##TITLE=  aspirin,  2-(acetyloxy) benzoic acid
##JCAMP-DX= 4.24
##DATA TYPE= LINK
##BLOCKS= 2
##ORIGIN= Dept of Chemistry, UWI, Mona, JAMAICA
##OWNER= public domain
##TITLE= aspirin,  2-(acetyloxy) benzoic acid
##JCAMP-DX= 5.01  $$ exported from JSpecView
##DATA TYPE= NMR SPECTRUM
##DATA CLASS= XYDATA
##BLOCK ID=1
##ORIGIN= Dept of Chemistry, UWI, Mona, JAMAICA
##OWNER= public domain
##LONGDATE= 2002/05/22 17:33:00 -0500
##SPECTROMETER/DATA SYSTEM= Bruker AVANCE 500 MHz
##$MODELS=
<Models>
<ModelData id="aspirin" type="MOL">
aspirin (2-(acetoxyl)benzoic acid)
RLACD/Labs0520021140  
http://wwwchem.uwimona.edu.jm/spectra
 21 21  0  0  0  0  0  0  0  0  0 V2000
   -0.8665    0.8024    0.0000 C   0  0  0  0  0  0  0  0  0  0  0  0
    0.4499    0.2908    0.0000 C   0  0  0  0  0  0  0  0  0  0  0  0
    1.5489    1.1509    0.0000 C   0  0  0  0  0  0  0  0  0  0  0  0
    1.3462    2.5308    0.0000 C   0  0  0  0  0  0  0  0  0  0  0  0
    0.0581    3.0583    0.0000 C   0  0  0  0  0  0  0  0  0  0  0  0
   -1.0298    2.1931    0.0000 C   0  0  0  0  0  0  0  0  0  0  0  0
   -2.1591    0.0020    0.0000 C   0  0  0  0  0  0  0  0  0  0  0  0
    1.5412   -2.0441    0.0000 C   0  0  0  0  0  0  0  0  0  0  0  0
    2.9836   -1.6136    0.0000 C   0  0  0  0  0  0  0  0  0  0  0  0
    0.5219   -1.1013    0.0000 O   0  0  0  0  0  0  0  0  0  0  0  0
   -3.2313    0.5672    0.0000 O   0  0  0  0  0  0  0  0  0  0  0  0
   -2.0988   -1.3365    0.0000 O   0  0  0  0  0  0  0  0  0  0  0  0
    1.1799   -3.1900    0.0000 O   0  0  0  0  0  0  0  0  0  0  0  0
    2.5593    0.7752    0.0000 H   0  0  0  0  0  0  0  0  0  0  0  0
    2.2106    3.1880    0.0000 H   0  0  0  0  0  0  0  0  0  0  0  0
   -0.0976    4.1321    0.0000 H   0  0  0  0  0  0  0  0  0  0  0  0
   -2.0482    2.5645    0.0000 H   0  0  0  0  0  0  0  0  0  0  0  0
   -1.1721   -1.6380    0.0000 H   0  0  0  0  0  0  0  0  0  0  0  0
    3.5898   -2.5187    0.0000 H   0  0  0  0  0  0  0  0  0  0  0  0
    3.2178   -1.0204   -0.8881 H   0  0  0  0  0  0  0  0  0  0  0  0
    3.2178   -1.0204    0.8881 H   0  0  0  0  0  0  0  0  0  0  0  0
  1  2  4  0  0  0  0
  1  6  4  0  0  0  0
  1  7  1  0  0  0  0
  2 10  1  0  0  0  0
  2  3  4  0  0  0  0
  3 14  1  0  0  0  0
  3  4  4  0  0  0  0
  4 15  1  0  0  0  0
  4  5  4  0  0  0  0
  5  6  4  0  0  0  0
  5 16  1  0  0  0  0
  6 17  1  0  0  0  0
  7 12  4  0  0  0  0
  7 11  4  0  0  0  0
  8  9  1  0  0  0  0
  8 10  1  0  0  0  0
  8 13  2  0  0  0  0
  9 21  1  0  0  0  0
  9 20  1  0  0  0  0
  9 19  1  0  0  0  0
 12 18  1  0  0  0  0
M  END
</ModelData>
</Models>
##$PEAKS=
<Peaks type="HNMR" xUnits="ppm" yUnits="arbitrary units" >
<PeakData  id="1" title="methyl group ~2.3" peakShape="singlet" model="aspirin" atoms="19,20,21"  xMax="2.83" xMin="1.83"  yMax="10000" yMin="0" />
<PeakData  id="2" title="H ~5.03" peakShape="multiplet" model="aspirin" atoms="18"  xMax="5.23" xMin="4.83"  yMax="10000" yMin="0" />
<PeakData  id="3" title="H ~7.18" peakShape="multiplet" model="aspirin" atoms="14"  xMax="7.33" xMin="7.03"  yMax="10000" yMin="0" />
<PeakData  id="4" title="H ~7.38" peakShape="multiplet" model="aspirin" atoms="16"  xMax="7.53" xMin="7.23"  yMax="10000" yMin="0" />
<PeakData  id="5" title="H ~7.61" peakShape="multiplet" model="aspirin" atoms="15"  xMax="7.76" xMin="7.36"  yMax="10000" yMin="0" />
<PeakData  id="6" title="H ~8.04" peakShape="multiplet" model="aspirin" atoms="17"  xMax="8.24" xMin="7.84"  yMax="10000" yMin="0" />
</Peaks>
##.SOLVENTNAME= CHLOROFORM-d
##.OBSERVENUCLEUS= ^1H
##.OBSERVE FREQUENCY= 500.13309
##.ACQUISITIONTIME= 3.17194
##.ACQUISITIONMODE= SIMULTANEOUS
##.ZEROFILL= 32768
##XUNITS= HZ
##YUNITS= ARBITRARY UNITS
##XFACTOR= 5.34893E-3
##YFACTOR= 2.14109634E-2
##FIRSTX= -229.85934842
##FIRSTY= -2.9696
##LASTX= 5119.07064794
##NPOINTS= 33925
##XYDATA= (X++(Y..Y))
-42973a39mL3nJ5J0l0KL0m6K1j0JlL9l9MrJmMNqnk1J9J5L6l7K2o1RM4k1ML9l8a37
-41853i9j4lopJ1J6m1P5q2MK9J0j5jNkjRlk2PK0mj4K5pjK8q1J6M2k5Nk9K0KJ8a02
-40704a45NK5j3m2L2QmRK7l1J5lj1J9j7rRL0%m7L5j5j8mK1N0m3ppMJ7k6L6l9j9a09
-39613a32J9m6M6J0l5K8pkJ2l3J9J0pl0K2K0l4qL6Lj7k4M8Kl0RMJ9m8nK3j0MKa37
-38552a69N7k5J8k7K1j9L1K1k1l4M2l1J1K9ok4rRJ1Nj5Kk4%L4j5Ok0N4m4L6k0a10
-37550a11k2qM7j6l1K6j1J3k3J5j9jM5k4j3k1M5j0oKj4qrJ3J5j0l7J8J9L6j4j3a19
-36548a01J2j8Pkj5m8J3M7k4j1qM1KL5j7mj9pj3K0Kn2O9j8k7nL9l2k3N8l7L0Mi4
-35517a44j4L2k2mJ9%j0k4L2Pj4K7Jk5J5LK5m9mL0k3J8K4n3L9rJ0k0L9o5N2k5a25
$$ plain form
-42973 -139 -143 -110 -115 -100 -90 -120 -118 -88 -134 -113 -123 -122 -125 -86 -125 -121 -130 -129 -133 -129 -124 -132 -137 -158 -139 -124 -88 -125 -103 -164 -155 -111 -132 -128 -89 -127 -137
-41853 -99 -113 -116 -122 -129 -118 -102 -143 -68 -150 -146 -117 -107 -122 -123 -118 -120 -121 -112 -115 -137 -130 -110 -114 -128 -103 -110 -111 -83 -164 -148 -106 -131 -126 -155 -135 -133 -115 -102
-40704 -145 -140 -115 -128 -170 -138 -130 -134 -125 -98 -129 -114 -117 -128 -109 -126 -135 -126 -96 -96 -143 -108 -123 -141 -145 -124 -74 -117 -124 -131 -127 -110 -136 -100 -139 -158 -109
-39613 -132 -113 -159 -113 -103 -138 -110 -117 -119 -107 -140 -121 -111 -118 -148 -126 -106 -140 -148 -112 -109 -126 -150 -102 -100 -130 -121 -117 -98 -146 -151 -128 -138 -134 -132 -137
-38552 -169 -112 -137 -119 -146 -125 -144 -113 -92 -113 -147 -105 -136 -125 -96 -102 -126 -135 -126 -115 -110 -125 -123 -147 -147 -113 -128 -122 -142 -88 -132 -96 -116 -110
-37550 -111 -133 -141 -94 -110 -141 -115 -126 -113 -136 -121 -140 -141 -96 -120 -133 -154 -109 -119 -125 -123 -137 -145 -154 -141 -126 -136 -173 -155 -136 -100 -114 -127 -119
-36548 -101 -89 -107 -100 -102 -117 -165 -152 -105 -129 -140 -148 -107 -105 -70 -87 -91 -110 -117 -130 -110 -108 -160 -91 -109 -136 -141 -102 -134 -157 -99 -136 -106 -102 -94
-35517 -144 -158 -126 -148 -152 -133 -133 -143 -167 -135 -128 -142 -115 -114 -139 -124 -121 -96 -145 -149 -119 -142 -124 -100 -153 -114 -123 -113 -133 -94 -159 -107 -132 -125
-34515a31oj6M9j6j0M3k0m4L9k5N0m0kM1k2%l6L2k5J0k4L6K9k7j8jJ6%j0J5k7a34
-33542a14rpk2M1n2L6j3j4O3l4lMj5kQQM6o1j1K4j8K3j0J0J4k9L1m4QJL8n2N1a36
-32511a10k2lJ9l0OLJ5jJOj4K6oJk4knJ4K9m9J3Qk3O2n2QpJk2K9Rk3j%JO8n5Ma31
-31332a47M0j6kM1n6K6J3k5j0PK5k0rpRj4J0j3K9l4OK9Omk1J7Pm8K7Qnj4JO4r3a15
-30241a21l6K9j8K3pK9k9j1oJ2kNJ5Kk8M6j0Jj4k4LK2nL1o7K3jnL7Qk2j5j5K9a12
-29181a07Ml5K2JnJ1l8L8k6M0k2k0Rl7M6koLJ7l4OJ9pnOrqJ4qJ1pJMK7k3OooM0a28
-27972a44K6J1l4Rk1P2n1J3Lk1N6o2K2Pk0j0L9j2J3rl9J9k9K8LK0kPLMl1L0j3a63
-26941a56K1K1j0J6j7k2L9j7lJ2j1M4l3k1k3M5l0K5NlK6k8l8L9j2j9Rj0L7J2k3a07
$$ plain form
-34515 -131 -137 -153 -104 -120 -130 -87 -107 -151 -112 -137 -87 -127 -129 -88 -110 -110 -146 -114 -139 -129 -153 -117 -88 -115 -133 -134 -118 -118 -128 -113 -140 -134
-33542 -114 -123 -130 -152 -111 -163 -127 -140 -154 -91 -125 -128 -124 -139 -141 -133 -125 -79 -140 -151 -127 -145 -122 -132 -122 -108 -137 -106 -150 -142 -141 -103 -155 -104 -136
-32511 -110 -132 -135 -116 -146 -140 -137 -122 -123 -122 -116 -130 -104 -110 -109 -133 -135 -140 -126 -97 -146 -133 -125 -148 -86 -138 -130 -137 -136 -158 -129 -120 -143 -144 -144 -143 -75 -130 -126 -131
-31332 -147 -107 -123 -125 -84 -140 -114 -101 -126 -136 -129 -104 -124 -133 -140 -131 -145 -135 -148 -119 -153 -147 -118 -112 -116 -137 -120 -113 -161 -134 -126 -131 -145 -144 -80 -173 -115
-30241 -121 -157 -128 -146 -123 -130 -101 -130 -141 -147 -135 -137 -132 -117 -115 -143 -97 -107 -106 -120 -144 -141 -119 -124 -93 -160 -137 -138 -143 -106 -98 -120 -135 -150 -121 -112
-29181 -107 -103 -138 -116 -115 -120 -109 -147 -109 -135 -95 -117 -137 -128 -165 -119 -121 -127 -124 -107 -141 -135 -116 -123 -128 -122 -131 -139 -125 -133 -122 -129 -128 -124 -97 -120 -114 -120 -126 -86 -128
-27972 -144 -118 -107 -141 -132 -153 -81 -132 -119 -116 -137 -81 -143 -121 -114 -134 -144 -105 -117 -104 -113 -152 -133 -162 -134 -131 -111 -113 -106 -103 -99 -130 -100 -113 -163
-26941 -156 -135 -114 -124 -108 -125 -147 -108 -125 -128 -116 -127 -83 -116 -137 -160 -115 -145 -120 -115 -118 -92 -120 -158 -119 -131 -150 -141 -151 -114 -102 -125 -107
-25968a42L1l8L8k5K5k7J8j7PpJ6j1J9Kll7MRJ4j7J6K1m0nkL2J1k3J5qk0K2j1a31
-24937i8l4j3kJ7J4k4mK4k8JJ0j8J5K0j4k9K6K0l2jK1j6J0J1k8J7J1j4j6M1k2a50
-23964a18%j2J7k7J6M3m3J6j0kJnLL3l1Nk8O2l9pJ6j1k6M3m0K9J7m6K9lk1k4N0a47
-22933a49M8l7QL3j7Krj1M3l7mMJnK0k5l1M7j1koL4k1j2pL6j9J9Ll6N0k0m5qK2a26
-21842a56J8L3k4M%Lm8K5nL6k7qJ8RNm5L1k3LNQl4L8K1j9LK4k3J4m2K4Jk9K4Na28
-20752a47jK1n7O1k0J5K6j9k0QK1j0qj9K9Kk3J8K8J1l6Kj4nPOmpJ5ql3OPj3M2a46
-19662i2k0m5L4Rl3M8j4l2L5j3Jj4k9L7j3K0l2jJ8K8k1Pl9J1OJ2M7m9J5j0pJ1a16
-18660a37j1j1M1Qj1nooMrML0j8J0j8Mj6K5k7L6m8N7q1N6J3Ol9OK1j5J2l3RJ9a22
$$ plain form
-25968 -142 -111 -149 -111 -136 -111 -138 -120 -137 -130 -137 -121 -132 -113 -111 -114 -151 -147 -138 -124 -141 -125 -104 -144 -149 -151 -119 -108 -131 -116 -124 -144 -122 -133 -131
-24937 -98 -132 -145 -147 -130 -116 -140 -144 -120 -148 -147 -137 -155 -140 -120 -134 -163 -137 -117 -149 -150 -129 -145 -135 -124 -152 -135 -124 -138 -154 -113 -135 -150
-23964 -118 -118 -130 -113 -140 -124 -81 -124 -108 -118 -120 -119 -124 -121 -88 -119 -114 -142 -80 -119 -126 -110 -121 -147 -104 -144 -115 -98 -144 -115 -118 -139 -163 -113 -147
-22933 -149 -101 -138 -130 -97 -114 -112 -121 -132 -89 -126 -130 -126 -125 -130 -110 -135 -166 -119 -130 -132 -138 -104 -125 -137 -144 -108 -127 -108 -105 -141 -91 -111 -156 -164 -142 -126
-21842 -156 -138 -105 -129 -125 -125 -122 -170 -145 -150 -114 -141 -149 -131 -122 -117 -162 -131 -154 -151 -146 -138 -172 -134 -113 -132 -129 -105 -128 -114 -156 -132 -131 -160 -136 -131 -128
-20752 -147 -148 -127 -184 -123 -143 -128 -102 -121 -141 -133 -112 -122 -130 -149 -120 -118 -141 -123 -95 -84 -120 -118 -132 -137 -130 -124 -128 -135 -120 -128 -161 -155 -148 -161 -119 -146
-19662 -92 -112 -157 -123 -114 -147 -99 -113 -145 -110 -123 -122 -136 -165 -128 -141 -121 -153 -154 -136 -108 -129 -122 -161 -150 -144 -132 -85 -134 -119 -129 -136 -125 -116
-18660 -137 -148 -159 -118 -110 -121 -126 -132 -138 -134 -143 -139 -109 -127 -117 -135 -131 -147 -122 -149 -113 -161 -104 -185 -129 -116 -110 -149 -143 -122 -137 -125 -158 -149 -130 -122
-17599a51KJ0K5j3RkQk2J8l2L7K1n1J4J5m7K1Rj9MJJK8l3J4K9n2O2rj5Pk4J9m1a00
-16538a27oj0L4o%nLl5J8QoL8k1J3l1nK1Nj7j5J9LkNk2J8J6j6k0PNK2j7%pQl1h2
-15388a30J0M1k9l3j1M5k4OL7p5N3j6Ok1L8l1K3j1J1l1N6k5J3m6J8qJ1OMk5J3a31
-14416a33KqrRlk1L6j7J8j4K3l2K5l3M4mk4K1J4m6N4m0K0J8j7jl8J8L5o3L7l6a44
-13414a08n6K2JJ3KJ1j6K2Ll7J1K9o7K1J7K2pj0mK1Kkm9L7L8k7L9n7j9K6LpM1a40
-12383a47K7j9J2JJj4l0O7j7l4M6k7M7l3J9l6N%K2k9J6qj6K7j0%j7N1o2L2j5J2a37
-11381a38QNJ0mm1L7k3M6k3J6n0K9LpK4l4qRL9k6KrpM8k6QJ4m6M2k4L1n2M2pM2a63
-10290a44M7j0l4%L2J4n5K2pJ2mj1j2J7JJ3k7LK2kl4J3J6kMj9K8L5m5nJ9pK7m3i2
$$ plain form
-17599 -151 -149 -139 -114 -127 -118 -120 -112 -134 -116 -148 -111 -90 -141 -127 -112 -159 -138 -129 -148 -144 -143 -142 -114 -147 -133 -104 -156 -94 -103 -118 -111 -135 -116 -157 -100
-16538 -127 -133 -143 -109 -115 -115 -120 -117 -152 -134 -126 -132 -94 -115 -102 -133 -138 -117 -112 -129 -144 -125 -122 -124 -119 -141 -123 -107 -123 -143 -136 -131 -109 -126 -126 -133 -125 -156 -82
-15388 -130 -120 -79 -108 -141 -152 -107 -131 -125 -88 -163 -110 -126 -120 -141 -103 -134 -111 -122 -111 -142 -86 -111 -98 -144 -126 -134 -123 -117 -113 -138 -125 -131
-14416 -133 -131 -139 -148 -139 -142 -163 -127 -144 -126 -140 -117 -149 -124 -157 -113 -117 -141 -120 -106 -152 -98 -138 -118 -100 -117 -118 -156 -138 -103 -166 -129 -165 -144
-13414 -108 -164 -142 -141 -128 -126 -115 -131 -109 -106 -143 -132 -103 -170 -149 -132 -110 -117 -127 -131 -110 -108 -110 -159 -122 -84 -111 -72 -129 -148 -122 -119 -126 -85 -140
-12383 -147 -120 -139 -127 -126 -125 -139 -169 -102 -119 -153 -107 -134 -87 -120 -101 -137 -132 -132 -110 -139 -123 -131 -147 -120 -130 -130 -147 -96 -158 -126 -141 -129 -137
-11381 -138 -130 -125 -115 -119 -160 -123 -146 -100 -123 -107 -157 -128 -125 -132 -108 -142 -150 -141 -102 -128 -126 -135 -142 -94 -120 -112 -98 -144 -102 -126 -95 -147 -105 -112 -70 -163
-10290 -144 -97 -107 -141 -141 -109 -95 -150 -128 -135 -123 -127 -138 -150 -133 -132 -119 -146 -143 -121 -123 -157 -144 -128 -130 -126 -145 -117 -82 -127 -132 -113 -120 -93 -136 -92
-9229a29j1L5j1j3KNJ8k1oM6k7JNj2nj7j0L9Mn8L8J9j1l3N2j9k1J8j1k7M3k1a44
-8227a43k5K5K2lk8N5n1K1l7M6p2O8Kj1j2K1LJ8k7k5Mj0J8LRj6J2K9j8l7K4L4a21
-7225a42J6j6K1nj3J2J2q1P5k9M4l8K3noj9j4N6m9L1J6LQp2N2j5J7m5O0k0oj7a42
-6223a55J6j0J3qJ1j7K3qj9K7NqJ5MrlnooJ9k6j4K7qK3olj8PLROnrMJ0l0L6j1i3
-5015a28LJ3oL4pj1k7lK%lQj7j5M7J4l0RNMl6K9J4m4MK0K6J0m3K4j8j9kJ3kRa43
-3895a46M2j3k3J7j7j7J6K9k2K9l9J4OJ9p4M9J0jj2qK0oj7%L7n2K6M6m5Nj3oa29
-2893a13J3l1M0k3k4K1M6r1L7j8J7k0J2Qj7Rk7O3l1%k5J1K8pj0pkJ1jK4lm4J5a39
-1862a40L9m2J8j2k1J6J9pK1o0N1pk8RqN6l2K2ml8K0k2L2mn1O4l6L4j4qjj2ma40
$$ plain form
-9229 -129 -140 -105 -116 -129 -127 -122 -104 -125 -131 -85 -112 -111 -106 -118 -123 -140 -150 -111 -107 -165 -127 -108 -119 -152 -100 -119 -140 -122 -133 -160 -117 -138 -144
-8227 -143 -168 -143 -121 -124 -152 -97 -148 -127 -164 -118 -190 -122 -120 -131 -143 -122 -119 -101 -128 -153 -149 -159 -141 -138 -129 -145 -133 -104 -122 -159 -135 -101 -121
-7225 -142 -126 -142 -121 -126 -139 -127 -115 -196 -121 -150 -106 -144 -121 -126 -132 -151 -165 -109 -158 -127 -111 -108 -100 -172 -120 -135 -118 -163 -103 -123 -129 -146 -142
-6223 -155 -139 -149 -136 -144 -133 -150 -127 -135 -154 -127 -122 -130 -115 -111 -120 -123 -128 -134 -140 -121 -147 -161 -134 -142 -119 -125 -128 -146 -139 -136 -127 -121 -126 -135 -131 -121 -151 -115 -126 -93
-5015 -128 -125 -112 -118 -84 -91 -102 -129 -132 -130 -130 -133 -125 -142 -157 -110 -96 -126 -117 -112 -108 -144 -115 -101 -145 -141 -121 -95 -85 -128 -104 -122 -141 -143 -130 -132 -123 -143
-3895 -146 -104 -117 -140 -123 -140 -157 -141 -112 -134 -105 -144 -130 -124 -105 -179 -130 -120 -121 -133 -141 -121 -127 -144 -144 -107 -159 -133 -87 -132 -127 -140 -146 -129
-2893 -113 -100 -131 -91 -114 -138 -117 -71 -162 -125 -143 -126 -146 -134 -126 -143 -134 -161 -98 -129 -129 -154 -143 -115 -122 -132 -139 -141 -130 -131 -107 -110 -154 -139 -139
-1862 -140 -101 -143 -125 -137 -158 -142 -123 -130 -109 -169 -118 -125 -153 -144 -152 -96 -128 -106 -110 -148 -128 -150 -118 -122 -173 -109 -145 -111 -125 -133 -134 -146 -150 -140
-830a54K1M3l1oj0K5o0OJ9N4l0k1P0m7LNk0j9L2nnM7n4J1qPJ1k3JL7k4J3m3a22
201a28L9n9J0J4j3L0j6j5KK2Nm0J3Pln4R4m0J6j2L0n6J4K4l0jR%K2l1L4l2a42
1203a04n3N5j3pOmJ1k0l5J3LL0K1o3j6N5Pl0mM4p4P1j6kK8%l7lk6J7J0mL5ka63
2264a64L4k4L7l2N0m1Kok2M5l8RL1ok5K1K0m4M5pJ5J4l8L5l1l8oK5J8l9J7L0a51
3266a19n8O0J3j1kQl5qJ1poJ4pK2J5l7j9O9l2l2J9oJ8K4Pk1lJ3j6Kl4K8oJMa10
4356a27kk1L5m3J5rK1j2J4J3j8K2j7J5l7J8J4j3k3j1O6l4j6PMJ1k2JJ6j6J3a38
5329a32k0J9J6l6N0k2k4L6m4M3j0k5J4J8n8N4j3mL1k6Jlk5M5qNj6L3n8M2l9a24
6301a33J1kok2L4k3LnkL0l4L7rQj1K0Pk5l6K5RQnQj5j6K0k8LM0%m8J2K7%J5i9
$$ plain form
-830 -154 -133 -90 -121 -127 -137 -112 -172 -166 -147 -93 -123 -144 -74 -121 -118 -113 -133 -152 -120 -125 -130 -83 -137 -126 -134 -127 -116 -139 -138 -101 -125 -112 -155 -122
201 -128 -89 -148 -138 -124 -137 -107 -123 -138 -136 -114 -109 -149 -136 -129 -132 -186 -92 -132 -116 -128 -98 -154 -140 -116 -146 -147 -138 -138 -116 -147 -113 -145 -142
1203 -104 -157 -102 -115 -122 -116 -120 -109 -129 -164 -151 -148 -118 -97 -160 -176 -121 -114 -144 -148 -104 -178 -107 -123 -125 -97 -97 -134 -137 -163 -146 -136 -140 -105 -107 -163
2264 -164 -130 -154 -117 -149 -99 -140 -138 -144 -166 -121 -159 -150 -119 -125 -150 -129 -109 -153 -108 -115 -100 -86 -124 -89 -120 -158 -164 -139 -121 -160 -143 -113 -151
3266 -119 -177 -117 -104 -115 -117 -109 -144 -152 -141 -148 -154 -140 -147 -125 -110 -147 -166 -97 -129 -161 -142 -148 -130 -106 -99 -120 -123 -110 -126 -124 -158 -130 -136 -135 -131 -110
4356 -127 -129 -150 -115 -158 -143 -152 -131 -143 -129 -116 -134 -112 -129 -114 -151 -133 -119 -132 -155 -166 -100 -134 -150 -143 -139 -128 -150 -149 -133 -149 -136 -138
5329 -132 -152 -133 -117 -153 -103 -125 -149 -113 -157 -114 -124 -149 -135 -117 -175 -121 -134 -138 -107 -133 -132 -135 -160 -115 -123 -118 -134 -101 -159 -117 -156 -124
6301 -133 -122 -124 -130 -152 -118 -141 -138 -143 -145 -115 -149 -112 -121 -113 -124 -104 -97 -122 -158 -133 -124 -116 -121 -113 -128 -144 -124 -152 -149 -109 -109 -157 -145 -118 -118 -103 -99
7421a26rMJ4l9N9l3Oj3K3Nrk9j1L3PJ4Rl2L2k5L2l8j0j4J6k2lQ5nq0M8k0K2i8
8453a28LrKMr%j9M5j3nJ5l4L5J9l4J4j8M4o4%O0j7On2K8MkJ8Mk0K1k7PPm0K9a53
9572a69O4o3M9joNn0QN5l3L9k9J2J6k2jj7NO7o9J0k8N6k9j3J2jK0J2m9L5k2a30
10574a12qlj5M4l3k8J4J9QK1mk9K5l8kL8l3J0qj0qL6K0Lkn8L0mJ4Nl3K0Rm5pa12
11665a02n2M5m0J9OMk3J6Kj2M5m1J6mL7j3k3PJ1k1J4j0nnj1NjJ3poj4L5k1NJ6a00
12755a38N0k1k5J8j5J7Ml2JJ9j4K4J9m8J5J4Rl7K4Lk0K8m2RPl0k0M1k1M8oK0a31
13757a76L4M0j4k7JL9l2Qk3J2K8p0M9oj6L7m3K2k4Mj0JO2rk1oJ5k4K9n7M1lMa54
14789a12j5Pk1N1o0J6k3K6J9j3j6K2k2M0j6J0L7m3j7k5K0J2k1J8Qk4K1J5k8J0a43
$$ plain form
7421 -126 -135 -131 -117 -156 -97 -130 -124 -137 -114 -109 -118 -147 -158 -125 -118 -104 -95 -127 -95 -120 -88 -126 -136 -150 -134 -156 -159 -74 -79 -159 -111 -131 -109 -98
8453 -128 -125 -134 -132 -128 -137 -137 -156 -111 -124 -129 -114 -148 -113 -94 -128 -114 -132 -88 -152 -152 -92 -109 -103 -155 -127 -123 -125 -107 -103 -123 -102 -129 -122 -115 -155 -126 -153
9572 -169 -105 -168 -119 -120 -126 -121 -171 -163 -108 -141 -102 -131 -119 -103 -125 -126 -143 -138 -71 -140 -130 -158 -102 -131 -144 -132 -133 -113 -101 -150 -115 -137 -130
10574 -112 -120 -123 -138 -94 -127 -155 -141 -122 -114 -93 -97 -126 -101 -139 -141 -103 -136 -126 -134 -144 -152 -116 -96 -93 -95 -153 -123 -127 -113 -108 -141 -121 -112 -157 -164 -112
11665 -102 -154 -109 -149 -130 -124 -120 -143 -127 -125 -137 -92 -133 -117 -121 -84 -97 -120 -113 -102 -123 -109 -119 -124 -129 -140 -135 -136 -123 -130 -136 -150 -115 -136 -131 -115 -100
12755 -138 -88 -109 -134 -116 -131 -114 -110 -142 -141 -122 -136 -112 -93 -141 -126 -112 -103 -140 -116 -113 -133 -105 -147 -138 -131 -161 -181 -140 -161 -113 -119 -99 -131
13757 -176 -142 -102 -116 -143 -142 -103 -135 -127 -150 -138 -110 -180 -131 -137 -153 -116 -159 -137 -161 -157 -167 -166 -104 -113 -134 -140 -125 -149 -120 -177 -136 -139 -135 -154
14789 -112 -127 -120 -141 -90 -150 -134 -157 -131 -112 -125 -141 -119 -141 -101 -117 -107 -70 -113 -130 -155 -135 -123 -144 -126 -118 -142 -121 -106 -134 -124 -143
15732a70N4KJmrj4K8k3Rl3K4k9K1K4l0K4m2M6J6l7oJ7L1m6j3J4n%K4n1M6j1J6a07
16763a10j0m5M3Kl7O0l9k6nJ3mK1L5o3K9L0K3k7%l0j3K1K1RKl3lNKK3j2l9M4a54
17794i9Mk0qk7J1Jj1L5lk5J4k1K4pkqKK9j8j4J1n7Q4ro8J07o2j1K1k0Mk2jK3a05
18855a13j8Qo2K2K8MK1n5L6k4L1Kl4L4k6K1mj3J0J1L4l2joj8L1Ln4M1j2J3k4a07
19857a32MMj6M2k2j7L9l9K3k9K8k3K7l6MK7k4K0j8L2j6j6J7J6k4k3N9n1K2jJ1a44
20830a30J2k4L0j7K3l3nJ0K0j5m9O2j9N5m3Lrj1L8pk6J2Lk7K9p2N5J7J1njj1a32
21832a15l2L3Ll3J1k6K5J0J2J8oo3L9pl0N5j0j9Jj8K6m4J9K6Jppj7j9N0K4m3a49
22834a27k6lM5l1N7p2LN5o9N8l4K8jk7oK8Pj5j5QK8l8K3koJ4k8J4jKJ0lNrOoa59
$$ plain form
15732 -170 -116 -114 -113 -117 -126 -140 -112 -135 -126 -159 -135 -164 -143 -119 -149 -125 -167 -121 -105 -142 -148 -131 -100 -146 -159 -145 -150 -150 -126 -177 -131 -142 -126 -107
16763 -110 -120 -165 -122 -120 -157 -97 -136 -162 -167 -154 -158 -137 -102 -165 -136 -106 -83 -110 -110 -140 -153 -132 -111 -102 -100 -133 -136 -131 -129 -106 -118 -157 -113 -154
17794 -99 -95 -115 -123 -150 -139 -138 -149 -114 -117 -142 -128 -149 -125 -132 -134 -142 -140 -111 -129 -143 -132 -189 -105 -114 -182 -75 -137 -148 -127 -147 -143 -165 -166 -143 -105
18855 -113 -131 -123 -185 -163 -135 -131 -110 -165 -129 -153 -122 -120 -154 -120 -146 -125 -129 -142 -132 -121 -87 -119 -120 -126 -144 -113 -110 -164 -123 -135 -122 -146 -107
19857 -132 -128 -124 -140 -98 -120 -137 -98 -137 -114 -143 -115 -138 -111 -147 -143 -116 -140 -120 -138 -106 -122 -138 -121 -105 -129 -152 -93 -144 -122 -123 -112 -144
20830 -130 -118 -142 -112 -129 -106 -139 -144 -134 -114 -129 -178 -116 -135 -80 -123 -120 -129 -140 -102 -109 -135 -123 -120 -147 -118 -190 -135 -118 -107 -112 -113 -124 -132
21832 -115 -147 -114 -111 -144 -133 -159 -134 -124 -112 -94 -100 -163 -124 -131 -161 -106 -116 -135 -134 -152 -126 -170 -151 -125 -124 -131 -138 -155 -174 -124 -100 -143 -149
22834 -127 -153 -156 -111 -142 -85 -157 -154 -99 -168 -110 -144 -116 -117 -144 -150 -122 -115 -130 -145 -137 -109 -147 -124 -126 -132 -118 -146 -132 -133 -131 -121 -124 -119 -128 -122 -128 -159
23954a32qK6j5J7j8k3J4J0L3o2LK2jj1J4Rk2K4ojJ7pl8PK4pl3K9J9%k3J3j6L1a34
25015a23l0M1k5J7pm1K7LL4o3L2LJ9qj1KNOMl0QM5m0JJ4j4K2k4jJ8k1j9K4K9a02
26075a51K3K9m2K3j2k9N2k3k3qM7m5L5k2J2MJ6n6M5Q%%j3l6K0J6J4Ml0oJ6M3a31
27077a01m5MOk8j3P6l6j7Q3m9Lj5J4j0l3j2J2N5j5Kj3k3N2m5J6J0Moj0J6j3Ma24
28080a18J3Kj4%rj9M9l9l0OM8j4J7k8qM1m6L6J2mn5M5Ol8M9j5l3J3J0j1K7lj3a44
29111a24j0k2K2K0l2j5L1L0ml7nJ8k6J3K1j4j0O6l1J7n0K7ol3L1QJ6l2j8J7k4a47
30084a38lkqN3k3m0mM8l7J5RJ4k1J5j7J0k2L0qk4lK8RL0n5L9j3j9Pj4J5j5J4a31
31115a35nMNpJ7l0J0JlJ6j5J9l6M5j8rJ4kJ4k0rK7k9J8k2K1j3N4k7%j8j5rM1a28
$$ plain form
23954 -132 -140 -114 -129 -112 -130 -153 -139 -129 -96 -158 -155 -133 -134 -145 -131 -122 -144 -120 -126 -127 -110 -117 -155 -148 -124 -131 -164 -135 -116 -116 -139 -126 -142 -111 -134
25015 -123 -153 -112 -137 -120 -127 -168 -141 -138 -104 -167 -135 -132 -113 -121 -132 -130 -125 -119 -115 -145 -137 -92 -132 -131 -117 -131 -109 -133 -134 -116 -137 -156 -132 -103 -102
26075 -151 -128 -99 -141 -118 -130 -159 -107 -130 -153 -161 -114 -159 -124 -146 -134 -130 -114 -170 -125 -117 -117 -117 -130 -166 -146 -130 -116 -112 -142 -148 -132 -89 -131
27077 -101 -146 -142 -136 -164 -177 -101 -137 -154 -71 -120 -117 -132 -118 -128 -161 -173 -161 -106 -121 -119 -132 -155 -103 -148 -132 -122 -118 -124 -134 -118 -131 -127 -124
28080 -118 -105 -103 -117 -117 -126 -145 -96 -135 -165 -159 -111 -125 -108 -136 -144 -103 -149 -113 -101 -105 -160 -115 -109 -147 -98 -113 -146 -133 -123 -134 -107 -110 -123 -144
29111 -124 -134 -156 -134 -114 -146 -161 -130 -100 -104 -141 -146 -128 -154 -141 -120 -134 -144 -78 -109 -92 -142 -115 -121 -154 -123 -115 -99 -131 -149 -132 -156 -147
30084 -138 -141 -143 -151 -98 -121 -161 -165 -117 -154 -139 -130 -116 -137 -122 -139 -129 -151 -121 -129 -153 -156 -128 -119 -89 -144 -105 -118 -137 -130 -144 -129 -144 -130 -131
31115 -135 -140 -136 -131 -138 -121 -151 -141 -140 -143 -127 -142 -123 -159 -114 -132 -141 -127 -129 -115 -135 -144 -117 -146 -128 -150 -129 -142 -88 -115 -115 -133 -148 -157 -116 -128
32176a37J4Ok1J3Nl1M1m5J8N1m4J6k2J9m8P2m3jQj8M8o0J6j1L3j6k2K3Pk0J9a14
33149a35Ok0J6OrJ7Mpk4M1o7J2O0l9nL7j3j8Qjk6O8l6J2pk1pL6J1J6l1L3Qm1a42
34209a15m0J1J5K8n1j2K0j8M1m9O1l3oK0J0k8j8K1L1J2m0l8M4Pk8jJ9k3JONN2a30
35212a46J4nK0j1mqK4k4K3k0JOlJ6Nl4NJ4%J6j5j9N4m6K5k7k1K5j9L1J7j6k1a30
36243a35J5%JKkJ4k4j7KL1Qk1j9nQK8J2m3L2m8M7j9o6R2rk5rj1K8K9j8j5PPJ1a49
37333a23k7M1j1k5j3L1Ol4N4k1kj5l1N6k0j3J6K5j1kLk4JQMJ2nk3L2k2J2l4Ma48
38365a25L6p5P3k8J1l5K9k1l2O4k3j4OqL4k3K3j7qPJ1j1Rj7j0M0n4OQK6j5Rj3a43
39396a30K3l0moJ6J0k1Lql2L3K1K6l1j6J5j6K5l3K9k2J3j2L1j6J0k7NKJ2J9ka27
$$ plain form
32176 -137 -123 -117 -138 -125 -120 -151 -110 -155 -137 -86 -130 -114 -136 -117 -165 -93 -136 -137 -129 -147 -99 -159 -143 -154 -121 -137 -159 -136 -129 -149 -130 -114
33149 -135 -129 -149 -133 -127 -136 -119 -115 -122 -146 -105 -172 -160 -100 -139 -144 -107 -120 -138 -130 -131 -157 -89 -125 -113 -120 -141 -148 -112 -101 -85 -116 -83 -75 -116 -142
34209 -115 -155 -144 -129 -101 -152 -164 -144 -162 -121 -170 -109 -142 -148 -128 -118 -146 -164 -143 -112 -100 -140 -178 -134 -127 -155 -156 -137 -160 -159 -153 -148 -96 -130
35212 -146 -132 -137 -117 -128 -132 -140 -116 -140 -117 -137 -136 -130 -133 -117 -112 -146 -141 -127 -127 -111 -126 -145 -91 -137 -112 -139 -160 -135 -154 -123 -106 -122 -143 -130
36243 -135 -120 -120 -119 -117 -119 -105 -129 -146 -144 -113 -105 -126 -145 -150 -142 -114 -102 -145 -113 -161 -114 -133 -199 -107 -116 -141 -150 -161 -133 -104 -122 -137 -130 -123 -112 -149
37333 -123 -150 -109 -120 -145 -158 -127 -121 -155 -101 -122 -124 -139 -170 -114 -134 -147 -131 -106 -117 -119 -116 -140 -139 -131 -127 -115 -120 -143 -111 -133 -121 -155 -151 -148
38365 -125 -89 -164 -91 -119 -108 -143 -114 -135 -167 -103 -126 -140 -134 -142 -108 -131 -108 -125 -133 -126 -115 -126 -117 -134 -144 -104 -158 -152 -144 -118 -133 -124 -137 -143
39396 -130 -107 -137 -141 -147 -131 -121 -142 -139 -147 -179 -146 -125 -99 -130 -146 -131 -147 -122 -155 -126 -148 -135 -147 -116 -132 -122 -149 -144 -142 -130 -111 -113 -127
40398a26Rl1j3N3o4K4PlJ2J6n4L5L0Nk0lj2rmM1l2k0K7J0k4K1qRL1k3qm3KN6a16
41459a23k2nL8j5K1Jl3L0J0l0J2n3L4M2n8K3Jk9KJN4k7Rj2K3k7j3mK8mKQMj7a05
42520a20k1RnJ3j2pJ8Oj1j0J7j1j3QqK6jJ5m0j0J0L2m0L1rL1k5ML7p9K3K1Pj6a49
43581a62J3NkLj0M6k3J7k7nK8mNK6m6M1j2n8N2m8L4Nm8K4K6j1J8Km2L1j0KkJ4i8
44642a06m4N7l2l1M9j0pj2k0K5%J4j0oj0K2J2k3L3m5K3J7l8j2J3J4jk3L0l8K6a33
45615a47N6k2Ol3K1k0J8k5j1L8K4k6%oLJ8m8J4K2Mk0K5l4J2Nm5OJ4N2m6J8j2a39
46617a54j7N1L2l0qj6L4k2j7k5K1Rj4L3kN5r4Ok5N3j1M1pj3J7n6OJ1K0jjMPma25
47678a60M1l1J6j1L1l2JnJ5L6k2JJ3k4l4L0Pj9J3J5k3M9j4j4j1JK0l0KJ6%k5a36
$$ plain form
40398 -126 -117 -148 -161 -108 -172 -148 -141 -144 -132 -116 -170 -135 -105 -100 -120 -123 -135 -144 -148 -107 -139 -159 -132 -122 -146 -125 -133 -124 -93 -116 -124 -167 -165 -109 -116
41459 -123 -145 -150 -112 -127 -106 -105 -138 -108 -98 -128 -116 -169 -135 -93 -151 -128 -127 -156 -154 -153 -99 -126 -117 -129 -106 -133 -146 -150 -122 -126 -124 -116 -112 -129 -105
42520 -120 -141 -132 -137 -124 -136 -143 -125 -119 -130 -140 -123 -134 -147 -139 -147 -121 -122 -107 -147 -157 -147 -115 -155 -124 -133 -102 -127 -123 -86 -165 -142 -121 -114 -130 -149
43581 -162 -149 -144 -146 -143 -153 -107 -130 -113 -140 -145 -117 -121 -116 -90 -136 -95 -107 -165 -113 -161 -127 -122 -170 -146 -120 -131 -113 -111 -153 -122 -132 -130 -132 -118 -98
44642 -106 -150 -93 -125 -156 -107 -117 -124 -136 -156 -131 -131 -117 -127 -133 -143 -121 -109 -132 -99 -144 -121 -104 -142 -154 -141 -127 -128 -151 -121 -159 -133 -133
45615 -147 -91 -113 -107 -140 -119 -139 -121 -146 -157 -119 -95 -121 -121 -127 -124 -106 -154 -140 -118 -114 -134 -109 -143 -131 -126 -171 -165 -151 -99 -145 -127 -139 -139
46617 -154 -171 -120 -88 -118 -126 -142 -108 -130 -147 -172 -151 -142 -156 -123 -125 -70 -164 -158 -183 -130 -141 -100 -107 -120 -103 -159 -153 -142 -122 -123 -124 -120 -113 -117 -125
47678 -160 -119 -150 -134 -145 -114 -146 -145 -150 -135 -99 -121 -120 -107 -131 -165 -135 -128 -147 -134 -119 -142 -93 -107 -121 -132 -131 -111 -141 -139 -123 -123 -148 -136
48680a41pJ3nNK6n8K3Lk6K9J5Nk2pK9pk8qM6j7N1j8n2L1m4L7k5K5l4M3k6L1l0a09
49711a11k0RK5m9J5ok6N5nnkJ7l0J8k5J7J2m0J6j1K7k6RqJ4Lj5J1oRRk1Ok8N2a21
50801a55L6j2pk4L8j1kQj8K4oj0j2lJ0K0K0l6LK0moJ8Jm4k0K4L3m1j4M4oLj0a49
51862a11ol6J6J1qpjK1l4K2K0k3k9L4K3j9k2L5Pl4J2j3K7j9j6J1OJ7l8L8l7N6a35
52864a43K9j4qMMJ2J5m7J5L5j4l7J6%RnK4nk4K2nm5M5J3m8N3l0k2M2j8k3rNN9a50
53925a05l6L7l4qJL6l0K9j0QMk2j2L1l3J0k4N2j3j4MqQmkMK0m9K6k4L7J9m2Ka24
54986a66O9n7N2k1j5rl3P1j1m5K6K2j6Rmj3PK0k5k7J4K9k1j8K7oMJ3k0QjJ4j9a43
56017a25rmJ9qmJ2j1K1j3oj1j1N2l3j2K2jOk9PL8o5J4J6L4j6mj6JJ4j7%JL3ja52
$$ plain form
48680 -141 -148 -135 -140 -135 -109 -167 -144 -141 -167 -138 -123 -118 -140 -147 -118 -125 -153 -161 -115 -132 -81 -99 -151 -120 -164 -127 -152 -127 -161 -118 -144 -113 -143 -109
49711 -111 -131 -122 -97 -146 -131 -137 -163 -108 -113 -118 -120 -103 -133 -115 -140 -123 -111 -151 -135 -146 -119 -145 -136 -144 -130 -127 -142 -131 -137 -128 -119 -140 -134 -162 -110 -121
50801 -155 -119 -131 -138 -162 -124 -135 -137 -129 -147 -123 -129 -139 -151 -154 -144 -124 -104 -140 -137 -117 -121 -127 -109 -108 -152 -172 -148 -115 -156 -170 -126 -132 -129 -139 -149
51862 -111 -117 -153 -137 -126 -134 -141 -142 -121 -155 -133 -113 -136 -165 -131 -108 -127 -149 -114 -107 -141 -129 -142 -115 -134 -150 -139 -133 -116 -154 -116 -153 -97 -135
52864 -143 -114 -128 -136 -132 -128 -116 -101 -148 -133 -98 -112 -149 -133 -133 -124 -129 -105 -110 -134 -112 -117 -162 -117 -104 -152 -99 -129 -151 -109 -127 -150 -159 -154 -95 -150
53925 -105 -141 -104 -138 -146 -145 -109 -139 -110 -120 -112 -108 -130 -142 -111 -144 -134 -158 -106 -119 -133 -129 -137 -129 -133 -135 -131 -111 -160 -134 -158 -121 -102 -144 -142 -124
54986 -166 -97 -154 -102 -123 -138 -147 -180 -109 -120 -165 -139 -117 -133 -124 -128 -141 -134 -114 -139 -166 -152 -123 -144 -162 -135 -141 -137 -124 -144 -136 -137 -123 -142 -143
56017 -125 -134 -138 -119 -127 -131 -119 -130 -109 -122 -128 -139 -150 -98 -131 -143 -121 -122 -116 -145 -138 -100 -165 -151 -135 -101 -117 -121 -137 -136 -122 -139 -139 -138 -105 -106 -152
57108a74M3Ok1MoL9k9J2jPpOj0J3kJJ2m1L5rnPn9M5lJ7QJ9l3J1j5J2Rl8l0O9a27
58227a22rnQj0K4n4J4K5l2N2ml0KM1l4%Mpj0L5l3J2Mj1Rl3JL0l8N8%m9M0m5L6a54
59318a34l5L4rRQj1prK4j5J8j5J1nJ6lRKJn6J7j3N8l2L4m7kK3j0J2j3j4nL2qa02
60408a13Kj4j3k6K5M1k3nl6K6NJLj4J5j5Jm4P5l7J2J7orJ6j0%oJ9k3JNKJ6j8a42
61498a40J4k2OROKj7K3j5j2oM7qk2J6k4j8J8K9k2K8l0KnK2mj7K4k5j8J7M0l8a22
62530a31QnomJ9k7L0k0Qm1M0k9K6k1K3l8K3oK4jpNOK9j3l7rM1k9J0lj3j0L3Ka36
63620i0m6NL1ql4nk8N8k9ok5L9mL0k8LkrJ5K4j4j6J3K1l1J1l8L4l8J4mL5pJ6a47
64681a61J5j1O1pm7Kj6L8k2K7j4j4N4n1m0P1k6Mk9L7j5j3M0Km0L4m0K7%j3M2a42
$$ plain form
57108 -174 -131 -125 -146 -142 -148 -109 -138 -126 -127 -120 -127 -121 -131 -118 -120 -119 -107 -148 -113 -122 -127 -120 -179 -134 -137 -120 -112 -93 -126 -115 -130 -118 -109 -147 -177 -108 -127
58227 -122 -131 -136 -128 -138 -114 -168 -154 -129 -161 -109 -113 -143 -141 -100 -134 -134 -130 -137 -147 -112 -145 -133 -129 -140 -131 -164 -163 -133 -171 -113 -113 -162 -122 -167 -131 -154
59318 -134 -169 -135 -144 -135 -127 -138 -145 -154 -130 -145 -127 -142 -131 -136 -120 -123 -114 -112 -111 -167 -150 -163 -105 -137 -103 -150 -152 -129 -139 -127 -140 -154 -159 -127 -135 -102
60408 -113 -111 -125 -138 -164 -139 -98 -121 -126 -162 -136 -131 -130 -127 -141 -126 -141 -140 -184 -109 -146 -134 -117 -123 -132 -116 -126 -126 -132 -113 -136 -135 -130 -128 -112 -130 -142
61498 -140 -126 -148 -142 -133 -127 -125 -142 -119 -134 -146 -152 -105 -113 -135 -119 -143 -161 -143 -114 -136 -108 -138 -136 -141 -119 -123 -140 -116 -141 -159 -142 -102 -140 -122
62530 -131 -123 -128 -134 -138 -119 -146 -116 -136 -128 -169 -129 -158 -132 -153 -130 -168 -145 -151 -127 -128 -135 -130 -124 -95 -108 -145 -154 -113 -142 -132 -135 -148 -158 -125 -123 -136
63620 -90 -136 -131 -100 -108 -142 -147 -175 -117 -146 -152 -177 -138 -142 -112 -140 -137 -139 -148 -133 -109 -123 -139 -126 -105 -136 -125 -163 -129 -167 -153 -157 -122 -129 -113 -147
64681 -161 -146 -157 -96 -103 -150 -148 -164 -126 -148 -121 -135 -149 -95 -146 -186 -115 -141 -137 -166 -129 -144 -157 -117 -115 -155 -121 -161 -134 -134 -147 -105 -142
65653a62M4k1l1K9qK0J8m1J1J8Qk1l6L9Oj3K6j4n2O5l3J9J4j2J6l5qJ5J2J6k6a31
66626a51J4J9k5J3m5N2l8K8nJ3Oj2j6mN5k4k%k1O4k9j3Lplk7K6j0j7M9Jj6Qja56
67687a11J0m5j9N0Pl1K1l5M4m1M4n2L6k3K0j3J1j4J7Kj6J4j1Oj2L6m0qpL8J9a32
68659a19j1j0j9K0QJ1m6L8J5l9k7M8j2M0k9l9K0pK0l1L3J9Jm3K2J0Ok4RLK0k7a15
69661a58M1Pj7k7J8j1K4nl8L8KpL1k0k5J9k0NRL7n0J8M4o2LQQm1K4J6KL5n1Oa42
70722a81M9J8j5RK1k2j6j5J6Mk0N0K7l0m6M6qk7PQk6J5L7K1o4J3LRj8j3oK9j7a55
71753a57M6l2J2j8nJ0K6j2ml0N5j4Kk3k7M4j9L0j6PL1n9QL4k0k6jM2o0N7km7a41
72755i8m1j3L5J4n1M3Jk8j4L7J4l4nLL1l8M4k4k3J9%J2l3MlK8j9J8j6K6rJ8qa52
$$ plain form
65653 -162 -118 -139 -170 -141 -149 -129 -111 -152 -141 -123 -115 -136 -172 -133 -127 -140 -114 -128 -180 -115 -148 -129 -115 -127 -111 -146 -154 -139 -127 -111 -137 -131
66626 -151 -137 -118 -143 -130 -175 -123 -161 -133 -138 -125 -119 -131 -147 -151 -96 -120 -122 -122 -143 -79 -108 -121 -118 -125 -128 -155 -129 -139 -156 -107 -106 -122 -114 -115 -156
67687 -111 -101 -146 -165 -115 -108 -139 -118 -153 -109 -150 -106 -158 -122 -145 -125 -138 -127 -141 -124 -122 -138 -124 -135 -129 -141 -105 -145 -153 -160 -122 -103 -132
68659 -119 -130 -140 -159 -139 -131 -120 -166 -128 -113 -152 -179 -131 -143 -103 -132 -171 -151 -158 -138 -169 -136 -117 -116 -159 -137 -127 -121 -145 -136 -133 -113 -140 -115
69661 -158 -117 -110 -127 -154 -136 -147 -123 -128 -166 -128 -126 -133 -102 -122 -147 -128 -148 -143 -134 -97 -147 -129 -85 -147 -144 -136 -128 -169 -145 -129 -127 -92 -143 -137 -142
70722 -181 -132 -114 -129 -120 -99 -121 -137 -152 -136 -132 -152 -102 -75 -105 -151 -105 -113 -140 -133 -125 -151 -136 -99 -78 -142 -129 -126 -117 -135 -148 -154 -125 -142 -155
71753 -157 -111 -143 -131 -149 -154 -144 -118 -130 -134 -164 -109 -123 -121 -144 -171 -127 -146 -116 -132 -125 -94 -153 -145 -111 -131 -157 -158 -116 -176 -119 -121 -168 -141
72755 -98 -139 -152 -117 -103 -154 -111 -110 -138 -152 -115 -101 -135 -140 -137 -106 -144 -100 -124 -147 -128 -128 -116 -149 -145 -148 -120 -139 -121 -137 -111 -120 -102 -110 -152
73787a33pK2j4j8K4MJ4j5qrj9N5k1j0J8o1N2J4Jl1J8k2K0M2p2kPL5oqL8j1m1a53
74818a25j2L7k1nJ9j7Nk7J9KJm0M5J7k9qNLJ4k5L1%j7j0K2l9L6m1K7rkK1k9pa28
75879a26j5K9l8K9j2KK1k2KK3mOmm2rO5l7Nk0K8NmK7l5J2l9L4j9J7J7L0l8k3a71
76910a63RoL0k2K0j1K3j8Pj6J4J0k3L6j9qj5L4mj4k9P6n9J9%K9l8JJ0J6k5j3a35
77912a29qlM9m9K4Pj1k0k3M4rrnj1M3Jjj9j8N8n4N2p5K6LK6k7J9lprM3j8k4j8a30
79003a12K0l3mMjj7mK2J5Ko0J6M5j8j3K4j8Nk4M2m2K8J3j6Rk8mK3kjK9Jl8J2a28
80063g8o7J0J7j6LL0n8L6L1o2L1l3M8oMj3Kk2K3K0mj5J5rKj0NlJ4kl2J5oK7k0a06
81154h7m4L6qm0P6l1k7K0j8J4k6K4J4l2K8m1L9m2M5Mm7J6M2n1NJ6J3pj7k9K4i1
$$ plain form
73787 -133 -140 -118 -132 -150 -126 -122 -108 -123 -131 -140 -159 -104 -125 -135 -117 -178 -126 -112 -111 -142 -124 -146 -126 -84 -156 -158 -151 -116 -122 -130 -92 -103 -144 -153
74818 -125 -137 -100 -121 -126 -107 -124 -119 -146 -127 -125 -124 -164 -119 -102 -131 -139 -134 -131 -117 -142 -111 -111 -128 -138 -116 -155 -119 -160 -133 -142 -144 -123 -152 -159 -128
75879 -126 -141 -112 -150 -121 -133 -131 -110 -132 -130 -107 -111 -105 -109 -151 -160 -95 -132 -127 -147 -119 -114 -118 -91 -126 -114 -153 -119 -138 -121 -104 -74 -112 -135 -171
76910 -163 -154 -160 -130 -152 -132 -143 -120 -138 -131 -147 -133 -123 -146 -110 -129 -137 -152 -118 -122 -136 -165 -89 -148 -129 -129 -100 -138 -137 -127 -111 -136 -149 -135
77912 -129 -137 -140 -91 -140 -116 -109 -120 -140 -163 -119 -128 -137 -142 -153 -110 -109 -110 -129 -147 -89 -143 -91 -166 -140 -137 -111 -138 -119 -122 -129 -138 -95 -113 -137 -155 -130
79003 -112 -92 -125 -129 -125 -126 -143 -147 -125 -110 -108 -168 -152 -107 -125 -138 -114 -132 -127 -151 -109 -151 -123 -110 -126 -117 -145 -149 -126 -128 -129 -100 -99 -137 -125 -128
80063 -78 -145 -135 -118 -134 -131 -101 -159 -123 -92 -154 -123 -156 -108 -114 -110 -123 -121 -143 -120 -100 -104 -119 -104 -113 -111 -121 -116 -119 -105 -107 -139 -124 -130 -103 -123 -106
81154 -87 -131 -95 -103 -143 -67 -98 -125 -105 -123 -109 -135 -111 -97 -129 -101 -142 -103 -145 -100 -96 -143 -127 -85 -136 -131 -115 -102 -109 -126 -155 -131 -91
82126h8Ql7mjK1j5K8m6PnJ7J7j6Mj4L5k6j8L5pj1k1OJ0l2L8LLl1L2nJ1lj7pM0g7
83246a18L9l1J7k9pRqj5N5l6J8j8K8Ql5Lk6J0J7K5nPK5l2J6k6K6m2N4l3J9j1h2
84248i0M2J5p2j9O8k6k0k6N8jj3NL0%m4K3j4J1M4n0J4j0k5NL1m1K5%J8k3j5L6e8
85250g9pqL5k1J4pRL1k2qKK2Mj2j4Rj7M1l5j2L8k3J6M1j5%k5l2J2J2j4J1j1j2h4
86311i0JM2ml4k0L7k4K5l3N2k2pk0jJ0M5m1J9k6J9Rj1J7k7qOL1j7j2j9M3m9L6h8
87342f8j9Nj2j6J7Pk9K4M0o0Jk6J7K2j2j0k0L3K4Nm3nj2OL6m3J2mOK9k9k0M5a07
88373a38J3nj6K6j0%NNJ5j4j8K2l3K3j7L1k0nMOk6J3M3m5J3QmJ0j2k5N4l0j%a48
89434a25MJ3k6lj5J3J3Jk4M0l0J1oJ7K0rk9kL4j5j6Jj7M6j6mPkK0l2MK0J1l5i8
$$ plain form
82126 -88 -80 -117 -121 -122 -101 -116 -88 -134 -127 -132 -115 -98 -114 -110 -124 -89 -115 -133 -98 -105 -116 -137 -131 -121 -153 -115 -112 -109 -140 -108 -113 -102 -105 -122 -129 -89 -77
83246 -118 -79 -110 -93 -122 -129 -120 -128 -143 -88 -124 -106 -124 -96 -88 -123 -120 -146 -136 -119 -94 -99 -92 -67 -99 -83 -109 -83 -125 -71 -104 -85 -96 -82
84248 -90 -48 -33 -105 -124 -56 -82 -102 -128 -70 -71 -84 -79 -49 -49 -93 -70 -84 -73 -29 -79 -65 -75 -100 -95 -64 -105 -80 -80 -62 -85 -100 -64 -58
85250 -79 -86 -94 -59 -80 -66 -73 -64 -33 -55 -63 -61 -39 -35 -47 -61 -52 -69 -28 -63 -75 -37 -60 -44 -3 -18 -18 -43 -75 -63 -51 -65 -54 -65 -77 -84
86311 -90 -89 -47 -51 -85 -105 -68 -92 -67 -100 -48 -70 -77 -97 -98 -88 -43 -84 -65 -91 -72 -63 -74 -57 -84 -92 -86 -55 -72 -84 -103 -60 -109 -73 -88
87342 -68 -87 -82 -94 -110 -93 -86 -115 -91 -51 -111 -110 -136 -119 -97 -109 -119 -139 -106 -82 -77 -120 -125 -137 -131 -95 -138 -126 -130 -124 -95 -124 -144 -99 -107
88373 -138 -125 -130 -146 -120 -130 -130 -125 -120 -105 -119 -137 -115 -148 -125 -142 -111 -131 -136 -132 -126 -152 -139 -96 -141 -128 -120 -124 -114 -126 -151 -97 -127 -128 -128 -148
89434 -125 -121 -108 -134 -137 -152 -139 -126 -125 -149 -109 -139 -128 -134 -117 -97 -106 -135 -137 -103 -118 -134 -133 -150 -104 -120 -124 -117 -119 -99 -131 -127 -107 -96 -131 -98
90495a26J5mJ8k5l1N9k9j5K8Km8O0Ol7Jj7J2L9m1K5l2QmJK8qK8m1KJ6n0J0K1a23
91526a58KN1k8jN%K3k5K6j6NkJ0rk8j0J2JM8Jj6mK9p4N0l4L8l4J7k1L9k1Lj5a35
92587a17kj8j6K7K6j7m0K2POQj7J4l6N1m3K5OnK0k2k5K2RJ4j4j3nRmM0l2K2oa16
93648a07m2K9J7l0J4j4LPJ0l5M0j9pJ3lk1K7K8p2O0n6N2j4rN0l2L6l2J4l1J8a00
94621a13k8K1j5L7l5rK4k1L7k2olJ6%mk4PMJoj2N8m6K3J5k1j8J1k6j4L7k2L6i2
95652a36j6N7k2K0j3m4J4K4%k1Qj3j4%M5k9J9Pk8olM4J2l1Mj9J2L1n1K5k4K0a20
96654a64L3ORl1k0M4kRlK4n0k9pO2J1l6N7o1L8k2Pk8J6k3J6L3l0OPj0J4k3M2a60
97686a40QkMK9l4Rj9L0Nk2rOK4l1NnkK8j8L0oj3nK7pj6K1m0j8M0j3K5l3nN3j8a35
$$ plain form
90495 -126 -111 -115 -97 -122 -153 -94 -123 -138 -110 -108 -156 -96 -90 -127 -126 -143 -131 -92 -133 -108 -140 -132 -136 -135 -107 -115 -87 -128 -126 -110 -160 -150 -129 -123
91526 -158 -156 -105 -133 -134 -129 -129 -106 -131 -105 -121 -116 -118 -108 -117 -145 -155 -143 -142 -94 -93 -109 -113 -84 -158 -108 -142 -104 -138 -121 -142 -103 -124 -121 -136 -135
92587 -117 -119 -137 -153 -126 -100 -117 -157 -135 -128 -122 -114 -131 -117 -153 -102 -145 -120 -114 -119 -99 -121 -146 -124 -115 -101 -115 -128 -133 -124 -128 -88 -120 -98 -104 -116
93648 -107 -149 -120 -103 -133 -119 -133 -130 -123 -113 -148 -108 -127 -134 -121 -124 -145 -118 -90 -162 -102 -158 -106 -120 -129 -79 -111 -75 -107 -93 -124 -106 -100
94621 -113 -141 -120 -135 -98 -133 -142 -118 -139 -102 -124 -130 -133 -117 -117 -121 -145 -138 -134 -133 -139 -151 -93 -139 -116 -101 -122 -140 -129 -155 -169 -132 -154 -118 -92
95652 -136 -152 -95 -117 -97 -110 -154 -140 -116 -116 -137 -129 -142 -156 -156 -111 -140 -121 -114 -142 -148 -151 -107 -95 -126 -122 -141 -129 -98 -149 -124 -148 -128 -120
96654 -164 -131 -125 -116 -147 -167 -123 -125 -116 -119 -95 -145 -174 -181 -119 -108 -144 -87 -148 -110 -132 -125 -153 -137 -160 -144 -111 -141 -135 -128 -138 -124 -147 -105 -160
97686 -140 -132 -134 -130 -101 -135 -126 -145 -115 -110 -132 -141 -135 -111 -142 -137 -142 -144 -116 -134 -104 -110 -123 -128 -101 -108 -124 -103 -143 -161 -121 -134 -109 -142 -147 -94 -112 -135
98806a28J1J6l5j3K0MMkmmj2J1jM2%l3pJ3l1L2Pl7M6Jl1K5k9Pj8NJ9J4l6j0L5a52
99896i5m0JK4rJ6rk4N6q6L2j4pJ2L2j4k%K9o5M9Jol0L0O1o5pQnlpJ5j9mpK2k8a36
101046a35J8Lql7M7j5oj0J3k6N4k5QJ4j3rj2j6L7rNJ9k4pK0j2K0j7K5k9oJ6k1a19
102077a51%j5M7Pj8J1L1l5k4K2OmMLj2Kj8K1k3M1n3L9K5k9J6J1n9K7MM7k2Lk6a11
103109a28K0L2l5J5J2j7J2l7NL6k2j1K0j7LlML1j5n0O8m7K9l7Q4l1l0j2J0J4k5a31
104081i7J0j2Lk0k3L3J8k%nk5L2l9J8J1MJ2k9J6j3K7kl1L1l1M7n3M0o1O1JJ1k2g1
105113a05JK2Kk3K6k7L7mOmk6j0K4l1qO3m6K4k5j8J9L8m2L4j6j0K4k0RL7k9k3f7
106115i0K3qk6J0K7plNj2LK6Mj4J7l6M3m4J1J1j3jNJ2l9J3lN2m2J3MQJ0j6J9n0d1
$$ plain form
98806 -128 -117 -101 -136 -149 -129 -125 -121 -123 -127 -131 -143 -132 -133 -91 -91 -124 -131 -118 -149 -117 -110 -147 -101 -100 -131 -106 -135 -128 -146 -141 -122 -108 -144 -154 -119 -152
99896 -95 -135 -134 -110 -119 -103 -112 -136 -80 -166 -134 -148 -155 -143 -111 -125 -127 -127 -98 -163 -114 -113 -119 -149 -119 -58 -123 -130 -122 -127 -130 -137 -122 -141 -145 -152 -130 -158 -136
101046 -135 -117 -114 -122 -159 -112 -127 -133 -143 -130 -156 -102 -127 -119 -105 -118 -127 -139 -155 -118 -127 -122 -103 -127 -134 -114 -126 -106 -123 -98 -127 -133 -117 -138 -119
102077 -151 -151 -166 -119 -112 -130 -119 -88 -123 -147 -125 -119 -123 -119 -116 -128 -126 -144 -123 -146 -105 -158 -119 -94 -123 -107 -96 -155 -128 -124 -77 -99 -96 -122 -111
103109 -128 -108 -76 -111 -96 -84 -101 -89 -126 -121 -85 -107 -118 -98 -115 -112 -115 -111 -80 -95 -145 -77 -124 -95 -132 -48 -79 -109 -121 -111 -97 -122 -131
104081 -97 -87 -99 -96 -116 -139 -106 -88 -90 -90 -95 -120 -88 -127 -109 -98 -94 -82 -111 -95 -108 -81 -83 -114 -83 -114 -67 -120 -80 -141 -80 -79 -68 -90 -71
105113 -105 -104 -82 -80 -103 -77 -104 -67 -71 -65 -69 -95 -105 -81 -112 -120 -57 -103 -79 -104 -122 -103 -65 -107 -73 -89 -99 -75 -95 -86 -49 -78 -101 -67
106115 -90 -67 -75 -101 -91 -64 -71 -74 -69 -81 -78 -52 -48 -62 -45 -81 -38 -82 -71 -60 -73 -74 -69 -57 -96 -83 -86 -34 -76 -63 -59 -51 -41 -57 -38 -88 -41
107206h0M0K1k2NQj2Oj7oJ7lrqL2K8n8J9K2m1N3k4J5J1m2NNK9Mk5oj2K1K6qk1e9
108296hl2oK0k8O5m9K2l8M1K4o5J1K7jk7QJ9Jk1j2KL3k5J6J8j0p4M8MJOkj9L2d8
109357d7K1nmk1K9PnNj7j5k1L5K5n9K8J0Pj3k7K8J3pk6K7J6l1j7nJ9J5kj6k5J9h0
110418a03L5LRQk9oJ7J1ok2j5NK6K3k1l1Ml0P3p3J9K3k2Oj0L1k4J7k8J7Kk2JM2a22
111479a27M5k4MqPk6L1j2k2L0mOm0P9q5N8l5K4lj8LoL1l1lK4Jmm0L8K6j0n1K9a05
112540a43K1NK1k5K0J1p3O2k2qmM8o8P6l4LRl7N4l2J8k3K0j4J7Ro7J1L8ok0L6f4
113543a31J4Qllj5J0K7l7lNnJ2J5OPn2L0jLL4o1M9j2L0k9J6k9J4J8K7k3Oj4J3a00
114604h6m6J5J9Oj3L3n5M9jm6J8kj0J8k4J8j3NJ5K4k7mJ0rj7JL0jk6K7K3k5O9f9
$$ plain form
107206 -80 -40 -19 -41 -36 -28 -40 -34 -51 -57 -40 -43 -52 -60 -28 0 -58 -39 -17 -58 -5 -29 -14 -3 -45 -40 -35 -6 -2 -27 -33 -45 -24 2 -6 -27 -59
108296 -8 -40 -46 -26 -54 11 -38 -16 -54 -13 11 -54 -43 -16 -17 -44 -36 -17 -16 -37 -49 -47 -14 -39 -23 -5 -15 -89 -41 -37 -36 -30 -32 -51 -19 -48
109357 -47 -26 -31 -35 -56 -27 -20 -25 -20 -37 -52 -73 -38 -13 -72 -44 -34 -27 -40 -67 -39 -26 -33 -59 -32 -16 -47 -64 -69 -50 -35 -37 -53 -78 -59 -80
110418 -103 -68 -65 -56 -48 -77 -83 -66 -55 -61 -83 -98 -93 -67 -44 -65 -96 -92 -122 -49 -122 -103 -80 -102 -96 -106 -75 -99 -82 -110 -93 -91 -113 -112 -70 -122
111479 -127 -82 -106 -102 -110 -103 -129 -98 -110 -132 -102 -106 -100 -140 -61 -146 -88 -123 -99 -102 -120 -117 -123 -92 -123 -126 -102 -101 -105 -145 -107 -81 -91 -142 -113 -105
112540 -143 -122 -117 -96 -121 -101 -90 -163 -101 -123 -131 -135 -87 -155 -79 -113 -110 -101 -138 -84 -116 -98 -121 -101 -115 -98 -89 -156 -145 -107 -113 -133 -97 -64
113543 -131 -117 -109 -112 -115 -130 -120 -93 -130 -133 -128 -133 -121 -106 -100 -93 -145 -115 -116 -113 -79 -140 -91 -103 -73 -102 -86 -115 -101 -83 -56 -79 -73 -87 -74 -100
114604 -86 -132 -117 -98 -92 -105 -72 -127 -78 -79 -125 -107 -109 -119 -101 -125 -107 -120 -115 -100 -76 -103 -107 -97 -106 -123 -122 -92 -93 -119 -92 -69 -94 -25 -69
115635f5k1mOj1oM0L6K4m3J0n3qJ3oJ%l3K1oJ0k9J4J1Ok0J8pmj7l1L5J0oj9Nk0a09
116755a39J9M5l0Lk2K8j7L9qJ1n4N2k8K3k9K7Lk3J1lJ2k5J3j6L7k1l9K5l7K6Ma23
117728a26J9NJ5j1J8j9%J0j5K1j8k2J9j6K1j5rJ3L9Ol6rJ5j6J7Nn6N6LqK8l3Ka23
118759a22J8k1J1J1j8L3Lj6N0q3J3K1Kj3K2l0K2m5P1l1K1k9LoPJ5ll0O8m9KRK5i4
119791i1OJ7%Pl5L2K7o7L1r%J5jj4J9l0O9m7L0pPK2k3L2RjJJ9j2k5N3lN4M%L3A05
120911A26K0O6j8L7QK1k2J4L6j1J8k1M2ol9kK9K1m4k9j7j1pLl8Oj3NOk7rK6j4A30
121943A10J2M2k1j4Mk1M7k9jj5nJ2mL8k3J5J9rJ0k1KJ6j5K5k2M7m6N0n6K8%QQA80
122974B19oJ5j9l9OOl4RM5o7LQKKk8L1k4J2k6kl6O5j7l0K8L3n2k5L5Jl7J1q%j0F6
$$ plain form
115635 -65 -86 -90 -84 -95 -101 -61 -25 -1 -44 -34 -87 -95 -82 -88 -87 -87 -120 -99 -105 -95 -124 -110 -99 -93 -113 -95 -102 -106 -123 -154 -119 -109 -115 -134 -129 -149 -109
116755 -139 -120 -75 -105 -102 -124 -96 -113 -74 -82 -71 -125 -73 -101 -78 -107 -80 -77 -100 -89 -92 -80 -105 -92 -108 -71 -92 -131 -106 -143 -117 -113 -123
117728 -126 -107 -102 -87 -98 -80 -99 -99 -89 -104 -83 -101 -123 -104 -120 -99 -114 -123 -110 -71 -65 -101 -110 -95 -111 -94 -89 -145 -89 -86 -94 -66 -99 -97 -123
118759 -122 -104 -125 -114 -103 -121 -88 -85 -101 -51 -134 -121 -100 -98 -111 -89 -119 -97 -142 -71 -102 -81 -110 -107 -113 -106 -91 -94 -124 -56 -105 -103 -94 -69 -94
119791 -91 -85 -68 -68 -61 -96 -64 -37 -104 -73 -82 -82 -67 -68 -82 -63 -93 -24 -71 -41 -48 -41 -19 -42 -10 -1 -2 -1 18 6 -19 34 31 85 89 89 122 105
120911 126 146 212 194 231 239 260 238 252 288 277 295 274 316 310 271 269 298 319 275 246 229 218 211 214 176 182 169 174 180 153 144 170 156 130
121943 110 122 164 143 129 133 112 159 130 129 114 109 121 117 155 132 147 166 157 167 146 148 164 149 174 152 199 153 203 147 175 175 183 191 180
122974 219 213 228 209 170 176 182 148 157 202 135 138 146 148 150 122 153 129 141 115 113 77 142 125 95 123 156 104 79 114 115 78 89 81 81 71 66
124065H0lo3L7LL2qj8J5n8L6l0kMJ4j4J8k7K3j8j6LpK7k0k3K3Qk2LQnmlL3j8k5E
125185a0K2l8J1rnj8L8j3j5jQl1L4m2L6k6L4j0Pk5llJ2K1l2jl2P6mp7M1nMm4L4d8
126275d0n1K5k1K0j3j2J7nj4J2J2lk1K0K6l8J9l8M7Mj8J4m0j8L1KKPj0rnKj2na23
127336a10J7QJ2j8nqJ5L4k1j6J5j7kk0L7Qj3j2kk0k1K7J0LnK5k9J5n0N1l5QL0a04
128368a08QJ0j5k1J6J3l9oK1M5n9L4j9Qj2M4nl3l0M1k3qM2J4m2Rk1K9J8K7m3oa24
129370a64M4lK7J0Om6K6n7L1jK2j7k5K6K8k3k5M6mj6%L8m3J7KL1k1l5mN5m2J7i9
130372i7k8NJJj0L2J1m7M2j6j2l0K7O2l4Pk8J1K4l0J7l1kK2j2omOk6N2k0pMl1a36
131433a15PM8m7J3PJm0N7l8LL2j8j5J1Pml9J8J1j8%K3lk4O0n9K7qL7o1k1K7j7a25
$$ plain form
124065 80 77 14 51 54 86 78 60 75 17 53 23 21 25 39 25 43 16 39 21 5 8 1 28 8 -15 8 16 -6 -3 5 0 -4 -7 26 8 -17 5
125185 -10 12 -26 -15 -24 -29 -47 -9 -22 -37 -38 -30 -61 -27 -69 -33 -59 -25 -35 -28 -53 -56 -59 -47 -26 -58 -59 -91 -15 -19 -96 -55 -60 -56 -100 -66 -48
126275 -40 -91 -66 -87 -67 -80 -92 -75 -80 -94 -82 -70 -73 -94 -74 -48 -86 -67 -105 -58 -54 -72 -58 -98 -116 -85 -83 -81 -74 -84 -93 -98 -96 -108 -113 -123
127336 -110 -93 -85 -73 -91 -96 -104 -89 -55 -76 -92 -77 -94 -96 -116 -79 -71 -84 -96 -98 -118 -139 -112 -102 -99 -104 -79 -108 -93 -143 -92 -127 -119 -89 -104
128368 -108 -100 -90 -105 -126 -110 -97 -136 -142 -121 -76 -135 -101 -120 -112 -124 -80 -85 -118 -148 -107 -130 -138 -96 -82 -124 -115 -136 -107 -89 -62 -105 -111 -124
129370 -164 -120 -123 -96 -86 -80 -126 -100 -157 -126 -127 -105 -122 -147 -121 -93 -116 -141 -95 -99 -115 -115 -77 -120 -103 -101 -70 -91 -126 -130 -75 -117 -100 -99
130372 -97 -125 -120 -119 -118 -128 -96 -85 -132 -90 -106 -118 -148 -121 -59 -93 -86 -114 -103 -79 -109 -92 -123 -125 -103 -115 -121 -125 -119 -145 -93 -113 -120 -116 -147 -136
131433 -115 -108 -60 -107 -94 -87 -86 -126 -69 -107 -104 -72 -90 -105 -94 -87 -91 -130 -112 -101 -119 -119 -96 -99 -123 -63 -122 -95 -103 -66 -127 -148 -121 -138 -125
132465a32QL0m2M0k4okJ4qN5m3m1mO3ml3j0M7j5j2J8l2J9kj4M3l2L7l8mK5K5m4a27
133496a58M1j6K1L0m8NmM5J2No6L9LK9m7K0j8m6M9K4l0J9l3M6k0oL7n6MM9n4N1a12
134499h8k1L8q1M7KK7j3j1j0mj1J4j5RON0m9LPj5nJ9J0o0N1mk0j0J6oj4J2j9K0a13
135560f4p0M9n6K4l8J8J7Kl8O6o2L2j7k2L6J3k7L8j8J5l5MK0L6o2qL3%J0nMk8g9
136562a01l9J3K8k3K9LPm8LL1l3J1J5kk4J1Mk2K3Jj7J9MJk4J5Qom8N3l8K2%j5a06
137623a46K7j5kJ6j3J5j0J9j6J3k6Ok3JkL2k9J6JJ0kj8MJ9J2m7N1Ll2j7J6lJ8a46
138654a24m2J1K3k3K8K7l3j6J7jj1l2O8n8NRK7LJ4Jm6L8ol4K1k4L8l0j2N2m4N5a32
139656a39PJ3j8rnL0k4pK2l0J3K4j5QJ8m7L3j2LL0j7J0kl5qJ8j7KL8k5PRK%k4a21
$$ plain form
132465 -132 -124 -94 -136 -96 -120 -126 -128 -114 -122 -67 -110 -151 -155 -92 -96 -129 -139 -92 -107 -119 -101 -133 -114 -116 -130 -87 -119 -82 -120 -124 -99 -74 -118 -127
133496 -158 -117 -133 -112 -82 -130 -125 -129 -84 -72 -67 -133 -94 -91 -62 -109 -89 -107 -153 -104 -80 -110 -91 -124 -78 -98 -104 -67 -123 -119 -70 -124 -73 -112
134499 -88 -109 -71 -152 -105 -103 -76 -89 -100 -110 -114 -125 -111 -126 -117 -111 -61 -110 -107 -100 -115 -120 -101 -91 -151 -100 -104 -124 -134 -118 -124 -138 -126 -145 -125 -113
135560 -64 -134 -85 -141 -117 -155 -137 -120 -118 -156 -90 -152 -120 -137 -159 -123 -110 -137 -99 -117 -102 -137 -133 -113 -77 -139 -147 -114 -114 -104 -109 -105 -133 -79
136562 -101 -140 -127 -99 -122 -93 -90 -83 -131 -128 -97 -130 -119 -104 -106 -130 -119 -115 -137 -114 -113 -130 -111 -107 -106 -130 -115 -107 -113 -161 -108 -146 -124 -124 -139 -106
137623 -146 -119 -134 -136 -120 -133 -118 -128 -109 -125 -112 -138 -132 -155 -154 -156 -124 -153 -137 -136 -126 -128 -146 -142 -123 -111 -158 -107 -104 -136 -153 -137 -140 -122 -146
138654 -124 -166 -155 -132 -155 -127 -100 -133 -149 -132 -133 -144 -176 -108 -166 -161 -152 -125 -122 -108 -107 -153 -115 -121 -155 -134 -158 -120 -150 -162 -110 -154 -99 -132
139656 -139 -132 -119 -137 -146 -151 -121 -145 -152 -130 -160 -147 -123 -138 -130 -112 -159 -126 -138 -135 -105 -122 -112 -114 -149 -157 -139 -156 -154 -116 -141 -134 -125 -123 -123 -147 -121
140747a53L6oj7%J9ml0j0QK1j4K3j5JK9rJ4o4K5%rl2M5j5j0M3lrPj5M2n3NL0j5a04
141838a37J5k7N4n6L3l5K1K7j3j0k0j4L7k5nK4K3k1J4k0MOk9j0M1koj0j0j0J6a24
142810a21k6j0L9k5rJJ5j9J4kK5k4Kj7M6k6k9MJ3M3ko4lK5J1j0QoOrj4O9p5L4a26
143871a50K5l3M4J3lq3N5Qn0L8k7K8J7l4K2j3J7K1l1nRk8J8J8k3j4P0l5Rm9K4a62
144844a38j2j2J9k3ROJ9Jk2k0N6mk8M0Lm1j4J2nJ5j0K9l6mMJ3k8L5lL0m8qK1Ja39
145905a60L8M1l3k2j3M0m5K0kK3k3lOK1j6J0k4j8K6J2k7K1qJ5k1lj3L5k4J6k2a64
146878a06k3j6RNkk2L7j3K8o2L9m3L3k3kJ8k0L7L5n8K5l6K9rRj6L5j5J6j0kj2a19
147880a43j8L9m1N8k3l1L7k3J6l2M6l1J4J1Rj9K4k2J3l8K4%J9k6L5j9k2K3k0J7a19
$$ plain form
140747 -153 -117 -123 -140 -140 -121 -125 -155 -165 -157 -136 -150 -127 -142 -141 -112 -121 -107 -171 -146 -146 -155 -187 -142 -157 -167 -124 -127 -136 -129 -144 -102 -155 -150 -120 -135 -104
141838 -137 -122 -149 -95 -151 -118 -153 -132 -105 -118 -128 -148 -162 -125 -150 -155 -131 -108 -129 -115 -135 -131 -125 -154 -164 -123 -125 -131 -141 -151 -161 -145 -124
142810 -121 -147 -157 -118 -143 -152 -151 -136 -155 -141 -143 -118 -142 -140 -157 -111 -137 -166 -162 -149 -106 -108 -172 -175 -150 -139 -149 -141 -147 -141 -150 -164 -95 -170 -136 -126
143871 -150 -125 -158 -114 -101 -104 -187 -132 -124 -174 -136 -163 -135 -118 -152 -130 -143 -126 -105 -136 -141 -132 -160 -142 -124 -147 -161 -91 -126 -117 -166 -142 -162
144844 -138 -150 -162 -143 -166 -157 -151 -132 -131 -153 -173 -117 -121 -149 -109 -106 -147 -161 -149 -154 -139 -149 -120 -156 -160 -156 -143 -171 -136 -139 -109 -157 -165 -144 -143 -139
145905 -160 -122 -81 -114 -136 -149 -109 -154 -134 -136 -113 -136 -139 -133 -112 -128 -118 -142 -160 -134 -122 -149 -128 -136 -121 -142 -145 -158 -123 -147 -131 -153 -164
146878 -106 -129 -145 -136 -131 -133 -155 -118 -131 -103 -165 -126 -169 -136 -159 -161 -143 -163 -126 -91 -149 -124 -160 -131 -140 -131 -147 -112 -127 -111 -121 -123 -135 -119
147880 -143 -161 -122 -163 -105 -128 -159 -122 -145 -129 -161 -115 -146 -132 -121 -112 -131 -107 -129 -116 -154 -130 -130 -111 -137 -102 -121 -143 -120 -140 -123 -119
148823a58M6qr%PoMqqJ7j4L7l6J2J4orK4j3Nm5M3L5l1J2l2nK6j6JL6l4Kj9J4k9a26
149943a17Kl8%J3N3l3J5%Pj4j7j3J1J0Onj4K8K2k2j4N0m7K4qQm4%M3k8l0L7NLa29
151004a19j9L1j4M3l7lK9%k4kJ7l6M4Ool3KK4k8QJ1OJ1l5L1k5RJ6Nk4j5NkmL%a10
152124a07J7j6L5k0J5m5jl1J4K7k1NJ9qj9K0m%K4m2J4K5n2L2l9N0j9NRj2j0Jj8a59
153155a10j9j5J9j0mJj9M5qj6Rk5QJ8pk2O2o9K1L8k8Qk3rMQoON1k8k2mjJ7Qj5a30
154276a44mM6k6l6K0K7m7J7J3k3LL3k2j3pJ3Mm0J4L1j8j0L2j5K0k5J8JJ1j6mL1a24
155278a56olK5LpqKnK9n3L7MJ4Kl4JK7k3J1j6pJ1OM3m6j2L5j5kk8J7k7O7m6J7a75
156368a49KK4MqJn3M6j6qK3k4J2J6j5M0m3Pj0j5J2J4Pnk8kj0M9k2J3K7j7rKj5a54
$$ plain form
148823 -158 -112 -120 -129 -129 -122 -128 -124 -132 -140 -123 -137 -100 -136 -124 -110 -116 -125 -101 -114 -109 -154 -111 -76 -107 -95 -127 -132 -106 -122 -121 -85 -119 -117 -136 -122 -151 -126
149943 -117 -115 -153 -153 -140 -87 -120 -105 -105 -98 -112 -129 -142 -131 -121 -115 -120 -134 -106 -84 -106 -120 -70 -117 -93 -101 -93 -137 -137 -94 -122 -152 -115 -110 -107 -129
151004 -119 -138 -107 -121 -78 -115 -118 -89 -89 -113 -115 -98 -134 -90 -84 -90 -123 -121 -97 -125 -117 -106 -100 -89 -124 -93 -118 -109 -93 -88 -112 -127 -122 -124 -128 -125 -125 -110
152124 -107 -90 -106 -71 -91 -76 -121 -122 -153 -139 -112 -133 -128 -109 -117 -136 -116 -120 -120 -96 -138 -124 -99 -151 -119 -158 -108 -127 -122 -113 -125 -135 -134 -152 -159
153155 -110 -129 -144 -125 -135 -139 -138 -157 -112 -120 -136 -127 -152 -144 -126 -133 -155 -93 -162 -141 -103 -131 -123 -146 -155 -151 -143 -149 -143 -92 -120 -142 -146 -147 -130 -122 -137 -130
154276 -144 -148 -102 -128 -164 -144 -117 -164 -147 -134 -157 -154 -121 -143 -156 -163 -150 -146 -186 -172 -141 -159 -169 -137 -152 -132 -157 -139 -138 -127 -143 -147 -116 -124
155278 -156 -162 -165 -140 -137 -144 -152 -150 -155 -126 -179 -142 -138 -124 -122 -156 -155 -128 -151 -140 -156 -163 -152 -146 -103 -149 -161 -126 -141 -143 -171 -154 -181 -114 -160 -143 -175
156368 -149 -147 -123 -119 -127 -126 -179 -133 -149 -157 -134 -158 -146 -130 -145 -105 -148 -141 -151 -166 -154 -140 -133 -138 -166 -168 -178 -129 -151 -138 -111 -128 -137 -135 -150 -154
157429a38J9m1K1kK2J4n6QqOrL9ro7O9j8j4J5j5L2k4J7k8M5k0L4n4K1rL6m8OK2a35
158461a35jj7M1j4m2K6ok6N9o7K3J1jJ5k8M1j7k3J1OJ1mMmk3j0mQ2l8o3O0j9k6a53
159492a38Qk4rK4k0J6j1K1J4k6L5m0n%J6%jrK0pOLj0n6K5J9j0L4j2j2k1N8p9na53
160553a40k8NoJ4K3J9l2jl1M8n6L9mL3k3J2j1m2K2Lk4P3l2k9K2jM7n0M4k2l3N1a77
161556a34kqj6%K1J7l8opJNK3J4j7K0m3%M8m3J3J7OoJ4rK4m3k9K3L1n4K9l9K0a64
162617a13m7L8p4M6J2k5%Qj5K2j6J9%m0Lj2K1K5rQk1K6j%OJ3nj8pj5JJrJ2LJj6a30
163766a66j4K6ONK4Rm4j0J4MJ4Kk0j4rMK1K2j4l0j6L0RprJ5k3M0l5K7Ol0J3n9a71
164827a44jLK4n6QK3m3L3Rl4J9Onk8J0J7M%L5j1k3J3Pm9M8j9nQM0p7K2k7J4QRa76
$$ plain form
157429 -138 -119 -160 -139 -141 -119 -105 -161 -153 -161 -155 -164 -125 -134 -201 -132 -150 -164 -149 -164 -132 -156 -139 -167 -122 -142 -108 -162 -141 -150 -114 -162 -156 -134 -135
158461 -135 -136 -153 -112 -126 -168 -142 -148 -174 -115 -182 -159 -148 -149 -134 -162 -121 -138 -161 -150 -144 -133 -137 -133 -137 -160 -170 -174 -92 -130 -193 -133 -152 -178 -153
159492 -138 -130 -154 -163 -139 -159 -143 -154 -133 -119 -145 -110 -150 -155 -155 -139 -139 -140 -149 -129 -136 -130 -127 -137 -193 -168 -149 -159 -125 -137 -149 -170 -112 -191 -196 -153
160553 -140 -168 -163 -169 -155 -132 -113 -145 -146 -177 -129 -185 -146 -150 -117 -140 -128 -139 -181 -159 -156 -180 -107 -139 -168 -146 -147 -100 -150 -106 -128 -161 -110 -177
161556 -134 -136 -144 -160 -160 -139 -122 -160 -166 -173 -172 -167 -144 -130 -147 -127 -170 -170 -122 -165 -152 -135 -129 -135 -121 -130 -106 -149 -178 -155 -124 -178 -149 -188 -168 -164
162617 -113 -160 -122 -196 -150 -138 -163 -163 -155 -170 -148 -164 -145 -145 -185 -182 -194 -173 -148 -157 -149 -170 -144 -145 -145 -139 -126 -131 -149 -156 -171 -170 -169 -178 -166 -163 -162 -178 -130
163766 -166 -180 -154 -148 -143 -119 -110 -154 -164 -150 -146 -132 -130 -150 -164 -173 -169 -148 -126 -140 -170 -186 -156 -147 -154 -163 -148 -171 -131 -166 -139 -133 -163 -150 -209 -171
164827 -144 -145 -142 -118 -174 -166 -143 -186 -153 -144 -178 -159 -153 -158 -186 -176 -159 -155 -155 -120 -131 -154 -141 -134 -183 -135 -154 -159 -151 -111 -188 -166 -193 -179 -171 -162 -176
165918a65KJ4k8M0m2J8Kql0L1j2L9mj6k6J5J0J5ln1N5Rj9J4k1K2J8m2j3K1kk6a64
166920a60Oj8K5n1O8l9J9Oj3J7k9K3j%j6l2L9j7j1kpKK8k4k0M6kj3oj1N5n9Nla60
167981b15M6l4k6O3j7Lj1OJ2J6K4l6J9k0K3l3L5k4J4JnL9oo5N4j8K2m9L3J1J2a64
168954a55L0j8K7m5k1L8pK5k2l1L2m5K8k8M2Oj6J8l1rL0J1k5JJ9J5m2J3J4J5l6a38
169926a67J6k1L3K1n1K1k9J7J5j0%pJ3nK6k3l5J2lJ5K5l8O0k7oJ%k4K6rj9O0n1a69
170958a38k5k6L5Nl6K3J0lOJ5l6N0l2j2K1J5n7J5L1l0N1m7L6j0j3L6l1mj1pL2a69
171930a53j0MK7k2k1L9m5J1K3k8L7k4Rj4J6J5j1l9K9qj4J4j5J9j6J1L7o5K5M7a51
172874a34m2K9jk4K7k5qNrKL6m5M1J0j6J5%k1L1m9K7nRm3N6l1LoK3l7PKM5ml5a55
$$ plain form
165918 -165 -163 -149 -177 -137 -179 -161 -159 -167 -197 -166 -178 -139 -143 -159 -185 -170 -160 -145 -148 -199 -144 -135 -154 -140 -161 -139 -121 -163 -176 -155 -157 -183 -164
166920 -160 -154 -172 -147 -198 -130 -169 -150 -144 -157 -140 -169 -146 -147 -147 -163 -195 -156 -173 -184 -186 -193 -191 -163 -187 -207 -161 -163 -176 -182 -193 -138 -197 -192 -195 -160
167981 -215 -169 -203 -229 -166 -183 -180 -191 -185 -173 -157 -133 -169 -150 -170 -147 -180 -145 -169 -155 -154 -159 -120 -126 -191 -137 -155 -133 -182 -149 -138 -126 -164
168954 -155 -125 -143 -116 -161 -182 -144 -151 -126 -148 -179 -147 -192 -164 -192 -150 -144 -160 -142 -173 -182 -152 -141 -166 -165 -146 -131 -173 -160 -146 -131 -167 -138
169926 -167 -151 -172 -139 -118 -169 -148 -177 -160 -145 -155 -155 -162 -149 -154 -128 -151 -186 -174 -177 -162 -137 -175 -115 -142 -148 -147 -147 -171 -145 -154 -173 -113 -164 -169
170958 -138 -163 -189 -154 -149 -185 -162 -152 -155 -149 -134 -170 -120 -152 -164 -143 -128 -185 -170 -139 -169 -118 -165 -129 -139 -152 -116 -147 -151 -162 -169 -137 -169
171930 -153 -163 -159 -132 -154 -175 -136 -181 -170 -147 -175 -138 -162 -153 -167 -151 -136 -147 -186 -157 -165 -179 -165 -180 -161 -177 -166 -129 -194 -169 -122 -151
172874 -134 -176 -147 -148 -172 -145 -170 -178 -173 -182 -180 -144 -189 -148 -138 -154 -139 -139 -160 -129 -178 -151 -156 -147 -190 -134 -165 -162 -168 -145 -182 -175 -173 -128 -132 -167 -155
173964a41l1M5%j5MrokOlpQoK2l2l6K8J0J9l6M5m2L0Lk7J7pN3n9pj2M5j5k2J0a11
175055a30m9J0K4Mk9J0pJ3K8n1RkK4l8L1rj5K9j2pM4m2qj4M4rM7k7j8k2K6k1K0a69
176086a78K7Ol6KJ2rJ4J5j3JkJ2j3K7j5l3J2LQql2K2M2j7K0l5J5j0MOj1K3j5J9a55
177147a84LN2m8K3k2K1J7Pl4Kk3K0j5MqJ6pj5JK1Nj0pJ5K6n2J9nj1M7k3k7L7Na77
178208a25l4NJ1k4j2qM9n6lM2KQo9K6ML3j4J0j5QJk0j6N7Olj7jj6J5j8Pj5%L4a79
179299a59j4KmJ5J5k6OOj6J0ml8K7PJ6o0L4J7%J8rj8nJ4KK0j9j8K9m5L1l9M7Qa66
180360a62L7m2j2L7k7j1K5k3J7pRjK9l4jj7M2m4K2OoL0j8m5K7k2L7J4rn0L8k2a75
181362a52J0n8K5K2j2j0k8jO9k9l6RN2l7M2n6J8k4JK2Ljk0O3m4qL9k0pj4LM5k6a79
$$ plain form
173964 -141 -172 -127 -127 -142 -138 -147 -153 -155 -149 -152 -159 -151 -157 -135 -167 -203 -175 -165 -146 -182 -137 -179 -149 -146 -173 -156 -163 -110 -169 -176 -188 -143 -158 -180 -170 -111
175055 -130 -179 -169 -145 -141 -170 -160 -167 -154 -126 -177 -168 -170 -146 -184 -153 -162 -177 -148 -160 -167 -123 -165 -173 -187 -143 -152 -105 -132 -150 -172 -146 -167 -147 -169
176086 -178 -151 -145 -181 -179 -167 -176 -162 -147 -160 -159 -161 -149 -162 -135 -150 -183 -171 -168 -160 -168 -200 -178 -136 -153 -133 -168 -153 -163 -159 -153 -164 -141 -156 -137 -155
177147 -184 -181 -129 -177 -154 -176 -155 -138 -131 -165 -163 -186 -166 -181 -177 -185 -169 -176 -191 -190 -169 -164 -174 -181 -166 -140 -192 -173 -178 -189 -142 -165 -192 -155 -150 -177
178208 -125 -159 -154 -143 -167 -179 -187 -138 -194 -197 -155 -153 -145 -214 -188 -184 -151 -165 -155 -170 -162 -161 -181 -197 -140 -134 -137 -154 -155 -171 -156 -174 -167 -182 -182 -148 -179
179299 -159 -173 -171 -175 -160 -145 -171 -165 -159 -175 -165 -169 -207 -180 -173 -157 -217 -183 -166 -166 -148 -157 -175 -180 -166 -164 -144 -163 -181 -152 -197 -166 -205 -158 -150 -166
180360 -162 -125 -167 -179 -142 -169 -180 -155 -178 -161 -168 -159 -160 -131 -165 -166 -183 -141 -185 -163 -157 -163 -133 -151 -196 -169 -191 -154 -140 -149 -199 -161 -183 -175
181362 -152 -142 -200 -175 -153 -165 -175 -203 -204 -135 -164 -200 -191 -139 -176 -134 -190 -172 -196 -195 -173 -170 -171 -191 -128 -172 -180 -141 -161 -168 -182 -179 -134 -160 -179
182394a83N0%l0J3k5J4j7L6j7j4K0k7k4K6J3J0K5p3N4Lj5%MpjrJ5pj0K3kl3K4a84
183425a72PJ9m2L6pk2KmJ5QJ%k9L0l0J0K9o7O5j7nk0L9Kk8L4j2k9K3k4L0j2MK6a68
184486a62K9m3QPK1j2j5k0L1j0qK5J6l2j5J3jJ7%K7k3J4k8L3n5M3j9M3k5j9Oma65
185488a59J3k5K5Ol4L3j5j8L2rj5L2n2K8K2%l9K7K4l0j4%K4L3o7K3J4oM2J7j5a01
186461a52jJ3L0m6Oj0K6j4M8n0Q1n7K0j7kl0N2o0M8l8K9k2J2k4N3Qj0rLQ%qL2h5
187493f8j5K1MN2nO5L3Q8J0O3J8P7N2R6L7P5P3J52J64L76L06M1m37m39k57j56B74
188318B09m0rp1lm4K8l3l1j9O6q0N1j2K6m3j4k6Rj6L9poj9nlj5J5J6J3k5PJ6J0A3
189349A9M3k6J06J2J19lP5K8Q1K2J13M8J22N6K07K16M67L44J05n16n50l33k03C34
$$ plain form
182394 -183 -133 -133 -163 -150 -175 -161 -178 -142 -159 -173 -153 -180 -204 -178 -165 -155 -130 -203 -149 -146 -161 -161 -157 -164 -165 -174 -159 -166 -176 -153 -155 -188 -164 -184
183425 -172 -165 -146 -188 -152 -159 -181 -179 -183 -168 -160 -159 -159 -188 -158 -188 -178 -149 -216 -151 -168 -173 -193 -154 -152 -180 -146 -158 -187 -164 -188 -158 -170 -166 -140 -168
184486 -162 -133 -176 -168 -161 -140 -152 -167 -187 -156 -166 -174 -149 -133 -165 -180 -167 -168 -151 -151 -124 -147 -133 -161 -128 -183 -140 -159 -116 -141 -160 -154 -158 -165
185488 -159 -146 -171 -146 -140 -174 -141 -156 -174 -142 -151 -166 -134 -186 -158 -136 -136 -175 -148 -124 -154 -168 -168 -144 -111 -178 -155 -141 -147 -105 -88 -103 -101
186461 -152 -153 -140 -110 -156 -150 -160 -134 -148 -100 -150 -69 -126 -106 -123 -125 -155 -103 -163 -115 -153 -124 -146 -134 -158 -105 -97 -107 -116 -113 -105 -105 -113 -81 -85
187493 -68 -83 -62 -58 -6 -11 54 87 175 185 248 266 343 395 491 528 603 676 828 992 1368 1674 1715 1278 839 582 426 274
188318 209 169 160 89 86 42 70 37 6 -13 53 -27 24 12 38 -5 -19 -45 -36 -52 -13 -20 -26 -45 -50 -53 -68 -53 -37 -24 -49 -42 -26 -16 13
189349 19 62 36 142 154 273 270 345 373 454 476 589 637 759 815 1022 1238 1705 2049 2154 1638 1088 755 552 334
190086B62l7l8o7ln2L5l1j0j5k4q%m6L1pk1j9M3n3Ll5K1qK2j9Ok1Ml4J3kk1K7a54
191118a59L0Rj9k4O8j3m7KK3k7J5k0qK1J1%l8j0M8k1j2j2L5j9j0j7J2J8Oj2K9a28
192090a69j8M4k4qj3L5L3k8j2J2l1K8l5K2l0K4o7N5J1j4l3N3j8j0QjqL9l5K6k7a71
193063a68k9K4J6J4k4J2k4RK0j9J0jK2k9j2K5m0L7l4rJ8K9L2q4N0ol0j5PL2J4a75
194035a67m2kqK6QOj4%K4L1l8K0l1L9j8k7rK8kL0o9N4m5PK6k7K1J7k0k3M3j1k3a79
195066a77mqK3qnK0j0l1P1n6NjQoJ6L5m3L6q0O6qM1m9K8jpj7L0p0Rj0L7k6M0l9b16
196156a73J0LPm5L7j0L6n3N6o0J2k0J3j0L4l1NK9j7JJol2qL7nJ9lrj9M8n2%rO6a77
197246b03J9Kk1J8k3O6m8kK5l6KPmJ4j6M0m6J1m9M5Qlj5L2j3J0m0L9l9K5J2k4a53
$$ plain form
190086 262 225 187 120 117 65 100 69 59 44 20 12 12 -34 -3 -10 -31 -50 -7 -60 -57 -92 -71 -79 -57 -76 -70 -91 -87 -121 -108 -110 -131 -104 -154
191118 -159 -129 -120 -139 -163 -95 -108 -155 -153 -130 -157 -142 -162 -170 -149 -138 -138 -176 -186 -138 -159 -171 -183 -148 -167 -177 -194 -182 -164 -158 -170 -141 -128
192090 -169 -187 -143 -167 -175 -188 -153 -120 -148 -160 -148 -179 -151 -186 -164 -194 -170 -237 -182 -171 -185 -218 -165 -183 -193 -185 -186 -194 -155 -190 -164 -191 -171
193063 -168 -197 -173 -157 -143 -167 -155 -179 -170 -150 -169 -159 -160 -138 -167 -179 -154 -194 -157 -191 -200 -182 -153 -121 -205 -155 -161 -191 -206 -199 -167 -153 -175
194035 -167 -209 -211 -219 -193 -185 -179 -193 -193 -169 -138 -176 -156 -187 -148 -166 -193 -202 -174 -176 -146 -215 -161 -206 -199 -173 -200 -179 -162 -182 -205 -162 -173 -196 -179
195066 -177 -181 -189 -166 -174 -179 -159 -169 -200 -129 -185 -180 -181 -173 -179 -163 -128 -171 -135 -215 -149 -157 -116 -165 -137 -138 -145 -162 -132 -202 -193 -203 -166 -192 -152 -191 -216
196156 -173 -163 -160 -153 -198 -161 -171 -135 -188 -132 -192 -180 -200 -187 -197 -163 -194 -189 -160 -177 -176 -175 -181 -213 -221 -184 -189 -170 -173 -182 -201 -153 -205 -205 -214 -148 -177
197246 -203 -184 -182 -203 -185 -208 -142 -190 -192 -167 -203 -201 -194 -198 -184 -200 -160 -206 -195 -244 -199 -191 -194 -209 -177 -190 -180 -220 -181 -220 -195 -183 -207 -153
198248a60j9j9lMJ4l9P2m9J5L8k9Mk7K3JJ3m7K6Pj6JM2o0K6k6L6l3M3k4Pj8M4b18
199250a57k0Om6L4l4N4l5K5l4L0KK4j9lk2K7l5L8pllM6m7J8k8M1n3L2k4L0m0L0a72
200252a70j8M4j0L8p6L1m7O0l6M5k1J8l8M0pJ4kK1o4M9j3L8n2K1L0k5j7L9lJ3a31
201194e1j05O0RPm3K9j9Q9m3J9j4PoJ3K0O0m3N0m4N8k9Q8j5K7oK3j0J04lR4J04E44
202167F53J79J04J82J56J95J42K31J78L08K01L96L99O28R36J011L37p48j482j027B205
202785A723l89j71j85j41j06k1j11Oq7j7o3l0n0l4l6L2j01K1m8K5n3Po4M1n9k9E9
203610G0pm2J2l5k8J3k5pqJ3k0J9j9K8l6K4j4nl3J2m9L2j4l2jN7m0O0r8N6l3M3a30
204612a14j6K4l3L3m6L5j8%l3M0OK8m1P1n1K5k6k9qL2j5J0nO1p9K7l5K0l2N4j5h7
$$ plain form
198248 -160 -179 -198 -201 -197 -183 -222 -150 -199 -184 -146 -175 -171 -198 -175 -174 -161 -208 -182 -175 -191 -190 -148 -208 -182 -208 -172 -205 -162 -186 -179 -197 -153 -218
199250 -157 -177 -171 -217 -183 -217 -163 -198 -173 -207 -177 -175 -151 -170 -173 -195 -168 -203 -165 -172 -175 -178 -132 -179 -161 -189 -148 -201 -169 -193 -163 -203 -173 -172
200252 -170 -188 -144 -154 -116 -192 -161 -208 -148 -184 -139 -160 -142 -180 -140 -147 -133 -135 -114 -178 -129 -142 -104 -156 -135 -105 -130 -147 -108 -111 -98 -131
201194 -51 -156 -96 -87 -80 -123 -94 -113 -24 -67 -48 -62 -55 -61 -48 -28 32 -11 39 -5 53 24 112 97 124 118 141 131 235 232 326 430 544
202167 653 832 936 1118 1274 1469 1611 1842 2020 2328 2529 2925 3324 3952 4888 5899 6236 5488 4006 2979 2205
202785 1723 1334 1163 978 837 731 710 599 605 518 501 438 408 358 324 288 320 219 240 192 217 164 171 107 148 89 60 59
203610 70 63 21 33 -2 -30 -17 -42 -49 -57 -44 -64 -45 -64 -36 -72 -48 -62 -67 -100 -88 -137 -105 -119 -151 -152 -95 -135 -75 -173 -117 -150 -107 -130
204612 -114 -130 -106 -139 -106 -152 -117 -135 -135 -168 -128 -122 -94 -135 -64 -115 -90 -116 -145 -153 -121 -136 -126 -131 -70 -149 -122 -157 -137 -169 -115 -130 -87
205584a51N2k6O0m2j6J4Nm4K4K0K6l7J3l1Q1p3M4p0O5l8O8m0Oj2L8nk2J4L6j7b7
206527f6L7n9K5pJ5Jk1lk8M5Ok7O5m6K4n3N5l6N4j9k7NK1j3K6k8K1LN1k6J6nL0d
207558D4l8M3kk3N8m4K1oj6KL2j8J1K0k6L6Kj6J8L7l4M4Pj7K4J6MMML0%qk1j8B01
208619B20%OK8Ql6N9j6N3j7%J3J3O6n2K9J0L7k2L3J4L2nJ6J0L8k6L4N8K7j8l9F25
209591F46K0M7MJ6J3O2k4L0MN0J6M1L9L8O4Pj8R7K9Q8P3N2O3J27O2J31K1K2oM4A857
210534A956RO0K0Q3j5O3L9N6M1O6K1R8M1J37N5P6jJ08j6J26L9Q5K3J34j5J00L7C598
211388C666K03P9J63j35j1r2J20j18J54o2Q9K8J81J4K22pK03k4K43L4J62k1J26E170
212125E357L4K51j3J21j23L3r7R4l2K42M9L25K8L16P3L03R0K99K4L71qL73M6M42H694
$$ plain form
205584 -151 -99 -125 -65 -107 -123 -109 -104 -148 -124 -104 -78 -115 -102 -133 -52 -125 -81 -151 -86 -124 -56 -96 -90 -102 -64 -69 -91 -77 -41 -58 -27
206527 -66 -29 -88 -63 -70 -55 -54 -75 -78 -106 -61 -55 -82 -17 -63 -39 -92 -37 -73 -19 -38 -65 -60 -39 -52 -26 -54 -33 -30 21 -5 11 6 36 -4
207558 44 6 49 47 24 82 38 59 53 37 39 71 53 64 84 58 94 96 80 98 135 101 145 152 135 159 175 179 183 187 217 217 209 188 170 201
208619 220 220 226 254 262 226 285 269 322 305 305 318 331 397 345 374 384 421 399 432 446 478 473 489 499 537 511 545 603 630 612 573 625
209591 646 666 713 717 733 746 808 784 814 818 868 884 925 964 1002 1066 1073 1055 1152 1181 1269 1342 1394 1457 1584 1646 1777 1798 1820 1814 1858 1857
210534 1956 1965 2025 2045 2128 2113 2176 2215 2271 2312 2378 2399 2497 2538 2675 2730 2806 2805 2913 2897 3023 3062 3147 3170 3304 3289 3389 3426 3598
211388 3666 3869 3948 4111 3976 3965 3873 3993 3875 4029 3967 4056 4084 4265 4279 4501 4494 4697 4673 4916 4950 5112 5091 5217 5170
212125 5357 5391 5642 5629 5750 5627 5660 5563 5657 5625 5867 5916 6241 6269 6585 6658 6961 7051 7350 7374 7745 7737 8110 8156 8598 8694
212891I081J08L94J12M71J25M61R7N43J92O26K51O85K44P37K73P63L61P94K85A7433
213510A7872J057O97J132N51J180P13J256P52J455J012J727J120J952J404K104C7546
214011D0038J985L081K527L781L344M730L627M444K964N296P225J2825J7602K2711A56969
214482A82954K8198L1570L1739L5368L2363L0215L4064M1245M2811N1674N3305F68105
214865G68395J44742Q6445r807j47784k04542j37350j06223p5867n5023l2033B04630
215218A86820j7220j1407j1453p517q281o094p667n889o734l976n183m477o342H0429
215660G5501l756m164k963l715l021l939k509l193k013k959k239k723j824k336C2544
216132C0323j378j858j221j637j013j464q44j434q93j242o94j196p08j058n70A2173
$$ plain form
212891 9081 9189 9583 9695 10166 10291 10752 10849 11392 11584 12210 12461 13146 13390 14127 14400 15163 15524 16318 16603 17433
213510 17872 18929 19626 20758 21309 22489 23202 24458 25210 26665 27677 29404 30524 32476 33880 35984 37546
214011 40038 42023 45104 47631 51412 54756 59486 63113 67557 70521 75817 83042 95867 113469 136180 156969
214482 182954 211152 242722 274461 309829 342192 372407 406471 447716 490527 542201 595506 668105
214865 768395 913137 999582 989775 841991 637449 500099 393876 318009 262986 230953 204630
215218 186820 169600 158193 146740 139223 130942 124848 117181 111292 104558 100582 95399 90922 84580 80429
215660 75501 71745 67581 64618 60903 57882 53943 51434 48241 46228 43269 41030 38307 36483 34147 32544
216132 30323 28945 27087 25866 24229 23216 21752 20908 19474 18581 17339 16645 15449 14741 13683 13113 12173
216633A1716q36l95p94k98o85k73o65j51n36k02n65j58m48q8m17Qm17j5l46ql14D114
217310C775L4k98J9k25J7k90l2l39j17l48p7k25J8j38J22j57O9j49N5j40J05j42A641
218017A554M7j37J47j52P5j49M5j84M7r9O8j35K9r5Q4j23P3j11Q8j32P0j52R7H69
218754I51j02O4q9P2r4Q1o7P4j09O8q6O5o8L9k6M8n2K4q6O7o0N6o8P0o9P8n0Q9H11
219638H80p8P7o5j1o9N3n7K0m7J8n5O5r5J3lJ0n8L1l6L9o3O5r2Q6o1N2q1N0m0F25
220551E50L1n8L1l5J7m2J9k7M4p8P6p3M8m6L4j8RL0m9J1Ml0Nl2kK8m8pJ2j2k5C80
221523C88j6K3%J6pKJ6j8J1Qn7j0L0lk0qj4K6rJ3jj9Pj4J0J6j9l9J9J6l2L8k2C40
222555C31jK9m8J7J7K9m3QJ0%mm7J0K3j0%l0J6lrK0k0l2QoK4j1j1oJ2JJ2l8N0B77
$$ plain form
216633 11716 10880 10485 9691 9393 8708 8435 7770 7619 7083 6881 6316 6158 5710 5622 5205 5213 4796 4781 4435 4427 4113 4114
217310 3775 3809 3511 3530 3305 3322 3032 3000 2661 2544 2196 2119 1894 1912 1774 1896 1739 1808 1659 1714 1574 1679 1537 1641
218017 1554 1601 1464 1611 1459 1534 1385 1430 1246 1293 1194 1262 1127 1156 1061 1145 1022 1095 984 1072 940 1010 858 955 869
218754 951 849 913 824 896 802 883 816 890 781 849 763 828 760 799 773 821 769 793 707 774 714 770 702 772 703 781 731 820 811
219638 880 802 879 814 803 734 787 730 750 703 721 666 731 636 649 646 656 598 629 593 632 569 634 542 628 567 619 538 588 548 625
220551 550 581 523 554 519 536 494 513 486 530 452 528 455 503 457 491 473 482 512 463 474 478 448 453 421 419 447 399 392 404 392 367 380
221523 388 372 395 395 411 404 406 422 404 415 423 366 356 386 383 363 355 341 367 358 371 370 351 358 344 354 370 351 312 331 347 315 353 331 340
222555 331 330 359 311 328 345 374 331 339 349 349 345 298 308 331 321 321 291 307 304 295 315 295 263 271 265 289 278 267 261 273 274 286 248 298 277
223615B38K3K8l2l1J4J3m2O1n7K4k4L1j2mkK5Qj2k0j7jJ3oJ9j9K4kKk7J4j2J0B03
224617B48m2K8rK3l0J0N5l7l4L8k1L8p5M7l2L7k5J5m0RM2Pl7K6l5K5j3L2nJ7m8B70
225589B10N2l8J1jM9j2J3Rj4KM9n7K7J3N0k4L2j3N3j8N0LLK3M7M0J19L5J31J08A138
226532A244J80J71K12J15K23K10K53K73L85M42P17J005R26J25j009j423r48p10A951
227121A596j57k21n6j45j6r9oj03J4m5mj26P0j36L8q2Lk1j6o8K4o7K0j9k4Rm8B96
227976C01o6N1k7om2K0l0K6k0K5m1K5p3N4p6Q2q4L7Nk3J4po2O5n0L4j3K9j4m9I4
228919A28o0N5l2JPJ6n1M9n2L1l9N8n1N4o2L9j9mk0N6q2P5l7M7l2l5K9JMk2L0F0
229891C4L8k6L3k8M0p4O8l2M4p7K1LkJ3l9J1M3j1M6o7M7Kl3j6j6K7ok6K3j0L6C1
$$ plain form
223615 238 261 289 257 226 240 253 211 272 215 239 215 246 234 230 228 253 261 249 229 212 211 224 218 237 218 242 240 242 215 229 217 227 203
224617 248 206 234 225 248 218 228 283 246 212 250 229 267 192 239 207 244 219 234 194 203 245 252 215 241 206 231 218 250 245 262 214 270
225589 210 262 224 235 234 283 271 284 293 279 281 330 273 300 313 363 339 371 358 411 393 443 446 449 472 519 559 678 713 844 952 1138
226532 1244 1424 1595 1807 1922 2145 2355 2608 2881 3266 3708 4425 5430 6356 6481 5472 4049 3101 2391 1951
227121 1596 1439 1218 1162 1017 1001 902 896 793 807 762 758 632 702 566 604 522 525 504 488 420 444 377 397 378 354 363 315 296
227976 301 235 286 259 253 211 231 201 227 207 232 191 216 143 197 121 203 119 156 161 138 152 145 83 148 98 132 119 148 134 85 94
228919 128 68 123 91 92 99 115 64 113 61 92 53 111 60 114 52 91 72 68 48 104 22 97 60 107 75 40 69 70 74 52 82 60
229891 34 72 46 79 51 91 17 85 53 97 20 41 44 42 55 16 27 70 59 105 38 85 87 54 38 22 49 43 17 40 30 66 31
230863E6m9P2m5K0QJk0J2l5L7k0krKpK8m3Q2o0J0n0M8j9K3l2N0l7MkK0j7O%k2H
231924B0L7m2k7O2l6JKL5l1rON2l1Ro6M2m0L4j2M1l5M1m2PRJj5lOM6n7L1k7j9B9
232984EmM8o9L5l7M1K1m8L9k8L9k4kPKj7k3M7j0k1oK9l3L0k9K2KqOmNMoK2k8J2B9
234104A8jj7qJ5K3n3M8j6pRj5qK6j8K6Mo0j7N3km2N2o8O6j6%kj1pK9K0l9J4J6b4
235165aj2nj8M0k0M5l4N0k7rj6L8m9L8K0m4k0Rk7%L4j8K3K0j2j4j1j7L1l4N2l8c5
236166hk1k4L4mJ5j7jK7%pkk6J4j5L1J5j0%Mj1pkK1K1j9k2Mj5L2k4K0l2K4m5N7c4
237256a8Jk0M4j6n1J2L1L5m0%K4j5k5N2k6J8l2K7%k5j5J2J7nKQl5L5o%LqNk5J9f
238347d9K3nJ6j1J7k6k5QJ0oL0Lj2J2j8J9kj6L0n3N9j1l0K8j0j2l4K2j7M8k3Kb6
$$ plain form
230863 56 7 79 34 54 62 63 43 55 20 57 37 35 26 28 21 49 6 88 28 38 -12 36 17 40 8 58 21 25 23 43 26 32 32 10 8
231924 20 57 15 -12 50 14 15 17 52 21 12 18 70 39 48 -18 24 -16 18 6 47 12 53 11 18 27 28 13 10 16 62 5 36 9 -10 29
232984 5 1 49 -20 15 -22 19 40 -8 31 3 42 18 16 23 25 8 -15 32 22 1 -5 24 -9 21 -8 14 16 8 14 10 15 19 13 35 7 19 29
234104 18 17 0 -8 7 30 -23 25 9 2 11 -4 -12 14 -4 22 26 -34 -51 2 0 -42 10 -58 8 -8 -8 -10 -21 -28 1 21 -18 -4 12 -24
235165 -1 -13 -18 -36 4 -16 29 -5 45 18 9 -7 31 -18 20 40 -4 -24 -15 -42 -42 -8 -26 -3 17 5 -9 -20 -37 -6 -40 12 -26 -35
236166 -8 -29 -53 -19 -23 -8 -25 -26 1 1 -6 -8 -34 -20 -35 -4 11 1 1 5 -6 -13 -15 6 27 8 -14 -10 -25 7 -17 3 -29 -5 -50 7 -34
237256 -18 -17 -37 7 -9 -60 -48 -17 18 -22 -22 2 -13 -38 14 -12 6 -26 1 1 -24 -39 -27 -10 -15 -13 -5 -40 -5 -11 -11 -8 -16 -11 -36 -17 -6
238347 -49 -26 -31 -15 -26 -9 -35 -60 -52 -42 -48 -18 -15 -27 -15 -33 -14 -16 -32 -2 -55 4 -7 -37 -9 -19 -31 -65 -43 -60 -12 -35 -33 -26
239348e6L9J4j9Rj6k5L0l1J7M5l8J4j3L0Jl9Kj8L8k5K4k3L5l9L3J4n0KnK5J1k0d2
240350b2k%MQrj3J2k6K0Rk8QJ4pQm7M4k9J5l0L2l6N3k7OJNkkK4j8l6M7o1M2j0e1
241470e6O2m9jl5M5oj0KJ6k8K8mKK8j3nOj9J5l9j0J8LJj4nk1L9K2k2K8rj1j7J0c9
242560b3l4L9k8j1K8ok1J3j4M6l4Rl2J4k2M1m0K0j2Lk0J8Qj1j8N6m0J6k7QpROg4
243591e8j0j4M8l9J1J5j6j9K9k8K9mj4j4L1OPm2L3j9J2LrL5nl4K2n0K6j8J5k5e9
244593e9j5L4j3J5j3k0L7k5J5K3k1k3%%L7o2N9m5M7n5L1l2L6j7K3j6K1j5knJ9f0
245565e5Qj7KJ6J2l9mJ4Oj0J6rlJpL8l3OPl1K4NpQk0J5qK9l6M8j5M0m4PJ9l3j0d8
246714b5L4m6K8k8K8n5M5j0k8K9j3rk1J6l2K4J9k5j3lK0oL8j7npJ8l4plM9j6l7i2
$$ plain form
239348 -56 -17 -3 -22 -13 -29 -54 -24 -55 -38 7 -31 -17 -30 0 1 -38 -36 -54 -16 -41 -17 -40 -5 -44 -11 3 -47 -45 -50 -25 -14 -34 -42
240350 -22 -24 -24 -20 -12 -21 -34 -22 -48 -28 -19 -47 -39 -25 -32 -24 -71 -27 -56 -41 -71 -39 -75 -22 -49 -43 -42 -37 -39 -41 -17 -35 -71 -24 -85 -43 -53 -51
241470 -56 6 -43 -44 -79 -34 -40 -50 -48 -32 -60 -32 -36 -34 -6 -19 -24 -18 -37 -22 -61 -71 -53 -50 -49 -63 -68 -89 -50 -28 -50 -22 -31 -42 -59 -49 -39
242560 -23 -57 -18 -46 -57 -29 -35 -56 -43 -57 -11 -45 -36 -68 -54 -76 -35 -75 -55 -67 -64 -84 -66 -58 -69 -87 -31 -71 -55 -82 -74 -81 -72 -66 -74
243591 -58 -68 -82 -34 -73 -62 -47 -63 -82 -53 -81 -52 -56 -70 -84 -53 -47 -40 -82 -49 -68 -56 -53 -62 -27 -32 -66 -44 -94 -68 -86 -71 -96 -59
244593 -59 -74 -40 -53 -38 -51 -71 -34 -59 -44 -21 -42 -65 -65 -65 -28 -90 -31 -76 -29 -84 -53 -85 -49 -66 -43 -59 -38 -53 -55 -60 -41 -60
245565 -55 -47 -64 -62 -46 -34 -73 -77 -63 -57 -67 -51 -60 -63 -62 -69 -31 -64 -58 -51 -82 -58 -53 -60 -52 -72 -57 -65 -36 -72 -24 -39 1 -43 -36 -17 -50 -60 -48
246714 -25 9 -37 -9 -37 -9 -64 -19 -29 -57 -28 -41 -50 -71 -55 -87 -63 -44 -69 -82 -85 -65 -71 -33 -50 -55 -62 -44 -78 -85 -88 -39 -55 -92 -92
247745f9N4j7Jj8PJ6ll3J5Ol6M1K6M5m5k5J2J6J0o1J7j0j9J4k2Rj7M7k6k3N8Og6
248747g5rM4mmj6j6L4qooNj7L0pk9K9L2%o5O3n7J8K7j7oRLRj9kK2k8J5rJ0rJPg7
249925h6kQL0%k2kL1k3PJ8j4m2L2rK1%rk0J4J8j8J6l5L9j7m9N2m5K9L6J7m3JJ2g9
250986h3j9M8Pm7J9J7k3K2l5J5J7o8O6K1k9jk6PpK7Lk2M3Lm3L9Joj1l7N9j7j0e7
252017g6J8k9N8m6j1M0k9k1N2k9J2L2l9l6K0K5l1K6MJ9l5L1k5k6Lj0N1l0Mj8M2c4
252989g1j5jJ8oj5L1j3l5N5k1L8o4L5j7%K6nj0K8k4k1k0K5JK1k2L1l4RJ2j9LMg6
254021f8Mj8MJk6jJ9j8ONJ8k9M2J4m9J2J3l1L7j3j4L9q1P0l3lQL6ml5L5jl1L8h0
255081i3LM6k6m5J3JJ4NLK4n6L3LQj9qoL7k8Oj2M4j2K1o2K3K6Ml6M4o6N3j3Mk3c2
$$ plain form
247745 -69 -15 -32 -31 -49 -42 -26 -29 -62 -47 -41 -77 -36 -10 35 -10 -35 -23 -7 3 -58 -41 -51 -70 -56 -78 -69 -86 -39 -65 -88 -30 -24 -76
248747 -75 -84 -40 -44 -48 -64 -80 -46 -54 -60 -66 -61 -78 -48 -55 -84 -55 -23 -23 -88 -25 -82 -64 -37 -54 -60 -51 -48 -39 -58 -60 -38 -66 -51 -60 -50 -59 -58 -51 -77
249925 -86 -88 -80 -50 -50 -72 -74 -43 -66 -59 -41 -55 -97 -65 -74 -53 -53 -62 -82 -68 -50 -68 -52 -87 -48 -65 -114 -62 -107 -78 -42 -25 -68 -67 -55 -79
250986 -83 -102 -54 -47 -94 -75 -58 -81 -59 -94 -79 -62 -130 -64 -43 -72 -73 -99 -92 -99 -72 -69 -91 -48 -45 -88 -49 -48 -54 -65 -102 -43 -60 -70 -57
252017 -76 -58 -87 -29 -75 -86 -46 -75 -96 -44 -73 -61 -29 -68 -104 -84 -59 -90 -64 -60 -41 -76 -45 -70 -96 -93 -103 -52 -82 -78 -96 -54 -34
252989 -71 -86 -87 -69 -75 -90 -59 -72 -107 -52 -73 -35 -99 -64 -81 -81 -55 -60 -70 -42 -66 -87 -107 -82 -81 -60 -82 -51 -85 -76 -64 -83 -80 -76 -76
254021 -68 -64 -82 -78 -77 -103 -104 -85 -103 -97 -92 -74 -103 -61 -47 -96 -84 -71 -102 -65 -78 -92 -53 -134 -64 -97 -100 -92 -56 -60 -95 -60 -61 -92 -54 -80
255081 -93 -90 -44 -70 -115 -102 -101 -87 -82 -79 -55 -111 -78 -75 -67 -86 -94 -100 -63 -91 -85 -97 -53 -65 -44 -106 -83 -57 -53 -89 -45 -111 -58 -71 -67 -90 -32
256171i7K6m7N0k0%L9k0LKm3K9J4n1L0kJ6j4j2K1lK0j8J7nnmRj5k7M0l3%OL6m1a13
257261h9K3rJj0OMk8K8m3N3m6O1n6N0l1L6l8J7m0K8l7L4j3K5qKj1K2j8mj2M5k6e8
258293e2k4K1m7J1kpJ2OKj2K9j4rK5j9j6JKKoJ6L3j5K7m9k5nP1J4k8m3j0J2Kk1f7
259383d5l7K0k1k0J9Kk5L0K9m0PJ2j7l4K5L7o0K7M8o5JJ1%M2m8KJ4l4K9QJ8l6h2
260385h3k6L5j1rkK1j4NrK%N4o3K0j1kL7k8j6qJ7OKLJ7j2j8L0k8%j0K0nK7l2L0h2
261504a07L7JNJ0NQk8L1J5k5K6l6rK2J0j8k9K3l8J9MNj3K2l4kK0j9NM5m7K4k8g6
262535f5K1k4l0K0nk2J7K9k5NQk8L6Pk1jK7j5k7K0K8n0mjK9k9ML7k1qJ5k7M4j5h5
263596e8l1PJ5m5L2l1L3nJ9Ok5l2L6k6K6j5NRl9J4K8n3kM5J2l1K8k8K5j7J0l8g5
$$ plain form
256171 -97 -71 -118 -68 -88 -88 -49 -69 -66 -64 -107 -78 -64 -115 -85 -87 -71 -85 -97 -76 -79 -59 -77 -60 -65 -70 -74 -65 -80 -107 -67 -100 -100 -94 -58 -99 -113
257261 -89 -66 -75 -74 -84 -78 -74 -102 -74 -117 -64 -110 -49 -105 -55 -86 -50 -88 -71 -111 -83 -120 -86 -99 -74 -82 -80 -91 -69 -87 -91 -103 -58 -84 -58
258293 -52 -76 -55 -102 -91 -93 -100 -88 -82 -80 -92 -63 -77 -86 -61 -80 -96 -95 -93 -91 -97 -81 -48 -63 -36 -85 -110 -115 -44 -30 -58 -101 -111 -99 -97 -118 -67
259383 -45 -82 -62 -83 -103 -84 -82 -107 -77 -48 -88 -81 -69 -86 -120 -95 -58 -118 -91 -43 -108 -107 -96 -96 -54 -102 -100 -86 -120 -91 -83 -65 -101 -82
260385 -83 -109 -74 -85 -94 -96 -75 -89 -84 -93 -91 -91 -37 -100 -80 -91 -93 -56 -84 -100 -108 -91 -85 -83 -80 -63 -75 -93 -63 -91 -91 -101 -81 -86 -59 -91 -61 -82
261504 -107 -70 -69 -64 -54 -49 -41 -69 -38 -23 -48 -22 -58 -67 -45 -35 -53 -82 -59 -97 -78 -74 -69 -82 -60 -94 -96 -76 -95 -90 -45 -92 -68 -96 -76
262535 -65 -44 -68 -98 -78 -83 -105 -88 -59 -84 -79 -71 -99 -63 -56 -77 -78 -51 -66 -93 -73 -45 -95 -99 -100 -71 -100 -96 -59 -80 -88 -73 -100 -56 -71 -85
263596 -58 -89 -82 -67 -112 -80 -111 -78 -83 -64 -58 -83 -115 -79 -105 -79 -94 -89 -80 -119 -105 -77 -130 -132 -87 -75 -106 -78 -106 -81 -98 -88 -126 -75
264598h5Qj0j0j0Q%k6K3k8QOL4J2jQm5K6nj8L0j2mqQRL5nk2l0pJ0J9m5N8nmm8h2
265747a00Qm3O5qJ2oLp4O8k0j1J6j6N2m0M1l0k9J5M4j1l5KJ8%kJ2j9qmK1l6N4g2
266778g7m3J2L3k9J3PqpLJmJ1Jj7j1M9j2m0K7pmJ6rNk3J8K1j8jOj0k3PK6K7nl5e9
267927d9o4L0kl9L4j0M7m6J6jj3J4m4L9k4N0lk3kmK5j4NKrk0M1o3N9j8j7kJ5%e5
268988h6j5JJ7KK1n7L0j1PoMl3O7k8j5K2Nj4K3m8K1j9j4M6Lj3%k8J8L0k2Oj0J7g8
270048h0l7M5rj5j0K8l9K0J4Mkrl2L9K7n2O1o0M9l4J0kJ2kJ2o9K4K4nkLQ%Ql7a10
271138e4j6Kk2K7n9L1%K5mk7rL0j2j6K7K3n7L9k1J9jL1Lk3k5Pk0PJ6M2n4j0J7a12
272169b1q0K1J9pL5l5K4m0J5M2k7nJ5J0l9OLK3oj1K4l3J8j8L4MJ2lPl6Lj1J6J3d0
$$ plain form
264598 -85 -77 -87 -97 -107 -99 -99 -125 -102 -130 -122 -116 -82 -70 -71 -63 -108 -82 -87 -105 -75 -87 -91 -99 -91 -82 -47 -52 -74 -104 -111 -101 -82 -127 -69 -74 -78 -126 -82
265747 -100 -92 -135 -70 -78 -66 -72 -69 -143 -75 -95 -106 -90 -106 -54 -94 -53 -83 -112 -97 -53 -64 -99 -97 -79 -79 -81 -69 -88 -96 -100 -79 -115 -61 -72
266778 -77 -120 -108 -75 -104 -91 -84 -92 -99 -96 -95 -99 -88 -87 -104 -115 -66 -78 -118 -91 -98 -102 -86 -95 -90 -113 -95 -74 -92 -93 -87 -97 -120 -113 -87 -60 -65 -100 -59
267927 -49 -113 -83 -85 -124 -90 -100 -53 -99 -83 -84 -97 -83 -127 -88 -112 -62 -65 -88 -90 -94 -69 -83 -78 -76 -85 -105 -64 -127 -68 -86 -103 -105 -90 -90 -55
268988 -86 -101 -100 -83 -81 -60 -117 -87 -98 -91 -97 -93 -126 -59 -87 -102 -80 -75 -89 -66 -114 -93 -112 -126 -80 -77 -90 -90 -118 -100 -70 -92 -86 -96 -79 -78
270048 -80 -117 -72 -81 -96 -106 -78 -117 -97 -83 -79 -81 -90 -122 -83 -56 -108 -47 -107 -58 -92 -82 -84 -72 -74 -62 -131 -107 -83 -88 -90 -87 -79 -79 -71 -108 -110
271138 -54 -70 -68 -90 -63 -122 -91 -91 -66 -70 -97 -106 -76 -88 -104 -77 -54 -111 -72 -93 -74 -75 -44 -41 -64 -89 -82 -102 -95 -79 -37 -91 -101 -84 -112
272169 -21 -101 -80 -61 -68 -33 -68 -44 -84 -69 -27 -54 -59 -44 -34 -73 -67 -64 -41 -47 -58 -34 -67 -49 -67 -33 -29 -17 -20 -13 -49 -46 -57 -41 -28 -40
273230f2K5KpNqoNL0j5PJ7l9L9k7J1J5l0l6O4m0L6k9k5K8k9M5K1Jql8L3k9K2j6B
274291c9pK0J6qk8JK4MpKQmJ0nm6M5jL2m9jN2n1J4j6K7j2J8l3J0k1L6Ok8NK3k8d7
275410c5N0o8N8m3J0Rm1L3k2J1jqL2Om0K7k7j9J7J0M3l0mk0K6k0nPkJ5qJ4j6k4d6
276471b6K9rl5PJ3j1J2k5J0RK0j2MPl5LrMl1J7L1ojQmQM6m7K5l3K0nj2J5mk6J4b7
277620c8RJ5l7M0Pl2K5mk2L8j8k1L1k6NL5p0M6MpJ8l9K5k8QJ2Klpj8J7J4m1K6b3
278681e8K4Mj0J1k6J6J2j2K4J4j6n1M6L8l6j5K5j2J1l0LNJo7P0j3J2j7QJ4ok6d7
279682gl9PKnJ2k8K7k2J0oJ9k5Pj8L4m5K6l7J2L3j0J5m4jL0Rm7K0L6m1rK8rQk6i2
280773h4J8Pk8K8j2K8J0j1l6J2J3l3qL9k9J1PJ1m0J2J0kJ9k0J8k7nJ6k0L6k7J7h5
$$ plain form
273230 -62 -37 -35 -42 -37 -45 -51 -46 -16 -31 -24 -7 -46 -7 -34 -23 -8 -38 -74 -10 -50 -14 -43 -68 -40 -69 -24 -3 -2 -10 -48 -15 -44 -22 -38 2
274291 -39 -46 -26 -10 -18 -46 -45 -21 -17 -24 -22 -14 -18 -8 -13 -59 -14 -15 17 -32 -33 19 -32 -18 -34 -7 -19 -1 -34 -24 -45 -9 -3 -31 -26 -3 -31 -47
275410 -35 15 -53 5 -38 -28 -19 -60 -27 -49 -38 -39 -47 -15 -9 -49 -22 -49 -68 -51 -41 2 -28 -32 -52 -26 -46 -51 -44 -46 -31 -39 -25 -41 -65 -46
276471 -26 3 -6 -41 -34 -21 -32 -20 -45 -35 -26 -6 -18 -14 -7 -42 -39 -48 -44 -75 -58 -27 -33 -34 -26 -30 -22 24 -23 2 -31 -11 -16 -28 -13 -17 -43 -29 -27
277620 -38 -29 -14 -51 -11 -4 -36 -11 -15 -37 1 -17 -38 -7 -33 -28 7 -63 -17 -13 -20 -2 -41 -16 -44 -36 -24 -22 -25 -32 -50 -33 -19 -60 -34 -23
278681 -58 -34 -30 -40 -29 -55 -39 -27 -39 -15 -1 -17 -68 -22 16 -20 -35 -10 -22 -11 -41 -38 -33 -32 -99 -29 -42 -30 -47 -39 -25 -31 -57 -47
279682 -7 -46 -39 -37 -42 -30 -58 -31 -53 -43 -49 -30 -55 -48 -66 -32 -77 -51 -88 -76 -43 -53 -38 -82 -83 -53 -44 -91 -71 -35 -76 -85 -57 -66 -58 -84 -92
280773 -84 -66 -59 -87 -59 -71 -43 -33 -44 -80 -68 -55 -88 -96 -57 -86 -75 -68 -57 -97 -85 -75 -77 -58 -78 -60 -87 -92 -76 -96 -60 -87 -70 -85
281774a29N7l3J8mJ9Jl3L8k1Jk8K2K0qrj5J9PQk7J1K5k6K1n9P5l8j2QNMkj4K0f0
282835h4K6J0l9J8j7K7j3knj0k1L6k2J5j8k1KK0%Rj4L9k5k1m0O1l1RK7K3j5l0i3
283837a12L3Rk9Jk5L3j4J0ppk0L6qRJ0jk8L8%m5J8JM0k3Oo3P3jj3k8rOML6K7m2h9
284956f8pLj2Qj4l6N2k5j8nN3j8j6Nj4M8o4M5k0J6j9RQj1L6rl1QJ3j0j3L0k4L5a01
286017g1l4kj6K5k2L7l3K5m8Q0j2m0JL4J9j2mlk8K6m2LK3j1K3j1l3L6Rk0%LK9h8
287048f1l6ONm4N5l3Nlj9M0M0q2M2pml0N8j8KJ4m3L6k4oLj2J4L0Rn0L7mM1m8Oa19
288138h6j5J4nl0N2pj0J1j8J2K2k3m7L4J7m8L6J0j0K2m6J8MoPk3mL6nJ5m8L4li2
289169g7J0k9QOk1L5l1Rjk4LK9pknK9o2L9kJ3k1K7l2K0pj7K5k8K5m2J0PL1m7k7a11
$$ plain form
281774 -129 -72 -105 -87 -91 -72 -71 -104 -66 -87 -86 -114 -92 -72 -80 -89 -104 -85 -78 -70 -97 -86 -61 -87 -66 -125 -50 -88 -100 -92 -87 -83 -85 -99 -79 -60
282835 -84 -58 -48 -87 -69 -86 -59 -72 -74 -79 -89 -110 -74 -96 -81 -99 -120 -118 -98 -98 -89 -103 -64 -89 -110 -150 -89 -120 -111 -84 -61 -76 -106 -93
283837 -112 -79 -70 -99 -98 -123 -90 -104 -94 -101 -108 -128 -92 -100 -91 -81 -82 -110 -72 -72 -117 -99 -98 -58 -81 -75 -138 -65 -66 -79 -107 -116 -110 -106 -70 -43 -85 -89
284956 -68 -75 -72 -84 -76 -90 -126 -74 -99 -117 -122 -69 -87 -103 -98 -112 -64 -128 -83 -103 -87 -106 -97 -89 -100 -64 -73 -104 -96 -83 -93 -106 -76 -100 -65 -101
286017 -71 -105 -107 -123 -98 -120 -83 -116 -91 -139 -59 -71 -111 -110 -76 -57 -69 -73 -76 -104 -78 -120 -117 -94 -105 -82 -93 -126 -90 -81 -101 -101 -98 -69 -88
287048 -61 -97 -91 -86 -130 -75 -108 -103 -106 -125 -85 -45 -127 -85 -92 -96 -126 -68 -86 -84 -70 -113 -77 -101 -107 -104 -116 -102 -72 -63 -113 -76 -80 -39 -87 -81 -119
288138 -86 -101 -87 -92 -122 -70 -77 -87 -76 -94 -82 -60 -83 -130 -96 -79 -127 -91 -81 -91 -69 -115 -97 -93 -99 -92 -115 -119 -83 -88 -73 -121 -87 -90 -92
289169 -77 -67 -96 -88 -82 -103 -68 -99 -90 -91 -115 -112 -83 -90 -92 -97 -68 -130 -91 -93 -80 -101 -74 -106 -86 -93 -110 -85 -113 -88 -130 -120 -113 -82 -129 -156 -111
290259g7l3Qo%N2l8k9j3L1J1Jj8RjNk5K0K4oPk8K5nk6K6LOmJ3J0m0Jj3LPKL1l2g0
291438f7j3J0l8MK0j4Qj7J9Jkj7j1L1k2j5K9L0m2K8j7k0J9l0J6L6ll6J0k5K2Ja11
292440a17qL4Kmj0L0j9K0m5M6j6j8J2l3L2l2K8K8m0K6Lj4k4J8LL3j6Jj9l3L0na14
293441i8J1lK1l2rl1M3j6J7noJ5rJ8RKk4OM0p1O3l7K0n3M9l2J2J9oj1K1rL2m1a02
294502a05j7L9K2k4K1m2j5NK0JL5m5rN8m7K9nP%l0K5j2j5J1lJ2rK3j5Oj8Kk7K9h0
295563i7J2j8rL2J6m1M3n4jJ3KqjlNj2M2j9J1Pj0kOQMk0QJ1j5j3%j0K1k3J1J7g9
296682g9Jk1Mk3N1m0N0l0J8j3k3J3J0Pk6jNJ8k6QJ3M0o3j2O2j6kJ0k4J1PlMj3d0
297743g8J8oRk0N7J5k2l2j9k6M8JJ0o2J3KO5j1l4J9j3NMK8l1m7M2j6M4k5k9L1h7
$$ plain form
290259 -77 -110 -102 -108 -108 -56 -94 -123 -136 -105 -94 -93 -111 -102 -103 -98 -123 -103 -79 -85 -78 -106 -81 -86 -112 -86 -83 -77 -81 -68 -58 -98 -97 -110 -107 -100 -98 -67 -99 -70
291438 -67 -80 -70 -108 -104 -84 -98 -90 -107 -88 -87 -89 -106 -117 -86 -108 -123 -94 -64 -106 -78 -95 -115 -96 -126 -110 -74 -77 -113 -103 -128 -106 -105 -111
292440 -117 -125 -91 -89 -93 -103 -73 -92 -72 -117 -71 -87 -105 -93 -126 -94 -126 -98 -70 -110 -84 -81 -95 -119 -101 -98 -65 -81 -80 -99 -132 -102 -107 -114
293441 -98 -87 -90 -69 -101 -110 -141 -98 -114 -97 -102 -108 -93 -102 -84 -75 -73 -97 -91 -51 -122 -59 -96 -76 -129 -80 -112 -100 -81 -87 -98 -77 -86 -54 -95 -102
294502 -105 -122 -83 -61 -85 -64 -106 -121 -116 -96 -95 -60 -105 -114 -56 -103 -74 -79 -72 -72 -102 -77 -89 -104 -93 -96 -84 -93 -70 -85 -79 -97 -95 -122 -93 -80
295563 -97 -85 -103 -112 -80 -64 -105 -62 -116 -117 -104 -102 -110 -111 -114 -109 -121 -79 -98 -87 -80 -90 -92 -86 -78 -74 -94 -86 -75 -90 -103 -103 -113 -92 -115 -104 -87 -79
296682 -79 -78 -99 -95 -118 -67 -107 -57 -87 -69 -82 -105 -92 -82 -75 -101 -102 -97 -79 -105 -97 -84 -44 -107 -119 -57 -73 -75 -65 -89 -78 -71 -74 -70 -83 -40
297743 -78 -60 -66 -57 -77 -20 -5 -27 -59 -78 -104 -56 -55 -45 -107 -94 -92 -27 -38 -72 -53 -66 -61 -57 -29 -60 -107 -65 -81 -37 -62 -91 -60 -87
298745c6rjm5L6j2j6J9j0K5n5J6jKKl4M6%lOk1J6rk2L0j8k7K7K0l3rJ0L5mo3K5h0
299835g7j4LJ3j9K4l4M1n8O4m2J9k0Ql1M8l5J6rj4M0n4M6ppJ1J9l4J9j7QK1rrf7
300866i0PpJ3l7JM9j7Nk9k6M8j6K9o0K3j0J3O3m4k3rJ0rML1Mk0J8j9nJ5nRl4N4h9
301956g0k7K8J8l5J9Kk6pL4Lj5j6M9j4rk6lO3l9L2m6J0j9L8k9J4J9l8J4L4j4j7g7
302958f1l4M1l2N2jo0K1L6n1O4no1N2m3J2L2o2L0%NkJ3Kj7J1K3k2KMj4K2j1j6g1
303989f1k3J3QmJ4kj9M0j7k2M3l0J8k9N2j8m4K3J5K2Rl1n4M1l1K4K1L0k4k3K4f1
304961g2N7k4j5kK6MJ2m5QK1j2J8KJ1m3M6l3N1Nj3n0L8k3rj9L5JkpjRqM0m6pje3
306081c4JJ5KJ1k0j2L3K0Nm3K4knj7JnKmj8K6J7l1K3Mj6nK7molKK1k2KK3K0n5c5
$$ plain form
298745 -36 -45 -46 -91 -55 -67 -83 -64 -74 -49 -104 -88 -89 -87 -85 -119 -73 -73 -76 -70 -91 -75 -84 -106 -76 -94 -121 -94 -74 -107 -116 -106 -71 -75 -138 -113 -80
299835 -77 -91 -88 -75 -94 -70 -104 -63 -121 -57 -99 -80 -100 -92 -123 -75 -110 -94 -103 -117 -77 -131 -85 -92 -99 -88 -69 -103 -84 -101 -93 -72 -81 -90 -67
300866 -90 -83 -90 -77 -114 -113 -64 -81 -76 -105 -131 -83 -99 -70 -130 -107 -117 -104 -41 -85 -108 -117 -107 -116 -112 -81 -77 -97 -79 -98 -103 -88 -93 -84 -118 -64 -89
301956 -70 -97 -69 -51 -86 -67 -65 -91 -98 -64 -61 -76 -92 -43 -57 -66 -92 -95 -32 -71 -39 -85 -75 -94 -56 -85 -71 -52 -90 -76 -42 -56 -73 -77
302958 -61 -95 -54 -86 -34 -35 -95 -74 -38 -89 -25 -30 -91 -39 -82 -70 -38 -100 -70 -70 -65 -67 -54 -52 -69 -58 -35 -57 -55 -51 -65 -43 -54 -70 -71
303989 -61 -84 -71 -63 -67 -53 -55 -74 -34 -51 -73 -30 -60 -42 -71 -19 -37 -81 -58 -43 -21 -12 -43 -97 -56 -87 -63 -42 -12 -36 -59 -35 -61
304961 -72 -15 -39 -54 -56 -30 -26 -14 -59 -51 -30 -42 -24 -22 -11 -54 -8 -41 10 15 2 -48 -10 -33 -42 -61 -26 -25 -27 -34 -35 -26 -34 6 -40 -47 -48 -53
306081 -34 -33 -18 -16 -5 -25 -37 -4 16 21 -22 2 0 -5 -22 -21 -26 -24 -28 -46 -20 -3 -34 -11 -7 -23 -28 -1 -5 -11 -14 -12 9 -13 -11 12 32 -23 -35
307230B9m4J0lKPj0J3ok7K8K4j9rL9p2O9Jj5l5N2pmj8J5LM6k3l0KLK5k0j3J5J2G4
308320C0NJ3rJ1k0oKqK3L1j8j1j7K4j6J9j4K2nl1K4nj5K8J6QKLkNJ4j1PJ8j1pA57
309440A08L3j6L8Nl7J5j5Jk3L9j1J2jON7J4m2J1J3K2jK9LK8jj1N7pM6l2P8L3O5E59
310471F16L6J40L1J07J17J02R6J73J68J99K32K69L96N31M54K44j97k42k8M2J95C963
311148D498Q04R08O49j72q77m72k49nJ54M55O96J226R59K39j244j356q06m87k41D661
311767D869N72O97L09m49j166p41n52l19k06j8R1K85J38o5n82n40l80l10j74j22A243
312415A115p8o9l6l3q3m5o4l2o6qj1l2p4m4n5J3j0j6l4jm6ql9K9n5j0m1PRj7k9A20
313387A49Lk0l4l4LL7l6j5jL4k4k4k0j8N3k1Nqj3PL2n6j7K6J5m6K3Kj5pJ9J6k7c8
$$ plain form
307230 29 -15 -5 -8 -6 1 -9 4 -2 -29 -1 23 4 -5 34 -38 31 32 17 -18 34 27 23 5 20 23 69 46 16 18 21 46 26 13 28 40 74
308320 30 35 48 39 50 30 24 26 18 41 72 54 43 26 50 34 53 39 61 56 25 49 44 29 57 73 81 83 86 84 89 103 92 99 117 106 99 157
309440 108 141 125 163 168 131 146 131 132 109 148 137 149 148 154 211 225 183 194 207 229 228 257 260 288 287 276 333 326 372 340 418 451 516 559
310471 616 652 792 823 930 1047 1149 1245 1418 1586 1785 2017 2286 2682 3213 3667 3911 3714 3472 3444 3486 3681 3963
311148 4498 5302 6210 6859 6687 5810 5338 5089 5084 5238 5693 6389 7615 8574 8813 7569 6213 5407 4920 4679 4661
311767 4869 5441 6138 6447 5998 4832 4091 3539 3220 3014 2996 3087 3372 3510 3445 2863 2323 1943 1633 1459 1337 1243
312415 1115 1037 968 932 899 816 771 707 675 609 601 590 558 484 440 385 398 388 372 338 337 291 283 244 273 218 208 167 174 183 166 137 120
313387 149 152 132 98 64 67 104 68 53 52 86 62 38 18 0 53 32 37 29 16 23 55 -1 -18 8 23 -23 0 2 -13 -20 -1 15 -12 -38
314419a3K2k0K8l6Jj3KK3Qk2L5l0KL4m5M9l3%J9J2o2M3oOJ5N9l0l3m5M2l7MO3C0
315450dPKJ7J6j7onL6m0J4kK0j4NK0j6N4n3KJ2NJ3lj6J0J2Rj8QNJ1j1L1oMmJ5A12
316599F8J6L1j8N9Lkk8nM6Nj3j5J1K2LRj7NKJ0J7lJ7l0N8k9OK6J6l1%mO4l4j5B39
317689B72J5j4J4K6%k8K3l2J8KJ5Pn4N4L1j6l4L2Rj0nJ4J2j2PMk3j8K3Mj2J2k0C36
318720C22L1jo6N6rk5L5p2O9oKk4J2l3K1Nk1L1k1Jj5j1j1J0Ol0L0M5mj7J1k5K1C60
319751C40K2p1K9KJ8J5n4J8L1m1j3M7m3L6j3k9K4n6M0K1l9RJ5rKl5L4l1M3m5J9B37
320724B62Jnj6k7%J9l3J0J2m6K9k0nJ6m2K9o5J6l1M0m6k7N0n3PJ6NJ0l0%m2J2E9
321725C5M4j6j6L0j7J2l3m5Q3k1l9kL0m5K0J6j6nJ1l9N8n8Q1l5m1pJ7oJ7j4oKh
$$ plain form
314419 -13 9 -11 17 -19 -18 -31 -29 -6 2 -20 15 -15 -13 21 -24 25 -8 -8 11 23 -39 4 -2 4 19 78 48 15 -30 12 -25 -21 42 30
315450 -4 3 5 22 38 21 15 10 46 6 20 18 38 24 29 49 33 87 34 36 48 53 66 63 47 57 69 78 60 68 73 84 73 104 98 102 98 113 112
316599 68 84 115 97 156 159 157 129 124 170 175 162 147 158 180 183 192 175 180 182 192 209 206 223 193 251 222 228 254 270 239 239 235 299 265 250 239
317689 272 287 273 287 313 313 285 308 276 294 296 311 318 264 318 349 333 299 331 340 330 325 339 351 339 346 350 327 309 332 336 324 336 316 336
318720 322 353 352 286 342 333 308 343 271 340 334 336 312 324 291 312 317 296 327 306 307 292 281 270 280 286 256 286 331 327 310 321 296 317 360
319751 340 362 291 320 322 340 355 301 319 350 309 296 343 300 336 323 294 318 262 302 323 284 293 308 299 301 266 300 269 312 267 286 237
320724 262 263 258 242 215 215 234 201 211 223 177 206 186 181 197 155 184 119 135 104 144 98 71 121 68 75 91 96 106 76 76 34 46 59
321725 35 79 63 47 77 60 72 39 -6 77 56 17 15 45 0 20 36 20 15 26 -13 45 -13 68 33 -8 -15 2 -4 13 -1 -7 -5 -8
322727B6k8o%j6K9loj9N0k2j2J6j0jKk0j2J4MNJj6M6m1M6m8K6J2m4M5j9L4l5mG
323788C6l9J4jL8m7k9K3PJ2j0qNOK5m7j8K4lM0%pk7K7J3m3LM9n0JL7j8qolK%jd
324937b9rM8mn7M9k1MLK3mk9pRK1m5K0J9J9m4J3K9k4J3J3k9K1k9J0K0k0j8K5j8G
325968a9j1K7NNm7J7j4L0J1q%k9j5K3J0L9l9J4j0L5l7jlK8Ok1L3p4K8Rk8qqM1A4
327029a9j4L4J6l8K1J0Mo2M4Ql8krM1J1l3J8JJ3OJ4j7l0L5Kk5J4k8K9l5M0l7J3A2
328060a1j2K7qJ6MjQK5k8k3J2J3%M4k9j0k0j0J7K4j0kl5L3pJ7j9L3k6l0j6N7l8A4
329091A7K6k6M8m5K0k5K1k6M9rm5M1o0J3PL7oJ5kl2J9JQn7O6k1mkJ4NJK3j7LL3E0
330181F0j3l5L7OK1Om6N7n2L4L4n9j1nL3L0l3J9L1k8k3L0Lm1L0k3pL8K1k0j2K2I3
$$ plain form
322727 26 -2 -8 -8 -24 5 2 -4 -23 27 5 -7 9 -1 -2 0 -20 -32 -18 -14 -9 -8 -24 22 -19 27 -21 5 17 -27 18 -1 33 -2 -6 7
323788 36 -3 11 10 48 1 -28 -5 2 14 4 -4 1 7 32 -15 -33 -9 -12 28 28 21 -6 21 34 -9 -6 43 -7 -6 31 13 5 -1 -4 -2 -2 -3 -4
324937 -29 -38 10 6 -51 -2 -23 -19 -16 7 3 -26 -33 -24 -3 -48 -28 -9 10 -34 -21 8 -16 -3 10 -19 2 -27 -17 3 -17 -35 -10 -28 7
325968 -19 -30 -3 2 7 -40 -23 -37 -7 4 -4 -4 -33 -48 -25 -15 24 -15 -1 -11 24 -13 -14 -17 11 17 -4 29 -45 -17 -8 -36 -44 -52 -11 14
327029 -19 -33 1 17 -21 0 10 14 -48 -4 4 -34 -36 -45 -4 7 -26 -8 -7 6 12 26 9 -21 14 16 -9 5 -23 6 -29 11 -26 -13 12
328060 -11 -23 4 -4 12 16 15 23 48 20 -3 9 22 22 66 37 27 7 -3 14 38 28 26 -9 24 17 34 15 48 22 -8 -24 33 -5 14
329091 17 43 17 65 20 40 15 36 10 59 50 5 46 -14 -1 6 43 37 52 50 18 37 38 46 -11 55 34 30 28 42 47 48 71 54 57 90 50
330181 60 47 12 49 55 76 82 36 93 41 75 109 50 39 34 67 97 64 83 114 86 63 93 96 55 85 62 55 93 114 94 82 104 93
331183I6oJ8J8n0oK2j2j2J7LJ6L7l3J8J0j3mlnJ1J7Rjk4K9L9jl4%JJ3j6N7j8j1A75
332273A82K2k3J3J0K6oJ8K6l8N6k5nK4QrL7J6j4K1K1K7k2L3J3J2j5N1n3K6L9o3D56
333245D54J4j1K7k1J7PKOl3M7qKmjkK6oM2jk0Nj6lm9P0o4j6K9Om7KLj8j7Opk6D19
334394D37l5M5j2Rm1N4n9K5K9o7N4J0rj7j3J0mj8K6o4rmL9n3J7L1o5O8j7Oj6M0C44
335396C78jj6KL0k6K9RJ3mk8L5k0LM2k0nj4M0JNK0oJ8nRj6pJ5k2J6K0J7K6l1OD95
336486E07j4Mk2OJ2jk8K2K3j5K2JNJJ0j4j4KlNL1l1%M4m7k0K1kk0J2J1NQJ1p6D56
337576D46j6N5l0j5J1%J8l0j7L2k8J5k5K6o1K6k4PqJ2ol8O4n7N2k3NprQ0m3J5D19
338578D14M7l0l8K9NJ5l7K4K5L9l3J0m2M5j3K5m9M8J0L7kJ0N1J2RO0L5J8R5O1I49
$$ plain form
331183 96 90 108 126 76 70 92 80 68 85 88 104 141 108 126 136 123 119 116 111 122 139 148 147 123 152 191 190 156 156 157 170 154 211 193 182 175
332273 182 204 181 194 204 230 224 242 268 230 286 261 256 280 288 279 316 332 318 339 360 387 365 398 411 423 408 459 406 432 471 408 456
333245 454 468 457 484 463 480 487 489 495 462 509 501 503 499 498 496 522 516 558 557 537 542 526 523 474 544 480 464 493 499 452 454 457 439 422 428 421 395 419
334394 437 402 447 435 444 403 457 398 423 452 385 439 449 440 423 410 420 416 398 424 360 351 347 386 333 350 381 316 384 367 373 357 397 344
335396 378 377 361 363 393 367 396 405 418 414 386 421 401 404 446 426 421 407 447 448 453 473 467 485 480 489 473 466 481 459 475 495 512 538 507 513 495
336486 507 493 497 475 481 493 492 464 486 509 494 516 517 522 523 533 519 505 507 504 509 540 509 509 553 506 486 507 505 485 497 508 513 521 532 456 456
337576 446 430 485 455 440 451 451 469 439 422 454 426 441 416 442 381 407 383 390 382 394 388 350 414 357 409 386 391 384 375 455 412 427 419
338578 414 461 431 393 422 427 442 405 429 454 493 460 470 428 473 460 485 436 484 494 531 529 539 590 602 611 671 706 724 819 880 949
339521A082O7J11J46N6J85J41J18J30K02J79J97K76K53K60K61Lj35k96l66l70B171
340169A876j93j54j31o1q3m2n3j0PJ9m6%Kj1k5j9n6l6m7q2m8l8J2p5n1Qqo5J7F07
341082E43k2j0Mk2pn4k6J0k5j6j5Km8L8k7k8J5Pl1K2j1j5%k5k0k8J0j5k7LOqj7A80
342113A98j3q2L6K7m1J1mK0m2lQl5L2J3o3O4k6pk0J4j7L9k7LLK6m2k0N1k1J5J5F2
343115A12m1J8j0M9qklL3l9j6j2oJ4QJ1nj1oj1J8j0J3JL0m1J%L1l2J1M6k0j2J5H8
344176A54mqk5J3J2n5K5L6m7oj2rL8J2j9m2L7mmrj4K2LJ2K2m3J6rJ7J4k4Nj0J6A24
345236E2M5k0K2l2K2mj7k1J6Qk0K5j4k1N1j7Lk1L9l2J8K0l9K4j7nJ6l5J4Qlj4G3
346238A8L8L1k5J9k0lJ8J0j3K4m9JL1j8j5K3nJ9%l1K0Ll6P0o7J5qkK9K1l4L4l4H2
$$ plain form
339521 1082 1149 1260 1406 1462 1647 1788 1906 2036 2238 2417 2614 2890 3143 3403 3664 3667 3532 3236 2870 2500 2171
340169 1876 1683 1529 1398 1337 1254 1212 1159 1149 1156 1175 1129 1129 1131 1120 1095 1076 1020 984 937 855 807 769 781 706 655 663 655 590 607 607
341082 543 521 511 515 493 486 432 406 416 391 375 360 362 314 352 325 297 312 319 288 310 299 284 284 259 239 211 221 206 179 182 188 180 163 180
342113 198 185 103 139 166 125 136 132 152 110 107 115 80 112 125 62 126 100 93 73 87 70 109 82 85 88 114 72 52 103 82 97 112 62
343115 112 71 89 79 128 120 118 115 148 109 93 81 75 89 97 108 103 92 86 75 93 83 96 97 127 86 87 87 118 86 97 143 123 111 126 88
344176 154 150 142 117 130 142 87 112 148 101 95 83 74 112 124 105 63 100 96 92 83 69 91 94 106 128 85 101 92 109 123 99 104 94 110 124
345236 52 97 77 99 67 89 85 68 47 63 71 51 76 62 41 92 75 78 57 96 64 82 102 63 87 70 65 81 46 60 68 65 51 73
346238 18 56 87 62 81 61 58 76 86 73 97 48 49 80 62 47 70 65 84 84 53 73 76 40 110 43 58 50 48 77 98 64 98 64 82
347269G9j2J1m6M7k7J6rKmK9l8J1Lj2J1pk1mM5qJ1j0j2Rk0K7j5j6M7l0lJ9kL1E8
348330E3%J4l1L9k8K7Pl5L8j0m5N1nLPl7J5L5l2m9L9J0J5k3J6L2j6Nj3j4k5j4G4
349332G8ok1pMJ2K5j5kj1PRn0O7p1L4Mk1pJ0M8m3Jj8PN%k4N0k3%LJ1p2N8l0N9D7
350451A4M5k4j1L1j0k6OOJ0Km7L6pj0K4j3pk1J4j8K6m2K4K5mpLj0J6j8j2M4m6F
351482B7n9M5J5J2n9J5J3j0PnlJ9%j8J6RRok5j2J3Ooj5J3j7M8j5qj3RNj4J5J2@
352573A3k1oJ8NrL2m5L2j2j0J9j8PQK0n7N7n2PL3pk3J6j6k7N6l1k4nL4Mj3Mqna
353663a3J4J0l8l0L1RqN3l0J2k0J3Onl0K9o5M9j7nORK0rL3j5j6rj1M6J2p7O2n2b4
354723e8N4Kj2K7m6J3l6O6n1L5j9j0N1k7l4K9j7N6j4m0RK8j7J0j8PNl9M8k4oPa1
$$ plain form
347269 79 67 78 32 79 52 68 59 61 57 86 48 59 62 50 61 54 33 29 74 66 77 67 55 64 44 71 56 40 87 57 54 73 71 102 58
348330 53 53 67 36 75 47 74 81 46 84 74 29 80 75 78 85 48 63 98 66 17 56 66 81 58 74 106 90 95 82 68 43 29 74
349332 78 72 51 44 48 60 85 70 68 57 64 73 23 90 19 53 57 36 29 39 87 44 45 27 34 39 39 15 65 42 42 45 56 -16 42 12 71 47
350451 14 59 35 24 55 45 19 25 31 41 43 -4 32 25 15 39 26 19 -2 12 -6 20 -22 2 27 23 16 19 9 25 7 -5 39 -7 6
351482 27 -32 13 28 40 -19 -4 9 -1 6 1 -2 17 17 -1 15 24 33 27 2 -10 3 9 3 -12 1 -16 32 17 9 -4 5 10 -4 11 23 0
352573 13 -8 -14 4 9 0 32 -13 19 7 -3 16 -2 5 13 33 -24 33 -19 -12 21 14 -9 7 -9 -36 20 -11 -35 -40 -6 -2 -15 -11 -19 -24 -1
353663 -13 1 11 -27 -57 -26 -17 -25 28 -2 10 -10 3 9 4 -26 3 -62 -13 -30 -35 -29 -20 0 -9 24 9 -7 -16 -27 19 31 -46 16 -36 -24
354723 -58 -4 -2 -14 13 -33 -20 -56 10 -41 -6 -25 -35 16 -11 -45 -16 -33 23 9 -31 -22 6 -11 -1 -19 -12 -7 -46 2 -22 -28 -21 -11
355725a2Qj7Lk1L2nK6n6oK4kJ8K0m3J5jl5oO0k4Nk8L6Nj5j3N4l9M0m1J1J7j4J0a5
356786b1j3RJ3rm4N6jJk4Pl5J7K2k8PmM4l7J6j6J3j2K0oj8M3m8j4L4m0N2l0k%b1
357846c9NKj3j7N9m0K3nk4%K0l1L2m8K9j3N2n7J8J0%l9M2J2k4K2j3J4k9n5N7K5f5
358848a6k1Pl0K6J6J3j9j8o%J9J0j0k0J0j1rJ3l3K7K5k4K0MNl0JK8k4j7K3j1K4f3
359879f2K8J9k6l1J0K2j9rk0j2M7k3K9j6L7n3M2lm3Q3k2qk7RM5k3l2K0K6m6JL6h3
360881d7J4Qk6OMkm5M7j7K2lM3p5L0k0Pnkjj6K9j9K8m2j5L8%K7l5K8NPk2j0Nj1f7
362001d0mK3n9J3K9m5P4k6j5k5J3Rj4J8nJ1j1jJl8J7PJ0Pj7kNK6Jk6M0n4O3n7e6
363061f1n2L9qj2L4j8MJK9p2K8K8JK5m4J4k6M6J0l2qJ1j2NJj4PN2m2k3K0K1l6e6
$$ plain form
355725 -12 -4 -21 -18 -39 -7 -12 14 -42 -48 -24 -26 -8 12 -31 -16 -17 -52 -58 2 -22 -17 -45 -9 -4 -19 -32 22 -17 23 -18 -7 10 -4 6 -15
356786 -21 -34 -25 -12 -21 -65 -9 -10 -9 -33 -26 -61 -44 -22 -50 -43 -47 -3 -40 -24 -40 -27 -39 -19 -25 -43 0 -48 -62 -28 -68 -16 -46 -48 -48 -21
357846 -39 -34 -32 -45 -62 -3 -43 -20 -25 -49 -49 -29 -60 -28 -76 -47 -60 -8 -65 -47 -37 -37 -76 -34 -22 -46 -24 -37 -23 -52 -107 -50 -25 -65
358848 -16 -37 -30 -60 -34 -18 -5 -24 -42 -48 -48 -29 -19 -29 -49 -39 -50 -59 -46 -79 -52 -27 -51 -31 -27 -22 -52 -51 -23 -47 -64 -41 -52 -28 -63
359879 -62 -34 -15 -41 -72 -62 -40 -59 -68 -88 -100 -53 -76 -47 -63 -26 -79 -37 -40 -83 0 -22 -30 -57 -48 -3 -26 -58 -38 -12 -58 -57 -21 -83
360881 -47 -33 -25 -51 -45 -41 -43 -88 -41 -58 -36 -39 4 -71 -41 -61 -54 -59 -61 -62 -78 -49 -68 -40 -82 -97 -59 -59 -32 -67 -39 -34 -27 -49 -59 -54 -65 -67
362001 -40 -44 -21 -80 -67 -38 -83 -9 -35 -50 -75 -62 -53 -67 -49 -54 -43 -54 -55 -54 -92 -75 -68 -58 -51 -68 -70 -65 -39 -38 -64 -24 -78 -15 -72 -56
363061 -61 -113 -74 -82 -94 -60 -78 -74 -73 -44 -116 -88 -60 -59 -34 -78 -64 -90 -44 -34 -66 -74 -63 -75 -70 -69 -83 -76 -24 -66 -89 -69 -48 -84 -56
364092d6rk7J1L0%k8j1L5j7nj8K2j4jrK3j6N2m0J2J5l1%M0k3K7j7l2N7l4j2J6d5
365094e1k0J4J6j6%M3n0MMK4n4L6K0m0qM6m1PJ1k8J7k1J3O4p7L9lol2N1k3PJ2g5
366125c8j3k4J7kk2QL2k1O5k6k6prm0N1J1K7n1M2k3J4jJ0l4k0M5J4l6L2k8M6j8a5
367127a1k7K1k1l0L1Mj2J3OKNlk4L8n8M0Kl2J5k1M3l7K4k7K3j2lJ1k0rK4j1Pk4d6
368188c0l9O1k4Lok1J2J1k3J8l1J6K5k1J2Kk4%L1j3JK1l9l9O3m2M9k0K1j6L2k8d3
369189e6Lj0J8K3J2n5K8l1OM3k7K6k2kPk0J6jj8l6M3MqL0j5lkj0k1L5J1j9J1l0d8
370250c4l1mk3M6MK4k4L0j6l8nj1M1k9J5RJ2j9MK2j8j6M4o0L0k0L2m6M9l2K2K7f9
371252g8L6K2l2J6j6k2K3oll3M7J1l3L3j5J1l4K0Oj7PL2l6j4k3J0K8J4oj1k1K6h4
$$ plain form
364092 -46 -55 -82 -71 -41 -41 -69 -80 -45 -62 -67 -85 -63 -77 -78 -87 -64 -80 -28 -68 -56 -41 -72 -72 -32 -55 -28 -45 -77 -20 -54 -66 -50 -45
365094 -51 -71 -57 -41 -57 -57 -14 -64 -60 -56 -32 -86 -50 -30 -70 -78 -32 -73 -66 -55 -83 -66 -87 -74 -10 -87 -48 -51 -57 -89 -38 -61 -54 -42 -75
366125 -38 -51 -75 -58 -60 -82 -74 -42 -63 2 -24 -50 -57 -66 -106 -55 -44 -17 -68 -26 -49 -35 -36 -26 -60 -80 -35 -21 -57 -25 -53 -7 -25 -15
367127 -11 -38 -17 -38 -68 -37 -33 -45 -32 -26 -24 -19 -22 -46 -8 -66 -26 -24 -56 -41 -62 -19 -56 -32 -59 -36 -48 -51 -40 -60 -69 -45 -56 -49 -73 -46
368188 -30 -69 -8 -32 -29 -35 -56 -44 -33 -56 -38 -69 -53 -28 -49 -37 -35 -59 -59 -28 -41 -40 -19 -58 -97 -34 -76 -27 -47 -26 -42 -10 -38 -43
369189 -56 -53 -63 -45 -22 -10 -65 -37 -68 -62 -19 -46 -20 -42 -44 -37 -57 -41 -42 -60 -96 -53 -49 -57 -27 -42 -45 -47 -57 -78 -43 -32 -51 -40 -70 -48
370250 -34 -65 -69 -92 -46 -42 -18 -42 -12 -28 -66 -71 -82 -41 -70 -55 -46 -34 -53 -49 -27 -45 -61 -17 -77 -47 -67 -35 -81 -32 -64 -42 -15 -69
371252 -78 -42 -20 -52 -36 -52 -74 -51 -57 -60 -93 -46 -35 -68 -35 -50 -39 -73 -53 -47 -64 -57 -25 -61 -75 -98 -88 -60 -46 -52 -63 -84 -58 -84
372254f4k0qK2rJ7Njk8O2m5RpPql8L9J0j5mJ4NpkJ7k9NPj0K1l0k1L9k2L6k1K6e5
373373d4k2Qj2NojNj2KqJ7J2j3pNJ4ml4qM1j4K6rk0mL5m8J8KlOnL9o7K1j0L5j7a03
374552f0m4M5l6M6k7J3m2K6J3m9L1nK4l5M1j6oj4MQJ2K8m7Pj0LJ4j2L1j4o2L0f9
375553e9mRo2L0j6%mL6k8J6Orj8K6k1M6m4L2j4J3J0mm9L7j8PqK4j6Oj0rPKqK0e8
376673e1l2kJ8k4j8M2l4J3K8k6J3MLk4K2Mj2n3MJ9L6j1L2j4K3n8K7Qj2j0J1J1e0
377675i0rQK7j0njk2OL3l7K9%J7Kl0K5j9j6NMK4Nj0qOrqj2J4K5l8J8ONj8ql2M6i6
378853a53P8Mj6RJ9k4K0m1J5J6l7L7lPj8j8L2Kk1QK6j7lK1j6k1K1j0PJ9n5M5n2f5
379884a01J4KqJ9l0L2J7o6N1k0KJ5k8MJ4k6J7m8lP4k5k1L6nQj0k1K5j8MK7j9l4f5
$$ plain form
372254 -64 -84 -92 -70 -79 -62 -57 -58 -86 -24 -69 -60 -67 -60 -68 -106 -67 -57 -72 -76 -62 -57 -64 -66 -49 -78 -73 -66 -76 -55 -85 -106 -67 -89 -53 -74 -48 -55
373373 -44 -66 -58 -70 -65 -71 -72 -67 -79 -77 -85 -68 -56 -69 -76 -71 -57 -61 -95 -103 -62 -76 -50 -59 -79 -83 -48 -96 -78 -76 -79 -73 -78 -39 -106 -85 -95 -60 -77 -103
374552 -60 -104 -59 -95 -49 -76 -63 -105 -79 -66 -115 -84 -89 -65 -100 -59 -75 -81 -95 -91 -83 -71 -43 -90 -83 -93 -90 -76 -88 -57 -71 -133 -103 -69
375553 -59 -63 -54 -116 -86 -102 -102 -106 -70 -98 -82 -76 -85 -103 -77 -98 -52 -96 -64 -78 -65 -55 -59 -108 -71 -89 -82 -90 -66 -82 -76 -86 -95 -88 -86 -94 -74 -58
376673 -51 -83 -85 -67 -91 -109 -67 -101 -88 -60 -86 -73 -69 -66 -90 -68 -64 -76 -129 -125 -106 -70 -81 -49 -63 -40 -98 -71 -63 -75 -85 -74 -63 -50
377675 -90 -99 -91 -64 -74 -79 -80 -102 -96 -63 -100 -71 -71 -54 -52 -82 -57 -76 -92 -87 -83 -59 -54 -64 -72 -66 -75 -83 -95 -81 -56 -94 -76 -70 -65 -83 -91 -123 -77 -96
378853 -153 -75 -71 -87 -78 -59 -83 -63 -104 -89 -73 -110 -73 -76 -69 -87 -105 -73 -71 -92 -84 -58 -75 -78 -57 -73 -94 -73 -83 -76 -57 -112 -67 -119 -65
379884 -101 -87 -85 -93 -74 -104 -72 -55 -121 -70 -90 -88 -73 -101 -97 -83 -109 -92 -140 -143 -69 -94 -115 -79 -84 -76 -86 -107 -82 -100 -96 -69 -88 -122 -65
380916h7J6Nl0qJ6L0j2lj7J0J6l2J7j8P%N0n6L5j6l3M5j1M4l5%Kj2qRqL5p4N0h1
381976g7K1l9RJ1k7L6j7k5K2J8k4J1njMK0k6K2oj2J7j3K0Mpj2j1j1k0K0K3oj6h8
383007f7k3J6j2j9MK4lK3ml3M9m8k7K2l5Q2k1J8l8nJ1J9lnMk2J5J6k2K0M2p1K1e6
384039g3N0l5jk9rK1J6j8j4P5p9L5k3R%pk1M8lj0J1l4KPrj4K7J0lRl3L0l7K4ng2
385130a00L6j3nk1L0l8L2J1lJj0k5j0M1%M1k3l5j1J2K9l1QJ9k8K3pMk4K4j8nld5
386162a10N5j7J8k6jl0K4k3N0k0Jqj1j8ML7NprJj3L3l6K1lJj7LK3j2RL7k9J7qd6
387253f8L0j0j6J1oJ9p6K7M5pmMjj0J4qm2L3O1l3kk8KJ0poj6L4j4ok7NK4j6J2h1
388344e3m0M5Pm8%K9l1J8l9N9j7j3NJ1Jk0j5o0N3PL3Jk9J6Ok0Pj2J1j8KJ7j2k0i2
$$ plain form
380916 -87 -71 -66 -96 -104 -88 -58 -70 -73 -90 -80 -64 -96 -79 -97 -90 -90 -40 -96 -61 -77 -110 -65 -76 -32 -67 -67 -65 -77 -85 -76 -84 -49 -123 -73 -81
381976 -77 -56 -95 -86 -75 -102 -66 -83 -108 -86 -68 -92 -81 -86 -87 -83 -63 -89 -67 -73 -85 -68 -81 -61 -57 -64 -76 -87 -98 -118 -98 -75 -81 -97 -88
383007 -67 -90 -74 -86 -105 -101 -77 -80 -57 -61 -94 -45 -93 -120 -98 -133 -51 -72 -54 -92 -97 -86 -67 -70 -75 -71 -93 -78 -62 -84 -64 -22 -93 -72 -56
384039 -73 -23 -58 -59 -88 -97 -76 -60 -78 -92 -17 -96 -61 -84 -75 -75 -82 -103 -55 -58 -68 -57 -91 -89 -82 -91 -105 -78 -68 -71 -62 -95 -65 -102 -78 -83 -72
385130 -100 -64 -77 -82 -103 -73 -111 -79 -68 -71 -70 -80 -105 -115 -74 -74 -33 -56 -91 -102 -90 -61 -92 -84 -65 -93 -70 -77 -73 -97 -73 -91 -96 -99 -45
386162 -110 -55 -72 -54 -80 -81 -111 -87 -110 -60 -80 -79 -87 -98 -116 -112 -75 -70 -77 -86 -85 -98 -65 -101 -80 -83 -82 -99 -96 -73 -85 -76 -39 -68 -51 -59 -46
387253 -68 -38 -48 -64 -53 -59 -40 -116 -89 -44 -51 -55 -51 -52 -62 -48 -56 -98 -65 -4 -37 -39 -67 -65 -55 -62 -68 -84 -50 -64 -70 -97 -92 -68 -84 -72 -81
388344 -53 -93 -48 -41 -89 -89 -60 -91 -73 -112 -53 -70 -83 -78 -67 -66 -86 -101 -161 -108 -101 -68 -67 -96 -80 -74 -94 -87 -99 -88 -106 -104 -87 -99 -119 -92
389405i1j5K7rK2KJ3l5Rqj3K3J0NmPrj5LKJ4oj0k0j4L2j9K6j4j0K1j6K0j5j0N3h6
390496i7K9K3j4o3L3pJ1K2J6l8rMJ2QKL0k3rm7PL4l4LM7k8J1L3k6l3M1lj1J0j6h8
391558h8J2J6k4K3KK9m9j0L0Mk8qk0L7k2K7l3pL6%jJ5m4O2o9L4J8j3nj2%J5QQa04
392619d6K1k6qPn2N6j0l8L2rJ5j8Ql0J0J0L1j3ok0MPJ7mRnlJ6l4L1k3j4J4LOj2g6
393740f7j0m4N9olJ9l4M0k4pJj6j5L5N8o1K2j3n6K9L3l6J8J2J8l0rL0m7J4jNj6i9
394772d2mj4k6J1K2k0K0j3j3L9qNn0K6J2l1K6l9L9l9K4NknJ0ol%K6J6k8j6nK0h9
395833i2K2kj1J6j6mL9j2j8j3K3lJj1J0J4lj9ONqJ3kK8k4j7jJ2lrKQK8K2m1nK7f6
396983i2J2OJ0J3l1L1m1j4K8rL1%j5OKkM1n1L2m0L8l5QN3m2K5l0N6p3J4K6jn3g8
$$ plain form
389405 -91 -106 -79 -88 -66 -64 -51 -86 -77 -85 -98 -75 -65 -60 -64 -57 -66 -81 -78 -76 -62 -68 -78 -98 -112 -80 -99 -73 -87 -97 -76 -92 -72 -87 -97 -44 -86
390496 -97 -68 -45 -59 -122 -89 -96 -85 -63 -47 -85 -94 -90 -78 -70 -68 -38 -61 -70 -117 -110 -76 -110 -107 -60 -88 -77 -44 -70 -103 -62 -65 -76 -66 -82 -88
391558 -88 -76 -60 -84 -61 -59 -30 -79 -89 -59 -55 -83 -91 -111 -74 -96 -69 -102 -109 -73 -73 -74 -59 -103 -41 -110 -76 -58 -71 -76 -88 -88 -73 -65 -57 -104
392619 -46 -25 -51 -59 -52 -104 -48 -58 -96 -64 -73 -58 -76 -68 -98 -88 -78 -47 -60 -66 -86 -82 -75 -58 -62 -53 -58 -61 -45 -79 -48 -71 -85 -71 -68 -62 -74 -76
393740 -67 -77 -121 -62 -68 -71 -52 -86 -46 -70 -77 -76 -92 -107 -72 -14 -75 -53 -66 -122 -93 -60 -96 -78 -66 -48 -78 -87 -57 -104 -90 -91 -86 -102 -99
394772 -42 -46 -60 -86 -75 -53 -73 -53 -66 -79 -40 -48 -43 -93 -67 -55 -86 -60 -99 -60 -99 -75 -70 -72 -77 -67 -73 -76 -76 -50 -34 -62 -78 -83 -63 -89
395833 -92 -70 -72 -83 -67 -83 -87 -48 -60 -78 -91 -68 -71 -70 -81 -71 -57 -60 -79 -73 -68 -76 -63 -65 -37 -61 -78 -79 -67 -70 -79 -77 -69 -41 -19 -60 -65 -38 -66
396983 -92 -80 -74 -64 -51 -82 -51 -92 -106 -78 -87 -56 -56 -71 -65 -63 -65 -24 -75 -43 -83 -45 -80 -72 -19 -61 -36 -66 -10 -83 -69 -43 -44 -97 -78
398015f4k6Kl4R5k7rj4J8LKl1K9n8M3%k1M5l7J0J5lpj1K1m8J8RKK8jj9k3K4j7d6
399077h7J4J6%np%Nl0PMJ6kj1J5J2m7K8qKJ0MJ3o5P1n8QlK4M6n7J9LJj9ll0O4i2
400227f3K0m4K2m2L1pRj5QJ2%%qJ4l1O9j2j6OJ2m9j9O9l4JJ3nrJ8m1K2jPL1l8c7
401317e0k6kOrJ4j0J1J4j5JJ1l4QK0J1KJ4m4K4j1rnL6j9J3k2kkoj9L7J1J2j2j9i7
402408f8pN4n0k5Q0q7QK1L5l4QQj9JK0JLn2K2L2k4J0j8J0L2n0K1ONk6L4m1N1k7i0
403470c9m5P3k7Mk0mNk5pM0k1J2k4MK1k0j0QN9l1KmoPrJ6rl2M4j6K9J2n1J3j9e3
404561g6J1LM9l0j6J5J0l4J5pJ8Mm8M5k0Oj6%RPj0J0J4rkrN6n5j3J9k2J9M0k1g2
405622g7K2L6j3j1J3j7K0k3oM4j7j9j3M7l9L8n0J6J3okk8RkM7oMk9omK0k6QJ0d6
$$ plain form
398015 -64 -90 -88 -122 -27 -54 -63 -77 -59 -56 -54 -85 -56 -114 -71 -71 -92 -47 -84 -74 -59 -62 -69 -80 -59 -107 -89 -80 -78 -50 -51 -70 -93 -69 -86 -46
399077 -87 -73 -57 -57 -62 -69 -69 -64 -94 -87 -83 -67 -69 -80 -65 -53 -100 -72 -80 -78 -68 -64 -51 -116 -45 -103 -95 -98 -74 -28 -85 -66 -63 -62 -81 -84 -114 -50 -92
400227 -63 -43 -87 -65 -107 -76 -83 -74 -89 -81 -69 -69 -69 -77 -63 -94 -25 -37 -53 -47 -35 -84 -103 -34 -68 -67 -54 -59 -68 -50 -91 -69 -70 -63 -32 -70 -37
401317 -50 -76 -78 -72 -81 -67 -77 -66 -52 -67 -66 -55 -89 -81 -61 -50 -48 -34 -78 -54 -65 -74 -79 -43 -62 -49 -71 -73 -75 -81 -100 -63 -52 -40 -52 -71 -97
402408 -68 -75 -21 -71 -96 -16 -103 -95 -74 -39 -73 -65 -57 -76 -75 -55 -54 -51 -103 -81 -49 -73 -63 -81 -71 -39 -89 -68 -62 -57 -83 -49 -90 -39 -66 -90
403470 -39 -84 -11 -38 -34 -54 -58 -53 -78 -85 -45 -66 -54 -78 -74 -53 -73 -83 -75 -16 -47 -45 -49 -55 -48 -57 -41 -50 -82 -38 -54 -25 -13 -64 -51 -70 -53
404561 -76 -65 -62 -13 -43 -59 -44 -34 -68 -53 -60 -42 -38 -86 -41 -61 -55 -71 -71 -62 -55 -65 -55 -41 -50 -52 -61 -5 -60 -73 -54 -76 -57 -17 -38 -72
405622 -77 -55 -19 -32 -43 -30 -47 -27 -50 -56 -12 -29 -48 -61 -14 -53 -15 -65 -49 -36 -42 -44 -72 -63 -65 -18 -24 -20 -49 -55 -59 -39 -65 -57 -47 -46
406684f5L7KJ2o1M0J2j0J4K0l1K2j0mrRj0Nk9M3k0Ql5J0K8l7L8plK2k2Jk0k5O1c4
407745HJn8M4k7K0j2KJ7j5MrL2p3N9jj7J1mj0J2j3O0m3k1j2K5M5m6Kj2J0J8l7b
408777A6k5l1Lj8M1j5K3K3Jk2J1k8J1K7j6l1J9km3K9M1Ml3j2L7%k1jk2J2M8k2A0
409780b6L8k0J0o2L8ML5Ok5j1L2l5K4J2KKj2l2J7OL0k2k7M1n6L9oj1L0m1N2j9a7
410782Eoj3K4j9N6k7j6K7Lj4k5pK8Nqj8NJ0j8K8J3k1j1KRK3k8J7mj3L6l2J6l2A8
411844C2o2L9l0L8oK1jl0K6J4L9n2j9L8j0k0jJK6K4n8P%OQj6Nj1M7k1l7j4L9MD
412905cj4J5jN5l2lnjQK3Mn4Lj5O4L1k3m5Oj0K3l2M9m3M5j5j0nL6l3J7j7MNj8A
413996B1K2k6K5Jn0L4k1L0j2J0l3K0l7P4n0K8l8J8Rj3Nm7M7j0J8k3j5L7k7K5Od
$$ plain form
406684 -65 -28 -26 -14 -75 -35 -23 -33 -19 1 -30 -8 -18 -22 -31 -22 -32 -27 -56 -13 -33 -25 -60 -50 -22 -59 -21 -28 -31 -9 -31 -30 -50 -75 -14 -34
407745 8 9 -49 -5 -32 -12 -24 -22 -5 -20 -16 -25 7 -66 -7 -8 -25 -14 -18 -28 -16 -29 31 -12 -33 -45 -20 25 -21 -19 -31 -21 -3 -40 -2
408777 16 -9 -40 -37 -55 -14 -29 -6 17 18 -4 7 -21 -10 17 1 -30 -11 -13 -56 -27 14 18 -15 -27 10 10 -11 -12 -34 -22 26 4 10
409780 -26 12 -8 2 -60 -22 -18 17 23 -2 -13 19 -16 8 20 22 24 12 -20 -3 3 33 11 -16 25 -31 8 2 -9 21 -20 32 13 -17
410782 5 -1 -14 10 -9 47 20 4 31 34 20 -5 -12 16 21 13 -5 0 10 -8 20 33 12 1 3 12 35 7 24 20 7 43 11 27 -5 18
411844 32 -30 9 -21 17 11 32 31 1 27 41 80 28 9 47 37 17 16 17 43 67 9 16 16 22 30 14 19 8 55 34 -3 -17 22 26 4
412905 -3 -17 -2 -3 52 20 17 12 11 19 42 46 -8 -5 -20 44 75 52 7 13 3 26 -6 43 0 45 30 20 15 51 18 35 18 22 27 9 1
413996 21 43 17 42 43 -7 27 6 36 24 34 1 21 -16 58 8 36 -2 16 25 12 17 -30 17 7 25 2 -13 24 -3 22 28 -4
414969B6j6rL1j4nJ8J3k1j7KpJ3NLjk4K3k8oK3PPpK7o0ON6m3L3k4j1J8pPOpk0B8
416119a8K6nK3J3k2j8K8pqJJ4j4j0L1l2ORNMk4KK2k7jkJ7J2k1nPQj1J0j9jrL4B8
417269a6%NM4l9J6J2j3j3%L7j9nj4j2M1pk0K8j7k7L5pKK9k2l2J6PnlJL1m2J3j1c
418360DLL3l3k6L7Mk1J7J3j3K6m3k4L7j6O6m1Lj5j6L4k9M8q0O4n8N9qk5OJ0J1B4
419362e1P4j9L5Pm4jL3j8oJ8k2J3Mj7K0j8Nm6N3k9K4J4k0on4P0k7J6Ml3J7MpKA6
420424HK3l0mK0Kk5L5k9L1k0l7RK7j2J3mJ9pkJ0k4M4m8J7lOj5jJ7MM8n9%jlOK1D7
421574D4j5L1n1J6OK6rk0NM4p3j5R2o4N6l6j2l1KLK0K7k1J8n6J7L6k2j7J2LL3B3
422576HjJ5l0K2k7M2Nl2J6J6k9L2j4NK5j9j3j5j9LN9Pj6nk5L1l5MKL4nK1j0m2C1
$$ plain form
414969 26 10 1 32 18 13 31 44 23 6 8 1 14 19 22 21 -3 20 -8 -14 9 16 23 16 43 -17 -11 45 2 35 11 0 18 11 18 24 17 -3 28
416119 -18 8 3 26 39 17 -1 27 20 12 13 27 13 3 34 2 8 17 22 26 2 4 26 -1 -2 -4 13 25 4 -1 6 14 3 13 -6 -7 -16 18 28
417269 -16 -16 -11 33 -6 10 22 9 -4 -4 33 14 9 -5 -17 24 17 -3 25 8 -19 16 9 11 40 18 -14 2 9 4 1 2 33 -9 4 -7 -3
418360 4 7 40 7 -19 18 22 1 18 31 18 44 1 -23 14 -2 64 23 26 11 -5 29 0 48 -32 32 -26 33 25 0 6 16 27 24
419362 -51 23 4 39 46 2 1 34 16 10 28 6 19 23 6 26 8 13 -33 20 -9 15 29 9 3 -51 19 -8 8 12 -21 -4 0 -7 -5 16
420424 8 31 1 -3 17 19 -6 29 0 31 11 -26 -17 10 -2 11 7 26 19 17 27 3 47 -1 16 13 19 4 3 20 24 72 13 13 12 9 15 36 47
421574 44 29 60 9 25 31 57 48 28 33 77 4 -11 81 17 73 37 25 -6 -4 -1 19 46 25 43 -13 4 40 18 1 13 16 49 23
422576 8 7 22 -8 14 -13 29 34 2 18 34 5 37 23 28 53 34 21 6 -13 -10 49 56 40 35 10 41 6 10 12 46 41 62 52 10 31
423638HM2l0kKK0m9J1OL4l0k7K2oK7k2J4K3l1k2J8mN4m7L5j3l0K8lRrk9K9l2M5I
424699AL1PJJ7l9M4m1M1j3pl6L3m3L7MjnK3j4ML3o6L0J6k5mqmK2K2o2O2k4jk5B5
425790B5ql3N1Pj6L5Qno1M0Ol0K6%j2n3L3J7RK3j9j1l8M6PM2r0K5K8K8k4oKrj3C1
426881BK5K9J6l4j2KrJ6mmJ7J6Jn5L1k6K4j8JJ2L5l5j9K7k8L1oj5L1j2J4l2K2F2
427913B7K9j3j0J5L7k9k1K0MJj7J4J8j7qk0NkJ0L2jn0J8K8l8J4qnN3n1L4rpJ5C1
428975E4j2J3j5NkL8j1K8m7K4k0QK4l8j3J8K5m2N9n3l8O2j5K6m4K9J1l2J0L6l2D0
429948E3k1J4J5k5K2Jj0RN0k7JRl4k7L8rj7K6rj7O1k7j1k6J4M3l9K5l1K7j5J3F2
430950A02j6k9ML5k3j3K9m3M3j7n3N2KK0l3RJ8MLk8J9Rj1j7RqK9j3nk7L1Pnj7I0
$$ plain form
423638 8 50 20 18 20 40 -9 2 8 42 12 -15 7 1 28 6 20 43 12 -10 8 4 58 11 46 33 3 31 28 37 28 -1 28 -4 41 9
424699 1 32 39 40 57 18 62 21 62 49 42 6 39 -4 33 37 36 31 54 40 44 77 11 41 57 32 28 20 16 38 60 -2 60 36 35 10 25
425790 25 17 -16 35 42 26 61 69 64 3 43 49 19 45 45 33 -20 13 30 39 62 43 32 -6 40 47 89 -1 24 52 80 56 50 52 43 30 31
426881 2 27 56 72 38 26 28 19 35 31 27 44 60 61 6 37 11 35 17 18 30 65 30 11 38 10 41 35 20 51 39 53 21 43 62
427913 27 56 43 33 48 85 56 35 55 59 60 43 57 75 58 50 30 35 33 43 75 74 24 42 70 32 46 38 33 86 35 69 60 53 68 31
428975 54 42 55 40 45 43 81 70 98 51 75 55 63 87 49 36 54 79 37 96 43 5 67 52 78 34 63 74 42 52 88 56 40
429948 53 32 46 61 36 58 59 49 58 108 81 82 91 57 30 68 59 42 68 59 42 103 76 65 39 53 96 57 82 51 78 63 76 62
430950 102 86 57 61 96 73 60 89 46 89 72 19 71 73 93 60 69 87 91 94 66 85 94 83 66 75 67 96 83 78 51 82 89 84 67 90
432012H1J2Pl5j6M9qm%J5Rl9N6m0NLOK1m6J8MJ7l6M8l9pk7N4l5L4rJ7Pm5K5J2A15
433103G1L6PkPn2M1j7MplOk5MP3m4K6n1K4j0Mj3M2j9pk1O5ok9J3j9L9k0j7lmj5A14
434223A38k3j1K0J8j7j3jJ0j2m4N5j4NK1qj1J7Qk6OJ8l5Jj5L6J4k1kM2l6l0K2A03
435226A31K4k1Nnjn9M8K0l6NK1l0K1rJ3rJ9k7K4l4O1k6K0k0k4K9J9jj0k5J9J6A32
436228A41p%oQJ5Qm3K8K1kj0m0QL5J9o1L6J1mL7j4j5%mJ3j6K9j8n0M7Nrjk6J4A54
437319A51L3j3K5k1j0j2J3j6J4J9oj9oQM7m4L5j8j4J2j8P0p7J9j5J6Qm0O2l7J7A67
438292A49M0m0K9J1PrJ8n0O7n5OM1qnLk2M5j2k9J1%LjR%j6NRj5OOrJL1k3NrRj2B03
439501B14qj3L3k1Qk3N9k8k0K1J%Jj0K1Kk5j0M7m4O4l5%k4K6j5QnK4m0N3m9L2B24
$$ plain form
432012 81 93 100 65 49 98 90 86 86 101 110 71 127 87 92 95 101 122 76 94 98 115 79 127 88 81 54 108 73 107 98 115 122 77 102 114 115
433103 71 107 114 112 119 67 108 91 95 88 85 91 66 70 143 99 125 74 98 88 92 79 121 102 95 74 139 133 104 117 98 137 117 100 97 93 78 114
434223 138 115 104 124 142 125 112 111 121 109 65 120 106 111 132 124 113 130 138 112 118 136 101 102 87 123 137 116 114 156 120 90 112 103
435226 131 155 134 139 134 133 74 122 142 106 111 132 102 123 114 127 118 137 110 134 100 161 135 155 135 111 140 159 158 148 123 142 158 132
436228 141 134 134 128 136 151 159 116 144 165 163 153 113 121 156 175 114 150 161 157 194 180 165 165 161 174 158 187 169 119 166 171 162 161 135 149 154
437319 151 184 171 196 175 165 153 166 150 164 183 177 158 152 160 207 163 198 180 166 178 160 230 153 172 157 173 181 141 203 166 183 167
438292 149 189 149 178 189 196 187 205 155 222 167 173 214 206 201 204 182 227 215 186 197 197 200 199 208 208 192 197 206 191 197 203 194 195 226 203 208 199 208 196 203
439501 214 206 193 226 205 213 190 249 221 201 222 223 223 224 214 235 237 212 202 249 205 269 234 234 210 236 221 229 224 248 208 261 212 244 224
440533B55mqm4L6R%QJm1RJ1L3j1j4J4j9K9rNj7J9Ok6KrK1l3K6M0k4l6RK8j4K2B14
441624B46N5l9qNj5K1M8k1k6MJ7j0qNoLL4p4L9k0J9L4l8rP1l5j3Pm1N3j4KL1k3B93
442685C04k4N0l5%K7M5r3M6k6J5j7K1J5l0K0LmQk3K9k5K7J3n6J3jL6k4j4J5j5C21
443658C35j3OJj3L9l1j8N8k4J9j7JJ4nqK5j9n1L2LK3RPk7K1j9K5j4J4j5OJ3Kj1C72
444720C58J4j7j8M2K3m3PjM2l3K7n3K6L2pK8m4J2Jk5L6Jmj0K8K2n1mL5Qk0MJ8D07
445752D03M5n0J3jLJj1K8Ok7J3N0j9J1Pl3Kk1M0j6nL6l0J6l0j8M2J4J9k9j0K7D80
446754D74KKL0m7J3J6j5K4L5k3n5M4J9l1K1l7K8J1qJ6k6K0j6K6KrJ2k9K0kj1NE29
447757E25KL2popj3L6L7k9j9qK8k2K5qJ3j0m3K2M2J9l6j1k3K0J3J9k1NK8k2l5E64
$$ plain form
440533 255 251 243 199 235 244 244 252 253 212 221 232 265 254 240 254 235 264 255 260 243 262 268 242 244 235 256 223 249 289 265 229 238 266 252 274 214
441624 246 301 262 254 259 244 265 313 292 266 270 287 277 269 274 268 271 305 231 270 250 269 303 265 256 327 292 279 286 245 298 284 286 317 294 293
442685 304 280 330 295 295 322 367 274 320 294 309 292 313 328 298 318 321 317 325 302 331 306 333 346 290 303 302 338 314 300 315 300 321
443658 335 322 328 329 316 355 324 306 364 340 359 342 343 357 352 344 369 350 299 331 334 357 366 373 346 367 348 373 359 373 358 364 377 379 368 372
444720 358 372 355 337 379 402 359 366 365 407 374 401 348 374 406 399 427 383 395 396 371 407 408 404 394 422 444 393 389 424 432 412 416 434 407
445752 403 448 398 411 410 413 414 403 431 437 410 423 473 454 465 472 439 441 420 460 444 439 475 445 461 431 413 455 469 488 459 449 476 480
446754 474 476 478 508 461 474 490 475 499 534 511 456 500 519 488 509 472 500 511 503 519 493 513 497 523 525 516 528 499 519 517 506 511 529
447757 525 527 559 552 546 539 526 562 599 570 551 543 571 549 574 566 579 569 526 548 590 609 573 562 539 559 572 591 570 575 603 581 546 564
448759E87NJ9j5ML3j0J1km0L8l2M7m6M8j0l3O0n2J4J2j4J6J3k1M2j3OJk2K4K0F90
449732F55L2nL1L0o4rJ6K3j4K9m7L3LRl9K1lJ9J1mK3l1L2K4j9JRj0k2L1NnJ2J9G74
450794G72j3lJ7NL9K6j8m0QL2qk0K1o1O3oL0j7JPoM2k3k8J0K9rLJ6mK2k5L4k8H96
451855H74OLJ5OJ2jJ2l5k2Q4k0j2L8qk6j0K1J5J6JN6m6L8n2L1j4K4k1lK6l7j2A019
452858I87L1OJM3jj6jmJ0k7L8Nj8MlQ5l9J2PjL1m4NK5j8K3j0J2K9n1L1L6k3L4A239
453919A183ml8N8L6m3j1N3J7KNj9NK6l9L2JKN%J0k0J1L1K0m5O3k2J0L0RmJ6m0A346
454951A374pM9k9lN3j5k5NN9KNl0J6J2L6n6L0j2N6K2j5oK9j9KM0j1j4L1j4mJ4A616
455954A630J5J3j3M1m9K4j4N3k9J3ML0Kk9L3N8k3PM2lj5J8m0K6L7PnJ7k7K5mL4A898
$$ plain form
448759 587 592 611 596 600 633 623 634 632 592 630 598 645 599 647 637 604 664 612 626 638 624 640 653 632 674 661 667 668 646 670 690 690
449732 655 687 682 713 743 679 670 686 709 695 724 677 710 713 722 683 704 701 720 731 727 750 719 751 775 756 757 766 756 734 765 770 765 777 796 774
450794 772 759 756 773 778 817 843 825 785 793 825 817 797 818 757 820 814 844 827 828 835 829 871 848 820 830 859 850 853 869 865 887 862 896 868 896
451855 874 880 883 898 904 916 915 927 892 870 954 934 922 960 952 926 916 937 952 968 969 1025 979 1017 965 996 982 1006 985 982 1008 971 959 1019
452858 987 1018 1024 1025 1068 1067 1051 1050 1046 1056 1029 1067 1072 1054 1058 1055 1140 1101 1113 1120 1119 1150 1106 1111 1136 1118 1141 1131 1143 1172 1121 1152 1188 1165 1199 1239
453919 1183 1179 1141 1199 1235 1192 1181 1234 1251 1253 1258 1239 1244 1270 1231 1263 1264 1266 1271 1271 1281 1261 1272 1303 1323 1278 1341 1319 1329 1359 1368 1364 1380 1340 1346
454951 1374 1367 1416 1387 1384 1437 1422 1397 1402 1461 1463 1468 1438 1454 1466 1502 1446 1476 1464 1520 1542 1527 1521 1550 1531 1533 1573 1562 1548 1579 1565 1561 1575 1616
455954 1630 1645 1658 1645 1686 1637 1661 1647 1700 1671 1684 1688 1718 1720 1691 1724 1782 1759 1766 1808 1805 1790 1808 1768 1794 1831 1838 1833 1850 1823 1848 1844 1878 1898
456956A889K6K9k5MkL7J2K8l1M9RK7k8J1J3J7K7k7M5lK4mK2K9L2n7M3k0O3K9l5B284
457929B256L6k0M7Jkj1M4k5M7QM6l7N4k2L6K4K6K1l7j3Q4l7K7L3KNK4L2k1N3K5B728
458902B681P9l0K3mJ6M3M5n1M2K6K8N4j9QK3RRJN7NN2j1N2l5M4J4mN4PnP1%lJ5C300
459964C318M2R5k6l7L4K1K4K8L7rO5J7J3M7qL7L6J0M0L5K3mK9KN6J7O4J2LK7N5D100
460937D108O1JK7O5j5P2K2J8L1J7K7K8L9L5K8L8K3L6J4M3J6N6J0K2P6LO8M0L8E083
461851E085N4J2O1M8j8P4P2K9J3M6L9M5L6L5M9L1J00j3L9M0Q8kP5N5L2J2O3O8F283
462735F357P5K4N4J3J03K3N5O8K6O0N6M3R7J6M6R0K8Q0O2L2J4J19M8O6O7M4R9G899
463590G972O8M9J12R2pJ02N5R6N2P7O7O8O6R0P5Q6R5M9J00O1O4Q5O9Q7Q8P8Q9A0101
$$ plain form
456956 1889 1915 1944 1919 1923 1921 1958 1970 1998 1967 2016 2025 2052 2024 2035 2048 2065 2092 2065 2110 2107 2131 2127 2149 2178 2210 2153 2196 2176 2239 2268 2233 2284
457929 2256 2292 2272 2319 2320 2318 2307 2351 2326 2373 2381 2427 2390 2444 2422 2458 2482 2508 2529 2492 2479 2563 2526 2553 2586 2588 2593 2617 2649 2628 2681 2706 2728
458902 2681 2760 2730 2753 2749 2765 2808 2853 2802 2844 2870 2898 2952 2933 2941 2964 2973 2982 2983 3040 3045 3097 3086 3138 3103 3147 3161 3157 3211 3218 3213 3284 3284 3281 3296 3300
459964 3318 3360 3455 3429 3392 3426 3447 3471 3499 3536 3527 3592 3609 3622 3669 3661 3698 3734 3744 3784 3819 3842 3838 3867 3869 3925 3942 4006 4018 4021 4048 4103 4100
460937 4108 4169 4170 4197 4262 4247 4319 4341 4359 4390 4407 4434 4462 4501 4536 4564 4602 4625 4661 4675 4718 4734 4790 4800 4822 4898 4901 4969 5009 5047 5083
461851 5085 5139 5151 5212 5260 5242 5316 5388 5417 5430 5476 5515 5560 5596 5631 5680 5711 5811 5798 5837 5877 5965 5963 6038 6093 6125 6137 6200 6268 6283
462735 6357 6432 6456 6510 6523 6626 6649 6704 6772 6798 6858 6914 6957 7054 7070 7116 7206 7234 7314 7376 7408 7422 7541 7589 7655 7722 7766 7865 7899
463590 7972 8040 8089 8201 8293 8286 8388 8443 8539 8591 8668 8735 8803 8869 8959 9034 9120 9215 9264 9364 9425 9489 9574 9643 9730 9818 9896 9985 10101
464446A0165Q5J16P5O5J17J02P6J15P6R8J40R7Q4J17J06Q7Q6J29J31L9J40O4J42A2556
465183A2709J14J11Q7J33J13J21J32R4J57J31J75P3J50J29J27J37J37J34J48J47A5403
465831A5514J62J39J36K06J07J40K03J28J15J75J81J40J78J83J36J94J95J31K08A8706
466451A8894J81J79J83J59J69J76K25J70J85K32J85J71J91J96K18J83K14J89K22B2717
467070B2930J91J90K61J58K30J81K49J94K18K47J88K25K26J88K50K04K33K10K34B7197
467689B7436K35K35J87K19K53J76K78K13J92J88K48J96K34K26J94J89K59J99J96C1762
468308C1974J94J69J99J89K13J79J85J43J99J60J85J60J59J55J60J29J84J05J57C5384
468927C5453J46O1J72R2J20Q7M5J30K0J08J01P1K0L7O1Q7%j1N6k8L1mJ8k9m3l5C6779
$$ plain form
464446 10165 10250 10366 10441 10506 10623 10725 10801 10916 10992 11090 11230 11327 11411 11528 11634 11721 11807 11936 12067 12106 12246 12310 12452 12556
465183 12709 12823 12934 13021 13154 13267 13388 13520 13614 13771 13902 14077 14150 14300 14429 14556 14693 14830 14964 15112 15259 15403
465831 15514 15676 15815 15951 16157 16264 16404 16607 16735 16850 17025 17206 17346 17524 17707 17843 18037 18232 18363 18571 18706
466451 18894 19075 19254 19437 19596 19765 19941 20166 20336 20521 20753 20938 21109 21300 21496 21714 21897 22111 22300 22522 22717
467070 22930 23121 23311 23572 23730 23960 24141 24390 24584 24802 25049 25237 25462 25688 25876 26126 26330 26563 26773 27007 27197
467689 27436 27671 27906 28093 28312 28565 28741 29019 29232 29424 29612 29860 30056 30290 30516 30710 30899 31158 31357 31553 31762
468308 31974 32168 32337 32536 32725 32938 33117 33302 33445 33644 33804 33989 34149 34308 34463 34623 34752 34936 35041 35198 35384
468927 35453 35599 35660 35832 35924 36044 36131 36176 36306 36326 36434 36535 36606 36626 36663 36724 36811 36811 36800 36856 36828 36859 36855 36873 36844 36801 36766 36779
469753C6729n3k7p6r0m1m4p2j03q0j11r1j03j17j29j39r8j31j56j28j52j18j52C4322
470460C4171j50j79j70j61j70k16j99j94k02j60j98k08j53k42k18j92k09k10k10C0296
471080C0075j81k55k02k16k54k04k03k28k41j94k04k27k11k28k27k47k09k04k44B5649
471699B5463k22k04k64j75k15k10k64j94j96k09k18j84k14j99k18j78k08k26k45B1246
472318B1097j97k06j66k03k26j53j94j61j91k07k17j27j90k03j57j41j96j43j47A7457
472937A7318j74j59j48j76j09j64j81j34j29j45j77j24j36j84j04j20j74j38j55A4365
473556A4255j44j04j51j19r5j37r8j49j56r5j20j13j21j20q6r2j05j32j25p8j13A1692
474235A1625j42j16p9j33m5r5j19r1r0p4r7q0r1j35l8n2j24j15n4q8q4o1o4j02I378
$$ plain form
469753 36729 36676 36649 36573 36483 36442 36398 36326 36223 36143 36032 35941 35838 35721 35592 35453 35355 35224 35068 34940 34788 34670 34518 34322
470460 34171 34021 33842 33672 33511 33341 33125 32926 32732 32530 32370 32172 31964 31811 31569 31351 31159 30950 30740 30530 30296
471080 30075 29894 29639 29437 29221 28967 28763 28560 28332 28091 27897 27693 27466 27255 27027 26800 26553 26344 26140 25896 25649
471699 25463 25241 25037 24773 24598 24383 24173 23909 23715 23519 23310 23092 22908 22694 22495 22277 22099 21891 21665 21420 21246
472318 21097 20900 20694 20528 20325 20099 19946 19752 19591 19400 19193 18976 18849 18659 18456 18299 18158 17962 17819 17672 17457
472937 17318 17144 16985 16837 16661 16552 16388 16207 16073 15944 15799 15622 15498 15362 15178 15074 14954 14780 14642 14487 14365
473556 14255 14111 14007 13856 13737 13642 13505 13407 13258 13102 13007 12887 12774 12653 12533 12447 12355 12250 12118 11993 11915 11802 11692
474235 11625 11483 11367 11288 11155 11110 11015 10896 10805 10715 10641 10544 10464 10373 10238 10200 10148 10024 9909 9855 9767 9683 9622 9558 9456 9378
475001I332j11j02l9j34l5l7n9q3q0n8p9j02m0n1q5l4j07m8n2q7o3m0l7p8o1l9G527
475827G435j0q3m8o1k4j12m1j5o6k5o1m7q1m3q7Po2n6l0p7j0k4j02J6n2l0q4m0F053
476711E996l6n4m7Pn2n0n4j6m4l6k5p4j2k4m8m0l3o2l4Mp4lp5nm6m4j4m5k9m6D875
477655D780N3n3k3m2no2ml0l4k2j9k7p7%m5J7n1j1m0Mq6Oo3n0L4j4o4L5n8J0n9C996
478628C951Qj1n7Nl7n0k0km5mol8J8n4Oo5olo0L1o2l6M0j6o8pj3m0k0%k5l0Nk3C247
479689C216oQk1k6nj7k5j1j3k9l7J5m1J4m4l9J6j0rj7j2lj1k9m2K0j4l2jqn3OB747
480692B696j0j7Rm5KNl2l9M4n4K1k0j3mm7jj7J0k5k2K3j1j0l0lj0Jk3j6l3K8l7B311
481694B276L9k5K1om4k0m6m5N6j2k7K4k1j8l0K6k3J4k3qmk5j4qklj1K8o5kL7nA984
$$ plain form
475001 9332 9221 9119 9080 8946 8911 8874 8815 8732 8652 8594 8515 8413 8373 8322 8237 8203 8096 8048 7996 7909 7846 7806 7769 7691 7630 7591 7527
475827 7435 7425 7342 7294 7233 7209 7097 7056 7041 6975 6950 6889 6842 6761 6718 6631 6638 6576 6520 6490 6413 6403 6379 6277 6293 6241 6211 6127 6087 6053
476711 5996 5960 5906 5859 5866 5814 5764 5710 5694 5650 5614 5589 5515 5503 5479 5431 5391 5358 5296 5262 5266 5192 5189 5114 5109 5063 5019 5005 4960 4931 4885 4875
477655 4780 4833 4780 4757 4715 4710 4648 4644 4614 4580 4558 4539 4512 4435 4435 4390 4407 4356 4345 4305 4309 4223 4229 4166 4116 4150 4136 4072 4107 4049 4059 4000 3996
478628 3951 3959 3948 3891 3896 3859 3809 3789 3787 3742 3738 3732 3694 3712 3658 3664 3599 3593 3590 3530 3561 3499 3463 3503 3487 3419 3412 3399 3359 3339 3339 3314 3284 3289 3266 3247
479689 3216 3210 3218 3197 3171 3166 3149 3124 3113 3100 3071 3034 3049 3008 3022 2978 2939 2955 2945 2936 2919 2907 2904 2893 2864 2822 2842 2828 2796 2795 2787 2734 2740 2747
480692 2696 2686 2669 2678 2633 2635 2640 2608 2569 2613 2559 2580 2560 2547 2543 2496 2495 2478 2488 2463 2441 2464 2453 2443 2413 2410 2400 2401 2378 2362 2329 2357 2320 2311
481694 2276 2315 2290 2311 2305 2261 2241 2195 2150 2206 2194 2167 2191 2170 2152 2122 2148 2125 2139 2116 2108 2104 2079 2065 2057 2055 2052 2041 2069 2004 2002 2039 2034 1984
482697A951kj4J7j9j5j1M8m7j3J2k3j3j2J7k9nll1K7J2l6j9j4J7rrJ3j8m2mM2A719
483670A745o7K1j9Pm0K3%kk9%J3k3j1ml3K2J4l5J7l3K1k3rmmj2J6l6Ql8K6MK0A485
484702A500m8N9p1j1M5On7K0J0k5mk1L9Lj0l5jjmjqk2N3j07L3j8K8j2kM0l6k8A318
485704A331kl5j3j7K1N%Pnk1k0j1j3M5k3K0l8L7m1k3k9J4L1k0Nk1n3L4L0k6JkA156
486707A147QJ2n5K1Mk2NL5p1M0k3j2K9j8j6J8Lk6M6o4PK2nj3J7k4k1K5lMl3j5I99
487709A025kj3j0M0j2nl6O2j7l5K2k2kpJ3k7k4M5l3rj8J3K8l5jLK0m7J8moK3j6I31
488741I27j2k2J5ok7J8J5m5j8N2j9jJ3j3jpk2j7j0M7l4OnPKj0j9L6k2J4j4k0M1G95
489773H14j5k3L6L1k8l3J2K7l7K0l0K9k0rJj3J6lj6J0Ok2K1l3L5j8k4J5r%l7O9G53
$$ plain form
482697 1951 1949 1935 1952 1933 1918 1907 1955 1908 1895 1907 1884 1871 1859 1876 1847 1842 1839 1808 1835 1847 1811 1792 1778 1795 1786 1777 1790 1772 1730 1726 1768 1719
483670 1745 1678 1699 1680 1687 1647 1670 1670 1668 1639 1639 1652 1629 1618 1614 1581 1603 1617 1582 1599 1566 1587 1564 1555 1551 1547 1535 1551 1515 1523 1485 1511 1515 1535 1485
484702 1500 1452 1511 1440 1429 1474 1480 1423 1443 1453 1428 1424 1403 1442 1445 1435 1400 1399 1398 1394 1393 1385 1363 1416 1309 1342 1324 1352 1340 1338 1378 1342 1314 1318
485704 1331 1329 1294 1281 1264 1285 1290 1290 1297 1292 1271 1251 1240 1227 1272 1249 1269 1231 1268 1227 1204 1175 1189 1220 1200 1205 1184 1131 1165 1195 1169 1170 1168 1156
486707 1147 1155 1167 1112 1133 1137 1115 1120 1155 1084 1124 1101 1089 1118 1100 1084 1102 1105 1079 1125 1061 1068 1090 1085 1072 1089 1065 1044 1069 1066 1070 1037 1022 999
487709 1025 1023 1010 1000 1040 1028 1023 987 1049 1032 997 1019 997 995 988 1001 974 950 995 962 953 935 948 976 941 940 943 963 916 934 930 924 947 931 931
488741 927 915 893 908 902 875 893 908 863 845 897 878 877 890 877 876 869 847 830 820 867 833 839 834 841 843 833 814 850 828 842 828 808 849 795
489773 814 799 776 812 843 815 782 794 821 784 804 774 803 783 774 775 762 778 775 759 769 775 753 774 741 776 758 734 749 740 740 703 772 753
490776G32J0L0l6K4mk0k8NRqJ6Ml9J7mM6l0j5j7K4j7J4m0Mk5O5l2rLL2m9lk7K1F96
491837F88mlk9J1L2p9QL8kJ5j8Joom1K5Pj6K0l6K1m3L7L2n2J9J4j4k3j3J6j0K7E89
492869E69N2k7j4l0M2j5M3k6j3lnJ3Kj0j7RmJ1%k1K2Nk3J0k0L5m4LM0l4J6k0K4E46
493901E16K1j8L8k3N9o1n0L1QJ3k2NK3j5J5k3pPK1m3Mpj2M3%o%KJ6m3J8OmlOj4E01
495022D93k6L7j4K5n7qM4j5Pj7l0M2J3m9M4JMl1K8l7K7k7J5k7l2O9m1J6KKk1J9D63
496024D45j6JK7L2o1KJ9nk2pJ2K6Kj0p0N2PkK4l9K2m7M9k7kPj6L0j5J7k9J0k0C99
497056C98QQpK3l6j6RJ1l3K6JoNOk0J2j1l9L4OJ7PmnJ3m5K8Mpj8RK0k7K6j0j7C90
498177C79j2mqm1M7nj6L6k1J0L5m5J7jl9P1n8jJ6NKjjl0J2Rl0MjrJ7K9km7L2J2C11
$$ plain form
490776 732 742 772 736 760 756 736 708 713 722 714 730 734 695 712 708 754 724 709 692 716 699 713 673 677 652 717 685 676 679 711 662 659 632 653 696
491837 688 684 681 652 663 695 616 624 662 660 675 657 658 652 646 605 630 637 621 641 605 626 583 620 652 600 619 633 619 596 583 599 589 616 589
492869 569 621 594 580 550 592 577 620 594 581 578 573 586 588 578 561 570 566 577 577 556 578 583 560 570 550 585 541 544 584 550 566 546 570 546
493901 516 537 519 557 534 593 532 482 513 521 534 512 517 540 525 540 517 510 517 538 495 499 492 480 523 523 517 517 519 535 492 510 516 512 509 515 501 501
495022 493 467 504 490 515 458 450 494 479 486 469 439 481 494 445 489 490 494 463 491 454 481 454 469 442 410 479 438 454 456 458 437 456 463
496024 445 429 430 457 489 428 430 449 444 422 415 427 453 455 445 375 427 434 432 456 417 439 392 441 414 412 419 403 433 418 435 406 416 396 399
497056 398 406 414 407 430 394 378 387 398 365 391 392 386 391 397 377 389 378 339 373 379 396 403 399 394 407 362 390 394 387 369 378 398 371 397 387 370 390
498177 379 367 363 355 314 361 356 340 376 355 365 400 355 372 371 332 403 345 344 360 365 367 366 365 335 347 356 326 330 329 320 337 366 364 317 349 361 311
499297C55n2L0Qpk6M1m9J2J5nj0K7Ml6j9K4J3j4K4qRm0J2J8lPJoj5k7L5k4L0l5C46
500359C20Rn0RK1Qk5k6M2k5K2j6NJl3oK0JrJ1qK8qj0L2j7LQml0N3o4K0K4m9K8B81
501450B86k6K4J6l3K2k3K8l0qK6j7OL0k2K5k8Qm4M7J2ko2K2j3K3j3kL0m0M8j9B76
502423B57j2J7lPk4%K8Pl1J2j5k6K0N7o3Rk2kJ7Pj2nj0RN0k8N4p2J9k8M0qJ2oB13
503484B38j1k3L8j9j6j7L2K8j8j9K3k4K8J5k5k8K2L6n8OJ0J0Ko2N1k7lL8l2J2B05
504428A93L6Pj4j3oJ8lj3L2l8k0L9k7K6k7K2l5M1k6L2m6k6N3l0N2k2Nj3J6kONA94
505430B32o5K1%j4L9Kj6K5o6K4K4k9Joqj1K4l2L3K2j2Jk7L4%K4l0K2m9K5lJ6l9A66
506462A93Pm8J4oL5%mj4J5jl9K1m3N2k2QJ6mmk1mL9j1k8O9l6m7K3M0k0qk7j5J4A75
$$ plain form
499297 355 303 333 341 334 308 349 300 312 327 322 312 339 343 307 288 312 325 311 335 327 336 296 308 326 323 330 331 325 310 283 318 294 324 289 346
500359 320 329 279 288 309 317 292 266 308 283 305 289 294 295 262 256 276 277 268 279 271 299 291 281 313 296 299 307 303 273 326 262 282 306 257 285 281
501450 286 260 284 300 267 289 266 294 264 256 282 265 271 301 279 304 276 284 240 287 299 297 235 257 244 267 254 252 282 242 290 271 276
502423 257 245 262 259 266 242 242 270 277 246 258 243 217 237 294 231 240 218 216 233 240 228 223 213 222 272 244 298 226 245 217 257 249 261 255 213
503484 238 227 204 242 223 207 190 222 250 232 213 236 212 240 255 230 202 224 260 202 208 218 228 230 168 219 192 189 227 195 207 205
504428 193 229 236 222 209 203 221 218 205 237 199 179 218 191 217 190 212 177 218 192 224 178 152 205 175 227 205 210 197 213 211 217 222 194
505430 232 167 188 188 174 213 215 199 224 158 182 206 177 178 172 164 153 177 145 178 200 188 189 162 196 196 220 190 212 163 188 185 201 162 166
506462 193 200 152 166 160 195 195 191 177 192 191 152 173 130 182 160 168 184 180 176 155 151 190 179 151 220 184 137 160 200 180 172 145 130 144 175
507524A52L8l8J1mj1J3pjmMqKpKnK1oqK4%j0Pml6J0j5N3l2J0Rk9M8n3k0J7K3K4A58
508673A41%l4M4J2l3L4l5Qj6NM8m9K6Pl1KoL8l0j1LOL1k6L2m0l6K3L0k6M1kj4A12
509705A45K2l2jl4J1KnL7Nj8L1n5OK3J6m2J2mLl1M1l6L7Kn4N3k3K9K7k4k2%%J9A41
510767A35j8j4Qk5M8RJ6m3K1j8j2k4J9NL4om5K1j2L6l3k7O2J4r0N0kJ6RkmnNJ2A14
511828A17oK1l4K8m5L6mqoLMj6J0k8M5k6K2k8J4nKJ5K0j2l4Nj0K9%j0j0L0l5mA29
512890I3m3N3k8L3Lpoj6K1KJlkQl1RK9l8J1K5j7l1J1J8nN4p9NJ3j1Kl9K5J5J2A27
513981H2l0M3j4J5j0j3oL4k9J0M4l2j6Jj1K1l6J6K8j4RJJ7l6J2K6l6J8j3qJ8MI5
514983F2M8m9Pkml6O3Ll0jKQl0L1l9N5n4K1K4npJ1K3o0J5K0lm6K6K4%j5OK0rMF1
$$ plain form
507524 152 190 152 163 159 148 161 154 153 149 153 145 147 140 142 137 158 152 144 168 168 158 165 161 125 135 120 173 141 151 160 131 179 126 106 123 146 170 158
508673 141 141 107 151 163 130 164 129 137 121 126 174 125 151 158 127 129 123 161 131 120 123 129 160 134 166 126 90 113 143 117 158 156 142 112
509705 145 167 135 134 100 111 113 108 145 150 132 163 108 114 137 153 111 123 119 122 91 132 96 133 135 81 134 111 140 167 143 121 121 121 140 141
510767 135 117 103 111 86 134 143 159 116 137 119 107 83 102 107 141 135 90 111 99 135 102 75 137 151 61 111 109 125 134 132 128 123 128 140 114
511828 117 111 132 98 126 81 117 113 105 99 102 106 90 100 72 117 91 113 85 99 94 96 111 131 119 85 90 80 109 109 99 89 119 84 80 129
512890 93 50 103 75 108 111 104 98 82 103 105 106 103 101 109 78 87 116 78 89 114 97 66 77 95 90 144 65 70 83 72 74 35 60 75 87 127
513981 82 52 95 81 96 86 73 67 101 72 82 126 94 78 79 68 89 53 69 97 83 92 93 110 74 86 112 76 94 81 73 91 95 95
514983 62 110 61 68 66 62 26 89 92 62 61 63 71 41 72 33 88 34 55 79 74 67 78 101 41 56 76 73 27 53 77 77 62 68 88 79 83 61
516104F6qL0k6k0N9k3k2K6j5K6k7%k2j6L4j1N3k8m4L8qk3J5Mpm0P2m5J2J2rJ4G4
517106D8L4J6k8j7K0pj0KK7l0Rk6J7J0j0K4joJ3l6L2l0J0k9L7k2%%KL4k0J8nnG5
518168D1pK1M0m5K9k4j3oJ5j6k1J4M9jn1K6kL2k4k9M4MmLk5rJK3Rm0J8Nro1Q0E4
519259A8L6%L2p1MK5J3j5j4L6m3RJ9k4K3L%ql1K2%J3L5o1K3K5j5J4k1J0k0J2J2E2
520291D4k7J6nK1%qopj2jl3P1j6mj5L4k5l5N1J5k6nk1K4L6k3j7rJ8mJ2M1n4k0I
521352D6Pom4rM1%K3k8mK9j9Kk6K6J4l6L4Jm4j9K3j7J5N2j5k1J6j1jj5qJ0J8J8A5
522414C2Jl2J6Oj1KL2j7J8jj0o0L7%J4J9%k1k1oL4Pjk0j1oL9k3oJ2j4J5mMmlJ7C6
523564A9rJ2N1n0Oj4J0J4j3PK0j7oLk7pJL5n3N7j9j7rM0Mj1k5K6K2m0K5o4J2K6a1
$$ plain form
516104 66 58 88 62 42 101 78 56 82 67 93 66 66 44 28 62 51 104 76 32 70 62 39 54 58 51 11 83 38 50 62 53 67 74
517106 48 82 98 70 53 73 66 56 58 85 55 64 38 55 65 55 79 78 72 85 49 81 51 61 32 69 47 47 47 49 83 63 81 76 71 75
518168 41 34 55 95 50 79 55 42 36 51 35 14 28 77 76 25 51 49 81 57 28 72 76 72 75 50 41 42 65 74 34 52 57 48 -13 67 54
519259 18 54 54 86 15 19 44 57 42 28 64 21 30 49 25 48 51 51 43 12 34 34 47 82 21 44 69 54 68 47 57 37 49 61 52
520291 44 17 33 28 49 49 41 35 28 16 15 -18 53 37 33 18 52 27 -8 43 58 32 27 6 30 66 43 26 17 35 31 43 84 30 10 9
521352 46 53 47 3 -6 35 35 58 30 26 55 36 38 12 38 52 16 50 51 7 -12 11 -6 9 61 46 25 41 30 29 14 6 16 34 52 15
522414 32 33 1 17 23 12 14 46 29 47 46 36 -24 13 13 27 46 46 25 4 -2 32 39 38 18 7 1 40 17 11 23 9 24 20 24 20 17 34 36
523564 19 10 22 73 23 29 15 25 39 26 33 53 36 30 33 6 -1 0 35 -18 39 20 3 -6 34 38 27 2 28 50 10 35 -29 -17 9 -11
524625a2K4K9%n2JM1J2o2L9l1J4K2K2j9l7QJ1Ll9M9k9QLj1NJ0Pl7J9L9m9M3k1g
525657A5L8o5L8l4M0k8K0pj0K0m9M4k6RQJ4k6M1l0Nl9M0qk3J3nj1K6j8MJ1qrJ7A4
526718C0l0OmJ6j5Lk0nRmK6pj3J3j0NK6m9J6K2l7J2mL2Qpl9QO5o3L5n5J8J4j8e
527809b5kJ0JK7l3L6k5J8j6j5O2k7k7j0M2Jk6K2J9k7J8k1j5K7l1KK4rMJ8J1k5a3
528812a9K6j9L7l1k5J2L5k8J8N4n0j7lRn1oM5k4K0l0L4j0pK8J4o7K9L3k3oN7k2i
529814@Jj8QQNj6j1PKJ8l0L1l5QoJ9J7j9MOk1k4J3L3K1m5J8l1N2k1l8L4jk8J9b8
530905a6rK3m8K5L9n1L9Nm7j4N2k3Lj0L9k2L5l1nK0l8L8j4rj6K4k1Pk4J7M3m6c3
531908a4J4n2N6j6MJ7l9qQNL7Jl1Nl4K9j7nOK2K5l0Ml5K6Lj1J5K2j0n8L5k1L2i
$$ plain form
524625 -12 12 41 41 -11 -10 31 43 -19 20 -11 3 25 47 28 -9 -1 10 13 -26 23 -6 2 5 -6 -1 9 16 -21 -2 37 -12 31 10 -7
525657 15 53 -12 26 -8 32 4 24 17 7 27 -22 22 -4 5 13 27 1 42 12 17 -22 18 10 -13 0 -5 -16 10 -8 -4 7 -1 -10 7 14
526718 30 0 6 2 18 3 6 -14 -19 -10 -14 12 5 -8 5 -5 0 26 -23 -7 15 -22 -10 -14 18 26 19 -20 -12 53 -10 25 -30 -12 2 -16 -5
527809 -25 -27 -17 -16 11 -22 14 -11 7 -9 -24 38 11 -16 -26 16 17 -9 13 32 5 23 2 -13 14 -17 -15 9 0 4 22 33 8 -13
528812 -19 7 -12 25 -6 -31 -19 16 -12 6 60 10 -7 -10 -1 -52 -58 -13 -37 -17 -47 -13 -23 -30 -2 12 -55 -26 7 -16 -22 35 13 -9
529814 0 1 -17 -9 -1 4 -12 -23 -16 -14 4 -26 5 -30 -22 -28 -9 8 -11 -7 -1 -22 -46 -33 0 21 -24 -6 -37 15 -6 -44 -10 -11 -39 -20 -28
530905 -16 -25 -2 -50 -25 14 -37 2 7 -40 -54 -2 -25 -22 -32 7 -15 20 -11 -16 4 -34 4 -10 -19 -35 -11 -32 -25 -49 -32 11 -35 -33
531908 -14 0 -52 4 -12 -8 9 -30 -38 -30 -25 12 13 -18 -13 -47 -18 -35 -40 -34 -12 13 -17 -13 -48 -22 -19 -30 -15 7 -3 -61 -26 -47 -15 -9
532969iNj0jL1j6j3OKRk4j3K8pj8K3m0O1ol6KL1k9NJ1K5k2k4K7m7L5m5L4j9K3f
534031c4j7K3M2j8k8L5m8J0l1L0K4NOPo3K7M0o0J7L2n6O8j5Pl9KJ8Rj7j5NJ3j3f5
535063A1n2nM7m2L1k4Qj0M8k3jj0j8L7m4K6Km3J5J3J3j8PK7k7J2k7M4o7KP5l4e3
536065e2N7m9K1L1k1j3Nj3J5orj8j8L9Pjmqj7JmO0o0M5m7J6RJqPk2J7Rl7LL3k7e3
537215d0qJ0j4J3j3K7pm1J1M2j9J0m6K8j3K3Q%qJ3m2J7J9K3k2m0kK9J3LjqJ1kb2
538277a1n4M4j9Kj3%K1l9N1k1k1N5pn3N8n5MJ3L8j7Rj7Lnj5K2j8J3J0m0L2Oj1f5
539309c5pjK7k6k2KJ5JK6k4Mj3nj5QL2qM0n8L9k8k6J8J3L4l0k2K5j1J1K7k2o%a
540370c0j0K4j2m5K6l8J5J6K9l3KoL5l0j6%K9k8M8j1J8n0k4O9l9j7L5j5L3j3k4g6
$$ plain form
532969 -9 -4 -14 -15 16 0 -13 -7 -5 4 -20 -33 -5 -12 -30 -7 -47 14 8 -28 -26 5 -24 -19 -8 17 -5 -29 -2 -49 -14 -59 -25 -44 -21 -6
534031 -34 -51 -28 14 -4 -32 3 -45 -35 -66 -36 -12 -7 -1 6 -57 -30 10 -50 -33 -1 -57 11 -4 3 -36 -34 -16 -7 -24 -39 -34 -21 -34 -65
535063 11 -41 -46 1 -41 -10 -34 -26 -36 12 -11 -12 -22 -40 -3 -47 -21 -19 -62 -47 -34 -21 -39 -32 -5 -32 -20 -47 -3 -70 -68 7 -27 -53
536065 -52 5 -44 -23 8 -13 -26 -21 -34 -19 -25 -34 -52 -70 -31 -24 -25 -29 -37 -54 -53 -57 3 -57 -12 -59 -43 -34 -33 -41 -34 -56 -39 -30 -67 -64 -31 -58 -53
537215 -40 -48 -38 -52 -39 -52 -25 -32 -73 -62 -20 -39 -29 -75 -47 -60 -37 -29 -29 -37 -24 -66 -49 -30 -7 -29 -69 -71 -42 -29 -26 -27 -35 -24 -26 -22
538277 -11 -65 -21 -40 -38 -51 -51 -30 -69 -18 -39 -60 -5 -12 -65 -7 -62 -58 -45 -7 -24 -15 -32 -29 -34 -49 -27 -45 -32 -22 -62 -30 -24 -35 -65
539309 -35 -42 -43 -16 -42 -64 -62 -47 -46 -20 -44 -40 -53 -58 -73 -65 -33 -41 -1 -59 -20 -48 -74 -56 -43 -9 -39 -61 -36 -47 -36 -9 -31 -37 -37 -1
540370 -30 -40 -16 -28 -73 -47 -85 -70 -54 -25 -58 -56 -62 -27 -57 -73 -73 -44 -72 -24 -35 -17 -67 -91 -22 -61 -78 -43 -58 -25 -38 -62 -76
541343e3oj9K4l1O3Mj2l7QNmM4k7k3K6l2J4MJ0k1L0Rk9N9n0mJ3m7M7j9Mk4J9Re6
542405f3j0N0j1k5k0K9j9K5Mk3k8P0j4k0K3J0m2LNJ4om7N7rk5M2m0N7k8Nql7k9c6
543437b1j2k3k3O0o1pL2oJ1j0qJ5J8k2J0Rj2J3j9qOqJ6orJ9l2L5LJ0k6K6m7L0h0
544498d7m7Q9o4M4k2Kk4MJ2j3K0k8J6J4j4J5j2m3M0J4rl7K4M0pj8k2M5mk6JPk3b1
545530c8k6Nj9L6k6j1K3j6M5m3J9%K0j9K2n9M9k2Ql3N0l2j2L7Jk7N2m6L3k1K4c8
546503f6nJ5K0j5k4K2k5L1k5L8k5jJ8m7J6kQRL3o2L8Kn3M5lrM3l7k5L7pk9K0Ne9
547565d1j4Pk2M4qj5Lm2J6M2k4Mk3%pL7j4l4L5k6K8pj1oj6K%L1J7Km0K5k7M6m3c7
548656c7l5L8l4j7N9o4RKoJ7QlJ9l2J9jj5J9j0J9o0L2L1J4m6l3P9j7m3K7j8K0g1
$$ plain form
541343 -53 -59 -78 -54 -85 -22 -18 -30 -67 -59 -54 -58 -14 -41 -64 -38 -70 -56 -52 -42 -63 -33 -24 -53 6 -44 -48 -35 -82 -35 -54 -50 -74 -55 -46 -56
542405 -63 -73 -23 -34 -59 -79 -50 -69 -44 -40 -63 -91 -21 -35 -55 -32 -22 -64 -61 -56 -42 -48 -95 -38 -47 -72 -30 -70 -13 -41 -36 -44 -81 -110 -36
543437 -21 -33 -56 -79 -19 -80 -87 -55 -61 -50 -60 -68 -53 -35 -57 -47 -38 -50 -37 -56 -64 -58 -66 -50 -56 -65 -46 -78 -43 -40 -30 -56 -30 -77 -47 -80
544498 -47 -94 -5 -69 -25 -47 -45 -69 -65 -53 -66 -46 -74 -58 -44 -58 -43 -55 -98 -58 -44 -53 -90 -66 -26 -33 -51 -73 -28 -32 -58 -57 -50 -73 -21
545530 -38 -64 -59 -78 -42 -68 -79 -56 -72 -27 -70 -51 -51 -31 -50 -28 -87 -38 -60 -52 -85 -35 -67 -79 -42 -41 -68 -16 -62 -29 -50 -26 -38
546503 -66 -71 -56 -36 -51 -75 -53 -78 -47 -72 -34 -59 -60 -42 -89 -73 -75 -67 -58 -25 -87 -49 -47 -100 -55 -58 -67 -24 -61 -86 -49 -56 -85 -65 -60 -59
547565 -41 -55 -48 -70 -26 -34 -49 -46 -88 -72 -30 -54 -50 -73 -73 -80 -43 -57 -91 -56 -82 -54 -61 -72 -78 -94 -92 -92 -61 -44 -42 -82 -57 -84 -38 -81 -37
548656 -37 -72 -34 -68 -85 -26 -90 -81 -79 -85 -68 -60 -63 -44 -76 -57 -58 -73 -54 -64 -45 -105 -73 -42 -28 -74 -107 -28 -45 -88 -61 -79 -59 -71
549658f4j6J3J8k5jl6N8lj0J2j2Nj9J1K2J8m8j1K5J1j0Pl4K1j7J3ok4K5L1o9J1d2
550661c4m0J6Jqpk7K5o6N8J6J5l7Lj2K0L3m8L8n0L1j2lojL5J4Lj0J7o0N8o0OQa03
551722h7PqJ4pJ1J1k4JK9k2J0Mj1j2%L0j0MnM0o6j0%J7J3NJ9j9k1K6L1j5n2J9c6
552784h2J0L9m7K0K3j9k6j2K1LlK5rk5J1J8qk0Rl9J9L3l9K8J2k2Kj6L6Pn7L3j5a04
553815f3j8j7L2l1L1nm1M4J5qj3k1O3m7M5n5J9j7L1l2N2n9J5m3M9n3N8J8l8J9f7
554759i3RPM1l5J7Kk7l7M8kkj3j7N2Lk8K7L6n8l5K8K4Ql4N2p0N0j4nk6J4K0j4h1
555791f5k8qM2jk2NO3p1QL1m6J4rJ4Pj6K1Pk8j1J5NoK5mNl8L1l2L4Rm4J5K0J6f0
556882d7j8J8L3k4n5M7nj8M2p4J1j6J2OJ2mOk2lJ8%j1kkM3m8L1k7jL2J4k3k2N8h4
$$ plain form
549658 -64 -80 -67 -49 -74 -75 -111 -53 -56 -66 -54 -66 -61 -80 -69 -47 -29 -77 -88 -63 -52 -62 -55 -89 -68 -85 -72 -78 -102 -77 -46 -115 -104 -42
550661 -34 -74 -58 -57 -65 -72 -99 -74 -140 -82 -66 -51 -88 -85 -97 -77 -44 -92 -54 -104 -73 -85 -88 -94 -95 -60 -46 -43 -53 -36 -96 -38 -98 -92 -84 -103
551722 -87 -80 -88 -74 -81 -70 -59 -83 -82 -53 -75 -65 -61 -72 -84 -84 -54 -64 -60 -65 -25 -91 -101 -101 -84 -71 -66 -47 -66 -87 -61 -30 -45 -97 -78 -36
552784 -82 -72 -33 -80 -60 -37 -56 -82 -94 -73 -70 -73 -48 -57 -82 -71 -53 -61 -81 -72 -111 -92 -59 -98 -70 -58 -80 -78 -94 -58 -51 -108 -75 -90 -104
553815 -63 -81 -98 -66 -97 -66 -71 -112 -68 -53 -61 -74 -95 -32 -79 -34 -89 -70 -87 -56 -88 -36 -95 -80 -123 -74 -127 -69 -51 -89 -70 -67
554759 -93 -84 -77 -36 -71 -54 -52 -79 -116 -68 -70 -72 -85 -102 -50 -47 -75 -48 -12 -70 -105 -77 -53 -45 -79 -27 -97 -47 -61 -66 -92 -78 -58 -72 -81
555791 -65 -93 -101 -59 -60 -82 -77 -14 -85 -77 -46 -92 -78 -87 -73 -66 -82 -61 -54 -82 -93 -78 -73 -79 -54 -58 -53 -91 -60 -92 -58 -49 -93 -78 -58 -42 -60
556882 -47 -65 -47 -14 -38 -93 -46 -51 -69 -27 -101 -90 -106 -94 -88 -76 -80 -74 -96 -99 -81 -81 -92 -94 -96 -53 -101 -70 -97 -98 -66 -52 -75 -97 -39 -84
557943g7j8L9j1qm0L1J2lK5l3J0Kk4lN1n6k1M4L2m8j1N1l3K2n1J7J9M7k9l2LQa11
558946i0J4J6k0j9nOpJ8L9J1k1j4J6j7J1l3J4L5k0Jl4K9jj1OkJ3l6MJ1opJ2PRc6
560037f7j1pRj6J1O%Rk1qK7o0L0K4kmj5Ql2M3n5P4k8J2k1KJ1j9rN6K1k3o1L5M1a15
561128f3j3K7l3j3j6J0Pk1RM4m6K3j7pK2j5J0K8j6l0N7k4K3k2m0M1M%l8J6k6M8g3
562130g6J6m4K7%J2l3K7k7NJ5l8J6K2K8j1k5l6K6J5k%k5M9n6L4l1j1K0OK4%k6a04
563133g9j6k0M5k9J5Ml5M3J3k8j7JoN4k8j2KJ3k9K3J7k4l2L5oJ8k2jJ4kK9k6lf9
564165a01J9J0j6l8L8L5k0M4q5nN4l9J2rK4l8LK1k3L8j3mK0j3K2k9J8lj5K7k4i3
565138a24J2QL4j9J1m3J8jL2k9OJ4j9M3k3L6n6Jk1M1%J9l0Ql2k3M8J7K6p2K7og2
$$ plain form
557943 -77 -95 -56 -67 -75 -115 -84 -72 -75 -50 -83 -73 -71 -95 -98 -47 -103 -124 -80 -48 -96 -107 -56 -89 -67 -118 -101 -82 -35 -64 -96 -93 -85 -111
558946 -90 -76 -60 -80 -99 -104 -98 -105 -87 -48 -37 -58 -72 -56 -73 -62 -95 -81 -46 -66 -65 -99 -70 -71 -82 -76 -78 -65 -101 -97 -86 -92 -99 -87 -80 -71 -36
560037 -67 -78 -85 -76 -92 -81 -75 -75 -66 -87 -95 -68 -128 -98 -74 -76 -80 -95 -87 -119 -76 -131 -57 -85 -73 -94 -92 -81 -100 -109 -53 -32 -55 -116 -81 -40 -115
561128 -63 -76 -49 -82 -95 -111 -101 -94 -115 -106 -62 -108 -85 -102 -109 -87 -102 -92 -64 -80 -110 -53 -77 -54 -76 -116 -75 -71 -71 -109 -93 -119 -71 -73
562130 -76 -60 -104 -77 -77 -65 -98 -71 -98 -93 -78 -116 -100 -78 -50 -61 -86 -122 -96 -81 -83 -83 -108 -59 -115 -81 -112 -123 -103 -97 -73 -73 -99 -104
563133 -79 -95 -115 -70 -99 -84 -80 -115 -72 -59 -87 -104 -103 -109 -55 -83 -95 -93 -80 -109 -86 -69 -93 -125 -90 -96 -78 -100 -101 -87 -89 -60 -86 -89 -69
564165 -101 -82 -72 -88 -126 -88 -53 -73 -29 -114 -119 -65 -104 -92 -101 -77 -115 -112 -91 -114 -76 -89 -93 -73 -86 -64 -93 -75 -78 -93 -66 -90 -93
565138 -124 -112 -104 -70 -89 -78 -121 -103 -104 -72 -101 -95 -81 -100 -57 -80 -44 -100 -99 -120 -79 -79 -60 -90 -82 -114 -137 -89 -72 -46 -118 -91 -97 -72
566140a02OO5r9PJ0J6j4J7l9K5j9K6J0J5%l6N2n5K1J5k6K3l2ON1n4kL3m9RL1rg9
567143f2m9M4k6jj1K4m4K7Ol9N5J7l2j6j3ML9K1%m9L2k6J5PL4l3j1j0j1N6p8L9c5
568145h6J0Qrk4L6nm9N5o8nK6%M1l1jL2k9j4%N0k1j8kN0l1pj5j5lM8Ll4L4j2j1a09
569236a30J1k2N1mj5L5pJ4Ml2N0j06P3n3K3J7MLJ9n4N0k5Jlk1L4k9J7j0l6K0Jg3
570239a29O8mj8lj7J3k1J8j8jj3L4l2N4l1KRJ1k0RL3p4M8j6j6JL4jlMm8J4j8O1a19
571300g3k3pl2L2KJPk9JJ7Ol%M1l1qJ7Pn6L0l1Q1n4J3n8N2OPkn7K9N1n2K4k1M7g3
572421a01M1m9j7oK8RK3j9Pj5mk2J9L5%j0o6Q8o0j0L5K8m9QOj9L5j2m6L0M1MK2f8
573453i4n8M0m5P5M4q4kK1Kk9K8J0j5L2l1j3Q3l4k3J7l4M0k7J4N%pqk2K0Kj3m5h5
$$ plain form
566140 -102 -96 -31 -130 -123 -113 -97 -111 -94 -133 -108 -127 -101 -91 -76 -76 -112 -60 -115 -94 -79 -105 -82 -114 -108 -57 -111 -113 -80 -129 -120 -89 -98 -79
567143 -62 -111 -67 -93 -94 -105 -81 -125 -98 -92 -131 -76 -59 -91 -107 -120 -116 -77 -56 -56 -105 -73 -99 -84 -77 -43 -76 -87 -97 -108 -52 -130 -91 -35
568145 -86 -76 -68 -77 -101 -65 -70 -119 -64 -132 -137 -111 -111 -70 -101 -102 -70 -99 -113 -113 -63 -84 -102 -104 -54 -85 -92 -107 -122 -125 -77 -74 -108 -74 -86 -97 -109
569236 -130 -119 -141 -90 -94 -109 -74 -81 -67 -63 -95 -45 -151 -78 -131 -108 -91 -87 -84 -65 -119 -69 -94 -93 -96 -117 -83 -112 -95 -105 -141 -121 -120 -73
570239 -129 -61 -65 -83 -86 -103 -90 -111 -93 -111 -112 -125 -91 -123 -69 -100 -98 -89 -78 -98 -89 -56 -130 -82 -98 -114 -113 -79 -80 -83 -79 -127 -113 -131 -70 -119
571300 -73 -96 -103 -135 -103 -101 -100 -93 -122 -121 -104 -98 -101 -101 -60 -91 -99 -82 -75 -131 -101 -132 -51 -105 -92 -150 -98 -92 -85 -87 -144 -115 -64 -116 -92 -113 -66 -73
572421 -101 -60 -109 -126 -132 -104 -95 -72 -91 -84 -99 -103 -125 -106 -71 -71 -81 -147 -59 -119 -129 -94 -66 -115 -107 -101 -120 -85 -97 -143 -113 -72 -68 -46 -68
573453 -94 -152 -112 -157 -82 -38 -122 -124 -103 -101 -130 -102 -92 -107 -75 -106 -119 -36 -70 -93 -76 -110 -70 -97 -83 -78 -78 -85 -93 -115 -95 -93 -106 -151 -85
574485a23k9O1m2L0M2n9nN2Km3N8qMo7KM2jJ1lpL2n3J8k4L7Nq7P9J3l7K5%Pn8a21
575546h9K2p2NK5K2l4J5j9JM6l7KJ7J9k6M2J1q2M3K9no3M2M9q4K6K3k5J6j5J3f1
576519a41O7Lj8k8J7k1J07m6j1j20J71Rm3L7j11P6O1J4j94R9pK9R1k15RQ8N0M6a60
577404A82j21m79J06m4J67N3j42R4L3J0O9L2j84J64l9Jm8l2P2k7k4O9k0j06J36i8
578200a14J0m5P6l8m6oM7N4q5R7l6j1J4j9m1N0n7O9p8J9N6k9J8n6J7J7j1o7J09a03
579114a29J9L6k5j4JM9m6m3Q0m2N8o4J8K7mk8K1l4M6l1n2K3L9mo6O4mK0m2m1Q8a32
580087g9n2O7q9M9nlL1K8l3j4rj8M4m3M1k8M7n5J4NJ8p1N0lk5J3K2k3lJ0L4j15a09
581089g6k5M1m5J6l7om6P9Pn5J6m1O0mK1J6l4qM5m3jlJ3Mj4Mj0JlK5l1K4lJk4g8
$$ plain form
574485 -123 -152 -91 -133 -103 -61 -120 -125 -73 -71 -114 -56 -64 -60 -127 -125 -83 -84 -73 -76 -83 -51 -104 -86 -110 -73 -68 -155 -76 -63 -100 -75 -75 -68 -126 -121
575546 -89 -67 -139 -134 -109 -87 -121 -106 -125 -124 -78 -115 -113 -96 -77 -103 -61 -50 -132 -89 -60 -65 -128 -86 -37 -121 -95 -72 -97 -81 -96 -83 -61
576519 -141 -74 -71 -89 -117 -100 -121 -14 -60 -71 -191 -20 -11 -54 -17 -128 -52 9 23 -171 -72 -79 -50 41 -174 -165 -77 -27 19 -160
577404 182 61 -418 -312 -356 -189 -136 -278 -184 -151 -141 -72 -40 -224 -60 -99 -98 -146 -178 -106 -133 -157 -88 -108 -214 -78 -98
578200 -114 -104 -149 -73 -111 -157 -163 -116 -62 -147 -50 -86 -97 -83 -102 -143 -93 -150 -81 -159 -140 -84 -113 -95 -151 -134 -117 -128 -195 -86 -103
579114 -129 -110 -74 -99 -113 -112 -63 -109 -152 -72 -114 -56 -120 -102 -75 -79 -107 -86 -120 -74 -105 -157 -134 -95 -99 -165 -101 -105 -85 -127 -168 -80 -132
580087 -79 -131 -64 -153 -104 -109 -112 -81 -53 -86 -100 -109 -127 -83 -126 -85 -113 -66 -121 -107 -102 -84 -155 -105 -108 -133 -120 -98 -121 -124 -114 -80 -195 -109
581089 -76 -101 -60 -105 -89 -126 -132 -178 -99 -92 -147 -131 -172 -112 -116 -95 -79 -113 -121 -76 -119 -120 -123 -110 -106 -120 -116 -126 -125 -128 -103 -134 -110 -113 -112 -136 -78
582180f7l0n0L7J1L3m6k8P2m3m7K6j0L3L6o5J4MK7Rl4Rom3J3M4j3j8K1J4l5M6a09
583153a19K4k0L8k3k0mM1j5l6J4KL0q3L3LK9j0K5j1j1J7K9m3k7J0j2L3oK3l1J0h5
584126i3k3L2k8j5J2j7L6m4J1%k6O6k3K1j3j2M6o7JK1L5p3K9JrJ6j8j6L7PJ0l5a18
585129f3k4o1M7m2J8M5n6M4j2NJ1n5K6qJ9k2OK1j3PrnrL4Jm6L0lRj1j5N1k2n3h4
586190a37J6L4j8j4k2J9kJ3K7m9K1j3J4l5O1k6pJ4j5qMk7K0QrM3k3ojm7O6KNj9a17
587252a46J3L7j6Rl9rj3O4m0PO2o8jL3j3oKM2k7PO%n3L3J9Ml0Qk0J7nK1k3L6k4a40
588343a35N4j3k5k4j1J5J1jlMK9m8J7J7M6n8Nm7M5NM1n1K0jnOj2j0K9rMk3KQj8a11
589434a30qL2l8M3Kj8KJ3rk2J3RrrNP2p3nJ5qmJ8MJ2l4LmMK0J3k1J7m5L6j8k9a26
$$ plain form
582180 -67 -97 -147 -110 -99 -66 -112 -140 -68 -111 -158 -132 -142 -109 -73 -138 -124 -120 -93 -84 -118 -109 -115 -158 -145 -101 -114 -132 -111 -97 -132 -86 -109
583153 -119 -95 -115 -77 -100 -120 -124 -83 -98 -134 -120 -118 -88 -171 -138 -135 -106 -116 -91 -102 -113 -96 -67 -110 -137 -127 -139 -106 -112 -89 -120 -110 -85
584126 -93 -116 -84 -112 -127 -115 -132 -96 -140 -129 -129 -155 -89 -112 -91 -104 -116 -70 -137 -136 -115 -80 -153 -124 -123 -132 -116 -134 -150 -113 -106 -96 -131 -118
585129 -63 -87 -148 -101 -143 -125 -80 -136 -92 -104 -99 -88 -143 -117 -125 -106 -128 -122 -101 -114 -107 -116 -121 -130 -96 -95 -141 -111 -114 -105 -116 -131 -80 -102 -155 -84
586190 -137 -121 -87 -105 -119 -141 -122 -124 -111 -84 -133 -112 -125 -111 -146 -85 -111 -118 -104 -119 -127 -123 -150 -130 -122 -131 -88 -111 -117 -118 -165 -99 -97 -92 -111 -117
587252 -146 -133 -96 -112 -103 -142 -151 -164 -100 -140 -133 -71 -139 -140 -107 -120 -126 -124 -82 -109 -102 -96 -96 -149 -116 -97 -93 -123 -115 -135 -118 -123 -102 -125 -89 -113 -140
588343 -135 -81 -94 -119 -143 -154 -139 -128 -129 -132 -128 -99 -147 -130 -113 -67 -125 -120 -167 -122 -117 -76 -127 -107 -108 -113 -107 -119 -129 -100 -109 -105 -128 -126 -118 -136 -111
589434 -130 -138 -106 -144 -101 -99 -117 -115 -102 -111 -133 -120 -111 -120 -129 -124 -52 -125 -130 -115 -123 -127 -109 -105 -93 -127 -124 -128 -124 -104 -91 -112 -95 -140 -104 -122 -151 -126
590554a08k0QmLKJ3k1l3K5K5l9k0O9j2j6Oj1RJJ1j6RQl8M8j0k9Ok4M9Mm9M6k4i5
591616a11K6o7PJ9km7Q2Jj3k5K5j9Jj0j0J4OMK0kJol1L7k8M1m1RNJ5k1j6K1k%a04
592707a13J3lRj7k2J3L5m8k7M1L5l1j1K5oJ3l5rKL3j6J0J1j7J9j2Lm6L4K7j0n0a26
593709a21pK5l4M4qj3J7m2NPJ4Oqm1LK8k7N5l2K4pk0%K4J%k9J4m3M5Ol6jK6j2a38
594800a36J2J3mj5k6M0j3j4N7k1j1k8Rj6O2m0K2K9n4J8kk7N1Jj7j7K9k3J1l1N4a28
595773a32l6P9k2k2kK2QoKqn9L0N6m7L4k4Ql6K5k5L2j3K0lPk4J4j9qL9Oj1j3k3a78
596835i0n7J5LL4k0kKk5K8L2j6l7QnNm0kP3l2j5pL2l4J6M5m4M2j1l5L4Pll1NL2a17
597925a46J3K8Ml5j7K9J0n6P1Ql8l0M9Kk9JK6j8NJ6m2PJ0J4nj9Jj4J6J9k8M2j2a24
$$ plain form
590554 -108 -128 -120 -124 -121 -119 -106 -127 -160 -135 -110 -149 -169 -100 -112 -128 -122 -133 -124 -123 -112 -128 -119 -111 -149 -101 -111 -140 -134 -158 -109 -105 -154 -108 -132 -95
591616 -111 -85 -152 -145 -126 -128 -175 -93 -92 -105 -130 -105 -124 -123 -133 -143 -129 -123 -119 -99 -101 -100 -106 -137 -100 -128 -87 -128 -119 -114 -99 -120 -136 -115 -117 -117 -104
592707 -113 -100 -103 -94 -111 -133 -120 -85 -133 -160 -119 -84 -115 -126 -101 -107 -94 -129 -138 -136 -103 -119 -109 -98 -115 -96 -108 -105 -151 -117 -90 -100 -150 -126
593709 -121 -128 -103 -137 -93 -101 -114 -97 -139 -134 -127 -113 -107 -115 -156 -153 -125 -152 -97 -129 -105 -112 -132 -132 -108 -107 -107 -136 -122 -165 -120 -114 -150 -151 -125 -137 -138
594800 -136 -124 -111 -115 -130 -156 -116 -129 -143 -86 -107 -118 -146 -137 -153 -91 -131 -109 -80 -134 -116 -118 -145 -94 -93 -110 -127 -98 -121 -110 -141 -87 -128
595773 -132 -168 -89 -111 -133 -135 -113 -105 -111 -109 -117 -176 -146 -90 -137 -103 -127 -119 -155 -130 -155 -123 -136 -116 -119 -112 -136 -122 -141 -149 -110 -104 -115 -128 -151 -178
596835 -90 -147 -132 -129 -95 -115 -117 -115 -140 -112 -80 -96 -133 -125 -130 -125 -165 -167 -94 -126 -141 -148 -116 -150 -134 -89 -133 -91 -102 -137 -103 -96 -99 -130 -125 -93 -117
597925 -146 -133 -105 -101 -136 -153 -124 -114 -170 -99 -91 -129 -159 -110 -108 -137 -136 -110 -128 -123 -107 -149 -142 -132 -118 -123 -142 -141 -155 -139 -120 -148 -106 -118 -124
598958a11o4J9L9l5K4jL7m1Oj8mj0K6J9j4KL3m0oN8k7km5K5K2j4k0L2J9o7K0Qa21
599960h2j8k6J6ol0L2Rm9M4j0j6K0kRj4j9L5j6opj4J2J7j9J1K4j2j9l3M8j5m1a21
600963a32K8k9k2N5mm7J8J3j3j3J9qjMRkl5L0%N0k6l4J0J9mk1J4J2j9j7K2J7J0a62
601994a10j3l1K4l1L0M3l8KJ7J3j4Lm3J6J3j0QOmk8J0%NjJ4k0K1m8%P0p7N5jk0a11
603056a44K3lk3k8J8K9pL3k6k4L8J0k4qJ2k4K0PK1m5j4QL6lm2L4qK7j3k5oJ2O1h1
604088a80K0J8J5k3K6NNJ7n4K4J8m0K0j6K4l0N4j8k8k4M2LJ9p4K9j3O4k4k3J6a03
605031a17j1L2n7J6M7m7K2l3L1k4K4m4L9K8lm0nK3K8ql6K4Jl6J9Kj2J5J1l2QJ4a57
606034a62L3JL2k4k6J5L2j9J0m4Ok9J6L8j6j8K5L1m8L7n0L0ok2k1M5l0J1K7Ll4a34
$$ plain form
598958 -111 -175 -156 -117 -152 -128 -129 -92 -133 -127 -145 -149 -159 -133 -114 -128 -126 -93 -133 -139 -81 -108 -110 -155 -130 -108 -122 -142 -110 -91 -158 -138 -130 -121
599960 -82 -100 -126 -110 -116 -146 -114 -105 -154 -110 -120 -136 -116 -118 -109 -123 -142 -107 -123 -129 -136 -150 -138 -121 -140 -129 -105 -117 -136 -169 -121 -136 -177 -121
600963 -132 -104 -133 -155 -100 -104 -151 -133 -120 -133 -146 -127 -135 -136 -132 -123 -125 -160 -130 -130 -80 -106 -140 -130 -111 -115 -136 -122 -110 -129 -146 -124 -107 -97 -162
601994 -110 -123 -154 -130 -161 -131 -88 -126 -124 -107 -94 -108 -105 -148 -132 -119 -129 -121 -115 -119 -147 -137 -137 -132 -133 -119 -139 -118 -166 -166 -96 -173 -118 -119 -139 -111
603056 -144 -121 -124 -147 -175 -157 -128 -135 -102 -128 -152 -114 -104 -128 -136 -124 -148 -128 -121 -100 -145 -159 -151 -115 -118 -160 -126 -134 -107 -120 -145 -151 -139 -78 -81
604088 -180 -160 -142 -127 -150 -124 -119 -114 -97 -151 -127 -109 -149 -129 -145 -121 -151 -97 -115 -143 -167 -125 -122 -103 -177 -148 -161 -97 -121 -144 -128 -103
605031 -117 -128 -96 -153 -137 -90 -137 -115 -148 -117 -141 -117 -161 -122 -94 -97 -137 -142 -119 -91 -99 -135 -111 -110 -146 -127 -125 -137 -122 -111 -143 -135 -121 -157
606034 -162 -129 -128 -96 -120 -146 -131 -99 -118 -108 -152 -146 -175 -159 -121 -137 -155 -130 -99 -147 -110 -160 -130 -136 -158 -179 -134 -164 -153 -126 -123 -157 -134
607007a00n0N2m5JJ0j4K4j4J7k0J4j7k0RQKL7k6j1K3J2n2L7k7j3pM7MrK6n0J2a26
608009a55N7n0J2l6N8J9m3J6rQol1M8j2l9M7k1nL2k7lK2RKKk3j4j7K9nK9jk9L0a85
609071a24Ql4K9ok0j0L3mrOm6O7l1J7J6m7M9k5K3j2j7J3j0j3k7K3M4m0J9J1k0a34
610044a34Ll2M4K5j1rKl7K5pKj7N8n6K5mn1N3l4L6m4J4lM7k3oJ9j6l4L9J2k1La22
611076a40J3l0L5j9k1L3J5n%m4K5J9j0j8QKK5l6qQkj1Q0m2j3k0K1mk1qj0M2Qka49
612137a32Qnj7Lj1oKjJ2K1l4M1j4j6Rj3M5l6M7n1Pj7pN5o4N2kok5J1J1Mj2j0M7a44
613228a16j0pMPl8l5M1j3K8j3J1K6m7kM4j3j8j9O8n2j4L6Jj4J7j8K8Nqj6J1j4a19
614231a51j0J7K7Pl7j4L2Nljl1K1nl0J9KL2rn1M4pL3k9lj1JQJ0JJ9m1l2J9N3ra30
$$ plain form
607007 -100 -150 -98 -143 -142 -132 -146 -122 -136 -119 -139 -125 -142 -162 -153 -145 -143 -106 -132 -143 -120 -108 -160 -123 -150 -163 -170 -123 -119 -128 -102 -152 -140 -126
608009 -155 -98 -148 -136 -172 -114 -95 -138 -122 -131 -123 -129 -160 -112 -124 -163 -116 -137 -142 -110 -137 -140 -118 -109 -107 -105 -128 -142 -159 -130 -135 -106 -107 -136 -106 -185
609071 -124 -116 -150 -121 -127 -147 -157 -124 -128 -137 -131 -177 -110 -141 -124 -108 -155 -106 -131 -108 -120 -137 -124 -134 -147 -174 -151 -107 -147 -128 -117 -137 -134
610044 -134 -131 -163 -119 -94 -105 -114 -112 -149 -124 -131 -129 -146 -88 -144 -119 -123 -174 -121 -155 -119 -163 -149 -152 -105 -128 -134 -115 -131 -165 -126 -114 -135 -132 -122
611076 -140 -127 -157 -122 -141 -162 -129 -114 -119 -119 -163 -138 -119 -129 -147 -139 -137 -112 -148 -156 -148 -150 -161 -81 -123 -136 -156 -135 -139 -160 -168 -178 -136 -128 -130 -149
612137 -132 -124 -129 -146 -143 -154 -160 -158 -159 -147 -126 -160 -119 -133 -149 -140 -153 -108 -144 -97 -148 -141 -158 -165 -110 -174 -122 -124 -130 -155 -144 -133 -129 -141 -151 -104 -144
613228 -116 -126 -133 -129 -122 -160 -195 -154 -167 -139 -152 -141 -115 -162 -164 -120 -133 -151 -170 -102 -154 -168 -132 -131 -145 -128 -146 -118 -113 -121 -137 -126 -140 -119
614231 -151 -161 -144 -117 -110 -147 -161 -129 -124 -127 -128 -159 -138 -143 -173 -154 -152 -120 -129 -180 -136 -143 -110 -139 -142 -153 -152 -144 -134 -133 -114 -155 -187 -168 -115 -124 -130
615322a37j8nk7Q1j0m0JK8o1K4OK5MnK4m3Pkkk2N1k2j4J8nj1J9kj0nj4N0j8J9a46
616383a68L6L2n7J0j3QJ6m3J5jJ5k7J8J7QqK9l1Rj5L3k8Lk3K1N1q6N0pj9l0K1a53
617386a19k7PLj8RrK6j9J0k8O3o0N2k8k2L3rk9K2kj8qK8jj7qK1j7J1KJ1jk7K6a33
618447a37Ml8L8l5M1J4k9Nk5Rk3M2Qj2LPl0L8ln5M2j7j7K5QMNk2rK3Kk8M2l2J0a47
619538a00m7j0J8Pk3J2j5L3o5J8M3k4J8oLl5J1k5L0K4ol1j0L9k0nj9L5k1M7k4a59
620511a44nQKPl5K8j6j6L2jK0l7K9rk0L7m7L8j6Qj6m5P5j8l5J5J5o%mL0k9l3M6a32
621573a47QLj9J1l5M8k0K6l7l0N2Jro2M9pK5NRo2P1m8O6m2l5K2k8K3J5%rJ4jra26
622634a74l4O9qj7NK1k4j7L8K2k3Mk5J5ork4J5L3Mm6J8L2l6J9l4L7lk1L3m3L1a20
$$ plain form
615322 -137 -155 -160 -187 -106 -116 -156 -155 -127 -188 -164 -158 -133 -129 -134 -110 -153 -146 -148 -150 -172 -121 -143 -157 -139 -144 -155 -136 -138 -148 -153 -167 -117 -135 -116 -146
616383 -168 -132 -100 -157 -147 -160 -152 -136 -179 -164 -165 -150 -177 -159 -142 -134 -142 -113 -144 -135 -150 -117 -145 -142 -165 -144 -93 -179 -129 -136 -155 -185 -164 -153
617386 -119 -146 -139 -136 -154 -145 -154 -128 -147 -137 -165 -102 -162 -110 -138 -160 -127 -136 -165 -143 -145 -163 -171 -143 -144 -161 -169 -148 -165 -154 -152 -141 -142 -169 -143 -133
618447 -137 -133 -171 -133 -168 -127 -113 -142 -137 -162 -153 -176 -134 -126 -138 -135 -128 -158 -120 -123 -178 -136 -153 -170 -145 -137 -133 -128 -150 -159 -136 -134 -162 -120 -152 -142 -147
619538 -100 -147 -157 -139 -132 -155 -143 -158 -125 -190 -172 -129 -153 -135 -141 -138 -173 -162 -187 -157 -133 -139 -170 -180 -141 -161 -166 -185 -150 -171 -124 -148 -159
620511 -144 -149 -141 -139 -132 -167 -139 -155 -171 -139 -140 -120 -157 -128 -137 -157 -120 -167 -129 -145 -137 -153 -198 -123 -141 -176 -161 -146 -152 -152 -156 -126 -155 -188 -142 -132
621573 -147 -139 -136 -155 -144 -179 -131 -151 -125 -162 -192 -140 -139 -148 -210 -161 -168 -143 -138 -129 -191 -120 -168 -102 -144 -179 -157 -185 -162 -147 -147 -156 -142 -143 -152 -126
622634 -174 -208 -139 -147 -164 -159 -138 -162 -179 -141 -119 -142 -138 -163 -148 -154 -163 -187 -172 -139 -135 -181 -163 -131 -167 -148 -182 -145 -148 -169 -136 -179 -148 -120
623637a42k9L2j9Pk9mJL7j2j2K3Nl7L2q%rM6j5%n0L9mM9n0j2j8RrK2%qK5k1J4a46
624728a46jJ3j2m3M9j4J5qMj6M4l7JQnR%J4m0Onk0J5j9M4l4K0pQJ3k9M4j7qk5a72
625819a76J1MK4Ol5Ql3N9k4K0mLl3K0J8pk6J0Njl7N7k2K7j0n1NJ8J6j6LJJ2j4a43
626880a23l8Jl8M5Oj3nkJ2mRk4RL1l5K4j7l1N8k6L4l0j9K3k9J7RK1ln6P3k3j2a37
627912a78O6o8LK3Jpj0MK0j0Mk0J7NQk1j0K1kRk4K3QJ5k4k2K6k0Kj6L0Nl1J6l7a28
629003a86K7k6L3j1l1K9Rj8M8Pj5Ol6N3l3No2O5J5k2NJ1k0lpM0m3K4K8j5l9M4a36
630006a56K8m8K4l7M5k8k0L8J7j1jPl6L6Ll5M9l0J9n1J8Oo%K7K1k9j6j6RKPK7a43
631038a53Rj1MJ1J1j2%n0J5K3jk9K1llnM2mk2M5l0l0K3rj0MJkqJ8Lk9K2j0Pj0a42
$$ plain form
623637 -142 -171 -139 -158 -151 -180 -184 -183 -146 -158 -170 -147 -142 -179 -147 -155 -155 -164 -118 -133 -133 -183 -144 -148 -99 -149 -161 -179 -170 -179 -157 -157 -165 -140 -161 -147 -146
624728 -146 -147 -134 -146 -189 -140 -154 -139 -147 -143 -159 -115 -152 -151 -143 -148 -139 -139 -125 -165 -159 -164 -184 -169 -188 -144 -178 -158 -165 -157 -144 -173 -129 -146 -154 -179 -172
625819 -176 -165 -161 -137 -131 -166 -158 -191 -132 -156 -136 -140 -137 -170 -150 -132 -139 -165 -155 -150 -151 -188 -131 -153 -126 -136 -187 -182 -164 -148 -164 -161 -160 -148 -162 -143
626880 -123 -161 -160 -198 -153 -147 -160 -165 -167 -155 -159 -150 -174 -165 -134 -169 -145 -162 -193 -135 -161 -127 -157 -176 -153 -182 -165 -156 -135 -138 -194 -121 -144 -156 -137
627912 -178 -112 -180 -177 -154 -153 -160 -170 -166 -146 -156 -152 -172 -155 -150 -142 -163 -173 -152 -154 -145 -169 -146 -138 -123 -147 -169 -143 -163 -161 -177 -147 -142 -173 -157 -194 -128
629003 -186 -159 -185 -152 -163 -194 -165 -156 -174 -126 -119 -134 -128 -164 -111 -144 -139 -201 -136 -121 -143 -138 -127 -147 -150 -157 -117 -160 -136 -108 -123 -162 -118 -136
630006 -156 -128 -176 -152 -189 -144 -172 -192 -154 -137 -148 -149 -142 -178 -142 -139 -174 -125 -155 -136 -187 -169 -163 -169 -169 -142 -121 -150 -166 -182 -173 -171 -164 -137 -143
631038 -153 -144 -155 -151 -140 -129 -141 -141 -191 -176 -153 -154 -183 -162 -165 -168 -173 -131 -135 -157 -112 -142 -172 -149 -158 -168 -164 -163 -165 -173 -155 -152 -181 -159 -169 -162 -172 -142
632158a62MPn1N0j6J5k7J5K2npJ9rk9M3k6J8J7k5prK2k0K0K0k1j7%l0L4m4M3l4b08
633190a49Pl9J1M4n4K6j0%Pql7J5j1M2oK2n5M3l9L8Jk5L7l6J7J0k1J3KJ0rlMMa60
634251a75J4J7pm2N8l1j0pL1l2L4kqNj2RK7m1L8k2j8OMpJ3m5L3K3l6J3Lk2OK9a64
635313a69m2N2l3PM0n4J9%K0K5k9k6M9k8lJpL5k8k8K1J4k5J8mnkK7m1MK6qnK3a65
636374a86J1j3J7j0J6mj6mK5k4L5k7M1j3l3oK3j1J2NMj0J0nmJ4j7j5MnJM6k0qa76
637436a44q1N3L2l9Qk7L2J0j7rK3l0QqK2m0K4J5j4L3j3k7N1p1L7j0J7l8J8M5j3a93
638409a82J3Lj0J1lJ8m4N2m4L7Nl9rL6rj6K0l1N8m4L1l3kK0J1m6M1k8LQJ1m8qa78
639441a94K7lJ5j9M1m8K4k8L5k0KJk3j8L6jjk6M7Qj1Rlokm0J8M9m6kJ3k0K6k8a88
$$ plain form
632158 -162 -158 -151 -202 -152 -168 -153 -180 -165 -143 -148 -155 -136 -145 -174 -131 -157 -139 -122 -147 -154 -163 -141 -161 -141 -121 -142 -159 -159 -189 -155 -199 -156 -190 -208
633190 -149 -142 -181 -170 -126 -180 -154 -164 -164 -157 -165 -202 -187 -198 -156 -162 -140 -195 -152 -191 -153 -152 -177 -140 -176 -159 -149 -170 -157 -155 -145 -154 -157 -153 -149 -160
634251 -175 -161 -144 -151 -193 -135 -166 -176 -183 -152 -184 -150 -152 -160 -155 -167 -158 -131 -172 -134 -156 -174 -168 -164 -171 -158 -203 -170 -147 -183 -170 -167 -189 -183 -154 -164
635313 -169 -211 -159 -192 -185 -145 -199 -180 -180 -160 -135 -164 -190 -141 -169 -172 -171 -178 -143 -171 -199 -178 -164 -189 -171 -175 -180 -182 -155 -196 -192 -166 -174 -179 -156 -165
636374 -186 -175 -188 -171 -181 -165 -169 -185 -189 -164 -188 -153 -180 -139 -152 -185 -191 -168 -179 -167 -162 -158 -168 -158 -163 -167 -153 -170 -185 -181 -186 -185 -139 -159 -167 -176
637436 -144 -225 -172 -140 -179 -171 -198 -166 -156 -173 -182 -159 -189 -181 -189 -167 -207 -183 -168 -182 -149 -162 -189 -138 -209 -172 -182 -165 -203 -185 -140 -153 -193
638409 -182 -169 -166 -176 -165 -168 -150 -194 -142 -186 -149 -144 -183 -192 -156 -165 -181 -161 -192 -134 -178 -147 -180 -182 -162 -151 -197 -156 -184 -181 -173 -162 -210 -218 -178
639441 -194 -167 -170 -155 -174 -133 -181 -157 -185 -150 -170 -168 -167 -190 -208 -172 -173 -174 -200 -153 -145 -156 -147 -150 -156 -158 -198 -180 -131 -177 -179 -166 -186 -160 -188 -188
640502a96J0J3%J0L1m0L7Mk6M2k9k4pKN1m0k4POK7k9M3j2l8JJ9mJ8qj0JJ0kK3a68
641564a67k5K0NK0j3MpJ2qoJ9M4l5L3jOrk9j5J2%j6L8m5M5l0J8L0n4QL7NqJ8na18
642655i6j9L7LOJ9K2l4KK0j3L1J4Q3Nk6O2J1N5L8M5Q1L8Q5R4J17O1J15K09K49A418
643569A441j91j66j1L6J43Q2k8k56k72j86j07p8m4p3m8L9l4L2k3m2pL8Pj2J7k0B68
644394C19KL0L2N5J00O7M0P9R1J64J17J25J63K05K87K81K91K4kP7J58Q5Or7j31B265
645190B152qj89l07l70j99j99j53p9q0m5m7j1m3l6Jk1l1j3J6l6O4k1l5K8K5l5D03
646016D24M3J9J01M0O9M6R8R3J12K08K21J61J6k08j44p7P4J68J04m0k78l13k14E31
646753D49m0o7mj8m0K7l2l8L4j4j2k4N4NpL3jM4O6L6L9O9J01M2J25R1J30J00J55A483
$$ plain form
640502 -196 -186 -173 -173 -163 -132 -172 -135 -131 -157 -115 -144 -168 -175 -173 -122 -162 -186 -179 -173 -146 -175 -132 -144 -182 -181 -162 -166 -148 -156 -166 -165 -155 -157 -134 -168
641564 -167 -192 -172 -167 -147 -160 -156 -163 -151 -159 -165 -146 -102 -137 -104 -105 -99 -108 -137 -152 -140 -140 -156 -118 -163 -118 -148 -130 -100 -154 -146 -109 -104 -112 -94 -99 -118
642655 -96 -115 -78 -75 -69 -50 -28 -62 -60 -40 -53 -22 -8 75 80 54 116 127 182 220 265 346 384 469 563 680 741 856 1065 1314 1418
643569 1441 1250 1084 1073 1109 1252 1334 1306 1050 778 592 485 407 363 290 242 281 247 279 256 214 207 245 252 240 257 237 268
644394 319 321 351 383 438 538 605 645 724 815 979 1096 1221 1384 1589 1876 2157 2448 2472 2470 2547 2705 2790 2796 2699 2568 2265
645190 2152 2144 1955 1648 1278 1079 880 727 648 568 523 476 465 422 386 387 366 335 322 338 302 366 345 310 338 363 328 403
646016 424 467 486 587 627 696 742 840 933 1045 1253 1474 1635 1651 1443 1299 1222 1296 1464 1568 1528 1250 937 723 531
646753 449 409 342 338 320 280 307 275 237 271 257 245 221 275 280 273 306 305 349 415 451 490 559 660 702 827 918 1048 1148 1303 1483
647667A667L15L08K81J49J5k2j49j56m6L8j5k15j46k82l57l12k01j38j13p5l9D78
648345D46j5l2k7j8J1J3j8l2m3j0K3k4L0L0j4P5QL2K6J6J16P2J05M2J38J26J13A372
649200A530K23L08L54K92J59M2n1j15k20p7O3o1j66k42k24l79l42k10j51j18n9D77
649879D35l4p6K4j17J9kk4k8n4J8m3K1l6Ml3Kk7m5J7j4l0K5k0Onm3J2Rl8j2rL0i0
650881h8j9j1j5K3l3K9l1ML7k1j3J8j5J1nk8RK0J3qL2n9J8K3m%oK2K0k7kpL6K4g9
$$ plain form
647667 1667 1982 2290 2571 2720 2735 2713 2564 2408 2362 2400 2385 2170 2024 1742 1385 1073 872 734 621 546 507 478
648345 446 431 399 372 354 365 378 360 328 285 275 298 274 304 334 320 395 403 435 461 477 593 665 770 812 950 1076 1189 1372
649200 1530 1753 2061 2415 2707 2866 2908 2857 2742 2522 2445 2508 2447 2281 2039 1815 1436 1094 884 733 615 556 477
649879 435 401 325 349 232 251 249 225 197 143 161 118 139 103 107 74 76 49 4 21 7 -23 2 -18 -12 -17 -60 -48 -39 -77 -89 -98 -68 -90
650881 -88 -107 -118 -133 -110 -143 -114 -145 -141 -104 -125 -138 -120 -135 -124 -129 -157 -148 -128 -115 -123 -91 -150 -132 -109 -113 -113 -119 -97 -77 -104 -106 -113 -77 -53 -79
$$ [...]
997512E516  $$checkpoint
##END= $$ end of C NMR
##END= $$ end of file