##TITLE= Sample
##JCAMP-DX= 4.24
##DATA TYPE= UV/VIS SPECTRUM
##DATA CLASS= XYDATA
##ORIGIN= Exported PE Spectrum Data File
##OWNER= rjlancashire
##DATE= 02/07/04
##TIME= 10:00:16.00
##RESOLUTION= 1.000000
##SPECTROMETER/DATA SYSTEM= PERKIN-ELMER LAMBDA 19 UV/VIS/NIR UV
##XUNITS= X UNITS
##YUNITS= Y UNITS
##XFACTOR= 6.5E-4
##YFACTOR= 6.83264136E-7
##FIRSTX= 350
##FIRSTY= 0.2514379
##LASTX= 1000
##NPOINTS= 651
##XYDATA= (X++(Y..Y))
538462C67995J1333J1917J2372J2796J3143J3698J3949J4135J4229J4162J4042E27638
558462E41340J3488J3290J3064J2897J2550J2167J1720J1283J0448R796R137Q636F87687
580000F94897O559N918M679L819K945K216J244M95k05q20j800k393l034l603m490G01190
606154F95255o492p258p676q037q327q710r049r390r627r975j0182j0315j0387E69513
629231E59222j0245j0121r961r845r745r674r432r250r007q729q285p930p566D32142
652308D25302o521o173n849n384n007m530m130l470k984k512k111j581j161p05C72814
676923C73045P52J258J669K318K799L227L524L975M310M578M835N262N578N945D29311
701538D35922O875P063P218P347P394P476P524P713P969Q180Q342Q709Q968R216E55317
$$ plain form
538462 367995 379328 391245 403617 416413 429556 443254 457203 471338 485567 499729 513771 527638
558462 541340 554828 568118 581182 594079 606629 618796 630516 641799 652247 662043 671180 679816 687687
580000 694897 701456 707374 712053 715872 718817 721033 722277 722772 722567 721747 719947 717554 714520 710917 706427 701190
606154 695255 688763 681505 673829 665792 657465 648755 639706 630316 620689 610714 600532 590217 579830 569513
629231 559222 548977 538856 528895 519050 509305 499631 490199 480949 471942 463213 454928 446998 439432 432142
652308 425302 418781 412608 406759 401375 396368 391838 387708 384238 381254 378742 376631 375050 373889 373184 372814
676923 373045 373797 375055 376724 379042 381841 385068 388592 392567 396877 401455 406290 411552 417130 423075 429311
701538 435922 442797 449860 457078 464425 471819 479295 486819 494532 502501 510681 519023 527732 536700 545916 555317
726154E65027R943J0127J0263J0577J0738J0918J1084J1215J1274J1263J1178F94749
746154G05850J1129J1161J1155J1141J1038J0884J0745J0584J0392J0250J0030H34253
766154H44032R663R528R377R189R052Q590Q259P975P714P459P274P039O873O512I64791
790769I70727N613N172M827M458M228L849L563L259K964K523K181J791J464Q85A017993
815385A018136j71n25p57j052j306j768k246k738l184l711m065m408m625m928I77446
840000I72003n699o185o586p028p385p869q151q353q535q765q918r140r399r908H49786
864615H39163j0786j0885j0930j0990j1117j1373j1583j1758j1805j1908j2024G01911
884615F89761j2220j2287j2345j2355j2334j2318j2233j2161j2079j1995j1941E43607
$$ plain form
726154 565027 574970 585097 595360 605937 616675 627593 638677 649892 661166 672429 683607 694749
746154 705850 716979 728140 739295 750436 761474 772358 783103 793687 804079 814329 824359 834253
766154 844032 853695 863223 872600 881789 890841 899431 907690 915665 923379 930838 938112 945151 952024 958536 964791
790769 970727 976340 981512 986339 990797 995025 998874 1002437 1005696 1008660 1011183 1013364 1015155 1016619 1017504 1017993
815385 1018136 1017965 1017440 1016683 1015631 1014325 1012557 1010311 1007573 1004389 1000678 996613 992205 987580 982652 977446
840000 972003 966304 960119 953533 946505 939120 931251 923100 914747 906212 897447 888529 879389 869990 860082 849786
864615 839163 828377 817492 806562 795572 784455 773082 761499 749741 737936 726028 714004 701911
884615 689761 677541 665254 652909 640554 628220 615902 603669 591508 579429 567434 555493 543607
904615E31831j1727j1651j1585j1523j1414j1321j1205j1007j0876j0685j0531C97943
924615C87764j0024r894r683r549r376r240q971q753q590q466q208q091p965p858B55431
949231B47949p246o992o626o466o320o214o079n902n694n524n250n028m819m645A60691
973846A56379m189m083l848l650l475l298l109k940k787k697k592k526k474k399A09950
998462A07646k259k236k134k121k153k176k220k239k225k178k079k044j990j916G5911
1023077G4236j557j468j442j442j432j403j237j085q78p21n90n09m22l35k39k62E8904
1050769E8528m99n58o16o61p31p93q50q91r10r42r97j017j014j026j000r64r03D3314
1080000D2503q02q63r31r50r73q78p22o26n55n12n81o72p30o56n57m60l69l50m27B9432
$$ plain form
904615 531831 520104 508453 496868 485345 473931 462610 451405 440398 429522 418837 408306 397943
924615 387764 377740 367846 358163 348614 339238 329998 321027 312274 303684 295218 287010 278919 270954 263096 255431
949231 247949 240703 233711 227085 220619 214299 208085 202006 196104 190410 184886 179636 174608 169789 165144 160691
973846 156379 152190 148107 144259 140609 137134 133836 130727 127787 125000 122303 119711 117185 114711 112312 109950
998462 107646 105387 103151 101017 98896 96743 94567 92347 90108 87883 85705 83626 81582 79592 77676 75911
1023077 74236 72679 71211 69769 68327 66895 65492 64255 63170 62292 61571 60981 60472 60050 59715 59476 59214 58904
1050769 58528 58029 57471 56855 56194 55463 54670 53820 52929 52019 51077 50080 49063 48049 47023 46023 45059 44156 43314
1080000 42503 41701 40838 39907 38957 37984 37106 36384 35758 35203 34691 34110 33438 32708 32052 31495 31035 30666 30316 29889 29432
1112308B9010l18k13j34j49k41k92l12l25k99k51k19k23j35j04r8j07j05j45j21B5131
1144615B5052j19j14j05j23j60j43j49j73j10j0P0J42Q7qr3k19k29j98j20nJ7P6B3489
1181538B3569K8o3j56k16j69n9M4K71L48K42P7r2k62l54l24j21j6M2Q2Q2OK3N0B2982
1220000B2939n2j15j10rP2O0J6L4o5j77r1l0o0o9oJ2l1m4j3k7J1N5J44J15L7m2B2349
1263077B2158p7l2J66K30K15J50l5j22j80j93m1K2M2J07R7P1P7Q6l8j39k32j95B1928
1300000B1829N6J58L03L20J45jl13l72k17%L25M52L87K59m3k52k29k31k22l5oj8B2208
1336923B2009n4qj1P8qr3p3j09K2J3j52q5j10j58R8P3J06R9n7m5j20j99N0N5J10B1632
1378462B1628k4n3j74q3j21j69l7n7P3J06o0np2j74L2J2O3Q5n6no1j50k1q6n0K0B0430
$$ plain form
1112308 29010 28692 28479 28345 28196 27955 27663 27351 27026 26727 26476 26257 26034 25899 25795 25697 25590 25485 25340 25219 25131
1144615 25052 24933 24819 24714 24591 24431 24288 24139 23966 23856 23846 23916 24058 24145 24137 24044 23825 23596 23398 23278 23273 23290 23366 23489
1181538 23569 23597 23534 23378 23162 22993 22934 22978 23249 23597 23839 23916 23824 23562 23208 22884 22763 22747 22789 22871 22953 22959 22982 23032 22982
1220000 22939 22887 22772 22662 22653 22725 22785 22801 22835 22770 22593 22502 22472 22412 22343 22337 22349 22318 22274 22261 22234 22245 22300 22444 22559 22596 22554 22349
1263077 22158 22081 22049 22215 22445 22660 22810 22775 22653 22473 22280 22239 22261 22303 22410 22507 22578 22655 22741 22703 22564 22332 22137 21928
1300000 21829 21885 22043 22346 22666 22811 22810 22497 22125 21908 21908 22233 22685 23072 23331 23288 23036 22807 22576 22354 22319 22313 22295 22208
1336923 22009 21955 21947 21936 22014 22006 21913 21840 21731 21753 21766 21614 21529 21419 21261 21359 21432 21538 21637 21580 21535 21415 21216 21266 21321 21431 21632
1378462 21628 21604 21551 21377 21294 21173 21004 20967 20910 20983 21089 21029 21024 20952 20778 20810 20822 20885 20970 20914 20909 20848 20698 20677 20591 20541 20561 20430
1421538B0413O5J2L8Rp5n9j79j1R1mrJ7j77j27j64j10jo4m0M1j51p3j02k29j20A8735
1463077A8460r8j92l4P4J9J90N1N4J25m5N9J31k5J12N2Q2J43%ln5j37L1O2Q9J59A9312
1504615A9219r7j20q7n5n9R5Q2M7J04lj1P8j3L1l4j51j13k07j96m4A8368
$$ plain form
1421538 20413 20478 20490 20528 20537 20462 20403 20224 20213 20304 20300 20291 20308 20131 20004 19840 19730 19729 19665 19625 19666 19515 19442 19340 19111 18991 18735
1463077 18460 18362 18170 18136 18210 18229 18419 18470 18524 18649 18604 18663 18794 18769 18881 18933 19015 19158 19158 19155 19100 18963 18994 19056 19145 19304 19312
1504615 19219 19122 19002 18915 18860 18801 18896 18978 19025 19129 19126 19115 19193 19180 19211 19177 19026 18913 18706 18510 18466 18368
1538462A8464  $$checkpoint
##END=
