##TITLE=	ah$ptx1KSY2hwj3Pu1kZvg.1.fid
T Mies ; agmb ; TM-V1-260 in CD3OD ; 13C{1H} NMR Spectrum using Av400D ; Feb21-2022 / 1

##JCAMP-DX=	6.0	$$ MestReNova 14.3.0-30573
##DATA TYPE=	LINK
##BLOCK_ID=	1
##BLOCKS=	2    
##ORIGIN=	Mestrelab Research S.L.
##OWNER=	hrzepa
##$MNOVA/LINK_BLOCK_TYPE=	ITEM	$$ NMR Spectrum
##$MNOVA/ITEM/POLYGON=	(XY..XY)
5321,5835
8722,5835
8722,8208
5321,8208
5321,5835
##$MNOVA/ITEM/Z=	0
##$MNOVA/ITEM/ANGLE=	0
##TITLE=	ah$ptx1KSY2hwj3Pu1kZvg.1.fid
##JCAMP-DX=	6.0	$$ MestReNova 14.3.0-30573
##BLOCK_ID=	2
##DATA TYPE=	MNOVA NMR VIEW DATA
##DATA CLASS=	MNOVA VIEW DATA
##$MNOVA/ITEM/ZOOM/X=	-9.4805158492331624842,	229.48420000433532095
##$MNOVA/ITEM/ZOOM/Y=	-26534.044677734375,	284823.755859375
##END=	
##TITLE=	ah$ptx1KSY2hwj3Pu1kZvg.1.fid
##JCAMP-DX=	6.0	$$ MestReNova 14.3.0-30573
##BLOCK_ID=	3
##DATA TYPE=	NMR SPECTRUM
##DATA CLASS=	XYDATA
##NUMDIM=	1
##ORIGIN=	Bruker BioSpin GmbH
##OWNER=	nmrsu
##.OBSERVE FREQUENCY=	100.60371819182999786
##.OBSERVE NUCLEUS=	^13C
##.SOLVENT NAME=	MeOD
##.PULSE SEQUENCE=	zgpg30
##LONGDATE=	2022/02/22 09:29:51.000
##.ACQUISITIONMODE=	SIMULTANEOUS (DQD)
##$ORIGINAL FORMAT=	Bruker XWIN-NMR
##$MNOVA/SCALES_VERSION=	9
##$PARAMETER FILE=	(acqus, ASCII, /private/var/folders/f6/rjf_tdyn2v98c5c0wvkgn4s80000gn/T/ah$ptx1KSY2hwj3Pu1kZvg/1/acqus, 0)
$$ ##TITLE= Parameter file, TOPSPIN		Version 3.2
$$ ##JCAMPDX= 5.0
$$ ##DATATYPE= Parameter Values
$$ ##NPOINTS= 19	$$ modification sequence number
$$ ##ORIGIN= Bruker BioSpin GmbH
$$ ##OWNER= nmrsu
$$ $$ 2022-02-22 09:29:52.409 +0000  nmrsu@nmrpc
$$ $$ /opt/topspin/data/agmb/nmr/Feb21-2022/1/acqus
$$ $$ process /opt/topspin3.2/prog/mod/shimcntl
$$ ##$ACQT0= -1.89075630252101
$$ ##$AMP= (0..31)
$$ 100 100 100 100 100 100 100 100 100 100 100 100 100 100 100 100 100 100
$$ 100 100 100 100 100 100 100 100 100 100 100 100 100 100
$$ ##$AMPCOIL= (0..19)
$$ 0 0 0 0 0 0 0 0 0 0 0 0 0 0 0 0 0 0 0 0
$$ ##$ANAVPT= -1
$$ ##$AQSEQ= 0
$$ ##$AQ_mod= 3
$$ ##$AUNM= <au_zg>
$$ ##$AUTOPOS= <>
$$ ##$BF1= 100.592653
$$ ##$BF2= 400.05
$$ ##$BF3= 100.592653
$$ ##$BF4= 100.592653
$$ ##$BF5= 100.592653
$$ ##$BF6= 100.592653
$$ ##$BF7= 100.592653
$$ ##$BF8= 100.592653
$$ ##$BYTORDA= 0
$$ ##$CAGPARS= (0..11)
$$ 0 0 0 0 0 0 0 0 0 0 0 0
$$ ##$CFDGTYP= 0
$$ ##$CFRGTYP= 9
$$ ##$CHEMSTR= <none>
$$ ##$CNST= (0..63)
$$ 1 1 1 1 1 1 1 1 1 1 1 1 1 1 1 1 1 1 1 1 1 1 1 1 1 1 1 1 1 1 1 1 1 1 1 1
$$ 1 1 1 1 1 1 1 1 1 1 1 1 1 1 1 1 1 1 1 1 1 1 1 1 1 1 1 1
$$ ##$CPDPRG= (0..8)
$$ <> <> <waltz16> <> <> <> <> <> <>
$$ ##$D= (0..63)
$$ 0 1 0 0 0 0 0 0 0 0 0 0.03 0 0 0 0 0.0002 0 0 0 0 0 0 0 0 0 0 0 0 0 0 0
$$ 0 0 0 0 0 0 0 0 0 0 0 0 0 0 0 0 0 0 0 0 0 0 0 0 0 0 0 0 0 0 0 0
$$ ##$DATE= 1645522191
$$ ##$DE= 6.5
$$ ##$DECBNUC= <off>
$$ ##$DECIM= 832
$$ ##$DECNUC= <off>
$$ ##$DECSTAT= 4
$$ ##$DIGMOD= 1
$$ ##$DIGTYP= 12
$$ ##$DQDMODE= 0
$$ ##$DR= 22
$$ ##$DS= 0
$$ ##$DSPFIRM= 0
$$ ##$DSPFVS= 20
$$ ##$DTYPA= 0
$$ ##$EXP= <c13f>
$$ ##$F1LIST= <>
$$ ##$F2LIST= <>
$$ ##$F3LIST= <>
$$ ##$FCUCHAN= (0..9)
$$ [...]
$$ 130000 130000 130000 130000 130000 130000 130000 130000 130000 130000 130000
$$ 130000 130000 130000 130000 130000 130000 130000 130000 130000 130000 130000
$$ 130000 130000 130000 130000 130000 130000 130000 0 0 0 0 0 0 0 0 0 0 0
$$ 0 0 0 0 0 0 0 0 0 0 0 0 0
$$ ##$ShimPowMaxUC= (0..63)
$$ 130000 130000 130000 130000 130000 130000 130000 130000 130000 130000 130000
$$ 130000 130000 130000 130000 130000 130000 130000 130000 130000 130000 130000
$$ 130000 130000 130000 130000 130000 130000 130000 130000 130000 130000 130000
$$ 130000 130000 130000 130000 130000 130000 130000 0 0 0 0 0 0 0 0 0 0 0
$$ 0 0 0 0 0 0 0 0 0 0 0 0 0
$$ ##$ShimPowMaxUG= (0..63)
$$ 1000000 1000000 1000000 1000000 1000000 1000000 1000000 1000000 1000000
$$ 1000000 1000000 1000000 1000000 1000000 1000000 1000000 1000000 1000000
$$ 1000000 1000000 1000000 1000000 1000000 1000000 1000000 1000000 1000000
$$ 1000000 1000000 1000000 1000000 1000000 1000000 1000000 1000000 1000000
$$ 1000000 1000000 1000000 0 0 0 0 0 0 0 0 0 0 0 0 0 0 0 0 0 0 0 0 0 0 0 0
$$ 0
$$ ##$ShimPowRcbType= 3
$$ ##$ShimPowRes= (0..63)
$$ 1e-20 1e-20 1e-20 1e-20 1e-20 1e-20 1e-20 1e-20 1e-20 1e-20 1e-20 1e-20
$$ 1e-20 1e-20 1e-20 1e-20 1e-20 1e-20 1e-20 1e-20 1e-20 1e-20 1e-20 1e-20
$$ 1e-20 1e-20 1e-20 1e-20 1e-20 1e-20 1e-20 1e-20 1e-20 1e-20 1e-20 1e-20
$$ 1e-20 1e-20 1e-20 1e-20 0 0 0 0 0 0 0 0 0 0 0 0 0 0 0 0 0 0 0 0 0 0 0 0
$$ ##$ShimPowRng0= (0..63)
$$ 1 1 1 1 1 1 1 1 1 1 1 1 1 1 1 1 1 1 1 1 1 1 1 1 1 1 1 1 1 1 1 1 1 1 1 1
$$ 1 1 1 1 0 0 0 0 0 0 0 0 0 0 0 0 0 0 0 0 0 0 0 0 0 0 0 0
$$ ##$ShimPowRng1= (0..63)
$$ 1 1 1 1 1 1 1 1 1 1 1 1 1 1 1 1 1 1 1 1 1 1 1 1 1 1 1 1 1 1 1 1 1 1 1 1
$$ 1 1 1 1 0 0 0 0 0 0 0 0 0 0 0 0 0 0 0 0 0 0 0 0 0 0 0 0
$$ ##$ShimPowRng2= (0..63)
$$ 1 1 1 1 1 1 1 1 1 1 1 1 1 1 1 1 1 1 1 1 1 1 1 1 1 1 1 1 1 1 1 1 1 1 1 1
$$ 1 1 1 1 0 0 0 0 0 0 0 0 0 0 0 0 0 0 0 0 0 0 0 0 0 0 0 0
$$ ##$ShimPowRng3= (0..63)
$$ 1 1 1 1 1 1 1 1 1 1 1 1 1 1 1 1 1 1 1 1 1 1 1 1 1 1 1 1 1 1 1 1 1 1 1 1
$$ 1 1 1 1 0 0 0 0 0 0 0 0 0 0 0 0 0 0 0 0 0 0 0 0 0 0 0 0
$$ ##$ShimSysFunc= (0..63)
$$ 1 2 3 4 5 6 7 8 9 10 0 37 38 35 16 15 14 13 12 11 28 27 26 25 24 23 36
$$ 22 30 29 20 21 34 33 32 31 17 18 19 0 0 0 0 0 0 0 0 0 0 0 0 0 0 0 0 0 0
$$ 0 0 0 0 0 0 0
$$ ##$ShimSysMatrix= 0
$$ ##$ShimSysType= 4
$$ ##$TFXNUM= 0
$$ ##$TRIPLO2= 0
$$ ##$VTU= 2
$$ ##$VTUETH= <149.236.99.20>
$$ ##$VTUTY= <no>
$$ ##$WBREFAM= (0..15)
$$ 136.7 118.7 100 100 100 100 100 100 100 100 100 100 100 100 100 100
$$ ##$WBREFLM= (0..15)
$$ 0 0 0 0 0 0 0 0 0 0 0 0 0 0 0 0
$$ ##$WBREFPH= (0..15)
$$ 77.55 -71.28 0 0 0 0 0 0 0 0 0 0 0 0 0 0
$$ ##$WBSGU= (0..15)
$$ 0 0 0 0 0 0 0 0 0 0 0 0 0 0 0 0
$$ ##$XFAC= 2
$$ ##END=
$$ 
##$DECIM=	832
##$DSPFVS=	20
##XUNITS=	HZ
##YUNITS=	ARBITRARY UNITS
##FIRSTX=	23084.424499582601129
##LASTX=	-953.67024106489554924
##DELTAX=	-0.36679781400240324407
##XFACTOR=	1
##YFACTOR=	0.77232890191730574347
##FIRSTY=	-120.1390380859375
##MINY=	-640.976318359375
##MAXY=	258930.6875
##NPOINTS=	65536
##XYDATA=	(X++(Y..Y))
$$ [...]
8834f05L3M9M7L2J1rk3k5j4llj2j4%J8K2J2KjKOJ0J5J5J1J0R%j4k2j2NJ0Kpolnoljpj4j7j1
$$ -605 -572 -523 -476 -444 -433 -442 -465 -490 -504 -507 -510 -522 -536 -536 -518 -496 -484 -482 -483 -481 -475 -465 -450 -435 -424 -414 -405 -405 -419 -441 -453 -448 -438 -436 -443 -449 -452 -457 -463 -466 -467 -474 -488 -505 -516
8817e16lKONkj0j2KJ8K5J2j1l3l7k6j0QK2L6L8K6Ql%QJ1PJoj5k7l3l1j8olrj0KK1L3K5Nj4
$$ -516 -519 -517 -511 -506 -508 -518 -530 -528 -510 -485 -473 -484 -517 -554 -580 -590 -582 -560 -524 -486 -460 -452 -455 -455 -447 -436 -429 -428 -434 -449 -476 -509 -540 -558 -564 -567 -576 -586 -584 -563 -530 -505 -500 -514
8801e14j7mJ3K1J4ok3j8LK4K4Nj7k5k3k0j5mRJ4Mj2k2j5LK3L5K9J2mpmlprokMKlj4k0k0j9
$$ -514 -531 -535 -522 -501 -487 -493 -516 -534 -531 -507 -483 -478 -495 -520 -543 -563 -578 -582 -573 -559 -555 -567 -589 -604 -601 -578 -543 -514 -502 -506 -513 -517 -520 -527 -536 -542 -544 -540 -538 -541 -555 -575 -595 -614
8785f14j4pKMmj2oJ0J5Orj0NK2K5J3%lMMqk6l9l4j6NJ6J8J7J8K4K7K5J7QLMJ2K5L2K3Kj7k4
$$ -614 -628 -635 -633 -629 -633 -645 -651 -641 -626 -620 -629 -639 -634 -612 -587 -574 -574 -577 -573 -569 -577 -603 -642 -676 -692 -687 -671 -653 -636 -618 -594 -567 -542 -525 -517 -514 -510 -498 -473 -441 -418 -416 -433 -457
8769d57k3k3k4k4j4JJ8K1Pj3j6KK4L0K1R%j3l4m8m4k4lJ1J5J0mk0k3j2JLkoLK0L9N2N1L6J0
$$ -457 -480 -503 -527 -551 -565 -564 -546 -525 -518 -531 -547 -545 -521 -491 -470 -461 -461 -474 -508 -556 -600 -624 -627 -616 -601 -591 -595 -615 -638 -650 -649 -646 -648 -654 -651 -631 -592 -540 -489 -453 -443
8754d43j3k8l1k5j4mMPPKj1k1j8mPMmmLPPJ2K3K9K7J9J3Kj9l1k3KJ6J0nj0njlqj3j8k3k1j1
$$ -443 -456 -484 -515 -540 -554 -558 -554 -547 -540 -538 -549 -570 -588 -592 -585 -581 -585 -589 -586 -579 -572 -560 -537 -508 -481 -462 -449 -447 -466 -497 -520 -518 -502 -492 -497 -507 -512 -513 -516 -524 -537 -555 -578 -599 -610
8737f10kmj5j7nJ1K1K2K0J2LonPJ7J9J2PLlrj6j9k0j7rKRJ7K5L0K5J1KMJ0Rjj3j3oKKpj7k3
$$ -610 -612 -616 -631 -648 -653 -642 -621 -599 -579 -567 -564 -570 -575 -568 -551 -532 -520 -513 -510 -513 -522 -538 -557 -577 -594 -603 -601 -592 -575 -550 -520 -495 -484 -482 -478 -468 -459 -460 -473 -486 -492 -490 -488 -495 -512 -535
8720e35k2k7l8m2l2oJ3J8J2OKk%J1K5L0J9Jrj0opj0qllnkRK1K1J2K%%noJJ2J9J4O%pj2j5j0
$$ -535 -557 -584 -622 -664 -696 -702 -689 -671 -659 -653 -651 -653 -653 -642 -617 -587 -568 -567 -576 -586 -592 -599 -609 -617 -620 -623 -628 -630 -621 -600 -579 -567 -565 -565 -565 -570 -576 -575 -563 -544 -530 -524 -524 -531 -543 -558 -568
8703e68JJ2J8J8J0Kjkpj7k8l0k5j1LJ4K0J6Omj1j2j0oorq%KlpRL2M1K3jrlMNPJ7L0L3K1Kj5
$$ -568 -567 -555 -537 -519 -509 -507 -508 -510 -517 -534 -562 -592 -617 -628 -625 -611 -591 -575 -569 -573 -584 -596 -606 -612 -618 -627 -635 -635 -633 -636 -643 -634 -602 -561 -538 -539 -548 -551 -547 -542 -535 -518 -488 -455 -434 -432 -447
8686d47k4k6k2j2KPJomQK1K2J5%j2j7j1nqj8k1j6rn%J2J5RKKLnj7k1rNJ5J8J1NPJ7K1Prj1
$$ -447 -471 -497 -519 -531 -529 -522 -521 -527 -531 -523 -502 -480 -465 -465 -477 -494 -505 -510 -518 -536 -557 -573 -582 -587 -587 -575 -560 -551 -549 -547 -544 -549 -566 -587 -596 -591 -576 -558 -547 -542 -535 -518 -497 -490 -499 -510
8669e10JJ0RMok2l8l4j3Jlj0KK2L0K3J4J3Oj1k6k9k7k7k5j8kJ4K7L5M0M0L7K5Kk6m3m1k7j4
$$ -510 -509 -499 -490 -486 -492 -514 -552 -586 -599 -598 -601 -611 -609 -587 -557 -534 -520 -507 -501 -512 -538 -567 -594 -621 -646 -664 -666 -652 -625 -590 -550 -510 -473 -448 -446 -472 -515 -556 -583 -597
8654e97rj2k0k4j7mRJ8K4L4M3M1K5Pnqpj0j6k4k9k7k2j6j3qJJ1J4QkkJ7L5L6J7qk0j8j0lK
$$ -597 -606 -618 -638 -662 -679 -683 -674 -656 -632 -598 -555 -514 -489 -482 -487 -495 -502 -512 -528 -552 -581 -608 -630 -646 -659 -667 -666 -655 -641 -633 -635 -637 -620 -585 -549 -532 -540 -560 -578 -588 -591 -589
8639e89LJkJJlrj1pmrk1l0k7j2QK7L8M3M1L3K5J6Rjj5k6k5j6oKQJ2J3Oqj7j6r%MKjjknonm
$$ -589 -586 -585 -587 -586 -585 -588 -597 -608 -615 -619 -628 -649 -679 -706 -718 -710 -683 -645 -602 -561 -528 -503 -487 -478 -479 -494 -520 -545 -561 -567 -565 -557 -545 -532 -526 -534 -551 -567 -576 -576 -572 -570 -571 -572 -574 -579 -585 -590 -594
8621e94j0j6j8j2lJPK3M5N7M8K9Qlrj4k2m1n8n5k4J3K9J9Lklj1k0j6lQRRRJj3k4j9nRJ8K7
$$ -594 -604 -620 -638 -650 -653 -652 -645 -622 -577 -520 -472 -443 -435 -438 -447 -461 -483 -524 -582 -637 -661 -648 -619 -600 -597 -599 -602 -613 -633 -649 -652 -644 -635 -626 -617 -616 -629 -653 -672 -677 -668 -650 -623
8605f23L3L1J9PLPJ2J3J0PLJJK%oj4k3k9k7j7nLPJ1J6J6R%mlkkmnnj1j7j7mJ2J9J1KLJ0J2
$$ -623 -590 -559 -540 -533 -530 -523 -511 -498 -488 -481 -478 -477 -476 -474 -474 -480 -494 -517 -546 -573 -590 -595 -592 -585 -574 -558 -542 -533 -533 -537 -540 -542 -544 -548 -553 -558 -569 -586 -603 -607 -595 -576 -565 -563 -560 -550 -538
8588e38Kpj0mLKlj2j2%K3L8L5J5lj4j8k0k0j7j8k3k4j3OJ9K2J7QJrj3j1lNOjj0j4j5j6j1J
$$ -538 -536 -543 -553 -557 -554 -552 -555 -567 -579 -579 -556 -518 -483 -468 -471 -485 -503 -523 -543 -560 -578 -601 -625 -638 -632 -613 -591 -574 -566 -565 -574 -587 -598 -601 -596 -590 -591 -601 -615 -630 -646 -657 -656
8572f56J8L1K9J9QLLRK1K8K5Qj0k2k3k1k0j4%J5J8Pmollrj2j2j2j4qNJ6K0K5L1L1K1Nqj6k3
$$ -656 -638 -607 -578 -559 -551 -548 -545 -536 -515 -487 -462 -454 -464 -486 -509 -530 -550 -564 -564 -549 -531 -524 -528 -534 -537 -540 -549 -561 -573 -585 -599 -607 -602 -586 -566 -541 -510 -479 -458 -453 -461 -477 -500
8556e00k2j6j7l1m4l9j3J4K6K2J0lj0rqj0j6j0RK4K8K0J1JooJPONNNkoKJ9K6J8%j2j3lM%j3
$$ -500 -522 -538 -555 -586 -630 -669 -682 -668 -642 -620 -610 -613 -623 -632 -640 -650 -666 -676 -667 -643 -615 -595 -584 -583 -589 -595 -594 -587 -581 -576 -571 -566 -568 -574 -572 -553 -527 -509 -509 -521 -534 -537 -533 -533 -546
8540e46k4j9kJ4J7J4Moj4j3jJ4J9J1kj0j0ork0l3l8l5k7j3QL0L5K4RJ0K7M3L8K2OMOKqj8k3
$$ -546 -570 -589 -591 -577 -560 -546 -542 -548 -562 -575 -576 -562 -543 -532 -534 -544 -554 -560 -569 -589 -622 -660 -695 -722 -735 -727 -697 -662 -638 -629 -619 -592 -549 -511 -489 -483 -479 -473 -471 -479 -497 -520
8524e20k5k2qQJ4Kj1j1MJ8K1K3L0L5K5jk5l1k1oMRJ0Qkj0j4j6j6j5qMJ2J3J0RRRJ1J4J3kk3
$$ -520 -545 -567 -575 -567 -553 -551 -562 -573 -569 -551 -530 -507 -477 -442 -417 -418 -443 -474 -495 -501 -497 -488 -478 -470 -472 -482 -496 -512 -528 -543 -551 -547 -535 -522 -512 -503 -494 -485 -474 -460 -447 -449 -472
8509d72l7k9pJ2J6Kj7k8k7j6onojJ0J7J1koKJ3J2QRJ7J5mk2k3j6k0l5m1k2OK0J8J0RJ3J8K3
$$ -472 -509 -538 -545 -533 -517 -515 -532 -560 -587 -603 -609 -614 -620 -621 -611 -594 -583 -585 -591 -589 -576 -564 -556 -547 -530 -515 -519 -541 -564 -580 -600 -635 -676 -698 -692 -672 -654 -644 -635 -622 -604 -581
8493e81K4J5jj4j4kJ4K2K3J7Kj6k9k5j2LQJ0J3J2QQJ1J3Nqj3j6k7l5k8qQQ%%MOPJ1J2Jj7k6
$$ -581 -557 -542 -543 -557 -571 -573 -559 -537 -514 -497 -495 -511 -540 -565 -577 -574 -566 -556 -543 -531 -523 -515 -504 -491 -486 -494 -507 -523 -550 -585 -613 -621 -613 -605 -605 -605 -601 -595 -588 -577 -565 -564 -581 -607
8477f07j7mlj6k9k6qRJ7J9K8L8L8K4Rkj1k1k2j0LMpj4j1nqrJJ7K9K6J8J6K0K0J4PJknpppj8
$$ -607 -624 -628 -631 -647 -676 -702 -710 -701 -684 -665 -637 -599 -561 -537 -528 -530 -541 -562 -584 -594 -591 -587 -594 -608 -619 -624 -632 -641 -640 -623 -594 -568 -550 -534 -514 -494 -480 -473 -472 -474 -479 -486 -493 -500 -518
8461e18k9l1k3j7j7j4jJ2J3Ooj9l5m1k9pOQJ4K1K2J6J1J5K1K0J6K2L0L0J6%j1j7j9j8j3lP
$$ -518 -547 -578 -601 -618 -635 -649 -650 -638 -625 -619 -625 -644 -679 -720 -749 -756 -750 -742 -728 -707 -685 -669 -658 -643 -622 -602 -586 -564 -534 -504 -488 -488 -499 -516 -535 -553 -566 -569 -562
8446e62J3J0Mkoj3k5k8j5OJ7J4OOJ3J9J7J3J2J3Qnk1k6j7%J3J8J3Jj0j6j5j2j1j1lLQQPOK
$$ -562 -549 -539 -535 -537 -543 -556 -581 -609 -624 -618 -601 -587 -581 -575 -562 -543 -526 -513 -501 -488 -480 -485 -506 -532 -549 -549 -536 -518 -505 -504 -514 -530 -545 -557 -568 -579 -582 -579 -571 -563 -556 -550 -548
8430e48pj4j9j9j6rpj0j5j2JJ0J2QQJ8L1L6K6J2Jnj0j6j2n%ljJ1K4J8%j8k0j2LJ3J7J1LJK
$$ -548 -555 -569 -588 -607 -623 -632 -639 -649 -664 -676 -675 -665 -653 -645 -637 -619 -588 -552 -526 -514 -513 -518 -528 -544 -556 -561 -561 -564 -565 -554 -530 -512 -512 -530 -550 -562 -559 -546 -529 -518 -515 -514 -512
8415e12jqj0orj8k3j3JMpk0l0l7l4j9lORJ4K5L1K9K5K6K9K8K2J3OLORLj0k3k2pRJ8K1J7Jk1
$$ -512 -513 -521 -531 -537 -546 -564 -587 -600 -599 -595 -602 -622 -652 -689 -723 -742 -745 -739 -730 -716 -691 -660 -631 -606 -580 -551 -523 -501 -488 -482 -479 -473 -464 -461 -471 -494 -516 -523 -514 -496 -475 -458 -457 -478
8399d78l5l0j8j4k2k7k1oNJ1J3J7J7J5J1RJj3j9j1NJ0%j0j0jQJ3J7J5%k5l6k4kJ1J2J1J4K1
$$ -478 -513 -543 -561 -575 -597 -624 -645 -651 -646 -635 -622 -605 -588 -573 -562 -553 -552 -565 -584 -595 -590 -580 -580 -590 -600 -601 -593 -580 -563 -548 -548 -573 -609 -633 -635 -624 -612 -601 -587 -566
8384e66K6K6K1Mj6k7k4j5j3j5j7k0j7qQJ9K3K3K4J9QljO%j4k6k4j7j4j1oNJ7K3K0Qlommoo
$$ -566 -540 -514 -493 -489 -505 -532 -556 -571 -584 -599 -616 -636 -653 -661 -653 -634 -611 -588 -564 -545 -537 -540 -541 -535 -535 -549 -575 -599 -616 -630 -641 -647 -642 -625 -602 -582 -574 -577 -583 -587 -591 -597 -603
8368f03KRPONLmj2rNJ2Qjlkpj1pOK0K2J6RMlj4k3k9l1l1k3rJLMJ0J8J8J6J9K5K2J3MNQRRJ0
$$ -603 -601 -592 -585 -579 -574 -571 -575 -587 -596 -591 -579 -571 -572 -575 -577 -584 -595 -602 -596 -576 -554 -538 -529 -525 -528 -542 -565 -594 -625 -656 -679 -688 -687 -684 -680 -670 -652 -634 -618 -599 -574 -552 -539 -535 -530 -522 -513 -504 -494
8350d94Jj1j6rKQJ2K0K3J1oj4mRJ1Mrk1k9k9k0oMN%pmNNj2k8k7j1jlJJ7K4J3qj0OK0J7Krj1
$$ -494 -493 -504 -520 -529 -527 -519 -507 -487 -464 -453 -459 -473 -477 -468 -457 -453 -462 -483 -512 -541 -561 -567 -563 -558 -558 -565 -569 -564 -559 -571 -599 -626 -637 -638 -641 -640 -623 -599 -586 -594 -604 -598 -578 -561 -559 -568 -579
8333e79qnlljjmj1j4pJ0K4K7K0Jj6k3j2KJ0J3J6J5R%LJ9K5J1j0j3jPrl4m6l4qRJ1%j0j3j3
$$ -579 -587 -592 -595 -598 -599 -600 -604 -615 -629 -636 -626 -602 -575 -555 -554 -570 -593 -605 -603 -593 -580 -564 -549 -540 -540 -537 -518 -493 -482 -492 -505 -506 -499 -508 -542 -588 -622 -630 -621 -610 -610 -620 -633 -646
8317f46j1pmqj8k5j6PL0L8L2K3J7J0lk0l0k7rJ1K5K6K2J2jj3j6pNJ1N%oj0j4j2mjmnKJ1J6
$$ -646 -657 -664 -668 -676 -694 -719 -735 -728 -698 -660 -628 -605 -588 -578 -581 -601 -631 -658 -667 -656 -631 -605 -583 -571 -572 -585 -601 -608 -603 -592 -587 -587 -593 -603 -617 -629 -633 -634 -638 -643 -641 -630 -614
8301f14J5J8K1J8Npj2rjNOjrj1ppj6k4j6QL3M6M2K7J2NLjj5k9k9j4OJ6J6J1PRPNKkrj7k3j4
$$ -614 -599 -581 -560 -542 -537 -544 -556 -565 -566 -561 -555 -556 -565 -576 -583 -590 -606 -630 -646 -638 -605 -559 -517 -490 -478 -473 -470 -471 -486 -515 -544 -558 -552 -536 -520 -509 -502 -493 -486 -481 -479 -481 -490 -507 -530 -544
8284e44OK1J7nk4l3k6j1JPLKPJ8K4K5J9Prk1k4j4nlnnmlKPQjj6k2j4kML%JOJ1Pmj1lJ5K6J9
$$ -544 -538 -517 -500 -505 -529 -562 -588 -599 -598 -591 -588 -586 -579 -561 -537 -512 -493 -486 -495 -516 -540 -554 -559 -562 -567 -572 -576 -579 -577 -570 -562 -563 -579 -601 -615 -617 -613 -610 -610 -609 -603 -592 -585 -589 -600 -603 -588 -562 -543
8266e43Jj4j7j2nOJ3J3PQJ6J7Nj2j6pmj6k8k1%J7J7J1RQKnqoJJ0J6J4%k3l8l9k7qQJ9J9J2
$$ -543 -542 -556 -573 -585 -590 -584 -571 -558 -551 -543 -527 -510 -505 -517 -533 -540 -544 -560 -588 -609 -609 -592 -575 -564 -555 -547 -545 -550 -558 -564 -563 -553 -537 -523 -523 -546 -584 -623 -650 -658 -650 -631 -612 -600
8250f00QJ3J9J4KolMOLKLjj2k4k6j6kQPJmpj2j7j4KK4L1J8kpNJ6J3Jpj0j1mPJ3Kk1l5k9j3
$$ -600 -592 -579 -560 -546 -544 -550 -553 -549 -543 -540 -538 -535 -536 -548 -572 -598 -614 -616 -608 -601 -600 -604 -611 -623 -640 -654 -652 -628 -597 -579 -581 -588 -583 -567 -554 -553 -560 -570 -581 -585 -578 -565 -563 -584 -619 -648 -661
8233f61l%%LPOJoj0mJ5L2L4J9jj0rkKJllQJ9K1J4J0J1Nj4l5m3l5k0nRJ5J0kj1j0mNJ4J1Jo
$$ -661 -664 -664 -664 -661 -654 -648 -647 -653 -663 -667 -652 -620 -586 -567 -568 -578 -587 -589 -587 -586 -589 -592 -584 -565 -544 -530 -520 -509 -504 -518 -553 -596 -631 -651 -656 -647 -632 -622 -624 -635 -645 -649 -644 -630 -619 -618 -624
8216f24NK2K8K0J9K7K9K0QPP%j0j2j4k2k8k6k0k2k1pJ7K8J4j5l7m1k5LK1K1J0PJ0J1J%J2K6
$$ -624 -619 -597 -569 -549 -530 -503 -474 -454 -446 -439 -432 -432 -442 -454 -468 -490 -518 -544 -564 -586 -607 -614 -597 -569 -555 -570 -607 -648 -673 -670 -649 -628 -618 -611 -601 -590 -589 -589 -577 -551
8201e51K4Qqj9k6k4j4JJ4K6L3L0J2j3k2j1J2K5K5J4Njmlnqj7l1m1l6j7JQLMRJ2Plqj1j5k1
$$ -551 -527 -519 -527 -546 -572 -596 -610 -609 -595 -569 -536 -506 -494 -507 -529 -540 -528 -503 -478 -464 -459 -460 -464 -467 -472 -480 -497 -528 -569 -605 -622 -621 -613 -610 -606 -597 -585 -578 -581 -589 -600 -615 -636
8185f36k0j0NJ9K3K6K3J5lj9k4j8j3j0pLJ0P%jPJ1Nqj6j5oJJ0K0K7K1Kj7j7jJ0LrnJ4L0L0
$$ -636 -656 -666 -661 -642 -619 -593 -570 -555 -558 -577 -601 -619 -632 -642 -649 -646 -636 -629 -629 -630 -623 -612 -607 -615 -631 -646 -652 -651 -641 -621 -594 -573 -571 -588 -605 -606 -596 -593 -602 -607 -593 -563 -533
8169e33K0J0J1J5J7J0lj6j3KJ5J3mk6m3m5l5k0j2j0mJjj1j3o%%JL%j1j9j0J1K4K2J4QJ0K1
$$ -533 -513 -503 -492 -477 -460 -450 -453 -469 -482 -480 -465 -452 -456 -482 -525 -570 -605 -625 -637 -647 -651 -650 -651 -662 -675 -681 -681 -681 -680 -677 -677 -688 -707 -717 -706 -682 -660 -646 -638 -628 -607
8154f07K9K7J7J4K3K7J2rj4omj3j6nJ0J5J7J9J1pk1j8j0rj0jJ3J4Jj0pLJ1J3J5J8J5RORJ2
$$ -607 -578 -551 -534 -520 -497 -470 -458 -467 -481 -487 -491 -504 -520 -525 -515 -500 -483 -464 -453 -460 -481 -499 -509 -518 -528 -529 -516 -502 -501 -511 -518 -515 -504 -491 -476 -458 -443 -434 -428 -419 -407
8139d07J0Lnj3j8j7j1jQJ1Kj1k2k2j4lQJ7J4NkMJ5J7MpoMJ0Okpj5k5l0k8k1j4j0jJ2K1J9J4
$$ -407 -397 -394 -399 -412 -430 -447 -458 -459 -451 -440 -438 -449 -471 -493 -507 -510 -502 -485 -471 -466 -468 -464 -449 -432 -428 -435 -441 -437 -427 -421 -423 -430 -445 -470 -500 -528 -549 -563 -573 -574 -562 -541 -522 -508
8123e08J6J9J7jk2m0m6m0k7rNQJ0J6K3K5J9QJnj0j8k5k8k6j9pNJ4K1K1J8J5J7J9J1lj4j3n
$$ -508 -492 -473 -456 -457 -479 -519 -565 -605 -632 -641 -636 -628 -618 -602 -579 -554 -535 -527 -526 -531 -541 -559 -584 -612 -638 -657 -664 -659 -645 -624 -603 -585 -570 -553 -534 -523 -526 -540 -553 -558
8108e58LOPRPLjoro%MMmpm%lj1j3jJ7K6J5jqJRPkmllj0j7j9j9j8j5mJ0J5J1NMONnj0pklmM
$$ -558 -555 -549 -542 -533 -526 -523 -524 -530 -539 -545 -545 -541 -537 -541 -548 -552 -552 -555 -566 -579 -580 -563 -537 -522 -523 -531 -530 -521 -514 -516 -520 -523 -526 -536 -553 -572 -591 -609 -624 -628 -618 -603 -592 -587 -583 -577 -572 -577 -587 -594 -596 -599 -603 -599
8089e99J5J2pk1j2J4K8K2J2J4K2K9K7J6Jj2j2pj2k4k8j8nmj1j0pnnMJ2J5J0Mkqj4j3j0j3j7
$$ -599 -584 -572 -579 -600 -612 -598 -570 -548 -536 -522 -500 -471 -444 -428 -427 -439 -451 -458 -470 -494 -522 -540 -545 -549 -560 -570 -577 -582 -587 -583 -571 -556 -546 -542 -544 -552 -566 -579 -589 -602 -619
8074f19j2jLlojMJlJQJ2J1Qlk2m0m1k1PK8L1K1J3J6K2J4ok2k5j8j1KJ5J1j2l5l2oJ5J9K0K4
$$ -619 -631 -632 -629 -632 -638 -639 -635 -634 -637 -636 -628 -616 -605 -597 -600 -622 -662 -703 -724 -717 -689 -658 -637 -624 -608 -586 -572 -578 -600 -625 -643 -654 -652 -637 -626 -638 -673 -705 -711 -696 -677 -657 -633
8058f33K9K3J4J2J7J6Poj3j2oLJ4J9J7jj9k5j5LJ2J2O%qr%J1J0mj5j5r%QRLj2j6jJ9K1Jk0
$$ -633 -604 -581 -567 -555 -538 -522 -515 -521 -534 -546 -552 -549 -535 -516 -499 -500 -519 -544 -559 -556 -544 -532 -526 -526 -534 -543 -543 -532 -522 -526 -541 -556 -565 -565 -557 -548 -545 -557 -573 -574 -555 -534 -533 -553
8042e53j8OL1M0K9J4NOQQ%j0k1k2j4m%mrj0oJJ1J8J9J6RJj1k6l4l0j5kRJ4J1jj5k4k3j5nO
$$ -553 -571 -565 -534 -494 -465 -451 -446 -440 -432 -424 -424 -434 -455 -477 -491 -495 -495 -499 -508 -518 -524 -523 -512 -494 -475 -459 -450 -449 -460 -486 -520 -550 -565 -567 -558 -544 -533 -534 -549 -573 -596 -611 -616 -610
8026f10J0Jj6k9k5oJ9L5M0L5K8K4J6Jk1m3n4m7k7%J9K9K5J6Jj0j3mJ0K0K2K2K1K1J4%j8l0
$$ -610 -600 -599 -615 -644 -669 -675 -656 -621 -581 -546 -518 -494 -478 -477 -498 -541 -595 -642 -669 -669 -650 -621 -596 -580 -579 -589 -602 -606 -596 -576 -554 -532 -511 -490 -476 -476 -494 -524
8012e24l2l0k9k3rOJ0Jrj1nJKLMOJ1J7K2J5mj8k2j6pjNQNnj3rOK5L4K9J9J2J0J0J4J8K3K0
$$ -524 -556 -586 -615 -638 -647 -641 -631 -630 -639 -650 -655 -654 -652 -649 -645 -639 -628 -611 -589 -574 -578 -596 -618 -634 -641 -642 -637 -629 -624 -629 -642 -651 -645 -620 -586 -557 -538 -526 -516 -506 -492 -474 -451 -431
7995d31Lk3m3m1k5j1j2j9k2j8j5j2r%NMLQJ4J6J5RJj2j8pJ3K6J9Kj1j2qmLJ1J4RkqnOJ8K0
$$ -431 -428 -451 -494 -535 -560 -571 -583 -602 -624 -642 -657 -669 -678 -678 -673 -669 -666 -658 -644 -628 -613 -604 -603 -615 -633 -640 -627 -601 -582 -580 -591 -603 -611 -615 -612 -601 -587 -578 -580 -588 -593 -587 -569 -549
7979e49J3NJKLjj3j7qJ0J8Rln%%nmjnj6k3k4k6l1k4jK5L1J8Koprj1j3j4j3lJ4L0L5K6Nj7k6
$$ -549 -536 -531 -530 -528 -525 -526 -539 -556 -564 -554 -536 -527 -530 -535 -535 -535 -540 -544 -545 -550 -566 -589 -613 -639 -670 -694 -695 -670 -639 -621 -619 -625 -632 -641 -652 -665 -679 -692 -695 -681 -651 -616 -590 -585 -602 -628
7962f28k1oPJ4J5J4LpnJ3L2L3K0Koj0j3j2%J9L0J8oj7pNmk4l1j5J1K3K0J1Lnj1j4j4j3oOJ4
$$ -628 -649 -655 -648 -634 -619 -605 -602 -609 -614 -601 -569 -536 -516 -514 -520 -530 -543 -555 -555 -536 -506 -488 -494 -511 -518 -513 -517 -541 -572 -587 -576 -553 -533 -522 -519 -524 -535 -549 -563 -576 -582 -576 -562
7947e62J0K%mj2k6l2k6j8j1lPJ0JoOK4K5Kj7j8lMMOJ6K5K8K9K5J1j3l0l2k4j6j0ok%LPJ3J4
$$ -562 -552 -550 -550 -554 -566 -592 -624 -650 -668 -679 -682 -675 -665 -664 -670 -664 -640 -615 -613 -630 -648 -651 -647 -643 -637 -621 -596 -568 -539 -514 -503 -516 -546 -578 -602 -618 -628 -634 -636 -636 -633 -626 -613 -599
7931e99J2Pkj4k6l5m2m4l9k7j4LJ9L4M2L9L5L3K8J6RJ1J7J5KplOJ2J5J5J4J0Pjj6k9k7j3p
$$ -599 -587 -580 -582 -596 -622 -657 -699 -743 -782 -809 -823 -820 -801 -767 -725 -686 -651 -618 -590 -574 -565 -554 -537 -522 -520 -527 -530 -524 -512 -497 -482 -468 -458 -451 -452 -468 -497 -524 -537 -544
7916e44j5k1qJ1J6RJ2K9L8K4jk0k8l1k6rJ4K2J7QPJ4J8J4ROM%lnoj2k5l4l4k4j5j0j2j6j6
$$ -544 -559 -580 -588 -577 -561 -552 -540 -511 -473 -449 -450 -470 -498 -529 -555 -564 -550 -528 -511 -503 -496 -482 -464 -450 -441 -435 -431 -431 -434 -439 -445 -457 -482 -516 -550 -574 -589 -599 -611 -627 -643
7901f43j1lLMPJ5K2K0QknjmrnRK7K8J8OPJ2J3NmpjOJ4K1K6K3J1j1l5m8m5l4k1rNJ6K1J5PK
$$ -643 -654 -657 -654 -650 -643 -628 -606 -586 -578 -580 -585 -586 -590 -599 -604 -595 -568 -540 -522 -516 -509 -497 -484 -479 -483 -490 -491 -485 -471 -450 -424 -401 -390 -401 -436 -484 -529 -563 -584 -593 -588 -572 -551 -536 -529 -527
7884e27Lmj8l2l5k6rNJ4J5Oqj8j8nRJ6K0K0J5OlmJMJLOKqj7j4j2j5j7kK7M7M6K9RmpJRJ0K
$$ -527 -524 -528 -546 -578 -613 -639 -648 -643 -629 -614 -608 -616 -634 -652 -657 -648 -632 -612 -592 -577 -571 -574 -578 -577 -573 -572 -569 -563 -561 -569 -586 -600 -612 -627 -644 -646 -619 -572 -526 -497 -488 -492 -499 -498 -489 -479 -477
7867d77j0k2l0k8j3MRLKJ3K4K3J0ok1k8k6j4llj2k3k0oJ1J5OmnNJ0PLKoj8k4j5qj0qOK3K3
$$ -477 -487 -509 -539 -567 -580 -576 -567 -564 -562 -549 -525 -502 -492 -498 -519 -547 -573 -587 -590 -593 -605 -628 -648 -654 -643 -628 -622 -626 -631 -626 -616 -609 -606 -604 -610 -628 -652 -667 -675 -685 -693 -687 -664 -641
7851f41OnJJ6K4K3J4Krj3rkLNN%qj3j5k3l3l4k1jQQPQQNLLJJNJ2J8J5J1POK%MRPmj9k4j4N
$$ -641 -635 -640 -639 -623 -599 -576 -562 -560 -569 -582 -591 -593 -590 -585 -580 -580 -588 -601 -616 -639 -672 -706 -727 -728 -720 -712 -705 -697 -689 -684 -681 -678 -677 -676 -671 -659 -641 -626 -615 -608 -602 -600 -600 -596 -587 -580 -584 -603 -627 -641 -636
7832f36K0K1J4POQQPPPOKJLPROLjrj8j9j0jnj9l3l4k2mRJ6K3L0L5K5RkjL%%QJ8J7PJOROlp
$$ -636 -616 -595 -581 -574 -568 -560 -552 -545 -538 -531 -525 -523 -522 -519 -512 -503 -497 -494 -495 -504 -522 -541 -551 -552 -557 -576 -609 -643 -665 -669 -660 -644 -621 -591 -556 -531 -522 -524 -525 -522 -522 -522 -514 -496 -479 -472 -471 -465 -456 -450 -453 -460
7813d60jMOjj2j7j6k0l0l7k8pMMjJMOL%%MJ7K6J7pj8oJ3J3lk1l0l0k2kK0L5L9L7K3Jj6qJ3
$$ -460 -461 -457 -451 -452 -464 -481 -497 -517 -547 -584 -612 -619 -615 -611 -612 -611 -607 -601 -598 -598 -598 -594 -577 -551 -534 -541 -559 -565 -552 -539 -542 -563 -593 -623 -645 -647 -627 -592 -553 -516 -493 -492 -508 -516 -503
7796e03K2Oj2k1k3k9l6k6mRNopQL0L9K5%j5j6j7k4l2k1LK5K6J4NNJ0J2J0PJ2J7J9J4P%lrj5
$$ -503 -481 -475 -487 -508 -531 -560 -596 -622 -626 -617 -612 -618 -625 -617 -587 -548 -523 -523 -538 -554 -571 -595 -627 -648 -645 -620 -594 -580 -575 -570 -560 -548 -538 -531 -519 -502 -483 -469 -462 -462 -465 -474 -489
7781d89j8j5rmllkKLkpjJ0J6Lj9l1k4oQJ3J5J5J4J1PPJ0J1NjKJ3J8J3Njrk1l1k6nJ0Qrk1j9
$$ -489 -507 -522 -531 -535 -538 -541 -543 -541 -538 -540 -547 -548 -538 -522 -519 -538 -569 -593 -599 -591 -578 -563 -548 -534 -523 -516 -509 -499 -488 -483 -484 -482 -469 -451 -438 -433 -434 -443 -464 -495 -521 -526 -516 -508 -517 -538 -557
7763e57j0nn%J0J8J3lj1rjNJ0J4J6J1NMPPJpj6j5kJ4J7%k1k9k3j1ojQJ7K2K2K0J4Lj0j4j3
$$ -557 -567 -572 -577 -577 -567 -549 -536 -539 -550 -559 -560 -555 -545 -531 -515 -504 -499 -495 -488 -481 -480 -487 -503 -518 -520 -506 -489 -489 -510 -539 -562 -573 -579 -580 -572 -555 -533 -511 -491 -477 -474 -484 -498 -511
7747e11qKJ4J9Pj4l4m1l5k2j4j3j8k0j7j1pJJ4K8K9J9J2J5K0J9J1J2J9K4J8Nj0j9k0j0RK0
$$ -511 -519 -517 -503 -484 -477 -491 -525 -566 -601 -623 -637 -650 -668 -688 -705 -716 -723 -722 -708 -680 -651 -632 -620 -605 -585 -566 -555 -543 -524 -500 -482 -477 -487 -506 -526 -536 -527 -507
7733e07J2qk4k8k3j2%J3J8Rpj7j7pOJ6J9J8J4R%j2j9j9qLJ0Qkj3j8j7j3j1rkNJ2J6K1K2J4
$$ -507 -495 -503 -527 -555 -578 -590 -590 -577 -559 -550 -557 -574 -591 -598 -592 -576 -557 -539 -525 -516 -516 -528 -547 -566 -574 -571 -561 -553 -555 -568 -586 -603 -616 -627 -636 -638 -633 -621 -605 -584 -562 -548
7718e48nk0j9mRQrk6k5j0RK1K1J6Ppk1k4j9j1o%PRNLMPKnmMJ0OJJ0L0M4M2K7Pj3l3n0m8l0
$$ -548 -553 -573 -592 -596 -587 -579 -588 -614 -639 -649 -640 -619 -598 -582 -575 -582 -603 -627 -646 -657 -663 -663 -656 -647 -642 -639 -635 -628 -626 -631 -635 -631 -621 -615 -614 -604 -574 -530 -488 -461 -454 -467 -500 -550 -598 -628
7701f28r%mnQK4L2K7K1J6J2Kj0j6j6j4j3j1jJ6K4J6%j6j9j7j5j1p%RK2L5L9K9J1nj7k4k5j1
$$ -628 -637 -637 -641 -646 -638 -614 -582 -555 -534 -518 -506 -504 -514 -530 -546 -560 -573 -584 -585 -569 -545 -529 -529 -545 -564 -581 -596 -607 -614 -614 -605 -583 -548 -509 -480 -469 -474 -491 -515 -540 -551
7686e51J0J8J1lplnj1j4rjMOQQPOOKkpj0j2j4qJRNmj1j2rn%jrj8j8oNLj1k1k2k0k6l1k8j5
$$ -551 -541 -523 -512 -515 -522 -525 -530 -541 -555 -564 -565 -561 -555 -547 -539 -532 -526 -520 -518 -520 -527 -537 -549 -563 -571 -570 -561 -556 -560 -571 -583 -592 -597 -597 -598 -607 -625 -643 -649 -644 -641 -652 -673 -695 -715 -741 -772 -800 -815
7668h15KJ2J8J9J8J3MknlRK6L8L4J6j0l1m4m1k6nJ0J1PLK%lkNJ6K6L2L3L1L0K7K0Qjqj8l4
$$ -815 -813 -801 -783 -764 -746 -733 -729 -731 -736 -739 -730 -704 -666 -632 -616 -626 -657 -701 -742 -768 -773 -763 -752 -745 -742 -740 -740 -743 -745 -740 -724 -698 -666 -633 -602 -572 -545 -525 -517 -518 -526 -544 -578
7652e78m2l3j5%J2K8M4M6L5K1J5Rmk1l6m8n3m2j3J5K8K8K7K6J6jj4k3k7k9k3rLJ0J3J2J1J0
$$ -578 -620 -653 -668 -668 -656 -628 -584 -538 -503 -482 -467 -458 -462 -483 -519 -567 -620 -662 -675 -660 -632 -604 -577 -551 -535 -536 -550 -573 -600 -629 -652 -661 -658 -648 -635 -623 -612 -602
7638f02Nkj3j7j0mnqNK6L6K2%j4j5nJ2L0L4K0Mj%mj6k6k6k1j0%J0J5J8J7Pj1j8qRJ2LjMOJ
$$ -602 -597 -599 -612 -629 -639 -643 -648 -656 -651 -625 -589 -567 -567 -581 -596 -601 -589 -559 -525 -505 -501 -502 -502 -506 -522 -548 -574 -595 -605 -605 -595 -580 -562 -545 -538 -549 -567 -575 -566 -554 -551 -552 -548 -542 -541
7622e41lljlnj0k3l6m0k6roj3k1j8mJ5L2M1L9K8J4JlJLjrj2qml%ORJ0QPMmj1j4j1jJ8L3L1
$$ -541 -544 -547 -548 -551 -556 -566 -589 -625 -665 -691 -700 -706 -719 -740 -758 -762 -747 -715 -674 -635 -607 -593 -592 -595 -594 -591 -592 -601 -613 -621 -625 -628 -628 -622 -613 -603 -595 -588 -584 -588 -599 -613 -624 -625 -607 -574 -543
7604e43J4nj1j5j7j2LJ9J9J1QJ3J7J5Qkj8l1l0j1QJ6J2J0J8L2M2L6J5rk5k5j7j1nKJ1J2OJ
$$ -543 -529 -534 -545 -560 -577 -589 -586 -567 -548 -537 -529 -516 -499 -484 -476 -478 -496 -527 -557 -568 -560 -544 -532 -522 -504 -472 -430 -394 -379 -388 -413 -438 -455 -466 -471 -469 -458 -446 -440 -439
7590d39LJ2J6Pmn%jj8l2l2j8ojLJ0J5J1Koj1j5j9k6k8k3rKOLQJ8K4K2J4QKrk2k9k3nQJ2Kp
$$ -439 -436 -424 -408 -401 -405 -410 -410 -411 -429 -461 -493 -511 -517 -518 -515 -505 -490 -479 -477 -483 -494 -509 -528 -554 -582 -605 -614 -612 -606 -603 -595 -577 -553 -531 -517 -509 -507 -516 -538 -567 -590 -595 -587 -575 -573 -580
7573e80mNJ4J5Rlj7k2j2OJ6J7J2Mqj6oJ5K8K0J0J1K2K1Rpj7k5k5j5LJ1Q%pj3j7j3prj6j0J5
$$ -580 -584 -579 -565 -550 -541 -544 -561 -583 -595 -589 -573 -556 -544 -540 -548 -564 -570 -555 -527 -507 -497 -486 -464 -443 -434 -441 -458 -483 -508 -523 -520 -509 -501 -501 -508 -521 -538 -551 -558 -567 -583 -593 -578
7557e78M4M9L1Qj1k2l1k8j2PJ5J1PJ0Rok7l3k1lKpj2j2j1j5k0k1j9j3lJ4L2L9L6L4L4L1J8
$$ -578 -534 -485 -454 -446 -457 -479 -510 -538 -550 -543 -528 -517 -510 -500 -491 -497 -524 -557 -578 -581 -579 -586 -598 -610 -621 -636 -656 -677 -696 -709 -712 -698 -666 -627 -591 -557 -523 -492 -474
7543d74mk1k2j6j2j5j6j1lOJ8L0L6K7Lj8k6k0j2mKOJ4J9J9J2%qqJRRLoqporrnkmj1j4j1lN
$$ -474 -478 -499 -521 -537 -549 -564 -580 -591 -594 -588 -570 -540 -504 -477 -474 -492 -518 -538 -550 -554 -552 -546 -532 -513 -494 -482 -482 -490 -498 -497 -488 -479 -476 -482 -490 -497 -503 -512 -521 -526 -528 -532 -543 -557 -568 -571 -566
7526e66ROlj6k6k8k2rLPLMJ3K6K9K5J9J7J7J6J7J8J3Kj3k8l9m4l5j7jQPLnj1j2j2j4j7mK3
$$ -566 -557 -551 -554 -570 -596 -624 -646 -655 -652 -645 -642 -638 -625 -599 -570 -545 -526 -509 -492 -476 -459 -441 -428 -426 -439 -467 -506 -550 -585 -602 -603 -595 -588 -585 -590 -601 -613 -625 -639 -656 -660 -637
7510f37M4M1K2QJ0J8J8Qqj6j2kNkj6k4j6QK8L0J6%rj5k2k4qK0L1Rk7m1k6mNJ0J4Rj4l7l7j3
$$ -637 -593 -552 -530 -522 -512 -494 -476 -468 -476 -492 -504 -506 -501 -503 -519 -543 -559 -551 -523 -493 -477 -477 -486 -501 -523 -547 -555 -535 -504 -495 -522 -563 -589 -593 -588 -578 -564 -555 -569 -606 -643 -656
7495f56J6K6J9QKOJ2K3L0K7J1j1l1l7l1j7LK1K6J9MnmLQJ2J8K3K6K0J4PJllLJ4J9J3mk6l6
$$ -656 -640 -614 -595 -587 -585 -579 -567 -544 -514 -487 -476 -487 -518 -555 -586 -603 -600 -579 -553 -534 -530 -535 -539 -536 -528 -516 -498 -475 -449 -429 -415 -408 -407 -410 -413 -410 -396 -377 -364 -368 -394 -430
7479d30l7l0k5k0k1k3k4j6JJ2J0jqqKJ5L3M3L6J0j6k3rQPqk0j8j0j0j5j7j2lLOJ0J3J2J0R
$$ -430 -467 -497 -522 -542 -563 -586 -610 -626 -625 -613 -603 -604 -612 -620 -618 -603 -570 -527 -491 -481 -497 -520 -529 -521 -514 -522 -542 -560 -570 -580 -595 -612 -624 -627 -624 -618 -608 -595 -583 -573 -564
7464e64PKpj3j5j4rLJ5J9Rmj3j1j1j2rKJ2J5QKkjKJ0K1K3J6J0J0Rnk6l6l1k1j5j2mJ3K8L3
$$ -564 -557 -555 -562 -575 -590 -604 -613 -610 -595 -576 -567 -571 -584 -595 -606 -618 -627 -625 -613 -598 -590 -588 -590 -591 -589 -579 -558 -535 -519 -509 -499 -490 -495 -521 -557 -588 -609 -624 -636 -640 -627 -599 -566
7449e66K4Rjm%LJkkjjkmnokKJpj1rkKLNJ3K6L6L7K6Rpj6k2k7k1rMMj1k5k3rPJ1jj9l2k9j7
$$ -566 -542 -533 -534 -538 -538 -535 -534 -536 -538 -539 -540 -542 -546 -551 -557 -559 -557 -556 -563 -574 -583 -585 -583 -580 -575 -562 -536 -500 -463 -437 -428 -435 -451 -473 -500 -521 -530 -526 -522 -533 -558 -581 -590 -583 -572 -573 -592 -624 -653 -670
7430f70mMRJ3J5J7J1%j4k3k2j8j4pLJ9K8K7J6jj5j7rMJ2J8K2K1Prj0KJ7J8Oj2l0l8k7mJ5J5
$$ -670 -674 -670 -661 -648 -633 -616 -605 -605 -619 -642 -664 -682 -696 -703 -700 -681 -653 -626 -610 -611 -626 -643 -652 -648 -636 -618 -596 -575 -568 -577 -587 -585 -568 -550 -544 -556 -586 -624 -651 -655 -640 -625
7415f25J0OQNNJ2J6Qrj7j3j0j3j0NJ9J5jrnlj3k1j4KJ1J2J6K5K4Mj9k5j4%J2K1K5J5ok3k5
$$ -625 -615 -609 -601 -596 -591 -579 -563 -555 -564 -581 -594 -604 -617 -627 -622 -603 -588 -589 -598 -603 -606 -619 -640 -654 -652 -641 -629 -613 -588 -564 -560 -579 -604 -618 -618 -606 -585 -560 -545 -551 -574 -599
7399e99j6nRK2K0ol4l9k1JJ0PjppJJ2J8J4RLkpprj6k6k1mRNrj2pjLJ1J7J7J0NRJ3J1OJj0k1
$$ -599 -615 -620 -611 -589 -569 -575 -609 -648 -669 -668 -658 -651 -652 -659 -666 -665 -653 -635 -621 -612 -609 -611 -618 -625 -634 -650 -676 -697 -701 -692 -687 -696 -708 -715 -716 -713 -702 -685 -668 -658 -653 -644 -631 -620 -614 -613 -623 -644
7382f44j8JK3L1K5J8J5Prk5k8j8qlnj2k2k8k3pQJ9K4K3J5PLLNOJ0J5J7RMMJ0J2ROKlo%J1K1
$$ -644 -662 -661 -638 -607 -582 -564 -549 -542 -551 -576 -604 -622 -630 -633 -638 -650 -672 -700 -723 -730 -722 -703 -679 -656 -641 -634 -631 -628 -623 -617 -607 -592 -575 -566 -562 -558 -548 -536 -527 -521 -519 -522 -528 -528 -517 -496
7365d96K0J0lj7k3k0rMRNlj2j5rjnk4m2m3k7nJ1K3L4L6L2L0L3L4L1K3J3Nmj4j7j5j1j0j0q
$$ -496 -476 -466 -469 -486 -509 -529 -538 -534 -525 -520 -523 -535 -550 -559 -560 -565 -589 -631 -674 -701 -706 -695 -672 -638 -602 -570 -540 -507 -473 -442 -419 -406 -401 -405 -419 -436 -451 -462 -472 -482 -490
7350d90oqj6k1j8j2j3k2k9k9k4j9pQK0J9J0J2K7M3M9M6M0K6Lk1l3k6j2%Mlj4k1k0j4qolNJ4
$$ -490 -496 -504 -520 -541 -559 -571 -584 -606 -635 -664 -688 -707 -714 -706 -686 -667 -657 -645 -618 -575 -526 -480 -440 -414 -411 -432 -465 -491 -503 -503 -499 -502 -516 -537 -557 -571 -579 -585 -588 -583 -569
7335e69K4L1K9J7lk1k9k6k1j8j6oJ2L0L6L2K2J5J1Jj5l1l7l0j3MJ5J0%qmLROmj5j9qJ6L3K2
$$ -569 -545 -514 -485 -468 -471 -492 -521 -547 -568 -586 -602 -608 -596 -566 -530 -498 -476 -461 -450 -449 -464 -495 -532 -562 -575 -571 -556 -546 -546 -554 -558 -555 -546 -540 -544 -559 -578 -586 -570 -537 -515
7320e15j3m8o1n0k9j0OK0L0L6L9M0L2J2j1k6k5j1NRkj7k4k0j0jLOPPOJ3K5L6L5K2Jj4j7rl
$$ -515 -528 -576 -637 -687 -716 -726 -720 -700 -670 -634 -595 -555 -523 -511 -522 -548 -573 -584 -579 -570 -572 -589 -613 -633 -643 -644 -641 -635 -628 -621 -615 -602 -577 -541 -506 -484 -483 -497 -514 -523 -526
7305e26rj8j5mjj0j6pQJ1jj8k7k3nJ7L2L2K2J5RRRJ2Mj8m0m6l3k0j7j7rkjkJ0K8L8L5L0L1
$$ -526 -535 -553 -568 -572 -573 -583 -599 -606 -598 -587 -588 -606 -633 -656 -661 -644 -612 -580 -558 -543 -534 -525 -516 -504 -500 -518 -558 -604 -637 -657 -674 -691 -700 -702 -703 -705 -695 -667 -629 -594 -564 -533
7289e33L0J8MlKPOkqj3j2j5j6j8j5oJ%pj3j2lRK3K8K2Lj9l0k7j4kNNJkMJ4J8Orj2lOPJ0K0
$$ -533 -503 -485 -481 -484 -482 -475 -469 -471 -479 -492 -504 -519 -535 -553 -568 -574 -573 -573 -580 -593 -605 -608 -599 -576 -548 -526 -523 -542 -572 -599 -613 -615 -610 -605 -604 -606 -602 -588 -570 -564 -573 -585 -588 -582 -575 -565 -545
7272e45K7K1Npj0pqj1j6j9j3mlj3k0j1J2L4M1K9J1mj2j0lKKnj4k0j7lPQKjkoj4j9j4rppno
$$ -545 -518 -497 -492 -499 -509 -516 -524 -535 -551 -570 -583 -587 -590 -603 -623 -634 -622 -588 -547 -518 -507 -511 -523 -533 -536 -534 -532 -537 -551 -571 -588 -591 -584 -576 -574 -575 -577 -583 -597 -616 -630 -639 -646 -653 -658 -664
7255f64plRJ9J4KonLJ4K1J9J1KNJ8K7K8J6MlKJ0Pj2l2l8l2k7k0mJ7K9K2Ooj6k4k6j6jNJnm
$$ -664 -671 -674 -665 -646 -632 -630 -636 -641 -638 -624 -603 -584 -573 -571 -566 -548 -521 -493 -477 -473 -476 -474 -464 -457 -469 -501 -539 -571 -598 -618 -622 -605 -576 -554 -548 -554 -570 -594 -620 -636 -637 -632 -631 -636 -640
7239f40JMMLKMMjqj6k1k1j5oNJ1J0OLRK1L2L1J9Oknj1k0k1j1kMMPJ5K6L3L2K0Nlkjpj7k7k9
$$ -640 -639 -635 -631 -628 -626 -622 -618 -619 -627 -643 -664 -685 -700 -706 -701 -690 -680 -674 -671 -662 -641 -609 -578 -559 -553 -555 -560 -571 -591 -612 -623 -625 -621 -617 -610 -595 -569 -536 -504 -484 -479 -482 -484 -485 -492 -509 -536 -565
7221e65k3j0LOnj7k1j7j0nKQRNKORJ0RQMjj0j7j6nJ3K6K6J4MOJ4J7J2Kj1j8j9j4nLQPjrj0
$$ -565 -588 -598 -595 -589 -594 -611 -632 -649 -659 -664 -662 -654 -645 -640 -638 -632 -623 -613 -604 -596 -592 -593 -603 -620 -636 -641 -628 -602 -576 -562 -558 -552 -538 -521 -509 -507 -518 -536 -555 -569 -574 -571 -563 -556 -557 -566 -576
7204e76pprrJJ5K6K4J2kj0j2j5k9l9l3j1POpj6j7j8k2j9j0%JKPJ7K8L7M2L7K0Kj1k0k3j9p
$$ -576 -583 -590 -599 -608 -607 -592 -566 -542 -530 -532 -542 -554 -569 -598 -637 -670 -681 -674 -668 -675 -691 -708 -726 -748 -767 -777 -777 -776 -774 -767 -750 -722 -685 -643 -606 -586 -584 -595 -615 -638 -657 -664
7189f64JJjNJ5Rpj4lJ3J8J3QP%okJ5K3J8OMJ2J5J2Npk8n1n7l8rRPjqj2j5j0NK8M6M7K9PjP
$$ -664 -663 -662 -663 -658 -643 -634 -641 -655 -658 -645 -627 -614 -606 -599 -599 -605 -607 -592 -569 -551 -545 -541 -529 -514 -502 -497 -504 -532 -583 -640 -678 -687 -678 -671 -672 -680 -692 -707 -717 -712 -684 -638 -591 -562 -555 -556 -549
7171e49K0K2J0qj7j2KQmk1k8j9kOPMkoqmkoj0oOJ4QlrpljKJ4K3K1Nj4k3k2j8j4rjKnj7j9k
$$ -549 -529 -507 -497 -505 -522 -534 -532 -524 -528 -549 -577 -596 -598 -592 -585 -581 -583 -589 -597 -601 -603 -609 -619 -625 -619 -605 -597 -600 -609 -616 -619 -620 -618 -604 -581 -560 -555 -569 -592 -614 -632 -646 -655 -656 -654 -659 -676 -695 -697
7153f97K4L9L6K8K8L7L8J8j1k2j1MJ0Krj3j3oNJ4J9J9J7J1LJPJ3J5J2J0Nj2l3m7m3l1j3NJ7
$$ -697 -673 -634 -598 -570 -542 -505 -467 -449 -460 -482 -493 -489 -479 -477 -486 -499 -512 -518 -513 -499 -480 -461 -444 -433 -430 -429 -422 -409 -394 -382 -372 -367 -379 -412 -459 -502 -533 -546 -541 -524
7139e24J4mj9k1j2jNQJ2J1RLpj8k3k4k9l7l5j6J3K8L0K9L4L0J5pj7j6j5j5j0KJ6J7Mj2j6j0
$$ -524 -510 -514 -533 -554 -566 -567 -562 -554 -542 -531 -522 -519 -526 -544 -567 -591 -620 -657 -692 -708 -695 -667 -637 -608 -574 -544 -529 -536 -553 -569 -584 -599 -609 -607 -591 -574 -570 -582 -598 -608
7124f08rj7k2j2OJ5J3J1J5K6L9N0N1L4Mk2l8m5m6l8k5j8k8l5k4%J7J6NLJ3K5K9K2Oj0j6pJ0
$$ -608 -617 -634 -656 -668 -662 -647 -634 -623 -608 -582 -543 -493 -442 -408 -404 -426 -464 -509 -555 -593 -618 -636 -664 -699 -723 -723 -706 -690 -685 -682 -669 -644 -615 -593 -587 -597 -613 -620 -610
7110f10K4L0K3Qj0k2k5k2j3%J9L7M4L1jl1m2k6LK2K4J6Mpk1k8k2%K1K4Pj5k6k8k4j7mRJ3R
$$ -610 -586 -556 -533 -525 -535 -557 -582 -604 -617 -617 -598 -561 -517 -486 -487 -518 -560 -586 -583 -561 -537 -521 -517 -524 -545 -573 -595 -595 -574 -550 -543 -558 -584 -612 -636 -653 -657 -648 -635 -626
7095f26J0J7K7K3J3K%Jlj0j4j5j2nOK5M0M3K5%k0k7k6k3k3k6k6k1kK0K8J3oj0%RQOJ1J5Qj1
$$ -626 -616 -599 -572 -549 -536 -534 -534 -533 -536 -546 -560 -575 -587 -592 -586 -561 -521 -478 -453 -453 -473 -500 -526 -549 -572 -598 -624 -645 -647 -627 -599 -586 -592 -602 -602 -593 -585 -579 -568 -553 -545 -556
7080e56k8l3k5j3ojOJ4J2Jq%J6K3J9J3J2R%qj1j3j9k4j6njplJ1K6K6J8J5J3J1OOQKj4k4j7
$$ -556 -584 -617 -642 -655 -661 -662 -656 -642 -630 -629 -637 -637 -621 -598 -579 -566 -554 -545 -545 -553 -564 -577 -596 -620 -636 -641 -642 -649 -652 -641 -615 -589 -571 -556 -543 -532 -526 -520 -512 -510 -524 -548 -565
7064e65kPMnj4k5l6l4j5PJ7J4Omj5k0j0QJ9J7J1QJ2J1Plj5k2k1j4JJ4K5K4Oj4j9jJ9K5J8J2
$$ -565 -567 -560 -556 -561 -575 -600 -636 -670 -685 -678 -661 -647 -641 -645 -660 -680 -690 -682 -663 -646 -635 -627 -615 -604 -597 -600 -615 -637 -658 -672 -671 -657 -632 -608 -602 -616 -635 -636 -617 -592 -574 -562
7048e62QLqj7k5l0k6rJ5L4M2L7K4Lj9l5l9l1j1J6L4K8Nj6k2j0KOJpj0okJJLNNORRkj1lJ7K8
$$ -562 -554 -551 -559 -576 -601 -631 -657 -666 -651 -617 -575 -538 -514 -511 -530 -565 -604 -635 -646 -630 -596 -568 -563 -579 -601 -611 -609 -603 -602 -609 -619 -625 -627 -626 -625 -622 -617 -612 -606 -597 -588 -590 -601 -604 -587 -559
7032e59J8mk2k5j8qJJkjRJ6J5J1RQKrk0k2j8qJKmoJ0K8L1J7LMJ4K1J8J2PJ%OJ7K4J7Jj0jJ7
$$ -559 -541 -545 -567 -592 -610 -618 -617 -616 -618 -619 -610 -594 -579 -568 -559 -551 -549 -558 -578 -600 -618 -626 -625 -623 -627 -633 -623 -595 -564 -547 -544 -540 -526 -505 -487 -475 -468 -467 -467 -461 -444 -420 -403 -402 -412 -413 -396
7014c96K5J4nj9k7l1k6j1LJj5k5k1ronJJ2K1K0J4Olj2j6pPJ1nk9m0k6o%noloj6k3k3j9j1M
$$ -396 -371 -357 -362 -381 -408 -439 -465 -476 -473 -472 -487 -512 -533 -542 -548 -553 -552 -540 -519 -499 -485 -479 -482 -494 -510 -517 -510 -499 -504 -533 -573 -599 -605 -605 -610 -616 -619 -625 -641 -664 -687 -706 -717 -713
6998g13K3L6L7K8J9QJNK9N5N9L1nk8k9j3JJrk0j9qJJqj7k3k3k1k0k2k2j1MJ0MlkNJ5K3K9L1
$$ -713 -690 -654 -617 -589 -570 -562 -561 -556 -527 -472 -413 -382 -387 -415 -444 -457 -456 -455 -464 -484 -503 -511 -510 -509 -517 -534 -557 -580 -601 -621 -643 -665 -676 -672 -662 -658 -661 -663 -658 -643 -620 -591 -560
6982e60K8K6K6K6K3J5Jj3k2k4k4l1m0l7k1jO%j0j3j2j1j5j4mJ2J9Rj0j7nJ2J6J3RNkj3j5j0
$$ -560 -532 -506 -480 -454 -431 -416 -415 -428 -450 -474 -498 -529 -569 -606 -627 -628 -622 -622 -632 -645 -657 -668 -683 -697 -701 -689 -670 -661 -671 -688 -693 -681 -665 -652 -643 -638 -640 -653 -668 -678
6968f78oqj0jJ2K3K5J9Qqk4k7j5MJ7J7J1M%oj2j2nRJ7K0K0K5K6K1J0kqj3j8k4k7k0oPJ1J1
$$ -678 -684 -692 -702 -703 -691 -668 -643 -624 -616 -624 -648 -675 -690 -686 -669 -652 -641 -637 -637 -643 -655 -667 -672 -663 -646 -626 -606 -581 -555 -534 -524 -526 -534 -547 -565 -589 -616 -636 -642 -635 -624 -613
6952f13J4K0K4J9Oqj7j2kOLmrrrroNJ4Qqj9j5%J0QKLJ1J0ok1j4J0K2J2noRJ2Jj0lRJ2KkQJ6
$$ -613 -599 -579 -555 -536 -530 -538 -555 -567 -569 -563 -560 -564 -573 -582 -591 -600 -606 -601 -587 -579 -587 -606 -621 -621 -611 -603 -601 -598 -587 -577 -583 -604 -618 -608 -586 -574 -579 -585 -576 -564 -563 -573 -576 -567 -555 -553 -555 -547 -531
6934e31Nj8l1k7j7j6k4k5qJ9L8M2L5K1J2N%qj3rPK0K5J8J2Nkj3j8j7j6k0k7k6j2MJ3J6J3Q
$$ -531 -526 -544 -575 -602 -619 -635 -659 -684 -692 -673 -635 -593 -558 -537 -525 -520 -520 -528 -541 -550 -543 -523 -498 -480 -468 -463 -465 -478 -496 -513 -529 -549 -576 -602 -614 -610 -597 -581 -568 -560
6920e60Kqj7k1k3k1j2NK4K9J8MNJ4J9Poj1nkrk2k5j0J4L0K8J6Kj3k3k9k7j6mPJ3J4J1J4J8
$$ -560 -558 -566 -583 -604 -627 -648 -660 -655 -631 -602 -584 -580 -575 -561 -542 -535 -541 -552 -557 -559 -568 -590 -615 -625 -611 -581 -553 -537 -535 -548 -571 -600 -627 -643 -647 -640 -627 -613 -602 -588 -570
6905e70J8RnnNJ6J9J7J5Rok2l1l1k3qJ0K2J8Jj7k9l5l4k7j0PK0K4K1J5J2J1Ooj7j7rnpj1j2
$$ -570 -552 -543 -548 -553 -548 -532 -513 -496 -481 -472 -478 -500 -531 -562 -585 -593 -583 -561 -543 -542 -559 -588 -623 -657 -684 -694 -687 -667 -643 -622 -607 -595 -584 -578 -584 -601 -618 -627 -632 -639 -650 -662
6889f62rjJ1J5J0NOJ3J1jrnOJ1QMRK2L6M0K7Oon%%JM%j3k9l4k9k0j2olnmNJ8K6J9Q%jL%qj9
$$ -662 -671 -672 -661 -646 -636 -631 -625 -612 -601 -602 -611 -616 -610 -599 -591 -587 -578 -556 -520 -480 -453 -447 -453 -458 -458 -458 -457 -453 -453 -466 -495 -529 -558 -578 -590 -596 -599 -604 -608 -603 -585 -559 -540 -532 -532 -533 -530 -530 -538 -557
6871e57j4QL1L0Ok2l4k6j1LNkj7k6k8k1j0LJ5K3K5K9L7L6K3Noolpj0qLJ0Qnj8j9j0KQPRJ3
$$ -557 -571 -563 -532 -502 -496 -518 -552 -578 -589 -586 -581 -583 -600 -626 -654 -675 -685 -682 -667 -644 -619 -590 -553 -517 -494 -489 -495 -501 -504 -511 -521 -529 -526 -516 -508 -513 -531 -550 -560 -558 -550 -543 -534 -521
6855e21J3RLoj8k9l4l1k0qOJ8K4K2J5ROKnj2j1lJ2K1K0J1%rj5j4pkrk2k4qJ1J2jj6k2l0l9
$$ -521 -508 -499 -496 -502 -520 -549 -583 -614 -634 -642 -636 -618 -594 -572 -557 -548 -542 -540 -545 -557 -568 -571 -559 -538 -518 -507 -507 -516 -531 -545 -552 -554 -563 -585 -609 -617 -606 -594 -595 -611 -633 -663 -702
6839g02m1k0J1L3L5K2Mj0j2JK3L6L0J8J0Ojj6k9k6j4ppj2r%OJqoJ2L4M2L6K8K8K9J8Jqo%M
$$ -702 -743 -763 -752 -719 -684 -662 -658 -668 -680 -679 -656 -620 -590 -572 -562 -556 -557 -573 -602 -628 -642 -649 -656 -668 -677 -677 -671 -670 -678 -684 -672 -638 -596 -560 -532 -504 -475 -457 -456 -464 -470 -470 -466
6823d66PQLqj0%J0Kk0l4k9k1k2k8l0j9kJ3K4L1L0K4J8J7J6J0mj4j2k%j3k2j5LJ0Kqj0oopn
$$ -466 -459 -451 -448 -456 -466 -466 -456 -454 -474 -508 -537 -558 -580 -608 -638 -657 -659 -646 -622 -591 -561 -537 -519 -502 -486 -476 -480 -494 -506 -508 -508 -521 -543 -558 -555 -545 -543 -551 -561 -567 -573 -580 -585
6807e85mqj2j0kNJ0J9K7K6J5PNNJkmpplMO%opj0j6k3k6k7l5l8k5KK6L4K8J7N%MJ0Oj2k5j9
$$ -585 -589 -597 -609 -619 -621 -616 -606 -587 -560 -534 -519 -512 -507 -502 -501 -503 -507 -514 -521 -524 -520 -514 -514 -520 -527 -537 -553 -576 -602 -629 -664 -702 -727 -725 -699 -665 -637 -620 -615 -615 -611 -601 -595 -607 -632 -651
6791f51JJ7K0J4QMjj2j9j4KJ1Npj2nKNNJ1J8J9J8J4R%j2j3rkjlmmlnj0j7k0j5lOJ0POMMLO
$$ -651 -650 -633 -613 -599 -591 -587 -588 -600 -619 -633 -631 -620 -615 -622 -634 -639 -637 -632 -627 -616 -598 -579 -561 -547 -538 -538 -550 -563 -572 -574 -575 -578 -582 -586 -589 -594 -604 -621 -641 -656 -659 -653 -643 -636 -630 -626 -622 -619 -613
6773f13J1J3J0Nkrj3qmj1k6k9j2J0J7J3J8L8N6N0K0j1l0l3k6j9j7j9k2k2j6kJ8L9M9M3K4O
$$ -613 -602 -589 -579 -574 -576 -585 -598 -606 -610 -621 -647 -676 -688 -678 -661 -648 -630 -592 -536 -486 -466 -477 -507 -540 -566 -585 -602 -621 -643 -665 -681 -683 -665 -626 -577 -534 -510 -504
6759e04klJNMj0k6l6k7pPKj1j7rJMjLJ3J7PppOJ9J9Qoj2nJ1K4K5J6J0Ojj4k2j7j2j3j5qQK1
$$ -504 -506 -509 -508 -503 -499 -509 -535 -571 -598 -605 -598 -596 -607 -624 -633 -632 -628 -629 -626 -613 -596 -589 -596 -603 -597 -578 -559 -551 -557 -569 -574 -563 -539 -514 -498 -488 -482 -483 -497 -519 -536 -548 -561 -576 -584 -576 -555
6741e55K2J3PLK%lj2k6l6l1j8mlj1j8j6j0oJJ5K8L4K7K1J6J2RJ2J9J9J2J0J5J7J0JjKjj4k3
$$ -555 -533 -520 -513 -510 -508 -508 -511 -523 -549 -585 -616 -634 -638 -641 -652 -670 -686 -696 -702 -701 -686 -658 -624 -597 -576 -560 -548 -539 -527 -508 -489 -477 -467 -452 -435 -425 -424 -425 -423 -424 -438 -461
6726d61k0j4j3j6j9j5roj2j9k0j1NJ6K1K2J9RjqqnlllmmpqmNJ7K1J7J8K5K4Pj5k4k3k2k4k1
$$ -461 -481 -495 -508 -524 -543 -558 -567 -573 -585 -604 -624 -635 -630 -614 -593 -571 -552 -543 -544 -552 -560 -565 -568 -571 -574 -578 -582 -589 -597 -601 -596 -579 -558 -541 -523 -498 -474 -467 -482 -506 -529 -551 -575 -596
6710e96j1pj1j1onj5j6kJ4J5Jj1j0%NOLJ%KJKNPKppQK4K7K0Rlj3j8j1NK0K9K5J2lj1pnqj3
$$ -596 -607 -614 -625 -636 -642 -647 -662 -678 -680 -666 -651 -650 -661 -671 -671 -666 -660 -657 -656 -656 -654 -653 -651 -646 -639 -637 -644 -651 -643 -619 -592 -572 -563 -566 -579 -597 -608 -603 -583 -554 -529 -517 -520 -531 -538 -543 -551 -564
6692e64oJK%J0K5L2K1Nrk1k5j7LK1K4J9J8J8J0j0k8l3k6j7j4j5j6pRK3L0K6J5mk2l3k3kJ6
$$ -564 -570 -569 -567 -567 -557 -532 -500 -479 -474 -483 -504 -529 -546 -543 -522 -498 -479 -461 -443 -433 -443 -471 -504 -530 -547 -561 -576 -592 -599 -590 -567 -537 -511 -496 -500 -522 -555 -578 -580 -564
6678e64K4K0J1jj9l1k6mJ8K5K1J7J4P%LPNqj4qkj1k4k3oQJ3J8K5K2Nj1j2jPJj2k3k8k5j5j
$$ -564 -540 -520 -509 -510 -529 -560 -586 -590 -572 -547 -526 -509 -495 -488 -488 -485 -478 -473 -481 -495 -503 -505 -516 -540 -563 -569 -561 -548 -530 -505 -483 -478 -489 -501 -502 -495 -494 -506 -529 -557 -582 -597 -598
6662e98J4K6K8K2J0kj6k7l0j8KJ4J1NLORJ4J5Oj6l0k5j0qj9k8k0kRJ1J8L2M3M0K3LqoKJ1J5
$$ -598 -584 -558 -530 -508 -498 -500 -516 -543 -573 -591 -589 -575 -564 -559 -556 -550 -541 -527 -512 -506 -522 -552 -577 -587 -595 -614 -642 -662 -664 -655 -644 -626 -594 -551 -511 -488 -485 -493 -499 -497 -486 -471
6646d71J5Oj0k1k3j6j2j2j1lLJqj1MK8M3M2L1K3J6Nj3k7l0k0j1rj6k3k9l0k5j8j3rpprj4j5
$$ -471 -456 -450 -460 -481 -504 -520 -532 -544 -555 -558 -555 -554 -562 -573 -569 -541 -498 -456 -425 -402 -386 -381 -394 -421 -451 -471 -482 -491 -507 -530 -559 -589 -614 -632 -645 -654 -661 -668 -677 -691 -706
6631g06oJ1L1L7L1J8J4J6J4lk8m2l3rJ5K5J8RPRQlj7k6k4j9j4j0oMJ3J8J4RRRQNMLkj2j9j8
$$ -706 -712 -701 -670 -633 -602 -584 -570 -554 -540 -543 -571 -613 -646 -655 -640 -615 -597 -588 -581 -572 -564 -567 -584 -610 -634 -653 -667 -677 -683 -679 -666 -648 -634 -625 -616 -607 -599 -594 -590 -587 -589 -601 -620 -638
6615f38j6j7j5lJ1J8J9J9K3K1J3M%MJ0J5J7J4QKkqj4k0k3j8nNRJ0J2J6J6Qnj2j5j6j2kONn
$$ -638 -654 -671 -686 -689 -678 -660 -641 -622 -599 -578 -565 -561 -561 -557 -547 -532 -515 -501 -493 -491 -493 -501 -515 -535 -558 -576 -581 -576 -567 -557 -545 -529 -513 -505 -510 -522 -537 -553 -565 -567 -561 -556 -561
6599e61j0kQJ5K1K8L1J7mj5qLjj8l2k8j4jJjk%MJ1J5J0KKJ1J9J3%rpnnprj4j7oJ7L6L2J3l
$$ -561 -571 -573 -565 -550 -529 -501 -470 -453 -457 -472 -480 -477 -478 -496 -528 -556 -570 -571 -570 -571 -573 -573 -569 -558 -543 -533 -531 -529 -518 -499 -486 -486 -495 -502 -507 -512 -519 -528 -542 -559 -565 -548 -512 -480 -467 -470
6583d70lLLqj4qPJ7J7J4J9K5J9Kj4k2k6l5m3m1l1j9oJ3L2L9K6Jk7m7n4m3k2jJ0J3J5J9K2K0
$$ -470 -473 -470 -467 -475 -489 -497 -490 -473 -456 -442 -423 -398 -379 -377 -391 -413 -439 -474 -517 -558 -589 -608 -614 -601 -569 -530 -504 -503 -530 -577 -631 -674 -696 -697 -687 -674 -659 -640 -618 -598
6568e98J4PKkpj1j3nQJ4ROJ1K1K0Mj2j5j5j7k4k5k0j6j8rJ5L9M0K1jj5k0j7j2nmqj3j1pmk
$$ -598 -584 -577 -575 -577 -584 -595 -608 -613 -605 -591 -582 -576 -565 -544 -524 -520 -532 -547 -562 -579 -603 -628 -648 -664 -682 -691 -676 -637 -597 -576 -577 -592 -612 -629 -641 -646 -650 -658 -671 -682 -689 -693 -695
6552f95lnkRK0K4J8J3J2Pmj1oNMpj4j0OK3L4L7L0J5lj3qPJ9J6ol2m7m4k5kJ3J5J5J9K3J1j5
$$ -695 -698 -703 -705 -696 -676 -652 -634 -621 -609 -602 -606 -617 -623 -618 -614 -621 -635 -645 -639 -616 -582 -545 -515 -500 -503 -516 -524 -517 -498 -482 -488 -520 -567 -611 -636 -638 -625 -610 -595 -576 -553 -542 -557
6536e57k9j7kqk4k7j4KJ0J7K4K6K4L0M1L7J4j2k5l2l8l4j6KMl%QQqk1j8lJ7L2L8K8Pj2k2k2
$$ -557 -586 -603 -605 -613 -637 -664 -678 -676 -666 -649 -625 -599 -575 -545 -504 -467 -453 -465 -490 -522 -560 -594 -610 -608 -604 -607 -607 -599 -591 -599 -620 -638 -641 -624 -592 -554 -526 -519 -531 -553 -575
6521e75j3%QKj5k1rJ0K1K2K1J9J2Jprj0j5j7j3ojj%MPPMJlqj1j3j6j9k1j8qMJ8K7K5J1noO
$$ -575 -588 -588 -580 -578 -593 -614 -623 -613 -592 -570 -549 -530 -518 -517 -524 -533 -543 -558 -575 -588 -594 -595 -596 -596 -592 -585 -578 -574 -573 -576 -584 -595 -608 -624 -643 -664 -682 -690 -686 -668 -641 -616 -605 -610 -616 -610
6504f10J3PolJ6L1L2J9PJpk1l3l6l0j8oOJ6K4K8L4L0J0k1m0l2kK5L2K7K0J7PlqlNKj3l0l7
$$ -610 -597 -590 -596 -599 -583 -552 -520 -501 -494 -493 -500 -521 -554 -590 -620 -638 -644 -638 -622 -598 -570 -536 -506 -496 -517 -557 -589 -591 -566 -534 -507 -487 -470 -463 -466 -474 -477 -472 -470 -483 -513 -550
6489e50l1j6lORJ4K2K9K4J0qj5j4rj0j9k5k8k6k0j8j7j8j1LK0L0K7J8J0M%mj0k1k9l1j9jJ2
$$ -550 -581 -597 -600 -594 -585 -571 -549 -520 -496 -486 -494 -509 -523 -532 -542 -561 -586 -614 -640 -660 -678 -695 -713 -724 -721 -701 -671 -644 -626 -616 -612 -612 -616 -626 -647 -676 -707 -726 -727 -715
6474g15J4Nj3k4k1o%pj1mRQqj5lJ8L0L0K7K9L5L3J8nk9l8l2j5LJ3J0koJJ5J6Mj1j5rLJ7L2
$$ -715 -701 -696 -709 -733 -754 -760 -760 -767 -778 -782 -773 -765 -773 -788 -791 -773 -743 -713 -686 -657 -622 -589 -571 -576 -605 -643 -675 -690 -687 -674 -664 -666 -672 -671 -656 -640 -636 -647 -662 -671 -668 -651 -619
6459f19M6N1N0M0K5Qrj8j9k0j9j9j5j3j0poqj5j9j7j0l%%krj3j2lRJ5J3ONOKj2k4k6j0RK2
$$ -619 -573 -522 -472 -432 -407 -399 -408 -426 -445 -465 -484 -503 -518 -531 -541 -548 -554 -562 -577 -596 -613 -623 -626 -626 -626 -628 -637 -650 -662 -665 -656 -641 -628 -622 -617 -611 -609 -621 -645 -671 -681 -672 -650
6443f50K8L5M2L4J1j3j8oO%j3k2k0j8k4k9k2rMJ0J6K5K7K0J0JjKPQJj1k3k0j0%PJ2K2K9K9
$$ -650 -622 -587 -545 -511 -500 -513 -531 -537 -531 -531 -544 -566 -586 -604 -628 -657 -679 -688 -684 -674 -658 -633 -606 -586 -576 -575 -576 -574 -567 -559 -558 -569 -592 -612 -622 -622 -615 -603 -581 -552 -523
6428e23K1J2J0J6K4K7J7pl2m7n1m5l5k1nRJ4J3Nmol%lj4k5l0k6j4QL1M7M5L2J7NjlnpoLJ0
$$ -523 -502 -490 -480 -464 -440 -413 -396 -403 -435 -482 -533 -578 -613 -634 -639 -630 -616 -603 -598 -602 -608 -611 -611 -614 -628 -653 -683 -709 -723 -715 -684 -637 -592 -560 -543 -538 -539 -542 -547 -554 -560 -557 -547
6412e47Ppk3k8k2j0KNlj5k0j6j5k2k5j3J1L3M9N7N2L3J2Kkrj5pJ4K4J4nj9k7l0k8j9j1p%J3
$$ -547 -540 -547 -570 -598 -620 -630 -628 -623 -626 -641 -661 -677 -692 -714 -739 -752 -741 -708 -659 -602 -550 -517 -505 -503 -505 -514 -529 -536 -522 -498 -484 -489 -508 -535 -565 -593 -612 -623 -630 -630 -617
6397f17J6MoMK5L1J5nj3j4j1rjPJ1RQJ3K2L0L0J9Nqj9k7l5l9l6k6j6qo%J2K7L9M5M5M1K7P
$$ -617 -601 -597 -603 -599 -574 -543 -528 -533 -546 -560 -571 -580 -581 -574 -563 -554 -546 -533 -511 -481 -451 -432 -427 -435 -454 -481 -516 -555 -591 -617 -633 -641 -647 -647 -635 -608 -569 -524 -479 -438 -411 -404
6382d04orpopmmj3k6l6m0m3m1k8rKkj3j4lJ0K0J9J3OKkqj3j1nKRJ6K5K7J9Ok%NKrj9j3J0K5
$$ -404 -410 -419 -426 -432 -439 -443 -447 -460 -486 -522 -562 -605 -646 -674 -683 -681 -683 -696 -710 -713 -703 -683 -664 -651 -645 -643 -645 -653 -666 -677 -682 -680 -671 -655 -630 -603 -584 -578 -580 -580 -575 -573 -582 -601 -614 -604 -579
6364e79J8jj1omrj7j0LJ1J1RNKNJ4J7J4J0J6J9J1j3k8k4qQJ1Moj3j4j3j1j1qlKL%pj0oOJ5
$$ -579 -561 -562 -573 -579 -583 -592 -609 -619 -616 -605 -594 -585 -580 -578 -573 -559 -542 -528 -518 -502 -483 -472 -485 -513 -537 -545 -537 -526 -522 -528 -541 -555 -568 -579 -590 -598 -601 -599 -596 -596 -603 -613 -619 -613 -598
6348e98J7J1RJ3J2%j7k6k0j3j2j5j4o%lj1j1jQJ0OPJ8K7K5J6J1J2J4Nrk2k3j1OJ6J7J0Kjl
$$ -598 -581 -570 -561 -548 -536 -536 -553 -579 -599 -612 -624 -639 -653 -659 -659 -662 -673 -684 -685 -677 -667 -661 -654 -636 -609 -584 -568 -557 -545 -531 -526 -535 -557 -580 -591 -585 -569 -552 -542 -540 -541 -544
6332e44klnqoKRJ0ONPJ0RRJ0Plj2j2j0j6k8l2k2qlrj4qQK3K4Pj8k8k2j6k0k0oJ8K8K1J4J5
$$ -544 -546 -549 -554 -562 -568 -566 -557 -547 -541 -536 -529 -519 -510 -501 -491 -484 -487 -499 -511 -521 -537 -565 -597 -619 -627 -630 -639 -653 -661 -653 -630 -606 -599 -617 -645 -667 -683 -703 -723 -729 -711 -683 -662 -648 -633
6316f33J8J0jonmjJ2K6L1K5J3Jj3k2k4j5lPQMkkOJ3Rmk1l3l7l1k0j2p%J2K1K1J5J1J5K2K8
$$ -633 -615 -605 -606 -612 -617 -621 -622 -610 -584 -553 -528 -515 -514 -527 -549 -573 -588 -591 -584 -576 -572 -574 -576 -570 -557 -548 -552 -573 -606 -643 -674 -694 -706 -713 -713 -701 -680 -659 -644 -633 -618 -596 -568
6300e68L3L2K4J3Kpj5j5qMJ3K2K4J0j8l6k5OK3K0QMLlj0j1j2j9k5k4j6kJ2J9J3lj6k1j9j4
$$ -568 -535 -503 -479 -466 -464 -471 -486 -501 -509 -505 -492 -470 -446 -436 -454 -490 -515 -509 -486 -466 -458 -454 -451 -454 -464 -475 -487 -506 -531 -555 -571 -573 -561 -542 -529 -532 -548 -569 -588 -602
6285f02oJnj5j9nQQJKJ1J6J3Nmj5j9j2LJ3J5J6K2K3J7Okqj2j2rqj2j4j3j0j0j1nPJ9J9J2%
$$ -602 -608 -607 -612 -627 -646 -651 -643 -635 -634 -632 -621 -605 -592 -587 -591 -606 -625 -637 -634 -621 -606 -590 -568 -545 -528 -522 -524 -532 -544 -556 -565 -573 -585 -599 -612 -622 -632 -643 -648 -641 -622 -603 -591 -591
6269e91qj1j0%J4K4K0OllJlj2j4rLJ1J7J7Rlj2j5j2oKPNkj0k1l5m3l6rK0L8L9L3K3J7J6J7
$$ -591 -599 -610 -620 -620 -606 -582 -562 -556 -559 -562 -561 -564 -576 -590 -599 -596 -585 -568 -551 -542 -545 -557 -572 -584 -590 -588 -581 -576 -578 -588 -609 -644 -687 -723 -732 -712 -674 -635 -602 -579 -562 -546 -529
6254e29J7J7K2K2Ok0l7l5k1j5j4j2prj7k3j5JJ7K5J9Lj3k4k6j7nPJ3J4J4J6J3Lj2k3k8k7k1
$$ -529 -512 -495 -473 -451 -445 -465 -502 -537 -558 -573 -587 -599 -606 -615 -632 -655 -670 -669 -652 -627 -608 -605 -618 -642 -668 -685 -690 -683 -670 -656 -642 -626 -613 -610 -622 -645 -673 -700 -721
6239g21j0MJ8K6K4J2mj5j4qjNQRPNOJpj3oLLrj6qNJ6K0K6L0L1L1K9K1Nrj0PK5K5Mk0l3l0k3
$$ -721 -731 -727 -709 -683 -659 -647 -651 -666 -680 -688 -689 -684 -676 -667 -660 -655 -649 -648 -655 -668 -674 -671 -668 -677 -693 -701 -696 -680 -660 -634 -604 -573 -542 -513 -492 -487 -496 -506 -499 -474 -449 -445 -465 -498 -528 -551
6222e51j7j3jJ1J2KpnMQOMOQJ1J5J1KkLPkj5j6rqk0k5j3ORlj2rMJ8K4J8jk0k2qRJ4QJjjjp
$$ -551 -568 -581 -582 -571 -559 -557 -564 -569 -565 -557 -551 -547 -541 -533 -522 -507 -496 -494 -496 -493 -486 -488 -503 -519 -528 -536 -556 -581 -594 -588 -579 -582 -594 -603 -599 -581 -557 -539 -540 -560 -582 -590 -581 -567 -559 -558 -559 -560 -561 -568
6204e68j2j1%J0Rok3l1k2JK4K9J5qj7rJLlnjNJ2J8K0K0J6J1QOQRNmqjJ1J7J0JopnjLQJ6K5
$$ -568 -580 -591 -591 -581 -572 -578 -601 -632 -654 -653 -629 -600 -585 -593 -610 -619 -618 -615 -618 -623 -624 -619 -607 -589 -569 -549 -533 -522 -514 -508 -500 -491 -486 -490 -498 -499 -488 -471 -461 -460 -466 -473 -478 -479 -476 -468 -452 -427
6186d27K8J9jk6m0l8k3qJ%qk2l1k8rRJ3OKRJ2Kj5k0oJ6K8K2Nj0j8k0k4k8k5j4llj2j8j1NJ5
$$ -427 -399 -380 -381 -407 -447 -485 -508 -516 -515 -515 -523 -545 -576 -604 -613 -604 -591 -585 -583 -574 -562 -560 -575 -595 -601 -585 -557 -535 -530 -540 -558 -578 -602 -630 -655 -669 -672 -675 -687 -705 -716 -711 -696
6171f96J4PMKMNJ1J8K5K9L3L4K7Nk3m5m6l1qJ3K2K3J5Pjj0j9j7oNJ1J2J3J2Mnj3j1lNMj1l1
$$ -696 -682 -675 -671 -669 -665 -660 -649 -631 -606 -577 -544 -510 -483 -478 -501 -546 -592 -623 -631 -618 -596 -573 -558 -551 -552 -562 -581 -598 -604 -599 -588 -576 -563 -551 -547 -552 -565 -576 -579 -574 -570 -581 -612
6155f12l5k8k3k4k1mJ1OpnJ2K4K2J3P%omjlpkJ3J6NkJ0L5M6M1L0J5kj7k1j8k0k5k7j9j1pp
$$ -612 -647 -675 -698 -722 -743 -747 -736 -730 -737 -742 -730 -706 -684 -671 -664 -664 -670 -674 -675 -678 -685 -687 -674 -658 -653 -655 -645 -610 -564 -523 -493 -478 -480 -497 -518 -536 -556 -581 -608 -627 -638 -645 -652
6139f52mkjLP%j0j2lMLKJ4L0L2J7lj2rrj9k7j9LK2K2J3J1J3Lj7l4k6kJ6J3J%J7L4K8%k7l2
$$ -652 -656 -658 -659 -656 -649 -649 -659 -671 -674 -670 -667 -665 -651 -621 -589 -572 -575 -587 -596 -605 -624 -651 -670 -667 -645 -623 -610 -599 -586 -583 -600 -634 -660 -662 -646 -633 -632 -632 -615 -581 -553 -553 -580 -612
6123f12j9kNJ0RMJLKj4l3l3lL1M3K8RjkJPJ3J7J6J1Qkj9l0k8j6qqrnjLJ0K5L6L4J8Lrj7k6
$$ -612 -631 -633 -628 -618 -609 -605 -604 -601 -599 -613 -646 -679 -682 -651 -608 -580 -571 -572 -574 -573 -566 -553 -536 -520 -509 -501 -503 -522 -552 -580 -596 -604 -612 -621 -626 -627 -624 -614 -589 -553 -519 -501 -498 -507 -524 -550
6106e50k8k1j9k7l1j9OK4L2L7M1L6J5nj3qkQJ9K1Pj4l1l1k0kJ0J2Lrj7j7rMJ5J7PMJ4K5K2
$$ -550 -578 -599 -618 -645 -676 -695 -689 -665 -633 -596 -555 -519 -504 -509 -522 -530 -532 -524 -505 -484 -477 -491 -522 -553 -573 -575 -565 -553 -550 -559 -576 -593 -602 -598 -583 -566 -559 -555 -541 -516 -494
6091d94Ooj5k4l4l1j2J3K8L5L4K7J3%lkkmmpj4k2k3j9j4nRJ7Nj9l5k8r%JJPJ2QJk%KLNMjo
$$ -494 -488 -494 -509 -533 -567 -598 -610 -597 -569 -534 -500 -473 -460 -460 -463 -465 -467 -471 -475 -482 -496 -518 -541 -560 -574 -579 -570 -553 -548 -567 -602 -630 -639 -639 -638 -637 -630 -618 -610 -609 -611 -611 -609 -606 -601 -597 -598 -604
6073f04kMKj2l0l4k4j2jJ2K4K5J5NLLmj4j4mNJ1J2Poj5pJ1K0J7J2J6J2ok6j9QK6K5J7J3J4
$$ -604 -606 -602 -600 -612 -642 -676 -700 -712 -713 -701 -677 -652 -637 -632 -629 -626 -630 -644 -658 -662 -657 -646 -634 -627 -633 -648 -655 -644 -624 -607 -595 -579 -567 -573 -599 -618 -610 -584 -559 -542 -529 -515
6058e15J0N%qk3l0k3nQJ6K0K1J0pj3kJ5K2J9J1MkjJjj5k9l4l1k2j3lMLjqj3k0k5k6k1j4rl
$$ -515 -505 -500 -500 -508 -531 -561 -584 -589 -581 -565 -545 -524 -514 -521 -534 -536 -521 -499 -480 -469 -465 -467 -468 -467 -468 -483 -512 -546 -577 -599 -612 -615 -611 -608 -609 -617 -630 -650 -675 -701 -722 -736 -745 -748
6042g48JOJ3J9K1J9J6J6J6J5J1OPN%j2k1k3j7j2qLK2M0M3K8J5J6K1J6Lj0j0ojKJjorj1j6j9
$$ -748 -747 -741 -728 -709 -688 -669 -653 -637 -621 -606 -595 -589 -582 -577 -577 -589 -610 -633 -650 -662 -670 -667 -645 -605 -562 -534 -519 -503 -482 -466 -463 -473 -483 -489 -490 -488 -487 -488 -494 -503 -514 -530 -549
6026e49j7j0lKNRJ0OJJLM%k%NRQkj3j9j7j0ooJPOmj3j1mmoJK3M4M2J6j3k6k3j7j4pPK4L0K3
$$ -549 -566 -576 -579 -577 -572 -563 -553 -547 -546 -545 -542 -538 -538 -540 -540 -535 -526 -518 -520 -533 -552 -569 -579 -585 -591 -590 -583 -577 -581 -594 -605 -609 -613 -619 -618 -595 -551 -509 -493 -506 -532 -555 -572 -586 -593 -586 -562 -532 -509
6008e09J6J5J6Rnk0k9l0k6j8qjnj7k7k6j4JRQJ%J0K7L4K5Nj2j1JJ2J2OJJJKQJ9K6J5nj9j6
$$ -509 -493 -478 -462 -453 -458 -478 -507 -537 -563 -581 -589 -590 -595 -612 -639 -665 -679 -678 -669 -661 -660 -660 -650 -623 -589 -564 -559 -571 -582 -581 -569 -557 -551 -550 -549 -548 -546 -538 -519 -493 -478 -483 -502 -518
5992e18mkj1k0k1rNQjj7j9nJ7L2L1K6K4K6K3J5Ooj7k7l2l3k5j2MJ6K6L1K9J6%j1j3pkKKkr
$$ -518 -522 -524 -535 -555 -576 -585 -580 -572 -573 -590 -609 -614 -597 -565 -534 -508 -484 -458 -435 -420 -414 -420 -437 -464 -496 -529 -554 -566 -562 -546 -520 -489 -460 -444 -444 -455 -468 -475 -477 -475 -473 -475 -484
5976d84j2j2j2j2plmj5k5k1j2pqnJLmj7k3k2j3kQJ7K3K7K8K3J4J1J2J4Qnj8k3j8kJ7L2L1J7
$$ -484 -496 -508 -520 -532 -539 -542 -546 -561 -586 -607 -619 -626 -634 -639 -638 -635 -639 -656 -679 -701 -714 -716 -708 -691 -668 -641 -613 -590 -576 -565 -553 -539 -531 -536 -554 -577 -595 -597 -580 -548 -517 -500
5961e00Krj6k5l2k7j5mKOJ1J8K1K0J7K0K6L2L2K0Moplnonjkj1j9k6k8k8k2j5qkRK0K2J0mj1
$$ -500 -498 -507 -523 -548 -580 -607 -622 -626 -624 -618 -607 -589 -568 -548 -531 -511 -485 -453 -421 -401 -397 -403 -410 -413 -418 -424 -429 -430 -432 -443 -462 -488 -516 -544 -566 -581 -589 -591 -582 -562 -540 -530 -534 -545
5945e45rokLLLMQPmj6k0j8j7j2%J8K7K3J4Lnj4j9k2k7k9k0MK5K8J5%nljjNJ0Prk7k9j4NJ5
$$ -545 -554 -560 -562 -559 -556 -553 -549 -541 -534 -538 -554 -574 -592 -609 -621 -621 -603 -576 -553 -539 -536 -541 -555 -574 -596 -623 -652 -672 -668 -643 -615 -600 -600 -605 -608 -609 -610 -605 -595 -588 -597 -624 -653 -667 -662 -647
5928f47J2NOJ0J2J1J1J3J0kj4j8j1KROnj8k3j4RL3L9K3jj9j9mJ6L2L2J9kj6k3k6k5j4QK1J7
$$ -647 -635 -630 -624 -614 -602 -591 -580 -567 -557 -559 -573 -591 -602 -600 -591 -585 -590 -608 -631 -645 -636 -603 -564 -541 -542 -561 -580 -584 -568 -536 -504 -485 -487 -503 -526 -552 -577 -591 -583 -562 -545
5913e45LkQK1K1J6J5K4K7J7%rrj3k6m0m2k5kJ9K7J5rl3l9k4JK3L4L5K6J0klOJ3Pj2l0k9k0
$$ -545 -542 -544 -536 -515 -494 -478 -463 -439 -412 -395 -395 -404 -413 -426 -452 -492 -534 -559 -561 -542 -515 -500 -509 -542 -581 -605 -604 -581 -547 -512 -486 -476 -478 -481 -475 -462 -455 -467 -497 -526 -546
5898e46j6k2k4j0J3K7K4J2kpmQJ9K1J9J4Mj1k4k4j1MJ1QJj0j5j2KJ7K4K6K1J2Kqj7k0j1PK0
$$ -546 -562 -584 -608 -618 -605 -578 -554 -542 -544 -551 -555 -547 -528 -507 -488 -474 -470 -481 -505 -529 -540 -536 -525 -517 -516 -526 -541 -553 -551 -534 -510 -484 -463 -451 -449 -457 -474 -494 -505 -498 -478
5883d78J6KJRJ2Ll%Kpj4j1pj3k2k0j5j6k5k0kJ1Qjonlkoj3j3oQJ0Nllk%jnj7k7k5j2mkJJ7
$$ -478 -462 -460 -459 -450 -438 -435 -438 -438 -436 -443 -457 -468 -475 -488 -510 -530 -545 -561 -586 -606 -608 -597 -589 -590 -596 -601 -604 -606 -612 -625 -638 -644 -636 -626 -621 -624 -627 -629 -629 -630 -635 -652 -679 -704 -716 -720 -722 -721 -704
5865g04L7M6M0K7Nj9m1m6l9k4oK0M3N0L7J7Njpj5j1NJ8J6LljJLJ0J7J1j3l2l0j4mppOK2L1
$$ -704 -667 -621 -581 -554 -549 -568 -609 -655 -694 -718 -724 -704 -661 -611 -574 -557 -552 -553 -560 -575 -586 -581 -563 -547 -544 -547 -548 -547 -544 -534 -517 -506 -519 -551 -581 -595 -599 -606 -613 -607 -585 -554
5849e54L0K4J6Kj1j2lOQMlpqnnj0j6j5nNJ0P%ljMQQMmj4j7j7j5j4j0mnj2j9rJ3K8K1Lrj0p
$$ -554 -524 -500 -484 -482 -493 -505 -508 -502 -494 -490 -493 -500 -508 -513 -518 -528 -544 -559 -564 -559 -549 -542 -542 -545 -546 -542 -534 -526 -522 -526 -540 -557 -574 -589 -603 -613 -617 -622 -634 -653 -662 -649 -621 -600 -597 -606 -616 -623
5832f23jLLmj5k5k9k1qPJ6J9J9J8J4J2J4J7J6Ooj0JJ4J9J3kj2j1%Pkj8k6j7pqk3k9j0J9L1
$$ -623 -624 -621 -618 -622 -637 -662 -691 -712 -720 -713 -697 -678 -659 -641 -627 -615 -601 -584 -568 -562 -568 -578 -577 -563 -544 -531 -533 -545 -556 -556 -549 -551 -569 -595 -612 -619 -627 -650 -679 -689 -670 -639
5816f39J6j0k3k0rMJ5K2K6L2M0M0K0qj7rmj9l9l8j9kkj0j3oKJ0J3Pmj3j0ljqj0mORKrj1pj
$$ -639 -623 -633 -656 -676 -685 -681 -666 -644 -618 -586 -546 -506 -486 -494 -511 -520 -524 -543 -582 -620 -639 -641 -643 -653 -666 -672 -670 -660 -647 -640 -644 -657 -667 -670 -671 -679 -689 -693 -687 -678 -676 -685 -696 -703 -704
5800g04RJ9K6K3J8J6J4Mj0j2JJ2MpkJ8L1K5J0Joj2j7j6j0mkqj7k7l2k9k3j8j7k4k6j6JJ1J1
$$ -704 -695 -676 -650 -627 -609 -593 -579 -575 -585 -597 -596 -584 -580 -587 -589 -571 -540 -515 -505 -504 -510 -522 -539 -555 -565 -569 -571 -579 -596 -623 -655 -684 -707 -725 -742 -766 -792 -808 -807 -796 -785
5785g85QJ6L3M5M5M1L4K6J8J1RMoj3j1kLLmqqnjOJ2J2QRJ6K2J4kj4j5j8k9l6k5oPQL%lkjL
$$ -785 -777 -761 -728 -683 -638 -597 -563 -537 -519 -508 -499 -495 -501 -514 -525 -527 -524 -521 -525 -533 -541 -546 -547 -541 -529 -517 -509 -500 -484 -462 -448 -450 -464 -479 -497 -526 -562 -587 -593 -586 -578 -575 -575 -578 -580 -581 -578
5768e78%rj6j9j7j1poj0j3j2njOJ7K7K8K0J7J8K2J9J5J0%j1k0k3k1j7oPK1K6K8K5J5Krj3j3
$$ -578 -578 -587 -603 -622 -639 -650 -657 -663 -673 -686 -698 -703 -704 -698 -681 -654 -626 -606 -589 -571 -549 -530 -515 -505 -505 -516 -536 -559 -580 -597 -603 -596 -575 -549 -521 -496 -481 -479 -488 -501 -514
5752e14oKJ0J0%qpMJ4J6J1Jj0j4j2nNJ2J7J6J5RJrj4j0ponNJ1Opj4j1j0nJN%kJ2L1K9R%J2
$$ -514 -520 -518 -508 -498 -498 -506 -513 -509 -495 -479 -468 -467 -477 -491 -503 -508 -503 -491 -474 -458 -443 -434 -433 -442 -456 -466 -473 -479 -484 -479 -468 -462 -469 -483 -494 -504 -509 -508 -503 -503 -505 -493 -462 -433 -424 -424 -412
5735d12J9PoLJ7K2K1K4K6K2K7N2P8Q9J01J34J73K15K76L83N43P65J059J317J279P41j53r54
$$ -412 -393 -386 -392 -389 -372 -350 -329 -305 -279 -257 -230 -178 -100 -11 90 224 397 612 888 1271 1814 2579 3638 4955 6234 6975 6822 5868
5725E868j295j187r05o68n02l71k80k37k18j84j42j11q7o0l4j6JJ9K2om4o5n2k3QK8L7L0J2
$$ 5868 4573 3386 2481 1813 1311 940 660 423 205 21 -121 -232 -319 -379 -413 -429 -428 -409 -387 -393 -437 -502 -554 -577 -569 -541 -504 -474 -462
5714d62j1k8l8l6k8k4k2k0j3JJ0J2NnqojlrrkMONK%nmNK2L9M6L7J1j4k4j5kNKnpqjJ5L3M3
$$ -462 -473 -501 -539 -575 -603 -627 -649 -669 -682 -681 -671 -659 -654 -659 -667 -673 -674 -677 -686 -695 -697 -693 -687 -682 -680 -680 -685 -689 -684 -662 -623 -577 -540 -529 -543 -567 -582 -584 -579 -577 -582 -589 -597 -598 -583 -550 -507
5697e07L2J0op%KlomKQNmj3j5pJM%KORRRROoj8k7l0k8j8lKloNK3L3L1K1Mj4k1rOPmj2rrj8
$$ -507 -475 -465 -471 -478 -478 -476 -479 -485 -489 -487 -479 -474 -478 -491 -506 -513 -512 -508 -508 -506 -500 -491 -482 -473 -464 -458 -464 -482 -509 -539 -567 -585 -588 -586 -589 -595 -590 -567 -534 -503 -482 -478 -492 -513 -522 -516 -509 -513 -525 -534 -543 -561
5678e61k6k1j2%J8M5N9M7J6mqoj2j8j8j3qkOJ1ll3n6n2j9J6L3L2K6K5K0R%KJ8L2L4K1OjJQ
$$ -561 -587 -608 -620 -620 -602 -557 -498 -451 -435 -439 -447 -453 -465 -483 -501 -514 -522 -524 -518 -507 -510 -543 -599 -651 -670 -654 -621 -589 -563 -538 -518 -509 -509 -507 -489 -457 -423 -402 -396 -397 -396 -388
5663c88J2RJmrj4k5l4l7l2k5j9j5qKJ2J9K2J8Poj1kJ5K5K3J2MKNP%j6k8k8k6k7l1k4pPPNP
$$ -388 -376 -367 -366 -370 -379 -393 -418 -452 -489 -521 -546 -565 -580 -588 -586 -574 -555 -533 -515 -508 -514 -525 -527 -512 -487 -464 -452 -448 -446 -441 -434 -434 -450 -478 -506 -532 -559 -590 -614 -621 -614 -607 -602 -595
5646e95J1J0PONKkKJ6L0L8L8L6K9K1J6J7J8J2pl1n1n5m0j3J0K2K3J2lj3j2jPNpk1k7k3j2%
$$ -595 -584 -574 -567 -561 -556 -554 -556 -554 -538 -508 -470 -432 -396 -367 -346 -330 -313 -295 -283 -290 -321 -372 -427 -467 -480 -470 -448 -425 -413 -416 -429 -441 -442 -435 -430 -437 -458 -485 -508 -520 -520
5631e20NLJk%LJ2K1K9L1K1Kj7k0j0Kkj1qMQqk2k0mPJ2J3J4J1PJ2K2K8K2J5J2Qlj6k6l0l3k9
$$ -520 -515 -512 -511 -513 -513 -510 -498 -477 -448 -417 -396 -394 -411 -431 -441 -439 -441 -452 -460 -456 -448 -456 -478 -498 -502 -495 -483 -470 -456 -445 -438 -426 -404 -376 -354 -339 -327 -319 -322 -338 -364 -394 -427 -456
5615d56k2j9k1k2j4mlprpj1k0k4rJ4K7K2Pmorj7k6k8j4QL4M6M0J6qj6qOJ0KlJRNqj3lJ4K3
$$ -456 -478 -497 -518 -540 -554 -558 -561 -568 -577 -584 -595 -615 -639 -648 -634 -607 -585 -578 -582 -588 -597 -614 -640 -668 -682 -674 -640 -594 -554 -538 -546 -562 -570 -564 -554 -552 -555 -554 -545 -540 -548 -561 -564 -550 -527
5599e27J8J0PLnj0nKNlj0qjKj0k9m9n2l7j0J6L2L2J8LkKMmj5j9j6j9k5k2pRJ1Nmj0j0JJ9L2
$$ -527 -509 -499 -492 -489 -494 -504 -509 -507 -502 -505 -515 -523 -524 -522 -532 -561 -610 -662 -699 -709 -693 -661 -629 -611 -608 -610 -608 -604 -608 -623 -642 -658 -677 -702 -724 -731 -722 -711 -706 -710 -720 -730 -729 -710 -678
5582f78L0J7NJKRJ4J2kj8k3j4%J2J8K4K5J8RKjNJ1J0%plJ1J7Qrj8j2npj9k7j9KJ8K0J4J4J7
$$ -678 -648 -631 -626 -625 -623 -614 -600 -588 -590 -608 -631 -645 -645 -633 -615 -591 -566 -548 -539 -537 -538 -533 -522 -512 -512 -519 -522 -511 -494 -486 -495 -513 -525 -530 -537 -556 -583 -602 -600 -582 -562 -548 -534 -517
5566e17J6Pkj2k2k4j2J1K1J2nj3j0qqnKOKkmlkljOJ7K6K2J0krj3j7j2lMkj1j6j0lJMQQKmn
$$ -517 -501 -494 -496 -508 -530 -554 -566 -555 -534 -522 -527 -540 -550 -558 -566 -571 -569 -563 -561 -563 -567 -570 -572 -575 -576 -570 -553 -527 -505 -495 -497 -506 -519 -536 -548 -551 -547 -549 -560 -576 -586 -589 -588 -584 -576 -568 -566 -570 -575
5548e75jKkpnQK2K6J8Moj5j8j7rnllJjqj3qoj2j6rQJ2Kj1j6j4j1qnpqlJMKJORJ5K3J9%k8m3
$$ -575 -576 -574 -576 -583 -588 -580 -558 -532 -514 -510 -516 -531 -549 -566 -575 -580 -583 -586 -585 -586 -594 -607 -615 -621 -633 -649 -658 -650 -638 -636 -647 -663 -677 -688 -696 -701 -708 -716 -719 -718 -714 -712 -711 -705 -696 -681 -658 -639 -639 -667 -710
5529g10m0k6j2LK4L8M0L3K3J0mqJJ5J9J5J0M%jLRJ1J5J4%j9k8k0nKOJ1J1kj7k0qRK0L2L7L3
$$ -710 -750 -776 -788 -785 -761 -723 -683 -650 -627 -617 -621 -629 -628 -613 -594 -579 -569 -565 -565 -566 -563 -554 -543 -528 -514 -514 -533 -561 -581 -586 -584 -578 -567 -556 -558 -575 -595 -603 -594 -574 -542 -505 -472
5514d72K2Pnj0pJJ2J3Plj4k6l3k6j0jlj1j5j3j2j6k1j8pPQKJJ2J9Rj3k1rKmj4oK0L9L6J9N
$$ -472 -450 -443 -448 -458 -465 -464 -452 -439 -432 -435 -449 -475 -508 -534 -544 -545 -548 -559 -574 -587 -599 -615 -636 -654 -661 -654 -646 -644 -643 -631 -612 -603 -616 -637 -646 -644 -648 -662 -668 -648 -609 -573 -554 -549
5498e49QJ7J9J0j0k6l1k5j3JJ1J4Qok1k9k1oNNnj3j3j1qkQJ5J8J2NjjKORQMklNK0K6J9OKP
$$ -549 -541 -524 -505 -495 -505 -531 -562 -587 -600 -599 -588 -574 -566 -572 -593 -622 -643 -649 -644 -639 -644 -657 -670 -681 -689 -691 -683 -668 -650 -638 -633 -634 -635 -633 -627 -618 -610 -606 -608 -611 -606 -586 -560 -541 -535 -533 -526
5480e26J3J1Nnj8k7k4j4LJ3J3Lqj0ompj0pjLPJ0PkrqjKJ2L2N1N4L4Rj2k3k2j1KJ1J8J6Lj8
$$ -526 -513 -502 -497 -502 -520 -547 -571 -585 -582 -569 -556 -553 -561 -571 -577 -581 -588 -598 -605 -606 -603 -596 -586 -579 -581 -590 -598 -599 -597 -585 -553 -502 -448 -414 -405 -417 -440 -462 -473 -471 -460 -442 -426 -423 -441
5464d41k3lK6N0O9Q5R4R7J21J74K32K99M13N46N49K94j27m51n15m05k98k52k15j60j18j04
$$ -441 -464 -467 -441 -391 -322 -237 -143 -46 75 249 481 780 1193 1739 2288 2582 2455 2004 1489 1084 786 534 319 159 41 -63
5454f3q8n8l7l5l3k2j7k1j7m%rj1nok3l5l2k4k2j7jJ3J7J8K1K4K0J3Mqk0j9rkjNJ0Jk4l8k5
$$ -63 -151 -209 -246 -281 -314 -336 -353 -374 -391 -395 -395 -404 -415 -420 -426 -449 -484 -516 -540 -562 -579 -580 -567 -550 -532 -511 -487 -467 -454 -450 -458 -478 -497 -506 -508 -509 -504 -494 -493 -517 -555 -580
5439e80KJ6J5J1Q%j3j7qRK3K8K1J1NQRPRJ2Mk2m1m0k3j2rqmJNJ2J4J4J3K4L4L3K5J9J6Pj0
$$ -580 -578 -562 -547 -536 -528 -528 -541 -558 -566 -557 -534 -506 -485 -474 -469 -461 -452 -445 -436 -424 -420 -442 -483 -523 -546 -558 -567 -575 -579 -578 -573 -561 -547 -533 -520 -496 -462 -429 -404 -385 -369 -362 -372
5423c72k6k7k1j2kPJ0PNPJ1J3Rkj7k8l4l2k9k1j1j0j8k6k3j4o%J8L6M0K8J3J2J4Mj6l0k9j7
$$ -372 -398 -425 -446 -458 -460 -453 -443 -436 -431 -424 -413 -400 -391 -393 -410 -438 -472 -504 -533 -554 -565 -575 -593 -619 -642 -656 -662 -662 -644 -608 -568 -540 -527 -515 -501 -497 -513 -543 -572 -589
5408e89ppj4j1QL3M5L6J5jqrpmnqj1j0qnkKOKmj2j5j0PK9M4M2K2KolMPP%j2k7m0m0l1k3j7
$$ -589 -596 -603 -617 -628 -620 -587 -542 -506 -491 -492 -500 -509 -516 -520 -525 -533 -544 -554 -562 -567 -569 -567 -561 -559 -563 -575 -590 -600 -593 -564 -520 -478 -456 -454 -460 -463 -459 -452 -445 -445 -457 -484 -524 -564 -595 -618 -635
5391f35lK0M1M4K7Orj7j8j0KNpk0j9j0njOK4L8L7K1kj9l2l7l3k3j0jOJ2K3K9K9K3J5RMknk
$$ -635 -638 -618 -577 -533 -506 -500 -509 -526 -544 -554 -552 -547 -554 -574 -593 -603 -608 -609 -603 -579 -541 -504 -483 -485 -504 -536 -573 -606 -629 -639 -640 -634 -622 -599 -570 -541 -518 -503 -494 -490 -492 -497 -499
5375d99LMJkKQ%k0l7l2j0J5K9L1K0Nj1j5j0kKKLkj5k8l3k8j9j0NK1K7K3J4J2J5J8J0nj9k4
$$ -499 -496 -492 -491 -493 -491 -483 -483 -503 -540 -572 -582 -567 -538 -507 -487 -482 -493 -508 -518 -520 -518 -516 -513 -515 -530 -558 -591 -619 -638 -648 -643 -622 -595 -572 -558 -546 -531 -513 -503 -508 -527 -551
5360e51j9j4j0qnlj1k2k7j8lJ5K6L2K8J9J0Jpj0JJ8K7K2J2PNjl%Jnj1rpj6l1l3j5J2K7K0O
$$ -551 -570 -584 -594 -602 -607 -610 -621 -643 -670 -688 -691 -676 -650 -618 -590 -571 -561 -560 -567 -577 -576 -558 -531 -509 -497 -490 -485 -486 -489 -489 -488 -493 -504 -513 -520 -536 -567 -600 -615 -603 -576 -556 -550
5344e50pj0qnm%J0K0J8Lj3k3k2j4kQPrl1m4l7k3j3oJ0L8N6N3L5J6Nqk0j9pOPMPJ4J3Kj2j4
$$ -550 -557 -567 -575 -580 -584 -584 -574 -554 -536 -533 -546 -569 -591 -605 -607 -599 -592 -601 -632 -676 -713 -736 -749 -755 -745 -707 -651 -598 -563 -547 -542 -550 -570 -589 -596 -590 -583 -579 -572 -558 -545 -543 -555 -569
5328e69qkoj7k2rJ4L0K8J2qk3k7k0lJ2K0K0J5Mrj4lJ5K0J4J0J0J0%j1j1ljjLJ2J5Pmj6k2k1
$$ -569 -577 -579 -585 -602 -624 -633 -619 -589 -561 -549 -557 -580 -607 -627 -630 -618 -598 -578 -563 -559 -568 -582 -585 -570 -550 -536 -526 -516 -506 -506 -517 -528 -531 -532 -533 -530 -518 -503 -496 -500 -516 -538 -559
5312e59j0OJ1JrnPQko%N%olLjqp%%j3k1j1RJ8J1mnOJ7J6Lllkpr%J5J8RLOOnk0k3j4kJ0J8K5
$$ -559 -569 -563 -552 -551 -560 -565 -558 -550 -552 -558 -558 -553 -553 -559 -562 -559 -560 -568 -575 -575 -575 -588 -609 -620 -611 -593 -582 -586 -591 -585 -568 -552 -549 -552 -555 -557 -564 -573 -573 -558 -540 -531 -528 -522 -516 -521 -541 -564 -578 -580 -570 -552 -527
5293e27K5K2J0qk3k2j1pj8l8m3k6KK3K6J2j0k3j6KJ7K2J5OJNJ4J6PmmORjj1j3mOJ5K1K0J1
$$ -527 -502 -480 -470 -478 -501 -523 -534 -541 -559 -597 -640 -666 -664 -641 -615 -603 -613 -636 -652 -650 -633 -611 -596 -590 -589 -584 -570 -554 -547 -551 -555 -549 -540 -541 -552 -565 -569 -563 -548 -527 -507 -496
5277d96ok2k9k9k6j7lJ4J9Qj3k3j9j2rqLJ5J5Noj0j2j4j3qLJ4K0K2J8J7J6J1JnJJ4K2K7K7
$$ -496 -502 -524 -553 -582 -608 -625 -628 -614 -595 -587 -600 -623 -642 -654 -663 -671 -668 -653 -638 -633 -639 -649 -661 -675 -688 -696 -693 -679 -659 -637 -619 -602 -586 -575 -574 -579 -578 -564 -542 -515 -488
5262d88K0Lj1j0NJ1%j7k7k8k4j9j2lQJ7J6Oqj5j7j8j7nJ2J7OmjMJ%RK2J9nl0m0l8k4oJ5K8
$$ -488 -468 -465 -476 -486 -481 -470 -470 -487 -514 -542 -566 -585 -597 -600 -592 -575 -559 -553 -561 -576 -593 -611 -628 -633 -621 -604 -598 -602 -603 -599 -598 -598 -589 -567 -548 -553 -583 -623 -661 -685 -691 -676 -648
5247f48K4J0nj0mPJ6J7Nqj1%J4J7Poj1j1j5j6qOR%rj0nKQJ6K2K2J7J1lk1k7j4OJ3LpmNJ3K3
$$ -648 -624 -614 -619 -629 -633 -626 -610 -593 -588 -596 -607 -607 -593 -576 -569 -575 -586 -597 -612 -628 -636 -630 -621 -621 -630 -640 -645 -643 -635 -619 -597 -575 -558 -547 -550 -571 -598 -612 -606 -593 -590 -597 -601 -596 -583 -560
5230e60L2L5K3Mj2j9k3k2j6lPJ3J4J3Mj1k6k2kK0K7K3J6Lj3l2m1l9l1j5MJ6J0oj7j9k2k9k7
$$ -560 -528 -493 -470 -466 -478 -497 -520 -542 -558 -561 -554 -541 -527 -514 -510 -521 -547 -569 -571 -551 -524 -501 -485 -482 -495 -527 -568 -607 -638 -653 -649 -633 -623 -629 -646 -665 -687 -716 -743
5216g43j3lpj3%K6M5N0N2N5N4M2K2ol5m9l6rMpk7l2k8k1j8j0JJ0J7J9J5PKLOLJNJ6K0J5Mm
$$ -743 -756 -759 -766 -779 -779 -753 -708 -658 -606 -551 -497 -455 -433 -439 -474 -523 -559 -568 -564 -571 -598 -630 -658 -679 -697 -707 -706 -696 -679 -660 -645 -638 -636 -633 -627 -624 -623 -618 -602 -582 -567 -563 -567
5200e67nLJ2K1K1J8J6J4Qnj8k2k3k2j7oPJ3Q%pj2j4oJ4K9K4Mj6k8k8j8jJ5J9J5J5J8J0j2l1
$$ -567 -572 -569 -557 -536 -515 -497 -481 -467 -459 -464 -482 -504 -527 -549 -566 -572 -565 -552 -544 -544 -551 -563 -577 -583 -569 -540 -516 -512 -528 -556 -584 -602 -603 -588 -569 -554 -539 -521 -511 -523 -554
5185e54k7qQJ5J9J8J0ok2l1l6k7nK4L8L0Rrj8k2k4k6k1j3m%LKJlomJRJ5K2K8K3Qqj4j3rmM
$$ -554 -581 -589 -581 -566 -547 -529 -519 -525 -547 -578 -614 -641 -646 -622 -584 -554 -545 -554 -572 -594 -618 -644 -665 -678 -682 -682 -679 -677 -676 -679 -685 -689 -688 -679 -664 -642 -614 -591 -583 -591 -605 -618 -627 -631 -627
5168f27J5J3kk3l1k1jJ3J0nj2mQPlmOJ0MJNQKolNQLJQJ4J1%omKLlroPJ1jk1l0k2j0mqrnPJ4
$$ -627 -612 -599 -601 -624 -655 -676 -677 -664 -654 -659 -671 -675 -667 -660 -663 -667 -661 -651 -647 -646 -641 -633 -631 -637 -640 -635 -627 -624 -623 -615 -601 -590 -590 -596 -600 -598 -595 -598 -607 -613 -606 -595 -596 -617 -647 -669 -679 -683 -691 -700 -705 -698 -684
5149f84J6J5Ppk4l2k8j6mQK6M1M0K4PNJ7L3M0L5J8Lnrj5k0j3JPjj1j0opj4k1k1j3LK1K7K1
$$ -684 -668 -653 -646 -653 -677 -709 -737 -753 -757 -749 -723 -682 -642 -618 -611 -606 -589 -556 -516 -481 -463 -460 -465 -474 -489 -509 -522 -521 -514 -515 -526 -536 -542 -549 -563 -584 -605 -618 -615 -594 -567 -546
5133e46J2ROj0l1l9k8rJ1K5L1K9J5Kj0j8j9j1PK4L2K9J6lk1k9k2pMKj1j9j6lJ1J5J6J4J1J0
$$ -546 -534 -525 -519 -529 -560 -599 -627 -636 -625 -600 -569 -540 -525 -523 -533 -551 -570 -581 -574 -550 -518 -489 -473 -476 -497 -526 -548 -555 -551 -549 -560 -579 -595 -598 -587 -572 -556 -542 -531 -521
5119e21Omk1l1k3oMknMRjj1lK1L3K0mk3k8k1qkj1k5k2jK0K6K2J5J0NJkKRJ7J6MppJMK%lj2
$$ -521 -515 -519 -540 -571 -594 -600 -596 -598 -603 -599 -590 -591 -602 -605 -584 -551 -531 -535 -558 -586 -607 -615 -617 -628 -653 -675 -676 -656 -630 -608 -593 -583 -578 -577 -579 -577 -568 -551 -535 -531 -538 -545 -544 -540 -538 -538 -541 -553
5101e53k5k7j3KJ0J0J3J1Okoj0j4j0KJ5K0J9J3NlKJ6J8Jj2qMlk5m1m1l4k3mJ8K6J2%JQRNJ0
$$ -553 -578 -605 -618 -616 -606 -596 -583 -572 -566 -568 -574 -584 -598 -608 -606 -591 -571 -552 -539 -534 -537 -535 -519 -501 -500 -512 -520 -516 -519 -544 -585 -626 -660 -683 -687 -669 -643 -631 -631 -630 -622 -613 -608 -598
5085e98K2L0K8K1Pj3l4m2l0oRQKJPJ0QRJ7K1Rrk0k0k2k8k9j5%Knrn%NJ1J9K0J4RJ0J6K1J9
$$ -598 -576 -546 -518 -497 -490 -503 -537 -579 -609 -615 -606 -598 -596 -595 -588 -578 -570 -561 -544 -523 -514 -523 -543 -563 -585 -613 -642 -657 -657 -655 -660 -669 -674 -674 -669 -658 -639 -619 -605 -596 -586 -570 -549 -530
5069e30J0pk0k0j0jrk4l2k5j0QJ9K5K5J5mk1k7j7n%jMJ5J9Nj4j8kJ4J6OLRK4L7M5L8J9mj6
$$ -530 -520 -527 -547 -567 -577 -578 -587 -611 -643 -668 -678 -670 -651 -626 -601 -586 -590 -611 -638 -655 -660 -660 -661 -657 -642 -623 -618 -632 -650 -652 -638 -622 -616 -613 -604 -580 -543 -498 -460 -441 -445 -461
5053d61j4q%LOJrj8k0j5j0rj0rorj4j4ojoj8j9lJ3K1K7L7M3L0J2KK%qj2o%lj3k0k6k7j8LK0
$$ -461 -475 -483 -483 -480 -474 -473 -482 -500 -520 -535 -545 -554 -564 -573 -579 -588 -602 -616 -622 -623 -629 -647 -666 -669 -656 -635 -608 -571 -528 -498 -486 -484 -482 -482 -490 -502 -508 -508 -511 -524 -544 -570 -597 -615 -612 -592
5037e92K2J1jj0k1k7k4j0KJ1J4J4J2J5K5L5L1J5mj5j3nMQPNLlj5k0j5kLJKJ2K0J8J1O%j2l1
$$ -592 -570 -559 -560 -570 -591 -618 -642 -652 -650 -639 -625 -611 -599 -584 -559 -524 -493 -478 -482 -497 -510 -515 -511 -503 -496 -491 -488 -491 -506 -526 -541 -543 -540 -539 -537 -525 -505 -487 -476 -470 -470 -482 -513
5021e13m1l4rK2M1L9J8qk4k9k2j1JPjj6k5j9MK5K6J2kmOJ6K0J7J2Kj1k1k0pPJ4Nj3k3j9lJ5
$$ -513 -554 -588 -597 -575 -534 -495 -477 -485 -509 -538 -560 -571 -570 -563 -564 -580 -605 -624 -620 -595 -569 -557 -559 -563 -557 -541 -521 -504 -492 -490 -501 -522 -542 -549 -542 -528 -523 -536 -559 -578 -581 -566
5005e66K6K9K5K0J2Mmrj1j4j6j5nJ2K4K5J5%j4k3k4j8j4j6k0j8mJ1J7J5J1J3K1J9Lk0k7j5
$$ -566 -540 -511 -486 -466 -454 -450 -454 -463 -474 -488 -504 -519 -524 -512 -488 -463 -448 -448 -462 -485 -509 -527 -541 -557 -577 -595 -599 -588 -571 -556 -545 -532 -511 -492 -489 -509 -536 -551
4991e51LPlj4k1j7oJ2L0M0M0L3K3J0J%jpj7k0j5qmjkmqqm%lpqoqqpjLPJ3J6J2kj3pJ0K3J8
$$ -551 -548 -541 -544 -558 -579 -596 -602 -590 -560 -520 -480 -447 -424 -414 -413 -413 -414 -421 -438 -458 -473 -481 -485 -486 -488 -492 -500 -508 -512 -512 -515 -522 -530 -536 -544 -552 -559 -560 -557 -550 -537 -521 -509 -511 -524 -531 -521 -498 -480
4973d80%j1j0kLLJjmpqm%J%%MJ4K7K7J5Jommj0j8k9l5l5k4j0LNMJKNJ1J0jrmJ4L1L7K8Qj8
$$ -480 -480 -491 -501 -503 -500 -497 -496 -497 -501 -508 -516 -520 -520 -519 -519 -519 -515 -501 -474 -447 -432 -431 -437 -441 -445 -455 -473 -502 -537 -572 -596 -606 -603 -598 -594 -593 -591 -586 -575 -565 -566 -575 -579 -565 -534 -497 -469 -461 -479
4955d79l6l9k2%RNkkJ4L5M5L1Lj8j9oJMOJ2J6J5Plj5k9l7k7KL1L5J1j5j9nJ1J6J4Q%j0j9j9
$$ -479 -515 -554 -576 -576 -567 -562 -564 -566 -552 -517 -472 -441 -438 -456 -475 -481 -480 -476 -470 -458 -442 -427 -420 -423 -438 -467 -504 -531 -529 -498 -463 -452 -467 -486 -491 -480 -464 -450 -442 -442 -452 -471 -490
4940d90j4oMQLoj6k1k3k2j3JJ3J8J7J6J4J2J6K7L9M5L6J7pk8l7l5k7j8q%KJj%KQJ3Rlj4j2
$$ -490 -504 -510 -506 -498 -495 -501 -517 -538 -561 -583 -596 -595 -582 -564 -547 -531 -517 -505 -489 -462 -423 -378 -342 -325 -332 -360 -397 -432 -459 -477 -485 -485 -483 -482 -483 -483 -481 -473 -460 -451 -454 -468 -480
4924d80m%JJMOQJ1Nj1k5j9jJ8K8L0K4Mj5k1j7j6j6pQJ3J0J4K6K9J8Lnj2j6qNOj0k2j6lNNL
$$ -480 -484 -484 -483 -482 -478 -472 -464 -453 -448 -459 -484 -503 -504 -486 -458 -428 -404 -400 -415 -436 -453 -469 -485 -492 -484 -471 -461 -447 -421 -392 -374 -371 -376 -388 -404 -412 -407 -401 -411 -433 -449 -452 -447 -442 -439
4907d39lrpNJ1KojJ4J9J2mj8k1j0RJ3jj2nJ0R%prj2j0KJ9K3J7J3J5J5Npj6j9j5pLJ4K2K7K5
$$ -439 -442 -451 -458 -453 -442 -440 -446 -447 -433 -414 -402 -406 -424 -445 -455 -446 -433 -434 -446 -451 -441 -432 -432 -439 -448 -460 -470 -468 -449 -426 -409 -396 -381 -366 -361 -368 -384 -403 -418 -425 -422 -408 -386 -359 -334
4891c34K2J8J0qk6l1k0j2r%J5K1J3L%%pqjLK%JkroNJ1J1K1L8M7L8K2J1%j3j5qmOL0N4M5Pj4
$$ -334 -312 -294 -284 -292 -318 -349 -369 -381 -390 -390 -375 -354 -341 -338 -338 -338 -345 -353 -354 -351 -349 -349 -348 -350 -359 -365 -360 -349 -338 -317 -279 -232 -194 -172 -161 -161 -174 -189 -197 -201 -195 -165 -111 -66 -59 -73
4874g3oMkKJ9J8mj2OJ9J0J1L2M7L6K5K8J9qoK8M1J5NL7O1N3N5Q4Q7N5O3J31J66J40J60K65
$$ -73 -79 -75 -77 -75 -56 -38 -42 -54 -48 -29 -19 -8 24 71 107 132 160 179 171 165 193 234 249 254 291 352 405 460 544 631 686 749 880 1046 1186 1346 1611
4860A611L21K35J07N4M0K4J01K72L65L43M36P27R56J038J351K104K944L848N634Q342R585
$$ 1611 1932 2167 2274 2328 2368 2392 2493 2765 3130 3473 3909 4636 5592 6630 7981 10085 13029 16877 22511 30853 40438
4853D0438O399p22p273r306p376m871l655l001k068j308j158j108p14l63m16m91k45j6j34
$$ 40438 46837 46115 38842 29536 22160 17289 13634 10633 8565 7257 6099 4991 4277 3914 3498 3007 2762 2746 2612
4846B612k71r5R8j9j63j1J66M5r8O7K63J36l8J25L61K81J60M17P51O45L19K90L93K31J17N31
$$ 2612 2341 2246 2344 2325 2162 2151 2317 2362 2264 2331 2594 2730 2692 2817 3178 3459 3619 4036 4787 5432 5751 6041 6434 6665 6782 7313
4836G313J047J038R79J656K578K892L338N214P935J0408J4409K2209K9645K6638Q887j3989
$$ 7313 8360 9398 10377 12033 14611 17503 20841 26055 33990 44398 58807 81016 110661 137299 146186 132197
4830A32197k7066k5687j7935j2573j0293p852n028l703l580k857j611j241j587j332n55m11
$$ 132197 105131 79444 61509 48936 38643 30791 25763 22060 18480 15623 14012 12771 11184 9852 9297 8886
4824H886q12o72p4m9n17m52J07J52k89k25L24L54j27q5N10O06J62K80J031J220O32M15Q09
$$ 8886 8074 7402 7328 7279 6762 6310 6417 6569 6280 6055 6379 6733 6606 6521 7031 7637 7799 8079 9110 10330 10962 11377 12186
4816A2186P70K75O15J767K166J752K377M227N293N569P879J2768J7541K3055L4783N0775N4597
$$ 12186 12956 13231 13846 15613 17779 19531 21908 26135 31428 36997 44876 57644 75185 98240 133023 183798 238395
4810B38395L1187j1030m4371n0828l8467k5984k0351j6449j1163p470o735o011l841k418k770
$$ 238395 269582 258552 214181 163353 124886 98902 78551 62102 50939 43469 36734 30723 26882 24464 21694
4804B1694k830j575p70j319j574o74j22p34j061k97J91l93p18J3M92r3m40L00Q18K39j13P18
$$ 21694 18864 17289 16519 15200 13626 12952 12830 12096 11035 10738 10929 10536 9818 9831 10323 10230 9790 10090 10908 11147 11034 11752
4796A1752J372P87K78R30J435P77N06J786K882K436K411M478O542O876Q345J3637K0075K5785
$$ 11752 13124 13911 14189 15119 16554 17331 17837 19623 22505 24941 27352 31830 38372 45248 53593 67230 87305 113090
4790A13090L6592N5980O9565N3815O217m4238o5809n6309l8026k7476k2511j6446j0520q298
$$ 113090 149682 205662 275227 329042 335259 291021 225212 168903 130877 103401 80890 64444 53924 45626
4785D5626p865n843l397l039l562k632j194j274j987j441l90n76j298q82M0j48q68n53K84
$$ 45626 37761 31918 28521 25482 21920 19288 18094 16820 14833 13392 13002 12426 11128 10246 10286 10138 9270 8717 9001
4778I001J02o09l27M91L20l90o6Q64P67J1K68J177J040K93Q04K139K249J618K592M756N584
$$ 9001 9103 8494 8167 8658 8978 8588 8522 9386 10153 10164 10432 11609 12649 12942 13746 15885 18134 19752 22344 27100 32684
4770C2684N842Q956J4649J9729K6427M0849N8129N8444K8392j7887m9957n2999l9162k7152
$$ 32684 38526 47482 62131 81860 108287 149136 207265 265709 294101 276214 226257 173258 134096 106944
4765A06944k1670j7128j1592q196p428o308m095k929l206k952j726j173j650j660q35n09j004
$$ 106944 85274 68146 56554 48358 40930 34622 30527 27598 24392 21440 19714 18541 16891 15231 14396 13887 12883
4758A2883j086m31j84o52p42j51Q0l67m92K4K17k26l45J81L99j8j05M73P20K80K03Q90J257
$$ 12883 11797 11366 11182 10530 9788 9637 9717 9350 8858 8882 9099 8873 8528 8709 9108 9090 8985 9458 10178 10458 10661 11551 12808
4750A2808Q93J010K096K858K847L730O279Q881J1303J6537K4730K8023J7620l793k2276k7198
$$ 12808 13701 14711 16807 19665 22512 26242 32521 41402 52705 69242 93972 121995 139615 135822 113546 86348
4744H6348k1286j4202j0642q595o043m003l369l034k115j340j315j354r04n12o32p64m84k16
$$ 86348 65062 50860 40218 31623 25580 21577 18208 15174 13059 11719 10404 9050 8146 7634 7002 6238 5754 5538
4738E538l39m62k40l6j84l47j89j0j26k56r9Q0k8j74m8J17K1j13J6J90J12J4K03M33L64K73
$$ 5538 5199 4737 4497 4461 4277 3930 3741 3731 3605 3349 3250 3330 3302 3128 3080 3197 3218 3105 3121 3311 3423 3437 3640 4073 4437 4710
4728D710N46R05R53J051J753K741L542M851P485R842Q464K261n211r162q485n938m175l351
$$ 4710 5256 6161 7114 8165 9918 12659 16201 21052 28537 38379 46843 49104 43893 34731 26246 20308 16133 12782
4721A2782k552j717j299j192r60o23m91n17m34k54k02k63k43j40j15j68j61q9p4j17j07n1
$$ 12782 10230 8513 7214 6022 5062 4439 3948 3431 2997 2743 2541 2278 2035 1895 1780 1612 1451 1362 1288 1171 1064 1013
4713A013m5q5p2j0mn7p4l4j4l4l2KLl8n7l9m1p5q2m7k7m1m5k3j2k4j9J0K9K0J3J7jl4l5JK3
$$ 1013 968 883 811 801 797 740 666 632 618 584 552 554 557 519 462 423 382 307 225 178 151 110 65 42 30 6 -13 -3 26 46 59 76 75 41 6 7 30
4700C0Nj6j3qj8j5J1K7J6LJj3m0n0k7JOMJ3J4jj1mM%jJ0J9L0N7R0R2P0P5J31J91K23K41K77
$$ 30 35 19 6 -2 -20 -35 -24 3 19 22 23 10 -30 -80 -107 -106 -100 -96 -83 -69 -70 -81 -85 -81 -81 -82 -72 -53 -23 34 124 216 286 361 492 683 906 1147 1424
4685A424L02K73J81M7j00k31l01k97k62k31j97j51j11j00r8q3o2n2n2m0k8k9l4k4rmonklm
$$ 1424 1726 1999 2180 2227 2127 1896 1595 1298 1036 805 608 457 346 246 148 65 3 -49 -101 -141 -169 -198 -232 -256 -265 -269 -275 -280 -282 -285 -289
4674b89NJ4J0MRJ1Jj5k0k6l6l6j6QJ5J8L1M4L2Pj0j8k5k9j6KMpj8k2k6k2oOkj7j2KMpj1jN
$$ -289 -284 -270 -260 -256 -247 -236 -235 -250 -270 -296 -332 -368 -384 -376 -361 -343 -312 -268 -236 -229 -239 -257 -282 -311 -327 -325 -321 -328 -346 -368 -394 -416 -422 -416 -418 -435 -447 -445 -441 -448 -459 -460 -455
4658d55OJ0J6Pj1j7JJ9K5K2J7J4J5K2K5J5j0l1m1l8k4jJ7J3%nJ%j1j9j4mkmqomlrj4pJ3K7
$$ -455 -449 -439 -423 -416 -427 -444 -443 -424 -399 -377 -360 -346 -331 -309 -284 -269 -279 -310 -351 -389 -413 -414 -397 -384 -384 -389 -388 -388 -399 -418 -432 -436 -438 -442 -450 -456 -460 -463 -472 -486 -493 -480 -453
4643d53K2RNPQOPJ4J2Mjoj8l3l6k3mJ2J7J3%qlJj1k9l2j2RK1K5K8K2Qqj9k1j5%J0RLKlk0l4
$$ -453 -431 -422 -417 -410 -402 -396 -389 -375 -363 -359 -360 -366 -384 -417 -453 -476 -480 -468 -451 -438 -438 -446 -449 -448 -459 -488 -520 -532 -523 -502 -477 -449 -427 -419 -427 -446 -467 -482 -482 -472 -463 -460 -458 -461 -481 -515
4626e15k2MJ6Omnpj6k6k6k2j0J3L6L7J2mJJ0PmonomRK0J7RQJ3J3J2J5J6QMOJ3J5J5J5J2%p
$$ -515 -537 -533 -517 -511 -515 -520 -527 -543 -569 -595 -617 -627 -614 -578 -541 -529 -533 -532 -522 -515 -519 -525 -530 -536 -540 -531 -511 -494 -485 -477 -464 -451 -439 -424 -408 -400 -396 -390 -377 -362 -347 -332 -320 -320 -327
4609c27KJ0Mj3k9l6l7l1j5%QRJ2J4Rnj4j1jQJ3Rmj6k3k8l0k7j6mLQJ7K9L1K2J3J2J7J9J9J7
$$ -327 -325 -315 -311 -324 -353 -389 -426 -457 -472 -472 -464 -455 -443 -429 -420 -425 -439 -450 -451 -443 -430 -421 -425 -441 -464 -492 -522 -549 -565 -569 -566 -558 -541 -512 -481 -459 -446 -434 -417 -398 -379 -362
4594c62J2NkqpjONlj5k0j7nJ2K0J2lj1ork1k9j9nJjoj1j4j3mRJ8K2J9Nj5k0oJ0RjjQJ4J4J3
$$ -362 -350 -345 -347 -355 -362 -363 -357 -352 -355 -370 -390 -407 -412 -400 -380 -368 -371 -382 -388 -397 -418 -447 -466 -471 -470 -471 -477 -488 -502 -515 -519 -510 -492 -470 -451 -446 -461 -481 -487 -477 -468 -469 -470 -462 -448 -434 -421
4577d21J4J6J5J3Mrk2k4k5k6k6j5kJmojmj4k2j8nQJ7K0J5QMok4l7l3j2OJ1J3K2L3M2M8M7L6
$$ -421 -407 -391 -376 -363 -359 -368 -390 -414 -439 -465 -491 -506 -508 -507 -511 -517 -518 -522 -536 -558 -576 -581 -573 -556 -536 -521 -513 -509 -515 -539 -576 -609 -621 -615 -604 -591 -569 -536 -494 -446 -399 -363
4561c63J0j9l3l2k8k5k4k0j5j7j9j3MK9M1L5K2J2Okj2j4mRJ9J3mk2k9k3j6j2j0njjKJ0J0J
$$ -363 -353 -372 -405 -437 -465 -490 -514 -534 -549 -566 -585 -598 -594 -565 -524 -489 -467 -455 -449 -451 -463 -477 -481 -472 -453 -440 -444 -466 -495 -518 -534 -546 -556 -561 -562 -563 -561 -551 -541 -540
4546e40q%J4J5kj1jJ9K9K2Lj5j9j1KO%j1k1l0k6rJ0J2nk0k3k2k3k1pRJ9K0J7J1RJ6L0L7K8
$$ -540 -548 -548 -534 -519 -521 -532 -533 -514 -485 -463 -460 -475 -494 -505 -503 -497 -497 -508 -529 -559 -585 -594 -584 -572 -577 -597 -620 -642 -665 -686 -693 -684 -665 -645 -628 -617 -608 -592 -562 -525 -497
4531d97Pqj3lJ8M3N0L8J5jj4k6l3k4KK3K7J6mj9l0l3l4l0k4j3qpj0mJ5L5M3L5J4pj6j2pmm
$$ -497 -490 -498 -511 -514 -496 -453 -403 -365 -350 -351 -365 -391 -424 -448 -446 -423 -396 -380 -384 -403 -433 -466 -500 -530 -554 -567 -575 -582 -592 -596 -581 -546 -503 -468 -454 -461 -477 -489 -496 -500 -504
4516e04mjmj2l0l9l0%K4K2OKJ6L2L2K3J3Lrj9k6l3m1l7k2nkpp%PJ2Qmj7j9lJ6K6L0L6L8J9
$$ -504 -508 -509 -513 -525 -555 -594 -624 -624 -600 -578 -572 -570 -554 -522 -490 -467 -454 -451 -460 -479 -505 -538 -579 -616 -638 -643 -645 -652 -659 -659 -652 -640 -632 -636 -653 -672 -675 -659 -633 -603 -567 -529 -510
4501e10j2l2k3MK5K9J4j0l1l8l4k6k0qNJ4J2J2J8K0J2nj5rQK1K6K3J3Jj2j4oJnj8k6k3j5j1
$$ -510 -522 -554 -577 -573 -548 -519 -505 -515 -546 -584 -618 -644 -664 -672 -667 -653 -641 -629 -611 -591 -579 -584 -599 -608 -600 -579 -553 -530 -517 -516 -528 -542 -548 -547 -552 -570 -596 -619 -634 -645
4486f45nkmj1j4j0ojNJ2J1jj1pRK5L7L8L2J9J1PMlnLJ1Nrj6j2j0j2j8k0k1j6oJ0J8J3Ml%N
$$ -645 -650 -652 -656 -667 -681 -691 -697 -698 -693 -681 -670 -671 -682 -689 -680 -655 -618 -580 -548 -529 -518 -511 -507 -510 -515 -512 -501 -496 -505 -521 -533 -543 -555 -573 -593 -614 -630 -636 -626 -608 -595 -591 -594 -594 -589
4469e89J3J7J0lj6j8rjKmrnJ3L2L6K6J1kj2j7k0k0j8oJ7L7M2L0J5RJ5K5L6M1K8Lj9k8k6k1
$$ -589 -576 -559 -549 -552 -568 -586 -595 -596 -594 -598 -607 -612 -599 -567 -531 -505 -494 -496 -508 -525 -545 -565 -583 -589 -572 -535 -493 -463 -448 -439 -424 -399 -363 -322 -294 -291 -310 -338 -364 -385
4455c85k4l3m4m9l6j0J7L0K8J7%qpjlj0j4qLJ1J8K6L1K7J8Lj9m5n9n6l8j5KJ2J5J6K1K7K3
$$ -385 -409 -442 -486 -535 -571 -581 -564 -534 -506 -489 -489 -497 -504 -505 -508 -518 -532 -540 -537 -526 -508 -482 -451 -424 -406 -403 -422 -467 -526 -582 -620 -635 -633 -621 -606 -590 -569 -542 -519
4440e19RjLJ5K6K9K3Oj9l7m2l6l2k8k1j4j1nPJ7J8J2PQJ3K1L1L4K1kj8k1j9j8j9j7j6j9j8
$$ -519 -510 -511 -508 -493 -467 -438 -415 -409 -428 -465 -507 -543 -575 -603 -624 -638 -649 -654 -647 -630 -612 -600 -593 -585 -572 -551 -520 -486 -465 -467 -485 -506 -525 -543 -562 -579 -595 -614 -632
4426f32j3pkMRJ1RRJ2J1OjKJ4L1M1L9K8J3lj2j4nJ1K2K2Qrk3k5k0j0mlJJ2K1J9Oqj5j9j9j9
$$ -632 -645 -652 -654 -650 -641 -630 -621 -612 -600 -589 -583 -584 -582 -568 -537 -496 -457 -429 -416 -419 -431 -445 -450 -439 -417 -395 -387 -396 -419 -444 -464 -474 -478 -481 -480 -468 -447 -428 -422 -430 -445 -464 -483 -502
4410e02j8k1k2j6JJ9K8K8J8Mqj2j2j2j4j2plnj1j3j4j5rOK4L3K5J1kj1j1ojknjRJ2Kj4j8q
$$ -502 -520 -541 -563 -579 -578 -559 -531 -503 -485 -481 -489 -501 -513 -525 -539 -551 -558 -561 -566 -577 -590 -604 -619 -628 -622 -598 -565 -540 -529 -531 -542 -553 -559 -560 -562 -567 -568 -559 -547 -545 -559 -577 -585
4394e85NO%mMJ5J8J3JqrmOJ2RkqoNJ0J0Mklnnlmrj4j6j1nLPQJ0RQjj7k8k6mK2L7L3J1j5l1
$$ -585 -580 -574 -574 -578 -574 -559 -541 -528 -527 -535 -544 -548 -542 -530 -521 -523 -531 -537 -532 -522 -512 -508 -510 -513 -518 -523 -526 -530 -539 -553 -569 -580 -585 -582 -575 -567 -557 -548 -540 -541 -558 -586 -612 -616 -594 -557 -524 -513 -528 -559
4376e59k7rJ0J7J7J7J7J5J4J5J6J1kj1roqqjNKoj1j1j2j8k5k6k1pJ2K7K7K0J3J2Qkrj2j5k2
$$ -559 -586 -595 -585 -568 -551 -534 -517 -502 -488 -473 -457 -446 -448 -459 -468 -474 -482 -490 -491 -486 -484 -490 -501 -512 -524 -542 -567 -593 -614 -621 -609 -582 -555 -535 -522 -510 -502 -504 -513 -525 -540 -562
4360e62k6k0pMJ3J9J1j1l5m1k6JK3L3L0J8MLJ3K2J7Jn%J1J3Mqj5j7j9k3j7NL2M2L3J6J1J0
$$ -562 -588 -608 -615 -611 -598 -579 -568 -579 -614 -655 -681 -680 -657 -624 -594 -576 -572 -569 -556 -534 -517 -516 -521 -521 -510 -497 -493 -501 -516 -533 -552 -575 -592 -587 -555 -513 -480 -464 -453 -443
4346d43Oj%NKj3j9j0LMnoLJ6J9J7Pj1l3m5l8k0kJ0J3Pnj1pmqj8k3j7rlj%ljRK6M2M9M6L6J5
$$ -443 -437 -438 -438 -433 -431 -444 -463 -473 -470 -466 -471 -477 -474 -458 -439 -422 -415 -426 -459 -504 -542 -562 -564 -554 -541 -534 -539 -550 -557 -561 -569 -587 -610 -627 -636 -639 -640 -640 -643 -644 -635 -609 -567 -518 -472 -436 -421
4329d21qk4k5j4jOQQMJjkjKOJ0J4J8J4Onqmrk6m0l3rJ1Rrj8rjmj0nQJ1mj7j5mOJ6K9M1M1L2
$$ -421 -429 -453 -478 -492 -493 -487 -479 -471 -467 -466 -467 -469 -470 -468 -462 -452 -438 -420 -406 -400 -405 -413 -417 -426 -452 -492 -525 -534 -523 -514 -523 -541 -550 -551 -555 -565 -570 -562 -551 -555 -572 -587 -591 -585 -569 -540 -499 -458 -426
4311d26K5J6ll1m5l5j0PR%nkMPJ0J6K7L3K5Nj4k5k7k1j1kLKrk1k6j7JJ3J4J3K2L4K7Kk1k6
$$ -426 -401 -385 -388 -419 -464 -499 -509 -502 -493 -493 -498 -500 -496 -489 -479 -463 -436 -403 -378 -373 -387 -412 -439 -460 -471 -473 -470 -468 -477 -498 -524 -541 -540 -527 -513 -500 -478 -444 -417 -415 -436 -462
4295d62j7rrrj0j0j0mOJ2Q%lOJ7K0J1LLNjqoQJ5Qpk0k7k6j8j3k2m0m0j1K6M4M0K7J2mk2k9
$$ -462 -479 -488 -497 -506 -516 -526 -536 -540 -534 -522 -514 -514 -517 -511 -494 -474 -463 -460 -457 -452 -453 -461 -467 -459 -444 -436 -443 -463 -490 -516 -534 -547 -569 -609 -649 -660 -634 -590 -550 -523 -511 -515 -537 -566
4279e66k5j1RL2M5M0J9pk6k6pK0L8L1Rj0k0k1k1j9j8j5pJ1K7L2K3J0%pqrj4k5l3l3k3j7j6
$$ -566 -591 -602 -593 -561 -516 -476 -457 -464 -490 -516 -523 -503 -465 -434 -425 -435 -455 -476 -497 -516 -534 -549 -556 -545 -518 -486 -463 -453 -453 -460 -468 -477 -491 -516 -549 -582 -605 -622 -638
4265f38j2jJ0J4J1PQJ3J9J9Pqj5nQJ0nk4k6pJ9L1K1QPJ3J0moKRJ0PMmj4j0MJ2Norj3k4l0k1
$$ -638 -650 -651 -641 -627 -616 -609 -601 -588 -569 -550 -543 -551 -566 -571 -563 -553 -558 -582 -608 -615 -596 -565 -544 -536 -529 -516 -506 -510 -516 -514 -505 -495 -488 -484 -488 -502 -512 -508 -496 -491 -497 -506 -519 -543 -573 -594
4248e94okolMNpj6j6pQK5L1J8llJ7K9J6nj0JOkpLJ7K6L1L3L0K2J1Jj0k3l1k8j9j1okLMMPJ0
$$ -594 -600 -602 -608 -611 -607 -602 -609 -625 -641 -648 -640 -615 -584 -566 -569 -572 -555 -526 -510 -515 -525 -524 -518 -520 -527 -524 -507 -481 -450 -417 -387 -365 -354 -353 -363 -386 -417 -445 -464 -475 -481 -483 -480 -476 -472 -465 -455
4231d55Pkpoqj3j9j3%RJ0QN%qrkMjj3j8j0lmonKNOJ0J8K0J2JjMPL%jkqj3j5j2qKJ3J3jj4j2
$$ -455 -448 -450 -457 -463 -471 -484 -503 -516 -516 -507 -497 -489 -484 -484 -492 -501 -503 -499 -500 -513 -531 -541 -544 -548 -554 -559 -557 -552 -546 -536 -518 -498 -486 -485 -486 -482 -475 -472 -472 -473 -475 -483 -496 -511 -523 -531 -529 -516 -503 -504 -518 -530
4212e30MOj2l5m2l2j5MK1L3L6L2K0QMJ2K0J4rl1m1m0l3k1roj3k0j8rjQK4M3N0M1K2Pkj5k9
$$ -530 -526 -520 -532 -567 -609 -641 -656 -652 -631 -598 -562 -530 -510 -502 -498 -486 -466 -452 -461 -492 -533 -573 -606 -627 -636 -642 -655 -675 -693 -702 -703 -695 -671 -628 -578 -537 -515 -508 -510 -525 -554
4197e54l9k9j0Jqj8j1QJ5RJ0K3L2K4Pkoj4j3MK8L6K6Roj7j8pPJ1PPJ3J5Okj1k4m1m4l0pPJ2
$$ -554 -593 -622 -632 -631 -639 -657 -668 -660 -645 -636 -626 -603 -571 -547 -540 -542 -548 -562 -575 -571 -543 -507 -481 -472 -478 -495 -513 -520 -513 -502 -495 -488 -475 -460 -454 -456 -467 -491 -532 -576 -606 -613 -606 -594
4180e94J5J3OkMJ7K5J9P%jKMKJlrj6j8j2ooj1j5j9k1j5KJ8K0J4J6K1J6lk0k5j8j0JJ3J7Rn
$$ -594 -579 -566 -560 -562 -558 -541 -516 -497 -490 -490 -491 -489 -485 -483 -482 -485 -494 -510 -528 -540 -546 -552 -563 -578 -597 -618 -633 -631 -613 -593 -579 -563 -542 -526 -529 -549 -574 -592 -602 -601 -588 -571 -562 -567
4164e67j5j8j5pKMmrjJ3J5Jrrnpj3rjL%%J4L5N3N4M4K8J6Ojrk1l7m5m2k9j7j0kQJ9K6K3Lk8
$$ -567 -582 -600 -615 -622 -620 -616 -620 -629 -630 -617 -602 -601 -610 -619 -624 -631 -644 -653 -654 -651 -651 -651 -637 -602 -549 -495 -451 -423 -407 -401 -402 -411 -432 -469 -514 -556 -585 -602 -612 -614 -606 -587 -561 -538 -535 -563
4147e63m8m1j5NJ6K4L4L2J4pj5j2qnkJJJJmrlJ5K6K3J2PMok0k4j6oOK0K8K0OOJ6J6lk3k3r
$$ -563 -611 -652 -667 -662 -646 -622 -588 -556 -542 -549 -564 -576 -584 -589 -591 -590 -589 -588 -587 -591 -600 -603 -588 -562 -539 -527 -520 -516 -522 -542 -566 -582 -588 -582 -562 -534 -514 -508 -502 -486 -470 -473 -496 -519 -528
4131e28Jlj3k5l2l0k0qjLJ0J5J8K1L1L8L5J6mj5j5nQJ6J5J0NPPMpk1l1l2k9k6k9k5j0NNj1
$$ -528 -527 -530 -543 -568 -600 -630 -650 -658 -659 -656 -646 -631 -613 -592 -561 -523 -488 -472 -476 -491 -506 -511 -503 -487 -472 -462 -457 -450 -443 -439 -446 -467 -498 -530 -559 -585 -614 -639 -649 -644 -639 -650
4115f50k6k6j2NK1L5M1L1J4KKL%nkMNjmjoj6j7kJ3J5RJ4K5K9K3J5Oj2k8k7nJ6J9NmkKKjj0
$$ -650 -676 -702 -714 -709 -688 -653 -612 -581 -567 -565 -563 -560 -560 -565 -567 -563 -558 -559 -563 -564 -570 -586 -603 -605 -592 -577 -568 -554 -529 -500 -477 -462 -456 -468 -496 -523 -528 -512 -493 -488 -492 -494 -492 -490 -491 -501
4099e01j7j9j5j0roKJ4J7QkoJMkj1j1kMmk3l2k1%J3J4QLlpnMJ2J0lj5j3lMMQJ9J9jk7l4j5
$$ -501 -518 -537 -552 -562 -571 -577 -575 -561 -544 -536 -538 -544 -543 -539 -541 -552 -563 -565 -561 -565 -588 -620 -641 -641 -628 -614 -606 -603 -606 -613 -618 -614 -602 -592 -595 -610 -623 -626 -622 -618 -610 -591 -572 -573 -600 -634 -649
4081f49PJ0%qpl%KKLQJ8K5J7LkOJ4J2lk0k9k9j9oMPLoj0nOJ6K5L1L4L0J9QLJPJ4J3lk3k9j5
$$ -649 -642 -632 -632 -640 -647 -650 -650 -648 -646 -643 -635 -617 -592 -575 -572 -574 -568 -554 -542 -545 -565 -594 -623 -642 -648 -644 -637 -634 -640 -650 -655 -649 -633 -608 -577 -543 -513 -494 -486 -483 -482 -475 -461 -448 -451 -474 -503 -518
4064e18JO%nlkloj0k0k5j8JJ7J6Norpmkjmj0k0k4k0rOJ8K5K5K0J3Mnj1oJ0K3J4pk1j8porl
$$ -518 -517 -511 -511 -516 -519 -521 -524 -530 -540 -560 -585 -603 -602 -585 -569 -564 -570 -579 -586 -590 -592 -593 -597 -607 -627 -651 -671 -680 -674 -656 -631 -606 -586 -573 -569 -574 -585 -591 -581 -558 -544 -551 -572 -590 -597 -603 -612 -615
4046f15RJ7J2NLOPO%mkLKqk4l0k2mJ1J1rk8k1QL2L6K9L0L4K6J0LJ1J9J3lk0k6j6MJ4jk7l8
$$ -615 -606 -589 -577 -572 -569 -563 -556 -550 -550 -554 -556 -553 -551 -559 -583 -613 -635 -639 -628 -617 -626 -654 -675 -667 -635 -599 -570 -540 -506 -480 -470 -467 -456 -437 -424 -427 -447 -473 -489 -485 -471 -472 -499 -537
4030e37k5nQJ4K2K3J3jolJ%kpj1rKJ8K8K7K2J5J2J1Kj2k7l0k8l0l8l7j8J1L0L4L3L6L3J9j
$$ -537 -562 -567 -559 -545 -523 -500 -487 -488 -494 -497 -496 -496 -498 -505 -516 -525 -523 -505 -477 -450 -428 -413 -401 -390 -388 -400 -427 -457 -485 -515 -553 -590 -608 -597 -567 -533 -500 -464 -431 -412 -413
4015d13j5j7pOP%j1j3j2j6k7l2k7j2MJ4K1K5K7K0Orj1n%KKNP%rj1oknmOK1K6Rj9l4k5qjml
$$ -413 -428 -445 -452 -446 -439 -439 -450 -463 -475 -491 -518 -550 -577 -589 -585 -571 -550 -525 -498 -478 -472 -481 -492 -497 -497 -495 -493 -488 -481 -481 -490 -501 -507 -509 -514 -518 -512 -491 -465 -456 -475 -509 -534 -542 -543 -547 -550
3998e50ORkj3j6j2okJ0K2K8K7K3K4K0J1Jnj1j7k3k5j9j1lLNOQOJJOJ5K3K5K1J0nj8k4k2j5
$$ -550 -544 -535 -537 -550 -566 -578 -584 -586 -576 -554 -526 -499 -476 -452 -432 -421 -420 -425 -436 -453 -476 -501 -520 -531 -534 -531 -526 -520 -512 -506 -505 -504 -498 -483 -460 -435 -414 -404 -409 -427 -451 -473 -488
3982d88rnmqplnj4k2j8j0rj6j4mOJ1RJ1J7K0J6J1RJ1Rjj0mJ3K6K1J2Njj3k7l1k5k1k0j3MJ6
$$ -488 -497 -502 -506 -514 -521 -524 -529 -543 -565 -583 -593 -602 -618 -632 -636 -630 -619 -610 -599 -582 -562 -546 -535 -526 -515 -506 -507 -517 -521 -508 -482 -461 -449 -444 -445 -458 -485 -516 -541 -562 -582 -595 -591 -575
3966e75J6J8K6L7K9Pj7k7k4j9j7j7k0k1k0j2KJ8K4J4jj0j1j0rnOJ9K8K8K0Mj1j5j1nmj0j9
$$ -575 -559 -541 -515 -478 -449 -442 -459 -486 -510 -529 -546 -563 -583 -604 -624 -636 -634 -616 -592 -578 -579 -589 -600 -610 -619 -624 -618 -599 -571 -543 -523 -519 -530 -545 -556 -561 -565 -575 -594
3952e94k2j3OK2K0kk3k5pJ8L0L1K6K6K3J4lj8k0j2mk%LNLjmrj4j9j9j5j0kLMK%OJ4J8J1pk2
$$ -594 -616 -629 -623 -601 -581 -583 -606 -631 -638 -620 -590 -559 -533 -507 -484 -470 -473 -491 -511 -523 -527 -529 -529 -526 -521 -518 -519 -523 -532 -546 -565 -584 -599 -609 -611 -608 -604 -602 -602 -596 -582 -564 -553 -560 -582
3935e82k3j0%kj2qRK3J6NPK4L3K2lk7l7l6k5j2JJ4J9J3jj0q%MK%JLLMPJ4J6J5NnqlKLJPJ0
$$ -582 -605 -615 -615 -617 -629 -637 -628 -605 -589 -584 -577 -553 -520 -498 -501 -528 -565 -601 -626 -638 -637 -623 -604 -591 -592 -602 -610 -610 -606 -604 -604 -603 -600 -597 -593 -586 -572 -556 -541 -536 -541 -549 -552 -550 -547 -546 -539 -529
3917e29Poj2oJ2K7L0J7lj5j3opj0pKPRK1L1K0j4m9n5l8k4k0k0j3JJ1J3J1J4J7K0J6J3J3RJ
$$ -529 -522 -528 -540 -546 -534 -507 -477 -460 -463 -478 -491 -497 -504 -514 -521 -519 -512 -503 -482 -451 -431 -445 -494 -549 -587 -611 -631 -651 -664 -663 -652 -639 -628 -614 -597 -577 -561 -548 -535 -526 -525
3902e25rmJ1K0J6Loj3k2l0k6j0QK0K7K3Rj2k7k9j8qkmlNJ8K4J3mj2nKMkjOJ3J3Moj1oMJ3J6
$$ -525 -534 -538 -527 -507 -491 -488 -494 -507 -529 -559 -585 -595 -587 -567 -540 -517 -508 -520 -547 -576 -594 -602 -604 -608 -611 -606 -588 -564 -551 -555 -567 -572 -570 -566 -568 -569 -563 -550 -537 -533 -539 -550 -556 -552 -539 -523
3885e23J5J9K7L0K2Rkoj0j2j0kJ3K4K1Oj1k3k8k6j9j2oomJOPPJ0J3PmrlKmj4j6qjLRJ7K1J4
$$ -523 -508 -489 -462 -432 -410 -401 -403 -409 -419 -431 -441 -443 -430 -406 -385 -379 -390 -413 -441 -467 -486 -498 -504 -510 -514 -513 -507 -500 -493 -483 -470 -463 -467 -476 -479 -477 -481 -495 -511 -519 -520 -517 -508 -491 -470 -456
3869d56OKkj3k3k5j6mjpj6k3j9oOOjJJ0J7J1kj1j3j0roJJ3L0M0L6K1J0J0J1Npj3j0mkmmkl
$$ -456 -450 -448 -450 -463 -486 -511 -527 -531 -532 -539 -555 -578 -597 -603 -597 -591 -592 -591 -581 -564 -553 -555 -566 -579 -589 -598 -604 -603 -590 -560 -520 -484 -463 -453 -443 -432 -427 -434 -447 -457 -461 -463 -467 -471 -473 -476
3852d76mmmlpj3j9k4k3k3k0j0MJ4J5J5J9K0J6J0J1J4Rqk7l3k5j3LJ4J8QnqKJ3J5Lj1j6j6j7
$$ -476 -480 -484 -488 -491 -498 -511 -530 -554 -577 -600 -620 -630 -626 -612 -597 -582 -563 -543 -527 -517 -506 -492 -483 -491 -518 -551 -576 -589 -586 -572 -554 -546 -551 -559 -557 -544 -529 -526 -537 -553 -569 -586
3836e86j7rRK1J7%j2q%QJ2Rol0l7j9PK1J3kj0qLJ7K6K5J8J5J8J9J5PJoj8k4k3k2k2k2j2JM
$$ -586 -603 -612 -603 -582 -565 -565 -577 -585 -585 -577 -565 -556 -562 -592 -629 -648 -641 -620 -607 -609 -619 -627 -624 -607 -581 -556 -538 -523 -505 -486 -471 -464 -463 -469 -487 -511 -534 -556 -578 -600 -612 -611 -607
3821f07lj4j7j2pnjOJ5K4K4J5%j6k2j9nRJ5J0PRJ3Rlj8k0j1PK3L1K2Mrj4j2j4j4jK3L8L2Q
$$ -607 -610 -624 -641 -653 -660 -665 -666 -660 -645 -621 -597 -582 -582 -598 -620 -639 -644 -635 -620 -610 -603 -594 -581 -572 -575 -593 -613 -624 -617 -594 -563 -541 -537 -546 -560 -572 -586 -600 -601 -578 -540 -508 -500
3805e00j3k5l4m1m0k2JJ2RKlkkkKOJ0J1J0J4K1K8K4J2KMJ6K3J6LnplOJ5J7Mj1j1MJ9J8Nor
$$ -500 -513 -538 -572 -613 -653 -675 -674 -662 -653 -651 -654 -656 -658 -660 -658 -652 -642 -631 -621 -607 -586 -558 -534 -522 -520 -516 -500 -477 -461 -458 -463 -470 -473 -467 -452 -435 -431 -442 -453 -449 -430 -412 -407 -413 -422
3788d22j0j2j5j8j5r%ORQPJoj4k3k8k9j4J2K9K6Pj0j7j4oMJ0J0J1J6K5K7J6Lqj5j8j5j0qj3
$$ -422 -432 -444 -459 -477 -492 -501 -501 -495 -486 -478 -471 -470 -476 -490 -513 -541 -570 -584 -572 -543 -517 -510 -520 -537 -551 -557 -553 -543 -533 -522 -506 -481 -454 -438 -435 -443 -458 -476 -491 -501 -509 -522
3773e22j0%J2J1Jopqj2j1%J4J8J4PLlj3j7j3noj2j6rj%j0j8j8j2p%J0K1K2J3lj7k1j4jRJ4
$$ -522 -532 -532 -520 -509 -508 -514 -521 -529 -541 -552 -552 -538 -520 -506 -499 -496 -499 -512 -529 -542 -547 -553 -565 -581 -590 -591 -591 -601 -619 -637 -649 -656 -656 -646 -625 -603 -590 -593 -610 -631 -645 -646 -637 -623
3757f23J9K2J8Lj3j8j3pkLQQLJNPJnlQJ2OlnNJ7K5K0Qnj0nMJ0Pj0k6k9j3RJ6Orj6j1ol%OJ1
$$ -623 -604 -582 -564 -561 -574 -592 -605 -612 -614 -611 -603 -595 -592 -591 -586 -579 -578 -583 -586 -578 -566 -560 -563 -568 -563 -546 -521 -501 -493 -498 -508 -513 -509 -499 -492 -502 -528 -557 -570 -561 -545 -539 -548 -564 -575 -581 -584 -584 -578 -567
3738e67Opj6r%OMOJ2J4Q%pqnLJ0RJ%J0J8J5MpnLRJ1OK%LOM%nj1j8j8j1kKRJ5J9J2kojOPPJ3
$$ -567 -561 -568 -584 -593 -593 -587 -583 -577 -565 -551 -543 -543 -550 -558 -563 -560 -550 -541 -540 -540 -530 -512 -497 -493 -500 -505 -502 -493 -482 -476 -474 -474 -471 -465 -461 -461 -466 -477 -495 -513 -524 -526 -524 -515 -500 -481 -469 -471 -477 -478 -472 -465 -458 -445
3719d45K0J7Lj8k8k2qJpj6rJ2K8K9J7Lj5k9l4k5j3rj0j1j0rjJ6L3L2J3lJJ5J7Lj3j8j0npj0
$$ -445 -425 -408 -405 -423 -451 -473 -481 -480 -487 -503 -512 -500 -472 -443 -426 -423 -438 -467 -501 -526 -539 -548 -558 -569 -579 -588 -589 -573 -540 -508 -495 -498 -497 -482 -465 -462 -475 -493 -503 -508 -515 -525
3703e25p%OJ0J3J5J0Jm%NRJ2J5J4Pjmrj6k4k2rNJ0Nlnmj%mqoKJ1J0kj6k1j2jNNPJ1Oj0k5k3
$$ -525 -532 -532 -526 -516 -503 -488 -478 -477 -481 -481 -476 -467 -455 -440 -426 -419 -420 -424 -433 -449 -473 -495 -504 -499 -489 -484 -487 -492 -496 -497 -497 -501 -509 -515 -513 -502 -492 -494 -510 -531 -543 -544 -539 -534 -527 -516 -510 -520 -545 -568
3685e68rPJ7K6K7J7%rkNjj0oRJ4Jj6j6jQNmpjjj0k0k5k2j5oOK0K8K8K1Rmj6j9j5j2j3k1k7
$$ -568 -577 -570 -553 -527 -500 -483 -483 -492 -494 -489 -490 -500 -506 -497 -483 -482 -498 -514 -515 -507 -502 -506 -513 -514 -515 -525 -545 -570 -592 -607 -613 -607 -587 -559 -531 -510 -501 -505 -521 -540 -555 -567 -580 -601 -628
3668f28j7PL5M8L7J2oj2rnjKNQJ4K0J7Jk2l4l2k3j6j0rj4k2k3j5MK4M1M6L6J4qj9k0j2lOQ
$$ -628 -645 -638 -603 -555 -518 -506 -512 -524 -533 -538 -539 -537 -532 -524 -510 -490 -473 -472 -494 -528 -560 -583 -599 -609 -618 -632 -654 -677 -692 -688 -664 -623 -577 -541 -527 -535 -554 -574 -586 -589 -583 -575
3653e75Kj0j8j8j2mjMRJ4J3Lqr%RPKkjjoj3j5j1qj0qjOPNJ3K4K6J3MJ4L0L1J5jlkpj2pMR%
$$ -575 -573 -583 -601 -619 -631 -635 -636 -632 -623 -609 -596 -593 -601 -610 -610 -601 -594 -592 -594 -595 -596 -602 -615 -630 -641 -649 -659 -667 -668 -662 -655 -650 -637 -613 -587 -574 -570 -556 -526 -495 -480 -481 -484 -486 -493 -505 -512 -508 -499 -499
3635d99j1j5j3j6k0k3j8j0lMJ7L1L3J8%%PKj4k7j9lQRROLMNLlkPJ1NjOJ3Pj1j4lLrk5k6j3
$$ -499 -510 -525 -538 -554 -574 -597 -615 -625 -628 -624 -607 -576 -543 -525 -525 -525 -518 -516 -530 -557 -576 -579 -571 -562 -553 -547 -544 -540 -535 -532 -535 -537 -530 -519 -514 -515 -509 -496 -489 -500 -514 -517 -514 -523 -548 -574 -587
3617e87jjoj0rkJ1K2K3QnoJ1L5M5K9kk6l1k7k5k5j8lJ6K7K7J5ok4k9k2pOJ2J3J2RLj2k4k3
$$ -587 -588 -589 -595 -605 -614 -616 -605 -583 -560 -552 -557 -563 -552 -517 -472 -443 -445 -471 -502 -529 -554 -579 -597 -600 -584 -557 -530 -515 -521 -545 -574 -596 -603 -597 -585 -572 -560 -551 -548 -560 -584 -607
3602f07rOJ0J3J4Rnj9k0qNJ0J2J4J5J1KmlLJ1J2Qlj4k3k6k3j7qLJ2J1LrqMJ4J7J5J4J6J6J3
$$ -607 -616 -610 -600 -587 -573 -564 -569 -588 -608 -616 -611 -601 -589 -575 -560 -549 -547 -551 -554 -551 -540 -528 -520 -523 -537 -560 -586 -609 -626 -634 -631 -619 -608 -605 -614 -622 -618 -604 -587 -572 -558 -542 -526 -513
3586e13J1QMLJ0J6J4LqpKJ5J7Pj0j9j3jOjj5k6k4mK1K8J1qrKKj1j5kJ5J8Nj2k3j8lOLlJJ1
$$ -513 -502 -494 -490 -487 -477 -461 -447 -444 -452 -459 -457 -442 -425 -418 -428 -447 -460 -461 -455 -456 -471 -497 -521 -525 -504 -476 -465 -473 -482 -480 -478 -489 -504 -506 -491 -473 -468 -480 -503 -521 -524 -518 -515 -518 -517 -506
3569e06J4Llklj1j1PL0M2L9L3K4Mj6k7k4k0k4k8k6k1j8k0k2j8nJ3K4K4J9J6J0%olORLKRJ9
$$ -506 -492 -489 -492 -494 -497 -508 -519 -512 -482 -440 -401 -368 -344 -340 -356 -383 -407 -427 -451 -479 -505 -526 -544 -564 -586 -604 -609 -596 -572 -548 -529 -513 -503 -503 -509 -512 -506 -497 -494 -492 -483 -464
3554d64K6K5J6%j3j1MJ2J0%rj8k9l6k9j0J4K7K5J1%NJ9K9K2Mj5k6k6j9oOJ1Jk1l9l8k0j0j7
$$ -464 -438 -413 -397 -397 -410 -421 -417 -405 -395 -395 -404 -422 -451 -487 -516 -526 -512 -485 -460 -449 -449 -444 -425 -396 -374 -370 -385 -411 -437 -456 -462 -456 -445 -444 -465 -504 -542 -562 -572 -589
3539e89l4l4j6LJ2J3RO%jMJ0J4J7K1K2J8QlqlJ1K2K1Qqk1k6k4j0OJ5J3RPLjj%mqkJ4J5pl2
$$ -589 -623 -657 -673 -670 -658 -645 -636 -630 -630 -631 -627 -617 -603 -586 -565 -543 -525 -517 -520 -528 -531 -520 -498 -477 -469 -477 -498 -524 -548 -558 -552 -537 -524 -515 -508 -505 -506 -507 -507 -511 -519 -521 -507 -492 -499 -531
3522e31l0qMnj4oJ0J9J9J6J4Nj0k0j3OK1K6J8Mnj1j0mKNOJ2K0J8OqrkKlqplkj0j8k4k1j6j2
$$ -531 -561 -569 -565 -570 -584 -590 -580 -561 -542 -526 -512 -507 -517 -537 -550 -544 -523 -497 -479 -475 -480 -491 -501 -505 -503 -498 -492 -480 -460 -442 -436 -444 -453 -455 -453 -456 -464 -471 -474 -476 -486 -504 -528 -549 -565 -577
3505e77j2j3oOJ4J0Lmooprj0rnKNOJ3K6L9M1K9J4jj2k3k3j6l%lqqmorj0kQJ2Pok3l2k7j0O
$$ -577 -589 -602 -608 -602 -588 -578 -575 -579 -585 -591 -598 -607 -617 -626 -631 -629 -624 -618 -605 -579 -540 -499 -470 -456 -457 -469 -492 -515 -531 -534 -534 -537 -545 -553 -557 -563 -572 -582 -584 -576 -564 -557 -563 -586 -618 -645 -655 -649
3488f49J3J4J6J7J2MNO%j3j4LK0K6K1J9J7Rpj5j7j3qJJ1J7J2Lnrj5j6j2ooj1j2mNRPKmj7l2
$$ -649 -636 -622 -606 -589 -577 -573 -568 -562 -562 -575 -589 -586 -566 -540 -519 -500 -483 -474 -481 -496 -513 -526 -534 -533 -522 -505 -493 -490 -495 -504 -519 -535 -547 -553 -559 -570 -582 -586 -581 -572 -565 -563 -567 -584 -616
3471f16l6k4oLOJ1K2L1K5Prj4rjjlmkJjlJJ2L0M6N0L8Pk5l8k6kJ2RloLJ5J4NkJM%plJ2K3J4
$$ -616 -652 -676 -682 -679 -673 -662 -640 -609 -584 -577 -586 -600 -609 -610 -611 -614 -618 -620 -619 -620 -623 -622 -610 -580 -534 -484 -446 -439 -464 -502 -528 -530 -518 -509 -512 -518 -515 -500 -486 -481 -483 -482 -478 -478 -485 -488 -476 -453 -439
3453d39pk9l9l6k0%J2Qrk4k8j8nLK%%OJ2J8K1K0Rlp%PLoj2j0jJ0J7J6RJ0K3L5K8Kk5l2j5J
$$ -439 -446 -475 -514 -550 -570 -570 -558 -550 -559 -583 -611 -629 -634 -631 -629 -629 -629 -623 -611 -593 -572 -552 -543 -546 -553 -553 -546 -543 -549 -561 -571 -572 -562 -545 -529 -520 -510 -487 -452 -424 -422 -447 -479 -494 -493
3437d93Lj0j9j4JJ1J1QMJpj9l0l2k1jJ4J5J0RJ3J0krokrj5j2l%k%KKjPK1L3L1K3Prk2k0o%
$$ -493 -490 -500 -519 -533 -532 -521 -510 -502 -498 -497 -504 -523 -553 -585 -606 -607 -593 -578 -568 -559 -546 -536 -538 -547 -553 -555 -564 -579 -591 -594 -594 -596 -596 -594 -592 -593 -586 -565 -532 -501 -478 -471 -480 -502 -522 -528 -528
3419e28jJJ7K6J9Jrj0j3j8j9j1%J3K3K2Prj5j4j3j6j5nJloJK0L6M4L9K6Prj7k2k6k1kK1K7
$$ -528 -529 -528 -511 -485 -466 -465 -474 -484 -497 -515 -534 -545 -545 -532 -509 -487 -480 -489 -504 -518 -531 -547 -562 -567 -566 -569 -575 -574 -554 -518 -474 -435 -409 -402 -411 -428 -450 -476 -497 -499 -478 -451
3404d51J2j0j8j4qmpj4k6k9j5J2L2K6Jk5l1k0jJ7K0Oj6l2l1j7JJ3J4J1J2J9L0L2K6J5ROMJ
$$ -451 -439 -449 -467 -481 -489 -493 -500 -514 -540 -569 -584 -572 -540 -514 -513 -538 -569 -589 -590 -573 -553 -547 -563 -595 -626 -643 -642 -629 -615 -604 -592 -573 -543 -511 -485 -470 -461 -455 -451 -450
3389d50JKkj4l2m3m1k4nQJ0PJ0J5J9J7J1OLjnj3j9k2k3j8qKN%qj0kJ2K6L2K7J6J0J0J0Jj1
$$ -450 -449 -447 -449 -463 -495 -538 -579 -603 -608 -600 -590 -583 -573 -558 -539 -522 -511 -505 -502 -503 -508 -521 -540 -562 -585 -603 -611 -609 -604 -604 -612 -622 -624 -612 -586 -554 -527 -511 -501 -491 -481 -480 -491
3373d91j4okj1k2j9nRJ0NKRJ8J9J1pk4l3k6pJ2J1lj5oQPrj9j6j7l1m6l7nK7M5M7L8K0MLJ3
$$ -491 -505 -511 -513 -524 -546 -565 -570 -561 -551 -546 -544 -535 -517 -498 -487 -494 -518 -551 -577 -584 -572 -561 -564 -579 -585 -577 -570 -579 -598 -614 -631 -662 -708 -745 -750 -723 -678 -631 -593 -573 -569 -566 -553
3358e53J4lk1k6j9oRK6L1Rk3l2j5J4K6K5J4Lrj7j2jJ2J7J3jj9k8k5j2kMJ5K4K4Qj3k4j6lL
$$ -553 -539 -542 -563 -589 -608 -614 -605 -579 -548 -539 -562 -594 -609 -595 -569 -544 -530 -527 -536 -553 -565 -566 -554 -537 -524 -525 -544 -572 -597 -609 -611 -607 -592 -568 -544 -536 -549 -573 -589 -592 -589
3343e89joJJ2J7J2J1J4J4MmLJ7J6Jj6j9j8j5j2oj%MQLj7l5l4j5KJ4K4K9K5J1MPJ5K0K2K2J4
$$ -589 -590 -596 -595 -583 -566 -554 -543 -529 -515 -511 -515 -512 -495 -479 -478 -494 -513 -531 -546 -558 -564 -565 -565 -561 -553 -550 -567 -602 -636 -651 -649 -635 -611 -582 -557 -546 -542 -535 -520 -500 -478 -456 -442
3327d42Mnrj1j0LK5L4K2kj8k3j9j3j0j2j4nRJ6Jk0k5j0QJ0Jj1j8j5nPJ4J9K2K1J4Kmpj3k4
$$ -442 -438 -443 -452 -463 -473 -470 -445 -411 -389 -391 -409 -432 -451 -464 -474 -486 -500 -505 -496 -480 -479 -499 -524 -534 -526 -516 -515 -526 -544 -559 -564 -557 -543 -524 -502 -481 -467 -465 -469 -476 -489 -513
3311e13k8k2j6j7k2k3j5jJ1J3Ok%OJ1J3J9L0L4L0K0J3Noj2j1lOJ7K9L4K8J6J2Rlk6m3m6l3
$$ -513 -541 -563 -579 -596 -618 -641 -656 -657 -646 -633 -627 -629 -629 -623 -612 -599 -580 -550 -516 -486 -466 -453 -448 -454 -466 -477 -480 -474 -457 -428 -394 -366 -350 -338 -329 -332 -358 -401 -447 -480
3297d80j0J2K5K2Mk0l9m4l1kL0M5L8J7mj6j7rJJ4K6L3K5Lj9l2l8m5m5k9oPLkLJ5K2K1J4Kj3
$$ -480 -490 -478 -453 -431 -427 -447 -486 -530 -561 -563 -533 -488 -450 -433 -437 -453 -470 -479 -478 -464 -438 -405 -380 -377 -396 -428 -466 -511 -556 -585 -591 -584 -581 -583 -580 -565 -543 -522 -508 -506 -519
3282e19k0j7pj%lqj5j7j2nKOJ4J9K1K1K0J3mj8k6k3j8j2jJ3J9J9J6J3RMkj0k0k9k3mJ4J7J1
$$ -519 -539 -556 -563 -564 -564 -567 -575 -590 -607 -619 -624 -622 -616 -602 -583 -562 -541 -521 -508 -512 -530 -556 -579 -597 -609 -610 -597 -578 -559 -543 -530 -521 -517 -519 -529 -549 -578 -601 -605 -591 -574 -563
3266e63J0K1L7L9J8j1k8k8k9l9m4k5J3M1M4L5L2L5L4K6J7PlrnOJ1Mrj8j6mQRkj3j2pj0k5k9
$$ -563 -553 -532 -495 -456 -438 -449 -477 -505 -534 -573 -617 -642 -629 -588 -544 -509 -477 -442 -408 -382 -365 -358 -361 -370 -375 -369 -358 -354 -363 -381 -397 -401 -393 -384 -386 -399 -411 -418 -428 -453 -482
3251d82j4OJ4RNQJ0PJqk0l1l0k0rqrKK3L6K6Orj5j5j5j1LJ8K3J3jplPRKmkOJ0J1J3J7J2lj7
$$ -482 -496 -490 -476 -467 -462 -454 -444 -437 -436 -444 -464 -495 -525 -545 -554 -562 -571 -569 -546 -510 -484 -478 -487 -502 -517 -532 -543 -540 -522 -499 -486 -487 -494 -497 -490 -481 -479 -483 -485 -479 -469 -458 -445 -428 -416 -419 -436
3234d36k0j4j3j1lPJ1Mnj5k4k9k0%J1OjOK2L0K8K5K6K0Oj0j4j0rj8k7k8j8jJ0J1O%mmlKKL
$$ -436 -456 -470 -483 -494 -497 -490 -479 -475 -480 -495 -519 -548 -568 -568 -557 -551 -552 -546 -524 -494 -466 -441 -415 -395 -389 -399 -413 -423 -432 -450 -477 -505 -523 -524 -514 -503 -497 -497 -501 -505 -508 -506 -504 -501
3218e01MOKpj6k0k3k5k0%J7J8PNJ5K0J1%LJ6J8Omrj4k2k3j5prk2k6j2J4K9K4Nj0j5j3j1oN
$$ -501 -497 -491 -489 -496 -512 -532 -555 -580 -600 -600 -583 -565 -558 -553 -538 -518 -507 -507 -504 -488 -470 -464 -468 -477 -491 -513 -536 -551 -558 -567 -589 -615 -627 -613 -584 -560 -555 -565 -580 -593 -604 -610 -605
3202f05J6K2K7L0K5Pj5k3j2jlj8l0l1k5j6qjOJ2K0K7L1K8K3K1K1J8%k2l5k6kJ2RkpnkKQJ7
$$ -605 -589 -567 -540 -510 -485 -478 -493 -516 -528 -529 -532 -550 -580 -611 -636 -652 -660 -661 -655 -643 -623 -596 -565 -537 -514 -493 -472 -454 -454 -476 -511 -537 -539 -527 -518 -520 -527 -532 -534 -532 -524 -507
3187e07J9J4L%LLmj3j3kPMjMJ3J6Lj7l1l6l0j8onpkOJ4J4J8K9L4K1KnjOPJpj7k4k3j8pJ1L3
$$ -507 -488 -474 -471 -471 -468 -465 -469 -482 -495 -497 -490 -486 -487 -483 -470 -454 -451 -468 -499 -535 -565 -583 -589 -594 -601 -603 -597 -583 -569 -551 -522 -488 -467 -465 -470 -471 -465 -458 -457 -464 -481 -505 -528 -546 -553 -542 -509
3170e09M4L4Pj7k5j3J4M7N9M5J2j1j9k0k5k9k3j4pnmj3l1m4m0j6KMmmQJ6J6J3J8K4J8nl1m0
$$ -509 -465 -431 -424 -441 -466 -479 -465 -418 -359 -314 -302 -313 -332 -352 -377 -406 -429 -443 -450 -455 -459 -472 -503 -547 -587 -603 -601 -597 -601 -605 -597 -581 -565 -552 -534 -510 -492 -497 -528 -568
3155e68l2j8qjjjlJNRJ3K4L5L7K2Kj5k2k5k8k9k7j4OJ9J7PLJ2K0J3%rpmjJOJ2K1K8K2Jk2k9
$$ -568 -600 -618 -626 -627 -628 -629 -632 -631 -626 -617 -604 -580 -545 -508 -486 -484 -499 -521 -546 -574 -603 -630 -644 -638 -619 -602 -595 -592 -580 -560 -547 -547 -556 -563 -567 -568 -567 -561 -549 -528 -500 -478 -477 -499 -528
3138e28j9jRJ0PLknJJ3K2J7RMQJ1Ork5l3l2j9OK8L4J6qk3k5j9j3oNK4L7L0Kk8l1pK1L2K9J8
$$ -528 -547 -548 -539 -529 -522 -519 -521 -526 -525 -512 -490 -473 -464 -460 -452 -441 -435 -444 -469 -502 -534 -553 -547 -519 -485 -469 -477 -500 -525 -544 -557 -563 -558 -534 -497 -467 -465 -493 -524 -531 -510 -478 -449 -431
3122d31Nj2k2j8qmjQK2K7J8OLjj4l5m7m6k7%K4K9J8J3J9K4J7%j2j1mOJ4J6J0Koj4k8m2m3k4
$$ -431 -426 -438 -460 -478 -486 -490 -491 -483 -461 -434 -416 -410 -407 -408 -422 -457 -504 -550 -577 -577 -553 -524 -506 -493 -474 -450 -433 -433 -445 -456 -460 -454 -440 -424 -414 -412 -418 -432 -460 -502 -545 -569
3107e69%J7K3K2K0K2K8L3K8J3lj2j7k4k6k2pKLkqj3j4j1jPNnj6k1k0j2NK0K3J3krpmlprrl
$$ -569 -569 -552 -529 -507 -487 -465 -437 -404 -376 -363 -366 -378 -395 -419 -445 -467 -474 -472 -469 -471 -479 -492 -506 -517 -518 -511 -506 -511 -527 -548 -568 -580 -575 -555 -532 -519 -521 -530 -537 -541 -544 -551 -560 -569 -572
3090e72MKpj1mJ3K4K3J5RLnroMQNLOJ4J4Nj2k5k9k2qPJ3J1RJ3J9K2J2LLJ1J0qk4k7j7qppp
$$ -572 -568 -566 -573 -584 -588 -575 -551 -528 -513 -504 -501 -506 -515 -521 -517 -509 -504 -501 -495 -481 -467 -462 -474 -499 -528 -550 -558 -551 -538 -527 -518 -505 -486 -464 -452 -449 -446 -435 -425 -433 -457 -484 -501 -509 -516 -523 -530
3073e30j2j4jK0K9J7%KJ8K6J2oj4j2olk%%OJ6J8PmlOJ1Lqj0qrj2j4j3rlJjj0j9k2j8oJ4K9
$$ -530 -542 -556 -557 -537 -508 -491 -491 -489 -471 -445 -433 -439 -453 -465 -471 -474 -476 -476 -476 -470 -454 -436 -429 -433 -436 -430 -419 -416 -424 -434 -442 -451 -463 -477 -490 -499 -502 -501 -502 -512 -531 -553 -571 -577 -563 -534
3056e34K7Qj2j8j6j5j9j4%J5K6L1K4Lk2l5k3JK4L6L6K5OomQJ7J6R%rj5j0kL%klmrj4pJ0K0
$$ -534 -507 -499 -511 -529 -545 -560 -579 -593 -593 -578 -552 -521 -497 -494 -516 -551 -574 -573 -549 -513 -477 -452 -446 -452 -456 -448 -431 -415 -406 -406 -415 -430 -440 -442 -439 -439 -441 -444 -448 -457 -471 -478 -468 -448
3040d48J4rk8l2k3j2j0oKJ1J0KkKKpk1k7l2l1k4nJ3J9J4J0K0L0K6Lk2l3k2oLMNQNKPK2K7J1
$$ -448 -434 -443 -471 -503 -526 -538 -548 -554 -552 -541 -531 -529 -531 -529 -527 -534 -555 -582 -614 -645 -669 -674 -661 -642 -628 -618 -598 -568 -542 -539 -561 -594 -616 -622 -619 -615 -610 -602 -597 -595 -588 -566 -539 -528
3024e28j7l2k6j5pOK4L5K7OpkJ1J8J6Plj0qJONLJ1K3K6J4qk0j8j1oljjj1k1k3qJ0J5QjkMN
$$ -528 -545 -577 -603 -618 -625 -619 -595 -560 -533 -527 -534 -536 -525 -507 -491 -484 -487 -497 -505 -504 -498 -493 -490 -479 -456 -430 -416 -424 -444 -462 -473 -479 -482 -483 -484 -495 -516 -539 -547 -537 -522 -514 -515 -517 -513 -508
3007e08kj0j2p%KK%qj4j2%J1J0LLQRK%LMoj5rPK3K9K9K3Rj0k4k7k0j1NK4L9L8K4J2NNJqj6
$$ -508 -510 -520 -532 -539 -539 -537 -535 -535 -543 -557 -569 -569 -558 -548 -545 -542 -534 -525 -523 -523 -520 -516 -522 -537 -546 -539 -516 -487 -458 -435 -426 -436 -460 -487 -507 -518 -513 -489 -450 -412 -388 -376 -371 -366 -365 -373 -389
2990c89j7nJ2J7Poj1olj2k1k3j4poj2j3j1qqnOK3K7J3nj2qpj8l1k9rJ6L4M1M0L3K1Lj8l4l4
$$ -389 -406 -411 -399 -382 -375 -381 -392 -398 -401 -413 -434 -457 -471 -478 -484 -496 -509 -520 -528 -536 -541 -535 -512 -485 -472 -477 -489 -497 -504 -522 -553 -582 -591 -575 -541 -500 -460 -427 -406 -403 -421 -455 -489
2974d89j9lmj9l1l0k2j9j7j0NK3L5L9L2J6lj2pNP%oKK0L4L1J7kj4j7j3porj3k1k9l1k5j6j4
$$ -489 -508 -511 -515 -534 -565 -595 -617 -636 -653 -663 -658 -635 -600 -561 -529 -513 -516 -528 -535 -530 -523 -523 -529 -527 -507 -473 -442 -425 -427 -441 -458 -471 -478 -484 -493 -506 -527 -556 -587 -612 -628 -642
2959f42j8j5jJ7K3J6J1J5K3K3J3%qqKJ5K1J6QPJ3J2OjKPOlrpmj0k4l5l5k5rMRPLMNjppkmj2
$$ -642 -660 -675 -676 -659 -636 -620 -609 -594 -571 -548 -535 -535 -543 -551 -549 -534 -513 -497 -489 -482 -469 -457 -451 -452 -450 -443 -437 -440 -449 -456 -460 -470 -494 -529 -564 -589 -598 -594 -585 -578 -575 -571 -566 -567 -574 -581 -583 -587 -599
2941e99j6rJMPJ2J7J1kj7k6k9k6j8j3j4j8oK3N5P2O6M3J6lo%lj4k3k2j1kQJ7K3K1J5J4J4O
$$ -599 -615 -624 -623 -619 -612 -600 -583 -572 -574 -591 -617 -646 -672 -690 -703 -717 -735 -741 -718 -663 -591 -525 -482 -466 -469 -475 -475 -478 -492 -515 -537 -548 -550 -542 -525 -502 -481 -466 -452 -438 -432
2926d32j3k9k6pJ2J6Onojjnn%NMOJ0Rnk4l1k1j2ooqj1j2oPJ2RKLRJ3Plj2j3mQJ9K1J7RJLJ0
$$ -432 -445 -474 -500 -507 -495 -479 -473 -478 -484 -485 -486 -491 -496 -496 -491 -487 -481 -471 -462 -467 -491 -522 -543 -555 -561 -567 -575 -586 -598 -604 -597 -585 -576 -574 -571 -562 -549 -542 -545 -557 -570 -574 -566 -547 -526 -509 -500 -499 -496 -486
2907d86J8J5KmlMJoj0oJNKj1k9l6k5rj0k6l5k0OJ7J2PJ4K5K8K6J5jk0k8k1j2j4j7pJ1K2K2
$$ -486 -468 -453 -451 -455 -458 -454 -453 -459 -469 -475 -474 -469 -467 -478 -507 -543 -568 -577 -587 -613 -648 -668 -662 -645 -633 -626 -612 -587 -559 -533 -518 -519 -539 -567 -588 -600 -614 -631 -638 -627 -605 -583
2892e83K1K4K6K0J2J1Omj4j3mjkLJ7K5K0RL%npoknj0j1j0pj0j3j5j7j6j0KJ6K0J3%j0j3j3
$$ -583 -562 -538 -512 -492 -480 -469 -463 -467 -481 -494 -498 -499 -501 -498 -481 -456 -436 -427 -424 -424 -429 -436 -442 -444 -449 -459 -470 -480 -487 -497 -510 -525 -542 -558 -568 -566 -550 -530 -517 -517 -527 -540 -553
2876e53j2j1qj0j3rQK0J0j2k3j2QJ8J9J3PkkRK0J6Jj0j1rkRK2K7K1J3QPKnj4k3k9k7j8rjN
$$ -553 -565 -576 -584 -594 -607 -616 -608 -588 -578 -590 -613 -625 -617 -599 -580 -567 -560 -562 -564 -555 -535 -519 -518 -528 -539 -548 -550 -541 -519 -492 -471 -458 -450 -443 -441 -446 -460 -483 -512 -539 -557 -566 -567 -562
2860e62QMmo%QJ4J7J9J3JnjNJppLJ4J9K0J4Nkpj0j6j2PK3K2MrnLKmnjkrj7j6qMJ4J3Lj7l6
$$ -562 -554 -550 -554 -560 -560 -552 -538 -521 -502 -489 -488 -493 -494 -489 -488 -495 -502 -499 -485 -466 -446 -432 -427 -429 -436 -446 -462 -474 -467 -444 -422 -418 -427 -432 -429 -427 -431 -436 -437 -439 -448 -465 -481 -489 -485 -471 -458 -455 -472 -508
2842e08m8m9l2pJ6K2J1jlJ0K8M1M0K4QNRPj2l4m3l4j9okjKRJ5J9J7J5J3J0NK%moj1j5k1k5
$$ -508 -556 -605 -637 -644 -628 -606 -595 -596 -599 -589 -561 -520 -480 -456 -448 -443 -434 -427 -439 -473 -516 -550 -569 -575 -577 -578 -576 -567 -552 -533 -516 -501 -488 -478 -473 -471 -471 -475 -481 -492 -507 -528 -553
2826e53j8kJ4K1K0J6J0JorolLJ2J4%k2l3k6j3mKJ0K0K4K6K8J9kk3k2kJ1Nqj4j0j1j5j7j0k
$$ -553 -571 -573 -559 -538 -518 -502 -492 -491 -497 -506 -512 -515 -512 -500 -486 -486 -508 -541 -567 -580 -584 -582 -572 -552 -528 -502 -474 -455 -457 -480 -502 -504 -493 -488 -496 -510 -520 -531 -546 -563 -573 -575
2810e75KjmppokJKPJ0J0%j3k0j1J0K6K1Kj0mJ2K1K4K4J5rl2l1qJ4J9J5J5J6Pj3k7k7j4KRO
$$ -575 -573 -574 -578 -585 -592 -598 -600 -599 -597 -590 -580 -570 -570 -583 -603 -614 -604 -578 -557 -555 -565 -569 -557 -536 -512 -488 -473 -482 -514 -545 -553 -539 -520 -505 -490 -474 -467 -480 -507 -534 -548 -546 -537 -531
2794e31KPJ5J6PLJ1K2K1J0KKLkj3k2k7k4j5j1j7k4k0lJ3K0J6J0N%pj8k7k5rJ3K8L1L4L9L9
$$ -531 -529 -522 -507 -491 -484 -481 -470 -448 -427 -417 -415 -413 -410 -412 -425 -447 -474 -498 -513 -524 -541 -565 -585 -588 -575 -555 -539 -529 -524 -524 -531 -549 -576 -601 -610 -597 -569 -538 -504 -465 -426
2779d26K5Q%jjnlPJ4J4Mrk2l0l0k0oMNJjKJ2K5L0K1mk8l3j9mLOJ0J2Ooqmkj1j6oJ2K4K1Pj0
$$ -426 -401 -393 -393 -394 -395 -400 -403 -396 -382 -368 -364 -373 -395 -425 -455 -475 -481 -477 -472 -471 -472 -470 -458 -433 -403 -382 -386 -414 -447 -466 -470 -467 -461 -451 -439 -433 -439 -447 -451 -453 -464 -480 -486 -474 -450 -429 -422 -432
2762d32k4k1nJ5K1J6J1Pkj4j8qRJ6J2JmmjklkMJ1J4Pj0l2m5m5l2j7kRJ4QlrkJ1J9J9J0JmK
$$ -432 -456 -477 -482 -467 -446 -430 -419 -412 -414 -428 -446 -454 -445 -429 -417 -416 -420 -424 -425 -427 -430 -432 -428 -417 -403 -396 -406 -438 -483 -528 -560 -577 -579 -570 -556 -548 -551 -560 -562 -551 -532 -513 -503 -502 -506 -504
2745e04J5K4K0Pmj6k6l1k3j0jjKMNLNJ2J3PKNMnk0k6k3j4lOP%mLJ5J5KpkNJj4k6k8j6lOKm
$$ -504 -489 -465 -445 -438 -442 -458 -484 -515 -538 -548 -549 -550 -548 -544 -539 -536 -531 -519 -506 -499 -497 -492 -488 -493 -513 -539 -562 -576 -579 -573 -566 -566 -570 -567 -552 -537 -535 -542 -544 -539 -538 -552 -578 -606 -622 -625 -619 -617 -621
2727f21rnLJ2K2K5J8KplMKooLJ3J2MnqmKRJ2RNKJkqj5j5oQJ8J6Jk0l4l4k5j0j%oq%J2J8K0
$$ -621 -630 -635 -632 -620 -598 -573 -555 -553 -560 -563 -559 -557 -563 -569 -566 -553 -541 -537 -542 -550 -554 -552 -543 -531 -522 -517 -515 -514 -516 -524 -539 -554 -560 -552 -534 -518 -517 -537 -571 -605 -630 -640 -641 -641 -647 -655 -655 -643 -625 -605
2708f05K1K4K2J1jlLQQPQJ0J1J0Pmk3l5l1j5lJJ%oj4k0k2j8j1jJ1K4L5L7K7Orj3rjJ0K6L4
$$ -605 -584 -560 -538 -527 -528 -531 -528 -520 -512 -505 -497 -487 -476 -466 -459 -463 -486 -521 -552 -567 -570 -569 -568 -568 -574 -588 -608 -630 -648 -659 -660 -649 -625 -590 -553 -526 -520 -529 -542 -551 -552 -542 -516 -482
2692d82K4Kj5j8j0lNJ1Prk5k4rJ2K4K9K5J4lj5j8j1mkrj5j6qjmj4k1j6lRJ4J5J9K6L4K9J4
$$ -482 -458 -456 -471 -489 -499 -502 -497 -486 -479 -488 -513 -537 -546 -534 -510 -481 -456 -442 -445 -460 -478 -489 -493 -495 -504 -519 -535 -543 -544 -548 -562 -583 -599 -602 -593 -579 -564 -545 -519 -485 -456 -442
2677d42nj4j2ppj1j7k0j6kJ7L3L7K8J0qj9j5jROrk4k9k2qJ0J9J7Q%JOOLkj%jnj1j5j4j4j8
$$ -442 -447 -461 -473 -480 -487 -498 -515 -535 -551 -553 -536 -503 -466 -438 -428 -436 -455 -470 -471 -462 -456 -465 -489 -518 -540 -548 -538 -519 -502 -494 -494 -493 -487 -481 -478 -480 -481 -481 -482 -487 -498 -513 -527 -541 -559
2660e59k2k4j5JJ6K6L5M1M1L0J4lj6k2k0j2qj0j8j8j4j5j8pK1M1K8nk7k5j6j7k3k0oMN%kl
$$ -559 -581 -605 -620 -619 -603 -577 -542 -501 -460 -430 -416 -419 -435 -457 -477 -489 -497 -507 -525 -543 -557 -572 -590 -597 -576 -535 -507 -512 -539 -564 -580 -597 -620 -640 -646 -642 -637 -637 -639 -642
2646f42KJ8L3L2J1rj2jKrj2JK0K5K0J6K0J9J1J%JLK%nj6k4k1j0%MPOpk1k5j1OJ1Kj4k1j5O
$$ -642 -640 -622 -589 -557 -546 -555 -567 -568 -566 -575 -587 -586 -566 -541 -521 -505 -485 -466 -455 -454 -454 -453 -450 -448 -448 -453 -469 -493 -514 -524 -524 -520 -513 -507 -514 -535 -560 -571 -565 -554 -552 -566 -587 -602 -596
2629e96K7L1J6j1l2l9k4PL8M8L6J6MJklj%pj2oPJ0Knljnj1j3j4j3qNJ5J2jj5k2j7LK6L5K1
$$ -596 -569 -538 -522 -533 -565 -604 -628 -621 -583 -535 -499 -483 -479 -478 -480 -483 -484 -484 -491 -503 -509 -502 -492 -490 -495 -498 -499 -504 -515 -528 -542 -555 -563 -558 -543 -531 -532 -547 -569 -586 -583 -557 -522 -501
2613e01qk7k9k3j8j0kQJ6K3K9L0K6K4K3K1J0kj2k3l7m5m0k5j4j4j7j3%J4J7J1QJ3K4K5J3k
$$ -501 -509 -536 -565 -588 -606 -616 -618 -610 -594 -571 -542 -512 -486 -462 -439 -418 -408 -410 -422 -445 -482 -527 -567 -592 -606 -620 -637 -650 -650 -636 -619 -608 -600 -587 -563 -538 -525 -527
2599e27j1j2j3j0l%nj6k5k1qRK0K4K1K3K6K2Jj8j6OK5K4Qmj2j5j4j0lMLoj9k3j1RJ7PjQK7
$$ -527 -538 -550 -563 -573 -576 -576 -581 -597 -622 -643 -651 -642 -622 -598 -577 -554 -528 -506 -505 -523 -539 -533 -508 -484 -476 -480 -492 -507 -521 -531 -534 -530 -527 -533 -552 -575 -586 -577 -560 -553 -554 -546 -519
2583e19L5K5J0nj4j9j5lOKj2k5k9k4j6j3j2j0JJ5K3K5K8L1L1K2Pqk2l3l1j5LJ1J1J3K0J7k
$$ -519 -484 -459 -449 -454 -468 -487 -502 -505 -499 -497 -509 -534 -563 -587 -603 -616 -628 -638 -637 -622 -599 -574 -546 -515 -484 -462 -455 -463 -485 -518 -549 -564 -561 -550 -539 -526 -506 -489 -491
2569d91k6l4k3nOJ0J0J0J5K1J9J3RJ0J3Qlj1j0onmJQJ0QKrk4l6k9rJ1J8J5J1J1J0O%j3k4k8
$$ -491 -517 -551 -574 -579 -573 -563 -553 -543 -528 -507 -488 -475 -466 -456 -443 -435 -438 -449 -459 -465 -470 -474 -473 -465 -455 -447 -445 -454 -478 -514 -543 -552 -541 -523 -508 -497 -486 -476 -470 -470 -483 -507 -535
2553e35j7jLmr%J8K9K5J4OPRMj3k9k8qJ5K2J1mj2qLJ1Qlj0j0nKPRQKpj6k4k5j5JJ1J2QKor
$$ -535 -552 -553 -550 -554 -563 -563 -545 -516 -491 -477 -471 -464 -455 -451 -464 -493 -521 -529 -514 -492 -481 -485 -497 -505 -502 -491 -483 -486 -496 -506 -511 -509 -502 -493 -485 -483 -490 -506 -530 -555 -570 -569 -558 -546 -538 -536 -542 -551
2536e51jJ9L3K8J4QJ3J7J1Kpj2j3j3j3j7k1k0j4pLJ5J7NrrQK1J6Mnn%NMoj7k1j3rpojJkJJ1
$$ -551 -552 -533 -500 -472 -458 -450 -437 -420 -409 -407 -414 -426 -439 -452 -465 -482 -503 -523 -537 -544 -541 -526 -509 -504 -513 -522 -514 -493 -477 -473 -478 -483 -483 -478 -474 -480 -497 -518 -531 -540 -547 -553 -554 -553 -555 -554 -543
2518e43J6R%PK0K3J5J2J7K0J1jnmknj3k2k7k4j8j2pljmmJLjpomoj1j3j0pjJ3K2J2j2j8NL1
$$ -543 -527 -518 -518 -511 -491 -468 -453 -441 -424 -404 -393 -394 -399 -403 -405 -410 -423 -445 -472 -496 -514 -526 -533 -536 -537 -541 -545 -544 -541 -542 -549 -555 -559 -565 -576 -589 -599 -606 -607 -594 -572 -560 -572 -590 -585 -554
2502e54M2L9M0M2K8Lj6k1k2k6k7j7KJ3J2jrqJNKnj0j2j2rrj4k3k1lJ9K9K5J8J5RLlqqoNJ9
$$ -554 -512 -473 -433 -391 -363 -360 -376 -397 -419 -445 -472 -489 -487 -474 -462 -463 -472 -480 -479 -474 -472 -477 -487 -499 -511 -520 -529 -543 -566 -587 -590 -571 -542 -517 -499 -484 -475 -472 -475 -483 -491 -497 -492 -473
2485d73K1J1krj4k2k9k1%J7J7QjjLJoj1j5j6j4rnkloolJJ0K5M0M8L9K0KojKJ%JKJjjok0l4
$$ -473 -452 -441 -443 -452 -466 -488 -517 -538 -538 -521 -504 -496 -497 -498 -495 -494 -500 -511 -526 -542 -556 -565 -570 -572 -575 -581 -587 -590 -589 -579 -554 -514 -466 -427 -407 -405 -411 -412 -410 -409 -409 -408 -406 -405 -406 -407 -413 -433 -467
2467d67l3j6mnj3r%%nmQK0K2J7Pnj4j3kMjroLJ4J7J8J0ok1k5j6pmpj4j8j1KJ2J0kj1j6j6j1
$$ -467 -500 -516 -520 -525 -538 -547 -547 -547 -552 -556 -548 -528 -506 -489 -482 -487 -501 -514 -516 -512 -513 -522 -528 -525 -511 -494 -476 -466 -472 -493 -518 -534 -541 -545 -552 -566 -584 -595 -593 -581 -571 -573 -584 -600 -616 -627
2451f27JJ1OnmJ4K9J9mj6j1mj1j9j0J1L1L8L5K5RnpLJ3J2NKLRRkj7k8k2jK0K5J7RMJjjKLj
$$ -627 -626 -615 -609 -614 -618 -604 -575 -556 -560 -576 -587 -591 -602 -621 -631 -620 -589 -551 -516 -491 -482 -487 -494 -491 -478 -466 -461 -459 -456 -447 -438 -440 -457 -485 -507 -508 -488 -463 -446 -437 -433 -432 -433 -434 -432 -429 -430
2433d30m%Kkj0j6j7j4r%J5K6K8J4j0k6k7j2MJ1J3J5J5J1NNJ2J6Pj0k2j6%J1Rnj3r%J2K0K4
$$ -430 -434 -434 -432 -434 -444 -460 -477 -491 -500 -500 -485 -459 -431 -417 -427 -453 -480 -492 -488 -477 -464 -449 -434 -423 -418 -413 -401 -385 -378 -388 -410 -426 -426 -415 -406 -411 -424 -433 -433 -421 -401 -377
2418c77K4J5Jj2k1k6k2j5rnmnj2k2k7k1nJ1K6L5L2J0k3m1l7j9pllNJ9K8K4J2MLkj7l6l9k5
$$ -377 -353 -338 -337 -349 -370 -396 -418 -433 -442 -447 -451 -456 -468 -490 -517 -538 -543 -532 -506 -471 -439 -429 -452 -493 -530 -549 -556 -559 -562 -557 -538 -510 -486 -474 -470 -467 -469 -486 -522 -561 -586
2403e86pOJ4J9J9J8J9K2J5kj7j5nkpnKROmqoprj1nQK5L1J9ql3m1l3j5LJ9K6K0Nrj2KK1L5L8
$$ -586 -593 -587 -573 -554 -535 -517 -498 -476 -461 -463 -480 -495 -500 -502 -509 -514 -512 -503 -497 -501 -509 -515 -522 -531 -542 -547 -539 -514 -483 -464 -472 -505 -546 -579 -594 -591 -572 -546 -526 -521 -530 -542 -540 -519 -484 -446
2386d46K8J1mj8l3m5m8l9k0NK7L6K2ql3l4j6KPKjKJ3K9L9L2J0rj6j6j9k2j7pnqqKJ3J8J5P
$$ -446 -418 -407 -411 -429 -462 -507 -555 -594 -614 -609 -582 -546 -524 -532 -565 -599 -615 -613 -606 -604 -605 -603 -590 -561 -522 -490 -480 -489 -505 -521 -540 -562 -579 -586 -591 -599 -607 -605 -592 -574 -559 -552
2371e52koKJ8K7K1NoplJ%mj2j7j9j5qLJ4K0J9J2PMMKkpj5j9j7j1nLJ3K3K4J7J4K1L4L9L0J5
$$ -552 -554 -560 -558 -540 -513 -492 -487 -493 -500 -503 -502 -502 -506 -518 -535 -554 -569 -577 -574 -560 -540 -521 -509 -502 -498 -494 -492 -494 -501 -516 -535 -552 -563 -568 -565 -552 -529 -505 -488 -474 -453 -419 -380 -350 -335
2354c35lj8l3m3m1l2k4k2k1j3jQOJNJ7K9K5J1jlNQOlj1j6j5j4j4j9k0j5mNJ0J2J2Pmj0mNN
$$ -335 -338 -356 -389 -432 -473 -505 -529 -551 -572 -585 -586 -578 -572 -571 -566 -549 -520 -495 -484 -485 -488 -483 -475 -469 -472 -483 -499 -514 -528 -542 -561 -581 -596 -600 -595 -585 -573 -561 -554 -558 -568 -572 -567 -562
2338e62%JJ6K9K8J8J6K2K6J8Lj0j9k0j1OJ8J6O%KMkj3j5nQJ2Ooj3j6j6j2lQJ1ROMJjlmqrj
$$ -562 -562 -561 -545 -516 -488 -470 -454 -432 -406 -388 -385 -395 -414 -434 -445 -439 -421 -405 -399 -399 -397 -393 -395 -408 -423 -428 -420 -408 -402 -408 -421 -437 -453 -465 -468 -460 -449 -440 -434 -430 -429 -430 -433 -437 -445 -454 -455
2321d55J1J4%j2j7j7k2k7j9o%KJ7L8M5K8RNJ1ROJ1J3ql8m9l5k0k0k2j5prj3oPJ3J0PMkokP
$$ -455 -444 -430 -430 -442 -459 -476 -498 -525 -544 -550 -550 -548 -531 -493 -448 -420 -411 -406 -395 -386 -380 -369 -356 -364 -402 -451 -486 -506 -526 -548 -563 -570 -579 -592 -598 -591 -578 -568 -561 -557 -559 -565 -567 -560
2305e60OJkKJ0J2J3J1QNMNmj9k7k1mJ6L2L7K9J6J0J5J5Nj1k3k8k8j8JJ4J4N%lqj7j8j4j4j8
$$ -560 -554 -553 -555 -553 -543 -531 -518 -507 -499 -494 -490 -485 -489 -508 -535 -556 -560 -544 -512 -475 -446 -430 -420 -405 -390 -385 -396 -419 -447 -475 -493 -492 -478 -464 -459 -459 -462 -470 -487 -505 -519 -533 -551
2289e51j7jJ7K9L1K3Oj9l0k0%J3Qmj0oPK1K7K1RJJPJ5K0K3K2J4Nnj0j4j9k4k7k4j8j1lLON
$$ -551 -568 -569 -552 -523 -492 -469 -463 -482 -512 -532 -532 -519 -511 -515 -525 -531 -524 -503 -476 -455 -446 -445 -444 -437 -422 -402 -379 -357 -343 -338 -343 -353 -367 -386 -410 -437 -461 -479 -490 -493 -490 -484 -479
2273d79KLNOQJ0Qnk7m4m6l3nK4L7K7Nj0rlmmOJ4J0JMJ5J9J2JjKKPJ5J8Mk0l6l0j5%PJ1J3J6
$$ -479 -477 -474 -469 -463 -455 -445 -437 -442 -469 -513 -559 -592 -597 -573 -536 -509 -504 -514 -523 -526 -530 -534 -528 -514 -504 -503 -499 -484 -465 -453 -452 -453 -451 -449 -442 -427 -409 -405 -425 -461 -491 -506 -506 -499 -488 -475 -459
2256d59J8J3Moj4j7j2jJ0J2Nnqmnj2k1k4j6%J2J4P%JL%j0j7j4nknom%knnJJ4K7L6L3K0Q%o
$$ -459 -441 -428 -424 -430 -444 -461 -473 -474 -464 -452 -447 -452 -460 -464 -469 -481 -502 -526 -542 -542 -530 -516 -509 -509 -508 -505 -505 -515 -532 -546 -551 -553 -558 -564 -568 -568 -570 -575 -580 -579 -565 -538 -502 -469 -449 -441 -441 -447
2238d47j4j7j4mJOJ2J9J7RNQRmk2l3l1k5k1j7pPJ8J7Oj1k0j7nPJ8K5L0K5K0J6J6J0kj6k3k6
$$ -447 -461 -478 -492 -496 -495 -489 -477 -458 -441 -432 -427 -419 -410 -414 -436 -469 -500 -525 -546 -563 -570 -563 -545 -528 -522 -533 -553 -570 -575 -568 -550 -525 -495 -470 -450 -434 -418 -408 -410 -426 -449 -475
2223d75k5k0j0kNJ1J6J5QJjNNkj1j5j5j1oJONKJPJ4J6Plj0qjPOJnlKN%qj7k0j8j7j5j0OK7
$$ -475 -500 -520 -530 -532 -527 -516 -500 -485 -477 -476 -477 -472 -467 -469 -480 -495 -510 -521 -527 -526 -520 -515 -513 -512 -505 -491 -475 -468 -471 -481 -489 -490 -483 -477 -476 -481 -484 -482 -477 -477 -485 -502 -522 -540 -557 -572 -582 -576 -549
2205e49M0L1RlNJ5J0mqkJKNJ1J0%nJKpj4lJ2Qj1k3j8ojKQJ2J4J7K2K0J1MPPnk2k8k2rj%ko
$$ -549 -509 -478 -469 -472 -467 -452 -442 -446 -454 -456 -455 -453 -448 -437 -427 -427 -432 -431 -429 -436 -450 -453 -441 -433 -444 -467 -485 -491 -492 -490 -482 -470 -456 -439 -417 -397 -386 -382 -375 -368 -373 -395 -423 -445 -454 -455 -455 -457 -463
2187d63KJ9L2K5Nj2j1%J3K2K5J8Mj6l0l4k8j2lpj9k4j6kPJ3J0Knpkkrk0k0pJ1K4K8K4J5J0
$$ -463 -461 -442 -410 -385 -380 -392 -403 -403 -390 -368 -343 -325 -321 -337 -367 -401 -429 -441 -444 -451 -470 -494 -510 -512 -505 -492 -482 -480 -485 -492 -494 -496 -505 -525 -545 -552 -541 -517 -489 -465 -450 -440
2171d40J2J4Rkj5k4k8k5j1NJ7J4mk5l8l3j3PJ7J8K2K8K9J8KpkOMmqjKj4m1n1l4JK5L3L0K2
$$ -440 -428 -414 -405 -407 -422 -446 -474 -499 -510 -505 -488 -474 -478 -503 -541 -574 -587 -580 -563 -545 -523 -495 -466 -448 -446 -453 -455 -449 -445 -449 -457 -458 -456 -470 -511 -562 -596 -595 -570 -537 -507 -485
2156d85Pj1k2k2j8j1mRK3L1K7J5NMRJ2J1PLjrj5j5qoqo%LKKJ0J8J4jj1j0mlj2k3k3pJ2K0J1
$$ -485 -478 -489 -511 -533 -551 -562 -566 -557 -534 -503 -476 -461 -456 -452 -443 -431 -420 -413 -410 -411 -420 -435 -450 -458 -464 -472 -478 -478 -475 -473 -471 -461 -443 -429 -430 -441 -451 -455 -458 -470 -493 -516 -523 -511 -491 -480
2139d80mj1ppj2j9k0j6j3qppqmLJ0J8K1K1J3%qpJNJ0J3J6J5NnrKJ6K0J1kojJjkjok1k8j7M
$$ -480 -484 -495 -502 -509 -521 -540 -560 -576 -589 -597 -604 -611 -619 -623 -620 -610 -592 -571 -550 -537 -537 -545 -552 -551 -546 -536 -523 -507 -492 -487 -492 -501 -499 -483 -463 -452 -454 -460 -461 -460 -461 -463 -464 -470 -491 -519 -536 -532
2122e32J5J7J7J9J5LkMRLppNJ5J3Kj1j6j5j3j5j7j3jRJ2J1RJ1J1Okj0j5r%OMKLNkj7k9l0k0
$$ -532 -517 -500 -483 -464 -449 -446 -448 -444 -435 -432 -439 -446 -441 -426 -413 -411 -422 -438 -453 -466 -481 -498 -511 -512 -503 -491 -480 -471 -460 -449 -443 -445 -455 -470 -479 -479 -473 -469 -467 -464 -459 -461 -478 -507 -537 -557
2105e57jK0L4L2J7kj6j9oJ8L6L1Rj1rOJ5Rqk1k5j8olj1k3k5j7oKMPLj0k4l5l0j5JRN%LJ7L0
$$ -557 -558 -538 -504 -472 -455 -457 -473 -492 -498 -480 -444 -413 -404 -415 -424 -418 -403 -394 -402 -423 -448 -466 -472 -475 -486 -509 -534 -551 -557 -555 -551 -544 -541 -551 -575 -610 -640 -655 -654 -645 -640 -640 -637 -620 -590
2088e90M1M8N0M0J8MKQQKklj0k1k9k7j9j4j1onj0j2oNJ4J9K1K5K1Rkrj0pjJ0J9K1J9J6J5J3
$$ -590 -549 -501 -451 -411 -393 -389 -387 -379 -371 -369 -371 -374 -384 -405 -434 -461 -480 -494 -505 -511 -516 -526 -538 -544 -539 -525 -506 -485 -460 -439 -430 -432 -441 -451 -458 -459 -449 -430 -409 -390 -374 -359 -346
2072c46PJnj6k6l2k6j2jKMQJ2Omrnkoj2rOK1K9K7K1J2kj4k0k1k6l5l6k2KJ4Mj2j9j4rjPJ6
$$ -346 -339 -338 -343 -359 -385 -417 -443 -455 -456 -454 -450 -442 -430 -424 -428 -437 -442 -444 -450 -462 -471 -465 -444 -415 -388 -367 -355 -357 -371 -391 -412 -438 -473 -509 -531 -529 -515 -511 -523 -542 -556 -565 -566 -559 -543
2056e43J8J2NKMNRJ2Lj5k5j7LJ5J9J7J0nk0k2pJ0J4Npj6j6nRJ3PjNK1L4L4K4J2ORJ3Lj8m0
$$ -543 -525 -513 -508 -506 -502 -497 -488 -476 -473 -488 -513 -530 -527 -512 -493 -476 -466 -471 -491 -513 -520 -510 -496 -491 -498 -514 -530 -535 -526 -513 -506 -507 -502 -481 -447 -413 -389 -377 -371 -362 -349 -346 -364 -404
2040d04m4l5j8p%OJ3J8J6Rj%J6L5M0K5jk0k2j5j0j3j8j2kjj6l7m6m0k5%K3L6K9Mj8j5QL2L7
$$ -404 -448 -483 -501 -508 -508 -502 -489 -471 -455 -446 -447 -447 -431 -396 -356 -331 -332 -352 -374 -389 -399 -412 -430 -442 -444 -445 -461 -498 -544 -584 -609 -609 -586 -550 -521 -517 -535 -550 -542 -510 -473
2025d73K0%j1j5k0k5k0%K4M6N6M9K1j2k5j3Jkj7k3j2kJOJ5J7Kk2l4k6j0LNMJ1K1K3J0pqQK2
$$ -473 -453 -453 -464 -479 -499 -524 -544 -544 -520 -474 -418 -369 -348 -360 -385 -398 -397 -399 -416 -439 -451 -453 -452 -446 -431 -414 -412 -434 -468 -494 -504 -501 -496 -492 -481 -460 -437 -427 -434 -442 -434 -412
2009d12J7Lrj2j2j3j5j5j4j2j1j5k0k2j8j1pmnqj0nQK3L4L6L1K1RJMRRLlj3k3k7j9jJ5K1K2
$$ -412 -395 -392 -401 -413 -425 -438 -453 -468 -482 -494 -505 -520 -540 -562 -580 -591 -598 -602 -607 -615 -625 -630 -622 -599 -565 -529 -498 -477 -468 -467 -463 -454 -445 -442 -445 -458 -481 -508 -527 -528 -513 -492 -470
1994d70J5Jj0j2plJRK4K7J2moKNmj5j5oJMMMNPQPNMJ1K0J8%k2k9k1pjjk%jrj7j8nJ3K2J8Q
$$ -470 -455 -454 -464 -476 -483 -486 -485 -476 -452 -425 -413 -417 -423 -421 -416 -420 -435 -450 -456 -455 -451 -447 -443 -438 -431 -423 -416 -411 -407 -396 -376 -358 -358 -380 -409 -430 -437 -438 -439 -441 -441 -442 -451 -468 -486 -491 -478 -456 -438 -430
1975d30%jmj1j8k2j8j1MJ8K5K2J4Pmk2l4k6mPmj7k0j3j1pQK2K3QqqJJ2J5RkqlLKpj7j8j5o
$$ -430 -430 -431 -435 -446 -464 -486 -504 -515 -511 -493 -468 -446 -432 -425 -429 -451 -485 -511 -515 -508 -512 -529 -549 -562 -573 -580 -572 -550 -527 -519 -527 -535 -534 -522 -507 -498 -500 -508 -511 -508 -506 -513 -530 -548 -563 -569
1958e69NJ7K0J3QJ1J5J3OMPJ6J8J5J1J1J2J4Ppj8k2k0j3lJ0J6Qj0k9l9l7k0JJ1Jj2j0OJ2j
$$ -569 -564 -547 -527 -514 -506 -495 -480 -467 -461 -457 -450 -434 -416 -401 -390 -379 -367 -353 -346 -353 -371 -393 -413 -426 -429 -419 -403 -395 -405 -434 -473 -510 -530 -529 -518 -517 -529 -539 -533 -521 -522
1943e22j2lJ4K2J3LMRRKoj5k3k5k0j2j1qJK1L7L8K4QJmj4k9l6k6j2onJJ0J1lj4j4mNJ1K0L0
$$ -522 -534 -537 -523 -501 -488 -485 -481 -472 -463 -461 -467 -482 -505 -530 -550 -562 -573 -581 -580 -559 -522 -484 -460 -452 -451 -455 -469 -498 -534 -560 -572 -578 -583 -582 -572 -561 -564 -578 -592 -596 -591 -580 -560 -530
1927e30L8M2M1L1Rj9l1k0MK7L1J6j1l4l9k8j5j0j0pJJ0J2J0PLNJ1K5L7L4J0k4m9m9l5j9j1
$$ -530 -492 -450 -409 -378 -369 -388 -419 -439 -435 -408 -377 -361 -372 -406 -445 -473 -488 -498 -508 -515 -514 -504 -492 -482 -475 -472 -467 -456 -431 -394 -360 -350 -374 -423 -472 -507 -526 -537
1913e37qlMJ3K3K5J6KokPJ2J0lj9k9k9k1j4qLJ9L1L4L0K1Pj2k8l0k3j3lNLnrromNJ7K6K1Q
$$ -537 -545 -548 -544 -531 -508 -483 -467 -465 -471 -473 -466 -454 -444 -447 -466 -495 -524 -545 -559 -567 -564 -545 -514 -480 -450 -429 -422 -434 -462 -492 -515 -528 -531 -526 -523 -528 -537 -546 -552 -556 -551 -534 -508 -487 -479
1897d79krk0k6k3j7j4j1PL3N2N1L4J4oj8j2PK6K9K3J5Pnj5k3k8l1k4mJ3J5LnmOJ6K5K9J9m
$$ -479 -481 -490 -510 -536 -559 -576 -590 -601 -594 -561 -509 -458 -424 -410 -416 -434 -446 -439 -413 -384 -361 -346 -339 -344 -359 -382 -410 -441 -465 -469 -456 -441 -438 -443 -447 -441 -425 -400 -371 -352 -356
1882c56k6l4l3k6j6nQJ9K4K2J5NkjLkj4k3j6%J0jk7m7m3j4K2M0L3J3KLNlj9k7k5j2KJ2J4J0
$$ -356 -382 -416 -449 -475 -491 -496 -488 -469 -445 -423 -408 -403 -405 -406 -403 -405 -419 -442 -458 -458 -448 -449 -476 -523 -566 -580 -558 -518 -485 -472 -470 -467 -462 -465 -484 -511 -536 -548 -546 -534 -520 -510
1866e10PJ2K1K1J0nj6j9qQK2J7lk2k5j4o%Jkj1j6j4ppp%J2J4mk2k1KK4L0K4J6J2RMJQJ6J5
$$ -510 -503 -491 -470 -449 -439 -444 -460 -479 -487 -479 -457 -440 -443 -465 -490 -504 -510 -510 -509 -511 -522 -538 -552 -559 -566 -573 -573 -561 -547 -551 -573 -594 -592 -568 -538 -514 -498 -486 -477 -473 -472 -464 -448 -433
1850d33Pkoj3k2k5k0j0lJKnj8k4pJ7L2K8J6Mj2k9m0l5k0o%J%LPJ6K3K7K8J5mj6qJ4K6J6nk3
$$ -433 -426 -428 -434 -447 -469 -494 -514 -524 -527 -526 -524 -529 -547 -571 -578 -561 -529 -501 -485 -481 -493 -522 -562 -597 -617 -623 -623 -622 -622 -619 -612 -596 -573 -546 -518 -503 -507 -523 -531 -517 -491 -475 -480 -503
1834e03k8k3oJ1K0J9J4RKpj0JJ1J2POPMjklj0j9j0J3K7J6lrlJnpkNJrj6j8j8j7j3qpokJ0K0
$$ -503 -531 -554 -560 -549 -529 -510 -496 -487 -485 -492 -502 -501 -490 -478 -471 -465 -458 -454 -455 -457 -460 -470 -489 -499 -486 -459 -443 -446 -455 -458 -457 -462 -469 -471 -466 -465 -474 -490 -508 -526 -543 -556 -564 -571 -577 -579 -569 -549
1816e49K0J1Jpj5j7oJ2K3J7NPK2L2J7j2l1k9j8qjRJ6J2lj1lOOKLjj7l5m2l3j6PL0M7M9M2L6
$$ -549 -529 -518 -517 -524 -539 -556 -562 -550 -527 -510 -505 -498 -476 -444 -427 -439 -470 -499 -517 -525 -526 -517 -501 -489 -492 -503 -506 -500 -494 -492 -489 -490 -507 -542 -584 -617 -633 -626 -596 -549 -500 -458 -422
1801d22L2K3J0MMjj5k1j2JPRJ4J3jk2l2k8j9qNQ%j3k0j8j3lJ3K8K8J5OJ2K1K2J5OL%pj5j7
$$ -422 -390 -367 -357 -353 -349 -350 -365 -386 -398 -397 -390 -381 -367 -354 -355 -377 -409 -437 -456 -464 -459 -451 -451 -464 -484 -502 -515 -518 -505 -477 -449 -434 -428 -416 -395 -373 -358 -352 -349 -349 -356 -371 -388
1785c88pJ0J4Mj5k6k6k2j4jJ1J0jj2j3qkJlj5k4k4j8j0qmOK1L9N0M8L2Roj5k1k6k7k9l2k9
$$ -388 -395 -385 -371 -367 -382 -408 -434 -456 -470 -471 -460 -450 -451 -463 -476 -484 -486 -485 -488 -503 -527 -551 -569 -579 -587 -591 -585 -564 -525 -475 -427 -395 -386 -392 -407 -428 -454 -481 -510 -542 -571
1770e71j0J6L5M1L9L9K9Qj2j8qOJ1Omq%J4K3K3J8J2Moj6k7m2n2m5k8j4j1j3j0lPJ2Pj2l2l4
$$ -571 -581 -565 -530 -489 -450 -411 -382 -374 -386 -404 -412 -406 -395 -389 -393 -401 -401 -387 -364 -341 -323 -311 -307 -313 -329 -356 -398 -450 -495 -523 -537 -548 -561 -571 -574 -567 -555 -548 -560 -592 -626
1755f26j4KMKJ3K7K6J1lprj2qOJ7J5POJ7K7K6J3ok2k8j6OK9L3J9Jj0j4j5j3rno%J9M3N0L7
$$ -626 -640 -638 -634 -632 -619 -592 -566 -555 -558 -565 -574 -586 -594 -588 -571 -556 -549 -543 -526 -499 -473 -460 -466 -488 -516 -532 -526 -497 -464 -445 -444 -454 -468 -483 -496 -505 -510 -516 -516 -497 -454 -404 -367
1739c67Rj8l7l5j7RK1J9J7J9J6Nqj9l3m1l7k1j4k2k7j6MK3L7M7M7K7LmJQQL%lkOJ0lk3l6l3
$$ -367 -358 -376 -413 -448 -465 -456 -435 -416 -399 -380 -364 -359 -367 -386 -419 -460 -497 -518 -532 -554 -581 -597 -593 -570 -533 -486 -439 -412 -409 -413 -412 -404 -396 -393 -393 -396 -398 -392 -382 -385 -408 -444 -477
1723d77j9mJ0J9J8Roj7j4MJ8J0j7l2k0MK3L6M0K8J0RK9M4M3M3N0M9L8M4P5J00R2R0J18J53
$$ -477 -496 -500 -490 -471 -453 -444 -450 -467 -481 -477 -459 -449 -466 -498 -518 -514 -491 -455 -415 -387 -377 -368 -339 -295 -252 -209 -159 -110 -72 -28 47 147 239 329 447 600
1710F00J84K60M08N90Q16J200J720J982J499K78j020j693j635j260r42p27n36l74k82k32j73
$$ 600 784 1044 1452 2042 2858 4058 5778 7760 9259 9537 8517 6824 5189 3929 2987 2260 1724 1350 1068 836 663
1702F63j19r9r7q3o4o3o5n0k8k7l3l2l1l8l8j5J3J9Nj2k3k9l1k5k2k7l1k7k2l0l8l1rJ2K6
$$ 663 544 445 348 265 201 138 73 23 -5 -32 -65 -97 -128 -166 -204 -219 -206 -187 -182 -194 -217 -246 -277 -302 -324 -351 -382 -409 -431 -461 -499 -530 -539 -527 -501
1689e01L6L7K4J6K8M0K2j7m4l7j5nrj2j0ojKLRJ7K4K1Rknonolkj0k0k6k3j5oLJ3J7J0mrMK0
$$ -501 -465 -428 -404 -388 -360 -320 -298 -315 -359 -396 -411 -416 -425 -437 -447 -453 -454 -452 -449 -440 -423 -399 -378 -369 -371 -376 -382 -387 -393 -396 -398 -408 -428 -454 -477 -492 -498 -495 -482 -465 -455 -459 -468 -464 -444
1673d44K4J3OQJ3J3J3J3Oj4l1l1j9j2j8k9l5l1j6KJ6J6J3J0QMKOJ0QOJ1J7J7RMJkmlLJ3J8
$$ -444 -420 -407 -401 -393 -380 -367 -354 -341 -335 -349 -380 -411 -430 -442 -460 -489 -524 -555 -571 -569 -553 -537 -524 -514 -506 -502 -500 -494 -484 -476 -470 -459 -442 -425 -416 -412 -411 -413 -417 -420 -417 -404 -386
1657c86K0Pj2k5k4j8k4l1k3KL0L8K7Qqj3onj5k4j2J4L3L1J5%j5k7k6j2KL%LQMj1k8l7l3k1
$$ -386 -366 -359 -371 -396 -420 -438 -462 -493 -516 -514 -484 -446 -419 -411 -419 -432 -438 -443 -458 -482 -494 -480 -447 -416 -401 -401 -416 -443 -469 -481 -479 -476 -476 -473 -465 -461 -472 -500 -537 -570 -591
1642e91nJ1L0N0O3N3K1j0k3k1j6j0pl%OJ3J4Kj5k9l2k8j5LJ7J8OmlOJ1RNRJ6K1J8Mqj3qpj3
$$ -591 -596 -585 -555 -505 -442 -389 -368 -378 -401 -422 -438 -448 -455 -458 -458 -452 -439 -425 -423 -438 -467 -499 -527 -542 -539 -522 -504 -498 -502 -505 -499 -488 -479 -474 -465 -449 -428 -410 -406 -414 -427 -435 -442 -455
1626d55k1k4k0qMJ4J7Qj%QJ3J0ORJ2Lj0j1LK0K8L0K9K5J2knJJ1J7J5Pj0k9l9l8l3k7j5%J2
$$ -455 -476 -500 -520 -528 -524 -510 -493 -485 -486 -486 -478 -465 -455 -449 -440 -428 -425 -435 -446 -443 -423 -395 -365 -336 -311 -299 -301 -306 -305 -294 -277 -262 -255 -265 -294 -333 -371 -404 -431 -446 -446 -434
1611d34J5J0P%j0j4pLKrj2KK1K5J4J%QJ2PKKPJ0QRJ5K2K0OlOK6L6J8j2l6m0l4k8k5k0qLQP
$$ -434 -419 -409 -402 -402 -412 -426 -433 -430 -428 -437 -449 -447 -426 -401 -387 -386 -386 -378 -366 -359 -357 -355 -348 -338 -330 -321 -306 -284 -264 -258 -261 -255 -229 -193 -175 -187 -223 -263 -297 -325 -350 -370 -378 -375 -367 -360
1594c60MMOOKj2k5l4l5k8k2j7j7j4mJ2J9Oj4j3J0L5L1Rrrk%%NJ5K3K5K5K2J4KlMK3L4K9Mk7
$$ -360 -356 -352 -346 -340 -338 -350 -375 -409 -444 -472 -494 -511 -528 -542 -546 -534 -515 -509 -523 -536 -526 -491 -460 -451 -460 -469 -471 -471 -471 -466 -451 -428 -403 -378 -356 -342 -340 -343 -339 -316 -282 -253 -249 -276
1578b76n0n5m2k4j2p%J3K2J9LqrkLKjmlJPRLmj1j6j5oPJ4J1kj7l0l0j4PK0K2K5L3L2J6JjM
$$ -276 -326 -381 -423 -447 -459 -466 -466 -453 -431 -412 -409 -417 -426 -428 -425 -423 -424 -428 -431 -430 -423 -414 -411 -415 -426 -442 -457 -463 -456 -442 -431 -433 -450 -480 -510 -524 -517 -497 -475 -450 -417 -385 -369 -368 -369 -365
1561c65ok7l7l2k2j5kJ6K2Pj0j0JNlrqmmnppjJ5K9L3K2J2J1J3Qkj1j4j6j2kPQkqpJJ1J7K3
$$ -365 -371 -398 -435 -467 -489 -504 -506 -490 -468 -461 -471 -481 -480 -475 -478 -487 -495 -499 -503 -508 -515 -522 -523 -508 -479 -446 -424 -412 -401 -388 -380 -382 -393 -407 -423 -435 -437 -430 -422 -424 -432 -439 -438 -427 -410 -387
1544c87K7K5J8Rnk2l4k6jJ8Ok8m8l7pJ3J0mj2pPJ5Rj0k7k9j5NJ8J3rl4m1j9J5L7L9L4L4L2
$$ -387 -360 -335 -317 -308 -313 -335 -369 -395 -396 -378 -372 -400 -448 -485 -492 -479 -469 -473 -485 -492 -485 -470 -461 -471 -498 -527 -542 -537 -519 -506 -515 -549 -590 -609 -594 -557 -518 -484 -450 -418
1529d18J5j3l2k9j9j4j6j6qlkkQJ8J5%j5j9oQJ5J1LKQJ4J5J0%opjKMLOJ1Rjrj0qqoQK2K7J3
$$ -418 -403 -416 -448 -477 -496 -510 -526 -542 -550 -553 -555 -557 -549 -531 -516 -516 -531 -550 -556 -548 -533 -522 -519 -517 -509 -495 -480 -470 -470 -476 -483 -484 -482 -478 -475 -469 -458 -449 -450 -459 -469 -477 -485 -491 -483 -461 -434 -421
1512d21rk5l1k7j5KJ7K3K5K6K5J5lj9j6jJ1Nj5l0k9j9oOJ7J7lk8l4j5MJ1RJ4K2K2J7J3J2O
$$ -421 -430 -455 -486 -513 -528 -526 -509 -486 -461 -435 -410 -395 -398 -417 -433 -434 -423 -418 -433 -463 -492 -511 -517 -511 -494 -477 -480 -508 -542 -557 -553 -542 -533 -519 -497 -475 -458 -445 -433 -427
1497d27mj4j8j8j7j0JJ8K9K5Pj7l4l4k1lJ2J7J3Mlnmnj0j2rLJ9L2L3K8K3K0J9Rkj5k4k8k7
$$ -427 -431 -445 -463 -481 -498 -508 -507 -489 -460 -435 -428 -445 -479 -513 -534 -537 -525 -508 -495 -491 -494 -499 -503 -508 -518 -530 -539 -536 -517 -485 -452 -424 -401 -381 -362 -353 -355 -370 -394 -422 -449
1482d49j8oPJ7K3K3J3jj9l5m1l7k6j4pjOJ1J6J9K1J9J5J3J2Olrj3j7k3j9nJ1J8J9J5Qj0k7
$$ -449 -467 -473 -466 -449 -426 -403 -390 -391 -410 -445 -486 -523 -549 -563 -570 -571 -565 -554 -538 -519 -498 -479 -464 -451 -439 -433 -436 -445 -458 -475 -498 -517 -522 -511 -493 -474 -459 -451 -461 -488
1467d88l4k7j5jJ0J9J8J3Lqk0k1j1JK%%KKJPJ1LplJ6K6K1J1RJ1Onj4j6j4oNROLKjpmNQlj7
$$ -488 -522 -549 -564 -565 -555 -536 -518 -505 -502 -510 -530 -551 -562 -561 -559 -559 -559 -557 -555 -554 -547 -536 -533 -540 -543 -527 -501 -480 -469 -460 -449 -443 -448 -462 -478 -492 -498 -493 -484 -478 -475 -473 -474 -481 -485 -480 -472 -475 -492
1449d92k0j1omjJmj6k9l2k3nJ3K4K7L0L2L0J9J0J0J4J7J7K0K3J9Pj0k3l0k9k3k2k9l0j6NJ3
$$ -492 -512 -523 -529 -533 -534 -533 -537 -553 -582 -614 -637 -642 -629 -605 -578 -548 -516 -486 -467 -457 -447 -433 -416 -399 -379 -356 -337 -330 -340 -363 -393 -422 -445 -467 -496 -526 -542 -537 -524
1435e24Oo%J5K7K4J1KKJ0J4RMK%nrpjkqj2q%Kjrj6j4mKmj3j7rmmkNJ5K2K5K1J0jpplJJ1K1
$$ -524 -518 -524 -524 -509 -482 -458 -447 -445 -443 -433 -419 -410 -406 -404 -404 -409 -418 -425 -426 -428 -436 -448 -456 -456 -454 -455 -464 -480 -494 -498 -496 -500 -513 -530 -539 -543 -547 -549 -544 -529 -507 -482 -461 -451 -452 -459 -466 -469 -468 -457 -436
1416d36K5J6%j0oLQRKqk1l4l6k3jJ2J0MOJ0J3RLjpnMJ5J5Pjj%lpnKRJ5J6Ork3k7k8k2j2%K
$$ -436 -411 -395 -395 -405 -411 -408 -400 -391 -389 -397 -418 -452 -488 -511 -512 -500 -490 -486 -480 -470 -457 -448 -445 -446 -453 -458 -454 -439 -424 -417 -418 -419 -419 -422 -429 -434 -432 -423 -408 -392 -386 -395 -418 -445 -473 -495 -507 -507 -505
1398e05qj3pMOJJQJ4RLjLPQRJ2J9K0J1qk4l0k5j7qLJ0J1J2J3J7K0J4Jj5k4j5JJ1J1ONJj2k5
$$ -505 -513 -526 -533 -529 -523 -522 -521 -513 -499 -490 -487 -488 -485 -478 -470 -461 -449 -430 -410 -399 -407 -431 -461 -486 -503 -511 -508 -498 -487 -475 -462 -445 -425 -411 -410 -425 -449 -464 -463 -452 -441 -435 -430 -429 -441 -466
1381d66k4rJ2K2J9Qloqj3j8j4mjrk0j7mQJ4K3L0K4Q%PK0K2J5O%kJQJ2J1Kqj2rnnj2j7j0JJ
$$ -466 -490 -499 -487 -465 -446 -438 -441 -447 -455 -468 -486 -500 -504 -505 -514 -534 -551 -555 -547 -533 -510 -480 -456 -448 -448 -441 -421 -399 -384 -378 -378 -380 -379 -371 -359 -348 -346 -354 -366 -375 -380 -385 -397 -414 -424 -423 -422
1364d22j4k8k4nJ2J6Poj9k1j0MPlj0qKQJj6l3m1l5j8JJ4J8J7J2J1J4K7M0M2K6LqlNN%LJ2J5
$$ -422 -436 -464 -488 -493 -481 -465 -458 -464 -483 -504 -514 -510 -503 -506 -516 -524 -522 -514 -513 -529 -562 -603 -638 -656 -655 -641 -623 -606 -594 -583 -569 -542 -502 -460 -434 -431 -439 -442 -437 -432 -432 -429 -417 -402
1348d02Qnj6k3k5j9pjnj5k0j5pJJ0K0L0L1K7J9Rmj7k1j7nPJ3J0Kj0k3k9k4j2LJ6K5L2L5L2
$$ -402 -394 -399 -415 -438 -463 -482 -489 -490 -495 -510 -530 -545 -552 -551 -541 -521 -491 -460 -433 -414 -405 -409 -426 -447 -464 -469 -462 -449 -439 -437 -447 -470 -499 -523 -535 -532 -516 -491 -459 -424 -392
1333c92K2J1NNOKkLJ5J9Oj1j8j1%KJ%KKmj4k3k9l3l6l3k2pLPPRPJqj3j5j1KJ9K4J0j0j4jJ3
$$ -392 -370 -359 -354 -349 -343 -341 -343 -340 -325 -306 -300 -311 -329 -340 -340 -338 -337 -337 -335 -333 -337 -351 -374 -403 -436 -472 -505 -527 -534 -531 -524 -517 -508 -501 -500 -508 -521 -536 -547 -545 -526 -502 -492 -502 -516 -517 -504
1316e04J3QNNMNRJ1MnpmJKPJ4J6J4J1J4K0K1J4Nlmnk0m1n1l3KK9L8L6L3K6J0pj7j4j0ommr
$$ -504 -491 -483 -478 -473 -469 -464 -455 -444 -440 -445 -452 -456 -455 -453 -446 -432 -416 -402 -391 -377 -357 -336 -322 -317 -320 -324 -329 -349 -390 -441 -474 -472 -443 -405 -369 -336 -310 -300 -307 -324 -338 -348 -354 -358 -362 -371
1299c71j7j5jJ5K0J7J4J1Jj6k6k4k3k9l4k2mKqj4oPJ3Pkj4k5k4pQRJnkPJ8L5M3L2J1jK%j5
$$ -371 -388 -403 -404 -389 -369 -352 -338 -327 -326 -342 -368 -392 -415 -444 -478 -500 -504 -502 -510 -524 -530 -523 -510 -503 -505 -519 -544 -568 -575 -567 -558 -557 -562 -564 -557 -539 -504 -461 -429 -418 -419 -417 -417 -432
1283d32l2l1j2QJ0nk5l4k9j4KJ3J9J6Poj2j1okNJ0J2NJLRJ6K3K8K6J3NLKj0k2j9mQRQRNnj7
$$ -432 -464 -495 -507 -499 -489 -494 -519 -553 -582 -596 -594 -581 -562 -546 -539 -545 -557 -568 -574 -576 -571 -561 -549 -544 -543 -540 -531 -515 -492 -464 -438 -425 -420 -417 -415 -425 -447 -466 -470 -462 -453 -445 -436 -431 -436 -453
1266d53k3k1j4LK2K9K3J2PNJpnMJ4J4Kj1j7rJ0K8K8J3rk3l0k8k1j2pppmKONNJ0J8J9J2%j5
$$ -453 -476 -497 -511 -508 -486 -457 -434 -422 -415 -410 -409 -416 -421 -417 -403 -389 -387 -398 -415 -424 -414 -386 -358 -345 -354 -377 -407 -435 -456 -468 -475 -482 -489 -493 -491 -485 -480 -475 -465 -447 -428 -416 -416 -431
1250d31k3k3j7lJ0J9K0J6J5J4Nj0k6l2l2k7j4jPLJJ2L1M0L0J5MlomKKqj6j9j4rKJ4K3K3J7
$$ -431 -454 -477 -494 -497 -487 -468 -448 -432 -417 -403 -398 -408 -434 -466 -498 -525 -539 -540 -533 -530 -529 -517 -486 -446 -416 -401 -397 -400 -406 -410 -408 -406 -414 -430 -449 -463 -472 -470 -456 -433 -410 -393
1234c93J1LpqMJ0nk8l6k7j7j5j5j2j6l0l3j2J6L2K4Oj4k3j8JK2L1L2L0K6J6kj4j9j7j6j0j
$$ -393 -382 -379 -386 -394 -390 -380 -385 -413 -449 -476 -493 -508 -523 -535 -551 -581 -614 -626 -610 -578 -554 -548 -562 -585 -603 -602 -580 -549 -517 -487 -461 -445 -447 -461 -480 -497 -513 -523 -524
1220e24QJ1J0OLjlkJLNNOPRJ1Nnj5j5pPJ4J2QRQmk1k6rJ0J3Jqj0rj3j5j8k4l4l1oK5M3M0K5
$$ -524 -516 -505 -495 -489 -486 -487 -490 -492 -491 -488 -483 -478 -472 -465 -456 -445 -440 -445 -460 -475 -482 -475 -461 -449 -441 -432 -424 -428 -449 -475 -484 -474 -461 -460 -468 -478 -487 -500 -515 -533 -557 -591 -622 -628 -603 -560 -520 -495
1202d95J4LkNK3M0M3K6nl9o0n7l7j4PK2L7N0N1L3Pj1j2jNNKmj7l3l4j8OJ5J0Klj3l0l8k9p
$$ -495 -481 -478 -480 -475 -452 -412 -369 -343 -348 -387 -447 -504 -541 -555 -548 -526 -489 -439 -388 -355 -348 -359 -371 -372 -367 -362 -360 -364 -381 -414 -448 -466 -460 -445 -435 -433 -436 -449 -479 -517 -546 -553
1187e53J2K3K8K8J8jj6j8pjlokJLMRR%j0mJ2J8OoJJ6K1J8K1K8K3kk4k9k2k3k9k8j9oOK5M7
$$ -553 -541 -518 -490 -462 -444 -445 -461 -479 -486 -487 -490 -496 -498 -497 -494 -490 -481 -472 -472 -482 -486 -474 -456 -450 -456 -455 -439 -418 -400 -379 -351 -328 -330 -354 -383 -405 -428 -457 -485 -504 -510 -504 -479 -432
1171d32N5L9J0j5k8l4k9j5kMJnqj0oMPmj8k2j3k%LJ3K1J9J5J2J2LpqJJ2J7J2jk1l9m4l5j8
$$ -432 -377 -338 -328 -343 -371 -405 -434 -449 -451 -447 -446 -451 -459 -469 -475 -471 -464 -468 -486 -508 -521 -523 -523 -520 -507 -486 -467 -452 -440 -428 -425 -432 -440 -439 -427 -410 -398 -399 -420 -459 -503 -538 -556
1155e56kRJ8K4K2J0j3l9n1l9j2RJ9K1K3J8RNJ4K4K3J7J5J7J3KmJJ6K5J9%k1l0k7k0j9j6qJ
$$ -556 -558 -549 -531 -507 -485 -475 -488 -527 -578 -617 -629 -620 -601 -580 -557 -539 -530 -525 -511 -487 -464 -447 -432 -415 -402 -400 -404 -403 -387 -362 -343 -343 -364 -394 -421 -441 -460 -476 -484 -483
1140d83MLLONjjPJ2Opj4qLJ0J0Lj0j6j2kJlrokkmjPJ0P%mLJ5K4K4J5Jj2k3l1l1k7k3j9j1L
$$ -483 -479 -476 -473 -467 -462 -463 -464 -457 -445 -439 -446 -460 -468 -465 -455 -445 -442 -452 -468 -480 -482 -481 -484 -493 -499 -501 -503 -507 -508 -501 -491 -484 -484 -488 -485 -470 -446 -422 -407 -406 -418 -441 -472 -503 -530 -553 -572 -583 -580
1122e80J5J5RLNQJ6K8L9L2Qk0l3k9k1j7j7j8j5nJ5L1K8Nj7j9nJ1J4QOJ5K8K2nl4m1k7j0jO
$$ -580 -565 -550 -541 -538 -533 -525 -509 -481 -442 -410 -402 -422 -455 -484 -505 -522 -539 -557 -572 -577 -562 -531 -503 -498 -515 -534 -539 -528 -514 -506 -500 -485 -457 -435 -440 -474 -515 -542 -552 -553 -547
1107e47J3J7Qqj9j8qNJ6K1K3K5K1Orj0MJ3Mj1j5pmqrkLLNJ0J7J8J9K1J4kj6j6lJ1K0K2J8O
$$ -547 -534 -517 -509 -517 -536 -554 -562 -557 -541 -520 -497 -472 -451 -445 -454 -464 -460 -447 -443 -454 -469 -476 -480 -488 -497 -499 -496 -493 -488 -478 -461 -443 -424 -403 -389 -391 -407 -423 -426 -415 -395 -373 -355 -349
1091c49oj0kRJ2Mj2k6l2k7j8qLJ2Prk4l0k2j1l%mnJJ3J5ROJ3K3K1J4J0J5J8J4J1J2Rlj4j3
$$ -349 -355 -365 -367 -358 -346 -342 -354 -380 -412 -439 -457 -465 -462 -450 -443 -452 -476 -506 -528 -539 -542 -542 -546 -551 -550 -537 -522 -513 -507 -494 -471 -450 -436 -426 -411 -393 -379 -368 -356 -347 -350 -364 -377
1075c77lNLj0k2k9k7k0j2kNMJklmrj6j7j0kNRPlj1pRK1J7Krj4k0k8l2k5j1%MQJ8L2M3M2L5
$$ -377 -380 -375 -372 -382 -404 -433 -460 -480 -492 -494 -489 -485 -484 -486 -489 -493 -502 -518 -535 -545 -547 -542 -533 -526 -529 -540 -547 -538 -517 -500 -498 -507 -521 -541 -569 -601 -626 -637 -637 -633 -625 -607 -575 -532 -490 -455
1059d55K1Jk3l5k4%J1NNK1L6K5Jj2roj7k9k3oJ1K0K3K5K0J3QPQKrj5j2jKnk1k5j5NJ9K1Ro
$$ -455 -434 -433 -456 -491 -515 -515 -504 -499 -494 -473 -437 -412 -411 -423 -432 -438 -455 -484 -507 -513 -502 -482 -459 -434 -414 -401 -393 -386 -378 -376 -385 -400 -412 -413 -411 -416 -437 -462 -477 -472 -453 -432 -423 -429
1042d29j8k2j5o%jk%PK1L3L1J5lj3j6j4rKQ%j1j5pMJ0Pkj8l3l8k3kJ4J5J4J7K7L2K7J3L%J
$$ -429 -447 -469 -484 -490 -490 -491 -493 -493 -486 -465 -432 -401 -386 -389 -402 -418 -432 -441 -439 -431 -431 -442 -457 -464 -460 -450 -443 -445 -463 -496 -534 -557 -559 -545 -530 -516 -499 -472 -440 -413 -400 -397 -397 -396
1026c96PJ8L1K9J3nj2j1j2k0k6k7k5k3j3jJj0j9j1NOrk2j9lJ1J8J7Qmj2rNK1K7K4J3%nJJ2
$$ -396 -389 -371 -340 -311 -298 -303 -315 -326 -338 -358 -384 -411 -436 -459 -472 -473 -472 -482 -501 -512 -507 -501 -510 -532 -551 -554 -543 -525 -508 -500 -504 -516 -525 -520 -499 -472 -448 -435 -435 -440 -439 -427
1011d27J9J4Lnj0j7k3j9rnj4k4k5j5kPJ7K2J1rk2k0rloj4j9j8qLMmoMJ9K0J0mqjJ1K1J9RJ
$$ -427 -408 -394 -391 -396 -406 -423 -446 -465 -474 -479 -493 -517 -542 -557 -559 -552 -535 -513 -502 -511 -533 -553 -562 -565 -571 -585 -604 -622 -630 -627 -623 -627 -633 -629 -610 -590 -580 -584 -592 -593 -582 -561 -542 -533 -532
994e32LRJ4J5J5J5J1OOJ2J4J4J2J2J2J2RNmj5j9j8j8j7qMRkj7k6k7k0nJ4K9K6J7J1J1Ojpn
$$ -532 -529 -520 -506 -491 -476 -461 -450 -444 -438 -426 -412 -398 -386 -374 -362 -350 -341 -336 -340 -355 -374 -392 -410 -427 -435 -431 -422 -424 -441 -467 -494 -514 -519 -505 -476 -450 -433 -422 -411 -405 -406 -413 -418
979d18KQP%rj6j6j1%J3J8J1lj7k3k1j0NJ8J5KrlJ1J6Qloprj1rKJ8K9L1K1J1OOPJ2J5J0qk4
$$ -418 -416 -408 -401 -401 -410 -426 -442 -453 -453 -440 -422 -411 -414 -431 -454 -475 -485 -480 -462 -447 -445 -454 -457 -446 -430 -422 -425 -431 -438 -447 -458 -467 -465 -447 -418 -387 -366 -355 -349 -343 -336 -324 -309 -299 -307 -331
962c31k5j2pqj0j0j4k2k2j4qj3j4nQJ2J2J5K1K1J1%pj2j3nLkj8k7j2J5L2K9J4Jqj2qMJ3J3
$$ -331 -356 -368 -375 -383 -393 -403 -417 -439 -461 -475 -483 -496 -510 -515 -507 -495 -483 -468 -447 -426 -415 -415 -422 -434 -447 -452 -449 -451 -469 -496 -508 -493 -461 -432 -418 -417 -425 -437 -445 -441 -428 -415
946d15KnlQJ6J6Nqj7j7rjJmj2j7j4pKRJ8L0L7K9J1LJ3K2J4rk4k7k3k2j3kLjkJ1K3J6Jn%Ll
$$ -415 -413 -418 -421 -413 -397 -381 -376 -384 -401 -418 -427 -428 -427 -431 -443 -460 -474 -481 -479 -470 -452 -422 -385 -356 -345 -342 -329 -307 -293 -302 -326 -353 -376 -398 -411 -413 -410 -411 -413 -402 -379 -363 -362 -367 -367 -364 -367
929c67j3k0k3j9r%LNJ5L1L8K9J4Mkj2k0k0j1lpj8k8l3l5m2m3l2j0J3K2K1J1%pqlkrj5j0NK0
$$ -367 -380 -400 -423 -442 -451 -451 -448 -443 -428 -397 -359 -330 -316 -312 -314 -326 -346 -366 -377 -380 -387 -405 -433 -466 -501 -543 -586 -618 -628 -615 -593 -572 -561 -561 -568 -576 -579 -581 -590 -605 -615 -610 -590
913e90K6K0J5J5J7J7QlojLNMMK%MJ6K7L2L0K4Pj2j6KK0Pk2l3j3Nol6n0l9k0nQK5L3L3K5J8
$$ -590 -564 -544 -529 -514 -497 -480 -472 -475 -481 -482 -479 -474 -470 -466 -464 -464 -460 -444 -417 -385 -355 -331 -324 -336 -352 -350 -330 -323 -345 -378 -391 -386 -392 -428 -478 -517 -537 -542 -534 -509 -476 -443 -418 -400
897d00J0%j1j4o%nj5j8nJ8K8K5J8J4J1MMJ0Rqk8l2k0qrj6k4l0l0j7KRLKJ5L1L1J7OMjj2k3
$$ -400 -390 -390 -401 -415 -421 -421 -426 -441 -459 -464 -446 -418 -393 -375 -361 -350 -346 -342 -332 -323 -331 -359 -391 -411 -419 -428 -444 -468 -498 -528 -545 -543 -534 -531 -529 -514 -483 -452 -435 -429 -425 -426 -438 -461
881d61k3j9j9j7qQK3K3J4%qj3j8k4k3j1OJ8K3K8L9M1K5nk5k1rmj1j6j2mJMNQJ0J2J3RLlom
$$ -461 -484 -503 -522 -539 -547 -539 -516 -493 -479 -479 -487 -500 -518 -542 -565 -576 -570 -552 -529 -501 -462 -421 -396 -401 -426 -447 -456 -460 -471 -487 -499 -503 -502 -498 -493 -485 -475 -463 -450 -441 -438 -441 -447 -451
865d51mj3k2j9qKmj6j8nJ1J7J6J6J7J2Krj3j0KK1M3N3M5K1mk3k6j5JJ0J3J1J1PjnjOQQRJ2
$$ -451 -455 -468 -490 -509 -517 -515 -519 -535 -553 -558 -547 -530 -514 -498 -481 -469 -467 -476 -489 -499 -497 -476 -433 -380 -335 -314 -318 -341 -367 -382 -381 -371 -358 -347 -336 -329 -330 -335 -336 -330 -322 -314 -305 -293
849b93Nj0k6k7j5%M%nj0j3k1k7k3mJ4J9RklPK0K3J0j2k5k1plj5k8l0j8kJ0J7J4Jj3j8qRJ9
$$ -293 -288 -298 -324 -351 -366 -366 -362 -362 -367 -377 -390 -411 -438 -461 -465 -451 -432 -423 -425 -428 -421 -401 -378 -368 -380 -405 -426 -433 -436 -451 -479 -509 -527 -529 -519 -502 -488 -487 -500 -518 -526 -517 -498
833d98J7J2Nmj1j1mlj3k2j4LJ2J0PJ2J1KolL%j4k6k5j6oLNLLJ2K6L7L7L2K6J6Mqj2j3q%J0
$$ -498 -481 -469 -464 -468 -479 -490 -494 -497 -510 -532 -546 -543 -531 -521 -514 -502 -491 -489 -495 -498 -495 -495 -509 -535 -560 -576 -582 -579 -574 -571 -568 -556 -530 -493 -456 -424 -398 -382 -378 -386 -398 -411 -419 -419 -409
$$ [...]
-954b67
##END=	
##END=	
