##TITLE=	Jul23-2022.41.fid
TM-VI-285, Bz-pyr, CD3OD 13C

##JCAMP-DX=	6.0	$$ MestReNova 14.3.1-31739
##DATA TYPE=	LINK
##BLOCK_ID=	1
##BLOCKS=	2    
##ORIGIN=	Mestrelab Research S.L.
##OWNER=	hrzepa
##$MNOVA/LINK_BLOCK_TYPE=	ITEM	$$ NMR Spectrum
##$MNOVA/ITEM/POLYGON=	(XY..XY)
5321,5835
8722,5835
8722,8208
5321,8208
5321,5835
##$MNOVA/ITEM/Z=	0
##$MNOVA/ITEM/ANGLE=	0
##TITLE=	Jul23-2022.41.fid
##JCAMP-DX=	6.0	$$ MestReNova 14.3.1-31739
##BLOCK_ID=	2
##DATA TYPE=	MNOVA NMR VIEW DATA
##DATA CLASS=	MNOVA VIEW DATA
##$MNOVA/ITEM/ZOOM/X=	-20.698776542268014111,	240.66949999422217843
##$MNOVA/ITEM/ZOOM/Y=	-211.30368423461914063,	2192.850677490234375
##END=	
##TITLE=	Jul23-2022.41.fid
##JCAMP-DX=	6.0	$$ MestReNova 14.3.1-31739
##BLOCK_ID=	3
##DATA TYPE=	NMR SPECTRUM
##DATA CLASS=	XYDATA
##NUMDIM=	1
##ORIGIN=	Bruker BioSpin GmbH
##OWNER=	nmr
##.OBSERVE FREQUENCY=	100.69424847706599735
##.OBSERVE NUCLEUS=	^13C
##.SOLVENT NAME=	MeOD
##.PULSE SEQUENCE=	zgpg30
##LONGDATE=	2022/07/23 17:30:00.000
##.ACQUISITIONMODE=	SIMULTANEOUS (DQD)
##$ORIGINAL FORMAT=	Bruker XWIN-NMR
##$MNOVA/SCALES_VERSION=	9
##$PARAMETER FILE=	(acqus, ASCII, /private/var/folders/f6/rjf_tdyn2v98c5c0wvkgn4s80000gn/T/ICmhQgkvR4K3GNzOG$oINA/41/acqus, 0)
$$ ##TITLE= Parameter file, TOPSPIN		Version 3.2
$$ ##JCAMPDX= 5.0
$$ ##DATATYPE= Parameter Values
$$ ##NPOINTS= 11	$$ modification sequence number
$$ ##ORIGIN= Bruker BioSpin GmbH
$$ ##OWNER= nmr
$$ $$ 2022-07-23 17:30:23.660 +0100  nmr@CZC10666PP
$$ $$ /opt/topspin/data/agmb/nmr/Jul23-2022/41/acqus
$$ $$ process /opt/topspin3.2/prog/mod/shimcntl
$$ ##$ACQT0= -2.01680680282977
$$ ##$AMP= (0..31)
$$ 100 100 100 100 100 100 100 100 100 100 100 100 100 100 100 100 100 100
$$ 100 100 100 100 100 100 100 100 100 100 100 100 100 100
$$ ##$AMPCOIL= (0..19)
$$ 0 0 0 0 0 0 0 0 0 0 0 0 0 0 0 0 0 0 0 0
$$ ##$ANAVPT= -1
$$ ##$AQSEQ= 0
$$ ##$AQ_mod= 3
$$ ##$AUNM= <au_zgonly>
$$ ##$AUTOPOS= <13 >
$$ ##$BF1= 100.683175
$$ ##$BF2= 400.41
$$ ##$BF3= 100.683175
$$ ##$BF4= 100.683175
$$ ##$BF5= 100.683175
$$ ##$BF6= 100.683175
$$ ##$BF7= 100.683175
$$ ##$BF8= 100.683175
$$ ##$BYTORDA= 0
$$ ##$CAGPARS= (0..11)
$$ 0 0 0 0 0 0 0 0 0 0 0 0
$$ ##$CFDGTYP= 0
$$ ##$CFRGTYP= 9
$$ ##$CHEMSTR= <none>
$$ ##$CNST= (0..63)
$$ 1 1 145 1 1 1 1 1 1 1 1 1 1 1 1 1 1 1 1 1 1 1 1 1 1 1 1 1 1 1 1 1 1 1 1
$$ 1 1 1 1 1 1 1 1 1 1 1 1 1 1 1 1 1 1 1 1 1 1 1 1 1 1 1 1 1
$$ ##$CPDPRG= (0..8)
$$ <waltz16> <> <waltz16> <> <mlev> <mlev> <mlev> <mlev> <mlev>
$$ ##$D= (0..63)
$$ 0 1 0.00345 0 0 0 0 0 0 0.06 0 0.03 2e-05 3e-06 0 0 0.0002 0 0 0 0 0 0
$$ 0 0 0 0 0 0 0 0 0 0 0 0 0 0 0 0 0 0 0 0 0 0 0 0 0 0 0 0 0 0 0 0 0 0 0 0
$$ 0 0 0 0 0
$$ ##$DATE= 1658593822
$$ ##$DE= 6.5
$$ ##$DECBNUC= <off>
$$ ##$DECIM= 760
$$ ##$DECNUC= <off>
$$ ##$DECSTAT= 4
$$ ##$DIGMOD= 1
$$ ##$DIGTYP= 12
$$ ##$DQDMODE= 0
$$ ##$DR= 21
$$ ##$DS= 4
$$ ##$DSPFIRM= 0
$$ ##$DSPFVS= 20
$$ ##$DTYPA= 0
$$ ##$EXP= <c13q>
$$ ##$F1LIST= <111111111111111>
$$ ##$F2LIST= <222222222222222>
$$ ##$F3LIST= <333333333333333>
$$ [...]
$$ ##$Sgu3PowerLevels= (0..7)
$$ 0 0 0 0 0 0 0 0
$$ ##$Sgu4PowerLevels= (0..7)
$$ 0 0 0 0 0 0 0 0
$$ ##$Sgu5PowerLevels= (0..7)
$$ 0 0 0 0 0 0 0 0
$$ ##$Sgu6PowerLevels= (0..7)
$$ 0 0 0 0 0 0 0 0
$$ ##$Sgu7PowerLevels= (0..7)
$$ 0 0 0 0 0 0 0 0
$$ ##$Sgu8PowerLevels= (0..7)
$$ 0 0 0 0 0 0 0 0
$$ ##$SguType= 3
$$ ##$ShimPowMaxUA= (0..63)
$$ 130000 130000 130000 130000 130000 130000 130000 130000 130000 130000 130000
$$ 130000 130000 130000 130000 130000 130000 130000 130000 130000 0 0 0 0
$$ 0 0 0 0 0 0 0 0 0 0 0 0 0 0 0 0 0 0 0 0 0 0 0 0 0 0 0 0 0 0 0 0 0 0 0 0
$$ 0 0 0 0
$$ ##$ShimPowMaxUC= (0..63)
$$ 130000 130000 130000 130000 130000 130000 130000 130000 130000 130000 130000
$$ 130000 130000 130000 130000 130000 130000 130000 130000 130000 0 0 0 0
$$ 0 0 0 0 0 0 0 0 0 0 0 0 0 0 0 0 0 0 0 0 0 0 0 0 0 0 0 0 0 0 0 0 0 0 0 0
$$ 0 0 0 0
$$ ##$ShimPowMaxUG= (0..63)
$$ 524287 524287 524287 524287 524287 524287 524287 524287 524287 524287 524287
$$ 524287 524287 524287 524287 524287 524287 524287 524287 524287 0 0 0 0
$$ 0 0 0 0 0 0 0 0 0 0 0 0 0 0 0 0 0 0 0 0 0 0 0 0 0 0 0 0 0 0 0 0 0 0 0 0
$$ 0 0 0 0
$$ ##$ShimPowRcbType= 3
$$ ##$ShimPowRes= (0..63)
$$ 1e-20 1e-20 1e-20 1e-20 1e-20 1e-20 1e-20 1e-20 1e-20 1e-20 1e-20 1e-20
$$ 1e-20 1e-20 1e-20 1e-20 1e-20 1e-20 1e-20 1e-20 0 0 0 0 0 0 0 0 0 0 0 0
$$ 0 0 0 0 0 0 0 0 0 0 0 0 0 0 0 0 0 0 0 0 0 0 0 0 0 0 0 0 0 0 0 0
$$ ##$ShimPowRng0= (0..63)
$$ 1 1 1 1 1 1 1 1 1 1 1 1 1 1 1 1 1 1 1 1 0 0 0 0 0 0 0 0 0 0 0 0 0 0 0 0
$$ 0 0 0 0 0 0 0 0 0 0 0 0 0 0 0 0 0 0 0 0 0 0 0 0 0 0 0 0
$$ ##$ShimPowRng1= (0..63)
$$ 1 1 1 1 1 1 1 1 1 1 1 1 1 1 1 1 1 1 1 1 0 0 0 0 0 0 0 0 0 0 0 0 0 0 0 0
$$ 0 0 0 0 0 0 0 0 0 0 0 0 0 0 0 0 0 0 0 0 0 0 0 0 0 0 0 0
$$ ##$ShimPowRng2= (0..63)
$$ 1 1 1 1 1 1 1 1 1 1 1 1 1 1 1 1 1 1 1 1 0 0 0 0 0 0 0 0 0 0 0 0 0 0 0 0
$$ 0 0 0 0 0 0 0 0 0 0 0 0 0 0 0 0 0 0 0 0 0 0 0 0 0 0 0 0
$$ ##$ShimPowRng3= (0..63)
$$ 1 1 1 1 1 1 1 1 1 1 1 1 1 1 1 1 1 1 1 1 0 0 0 0 0 0 0 0 0 0 0 0 0 0 0 0
$$ 0 0 0 0 0 0 0 0 0 0 0 0 0 0 0 0 0 0 0 0 0 0 0 0 0 0 0 0
$$ ##$ShimSysFunc= (0..63)
$$ 1 2 3 4 5 7 9 11 15 16 8 10 12 14 6 17 13 18 19 20 0 0 0 0 0 0 0 0 0 0
$$ 0 0 0 0 0 0 0 0 0 0 0 0 0 0 0 0 0 0 0 0 0 0 0 0 0 0 0 0 0 0 0 0 0 0
$$ ##$ShimSysMatrix= 0
$$ ##$ShimSysType= 1
$$ ##$TFXNUM= 0
$$ ##$TRIPLO2= 0
$$ ##$VTU= 2
$$ ##$VTUETH= <149.236.99.20>
$$ ##$VTUTY= <no>
$$ ##$WBREFAM= (0..15)
$$ 135 116 100 100 100 100 100 100 100 100 100 100 100 100 100 100
$$ ##$WBREFLM= (0..15)
$$ 0 0 0 0 0 0 0 0 0 0 0 0 0 0 0 0
$$ ##$WBREFPH= (0..15)
$$ 71.66 -68.25 0 0 0 0 0 0 0 0 0 0 0 0 0 0
$$ ##$WBSGU= (0..15)
$$ 0 0 0 0 0 0 0 0 0 0 0 0 0 0 0 0
$$ ##$XFAC= 2
$$ ##END=
$$ 
##$DECIM=	760
##$DSPFVS=	20
##XUNITS=	HZ
##YUNITS=	ARBITRARY UNITS
##FIRSTX=	24231.369385662510467
##LASTX=	-2084.0185409410978536
##DELTAX=	-0.40154708059210514337
##XFACTOR=	1
##YFACTOR=	0.044986034669493656091
##FIRSTY=	3.0758373737335205078
##MINY=	-11.953617095947265625
##MAXY=	1993.5006103515625
##NPOINTS=	65536
##XYDATA=	(X++(Y..Y))
$$ [...]
10545E5k7k0pRK1L0L0K1Qnj0onmmklpnMJ4J6J3J0J2Pkj4k0k1j8j1lKKkn%J0K4L2L2K4Rnj2
10527A67j0lJlj4l1m0l8k4qlm%J1K6L1K5J8J6J8J8J4Mnrojjj1k2l1l4k9j4OK2K7K2J6J1Lq
10510A07j7j1QK5K9J9J0NKlqolmj0j2j0qnKJ1J5J3J0ROlj3j9k4k7k4j2JQOLJJKMJ1J5J2Nm
10491A17om%JJK%nj5k2k0j1mmolLQPJrk0k3j8pKOJ1J5J9K2K9L6L7K3Kj4j8j5j4j5j2lJmj7
10473E4k8k8j8lJ1J6J3J0J4K2K2J5Mkmj4k9l7l2k1j1qj1j1kJ0J4J1PRJ2J5J9K4K7K2J7J7K0
10457A46J9J0jopnmlmpj5k5k9k1kJ4J6OkmkJNJ1J6J8J8J6Pnj4j1lLjrk4m0m5l1qJ2J7J5J2
10439C4J2J0Kqj3j1lNJ8K9L2K1%j3j1kjrj7j7j2j0j0rolJJ%jKRJ6K0J7J4J1OMNO%j2k4k3j0
10421E0%%lljJjKJ3K4K7K0J1Klm%ORNlj3k3l0k7j6kOKnj4j5j2mMJ4J9J2%rnPJ5J5J3J7K0J6
$$ plain form
10545 55 28 8 1 10 31 61 91 112 120 115 105 99 94 90 86 84 81 74 69 73 87 103 116 126 138 145 143 129 109 88 70 59 56 58 60 58 53 53 63 87 119 151 175 184 179 167
10527 167 157 154 155 152 138 107 67 29 5 -3 -6 -10 -10 1 27 58 83 101 117 135 153 167 171 166 157 151 150 149 138 116 85 51 22 8 14 36 63 85 101 112 115 107
10510 107 90 79 87 112 141 160 170 175 177 174 166 160 157 153 143 131 121 113 108 110 121 136 149 159 168 174 171 158 139 115 88 64 52 53 61 67 70 71 72 74 78 89 104 116 121 117
10491 117 111 107 107 108 109 111 111 106 91 69 49 38 34 30 24 21 24 32 39 40 31 11 -12 -30 -37 -35 -29 -18 -3 16 38 67 103 140 163 165 151 133 118 104 89 77 74 75 71 54
10473 54 26 -2 -20 -23 -12 4 17 27 41 63 85 100 104 102 98 84 55 18 -14 -35 -46 -54 -65 -76 -78 -68 -54 -43 -36 -27 -15 0 19 43 70 92 109 126 146
10457 146 165 175 174 168 161 156 152 149 145 138 123 98 69 48 46 60 76 82 80 76 74 75 80 91 107 125 143 159 166 161 147 136 133 136 135 126 102 62 17 -14 -22 -10 7 22 34
10439 34 46 56 58 50 37 26 23 28 46 75 107 128 128 115 104 102 101 92 75 58 46 36 26 17 11 8 9 10 10 9 11 20 36 56 73 87 98 104 108 113 119 119 107 83 60 50
10421 50 50 50 47 44 43 44 43 45 58 82 109 129 140 142 139 135 135 141 150 155 152 139 116 86 59 43 41 47 49 44 30 15 3 -1 3 17 36 48 48 39 34 41 56 71 84 101 121 137
10401A37jj9k6j5KJ3Prk4k6j7poj0j3q%LkppJJ1J7K2K7K4J0nj6j6j1mKQJ3J5J1L%OJ5J7J0
10384A25OJ0J8K2K8L2L1K1K3M8R1J33J72K12K24J61K2j32k18k22j79j34r6o1l5k5k6l0k7k1
10372A73j4j0qnLJ5K4K0J1LjnppjPJ3J6J2Mnj0j4k0k3k2j7j3j1qkKOMkqj0qkKMLJOJ5K2J3
10353A46qk3j8qlqnORpk7l3j5RK4K8K7K6J9Qpj7k1j9j3oLJ8L0L5K3Lj8k7k1pPJ6K2K9K9K1
10336B27Ommloj7k7k8k1j0%MOPPPjj3k5k5j4KQPMLL%mqj0j3j0jJ2J9J7OlpnjPJ3J9K0J7J1
10317A72KjJOPNlrqkJnj6k3k1j3mKJ0J8K4K8K7J9Omn%NNKLQJ1Pmj6j7pJ0K3K3J2ql2m9n1l5
10297A04j3lmrpJQPJoj2j6j5qMJ6K5K8K3J1jpplKRJ6J6Kk2l7l0pJ3J5MpqlkjLOQLlrj0rqo
10277E2oolNPMlkKPQJ4K5L3K9J2mj5j6rJPMnj4j9k2j8r%KJJPRMoqkMPRJ2J1Ook1l5m2l4j7
$$ plain form
10401 137 136 117 91 76 78 91 98 89 65 39 22 15 9 -1 -14 -22 -22 -19 -21 -28 -35 -34 -23 -6 16 43 67 77 72 56 40 29 25 27 35 48 63 74 77 77 83 98 115 125
10384 125 131 141 159 181 209 241 272 293 316 364 455 588 760 972 1196 1357 1379 1247 1029 807 628 494 398 337 302 277 251 221 194 173
10372 173 159 149 141 136 139 154 178 198 209 212 211 206 199 192 191 198 211 227 239 243 238 228 214 194 171 149 132 119 108 100 98 100 106 110 108 100 90 82 80 82 86 89 90 96 111 133 146
10353 146 138 115 97 89 86 78 73 79 88 81 54 21 6 15 39 67 94 120 139 147 140 123 102 83 70 64 67 85 115 150 173 176 158 131 110 103 110 126 148 177 206 227
10336 227 233 229 225 222 216 199 172 144 123 113 113 117 123 130 137 144 143 130 105 80 66 68 76 83 87 90 93 93 89 81 71 58 48 47 59 78 95 101 98 91 86 85 92 105 124 144 161 172
10317 172 174 173 174 180 187 192 189 180 172 170 171 166 150 127 106 93 89 91 101 119 143 171 198 217 223 219 214 214 219 224 226 229 237 248 255 251 235 218 211 221 244 267 279 271 239 190 139 104
10297 104 91 88 84 75 68 69 77 84 85 79 67 51 36 28 32 48 73 101 124 135 134 127 120 117 119 128 144 160 162 140 103 73 66 79 94 98 91 83 80 78 77 80 86 94 97 94 85 75 66 58 52
10277 52 46 40 37 42 49 53 50 48 50 57 65 79 104 137 166 178 174 159 143 134 135 142 146 141 127 108 86 68 59 59 61 62 63 70 79 83 77 69 67 71 78 87 99 110 116 110 89 54 12 -22 -39
10256c9MJ6J6QjljKkj3j7qRJ9J6RKnrlPK3L2L4L6L6L0J6lk2l4l6k8j7j3j4j1MK3L0K2QKMj
10238A28j4k8l1k3j4j2oLJ4K0J9J5J0MjJLMknmLJ1J2Ppk3l0k5j8j1lMJ6K2K8L4L9L6K9K7K5
10221B57J8R%jnj5k8l6l5k7j8j3j1j1nNJ3J7J9J7J4QJlrj3j4qJONKjlkKLLLMPMkqj3j6j5j7
10202H9k0k4k1j4j0j2j6rLJ3J2P%ornLPMlonlnmJJ0K2K9K9J7OjornJ1K9L6L0J6Kj0j4nJ1K1
10183A86J9Mj1j7j1%J0J3J1J1Nnj7j9j1kKJlj4l1m4m3k7rLJ0J3J5J8J7J3J0J3J9J9Pj0j8j4
10167A13lNROJmnqj5j8j4j1j3k0j9qKPRRNJKJ1J9J8J2N%oj4k0k6k6k2j5j1p%QJ1ROJ3K6L6
10149E8L0J4Jponorq%RJ0M%KLKmrqlj%%JLOJ1J4J6J2Jrj0nnj6k5k3j2l%k%KJkrj2j1oJQQN
10127F%mk%NJ0J7J9J2Km%ORMmj3k1k7k5j8lJ1K3L0K5J4jrj2j3qkJlj1j4j0LJ5K5K7K5J7Nj1
$$ plain form
10256 -39 -35 -19 -3 5 4 1 0 2 0 -13 -30 -38 -29 -10 6 15 17 12 3 0 7 30 62 96 132 168 198 214 211 189 155 119 91 74 61 47 36 40 63 93 115 123 125 129 128
10238 128 114 86 55 32 18 6 0 3 17 37 56 71 81 85 84 85 88 92 90 85 81 84 95 107 114 107 84 54 29 11 0 -3 1 17 39 67 101 140 176 205 232 257
10221 257 275 284 284 283 278 263 235 199 164 137 119 106 95 84 79 84 97 114 133 150 164 172 173 170 161 148 134 126 127 133 138 140 139 136 134 136 139 142 145 149 156 160 158 150 137 121 106 89
10202 89 69 45 24 10 0 -12 -28 -37 -34 -21 -9 -2 -2 -8 -17 -22 -19 -12 -8 -11 -17 -22 -25 -30 -34 -33 -23 -1 28 57 74 80 79 73 64 59 70 99 135 165 181 183 173 159 154 165 186
10183 186 205 209 198 181 170 170 180 193 204 215 220 215 198 179 168 166 168 169 166 152 121 77 34 7 -2 1 11 24 39 57 74 87 97 110 129 148 155 145 127 113
10167 113 110 115 124 130 131 127 122 114 99 81 67 56 43 23 4 -4 -2 5 14 23 28 29 31 42 61 79 91 96 96 90 76 56 30 4 -18 -33 -44 -51 -51 -43 -32 -23 -17 -4 22 58
10149 58 88 102 103 96 90 85 79 70 62 62 71 81 85 85 87 90 92 88 79 71 68 67 67 67 68 71 77 88 102 118 130 131 122 112 107 102 86 61 38 26 23 23 21 21 23 24 22 13 1 -10 -16 -15 -7 1 6
10127 6 6 2 0 0 5 15 32 51 63 65 61 61 67 76 80 76 63 42 15 -10 -28 -31 -20 3 33 58 72 71 62 50 37 29 27 28 25 14 0 -10 -7 8 33 60 85 102 107 96
10108I6k0j4JJ3J1Mkpj6k8l5l0k3j4rj0j0pOK3L4L2K0J0Ljm%OJ3J1QMjqj4j3j0rj1j5j2jJ0
10090a9J8K2K7K6K0R%norj5j8j6rnmmjNLoj2oPJ9K0J8J9J9J3JoKJ5K3K3J1oj6j4kQJ3J3J6
10072A91J3Nqj3j2qqrrj1j3j2rnljKNLLMMok2l3l1j7%J0J5J5J6K0K2J9J4RLjlLJ0Qnk2k9k6
10054G8j9j5j6j4oQK1K3J3ok4l2k4oJ2K0J5M%LOKk%NRPLLORR%j4k3k4j6j1oMK5L9L9K1jj8
10035A07k6k3j3lJlj0j4j1n%NJ2J5K1K9K7J3rj8j3LJ2J4ROJ1J9K2J3NLQJ1O%nj1j5j7j8k4
10018A34l7m7m6l7l0k4j2jLkokMOOQJ1J4J6K2K4K1J1MJkppJJ1J7J7J5J6J0mk3l4l1j3NJ0R
10001C1J1K0K8L1L3L6L3J8%j3j6k1k9l6l5l2l0l2k9k0pOJ7K6K7K2J2kj5k2k3j4KJ7J8Oj3k2
9986a7j5JRJ2J0PN%lJMQJ2J9K1J7J0M%pj3j1KJ1R%ro%QJ8K6L0K8J9OmrlOJ0PMMMmj7k6k6k3
$$ plain form
10108 96 76 62 63 76 87 91 89 82 66 38 3 -27 -50 -64 -73 -83 -93 -100 -94 -71 -37 -5 15 25 28 27 23 23 29 42 53 61 65 64 56 42 29 19 10 -1 -16 -28 -29 -19
10090 -19 -1 21 48 74 94 103 103 98 92 83 68 50 34 25 20 16 12 11 16 19 13 1 -5 2 21 41 59 78 97 110 111 105 107 122 145 168 179 173 157 143 141 149 162 175 191
10072 191 204 209 201 188 176 168 160 151 142 131 118 106 97 92 89 88 90 95 98 101 105 109 103 81 48 17 0 0 10 25 40 56 76 98 117 131 140 143 142 139 142 152 160 155 133 104 78
10054 78 59 44 28 14 8 16 37 60 73 67 43 11 -13 -19 -7 13 28 32 32 35 41 43 41 41 46 55 62 65 68 74 83 92 92 78 55 31 15 4 -2 2 27 66 105 126 125 107
10035 107 81 58 45 42 43 40 30 16 5 0 0 5 17 32 53 82 109 122 113 95 82 85 97 111 120 126 137 156 178 191 196 199 207 218 224 224 219 208 193 176 158 134
10018 134 97 50 4 -33 -63 -87 -99 -100 -97 -99 -105 -107 -103 -97 -91 -83 -72 -58 -42 -20 4 25 36 40 41 39 32 25 26 37 54 71 86 102 112 108 85 51 20 7 12 22 31
10001 31 42 62 90 121 154 190 223 241 241 228 212 191 162 126 91 59 29 -3 -32 -52 -59 -53 -36 -10 17 39 51 49 34 12 -11 -25 -23 -6 12 18 5 -17
9986 -17 -32 -31 -22 -10 0 7 12 12 9 10 14 22 34 53 74 91 101 105 105 98 85 74 76 87 96 96 87 81 81 89 107 133 163 191 210 216 212 203 200 206 216 223 227 231 235 231 214 188 162 139
9966A39j8j3j1qqlKLnj6k1j0NJ2Opj3oMRNlpqmMJ4J9J7J3RPKoj3j4j2pkjmrj0njQJ9K9L1J7
9946A29%j4j3mQRJpqklj5k8l2k3j2KJ4K5K0Lk0k9j9nMNMJ0J8K3J3jj3j5pjLQJ7K7L3K5J1j
9927A40poknj4k7l3k7j0KNNQJ5J3Jj8l3l6l3k2nJ3K4K4K2K1K3K2J7J0QJ1J7K2K6K3J9J6J1
9911B40Kj5k9l1k4j4pkMMjqj3j0nKNKnj2j1ppj0j3qKRPjkQK2K7K4J6J2J6K2K5K2J4M%MQPn
9892B68k0l0k7j8j3j7k7k8k2j6j2pMJ1QJkJMJ0J9K7K6K0J5J5J2Mpj3j1oknj6k4k4j4lKJkn
9875G7qnJOJ0J4J9K1J8Qmj6k3k3j8j4j2j5j4qOK4L7L4J9QOQQQRNjpmJMNMjj6l3m0l1j4JJ2
9856F6J4PknjKlj1j4j0kKJJMRQMJMNLMJ0J1nk8l9l4k3j6j0jNQJ0J2RjjJ3L5M6M1K8J4Mmo%
9836A65MMkpj1j0pmopmNJ6K0J4Mpj1rpj1j7j8pJ2K6K6J6PPJ8K6K6J7Loj1rrj6k8l8l2j7%P
$$ plain form
9966 139 121 108 97 89 81 78 80 83 78 62 41 31 36 48 54 47 34 28 32 41 46 43 36 28 24 28 42 61 78 91 100 107 109 103 90 76 64 57 55 54 50 41 31 26 25 33 52 81 112 129
9946 129 129 115 102 98 106 115 116 109 101 99 96 81 53 21 -2 -14 -12 2 27 47 50 30 1 -18 -23 -19 -14 -10 0 18 41 54 53 40 25 18 17 20 28 45 72 105 130 141 140
9927 140 133 127 125 120 106 79 46 19 9 11 16 21 29 44 57 58 40 7 -29 -62 -84 -89 -76 -52 -28 -6 15 38 60 77 87 95 106 123 145 171 194 213 229 240
9911 240 242 227 198 167 143 129 122 120 124 128 127 119 106 96 91 93 98 100 95 83 72 65 58 48 35 27 29 38 45 44 42 50 72 99 123 139 151 167 189 214 236 250 254 254 258 266 273 268
9892 268 248 218 191 173 160 143 116 88 66 50 38 31 35 46 54 55 53 54 58 68 87 114 140 160 175 190 202 206 199 186 175 169 167 162 146 122 98 84 81 83 84 82 77
9875 77 69 64 65 71 81 95 114 135 153 161 157 141 118 95 77 63 51 36 22 14 20 44 81 115 134 142 148 156 164 172 181 186 185 178 174 175 179 184 188 187 171 138 98 67 53 54 66
9856 66 80 87 85 80 79 81 78 67 53 43 41 43 44 45 49 58 66 70 71 75 80 83 87 97 108 103 75 36 2 -21 -37 -47 -48 -43 -35 -25 -13 -4 -5 -6 7 42 88 129 157 171 175 171 165 165
9836 165 169 173 171 164 153 143 136 132 126 119 115 120 136 156 170 174 167 156 147 140 129 112 94 87 99 125 151 167 174 181 199 225 251 268 271 265 254 245 236 220 192 154 122 105 105 112
9817A12OLKLPJ2J0kj6k8l1k4rJ0J8J1lj4j5rjPOnj8k0pPOrk6l0k1mRJ4J4J3J3J0N%j%NJ2K3
9799D5K9K6K1J8K0J4jj5j7pJMJJ%mj2j7j7rjNQJ0Qjj2j6j5j3j5j3jJ1J2Kj5k5k7k2oJ5K9K8
9781B7J9Lj0j8k1j8j0KJ6K3L1L6L9M1M0L6K5Oj5k7l0l6m4m3l0j5j0j5j2kRJ7K6L4L2K0J1R
9766A46Pmj5j9j8k3l2l6k8j8qjMNOJ1K1K6K8J9Qnj7k4k4j3KJ4J9J2JmkMJ0J5J5J0L%kqj7k1
9748D7j9rkNPMmqmNJ2J6J6J3RPNJlqj2j2j4j5j6j2o%PRJ0QOPOLklMK0K9K6J4LlnomJQJ5K2
9727A78K2J5kj6k3k5k1j6j3j3j5j5j3j0mKRRPRJ4J6J6J5K0J8Kk0l5l4k7j9j2pnnlMJ6J9J2
9711E0KkKJ1J7J8J5PjplPJ3Mj1j7j1jJlpm%MORJ4J6Prk1j9mJ5K9L0K0Nj0k3k8k9k2j0KPOj
9691G4j1k0k3j8rmlqj1qKJ8K3K0J1QJ1J2QNOPOPRJ0QJrj9k4k0j4oljJPJ6K3J9Nj2k4l2l6l5
$$ plain form
9817 112 118 121 123 126 133 145 155 153 137 109 78 54 45 55 73 84 81 67 52 43 42 49 55 50 32 12 5 12 18 9 -17 -47 -68 -72 -63 -49 -35 -22 -9 1 6 6 5 5 10 22 45
9799 45 74 100 121 139 159 173 172 157 140 133 134 138 139 140 140 136 124 107 90 81 80 85 93 103 111 110 98 82 67 54 39 26 25 36 48 50 35 10 -17 -39 -45 -30 -1 27
9781 27 46 49 39 21 0 -18 -28 -26 -10 13 44 80 119 160 200 236 261 267 252 225 195 159 115 72 42 27 17 2 -10 -12 -3 14 40 74 106 126 137 146
9766 146 153 149 134 115 97 74 42 6 -22 -40 -48 -49 -45 -40 -34 -23 -2 24 52 71 79 74 57 33 9 -4 -2 12 31 43 44 40 38 42 52 67 82 92 95 95 93 85 68 47
9748 47 28 19 17 22 29 33 29 21 17 22 34 50 66 79 88 95 100 101 98 90 78 66 52 37 21 9 3 3 10 19 29 37 43 50 56 59 57 54 58 78 107 133 147 150 147 142 136 132 133 141 156 178
9727 178 200 215 213 197 174 149 128 112 99 86 71 56 43 33 29 31 40 49 56 65 79 95 111 126 146 164 166 146 111 77 50 31 19 12 7 2 -1 3 19 38 50
9711 50 52 50 52 63 80 98 113 120 119 112 109 116 129 133 122 105 94 93 94 91 84 80 80 84 90 99 113 129 136 127 106 87 83 98 127 157 177 182 172 149 121 92 70 60 62 69 75 74
9691 74 63 43 20 2 -7 -11 -14 -22 -33 -41 -39 -21 2 22 33 41 52 64 72 77 83 90 96 103 112 122 130 131 122 103 79 59 45 39 36 35 36 43 59 82 101 106 94 70 38 2 -33
9672c3k6j0KJ0J5J3NlmJQJ6K6L6L4J8NJLKLPJ4J6Ppj8k3k4k1k1j9j2mOJ4K6L5L9L2J8Nqk6
9655A58l8l8k8j3lMRPMkonJJ1J7J3Koj0j1j2j1j0oLJ9K9K5J0jLJ2J4Pklmnppnmrj6k0j4lQ
9636E7J3J4J5RjqnRK1K2Pj1k3k5j9j0ljnqoLJ2K0K5K5J8Lj2k0j8j2ojjklklj0j4nRJ6J1NO
9617H6J6K3K2J2kj5j9k0k3k6k1j2ljjnj0j6j8qRK0J7J0jpo%PRQPJ2K2K9K8J4nj6j9j8k1k6
9599C2k8k3k0j0OK5L4L0J6KljRJ9K5K0QkkLLrk3k4rQJ1NJRJ9K3K6K8K4Jl0n1m3j5J2K5K7K9
9582A87L0K6J8J0Kpj8k1j6nOJ0RNjrj9l0l7l3k6k4k5k4j5qlKJ3K2J9Jj6k0j1kKKKMPRQRJ2
9564D5J2Nrj9k3j9j6j2rnmoj4k1k0pJ5L3L9L5K8J9J1PRJ0OKNJ4J5Rjmqj5k1j9qOJ9K8L2K7
9546A71J0j2l3m4m6l5j7mJJNJ0J3QKmolKOLmnKJ0J0NlprqjRJ5J3Okrj5k1k2j6lJ3J8J5%j3
$$ plain form
9672 -33 -59 -69 -67 -57 -42 -29 -24 -27 -31 -30 -22 -6 20 56 90 108 113 114 117 119 122 129 143 159 166 159 141 118 94 73 52 33 21 17 23 37 63 98 137 169 187 192 184 158
9655 158 120 82 54 41 38 42 51 58 62 60 54 49 50 61 78 91 93 87 77 66 54 43 33 27 30 49 78 103 113 112 115 127 141 148 146 143 139 134 127 120 115 111 102 86 66 52 49 57
9636 57 70 84 99 108 107 99 94 103 124 146 153 142 119 94 75 65 62 61 56 48 42 45 57 77 102 127 145 148 136 116 98 86 80 79 78 76 73 71 68 58 44 39 48 64 75 80 86
9617 86 102 125 147 159 157 142 123 103 80 54 33 21 18 17 16 11 1 -15 -33 -41 -32 -12 5 15 14 7 1 1 8 17 25 32 44 66 95 123 137 132 116 97 79 58 32
9599 32 4 -19 -39 -49 -43 -18 16 46 62 64 61 60 69 88 113 133 141 139 137 140 143 134 111 87 78 86 97 102 103 112 131 154 180 208 232 233 203 152 109 94 106 131 158 187
9582 187 217 243 261 271 273 266 248 227 211 206 212 222 231 236 235 226 207 177 140 107 81 57 32 8 -7 -15 -18 -16 -3 19 38 39 23 3 -8 -10 -8 -6 -4 0 7 16 24 33 45
9564 45 57 62 53 34 11 -8 -24 -36 -45 -50 -54 -60 -74 -95 -115 -122 -107 -74 -35 0 28 47 58 65 74 84 90 92 97 111 126 135 134 130 122 107 86 67 59 65 84 112 144 171
9546 171 181 169 136 92 46 11 -6 -10 -9 -8 -3 7 20 28 30 26 20 17 19 25 28 24 19 21 31 41 46 43 36 27 19 18 27 42 55 61 59 50 35 14 -8 -24 -27 -14 4 19 19 6
9527Fj6j1JPLrk1k2j3MJ7K2J7J1J1K3L0K1Omoj0k0k5k3k0j8j6rMJ4K2K6K9K9K6K1J2Jj1k1
9510H8k4k1j6pKJ1J5J2Krj6j9j8qQK7L7L1J9QkqoLJ3J4Olqj3j2pJLmj3j4oPJ7K5K2Pj2k4k7
9492H1k2k0j6j2j0j2j1kJ3K3K4K4K6K9K8J8jk2l7l7k1jRRKoj6k0j8pjNRJ6K3K7L0K6J6Kj1
9475A37k1k7l2l0k0rJOJ5J9K6L3L5K7Rqj6j9k4k5j6mJmj0j3j8k0k1j0kJJMO%ooJQQPQJ2J2
9457A6OJMRQjqlNRJ0J2J3Lj4k3j7lMJk%L%oj5k0j8pRK0J7QKMJ5K5K6J9RLOJ6K5K5J4Kpj6k4
9437A65k8k2j5j2j1r%MMMJ1J8J5Lj1j4j3j0j1oOK1K8K5Qj2k8l6l2j5OK0K4J5OK%lpj1j3j6
9420E0k0j9j0RK4K5J6J1J7K3K3J5J2J4J3PKJkj2k3k7k1j4rmlnj0j1mMJ2J8K4K1Pj1j9j8j3
9404I3j3j3roqj4k0k2k8l2k9j5NJ7K1K1K4K7K5J8Kj2j8j8j7j6j4qmjllJRJ9L0L6L6K7J8J8
$$ plain form
9527 6 -10 -21 -20 -13 -10 -19 -40 -62 -75 -71 -54 -32 -15 -4 7 30 60 81 87 83 77 67 47 22 -1 -21 -39 -55 -64 -60 -46 -24 2 31 60 86 107 119 120 109 88
9510 88 64 43 27 20 22 33 48 60 62 53 37 18 0 -8 0 27 64 95 114 122 120 112 106 109 122 136 142 139 131 118 106 99 100 103 99 86 72 66 73 90 115 137 144 132 108 81
9492 81 59 39 23 11 1 -11 -22 -24 -11 12 36 60 86 115 143 161 160 138 101 64 43 42 51 60 62 56 40 20 2 -5 -6 -1 8 24 47 74 104 130 146 148 137
9475 137 116 89 57 27 7 -2 -1 5 20 39 65 98 133 160 169 161 145 126 102 77 61 57 58 54 44 31 13 -7 -28 -38 -40 -39 -38 -34 -28 -28 -34 -40 -39 -31 -23 -16 -8 4 16
9457 16 22 23 27 36 44 43 35 32 37 46 56 68 81 84 70 47 30 27 31 32 30 30 33 33 27 12 -8 -26 -33 -24 -4 13 21 23 27 42 67 93 112 121 124 130 146 171 196 210 212 205 189 165
9437 165 137 115 100 88 77 68 68 72 76 80 91 109 124 127 116 102 89 79 68 62 68 89 117 142 150 138 110 74 42 27 33 53 77 92 98 100 100 97 90 79 66 50
9420 50 30 11 1 10 34 59 75 86 103 126 149 164 176 190 203 210 212 213 211 199 176 149 128 114 105 101 98 93 83 72 68 72 84 102 126 147 154 143 124 106 93
9404 93 80 67 58 52 44 30 10 -12 -40 -72 -101 -116 -111 -94 -73 -52 -28 -1 24 42 44 32 14 -4 -21 -37 -51 -59 -63 -64 -67 -70 -69 -60 -41 -11 25 61 88 106 124
9387A24K2L0L1K9K0J0K%LOLlkKNKkjkj4l1m1l6k0j0j2k0j9rNJ6J9K1K1J6Q%JONnj8k3k2j5
9369A02j0qrj6k3k2j0MJ0NlkQJ9K2J7J1O%nmOJ8J5kj9k0j0KJ0J7K5K9K1PlonJMPPJoj2j5j2
9350A52j0pokOJ0QOLJoj8k4k0qJLkpj0pKJ4K9L9L7K5Pmrj0rqopj0j2qnmokJ0K4K9K4J4jj6
9331B00k4k5k1j9j7j7j7j9k1k2k3j9qJJoj6j8j7j6j1%PNLOJ3J0mj7j6oMJ6K5L4M2M4M0K4%
9314I6j9k4j1MJ3J3J0RRLpj1oQK0K4K2J4Jj1j6j0LROlj4j5r%LOJ0J4Rpk0k2j4plkkmjNJ0J1
9295I4RPPMkj1j8k3k0j2JRJ2Pnj9k9l0k4j3mJKKJ2K4K7K1RKNJ0J5J2Mpj1rnqj5j7qNJ6K1K3
9276G1K1J5P%kJKKJjkmpj1j6k0k6k8k3j7oNJ6K2J9J1Mkrj8k2j5JJ5K1K3K2J9J1Krj5j7j0K
9258C3J8K6K3J1oj2rNJ4J6J0MQJ5J9J2kj4k0j9j3qj3k4l2k9j7oOJ8L3L6K6J1lqpnnoj0j4j3
$$ plain form
9387 124 146 176 207 236 256 266 268 268 271 277 280 277 275 277 282 284 282 281 279 265 234 193 157 137 127 115 95 76 67 72 88 107 128 149 165 173 173 174 180 185 180 162 139 117 102
9369 102 92 84 75 59 36 14 4 8 18 23 20 18 26 45 67 84 95 101 101 96 92 98 116 131 129 110 90 80 82 92 109 134 163 184 191 188 182 177 178 182 189 196 197 191 179 164 152
9350 152 142 135 129 127 133 143 151 157 160 161 155 137 113 93 85 86 89 87 80 70 63 65 79 108 147 184 209 216 212 203 193 184 176 170 163 153 141 133 128 124 118 116 126 150 179 203 217 216 200
9331 200 176 151 130 111 94 77 60 41 20 -2 -25 -44 -52 -51 -50 -56 -72 -90 -107 -123 -134 -134 -127 -122 -119 -113 -100 -90 -94 -111 -127 -133 -129 -113 -88 -54 -12 32 72 96 96
9314 96 77 53 42 46 59 72 82 91 100 103 96 85 79 87 107 131 153 167 168 157 141 131 134 143 149 146 132 117 108 108 111 117 127 141 150 143 123 101 87 80 77 75 73 69 68 73 83 94
9295 94 103 110 117 121 119 108 90 67 47 35 36 45 57 64 59 40 11 -19 -43 -56 -60 -59 -57 -55 -43 -19 8 29 38 40 45 55 70 82 86 79 68 59 54 46 31 14 6 11 27 48 71
9276 71 92 107 114 114 112 113 115 117 118 117 115 111 104 93 77 57 31 3 -20 -37 -43 -38 -22 0 19 30 34 32 23 5 -17 -32 -31 -16 5 28 50 69 80 82 73 58 41 31 33
9258 33 51 77 100 111 105 93 84 89 103 119 129 133 141 156 175 187 185 171 151 132 119 111 98 74 42 13 -4 -10 -4 14 47 83 109 120 117 109 102 97 92 86 76 62 49
9241D9j2pmljMJ7K6K6J7J2J6K2K4K2J7Oj0j8j7j5j6j9j3lMQJ0J1RLmmMJ3J6Qmnkmj5k0j0L
9223A41Jj1j9j2nmnjNNMJ0K1L2M0M1L7K5J1lj0j4j3j1j1j6k3k2j6qljmj2k0k1j9j4j0okkk
9205E3MJ7K6K3Qnj2j5k0k2k1j7rLJ0RkqpjKNJ1J6J6J2J6K3K4J3%nj%oj4j9j7mJ3K5K0RMJ2
9187A69K1K2J5Ppk2l5l7l2k1j1mJNJ2J6J6RLLQJ4J3Ojm%Ljqj2p%OQQKqj0LK1K9K2Q%k%lpj0
9167B08j0qnJPJ1J0Kpj0j1j0pKJ2J7J1Jj1j7j4pLO%j4k6k8j8lMKmpljmmLJ1J1kk2l6l4j9J
9148a9J5J8J9J9K2K5K6K5J8Kj6k7k6k5l1l7k6kK3L4K9J9J1Lkrj6k2j8kJ0J0KMJ8K8K1Omqj0
9132A07rmmj3j9j0J4L2L2J5lj2pOJ6J8QjnJJ0J8J8J1jj3k7l9l9k2%J6J8J6J2Lj5k5k6k0k1
9116C6k7k6j5MK1K6K0RNJ6K7L0J4qk4k3rMPkj3k1k4k1pJ3K8L0K4J6J1Mlmlmpp%RJ7K0J8J0
$$ plain form
9241 49 37 30 26 23 22 26 43 69 95 112 124 140 162 186 208 225 231 221 203 186 171 155 136 123 120 124 132 142 153 162 165 161 157 161 174 190 198 194 189 187 183 168 148 138 141
9223 141 142 131 112 100 95 91 86 85 90 95 99 109 130 162 202 243 280 305 316 313 303 289 276 265 254 238 215 193 177 169 166 165 161 149 129 108 89 75 65 59 57 55 53
9205 53 57 74 100 123 131 126 114 99 79 57 36 19 10 13 23 32 30 22 15 14 16 21 32 48 64 76 92 115 139 152 152 147 146 146 140 126 107 90 86 99 124 144 153 157 169
9187 169 190 212 227 234 227 205 170 133 101 80 69 65 66 71 83 99 115 124 127 130 138 152 165 171 170 166 166 169 168 160 148 141 141 147 155 163 165 157 147 150 171 200 222 230 230 228 228 225 218 208
9167 208 198 190 185 186 193 204 214 216 209 199 188 178 171 173 185 202 213 214 203 186 172 165 168 174 174 160 134 106 88 85 89 91 87 80 77 76 72 68 71 82 93 91 69 33 -1 -20 -19
9148 -19 -4 14 33 52 74 99 125 150 168 170 154 127 101 76 45 8 -18 -20 3 37 66 85 96 99 97 88 72 50 32 30 40 50 52 56 74 102 123 129 125 117 107
9132 107 98 94 90 77 58 48 62 94 126 141 138 126 119 125 141 159 167 166 161 162 172 190 208 219 218 205 178 139 100 78 78 94 112 128 140 143 128 103 77 57 36
9116 36 9 -17 -32 -28 -7 19 39 48 53 69 96 126 140 132 108 85 76 80 87 85 72 51 27 6 -1 12 40 70 94 110 121 125 122 118 115 111 104 97 97 106 123 143 161 171
9098A71lj6k7l6m0l6k5k0j8j2QL2M5M2L2K3K0J4Kj0j4mRJ5Opj5j4qnonk%jopjOOmj8k1j3L
9080D0J2QJ%NRJ0J0J4J6Rmj4j9k6l0k7j3MK0L1L7L3J4rk6l1k8j8nJ0K1K4K0J2jj2j7j0LJ2
9063H5J4RKoj3j4pMPOPJ3J4Mj4k3j7kJ1J6J7J7J7J7J4P%j0j8k0j6oNJ3J3Nqk0k4j7p%jlpq
9045E6pjNNJNJ5K0J3ONJ2J7J3J1J3J2OmrmKLJ%lnj1j6j9k1j5pKOJlnlkpj2j1oJLKKLKjonN
9023F5J7K5K1Rlj7k5l0k6j9j5j8k3j9mJ6K8L4M1N0N5M5K0pj9j7j0ommmnj2k3l2l1j4J0L0L4
9007A13K2Lj0j4rMJ6K3J7Kj5k8l3k9j7%J5K0J5Nj1k9m7n1m2k0jJ2J4QjjRK1J6lj9j9nJ0J5
8991d4J5K0K6L2K8J2oj6j2KJ5J9J8J6K0K6K3J0oj6j7j5j4j6j9j9j3%J0J8J8J6J3PJJMJ1J1
8975A79PLJJloj1j2j1j0nlKOQOjj3k1k5k1j4q%OOJnnOJ6K0J2%pnJLMMQQNK%%nj1j3rn%RK0
$$ plain form
9098 171 168 152 125 89 49 13 -12 -32 -50 -62 -54 -22 23 65 97 120 140 154 156 146 132 128 137 152 158 151 136 122 114 109 103 98 96 96 95 89 82 81 87 93 89 71 50 37 40
9080 40 52 60 61 61 66 75 85 95 109 125 134 130 116 97 71 41 14 1 5 25 56 93 126 140 131 105 74 46 28 23 33 54 78 98 110 109 97 80 70 73 85
9063 85 99 108 110 104 91 77 70 74 81 87 94 107 121 125 111 88 71 69 80 96 113 130 147 164 178 185 185 175 157 137 121 115 120 133 146 151 143 123 99 82 75 75 74 71 64 56
9045 56 49 48 53 58 59 64 79 99 112 118 123 135 152 165 176 189 201 207 203 194 190 192 195 196 196 193 188 177 161 142 121 106 99 101 107 108 105 100 97 95 88 76 65 59 60 63 65 67 70 72 71 65 60 65
9023 65 82 107 128 137 134 117 92 62 36 17 2 -16 -39 -58 -62 -46 -18 16 57 107 162 207 227 220 201 184 174 168 164 160 156 151 139 116 84 53 39 49 79 113
9007 113 135 138 128 114 105 109 125 148 165 167 152 124 91 62 45 45 60 80 95 100 89 60 13 -38 -80 -100 -101 -89 -75 -67 -68 -69 -60 -39 -23 -26 -45 -64 -69 -59 -44
8991 -44 -29 -9 17 49 77 89 83 67 55 57 72 91 109 125 145 171 194 204 198 182 165 150 136 120 101 82 69 69 79 97 115 131 144 151 152 153 157 168 179
8975 179 186 189 190 191 188 182 171 159 148 138 133 130 132 138 146 152 151 138 117 92 71 57 49 49 55 61 62 57 52 58 74 94 106 106 99 94 95 98 102 106 114 122 127 129 129 129 124 113 100 91 86 86 95 115
8953A15K6J9Mopqj5j8j4lKkrj5j3pkJjnm%OQRJ0J0PMLNPQJ2J1Lj1k2k3j2jQJ0QJmlLL%mkO
8932I8J2J3RJqj5j5rNJ7J8Nj4k5j7kMjj4k4k5j3JJ7K2J8J1Loj4j1NK3L2K6J1JLJ2J9J3%rp
8914A70KNkj6l0l2k3qMQRQPNKKNOMkpr%J8L6M1L3J7OKKKJqk0k7k8k1j2jRJ5J1KKJ0J7J3kj5
8894B11k1j8j4j5j8j9j7j4j5k1k7k9k1%K4L4K9J4MMJ0RNkqj3j4j6j5j3oJ0K5L3K7J1lpKJ5
8878A21K6K7K4K1J6J3J0Lrk4l4l6l9m1l7j5RJ8Poj2qjMQRRRPOJKOJ1PjlLJ0RNjkKJ1K1K4K0
8859B10Nj1k6l1l0k3j4mRK1L0L1K1NpoKROmj3j6j1mNRMrk1k3j4JJ4J8J4Krj2rnpnJRJ2RMO
8840A43PQNMNOQJ2J4Rmj8k5k4k0j3kRJ4Oqj4rMQLnj1j1j1j3j4qkKJlpj1j3j1njmj1j6j4j3
8820e3j6k1k0j1LJ6K7L5L9L8L3K3J1jrj3j3qkRJ7J6Lj1j2KK1K6J6L%J3K6K6J2rk0j8rqj2j6
$$ plain form
8953 115 141 160 164 158 151 143 128 110 96 93 95 93 84 69 56 49 47 48 47 42 38 38 44 52 61 71 81 88 92 95 100 107 115 127 138 141 130 108 85 73 72 80 90 98 99 95 92 95 98 98 94 92 98
8932 98 110 123 132 133 125 110 95 86 91 108 126 131 117 92 75 73 77 76 62 38 13 0 1 18 40 58 69 72 66 52 41 46 69 101 127 138 139 142 154 173 186 186 177 170
8914 170 172 177 175 159 129 97 74 66 70 78 87 95 102 107 109 111 116 122 126 124 117 108 108 126 162 203 236 253 259 261 263 265 266 258 238 211 183 162 150 149 158 173 184 186 188 198 215 228 226 211
8894 211 190 172 158 143 125 106 89 75 60 39 12 -17 -38 -38 -14 20 49 63 67 71 81 90 95 93 85 72 58 42 27 14 8 18 43 76 103 114 111 104 106 121
8878 121 147 174 198 219 235 248 258 261 252 228 194 158 119 78 41 26 35 53 60 54 42 34 33 37 45 54 63 72 79 85 86 88 94 105 112 111 108 111 121 130 135 134 132 134 145 166 190 210
8859 210 215 204 178 147 117 94 80 76 85 106 136 167 188 193 186 180 182 191 197 193 180 164 153 149 154 163 167 158 137 114 100 101 115 133 147 149 140 128 119 114 107 102 103 112 124 133 137 143
8840 143 150 158 163 167 172 178 186 198 212 221 217 199 174 150 130 117 115 124 138 144 136 122 113 117 125 128 123 112 101 90 77 63 55 53 55 56 53 46 35 22 11 6 5 1 -10 -26 -40 -53
8820 -53 -69 -90 -110 -121 -118 -102 -75 -40 -1 37 70 93 104 103 94 81 68 60 58 67 84 100 103 92 80 82 103 129 145 148 148 161 187 213 225 216 196 178 169 161 149 133
8804A33j3nMPRRPNNJ1J4Ppk1k5k2j8j5j1nJL%monjJ%%LPRJ0J0Plj1rKRJ1J2J9K5K3J8J7J9
8784B36J8Rlj7l3m5m8m3l7k9j8o%MQJ0OmrqJPQRPNNMJLJ3K5K9K0QMKpj7k0j2nk%NPOkj3k4
8764E8k9k4j1%PJ2J6J6K0K2K0J1KjKjj1j6j2m%LQJ1Jj7k7k3j6j0nKJ3J4NmlQJ8J7Qlj1j3o
8746D7PK0K1J3J0J5K1J8J0JjmolKOKoj2j5j4j0mJOJ1J6J6J1Moj5k6l2k7j6ooj0j1oLPQQRJ0
8727F7J2J7K2K4K2J6Nj0k9l9l2j5mnrmQJ9K6K8K8K1J0%nnpj0j4j3j2j2j5j9j8j2pj0j6j7j0
8710b4NJ7K1K0J7J7K1K7K9K4J2ok4l3l0k1j1nkoj4j9j7j1okKJ3K5L2K7J4LljNKj5l2l2j0J5
8694B4K7J9PNOQJ0J9L3M0L0Rqj3j4j6k3k3j7pNJ5K0J7Mj6l6m2l3j2MPMJLJooMJ3J4J2J2J2
8676A13Qjppnrj4j7j1kMLknMJ4J1pk4l3k4pJ8M1M4K9J2NNKqj7j5j0ppnjOJ2J5J5Ooj4j4mP
$$ plain form
8804 133 120 115 119 126 135 144 151 156 161 172 186 193 186 165 140 118 100 85 74 69 70 73 73 69 63 58 57 58 58 58 61 68 77 87 97 104 101 90 81 83 92 103 115 134 159 182 200 217 236
8784 236 254 263 260 243 210 165 117 74 37 8 -10 -16 -16 -12 -4 6 12 8 -1 -9 -8 -1 7 16 23 28 33 37 38 41 54 79 108 128 136 140 142 135 118 98 86 81 79 79 84 91 97 95 82 58
8764 58 29 5 -6 -6 1 13 29 45 65 87 107 118 120 119 121 120 109 93 81 77 77 80 88 99 100 83 56 33 17 7 2 4 17 31 36 32 29 37 55 72 80 77 66 53 47
8746 47 54 74 95 108 118 133 154 172 182 183 182 178 172 169 171 177 179 173 161 146 132 122 118 119 125 136 152 168 179 183 177 162 136 104 77 61 55 49 39 28 22 25 32 40 48 57 67
8727 67 79 96 118 142 164 180 185 175 146 107 75 60 56 51 42 38 46 65 91 119 147 168 178 178 173 168 161 151 137 124 112 100 85 66 48 36 29 19 3 -14 -24
8710 -24 -19 -2 19 39 56 73 94 121 150 174 186 180 156 123 93 72 61 56 54 48 34 15 -2 -13 -19 -21 -19 -6 19 51 78 92 95 92 91 96 98 83 51 19 9 24
8694 24 51 70 77 82 88 96 106 125 158 198 228 237 229 216 202 186 163 140 123 116 121 136 156 173 177 161 125 83 50 38 42 49 53 54 57 58 52 46 50 63 77 89 101 113
8676 113 121 120 113 106 101 92 78 61 50 48 52 55 53 48 52 66 77 70 46 13 -11 -18 0 41 85 114 126 131 136 138 130 113 98 88 81 74 69 68 74 86 101 116 122 116 102 88 84 91
8657I1J2J1M%j%jmqj1rkNJ0J0J3J2Onk0l2l6k6oJ6K7K5K0J5Q%pqlNJ6K3K0Qpj5j8j9j8j6r
8638G6kQJ4J5J2LloqqJJ3J8J3KjKORJ1J2J4Rjj5k5l1l3l5l5l1k0kJ8L1L2K1RMOQJ2J7J8J2
8620A70jpkNNpk0k8k6j8pOJ4J6J1LkJPJ0RJ0J1J2ROLJmj0j3j3j1o%Lkj0j8k5k7k3j0MJ6K1
8602F3K0J9K0K1K2J7Pmj7k6l0k5j6plJQJ8K9L6L2J4nj6j1lK%nj3k2j8nJ0J3Mrj7k2k4k1j4
8585B3olJOJ1J2Pjm%QJ9K2K0J1%qnPK1K9K5J6Kj1k4l2l6l3k3j1npj1j0plKJ2J9K0J6QLmqp
8566F1k%KNJ4K2K4J8Rkj2qMJ4J2%pj1j0rolllnpj0j2j0p%J2K6L6L1J5kj3j9k2k3k3k0j7pL
8547C5J4K0K3K1J3Mnj6k6k8j6OK3K8K5J4LonKQMnj7k6k4pJ4K6K4J2Kqj6j9j3mNQOJpqpqj2
8529E8j3lQRlqJJ4J6Nj2j9j6mQJ3J4J2J0Kj0j7k0k0k1k2k5k4k2j6j0mLJ6L4M8M6K9Oj3k0k3
$$ plain form
8657 91 103 114 118 118 117 117 116 112 104 93 84 82 87 97 107 120 132 138 133 113 81 45 19 13 29 56 81 101 116 124 124 117 109 106 111 127 150 170 178 171 156 138 119 101 85 76
8638 76 74 82 96 111 123 126 123 117 109 101 102 115 133 146 148 147 149 155 164 175 187 201 210 209 194 169 138 105 70 35 4 -16 -18 0 31 63 84 93 97 103 111 123 140 158 170
8620 170 169 162 160 165 170 163 143 115 89 71 64 70 84 100 111 114 112 113 120 130 139 149 160 172 181 187 190 191 187 177 164 151 140 134 134 137 135 125 107 82 55 32 22 26 42 63
8602 63 83 102 122 143 165 182 189 185 168 142 112 87 71 64 61 62 70 88 117 153 185 199 194 178 167 164 166 166 161 148 126 108 103 113 126 130 121 104 82 58 37 23
8585 23 17 14 15 21 32 44 51 50 46 46 54 73 95 115 126 126 118 113 120 141 170 195 211 213 202 178 146 110 77 54 43 38 31 20 10 3 0 2 14 33 53 69 77 80 76 68 61
8566 61 59 59 61 66 80 102 126 144 153 151 139 131 135 149 161 161 154 143 133 124 118 115 112 109 104 97 87 75 65 58 58 70 96 132 163 178 176 163 144 122 99 76 56 39 32 35
8547 35 49 69 92 113 126 130 125 109 83 55 39 45 68 96 121 135 138 132 127 129 137 141 136 119 93 69 62 76 102 126 138 140 132 116 97 84 80 85 93 99 100 93 85 78 70 58
8529 58 45 42 50 59 56 48 49 63 79 84 72 53 37 33 41 54 68 80 90 92 82 65 45 25 4 -18 -43 -67 -89 -105 -115 -119 -116 -100 -66 -18 28 57 63 50 30 7
8512Gk5l0l2k5j0OJ6J8J8K1K2K3K0J5P%lkkpj8k1j0J2L0L1K0Noj4k2k9l0k3rOJ6K0K2K3J4
8496E4pl1m0l3j2NJ3J0jqnNJ5K1K3K5K2Qqj7j1kOJ0J2Pj0l0m0l1pJ5K5K3J5NnrlNPMPK0L7
8477H9M2L0Rj4k5k3j3lJkj0k1k7j9JJ5J6J1J4K4K9K6J7J0Mj1l0l9l5k1lRJ7J6J2J1J5K4K9
8462A75K7K0Nrj6j7j4o%Lkj5k7l0k8j9j0NJ9K4K2J6Ooj5j5oOJ3J2Mj1k4k2j0LKqj5j0MJ4J9
8445F4J9J9K0J5Mj3k4k1j2oj0j9k7k9j9OK8L0J3pj0OK6L6L1J9J0MJlpj1j8k5l0k4j1LPMmr
8428B6j2j2j1j4rJJ2J6J2J2J6J8K0J8J5PjjNJ1RLkj0j8j5OL2L8K0%rpqj1j6j6j2kOROjlnq
8409A15j1j4j5j4j0onnpoqj1j1rojKKJkmoqlJ0K0K2J8J6K0K2J1jokLNPOJj0k2k5k6k3j9j1
8390b6jQJ4J5J5J6J6J6J5J1PQJ4K1K4J8QLJ0J7J5Jj7k8l0k8k3j9j2nNJ9L0L2K1Kj4k1j6pj
$$ plain form
8512 7 -18 -48 -80 -105 -115 -109 -93 -75 -57 -36 -14 9 29 44 51 51 48 46 44 37 19 -2 -12 0 30 61 81 86 80 66 44 15 -15 -38 -47 -41 -25 -5 17 40 54
8496 54 47 16 -24 -57 -69 -64 -51 -41 -42 -50 -55 -50 -35 -14 9 34 56 64 56 39 28 26 32 42 54 61 51 21 -19 -50 -57 -42 -17 6 21 26 21 12 9 14 21 25 32 52 89
8477 89 131 161 170 156 131 108 95 92 93 91 81 60 33 14 15 30 46 57 71 95 124 150 167 177 181 170 140 101 66 45 42 51 68 84 96 107 122 146 175
8462 175 202 222 227 218 202 185 171 165 165 168 166 151 124 94 66 47 37 42 61 85 107 123 129 123 108 93 87 93 106 118 122 111 87 65 55 58 60 52 37 27 31 45 64
8445 64 83 102 122 137 141 128 104 83 71 65 55 36 9 -20 -39 -33 -5 25 38 31 21 27 53 89 120 139 149 153 154 151 144 133 115 90 60 36 25 28 35 39 35 26
8428 26 14 2 -9 -23 -32 -31 -19 -3 9 21 37 55 75 93 108 115 114 113 118 129 138 141 139 129 111 96 102 134 172 192 192 183 176 168 157 141 125 113 111 117 126 132 131 128 123 115
8409 115 104 90 75 61 51 45 40 35 28 22 14 3 -8 -17 -23 -24 -22 -20 -19 -21 -25 -31 -39 -42 -32 -12 10 28 44 64 86 97 96 90 88 91 96 103 109 110 100 78 53 27 4 -15 -26
8390 -26 -27 -19 -5 10 25 41 57 73 88 99 106 114 128 149 173 191 199 202 212 229 244 245 228 200 170 142 119 100 88 83 88 107 137 169 190 192 178 157 141 134 133
8374A33lj4k3k3j1NJ8K1J4jj4j7j5j1j2rmLRJ0Omj9l1k9k0oJPJ5K0K1J7Plj1qNK0K8K2Rjm
8356I8%LjpoMJ2J0%pokLPPMoj4j4JJ7J8Mj2j7qjkj0j9j9j5pkknjORPQJ2J2%j5k3j7mNRNmr
8335FmJ3K7L0K7K6K8K9K0Kj9l5m6m9m9m1k6oJ2J8J9J8J8J8J7K2L0L6K6Ppj0nnj0j8k4k7k8
8319D0k3j2mnj0j3j0mLJ3K1K1J6RPMlqj2j2rnJ%oj5j6j2rj0j5j3nOJ5J9K1K5K6K6K0J4OJk
8301H1lmqj1j2ojMNQOlj3j2nK%pj1q%J2K3K5K0J0%llnpmjJJMQNmj4j1%Mmj2j3nNJ2J3Ompm
8280E0mj0j3mQROJ1K2K2Nj2j5qnn%J0J9K2K0J6QOJ0J8J6Lj4k2k3j9j3lNQMLLOOLKkrj7j6p
8260A00J%lkMQQMjoqo%LMPJ7K5K7J8J1O%j2k5k6j7ppj0qprj1pJJor%J2Rqj9j7rqj6k2k4j6
8240f0mJlj3j7j2mOJ5K7L1K5J4P%rj3qQK0J9Poj3j4j0qlLJ3K3L4L7L1K3J6J0Jj0j1nmj8l8
$$ plain form
8374 133 130 116 93 70 59 64 82 103 117 116 102 85 70 59 47 38 34 37 46 56 62 58 39 8 -21 -41 -47 -46 -39 -24 -4 17 34 41 38 27 19 24 44 72 94 103 102 98
8356 98 98 101 100 93 87 91 103 113 113 106 100 98 101 108 115 119 113 99 85 86 103 121 125 113 96 88 87 85 75 56 37 22 15 13 11 6 5 11 20 27 35 47 59 59 44 21 4 0 5 14 19 15 6
8335 6 2 15 42 72 99 125 153 182 202 204 185 150 104 55 6 -35 -61 -67 -55 -37 -18 0 18 36 53 75 105 141 167 174 167 157 152 147 137 119 95 68 40
8319 40 17 5 1 -4 -14 -27 -37 -41 -38 -25 -4 17 33 42 49 53 50 42 30 18 9 4 5 5 -1 -16 -32 -44 -53 -63 -78 -91 -96 -90 -75 -56 -35 -10 16 42 62 76 82 83 81
8301 81 78 74 66 55 43 37 36 40 45 53 59 56 43 31 26 28 28 21 10 2 2 14 37 62 82 92 92 89 86 81 74 70 69 70 71 75 83 88 84 70 59 59 63 59 47 34 29 34 46 59 65 61 54 50
8280 50 46 36 23 19 27 36 42 53 75 97 102 90 75 67 62 57 57 67 86 108 128 144 152 158 168 186 202 205 191 169 146 127 114 111 116 124 128 131 134 140 146 149 151 149 140 123 107 100
8260 100 101 101 98 96 100 108 116 120 119 113 105 99 99 102 106 113 130 155 182 200 211 217 217 205 180 154 137 130 123 113 105 98 89 78 71 72 73 67 58 58 70 79 71 52 35 26 18 2 -20 -44 -60
8240 -60 -64 -63 -66 -79 -96 -108 -112 -106 -91 -64 -33 -8 6 13 13 4 -9 -17 -9 11 30 37 31 18 4 -6 -14 -17 -14 -1 22 56 93 124 147 163 173 174 164 153 148 144 126 88
8222H8m7l6j5mlnonKJ2K2K8K4J9J5Pkrj0j0j5k3k4j8j0lQK0L1L4L0K7K3J8Pnj6k2k5k2j2k
8205F6Kkj2j7j8j2nJJjkj%KJ1K2K5J6jj3j4pPK1K8J6pk4k4j7rjJ1K2J9Mj3j5pLPNLLQRPlj2
8186H2j3qLJ0J2RKnpKJ5J8Nj1k1k1j5pKJ1J2J1RNmj1j0LJ2QlpjPJ1J1J0Kpj3j1JJ5K4K3J6
8167A76J0OJonNJ7J5lk3l2l3l2k9k2oJ3K6K6J3nk0l2m3m9m5l2j7qkPJ7K5K7K2J4MKQJ8K9L2
8150F9L1L0K7J8Onj3j6j7k0k1k0j6j0KK1L5L5J5mj5j5j7j9j7oORMkjOJ2J2Nnrok%NJ4K4K8
8133A58K2Rlj7l2m1m1l4l2l4l3k2mJ1J9K0J9J5J0RRJ4J6J1Lj0j9k2j6j0mpj3j5kJ5K5K1J5
8117A0K3L5L8K4Lk0m3n7n5m0j9jJ4K9L8L5K7J2mj4j4%J5J9J6J4J5J3Ojmnpj0j0j1j2j2pKJ3
8100E5K3K4J3%nLJ7J9J0nj8k7k6j5nnj0j4j3j2j1j1rmNJ8K8K9J8NnplQK2K4J4jj0qjNPPNl
$$ plain form
8222 88 41 5 -10 -14 -17 -22 -28 -33 -31 -19 3 31 55 74 89 96 94 85 75 65 50 27 3 -15 -25 -28 -20 0 31 65 95 122 145 163 170 165 149 127 102 80 68 66
8205 66 68 66 54 37 19 7 2 3 4 3 1 0 0 2 13 35 60 76 75 62 48 41 48 69 97 113 106 82 58 41 32 31 42 64 83 87 74 59 52 55 62 67 70 73 81 90 97 94 82
8186 82 69 61 64 74 86 95 97 92 85 87 102 120 125 114 93 72 57 50 52 63 75 86 95 100 96 85 75 78 90 98 95 88 87 94 105 116 126 128 121 108 97 98 113 137 160 176
8167 176 186 192 193 187 182 187 204 219 216 193 161 128 96 67 45 39 52 78 104 117 112 92 60 17 -32 -77 -109 -126 -134 -136 -129 -112 -87 -60 -38 -24 -20 -18 -10 8 37 69
8150 69 100 130 157 175 181 176 163 147 130 110 89 69 53 43 45 66 101 136 151 147 132 117 100 81 64 58 64 73 77 75 74 80 92 104 109 104 95 89 87 87 92 106 130 158
8133 158 180 189 186 169 137 96 55 21 -11 -45 -78 -100 -104 -93 -74 -54 -35 -20 -10 -1 8 22 38 49 52 42 23 1 -15 -25 -29 -36 -49 -64 -66 -51 -26 -5 10
8117 10 33 68 106 130 133 113 70 13 -42 -82 -101 -102 -88 -59 -21 14 41 53 49 35 21 21 36 55 71 85 100 113 119 118 114 109 102 92 82 71 59 47 40 42 55
8100 55 78 102 115 115 110 113 130 149 159 154 136 109 83 68 63 58 48 34 21 9 -2 -13 -22 -26 -21 -3 25 54 72 77 72 65 62 70 92 116 130 129 119 111 110 115 122 129 134 131
8082A31j4k1k1j7j7k0j9j2olmkNRPOJ3K0K3K0J6J5J2Opj8k7k3j1KQKj0j8j6r%%nj0oMQMmn
8063a4%MKkKJ2K6L3L3K8K0Rnj9k6k5j9j2nKJ0J6J5J1LJNJ5J9J2mk0k4j7lPQNMJ0J4Nj1k5k7
8045G3k1j1kPJ4J8J7Prk2k6k1j0KJ3J6J2RJ2J2Lj4k6k4j5pjJLLLKLJoj6k2k3j1QK5K9K1Rn
8027C1j9k8l2k3j2lPJ4J8J5J0J0J6K2J8RjlkLPQQJ0J2J4J6J9J9J2kj5j7j1mknppkLPN%JQJ0
8008A37kj8k4j2PJ8K1K0J6Pmj6k4k6k2j3lmj6l0l8m0l1j9oOJ6K5L0L5L3L2K8K2J8J5Rkj2j2
7992A21ljj0k0k2j3mJJ1K4L1K7J7QKqk1k5j5NK2K8K3Qpj3j5j5j5nRJ8J1lromoj2qKJ3J9K0
7975A60J5Mqj9k2j9j8j7j6q%Klj0j0jJ0J4RM%lpqnjmrj1lJ0K2K7K1J1LJOR%j3k6l4l2j7PK5
7956C6K8J1j0j8j4mKkpoMJ4J8J8K0K6L1K7K0K0K0J4Jj5k7l2l2k5j1KJ2J1kj9l1k2KK5L0K5
$$ plain form
8082 131 117 96 75 58 41 21 2 -10 -16 -19 -23 -25 -20 -11 -4 2 15 35 58 78 94 109 121 127 120 102 75 52 41 43 51 53 43 25 9 0 0 0 -5 -15 -21 -17 -9 -5 -9 -14
8063 -14 -14 -10 -8 -10 -8 4 30 63 96 124 144 153 148 129 103 78 59 47 42 44 54 70 85 96 99 100 105 120 139 151 147 127 103 86 83 90 98 103 107 117 131 136 125 100 73
8045 73 52 41 39 46 60 78 95 102 93 71 45 24 14 16 29 45 57 66 78 90 93 79 53 29 14 7 6 7 10 13 16 18 21 22 16 0 -22 -45 -56 -48 -23 6 27 36 31
8027 31 12 -16 -48 -71 -83 -86 -79 -65 -47 -32 -22 -12 4 26 44 53 52 49 47 50 57 65 73 83 95 109 125 144 163 175 173 158 141 130 126 124 119 112 105 103 106 113 118 118 119 127 137
8008 137 135 117 93 81 88 106 127 147 163 170 166 150 126 100 78 65 62 58 42 12 -26 -66 -97 -116 -122 -116 -100 -75 -45 -10 23 55 83 105 123 138 147 145 133 121
7992 121 118 117 107 87 65 52 48 49 60 84 115 142 159 167 169 161 140 115 100 105 127 155 178 186 179 166 151 136 121 116 125 143 154 151 142 136 132 126 114 106 108 121 140 160
7975 160 175 179 171 152 130 111 93 76 60 52 52 54 51 41 31 30 40 54 63 67 67 64 57 49 44 43 39 30 19 16 26 48 75 96 107 110 111 117 126 126 113 87 53 21 4 11 36
7956 36 64 75 65 47 33 29 31 29 22 16 20 34 52 70 90 116 147 174 194 214 234 248 249 234 207 175 143 118 107 109 121 132 130 111 80 58 60 85 115 140
7940A40K0J5Nj1k2k5k0j0JJ5K1K0J8J4RJmjMN%j%K%oj4k6l4l8l4k9j9rKJ0ONPRJ1J1RNKMQ
7921G6J2RLJMOjj3k1j6nKJlJJ4K4K2J5ROMjkMJ0RJorj0qnoj5l1l6k6kJ6J5Ml%J3K2K2J5J2
7901A33J5J9J7Opj9k1j8j0pqrqnljMPRJ3J8J9Qj0k0j6nkom%NMNRJ2Nnj0kQJ3J1Krj1oPJ9K2
7881A68J5Nqj7k0j6rqj2k3l2l0j5JQOjk%jljOJ4J3QMKKLNQRJ0Nnj6j7nJ0J4Lj1j8j8j5j6j6
7862a6j8k0k3k0j1kLOJ3K3K8K3J4OMLKJLOJ1J8K0J6QJnj1j9k3j7lJ1J6J4J1PLLQJ5J4Kj2k4
7844H9k8k2oJ3K5K7J9J1QOjj1k0k3k0j1lOJ1J4J1Lpj6j6qMJ2J4J1PRJ4J8J2Moj2j7k3k5k3
7827E0j7qMJ8K6K0J1MJnj0rKJ4J6Pmj4j6j1l%lqqqj2k0j7r%QJ1J6J5RMMQQMlnprnNJ8K6K1
7807A19R%mpj3j7j5pklmjOJ0J1RKpj3j1m%KMN%rj1lRJ5J3Plj2j2mK%JRJ8J5%j3j4j0j1j1m
$$ plain form
7940 140 160 175 180 169 147 122 102 92 93 108 129 149 167 181 190 191 187 186 190 195 195 194 194 196 196 190 176 150 116 78 44 15 -4 -13 -11 -1 5 10 17 26 37 48 57 62 64 68 76
7921 76 88 97 100 101 105 111 110 97 76 60 55 57 58 55 56 70 94 116 131 140 146 150 149 147 151 161 170 171 165 156 146 138 133 127 112 81 45 19 17 33 48 52 49 49 62 84 106 121 133
7901 133 148 167 184 190 183 164 143 125 115 108 100 91 83 78 75 74 78 85 94 107 125 144 152 142 122 106 101 99 93 89 89 94 98 103 112 124 129 124 114 112 120 133 144 146 137 126 120 127 146 168
7881 168 183 188 180 163 143 127 118 110 98 75 43 13 -2 -1 7 13 12 10 10 9 6 5 11 25 38 46 50 52 54 57 62 70 79 89 94 89 73 56 51 61 75 78 67 49 31 16 0 -16
7862 -16 -34 -54 -77 -97 -108 -110 -107 -101 -88 -65 -37 -14 0 6 10 13 15 16 19 25 36 54 74 90 98 99 94 83 64 41 24 21 32 48 62 73 80 83 86 94 109 123 125 113 89
7844 89 61 39 33 46 71 98 117 128 136 142 141 130 110 87 67 56 53 59 70 84 95 98 91 75 59 51 55 67 81 92 99 108 122 140 152 156 150 138 121 98 73 50
7827 50 33 25 29 47 73 93 104 108 109 104 94 85 87 101 117 124 120 106 90 79 76 76 73 65 57 49 37 17 0 -9 -9 -1 10 26 41 50 54 58 66 74 78 75 70 63 54 49 54 72 98 119
7807 119 128 128 124 117 104 87 72 65 63 60 56 55 61 71 82 91 93 86 73 62 58 58 60 64 69 69 60 49 46 55 70 83 90 87 75 63 59 61 61 62 71 89 104 104 91 77 67 56 45 41
7787D1OROQJ5J5Lj2j4rnnm%JmoJJ3K1K2K1K0K1K0J9J9K0J1Jpmkrk7m0m1l1j9j1%QJ2QKjMQ
7768A04J0Olj1j1lQJ7J7J4P%pj0j2j5j6j2n%NJ0J8K7K8K1J3NJqj7k3k3j8j3j3k0k7k6j1J1
7751A8K7L3K5J6Onj6k3j7JJ6J6Kj0j1oqj7k0j4%J3K2K8K5J6OMPPOOLpj5j3%QP%%PJ3J3Qkj7
7732A58l1l6l0j6jJ0J2Mj2k3k4j4nLJ3K4K6K5K0K1K6K5J6kj6j7oMOKjjnj2j8j7j0nqj6j8j0
7715D1MJ3J4QKmppoonjOPLJJ0K1K5J4JpnJQJ6J9J6Qkj3k0j8j2qqj2j6k0k3k2j3KJ4K0J6Jk0
7696C6l8m6l5j0K2N3O4N4K6%j2j6j6j3rpj0j4j4rJJ5K9L3K3Ppj0j2j2j7k1k3j8qMPKMJ6K8
7680D7K7J2kpkNOlj6j8rQJ6J0oj8j6oMNjkKNL%KONNQJ0R%pqqrj1j4j5j1%J1J3P%MJ6K5K2Q
7659A12j0k6k7j8pjJOJ2J4J5J4J2Npj6k1k4k2j3mLKPJ8K4J7Nlj%nj4j7j7j0kQJ6J6J5J5J8
$$ plain form
7787 41 47 56 62 70 85 100 103 91 77 68 63 58 54 54 55 51 45 46 59 80 102 123 143 164 184 203 222 242 253 254 247 243 241 232 205 165 124 93 74 63 63 71 83 91 93 92 96 104
7768 104 114 120 117 106 95 92 100 117 134 148 155 155 148 138 126 111 95 83 78 78 83 93 111 138 166 187 200 205 206 198 181 158 135 117 104 91 71 44 18 7 18
7751 18 45 78 103 119 125 120 104 81 64 65 81 97 99 89 78 72 64 47 27 13 13 26 48 76 101 117 123 127 134 141 147 153 156 149 134 121 121 129 136 136 136 143 156 169 177 175 158
7732 158 127 91 61 45 44 54 66 70 58 35 11 -3 -8 -5 8 32 58 83 103 124 150 175 191 189 173 156 150 154 160 162 161 160 155 143 125 108 98 93 85 69 51 41
7715 41 45 58 72 80 82 78 71 64 58 52 47 46 52 59 62 63 73 94 119 133 134 127 122 123 131 147 166 182 190 188 175 155 137 125 117 109 97 81 61 38 16 3 5 19 39 55 56 36
7696 36 -2 -48 -83 -93 -71 -18 46 100 126 126 114 98 82 69 60 53 43 29 15 6 7 22 51 84 107 114 107 97 85 73 56 35 12 -6 -14 -10 -3 -1 3 19 47
7680 47 74 86 84 77 75 80 86 83 67 49 40 48 64 74 68 50 34 28 32 37 36 34 36 41 44 44 46 52 57 62 70 80 89 89 82 74 66 57 46 32 17 6 6 17 30 37 37 41 57 82 104 112
7659 112 102 76 49 31 24 23 24 30 42 56 71 85 97 102 95 79 58 34 12 -1 -5 -2 0 7 25 49 66 71 68 67 67 62 48 31 14 4 2 10 26 42 57 72 90
7641I0J5Plrj1qmMJ1J3QKJPPrl0m3l8k6j7j2p%PO%lNJ9K7K5J4%j1j6j5ojnj2rOK2L5L4K4R
7622A03pj5j8k0j9j4nJLMRJ8K0Rmj3j5j5j5j3j3j0%J4K7L4L2K4J2KmkPJ1Nj0k4k9k6j8pOJ4
7605C9J2Kj2k0j4KK1L2L2K8K3J5Nmonqj2j4qkLOJ2J7J8J0%rj3j7k3k9k8j6OK4L1K4Pj1k3k5
7588G0j9j2rj0j1j2j3j5j6j8k1k1j6qMJ5J7J3M%OJ3J9K0K0J6Onj4j7j9j4%J3J9J4NPJ2J3P
7571D3pj8j7qMJ1J7J4RJnlLO%j2k0j7qKQJ2ROKjllkJJ%loojOJ0Okj0qlLRJ1J0OJjKPJ4K1J9
7549A10Rpj5j3lMOPQPOJ0J7J6Nj2k2k1j4kJ5L2L6K4Lj6k4k2j8j6j7j5oJ0K6L6L8K7Qqj5j2
7532A82popqrnKJ0J2Ooj5k5k8k2rKKmj4k3k6j5JJ2QKKOMjMJ6K1J4ONPNKOP%j8k8k5j4olNK1
7512D6M3N3M6K8Qmj0j5j9k1k2k7l5m2m2l5k3j0KJ3K1K2J4NKJJNRJ4J2QRJ6K1J6OkJNPJpj1
$$ plain form
7641 90 105 112 109 100 89 81 77 81 92 105 113 115 116 123 130 121 91 48 10 -16 -33 -45 -52 -52 -45 -39 -39 -42 -37 -18 9 34 48 48 37 21 6 0 -1 -6 -18 -27 -21 1 36 70 94 103
7622 103 96 81 63 43 24 10 5 6 9 13 22 40 60 69 65 52 37 22 7 -6 -19 -29 -29 -15 12 46 78 102 114 116 112 110 117 128 133 123 99 70 44 26 19 25 39
7605 39 51 53 41 21 7 9 30 62 94 122 145 160 165 161 155 150 142 130 116 108 106 109 115 127 144 162 172 172 163 150 133 110 81 53 37 43 67 98 122 129 118 95 70
7588 70 51 39 30 20 9 -3 -16 -31 -47 -65 -86 -107 -123 -131 -127 -112 -95 -82 -78 -78 -72 -59 -40 -20 0 16 22 17 3 -14 -33 -47 -47 -34 -15 -1 4 11 23 36 43
7571 43 36 18 1 -7 -3 8 25 39 48 49 44 41 44 50 50 38 18 1 -7 -5 3 15 24 30 32 31 28 25 23 24 25 25 22 16 10 9 15 25 31 29 19 11 8 11 20 31 41 47 48 47 49 56 70 91 110
7549 110 119 112 97 84 81 85 91 98 106 113 119 129 146 162 167 155 133 112 98 96 111 143 179 203 206 190 166 144 126 110 93 78 72 82 108 144 182 209 217 209 194 182
7532 182 175 169 162 154 145 140 142 152 164 170 164 149 124 96 74 65 67 69 65 51 28 2 -13 -12 0 8 10 12 18 22 21 25 41 62 76 82 87 94 99 101 107 114 114 96 68 43 29 23 20 25 46
7512 46 89 142 188 216 224 220 210 195 176 155 133 106 71 29 -13 -48 -71 -81 -79 -66 -45 -23 -9 -4 -2 -1 0 5 14 28 40 48 57 73 94 110 116 114 115 120 127 128 121 110
7494A10j0j1k0l3l6k5j2jQK1K8K6J6OknnkJmj2pNJ2MpqLJ4J2Kj0j6j3oMJ6J9J1lj3j6j9k7
7476el4k3mJ1J0M%mj2j7j6pLJ1K1L2L1K3RJNJ7K5K6K5K4K2J6Ork2k9k7j8plllKPOMMNJmmL
7457A03OLqj9j9rKMKjKONjqj4j5qJPQPPOJjRK3L5L6K9J8Lqj1rkOJ4J6Oj0k1j8kJ5K5K7J6L
7437B67oj2j9k8l2k7j7j3j4j8k2j9j1%ONJ%j%LRJ2J0PMLJklnqj3j1qrj3j6j4qljJJOJ4K6L9
7418F2M1L0J1mj4j3q%J0J6Qpk2k3j1LROjpqnNJ6K4K7K2Rok2l2l2k0rorj1nRJ5J1nj8k3j2L
7399DJ2J0KlklmpolJjpj5j1MK4L4L0J2rk7l4k6pJ0J7J2OMLLJkJRJ9K7K3J1joj%mj4j8j7j5
7380C6j8j9j9j3qrj0rmLJ0K0K9K9K2J0PJ9L3M0L2J3j1k7l0k3j4rqorj9k8k5j4opj0qjPJ4K3
7362a7L2L7L1J7kj8k5k2j4j2j3j5j1m%RK0K5K1Qlnmpj1j3j2mOJ3J1jj6k3j9oJ0K3K8K9K7K2
$$ plain form
7494 110 100 89 69 36 0 -25 -37 -38 -30 -9 19 45 61 67 65 60 55 53 54 50 38 31 36 48 52 45 37 40 54 66 68 58 42 29 23 27 43 62 73 70 57 41 22 -5
7476 -5 -39 -62 -66 -55 -45 -41 -41 -45 -57 -74 -90 -97 -94 -83 -62 -30 1 24 33 34 39 56 81 107 132 156 178 194 200 191 169 140 113 95 88 85 82 79 81 88 94 98 102 107 108 104 100 103
7457 103 109 112 104 85 66 57 59 63 65 64 66 72 77 76 68 54 39 31 32 39 47 54 61 67 68 67 76 99 134 170 199 217 220 212 201 192 190 196 210 226 232 222 201 183 181 196 221 248 264 267
7437 267 261 249 230 202 170 143 126 113 99 81 59 40 29 29 35 40 41 41 40 40 43 52 64 74 81 85 88 89 87 84 79 71 58 47 39 30 17 1 -13 -21 -24 -25 -24 -23 -17 -3 23 62
7418 62 103 133 144 140 126 113 105 105 115 131 139 132 110 87 76 79 88 94 93 86 78 73 78 94 118 145 167 176 170 148 116 84 64 55 49 40 29 24 33 48 59 54 36 13 1 4
7399 4 16 26 28 25 23 20 16 9 3 0 1 0 -7 -22 -33 -29 -5 29 59 71 62 35 1 -25 -32 -22 -5 7 13 17 20 23 24 22 23 32 51 78 101 112 111 105 104 104 100 86 68 51 36
7380 36 18 -1 -20 -33 -41 -50 -60 -69 -73 -70 -60 -40 -11 18 40 50 57 76 109 149 181 194 183 156 126 103 89 80 72 66 57 38 10 -15 -29 -35 -42 -52 -60 -61 -54 -40 -17
7362 -17 15 52 83 100 98 80 55 33 19 7 -6 -21 -32 -36 -36 -27 -7 18 39 47 44 39 35 28 17 4 -8 -12 -6 7 18 17 1 -22 -41 -47 -37 -14 14 43 70 92
7346I2J1%lLRJ1RMmj4j8j3jOOMJlnmJL%nlQJ9J9RjkPJ5J6Qmj7k6l3l5l3k9k4j9j2LK1L0K9
7326C6J8J1RJ3J2Nnj2j2pJONKjkJjj2k4k9k2qMJ2J0RO%jjKMKjjMJ0J5J8K0K0J6J2RRJ0OKk
7306A78JJjrj5j5j3j2j4j3j0qpmKOLjJQJ1QJjJKMjj2k4k8j8oMQJ2J0LlmlnrnNJ2J1Nmj2j8
7285B2j2jM%olNQMJJKlrq%J4K4K5J7Mj0j8k0j1JJ3J6Qmj0nPJ8J8J0Jqj5j9j9j6j2qm%KLKN
7265A4J2K0K5K7K5J9J4J3J1QJj0k0k5k5k5k4k2j7j0ppj2j2rnNJ6K0J7PlpojOJ1J3J1ONOJ0
7248G5J7K1J8J1OMQJ4J4Lj8l3l4k3j9k2k3j6kPJ3J4J5J7K0K1J1nj4j2onrj1j2q%J2K3K2J0
7231A04nj3j3kJ8L5L6K2Jj1j5j5j6j8k0k1j9j2kPJ2J4J7J9J4Njlmj0j8k2j7pK%nrj0qqqlJ2
7214CL5M7M2K5J2RPJj2k3k2j1jJnj0nPJ5J6ROQRQ%qj6j6j2n%MPJ1J3J0Lj1k5l8l8k4JK2K4
$$ plain form
7346 92 103 103 100 103 112 123 132 136 132 118 100 87 86 92 98 102 103 100 95 91 92 95 95 90 87 95 114 133 142 141 139 146 161 177 185 181 164 138 105 70 37 8 -16 -35 -47 -44 -23 7 36
7326 36 54 65 74 87 99 104 99 87 75 68 69 75 80 82 81 79 80 79 67 43 14 -8 -16 -12 0 10 19 25 25 24 23 25 29 31 30 29 33 43 58 76 96 116 132 144 153 162 172 178 180 178
7306 178 179 180 179 170 155 140 127 115 101 88 78 70 63 59 61 67 70 69 70 78 89 97 98 97 98 100 104 103 91 67 39 21 15 19 27 39 49 52 49 45 42 37 28 23 28 40 51 56 52 40 22
7285 22 10 9 13 13 7 4 9 17 21 22 23 25 22 13 5 5 19 43 68 85 89 79 61 41 30 31 44 60 68 64 54 49 56 74 92 102 103 95 80 61 42 26 14 6 2 2 4 7 9 14
7265 14 26 46 71 98 123 142 156 169 180 188 189 179 159 134 109 84 60 38 21 11 4 -3 -15 -27 -36 -41 -36 -20 0 17 24 21 14 8 7 13 24 37 48 54 59 65 75
7248 75 92 113 131 142 148 152 160 174 188 191 173 140 106 83 64 42 19 3 1 8 21 35 50 67 87 108 119 114 100 88 82 77 68 57 45 37 37 49 72 94 104
7231 104 99 86 73 71 89 124 160 182 183 172 157 142 126 108 88 67 48 36 34 41 53 67 84 103 117 122 121 118 114 104 86 64 47 40 42 42 37 28 18 10 2 -6 -9 3
7214 3 38 85 127 152 164 173 180 181 169 146 124 113 112 113 108 98 93 100 115 131 140 146 154 163 171 171 163 147 131 119 114 114 118 125 136 149 159 162 151 126 88 50 26 27 49 73
7195G3J1loKMnj6j8j4j2rNK2K5Nk6l9l3j4MK1L2M0L6K5J2Knj1j0mKRJ1J0Lmonnj3k3k4j6j
7177C2J2J9J7Nqj5rLRJ0PMJjJOJ2J2Omj5k5k5j4PK4K5J8J1Ojj1j6j3j0j5k1k3k1j7j4oJ0K3
7160dK3J7OKMOOLlj2j1%J3J7QlmKQQOMmj5k0j5nmnjJ0J7J7J2Q%j5l4m0k8mJ8K6K2J2PJ4J9
7140H8J9J1MjmnopnjNJ4J9K3K4J9J0mk0l2m1m2l5k2pNJ0N%jQJ5J6J5K0K8K2Mj3j8j0l%knj2
7122H8j7j7rlkpqKK0L2L1J9QMJoj3j2qpj0qLJ2J3O%oj1j9k4k3j9j5j0JJ3J8J6Nj3k6k6qJ3
7104b2K3K1J6J4J0KmjQRlj8k3j5lJlj0j4j2oJORJ4K0K1J3Jj2j9j6mJ6L4L7K7J2OQRRMJnj0
7085A52j7j7rjLJj%kj2k6l5l0k1j5qOK0K4J7QMNOJ0J8J9J0qj9j5nPJ4J5Pj1k3k2nJ0J6J0%
7068H0mnjKLKkj1j9k0j7qJJ3K2K7L1L4L3K4J0kqj3k2l1l3k8k2j9j7j1pop%J3K1K2J6RLnj3
$$ plain form
7195 73 84 81 75 77 81 76 60 42 28 16 7 12 34 59 64 38 -1 -34 -48 -44 -23 9 49 85 110 122 124 119 108 98 94 96 105 116 126 129 125 119 114 109 96 73 49 33 32
7177 32 44 63 80 85 77 62 53 56 65 75 82 86 87 86 87 93 105 117 123 119 104 79 54 40 47 71 96 114 125 131 130 119 103 90 80 65 44 21 0 -17 -31 -37 -27 -4
7160 -4 19 36 42 44 48 54 60 63 60 48 37 37 50 67 75 72 68 70 78 86 92 96 92 77 57 42 37 33 28 27 37 54 71 83 91 91 76 42 2 -26 -30 -12 14 36 48 55 69 88
7140 88 107 118 122 121 117 112 106 99 94 93 98 112 131 154 178 197 207 203 183 151 110 68 33 11 4 9 19 24 24 23 31 46 62 77 97 125 147 151 138 120 110 107 107 105 100 88
7122 88 71 54 45 42 40 33 25 27 47 79 110 129 137 141 142 136 123 111 103 96 86 78 81 93 106 112 112 106 95 76 52 29 10 -5 -15 -14 -1 17 33 38 25 -1 -27 -35 -22
7104 -22 1 22 38 52 62 64 60 59 67 76 73 55 32 17 14 15 12 2 -12 -24 -30 -29 -23 -14 0 20 41 54 55 43 24 8 4 20 54 91 118 130 136 144 153 162 166 167 162 152
7085 152 135 118 109 108 111 112 111 111 109 97 71 36 6 -15 -30 -38 -32 -12 12 29 37 41 46 52 62 80 99 109 101 82 67 62 69 83 98 105 94 71 49 44 54 70 80 80
7068 80 76 71 70 72 75 77 75 64 45 25 8 0 1 14 36 63 94 128 161 185 195 193 185 172 150 119 86 58 36 17 0 -11 -18 -24 -31 -31 -18 3 25 41 50 53 48 35
7050C5j1lMORJ4J2Jj1j3mPJ7K2J8Onpmjknj2j8j2KJ0Jk0l2k5j3kOJ7K7K9K1RQJ3J8J3%j0q
7032A07lkjOJ4J5Mj2k7l9m4l3j6j%noKJ5K6K8J7kj3nJ3K7K9K2J0mj2qJMlj1j4qkLRJ4J6Ro
7013A14j9j8j3j4k6l6l2j8qnjJ0K1K5J5kj5j3JJ5K0K4L1L3K3Lj2j3p%OJ0Nnj3j5j2j1rpoo
6996B0oqj4j9j0PJ7J3QJ2K1J9J2J1J5J3Jj5k7l3l2k1oJ2J8Rqk6l3k6j0MJ8K9L8M1L1J8OKj
6980A00oj1j3pLPNMJok1l4l3k0lOQL%KRJ7K6K6J9Jk1l1k6j1kJ%JLLL%k%J1K0J8J0Jlrj4j6
6960A9qkLNQJ0M%jLPJ2J8K3K1Rok2l5m0l2j9jJ2K0K5K8K6J9Lj1j5nOPrk6l3k3lJ2K5K7K4J5
6942A00Mqj7k3k8k8l0k7j9mJ6L1L6L1J8Kj2j5pORjj3j4lQJ2J2J3J4RJj3k6l2k8j6n%%LMKm
6924d2okMPJ1J5J3%rrMJ3RNPJ2J2KppokJL%k%PJ2J1QPPKjjJ%oj3j5oJ1K5K4J1j%Lkj3k1k3
$$ plain form
7050 35 24 21 25 31 40 54 66 67 56 43 39 46 63 85 103 109 104 97 93 92 90 85 73 55 43 45 55 56 36 4 -21 -34 -36 -30 -13 14 43 64 73 81 94 112 125 125 115 107
7032 107 104 102 101 107 121 136 140 128 101 62 18 -15 -31 -32 -32 -37 -43 -41 -26 0 28 45 43 30 25 38 65 94 116 126 122 110 102 103 107 104 93 79 71 69 72 81 95 111 120 114
7013 114 95 77 64 50 24 -12 -44 -62 -70 -75 -76 -66 -45 -20 -5 -7 -22 -35 -34 -19 1 25 56 89 112 115 103 90 83 83 89 99 104 99 86 71 59 48 39 32 26 20
6996 20 14 6 -8 -27 -37 -30 -13 0 8 20 41 60 72 83 98 111 112 97 70 37 5 -16 -22 -10 8 17 9 -17 -50 -76 -86 -82 -64 -35 3 44 75 93 99 101 100
6980 100 94 83 70 63 66 73 78 82 83 77 56 22 -11 -31 -34 -28 -20 -17 -17 -15 -6 11 37 63 82 83 62 31 5 -6 -8 -7 -7 -6 -3 0 3 3 1 1 12 32 50 60 61 58 49 35 19
6960 19 11 9 12 17 25 35 39 39 38 41 48 60 78 101 122 131 125 103 68 28 -4 -23 -24 -12 8 33 61 87 106 109 98 83 78 84 91 82 56 23 0 -3 9 34 61 85 100
6942 100 104 96 79 56 28 0 -30 -57 -76 -80 -64 -33 3 34 52 54 42 27 20 26 35 34 21 7 4 12 24 36 49 63 72 73 60 34 2 -26 -42 -47 -47 -47 -44 -40 -38 -42
6924 -42 -48 -50 -46 -39 -28 -13 0 0 -9 -18 -14 -1 8 13 20 32 44 46 39 32 26 24 25 28 28 26 26 33 45 56 64 71 78 80 79 78 79 79 73 60 45 39 50 75 99 110 109 109 112 110 97 76 53
6903E3k2j6j1ml%RK5L0K4J1jprpooj0j1j1rj2j5j0PK4L4K4Nj0rKRJ0QJ0J1J2J1J3J7J6Qkq
6885A74pl%KKkj1j8j8j3m%kmm%NPMlnmLPQNLOJ4J8J1ok2k8k5j9j2rj0j0pPK2K6J9J0MKlm%
6864A06QJ0Lrj4j1jOL%RK3K6J2oj5j1pmmoj2j7j9j2lQJ7K3K2J6J4J0%j5k3j5jPLmn%J0J7J7
6846A56Pqj7k0k0k1k4k2j6oKLKlomPK1L5L6K4J2PPjj4k5k4j5p%OJ0J1RRJ2J1Lpj1j3j2oJO
6828I5KkoonKJ3K0J2krmkpqjKoj8k2k1k0k2k0rJLK%JJ0K4L4L1J6NKNPMKmj3k0k0j2jRJ6K0
6807G8J6J2QJj1k5k8k2qNJ6K0J3kj7k3j8j3qlJ0K6L3K3Nj0j4j3j1qomjKQJ4K0K3K2J5OJMQ
6790A44J0Lrk1k6j7%QNmj0pLJ3J6J1mj5j9j2mjnrj3j2j0oj%lj0j8j5kJ3K0J6J5K1K8K7J5j
6772A14j1j1lMJ2J7J7J2J0J3J8J5QKjqk1l3l5k8j7mJ1K0J8Rjpj2j5j6j6j7j4JK0L2L2K5J6
$$ plain form
6903 53 31 15 4 0 -3 -3 6 31 61 85 96 95 88 79 72 66 60 50 39 28 19 7 -8 -18 -11 13 47 71 76 66 57 59 68 78 86 96 107 119 130 143 160 176 184 182 174
6885 174 167 164 164 166 168 166 155 137 119 106 102 102 100 96 92 92 97 104 108 105 100 96 99 106 114 119 122 128 142 160 171 165 143 115 90 71 59 50 40 30 23 30 52 78 97 107 111 113 110 106 106
6864 106 114 124 127 118 104 93 92 98 101 101 110 133 159 171 165 150 139 132 128 124 118 106 89 70 58 55 63 80 103 125 141 155 165 165 150 127 112 111 118 121 117 112 112 122 139 156
6846 156 163 155 138 118 98 77 53 31 15 9 11 14 16 13 7 3 10 31 66 102 126 138 145 152 151 137 112 88 73 66 66 72 82 93 102 111 123 134 137 130 119 106 94 88 89 95
6828 95 97 95 89 83 78 80 93 113 125 123 114 110 108 101 93 92 94 88 70 48 27 7 -15 -35 -44 -43 -40 -38 -38 -37 -27 -3 31 62 78 83 85 90 97 101 103 99 86 66 46 34 33 42 58 78
6807 78 94 106 114 115 104 79 51 29 21 26 42 62 75 73 56 33 15 2 -6 -9 1 27 60 83 88 78 64 51 40 32 26 22 21 23 31 45 65 88 110 125 131 132 136 144
6790 144 154 157 148 127 101 84 84 92 97 93 83 76 79 92 108 119 115 100 81 69 65 64 59 50 37 25 15 9 8 8 5 -5 -23 -38 -40 -27 -7 9 24 45 73 100 115 114
6772 114 103 92 89 93 105 122 139 151 161 174 192 207 215 217 216 208 187 154 119 91 74 70 81 101 119 128 127 120 108 93 77 61 44 30 31 51 83 115 140 156
6756A56NnoNJ7K2K0J5Oqk2k9k4j2KROok2l4m2l9k3lPKj5k5k0qQK3L1L2L0K7K6K1Oj3k5k4j5
6739E6m%LNNjpj0lLMMPJ1J4J0MKkj0k1k6j6lMjrj1ojLQJ3J5J1PPOL%MRJ1QJnojPJ0Lqj5j8
6717G4k0k1j5kQJ1Omj6k5k8k3j7qKJ8K6K4J1K%MJ1J3J3O%oolMJ0J5J8K0K1K0J7Oj2k7k7j0
6700I0QJ3NkJLmj2oJ0K5K9K7K8L1K4Nk1m1m7m0k7k0k1k5k8k7k1j2jRJ2J0MMJ1J7K2K4K7L0
6683A14K3Rmpllpj5j8j5p%LKkj0j7j6oJ1K3K3J3%lNJ8J9Prj9j5j0qoKRQkrp%RJ0Lj0k0j7l
6664D3J6K9K9J5lj6j2LJ1Pkrj4k0k4j9qKPQMnj3j6qNJ2Pmj2j3oj%KMRJ3J9K5K6J7kk0l2l5
6645A9l0k2j1jPJ2J6J9K7L1K9J7%j2j3ploj0o%mj5k2j4OK1J9Qlom%KNQJ1Lj1k2k2j6j9k6k3
6627f8kK2L4K7Rj3k3j5MK0J9J2NLNRJ1NmqlKlj4j5pKPJ2J9K3K6L4M2L7J9kj5k0k5k2j1%NL
$$ plain form
6756 156 161 156 150 155 172 194 214 229 235 227 205 176 152 140 142 151 157 151 129 95 53 14 -9 -12 -5 -3 -18 -43 -63 -71 -63 -40 -9 23 53 80 106 127 133 120 95 71 56
6739 56 52 52 55 60 65 64 57 47 44 47 51 55 62 73 87 97 101 103 101 91 70 44 28 25 29 28 19 8 2 1 4 12 25 40 51 58 65 71 74 74 78 87 98 106 107 102 96 95 102 112 115 107 92 74
6717 74 54 33 18 16 24 35 41 37 21 -4 -32 -55 -72 -80 -78 -60 -34 -10 1 3 3 7 18 31 44 50 50 44 38 35 39 49 64 82 102 123 143 160 166 154 127 100 90
6700 90 98 111 116 114 115 118 114 102 96 106 131 160 187 215 246 270 275 254 213 166 126 99 79 58 33 5 -22 -43 -55 -56 -47 -35 -25 -21 -17 -6 11 33 57 84 114
6683 114 137 146 142 135 132 129 122 107 89 74 67 67 70 72 70 60 43 27 21 32 55 78 91 91 88 93 111 130 137 128 109 94 84 76 70 72 81 89 87 78 71 71 80 90 93 83 63 46 43
6664 43 59 88 117 132 129 113 101 104 115 122 120 111 97 77 53 34 26 28 35 43 47 42 29 13 5 10 22 29 25 13 0 -6 -7 -7 -5 -1 8 21 40 65 91 108 106 86 54 19
6645 19 -11 -33 -44 -45 -38 -26 -10 9 36 67 96 113 113 101 88 81 78 72 62 56 56 52 37 15 1 7 28 47 55 52 46 42 42 44 49 57 68 71 60 38 16 0 -19 -45 -68
6627 -68 -70 -48 -14 13 22 9 -14 -29 -25 -5 14 26 31 34 39 48 59 64 60 52 49 51 48 34 19 12 14 21 33 52 75 101 135 177 214 233 231 216 196 171 149 138 138 143 146
6609A46OJ4J8J6Pmj4j8j4pj1k3k8j7KJ3Q%omjjklmmlJORNkpj0j1qNK2K6J8J0J1J7J5Lrj2o
6590A49koj9l2l4k1n%j0k2l2l0k1j4pnkNJ6L0L7L0J3nj1pjkopjJ0J4J3Mpj2j5j9k1j3NK2K9
6572a2K0J1RJ6K5K6J8Mj0k2l0l5l1j9LK2K6J9QJLPOlj4j8j7rjOROJljLPJ1QLpj1rkNJ3J8K3
6553H3K5K3J6MmmKN%j3k0k1j8j4oJPRLrk0k0qPJ5J3P%qj5j6nLKjJQJ0Jj0rJJ5K1J8Qjnopj0
6532E8j1rprr%J6K7L1K6K2J9J4Mqk0k5k3k1k2k7k8j9JJ3J2LnmmmolLQRJ2J7K0K3K3J7Q%kJ
6514A21NNkj0j3j2j4j9k3k0j3pj3j7j2NK1K4J6OOROoj8j8p%%%LJ5K4J9Lj6k6j8jJ2Pqj8j7
6496b1j0mm%QJ7K2K1Qqj8j4jOPMQJ5J7J0%j0j3j2j0j0p%QJ4J6K0K6K5J4Kkjlrj4j6k0j5jJ8
6478F3K3J0%JRQLLJ1Rlj7k3k1j9j3qprj0kJ0J9K5L4L7L0J5MLNJrk4l3l3k3r%krj5j4j0lLO
$$ plain form
6609 146 152 166 184 200 207 203 189 171 157 150 139 116 88 71 73 86 94 94 88 84 83 82 80 77 73 69 66 67 73 82 87 85 78 68 57 49 54 76 102 120 130 141 158 173 176 167 155 149
6590 149 147 141 122 90 56 35 30 30 20 -2 -34 -64 -85 -99 -106 -111 -113 -108 -92 -62 -25 5 18 13 2 -5 -6 -8 -14 -21 -22 -12 2 15 19 12 0 -15 -34 -55 -68 -63 -41 -12
6572 -12 8 19 28 44 69 95 113 117 107 85 55 20 -11 -30 -27 -5 21 40 48 49 52 59 65 62 48 30 13 4 3 9 18 24 25 22 21 24 31 42 50 53 46 35 26 24 29 42 60 83
6553 83 108 131 147 151 147 143 145 150 150 137 117 96 78 64 58 59 66 75 78 69 49 29 21 28 43 56 63 63 55 40 24 19 22 24 23 24 32 42 43 33 24 25 40 61 79 87 86 81 75 68 58
6532 58 47 38 31 22 13 13 29 56 87 113 135 154 168 172 164 144 119 96 75 53 26 -2 -21 -20 -7 5 8 3 -1 -5 -9 -15 -18 -15 -7 2 14 31 51 74 97 114 122 122 120 121
6514 121 126 131 129 119 106 94 80 61 38 18 5 -2 -15 -32 -44 -39 -18 6 22 28 34 43 49 43 25 7 0 0 0 0 3 18 42 61 64 48 22 4 3 15 22 14 -4 -21
6496 -21 -31 -35 -39 -39 -31 -14 8 29 37 29 11 -3 -4 2 9 13 21 36 53 63 63 53 40 28 18 8 1 1 9 23 39 59 85 110 124 126 124 123 120 111 97 81 61 46 45 63
6478 63 86 96 96 97 106 114 117 120 131 140 137 120 97 76 57 44 36 29 20 10 8 18 37 62 96 133 163 178 182 185 190 191 182 158 125 92 69 60 60 58 49 34 20 10 7 10 16
6459A6Kj0k3k9j8JJ2Rmj2j1noj2j6j4j2j2qQL1M6M9L7K6J2JkNJ5J4jk0l0k8j7rmqj4j4pKR
6441e1J0PJqj5j3jJ1J0LjOJ8K8L3K9K1J6J7K2K1Oj2k3j9o%lj9l0k9j2OJ2MnnLROlpokjJRJ6
6422E4J6Plo%MKmrj2j2oJNLkprrj1qpnmMJ7K7K7J5%rrkNRP%ljQK0K9K6J1rk0k1j5j0ojkj2
6401F3k2k0mJ3J6RKlj0k2l1l2k5j3lMRJ1J3J6J9K0J5Mornl%KLmj4k4k4j2kMKKNJ2K4L3L3J8
6382F4kj1j2j0j1pLJ5K1J9J5J5J2Kj3k1j6pkjjKNKLPJ7K3K2J5Olj0j0roqj0j0nKPPNK%%lj2
6363I1k1k1j2l%LPJ6K2K6K5J6lk4l4k9j4k%qj6k0j7j0kRK0K8L5L2K3RkqqmJJ4K4K5J0j1k5
6345A42k6k2j4pmnroLQKj4k7k9k7k3j3JJ3K0J6RLJJJ%KRJ8K5K6K1J4PLLJoj3j9j7j4j3j5j6
6327A0j2j2j4j4mJ9L9M2K4Jj0oloj5k0j5LK5L8L1J2nj3j3j6j5pJKkMK0L3K9J2pj8j8j8j6j2
$$ plain form
6459 16 18 8 -15 -44 -62 -61 -49 -40 -44 -56 -67 -72 -78 -90 -106 -120 -132 -144 -152 -144 -113 -67 -18 19 45 57 58 56 61 76 90 89 69 39 11 -6 -15 -19 -27 -41 -55 -62 -60 -51
6441 -51 -41 -34 -33 -41 -56 -69 -70 -59 -49 -46 -47 -41 -23 5 38 67 88 104 121 143 164 170 158 135 116 110 110 107 88 58 29 17 23 35 39 34 29 32 41 47 44 37 31 29 28 29 38 54
6422 54 70 77 74 68 68 72 74 70 61 49 37 31 32 37 40 38 31 22 13 2 -6 -13 -18 -22 -18 -1 26 53 68 68 59 50 48 53 62 69 69 66 65 73 93 122 148 159 150 130 109 94 84 78 77 75 63
6401 63 41 21 17 30 46 55 57 54 44 22 -9 -41 -66 -79 -82 -78 -69 -58 -45 -29 -10 10 25 29 23 14 9 6 6 8 11 7 -7 -31 -55 -67 -69 -65 -63 -61 -56 -44 -20 13 46 64
6382 64 62 51 39 29 18 11 14 29 50 69 84 99 111 113 100 79 63 56 54 53 52 54 59 61 64 71 88 111 133 148 154 151 141 131 122 116 108 98 88 83 85 92 99 104 106 106 106 103 91
6363 91 70 49 37 34 34 37 44 60 82 108 133 149 146 122 88 59 45 43 43 35 19 -1 -18 -28 -30 -21 -1 27 62 94 117 126 124 116 108 104 105 119 143 168 178 167 142
6345 142 116 94 80 73 69 64 55 49 52 60 62 48 21 -8 -35 -58 -71 -70 -57 -37 -21 -12 -9 -8 -7 -6 -6 -4 5 23 48 74 95 109 116 119 122 123 117 104 85 68 54 41 26 10
6327 10 -2 -14 -28 -42 -46 -27 12 54 78 79 69 63 60 54 39 19 4 7 32 70 101 113 108 95 82 66 51 44 45 47 45 49 69 102 131 143 136 118 100 82 66 54
6310E4mRJ7K0J8J7J9K0J6Mj4l6m9n0l7k1j2rnjJmnkLMMQJ6J9K2K1K4K7K7K6K4K0J3Kj2k5l5
6293A34m1m1l7k9k5j6qKJ2J4Mrj4lJ4K5K4K5K7K1Prj5pJ0K4K6J8Mnrj2j7k2k0j2lKLkmjRK2
6275F6L1L2K6J4Jj2j7j5qnqj6k2k4k1j6pJQPjj1j0oKPQOkqoOK5L7L6K1QLLOQPLoj6k2k2j5
6256G6o%Jpj9k5k6j9mJ9L8M2K8J2Nkj1k0j9j1j3k2k3j7nMJ2J7J5Loppj2j9j7j0pj1j0lNPO
6238f8MKLRJ7K3K0J5RRRROJnqmRK2K5J9QK%jloj1j4j8j6nPJ0Lpj1q%J2K0K4K2J2lk0l2l6k8
6218B7j7kJ2K1K1J5J2J4J9K5K4J5mk1l0k7j6mLLnk1l4l6k6j0KJ0J2J3J5J7J2LmokMJ2J7J2
6202G5kj2j1jOJ0QQQQJ0J0Nlj0j0qqj2j7j2jJ2J7J1Kloj0j5j6j2ppp%J0J1Jj0j2rmmJJ1K5
6183B0L4L1K0Pmj3k0k2k1j9j8j7j0kLL%lqj0j0lOJ5K3K6K4J8J2J0J3J4J0PPRRJ1J4J7J2ok7
$$ plain form
6310 54 50 59 76 96 114 131 150 170 186 190 176 140 91 41 4 -17 -29 -38 -43 -44 -43 -47 -52 -54 -51 -47 -43 -35 -19 0 22 43 67 94 121 147 171 191 204 206 194 169 134
6293 134 93 52 15 -14 -39 -55 -63 -61 -49 -35 -31 -40 -54 -57 -43 -18 6 31 58 79 86 77 62 55 65 89 115 133 137 132 123 111 94 72 52 40 37 39 42 40 36 35 44 66
6275 66 97 129 155 169 170 158 141 126 118 113 105 89 67 43 22 6 -1 0 8 15 14 3 -7 -13 -11 -4 4 10 8 0 -6 0 25 62 98 119 127 130 133 139 147 154 157 151 135 113 91 76
6256 76 70 70 71 64 45 20 -6 -25 -29 -10 28 70 98 110 115 113 102 82 63 52 39 17 -6 -23 -28 -24 -12 5 20 23 17 10 3 -9 -28 -45 -55 -62 -73 -83 -86 -81 -74 -68
6238 -68 -64 -62 -59 -50 -33 -10 10 25 34 43 52 61 67 68 63 55 51 60 82 107 126 134 136 136 135 132 126 115 101 83 67 62 69 79 82 75 64 56 56 68 88 112 134 146 143 123 91 55 27
6218 27 10 8 20 41 62 77 89 103 122 147 171 186 182 161 131 104 88 84 87 90 85 64 30 -6 -32 -42 -40 -30 -18 -5 10 27 39 42 38 32 30 34 46 63 75
6202 75 73 61 50 49 55 65 73 81 89 97 107 117 122 119 109 99 91 83 71 54 42 41 53 70 81 83 80 74 64 49 33 21 14 7 0 0 10 21 22 12 0 -9 -13 -17 -16 -5 20
6183 20 54 85 105 112 108 95 75 53 32 13 -5 -22 -32 -34 -31 -28 -28 -31 -39 -49 -59 -62 -56 -41 -18 8 32 50 62 72 85 99 109 116 123 132 141 152 166 183 195 189 162
6166A62l7l2j4JONOOKmokPJ2J2J1J0QMKLMLKkj2k5l6l8l6l3l1j8JK1L1L5L5K5Mk1l7l5k2q
6148c1kjLJ2K0K0J7J8K7L1K0lk2l2l0j8LJ8J8Kj0j1lLOJ0J9K3J6Lprj0j8l0l6l2l0k9k7k0
6131a22oRJ9K4K9L1L0K4Pj2k5k7k6k8k9k2nJ2K1K3K2J5QOJ2K2L1L1K1J1MKJlj3j4rjkqj0j2
6114D1j9k5k3rLNQJ4J7QnoJ1L0L3J9Jj0j2rkNJ1RLkkkoj7k5k5j5lMPPML%lmnqj2j3jJ9L0K6
6094E5J1kn%OJ4J9J5%j6k5k4j8j1%J3K2K0R%%LLoj6k0j2KJ1Qnj6j8j1kKJ0J9K8K8K2J2OMN
6076A40OJj0k0k3k0j4j3j6j3pkoj2j3nMO%njJ3K1K0Mqj2oJPJ3J7J6J0%nnJKlj1j6j6j2rqm
6057a3%%momJJ0J7K1J4mk2k5j7oKOLmj5k1j8nJ0K2K9K7J4JoJJ2J6QlqoJMPJ2J7J4Lj0j4j0
6038E1lLQJ2J2Ooj4j6qKRJ1RQJpj1qlJNJ4K0J8J0LNJ2J4J3Nlj2j6j6j7j6j3j1j5k2k1rJ%k
$$ plain form
6166 162 125 93 79 80 86 91 97 103 105 101 95 93 100 112 124 135 145 153 157 159 162 166 169 171 169 157 132 96 58 22 -11 -42 -60 -59 -38 -7 28 63 88 92 71 34 -1 -23 -31
6148 -31 -33 -34 -31 -19 1 21 38 56 83 114 134 131 109 77 47 29 32 50 68 70 60 49 46 49 55 65 84 107 123 126 119 110 100 82 52 16 -16 -46 -75 -102 -122
6131 -122 -128 -119 -100 -76 -47 -16 14 38 45 33 8 -19 -45 -73 -102 -124 -129 -117 -96 -73 -51 -36 -28 -22 -10 12 43 74 95 106 110 112 113 110 97 83 74 73 71 63 53 41
6114 41 22 -3 -26 -35 -32 -27 -19 -5 12 20 15 9 20 50 83 102 103 93 81 72 70 75 86 95 98 96 94 92 86 69 44 19 4 1 5 12 19 23 26 26 23 19 14 6 -6 -19 -20 -1 29 55
6094 55 66 64 59 59 65 79 98 113 113 97 72 48 30 19 19 32 54 74 83 83 83 86 89 83 67 47 35 37 48 56 51 35 17 6 4 6 16 35 63 91 113 125 131 135 140
6076 140 146 147 137 117 94 74 60 47 31 18 11 9 3 -9 -22 -27 -23 -17 -17 -22 -23 -10 11 31 35 27 15 9 10 17 30 47 63 73 73 68 63 64 66 63 52 36 20 8 -1 -9 -13
6057 -13 -13 -13 -17 -23 -27 -26 -16 1 22 36 32 10 -15 -32 -38 -36 -30 -27 -31 -46 -67 -85 -90 -80 -58 -29 -2 12 13 7 8 20 36 44 41 33 27 28 32 39 51 68 82 85 75 61 51
6038 51 48 51 59 71 83 89 83 69 53 45 47 56 67 76 84 85 78 67 59 56 57 62 76 96 114 124 127 132 144 158 171 176 173 161 145 129 112 96 83 72 57 35 14 5 6 6 4
6020DNJ8K1J0pj6j1%J2J7J6J2J3J4J0Klkkqj9k5k4j8j1njNJ1J4J4J2J7K2K5K2J5QkqqjQJ1
6002A67J0J2J3Ork0k5j9j1oqj6k1j8rmlm%QJ6K6L4L2J8lk1k8k3j3lJLJ1K1K4J4mk0l2l6k8
5985C2qJ7L2L2J7Jj6l2l9l4j7kPQKjkk%joj5k1j6kJ6K5K2Nj1k7l3k9k1j4qm%LNJ4K3L0K3N
5967d2j1rJ1K9L3K2PJjMRJ5J8J6Oknnmorj2j0qokKLjrk0k9l6l5k7j4mKQJ6K5K7K0RkomMJ4
5947a8K0K3J9Qpj5oJ0J9J0nj4j6j7j9j6lQJ0M%MQRMKLLkj1j6k0j9j9k1k3k4j7nJ2K4K8K6K1
5930c8J4J0RQMoj2j2kJ0K1L0L6L5L4L3K8J7jj6k0j7j2nMJ4K1J9Mj4k8l2k8k1j1lKMQJ3J2j
5913A11j4j7j3n%MN%j0j7j4qkKQJ5K3K5J9Nrj4qKJ4J9K1J4Nknj1k2k9k9j9rnqj2j2oMJ4K0
5895C0J9J6J4J3RLrj9j8pORQJ2K3L0K5Pj0k3l0l4l3l0k2j4JJ5J8J2JolJPQQNPJ4K4K6J6OL
$$ plain form
6020 4 9 27 48 58 51 35 24 24 36 53 69 81 94 108 118 120 117 115 113 105 86 61 37 19 8 3 2 7 18 32 46 58 75 97 122 144 159 167 165 157 149 148 156 167
6002 167 177 189 202 208 199 179 154 135 124 118 110 94 73 55 46 42 39 35 35 43 59 85 119 151 169 166 145 117 94 81 78 79 82 93 114 138 152 148 128 96 60 32
5985 32 24 41 73 105 122 123 107 75 36 2 -15 -17 -10 -2 0 -1 -3 -5 -5 -6 -12 -27 -48 -64 -66 -50 -25 -3 2 -9 -36 -69 -98 -119 -133 -141 -145 -145 -142 -137 -123 -100 -70 -47 -42
5967 -42 -53 -62 -51 -22 11 33 40 41 40 44 53 68 86 102 108 106 101 96 92 86 77 65 55 47 41 39 41 44 43 34 14 -15 -51 -86 -113 -127 -131 -129 -121 -105 -80 -53 -33 -24 -26 -32 -36 -32 -18
5947 -18 2 25 44 52 45 30 24 34 53 63 58 44 28 11 -8 -24 -27 -19 -9 -5 -5 -1 7 16 20 22 25 28 26 15 -1 -21 -40 -59 -80 -103 -127 -144 -149 -137 -113 -85 -59 -38
5930 -38 -24 -14 -5 3 7 1 -11 -23 -25 -15 6 36 72 107 141 174 202 219 218 202 182 165 153 148 152 166 187 206 210 196 168 136 108 87 76 73 75 79 87 100 112 111
5913 111 97 80 67 62 62 66 71 71 61 44 30 22 20 22 30 45 68 93 112 117 108 94 86 88 102 121 142 156 161 159 154 143 121 92 63 44 35 30 22 10 -2 -8 -4 10 30
5895 30 49 65 79 92 101 104 95 76 58 51 57 66 74 86 109 139 164 171 161 138 108 74 41 11 -11 -25 -24 -9 9 21 22 16 13 14 21 29 37 42 49 63 87 113 129 135 138
5877A38QJ1P%kNROlj4k1j8qk%llmpj1rLJ1J2QNLpk1k7k0lJ6K5K6J3ok1k5j5LJ7K5L0L4L3K3
5858B21Jj7k4k0j1kKKlj1j7j4oOJ6J6RKkjJKlj7l5m7m7l4k0mJ0J9J8J5K1L7M7M4L1K1Rpk2
5841A86l2l0k1j1%J2K4L0K6J4kj6j9j6j2qjJ2K1J9Prj8k1k2k6l3l6k8j5nmj5k4k5j8lJ3K3
5825h3K3J9J3J2J3J2J6J7J5J3J2J1RLpj5k1j9oJ3K5K0OllJK%lpj1j5k0k4k4j8oLNlprlOJ4
5807b4J4ROJ3K0K2J7J1NkplMQOJjmokNJ0QNLkj3j9j4kRJ6J5Qpk3k8j9kJ4K0J4Lrj3j2pjLN
5787E4K%MJ2J4J1Lmqn%Lkj3k2k4k5k6k6j6mQJ5J5J4RMkoj0p%MNJlmllnj2j9j8oOJ6K5L1L2
5767A5K9K6K4J8jk1k3rORJpj4k1k4k2j7j0qrj2j2qKJ2J4ROPJ3K0K1J6P%jJKLRJ9K8K9K1Qo
5749A50j1qJOKnj0rqo%PRNKLMKmqrj4k2k2qJ2K9L3K4Rrk1k5j9j2mjKMLmj7k3j3OJ8J4Joom
$$ plain form
5877 138 146 157 164 164 162 167 176 182 179 165 144 126 118 116 116 113 110 106 99 88 79 82 93 105 113 118 121 114 93 66 46 43 59 84 110 123 117 96 71 56 59 76 101 131 165 198 221
5858 221 222 205 181 161 150 148 150 152 149 138 121 107 101 107 123 139 148 150 148 147 148 150 147 130 95 48 1 -33 -53 -57 -47 -28 -10 5 26 63 110 154 185 206 215 208 186
5841 186 154 124 103 92 92 104 128 158 184 198 196 180 161 145 133 125 124 136 157 176 183 174 156 135 113 87 54 18 -10 -25 -30 -34 -49 -73 -98 -116 -119 -106 -83
5825 -83 -60 -41 -28 -16 -3 9 25 42 57 70 82 93 102 105 98 83 62 43 37 50 75 95 101 98 95 96 98 98 95 88 77 62 42 18 -6 -24 -30 -27 -22 -25 -32 -41 -44 -38 -24
5807 -24 -10 -1 5 18 38 60 77 88 93 91 84 81 85 93 99 100 99 95 89 87 92 102 110 115 118 116 103 84 70 68 77 93 108 116 109 86 58 39 37 51 71 85 88 79 66 54 47 46 49 54
5787 54 56 56 60 72 86 97 100 96 88 83 83 86 84 71 49 25 0 -26 -52 -68 -72 -64 -49 -34 -20 -11 -7 -9 -15 -25 -32 -32 -28 -23 -22 -25 -29 -32 -35 -40 -52 -71 -89 -95 -89 -73 -48 -17 15
5767 15 44 70 94 112 111 90 67 58 64 73 74 67 53 32 8 -14 -31 -41 -49 -58 -70 -82 -90 -88 -76 -62 -53 -47 -40 -27 -7 14 30 37 37 36 37 39 42 51 70 98 127 148 156 150
5749 150 139 131 132 138 140 135 125 116 108 102 102 109 118 123 125 128 132 134 130 122 113 99 77 55 47 59 88 121 145 154 145 124 99 80 68 64 63 65 69 72 68 51 28 15 21 39 53 54 48 42 38
5728C8jKKlqmORMoj1j1j0j0j2j2pJJ1J5J0QRRMmq%J2K2K3J5jj7k3j7lOPLlnolQK6L9L2J3j
5708A48moj1k0k1j7rMK0K8K1R%oj7k8k9k2j3lRK2K7K3K1K4K3J1mrpqj2j7j7j2kRQlqJJ2J4
5690A29LjQJ8J5jj6j9j0KRQjj6k6k5j3OK1K5J2qk3k5j8j0nKJ2J7Oj4k5k0oLOJ2K1L2L4K7J5
5673A61KmmkjjJOJ5K2J7%j8k1pRJ6J4J2RPLmj8l4l6k2nlj5k3k5k0j8j1%POJjmrj2j3lPJ7K0
5654A8J9R%mljJOJ3J5Rjj0j2pLJ7L0L8L7K7J3%rj0qoqrj2j3j2j5j7k0k2k1j2MK2K7K2J5J1
5636A24RMlqj0j2j4j3qkKNNMMKmj5k2j9nQJ2Pjl%NLoj2mJ2K6K6J9J7K0K2J1qk6l7l6l2k5j9
5617Cj6j3nMRQNQJ3J2KllOJ4K5L3L0J7kj9l4m1l8j5RK8L4L4K7J0j2l1l9l6k8k0j0klqj4j1
5600g2%J3K1J9J2QJ1RJpj3j0nPJ8K9L0K3J4Onj5j9j5nKPNJkmqj5j9j4%J2K0K1J9J3Lpj3j4
$$ plain form
5728 38 37 39 41 38 30 26 32 41 45 39 28 17 7 -3 -15 -27 -34 -33 -22 -7 3 11 20 29 33 29 21 21 33 55 78 93 92 75 52 35 32 38 45 48 45 40 34 31 39 65 104 136 149 148
5708 148 144 138 127 107 86 69 60 64 84 112 133 142 142 136 119 91 62 40 27 24 33 55 82 105 126 150 173 184 180 171 164 156 144 127 110 98 96 105 113 110 102 103 115 129
5690 129 132 131 139 157 172 171 155 136 126 128 137 145 144 128 102 77 64 70 91 116 128 120 97 72 54 44 39 41 53 70 76 62 37 17 11 14 20 32 53 85 119 146 161
5673 161 163 159 155 153 152 151 152 158 173 195 212 212 194 173 166 175 191 205 217 226 233 236 232 214 180 144 122 117 114 99 76 51 31 13 2 2 9 15 16 15 11 2 -10 -23 -26 -19 -2 18
5654 18 37 46 46 42 39 38 39 45 58 73 82 81 71 59 52 55 72 102 140 177 204 217 217 208 198 190 184 176 167 155 142 130 115 98 78 56 35 23 27 49 76 98 113 124
5636 124 133 137 134 126 116 104 90 77 69 67 69 74 79 83 87 89 85 70 48 29 24 32 44 51 50 47 47 52 55 49 37 33 45 71 97 116 133 153 175 186 178 152 115 79 47 22 3
5617 3 -13 -26 -31 -27 -18 -10 -5 3 16 28 30 27 24 30 44 69 102 132 149 147 128 94 53 15 0 9 37 71 105 132 142 130 99 60 24 -4 -24 -34 -36 -39 -47 -61 -72
5600 -72 -72 -59 -38 -19 -7 1 12 21 22 15 2 -8 -13 -6 12 41 71 94 108 114 109 94 75 60 55 57 64 69 70 68 64 56 41 22 8 8 20 40 61 80 93 96 89 76 62
5582F2j1j0okMPMpj4j4kRJ2PJMRJ3J6J6J5J0QJ2J4Qpj7j8j2j0j3j4j0pqnNJ5K5K7K8J9Jk0
5564A44l4l3k3j1%J2K4K6J7kj9l0k8j6jJ3K5L6M4M3K7Rpj4j5j7j4j0jLMmj7k9l0j4LJ1RNL
5547H9lj4k3k0pLKoj0nLLJjMJ0J2J1J2J7K3K4K2J5QLjoj6k3k5j9rKQMnrmKJpj0j0j3k2k1n
5528a5J8L4L3K0Kj4k0j3mkpj1pKONlj2j7j9j1lKL%kjOJ6J7J3PRJ4J0jj2j1%J1J4QkpnNJ6K2
5509I4K1J9J7J2LllMQKljJ0K0J7QJnj0k0k5j6lM%onKPOKnj2j5pQK1K4J8RNOQPJoj0j3j9k2
5489A55k0j6j5j4pLJ4K2K8L2L0J9J0Lkqj1rnmlkmpn%ORRRPJJJ1K0K2K2K9L3L2L4M8O8Q4J11
5471G40J71K51L36M39N75O53N20J35l31o25o48n11l71k86k27j78j43j21j00p9o5n6m0j6JJ0
5460C4J4J8K0J7J7J5J0KnpnKJ6K7K2Nj3j6j1lkoj0j5j5j7k1k3k4j6pLJ1J5J7J3P%oj0oNJ3
$$ plain form
5582 62 51 41 35 33 37 44 48 41 27 13 11 20 32 39 40 44 53 66 82 98 113 123 131 143 157 165 158 141 123 111 101 88 74 64 57 49 44 49 64 89 116 144 163 164 144
5564 144 110 77 54 43 43 55 79 105 122 120 101 71 43 27 26 39 64 100 144 187 214 223 216 202 187 170 156 146 145 148 152 148 131 102 72 58 61 72 81 86 89
5547 89 86 72 49 29 22 25 27 21 11 6 9 12 13 12 16 26 38 49 61 78 101 125 147 162 170 173 172 166 150 127 102 83 74 76 84 88 83 74 70 72 73 66 56 46 33 11 -10 -15
5528 -15 3 37 70 90 92 78 58 45 41 39 32 21 14 16 22 27 24 12 -5 -24 -35 -38 -36 -33 -33 -35 -36 -30 -14 3 16 23 32 46 56 55 43 32 32 43 57 65 63 56 51 56 72 94
5509 94 115 134 151 163 166 163 160 164 172 174 171 170 180 200 217 225 226 221 211 191 166 150 147 151 151 145 140 142 149 155 157 152 140 125 118 126 147 171 189 198 203 209 217 224 225 219 209 196 177 155
5489 155 135 119 104 90 83 86 100 122 150 182 212 231 241 244 242 234 223 214 209 205 202 200 196 189 184 184 190 199 208 217 224 225 226 237 257 279 301 330 363 395 429 477 545 629 740
5471 740 911 1162 1498 1937 2512 3165 3685 3820 3489 2864 2216 1705 1334 1048 821 643 500 379 279 200 135 79 39 23 24 34
5460 34 48 66 86 103 120 135 145 147 142 135 130 132 148 175 197 202 189 173 162 159 157 151 141 126 111 94 73 50 26 10 3 6 17 32 49 62 69 69 63 53 47 52 65
5443F5J2Jj2k0k0j7rJRJ0J0RQMoj3j2mJkj1j4j6j7k1k3j7jJ9L6M8M7L5J5JMJ7K4J5mj6j7j3
5426A06j1rokLJ1K0K0Qoj3rpqj1qkKjrj4j1%J1J4PjnpoomLQJ1Pkj1j5j3ojLNQJ1J5J7K1K2
5406A29J7Omj1j0j0j2j2j3j1j4j6j9k0j7j5j3j1j0kJ3K9L2K5J5J1J4J5Qlj2j5j0nnj0oPJ9
5390E4J6jj6j9j5j0ojKLQJ3J8J5PkpqplLPRLqj8j7j1rj4k3k3j4kJ1K4L6M5M3L2J6OKJ%mj5
5371A21l1l8k6oMjj2j1kJ3K6L2L2K1Noj1rj0j0j1j1j3j4j3j3qkPJ0NJ%J%kml%OJ9K8K3Nj2
5353H0k0k1k1j8j1ponqj1j1oMJ0QMJLMMQJ4J6K0K2K1J4%j1j2j0rpkLMLMJ0J8J7Kj8k9k2JK1
5334E1L1K7K1J2Kqj1j2j2j0kRJ7J9J9J8Qnj4j0kL%%KLjm%NNjnpj1k0k7k6j8j0rj0olorj2k
5315b1J3K5K8J7Nmqj2j5j3jJ1J1Lj0j5j5j5j3oPJ2PmmQJ7K2J9J7J6J0%opkLJ0J4J4J3J7K2
$$ plain form
5443 65 77 78 66 46 26 9 0 1 10 20 30 39 47 51 45 32 20 16 17 15 4 -10 -26 -43 -64 -87 -104 -105 -86 -50 -2 45 80 95 96 100 117 141 156 152 136 119 106
5426 106 95 86 80 78 81 92 112 132 140 134 121 112 105 97 86 78 76 78 77 68 54 43 43 54 68 75 74 69 62 56 50 46 49 57 68 75 73 62 47 34 28 27 30 35 43 54 69 86 107 129
5406 129 146 152 148 137 127 117 105 93 80 69 55 39 20 0 -17 -32 -45 -56 -66 -68 -55 -26 6 31 46 57 71 86 94 91 79 64 54 49 44 34 28 35 54
5390 54 70 69 53 34 19 9 3 2 4 7 15 28 46 61 68 66 59 51 44 41 44 51 60 63 55 37 20 9 0 -14 -37 -60 -74 -76 -65 -41 -5 40 83 115 131 137 139 140 140 136 121
5371 121 90 52 26 20 24 23 11 0 -2 11 37 69 101 122 127 121 110 101 91 81 70 59 46 32 19 6 -2 -4 3 13 18 19 19 20 20 18 14 11 11 17 36 64 87 92 80
5353 80 60 39 18 0 -11 -18 -24 -29 -37 -48 -59 -65 -61 -51 -43 -39 -38 -35 -31 -27 -19 -5 11 31 53 74 88 88 77 65 55 46 39 37 40 44 47 51 61 79 96 98 80 51 29 30 51
5334 51 82 109 130 142 144 136 125 113 101 91 89 98 115 134 153 171 179 174 160 150 148 151 151 151 153 156 155 151 151 156 161 160 155 148 137 117 90 64 46 36 27 17 11 8 2 -7 -19 -21
5315 -21 -8 17 45 62 67 63 55 43 28 15 14 25 36 39 29 14 -1 -16 -29 -35 -28 -16 -9 -13 -17 -9 8 30 49 66 82 92 92 86 79 77 80 90 104 118 131 148 170
5298A70K2J3%rj8l0m3m3k6jJ4J5Mrj6j4omnkNJ4J9J2MkJNMmokLjj1j8j2rj5k4k0jJ9K7K1O
5279B7j0j5qMOkj4j9j3JJ1J7J5J4J4J4J2Mrj9k3j5nNJ1J9K4K1Ppj2mOJ3J4RJmokjnrj1pJM
5260E4KkkOJ0%j8k6k0kJ0RJqj0kJ0J1Lrj1mPJ5J8K1K2K1J9J5J0Lpj7j9j2ljoj1j2j3j8k4k0
5242a0pJ3K5L3K8K0J0Njj0j8k3j9j3j0j1j2j1lQJ8K5K8K7K7K3J3Kqj4j4j0ljpj2rNJ9K1Pr
5225A22j8k2j7j0%NNKKORRNjnrrqnKOMjjLRQMNJ1J5R%mnqj6k5l0k6j5kRJ4Rkj1rQK6K9J6L
5204I6JPQOMRJ2J1P%j2k3k8k8l0l4l5l2k2rJQNlj2j4oJ1K9M0M1L8L4K8J5jj3j5oNJ7K5K9K7
5186A91J7Omj1j3j4qk%mj0j2rrrokkj0j8j2LJ5J8J0Jlllknpppmlnj1j6j7j3j2j4j0JJ3J4O
5167bjnoj0qKJ6K7L1K0Jj8k7k3j5nLQRJ4L2M8M7L0J0JKJk%kj0k3k6k5k4l0l6l6l2k3j1OK4
$$ plain form
5298 170 192 205 205 196 178 148 105 62 36 35 49 64 68 59 43 29 23 19 14 12 17 31 50 62 66 64 65 70 74 70 64 62 65 64 53 35 23 14 -1 -25 -45 -46 -27 0 21 27
5279 27 17 2 -6 -2 4 2 -12 -31 -44 -43 -32 -15 0 14 28 42 54 58 49 30 7 -8 -13 -8 3 22 46 67 74 67 55 51 57 70 84 93 94 90 84 82 81 76 67 56 49 50 54
5260 54 56 54 52 58 68 68 50 24 4 2 12 21 22 14 4 2 12 23 26 17 6 2 9 24 42 63 85 106 125 140 150 153 146 129 110 98 95 94 88 77 65 52 34 10 -10
5242 -10 -17 -4 21 54 82 102 112 117 116 106 88 65 46 33 23 12 0 -11 -14 -6 12 37 65 92 119 142 155 157 149 135 121 111 108 107 100 88 79 84 103 124 131 122
5225 122 104 82 65 55 55 60 65 67 69 75 84 93 98 97 92 83 74 66 61 63 69 73 72 71 74 83 91 95 100 111 126 135 135 131 126 118 102 77 47 21 6 4 13 27 36 34 23 14 22 48 77 93 96
5204 96 97 104 112 118 122 131 143 154 161 161 149 126 98 70 40 6 -29 -61 -83 -92 -91 -83 -78 -81 -93 -107 -113 -102 -73 -33 8 46 80 108 123 122 109 94 88 93 110 135 164 191
5186 191 208 214 210 199 186 172 164 162 162 158 148 136 127 118 109 103 101 99 89 71 59 62 77 95 105 106 103 100 97 95 90 83 76 69 65 62 57 46 30 13 0 -12 -26 -36 -35 -22 -8 -2
5167 -2 -3 -8 -14 -24 -32 -30 -14 13 44 64 65 47 20 -3 -18 -23 -20 -12 -3 11 43 91 138 168 178 179 181 182 180 180 178 168 145 119 94 70 40 4 -32 -64 -87 -98 -92 -68
5149f8L5L3K4J4J5K3K8K3J4Mmj8k7k4j1klpj0j5k2k1rPJ7K0K4K3J8J0POOQJ1J1Nmo%QJ6J6
5132A75J2Knm%jj2k6l3l2j9%J5J8J3J0J3J9J7Oj1k6l2k8j8q%NPONQRKorm%oj1pLJ0J3J4J7
5114A01J7J5J7K2K8K6K0Rlj3j9k0j9j3j0opokOJ0P%ppLJ2J5Rlj0j6j8j9j1JP%j3k3l0l3l0
5096a3j7MJ8J7J2RROpk1k5k3j7j4j6j8j2KK2L5L6K0NjNJ4J7J0K%%krj0mMRJ3J6J6J0L%J%j
5078A05jj%KRJ6J5QLOJ2J6J5J3RLpj5k2k4k1j5njJJPJ3K0K1J8Rmj4j1jJqj9k0oRJ2Mnj2j4
5059A22j4rjJ0K3L3L8L0J0j2k7l4l3k8k3j6oPJ4J2P%klrj5j8j5oLJ1J5J8K0K0J7J1Njnj1j6
5042A22j5rljj%jkjMJ3J7J0%nKJ5K3K5K1J1lj9k9k5j5j0omKKpj5j6j2rj1j4rkNRRQKlqnkK
5022D0LLMOJpj6k1k1j6oKL%lLRJ0PNPRQPJ2K1K9K7J8QKJKMLmj3k4l1k9j4MJ4J4OJ%oj3j4n
$$ plain form
5149 -68 -33 0 24 38 53 76 104 127 141 145 141 123 96 72 61 59 56 49 39 24 2 -19 -28 -21 -4 16 40 63 81 91 98 104 110 118 129 140 145 141 135 135 143 159 175
5132 175 187 189 184 180 180 179 167 141 108 76 57 57 72 90 103 113 126 145 162 168 157 131 99 71 53 45 45 50 57 63 68 76 85 87 81 72 68 68 62 51 44 47 57 70 84 101
5114 101 118 133 150 172 200 226 246 255 252 239 220 200 181 168 158 152 145 139 137 143 153 160 160 153 146 149 161 176 185 182 172 156 138 119 108 109 116 116 103 80 50 17 -13
5096 -13 -30 -26 -8 9 21 30 39 45 38 17 -8 -31 -48 -62 -78 -96 -108 -106 -84 -49 -13 7 12 11 16 30 47 57 59 59 59 57 48 38 34 38 47 60 76 92 102 105 105 106 106 105
5078 105 104 103 103 105 114 130 145 153 156 162 174 190 205 218 227 230 223 208 186 162 141 126 121 120 121 122 129 142 162 183 201 210 206 192 181 180 181 173 154 134 128 137 149 153 148 136 122
5059 122 108 99 98 108 131 164 202 232 242 230 203 169 136 108 85 69 63 70 84 96 103 103 101 98 89 74 56 41 35 38 49 64 82 102 122 139 150 155 154 149 138 122
5042 122 107 98 95 94 93 93 92 90 89 93 106 123 133 133 128 130 145 168 193 214 225 222 203 174 149 134 124 118 114 116 118 111 96 80 68 59 48 34 25 23 28 37 46 54 56 53 45 40 38 40
5022 40 43 46 50 56 57 50 34 13 -8 -24 -30 -28 -25 -25 -28 -25 -16 -6 1 6 13 22 30 37 49 70 99 126 144 152 154 155 157 161 164 160 147 123 92 63 49 53 67 81 87 88 88 82 69 55 50
5002E0MOLKM%qj1nLJoqJJ1J6RJnplK%pj2j1prj5k3k2j2kMLNRJ1OJkLOOLMLjj2k6k7j3NQmj6
4979h4oJ7L6L7K6K1K1J8Ork0k6k5j8j1nmnomnmjPJ7K4K6K6K3J4Lnnklqj2pMJ0RLlqj4j5j1
4960B2%J1J5J1OQJ3J5Ooj3j1mmqj2oKQQRJ6K2K1Qj0k2k3j4njLKKLM%qj6j7j0kNJ4K9L7L2J6
4941A56Kmpj2j3rlknrj3k0k5k2rMJ6L0L7L2J4lroprlJ2K9M1L8K7J1JKJ6K8L2K7J7J0OPMkr
4923C98kK1N3P9R5J02J12J33J75K34K97L62M35N01N07L86J28j85m32n33n08m24l37k69k11
4913A117j60j19r0o9n1m0l6l9m2m8n8p0o9m9k0KJ0Okpj0pKRJ0J1J4K1K4J6Jj5k1j7j0pnlm
4897A75j0j5j4oNJ4J8J4Kprljnrn%JloomJQJ6K1J7J0LmprmMJ4J9K0J6J1QOKmqoMJ4J6J1RR
4876C23Pnj7k1j7j3j2j1j0j1rkK%qj2j2j0lQK0K7K8K7K5K4K7K8K1J9L0N6P7R2J06J32J60K01
$$ plain form
5002 50 54 60 63 65 69 69 61 50 45 48 49 43 35 36 47 63 72 73 68 61 58 60 60 53 41 30 23 14 -1 -24 -46 -58 -60 -56 -53 -48 -39 -28 -22 -21 -23 -20 -14 -8 -5 -1 2 1 -11 -37 -64 -77 -72 -64 -68 -84
4979 -84 -90 -73 -37 0 26 47 68 86 92 83 63 37 12 -6 -17 -22 -26 -31 -37 -41 -46 -50 -51 -44 -27 -3 23 49 72 86 89 84 79 77 74 66 54 47 51 61 70 73 70 62 48 33 22
4960 22 22 33 48 59 65 73 86 101 107 101 88 77 73 69 61 49 43 45 53 61 70 86 108 129 137 127 105 82 68 63 62 65 67 69 72 76 76 68 52 35 25 23 28 42 71 108 140 156
4941 156 158 154 147 135 122 113 110 108 103 94 81 61 36 14 5 9 25 55 92 124 138 135 126 120 113 104 101 113 142 183 221 248 259 260 262 278 306 338 365 382 392 398 405 409 407 398
4923 398 396 417 470 549 644 746 858 991 1166 1400 1697 2059 2494 2995 3502 3888 4016 3831 3399 2866 2358 1934 1597 1328 1117
4913 1117 957 838 748 679 628 588 552 513 471 423 365 295 226 177 157 159 169 175 173 166 156 149 151 160 170 181 195 216 240 256 257 242 221 204 194 187 182 179 175
4897 175 165 150 136 130 135 149 167 181 183 176 167 164 163 158 149 144 144 145 142 136 130 126 127 135 151 172 189 199 202 198 191 182 178 182 196 215 235 251 262 270 276 278 274 266 260 264 278 294 305 314 323
4876 323 330 325 308 287 270 257 245 234 224 213 204 202 204 204 196 184 172 162 159 167 187 214 242 269 294 318 345 373 394 413 443 499 576 668 774 906 1066 1267
4861A267K72L73M93O64R06J100R88M31l56r39j078q97o57m82l52k47j90j72j51j15q8o8l7
4852F65mLj1j4poqPK9L6L2L4L3K0J4L5O4P3P4Q3Q7P5Q1J24J69J81K08K86L79M68O29R17J294
4839F050J771K455L182L255K005k88k388l249k932k221j652j231q61o03m88m05k93k05j76
4831A726j38p4m6o9p8n4m2n6m5jJ5MJ6N2O1N1P7J28J41J25J40J68J51J29J78K71L29L95N64
4819D118P81R55J193J669K347L174M380N942O764N224J106l555o235o260m930l655k760k020
4812H238j430j106r25p11n12m22l67k52j50j45j61j17p5r1j03n3j0k6k8K5O1M0L6R2J24J02
4802B034J12J82K14J87K08L11L85M18N49P98J026J260J725K475L386M612O358P822P102L149
4794D4313k451o591p587o362m755l580k664j888j397j143q96o28m78m33l53k44k14k35j98
$$ plain form
4861 1267 1539 1912 2405 3069 3975 5075 6063 6494 6138 5199 4121 3224 2567 2085 1733 1486 1296 1124 973 858 770 702 665
4852 665 661 664 653 639 632 626 618 625 654 690 722 756 789 809 823 858 922 995 1069 1152 1239 1314 1395 1519 1688 1869 2077 2363 2742 3210 3839 4756 6050
4839 6050 7821 10276 13458 16713 18718 18430 16042 12793 9861 7640 5988 4757 3896 3293 2805 2400 2107 1902 1726
4831 1726 1588 1514 1468 1399 1321 1267 1225 1169 1124 1123 1138 1142 1158 1210 1271 1322 1399 1527 1668 1793 1933 2101 2252 2381 2559 2830 3159 3554 4118
4819 4118 4899 5854 7047 8716 11063 14237 18617 24559 31323 36547 37653 34098 27863 21603 16673 13018 10258 8238
4812 8238 6808 5702 4777 4066 3554 3132 2765 2513 2363 2218 2057 1940 1865 1774 1671 1618 1608 1582 1554 1579 1640 1680 1716 1808 1932 2034
4802 2034 2146 2328 2542 2729 2937 3248 3633 4051 4600 5398 6424 7684 9409 11884 15270 19882 26240 34062 41164 44313
4794 44313 41862 35271 27684 21322 16567 12987 10323 8435 7038 5895 4999 4371 3893 3460 3107 2863 2649 2414 2216
4786B216j23j06j23r1m2n0p5l8J6J4LN3J12J12J01J46J80J50J37K19L12L44M13O03Q14R88
4776F285J303J889K639L559M903O385O584M106n06m765o554n961m536l378k537j807j266r79
4768E364p91n84m36l91l52k67k11k15k07j59j34j47j32p0l4m4m1j0%j2LM5N7M2N7R7J02P5
4757A605Q1J17J35J55K37L57M54N85Q46J210J629K214K974L373K603N45j784l129l154k500
4749H553j860j412j047p57n88m86l75k69k12j77j28q8r1j06r4p3o5n3k5koj6j2rk6l8k5%J8
4737E31L6N5N4L3K1L7N5O1P0R1J16J52K28L44M79O57R09J122J020M53l48r43j090r14o77n05
4727B047l81k80k10j74j42j06p6n8m3l2l6m3l8k0mKJknqnmj3k9l7l2k0j4j2j1j2j8k1j3KK1
4713A74L3L2K1Pknrj4j7j4rn%MPLkrj8k9l4k3JK3L2L0K4J5Nlpnkl%OJ1Krj2pmrj2nNJ0O%p
$$ plain form
4786 2216 2093 1987 1864 1773 1731 1681 1606 1568 1584 1598 1601 1654 1766 1878 1979 2125 2305 2455 2592 2811 3123 3467 3880 4483 5297 6285
4776 6285 7588 9477 12116 15675 20578 26963 33547 37653 37147 32382 25828 19867 15331 11953 9416 7609 6343 5364
4768 5364 4573 3989 3553 3162 2810 2543 2332 2117 1910 1751 1617 1470 1338 1268 1234 1190 1149 1139 1139 1127 1130 1175 1232 1274 1331 1428 1530 1605
4757 1605 1686 1803 1938 2093 2330 2687 3141 3726 4572 5782 7411 9625 12599 15972 18575 19120 17336 14207 11053 8553
4749 8553 6693 5281 4234 3477 2889 2403 2028 1759 1547 1370 1242 1154 1063 957 863 790 725 672 647 645 639 623 611 602 576 538 513 513 531
4737 531 567 622 676 709 730 767 822 883 953 1044 1160 1312 1540 1884 2363 3020 3929 5051 6071 6524 6176 5233 4143 3229 2552 2047
4727 2047 1666 1386 1176 1002 860 754 678 620 577 545 509 466 428 408 404 406 407 405 400 392 387 383 370 341 304 272 252 238 226 215 203 185 164 151 153 174
4713 174 207 239 260 267 265 260 251 237 220 206 197 192 192 196 203 206 204 195 177 148 114 91 92 115 147 177 201 216 221 218 211 206 204 201 201 207 218 220 211 199 192 188 179 167 162 167 177 183 183 176
4692A76j4j4pLLlmKRJ0J0ROLKRJ5J5J0MLok1l8m4m3l6k4rMQMmpmKJ1J9K3J7Lqj0kJ2K2K1J2
4673A49Jnj0j4j9k3k2j5qoj2j6j2QK8M1M0L0K3K1J9J2Jrj3pjJjqj2j0pjjlmnnj1j7k0j8j3
4656D6j1pMK2L9M1K8Qlmnj3k0k2j8j5j3oNQ%j1j6j5j4j2kJ5K9K8J4mj4j1jQJ2RMmroNJ8K1
4637A08J1jj0j4j6j6qJONQJ9K8K7J9J0PJj2k5k2qPJ1J1J1J4Qpk1k6k1j3pJJ1J9J9J2Lqj7k2
4620A03k0pMRPL%oj7k3k2j4lOJ6J9J3Lmj2j9k3j9j3plQJ9K2J2nj9k3k5j5KK2L6M3M0L1J7%
4603A36j7k7k8k2pRK0K9K8J9%j8k0rPJ6J5R%mjPJ1J0RPNLORQ%j1j4j3j4j9k2k1j6j2n%jqj7
4584C7k4k7k7k2j5jJ5K6K9K3J3MlnlKQQKnppmjJOJ0J2J4J1P%nm%PJ0J0N%mnomjMRQKoqj1j3
4563F5j9k1j4mMRJ2J0Ojqj3pPK4K9J9NkKPJ7K6L0K2Mj6l2l9l3j6kkj3j7nQJ0MJMOJl%NPKr
$$ plain form
4692 176 162 148 141 144 147 144 140 142 151 161 171 180 186 189 191 200 215 230 240 244 247 241 220 182 138 95 59 35 26 30 38 42 38 31 27 29 40 59 82 99 102 94 84 82 94 116 137 149
4673 149 150 145 135 121 102 79 57 42 34 28 16 0 -12 -4 24 65 105 135 158 179 198 210 211 202 189 182 181 182 181 173 161 151 144 143 142 139 135 130 125 114 97 77 59 46
4656 46 35 28 32 54 93 134 162 170 167 163 158 145 125 103 85 70 57 51 56 64 64 53 37 22 8 -4 -6 9 38 66 80 76 62 51 50 58 70 79 83 79 70 64 69 87 108
4637 108 119 118 108 94 78 62 54 55 61 66 74 93 121 148 167 177 184 185 173 148 126 118 125 136 147 158 172 180 173 152 126 105 92 85 86 97 116 135 147 150 142 125 103
4620 103 83 76 80 89 96 99 99 93 76 53 31 17 14 20 36 55 68 71 67 55 36 13 -6 -19 -26 -29 -21 -2 20 32 27 8 -15 -40 -55 -53 -31 5 48 88 119 136 136
4603 136 119 92 64 42 35 44 64 93 121 140 140 122 102 93 100 116 131 140 140 136 135 142 153 163 172 179 184 187 193 202 210 210 199 185 172 158 139 117 96 80 68 63 63 62 54 37
4584 37 13 -14 -41 -63 -78 -79 -64 -38 -9 14 27 31 28 23 20 22 30 38 40 35 28 21 17 16 17 23 33 45 59 70 77 77 72 68 68 75 85 95 100 100 96 91 85 81 80 84 93 101 103 97 89 78 65
4563 65 46 25 11 7 11 20 32 42 48 47 39 26 19 26 50 79 98 103 101 103 110 127 153 183 205 209 193 161 122 89 73 71 69 56 39 34 42 52 56 57 61 67 68 65 65 70 77 79 70
4544G0k1k8j8NK4K7J1qj5oMOlj7k7k3j1QK1K3K1J8J6J1NJJjprLK2L3K8J3joplKOPJmj0j5j9
4525A28j5rlnj3k0k1k0j6nJ0J8J5NJMPOKNJ0QKj%%rj8k0j1qj1j5j1kPNjroOK3L3K8J6P%j1
4505H6k7l1j9MJ6J7J1J1J1Noj3j5j3j5j6j2nLRJ5K1K6K3J5OMPJ6K5L2L0J6nk4l5l6l0k1j8
4489F8k2k8k2qNRQPLnj6j8mJ5K7K9K4J9J8K0J9Rnj8k4k7k5j7nRJ9K2J9Nj4k6k4j3JQJ5J9K4
4472A00K6K3J4Kj1j7j9j7j6j5j6j6j2j1j1rnOJ6K3K0Rpj9k3rRK1K1J5J4J2Nj0j7qRK0J6Kl
4456A12LJ6K5K4J6kk0l2l2k5j7j3qLJ1J2OKLNOJ1K2L0K9J7Koj1j3j6j7j8j7j7j4pJMLmj2j8
4438D4k0j8j4j8k0j7j0kkpq%J3K5L1L3L1K0RNRJ3Qkj0j2j3j1qJRJ5J4Nqj6j4rmJQJ4J4Nlp
4420G4rj3j5rMJ5J9J8J1lj6j9j1kQJ4J9J9J8J8J9J3jj2j2nKMjj0k0k8k6j3jNPJ3K1K2J3kr
$$ plain form
4544 70 49 21 3 8 32 59 70 62 47 41 45 51 48 31 4 -19 -30 -22 -1 22 43 61 77 88 93 94 95 94 87 78 81 103 136 164 177 176 170 163 160 162 168 175 176 172 162 147 128
4525 128 113 104 101 96 83 63 42 22 6 1 11 29 44 49 50 54 61 67 69 74 84 92 94 93 93 93 84 66 46 35 27 16 1 -10 -12 -5 0 -1 -10 -16 -10 13 46 74 90 97 97 86
4505 86 59 28 9 13 29 46 57 68 79 84 78 65 50 37 22 6 -6 -11 -8 1 16 37 63 86 101 107 111 118 134 159 191 221 237 232 208 173 137 107 86 68
4489 68 46 18 -4 -12 -7 2 10 17 20 15 -1 -19 -23 -8 19 48 72 91 109 129 148 157 152 134 110 83 58 41 36 45 64 86 105 110 96 70 46 33 34 42 57 76 100
4472 100 126 149 163 165 154 137 118 101 85 70 54 38 26 15 4 -5 -10 -4 12 35 55 64 57 38 15 6 15 36 57 72 86 98 103 93 76 68 77 97 113 115 112
4456 112 115 131 156 180 196 194 174 142 110 85 68 55 47 50 61 73 79 81 84 89 95 106 128 158 187 204 206 200 189 176 160 143 125 108 91 77 70 71 75 78 74 62 44
4438 44 24 6 -8 -26 -46 -63 -73 -75 -77 -84 -92 -92 -79 -54 -23 10 41 61 70 75 84 97 105 103 93 81 68 57 49 50 59 74 88 93 85 69 55 46 42 43 51 65 79 84 81 74
4420 74 65 52 37 28 32 47 66 84 95 92 76 57 46 44 52 66 85 104 122 140 159 172 171 159 147 142 144 148 147 137 117 89 63 50 49 54 61 74 95 117 130 128 119
4403A19qnoqnLJ2J6J4Qmj6k0j4lQJ5J4Q%lkKLLMLKKNLrk3l3l7l4k5j0J0J9K1J7J3Qkj1j6j4
4383B4j3j2j6j3nQJ7J7J3OJnj2j5j0%J0J2J4J3RMjrj8k2k2rMJ2J6J5J5J4J2Q%j0j9j9j1kK
4366CLNPOJjNQNmj0ommrj3j4j0%PJ2J3J2QJj0j8j5lPRRJ2K1K3J3ok3l4l0j9pklk%JJNK1M0
4346A1N0L8J9ONMjj0j7k0k3k3j8j0kJLMJmj2k0k3j1J0K9L3L3L1L2K7J2nj5j8j5j2qopj2j5
4329D2j3j3j6j5oJ7L5M0K8J1KLPJ0J5K0K2J7O%kkqj7k1j8rJJpj7j9j0MJ6J7J3RNlj5l1l9l4
4311B6k3rmkjknj0j3rolkKJ2K6L6M2L7K6J4J1J7K5K6J9Rmk0l5m8m7m2l4l1k8j7JJ9K9L1L0
4294D3K5K1J1%rrMJ9K4J8Okmqj4k1k2k1k0j8j2omqj3j4j0lNJ0QKqj9k3j7jJ7L1L4K9K1J2M
4276E8koj1j7k2j7nOJ0O%LJ2J8J4LoqkMPNMNRPnk2k7j3J2L0L7L3K4Rmrpnj2k2k6k3k0j9j6
$$ plain form
4403 119 111 106 100 92 87 90 102 118 132 140 136 120 100 86 83 91 106 120 128 128 125 123 125 128 131 135 138 140 142 147 150 141 118 85 48 14 -11 -21 -11 8 29 46 59 67 65 54 38 24
4383 24 11 -1 -17 -30 -35 -27 -10 7 20 26 27 22 10 -5 -15 -15 -5 7 21 34 43 47 46 37 19 -3 -25 -34 -30 -18 -2 13 28 42 54 62 62 52 33 14 3 1 3
4366 3 6 11 18 24 25 24 29 37 42 38 28 22 18 14 5 -8 -22 -32 -32 -25 -13 0 12 20 21 11 -7 -22 -25 -18 -9 0 12 33 56 69 63 40 6 -24 -43 -50 -52 -55 -57 -57 -56 -55 -50 -29 11
4346 11 61 99 118 124 129 133 132 122 105 85 62 39 21 11 9 10 13 17 18 14 2 -18 -41 -52 -42 -13 20 53 84 116 143 155 150 135 117 102 90 82 76 69 57 42
4329 42 29 16 0 -15 -21 -4 31 71 99 110 112 115 122 132 147 167 189 206 212 212 210 208 200 183 162 144 135 136 137 130 113 94 84 88 104 121 134 143 148 145 130 99 60 26
4311 26 3 -6 -10 -12 -13 -15 -20 -30 -43 -52 -58 -61 -63 -61 -49 -23 13 55 92 118 132 143 160 185 211 230 239 235 215 180 132 85 43 9 -22 -50 -67 -66 -47 -18 13 43
4294 43 68 89 100 100 91 82 86 105 129 147 153 151 147 139 125 104 82 61 41 23 11 5 1 -7 -20 -34 -44 -47 -42 -32 -24 -22 -30 -49 -72 -89 -90 -73 -42 -8 21 42 54 58
4276 58 56 50 39 22 0 -17 -22 -16 -6 0 0 3 15 33 47 50 44 36 34 38 45 50 54 59 68 75 70 48 21 8 20 50 87 120 144 153 149 140 133 128 116 94 68 45 25 6 -10
4258a0j3nNJ7K5K6J9QKKLLKJlj0j9k2j6rpj4j8j2JJ1J5J3Mj1k5k7j8njln%OJ1RPJ2K9M8N5
4239H1M3K7J5Okj0j6k2k3j7mOLrj5j4oJNQRNmj8l2l4k2lJ3K5L1L3K6J9J4Rnk3k7j4KRPkj2
4221F3k2k5j7j2j0qjPJ3J9L1L7L9L6L3K5Oj1j7j3roKQQ%mlrj8k2j2LRLmj2j8k1k2j5qKJ4K2
4203F1K6K6K4J8Kj7l0l2k8k0qLRRJ0J4J9J5Omnl%%lqj8k7l1k5j5nLJ1J8K2K2J9J2Mknmmmk
4185E3KRJ0J0QMkmnmpmJROmj4j1jN%j2j9j3KJ4K0K2K1J8J0ORJ5J2O%lrk0k2j3jMJkjlorqj2
4164F8j8k7k8k2qRJ4Mj1j6oMOLJLJlnkPJ3J3J0JmJJ0J5J1RJ3K0J9J4Nnj6k5k9k5j7mJ5L4M1
4145I3K9Kk4l3k0%J5J8J5J6K0K3J6NmqpolLRJ3Poj8j9j4rnjJqk1k7k2j3j4j9k3j9j6j2pJR
4127h3J4J8K3K3J4PLLK%kJLMLMNOQROJkoj2j6j8j5oMJ6K2J8RPJ4K2K0Rmj1j6j8j4KJ6K2K5
$$ plain form
4258 -10 -23 -28 -23 -6 19 45 64 72 74 76 79 82 84 85 82 72 53 31 15 6 -1 -15 -33 -45 -44 -33 -18 -5 -1 -12 -37 -64 -82 -87 -88 -91 -96 -96 -90 -79 -70 -63 -51 -22 26 81
4239 81 124 151 166 172 170 160 144 122 99 82 78 84 87 78 63 49 43 44 49 57 66 71 67 49 17 -17 -39 -42 -29 -4 27 60 86 105 119 128 123 100 73 59 61 70 77 75 63
4221 63 41 16 -1 -13 -23 -31 -32 -25 -12 7 38 75 114 150 183 208 214 203 186 173 164 158 160 168 176 176 172 169 160 142 120 108 111 120 123 119 107 89 68 46 31 23 25 39 61
4203 61 87 113 137 155 157 140 110 78 50 30 22 25 34 43 53 67 86 101 107 103 98 95 95 95 92 84 66 39 8 -17 -32 -37 -34 -23 -5 17 39 58 70 74 72 67 63 59 55 53
4185 53 55 64 74 84 92 96 94 90 85 81 74 70 71 80 86 82 68 57 56 61 61 49 30 17 19 33 53 75 96 114 124 130 139 154 166 172 172 169 160 140 118 105 104 108 109 107 106 103 97 88 80 68
4164 68 50 23 -5 -27 -35 -26 -12 -8 -19 -35 -41 -37 -31 -28 -27 -24 -23 -26 -31 -33 -26 -13 0 10 11 7 8 18 33 44 53 66 86 105 119 124 119 103 78 49 24 7 3 18 52 93
4145 93 122 124 100 67 47 47 62 80 95 111 131 154 170 175 171 163 156 150 147 150 159 172 179 173 155 136 122 113 108 107 108 100 79 52 30 17 3 -16 -39 -58 -74 -86 -93 -92 -83
4127 -83 -69 -51 -28 -5 9 16 19 22 24 24 22 23 26 30 33 37 42 48 56 65 71 72 70 64 52 36 18 3 -3 1 17 39 57 66 73 87 109 129 138 134 123 107 89 75 77 93 115 140
4108A40K7K8J4oj5j1kpj5j5n%nqkNJj3k4k8k0oQJ5J3QMKjnqqrmJ0K4K8J9RNLjmlMJ0J4J4J5
4088A95Qok5l6l3k1qKJ3K6L1K3Qmrj4j8j7nJ0J8J4Njj0k4m0n0m3k7j1orq%J1J0LlNK3L2K9
4071C8J5jj0j0omrj8k8k7j6nLNJ1J9K4J9OmkMJ4J9J6J2QOK%%OJ4K2K2J9J3RNJmrj1rprj9k5
4052I9k4j0LJ1J0PNPJ5K7L5L1J7Mkoj8l5m5l9k4j2pnnlJQJ2J0Lnj3j9k5k4j8oLNOJ1J7K3K2
4034D7J8J5J0mk0k7k1j2pnNJ5J9J2NLLmj3j6j2j0qpljnpjJ4K7L1K7K2K0J3LnpkKK%JOJ4K5
4015A62L0K2Mj3k0j5j2j7k3k1j8j4j2oLN%j0j6j3nMLkj1j5j5pQK2K4J7OJMMKJJKJMQQLlkk
3995G7pj8k4k4j5%K3M3M3K3jj0rpjJ1K5K6J6jj4j7j2%QRONPNoj9k0rKKpk0k2j5kPRPKnj5j7
3976C9rNJ8K6K9K4Pj5l0k6j2JM%mmNJ6K1K0J3O%LRJ4Oj0k1j4MJ5Rok0k9l1k5j5nMJ5K5K7J2
$$ plain form
4108 140 167 195 209 203 188 177 175 168 153 138 133 133 128 120 118 123 124 111 87 59 39 33 41 56 69 77 81 83 82 77 69 61 52 48 58 82 110 129 138 143 146 145 141 138 142 152 166 180 195
4088 195 203 197 172 136 103 82 74 76 89 115 146 169 177 173 164 150 132 115 110 120 138 152 157 156 146 122 82 32 -11 -38 -49 -55 -64 -72 -72 -61 -51 -48 -51 -46 -23 9 38
4071 38 53 52 42 32 26 22 13 -5 -33 -60 -76 -81 -78 -73 -62 -43 -19 0 6 2 0 4 18 37 53 65 73 79 81 81 81 87 101 123 145 164 177 186 191 192 188 179 168 159 152 143 124 99
4052 99 75 65 68 79 89 96 101 108 123 150 185 216 233 237 235 229 211 176 131 92 68 56 49 44 39 36 37 45 57 67 70 65 52 33 8 -16 -34 -40 -37 -32 -26 -15 2 25 47
4034 47 65 80 90 86 66 39 18 6 -1 -6 -1 14 33 45 50 53 56 52 39 23 11 1 -7 -14 -17 -18 -23 -30 -31 -17 10 41 68 90 110 123 126 121 114 112 114 116 116 117 123 137 162
4015 162 192 214 218 205 185 170 158 141 118 97 79 65 53 47 50 55 55 45 29 16 11 15 18 16 5 -10 -25 -32 -24 -2 22 39 45 46 50 54 56 57 58 60 61 65 73 81 84 81 79 77
3995 77 70 52 28 4 -11 -11 12 55 98 121 120 110 101 94 93 104 129 155 171 170 156 139 127 127 135 144 150 155 162 167 161 142 122 113 115 117 110 90 68 53 51 58 67 74 76 71 56 39
3976 39 30 35 53 79 108 132 139 124 94 68 56 57 61 61 57 53 58 74 95 115 128 134 134 137 146 160 166 156 135 121 125 140 149 143 123 94 63 38 23 18 22 37 62 89 101
3958A01qj6qRJ4Rkj1j7k0j9j3rqlNJ7K0J4Ojrk0k9k9j7lQJ6J7J1Jpj0mNROKjjMRJ4J8K5K7
3939A02K1Qpj6j7j6j7k2k6k3j1QK6L6L5L2K6J8lk9m4m3k5qNJ0J5J8K5L5M3M3K9Lk0l6l8l3
3924A04k4j4%J5K7K7J5nk3l3l1j9kJ2J3PMJ0J6J8J3Nkj1k1k8l2l3k4j3KQLj%MQONKJJ0K4L5
3906G8L5L0L0L0J9kk0k3j6j0j1rnnj0j3j1mkpj1j1jPQOOJ5K1J7jk1l5m0l2j6poj0pQK7L2K6
3889D9J7J4J4J5J7J5J2POOLjpj1j8k2j9nOJ1Njoj1j5j9j9j7j5j1nNJ1J2MlkPJ3J2JooKOJn
3870D7plJlj0j3j2j0lNJ0J4J3J4J7Pj2l1l4k7j7j1mNJ1P%nlKQJ0J2J6K2L2L7L0J4jj2j2nK
3852A01ONMRJ1J2J0J4K2L4M0L8K5Nj5k7l0k7k3j8j8j6j5qNJ8K5J7Jj3j6qloj5k7l3l1k4j2
3836A7lmj2j8j3MK0K4J6RPJ1RLmrj3j4rklj0j5rNJ2Nmj2j0mRK1L3L2J8jj5j6o%nj6k3j9j2
$$ plain form
3958 101 93 77 69 78 92 101 99 88 71 51 32 19 10 2 -1 4 21 41 55 61 60 51 31 2 -27 -44 -47 -39 -23 -6 5 6 -1 -11 -15 -10 -1 5 7 6 5 9 18 32 50 75 102
3939 102 123 131 124 108 91 75 58 36 10 -13 -24 -16 10 46 81 113 139 157 154 125 81 38 13 5 10 20 35 53 78 113 156 199 228 231 211 175 137 104
3924 104 80 66 66 81 108 135 150 145 122 89 58 39 37 49 62 69 73 83 99 117 130 135 133 122 101 73 41 8 -16 -29 -27 -19 -16 -17 -17 -13 -5 1 6 8 9 19 43 78
3906 78 113 143 173 203 222 220 200 177 161 151 140 131 126 121 111 98 87 83 81 74 63 52 51 58 66 72 78 93 114 131 130 109 74 34 2 -14 -21 -27 -37 -44 -36 -9 23 49
3889 49 66 80 94 109 126 141 153 160 166 172 175 174 167 156 138 116 97 92 98 109 114 113 107 96 81 62 43 26 11 0 -5 0 11 23 27 24 22 29 42 54 55 49 43 45 51 52 47
3870 47 40 37 38 35 25 12 0 -10 -13 -8 2 16 29 43 60 67 55 24 -10 -37 -54 -65 -69 -64 -53 -46 -46 -51 -54 -52 -44 -34 -22 -6 16 48 85 115 129 128 116 104 99 101
3852 101 107 112 116 125 136 148 158 172 194 228 268 306 331 336 321 294 264 237 214 196 178 162 147 139 144 162 187 204 205 192 176 168 165 159 144 117 84 53 29 17
3836 17 14 10 -2 -20 -33 -29 -9 15 31 40 47 58 67 70 66 57 44 30 21 19 16 6 -9 -18 -13 -1 4 0 -12 -22 -26 -17 4 37 69 87 86 71 55 49 49 44 28 5 -14 -26
3818b6n%QJ6K1K1K1J8J6Qjnrj2j5j3nOJ1Pjqj0pLJ2J3Mj3k3k1j0j%%%kj2j9k0j3qqnNJ8J9
3799d5QljPJ3J2RJ2J5J0jj5k1j9j1pom%OJ0J3J1OjlLJ2J8J6J1Mjmmlqj7j9rNJ1J0NMNPJ2K4
3779G7L1K7J1oj2pnolRJ6J3%pqpj0rpj1k0k6j9q%MNKmpmNPMMJ0J6J8J0lj0j0%PRRJ8K8L3L0
3759A94L2L6L2Rj9l6l6k8j9j4j1n%OPLrj9k4k0j4pkLRJ4J1NKJ2K5L2K5J3Lpj7k7k7j6qj1k1
3742G6k5j9qJJ3K6L5L0K1J2Nnj4j6nPQjrpJJ0J4J3OKOJ5K1J2pk3k8k5j7rlkj2k9m2m2l1j8
3724f3j5j8k0j7qjQJ8K8K9K2J2J0J4J7J4J2J4J7Rpk0k3j8r%QJ0RJ1J0Kj0j8j8j6j8j4%J5J7
3707gQjoj1j3j1qj0pOK9M4M4L3K2J4RN%nmjPQKrj4j4j5j4j2rj1j5j6j2kLNNOMkpj0mMJ0J2
3688C0J2J4J3PKj%K%pj6j6j0moj3j2kJ2K3K8K9K5J4K%NJ0RNjrj3j4j0qm%LJjjKKlonpj5j9
$$ plain form
3818 -26 -31 -31 -23 -7 14 35 56 74 90 98 97 92 83 71 56 43 38 44 55 62 61 53 43 36 39 51 64 68 55 32 11 1 0 0 0 0 -2 -14 -33 -53 -66 -74 -82 -87 -82 -64 -45
3799 -45 -37 -40 -41 -34 -21 -9 0 12 27 37 36 21 0 -19 -30 -37 -43 -47 -47 -41 -31 -18 -7 -1 -2 -5 -2 10 28 44 55 59 58 54 50 47 39 22 3 -6 -1 10 20 25 29 34 41 53 77
3779 77 108 135 146 140 128 121 116 110 107 116 132 145 145 138 130 123 113 104 97 86 66 40 21 13 13 17 22 24 20 13 9 14 21 25 29 39 55 73 83 80 70 60 60 67 76 85 103 131 164 194
3759 194 226 262 294 303 284 248 212 184 165 151 140 135 135 141 148 151 142 123 99 79 65 58 56 59 68 82 93 98 100 112 137 169 194 207 210 203 186 159 132 116 108 97 76
3742 76 51 32 24 25 38 64 99 129 150 162 167 162 148 132 127 134 142 141 132 125 126 136 150 163 169 171 177 192 213 225 218 195 167 142 125 116 113 111 99 70 28 -14 -45 -63
3724 -63 -78 -96 -116 -133 -141 -142 -134 -116 -88 -59 -37 -25 -15 -1 16 30 42 56 73 82 75 55 32 14 5 5 13 23 32 43 53 55 45 27 9 -7 -25 -39 -39 -24 -7
3707 -7 1 0 -6 -17 -30 -41 -49 -59 -66 -60 -31 13 57 90 112 126 135 140 140 135 131 130 137 145 147 138 124 110 95 81 69 60 49 34 18 6 4 7 12 17 23 27 25 18 8 4 8 18 30
3688 30 42 56 69 76 78 77 77 79 79 72 56 40 30 26 20 7 -5 -7 5 28 56 85 110 124 126 126 131 141 150 155 154 145 132 118 108 100 96 96 99 100 99 98 100 102 99 93 88 81 66 47
3668D7j3KJ3J5J6K2K8K0MokJ3K3J3mk0k1j8j3j3j1ppj0j6k1k5k0j6j2j1oLJ7K5J9Mj2j8oJ1
3651a3K3K5K1K0K0J6Rlj5k3k3j5qqj2j8k2k2j9j0jRJ4J9K4K5K3J5Noj1oQJ7J6Olnj%mj2k1
3634C4k5k0j6j0lNROoj3j0OK2K6K2J6J6J5J0mj4j7pQJ9J7PnpkLKnj1j2q%PMkmLJ0RQJ1J6J7
3615A27J5J6J6J0mj5j9j5oKNKnoJMkj3j6j3j0j7k6k7k0j4j0nMJ3J1MjLPNKJKKJ%%mrj1pkl
3595b7mNJ9K6K4Rmj1qJRJ2J0LoroLJ2J6J9K3K8K4Qj1k0j3JOLoplKMNJ1J9K3J9Orj9j8pK%r
3575A55j7j3pkjkjjpj4j6rKRRNLPJ4K1K1J5OKNQJj3k3k3j6j0qrj0j0qponpj3j5j3rnkKJ2K1
3555A6K6K2J5J1Mrk1k1nJ5K5K0Plj4k7m2m4k9kK1K7K6K1J3%j0j2kRJ5J3QL%lrj4k2k7l1l1
3538f1k4j0KPJ0J0J2J2J4J8J8J6J7K0J9Rmrmjoj1j3j2j4j5j1kPJ1J5J5J0KmjOJ3RjplQJ5J5
$$ plain form
3668 47 34 36 49 64 80 102 130 150 154 148 146 159 182 195 191 171 150 132 119 106 95 88 81 71 55 34 9 -11 -27 -39 -50 -56 -53 -36 -11 8 12 0 -18 -24 -13
3651 -13 10 35 56 76 96 112 121 118 103 80 57 42 34 26 14 -4 -26 -48 -67 -77 -78 -69 -55 -36 -12 13 36 51 56 50 39 33 41 58 74 80 77 72 71 71 67 55 34
3634 34 9 -11 -27 -37 -40 -35 -26 -20 -26 -39 -49 -43 -21 5 27 43 59 74 84 80 66 49 42 50 69 86 93 88 81 79 82 84 79 68 56 48 48 55 59 57 53 56 66 75 83 94 110 127
3615 127 142 158 174 184 180 165 146 131 125 127 132 134 129 123 124 128 126 113 97 84 74 57 31 4 -16 -30 -40 -45 -41 -28 -17 -13 -14 -11 -4 1 3 4 6 8 9 9 9 5 -4 -15 -22 -24 -27
3595 -27 -31 -26 -7 19 43 52 48 37 29 30 39 51 61 64 58 49 43 46 58 74 93 116 144 168 176 165 145 132 133 139 142 136 129 126 128 132 137 148 167 190 209 215 206 187 169 162 164 164 155
3575 155 138 125 118 116 115 113 112 111 104 90 74 65 67 76 85 90 93 100 114 135 156 171 177 179 184 192 193 180 157 134 118 108 100 91 81 71 63 56 50 45 38 25 10 -3 -12 -17 -19 -17 -5 16
3555 16 42 64 79 90 94 85 64 43 38 53 78 98 105 102 88 61 19 -25 -54 -56 -35 -8 18 39 52 52 42 30 28 37 52 65 73 76 76 73 64 50 28 1 -30 -61
3538 -61 -85 -95 -93 -86 -76 -66 -54 -42 -28 -10 8 24 41 61 80 89 85 76 72 71 65 54 41 29 15 0 -11 -13 -6 5 20 35 45 47 43 42 48 61 70 69 62 59 67 82 97
3520I7QLMRJ3J3Mj0j7j3j0j3k2k4j8pLJ0J5J2LonJKoj0nPJ5J5Pok0l2l3k3lJ6K1J3LKNOmj5
3502Ej9j5j0olKNNOJ0J2J2J4J7J8J2kj2j7j7j8j6rKJ3K0K4J6LkNJ7J9Qoj5j3LJ9K4J5%plK
3483A18%lljlllnqrJJ2J8J6J3J0O%kkpj2j1kM%roJ0K8L2K3J4QKj0k0k2j6rrj4j5j3j5k3k7
3465C3k2j3ponmjNJ1J0MnpKOLjLJ0J2PkjNJ6K6K7K0QKJnj2j5j0jNQJ4J6J2Njlkmnoopoqj0
3443I6j4j5j0%QJ0QNK%lj4k7l9m2l4j8KK1L6M4M4L2J2j0k1k0rJLJ%MPRRJ2Pkj4k1k3k1j5m
3425cOJ1QLOJ1J5J4J3J4J2Npj3qNK1K9K6J1rk4k9k3j3opoNK0K9K4J1lj3j9j5qkmj1j5j3j3
3408C5j0oKJ2J6J2NnrrmJOJ1J9K8L3L5L3K7J4lj6k2k2k1j6qjlj1j9k0j5j1j0j2j1j1rnJMN
3390A0KJKLJjkjJJmqpKJ3J6RjomLONkqp%QJ4J5J4J2J0NJKPNmj7k0j4lKkj0j2rJJ3K2K4K1J1
$$ plain form
3520 97 105 108 112 121 134 147 151 141 124 111 101 88 66 42 24 17 20 30 45 57 60 54 49 50 52 46 36 31 38 53 68 75 69 49 17 -16 -39 -42 -26 -5 8 11 13 18 24 20 5
3502 5 -14 -29 -39 -45 -48 -46 -41 -36 -30 -20 -8 4 18 35 53 65 63 51 34 17 -1 -17 -26 -24 -11 9 33 49 52 50 55 72 91 99 93 78 65 68 87 111 126 126 119 116 118
3483 118 118 115 112 111 108 105 102 97 89 80 81 93 111 127 140 150 156 156 154 152 145 133 122 120 124 124 115 109 119 147 179 202 216 224 226 216 196 174 158 149 140 126 111 98 83 60 33
3465 33 11 -2 -9 -15 -20 -24 -25 -20 -9 1 5 0 -7 -5 1 4 3 6 16 28 35 33 32 37 53 79 106 126 134 136 137 132 120 105 95 94 99 107 121 137 149 154 153 150 148 144 139 133 127 120 114 106 96
3443 96 82 67 57 57 65 75 83 88 90 90 87 73 46 7 -35 -69 -87 -85 -64 -28 16 60 92 104 94 73 53 44 45 48 49 49 53 60 69 78 90 97 95 81 60 37 16 1 -3
3425 -3 3 14 22 25 31 42 57 71 84 98 110 115 108 95 87 92 113 142 168 179 170 146 117 94 81 75 68 62 67 87 116 140 151 148 135 116 101 93 91 87 76 61 48 35
3408 35 25 19 21 33 49 61 66 61 52 43 39 40 46 57 76 104 137 172 205 232 246 243 227 205 183 162 146 138 137 134 123 104 84 69 58 48 36 25 14 5 0 1 5 10
3390 10 12 13 15 18 19 18 16 15 16 17 13 5 -2 0 13 29 38 37 31 27 30 36 41 39 31 24 24 32 46 61 75 87 97 102 103 105 112 117 113 96 76 62 59 61 59 49 37 28 29 42 64 88 109 120
3368A20jokOJ4J6J4Nnj7k5k2j5nJPJ8K8L6L2J4qk3k7k7k8k3j6qqqlMLpj4j0kMMKjoj0qkJ0
3349AK5L6L8L2K2J4J3J4J1Kj0j9k2k1k1j7oMMlj1qlJNRJ0O%JOOJnpj2j8k2k1j3kJ0J8J6Nj5
3331E4l0l1k2rNJ1RMjjRK1K9L1K5J3lk0l0l3l1k4rQJ4QKNJ5K0J5J5K0K3J8J2J5K5K8K1Oj0
3314B27k3k7k2j4j3j7j8j0PK1K5J5kj3j1lMKkmnrj4j2lNOlj3j7j4lQJ2Qmj0rkQJ1QLKOJ5J7
3295A13J1NORPkqrnllmj2k0k3j6mMQRJ5K2K7L0K5J2nk4l2k7j3JPPLjpj5k2k3j7rjPJ1J1Mm
3276D5pj1k0l3l8k1RL3L7K3RJJJMOPPQQNJJQJ6J5Noj2j5j3nQJ8J7J0jrj8k3k3j8j1nKRJ8K2
3257F5K2J6Ooj1j0%J1J3Lj4k6k7k0pPJ8K4K1J3NMNKpj2rpqj3j0jQKj1k1j8j1j2j4rPK6L3K4
3238E1Mj5k4k1j5pmmm%RJ2Lrj3lJ4K5K4J7OLOJ7K5K5J4ok8m5m8l5j9oJLQJ0J1Q%rj3j1jJ2
$$ plain form
3368 120 119 113 111 117 131 147 161 166 161 144 119 97 82 77 78 85 103 131 167 199 213 205 182 155 128 100 77 61 53 45 37 34 38 41 34 20 10 8 12 16 18 17 11 1 -7 -9 1
3349 1 26 62 100 132 154 168 181 195 206 208 198 179 157 136 115 98 92 96 100 97 86 78 75 76 81 90 100 106 106 107 113 119 120 115 108 96 78 56 35 22 20 30 48 64 69 54
3331 54 24 -7 -29 -38 -33 -22 -13 -9 -10 -11 -2 19 48 79 104 117 114 94 64 31 0 -24 -33 -25 -11 -3 -1 4 19 39 54 69 89 112 130 142 157 182 210 231 237 227
3314 227 204 177 155 141 128 111 93 83 90 111 136 151 149 136 125 122 126 128 126 122 117 108 94 82 79 84 90 87 74 57 43 40 48 60 68 64 54 45 43 51 62 70 73 75 81 96 113
3295 113 124 129 135 144 151 149 141 132 127 124 121 117 105 85 62 46 42 46 54 63 78 100 127 157 182 194 189 165 133 106 93 94 101 108 111 110 103 88 66 43 26 17 16 23 34 45 49 45
3276 45 38 27 7 -26 -64 -85 -76 -43 -6 17 26 27 28 29 33 39 46 53 61 69 74 75 76 84 100 115 120 114 102 87 74 69 77 95 112 122 121 112 94 71 48 30 19 14 16 25 43 65
3257 65 87 103 109 103 92 82 82 93 106 109 95 69 42 22 15 22 40 64 85 98 103 107 112 114 107 95 86 79 71 58 48 47 55 57 46 25 7 -4 -16 -30 -39 -32 -6 27 51
3238 51 55 40 16 -5 -20 -27 -31 -35 -39 -39 -30 -18 -15 -24 -37 -40 -26 -1 23 40 46 49 55 72 97 122 136 130 102 57 9 -26 -45 -51 -50 -47 -39 -29 -18 -10 -10 -19 -32 -43 -44 -32
3220c2J8K0K1J7Rnk0k8l0k4j7j5j2mJ4K6K4J2LMJ3K3K6K2J0mj4j9j9j5j1rj0rpkLJ6L4M8M3
3204A00K4OKQPlj4k0j9j8k1k3k6k8l3l5l2k3qJ0K6L4L8L5K6J8J3J1J0RJ0RN%jPJ8K6K4J3l
3187A82j8k6k8k1rQK0J5lj6j6oJLKJlqlOJ0MnnKJ1J9K4K3J5QKjj0j9k2j5mNJ0RKmlJNLnj6
3167A25l1m6n1m9l8k5j3kNPM%k%NJ2K1L1M2M3L5J8Okpj4j7j0NJ9K4J9J0jpj2j6j7j5rmk%K
3150D3NPPKoj6j9j8j6k4l1l4k9k8k8l0k8j8mJ0K0K3K6L2L7L5K7K3K6L2L0J5qk5k5pJ5K6K1
3134F8J2J0J6K4K1Oj4k9k9j9qkpj5k1j8pLN%KNNmrjJ8L2L2K8L0L6L7K5Mj5k9l1k5j2jLmj2
3116A10j6j8j9k2k2j9j9k0j9j4mQK1K9K7K0J4Qkj4j9oJ1K4K9L3L3K5Rj1k6l3l3k7j9j3pjO
3101DJ0J1J7J8J5PNRQkj5k0j7qMJ0Noj1oKNMPJ0Ojnmnj0j2rrj0pkJJ%QK2K8K4J2%omjoj6j9
$$ plain form
3220 -32 -14 6 27 44 53 48 28 0 -30 -54 -71 -86 -98 -102 -88 -62 -38 -26 -23 -19 -6 17 43 65 75 71 57 38 19 4 -7 -16 -26 -35 -42 -44 -41 -25 9 57 100
3204 100 124 130 132 140 147 144 130 110 91 73 52 29 3 -25 -58 -93 -125 -148 -156 -146 -120 -86 -48 -13 13 31 44 55 65 74 84 93 98 98 97 104 122 148 172 185 182
3187 182 164 138 110 89 80 88 108 123 120 104 88 82 83 86 88 89 86 78 75 81 91 95 90 85 87 98 117 141 164 179 187 189 188 178 159 137 122 118 123 133 142 144 140 137 138 143 146 141 125
3167 125 94 48 -3 -52 -90 -115 -128 -130 -125 -118 -114 -114 -116 -116 -111 -99 -78 -47 -5 38 73 91 97 95 88 74 57 47 52 71 95 114 124 123 116 104 88 71 56 47 43 41 41 43
3150 43 48 55 62 64 58 42 23 5 -11 -35 -66 -100 -129 -157 -185 -215 -243 -261 -265 -255 -235 -212 -186 -154 -117 -82 -55 -32 -6 26 56 71 63 38 13 6 21 47 68
3134 68 80 90 106 130 151 157 143 114 85 66 58 56 49 34 13 -5 -12 -9 -4 -4 -2 3 8 4 -5 -6 12 44 76 104 134 170 207 232 236 221 192 161 136 124 123 126 122 110
3116 110 94 76 57 35 13 -6 -25 -45 -64 -78 -82 -74 -53 -24 3 23 37 45 43 29 10 4 15 39 68 101 134 159 168 157 131 98 65 38 19 6 -1 -2 4
3101 4 14 25 42 60 75 82 87 96 104 102 87 67 50 42 46 56 61 55 44 38 40 45 49 56 66 72 71 66 62 57 47 35 26 17 7 0 -2 -1 0 0 8 30 58 82 94 94 88 84 83 77 61 42
3080D2rOJ5J5J0PQPOMjqj0j0rj4k1k6k0j2lNJ5K5K7J1j2k8k7j7plkkMJ6L0L5K2Lrj4j8k2j6
3062gmRQLkoomNJ5K0J5Krj6j8j2p%OJ4K0J8OnmJ0K5L2K4J1mqnNQN%lnj1k0k5k1r%MLNRJ7K4
3041A12K7K5J4MJOJ3J4J2J1RKj3k5l1k6j7pJL%nnmqj4j4p%LOJ2J0lk3l4l0j7mKRJ3J5J7J5
3023F9Mj0j8j6r%OJ1J7J7J1Koj1j1pkMKmj5k1j7j0mlJJ5L1M0L1J1rj6j1%OLoj4j7j9k1j9j7
3005c2j0kJ1K5L4L4K9K5J9QlnNJ4J0mj6j9j2jPJ1QLLN%qj3j4j2j1lJ0K4K9K3J4PKjkl%OQO
2986B09lj4j8j9k2k6l0l0k7k0mJ0J6Pmj0qojOJ9K9L2K2Mj3k1j5omnonj0j9k0j4mlroOJ6J4
2968a2POJ7K4K2J0kpqnKRJ5J6J5J0NMQJ6J6Mj1j5qKNNPJ2J3Qjj4k3k1j1lnj3j7rklj3k2k0
2949A3qQJ7J3KlKRJ1PPJ6K4K0J0L%JKJ0K3K9K5J4Kj2k1k1j3nmoqj2k0k3j8j0j0j3rjMORJ9
$$ plain form
3080 42 33 39 54 69 79 86 94 101 107 111 110 102 92 82 73 59 38 12 -8 -20 -23 -18 -3 22 49 60 48 20 -7 -24 -31 -34 -36 -38 -34 -18 12 47 69 72 63 49 31 9 -7
3062 -7 -11 -2 6 9 7 1 -5 -9 -4 11 31 46 48 39 23 5 -7 -14 -14 -8 6 26 44 50 45 41 51 76 108 132 143 139 131 126 131 139 144 144 141 136 125 105 80 59 50 50 54 57 62 71 88 112
3041 112 139 164 178 182 183 189 202 216 228 239 248 250 237 212 181 155 138 131 132 135 135 130 125 121 113 99 85 78 78 81 87 99 109 106 83 49 19 2 -2 0 9 22 37 54 69
3023 69 73 63 45 29 20 20 26 37 54 71 82 84 78 67 56 49 47 51 53 49 34 13 -4 -14 -18 -21 -20 -5 26 66 97 108 99 83 72 72 78 81 75 61 44 25 4 -15 -32
3005 -32 -42 -44 -33 -8 26 60 89 114 133 141 138 133 138 152 162 158 142 123 111 110 117 128 136 139 142 147 147 139 126 112 100 89 86 96 120 149 172 186 193 195 194 192 189 189 195 203 209
2986 209 206 192 174 155 133 107 77 47 20 0 -4 6 22 29 25 15 7 1 0 6 25 54 86 108 112 99 78 63 57 53 48 42 37 27 8 -12 -26 -30 -33 -42 -48 -42 -26 -12
2968 -12 -5 1 18 42 64 74 72 65 57 52 54 63 78 94 109 119 124 128 136 152 168 172 161 146 138 140 145 150 157 169 182 190 189 175 152 131 120 117 112 99 82 73 71 68 55 33 13
2949 13 5 13 30 43 45 42 44 53 64 71 78 94 118 138 148 151 151 152 154 164 187 216 241 255 257 245 224 203 190 185 181 175 167 155 135 112 94 84 74 61 52 51 55 61 70 89
2931H9K6K1J1Mlj1j7j7j6j7j6j3nlmorj0rmPJ7K8L0K3Orj8k3k2j4OK2J9Lj1j3j3j6j5j0oo
2914b4lQJ6J4OLNNkqqjMJj2k5l2k6j5rokNPjj0pOK1K5K0J3PORJ5K2K2J8J3QkpmQJ9K2J8J2
2894A54Moj1j1rj1j5j2prk2l0k8j6jJ8L6M7M6L2J6%j6k6k5k0j8k1j9j2KJ3K1K3K0J2Mnj1j3
2878G4j3o%NMoj3j3o%jk%Jmj1qLJ1J1PPQN%pj0j1j1j1j0p%J0J4J2M%oj2j9j9nJ2K3K1Rnj4
2858A1j6j3r%J4K7L8L4K3J3J0J3J2Mj0j9k5k4j7nLKrj8k5k4j9mJ1K1J9J7J8K4K7K6J9Qlpj0
2842A37j5k5k7j6lKmj3j5j0JJ6K6K4J2lj4j7j3JJ3J1%mQK6L1K6K2K2J9J2POONNMkj6k8l1k4
2824A62j1KJ1Oj1l4m5l9k1jJ4K5K7K3J8J7J8J0jrp%%oj2j3pJRJ6J7Nj2k8l1k4j5j0qqj2k0
2808dk6k1rLRRJ1J5J6J6J2N%kJORJ0QKnj5k1k2j4nNJ0J4K2L3L8K4jk9m2l8k2jJ1J7J9K1J7
$$ plain form
2931 89 115 136 147 151 148 137 120 103 87 70 54 41 36 33 29 23 14 4 -5 -9 -2 15 43 73 96 102 93 75 52 30 16 22 44 63 66 55 42 29 13 -2 -12 -18 -24
2914 -24 -27 -19 -3 11 17 20 25 30 28 20 12 11 15 16 4 -21 -53 -79 -94 -103 -109 -111 -106 -99 -100 -110 -117 -111 -90 -65 -45 -32 -25 -19 -10 5 27 49 67 80 88 86 79 75 83 102 124 142 154
2894 154 158 152 141 130 121 110 95 83 76 67 45 15 -13 -29 -30 -12 24 71 117 149 165 165 149 123 98 78 60 39 20 8 10 23 44 67 87 99 103 98 87 74
2878 74 61 55 55 60 64 58 45 32 26 26 25 23 23 24 20 9 1 4 15 26 33 40 48 53 53 46 36 25 14 3 -7 -14 -14 -4 10 22 26 26 20 8 -11 -30 -35 -23 0 21 30 25 11
2858 11 -5 -18 -27 -27 -13 14 52 86 109 122 132 145 157 161 151 132 107 83 66 61 64 66 57 39 14 -10 -29 -33 -22 -1 18 35 53 77 104 130 149 157 154 147 137
2842 137 122 97 70 54 51 53 49 36 21 11 12 28 54 78 90 87 73 56 43 44 57 68 68 64 72 98 129 155 177 199 218 230 237 243 249 254 259 263 261 245 217 186 162
2824 162 151 153 164 170 159 125 80 41 20 19 33 58 85 108 126 143 161 171 170 161 154 154 154 148 136 123 116 117 126 142 159 164 152 124 93 69 54 44 36 28 16 -4
2808 -4 -30 -51 -60 -57 -48 -39 -28 -13 3 19 31 36 36 34 35 41 50 60 68 70 65 50 29 7 -7 -12 -7 3 17 39 72 110 134 133 104 62 24 2 1 12 29 48 69 86
2790H6Jj6j6kNrl1l4k1lJ0J3J4Pmj4j4lJ2K0K2J5OJJ%mj0j6k0k3j5MK2K8K2J6J9K1Qj8m0l8
2773Bj8NJ4J6J6J6J4Pmj6k5k6k0j0lknrj0jJ8L5L4K2Omorj0j0qrj2j1pjNJ5K0J9J2Jon%OO
2754D2LjjjjmkNJ0J1OjmjNQ%j6k1j3JQQQRJ2J9K9L1J9%j0mKnk0k6k0pJLLkonLJ1J7J5RJlj
2733A24J%lommoqoljjoj3j7j5oPJ7J9J4Jrj1kNPMmj2j5j2%J3J7J1jpmKNMMMMjo%J4K6K8K1
2712A69J1Lkpj1qJOKrj8j7j5j9k8l1k6k0j6pJ3L2M5M3L3J6%rnNJ1Pkj2j7j5lRJ3P%rk2l3l4
2694C1j9KJ7K6K9K7J5kj5j9j4lOOJppnkJJlqpNJ6J8J3QPLjLJ0J2Lrj5j0%QJ0Mor%J7L0L2K4
2674B24Pj5l3l9l3k2pJ3K9L0J7lj5rJ1L3M0K8Nj3j6j0noj2j9k4j9j2qnkNOkj7k6k5j3kNLK
2656D6%kmlOJ2J0MKORMMPJ1O%MJ8K8K5Rpj5j7j4oOJ9K3J4mj9k1j5j1j1j5j6j3oLQJ2J6K6L3
$$ plain form
2790 86 87 71 55 53 58 49 18 -16 -37 -40 -30 -17 -3 4 0 -14 -28 -31 -19 1 23 38 44 45 46 46 42 32 16 -4 -27 -42 -38 -16 12 34 50 69 90 98 80 40 2
2773 2 -16 -11 3 19 35 51 65 72 68 52 27 1 -19 -29 -32 -34 -39 -48 -58 -59 -41 -6 28 50 56 52 46 37 27 17 9 0 -12 -23 -30 -31 -26 -11 9 28 40 41 35 30 30 36 42
2754 42 45 44 43 42 41 37 35 40 50 61 67 66 62 61 66 74 74 58 37 24 25 33 41 49 58 70 89 118 149 168 168 158 154 156 151 131 105 85 78 79 82 85 83 77 72 75 86 103 118 127 128 125 124
2733 124 125 125 122 116 112 108 102 94 88 85 84 83 77 64 47 32 26 33 50 69 83 84 75 64 62 67 74 78 74 62 47 35 35 48 65 76 75 68 64 66 71 75 79 83 87 86 80 80 94 120 148 169
2712 169 180 183 181 174 163 155 156 162 164 155 137 120 105 86 58 27 1 -19 -35 -42 -29 3 48 91 124 140 140 131 126 131 142 149 147 135 118 103 100 109 122 129 129 120 98 65 31
2694 31 12 14 31 57 86 113 128 126 111 92 78 75 81 87 88 81 74 69 67 68 69 66 58 51 56 72 90 103 111 118 121 120 123 133 145 148 139 124 114 114 122 132 136 130 121 121 138 168 200 224
2674 224 231 216 183 144 111 89 82 95 124 154 171 168 153 144 155 188 228 256 261 248 232 222 217 211 199 180 156 137 125 117 112 110 115 121 119 102 76 51 38 36 41 44 46
2656 46 46 44 40 37 43 55 65 69 71 77 86 90 94 101 112 118 118 122 140 168 193 202 195 180 163 149 143 149 168 191 205 201 182 161 146 135 124 109 93 80 74 77 85 97 113 139 172
2637A72K6Pj4k6k9k5j4MJ8K0J5J1O%j1j7j8j7j6j6j3qpqoMJ7K7L0K6K2J8J7J6J4Mj1k1k0j6
2621A61j9l0l4k4j2rqLK1K8J4pk1k2j5%J7K2Nj2j3%NkrqklqqoonJJ0J3PNOMmj7k0j6kRJ0N
2602DJKJoj8k3j5lLOJ4K4L2L4K8K1J3J0QJ1RQPPOkj4k2k4k6l0l4l1j4LJ2J1MJ%mj0j1nPJ2
2584GJ3PPJ5K7L1K8K5K6K7J7%j5k0j6nORjk0l7l8k7j5qlMJ5K0J8J1QRJ0QOMkrj5j3oKOQOj
2565A29rj3j4j4j2kJ4L0L2K3Pj0k5l4l0k0j1nLJ2J5J2PJ0J7K7L2K9K0Opj7k2k3k2k3k0j7q
2549F7KJ2K3L1L2K5J4QMNPJ3J5Rmk0l1l6l3k3j2lklqj8k9k9j3J0K1K0J0jpkJ1K5K3Oj1j5j1
2532H2nKQQmk1l0j9NK3K7K2J2Lrj7j8j2mjj%KLKNJ1Rlj2qOJ3Kj6k2j7plorpmLJ1K3K9K5Oj2
2512G5k3k3k0k0k1j8j0%PQMKJLMRK0K9L1J9KpqqlMJ0J1Mnj2j3nLPMmj0j8k5k6j8nknoPK3L0
$$ plain form
2637 172 198 205 191 165 136 111 97 101 119 139 154 165 171 171 160 143 125 108 92 76 63 55 48 40 34 38 55 82 112 138 160 178 195 211 225 229 218 197 177 161
2621 161 142 112 78 54 42 33 25 28 49 77 91 84 63 41 26 26 43 65 70 58 45 45 50 48 39 31 29 26 18 10 4 -2 -7 -6 4 17 24 29 35 39 35 18 -2 -18 -20 -11 -1 4
2602 4 5 7 8 2 -16 -39 -54 -57 -54 -48 -34 -10 22 56 84 105 118 128 136 147 156 164 171 178 184 182 168 146 122 96 66 32 1 -13 -10 2 13 17 18 18 14 4 -7 -12 -5 7
2584 7 20 27 34 49 76 107 135 160 186 213 230 230 215 195 179 174 180 189 188 168 131 93 66 51 43 40 44 59 79 97 108 116 125 135 143 149 153 151 142 127 114 108 110 116 124 130 129
2565 129 120 107 93 79 67 65 79 109 141 164 171 161 136 102 72 52 41 36 39 51 66 78 85 95 112 139 171 200 220 226 219 202 180 157 135 112 92 75 67
2549 67 69 81 104 135 167 192 206 214 218 223 230 243 258 267 263 243 212 176 143 120 108 105 103 100 92 74 45 16 3 13 34 54 64 63 56 54 65 90 113 119 108 93 82
2532 82 77 79 87 95 91 70 40 21 26 49 76 98 110 113 104 87 69 57 53 52 51 51 53 56 58 63 74 83 80 68 60 66 79 81 65 43 26 19 16 10 1 -6 -10 -7 4 27 56 81 87 75
2512 75 52 29 9 -11 -32 -50 -60 -60 -53 -45 -41 -39 -38 -35 -31 -22 -2 27 58 77 79 72 64 56 53 57 67 78 82 77 65 52 47 50 57 61 57 47 29 4 -22 -40 -45 -47 -52 -58 -51 -28 2
2492BK7K2K0J9J2Lqj8k7k6rJ0K1J5OJPJ6K4K8K4J1jkMOok6m2m3l1j4moj3j0JJ3K3K2J7J0M
2475H2%jnj2j6j0kK%jPJ5J9J8J4NmqppplQJ4Pmj3j3j1j1j4k3l3l5j8NJ8J3jokJkj0j2nQK1
2455c9K8K9L1K9J8Lj0j0JJ1J4RLllKJ4K2J6kk3k6j8j2j5k0j4KJ0PNJ1J7J3Jj0qNJ8J9Pnr%
2438A18QJ5J6J5Oj3l1l3k0lQOlj3k1k1k1j8j7j1%J1K2L1L4K8J6RQJ0J3J5J4Oqj4j3olmpj2
2421A17j7j7nJ2K5K3J0mj1j1j1j4k0k0j5q%MMjoqrj0q%J4K5K6K0Rlj2j3mNPkj0j1nPJ0jj9
2403D3k8j6kMkj2j0lOJ3J5J5RLMJ2K3K4J9Lj5l1l6k7j1MJ2J3J3J1OJkkmpj0p%OJ1J2QJpj4
2384D5k1k5k6j6MK1K7K1Pqk0k3k3j6j1j0j0pPK3L6L6L3K7K2J7J1Moj5j7pNJ0Morprj6k1j4
2368A7KJ7K0J3Mpj8k5k5j8j1qlKOOORRNLJ0K1K6K1Rqk3l3l3k7j7nQJ7J5QMORNMOJ1J6J9J5
$$ plain form
2492 2 29 51 71 90 102 105 97 79 52 26 17 27 48 63 69 70 77 93 117 145 169 180 179 177 181 187 181 155 113 70 39 25 21 15 2 -8 -7 6 29 51 68 78 82
2475 82 82 81 76 64 48 38 36 38 38 37 44 59 78 96 110 115 111 103 96 89 82 79 87 101 108 104 91 78 67 56 42 19 -14 -49 -67 -62 -44 -31 -32 -38 -40 -39 -41 -51 -63 -68 -60 -39
2455 -39 -11 18 49 78 96 99 89 79 80 91 105 114 117 114 111 113 127 149 165 163 140 114 96 84 69 49 35 37 47 54 59 70 87 100 101 91 83 88 106 125 132 127 118 118
2438 118 126 141 157 172 178 165 134 101 81 78 86 92 89 76 55 34 13 -5 -22 -33 -33 -22 0 31 65 93 109 118 126 136 149 164 178 184 176 162 149 143 140 136 129 117
2421 117 100 83 78 90 115 138 148 144 133 122 111 97 77 57 42 34 34 38 42 41 35 27 18 8 0 0 14 39 65 85 94 91 79 66 62 67 74 72 62 51 46 53 63 62 43
2403 43 15 -1 -3 1 -1 -13 -23 -26 -20 -7 8 23 32 35 39 51 74 98 117 120 105 74 38 11 0 4 16 29 42 53 59 60 58 56 52 45 35 28 28 34 45 57 65 66 59 45
2384 45 24 -1 -27 -43 -39 -18 9 30 37 29 9 -14 -37 -53 -64 -74 -84 -91 -84 -61 -25 11 44 71 93 110 121 125 119 104 87 80 85 95 99 93 84 77 68 52 31 17
2368 17 19 36 56 69 73 66 48 23 -2 -20 -31 -39 -42 -40 -34 -28 -22 -13 -4 1 4 14 35 61 82 91 83 60 27 -6 -33 -50 -55 -47 -30 -15 -7 -3 3 12 17 21 27 38 54 73 88
2349H8Pnolkrj4qkpk0k5j8JK0L1L3K2RLQJ5J6Q%npqpprj7k5k5j7kJ0K1K5K1RkmJPRJ2J7J8
2329A57J5J0PJj2k3k5j6rj0j5j3lPPL%NJ0Nj1k6l2l2k7j8kJ3K2K0J7J9K4K5J4nk0k3j0MJ4
2313F7J7J4J0MLKLJkjmpj1j0j0j2j1oMJ0J2RNK%LPQRJ1J3J7K2K2J3mj8j9j0nj1j9k1j9j7j5
2294E6j5j2pLQNmqo%NJ2K0K0J1NKjqrJJ4J4Mpj4j4rJQJ0OK%lmJLJ%NJ4J2JrqjJ0J8J8Nj2j6
2273A28nPQ%%KLnj0qljLRJ7J9Pj2k8l5l2k1j1%RJ4J3J1J1J5J6J1mj8k5j9j3j3j6j3jQJ1J3
2255D2J5J7J4J1Qjj5k7k4j1jLRJ3J5J4J7K9L2J4j5l4l4k1kJ1J5OorLJ7K2J5Olj0j5j7j7j8
2239F8k4l2l4k5nJ5K0J1lj1j2j0mNJ3J5Qlj3j9j7j0LJ5J8J5J1J3J7J7J3Ojrj9l2m5m3k5KK5
2222h6L7L8L2K6K0J7J3RNJoj9l4l2oK4M0L4J5mj6k3k4k0j5j3j4j8k6l2l2j9JJ2J3J1J5K0J8
$$ plain form
2349 88 95 90 84 81 79 70 56 48 46 39 19 -6 -24 -23 -3 28 61 83 92 95 103 118 134 142 142 137 130 122 115 108 99 82 57 32 15 13 23 44 69 90 99 97 93 94 101 110 122 139 157
2329 157 172 182 189 190 178 155 130 114 105 95 80 67 64 71 78 81 81 86 96 101 90 64 32 0 -27 -45 -47 -34 -12 8 25 44 68 93 107 102 82 59 49 53 67
2313 67 84 98 108 112 115 117 120 121 119 118 114 107 96 86 76 64 53 47 51 61 73 82 87 89 89 92 99 107 116 127 140 157 179 201 214 210 192 173 163 158 147 128 107 88 71 56
2294 56 41 29 22 25 33 38 34 26 20 20 25 37 57 77 88 93 95 94 86 77 78 92 106 110 103 89 75 66 67 75 85 91 93 93 90 86 87 90 91 91 96 110 122 123 114 106 105 115 133 151 156 144 128
2273 128 123 130 138 138 138 140 143 138 128 120 117 116 119 128 145 164 171 159 131 96 64 43 32 32 41 55 68 79 90 105 121 132 128 110 85 66 53 40 24 11 10 18 29 42
2255 42 57 74 88 99 107 106 91 64 40 29 28 31 40 53 68 82 99 128 160 174 159 125 91 70 68 79 94 100 94 85 88 105 127 142 148 145 135 120 103 86 68
2239 68 44 12 -22 -47 -52 -37 -17 -6 -9 -20 -32 -42 -46 -41 -28 -13 -5 -8 -21 -40 -57 -67 -64 -49 -31 -16 -5 8 25 42 55 61 60 51 32 0 -45 -88 -113 -111 -86
2222 -86 -49 -11 21 47 67 84 97 106 111 112 106 87 53 21 15 39 79 113 128 124 108 85 61 41 26 13 -1 -19 -45 -77 -109 -128 -127 -115 -102 -91 -76 -56 -38
2207c8RKLQJ1QOPQMnj4k0k2j6%J9L0K9K1J8K3K0Pj2k7l1l2k7k2rNJ3J3QLJ%lj1j7j7oJ3K6
2188a4L1L2L1K3Nj6l1l0j4J0K8L5K6J1MK%mjJ1K6L0K0Kj5k3k5k1j7j1nj%jl%lj2k4k8k2rn
2171hoj3j3%J4J9J2ONOL%JNOOPNKJQJ6K0J4O%j1k4l2l3k6j6jJ5K2J8PJ%knjJ0J7J8J0Ljjk
2151H8mj4k2k3j3jOMmpoJPONOJ2J3Qlj0j3qMJ7K4K0J0NK%qj4j3pjjqj6j9j7rjOJ2PkrjJ7L3
2131E9L5K6J1lj3j8j8j3oMJ4K0J9J5J3J2J5J7K1K2J8J5Qlk1l2k8j2loj7j9j2m%MQRJj3l0l9
2114E6l5k3rPK0L1L0K0Mj5l3m0l2k0j2rMK3L5K9J3NRJ5J9K5K9K9J7Lj0j8k2k1j8j0m%Kjrj6
2097F8j8j2KJ6K4K1J3Jmoj0k0l2l5k5j0Jlj4j4lQPoj7k0j7j0mJLLOJ2J9K2J7QLNJ2J6K0K4
2079E2L0K5Rqj3lJ5K7L1K8J3qk4k8k1j0k%mpj0oJJ1J8J3mk1l2l3k2nJ4K6K3J1Jljj%kmolK
$$ plain form
2207 -38 -29 -27 -24 -16 -5 3 9 16 24 28 23 9 -11 -33 -49 -49 -30 0 29 50 68 91 111 118 106 79 48 16 -11 -33 -42 -37 -24 -11 -3 0 1 1 -2 -13 -30 -47 -53 -40 -14
2188 -14 17 49 80 103 108 92 61 31 17 27 55 90 116 127 131 133 133 129 128 139 165 195 215 217 202 179 154 133 116 105 100 99 99 98 95 95 92 80 56 28 6 -3 -8
2171 -8 -14 -27 -40 -40 -26 -7 5 11 16 22 25 25 26 31 37 43 50 55 57 58 66 82 102 116 122 122 111 87 55 22 -4 -20 -21 -6 16 34 41 42 42 40 35 34 44 61 79 89 92 91 90 88
2151 88 84 70 48 25 12 11 17 21 17 10 4 5 12 18 23 29 41 54 62 59 49 36 28 32 49 73 93 103 108 110 110 102 88 75 68 67 66 58 42 23 6 -3 -4 2 14 21 19 10 9 26 59
2131 59 94 120 131 128 115 97 79 66 60 64 78 98 117 132 145 157 172 189 210 232 250 265 273 270 249 217 189 177 174 168 151 132 120 116 116 120 128 137 138 125 95 56
2114 56 21 -2 -11 -4 16 47 77 97 101 86 53 13 -19 -39 -51 -60 -56 -33 2 31 44 49 58 73 92 117 146 175 192 195 185 167 145 124 106 96 92 92 94 93 84 68
2097 68 50 38 40 56 80 101 114 115 111 105 95 75 43 8 -17 -27 -26 -29 -43 -57 -60 -52 -45 -51 -68 -88 -105 -115 -119 -118 -115 -112 -106 -94 -75 -53 -36 -28 -25 -20 -8 8 28 52
2079 52 82 107 116 108 95 92 107 134 165 193 206 198 174 146 125 115 113 113 109 102 92 86 87 98 116 129 125 104 72 39 17 12 26 52 75 86 87 84 83 82 82 80 76 70 67 69
2061F9Mjqj3j5j9k0k0qJ3L4M6M0K1Lj0j4j6oJ4L3L6J9Jrrj1k3l3l5k6j6j2rkJ2K6K6J9J1Q
2044A00NLNQPkj6k7k9k8k7k7k2j3lJJlqj4j3%J9L4L7L0K3J2%qj1j0pKJ7L2L7K6Pj3k8k9k1
2027D7mPJ0OJkmjKlj1j9j6pLJ1J2Opj4j3pn%QJ2Opj6j6qLJ2J7J8J0JopnjKjj0j8k3k3k1j6
2007i7oPJ8J8J2%rj4j2mOJ2J3J1QQJ2J5J4QlnLJ3J7PnqlKKlml%KMM%opkOJ3J9K2K1J2Knpr
1986I9j3j9k0j6j4j1nPK2K7K2J3RQJj4k9l1j6J4L7M4L1J4LNRPkj3j7j2qpj1j1nMPNjpj2j1
1969H3%J8K6K0P%KKnj8k8k3j2moj3j5j2j0oJJ4K4K4J7J0MKLJ0K0K5K4J4KoqkKK%%Jmj0j3p
1950A55LQNoj7k2k0j7j8k6k9k3j1NJ4K0J8J3PJpj6k1k0k0j8j5mJ3K7L0K7K0J5J4R%j1j3jJ8
1933H7L4L6K9J3ok2k2rMROJjlnjMMJnorj3j7j5qnj0j9k0rMJ1OJNJ6K2J9J3PMkrj4j6j0LJ3
$$ plain form
2061 69 73 72 64 51 36 17 -3 -23 -31 -18 16 62 102 123 126 116 102 86 80 94 127 163 182 183 174 165 154 131 98 63 37 21 9 0 -2 10 36 62 81 92 100
2044 100 105 108 113 121 128 126 110 83 54 26 -1 -28 -50 -63 -66 -65 -64 -67 -75 -89 -102 -102 -83 -49 -12 18 41 53 53 45 34 24 17 19 36 68 105 131 138 125 97 68 47
2027 47 43 50 60 66 67 65 61 60 62 59 48 29 13 6 9 20 32 38 31 17 4 -3 -8 -8 0 12 18 11 -5 -21 -29 -26 -14 3 21 31 32 26 19 14 13 15 14 4 -14 -37 -60 -81 -97
2007 -97 -103 -96 -78 -60 -48 -48 -57 -71 -83 -87 -81 -69 -56 -45 -37 -29 -17 -2 12 20 17 12 15 28 45 52 47 39 36 38 40 37 33 30 30 32 36 40 40 34 27 25 31 44 63 85 106 118 120 115 108 99
1986 99 86 67 47 31 17 6 1 8 30 57 79 92 101 109 110 96 67 36 20 34 71 115 146 160 163 168 177 184 182 169 152 140 132 125 114 103 98 102 109 114 113 106 94 83
1969 83 83 101 127 147 154 154 156 158 153 135 107 84 72 68 62 49 34 22 12 6 7 21 45 69 86 96 100 102 105 115 135 160 184 198 200 194 186 184 186 188 188 188 189 185 175 162 155
1950 155 158 166 171 165 148 126 106 89 71 45 16 -7 -18 -13 1 21 39 52 59 60 53 37 16 -4 -24 -42 -57 -61 -48 -21 9 36 56 71 85 94 94 83 70 69 87
1933 87 121 157 186 199 193 171 149 140 144 153 159 160 159 156 151 150 154 158 159 154 148 139 126 109 94 86 81 71 52 32 23 27 38 44 45 50 66 88 107 120 127 131 129 120 106 90 80 83 96
1914I6J4Morqppoj1j6j8j4pmjRK2K3Qj4l1l5k9j8o%NJ3K1K6K2J3Jj0j5rJPP%pj1j0JJ6K6K8
1895E4K1J1mk5l6k8oJ5K2K0J9K0K1K3K0J2kj2j5j4j3j4j5j0njknqnLJ1Qlj5j9j8j6j3jJ6K4
1878A5K5J6PjljMOKkl%jnpjLKnj4k2k2k2k0j9j7j0KJ0J0NLMPJ2J4J3RORJ5J6J1Kk%KKlj1j5
1858B6j3p%OJ2J4Qlj2j1lPK0L1L7L4K5J1%pj1j4k2k9l0k4j7j5j5rNJ7K4K4J7Mj1k0j7rkoj9
1840dl0k7rJ6L7M8M9M2L0J9J7J6Rmj7k4k3j5pmqj9k1j0PK0K2J6Pnj9k7k6j6pnrj1nRK5L0K3
1823I0Lj6k6k7k2j8j6qJNKkMJ4K1K1J6J1RJ4J9K1J3Km%NOLkj0k2l5l5k3oOJ1Mrj7j4jJ1J2
1805A1Omj3j5j5rnlkOJ9L0L7L3K5J3LJQJ7J7Orj9k1k1j4pnj3k6l3l4k5j5mPJ7K1K4K4K0Mj5
1787B2k0j0JNJJQJ1Pnj5j6j4rmJJ0K1K7K6J6Kj1k1k6k5j8qMJ2J4J2RPLj%JjoqljlqrmOJ2P
$$ plain form
1914 96 110 114 108 99 91 84 77 71 60 44 26 12 5 1 0 9 31 54 62 48 17 -18 -47 -65 -71 -71 -66 -53 -32 -6 16 29 30 20 5 -4 -3 4 11 11 4 -7 -17 -16 0 26 54
1895 54 75 86 82 57 21 -7 -13 2 24 44 63 83 104 127 147 159 157 145 130 116 103 89 74 64 59 58 56 51 43 38 41 52 60 57 42 23 5 -11 -24 -25 -9 15
1878 15 40 56 63 62 59 58 62 68 70 68 65 65 64 59 52 51 54 56 51 37 15 -7 -29 -49 -68 -85 -95 -93 -83 -73 -68 -65 -61 -54 -42 -28 -15 -6 0 9 24 40 51 53 51 51 53 55 52 41 26
1858 26 13 6 6 12 24 38 46 43 31 20 17 24 44 75 112 146 171 182 182 175 164 150 128 99 69 45 28 13 -2 -11 -6 11 35 59 76 80 69 49 32 23 21 15 -4
1840 -4 -34 -61 -70 -54 -17 31 80 122 152 171 188 204 213 209 192 168 145 130 123 119 111 92 71 61 68 88 110 126 133 128 109 82 56 40 33 28 19 8 3 12 37 67 90
1823 90 93 77 51 24 2 -16 -32 -40 -39 -34 -32 -34 -30 -16 5 26 42 53 62 76 95 116 129 131 127 127 132 138 141 139 129 107 72 37 14 8 14 25 29 20 3 -11 -12 -1 11
1805 11 17 13 0 -15 -30 -39 -44 -47 -49 -43 -24 6 43 76 101 114 117 118 126 143 160 166 157 138 117 96 82 75 70 57 31 -2 -36 -61 -76 -80 -73 -56 -35 -11 13 33 37 22
1787 22 2 -8 -7 -2 -1 0 8 19 26 21 6 -10 -24 -33 -37 -36 -26 -5 22 48 64 66 55 34 8 -17 -35 -43 -39 -27 -13 -1 8 15 18 17 17 18 17 11 3 0 -1 -4 -12 -21 -25 -19 -7 0
1767@kj5k1j6%J7L0K8J5lj2rmjKJ1K2K4J0lj2j0pmJMOPJ0ROKMJ4K4K9J9%j8k2j4%J3K0K6K5
1749B05J5kj8l0l6l7l4k5j3jLkj4j9rPJ9K7L2L4K5Oqj0m%NJ3J5Nj5l0l2k3j2kKMNJ0QKqrl
1731D6JkokOJ1J4J5J8J6J0nj7j8pJ0K0J9J4Q%qj1j0prqKJ6K0J3Kmnmmmqj6k5k8k2j5qkLNP
1711B1ONQJ3J6J3OJKLkpj2j3j1qmjjKJ0J7J5OklmnqqponlmpoMJ4J6J0L%JMJ3K8L7L3J9N%K
1690B06Jpj7k5l0l4l3k4j1MJ5J8J6Ork3k9k1rNJ4K2K2J4Mmm%MPONjnj2j4j3o%KJjmnn%QPm
1670C7k1k6j8LJ8K3K2K3K5K4J9J9K5L4L1J6kj5k6l5m4m2l0j3%QJ2J5J4Onj3j2rj1k0k4j8n
1655a5OJ3K1K6K1RMQJ2PlkQJ4Nj8l7m2l1j6oJLKjJNJ2J8K1K0J7J1Kmpononorj5j6rknj6k3
1635c8j4MJ7J9J3J0NkolOJ6K4K8K8K4J8J4J2Mj0k3l0l4l7l5k2nNQPJ7L0L7K8J5OMONKKKJk
$$ plain form
1767 0 -2 -17 -38 -54 -54 -37 -7 21 36 33 21 12 8 7 9 20 42 66 76 73 61 51 44 40 41 45 51 58 68 77 83 85 89 103 127 156 175 175 157 135 121 121 134 154 180 205
1749 205 220 218 200 170 134 97 63 38 25 24 27 25 11 -8 -17 -10 9 36 68 102 127 133 125 115 111 111 116 129 144 149 134 104 72 49 37 35 37 41 46 56 64 66 58 49 46
1731 46 47 45 39 37 43 54 68 83 101 117 127 122 105 87 80 90 110 129 143 151 151 143 132 122 115 106 98 100 116 136 149 151 147 142 138 134 130 122 106 81 53 31 16 8 6 9 14 21
1711 21 27 32 40 53 69 82 88 89 91 94 92 85 73 60 49 41 37 36 35 37 47 64 79 85 83 80 76 71 63 55 48 42 37 34 30 23 17 21 35 51 61 64 64 65 69 82 110 147 180 199 204 204 206
1690 206 207 200 183 158 128 94 61 37 26 30 45 63 79 85 76 53 24 3 -6 -1 13 35 57 71 75 71 67 67 71 78 84 89 88 83 71 57 44 38 38 40 41 40 36 31 26 26 34 41 37
1670 37 16 -10 -28 -25 -7 16 38 61 86 110 129 148 173 207 238 254 252 237 211 176 132 90 60 47 47 55 67 82 96 102 97 84 72 63 52 32 8 -10 -15
1655 -15 -9 4 25 51 72 81 85 93 105 112 109 107 115 129 134 116 79 37 6 -10 -16 -15 -12 -10 -11 -10 -5 7 25 46 66 83 94 96 92 85 79 74 68 63 57 48 33 17 8 6 1 -15 -38
1635 -38 -52 -48 -31 -12 1 11 16 14 8 5 11 27 51 79 107 131 149 163 175 179 169 146 116 82 45 10 -12 -17 -12 -4 3 20 50 87 115 130 136 140 146 151 153 155 157 158 156
1617A56jkmj2k0k1j5nPJ4J5OjnomlKMMKNJ3K2K7K4J5Ojmrk2l5l9l4k1j0LJ3J3Kj5k5k8k4j6
1599b9lJ0J8K1K1J6J3J4K2K7K5J6Olj6k9l2k1jJ6K6L0K2Nj0j4nMkj9l6m2l8k7j7j1mKJ1J8
1583a6J7J2%pom%OJ6K2J8Nj0k0k5k8k7k2j3ppj1j3p%MLOJ8L3M2L3K0QJlmkMJ1J3QJl%Ljrj5
1563D4j3rnjNNJm%PQmj6j8j1n%MJ2K0K1J2mj3j5rjQJ5J3Krj1kJ0J7J4NnroMJ2J0L%OJ1QJl
1542A05JNLlnJJ1J3Lj2k4k4j8j0rj2j7k1j8rNJ1Nj1k3k6k1j4qmjKOJ1J6J9K4K9K5J6ONJ5K5
1525G2K8K4J5Pjnprqoj0j8j9mJ5K6J9QLKknnoj7k8l0j8jJ5K4K8K8K4J6%j9l3l1j5KJ6K3K7
1507A25K2Pj7l5m2l2j7j0qj4j3j0lNJ6K3K5K4K2J8QkkOJ5K0J8J2MjJPPlj4j3jQMrk0j9nJ3
1489A20K0J8J2Mlj0j4j5j5j7j8qOJ7K1J5Jj8l2l9l3k5k0j5nNJ5J8J7J6J7J8J3Lrj3j2j3j6
$$ plain form
1617 156 155 153 149 137 117 96 81 76 83 97 112 118 117 112 106 102 99 101 105 109 111 116 129 151 178 202 217 223 222 218 209 187 152 113 79 58 48 51 64 77 79 64 39 11 -13 -29
1599 -29 -32 -22 -4 17 38 54 67 81 103 130 155 171 177 174 158 129 97 76 75 91 117 147 169 174 164 150 145 149 147 128 92 50 12 -15 -32 -43 -47 -45 -34 -16
1583 -16 1 13 13 6 0 -4 -4 2 18 40 58 63 53 33 8 -20 -47 -69 -82 -89 -96 -107 -120 -127 -127 -123 -120 -114 -96 -63 -21 12 32 40 41 38 34 32 36 47 60 68 69 66 66 69 68 59 44
1563 44 31 22 17 16 21 26 27 23 23 30 38 34 18 0 -11 -16 -16 -12 0 20 41 53 49 36 21 12 11 19 34 47 49 40 29 27 37 54 68 73 68 59 53 57 69 79 82 82 88 99 107 108 105
1542 105 106 111 114 111 106 107 118 131 134 122 98 74 56 46 37 25 8 -13 -31 -40 -35 -24 -19 -30 -53 -79 -100 -114 -122 -126 -127 -125 -119 -108 -92 -73 -49 -20 5 21 27 32 47 72
1525 72 100 124 139 146 145 140 133 124 116 110 100 82 63 59 74 100 119 127 130 132 130 125 120 114 97 69 39 21 20 35 59 87 115 139 155 155 136 103 72 57 59 75 98 125
1507 125 147 154 137 102 60 28 11 1 -7 -21 -34 -44 -47 -42 -26 -3 22 46 68 86 94 92 90 96 111 131 149 161 165 164 165 172 179 176 162 149 148 156 160 151 131 112 107 120
1489 120 140 158 170 174 171 161 147 132 117 100 82 74 80 97 118 133 134 116 84 45 12 -13 -33 -48 -53 -48 -33 -15 2 18 35 53 66 69 60 47 35 22 6
1474Fj3jJ2J7J3QJ3K3K8K1Nj5k8l0k0pkpj8j7%J9L1K5J5PNORJ2J1Mqj9k5k6k0pOQKnorj2j4
1455cj0%RJ1J1J5K7L8L7K5Ooj3j5j5j0lLLmj4j6j2m%%nqpnrj3j3mNJ3J1PMPJ2J6J7J7J3Nr
1436A14k1k5j6jJ0J0Krj5j3oJQJ2J6K0K2J8Pmpqj2j9k8k8k1j0jOJ2J2J1RNnj4j2JJ3J6J2R
1419G1OJqj6k1k3j9pJ0K1K7K8K5K1K1K1K1J5O%lj0k1k8k6j8j0%J5K7K6J1qk3l1l0j8kLmj1
1403C9rJPPMQJ9K8L0K3J1%rj6j8j3rpj2j2qmoj0oOJ8K4K2K1J8J6J2P%j2l1m7n1l8k0nNJ0P
1385@%rj0mMOPRJ6J9K3K4K4J6Mookjmqj1j3j6j8j2KJ6J9Qj0j8j4JJ0J0LOJ7K5K2J2NMJpj0
1366A34nMLoj7k2j5nLmj9l1l1k5j5oOJ5K1J8J5J2J2J4J3Plj4k2k1j3lPPLkkkpj0qJJ1QLln
1347AKRJ3J3J2J3J6J7J7J3RJnomqj1j0JRJ0QMJoj0rlMJ1J7J9J1kqpoj1j9k3k0j4mLMjm%J1
$$ plain form
1474 6 -7 -8 4 21 34 42 55 78 106 127 132 117 89 59 39 32 30 23 5 -12 -12 7 38 63 78 85 90 96 105 117 128 132 124 105 80 54 34 27 33 41 43 38 32 23 11 -3
1455 -3 -13 -13 -4 7 18 33 60 98 135 160 166 160 147 132 117 107 104 107 110 106 92 76 64 60 60 60 55 47 40 35 26 13 0 -4 1 14 25 32 36 43 55 71 88 105 118 123 114
1436 114 93 68 52 51 61 71 73 64 49 36 30 31 39 51 67 87 109 127 134 130 123 115 103 84 56 28 7 -3 -4 2 14 26 37 46 51 46 32 20 21 34 50 62 71
1419 71 77 78 70 54 33 10 -9 -16 -6 15 42 70 95 116 137 158 179 194 200 200 197 187 166 138 112 94 84 84 99 126 152 163 155 132 101 71 53 51 54 50 39
1403 39 30 31 38 45 49 57 76 104 134 157 168 168 159 143 125 112 103 96 84 72 64 60 54 44 38 44 62 86 108 129 147 163 175 182 182 170 139 92 41 3 -17 -22 -17 -7 0
1385 0 0 -9 -19 -23 -19 -13 -6 3 19 38 61 85 109 125 129 123 117 115 114 110 102 91 78 62 44 32 34 50 69 77 67 49 35 36 46 56 59 65 82 107 129 141 146 150 151 144 134
1366 134 129 133 136 130 113 91 76 71 74 70 51 20 -11 -36 -51 -57 -51 -36 -15 3 18 30 42 56 69 76 73 59 37 16 3 0 7 14 17 15 13 11 4 -6 -14 -13 -2 6 9 6 1
1347 1 3 12 25 38 50 63 79 96 113 126 135 136 131 125 121 113 102 92 93 102 112 120 124 125 119 109 100 97 101 112 129 148 159 157 149 142 136 125 106 83 63 49 45 48 52 51 47 47 58
1327E8K5L2L4K4Pj4l0l7k9j6lJ%kJLJkomNJ8K7K9K0Nrj5j2qprqqrj6j5mJ0K0K0J9J9J7Onj2
1308A21j1j1j2j2rlJOJ2J2NmmLJ1Nrj9j7p%%%KQJ7K3K6J9Pnj2j1lMLqj7j8j0kOJ4K0J6J0O
1289A53J0J7J9J6J1Lmqqj2j9k5k5j8j7k0k2j4NK6L7L3K0ROMK%jLNOLkj0j9k4k1j6rl%lolL
1271H2J2K1L1L0J7pk1k0j0k%OJ1J0%j0j8k3l2l2k4qNJ0J2J5J5J6J4J4J3J6J8J7Rmj2j0nmr
1254A43j3j7j8j9k0j6pLJ5K1K1J5MjjNRNlj1j3j2rnkqk0k8k1j0JJ1K1K9K6J6QQJ1J1J1J0J
1237A51j4k5k1rMJ1J3J0QRJ6J4ml1m6m2l1j9j2ol%QK1L6M1L6K0jj4j4o%mj1j4j5j8j5rKOP
1220B9MNRJ4J0nk3k7j6LJ5K1K3K3J9J5J6J8J4Nnj2j9k3k0j2npj3j7j7j4oMQMmj0qKJ3K2K1
1203E4J8J9J9J6Mprj1j7k3k1j0LJ2J7J5R%om%L%mnnlNJ2J5J0KjmpqrmKOPjj8l7m5l9j9NK4
$$ plain form
1327 58 83 115 149 173 180 166 136 99 70 54 51 52 52 50 51 54 55 53 47 43 48 66 93 122 142 147 138 123 111 103 96 87 79 71 62 46 31 27 37 57 77 96 115 132 138 133 121
1308 121 110 99 87 75 66 63 64 70 82 94 99 95 91 94 105 110 101 82 65 58 58 58 58 60 68 85 108 134 153 160 155 143 132 129 133 136 128 111 93 83 81 87 101 121 137 147 153
1289 153 163 180 199 215 226 229 225 217 209 197 178 153 128 110 93 73 51 37 42 68 105 138 158 167 173 177 179 179 178 181 186 192 195 193 183 164 140 119 103 94 91 91 88 82 79 82
1271 82 94 115 146 176 193 186 165 145 135 133 133 139 150 160 160 150 132 109 77 45 21 13 18 28 40 55 70 86 100 114 127 143 161 178 187 183 171 161 156 152 143
1254 143 130 113 95 76 56 40 33 36 51 72 93 108 112 111 110 115 124 129 126 115 102 90 81 76 74 66 46 18 -3 -13 -12 -1 20 49 75 91 99 107 118 129 140 150 151
1237 151 137 112 91 82 86 97 110 120 128 137 153 167 163 132 86 44 13 -6 -18 -24 -27 -27 -19 2 38 79 115 135 134 120 106 100 100 96 85 71 56 38 23 14 16 22 29
1220 29 33 38 47 61 71 66 43 16 0 3 18 39 62 85 104 119 135 153 167 172 167 155 136 113 93 81 76 69 56 39 22 8 2 6 14 18 14 4 -4 -2 11 33 54
1203 54 72 91 110 126 130 123 114 103 86 63 42 32 35 47 64 79 88 88 82 78 78 81 81 77 72 67 64 69 81 96 106 108 107 103 96 88 79 75 77 83 90 89 71 34 -11 -50 -69 -64 -40
1183d0K8K0QK%oj9l1k6qJ0J9J6J1PMkprnOJ4J3J2J7K7K8J8J0J1J6J4lk1k6k0j0l%LQJ5J8J2
1165A31%j2k2k6k2nJ5K7K0Jj5k2k0j1KJ1J1QLjrj9k5k0j2j2j4j7j2nNK0L7M9M8L1Qrj6j5j5
1149G1j6j5j0JLoj7j7nJ1K3K5K3J6J2J3J2OlpkMMjkJLKmj0j3j2pklqj2j2qjNOkj3k2k0j6n
1130c0J0K1K6K1J4J3J3J4J4J5J3J0Jpj5k3k5j9qKMLJJOJ3J8J6Npj3j0mJOOPONKkpj0j0qj2
1111G7k2l2k8j2LOjj0j4j4j0lRK2L3M2L9K5Nj2j5j2rj0rqpqj0kJ3K1J7NMJ4K4J8%j7k4j8j0
1094F0oj1j9k0j0jnj7k2j2LJ3J6J5J3NkolLNNNMPJ9L3M4M5L6J7ql1m4m2l4k2j4ojPJ1J1Ml
1076D2mnrk0k7k9k4j1QK5L4L2K6J6ROJ2K3L0K7J6OLMOKj4l2m8n0m0k0jJ3J8J4RJ1J7J8Qmj3
1058H4j4j3rmNJ6K2J6jj6j9j4j0ojQJ5J6J3J0PNJ0J5J8Rok1k9l2k3oJ1K2K6K8L1K9J4nk2k8
$$ plain form
1183 -40 -12 8 16 18 18 12 -7 -38 -64 -72 -62 -43 -27 -16 -9 -5 -7 -14 -23 -28 -22 -8 5 17 34 61 89 107 117 128 144 158 155 134 108 88 78 75 75 78 86 101 119 131
1165 131 131 119 97 71 49 44 59 86 106 107 92 70 50 39 41 52 63 71 74 73 64 45 20 0 -12 -24 -38 -55 -67 -72 -67 -47 -10 39 87 118 126 117 101 86 71
1149 71 55 40 30 31 34 28 11 -6 -11 0 23 48 71 87 99 112 124 130 127 120 118 122 126 125 123 124 127 129 125 115 102 90 83 81 78 70 58 46 38 37 42 48 46 33 11 -9 -25 -30
1130 -30 -20 1 27 48 62 75 88 102 116 131 144 154 155 148 133 110 85 66 58 60 64 67 68 69 75 88 106 122 127 120 107 97 93 94 100 106 113 119 124 126 124 117 107 97 89 77
1111 77 55 23 -5 -17 -14 -8 -9 -19 -33 -47 -57 -60 -51 -29 4 46 85 110 115 103 88 76 67 57 48 40 33 25 15 13 26 47 64 69 73 87 111 129 129 112 88 70 60
1094 60 54 43 24 4 -6 -7 -12 -29 -51 -63 -60 -47 -31 -16 -3 2 0 -6 -9 -6 -1 4 9 13 20 39 72 116 161 197 214 206 175 131 89 55 33 19 13 12 19 30 41 45 42
1076 42 38 33 24 4 -23 -52 -76 -87 -79 -54 -20 12 38 54 63 69 81 104 134 161 177 183 186 190 196 198 184 152 104 54 14 -6 -7 6 24 38 47 58 75 93 101 97 84
1058 84 70 57 48 44 49 65 87 103 102 86 67 53 43 37 36 44 59 75 88 98 105 110 120 135 153 162 156 135 106 74 51 45 56 78 104 132 163 192 206 201 179 151
1042A51k6k1j4njJlj1j7j8j5qkLPRLpj1pkmj6k9k9k0pLPPOPJ0J1OjmjLkj1j6j2mKPJ6L1M0
1022FM0K8J8J5J6J3QML%nnjkj2k4k3j1NJ5J8J2%j5k5k2j4j1j5k2k9k6j3LJ5J9J7J8K1K1J2
1005E2jmjNNJkjNJ0QJkRK6L2K0LnlloplJjoj0j4j4j2ojMRJ3J3LlkjlqoMP%rj5j7j6j0JPKj2
983C7j4mJ0J5J0NLMNJqj7j7mJ3K3K1J4OKlnopj0j1mOQNJJlj4k2j7lON%MJ4K2K4K1J3Jqj0o
963A07lj0j8k2j6pKLJnj2j4j0kNOjoj0oj%%JMRJ9L5M4L4Pk0l3k6nJ4K8L0J8KmJQR%j0k0k8
944I8l5l2k0nPJ1RKoj3j8j9j4jJ1J7J1KkPK3L6L6K3OJOJ0Mj0k3k8k3pJ0J6Qrk1k6k6k4j6%
926b4J1J2KjLQNoj7k4k0pNPlj3j2JJ7K3J6RPRJ2QM%knn%NJ1J4J6J8K0J7J1NKJmj1j5qJQPP
905A25PJj2k5k6j6%J2K0K0J2mk0k7k3j5qjQJ5J6J1Klk%LKMPJ2J4J2RLrk0k3j8j3j1rmjoj1
$$ plain form
1042 151 125 104 90 85 84 85 82 71 54 36 21 13 11 14 21 30 33 26 15 8 6 2 -14 -43 -72 -92 -99 -96 -89 -82 -76 -69 -59 -48 -42 -43 -47 -48 -45 -47 -58 -74 -86 -90 -88 -81 -65 -34 6
1022 6 46 74 92 107 123 136 144 148 151 151 146 141 140 138 126 102 79 68 73 88 106 118 118 103 78 56 42 31 16 -6 -35 -61 -74 -71 -56 -37 -20 -2 19 40 52
1005 52 51 47 46 51 56 57 55 54 59 69 77 78 76 85 111 143 163 166 161 158 155 149 142 139 140 139 133 123 109 95 83 77 76 80 89 102 115 118 115 113 112 109 101 95 99 106 106 97 82 65 49 39 40 47 49 37
983 37 23 19 29 44 54 59 62 66 71 72 64 47 30 26 39 62 83 97 103 105 102 97 91 84 74 63 59 65 73 78 79 80 77 63 41 24 21 27 32 32 36 50 72 96 117 130 131 123 113 107
963 107 104 94 76 54 38 31 33 36 37 32 20 6 -4 -6 -1 5 4 -2 -12 -18 -19 -19 -19 -18 -14 -5 14 49 93 127 134 114 81 55 50 64 92 122 140 142 138 139 147 156 156 146 126 98
944 98 63 31 11 6 13 24 33 35 29 16 -2 -21 -35 -36 -25 -8 3 5 3 10 33 69 105 128 134 135 141 151 155 145 122 94 71 64 74 90 98 89 68 42 16 -8 -24 -24
926 -24 -13 -1 1 0 3 11 16 10 -7 -31 -51 -58 -53 -46 -49 -62 -74 -73 -56 -33 -17 -8 -1 8 20 28 32 32 30 25 20 20 25 36 50 66 84 104 121 132 137 139 140 136 125 110 102 103 111 118 125
905 125 132 133 121 96 70 54 54 66 86 106 118 114 94 67 44 29 21 20 28 43 59 70 72 69 67 67 70 72 76 83 95 109 121 130 133 124 104 81 63 50 39 30 26 25 19 8
887Hj0mKNRJ3J3J2J5J9J1rl2m4l6k3lJ5K8L1K7J7Nqj5k0k1j4pNRLnj4j6j4pLJ5K0J8J4QNN
869C3J0RN%LJ1J7J4Lj1k1k3j2KQO%lk%NQRPOPNLLJ1J4J0%qj2j3j1nloj2j7j5j3qlK%qj3j7
848b5j6j3pjJMRJ8K3J8J1Jmnqj5k8l4k7rNJ5J8J7J4J2J3J3J1O%kmjPJ7K4K5J9Qoj6j2lKnj6
830E4j9j4mNQM%MJ1J5J3J1J5K3K4J9J2J0J2J0jj7k7k7j3OK4L2K4Oorpj2k5l0k3j2omKQPlj6
812H4k3j8mRJ1Lnppqqnmmj0j1j5j7j9rOK2L0L0K6K4K0J6Qmj3j6j4j1rpqj2j5j0nJLL%mpmN
792a2J2J5J3J1J1J2J5J6J0%qplJ%knlLQMlm%Joj5j4j0kNRJ1J0OONNMMKmj1j2rjJ0K1J9Kj8
771A02k5j6lJ0J8K0J4Lqj4j9j6qkqk3k7k2j2qnJJ2J9K1K4K0RKKKrk3k4pJ3K6K9K7J6Jj7k8
754F7l0k4j0RK0K2J6J2J0QMMONlj5k6k6j7mOQONPJ2J6J6Orj8j2MJ9J8Plj0j0ojKKJMNjj1k2
$$ plain form
887 8 -2 -6 -4 1 10 23 36 48 63 82 93 84 52 8 -28 -51 -54 -39 -11 20 47 64 69 61 46 26 5 -9 -16 -11 -2 1 -4 -18 -34 -48 -55 -52 -37 -17 1 15 23 28 33
869 33 43 52 57 57 60 71 88 102 105 94 73 50 38 40 48 54 54 51 49 49 54 62 71 78 84 91 96 99 102 113 127 137 137 129 117 104 93 88 85 79 67 50 35 22 14 11 13 13 5 -8 -25
848 -25 -41 -54 -61 -62 -61 -57 -48 -30 -7 11 22 23 19 14 6 -9 -37 -71 -98 -107 -102 -87 -69 -52 -38 -26 -13 0 11 17 17 15 11 10 17 34 58 83 102 110 104 88 76 73 75 70 54
830 54 35 21 17 22 30 34 34 38 49 64 77 88 103 126 150 169 181 191 203 213 212 195 168 141 128 134 158 190 214 220 214 205 198 186 161 131 108 96 90 86 88 96 103 100 84
812 84 61 43 39 48 59 62 57 50 43 35 27 22 18 14 4 -7 -22 -39 -58 -67 -61 -39 -9 21 47 71 91 107 115 111 98 82 68 57 48 41 33 21 6 -4 -9 -8 -5 -2 -2 -6 -13 -17 -12
792 -12 0 15 28 39 50 62 77 93 103 103 95 88 85 86 86 84 79 76 79 87 91 88 84 84 85 79 64 50 40 38 43 52 63 73 79 85 90 95 99 103 105 101 90 78 69 68 78 99 118 120 102
771 102 77 61 58 68 86 106 120 123 115 101 82 66 58 56 48 25 -2 -24 -36 -44 -49 -48 -36 -17 4 28 48 57 59 61 63 54 31 7 0 13 39 68 95 111 112 95 67
754 67 37 13 3 12 32 54 70 82 92 100 104 108 114 119 116 101 75 49 32 28 34 42 48 53 60 72 88 104 110 101 83 71 75 94 112 119 116 106 96 90 89 91 93 94 98 103 102 91 69
734F9k3j8j0ooppJQJ2J2J2J1Lj0j7j2JRQLjnrqjNJ0J3J7J7RKMJ5K4K5K2J8J1lk3l9m5l9k9
716B3j9j4j1mNJ3J4J8K7L6L1J5JlJmj5k4j6%ROln%jj3l0l7l4j9lJ0J8K3J9J3OKKNQOjkNJ5
697G3J9J6Opk0k8k6j2NJ5J8J4RL%KRJ1QJnrj3j8j5nPJ4J3J3J9K4K5K1J6Ooj6j6rpj1j7k1j9
679H7j6pKNPPJ0QJrj5j9k0j6rjJllKJ2K3L2K7Rj1j6pKNKJLjqj0kRJ5J1kj3j7j1nJLLLPJ5K3
658A15K4J7J0NLkqj5k0k2k0j6j2rpjLNPJ1J5J4J2PLmj3j7j8k3k8k6j6jRJ0Nlo%J3K9L0K0M
640H4qj2ql%jjKOONOJ4J9J7Qjmnqj4j4oOJ1Lrj2qJORJ0QNLMQRLnj0j1omkloqj4k2l0k9k2o
618c9J0K5L3L7L3K5J0ok3l2l0j8p%KNRJ4J4J1NlpqmOJ5K2J8R%pj3j9j4lJ1J3Jj7k7k3qRJ5
600D4J0MNJ1J3Noj3j5j0KJ8K5K1J1MML%orrpmkjjj%%%MJ1J9K2J5OKPJ7K0J3Jj3k3k6k4j4l
$$ plain form
734 69 46 28 18 12 6 -1 -8 -7 1 13 25 37 48 51 41 24 12 13 22 30 33 32 27 18 10 9 14 24 37 54 71 80 82 86 101 125 150 172 190 201 198 175 136 91 52 23
716 23 4 -10 -21 -25 -20 -7 7 25 52 88 119 134 135 132 133 129 114 90 74 74 83 89 86 81 81 80 67 37 0 -34 -53 -56 -46 -28 -5 14 27 33 35 37 42 50 56 55 53 58 73
697 73 92 108 114 107 87 59 33 21 26 41 59 73 82 85 85 87 96 107 115 116 111 102 89 71 56 51 58 72 85 98 117 141 166 187 203 209 203 187 171 162 155 144 127 106 87
679 87 71 64 66 71 78 85 95 103 104 95 80 61 41 25 16 15 16 13 10 12 24 47 79 106 115 104 88 81 83 88 90 91 94 93 85 75 73 82 97 108 106 93 76 65 60 61 64 67 70 77 92 115
658 115 139 156 166 171 174 172 164 149 129 107 87 71 59 50 43 42 45 50 57 68 83 97 109 116 119 115 102 85 67 44 16 -10 -26 -27 -18 -8 -3 -6 -12 -12 1 30 60 80 84
640 84 76 64 56 53 53 52 51 53 59 65 70 76 90 109 126 134 133 129 124 116 102 88 82 88 99 102 93 81 73 74 80 89 99 107 112 115 119 127 136 139 134 124 113 107 103 101 98 92 84 70 48 18 -11 -33 -39
618 -39 -29 -4 29 66 99 124 134 128 105 73 43 25 18 18 20 25 34 48 62 73 78 75 68 60 56 62 77 99 117 126 126 119 106 87 73 70 81 94 95 78 51 28 20 29 44
600 44 54 58 63 74 87 92 86 73 58 48 50 68 93 114 125 129 133 136 136 130 121 112 105 101 99 98 97 96 96 96 96 100 111 130 152 167 173 175 182 199 219 232 233 220 197 171 147 133 130
580A30OQPKln%RJ4J1PPJ0J2J3Q%j0j6j6j2j1j0oKNMkrj9l4m2l3j1J3K2K1J1JoqqrpLK3M1M6
561A59L3J5%qj0j3j7j9j8j2m%jpj4j8j7qOJ5J4ROOJ0J1J2J1Nlol%%loooqj4k0k4k2j0QK1K3
542F7J7J0Lkorj1j6k4k5k0pJ1K7L1J7pk2k4j5j3j0lJ2K6L2K1%k0k3j1JQJ1J6J8RknKN%rj2
524D8pjNJ1J5J6J2P%omkkqj3r%NPOONLLPPMOJ3K1K0J0mj1j1m%kj2k5l2k7j5kK%kkjJLPJ1Q
503F7Mnj4k1k4k0rQK5K9J8lj2oLJj1k0j5lJ2K5L1L3L1L0K6J9Lj1k0k4k2j6j0qqpkMONkj1j3
485F3nJ3K2J6MKJ1K1K0J1NMPJ0Ojj2j7j9k1k2j6lQJk1m0m0j9NJ7J1ok1k7j6lKnj1qKPLKJ3
466d7L2M6M7L5K3J3Loj5k0k2k0k0j7j7j8k2k0j2jRJ0QOPJ1J3J5J1QOQJ0PJKPJ2J1PKlrj4j7
448G0j4qjMMKJMQKj5l2l4k0kQPMNJ2J9K1J5J1QLrk0k4j9j0nkKNOMLLLNOOJ%LJ1J2%j5k2j6
$$ plain form
580 130 136 144 151 153 150 145 145 154 168 179 186 193 203 215 228 236 236 226 210 194 182 171 161 155 157 162 166 164 155 136 102 60 27 16 29 51 72 83 84 78 70 62 53 46 49 72 113 159
561 159 192 207 207 199 189 176 159 140 122 110 106 106 105 98 84 66 49 41 47 62 76 85 91 97 107 118 130 141 146 143 137 134 134 134 131 125 119 113 105 91 71 47 25 15 23 44 67
542 67 84 94 97 95 89 80 69 53 29 4 -16 -23 -12 15 46 63 56 34 10 -5 -18 -28 -31 -19 7 39 60 60 40 17 6 7 15 26 42 60 69 67 62 64 69 69 60 48
524 48 41 40 45 56 71 87 99 106 106 100 96 94 92 84 71 62 62 67 74 80 86 91 94 97 104 111 115 121 134 155 175 185 181 170 159 155 155 153 141 116 84 57 42 40 42 42 40 38 37 38 41 48 59 67
503 67 71 66 52 31 7 -13 -22 -14 11 40 58 55 43 37 40 41 30 10 -5 -8 4 29 60 93 124 154 180 199 202 191 171 147 125 109 99 91 83 76 74 78 84 89 87 76 63
485 63 58 71 93 109 113 115 126 147 167 178 183 187 194 204 210 209 197 180 161 140 118 102 99 107 108 87 47 7 -12 -7 10 21 15 -6 -33 -49 -52 -50 -55 -66 -74 -72 -65 -62 -60 -47
466 -47 -15 31 78 113 136 149 152 146 131 111 89 69 49 32 15 -3 -25 -45 -57 -58 -49 -39 -31 -25 -18 -7 6 21 32 40 46 54 64 71 72 74 81 93 104 111 113 110 101 87 70
448 70 56 48 47 51 55 57 58 62 70 72 57 25 -9 -29 -31 -23 -16 -12 -7 5 24 45 60 71 79 82 73 53 29 10 0 -5 -7 -5 0 6 10 13 16 19 24 30 36 37 37 40 51 63 63 48 26 10
427A0j0qj8l0l3k5pJ0K2K4K3K4K5K5J7Kj2j6j3rprlOJ2J4J1J1J4J2Npj9k9k9k2r%M%kJPJ6
410b2K2K1J5J0J2K1K6K1J2Jpj0qnoj8l3l1j4NJ0N%JRJ5J8J3PMNNlj3j5rKJ0J4J1Pjj1j6j2
392F8%J8K7K6J5Krj5j2lNPJ2K0K2J3mj3j2rqpk%%JRJ7J7Nrj4j2j0j4j7j6j0%PJ1J1ROPOjj4
372A30k6k4qRJ9K1J1kj1rJPOMQJ3J3J0Pkj6k1j4JJ2J1QJqj5j4okoj4j6rKJ4K0J6Jj3j5p%J
353H8kkljK%lrj1rmMJ1J7K3K4K1J3MKLMmj5k2j6jJ5K2J5Jj1j7k0j8j4pmpj1j4j2lJ0K2K6J8
334A05QMNMjj%Klopkjjoj0j1rkJ0K0K4J8Opj8k5k2rOJ3J1Mlj2j6j7j1nklljKNPJ0J7K1K2J5
314A25jk0l2l6l1j4RK9L9L4K9K5K3J6Nj0k2k8k4j5n%JKJ%%mj1k0k4k5k3k0j3qlKJ5L3L9L3
297G1K1J5J3Jj2j6mPROOPRJ0J3J2Mj0j6j2lKJmqj1pJJ1J6J5J4J4J5J5Rlk0l0k6j2MJ3J0Lj
$$ plain form
427 10 0 -8 -26 -56 -89 -114 -121 -111 -89 -65 -42 -18 7 32 49 51 39 23 10 1 -6 -15 -18 -12 0 14 25 36 50 62 67 60 41 12 -17 -39 -48 -48 -44 -44 -46 -45 -38 -22
410 -22 0 21 36 46 58 79 105 126 138 139 132 122 114 109 103 85 52 21 7 12 22 27 27 28 37 52 70 83 90 94 99 104 101 88 73 64 66 76 90 101 108 107 96 80 68
392 68 68 86 113 139 154 156 147 132 120 117 122 129 141 161 183 196 192 179 167 158 150 143 141 141 141 142 151 168 185 190 181 167 155 145 131 114 98 88 88 95 106 117 126 132 139 145 144 130
372 130 104 80 72 81 100 121 132 130 119 110 111 118 124 128 136 149 162 172 179 177 161 140 126 127 139 150 158 159 151 136 122 116 114 108 94 78 69 71 85 105 121 122 109 94 87 87 88
353 88 86 84 81 80 82 82 79 70 59 50 46 50 61 78 101 125 146 159 163 165 168 172 168 153 131 115 114 129 151 166 167 156 139 119 101 87 80 76 69 58 44 32 29 39 61 87 105
334 105 113 117 122 126 125 124 124 126 123 117 110 108 107 106 100 90 79 70 68 78 98 122 140 146 139 121 96 74 65 71 84 95 99 96 84 68 51 40 35 33 30 27 26 28 33 40 50 67 88 110 125
314 125 124 104 72 36 5 -9 0 29 68 102 131 156 179 195 200 190 168 140 116 101 96 96 97 99 100 100 100 96 85 65 41 16 -7 -27 -40 -48 -51 -49 -34 -1 38 71
297 71 92 107 120 121 109 93 89 96 105 111 117 124 133 143 156 168 172 162 146 134 131 133 134 130 122 111 104 105 116 132 147 161 175 190 205 214 211 191 161 135 123 127 140 150 153 152
279A52mj6l4m7m0j9JJ0J5J7J0nk0k1j0KRJ2K4L6L4J8Jj0j9k8l2k2nPRMj%LQRJrj6j5rrrj1
261b9j0nOJ8K3J9RPJ2J9J9J5J4K1K9L1K1Ppj4j8k3k8k5j5lJ%nj0j0mQJ6J6RORJ2OkkRJ7J1
243A80oj9k1j4ojmrj4j2rqnMJ6K1J6RLjpqkRJ5J1Jnrj2j1KJ7K6J9Lomkqk2k9k3j0loj1nRK3
222G2L0L1K8K4J4Jj4k0j8j2j1j2j2qmkNJ5K1J7J1J2K1K4J5lj9k7k8k7k3j7qmj%PJ6J8J4NJ
206A32JMOPKqk2k9k6j8j1qj2j8k6k4j0J0K5K8K0Pnj2j5k2k6k3j4lMJ2K2K8K3J3J2K2L1L5L1
189A43K8J9Kj7k4j8oJKLOJ0Olj6k5k4j2NJ7J6PlrokLKnj0rnjjmqrj5k3k9k4oJ7K9K5Prj3j1
169Apj0j0qppnoqrlJ0K2K7K7L0K4Rpj7j8j6j2olkjPRPnqokjjMRPjqj0rlJLKNJ1J5J4RQJ2J4
147G1J6J4J2Olqrrj1j0qqj1j4qLJ1Qjj3j7j3oMQO%l%NMnj2j5oJMLMRJ6K1J9Pj1k4k6j7pMJ1
$$ plain form
279 152 148 132 98 51 11 -8 -7 3 18 35 45 40 20 -1 -11 -9 0 12 36 72 106 124 125 115 96 68 36 14 9 16 25 29 28 28 31 39 48 49 40 24 9 0 -9 -18 -29
261 -29 -39 -44 -38 -20 3 22 31 38 50 69 88 103 117 138 167 198 219 226 219 205 187 164 136 111 96 93 94 94 89 79 69 65 73 89 105 114 120 129 141 147 145 143 152 169 180
243 180 174 155 134 120 114 113 109 100 86 74 65 57 52 56 72 93 109 118 121 120 113 105 103 112 127 138 139 134 125 113 102 104 121 147 166 169 163 159 157 149 127 98 75 65 62 56 45 40 49 72
222 72 102 133 161 185 199 200 186 166 148 136 125 113 101 93 89 87 92 107 128 145 156 168 189 213 228 225 206 179 151 124 101 84 76 72 71 71 78 94 112 126 131 132
206 132 133 137 143 150 152 144 122 93 67 49 38 30 18 0 -26 -50 -60 -50 -25 3 23 30 25 13 -2 -24 -50 -73 -87 -90 -86 -74 -52 -24 -1 12 24 46 77 112 143
189 143 171 190 192 175 151 133 127 128 130 133 139 149 155 152 136 111 87 75 80 97 113 120 117 108 102 100 103 105 100 90 81 76 75 74 70 62 53 38 15 -14 -38 -44 -27 2 27 34 25 12 1
169 1 -6 -16 -26 -34 -41 -48 -53 -59 -67 -76 -79 -69 -47 -20 7 37 61 70 63 46 28 12 0 -6 -9 -11 -12 -5 4 11 6 -2 -8 -10 -11 -12 -8 1 8 7 -1 -11 -20 -23 -22 -19 -17 -12 -1 14 28 37 45 57 71
147 71 87 101 113 119 116 108 99 90 79 69 61 53 42 28 20 23 34 42 41 28 11 -2 -8 -4 4 10 10 7 7 12 16 11 -1 -16 -22 -21 -17 -14 -10 -1 15 36 55 62 51 27 1 -16 -23 -19 -8
127hJ2J5K0K4K1J0kroNJ7K8L2K6J2lj3j4j0qrqJJ2J4Jj5k0j1OJ7K2K2K2K2J5lk1l3l3k8j6
110A06lROmj0kQJ0OOQJj2j8pPRJpj0qkMOMQJ5K0J3JoooplMMok0k7k2q%jpnKPONQJ0Kj4j7p
88E1NPOPKqk0k2j4qnJJ1K0K0J7J3J0RNJkljK%pj5k1k1pJ3L1L4K2Q%%Jjnolkqk0k9k4j0OJ5
67E5J9J9J5Nqj8k6k9k5j3KJ3K0K0J3Mjnj1j7j9j1ljoj0j3j5j5mJ5K8K2Nqj3mNQMJMJ2J6J2
49D2J1J0J0LmmjjJOJ3J5Pjnj4k8m4m8l5rJ4K8K9K7K4J9J2PJ1K0K5K2J7J1Kj5l0k9j4LRLj1
31A08k6l7l0j1L%j0j2%QMooOJ7K0J1%jJ2L1L9K9Rpj3j7k9l9l8k7j7oNK1L3M0L1J3pk1k7k4
14B9k0j6j7j5j4j6j8j5oNJ3J6J7J4RLJJMJ0J9L0L4K2Jj5j8j0jJrk0k2j8rkLRJ5J6J5J1J0P
-4E4NKJmj0j2pKJ0J8K3K6J8ROJ0J2Kj2k3k6k5k0j3qj0j7j9j7oLRRPLKJ2K5L4L5K4Oj2k4k6
$$ plain form
127 -8 4 19 39 63 84 94 92 83 77 82 99 127 159 185 197 194 181 167 157 149 140 132 133 145 159 160 145 125 114 120 137 159 181 203 225 240 237 216 183 150 122 106
110 106 103 112 118 114 104 102 110 120 126 132 140 141 129 111 104 111 120 121 114 104 96 94 98 104 108 116 131 151 164 165 159 153 147 140 137 141 145 139 119 92 70 62 62 61 54 49 51 58 64 69 77 87 89 75 58 51
88 51 56 63 69 76 78 70 50 28 14 6 1 2 13 33 53 70 83 93 102 107 108 106 103 102 104 104 97 82 61 40 33 46 77 111 133 141 141 141 142 141 136 130 127 125 117 97 68 44 34 40 55
67 55 74 93 108 113 105 87 61 32 7 -6 -4 9 29 49 62 66 65 60 49 32 13 2 -1 -2 -8 -18 -31 -46 -61 -65 -50 -22 0 5 -3 -16 -20 -15 -7 -3 -2 2 14 30 42
49 42 53 63 73 76 72 68 67 66 67 73 86 101 108 107 102 88 60 16 -32 -67 -76 -62 -34 -5 22 46 65 77 84 95 115 140 162 179 190 192 177 147 118 104 107 116 119 108
31 108 82 45 15 4 7 7 -3 -15 -15 -7 -3 -9 -15 -9 8 28 39 39 38 50 81 120 149 158 151 138 121 92 53 15 -12 -29 -35 -30 -9 24 64 95 108 101 80 53 29
14 29 9 -7 -24 -39 -53 -69 -87 -102 -108 -103 -90 -74 -57 -43 -34 -31 -30 -29 -25 -15 4 34 68 90 91 76 58 48 47 48 39 19 -3 -21 -30 -32 -29 -20 -5 11 26 37 47 54
-4 54 59 61 62 58 48 36 29 31 41 59 82 108 126 135 141 151 163 165 153 130 104 79 59 46 38 28 11 -8 -25 -31 -28 -19 -10 -3 0 2 14 39 73 108 132 138 126 102 76
-22G6j9j3rojMLjjKOPQJ3J7J2lk0k3j4kmj0oQK1J8Plj0k1l3l4k1%J7K7K6K0Qj%OJ0PKJjnj2
-42E3j6j3nkmpnMP%j0j1kNOMKkmkRK1K0PmrrmKOJj3k5k9k5j4%QLrj6j0KJ4K0K2J9RKMJ3K1
-63C4J7J2RJ1RKJNJ2J1Nmrj2j2qlJkpqnmj0j8k2j2KJ4J9J1%rj0rqj2j9k2j4KJ6K1J8J4J9J9
-82D5Oj4k5j8rnoj2j7k0j5jJ4K4K9L1L1K7K1J9K2K7K2R%kOJ2RKqj7k7l6l8k9j4jQJ3J4J1Q
-99I6PMkqj1rpkLP%j1j6qLQPLmj8k7k2kJ9L2L1K3J3Jpj2j3j6j6j1jNOKJJLOJ0J0Lj0k2k7j8
-119DmQR%j0j6j6j0LJ8L1L7L4K6J2nj6k0j5j2j2j1nQJ7K2J8J2QQRJ1Qlj4k1j7oNKj1k4k1o
-137C5NQPJ4K3K3J1mj1j2j5k3l1k8j2MJ0O%oomKOJ0QJ0J4J9J6Npj6j9j4qkKLNPM%LJ4J8J2
-155H6mj5j8j6j2pjJjlLJ3K4K5J8J0RJ5K6L1K7J7J2Qlk2l7l8k9j7j1mQJ7J8Qqj9j8qKMjkN
$$ plain form
-22 76 57 44 35 29 28 32 35 34 33 35 41 48 56 69 86 98 95 75 52 38 36 32 22 16 24 45 63 70 67 57 36 3 -31 -52 -52 -35 -8 18 38 46 45 45 51 61 68 70 71 70 65 53
-42 53 37 24 19 17 13 6 1 5 12 12 2 -9 -11 -6 0 4 6 4 0 -2 7 28 48 55 51 42 33 29 31 37 38 25 0 -29 -54 -68 -68 -60 -57 -66 -82 -92 -90 -76 -56 -34 -15 -6 -4 0 13 34
-63 34 51 63 72 83 92 94 95 100 112 123 128 124 115 103 91 83 80 81 79 72 64 59 55 45 27 5 -7 -5 9 28 39 39 30 20 11 3 -9 -28 -50 -64 -62 -46 -25 -7 7 26 45
-82 45 51 37 12 -6 -15 -20 -26 -38 -55 -75 -90 -91 -77 -53 -24 7 38 65 86 105 127 154 176 185 185 183 189 201 210 212 204 187 160 124 86 57 43 42 50 63 77 88 96
-99 96 103 107 105 97 86 77 70 68 71 78 78 67 51 43 46 54 61 64 60 42 15 -7 -9 10 42 73 96 109 110 103 91 78 62 46 35 34 39 45 47 48 49 52 58 68 78 81 71 49 22 4
-119 4 0 8 17 17 7 -9 -25 -35 -32 -14 17 54 88 114 126 121 105 85 70 58 46 35 30 38 55 77 95 107 115 123 132 143 151 148 134 113 96 90 95 97 86 62 41 35
-137 35 40 48 55 69 92 115 126 122 111 99 84 61 30 2 -10 -6 4 10 10 4 -2 -6 -4 2 12 20 30 44 63 79 84 77 61 42 28 20 18 20 23 28 35 39 39 42 56 74 86
-155 86 82 67 49 33 21 14 13 14 13 10 13 26 50 75 93 103 112 127 153 184 211 228 240 248 245 223 186 148 119 102 91 87 95 112 130 138 130 111 93 85 87 91 90 88 93
-173I3J5J7J0kj2j4rjRK4L9M8L8J4j5k8k8k0j9k0k4k4k5k7k7j9pNRPNOJ1J4J7J9K1J7Onp%
-190A11ONLLNO%kJRJ1Plqn%NM%JKNOM%pj3j6j2rqo%Jnj7k1j7j1plKRJ3J9K4K4J3qk4k6j7n
-212D9LMjnmLJ4K0J8Oj1k5k7k4j5lJ6K9K5J0l%QJ2J2J1J0QPO%j2k5k9k2oOJ1P%k%Kqk0k5j8
-230A2qJLMNPJ0J4J7J9K0J5RMOOMkkLJ2J4J1lk0l3l4k7j3JJ5K2J9PkokLOMmpKK0L1K8K1K1
-250B33K4J7Jj5j9j5poj2k0k6l0l0k0lJ2J7J3J1J6K0J6J0MJpj2j5j5k0k2j8kJ3J8J1kj5j9
-265H7j2JJ3K1K5K2J6Nlj0j6k1j9j1nkKJ0J9J9J7J6J7J4Lrk0k2k0j7j7k3k8k8k2j4j5j5j0
-281e2opj4j7j1JPQJ0J9L1L6L2K1RJjjjnojOROkrrm%JLPJ2J2Mmqrj3j4j2rj2j7j3OK7L6L1
-301G8J8Mj0j9k3k2k1j7qJ0K1K1J1PJ1J9K5K6K0Rj0k5k8k0j1qql%pj6j5jJ7J9OoplJ%%%LQ
$$ plain form
-173 93 108 125 135 133 121 107 98 97 106 130 169 217 255 269 254 226 198 178 159 139 115 91 66 39 12 -7 -14 -9 0 7 12 18 29 43 60 79 100 117 123 118 111 111
-190 111 117 122 125 128 133 139 139 137 138 147 158 165 162 154 149 149 154 158 158 159 161 166 172 176 176 169 156 140 128 119 111 105 105 106 101 84 63 46 35 28 25 27 36 49 68 92 116 129 121 97 71 54 49
-212 49 52 56 55 50 46 49 63 83 101 107 96 71 44 20 5 2 18 47 72 82 79 79 87 99 111 122 132 140 147 153 153 141 116 87 65 59 65 76 83 83 81 81 83 75 55 30 12
-230 12 4 5 8 12 17 24 34 48 65 84 104 119 128 132 138 144 148 146 144 147 159 173 184 181 161 128 94 67 54 55 70 92 111 118 116 110 108 111 117 121 117 110 112 132 163 191 212 233
-250 233 257 274 275 260 241 226 219 213 201 181 155 125 95 75 72 84 101 114 125 141 161 177 187 191 192 185 173 158 143 123 101 83 81 94 112 123 121 106 87
-265 87 75 76 89 110 135 157 173 178 175 165 149 128 109 98 93 91 93 103 122 141 158 174 191 205 208 199 179 157 137 120 103 80 52 24 2 -12 -27 -42 -52
-281 -52 -58 -65 -79 -96 -107 -106 -99 -91 -81 -62 -31 5 37 58 67 68 67 66 65 60 54 53 59 68 74 72 63 54 50 50 51 54 61 73 85 89 85 77 68 55 41 29 20 8 -9 -22 -16 11 47 78
-301 78 96 100 90 71 48 26 5 -12 -20 -10 11 32 43 50 61 80 105 131 151 160 150 125 97 77 66 58 50 47 47 40 24 9 8 25 44 50 44 37 34 35 35 35 35 38 46
-319D6J6K3K9K6J8Okprj3j4j4j6k1k1qJ3K5K6K0J6J3QLOJ3J9J9J4Qmj7k1j2KRKj4k8l5l5k6
-336F3j7qnkJPJ1J5J8J7J0Ljlqj2j2ompj3j4rKJ1K3L2L3K3J0L%qj8k3j7jJ0J0%j3j9j9j7j1
-354C5jJ5K9L1J9Jj4k5k9k9k2j4j3j3qNK0K6K7K4J1ok0j9oPJ4J8J7J3MmlJJlmlmrj2qkKJK
-373E2QJ2Nrj8j8j5j1rj0qm%NJ0J0J1J8K6K8K0Nnj0mNJ8K2J8RMKkqj3j0prj7k4k5j7lJ2K1
-391F5K6K3J5Jj0j5j3nMJ1J3R%j2j4j0%LkqromprpmjLPJ0Noj5j6rLJ1J0kj8k6k2rJMKLJ2J8
-411@K2K1J6J3J0OMJkmnjLONNMMKKjnj1j4j0MK3M0M4L4J6%qj0pklj2k2k3j3kOJ4K1K0J0mj5
-430A82k1k2k1j7j1njJ%lpj1k0k9k9j6KOJmjKlqpjL%jJPJ1O%nqqrqjQJ7K4K6L1L6L8L0J2p
-451A60j7j7j8k2k5j9rkJJpj7k3k3j5oLJ3K0K1J0M%%OJ5K7L2K6J0pj7k0j8rlKPJ1J2P%nJJ1
$$ plain form
-319 46 62 85 114 140 158 164 162 155 146 133 119 105 89 68 47 39 52 77 103 123 139 152 160 163 169 182 201 220 234 242 238 221 200 188 190 199 201 187 159 124 89 63
-336 63 46 38 33 31 32 39 50 65 83 100 110 113 112 109 101 89 77 71 67 60 47 33 24 26 37 60 92 125 148 158 161 161 153 135 112 95 94 104 114 114 101 82 63 46 35
-354 35 34 49 78 109 128 129 115 90 61 32 10 -4 -17 -30 -38 -33 -13 13 40 64 75 69 49 30 24 31 45 63 80 93 97 93 90 91 92 89 85 82 78 69 57 49 47 49 50 52
-373 52 60 72 77 68 50 32 17 6 -3 -13 -21 -25 -25 -20 -10 0 11 29 55 83 103 108 103 93 89 94 112 134 152 161 165 167 165 157 144 134 127 118 101 77 52 35 32 44 65
-391 65 91 114 129 130 120 105 92 87 91 102 115 124 124 112 98 88 88 91 89 81 72 66 62 55 46 39 35 34 37 44 54 59 53 38 22 13 16 27 37 35 17 -9 -31 -40 -39 -35 -33 -30 -18 0
-411 0 22 43 59 72 82 88 92 93 91 87 82 81 84 90 95 100 104 108 110 112 111 106 95 81 71 75 98 138 182 216 232 232 224 214 207 205 202 190 168 145 132 130 136 150 171 191 201 197 182
-430 182 161 139 118 101 90 85 84 85 85 82 75 64 44 15 -14 -30 -28 -22 -21 -25 -26 -24 -27 -35 -42 -43 -40 -40 -41 -40 -33 -22 -16 -16 -21 -29 -37 -46 -54 -55 -47 -30 -6 20 51 87 125 155 167 160
-451 160 143 126 108 86 61 42 33 31 32 33 26 9 -14 -37 -52 -58 -55 -42 -22 -1 9 13 13 13 19 34 61 93 119 129 122 105 85 67 58 55 57 64 75 87 94 94 89 90 101
-469A01K0J5mk4l5l2k1j0KJ3K3K9K5J4lj6k0j6j1lQJ7J8Omp%QJ5J9K0J3Jj3k9l8l2j4KMoj1
-485B4qLJ6J9J2oj9k0j0MJ5J9J6RNJ5K9L4K1jj9k6k8k5j9j5j0omkJOJ2J0Mmom%LRJ3J3J1Q
-504I9QNnj3j7rMRKj3k1k4k1j9j9j3lRJ3J2LnmNJ0Mpj1oLJ1J4J1MmoJQJ4Rjj6k6k7k1j2m%
-523f9MJ1K0K7K5J3mj3j4j4j1NK5M1L9K3Mj2k2k5j9j0nnj0j7k4j6MK4L3L4K5J7J0J0J6K3K1
-538A64Qoj2j1qj1j8k6k5j4NK7L9L6K3Oqj3j2j0qppj2j8j7pMNjpojKMOJ3J9K1J7RM%mo%PJ0
-558A54Jj4k0j0KPOPJ2J8K2J8Opj6j4j0j1j6j8j0JNPOMpj6j7j2j1j5j7j2mJMJ2K2K5J8%k0
-575H1l8m4m0k9j8j0on%RK3L1L2K6K3J6Mpj4j6j9k8k5j3KNnj7k5k6j5LK6L8L3J8KomNJ4J7
-592bJ5J2RRJ7K5K4J0j0j5oMJj1j5j0JPJ2J5J0Jpolj0j9k2j4mRK3L6K9Nj4j2PK1K5K4K3J4
$$ plain form
-469 101 121 136 132 108 73 41 20 10 12 25 48 77 102 116 113 97 77 61 50 47 55 72 90 96 92 85 85 93 108 127 147 160 161 148 119 81 49 35 37 41 35 24
-485 24 16 19 35 54 66 60 41 21 11 15 30 49 65 74 79 94 123 157 178 177 158 132 104 79 60 45 35 29 25 23 24 30 42 52 56 52 46 42 42 45 54 67 80 91 99
-504 99 107 112 107 94 77 68 72 81 83 70 49 25 4 -15 -34 -47 -50 -41 -28 -16 -13 -18 -22 -17 -7 -3 -10 -21 -27 -24 -13 1 12 16 12 6 7 15 29 38 37 21 -5 -32 -53 -65 -69 -69
-523 -69 -65 -54 -34 -7 18 31 27 14 0 -14 -25 -20 5 46 85 108 112 100 78 53 34 24 19 14 4 -13 -37 -53 -49 -25 8 42 67 84 94 104 120 143 164
-538 164 172 166 154 143 135 124 106 80 55 41 46 73 112 148 171 177 169 156 144 134 126 119 112 100 82 65 58 62 67 66 59 53 52 54 58 64 77 96 117 134 143 147 147 143 137 137 144 154
-558 154 155 141 121 111 113 120 126 133 145 163 185 203 209 202 186 172 162 151 135 117 107 108 113 120 126 130 123 107 90 78 67 52 35 23 19 20 24 36 58 83 101 101 81
-575 81 43 -1 -41 -70 -88 -98 -104 -109 -109 -100 -77 -46 -14 12 35 51 55 48 34 18 -1 -29 -54 -67 -65 -60 -65 -82 -107 -133 -148 -145 -119 -81 -48 -30 -28 -34 -38 -33 -19 -2
-592 -2 13 25 34 43 60 85 109 119 109 94 88 92 93 82 67 57 58 65 77 92 102 103 96 90 87 77 58 36 22 18 27 50 86 115 120 106 94 101 122 147 171 194 208
-609B08ok7l5l0k1j5j1lMJ4J7J7RKklnqnKQQLnrj2j1j2j1pjNOKlrrjJ3K3K4J3%pqj0j4j8j4
-629D6nMOkrqJJ1J7J9K3K4J8Mj2k0j9j9k1k4j8oJkrj2j4j5j4rLJ4K0K4K6K7K3J7J2Nqk2l1
-646D6k8j8kPJ5J5J1PN%oqoJQJ5K0J6QlpqnLJ1J8J6J0Kqj7k4k4j7j4j3j2qkPJ4J9J7J3RQR
-665A00RQOJoj1j3j3j1lPJ3Pqj7rPJ7J3nk7m2m1l2j5JJ1J9J9J5PMQJ2RJj0j6j6j1nlmmJPP
-684a3kj6k9k7j1RJ5Q%PK6L6L4K3J6J3J2J2J8L0M1M6M0K1ol1m1l8l1k6k2j5lMOJpj3j3j0q
-700E6qmLNlj4j9j4kQOmrjJ3K7K9K6K3J9Oj4k9k9j6KJ3J0nk4l6l0j7lPJ3K0K5K0R%lmrj5j5
-719A3j2qj2j4j1MK0K7K3J1kj1j4j4j3j3oNJ6K0J6PjjNOLlnnpj2qMJ8K1J7J3J7K2K3J5Lqj2
-737A37j1qj4k5k9j9mRJ4J4R%j1j9j8j1mKMJlm%RJ5K0K0J8J3Jj0j4qLJ2J1OLOJ1J4Plj6k4
$$ plain form
-609 208 202 175 140 110 89 74 63 60 64 78 95 112 121 123 121 118 113 105 100 102 110 118 121 116 107 95 84 72 61 54 53 58 64 66 63 54 45 44 57 80 104 117 117 110 102 92 78 60 46
-629 46 41 45 51 49 40 32 33 44 61 80 103 127 145 149 137 117 98 79 58 34 16 10 11 9 0 -12 -26 -41 -55 -64 -61 -47 -27 -3 23 50 73 90 102 107 99 77 46
-646 46 18 0 -2 5 20 35 46 53 58 58 52 44 38 39 47 62 82 98 106 103 96 88 83 86 97 115 131 141 143 135 118 94 70 53 39 26 14 6 4 11 25 44 61 74 83 91 100
-665 100 109 117 123 124 118 107 94 81 70 67 74 87 94 86 69 60 67 84 97 92 65 23 -18 -50 -65 -64 -53 -34 -15 0 7 11 19 31 40 41 31 15 -1 -12 -17 -20 -24 -28 -27 -20 -13
-684 -13 -15 -31 -60 -87 -98 -89 -74 -66 -66 -59 -33 3 37 60 76 89 101 113 131 161 202 248 288 309 303 272 231 193 162 136 114 99 96 100 106 107 100 87 74 64 56
-700 56 48 44 47 52 49 35 16 2 0 8 14 10 1 0 13 40 69 95 118 137 143 129 100 71 55 57 70 80 75 51 15 -15 -32 -35 -28 -15 5 30 50 59 59 56 52 43 28 13
-719 13 1 -7 -19 -33 -44 -40 -20 7 30 41 39 28 14 0 -13 -26 -32 -27 -11 9 25 32 31 30 35 41 44 41 36 31 24 12 4 8 26 47 64 77 94 116 139 154 157 149 137
-737 137 126 118 104 79 50 31 27 36 50 64 73 73 62 43 25 14 10 12 16 17 14 10 10 19 34 54 74 92 105 106 96 82 74 77 89 100 106 109 115 126 140 147 144 128 104
-755A04l1l4l9l8k7qRJ6J4RNKKPJ2J0kj4j8qNJ4J3J3J6J9J5JqoOJ3J0Kkpj5j9j9j5j3j2mP
-773a5J4J5K0K2J4JlPJ8K1J3QPQONNJlKJ0J7J7J2QNjrj7k3k6k7k6k7k6k2qJ2K2J9Mj3k2k6
-790A9k1j1MJ3J3Olrj2j7j3oLNMjllmm%KNOPJ0J3J7J6J3J2J1RNNQQLKRJ7J8J3RNpk0k5k0j0
-810A01njMKnj4j3nlrj6j4oNJ1J2OKLOKqj2rmrj7j5jJ5K4K7K4J3lj3qMJ2RK%LOMJMJ0J1Lr
-831A27j6j0jPJ1J2J0QM%kpj3k1k7k9k8k1j0LK2L5L0J0pj2plqj5j5j0MK0K7K3J5RJ1J1QMO
-848A55RJ0NJjkklpj2j3qkjpj4j2kJ3J9J0lj2pKNjqj2rKJ4K1J5Mqj3qMJ8K2J6Jj1j6j6j4q
-867A14lJJjoj1j5j6rkMOL%llmoj1j7k1k1j8j0l%jkmlJQJ7K2J8J5J0PPJ1K0K4K0J1LjjKLn
-887A31k3l9m3l4k4j7oQJ7K0J6J7J7J4J1O%j3k3k2mJ5K2J6QORJ3J4J2Mrj6j0JNjqplJKjqj4
$$ plain form
-755 104 73 39 0 -38 -65 -73 -64 -48 -34 -25 -20 -18 -16 -9 3 13 11 -3 -21 -29 -24 -10 3 16 32 51 66 67 59 53 59 72 82 84 82 75 60 41 22 7 -6 -18 -22 -15
-773 -15 -1 14 34 56 70 71 68 75 93 114 127 135 142 150 156 161 166 167 164 166 176 193 210 222 230 235 234 225 208 185 159 132 106 79 53 31 23 35 57 76 80 67 45 19
-790 19 -2 -13 -9 4 17 23 20 11 -1 -18 -31 -37 -34 -29 -25 -26 -29 -32 -36 -40 -40 -38 -33 -27 -20 -10 3 20 36 49 61 72 81 86 91 99 107 110 112 121 138 156 169 178 183 176 156 131 111 101
-810 101 96 95 99 101 96 82 69 64 61 52 36 22 16 21 32 44 50 52 55 61 63 55 43 34 30 21 4 -11 -12 3 27 54 78 91 88 75 67 71 83 92 94 94 97 103 107 108 112 122 133 136 127
-831 127 111 101 100 107 118 130 140 148 152 152 150 143 130 109 82 53 25 4 -6 -3 19 54 84 94 87 75 68 65 57 42 27 17 21 41 68 91 106 115 126 137 145 149 155
-848 155 164 174 179 180 179 177 175 172 165 153 140 132 130 129 122 108 96 94 107 126 136 133 121 114 116 121 120 112 100 91 93 107 128 143 147 139 126 118 122 140 162 178 179 168 152 136 122 114
-867 114 111 112 113 112 106 95 80 64 55 53 57 63 66 66 63 60 56 50 39 22 1 -20 -38 -48 -51 -51 -52 -54 -58 -61 -60 -52 -35 -13 5 20 30 37 44 55 75 99 119 130 133 132 131 133 136 131
-887 131 108 69 26 -8 -32 -49 -55 -47 -30 -10 6 23 40 54 65 71 71 58 35 13 9 24 46 62 70 76 85 98 112 124 128 119 103 93 94 99 98 90 83 80 81 83 82 74 60
-905F0oJ5L4L7K4J2RJ2J2Pkj0j7j6j4j5j6j0%NKorj1j8k9k8j3J1K9L2K3J5J3J1J0J0J0Pnj8
-922A57k1j0OJ4J5J2QLjnj2j7j5jJ4J5Olooj1j6j7j0omppkOJ0Nmj3j5j1lPJ4J9K0K2J8Oop
-940A41KPKkMJ3J5LnnJ%rk7m1m2k6jJ7K4J7Ooj6j9rMQkj4j8pJ1K4K2Lj8k7j4JOkrqkMONjj1
-960Ej6j0QK3L3L6L4K9J9J0Llj0j5j1jJrk9m0l9k9k1j1JJ3J6J2Jrj9k5k5j2J0L4M6L9J7pk0
-977B9k1j8j6j0KJ5J9J7RKnqmLJ3K0K7L1K5J2mj4j8j1jOMmqponl%%j1k4k7j9rjjpj5k1j8r
-996i1OJ3J1MljOJ6K1K5K9K7K1J1NMPMmj5k2k3k1j7oRK5L2K8J6OJnj1j6j5rkOJ0J5J9K2J9
-1013A57J1lj2j6j0LRKj6k8k3j0mrj5j1kOJ2J4J3QKlj1j4j1l%oj2j0kMNLKjkkoj3k3k2j2k
$$ plain form
-905 60 54 69 103 140 164 176 185 197 209 216 214 204 187 171 157 142 126 116 116 121 123 117 108 97 79 50 22 9 20 49 81 104 119 132 143 153 163 173 180 175 157
-922 157 136 126 132 146 161 173 181 184 183 178 166 149 134 133 147 162 168 165 159 153 142 126 109 99 93 89 82 75 73 79 89 94 90 77 62 51 48 55 69 88 108 130 148 154 148 141
-940 141 143 150 152 150 154 167 182 185 180 175 176 176 167 140 99 57 31 30 47 71 88 94 88 72 53 44 48 56 54 40 22 15 26 50 72 75 57 30 16 17 23 21 12 4 2 6 12 17 16 5
-960 5 -11 -21 -13 10 43 79 113 142 161 171 174 171 161 146 135 134 135 126 97 57 18 -11 -32 -43 -42 -29 -13 -1 0 -9 -28 -53 -78 -90 -80 -46 0 39 56 49 29
-977 29 8 -10 -26 -36 -34 -19 0 17 26 28 23 15 11 14 27 47 74 105 130 142 138 124 106 95 94 100 104 100 92 85 79 74 71 71 71 60 36 9 -10 -19 -20 -21 -28 -43 -64 -82 -91
-996 -91 -85 -72 -61 -57 -60 -61 -55 -39 -18 7 36 63 84 95 100 104 111 115 111 96 74 51 30 13 7 16 41 73 101 117 123 124 119 108 92 77 68 66 72 82 97 116 138 157
-1013 157 168 165 153 137 127 130 139 141 125 97 74 64 60 51 36 25 23 29 41 55 68 76 78 75 64 50 39 36 36 30 18 8 6 10 15 18 20 19 17 15 9 -4 -27 -49 -61 -63
$$ [...]
-2084A30
##END=	
##END=	
