##TITLE=	Nov16-2021.53.fid
TM-VI-167 13C

##JCAMP-DX=	6.0	$$ MestReNova 14.3.1-31739
##DATA TYPE=	LINK
##BLOCK_ID=	1
##BLOCKS=	2    
##ORIGIN=	Mestrelab Research S.L.
##OWNER=	hrzepa
##$MNOVA/LINK_BLOCK_TYPE=	ITEM	$$ NMR Spectrum
##$MNOVA/ITEM/POLYGON=	(XY..XY)
5321,5835
8722,5835
8722,8208
5321,8208
5321,5835
##$MNOVA/ITEM/Z=	0
##$MNOVA/ITEM/ANGLE=	0
##TITLE=	Nov16-2021.53.fid
##JCAMP-DX=	6.0	$$ MestReNova 14.3.1-31739
##BLOCK_ID=	2
##DATA TYPE=	MNOVA NMR VIEW DATA
##DATA CLASS=	MNOVA VIEW DATA
##$MNOVA/ITEM/ZOOM/X=	-20.698776542268014111,	240.66949999422217843
##$MNOVA/ITEM/ZOOM/Y=	-293.65950870513916016,	3100.3819580078125
##END=	
##TITLE=	Nov16-2021.53.fid
##JCAMP-DX=	6.0	$$ MestReNova 14.3.1-31739
##BLOCK_ID=	3
##DATA TYPE=	NMR SPECTRUM
##DATA CLASS=	XYDATA
##NUMDIM=	1
##ORIGIN=	Bruker BioSpin GmbH
##OWNER=	nmr
##.OBSERVE FREQUENCY=	100.69424847706599735
##.OBSERVE NUCLEUS=	^13C
##.SOLVENT NAME=	CDCl3
##.PULSE SEQUENCE=	zgpg30
##LONGDATE=	2021/11/17 00:37:00.000
##.ACQUISITIONMODE=	SIMULTANEOUS (DQD)
##$ORIGINAL FORMAT=	Bruker XWIN-NMR
##$MNOVA/SCALES_VERSION=	9
##$PARAMETER FILE=	(acqus, ASCII, /private/var/folders/f6/rjf_tdyn2v98c5c0wvkgn4s80000gn/T/FCbDzVY$RxeHvAIr6oWozA/53/acqus, 0)
$$ ##TITLE= Parameter file, TOPSPIN		Version 3.2
$$ ##JCAMPDX= 5.0
$$ ##DATATYPE= Parameter Values
$$ ##NPOINTS= 11	$$ modification sequence number
$$ ##ORIGIN= Bruker BioSpin GmbH
$$ ##OWNER= nmr
$$ $$ 2021-11-17 00:37:28.356 +0000  nmr@CZC10666PP
$$ $$ /opt/topspin/data/agmb/nmr/Nov16-2021/53/acqus
$$ $$ process /opt/topspin3.2/prog/mod/shimcntl
$$ ##$ACQT0= -2.01680680282977
$$ ##$AMP= (0..31)
$$ 100 100 100 100 100 100 100 100 100 100 100 100 100 100 100 100 100 100
$$ 100 100 100 100 100 100 100 100 100 100 100 100 100 100
$$ ##$AMPCOIL= (0..19)
$$ 0 0 0 0 0 0 0 0 0 0 0 0 0 0 0 0 0 0 0 0
$$ ##$ANAVPT= -1
$$ ##$AQSEQ= 0
$$ ##$AQ_mod= 3
$$ ##$AUNM= <au_zgonly>
$$ ##$AUTOPOS= <53 >
$$ ##$BF1= 100.683175
$$ ##$BF2= 400.41
$$ ##$BF3= 100.683175
$$ ##$BF4= 100.683175
$$ ##$BF5= 100.683175
$$ ##$BF6= 100.683175
$$ ##$BF7= 100.683175
$$ ##$BF8= 100.683175
$$ ##$BYTORDA= 0
$$ ##$CAGPARS= (0..11)
$$ 0 0 0 0 0 0 0 0 0 0 0 0
$$ ##$CFDGTYP= 0
$$ ##$CFRGTYP= 9
$$ ##$CHEMSTR= <none>
$$ ##$CNST= (0..63)
$$ 1 1 145 1 1 1 1 1 1 1 1 1 1 1 1 1 1 1 1 1 1 1 1 1 1 1 1 1 1 1 1 1 1 1 1
$$ 1 1 1 1 1 1 1 1 1 1 1 1 1 1 1 1 1 1 1 1 1 1 1 1 1 1 1 1 1
$$ ##$CPDPRG= (0..8)
$$ <waltz16> <> <waltz16> <> <mlev> <mlev> <mlev> <mlev> <mlev>
$$ ##$D= (0..63)
$$ 0 1 0.00345 0 0 0 0 0 0 0.06 0 0.03 2e-05 3e-06 0 0 0.0002 0 0 0 0 0 0
$$ 0 0 0 0 0 0 0 0 0 0 0 0 0 0 0 0 0 0 0 0 0 0 0 0 0 0 0 0 0 0 0 0 0 0 0 0
$$ 0 0 0 0 0
$$ ##$DATE= 1637109447
$$ ##$DE= 6.5
$$ ##$DECBNUC= <off>
$$ ##$DECIM= 760
$$ ##$DECNUC= <off>
$$ ##$DECSTAT= 4
$$ ##$DIGMOD= 1
$$ ##$DIGTYP= 12
$$ ##$DQDMODE= 0
$$ ##$DR= 21
$$ ##$DS= 4
$$ ##$DSPFIRM= 0
$$ ##$DSPFVS= 20
$$ ##$DTYPA= 0
$$ ##$EXP= <c13>
$$ ##$F1LIST= <111111111111111>
$$ ##$F2LIST= <222222222222222>
$$ ##$F3LIST= <333333333333333>
$$ ##$FCUCHAN= (0..9)
$$ [...]
$$ ##$Sgu3PowerLevels= (0..7)
$$ 0 0 0 0 0 0 0 0
$$ ##$Sgu4PowerLevels= (0..7)
$$ 0 0 0 0 0 0 0 0
$$ ##$Sgu5PowerLevels= (0..7)
$$ 0 0 0 0 0 0 0 0
$$ ##$Sgu6PowerLevels= (0..7)
$$ 0 0 0 0 0 0 0 0
$$ ##$Sgu7PowerLevels= (0..7)
$$ 0 0 0 0 0 0 0 0
$$ ##$Sgu8PowerLevels= (0..7)
$$ 0 0 0 0 0 0 0 0
$$ ##$SguType= 3
$$ ##$ShimPowMaxUA= (0..63)
$$ 130000 130000 130000 130000 130000 130000 130000 130000 130000 130000 130000
$$ 130000 130000 130000 130000 130000 130000 130000 130000 130000 0 0 0 0
$$ 0 0 0 0 0 0 0 0 0 0 0 0 0 0 0 0 0 0 0 0 0 0 0 0 0 0 0 0 0 0 0 0 0 0 0 0
$$ 0 0 0 0
$$ ##$ShimPowMaxUC= (0..63)
$$ 130000 130000 130000 130000 130000 130000 130000 130000 130000 130000 130000
$$ 130000 130000 130000 130000 130000 130000 130000 130000 130000 0 0 0 0
$$ 0 0 0 0 0 0 0 0 0 0 0 0 0 0 0 0 0 0 0 0 0 0 0 0 0 0 0 0 0 0 0 0 0 0 0 0
$$ 0 0 0 0
$$ ##$ShimPowMaxUG= (0..63)
$$ 524287 524287 524287 524287 524287 524287 524287 524287 524287 524287 524287
$$ 524287 524287 524287 524287 524287 524287 524287 524287 524287 0 0 0 0
$$ 0 0 0 0 0 0 0 0 0 0 0 0 0 0 0 0 0 0 0 0 0 0 0 0 0 0 0 0 0 0 0 0 0 0 0 0
$$ 0 0 0 0
$$ ##$ShimPowRcbType= 3
$$ ##$ShimPowRes= (0..63)
$$ 1e-20 1e-20 1e-20 1e-20 1e-20 1e-20 1e-20 1e-20 1e-20 1e-20 1e-20 1e-20
$$ 1e-20 1e-20 1e-20 1e-20 1e-20 1e-20 1e-20 1e-20 0 0 0 0 0 0 0 0 0 0 0 0
$$ 0 0 0 0 0 0 0 0 0 0 0 0 0 0 0 0 0 0 0 0 0 0 0 0 0 0 0 0 0 0 0 0
$$ ##$ShimPowRng0= (0..63)
$$ 1 1 1 1 1 1 1 1 1 1 1 1 1 1 1 1 1 1 1 1 0 0 0 0 0 0 0 0 0 0 0 0 0 0 0 0
$$ 0 0 0 0 0 0 0 0 0 0 0 0 0 0 0 0 0 0 0 0 0 0 0 0 0 0 0 0
$$ ##$ShimPowRng1= (0..63)
$$ 1 1 1 1 1 1 1 1 1 1 1 1 1 1 1 1 1 1 1 1 0 0 0 0 0 0 0 0 0 0 0 0 0 0 0 0
$$ 0 0 0 0 0 0 0 0 0 0 0 0 0 0 0 0 0 0 0 0 0 0 0 0 0 0 0 0
$$ ##$ShimPowRng2= (0..63)
$$ 1 1 1 1 1 1 1 1 1 1 1 1 1 1 1 1 1 1 1 1 0 0 0 0 0 0 0 0 0 0 0 0 0 0 0 0
$$ 0 0 0 0 0 0 0 0 0 0 0 0 0 0 0 0 0 0 0 0 0 0 0 0 0 0 0 0
$$ ##$ShimPowRng3= (0..63)
$$ 1 1 1 1 1 1 1 1 1 1 1 1 1 1 1 1 1 1 1 1 0 0 0 0 0 0 0 0 0 0 0 0 0 0 0 0
$$ 0 0 0 0 0 0 0 0 0 0 0 0 0 0 0 0 0 0 0 0 0 0 0 0 0 0 0 0
$$ ##$ShimSysFunc= (0..63)
$$ 1 2 3 4 5 7 9 11 15 16 8 10 12 14 6 17 13 18 19 20 0 0 0 0 0 0 0 0 0 0
$$ 0 0 0 0 0 0 0 0 0 0 0 0 0 0 0 0 0 0 0 0 0 0 0 0 0 0 0 0 0 0 0 0 0 0
$$ ##$ShimSysMatrix= 0
$$ ##$ShimSysType= 1
$$ ##$TFXNUM= 0
$$ ##$TRIPLO2= 0
$$ ##$VTU= 2
$$ ##$VTUETH= <149.236.99.20>
$$ ##$VTUTY= <no>
$$ ##$WBREFAM= (0..15)
$$ 135 116 100 100 100 100 100 100 100 100 100 100 100 100 100 100
$$ ##$WBREFLM= (0..15)
$$ 0 0 0 0 0 0 0 0 0 0 0 0 0 0 0 0
$$ ##$WBREFPH= (0..15)
$$ 71.66 -68.25 0 0 0 0 0 0 0 0 0 0 0 0 0 0
$$ ##$WBSGU= (0..15)
$$ 0 0 0 0 0 0 0 0 0 0 0 0 0 0 0 0
$$ ##$XFAC= 2
$$ ##END=
$$ 
##$DECIM=	760
##$DSPFVS=	20
##XUNITS=	HZ
##YUNITS=	ARBITRARY UNITS
##FIRSTX=	24231.369385662510467
##LASTX=	-2084.0185409410978536
##DELTAX=	-0.40154708059210514337
##XFACTOR=	1
##YFACTOR=	0.068920375002988781832
##FIRSTY=	28.044916152954101563
##MINY=	-11.806603431701660156
##MAXY=	2818.529052734375
##NPOINTS=	65536
##XYDATA=	(X++(Y..Y))
$$ [...]
12916D90K2J0mj0j3j6j6j6k3k9k1LK5L1K8K5K5K0Rpk5l7l1j1%oj7k2k2j6mQOnmJ2K4J9Ll%
12900D02jqj2rmJMLjl%N%oj0j3j5j0JJ3J5J2J2J1Nmj1rplKPPPJ0J4J4RL%k%PJ9K8K7J7Kj0
12880E19j4rnmkkjkJLkk1m3n4n0l0mJ4J8Qj%MNOQJ1J2J0RJj3k2j3NJ7J4%j3k2j9pNJ1J1J5
12862C54J8J4ORJ8K0Oj1j9j9j6j2poqj1j0qm%JkokQJ9K6K9K7J9J0RJ0OknLJ4K2K6K9L5M9P6
12844G15J05J30J59K08K43K01N7j20k32k44k01j60j28r7o8n6n5m7k9j4plJjqj5j6j2lJ2K8
12831C43L7L6K6J4JnmKjj3k6l0k3j7j1JJ8L0L0J6%j7l2m0m0l1j9nOJ1O%nnKJ7L5M2L0Roj7
12815C65k7l3k6rRK1K7L1L0K1J3RRQLJkqj1j0kJoj9k7k7k2k0k0j9mJ6K7K5J5MlplPJ6K0K0
12797C93J8Rrk5l3k6j1KJ1J4J5J6J7J3JrqMJ7K3K2J4kk0k8k2j1j%mj3j9j4%J3J6J0%qj4j2
$$ plain form
12916 490 512 522 518 508 495 479 463 447 424 395 374 377 402 433 461 486 511 531 540 533 508 471 440 429 429 423 406 384 362 346 342 350 356 351 347 359 383 402 405 402 402
12900 402 401 393 381 372 368 369 373 376 375 372 372 377 377 371 361 348 333 323 324 337 352 364 376 387 392 388 377 368 361 358 360 367 374 381 391 405 419 428 431 431 429 429 436 455 483 510 527 529 519
12880 519 505 496 491 487 485 483 482 480 481 484 482 461 418 364 314 284 280 294 312 320 319 319 323 328 334 342 353 365 375 384 385 372 350 337 342 359 373 373 360 338 319 312 317 328 339 354
12862 354 372 386 392 401 419 439 445 434 415 396 380 368 361 355 347 336 326 318 314 314 315 313 307 305 313 332 358 387 414 433 443 452 462 468 466 461 464 478 500 526 555 590 639 715
12844 715 820 950 1109 1317 1560 1761 1818 1698 1466 1222 1021 861 733 636 568 512 457 410 381 367 360 357 358 357 349 334 318 306 303 315 343
12831 343 380 416 442 456 457 452 448 450 449 436 410 380 357 340 329 330 348 378 408 424 424 407 375 335 295 264 245 240 246 257 263 263 258 253 255 272 307 349 379 388 382 365
12815 365 338 305 279 270 279 300 327 358 388 409 422 431 440 448 451 452 450 442 431 421 419 420 414 395 368 341 319 299 279 260 256 272 299 324 339 343 340 333 330 337 353 373 393
12797 393 411 420 411 386 353 327 316 318 329 343 358 374 391 404 405 396 388 392 409 432 454 468 466 446 418 396 385 384 384 380 367 348 334 334 347 363 373 373 365 351 339
12781C39kRJ3Npj6k3k5j7JK5L6L2J9Q%nrj0pmom%RJ1Omrj3j7k0j5lRJ1J1J3K2K5J7%j4k0j7
12763C54j3rpolkJ%nj5k5k8k0jJ8L0L1K0Kj3j8j1%OOOONM%mqqm%jkJMkj4k1j7oOJ4J8K0J7
12743C06J5J2ROQJ4J9J5Mj3k9l4k5mJ3J4Kj2j5rNJ6J3mk0k2qJ1K4K6K1J1Mlqj2j4pLJ2J4J1
12726C69Loj1j3rkMJ4K2K4J6%j4k2j7oPJ8K3K3J8J3RJ2J2RMJJknljjnooj2k4l1k5j0KQOJp
12707C81j3j0%OO%lnrj5j5j0%QJ2J0Mnj7k5k5j9r%MNQJ4K2K2K0J4J1OJkj%j%LNMMJ2K0J9J0
12688D47Jnrj5j6j0lMQQPJrk3m0n2m9l2j0OJ6K1J9J0JlljQJ9K2J0mj0mKNRJ2J3QLMJ0J7K6
12670D19L2L1K2J1PNlj8l4l4j8%QKqqnloo%NPJpj0lJ1K5K7J7Jj3k5l2k6j1QK0K2J5Jj6k4k1
12652C66j0lnj2j9k2j8r%QJ7K7L2K6J4Lknj1j1nKQJ4J8J6Jj8k5j8rj2j7j0J1K7K6J1ljNQJ
$$ plain form
12781 339 337 346 359 364 357 341 318 293 276 277 302 338 370 389 397 397 392 383 373 366 362 356 352 352 361 372 378 374 365 352 335 315 300 297 306 317 328 341 363 388 405 405 391 371 354
12763 354 341 332 325 319 316 314 315 315 310 295 270 242 222 221 239 269 300 320 322 309 291 280 280 286 292 298 304 309 313 313 309 301 293 289 289 288 286 287 291 289 275 254 237 231 237 251 269 289 306
12743 306 321 333 342 348 356 370 389 404 408 395 366 332 307 303 316 330 332 320 305 296 301 317 330 326 306 284 276 287 311 337 358 369 373 370 362 350 336 329 332 344 358 369
12726 369 372 366 355 342 333 331 335 349 371 395 411 411 397 375 358 352 359 377 400 423 441 454 463 475 487 496 500 501 502 500 495 492 491 490 485 479 473 461 437 406 381 371 373 381 387 388 381
12707 381 368 358 358 364 370 370 367 362 353 338 323 313 313 321 333 343 347 342 325 300 275 256 247 247 251 256 264 278 300 322 342 356 367 373 374 372 371 371 370 370 373 378 382 386 398 418 437 447
12688 447 448 443 434 419 403 393 390 394 402 410 417 418 409 386 346 294 245 213 203 209 225 246 265 275 276 273 270 269 277 296 318 328 324 314 310 312 317 326 338 351 359 362 366 376 393 419
12670 419 451 482 504 515 522 527 524 506 472 438 420 420 428 430 422 414 409 406 400 394 394 399 406 407 400 390 387 398 423 450 467 468 455 430 398 372 361 369 389 411 426 427 411 387 366
12652 366 356 353 348 336 317 295 277 268 268 276 293 320 352 378 392 395 393 388 377 366 361 363 371 385 403 419 420 402 377 359 350 338 321 311 322 349 375 386 383 382 387 395 396
12634C96mqj0j6k3k2pJ1K9L9L8L0J8J0Lpk2l5l5k0jQMj0k3k7k2j2omnll%JKLMRJ3J4J3J3J9
12617C52K2K4K1J2kj8k3j7j0j0j7k1k3k8l0k7j2OK1K9K8K2J4J0QPJllllljJJjKJ3K6L0K0K
12600D17j4j6mJ4K2J7PMOJ0PJj%lrj1j1j5k4k3mK1L5L5L0K6K0Prk6l7l9k9j5kKJjjkjKPRK
12581D05j1k2k0oRJ5J2RNmj3j3mJjmJPOJnomj%MMLjj4k9l6k7mJ8K8K9K7K3J5Moqqrj6j7j0
12562C27MJ1J0NL%pj4j0jPQOMJjJOJ1J1J0RQJ0J1Q%rj0pnpj1j7k0j9j1%J3K5L6L5K1%j4j6
12544D22j4j0jMJj2k1k1j5j4j1kJ4K4K4J6QNNLoj6j2QL0L9L5K0Lj2j8j9k2k9l1j8PK7L2K8
12527D51K3K6L0K8J9Mj1j7j7j7j6j3oJQJ2Qjj0j5j4j2pJJ0J3J1OLJmj0j5j8j7j0NJ8K1J2J
12511D82%J0K0K5K1J3Mj2k7l6l3k3j3lMPkj2j3mRJ4J7J5Ork0j9j2j1j8k1j7qjKNOKklnnKJ8
$$ plain form
12634 396 392 384 374 358 335 313 306 317 346 385 423 453 471 481 484 477 455 420 385 365 364 372 376 366 343 316 294 282 276 272 267 264 261 261 262 264 267 271 280 293 307 320 333 352
12617 352 374 398 419 431 429 411 388 371 361 351 334 313 290 262 232 205 193 199 220 249 277 299 313 323 331 338 339 336 333 330 327 324 323 324 325 324 326 339 365 395 415 417
12600 417 403 387 383 397 419 436 443 447 453 463 470 471 470 470 467 458 447 436 421 397 374 370 391 426 461 491 517 537 544 535 509 472 433 404 389 387 389 390 389 388 386 385 387 394 403 405
12581 405 394 372 352 346 355 370 382 391 396 392 379 366 362 363 362 358 359 366 372 373 368 362 358 357 357 361 365 368 367 353 324 288 261 257 275 303 332 359 382 397 401 395 387 379 370 354 337 327
12562 327 331 342 352 357 360 360 353 339 329 328 335 343 349 353 354 353 354 360 371 382 392 401 409 419 430 438 438 429 419 412 407 400 389 372 352 333 322 322 335 360 396 431 452 452 438 422
12544 422 408 398 397 401 402 390 369 348 333 319 308 306 320 344 368 384 392 397 402 405 399 383 371 379 409 448 483 503 506 494 476 457 435 406 375 357 364 391 423 451
12527 451 474 500 530 558 577 581 570 553 536 519 503 490 484 485 493 505 513 512 502 487 473 461 454 455 465 478 489 495 498 499 495 485 470 452 435 425 430 448 469 481 482
12511 482 482 492 512 537 558 571 575 563 536 500 467 444 431 428 432 439 437 425 412 408 417 431 448 463 469 460 440 421 409 398 380 359 342 334 333 335 340 346 348 346 343 338 333 335 353
12493C53L4L8K4Oklpj7l0l7l1j5OJ7J8J1OLkqpLK1L3L2J2j7m3n7n6m4k8rOJ5J9J8J5J3K0L4
12476C44M0K7Oj0j7k2k1j0PJ9J5PNRO%lnpj1rrj3k1k1j2lMJ1J8K3K4J9J0nj8k1j7j6j6oJ1
12460C12K8L0K7K4K1J3%rj4j8j8j5rqqmNJ1J3J0P%j0j7j5qJPJ5J4PorkOOkmKJ1J2O%nmjjp
12440C94j6k2k3k5l2m1l5j3J3K6K3J1%lJJ1J9K3K4K1J3Lnrj1j6j5qjklJRJ3Omj1qmKMPJ1J3
12423C41Ork3k6j6kRJ0Nlj2k1k5k2j2KJ4K0K5L1L6M0L7L2K2Rpj9k3j8oPJ2Opj3j3j0rj1ql
12406C46LQPkj3j4nQJ1QKnj0j2nOJ7K6K9K6J9J2Lqj9k1qPJ1%j3j5nQJ7J3Jrj1pnprpopj3j7
12387C35j9j8j3olrj9k0j3l%%JMJ2K3L5M3M1K9J6Plj1j6j3rj0j2rJPMlrroJOOK%OJ6J5Lj1
12368C69j0JJ3J8J5J5K1K7K2Qj4k6k8j9j1mkjqk1l7m4l6j6RK8L4K7J6J3J7K4K2J6Okj0j2r
$$ plain form
12493 353 387 425 449 455 453 450 443 426 396 359 328 313 319 336 354 365 371 374 372 364 357 360 381 414 446 458 441 398 341 285 241 213 204 210 225 244 262 277 290 310 344
12476 344 384 411 417 407 390 368 347 337 344 363 378 385 390 399 405 405 402 397 390 379 370 361 348 327 306 294 291 295 306 324 347 371 390 400 395 377 356 339 323 307 301 312
12460 312 340 370 397 421 442 455 455 446 432 414 396 381 372 364 356 352 357 368 381 391 398 398 388 371 356 348 349 356 371 385 392 386 377 375 381 387 385 381 383 394 406 412 412 407 403 402 401 394
12440 394 378 356 333 308 276 235 200 187 200 226 249 260 260 257 258 269 288 311 335 356 369 372 367 358 347 331 316 308 307 305 302 303 312 325 331 327 316 308 304 306 310 317 328 341
12423 341 347 338 315 289 273 271 280 290 295 292 280 259 234 212 200 202 216 236 261 292 328 368 405 437 459 468 461 442 419 401 395 402 414 420 413 400 387 377 368 357 349 346
12406 346 349 357 364 362 349 335 330 338 349 357 359 354 344 332 327 333 350 376 405 431 450 462 465 457 438 417 409 416 427 427 414 399 394 402 419 432 433 424 413 406 401 394 385 378 372 365 352 335
12387 335 316 298 285 279 276 267 248 228 215 212 212 212 213 217 229 252 287 330 371 400 416 423 420 409 393 380 371 361 349 340 341 348 352 349 340 331 325 326 332 338 340 340 346 362 377 380 369
12368 369 359 360 373 391 406 421 442 469 491 499 485 459 431 412 401 397 395 394 386 365 328 284 248 232 241 269 303 330 346 359 376 400 422 438 444 442 432 420 411
12352D11opp%OMoj4j1j2k1k9k6pJ1J6Pnj3qOK0K8L2L4L3K5J1kj3j7j5j0qj6l0l7l3k1j0JJ1
12335B72J8J7RJkjNJ2K0K0J6Nnj0qlKPPLrk6l9l8k3mN%j1k2k4j5KK0L1L6L7L4K8J5%rrnmo
12317C49pl%JjKJ1K0K1J2LLRJ2Mj3k7l2k9k2j5oMJ0J3J6J9K3K4J9J0Koj3j9j9j2JJ1J1Kj0
12300C78j7j5nQK0K5K2K0J6J3Mj1k5l2k5j1jjnnoj0j5j4nMONPJ5K7L0K1Pnj1j6j7j5qqj2j5
12283C18j0KJ3J6J6J6J6J2Loj6k4k7k4k2j6rNK3L3K7J2%lMQRMlj2k1k4j8nPJ0LnqnLONLKL
12264C21Kkllmqj0kJ5K9K7J3mj3j0%QNnj7k4k7k4j4lJ1K1K9L5L2J2j9m3m8l7j7LJ7K1J6Nn
12247B80j2j1lJ2K1K1RklOJ7K2J9R%jlnrj4j7k7l5l6k4nJ1K4L4M1L9K5Lj9l0k8j8lMQOMKL
12230C15NOPJ3K4K8J4j6m9o8o6m8k3LK1K5K3K0K4L0L2K5J3Mkmj1k1l3l8l4k5j3%PRJ1J6K3
$$ plain form
12352 411 405 398 391 391 397 401 395 381 370 358 337 308 282 275 286 302 309 304 291 283 289 309 337 369 403 436 461 472 470 457 440 425 415 407 391 361 324 291 270 260 261 272
12335 272 290 307 316 317 315 314 319 331 351 371 387 392 387 377 369 366 368 375 382 385 376 350 311 273 250 246 251 251 240 218 194 179 181 201 232 268 305 339 367 382 382 373 364 359 355 349
12317 349 342 339 339 340 339 341 352 372 393 405 408 411 420 432 436 423 396 364 335 313 298 292 296 306 319 335 354 377 401 420 430 432 426 413 394 375 363 364 375 386 388 378
12300 378 361 346 341 349 369 394 416 436 452 465 469 458 433 401 376 365 364 363 358 353 347 337 322 308 303 307 313 318 325 340 367 397 418 425 420 409 393 376 361 353 345 333 318
12283 318 308 310 323 339 355 371 387 399 402 396 380 356 329 305 283 267 258 263 286 319 346 358 358 355 359 367 376 380 377 365 344 320 302 297 304 314 317 312 304 299 302 308 313 316 318 321
12264 321 323 321 318 315 311 303 293 291 306 335 362 375 371 358 348 348 356 361 356 339 315 288 264 250 247 258 279 308 343 375 387 368 325 277 240 223 226 243 264 280 285 280
12247 280 268 257 254 266 287 308 317 315 312 318 335 357 376 385 385 384 381 376 367 353 336 309 274 238 214 209 220 244 278 319 358 383 386 367 337 309 291 288 292 300 306 310 312 315
12230 315 320 326 333 346 370 398 412 396 347 279 213 165 142 145 166 191 214 234 258 288 320 345 358 362 360 356 345 324 291 253 219 194 181 181 188 197 208 224 247
12214B47K8L2L1K4Oj2k0j4n%OJ6K7K5J2jmOJ5J5Lj1j8j5qnlLONJkJKjpj3j9k1j5kJj0k4k2
12196B60jK2K5J0j0k2j9lJ8L0L0K0PkpoLJ5J9J0pj8k0j4j0pqplOJ6K4K7K1J2Kmpqnmj0j5j3
12178C47lJ0J3J1PQJ4K0K0J0lj0qKLoj6j5kJ0J5J1Nlj1j7j9j9j9k0j8j1lOJ4J9J4Jj0j0ml
12161C30ooJNmj9k6j8mJ0J5J4J3J7K2K5J9Opj3j5j3rpnmKJ1J3Nj0k3k6k1j0KQLoro%J%LJ0
12143B68J2J4K1K9L3L0K1J3Nnj2j2kOPJqj1pkJ%jnj1j6j0%MmrjJ4K2J3lj7k5j9lJ6K3J1mp
12125C70JJ0J7K3K4J6Kj6k8l9m5m3l3j6OK6L2J6j0k5k3rLJ2J8J9J1lj4j9k1k3j8mJ4K1J1o
12109B57j6j4kJ0J5J2RJ3K0K0Roj4j4j1nOK1K9K2PllKPJ2J4J4J2J0RPONJnj3j8j9j3mNMoj6
12091C76j6rJQJ0QMMJ0J3Oqj8j8j6j2ojjppjNJpj0qlMJ0Qlj8k7k8k4j7lJ2K6L1L1K8K3K1K3
$$ plain form
12214 247 275 307 338 362 368 356 336 322 317 317 323 339 366 391 403 402 398 404 419 434 437 426 408 393 385 380 377 380 386 391 392 390 391 393 392 385 372 353 332 317 315 316 306 282 260
12196 260 259 281 306 316 306 284 265 262 280 310 340 360 367 365 358 352 355 370 389 399 392 374 354 340 330 323 315 308 305 311 327 351 378 399 411 413 409 402 394 389 385 375 360 347
12178 347 344 354 367 378 385 393 407 427 447 457 454 444 436 438 441 435 419 404 402 412 427 438 443 440 429 412 393 374 355 335 317 306 303 309 323 342 356 357 347 337 333 330
12161 330 324 318 319 324 320 301 275 257 253 263 278 292 305 322 344 369 388 394 387 374 359 346 337 330 325 321 323 334 347 352 342 319 293 272 262 264 272 275 269 260 254 254 255 255 258 268
12143 268 280 294 315 344 377 407 428 441 446 441 429 417 415 421 428 429 421 410 403 401 402 402 401 396 385 369 359 359 363 359 350 349 363 385 398 395 378 353 334 331 347 370 381 377 370
12125 370 371 381 398 421 445 461 463 447 419 380 335 292 259 243 249 275 307 323 313 288 265 256 259 271 289 308 319 316 302 283 262 239 221 217 231 252 263 257
12109 257 241 227 225 235 250 262 271 284 304 324 333 327 313 299 288 283 289 310 339 361 368 365 362 364 371 383 397 411 423 433 442 449 455 460 461 456 443 425 406 393 389 394 398 392 376
12091 376 360 351 352 360 370 378 382 386 396 409 415 407 389 371 355 343 337 336 335 328 321 320 325 326 319 309 301 298 302 312 320 317 299 272 244 220 203 200 212 238 269 300 328 351 372 395
12073C95K3J6Mnj1j0kONj1k8l0j7kOM%npjPJ1J2QLqj6j4mPJ5J8J7Rlj3j1qnlLQO%JNRO%JM
12052C95Mnj8l0k7j6JJ5K6L5L6K7Oj6k5j9lJ2K2K5J9Nj4k8k9k3j8j2kJ4K2J7RQJ2J2Olj2k3
12036D05k9k4j4mJPJ1J5J6J6J7J7J6J2Olnljjoj0j2j1o%%kLJ3J0j2l5l7j4OQ%lKPJ2J6J4O
12018D04oj2j0opj5k3k6k2j2JJ2J8J3LppLQMqk0k5j7nMKpj4j1n%ORJ2QLLOJ5K2K8K8K4J5K
12000C88j4l1m1m0l3k2oJ0K0J9J1QJ0K1L9N1M8K5JoMJ1Kj6l2l6l3k3j4JJ6L0L5K6J0JLRPq
11984D51k5l4l4l0k9k6k1j0LJ8K7K5J0noNJ5J4RJ1J5J5J0RJ2J5J1kj7k8l5l4k9k3j7nJ7L8
11969C20M9M1K1%j6k6l2l3k8j0J2L1L9L7L7L6K7J1qk2k3j2OK3K5J7Okj2k6l6l1j3NRQOJqj2
11952D17mLkk1l3k9j3KJ2J7J4Okkjnj0j1qj0j6j8rLOmj2j1JJ2J1%j1j2oKMNNORJ4J8J9K0K7
$$ plain form
12073 395 418 434 438 433 422 412 410 416 421 410 382 352 335 333 339 343 343 338 331 330 337 348 360 368 371 363 347 333 329 336 351 369 386 395 392 379 368 360 355 352 355 363 369 369 370 375 384 390 390 391 395
12052 395 399 394 376 346 319 303 304 319 345 380 416 443 449 433 408 389 386 398 420 445 464 469 455 427 398 375 357 345 343 357 379 396 405 413 425 437 443 440 428 405
12036 405 376 352 338 334 335 342 353 368 384 400 417 434 450 462 468 465 460 457 456 455 449 439 427 416 410 410 410 408 411 424 434 422 387 350 336 342 350 350 347 349 356 368 384 398 404
12018 404 398 386 376 370 363 348 325 299 277 265 266 278 296 309 312 305 298 301 309 313 305 285 260 243 238 242 244 237 223 212 207 207 213 222 234 242 245 248 254 269 291 319 347 371 386 388
12000 388 374 343 302 262 229 207 201 211 231 250 261 269 279 300 339 390 438 463 464 458 462 473 475 459 427 391 358 335 321 322 338 368 403 429 439 440 443 452 459 451
11984 451 426 392 358 328 299 273 252 242 245 263 290 315 325 320 314 319 334 348 357 368 383 398 408 417 429 444 455 453 436 408 373 339 310 287 270 265 282 320
11969 320 369 410 431 431 415 389 357 324 296 286 298 329 368 405 442 478 505 516 508 486 463 451 457 480 505 522 528 526 514 488 452 421 408 413 422 430 436 437 429 417
11952 417 413 416 414 393 360 331 318 320 332 349 363 369 367 365 364 359 349 338 330 320 304 286 277 280 286 282 270 259 260 272 283 283 272 260 254 256 260 265 270 276 285 299 317 336 356 383
11934C83L0K3QkjNJ1J3J2Noj4j3rj0j6k1k0k1k4k8l1l0k1mJ7L1L0K2J5J0Jj4k9l3k8j7j3j8
11918A93l0l7l0j4OJ7J9J6J4K0K5L1L6M4M6L4J4KJJmqqnljKMJnoprj0nNJ0QLnj5k5j9LK4K9
11900C62J8Lpj3j1lNLlrj0j2j9k1k1j6j2oMJ6K0J6Mrj3qOK5M1M3L4J5NMROlj1rmmj4k3k3j2
11882C43jNLkjK%j1k1k5j6nJNJ1J6J8J4Q%j4k3k3qONj0j9pJ3K4J6%mOJ7J9J5J1QONOKnj4k0
11863C56j7rJPQ%j3k5k8k1j1%J3K2K3J1mj2qlmmJJ0J5J2O%oj1j1JJ5J8Qmj2j5j7j3nMPQOJ
11844C00mrnLPJqpNK3L4L4K4Qj0k4k5j4%QQM%mprrqlPJ6J4kk0k1pJ0J6J3QOJ1J2kk2l9l9k3
11825B51qjKMJ2J7J8J6J3J0OL%kJNPPMKKMRJ2Rlj4j6oPJ1J0LnrnJ0K7L6L0J6LmnnlkknqnK
11804D61ONoj8k5k6k2j7rJPPQQNkj0j3j6k0k1j5nMRJ5K1K6K2Qqj7j4lRRKlkLRJ5J5Pnj5j4
$$ plain form
11934 383 413 436 444 442 441 446 457 470 482 487 481 467 454 445 435 419 398 378 357 333 305 274 244 223 219 236 267 297 319 334 344 345 331 302 269 241 224 211 193
11918 193 163 126 96 82 88 105 124 140 154 174 199 230 266 310 356 390 404 406 407 408 404 396 388 383 380 379 381 385 386 381 375 368 359 349 344 349 359 367 370 365 350 325 306 309 333 362
11900 362 380 383 376 363 352 349 354 357 354 345 335 323 304 283 262 246 234 228 232 248 268 284 288 279 266 258 264 289 330 373 407 422 427 431 440 446 443 432 423 419 415 401 378 355 343
11882 343 342 347 350 348 347 349 349 338 317 292 276 271 272 277 288 304 322 336 344 344 330 307 284 276 282 287 277 258 251 264 288 304 304 300 306 323 342 357 368 376 382 387 393 395 390 376 356
11863 356 339 330 331 338 346 346 333 308 280 259 248 248 261 283 306 317 313 301 293 290 286 282 283 293 308 320 326 326 320 309 298 299 314 332 340 336 324 309 292 279 274 278 285 293 299 300
11844 300 296 287 282 285 292 293 285 278 283 306 340 374 398 406 396 372 347 333 333 341 349 353 353 349 342 333 324 316 313 320 336 350 348 328 307 300 310 326 339 347 353 364 376 374 352 313 274 251
11825 251 243 242 244 248 260 277 295 311 324 334 340 343 343 341 342 347 354 361 365 367 369 373 382 394 403 400 386 370 364 371 382 392 395 390 381 376 386 413 449 479 495 498 494 489 484 481 479 477 472 464 459 461
11804 461 467 472 466 448 423 397 375 358 349 350 357 364 372 380 385 383 373 360 344 324 303 288 283 287 296 311 332 358 380 388 380 363 349 346 355 364 366 363 361 364 373 388 403 410 405 390 376
11785C76ojjk%%jLJ4K4J9Lj3j7j4j6k5l1k8j7pmj0j5j1QL3M4L7J5pk4l4l7k7rJ2K4K3J0lj0
11769B75pLJ5K6L1L0K4K5L2L5J9rk6j6MJ6Rnj2j4j6k3k5j8kJ2J7J4J0J2J7K1K1J6Onj2j1p
11753D82nmprj3j1KJ5J7Pkooj4k2k3j6j0j4k1k2j3JJ0J0OKjnj1j1kJ1J9K1J8J4Qok0k6k2j3
11736C08kQJ6K0J6J1QMmj2j2%J8K9L1K7K1J3PPNmj5k0j5rj0j4j8j3JJ7K2Qj7l4l4k4j8j5q
11719B99MJ2J6J4J2OKMJ2J9J8Rkj1j4pNJ1Kj3k2k2j4mMQMkqo%OO%j1j8j9j6j7j9j8qLQNKR
11700B49J8J8J1PJ0J4J1KllkKQJ1Omj1oOJ9K8L0J7kj4qMJ2J1J0Pnk5m1m2l2j6o%NRRRJ0J6
11682C49J7J2POLoj6j9j1lkkJQJ4J7Rnj9k1j0JLJMPKpqJJ0J7J8J3Lrj3pMJ2J4J2QQJ1J6J4
11663D64PMONok1l2l6l6k7j3jJnoKJ9L5L7K5Pmppj3j3mJ1K1K5K4J9J0LKKJjOJ4J8J1Jrk0k7
$$ plain form
11785 376 370 369 368 366 366 366 365 368 382 406 425 428 415 398 384 368 343 312 284 267 260 256 246 231 220 228 261 305 342 357 350 326 292 255 228 219 231 255 278 288 285 275
11769 275 268 271 286 312 343 373 397 422 454 489 508 499 473 457 461 477 486 481 469 455 439 416 391 373 371 383 400 414 424 436 453 474 495 511 517 512 500 489 482
11753 482 477 473 466 457 444 433 435 450 467 474 472 466 460 446 424 401 385 375 361 340 318 305 306 316 326 332 334 333 328 317 306 304 315 334 355 373 387 395 389 369 343 321 308
11736 308 306 314 330 350 366 377 385 389 385 373 361 361 379 408 439 466 487 500 507 514 519 515 500 480 465 456 446 432 414 401 402 419 441 449 432 398 364 340 322 307 299
11719 299 303 315 331 345 357 363 365 369 381 400 418 427 425 414 400 393 398 409 411 398 376 354 340 336 340 348 352 350 342 336 336 342 348 348 337 319 300 284 267 248 230 222 225 233 238 240 249
11700 249 267 285 296 303 313 327 338 340 337 334 332 334 342 353 359 355 344 338 344 363 391 421 438 436 422 414 418 430 441 451 458 453 428 387 345 313 297 291 291 296 305 314 323 333 349
11682 349 366 378 385 391 394 388 372 353 342 339 337 335 336 344 358 375 384 379 360 339 329 330 333 334 338 345 347 340 332 333 343 360 378 391 394 385 372 365 369 381 395 407 415 423 434 450 464
11663 464 471 475 481 486 480 459 427 391 355 328 315 314 315 310 304 306 325 360 397 422 429 425 418 411 398 385 381 392 413 438 462 481 491 494 496 498 499 498 504 518 536 547 548 539 519 492
11645D92k0oKlj4k0k1k6l0l0k1rKNLoj3j5qJJ1K0K6K8K8K6J9J1OPQ%j3k6l6l7k9j0J1J8Qq
11628C31k2k5k1j3%J4K1J7J0RJ3J6J0lj3j4oJJoj0nLM%lkKjmrj2j4j1%J1J8J6J1O%rj7k3k9
11610B42l2k1KK5L4K3OoqjOJ2J5J8K2K2J5Nno%RJ3Qkj0j5j3j1pJPJ0J1J0OKKPJ1Plj2j4j4
11592C71j2mRJ6Pj4k5j4J0K4J7NMJ4K0Qqj6rJL%jLNK%jkoj1j6k3l1l1j5LJ3J2RJ2J1Lqj2j2
11573C11j1j0oLJ2K2K9K7Qj1j2NJ9J6PNRQJkJM%rj9k4j8pmj5k6k7j8oOK3L2K8J0ljQK0K6K7
11555D38J9PkoonKRJ4J0Koj2j4j3j2j5k4l4m0l5j9KJ2Rj%J0K3L0K6J7MmojPJ0J4J0KnnLQJ0
11537D33QPjrj4pKJ0J6J8J1%rpKOjj7l1l1j7LJ0OJMJ0J2RJomOJ5J8J4J5J7J5ROQQJ0J7K6K7
11518F26J7RNMjloj2k0j7lMkj0j1j0j2j1j0j5k4j9OK5K1QPJ5K9M9O8P2O2P1J11J48J68K08
$$ plain form
11645 492 472 466 468 465 451 431 410 384 354 324 303 294 296 301 304 298 285 270 262 263 274 294 320 348 376 402 421 432 438 445 453 453 440 414 378 341 312 302 313 331 339 331
11628 331 309 284 263 250 250 264 285 302 312 321 334 350 360 357 344 330 324 325 326 320 310 305 308 312 312 309 307 309 308 304 295 283 269 258 258 269 287 303 314 320 320 311 294 271 242
11610 242 210 189 191 216 250 273 279 273 265 264 270 282 297 315 337 359 374 379 374 368 368 377 390 398 396 386 371 358 347 340 341 348 358 369 379 385 387 389 396 407 414 411 399 385 371
11592 371 359 355 364 380 387 373 348 334 344 368 385 390 394 408 428 436 428 412 403 404 407 407 406 409 414 416 416 415 413 407 396 380 357 326 295 280 283 296 308 317 329 340 343 335 323 311
11573 311 300 290 284 287 299 321 350 377 385 374 362 367 386 402 409 414 423 431 432 430 431 435 435 426 407 383 365 358 354 339 313 286 268 262 268 291 323 351 361 358 357 365 385 411 438
11555 438 457 464 462 456 450 445 447 456 470 480 482 476 464 450 437 425 410 386 352 312 277 258 260 272 281 280 280 290 313 343 369 386 390 386 380 379 386 396 410 420 422 417 412 415 423 433
11537 433 441 448 447 438 424 417 419 429 445 463 474 474 465 458 460 466 465 448 417 386 369 372 382 388 389 393 403 415 424 425 419 415 421 436 454 468 483 500 515 524 530 538 546 556 573 599 626
11518 626 643 652 657 661 660 657 651 639 619 602 599 603 601 591 580 570 558 547 537 522 498 479 485 510 531 539 546 561 590 639 707 779 841 912 1023 1171 1339 1547
11503A547K94M13N58P72J015J057O67q0p76j061r47p01n15l87k72j81j36j10p5m7m7n7n5m1
11493H35k8j9j4j7k9l6k8j8j4j6j7j9k5k2mJ6K2J7J1Jj5l2m0m2m5m2k7kJ9K6J7LppnkJQJ9
11477D23K3K0J5J2Mrj7j8j5j2qnpj6j8j2JRJ3J7J7J1%j2k4l7l7j9PK7L5L3K6J3jj1j6j7j1
11462C84MJ8K2J6RNOOOMnj8k9k9k1j1qj0j4j2pjKJkmkOJ5J8J9K3K9K8J5kj0j3j6j7j0KQ%j1
11444C94j7j8j8j7j2jRJ8K5K5K2J2Lnj0j5j8k2j7oQJ3Orj9j6nPQJpp%LKJkk%RJ8K1J3Loj1
11425C61j7j9j9j4qmlqj4j4pKN%j1j6j6qOK3L7L9L1J6Kj2k4k9j5RL2M0L5K5J4Lmojlj1k1k9
11408C47k9k2mJ4K6K4J6QNONN%pj2j3oLJ2J7J5Ml%J2K4K1Lj8l0k8j4orj5j3kRJ2Noj8k3j5
11390C00%J5J9K0K0K7L0K6J7OJJLPJ4K0K1J4jj6k6k9k9k7k3j6rmjlj0k4l4l5k4j1kLONLLR
$$ plain form
11503 1547 1841 2254 2812 3584 4599 5656 6323 6243 5467 4406 3459 2758 2243 1856 1584 1403 1267 1157 1082 1035 988 931 876 835
11493 835 807 788 774 757 728 692 664 646 632 616 599 580 555 533 529 545 567 584 595 596 581 549 509 467 422 380 353 351 370 396 413 416 409 402 397 395 396 404 423
11477 423 446 466 481 493 497 488 471 453 438 426 418 413 406 390 372 360 361 370 383 400 417 428 428 416 392 355 318 299 306 333 368 401 427 440 439 428 412 395 384
11462 384 388 406 428 444 453 458 464 470 476 480 475 457 428 399 378 367 359 349 335 323 316 315 317 318 316 312 310 316 331 349 368 391 420 448 463 461 451 438 422 405 395 397 405 405 394
11444 394 377 359 341 324 312 311 320 338 363 388 410 422 425 420 410 395 377 355 338 332 340 353 359 350 331 315 310 317 325 326 319 312 312 315 317 318 316 314 314 323 341 362 375 378 372 361
11425 361 344 325 306 292 284 280 277 269 255 241 234 236 241 241 230 214 198 190 196 219 256 295 326 342 344 332 308 279 264 273 305 345 380 405 419 422 418 412 411 408 397 376 347
11408 347 318 296 292 306 332 356 372 380 385 391 396 401 401 394 382 369 363 366 378 395 410 414 411 411 423 447 468 471 453 423 395 381 375 366 351 338 336 345 357 362 356 338 315 300
11390 300 300 315 334 354 374 401 431 457 474 480 481 482 485 492 506 526 547 561 560 544 518 489 460 433 410 394 385 381 380 377 367 343 309 274 250 239 237 240 246 251 254 257 266
11373B66J6K0J7J0mj9k3j8j0plJ4L5M8M3L5K9K2Qjkjoj1pMJ4J8J9J5Qnj1qlmj3k3k9k9k5j7
11356C62j0o%MNK%J%oj1j4j1nKJ4L1M2M2L1K0J1Kj3l0m1l7k0KK0K7K3J4J0J2J3Qjoqnlloj6
11338D46k6k8j3J3K9K6J1lrj8l0m0l7k0nOJ2J9K3K1J5J0Njj1k3l2k7j0PJ6J6J7K2K7K8K2J3
11323D71jj7k8k6j7j3k0l0l4l2k8j7nNRJ4K7L9M1K6J0KNOjj2j3lONrk1k3j4nMPROJlon%J1
11305C21J4Mj4k8k8j6JJ4K5L2L2K5J6QQMnj7k3k2j4kJ1J6J2kj1j5j1KJ6K4J6jj3pOJ3Noj1
11288C79j0pqrnOJ4J1Kqj1j3j7j7oRJ8K3K6K5J3j0k6l0k0j0ommqj4j9k0j4kJ1K4L3L6K6Pj3
11271C52k2j9oLJ0J1J0QPJmqlQJ8J8J0jqj2qKRJ2J3J4J3NjjNJ0Omj3j7j7j5j4j2j5k2l0l2
11254B61k1kJ7K3J7Nnj1j3j4j1kQJ4J1KmlMJ1J4J1%rj6j4j0mJNQQRJ2J4J6J5J7J5Opj7j6p
$$ plain form
11373 266 282 302 319 329 325 306 283 265 255 248 245 259 294 342 385 420 449 471 479 478 476 475 469 458 451 455 469 487 506 521 529 524 513 505 502 498 485 462 433 404 379 362
11356 362 352 346 346 350 355 357 357 358 358 352 341 327 316 311 313 327 358 400 442 473 493 504 506 493 463 422 385 365 367 387 414 437 451 461 473 486 494 493 487 479 474 471 468 462 446
11338 446 420 392 379 392 421 447 458 455 446 428 398 358 321 301 296 302 314 333 356 377 392 402 407 406 395 372 340 313 303 310 326 342 359 381 408 436 458 471
11323 471 470 453 425 399 382 369 349 319 285 253 225 208 203 208 217 231 258 297 338 364 374 376 381 387 386 374 361 358 364 369 360 339 316 302 297 301 308 317 323 324 321 315 310 310 321
11305 321 335 339 325 297 269 253 254 268 293 325 357 382 398 406 414 418 413 396 373 351 337 335 346 362 374 372 361 346 335 337 353 377 393 392 379 372 378 391 396 390 379
11288 379 369 362 354 345 340 346 360 371 373 365 354 341 324 307 301 310 328 351 377 402 415 405 379 349 329 319 313 309 305 297 283 264 244 230 228 239 263 296 332 358 365 352
11271 352 330 311 305 308 318 329 339 347 354 355 351 343 340 348 366 384 394 393 385 373 365 367 376 388 401 415 428 433 432 431 436 446 452 448 435 418 401 386 372 360 345 323 293 261
11254 261 240 238 255 278 295 300 295 284 271 257 246 244 252 266 277 279 275 272 276 287 301 312 312 303 287 273 263 259 260 265 273 281 290 302 316 332 347 364 379 385 378 361 345 338
11236C38OJ5K4L5L9L3J6jj2j8k2k2j5plrj4j3mLMlrj5j9j9j5lJ2K7L0K3R%kjJMRJ2Nj1k6l7
11218C45l5k0MK8L7K5PkLRRMMKrk4k6j0J2K3J5kj5j9j1LJ3J6Qnj7k2j9j2oljLJ0J7K0J4%j0
11201C63q%MjnkPJ4J9J7Pj0k3k0mPQKmqj2j1ronoolMJ0J4R%ppk%nj8l0l5k7j4%QJ4K2K5J8
11181B84Lj1j4pMJ4K1K1K1K1K1J4Lqj3j2ojPJ0Nj0k1k1qNJ3J4J4J2J0Kqj9k6k7k6k1j6mJ3
11165B53L0L3K3QNJ1J6J5O%jMJ0J0O%mnqj1j1kJ4K6L0K2J1krj0ppj0j3r%Ljnmjnj1j2qprq
11145C56%RJ3J5J4J2Krj5j3j1j4k0k4k6k9l0k1nJ1K0J9J8K0K2J5OLNMoj5j6pjlpqJJ1J6J4
11128C26P%mnJJ0J4Pqj1jJ5J9J1NOQOnj6j8j0OJ5J7J6J6J7J5RMKmj3k1j9j4p%J4K5K4J2lj5
11110D53k2k8k6j5JJ3J8J4Kj2k3k5j6JJ1PmrlRJ4J0kj3j9j1KJ0Nj1k7l1k2oJ2K4K5K1K1K9
$$ plain form
11236 338 344 359 383 418 457 490 506 505 493 475 453 431 416 409 406 397 383 370 366 369 373 370 361 346 327 308 293 290 302 329 359 382 391 391 389 388 389 393 402 414 419 408 382 345
11218 345 310 290 294 322 359 384 391 389 392 401 410 414 418 420 411 387 361 351 363 386 401 399 384 365 354 357 370 386 394 389 372 350 331 319 313 310 309 312 322 339 359 373 373 363
11201 363 355 355 359 358 353 351 358 372 391 408 415 405 382 362 358 365 373 375 371 363 351 340 331 325 320 314 308 305 309 319 333 342 342 335 328 326 326 321 303 273 238 211 197 197 205 219 241 266 284
11181 284 287 276 262 255 259 273 294 315 336 357 378 392 395 387 374 362 356 355 362 372 377 367 346 325 317 322 335 349 363 375 385 387 379 360 334 307 281 260 244 240 253
11165 253 283 316 339 347 352 363 379 394 400 400 399 403 413 423 429 429 425 420 412 401 390 388 402 428 458 480 491 489 480 470 463 456 446 433 424 424 427 426 421 417 416 411 400 388 380 373 364 356
11145 356 356 365 378 393 407 419 421 412 397 384 373 359 339 315 289 260 230 209 204 215 235 254 272 292 314 329 335 338 343 347 341 326 310 303 302 299 292 284 285 296 312 326
11128 326 333 333 329 324 325 335 349 356 348 337 336 351 370 381 386 392 400 406 401 385 367 357 363 378 395 411 427 444 459 468 472 474 470 457 436 417 403 396 396 410 435 459 471 468 453
11110 453 431 403 377 362 363 376 394 408 410 398 375 350 334 335 346 353 349 340 337 346 360 370 368 355 336 325 327 337 342 331 304 273 251 245 257 281 306 327 348 377
11094C77L3K1mk6l1k5j6nRK8L9L1J1oj0opj5j7nJ0J5J3QNnk1k6j5kjj2j7r%LLOJ0Nnj5j6j3
11077B97j0qnnppjOQMMJ0J4J2QNPRQPMKjlmkkJNLkpn%K%lpj7k9l1j8JJ1J0NKLQJ3J1Mmmj%
11054C01onQK1J9jk1k5j6qpj2j1JJ5K5K3J5Lpj1qopj3j9j6pk%JRK2K9K2Mj2j8j6j2qKJ8K8
11037B92K7J5OMKko%J1J9J4MmkKJlpqj1j3j2oLQQRJ2J0%j0rKJ3J0KKJ0J6J4Lqj8k8l2l5l7
11018B68l9l2j7MK0K6K5K2J8J4J0Loj4j4nLRJ5K0J9Oj0j6j1JO%j3k1k0j0KJ1J7J7J4QOJ4K5
11001C75K9K5J4Kj3k7l4l2j9qkoj0qOK0J9PjLRQkrnLPPPQJj3k0j1RK1J9J2J0J0PKMJ3J7Pj2
10982D49l1m2m5m2l5k4j1kKjokRK2K5K4K3K5K2J3kj1j5j1lQJ0RPPNmj3j3lJ1J6J2%j0oJ0K3
10965D00K1Lj3j8j5j1qlLNMNJ2J6J6J1kj7l2l7k9j3J0L0L8K7Qrj2j2j1qjLjpo%%qj3j1orj4
$$ plain form
11094 377 410 431 427 401 370 345 329 324 333 361 400 431 442 436 426 420 413 398 381 376 386 401 414 422 427 422 401 375 360 358 357 345 328 319 319 322 325 331 341 346 341 326 310 297
11077 297 287 279 274 269 262 255 254 260 268 272 276 286 300 312 320 325 332 341 349 356 360 362 361 358 354 352 350 351 356 359 357 350 345 345 347 347 344 337 320 291 260 242 243 254 264 269 271 274 282 295 306 310 306 302 301 301
11054 301 295 290 298 319 338 337 316 291 275 267 260 248 237 238 253 278 301 316 319 312 301 293 287 280 267 248 232 225 223 223 224 233 255 284 306 310 298 280 264 252 244 246 264 292
11037 292 319 334 340 344 346 344 338 338 349 368 382 386 382 380 382 383 380 373 365 354 341 329 323 326 334 342 351 363 373 373 363 354 356 369 379 381 383 393 409 423 426 418 400 372 340 305 268
11018 268 229 197 180 184 204 230 255 277 295 309 319 322 316 302 288 283 286 295 310 330 349 355 345 329 318 319 325 325 312 291 271 261 263 274 291 308 322 330 336 350 375
11001 375 404 429 443 445 432 405 371 339 320 312 310 304 294 286 292 312 331 338 337 340 349 357 355 346 341 344 351 358 365 373 374 361 341 330 339 360 379 391 401 411 418 420 424 437 454 461 449
10982 449 418 376 331 289 254 230 219 217 219 218 212 210 219 241 266 290 313 338 360 373 371 360 345 334 331 339 349 358 365 372 377 373 360 347 344 355 371 383 383 373 367 377 400
10965 400 421 424 411 393 378 367 359 356 359 364 368 373 385 401 417 428 426 409 377 340 311 298 308 338 376 403 411 402 390 378 367 359 358 361 360 353 347 347 347 339 326 315 309 300 286
10947B86j7j1lLNJqj3j1ojLRJ7K2K2K1K0J7Lj5k3j4MJ9K1J9J8J9J6J1Jj0k0k4k2k4l1m2m2
10931B20l0qJ5L4M2L5J3rj7j2nl%RJ7J7Qmj0ojKJjKRJ3Nj0k5k9k6j9j6j2mJ%mlNJ0J0PPPJ
10912B36oj4j9j8j0LJ8K7K4J7J0NjlJJ1K0J9J5J4K3L0K6J2pj4j4j0pmKJ0J7J7J3Kop%RJ5J2
10895D68Mmpj0rlLNkj2k0j9qKNmj7k3j7j0rj6k3k2j8j4rjQJ1J0J0OJmqnKJ0J9K6K9K0Lj4k4
10877C10k1mJ4K1J5%ponqj2j4j3j4j2kJ5L2M7N4M7L0OqpKOMjkklpj2j4rJRJ0Nnj6k2k2j9k0
10858C41k6l1l2k8k0qJ1K4K8K5K8L5L1J7OMP%j1j2JJ5J5Mj3k8l1k3j0mpj0lRJ8K2J8J1OQJ7
10842D04K1Rqk0k2k3k6k4j1MJ1J3J5J8J7Qjopj3k0k0j4%J2J7Prj5nRJ6J0ONMJjjKPJ1J0mk5
10824C62l8l3k1j2pnmmlJL%lkLMNJ4J9J3oj6j1kjlmnj3j8rRK0J7PMJ1K0K6K1Mj4k4j6JJ4J8
$$ plain form
10947 286 269 258 255 258 263 264 256 243 232 226 225 228 237 254 276 298 319 339 356 359 344 321 307 311 330 351 370 388 407 423 434 435 425 405 381 359 335 304 262 220
10931 220 190 182 197 231 273 308 321 312 295 283 278 275 275 284 301 318 326 322 312 306 305 307 308 307 309 318 331 336 326 301 272 246 227 211 199 195 196 196 192 189 194 204 214 221 228 235 236
10912 236 230 216 197 179 169 172 190 217 241 258 268 273 272 269 270 281 301 320 335 349 372 402 428 440 433 419 405 395 388 384 386 396 413 430 443 445 439 432 432 441 456 468
10895 468 472 468 461 451 442 439 442 447 445 433 413 394 386 388 393 389 372 349 332 322 313 297 274 252 234 220 211 210 218 229 239 249 255 256 252 244 239 241 251 270 296 325 345 348 334 310
10877 310 289 285 299 320 335 335 328 322 317 309 297 283 270 256 244 242 257 289 336 390 437 467 473 465 458 460 466 470 469 467 465 462 455 443 429 420 421 430 440 445 440 424 402 380 361 341
10858 341 315 284 252 224 204 196 207 231 259 284 312 347 378 395 401 405 412 412 401 389 390 405 420 424 411 383 352 329 319 315 308 298 295 304 322 344 362 373 379 387 404
10842 404 425 434 426 406 384 361 335 311 300 304 315 328 343 361 378 386 385 379 372 359 339 319 305 305 317 334 341 332 317 312 321 337 347 353 358 362 363 362 361 363 370 381 391 387 362
10824 362 324 291 270 258 251 246 242 238 235 236 239 239 236 234 237 241 246 260 279 292 286 270 259 257 256 253 249 244 231 213 204 213 233 250 257 261 272 292 318 339 343 329 305 289 290 304 322
10805C22J5RRJ4J8J3jj5k0j4n%j%MPKnlQJ7Rmr%J0J4J7J5Ppj5j6k0k8l3k3qlmmMJ4J8K0K0
10786C48J8RMMJ2J4Qkpo%RJ5K0J5Omj0j6k3k4j7jQRLmnmoj3k5l3k8j9j0qmKPPQJ2J4J2J2J6
10767C23K1K0J5J6J6J1Jrj6k4k9k6j1QK0K0J0lj2j6j7j5j1JJ5K4K2J3Lklj%kopljnj3k0j8
10751B89j0OJ9K2J6Nqj9k7k7k2j7j7j5mJ1K4L0L1L1K9K8K6K2J4Kj0j8j9j6j1j0rqmJNPJ0J5
10735C72J3Lj2k4k3j5pkJPQMllOJ4J4J2J5K6L6L7K6Nj2k2j7mJ0J7J6J2Mmj6l0m2m5l6j8OK4
10718C53K7J6ORK3L3L1J8Kj5k8l4l6l3k8j7%J2J3RJ2K1K6K3J5Ojrj3j3rkJ0K0K3J7Pjnrrq
10701D62oqj3j4j1nKRJ1RKljLM%qj6k2k4j9q%J%jKPJ1J2P%oqrj0j1j0mjlpkJ2K4K1Nj0j5j3
10681C36j3j6k0j2KK0K9K7J9J1RPjj2j9j9j2JJ1J7J2MKQJ5J6J2Lrk2l3l1k2j1lJOPOKJ%j%
$$ plain form
10805 322 337 346 355 369 387 400 399 384 364 350 345 345 344 344 348 355 357 352 349 357 374 383 379 370 370 380 394 411 426 433 426 411 395 375 347 314 291 283 280 276 272 276 290 308 328 348
10786 348 366 375 379 383 395 409 417 415 408 402 402 411 426 446 461 467 463 453 437 414 390 373 372 380 389 392 388 383 379 373 360 335 302 274 255 245 237 233 235 242 249 257 269 283 295 307 323
10767 323 344 364 379 395 411 422 423 414 398 374 345 319 308 316 336 356 366 363 351 335 318 303 292 293 308 332 354 367 370 368 365 364 364 362 356 349 346 345 340 327 307 289
10751 289 279 285 304 326 342 347 339 320 293 266 244 227 210 195 191 202 226 256 287 318 347 375 401 423 437 439 429 411 392 376 365 355 346 338 334 335 340 347 357 372
10735 372 385 388 376 352 329 314 307 305 306 313 321 325 322 319 325 339 353 365 380 406 442 479 505 510 498 476 459 455 465 482 498 510 514 510 494 464 422 377 341 323 329 353
10718 353 380 396 402 411 434 467 498 516 518 503 475 441 405 372 344 327 327 339 352 361 373 394 420 443 458 464 463 454 441 428 419 417 427 447 470 487 494 493 488 479 470 462
10701 462 456 448 435 421 410 405 407 416 427 436 438 435 434 437 441 441 433 417 395 371 352 344 344 345 345 344 346 353 364 376 383 383 377 369 360 350 339 329 325 324 321 314 312 324 348 369 374 364 349 336
10681 336 323 307 287 275 277 297 326 353 372 383 392 399 398 386 367 348 336 337 348 365 377 381 383 391 406 422 434 437 428 406 373 342 320 309 306 307 313 320 326 328 329 329 328 328
10663C28LJ1J9K5K2J0mpjLkj0j4j4j2j0njkj1j8k1k4k6k3j2JMkolMM%jPJ9K6K8K9K7K2J3N
10645C81MON%oj2j8k2k3j7pMJ4K0K1J8J4J0NKJJmj4k0j5mORLnj2j4j1oKOOKjjoj9l1l0j9n
10627B18JLLMMPJ4K4K7K1J2LKJ2K2K3J3jmLJ0Omrj2j5j9j9j3omokNPjqoLMmj2j2j1j5j9j9
10608B30j4oNJ4J5NJPJ8K2K0K1K0J3%nKRRJpj1j2qlKMPQLpj4j3j3j3j3mMJ0J1J4K0K3J7R%
10589D01opnllnqqqnlJKMNMjopnonjPJ3J5J2PjorqmRK3L4K9J6Kj2k2l0l3l4l3k7j2LRLkLN
10568B82kj2j3lJ1J5J2QQJ2J8K3K8L4L2K2Ppj4j9j9j7j2j5k4l1k6j0PJ7J8J0K%NJ1RNMRJ4
10551C99J8J8K0J7Oj0k2k6k4j9j5j8k2k2j4JJ7K5K3J5LljRJ5J6Rjj5k6l1k2qMONOJ2J3Pmj7
10535C44k4k3j9j2mMJoj1LK3L2K4Pqj9k9k9j4RK2K4J7J1KonMJ0QMRJ8K3J8Rnj8k4k2j7j3j0
$$ plain form
10663 328 331 342 361 386 408 418 414 407 406 409 407 397 383 369 357 347 342 341 339 328 310 289 265 239 216 204 205 209 207 201 198 202 206 206 205 212 231 257 285 314 341 363 376 381
10645 381 385 391 396 396 390 378 360 338 315 298 291 295 309 329 350 368 382 392 397 399 400 401 397 383 363 348 344 350 359 362 357 345 331 320 314 316 322 328 330 329 328 322 303 272 242 223 218
10627 218 219 222 225 229 233 240 254 278 305 326 338 341 343 355 377 400 413 412 408 411 421 427 423 414 402 387 368 349 336 330 326 320 318 323 330 329 321 315 318 322 318 306 294 283 268 249 230
10608 230 216 210 215 229 244 249 250 257 275 297 317 338 358 371 371 366 368 377 386 387 380 369 357 349 346 348 352 359 367 370 363 349 336 323 310 297 293 297 307 318 332 352 375 392 401 401
10589 401 395 388 383 380 377 372 364 356 348 343 340 341 343 347 352 356 355 349 342 337 331 326 325 332 345 360 372 379 378 372 363 355 351 360 383 417 446 462 464 452 430 400 367 333 300 273 261 264 273 276 274 277 282
10568 282 280 268 255 252 263 278 290 298 306 318 336 359 387 421 453 475 482 475 461 442 423 406 394 379 355 324 298 288 295 312 330 340 342 342 347 358 367 372 376 385 399
10551 399 417 435 455 472 478 468 446 420 396 377 362 344 322 300 286 287 304 329 352 367 370 367 366 375 390 406 415 414 399 373 342 320 312 316 322 327 333 345 358 365 361 344
10535 344 320 297 278 266 262 266 267 261 250 253 276 308 332 339 331 312 283 254 240 249 271 295 312 323 325 319 314 318 328 336 340 349 367 390 408 417 412 394 370 348 331 318 308
10517C08o%JKOJ7K5K4J4Krj3j0kOQMjmpj0j3j1qllnpojMJ4K7L4K8J1mj4j8k1k2j5JJ7K6K1
10499C87Pj1j8j4oJMPJ4K1K2J4jk2l6m0l6k3qJ2L0L8L0J2mn%NN%%JKKKKMPOLJkoj1j2qjmj5
10479C56k3j9lJ5K8K6J1j2k7k6j7j0pNK2L6L5K1Lj6l2l5k8j6rlMQJj5k7k8j4NK3K7J6JmjM
10463B75OOLkpq%RJ5J5J2RN%rj7j6lPNqj4rKJ1J1OLQK2L2L1J9RRJ0Nj0k3l4l9m0l0j7plnn
10443B39oojORPRK0L5L8K6Rlpj1j9k0j6j0lRK2K8K0kj8k4j3MJ9K0Oj4k8k9k3j0JQNlp%J1J7
10425B95J2Jqqmj%LOJ0J5K0K2J7Noj1j0j2j8j6qNJ7K3K0Pj0k0j6p%%kjjqj6j4kJ3J8J7J2R
10407C48%j1j8j0MJ6K1K0J8J8J6J7J4Lj5k9l1k5j3%RPpk1k2j5j0qlQJ6J9J8K0K0J0ok2k8k4
10391C04j8j1jJ4K8L3K9K6K6K6J7Jj6l2m0l8l2k9l4l8k7pJ1J7J5Nnp%J2J4OJKNKKRK2K7J5
$$ plain form
10517 308 302 302 303 305 311 328 353 377 391 393 384 371 361 359 365 373 377 376 372 365 355 342 331 323 320 317 312 305 299 298 302 316 343 377 405 416 412 398 380 359 337 322 323 340 366 387
10499 387 394 383 365 351 345 346 350 357 371 392 414 428 427 405 369 329 293 270 262 274 304 342 372 384 380 375 375 380 385 385 385 386 388 390 392 394 398 405 411 414 415 413 407 396 384 376 375 371 356
10479 356 333 314 311 326 354 380 391 379 352 326 309 299 292 297 319 355 390 411 414 398 366 331 303 287 278 275 279 287 288 273 246 218 204 209 232 259 275 276 272 271 275
10463 275 281 287 290 288 281 273 273 282 297 312 324 333 338 338 329 312 296 293 300 305 297 283 274 276 287 298 304 307 315 337 369 400 419 428 437 447 452 442 419 385 346 306 276 259 252 249 244 239
10443 239 233 227 226 232 241 248 257 277 312 350 376 385 382 375 364 345 325 309 299 296 305 327 355 375 373 355 331 318 322 341 361 367 353 325 296 273 263 264 272 277 274 267 267 278 295
10425 295 307 308 300 292 288 287 287 290 296 306 321 341 363 380 385 379 368 358 346 328 312 304 309 326 349 369 376 366 346 330 323 323 323 321 320 319 311 295 281 279 292 310 327 339 348
10407 348 348 337 319 309 313 329 350 370 388 406 422 439 453 456 441 412 381 356 343 343 352 359 352 331 309 294 284 276 273 281 297 316 334 354 374 384 378 356 328 304
10391 304 286 275 274 288 316 349 378 404 430 456 473 474 458 426 386 348 316 287 253 215 188 181 192 209 224 229 224 217 217 229 243 249 250 252 257 259 261 270 292 319 334
10375C34j1m0n4m5j7J5L9N0M9M1L4K5J4nk6l5l2k4j7j4oJOQNmj5j8oPOoj5j1KJ4K2K3K2K5
10359C41L2L5K7J4Lpj6k7k8j3KMj2l7n3n6m6l1j9oNJ6K4L0L1K3J1MPJ3J2Lm%RJ1MlnJJ3K4
10342C36K6K0Plj2j8k0j7j0nLJ1K0K4J6NljOPJrj5j3j0rqmKRPJnmJJ0J4J2OJjjoj2j3kJ2K0
10323C76J3lj3j4j2o%J2K2K5J8MopMK0L3L7M0M9P5J18J61J74J24K4q3j44j44j12q0o2m8l5
10309E60k4k0j8j2kNM%moqpKJ5K3J7Kj5k6l0k3pMPjqqjjrk0j9nJ8L4L4J9lk2k6k3k2k8l2k2
10291B92pKkqpoj1k0j8nRJ9K3K2J7J0NNK%lj%J%KJ%kjLQJ0QMjJOQL%JNKrk2l1l5l5l0j7MK1
10270B23K6K0J0Lkrj1qJPPMOJ6K8K9J0j6l2l1k2j6rOK3L2K7J4Kj0j4pOJ1%j8l1l2k1pNJ0R
10252B39J0J5K1K3K0J2jj1j3mRJ7J8J9J9J8RkplLMlj2j3p%QJ3J6J1nk0k6k1j5j3j0mQJ7J6
$$ plain form
10375 334 323 283 229 184 167 182 221 271 320 361 395 420 434 429 403 368 336 312 295 281 275 276 282 290 295 291 276 258 252 259 265 259 244 233 235 249 271 294 316 341
10359 341 373 408 435 449 452 445 429 402 374 361 363 367 355 318 265 209 163 132 113 107 112 128 152 182 213 236 247 251 258 271 283 286 282 282 291 302 306 303 298 299 312 336
10342 336 362 382 389 386 374 356 336 319 309 304 307 318 338 362 378 383 380 379 385 392 393 384 369 356 346 337 329 325 327 336 343 344 339 335 336 346 360 372 378 379 378 377 371 359 346 344 356 376
10323 376 389 386 373 359 347 341 341 353 375 400 418 422 416 409 413 433 466 503 543 592 667 785 946 1120 1244 1268 1185 1041 897 785 705 643 595 560
10309 560 536 516 498 486 484 489 493 493 489 483 475 468 470 485 508 525 527 512 486 456 433 426 430 437 436 428 420 419 418 409 389 370 365 383 417 451 470 467 445 419 396 374 346 314 292
10291 292 285 287 285 277 270 264 253 233 215 210 219 238 261 283 300 310 315 320 322 322 319 318 318 319 319 321 322 322 320 319 322 330 340 348 352 351 352 358 366 369 369 370 375 377 368 346 315 280 245 215 198 202 223
10270 223 249 269 279 282 280 271 260 252 253 260 267 271 277 293 321 350 360 344 312 281 259 243 234 240 263 295 322 336 338 328 314 307 313 324 324 306 275 243 222 215 220 230 239
10252 239 249 264 285 308 328 340 339 328 315 311 320 337 355 374 393 411 420 418 411 408 411 415 412 400 387 380 380 388 401 417 428 423 403 377 356 341 328 318 314 322 339 355
10235C55RLPJ3J1Jpj1j2j5k2k4k5k4k3j7j1pkRK1K8K5J7J1RRMkonjlomKNJornkJPJ0Pkj1j1
10216B92pnnl%lpj5j7j5oOJ5J9J5J2J3J8K0J5RPJ4J8J5Jj6l0l4k3kJ4J0mpJPLlJJ1J5RNMN
10197C72ONNPRJ4J3NmnJOPKmj8l1l6k7j4pj0j4j5j1kOJ3J7K0K1J6NnnKQQORJ0RJmJJ2J9J2
10178D35nk0k4j9j2pnkNJ6K3K3J4jj8l1l5k7j4pqj5j9j8j1pjOJ6K6L6M1M1L8L3K6K1J2Kqj3
10162D87j6j6j4qkmj1j5qKJ0RKj3k9m3l9j7J2L4M5M7M4L9L5L0J9Jj9l0k5j6j2j4j5pKKoj1
10145D30qJRJ5K0J9J1kj3j8k0k2k1j5okrj4j0JPJrj0kMJ0J7K2J7kj7j9j0jLOQKnj0j2j4j2
10128C20KK0K7J2mlJ0J9Qj0k0j6pjkj1j7j8j1polOJ5J6Lj3j9rNJ1PJMJ4J8Rj1k7l3k7j3LJ0
10110B52J2J1J0J2J2J0QNLkj0j7j8j2LJ5J9J5J1J4K2K7K7J7Lj6l1k9j3NJ3J0RJ1Qmj5j6rJ
$$ plain form
10235 355 364 367 374 387 398 399 392 381 369 354 332 308 283 259 236 219 208 201 199 208 229 257 282 299 310 319 328 332 330 324 319 318 315 309 305 307 312 313 307 298 293 291 292 299 309 316 314 303 292
10216 292 285 280 275 272 272 269 262 247 230 215 209 215 230 249 264 276 289 307 327 342 351 358 372 390 405 406 390 360 326 303 301 315 325 321 314 315 322 325 322 323 334 349 358 363 367 372
10197 372 378 383 388 395 404 418 431 436 432 427 428 434 441 443 439 421 390 354 327 313 306 296 282 267 256 254 260 273 290 310 331 347 352 347 342 344 352 360 366 375 385 394 395 391 392 404 423 435
10178 435 430 410 386 367 355 348 343 341 346 362 385 408 422 421 403 372 337 310 296 289 281 266 247 229 218 211 210 216 232 258 294 335 376 414 447 473 494 506 508 500 487
10162 487 471 455 441 433 431 427 416 401 393 395 405 414 416 403 374 331 292 275 287 321 366 413 457 496 531 561 580 581 562 532 507 491 479 465 450 443 445 447 441 430
10145 430 422 423 432 447 467 486 497 495 482 464 444 422 401 386 380 378 369 355 345 346 353 354 345 335 333 337 347 364 386 403 401 384 365 355 354 357 363 371 373 368 358 346 332 320
10128 320 322 342 369 381 377 374 384 403 411 401 381 365 358 357 355 344 327 309 298 291 285 282 288 303 319 322 309 290 281 286 297 304 305 309 323 341 350 339 312 279 252 239 242 252
10110 252 264 275 285 297 309 319 327 332 335 333 323 306 288 276 279 294 313 328 339 353 375 402 429 446 449 433 402 373 360 365 378 388 397 408 416 412 397 381 372 373
10094C73PJ0J0PNOOPOMKlomnj1j7k0k0k1k3j9j0kkpj0rkQJ5J0jqo%%jJQJ4K0K2J8Rmj4j7k0
10074C06k3k3j4QL1M1K8Kj7k2j8j4pJOPPJ0R%j2j4kJ4K2J9Orj9j7oLRJ0J5K0K1J6RMlj0j7
10057C77j9qJ3L2L6K5RJlpj3j5j2kMkj8l3l8l2k3j6oQK4L4L6L7L3K1Jj7j9q%nj9k7k6j4LK4
10040C36M1M5L2J3%qj5k0j4%J5J8J5RO%llmoj2j4j1nJJpj6j7oJ2K4K4K2K2K4K0Rlj2j6k6l7
10023D34m7m7l7k3qNJ2J1MLRJ2J2PLlj2j5nJ1K0K0J1Jj2k5l4l4k7k0j4j3j3j3oPJ9K8L2L4
10007B87L4L1K3J4PNjj3k5k9k1qkkqqkOJ1QKJLKnj2j1qrj2j2mMNOJ2J6J3Krj6j5j2pKJ2K6
9988B81L3L3K3Oj3k8l5l4k7k1j2LJ8K2Rqj4j0oj0j5j0NK3L4L4K1%k2l3k6rJ4L3L7K6Mj0j3
9972C03omqj2rokMJ8L2L7L3K6J9Kj8l5l5k6j3KJ9K9L0K2J4Kj3l1l9l3k2j5j2j0mLJ2J6J5J1
$$ plain form
10094 373 380 390 400 407 412 418 424 431 437 441 443 440 434 430 425 414 397 377 357 336 313 294 284 282 280 273 263 254 252 260 275 285 284 276 270 270 270 269 270 278 292 312 334 352 361 357 343 326 306
10074 306 283 260 246 254 285 326 354 356 339 317 299 285 278 279 285 292 299 309 318 318 306 292 290 304 326 345 351 342 323 306 300 303 312 322 337 357 378 394 403 407 404 394 377
10057 377 358 350 363 395 431 456 465 466 463 456 443 428 416 414 418 416 398 365 327 295 272 256 250 258 282 316 352 389 422 443 444 427 408 400 400 395 376 349 323 309 312 336
10040 336 377 422 454 467 467 459 444 424 410 410 425 443 458 467 473 473 470 467 463 457 445 431 420 415 416 417 410 394 377 371 383 407 431 453 475 499 519 528 525 513 497 471 434
10023 434 387 340 303 280 272 277 289 300 304 307 316 328 340 347 350 347 335 320 315 326 346 366 377 378 366 341 307 273 246 226 212 199 186 173 167 174 193 221 253 287
10007 287 321 352 375 389 396 401 400 387 362 333 312 304 302 300 292 284 282 288 299 307 309 310 313 315 310 298 287 279 270 258 246 242 246 251 257 269 285 298 300 291 275 260 248 241 243 255 281
9988 281 314 347 370 376 363 335 300 266 239 218 206 209 227 249 258 250 236 226 220 210 195 185 190 213 247 281 302 302 280 247 221 212 226 259 296 322 326 316 303
9972 303 297 293 285 273 264 258 256 260 278 310 347 380 406 425 427 409 374 339 313 300 302 321 350 380 402 416 418 405 374 335 302 280 265 253 243 239 242 254 270 285 296
9956B96RJ2J4Mj4l1l7l1j6%J2K2K8K5J2%opj0j2oJ0K2K3J2%rqMJ5K0J3JkJOJ1J3J0jj0j2p
9939C76pj0j3rolJJ0J2QkomjLRJ1Mj4l5m5m0k5oOJ3J6K2K4J9Lj6k7k4j8j6j4lJ6L3L3K5J6
9921C16R%poLJ3J7K0J8Qpj5j8k2l1l0j3J3K4K2J5J0QMkqj7k2k4k0j4pJOJpj2j0kLLjrj1lJ3
9903B09K4K6K3K2J8Nj5k5k0qknj1j0NK9M6M2K2MlllljjmpmQJ5J3Lj0k2l1l4k5nJ8L3L7L5K8
9885D13K1J2Kqj8k8l1k7j9j0JPJ0QKjjjjllkKQJ7J9J3Lmrj2j6j6j2qnkMPQQOKlpj0rqn%OJ3
9864C13K4L9N0M5K3jk1l4m2m0k6rjkmJRJ2J2RNMJ0J8J8Rjmknj2j6j6j9k5k6j5JJ5K0J1mj7
9847C06k2j9j1JJ3J9J7J9K6L3K8Qj1k1k5k4j8mOJj2j8j4lQJ4J4PjnmjJ%kj0j2lJ8L2L3K3J2
9830C99Nkpj1j7k0j6kJ6K6K3J2Jpj1j0nQK0K9L1K5J2lk0l1l6l4k7k3k2j9qRK6L4L4K8K6K2
$$ plain form
9956 296 305 317 331 335 321 290 253 222 206 206 218 240 268 293 305 305 299 292 282 270 264 274 296 319 331 331 322 314 318 333 353 366 367 365 366 372 383 396 406 405 395 383 376
9939 376 369 359 346 337 331 328 329 339 351 359 357 351 347 346 349 358 369 373 359 324 279 239 214 208 214 227 243 265 289 308 311 295 268 244 226 210 196 193 209 242 275 300 316
9921 316 325 325 318 312 315 328 345 365 383 391 384 369 351 329 298 268 255 268 292 314 329 339 347 351 349 341 324 302 278 258 244 237 238 244 245 238 226 216 214 217 220 219 210 199 196 209
9903 209 233 259 282 304 322 327 312 287 267 259 257 252 241 231 236 265 311 353 375 379 376 373 370 367 366 365 361 354 350 358 373 386 389 379 357 326 292 267 262 280 313 350 385 413
9885 413 434 446 448 440 422 394 363 336 317 307 308 315 325 333 335 334 333 332 331 328 325 323 325 333 350 369 382 385 381 372 360 344 328 316 308 303 301 305 312 320 328 334 336 333 326 316 307 299 294 294 300 313
9864 313 337 376 426 471 494 493 472 438 396 356 330 321 320 318 314 315 324 336 348 357 362 366 376 394 412 421 420 416 414 409 397 381 365 346 321 295 280 281 296 316 327 323 306
9847 306 284 265 254 255 268 287 304 323 349 382 410 418 407 386 361 337 319 315 321 322 310 292 278 275 283 297 311 318 317 312 308 307 308 308 306 296 284 281 299 331 364 387 399
9830 399 404 402 395 384 367 347 331 329 345 371 394 406 407 400 389 379 374 382 402 431 462 487 499 496 476 445 409 375 348 325 303 284 276 285 311 345 379 407 433 455
9814D55J3ok0k1rLPNMQJ3J6J2OJlrk1l3l9l6k2oQJ1Mpj1lQJ3J2Olj0rkNPPQJ0LkkLMjqlJ1
9793C77K2K5J7PKLOOMmj2k2k7k5j9j7j9j8rQK2K6J7Lpj0pJRJ2Rjj0j6j9k2j9j0OJ5Pqk1k0
9776B62j2kOPOKmpnMJ1J4QORJ7J5Mj2j9j0OJ8J9J4J3J4Oj0k4k1pMKoj8k7l0k7j7j1j2j4j2
9758A60JJ3K1K2K0J4Nqj9k4k0rKJ3J4Mj3k3k0rJJ0K0K6K2J2NJ1K0J8J0MJ1K6L8L7K7J5Nkj0
9742D50k0k5j9mNPKjmnooqlOJ8J6Kj5j9j5j0j0qkMQJ6K5L0K0Kj0rjJqk4l6l5k2jJ5K8L7M1
9723D07L3J5ok1k4j9j4qlKLkorqkRK0K6K7J8Plrj3j5j1MJ8K1QmkOR%qj1j7k8l5k7pJ2J8J6
9705C67J4J3J0QLlj0j1q%OJ0Q%qj2plpj5k1k2k1k0j3KJ5K5L1L5L6L0K3J2Lj0k3l4l8l9l7l0
9688B59j7jQJj8l0k5mJ6K4K3J8J5J3J6K5L6M0L2J7Jrj5j9j7j4nJLjqqlNNqk4k9k2j0kJOJ6
$$ plain form
9814 455 468 462 442 421 412 415 422 427 431 439 452 468 480 486 487 484 475 454 421 382 346 324 318 326 337 341 334 323 320 328 341 353 359 356 346 337 335 340 347 354 362 372 375 373 371 374 378 377 369 366 377
9793 377 399 424 441 448 450 453 459 465 469 465 453 431 404 379 360 343 324 306 297 305 327 353 370 373 366 356 349 350 359 371 380 379 369 353 334 312 293 283 289 304 311 303 282 262
9776 262 250 248 254 261 267 269 265 258 253 257 268 282 290 296 305 322 337 341 329 310 300 306 324 343 357 370 384 390 380 356 335 328 332 334 328 310 283 253 226 209 198 186 172 160
9758 160 161 174 195 217 237 251 256 248 229 205 185 176 178 191 205 209 196 173 153 144 145 155 175 201 223 235 240 251 271 289 299 303 314 340 378 415 442 457 462 460 450
9742 450 430 405 386 382 387 394 396 395 391 386 380 374 366 363 369 387 403 405 390 371 356 346 336 328 326 330 338 354 379 409 429 431 421 412 411 412 404 380 344 309 287 286 301 329 366 407
9723 407 440 455 449 428 404 385 371 363 360 362 365 363 357 348 340 338 347 367 393 420 438 445 442 433 420 405 394 398 416 437 445 441 439 445 454 454 446 435 418 390 355 328 321 333 351 367
9705 367 381 394 404 412 415 412 402 391 383 383 389 399 407 407 399 387 380 377 370 355 334 312 291 271 258 260 275 300 331 366 402 432 455 467 470 460 437 403 365 326 289 259
9688 259 242 241 249 250 232 202 177 173 189 213 236 254 269 282 298 323 359 399 431 448 449 440 425 406 389 375 370 371 374 373 365 357 354 359 364 356 332 303 281 271 269 270 276 292
9670B92K7L2L4K8J6kj1qMJ3J6J4Oqk3k8k5k5l0l4k7j4kQJ6J6J0OQJ1J0MJJMMJnj2j6j1%NK
9652C08nmLJ0J1QQJ3K1K6J7nk8l9l5k0pmmjMOM%kKRJ9K9L0J7Krj0oJJ1K0K1J2Mjmqj5j7j4
9634C78j5k0k6k4j8j0qj0j5j6j4qkLJ1K0K8L2K5J3Jkjkrj6j6j0lkpj2j2mPJ9K5K4J2oj9j4
9617B77KJ7K0J4Mj0k2k5j6lK%nmLPPJmrj3j0JJ2J3ROJ4K4K4J2komjjLONkopnoj0j5j8j8j6
9597B45j7k1k3j3OK3L1L6M0M0K9J3LMNjj2k1k8k8k5k0j5j4j3j2qjPJ3J4QKKJoj8k5k5j8pM
9580A55J3J8J8J7J7J4RJ1J6J7Qqj7j6j2rpJJ2J9K0J8J7J5J7J8J4NprlNRJ1J1J0Nlj0j6k0j8
9563C65j5j3qJJ1J1Jj4k3k3k0j4pLJ1J3J6J4J0JkMJ3K1K3J8Qnj3j1lkj0j6j6oPJ4J5Rjj3k4
9546C30k4j2LJ2J3J1J2J6J5Noj5j5j0mjjlJPJ0RQRQmj9k9k9k2j5j2j0j1j4j3jJ5K6L1K5J4
$$ plain form
9670 292 319 351 385 413 429 427 416 408 412 425 441 455 461 453 430 402 377 352 322 288 261 247 245 253 269 285 295 301 309 320 330 334 335 336 340 344 345 340 328 312 301 301 306 308
9652 308 303 299 302 312 323 331 339 352 373 399 416 411 383 344 309 289 282 278 274 273 277 283 287 287 285 287 296 315 344 374 391 393 384 374 368 369 380 400 421 433 437 436 432 424 409 392 378
9634 378 363 343 317 293 275 265 257 247 232 216 202 194 192 195 206 226 254 286 311 324 325 323 322 320 311 295 279 269 266 264 257 245 233 229 236 255 280 304 316 310 291 277
9617 277 279 296 316 330 334 324 302 277 261 258 260 260 255 251 254 261 268 269 265 256 243 233 234 246 259 268 274 288 312 336 348 346 340 336 335 334 337 343 348 346 340 333 328 322 312 297 279 261 245
9597 245 228 207 184 171 177 200 231 267 307 347 376 389 392 396 401 400 388 367 339 311 286 266 251 237 224 212 204 203 210 223 237 245 247 249 250 244 226 201 176 158 151 155
9580 155 168 186 204 221 238 252 261 272 288 305 313 305 288 272 260 251 244 245 257 276 296 314 331 346 363 381 395 400 393 384 381 386 395 406 417 427 432 429 419 403 383 365
9563 365 350 337 329 330 341 352 353 339 316 293 273 259 252 255 266 279 295 309 319 320 318 322 335 356 379 397 405 400 387 376 373 371 361 345 329 323 330 344 359 368 367 354 330
9546 330 306 294 297 309 322 333 345 361 376 381 375 360 345 335 331 330 329 326 327 334 344 353 361 370 378 374 355 326 297 275 260 248 238 227 213 200 199 214 240 271 296 310
9529C10jj0j1nLPJ1J3Oqk2k1oJ3K1J7jk0k5j1RK6L1L0K2Rmj3j2j0njLKkpmLJ2J6J3Lj0j7j3
9511C41mLKjjKKJLQRjj6k4k1j0kMONLKLM%%QJ3Oj1k1j6%J6K7K6J0j2k2j3LJ4J6J6J9J8Poj3
9491D03r%J1K1K9L8L9K5kk8l3k2mPJ2J5J5J1Lqk1l3l7k8j4jNNMJKOJ2J2Q%lnrj3j7j7j4j0
9474C56lPJ2J3Q%rj9k9l5l3k1nRJ1%j4j7oPJ5J4J3J1Npj6k1j8rMK3L8L8K6J2%pj5k4k7j8%
9456B69J7K7K6J9J1ORJ3J8J5Ppj8k1j2LJ1Nj1k5k9l1l3l3k0NK9M1M1L2K4K0J4Lrk1k3k0j1
9441C41lMQPOMOQPOMMMNNOOLlj5k8l6l7l0j9kJ3K6K8J9PNJ1J7J6MorpopqoKJ0J7J1nk2l2k7
9420C12j3%M%mnnkKRJ6J6J1PQJ4J8K2K5K1PkJJ7K6J9lk3l6m4m4l5k0oMJ1J1Lpj0jQQMLPJ1
9401C65RM%oj2j5j3j4j8j6%J8K3J2JlKMKMJ0J9K4K3J0pk5l0k1oLPQQOkj0j2j2j0j4k0k3j7
$$ plain form
9529 310 309 299 288 283 286 293 304 317 323 315 293 272 266 279 300 317 316 296 271 260 269 295 326 356 378 387 383 370 358 348 343 342 345 347 345 338 334 337 349 365 378 381 371 354 341
9511 341 337 340 342 341 340 342 344 345 348 356 365 364 348 324 303 293 291 295 301 306 309 311 314 318 318 318 326 339 345 334 313 297 297 313 340 366 376 364 342 329 332 346 362 378 397 415 422 416 403
9491 403 394 394 405 426 455 493 532 557 555 527 494 472 468 475 487 502 517 528 531 523 502 469 432 404 390 389 394 399 403 404 406 412 424 436 444 444 441 436 427 414 397 380 366 356
9474 356 353 360 372 385 393 393 384 365 336 301 268 247 242 251 262 262 248 231 225 232 247 261 274 285 290 283 267 246 228 219 223 246 284 322 348 360 360 353 338 314 287 269 269
9456 269 286 313 339 358 369 375 384 397 415 430 437 430 412 391 379 382 393 398 387 362 333 302 269 236 216 221 250 291 332 364 388 408 422 425 416 395 372 352 341
9441 341 338 342 350 357 363 367 373 381 388 394 398 402 406 411 416 422 428 431 428 413 385 349 312 282 263 261 274 300 328 347 354 359 370 387 403 407 401 392 385 379 372 364 358 360 370 387 398 393 371 339 312
9420 312 299 299 303 303 299 294 289 287 289 298 314 330 341 348 356 370 388 410 435 456 463 461 462 479 505 524 521 498 462 418 374 339 319 313 317 328 339 342 335 325 324 332 340 344 347 354 365
9401 365 374 378 378 372 360 345 332 318 300 284 284 302 325 337 338 335 337 341 343 347 357 376 400 423 433 426 401 371 350 344 347 354 362 370 376 374 364 352 340 330 316 296 273 256
9384B56%K4M2M3L0J0qk1k5j8mJ2J7J2jj0j9k4k8k6j3PJ8J4JqpmJJ2K2K1Mj4j9j0pj4k2j4O
9367B36L0M1L7J8kj5j7j1qprj0rkPJ3J1Mpj3j4pKQQQRJ1J0L%LJ3K3K4Qj3k9l2k8k2j4lRJ7
9349B81J9K3K5J7Kj1j4qnkKNPKoj3j3qlKLjl%PJ2J0M%MQMllNJ3J3Mqj5j5pLQLrk1j8mJ4K1
9329C31J7OKJkj1k0k3j7ronmjLKJ%K%oj3j1%J3K2K5K5K9L4L5K6J4%j0j5j7j6j2ollnmJQR%
9309C87j8l1l1k2j2nMQLmmNJ1J1Mnj3j6rJ4L6M4L8K4J2%onkjkmnj0j1nJJkJPJ0J0J1J8J8J1
9291D66jj0j5k1k4k4k3k3k0j0JNPJ3K2K3J5PJ1K4L2K4%k4l5l1k9l3l4k7j7j3j6j7j0%PJ6K3
9275B39K7K7K3J7J1Joj2j6j8j8j3rmJPNknmLOQPLmrjJ5K3K0J2NQJ4K2J9Pj0j6pPJ4J1jj8l1
9256C58l3k0kJ0J0Llj0j1qlk%MJ2J7K0K0K3K2J7J0J%MRPmj4j1JOlj4j7j7j9k4k1qMRPMJJM
$$ plain form
9384 256 256 280 322 365 395 405 397 376 351 333 329 341 358 370 369 359 340 316 288 262 249 256 274 288 289 281 274 270 271 283 305 326 330 316 297 287 280 266 244 230 236
9367 236 266 307 344 362 360 345 328 317 309 302 293 283 274 272 279 292 303 307 300 287 273 266 268 276 284 292 301 312 322 325 325 328 341 364 388 396 383 354 322 294 272 258 255 264 281
9349 281 300 323 348 365 367 356 342 334 329 327 329 334 341 343 337 324 311 303 300 302 305 304 301 301 308 320 330 334 334 338 346 350 347 344 349 362 375 379 371 356 341 334 337 345 348 339 318 300 296 310 331
9329 331 348 354 356 357 355 344 324 301 284 275 269 264 260 259 262 264 265 265 267 267 261 248 237 237 250 272 297 322 351 385 420 446 460 460 450 435 418 402 390 384 381 378 373 369 370 378 387 387
9309 387 369 338 307 285 273 268 272 280 283 279 275 280 291 302 306 301 288 272 263 277 313 357 395 419 431 431 425 420 418 417 415 411 406 396 385 380 381 382 380 381 388 398 408 419 437 455 466
9291 466 465 455 440 419 395 371 348 325 305 295 296 301 308 321 343 366 381 388 399 423 455 479 479 455 420 389 360 327 293 266 249 236 220 203 193 193 200 216 239
9275 239 266 293 316 333 344 345 339 327 311 293 275 262 253 249 250 257 262 260 255 251 254 260 268 275 278 274 265 264 279 302 322 334 339 347 361 383 402 409 399 383 376 383 397 408 407 389 358
9256 358 325 305 303 313 323 326 323 313 302 294 291 289 289 293 305 322 342 362 385 407 424 434 435 435 439 448 455 451 437 426 427 433 430 416 399 382 363 339 318 310 314 323 330 334 335 336 340
9237C40J0J3J2Mnj3j3j0qqnKPLnolknqpj1j8k2j2LQMljOJ4J1KpnLQQRJ6K0J2KMJ3J8J5J3J4
9217D17J4J1J2K0K4K1J1jj6l9o0o6n6l8k0pKMKjkpqpljjLPQMNJ4K1K0J6K2K8K7J5Llj2k6m0
9199C17l8k5j2rj1j0plNJ8K9L1K2J0jrrlNJ1J1J2RMknoj4k1k5k0j4j2rkNNLOJ5K2K2J6Pkl
9181C13lj0k4k9j7PJ7J0kjPJ2J1OKmj1j6j9j4qkmqqMJ9L2M1M4M2L4J9Onokkj4l4m4l4j9rk
9163B75J2K2K1Mj4k2k8k8k3rOJ8K9L8L3J3qj5pkj0k4l1k6j2NK1K9L0K3J5PJk%KLJnj3j7j6
9146B96j0jRJ4J8J9K1K1J5Lqj4j5j6j6j6j0LK1L3K9Qj3j7pOQMjj1k9m7m8k9pPQPJ1J3J4J8
9129B91K4K7K7K3J9J0lj2j0mjmj3k1k9k5oJ7L1K7J3kj3k1k4k0j2nmlkKRJ5J5Qjj0j4j6j3p
9112B63KJ0J9L0M2M6L5J8Lmpolkoj6k9l4k4qNMnj0kRJ5J4J0MJjlkj%JJKMLoj3j2MK1K5J5m
$$ plain form
9237 340 350 363 375 379 374 361 348 338 330 322 317 319 326 329 324 318 315 313 308 300 293 282 264 242 230 233 241 245 242 241 247 261 272 274 267 262 265 273 281 290 306 326 338 340 344 357 375 390 403 417
9217 417 431 442 454 474 498 519 530 529 513 474 414 348 292 254 234 227 229 233 235 234 232 225 217 210 207 206 205 208 215 223 227 232 246 267 287 303 325 353 380 395 398 395 383 357 317
9199 317 279 254 242 233 222 212 205 202 207 225 254 285 307 317 316 307 298 295 300 311 322 334 343 347 345 340 334 320 299 274 254 240 228 219 217 222 227 230 236 251 273 295 311 318 316 313
9181 313 310 300 276 247 230 237 254 264 262 261 268 280 291 297 299 295 284 268 249 235 227 225 221 213 205 209 228 260 301 345 387 421 440 446 441 435 433 431 417 383 339 305 286 277 275
9163 275 287 309 330 334 320 298 270 242 219 210 216 234 263 301 334 347 339 324 317 315 305 281 250 224 212 217 238 267 297 320 335 342 343 341 341 343 346 347 342 329 312 296
9146 296 286 285 294 308 326 345 366 387 402 405 397 383 368 352 336 320 310 313 334 367 396 404 391 374 367 373 381 385 384 373 344 297 249 220 213 220 228 235 246 259 273 291
9129 291 315 342 369 392 411 421 418 406 396 392 391 387 374 353 324 299 293 310 341 368 381 379 366 345 321 301 289 284 280 277 275 277 286 301 316 324 323 313 299 283 270 263
9112 263 265 275 294 324 366 412 447 465 468 464 457 451 448 446 440 424 395 361 337 329 334 338 333 323 321 330 345 359 369 373 374 373 370 368 367 367 368 369 371 375 378 372 359 347 351 372 397 412 408
9092D08j8k7k8k0rlmproJPJ1RPMNKknprj2j1mOQJj2k8l7l2j5jJkjJ0K0K4L0M1M9M4K8Ppj5
9073C92j7j4oLJ0Rjj2j9j5rpj1j6j9k0j7rjLLNJ2J8K1K4K7K4J5J0PLqj2pMP%onjKLkj2k3k5
9054C08j8j4j7j8j5p%LQJ8K2K2J6J0M%oj2j8j7mQJ2MooJRJ2J0MJMRRMJNJ9K6K3J0nqonmnl
9034C88lpqmNJ1J5K2K8K4Qrj4j0j0j9k6k4j2%Lkj3k2k4j1J1K9L1K3J1Mlj1j2lJ3J9J3Klln
9017D02pomoj1j0jPRPOMjqj8k7l2k4pQPmmJ1K5K4J2NQJ6J6Pnj3j3j3j1j1j0oopqonj1k3k9
8998B27k3j0JOJ1J9K6K6K4J8QkqpJMkj0r%J1J9K1J9J2Jopjjrj8j9j2JRJ1Npk7m1l9k1%J0Q
8979B19KKPOlj4j2MK0K7K4K4K4K0J0Jllorj0pnLJ6L2M0L2J3lronj5k8l7l3j9mKKklk%Jkmn
8960B82pj2j4pKJ0QJmoqrkJ1K4L5M5N2M9L5K1Rjj7l2l8l1k3j6nQJ7J5Mqk0l3l6k5kK2L6L8
$$ plain form
9092 408 390 363 335 315 306 303 299 292 283 277 278 285 296 305 312 316 321 323 321 316 309 300 288 277 273 279 287 288 276 248 211 179 164 163 164 162 161 171 191 215 245 286 335 379 407 414 407 392
9073 392 375 361 355 358 368 377 376 364 345 330 321 314 303 287 268 248 231 222 221 224 227 232 244 262 283 307 334 358 373 383 390 393 385 373 366 370 377 377 371 366 365 367 370 368 356 333 308
9054 308 290 276 259 241 226 219 219 222 230 248 270 292 308 318 322 322 316 304 286 269 265 273 285 289 283 277 278 287 299 309 313 314 318 327 336 340 341 346 365 391 414 424 419 411 405 400 396 391 388
9034 388 385 378 370 366 371 382 397 419 447 471 479 470 456 446 436 417 391 367 355 355 358 356 343 321 297 286 297 326 357 380 391 395 392 381 369 366 379 398 411 413 410 407 402
9017 402 395 389 385 379 368 358 357 364 373 380 386 390 389 381 363 336 304 280 273 281 288 284 280 291 316 340 352 357 365 381 397 404 399 386 373 360 349 338 328 322 316 309 301 295 290 279 256 227
8998 227 204 194 195 201 212 231 257 283 307 325 333 331 323 316 317 321 319 309 300 300 311 330 351 370 382 383 377 370 369 368 359 341 322 310 311 320 331 336 329 302 261 222 201 201 211 219
8979 219 221 223 230 236 233 219 207 211 231 258 282 306 330 350 360 361 358 355 349 340 330 323 318 321 337 369 409 441 454 451 442 436 431 416 388 351 318 299 295 297 299 297 294 292 292 293 291 287 282
8960 282 275 263 249 242 244 254 262 263 259 253 245 236 234 245 269 304 349 401 450 485 506 515 514 497 465 427 396 373 357 352 360 377 392 396 388 368 335 299 274 272 294 330 368
8942C68K6Oj5k8k9k1j0PK5L6L7K7J2Lkpj7l2l8l0j3LMjolJkoj1pKJ2J7J6Oj0k5l0j9%J1On
8925B58j0lONnj4j2nJkqj0qm%KMPQRJ0RKj0j9j8lJ3K1J8Poj9k7k2rJkj3j8j3mLQPJj0j1LK3
8905A41L4K8J4NNJ0J0OKLRJ3J8K0J7RLLOPkj4k6l3l6l4k7j6mQJ9K4K2J6J6K2K7K3J2lj8k5
8888C14k1oORRRJ4J4QjqoLJ4K1J6Kqp%%oj5k0k6k8k1lJ7K2J7RQOJj1k0k2j5kJ1J5Qmrolpj3
8868B65j4qmnrq%QJ3J2J2J3J0jj5k3k3j7qk%jJOJ5J8J7J8J8J5O%%NQPON%j1k1k2j2k%lm%K
8849B67J%jqj5j3jJ2J4OMRJ2RJnpkPJ5J6J1J2J9K4K4K3K0J0j0k8l6l3k7k0qNROlnkKOOLlj3
8829C13k5l1k6oJ0J7J0kj2j7j8j1MJ7K4K2J4PNNLj%J2K1J7LnmK%orqopj0j2j4j1mLJlnKJ3
8810B72K0J7QJkoj4k0k3k1j8j0MK0K8K1Mj3k5l2k9j4OJ9K0J7J4J0MmmLPOJ0K2L7M4L4J7Kq
$$ plain form
8942 368 394 400 385 357 328 307 297 304 329 365 402 429 441 444 442 435 418 386 348 318 305 308 312 311 305 302 303 301 295 284 277 279 291 308 324 330 320 295 265 246 246 257 263 258
8925 258 248 245 251 256 251 237 225 220 221 219 211 201 193 189 189 191 195 202 210 219 229 238 240 230 211 193 190 203 224 242 249 243 224 197 175 166 167 165 152 134 121 117 120 128 135 136 126 115 118 141
8905 141 175 203 217 222 227 237 247 253 255 258 267 280 298 318 335 344 347 350 356 363 361 347 321 288 252 218 191 175 171 179 198 222 244 260 276 298 325 348 360 357 339 314
8888 314 293 287 293 302 311 320 334 348 356 355 347 341 344 358 379 395 397 389 382 382 382 376 361 341 315 287 266 263 280 302 319 328 336 342 343 332 312 290 275 273 284 299 307 303 294 288 285 278 265
8868 265 251 243 239 234 225 217 217 225 238 250 262 275 285 284 269 246 223 206 198 196 196 195 196 202 217 235 252 270 288 303 309 309 309 314 322 329 335 340 340 329 308 286 274 272 272 269 265 265 267
8849 267 268 268 267 259 244 231 230 242 256 262 266 275 287 296 297 292 285 283 290 305 321 332 344 363 387 411 434 454 464 454 426 390 357 330 310 302 307 316 322 319 314 312 314 320 326 329 326 313
8829 313 288 257 231 225 235 252 262 260 248 231 213 202 206 223 247 269 283 290 295 300 303 302 302 314 335 352 355 350 346 348 348 342 333 325 319 312 302 290 276 265 261 264 265 262 257 259 272
8810 272 292 309 317 318 316 310 296 276 253 232 214 204 208 228 256 277 281 268 243 211 182 168 174 193 213 230 244 254 258 254 250 253 260 266 276 298 335 379 413 430 432 424
8793D24j6k3k5j5LJ8K5J4nk0k4k4k8l6l8k8j1OJ6J9J8J6J5J2Lqj4j0KJ1J3J0QKpk0k3j2OJ5
8777B69J1jnpj0j5j2lLLNRPjonkkJJ4L0L8L0J4mj7k5k5k3k1j8nJ2K2J9Ork3l0k3j0OJ6K3K4
8759B60J8QNRJ4J4J0Mmj5l0l8l4k2qLRJ2J6J6J2N%mj2k1k1j2jNQJ5K4K8J8Lj2j8j3jJ0J0K
8742B72prjQPlj5k1k0j5pkkqj1mQJ5J4NnroKJ5K0J6Npj7k1j9j1kNPOMOJ5K5K6J6Moj1qNJ7
8722B76J9PjKJ1J6J6J7J5Jj7k6k0pj%%%j%J%npJJ1J6J3QMJoj5k2k4j7qlmrqonmjQK0K6K6K5
8702C23K2J5%j8k7j9nOJ1RRQNJlnkLOOMLlj4k5k7k0j5j6k3k7k3j5nNJ5J9K1K0J9J5Pnj6k1
8684B18j9j4qjMOKnpLJ9L5M0L5K1Lj3k2j5nJnj4j4kJ1J3NnqpkKKklLJ4K2K7K9K9J7ql2l7k4
8665B89pkjJRK0L0L5L0J7Lj0k1k6k5j5opj3k1k1j7qKQJ5K2K5J6ok5l0k2j5j2pLJ5K2K3J9J1
$$ plain form
8793 424 408 385 360 345 348 366 391 405 400 380 356 332 304 268 230 202 191 197 213 232 250 266 281 293 296 288 274 264 266 277 290 300 308 310 303 283 260 248 254 269
8777 269 280 279 274 267 257 242 230 227 230 233 238 247 254 253 247 242 240 238 239 253 283 321 351 365 361 344 319 294 271 250 232 227 239 261 280 286 277 254 224 201 191 197 213 236 260
8759 260 278 286 291 300 314 328 338 342 338 323 293 255 221 199 191 194 203 215 231 247 259 264 264 260 248 227 206 194 193 198 206 221 245 273 291 294 282 264 251 250 260 270 272
8742 272 265 256 255 263 270 267 252 231 211 196 189 187 185 177 166 162 170 185 199 204 199 190 184 186 201 221 237 242 235 218 197 178 167 165 170 177 183 187 193 208 233 259 275 279 273 262 254 259 276
8722 276 295 302 301 303 314 330 346 363 378 379 362 336 316 309 308 308 308 308 307 307 308 308 303 296 297 308 324 337 345 349 350 344 329 307 283 266 258 255 251 242 234 228 223 219 218 226 246 272 298 323
8702 323 345 360 360 342 315 296 291 297 308 317 326 334 339 340 337 332 330 333 339 345 349 352 349 335 310 283 263 248 232 209 182 159 144 139 144 159 178 199 219 238 253 260 255 239 218
8684 218 199 185 177 176 180 186 188 183 176 179 198 233 273 308 329 332 319 297 282 277 278 273 259 245 243 254 267 272 267 259 252 250 252 254 252 249 252 266 288 315 344 373 390 382 350 313 289
8665 289 282 280 279 280 289 309 339 374 404 421 424 414 393 367 342 327 321 314 301 280 259 242 234 236 244 259 281 306 322 316 291 261 239 224 212 205 208 223 245 268 287 298
8649B98Klklqj9k2j8pNJ6K2K6K3J5PKmrj5j9j8j3pLJ9L7M5L9K5J2Jj1k3l2l4k9j9kJ6K5K2
8632C43Qok0k8k9l0k8l0k7k0mJ5L3M4M3L1J6Krk0l1l6k7rJ0J9K2K2K0J8J8K6L3K8J5MMNjj6
8616D08k7k8k3j7j2pKJ4K5K5J2oj4rjL%qj6k0k0j3JJ5K4J7kk1k7k2j5pJJ3J9J6PMQJ2J4J6
8599C41J6J3QOJ0J6K0J8J2Kqj0qnnrj7k5k4j0OJ6J5J3J4J4R%orj5k7m0m3l1j4%MJknj0j7j7
8581A97qPK1K9K5Rj2k3j9kJ3J6J0LJRJ5J2jj4j7j1lNJ5J8J2jqpJKJloomlmqrrrj4j8j6%K0
8562B06L6M0K8J3Kj%MPJ1RMnj2j5j2mQJ7J7Nj3k8l3k4j0jpj9k4j4PK2K4J7Q%kjJjnkJ2K6K3
8543C14Prj3qm%PJ4K1K4K4J8Lj6k5k6j9j1mNJ9L2L9L7K6J5Q%j5l0l6l2k6k0j9k0k5k8k5j0
8527A92OK3L4L5K5J1QJ8K6K1Pqj5j7j0%Nlj7k8k9k6j9j0MJ7L2M3M8M6L8L1K2Lk1l7l9k8j3
$$ plain form
8649 298 300 297 295 292 284 265 243 225 218 223 239 261 287 310 325 332 334 330 321 306 287 269 256 249 252 271 308 353 392 417 429 430 419 396 364 330 301 282 280 296 321 343
8632 343 351 345 325 297 268 238 210 180 153 133 129 144 177 221 264 295 311 313 304 284 253 217 190 181 191 210 232 254 274 292 310 336 369 397 412 416 420 425 424 408
8616 408 381 353 330 313 301 294 296 310 335 360 372 366 352 343 342 345 345 337 321 301 281 268 269 284 308 325 323 302 275 253 238 231 232 245 264 280 287 291 299 311 325 341
8599 341 357 370 378 384 394 410 430 448 460 462 454 444 436 431 426 417 400 375 351 341 347 363 378 391 405 419 428 428 422 413 398 371 331 288 257 243 243 247 248 246 241 231 214 197
8581 197 189 196 217 246 271 280 268 245 226 224 237 253 263 266 267 276 291 303 302 288 271 260 257 262 277 295 307 306 298 291 292 294 295 292 286 280 276 273 269 261 252 243 234 220 202 186 186 206
8562 206 242 282 310 323 325 324 324 328 335 346 355 359 354 342 327 315 311 319 336 353 358 345 317 284 260 250 249 242 223 199 185 192 214 238 255 263 263 261 260 261 260 255 253 265 291 314
8543 314 321 312 299 291 287 287 294 308 329 353 377 395 398 382 357 331 312 301 297 302 321 353 392 429 455 470 478 478 463 433 397 365 339 319 300 280 255 227 202 192
8527 192 198 221 255 290 315 326 334 352 378 399 406 398 383 366 356 356 361 358 341 313 284 258 239 229 233 250 282 325 373 419 457 488 510 513 492 455 416 388 375
8512C75PK8M4M6L0J0kopj5k1k1j0JLJkkqj4j8j0JJ0Rjj2j9j0NJ8K1J4Nnj3j8j7j7j6j9k4l4
8494B87m1m2l4j7LK0L1L6L6L3K6J0oj6j3mORNpj8j7lJ9K9K2Lj5j6lRJ3RPRJ2Qmj7k8l3l0k1
8477B57j4nRK8L5K1%j3j0nj0k1k9l0k4j6oJ0K1K6J8PLOJ2J2J3J7K1J8Nj0j6j4j2j0j0j2j4
8461B58j3jJ5K8K6J7PLMKknJJ3K3K3J6PLjnqj0j0j4k0k4j8lJ3K5K9K5J9Qjj0j2j2j3j5j7j6
8444C35j1qj1j4rJRJ2J5K5L6L7K3Lj2j0%PNnj9l1m0l9k9j6j0j0rlKKJ%NRJ1J1J0Okj1j4j1
8426B41onokPK1L0L0K5J4KooJQQPPOJj0j6j8k0k1j8qLJ1J0POPNlj3k2k5k1j5j4j2qJJ4K2K3
8408B42J7J2J1J3J0Lkkkqj7j8rNJ7K7K9K4J3MJKNRJ2J0kj4k2k5k7l2k6j1LOlj6k3k4j5jJ4
8390A90K5K5J1oj8j6lJ1K0J6Pnj3j1lQJ6J9K0K3K4K3J5QPQRJ2J3J6J9J9J7J2Jj7l5m3l7k2
$$ plain form
8512 375 382 410 454 500 530 540 538 532 525 510 489 468 458 459 462 463 461 459 451 437 419 409 410 420 429 428 416 397 387 392 410 431 445 450 445 432 414 397 380 364 345 321 287
8494 287 246 204 170 153 156 176 207 243 279 312 338 348 342 326 313 309 315 324 329 322 304 287 284 303 332 354 357 342 326 323 332 345 354 361 370 382 390 386 369 341 308 278 257
8477 257 243 238 247 275 310 331 331 318 308 303 293 272 243 213 189 173 167 177 198 224 242 249 252 258 270 282 295 312 333 351 356 346 330 316 304 294 284 272 258
8461 258 245 244 259 287 313 330 337 340 344 346 344 339 340 353 376 399 415 422 425 424 419 411 401 391 377 357 333 315 312 325 350 379 404 423 431 430 420 408 396 383 368 351 335
8444 335 324 316 305 291 282 283 292 304 319 344 380 417 440 443 431 421 421 428 433 428 409 378 338 299 270 254 244 234 225 222 224 226 227 227 232 241 252 263 273 279 277 266 252 241
8426 241 235 230 224 222 229 250 280 310 335 349 351 345 339 340 348 356 363 370 376 377 367 351 333 313 292 274 266 269 280 290 297 303 310 315 312 299 277 252 231 216 202 190 182 183 197 219 242
8408 242 259 271 282 295 305 308 306 304 302 294 277 259 250 255 272 299 328 352 365 369 370 372 377 386 398 408 406 392 370 345 318 286 260 249 252 258 255 239 216 192 177 176 190
8390 190 215 240 251 245 227 211 208 219 239 255 262 257 244 233 230 238 254 273 293 316 340 363 378 386 393 401 410 422 435 451 470 489 506 518 519 502 467 424 387 365
8374C65pJJJ%KLKKlnjQJ6J4Jj1j4j0j1j8k7l1l2l3k6mK7N1N4L8K0NmnJQPJmnkMJ5K8L6K9R
8355D96j0k0j9rLJ0J1Lj0k1k7k5k0j8j8j9j7j2oJJ3K6L1K4Rpj6j6qKPjj7l0l0k0rljmrj2r
8338A93nJJMRJ5J9K3K6K1Qlmmj1j5kJ9K9J6pk1k1j7j3j0mMJ7L1M1L6J9Koj1j2j3j0mLOPMM
8320C65RJ3J2N%jkj1k5l5l6k9j8nNJ1J1Qjj3k4k5j3NJ5K0K2K2J5lj7j8rlLJ5K8K7J1ooMJ4
8302C40J7J9K0J5Mllnj6k6k3j5j8l3m4l5j0J2J4Lpj3j7k2j6MK7L5K9J8J4J3J4J4J8J9J4Mk
8287C59jOJ6J8Oj2k6l2l4l7l3k1jJ7L0L4K5Qj4k4k7k2j4mJJk%QJ9K8L4L7L0J6mj9k6j9kJ5
8270C34J7J1N%j2k5k5qJ4K2J2Jl%OJ1J4J0jj5k7l6l5k1jRPkqojOJ2J9K1J5jk0l4l3k0olj0
8253A93j9k0j6q%OJ0J5J7K0K3K3K0J0Jll%MJ0J4J2%j1rKJ0QKmomjLKjllKPJ6K4K4J6MkmjJ
$$ plain form
8374 365 358 359 360 361 361 363 366 368 370 367 362 361 369 385 399 400 389 375 365 354 336 309 278 246 213 187 183 210 261 315 353 373 378 374 369 370 378 385 386 382 377 375 379 394 422 458 487 496
8355 496 486 466 447 438 441 451 462 465 455 434 407 382 362 344 326 307 290 278 272 273 286 312 343 367 376 369 353 337 329 331 338 337 320 290 260 240 231 228 227 223 214 202 193
8338 193 188 189 190 194 203 218 237 260 286 307 315 312 308 304 293 278 276 295 324 340 333 312 291 274 261 251 247 251 268 299 340 376 395 397 391 380 368 355 345 341 344 350 357 361 365
8320 365 374 387 399 404 404 403 401 390 365 330 294 265 247 242 247 258 269 277 276 263 239 214 201 206 221 241 263 285 300 297 280 262 253 250 253 268 296 323 334 328 322 326 340
8302 340 357 376 396 411 415 412 409 404 388 362 339 324 306 273 229 194 184 196 210 213 206 193 176 154 138 142 169 204 233 251 265 278 292 306 324 343 357 361 359
8287 359 358 364 380 398 404 392 366 334 300 263 230 209 208 225 255 289 314 322 308 284 257 235 221 217 218 219 217 217 225 244 272 306 343 373 389 385 366 340 321 319 334
8270 334 351 362 367 367 355 330 305 297 311 333 345 346 343 343 349 360 374 384 383 368 341 305 270 249 248 257 264 262 254 248 247 253 265 284 305 320 319 299 265 232 212 206 203 193
8253 193 174 154 138 130 130 136 146 161 178 198 221 244 264 274 275 272 269 269 273 283 297 309 309 298 289 291 301 309 311 307 301 297 296 299 301 300 297 294 296 303 319 343 367 383 387 385 381 380 381
8233C81KLMOJ0J3J1Kqj7k0k1k0j3kRJ5J2Lll%jnj5k6l4l2k0p%NJ5K5L0K6J9J4J0NKKL%nrj7
8214C49l2m0l1qJ1J3Mpj2j3j0jJ1K1K2K1K2K8L3L0J5%pmNJ0J3RKj1j6j2opj9l0k6j1LOLjK
8197C29OOJqj5j6j0nmqj2j5j4j2plnj0j5j7j2mOJ1J3J4J7K2J6kk2l2k6j4kQJ3J3Plrj4j6j2
8179A38kJ5K8K7J7OLQJ9L0L5K7J0j1k1j4KJ5J7Qlj0j1lPOoj9k2qQJ6Oj2k6k8k4k0j7oJ7M0
8162B42M8L8K1Nrj7j5mOQNJmj6k8l4k9k0j2mJ0K0K2J7J5K1K7K7J9J0Kqk0k6j9qoj4k4k7j8
8146B02ompj1j0mNJ1J8K4K6K4J6Onj0pOK0K9K8J9J0NMLJlrj3j2mNRKj2k3k7k6k5k5k3j6mL
8128A90MNJ2K4L2L0K4K1K2K3J8Prk4l4l6l5l1k3j4qkPK3L5L7K5J3J0J9L3M2L6J6mj3j4j3j8
8112D30k1j7j2oJJ1J7J6J0OLpk0k5k2j3lRK2K9K5J6J0RJ0Pkrj6k1k5k3j4MJ4J0mj6j6j1m%
$$ plain form
8233 381 383 386 390 396 406 419 430 432 424 407 387 366 346 333 331 340 355 367 370 367 364 364 363 358 343 317 283 251 231 224 224 229 244 269 299 325 344 358 368 373 375 377 380 380 375 366 349
8214 349 317 277 246 238 249 262 266 259 247 234 224 223 234 255 277 298 320 348 381 411 426 426 419 415 420 430 443 452 454 443 427 415 409 402 383 353 327 316 319 325 328 327 329
8197 329 335 341 342 334 319 303 293 288 284 276 264 249 235 223 216 213 208 198 183 166 154 150 156 167 180 194 211 233 249 247 225 193 167 153 151 159 172 185 192 189 180 166 150 138
8179 138 136 151 179 206 223 229 232 240 259 289 324 351 361 350 329 315 317 332 349 357 354 344 333 330 337 343 337 318 296 288 296 312 318 306 280 252 228 208 191 185 202 242
8162 242 290 328 349 354 345 328 313 309 315 323 328 329 325 309 281 247 218 198 186 182 192 212 234 251 266 287 314 341 360 370 372 364 344 318 299 291 285 271 247 220 202
8146 202 196 192 185 174 164 160 165 176 194 218 244 268 284 290 285 275 268 274 294 323 351 370 380 385 389 392 393 390 381 368 356 352 357 366 368 356 333 306 280 255 230 207 191 187 190
8128 190 194 199 211 235 267 297 321 342 364 387 405 412 403 379 345 309 274 243 220 206 198 196 203 226 261 298 323 336 346 365 398 440 476 492 488 475 461 448 430
8112 430 409 392 380 374 375 386 403 419 429 435 438 431 411 386 364 351 348 357 379 408 433 449 459 468 478 485 483 474 458 437 412 389 375 379 393 403 399 383 367 356 352 352
8095C52K%qj5j9j9j5pOJ6J9J3PKKMQJ0Moj2j1ompnLJ4J8J3Nkk%%nj3j9j9j8j3pmkkJOQQRJ2
8075C02J3J5J3J0lj7k6k1j1pj0j1qnomPJ8K3J9J3MlnNK0K9K8J5lj8j9nJ1J7J2ONMK%MOLkl
8056D17%NLmj4k4l3l7l6l3k6k1j6pQK2L1L3K8K1J1%orlPJ8K3J3nj7j8qMJ5K2J7Mj1j8j8j5
8039C23rklj2j9j8j0mmj0j5j6j1JJ0RLj%JLPJ2J1%j0qLJ5K0J9J8J4Pnj8k4k1j1k%%KPJ4K3
8021B89L3M5N0M7L0J1nj7k5k8k2j2qj3j6pMQMNJ2J5Oqj7j9j5mPQnk0k9k5j7pKRJ0RQJ1J5J4
8003C33RJl%LNNPQNjrj3j2qlLNNQJ2J2O%mkLJ0K1K2Rj1k2k1j1lKJ0J7K0Oj6l4l4k0mOQJ0O
7983C46koKJ6K4K4K3K4K1J2kj5k7l3k7j2%Jrj8k1j7j1pnJJ3K8L8L2J3pj8j7j4j2j1oMJ2J3
7967C50PKkmnoj2j9k6k5j6pkKJlnlJJmnLRJ0MLOJ0J6K2K4J9J2J3K1K4J5lj2j3j4k0k3j1J1
$$ plain form
8095 352 354 354 346 331 312 293 278 271 277 293 312 325 332 334 336 340 348 358 362 356 344 333 327 323 316 311 314 328 346 359 364 362 360 360 360 355 342 323 304 286 273 266 262 260 258 259 265 273 281 290 302
8075 302 315 330 343 353 350 333 307 286 275 268 258 247 239 234 228 224 231 249 272 291 304 308 305 300 305 325 354 382 397 394 376 357 352 363 380 392 398 403 407 409 409 413 419 422 420 417
8056 417 417 422 425 421 407 383 350 313 277 244 218 197 181 174 182 204 235 268 296 317 328 328 322 313 310 317 335 358 371 366 349 331 323 327 342 364 381 385 374 356 338 323
8039 323 314 312 309 297 278 260 250 246 242 232 217 201 190 191 201 210 213 212 212 213 216 223 235 246 246 236 228 231 246 266 285 303 317 324 319 301 277 256 245 243 243 243 245 252 266 289
8021 289 322 367 417 464 494 505 500 483 458 430 408 396 388 375 359 352 356 364 368 373 385 400 406 398 381 362 347 343 350 358 353 333 304 279 262 255 257 266 276 285 293 304 319 333
8003 333 342 343 340 340 343 348 353 360 368 373 372 363 350 338 330 327 330 335 340 348 360 372 378 378 374 372 375 385 406 428 437 426 404 383 372 369 371 381 398 418 424 408 374 340 320 316 322 330 340 346
7983 346 344 338 340 356 380 404 427 451 472 484 482 467 440 407 380 368 368 369 360 342 321 304 293 286 281 282 295 323 361 393 406 399 381 364 350 338 327 321 325 337 350
7967 350 357 359 357 353 348 342 330 311 285 260 244 237 235 237 238 235 230 227 228 229 225 220 223 232 242 246 249 255 265 281 303 327 346 358 371 392 416 431 428 416 403 389 369 346 335 346
7948C46K8K7J4OJ0K3L1L2K8K2J3Nnj2k1k8l1k5qJ5L1L3J7kj4rNJ5J0jrj2j5k1k8l4m2m8m8
7933B98l6k0pjLK%KJ6L3L9K8J1JJMRJ2R%prljjorj3j7j9j7j2jQJ4J5J5J4J1Noj4j6pJ0J9J3
7914C70kpOK4L3K4RkoqomkjklmjJoj7k6k4j5nlmj1j3lJ2K6K6J5Jrj6j9k0k0k0j3mNNjj0j5
7894B35j1JJ1J2KnKJ5K1J8RMKLJ0J9K7K7K0Qnj5k3k7k8k0kJ7K2J6QMLjj0j4j8k0k1j5nQJ7
7877C01K2K5L1L0K3Oorm%Jmqj3j4j3j2j2pQK5K8J4oj8k1j9j5qkLPJ4J8J5QMKklkOJ3Qoj5j2
7858C81OK5K8J5jrj0qnPJ8K1J1jprj2j5j0JJ3J7J7J3Qmj8k4j9q%KMNLmnjMRJ4J6J2LmLJ8K9
7839E29K7J5lj8k8l1l0k8k5j8oPJ7J8Mj2j3NK7L4K8K4K9L5K9J5Lmj1j6j8j9j7j7j6qOJ4J0
7823E38LLK0L9M5L4J4lj2j4j5j8j7pQK3L0K9K2J3LJQJ6K0J9K0K2K0RkolLLJJMORJ2K1L2M2
$$ plain form
7948 346 374 401 415 421 431 454 485 517 545 567 580 585 580 568 547 519 488 463 455 470 501 534 551 549 535 526 531 546 556 555 546 534 519 498 470 436 394 346 298
7933 298 262 242 235 234 237 239 239 241 257 290 329 357 368 369 370 374 383 395 404 404 397 388 385 384 383 377 368 355 338 319 302 290 289 297 311 326 341 355 366 371 365 351 335 328 338 357 370
7914 370 368 361 367 391 424 448 457 455 449 441 435 431 429 428 426 423 419 418 419 413 396 370 346 331 326 323 319 308 295 292 304 330 356 371 372 363 347 328 308 288 268 255 251 256 261 260 250 235
7894 235 224 225 236 248 250 245 247 262 283 301 310 314 316 319 329 348 375 402 422 430 425 410 387 360 332 312 310 327 349 365 373 377 380 379 369 355 337 317 296 281 276 284 301
7877 301 323 348 379 409 432 438 432 423 419 419 420 416 408 395 381 368 356 344 337 345 370 398 412 406 388 367 348 333 325 323 326 333 347 365 380 388 392 394 392 389 387 393 406 414 408 393 381
7858 381 387 412 440 455 454 445 435 427 422 429 447 468 479 478 471 462 450 435 425 426 439 456 473 486 494 490 472 448 429 421 421 423 427 432 435 431 426 425 429 438 452 468 480 483 479 482 500 529
7839 529 556 571 568 550 522 491 461 433 408 390 384 391 408 426 430 418 405 410 437 471 499 523 552 587 616 631 634 630 619 603 585 566 549 532 516 508 514 528 538
7823 538 541 544 564 603 648 682 696 693 681 667 652 634 617 610 618 641 671 700 722 735 738 739 747 763 783 802 822 844 864 873 871 865 862 865 868 869 870 874 880 889 901 922 954 996
7806I96M9N5N5M5L0K5L3M3M9N7P1Q2Q2P8Q2R6J10J22J33J44J49J60J88K30K79L34M04M86N80
7794E247O96Q56J063J322J660K119K707L408M182M880N118M393K498j46k667m314m895m693
7787B3434m101l389k702k121j673j334j064q52o92n76m86m18l64l10k51j97j58j23q9n9l9
7778B436k5j6j8l9o9q9j00j05j02q6n9l8j9lJ3J6J1J0J8K7L3M0N5O9P4P4P7Q3R6J13J27J37
7766B741J51J83K29K76L20L75M48N30O21P42R11J128J411J806K342L004L762M551N133N027
7757C5691L778J426j345l611m816n008m569l869l128k464j934j531j220r79q03o73n68m72
7750C905l87l17k59k18j92j74j43j06q0o9o5n2l7l0k8k5k1j9k4k9l3l0j6%QQQJ5K3K5K2J8
7737A678J7K3M3P7J09J26J34J46J62J81J97K11K30K56L05L83M73N66O74Q24J024J272J595
$$ plain form
7806 996 1045 1100 1155 1200 1230 1255 1288 1331 1380 1437 1508 1590 1672 1750 1832 1928 2038 2160 2293 2437 2586 2746 2934 3164 3443 3777 4181 4667 5247
7794 5247 5943 6799 7862 9184 10844 12963 15670 19078 23260 28140 33258 37651 40149 40003 37336 33022 28127 23434
7787 23434 19333 15944 13242 11121 9448 8114 7050 6198 5506 4930 4444 4026 3662 3352 3101 2904 2746 2623 2534 2475 2436
7778 2436 2411 2395 2377 2338 2269 2180 2080 1975 1873 1787 1728 1690 1671 1668 1681 1697 1708 1718 1736 1763 1796 1836 1891 1960 2034 2108 2185 2268 2364 2477 2604 2741
7766 2741 2892 3075 3304 3580 3900 4275 4723 5253 5874 6616 7527 8655 10066 11872 14214 17218 20980 25531 30664 35691
7757 35691 39469 40895 39550 35939 31123 26115 21546 17677 14549 12085 10151 8620 7400 6421 5618 4945 4377 3905
7750 3905 3518 3201 2942 2724 2532 2358 2215 2109 2029 1960 1895 1843 1806 1776 1748 1723 1702 1683 1659 1630 1597 1567 1551 1551 1559 1567 1575 1590 1613 1638 1660 1678
7737 1678 1695 1718 1761 1838 1947 2073 2207 2353 2515 2696 2893 3104 3334 3590 3895 4278 4751 5317 5991 6815 7839 9111 10706
7728A0706K035K615L314M092M814N122M520K746J39k454m236m936m796m223l515k828k239
7721A0876j776j416j130r02p21n75m57l77l32l05k77k46k16j90j66j48j31j05p5n7n8o2n4
7712A100l7k7k3j8j2j3k4l9n0n8n6m4l0j8j0noj5k9l6l7l4k8j1RK6K6J4nk0k0pLKoj1j2j7
7697D22j9oJ2J9OqmJ2K3K0J3J3J7J4Koomj0k5l6l4k4j3pljmojNMnj4j4j0jJ2K5L3K5RnojM
7678D17MLJrk4l0k3mPRQRQ%njRJ9J9J3Jj2j8j7j5k1l3l6k7j8j5j6j2n%RK1K9L0K4J6RQJ3J9
7660C64J6Mrj6k0k2k6k7k5k0j0JRQJmmJNRJ3J4J3J0RQOMOPJ3J4J1Kpj2rpmpj1j2rorj1rKJ1
7641B65J4J2RJpqjJ1J7K0K1J9J0kn%%nj1qKJ5K3K3J4Jj2j5j1lNOJqj5j5r%RJ1Mj0j7j6j5j8
7622C02j9j4oJ%kmrj4k0k2j9j3nJOJ2K1K1J0qj9j6pKJ2K8M0M1L1J7QJpj3j2nJNRQOLRJ7J4
$$ plain form
7728 10706 12741 15356 18670 22762 27576 32698 37218 39964 40103 37649 33413 28477 23681 19458 15943 13115 10876
7721 10876 9100 7684 6554 5652 4931 4356 3899 3522 3190 2885 2608 2362 2146 1956 1790 1642 1511 1406 1331 1274 1216 1154 1100
7712 1100 1063 1036 1013 995 983 970 946 907 857 799 743 699 669 651 641 636 630 615 586 550 513 479 451 440 449 475 501 515 510 490 470 463 466 468 462 451 439 422
7697 422 403 397 409 428 434 426 422 434 457 477 490 503 520 534 536 530 524 520 510 485 449 415 391 378 371 368 367 363 357 356 361 365 360 346 332 322 321 333 358 391 416 425 420 414 413 417
7678 417 421 424 425 416 392 362 339 335 342 351 359 368 376 376 371 370 379 398 417 430 431 419 401 384 369 348 315 279 252 234 219 203 191 186 186 195 216 245 275 299 315 324 332 345 364
7660 364 380 384 375 359 339 317 291 264 239 219 209 210 219 227 228 224 220 221 226 235 248 262 275 285 294 302 308 312 318 325 338 352 363 365 358 346 337 330 326 319 308 296 287 281 272 261 252 254 265
7641 265 279 291 300 301 294 286 285 296 313 333 354 373 383 381 376 376 376 371 360 352 354 369 392 415 429 430 418 403 392 389 394 400 401 393 378 363 354 354 363 374 378 368 351 335 320 302
7622 302 283 269 263 264 264 262 258 249 235 215 193 174 161 156 157 163 175 196 217 227 219 200 184 177 179 191 219 259 300 331 348 356 357 350 337 325 320 321 326 335 343 349 352 361 378 392
7604C92kk3l3l6m1m9m7l0oJ2K2K1J1lpNK7M6N3M6L1J4jj2k1k7k6j9j4j2pNJ4J3JnljnqqkM
7586B69QOmj7k6k5j4kPJ3J4Oqk0k4j7oKMkj0oRK6L1K4J1jj2k1k1j0OJ8K1J3LnmMQ%j1j3kJ0
7568B32J3J0PLmj2j3lQJ1Mpj2qjPJ4J8J5RPJ0J1Jj0nJ4K9K5Qj3l0m2m3l1j7j1j5j5pNJ2J4
7551A88J2J0J3K1K6K1Nj5k5k8k7j9oJ0J7J1%qqnKNOkqqjPJ0J0J1J1Lj0j9k0j3mMJ2J3J1J3
7533B26J8K0J1jqqrj0lQJ5J3RMkj3k2k6k3j9j5j1pjQK1L2L3K6J7J2Onj9l0l4l1k3j5mRK0K2
7516A91J3jokOJ1RRQRJ2J6K2K4K2J6J5J4J0jj6k7k9k4j6j2j2j2pNJ8K3K0J6J4J1PKLK%lnq
7499C47j2j6j2nknj0j1pnj0k1l4m1l6k0JJ8K8L7M1L6K1O%PJ8K6K6J8Kj2k4k7k0rMJ4J6J4M
7482C45j3k8l5k3pLJJJ0J9J6O%PJ5J3QKjpj2j2mNRNknjNPOPJ2J9K2K2J8J0kj5k2k2j5oJkj4
$$ plain form
7604 392 390 367 334 298 257 208 161 131 125 137 159 180 191 188 181 186 213 259 312 358 389 403 402 390 369 342 316 297 283 271 264 269 283 296 297 292 289 288 283 275 267 265 269
7586 269 277 283 279 262 236 211 197 195 202 215 229 235 227 207 183 166 160 162 166 164 154 148 157 183 214 238 249 248 236 215 194 184 190 208 229 242 245 240 236 240 248 248 237 224 222 232
7568 232 245 255 262 265 261 249 236 233 241 252 256 249 237 229 228 235 249 267 282 291 298 308 319 320 310 305 319 348 373 381 368 338 296 253 222 205 194 179 164 157 162 174 188
7551 188 200 210 223 244 270 291 296 281 256 228 201 182 176 186 203 214 214 206 198 193 195 200 206 204 196 188 187 194 204 214 225 236 239 229 210 190 177 173 177 189 202 213 226
7533 226 244 264 275 274 266 258 249 239 236 244 259 272 281 285 283 270 248 222 199 180 165 154 147 146 154 175 207 240 266 283 295 301 296 277 247 213 182 159 144 140 149 169 191
7516 191 204 203 197 195 201 212 221 230 238 247 259 275 297 321 343 359 374 388 398 397 381 354 325 301 285 273 261 249 242 247 265 288 308 324 338 349 356 358 361 363 363 360 355 347
7499 347 335 319 307 302 300 295 285 274 267 262 252 231 197 156 120 100 101 119 147 184 225 261 282 288 288 295 313 339 365 383 385 373 349 322 302 293 297 311 327 341 345
7482 345 332 304 269 246 239 242 243 244 254 273 289 295 295 302 317 330 338 340 339 332 320 308 304 309 318 323 321 316 315 320 327 333 340 352 371 393 415 433 443 441 426 404 382 367 361 362 360 346
7463C46k3k1j0KNOONjrnJ0K4K3Mj8k5j8pm%OJ6K2K7L3L7K8J2J%kj2k3k2pRJ6J3Krj4j8k2k6
7445C57k9l1l5m0l7j8OK0K2K0J8J5J2J2K2K8K5J5QLlj7k4j8mNLJMRRRJ5K1K1J4Okj5l0l4k6
7428C37j4j0j4qOK0K1J2MJkmmKJ3J8J3lj6k0j6j4j4qMJ2RNPJ4J2Mlkjj0j9k0oJ4K8K9J8Lr
7410C89j3j0j3k2l3l3k2oMNlqmQJ6J1%nKRROPJ1J2Lmrj5k3k9k5j2jNKmj0j6j8j5p%PJ5K5L1
7391B17K5PqoJ1K8L2K8K4J9Oj8m1m7l4rJ3K9L3K9K1J3P%m%J3K4K7K1J6J2Mj2k6k6j5noj4k5
7374C63l7m0l1j2NRQOPP%nnk%lopmqj8k8k5j2NJ7K4L2L5K9J4kqqqj0j0nMJ5L1M3M1K3lk0k4
7356C77k6k8k9j9rj0k3k9j7MJ7J4PJ1K2K8K3RmppmkMJ0Qnk0k0jK1K8J4j0k6k9k9l1l5k3KL0
7339A86M7M8L6K4J5J4J4J1kj5k3k4k5k3j2NK1K9K9K2Qpj7j6qMJ0J0%j2k1k6k8k2pJ0J5Mnp
$$ plain form
7463 346 323 302 292 294 299 305 311 316 315 306 301 311 335 358 362 344 319 301 294 290 290 296 312 334 361 394 431 459 471 472 472 470 458 435 413 406 415 431 444 446 437 423 405 383 357
7445 357 328 297 262 222 185 167 173 193 215 235 253 268 280 292 314 342 367 382 390 393 390 373 349 331 327 332 335 336 340 349 358 367 382 403 424 438 444 442 427 397 363 337
7428 337 323 313 299 291 297 317 338 350 354 355 353 349 345 347 360 378 391 388 372 352 336 322 308 300 304 316 325 330 337 351 363 367 364 362 361 351 332 312 306 320 348 377 395 398 389
7410 389 376 366 353 331 298 265 243 237 241 246 243 235 231 239 255 266 266 261 263 272 281 287 294 305 317 320 316 307 292 269 240 215 203 202 207 209 205 195 179 161 146 139 139 146 161 186 217
7391 217 242 249 241 235 246 274 306 334 358 377 383 365 324 277 243 234 247 276 309 338 359 372 379 379 375 375 388 412 439 460 476 488 492 480 454 428 413 408 402 388 363
7374 363 326 286 255 243 248 257 265 271 278 285 285 280 275 273 273 270 264 257 253 245 227 199 174 162 167 184 208 240 275 304 318 316 308 300 292 282 272 267 271 286 317 360 401 424 421 401 377
7356 377 351 323 294 275 266 256 233 204 187 191 208 222 229 240 262 290 313 322 318 311 304 300 298 302 312 320 315 295 275 274 295 323 337 327 301 272 243 212 177 154 156 186
7339 186 233 281 317 341 356 370 384 395 393 378 355 331 306 283 271 276 297 326 355 377 385 378 361 345 337 341 351 361 361 349 328 302 274 252 245 255 270 274 269 262
7323B62kJJQJ6J9J8J9J8J0nj2rlkmmoj2k4k7j6LJ6K1J9K0K4K5J9J0MMKjrj6k2k7k2j2JJ4K2
7305C41K7K6K1J0jj0j3j5j8k3k8k9k6j9j2lJMJ3K9M4M4L3J9J6J5J2Kj1k0k3k0j9k1k4j6%O
7290C12lk0k7j7lPOKKJ0K8M4M5K9Nj7l5m9n7n6m6k9oK1M3M7L6K0J0J0J4J2Omp%J4K7L1K3J1
7273D39%pj5k8m1m7m1k3JJ9K3J5MllkKRJ8K1J4NMJ0J4Jk0l0k5j4j4k2k3rPJ3J1RJ4K2K1J5
7256C44Nkrj5k4l1l1k1nPJ3J7J8J6J3J1J4J2Kj1j2JJ3J1krlNOpk2k9k6j2OK2K6J3qk6l1k3
7240B16j3JJ1J8J4QNNQRJ6K6L3K9J7Nlj1j8k0j3qj3k4l0k2j1lllmnonpj1j3nPJ5J7J8K3K9
7222B79K5J0qk2k4j1KOnj4j3qoj2j2jJ3J9J6Omj4j9j3LK0L3L5K7K3K7L8M8M5K7lk9m2l7k4
7206C81j8k0k5k4j5lPRLoj1nOK1L1K9J6mj5j6j4j7j9j4qj0k3l4l5k3rNJ7K9L7L5K3RNQPlj3
$$ plain form
7323 262 260 261 262 270 286 305 323 342 360 370 365 353 344 341 339 335 331 325 313 289 262 246 249 265 286 305 325 349 374 393 403 407 411 413 412 403 387 365 338 316 304 305 319 341
7305 341 368 394 415 425 424 414 401 386 368 345 317 288 262 243 231 228 229 233 246 275 319 363 396 415 431 446 458 460 449 429 406 386 367 346 322 306 306 312
7290 312 309 289 262 245 242 249 255 257 259 269 297 341 386 415 420 403 368 319 262 206 160 131 125 146 189 236 272 292 302 312 326 338 344 340 333 333 347 374 405 428 439
7273 439 439 432 417 389 348 301 260 237 238 257 280 295 299 296 293 291 293 302 320 341 355 360 364 374 388 389 369 339 314 300 286 264 241 232 239 252 263 272 286 308 329 344
7256 344 349 347 338 323 299 268 237 216 211 218 231 248 266 282 295 306 320 332 334 323 311 312 325 336 334 325 322 327 333 326 304 275 249 237 243 265 291 304 296 270 239 216
7240 216 203 204 215 233 247 255 260 265 273 282 298 324 357 386 403 408 405 394 376 356 343 335 322 298 268 246 235 232 229 226 222 217 211 206 199 188 175 170 177 192 209 227 250 279
7222 279 304 314 306 284 260 249 251 257 252 238 225 217 211 199 187 186 199 218 234 240 236 222 203 190 193 213 246 281 308 331 358 396 444 489 516 513 484 442 405 381
7206 381 363 343 318 294 279 276 283 292 295 289 278 273 279 300 331 360 376 372 357 341 327 310 291 277 269 259 236 202 167 144 135 140 157 186 223 258 281 290 295 303 310 307 294
7189B94j1kPJ0J4K1K3J4%j0j4j5j2qqj6k1j7kRJ3J1J1QNOJ2K1K4K1J5Ppk0k5j5LJ6J0rk6l1
7172C06k5j4mNJ0J1QKjmqj4j9k1j7oM%j3k1j8o%j%OJ3J5J4J4J8K7L0K2Jj7k2j7j3j3j1JJ6
7154B38K7K6K1J7J3Pkj2j6j5j0nKPJ1J0NJLNOMKL%pj5j8j3%J2K1K4K0J2%pj2k0l4m4l9k4q
7137A96orp%NJnnKRJ2J6K4L0K1jj7j6nNOMJoj6j7oJ0J5Pll%MKlrj2oNJ2J6K0K1J6J0QJ3J3
7117C52PMKpk5m1m1l0j8j0lMLmoKRMoj0nMRROOJ1J6J2lj5j9j2lNJ2J8J9J4Kj1j3lJ6K8K5J5
7098C29PNNNOLmj6j7rKRQQOlj6l0l4l1k2j3onnlJOPNRJ6K0J3kj3j4mRJ6J0mj6j4%J8K5K2R
7078B98kj0j2j4j7j8j4roj0j2nQJ5J7J7J7J5J2J2J6J4Noj1nRJ8J8R%l%LkkQK6M0L7J7pk6k8
7061D12k0j4j5j4qNJ7K3K3J8Poj4rk%rk0k2j5lJ2K7L4K9J1qj4j3j2j8k7k9k1pOJ6J9J6J1O
$$ plain form
7189 294 283 281 288 298 312 333 356 370 370 360 346 331 319 311 303 287 266 249 247 256 269 280 291 299 304 310 322 343 367 388 403 410 403 383 358 343 346 362 372 363 337 306
7172 306 281 267 263 268 278 289 297 299 298 294 286 272 253 232 215 209 213 213 200 179 161 155 155 154 154 160 173 188 202 216 234 261 291 313 314 297 275 258 245 232 221 222 238
7154 238 265 291 312 329 342 349 347 335 319 304 294 289 291 298 309 319 324 325 328 333 339 343 345 348 348 341 326 308 295 295 307 328 352 372 384 384 377 365 345 311 267 228 204 196
7137 196 190 181 174 174 179 180 175 170 172 181 193 209 233 263 284 283 266 250 245 250 256 260 261 255 239 222 216 226 241 248 245 242 242 246 248 245 236 224 218 223 235 251 271 292 308 318 326 339 352
7117 352 359 363 365 358 333 292 251 221 203 193 190 194 197 193 187 189 198 202 196 186 181 185 194 203 209 215 226 242 254 251 236 217 205 202 207 219 237 256 270 272 261 248 245 261 289 314 329
7098 329 336 341 346 351 357 360 356 340 323 314 316 325 333 341 347 344 328 298 264 233 211 198 192 187 182 179 180 186 193 198 207 223 243 256 254 241 227 223 232 248 258 254 238 224 224 242 267 289 298
7078 298 296 286 274 260 243 225 211 202 196 186 174 169 177 192 209 226 243 258 270 282 298 312 317 311 300 295 304 322 340 349 349 346 346 349 347 345 353 379 419 456 473 466 440 412
7061 412 392 378 363 349 341 346 363 386 409 427 434 428 414 405 403 403 394 374 352 337 334 346 373 407 436 447 439 425 412 400 382 355 326 305 298 304 320 339 355 366 372
7044C72%qj6j8j5j5j8k3k7k7k0kK3M3M8M0K2%j7l0l1k6j4jJ4L0M0L8K8J2%loqj1q%QJ4J7J8
7028D23J4Okoj0j8k7k7j9j0mllnj1j9k1j6j0qj2j5j0KJ8K5J6kj1lJ9L3K8J4Jrj7k2j3MJ7J3
7011C00%j3j5j0LJ7K5J7LnlNQROJj0j4pJ0K5K8K5K0J5J2RMj0l0m7m6l3j9j5j2lJ2K3K2J6N
6994C28pj8k5k1j2JJ2K3K9K4J2lj2j2mPJ8K4K4J7QklLJ4K2J5lk7m0l5j6JPLkmmnopojLRQP
6975C44MJ0J7K4J8Nqj3j1prj1j0oqpMJ8K3J0oj3o%KKJ0K6L8L8K1Kj0j4j8k3k5k0j6j7k0j5
6958C23j1j5k4k5j7qoj1j4j9k1j8j3j0pOK8M7M8L3J1klQK5L1K1Jj3j4j3j3j6j1%J2J8J3O%
6942C27LRROJ%QJ7K7L0K9K5J4mk8m7n1l9k5j8j7j8j7j1mjllPJ8K3J7J0J1J4J4RLqj9k5k3j8
6925B52k1k4k0lJ3K1K2K6L2L7L7L5K3Kk0k7k1j3j3j8j5oKLjoj3j5j0jMlj0pPJ8K0J1lj3j8
$$ plain form
7044 372 372 364 348 330 315 300 282 259 232 205 185 183 206 249 297 337 359 359 342 312 281 255 241 240 254 284 324 362 390 402 402 399 393 385 374 366 366 374 388 405 423
7028 423 437 443 441 435 425 407 380 353 334 324 320 317 314 309 298 279 258 242 232 224 212 197 187 189 207 232 248 246 235 232 251 284 312 326 327 318 301 279 266 270 287 300
7011 300 300 287 272 262 265 282 307 324 327 322 319 324 332 341 347 348 338 324 317 327 352 380 405 425 440 452 461 465 455 425 378 332 299 280 265 253 250 262 285 307 323 328
6994 328 321 303 278 257 245 246 258 281 310 334 346 343 331 319 315 322 340 364 388 405 413 411 408 411 425 447 462 459 432 392 357 341 342 349 352 350 346 342 337 331 324 318 317 320 329 337 344
6975 344 348 358 375 399 417 422 414 401 390 383 374 363 353 347 339 332 336 354 377 387 381 368 362 362 364 366 376 402 440 478 499 501 491 477 459 436 411 391 375 358 338 323
6958 323 312 297 273 248 231 223 217 206 192 173 152 134 121 111 104 110 138 185 233 266 277 275 272 280 305 336 357 358 345 331 318 305 289 278 278 290 308 321 327 327
6942 327 330 339 348 354 355 355 363 380 407 437 466 491 505 501 473 426 375 336 311 293 276 258 241 230 226 225 222 219 226 244 267 284 294 305 319 333 342 345 337 318 293 270 252
6925 252 231 207 187 184 197 218 240 266 298 335 372 407 430 432 412 385 364 351 338 320 305 299 301 304 303 297 284 269 259 258 262 259 249 242 249 267 287 298 295 282 264
6909B64j6pNJ5J6J3OKkqj2j2rj1j9k7k7j1J2L1L6K9K0J3RQRQPPJ0J3J5RJrk1l0l2j5J0L1L2
6891C63J4j2l3m2l3j3RK1K7K6K2J5PNKkrj0lNROlj1j7j9j8j9j6qMJ6K2K3J8Qqk3k6j9pKNL
6874B81%jMJ1J3QLMRRJojJ4K5K4J6Ojj2l0m6n2m3k5oPJ3RJnmLJ0PKKQROKNJ1OlmNJ0QNJ0J5
6853C43J3NmpolLKrk7l7l1j1J1K8L1K1Nlmoj1j2rj0j7k2j5jKoj7j5oJMKNJ3K2K2J2kro%KK
6834B43LQJ2Rmk0l4m2l8k2LK8M3M4L5K5K1K4L0L4L1J7Mnnpj1j2mK%qj6k3l5m8m9l4j0J0K1
6817B20K7K8K2J1jqj2j4j1lQJ2J0RJ4K6L5L1J4pk3k8k1j1olljLQJ3J8K0J7J0OMOLqk4l6l8
6800C17k8j7j2j3j3j0orj2qPJ8J8J4J7L0M0L8K9J6jk1m3n5n1l1j0OQNKLPJ1Qlj7k7k6k0j3
6783A48j0oKJ0J1PKNJ7L1L8L5K2J1NLKjorpJPQNMRJ2J3ROL%JMQRPMkoqj0j2j6j0LJ0Ooj1p
$$ plain form
6909 264 248 241 246 261 277 290 296 298 296 288 276 264 255 244 225 198 171 160 172 203 239 268 288 301 310 318 327 335 342 349 359 372 387 396 397 388 367 337 305 290 300 331 363
6891 363 377 365 332 290 257 244 253 274 301 327 349 364 371 376 378 376 367 357 354 359 368 374 371 360 343 324 306 287 271 263 267 283 305 328 346 354 346 323 297 278 271 273 278 281
6874 281 281 280 284 295 308 316 319 323 332 341 342 336 335 349 374 398 414 420 419 407 377 331 279 236 211 205 212 225 234 235 230 226 229 239 246 248 250 258 267 273 275 280 291 297 294 290 295 305 313 318 328 343
6853 343 356 361 357 350 344 341 344 346 337 310 273 242 231 242 270 301 322 327 324 320 314 303 291 282 272 255 233 218 217 219 213 196 181 175 176 180 182 187 200 222 244 256 254 245 239 239 241 243
6834 243 246 254 266 275 271 251 217 175 137 115 118 146 189 233 268 293 314 338 368 402 433 450 454 449 444 437 426 414 410 412 412 404 388 365 330 282 233 199 189 199 220
6817 220 247 275 297 308 307 299 287 273 262 259 267 279 289 298 312 338 373 404 418 411 388 360 339 328 322 319 316 315 318 326 339 357 377 394 404 410 414 420 423 415 391 355 317
6800 317 289 272 260 247 234 224 218 209 197 189 196 214 232 246 263 293 333 371 400 416 415 394 351 296 245 214 204 210 218 223 225 228 235 246 254 251 234 207 181 161 148
6783 148 138 132 134 144 155 162 164 169 186 217 255 290 312 323 328 331 333 332 326 317 310 311 318 326 331 335 344 356 369 378 384 387 387 388 392 400 409 416 420 418 412 404 394 382 366 356 359 369 375 369 358 351
6762C51%NJ1J7J9J7J2PJkPJ9K0jk9m5m4l3k3j8j3mQJ9K1J2MkjLRJ8K3J6Jj0j7j8j7j0KNkj8
6745C20k8k6k0j5j1nNJ3J6J4Olj2j3pNJ1J0NKMORJ4J9K0J3Nkoj2j3rJJ0Oj0l0l8l2j4J0K6
6728B44K9J9Nmnnoppj0qKJ8K5J5KLJ8L1L0K2J0ok4l1j9lLnj6j3jJ1J1jj3j4qmopjPJ1Lqj7
6709B70j5rjLLOJ2J8K2K4K2J4Kj1j7k1k4k8k8k4j8j4j2j1oJOPMKNJ2J6J6J4J0PPJ0J5J4J3
6692C16J2J2Mrk1k5k4k3k3k0j3KK0L4L8L3K6K4K1J3lj7k8l1k9k3j7j1oKJ0J5J2Lqj5j7j4j3
6676B07j2oMJ6K5K2J0qk3k2j2nlnmkkkJJ0K0L0L8L8K8Pj1j5qkpj6k0j1RK7L8L6K6Rpj9k7k8
6658C24k3j3lNOOPJ1J1NMPJ4J2jj8k7k9k4j4jPQNJ%%%lj1j9k2j2KJ3J3QPOKkkLOPLkj1j7j1
6638B38LJ9K3J4jj5k2j9oJ0J8J6RLLQJ2Rkj3j4rmmkKlj8k9k5j3qj6k3j6%J6K1J8J1%ppKJ3
$$ plain form
6762 351 351 356 367 384 403 420 432 439 440 438 445 464 484 483 454 409 365 332 309 291 278 274 282 301 322 334 338 336 335 338 347 365 388 404 405 395 378 360 343 333 335 340 338 320
6745 320 292 266 246 231 220 215 220 233 249 263 269 266 254 241 234 239 250 260 265 267 271 277 286 300 319 339 352 357 355 349 337 324 315 316 326 332 322 292 254 222 208 218 244
6728 244 273 292 297 293 288 283 277 270 263 253 245 247 265 290 305 307 310 328 359 389 411 421 415 391 360 341 338 341 336 320 307 306 317 328 327 314 300 292 288 282 275 274 281 292 295 287 270
6709 270 255 246 245 248 251 257 269 287 309 333 355 369 371 360 343 322 298 270 242 218 200 186 174 163 157 158 164 171 175 177 182 194 210 226 240 250 257 264 274 289 303 316
6692 316 328 340 344 335 314 289 265 242 219 199 186 188 208 242 280 313 339 363 384 397 394 377 349 318 289 266 249 238 232 234 244 259 271 274 266 251 234 220 207
6676 207 195 189 193 209 234 256 266 258 235 213 201 196 193 188 184 182 180 178 179 189 209 239 277 315 343 350 339 324 316 314 307 291 271 260 269 296 334 370 396 405 398 379 352 324
6658 324 301 288 285 290 296 302 309 320 331 336 340 347 361 373 372 354 327 298 274 260 259 266 274 279 280 280 280 280 277 266 247 225 213 215 228 241 249 256 262 264 262 260 263 269 276 279 277 266 249 238
6638 238 241 260 283 297 296 281 259 240 234 244 262 278 287 290 293 301 313 322 320 307 293 284 280 276 274 276 273 255 226 201 188 180 164 141 125 125 141 162 180 191 191 184 177 179 192
6620A92K0J7Rkj1j0kNLoj5j8j5r%J3K3K8K6K2J6PjmmjLNROkj2j7j4oNJ3J9J9J6J3Qjj0j0M
6602C31K4L2K5J2%rj6j8j2lLKlqrqqj3k1l0l3l2k5j7mLNNJ4L0M2L9K8J9J6J2%j5k4k0pOJ1
6585C24Q%oj2j5j2o%LOJ1J0%j1j5rklomKPPNKkkKRJ0Jj1j5j1mj%LOONQJ3J8J3Jrj1rlj%%j
6563B99%LOJ3K0K2K1J4Kj1k5l6m2m1l2j9lPQMNJ3J8J7ROJ0J5J7J4Q%j2k1l0l6l9l6k9k0j4
6546A05j5j5pJ1L6N3N3L1Kk1k8k0j2rrrmOJ6K3K2J6J1J2J6J9K0J6OjlJJpj7k1k1j9j3kJ2K2
6530B57K5K1J5Nj0k2k5j8nPJ2Ooj4j1mNJ3K0J6Lj0j5j0qj6k6l1k3nRJ3PLPJ0QLQJ8K2J3JK
6512B70J7L3M2L6J9pl3n0n6m8l0rRK0K5K0Mj8l3l7l5k8j8%K0L4L8L6L2K5J5QQJ3J6J1nk1k7
6496B96k0rjMLJlrj3j3oNJ6J8J3OKNRJ2J0%j3k1k0qMJ6K0J9J1LlnmjPJ1QJoj2j3j2pk%%QJ7
$$ plain form
6620 192 212 229 238 236 225 215 213 218 221 215 200 182 167 158 158 171 194 222 248 270 286 293 292 288 284 283 286 291 300 306 304 292 275 261 255 260 273 292 311 327 340 348 347 337 327 331
6602 331 355 387 412 424 424 415 399 381 369 366 369 371 368 360 351 343 335 322 301 271 238 206 181 164 160 163 168 173 187 217 259 298 326 345 361 373 373 358 334 314 307 313 324
6585 324 332 332 326 314 299 287 281 281 284 290 301 311 311 300 285 276 274 271 265 261 263 270 277 282 284 282 280 282 291 301 302 291 276 265 261 260 260 263 269 275 280 288 301 319 332 333 324 313 304 301 300 300 300 299
6563 299 299 302 308 321 341 363 384 398 400 389 364 328 286 245 213 194 191 198 206 210 215 228 246 263 272 278 288 303 320 334 342 342 330 309 279 243 204 168 139 119 105
6546 105 90 75 68 79 115 168 221 252 254 233 205 185 173 164 155 146 142 148 164 187 209 225 236 248 264 283 303 319 325 324 321 322 323 316 299 278 257 238 225 223 235 257
6530 257 282 303 318 323 313 291 266 248 243 250 262 268 262 248 237 233 238 251 271 287 290 280 265 255 247 231 205 174 151 146 155 168 175 178 185 195 203 206 214 232 254 267 268 270
6512 270 287 320 362 398 417 410 377 327 271 223 193 184 193 213 238 258 262 244 211 174 139 111 93 93 113 147 185 221 253 278 293 301 309 322 338 349 344 323 296
6496 296 276 267 266 270 273 274 271 262 249 236 230 235 251 269 282 288 290 295 304 316 326 326 313 292 272 264 268 284 304 323 334 337 334 329 325 324 331 342 350 351 345 333 320 308 301 299 299 299 307 324
6476C24K0Rnj2j5j7k1k0j1mknpJJ0J2Loqmmj0j7j6rqj2k1k5j7jK2L9M5L4J7PRJ8J7Lj0j4m
6458B85NJ0RP%j1k4l5m2m0k6kK2L3L0J8Jj2j3kJ3K1J9J2%j3k6l2l6l5k8j6JJ3K0K9L5L3J9
6443B42OOJ6K3K1J8J6J3Olj2j6k1k4k4j7j2rpjJ0J2jk2l6l4j5OJ7J6PLJjkLJ6K3J5jj1nNQ
6425B35RJ2J4J4QMLLkoj1j3j5r%PPLkoj3j7j3jMkj2j6j2ppmNJ7K6K7K3J0nj7k1k2k3k7k5j8
6407A05j1kNJ0RJmljKMQJ2QjplNJ0RJl%J2K9M2M5L5J4qk4k7k1rPJ7K2J7Rjj0j7j6p%nj2j7
6387B29j5j4j3qkmj2j6j1nkNJ5K2J9J0QJ1J2J2J0Mqj9j7mORQQO%rk1l8n0m4j9PK1K3K4K8K5
6370A91J9J7K5L5L6K4Qkqj5k1k7l2l7m1l6j9MK2K6K4K3K4K8K4J3lj5j3jJ0Rkj3j6qLJ2J4J1
6354B93Jj0j4pOJ8J6O%OJ5J3%pmMN%lKJ1J7J4RPQOjj0j5j8k0k0j1JRQKlnlJM%j7l6m3l1j0
$$ plain form
6476 324 344 353 348 336 321 304 283 263 252 248 246 241 234 235 245 257 260 254 246 242 238 228 211 195 186 178 166 145 120 103 102 124 163 208 242 259 266 275 293 310 313 303 289 285
6458 285 290 300 309 316 316 305 281 246 204 164 138 136 158 191 221 239 240 228 215 213 226 247 266 278 278 265 239 207 171 136 108 92 93 106 126 155 190 223 242
6443 242 248 254 270 293 314 332 348 361 367 364 352 336 315 291 267 250 238 229 222 221 231 243 242 220 184 150 135 141 158 174 181 184 185 184 182 185 201 224 239 238 227 222 227 235
6425 235 244 256 270 284 292 296 299 302 300 294 283 270 255 246 246 253 260 263 261 255 242 225 212 211 215 213 201 185 173 166 159 155 160 177 203 230 253 263 258 241 220 198 175 148 123 105
6407 105 94 92 97 107 116 117 113 110 109 111 115 123 135 143 142 135 132 137 147 156 157 154 154 166 195 237 282 317 331 323 299 272 251 242 249 266 288 305 314 313 303 286 270 263 263 258 246 229
6387 229 214 200 187 179 177 173 161 145 134 129 127 132 147 169 188 198 206 217 229 241 251 255 247 228 211 207 213 222 230 238 244 244 235 214 176 126 82 63 70 91 114 138 166 191
6370 191 210 227 252 287 323 347 355 353 345 330 309 282 250 213 172 136 117 121 143 169 193 216 240 268 292 305 302 287 274 273 283 292 290 277 261 253 256 268 282 293
6354 293 294 284 270 263 269 287 303 309 309 315 330 343 343 336 332 336 341 341 338 340 351 368 382 391 398 406 412 411 401 386 368 348 328 317 318 327 335 337 334 329 326 327 331 331 314 278 235 204 194
6334A94PJ6J7J7J4RJqj7j8j0NJ8K1J1L%OJ0J2RLloolLPRLlokjrj7j5m%oj9k4k2j8j5j0oom
6314A37JOLnpMK2L4L1J8MmnjPJ6K2K6K4K1K0J8J4J3J4J1kk1l8m3l9k5j0KL%%NQJpj0nKOJ1
6296B82J4K0K0J2nk2k8k2j3rj0qlJJ%JLPJ4J6J1MJJok0l0j8MK0K0J3J2J5J5J1PPLlqj1j0j4
6278B95j4qJNLKOQJj5l0l8l8l1j8%J8L6M7M8L7J7ok0k3k3k3k1j3kPNjmJPPjj3k0k1j2m%ll
6259A46LJ0J3J3QJlJJ4K5K1RJMPLmqqlJ0K3K6J8QPJ3J4J1PMmqpkMQJ4J6Rmj0j1j8l3m4l6j3
6240B55OJ0RJ1J4J6J2Npj8k2j6pJK%npoJPLpj5j0%QRRM%kLJ5K2J7P%nj2k0k0j2kLkqj1j0q
6220B17ppokLNNJ0J7J6Kj6k0rMJ0RJ2J8K5K6K0Rpj9k5k3k1k0j9qRK3K6J9J7J7J5MoojJlm%
6202C10MPPPKrj2lJ0K0K6K6J7kk4l6l8l6l4k7j2llj1j6j4nMJ0OJmpj5k4k7j9mJ0K5M2N4N4
$$ plain form
6334 194 201 217 234 251 265 274 275 267 250 232 222 227 245 266 277 280 280 286 296 308 317 320 317 311 305 302 305 312 321 324 321 315 313 312 303 286 271 267 267 261 242 218 196 178 163 153 147 141 137
6314 137 138 144 147 142 135 139 161 195 226 244 248 244 239 238 245 261 283 309 333 354 374 392 406 419 433 444 442 421 383 340 301 276 266 268 271 271 271 276 284 285 278 268 263 265 271 282
6296 282 296 316 336 348 343 321 293 271 258 249 239 231 228 229 230 230 231 234 241 255 271 282 286 287 288 282 262 232 214 218 238 258 271 283 298 313 324 331 338 341 338 330 319 309 295
6278 295 281 273 274 279 282 284 290 298 299 284 254 216 178 147 129 129 147 183 230 278 315 332 326 306 283 260 237 216 203 201 208 213 212 208 209 216 223 222 209 189 168 156 152 152 149 146
6259 146 149 159 172 185 193 194 191 192 206 231 252 261 262 266 273 276 272 264 256 253 263 286 312 330 338 345 358 372 383 390 394 390 382 375 373 377 385 399 415 424 420 410 399 381 348 304 268 255
6240 255 261 271 280 291 305 321 333 338 331 313 291 275 268 269 271 271 266 259 253 254 261 264 257 242 232 232 240 249 258 262 262 260 263 278 300 317 324 324 319 307 287 267 255 253 256 254 246 235 225 217
6220 217 210 203 197 195 198 203 208 218 235 251 253 237 217 208 212 222 231 243 261 286 312 332 341 334 315 290 267 246 226 207 199 208 231 257 276 293 310 325 329 323 317 316 317 314 310 310
6202 310 314 321 328 335 337 328 316 313 323 343 369 395 412 410 386 350 312 276 242 215 203 200 197 186 170 156 151 155 165 171 172 168 161 146 122 95 76 72 82 107 149 203 257
6184B57M5M2M6M1K3Kqonj3k4l2l8m2m0k9j2kLPJ5J4LpjJ2J3MkNJ5J5Moj0rn%Klnn%jornMJ4
6165B61J7J3OLKjj0j5j0l%lpppj2j7k1k1j7nJ3K7L6L6K7J2%rj3j5j7r%OKkLJ1J6J4RQNK%J
6146C09KQJ3J6J7J3Nlqojkj5k6k6j5k%pj3j1%J1J6J0lj2j5j4j4k3l0k6oK0L6L6K9K6K6K2J3
6129C50QPNjpj2j8k9l6k8rJ3K4K3J4NJKjj2k5k7j4NK2K8K8J8NopJNmk0k8k0kJ6K2K0J8J8J4
6111C66Kj3k4k0qKRJ1J4J3J1Okj1k2k7k2j0%J0J6J5RLJjnj2j7j8j5nRK3K9K9L1L4L1J8mk5
6094D31m0m4l5j4QK0K7L0L1K9K0Mj4k8k9j7jLmj9k6k3j7j1mQK3K7J8%j4k1k2j6oK%j9l5l3
6078A89qK6N4O2N1L2J2ok4l9m7m5l8l1k6k1j9j5mJ3K3J8Mqj6k7l6l6k1NL0M9O0O4O6O2N1K9
6063D33Oj0j3j3j6k2k9l0k6j5nMQJ0J0J1RO%j1k5l5l6k8j9j4j9l1l5k4nJ0J2J5K2L5M3M7M4
$$ plain form
6184 257 302 344 390 431 454 456 448 442 437 424 400 368 330 288 248 219 207 205 208 215 230 244 247 240 239 251 264 268 266 271 286 301 305 299 289 280 275 275 277 274 269 264 264 263 257 248 243 247 261
6165 261 278 291 297 300 302 301 291 276 266 263 263 260 253 246 239 227 210 189 168 151 146 159 186 222 258 285 297 297 288 275 260 243 234 234 240 242 240 243 254 270 284 293 301 306 308 308 309
6146 309 311 319 332 348 365 378 383 380 372 366 365 363 348 322 296 281 279 279 272 259 248 248 259 275 285 282 270 255 241 227 204 174 148 142 162 198 234 263 289 315 337 350
6129 350 358 365 370 369 362 350 332 303 267 239 230 243 267 290 304 309 310 312 311 299 274 247 233 238 260 288 316 334 339 333 326 327 332 328 308 280 260 258 274 296 316 334 352 366
6111 366 368 355 331 311 303 305 314 325 339 352 363 369 367 356 334 307 285 275 275 285 301 316 325 328 329 328 323 311 294 276 261 256 265 288 317 346 377 411 442 460 456 431
6094 431 391 347 312 298 306 326 353 383 414 443 463 467 453 425 396 379 378 381 377 358 332 309 292 281 277 285 308 335 353 353 339 318 296 280 274 276 276 257 222 189
6078 189 181 207 261 323 374 406 418 412 388 349 302 257 219 188 162 141 122 107 103 116 139 157 161 153 137 110 74 38 17 22 52 101 161 225 291 353 404 433
6063 433 439 429 416 403 387 365 336 306 280 265 260 264 272 282 292 303 312 318 318 307 282 247 211 183 164 150 131 100 65 41 36 46 58 73 95 130 173 220 264
6047B64L8K4QkolJJ%mnnqrrkRJ4J2ROLmj5k0k2k1k1k2j6j1j0j2mJ5K9K5NrqljkLJ4J8J4Lo
6028B55j3j5j6j1%J2J7Rok3l1k9k1q%%lJJ4K4K7K7L0L5L6K8J8QKjLJ0J9K3K0Nj4l1l6k8j6
6011C21okLNNKkkJPJ1J3Nqk2l1k9j9rjOJ2J4J0%j5k7l1k1jJ2J2J0J1J4Mj3k8k8k0rlnj7l0
5993I9k4JK5L0J7LppnjKPJ6K4K5J3KlKKJKRJ6J6J2RRJ5J9J5mk4l0k1j1j0j5k1k4k6k2j0jj
5975A24qqjRJ6K2K8K6J3oj8j5oKJqj8k2k3k0k1j8j0kLOJ7L1M0L8K5J1Jm%RJ3J1QQROmj2j8
5957B35j9j7j2rrrropolNQQQJ3J8K0J5RKnj3k1k4k3j6qmpqrokNJ6K5K9K6J7Lj1j4oRJ5Rlj6
5937A93k3k3j7nMPOQJ1J2Pmj5k2k0qMJ2J0NNQQPPRJ2Qkrj2rqoMJ9L4L8L0J1qj7j6kJ4K1J7
5918C05RPJ4K2K1J5Nlj4k0j9j3j4j7j8j4j0j2j5j4oMPMoj5j3lRJ7J7J3QKjmpj0rkKnj9k5j5
$$ plain form
6047 264 302 326 334 332 326 323 324 325 325 321 316 311 303 294 285 283 292 306 318 327 333 336 332 317 297 275 254 233 211 195 184 174 162 158 173 202 227 232 223 215 212 211 209 212 226 244 258 261 255
6028 255 242 227 211 200 200 212 229 238 232 209 178 149 128 120 120 120 117 118 132 156 183 210 240 275 311 339 357 365 367 366 369 379 398 421 441 446 432 401 365 337 321
6011 321 315 313 316 321 326 328 326 324 325 332 343 356 361 353 331 300 271 252 243 242 248 260 274 284 284 269 242 211 190 189 201 213 223 234 248 252 239 211 183 163 154 151 146 129 99
5993 99 75 76 101 131 148 151 144 137 132 131 133 140 156 180 205 218 220 217 219 221 222 224 233 249 265 277 286 295 310 329 344 340 316 286 265 254 244 229 208 184 158 136 126 125 124
5975 124 116 108 107 116 132 154 182 208 221 215 197 182 176 178 179 171 153 131 108 88 67 49 39 37 40 46 63 94 134 172 197 208 209 205 205 214 227 238 246 254 263 269 265 253 235
5957 235 216 199 187 178 169 160 151 145 138 132 129 134 142 150 158 171 189 209 224 233 235 230 217 196 172 149 133 125 121 114 106 97 91 89 94 110 135 164 190 207 210 199 185 179 188 203 212 209 193
5937 193 170 147 130 125 129 136 142 150 161 173 180 176 161 139 119 111 115 127 137 142 147 155 163 170 177 186 198 206 204 195 183 174 166 160 164 183 217 255 285 296 288 271 255 253 267 288 305
5918 305 314 321 335 357 378 393 398 395 381 361 342 329 315 298 280 266 256 244 229 215 209 213 220 224 218 203 190 187 196 213 230 243 251 253 252 248 241 231 222 220 222 217 198 173 158
5900A58MJ6J8QkrqkOPONQJ3J9K0J9J5RLK%nrj0nKPJ0QQQOMkj0j6j4oJJqj8k3k0oLOLKNRRJ2
5879B67K1L1K9J8Lj0j8j8j5rqqjJ3K4K3J1nj5j4oQJ8J9J1%nlJNLKkj0k1k7k8k6k7k4j2jLK
5861A99J0K5L2J8oj5nRJ8J7J3NmqlKLmj1j5j4j1j1j0nMJ5J9J6Q%l%OLj0k1k3j3rj4j7pJ3K7
5843B23K7K2K2K7L1L0K5J6Lrj4mRJ0mj9k2j2KROqk1k4j5kjj3k6l1l0k1qMJ0OjnjLJkokMJ3
5824B02K0K5L0L1K3Pj2k6l1k6j6lQJ6K4K9K8K1Qlrj4j7k0j7j4j5j7j4oOJ5K1K3K2J8Rkj1j4
5808B99j7k0k2j6%J8K8K8K8L2L5K6Oj2j7rkJlj1j5j5rmnj1j7k1k5k9k3j0K%j4k8l2k2nJ2K6
5792A27L7M1M0L6K6J5PK%mj0j7j9j3mMQQPLlj1j3kJ6K7K4J0jolJMJrj8j8j0nnoKJ3J5Qqk0
5773B77k7k7k2j1JJ3K0K5K3J8J0K%J0K8L8L1Qj9l3k9j2PJ9J6J0PJ2J8J8J3PLKJnj4k2j9j2
$$ plain form
5900 158 162 178 196 204 202 193 185 183 189 196 202 207 215 228 247 267 286 301 310 313 315 315 310 301 291 286 288 295 305 313 321 329 335 339 337 327 311 297 291 292 293 285 267 244 224 218 221 227 230 232 237 246 255 267
5879 267 288 319 348 366 369 359 341 323 308 299 291 283 282 295 319 342 353 348 333 319 313 321 339 358 369 369 364 361 362 367 370 372 370 360 339 312 284 258 231 207 195 194 197 199
5861 199 209 234 266 284 278 263 258 267 285 302 315 320 316 308 305 307 310 306 295 280 266 255 244 234 229 233 248 267 283 291 291 288 288 294 297 287 266 243 230 221 207 190 183 196 223
5843 223 250 272 294 321 352 382 407 423 426 417 403 399 408 418 414 395 373 361 363 372 378 370 349 325 310 308 307 294 268 237 207 186 178 182 192 198 197 192 191 194 195 193 187 185 189 202
5824 202 222 247 277 308 331 338 326 300 269 243 227 224 232 248 272 301 329 350 358 355 346 332 315 295 278 264 249 232 218 212 218 233 254 277 299 317 326 324 313 299
5808 299 282 262 240 224 224 242 270 298 326 358 393 419 425 413 396 387 385 386 383 372 357 342 333 329 324 313 296 275 250 221 198 188 190 190 176 148 116 94 89 101 127
5792 127 164 205 245 281 307 322 329 331 331 327 317 300 281 268 264 268 276 284 291 294 291 280 267 265 281 308 332 342 341 335 332 333 337 338 329 311 293 283 278 273 267 269 282 297 305 297 277
5773 277 250 223 201 190 191 204 224 249 272 290 300 302 302 312 340 378 409 417 398 365 336 324 331 350 366 376 383 395 413 431 444 451 454 456 457 452 438 416 397 385
5757C85orj4k0k1j5jJ4K0J4MMPMpk0k3j7j0nkLJ0J4J0QJ3K1K2J3jprj0j7k5k9k7k3k6l4l7
5740A51k5%K5L6L7K9K3K2K2J9Orj6rLPM%kk%J0J8K0J1qk3l1k4pJ1K4K9L1K3Qj0j8j8j8k0j5
5723C14mNNJMJ4K3K0J2MOJ5J6Mj8l1k7j5nJ%oj2j4oRJ8J3lj9k7k0oOJ0Jj3k5k7k0j0lLRJ6
5705B18J8Oj6l6m1k7%K0K2J4OPRQOPRRPQJ3J4Rmj9l0l1k3rJPQQPQJ1J4J2jj5k7l0k3rJKjn
5686A42kRK5L6L4K5J4Okj1j1KJ5J4Jj1j2pllj0j8j8mJ5K8L0K7K3J3kj3j3porpMJ2Qqk3l0k2
5668B31oRJ8J5O%%LNORJ2J0NklmnojPJ4J9K2J6%k1l0k8k3k3k5k8l1k9k1qPJ7K3K3J6Lrj7j7
5650A59j4qJQJ4J8K5K7K2J2Jrj6j5oOJ2RRJ1J2Lnoloj7l0l0j6PK3K5J6OJJ%klLRQMj%Ljrj3
5630B45p%Mkj4k3k4j9j0jLJoj5j5lJ3K3K3J6J0PPMJKNJ0J2J1RPLkmjOQN%mprqqj2j1%J8K4
$$ plain form
5757 385 379 370 356 336 315 300 299 313 333 347 351 355 362 366 359 339 316 299 289 284 282 285 295 309 319 327 340 361 383 396 395 388 379 369 352 327 298 271 248 222 188 151
5740 151 126 126 151 187 224 253 276 298 320 339 345 336 320 311 314 321 325 325 323 321 321 331 349 369 380 372 349 318 294 287 298 322 351 382 405 413 403 385 367 349 329 314
5723 314 310 315 320 321 325 339 362 382 394 398 404 419 435 439 421 390 363 348 343 344 344 338 326 312 306 315 333 346 343 324 297 277 271 277 287 288 275 250 223 203 193 190 193 202 218
5705 218 236 242 226 190 149 122 122 142 164 178 184 191 200 208 214 221 230 239 246 254 267 281 290 286 267 237 206 183 174 175 182 190 198 205 213 224 238 250 249 234 207 177 154 145 146 148 147 142
5686 142 140 149 174 210 244 269 283 289 287 276 265 267 282 296 297 286 274 267 264 261 251 233 215 211 226 254 284 311 334 347 345 332 319 312 306 297 290 294 306 314 306 283 253 231
5668 231 225 234 252 267 273 273 273 276 281 287 296 308 318 323 321 318 314 309 303 302 309 323 342 364 380 380 359 329 301 278 255 230 202 171 142 121 113 120 137 160 183 199 202 193 176 159
5650 159 145 137 138 146 160 178 203 230 252 264 265 256 240 225 219 225 237 246 255 266 278 281 276 270 267 261 244 214 184 168 175 198 223 239 245 246 247 247 245 242 245 254 262 266 265 265 268 267 258 245
5630 245 238 238 242 240 226 203 179 160 150 149 152 153 147 132 117 114 127 150 173 189 199 206 213 217 218 220 225 235 247 258 267 274 277 275 271 270 276 284 289 289 285 278 269 261 253 241 230 230 248 272
5610B72J3nj7j3%J5K6K4Oj7l2l5k7j6lQJ2J0J0J6J8J2JlJMjro%Jrj5qNQKprrqm%jqj2pNJ2
5590B00J5J4J4J1NJJMJ1J7K3L2L7L4J9LkLPQPROpj9k4k2j9j1LJ3J5J4J7K1K8L8M5M3L3M0O8
5573G55R2R4J00J34J94K70L77N01N36L58pl60n25m98m06l30k60j81j17r0q3o7m8l8k9j3%J
5562C60pojlrj2rpnlkpj1j0n%LRJ3J1Jj1k0k5j6%J2J3QRJ7K1J8J3J4J6J5J2Ook3l4l3k0lL
5543B86Kmrj6k7m1n0m5k7oJ3K2K4J9J7J5J3OKNRJ1RQN%n%J2K3K0Nj1k1k2k0j9k1j6nNRONJ3
5525A99K1K1J1jqlOJ3J3J1J2Q%rj2o%Knj8l2l4j5J0K1J1ooQJ8J4Jj0j1qnkKPJ0J2J4J4J5J7
5507C00J7J3jk2l5l4k3j3j2j6j6rjOJ3J5J6J9K6K9J6rl1l7l0j9j3j2pMJ6K2J9J4J2J1Poj6
5492B13j9j3njJNJ3K4L3L2K3J3QLmj2j1jQPkppl%jorpkQJ4J6Qok2l1k4qOJ3J1RRJ3J9K2J5
$$ plain form
5610 272 285 280 263 250 250 265 291 315 321 304 272 237 210 194 191 199 211 221 231 247 265 277 278 275 276 280 279 270 264 264 265 256 241 233 238 246 248 241 232 223 215 211 211 210 202 190 183 188 200
5590 200 215 229 243 254 259 260 261 265 276 293 316 348 385 419 438 441 439 442 449 457 464 473 479 472 453 429 407 388 377 380 393 408 422 439 460 488 526 571 614 647 687 755
5573 755 847 941 1041 1175 1369 1639 2016 2517 3053 3411 3404 3044 2519 2021 1615 1285 1025 844 727 637 554 487 439 401 372 359 359 360
5562 360 353 347 346 343 334 322 313 306 301 298 296 289 278 268 263 263 266 275 288 299 300 289 269 244 228 228 240 253 261 270 287 308 326 339 353 369 384 396 402 396 373 339 306 286 283 286
5543 286 288 284 275 259 232 191 141 96 69 63 76 98 122 141 158 173 186 192 194 199 208 219 228 236 241 241 236 236 248 271 291 296 285 264 242 222 203 182 166 161 166 175 181 186 199
5525 199 220 241 252 251 243 240 246 259 272 283 295 303 303 294 282 276 276 278 273 255 223 189 174 184 205 216 210 204 212 230 244 245 235 224 216 211 209 211 218 228 240 254 268 283 300
5507 300 317 330 329 307 272 238 215 202 190 174 158 149 148 154 167 182 198 217 243 272 288 279 248 211 181 162 149 137 130 134 150 172 191 205 217 228 235 229 213
5492 213 194 181 176 175 176 181 194 218 251 283 306 319 327 330 326 314 303 302 310 317 315 308 301 298 298 297 291 282 275 273 281 295 311 319 313 291 260 236 228 234 247 258 267 276 289 308 330 345
5472C45Kj5k2j8j4j1j1qlJLOQJ4J6J4Mj0j8j9j3j1j2j3nOJ4J3Nnj5k2j9j2nqj5j6j0ppqn%
5455I4jmppolNJ6J8J4J1J5J9J8RKLORNjnnkKMOJ0J2Q%pp%MLJJNQJ0PL%mj0k6m2m8l7j1J0J6
5433A21J2J1J7K4K7K8L0K8J9Kj7k9l5l5k8j5jNLmqoNJ8K5K3J2Kmljlj1j9j5LK4L1K0Kj1j3
5416B34j4k0k9l2k1oMMKOJ7K7L1L2K9K6K2J7J0jj0rjPJ0O%kJJ1J8J4N%MJ0J2J0PJj1k1j5J
5399C86J7K5K2J1j1m0n8n8m4k8j8j0lLPQPOLMPJ0J4J6J9K4K6K2J2mj3j3pkjnj4k5l0k6j3j
5382B25JmpkQJ2Nj2k3j9lPJ1J2J3J3PJ%NOL%loqmMJ4K2K6K3J1pk3k9k8k3j8j0JJ3K3K7K0P
5363B91lojLNMLMJ0J3Qmj5k4k6k6k3j5j0j0j3j2mRJ8K3K9L2L4K6Pj2k2j4JJ0J1QKqj9k7k8
5346B29k2j2kPJ4J9K1J8Oj1k5k6j5kML%MJ3K0K1J4RQJ3J9K0J3kk0l2l1k3j2lNJ3J8K1J7J0
$$ plain form
5472 345 347 332 310 292 278 267 256 248 245 246 249 255 263 277 293 307 311 301 283 264 251 240 228 215 210 216 230 243 248 243 228 206 187 175 170 162 147 131 121 114 107 99 94 94
5455 94 93 89 82 75 69 66 71 87 105 119 130 145 164 182 191 193 196 202 211 216 215 210 205 203 205 209 215 225 237 245 245 238 231 231 235 238 239 240 245 253 263 270 273 273 269 259 233 191 143 106 95 105 121
5433 121 133 144 161 185 212 240 270 298 317 319 302 273 238 203 175 160 159 164 167 163 155 149 154 172 197 220 232 234 230 227 226 223 212 193 178 181 205 236 256 258 247 234
5416 234 220 200 171 139 118 112 116 120 122 128 145 172 203 235 264 290 312 329 339 338 328 319 318 325 335 341 341 339 340 351 369 383 388 388 392 402 414 424 431 432 421 400 385 386
5399 386 403 428 450 461 450 410 352 294 250 222 204 194 191 194 201 209 216 222 225 229 236 246 260 276 295 319 345 367 379 375 362 349 342 340 339 334 320 295 265 239 226 225
5382 225 226 222 215 213 221 233 238 226 203 184 181 188 199 211 224 237 244 245 245 250 256 259 259 256 250 242 238 242 256 278 304 327 338 331 308 279 251 228 210 200 201 214 237 264 284 291
5363 291 288 282 281 284 289 293 296 300 310 323 331 327 312 288 262 236 213 198 188 178 165 153 149 158 176 199 228 260 294 320 327 315 293 279 280 290 301 309 311 303 284 257 229
5346 229 207 195 193 200 214 233 254 272 278 267 242 216 201 199 203 206 206 210 223 243 264 278 287 295 308 327 347 360 358 338 306 275 252 240 237 242 255 273 294 311 321
5330C21lk0l3l3k3mNOjmnrj4j3KJ9K4J1qj6oMQJnqnk%kpj7k0j5nKNORJ3J0JmNK1L6L5J5j3
5310B64l2l2j9plnml%LNQNkonJNQPJmkPJ4J1JolQJ6J6J1OJoj6k4k5k0j0JJ2K1K0RkolLNPR
5289B40O%mJJ2K2K5K1J0lj1r%NQPJqk0k4j8pjmj4k1j7kJ4J9J4RJ4K1J9Pok0l2l3k2kJ1J2M
5271B24JMRJ2RQRJ3J4Oj0k7l5l2k4j8j3qJJ2K1K2J4Lmnnj1j6j0KRMjKJ2J6J2J0J2J5J6J8K1
5253C12J8Nj0j3kRJ5J5J0jj2k0j7qKJ3J6Jk4m4m9l9k3nRJ7J6J1J1J1Mrj2%J7K6K3J6J1O%p
5236B99j5j5j0JJ3K2K5K4J7Lj0j7j0LJ3J2OJ%LNM%j0k1k7k0nPMqj5j1%J0J2Qlj5k3k7k5k0
5219A85j7j4j1nKJ0J3J5J5J8K3K3K1J3O%oj1j8k3k1j0LNlj0lJ2K6K6J9J4J3J1Kj0j6j2mjm
5202B76qpjOJ0Onj3j5qkkpj0j1nOK1L0K8J6Kqj7k2k5k2j5oMJ3J1Lpj0pnmnppnKJ5K4K4J5J
$$ plain form
5330 321 318 298 265 232 209 205 210 216 215 211 206 197 183 170 172 191 215 226 218 202 196 200 208 209 204 196 191 189 189 187 180 163 143 128 123 125 130 136 145 158 168 169 165 170 191 227 262 277 264
5310 264 232 200 181 174 171 166 162 159 159 162 167 175 180 178 172 167 168 173 181 188 189 185 183 190 204 215 216 210 207 215 231 247 258 264 265 259 243 219 194 174 164 165 177 198 218 227 225 219 216 219 224 231 240
5289 240 246 246 242 243 255 277 302 323 333 330 319 310 310 315 323 330 331 323 303 279 261 254 253 249 235 214 197 195 209 228 242 251 265 286 305 312 306 286 254 221 199 197 208 220 224
5271 224 225 229 238 250 259 267 276 289 303 309 299 272 237 205 181 163 150 142 143 155 176 198 212 215 211 206 201 190 174 164 166 175 179 178 180 192 208 220 230 242 257 273 291 312
5253 312 330 335 325 312 310 319 334 349 359 358 346 326 309 301 303 316 332 333 309 265 216 177 154 149 158 175 191 202 213 224 228 219 207 207 224 250 273 289 300 306 306 299
5236 299 284 269 259 260 273 295 320 344 361 364 354 337 327 330 343 355 361 362 362 365 370 374 374 364 343 316 296 291 298 302 294 279 268 268 278 290 298 295 280 257 230 205 185
5219 185 168 154 143 138 140 150 163 178 193 211 234 257 278 291 297 297 291 280 262 239 218 208 211 216 213 203 200 212 238 264 283 297 310 321 323 313 297 285 281 280 276
5202 276 268 261 260 266 276 282 277 264 249 241 239 237 230 220 209 204 210 231 261 289 305 307 299 282 260 235 213 198 192 196 209 220 223 216 206 199 194 190 185 178 171 166 168 183 207 231 246 247
5183B47rj4qkJkkJJ2K2K5J7LnkPJ1P%kjKOJ2J3Qkj0j1oklopKJ5K4K1RmqojKJkmloj1j6j6r
5162B88l%LJ0J3J1Nlj3k4l3k9k0rllpj4j6j1jJ0J4J6J5RJkJQJ6K2K2J7Lj1j6j2rj1j6j8j8
5145A82j5pMROJKJ1K1K8K9K4J8J3J1J0J0QJj2k4l0k4j7j6k0j7qKMQJ8K5K3J1KJKJJKONjpj2
5126B89j2j3j3j1lNOmj3j4j2j2j7j8j0lk%LJ2J8J5Npj9k5k3j3LJ3J3NLJ3K3K8K2J5QLlpok
5108B40NJ4J8J6QJ1K7M8M9K7nk7l6l9l6l1j8lJ1K0J9J1kj2j7j9j7j4j1onmj0j7k1j4jQRQJ2
5092A96J6J0lj3j4pjOJ4K1J8J2OMOQJ1J3RNJlj0j7j9j1%NNKlj0qMK1L2L1K3J0lj6k7k9k7k1
5074B47j9j8j6j7j6j6j4nKRJ1J8K9L6L2K3J2OJpj4j8k4k9k9k2j4n%LJKNJ4J9K0J4J1J0J1J2
5057B65J8K3K3J3jrqmLQJ5J9J7J3J1J1J2J1Lmrprk2m3o0o0m7l1j9j1j0j1r%J3K2K8L4M1M9
$$ plain form
5183 247 238 224 216 214 215 213 211 212 224 246 271 288 291 286 284 291 302 309 309 307 306 308 314 326 339 347 345 335 324 318 316 313 307 300 302 317 341 362 371 367 359 353 352 354 355 353 349 346 340 329 313 297 288
5162 288 285 285 288 298 311 322 327 324 311 287 254 225 205 196 193 190 183 169 153 142 141 151 165 181 196 205 206 204 205 213 229 251 273 290 293 282 266 254 245 234 218 200 182
5145 182 167 160 164 173 179 180 182 193 214 242 271 295 313 326 337 347 357 365 366 354 330 300 276 259 243 223 206 198 200 204 212 230 255 278 289 291 292 294 295 296 298 304 309 308 301 289
5126 289 277 264 251 240 237 242 248 244 231 217 205 193 176 158 148 145 143 143 146 158 176 191 196 189 170 145 122 109 112 125 138 143 146 159 182 210 232 247 255 258 255 248 242 240
5108 240 245 259 277 293 301 312 339 387 436 463 458 431 395 356 320 289 271 268 279 299 318 329 327 315 298 279 262 248 237 231 226 222 212 195 174 160 159 167 176 184 196
5092 196 212 222 219 206 192 185 184 190 204 225 243 255 261 265 271 279 290 303 312 317 318 315 305 288 269 258 258 263 268 270 267 257 249 253 274 306 337 360 370 367 351 324 295 268 247
5074 247 228 210 194 177 161 145 131 126 128 137 148 166 195 231 263 286 298 304 305 298 284 266 242 213 184 162 148 143 143 146 147 149 154 168 187 207 221 232 242 253 265
5057 265 283 306 329 342 341 332 324 320 323 331 346 365 382 395 406 417 429 440 443 439 430 423 414 392 349 289 229 182 151 132 121 111 100 91 91 104 126 154 188 229 278
5041B78N5N5M5K2lj6j4j2j7j7r%Jkkjj0k4k9j8jPJ1J6K2J8Lj1k2k2k1k0k6l1l1k1pMJ2J9K2
5025B03K1J0%mJPJ2J3J3J0M%%LKOJ8L0K9J3%KK0M4P2R8J16J22J36J76K33L04L90M74M81L28
5010C387L5k64m32m41l67k88k29j86j56j36j18r8q2p4o6n3l6k3j5j4j5j3onj4k6k4j1KPPJ0
4997B56J4J9K2K1J4J2J9K9K4Lj1oOPlrpmlpj2j5j3ojnj3rQK5L5L6L2K5J7Ooj2j3qmlkJnk1
4979D33l8l7k0lLnj8l2l5k1kJ4K1K4K2J2%oKJ8K5K1Rmj4k2k7l5m1m2l1j1J3L4M6M5L5K2J3
4963C68OMLLkj3j7j9j9k2k3j9j4j4j5j1mNJ0J2J2J1RP%j1j6j2kOJ1J4J2KprLJ3J7J2QKkpq
4945B84nKOPOKnj2j7j7j3rj0j0n%jnrmNJ2J1OjmjJkqj4j2mPJ8K7L0K5J9J7J7Pj4l4m1k9rM
4926B18M%jLJpj0kJ0J8J9K0J8Oj1k3k3j7rnJJ0J9K9L0K4J1Joj2k0k7k6j5JJ8L0L4K7J4NL%
$$ plain form
5041 278 333 388 433 455 452 436 422 410 393 376 367 367 368 366 364 363 353 329 300 282 281 288 299 315 337 355 358 347 325 303 282 262 236 205 174 153 146 150 162 181 203
5025 203 224 234 234 230 231 238 250 263 276 286 290 290 290 293 295 301 319 349 378 391 391 393 413 457 529 627 743 865 1001 1177 1410 1714 2104 2578 3059 3387
5010 3387 3422 3158 2726 2285 1918 1630 1401 1215 1059 923 805 707 625 551 485 432 396 373 358 344 329 316 310 305 291 265 241 230 232 239 246 256
4997 256 270 289 311 332 346 358 377 406 430 433 422 416 422 429 426 417 410 406 403 396 384 369 356 350 349 344 331 322 330 355 390 426 458 483 500 506 500 488 475 467 463 460 458 459 454 433
4979 433 395 358 338 335 338 333 315 283 248 227 225 239 260 284 306 318 318 312 314 332 357 378 387 383 369 347 320 285 244 202 171 160 173 207 253 298 333 355 368
4963 368 374 378 381 384 382 369 352 333 314 292 269 250 236 222 207 196 192 197 207 219 231 242 251 258 258 247 231 219 217 223 234 248 260 262 255 246 249 262 279 291 299 301 299 292 284
4945 284 279 281 287 294 300 302 297 285 268 251 238 229 219 209 204 204 203 198 189 185 190 202 213 219 218 214 213 214 212 204 190 178 174 181 199 226 256 281 300 317 334 341 327 293 252 223 214 218
4926 218 222 222 221 224 225 218 208 206 216 234 253 273 291 297 286 263 240 223 214 209 210 220 239 268 298 322 333 334 328 316 296 269 243 228 229 247 277 311 338 352 357 360 360
4909C60npjPROlj2j6j1%J0J3P%rj0n%nk5m7n2l6j7n%KLjj0j3j2j0nKJ3K5L1L1K5J6J0RJ0J0
4890B82Lj1k6l2k0NK6K7J1orojlrj6k2j9oJ7L4L4K0KrrlOJ7K3K2J0kj0j3j3j0lPJ5K2K7K6
4873C78J7kj9k9l1l0k9k3j1%PMkoj0j4j8j8j2JJ4K8M0N1N2M2K5Oj0k6l7l8k9j6j6k2k6j7n
4857A69%%LQROPJ6J7Nj5k6k7k1j1KJ5J8J4J3J8K9L2K5J6QOQJ1Qkj1j4oKjj0j6qMRNoj7k4k7
4839B41k0pRK1K8K7J4pk8l9m0l2k4j9j9k7l2k9j7%RJ4J4J1PJ0J8K9L4K3kk8l8l0j4jPJ7K7
4823A07L2L3L2K7J5nk1k7k7k3j3jPRJ0J3J1Lpj2pKJ1J2Pmj0p%MMMPMjmlkj%LMMjpoLJ5J9J3
4803B26OJ0J7J8J4J2J4J6J2OMkj2k3k6k0j0JJ1J9K4K1J2Kpj1rokMRJ3J3J3J3J3RLnj5k6l4
4786C27l2k3j0lJJLKJjMRJ1Mpj4j2ok%LRJ5J7J1lj4j8j3p%OQRRJ3J3Lj3j9j3mkrj6j6pLQk
$$ plain form
4909 360 355 348 347 354 363 369 366 354 338 327 327 337 350 357 357 348 338 333 333 328 303 256 204 168 151 146 146 148 151 150 140 127 115 105 100 102 115 140 171 202 227 243 253 262 272 282
4890 282 285 274 248 216 196 201 227 254 265 259 250 244 243 240 231 215 193 174 168 185 219 253 273 275 266 257 254 260 277 300 322 332 330 320 307 294 284 281 288 303 325 352 378
4873 378 395 393 374 345 314 284 255 232 221 221 228 232 230 224 214 200 182 164 152 153 167 195 235 286 338 380 405 411 401 375 338 300 271 255 239 217 191 174 169
4857 169 169 169 172 180 189 195 202 218 235 240 225 199 172 151 140 142 157 175 189 202 220 249 281 306 322 330 336 344 355 363 361 350 336 330 332 331 321 305 297 301 310 315 309 292 268 241
4839 241 221 214 223 244 272 299 313 306 278 239 199 167 143 124 105 78 46 17 0 0 9 23 37 48 55 65 83 112 146 169 167 139 101 71 57 56 63 80 107
4823 107 139 172 204 231 246 241 220 193 166 143 130 129 136 145 155 168 179 182 175 163 156 158 169 181 188 184 174 167 167 171 175 179 186 190 189 185 182 180 179 179 182 186 190 189 182 176 179 194 213 226
4803 226 232 242 259 277 291 303 317 333 345 351 355 353 341 318 292 272 262 263 274 293 317 338 350 352 345 334 325 319 317 321 330 343 356 369 382 395 404 407 402 387 361 327
4786 327 295 272 262 259 260 261 264 266 267 266 270 279 290 294 287 273 261 255 253 253 256 265 280 297 308 305 291 273 260 253 253 259 267 276 285 298 311 314 301 282 269 265 263 254 238 222 215 218 226 224
4766B24k1k8j2J6L4K5Kj9k5k2j7j3j1j3j4j0KJ8K5K5K1K5L1L0K0Lj3k6l1k0jJ5J5RPJ2J1j
4751B73j7k7k7j5nJKKNRJ2J2J3J4J4J3J0%j5k3j8nJmj4j8j6j2pjNJ1J1J0J2K1K6J8lk0k0o
4734B22PJ4J8J7Pj3k7l1k6k1j6q%%nmJ0K5L1K4RjjMJ1J7K4K7K0Lj5k7l0k7j8ojj1k3k3pJ0
4717A59J4RQJ3J4Npj4j8k1k0j6qjMNMMJ1K2L2L2K3J2PRJ3J2Kj0j8j6j3j5j4q%MNQJ1QKNJ5
4699B73K0Qj1k4l0l0k8j9j3j2j8j7rkjNJ5K6L4M0M6M3K7QJQJ3Pmj0rmkmpqlMQPPQRKrj9k3
4680C03j7qqj9l5m3l8k4pJ0K1K6K4K0J7J3QOQJ1Mj1k2j4OK2K1Nj2j9j9j2mlqk0k5j6OK2K4
4664A93J4Nlj2j6qJ5L9M5K8Ooqprj2j2j2j1o%MKkjLRJ3J5J4QL%jnj3j5j4rokMPJ1J8L0L4K3
4644C53mk9l9l8l0j8nQRMMJ4K8L0J6%nmjnqj2j5j3%K4M4N1M4K9J3jj2j6j0pj1k6m1m3l0rM
$$ plain form
4766 224 203 175 163 179 213 238 240 221 196 174 157 144 133 120 106 96 98 116 141 166 187 212 243 273 293 296 283 257 226 206 205 220 235 244 251 263 274 273
4751 273 256 229 202 187 182 183 185 187 192 201 213 225 238 252 266 279 289 289 274 251 233 228 229 225 211 193 177 165 158 157 162 173 184 194 206 227 253 271 268 248 228 222
4734 222 229 243 261 278 285 272 245 214 188 167 151 143 143 143 138 134 144 169 200 224 233 232 231 235 246 263 287 314 334 337 322 295 265 238 220 214 213 202 179 156 149 159
4717 159 173 182 190 203 217 222 215 201 183 162 142 126 118 117 121 126 130 134 145 167 199 231 254 266 273 282 295 307 309 299 281 265 252 237 223 215 215 219 224 232 243 251 253 258 273
4699 273 293 301 290 266 236 206 178 159 146 134 116 99 90 88 87 92 107 133 167 207 253 296 323 331 332 340 353 360 356 346 337 333 331 327 320 312 309 313 321 328 335 343 352 354 345 326 303
4680 303 286 278 270 251 216 173 135 111 104 114 135 161 185 205 222 235 243 249 257 268 272 261 239 225 231 253 274 279 267 248 229 217 213 210 202 182 157 141 147 169 193
4664 193 207 212 209 197 181 173 188 227 272 300 306 300 292 285 276 264 252 240 229 223 223 227 229 227 226 229 238 251 266 280 288 291 291 290 285 272 257 243 234 228 226 230 237 248 266 296 330 353
4644 353 349 320 281 243 213 195 190 198 207 211 215 229 257 287 303 303 298 294 293 288 280 268 253 240 240 264 308 359 403 432 445 444 432 416 406 399 388 362 321 278 248 239 243
4627B43Olqj1j0j0r%J6L0L4K5J3OMKkmLJ2J3Ooj4j7j5j1poplLJ1J7K2K0J4Llmmmqj3j4j0k
4608B98NLmpkPJ2J1Lmj3j6j4p%J%nrj4j8j9j3lQJ3J5J2QNOQJ1J1Ojj0k0k9l1k7j8j1jJ1J8
4590A76K1J7J4J3Nnj3j3omnkPJ3J1LJJ2K1K1Rkrj1j1j2j0onoonk%MRQkj3j7j0LJ5K5L2L1J8
4571C14KqoLJ0J0Nlrronj2j7j8j6j8k5k5j6JJ6K5K5J7J1J2J5J1jj7k1j6oJJorlRJ4RJMJ0P
4552B61pj6j7j0rrpjLL%jNJ6K3J8Pllknj3j2mJ1K2K9K5J3jj0j5j7j8k2l3n0n9n0k4NK1K4K0
4535H8J4J1J4J8J6PkKJ0Rmj6j5nQJ7J6RMRJ8J9Qoj4j4j1nKKrk6k7qJ6K9K7J9J6J2Oknk%Jj
4516B55lpj6k5k6j9r%RK1L1K9J2pj2nJjqpMK0K9K6J5QMM%j0k4l6l6k5rLOJj1k0k0rLQORJ6
4497A75J6Rlrj0j4k0k0j0NJ4J6J3J6K0K5K8K6K1Rrj9j8j0jJ%koj1j5j3qmmpom%MPQPPQJ3J6
$$ plain form
4627 243 249 246 238 227 217 207 198 198 214 244 278 303 316 322 326 328 326 322 325 337 350 356 350 336 319 304 293 286 280 273 270 273 284 301 323 343 357 360 357 353 349 345 337 324 310 300 298
4608 298 303 306 302 295 293 300 312 323 326 322 309 293 279 272 272 273 273 268 259 245 227 208 195 192 200 213 228 240 248 253 259 267 278 289 295 294 284 264 235 204 177 159 148 147 158 176
4590 176 197 214 228 241 246 241 228 215 209 205 200 198 205 218 229 232 233 245 266 287 296 294 285 274 263 251 241 235 230 224 218 213 211 211 215 224 232 230 217 200 190 193 208 233 265 296 314
4571 314 316 308 302 305 315 325 330 327 318 309 303 298 286 269 251 235 217 192 167 151 152 168 193 218 235 246 258 273 284 283 266 245 229 223 224 225 219 210 207 216 230 239 240 244 254 261
4552 261 254 238 221 211 202 193 186 185 188 191 191 190 195 211 234 252 259 256 253 251 246 233 221 217 228 250 279 304 317 316 306 291 274 256 234 201 151 92 42 18 23 44 68 88
4535 88 102 113 127 145 161 168 166 168 178 187 183 167 152 147 155 172 188 197 201 210 228 247 255 249 235 221 210 205 207 209 200 174 147 139 155 184 211 230 246 258 264 262 257 255 255 256 255
4516 255 252 245 229 204 178 159 150 150 159 180 211 240 252 245 233 228 229 228 220 213 217 237 266 292 307 315 319 323 323 313 289 253 217 192 183 186 192 193 182 162 142 133 136 144 150 159 175
4497 175 191 200 197 188 178 164 144 124 114 119 133 149 162 178 198 223 251 277 298 307 298 279 261 251 250 251 251 249 243 232 217 204 196 192 188 181 175 171 171 175 182 190 197 204 212 225 241
4478B41J3MlmKMmj6k4j9mJ0J6J4OlmjRJ6J9J3PNMK%LPPJnoj0k0l2l6l0j9nOJ1Poj4j3jJ2J4
4458A74RLPJ9L1L3K3Mj6k6k1qkrk0k8k4j6rorj5j3pJJLJ2K4K6J8J1RN%KJ1J1%j0oJ0K2K3K2
4440B69J9J3Jj0j4rmnj4k8l2k3nOMlmLQPMORJ2RL%lkj%mj0j2oMJ0OJMRJ4J6J7J0ok1k2pQJ4
4420B41J1PJnjRJ0kj9k4j4kJ0J9K4J8OKLjj5k6j7KJ4Qpj1nPJ7J7J1Jmmklnopqqj1j7k5l1l1
4401A27k8k1j0jQJ6K5L4L8L1J9J0Kpk0k1j0QJ8J4Mnj3k1j9qJ0K2K3J5Lrj7j7j0rj4k2k2j2
4385A11ljk%L%pj0jJ5K6K4J7J0NNRJ6J9J4O%LJ0J4J1Kj0k1k6k7k3k0k5l2l5l0j9oPJ8K6L2
4367A05L6L6L0J7OLOP%qj2qkMPRQJ0J3J2Mpj3qNJ6K0J3Krj1j2j9k6k6j9j0omk%KNJ7K9L4K4
4348B78PopKJ3J9J5RQRJ2J5J9K4K1Oj3k6k3j0KQKj1k3k3j4jJoj7k4k6k4k2j1NJ8J9Oqj5j3
$$ plain form
4478 241 254 258 255 251 253 257 253 237 213 194 190 200 216 230 236 233 229 228 237 253 272 285 292 297 301 303 303 306 313 320 321 316 310 300 280 248 212 182 163 158 164 175 182 176 162 149 148 160 174
4458 174 183 186 193 212 243 276 299 303 287 261 240 232 230 221 201 173 149 133 124 118 109 94 81 74 75 76 79 91 115 141 159 170 179 184 184 186 197 208 208 198 192 202 224 247 269
4440 269 288 301 302 292 278 269 265 260 246 218 186 163 158 164 168 165 161 164 172 179 183 189 198 210 219 222 222 219 217 216 216 212 202 190 184 188 198 204 205 209 218 232 248 265 275 269 248 226 219 227 241
4420 241 252 259 260 255 254 263 273 271 252 228 214 212 222 241 265 283 289 291 294 293 278 252 235 237 251 259 252 241 236 243 260 277 288 289 285 281 279 276 271 265 258 250 242 231 214 189 158 127
4401 127 99 78 68 67 75 91 116 150 188 219 238 248 250 243 223 202 192 200 218 232 236 231 218 197 178 170 180 202 225 240 243 234 217 200 190 181 167 145 123 111
4385 111 108 107 105 105 108 108 101 91 90 105 131 155 172 182 187 192 201 217 236 250 256 256 259 269 283 294 296 286 265 239 212 189 169 144 112 77 47 28 22 29 47 73 105
4367 105 141 177 207 224 230 233 239 246 246 238 226 218 216 220 227 236 244 254 267 279 283 276 263 255 260 276 296 309 311 302 291 279 260 234 208 189 179 173 169 167 167 169 174 191 220 254 278
4348 278 285 279 272 274 287 306 321 330 338 347 359 374 393 417 438 444 431 405 382 372 374 382 384 373 350 327 313 312 313 307 290 266 240 216 194 183 188 206 225 231 223 208 195
4331A95n%KKKJjjKRJ9K2J8PknJPJ0N%kpj6k0j3MJ4J1mk1l4m0l0j3j%kKJ0J0Kk%OQRRJ0QQN
4310A99%nj1j3j6j6j0QK3K5J1mj2qOJ9K5K1J4J4J6J2ok2k8k2rKJ1J4J5J4J1Lj1k3k3j3kNR
4294B23J0P%omNJ0Lj2j3%J2J0%oKJ0Plj0j5k3l0k8j5jOOLNJ0QJj1j7j5qOJ8K6K5J4%olNRL
4274B18nj2j0%QJ4K0K5K8K3J2L%LPPRRPnk0k6k6k4k2j9j1opj1j1j4k3l3k7rQJ0J0J5K2K4K0
4257A81J6J0LmkLORJ4K1J7Nqj1rlPJ6J9J4Mpj7k3k0rMRQNkqr%J2J5Oj0k4k3j1QJ5Nj1k3k2
4238A76j6qnloo%J2K2K3J4%j1j4oJJkLK6M9N7M6K7Rmj6k6k9k5k0j7k1k1j9j3qnJJ2J7J4OM
4221B19QJ2J1PMOOmj6j8j1JL%JRJ4Qmj2j2qopqj3j5k0k4k8k7j1J3L3L3J9NNJ4K4K8K2J2ok3
4203B44l1k7j6pqj3k0k3k5k3j9j3j1qj0qlRK0L1L2K4J4OL%nj0rKJ9L0K4Oj1j0MJ9K6K3J7J0
$$ plain form
4331 195 190 190 192 194 196 197 196 195 197 206 225 247 265 272 270 265 266 273 283 288 288 286 279 263 243 230 234 248 259 255 234 200 160 130 117 116 116 114 116 126 136 138 136 136 142 150 159 168 178 186 194 199
4310 199 199 194 183 170 154 138 128 136 159 184 195 191 179 171 177 196 221 242 256 270 286 298 292 270 242 220 211 213 224 238 253 267 278 281 270 247 224 211 209 214 223
4294 223 233 240 240 234 230 235 245 248 236 223 223 235 245 245 239 241 251 258 255 245 230 207 177 149 134 133 139 145 148 153 163 171 172 161 144 129 121 127 145 171 196 210 210 204 201 206 215 218
4274 218 213 201 191 191 199 213 233 258 286 309 321 324 324 327 334 341 350 359 366 361 341 315 289 265 243 224 213 207 200 189 178 164 141 108 81 72 80 90 100 115 137 161 181
4257 181 197 207 210 206 204 207 213 222 236 257 274 279 271 260 251 248 255 271 290 304 308 301 284 261 241 232 236 245 253 258 256 248 239 239 251 266 272 262 238 215 204 212 227 232 221 198 176
4238 176 160 152 147 144 138 132 132 144 166 189 203 203 192 178 172 173 174 172 175 201 250 307 353 380 389 385 369 343 314 289 269 252 231 210 191 178 170 165 166 178 195 209 215 219
4221 219 227 239 250 257 261 267 273 269 253 235 224 225 228 228 229 238 252 260 256 244 232 224 218 211 203 190 175 155 131 103 76 65 78 111 144 163 168 173 187 211 239 261 273 267 244
4203 244 213 186 170 163 155 142 122 99 74 51 32 19 8 0 -10 -18 -21 -12 8 39 71 95 109 115 118 118 113 103 94 96 115 145 169 175 164 154 158 177 203 226 243 253
4186B53Jm%PNoj7j6oJjnJRJ3Pjmk%LPJ2J4J1Olj5l0m2m7l7k0kJ3K3K7K3J0klOJ2Mj4k2j3N
4166A61J3Mj5k5k4j2jMQJ3J9K6L2L5L3K2J0LRJ6K3K3J9Rqk3k9k2j0JQJ0Okprj2j4j1mjoj9
4149B53k3k1j9j6pJ1K7L3K6J1pk3l4l1j2J6L7M0K9J7J4J2Nmj1j8k7l7m0l0j5pkKORRQQOJm
4132A92njLNMKkj0k1k2j5jRJ2J1J2J7K2K0J0jplMPMmj0j2nMJ2J4J2Omj0oLOmj6k5k4k0j7q
4113A38LJ1J4J6J9J6J1ORQNKJL%nrj0pkJlrpRK3K0Mj1j3mQJ6J6MpqNJ5J3jqmPJ1Mj2k3k0r
4093B46%%klknlRK2K6J8Pmrj0lRJ8K0J3%j4k4k5j7ploj2j4j3qjRK0K3J7Mpj7k8l7m0k8nK0
4075A34L7L8K8J6J3J7J5RKJKjpj4k1k4k1pJ%j0j3nJrk5l2k7j2KJ2J9K1J7Ork2k1pJ3K9L6L6
4058B18L0J7%j5k2j8nJ4K6K1Mj3k2k3j8kJ4J7Jj8k4j6ppokKKLLJmnQK9L9L4J7lj9k3j3NK1
$$ plain form
4186 253 254 250 250 257 262 256 239 223 217 218 217 212 213 222 235 242 241 237 235 235 238 245 257 271 282 288 285 270 240 198 151 114 94 92 105 128 155 178 188 186 183 189 201 205 191 169 156 161
4166 161 174 178 163 138 114 102 101 105 113 126 145 171 203 238 271 293 303 306 315 331 354 377 396 405 397 374 345 323 313 314 322 332 338 336 329 320 308 294 283 279 278 272 253
4149 253 230 209 190 174 167 178 205 238 264 275 268 245 211 180 168 184 221 261 290 307 321 333 338 334 323 305 278 241 201 171 156 149 147 149 155 164 173 181 189 195 196 192
4132 192 187 186 189 194 198 200 198 188 167 145 130 129 138 150 161 173 190 212 232 242 241 234 231 235 242 246 242 232 220 215 219 231 245 257 263 259 249 243 246 252 248 232 207 183 163 146 138
4113 138 141 152 166 182 201 217 228 234 243 251 256 258 259 262 262 257 248 238 231 229 230 227 218 211 220 243 263 267 256 243 239 247 263 279 283 276 268 273 288 301 300 292 288 295 306 310 298 275 255 246
4093 246 246 246 244 241 239 234 231 240 262 288 306 313 309 300 290 287 296 314 334 347 347 333 309 284 267 260 257 251 239 225 212 204 203 212 232 255 272 276 269 252 224 187 147 119 114 134
4075 134 171 209 237 253 266 283 298 307 309 310 312 311 304 290 269 245 224 217 218 218 208 195 190 191 182 157 125 98 86 88 100 119 140 157 163 154 132 111 104 117 146 182 218
4058 218 248 265 265 250 228 210 205 219 245 266 270 257 235 212 194 192 206 223 224 206 182 166 159 152 146 144 146 148 151 154 155 151 146 154 183 222 256 273 270 251 228 215 220 241
4040B41K7K5K2K0J9J2jj0j3mPJ4RJqj4j8j5oMQNmrr%J1J7Rpj8j8j3oorj2j3j2j1qpqj3pJ4
4022A86L8N2M0J4qj8j5qmlkMJ0PK%Jnk0l4l1j7olm%NNORJ2J3J1PMJJLLknkJ1K6L8L9K9J0p
4002C93j6j5q%jj3k9m2m2l0j3NJ7J2nk4l4k9j9j1qqj2j3pQK1K1J4QJ5K5K6J5%rrol%jjjj%
3984A70jkjmolQJ5Q%RL2M4L3Rlpj0k1k3j8j1ojJ1K0K3K2K1J5jj8k7k3j4j2j6j9k1k1j6rkk
3966A22lmKQJ3J1NklOJ9L1L7L1J4rk5k5j4prj2qMJ2J0kj5k2j6kJ2J4Nj0j7j6j1%J3K4K0RL
3948A93J0K1K0Nj2j9j7j4j5j8j8j2%RQjj0pLQOJ%mpojOJ3J9K6K9K1Rnj4k1j9rJKqj5j7j2j1
3930A18j0q%J3K7L8L7K2lk3k3j1LQKoj2j0nLJ0J3Pmj4k1k6k4pJ4K6K3RMQJ7K1K4K3J8OmnM
3912B82J0Nj1k8l4k9k1j1ompj0j0lOJ2J3RLnqol%KNJ0J6J9J4Lo%J2J6Mj6k7k5j6mPJ4J1jj4
$$ plain form
4040 241 268 293 315 335 354 366 365 355 342 338 345 359 368 369 361 347 329 314 308 312 320 325 321 312 303 303 314 331 340 333 315 297 284 278 272 263 251 238 226 215 207 200 192 179 172 186
4022 186 224 276 316 330 322 304 289 281 277 274 272 276 286 293 295 295 296 291 271 237 206 189 183 180 176 176 181 186 192 201 213 226 237 244 248 249 250 253 256 254 249 247 258 284 322 361 390 400 393
4002 393 377 362 354 354 353 340 311 269 227 197 184 189 206 218 213 189 155 126 107 96 88 80 68 55 48 56 77 98 112 120 135 160 186 201 201 192 183 177 174 174 173 172 171 170 170
3984 170 169 167 166 162 156 153 161 176 184 184 193 225 269 302 311 308 301 291 270 247 229 218 212 211 222 242 265 287 308 323 322 304 277 254 240 228 212 193 172 151 135 126 124 122
3966 122 119 115 117 125 138 149 154 152 149 155 174 205 242 273 287 278 253 228 214 207 198 186 178 182 194 204 202 187 165 149 147 159 173 178 168 151 135 124 124 137 161 181 190 193
3948 193 203 224 244 249 237 218 201 187 172 154 136 124 124 133 141 140 130 123 126 134 140 141 141 137 130 124 123 129 142 161 187 216 237 246 241 227 206 187 178 179 181 173 158 141 129 118
3930 118 108 100 100 113 140 178 215 237 234 211 188 177 180 188 190 184 172 162 157 160 170 183 190 186 172 151 125 101 94 108 134 157 166 170 178 195 216 240 263 281 287 283 278 282
3912 282 292 297 286 258 224 195 174 163 157 153 146 136 126 123 129 141 154 163 166 161 153 147 144 144 146 151 161 177 196 210 213 207 207 219 235 239 223 196 171 155 151 158 172 183 182 168
3894A68k0j6lPJ0KoojMLJKQJ6K4K4J9J4J8K5K6K2K2K6K7J9PLJnk0l5m0l3k1qqj9l6m4l8k0
3877A19JJ7K0Oj6k9k3lK0L4L5K5Rpj9k2k1j8j1pkLRJ9K6K6K1J7J2Rjj0j3mQJ8K4K6K6K5J8
3860C67Oj0j9j7p%MPJ0R%j6k4k3k1j8j3mJ0K2L1L5L2J7JolNJ0Mpj8k4k4j8j0lJJmqj2j4j3
3842B36qqrj4j1nKOMNJ0J8K1J3mk0k3j0NJ2J0Knj0j1j0j0j5k3l3l6k9j2LPmj6j7mJ5K7L0K3
3825A02J1lj4j7j3lNNLQJ6K2J9J5J5K1K3J8OmjQJ6J0jrj1j6k5k4oJ4J9Nj0j6j2plMJ0J2RM
3807B05KOJ8K8L5L3K1Nrj7j8j1nmj0j8k2j8pQJ7K1K1J5Jj9l6l8l0j3JJ0J2J3K0K7K5Oj7k5
3791B33k0pJKLMJ0J5J5Jk0l5l6k7j7oQK6L6L2J2j3k6k3j5j3j7j2LJ7J9J1QJ1J2Noj2j5j4l
3775A47J8L3L2J9Lj0j8k4k7k3j9j5rmJONKLJ3K6K8J6%nk%mj0j2rqopqnLJ7K6K1J1KjKOJ1J4
$$ plain form
3894 168 148 132 129 136 146 148 142 136 135 139 142 143 145 153 169 193 217 236 250 268 293 319 341 363 389 416 435 442 445 446 441 421 386 346 313 292 284 276 257 221 177 139 119
3877 119 120 137 157 163 147 118 95 92 112 146 181 206 215 208 189 167 146 128 117 110 108 111 120 139 165 191 212 229 241 250 249 239 226 222 230 248 272 298 324 349 367
3860 367 373 363 344 327 320 320 324 331 341 350 350 334 310 287 266 248 235 231 241 263 294 329 361 378 379 373 370 375 385 389 382 364 340 316 298 288 285 286 287 283 275 263 249 236
3842 236 228 220 211 197 186 181 183 189 193 198 208 226 247 260 256 236 213 203 208 220 230 232 227 217 206 196 186 171 148 115 79 50 38 41 48 44 28 11 7 22 49 79 102
3825 102 113 110 96 79 66 63 68 73 76 84 100 122 141 156 171 192 215 233 239 235 234 242 258 268 267 258 247 231 206 182 176 190 209 214 204 188 176 169 166 170 180 192 201 205
3807 205 207 213 231 259 294 327 348 353 344 327 309 298 293 289 279 261 239 221 214 222 239 260 281 296 297 278 242 204 174 161 162 172 184 197 217 244 269 275 258 233
3791 233 213 206 207 209 212 216 226 241 256 257 237 202 166 139 122 116 124 150 186 218 230 217 191 168 153 140 123 111 114 131 150 161 169 180 192 197 191 179 164 150 147
3775 147 165 198 230 249 252 242 224 200 173 150 131 116 107 103 104 110 115 117 120 133 159 187 203 203 198 196 196 192 182 170 161 153 147 140 132 127 130 147 173 194 205 207 206 208 214 225 239
3756B39J4J2J0Kqj6j6j1nKPRQLnj2j4rJJrk2k7k0rjNQJ5K3K7J9Jj5k1j3jPJ1J2J0J0J1J1K
3738B46j3k1k2j5pOK1L0K8J9QjnplLRJ1J0Nnj2j5j0nllkmmjMNmj7k3k1j4j0qmJMMKjJRJ7K1
3718B04J9J7J6K1K3J8Olprj1j2j4j0mLPMjpj1j3j7k1k2k2j7nJ1K6L6L6L0K0Q%KQJ1QJj1k1
3701B97k7k0nJ5L1L8L4K2Nj0k0k6k7k7k4k1j2lNPMLNNNLJoj7l1l7k9j0J2K9L3K8J7Kj0j6j5
3684B08oLJ0J1J1J0J1J3J3J1Mmj0j1j0nMJ4K0J6J0%prnJMmj8l1l5k7j2OJ5J4Mrj5j5rmjkK
3666A66J1J8J8R%lk%KOPPQLj0k5l1k1pNJ3K7M0L5J0j9l1l0k6k2rMJ2P%NJ7L2M1M2L8K9J3m
3648C85k1l1k9k2j6j6j6j2j0j0j2j2pjNJ1J2RJ0J8K4J9Nrj5j9k1j4jJ4K4K3J9Qkj0j2qjPJ4
3632B80J3Plj1j0JJ4K2K2J5RNok2l7m4m5m1l2j6JJ2J3Moj9k5k1j0KJ0J3J4J5J2Pjj0j8j6n
$$ plain form
3756 239 253 265 275 277 269 253 237 226 221 223 230 239 247 250 245 233 219 210 211 212 203 181 154 134 125 124 129 137 152 175 202 221 222 207 186 173 172 179 190 202 212 222 233 244 246
3738 246 233 212 190 175 168 174 195 225 253 272 280 279 274 267 264 267 276 287 297 302 297 285 270 260 255 252 249 247 243 239 238 242 247 243 226 203 182 168 158 150 146 147 151 155 157 156 157 166 183 204
3718 204 223 240 256 277 300 318 324 321 314 305 294 282 268 258 254 257 264 268 267 260 249 236 219 198 176 154 137 132 143 169 205 241 271 291 299 299 301 309 320 328 329 318 297
3701 297 270 250 245 260 291 329 363 385 390 380 360 334 307 280 256 235 223 220 225 232 236 239 244 249 254 257 258 252 235 204 167 138 128 140 169 202 230 247 249 239 223 208
3684 208 202 205 215 226 237 247 258 271 284 295 299 295 285 274 264 259 263 277 297 313 323 323 316 307 302 303 307 303 285 254 219 192 180 186 201 215 219 210 195 180 171 167 166 164 166
3666 166 177 195 213 222 222 219 217 217 219 225 232 239 247 250 240 215 184 163 156 161 174 201 241 276 286 267 236 206 180 158 149 153 165 172 172 177 194 226 267 309 347 376 389 385
3648 385 364 333 304 282 266 250 234 222 212 202 190 178 171 170 175 186 198 207 217 235 259 278 283 274 259 240 219 205 204 218 242 265 284 292 290 280 268 260 259 266 280
3632 280 293 300 297 286 276 277 291 313 335 350 359 364 358 336 299 255 210 169 137 121 122 134 147 151 145 126 101 80 70 72 82 95 109 124 136 143 142 132 114 98 93
3615I3QJ4J3NknjKLmolNRJ0J7L0M0L6K0Mnomkkl%NON%qj8l3m5m3k6oRJ9K6K8K0Nrj0kPJ1J1
3595B18J4K2K6K9K6J7Pjj%nk0l3l8l2k3qQK0K3J5jj8l0l0j7oqk0k1qNQNMRJ3J6J8J5Nrj4p
3577A73PJ6J4%j2j5pJLJNRRM%lrj9k8k7k1j5j3j1pjLjrqJJ5K4K9K8K3Qrj6rJkj4k4k3j3jO
3558F3QJ0J2J3J0MOJ4K3K5J9J3Q%j5k8k6rJ3K6K3J2lk2m7o2n0j6J9L5L0J9J0KlKRJ4J3J7K3
3541B14K6K0Qj2l2m5m1k1mOJ1K0K6K0J0J0J8K1J2kplMPMKMJ6K6K7J9Nkpqj0j0rqj1rkRJ3L
3523C18j8l1k8j1MQNJpj8k1j5rpplORJ1J5J9K2J9J7J3Nqj4j2rj2j5rNJ4Rkj0r%J5K8K8J5%
3505C11pmkorqllrj3j3j0j1j1rnkj%LQJ4K4L1K8J4LMJ2Rjqrj3k6l3k2%J1RK%mj0j0JJ1J1J
3485B45qj3k0l0l5k6j1jjnjRK2K6K6K1J5Ooj9k6k1lJ7K8K1Pmqrj0j0ro%J0K2L0K8J8PKJJl
$$ plain form
3615 93 101 115 128 133 131 126 125 127 130 126 120 117 122 131 141 158 188 228 264 284 288 283 277 273 271 269 266 266 271 277 282 282 274 256 223 178 135 109 103 112 131 157 185 205 210 201 191 189 196 207 218
3595 218 232 254 280 309 335 352 359 358 357 357 352 332 299 261 229 206 198 206 226 249 264 263 245 215 185 168 162 154 134 113 105 110 118 123 127 136 149 165 183 198 203 194 180 173
3577 173 180 196 210 210 198 183 176 177 180 181 186 195 204 208 208 205 196 177 149 122 101 86 73 62 55 54 57 56 47 39 40 55 79 108 136 159 167 158 142 133 134 132 118 94 71 58 57 63
3558 63 71 81 93 106 116 120 126 140 163 188 207 220 228 228 213 185 159 150 163 189 212 224 221 199 152 90 40 24 43 78 108 127 137 139 136 138 147 161 174 191 214
3541 214 240 260 268 256 224 179 138 117 113 119 130 150 176 196 206 216 234 255 267 265 258 255 259 266 270 272 276 292 318 345 364 369 367 360 352 342 332 323 315 304 295 293 302 315 318
3523 318 300 269 241 230 234 242 247 248 241 223 202 187 178 171 164 161 167 176 187 202 221 243 262 279 292 297 289 275 263 254 242 227 218 223 237 246 244 234 225 225 240 268 296 311 311
3505 311 304 300 298 292 283 275 272 269 260 247 234 224 213 202 193 188 186 185 185 188 196 210 234 265 293 307 310 314 326 335 334 326 317 304 278 245 223 223 234 243 245 245 241 231 221 222 233 244 245
3485 245 237 224 204 174 139 113 102 101 100 95 94 103 125 151 177 198 213 219 213 194 168 147 144 161 189 210 217 213 205 196 186 176 167 161 161 171 193 223 251 269 276 278 279 280 277
3467B77j4k2k4j5pj3k3k1kJ9K8K3J6J4J6J8J6J0jrj2j8k6l7m3m1l2k4j2kNJ2J8K6K4J5Lmk
3452A36KMNJ0J3J6J8K4L1L2K3Lj9l1l2k8k2j4lMLoj5j8j1nrk0k3j0J6L4L8L3K7K7K3J4Kpj2
3435B53j3j0nmj1j9k0j0KRMjjloj2j3j0rrq%J0J6K0K1J9J6QKLPJ3J9K1J9J3ONMkj6l3m2m0
3417A93l1j7qnj1j9j9rLJ4K1K3J9QJMJ0J0Lnj0j6j8j7j0orrlMNJ%MJ0P%ooNJ3J5N%NK0L1L9
3398B39M3M0K5Jj7j8pNJ2J7J7Mj7l5m1l1j6lJ2K3K0Kj9k4j4nmqp%NLjj1k1k4j4JPkj3j4ol
3380A01nqporq%J2J8J6PMOJ0J1POOPMmj3j5j1ok%LJ4K4K5J9J3J9K8L0J5rk5k5j1NJ2J0Moj4
3361B52k0k0j7j2j2j5j5j0%RJ1Lj2k2j9rmoqnMJ2J8J9J2LomJOQJ1J4J3MlnJOQKrj8k2k1j8
3343A05j0LJ9K9K3RKPJ6K0J4OKNJ3J4Qok0k8k5j7kJ7L0L1K3J7J5J0kj5k4k3j5rmoj5k5l0k5
$$ plain form
3467 277 263 241 217 202 195 182 159 138 136 155 183 206 222 236 252 270 286 296 295 286 274 256 230 193 150 109 77 53 41 39 44 56 74 100 124 139 142 138 136
3452 136 138 142 147 157 170 186 204 228 259 291 314 317 298 267 235 207 185 171 168 172 175 169 154 136 125 120 111 91 68 58 74 108 146 179 206 233 256 270 272 265 253
3435 253 240 230 225 221 210 191 171 161 163 172 176 175 174 171 165 153 140 130 121 112 104 104 114 130 150 171 190 206 214 216 219 226 239 258 279 298 311 317 322 326 324 308 275 233 193
3417 193 162 145 137 132 121 102 83 74 77 91 112 135 154 162 163 167 177 187 190 185 175 159 141 124 114 108 99 90 87 91 96 97 97 101 111 118 118 112 106 111 124 139 144 144 149 169 200 239
3398 239 282 322 347 348 331 313 306 311 323 340 357 361 344 309 268 237 221 218 230 253 273 275 256 232 218 213 209 201 194 194 199 202 201 190 169 145 131 132 139 137 124 110 104 101
3380 101 96 88 81 75 66 58 58 70 88 104 111 115 121 131 142 149 155 161 168 172 168 155 140 129 123 121 121 124 138 162 187 206 219 238 266 296 311 302 277 252 241 246 258 268 272 266 252
3361 252 232 212 195 183 171 156 141 131 131 140 151 154 142 120 101 92 88 82 74 69 73 85 103 122 134 137 131 127 128 134 142 153 167 180 184 181 176 177 183 191 193 184 166 144 123 105
3343 105 95 98 117 146 169 178 180 187 203 223 237 243 245 250 263 277 285 279 259 231 206 189 187 204 234 265 288 305 320 330 328 313 289 266 251 242 238 232 217 192 162 137
3326A37j6r%J1K2L0L3K7J9J1QRRMnj3j7j6j4j3j3j2jJ3K3J9Kj7k6k1j0jQK1L5M1L0J4Mjlm
3309C18KJ0Qj2l0l6k9k2j8j5nPJ2J3J0RPKoj3j1mlj1j9j8oNQNJoj4k3k4j1MJ5J3KolPJ3J3
3291A39QOM%jNJ3J0lj8j8kJ9K9K7K0J3%j7k7k4j6j1pLJ7L0L7L7L1J7Km%KLMMnk6m0l5j9lN
3273B09J4K3K2J2LjKJklmoqmKJrk0k2j8rlj%lqj3j2nKKoj5j9j6j4j0kRJ9J9J0mj6k2j7nJ2
3254F5K5K6J6Jrj1mNJ5K1J9J4Mrj5j1MK2K7J7jj6k3j7pOJ5J9K1K1J3kj6k5k2j0LRLj0j8j0
3237A55NJ3PjQL1M7M0J4j7l7m2l3j9oJRK4M3N2M6K7Kk1l9m9n0m3l3j9nJ0J8K1K0J2kj4j9j8
3221A38j5rkM%oq%J1J1M%PJ5J4RNQJ1Noj7k1k0j8j1lJ0K2L0K4RnqKJ1RKjoj4k6k9k0rnnjJ2
3201A08K6L4L4K7J4Jrj5j7j3nPJ4J2LmmLPNKLPRkk2m1m7l6j2J4K9K5J1kokKmj6k8k9j7MK3
$$ plain form
3326 137 121 112 112 123 145 175 208 235 254 265 273 282 291 295 290 277 260 244 230 217 204 192 191 204 227 246 248 231 205 184 174 173 181 202 237 278 308 322 326 325 322 318
3309 318 320 330 338 326 296 260 231 209 191 176 171 178 190 203 213 222 229 231 225 212 201 197 194 183 164 146 140 145 153 158 159 153 139 116 92 81 85 100 113 115 109 106 113 126 139
3291 139 147 153 157 157 156 161 174 184 181 163 145 143 162 191 218 238 251 251 234 207 183 167 156 149 152 169 199 236 273 304 321 323 319 319 321 324 328 332 327 301 261 226 207 204 209
3273 209 223 246 268 280 283 282 284 285 283 280 276 270 262 258 260 261 252 232 210 192 183 180 179 179 176 168 155 143 138 140 142 136 121 102 86 72 62 60 69 88 107 117 113 97 75 58 53 65
3254 65 90 116 132 133 124 113 109 114 129 150 169 183 187 178 163 152 156 178 205 222 221 205 182 165 158 164 179 198 219 240 253 251 235 210 188 178 181 190 193 183 165 155
3237 155 160 173 180 179 187 218 265 305 319 302 265 223 190 171 165 166 175 199 242 294 340 367 369 348 309 260 210 167 134 115 110 120 138 159 179 191 189 175 156 138
3221 138 123 114 112 116 116 110 102 102 113 124 128 128 135 150 164 173 178 186 197 202 196 179 158 138 120 109 106 116 138 168 192 201 196 188 190 201 210 212 211 205 191 165 136 116 107 102 97 96 108
3201 108 134 168 202 229 243 244 235 220 203 190 185 192 206 218 221 217 213 216 223 228 230 233 240 249 247 225 184 137 101 89 103 132 157 168 166 160 158 160 156 140 112 83 66 70 93
3183I3L3L3K2J0PJ3J8J8J6J4J1Okoqj2j6j5mQJ1Moj1ql%PJ5K4K6J6kj5j8j3qj0j8k4k0qNR
3165A92Nmj4j4q%%oj0lJ0K0J6Pmj2j8k2k1j4oMRJ4J8J7J2ONJ0J1MljJ%rj7k2k4k5k2j5qon
3147D8kRJ8J9PnoNJ1MomJ2K7K8K1J9K5K8K5J5kk0k3rJ0J8J4M%jLQJ2Qjj1j9k2k3j9j5rjOJ2
3128B18RM%J%qj5k0k0j4pjjk%QJ3J5J3J2J0PLlol%Jkj4k7l8l5k0lNKjKRJ2Nlj0j6k2j9j0M
3109C3J4K5L7M7M5L0J2kj2j6j5qjNOPRJ0Lqk0k2j7j2j3j8k1k0j2nKQJ4J8K2K5J9Prk1k2j3
3092A11jRJ2QLjmnrj6k3k2j2MJ8K4K4K0J4OjmjKjnmPK1K3J8J5K2L0L0K2J2PKrk1l3l9l7k8
3074A88k0j7j6j7j0KJ3J6Rmj4k2k6k8k3j6lJ0K0K7K4J8J4K0K6K1Qlmjlj2j6j2mJNJ0J7J5M
3057A97qj6j9j8j4qjRJ7K1K2J6Mqj6j3oJLjprnKJ2J7K1K2K0J9J6J2%j7l1l2k2j0j%lokLNj
$$ plain form
3183 93 126 159 181 191 198 211 229 247 263 277 288 294 292 286 278 266 250 235 231 239 250 254 248 237 229 226 226 233 248 272 298 314 312 297 279 266 258 248 230 206 186 178 183 192
3165 192 197 193 179 165 157 157 157 151 141 138 148 168 184 191 187 175 157 135 114 100 94 98 107 121 139 156 168 174 179 189 200 204 201 200 201 201 192 175 153 129 104 82 67 59 53 48
3147 48 46 55 73 92 99 94 88 93 104 108 102 98 110 137 165 186 205 230 258 283 298 296 276 253 244 254 272 286 290 290 289 292 300 312 320 319 308 289 267 244 225 210 201 200 206 218
3128 218 227 231 231 232 232 224 209 189 169 155 148 147 146 144 144 152 165 180 193 205 215 222 225 222 216 213 213 214 212 198 171 133 98 78 75 80 82 81 83 92 104 109 106 96 80 58 39 29 33
3109 33 47 72 109 156 201 231 243 241 229 213 198 190 189 194 200 207 216 226 229 221 201 179 162 150 137 119 98 78 66 61 63 71 85 103 125 150 169 176 167 146 124 111
3092 111 110 119 131 139 142 141 137 132 123 107 84 62 50 54 72 96 120 140 154 160 159 155 154 156 155 150 146 153 174 197 215 230 252 282 312 334 346 353 355 346 325 292 253 216 188
3074 188 168 151 135 118 108 110 123 139 148 144 130 108 82 54 31 15 12 22 42 69 93 111 125 145 171 192 200 197 193 192 189 177 161 149 145 146 151 161 178 193 197
3057 197 189 173 154 136 122 114 113 122 139 160 182 198 202 194 178 165 159 160 163 162 155 146 141 143 155 172 193 215 235 254 270 282 282 265 234 202 180 170 169 169 166 160 158 161 166 165
3039A65qj3j1qpmLJ4K2K7K9L0K2Rqj8k5k6k1pJ0J2jj9k4j5kJ0K1K6K2Rpj7j9j3LJ9K4J3jq
3022B08j0j1qjJ0J3J1J1RMlj0j1j3j5j9j9j0MK1L1L3K5J5Koj0lKJmpn%LQJ3J3J0NKlppjOK
3003B79nj0rjQJ7J9J7J6J6J1lk2l3l8l7l2j8JPJlOJ8K1J0jorj4k1k4k3j8rkKLOJ3K4K9L1K9
2986B46K8K3J8Ooj5j5p%%oj2j2qmKNNnj9k7k1j3j5k4k7j4NJ5J1kj2j1nNRQM%jmppkOQ%rj0
2966H4%J4J9J1%qpprj1j1nNJ9K6K5J4kj2j6r%OJ1J6K2K1J0mrlOJ2J2QKpj8k5l1l6l7l2k2j2
2948A0kNJ1ROOPQJ0J6K2K2J2LNJ5K3K4J6O%MPjk1l9l7k0jRJ5K2K6J7kj3j5rojRK2K5J6OMR
2929B60J0Jj0j6j1ooj0j3qlLRK0L0K8J4lj2rJJ1J6J5Qlj3j7j7j6j4qKRQJmjJ%oj3j6j7j6j0
2910A69kKKLOJ2K1K0Lk5m2l5j0J7L1L2J8kj6j4jNnk0k6k2j5mRJ7J6Rjqj3pNJ3Qnj5j7j4oJ4
$$ plain form
3039 165 157 144 133 125 118 114 117 131 153 180 209 239 261 270 262 244 219 193 172 165 175 187 186 167 143 128 126 136 157 183 205 214 207 190 171 158 161 180 204 217 216 208
3022 208 198 187 179 178 188 201 212 223 232 236 233 223 212 199 184 165 146 136 140 161 192 225 250 265 267 261 251 248 250 251 247 240 235 235 238 246 259 272 282 287 289 286 279 272 271 277 279
3003 279 274 264 255 254 262 279 298 315 331 347 358 355 333 300 262 225 193 175 176 183 184 181 187 205 226 236 235 229 220 206 185 161 138 120 111 109 111 114 120 133 157 186 217 246
2986 246 274 297 315 321 315 300 285 278 278 278 272 260 248 240 236 238 243 248 243 224 197 176 163 148 124 97 83 88 103 114 112 100 89 84 89 98 106 110 110 109 105 98 91 89 95 103 103 94 84
2966 84 84 98 117 128 128 120 113 106 97 86 75 70 75 94 120 145 159 157 145 129 120 120 126 137 153 175 196 206 202 193 190 196 208 220 228 230 223 205 180 149 113 76 44 22 10
2948 10 8 13 24 33 39 45 52 60 70 86 108 130 142 145 150 165 188 212 228 234 234 238 245 244 223 184 147 127 126 135 150 172 198 215 213 200 185 176 170 169 178 200 225 241 247 251 260
2929 260 270 271 261 245 234 228 222 212 199 191 188 191 200 220 250 278 292 289 277 268 269 280 296 311 319 316 303 286 269 253 239 231 233 242 250 251 247 246 247 247 241 228 212 195 179 169
2910 169 167 169 171 174 180 192 213 233 236 211 169 134 124 141 172 204 222 220 204 190 189 194 189 169 143 121 106 102 111 128 144 153 152 144 131 124 129 142 150 145 130 113 99 93 107
2892A07L5M4L6K8K9L1K3Rjk%%JJnj6k2k1j0KJ1J1MkjOJ0J2J1Rkj6k6k6k6l0l5l5k3oJ5K7L0
2875A87K5J8J3QLkpj4j9j5oMOMOPQNNJ3J7J2%mLJ8K6J7kj8k0j2mlolMRNkqoKQJ1PJlpo%J0
2854B95J6J2jj3j5j2omnrj3k1k4j9qKPJ0J0J2J5K0K0J7J0Kkoo%OPLnj0j0okkrj7k2k1k0k1
2836A55k2k4k4j8pQJ9K1J9J7J9J6Qpj8k1j8j3j0kJ0K3K4J7J2J0Lj3k9l1j8lNMKMPJ0RNlj1
2819A35j5qOJ9K1J6J2Plj5j6oPOoj8k3k0oJ1K2K2J3ROJpq%MLLJ1J9K1J8J3%j8k9k7j6qj0j3
2801A33j1mMRQJmlKNQJ1J3PJLJ4J9Rj1k6k4j6j0j5k7l2k7j4JJ6K8L1K0Lj0j4j0okJNOQJ2J1
2783A23PJJMPOLklLRRKmlnj3k7l1k6j2MJ5J5P%LJ1J7K0J7J0mj5j6qJMMOJ1J6K7L5L3J8%j6
2763B64k3k3j5jJ5K9L7M1L7K3Mj5l0m2m7m1l1k3k2k2j6lJ3K2K2J3OQJ4J9J3Lpj5j9j6qMJ0
$$ plain form
2892 107 142 186 222 250 279 310 333 342 341 339 339 339 340 341 336 320 298 277 267 269 280 291 295 293 292 298 308 320 331 340 338 322 296 270 244 214 179 144 121 115 130 157 187
2875 187 212 230 243 251 254 252 245 231 212 197 191 195 201 205 211 218 226 231 236 249 266 278 278 274 277 295 321 338 336 318 298 286 282 279 273 270 274 283 288 286 278 272 274 282 293 300 301 298 291 285 285 295
2854 295 311 323 322 309 294 282 276 272 267 258 245 224 200 181 173 175 182 192 202 214 229 249 269 286 296 298 296 290 284 284 290 297 300 295 285 275 269 267 265 256 239 217 196 176 155
2836 155 133 109 85 67 60 68 87 108 127 144 163 179 187 180 162 141 123 110 100 98 108 131 155 172 184 194 197 184 155 124 106 103 108 112 114 118 125 135 144 149 146 135
2819 135 120 112 118 137 158 174 186 193 190 175 159 153 160 166 160 142 119 99 93 104 126 148 161 170 176 177 170 162 162 166 169 172 183 202 223 241 254 254 236 207 180 164 156 146 133
2801 133 122 118 122 131 139 140 136 133 135 140 148 159 172 179 180 183 197 216 225 214 188 164 148 138 123 96 64 37 23 24 40 68 99 119 122 112 98 88 82 80 81 86 92 100 112 123
2783 123 130 131 132 136 143 149 152 150 147 150 159 168 170 166 163 158 145 118 87 61 49 53 68 83 90 90 93 104 121 141 158 168 164 149 133 125 126 130 134 140 151 167 194 229 262 280 280 264
2763 264 241 218 203 202 217 246 283 324 361 384 388 373 343 301 254 213 182 159 137 115 99 96 109 131 153 166 172 180 194 213 226 229 222 207 188 172 164 168 178
2748A78Mj0j7j0RK0J5KmJNJnm%KKjllJOJ1J1QQNJjLJ1J6J4J2Omk4l6l5k3j3j0pllrj5rKJ1
2728A16Q%pj3j4mJ8L7M0K1jrn%J%J%qj9j9qORkroOJ6J4J1POQJ4K2J8kk0j9mMjj0j2rj0j3j7
2708A42k0k0j2%QJ1J6K4K8J8JnLJ5J6Kj7k7k5j2LJ3J6J6J4J3ROMMONmj7k4j7JJ8K5K1J0kj0
2691B56qLJ7K3K1J5J3J6J9Qj5l6l9k7j2mnoj0j2qPK1K4J6KnlJPPMjmj1j9k3j8j2j0j7k2k3
2674A30k1j4%J6J9Nj5k4j6MK3L0K5K1K3K4J4mj7j9j4j3j2nJ3K6K9K2J1kj5k9l8l7k4rLONM
2657A25QJ4J3Lj0k2k9k8j9qMJ3J5J2jk1l6l5j7PK5L6M0L7L1K2J8J9J9K0K1J8Rnj3r%N%j0j5
2641B56j5j0n%%mj1j6j1J0L3L8J7qj6pKMMQRjj5j9oJ1J4Lj5k4j9mNMLLLmj4j6pKJrk1k3j7
2622A13pJJmrj1nQK1K8K6J3jpmQJ6J6NooQK2K3J1mj8l0l7l2j1J7L5L5K1mk7l9l6k2qkMJ1J8
$$ plain form
2748 178 182 172 155 145 154 174 189 191 187 188 193 194 189 185 185 187 189 188 185 182 183 189 200 211 219 227 232 233 232 235 246 262 276 288 294 290 266 230 195 172 159 149 142 139 136 127 112 103 105 116
2728 116 124 124 117 104 90 86 104 141 181 202 201 192 187 187 188 188 189 189 181 162 143 135 141 150 148 139 133 139 155 169 180 187 193 201 215 237 255 253 233 214 210 214 213 203 191 182 172 159 142
2708 142 122 102 90 90 98 109 125 149 177 195 196 191 194 209 225 227 210 183 158 146 149 162 178 194 208 221 230 236 240 244 250 255 251 234 210 193 194 212 237 258 268 266 256
2691 256 248 251 268 291 312 327 340 356 375 383 368 332 293 266 254 250 245 239 229 217 209 216 237 261 277 279 274 271 272 279 286 290 289 285 274 255 232 214 202 192 175 153 130
2674 130 109 95 95 111 130 135 120 96 80 84 107 137 162 183 206 230 244 240 223 204 190 177 165 160 173 199 228 250 261 259 244 215 177 140 116 107 110 116 121 125
2657 125 133 147 160 163 153 131 102 74 55 47 51 64 79 91 90 69 33 -2 -19 -12 13 49 89 126 157 179 197 216 235 255 276 294 303 298 285 276 276 281 281 271 256
2641 256 241 231 226 226 226 222 211 195 184 194 227 265 282 274 258 251 253 257 261 269 278 277 262 243 237 248 262 265 250 226 207 203 208 212 215 218 221 217 203 187 180 182 183 174 153 130 113
2622 113 106 107 108 104 95 84 79 87 108 136 162 175 174 167 163 171 187 203 208 202 196 204 226 249 260 256 238 208 171 139 128 145 180 215 236 232 205 166 130 108 100 98 102 113 131
2604A31J8J1LLNPNQJ5K0J6Qkj1k3l5l7k9j8qkLRJ0PNJ3K8M5N1M1K5J1PLnj1qjlj1j7j4lMN
2586B79lj4k3k0qJjqj1oLJ1J2QKlmk%jnlKQJ3Qok2l6l6k6j1pj0j1kJ2J8J4POLklLJ3J4J0%
2566A63qj7j9j1NJ9K1J4RJ1J6J7Qoj9j6mQRJj0j5j7j5j1oJJ4K6K2NqpMKj6l1k9j3QK3K9K6
$$ plain form
2604 131 149 160 163 166 171 178 183 191 206 226 242 250 248 237 214 179 142 113 95 87 85 88 97 107 114 119 132 160 205 256 297 322 333 340 343 338 327 319 318 315 304 287 273 270 274 279
2586 279 276 262 239 219 211 212 211 203 192 186 189 200 212 220 222 219 215 213 213 212 207 204 206 214 227 235 229 207 171 135 109 98 91 81 70 68 80 98 112 119 125 128 126 123 126 139 153 163 163
2566 163 155 138 119 108 113 132 153 167 176 187 203 220 228 222 203 187 183 191 200 201 191 176 159 144 133 127 128 142 168 190 195 187 180 184 186 170 139 110 97 105 128 157 183
$$ [...]
-2084A29
##END=	
##END=	
