##TITLE=	Jul23-2022.40.fid
TM-VI-285, Bz-pyr, CD3OD

##JCAMP-DX=	6.0	$$ MestReNova 14.3.1-31739
##DATA TYPE=	LINK
##BLOCK_ID=	1
##BLOCKS=	2    
##ORIGIN=	Mestrelab Research S.L.
##OWNER=	hrzepa
##$MNOVA/LINK_BLOCK_TYPE=	ITEM	$$ NMR Spectrum
##$MNOVA/ITEM/POLYGON=	(XY..XY)
5321,5835
8722,5835
8722,8208
5321,8208
5321,5835
##$MNOVA/ITEM/Z=	0
##$MNOVA/ITEM/ANGLE=	0
##TITLE=	Jul23-2022.40.fid
##JCAMP-DX=	6.0	$$ MestReNova 14.3.1-31739
##BLOCK_ID=	2
##DATA TYPE=	MNOVA NMR VIEW DATA
##DATA CLASS=	MNOVA VIEW DATA
##$MNOVA/ITEM/ZOOM/X=	-4.005464102252559222,	16.005770000004368114
##$MNOVA/ITEM/ZOOM/Y=	-1271.0411973595619202,	13974.8726806640625
##END=	
##TITLE=	Jul23-2022.40.fid
##JCAMP-DX=	6.0	$$ MestReNova 14.3.1-31739
##BLOCK_ID=	3
##DATA TYPE=	NMR SPECTRUM
##DATA CLASS=	XYDATA
##NUMDIM=	1
##ORIGIN=	Bruker BioSpin GmbH
##OWNER=	nmr
##.OBSERVE FREQUENCY=	400.4124024600000098
##.OBSERVE NUCLEUS=	^1H
##.SOLVENT NAME=	MeOD
##.PULSE SEQUENCE=	zg30
##LONGDATE=	2022/07/23 17:16:00.000
##.ACQUISITIONMODE=	SIMULTANEOUS (DQD)
##$ORIGINAL FORMAT=	Bruker XWIN-NMR
##$MNOVA/SCALES_VERSION=	9
##$PARAMETER FILE=	(acqus, ASCII, /private/var/folders/f6/rjf_tdyn2v98c5c0wvkgn4s80000gn/T/Khjr2pUtRoKHD9okQDgndg/40/acqus, 0)
$$ ##TITLE= Parameter file, TOPSPIN		Version 3.2
$$ ##JCAMPDX= 5.0
$$ ##DATATYPE= Parameter Values
$$ ##NPOINTS= 11	$$ modification sequence number
$$ ##ORIGIN= Bruker BioSpin GmbH
$$ ##OWNER= nmr
$$ $$ 2022-07-23 17:16:41.833 +0100  nmr@CZC10666PP
$$ $$ /opt/topspin/data/agmb/nmr/Jul23-2022/40/acqus
$$ $$ process /opt/topspin3.2/prog/mod/shimcntl
$$ ##$ACQT0= -2.36344537815126
$$ ##$AMP= (0..31)
$$ 100 100 100 100 100 100 100 100 100 100 100 100 100 100 100 100 100 100
$$ 100 100 100 100 100 100 100 100 100 100 100 100 100 100
$$ ##$AMPCOIL= (0..19)
$$ 0 0 0 0 0 0 0 0 0 0 0 0 0 0 0 0 0 0 0 0
$$ ##$ANAVPT= -1
$$ ##$AQSEQ= 0
$$ ##$AQ_mod= 3
$$ ##$AUNM= <au_zg>
$$ ##$AUTOPOS= <13 >
$$ ##$BF1= 400.41
$$ ##$BF2= 400.41
$$ ##$BF3= 400.41
$$ ##$BF4= 400.41
$$ ##$BF5= 400.41
$$ ##$BF6= 400.41
$$ ##$BF7= 400.41
$$ ##$BF8= 400.41
$$ ##$BYTORDA= 0
$$ ##$CAGPARS= (0..11)
$$ 0 0 0 0 0 0 0 0 0 0 0 0
$$ ##$CFDGTYP= 0
$$ ##$CFRGTYP= 9
$$ ##$CHEMSTR= <none>
$$ ##$CNST= (0..63)
$$ 1 1 145 1 1 1 1 1 1 1 1 1 1 1 1 1 1 1 1 1 1 1 1 1 1 1 1 1 1 1 1 1 1 1 1
$$ 1 1 1 1 1 1 1 1 1 1 1 1 1 1 1 1 1 1 1 1 1 1 1 1 1 1 1 1 1
$$ ##$CPDPRG= (0..8)
$$ <> <> <> <> <mlev> <mlev> <mlev> <mlev> <mlev>
$$ ##$D= (0..63)
$$ 0 1 0 0 0 0 0 0 0 0.06 0 0 0 0 0 0 0.0002 0 0 0 0 0 0 0 0 0 0 0 0 0 0 0
$$ 0 0 0 0 0 0 0 0 0 0 0 0 0 0 0 0 0 0 0 0 0 0 0 0 0 0 0 0 0 0 0 0
$$ ##$DATE= 1658593001
$$ ##$DE= 6.5
$$ ##$DECBNUC= <off>
$$ ##$DECIM= 2496
$$ ##$DECNUC= <off>
$$ ##$DECSTAT= 4
$$ ##$DIGMOD= 1
$$ ##$DIGTYP= 12
$$ ##$DQDMODE= 0
$$ ##$DR= 22
$$ ##$DS= 2
$$ ##$DSPFIRM= 0
$$ ##$DSPFVS= 20
$$ ##$DTYPA= 0
$$ ##$EXP= <proton>
$$ ##$F1LIST= <111111111111111>
$$ ##$F2LIST= <222222222222222>
$$ ##$F3LIST= <333333333333333>
$$ ##$FCUCHAN= (0..9)
$$ 0 2 0 0 0 0 0 0 0 0
$$ ##$FL1= 90
$$ ##$FL2= 90
$$ ##$FL3= 90
$$ [...]
$$ 90 74 58 42 26 10 0 0
$$ ##$Sgu3PowerLevels= (0..7)
$$ 0 0 0 0 0 0 0 0
$$ ##$Sgu4PowerLevels= (0..7)
$$ 0 0 0 0 0 0 0 0
$$ ##$Sgu5PowerLevels= (0..7)
$$ 0 0 0 0 0 0 0 0
$$ ##$Sgu6PowerLevels= (0..7)
$$ 0 0 0 0 0 0 0 0
$$ ##$Sgu7PowerLevels= (0..7)
$$ 0 0 0 0 0 0 0 0
$$ ##$Sgu8PowerLevels= (0..7)
$$ 0 0 0 0 0 0 0 0
$$ ##$SguType= 3
$$ ##$ShimPowMaxUA= (0..63)
$$ 130000 130000 130000 130000 130000 130000 130000 130000 130000 130000 130000
$$ 130000 130000 130000 130000 130000 130000 130000 130000 130000 0 0 0 0
$$ 0 0 0 0 0 0 0 0 0 0 0 0 0 0 0 0 0 0 0 0 0 0 0 0 0 0 0 0 0 0 0 0 0 0 0 0
$$ 0 0 0 0
$$ ##$ShimPowMaxUC= (0..63)
$$ 130000 130000 130000 130000 130000 130000 130000 130000 130000 130000 130000
$$ 130000 130000 130000 130000 130000 130000 130000 130000 130000 0 0 0 0
$$ 0 0 0 0 0 0 0 0 0 0 0 0 0 0 0 0 0 0 0 0 0 0 0 0 0 0 0 0 0 0 0 0 0 0 0 0
$$ 0 0 0 0
$$ ##$ShimPowMaxUG= (0..63)
$$ 524287 524287 524287 524287 524287 524287 524287 524287 524287 524287 524287
$$ 524287 524287 524287 524287 524287 524287 524287 524287 524287 0 0 0 0
$$ 0 0 0 0 0 0 0 0 0 0 0 0 0 0 0 0 0 0 0 0 0 0 0 0 0 0 0 0 0 0 0 0 0 0 0 0
$$ 0 0 0 0
$$ ##$ShimPowRcbType= 3
$$ ##$ShimPowRes= (0..63)
$$ 1e-20 1e-20 1e-20 1e-20 1e-20 1e-20 1e-20 1e-20 1e-20 1e-20 1e-20 1e-20
$$ 1e-20 1e-20 1e-20 1e-20 1e-20 1e-20 1e-20 1e-20 0 0 0 0 0 0 0 0 0 0 0 0
$$ 0 0 0 0 0 0 0 0 0 0 0 0 0 0 0 0 0 0 0 0 0 0 0 0 0 0 0 0 0 0 0 0
$$ ##$ShimPowRng0= (0..63)
$$ 1 1 1 1 1 1 1 1 1 1 1 1 1 1 1 1 1 1 1 1 0 0 0 0 0 0 0 0 0 0 0 0 0 0 0 0
$$ 0 0 0 0 0 0 0 0 0 0 0 0 0 0 0 0 0 0 0 0 0 0 0 0 0 0 0 0
$$ ##$ShimPowRng1= (0..63)
$$ 1 1 1 1 1 1 1 1 1 1 1 1 1 1 1 1 1 1 1 1 0 0 0 0 0 0 0 0 0 0 0 0 0 0 0 0
$$ 0 0 0 0 0 0 0 0 0 0 0 0 0 0 0 0 0 0 0 0 0 0 0 0 0 0 0 0
$$ ##$ShimPowRng2= (0..63)
$$ 1 1 1 1 1 1 1 1 1 1 1 1 1 1 1 1 1 1 1 1 0 0 0 0 0 0 0 0 0 0 0 0 0 0 0 0
$$ 0 0 0 0 0 0 0 0 0 0 0 0 0 0 0 0 0 0 0 0 0 0 0 0 0 0 0 0
$$ ##$ShimPowRng3= (0..63)
$$ 1 1 1 1 1 1 1 1 1 1 1 1 1 1 1 1 1 1 1 1 0 0 0 0 0 0 0 0 0 0 0 0 0 0 0 0
$$ 0 0 0 0 0 0 0 0 0 0 0 0 0 0 0 0 0 0 0 0 0 0 0 0 0 0 0 0
$$ ##$ShimSysFunc= (0..63)
$$ 1 2 3 4 5 7 9 11 15 16 8 10 12 14 6 17 13 18 19 20 0 0 0 0 0 0 0 0 0 0
$$ 0 0 0 0 0 0 0 0 0 0 0 0 0 0 0 0 0 0 0 0 0 0 0 0 0 0 0 0 0 0 0 0 0 0
$$ ##$ShimSysMatrix= 0
$$ ##$ShimSysType= 1
$$ ##$TFXNUM= 0
$$ ##$TRIPLO2= 0
$$ ##$VTU= 2
$$ ##$VTUETH= <149.236.99.20>
$$ ##$VTUTY= <no>
$$ ##$WBREFAM= (0..15)
$$ 135 116 100 100 100 100 100 100 100 100 100 100 100 100 100 100
$$ ##$WBREFLM= (0..15)
$$ 0 0 0 0 0 0 0 0 0 0 0 0 0 0 0 0
$$ ##$WBREFPH= (0..15)
$$ 71.66 -68.25 0 0 0 0 0 0 0 0 0 0 0 0 0 0
$$ ##$WBSGU= (0..15)
$$ 0 0 0 0 0 0 0 0 0 0 0 0 0 0 0 0
$$ ##$XFAC= 2
$$ ##END=
$$ 
##$DECIM=	2496
##$DSPFVS=	20
##XUNITS=	HZ
##YUNITS=	ARBITRARY UNITS
##FIRSTX=	6408.8703656999996383
##LASTX=	-1603.8278811825093726
##DELTAX=	-0.12226593800080123864
##XFACTOR=	1
##YFACTOR=	0.0098512344217098930799
##FIRSTY=	7.6588330268859863281
##MINY=	-0.59820419549942016602
##MAXY=	12704.4296875
##NPOINTS=	65536
##XYDATA=	(X++(Y..Y))
$$ [...]
2884D060l1l5k4j2j6l4n6p3q1p2m9l3l2l4j9%ll0m8l7j3nj3k0k0j7j1jJ4J9J6J5K6L5L2K1
2879C419Qnk1l7l9k4lPMj2k9m1m0l5l3l5l4k0mlk5m4m1j2J9K8J6jj3j9l1m5n4m7k6qkjKOO
2874B731Jmj5l2m9n0l2j5j0rKJ4J1mj3rmj0k4l9m6m1k4%J2QLPJ9K5K7L2K9J1pqNPrk0jL4N8
2869B561O2N9N3M3K8J2KKRJ7J5JjJ3L2K6mk9l2k5k6l3l2j9omkOK0L2L5L5L7M4M9M9M1L4L3
2864C137L6L6K4Jk1k9l0l1l9m1k8j2jLMlk0l4k9pJ0J4J7K9L9L5K2J2J1J8K8L3K0ok8k7j6q
2860C119jJ2K5K3Nj0rnqj6k7l3l6m1m6m8l8j3J1J8RMJ1K3L0K8K7L6M7N2M3K9K2K9L3K0j0l5
2855C280m7n3n2m5m1n5q0q4n6k1j2k4k5j4pj1j1MJ7Qk3n1n8m4k2j0rpjlj7l8m8m5m4m6m2k7
2850B136j7k3l4l5l0k6k1j1%%j0j2MK4K9J9J2K2L9N2N8N7N7N5M7L0J3QK2M4N5N3M5M2L4K1
$$ y = [4060, 4029, 3994, 3970, 3958, 3942, 3908, 3852, 3779, 3698, 3626, 3577, 3544, 3512, 3478, 3459, 3459, 3456, 3426, 3378, 3341, 3328, 3323, 3310, 3290, 3270, 3253, 3242, 3241, 3255, 3274, 3290, 3305, 3331, 3366, 3398, 3419, 3427, 3422, 3401, 3364, 3325, 3301, 3298, 3305, 3309, 3297, 3268, 3227, 3187, 3152, 3119, 3084, 3050, 3030, 3026, 3023, 2998, 2954, 2913, 2901, 2920, 2948, 2964, 2963, 2950, 2931, 2900, 2855, 2801, 2754, 2728, 2720, 2718, 2717, 2719, 2725, 2731, 2732, 2728, 2713, 2681, 2632, 2582, 2550, 2535, 2525, 2516, 2518, 2532, 2543, 2539, 2526, 2517, 2513, 2503, 2479, 2440, 2394, 2353, 2329, 2329, 2341, 2349, 2352, 2359, 2378, 2403, 2430, 2462, 2491, 2502, 2495, 2487, 2492, 2499, 2490, 2470, 2469, 2503, 2561, 2623, 2682, 2735, 2778, 2806, 2818, 2820, 2822, 2831, 2848, 2863, 2864, 2863, 2876, 2908, 2934, 2930, 2901, 2869, 2844, 2818, 2785, 2753, 2734, 2728, 2724, 2722, 2728, 2748, 2780, 2815, 2850, 2887, 2931, 2980, 3029, 3070, 3104, 3137, 3173, 3209, 3233, 3234, 3213, 3184, 3154, 3123, 3084, 3043, 3015, 3003, 3002, 3005, 3009, 3006, 2986, 2952, 2923, 2916, 2926, 2940, 2957, 2986, 3025, 3060, 3082, 3094, 3105, 3123, 3151, 3184, 3204, 3198, 3170, 3143, 3127, 3119, 3118, 3130, 3155, 3178, 3183, 3173, 3164, 3159, 3151, 3135, 3108, 3075, 3039, 2998, 2952, 2904, 2866, 2853, 2864, 2882, 2891, 2895, 2906, 2929, 2959, 2987, 3014, 3050, 3097, 3149, 3192, 3221, 3243, 3272, 3305, 3325, 3315, 3280, 3233, 3180, 3128, 3083, 3042, 2987, 2907, 2823, 2767, 2746, 2734, 2710, 2685, 2671, 2664, 2653, 2642, 2646, 2663, 2671, 2648, 2597, 2539, 2495, 2473, 2463, 2454, 2447, 2446, 2443, 2426, 2388, 2340, 2295, 2251, 2205, 2163, 2136, 2119, 2096, 2062, 2027, 1997, 1971, 1950, 1939, 1939, 1939, 1929, 1917, 1921, 1945, 1974, 1993, 2005, 2027, 2066, 2118, 2176, 2233, 2290, 2345, 2392, 2422, 2435, 2443, 2465, 2509, 2564, 2617, 2662, 2704, 2738, 2759]
2846B759RQJ9K4J6PMNJ2K4M3N2L8J5LJ5L2M0L5K4J3PJj2l5n3n1l1k1k9m1l7k2rjRK5L5L6L7
2841C005M4N3N6N4M9M8M8M3L5L2M9P7R4Q4N9M3L6K5RMJ7L3K8J0%OJ8K6L1L8M2L8K8J7J2J5
2837D306K3L0L5L5L7M0L9L1J5mk2l0k6j9j7k6l8m6n0n1n5n3m2l4m1n5n4k2J7L0J3kJ0L2L7
2832D043K4J7K6L6L3J9Jk1m5m8k4M%l3o2o5n5n6o0m8k5j6l0m4m0k0nllMJ9L6N2O3N8L5Qrj3
2828C753j0kJ1J2j1m7n9l3NJ4mj9j2%%j2k3l1m7o3o4m5k2j0j6k4k8k0pOJ0Nnj0nMJ8K6K3J0
2823C268KJ0K6L0J9%j7l4n5o7o3m8l8l9m4m6m7m6m9n5n9n1l3j9k7m7n6m4l0k9l1k4j0mjOJ6
2818B264J4mk7m1m4k9KL6M3K2qj6pRK1L1L8L6L0L0M3N3M8L4K2K2L3M7N4N4M9M1L2J9Pmj4k0
2814B920k0j4j2k0l2m2m6m7m7m5m7n4o0n1l3k4l2m9n8n9n4m8l9k7k0j7j4rj0k0l7m5l9k4j2
$$ y = [2759, 2768, 2776, 2795, 2819, 2835, 2842, 2846, 2851, 2863, 2887, 2930, 2982, 3020, 3035, 3038, 3053, 3085, 3125, 3160, 3184, 3197, 3204, 3205, 3193, 3158, 3105, 3054, 3023, 3002, 2973, 2932, 2895, 2873, 2864, 2863, 2872, 2897, 2932, 2968, 3005, 3049, 3102, 3158, 3212, 3261, 3309, 3357, 3400, 3435, 3467, 3516, 3593, 3687, 3771, 3830, 3873, 3909, 3934, 3943, 3947, 3964, 3997, 4025, 4035, 4035, 4041, 4059, 4085, 4116, 4154, 4196, 4234, 4262, 4279, 4291, 4306, 4329, 4359, 4394, 4429, 4466, 4506, 4545, 4576, 4591, 4587, 4565, 4535, 4509, 4490, 4473, 4447, 4409, 4363, 4313, 4262, 4207, 4154, 4112, 4078, 4037, 3982, 3928, 3906, 3923, 3953, 3966, 3964, 3974, 4006, 4043, 4067, 4084, 4110, 4146, 4179, 4198, 4199, 4178, 4133, 4085, 4061, 4065, 4065, 4032, 3970, 3905, 3850, 3794, 3734, 3686, 3661, 3645, 3615, 3571, 3531, 3511, 3506, 3503, 3500, 3504, 3523, 3559, 3611, 3674, 3732, 3767, 3775, 3766, 3753, 3743, 3741, 3752, 3764, 3753, 3706, 3647, 3614, 3619, 3633, 3629, 3610, 3598, 3598, 3598, 3586, 3563, 3532, 3485, 3422, 3358, 3313, 3291, 3281, 3265, 3241, 3213, 3193, 3186, 3192, 3202, 3207, 3202, 3192, 3187, 3191, 3209, 3235, 3258, 3268, 3270, 3280, 3306, 3336, 3355, 3355, 3338, 3304, 3249, 3182, 3119, 3071, 3033, 2994, 2950, 2904, 2857, 2811, 2762, 2707, 2648, 2597, 2564, 2545, 2518, 2471, 2415, 2371, 2341, 2312, 2281, 2257, 2247, 2243, 2242, 2248, 2264, 2278, 2274, 2247, 2206, 2162, 2133, 2135, 2171, 2214, 2236, 2228, 2212, 2205, 2214, 2235, 2266, 2304, 2340, 2370, 2400, 2443, 2496, 2544, 2578, 2600, 2622, 2655, 2702, 2756, 2810, 2859, 2900, 2932, 2951, 2958, 2954, 2940, 2920, 2900, 2886, 2874, 2854, 2822, 2780, 2734, 2687, 2640, 2595, 2548, 2494, 2434, 2383, 2350, 2326, 2294, 2245, 2187, 2128, 2074, 2026, 1987, 1960, 1940, 1923, 1909, 1900, 1890, 1870, 1833, 1788, 1749, 1725, 1713]
2809A713j5k5k7j9j2j7k6k3lJ9K4J1pj3nNO%pqnOJ7K1J0j1k1qJ7L4L0J8Lj3k7l0k1j2j4j7
2804A548JL2N2M4J8mj3j3q%PLj1k2k4j6j1j0j3qNK9N3O3N6L5J6Jrj7k1j6lJ0J4J0L%PJ8L3
2799A839M6M8L4J4OJ4K3J5qj5ML5N5O0O8R0J18J37J46J49J46J34J17J00Q8P4N3K7Pqk5n3q7
2795C451j13j24j24j17j11j03q9p8p6q4q0n8l4l9o1o8l9jJ1Jj0j0j2j8j7j3k1m1m8k7J1M0
2791A898N0M4K5%j0%J5K6L4N0O0N3L9L2L6L7K9K2K0J4LMK0M2N1M7L1J7J8M7Q5R6O9L7L9P3
2787C153J08J30J44J56J62J54J42J30J08P6N0L8K8Nl1n6n8m7m0l7l3k5j6mJ7M1N4M6L4L5M8
2783D512O7Q0Q7Q8P7O0M5L0J6JkNNj3l1l5k7k4k2j1J2L3M3N0N8O0N1M4N4P1Q0P5P1P9Q8R7
2779E874J01J08J13J12J12J25J49J73J83J79J75J74J68J58J49J50J50J32J03Q4Q7J00J13J19
$$ y = [1713, 1698, 1673, 1646, 1627, 1615, 1598, 1572, 1549, 1546, 1565, 1589, 1600, 1593, 1580, 1575, 1580, 1586, 1586, 1579, 1571, 1566, 1572, 1589, 1610, 1620, 1609, 1588, 1580, 1597, 1631, 1661, 1679, 1682, 1669, 1642, 1612, 1591, 1579, 1565, 1548, 1549, 1581, 1633, 1677, 1695, 1691, 1678, 1665, 1657, 1657, 1664, 1667, 1656, 1634, 1610, 1594, 1583, 1573, 1560, 1552, 1557, 1586, 1639, 1702, 1758, 1793, 1809, 1810, 1801, 1784, 1763, 1747, 1744, 1754, 1768, 1778, 1781, 1781, 1788, 1806, 1839, 1885, 1933, 1967, 1981, 1987, 2001, 2024, 2039, 2031, 2016, 2020, 2055, 2110, 2170, 2238, 2328, 2446, 2583, 2729, 2878, 3024, 3158, 3275, 3375, 3463, 3537, 3590, 3617, 3624, 3616, 3591, 3538, 3451, 3338, 3214, 3090, 2973, 2862, 2759, 2670, 2592, 2516, 2432, 2352, 2294, 2260, 2221, 2160, 2092, 2053, 2052, 2063, 2064, 2054, 2044, 2032, 2014, 1997, 1984, 1963, 1922, 1874, 1847, 1858, 1898, 1948, 1992, 2017, 2017, 2007, 2007, 2022, 2048, 2082, 2132, 2192, 2245, 2284, 2316, 2352, 2389, 2418, 2440, 2460, 2474, 2477, 2481, 2501, 2543, 2594, 2641, 2672, 2689, 2707, 2754, 2839, 2935, 3004, 3041, 3080, 3153, 3261, 3391, 3535, 3691, 3853, 4007, 4149, 4279, 4387, 4463, 4513, 4551, 4579, 4584, 4553, 4497, 4439, 4392, 4352, 4315, 4282, 4257, 4241, 4237, 4254, 4295, 4349, 4395, 4429, 4464, 4512, 4579, 4659, 4746, 4834, 4911, 4971, 5016, 5046, 5062, 5063, 5061, 5066, 5071, 5058, 5027, 4992, 4965, 4941, 4919, 4908, 4920, 4953, 4996, 5046, 5104, 5164, 5215, 5259, 5313, 5384, 5464, 5539, 5610, 5689, 5777, 5874, 5975, 6083, 6196, 6308, 6420, 6545, 6694, 6867, 7050, 7229, 7404, 7578, 7746, 7904, 8053, 8203, 8353, 8485, 8588, 8672, 8759, 8859, 8972, 9091]
2776I091J18J09J02J20J68K20K47K48K42K43K40K27K15K15K28K43K54K62K74K88K97K89K66
2773A4206K50K61K98L35L61L86M27M81N43O02O58P09P59Q24R10J017J132J249J360J470J595
2770B9833J757J944K125K280K420K562K699K813K912L017L126L220L291L361L467L636L897
2768G8360M267M745N319O012O868P899R067J0317J1621J2948J4225J5348J6204J6706J6779
2767B36685J6377J5467J4040J2091R660O847L796O59k386n149p468r266j0549j1367j1772
2765B57665j1833j1636j1259j0765j0209r644r110q610q145p721p340o982o624o258n891n524
2763A20114n140m723m276l814l360k912k462k007j561j122o75k06K70P27J166J610K073K539
2761I6241K995L438L875M300M707N094N452N779O090O416O783P184P624Q124Q698R316R921
$$ y = [9091, 9209, 9318, 9420, 9540, 9708, 9928, 10175, 10423, 10665, 10908, 11148, 11375, 11590, 11805, 12033, 12276, 12530, 12792, 13066, 13354, 13651, 13940, 14206, 14456, 14717, 15015, 15350, 15711, 16097, 16524, 17005, 17548, 18150, 18808, 19517, 20276, 21100, 22010, 23027, 24159, 25408, 26768, 28238, 29833, 31590, 33534, 35659, 37939, 40359, 42921, 45620, 48433, 51345, 54362, 57488, 60708, 63999, 67360, 70827, 74463, 78360, 82627, 87372, 92691, 98703, 105571, 113470, 122537, 132854, 144475, 157423, 171648, 186996, 203200, 219906, 236685, 253062, 268529, 282569, 294660, 304320, 311167, 314963, 315622, 313236, 308087, 300619, 291353, 280804, 269437, 257665, 245832, 234196, 222937, 212172, 201963, 192319, 183209, 174599, 166454, 158733, 151393, 144411, 137787, 131529, 125638, 120114, 114974, 110251, 105975, 102161, 98801, 95889, 93427, 91420, 89859, 88737, 88062, 87856, 88126, 88853, 90019, 91629, 93702, 96241, 99236, 102674, 106549, 110849, 115556, 120650, 126102, 131881, 137971, 144387, 151170, 158354, 165978, 174102, 182800, 192116, 202037]
2758B02037J0453J0851J1045J0960J0536R717Q462O773M707K340k57l002n754q339j0594j2412
2757B47523j3717j4481j4733j4561j4057j3301j2372j1359j0317r272q252p299o447n696n032
2755H6627m470m024l690l432l227l067k956k884k839k796k733k637k516k396k284k177k057
2753C6442j927j796j668j544j424j312j217j132j047r65q93q37p84p22o59o12n74n31m83m45
2750A5870m30m28m18l91l54l14k83k65k58k46k30k17k15k14k12k13k11j98j72j53j51j52j39
2747A0006j17j07j09j04q7p5q2r6j05j09j16j26j32j28j21j16j12j13j16j26j35j40j37j24
2744G273j09r1o8m3k5k2k9m5o5r0j06j08j00r6r7j00j05j15j25j17r3p6p8r0j01j04j06r9
2741D870q6p9q7r2p7m9k9k6k5k5l3n1o3n3k9j3j1j0kRQlj4j3m%pj5j9j3kJ1K4L3L2K2Ol%J4
$$ y = [202037, 212490, 223341, 234386, 245346, 255882, 265599, 274061, 280834, 285541, 287881, 287624, 284622, 278868, 270529, 259935, 247523, 233806, 219325, 204592, 190031, 175974, 162673, 150301, 138942, 128625, 119353, 111101, 103802, 97355, 91659, 86627, 82157, 78133, 74443, 71011, 67784, 64717, 61761, 58877, 56038, 53242, 50509, 47872, 45356, 42960, 40676, 38499, 36442, 34515, 32719, 31051, 29507, 28083, 26771, 25554, 24422, 23375, 22410, 21517, 20680, 19896, 19174, 18515, 17903, 17329, 16798, 16315, 15870, 15440, 15012, 14594, 14203, 13849, 13535, 13252, 12987, 12729, 12483, 12253, 12036, 11821, 11607, 11395, 11182, 10971, 10773, 10601, 10448, 10297, 10145, 10006, 9889, 9782, 9673, 9569, 9482, 9407, 9325, 9229, 9124, 9015, 8899, 8773, 8641, 8513, 8392, 8276, 8164, 8051, 7935, 7809, 7674, 7534, 7397, 7273, 7164, 7073, 7005, 6962, 6937, 6915, 6886, 6841, 6776, 6686, 6580, 6472, 6372, 6276, 6179, 6079, 5974, 5859, 5734, 5617, 5524, 5448, 5370, 5280, 5179, 5075, 4969, 4870, 4784, 4705, 4618, 4526, 4449, 4400, 4371, 4345, 4320, 4295, 4262, 4211, 4148, 4095, 4066, 4053, 4042, 4032, 4030, 4039, 4047, 4044, 4030, 4017, 4013, 4013, 4006, 3991, 3972, 3959, 3957, 3968, 3992, 4025, 4057, 4079, 4085, 4082, 4082, 4096]
2736D096K4J4qk2j6pj3k3k4j0knj3k2l5n3o0n1m0n3q5j08j06q0n0j8jpl6o5p2o1m4k5pMnj8
2731B893k0rj4l9o7p0n2l5k5k4k8l9m1k3KQpj8mJ5K0PJRJ7Rrj7qJ0J7Mj5j6RM3N9L8qm5n3
2726B475l1oJ1J7K2K6K0Lj6k0kK2L1J5rj2PK9K8J6J6L5N4O3P2Q6R1P5M4J4jlNQnk9m5m4m3
2722C019n5p7r0r0q5p6o5n5n2m9l7j5nj0k3k6k0j4j4j7k1k4l1m0m7m0k2kPLjPK4L0J4qj3j
2717A979RJ1J6L1M6M4L3L2M1M1K4QKLNJ6L3M1K5QRK5L1K5K1K5K2nm9q8r9p9m9l3m0n2n5n9
2712A998p6q7p4m6k8k2j3LNpj4nLjplmk2m9n4l3oJ4K8L5K9J3jom%MKjLJ4K2J7NMJ5J8Mk3m0
2707A610m0k4nJ1K7L8L6J2k0l4k5j0j3k7l5k8j5qpnjjqj9k1j9j9k7l5l3k9k9l3l0k2k1k3j2
2702A056RK2J7QJ0J5J1J0K6M6M5K6J5K5L3K3P%MMmj2j0%RRjplLLknmmqrj1j1lJ0J1j1m4n5
$$ y = [4096, 4120, 4134, 4126, 4104, 4088, 4081, 4068, 4045, 4021, 4011, 4009, 4004, 3991, 3969, 3934, 3881, 3821, 3770, 3730, 3677, 3592, 3484, 3378, 3298, 3248, 3230, 3229, 3222, 3186, 3121, 3049, 2988, 2944, 2919, 2912, 2916, 2911, 2893, 2873, 2864, 2850, 2811, 2744, 2674, 2622, 2587, 2562, 2538, 2510, 2471, 2430, 2407, 2409, 2417, 2410, 2392, 2388, 2403, 2423, 2430, 2431, 2440, 2457, 2466, 2457, 2440, 2432, 2442, 2459, 2463, 2448, 2432, 2441, 2484, 2543, 2581, 2573, 2528, 2475, 2444, 2438, 2449, 2466, 2488, 2514, 2534, 2537, 2521, 2501, 2499, 2521, 2552, 2567, 2558, 2546, 2553, 2582, 2610, 2626, 2642, 2677, 2731, 2794, 2866, 2952, 3043, 3118, 3162, 3176, 3175, 3172, 3177, 3185, 3180, 3151, 3106, 3062, 3019, 2964, 2887, 2797, 2707, 2622, 2546, 2481, 2426, 2374, 2325, 2288, 2273, 2268, 2258, 2235, 2209, 2189, 2175, 2161, 2144, 2123, 2099, 2068, 2028, 1981, 1941, 1919, 1917, 1924, 1927, 1926, 1933, 1957, 1987, 2001, 1993, 1980, 1979, 1988, 1999, 2015, 2046, 2092, 2136, 2169, 2201, 2242, 2283, 2307, 2315, 2317, 2320, 2325, 2341, 2374, 2415, 2440, 2448, 2457, 2482, 2513, 2538, 2559, 2584, 2606, 2601, 2552, 2464, 2365, 2286, 2237, 2204, 2164, 2112, 2057, 1998, 1922, 1835, 1761, 1715, 1687, 1665, 1652, 1655, 1660, 1653, 1639, 1634, 1637, 1636, 1629, 1626, 1622, 1600, 1551, 1497, 1464, 1458, 1472, 1500, 1535, 1564, 1577, 1576, 1570, 1566, 1566, 1570, 1572, 1571, 1574, 1588, 1610, 1627, 1632, 1636, 1651, 1669, 1673, 1650, 1610, 1570, 1546, 1541, 1552, 1579, 1617, 1653, 1665, 1645, 1611, 1586, 1576, 1563, 1536, 1501, 1473, 1458, 1450, 1443, 1438, 1437, 1436, 1428, 1409, 1388, 1369, 1350, 1323, 1288, 1255, 1226, 1197, 1164, 1134, 1112, 1091, 1068, 1056, 1065, 1087, 1104, 1112, 1122, 1137, 1148, 1158, 1184, 1230, 1275, 1301, 1316, 1341, 1374, 1397, 1404, 1404, 1408, 1412, 1408, 1396, 1386, 1386, 1395, 1404, 1403, 1396, 1393, 1396, 1399, 1397, 1392, 1388, 1384, 1376, 1367, 1356, 1345, 1342, 1352, 1363, 1352, 1308, 1253]
2697A253l9k0pMQok9k9jK7K2JoLKj7k7j9qrj2j0kJjnj2k1j8kK2L3K3nl0l9k8kK4M3M3L2K0
2691A157J6K1J7Kj2j4pkjNK0L6M2L4J6jpOK5K9K0J2J7K5K8K6K9M0M9N5O2P3P8O7N2M7N7O6
2687B185O2M9L5K8L0M3O3P5O8N4N4Q0J07J14R5P0N5N2N1L4lm2o3o2o4p8q7p6o0o6r0r8p7n5
2683B483o4r5j11r3n5k7k2k5k9l0l1k9j7nok1l3k4kJ5K2L0M3M8M1L4L5M3M5M5M4M5M3M5N2
2678B394N4M7L5L4L7K8Oj1JK6L7K4PRK5L5K8K1K0J9Ooj3k1m2o7p2o1n2n6o6p3q3r6j03r6q8
2674A887q6q3p3o4o7o8n3k6j1j8l6n8o9o3m1k3k3l0l2k7l0l6l0j5nj1j8j8j9k0j0J3K9K0J
2670G87qmJPJ1J2KnLJ9K3J2lj4j9k0j1LPmj6j6j1olMJ0Opj8j8j7j8k1j8oJ0K2K5K4K3K0J4
2664G82Kj0j4qLJ1J3J1Jj5k8k5j0jj0l1m2l2qJ3K2K5J8Mj5k5k1mQ%j9k7rJ8K7J5OQJ5J4J1
$$ y = [1253, 1214, 1194, 1187, 1191, 1199, 1193, 1164, 1135, 1134, 1161, 1183, 1184, 1178, 1181, 1183, 1166, 1139, 1120, 1112, 1103, 1091, 1081, 1079, 1080, 1079, 1074, 1062, 1041, 1023, 1021, 1043, 1076, 1099, 1094, 1064, 1025, 997, 995, 1019, 1062, 1105, 1137, 1157, 1173, 1194, 1211, 1213, 1201, 1187, 1180, 1178, 1177, 1182, 1202, 1238, 1280, 1314, 1330, 1329, 1322, 1328, 1353, 1382, 1402, 1414, 1431, 1456, 1484, 1510, 1539, 1579, 1628, 1683, 1745, 1818, 1896, 1963, 2015, 2062, 2119, 2185, 2247, 2296, 2331, 2359, 2389, 2432, 2495, 2570, 2638, 2692, 2746, 2826, 2933, 3047, 3142, 3212, 3267, 3319, 3370, 3404, 3401, 3359, 3296, 3234, 3170, 3092, 3005, 2929, 2869, 2803, 2713, 2615, 2538, 2483, 2419, 2324, 2213, 2120, 2065, 2038, 2016, 1991, 1962, 1932, 1901, 1872, 1855, 1850, 1844, 1823, 1790, 1766, 1764, 1779, 1801, 1831, 1874, 1922, 1963, 1997, 2032, 2075, 2120, 2165, 2209, 2254, 2297, 2342, 2394, 2448, 2495, 2530, 2564, 2601, 2629, 2635, 2624, 2625, 2651, 2688, 2712, 2719, 2728, 2753, 2788, 2816, 2837, 2857, 2876, 2882, 2876, 2863, 2842, 2800, 2733, 2661, 2600, 2548, 2492, 2426, 2353, 2270, 2174, 2071, 1975, 1887, 1801, 1718, 1645, 1581, 1514, 1446, 1393, 1367, 1356, 1338, 1302, 1244, 1175, 1112, 1071, 1048, 1025, 995, 963, 936, 906, 870, 840, 825, 820, 809, 791, 773, 754, 734, 724, 737, 766, 786, 787, 779, 775, 776, 783, 794, 806, 808, 803, 806, 825, 848, 860, 857, 843, 824, 804, 793, 796, 803, 799, 783, 767, 756, 750, 747, 751, 761, 767, 760, 742, 724, 707, 689, 668, 650, 644, 654, 676, 701, 725, 748, 768, 782, 784, 774, 760, 752, 755, 766, 779, 790, 791, 776, 748, 723, 713, 712, 702, 671, 629, 597, 589, 602, 624, 649, 667, 671, 656, 631, 610, 606, 614, 614, 595, 568, 559, 577, 604, 619, 625, 633, 648, 662, 673]
2659F73J2J1PMJ1J8J2OJ5L1L0Rj1j8j9k0j5qj1k1j7NK1Qj1j2jok9l8k3JRJ0J7K2J3nk1k5j9
2654F15kJ9K4Kk7l1%L4L7J2j6l2l7l8k6%K6L6L1K0J4RNMJ0J4J2Kj2j9k0j5j1j5k1j6LJ8J7
2650F26MmNJ5J1oj6j0RJ6Prj4qqj7k2qQOj3k4j5KJ5K3K8J9nk8l6k8j9j0LJ3J5PLOJ0J1NJJ
2644E69OJ2J2PLnk2m1m4k6qqj6mK7M5L5Qj0j4j0KJ7K2J4L%Jkj0j2mNPOLlj3k4k3qJ1K1J9J2
2639E60PNlj5k1j5npk3l6l3j7LK3L8M4M2L2K3J6Jk1m3m7k8NL3M6L6J3j5l2l3k4j8k0k9k5n
2634D12K5M3M2L2L0L3K4lk7l4k3j0LK0K6Rj9k4jK2K4RKKoj9k2j3%NONjoj0qlNJ3J5J2J2K1
2629F23K5J5KKJ8K9K1kk7m5m9l2qOMklmj4k3j8KK7M3M7L9K1%k0l2m1m0l3j5OL0M7N2M4K1j4
2624G02m5n4l3%K9M1L0Lk8m5l2pJ0J4J4Rnk2l0j6MJ7J8Rknj%j3l0l2j7JJ1K1L1K4LoMJ0nk1
$$ y = [673, 685, 696, 703, 707, 718, 736, 748, 754, 769, 800, 830, 839, 828, 810, 791, 771, 756, 748, 737, 716, 699, 704, 725, 733, 722, 710, 709, 703, 674, 636, 613, 614, 623, 633, 650, 672, 685, 680, 659, 634, 615, 613, 632, 656, 658, 631, 600, 600, 634, 671, 683, 667, 635, 598, 560, 534, 534, 560, 596, 627, 647, 661, 670, 675, 679, 689, 703, 715, 717, 705, 686, 666, 651, 640, 625, 604, 588, 591, 609, 626, 630, 626, 631, 646, 657, 651, 635, 625, 634, 650, 657, 648, 634, 626, 618, 601, 579, 571, 579, 585, 572, 548, 533, 535, 550, 573, 601, 620, 615, 587, 551, 523, 504, 494, 497, 510, 525, 532, 535, 541, 551, 562, 567, 568, 569, 575, 587, 599, 606, 609, 604, 582, 541, 497, 471, 463, 455, 439, 435, 462, 507, 542, 550, 540, 526, 516, 518, 535, 557, 571, 574, 574, 575, 573, 563, 551, 547, 552, 559, 565, 568, 565, 552, 528, 505, 497, 508, 529, 548, 560, 567, 572, 569, 554, 533, 518, 513, 506, 483, 447, 414, 397, 400, 423, 461, 505, 547, 579, 602, 618, 619, 598, 555, 508, 480, 485, 518, 564, 600, 613, 598, 566, 533, 509, 491, 471, 442, 417, 412, 437, 480, 522, 554, 584, 617, 641, 638, 611, 577, 554, 544, 547, 567, 593, 602, 583, 559, 558, 580, 604, 613, 615, 617, 611, 592, 570, 557, 557, 562, 568, 573, 572, 566, 556, 548, 545, 550, 563, 578, 590, 602, 623, 648, 663, 665, 667, 685, 714, 735, 733, 706, 661, 612, 580, 572, 578, 582, 580, 577, 573, 559, 536, 518, 520, 547, 590, 637, 676, 697, 697, 677, 645, 604, 564, 531, 516, 522, 552, 599, 651, 695, 716, 702, 657, 603, 570, 570, 599, 640, 670, 673, 645, 600, 568, 561, 571, 585, 599, 608, 603, 581, 551, 535, 539, 556, 574, 583, 581, 576, 575, 575, 562, 532, 500, 483, 484, 495, 516, 547, 571, 574, 568, 572, 582, 577, 556]
2618E56qK0K6PmPK2J9MojJ5L1L4J8lj4j3j2qJ2M0N2M0J7PJ1K6M5N8N3L5J9J4Ppj6rLNJjpk4
2613A071m2m5l2j8j0j4l3n3n3j7K3L3J3j0k1k7l3k7pJ0J7K0K5K2J1PJ7K7K5K2K9L7K6Lj6k7
2608I53l4l6j9J3M0N4N6N1L4QqrjKMJ1K0J6MmJJ1J5J4RMKjqk0l1l1k0j1qqqrj4k3k7k7k7k5
2603I13k1j7j8k2k3j6lOPKJOJ9K8L5L1J9%rJK2L0J7jpLRMoj0oknj8l1l1j0J1Rj6l7l1oJ0J3
2598H50QMlj1j0lLJorrrj5l1n2n6l1QL3L0J9J9K3J8Jj2j1k%nj2j5lJ6L1K4nl9m8k5J5M3M5
2592G69L1J6PKLJ1J8J2ok2k9l4l6k8pQJk3m1m1k9j6j0j4k4k7j6OK2K6K1J2JonJMLMKj1k4j7
2587E14QK4J4llRJ2POJ2Rkj1j1rpJJ3J7J0MKnk0k6j3QJ3%j0j4j5j2MK4K6Kk3k6oJ2J8J6J7
2582E86J2nk7l4k3nLL%%LJ0K0K9K6J2jj0j7k8k6mK1K4ll1l8k4j1jOJ3J6K1L5M9M1J4j1k2k4
$$ y = [556, 548, 568, 594, 601, 597, 604, 626, 645, 649, 643, 642, 657, 688, 722, 740, 737, 723, 710, 698, 690, 702, 742, 794, 834, 851, 858, 869, 895, 940, 998, 1051, 1086, 1105, 1119, 1126, 1119, 1103, 1094, 1097, 1102, 1103, 1102, 1095, 1071, 1029, 984, 952, 934, 924, 910, 877, 824, 771, 754, 777, 810, 823, 813, 792, 765, 732, 705, 698, 708, 725, 745, 770, 792, 803, 810, 827, 854, 879, 901, 930, 967, 993, 996, 980, 953, 919, 883, 864, 877, 917, 971, 1027, 1078, 1112, 1120, 1112, 1103, 1102, 1104, 1108, 1119, 1139, 1155, 1159, 1155, 1156, 1167, 1182, 1196, 1205, 1209, 1211, 1210, 1202, 1182, 1151, 1120, 1100, 1089, 1081, 1073, 1065, 1056, 1042, 1019, 992, 965, 938, 913, 892, 875, 857, 835, 812, 796, 793, 799, 806, 808, 809, 815, 834, 862, 897, 928, 947, 947, 938, 939, 961, 991, 1008, 1007, 1000, 1003, 1012, 1016, 1010, 1000, 994, 992, 987, 969, 938, 907, 897, 908, 917, 901, 864, 833, 827, 837, 850, 858, 862, 859, 848, 838, 835, 838, 839, 833, 824, 815, 806, 791, 760, 708, 652, 621, 629, 662, 692, 711, 730, 753, 771, 772, 760, 749, 747, 747, 742, 730, 715, 712, 728, 759, 783, 778, 739, 691, 666, 681, 724, 769, 800, 816, 823, 825, 828, 839, 857, 869, 863, 841, 812, 778, 742, 714, 707, 715, 716, 693, 652, 611, 582, 566, 556, 542, 518, 491, 475, 481, 503, 529, 550, 562, 563, 557, 552, 553, 557, 560, 564, 566, 555, 531, 514, 522, 546, 560, 557, 554, 563, 575, 582, 588, 600, 609, 607, 596, 585, 576, 569, 570, 583, 600, 610, 614, 616, 611, 591, 565, 552, 560, 573, 573, 563, 549, 534, 522, 526, 550, 576, 578, 555, 529, 523, 535, 553, 569, 586, 598, 593, 566, 532, 509, 504, 507, 510, 510, 510, 513, 523, 543, 572, 598, 610, 609, 599, 582, 554, 528, 524, 545, 569, 566, 535, 497, 473, 462, 461, 467, 480, 496, 517, 552, 601, 642, 656, 645, 623, 599]
2577E99k7l0k1n%qj3nOQKOK0K3Mj6j3J0K7L1K4J2j7n6p4n2qJ3PJJ4L6M2K6Jj5rRJ5jk2k2%
2571E22J6J6J3J8K2J5Jqj6k2k5j9j5rMK7L2Ok4k6lJ5J0kmlrj7j9qJ4L7M2K4oj9j4mMQPJmK
2566E80J5J2pk3j6mj0l0m0l2j5kNNLNJ0Rjj3j4pnlKQNLJ3L5M6L8K3J3POPJ3J7J0Kknrj5j7
2560F22j7k3k8k3qOJ4J5Pj4l9m4k2J3L4L0J6NJqk2l3k9j0J2K5K9K2J4J3K3L1K0rl1k6rlj3
2556E41j8jK4L4K7J6J3J1NlqmLLlqlQJ1Jj5j9j3mlmJJ2K1J2j3l8m1j3K3M0K6jj3pjkpmJkr
2550E76qNJ6J3LkLRPpk3l0k2%J2Lj6k2jK6L7K0j3m2n4m6k3jM%jLKolJ6M5O4O5N0K2j6m4m7
2545E74k1J3L2K2Jj3qMKj6k6j1K3M3L9J7pk3k4j1L%j7k7k1j2j0rJJ2Ppj0KJ0KojJ5K5J9PL
2539E96OLoj6pK0M7M9L4K6M4P1Q0O3M1L1K9L0K4J9J9K7L5L3J1k0l9l4j5NK4M1M3J9j3l3k6
$$ y = [599, 572, 542, 521, 516, 516, 508, 495, 490, 496, 504, 506, 512, 532, 555, 559, 543, 530, 540, 567, 598, 622, 634, 617, 561, 487, 435, 427, 440, 447, 448, 462, 498, 540, 566, 567, 552, 543, 552, 567, 566, 544, 522, 522, 538, 554, 567, 585, 607, 622, 623, 615, 599, 577, 552, 533, 518, 509, 513, 540, 572, 578, 554, 528, 525, 540, 550, 548, 544, 541, 532, 515, 496, 488, 502, 539, 581, 605, 599, 580, 566, 562, 566, 574, 581, 582, 578, 580, 595, 607, 600, 577, 561, 557, 547, 517, 477, 445, 430, 428, 433, 438, 441, 446, 456, 465, 464, 451, 437, 430, 425, 422, 424, 432, 437, 440, 453, 488, 534, 572, 595, 608, 615, 621, 628, 641, 658, 668, 670, 668, 663, 654, 639, 622, 605, 582, 554, 531, 523, 529, 543, 558, 565, 551, 512, 468, 446, 459, 493, 523, 539, 544, 545, 537, 515, 482, 453, 443, 455, 480, 509, 531, 545, 558, 581, 612, 632, 623, 592, 566, 557, 554, 541, 523, 522, 546, 580, 607, 623, 636, 647, 652, 649, 641, 637, 640, 643, 640, 632, 629, 637, 648, 649, 634, 615, 602, 598, 595, 591, 592, 604, 625, 637, 624, 586, 545, 532, 555, 595, 621, 620, 607, 600, 599, 597, 590, 586, 587, 585, 576, 568, 573, 589, 602, 605, 603, 606, 615, 622, 615, 592, 562, 540, 540, 552, 555, 539, 517, 516, 542, 579, 599, 586, 544, 490, 444, 421, 420, 424, 424, 423, 426, 428, 422, 419, 435, 480, 544, 609, 659, 681, 665, 621, 574, 553, 566, 598, 620, 621, 608, 600, 604, 606, 590, 564, 553, 576, 619, 658, 675, 668, 645, 621, 610, 613, 613, 596, 569, 548, 536, 526, 517, 518, 530, 537, 530, 520, 522, 532, 534, 528, 527, 542, 567, 586, 593, 596, 602, 605, 599, 583, 576, 596, 643, 692, 726, 752, 796, 867, 947, 1010, 1051, 1082, 1111, 1141, 1165, 1184, 1203, 1230, 1265, 1298, 1309, 1289, 1250, 1216, 1201, 1206, 1230, 1271, 1314, 1333, 1320, 1287, 1261]
2535A261rJjrk1l7m7m5l6l0l4m5n3n7n8n5m9m4l2j6n%QK2L2K0ok6k5j4j1j6j6qMJ8K2Nk0k9
2530E39oJ9J6j1k6j5KQPPKj0k0j5kMkj2j5kK1L9L9K3Lj5k4k1ML1L4J1nJ0L9N1L8J5mk1l4m2
2525F60m5m7l9j4J4J9Lj6j6j1pJJ5K2J2nrLRN%QK0K3J3Kpj0j4j6j8j8j5j1oMJ2J6J4J0jj2
2520E48j0QK9K9Jk3k4j0jl%PNj2k1j0J2K5K4J6Mrj3%Rkk0j4J5L6K2pj5PL6M6L4J2oqLJ4Rm
2514G39rlJ0J6K0J8J2J1K2L6L9L2L5N1N6L5Kk1k6k5j6JJ3PoJK3L1J2roJ3J8nl3m3k3QK3J0
2509A069j6k2qO%k3n0p1p9o5l2pmj4j7j3j4k3k7k1j5j0kJ3K4K1Pj2l0m2m1k4%J8K4J9J0jp
2505E21rpjRK3L2K6Qqj2jJ2J8J2mj8k5k0qJlj1j1jO%oolpj3oJ1K5L5M1M2K7Kj7k7k8k6j6o
2499E51%%RK0J8mk7l0j9qljJPJ9L3L3J0j5k5k0j4lJ7K3Oj8j9LJ2mj8pRRkLJ7J8JqMK2J9jk1
$$ y = [1261, 1252, 1253, 1252, 1243, 1222, 1185, 1138, 1093, 1057, 1027, 993, 948, 895, 838, 780, 725, 676, 632, 600, 584, 579, 579, 587, 609, 641, 661, 655, 629, 604, 590, 579, 563, 547, 539, 543, 561, 583, 588, 568, 539, 533, 552, 568, 557, 531, 516, 518, 526, 533, 540, 542, 532, 512, 497, 495, 499, 497, 485, 470, 468, 489, 528, 567, 590, 593, 578, 554, 533, 537, 568, 602, 613, 608, 618, 657, 708, 746, 761, 757, 736, 702, 660, 615, 568, 529, 515, 529, 548, 551, 535, 519, 508, 501, 502, 517, 539, 551, 546, 537, 540, 549, 554, 554, 562, 582, 605, 618, 620, 613, 603, 589, 573, 555, 537, 522, 511, 505, 509, 521, 537, 551, 561, 560, 548, 538, 546, 575, 604, 605, 582, 558, 548, 547, 544, 544, 551, 556, 544, 523, 513, 525, 550, 574, 590, 594, 585, 572, 572, 581, 579, 559, 545, 560, 596, 618, 611, 596, 603, 639, 685, 719, 731, 725, 717, 720, 734, 743, 739, 730, 727, 737, 753, 773, 791, 803, 814, 836, 872, 911, 943, 978, 1029, 1085, 1120, 1122, 1101, 1075, 1050, 1034, 1035, 1048, 1055, 1049, 1050, 1073, 1104, 1116, 1107, 1101, 1114, 1132, 1127, 1094, 1051, 1028, 1036, 1059, 1069, 1053, 1031, 1023, 1029, 1029, 1006, 956, 885, 806, 741, 709, 702, 698, 684, 667, 654, 640, 617, 590, 569, 554, 544, 542, 555, 579, 600, 607, 595, 565, 523, 482, 458, 458, 476, 500, 519, 529, 528, 521, 512, 505, 504, 513, 536, 568, 594, 602, 594, 582, 581, 593, 611, 623, 619, 601, 576, 556, 548, 549, 546, 535, 524, 523, 529, 529, 523, 517, 514, 507, 494, 488, 499, 524, 559, 600, 642, 669, 671, 654, 627, 599, 573, 557, 551, 551, 551, 560, 580, 598, 594, 567, 537, 518, 510, 507, 506, 507, 514, 533, 566, 599, 609, 594, 569, 549, 535, 532, 549, 572, 578, 560, 541, 544, 556, 552, 534, 527, 536, 545, 543, 546, 563, 581, 582, 574, 578, 600, 619, 618, 597]
2493E97k2rJ0K7L0J8lk0j7%J3J3Kj0j1oLNKoj6j9j1LOnk2k9j9kJ3K2L0K4%l3n7n8l8j5MJ4
2488D08K0K8L1K1lk1j2J9L8K5lj6oJ1J6J4J7K3K6J9J3J0Pkk1l7l3j3%j1l2l8k3nNJ4L0L9K7
2484E85OlLKj4l0k8pJ9L4L1J7jj2j8j6qMJ3J4J1J2J7K0J5Nlj3j8k0k1k7k6j2RJ7Lj4j3ljq
2478E21j2qjQJ9L3L1J1qlJ8K8J2j4k9k7j8j1rqmKkk1l9m1j9J1L1L5K4Oj4k2j1J1K6K8K0J0
2473E64%j2k3k9k4j1lmj3j1MK1K4J7J3J2NjNK3K9J5oj1lok0l0j9PK6K6J0j0j9j3JJ5K2K3J4
2468F08Jj0j4j5k3l0k3qkooJQNOJ9L2K8J2Lnk3m2l4%K8K6J3J2J7Qj0j3JNpj6kJ5Qk5n0m5j7
2463D30J1K5K7J9J1QNJmmkmrj1rj2k4k9j5NQqk2j9pLJ3K7M2M2K3Kp%Lqk7l7k7j0pj2rRL0L5
2457D56L0K3K5K3J4Jo%RJ3RMLKJ%Kjj5k5j5J5L2J9pj7j0oj2j6j5k0k6j9kRK%J3K6J5pj3kQ
$$ y = [597, 575, 566, 576, 603, 633, 651, 648, 628, 611, 611, 624, 637, 639, 629, 618, 612, 615, 620, 622, 616, 600, 581, 570, 573, 579, 574, 552, 523, 504, 502, 515, 537, 567, 591, 591, 558, 501, 443, 405, 390, 394, 408, 428, 456, 487, 508, 505, 484, 472, 491, 529, 554, 551, 535, 529, 540, 556, 570, 587, 610, 636, 655, 668, 678, 685, 683, 662, 625, 592, 579, 579, 568, 536, 498, 475, 470, 475, 489, 519, 558, 585, 591, 588, 591, 593, 579, 549, 521, 514, 533, 567, 598, 615, 614, 602, 584, 568, 560, 564, 577, 591, 602, 614, 631, 651, 666, 671, 668, 655, 637, 617, 596, 569, 543, 531, 540, 557, 560, 546, 533, 530, 529, 521, 509, 501, 500, 508, 527, 560, 591, 602, 594, 591, 609, 637, 649, 635, 606, 579, 561, 550, 541, 533, 529, 531, 529, 508, 469, 428, 409, 420, 451, 486, 510, 516, 502, 480, 469, 480, 506, 534, 554, 564, 564, 552, 529, 500, 476, 465, 462, 458, 445, 434, 438, 459, 483, 500, 513, 525, 530, 529, 534, 557, 586, 601, 595, 584, 581, 575, 555, 525, 506, 513, 539, 565, 575, 565, 546, 533, 534, 549, 571, 594, 608, 609, 599, 585, 570, 547, 517, 494, 486, 484, 478, 472, 473, 481, 486, 492, 511, 543, 571, 583, 586, 581, 558, 516, 482, 482, 510, 536, 549, 561, 578, 586, 576, 563, 564, 569, 562, 546, 544, 559, 567, 542, 492, 447, 430, 441, 466, 493, 512, 523, 531, 536, 537, 533, 529, 527, 523, 514, 503, 494, 482, 458, 429, 414, 419, 427, 419, 397, 378, 371, 374, 387, 414, 456, 498, 521, 523, 516, 516, 519, 511, 484, 447, 420, 410, 403, 391, 382, 391, 421, 456, 486, 509, 534, 557, 571, 572, 566, 566, 575, 588, 597, 601, 604, 606, 607, 607, 609, 608, 593, 568, 553, 568, 600, 619, 612, 595, 585, 579, 567, 551, 536, 516, 490, 471, 469, 478, 480, 480, 493, 519, 534, 527, 514, 512, 520]
2452E20RPKrj9jL4N3L8J1LJ1J6J1POok5m0m2l7l0j9pmpmRJ7J1MJ3K9L1J3j6l0k6rJ1K4K9K8
2447F16K5K0Rqk4k6rJ7L4L0J5Knj7l2l7k8j4j3j9j8oNPJ0J9K9L4L2J9kk1k4j4nmlRK8M1L7
2442G09J9lj2qkpj9k2j0jnj6j8j0jJ0K5L2K1ok8k8rJ5K9L2K4Rj1k7k5rOKj6k5j6KJ6J9J4M
2437F54nnJoj9k1kRol1l1mJ4J2QJ8K6K1J1J1Pj1k9k7j4j5k4k2q%ooJ3K9J7qj7%J9J7%j4j8
2431E38j1KJ5K0J5NOJ1Rmj7j8oQJ7J5%j4qJ1J8lk8k1J1L0J5j2k2qJ5L1L5J8qk3k0k0l1l5j4
2426E22J6K6J0lMJ5J4Jrj0lOMj0k4k2nMJmjjpj0NK5K5Kj8j5NJ7J4LljK%nKJ4K3J5lj8k1j1
2421E71J0K7K8Pj8k3nJ8K6J6ql0l8k3LJ5Pj1k0j6j1qkPJ6J6J0MJkjNJ3J4J1Mkj3k0j5KR%j5
2415E59k3k6k6j5J4M5M5J6kPK1Rk1m1m0l2k1mJ7L1L1J8mk4k9j4PJ2jj0JK0L2L1J7ok6k5nJ6
$$ y = [520, 529, 536, 538, 529, 510, 509, 543, 596, 634, 645, 648, 659, 675, 686, 693, 699, 693, 668, 628, 586, 549, 519, 500, 493, 489, 482, 478, 487, 504, 515, 519, 532, 561, 592, 605, 589, 559, 533, 524, 535, 559, 588, 616, 641, 661, 670, 662, 638, 612, 603, 620, 654, 684, 699, 701, 696, 679, 647, 610, 582, 568, 555, 536, 518, 512, 517, 524, 534, 553, 582, 616, 648, 667, 665, 644, 620, 606, 601, 597, 594, 603, 631, 672, 709, 728, 725, 713, 705, 703, 696, 677, 655, 645, 644, 639, 623, 605, 595, 594, 604, 629, 661, 682, 676, 648, 620, 611, 626, 655, 687, 711, 720, 709, 682, 657, 648, 654, 656, 640, 615, 599, 601, 617, 636, 650, 654, 649, 644, 645, 639, 620, 599, 597, 606, 600, 569, 538, 534, 548, 560, 568, 586, 612, 633, 644, 655, 662, 651, 622, 595, 581, 566, 542, 520, 512, 512, 506, 500, 513, 542, 559, 551, 534, 534, 553, 570, 570, 556, 538, 527, 529, 544, 564, 579, 584, 590, 601, 610, 606, 589, 571, 565, 573, 590, 605, 605, 591, 583, 594, 612, 609, 581, 560, 571, 601, 616, 604, 582, 574, 589, 620, 655, 673, 665, 642, 622, 602, 571, 536, 522, 538, 564, 574, 571, 575, 590, 604, 605, 596, 586, 583, 589, 593, 583, 559, 537, 532, 536, 537, 533, 532, 531, 524, 514, 519, 544, 569, 571, 553, 538, 543, 560, 574, 577, 574, 573, 575, 575, 570, 572, 586, 609, 624, 621, 603, 582, 571, 581, 608, 636, 643, 625, 602, 597, 615, 641, 657, 649, 619, 581, 558, 561, 576, 583, 572, 552, 536, 525, 517, 515, 522, 538, 554, 564, 568, 569, 567, 566, 571, 584, 598, 609, 613, 611, 598, 578, 563, 565, 574, 574, 559, 536, 510, 484, 469, 483, 528, 573, 589, 587, 594, 615, 624, 603, 562, 522, 490, 469, 465, 482, 513, 544, 562, 558, 534, 505, 491, 498, 510, 509, 499, 500, 520, 552, 583, 600, 594, 568, 543, 538, 554]
2410E54K2J3ol1m9m4j7PJ0ORJ6J9J9K2K4J2mj0mMPJ0J0mk2k6j5noj1lOPKKJ2J6Oj1k1j2PK1
2405E42K3J5J0J3J2Mj1k2k4k0j1qj4k6k8qK3M2M2K6Qnj2pKJj6l8m3j9RJ6%j0KK3L2K7K6L2
2400F08L1J7MMOlj6k0j3j0j1lJ7K7J3j1k3j4KQMKOJ5K1J1j4m0m6k9kJ3Rj0k5k5rOJ0MNJ9L5
2395E73L7K6J2Jooj%rk2k6j9qJNNkqnPJ2PKRK1K2Pj3k6k7k4j9j8j5kJ3J4nk0qJ5J6nj5NK4
2389E25J5nj1l%kPK4K4RLJ2J8Nj1j4j6k8m1l9j5RK5K3J2jkJ1K3J6mk1k8k3j2PK2K4J7J0J0
2384E75J6J7J3Kj0j5j3j4k5l6l4k0qm%J0J9K5K2Pj7l0j5J2K2QjJ4L2K6kk3k3j0JLK%NK2L4
2379E87K6Pnnnj3j8j0LJ3J9L0L9L4J5lj1j0j2j7j1KJ5J5OJOMj4l9n1m4k4pOK2L8M3K9jk1j8
2374F21KJ3%k6l9l1j3JNJmmPK1K6J6nj9j9j2mjjKJ1J5Q%OJ3Mj8k4%K5K5%j6k1k5k7j2J6K7
$$ y = [554, 576, 589, 583, 552, 503, 459, 442, 449, 459, 465, 474, 490, 509, 528, 550, 574, 586, 582, 572, 568, 572, 579, 589, 599, 595, 573, 547, 532, 527, 521, 510, 507, 513, 520, 522, 524, 536, 552, 558, 547, 526, 514, 521, 542, 565, 580, 590, 603, 615, 619, 608, 586, 562, 542, 531, 523, 509, 483, 455, 447, 470, 512, 554, 580, 588, 583, 571, 564, 566, 567, 551, 513, 470, 451, 460, 476, 476, 466, 468, 491, 523, 550, 576, 608, 639, 656, 660, 664, 670, 667, 651, 631, 618, 608, 597, 594, 611, 638, 651, 640, 617, 603, 605, 613, 617, 619, 625, 640, 661, 672, 658, 618, 572, 543, 541, 554, 563, 553, 528, 503, 494, 500, 510, 514, 519, 538, 573, 610, 636, 648, 649, 643, 637, 636, 636, 627, 605, 579, 560, 552, 553, 558, 563, 561, 553, 548, 555, 567, 574, 576, 585, 606, 628, 635, 622, 596, 569, 545, 526, 508, 493, 491, 504, 518, 513, 493, 485, 500, 516, 511, 496, 501, 525, 540, 535, 524, 521, 521, 519, 526, 550, 574, 583, 586, 598, 616, 621, 610, 596, 580, 552, 511, 472, 457, 466, 491, 514, 526, 525, 523, 534, 557, 573, 569, 548, 520, 497, 485, 492, 514, 538, 555, 565, 575, 591, 608, 621, 623, 613, 598, 585, 571, 546, 510, 476, 456, 448, 444, 444, 454, 473, 498, 520, 527, 510, 480, 465, 477, 499, 507, 506, 520, 552, 578, 576, 553, 530, 520, 521, 524, 526, 526, 531, 553, 587, 613, 620, 615, 610, 605, 592, 574, 564, 567, 580, 599, 629, 668, 702, 717, 714, 703, 693, 681, 664, 653, 655, 670, 685, 691, 692, 698, 702, 688, 649, 598, 554, 530, 523, 529, 551, 589, 632, 661, 660, 639, 621, 623, 636, 636, 610, 571, 540, 527, 528, 533, 534, 530, 526, 533, 554, 580, 596, 591, 572, 553, 541, 537, 536, 535, 537, 548, 563, 571, 571, 577, 590, 594, 576, 552, 552, 577, 602, 602, 586, 565, 540, 513, 501, 517, 544]
2369E44J7QK0L5K5%k0k6l1l4k1NJ9J1lmLLlmkj3l4m4k6PK8K8J6NKkllklkKPNlj0mJ0K3K4J4
2363E64Mnqj0lRK5L8M3L3Nl2o1o3l6LL1L7K4OKJ2K2J6lj1mMlj0nJ3L0L8L6K5Pj0j3pj3k9l6
2358F65k1OK4L2L6L9L3K2J1%j0j4pJ0K5L1K6J4L%NRkk0k8k7k5k6k0kJ7K6K6K2J9J6J9K4J4
2353I72j3m3n6m7l5l5l9l5j7PJ8J1nj3lJ2Qj5l7m2l2k1j5qLJ3J8K2K0J3%qm%oj5nK2L6K1k
2348F45r%%j2j6r%kJJ4K4J6%kOQNJ0K3K4Lk2k8k1j2qjJ0J9K3K4K4J5ql5m2k5JJ1Jj5j7nPR
2342F34Loj3j4lJ3K4K0Pjnj1j5j2KJ5J5Lpokpj7k4j9j3j5j6kK4M5M1J8pk4l0k2nJ0J4J5J4
2337F21Qoj8j4MRnj5oJ1J1kpPK5L7L7L0J5Joqj8l6l9k0jnk2k5qJ0J0Kk%MPJ1J2Jj0lK0L8L6
2332F91J4j0k0j6j3j9k9l2k4qKJ2K6L7L1Lk0j9KK0J9Lj3j9j0LJ2J0%nkNJ0J1J0Okj5k1j6j
$$ y = [544, 561, 569, 589, 624, 649, 649, 629, 603, 572, 538, 517, 522, 541, 552, 549, 545, 548, 551, 548, 544, 542, 529, 495, 451, 425, 432, 460, 488, 504, 509, 511, 509, 506, 503, 501, 498, 496, 498, 505, 510, 507, 497, 493, 503, 526, 550, 564, 568, 563, 555, 545, 542, 551, 576, 614, 657, 690, 695, 663, 602, 539, 503, 506, 537, 574, 598, 604, 606, 618, 640, 656, 653, 642, 638, 642, 639, 629, 624, 637, 667, 705, 741, 766, 773, 763, 750, 743, 730, 701, 665, 644, 650, 674, 706, 742, 781, 814, 836, 847, 847, 837, 823, 816, 826, 851, 882, 908, 922, 925, 925, 930, 939, 937, 917, 889, 862, 837, 811, 791, 789, 806, 832, 858, 880, 899, 915, 934, 958, 972, 959, 916, 860, 813, 778, 743, 704, 669, 652, 659, 677, 688, 683, 670, 667, 679, 687, 672, 635, 593, 561, 540, 525, 517, 520, 533, 551, 573, 593, 606, 606, 598, 594, 594, 588, 573, 568, 590, 626, 647, 645, 636, 636, 636, 624, 608, 599, 599, 597, 598, 612, 636, 652, 652, 650, 656, 664, 669, 679, 702, 726, 729, 707, 679, 658, 646, 638, 637, 647, 666, 689, 713, 737, 752, 744, 709, 667, 642, 643, 654, 655, 640, 623, 618, 625, 634, 637, 631, 618, 604, 601, 614, 638, 658, 665, 664, 659, 648, 633, 621, 623, 638, 653, 656, 649, 643, 641, 634, 617, 593, 574, 561, 546, 530, 528, 552, 597, 638, 656, 649, 625, 595, 573, 568, 578, 592, 607, 621, 629, 623, 605, 591, 595, 604, 599, 584, 578, 589, 600, 598, 591, 598, 623, 660, 697, 727, 742, 743, 737, 729, 711, 675, 636, 616, 615, 610, 588, 563, 555, 565, 575, 577, 575, 575, 579, 586, 597, 609, 610, 600, 597, 617, 655, 691, 705, 695, 675, 659, 646, 627, 598, 566, 542, 534, 536, 548, 574, 611, 642, 645, 625, 606, 608, 628, 647, 650, 637, 618, 608, 611, 623, 633, 633, 628, 626, 631, 641, 652, 662, 668, 666, 651, 630, 614, 613]
2327F13J2J7J7J9J9J5MpqojLPOkj3j6pMPlk0l1k8j6lJ3K9L2J4j3k4oK1K2ll5m6l6j6JJ6K5
2321E76K7K1J1mj7k3k1j8j1MK7L9L2J1mlKMJMOjj6j8oJ3J8Qpj4j0jNLjkLKqj8j2LQoj6rRJ6
2315F07J0Llj3k1j7nOJ1J7J9J1j0j9j1KKm%J0QkkJ5K8K2jk2k6j5RL3M3L1Pqrqj1j6j2MK6M1
2310G30L0%k9l3j4J1K3J5kj4j4ppj0j0JPNjMJ8J9Mj3j6j0lkmj0j9k1j0NQjmOJ8K0J3OKnj5
2305F71k4l3m7n3l8jL9N8N3L0Lj5k0j7j3j2j2p%LMRJ0NkNJ9K2Nj9k6j1QJ6Oj5l5m2l3j4OK0
2299E03K9L4L1J9O%%Joj8k3k2j5rJJ5K7K7J2j0k3k0nJ2K6L4L8L0Rj9l3l1j4KJ3J5J0ok4l6
2294E80m0l6k9j6%J4K1K6K7K4Qrj2%J5K3K2J5jk0k9k1rorr%J0J4J5J5J0ok6l5k1JJ3PnnJ0
2289E26K5K9K0J4J0OLQJ9K4J1j1k6k9k9l2l3l0k7k0kK5N1N5L8J7MmqnMJ5K3K7K9K3J2%pj4
$$ y = [613, 625, 642, 659, 678, 697, 712, 716, 709, 701, 695, 694, 697, 704, 710, 708, 695, 679, 672, 676, 683, 680, 660, 629, 601, 585, 582, 595, 624, 656, 670, 657, 633, 627, 648, 670, 667, 632, 586, 550, 534, 535, 551, 576, 603, 624, 635, 631, 614, 591, 570, 552, 541, 545, 572, 611, 643, 654, 650, 647, 649, 653, 654, 658, 664, 663, 647, 629, 623, 636, 654, 662, 655, 641, 631, 630, 635, 638, 637, 635, 638, 640, 632, 614, 602, 605, 613, 607, 591, 582, 591, 607, 617, 620, 617, 604, 583, 566, 561, 567, 578, 595, 614, 625, 615, 596, 585, 587, 589, 585, 585, 595, 603, 601, 599, 614, 642, 664, 663, 641, 615, 600, 609, 642, 685, 716, 723, 715, 706, 698, 687, 671, 659, 663, 689, 730, 760, 760, 731, 698, 684, 695, 718, 733, 731, 717, 703, 696, 689, 679, 669, 670, 677, 682, 681, 685, 703, 722, 726, 713, 697, 687, 684, 682, 678, 668, 649, 628, 618, 623, 631, 630, 626, 632, 650, 670, 683, 689, 691, 686, 671, 647, 614, 567, 514, 476, 475, 514, 572, 625, 655, 658, 643, 623, 606, 593, 581, 569, 562, 562, 565, 569, 578, 588, 593, 591, 596, 615, 637, 642, 623, 597, 586, 594, 610, 616, 601, 566, 524, 491, 477, 483, 503, 532, 566, 597, 616, 622, 622, 622, 623, 617, 599, 576, 554, 539, 530, 531, 546, 573, 600, 612, 602, 579, 559, 554, 566, 592, 626, 664, 694, 703, 684, 651, 620, 606, 608, 621, 636, 646, 640, 616, 580, 540, 504, 475, 459, 459, 473, 494, 520, 547, 571, 579, 570, 558, 558, 573, 596, 618, 633, 632, 612, 583, 562, 553, 547, 538, 529, 529, 539, 553, 568, 583, 593, 587, 561, 526, 505, 506, 519, 526, 521, 516, 526, 551, 580, 600, 614, 624, 630, 633, 641, 660, 684, 695, 684, 658, 629, 600, 568, 535, 505, 478, 458, 456, 481, 532, 587, 625, 642, 646, 642, 634, 629, 633, 648, 671, 698, 727, 750, 762, 762, 755, 741]
2284G41k1k5j4PK2K2K0K0J9Kk0l3k7j0MJ1QNPJ8K1Mk5m2l8l0l0k2ML4M0K2Joj1k4l3k4kJ1
2280F06J0Krj4j0PK4K4Nj5j7nMMKjorJJ1Qj3k9j8NJ3lk0k0j2j3j8j2J0K6K4J6J5K0J9J3J4
2274F39J5RkoKKj6m0m3k3NK4K6J7O%K%rk0k0oJ2K4K7K7J9Qkloj7l2l7k6q%jJJ2K1K2J7K0K8
2269F68K5J1lj0j4k1k1j3jkj2j7j3qqkJ3K4K3J1Jnj3k4k9j9MK1K4J3LNJ4J9J2kj1j1JJ6K2
2264F71J6jj6j4jJ7K7K4Qj2k0j9j6k1l0k9k0j1jPJ2J0jpkRJ2Kj1j4%J9K7J7%q%POnj4j5j4
2259E89j1nMJ5J5RKMOKnjPNrk2k1j6j6j4LK8L3J0j4k3k1k6l3k6kJ6J6PKJJNJ8L0L0J4lrmN
2253E96J3J6J2NKRJ5Nk4m3l1KK4J7kpNJ8J5ok5l3k7j6rkPJ7K7K9K4J4NjJONpk0k8k2j1JOJ1
2248E93J3RL%PJ3Oqj1OK3K4J0kmlljMNLOJ2J1%j8l8m9m2k1LLj4k4j1J1K6K6J6Jj1nK3N1M7
$$ y = [741, 720, 695, 681, 688, 710, 732, 752, 772, 791, 793, 773, 740, 713, 703, 707, 718, 726, 731, 738, 756, 777, 781, 756, 714, 676, 646, 616, 594, 598, 632, 672, 694, 695, 689, 678, 654, 621, 597, 595, 606, 616, 618, 609, 595, 585, 592, 616, 640, 645, 630, 613, 608, 612, 616, 618, 617, 611, 602, 603, 614, 622, 609, 580, 562, 567, 580, 577, 557, 537, 525, 512, 494, 482, 492, 518, 542, 558, 573, 593, 612, 625, 639, 654, 663, 661, 655, 657, 659, 643, 603, 560, 537, 542, 566, 592, 609, 615, 615, 617, 617, 608, 588, 568, 562, 574, 598, 625, 652, 671, 679, 677, 674, 668, 651, 619, 582, 556, 548, 548, 547, 548, 560, 581, 603, 620, 640, 668, 693, 704, 701, 691, 677, 656, 635, 622, 621, 619, 607, 590, 577, 569, 561, 559, 572, 596, 619, 630, 631, 626, 613, 589, 560, 541, 545, 566, 590, 603, 606, 611, 625, 644, 656, 654, 643, 632, 633, 649, 671, 687, 686, 670, 656, 655, 672, 699, 723, 731, 719, 699, 680, 664, 643, 613, 584, 564, 553, 552, 559, 571, 581, 580, 573, 571, 580, 592, 594, 583, 569, 569, 588, 615, 632, 632, 624, 624, 631, 637, 632, 618, 603, 589, 578, 573, 577, 592, 607, 616, 618, 622, 628, 630, 625, 624, 631, 636, 627, 605, 584, 568, 552, 538, 541, 569, 602, 612, 598, 575, 554, 528, 495, 469, 467, 483, 499, 506, 508, 509, 510, 515, 533, 563, 593, 607, 604, 595, 591, 596, 609, 625, 637, 642, 644, 653, 668, 673, 649, 606, 575, 577, 601, 618, 616, 609, 614, 632, 647, 641, 616, 583, 556, 540, 531, 529, 536, 553, 580, 609, 633, 647, 652, 651, 652, 658, 663, 656, 636, 608, 586, 575, 576, 582, 593, 606, 615, 618, 618, 625, 638, 644, 636, 625, 631, 654, 678, 688, 686, 682, 679, 676, 675, 679, 684, 687, 693, 705, 716, 716, 698, 660, 611, 569, 548, 551, 554, 540, 516, 505, 516, 542, 568, 584, 585, 574, 569, 592, 643, 690]
2242F90Pl3m5l0j1JQJ6K0K0J2lj7k5k1oPJ1KppkMOLj1l3n1m4j2K1L6L5L1K4J2mj3j7j1MJ8
2237E85K0NqnKql2m3l2j3OK6L9M1L8M0M3K6rk7qK0J9pl0l7l3k2kK1K8K3J5J1Kj1k0k1k1k3
2232E98j7lJ3K6L0K2lk4k0JJ5RjRK4K3Mrpqk8m9m3rK1K6J8J3J6Oj1k1j2OJ6K1L0L0J5j0k3
2227F94k1j6j9k1j5j1j4j9j3KJ8K7L1K8K2J4Plj6k5k6j6qjMJ5L2M5L9J0k3m2n0n5n4l8pJ8
2222D93K8K8L0L1K1J1J0J9J6jk3l0j1K2M2L2Nj7k2k7l8l9j5K4N0N1L3Qj8l3k7j0KKmnnkPJ4
2217F52J7J6K0K0Jk7l8k2NJ5Nj0j9j4PK9K9Jl0l3rJ3J3Kpo%POjqkMMlqj2j6k0j3LJ1Pkoj1
2212E70j5j2OK7L4L0K2J5NnmJ0J4Kj4j5nM%j0j4j3pkKJ0K0K7J9JqLK2K3lk6k6j0mj2k2j7p
2207F15nj0oQK3K8K8K8K1J2LMKj2l0l9l2k0j0mQJ9K8L4L1J6j3l6m0k6pRK0K6K0J1RJ3J6J5
$$ y = [690, 697, 664, 619, 589, 578, 579, 587, 603, 623, 643, 655, 652, 635, 610, 589, 583, 590, 601, 603, 596, 589, 587, 591, 597, 600, 589, 556, 505, 461, 449, 470, 506, 541, 572, 596, 608, 604, 591, 574, 563, 567, 585, 605, 610, 602, 597, 599, 591, 559, 516, 484, 471, 477, 503, 542, 583, 621, 661, 704, 730, 721, 694, 686, 706, 725, 718, 688, 651, 618, 596, 594, 615, 643, 666, 681, 692, 694, 683, 663, 642, 621, 598, 581, 578, 591, 617, 647, 669, 666, 642, 622, 623, 638, 647, 646, 655, 679, 702, 706, 697, 690, 682, 654, 605, 562, 553, 574, 600, 618, 631, 647, 653, 642, 621, 609, 615, 631, 652, 682, 712, 727, 717, 694, 673, 657, 638, 617, 602, 591, 577, 558, 545, 547, 565, 592, 623, 651, 673, 687, 694, 691, 675, 650, 624, 608, 600, 599, 603, 618, 650, 695, 734, 744, 721, 679, 629, 574, 520, 482, 475, 493, 521, 549, 579, 610, 631, 642, 652, 671, 687, 686, 663, 633, 622, 644, 686, 718, 723, 706, 684, 657, 619, 580, 565, 589, 639, 690, 723, 731, 713, 680, 653, 643, 645, 647, 643, 638, 633, 631, 638, 652, 669, 685, 705, 725, 726, 699, 661, 639, 644, 659, 664, 654, 635, 621, 628, 657, 686, 687, 657, 624, 615, 628, 641, 643, 636, 630, 630, 637, 643, 642, 634, 632, 636, 640, 637, 629, 617, 601, 581, 568, 571, 582, 589, 587, 581, 570, 555, 543, 549, 576, 610, 640, 662, 677, 682, 677, 673, 683, 697, 699, 685, 670, 665, 669, 669, 659, 645, 632, 625, 623, 625, 635, 655, 682, 701, 702, 694, 697, 719, 742, 739, 713, 687, 677, 673, 661, 639, 622, 615, 610, 600, 594, 602, 625, 653, 681, 709, 730, 742, 745, 749, 751, 739, 709, 670, 638, 618, 608, 604, 612, 631, 659, 693, 724, 740, 727, 691, 651, 625, 618, 627, 647, 673, 693, 704, 713, 726, 742, 757]
2202G57J7K4J6pl2l4j9qqj4k2k6k3%K8M1K6kk7l9m0k7pJ3K3L0L2L1K1J2J0J4J1mk5m4n0l4
2197F14mK2K1jk5k9j9oLQJ7L2M0L5J2j2k6k2j2%J0J5J6J5J7K1K3J6Kj4k2k1j4j6k3k5j4MJ2
2192F50NjKJ0Rnk4l7k9rJ2J7J3J1K0L2L0J1j0j9j3orj5j0PK4L1L1K9K1Kj5j4jN%%RRj2l8m3
2187F80k8qOJ5J8J3L%RK6L8L7J8pk1j7mLLjqk2k9k0lLnj1j1qj1j2r%J5L5M6L6Ok0k7k0j2m
2182F92Knk2l7l5k6k4k5j9pOJ9L0L0J1j1j0J0J9QmPL1M4M1L7L8L4J6pk2k1j1mmqj5k3l0k5
2177F80pRRnj6oJ8L8L7J6j3l4l0rJ3K1J6OknKJ5K4J6%oMJ1OljPkl1n2m0qJ5J1rk2k0oJ1K0
2171F78J1j5l3k8j0OJ2J5J9J3M%PJ2Pk%J1K2K2J1kmLJ5K5K7K4J0j1k4j7kLqj7j5pqj0kJ4K1
2166G77J2%lk%lqj4j2KJ8K1Ppj0lJkoplQK0K9K2Mj7k7k6k1j1lJlj1rPK3K8K3J9J6J2Jrj7k3
$$ y = [757, 774, 798, 814, 807, 775, 741, 722, 714, 706, 692, 670, 644, 621, 621, 649, 690, 716, 714, 687, 648, 608, 581, 574, 587, 610, 640, 672, 703, 724, 736, 746, 760, 771, 767, 742, 698, 648, 614, 610, 632, 653, 652, 627, 598, 579, 573, 576, 584, 601, 633, 673, 708, 720, 708, 682, 660, 648, 648, 658, 673, 689, 704, 721, 742, 765, 781, 783, 769, 747, 726, 712, 696, 673, 648, 634, 638, 650, 655, 654, 656, 666, 675, 670, 646, 609, 580, 571, 583, 600, 613, 624, 644, 676, 706, 717, 707, 688, 675, 669, 660, 645, 635, 642, 666, 697, 728, 757, 778, 780, 765, 751, 750, 755, 755, 755, 764, 773, 761, 723, 680, 652, 644, 650, 665, 683, 696, 699, 699, 708, 734, 772, 809, 827, 820, 799, 782, 778, 781, 784, 783, 775, 753, 724, 704, 701, 704, 699, 688, 677, 669, 658, 646, 637, 637, 652, 687, 733, 769, 775, 755, 728, 708, 696, 692, 694, 689, 667, 630, 595, 569, 545, 520, 501, 494, 500, 519, 549, 579, 590, 579, 569, 579, 598, 606, 602, 609, 640, 684, 725, 762, 800, 834, 850, 843, 821, 800, 789, 785, 781, 773, 758, 735, 705, 680, 673, 682, 691, 686, 670, 664, 682, 720, 757, 773, 760, 726, 696, 687, 700, 721, 737, 743, 741, 736, 738, 753, 777, 793, 793, 787, 791, 802, 808, 805, 804, 811, 809, 778, 726, 686, 678, 693, 704, 695, 673, 653, 647, 658, 678, 689, 674, 641, 613, 603, 609, 621, 636, 655, 668, 672, 672, 679, 691, 698, 696, 696, 707, 729, 751, 762, 760, 756, 759, 774, 799, 826, 850, 860, 849, 825, 808, 806, 809, 801, 784, 769, 762, 754, 744, 742, 756, 777, 789, 789, 786, 784, 784, 781, 773, 759, 747, 749, 767, 788, 795, 788, 778, 775, 776, 774, 768, 761, 758, 766, 786, 815, 837, 841, 824, 797, 771, 750, 739, 736, 737, 734, 723, 714, 721, 744, 772, 795, 814, 830, 842, 843, 834, 817, 794]
2160G94l2l6k4ojlKK6M7M7K5lj9k2j2%Kj0j7mJ7K3PoLJ4Qj6k9k3mJ3K7K8J4pk3k1j4j0oLJ8
2155G70K6K1J0LJMNNNJmj4k1j7%J1QjlOPrl1l7k5mJ3J8J2MLJ6K5K2OKJ4L3L8K5Nj3k3k4k1
2149H72j7j7j7j5nRK0K2J5J1Oqk5k4ML7M7L5K0J0pk5k4mJ1NkQJ9Nj9k5rOJ7L1M5L2lk4j4N
2144A008Mqj2nJQK4L0J0k9n0l6pJ0J5J8K0J5Lj1k4k9k1r%lkJ1K5K4Kk0k4rJ0K3K6J7Kj3j9
2139I75j1kMRK5M8O0M6K1OJ3K9L4K6Pj6l6m2k9r%lpJJ4J3kj4j4olprlMJ1K2L4M2M2L8M0M8
2134A399M4K6O%J6L8N1N0M1K7J0oj5j2omrj4j4j6k9m4m9l7j5PJ7J5Npj7k5k3j1LRPQJ3J9K0
2129A478K4L4M8N8O1N4L9K6L0N3Q0R9J09J19J32J40J47J55J55J42J27J25J35J39J29J12Q9
2126D039O1L9K5J3k0p4j22j44j47j45j46j44j46j51j54j46j26j05q6o6n3n3o2o5n3l7k7l4
$$ y = [794, 762, 726, 702, 696, 695, 692, 694, 720, 767, 814, 839, 836, 817, 795, 783, 783, 785, 775, 758, 754, 771, 794, 801, 795, 798, 812, 820, 804, 775, 752, 748, 761, 788, 816, 830, 823, 800, 779, 765, 755, 749, 752, 770, 796, 817, 827, 830, 831, 835, 840, 845, 850, 851, 847, 833, 812, 795, 795, 806, 814, 813, 810, 816, 823, 814, 783, 746, 721, 717, 730, 748, 760, 764, 767, 783, 808, 830, 836, 838, 852, 885, 923, 948, 953, 940, 917, 893, 872, 855, 838, 821, 806, 801, 810, 830, 852, 867, 878, 884, 876, 851, 827, 831, 868, 915, 950, 970, 980, 973, 948, 924, 920, 931, 936, 934, 942, 961, 966, 947, 922, 913, 919, 936, 967, 1012, 1044, 1041, 1017, 1003, 1008, 1012, 1004, 992, 987, 988, 996, 1020, 1050, 1060, 1031, 981, 945, 938, 948, 963, 981, 1001, 1016, 1019, 1008, 984, 955, 934, 925, 925, 922, 920, 931, 956, 980, 982, 962, 938, 929, 939, 962, 988, 1005, 1007, 994, 975, 964, 962, 966, 975, 1000, 1048, 1108, 1154, 1175, 1181, 1194, 1223, 1257, 1283, 1290, 1274, 1238, 1196, 1167, 1158, 1158, 1155, 1148, 1149, 1163, 1176, 1174, 1160, 1146, 1140, 1137, 1130, 1121, 1118, 1122, 1133, 1155, 1189, 1231, 1273, 1311, 1351, 1399, 1443, 1469, 1475, 1475, 1491, 1529, 1580, 1630, 1671, 1698, 1708, 1702, 1687, 1675, 1669, 1665, 1656, 1642, 1628, 1612, 1583, 1539, 1490, 1453, 1438, 1445, 1462, 1477, 1482, 1475, 1458, 1433, 1410, 1399, 1402, 1411, 1418, 1426, 1439, 1458, 1478, 1502, 1536, 1584, 1642, 1703, 1757, 1796, 1822, 1852, 1905, 1985, 2084, 2193, 2312, 2444, 2584, 2731, 2886, 3041, 3183, 3310, 3435, 3570, 3709, 3838, 3950, 4039, 4100, 4139, 4164, 4177, 4157, 4083, 3961, 3817, 3670, 3525, 3379, 3235, 3089, 2938, 2784, 2638, 2512, 2407, 2321, 2255, 2202, 2149, 2087, 2022, 1969, 1932, 1905, 1871]
2122A871m6m7l4k1k1l3m0l3j7jROoj1JJ9J6j3l8m2l1k4k4k2k3l8n4n0k7KK2K9K3Pj0j5mJ1
2118A291J8J2JpJJ7K5J3kkQOj0j9rJmj1kJ9K8J8OMRROPPQRJ3J6K5M1O0O2M3J6LJ0K7M4O6Q9
2112A972R7Q7P2P7R6J07R4P4O3O6O9N8L0ol3m8n8p3q9r5q8q1q6r4r3q1o7n6m8m6m6m0k5rn
2108A695rj4j7k1k5k4k6l3l4k4j5k1l1k0QK4J8J1J4J2rl3m0k5qRK7L8K4nk1rJ2J8Pj2k5k9
2103A387k2j6j5j6j2MK1K8K2J4J0J7L2M8M9L1%j6lK3L2J2kJ9O3Q6P4N1M2L6K1J4M0Q3J08J01
2099B366R2J02J22J36J44J51J62J77J89K01K08K11K05J91J70J57J47J27Q0K3k2n8j04j57j90
2096D830j94j87j88j89j83j82j93j96j75j37j09r8r1q5q0p7o5m7l3k9k8k9m0n3n3l7k3j9j9
2092A991j0klj0j1ojNQJ1J1J6K4K9K2Ooj2j9k6k4pJ3K5K2J2NPJ5J6Kj9k4rJ1K3K8L5L8K5N
$$ y = [1871, 1825, 1778, 1744, 1723, 1702, 1669, 1629, 1596, 1579, 1578, 1587, 1593, 1587, 1576, 1577, 1596, 1612, 1599, 1561, 1519, 1488, 1464, 1440, 1418, 1395, 1357, 1303, 1253, 1226, 1228, 1250, 1279, 1302, 1309, 1299, 1284, 1280, 1291, 1309, 1321, 1322, 1315, 1316, 1333, 1358, 1371, 1369, 1367, 1375, 1381, 1371, 1352, 1343, 1344, 1340, 1329, 1327, 1346, 1374, 1392, 1398, 1402, 1411, 1420, 1426, 1433, 1440, 1448, 1457, 1470, 1486, 1511, 1552, 1612, 1674, 1717, 1733, 1736, 1746, 1773, 1817, 1883, 1972, 2069, 2156, 2228, 2305, 2401, 2508, 2602, 2676, 2739, 2805, 2874, 2932, 2962, 2956, 2923, 2875, 2817, 2744, 2655, 2560, 2472, 2391, 2305, 2211, 2118, 2037, 1970, 1914, 1866, 1820, 1774, 1734, 1709, 1700, 1695, 1686, 1672, 1655, 1634, 1609, 1585, 1559, 1526, 1492, 1468, 1453, 1432, 1401, 1381, 1389, 1413, 1431, 1442, 1456, 1468, 1459, 1426, 1386, 1361, 1353, 1362, 1389, 1427, 1451, 1446, 1425, 1416, 1428, 1446, 1453, 1441, 1416, 1387, 1365, 1349, 1334, 1318, 1306, 1310, 1331, 1359, 1381, 1395, 1405, 1422, 1454, 1502, 1551, 1582, 1582, 1566, 1563, 1586, 1618, 1630, 1628, 1647, 1710, 1796, 1870, 1921, 1963, 1999, 2020, 2034, 2074, 2157, 2265, 2366, 2458, 2560, 2682, 2818, 2962, 3113, 3275, 3452, 3641, 3842, 4050, 4261, 4466, 4657, 4827, 4984, 5131, 5258, 5338, 5361, 5339, 5281, 5177, 5020, 4830, 4636, 4449, 4261, 4072, 3889, 3707, 3514, 3318, 3143, 3006, 2897, 2799, 2708, 2623, 2543, 2466, 2401, 2354, 2321, 2292, 2264, 2235, 2195, 2142, 2089, 2052, 2029, 2010, 1991, 1981, 1979, 1976, 1966, 1955, 1949, 1948, 1953, 1961, 1972, 1983, 1999, 2023, 2052, 2074, 2080, 2074, 2062, 2043, 2017, 1993, 1986, 1999, 2024, 2046, 2058, 2063, 2070, 2085, 2101, 2103, 2084, 2060, 2051, 2062, 2085, 2113, 2148, 2186, 2211, 2216]
2087B216jJ4L5M0L8L9M4M1K0jjL0P3R8Q8O4O1Q3J01R3Q0R0J16J34J33J38J48J46J15P8N5M8
2083D456M1L4L3L1J9%mNJ7K7L9O0P6Q4Q9R8J04J01R1P9P3P2O5M2Pk6m1m4n1p0r8j25j49j56
2079D979j41j15j00j05j14j08q7o7n8n3m7m1l5k8j5KJ3J4Lpq%J0J3Noj6j8j0%J1K2L1L5L7
2075C996M6O0O5M9K1KLJ7L3N1O2O1M8L7L9M7M4L4L3N1Q4J09J10R1P0O4O6O3N4M6N2O9Q5Q9
2071E851P9O7O6P1P6P8Q3R4R9R2Q6R3J08J16J17J19J26J26J20J17J25J41J56J65J65J57J54
2067H847J68J88K00J96J95K01K07K11K24K49K60K47K32K32K46K55K62K79L03L24L47L83M16
2065A4672M33M38M53M78M92M91M88M95N16N55O11O65O93P04P31P84Q36Q71R12R74J042J097
2062B9431J150J232J339J444J539J642J769J914K070K240K426K635K868L134L426L750M113
$$ y = [2216, 2215, 2229, 2264, 2304, 2342, 2381, 2425, 2466, 2486, 2485, 2484, 2514, 2587, 2685, 2773, 2837, 2898, 2981, 3082, 3175, 3255, 3345, 3461, 3595, 3728, 3866, 4014, 4160, 4275, 4353, 4408, 4456, 4497, 4531, 4564, 4595, 4614, 4614, 4610, 4615, 4632, 4659, 4698, 4758, 4834, 4918, 5007, 5105, 5209, 5310, 5401, 5480, 5553, 5625, 5690, 5732, 5739, 5713, 5672, 5628, 5577, 5507, 5409, 5284, 5135, 4979, 4838, 4723, 4623, 4518, 4404, 4296, 4209, 4142, 4084, 4031, 3984, 3943, 3908, 3880, 3865, 3867, 3880, 3894, 3897, 3890, 3882, 3882, 3892, 3905, 3910, 3904, 3888, 3870, 3860, 3860, 3871, 3893, 3924, 3959, 3996, 4042, 4102, 4167, 4216, 4237, 4239, 4242, 4259, 4292, 4343, 4405, 4466, 4514, 4551, 4590, 4637, 4681, 4715, 4748, 4799, 4883, 4992, 5102, 5193, 5263, 5327, 5393, 5456, 5510, 5556, 5608, 5677, 5762, 5851, 5930, 5997, 6063, 6134, 6210, 6288, 6371, 6465, 6564, 6656, 6742, 6835, 6943, 7059, 7176, 7295, 7421, 7547, 7667, 7784, 7909, 8050, 8206, 8371, 8536, 8693, 8847, 9015, 9203, 9403, 9599, 9794, 9995, 10202, 10413, 10637, 10886, 11146, 11393, 11625, 11857, 12103, 12358, 12620, 12899, 13202, 13526, 13873, 14256, 14672, 15105, 15543, 15996, 16474, 16966, 17457, 17945, 18440, 18956, 19511, 20122, 20787, 21480, 22184, 22915, 23699, 24535, 25406, 26318, 27292, 28334, 29431, 30581, 31813, 33152, 34596, 36135, 37777, 39546, 41460, 43530, 45770, 48196, 50831, 53699, 56833, 60259, 64009, 68122]
2060F8122M524M978N468N998O593P265Q014Q851R801J0885J2111J3478J5004J6698J8565K0588
2058B36943K2724K4914K7070K9087L0844L2197L2987L3068L2322L0671K8073K4543K0147J5001
2056F20591R262L142l096r173j4840j9881k4125k7465k9867l1360l1997l1854l1053k9758
2054C48526k8133k6286k4301k2271k0288j8411j6650j5006j3499j2154j0976r937r007q173
2053A13434p432o783o206n681n198m756m359m004l691l406l140k887k648k439k265k116j975
2051D4448j835j713j616j532j441j342j247j173j116j062j004r48r05q72q30p70p07o64o37
2048B3034o03n50m92m51m23l93l57l37l28l11k74k35k18k25k30k21k08k04k11k21k30k43k65
2046A5804k88l05l15l23l33l40l42l40l37l30l14k89k70k67k73k76k67k48k18j84j60j58j76
$$ y = [68122, 72646, 77624, 83092, 89090, 95683, 102948, 110962, 119813, 129614, 140499, 152610, 166088, 181092, 197790, 216355, 236943, 259667, 284581, 311651, 340738, 371582, 403779, 436766, 469834, 502156, 532827, 560900, 585443, 605590, 620591, 629853, 632995, 629899, 620726, 605886, 586005, 561880, 534415, 504548, 473188, 441191, 409337, 378284, 348526, 320393, 294107, 269806, 247535, 227247, 208836, 192186, 177180, 163681, 151527, 140551, 130614, 121607, 113434, 106002, 99219, 93013, 87332, 82134, 77378, 73019, 69015, 65324, 61918, 58778, 55891, 53243, 50804, 48539, 46423, 44448, 42613, 40900, 39284, 37752, 36311, 34969, 33722, 32549, 31433, 30371, 29367, 28419, 27514, 26642, 25812, 25042, 24335, 23671, 23034, 22431, 21881, 21389, 20938, 20515, 20122, 19765, 19428, 19100, 18789, 18515, 18280, 18062, 17837, 17607, 17386, 17178, 16974, 16763, 16542, 16312, 16069, 15804, 15516, 15211, 14896, 14573, 14240, 13900, 13558, 13218, 12881, 12551, 12237, 11948, 11678, 11411, 11138, 10862, 10595, 10347, 10129, 9945, 9785, 9627, 9451]
2043I451j93j90j70j56j60j70j66j42j21j19j33j41j26r9p7o6o1n3m5m2m7n4o1o4o6o2n9o0
2039F548o5o3m3j3RJ5J2Mj3l9n9n8m8m7n7o7o6o6p6q6q9r1r1q2n9l5l0m2n9p2p8p5n9m5m5
2035D770o0p1o6n5m7m4m2m4n0m5k7oPLj3l3m4l7j0J4K1J3MOJ7J9Mk4l9k6%J4Mj4k3l3m8n5
2030C940l0RL4K8RjjQJ6J8J3NJ4L4M2K3jmJ5L4M1M0L5K1mk3k9k4k1k2k7m4p2r5r8q2o2m8m3
2026C648m9o5p7p7o6n8n8o1o2o0n8m8l6k7k4k1j5j8k9l8l3j9njlj1j9k3j9j3j1j2j1mLNkj4
2021B509k4k4j7j1j3j3pLLj%J2K2K1Qj4l2l4j8KP%qmPJ7K6K8K5J3%j4k8l5l0j7ppj0kJ7L1
2016B381K4jk7l2j7kjppkPK3M8O3N3K9J5J6Ok1l9l0lJ9K3J5LplJ5K7K7K4K7L2K5J5RJj4j9
2011B695ML6M4K3MJNOPJ5J7J4J8L1K8Jk3j6J0K5J5NNPQMjj5k7k4nJ0J1QJ2K0J7OPJ8K2Nk2
$$ y = [9451, 9258, 9068, 8898, 8742, 8582, 8412, 8246, 8104, 7983, 7864, 7731, 7590, 7464, 7365, 7288, 7222, 7161, 7108, 7063, 7021, 6974, 6920, 6859, 6795, 6729, 6667, 6608, 6548, 6483, 6420, 6377, 6364, 6373, 6388, 6400, 6404, 6391, 6352, 6293, 6235, 6187, 6140, 6083, 6016, 5950, 5884, 5808, 5722, 5633, 5542, 5451, 5369, 5310, 5275, 5245, 5203, 5144, 5072, 4994, 4919, 4860, 4815, 4770, 4710, 4639, 4573, 4518, 4471, 4427, 4385, 4341, 4291, 4246, 4219, 4213, 4220, 4223, 4210, 4177, 4133, 4096, 4086, 4100, 4121, 4134, 4138, 4144, 4161, 4180, 4184, 4160, 4121, 4095, 4095, 4109, 4113, 4099, 4076, 4043, 3995, 3940, 3910, 3919, 3953, 3981, 3990, 3989, 3988, 3996, 4012, 4030, 4043, 4048, 4062, 4096, 4138, 4161, 4160, 4156, 4171, 4205, 4246, 4286, 4321, 4342, 4338, 4315, 4286, 4262, 4241, 4219, 4192, 4148, 4076, 3981, 3883, 3801, 3739, 3691, 3648, 3599, 3534, 3457, 3380, 3314, 3256, 3198, 3137, 3075, 3015, 2957, 2909, 2873, 2846, 2822, 2801, 2786, 2768, 2739, 2701, 2668, 2649, 2644, 2643, 2640, 2629, 2610, 2587, 2568, 2555, 2544, 2532, 2521, 2517, 2520, 2525, 2523, 2509, 2485, 2461, 2444, 2433, 2420, 2407, 2400, 2403, 2406, 2405, 2405, 2417, 2439, 2460, 2468, 2454, 2422, 2388, 2370, 2372, 2379, 2379, 2371, 2367, 2374, 2391, 2417, 2445, 2470, 2483, 2483, 2469, 2441, 2406, 2376, 2359, 2352, 2345, 2335, 2333, 2350, 2381, 2405, 2404, 2377, 2345, 2328, 2326, 2325, 2318, 2311, 2309, 2316, 2339, 2387, 2450, 2503, 2532, 2547, 2563, 2569, 2548, 2509, 2479, 2476, 2495, 2518, 2533, 2536, 2529, 2526, 2541, 2568, 2595, 2619, 2646, 2678, 2703, 2718, 2727, 2728, 2714, 2695, 2699, 2735, 2779, 2802, 2806, 2807, 2812, 2818, 2825, 2840, 2857, 2871, 2889, 2920, 2948, 2949, 2926, 2910, 2920, 2945, 2960, 2965, 2970, 2977, 2985, 2989, 2988, 2973, 2946, 2922, 2917, 2927, 2938, 2946, 2958, 2978, 2995, 3001, 3008, 3026, 3048, 3053, 3031]
2006C031l0j7JNlqjM%j2k3k6k0nJ4K7L1K7K5K3J5%j5j8%L2O0O5M6J7PK2M8N4L2jj9rJ5K7J5
2001C436mj7j1J3M2N6L9Mj9j3OJ7K3L9O8Q7P8N3L5K6J9NlNK6M2M1K4J1J7L7M9M4L4L1L6L8
1996D414L4L4L9M9N3M7L5K4J9J6J5J8K9M6N5N4M9N2N5M0Rj0JM0P8R6R7Q8P7P3P7Q3Q3P5O3
1992F107N7N4M8L7K0QJ2M5R5J29J31J12R8J06J26J42J42J37J36J52J78K00K02J81J57J48J60
1988I120J85K05K11K07K03K08K21K40K64K89L11L21L24L29L37L50L71M03M39M63M70M68M72
1986A6411M84N01N14N17N03M82M67M66M71M70M61M61M83N19N55N84O13O61P37Q35R45J055
1983B9195J161J257J351J458J591J751J930K129K345K572K807L060L356L704M101M547N049
1981G3364N618O258P000P889Q959J0226J1703J3418J5417J7725K0364K3340K6620L0101L3602
$$ y = [3031, 3001, 2984, 2985, 2990, 2987, 2979, 2978, 2982, 2982, 2970, 2947, 2921, 2901, 2896, 2910, 2937, 2968, 2995, 3020, 3043, 3058, 3058, 3043, 3025, 3025, 3057, 3117, 3182, 3228, 3245, 3252, 3274, 3322, 3376, 3408, 3407, 3388, 3379, 3394, 3421, 3436, 3432, 3415, 3404, 3417, 3459, 3515, 3554, 3558, 3539, 3526, 3532, 3549, 3572, 3611, 3679, 3766, 3844, 3897, 3932, 3958, 3977, 3982, 3979, 3984, 4010, 4052, 4093, 4117, 4128, 4145, 4182, 4231, 4275, 4309, 4340, 4376, 4414, 4448, 4482, 4521, 4570, 4623, 4670, 4705, 4729, 4748, 4764, 4779, 4797, 4826, 4872, 4927, 4981, 5030, 5082, 5137, 5177, 5186, 5176, 5177, 5217, 5295, 5391, 5488, 5576, 5653, 5726, 5803, 5886, 5969, 6044, 6107, 6164, 6218, 6266, 6303, 6323, 6331, 6343, 6388, 6483, 6612, 6743, 6855, 6953, 7059, 7185, 7327, 7469, 7606, 7742, 7894, 8072, 8272, 8474, 8655, 8812, 8960, 9120, 9305, 9510, 9721, 9928, 10131, 10339, 10560, 10800, 11064, 11353, 11664, 11985, 12309, 12638, 12975, 13325, 13696, 14099, 14538, 15001, 15471, 15939, 16411, 16895, 17396, 17910, 18427, 18930, 19412, 19879, 20345, 20816, 21286, 21747, 22208, 22691, 23210, 23765, 24349, 24962, 25623, 26360, 27195, 28140, 29195, 30356, 31613, 32964, 34422, 36013, 37764, 39694, 41823, 44168, 46740, 49547, 52607, 55963, 59667, 63768, 68315, 73364, 78982, 85240, 92240, 100129, 109088, 119314, 131017, 144435, 159852, 177577, 197941, 221281, 247901, 278002, 311604]
1979C11604L6919L9861M2266M3975M4841M4733M3565M1269L7763L2912K6573J8721R532o04
1977G73930j1137k1441l0882l8887m5011m8987n0761n0518m8632m5554m1713l7476l3164k9039
1976B40728k5248k1839j8818j6200j3984j2132j0581r283q208p320o565n909n341m860m448
1974F9992m073l718l390l108k871k656k449k251k072j907j754j621j523j454j385j308j235
1972C1217j182j139j089j021r47q83q45q30q12p70p10o63o34o07n64n16m86m72m65m59m54
1969A5669m42m19l93l71l52l35l24l20l15l03k89k82k69k39k09k08k29k40k25k01j92j95j91
1966I126j75j55j44j48j67j81j72j41j13j01r8r5r6j17j52j75j74j49j15q8p2o7o9p4q2r1
1963E915r4r2r2j02j17j21j04p0l7k3l7o4q0p4n5m4m7n9o9p5p3o8n9n0l8k0pqk3l6l6k7k7
$$ y = [311604, 348523, 388384, 430650, 474625, 519466, 564199, 607764, 649033, 686796, 719708, 746281, 765002, 774534, 773930, 762793, 741352, 710470, 671583, 626572, 577585, 526824, 476306, 427674, 382120, 340407, 302931, 269767, 240728, 215480, 193641, 174823, 158623, 144639, 132507, 121926, 112643, 104435, 97115, 90550, 84641, 79300, 74440, 69992, 65919, 62201, 58811, 55703, 52832, 50176, 47727, 45476, 43404, 41497, 39743, 38122, 36599, 35145, 33760, 32452, 31217, 30035, 28896, 27807, 26786, 25839, 24956, 24111, 23281, 22469, 21699, 20989, 20326, 19692, 19085, 18521, 18005, 17519, 17047, 16582, 16123, 15669, 15227, 14808, 14415, 14044, 13692, 13357, 13033, 12713, 12398, 12095, 11806, 11524, 11255, 11016, 10807, 10599, 10370, 10130, 9905, 9704, 9512, 9317, 9126, 8951, 8796, 8652, 8504, 8337, 8156, 7984, 7843, 7730, 7629, 7531, 7436, 7340, 7223, 7071, 6896, 6722, 6573, 6458, 6370, 6298, 6231, 6162, 6088, 6006, 5915, 5821, 5729, 5637, 5535, 5418, 5297, 5193, 5123, 5086, 5063, 5026, 4962, 4882, 4808, 4753, 4709, 4662, 4603, 4534, 4459, 4386, 4318, 4259, 4209, 4171, 4151, 4144, 4136, 4113, 4077, 4041, 4014, 3987]
1959C987l8n2o3o5o0m2j4%j2l8n5o0o3o3m7j4PQLRJ7Oj5k7k7l0l7l5k5k0k3k6k2k6l7m5m3
1955B913l4k8k4k1k5l4l8l7l7l7k6qOMkljjLPnl4n6m8j5J7L6M1L3J2qqJ0K7K9J5lj7j8oKl
1949B578r%K4L7L4J9Npj4j6j1j1k3m1n9o8o4m9l7l6m2l7k6k2k8l6l7l9m6m8l5j8j1j8k8l1
1945A750k5j7j4j7j9j1NJ1jk0l1k9k0j3qqj7k9l2j9NK3K6J4Joj7l1l9k6kNj2k8k0LJ7J6J0
1940A375J2J4Nj0j7rQK3K2Jk8m6m0j7OJ7J6J2Qlk1l0k4j0pj9l3l8l6k8j5LJ7K5K9L0K0%j1
1936A201j1qj6k0mK0K1mk9l2k4k6l8m2k6%J9K2J4OJ4L2M8M6K0j5l6l0rLJLJ4J7Kj5j2%jj8
1931A087k2j2ok3m3m3k4j3j7k4k0%K2L9M5M3L5J8ok7k9j4nqj5j0MJ4J7J9J8Orj4%J5J6jj6
1926I97j6ppj4rJ3L1K1j0k7j9oj0k2k7j4LJ9L1L2K4J2Klpj0j3k0k9l1j9lLkl%NLKjj0k5l8
$$ y = [3987, 3949, 3897, 3834, 3769, 3709, 3667, 3653, 3653, 3641, 3603, 3548, 3488, 3425, 3362, 3315, 3301, 3308, 3316, 3319, 3328, 3345, 3351, 3336, 3309, 3282, 3252, 3215, 3180, 3155, 3135, 3112, 3086, 3064, 3038, 3001, 2956, 2913, 2879, 2851, 2827, 2806, 2781, 2747, 2709, 2672, 2635, 2598, 2572, 2564, 2570, 2574, 2572, 2569, 2568, 2567, 2570, 2577, 2572, 2538, 2482, 2434, 2419, 2436, 2472, 2513, 2546, 2558, 2550, 2542, 2552, 2579, 2608, 2623, 2620, 2603, 2585, 2579, 2581, 2578, 2569, 2569, 2593, 2630, 2664, 2683, 2688, 2681, 2667, 2651, 2640, 2629, 2606, 2565, 2506, 2438, 2374, 2325, 2288, 2252, 2210, 2173, 2147, 2125, 2097, 2061, 2024, 1985, 1939, 1891, 1856, 1838, 1827, 1809, 1781, 1750, 1725, 1708, 1694, 1677, 1658, 1647, 1652, 1663, 1662, 1642, 1611, 1582, 1562, 1549, 1541, 1533, 1516, 1487, 1455, 1436, 1441, 1464, 1490, 1504, 1505, 1499, 1482, 1451, 1412, 1386, 1384, 1389, 1377, 1349, 1329, 1332, 1349, 1365, 1375, 1387, 1401, 1406, 1396, 1379, 1370, 1378, 1401, 1423, 1424, 1396, 1350, 1310, 1293, 1299, 1316, 1332, 1344, 1352, 1349, 1328, 1298, 1274, 1264, 1257, 1238, 1205, 1167, 1131, 1103, 1088, 1091, 1108, 1133, 1162, 1192, 1212, 1212, 1201, 1190, 1182, 1166, 1146, 1142, 1162, 1183, 1179, 1150, 1118, 1094, 1068, 1030, 988, 962, 962, 981, 1003, 1017, 1023, 1037, 1069, 1117, 1163, 1183, 1168, 1132, 1102, 1093, 1096, 1097, 1100, 1114, 1131, 1133, 1118, 1106, 1106, 1105, 1087, 1065, 1053, 1047, 1024, 981, 938, 914, 901, 884, 860, 840, 840, 862, 901, 946, 989, 1024, 1042, 1036, 1009, 980, 966, 961, 953, 938, 928, 932, 946, 963, 982, 1000, 1006, 997, 983, 983, 998, 1014, 1013, 997, 981, 974, 967, 953, 944, 957, 988, 1009, 999, 972, 953, 947, 937, 915, 888, 874, 877, 896, 927, 959, 983, 995, 997, 994, 987, 977, 964, 944, 915, 884, 865, 862, 865, 863, 860, 860, 865, 868, 870, 869, 859, 834, 796]
1921G96l6k2oLKKJ0K0J7jk0j9oMNJ3K4K9K1J1OLnj3j7k4l0k6KL1L3Pk0k3pJ2K2K1Rj1k9l4
1915G54k6j1JJ0J5J8J5J4J5J0j0l4m2k7kJ3J6J6J2MpnJ0K7K6Pj3j8j1nj4k9l3j8m%%RK2J8
1911G23kj9k3k0k0j5MK4L3K9K7J9Kj5j6OK5K5J0nj3j9k3k5j5MK9M6M5K8Oj4k4k3qQJ8K0K0
1906H52J4Lj3k2k2j9rPK0J1j4l0j8LJ0%n%Jrk0k2j9j8j3nJkjJ1K5J7j0k7j7MJ1kj5j9j2KJ6
1901F45K6J8lj7oJ9L0K1J0J6L0L1Rj7k5j6ojKJ0Rj4m7o2m4nK3L5M0M0K9J0JMLj7m0m4k0QK3
1896G08K5J5lk5k9pK2L2J7LOJ8J7%j5j5plnrj3j6j5pOJ2NppNJ8K1J6Plj0j2pmpj4j4pLLjn
1890F92%J1J7J2kj6j9j0J1L0L5K0%j2pmolJ2K6K0kj5rjklJ1K4J7lj5j1j3k8m3m0k2lQJ1Mj0
1885F62j5oJ0J0JnMJ3J4J0PLknjOJj1k3k5j8j5rKK3M0M3L0J2krrqnnmjQK1L0K5Nj5k2j1LM
$$ y = [796, 760, 738, 732, 735, 737, 739, 749, 769, 786, 785, 765, 746, 740, 744, 749, 762, 786, 815, 836, 847, 853, 856, 851, 838, 821, 797, 767, 741, 743, 774, 807, 814, 794, 771, 764, 776, 798, 819, 828, 817, 788, 754, 728, 717, 718, 728, 743, 761, 776, 790, 805, 815, 805, 771, 729, 702, 700, 713, 729, 745, 757, 761, 754, 749, 759, 786, 812, 819, 806, 788, 777, 772, 758, 729, 696, 678, 674, 674, 674, 683, 705, 723, 721, 702, 679, 659, 639, 624, 628, 652, 685, 714, 741, 760, 762, 747, 731, 737, 762, 787, 797, 792, 779, 760, 737, 712, 697, 701, 730, 776, 821, 849, 855, 841, 817, 794, 786, 794, 812, 832, 852, 866, 869, 856, 834, 812, 793, 784, 791, 811, 822, 808, 778, 760, 763, 773, 773, 768, 768, 769, 760, 740, 718, 699, 681, 668, 663, 664, 662, 661, 672, 697, 714, 704, 677, 660, 664, 675, 673, 658, 639, 627, 629, 645, 671, 689, 686, 669, 663, 682, 712, 733, 743, 759, 789, 820, 829, 812, 787, 771, 765, 764, 766, 776, 785, 771, 724, 662, 618, 613, 636, 671, 711, 751, 780, 790, 791, 795, 798, 781, 741, 697, 677, 685, 708, 733, 748, 745, 720, 691, 684, 706, 738, 755, 758, 764, 782, 799, 799, 784, 769, 762, 759, 754, 745, 732, 716, 701, 694, 700, 712, 717, 710, 703, 708, 726, 747, 763, 770, 767, 757, 745, 738, 734, 727, 713, 699, 692, 695, 698, 697, 692, 692, 703, 720, 732, 730, 714, 695, 685, 696, 726, 761, 781, 781, 769, 762, 758, 752, 749, 761, 787, 807, 805, 790, 781, 780, 778, 775, 786, 810, 827, 824, 809, 798, 785, 757, 714, 674, 652, 649, 657, 668, 672, 662, 647, 641, 651, 661, 662, 657, 661, 674, 688, 698, 705, 708, 706, 701, 700, 706, 707, 696, 673, 648, 630, 615, 606, 608, 631, 671, 714, 744, 756, 754, 745, 736, 728, 723, 718, 714, 713, 721, 742, 772, 797, 802, 787, 765, 754, 757, 761]
1879G61qj5rJMJRL2O2Q6R4Q9P2M8K8J5J0QLqk4m3n4n8n8n9n8n3l7j1J1Ok2m5l2JJ5mk6k6j1
1874F95j2k9l6k9j5nNJ8K6K7K7L5L8K8J1KJpk9m3l2LL3M4L1J0j4l3l9k4KK3K6J6jj8l2l8l1
1869F34j5QL2L6J8qj6olj9l3j7J1K1Nj2j7j1nLJ3J3LnnKORJ2J1mk6m0l9j7J5M2M3K3Kmj%%
1864F59%pk1k4mK1K6QmkPNqk0j9lK3L4J6j2k0mJ2J0kokjkknj0qOK2K3Mj4k1j7j3j0nljOJ9
1858F31K2J2klPQpk4k4j5j6k3k1mJ1J1%kMJ1J5J6J8J4Omj5k6l2k5nJ0J1L%NJ4J6J4RKmrj0
1853E99rj0j3j2kQOmnJ2K5J9LlMRMklpj3nJ7L4L1J5RQLj2k0j8j3j2j1qjORNjjQJ6K0J8J9J6
1847G38Qj%LJnkJ1J6Oj8l4l4j8LJ5Oj8l0j7J2K5J1j0j2kKj0j7mJ8K6J2nmOQKj0k3l4l6k6j0
1841E49kQK8M9M7J9j2j9nJ5J9Rpj0LJ9J8kj8j9oNPlj5j6jJ4Rj1j5JJ6Rj2k6k8k1jK2L3K4Q
$$ y = [761, 753, 738, 729, 730, 734, 735, 744, 776, 838, 924, 1018, 1107, 1179, 1227, 1255, 1270, 1280, 1288, 1291, 1283, 1259, 1216, 1162, 1104, 1046, 987, 929, 876, 839, 828, 839, 845, 823, 778, 746, 747, 762, 758, 732, 706, 695, 683, 654, 618, 589, 574, 569, 574, 592, 618, 645, 672, 707, 745, 773, 784, 786, 787, 780, 751, 708, 676, 679, 712, 756, 787, 797, 783, 750, 711, 687, 689, 712, 738, 754, 753, 735, 703, 665, 634, 619, 627, 659, 695, 713, 705, 689, 683, 680, 661, 628, 611, 622, 643, 648, 636, 619, 608, 603, 606, 619, 632, 635, 630, 625, 627, 633, 642, 654, 665, 661, 635, 595, 556, 539, 554, 596, 639, 662, 664, 660, 659, 659, 659, 659, 652, 631, 607, 603, 624, 650, 658, 654, 652, 659, 664, 656, 636, 617, 614, 637, 671, 687, 675, 655, 651, 663, 673, 671, 665, 663, 662, 660, 658, 653, 643, 635, 641, 663, 686, 690, 676, 655, 638, 625, 615, 610, 607, 606, 612, 631, 653, 665, 663, 660, 667, 675, 668, 644, 620, 605, 589, 566, 545, 541, 552, 563, 563, 561, 565, 576, 591, 607, 625, 639, 645, 641, 626, 600, 568, 543, 538, 548, 559, 562, 562, 567, 581, 597, 611, 620, 622, 618, 609, 599, 590, 580, 567, 555, 553, 561, 567, 563, 558, 570, 595, 614, 617, 614, 618, 627, 631, 629, 626, 619, 606, 601, 618, 652, 683, 698, 707, 715, 718, 706, 686, 668, 655, 643, 632, 624, 623, 629, 638, 643, 642, 641, 649, 665, 685, 703, 722, 738, 746, 745, 745, 748, 749, 744, 742, 753, 769, 775, 757, 723, 689, 671, 674, 689, 695, 677, 647, 630, 642, 667, 678, 668, 656, 654, 656, 646, 629, 625, 643, 669, 681, 676, 672, 678, 686, 688, 678, 655, 621, 585, 559, 549, 547, 555, 583, 632, 679, 698, 686, 667, 662, 677, 696, 705, 698, 688, 691, 710, 728, 726, 708, 689, 683, 688, 695, 692, 677, 661, 660, 674, 683, 672, 657, 658, 674, 683, 671, 645, 617, 596, 595, 617, 650, 674, 682]
1836F82NJ3J2jk2m1n1m3k0%OOJkJK2N3N9K7j5k8j6kPK3L7K8jj8j2lokJ0J2j3m3m9l0j0JJ0
1831E87K2L4M1L8J9oj6oQQOJ1J5Oqj0mlnljj2k3k2j2qnJ2L6L1qm3l8lK6K9J3nj9k0pQNk1m6
1825F01m3j5J6L0K7J8J2QQJ4J8K0J8J7J6Jj9k9j8JRNK%qj6j6j3j9k3j2J1K3J6OKlj6k6k4j3
1820E86j0j6k0j9j7j1LJ8K4K5K4K7L1M0M1K2j3l5k7oLmpnj2k4k3jK7L6K7J3Llnk%rk3l0j9
1815F09MJ9J4%nMJ3Qoj7j9j7j0ljoj0lPJk0l8l4rJ9L6L1Lk5k9qJ9K5J7Nlj0j0n%%jPJ4J3Q
1810E87J4K7K7Qj5k2j1MQmk3l0j1K2N2N5L4Mj5j4jRLqj3rllmkNJ2J7J6J0MKJKNJ1J4J0NNN
1804G90jj0j0ljnj0j6k6m1m0j9RJ8J1%%KMPROlj5j8j3nkkLJ3J4kk6m1l4k2j1KJ8L0K7J2MO
1799F09Ojj0j1j0k1l3l3j5LPJ1K3L8L7J7MRJ5Kk4l3j3K0L8M0L1J6Jrpklj3k7l3k8j2OJ6J9
$$ y = [682, 687, 700, 712, 711, 689, 648, 597, 554, 534, 534, 540, 546, 547, 545, 546, 568, 621, 680, 707, 692, 664, 648, 646, 653, 676, 713, 741, 740, 722, 710, 707, 701, 699, 709, 721, 708, 665, 616, 586, 576, 577, 587, 609, 643, 684, 722, 741, 735, 719, 713, 721, 729, 735, 746, 761, 767, 759, 749, 745, 742, 737, 734, 733, 721, 698, 676, 664, 656, 651, 663, 699, 730, 722, 679, 641, 638, 664, 693, 706, 701, 682, 662, 655, 663, 668, 647, 601, 558, 543, 559, 589, 616, 634, 646, 654, 662, 676, 694, 714, 732, 749, 765, 766, 747, 718, 700, 701, 710, 715, 717, 717, 709, 693, 677, 664, 645, 622, 610, 621, 644, 660, 666, 668, 665, 649, 623, 599, 586, 576, 560, 540, 521, 504, 493, 496, 514, 538, 563, 587, 614, 645, 685, 726, 748, 735, 700, 673, 667, 670, 666, 659, 654, 642, 618, 595, 594, 621, 657, 684, 697, 700, 697, 692, 690, 690, 681, 658, 628, 609, 613, 632, 646, 646, 641, 645, 658, 666, 660, 643, 624, 607, 597, 594, 593, 587, 577, 574, 581, 582, 562, 524, 490, 481, 500, 536, 567, 570, 545, 516, 508, 527, 552, 569, 574, 571, 561, 551, 546, 546, 546, 545, 552, 566, 579, 587, 601, 628, 655, 663, 648, 626, 615, 619, 627, 623, 600, 570, 559, 581, 633, 688, 722, 726, 711, 697, 696, 705, 708, 700, 687, 678, 675, 672, 668, 666, 671, 683, 700, 716, 726, 730, 732, 733, 735, 740, 751, 765, 775, 780, 785, 790, 789, 779, 769, 766, 765, 760, 750, 734, 708, 667, 627, 608, 617, 635, 646, 646, 646, 648, 652, 659, 668, 674, 671, 656, 638, 625, 620, 618, 616, 619, 632, 646, 644, 618, 577, 543, 521, 510, 512, 530, 560, 587, 599, 603, 609, 615, 614, 604, 593, 583, 562, 529, 496, 481, 484, 491, 502, 525, 563, 600, 617, 621, 630, 645, 647, 623, 590, 577, 597, 635, 675, 706, 722, 723, 714, 707, 705, 702, 689, 662, 629, 601, 589, 595, 611, 630]
1794F30K4L2L4K2Nrj4j3qKP%j3j7j1qj4j8j7j5j8j6qkj1k3j7MJ8K2K5L1K5Lk3l0j8plMJ6K6
1788E97K9L5M8M8K4j3l0j6RJ9Rrk0k5k0j4rj1oQK4K7J8J1QJj5k4j2J0J6Nj0j6k4l4l8k4lR
1784E82NkmnoLK0K9J8mj0OK8L7K5jk3k9j2PNj8l6k8lJ0QNQJ5J5J6K0K3J8J2PLmj0mMMlj0j2
1778G09j1j2mOJ2QRK1K2ll9m7j8J4K1J3J2J2lk7l2j9j0j9l3l6l3l0j2K4N5N3K5PJ2K1J1oj6
1773F57j2rj5k4k7k0pkkjJ0K0J5%rolkJ0K5K7QrnJ0J2jj5j9j2OK8L8L2K2K3J9pm1m8j9J3K1
1768F81P%PJ6J3mk5l6k5pKklRK3K4J6J1RKj3k0j5mMJ0J5J2kj4j3JJ1RjmNJ7J9Oqj3j0oMJ5
1762G23K0J4QPQ%j5j9qKlj5k0j3lNJ3J5J1mj7j4NK4K7J0j0k0j7j0lJOOlj6k1j0J1K8K6RJJ6
1757G55M4N6L6jk7l4l0k5j9j4rnMJ1%j9k3%K4K1pk1kK0J3j2k7k1rlLJ2J0pk1k1rnKK3N2N7
$$ y = [630, 654, 686, 720, 742, 747, 738, 724, 711, 703, 705, 712, 712, 699, 682, 671, 663, 649, 631, 614, 599, 581, 565, 557, 555, 544, 521, 504, 508, 526, 548, 573, 604, 629, 632, 609, 579, 561, 554, 551, 555, 571, 597, 626, 661, 709, 757, 781, 768, 738, 722, 731, 750, 759, 750, 730, 705, 685, 671, 662, 651, 645, 653, 677, 704, 722, 733, 741, 742, 727, 703, 691, 701, 717, 722, 712, 696, 672, 638, 600, 576, 573, 582, 587, 585, 581, 576, 570, 573, 593, 622, 640, 636, 626, 632, 660, 697, 722, 721, 698, 669, 657, 664, 669, 651, 615, 587, 584, 594, 602, 607, 615, 630, 645, 661, 681, 704, 722, 734, 741, 744, 740, 730, 726, 730, 734, 731, 721, 709, 698, 686, 682, 688, 700, 708, 717, 738, 760, 757, 718, 671, 653, 667, 688, 701, 713, 725, 722, 695, 663, 644, 634, 615, 582, 546, 513, 483, 471, 495, 550, 603, 628, 635, 647, 668, 679, 673, 657, 645, 636, 621, 597, 570, 550, 543, 541, 539, 538, 548, 568, 583, 583, 574, 568, 565, 563, 573, 598, 625, 633, 624, 619, 629, 641, 640, 625, 606, 594, 600, 628, 666, 698, 720, 743, 762, 755, 714, 666, 647, 660, 681, 688, 688, 695, 711, 724, 720, 695, 659, 634, 627, 629, 627, 624, 633, 656, 680, 696, 707, 716, 718, 705, 685, 670, 666, 670, 680, 695, 707, 705, 691, 678, 679, 690, 699, 698, 694, 699, 716, 735, 741, 733, 720, 710, 704, 708, 723, 743, 757, 765, 772, 780, 780, 765, 746, 738, 740, 737, 722, 702, 689, 686, 691, 704, 719, 730, 726, 709, 695, 700, 724, 751, 761, 751, 731, 714, 704, 701, 702, 708, 714, 711, 695, 674, 664, 675, 703, 729, 738, 739, 755, 799, 855, 891, 890, 863, 829, 799, 774, 755, 741, 732, 727, 731, 742, 742, 723, 700, 700, 724, 745, 738, 717, 715, 735, 748, 736, 709, 688, 679, 676, 679, 691, 701, 694, 673, 652, 643, 638, 640, 663, 715, 772]
1752G72L2KnOJ1Moj0j4j9k6l7m6m4k3OK2J6JonmnpjQK5L9M5L5J5lj2j4j0kPNpk4l7m2l6j9
1746E87KJ7K2J9J6J6J2jk2m0m2k8j0JJ0K5M8O2N6L7J5nk3k9j8mnk0k5j2RJ9K0K6L3K9Qj5k4
1742G66j9j2j2j9k5k0pLjj5k7k5j0KN%LJ8L3L2J2j1j6qKKJLN%qj5j3ojKQK3M2M7K8Monj2k5
1736G23k7oJ5J5Kj%mrjRMj5j6J1L5L3J2%mj2k6k8j5%Jpj6j9oK1M5M3J8nj1j1j5j5kJ1J2JJ
1731G41J9L0K0nj7j3pj3k4k0KL0M0K5Lj8l0l5k4%J9J1j1j7LK7K6Lj3qJ2K8K9J9RJlnqrrj2
1725G96j8k9l8m3l7j7OJ7J9J7J3jk3l4l1k1j7j1PK8L2K3J3OJkLJ1J5QKKjm%Mmj7j0K1L7J9
1720G42j4k3qMKMK2L5L0J6J3K3L7L8J4k1m3l7j3jllOJ1JqkMLloj1k3l2j9LJ1NPJ6J7%j0JJ4
1715G99Qj5k6j3NQmj1lROj0k2j4J1K9L4L6L2J8nj8mJ9K1lk4j9jOmj7j6okok3l9m4k9kK0K7
$$ y = [772, 804, 806, 801, 807, 818, 822, 816, 806, 792, 773, 747, 710, 664, 620, 597, 603, 625, 641, 642, 636, 631, 627, 622, 615, 614, 622, 647, 686, 731, 766, 781, 778, 766, 752, 742, 740, 747, 752, 745, 721, 684, 642, 606, 587, 589, 606, 628, 647, 663, 679, 691, 690, 668, 628, 586, 558, 548, 549, 559, 584, 632, 694, 750, 787, 802, 797, 774, 745, 727, 723, 718, 698, 673, 661, 670, 689, 709, 735, 768, 797, 805, 790, 766, 747, 735, 723, 704, 679, 659, 652, 655, 654, 639, 612, 587, 577, 579, 584, 584, 587, 605, 638, 670, 682, 671, 655, 647, 649, 651, 652, 655, 660, 660, 652, 637, 624, 618, 617, 619, 627, 650, 692, 739, 767, 771, 765, 760, 748, 723, 696, 690, 705, 720, 722, 721, 721, 717, 708, 707, 716, 720, 705, 689, 700, 735, 768, 780, 780, 776, 764, 738, 710, 695, 695, 696, 689, 673, 654, 648, 669, 714, 757, 775, 770, 759, 748, 733, 718, 716, 727, 739, 740, 741, 760, 790, 810, 805, 788, 775, 768, 755, 731, 711, 713, 743, 783, 808, 811, 793, 763, 728, 704, 704, 723, 734, 723, 706, 709, 736, 762, 765, 752, 744, 756, 784, 813, 832, 841, 842, 839, 834, 826, 817, 808, 796, 778, 749, 711, 668, 631, 614, 620, 637, 656, 673, 686, 685, 662, 628, 597, 576, 559, 548, 555, 583, 615, 638, 651, 657, 658, 656, 659, 670, 685, 693, 695, 697, 696, 692, 692, 696, 692, 675, 665, 686, 723, 742, 728, 705, 697, 701, 703, 707, 729, 764, 794, 810, 823, 846, 883, 921, 935, 914, 871, 834, 821, 820, 817, 814, 820, 831, 832, 824, 822, 826, 829, 826, 820, 809, 786, 754, 735, 738, 749, 754, 761, 777, 794, 794, 784, 785, 799, 807, 792, 766, 753, 758, 766, 762, 751, 748, 757, 763, 753, 731, 717, 728, 757, 791, 827, 859, 877, 872, 854, 850, 869, 890, 887, 863, 844, 843, 849, 845, 828, 812, 806, 804, 798, 775, 736, 692, 663, 661, 681, 708]
1710G08J4mj7j9nJ4K3J4lj2jJ2J4Ok%PRJ1J5J5Kj4k1j8j6j8j6oJrk7l3k0lOQQJ0J2J7K3L0
1704G15K8J7lj8k1oJ5K0J2MMJj2k2k2j3j1j2pQJ1LmkPJ5K6L8L8J9jj3j7k6l4l7l2k8j7LK5
1699F51K6Qj2j7j4pPK5L8L4J7NPK1L0K3nl3m0j9OJ2MjORkj0kJ2Qj4k8k5j4j0mJ2K6K4J2J3
1694G79K2K1Jk5l5l0k1r%KmlPJ8J5Kkkj0j9j6KJ0ok4j9%J6J3Kj1k0j6LK4K7Mj9k3j0%%kOJ9
1689F67L0K6J0kkPRkj0kJ3J5kj5j0KJj2k6l4l6k9rJ9L9M5L6K2Lj5k2j5mmj7m0o0o0l1J1L8
1684E34L5J6J0K4M0M7M4L6K7J3mk3m1m2k0QJ8QjLJ0PNJ4K4K0Lj2j6pQJ9J2j7m6n0k3J3L4L2
1679G62J0j6k9k1JJ9K9L7L8K1ok6k4j2lmpoMJ5K3J7ll1n1n5m2j9RL6N3N1L1Jj7j4jLpk1l0
1674G15k8j7%J3J3OMONmqmMPQJ4J7Rjqj3k0k2j2NJ8K1J0rk2j7LJ9J8J2J3J2lk5l4k8j9j1L
$$ y = [708, 722, 718, 701, 682, 677, 691, 714, 728, 725, 713, 712, 724, 738, 744, 742, 742, 749, 758, 769, 784, 799, 801, 787, 766, 748, 732, 714, 698, 692, 693, 684, 657, 624, 604, 601, 607, 615, 623, 633, 645, 662, 685, 715, 743, 760, 757, 739, 718, 712, 727, 747, 759, 763, 767, 768, 756, 734, 712, 699, 688, 676, 669, 677, 688, 691, 687, 685, 692, 707, 733, 771, 809, 828, 827, 814, 797, 771, 737, 700, 668, 640, 623, 626, 651, 677, 685, 673, 656, 642, 635, 642, 667, 705, 739, 756, 761, 768, 789, 819, 842, 837, 804, 764, 745, 751, 763, 767, 766, 772, 781, 779, 769, 767, 779, 787, 773, 745, 720, 706, 696, 692, 704, 730, 754, 766, 779, 801, 822, 823, 798, 763, 733, 712, 703, 703, 705, 701, 698, 705, 723, 738, 740, 738, 736, 726, 707, 691, 693, 703, 697, 673, 654, 654, 670, 683, 685, 674, 654, 638, 641, 665, 692, 696, 677, 654, 644, 644, 644, 642, 648, 667, 697, 723, 733, 731, 729, 736, 745, 743, 733, 731, 744, 759, 757, 742, 732, 734, 735, 723, 697, 663, 627, 598, 589, 608, 647, 692, 728, 750, 753, 738, 716, 701, 697, 693, 676, 636, 576, 516, 485, 496, 534, 569, 585, 595, 619, 659, 706, 750, 786, 813, 826, 822, 799, 758, 716, 696, 704, 722, 730, 729, 732, 742, 749, 754, 768, 792, 812, 815, 803, 787, 780, 788, 807, 819, 802, 756, 706, 683, 696, 730, 762, 772, 756, 727, 706, 707, 726, 755, 792, 830, 851, 845, 819, 795, 783, 780, 776, 769, 763, 767, 782, 805, 822, 819, 788, 737, 682, 640, 621, 630, 666, 719, 770, 801, 802, 785, 771, 770, 773, 766, 745, 715, 687, 670, 670, 683, 696, 702, 706, 712, 717, 713, 705, 701, 705, 712, 720, 734, 751, 760, 759, 751, 738, 718, 696, 684, 689, 707, 728, 738, 729, 707, 690, 693, 712, 730, 742, 755, 767, 764, 739, 705, 677, 658, 647, 650]
1668F50J8J8NkLjj8l4k6mJ0J1J0J5J9K1K6L0K8K3J8Pj8l6k9nJj8k8rK1K7J4PJj5l2k0J6L4
1663G38J1k1k1PK8K7K1K4K8J8Mmj0j4j7j1norrqpMK1K9J0k0l9k8mK0L5L3J6pj3lLpk0k4j8
1658G52j1kJ7L0K4MlNJ5Qj2l3m7m5k0J8M3L7J3jLJ1Qmk3l5l4j5J4K9K2kk2k7k0lJ9L8N0N3
1653H54M4K1j1l6l6j8lqk2k4rJ5L1L5K5Nj1j0KRLj0j5j1qlOJ7J1j2l4l2j5ljLJ7L0K3Porj1
1648H00j8k2j3%K%LJ1J9J6RPMj2l4m0k1MJ4J3K0L0K3pl1l0j4qoKJ4Qj2k4k1k0k9l2j5NJ5J9
1643F29L0M3M1K1lj8k4k3j7j7k3k2qOLqnJ0J4MkJ1K6K1NKJ9L8L8K4Pkqj3j3qNK2L4M0L1Rj7
1638I02k9j9jKnj1j0qq%J1Rj0k8k5j0nj2j1%MlqkKmqKJ8J8jj5j2opj5j4mPRLJRK5L7L6K3J2
1632H39QJ1J7K4K9K8J4%pj3l0n4n2j6K9M2K2kj0j2j2nJ3K9K3OnjQJ7J9J6PKKJ%NJ9K3J8J5
$$ y = [650, 668, 686, 691, 689, 692, 691, 673, 639, 613, 609, 619, 630, 640, 655, 674, 695, 721, 751, 779, 802, 820, 827, 809, 773, 744, 739, 740, 722, 694, 685, 706, 733, 747, 754, 755, 740, 708, 688, 704, 738, 749, 728, 707, 714, 742, 769, 790, 814, 842, 860, 864, 860, 850, 836, 819, 808, 803, 797, 788, 779, 771, 764, 768, 789, 818, 828, 808, 769, 741, 737, 757, 792, 825, 841, 834, 821, 818, 821, 814, 794, 770, 752, 741, 739, 756, 786, 810, 814, 811, 816, 831, 839, 827, 794, 747, 702, 682, 700, 743, 780, 793, 792, 795, 806, 814, 810, 787, 752, 718, 703, 717, 746, 768, 766, 744, 717, 697, 694, 713, 751, 801, 854, 898, 919, 908, 872, 836, 818, 815, 807, 785, 761, 752, 767, 798, 833, 858, 863, 852, 842, 844, 853, 856, 846, 831, 820, 812, 809, 815, 832, 843, 831, 797, 765, 750, 747, 746, 749, 766, 796, 819, 826, 820, 811, 800, 782, 760, 747, 747, 749, 749, 752, 763, 782, 798, 807, 814, 818, 806, 772, 732, 711, 715, 729, 742, 762, 792, 815, 808, 777, 747, 733, 725, 719, 721, 735, 743, 731, 707, 686, 666, 637, 605, 590, 595, 610, 629, 659, 702, 743, 764, 761, 743, 719, 696, 679, 662, 639, 617, 609, 615, 618, 610, 605, 615, 629, 633, 631, 642, 668, 689, 694, 696, 715, 753, 791, 815, 822, 820, 812, 799, 786, 778, 783, 805, 839, 879, 910, 919, 902, 873, 854, 853, 855, 850, 839, 829, 821, 813, 813, 824, 833, 823, 795, 770, 760, 755, 743, 732, 732, 736, 733, 725, 723, 725, 721, 713, 715, 733, 751, 750, 735, 723, 717, 710, 695, 681, 677, 684, 693, 696, 697, 706, 731, 768, 804, 827, 839, 847, 858, 875, 899, 928, 956, 970, 970, 963, 950, 920, 866, 814, 798, 827, 869, 891, 889, 879, 867, 855, 850, 863, 892, 915, 921, 916, 915, 923, 940, 959, 975, 982, 984, 986, 987, 987, 992, 1011, 1034, 1052, 1067]
1627A067K4L5L6L6M6M9K1k4m1k0Jjj6k2k5k8k6j0MLJJ3K8K2nk5k6k1j4jJ3J3lj8k1j6j7k3
1622A009k9k6j0J7M1M5M3M7N7N4M1M0N8O9N5L8L4L7K4MlOJ0Kmjjj1l0m7n3n1m7m9n5m8k3L
1618A246Nj2j6jJ6J2pk7l8l9l1j8j3j8k0mRMj0j1NJ6J1QJ6L1M0L4J6kpRL0L3J0pLK3K4Mj2
1612A312rqk2m2m3k8k0l0m1l2j2%lnMJ4Orj2%J0lk5l3k6j8j5rJ1L0L0J1j3k7l1k6j4NK1K3
1608I21J1rk4k8j3J1K2J3%KJ3Rj2k0%K3K0jpOJ5Qnj6k9l4k2MJ2jpMJ3pl1k9rNOJ6L1K8Nj1
1602H83rnj5j7kJ1QjJ1L1M0K9J4Kj0k0k2j3qj1j2qlJQK2K9K2Oj1k0k0j1KJ2K2K4K1J3J2J6
1597A021J5mk6l5k8k7l5m0k7oOOMJ1K4L2L6L2K5J5Krj0JK0L1L3K3Pj1k0j6mmj4k0j7oOJ8K7
1592A036K2Jj3lJ7K5J6J1J9K7J4oj5j2j0j6j8pQJ6J9K3K9K8J8Lj1k0k3j4QK6L2K5J2%rrLK1
$$ y = [1067, 1091, 1126, 1162, 1198, 1244, 1293, 1314, 1290, 1249, 1229, 1230, 1229, 1213, 1191, 1166, 1138, 1112, 1102, 1106, 1109, 1110, 1123, 1151, 1173, 1168, 1143, 1117, 1096, 1082, 1081, 1094, 1107, 1104, 1086, 1065, 1049, 1032, 1009, 980, 954, 944, 961, 1002, 1047, 1090, 1137, 1194, 1248, 1289, 1329, 1387, 1456, 1511, 1549, 1583, 1620, 1644, 1648, 1645, 1651, 1661, 1663, 1659, 1658, 1657, 1646, 1616, 1569, 1516, 1465, 1418, 1369, 1314, 1266, 1243, 1246, 1251, 1239, 1223, 1222, 1238, 1250, 1243, 1216, 1178, 1139, 1108, 1090, 1077, 1059, 1039, 1035, 1044, 1048, 1038, 1027, 1032, 1048, 1059, 1067, 1083, 1114, 1154, 1188, 1204, 1202, 1195, 1204, 1234, 1267, 1277, 1270, 1273, 1296, 1320, 1324, 1312, 1303, 1295, 1273, 1231, 1188, 1160, 1140, 1110, 1069, 1037, 1025, 1025, 1022, 1017, 1021, 1035, 1041, 1032, 1020, 1020, 1030, 1027, 1002, 969, 943, 925, 910, 901, 912, 942, 972, 983, 970, 943, 912, 886, 872, 877, 898, 921, 932, 923, 899, 871, 858, 869, 891, 904, 904, 906, 919, 928, 916, 896, 896, 919, 939, 938, 931, 937, 952, 960, 955, 939, 910, 876, 854, 858, 870, 869, 862, 866, 879, 872, 841, 812, 803, 808, 814, 830, 861, 889, 894, 883, 874, 869, 854, 837, 835, 846, 854, 853, 864, 895, 935, 964, 978, 980, 970, 950, 928, 915, 907, 896, 884, 876, 873, 874, 882, 904, 933, 955, 961, 950, 930, 910, 899, 901, 913, 935, 959, 980, 993, 1005, 1021, 1036, 1032, 1006, 971, 943, 916, 881, 841, 814, 808, 814, 820, 824, 835, 859, 891, 927, 959, 984, 999, 1001, 992, 982, 983, 1003, 1034, 1067, 1090, 1097, 1086, 1066, 1050, 1046, 1042, 1028, 1008, 991, 985, 991, 1009, 1036, 1058, 1059, 1046, 1043, 1060, 1085, 1101, 1112, 1131, 1158, 1172, 1166, 1151, 1139, 1129, 1113, 1095, 1088, 1096, 1112, 1131, 1154, 1183, 1211, 1229, 1232, 1221, 1201, 1178, 1164, 1172, 1198, 1230, 1255, 1267, 1267, 1258, 1249, 1252, 1273]
1587A273L9N3O3O4N7N2N2N3M2L5M9Q5J18J34J51J88K37K76L00L23L53L90M30M65M79M51L90
1584F602L22K64K03J22K1r4k15l31m18m58m56m33m03l74l50l30l07k72k33j98j70j43j19j06
1581B124r8q5o5n6n9o3n1k9j8k1l1l8m2m2l3k3k4k9k9j3OJ7J8J2Jj5k5k0j1qj2j3j3k0l6m5
1577A111l9k0LK3L5L7K8J5Lnj2j0qqj0oKLmpLJ1Q%LRNj2k3k4k1j7j0LJ1J3J9K8L2K6J5Rjj5
1571A203k8k7j5orj0lJ4K5J9jj6rJ6L7L8K7J6Ppk0k2j2mjMJ7K9K9K0J0MJKQJ7J6%j2j4qj4
1566A321l0l7k2J0L0K9J4%nkPJ7K6K9K4J2kj0j2j5j7qJ2L4M0K7QJOJ5K3J8MnLJ9K5J9K2L6
1561A666M6L6K6L6O5Q2P9P2Q1R7J06J02R4Q3P2O4N9N6M4J5k1n4p1p8q1q2q0q1q9j01r6o4k9
1557B054j6k5k9k3k3l5m5m4l9m1l7k4j5k6k9oK6K9Jk1j4LLlJ0L0L6J7mj4j6k2k2qJ8L3K9J0
$$ y = [1273, 1312, 1365, 1428, 1492, 1549, 1601, 1653, 1706, 1748, 1783, 1832, 1917, 2035, 2169, 2320, 2508, 2745, 3021, 3321, 3644, 3997, 4387, 4817, 5282, 5761, 6212, 6602, 6924, 7188, 7391, 7513, 7534, 7440, 7225, 6894, 6476, 6018, 5562, 5129, 4726, 4352, 4002, 3672, 3365, 3093, 2860, 2662, 2492, 2349, 2230, 2124, 2026, 1941, 1876, 1820, 1761, 1698, 1647, 1618, 1600, 1579, 1548, 1510, 1468, 1426, 1393, 1370, 1346, 1317, 1288, 1275, 1281, 1298, 1316, 1328, 1329, 1314, 1289, 1269, 1258, 1250, 1238, 1225, 1212, 1192, 1156, 1111, 1072, 1052, 1055, 1078, 1113, 1150, 1178, 1193, 1196, 1191, 1179, 1169, 1161, 1153, 1143, 1137, 1139, 1142, 1138, 1131, 1134, 1145, 1153, 1153, 1156, 1165, 1170, 1158, 1135, 1111, 1090, 1073, 1063, 1066, 1077, 1090, 1109, 1137, 1169, 1195, 1210, 1219, 1218, 1203, 1175, 1148, 1133, 1127, 1118, 1108, 1105, 1119, 1144, 1163, 1162, 1146, 1137, 1153, 1190, 1228, 1255, 1271, 1278, 1271, 1251, 1229, 1217, 1213, 1212, 1216, 1233, 1262, 1291, 1311, 1321, 1325, 1326, 1328, 1336, 1353, 1369, 1369, 1357, 1343, 1335, 1321, 1291, 1254, 1232, 1242, 1272, 1301, 1315, 1315, 1310, 1308, 1315, 1332, 1358, 1387, 1411, 1423, 1421, 1411, 1399, 1384, 1367, 1359, 1371, 1405, 1445, 1472, 1480, 1481, 1487, 1502, 1525, 1543, 1547, 1542, 1545, 1564, 1589, 1608, 1630, 1666, 1712, 1748, 1774, 1810, 1875, 1957, 2036, 2108, 2189, 2286, 2392, 2494, 2588, 2671, 2743, 2807, 2866, 2922, 2966, 2981, 2960, 2906, 2835, 2757, 2676, 2594, 2514, 2433, 2344, 2243, 2147, 2083, 2054, 2038, 2013, 1984, 1961, 1938, 1903, 1858, 1814, 1775, 1734, 1697, 1673, 1658, 1632, 1603, 1597, 1623, 1652, 1653, 1632, 1618, 1621, 1624, 1621, 1631, 1661, 1697, 1714, 1710, 1696, 1680, 1658, 1636, 1628, 1646, 1679, 1708, 1718]
1553A718npRL2M1K3j0k9k3j1j1j6j3lNJ1K9M8M8K1loPJ6K2K9L2K1Nl%lj7k8k7j5nlljOJ3J4
1547A908J2QJj3k9l2j1J8L5L1J8J3J8K7K8K1J3J2J7J7Mj0pJ1L1M2M3L8L2K2J2OJ%J%nrlJ1
1542B332K4K7K3J3kj3pJ7L7L8K3OJPK3L8M4M2M0L9K9Nj5j3MJ5K0K9M7O1O1N8N7N6M3K2J4K3
1538C268L4L4K6K4L3M7N7N9N3M1L3L0K7K0QMRJ8K0J7Rjj3j5j0j5k6k4ML9M7L9L8N2N4L7K3
1533D100K6L1K5K3L6N4N1L7K8K5J5RK3M8N9M9L6L5L7L7M1N0N5O0P5R7J08R7Q3P7P4O7O2P0
1529E800P7P0N4N0N5O3O9P9Q9R2R4J00J12J24J37J46J39J17J04J21J48J53J31J11J06J06R9
1526H546J03J24J54J73J85K01K17K20K11K05K17K43K68K79K76K71K78K95L16L35L46L52L63
1523A4178L88M30M71M99N26N73O37O93P36P87Q64R54J029J079J112J135J145J140J123J094
$$ y = [1718, 1713, 1706, 1715, 1747, 1788, 1811, 1801, 1772, 1749, 1738, 1727, 1711, 1698, 1695, 1700, 1711, 1740, 1788, 1836, 1857, 1854, 1848, 1855, 1871, 1893, 1922, 1954, 1975, 1980, 1977, 1977, 1974, 1957, 1929, 1902, 1887, 1882, 1879, 1876, 1875, 1881, 1894, 1908, 1920, 1928, 1929, 1916, 1887, 1855, 1844, 1862, 1897, 1928, 1946, 1959, 1977, 2004, 2032, 2053, 2066, 2078, 2095, 2112, 2116, 2106, 2099, 2110, 2141, 2183, 2226, 2264, 2296, 2318, 2330, 2336, 2337, 2337, 2338, 2338, 2333, 2324, 2321, 2332, 2356, 2383, 2406, 2419, 2417, 2404, 2397, 2414, 2451, 2489, 2512, 2518, 2519, 2526, 2549, 2587, 2631, 2673, 2713, 2752, 2781, 2786, 2771, 2758, 2762, 2777, 2797, 2826, 2873, 2934, 2995, 3053, 3110, 3166, 3209, 3231, 3245, 3268, 3302, 3336, 3362, 3386, 3419, 3466, 3523, 3582, 3635, 3676, 3709, 3739, 3766, 3786, 3794, 3798, 3807, 3825, 3845, 3862, 3871, 3870, 3857, 3842, 3832, 3817, 3791, 3767, 3771, 3810, 3857, 3896, 3934, 3986, 4040, 4077, 4100, 4126, 4157, 4182, 4205, 4241, 4295, 4346, 4383, 4411, 4436, 4451, 4460, 4483, 4531, 4590, 4639, 4675, 4710, 4747, 4784, 4825, 4875, 4930, 4990, 5065, 5162, 5270, 5367, 5450, 5527, 5601, 5668, 5730, 5800, 5877, 5947, 6001, 6051, 6106, 6169, 6238, 6317, 6406, 6498, 6592, 6692, 6804, 6928, 7065, 7211, 7350, 7467, 7571, 7692, 7840, 7993, 8124, 8235, 8341, 8447, 8546, 8649, 8773, 8927, 9100, 9285, 9486, 9703, 9923, 10134, 10339, 10556, 10799, 11067, 11346, 11622, 11893, 12171, 12466, 12782, 13117, 13463, 13815, 14178, 14566, 14996, 15467, 15966, 16492, 17065, 17702, 18395, 19131, 19918, 20782, 21736, 22765, 23844, 24956, 26091, 27236, 28376, 29499, 30593]
1521C0593J057J013R75R42R25R27R56J009J074J139J186J201J184J148J106J051R93R52R45
1518E0376R62R93J041J121J246J404J585J774J968K181K435K736L076L455L883M377M935N571
1516I5119O313P167Q098R094J0206J1515J3059J4872J7036J9661K2838K6645L1204L6654M3079
1514C72560N0505N8866O7831P6605Q4028Q8992R0774Q9048Q3752P5073O3303M8524L0506R261
1512A289628j4150l7454n7925p3418q2970q6850q6297q2978p8300p2951o7041o0593n3828
1511D34873m7108m0765l5031l0038k5804k2264j9330j6923j4949j3307j1928j0776r802q941
1509A27907q158p466o865o324n810n328m881m464m070l717l411l135k878k653k466k293k129
1507E1859j991j895j817j732j648j582j520j441j353j274j198j107j018r56r10q53p88p41
$$ y = [30593, 31650, 32663, 33638, 34580, 35505, 36432, 37388, 38397, 39471, 40610, 41796, 42997, 44181, 45329, 46435, 47486, 48479, 49431, 50376, 51338, 52331, 53372, 54493, 55739, 57143, 58728, 60502, 62470, 64651, 67086, 69822, 72898, 76353, 80236, 84613, 89548, 95119, 101432, 108599, 116697, 125791, 135997, 147512, 160571, 175443, 192479, 212140, 234978, 261623, 292827, 329481, 372560, 423065, 481931, 549762, 626367, 710395, 799387, 890161, 979209, 1062961, 1138034, 1201337, 1249861, 1280367, 1289628, 1275478, 1238024, 1180099, 1106681, 1023711, 936861, 850564, 767586, 689286, 616335, 549294, 488701, 434873, 387765, 347000, 311969, 281931, 256127, 233863, 214533, 197610, 182661, 169354, 157426, 146650, 136848, 127907, 119749, 112283, 105418, 99094, 93284, 87956, 83075, 78611, 74541, 70824, 67413, 64278, 61400, 58747, 56281, 53988, 51859, 49868, 47973, 46156, 44424, 42776, 41194, 39674, 38233, 36880, 35606, 34408, 33301, 32283, 31327, 30417, 29564, 28776, 28035]
1505B8035p19o91o46o02n76n49n09m67m37m08l70l34l17l08k87k50k15j85j58j38j39j60j86
1502A9384k01k10k14k12k08k08k16k25k27k18j99j64j11n4j4klljj8o6j42k21k89l44l94m38
1499A4782m60m47m09l75l58l47l12k58k07j73j44j02o7n4m4mO9J38J81K08K45K89L19L25L10
1496A3105K78K31J72J03J6q4j80k61l28l97m55m89m89m64m28l94l65l43l13k67k19j91j85
1493H053j78j55j31j21j26j35j41j39j31j19j20j34j39j21r1q3r5j00q5o6o5p0n8l3j8k8m5
1490E326n1m7m7n3n3l4jK4K3NmJ6N3Q0R7J20J52J70J63J54J63J82J82J62J37J21J02P7M0p
1486G252o7j28j65j80j87k01k10k07k05k05j98j76j57j49j42j22j03j10j35j47j30j06r4q7
1483C641p5o5n7m5k4j3k4m0m1k8j9k7l7m0l6l3k6j2mj6m4o6o9n2k7pMPKmnKJ0Qnk2k4nK6M6
$$ y = [28035, 27316, 26625, 25979, 25377, 24801, 24252, 23743, 23276, 22839, 22431, 22061, 21727, 21410, 21102, 20815, 20565, 20350, 20165, 20007, 19869, 19730, 19570, 19384, 19183, 18973, 18759, 18547, 18339, 18131, 17915, 17690, 17463, 17245, 17046, 16882, 16771, 16717, 16703, 16701, 16698, 16695, 16694, 16676, 16610, 16468, 16247, 15958, 15614, 15220, 14782, 14322, 13875, 13466, 13091, 12733, 12386, 12074, 11816, 11609, 11436, 11292, 11190, 11123, 11069, 11025, 11021, 11090, 11228, 11409, 11617, 11862, 12151, 12470, 12795, 13105, 13383, 13614, 13786, 13889, 13905, 13821, 13641, 13380, 13052, 12655, 12200, 11711, 11222, 10758, 10330, 9936, 9571, 9228, 8915, 8648, 8429, 8238, 8053, 7875, 7720, 7589, 7468, 7342, 7207, 7066, 6927, 6796, 6677, 6557, 6423, 6284, 6163, 6072, 5989, 5894, 5794, 5709, 5643, 5578, 5508, 5450, 5417, 5399, 5371, 5326, 5275, 5228, 5181, 5128, 5075, 5041, 5040, 5064, 5087, 5092, 5088, 5104, 5157, 5237, 5334, 5454, 5606, 5776, 5939, 6093, 6256, 6438, 6620, 6782, 6919, 7040, 7142, 7219, 7259, 7252, 7185, 7057, 6892, 6712, 6525, 6324, 6114, 5907, 5702, 5497, 5299, 5123, 4966, 4817, 4675, 4553, 4450, 4340, 4205, 4058, 3928, 3822, 3728, 3641, 3566, 3501, 3444, 3399, 3375, 3362, 3338, 3298, 3257, 3229, 3210, 3183, 3146, 3106, 3070, 3037, 3011, 2999, 2995, 2979, 2935, 2869, 2800, 2748, 2721, 2714, 2718, 2725, 2727, 2723, 2718, 2720, 2730, 2738, 2733, 2711, 2687, 2682, 2708, 2754]
1478B754M2K5J3J2J4NlJJ7K6J4j2k8k7k2k4l1k6kJ8J8NNK7N2P0Q9J14J25J09Q8R9J44J88K20
1474D119K60L29M13N03O01P12Q16Q89R34R56R33Q44P13N74M31K46jk80n26o94p63p39o50n42
1471A0078m49l59k57j45m5K4O9Q8Q2N1kp0j46k25l04l76m36m70m74m58m41m25l99l53l02k63
1468C993k35k10j79j48j22j08j05j06j03q8o6n0m5m4m8n5n8n0l1j8k0k8k9k6l0l9l9l0j9j4
1464A850j0j0j0q%J6K7K8K6J8RPK4M9O1M7K6K0L3M7N3N6N6M9K9Oj4k7l5m4n1n6n0l5j8jJ4
1460B182K7L5M1M8M8L3J3PK5M5N3N0M5L2Oj6k4l2n3p1n0mK5J3j3k3j6%K6N8P5O9O4Q6J25J49
1455C078J51J44J38J29J20J16J08P6K0k5l9l3l3n2q3j09j19j22j24j29j34j30j20j09j05j07
1452B507j00p6m4k2k3l6l6k8j7j0QL0L9L0J7Pj1l3m0k2nj5l3l3j9j1oNJ4kl1l8k0%KOJ6J9
$$ y = [2754, 2796, 2821, 2834, 2846, 2860, 2865, 2862, 2863, 2880, 2906, 2920, 2908, 2880, 2853, 2831, 2807, 2776, 2750, 2748, 2766, 2784, 2789, 2794, 2821, 2873, 2943, 3032, 3146, 3271, 3380, 3468, 3567, 3711, 3899, 4119, 4379, 4708, 5121, 5624, 6225, 6937, 7753, 8642, 9576, 10532, 11465, 12309, 13022, 13596, 14027, 14273, 14272, 13992, 13466, 12772, 12009, 11270, 10620, 10078, 9629, 9270, 9013, 8868, 8823, 8847, 8916, 9004, 9086, 9137, 9135, 9065, 8919, 8694, 8390, 8014, 7578, 7108, 6634, 6176, 5735, 5310, 4911, 4558, 4256, 3993, 3758, 3548, 3369, 3221, 3099, 2991, 2886, 2780, 2677, 2589, 2523, 2473, 2428, 2384, 2336, 2281, 2223, 2173, 2142, 2124, 2104, 2076, 2047, 2021, 1991, 1952, 1913, 1883, 1864, 1850, 1840, 1830, 1820, 1812, 1812, 1828, 1855, 1883, 1909, 1927, 1936, 1943, 1967, 2016, 2077, 2124, 2150, 2170, 2203, 2250, 2303, 2359, 2415, 2464, 2493, 2499, 2485, 2458, 2423, 2379, 2328, 2272, 2222, 2187, 2169, 2168, 2182, 2209, 2244, 2285, 2333, 2381, 2414, 2427, 2434, 2459, 2504, 2557, 2607, 2652, 2684, 2690, 2674, 2650, 2618, 2565, 2494, 2444, 2440, 2465, 2478, 2465, 2442, 2426, 2426, 2452, 2510, 2585, 2654, 2718, 2804, 2929, 3078, 3229, 3373, 3511, 3640, 3760, 3876, 3984, 4060, 4080, 4055, 4016, 3983, 3950, 3898, 3815, 3706, 3587, 3465, 3341, 3212, 3078, 2948, 2828, 2719, 2614, 2507, 2407, 2331, 2287, 2265, 2242, 2206, 2170, 2142, 2125, 2115, 2123, 2153, 2192, 2222, 2239, 2246, 2235, 2202, 2162, 2140, 2135, 2120, 2087, 2054, 2035, 2024, 2018, 2023, 2037, 2035, 2004, 1966, 1946, 1946, 1948, 1954, 1970, 1989]
1447A989J2QK0L3L5L9N1N0K6KJJ3Rj3l5m5m8m7l4j9qnkpk0l2k8k1k9m7n3m0j3K2O1Q4Q2O4
1443B055O5Q0R0R3J08J44J77J89J98K27K71L10L38L66L98M31M60M76M63M15L48K81K12J23
1440H318J1j08k21l23m07m63m89m90m69m29l80l47l34l24k96k53k03j64j39j26j19j01p3m9
1437B022m2n1n6n6n8o4o5n4m0k9k2j9j5j1kNlk3l6k8oMqk1k3k3l4m7m2j4QOj4k7k5j3%PJ1
1432A092J1J2J6J9J5QL%oj0mJ0K2K2J4LnlNJ0LnKK3L6K6N%J7L8M5M1L3K2Nj2k1k5l0l4l6l6
1427A331l9l5j6QJ5jk4k8j5KJ0Onk1l6l7k3qlj5k8l0j9qnrj1j0j4j9j3QK7K6Oj0pOQmj4rK
1422I39Lj1k7k8j8nLJmlJ3L6M3L0J3QPql0l8k4qpj3j4j2j6j8j1mnj0r%MJnnkLJ1J2lk1k6r
1416G33J0J5RK%klj1k5l5k2RL1K7J2J1K5L6K9Qj3l0l3k1mOOLNQMloKJ1Pj0k4j4J1K0J0kOK2
$$ y = [1989, 2001, 2009, 2029, 2062, 2097, 2136, 2187, 2237, 2263, 2265, 2266, 2279, 2288, 2275, 2240, 2195, 2147, 2100, 2066, 2047, 2039, 2034, 2032, 2025, 2005, 1973, 1945, 1924, 1895, 1848, 1795, 1755, 1742, 1764, 1825, 1909, 1991, 2055, 2120, 2200, 2290, 2383, 2491, 2635, 2812, 3001, 3199, 3426, 3697, 4007, 4345, 4711, 5109, 5540, 6000, 6476, 6939, 7354, 7702, 7983, 8195, 8318, 8329, 8221, 8000, 7677, 7270, 6807, 6318, 5828, 5359, 4930, 4550, 4203, 3869, 3545, 3249, 2996, 2793, 2629, 2490, 2364, 2245, 2144, 2071, 2022, 1980, 1929, 1873, 1817, 1759, 1695, 1630, 1576, 1536, 1507, 1485, 1466, 1451, 1440, 1438, 1443, 1440, 1417, 1381, 1353, 1347, 1351, 1343, 1322, 1299, 1276, 1242, 1195, 1153, 1139, 1147, 1153, 1139, 1112, 1087, 1074, 1074, 1081, 1092, 1103, 1115, 1131, 1150, 1165, 1173, 1176, 1176, 1170, 1160, 1156, 1166, 1188, 1210, 1224, 1227, 1222, 1219, 1224, 1234, 1237, 1232, 1234, 1257, 1293, 1319, 1324, 1324, 1341, 1379, 1424, 1465, 1498, 1520, 1525, 1513, 1492, 1467, 1437, 1403, 1367, 1331, 1292, 1257, 1241, 1249, 1264, 1263, 1239, 1211, 1196, 1198, 1208, 1214, 1209, 1188, 1152, 1115, 1092, 1084, 1081, 1066, 1038, 1008, 989, 981, 976, 967, 956, 946, 932, 913, 900, 908, 935, 961, 967, 957, 950, 956, 964, 960, 946, 937, 939, 942, 931, 904, 876, 858, 853, 856, 857, 853, 850, 863, 899, 942, 972, 985, 993, 1000, 992, 962, 924, 900, 892, 885, 872, 858, 846, 830, 812, 801, 797, 792, 782, 773, 773, 777, 778, 773, 768, 766, 769, 780, 792, 789, 768, 742, 733, 743, 758, 767, 769, 769, 767, 764, 753, 728, 693, 671, 680, 711, 738, 750, 761, 786, 822, 851, 859, 846, 816, 783, 762, 758, 764, 770, 773, 778, 786, 790, 787, 781, 783, 794, 801, 791, 767, 753, 764, 784, 794, 792, 798, 820]
1411H20L0K6K1J3lj3pMMmJ0L9N0K8jnJ2J9%k8l9k1RL4M2M3M3L6J5qj0RK7L2L4M4N1M3K4Kj5
1406A410k5j3J9M5M7L2J6Lj2j6KL2L7Rk7m8n1m6l0oJ1Pj2l2l7k7j0LJj2j7qJjj0j2mjj6m1
1401A161n4n0k8pPPjj7l1m0l5j9mOQPM%rk1l3l3k1qnj3j7pOJ6K1K3J3nk6l7l8l2j6RK8L4K6
1395G69J6Ppj4oJ0J8J7J6J7Nj5k1%K5L2J6MLMJqj7k7l5k9rJ5K6J6rl1l4k4j8j8j3LJ6J7Mm
1390G18mjOJ8K9L1K6K4K3J2pj9j2NJ8K2J4kk0l0l2l1k5j1OJ4PjjjorJJ5J6Lj3k9l8l2mK3K1
1385G24lj7%K2J9j1m0l9j2K1M5N7N5M2J8pj6j0%Jpj6k2k5j7%J4J4LJJ1J1pk7k6j0ORJpj4j4
1380G27j3mRK3L1K4J5J4K3K4Rrj2jNlj6k2k1j7rJJ1J2MpqJPqk8l2pK5M0L2K1J7J5Rjj2k2k1
1374H26kJ7J7NLK0L5K9Rl%NN%oj2j6pRJ5QkJRPqj6j3qj2j7j2kNNKKMJ0J2Kj6k3oJ7J6rl1k6
$$ y = [820, 850, 876, 897, 910, 907, 894, 887, 891, 895, 891, 901, 940, 990, 1018, 1017, 1012, 1024, 1043, 1043, 1015, 976, 955, 964, 998, 1040, 1083, 1126, 1162, 1177, 1169, 1159, 1168, 1195, 1227, 1261, 1305, 1356, 1399, 1423, 1425, 1410, 1385, 1372, 1391, 1436, 1483, 1515, 1531, 1534, 1522, 1506, 1508, 1540, 1577, 1586, 1559, 1511, 1460, 1414, 1384, 1378, 1389, 1396, 1384, 1352, 1315, 1288, 1278, 1281, 1282, 1270, 1253, 1245, 1246, 1245, 1235, 1223, 1219, 1218, 1202, 1161, 1107, 1057, 1029, 1022, 1029, 1036, 1035, 1018, 987, 947, 912, 893, 889, 895, 903, 910, 914, 914, 905, 884, 851, 818, 797, 789, 784, 771, 754, 747, 753, 769, 790, 813, 826, 821, 795, 758, 720, 688, 672, 681, 709, 743, 769, 785, 792, 785, 771, 765, 775, 793, 810, 826, 843, 848, 833, 812, 812, 837, 869, 885, 889, 892, 896, 897, 889, 872, 845, 810, 781, 772, 787, 813, 829, 820, 789, 755, 731, 713, 695, 682, 685, 701, 718, 722, 718, 714, 713, 719, 737, 766, 797, 823, 847, 870, 882, 875, 856, 844, 849, 867, 889, 903, 901, 881, 851, 819, 788, 763, 752, 758, 772, 779, 778, 777, 776, 770, 761, 762, 777, 793, 796, 783, 754, 716, 684, 680, 703, 724, 721, 704, 704, 726, 745, 734, 694, 655, 643, 664, 709, 766, 821, 863, 881, 874, 858, 848, 848, 849, 842, 826, 804, 779, 762, 762, 776, 790, 793, 794, 805, 816, 809, 782, 756, 746, 752, 761, 762, 755, 741, 727, 714, 710, 719, 742, 773, 797, 812, 826, 849, 873, 882, 873, 861, 860, 865, 862, 846, 824, 803, 786, 777, 778, 789, 801, 805, 798, 790, 791, 798, 790, 762, 730, 723, 748, 788, 820, 841, 858, 873, 882, 881, 869, 847, 826, 824, 841, 858, 863, 866, 886, 921, 950, 959, 956, 956, 961, 966, 966, 960, 948, 932, 925, 934, 949, 957, 955, 956, 965, 972, 964, 948, 935, 927, 915, 898, 886, 884, 889, 894, 896, 898, 902, 912, 924, 926, 910, 887, 881, 898, 914, 905, 874, 848]
1368H48pRJ9L1L2J6pj6j5j4j1lMnk1j9RL4L6K3J3Pmj7j7jJ5J9J4J1J2J3Qlj3j2lQJ1J7K9L9
1363A089L8J8mj7j5qKPO%j0pNJ0lk1j7J0K5J2pKK4K8Oj2j5rmPK4K1kj9oJ8K3J1LLJjOK1K9
1358A272K2J4Lj6l7l3jL8N4L8J1pnOR%pKJ6Rj6k7pL2N8N8L7J3Jj%nrlJ3K1J9J8K8L7L5K7J8
1353A735J2J5K4L6L1J4MJ7L5L8K9K1J5OjKJ0QmqJJ2J3J2K1L7M7N0M7M6M0K9K5K5L1L4M5O3
1348B617P8O8M1K0K8M5M8L2K4L5N0N2M4M9P2R9J13J08R3Q7J00J17J19J07R6J02J13J13J11
1344D781J19J34J41J33J29J30J33J33J47J75K02K03J89J79J88K12K46K86L29L64L90M16M47
1342I806M76N06N54O32P29Q34R51J096J274J481J731K047K445K928L480M065M612N054N369
1339E0070N567N643N600N490N381N236M944M504M139M112M458N018N633O210O615O704O523
$$ y = [848, 841, 850, 869, 900, 932, 948, 941, 925, 910, 896, 885, 882, 886, 881, 860, 841, 850, 884, 920, 943, 956, 963, 959, 942, 925, 924, 939, 958, 972, 983, 995, 1008, 1016, 1013, 1000, 988, 985, 993, 1004, 1021, 1050, 1089, 1127, 1145, 1141, 1124, 1109, 1101, 1103, 1110, 1116, 1116, 1106, 1099, 1104, 1114, 1111, 1090, 1073, 1083, 1108, 1120, 1113, 1115, 1139, 1167, 1173, 1161, 1146, 1137, 1133, 1140, 1164, 1185, 1183, 1164, 1158, 1176, 1199, 1210, 1213, 1216, 1217, 1216, 1222, 1243, 1272, 1294, 1308, 1311, 1295, 1258, 1225, 1224, 1262, 1316, 1354, 1365, 1358, 1353, 1359, 1368, 1368, 1361, 1363, 1379, 1388, 1372, 1345, 1338, 1370, 1428, 1486, 1523, 1536, 1537, 1536, 1536, 1531, 1522, 1519, 1532, 1553, 1572, 1590, 1618, 1655, 1690, 1717, 1735, 1747, 1762, 1786, 1822, 1853, 1867, 1871, 1888, 1923, 1961, 1990, 2011, 2026, 2032, 2031, 2033, 2043, 2051, 2047, 2039, 2040, 2052, 2065, 2077, 2098, 2135, 2182, 2232, 2279, 2325, 2365, 2394, 2419, 2444, 2475, 2509, 2554, 2617, 2695, 2763, 2804, 2824, 2852, 2897, 2945, 2977, 3001, 3036, 3086, 3138, 3182, 3231, 3303, 3402, 3515, 3623, 3716, 3803, 3903, 4020, 4139, 4246, 4342, 4444, 4557, 4670, 4781, 4900, 5034, 5175, 5308, 5437, 5567, 5700, 5833, 5980, 6155, 6357, 6560, 6749, 6928, 7116, 7328, 7574, 7860, 8189, 8553, 8943, 9359, 9806, 10282, 10788, 11342, 11974, 12703, 13537, 14488, 15584, 16858, 18339, 20070, 22117, 24562, 27490, 30970, 35035, 39647, 44701, 50070, 55637, 61280, 66880, 72370, 77751, 82987, 87931, 92435, 96574, 100686, 105144, 110162, 115795, 122005, 128620, 135324, 141847]
1337A41847O286O043N538M570L409K617K508K965L740M648N434N738N439M815M130L175J505
1335B14407q92l382n221o091o057n332m233l243k731k644k659k687l037l982n334o581p319
1333A42982p446p037o246n351m667m320m167m048m016m252m790n454o009o312o309n999n482
1331E1077m934m478m099l713l284k848k443k089j799j569j375j191j030r11q24p48o84o43
1329A2415o06n46m73m28m14m02l75l57l53l42l08k72k54k42k13j77j59j61j70j73j76j71j57
1326E486j45j42j37j20j02j04j20j30j22j11j08j11j14j07r0o3m4m4n4n4m6m2n3o2n7m2l0
1323C132k3k4l3m3m3k6j7l5o5q0o8n2n5p0p1n5l5k5j7oPLj3k7k9k7l6m8m2j5Lj0m7o5m3nJ2
1318A907Lqj5k7m7n0k5NPj7l8m3m2l7j8J1K5J3j1k2j5pmjjnmMJ3Oj3k6k7k0j2kLrk8l1j6j
$$ y = [141847, 148133, 154176, 159714, 164284, 167693, 170310, 172818, 175783, 179523, 184171, 189605, 195343, 200782, 205597, 209727, 212902, 214407, 213515, 210133, 204912, 198821, 192764, 187432, 183199, 179956, 177225, 174581, 171922, 169235, 166198, 162216, 156882, 150301, 142982, 135536, 128499, 122253, 116902, 112235, 107915, 103748, 99700, 95684, 91432, 86642, 81188, 75179, 68867, 62558, 56559, 51077, 46143, 41665, 37566, 33853, 30569, 27721, 25278, 23189, 21390, 19821, 18446, 17255, 16225, 15314, 14490, 13742, 13058, 12415, 11809, 11263, 10790, 10362, 9948, 9546, 9171, 8814, 8461, 8119, 7811, 7539, 7285, 7043, 6830, 6653, 6494, 6333, 6163, 5990, 5814, 5643, 5486, 5341, 5199, 5062, 4942, 4840, 4736, 4616, 4486, 4364, 4253, 4145, 4034, 3920, 3813, 3723, 3660, 3616, 3572, 3518, 3464, 3418, 3376, 3323, 3261, 3204, 3162, 3132, 3109, 3085, 3052, 3009, 2966, 2940, 2923, 2888, 2823, 2743, 2675, 2623, 2568, 2498, 2427, 2372, 2337, 2312, 2295, 2289, 2296, 2299, 2286, 2259, 2230, 2203, 2167, 2119, 2077, 2062, 2065, 2055, 2008, 1943, 1900, 1895, 1907, 1910, 1902, 1887, 1860, 1813, 1763, 1738, 1743, 1750, 1733, 1695, 1652, 1610, 1573, 1555, 1566, 1591, 1604, 1593, 1571, 1556, 1549, 1545, 1544, 1543, 1538, 1534, 1538, 1551, 1557, 1544, 1518, 1491, 1471, 1459, 1457, 1460, 1451, 1423, 1392, 1376, 1375]
1313A375mj0kJ3J7Oj3k7l1k5j2oj6l3l9k2LK0K2J2kj6k8l3l0j5J1L4L9K3nl2m1l7k6j9j7j0
1308A024QK7L2J9jj3j7j3nMQMqj4pJ0K2K1Pqj8k7l7l8j6J9L9K7ol4l8k7k2k2j9mJ8L5M2M1
1303A013K7Kk2l3l3l6l7k1RL1K9QmKJ7K5J6rl4l8j9MJ0jrrnKJ5K8K4Nj5k4k1qRK5K1Kj6k2
1298I08k7l4l3j5PJ0lj6j5%J4J7Kk0l4l1k2j3%J6K5J1j4k2j1%lj0pNJ7K2J8Lj8l2l0k0nOJ5
1293F61J2mk2l0k0oMPQJ1J5J3Lpj1p%J0K2K9J7pj9nJ7K5J6J1K0K8J6rk8k5j0lj0j8oJ6K9J8
1288G61mj2nKNRJ6J3pk5k1oJlnOJ5J6Mj1k8m2m4l1j0QJ6J4Jj3j6mRJ0KjLKmkRK1K7K7K5K3
1283G51K1K0J9Qj3k9k9j6%J6K5K3J0mj2j5k2k4j6qoj3j8j4oMQkj9k0JK2K0mj8k0k0k3j2J3
1278E78K5J6KLJ1Qnj6k2k9k3mJ3Nj5j8%J7J6RNPRK2L9M3K4mk0j3MK2L5L4K1MmkNQ%k0l6l7
$$ y = [1375, 1371, 1361, 1359, 1372, 1389, 1395, 1382, 1355, 1324, 1299, 1287, 1281, 1265, 1232, 1193, 1171, 1174, 1194, 1216, 1228, 1226, 1210, 1182, 1149, 1119, 1104, 1115, 1149, 1188, 1211, 1206, 1174, 1133, 1096, 1070, 1051, 1034, 1024, 1032, 1059, 1091, 1110, 1109, 1096, 1079, 1066, 1061, 1065, 1073, 1077, 1069, 1055, 1048, 1058, 1080, 1101, 1108, 1100, 1082, 1055, 1018, 980, 964, 983, 1022, 1049, 1043, 1009, 971, 944, 922, 900, 881, 877, 895, 930, 972, 1013, 1040, 1042, 1020, 987, 954, 918, 881, 860, 869, 900, 929, 937, 933, 935, 952, 977, 993, 984, 950, 912, 893, 897, 907, 906, 897, 888, 883, 885, 900, 928, 952, 957, 942, 918, 897, 889, 898, 923, 944, 946, 930, 908, 881, 847, 814, 799, 806, 816, 813, 797, 782, 782, 796, 813, 815, 795, 761, 730, 708, 695, 695, 711, 736, 747, 733, 711, 700, 700, 697, 687, 680, 685, 702, 724, 742, 745, 727, 695, 665, 645, 640, 646, 661, 673, 669, 647, 617, 597, 591, 595, 602, 610, 621, 636, 649, 652, 645, 634, 627, 627, 637, 659, 688, 705, 698, 679, 674, 691, 716, 732, 743, 763, 791, 807, 798, 770, 745, 735, 732, 722, 704, 698, 714, 743, 761, 757, 745, 740, 742, 747, 756, 772, 785, 778, 753, 732, 726, 727, 724, 719, 725, 740, 756, 760, 749, 721, 679, 635, 604, 594, 602, 618, 632, 633, 620, 604, 600, 609, 619, 621, 620, 623, 625, 621, 619, 628, 649, 676, 703, 728, 751, 772, 792, 811, 819, 806, 777, 748, 732, 732, 748, 773, 796, 806, 802, 790, 775, 753, 729, 713, 705, 699, 686, 668, 654, 648, 652, 660, 658, 639, 619, 620, 642, 662, 658, 640, 620, 600, 577, 565, 578, 603, 619, 621, 624, 635, 643, 638, 622, 600, 571, 548, 544, 557, 562, 547, 529, 529, 546, 562, 571, 576, 583, 592, 614, 653, 696, 720, 716, 696, 683, 687, 709, 744, 778, 799, 803, 799, 797, 802, 810, 810, 790, 754, 717]
1272G17k7k5l0k9j1J1J9J2PJ2K4K7J5j2l8m2k3KJ8K7L2L0J9QOKmlJ3K5J7lnJ7L9M2L0J7Pl
1267I40nJJ7L5N0N3M6L6L8M3M1K8J4QOJ3L0M5L9J2j2j4omnmlj3k7l6m3n0m3k1%%j5j7pnj8
1262A147k8k4j0KQMrk5l0k6k1j9j2OJ6J2lj6l1m3m6m5n4p0o2k4J2J4%PL6M3J8rj5noj2j8k1
1257F41k0mK8M9L3nk7j9%M%mkjKPQoj9j8%J7J8Oj0j6mJ7K2Kk6l4j3J1J8J4J1Rok6k8%L0L3
1252F92Nk0k0plroJ5M2N1L4Kk4l3k8j4JJ7K8K4Oj3j5JJ6J7J0jj5l1l7k5JK0K2J5Oqk6l2k1
1247F37kONPJ2Roj9j8j0j3k3k4rOQNM%pj3j0k%llNJ4K0J7J2J4K5L6L1Pj6j2J1K0Lj8k6k0j7
1242F43j7j0LOJjlj1k4k3kJ9K1J0PJ4J8Roj3j2j2j1mRJ4Oqj6j3kLPJ1J8K2J9J2N%mj1j5j3
1236F46lRJ4J0MLLlj8k8k5j5qoroMJ3J2ql3m1k7kK0M0N9O6M4Pj3qJkj8k4j4KJ3J4J1Lmj1j3
$$ y = [717, 690, 665, 635, 606, 595, 606, 625, 637, 644, 656, 680, 707, 722, 710, 672, 630, 607, 609, 627, 654, 686, 716, 735, 743, 749, 751, 747, 744, 757, 782, 799, 796, 791, 808, 847, 889, 919, 936, 943, 940, 935, 936, 953, 988, 1038, 1091, 1137, 1173, 1211, 1254, 1295, 1323, 1337, 1345, 1351, 1364, 1394, 1439, 1478, 1490, 1478, 1464, 1458, 1454, 1449, 1445, 1442, 1429, 1402, 1366, 1323, 1273, 1230, 1209, 1209, 1209, 1194, 1177, 1170, 1165, 1147, 1119, 1095, 1085, 1087, 1095, 1099, 1090, 1065, 1035, 1009, 988, 969, 957, 963, 979, 991, 988, 972, 941, 898, 852, 807, 753, 683, 621, 597, 609, 623, 623, 630, 666, 709, 727, 718, 703, 698, 692, 680, 662, 641, 621, 617, 645, 694, 727, 722, 695, 676, 676, 680, 680, 676, 674, 673, 675, 682, 690, 684, 665, 647, 647, 664, 682, 688, 678, 662, 658, 675, 697, 699, 673, 639, 626, 637, 655, 669, 680, 689, 683, 657, 629, 629, 659, 692, 697, 677, 657, 650, 647, 638, 632, 647, 689, 740, 774, 776, 752, 719, 691, 677, 678, 695, 723, 747, 753, 740, 725, 726, 742, 759, 769, 768, 753, 722, 685, 660, 661, 681, 703, 718, 724, 716, 690, 658, 637, 635, 641, 646, 653, 665, 674, 668, 649, 631, 621, 608, 585, 561, 552, 558, 566, 571, 575, 575, 568, 555, 545, 543, 543, 540, 537, 542, 556, 576, 593, 605, 619, 644, 680, 711, 718, 702, 690, 701, 721, 724, 706, 680, 660, 643, 626, 616, 619, 625, 626, 625, 622, 611, 587, 564, 562, 581, 602, 612, 619, 633, 651, 660, 654, 641, 629, 617, 606, 602, 611, 625, 631, 623, 607, 594, 592, 595, 602, 613, 631, 653, 672, 684, 689, 689, 685, 674, 659, 646, 643, 652, 666, 676, 680, 683, 686, 683, 665, 637, 612, 597, 589, 583, 574, 568, 572, 585, 597, 589, 556, 515, 488, 486, 506, 546, 605, 671, 715, 722, 709, 701, 702, 700, 682, 658, 644, 646, 659, 673, 684, 687, 683, 672, 659]
1231F59rLJ3J2kj3j1%jj9l8l9j5J4L0K7J7J0J2J5J6J0krkJ2J0j6m0l9k0j1j6j5OK6K4Oqj4
1226E83j8j9j2KNmj0nPJ7K4K7K6K3K3K6K0Lj3j5j1j6k7k4KL8N3M1J0j7k8l3m2m8l8qK2L4K7
1221F25J4MkJNMrk0j5KJ4Prj8j5rqj0nQJ8J5RJ3K6L4K4Nqj0okjnj6l1l9l5k4rJ0J8J1%mJJ
1215E59rj3kJ6K6K8L1K9J3oj2%J3Oj3k2qJ8L1K2kk0k7k6k1j2kkrpJ3M0M4K3lj9k1j7pnj3k4
1210E90k4j0MMoj7k5k2KL8N5M1J0m%jj7l1k9j6pj1j5j4jK0M0M7L5J2j0k0j1RK5K1PlMJ5J7
1205G02Oj1k2k1qKlj3pJ5L0K5Onmj%%lj0j6j7j4j4j7j7j2oKJ2J9J8J3J2J5J4RRQMkLJ2J4N
1200G32JQJ2Kj0qJKoj0mjpj5j2NK1K2NrnQOj1j5NK1Qj9k7j3joj4qKKqj7k3k7k6j8pPK0L0K2
1194F15mk7k6qNL%jmj0j1KJ7K5K2J5J4J9J8Pj0k1j5lJqj8k1k1k4k5j7lML%PK5M1M7L8K6J6
$$ y = [659, 650, 653, 666, 678, 676, 663, 652, 652, 651, 632, 594, 555, 540, 554, 584, 611, 628, 638, 650, 665, 681, 691, 689, 680, 678, 690, 700, 684, 644, 605, 585, 574, 558, 543, 549, 575, 599, 605, 597, 583, 565, 546, 534, 536, 541, 537, 527, 522, 529, 546, 570, 597, 623, 646, 669, 695, 715, 718, 705, 690, 679, 663, 636, 612, 614, 652, 705, 746, 756, 739, 711, 678, 636, 588, 550, 542, 564, 598, 625, 639, 643, 641, 642, 647, 651, 642, 622, 607, 609, 623, 630, 621, 603, 588, 579, 571, 561, 556, 564, 582, 597, 606, 619, 645, 679, 703, 708, 700, 690, 684, 682, 681, 676, 660, 629, 590, 555, 531, 522, 532, 550, 561, 561, 557, 558, 559, 550, 537, 535, 551, 577, 605, 636, 665, 678, 672, 660, 660, 673, 679, 666, 644, 636, 654, 685, 707, 705, 685, 658, 632, 611, 599, 597, 595, 586, 579, 592, 632, 676, 699, 696, 677, 656, 639, 632, 627, 614, 590, 566, 556, 560, 564, 558, 541, 516, 494, 496, 534, 589, 630, 640, 636, 636, 635, 618, 587, 558, 542, 535, 524, 509, 495, 494, 514, 554, 601, 636, 648, 638, 618, 607, 616, 641, 662, 669, 666, 670, 685, 702, 708, 697, 675, 654, 646, 648, 645, 632, 625, 640, 670, 695, 701, 696, 692, 691, 691, 691, 688, 678, 662, 645, 631, 617, 600, 583, 571, 565, 567, 579, 598, 616, 629, 641, 656, 670, 679, 688, 696, 700, 698, 701, 713, 727, 732, 733, 741, 753, 755, 745, 737, 738, 740, 734, 724, 720, 719, 712, 697, 685, 690, 711, 733, 738, 729, 724, 732, 738, 727, 712, 717, 738, 746, 727, 700, 687, 686, 680, 666, 658, 660, 662, 654, 637, 614, 587, 561, 543, 536, 543, 563, 593, 615, 611, 584, 558, 550, 555, 558, 558, 557, 553, 543, 532, 534, 551, 576, 598, 613, 627, 646, 664, 671, 661, 640, 625, 622, 623, 615, 597, 576, 555, 531, 506, 489, 486, 490, 493, 493, 500, 525, 566, 613, 651, 677, 693]
1188F93QKjOJ2Kj7k5j1RJ7J4J2J5J3LnJJ3K1J8Jj7k4k1j3j2j5j2j0j5k7k9j2J0J4Nnoj0j6
1183E86j2J0L3L3Qj8k4j1RK7L5L2J7Lrk5l8l4j1J5J9Qlorj2pPJ1kj7j5lRJ5J6QknRK3J9Lq
1178F84plkQK8M1K9Jl0m7m8k8%J3Nj3j6jJ4K2K1J5Nnj0j4k1l2l5j9KJ9K5K9L1L3L1J9%k1k7
1173F96j6JP%qpoj4k5k7j7nMNNLkpj1rjJ4K8L6L5K7J0j2l3m4m2l7l4l1k0oJPJ6K9L3K9K2J6
1168F10Qnj2j2rolJKknnm%J4K7K8J5Kkjnj1rkPK2L0K1j0l7l3oK0K9L0K2Kk3k9j2J1K3K6K3
1162G30Qj5l0k4j2omKJ1RjkOJ2Q%j0j9k3j7rorj2qmjJ%lqoKNLmjQK0J9Qqj0LK1K4J1j1k3k3
1156F02j6oKPQJ2K3L8M4K7ol2l2j9j3k2k5j0Kkj2rQK0J4%mjNRPlj5k0j4lPJ6K2J8Lj0qJMm
1150F13j1pPK0K3J7Ojj1k4l5k5LL1M3L8K5Prj8j0OJ1mk6m0l9l2j9%K2L4L0J5PJ5L4M8M8L6
$$ y = [693, 701, 703, 702, 708, 720, 722, 705, 680, 669, 678, 695, 709, 721, 736, 749, 752, 747, 748, 761, 782, 800, 801, 784, 760, 739, 726, 714, 699, 687, 677, 662, 635, 606, 594, 604, 618, 623, 618, 612, 602, 586, 574, 584, 617, 650, 658, 640, 616, 605, 614, 641, 676, 708, 725, 728, 719, 694, 656, 622, 611, 626, 645, 653, 650, 644, 635, 623, 616, 623, 634, 632, 615, 600, 597, 606, 621, 637, 645, 643, 638, 647, 670, 689, 692, 684, 677, 674, 672, 680, 708, 749, 778, 779, 749, 702, 654, 626, 626, 639, 644, 631, 615, 614, 628, 650, 671, 686, 691, 686, 676, 662, 641, 609, 574, 555, 557, 576, 601, 630, 661, 694, 725, 744, 744, 723, 696, 680, 681, 688, 688, 680, 673, 667, 653, 628, 601, 584, 579, 583, 588, 593, 596, 594, 587, 576, 567, 566, 580, 608, 644, 679, 706, 716, 704, 671, 627, 585, 548, 514, 483, 463, 457, 458, 465, 481, 510, 543, 572, 594, 610, 618, 613, 601, 589, 580, 574, 571, 572, 574, 572, 567, 562, 558, 558, 572, 599, 627, 642, 644, 642, 641, 636, 625, 616, 614, 621, 643, 673, 694, 684, 647, 614, 608, 628, 657, 687, 709, 711, 688, 659, 647, 658, 681, 707, 730, 738, 723, 693, 669, 657, 651, 647, 649, 660, 669, 668, 666, 672, 684, 692, 692, 682, 663, 640, 623, 614, 608, 599, 587, 579, 575, 574, 575, 575, 572, 564, 558, 560, 565, 568, 564, 563, 571, 591, 610, 618, 610, 600, 603, 624, 648, 659, 648, 625, 602, 586, 580, 582, 589, 597, 609, 632, 670, 714, 741, 735, 703, 671, 652, 639, 617, 592, 582, 584, 582, 570, 561, 569, 589, 603, 603, 599, 598, 603, 612, 619, 616, 601, 581, 567, 564, 571, 587, 609, 627, 630, 620, 612, 613, 617, 613, 602, 595, 602, 622, 645, 662, 668, 667, 656, 632, 597, 572, 575, 606, 649, 687, 712, 719, 710, 692, 682, 688, 699, 695, 669, 629, 590, 558, 539, 539, 561, 595, 625, 640, 647, 662, 696, 744, 792, 828]
1146H28K0Jj3k1j8pJ0K7L3K5RNK2M3N1M1K6J0jnjOQPPRMj3l8o1o7n1k7j4k2l5l1rQRLmqj1
1140G55qPK1K4J3JkMJ6K5K2J0jn%OJ6L3N0N6N0M4M1L9L5L1K7K3K1J7J5J2J3K1K7K3%k2l0k6
1135A404k8l8m2l8l6m6n1l7j9j9l0k6lJ5Nk8n3n2k2K2N8N9L2mk8l6l5k2JJ7J6%j9l2l5k3J
1131H28J5J2LJ4L7M9M1K9K7L2L4K8J7%j7j6JJ5J0nqlrk9n0n2m4l8l4k8k0k2l1m1l5j9oJJN
1126F92PLjKMrl3m3k7JJ6J2MMJ1J6J7J2Mmj1j2j5j9j9oK3M9N1L1J0MNmk0k0lJ9K4J7Nj5l9
1121G43n0l9j5knj3j1jJ2K1K5K1J3%j0j3jK0L0K7K1K3K3J6RJ0J0%j0j0moj9k6k0j3j3j4j0
1116G19nlk%KJQK3L3K4Npqlpk2l6l2oK1K4Jk5l3l4l3k7j2LRPQJ5K8L9M0K1j0k8j9NJ4Lqrp
1110F77j1j8j2NJ6J2jrnNQPPJ1Qql1m5m0k1MK6L5L3K7K1J7J0Kl%PJ0Kj7l5l8k0k%j2j3NK6
$$ y = [828, 848, 849, 836, 815, 797, 790, 800, 827, 860, 885, 894, 899, 921, 964, 1015, 1056, 1082, 1092, 1091, 1086, 1085, 1091, 1099, 1106, 1113, 1122, 1126, 1113, 1075, 1014, 947, 896, 869, 855, 833, 798, 767, 758, 766, 775, 778, 774, 766, 755, 747, 754, 775, 799, 812, 813, 811, 815, 831, 856, 878, 888, 887, 882, 882, 888, 904, 937, 987, 1043, 1093, 1137, 1178, 1217, 1252, 1283, 1310, 1333, 1354, 1371, 1386, 1398, 1411, 1432, 1459, 1482, 1482, 1460, 1430, 1404, 1376, 1338, 1296, 1258, 1222, 1176, 1125, 1088, 1069, 1050, 1020, 994, 991, 1006, 1011, 983, 930, 878, 856, 878, 936, 995, 1027, 1023, 995, 959, 924, 902, 903, 920, 936, 936, 917, 885, 850, 827, 828, 843, 855, 858, 872, 909, 958, 999, 1028, 1055, 1087, 1121, 1149, 1166, 1166, 1149, 1133, 1134, 1149, 1159, 1154, 1146, 1143, 1134, 1105, 1055, 1003, 959, 921, 887, 859, 839, 817, 786, 745, 710, 691, 685, 686, 687, 692, 699, 702, 701, 703, 707, 698, 665, 622, 595, 596, 612, 624, 628, 632, 643, 659, 676, 688, 692, 688, 677, 665, 650, 631, 612, 606, 629, 678, 729, 760, 770, 774, 779, 775, 755, 735, 732, 751, 775, 792, 797, 782, 743, 693, 654, 639, 637, 632, 619, 608, 607, 619, 640, 665, 686, 699, 699, 689, 676, 675, 695, 725, 752, 773, 796, 819, 835, 844, 854, 864, 864, 854, 844, 840, 834, 815, 789, 769, 756, 743, 729, 719, 714, 711, 709, 709, 711, 712, 720, 743, 776, 800, 805, 798, 790, 787, 780, 758, 722, 690, 684, 705, 729, 730, 705, 672, 638, 605, 578, 566, 569, 578, 585, 593, 608, 636, 675, 715, 736, 726, 698, 679, 684, 698, 701, 693, 684, 677, 666, 648, 636, 641, 657, 669, 668, 659, 654, 659, 667, 674, 681, 692, 700, 692, 661, 616, 576, 555, 559, 585, 620, 653, 680, 701, 718, 728, 730, 727, 727, 734, 744, 746, 729, 694, 656, 636, 634, 634, 622, 609, 614, 640]
1105F40K5Kj8j9jJ6K0J1kj7k5k1j1%J%Kmk3m5m0oK5K4JmJ3L1K7Qkklj5k9k9j0J4K4J7J0PM
1100E96lrKJ6J6kj6j0NJ3RKQK1L1K4Mj3j6j5k4l7l0%K9L0RomLMpj9k1j1PK1K5K9L6L6K0nk1
1094G27k3k2k1j0J5L6L4J7Kqj3j6rKNoj7j3npj5j1NJ7Kk3l0j2J3K1K1K6L0J9pk1j5loj8k0
1089F41qPJ1Npj6k1j8j5j5qQK8L8L0J3mj8j8lJ0Lj5j7J2M3M8K9Mk0l9l8qK3K9J3PJ9K0ol4
1084G13l6k3j8k1j2NJ1KlOJ8K0J5J2QM%jkljLPJ0J2Prk2k2j1%OJ2J6Qj0j2PL1L3J5nj7j7p
1079G29QJ2lk1k1lJ3J2lj9k8k5j3jNJ2K7L7L2Rj3k1j8rJ0L2M2K9Lj7k7k9l0k7j8nNJ0J1PM
1074F98mrpjLJnmMJ0J1PJmm%OQPQOlj6k4k8k9k6j2J4L3L0J0j3k9l5l7l3k3nJ2J5NoJK0L3K5
1068F11NlNJ4J2kj0j1rj6k8k6pJ7K7J9Mrj0nQJ7J9J3ONJ1J5J4Mpj2mJ2K5K5J0j2k1pJ6K3J
$$ y = [640, 665, 667, 649, 630, 629, 645, 665, 676, 674, 657, 632, 611, 600, 600, 601, 601, 603, 599, 576, 531, 491, 485, 510, 534, 535, 531, 544, 575, 602, 610, 608, 606, 603, 588, 559, 530, 520, 534, 558, 575, 585, 592, 596, 593, 584, 586, 602, 618, 616, 600, 590, 595, 608, 617, 619, 627, 648, 679, 703, 707, 694, 678, 663, 639, 602, 572, 572, 601, 631, 640, 634, 630, 633, 637, 630, 611, 590, 579, 586, 607, 632, 661, 697, 733, 753, 748, 727, 704, 682, 661, 651, 666, 702, 736, 753, 755, 747, 734, 718, 709, 711, 716, 710, 693, 680, 675, 668, 653, 642, 647, 664, 666, 643, 613, 601, 614, 635, 656, 682, 712, 731, 724, 703, 688, 685, 679, 661, 641, 633, 640, 651, 656, 649, 633, 612, 594, 579, 564, 556, 564, 592, 630, 660, 673, 669, 651, 633, 630, 640, 643, 628, 611, 623, 666, 714, 743, 747, 727, 688, 650, 642, 665, 694, 707, 714, 733, 753, 747, 713, 677, 654, 636, 615, 603, 608, 619, 621, 618, 624, 642, 662, 677, 689, 697, 701, 701, 700, 698, 695, 694, 697, 704, 714, 726, 733, 724, 702, 680, 669, 669, 675, 687, 703, 711, 701, 689, 696, 727, 760, 775, 770, 753, 736, 729, 737, 749, 746, 725, 704, 701, 714, 726, 723, 704, 676, 651, 638, 637, 642, 654, 681, 718, 750, 759, 746, 725, 707, 698, 708, 740, 782, 811, 814, 797, 770, 741, 711, 684, 666, 661, 666, 676, 687, 694, 698, 694, 685, 678, 677, 680, 681, 676, 672, 676, 686, 697, 704, 705, 701, 697, 697, 703, 711, 718, 726, 732, 729, 713, 689, 661, 632, 606, 594, 608, 641, 671, 681, 668, 639, 604, 567, 534, 511, 506, 518, 533, 538, 532, 533, 553, 586, 611, 616, 613, 618, 632, 644, 642, 632, 621, 612, 596, 568, 542, 535, 552, 579, 598, 602, 593, 583, 578, 586, 603, 622, 635, 641, 646, 657, 672, 686, 690, 683, 671, 667, 679, 704, 729, 739, 727, 706, 699, 715, 738, 739]
1063G39k8l9l3k6k2pJ5K4J0j1j8j1nkMJ2J0nj8j9qOJ1lk3k7nJ9K1MkJ2K7K1Kj1nRJ8J8J2J0
1058F76J3J2jj8k1j1mkLJ3K4L0K9K1Oj1k0k0k2k4j8jJ0OLJ0K0J2nj6j4j2j1nNRJj0j8k3j7
1053E99JK3L3K3Jj8k2j1NRnj3mJ5K3K0K1L3L1Ml1m6l7k3j7j1KK2L3K6Oj6k3j4OJ9J6Mqj3j2
1048F51j0j3j0KK1K9J7JlLMjpmQJ9K6K6J9RKkjJKNPNjj1j2KK6M6M7L2J6J3J5J0PJ6L6M2K2
1042A112oj4JJ6J4KjLKlpj0j5k3k1j1pj1j3ojpj9k3k1j7j2m%%ljNJ1J8K2J9Nj2j5rorpQK8
1036I52L9M0K7J0%LJ4J8J8L0N4O6N3L3K9M2M7M0K6J6Lj6l6m3l2j6j3k9n6o9o4n0l9l2k6k2
1032A017k9m3n2m6k2JPrk7k5lK1K6K2J7Rqk2k4j9j4qMJ1Pm%J6K6J7M%LNMK%JJ2K9M3M3L3J8
1027A043%j9k0mJ8K2Nj8l5m1l7l2k8k4j3KJ0P%kknkJ4L4L7J7pj8j9k8l8m0k6pOPLlrj4j5r
$$ y = [739, 711, 672, 639, 613, 591, 584, 599, 623, 633, 622, 604, 593, 588, 586, 590, 602, 612, 607, 589, 570, 562, 568, 579, 576, 553, 526, 521, 540, 561, 565, 563, 575, 602, 623, 625, 614, 609, 618, 636, 654, 666, 676, 689, 701, 700, 682, 661, 650, 646, 644, 647, 660, 684, 714, 743, 764, 770, 759, 739, 719, 697, 673, 655, 654, 664, 670, 673, 683, 703, 715, 710, 694, 680, 668, 657, 652, 657, 666, 667, 657, 639, 616, 599, 600, 623, 656, 679, 680, 662, 640, 629, 634, 643, 638, 625, 621, 636, 659, 679, 700, 733, 764, 768, 737, 691, 654, 631, 614, 603, 605, 627, 660, 686, 692, 676, 653, 639, 645, 664, 680, 684, 676, 663, 651, 641, 628, 618, 620, 641, 670, 687, 688, 685, 688, 692, 691, 684, 680, 688, 707, 733, 759, 778, 787, 789, 787, 786, 787, 789, 794, 801, 806, 805, 794, 782, 784, 810, 856, 903, 935, 951, 964, 979, 989, 996, 1012, 1048, 1090, 1112, 1106, 1092, 1093, 1109, 1123, 1125, 1124, 1127, 1129, 1126, 1119, 1109, 1094, 1071, 1050, 1039, 1032, 1021, 1008, 1002, 1001, 994, 975, 952, 931, 914, 902, 898, 898, 898, 895, 894, 899, 910, 928, 950, 969, 974, 962, 947, 938, 932, 923, 916, 924, 952, 991, 1031, 1058, 1068, 1068, 1071, 1085, 1103, 1121, 1151, 1205, 1271, 1324, 1357, 1386, 1428, 1475, 1515, 1541, 1557, 1560, 1544, 1508, 1465, 1433, 1417, 1404, 1375, 1319, 1250, 1186, 1136, 1097, 1065, 1039, 1017, 988, 945, 893, 847, 825, 826, 833, 824, 797, 772, 769, 790, 816, 838, 855, 864, 856, 834, 810, 791, 777, 769, 773, 784, 791, 787, 787, 803, 829, 846, 850, 850, 853, 858, 862, 864, 864, 865, 877, 906, 949, 992, 1025, 1043, 1043, 1024, 1004, 1000, 1018, 1040, 1045, 1027, 992, 951, 914, 882, 854, 830, 817, 819, 829, 836, 836, 834, 832, 827, 825, 839, 873, 910, 927, 920, 902, 883, 855, 817, 777, 751, 744, 750, 757, 760, 757, 748, 734, 719, 710]
1021G10jLPJ0J2Jj6k4j5kkn%J2J0j0k6k5j4lJNJ4K3K3J5Jrj3rLJ8L2L2K5J6J5J4Mj8m0n1m9
1016F74l4j6kNRJ6K0J5PknlRK4K5Nk3l0k2j5j8j1PJ8Nk1l2k1kJ4K3K4J2jlJMjrk0l2l8k1J2
1011E47L7L9K2LmKJ5K1J0j2k9k4JL1M3K3j4m5m9l3j8j7k1k3j5LK5L9L4J4MJ3K8K9K0Onj8k5
1006F57j8LK3K3Nj7k6j5JJ1Nrk1k4j5nJJRK2K6Ok5l8k3jOKKJ3K2K3K1J5jj7k2j1OJ3J2PMM
1001F55MNPRJ7K5J7rk6j5J5L1J4j5k7j5%L%kKMLjoj3j7j5lPOj1k8l0oK6M6L6J5LORLnjRNj2
995G25k7k5j6j5j3lOmk9l8j6J7L4K9J5%j3j4%J6J4kj1qpj2j1OJ9J9J1J2J7J5RPLj3k8k2LJ9
990F69J5Ljpj9l1l2k5j7mJ6K8K1Kj1mRJ7J3Kj1k2j9rNJ0Mk%J4L1M2M1K9Rj1j7rmj4l4m1k5
984F11%K1L2L7L2J7NKkk0l7m0k3%J5K3K0J1KLNkrq%jj5k3j6j0j3j7pJ0K2K2K0K1K7L0K2Ql
$$ y = [710, 709, 712, 719, 729, 741, 742, 726, 702, 687, 685, 683, 678, 678, 690, 700, 690, 664, 639, 625, 622, 623, 628, 642, 665, 688, 703, 704, 695, 682, 673, 676, 694, 726, 758, 783, 799, 814, 828, 832, 814, 774, 723, 674, 640, 624, 622, 627, 636, 652, 672, 687, 694, 692, 687, 684, 693, 717, 742, 747, 724, 694, 672, 657, 639, 628, 635, 653, 658, 637, 605, 584, 582, 596, 619, 643, 655, 654, 651, 652, 656, 655, 646, 626, 594, 556, 535, 547, 584, 623, 645, 648, 644, 646, 661, 682, 692, 680, 651, 627, 628, 659, 702, 725, 711, 666, 617, 584, 566, 549, 528, 505, 490, 493, 518, 557, 591, 605, 609, 622, 650, 679, 699, 705, 700, 682, 657, 639, 642, 665, 688, 693, 676, 650, 635, 636, 647, 652, 643, 622, 598, 583, 578, 579, 580, 589, 611, 637, 643, 618, 580, 557, 556, 562, 564, 566, 579, 601, 624, 645, 660, 659, 642, 620, 609, 615, 628, 640, 647, 651, 655, 659, 664, 671, 680, 697, 722, 739, 730, 704, 689, 704, 735, 749, 734, 707, 692, 692, 695, 695, 693, 695, 699, 702, 701, 695, 682, 665, 650, 647, 654, 660, 649, 621, 591, 585, 611, 657, 693, 708, 711, 717, 726, 729, 724, 723, 732, 737, 725, 698, 673, 657, 642, 629, 626, 632, 628, 599, 561, 545, 562, 596, 625, 640, 640, 627, 613, 613, 629, 643, 641, 630, 622, 615, 603, 592, 598, 617, 636, 647, 659, 676, 691, 700, 707, 710, 697, 669, 647, 650, 669, 684, 687, 686, 679, 660, 629, 597, 572, 555, 551, 567, 595, 616, 618, 607, 603, 612, 629, 642, 644, 633, 611, 592, 583, 588, 598, 602, 600, 600, 614, 645, 687, 728, 757, 766, 755, 738, 729, 725, 711, 677, 636, 611, 611, 632, 664, 701, 733, 750, 755, 757, 755, 735, 698, 658, 635, 635, 650, 673, 693, 704, 706, 709, 714, 712, 703, 695, 695, 694, 679, 656, 640, 630, 617, 600, 593, 603, 625, 647, 667, 688, 715, 745, 767, 775, 772]
979G72JJ0jk8m8l8j1J0K1L4M0K9J0NJ9K9J8lj8k2k4j8mLpk3j9KJ7J5ONPJ0J4J8J3ql1l6k8
974G41k0j9j5qnj3k8m0m5l7j1J7L1K5J9K6L1J7oj3NK7L0J6mk1k6k2rmrj1RM3O4N6K3rk6k7
969G52k1k0k3j9pPNrj5lJ6K3Qj1j4MK7L6K6R%LNmj7k4k0j2j3k4l5l2j4PK0K6L0K5Oj9k8k0
964F31jJ6L1L9L4J5jlok2l9l2qJ0J1J4K9M1K5rk9k0NK0K2J5J0Okj5k5k6j6mKlj7l2l6k8j7
959E85k0k9k5KL4M2K4%qKK0L7L9K8J3QJ7K9L8M8N5N3M1K8J7QJjkj2l2m6m4l5l0k3pJ3J8Nn
954H86pj3l4n2m7k0lj0k1j8nlj4j8qPQKnj2j9j9j0lj3k5j2K0M3L9K9K9L1J3j7l1j8lnj2rR
949F30K6K7J4pj7j2lJKQJ4J1jj0j1j4j6j4pllOJ9K4J2LJ0J3mk9l2oJ9K0LmOK3K9J5pk1j7k
943F95J6L1L2K0mj9k1j1lKQRpk9l7j8J0K3J6LLJ9M0M7L4Pj3k5l3m1m3k8mJ4J6OjKJ0J2Q%m
$$ y = [772, 773, 783, 782, 754, 706, 668, 657, 667, 688, 722, 762, 791, 801, 806, 825, 854, 872, 869, 851, 829, 805, 787, 783, 786, 779, 756, 737, 739, 756, 771, 777, 782, 789, 799, 813, 831, 844, 836, 805, 769, 741, 721, 702, 687, 679, 674, 661, 633, 593, 548, 511, 500, 517, 548, 573, 592, 618, 649, 666, 660, 647, 652, 679, 709, 725, 721, 700, 674, 652, 643, 639, 630, 619, 628, 671, 735, 791, 814, 805, 779, 752, 731, 711, 688, 669, 662, 669, 674, 665, 650, 647, 663, 686, 694, 683, 669, 673, 700, 736, 762, 771, 771, 774, 779, 775, 758, 734, 714, 702, 689, 665, 630, 598, 584, 591, 611, 637, 667, 692, 698, 679, 651, 631, 630, 646, 677, 716, 750, 765, 764, 761, 755, 733, 694, 662, 654, 664, 675, 689, 718, 759, 784, 775, 746, 726, 731, 751, 773, 788, 798, 804, 802, 787, 762, 736, 720, 716, 718, 715, 698, 666, 630, 602, 585, 565, 536, 511, 513, 547, 589, 613, 613, 605, 607, 627, 664, 703, 731, 744, 752, 769, 798, 836, 884, 939, 992, 1033, 1061, 1078, 1086, 1087, 1086, 1084, 1072, 1040, 994, 950, 915, 885, 862, 855, 868, 886, 891, 886, 879, 866, 832, 780, 733, 713, 710, 700, 679, 661, 656, 653, 639, 621, 613, 620, 628, 630, 625, 613, 594, 575, 565, 562, 549, 524, 512, 532, 575, 614, 643, 672, 703, 716, 699, 668, 650, 647, 642, 630, 621, 630, 656, 683, 697, 690, 673, 661, 658, 659, 661, 669, 683, 694, 693, 683, 672, 658, 642, 628, 621, 618, 615, 621, 640, 664, 676, 679, 689, 702, 698, 669, 637, 631, 650, 670, 673, 669, 675, 698, 727, 742, 735, 714, 697, 695, 711, 742, 774, 794, 790, 771, 750, 739, 736, 738, 746, 755, 748, 719, 682, 664, 674, 697, 713, 716, 719, 738, 778, 825, 859, 866, 853, 828, 795, 754, 711, 683, 679, 693, 709, 715, 714, 716, 726, 738, 746, 746, 742]
938G42mLJ6K8K0j0m1m7k0J4K9K3J4J0QOOMok7l9l2j6rj3j4j0qj5j4MK4K4kk5k6j2%MJ1J7K0
933F37J8J4Q%pj1rqj3j7j1MK1K3Mj5j7OL5M5M0K6J1j1k8k9j3LQKkmqj4j6j1jNMKMRMj3k6k1
927F28pkqj0%J4J7J5J3J4J9K6K5J1ppPJ6Nj2j2LJ9K4J8Lj1j3nK%qj6k1k1j2nj0j8oK3L8K6
922G55OOJ4Oj7l1k7j5%K0K9J6oj3j0j1j3jJ8K0mk0j2KNJJNLkpk0l9n1l9j4J2L9N8N5K8jj2
917G34rj3j9k0j4j1%K3M0K8KqNJ3LlNJ2Lj0j9k4l5m0k8pL%kQK6L9L7J8rk6k3pMPRJ5J8J3L
911G41mnpj0qPK8M0K8%k6l7l3k5j8j4j2oNJ4J2JolJok2l4k8j2MJ2PkqjJ3K2J2rk2k1rJJ2K1
906E93K6J4lj2j3j5k1j9kJ5K3K5L2L6K7Oj4k4k5k2qJ3K7K5J5Pjrk4l9m4k6J0L7L3J2KJ3K1
901F91J1ljJ2J5Kj1j2ork0k4j3NJ4J2J4K7L9L2J3LOMj4l0k1jNnj1kOok6l3k1p%JJ1K6L6K9
$$ y = [742, 738, 741, 757, 785, 805, 795, 754, 707, 687, 701, 730, 753, 767, 777, 785, 791, 797, 801, 795, 768, 729, 697, 681, 672, 659, 645, 635, 627, 612, 598, 602, 626, 650, 648, 623, 597, 585, 585, 589, 600, 617, 637, 655, 669, 677, 677, 670, 659, 650, 642, 629, 612, 601, 605, 626, 649, 653, 638, 621, 627, 662, 707, 747, 773, 784, 773, 745, 716, 703, 706, 714, 716, 714, 710, 702, 688, 672, 661, 660, 665, 669, 671, 675, 684, 688, 675, 649, 628, 621, 619, 611, 601, 601, 615, 632, 647, 660, 674, 693, 719, 744, 755, 748, 741, 748, 764, 769, 757, 745, 748, 767, 791, 809, 812, 801, 788, 783, 785, 785, 777, 761, 740, 719, 707, 702, 692, 674, 668, 691, 729, 755, 761, 767, 781, 787, 770, 739, 712, 697, 697, 717, 746, 762, 756, 743, 733, 722, 709, 708, 726, 746, 742, 722, 710, 712, 717, 718, 719, 724, 727, 725, 718, 698, 659, 608, 569, 555, 567, 606, 664, 719, 747, 746, 734, 725, 712, 693, 673, 659, 648, 648, 671, 711, 739, 741, 733, 738, 751, 754, 751, 756, 768, 771, 761, 742, 718, 683, 643, 615, 608, 611, 611, 609, 617, 643, 682, 719, 737, 728, 702, 679, 672, 676, 683, 692, 707, 725, 738, 741, 737, 732, 725, 715, 707, 714, 742, 782, 810, 810, 784, 747, 714, 689, 671, 657, 645, 639, 644, 658, 670, 671, 665, 662, 663, 657, 635, 601, 573, 561, 565, 577, 584, 582, 574, 573, 586, 608, 620, 611, 589, 568, 559, 560, 572, 593, 619, 633, 630, 618, 605, 590, 569, 550, 548, 563, 586, 611, 643, 679, 706, 712, 698, 674, 649, 627, 619, 632, 659, 684, 699, 706, 705, 696, 672, 633, 589, 563, 573, 610, 643, 655, 657, 670, 691, 702, 699, 698, 710, 725, 727, 716, 704, 698, 689, 669, 645, 632, 637, 651, 663, 677, 704, 743, 775, 788, 791, 797, 801, 787, 757, 736, 735, 740, 735, 724, 722, 728, 722, 696, 663, 642, 635, 635, 636, 647, 673, 709, 738]
896G38Mk2l5l2k7k4j9j0JPMJknoqpLK4L9L3J1kPK0J8kk2l5m2l7j1J7K4Kk3k2KK0K4J8K0K7
890F71K6J1rj9j9j4rJJ9L8L9K4RRJ3Oj6l1l0j3%OOKjjLJrj3pOJ2%j9l4l1j1J7L6L3J9MmmJ
885G18J0J5Rqk2k6j6jJ1J6RKKRJ1Mmrj3k1k1j2qj3j8j2NJ7J6MmqmJOJ2J7J5kk5l2j5RJ7J3
879F54QLprJ2L5K9ol1k2jM%PK3K2%j8j5%J1J7K0J8Ork4l3l3k3qjnj2j0JJ2K0K8K9J9LpJJ9
874G27K7J7rl1l6k6j7j5j5pJ2K5K5J2NJ0K2K4Qj4k4j4KO%l%Loj1jJ7K3Nk6m3k9QM9O5N4K3
869H42jrlRK0J9Oqj0JRPkqj6l1m4m3l3k8l1k8j2NJ3J6K0J7NlMJ6K0J9K4L1K4Jk1l0l1l1k9
863F76k1qjoj8k5j7NK4L3K9K8L0K9J8%j9k8k3j3j1k2l0k1%J2J0NNOLnrj0j3j8k2j8mJ3K4K3
858F11J6J1J1PMJ0J6Ok2m1l4j3JNJ3K0J9J3J8L0L1J6mj8k8l2k1%J0%j6j7jJ4J9J8J4J1J4J8
$$ y = [738, 742, 720, 685, 653, 626, 602, 583, 573, 574, 581, 585, 586, 584, 579, 573, 565, 558, 561, 585, 624, 657, 668, 666, 673, 693, 711, 709, 687, 652, 610, 573, 562, 579, 603, 605, 582, 560, 562, 582, 606, 624, 644, 671, 697, 708, 699, 680, 661, 647, 638, 639, 658, 696, 735, 759, 768, 777, 790, 796, 780, 749, 719, 706, 706, 712, 718, 720, 719, 718, 721, 722, 713, 700, 693, 699, 711, 711, 692, 658, 627, 616, 633, 669, 702, 721, 725, 721, 717, 718, 728, 743, 752, 744, 722, 696, 680, 679, 690, 706, 715, 717, 719, 728, 739, 743, 739, 730, 717, 696, 675, 663, 655, 642, 624, 612, 617, 634, 650, 654, 650, 642, 638, 639, 645, 657, 674, 689, 687, 662, 630, 615, 624, 641, 654, 662, 665, 658, 649, 661, 696, 725, 719, 688, 666, 665, 669, 669, 676, 699, 721, 721, 703, 688, 688, 699, 716, 736, 754, 760, 751, 727, 694, 661, 638, 630, 629, 624, 612, 602, 603, 615, 635, 663, 692, 711, 714, 707, 708, 727, 754, 771, 762, 731, 695, 669, 652, 637, 622, 615, 627, 652, 677, 689, 694, 704, 726, 750, 758, 744, 720, 706, 708, 714, 714, 711, 711, 714, 708, 697, 696, 713, 736, 741, 715, 672, 643, 651, 700, 765, 819, 842, 841, 832, 829, 838, 858, 877, 883, 875, 865, 866, 875, 882, 880, 872, 856, 825, 781, 738, 705, 677, 646, 618, 606, 611, 624, 640, 660, 677, 682, 679, 683, 699, 719, 738, 762, 793, 817, 818, 797, 767, 736, 705, 676, 655, 647, 646, 640, 622, 597, 580, 585, 609, 642, 671, 699, 729, 758, 776, 776, 757, 729, 706, 693, 682, 660, 630, 609, 609, 621, 631, 636, 641, 647, 650, 645, 636, 626, 613, 595, 573, 555, 551, 564, 588, 611, 627, 638, 649, 656, 660, 670, 686, 692, 670, 629, 595, 582, 583, 588, 601, 621, 640, 653, 671, 701, 732, 748, 744, 726, 698, 666, 645, 645, 655, 655, 639, 622, 621, 635, 654, 672, 686, 697, 711, 729]
853G29Qk0m3l5mK4K5J4J1J9K8K5J0nj8k1j8j4j2j3j4j1ojJlpplKJ2J6J1kj4j6j2qlOJ6J7R
848F73MMJrj7j5kRJ3J2QJ0J3J1%j4j7j1lkoj1j5j3LK0K1R%Jkj5k2nK4L9L3K4K3K4J8Lk0m2
843G59n0m1k5j8j5mJ1J7OkKPjj5k3k1j7j1%J5K8L8M4M0K3nk8m0l7k1KJ9K0J3Pjj6l0k7oJ5
838F12J5Jj2qJ0L2L9L0J0mkNQJj1j9k3j6mPJ6K2J9Pj0j4jJ7J9Kj4k0j4nQK1K8K1J2J1J5Pj0
832H08k5k7k1j7j7j4lQJ4Mj0j5oJ0J1J%J6L6M3L6K8K1RnnLQLKJqk3l0j7JJ1J9K9L1J5nj0o
827I04rk1k5j7qpnnj2k7l8l5k3qJ3L4L2Pj7j8nMPJ1K2L0L1L3L6L6L3L0K2Lk2m3m8l5j5MJ2
822H61J3J9L1M3M4L3J5qk8l5k4nMJrj3j1rqnnlpj6k5k9k3j5j1qkLLjllj0j5j2KJ4J9K3K8L5
817H48L7K7J0llJ0J5Jj6j0J4L1K5Rlj3k7l4l1k0j7j6qOK0K4K2J3Koj4k7m7n1k7JOj0j7mJ2
$$ y = [729, 737, 717, 674, 639, 635, 659, 684, 698, 709, 728, 756, 781, 791, 786, 768, 747, 729, 715, 703, 690, 676, 665, 659, 658, 659, 656, 649, 642, 639, 641, 653, 669, 680, 678, 664, 648, 636, 628, 625, 631, 647, 664, 673, 677, 681, 682, 673, 656, 641, 639, 648, 661, 673, 681, 691, 704, 715, 715, 701, 684, 673, 670, 668, 662, 651, 636, 623, 626, 646, 667, 676, 676, 677, 675, 660, 638, 633, 657, 696, 729, 753, 776, 800, 818, 821, 801, 759, 709, 668, 643, 625, 610, 606, 617, 634, 640, 638, 640, 647, 646, 631, 608, 587, 570, 559, 559, 574, 602, 640, 684, 724, 747, 742, 714, 674, 637, 616, 618, 637, 657, 670, 677, 676, 660, 630, 603, 597, 612, 627, 628, 616, 608, 618, 650, 689, 719, 729, 725, 723, 728, 736, 737, 726, 707, 684, 668, 664, 671, 687, 709, 728, 735, 725, 711, 710, 727, 746, 748, 734, 714, 700, 695, 703, 724, 752, 773, 785, 796, 811, 818, 808, 783, 756, 735, 718, 701, 687, 684, 692, 706, 710, 700, 685, 679, 689, 700, 701, 701, 717, 753, 796, 832, 860, 881, 890, 885, 880, 883, 891, 894, 896, 897, 889, 866, 836, 819, 820, 831, 850, 879, 910, 925, 920, 910, 904, 895, 874, 849, 832, 824, 817, 812, 807, 795, 768, 730, 695, 672, 664, 677, 711, 743, 750, 733, 715, 710, 714, 721, 732, 754, 784, 815, 848, 884, 920, 953, 983, 1005, 1008, 986, 943, 895, 860, 845, 849, 861, 874, 893, 924, 967, 1011, 1044, 1059, 1051, 1023, 988, 964, 959, 963, 964, 955, 942, 931, 922, 914, 909, 904, 901, 894, 878, 853, 824, 801, 786, 775, 767, 765, 768, 771, 770, 767, 764, 754, 739, 727, 729, 743, 762, 785, 813, 848, 885, 912, 922, 919, 916, 926, 941, 942, 926, 916, 930, 961, 986, 995, 992, 979, 952, 918, 887, 867, 850, 834, 826, 832, 852, 876, 898, 911, 913, 907, 893, 866, 819, 768, 741, 742, 748, 738, 721, 717, 729]
812G29J4NJlj7l5l7j3J8L4K5Kj7k3k0j3oMJ3J3Kj4k2j2MJ8K0J5J2J3J2Mqj9k5j9jJ9L1L6L6
807G76K7Oj8k1%J9J9NKPLj3k7k7k3k4k3j7oQJ8K0Mj3j2NJ3Jj2j1qj1j3jJ2Pnq%Krj5pRJ6J4
801F69Plj2j3lRRlj2j1lJOJ9L6L9K2kj1jJ2J6J4J1Moq%Lj1l6m4k9lJ5J8Roj3pjrk6k6pJ4J6
795F43Lmkkj0j4qJjj2j3MK1K0M%J2K4J1j4j6OK6K1OQK0K2Oj0j1j0j4j6rKKoj5j6j5j2qkkq
790F12j2lJ8L4L5K5J7J1Lqj5j4j0mLNnk5l4j9QJ6JoJ3M2M7K4kqkkrj2j1mMJ2J4jk4l8l8k7
784F11j2MJ8K3J3MJjj2k2k1rnnMJ9K6J2j3l0k7pJ4K2J0j3j9pMkj6k0j1JPPOMQJ8K0PpnJ0J4
779F23PMJ3K0Ok6n5n3k2J9M5M0J9QJ3J9J7QLKkj4k5k9k4j6oNJ4J9J8QJLQQJoolNJ8L0L3K2
773G72Oqj6j8j0%Kpj8k4k8l1l1j9lJ2K1K4J5lj9k3j4njkKJ2K7L5K1nk2k0q%LORQLkljKPOJ
$$ y = [729, 743, 748, 749, 746, 729, 694, 657, 644, 662, 696, 721, 723, 706, 683, 663, 650, 644, 648, 661, 674, 676, 662, 640, 628, 632, 650, 670, 685, 697, 710, 722, 726, 718, 699, 674, 655, 654, 673, 704, 740, 776, 803, 809, 791, 770, 770, 789, 808, 813, 815, 822, 825, 812, 785, 758, 735, 711, 688, 671, 665, 673, 691, 711, 715, 702, 690, 695, 708, 709, 697, 686, 678, 667, 654, 653, 665, 672, 667, 659, 659, 661, 652, 637, 630, 639, 655, 669, 676, 673, 661, 648, 645, 654, 663, 660, 648, 637, 634, 635, 641, 660, 696, 735, 757, 755, 744, 743, 755, 771, 785, 796, 800, 794, 786, 786, 789, 778, 742, 698, 669, 666, 681, 699, 708, 702, 689, 682, 681, 672, 646, 620, 613, 627, 643, 646, 642, 640, 638, 628, 614, 606, 607, 606, 594, 581, 585, 606, 626, 630, 630, 642, 666, 677, 663, 647, 653, 679, 700, 706, 714, 734, 756, 762, 752, 741, 731, 717, 701, 692, 694, 696, 690, 675, 659, 644, 632, 624, 622, 620, 612, 600, 597, 615, 649, 684, 709, 726, 737, 740, 732, 717, 703, 693, 689, 692, 697, 692, 667, 633, 614, 622, 638, 639, 633, 646, 688, 735, 759, 757, 749, 747, 745, 736, 724, 713, 709, 713, 725, 739, 738, 714, 676, 638, 611, 599, 603, 621, 644, 657, 661, 662, 661, 649, 627, 606, 597, 592, 587, 591, 610, 636, 648, 635, 605, 578, 571, 585, 607, 617, 604, 585, 578, 582, 580, 564, 544, 533, 534, 541, 548, 554, 558, 566, 584, 604, 611, 604, 599, 609, 623, 630, 634, 647, 667, 673, 647, 592, 539, 517, 536, 581, 621, 640, 648, 661, 680, 697, 705, 708, 710, 708, 694, 669, 640, 616, 600, 594, 599, 613, 632, 650, 658, 659, 662, 670, 678, 679, 673, 667, 664, 669, 687, 717, 750, 772, 778, 770, 754, 736, 726, 726, 728, 721, 703, 679, 651, 620, 589, 570, 567, 579, 600, 624, 639, 636, 617, 594, 580, 575, 574, 572, 574, 586, 613, 648, 669, 664, 642, 622, 614, 614, 617, 623, 632, 640, 643, 641, 638, 637, 639, 646, 652, 653]
767F53k%Kmrm%moQK9L3J2k1m2l6j3J1K2K5K9L1J8j4l5k9j0%JJ0K3J9lj9k1j9j6JK9M3J8k1
762F89m5m6l3j3OJ7J6J7K7K9J4mmNkj9k4j3jKLOOPJ8L4L6J8ok4l3l7k5MK9L8K9J9J6J6J1l
757G80k1l3l0j1QJ5Qrk8l2j9KRLppl%LNKlnnj1k2k6j6%MjrqLJ6K2J7J0QQlj7rK1L8J9j4k0
751F32OL2L2J4pk4k8j3J4K8J9kj3k0l1m0l1nJ2J2NPJ2QKOJ7J7LmKJ2Pj2k4k6j6mRJ9K1J5K
746F65j0j7j1LJ5J4J0J1J2%j2j2KJ0Kqj1j3j2%K5M1L5K0Qjj6k9k2mPMknj3j9j2PK3K0Onj2
740F94j9k0j1lkolRK1K4J1qj4kJ5J6nl2m8m4k0J4L7L6J8OJ0J7J3Jml%kpj0j1pPJ9J9PmjJ0
735G18J3NokJ1J5NqnJ2J8Nj6j9jJ9J9Kj5k1j6rpnjOPkj8l3l8l4j9nJ0J8K0J5PPJ3J6J4OJL
729G05OLj2k2j5RK8K7J5OOrl6m9l0LJ5Jj3j1kQK1L6L5J5rj8rMJ0Oj2l8n9n8k6J7M7L8Qj0N
$$ y = [653, 651, 651, 653, 649, 640, 636, 636, 632, 626, 634, 663, 696, 708, 687, 645, 609, 596, 607, 629, 654, 683, 714, 732, 718, 683, 654, 644, 644, 645, 655, 678, 697, 694, 675, 654, 635, 619, 620, 649, 692, 710, 689, 644, 598, 565, 552, 558, 575, 591, 608, 635, 664, 678, 674, 670, 675, 673, 654, 630, 617, 616, 618, 621, 627, 633, 640, 658, 692, 728, 746, 740, 716, 683, 646, 621, 625, 654, 692, 721, 740, 756, 772, 783, 780, 759, 726, 696, 685, 693, 708, 716, 707, 679, 647, 628, 630, 639, 642, 635, 628, 625, 625, 628, 633, 635, 632, 627, 622, 611, 589, 563, 547, 547, 551, 550, 541, 533, 536, 552, 574, 591, 601, 609, 617, 614, 597, 588, 609, 647, 666, 652, 632, 638, 670, 702, 716, 709, 685, 657, 644, 658, 686, 705, 703, 690, 670, 639, 599, 568, 563, 575, 587, 592, 599, 611, 619, 621, 627, 644, 661, 664, 660, 662, 674, 681, 669, 645, 619, 603, 599, 608, 627, 648, 663, 665, 655, 638, 627, 630, 645, 659, 669, 680, 692, 692, 680, 668, 670, 680, 682, 674, 663, 650, 638, 638, 663, 704, 739, 759, 767, 766, 750, 721, 699, 695, 702, 706, 704, 699, 686, 667, 655, 662, 685, 705, 711, 706, 694, 675, 655, 644, 641, 639, 633, 630, 639, 660, 684, 695, 687, 673, 671, 686, 702, 697, 665, 617, 573, 553, 567, 604, 640, 658, 664, 674, 691, 704, 705, 701, 698, 698, 696, 689, 679, 668, 661, 668, 687, 706, 713, 709, 708, 718, 731, 736, 730, 728, 739, 754, 759, 751, 746, 758, 776, 781, 765, 746, 745, 764, 783, 785, 770, 749, 733, 724, 717, 712, 711, 717, 724, 722, 704, 671, 633, 599, 580, 575, 585, 603, 623, 638, 645, 652, 665, 681, 695, 701, 702, 705, 711, 714, 702, 680, 665, 674, 702, 729, 744, 750, 756, 747, 711, 662, 632, 635, 650, 651, 638, 627, 625, 633, 654, 690, 725, 740, 731, 713, 704, 708, 718, 724, 712, 674, 615, 557, 531, 548, 595, 633, 641, 631, 636]
724F36L2L3Qj2rmj3k4k3k0k9m0l3qJ6L4N1N8L9Kk2j7NJ6QmrjOJ0RJ3J4Mj4k3j2OJ6J6J1Kj1
719G17j3LJ7J5PJ2K1J4jkJ4J5ok4j6KMk%Qnl9p1p2m2mK5L3K5J7J4J2MjLQQlj1j0mKkj0j3K
713F51K5K8Pk0l3l1k7k2j2JRJ5K3K6K0J0QJ1QjjQJ1jr%K2L0J6qk2j6mMKoj5k5k9j3J5L6L8
708G29K6J0mj3oJ6K6Ml0m5l5k6k4j6KJ3Q%MRKj0j0nkJOJ3J0M%%jLJ5K5K3J4QO%lNJ5RllJ0
702G80J2pk6l1k3j8j1mjrj3rmrj2mJ0J6J5K3L6L4J1j4k2k1k0k3k2j0QK5L1K2Jj5j8j4j0pn
697F42qj8k5j5OK9M6N3M9L2J5Kmj4k0j5JJ2Nj1j8j1OK1K1Oj3k1j8j0om%Joj4j9j7pJ0L1M0
692G34K8Npl%lkJ3L0L0J1j3k4k4j9k1k5k2rPRjqjPMqj2kJ6K3J8OnmPJ5Pj0j3OK4J1j7k8j0
686G20J1QqqJ2K9K9K1J4P%jPQmk1k1mJ5K1J5PJNJ5K4K6K5K6K0kk3k3qMLJPQjnQK5K7J7J3J7
$$ y = [636, 668, 701, 709, 697, 688, 684, 671, 647, 624, 604, 575, 535, 502, 494, 510, 544, 595, 653, 692, 694, 672, 655, 660, 676, 684, 680, 671, 670, 676, 686, 695, 708, 722, 726, 712, 689, 677, 683, 699, 715, 726, 728, 717, 704, 707, 724, 739, 746, 758, 779, 793, 792, 790, 804, 819, 813, 789, 773, 775, 779, 777, 777, 785, 780, 741, 670, 598, 556, 552, 577, 610, 635, 652, 666, 678, 682, 681, 684, 692, 700, 697, 686, 676, 672, 674, 672, 662, 649, 651, 676, 704, 711, 691, 658, 627, 600, 578, 566, 567, 576, 591, 614, 640, 660, 670, 678, 689, 697, 696, 695, 703, 714, 713, 704, 704, 726, 756, 772, 764, 742, 726, 722, 726, 728, 722, 707, 682, 653, 640, 655, 691, 729, 755, 765, 761, 748, 742, 758, 784, 788, 758, 713, 678, 652, 628, 612, 614, 627, 635, 635, 639, 648, 650, 640, 630, 625, 623, 624, 630, 643, 653, 657, 657, 657, 656, 659, 674, 699, 722, 736, 744, 750, 750, 747, 752, 767, 776, 773, 770, 780, 792, 785, 759, 728, 705, 687, 676, 672, 671, 662, 649, 640, 636, 627, 615, 611, 621, 637, 652, 675, 711, 745, 756, 742, 720, 699, 679, 656, 634, 624, 632, 657, 688, 710, 711, 696, 678, 664, 654, 647, 642, 634, 616, 591, 576, 582, 611, 657, 710, 759, 791, 806, 808, 804, 790, 770, 755, 756, 768, 773, 762, 744, 733, 739, 760, 781, 787, 774, 753, 735, 725, 719, 715, 715, 716, 710, 696, 677, 660, 653, 663, 694, 734, 762, 767, 760, 757, 757, 754, 752, 765, 795, 825, 836, 823, 799, 775, 756, 735, 710, 688, 679, 686, 695, 694, 686, 685, 692, 696, 688, 676, 674, 690, 713, 731, 737, 732, 728, 735, 750, 757, 747, 734, 740, 764, 775, 758, 730, 720, 731, 739, 731, 723, 735, 764, 793, 814, 828, 835, 835, 834, 841, 849, 845, 824, 803, 799, 814, 835, 850, 857, 858, 863, 878, 902, 928, 953, 979, 999, 997, 974, 951, 943, 947, 950, 951, 958, 966, 965, 960, 968, 993, 1020, 1037, 1050, 1067]
681A067K3K1K0K2K0J1kj3k4l0l5l8l9l8k9j4kMQJ3J6J1kj8l3m5n0m2k4lJ2K0J8J1KmpmMJ5
676H22K2K5J8jk1k9k1q%MPO%JJ3K4J6kqKPmj7j6j0j0j1oLM%mmoqnnj3k7l3l1l1k2ML7N0L6
670G48J6J0J0jj8k2j2orj5j4j3j3j4j1ojQK1K5J2opJ0K6K0Mm%QRNJjJJ1K2K4J4%rj5k1k4j6
664G47mQK0K8K1rm2m3j6MJmRK3J0j8k8j0RRjmnpoMJ3Pj4l3l4j6J1L5L9K7J4J4K4K6J5kj1j1
659H00nLQP%j2k2k3rRJ5Jj2j2NJ7K5L0L0J3j2k1LL0K9jk6l1k7k8k8j0J9L8L6K3K1K7L1K2P
654I70jLPJj3k5k3j1JPRJ5K2L0L0K2J2JmLJ6K6L1L3L8L8K3lk1k0j1nlklrj2o%oj9k3j0QJ9
649A135J8J2Kprrj5k5j6J3M2M0J1j3j7pjnj1j6k4k4pJ7L1J9lrMK2K6J8J2J3J5J9K6L0J7j0
644A314k5j5MNj1k1j2MJ4J9K2J5kj8j3JPok1k7k4k1k1j9j0MJ6J6MpkJ1Qj4l9l6qK0K3On%J5
$$ y = [1067, 1090, 1111, 1131, 1153, 1173, 1184, 1182, 1169, 1145, 1115, 1080, 1042, 1003, 965, 936, 922, 920, 924, 932, 945, 961, 972, 970, 952, 919, 874, 824, 782, 758, 755, 767, 787, 805, 816, 818, 814, 807, 803, 807, 822, 844, 869, 887, 886, 865, 836, 815, 807, 807, 811, 818, 824, 824, 825, 838, 862, 878, 876, 868, 870, 877, 873, 856, 840, 830, 820, 809, 803, 806, 810, 810, 806, 802, 796, 788, 783, 778, 765, 738, 705, 674, 643, 621, 625, 662, 712, 748, 764, 774, 784, 783, 765, 743, 731, 725, 716, 701, 687, 674, 661, 647, 636, 630, 629, 637, 658, 683, 695, 689, 682, 692, 718, 738, 742, 738, 738, 746, 755, 760, 761, 760, 761, 772, 794, 818, 832, 832, 823, 808, 787, 763, 747, 743, 751, 771, 799, 820, 811, 769, 726, 710, 714, 715, 711, 720, 743, 753, 735, 707, 697, 706, 715, 714, 710, 705, 698, 692, 696, 709, 716, 702, 669, 635, 619, 630, 665, 704, 731, 745, 759, 783, 809, 824, 822, 811, 800, 795, 798, 806, 813, 813, 801, 779, 756, 747, 756, 771, 772, 760, 748, 753, 770, 795, 825, 855, 868, 856, 835, 838, 868, 897, 896, 870, 839, 812, 784, 756, 746, 765, 803, 839, 862, 883, 910, 941, 963, 970, 969, 972, 979, 980, 967, 942, 919, 908, 909, 916, 925, 940, 962, 992, 1022, 1044, 1056, 1057, 1053, 1056, 1072, 1098, 1129, 1162, 1200, 1238, 1261, 1258, 1237, 1217, 1206, 1201, 1198, 1196, 1193, 1184, 1172, 1166, 1166, 1160, 1141, 1118, 1108, 1116, 1135, 1153, 1165, 1167, 1160, 1151, 1142, 1127, 1102, 1086, 1099, 1141, 1181, 1192, 1179, 1162, 1155, 1154, 1149, 1138, 1122, 1098, 1074, 1067, 1084, 1115, 1134, 1131, 1122, 1126, 1148, 1174, 1192, 1204, 1217, 1232, 1251, 1277, 1307, 1324, 1314, 1289, 1274, 1278, 1283, 1272, 1251, 1239, 1243, 1257, 1276, 1298, 1313, 1311, 1293, 1280, 1281, 1288, 1282, 1261, 1234, 1210, 1189, 1168, 1149, 1139, 1143, 1159, 1175, 1179, 1172, 1170, 1181, 1189, 1175, 1136, 1100, 1092, 1112, 1135, 1141, 1136, 1136, 1151]
638A151L3M4M3K6jk3k7k5k7l3j9K0O1O9M0Mj2k1m0n7m6j1J4J0KJ7M1L7Ok2k6j8j4pRK6K9K7
634A280K9K7J0j9m1m6m0k4kJ2Nj1j4MJ9J8RNKpk1k4k1j8j8j6j4j2oJ3L0K7Mj9k5j5pljMJ1
629A085J4J8K2K6K6J9QKJJpj9k7k7k7l0k8j4NJ2%j4j3J0L8M3J6j8l4k3plj7l2l1j4J2L3L6
624A042J8j1l3l3j4RK2K5J5Jj0j0lNNKPK2L1K1ok7k7j4kjkMJ0Oqk0j5onj9l4l7l2k6k7k7k0
619G76nOJ1Kj2j9j8oQK1K6J8Jj2j1mJjmnonmJOJ2J7K3K4K3K0J7RKKJ0J5Nj2k1k1j4j1j1j5
613H39j1MJ7K2J7J3J0jj3j3kJj3k2nJ6J3j1k6k2j8k3k0KK4K0jj3pKKllLJ1J8K1K4K3K4K0R
608I28j1l0l6k2MK5K5J4QJ9L2L4K7K0J2nk0k4k3k6k9k1ppk1k9j7jRJ4J3Lj4j7nROmrj0j3j2
603G89KJ7J5jrqrqLJ9J9O%OJk1l2j6J1J8J0J3K1J1j1j7J0M4N6M1J2j6m2n5m6k4lMJmJJ9L1
$$ y = [1151, 1184, 1228, 1271, 1297, 1296, 1273, 1246, 1221, 1194, 1161, 1142, 1162, 1223, 1292, 1332, 1336, 1324, 1303, 1263, 1206, 1160, 1149, 1163, 1173, 1175, 1192, 1233, 1270, 1276, 1254, 1228, 1210, 1196, 1189, 1198, 1224, 1253, 1280, 1309, 1336, 1346, 1327, 1286, 1240, 1200, 1176, 1174, 1186, 1191, 1180, 1166, 1170, 1189, 1207, 1216, 1221, 1223, 1216, 1195, 1171, 1150, 1132, 1114, 1098, 1084, 1072, 1066, 1079, 1109, 1136, 1140, 1121, 1096, 1081, 1074, 1071, 1070, 1074, 1085, 1099, 1117, 1139, 1165, 1191, 1210, 1218, 1220, 1221, 1222, 1215, 1196, 1169, 1142, 1115, 1085, 1057, 1043, 1048, 1060, 1060, 1046, 1033, 1043, 1081, 1124, 1140, 1122, 1088, 1065, 1058, 1055, 1038, 1006, 975, 961, 973, 1006, 1042, 1060, 1049, 1016, 983, 969, 978, 1000, 1025, 1040, 1041, 1031, 1021, 1018, 1023, 1028, 1030, 1037, 1059, 1090, 1111, 1105, 1078, 1051, 1037, 1035, 1034, 1032, 1036, 1046, 1052, 1044, 1024, 1009, 1003, 998, 979, 945, 908, 876, 850, 823, 796, 776, 771, 777, 788, 790, 778, 759, 741, 735, 743, 764, 790, 808, 809, 797, 786, 782, 783, 782, 778, 773, 767, 762, 758, 759, 765, 777, 794, 817, 841, 864, 884, 901, 910, 912, 914, 924, 939, 944, 932, 911, 890, 876, 865, 854, 839, 828, 832, 849, 871, 888, 901, 911, 910, 897, 884, 882, 883, 870, 848, 843, 859, 872, 861, 835, 813, 795, 772, 752, 754, 778, 798, 797, 784, 777, 779, 781, 778, 775, 778, 789, 807, 828, 852, 875, 899, 919, 928, 917, 887, 851, 829, 833, 858, 883, 897, 905, 924, 956, 990, 1017, 1037, 1049, 1044, 1024, 1000, 977, 951, 922, 901, 894, 887, 866, 837, 820, 819, 828, 842, 855, 858, 844, 827, 822, 831, 837, 833, 824, 814, 801, 789, 791, 808, 823, 822, 813, 805, 796, 788, 791, 810, 829, 835, 835, 841, 842, 821, 789, 773, 784, 802, 812, 825, 846, 857, 846, 829, 839, 883, 939, 980, 992, 976, 934, 879, 833, 809, 806, 810, 811, 807, 808, 827, 858]
598H58K6OrnORQJ1J6K2K1J8J3Nkmrk1l8m4l5k3j9j9j4LK3L7M2M5L8J5k1n0n6l9k0rm%lqmJ3
592G79K6K4J2KJj%PJ4Rrk1j7mJ0K1L2L6K6%k9l4j2J8K9J6krqokRJ3OLJ9L7L0QjJ7K9J7lkJ4
587A104J6MomNJ7K6K4Mk5m3l9k2pKJrj7j5lPJ5K3K8K7K0J8J5Nj1j9j0%LJNOok8m0k8jK3K7
581A093J6PRJ3J0%qj1j6j4lJ4J7Lj2j2lJ1L4O3P6N5J5k2l7l3j5J0K7K3KpKK3M2N3N4M5L1K2
576A577K7L8M3L8K9K5L5O1Q9J08J15J16J18J20J25J33J44J52J65J89K32K79L19L47L78M27
573E429N05O02P05Q03R04J018J132J230J296J325J311J245J121R41P04M16R5k34n46q26j056
571A8120j218j299j305j252j174j098j027r41q26p03o08n46m96m34l65l03k54k21k06k01j97
568C446j90j83j64j26q8p8r8j20j23j13r5o3k5mj3k4j7nj5l5m4m3n3o9p0m9k7j9j7j2j2k0
$$ y = [858, 884, 890, 881, 876, 882, 891, 899, 910, 926, 948, 969, 987, 1000, 1005, 1003, 999, 990, 969, 931, 887, 852, 829, 810, 791, 777, 780, 803, 840, 882, 927, 965, 980, 959, 909, 853, 814, 794, 785, 781, 781, 778, 770, 766, 779, 805, 829, 841, 843, 844, 843, 843, 850, 864, 873, 864, 843, 826, 822, 832, 853, 885, 921, 947, 947, 918, 884, 872, 890, 919, 935, 933, 924, 916, 910, 908, 917, 930, 936, 939, 958, 995, 1025, 1033, 1032, 1049, 1078, 1095, 1092, 1090, 1104, 1120, 1124, 1118, 1114, 1119, 1136, 1162, 1186, 1190, 1165, 1122, 1083, 1061, 1054, 1056, 1057, 1048, 1031, 1016, 1013, 1020, 1035, 1058, 1086, 1113, 1133, 1151, 1166, 1171, 1160, 1141, 1131, 1131, 1134, 1135, 1140, 1146, 1140, 1112, 1072, 1044, 1043, 1066, 1093, 1109, 1116, 1125, 1138, 1148, 1148, 1140, 1129, 1113, 1099, 1096, 1110, 1127, 1130, 1118, 1106, 1103, 1114, 1148, 1211, 1287, 1342, 1357, 1335, 1298, 1265, 1250, 1260, 1287, 1310, 1312, 1305, 1307, 1330, 1372, 1425, 1479, 1524, 1555, 1577, 1604, 1642, 1685, 1723, 1752, 1777, 1812, 1873, 1962, 2070, 2185, 2301, 2419, 2539, 2664, 2797, 2941, 3093, 3258, 3447, 3679, 3958, 4277, 4624, 5002, 5429, 5934, 6536, 7241, 8044, 8948, 9966, 11098, 12328, 13624, 14949, 16260, 17505, 18626, 19567, 20271, 20687, 20782, 20548, 20002, 19176, 18120, 16902, 15603, 14298, 13046, 11872, 10774, 9747, 8806, 7980, 7277, 6669, 6123, 5627, 5193, 4828, 4525, 4271, 4050, 3844, 3643, 3446, 3256, 3073, 2909, 2783, 2695, 2617, 2519, 2399, 2276, 2163, 2068, 2005, 1980, 1976, 1963, 1939, 1922, 1917, 1902, 1867, 1823, 1780, 1727, 1658, 1588, 1539, 1512, 1493, 1476, 1464, 1452, 1432]
564A432k9k9k0JK4K8Lk9l2qJ2J1PJ3J3pl3l9k5KK9M1K5ql0k4kQNoj9k5j5OJ9Oj6k1nNjj9k7
559A221k1nRJ3J2Pjj1j6j2LJ9L3M1M0K2mj6j1kLLJj4l8m4k5kOMRJ6J1mj4j7j6pJ2K4K0Kj2
554A239k2l2l1j1J8L0K7K9L9L9K3J2RP%kOJ1MjQJ8K2J4MkKJ9L9M2K8J3J0RRK0L7M5L7K5K9
549A822L9M1K9J4OQK7M9O1O3P2R0J00R7R4J08J36J65J93K19K34K31K23K19K16K08J97J84J52
545E297R2K9k1o2j13j62j95k14k33k44k32k06j90j83j64j27r4q1p5o8o8q0q9p5m5j7n%NJ4
541B394J4jk7m9n4m4l5k5rJ1J9J5J4K2L0K7K1K1K6K6J5K%J5L5L7J9mlJ7L9M2L6L3L8M6M4K8
537B835NoPK6L0K2J6J8J9J7K9N1O0M2J6LNJ5L0M7N7N3M4M0L6L0L1M0M7L8K8K8M2N3N7N9N9
532D029N3N3P2J03J32J44J54J69J93K18K39K62K90L22L40L22K74K32K14J98J55P9pq6j55k03
$$ y = [1432, 1403, 1374, 1354, 1355, 1379, 1407, 1410, 1381, 1349, 1341, 1353, 1364, 1371, 1384, 1397, 1390, 1357, 1318, 1293, 1295, 1324, 1365, 1390, 1382, 1352, 1328, 1326, 1334, 1339, 1333, 1314, 1289, 1274, 1280, 1299, 1305, 1289, 1268, 1263, 1268, 1267, 1248, 1221, 1200, 1195, 1204, 1217, 1229, 1236, 1235, 1224, 1208, 1196, 1199, 1218, 1251, 1292, 1332, 1354, 1350, 1334, 1323, 1321, 1324, 1327, 1328, 1314, 1276, 1232, 1207, 1205, 1211, 1215, 1224, 1240, 1251, 1247, 1233, 1216, 1200, 1193, 1205, 1229, 1249, 1251, 1239, 1217, 1185, 1154, 1143, 1161, 1191, 1218, 1247, 1286, 1325, 1348, 1360, 1369, 1376, 1376, 1374, 1380, 1391, 1395, 1394, 1402, 1420, 1442, 1456, 1460, 1458, 1460, 1479, 1518, 1560, 1588, 1601, 1611, 1620, 1629, 1649, 1686, 1731, 1768, 1793, 1822, 1861, 1902, 1931, 1945, 1951, 1959, 1986, 2035, 2096, 2159, 2231, 2321, 2421, 2518, 2612, 2720, 2856, 3021, 3214, 3433, 3667, 3898, 4121, 4340, 4556, 4764, 4961, 5145, 5297, 5389, 5418, 5397, 5335, 5222, 5060, 4865, 4651, 4418, 4174, 3942, 3736, 3546, 3363, 3199, 3072, 2978, 2897, 2822, 2754, 2686, 2606, 2517, 2442, 2397, 2380, 2375, 2375, 2380, 2394, 2408, 2407, 2380, 2331, 2277, 2233, 2198, 2173, 2164, 2175, 2194, 2209, 2223, 2245, 2275, 2302, 2323, 2344, 2370, 2396, 2411, 2413, 2413, 2428, 2463, 2500, 2519, 2515, 2512, 2529, 2568, 2610, 2646, 2679, 2717, 2763, 2807, 2835, 2840, 2834, 2841, 2867, 2897, 2919, 2935, 2953, 2972, 2989, 3018, 3069, 3129, 3171, 3187, 3190, 3195, 3210, 3240, 3287, 3344, 3397, 3441, 3481, 3517, 3547, 3578, 3618, 3665, 3703, 3731, 3759, 3801, 3854, 3911, 3970, 4029, 4082, 4135, 4207, 4310, 4442, 4586, 4740, 4909, 5102, 5320, 5559, 5821, 6111, 6433, 6773, 7095, 7369, 7601, 7815, 8013, 8168, 8247, 8240, 8154, 7999, 7796]
529G796k26k29k30k23j89j26o9m5m3l8k0jJ4L2N9Q3R0Q1P0P4R4J17J31J38J47J55J61J67J86
526H156K19K54K78K89K88K89K99L22L51L73L84L96M24M65N06N38N61N82O07O39O76P08P21
523A8325P10O79O50O34O25N97N37M68M13L77L36K84K33J98J80J77J94K23K40K31J97J54R8
520B6760J8q2j94l23m81o58q19r39j026j096j146j164j150j116j072j012r39q61p95p39o87
517A0479o34n80n25m65m03l47l11k97k93k82k55k27k10k03j93j74j53j42j37j33j27j29j38
515D121j45j39j16q9p2o4o3n9n8o5p2o9n3l9m0m9n0m2l5l6m0m7n3n4m5k8k3k9l0j3NLj7l8
510B357m5m1l2j6kkj6k8k9k7l2m0l5k2j7k4l4l1k6k8l5l2j1RQj1k6k5j4ojjoj2j4j3j5k0j4
506A591PK9L3K3J8J7J3Lmqj7k6k1qkqj3j4k1l8m9m3k8j8j3j3j9k9l2j9jMjl%nj4j8qLJ2J8
$$ y = [7796, 7570, 7341, 7111, 6888, 6699, 6573, 6504, 6459, 6416, 6378, 6358, 6357, 6371, 6403, 6462, 6545, 6635, 6716, 6786, 6860, 6954, 7071, 7202, 7340, 7487, 7642, 7803, 7970, 8156, 8375, 8629, 8907, 9196, 9484, 9773, 10072, 10394, 10745, 11118, 11502, 11898, 12322, 12787, 13293, 13831, 14392, 14974, 15581, 16220, 16896, 17604, 18325, 19035, 19714, 20364, 20998, 21623, 22220, 22757, 23225, 23638, 24015, 24351, 24635, 24868, 25066, 25246, 25423, 25617, 25840, 26080, 26311, 26508, 26662, 26760, 26778, 26696, 26502, 26179, 25698, 25040, 24221, 23282, 22256, 21160, 20014, 18850, 17700, 16584, 15512, 14500, 13561, 12700, 11905, 11166, 10479, 9845, 9265, 8740, 8275, 7872, 7525, 7214, 6917, 6624, 6342, 6087, 5860, 5650, 5447, 5254, 5080, 4927, 4785, 4648, 4515, 4388, 4259, 4121, 3976, 3837, 3721, 3632, 3560, 3496, 3433, 3374, 3316, 3251, 3179, 3110, 3057, 3018, 2978, 2929, 2879, 2837, 2802, 2766, 2726, 2679, 2626, 2572, 2527, 2499, 2476, 2447, 2417, 2404, 2409, 2412, 2395, 2357, 2312, 2271, 2239, 2223, 2221, 2219, 2203, 2175, 2146, 2119, 2087, 2047, 2012, 1990, 1973, 1949, 1915, 1884, 1858, 1830, 1795, 1763, 1752, 1761, 1769, 1758, 1732, 1707, 1693, 1687, 1686, 1685, 1679, 1667, 1653, 1640, 1625, 1605, 1591, 1598, 1627, 1660, 1683, 1701, 1718, 1731, 1734, 1730, 1722, 1705, 1679, 1658, 1650, 1648, 1640, 1627, 1613, 1592, 1554, 1505, 1462, 1434, 1416, 1403, 1390, 1371, 1342, 1310, 1291, 1290, 1294, 1293, 1290, 1290, 1285, 1271, 1253, 1245, 1248, 1260, 1278]
500A278K0J5%j5j4LK0J7mk5k9j8mNPOJjLRJ2J4K0K1J3%pj0j7k0qKj1m2n7m0j5oqppj1j0JO
495A087rk4k1j0rj5j0oj5k6k0nmpJ3M9N6K4rj3KPjj3k5l7l9k7j5pJ2L8M4J7j6k0JJ9K2K1J2
490A021qk9l4j8%POJjLPlk6l8k2MRoj1JJ1Mj3j8pJ1K4K2Kj6j3J0L1K7Qj2k2j9nJ2J8J4PQJ0
484I57Lrj7j4nMJ2J1Knn%%%J2K6K0ol0k8j0kj5k3j1QJ7QJ%%lj1j6k2k9l3l3l0k2rOJ7K4K8
479G68K7J6rl0l5k2oMMLJ%jlKJ1K1J5mk1k1kJ5K1J8J1O%j2k6k8j1J6K9J6mj0KJ7K5K1Oj4k1
474G95j4npj3j1LK4M1M9L2ol4l1nPmj1mOPQK2L0K1%j3j3nJ1K5J7j9n6n9k6RK3K0J5Rkj3j4
468H09q%%mojJ4L1L5K2LolNOnk3l1k0NK3K6J8Opj9k2mK4L8K5lk0j6rpoMJ2Lj3j2PK7K6J3j
463I36j1j9j6jJ2J0lnPJ9J8J6J5Pj0k4k1o%oj1qorj5j0NJ9K2J1nk3l9m5l7j2J8L8L7J8mj9
$$ y = [1278, 1298, 1313, 1313, 1298, 1284, 1287, 1307, 1324, 1320, 1295, 1266, 1248, 1244, 1249, 1256, 1262, 1263, 1262, 1265, 1274, 1286, 1300, 1320, 1341, 1354, 1354, 1347, 1337, 1320, 1300, 1292, 1294, 1283, 1241, 1184, 1144, 1129, 1123, 1115, 1108, 1101, 1090, 1080, 1081, 1087, 1078, 1054, 1033, 1023, 1014, 999, 989, 983, 968, 942, 922, 917, 913, 906, 919, 968, 1024, 1048, 1039, 1026, 1028, 1035, 1034, 1021, 996, 959, 920, 893, 878, 871, 883, 921, 965, 982, 966, 946, 947, 966, 988, 1009, 1021, 1013, 984, 950, 932, 932, 939, 945, 946, 945, 948, 955, 952, 926, 888, 866, 870, 879, 873, 862, 863, 874, 878, 865, 847, 840, 851, 875, 897, 899, 883, 870, 880, 911, 938, 946, 934, 912, 893, 888, 900, 918, 932, 939, 947, 957, 960, 951, 934, 920, 915, 919, 931, 942, 944, 939, 934, 934, 934, 934, 946, 972, 992, 986, 956, 928, 918, 916, 901, 878, 867, 875, 892, 900, 901, 901, 901, 898, 887, 871, 849, 820, 787, 754, 724, 702, 693, 699, 716, 740, 768, 795, 811, 802, 772, 737, 715, 709, 713, 717, 720, 721, 721, 720, 717, 719, 730, 751, 766, 762, 741, 720, 718, 733, 754, 772, 783, 789, 789, 777, 751, 723, 712, 728, 757, 773, 769, 759, 761, 778, 803, 824, 830, 816, 795, 781, 776, 769, 756, 745, 748, 772, 813, 862, 894, 888, 854, 823, 818, 825, 821, 810, 806, 812, 819, 827, 849, 879, 900, 900, 887, 874, 869, 880, 905, 922, 903, 847, 788, 762, 771, 794, 814, 829, 838, 836, 823, 809, 801, 801, 801, 797, 791, 790, 804, 835, 870, 892, 895, 889, 886, 891, 897, 892, 869, 838, 818, 823, 846, 872, 890, 896, 889, 870, 848, 844, 868, 906, 931, 928, 908, 892, 883, 876, 870, 874, 886, 889, 876, 864, 871, 898, 924, 937, 936, 925, 906, 890, 889, 901, 911, 908, 903, 910, 929, 947, 963, 978, 985, 975, 951, 930, 924, 924, 918, 907, 899, 893, 884, 869, 859, 864, 883, 905, 916, 911, 888, 849, 804, 767, 755, 773, 811, 848, 866, 862, 843]
457H43j8nJ1K2J2rk5j6OJ9J2KJMKqj3j5j7j2jJ3J3LKQMj6l0j4J8L3J1k2l8l2k0j3lJ6K5J1
452G64j8l4k0%Mj2k8l7l9l3rK8N5O0N3M1K5Mqokj0k3k2j1pj1j4p%J0K4L2K4Kj4j5rmJRJ5J2
447G70P%oj6k0j5oPK6L7K9jk8l0rOjk0l3k6qPJ1P%qqLJ9K2Qpokj5l8m6l1qLJ2K0K7K3J6J0
441F82Krj6j5rlNJ1J1LkJM%n%NORJ8K3J2j0k3k3j2KJ6K0Lj7j4J1L5L2Rj2k2k1j5j3j3j4mJ4
436F62K8K9K3J1nj3j1JOJlmkkLJ0Oj2k7k5j4pNK6M3L6Qj7k5k5k2j5lMLRL2M8L6Jk4k8k6l1
431F90l3j8MJ6J0jpqqj0j0pLJ8K8K4OqrlLMMJ0J7J8Oj6k6j3J2K3Rj0j4j1j4k0j7kJ2J7J6J7
425G02J8J0lk0m0n4m6j9J0K0J1OJ9L8M0J8mpMJ0jj5k1k0j9j0PK0Rj5l4l3k0mJ6L3L9K6J0j
420F80qk0k7j9KK2L0K2Lj7k7j7%J3J4J6J9K7K5J1qj5mJ6K4J7QJj2k9l9l4k2j5j0kRJ6J1Ml
$$ y = [843, 825, 820, 831, 853, 865, 856, 831, 815, 821, 840, 852, 854, 855, 859, 861, 853, 840, 825, 808, 796, 795, 808, 821, 824, 826, 834, 838, 822, 792, 778, 796, 829, 840, 818, 780, 748, 728, 715, 712, 728, 753, 764, 746, 712, 692, 692, 696, 684, 656, 619, 580, 547, 538, 566, 621, 681, 734, 775, 800, 804, 796, 790, 788, 778, 755, 733, 722, 715, 704, 690, 683, 683, 693, 717, 749, 773, 775, 761, 746, 737, 733, 734, 743, 758, 770, 777, 777, 771, 755, 735, 720, 714, 721, 747, 784, 813, 812, 784, 754, 745, 751, 750, 730, 697, 671, 663, 670, 681, 688, 688, 680, 672, 675, 694, 716, 724, 717, 711, 709, 694, 656, 610, 579, 571, 574, 586, 606, 633, 656, 672, 682, 684, 675, 659, 644, 635, 632, 637, 648, 659, 662, 660, 661, 665, 665, 660, 660, 665, 671, 680, 698, 721, 733, 723, 700, 677, 665, 667, 683, 703, 706, 689, 675, 686, 721, 753, 762, 750, 728, 707, 692, 679, 666, 652, 648, 662, 690, 719, 742, 753, 748, 735, 724, 725, 731, 732, 729, 725, 723, 721, 724, 734, 740, 728, 701, 676, 662, 655, 660, 686, 729, 765, 773, 756, 731, 706, 684, 669, 666, 670, 673, 682, 714, 762, 798, 799, 775, 747, 721, 690, 657, 639, 643, 659, 669, 668, 661, 653, 645, 635, 625, 618, 621, 639, 667, 691, 697, 689, 680, 677, 680, 684, 688, 698, 715, 733, 739, 723, 697, 684, 696, 719, 728, 718, 704, 693, 679, 659, 642, 640, 652, 669, 685, 702, 720, 730, 727, 707, 667, 613, 567, 548, 558, 578, 589, 595, 614, 652, 692, 710, 706, 699, 703, 713, 712, 697, 676, 656, 637, 627, 634, 654, 663, 648, 614, 581, 561, 557, 573, 606, 645, 671, 681, 680, 672, 652, 625, 606, 608, 630, 660, 682, 685, 668, 641, 624, 624, 637, 651, 667, 686, 713, 738, 749, 741, 726, 722, 738, 762, 779, 787, 788, 776, 747, 708, 674, 652, 637, 627, 625, 634, 650, 661, 665, 662]
415F62%J2J7jl2m9l4j2oqlJ1J5J4J8L0L2K4J6J4Qnj2poj7k9k5mK0K7J5pk5k5j7j1oOJ9K0J2
410F51PJ1Qqj6nMok7k5lJ9K2J2Jl%J4K0Pj8l1k3mJ5L1L9L3J9RJ0J4Rj0k9l7k7j1jkmjmj8l1
405F11k5mOMOJ6K7K0Mrj3qJ1K9K7Nj7j9j4k1l2k6nJ0RL%kkJOONJ2K5L2K9K5K0Rqk0j8j9k7
399F69l2j7J0K8L1K5J2mk2k6j4OJ8K2K0Pj5l3l3j7k%LJ6L1K7Nj3j9j8k2j9KK9M2L4K2J3Nm
394G67jOLj0j9j4j0j5j8lK1L1K8K4K4J0j4l3l4k8j9qKN%JJ4J9%l2m4k7lPOKMN%pmMOok0j6
389F04NK2K5K6K9K1Kj4j0ORKLJ8K5J8PMPQRRJk0m0m1k7j4j1j0nLQPNMJ0J9J8Lj6k0nJ5K4J7
383G60ok8l2j2K0M3M4K4Lo%J1J3Pjmqj1j7j8j4nJ0K5L0J9%j4j5j3j3oJ2L6M7L3PoNK5L0J8
378I93NPJ6J9J3O%mjJ2L2N0O2O8P3P7P7P6O9N5L4K1K0K9L6L6K8K1K6M1M9L0j0m3m8k7lRNo
$$ y = [662, 662, 674, 691, 690, 658, 609, 575, 563, 557, 549, 546, 557, 572, 586, 604, 634, 666, 690, 706, 720, 728, 723, 711, 704, 698, 681, 652, 627, 623, 643, 670, 685, 678, 653, 628, 611, 600, 594, 600, 619, 639, 651, 658, 669, 677, 669, 653, 648, 652, 646, 619, 594, 591, 610, 632, 644, 645, 642, 642, 656, 676, 683, 665, 634, 611, 607, 622, 653, 692, 725, 744, 753, 763, 777, 786, 776, 747, 710, 683, 672, 671, 669, 665, 664, 660, 642, 611, 586, 582, 588, 592, 598, 614, 641, 661, 665, 656, 643, 635, 646, 675, 702, 707, 690, 671, 657, 636, 604, 578, 573, 583, 592, 595, 595, 593, 591, 592, 598, 604, 609, 621, 646, 678, 707, 732, 752, 761, 753, 733, 715, 696, 669, 637, 620, 630, 658, 689, 714, 726, 722, 700, 674, 660, 666, 684, 706, 726, 733, 718, 685, 652, 635, 633, 633, 636, 652, 683, 710, 715, 702, 683, 665, 643, 624, 626, 655, 697, 731, 753, 766, 771, 767, 766, 772, 775, 765, 746, 732, 722, 707, 689, 686, 707, 738, 766, 790, 814, 824, 810, 777, 743, 715, 696, 688, 690, 695, 695, 696, 710, 729, 729, 697, 653, 626, 623, 630, 636, 638, 642, 647, 647, 640, 636, 640, 646, 640, 620, 604, 609, 631, 656, 682, 711, 732, 734, 720, 710, 716, 725, 727, 730, 748, 773, 791, 798, 802, 809, 817, 826, 835, 836, 816, 776, 735, 708, 694, 683, 673, 668, 671, 679, 686, 691, 695, 705, 724, 742, 745, 729, 709, 704, 719, 743, 760, 754, 726, 694, 682, 702, 745, 789, 813, 816, 810, 810, 821, 834, 841, 840, 836, 828, 817, 800, 782, 768, 763, 773, 798, 828, 847, 847, 833, 818, 805, 792, 786, 798, 834, 881, 914, 921, 915, 920, 945, 975, 993, 998, 1005, 1021, 1040, 1053, 1059, 1059, 1055, 1054, 1066, 1098, 1148, 1210, 1278, 1351, 1428, 1505, 1581, 1650, 1705, 1739, 1760, 1780, 1809, 1845, 1881, 1909, 1930, 1956, 1997, 2046, 2076, 2066, 2023, 1975, 1948, 1945, 1954, 1959, 1953]
373A953j3j1orj3qNRmk1j9kJ1PmmQK1K6K8L1L2K5J1MJ3L7O0P2P6Q0Q6R5J06J17J22J19J09
368C149R2O8M2L1K8K0pl8n6o3p4r9j20j30j30j30j24j14j00r0p6n5l5l1m4n9n5l8k5k6k4j4
364A673lj2m1n3l0J3L7K3nj6%K8M5M1K5J3J0J6K3L1M7N9N5K9KoOK2K4J9Pkj3k5m0m7m2k6j8
360A869l5o6q3p3n0l9l8l7k8j2%Jmrqklj7l2l7k8j9k2l5m3l8j9JJ5J8J1%j0j9k1j5mOjk4m2
355A008l5j0PLokJ3J7Nn%J5K0J0rk1k4j6nOPkj4k0j4lPRJ0J0Jj2j9qNOjJJ6K3Rj3j8lPNkj
349I57LKJjj2k7k8qJ1Nj8k3kJ4Mj4j4PK3J6mk1k2j3lkj0j6j2oj0j6qJ3L1L3K6J8J2NMJ1J9
344I25J9Poj3j0kkj5k9k8pJ0%k3l6k7j3%J5K6K4OqoLQNKlj5k6k7k4j9j2lmj1j0J0L0K5Kj0
338G28lRJ0NM%qpOJ2JrML4M5J8k3m7l8qJ5K1Qoj3j4j5j8j6r%LPJ3J6J0kj5j9j8j5j2ojPJ6
$$ y = [1953, 1940, 1929, 1923, 1914, 1901, 1893, 1898, 1907, 1903, 1882, 1863, 1861, 1872, 1879, 1875, 1871, 1879, 1900, 1926, 1954, 1985, 2017, 2042, 2053, 2057, 2070, 2107, 2167, 2239, 2315, 2395, 2481, 2576, 2682, 2799, 2921, 3040, 3149, 3241, 3309, 3351, 3382, 3410, 3430, 3423, 3385, 3329, 3266, 3192, 3093, 2973, 2843, 2713, 2583, 2459, 2345, 2245, 2155, 2079, 2024, 1989, 1958, 1914, 1855, 1800, 1762, 1737, 1711, 1687, 1673, 1670, 1658, 1617, 1564, 1534, 1547, 1584, 1607, 1602, 1586, 1586, 1614, 1659, 1700, 1725, 1738, 1748, 1764, 1787, 1818, 1865, 1924, 1979, 2008, 2010, 2004, 2010, 2032, 2056, 2075, 2082, 2080, 2067, 2042, 2002, 1955, 1913, 1887, 1869, 1834, 1768, 1685, 1612, 1562, 1523, 1485, 1448, 1420, 1408, 1408, 1409, 1405, 1396, 1388, 1386, 1383, 1366, 1334, 1297, 1269, 1250, 1228, 1193, 1150, 1112, 1093, 1094, 1109, 1127, 1138, 1138, 1128, 1109, 1088, 1073, 1069, 1075, 1074, 1050, 1008, 973, 963, 970, 973, 967, 965, 978, 995, 1000, 995, 995, 1010, 1030, 1040, 1031, 1010, 986, 970, 965, 971, 978, 976, 962, 942, 928, 925, 932, 941, 951, 961, 962, 950, 931, 923, 928, 934, 933, 934, 950, 973, 982, 969, 951, 948, 955, 960, 958, 957, 960, 962, 963, 962, 950, 923, 895, 887, 898, 903, 885, 862, 860, 874, 878, 864, 850, 857, 880, 896, 892, 871, 849, 836, 833, 831, 821, 805, 793, 787, 777, 761, 753, 766, 797, 830, 856, 874, 886, 891, 895, 906, 925, 944, 951, 945, 932, 922, 920, 918, 903, 874, 846, 839, 849, 849, 826, 790, 763, 750, 750, 765, 791, 815, 821, 813, 807, 810, 818, 823, 825, 822, 807, 781, 754, 730, 711, 699, 696, 692, 681, 671, 681, 711, 736, 738, 728, 725, 734, 744, 749, 753, 753, 745, 738, 744, 756, 757, 748, 752, 786, 831, 849, 826, 779, 741, 733, 748, 769, 777, 771, 758, 744, 729, 711, 695, 686, 686, 689, 696, 709, 725, 735, 733, 718, 699, 681, 666, 654, 648, 647, 654, 670]
332F70K0J2j0l2l0nK2K6J3NN%j9l8l4j2NOlkJ2K5K1%j9j8nmk3l5k2OK4K5K0J3jj9k1LL4L7
327F52J3j6l0k9k2j4KK4L6L2J5Klpj8k4j2Kjk1l3k2JJ0KnjPNmpjQJ4J5J1J1J2J0MkkMQJ1J0
322F47Qkj8l5m2l3j0J8L6L6K2NMJ4K3K4J3Kl%RJ4J1jj6k5k8l2l4k5pNJrrJPLjMJ3J4Nrj9k2
316E59rJ3K8J8j2l4k8nQJ0OMOPJ7L0K9Qj9k2kK0K4J3jj4k2k0qKNOJ1J4Oj0j4j2j3k0j5OJ9
311E89J3oj3nOJ4K2K6J5nk1k4k1j4lQRkj4j7j0jOJ2K2L1L5K3jk2k3pNMnj1j4j4j3qLJ0J4J5
305F08J4J4J2PlpKJ5J7Lj7k8k4oRJ3QPJ3J0nj7j0NLj5k3j2MPOPKj3k5j6LJ4RKJKNRRMOK0L4
299F83L2J8Krk4l5k5QL4L0Pj0qJOmk0k9j6J1K9K5Pqj3j6j6oPJ2Kj4k5l0l0k0mJ0J3OjJLlj1
294E70nJ8L9L7J5mkJ0J1jj4j4ojknNK7L9K8%j6j3kmj7k4k4k4k8k8j9j5k5l8k8ML4M2L4L1L0
$$ y = [670, 690, 702, 692, 660, 630, 625, 647, 673, 686, 691, 696, 696, 677, 639, 605, 593, 598, 604, 601, 599, 611, 636, 657, 657, 638, 620, 615, 611, 588, 553, 531, 537, 561, 586, 606, 619, 618, 599, 578, 581, 615, 652, 665, 649, 619, 590, 568, 554, 556, 580, 616, 648, 663, 665, 662, 655, 637, 613, 601, 603, 602, 581, 548, 526, 527, 537, 539, 534, 533, 540, 545, 541, 534, 533, 541, 555, 570, 581, 592, 604, 614, 618, 616, 614, 618, 626, 637, 647, 655, 653, 635, 600, 558, 525, 515, 533, 569, 605, 627, 632, 636, 650, 673, 697, 710, 712, 709, 709, 718, 732, 743, 742, 726, 701, 673, 641, 607, 582, 575, 580, 581, 572, 563, 564, 571, 574, 573, 577, 590, 604, 609, 600, 581, 559, 550, 563, 591, 609, 597, 563, 535, 530, 538, 548, 554, 558, 564, 571, 588, 618, 647, 655, 636, 614, 612, 632, 656, 669, 668, 654, 632, 612, 604, 606, 611, 617, 628, 642, 648, 638, 624, 612, 599, 579, 564, 570, 589, 602, 596, 583, 578, 584, 598, 620, 646, 661, 656, 635, 611, 590, 576, 573, 581, 590, 588, 574, 557, 547, 546, 552, 564, 586, 617, 652, 675, 674, 652, 629, 622, 627, 631, 626, 615, 601, 587, 574, 566, 569, 579, 593, 608, 622, 636, 648, 655, 652, 645, 647, 662, 679, 682, 665, 637, 613, 607, 616, 629, 637, 644, 657, 667, 662, 645, 635, 640, 643, 628, 605, 593, 597, 604, 610, 617, 619, 606, 581, 565, 568, 582, 591, 593, 594, 596, 601, 610, 619, 623, 629, 649, 683, 715, 733, 735, 726, 702, 667, 642, 650, 684, 714, 721, 711, 703, 704, 710, 706, 686, 657, 641, 652, 681, 706, 713, 705, 692, 676, 660, 654, 661, 673, 675, 661, 636, 606, 576, 556, 552, 562, 575, 581, 580, 581, 584, 581, 570, 565, 583, 622, 659, 674, 670, 668, 678, 689, 688, 674, 660, 654, 653, 651, 646, 651, 678, 717, 745, 745, 729, 716, 714, 710, 693, 669, 645, 621, 593, 565, 546, 531, 506, 468, 440, 444, 478, 520, 554, 585, 615]
289F15K0mk4k6j7oMJ5J6Kj2j0NQoj8j2LO%jK%j2j5jJ8K7K4J7J7J7RklPJ3Qj%Mj2l5l7mL2M1
283F72K3Mj1k6l7j9J4L1J6qj4l%j6k9k7qJ0J2nk3k1kJ7K2K2J6Kj7k7k0oKOJ4K1J2k%K1L7L5
278F88J9%j7k9k1KK0J3qk5k6j5LK4L6K3pk7k3pJlm%kj4k1j3OJ3%j0jJ8K5Ok8n1n0k6MJ8J0
273E01pj3nNPNOOjj5j9rPJ5J2PjmkNRPNQJ8K3J9J0MQJ4J3Kj5k7k2qOQjj0j3j3j3j3nJ4L5L4
267E97J1j4k3j5lKlj5k4k2nJ2K2K5L2L1J3j4k1nJ1Mj7k6k2j7j7j7rQK7L9L3Nk4l2j8%QJ4K1
262E52K3J7J2J1Jj6k8k0jOlj8k8l1k1jJ6J5jj1JK4L2K0jj4j1%J2K1K0Qj4k9k0RL0L1J8J5J5
257F41Qrk1k0j4j2mRJ4Ln%J8K0Nj2j1MJ4Qmj1ojNJ4K0J6Jj0mQLk1m4m6k9nJ5K3J9Mrj1kJ5
251E76K9L1K1Ojjmn%J3J6jk1k8k2j3pjkj4k3j5PJ9J3M%mpmJmk7l9k9mQJ0J5K2K1QJnj3k0j2
$$ y = [615, 635, 631, 607, 581, 564, 558, 562, 577, 593, 595, 583, 573, 578, 586, 580, 562, 550, 553, 559, 559, 558, 560, 560, 548, 533, 532, 550, 577, 601, 618, 635, 652, 661, 659, 656, 663, 676, 684, 683, 683, 687, 675, 640, 603, 599, 631, 672, 695, 699, 688, 662, 625, 606, 620, 651, 667, 659, 645, 642, 642, 626, 597, 570, 562, 572, 584, 579, 556, 535, 533, 550, 572, 594, 610, 612, 595, 568, 548, 542, 544, 550, 564, 585, 597, 595, 595, 616, 653, 688, 707, 707, 690, 661, 640, 642, 662, 675, 667, 642, 616, 601, 604, 628, 664, 687, 680, 653, 630, 623, 624, 621, 617, 617, 615, 601, 580, 567, 573, 586, 586, 576, 575, 593, 618, 624, 596, 545, 495, 469, 473, 491, 501, 494, 481, 476, 481, 488, 493, 499, 505, 504, 489, 470, 461, 468, 483, 495, 502, 501, 497, 495, 500, 509, 516, 521, 529, 547, 570, 589, 599, 603, 611, 625, 638, 640, 625, 598, 576, 568, 574, 582, 581, 571, 558, 545, 532, 519, 514, 528, 563, 597, 608, 594, 571, 556, 553, 555, 552, 537, 513, 491, 486, 498, 520, 545, 577, 608, 621, 607, 586, 581, 592, 596, 579, 553, 531, 514, 497, 480, 471, 479, 506, 545, 578, 583, 559, 527, 509, 509, 517, 531, 552, 575, 592, 604, 615, 616, 600, 572, 552, 551, 557, 554, 536, 508, 477, 456, 455, 471, 486, 485, 474, 475, 499, 531, 551, 550, 536, 525, 525, 537, 558, 578, 586, 572, 543, 523, 532, 562, 593, 611, 626, 641, 649, 640, 619, 599, 585, 573, 569, 578, 592, 595, 590, 590, 608, 628, 633, 621, 610, 614, 628, 636, 632, 621, 615, 614, 619, 633, 653, 669, 670, 660, 656, 664, 667, 646, 602, 556, 527, 522, 537, 560, 579, 583, 574, 563, 561, 576, 605, 636, 657, 663, 662, 661, 657, 652, 652, 665, 681, 680, 659, 631, 609, 596, 589, 588, 586, 572, 549, 534, 541, 560, 573, 577, 577, 573, 566, 562, 563, 559, 532, 493, 464, 460, 468, 478, 493, 515, 536, 544, 545, 540, 527, 507, 495]
245D95NJ2JlJ6L6K9lk7k5oPJ2J0PPJ1J4J7J5J2J1QJrk3l5l8k8rJ3K6L2K8J2nj1nLjj4j5mJ2
240E91J7J5J7K2K0Kk7m5l7rJ5J6nj5ML3M0J9qj3lMLklj2k3k6j3PK0J5mk2k8j5MJ2Lj0j1lP
235E52Rjj2j2J0M3N5L2ql1l3l3l6k3PL0K7Oj0j1kJ2K5L5L3K5J5%j4k1j9j4j5j7j2okJJnk0
230E61k4nK5M0L4J9QjolJpk0k0rmj8k7j1J6K4J2LOQLqj4j8j3JJ7K5K1Pj0k8l4k1KJ7J8J1Q
224E86OKll%Jnj0j3j0jMMKok2l8l9k0JJ2J8K6K5Mk4j9J5M1L4J3RJ4Kk4l7k0QJ5PNJ4K4K1O
219F25qk0k7k4KL7N4L5Npmqk7l8k5poj1qjpk1k1nQOl%J0J5RklJ2K6K1nk8k9j3kpqLJ8K2Qj4
213E27l2l2rK0L6L0J8J3J3Omj3j8k3j7jJ5J1rk8l0j5%PJ2K3L4L1Jl4m5k0J7L8L2J4%kJ0K1
208E97J9%j7j8nMMMJ1J8Rj2l7n1m9l3j0J4K6K5J7J6J8J6Lj7l2l6k9j0J3L0K6J3NNKmJK1L7
$$ y = [495, 500, 512, 513, 510, 526, 562, 591, 588, 561, 536, 530, 537, 549, 559, 566, 573, 584, 598, 615, 630, 642, 653, 661, 662, 653, 630, 595, 557, 529, 520, 533, 559, 591, 619, 631, 626, 615, 610, 613, 612, 598, 583, 579, 591, 608, 623, 640, 662, 682, 684, 657, 612, 575, 566, 581, 597, 592, 577, 581, 614, 654, 673, 665, 652, 649, 653, 656, 654, 651, 639, 616, 590, 577, 584, 604, 619, 615, 593, 565, 550, 554, 566, 569, 559, 548, 545, 552, 561, 560, 548, 536, 546, 589, 644, 676, 668, 637, 604, 571, 535, 512, 519, 549, 576, 582, 572, 561, 559, 571, 596, 631, 664, 689, 704, 704, 690, 669, 650, 636, 621, 604, 592, 586, 584, 585, 586, 581, 561, 537, 532, 557, 597, 631, 650, 658, 657, 651, 648, 649, 642, 622, 602, 593, 589, 571, 544, 533, 549, 573, 585, 588, 594, 602, 605, 597, 583, 565, 552, 553, 570, 595, 616, 623, 613, 585, 551, 530, 532, 549, 567, 578, 586, 592, 594, 591, 588, 588, 589, 584, 574, 561, 551, 550, 554, 558, 560, 554, 532, 494, 455, 435, 436, 448, 466, 492, 517, 521, 497, 478, 493, 534, 568, 581, 590, 604, 606, 582, 545, 525, 533, 548, 555, 560, 574, 598, 619, 625, 617, 597, 570, 546, 548, 585, 639, 674, 679, 672, 668, 660, 633, 595, 570, 563, 557, 546, 538, 537, 530, 509, 488, 483, 491, 497, 494, 494, 504, 519, 528, 526, 523, 535, 561, 582, 577, 549, 520, 507, 505, 498, 490, 493, 511, 533, 541, 527, 495, 463, 454, 474, 510, 540, 558, 571, 584, 590, 586, 573, 555, 532, 515, 514, 529, 540, 531, 503, 473, 458, 458, 465, 477, 500, 534, 565, 566, 532, 487, 467, 484, 522, 554, 568, 568, 566, 576, 597, 616, 616, 599, 581, 576, 580, 584, 588, 599, 617, 626, 614, 577, 526, 477, 444, 434, 448, 474, 499, 516, 532, 550, 566, 569, 552, 520, 484, 455, 445, 458, 488, 514, 527, 532, 537, 539, 535, 536, 557, 594]
203E94K7%j7j4jPJ2J7J7Rkm%ONkj4j9j7j2j2j4j7j8j2JJ5J7KrnJ2K2J8Nj6l9m2k0J1J5qk3
198D75j3PJ4QNJ1J4RMNPJ3J6J2jrr%J1K4K9J5j5l6l6k4j7j3nLK%OJ3MqjK0K7Mk5k9rJ3K2K4
192E67K2J8J0lj6k0j0M%k3m6m3j9NJ1J2K0K9K5Lk0k4j1KOQJ6J7Oj3k0pPOpj5j1jORJ2J7J9
187E48J6%k1l8m0k4jJ4Qpj1OL2M8M5K9Oj4k3k3j9k3k8k5k0j9k5k1kK6N2O8O0L0nj7rlj1j1
182E48JJ5J0%LJ5K0J1oj8k3j0J0K1Rj0j2njkJ2L2L2Lk8l4j8%J1J1Jj5k1j7j0j2j3j2j1j4j4
177D59%J5K2K3J8J3NJJlj3j7qNROJnj4j8mJ7K9J7oj5LL5M6K1k0l7k4oj%J1K2J5jolnj6j9j5
171E38j5k1j7%J6J6J3K1K5J0j4k5j3RK5K7J8ROJ5K0J2mj3nPJ1Lnrrj1j3j0npj7k1oJ9L1J9
166F30nk5l1k6j6prj6j5JK0L1L2K7K0J0LKmk6n5o0l4KK0J6Lpj2j3j3j3j2oJ1L6N3N3L5Oj7
$$ y = [594, 621, 621, 604, 590, 589, 596, 608, 625, 642, 651, 649, 645, 645, 651, 656, 654, 640, 621, 604, 592, 580, 566, 549, 531, 519, 520, 535, 552, 554, 545, 540, 552, 574, 592, 597, 581, 542, 500, 480, 491, 506, 498, 475, 462, 469, 483, 491, 496, 507, 521, 530, 534, 539, 546, 559, 575, 587, 586, 577, 568, 568, 579, 603, 632, 647, 632, 596, 560, 536, 519, 506, 501, 504, 506, 506, 512, 525, 529, 521, 520, 540, 567, 571, 546, 517, 508, 521, 543, 567, 589, 607, 617, 614, 598, 578, 568, 572, 572, 549, 503, 460, 441, 446, 457, 469, 489, 518, 543, 546, 526, 502, 491, 493, 499, 507, 523, 540, 546, 533, 513, 506, 513, 519, 512, 497, 486, 485, 491, 500, 512, 529, 548, 564, 564, 543, 505, 465, 441, 440, 454, 462, 455, 444, 450, 482, 530, 575, 604, 610, 596, 573, 550, 531, 508, 480, 455, 435, 416, 391, 370, 368, 394, 446, 514, 574, 604, 599, 582, 573, 570, 559, 548, 549, 564, 574, 574, 577, 592, 612, 623, 617, 599, 576, 566, 576, 597, 606, 596, 584, 579, 578, 576, 588, 620, 652, 655, 627, 593, 575, 575, 586, 597, 598, 583, 562, 545, 535, 523, 510, 498, 487, 473, 459, 459, 474, 496, 519, 537, 550, 555, 556, 557, 554, 541, 524, 516, 521, 530, 536, 537, 532, 518, 500, 496, 513, 542, 559, 553, 538, 541, 576, 622, 643, 623, 586, 562, 556, 555, 555, 566, 588, 603, 602, 596, 593, 588, 572, 553, 538, 523, 502, 485, 485, 501, 517, 530, 551, 576, 586, 572, 547, 534, 543, 568, 595, 613, 622, 628, 643, 663, 675, 671, 658, 653, 660, 671, 674, 669, 660, 651, 640, 627, 617, 612, 605, 588, 567, 561, 580, 611, 630, 625, 600, 569, 543, 527, 520, 511, 495, 480, 481, 501, 532, 564, 591, 611, 621, 624, 626, 622, 596, 541, 481, 447, 449, 469, 485, 488, 481, 469, 456, 443, 430, 418, 412, 423, 459, 512, 565, 600, 606, 589]
161E89k4j0J4L6M0K8Qj0j6j9k3k8k5j2jjj0j4jK4L8K5mk6k0KJ7J4RQJj7l5l4j0J2J4JpJJ6
156E50K6K3J2lj2rRK3K2Jk7m0l1qJ0Pj0k2j3J1K3J0j5l3l3k4j7qOK3M1N2N7M4K2K%NNkj2q
151F57jLqk6l5l0j3%Loj6k0j5mMNOJ1J2PKJ0K4K4OrkRNqj6j4j7k3j5LJ0kj5j4kJ0K0K6J7n
145E58k1j4J6M3N0L2ml8m8l3j9k5l1j1K1L9L1J9Rnk0j7LJ2jj3%K3L3K2J6K2K3Pk0l5k8qPQ
141F03lq%QNqj4qpj1j0RK9K6pm1m4j5J6L1K6J8J2J2J4J7J1j2l7m3k6ook2l8l5j6QK2K3K1K0
135E14J7J1PJ9L0K3RQK4K6nl8m1j5J0K1K8L0J8lj6j6j5k0k4k2j8j1lJqk3k4qJ1J6J1NKMJ2
130E47J9K0J7J5J0ok1k3j4j0j0lLj1l7l9j1J6K0J4K0K5K0J6K7L4J8%OJ9Pk5l1pQpk8j9LQk
125E88okJnnLJ1J5J2J1J0OKklnoj2j9k3k2j5p%%mmKPNkJJ2J9J4jj6j7lJ8K7J9Lj2k6l9m0k4
$$ y = [589, 565, 555, 569, 605, 645, 673, 681, 671, 655, 636, 613, 585, 560, 548, 547, 546, 536, 522, 521, 545, 583, 608, 604, 578, 558, 560, 577, 591, 600, 608, 609, 592, 557, 523, 513, 525, 539, 540, 533, 534, 550, 576, 599, 611, 608, 596, 587, 596, 619, 641, 642, 615, 575, 544, 536, 546, 553, 543, 521, 508, 519, 542, 552, 537, 504, 471, 447, 430, 422, 428, 451, 492, 544, 601, 645, 667, 669, 669, 674, 679, 677, 665, 657, 656, 659, 651, 625, 590, 560, 547, 547, 550, 544, 528, 508, 493, 489, 493, 498, 504, 515, 527, 534, 536, 546, 570, 594, 600, 591, 589, 598, 603, 595, 579, 565, 548, 525, 510, 513, 523, 521, 506, 492, 490, 500, 520, 546, 563, 558, 537, 523, 539, 582, 632, 664, 660, 622, 574, 541, 522, 497, 466, 455, 476, 515, 546, 565, 574, 569, 549, 532, 535, 547, 546, 533, 533, 556, 589, 611, 627, 649, 672, 679, 659, 624, 596, 588, 595, 603, 600, 592, 592, 600, 605, 597, 583, 575, 568, 557, 547, 556, 585, 611, 604, 563, 519, 504, 520, 551, 577, 595, 607, 619, 633, 650, 661, 649, 612, 569, 543, 537, 531, 509, 471, 436, 420, 428, 450, 473, 494, 514, 531, 542, 549, 568, 598, 621, 630, 638, 662, 688, 683, 645, 604, 589, 599, 620, 648, 678, 696, 693, 677, 661, 646, 626, 602, 580, 562, 551, 548, 549, 541, 518, 494, 486, 497, 513, 524, 529, 531, 535, 547, 566, 586, 603, 618, 628, 622, 601, 578, 564, 554, 544, 541, 544, 533, 496, 457, 446, 462, 482, 496, 516, 541, 561, 577, 604, 638, 656, 656, 662, 681, 688, 663, 632, 625, 633, 626, 598, 579, 582, 590, 588, 582, 580, 581, 576, 571, 574, 585, 600, 612, 623, 633, 639, 641, 639, 636, 631, 625, 613, 594, 571, 549, 534, 527, 527, 527, 523, 519, 521, 528, 533, 531, 532, 544, 563, 577, 576, 560, 543, 540, 558, 585, 604, 607, 595, 569, 530, 490, 466]
120D66rj0j9rJ1K1J7J2J3J3J0J9K7J5j4k9j9nqj0MJ7RnmOMJJ1K2J4mJK3K7ml4l3j3lnlJ5L5
114E73M2K9Pj2j9k1l3m5m1k0KRPLLJ0K1K5J7LLJ5J7jj8j1PRmj0mJnj3j1j1j6k3j5%RLmJJ5
109D94K3K0J5J9K7K3Lk2l3k8j5mLJ0J5J6J3RNmj7k6k1oOP%ookNJ1J2J0J3K0K0Rpj6k1k5k4
103E25j2jlj0lJ4J5mk5k5j7j2j1lPJ0J0J5J7Rkqrj3j6rJ0K7K9K2K1K6K4Oj9l2k7j3pnMJ8J9
98E42Jk1k6j8oLJ3K1K3K1K3K4J4kj4j6j7j5qLJj0j9j6qrqRL4M3K0j8l5j9RK1J2NJ4K6K3%j9
93F01k7k3j7qKLjmjMkj2j5j1jMNQJ8L0L1J6mj5j4lJ0J4jk8m5l6rJ3K3L0L3K4Mj0o%mj3j4q
87E41jJPJ3K3L0L2K5Rpj6j7j4rmqj6k1j9k2l6m0j9J0J9Kj7j9mJ3K4K1Qn%J3Rk1m2k9PK8K7
82D76K4L5L4Rk1k2LK2J2j4l6m3l4qK5M6L7J1nlLkj2j5qOJ6J8Ppj5j0jJLJ0J6J3%rj3j5j7j5
$$ y = [466, 457, 447, 428, 419, 430, 451, 468, 480, 493, 506, 516, 535, 562, 577, 563, 534, 515, 510, 502, 492, 496, 513, 522, 517, 513, 519, 523, 524, 535, 557, 571, 567, 568, 591, 618, 614, 580, 547, 534, 531, 526, 523, 538, 573, 615, 644, 651, 639, 620, 599, 566, 521, 480, 460, 462, 471, 478, 481, 484, 494, 515, 540, 557, 560, 563, 578, 595, 594, 576, 565, 572, 581, 577, 567, 563, 564, 559, 546, 535, 524, 508, 485, 470, 470, 479, 482, 478, 479, 494, 517, 537, 552, 571, 598, 621, 624, 602, 569, 541, 526, 522, 525, 535, 550, 566, 579, 588, 593, 589, 572, 546, 525, 519, 525, 532, 532, 526, 520, 518, 523, 534, 546, 556, 569, 589, 609, 618, 611, 595, 574, 549, 525, 513, 512, 509, 499, 496, 510, 525, 521, 496, 471, 454, 442, 431, 428, 435, 445, 455, 470, 487, 496, 494, 486, 477, 464, 448, 439, 449, 476, 505, 527, 548, 574, 598, 604, 585, 553, 526, 513, 506, 501, 505, 523, 542, 543, 522, 496, 478, 472, 475, 488, 509, 532, 553, 576, 600, 614, 612, 598, 582, 565, 550, 542, 545, 546, 536, 517, 501, 493, 484, 476, 485, 519, 562, 582, 564, 529, 510, 519, 540, 552, 557, 571, 597, 620, 620, 601, 574, 551, 534, 526, 528, 531, 530, 526, 525, 529, 527, 515, 500, 489, 488, 492, 497, 505, 523, 553, 584, 600, 596, 581, 567, 564, 574, 588, 587, 559, 514, 478, 469, 482, 505, 535, 568, 592, 596, 586, 580, 580, 576, 563, 549, 541, 540, 541, 548, 561, 584, 614, 646, 671, 680, 673, 657, 640, 626, 617, 613, 605, 589, 568, 549, 527, 491, 451, 432, 442, 461, 463, 446, 427, 423, 436, 460, 481, 489, 484, 484, 497, 506, 485, 443, 414, 421, 449, 476, 500, 535, 569, 578, 557, 535, 538, 560, 572, 558, 522, 479, 445, 437, 462, 508, 545, 556, 551, 548, 551, 549, 537, 522, 514, 520, 536, 554, 561, 554, 539, 529, 528, 529, 532, 542, 558, 571, 571, 562, 549, 534, 517, 502]
77E02ropj0j2j4j3nLJ1J9L0L7K6%k4k9j3PJ9J5kk0k1qJkplJ0J2NmqrojOJ4J8J5kk4l6k6pK
71D24LJ1K8L8L1J6J0J3Rkj7l0m1m5l5qK3M7N6N1L3J3MOJ2J2KnmOPqk8l8l4k5j5KK0K6J3qj4
66E59kJ8L4M2L4Qk7n1n3l9k3j6j9k5j8PL6M7L0Ppj3k2k2j0RJ6J3J2J0%j3j6j3j5j4QM5O0K9
61F06j8m1l0oJ0K2L0L0J7%j4k0k9m2n0l8qK0L1L1L4L9L2J3OJ1J1ok1j5%Jj4k4j5lQJ4K1K2
56F15J8J5J2Mmqrj2j5j3rj1nJ3K7J7klJ7K4Nj0lQjj7rK3N1O0N0K3j5m1l9k2j9l1l7k7qQJ6
51F36Qj7m4m8k7pj%OJ2RMQJ4J6J7K2K9K5J5Kqj2qjKjnl%lqj6k0k5k3j8j4j4j3pOJ6K2K4K4
45E74K3K2J8Lj6k6k3j8k1k4j7lRJ3J7J7Pmj0pqj2qJ1K2J8kj7k5k7j3J2L4L3J4k%M%j3j6nP
40E41Olprj5k7m0l7k2LK2K4Kk6l7j8J2K3QojJ7K2J2knkKMQJ0RRJ7K2J1rj4%J8K0OmjJ0J7J6
$$ y = [502, 493, 487, 480, 470, 458, 444, 431, 426, 429, 440, 459, 489, 526, 552, 552, 528, 499, 486, 493, 512, 527, 525, 505, 484, 476, 477, 475, 468, 465, 475, 487, 492, 488, 480, 471, 465, 464, 470, 484, 502, 517, 515, 491, 455, 429, 422, 424, 427, 438, 466, 504, 535, 551, 561, 574, 583, 581, 564, 534, 493, 448, 413, 405, 428, 475, 531, 582, 615, 628, 632, 638, 650, 662, 664, 659, 655, 661, 668, 660, 632, 594, 560, 535, 520, 522, 542, 568, 581, 573, 559, 557, 575, 609, 651, 685, 693, 666, 615, 562, 523, 500, 484, 465, 440, 422, 429, 465, 512, 542, 549, 542, 529, 507, 485, 475, 484, 500, 513, 525, 535, 535, 522, 506, 493, 478, 464, 472, 517, 577, 606, 588, 547, 517, 511, 521, 543, 573, 603, 620, 620, 606, 586, 557, 515, 465, 427, 419, 439, 470, 501, 535, 574, 606, 619, 625, 636, 647, 641, 620, 605, 605, 606, 592, 568, 553, 550, 558, 572, 593, 615, 633, 648, 660, 664, 660, 652, 643, 631, 616, 603, 594, 583, 578, 591, 618, 635, 633, 630, 647, 671, 676, 666, 663, 671, 670, 653, 644, 667, 718, 778, 828, 851, 836, 795, 756, 734, 715, 684, 647, 620, 612, 620, 636, 644, 627, 583, 535, 508, 501, 500, 500, 506, 518, 527, 531, 539, 553, 569, 586, 608, 637, 662, 677, 679, 671, 659, 651, 650, 652, 651, 646, 643, 643, 640, 632, 616, 596, 571, 548, 530, 516, 502, 489, 482, 488, 504, 526, 550, 574, 597, 619, 637, 640, 624, 598, 575, 557, 536, 512, 495, 492, 501, 514, 531, 548, 555, 551, 541, 534, 526, 514, 506, 517, 539, 557, 555, 538, 513, 486, 473, 485, 519, 552, 566, 564, 564, 568, 568, 555, 539, 534, 541, 547, 544, 537, 528, 513, 486, 446, 409, 387, 390, 412, 436, 438, 412, 375, 357, 369, 392, 400, 394, 393, 410, 432, 444, 442, 437, 435, 437, 441, 449, 459, 468, 477, 494, 516, 527, 518, 504, 504, 522, 542, 548, 544, 543, 553, 570, 586]
34E86J2QMKKknljmj3k2k3j9j2mjmj1qjkj7l4l9l0j6lJ6L8M8M2K4NnoJPOK%LLJJRK1K9K8J5
$$ y = [586, 598, 606, 610, 612, 614, 612, 607, 604, 603, 599, 586, 564, 541, 522, 510, 506, 505, 501, 490, 482, 481, 479, 462, 428, 389, 359, 343, 340, 356, 394, 442, 484, 508, 513, 508, 502, 503, 510, 516, 518, 518, 521, 524, 525, 526, 535, 556, 585, 613, 628]
$$ [...]
-1604G57
##END=	
##END=	
