##TITLE=	Nov16-2021.50.fid
TM-VI-167

##JCAMP-DX=	6.0	$$ MestReNova 14.3.1-31739
##DATA TYPE=	LINK
##BLOCK_ID=	1
##BLOCKS=	2    
##ORIGIN=	Mestrelab Research S.L.
##OWNER=	hrzepa
##$MNOVA/LINK_BLOCK_TYPE=	ITEM	$$ NMR Spectrum
##$MNOVA/ITEM/POLYGON=	(XY..XY)
5321,5835
8722,5835
8722,8208
5321,8208
5321,5835
##$MNOVA/ITEM/Z=	0
##$MNOVA/ITEM/ANGLE=	0
##TITLE=	Nov16-2021.50.fid
##JCAMP-DX=	6.0	$$ MestReNova 14.3.1-31739
##BLOCK_ID=	2
##DATA TYPE=	MNOVA NMR VIEW DATA
##DATA CLASS=	MNOVA VIEW DATA
##$MNOVA/ITEM/ZOOM/X=	-4.005464102252559222,	16.005770000004368114
##$MNOVA/ITEM/ZOOM/Y=	-814.15601634979248047,	9024.76202392578125
##END=	
##TITLE=	Nov16-2021.50.fid
##JCAMP-DX=	6.0	$$ MestReNova 14.3.1-31739
##BLOCK_ID=	3
##DATA TYPE=	NMR SPECTRUM
##DATA CLASS=	XYDATA
##NUMDIM=	1
##ORIGIN=	Bruker BioSpin GmbH
##OWNER=	nmr
##.OBSERVE FREQUENCY=	400.4124024600000098
##.OBSERVE NUCLEUS=	^1H
##.SOLVENT NAME=	CDCl3
##.PULSE SEQUENCE=	zg30
##LONGDATE=	2021/11/16 16:20:00.000
##.ACQUISITIONMODE=	SIMULTANEOUS (DQD)
##$ORIGINAL FORMAT=	Bruker XWIN-NMR
##$MNOVA/SCALES_VERSION=	9
##$PARAMETER FILE=	(acqus, ASCII, /private/var/folders/f6/rjf_tdyn2v98c5c0wvkgn4s80000gn/T/agW6E2evRdGDlKOaws$$6w/50/acqus, 0)
$$ ##TITLE= Parameter file, TOPSPIN		Version 3.2
$$ ##JCAMPDX= 5.0
$$ ##DATATYPE= Parameter Values
$$ ##NPOINTS= 11	$$ modification sequence number
$$ ##ORIGIN= Bruker BioSpin GmbH
$$ ##OWNER= nmr
$$ $$ 2021-11-16 16:20:34.096 +0000  nmr@CZC10666PP
$$ $$ /opt/topspin/data/agmb/nmr/Nov16-2021/50/acqus
$$ $$ process /opt/topspin3.2/prog/mod/shimcntl
$$ ##$ACQT0= -2.36344537815126
$$ ##$AMP= (0..31)
$$ 100 100 100 100 100 100 100 100 100 100 100 100 100 100 100 100 100 100
$$ 100 100 100 100 100 100 100 100 100 100 100 100 100 100
$$ ##$AMPCOIL= (0..19)
$$ 0 0 0 0 0 0 0 0 0 0 0 0 0 0 0 0 0 0 0 0
$$ ##$ANAVPT= -1
$$ ##$AQSEQ= 0
$$ ##$AQ_mod= 3
$$ ##$AUNM= <au_zg>
$$ ##$AUTOPOS= <53 >
$$ ##$BF1= 400.41
$$ ##$BF2= 400.41
$$ ##$BF3= 400.41
$$ ##$BF4= 400.41
$$ ##$BF5= 400.41
$$ ##$BF6= 400.41
$$ ##$BF7= 400.41
$$ ##$BF8= 400.41
$$ ##$BYTORDA= 0
$$ ##$CAGPARS= (0..11)
$$ 0 0 0 0 0 0 0 0 0 0 0 0
$$ ##$CFDGTYP= 0
$$ ##$CFRGTYP= 9
$$ ##$CHEMSTR= <none>
$$ ##$CNST= (0..63)
$$ 1 1 145 1 1 1 1 1 1 1 1 1 1 1 1 1 1 1 1 1 1 1 1 1 1 1 1 1 1 1 1 1 1 1 1
$$ 1 1 1 1 1 1 1 1 1 1 1 1 1 1 1 1 1 1 1 1 1 1 1 1 1 1 1 1 1
$$ ##$CPDPRG= (0..8)
$$ <> <> <> <> <mlev> <mlev> <mlev> <mlev> <mlev>
$$ ##$D= (0..63)
$$ 0 1 0 0 0 0 0 0 0 0.06 0 0 0 0 0 0 0.0002 0 0 0 0 0 0 0 0 0 0 0 0 0 0 0
$$ 0 0 0 0 0 0 0 0 0 0 0 0 0 0 0 0 0 0 0 0 0 0 0 0 0 0 0 0 0 0 0 0
$$ ##$DATE= 1637079633
$$ ##$DE= 6.5
$$ ##$DECBNUC= <off>
$$ ##$DECIM= 2496
$$ ##$DECNUC= <off>
$$ ##$DECSTAT= 4
$$ ##$DIGMOD= 1
$$ ##$DIGTYP= 12
$$ ##$DQDMODE= 0
$$ ##$DR= 22
$$ ##$DS= 2
$$ ##$DSPFIRM= 0
$$ ##$DSPFVS= 20
$$ ##$DTYPA= 0
$$ ##$EXP= <proton>
$$ ##$F1LIST= <111111111111111>
$$ ##$F2LIST= <222222222222222>
$$ ##$F3LIST= <333333333333333>
$$ ##$FCUCHAN= (0..9)
$$ 0 2 0 0 0 0 0 0 0 0
$$ ##$FL1= 90
$$ ##$FL2= 90
$$ ##$FL3= 90
$$ ##$FL4= 90
$$ [...]
$$ 90 74 58 42 26 10 0 0
$$ ##$Sgu3PowerLevels= (0..7)
$$ 0 0 0 0 0 0 0 0
$$ ##$Sgu4PowerLevels= (0..7)
$$ 0 0 0 0 0 0 0 0
$$ ##$Sgu5PowerLevels= (0..7)
$$ 0 0 0 0 0 0 0 0
$$ ##$Sgu6PowerLevels= (0..7)
$$ 0 0 0 0 0 0 0 0
$$ ##$Sgu7PowerLevels= (0..7)
$$ 0 0 0 0 0 0 0 0
$$ ##$Sgu8PowerLevels= (0..7)
$$ 0 0 0 0 0 0 0 0
$$ ##$SguType= 3
$$ ##$ShimPowMaxUA= (0..63)
$$ 130000 130000 130000 130000 130000 130000 130000 130000 130000 130000 130000
$$ 130000 130000 130000 130000 130000 130000 130000 130000 130000 0 0 0 0
$$ 0 0 0 0 0 0 0 0 0 0 0 0 0 0 0 0 0 0 0 0 0 0 0 0 0 0 0 0 0 0 0 0 0 0 0 0
$$ 0 0 0 0
$$ ##$ShimPowMaxUC= (0..63)
$$ 130000 130000 130000 130000 130000 130000 130000 130000 130000 130000 130000
$$ 130000 130000 130000 130000 130000 130000 130000 130000 130000 0 0 0 0
$$ 0 0 0 0 0 0 0 0 0 0 0 0 0 0 0 0 0 0 0 0 0 0 0 0 0 0 0 0 0 0 0 0 0 0 0 0
$$ 0 0 0 0
$$ ##$ShimPowMaxUG= (0..63)
$$ 524287 524287 524287 524287 524287 524287 524287 524287 524287 524287 524287
$$ 524287 524287 524287 524287 524287 524287 524287 524287 524287 0 0 0 0
$$ 0 0 0 0 0 0 0 0 0 0 0 0 0 0 0 0 0 0 0 0 0 0 0 0 0 0 0 0 0 0 0 0 0 0 0 0
$$ 0 0 0 0
$$ ##$ShimPowRcbType= 3
$$ ##$ShimPowRes= (0..63)
$$ 1e-20 1e-20 1e-20 1e-20 1e-20 1e-20 1e-20 1e-20 1e-20 1e-20 1e-20 1e-20
$$ 1e-20 1e-20 1e-20 1e-20 1e-20 1e-20 1e-20 1e-20 0 0 0 0 0 0 0 0 0 0 0 0
$$ 0 0 0 0 0 0 0 0 0 0 0 0 0 0 0 0 0 0 0 0 0 0 0 0 0 0 0 0 0 0 0 0
$$ ##$ShimPowRng0= (0..63)
$$ 1 1 1 1 1 1 1 1 1 1 1 1 1 1 1 1 1 1 1 1 0 0 0 0 0 0 0 0 0 0 0 0 0 0 0 0
$$ 0 0 0 0 0 0 0 0 0 0 0 0 0 0 0 0 0 0 0 0 0 0 0 0 0 0 0 0
$$ ##$ShimPowRng1= (0..63)
$$ 1 1 1 1 1 1 1 1 1 1 1 1 1 1 1 1 1 1 1 1 0 0 0 0 0 0 0 0 0 0 0 0 0 0 0 0
$$ 0 0 0 0 0 0 0 0 0 0 0 0 0 0 0 0 0 0 0 0 0 0 0 0 0 0 0 0
$$ ##$ShimPowRng2= (0..63)
$$ 1 1 1 1 1 1 1 1 1 1 1 1 1 1 1 1 1 1 1 1 0 0 0 0 0 0 0 0 0 0 0 0 0 0 0 0
$$ 0 0 0 0 0 0 0 0 0 0 0 0 0 0 0 0 0 0 0 0 0 0 0 0 0 0 0 0
$$ ##$ShimPowRng3= (0..63)
$$ 1 1 1 1 1 1 1 1 1 1 1 1 1 1 1 1 1 1 1 1 0 0 0 0 0 0 0 0 0 0 0 0 0 0 0 0
$$ 0 0 0 0 0 0 0 0 0 0 0 0 0 0 0 0 0 0 0 0 0 0 0 0 0 0 0 0
$$ ##$ShimSysFunc= (0..63)
$$ 1 2 3 4 5 7 9 11 15 16 8 10 12 14 6 17 13 18 19 20 0 0 0 0 0 0 0 0 0 0
$$ 0 0 0 0 0 0 0 0 0 0 0 0 0 0 0 0 0 0 0 0 0 0 0 0 0 0 0 0 0 0 0 0 0 0
$$ ##$ShimSysMatrix= 0
$$ ##$ShimSysType= 1
$$ ##$TFXNUM= 0
$$ ##$TRIPLO2= 0
$$ ##$VTU= 2
$$ ##$VTUETH= <149.236.99.20>
$$ ##$VTUTY= <no>
$$ ##$WBREFAM= (0..15)
$$ 135 116 100 100 100 100 100 100 100 100 100 100 100 100 100 100
$$ ##$WBREFLM= (0..15)
$$ 0 0 0 0 0 0 0 0 0 0 0 0 0 0 0 0
$$ ##$WBREFPH= (0..15)
$$ 71.66 -68.25 0 0 0 0 0 0 0 0 0 0 0 0 0 0
$$ ##$WBSGU= (0..15)
$$ 0 0 0 0 0 0 0 0 0 0 0 0 0 0 0 0
$$ ##$XFAC= 2
$$ ##END=
$$ 
##$DECIM=	2496
##$DSPFVS=	20
##XUNITS=	HZ
##YUNITS=	ARBITRARY UNITS
##FIRSTX=	6408.8703656999996383
##LASTX=	-1603.8278811825093726
##DELTAX=	-0.12226593800080123864
##XFACTOR=	1
##YFACTOR=	0.014640280960084871287
##FIRSTY=	10.784175872802734375
##MINY=	6.2769060134887695313
##MAXY=	8204.3291015625
##NPOINTS=	65536
##XYDATA=	(X++(Y..Y))
$$ [...]
2801B827J1K1J5L%J2J8J0qj9rJ6M1M6L1RjJMM%%OROKklkKJ7L6M7M0K8K1K6L3L4L5L7L6K5J0
$$ 2827 2838 2859 2874 2877 2877 2889 2907 2917 2909 2890 2881 2897 2938 2984 3015 3024 3023 3024 3028 3032 3032 3032 3038 3047 3053 3055 3053 3050 3048 3050 3067 3103 3150 3190 3218 3239 3265 3298 3332 3367 3404 3440 3465 3475
2796C475JjjmopqrpjQK1K8K4Pqj2kOQRK1L9N0N0M0L0K5K8L9M7M5L2J7PKPJ7K5K3J3PRJ4J5
$$ 3475 3476 3475 3474 3470 3464 3457 3449 3440 3433 3432 3440 3461 3489 3513 3520 3512 3500 3498 3504 3512 3521 3542 3581 3631 3681 3721 3751 3776 3804 3843 3890 3935 3967 3984 3991 3993 4000 4017 4042 4065 4078 4085 4094 4108 4123
2791D123J3J1PJ0J9L1L5L1L2M3M8L8J5LJ0K9M4M5L0OoNK8L4K1J3K5M1L8K9L7O7Q7P3M1K1K4
$$ 4123 4136 4147 4154 4164 4183 4214 4249 4280 4312 4355 4403 4441 4456 4459 4469 4498 4542 4587 4617 4623 4617 4622 4650 4684 4705 4718 4743 4784 4822 4851 4888 4955 5042 5115 5156 5177 5201
2786E201L6L4J7jkRK4L2M0N6P0P1O1N0M5L8K5J7K4M1N7O3O3O1O0O3P0P6P8Q2Q4P4N1L3M2P0
$$ 5201 5237 5271 5288 5287 5285 5294 5318 5350 5390 5446 5516 5587 5648 5698 5743 5781 5806 5823 5847 5888 5945 6008 6071 6132 6192 6255 6325 6401 6479 6561 6645 6719 6770 6803 6845 6915
2782F915Q6Q3P5Q1R3J00J03J10J26J40J37J22J10J18J41J56J50J34J34J57J83J93J99K19K51
$$ 6915 7001 7084 7159 7240 7333 7433 7536 7646 7772 7912 8049 8171 8281 8399 8540 8696 8846 8980 9114 9271 9454 9647 9846 10065 10316
2779A0316K83L04L19L38L60L81M01M22M46M78N20N69O21O68P08P44P81Q25Q86R51J011J064
$$ 10316 10599 10903 11222 11560 11920 12301 12702 13124 13570 14048 14568 15137 15758 16426 17134 17878 18659 19484 20370 21321 22332 23396
2776B3396J129J209J281J324J342J363J391J405J377J314J250J220J244J323J453J632J868
$$ 23396 24525 25734 27015 28339 29681 31044 32435 33840 35217 36531 37781 39001 40245 41568 43021 44653 46521
2774D6521K173K551K992L484M027M621N245N859O422O915P301P504P422O945N996M559K712
$$ 46521 48694 51245 54237 57721 61748 66369 71614 77473 83895 90810 98111 105615 113037 119982 125978 130537 133249
2772A33249O35j426l227m617n547o057o218o096n751n249m675m103l584l153k841k655k567
$$ 133249 133884 132458 129231 124614 119067 113010 106792 100696 94945 89696 85021 80918 77334 74181 71340 68685 66118
2770F6118k532k514k496k464k402k303k161j981j766j537j310j097q91o89m98l20j57qJ28
$$ 66118 63586 61072 58576 56112 53710 51407 49246 47265 45499 43962 42652 41555 40664 39975 39477 39157 39000 38992 39120
2767C9120K56L86N29O86Q56J038J223J398J574J772J988K185K323K408K469K519K543K528
$$ 39120 39376 39762 40291 40977 41833 42871 44094 45492 47066 48838 50826 53011 55334 57742 60211 62730 65273 67801
2765F7801K494K476K514K633K842L134L483L852M200M475M628M601M323L732K789J501r1j883
$$ 67801 70295 72771 75285 77918 80760 83894 87377 91229 95429 99904 104532 109133 113456 117188 119977 121478 121387 119504
2763A19504l702n316o525p248p522p443p103o583n946n258m572l933l367k874k452k100j823
$$ 119504 115802 110486 103961 96713 89191 81748 74645 68062 62116 56858 52286 48353 44986 42112 39660 37560 35737
2761C5737j605j423j269j154j084j057j060j085j112j127j127j126j120j084j012r31q72q25
$$ 35737 34132 32709 31440 30286 29202 28145 27085 26000 24888 23761 22634 21508 20388 19304 18292 17361 16489 15664
2759A5664p65o80n96n33m83m37l97l67l42l07k60k16j87j73j63j49j31j24j36j62j81j72j35
$$ 15664 14899 14219 13623 13090 12607 12170 11773 11406 11064 10757 10497 10281 10094 9921 9758 9609 9478 9354 9218 9056 8875 8703 8568
2756H568q7n7n7o8o6m4j7QL3N9Q2R5J03J08R8O9L7K2K0Ml6r4j44j75j92k05k21k32k31k20
$$ 8568 8481 8424 8367 8299 8233 8189 8172 8180 8213 8272 8354 8449 8552 8660 8758 8827 8864 8886 8906 8910 8874 8780 8636 8461 8269 8064 7843 7611 7380 7160
2752G160k14k14k08j82j51j34j31j25j09r2q0p0o1n8n9n3l8l2m4n3m5l4l7n0n5m6l7l1k5j4
$$ 7160 6946 6732 6524 6342 6191 6057 5926 5801 5692 5600 5520 5450 5389 5331 5272 5219 5181 5149 5105 5052 5007 4973 4936 4886 4831 4785 4748 4717 4692 4678
2748D678plKNLkkMJj3k4k4j7j4j2oKkj1rOJ7J2knMJ5J6Ppj7k1k0j4j0j0j0j2j8l0l5k8pJ2
$$ 4678 4671 4668 4670 4675 4678 4676 4674 4678 4679 4666 4642 4618 4601 4587 4575 4569 4571 4569 4558 4549 4555 4572 4584 4582 4577 4581 4596 4612 4619 4612 4595 4574 4554 4540 4530 4520 4510 4498 4480 4450 4415 4387 4380 4392
2743D392K5J9%k6m7n5n2m7l3j0P%k3l6k2j%j8l6l2qJ7K8K4Rrk1k8l1l1k3pQLk1m8n2l7k4j9
$$ 4392 4417 4436 4436 4410 4363 4308 4256 4209 4176 4166 4173 4173 4150 4114 4092 4091 4091 4073 4037 4005 3997 4014 4042 4066 4075 4066 4045 4017 3986 3955 3932 3925 3933 3936 3915 3867 3815 3778 3754 3735
2738C735j2MJ4Mj4j3LQrl2m0l2k1j1nnj1j3nMQMkj4k7l3k5j8k2l1l5k8j9mJ5K8K4J3POjj1
$$ 3735 3723 3727 3741 3745 3731 3718 3721 3729 3720 3688 3648 3616 3595 3584 3579 3574 3563 3550 3545 3549 3557 3561 3559 3545 3518 3485 3460 3442 3420 3389 3354 3326 3307 3303 3318 3346 3370 3383 3390 3396 3395 3384
2733C384pJ6L6L2J2j7m3n6m3j4OMqj4j3j4j4nRJ4Opj8l0l0j7MRpk9l8l0j2KQLqj9k0j0PQj5
$$ 3384 3377 3393 3429 3461 3473 3456 3413 3357 3314 3300 3306 3310 3302 3288 3275 3261 3247 3242 3251 3265 3271 3264 3246 3216 3186 3169 3173 3182 3175 3146 3108 3078 3066 3068 3076 3079 3071 3052 3032 3022 3029 3037 3022
2728C022n0o2l8lJ7J9K2K6J9Kj1j3j2j3j4mQJ2Mj5l1l5k4j3j0j3j1%QJj3k2j9nMJj5l6m9m7
$$ 3022 2972 2910 2872 2869 2886 2905 2927 2953 2972 2974 2963 2950 2938 2925 2911 2907 2915 2927 2931 2916 2885 2850 2826 2813 2803 2790 2779 2779 2787 2788 2775 2753 2734 2729 2733 2734 2719 2683 2634 2587
2723B587l4j4PJ9J0j4l2l6l0k5j9j0k%jkqj7j7qmj2j9j4lnj8k5k2j8j5mJ5K5J3knMOj0l2m0
$$ 2587 2553 2539 2546 2565 2575 2561 2529 2493 2463 2438 2419 2409 2407 2407 2406 2404 2396 2379 2362 2354 2350 2338 2319 2305 2302 2297 2279 2254 2232 2214 2199 2195 2210 2235 2248 2246 2241 2245 2251 2241 2209 2169
2718B169k4QK8K0mk2k1qlqj7k2j7mJ6K9K7J3pk5k7rJ8L1K1PMO%j2k0j8j6j3plj0k6l4k9j4
$$ 2169 2145 2153 2181 2201 2197 2175 2154 2146 2143 2135 2118 2096 2079 2075 2091 2120 2147 2160 2153 2128 2101 2092 2110 2141 2162 2169 2173 2179 2179 2167 2147 2129 2113 2100 2093 2090 2080 2054 2020 1991 1977
2713A977NK0K7J7ok1j0J5K5Rj4k4j3j%%NJ7J9J0NJ5L0L1K0PLlrnOJ4Rjnqk0l2k9j4kJkmj0
$$ 1977 1982 2002 2029 2046 2040 2019 2009 2024 2049 2058 2044 2020 2007 2006 2006 2006 2011 2028 2047 2057 2062 2077 2107 2138 2158 2165 2168 2165 2156 2151 2157 2171 2180 2179 2174 2166 2146 2114 2085 2071 2069 2070 2068 2064 2054
2707B054j7j4OK8L0Ok6m1l5k3k4l8m7l3lK2K9K2J0PRRJj0j8j7j3j5j3KJ9K2Lj0lJ8K9K1J0
$$ 2054 2037 2023 2029 2057 2087 2093 2067 2026 1991 1968 1944 1906 1859 1826 1823 1845 1874 1896 1906 1913 1922 1931 1932 1922 1904 1887 1874 1859 1846 1848 1867 1889 1892 1882 1879 1897 1926 1947 1957
2703A957J1J2Jk2l4k6nJ3K5L2L3K1mk7l3k9j9j5j4j2pJNlk0l0k1jJ0J1RQMmqKJ9L3L3J3k0
$$ 1957 1968 1980 1981 1959 1925 1899 1894 1907 1932 1964 1997 2018 2014 1987 1954 1925 1906 1891 1877 1865 1858 1859 1864 1861 1841 1811 1790 1789 1799 1810 1819 1827 1831 1827 1819 1821 1840 1873 1906 1919 1899
2697A899m1l8j6KNJmppLK1K7J8QQQok8l5k4j0MK0L6L9K5Q%lprlJ3L4M7M0J5rj3NK5L3L0K1
$$ 1899 1858 1820 1804 1806 1811 1812 1808 1801 1794 1797 1818 1845 1863 1871 1879 1887 1881 1853 1818 1794 1784 1788 1808 1844 1883 1908 1916 1916 1913 1906 1897 1894 1907 1941 1988 2028 2043 2034 2021 2026 2051 2084 2114 2135
2692B135Qqk3k8k0nJ2K3K2Rj2l4m8l9JM9P0N3J7j2k5k7k7k7k9k9k1j1rpJJ1Mk0l6k3LJ1kj8
$$ 2135 2143 2135 2112 2084 2064 2059 2071 2094 2116 2125 2113 2079 2031 1992 1993 2042 2112 2165 2182 2170 2145 2118 2091 2064 2035 2006 1985 1974 1965 1958 1959 1970 1974 1954 1918 1895 1898 1909 1907 1889
2687A889j6mJ1K1J5lk2k3oJ3K3K7K5J5J%J1K4K5J8J6K4L3L3K0MkPJ3Pj0k2j8j0oj2k1k4j5
$$ 1889 1873 1869 1880 1901 1916 1913 1891 1868 1862 1875 1898 1925 1950 1965 1966 1966 1977 2001 2026 2044 2060 2084 2117 2150 2170 2174 2172 2179 2192 2199 2189 2167 2149 2139 2133 2121 2100 2076 2061
2682B061MJ8J6Jj1j2lJ2K3J8Jj5j5qrk4l3k9k1k1k8l5l7k9rPNj5l0k3mPJ1J4K3K6K1J5J3K0
$$ 2061 2065 2083 2099 2100 2089 2077 2074 2086 2109 2127 2128 2113 2098 2090 2081 2057 2024 1995 1974 1953 1925 1890 1853 1824 1815 1822 1827 1812 1782 1759 1755 1762 1773 1787 1810 1836 1857 1872 1885 1905
2678A905K6K2Mj8k0j1j2l4n0l9j2%j0j9j0PJ5Orj9j3LJ2Lj0j1%JqpNRpk8k6mK0K7J8ml3m9
$$ 1905 1931 1953 1957 1939 1919 1908 1896 1862 1812 1773 1761 1761 1751 1732 1722 1729 1744 1750 1741 1722 1709 1712 1724 1727 1717 1706 1706 1707 1699 1692 1697 1706 1699 1671 1645 1641 1661 1688 1706 1702 1669 1620
2672A620m2j9LJ6K4L0K8K3K5L2L0J1j5k9k3kK1L0K2NjJ0K3K4J3Mjjoj2j5j3j2qjPOmj2oOR
$$ 1620 1578 1559 1562 1578 1602 1632 1660 1683 1708 1740 1770 1781 1766 1737 1714 1712 1733 1763 1785 1790 1789 1799 1822 1846 1859 1863 1862 1861 1855 1843 1828 1815 1803 1795 1794 1801 1807 1803 1791 1785 1791 1800
2667A800kj5j3mjqj0LK0K1Jk2k9k1j1j1j4j3q%J2L0M7N1M1K7J3%j2j6nJ6K9L0K5K0J8Oj3l1
$$ 1800 1798 1783 1770 1766 1765 1757 1747 1750 1770 1791 1792 1770 1741 1720 1709 1698 1684 1671 1663 1663 1675 1705 1752 1803 1844 1871 1884 1884 1872 1856 1851 1867 1896 1926 1951 1971 1989 1995 1982 1951
2662A951l3j8NJ6J4Nrk6m3m9l4jK7M3M5L8J9nk1k5k1j7j6j3j1j2qJQMrqRK9L1J8%nKJ9L0K3
$$ 1951 1918 1900 1905 1921 1935 1940 1931 1905 1862 1813 1779 1778 1805 1848 1893 1931 1950 1945 1924 1899 1878 1861 1845 1832 1821 1809 1801 1802 1810 1814 1805 1797 1806 1835 1866 1884 1884 1879 1881 1900 1930 1953
2657A953%j9j9mJ3K5L3K9J1rk0j8j9j7mK0L4K3kk1l1m1m3k9kJ9K7K6K3J3KjLLmoPL0M4N1M9
$$ 1953 1953 1934 1915 1911 1924 1949 1982 2011 2022 2013 1993 1975 1956 1939 1935 1955 1989 2012 2010 1989 1958 1917 1874 1845 1843 1862 1889 1915 1938 1951 1953 1952 1955 1958 1954 1948 1955 1985 2029 2080 2129
2652B129L7J8lj6k6m0n1m4k4pLNMNJ1K1K2J4OOJ0MprkNKnj2j9k3j9oKJJQJ9K5K6K2J7Nrk0
$$ 2129 2166 2184 2181 2165 2139 2099 2048 2004 1980 1973 1976 1981 1985 1990 2001 2022 2044 2058 2064 2070 2080 2084 2077 2068 2066 2071 2073 2068 2056 2037 2014 1995 1989 1991 1992 1993 2001 2020 2045 2071 2093 2110 2115 2106 2086
2647B086k3j7jJ5J7NmOJ9J3j6l8l0%K0J7LmJNLlnkOQQORJ5J0ok5k6oJ5J5JjJ4K2Rj5k3j0J0
$$ 2086 2063 2046 2045 2060 2077 2082 2078 2084 2103 2116 2100 2062 2032 2032 2052 2069 2072 2068 2069 2074 2077 2074 2069 2067 2073 2081 2089 2095 2104 2119 2129 2123 2098 2072 2066 2081 2096 2097 2096 2110 2132 2141 2126 2103 2093 2103
2641B103J9J2nj2%K1K7Rj0nJ7K6J0pkJ2J6jk3l8m0k7kK4L8L7K5Qj1k6k8j1J6L9M2K8Rjqk1
$$ 2103 2122 2134 2129 2117 2117 2138 2165 2174 2164 2159 2176 2202 2212 2205 2203 2215 2231 2230 2207 2169 2129 2102 2100 2124 2162 2199 2224 2232 2221 2195 2167 2156 2172 2211 2253 2281 2290 2289 2281 2260
2636B260l6l0%L1L3J4LNPpj4KK7L5K0lj7k0j2NK4K9K1J4J1RMkknqr%Pkj5j4kMoj8k0j5j3q
$$ 2260 2224 2194 2194 2225 2258 2272 2275 2280 2287 2280 2266 2268 2295 2330 2350 2347 2330 2310 2298 2303 2327 2356 2377 2391 2402 2411 2415 2413 2411 2406 2398 2389 2389 2396 2394 2379 2365 2363 2367 2361 2343 2323 2308 2295 2287
2631B287%Kmj0MK2K7J5OQLj3k4j2OJ6J7J6J4PMK2M7N2L2J8K8M6M3J6j0j9j4okJMRPnk2l3k9
$$ 2287 2287 2289 2285 2275 2279 2301 2328 2343 2349 2357 2360 2347 2323 2311 2317 2333 2350 2366 2380 2387 2391 2413 2460 2512 2544 2562 2590 2636 2679 2695 2685 2666 2652 2646 2644 2645 2649 2658 2665 2660 2638 2605 2576
2625B576k2k1k1j1JMlj4k6l5l1lK9M0K8J4J6J8Mj4j2OK0J7Mj0k7m0l9j9OK0K3K6L1L5L0J4
$$ 2576 2554 2533 2512 2501 2502 2506 2503 2489 2463 2428 2397 2394 2423 2463 2491 2505 2521 2539 2543 2529 2517 2523 2543 2560 2564 2554 2527 2487 2448 2429 2435 2455 2478 2504 2535 2570 2600 2614
2621B614nj6j4qoqkJ0J6Mrj3qnjPK1K6J9Nj1k5l3k6rJlj2j0%POPJ1J0lj0nQRpk1j6NK2K7K4
$$ 2614 2609 2593 2579 2571 2565 2557 2555 2565 2581 2585 2576 2563 2555 2550 2549 2556 2577 2603 2622 2627 2616 2591 2558 2532 2523 2524 2521 2509 2499 2499 2506 2512 2519 2530 2540 2537 2527 2522 2530 2539 2532 2511 2495 2500 2522 2549 2573
2615B573J9J6J1Kj2k6l0j9jRLmmKJ%JMmj1%K7M6L7J1nomj7l3m0l4j9KJ8J7kk0j6QK9L0J8J0
$$ 2573 2592 2608 2619 2621 2609 2583 2553 2534 2533 2542 2545 2541 2537 2539 2540 2540 2541 2545 2541 2530 2530 2557 2603 2640 2651 2646 2640 2636 2619 2586 2546 2512 2493 2495 2513 2530 2528 2508 2492 2500 2529 2559 2577 2587
2610B587Nj1k7k7kJ8J6JlJ3L0L7L9L4J6rk4j5NK5L5L2J1j6k3kJ3kk7k5jPrk2j2Jmj0LK3K3
$$ 2587 2592 2581 2554 2527 2525 2543 2559 2560 2557 2570 2600 2637 2676 2710 2726 2717 2693 2678 2683 2708 2743 2775 2786 2770 2747 2745 2758 2756 2729 2704 2703 2710 2701 2679 2667 2668 2664 2654 2657 2680 2703
2605B703J2J1J7Pk3m4l9k4j4lJ4K7K1PNJ9K5J0j4k4oK5L6K0nj1npk2k5kK0J6qj9rNQJ4K7L9
$$ 2703 2715 2726 2743 2750 2727 2683 2644 2620 2606 2603 2617 2644 2665 2672 2677 2696 2721 2731 2717 2693 2687 2712 2748 2768 2763 2752 2747 2740 2718 2693 2691 2711 2727 2719 2700 2691 2696 2704 2718 2745 2784
2600B784L7K2QMMPRQ%j2j9j1J4L9M0J4j4j9nNjrjJ3J4OLLkj8l3l4k5j5mQJ9K0Mk0l2k7j0l
$$ 2784 2821 2843 2851 2855 2859 2866 2875 2883 2883 2871 2852 2841 2855 2894 2934 2948 2934 2915 2910 2915 2914 2905 2904 2917 2931 2937 2940 2943 2941 2923 2890 2856 2831 2816 2812 2820 2839 2859 2863 2843 2811 2784 2774 2771
2594B771pj3j1JK1M0N3N2L5J3jrj6j9j2LJ6J7J0Knj3j5lJ7K9K0mj6qOPoj2kJ1J5J8L0M1L4
$$ 2771 2764 2751 2740 2741 2762 2802 2855 2907 2942 2955 2954 2945 2929 2910 2898 2901 2917 2934 2944 2946 2941 2928 2913 2910 2927 2956 2976 2972 2956 2948 2954 2961 2955 2943 2941 2952 2967 2985 3015 3056 3090
2589C090J4JJKlo%Kj0k7l3k5j0JON%oppj0j4pJ2L0L1J8Lqj4j8j6oRJ9J7P%lnmLJ0RMPK4M2
$$ 3090 3104 3105 3106 3108 3105 3099 3099 3101 3091 3064 3031 3006 2996 2997 3003 3008 3008 3002 2995 2988 2978 2964 2957 2969 2999 3030 3048 3051 3043 3029 3011 2995 2989 2998 3017 3034 3041 3041 3038 3033 3029 3032 3042 3051 3055 3062 3086 3128
2583C128L6J4pj4r%OQRPMlj7k9l3l0k2j0LJ6K3K6L4L9L2J3lopj1j0lOQQJ1J7J9J1L%J0K6M1
$$ 3128 3164 3178 3171 3157 3148 3148 3154 3162 3171 3178 3182 3179 3162 3133 3100 3070 3048 3038 3041 3057 3080 3106 3140 3179 3211 3224 3221 3215 3208 3197 3187 3184 3190 3198 3206 3217 3234 3253 3264 3267 3267 3277 3303 3344
2578C344M1J9nj5j2qrj0pqj4j6j1njNJ7K2Qj5k8k1pRK1K2Rrj4mM%pnJnk1k3pJ8L4L4K5J8J6
$$ 3344 3385 3404 3399 3384 3372 3364 3355 3345 3338 3330 3316 3300 3289 3284 3283 3288 3305 3327 3335 3320 3292 3271 3264 3273 3294 3316 3325 3316 3302 3298 3302 3302 3295 3290 3291 3286 3265 3242 3235 3253 3287 3321 3346 3364 3380
2573C380J7J4J2J3K4K7Pk7m5k9LJ9J4Knrj8k6l1l4l5l0j2J3K6J5j1k8k0MK1J8KnnkMJ3J8J1
$$ 3380 3397 3411 3423 3436 3460 3487 3494 3467 3422 3393 3396 3415 3429 3431 3426 3417 3399 3373 3342 3308 3273 3243 3231 3244 3270 3285 3274 3246 3226 3230 3251 3269 3271 3266 3261 3259 3263 3276 3294 3305
2568C305mj2nNKqmJ6L5L5K0QQJ5J2lj7j6rrk3l0j8OJ9J8J3J4J8J5NjkjmoJJ4K1J3lj1lRQj0
$$ 3305 3301 3289 3284 3289 3291 3283 3279 3295 3330 3365 3385 3393 3401 3416 3428 3425 3408 3392 3383 3374 3351 3321 3303 3309 3328 3346 3359 3373 3391 3406 3411 3410 3408 3407 3403 3397 3398 3412 3433 3446 3443 3432 3429 3438 3446 3436
2562C436k5j8KJ7J4NJNOkroNJ3QjrrkJ3K8K6Nk2l5k5rjJKNORJ5J9J2OJ7L8M5K2rk2k0j6j7
$$ 3436 3411 3393 3395 3412 3426 3431 3432 3437 3443 3441 3432 3426 3431 3444 3452 3451 3442 3433 3431 3444 3472 3498 3503 3481 3446 3421 3412 3411 3412 3414 3419 3425 3434 3449 3468 3480 3486 3503 3541 3586 3608 3599 3577 3557 3541 3524
2556C524qJ1K5K1J2PJ1J5J9J8Pj1k2j7ork5m2l6rK4M5M4L3K9L4L2J3rj3%J0Pjqj7l1m2m1l2
$$ 3524 3516 3527 3552 3573 3585 3592 3603 3618 3637 3655 3662 3651 3629 3612 3606 3597 3572 3530 3494 3485 3509 3554 3598 3631 3660 3694 3726 3739 3730 3717 3717 3727 3734 3733 3725 3708 3677 3635 3594 3562
2552C562k0qMJ5K6K9K3Qrj3oPJ4J2%j2rMJ1Jj3mK3L8K8Pqj9k9k4jK7L4L0K8L2K2lk2k3oJ3
$$ 3562 3542 3534 3538 3553 3579 3608 3631 3639 3630 3617 3611 3618 3632 3644 3644 3632 3623 3627 3638 3639 3626 3622 3645 3683 3711 3718 3710 3691 3662 3638 3637 3664 3698 3728 3756 3788 3810 3807 3785 3762 3756 3769
2546C769K1J1j8m1l4oJ5J7J4J8J8Jk2l1k2j1nk%nj2qOK5L0J8lk4l2k7rJ4K9L1K3J5QJppJQ
$$ 3769 3790 3801 3783 3742 3708 3702 3717 3734 3748 3766 3784 3785 3763 3732 3710 3699 3694 3692 3692 3687 3675 3667 3673 3698 3728 3746 3743 3719 3687 3660 3651 3665 3694 3725 3748 3763 3771 3772 3765 3758 3759 3767
2541C767RQK0L5L3J0j1j3LJ3Nj6l2k8rQJ0PJ4K7K2Jj4j3k%%LKj0j9j0J2K0J2KQK0K5J9R%j1
$$ 3767 3776 3784 3804 3839 3872 3882 3871 3858 3861 3874 3879 3863 3831 3803 3794 3802 3812 3819 3833 3860 3882 3883 3869 3856 3854 3854 3854 3857 3859 3849 3830 3820 3832 3852 3864 3866 3874 3894 3919 3938 3947 3947 3936
2536C936k0k8l0k5j4ojNJ5K1K0J4J1J2RLlj3k3l3l2k1nJ8M5O0M5J7JOJ5J7J7J5ll5m8k1J8
$$ 3936 3916 3888 3858 3833 3819 3813 3812 3817 3832 3853 3873 3887 3898 3910 3919 3922 3919 3906 3883 3850 3818 3797 3792 3810 3855 3915 3960 3977 3978 3984 3999 4016 4033 4048 4045 4010 3962 3941 3959
2531C959K8OrJJ9K1QolJ2K9L0J2j1k0j3nmlLOlj3pRK0J4Jrj4j5qJkj3k2j2NRKKJ6K7J9%j1
$$ 3959 3987 3993 3984 3985 4004 4025 4033 4027 4024 4036 4065 4095 4107 4096 4076 4063 4058 4054 4051 4054 4060 4057 4044 4037 4046 4066 4080 4081 4072 4058 4043 4035 4036 4034 4021 3999 3987 3992 4001 4003 4005 4021 4048 4067 4067 4056
2526D056oMQRPQJ3K5M0M9M7L6K3J1KOJ6K1Rj1k8l1k2mRJ5J4J6K0Qj9m5m8k4QL5M5L6Pk4l7
$$ 4056 4050 4054 4062 4071 4078 4086 4099 4124 4164 4213 4260 4296 4319 4330 4332 4338 4354 4375 4384 4373 4345 4314 4292 4288 4297 4312 4326 4342 4362 4370 4351 4306 4258 4234 4242 4277 4322 4358 4365 4341 4304
2521D304k8j6k0l8n1m1j4J0J5QJ4L7N5M6J5j7l2k8j0J3K4Ok7m1k2RK0J1lpmPJ7J5Kj4j5jP
$$ 4304 4276 4260 4240 4202 4151 4110 4096 4106 4121 4129 4143 4180 4235 4281 4296 4279 4247 4219 4209 4222 4246 4252 4225 4184 4162 4171 4191 4202 4199 4192 4188 4195 4212 4227 4229 4215 4200 4199 4206
2516D206Olj4k4k7j1J6L6L6K4J3MnnNK1K3Qj0j8j8j6k2l0l4k5mJ3K3K1J6Jj8l0k1KJ7K0J5
$$ 4206 4212 4209 4195 4171 4144 4133 4149 4185 4221 4245 4258 4262 4257 4252 4257 4278 4301 4309 4299 4281 4263 4247 4225 4195 4161 4136 4132 4145 4168 4189 4205 4206 4188 4158 4137 4139 4156 4176 4191
2511D191J7K3K8L2K9J6pk0j5kPQQNqk4l2k3lK2L8L3Mk1k2njj3k7k8k1rPK2J9LlJ3K7K0QRJ5
$$ 4191 4208 4231 4259 4291 4320 4336 4329 4309 4294 4292 4299 4307 4315 4320 4312 4288 4256 4233 4230 4252 4290 4323 4327 4306 4284 4279 4278 4265 4238 4210 4189 4180 4187 4209 4228 4231 4228 4241 4268 4288 4296 4305 4320
2506D320Nj9k8j9j2j8k0oJ1J4J1J6K6K7J8Mj2k2k0p%rk0j9lJ2K2L0L1K1%j6j8pQK3K5J1j1
$$ 4320 4325 4306 4278 4259 4247 4229 4209 4203 4214 4228 4239 4255 4281 4308 4326 4330 4318 4296 4276 4269 4269 4260 4240 4221 4218 4230 4252 4282 4313 4334 4334 4318 4300 4293 4301 4324 4349 4360 4349
2501D349k0j1lllJ0L2L5J9%mQJ8J5mk7l6j9J1L0J9qk3j9j1j3j4kK5M9M8J7k0m1l7j7KJ2J7
$$ 4349 4329 4318 4315 4312 4309 4319 4351 4386 4405 4405 4401 4409 4427 4442 4438 4411 4375 4356 4367 4397 4416 4408 4385 4366 4355 4342 4328 4326 4351 4400 4448 4465 4445 4404 4367 4350 4352 4364 4381
2496D381J4MrrKJ0JrmJ1J3mj7j0POj3k6j5RK4J9Okkoj7k5j5J1L5M0L0J6LnmRK2J7nk0j2RJ5
$$ 4381 4395 4399 4390 4381 4383 4393 4394 4385 4381 4392 4405 4401 4384 4374 4381 4387 4374 4348 4333 4342 4366 4385 4391 4389 4387 4381 4364 4339 4324 4335 4370 4410 4440 4456 4459 4454 4450 4459 4481 4498 4493 4473 4461 4470 4485
2491D485Kj6k1j9j8j9j2KQmj9k0mPLkNJ9K9K7J9J2Nlj4k9l4j7J9M1L0%j6j1kprNK2K9K0Ol
$$ 4485 4487 4471 4450 4431 4413 4394 4382 4384 4392 4388 4369 4349 4345 4352 4355 4353 4358 4377 4406 4433 4452 4464 4469 4466 4452 4423 4389 4372 4391 4432 4462 4462 4446 4435 4433 4426 4417 4422 4444 4473 4493 4499 4496
2485D496polok0k9k0MK4K9K1J2OMKnj2j1oj0k8m2m0k3qPK8M6L9J1j6k5j9j1MK5L7L2J7Kj2
$$ 4496 4489 4483 4480 4474 4454 4425 4405 4409 4433 4462 4483 4495 4501 4505 4507 4502 4490 4479 4473 4463 4435 4393 4353 4330 4322 4329 4357 4403 4442 4453 4437 4412 4393 4382 4386 4411 4448 4480 4497 4499 4487
2480D487k5k5nJ6K0Rkop%J6L1K3pk7k3rlprj1j4j4nORJ0J7K4J8Jj0mJ0J9K2K0Mk2m6m7k2L
$$ 4487 4462 4437 4432 4448 4468 4477 4475 4469 4462 4462 4478 4509 4532 4525 4498 4475 4466 4463 4456 4447 4436 4422 4408 4403 4409 4418 4428 4445 4469 4487 4488 4478 4474 4484 4503 4525 4545 4549 4527 4481 4434 4412 4415
2475D415J3RKjpj6k2k1k0j8qJ0J9J1prNK0J8PKQJ9K6K7K6K3J7Mj0j7j2jJlNK5L6K7NmMJ1J
$$ 4415 4428 4437 4439 4438 4431 4415 4393 4372 4352 4334 4326 4336 4355 4366 4359 4350 4355 4375 4393 4400 4402 4410 4429 4455 4482 4508 4531 4548 4552 4542 4525 4513 4512 4513 4510 4515 4540 4576 4603 4608 4604 4608 4619 4620
2470D620j8l6m0k1RK3Rj6k3j4j1j3qPJ3%j4j0lorlQOorlmj5k7l5m1m1k2J0L1L2L2M3N2L9J0
$$ 4620 4602 4566 4526 4505 4514 4537 4546 4530 4507 4493 4482 4469 4461 4468 4481 4481 4467 4457 4454 4448 4439 4436 4444 4450 4444 4435 4432 4428 4413 4386 4351 4310 4269 4247 4257 4288 4320 4352 4395 4447 4486 4496
2465D496rj0oj1k0j8pPJ3J3J1J0J7K4K3Qrj5j6k2l6m0k4lMLJ0K0J4j1k7j7PJ3MjNKj4k9k6
$$ 4496 4487 4477 4471 4460 4440 4422 4415 4422 4435 4448 4459 4469 4486 4510 4533 4541 4532 4517 4501 4479 4443 4403 4379 4376 4380 4383 4393 4413 4427 4416 4389 4372 4379 4392 4396 4395 4400 4402 4388 4359 4333
2460D333j2kjPJ6J7PKOOmrMK2J8qk2%L8N2L6J5Jj3l1l4j4QOj3k7k7k7k2oK1L6L2J8Nj1k4k6
$$ 4333 4321 4319 4318 4325 4341 4358 4365 4367 4373 4379 4375 4366 4370 4392 4410 4402 4380 4380 4418 4470 4506 4521 4522 4509 4478 4444 4430 4438 4444 4431 4404 4377 4350 4328 4322 4343 4379 4411 4429 4434 4423 4399 4373
2454D373j7rj0qOJ6Oj5k6j6%J2J8K4K7K7J8NkRK7K7Mk1k7k2k0k5k0rrk4l4k6oQJ1NNJ3K5K2
$$ 4373 4356 4347 4337 4329 4335 4351 4357 4342 4316 4300 4300 4312 4330 4354 4381 4408 4426 4431 4429 4438 4465 4492 4496 4475 4448 4426 4406 4381 4361 4352 4343 4319 4285 4259 4253 4261 4272 4277 4282 4295 4320 4342
2449D342Mj2j0OJ3Lj1j4qm%PJ2J5J6J7J0j6m0l8lL1L6J1j0j1%Nmj1rlJJlj5k8l4k0LK2K8K4
$$ 4342 4346 4334 4324 4330 4343 4346 4335 4321 4313 4309 4309 4316 4328 4343 4359 4376 4386 4370 4330 4292 4289 4320 4356 4367 4357 4346 4346 4351 4347 4336 4327 4324 4325 4326 4323 4308 4280 4246 4226 4229 4251 4279 4303
2444D303J3M%LMKlqj6k6k5j1Jmk2k6j1MMrj8k2k1j7pOJ5J3PLOJ4J8J4POJ3J7Qpj6j3kQOoj6
$$ 4303 4316 4320 4320 4323 4327 4329 4326 4318 4302 4276 4251 4240 4241 4237 4215 4189 4178 4182 4186 4177 4159 4137 4116 4099 4092 4098 4113 4126 4133 4136 4142 4156 4174 4188 4195 4201 4214 4231 4239 4232 4216 4203 4201 4209 4215 4209 4193
2438D193JL4N3L7QmONj4k9j9JLj7l2k4nJkn%JkjNOkj7k1j9j4p%Knj2j1KQLpj2j0lPJ4J0Kk
$$ 4193 4194 4228 4281 4318 4326 4322 4328 4333 4319 4290 4271 4272 4275 4258 4226 4202 4197 4198 4196 4191 4191 4192 4190 4189 4194 4200 4198 4181 4160 4141 4127 4120 4120 4122 4117 4105 4094 4096 4104 4107 4100 4088 4078 4075 4082 4096 4106 4108 4106
2432D106NJ1Nnpnoj0j3qJRJ6J5QMLOPMLLKlj5l0l7l1j4jlj2j5j2okMJ2K1K3J9R%lQJ7J1j2
$$ 4106 4111 4122 4127 4122 4115 4110 4104 4094 4081 4073 4074 4083 4099 4114 4122 4126 4129 4135 4142 4146 4149 4152 4154 4151 4136 4106 4069 4038 4024 4023 4020 4008 3993 3981 3975 3973 3977 3989 4010 4033 4052 4061 4061 4058 4066 4083 4094 4082
2426D082l4l7k4pK%mJJ3K5K4J8J3J1QOJ0J8K2J7Nj2l1m4m4l1k0j5j4qljllkJKkqj1qMJ2J3
$$ 4082 4048 4011 3987 3980 3982 3982 3978 3979 3992 4017 4041 4059 4072 4083 4091 4097 4107 4125 4147 4164 4169 4157 4126 4082 4038 4007 3987 3972 3958 3950 3947 3946 3943 3940 3938 3939 3941 3939 3931 3920 3912 3916 3928 3941
2421C941J0OLlrj1JK1L9M0K3kj5j9j9k3k2j3jJj0k4k5pJ1J4lj7j5MK1K6J7Jrj0mpj6j8j2n
$$ 3941 3951 3957 3960 3957 3948 3937 3938 3959 3998 4038 4061 4059 4044 4025 4006 3983 3961 3948 3947 3948 3938 3914 3889 3882 3893 3907 3904 3887 3872 3876 3897 3923 3940 3941 3932 3922 3918 3911 3895 3877 3865 3860
2416C860j0j4nJ2K2K5K7L0K0LnKQkj8k2j7ppj5k6k5lL2M6K7j0l0k4mJ4K1J8Qok4l9l8j8J0
$$ 3860 3850 3836 3831 3843 3865 3890 3917 3947 3967 3970 3965 3967 3975 3973 3955 3933 3916 3909 3902 3887 3861 3836 3833 3865 3911 3938 3928 3898 3874 3870 3884 3905 3923 3931 3925 3901 3862 3824 3806 3816
2411C816K2J8J3J6J3jj0j0j3l3m4k3J6L4J8rk1k1j9j8j6j5j7j7j4rJJ9L5L8K8J5Pjrj3lJ0
$$ 3816 3838 3856 3869 3885 3898 3897 3887 3877 3864 3831 3787 3764 3780 3814 3832 3823 3802 3781 3762 3744 3728 3713 3696 3679 3665 3656 3657 3676 3711 3749 3777 3792 3799 3798 3789 3776 3773 3783
2406C783J7Pj5k9k1J0L0K4LjJ0J2nk0j5oj1j6qPJ5J5J2jk2l0j5Jjj2kJ5J3qj3OK3J5KKLoj6
$$ 3783 3800 3807 3792 3763 3742 3752 3782 3806 3809 3808 3818 3830 3825 3805 3790 3784 3773 3757 3749 3756 3771 3786 3798 3797 3775 3745 3730 3731 3730 3718 3716 3731 3744 3736 3723 3729 3752 3767 3769 3771 3774 3768 3752
2401C752nJ4J0j5l5k9j1%pj9k5j5OJ9J3joNJ0MonJMPPKj5l2k6%K5K8J8J1P%j2j6rmpj1mJ1
$$ 3752 3747 3761 3771 3756 3721 3692 3681 3681 3674 3655 3630 3615 3621 3640 3653 3652 3646 3651 3661 3665 3659 3654 3655 3659 3666 3673 3675 3660 3628 3602 3602 3627 3655 3673 3684 3691 3691 3679 3663 3654 3650 3643 3632 3628 3639
2396C639J8J2jj1j1olqj9k5k4j8j7j1%J2J4kk5l7l0kL5O3O3M1Rj9l6m0l3j8ommLJ4J9J3Jq
$$ 3639 3657 3669 3668 3657 3646 3640 3637 3629 3610 3585 3561 3543 3526 3515 3515 3527 3541 3539 3514 3477 3447 3445 3480 3543 3606 3647 3656 3637 3601 3561 3528 3510 3504 3500 3496 3499 3513 3532 3545 3546 3538
2391C538j5j9j3%J6L0L2K3Kj4j7qJOQJ0J2J0lk0l5l9k3JJ5J5J3J9K0Kk4l1j8lknlJLPJ5J4
$$ 3538 3523 3504 3491 3491 3507 3537 3569 3592 3594 3580 3563 3555 3556 3562 3570 3580 3592 3602 3599 3579 3544 3505 3482 3483 3498 3513 3526 3545 3565 3567 3543 3512 3494 3491 3489 3484 3481 3482 3485 3492 3507 3521
2385C521jj7j5%J4J4QJrk2l2l1k6k1qJ4L5L8K4J0NMmk0l2k7pJ1J3NjPK2K6J5lj7j7j4j2j0
$$ 3521 3520 3503 3488 3488 3502 3516 3524 3525 3516 3494 3462 3431 3405 3384 3376 3390 3425 3463 3487 3497 3502 3506 3502 3482 3450 3423 3416 3427 3440 3445 3444 3451 3473 3499 3514 3511 3494 3477 3463 3451 3441
2380C441nLJj1k2j9j0j3k1j7J1L5L2J0nllj9l2k6mJ2J5J3J4Rkpoj0k4l5k1OJ8PpJK0L6L9L2
$$ 3441 3436 3439 3440 3429 3407 3388 3378 3365 3344 3327 3338 3373 3405 3415 3410 3407 3404 3385 3353 3327 3323 3335 3350 3363 3377 3386 3384 3377 3371 3361 3337 3302 3281 3287 3305 3312 3305 3306 3326 3362 3401 3433
2375C433J9Jj0mMNkkNR%nLJ6J5nk9l9k7j0lj0j8k5l0l5k3RL7L8J4loj2k7l8l4k2j1%J3K0J4
$$ 3433 3452 3453 3443 3439 3443 3448 3446 3444 3449 3458 3458 3453 3456 3472 3487 3482 3453 3414 3387 3377 3374 3364 3346 3321 3291 3256 3233 3242 3279 3317 3331 3328 3322 3310 3283 3245 3211 3189 3178 3178 3191 3211 3225
2370C225OPRMkkMQJ4K7L6K8J1jnqrl%j3l4m4l7k8k1rJ1K7L5L8M0L2J1j4l1m1m0k6pJ3K6L7
$$ 3225 3231 3238 3247 3251 3249 3247 3251 3259 3273 3300 3336 3364 3375 3374 3369 3361 3352 3349 3349 3336 3302 3258 3221 3193 3172 3163 3174 3201 3236 3274 3314 3346 3357 3343 3312 3271 3231 3205 3198 3211 3237 3274
2365C274L9K3ol1l8k8j3KJ1J3J0OLnj3rlmrjK4M2L3J0pj4j6j7j2j2k1l9m8m2k3KK0K5K2K3
$$ 3274 3313 3336 3330 3299 3261 3233 3220 3222 3233 3246 3256 3262 3265 3260 3247 3238 3235 3231 3222 3221 3245 3287 3320 3330 3323 3309 3293 3276 3264 3252 3231 3192 3144 3102 3079 3081 3101 3126 3148 3171
2360C171L0K6Nj7k3k6l3l7k8j6j4j3KJ9J8MjKnk4k6mK2L4L8M0L0%k5k5j1%MJ2K3K1RKKnk4
$$ 3171 3201 3227 3232 3215 3192 3166 3133 3096 3068 3052 3038 3025 3027 3046 3064 3068 3067 3069 3064 3040 3014 3010 3032 3066 3104 3144 3174 3174 3149 3124 3113 3113 3117 3129 3152 3173 3182 3184 3186 3181 3157
2355C157m0l8k8k2j9nJ9L2K0rl1l1j3lj8m1n3l8j1J5K8L2K9K3J9J8J5Nj1j8j4opj6j8qPJ8
$$ 3157 3117 3079 3051 3029 3010 3005 3024 3056 3076 3067 3036 3005 2992 2989 2971 2930 2877 2839 2828 2843 2871 2903 2932 2955 2974 2992 3007 3012 3001 2983 2969 2963 2956 2940 2922 2914 2921 2939
2350B939K6K8K7J6Kqj6j6lJ5J5j0l7l9j9nnkJ1K3K4K2K1Rj3k5j0J5K0OkMJ0Kj4l0l7l6k3l
$$ 2939 2965 2993 3020 3036 3038 3030 3014 2998 2995 3010 3025 3015 2978 2939 2920 2915 2910 2908 2919 2942 2966 2988 3009 3018 3005 2980 2970 2985 3005 3011 3009 3013 3023 3025 3011 2981 2944 2908 2885 2882
2345B882J2J6J3MklNJ2Rlj2j1jJ0J5J3Nkjjj1k6l4k4rjjqj6k1j6qj2k6k6JL4L8J6lpqj5k0
$$ 2882 2894 2910 2923 2927 2925 2922 2927 2939 2948 2945 2933 2922 2921 2931 2946 2959 2964 2962 2961 2960 2949 2923 2889 2865 2856 2855 2854 2846 2830 2809 2793 2785 2773 2747 2721 2722 2756 2794 2810 2807 2800 2792 2777 2757
2340B757j0jnj1ML3M7L3J0nj1j7j6%J6J0j3l0k5j1JJ4L0L8K1rk7j9%J3J0%jJ0K1J7kk3k7j8
$$ 2757 2747 2746 2741 2730 2734 2767 2814 2847 2857 2852 2841 2824 2808 2808 2824 2834 2821 2791 2766 2755 2756 2770 2800 2838 2859 2850 2823 2804 2804 2817 2827 2827 2826 2836 2857 2874 2872 2849 2822 2804
2335B804j1j5k4k5j8j2oNK7M4L7Kl2m2k4oknlKKj%POpk3l1k2LL0L9J9j0k4j5oj2k4k3j1JN
$$ 2804 2793 2778 2754 2729 2711 2699 2693 2698 2725 2769 2806 2808 2776 2734 2710 2704 2702 2697 2694 2696 2698 2697 2697 2704 2710 2703 2680 2649 2627 2630 2660 2699 2718 2708 2684 2669 2663 2651 2627 2604 2593 2594 2599
2330B599NJ0J2J3J4J7J6J0%nmOJ4J9J7J1Njj4k9l4j9J0K4J1j3j6KJ6Lk1l0j6mqj8j7n%qj3
$$ 2599 2604 2614 2626 2639 2653 2670 2686 2696 2696 2691 2687 2693 2707 2726 2743 2754 2759 2758 2744 2715 2681 2662 2672 2696 2707 2694 2678 2680 2696 2699 2678 2648 2632 2628 2620 2602 2585 2580 2580 2572 2559
2325B559jJ2J2kpMJ9J8Jj4k1j8oOR%j3j5j0rj6j6nJ2K1K4K5K0J4J7K0J2j2k7j5RJ6Lplmj5
$$ 2559 2558 2570 2582 2580 2573 2577 2596 2614 2615 2601 2580 2562 2556 2562 2571 2571 2558 2543 2533 2524 2508 2492 2487 2499 2520 2544 2569 2589 2603 2620 2640 2652 2640 2613 2598 2607 2623 2626 2619 2616 2612 2597
2320B597k2j7j0j5j8pJ3K2J4qk8m1l7j7RK5L0L5L5K4Kj6k3j7oPJ7J5NJLKj5m0m8k8LJ8J1l
$$ 2597 2575 2558 2548 2533 2515 2508 2521 2543 2557 2549 2521 2480 2443 2426 2435 2460 2490 2525 2560 2584 2586 2570 2547 2530 2524 2531 2548 2563 2568 2569 2572 2574 2559 2519 2471 2443 2446 2464 2475 2472
2315B472nLJ2J4J4J0Jrj5j4j1oOJ8K1J1oj7j9j3LK0K4J0l%J4J7Roj7k5k4j5jJ1K0K7K5Qj1
$$ 2472 2467 2470 2482 2496 2510 2520 2521 2512 2497 2483 2472 2466 2472 2490 2511 2522 2516 2499 2480 2467 2470 2490 2514 2524 2521 2521 2535 2552 2561 2555 2538 2513 2489 2474 2473 2484 2504 2531 2556 2564 2553
2310B553j9j2KJ4K0J1j3l2k2J1L1K2lj9k4k7k6j8oLOM%n%J4J8J1OJ9L2K1nj6qjj1j9j7j3j4
$$ 2553 2534 2522 2524 2538 2558 2569 2556 2524 2502 2513 2544 2566 2563 2544 2520 2493 2467 2449 2443 2446 2452 2456 2456 2451 2451 2465 2483 2494 2500 2519 2551 2572 2567 2551 2543 2542 2531 2512 2495 2482 2468
2305B468j4nKoj6qJ8L8L9K7J1lpjOKj4k6k3j2qj3j8j6j3j2j0pkKLORJ0J0Jj0k2k3j1PJ7J6
$$ 2468 2454 2449 2451 2445 2429 2421 2439 2477 2516 2543 2554 2551 2544 2543 2549 2551 2537 2511 2488 2476 2468 2455 2437 2421 2408 2396 2386 2379 2377 2379 2382 2388 2397 2407 2417 2418 2408 2386 2363 2352 2359 2376 2392
2300B392RJJPJ9K7K2Mpqqj8l2k8rRJ3J1Q%j3j5jK1K6J4%j1k2l2l2k4j9k0j7JJ9K7K4J8J0j
$$ 2392 2401 2402 2403 2410 2429 2456 2478 2482 2475 2467 2459 2441 2409 2381 2372 2381 2394 2405 2413 2413 2400 2385 2384 2405 2431 2445 2445 2434 2412 2380 2348 2324 2305 2285 2268 2269 2288 2315 2339 2357 2367 2366
2294B366j4k1k2k0j7j3j2j1oLJ2J7K2L0L2J8KpkLNQJ8K6K3Nj4k2j5kjrj6j4j4k1k4qJ3J6j
$$ 2366 2352 2331 2309 2289 2272 2259 2247 2236 2230 2233 2245 2262 2284 2314 2346 2364 2366 2359 2357 2360 2365 2373 2391 2417 2440 2445 2431 2409 2394 2392 2391 2382 2366 2352 2338 2317 2293 2285 2298 2314 2313
2289B313pNJ5Kj0lJ0Lj8k6j7j2j6j1QJ8Mj2oJ8L3L0J7Nkollqj7j8rNJ7K5K4J4JlQK2K6K1J2
$$ 2313 2306 2311 2326 2328 2318 2315 2325 2328 2310 2284 2267 2255 2239 2228 2236 2254 2258 2246 2240 2258 2291 2321 2338 2343 2341 2335 2332 2329 2321 2304 2286 2277 2282 2299 2324 2348 2362 2363 2360 2368 2390 2416 2437 2449
2284B449Kpj4j5j3rrj2j3mJ0K0J2j0k8k7j1knj7k2k1j1LJ2Rkj5j9j5j3j1oknj7k5j8JJ8J9
$$ 2449 2451 2444 2430 2415 2402 2393 2384 2372 2359 2355 2365 2385 2397 2387 2359 2332 2321 2319 2314 2297 2275 2254 2243 2246 2258 2267 2265 2250 2231 2216 2203 2192 2186 2184 2179 2162 2137 2119 2120 2138 2157
2279B157J1MPRPjrj2oJ0K1K1J2QQ%j6k7j7MRlj5j0MJ2J5J7J2lj7j7jJ2Rrl0l4j6J0K5K0Pj
$$ 2157 2168 2172 2179 2188 2195 2194 2185 2173 2167 2177 2198 2219 2231 2239 2247 2247 2231 2204 2187 2191 2200 2197 2182 2172 2176 2188 2203 2220 2232 2229 2212 2195 2194 2206 2215 2206 2176 2142 2126 2136 2161 2181 2188 2187
2274B187JPJ1K0K8K6J3nj7k3k1rOPnj3oOO%kMPKoj3j7j2LJ8K0Pj4k9l6k7lK0K4J4LNRJ3J8
$$ 2187 2188 2195 2206 2226 2254 2280 2293 2288 2271 2248 2227 2218 2224 2231 2226 2213 2207 2213 2219 2219 2217 2221 2228 2230 2224 2211 2194 2182 2185 2203 2223 2230 2216 2187 2151 2124 2121 2141 2165 2179 2182 2187 2196 2209 2227
2268B227J7jk2k5mJ3QmlRRoj7j3JJ0J0Lj1k4k7k1pJ1K5K2kl1m6l6j0K1M2M7L8K3J6Qpk1k0
$$ 2227 2244 2243 2221 2196 2192 2205 2213 2209 2206 2215 2224 2218 2201 2188 2189 2199 2209 2212 2201 2177 2150 2129 2122 2133 2158 2180 2178 2147 2101 2065 2055 2076 2118 2165 2203 2226 2242 2250 2243 2222 2202
2263B202qmj3k1k2k1j9mK1L4K5QJkrj7j3%NlqnKMjqj7j8pRJ4OlkLkj6k0qJ0J8J0mj2pMQMn
$$ 2202 2194 2190 2177 2156 2134 2113 2094 2090 2111 2145 2170 2178 2179 2177 2168 2151 2138 2138 2143 2140 2132 2127 2129 2133 2132 2124 2107 2089 2082 2091 2105 2111 2108 2106 2109 2107 2091 2071 2063 2073 2091 2101 2097 2085 2078 2082 2090 2094 2089
2257B089j2j1mKQJ2J1MjkMQLmnJLkpm%mj2qRJ8J0KMJ9K3Rj2k1j3OJ6Qj2k6k2j1pj2oJ0K0J2
$$ 2089 2077 2066 2062 2064 2072 2084 2095 2099 2098 2096 2100 2108 2111 2107 2102 2103 2106 2104 2097 2093 2093 2089 2077 2069 2078 2096 2106 2108 2112 2131 2154 2163 2151 2130 2117 2123 2139 2147 2135 2109 2087 2076 2069 2057 2051 2061 2081 2093
2251B093nj1lNNKJLKKNMkqoJKpk0k3j1J0K6L1K4J1j0k9l1j6NJ5J1Jrk4m6n4m4k1kNMMJ4L0
$$ 2093 2088 2077 2074 2079 2084 2086 2087 2090 2092 2094 2099 2103 2101 2093 2087 2088 2090 2083 2063 2040 2029 2039 2065 2096 2120 2131 2121 2092 2061 2045 2050 2065 2076 2077 2068 2044 1998 1944 1900 1879 1877 1882 1886 1890 1904 1934
2246A934L7K3jpJ2K5J5nrLNlmKLnpMLj7l3k0PK0J0pj4rjNKkLJ5K2K2K1K2J1j2k7j7QK5L1L4
$$ 1934 1971 1994 1993 1986 1998 2023 2038 2033 2024 2027 2032 2029 2025 2027 2030 2025 2018 2022 2025 2008 1975 1955 1962 1982 1992 1985 1971 1962 1961 1966 1968 1966 1969 1984 2006 2028 2049 2071 2082 2070 2043 2026 2034 2059 2090 2124
2240B124K7Nk4l3k1p%LQRjqpoqojlj5k9k6qRJ4RM%rj6j4LJ8J5mj4oLlj6j4LJ9K6L6L9K3rk4
$$ 2124 2151 2156 2132 2099 2078 2071 2071 2074 2082 2091 2090 2082 2075 2069 2061 2055 2054 2051 2036 2007 1981 1973 1982 1996 2005 2009 2009 2000 1984 1970 1973 1991 2006 2002 1988 1982 1985 1982 1966 1952 1955 1974 2000 2036 2075 2098 2089 2065
2234B065qJ2J3QJ4K2J1j0j4KJ6J3L%%qj8j6mPOJlljJNRNj5l7l6j1J6K1Poj1j2j2j1pprpJ%
$$ 2065 2057 2069 2082 2090 2104 2126 2137 2127 2113 2115 2131 2144 2147 2147 2147 2139 2121 2105 2101 2108 2114 2115 2112 2109 2108 2109 2114 2123 2128 2113 2076 2040 2029 2045 2066 2073 2067 2056 2044 2032 2021 2014 2007 1998 1991 1992 1992
2228A992qj7j6j0kKMNPJ5K2J6jj0KK2K9J6krqlOJ9L1K7J0ooOJ0%j5k5l2l2k6rJqk8l6j8LJ1
$$ 1992 1984 1967 1951 1941 1939 1941 1945 1950 1957 1972 1994 2010 2009 1999 2001 2023 2052 2068 2066 2057 2049 2046 2052 2071 2102 2129 2139 2133 2127 2133 2143 2143 2128 2103 2071 2039 2013 2004 2005 1997 1969 1933 1915 1918 1929
2223A929RJ1K0K1RlmOJ7K3K3K0Qj7m1n0l4qRJ3RN%mmjMMJ0K4L3K2ol2l2qK1K8J5rk4k8k8k7
$$ 1929 1938 1949 1969 1990 1999 1996 1992 1998 2015 2038 2061 2081 2089 2072 2031 1981 1947 1939 1948 1961 1970 1975 1975 1971 1967 1966 1970 1974 1984 2008 2041 2063 2057 2025 1993 1985 2006 2034 2049 2040 2016 1988 1960 1933
2218A933k2j3%J1K4L0K2ml1l1mK0J3j8l5j5J7K8Ok2l0j2J9M5M9L1NokJ0J8K6L0J8ok9l7l9
$$ 1933 1911 1898 1898 1909 1933 1963 1985 1981 1950 1919 1915 1935 1948 1930 1895 1880 1897 1925 1931 1909 1879 1867 1886 1931 1980 2011 2016 2010 2008 2018 2036 2062 2092 2110 2104 2075 2038 1999
2213A999m1l5j4J4K4J2mj2mRJ8J9J0LKM%jJ2K7K9J5jj6l0l6k2OK7K9K7L3M0L1Nk2l8l7k4j0
$$ 1999 1958 1923 1909 1923 1947 1959 1955 1943 1939 1948 1966 1985 1995 1998 2000 2004 2004 2003 2015 2042 2071 2086 2085 2069 2039 2003 1981 1987 2014 2043 2070 2103 2143 2174 2179 2157 2119 2082 2058 2048
2208B048qj4j2nj2l0l7j6J3K0MlQJ8J0mq%ONjlJPJ6K1K3J8RJKRJ1PLMJj4l4l7k0NJ8J4jj8
$$ 2048 2040 2026 2014 2009 1997 1967 1930 1914 1927 1947 1951 1948 1956 1974 1984 1980 1972 1972 1978 1983 1982 1979 1980 1987 2003 2024 2047 2065 2074 2075 2077 2086 2097 2104 2107 2111 2112 2098 2064 2027 2007 2012 2030 2044 2043 2025
2202B025k3j9j1j2j7k2k2j8jK2L7L0J1OJ8K5J3klNLrj6j0%jrj8j8j3mlrj9k4j4OK2K4J4J1
$$ 2025 2002 1983 1972 1960 1943 1921 1899 1881 1880 1902 1939 1969 1980 1986 2004 2029 2042 2040 2037 2042 2045 2036 2020 2010 2010 2009 2000 1982 1964 1951 1947 1944 1935 1916 1892 1878 1884 1906 1930 1944 1955
2197A955K5M2M0J3j5k5k5k3k3j2LRJj0j1pkKJ2K4K6J6lj5j3mMJ1J8K1J5Nknj1k0k5j4kjrq
$$ 1955 1980 2022 2062 2075 2060 2035 2010 1987 1964 1952 1955 1964 1965 1955 1944 1937 1935 1937 1949 1973 1999 2015 2012 1997 1984 1980 1984 1995 2013 2034 2049 2054 2052 2047 2036 2016 1991 1977 1975 1974 1965 1957
2192A957RK4K2Mj2j2k%qj9j9nJ8L4L3J6koPJ9J9J0NPJ0J1J0Opk4l3l4l6l3j1K8N4M0kl2l3
$$ 1957 1966 1990 2012 2016 2004 1992 1990 1990 1982 1963 1944 1939 1957 1991 2024 2040 2038 2032 2039 2058 2077 2087 2092 2099 2109 2120 2130 2136 2129 2105 2072 2038 2002 1969 1958 1986 2040 2080 2078 2046 2013
2187B013rK2M3M5K6OPJ4J0nj1KPrl7n0m2k6j1%LmqLK5L8L1J1Jllqj3j8k5k9k4j3nkQL2O1O8
$$ 2013 2004 2026 2069 2114 2140 2146 2153 2167 2177 2172 2161 2163 2170 2161 2124 2074 2032 2006 1995 1995 1998 1994 1986 1989 2014 2052 2083 2094 2095 2092 2089 2081 2068 2050 2025 1996 1972 1959 1954 1952 1960 1992 2053 2121
2182B121M8J3j2k3k2j7j5j8k3k0KK4K2%j8j5n%lkLPJ0K0L0K1jj5pRPj0j7kK0K9J6mj8k2j3
$$ 2121 2169 2182 2170 2147 2125 2108 2093 2075 2052 2032 2034 2058 2080 2080 2062 2047 2042 2042 2039 2037 2040 2047 2057 2077 2107 2128 2127 2112 2105 2114 2121 2111 2094 2092 2112 2141 2157 2153 2135 2113 2100
2177B100OK5L1J5j5m0m8l4j4%%lkQJ5J0NPJ9L0K7J2KjLJpj0nKLoj0nPJ4J3J5K5L8L8K2Kj2
$$ 2100 2106 2131 2162 2177 2162 2122 2074 2040 2026 2026 2026 2023 2021 2029 2044 2054 2059 2066 2085 2115 2142 2154 2156 2155 2158 2159 2152 2142 2137 2139 2142 2136 2126 2121 2128 2142 2155 2170 2195 2233 2271 2293 2295 2283
2171B283j2o%OJ1J4J5Qok3l0k8j9j1rnkjlMJ9K8K0KmRK7L7L6K7Pj4k9k8k4k6k9k2rmrqLJ3
$$ 2283 2271 2265 2265 2271 2282 2296 2311 2319 2313 2290 2260 2232 2213 2202 2193 2188 2186 2185 2182 2186 2205 2233 2253 2255 2251 2260 2287 2324 2360 2387 2394 2380 2351 2323 2299 2273 2244 2222 2213 2209 2200 2192 2195 2208
2166B208J2QRJ1OLNRNmm%%rj4mJ3K3K3J9J3Mlnqj9l1k9pJ6K2J1jo%J4K8K5Kk5l4k7k0j5kK3
$$ 2208 2220 2228 2237 2248 2254 2257 2262 2271 2276 2272 2268 2268 2268 2259 2245 2241 2254 2277 2300 2319 2332 2336 2333 2328 2320 2301 2270 2241 2234 2250 2272 2283 2282 2276 2276 2290 2318 2343 2345 2320 2286 2259 2239 2224 2222 2245
2160B245M1L6J7ORJ7J9K0K1J1j0k9k7rPNnqk%j0k4k9k5k1j8j2mkmMJ6K3J8J4K0J9Kj6j4LJ5
$$ 2245 2286 2322 2339 2345 2354 2371 2390 2410 2431 2442 2432 2403 2376 2367 2374 2379 2374 2366 2364 2364 2354 2330 2301 2276 2255 2237 2225 2221 2219 2215 2219 2235 2258 2276 2290 2310 2329 2331 2315 2301 2304 2319
2155B319J6J9K4J6mj8pJ4K1J3kj9l0k8j0PQrk0j4%QOLLJ1J9K2J6%j2j7rKMoj6j4%J1J9K1K2
$$ 2319 2335 2354 2378 2394 2390 2372 2365 2379 2400 2413 2411 2392 2362 2334 2324 2331 2339 2330 2310 2296 2296 2304 2310 2313 2316 2327 2346 2368 2384 2384 2372 2355 2346 2348 2352 2346 2330 2316 2316 2327 2346 2367 2389
2150B389J4NLJ0J4Ork3k9k9k5j7jJ8L3L2J2j0rOJ2mk1j8%K1L4M0L7K8K1J9J6Kqqknj8k9k7
$$ 2389 2403 2408 2411 2421 2435 2441 2432 2409 2380 2351 2326 2309 2308 2326 2359 2391 2403 2393 2384 2390 2402 2398 2377 2359 2359 2380 2414 2454 2491 2519 2540 2559 2575 2577 2569 2561 2559 2554 2536 2507 2480
2145B480j0J3L1K5MqKJ5RjMJ9J4j5l1j0K6M6M3K9J1j2k8k0J1L8M8M3L2K0Mj4k3j7JK0L8N2
$$ 2480 2470 2483 2514 2539 2543 2535 2537 2552 2561 2560 2564 2583 2597 2582 2551 2541 2567 2613 2656 2685 2696 2684 2656 2636 2647 2685 2733 2776 2808 2828 2832 2818 2795 2778 2779 2799 2837 2889
2140B889N4M6L3L6M8N7N8N6N8N2L6L3M9P2P6O9O4N7L4Nj2j6k8m6n0m0l6m8n4m8m4n6o7o3n4
$$ 2889 2943 2989 3022 3058 3106 3163 3221 3277 3335 3387 3423 3456 3505 3577 3653 3722 3786 3843 3877 3882 3870 3854 3826 3780 3730 3690 3654 3606 3552 3504 3460 3404 3337 3274 3220
2136C220m6k9lLk5n2l8%J2rl0k8j6j0lOQoj9j6pjMRJ1Nmj2j8k0j3qj3k3k3lJ6K1J8K0L2L4
$$ 3220 3174 3145 3142 3145 3120 3068 3030 3030 3042 3033 3003 2975 2959 2949 2946 2952 2960 2954 2935 2919 2912 2911 2915 2924 2935 2940 2936 2924 2906 2886 2873 2865 2852 2829 2806 2803 2819 2840 2858 2878 2910 2944
2131B944K1lk3k2pLqk7l1qJ4J9J0MLlj4j2%J2Lk0m3m7k6MK1J2pj6kJ9K4Mk1l5l1k0j6j2LK5
$$ 2944 2965 2962 2939 2917 2910 2913 2905 2878 2847 2839 2853 2872 2882 2886 2889 2886 2872 2860 2860 2872 2875 2855 2812 2765 2739 2743 2764 2776 2769 2753 2751 2770 2794 2798 2777 2742 2711 2691 2675 2663 2666 2691
2126B691L6J9j1k3%L7M8K4qj4LJ6R%QK7L1J1j5l2k7rJ0J4O%OJ3Qj0j9j2kjqj5k0j9j6j4j4
$$ 2691 2727 2746 2735 2712 2712 2749 2797 2821 2813 2799 2802 2818 2827 2827 2835 2862 2893 2904 2889 2857 2830 2821 2831 2845 2851 2851 2857 2870 2878 2868 2849 2837 2835 2834 2826 2811 2791 2772 2756 2742 2728
2121B728mJ8L5K8%j9j4NK6M3N3M3J5j0j6j6k1k3pJ7K6J7Mkqj3j2%J4K1J3oj8j4PK4J9JpLJ2
$$ 2728 2724 2742 2777 2805 2805 2786 2772 2777 2803 2846 2899 2942 2957 2947 2931 2915 2894 2871 2864 2881 2907 2924 2928 2926 2918 2905 2893 2893 2907 2928 2941 2935 2917 2903 2910 2934 2953 2954 2947 2950 2962
2116B962J5J6K2K3J0jJJ2J2j1l7m6k9lJ8K6K6J9NopjmpNL8N8M1Jk2j3OJ1LlnJJ5K4J9%r%J7
$$ 2962 2977 2993 3015 3038 3048 3047 3048 3060 3072 3061 3024 2978 2949 2946 2964 2990 3016 3035 3040 3034 3027 3026 3022 3015 3020 3058 3116 3157 3158 3136 3123 3129 3140 3143 3140 3135 3136 3151 3175 3194 3194 3185 3185 3202
2110C202J3pk5k5j2lpj5j4kJ4K0K0K2K6K4K0K0K0Rrj7qMNL%nj4j2MJ9J1rk0j2lkmNK0K9L0
$$ 3202 3215 3208 3183 3158 3146 3143 3136 3121 3107 3105 3119 3139 3159 3181 3207 3231 3251 3271 3291 3300 3291 3274 3266 3270 3275 3278 3278 3273 3259 3247 3251 3270 3281 3272 3252 3240 3237 3235 3231 3236 3256 3285 3315
2105C315K5K3K2J9RllJ0K7L2K3Kj8l1k4%K5L2J9jj0j0nk%KJ0K0K4J3%mJJ0J7K4K6J9PMPLj0
$$ 3315 3340 3363 3385 3404 3413 3410 3407 3417 3444 3476 3499 3501 3483 3452 3428 3428 3453 3485 3504 3503 3493 3483 3478 3476 3476 3478 3488 3508 3532 3545 3545 3541 3542 3552 3569 3593 3619 3638 3645 3649 3656 3659 3649
2100C649k2k0qPJ7K4L1L9N0N3M0J6mj0qmkOJ2J3Lqj0JJ8K4J8J2J7K6J8nk1j4NJ4Rmj2j3nJ
$$ 3649 3627 3607 3599 3606 3623 3647 3678 3717 3767 3820 3860 3876 3872 3862 3854 3850 3848 3854 3866 3879 3882 3874 3864 3865 3883 3907 3925 3937 3954 3980 3998 3993 3972 3958 3963 3977 3986 3982 3970 3957 3952 3953
2095C953LOJ5K3J4nrOK1K2J9K2K5J2jMK1L1K5J6NkQM0P1O0J1l6l9rJ5J8PjnokOK0L6L9K4L
$$ 3953 3956 3962 3977 4000 4014 4009 4000 4006 4027 4049 4068 4090 4115 4127 4126 4130 4151 4182 4207 4223 4228 4226 4234 4274 4345 4405 4416 4380 4341 4332 4347 4365 4372 4371 4366 4360 4358 4364 4384 4420 4459 4483 4486
2090D486nNJ6J0jmOK2M3O2O5M7K0J1J3J2%jK3N5P5O8M7K5J6K1K9L4L0K7K7L1L1J9LlQJ9J0
$$ 4486 4481 4486 4502 4512 4511 4507 4513 4535 4578 4640 4705 4752 4772 4783 4796 4808 4808 4807 4830 4885 4960 5028 5075 5100 5116 5137 5166 5200 5230 5257 5284 5315 5346 5365 5368 5365 5373 5392 5402
2085E402j0j7%Rj1m1m2qK7L6L1K8K6J7J5L6O6Q2P3N2L4K1J7J7J5J0J0K1L9N0N8O9Q0Q1P3O8
$$ 5402 5392 5375 5375 5384 5373 5332 5290 5282 5309 5345 5376 5404 5430 5447 5462 5498 5564 5646 5719 5771 5805 5826 5843 5860 5875 5885 5895 5916 5955 6005 6063 6132 6212 6293 6366 6434
2080F434Q0R6J01Q9P1O0O7Q6J04J06R5Q7R3J11J27J35J28J14J09J26J52J70J68J65J70J77
$$ 6434 6514 6610 6711 6800 6871 6931 6998 7084 7188 7294 7389 7476 7569 7680 7807 7942 8070 8184 8293 8419 8571 8741 8909 9074 9244 9421
2077I421J77J86K13K48K61K47K31K39K68K94L14L41L81M20M41M53M77N15N52N83O20O73P30
$$ 9421 9598 9784 9997 10245 10506 10753 10984 11223 11491 11785 12099 12440 12821 13241 13682 14135 14612 15127 15679 16262 16882 17555 18285
2074A8285P72Q06Q54R15R70J006J046J110J196J282J364J443J522J604J695J801J910K021
$$ 18285 19057 19863 20717 21632 22602 23608 24654 25764 26960 28242 29606 31049 32571 34175 35870 37671 39581 41602
2072D1602K148K313K513K725K938L169L429L722M048M417M839N315N843O434P099P830Q608
$$ 41602 43750 46063 48576 51301 54239 57408 60837 64559 68607 73024 77863 83178 89021 95455 102554 110384 118992
2070A18992R413J0227J1003J1673J2151J2354J2207J1639J0595R049P029M609J904r38l744
$$ 118992 128405 138632 149635 161308 173459 185813 198020 209659 220254 229303 236332 240941 242845 241907 238163
2068B38163o336q576j0380j1708j2544j2908j2856j2471j1835j1022j0114r189q302p475o722
$$ 238163 231827 223251 212871 201163 188619 175711 162855 150384 138549 127527 117413 108224 99922 92447 85725
2066H5725o048n444m896m403l983l635l336l065k816k592k391k215k065j930j784j626j485
$$ 85725 79677 74233 69337 64934 60951 57316 53980 50915 48099 45507 43116 40901 38836 36906 35122 33496 32011
2064C2011j386j316j245j170j106j051r90r24q77q43q01p39o83o57o49o38o19o03n82n46n05
$$ 32011 30625 29309 28064 26894 25788 24737 23747 22823 21946 21103 20302 19563 18880 18223 17574 16936 16317 15714 15132 14586 14081
2062A4081m76m61m44m18l89l65l41l19l03k92k73k42k15j99j88j73j55j45j46j48j44j22q9
$$ 14081 13605 13144 12700 12282 11893 11528 11187 10868 10565 10273 10000 9758 9543 9344 9156 8983 8828 8683 8537 8389 8245 8123 8034
2059H034n5l5l2k8j2OJ8K6L5L9L5L7O1J01J32J47J60J77J85J78J75J91K16K30K32K32K28K14
$$ 8034 7979 7944 7912 7884 7872 7878 7896 7922 7957 7996 8031 8068 8129 8230 8362 8509 8669 8846 9031 9209 9384 9575 9791 10021 10253 10485 10713 10927
2056A0927J90J68J44J01M1k0o9j19j73k16k40k49k64k89l17l39l53l54l46l34l21l01k68k36
$$ 10927 11117 11285 11429 11530 11571 11551 11482 11363 11190 10974 10734 10485 10221 9932 9615 9276 8923 8569 8223 7889 7568 7267 6999 6763
2053F763k21k17k18k13k04j86j59j35j28j34j32j19j03r4r2r2r3r3q9q3q4q5q1o5m8m0l9m3
$$ 6763 6542 6325 6107 5894 5690 5504 5345 5210 5082 4948 4816 4697 4594 4500 4408 4316 4223 4130 4041 3958 3874 3789 3708 3643 3595 3555 3516 3473
2049C473n1n6m7k6j3k0l5m1l7l1l0k9l3l9m4m4l8l2k1oMKqj7j9j7j1kjqj2kMrl3l9k3qj9m1
$$ 3473 3422 3366 3319 3293 3280 3260 3225 3184 3147 3116 3086 3057 3024 2985 2941 2897 2859 2827 2806 2800 2804 2806 2798 2781 2762 2745 2734 2732 2731 2723 2711 2709 2713 2704 2671 2632 2609 2601 2582 2541
2044B541n0l9j4RJ6qm5o2l9nMoqLQmj3j0nrj3oLQRJ0jk8m4l2KK2K0J0Lmj5k2k3k5l0l0k2j4
$$ 2541 2491 2452 2438 2447 2463 2455 2410 2348 2309 2304 2308 2302 2294 2297 2305 2301 2288 2278 2273 2264 2251 2245 2248 2256 2265 2275 2274 2246 2202 2170 2172 2194 2214 2224 2227 2223 2208 2186 2163 2138 2108 2078 2056 2042
2039B042j0rrkJ0K6K8Ok4l5k5j7j9j0J7L7L3J7J1J6J7J2Nlj8k3j0ONrj2onq%J9K3Kk3k9k5
$$ 2042 2032 2023 2014 2012 2022 2048 2076 2082 2058 2023 1998 1981 1962 1952 1969 2006 2039 2056 2067 2083 2100 2112 2117 2114 2096 2073 2063 2069 2074 2065 2053 2047 2042 2034 2034 2053 2076 2078 2055 2026 2001
2034B001k2j7KK5L1J9MlKJ3J5Nj0j4j2k4m8n6l3qnj6j4KJ4J5J9K9K7Rj0j4rMJ4J5Jj3pOQo
$$ 2001 1979 1962 1964 1989 2020 2039 2043 2040 2042 2055 2070 2075 2065 2051 2039 2015 1967 1911 1878 1870 1865 1849 1835 1837 1851 1866 1885 1914 1941 1950 1940 1926 1917 1921 1935 1950 1951 1938 1931 1937 1945 1939
2029A939j3mJnj1q%jKJ4K6K5J2QJ0Lj2k1j9qJRJ7J7RJmoj3k0k3k0j5j6k2k0j4onkJ1K2J3q
$$ 1939 1926 1922 1923 1918 1907 1899 1899 1898 1900 1914 1940 1965 1977 1985 1995 1998 1986 1965 1946 1938 1939 1948 1965 1982 1991 1992 1988 1982 1969 1949 1926 1906 1891 1875 1853 1833 1819 1813 1808 1806 1817 1839 1852 1844
2023A844j4KK4L3L1L1K6J0rj4j1j8l1k5PL9M3K1lj9k8l0k2pQJ8K2J8%j8k6j7omm%OJ0ONRJ9
$$ 1844 1830 1832 1856 1889 1920 1951 1977 1987 1978 1964 1953 1935 1904 1879 1886 1925 1968 1989 1986 1967 1939 1909 1887 1880 1888 1906 1928 1946 1946 1928 1902 1885 1879 1875 1871 1871 1877 1887 1893 1898 1907 1926
2018A926K6K8K4J5kk0k6j4RK0J0j5m0n0m3k2jJ3J2JjJ5L8M5K3nj7r%J%J%opMJ6K1K6L5M2K9
$$ 1926 1952 1980 2004 2019 2017 1997 1971 1957 1966 1986 1996 1981 1941 1891 1848 1826 1825 1838 1850 1851 1850 1865 1903 1948 1971 1966 1949 1940 1940 1941 1941 1942 1942 1936 1929 1933 1949 1970 1996 2031 2073 2102
2013B102Lj5j2KQlk4l7k7JK7K4Lj6j6lRK0K7K9K3J7J5J8K2K5K0RMJ7L9N5N6N7O7P5P3P1Q2
$$ 2102 2105 2090 2078 2080 2088 2085 2061 2024 1997 1998 2025 2049 2052 2036 2020 2017 2026 2046 2073 2102 2125 2142 2157 2175 2197 2222 2242 2251 2255 2272 2311 2366 2422 2479 2546 2621 2694 2765 2847
2008B847J04J21J19J09R8Q7P5O5N2L7J6ol2n6p2p4p1p0p9r5j15j24j16r4p3o4o2n4m3m1m7
$$ 2847 2951 3072 3191 3300 3398 3485 3560 3625 3677 3714 3730 3724 3692 3636 3564 3490 3419 3349 3270 3175 3060 2936 2820 2726 2653 2589 2527 2473 2430 2389 2342
2005B342m9m6m2l8k7qRJ4RM%oj5k0j3mLKkjJmj7j8JK2K3J0RK1K9J8KorqPL4N2M2J9J3K5L6
$$ 2342 2293 2247 2205 2167 2140 2132 2141 2155 2164 2168 2168 2162 2147 2127 2114 2110 2113 2115 2113 2112 2113 2109 2092 2074 2075 2097 2120 2130 2139 2160 2189 2207 2209 2203 2194 2186 2193 2227 2279 2321 2340 2353 2378 2414
1999B414M2N4P0P9O6M3K4J8K6M9P3P4M6Pk4m4o0o8o8o7p6q7q2o4m2k7k2j8j8j7j8j9k3k3k1
$$ 2414 2456 2510 2580 2659 2725 2768 2792 2810 2836 2885 2958 3032 3078 3085 3061 3017 2957 2889 2821 2754 2678 2591 2509 2445 2403 2376 2354 2336 2318 2301 2283 2264 2241 2218 2197
1995B197j7j8j5rqj4j9j2jkj6k1j3qj7k6k2oNMkqj3j8j9j2%J7K9L2K6K2K6K9J6j1l2l6k8j5
$$ 2197 2180 2162 2147 2138 2130 2116 2097 2085 2084 2082 2066 2045 2032 2024 2007 1981 1959 1953 1958 1962 1960 1952 1939 1921 1902 1890 1890 1907 1936 1968 1994 2016 2042 2071 2087 2076 2044 2008 1980 1965
1990A965okmmOK1K6K0J5J5Nj8l4k3MJ3ql3l5j2J4K3J5JkMJ0Jj0j0MJ5J3NNJ8K9K7J1j3l0l0
$$ 1965 1959 1957 1953 1949 1955 1976 2002 2022 2037 2052 2057 2039 2005 1982 1986 1999 1991 1958 1923 1911 1925 1948 1963 1964 1962 1966 1976 1977 1967 1957 1961 1976 1989 1994 1999 2017 2046 2073 2084 2071 2041 2011
1985B011j7lPJ3J3Npj1mkrj1%J7J6MLJ7K9K3J1%j1l1m0k5MJ9J1kojPJ2J8J9J3jqkJ2K0J4L
$$ 2011 1994 1991 1998 2011 2024 2029 2022 2011 2007 2005 1996 1985 1985 2002 2018 2022 2025 2042 2071 2094 2105 2105 2094 2063 2023 1998 2002 2021 2032 2030 2024 2023 2030 2042 2060 2079 2092 2091 2083 2081 2093 2113 2127 2130
1980B130%Kmj4k0j4j1j2j1lLkj7k8k1lK2M0L7J7knlnrLJ9K1Mpnoj6k3j2PJ3RQJ1jk5l7k7o
$$ 2130 2130 2132 2128 2114 2094 2080 2069 2057 2046 2043 2046 2044 2027 1999 1978 1975 1997 2037 2074 2091 2089 2084 2081 2076 2067 2070 2089 2110 2114 2107 2102 2096 2080 2057 2045 2052 2065 2074 2082 2093 2092 2067 2030 2003 1997
1974A997J3K7M0M6M1L0J8%k0l1k3nJ3J9J4Mrj2jJ3J5NpoLQPQJ8K9L2K6J3qk7l3k2j1j3j6n
$$ 1997 2010 2037 2077 2123 2164 2194 2212 2212 2192 2161 2138 2133 2146 2165 2179 2183 2174 2162 2161 2174 2189 2194 2187 2181 2184 2192 2199 2207 2225 2254 2286 2312 2325 2317 2290 2257 2235 2224 2211 2195 2190
1969B190J7K7J4JLJ2J4J1J3J5Jj6j7mJrj1PL5M9M5K8Pj1j5lJ5K3K5K5J9Jk1k7j1J0K0J6Nm
$$ 2190 2207 2234 2248 2249 2252 2264 2278 2289 2302 2317 2318 2302 2285 2281 2282 2273 2262 2269 2304 2353 2398 2426 2433 2422 2407 2404 2419 2442 2467 2492 2511 2512 2491 2464 2453 2463 2483 2499 2504 2500
1964B500pnjKOJ0J2J0PNPJ1J7K0J6Mj1j7j3lJ0K2K3J1mnJ2K8L6L6L6L6K7Nj2j1QK0J3j5l6
$$ 2500 2493 2488 2487 2489 2495 2505 2517 2527 2534 2539 2546 2557 2574 2594 2610 2614 2603 2586 2573 2570 2580 2602 2625 2636 2632 2627 2639 2667 2703 2739 2775 2811 2838 2843 2831 2820 2828 2848 2861 2846 2810
1959B810l2lL3N8O2M9K3jj6k0j6nRJ9K0K0K0J8Rkpml%QK0K5J9K0L5N4N6M3K1Ko%J7L1K7J7
$$ 2810 2778 2775 2808 2866 2928 2977 3000 2999 2983 2963 2947 2942 2951 2970 2990 3010 3030 3048 3057 3055 3048 3044 3041 3041 3049 3069 3094 3113 3133 3168 3222 3278 3321 3342 3344 3338 3338 3355 3386 3413 3430
1954C430J3K2K4J3%LJ9L8N3O0N6M2K4J9K8L6L0J6RJ7K8L4L2K7J3koQK9M5N5O4P2O4M3K5K6
$$ 3430 3443 3465 3489 3502 3502 3505 3524 3562 3615 3675 3731 3773 3797 3816 3844 3880 3910 3926 3935 3952 3980 4014 4046 4073 4086 4084 4078 4086 4115 4160 4215 4279 4351 4415 4458 4483 4509
1950D509L4L9L4K6K9M2O7R0R5Q0N6L9L5L3L7M8N8N6M2L4M5O3P5P4P1O6O1N5N5O1O6O8P0P2
$$ 4509 4543 4582 4616 4642 4671 4713 4780 4870 4965 5045 5101 5140 5175 5208 5245 5293 5351 5407 5449 5483 5528 5591 5666 5740 5811 5877 5938 5993 6048 6109 6175 6243 6313 6385
1945F385P7P3O7O7Q1R6R7Q4P5Q1R3J02J09J21J24J12Q9P7P7Q3Q7R7J16J31J31J18J08J05J08
$$ 6385 6462 6535 6602 6669 6750 6846 6943 7027 7102 7183 7276 7378 7487 7608 7732 7844 7933 8010 8087 8170 8257 8354 8470 8601 8732 8850 8958 9063 9171
1942I171J06J01R9J08J24J35J28J10R7R0Q1P0P2R0J08J08R2P9P4P0O8P1Q0Q1O7M4L0L3M7N8
$$ 9171 9277 9378 9477 9585 9709 9844 9972 10082 10179 10269 10350 10420 10492 10582 10690 10798 10890 10969 11043 11113 11181 11252 11332 11413 11480 11524 11554 11587 11634 11692
1938A1692N2K6j0l5l8j8PJ7%k8m7m2k8l2o1r1j01q7p5q6j19j43j36j10q9r3j10j17j13j11
$$ 11692 11744 11770 11760 11725 11687 11669 11676 11693 11693 11665 11618 11576 11548 11516 11455 11364 11263 11176 11101 11015 10896 10753 10617 10507 10418 10325 10215 10098 9985 9874
1935I874j21j37j44j35j13r8r9j15j24j21j06r7j03j14j20j15j05r2q5q7r4r6q7p4o4o5p5
$$ 9874 9753 9616 9472 9337 9224 9126 9027 8912 8788 8667 8561 8464 8361 8247 8127 8012 7907 7815 7730 7643 7549 7453 7366 7292 7228 7163 7088
1931G088q9j02j07j04q7o8n6n8o8p0o3o5p9q6p1m3l1m4n6n3n0o8j01j15j00p8o8o5n1l3l0
$$ 7088 6999 6897 6790 6686 6599 6531 6475 6417 6349 6279 6216 6151 6072 5986 5915 5872 5841 5797 5741 5688 5638 5570 5469 5354 5254 5176 5108 5043 4992 4959 4929
1927D929m4n1m3l3m0n4m9l3l0n1o1m5j6qk5m3m6l8l2l0k5j8j3j3j7k6l6m2m2l8l2k9l2l8l7
$$ 4929 4885 4834 4791 4758 4718 4664 4615 4582 4552 4501 4440 4395 4379 4371 4346 4303 4257 4219 4187 4157 4132 4114 4101 4088 4071 4045 4009 3967 3925 3887 3855 3826 3794 3756 3719
1923C719k6j7k7m4m9l4rOOpk6m2m2l0j7rmlqj6k8m4o7p4n1j0Rkj6j1NLj3k3j9j1rpqj2j8j9
$$ 3719 3693 3676 3649 3605 3556 3522 3513 3519 3525 3518 3492 3450 3408 3378 3361 3352 3348 3345 3337 3321 3293 3249 3182 3108 3057 3047 3056 3054 3038 3027 3032 3035 3022 2999 2980 2969 2960 2953 2945 2933 2915 2896
1918B896k2l1l8k7j0nj3j8j0lJLOMprJJ2Qmj5k2l3l8k9j2MJ2J2Oqk2k7k6k5k4j1OJ4Nmj0j3
$$ 2896 2874 2843 2805 2778 2768 2763 2750 2732 2722 2719 2720 2723 2729 2733 2726 2717 2718 2730 2738 2734 2719 2697 2664 2626 2597 2585 2589 2601 2613 2619 2611 2589 2562 2536 2511 2487 2476 2482 2496 2501 2497 2487 2474
1913B474k1k7k8k3k0k3k3j5qnpomjkkLJ0J2RQJ5J9J1j0k8l2k3rKJ0J7J7J2%m%J1J2Jk1l8m4
$$ 2474 2453 2426 2398 2375 2355 2332 2309 2294 2286 2281 2274 2268 2264 2263 2261 2259 2262 2272 2284 2293 2301 2316 2335 2346 2336 2308 2276 2253 2244 2246 2256 2273 2290 2302 2302 2298 2298 2309 2321 2322 2301 2263 2219
1908B219m2l8l5k4rJ0K1K5K8K8K0mk9m3l5j7LJ2J2kj9l2l1k0pMJ7K3J6jj2rOJ7J7Qmj2j6j6
$$ 2219 2177 2139 2104 2080 2071 2081 2102 2127 2155 2183 2203 2199 2170 2127 2092 2075 2078 2090 2102 2100 2081 2049 2018 1998 1991 1995 2012 2035 2051 2050 2038 2029 2035 2052 2069 2077 2073 2061 2045 2029
1903B029k1l6n7o8n5k7jQOQJ0J2RRJ4K4K9L0K3RnoKPjqnMKj2j7mJ7K3Qj4k5k1oJ0J7J1j6m4
$$ 2029 2008 1972 1915 1847 1792 1765 1764 1772 1778 1786 1796 1808 1817 1826 1840 1864 1893 1923 1946 1955 1950 1944 1946 1953 1952 1944 1939 1943 1945 1933 1916 1912 1929 1952 1960 1946 1921 1900 1894 1904 1921 1932 1916 1872
1897A872m8k1J2J6ok7l2k7k1j1OK2K3J6J2QLjPJ9K5J8Qql2m3k5J0K5Nj6j0K0L9K6ll1m2l7
$$ 1872 1824 1803 1815 1831 1825 1798 1766 1739 1718 1707 1713 1735 1758 1774 1786 1794 1797 1796 1803 1822 1847 1865 1873 1865 1833 1790 1765 1775 1800 1805 1789 1779 1799 1838 1864 1861 1830 1788 1751
1892A751j9kQPPQPLlp%J5K1Pj0qJ4K4Jm0n9m6k4j7k0j5JK3L8L9K8J3ONlj1j7j7j7j5pL%j7
$$ 1751 1732 1730 1738 1745 1752 1760 1767 1770 1767 1760 1760 1775 1796 1803 1793 1785 1799 1823 1824 1784 1725 1679 1655 1638 1618 1603 1604 1627 1665 1704 1732 1745 1751 1756 1753 1742 1725 1708 1691 1676 1669 1672 1672 1655
1887A655l3l3j3J2L3L5J7j0k3j7orj6rJ2K4J2j1k2j1RK2K3J6J3J2J2J3J5J4J2RJ3K7L8L7K5
$$ 1655 1622 1589 1576 1588 1621 1656 1673 1663 1640 1623 1617 1608 1592 1583 1595 1619 1631 1620 1598 1587 1596 1618 1641 1657 1670 1682 1694 1707 1722 1736 1748 1757 1770 1797 1835 1872 1897
1883A897J8J8K5L0K6J0j1k5k5j7j5k4l6m1m4m2l1j3klj4k7m1m7l2JK8K4Kj3j1llnkMPJ0J4
$$ 1897 1915 1933 1958 1988 2014 2024 2013 1988 1963 1946 1931 1907 1871 1830 1786 1744 1713 1700 1698 1695 1681 1654 1613 1566 1534 1535 1563 1587 1589 1576 1565 1562 1559 1554 1552 1556 1563 1573 1587
1878A587J5R%ljJNQPlj6j8j0jlqj4j5j1MK3L1K7J9J3Q%oprk3l9m0k4j7k1j5RL2L1J4%%Koj5
$$ 1587 1602 1611 1611 1608 1607 1608 1613 1621 1628 1625 1609 1591 1581 1580 1577 1569 1555 1540 1529 1533 1556 1587 1614 1633 1646 1654 1654 1648 1641 1632 1609 1570 1530 1506 1489 1468 1453 1462 1494 1525 1539 1539 1539 1541 1535 1520
1872A520k0j8j8j6j9k0j6%J7J9LroPJ1MmkMJ0J0M%lj1k0k8k5j9j9k2j4JOj1k5j4J0K2K4K9
$$ 1520 1500 1482 1464 1448 1429 1409 1393 1393 1410 1429 1432 1423 1417 1424 1435 1439 1435 1433 1437 1447 1457 1461 1461 1458 1447 1427 1399 1374 1355 1336 1314 1300 1301 1307 1296 1271 1257 1267 1289 1313 1342
1867A342L9L4J4LJ5K3Nk1k4mJ3RjKJ7K7K1J3J1J8K0Mk5m6m5l3k4j9j1klj0rQK3K1Kj5k1j9
$$ 1342 1381 1415 1429 1432 1447 1470 1475 1454 1430 1426 1439 1448 1447 1449 1466 1493 1514 1527 1538 1556 1576 1580 1555 1509 1464 1431 1407 1388 1377 1375 1372 1362 1353 1361 1384 1405 1407 1392 1371 1352
1862A352k0j6mJ0J6QknllolJ2K5K5Rj1k3k0jK8M7M1J8kqroJRKk0l6k4LK1K2J4Mrk0j8qmk1
$$ 1352 1332 1316 1312 1322 1338 1346 1344 1339 1336 1333 1327 1324 1336 1361 1386 1395 1384 1361 1341 1340 1368 1415 1456 1474 1472 1464 1455 1449 1450 1459 1461 1441 1405 1381 1384 1405 1427 1441 1445 1436 1416 1398 1390 1386 1365
1857A365l6k7mQok7k8qJ3J7R%ljLQJ0QMMJ0Nj6m1n1l7j5nprkJ1J8J6J1J1J1RQJ4K8L2K1J0
$$ 1365 1329 1302 1298 1306 1300 1273 1245 1237 1250 1267 1276 1276 1273 1272 1275 1283 1293 1301 1305 1309 1319 1324 1308 1267 1216 1179 1164 1159 1152 1143 1141 1152 1170 1186 1197 1208 1219 1228 1236 1250 1278 1310 1331 1341
1851A341QJ1Ppj6j4kRJ5J0j0k9l0k4k2l0k7rNMj0j5j2KK7N3N2J9k0k9j0OJpj0o%NRRJ2J9L1
$$ 1341 1349 1360 1367 1360 1344 1330 1328 1337 1352 1362 1352 1323 1293 1269 1247 1217 1190 1181 1186 1190 1180 1165 1153 1155 1182 1235 1287 1306 1286 1257 1247 1253 1254 1247 1237 1231 1231 1236 1245 1254 1266 1285 1316
1846A316K8J3pj9k6k5qJ4K6J8NKMjj0j7j4rLK2L5L3K0Qjj5l1l3j7LJ3J0PJ1J6J1lj4j3lnk4
$$ 1316 1344 1357 1350 1331 1305 1280 1272 1286 1312 1330 1335 1337 1341 1340 1330 1313 1299 1290 1293 1315 1350 1383 1403 1411 1410 1395 1364 1331 1314 1317 1330 1340 1347 1358 1374 1385 1382 1368 1355 1352 1347 1323
1841A323m4m7l0j0OJ6J9J6PNRJ2Rkj5k8l5k9j2QK1K5J5mj4oJ0J6QKJ%rj6j2oqj5j2kJ1J9K7
$$ 1323 1279 1232 1202 1192 1198 1214 1233 1249 1256 1261 1270 1282 1291 1289 1274 1246 1211 1182 1170 1178 1199 1224 1239 1235 1221 1215 1225 1241 1249 1251 1252 1252 1243 1227 1215 1209 1201 1186 1174 1172 1183 1202 1229
1836A229K8K1Pmqqj0j1rj0j1qlLQJ2J3Q%moj1k2k8k4j3JJ4K1J8Lj1j5mJ2K8L5K8Pj5k1j1L
$$ 1229 1257 1278 1285 1281 1273 1265 1255 1244 1235 1225 1214 1206 1203 1206 1214 1226 1239 1247 1247 1243 1237 1226 1204 1176 1152 1139 1140 1154 1175 1193 1196 1185 1170 1166 1178 1206 1241 1269 1276 1261 1240 1229 1232
1831A232Moj5rOJ7J6QkpnMJ5K4J9Kj4k1j3KPrl3m0j7J5K5J4jjJoj0nOP%mmqrKK3L2K2RN%j6
$$ 1232 1236 1230 1215 1206 1212 1229 1245 1253 1251 1244 1239 1243 1258 1282 1301 1303 1289 1268 1255 1257 1264 1255 1222 1182 1165 1180 1205 1219 1218 1217 1218 1212 1202 1197 1203 1210 1210 1206 1202 1194 1185 1187 1210 1242 1264 1273 1278 1278 1262
1825A262l4l4j2RJ4Nnj5k1k0qOJ0M%NJ4J3Kp%J0Pqk3l0l3l8l6j8KJ1J4K3L8L9K2OOMj6l7l8
$$ 1262 1228 1194 1182 1191 1205 1210 1205 1190 1169 1149 1141 1147 1157 1161 1161 1166 1180 1193 1195 1188 1188 1198 1205 1197 1174 1144 1111 1073 1037 1019 1021 1032 1046 1069 1107 1146 1168 1174 1180 1184 1168 1131 1093
1819A093j8jLNJ1RlrJJ2Qj%OJo%K2L2J8loNQjj0j1ro%J0K0K9L4K3ol9m7k1J2K4J2nj3j9k8
$$ 1093 1075 1074 1077 1082 1093 1102 1099 1090 1091 1103 1111 1110 1110 1116 1117 1111 1111 1133 1165 1183 1180 1174 1179 1187 1186 1176 1165 1156 1150 1150 1160 1180 1209 1243 1266 1260 1221 1174 1153 1165 1189 1201 1196 1183 1164 1136
1814A136l0j3J4L1K6J4MJjljLlj3j5lJ4J8QjMJ9K9K4J1KJ1K4K1ol7n0m1k2jK2L6L0Pj3j5m
$$ 1136 1106 1093 1107 1138 1164 1178 1182 1183 1182 1179 1178 1181 1178 1165 1150 1147 1161 1179 1187 1186 1190 1209 1238 1262 1273 1275 1286 1310 1331 1325 1288 1238 1197 1175 1174 1196 1232 1262 1269 1256 1241 1237
1808A237Ljoj0rnLJ3J8J4Mrj7j7j3j2j6j5KL0N3N4L3Oj1j0ooj6k2k2j7j6j5oQJ7J3JnOL3N5
$$ 1237 1240 1239 1233 1223 1214 1209 1212 1225 1243 1257 1261 1252 1235 1218 1205 1193 1177 1162 1164 1194 1247 1301 1334 1340 1329 1319 1313 1307 1291 1269 1247 1230 1214 1199 1193 1201 1218 1231 1232 1227 1233 1266 1321
1803A321M4%m9o8n5k9qjqj4pJ8L7K9Jj7j3KJ0J1J0lk1l1k2j0j4k0qJ9L3K5RMOMKkoj0rkJN
$$ 1321 1365 1365 1316 1248 1193 1164 1156 1155 1147 1133 1126 1144 1181 1210 1211 1194 1181 1183 1193 1204 1214 1211 1190 1159 1137 1127 1113 1093 1085 1104 1137 1162 1171 1175 1181 1185 1187 1185 1179 1169 1160 1158 1159 1164
1798A164J0J5Jk5l5j0K2K8Oj0pJqk2k2oJ0J6J0jpmNJ1OnqnJNPJ1J5J2Jj1j9j8j6j6j6qQK1
$$ 1164 1174 1189 1190 1165 1130 1120 1142 1170 1176 1166 1159 1160 1152 1130 1108 1102 1112 1128 1138 1137 1130 1126 1131 1142 1148 1143 1135 1130 1131 1136 1143 1154 1169 1181 1182 1171 1152 1134 1118 1102 1086 1078 1086 1107
1792A107K3K0K6M1M6L3J5RJ3Ok2m9n2l1oJorKJ2QkkJ0J5Nrj4qnj4k3k7k2rQK2K1Mj2j4mKk
$$ 1107 1130 1150 1176 1217 1263 1296 1311 1320 1333 1339 1317 1268 1216 1185 1179 1180 1174 1165 1167 1179 1187 1185 1183 1193 1208 1213 1204 1190 1182 1177 1163 1140 1113 1091 1082 1090 1112 1133 1137 1125 1111 1107 1109 1107
1787A107qkJ5K7K3Rl%J3K5K3J0oj5j7k1k9l2k4j1MJ5K6L0K2Mj2j5j0mLJ2J9J6OjLJ3K3K2Q
$$ 1107 1099 1097 1112 1139 1162 1171 1168 1168 1181 1206 1229 1239 1233 1218 1201 1180 1151 1119 1095 1084 1088 1103 1129 1159 1181 1185 1173 1158 1148 1144 1147 1159 1178 1194 1200 1199 1202 1215 1238 1260 1268
1782A268k0m1l9j7nj9m4n3l6pJ8L7M1K7Kj5j5qKJ2K2K3J0prJNj0k5j9MK0J3nj4qMJ4K2K2R
$$ 1268 1248 1207 1168 1151 1146 1127 1083 1030 994 987 1005 1042 1083 1110 1112 1097 1082 1074 1076 1088 1110 1133 1143 1136 1127 1128 1133 1123 1098 1079 1083 1103 1116 1111 1097 1089 1093 1107 1129 1151 1160
1777A160j1k6k3qRK3L0K5Ok0l7l5k0LK3K8K1J2J3K4K6J4jmLQOMOOlj4j9j5j6k5l6l1j1RJ7
$$ 1160 1149 1123 1100 1092 1101 1124 1154 1179 1185 1165 1128 1093 1073 1076 1099 1127 1148 1160 1173 1197 1223 1237 1236 1232 1235 1243 1249 1253 1259 1265 1262 1248 1229 1214 1198 1173 1137 1106 1095 1104 1121
1772A121J6J6J7J2PJ0K4L1K1Lj3k1k6k7k6k3j8qOJ9K6L2L7L0Rj1j8j4j6k4k7j7nKJ2K4K4R
$$ 1121 1137 1153 1170 1182 1189 1199 1223 1254 1275 1278 1265 1244 1218 1191 1165 1142 1124 1116 1122 1141 1167 1199 1236 1266 1275 1264 1246 1232 1216 1192 1165 1148 1143 1145 1157 1181 1205 1214
1767A214j3k4k6k9l0j8MJ4Jk7l9k1K0N1M4Rk7l3j5J%j0j3nJ6L6M8L7J4%LJ2Oj2k1j1MRLjk
$$ 1214 1201 1177 1151 1122 1092 1074 1078 1092 1093 1066 1027 1006 1026 1077 1121 1130 1103 1070 1055 1056 1056 1046 1033 1028 1044 1080 1128 1165 1179 1179 1182 1194 1200 1188 1167 1156 1160 1169 1172 1171 1169
1762A169lrj4j0OK7L6K8J3PJ5K1J6jj9l4l8l0j5pj3k2k5k3j8j0NK2K2J3J2K6M1L8K7K3K2Q
$$ 1169 1166 1157 1143 1133 1139 1166 1202 1230 1243 1250 1265 1286 1302 1301 1282 1248 1210 1180 1165 1158 1145 1123 1098 1075 1057 1047 1052 1074 1096 1109 1121 1147 1188 1226 1253 1276 1298 1306
1758A306j8l1k0jP%j1j2j2j3j4rKJ0J1NJJLJkjLOMLNJ2J2Kj0j0MJ8J5mk1k1mJ6K8L0K2J6J5
$$ 1306 1288 1257 1237 1236 1243 1243 1232 1220 1208 1195 1181 1172 1174 1184 1195 1200 1201 1202 1205 1206 1204 1203 1206 1212 1216 1219 1224 1236 1248 1250 1240 1230 1234 1252 1267 1263 1242 1221 1217 1233 1261 1291 1313 1329 1344
1752A344K1K4J8J3K2L9N2N2M2L1K1J9L0M4M8L8L4N3Q8J12J19J14J06R4P4N3L5J4j6m9p0p6
$$ 1344 1365 1389 1407 1420 1442 1481 1533 1585 1627 1658 1679 1698 1728 1772 1820 1858 1892 1945 2033 2145 2264 2378 2484 2578 2652 2705 2740 2754 2738 2689 2619 2543
1748B543p1o8o6o2n5m5m1m9o0o7o3n1l3j3QK1K0RLRJ2LqKL7P3Q1O4M7M9N4M8M2N2Q1J03J01
$$ 2543 2472 2404 2338 2276 2221 2176 2135 2086 2026 1959 1896 1845 1812 1799 1807 1828 1848 1857 1860 1869 1881 1884 1876 1878 1915 1988 2069 2133 2180 2229 2283 2331 2373 2425 2506 2609 2710
1744B710R0R9J34J65J75J70J78K09K46K63K62K56K52K35J85R8jq7j45j83k13k36k48k47k40
$$ 2710 2800 2899 3033 3198 3373 3543 3721 3930 4176 4439 4701 4957 5209 5444 5629 5727 5726 5639 5494 5311 5098 4862 4614 4367 4127
1741D127k33k18j91j58j31j17j09j03r4q4o9n4m7m6l9k1lNRJ2J2OkKK0M4O4P1O0M3L1L8N5
$$ 4127 3894 3676 3485 3327 3196 3079 2970 2867 2773 2689 2620 2566 2519 2473 2434 2413 2410 2415 2424 2436 2448 2454 2452 2454 2474 2518 2582 2653 2713 2756 2787 2825 2880
1737B880O8Q0R9J33J71K10K45K69K71K53K42K44K47K24J66Q1j3j02j70k15k42k68k89k96k85
$$ 2880 2948 3028 3127 3260 3431 3641 3886 4155 4426 4679 4921 5165 5412 5636 5802 5883 5870 5768 5598 5383 5141 4873 4584 4288 4003
1734D003k62k33k04j78j62j56j48j30r8o1l7l7m9n6m9l7k9k3j1NQJplKLlj4j9j4%J4J0qj8
$$ 4003 3741 3508 3304 3126 2964 2808 2660 2530 2432 2371 2334 2297 2248 2192 2143 2106 2077 2054 2043 2048 2056 2057 2050 2047 2049 2052 2049 2035 2016 2002 2002 2016 2026 2018 2000
1729B000j3OK7N2P6Q6Q1O7O2O3N7M9M5M5L1km2p5j01j18j20j04q2o9p2q0p2m8k1j1j9l1l5
$$ 2000 1987 1993 2020 2072 2148 2234 2315 2382 2444 2507 2564 2613 2658 2703 2734 2732 2690 2615 2514 2396 2276 2172 2090 2021 1949 1869 1797 1749 1728 1717 1698 1667 1632
1725A632m0m4m3k9k0k6l9l5j6mmLK2L5K1kpNJ4Onqpj0j7k0j4oJMMkj7l6m4l0rLjqlMLk%OQ
$$ 1632 1592 1548 1505 1476 1456 1430 1391 1356 1340 1336 1332 1335 1357 1392 1413 1411 1404 1409 1423 1429 1424 1416 1409 1399 1382 1362 1348 1342 1343 1347 1351 1349 1332 1296 1252 1222 1213 1216 1215 1207 1204 1208 1211 1209 1209 1215 1223
1720A223Lmj3k0k1j4rj9l7l7j5PJ3QLlj6k9k1LK4K8J9J2MlomMQJ0RJ3J5J6J4Oj2l5m9m1j7
$$ 1223 1226 1222 1209 1189 1168 1154 1145 1126 1089 1052 1037 1044 1057 1065 1068 1065 1049 1020 999 1002 1026 1054 1073 1085 1089 1086 1080 1076 1080 1088 1098 1107 1120 1135 1151 1165 1171 1159 1124 1075 1034 1017
1714A017JKJJ1K7K5J3OJ0J2KnMJ2Rkrj8k7k4KL3M0K2Kqj7k7k6j0LJj0j2nNJ1J5J2JmKQOJP
$$ 1017 1018 1020 1021 1032 1059 1084 1097 1103 1113 1125 1127 1122 1126 1138 1147 1145 1136 1118 1091 1067 1069 1102 1142 1164 1166 1158 1141 1114 1088 1078 1081 1082 1072 1060 1055 1060 1071 1086 1098 1099 1095 1097 1105 1111 1112 1119
1709A119K0K8K4J7J1Omj1j2rpmlpj9l5m0k7KK8L9L0J3Jmmlrk3m2m8l4j0PJ1J5K0K2J6PJ%K
$$ 1119 1139 1167 1191 1208 1219 1225 1221 1210 1198 1189 1182 1178 1175 1168 1149 1114 1074 1047 1049 1077 1116 1146 1159 1160 1156 1152 1149 1140 1117 1075 1027 993 983 990 1001 1016 1036 1058 1074 1081 1082 1082 1084
1704A084%kmkJPJ6J8Pj2k8k5j0KJoqolkKRJ7K1J7Kj4j6pjnqMJ5Rrk3k6j9rNJ1Jj4j1LNj4l2
$$ 1084 1084 1082 1078 1076 1077 1084 1100 1118 1125 1113 1085 1060 1050 1052 1053 1047 1039 1033 1030 1028 1030 1039 1056 1077 1094 1096 1082 1066 1059 1058 1053 1045 1049 1064 1073 1064 1041 1015 996 987 992 1003 1004 990 979 982 987 973 941
1698I41k8nK0L6M0K5Jj6pJ1K2K2J5Oj2k3j6MJ7J8J6J4Jj7l0k9k3j0J5L7L2Lj8nK1L1J6kk0
$$ 941 913 908 928 964 1004 1029 1030 1014 1007 1018 1040 1062 1077 1083 1071 1048 1032 1036 1053 1071 1087 1101 1102 1085 1055 1026 1003 993 1008 1045 1077 1080 1062 1057 1078 1109 1125 1123 1103
1693A103l5m1j9K6N8N4L0J1OKllknj0j1j0j3j8j5rj0j7j8kJ7K0J2PJ1J3Lj5k6k7k0j0JNKj
$$ 1103 1068 1027 1008 1034 1092 1146 1176 1187 1193 1195 1192 1189 1187 1182 1172 1161 1151 1138 1120 1105 1096 1086 1069 1051 1049 1066 1086 1098 1105 1116 1129 1132 1117 1091 1064 1044 1034 1035 1040 1042 1041
1688A041kKMNKLPJ2J4RMjkJMKpj8j9oJ0J5J3J2J3Oj0j8j4nkJNN%OK2L7L4K0Oj5m2o1m7pK4
$$ 1041 1039 1041 1045 1050 1052 1055 1062 1074 1088 1097 1101 1100 1098 1099 1103 1105 1098 1080 1061 1055 1065 1080 1093 1105 1118 1124 1114 1096 1082 1077 1075 1076 1081 1086 1086 1092 1114 1151 1185 1205 1211 1196 1154 1093 1046 1039 1063
1682A063K9J8Mpj5j2NJ0j2m2m7k0J6L7L7K5J1RJ7K0Qj1rRK2J0j3k1j7j3j6j7mJ0J5Npj2mO
$$ 1063 1092 1110 1114 1107 1092 1080 1085 1095 1083 1041 994 974 990 1027 1064 1089 1100 1109 1126 1146 1154 1143 1134 1143 1165 1175 1162 1141 1124 1111 1095 1078 1074 1084 1099 1104 1097 1085 1081 1087
1677A087Qlj5k0j2KNmj8k4j8p%%LJ3K3K5K1J4J2J0OMkrj6j7rknj1pjlj1j0J2L9M3J8j1k3k0
$$ 1087 1095 1092 1077 1057 1045 1047 1052 1048 1030 1006 988 981 981 981 984 997 1020 1045 1066 1080 1092 1102 1108 1112 1110 1101 1085 1068 1059 1057 1052 1041 1034 1033 1030 1019 1009 1021 1060 1103 1121 1110 1087 1067
1672A067j8k0j9jK6M1L7K5J9J5%k2l0k2j1j4k2j8pj2k7k2PL7M0K1QRJ5J9K6K9J9lj6rLMnp
$$ 1067 1049 1029 1010 1009 1035 1076 1113 1138 1157 1172 1172 1150 1120 1098 1087 1073 1051 1033 1026 1014 987 965 972 1009 1049 1070 1078 1087 1102 1121 1147 1176 1195 1192 1176 1167 1170 1174 1169 1162
1667A162NJ3Oj3k1j3JNkj0j0mJJ0J4Qnj2rpj3k2k3j4qlPJ5J3Jj1j7j7qJ0L2L4Rk0l3k4pOJ5
$$ 1162 1167 1180 1186 1173 1152 1139 1140 1145 1143 1133 1123 1119 1120 1130 1144 1152 1147 1135 1126 1119 1106 1084 1061 1047 1039 1036 1043 1058 1071 1072 1061 1044 1027 1019 1029 1061 1095 1104 1084 1051 1027 1020 1026 1041
1662A041J9K2K0J8J8J5Oj0k3j8LK6L1J5LOJ8K0Oj6l1l5k5pPQjqj0qj0j6j3nLM%kJOPLnj1j0
$$ 1041 1060 1082 1102 1120 1138 1153 1159 1149 1126 1108 1111 1137 1168 1183 1186 1192 1210 1230 1236 1220 1189 1154 1129 1122 1129 1137 1136 1128 1118 1110 1100 1084 1071 1066 1069 1073 1073 1071 1072 1078 1085 1088 1083 1072 1062
1656A062JJ5J7NkPK1J5qk0pOlk2k2%K0J9Lj2k3k4j0RJ5PKRJ3NmKJ5J9J1KMQMknnml%%mj0j2
$$ 1062 1063 1078 1095 1100 1098 1105 1126 1141 1133 1113 1106 1112 1109 1087 1065 1065 1085 1104 1107 1095 1072 1048 1038 1047 1062 1069 1071 1080 1093 1098 1094 1096 1111 1130 1141 1143 1147 1155 1159 1157 1152 1147 1143 1140 1140 1140 1136 1126 1114
1650A114j2qNJ8J9kk7l3j5MJ1J5K1K3Qj0j5lQRMJmj0j4j0lLMKkonJMmj4j5pKL%mqj2j2%J8
$$ 1114 1102 1094 1099 1117 1136 1134 1107 1074 1059 1063 1074 1089 1110 1133 1141 1131 1116 1113 1121 1130 1134 1135 1131 1121 1107 1097 1094 1097 1101 1103 1101 1095 1090 1091 1095 1091 1077 1062 1055 1057 1060 1060 1056 1048 1036 1024 1024 1042
1644A042K8K1Lj2j1llqj3j0JJ6L4M2L2Pj0j3rj3j9j4JJ3J3QJnqj3j7j6oJ1J7J0KPJ2Kj4j4
$$ 1042 1070 1091 1094 1082 1071 1068 1065 1057 1044 1034 1035 1051 1085 1127 1159 1166 1156 1143 1134 1121 1102 1088 1089 1102 1115 1123 1124 1119 1111 1098 1081 1065 1059 1070 1087 1097 1099 1106 1118 1120 1106 1092
1639A092ljj4k1pRJ5J1Nmj5j4OK3J6lj0%PJj0j2jJ7L0K9J8Mmqj0lQJ0mj6j3qj4k7k1KJ9J6
$$ 1092 1089 1088 1074 1053 1046 1055 1070 1081 1086 1082 1067 1053 1059 1082 1098 1095 1085 1085 1092 1093 1083 1071 1070 1087 1117 1146 1164 1168 1164 1156 1146 1143 1151 1161 1157 1141 1128 1120 1106 1079 1058 1060 1079 1095
1634A095Olj1k6l6l4j7LJ9J7kj6oJ8K3OrjJ7K2J7J8J5Lj3j1MJ6Qj0k6l4l2k4j2mLJ3K5L1K7
$$ 1095 1101 1098 1087 1061 1025 991 974 977 996 1013 1011 995 989 1007 1030 1036 1027 1026 1043 1065 1082 1100 1115 1118 1105 1094 1098 1114 1122 1112 1086 1052 1020 996 984 980 983 996 1021 1052 1079
1629A079J8RLLQOmj9k8k7j7KK3L1K5J4J4J8J5NNJ7K6K2Qnj3j9k1k1k0k0j5j0mKQRJj0rjON
$$ 1079 1097 1106 1109 1112 1120 1126 1122 1103 1075 1048 1031 1033 1056 1087 1112 1126 1140 1158 1173 1178 1183 1200 1226 1248 1256 1251 1238 1219 1198 1177 1157 1137 1122 1112 1108 1110 1118 1127 1128 1118 1109 1108 1114 1119
1623A119PJ1J1LLJ5K1Pj5j7jQkj3oJ0J1ql0l0j4OJ6J5J1LkkMJ0Qlj4j5nJ5L3L1Rj5k4j6j5
$$ 1119 1126 1137 1148 1151 1154 1169 1190 1197 1182 1165 1164 1172 1170 1157 1151 1161 1172 1164 1134 1104 1090 1096 1112 1127 1138 1141 1139 1137 1141 1151 1159 1156 1142 1127 1122 1137 1170 1201 1210 1195 1171 1155 1140
1618A140k5l0k0nRK3L9L8Rk7l9k5j0j3j5qMN%NK2L4K8Qj0j9k0k0j6jK1M0M3K9Mk6m3m0k0n
$$ 1140 1115 1085 1065 1060 1069 1092 1131 1169 1178 1151 1112 1087 1077 1064 1049 1041 1045 1050 1050 1055 1077 1111 1139 1147 1137 1118 1098 1078 1062 1061 1082 1122 1165 1194 1198 1172 1129 1089 1069 1064
1613A064rj5nJ5K4J7QJ1J6Oj2k7k8k3qRK0J8RJpj7k3j1J2K6J9OKPQlj1oQJ7J4J0J1J1nl4n0
$$ 1064 1055 1040 1035 1050 1074 1091 1099 1110 1126 1132 1120 1093 1065 1042 1034 1043 1063 1081 1090 1091 1084 1067 1044 1033 1045 1071 1090 1096 1098 1105 1113 1110 1099 1093 1101 1118 1132 1142 1153 1164 1159 1125 1075
1608A075l9nK6L8L2K2J5J3J2R%j4k4k8j8JJ8K6K5J9J5J1OOJ1J9J9J1%j0j3qJJ0J4J6J9K3K4
$$ 1075 1036 1031 1057 1095 1127 1149 1164 1177 1189 1198 1198 1184 1160 1132 1114 1115 1133 1159 1184 1203 1218 1229 1235 1241 1252 1271 1290 1301 1301 1291 1278 1270 1271 1281 1295 1311 1330 1353 1377
1603A377J8J2J1K0L9O3Q6R9R0O1K2LJ2M8Q9J27J60J89K07K14K20K28K25J95J29M0n4j36j93
$$ 1377 1395 1407 1418 1438 1477 1540 1626 1725 1815 1876 1898 1901 1913 1961 2050 2177 2337 2526 2733 2947 3167 3395 3620 3815 3944 3984 3930 3794 3601
1600C601k19k23k17k09j97j82j61j30r3n8m1l1k0rj1l2n4o0n1l8j8RK7J9j2l7l3j2Lpk8m2
$$ 3601 3382 3159 2942 2733 2536 2354 2193 2063 1970 1912 1871 1840 1820 1811 1800 1768 1714 1654 1603 1565 1547 1556 1583 1602 1590 1553 1520 1508 1511 1504 1476 1434
1596A434m0l1k4k0j5j6k2k8k7k0j7k0j6kPKj2j2MK3K8J6NLJ1K2K8K3Pj6k9k2%J3jl5n5m2r
$$ 1434 1394 1363 1339 1319 1304 1288 1266 1238 1211 1191 1174 1154 1138 1136 1143 1145 1133 1121 1125 1148 1176 1192 1197 1200 1211 1233 1261 1284 1291 1275 1246 1224 1224 1237 1236 1201 1146 1104 1095
1591A095J8K3K1K0J9J5ROOLJKMMjookKPJ0Kk1m7n7m2k0%J5K4K9K2J7J9K2J6%j6k4k8k4oJ1
$$ 1095 1113 1136 1157 1177 1196 1211 1220 1226 1232 1235 1236 1238 1242 1246 1245 1239 1233 1231 1233 1240 1250 1252 1231 1184 1127 1085 1065 1065 1080 1104 1133 1155 1172 1191 1213 1229 1229 1213 1189 1161 1137 1131 1142
1586A142Pj1j7JK0J7KlLkj8k9k7j9j3%J5K4J9J7K6L5K5J0%%%JJ0K2K5J5Jj1j7k7l3l1j4J1
$$ 1142 1149 1138 1121 1122 1142 1159 1161 1158 1161 1159 1141 1112 1085 1066 1053 1053 1068 1092 1111 1128 1154 1189 1214 1224 1224 1224 1224 1225 1235 1257 1282 1297 1298 1287 1270 1243 1210 1179 1165 1176
1581A176L0L2K5K3K2Qk2m5m2k1pm%POmj4pNQJpqjJ0J9K2K0J5J1LlJJ0J4Lj5k5k0rPJ9J7kk4
$$ 1176 1206 1238 1263 1286 1308 1316 1294 1249 1207 1186 1179 1175 1175 1182 1188 1184 1170 1163 1168 1176 1177 1170 1162 1161 1171 1190 1212 1232 1247 1258 1261 1258 1259 1269 1283 1286 1271 1246 1226 1217 1224 1243 1260 1258 1234
1575A234l2j7%PL%%mj5k2j1J4L8L8J5rj3NK6L4K7J9J4Nj4l6m5l5j1J0J6J2OJlolJ1K6L0J9
$$ 1234 1202 1185 1185 1192 1195 1195 1195 1191 1176 1154 1143 1157 1195 1233 1248 1239 1226 1231 1257 1291 1318 1337 1351 1356 1342 1306 1261 1226 1215 1225 1241 1253 1259 1260 1257 1251 1248 1259 1285 1315 1334
1570A334Okmop%RR%j3j5rk%LQPkj1pQJ6J4OOJ5K2K4K1K2J9RnrPL2M0K2pk0j4jPJ5K2K4Pk0
$$ 1334 1340 1338 1334 1328 1321 1321 1330 1339 1339 1326 1311 1302 1300 1300 1303 1311 1318 1316 1305 1298 1306 1322 1336 1342 1348 1363 1385 1409 1430 1452 1471 1480 1475 1466 1473 1505 1545 1567 1560 1540 1526 1525 1532 1547 1569 1593 1600 1580
1564A580l7k8kK2K3Mj6k6l1l9m0j7J8M3M1K8K1J6Kj0mJ7L1K4Qlj1j7j8j5j8k6k7j4KRJ0RQ
$$ 1580 1543 1515 1513 1535 1558 1562 1546 1520 1489 1450 1410 1393 1411 1454 1495 1523 1544 1560 1562 1552 1548 1565 1596 1620 1628 1625 1614 1597 1579 1564 1546 1520 1493 1479 1481 1490 1500 1509 1517
1560A517NMPJ0Lrj2j1j0j5j6j2pnOK2L1K2J0ORJ3J7K2K4K0J5J3J6J3RORJ5K1J8Prj3LL0M6
$$ 1517 1522 1526 1533 1543 1546 1537 1525 1514 1504 1489 1473 1461 1454 1449 1455 1477 1508 1530 1540 1546 1555 1568 1585 1607 1631 1651 1666 1679 1695 1708 1717 1723 1732 1747 1768 1786 1793 1784 1771 1774 1804 1850
1554A850M1L1K6J8Lj3k3k6l1l3l2k3j4jJ7L7M6L7J8QJ2K4L3L7M1M1K8PpnNNpk2k2j2KJ4K4
$$ 1850 1891 1922 1948 1966 1969 1956 1933 1907 1876 1843 1811 1788 1774 1773 1790 1827 1873 1910 1928 1936 1948 1972 2005 2042 2083 2124 2152 2159 2152 2147 2152 2157 2150 2128 2106 2094 2096 2110 2134
1550B134K7J8M%J1K1J7PRK6L9L4K6K5K9K4R%LJ1J2QMJjMJ8K7K6K1L5O2P9O7M3L0L7M4L8K0
$$ 2134 2161 2179 2183 2183 2194 2215 2232 2239 2248 2274 2313 2347 2373 2398 2427 2451 2460 2460 2463 2474 2486 2494 2498 2499 2498 2502 2520 2547 2573 2594 2629 2691 2770 2837 2880 2910 2947 2991 3029 3049
1545C049Mqj0jJ5K7L4L8M4M6N0N7O6O3N3N0O0O3M3J2JJ0K0K3L5O6R6J03Q9P7Q4J02J16J16
$$ 3049 3053 3045 3035 3034 3049 3076 3110 3148 3192 3238 3288 3345 3411 3474 3527 3577 3637 3700 3743 3755 3756 3766 3786 3809 3844 3910 4006 4109 4198 4275 4359 4461 4577 4693
1541D693J10J10J16J16J10J09J27J50J65J67J69J72J64J51J54J77K02K09K10K21K39K47K45
$$ 4693 4803 4913 5029 5145 5255 5364 5491 5641 5806 5973 6142 6314 6478 6629 6783 6960 7162 7371 7581 7802 8041 8288 8533
1538H533K39K28K12J98J85J69J56J73K20K60K64K55K79L34L85M18M58N21N89O49P10P75Q29
$$ 8533 8772 9000 9212 9410 9595 9764 9920 10093 10313 10573 10837 11092 11371 11705 12090 12508 12966 13487 14076 14725 15435 16210 17039
1535A7039Q65Q99R45J008J078J150J210J254J303J373J451J512J568J659J790J924K035K155
$$ 17039 17904 18803 19748 20756 21834 22984 24194 25448 26751 28124 29575 31087 32655 34314 36104 38028 40063 42218
1533D2218K308K479K649K829L049L316L624L978M374M817N335N973O744P632Q669R954J1586
$$ 42218 44526 47005 49654 52483 55532 58848 62472 66450 70824 75641 80976 86949 93693 101325 109994 119948 131534
1531A31534J3631J6144J9175K2676K6516L0565L4714L8733M2226M4675M5203M2199L3652J8751
$$ 131534 145165 161309 180484 203160 229676 260241 294955 333688 375914 420589 465792 507991 541643 560394
1529E60394n46j9857l4817m3443m6441m5708m2880l8918l4365k9592k4893k0543j6783j3722
$$ 560394 559848 539991 505174 461731 415290 369582 326702 287784 253419 223827 198934 178391 161608 147886
1527A47886j1319r486q125p102o247n468m765m148l574k999k450j956j521j168r74j018j308
$$ 147886 136567 127081 118956 111854 105607 100139 95374 91226 87652 84653 82203 80247 78726 77558 76584 75566 74258
1525G4258j785k348k878l247l414l427l355l213k998k734k468k212j965j752j600j497j404
$$ 74258 72473 70125 67247 64000 60586 57159 53804 50591 47593 44859 42391 40179 38214 36462 34862 33365 31961
1523C1961j307j217j139j065j000r54r21q85q51q22p96p62p30p05o80o34n75n23m83m39l99
$$ 31961 30654 29437 28298 27233 26233 25279 24358 23473 22622 21800 21004 20242 19512 18807 18127 17493 16918 16395 15912 15473 15074
1521A5074l71l57l37l06k74k45k18k00j95j91j65j15o2k6qrk4l9l7l1m4q4j25j36j21j09j12
$$ 15074 14703 14346 14009 13703 13429 13184 12966 12766 12571 12380 12215 12100 12038 12012 12004 11995 11971 11932 11895 11864 11820 11736 11611 11475 11354 11245 11133
1517A1133j18j20j20j25j37j45j35j11q8p7p8q4r4r8r0o6l9k3j5j2j3j7j2J3M6P0P7P9Q1Q1
$$ 11133 11015 10895 10775 10650 10513 10368 10233 10122 10034 9957 9879 9795 9701 9603 9513 9447 9408 9385 9370 9358 9345 9328 9316 9329 9375 9445 9522 9601 9682 9763
1514I763P5P2P7Q8J03J11J03Q6P2P0O8N4L8L7M3L6J2ojK5N4P1P0N5M6N1O2O1N3N1N9O3O1N8
$$ 9763 9838 9910 9987 10075 10178 10289 10392 10478 10550 10620 10688 10742 10780 10817 10860 10896 10908 10902 10901 10926 10980 11051 11121 11176 11222 11273 11335 11396 11449 11500 11559 11622 11683 11741
1509A1741N8N6N4O1P2P5P5Q2R6J03J00R4R0P6N6M3M5N3O4P9Q5O6K6LQK1J8QJrk3k9k5k7m1
$$ 11741 11799 11855 11909 11970 12042 12117 12192 12274 12370 12473 12573 12667 12757 12833 12889 12932 12977 13030 13094 13173 13258 13324 13350 13353 13361 13382 13400 13408 13409 13400 13377 13348 13323 13296 13255
1505A3255n7n9o2p8r3r3r6j13j32j28j10j03j07j01q5p9q1q4p9q2r3r5q1o8o3o4o0m8l2j5
$$ 13255 13198 13139 13077 12999 12906 12813 12717 12604 12472 12344 12234 12131 12024 11923 11838 11759 11678 11594 11515 11433 11340 11245 11164 11096 11033 10969 10909 10861 10829 10814
1501A0814rj6k5k3j3mMJ8L1M0N6Q5J07J02Q1O6N7L3ol6n5p9j02j00p1l5lM5J13J74K17K70
$$ 10814 10805 10789 10764 10741 10728 10724 10728 10746 10777 10817 10873 10958 11065 11167 11248 11314 11371 11404 11398 11362 11307 11228 11126 11026 10955 10920 10917 10962 11075 11249 11466 11736
1498A1736L60M80O12P60R30J111J289J466J646J814J934J929J665J018M2r84j735k080k119
$$ 11736 12096 12576 13188 13948 14878 15989 17278 18744 20390 22204 24138 26067 27732 28750 28792 27808 26073 23993 21874
1495B1874k008j837j634j429j238j048q61p06o09n48m85m13l47k98k55k17j89j71j56j44j39
$$ 21874 19866 18029 16395 14966 13728 12680 11819 11113 10504 9956 9471 9058 8711 8413 8158 7941 7752 7581 7425 7281 7142
1493G142j39j39j36j35j31j25j15j07r8q4p3p5q2q1o6n5o0p7q9r2q7q0p3o8p0p5p6o7m8l1
$$ 7142 7003 6864 6728 6593 6462 6337 6222 6115 6017 5933 5860 5785 5703 5622 5556 5501 5441 5364 5275 5183 5096 5016 4943 4875 4805 4730 4654 4587 4539 4508
1489D508k0rKJj4l5m5n0o3q4r3q5o7n3m1k6j8k1k5j7kKj0k3k4k1l1m4n0m2l3k5j2NJ4Oj1k3
$$ 4508 4488 4479 4481 4482 4468 4433 4388 4338 4275 4191 4098 4013 3946 3893 3852 3826 3808 3787 3762 3745 3743 3745 3735 3712 3688 3667 3636 3592 3542 3500 3467 3442 3430 3435 3449 3455 3444 3421
1484C421k8k6j6kPjj5k2j6j5k3k6k0j4j8k4j6JJj9l5k9j0Kjrj5k0k1k0j3nKPJ3J5Nj5l4m1
$$ 3421 3393 3367 3351 3349 3356 3355 3340 3318 3302 3287 3264 3238 3218 3204 3186 3162 3146 3147 3148 3129 3094 3065 3055 3057 3056 3047 3032 3012 2991 2971 2958 2953 2955 2962 2975 2990 2995 2980 2946 2905
1479B905m0l6k8j6jPKnj0j4k1k4k0qOJ5J4mk5l2j8NK2K9L5L5K3O%OOrk4k4j2pj6k6k4j0Jn
$$ 2905 2865 2829 2801 2785 2784 2791 2793 2788 2778 2764 2743 2719 2699 2691 2697 2712 2726 2722 2697 2665 2647 2652 2674 2703 2738 2773 2796 2802 2802 2808 2814 2805 2781 2757 2745 2738 2722 2696 2672 2662 2663 2658
1474B658k1k6j0NLj4k3j2KQLrk4l2k6j1kkNK0K7J8Lqj0oQK5L1J7pk2k3j6%J7K9K5J1Jmpqp
$$ 2658 2637 2611 2601 2606 2609 2595 2572 2560 2562 2570 2573 2564 2540 2508 2482 2471 2469 2467 2472 2492 2519 2537 2540 2532 2522 2516 2524 2549 2580 2597 2590 2568 2545 2529 2529 2546 2575 2600 2611 2612 2608 2601 2593 2586
1469B586j3k5k7j9j2k2l2j8QJ8jl3n2o2o4n5l6k4k7l5l2j6omlQK4K9J7pk5k9k8l0k6nK5M4
$$ 2586 2573 2548 2521 2502 2490 2468 2436 2418 2426 2444 2443 2410 2358 2296 2232 2177 2141 2117 2090 2055 2023 2007 2001 1997 1994 2002 2026 2055 2072 2065 2040 2011 1983 1953 1927 1922 1947 1991
1464A991M0K1jk2l5k9nJ7J9RKMRJ4J8J6lk7l8l0rQJ4J7J8K0K3K1J7J0QJ5K6L2K5J0%mmprk
$$ 1991 2031 2052 2051 2029 1994 1965 1960 1977 1996 2005 2007 2011 2020 2034 2052 2068 2065 2038 2000 1970 1961 1969 1983 2000 2018 2038 2061 2082 2099 2109 2117 2132 2158 2190 2215 2225 2225 2221 2217 2210 2201 2199
1459B199QJ2J1K3L8M0J8j%J8L0L8N4Q0J08J26J45J70J97K14K21K19K06J71J07K1o9j40j83
$$ 2199 2207 2219 2230 2253 2291 2331 2349 2348 2348 2366 2396 2434 2488 2568 2676 2802 2947 3117 3314 3528 3749 3968 4174 4345 4452 4473 4404 4264 4081
1456D081j98j98j93j84j79j78j72j48j02n5l1m0o7q5p6m7j7pj2k1l1l7l4j1J8L3J8rl3m7n7
$$ 4081 3883 3685 3492 3308 3129 2951 2779 2631 2529 2474 2443 2403 2336 2251 2175 2128 2111 2104 2092 2071 2040 2003 1969 1958 1976 2009 2027 2018 1985 1938 1881
1452A881o2n4l7j7jJ3K4K1Mj2j6j4j8k8k7pOpl3m0k1kqk0j0K1M2L6J6lj5k0j2LJ4J7J4Qmj6
$$ 1881 1819 1765 1728 1711 1710 1723 1747 1768 1772 1760 1744 1730 1712 1684 1657 1650 1656 1649 1616 1576 1555 1553 1545 1525 1515 1536 1578 1614 1630 1627 1612 1592 1580 1583 1597 1614 1628 1636 1632 1616
1447A616k5k7l6n1m7j7J9K9J3MJ0J4RKJ0K2K5K3J9J5%k0l2k7j2LJ3J1Jj2j6j5j1rJJ1J1jj3
$$ 1616 1591 1564 1528 1477 1430 1413 1432 1461 1474 1478 1488 1502 1511 1513 1523 1545 1570 1593 1612 1627 1627 1607 1575 1548 1536 1539 1552 1563 1564 1552 1536 1521 1510 1501 1502 1513 1524 1523 1510
1442A510rNJ3R%mj0k3l3l4k4j2kJ3K8L1J9ORJ8J0j7m5m5k6o%jLKqk1k5j5lJPK4M5M6J7k4m3
$$ 1510 1501 1506 1519 1528 1528 1524 1514 1491 1458 1424 1400 1388 1386 1399 1427 1458 1477 1483 1492 1510 1520 1503 1458 1413 1387 1381 1381 1380 1383 1385 1377 1356 1331 1316 1313 1314 1321 1345 1390 1436 1453 1429 1386
1437A386l0nPNMJ4K2J1j2k9k3kRMopNK2L1L1K1Kk0l6l6k4oJ0J9J5kk2l2k6j4pomJRJ7K2K0
$$ 1386 1356 1351 1358 1363 1367 1381 1403 1414 1402 1373 1350 1348 1357 1361 1355 1348 1353 1375 1406 1437 1458 1460 1440 1404 1368 1344 1338 1348 1367 1382 1380 1358 1326 1300 1286 1279 1273 1269 1270 1279 1296 1318 1338
1432A338OqqPJ9J8J2RQPRJ4J6Kj6j5LJ9J5QQJ2Jj9l0k3j3pljmj1j8j6qkKQJ3J5J0kj4j8j3
$$ 1338 1344 1336 1328 1335 1354 1372 1384 1393 1401 1408 1417 1431 1447 1449 1433 1418 1421 1440 1455 1463 1471 1483 1484 1465 1435 1412 1399 1392 1389 1388 1384 1373 1355 1339 1331 1329 1331 1339 1352 1367 1377 1375 1361 1343 1330
1426A330lLORJ0J0J0Plk2l1k1NK2J6lj7k1j3LJ8K0J6K0L2L3Qj4j4jol4n0l3kRjj1j1j0j0m
$$ 1330 1327 1330 1336 1345 1355 1365 1375 1382 1379 1357 1326 1305 1310 1332 1348 1345 1328 1307 1294 1297 1315 1335 1351 1371 1403 1436 1444 1430 1416 1415 1409 1375 1325 1292 1290 1299 1298 1287 1276 1266 1256 1252
1421A252J4L1L7L4K6J7Lj7k9k3oLnj9k2qJ0J6Qlm%Knj3nJ2K0Qj1j2JJ1QQJ9K8K2J0Lmk7n0
$$ 1252 1266 1297 1334 1368 1394 1411 1414 1397 1368 1345 1339 1342 1337 1318 1296 1288 1298 1314 1322 1319 1315 1315 1317 1312 1299 1294 1306 1326 1334 1323 1311 1312 1323 1331 1339 1358 1386 1408 1418 1421 1417 1390 1340
1416A340m9k4%LJMMrj6mJ4J1j6l8l0nJ9K9L6L7K3jj8j5JJ1J0NLJnqmkj1k2j5MJ2mk1j8LK2
$$ 1340 1291 1267 1267 1270 1271 1275 1279 1270 1254 1250 1264 1275 1259 1221 1191 1186 1205 1234 1270 1307 1330 1329 1311 1296 1297 1308 1318 1323 1326 1327 1322 1314 1310 1308 1297 1275 1260 1264 1276 1272 1251 1233 1236 1258
1410A258L0K4J4NPJ9K9L1K9K9K8J4mj7k7m2n9o4n0l5k5j5NK2K5K3K5L0K9K2J3OJpj1j6k6l5
$$ 1258 1288 1312 1326 1331 1338 1357 1386 1417 1446 1475 1503 1517 1513 1496 1469 1427 1368 1304 1254 1219 1194 1179 1184 1206 1231 1254 1279 1309 1338 1360 1373 1379 1380 1373 1362 1346 1320 1285
1406A285l7k1PL3M0K6%k0k8k3j6rkRK2L3L1J2j6k8j8JJ8L0L7L2J4kMK8M5L2nm1n4m3k1rj1
$$ 1285 1248 1227 1234 1267 1307 1333 1333 1313 1285 1262 1246 1237 1235 1244 1266 1299 1330 1342 1326 1298 1280 1281 1299 1329 1366 1398 1412 1410 1414 1442 1487 1519 1514 1473 1419 1376 1355 1346 1335
1401A335j6j9k0k4j8LK1J2j8l7k3OJ7Kk1l1k5pJ3K7K9K1RNOLj0k2k0qOJ0Kj0k0j9KL1M9M1
$$ 1335 1319 1300 1280 1256 1238 1241 1262 1274 1256 1219 1196 1202 1219 1221 1200 1169 1144 1137 1150 1177 1206 1227 1236 1241 1247 1250 1240 1218 1198 1190 1196 1206 1208 1198 1178 1159 1161 1192 1241 1282
1396A282Pk9m6m1j8KJ1J0MJkprmMROJKOJ1J0Jj3k0j8j5j8k3k4j9j3JK3M2M3K4%k1l5l5j4J8
$$ 1282 1289 1260 1214 1173 1155 1157 1168 1178 1182 1183 1181 1174 1165 1161 1165 1174 1180 1181 1183 1189 1200 1210 1211 1198 1178 1160 1145 1127 1104 1080 1061 1048 1049 1072 1114 1157 1181 1181 1160 1125 1090 1076 1094
1391A094L7L3J8OlrjJ2J9J1NNkk4l7j6J6L0K1K0L1K8%k8l3k3k3l1l7l7l0j2J6L7L3J1mmLJ4
$$ 1094 1131 1164 1182 1188 1185 1176 1175 1187 1206 1217 1222 1227 1225 1201 1164 1148 1164 1194 1215 1235 1266 1294 1294 1266 1233 1210 1187 1156 1119 1082 1052 1040 1056 1093 1126 1137 1133 1129 1132 1146
1386A146K4K8J5qk0j6nkjRK5K9K1QjmkLMpk1k3j8j6j8j2RK5J6rk5k2j0mmmJJ6L9N4M7K0rk4
$$ 1146 1170 1198 1213 1205 1185 1169 1164 1162 1161 1170 1195 1224 1245 1253 1252 1248 1246 1249 1253 1246 1225 1202 1184 1168 1150 1138 1147 1172 1188 1179 1154 1132 1122 1118 1114 1110 1111 1127 1166 1220 1267 1287 1278 1254
1381A254k5j2NJ4Jk3l0j2J3J7P%joj5k0j9j0J0L1L8K4PJJpk2k2oOO%j1l4n9o0k7RK3K1J4O
$$ 1254 1229 1217 1222 1236 1237 1214 1184 1172 1185 1202 1209 1209 1208 1202 1187 1167 1148 1138 1148 1179 1217 1241 1248 1249 1250 1243 1221 1199 1193 1199 1205 1205 1194 1160 1101 1041 1014 1023 1046 1067 1081 1087
1375A087pj1nLKQK8M7M2K1QPKj5k7k3oJ0J9J9J7J4J5J7J4J0QKnmJ1K4J0k0l3j8Kjk4m7n6m8
$$ 1087 1080 1069 1064 1067 1069 1077 1105 1152 1194 1215 1223 1230 1232 1217 1190 1167 1161 1171 1190 1209 1226 1240 1255 1272 1286 1296 1304 1306 1301 1297 1308 1332 1342 1322 1289 1271 1273 1272 1248 1201 1145 1097
1370A097k4J1L4K6Jj3JK8L8K3Kj2k1l0l4k1KJ2mk6k2NK6J7j1k8j3J9M6N0K7jj6j6roJPMj0
$$ 1097 1073 1084 1118 1144 1145 1132 1133 1161 1199 1222 1224 1212 1191 1161 1127 1106 1108 1120 1116 1090 1068 1073 1099 1116 1105 1077 1064 1083 1129 1179 1206 1205 1189 1173 1164 1158 1159 1166 1170 1160
1365A160k0j6jNMPJ1J0lj3oPJ3QMJ1J6J0j3l1l1j5jLLQJ6J9Oj2k4j8JJ8K5J7Q%nj1j4pMRK
$$ 1160 1140 1124 1123 1128 1132 1139 1150 1160 1157 1144 1138 1145 1158 1166 1170 1181 1197 1207 1194 1163 1132 1117 1116 1119 1122 1130 1146 1165 1171 1159 1135 1117 1118 1136 1161 1178 1186 1186 1181 1170 1156 1149 1153 1162 1164
1360A164qqOJ7J7J0J1K1K3Ok1l7l2j2KNmj7k7k6j7rokNRPJ%MQPKnj5k5k6j3J1L2L7K6J3J1
$$ 1164 1156 1148 1154 1171 1188 1198 1209 1230 1253 1259 1238 1201 1169 1157 1159 1164 1160 1143 1116 1090 1073 1064 1058 1056 1061 1070 1077 1078 1078 1082 1090 1097 1099 1094 1079 1054 1028 1015 1026 1058 1095 1121 1134 1145
1355A145J5J3%j1pLOJ%LMmj0j0qq%J9L4K5rm2n2k8QL5L6K1PQJ6J5Krr%%j4k9l0k1j5j9k1j1
$$ 1145 1160 1173 1173 1162 1155 1158 1164 1165 1165 1168 1172 1168 1158 1148 1140 1132 1132 1151 1185 1210 1201 1159 1107 1079 1087 1122 1158 1179 1186 1194 1210 1225 1227 1218 1209 1209 1209 1195 1166 1136 1115 1100 1081 1060 1049
1349A049OK0K6K4J6Nnj0j4k0k2j0J0K2J9Mj1k1k3j5lKMOJ1J0MLPJ0LJJ6L2K5ol4m0k4lJ4J9
$$ 1049 1055 1075 1101 1125 1141 1146 1141 1131 1117 1097 1075 1065 1075 1097 1116 1120 1109 1088 1065 1050 1047 1049 1053 1059 1070 1080 1084 1087 1094 1104 1107 1108 1124 1156 1181 1175 1141 1101 1077 1074 1088 1107
1344A107J5Jj0oJ0K3J9jj5j9j3pJJ0J7J1kj1pKJ0J5J6Qpj7j0NJ4J1Nlj2j9j7mNMJLPLrk0k7
$$ 1107 1122 1123 1113 1107 1117 1140 1159 1158 1143 1124 1111 1104 1105 1115 1132 1143 1141 1130 1123 1125 1135 1150 1166 1174 1167 1150 1140 1145 1159 1170 1175 1172 1160 1141 1124 1120 1125 1129 1130 1133 1140 1143 1134 1114 1087
1338A087k5j3JPkrLK8M1K4jpRK7K8J6Jqj1j0rj0j7k0qJ6L2L3J8NlkjjlkMLj2l3l8j9PJ6Mj0
$$ 1087 1062 1049 1050 1057 1055 1046 1049 1077 1118 1142 1141 1134 1143 1170 1198 1214 1215 1207 1196 1186 1177 1167 1150 1130 1122 1138 1170 1203 1221 1226 1223 1221 1220 1219 1216 1214 1218 1221 1209 1176 1138 1119 1126 1142 1146 1136
1333A136j0jPJ1RKj3k5k3j0KQJ3K2K1Pj5k3j0QK1K1J4MoqJJ6K7K7J9Oj2k7l1j7PK3K0nl1l5
$$ 1136 1126 1125 1132 1143 1152 1154 1141 1116 1093 1083 1085 1093 1106 1128 1149 1156 1141 1118 1108 1116 1137 1158 1172 1176 1170 1162 1163 1179 1206 1233 1252 1258 1246 1219 1188 1171 1178 1201 1221 1216 1185 1150
1328A150j1J9L3K3Ork0k8k5j0PJ5Pj3k9l2j7LJ1NjMJ3J2RJ7L1L2K0RNOJkMJ5K0J9J3Nrk4l4
$$ 1150 1139 1158 1191 1214 1220 1211 1191 1163 1138 1128 1135 1150 1157 1144 1115 1083 1066 1069 1080 1085 1084 1088 1101 1113 1122 1139 1170 1202 1222 1231 1236 1242 1243 1241 1245 1260 1280 1299 1312 1317 1308 1284 1250
1322A250k9j8qrj5j5j2j5k6k8pK3L8K7Qjjkj2k0j5JJ5J0j1k0pJ4J9MokON%JPJ1Ojoomoj4j0
$$ 1250 1221 1203 1195 1186 1171 1156 1144 1129 1103 1075 1068 1091 1129 1156 1164 1163 1162 1160 1148 1128 1113 1114 1129 1139 1128 1108 1101 1115 1134 1138 1132 1130 1136 1141 1141 1142 1149 1160 1166 1165 1159 1153 1149 1143 1129 1119
1317A119J0L5L6J4pj3j0rlQJ1N%RJ1mj9rJ4J4rk4j2Jj0k5j8J0K8K3J1OMkomOJ3J1%j4k0k0
$$ 1119 1129 1164 1200 1214 1207 1194 1184 1175 1172 1180 1191 1196 1196 1205 1216 1212 1193 1184 1198 1212 1203 1179 1167 1168 1158 1133 1115 1125 1153 1176 1187 1193 1197 1195 1189 1185 1191 1204 1215 1215 1201 1181 1161
1311A161j8k0k1j5kOQLKNJ4J4QKPJ2Jk2k9j3QOj3k3j7nLRJ7K5K7K6K0J0Jllpj7k8l0k4rRJ8
$$ 1161 1143 1123 1102 1087 1085 1091 1099 1102 1104 1109 1123 1137 1145 1147 1154 1166 1167 1145 1116 1103 1111 1117 1104 1081 1064 1059 1062 1071 1088 1113 1140 1166 1186 1196 1197 1194 1191 1184 1167 1139 1109 1085 1076 1085 1103
1306A103J2oj5rLOORJ9K7K9K5J5ol3n2n0l6k0nJ1K7L1J7kj0jJ2K0J9J4MmkLPQJ0J1PknMJ0
$$ 1103 1115 1109 1094 1085 1088 1094 1100 1109 1128 1155 1184 1209 1224 1218 1185 1133 1083 1047 1027 1022 1033 1060 1091 1108 1106 1096 1095 1107 1127 1146 1160 1164 1160 1158 1161 1168 1176 1186 1197 1204 1202 1197 1201 1211
1301A211kk0k6j3LONM%j0k1k3j6qlKQJ1Ooj7k2j4nkopJJ0J3Omj3j8j8j4rJJ5K9K6RprJONO
$$ 1211 1209 1189 1163 1150 1153 1159 1164 1168 1168 1158 1137 1114 1098 1090 1087 1089 1097 1108 1114 1108 1091 1069 1055 1050 1048 1042 1035 1036 1046 1059 1065 1061 1048 1030 1012 998 989 990 1005 1034 1060 1069 1062 1053 1054 1060 1065 1071
1295A071J0J0OJ3K9M1L0Pj1j6j5j5j3j5k1k6k1qJKLPRKkKRKj0qJ2K4J4qk0j9k3l5l7j7RK3
$$ 1071 1081 1091 1097 1110 1139 1180 1210 1217 1206 1190 1175 1160 1147 1132 1111 1085 1064 1056 1057 1059 1062 1069 1078 1080 1078 1080 1089 1091 1081 1073 1085 1109 1123 1115 1095 1076 1053 1018 981 964 973 996
1290I96K5K7L2K6Kk4k8j2LKj4k4j3J1K9K7J0LJ3K0Pk0l3k0OK2K2Qrk2j7JJ6K1K4L0K9Qk0l5
$$ 996 1021 1048 1080 1106 1108 1084 1056 1044 1047 1049 1035 1011 998 1009 1038 1065 1075 1078 1091 1111 1118 1098 1065 1045 1051 1073 1095 1103 1094 1072 1055 1056 1072 1093 1117 1147 1176 1184 1164 1129
1285A129l9m2l7j0L1N1L7J5J0K1K9K4J5Jj4k5k1rlpq%QQKnqj0j7k7l1j7J0K8K5QKJ8L8M6L1
$$ 1129 1090 1048 1011 1001 1032 1083 1120 1135 1145 1166 1195 1219 1234 1235 1221 1196 1175 1166 1163 1156 1148 1148 1156 1164 1166 1161 1153 1143 1126 1099 1068 1051 1061 1089 1114 1122 1124 1142 1180 1226 1257
1280A257Jl0m0l1j9j3pOJ9J2j6m0m0k6pJ0K7L4K6J2%pj3j7j6j2j2j1pMJ2J4RMKOJ0Rmj6j5
$$ 1257 1258 1228 1188 1157 1138 1125 1118 1124 1143 1155 1139 1099 1059 1033 1026 1036 1063 1097 1123 1135 1135 1128 1115 1098 1082 1070 1058 1047 1040 1044 1056 1070 1079 1083 1085 1091 1101 1110 1106 1090 1075
1275A075%J5J7Nj4k5k6k3j9j5nKJj1j5mJ3K0J8J7K6L5L0J6Llj2k1k2jK7L9K1j2l5l7l0k4j9
$$ 1075 1075 1090 1107 1112 1098 1073 1047 1024 1005 990 985 987 988 977 962 958 971 991 1009 1026 1052 1087 1117 1133 1136 1133 1121 1100 1078 1077 1104 1143 1164 1152 1117 1080 1050 1026 1007
1270A007j2kQRkj5j6%K2L2L0K8K6J6Jrrpj2j6pQJ8K1K1J5%j4j3knk5m1l3pJ3J6J1QJ3J3No
$$ 1007 995 993 1001 1010 1008 993 977 977 999 1031 1061 1089 1115 1131 1132 1123 1114 1107 1095 1079 1072 1080 1098 1119 1140 1155 1155 1141 1128 1126 1121 1096 1055 1022 1015 1028 1044 1055 1063 1076 1089 1094 1088
1265A088pOJ9K2K3K7K7J5oj6rnj7l1k7j1kpj9k9k6j2NJ2RJ0J6K2J5N%NMmj6k1j5JJ8K0kk9
$$ 1088 1081 1087 1106 1128 1151 1178 1205 1220 1214 1198 1189 1184 1167 1136 1109 1098 1096 1089 1070 1041 1015 1003 1008 1020 1029 1039 1055 1077 1092 1097 1097 1102 1106 1102 1086 1065 1050 1051 1069 1089 1087 1058
1260A058l5j4QJ1jlRK0J5MKJ0J3Kj4k6l0l3l3j6J3L5L4J7PJ0J4J1J2J5Mk4m9m3j4J2J6J3J9
$$ 1058 1023 1009 1017 1028 1027 1024 1033 1053 1068 1072 1074 1084 1097 1099 1085 1059 1029 996 963 947 960 995 1029 1046 1053 1063 1077 1088 1100 1115 1119 1095 1046 1003 989 1001 1017 1030 1049
1255A049K7K7J8J0J0J1J0%j5l5n0n4m6l3j7jJ3K1K2J6NkmLJ1J2PJ1K3L6L1Rj4k5k4j6oJkj6
$$ 1049 1076 1103 1121 1131 1141 1152 1162 1162 1147 1112 1062 1008 962 929 912 911 924 945 967 983 988 986 982 985 996 1008 1015 1026 1049 1085 1116 1125 1111 1086 1062 1046 1040 1041 1039 1023
1250A023l1l1j7LJ5K5L1L2J9jj2pJ0K1J9J2Lpj4j9j5nLKnjJ3K9K6J2kqj7l1m0k5KJ7Qpj1l
$$ 1023 992 961 944 947 962 987 1018 1050 1069 1068 1056 1049 1059 1080 1099 1111 1114 1107 1093 1074 1059 1054 1057 1059 1054 1053 1066 1095 1121 1133 1131 1123 1106 1075 1035 1010 1012 1029 1037 1030 1019 1016
1245A016OPjj3j2JJ7J6%j0nLMPJ7K6J5nj0JOj0k2j0J5K1Nj2mJ8K8J8LJPjk1m0m2l2j9lJ1J3
$$ 1016 1022 1029 1028 1015 1003 1004 1021 1037 1037 1027 1022 1025 1029 1036 1053 1079 1094 1089 1079 1080 1086 1076 1054 1044 1059 1080 1085 1073 1069 1087 1115 1133 1136 1137 1144 1143 1122 1082 1040 1008 989 986 997 1010
1239A010mj6qJ3J8J0OJ2Nj2j2K1N5N0J3k1k7k0j5pQK0K1J2MJ%KJpj9k4j3LJ6J6Kj9k9j4J6
$$ 1010 1006 990 982 995 1013 1023 1029 1041 1046 1034 1022 1043 1098 1148 1161 1140 1113 1093 1078 1071 1079 1099 1120 1132 1136 1137 1137 1139 1140 1133 1114 1090 1077 1080 1096 1112 1114 1095 1066 1052 1068
1234A068L1J6rj5jJ2J1MJOMoj3kJ6K2Nj8l2l1k7k6k7k7k1oJ2K0J7J3J6J9J0KJ0K6K4OlJ1K5
$$ 1068 1099 1115 1106 1091 1090 1102 1113 1117 1118 1124 1128 1122 1109 1107 1123 1145 1150 1132 1100 1069 1042 1016 989 962 941 935 947 967 984 997 1013 1032 1042 1044 1054 1080 1104 1110 1107 1118 1143
1229A143K1Okmj4k6k5j1%jlppoLJ5K2J9Mj6k9k6nJ4J5Nqj6j8pJ4K5J5nrk%qqPJ8J7J4J8K3
$$ 1143 1164 1170 1168 1164 1150 1124 1099 1088 1088 1087 1084 1077 1070 1064 1067 1082 1104 1123 1127 1111 1082 1056 1051 1065 1080 1085 1077 1061 1043 1036 1050 1075 1090 1085 1076 1074 1074 1066 1058 1065 1083 1100 1114 1132 1155
1224A155J9Qnk5m8n0j8K1L8K5Kj9l1l4k4j1oj0j3j2oLK1L3L0J7Mqk4l8k6NK4J2j2j9nRJ2P
$$ 1155 1174 1182 1177 1152 1104 1054 1036 1057 1095 1120 1122 1103 1072 1038 1014 1003 997 987 974 962 956 959 980 1013 1043 1060 1064 1056 1032 994 968 973 997 1009 997 978 973 982 994 1001
1219A001Kk%J2J7Pj1j3JJ1Nj0j1%J1J2J1J2J2ROKkj3k6l0j5J1L1L3K2Qlj9k9k5oJ0Rlj2j1
$$ 1001 1003 1001 1001 1013 1030 1037 1026 1013 1014 1025 1030 1020 1009 1009 1020 1032 1043 1055 1067 1076 1082 1084 1082 1069 1043 1013 998 1009 1040 1073 1095 1103 1100 1081 1052 1027 1021 1031 1040 1037 1025 1014
1214A014lOJ2J4PJjLLknMK2L4K9J0j0k4l2l3k6j3LOkrlOPKkmpj2nNPjjJ2J8Mj2oJ0J0l%K2
$$ 1014 1011 1017 1029 1043 1050 1051 1050 1053 1056 1054 1049 1053 1075 1109 1138 1148 1138 1114 1082 1049 1023 1010 1013 1019 1017 1008 1005 1011 1018 1020 1018 1014 1007 995 990 995 1002 1001 1000 1012 1030 1034 1022 1016 1026 1036 1033 1033 1055
1208A055L9K3j1l0k4j2j0j0kJ3K0J1lmOJ4RLOJ1Lj5k7k5k2k6k7j1J5L7M0L0J8J4J4Nj5k8k3
$$ 1055 1094 1117 1106 1076 1052 1040 1030 1020 1018 1031 1051 1062 1059 1055 1061 1075 1084 1087 1093 1104 1107 1092 1065 1040 1018 992 965 954 969 1006 1046 1076 1094 1108 1122 1127 1112 1084 1061
1203A061j1j0k1j8l%k0k7MM9N7K5j0k1j6r%J1Qj1k4j6%L%JJ1J2PMRQ%mKRRJ0J5K0Pj6l5l6
$$ 1061 1050 1040 1019 1001 998 998 978 951 955 1004 1061 1086 1076 1055 1039 1030 1030 1041 1049 1038 1014 998 998 1001 1001 1002 1013 1025 1032 1036 1045 1053 1053 1049 1051 1060 1069 1079 1094 1114 1121 1105 1070 1034
1198A034k4pNJ0MkLJ6K6K3J1NK%kJJ0J4Kj8l0k5rKJj0j8j5lJ0J5J8K1K0J5Pjpj3j5j3jJ1J4
$$ 1034 1010 1003 1008 1018 1022 1020 1023 1039 1065 1088 1099 1104 1106 1106 1104 1105 1115 1129 1131 1113 1083 1058 1049 1051 1052 1042 1024 1009 1006 1016 1031 1049 1070 1090 1105 1112 1111 1104 1091 1076 1063 1062 1073 1087
1192A087Mj4k6k3nRQmj6k0k3k1j3lPJ5K3L1L7M1M0L4J9Kj2j9k3k4j9j3j0nJPLqj8k2k6k9j3
$$ 1087 1091 1077 1051 1028 1023 1032 1040 1036 1020 1000 977 956 943 940 947 962 985 1016 1053 1094 1134 1168 1187 1189 1177 1158 1135 1111 1092 1079 1069 1064 1065 1072 1075 1067 1049 1027 1001 972 959
1187I59K3N4M9J1k6l1pK3L8L0J3LQJ6J8Nj7l8m4l3j4npj8k3j5NK9M4M0K6J7J4Nj7l3k7kK2
$$ 959 982 1036 1085 1096 1070 1039 1032 1055 1093 1123 1136 1139 1147 1163 1181 1186 1169 1131 1087 1054 1040 1035 1028 1010 987 972 977 1006 1050 1090 1116 1133 1147 1152 1135 1102 1075 1073 1095
1182A095K5J2qk1j9lNL%QJ9J9J4J6K3J1k0m1l3nJ4Oj7l5l7k4pOJ7K5K5J3%LK1L0J8mj5j4p
$$ 1095 1120 1132 1124 1103 1084 1081 1086 1089 1089 1097 1116 1135 1149 1165 1188 1199 1179 1138 1105 1100 1114 1120 1103 1068 1031 1007 1000 1006 1023 1048 1073 1086 1086 1089 1110 1140 1158 1154 1139 1125 1118
1177A118mJjrk0j4OK3K1Jj8k0r%mj9k5j5mrk3k8j7KJ1Q%lJLMRJ8K4J7kj2pNJ3J3J3J3J2QJ2
$$ 1118 1114 1115 1114 1105 1085 1071 1077 1100 1121 1122 1104 1084 1075 1075 1071 1052 1027 1012 1008 999 976 948 931 933 944 952 952 949 950 953 957 966 984 1008 1025 1023 1011 1004 1009 1022 1035 1048 1061 1073 1081 1093
1172A093J7J6J0Ljqj2j3rnrj3j4j3j4k1l0l5k3ML4N1M6K8Lk0k9k1%J1QKMJ5K5L0K7J7Lqj6
$$ 1093 1110 1126 1136 1139 1138 1130 1118 1105 1096 1091 1082 1069 1055 1042 1028 1007 977 942 919 923 957 1008 1054 1082 1085 1065 1036 1015 1015 1026 1034 1036 1040 1055 1080 1110 1137 1154 1157 1149 1133
1167A133k3k9k5qRJ1JqnKJ0J3J2Nnj2j6j5pQJ8J1j1k7k8j4LJ8K7K7J5ok5k8j3QK3K4J5Lqj3
$$ 1133 1110 1081 1056 1048 1057 1068 1069 1061 1056 1058 1068 1081 1093 1098 1093 1081 1065 1050 1043 1051 1069 1080 1069 1042 1014 1000 1003 1021 1048 1075 1090 1084 1059 1031 1018 1026 1049 1073 1088 1091 1083 1070
1162A070j1njkkjmj1j7j6j4j4oQJ2mj9j1QQrrJ5L5K5OOJ8J8J1RJ2J0KjLKOJ8K3Pk3l2j2J2
$$ 1070 1059 1054 1053 1051 1049 1048 1044 1033 1016 1000 986 972 966 974 986 982 963 952 960 968 959 950 965 1000 1025 1031 1037 1055 1073 1084 1093 1105 1115 1117 1116 1119 1121 1127 1145 1168 1175 1152 1120 1108 1120
1156A120J5Jj4k4k6j2J2K6K1O%jmqol%MJ4J9J2kj3j6pOJ7J7J3J8L1K8Kk5k4o%j2k0pJ5K0J3
$$ 1120 1135 1136 1122 1098 1072 1060 1072 1098 1119 1125 1125 1124 1120 1112 1106 1103 1103 1107 1121 1140 1152 1150 1137 1121 1114 1120 1137 1154 1167 1185 1216 1244 1246 1221 1197 1191 1191 1179 1159 1152 1167 1187 1200
1151A200LLMJj0k0k3j8j4j6j5jJ6J9Onqj1k0k5rJ8L4K7Qj3k3k2pJ0K2K1J2KkKJ0J0mk4l7l2
$$ 1200 1203 1206 1210 1211 1201 1181 1158 1140 1126 1110 1095 1094 1110 1129 1135 1130 1122 1111 1091 1066 1057 1075 1109 1136 1144 1131 1108 1086 1079 1089 1111 1132 1144 1146 1144 1146 1156 1166 1162 1138 1101 1069
1146A069j9pljJ1K8L5J9nj6mJ4K1K1J6Pqj5q%mk0k9k1mMKoj0pKNPJ8L7M7L3R%J0J5jk3k8k1
$$ 1069 1050 1043 1040 1039 1050 1078 1113 1132 1127 1111 1107 1121 1142 1163 1179 1186 1178 1163 1155 1155 1151 1131 1102 1081 1077 1081 1083 1077 1067 1060 1062 1067 1074 1092 1129 1176 1209 1218 1218 1228 1243 1242 1219 1191 1170
1140A170k3l0k7j0MMlkJ0J8J6Npj8k8l5l8k6kJ9J9nl4m4k9jK3L0K1OPK6M4L9J6rj4lRJ4Po
$$ 1170 1147 1117 1090 1080 1084 1088 1085 1083 1093 1111 1127 1132 1125 1107 1079 1044 1006 980 978 997 1016 1011 977 933 904 903 926 956 977 983 990 1016 1060 1099 1115 1106 1092 1089 1098 1112 1119 1113
1135A113j1pmj0j8j6mLlj1j0jPJ1J4Oj3k9l0j9j1mMJ2PjNK7M1K6nk3j9pjOJ6K1J7OJKjpj3
$$ 1113 1102 1095 1091 1081 1063 1047 1043 1046 1043 1032 1022 1021 1028 1039 1053 1059 1046 1017 987 968 957 953 957 969 976 975 980 1007 1048 1074 1069 1046 1027 1020 1019 1025 1041 1062 1079 1085 1086 1088 1087 1080 1067
1130A067j0LJ6K3K2J1nk6l8l5k0qmjRK4L0K1Ol%J1J6Pj8m0m8l9k0jJ1J0LJRJ4J0QJ0R%j1j2
$$ 1067 1057 1060 1076 1099 1121 1132 1127 1101 1063 1028 1008 1000 996 995 1004 1028 1058 1079 1085 1082 1082 1093 1109 1116 1098 1058 1010 971 951 950 961 971 974 975 984 998 1008 1016 1026 1035 1035 1024 1012
1124A012lQJ6J9J4jj0KK4K9J0nJJ6K3J5Mrk2l6m5m5l7j6OJ7J1LNJ3J1QJ1J6Qj0k0j3LJ5J6
$$ 1012 1009 1017 1033 1052 1066 1065 1055 1057 1081 1110 1120 1115 1116 1132 1155 1170 1174 1165 1143 1107 1062 1017 980 964 970 987 998 1001 1006 1019 1030 1038 1049 1065 1073 1063 1043 1030 1033 1048 1064
1119A064J0L%PJ8K5J8jk0l2k8j2MMlkRJ8J7J2Ojj3k1j3jQPKrj7j2LJ5J1%KJ6K4J2qj4pLQP
$$ 1064 1074 1077 1077 1084 1102 1127 1145 1144 1124 1092 1064 1052 1056 1060 1057 1055 1064 1082 1099 1111 1117 1116 1103 1082 1069 1068 1076 1083 1085 1076 1059 1047 1050 1065 1076 1076 1078 1094 1118 1130 1122 1108 1101 1104 1112 1119
1114A119MJnrj4j5j1m%mqlRJ3PkKJ2J8J0JkkkjKK%pj4j9k1j3OK2K0NlKJ0J0J0J3J4lk9m2l1
$$ 1119 1123 1124 1119 1110 1096 1081 1070 1066 1066 1062 1054 1051 1060 1073 1080 1078 1080 1092 1110 1120 1121 1119 1117 1115 1114 1116 1118 1118 1111 1097 1078 1057 1044 1050 1072 1092 1097 1094 1096 1106 1116 1126 1139 1153 1150 1121 1079 1048
1108A048j2KQJ0RNkj6k9l4k0J0L4M2L1J5%pmNJ1Rkj4j8nK0L4K3%qLJ8K2J4Krj9j6jJ1Rpk5
$$ 1048 1036 1038 1046 1056 1065 1070 1068 1052 1023 989 969 979 1013 1055 1086 1101 1101 1094 1090 1095 1106 1115 1113 1099 1081 1076 1096 1130 1153 1153 1145 1148 1166 1188 1202 1204 1195 1176 1160 1159 1170 1179 1172 1147
1103A147l4l5k1jJ4J0kojlmOL0M2K9Jk3l3k7qJ3K0Qj0k2k6k2rPJ4OjMJ1Qnj7k4j7OL7N2L6
$$ 1147 1113 1078 1057 1056 1070 1080 1078 1072 1071 1068 1064 1070 1100 1142 1171 1172 1149 1116 1089 1081 1094 1114 1122 1112 1090 1064 1042 1033 1040 1054 1060 1059 1063 1074 1082 1077 1060 1036 1019 1025 1062 1114 1150
1097A150J3NJ3J3Lkjoj4rRJ5jk0k6k0j4qJRRNok6m3l6oK0K4J3OOMjlqj6j5nJnqNJ5Lj3pJ2
$$ 1150 1163 1168 1181 1194 1197 1195 1194 1188 1174 1165 1174 1189 1188 1168 1142 1122 1108 1100 1101 1110 1119 1124 1118 1092 1049 1013 1007 1027 1051 1064 1070 1076 1080 1079 1076 1068 1052 1037 1032 1033 1028 1020 1025 1040 1043 1030 1023 1035
1091A035J2j2k1kK4L1K2J3Noj2qMQO%j2k6k7j2QJ6J4J0N%%J1J9Rj5l2k7j0mrj6j0NJ6J7J1
$$ 1035 1047 1035 1014 1012 1036 1067 1089 1102 1107 1101 1089 1081 1085 1093 1099 1099 1087 1061 1034 1022 1030 1046 1060 1070 1075 1075 1075 1086 1105 1114 1099 1067 1040 1030 1026 1017 1001 991 996 1012 1029 1040
1086A040L%KOJ3J4J3J5K0K0J2PJ3K1J7Jrj5k7m0l3nJ6J3moJKrj7j3nnj3j5KK3K5Lj7mL0M4
$$ 1040 1043 1043 1045 1051 1064 1078 1091 1106 1126 1146 1158 1165 1178 1199 1216 1217 1208 1193 1166 1126 1093 1088 1104 1117 1113 1107 1108 1110 1101 1084 1071 1066 1061 1048 1033 1035 1058 1083 1086 1069 1065 1095 1139
1081A139K3jpoj9l1j8J2K4J5LNPLkJRJ2J1Nnj5k3k9m0m9l5pJ7K4J9J0%qoMJ0Jj2j5mJ0J5L
$$ 1139 1162 1161 1154 1148 1129 1098 1080 1092 1116 1131 1134 1139 1146 1149 1147 1148 1157 1169 1180 1185 1180 1165 1142 1113 1073 1024 989 982 999 1023 1042 1052 1052 1044 1038 1042 1052 1053 1041 1026 1022 1032 1047 1050
1076A050j6k4rJ3J9J1MONlro%PJ7K6K3Porj2k1j8KJ9J2ljJ7J9Kk2l2l2k4nJ6K4Pj6k0mJ2Q
$$ 1050 1034 1010 1001 1014 1033 1044 1048 1054 1059 1056 1047 1041 1041 1048 1065 1091 1114 1121 1115 1106 1094 1073 1055 1057 1076 1088 1085 1084 1101 1120 1122 1100 1068 1036 1012 1007 1023 1047 1054 1038 1018 1014 1026 1034
1070A034j4k6j2J6K9J5%kQJ0Lloj1j5rPK3K2J1knKOLlopj6l1l4j2K1L9L5K5J7J2Lm%RJ0%j5
$$ 1034 1020 994 982 998 1027 1042 1042 1040 1048 1058 1061 1058 1052 1041 1026 1017 1024 1047 1069 1080 1078 1073 1075 1081 1084 1081 1075 1068 1052 1021 987 975 996 1035 1070 1095 1112 1124 1127 1123 1123 1132 1142 1142 1127
1065A127k0j2JJ0J7K5K6Qk3m0k9nMpj9k1k0j4jJ5K5K8K9K8J9JmQK2K0Lj2k2k9k4j0PJ0Kpp
$$ 1127 1107 1095 1096 1106 1123 1148 1174 1182 1159 1119 1090 1085 1089 1082 1063 1042 1022 1008 1007 1022 1047 1075 1104 1132 1151 1152 1148 1156 1178 1198 1201 1189 1167 1138 1114 1104 1111 1121 1123 1116 1109
1060A109LJ5K3K0Lj5k3j9j9k1j7mOLpqJQjj2j3llk0l7l5j3J7L9M1K9J2J0K5L0J1j8k6qRJ4
$$ 1109 1112 1127 1150 1170 1173 1158 1135 1116 1097 1076 1059 1055 1061 1064 1057 1049 1050 1058 1057 1045 1032 1029 1026 1006 969 934 921 938 977 1018 1047 1059 1069 1094 1124 1135 1117 1091 1083 1092 1106
1055A106PJj0k1k3j0Jlj3pJ5L7M2K9QnjLpk7l1rK2L5L2K6J7lk1j5J0K0Kk9m0k8rJJkmmmpj0
$$ 1106 1113 1114 1104 1083 1060 1050 1051 1048 1035 1028 1043 1080 1122 1151 1159 1154 1153 1156 1149 1122 1091 1082 1104 1139 1171 1197 1214 1211 1190 1175 1185 1205 1207 1178 1138 1110 1101 1102 1103 1101 1097 1093 1089 1082 1072
1049A072p%MJm%Lkj3j8j4j1j4k0j4RL3M4L9K9K4K1J8J3Jj6l0k8j0Kkj4j7j6j9k3j2RK5K5J8
$$ 1072 1065 1065 1069 1070 1066 1066 1069 1067 1054 1036 1022 1011 997 977 963 972 1005 1049 1088 1117 1141 1162 1180 1193 1194 1178 1148 1120 1110 1112 1110 1096 1079 1063 1044 1021 1009 1018 1043 1068 1086
1044A086K1K3J3oj9k0j7j9j6kJ2J3%j6k0j3nKPJ8K4K3J3Kmpj2j5j6pMJ8K4J8jk1k5j3JPJq
$$ 1086 1107 1130 1143 1137 1118 1098 1081 1062 1046 1044 1056 1069 1069 1053 1033 1020 1015 1017 1024 1042 1066 1089 1102 1104 1100 1093 1081 1066 1050 1043 1047 1065 1089 1107 1106 1085 1060 1047 1048 1055 1056 1048
1039A048nJ0K3J9%j7j3QJ9J0mnNMj1k2j5JM%OJ8J4pk1j1RJ1kj1j2j2j2lJ6K9L4L2J9mk9l1
$$ 1048 1043 1053 1076 1095 1095 1078 1065 1073 1092 1102 1098 1093 1098 1102 1091 1069 1054 1055 1059 1059 1065 1083 1097 1090 1069 1058 1067 1078 1076 1065 1053 1041 1029 1026 1042 1071 1105 1137 1156 1152 1123 1092
1034A092rJ0J2OQJ3Ooj3qjMPMpj2JK0K4Jk4k7j1NJ2J0J0J4J3Poj5j5rl%Jjrk4l1k2KK2K6J9
$$ 1092 1083 1093 1105 1111 1119 1132 1138 1132 1119 1111 1110 1114 1121 1125 1118 1106 1107 1127 1151 1152 1128 1101 1090 1095 1107 1117 1127 1141 1154 1161 1155 1140 1125 1116 1113 1113 1114 1113 1104 1080 1049 1027 1029 1051 1077 1096
1028A096J0Jj5l5m2k8JK2K9K5K0J8J8J7J6J9K3J9Kk3m2m6m1l9l6l3k4rJ1L1L3J0k1k8pJ8K7
$$ 1096 1106 1107 1092 1057 1015 987 988 1010 1039 1064 1084 1102 1120 1137 1153 1172 1195 1214 1216 1193 1151 1105 1064 1025 989 956 932 923 934 965 998 1008 987 959 952 970 997
1024I97K3K1J9RjonkOROnkJ9L6K7lk8l7l7k9oK1L3K4R%lrj6j5oLMLkoponjRJ6J7J0L%mqoq
$$ 997 1020 1041 1060 1069 1068 1062 1057 1055 1061 1070 1076 1071 1069 1088 1124 1151 1148 1120 1083 1046 1017 1011 1032 1065 1089 1098 1098 1095 1086 1070 1055 1049 1052 1056 1059 1057 1051 1044 1038 1033 1032 1041 1057 1074 1084 1087 1087 1083 1075 1069 1061
1018A061j8k5j7PJ7NpOL1L9K0JLK0K8J8Jj6l2l9l2j3J2K0J1nj4j1mNK2M1N0L2Jk5l3k5j0K
$$ 1061 1043 1018 1001 1008 1025 1030 1023 1029 1060 1099 1119 1120 1123 1143 1171 1189 1190 1174 1142 1103 1071 1058 1070 1090 1101 1096 1082 1071 1067 1072 1094 1135 1185 1217 1218 1193 1160 1135 1125 1127
1013A127PJlKJ5K2J5%j8l6m7m3k1KJ6J6RMjj2k6l3k5nJ4K6L1L0J8qk5j8PJ9Oj5j8JK3L2L1
$$ 1127 1134 1135 1132 1134 1149 1171 1186 1186 1168 1132 1085 1042 1021 1023 1039 1055 1064 1068 1067 1055 1029 996 971 966 980 1006 1037 1067 1085 1077 1052 1034 1041 1060 1066 1051 1033 1034 1057 1089 1120
1008A120L0K9K2Rkm%Kok0k3j1jpl2m9m6k3nLMPMj0k8k8oK3L1J4oqJ0K1J5K%J2K0J6kj7k3j5
$$ 1120 1150 1179 1201 1210 1208 1204 1204 1206 1200 1180 1157 1146 1145 1138 1106 1057 1011 988 983 986 990 997 1001 991 963 935 929 952 983 997 991 983 993 1014 1029 1031 1031 1043 1063 1079 1077 1060 1037 1022
1002A022KK1J9jk7m1l6k7j4KK1L4L0J3JjQK0L0L0J8Jj4j7rOK2K9K4J4Nlj2k6l6l2j0J5K3Q
$$ 1022 1024 1045 1064 1063 1036 995 959 932 918 920 941 975 1005 1018 1019 1018 1026 1046 1076 1106 1124 1125 1111 1094 1085 1091 1113 1142 1166 1180 1185 1182 1170 1144 1108 1076 1066 1081 1104 1112
997A112j4k5k4j5qlnj1j5nJ6K8K1NjOJ1QOJ8L2L2J1j4k2pMjj7k1pNjj4j0QK1J7Mlkoj9k4j1
$$ 1112 1098 1073 1049 1034 1026 1023 1018 1007 992 987 1003 1031 1052 1057 1056 1062 1073 1081 1087 1105 1137 1169 1180 1166 1144 1137 1141 1140 1123 1102 1095 1100 1099 1085 1075 1083 1104 1121 1125 1122 1120 1114 1095 1071 1060
992A060J8L6L0PqkQQJmoj2k1k4j2%jj5k7k1LK5K9J9QQJ0P%kLNmj8k6k0jK0K4Nk1l1k0KK0K6
$$ 1060 1078 1114 1144 1151 1143 1141 1149 1157 1158 1154 1148 1136 1115 1091 1079 1079 1078 1063 1036 1015 1018 1043 1072 1091 1099 1107 1117 1124 1124 1122 1125 1130 1126 1108 1082 1062 1061 1081 1105 1110 1089 1058 1038 1040 1060 1086
986A086K4K5K6K0lk3k3kJ3Pqj0mjKJ3K4K1Poj7l3m7m0j5MPJ2K1K1NpQK8K9J1lnnmJMJppjk
$$ 1086 1110 1135 1161 1181 1178 1155 1132 1130 1143 1150 1142 1132 1128 1127 1129 1142 1166 1187 1194 1188 1171 1138 1091 1051 1036 1040 1047 1059 1080 1101 1106 1099 1107 1135 1164 1175 1172 1167 1162 1158 1159 1163 1164 1157 1150 1149 1147
981A147j7l4l9l0nJ7K2Pj1j4rj1j5j2jLKJ3L3L7J5j1j5lQJ2J5J9J6J1J2J6J0j0k8l5k6pMM
$$ 1147 1130 1096 1057 1027 1022 1039 1061 1068 1057 1043 1034 1023 1008 996 995 998 1000 1013 1046 1083 1098 1087 1072 1069 1077 1089 1104 1123 1139 1150 1162 1178 1188 1178 1150 1115 1089 1082 1086 1090
976A090pj3qJNMNLlj0j1kLNJ3K3L0K5J4Nlj2j4qK%j7l2l1j1J4L0L0K1J6J7J6Mj5k3j8q%kj0
$$ 1090 1083 1070 1062 1063 1068 1072 1077 1080 1077 1067 1056 1054 1057 1062 1075 1098 1128 1153 1167 1172 1169 1157 1143 1135 1137 1137 1120 1088 1057 1046 1060 1090 1120 1141 1157 1174 1190 1194 1179 1156 1138 1130 1130 1128 1118
970A118k1k7j8%Rml0m2l2j2KPOjj1j9j6kJ2K1K2K7L7N2N4L8J9J0J4J1mj9j8qmn%J6L5M1L2
$$ 1118 1097 1070 1052 1052 1061 1057 1027 985 953 941 943 950 956 955 944 925 909 907 919 940 962 989 1026 1078 1132 1170 1189 1199 1213 1224 1220 1201 1183 1175 1171 1166 1166 1182 1217 1258 1290
965A290Qk0l3k5rqj5j6ojpr%Nnk0j5LJ5Rmq%QR%j2j3rqqMK6L4K0jj0j5k9l7k4kQPJ3K9L4K2
$$ 1290 1298 1278 1245 1220 1211 1203 1188 1172 1166 1165 1158 1149 1149 1154 1149 1129 1114 1117 1132 1141 1137 1129 1129 1137 1146 1146 1134 1121 1112 1104 1096 1100 1126 1160 1180 1179 1169 1154 1125 1088 1064 1062 1070 1077 1090 1119 1153 1175
959A175J3K0K2Qj1j6j4j7k1j6kOJ0J8L0L3K4Oj2k4k2j0jpj1mQKk2l5k4l%j4k1nK1L8L3J0k1
$$ 1175 1188 1208 1230 1238 1227 1211 1197 1180 1159 1143 1141 1147 1157 1175 1205 1238 1262 1268 1256 1232 1210 1200 1199 1192 1181 1177 1185 1187 1165 1130 1106 1103 1103 1089 1068 1063 1084 1122 1155 1165 1144
954A144m1m0k0QK8L2L1K8K0Lj2j1MJ6J2RJ7K5J6oj9j8j3j2kJ4J8jk1k5j9k5l4k6JK4K5J4P
$$ 1144 1103 1063 1043 1051 1079 1111 1142 1170 1190 1193 1181 1170 1174 1190 1202 1211 1228 1253 1269 1263 1244 1226 1213 1201 1199 1213 1231 1230 1209 1184 1165 1140 1106 1080 1081 1105 1130 1144 1151
949A151Mnj6k3j8%J8K6K2J5J5J6Mj4k2j4mqk0k4j1NJ4J3J6K1K5J7kk1k6j9j0pJJ0J2lj6j3
$$ 1151 1155 1150 1134 1111 1093 1093 1111 1137 1159 1174 1189 1205 1209 1195 1173 1159 1155 1147 1127 1103 1092 1097 1111 1124 1140 1161 1186 1203 1201 1180 1154 1135 1125 1118 1119 1129 1141 1138 1122 1109
945A109JJ3J3J3J4J2Loj2j7k3j8JJ6Rj9m0l1kJ4Prj0QK3J5mj5j2lMJ3K7L3K4Qmooj2k3l0k8
$$ 1109 1110 1123 1136 1149 1163 1175 1178 1172 1160 1143 1120 1102 1103 1119 1128 1109 1069 1038 1036 1050 1057 1048 1038 1046 1069 1084 1080 1065 1053 1050 1054 1067 1094 1127 1151 1159 1155 1149 1143 1131 1108 1078 1050
939A050j6KJ7K2K0J6J2J0J2J9K1J3%j1qLJ2J0qk5k7j5ljokJ0K0K0J1ko%J1J5Ork1j7oPJ4J7
$$ 1050 1034 1036 1053 1075 1095 1111 1123 1133 1145 1164 1185 1198 1198 1187 1179 1182 1194 1204 1196 1171 1144 1129 1126 1125 1119 1117 1127 1147 1167 1178 1176 1170 1170 1181 1196 1202 1193 1172 1155 1149 1156 1170 1187
934A187J7J3MnoLPql3m2k3LJ0KlJN%%QJ1Kj3k1j9j2mJ1K8L9L2Rj1j4KJ3Oj2j8pM%j5l4n0n4
$$ 1187 1204 1217 1221 1216 1210 1213 1220 1212 1179 1137 1114 1117 1127 1129 1126 1127 1132 1132 1132 1140 1151 1153 1140 1119 1100 1088 1084 1095 1123 1162 1194 1203 1192 1178 1180 1193 1199 1187 1169 1162 1166 1166 1151 1117 1067 1013
928A013l5LL1L3J7KmlJQJ6K0K8L7L2Pk4l4k1jPLok0l4m3m1k5LL4N2M8K7Mj0j2pKOMjoj1k2
$$ 1013 978 981 1012 1045 1062 1064 1060 1057 1058 1066 1082 1102 1130 1167 1199 1206 1182 1148 1127 1126 1133 1136 1130 1110 1076 1033 992 967 970 1004 1056 1104 1131 1135 1125 1113 1106 1108 1114 1118 1117 1111 1100 1078
923A078l3l1j2J5L3L1Qj7k3pJ5K4J9J3J3J3J1J6K3K0Mj0j3j2j5j9j7j3ro%lj5l1l8l6k6j0
$$ 1078 1045 1014 1002 1017 1050 1081 1089 1072 1049 1042 1057 1081 1100 1113 1126 1139 1150 1166 1189 1209 1213 1203 1190 1178 1163 1144 1127 1114 1105 1099 1099 1096 1081 1050 1012 976 950 940
918I40J2K7K3Oj3j9rRK8L2K5J5J1J3J4Qnk2l1k6qNRQQKrj5rjKNRRkj1JK3L1J7nj7j3MK5L0
$$ 940 952 979 1002 1008 995 976 967 976 1004 1036 1061 1076 1087 1100 1114 1122 1117 1095 1064 1038 1030 1035 1044 1052 1060 1062 1053 1038 1029 1028 1030 1035 1044 1053 1051 1040 1041 1064 1095 1112 1107 1090 1077 1081 1106 1136
913A136J2j1j5JRJnkJpj3r%%mqqnlpk1l7l7j0J8K6J6MMQNqk3l1k3nPRJ3K7L8L0J1JLjj5k3
$$ 1136 1148 1137 1122 1123 1132 1133 1128 1126 1127 1120 1107 1098 1098 1098 1094 1086 1078 1073 1070 1063 1042 1005 968 958 976 1002 1018 1022 1026 1034 1039 1031 1008 977 954 949 956 965 978 1005 1043 1073 1084 1085 1088 1087 1072 1049
907A049k0rnnkQJ8K2J4%nOL2N2N5M1K3Lj7l7m9n1m1k4j1p%J8M0M3K4Jnklj5k1j2JNjlmj0k2
$$ 1049 1029 1020 1015 1010 1008 1016 1034 1056 1070 1070 1065 1071 1103 1155 1210 1251 1274 1277 1260 1223 1174 1123 1082 1058 1047 1040 1040 1058 1098 1141 1165 1166 1161 1159 1156 1141 1120 1108 1109 1114 1113 1110 1106 1096 1074
901A074k6j6%NjnjKMPJ5J6J2QOjj2j1QK2J3njJ7J7j1l5k9j1pj6j8pNJ0Ooj7j7jJ6J7KoNK3
$$ 1074 1048 1032 1032 1037 1036 1031 1030 1032 1036 1043 1058 1074 1086 1094 1100 1099 1087 1076 1084 1106 1119 1114 1113 1130 1147 1136 1101 1072 1061 1054 1038 1020 1013 1018 1028 1034 1028 1011 994 993 1009 1026 1028 1022 1027 1050
896A050L0K7K2K1J7jj7j9mJ5J9Qj0k6l4l5j8RL1L5K8K3K2K1J8J6Qj1l5n2m7k6nLoj7j3%J0
$$ 1050 1080 1107 1129 1150 1167 1166 1149 1130 1126 1141 1160 1168 1158 1132 1098 1063 1045 1054 1085 1120 1148 1171 1193 1214 1232 1248 1256 1245 1210 1158 1111 1085 1080 1083 1077 1060 1047 1047 1057
891A057O%LJ1QJkKLoj5j6qKJ4K1J1j0k2j4QK4K3J0pj5pRK3K6K5K6K3Pj2k3k7m0n3n0k2LMj7
$$ 1057 1063 1063 1066 1077 1085 1086 1084 1086 1089 1083 1068 1052 1044 1046 1060 1081 1092 1082 1060 1046 1054 1078 1101 1111 1104 1089 1082 1091 1114 1140 1165 1191 1214 1221 1209 1186 1159 1119 1066 1016 994 997 1001 984
886I84l4l3j7OL2N3N6M7L5L2L0K1Pkj1k3k9j0K0L6K7J9L0M7M1Rj4oJ4J7j0l9m0j7MKj6k3j2
$$ 984 950 917 900 906 938 991 1047 1094 1129 1161 1191 1212 1219 1217 1206 1183 1154 1144 1164 1200 1227 1246 1276 1323 1364 1373 1359 1353 1367 1384 1374 1335 1295 1278 1282 1284 1268 1245 1233
881A233nj3j8nJ7J8ql5l9k5j4j4j0%Mnj5j0J2K6K4J4J3J6Lk5m1k8lOjlkj1k3k1jJ3Oonkoj1
$$ 1233 1228 1215 1197 1192 1209 1227 1219 1184 1145 1120 1106 1092 1082 1082 1086 1081 1066 1056 1068 1094 1118 1132 1145 1161 1164 1139 1098 1070 1067 1073 1072 1069 1067 1056 1033 1012 1011 1024 1030 1024 1019 1017 1011 1000
875A000LK2K4J0jNJ6J8J2KorkQPmqkPJ0RJ2Ppk4k1kJ9K2Qj5l0k3nRPmj3j4j7j5j0kNOQJ0P
$$ 1000 1003 1025 1049 1059 1058 1063 1079 1097 1109 1111 1105 1096 1094 1102 1109 1105 1097 1095 1102 1112 1121 1133 1140 1133 1109 1088 1086 1105 1127 1135 1120 1090 1067 1062 1071 1078 1074 1061 1047 1030 1015 1005 1003 1008 1014 1022 1032 1039
870A039jj2k5m0m5k6QL3L2J9PjopJJ5J8J3LmqpjJ0J7J2Kl%MQJ0PMJ0K4L3K0qk9k4oPN%lmo
$$ 1039 1038 1026 1001 961 916 890 898 931 963 982 989 988 982 975 976 991 1009 1022 1025 1021 1013 1006 1005 1015 1032 1044 1046 1043 1043 1047 1055 1065 1072 1076 1086 1110 1143 1163 1155 1126 1102 1096 1103 1108 1108 1105 1101 1095
864A095rj4k0k5k0pLjj0j3nMJ3K8M3L8J1j4rK1L6J6j6k9k0qnMJ9K3Ok1l2k1kJ1J3J0O%prj
$$ 1095 1086 1072 1052 1027 1007 1000 1003 1002 992 979 974 978 991 1019 1062 1100 1111 1097 1088 1109 1145 1161 1145 1116 1096 1088 1083 1087 1106 1129 1135 1114 1082 1061 1059 1070 1083 1093 1099 1099 1092 1083 1082
858A082J0J3jj0PM1N8L8Kj6j0J0L3M6M7L5K0Jk7o4p9n2rJ2Jj7k1j2NK6L1Rk4l4j2Nmj7pJ4
$$ 1082 1092 1105 1104 1094 1101 1142 1200 1238 1240 1224 1214 1224 1257 1303 1350 1385 1405 1406 1379 1315 1236 1184 1175 1187 1188 1171 1150 1138 1143 1169 1200 1209 1185 1151 1139 1144 1140 1123 1116 1130
854A130J4mj4oLMMROj4l3l0lL3N4M8K1j3l4l5k8j6nPJ1Mqk0k1rRJ4lk6k5JK5K7J7K0L3L8J9
$$ 1130 1144 1140 1126 1120 1123 1127 1131 1140 1146 1132 1099 1069 1066 1099 1153 1201 1222 1209 1175 1140 1112 1096 1091 1098 1109 1113 1105 1085 1064 1055 1064 1078 1075 1049 1024 1025 1050 1077 1094 1114 1147 1185 1204
848A204j2l0k5j2nj1j4j1nllNRLj3j9j1lqj5j0PK2K2J2NPJ5K0J2loMJ6Pj7l5l7k5j4rmMJ2
$$ 1204 1192 1162 1137 1125 1120 1109 1095 1084 1079 1076 1073 1078 1087 1090 1077 1058 1047 1044 1036 1021 1011 1018 1040 1062 1074 1079 1086 1101 1121 1133 1130 1124 1128 1144 1151 1134 1099 1062 1037 1023 1014 1010 1014 1026
843A026K1K9K9J3j1k7k3rljQK4L2K3Oqj4j6j0KJ2J1RROj4l8m3j9J1J8Nj1j0PK5L2L3L0K0m
$$ 1026 1047 1076 1105 1118 1107 1080 1057 1048 1045 1044 1052 1076 1108 1131 1137 1129 1115 1099 1089 1091 1103 1114 1123 1132 1138 1124 1086 1043 1024 1035 1053 1058 1047 1037 1044 1069 1101 1134 1164 1184 1180
838A180l4m3j6J9L0J6K%nk2l1k0nnj3nJ5L3M0L6K0pl1l2j7j3k2j9PL6L7Pj9k5j6ppnKQJ4K5
$$ 1180 1146 1103 1087 1106 1136 1152 1154 1154 1149 1127 1096 1076 1071 1066 1053 1048 1063 1096 1136 1172 1192 1185 1154 1122 1105 1092 1070 1051 1058 1094 1131 1138 1119 1094 1078 1071 1064 1059 1061 1069 1083 1108
833A108M1M7K9jnK6N9O0K6pj7j4qjOMmj0j1j3j7j3JJ0Kj2j9j5j0pqj6k2j6OK4K5J8J0Onk1
$$ 1108 1149 1196 1225 1224 1219 1245 1304 1364 1390 1383 1366 1352 1344 1343 1349 1353 1349 1339 1328 1315 1298 1285 1286 1296 1298 1286 1267 1252 1242 1235 1227 1211 1189 1173 1179 1203 1228 1246 1256 1262 1257 1236
828A236k9k6j5LK9M2K5j2l9m0k9k5k3j2QJ9J8J3J4K0K1J0rk7l7l8l4k5nJ9L6L8L2K8K6K2J2
$$ 1236 1207 1181 1166 1169 1198 1240 1265 1253 1214 1174 1145 1120 1097 1085 1093 1112 1130 1143 1157 1177 1198 1208 1199 1172 1135 1097 1063 1038 1033 1052 1088 1126 1158 1186 1212 1234 1246
823A246Kqk0l0k6mJ4Rj8l9l0lJ7J3mj3oJ3K2J3jqomonNJ4J3OPJ7K5K3J6RKrk2k7k1rJJkoq
$$ 1246 1248 1240 1220 1190 1164 1160 1174 1183 1165 1126 1096 1093 1110 1123 1119 1106 1100 1113 1135 1148 1147 1139 1133 1129 1123 1118 1123 1137 1150 1156 1163 1180 1205 1228 1244 1253 1255 1246 1224 1197 1176 1167 1168 1169 1167 1161 1153
817A153j3k4k7j8LJ6K1K4K7K6J1j1k4j7MK1K4Ok1m0m3k7lJ6K0J1KMJ0QkmOJ1Lj0j2opj6k1
$$ 1153 1140 1116 1089 1071 1074 1090 1111 1135 1162 1188 1199 1188 1164 1147 1151 1172 1196 1202 1181 1141 1098 1071 1068 1084 1104 1115 1117 1121 1131 1139 1137 1133 1139 1150 1153 1143 1131 1125 1118 1102 1081
812A081j2kLJ%MJ3K2K5J7Jj3j7rLJ2J2Jj1j4qKJ1J7J8J4RPJ3J9K0Rpk2k2oJ1Pj8m7n1l0KK4
$$ 1081 1069 1067 1070 1071 1071 1075 1088 1110 1135 1152 1153 1140 1123 1114 1117 1129 1141 1142 1131 1117 1109 1111 1122 1139 1157 1171 1180 1187 1200 1219 1239 1248 1241 1219 1197 1191 1202 1209 1191 1144 1093 1063 1065 1089
807A089K9K1J0LMNkj9l7m3l2nK5M4M1K3LqpmJOPjj4j3OK6K4jk8l3k0o%joj0qJJ0J2J3K0K5
$$ 1089 1118 1139 1149 1152 1156 1161 1159 1140 1103 1060 1028 1023 1048 1092 1133 1156 1159 1151 1144 1140 1141 1147 1154 1153 1139 1126 1132 1158 1182 1181 1153 1120 1100 1094 1094 1093 1087 1077 1069 1070 1080 1092 1105 1125 1150
802A150J6lk1k5k3k0j4%J6K4K2J9J2mk2l0k3qKNQJ2J8K3K6J9Jj9k5j6%J1J7K0J7J1OMPLqj7
$$ 1150 1166 1163 1142 1117 1094 1074 1060 1060 1076 1100 1122 1141 1153 1149 1127 1097 1074 1066 1068 1073 1081 1093 1111 1134 1160 1179 1180 1161 1136 1120 1120 1131 1148 1168 1185 1196 1202 1206 1213 1216 1208 1191
796A191j8j8k2k5k4k1k2k3j3QL0M3L7J6oj6qK%j3k5k6j8q%pk2l1j5K1M3M2K9K2J9J0kj5k0
$$ 1191 1173 1155 1133 1108 1084 1063 1041 1018 1005 1013 1043 1086 1123 1139 1133 1117 1109 1111 1111 1098 1073 1047 1029 1021 1021 1014 992 961 946 967 1010 1052 1081 1103 1122 1132 1130 1115 1095
792A095k1j4mLLlmlOK2M2M7L0ml0l0j0J5K0jl0m3l2k0j8j5KK3L1K7K1J5jj2kJ9K8J3lopj3
$$ 1095 1074 1060 1056 1059 1062 1059 1055 1052 1058 1080 1122 1169 1199 1195 1165 1135 1125 1140 1160 1159 1129 1086 1054 1034 1016 1001 1003 1026 1057 1084 1105 1120 1119 1107 1105 1124 1152 1165 1162 1156 1149 1136
786A136j7pQJ0jnMK0L2L0Rk1m2m1k8j6j3j5j4rJJ7K7K4J1lqmj%jllqj2j0MJ6J5ok4k5rLNM
$$ 1136 1119 1112 1120 1130 1129 1124 1128 1148 1180 1210 1219 1198 1156 1115 1087 1071 1058 1043 1029 1020 1021 1038 1065 1089 1100 1097 1089 1085 1084 1084 1083 1080 1077 1069 1057 1047 1051 1067 1082 1076 1052 1027 1018 1021 1026 1030
781A030J1J9J7J3J3J9K0J5QOMoj4j7j6j9k0qJ3K3J6Kpj3j8j8j0KRJ1J4J4Kj5k7k5j9j3nNJ5
$$ 1030 1041 1060 1077 1090 1103 1122 1142 1157 1165 1171 1175 1169 1155 1138 1122 1103 1083 1075 1088 1111 1127 1129 1122 1109 1091 1073 1063 1065 1074 1085 1099 1113 1115 1100 1073 1048 1029 1016 1011 1016 1031
776A031J6Oj0j9j0J2L4L5J9MKRJ6J8J1kj3k1k1k0k0j8k1l1l4j5J7L4K4J0NJoj0mLmj3j1LJ0
$$ 1031 1047 1053 1043 1024 1014 1026 1060 1095 1114 1118 1120 1129 1145 1163 1174 1172 1159 1138 1117 1097 1077 1059 1038 1007 973 958 975 1009 1033 1043 1048 1049 1043 1033 1029 1032 1028 1015 1004 1007 1017
771A017Nkm%QJ9K7K7J9J8J5Kk1l0k0JJ3J3NmmQK6L8L7L0K2J6Mj3k9l7l4k6j9j4nPJ2MmLK4
$$ 1017 1022 1020 1016 1016 1024 1043 1070 1097 1116 1134 1149 1151 1130 1100 1080 1081 1094 1107 1112 1108 1104 1112 1138 1176 1213 1243 1265 1281 1285 1272 1243 1206 1172 1146 1127 1113 1108 1115 1127 1131 1127 1130 1154
766A154L7L1J9J7K0J6Pknpj4k4k2oJ5K2Lk1k3kJ9J4pk5k8k5k3k6l1k8j1J2J8Kj2rRK0K3K7
$$ 1154 1191 1222 1241 1258 1278 1294 1301 1299 1294 1287 1273 1249 1227 1221 1236 1258 1261 1240 1217 1215 1234 1248 1241 1216 1188 1163 1140 1114 1083 1055 1044 1056 1074 1076 1064 1055 1064 1084 1107 1134
761A134L2K0ql4l1rRJ2RJ9L5L8J9pk5k7k3k4k5k4j5kJ6K9K6Pj6k8k5rJ1K5J6rk8k2LJ8J3k
$$ 1134 1166 1186 1178 1144 1113 1104 1113 1125 1134 1153 1188 1226 1245 1238 1213 1186 1163 1139 1114 1090 1075 1073 1089 1118 1144 1151 1135 1107 1082 1073 1084 1109 1125 1116 1088 1066 1069 1087 1100 1098
756A098j3j4j5j6j6j2%J4K1J4LOK1L1K1OKKrk7l2j8jOJ0J7K1J7RMJ2K2K4J2j1l3m1k4MK1J9
$$ 1098 1085 1071 1056 1040 1024 1012 1012 1026 1047 1061 1064 1070 1091 1122 1143 1149 1151 1153 1144 1117 1085 1067 1066 1072 1082 1099 1120 1137 1146 1150 1162 1184 1208 1220 1209 1176 1135 1111 1115 1136 1155
751A155jk5m5n0l2jJ8RqnJ7L1K4Opj5k0j6lKj1k4j2J5K3OoRL9N5M3J9JlRK2K4J2rk7l4l2k2
$$ 1155 1154 1129 1084 1034 1002 1001 1019 1028 1020 1015 1032 1063 1087 1093 1086 1071 1051 1035 1032 1034 1023 999 987 1002 1025 1031 1025 1034 1073 1128 1171 1190 1191 1188 1197 1219 1243 1255 1246 1219 1185 1153 1131
746A131j4j9k5k0l%j1j6QM0M8K8NklplJ2K5J9pk9l0j5lmj7k5j6PK9L3K0J0J2J3%k5l2oK9L7
$$ 1131 1117 1098 1073 1053 1050 1050 1039 1023 1031 1071 1119 1147 1152 1150 1147 1140 1137 1149 1174 1193 1186 1157 1127 1112 1109 1105 1088 1063 1047 1054 1083 1116 1136 1146 1158 1171 1171 1146 1114 1108 1137 1174
740A174J3rlJ5J7nk4j9NK3K0lk7l2k3j4j5j0J0K9K3Jj0kKj3k9l0j8qkJ3L1L2J5oj4j5j0kN
$$ 1174 1187 1178 1175 1190 1207 1202 1178 1159 1164 1187 1207 1204 1177 1145 1122 1108 1093 1083 1093 1122 1145 1146 1136 1134 1136 1123 1094 1064 1046 1038 1036 1049 1080 1112 1127 1121 1107 1092 1082 1080 1085
735A085N%KJ3K3K6K1J7Rok1k9k7j6%J3J0mj2lJ3J5Lj2k0k3j6JJ4J6OMJ0J7J2kj4j3LJ7J9Q
$$ 1085 1090 1090 1092 1105 1128 1154 1175 1192 1201 1195 1174 1145 1118 1102 1102 1115 1125 1121 1109 1106 1119 1134 1137 1125 1105 1082 1066 1067 1081 1097 1103 1107 1117 1134 1146 1144 1130 1117 1120 1137 1156 1164
730A164NJ5K8J8j4l5k9pM%nlKLJk%%lj0j5pJ2K9L4K5J4Q%qk0l3l9l3j0J3K0J2NPRKrk0k3j5
$$ 1164 1169 1184 1212 1230 1216 1181 1152 1145 1149 1149 1144 1141 1143 1146 1147 1145 1145 1145 1142 1132 1117 1110 1122 1151 1185 1210 1224 1232 1232 1224 1204 1171 1132 1099 1089 1102 1122 1134 1139 1146 1155 1157 1148 1128 1105 1090
725A090%Omj7j6JJ2NlMJ7K5K2K1K2J6Lj0k1k7k9j6JOjr%J6K7K7K3K2K2K2J6jj5j6qpk4l6k9
$$ 1090 1090 1096 1092 1075 1059 1060 1072 1077 1074 1078 1095 1120 1142 1163 1185 1201 1204 1194 1173 1146 1117 1101 1102 1108 1107 1098 1098 1114 1141 1168 1191 1213 1235 1257 1273 1272 1257 1241 1233 1226 1202 1166 1137
719A137j0LLNJ3J6Mj3k5j9jK1K7J1j7k6jL1M3K7Nqj4k2k6j7NK3K6J1j3l0l2k0pmnJJ2J8J1
$$ 1137 1127 1130 1133 1138 1151 1167 1171 1158 1133 1114 1113 1134 1161 1172 1155 1129 1128 1159 1202 1229 1234 1226 1212 1190 1164 1147 1152 1175 1201 1212 1199 1169 1137 1117 1110 1106 1101 1102 1114 1132 1143
714A143%%OPmj4j0NK3L4M1L9K2mk2k2nPMj0k1j5NK2K0%k2k8k5k5k5j6%Rjj8k2j4lNJ3J9J5
$$ 1143 1143 1143 1149 1156 1152 1138 1128 1133 1156 1190 1231 1270 1292 1288 1266 1244 1239 1246 1250 1240 1219 1204 1209 1231 1251 1251 1229 1201 1176 1151 1126 1110 1110 1119 1118 1100 1078 1064 1061 1066 1079 1098 1113
709A113LmKJ1J6J7K2K4J5jj0qkoj1mJ4K6K3Pnp%QJ2Jj9l4l0j2LJprJJ3J7J9K2K3J6%j4j9j8
$$ 1113 1116 1112 1114 1125 1141 1158 1180 1204 1219 1218 1208 1200 1198 1192 1181 1177 1191 1217 1240 1247 1242 1235 1235 1243 1255 1256 1237 1203 1173 1161 1164 1165 1158 1149 1150 1163 1180 1199 1221 1244 1260 1260 1246 1227 1209
704A209j8j3oJMJMJ6L2M2L4J4lnOJ5Pqj6qMKj8m1m7l3j2NJ3J8J3Jj7l3l6k5KL5N3M5K0LMP
$$ 1209 1191 1178 1172 1173 1177 1178 1182 1198 1230 1272 1306 1320 1317 1312 1318 1333 1340 1332 1316 1308 1312 1314 1296 1255 1208 1175 1163 1168 1181 1199 1212 1213 1196 1163 1127 1102 1104 1139 1192 1237 1257 1260 1264 1271
698A271lj9k3j1Jkj0pPK7M1M7M3K8Rqj6k1k5l1l5l5k7j1PJ3KqpQJ6J4NLQJ3J5J2Loj1j0qr
$$ 1271 1268 1249 1226 1215 1216 1214 1204 1197 1204 1231 1272 1319 1362 1390 1399 1391 1375 1354 1329 1298 1263 1228 1201 1190 1197 1210 1212 1204 1197 1205 1221 1235 1240 1243 1251 1264 1279 1291 1294 1288 1277 1267 1259 1250
693A250rJK1L7L3J8Ojmj1j9k8m0m2l2pJ6K5J9J4J2J3Rlj6k3k1j3mOJ6K0J5PMQJ0MorkNJ1J5
$$ 1250 1241 1242 1263 1300 1333 1351 1357 1356 1352 1341 1322 1294 1254 1212 1180 1173 1189 1214 1233 1247 1259 1272 1281 1278 1262 1239 1218 1205 1201 1207 1223 1243 1258 1265 1269 1277 1287 1291 1285 1276 1274 1279 1290 1305
687A305J9J5Ooj4j4j1lQJ3J2RPJ0Qkj4k2j8mJ3J8Rqj5j0JMmj3j2lJ1K0J7kk2k8j6%J0J3J3
$$ 1305 1324 1339 1345 1339 1325 1311 1300 1297 1305 1318 1330 1339 1346 1356 1364 1362 1348 1326 1308 1304 1317 1335 1344 1336 1321 1311 1312 1316 1312 1299 1287 1284 1295 1315 1332 1330 1308 1280 1264 1264 1274 1287 1300
682A300J0NkjJ2K6K7J8POQ%j6k7j9MJ8Qj6l2k1PK3J2j1k2j2RK3J9Nj4k2j4JP%j2j4j1j5k1
$$ 1300 1310 1315 1313 1312 1324 1350 1377 1395 1402 1408 1416 1416 1400 1373 1354 1358 1376 1384 1368 1336 1315 1322 1345 1357 1346 1324 1312 1321 1344 1363 1368 1354 1332 1318 1319 1326 1326 1314 1300 1289 1274 1253
677A253j9oQJ4J0jj6k0lK6L8J6j3k0nRJ2QQkk2l8k9jK7M0L8K6Pqj2kJ3K6L1K5J4Kmj1k0l1
$$ 1253 1234 1228 1236 1250 1260 1259 1243 1223 1220 1246 1284 1300 1287 1267 1262 1271 1283 1291 1299 1297 1275 1237 1208 1207 1234 1274 1312 1338 1345 1337 1325 1323 1336 1362 1393 1418 1432 1434 1430 1419 1399 1368
672A368l0j2J2K4J8Krj0oJRJ8J9Pj4k8l0j8%J8L1L5K6J1mj9k6j9pqk2k8pK5K8Jk5k7j6j5k2
$$ 1368 1338 1326 1338 1362 1380 1382 1373 1363 1357 1358 1367 1385 1404 1411 1397 1369 1339 1321 1321 1339 1370 1405 1431 1442 1438 1419 1393 1374 1367 1359 1337 1309 1302 1327 1355 1356 1331 1304 1288 1273 1251
667A251j8NL0M4M1K7J0JOPqk7k9j0OMljJ3K0J7J1J0RMkmJPRJ0J9L3L7J8j4k7j5KKj0k0k1j7
$$ 1251 1233 1238 1268 1312 1353 1380 1390 1391 1397 1404 1396 1369 1340 1330 1336 1340 1337 1336 1349 1369 1386 1397 1407 1416 1420 1418 1414 1415 1422 1431 1441 1460 1493 1530 1548 1534 1507 1492 1494 1496 1486 1466 1445 1428
662A428rNJ9K0J8K0K3J8Lj0j8k4k4j6j3k3m0m1k5j3j5qJ7M0L0lk3j0J7L6M1M1L5K2QKQJ8L1
$$ 1428 1419 1424 1443 1463 1481 1501 1524 1542 1545 1535 1517 1493 1469 1453 1440 1417 1377 1336 1311 1298 1283 1275 1292 1332 1362 1359 1336 1326 1343 1379 1420 1461 1496 1518 1526 1528 1536 1554 1585
657A585M1L9K1pk4k1oKoj6j7%J5J8Poj1jJ5K3J6L%RJ5Qpj8j9j2JNok5l3j9KJ3J4J1QKKLmk6
$$ 1585 1626 1665 1686 1679 1655 1634 1628 1630 1624 1608 1591 1591 1606 1624 1631 1625 1614 1613 1628 1651 1667 1670 1670 1679 1694 1702 1695 1677 1658 1646 1647 1652 1646 1621 1588 1569 1571 1584 1598 1609 1617 1619 1621 1624 1620 1594
651A594m2k8%J0kj4nOPj%KMPJ4J8J3J0J9K8K7J6RJ1J5J5Nj3k6k7j2jJKPJ1QknjNJ1J4Pj3l0
$$ 1594 1552 1524 1524 1534 1532 1518 1513 1519 1526 1525 1525 1527 1531 1538 1552 1570 1583 1593 1612 1640 1667 1683 1692 1703 1718 1733 1738 1725 1699 1672 1660 1659 1660 1662 1669 1680 1688 1686 1681 1680 1685 1696 1710 1717 1704 1674
645A674k4%J7J1rk6k7j8nMLNJ3K4K6J6M%J2K9M4M1K1kj2j5k4l3k8j2KJ0J9K5J8ql5m0k0QK7
$$ 1674 1650 1650 1667 1678 1669 1643 1616 1598 1593 1597 1600 1605 1618 1642 1668 1684 1688 1688 1700 1729 1773 1814 1835 1833 1821 1806 1782 1749 1721 1709 1711 1721 1740 1765 1783 1775 1740 1700 1680 1688 1715
640A715K8J3loj%j1k0j9j3qJJ7L1L4K3Nj5l5m5m3l3j8mOOkqmOJ6K1K2J3MMJ2J4OkKJ1J1Jj0
$$ 1715 1743 1756 1753 1747 1746 1746 1735 1715 1696 1683 1675 1676 1693 1724 1758 1781 1786 1771 1736 1691 1648 1615 1597 1593 1599 1605 1603 1595 1591 1597 1613 1634 1656 1669 1673 1677 1689 1703 1709 1707 1709 1720 1731 1732 1722
635A722j9k3k1j0Jmj9k6j3NJ0mk1k3rOJj5j6PK5J5rj7nMnj6j6rqoNJ6J5N%OJ5Qj1k8k4pJ1
$$ 1722 1703 1680 1659 1649 1650 1646 1627 1601 1588 1593 1603 1599 1578 1555 1546 1552 1553 1538 1522 1529 1554 1569 1560 1543 1538 1542 1537 1521 1505 1496 1488 1482 1487 1503 1518 1523 1523 1529 1544 1552 1541 1513 1489 1482 1493
629A493J3QNMlj4j6mQJj8l0k6j2KJ3J9K1J9J9K6K9K0mk6l2k5j7j7k2k6k4j8jJ7K7K5K0J7J1
$$ 1493 1506 1514 1519 1523 1520 1506 1490 1486 1494 1495 1477 1447 1421 1409 1411 1424 1443 1464 1483 1502 1528 1557 1577 1573 1547 1515 1490 1473 1456 1434 1408 1384 1366 1365 1382 1409 1434 1454 1471 1482
625A482JKJ5K3RrpJ2K7L1L3L1J0k4l9k8pnj1j1jJ1J8J8kl4n1l9j5jMJ1J7J5J2J9K2Ml0m2k6
$$ 1482 1483 1485 1500 1523 1532 1523 1516 1528 1555 1586 1619 1650 1660 1636 1597 1569 1562 1557 1546 1535 1534 1545 1563 1581 1579 1545 1494 1455 1440 1439 1443 1454 1471 1486 1498 1517 1539 1543 1513 1471 1445
620A445rj1j7j0OJ4J7J9K1J9J3J0Lj3l3m2l5j4OJ5J1LJ1K7K8Nk1k2plj5k5j3J0K2K4K6K7K3
$$ 1445 1436 1425 1408 1398 1404 1418 1435 1454 1475 1494 1507 1517 1520 1507 1474 1432 1397 1383 1389 1404 1415 1418 1429 1456 1484 1489 1468 1446 1439 1436 1421 1396 1383 1393 1415 1439 1465 1492 1515
615A515J4J2J9J4j2m1m6k8j6k3l3j8J2L0J6j0k5k1r%LQJ5K2K5J9J1OPOjj2j5j0nlnkLJ0J3
$$ 1515 1529 1541 1560 1574 1562 1521 1475 1447 1431 1408 1375 1357 1369 1399 1415 1405 1380 1359 1350 1350 1353 1361 1376 1398 1423 1442 1453 1459 1466 1472 1471 1459 1444 1434 1429 1426 1421 1419 1422 1432 1445
610A445Qmj6j8j1MJ3J8J9K0K2K1J8J3Mj4l1l2j6LJ2J2J1RMmnNJ6J7Rmj4j5oONj4l7m3k4PL0
$$ 1445 1453 1449 1433 1415 1404 1408 1421 1439 1458 1478 1500 1521 1539 1552 1556 1542 1511 1479 1463 1466 1478 1490 1501 1510 1514 1510 1505 1510 1526 1543 1552 1548 1534 1519 1513 1519 1524 1510 1473 1430 1406 1413 1443
605A443L2J0k0l9l3oK3M1M0K8J5J1J0R%nJJ5K3Pk7n1m3lL3L7J2j1j1kkj4j7pQRpk7l8l0j3
$$ 1443 1475 1485 1465 1426 1393 1387 1410 1451 1491 1519 1534 1545 1555 1564 1564 1559 1560 1575 1598 1605 1578 1527 1484 1481 1514 1551 1563 1552 1541 1539 1537 1523 1506 1499 1507 1516 1509 1482 1444 1414 1401
600A401NJ4J4J5J7K1J8Oj0k7l5l2k3j6j2pnmjJ0K5K8J0j5k7k2j3j0oKQONPQJkJ0L1L5K3RR
$$ 1401 1406 1420 1434 1449 1466 1487 1505 1511 1501 1474 1439 1407 1384 1368 1356 1349 1344 1340 1339 1349 1374 1402 1412 1397 1370 1348 1335 1325 1319 1321 1329 1335 1340 1347 1355 1356 1354 1364 1395 1430 1453 1462 1471
594A471J4J0K%lj2k2j9jJ5J8J3ROOQRjj8l0k5j5pkMJ1J9K6K8J3j4l0k3pJNJ6K3J1j6k5oJ8
$$ 1471 1485 1495 1497 1497 1494 1482 1460 1441 1440 1455 1473 1486 1495 1501 1507 1515 1524 1523 1505 1475 1450 1435 1428 1426 1430 1441 1460 1486 1514 1527 1513 1483 1460 1453 1454 1459 1475 1498 1509 1493 1468 1462 1480
589A480J6ok0rRJ3KnPL1L8K5MlKNM%JlonPK1L0L2L0K7K9L7L9L4L1M0N7O6O3O0O8P9Q1O8M7
$$ 1480 1496 1490 1470 1461 1470 1483 1485 1480 1487 1518 1556 1581 1585 1582 1584 1589 1593 1593 1594 1591 1585 1580 1587 1608 1638 1670 1700 1727 1756 1793 1832 1866 1897 1937 1994 2060 2123 2183 2251 2330 2411 2479 2526
584B526K7J1MNJ3K6L4K5om0n1m0k2j6oJ1K9K8J3JJKlj4k7l9m9n6o7q1p9o0m0m3o1o6m5k0p
$$ 2526 2553 2564 2568 2573 2586 2612 2646 2671 2665 2625 2574 2534 2512 2496 2490 2501 2530 2558 2571 2572 2573 2575 2572 2558 2531 2492 2443 2387 2320 2239 2160 2100 2060 2017 1956 1890 1845 1825 1818
579A818pjPJ0NK%mj7l1m0l7k2rrj9k3j8j0rj2oJ1K5L1K5Rj1k5k5j3jJ0K2K3Ok4m6m7l8l0k2
$$ 1818 1811 1810 1817 1827 1832 1834 1834 1830 1813 1782 1742 1705 1683 1674 1665 1646 1623 1605 1595 1586 1574 1568 1579 1604 1635 1660 1669 1658 1633 1608 1595 1594 1604 1626 1649 1655 1631 1585 1538 1500 1470 1448
574A448oJ0J4JqjJ7K8K2%j8j8jJ6J1j5m3n4m1j4J3L1L6L4K9K3J4OPJ8K8K1lk5l4l0k1j3LK0
$$ 1448 1442 1452 1466 1467 1459 1458 1475 1503 1525 1525 1507 1489 1488 1504 1515 1500 1457 1403 1362 1348 1361 1392 1428 1462 1491 1514 1528 1534 1541 1559 1587 1608 1605 1580 1546 1516 1495 1482 1485 1505
569A505L2K7J4Kloj2j9j8r%jlJJ5K7K5J1knkkj3k3k0KK7L3J6pj4%J4J5mk6k9rK0L6L3K3K1
$$ 1505 1537 1564 1578 1580 1577 1571 1559 1540 1522 1513 1513 1512 1509 1510 1525 1552 1577 1588 1586 1581 1579 1577 1564 1541 1521 1523 1550 1583 1599 1592 1578 1578 1592 1607 1603 1577 1548 1539 1559 1595 1628 1651 1672
564A672K9L6L3K7J9J2RJ4K6M1N1N2M6L8L1L5M9O3P0O7O9P5P9O8M7L8M9O1N8N5P4J15J50J57
$$ 1672 1701 1737 1770 1797 1816 1828 1837 1851 1877 1918 1969 2021 2067 2105 2136 2171 2220 2283 2353 2420 2489 2564 2643 2711 2758 2796 2845 2906 2964 3019 3093 3208 3358 3515
560C515J52J67K12K65L04L22L27L22L07K70K03J08Qp4j34j84k30k62k69k57k38k18k00j81
$$ 3515 3667 3834 4046 4311 4615 4937 5264 5586 5893 6163 6366 6474 6482 6408 6274 6090 5860 5598 5329 5072 4834 4616 4416 4235
557D235j64j45j25j07r0p5o3n7n1l9j7%PPRJ7K9L8M3M4M8N5O6P0P4Q5J11J41J63J81J97K17
$$ 4235 4071 3926 3801 3694 3604 3529 3466 3409 3358 3319 3302 3302 3309 3316 3325 3342 3371 3409 3452 3496 3544 3599 3665 3735 3809 3894 4005 4146 4309 4490 4687 4904
553D904K49K93L44L98M56N27N97O46O67O82O88O40M99K87N8j58l57n25o32o65o53o24n76n10
$$ 4904 5153 5446 5790 6188 6644 7171 7768 8414 9081 9763 10451 11091 11590 11877 11935 11777 11420 10895 10263 9598 8945 8321 7745 7235
550G235m36l78l36l04k76k47k13j75j43j21j05q8q0p6o8n4m5m7m8m0l1k7k1nRJ0RK6N7Q1R4
$$ 7235 6799 6421 6085 5781 5505 5258 5045 4870 4727 4606 4501 4413 4333 4257 4189 4135 4090 4043 3995 3955 3924 3897 3876 3871 3880 3890 3899 3925 3982 4063 4157
546D157J06J23J32J34J39J51J68J82K03K28K45K45K39K30K13J71J04K1p3j65k37k83l05l14
$$ 4157 4263 4386 4518 4652 4791 4942 5110 5292 5495 5723 5968 6213 6452 6682 6895 7066 7170 7191 7118 6953 6716 6433 6128 5814
543E814l07k83k47k17j98j92j90j77j49j14q9p9p3o6o6p6p8o4m3l7m1m1l0k2k4k8k4j5ooj0
$$ 5814 5507 5224 4977 4760 4562 4370 4180 4003 3854 3740 3651 3572 3499 3433 3367 3291 3213 3149 3106 3069 3028 2987 2957 2935 2911 2883 2859 2844 2838 2832 2822
539B822j5j7j4rj2k1k8l0k6k4k6l2l8l3j5%lj6j4RL1K5kk4k2r%lm%%prKK1K9J8PNQM%OOj2
$$ 2822 2807 2790 2776 2767 2755 2734 2706 2676 2650 2626 2600 2568 2530 2497 2482 2482 2479 2463 2449 2458 2489 2514 2512 2488 2466 2457 2457 2454 2450 2450 2450 2443 2434 2436 2457 2486 2504 2511 2516 2524 2528 2528 2534 2540 2528
534B528m0m3j6OKj1lK1L6K7J1KPK1L3L5K5J0mj2j1%J3J7QKJ3K3J6lj7j7j1kJ5L1K9J1lonj0
$$ 2528 2488 2445 2429 2435 2437 2426 2423 2444 2480 2507 2518 2520 2527 2548 2581 2616 2641 2651 2647 2635 2624 2624 2637 2654 2662 2664 2677 2700 2716 2713 2696 2679 2668 2666 2681 2712 2741 2752 2749 2743 2738 2728
529B728j0KJ5K3K9L7L9K7J4J4K7L4L1L3M8P0Q5R0Q6P0M2J7%qj7k6l7m7n9o6o2m3j9oj2k3k7
$$ 2728 2718 2720 2735 2758 2787 2824 2863 2890 2904 2918 2945 2979 3010 3043 3091 3161 3246 3336 3422 3492 3534 3551 3551 3543 3526 3500 3463 3416 3357 3291 3229 3186 3167 3161 3149 3126 3099
524C099k6k6k6j5PK5K2J0QK5M4M8L1Kk1k2mJ5J1j3l5m1l1j6PL2M8M3K2PQJ7K7L3L6L4L2L4
$$ 3099 3073 3047 3021 3006 3013 3038 3060 3070 3078 3103 3147 3195 3226 3228 3207 3185 3181 3196 3207 3194 3159 3118 3087 3071 3078 3110 3158 3201 3223 3230 3238 3255 3282 3315 3351 3385 3417 3451
519C451M3M9L9J9J1K5N4P6Q4Q4Q3Q0P3O9P0P7Q3Q6Q9R5J02J09J20J32J43J50J49J45J41J44
$$ 3451 3494 3543 3582 3601 3612 3637 3691 3767 3851 3935 4018 4098 4171 4240 4310 4387 4470 4556 4645 4740 4842 4951 5071 5203 5346 5496 5645 5790 5931 6075
516F075J48J49J45J48J61J85K04K13K09K01J94J96K05K12K12K08J97J75J38R3M2j5p6j24j60
$$ 6075 6223 6372 6517 6665 6826 7011 7215 7428 7637 7838 8032 8228 8433 8645 8857 9065 9262 9437 9575 9668 9710 9695 9619 9495 9335
513I335k00k57l16l48l50l41l31l13k85k57k40k27k12j93j72j46j18j02j05j05q9o7n4n5o0
$$ 9335 9135 8878 8562 8214 7864 7523 7192 6879 6594 6337 6097 5870 5658 5465 5293 5147 5029 4927 4822 4717 4628 4561 4507 4452 4392
510D392o4o8o7o4o5p5q6q7p7o9o6o1n7n9o4n9m2k6k2k5k6k4k7k7k0qoj7k8l2k9k6k3j6qpo
$$ 4392 4328 4260 4193 4129 4064 3989 3903 3816 3739 3670 3604 3543 3486 3427 3363 3304 3262 3236 3214 3189 3163 3139 3112 3085 3065 3057 3051 3034 3006 2974 2945 2919 2896 2880 2872 2865 2859
505B859LK1L5K6Jk2l0j9JK1K8J8MjJj1m0o6p3o1m8l4j4jok1k3rJqj6j4ppj0rnoqrj4k6l9l7
$$ 2859 2862 2883 2918 2944 2945 2923 2893 2874 2875 2896 2924 2942 2946 2945 2946 2935 2895 2829 2756 2695 2647 2613 2599 2598 2592 2571 2548 2539 2540 2532 2516 2502 2495 2488 2478 2469 2464 2458 2450 2441 2427 2401 2362 2325
500B325k6j0J1K6K4ol6l3KL2L1J0j0j6j2KK2L0J9NOK5M5N4N6N2M3L4L1L0J2k0m8n5m4l8m5
$$ 2325 2299 2289 2300 2326 2350 2344 2308 2275 2277 2309 2340 2350 2340 2324 2312 2314 2336 2366 2385 2390 2396 2421 2466 2520 2576 2628 2671 2705 2736 2766 2778 2758 2710 2655 2611 2573 2528
495B528n5n7m7l5k7k4k6k7k4j2OK0K1J0joqj8l1l2j9kNOQJ6J7Mj5k4j5OJ7J2%onnmLJ5J6M
$$ 2528 2473 2416 2369 2334 2307 2283 2257 2230 2206 2194 2200 2220 2241 2251 2250 2244 2236 2218 2187 2155 2136 2134 2139 2145 2153 2169 2186 2190 2175 2151 2136 2142 2159 2171 2171 2165 2160 2155 2151 2154 2169 2185 2189
490B189ojJ2J9J8J6J6Nj2k1j7j1j7k8l4k8k1j4nLOORJ3J3Lj6l6m6l7j1J2Rrk0rRJ4J0MJrj9
$$ 2189 2183 2182 2194 2213 2231 2247 2263 2268 2256 2235 2218 2207 2190 2162 2128 2100 2079 2065 2060 2063 2069 2075 2084 2097 2110 2113 2097 2061 2015 1978 1967 1979 1988 1979 1959 1950 1959 1973 1983 1987 1988 1979 1960
485A960j6jJ3J2JkQJ7J5MmJJ1J5J1NKkj0j5pJ0K0J3nk2l2l9m0k8mJ6K3K4K8K7Rj3j6%J2kk0
$$ 1960 1944 1943 1956 1968 1969 1967 1975 1992 2007 2011 2007 2008 2019 2034 2045 2050 2052 2050 2040 2025 2018 2028 2048 2061 2056 2034 2002 1963 1923 1895 1891 1907 1930 1954 1982 2009 2018 2005 1989 1989 2001 1999 1979
479A979k3qkj5l5m7m1k1OK6L1K3Poj6j6rpj8k3j1J2K0J2PJ5K6K5J9J5J0nk6m1m4l3oK7N0M7
$$ 1979 1956 1948 1946 1931 1896 1849 1808 1787 1793 1819 1850 1873 1880 1874 1858 1842 1833 1826 1808 1785 1774 1786 1806 1818 1825 1840 1866 1891 1910 1925 1935 1930 1904 1863 1819 1786 1780 1807 1857 1904
475A904K7Moj0j7l1m4m2j8NNj9l1j5J1K1J6J3J7J6QMRJ3J2Olj4k2j3QK5K7J3jpjN%j8l3l1
$$ 1904 1931 1935 1929 1919 1902 1871 1827 1785 1767 1772 1777 1758 1727 1712 1723 1744 1760 1773 1790 1806 1814 1818 1827 1840 1852 1858 1855 1841 1819 1806 1814 1839 1866 1879 1878 1871 1870 1875 1875 1857 1824 1793
469A793j7mJ4L3L8J6j0j1J0J5rl2l0rLOJoj2oJ1J2j0l5l8k3j0qpjLLLKj%RJ5Mj4k0qNRL%M
$$ 1793 1776 1772 1786 1819 1857 1873 1863 1852 1862 1877 1868 1836 1806 1797 1800 1806 1807 1801 1789 1783 1794 1806 1796 1761 1723 1700 1690 1682 1675 1674 1677 1680 1683 1685 1684 1684 1693 1708 1712 1698 1678 1670 1675 1684 1687 1687 1691
464A691J3J6R%LJ3J6Kj3j3nlj5k6l0j9QL8N6M7K2lj9k8k9j4jkj7k3j1PJ6J6Rnj7j8lJ0J3Q
$$ 1691 1704 1720 1729 1729 1732 1745 1761 1763 1750 1737 1732 1729 1714 1688 1658 1639 1647 1685 1741 1788 1810 1807 1788 1760 1731 1717 1716 1714 1697 1674 1663 1670 1686 1702 1711 1706 1689 1671 1668 1678 1691 1699
459A699KKkqj7k1j8pkllMJ0MjPJ8Rj7l4k5oPQOK%NJ5J1lqMJ0nj9rJ2J4pk0j8j3j8j7mRJ2P
$$ 1699 1701 1703 1701 1693 1676 1655 1637 1630 1628 1625 1622 1626 1636 1640 1639 1646 1664 1673 1656 1622 1597 1591 1598 1606 1612 1614 1614 1619 1634 1645 1642 1634 1638 1648 1643 1624 1615 1627 1641 1634 1614 1596 1583 1565 1548 1544 1553 1565 1572
453A572MKjj0j9k0rJ3L1L3J8MPJ8K1Qrj3mOPjlOJ8K1J8J7J4Ork4l2k7j0Lmk3k9pK5M0L5L0
$$ 1572 1576 1578 1577 1567 1548 1528 1519 1532 1563 1596 1614 1618 1625 1643 1664 1672 1663 1650 1646 1652 1659 1658 1655 1661 1679 1700 1718 1735 1749 1755 1746 1722 1690 1663 1653 1656 1652 1629 1600 1593 1618 1658 1693 1723
447A723L0K5J6J1J1Kj5k5j5LJ1MqoJ0L2L4J2j7k7j6nj0j9k3k5k8k4nJ2J5MjMQNJJnj9l1k6
$$ 1723 1753 1778 1794 1805 1816 1818 1803 1778 1763 1766 1777 1781 1773 1767 1777 1809 1843 1855 1838 1811 1795 1790 1780 1761 1738 1713 1685 1661 1656 1668 1683 1687 1686 1690 1698 1703 1704 1705 1700 1681 1650 1624
442A624qJ3K6K7J8PknlPJ7K3K1K0J8Qj3l4l7k5j2nNJ7K3J4Mkmj5k7k2%J5Rqj6j5k2l1k7KL5
$$ 1624 1616 1629 1655 1682 1700 1707 1705 1700 1697 1704 1721 1744 1765 1785 1803 1811 1798 1764 1727 1702 1690 1685 1690 1707 1730 1744 1748 1746 1742 1727 1700 1678 1678 1693 1702 1694 1678 1663 1641 1610 1583 1585 1620
437A620M2K5QJ3K8K7RqmJ1J5%k1k7j8JJ6K6K7J8%k3l8m1k8j2pj5k1pJ4K2Oj6k3j1QK2K8K8
$$ 1620 1662 1687 1695 1708 1736 1763 1772 1764 1760 1771 1786 1786 1765 1738 1720 1721 1737 1763 1790 1808 1808 1785 1747 1706 1678 1666 1659 1644 1623 1616 1630 1652 1658 1642 1619 1608 1616 1638 1666 1694
432A694K6K6K5J8%j7k2j6rnJJ1J3Kj6k8k8j8okmmOK2L4L6L1J8ql9n0l1MK5K4J3OKoj7k6k8
$$ 1694 1720 1746 1771 1789 1789 1772 1750 1734 1725 1720 1721 1732 1745 1747 1731 1703 1675 1657 1651 1649 1645 1641 1647 1669 1703 1739 1770 1788 1780 1741 1691 1660 1664 1689 1713 1726 1732 1734 1728 1711 1685 1657
427A657k0rnj3k6k3JK5K6%k5k8j2LjrpOJ2N%RK5L3L1K1J3ROLqk1l0k8j6nMJ3J8J5KlNJ7K1
$$ 1657 1637 1628 1623 1610 1584 1561 1562 1587 1613 1613 1588 1560 1548 1551 1550 1541 1534 1540 1552 1557 1557 1566 1591 1624 1655 1676 1689 1698 1704 1707 1699 1678 1648 1620 1604 1599 1603 1616 1634 1649 1651 1648 1653 1670 1691
421A691J4J0RLj0j8qJ1J6Kj0%K1K7J4lj2j6j9j5LK3J9nk9k9mK0J7ql2l2j5qj3j2KJ6J6J1J5
$$ 1691 1705 1715 1724 1727 1717 1699 1691 1702 1718 1720 1710 1710 1731 1758 1772 1769 1757 1741 1722 1707 1710 1733 1752 1747 1718 1689 1685 1705 1722 1714 1682 1650 1635 1627 1614 1602 1604 1620 1636 1647 1662
416A662J7J0LPJ1lk4k6oQQQK3L8M1L4K9J9Kj3j3mKlqj2j3j3k2l6m9m3j9NJ5J3Plj4k1j7j0
$$ 1662 1679 1689 1692 1699 1710 1707 1683 1657 1651 1659 1667 1675 1698 1736 1777 1811 1840 1859 1861 1848 1835 1831 1833 1830 1822 1810 1797 1784 1762 1726 1677 1634 1615 1620 1635 1648 1655 1652 1638 1617 1600 1590
411A590%J5K9K7J1lJJ4J5J0N%j5k9k8j2lqj7j4jJ6L1L5K1mk4k7j9rJJpj6qJ0J6jk4l1k2j0
$$ 1590 1590 1605 1634 1661 1672 1669 1670 1684 1699 1709 1714 1714 1699 1670 1642 1630 1627 1619 1602 1588 1587 1603 1634 1669 1690 1686 1662 1635 1616 1607 1608 1609 1602 1586 1578 1588 1604 1603 1579 1548 1526 1516
406A516jRJ6J3Mkmoj0qKJ3J5J2ONLJjLQJ4Poj5j1NJ7K1K1J8Rj2l1l7k4qJJno%J2K1J6KpkN
$$ 1516 1515 1524 1540 1553 1557 1555 1551 1545 1535 1527 1529 1542 1557 1569 1575 1580 1583 1584 1583 1586 1594 1608 1615 1609 1594 1583 1588 1605 1626 1647 1665 1674 1662 1631 1594 1570 1562 1563 1564 1559 1553 1553 1565 1586 1602 1604 1597 1595 1600
400A600MmrpnLJ9L2K6J4J8M1M8K3j2k4j4j3k7l4j5NQnpPK4K4Mj5j9KK7L0J2j1k2k2k1k1k3
$$ 1600 1604 1600 1591 1584 1579 1582 1601 1633 1659 1673 1691 1732 1780 1803 1791 1767 1753 1740 1713 1679 1664 1669 1677 1672 1665 1672 1696 1720 1724 1709 1690 1692 1719 1749 1761 1750 1728 1706 1685 1664 1641
395A641j9j1%P%q%K3L7K8J4PKj0k3j9lQNlkNJ0NkqoMJ0Pmj3j4pOJ7J9Oj7l7l5j3J7L5L2J5
$$ 1641 1622 1611 1611 1618 1618 1610 1610 1633 1670 1698 1712 1719 1721 1711 1688 1669 1666 1674 1679 1676 1674 1679 1689 1694 1692 1684 1678 1682 1692 1699 1695 1682 1668 1661 1667 1684 1703 1709 1692 1655 1620 1607 1624 1659 1691 1706
389A706nj6k2k7k4rRK3K3J8J1PMJrk5l2k7j4j1j2%K7M8M4K6RLJLMkk2l7l2j0Lnj8j8mMlj0
$$ 1706 1701 1685 1663 1636 1612 1603 1612 1635 1658 1676 1687 1694 1698 1699 1690 1665 1633 1606 1592 1581 1569 1569 1596 1644 1688 1714 1723 1726 1727 1730 1734 1732 1710 1673 1641 1631 1634 1629 1611 1593 1589 1593 1590 1580
384A580rjJ0K3L2L7L3K4J5RLLNPL%JMmk1l4l8k8j1NJ0mk7l6k6qLRJ2J0kpQL0L1J0rmOPJNJ9
$$ 1580 1571 1570 1580 1603 1635 1672 1705 1729 1744 1753 1756 1759 1764 1771 1774 1774 1775 1779 1775 1754 1720 1682 1654 1643 1648 1658 1654 1627 1591 1565 1557 1560 1569 1581 1591 1589 1582 1590 1620 1651 1661 1652 1648 1654 1661 1662 1667 1686
378A686K5J2rj8qPJ5J1Jomjjrj3j0qj3k0j1J5L3K1mj5PL6M9M0K6J5NmnLJ7K5K6K2J7J4J4J1
$$ 1686 1711 1723 1714 1696 1688 1695 1710 1721 1722 1716 1712 1711 1710 1701 1688 1678 1670 1657 1637 1626 1641 1674 1695 1691 1676 1683 1719 1768 1808 1834 1849 1854 1850 1845 1848 1865 1890 1916 1938 1955 1969 1983 1994
373A994PQJ2J1jj0mJ5K4K0PMJ8L6M8M7L5K4K0K3K6K8K8K6J6RLpk4k7rRKk4l2qJ3Rj1j9rJ5
$$ 1994 2001 2009 2021 2032 2031 2021 2017 2032 2056 2076 2083 2087 2105 2141 2189 2236 2271 2295 2315 2338 2364 2392 2420 2446 2462 2471 2474 2467 2443 2416 2407 2416 2418 2394 2362 2354 2367 2376 2365 2346 2337 2352
368B352L9N7N4K6mj5qJjnlJ2L9N7M8J8JJ4L2K2ljL4P3Q6Q2P4O2M6M5O1O8M6Pj6j8j2qpj4l4
$$ 2352 2391 2448 2502 2528 2524 2509 2501 2502 2501 2496 2493 2505 2544 2601 2649 2667 2668 2682 2714 2736 2733 2732 2766 2839 2925 3007 3081 3143 3189 3234 3295 3363 3409 3416 3400 3382 3370 3362 3355 3341 3307
363C307m8l7qQ%nNJ3om0n4l4oO%on%OJ5K3K2J2ok2k6j4OJ9J5Kpj2k1k8j3K1M5L5PmJ3L5L8
$$ 3307 3259 3222 3214 3222 3222 3217 3222 3235 3229 3189 3135 3101 3095 3101 3101 3095 3090 3090 3096 3111 3134 3156 3168 3162 3140 3114 3100 3106 3125 3140 3142 3135 3123 3102 3074 3061 3082 3127 3162 3169 3165 3178 3213 3251
357C251K7K0K0K6L2L7L4K3J0OJ3K2K3J8J0%rj5j3jJ2K2K1J6J2QLLJ4L5M4L0QJJ1J4lk5l3k5
$$ 3251 3278 3298 3318 3344 3376 3413 3447 3470 3480 3486 3499 3521 3544 3562 3572 3572 3563 3548 3535 3534 3546 3568 3589 3605 3617 3625 3628 3631 3645 3680 3724 3754 3762 3763 3774 3788 3785 3760 3727 3702
352C702j4j1j5j3nMKj3k9k4kK0K8K5K2J8J0LRK5L8M0L7L6L4L2K9K4Pj5k9k6j9j5pJ1L1L7K8
$$ 3702 3688 3677 3662 3649 3644 3648 3650 3637 3608 3584 3582 3602 3630 3655 3677 3695 3705 3708 3717 3742 3780 3820 3857 3893 3927 3959 3988 4012 4019 4004 3975 3949 3930 3915 3908 3919 3950 3987 4015
348D015J7Qmj5j1MJ5Opj2nLJ1J8J7Kj4j6okj0j6j5j2k0l3l4k2p%MJ1K1K5J6jj9k5k0pMkrk
$$ 4015 4032 4040 4036 4021 4010 4014 4029 4035 4028 4016 4011 4014 4025 4043 4060 4062 4048 4032 4026 4024 4014 3998 3983 3971 3951 3918 3884 3862 3855 3855 3859 3870 3891 3916 3932 3931 3912 3887 3867 3860 3864 3862 3853 3851
342C851K3L3Km4n6k4QPj1j4jKlJOj3m5n9l9j5pkJ0Qk4o0o4m0k1j5j4qlMJ3J5LpML2M8L7J6
$$ 3851 3874 3907 3909 3865 3809 3785 3793 3800 3789 3775 3774 3776 3773 3774 3780 3767 3722 3663 3624 3609 3602 3600 3610 3618 3594 3534 3470 3430 3409 3394 3380 3372 3369 3373 3386 3401 3404 3397 3401 3433 3481 3518 3534
337C534%pmPJ4Qpj4j2j1j0LJ9J3j4l2k1LPmrlL%oj6k9m3n1m5k9j3oj7l2l8k9k4l3m7m9m3l8
$$ 3534 3534 3527 3523 3530 3544 3552 3545 3531 3519 3508 3498 3501 3520 3533 3519 3487 3466 3469 3476 3472 3463 3460 3463 3463 3457 3441 3412 3369 3318 3273 3244 3231 3225 3208 3176 3138 3109 3085 3052 3005 2956 2913 2875
332B875l2j3QRj0k4j9j0j3j8j1OJ7J3KklnrrmQK1K7J6j0l7n4n4m6l3j9rj4k9m0l5k3k3l5m2
$$ 2875 2843 2830 2838 2847 2837 2813 2794 2784 2771 2753 2742 2748 2765 2778 2780 2778 2775 2770 2761 2752 2748 2756 2777 2804 2820 2810 2773 2719 2665 2619 2586 2567 2558 2544 2515 2475 2440 2417 2394 2359 2317
327B317l3k6l3m3l4rNj0l6m4k9j2ppKJ8K8K5J0j0l5n2n4l8j9j3j8k3j8j2j0lJ1K7L2K0PMO
$$ 2317 2284 2258 2225 2182 2148 2139 2144 2134 2098 2054 2025 2013 2006 1999 2001 2019 2047 2072 2082 2072 2037 1985 1931 1893 1874 1861 1843 1820 1802 1790 1780 1777 1788 1815 1847 1867 1874 1878 1884
322A884Kj2k3k2nJ3K2J7Omj6l4m8n2m5l1j6KK2L1K3Lj2j3JJ6K3J7Kj3k1j9j7j5oJ0J4nl2l8
$$ 1884 1886 1874 1851 1829 1824 1837 1859 1876 1882 1878 1862 1828 1780 1728 1683 1652 1636 1638 1660 1691 1714 1717 1705 1692 1693 1709 1732 1749 1751 1738 1717 1698 1681 1666 1660 1670 1684 1679 1647 1609
317A609j5QNqj1%Mnj0j1j8l0l0lK5L2J7KjMPJ4K8L6K1j1m2n1l6j4lOK1L1J5j8l6k6j0j3k3
$$ 1609 1594 1602 1607 1599 1588 1588 1592 1587 1577 1566 1548 1518 1488 1485 1510 1542 1559 1561 1560 1564 1571 1585 1613 1649 1670 1659 1617 1566 1530 1516 1513 1519 1540 1571 1586 1568 1532 1506 1496 1483 1460
312A460j8jNmoMJ3J7K3K9K1nk8k7j3onNJ7J3j1l3l2j6JQJ2K1L0L2J9Jj1j0o%OLj0k7k5rMk
$$ 1460 1442 1441 1446 1442 1436 1440 1453 1470 1493 1522 1543 1538 1510 1483 1470 1464 1459 1464 1481 1494 1483 1450 1418 1402 1403 1411 1423 1444 1474 1506 1525 1526 1515 1505 1499 1499 1505 1508 1498 1471 1446 1437 1441 1439
307A439j7k1j5j5j9j4NK0K1J5J3J5J6J9K2K1J1ol1n3n6k7K2N9O1M2K1Mj0k0k5k8l1l0j4NJ5
$$ 1439 1422 1401 1386 1371 1352 1338 1343 1363 1384 1399 1412 1427 1443 1462 1484 1505 1516 1510 1479 1426 1370 1343 1365 1424 1485 1527 1548 1552 1542 1522 1497 1469 1438 1408 1394 1399 1414
302A414RkpoKRJ4J1MKLJljRJ9J9J4RRJ1J5J7Qpj7j9k3l4l4j3J3K2J3Jqj4j3jJ8J9kk7l7l6
$$ 1414 1423 1421 1414 1408 1410 1419 1433 1444 1448 1450 1453 1454 1451 1450 1459 1478 1497 1511 1520 1529 1540 1555 1572 1580 1573 1556 1537 1514 1480 1446 1433 1446 1468 1481 1482 1474 1460 1447 1446 1464 1483 1481 1454 1417 1381
297A381k7j1LPloLJ3R%klj5k4j4J3L1L4L4L0J1k4n0n2l2rJ2K2J8Kj1j5j9k2j2J6L9M3L3K3
$$ 1381 1354 1343 1346 1353 1350 1344 1347 1360 1369 1369 1367 1364 1349 1325 1311 1324 1355 1389 1423 1453 1464 1440 1390 1338 1306 1297 1309 1331 1349 1351 1340 1325 1306 1284 1272 1288 1327 1370 1403 1426
292A426Ok5n9o5l9oJ3J6K0K6K5J9J4J0Lj1k4k4j3LJ1J7K3K4J1j0k1j5nmj0oPJ9J8J1MMK%k
$$ 1426 1432 1407 1348 1283 1244 1238 1251 1267 1287 1313 1338 1357 1371 1381 1384 1373 1349 1325 1312 1315 1326 1343 1366 1390 1401 1391 1370 1355 1350 1346 1336 1330 1337 1356 1374 1385 1389 1393 1395 1395 1393
287A393j%knlLNkmRK2J6nj2NJ8Nk0k2%J4Qnqn%NNnk2k8j4JPMKKjjkpj2pNNj1k2j0J7L7L9K8
$$ 1393 1392 1392 1390 1385 1382 1385 1390 1388 1384 1393 1415 1431 1426 1414 1419 1437 1442 1422 1400 1400 1414 1422 1417 1409 1404 1404 1409 1414 1409 1387 1359 1345 1346 1353 1357 1359 1361 1360 1359 1357 1350 1338 1331 1336 1341 1330 1308 1298 1315 1352 1391 1419
280A419Nk0l0j9mj0k7l4j8NJ8K2K0J5J6K5L3K9J5Mkj2k7l4k8j8j1jPQnj7j6pNJ3J7J2lj9k7
$$ 1419 1424 1404 1374 1355 1351 1341 1314 1280 1262 1267 1285 1307 1327 1342 1358 1383 1416 1445 1460 1464 1462 1450 1423 1389 1361 1343 1332 1331 1338 1346 1341 1324 1308 1301 1306 1319 1336 1348 1345 1326 1299
275A299k8k0qQK2L0L3K7J0j3k5j8lMKMPROQJ2J8J7J4QKjoj3k5l0k5j7j3j6j9k0j6kK1L4K8
$$ 1299 1271 1251 1243 1251 1273 1303 1336 1363 1373 1360 1335 1317 1314 1318 1320 1324 1331 1340 1346 1354 1366 1384 1401 1415 1423 1425 1424 1418 1405 1380 1350 1325 1308 1295 1279 1260 1240 1224 1222 1243 1277 1305
270A305J0%KKoj0pnj4k2j2J7L8L8K1Lmllqk0k9k7qJ3K3Qk0l8l6k2j2j0j0JK0L7L8K4OmjRJ9
$$ 1305 1315 1315 1317 1319 1313 1303 1296 1291 1277 1255 1243 1260 1298 1336 1357 1360 1356 1353 1350 1342 1322 1293 1266 1258 1271 1294 1302 1282 1244 1208 1186 1174 1164 1154 1155 1175 1212 1250 1274 1280 1276 1275 1284 1303
265A303K4K2J9J2Okrj5j3mLLkn%Kmj8k7k1rOJ9K5K3J1lrj3j8k1j9oNKpqNJ6J6Omnmqj8k4k1
$$ 1303 1327 1349 1368 1380 1386 1384 1375 1360 1347 1343 1346 1349 1347 1342 1342 1344 1340 1322 1295 1274 1265 1271 1290 1315 1338 1349 1346 1337 1324 1306 1285 1266 1260 1265 1267 1260 1252 1257 1273 1289 1295 1291 1286 1282 1274 1256 1232 1211
259A211qMJ4K4L0L0J7LjKLKNJ8J9jk7k6lJ5Qj1k2k1j7j4nNQKjKOMoj3j2KJ8K5K2J6J3Qkrl
$$ 1211 1203 1207 1221 1245 1275 1305 1322 1325 1324 1326 1329 1331 1336 1354 1373 1372 1345 1319 1316 1331 1339 1328 1306 1285 1268 1254 1249 1254 1262 1264 1263 1265 1271 1275 1269 1256 1244 1246 1264 1289 1311 1327 1340 1348 1346 1337 1334
253A334LjqjJ1Rj5k7j1J1Rqj0J0L1L1J8J2QKlpj5k6k1kJ2Mj3j1OJ1mj8j6j3k0k8k0KJ6J3J
$$ 1334 1337 1336 1328 1327 1338 1347 1332 1305 1294 1305 1314 1306 1296 1306 1337 1368 1386 1398 1406 1408 1405 1398 1383 1357 1336 1334 1346 1350 1337 1326 1332 1343 1339 1321 1305 1292 1272 1244 1224 1226 1242 1255 1256
248A256pj2j5j8k1j8pRJ9J4Lmnl%RK0K2J0pj2kJ1J8J3mk3l5k7jK7L9K8Qpj1j6k1j8KK4L0J2
$$ 1256 1249 1237 1222 1204 1183 1165 1158 1167 1186 1200 1203 1199 1194 1191 1191 1200 1220 1242 1252 1245 1233 1231 1242 1260 1273 1269 1246 1211 1184 1183 1210 1249 1277 1285 1278 1267 1251 1230 1212 1214 1238 1268 1280
243A280j4k9k8j4QK6K9J2j0j4%K1K5J5kj3j6j5qLJ3J1LKJ1K0J9J0Jlrj4j4qpk2m2m7l4nK0
$$ 1280 1266 1237 1209 1195 1203 1229 1258 1270 1260 1246 1246 1267 1292 1307 1305 1292 1276 1261 1253 1256 1269 1280 1283 1285 1296 1316 1335 1345 1346 1343 1334 1320 1306 1298 1291 1269 1227 1180 1146 1141 1161
238A161L1K1kk0k2nK3M2L8J1j1j0PJ4KoLJ7J6RJ9L7L4Ll2m1k9j9j8j7j0nmljk%PJ5J4Okj%
$$ 1161 1192 1213 1211 1191 1169 1164 1187 1229 1267 1278 1267 1257 1264 1278 1280 1274 1277 1294 1310 1319 1338 1375 1409 1412 1380 1339 1310 1291 1273 1256 1246 1241 1237 1234 1233 1231 1231 1238 1253 1267 1273 1271 1270 1270
232A270pk2k2nJ6K0Lj7k0j6j5k0j7nJ1J9K3K6K4J0pj8k3k6k5rJ4K8J9QOJ1R%%J0J7J3RRJ1
$$ 1270 1263 1241 1219 1214 1230 1250 1253 1236 1216 1200 1185 1165 1148 1143 1154 1173 1196 1222 1246 1256 1249 1231 1208 1182 1157 1148 1162 1190 1209 1217 1223 1234 1243 1243 1243 1253 1270 1283 1292 1301 1312
227A312Mj0j9k4k3k0j3nJMJllNK1K7J8PJ1K9L4Pl1m9l4kJ5Rrk4k7j9oNJ5K4K8K5J5Mmrj3j1
$$ 1312 1316 1306 1287 1263 1240 1220 1207 1202 1203 1207 1208 1205 1202 1207 1228 1255 1273 1280 1291 1320 1354 1361 1330 1281 1247 1245 1260 1269 1260 1236 1209 1190 1184 1189 1204 1228 1256 1281 1296 1300 1296 1287 1274 1263
222A263nnj4k7k8j4KKj3k0%M0P0O4K6j1k5k0j5j2mRRrk7k5nJ4K1J4kk0l0k1o%ooRK3K2J2J2
$$ 1263 1258 1253 1239 1212 1184 1170 1172 1174 1161 1141 1141 1181 1251 1315 1341 1330 1305 1285 1270 1258 1254 1263 1272 1263 1236 1211 1206 1220 1241 1255 1253 1233 1203 1182 1176 1176 1170 1164 1173 1196 1218 1230 1242
217A242J4Nj8l2k3j1qqOL0L9K6NkLPkj3j8j4n%oj3j5mNOklRL1M9N0K6rl4l9l1k0j3mNPLmp
$$ 1242 1256 1261 1243 1211 1188 1177 1169 1161 1167 1197 1236 1262 1267 1265 1268 1275 1273 1260 1242 1228 1223 1223 1217 1204 1189 1185 1190 1196 1194 1191 1200 1231 1280 1330 1356 1347 1313 1274 1243 1223 1210 1206 1211 1218 1221 1217 1210
211A210jORMjjL%orLJ2QmkJ3J7Lj6j3%PNJ0K3K6J6LlmokKpl2n0l7lK6L9M0L0J0j3k4j5kkj1
$$ 1210 1209 1215 1224 1228 1227 1226 1229 1229 1223 1214 1217 1229 1237 1233 1231 1244 1261 1264 1248 1235 1235 1242 1247 1257 1280 1306 1322 1325 1322 1318 1312 1310 1312 1305 1273 1223 1186 1183 1209 1248 1288 1318 1328 1315 1291 1276 1274 1272 1261
205A261k0j9j0lMJ5K3K0QKJ0K0J6lrOK4J8qk8l0k5k2j5kKj1k4j8LJ5J1%mnnmJKKQK3L5L3J6
$$ 1261 1241 1222 1212 1209 1213 1228 1251 1271 1279 1281 1291 1311 1327 1324 1315 1321 1345 1363 1355 1327 1297 1272 1250 1235 1233 1235 1224 1200 1182 1185 1200 1211 1211 1207 1202 1197 1193 1194 1196 1198 1206 1229 1264 1297 1313
199A313M%Jlj6k6k7j8rrj0nJ2K6K6Nk3m4n1m2k4oNJ2K3L5M2L3J4JJJ0J0rl4m3l2j4j0j9k4
$$ 1313 1317 1317 1318 1315 1299 1273 1246 1228 1219 1210 1200 1195 1207 1233 1259 1264 1241 1197 1146 1104 1080 1074 1079 1091 1114 1149 1191 1224 1238 1239 1240 1250 1260 1251 1217 1174 1142 1128 1118 1099 1075
194A075j0J5L0K9K5K7L2K4Jk0k5j3NK1K5J2j5l6l3rJ2J9J5J2J0Kpj4j3j1j0lRJ2Mpj0rpj0
$$ 1075 1065 1080 1110 1139 1164 1191 1223 1247 1248 1228 1203 1190 1195 1216 1241 1253 1238 1202 1169 1160 1172 1191 1206 1218 1228 1230 1223 1209 1196 1185 1175 1172 1181 1193 1197 1190 1180 1171 1164 1154
190A154j4j4j0KK1L3K3JqkMqk2k1oNMKJ0K0K0J5J1QJomLOmj8k6k5j8j2nQK6L1J3j9l7l0j2
$$ 1154 1140 1126 1116 1118 1139 1172 1195 1196 1188 1186 1190 1182 1160 1139 1133 1138 1142 1144 1154 1174 1194 1209 1220 1228 1229 1223 1219 1222 1228 1224 1206 1180 1155 1137 1125 1120 1128 1154 1185 1198 1179 1142 1112 1100
$$ [...]
-1604G62
##END=	
##END=	
