##TITLE=	6VBw9FsfQCGeypV7YhsagA.51.ser
TM-VI-167 cosy

##JCAMP-DX=	6.0	$$ MestReNova 14.3.1-31739
##DATA TYPE=	LINK
##BLOCK_ID=	1
##BLOCKS=	2    
##ORIGIN=	Mestrelab Research S.L.
##OWNER=	hrzepa
##$MNOVA/LINK_BLOCK_TYPE=	ITEM	$$ NMR Spectrum
##$MNOVA/ITEM/POLYGON=	(XY..XY)
5321,5835
8722,5835
8722,8208
5321,8208
5321,5835
##$MNOVA/ITEM/Z=	0
##$MNOVA/ITEM/ANGLE=	0
##TITLE=	6VBw9FsfQCGeypV7YhsagA.51.ser
##JCAMP-DX=	6.0	$$ MestReNova 14.3.1-31739
##BLOCK_ID=	2
##DATA TYPE=	MNOVA NMR VIEW DATA
##DATA CLASS=	MNOVA VIEW DATA
##$MNOVA/2D/THRESHOLD=	73.98564910888671875
##$MNOVA/ITEM/ZOOM/X=	-0.98001264966690615488,	11.003459999979801509
##$MNOVA/ITEM/ZOOM/Y=	-0.98001264966690615488,	11.003459999979801509
##END=	
##TITLE=	6VBw9FsfQCGeypV7YhsagA.51.ser
##JCAMP-DX=	6.0	$$ MestReNova 14.3.1-31739
##BLOCK_ID=	3
##DATA TYPE=	nD NMR SPECTRUM
##DATA CLASS=	NTUPLES
##NUMDIM=	2
##ORIGIN=	Bruker BioSpin GmbH
##OWNER=	nmr
##.OBSERVE FREQUENCY=	400.41200205000001233
##.OBSERVE NUCLEUS=	^1H
##.SOLVENT NAME=	CDCl3
##.PULSE SEQUENCE=	cosygpqf
##LONGDATE=	2021/11/16 18:08:45.000
##.ACQUISITIONMODE=	SIMULTANEOUS (DQD)
##$ORIGINAL FORMAT=	Bruker XWIN-NMR
##$MNOVA/SCALES_VERSION=	9
##$PARAMETER FILE=	(acqu2s, ASCII, /private/var/folders/f6/rjf_tdyn2v98c5c0wvkgn4s80000gn/T/6VBw9FsfQCGeypV7YhsagA/51/acqu2s, 0)
$$ ##TITLE= Parameter file, TOPSPIN		Version 3.2
$$ ##JCAMPDX= 5.0
$$ ##DATATYPE= Parameter Values
$$ ##NPOINTS= 121	$$ modification sequence number
$$ ##ORIGIN= Bruker BioSpin GmbH
$$ ##OWNER= nmr
$$ $$ 2021-11-16 18:17:41.049 +0000  nmr@CZC10666PP
$$ $$ /opt/topspin/data/agmb/nmr/Nov16-2021/51/acqu2s
$$ $$ process /opt/topspin3.2/prog/mod/go
$$ ##$ACQT0= 0
$$ ##$BF1= 400.41
$$ ##$FnMODE= 1
$$ ##$NUC1= <1H>
$$ ##$NusJSP= 0
$$ ##$NusT2= 1
$$ ##$NusTD= 120
$$ ##$O1= 2002.04999998732
$$ ##$SFO1= 400.41200205
$$ ##$SW= 12.0068636381483
$$ ##$SW_h= 4807.69230769231
$$ ##$TD= 120
$$ ##END=
$$ 
##$PARAMETER FILE=	(acqus, ASCII, /private/var/folders/f6/rjf_tdyn2v98c5c0wvkgn4s80000gn/T/6VBw9FsfQCGeypV7YhsagA/51/acqus, 0)
$$ ##TITLE= Parameter file, TOPSPIN		Version 3.2
$$ ##JCAMPDX= 5.0
$$ ##DATATYPE= Parameter Values
$$ ##NPOINTS= 12	$$ modification sequence number
$$ ##ORIGIN= Bruker BioSpin GmbH
$$ ##OWNER= nmr
$$ $$ 2021-11-16 18:17:44.471 +0000  nmr@CZC10666PP
$$ $$ /opt/topspin/data/agmb/nmr/Nov16-2021/51/acqus
$$ $$ process /opt/topspin3.2/prog/mod/shimcntl
$$ ##$ACQT0= 1000000
$$ ##$AMP= (0..31)
$$ 100 100 100 100 100 100 100 100 100 100 100 100 100 100 100 100 100 100
$$ 100 100 100 100 100 100 100 100 100 100 100 100 100 100
$$ ##$AMPCOIL= (0..19)
$$ 0 0 0 0 0 0 0 0 0 0 0 0 0 0 0 0 0 0 0 0
$$ ##$ANAVPT= -1
$$ ##$AQSEQ= 0
$$ ##$AQ_mod= 3
$$ ##$AUNM= <au_zg>
$$ ##$AUTOPOS= <53 >
$$ ##$BF1= 400.41
$$ ##$BF2= 400.41
$$ ##$BF3= 400.41
$$ ##$BF4= 400.41
$$ ##$BF5= 400.41
$$ ##$BF6= 400.41
$$ ##$BF7= 400.41
$$ ##$BF8= 400.41
$$ ##$BYTORDA= 0
$$ ##$CAGPARS= (0..11)
$$ 0 0 0 0 0 0 0 0 0 0 0 0
$$ ##$CFDGTYP= 0
$$ ##$CFRGTYP= 9
$$ ##$CHEMSTR= <none>
$$ ##$CNST= (0..63)
$$ [...]
$$ 0 0 0 0
$$ ##$ShimPowMaxUC= (0..63)
$$ 130000 130000 130000 130000 130000 130000 130000 130000 130000 130000 130000
$$ 130000 130000 130000 130000 130000 130000 130000 130000 130000 0 0 0 0
$$ 0 0 0 0 0 0 0 0 0 0 0 0 0 0 0 0 0 0 0 0 0 0 0 0 0 0 0 0 0 0 0 0 0 0 0 0
$$ 0 0 0 0
$$ ##$ShimPowMaxUG= (0..63)
$$ 524287 524287 524287 524287 524287 524287 524287 524287 524287 524287 524287
$$ 524287 524287 524287 524287 524287 524287 524287 524287 524287 0 0 0 0
$$ 0 0 0 0 0 0 0 0 0 0 0 0 0 0 0 0 0 0 0 0 0 0 0 0 0 0 0 0 0 0 0 0 0 0 0 0
$$ 0 0 0 0
$$ ##$ShimPowRcbType= 3
$$ ##$ShimPowRes= (0..63)
$$ 1e-20 1e-20 1e-20 1e-20 1e-20 1e-20 1e-20 1e-20 1e-20 1e-20 1e-20 1e-20
$$ 1e-20 1e-20 1e-20 1e-20 1e-20 1e-20 1e-20 1e-20 0 0 0 0 0 0 0 0 0 0 0 0
$$ 0 0 0 0 0 0 0 0 0 0 0 0 0 0 0 0 0 0 0 0 0 0 0 0 0 0 0 0 0 0 0 0
$$ ##$ShimPowRng0= (0..63)
$$ 1 1 1 1 1 1 1 1 1 1 1 1 1 1 1 1 1 1 1 1 0 0 0 0 0 0 0 0 0 0 0 0 0 0 0 0
$$ 0 0 0 0 0 0 0 0 0 0 0 0 0 0 0 0 0 0 0 0 0 0 0 0 0 0 0 0
$$ ##$ShimPowRng1= (0..63)
$$ 1 1 1 1 1 1 1 1 1 1 1 1 1 1 1 1 1 1 1 1 0 0 0 0 0 0 0 0 0 0 0 0 0 0 0 0
$$ 0 0 0 0 0 0 0 0 0 0 0 0 0 0 0 0 0 0 0 0 0 0 0 0 0 0 0 0
$$ ##$ShimPowRng2= (0..63)
$$ 1 1 1 1 1 1 1 1 1 1 1 1 1 1 1 1 1 1 1 1 0 0 0 0 0 0 0 0 0 0 0 0 0 0 0 0
$$ 0 0 0 0 0 0 0 0 0 0 0 0 0 0 0 0 0 0 0 0 0 0 0 0 0 0 0 0
$$ ##$ShimPowRng3= (0..63)
$$ 1 1 1 1 1 1 1 1 1 1 1 1 1 1 1 1 1 1 1 1 0 0 0 0 0 0 0 0 0 0 0 0 0 0 0 0
$$ 0 0 0 0 0 0 0 0 0 0 0 0 0 0 0 0 0 0 0 0 0 0 0 0 0 0 0 0
$$ ##$ShimSysFunc= (0..63)
$$ 1 2 3 4 5 7 9 11 15 16 8 10 12 14 6 17 13 18 19 20 0 0 0 0 0 0 0 0 0 0
$$ 0 0 0 0 0 0 0 0 0 0 0 0 0 0 0 0 0 0 0 0 0 0 0 0 0 0 0 0 0 0 0 0 0 0
$$ ##$ShimSysMatrix= 0
$$ ##$ShimSysType= 1
$$ ##$TFXNUM= 0
$$ ##$TRIPLO2= 0
$$ ##$VTU= 2
$$ ##$VTUETH= <149.236.99.20>
$$ ##$VTUTY= <no>
$$ ##$WBREFAM= (0..15)
$$ 135 116 100 100 100 100 100 100 100 100 100 100 100 100 100 100
$$ ##$WBREFLM= (0..15)
$$ 0 0 0 0 0 0 0 0 0 0 0 0 0 0 0 0
$$ ##$WBREFPH= (0..15)
$$ 71.66 -68.25 0 0 0 0 0 0 0 0 0 0 0 0 0 0
$$ ##$WBSGU= (0..15)
$$ 0 0 0 0 0 0 0 0 0 0 0 0 0 0 0 0
$$ ##$XFAC= 2
$$ ##END=
$$ 
##$DECIM=	4160
##$DSPFVS=	20
##.ACQUISITIONSCHEME=	NOT PHASESENSITIVE
##NTUPLES=	nD NMR SPECTRUM
##VAR_NAME=	FREQUENCY1,	FREQUENCY2,	SPECTRUM
##SYMBOL=	F1,	F2,	Y
##.NUCLEUS=	1H,	1H
##.OBSERVE FREQUENCY=	400.41200205000001233,	400.41200205000001233
##VAR_TYPE=	INDEPENDENT,	INDEPENDENT,	DEPENDENT
##VAR_FORM=	AFFN,	AFFN,	ASDF
##VAR_DIM=	512,	512,	262144
##UNITS=	HZ,	HZ,	ARBITRARY UNITS
##FIRST=	4405.895418600002813,	4405.895418600002813,	0.45022958517074584961
##LAST=	-392.40686505384644533,	-392.40686505384644533,	0.17028141021728515625
##MIN=	-392.40686505384644533,	-392.40686505384644533,	0.001278875512070953846
##MAX=	4405.895418600002813,	4405.895418600002813,	7614.10400390625
##FACTOR=	1,	1,	0.0047710827288836290747
##PAGE=	F1=4405.9
##FIRST=	4405.895418600002813,	4405.895418600002813,	0.45022958517074584961
##DATA TABLE=	(F2++(Y..Y)), PROFILE
$$ [...]
##PAGE=	F1=-983.978
##FIRST=	4405.895418600002813,	4405.895418600002813,	0
##DATA TABLE=	(F2++(Y..Y)), PROFILE
$$ plain form
1420 53 168 241 194 235 82 100 135 264 131 132 174 81 25 52 75 114 121 50 114 6 65 169 78 162 12 89 138 176 129 52 43 67 186
1110 186 122 130 140 28 145 142 148 102 95 136 128 15 83 93 142 81 57 167 119 136 112 19 78 193 175 95 60 112 64 149 73 120 67 134 25
781 25 61 57 140 27 33 44 58 52 154 172 52 78 117 155 193 87 175 151 396 235 199 585 4229 8216 8123 5323 444 339 283
509 283 342 328 104 269 156 260 313 146 30 198 187 45 182 108 93 73 61 44 54 110 60 75 203 85 119 56 72 58 10 82
227 82 93 106 39 110 72 97 22 16 174 114 132 54 17 71 87 55 91 143 187 160 52 101 110 103 151 32 86 177 213 55 175 36 204 155
-92 155 155 95 105 98 15 95 118 108 79 132 109 117 122 60 127 53 63 103 72 117 98 130 170 14 155 115 180 185 86 9 106 75
$$ packed form
1420E3J15P3m7M1j53J8L5J29j33JM2r3n6K7K3L9Pp1O4j08N9J04r1Q4j50P7M9L8m7p7rK4J19
1110A86o4QJ0j12J17lOm6pM1qj13O8J0M9o1k4J10m8J7k4r3N9J15j8q0l5N2m8Q5p6M7n3O7j09
781B5L6mQ3j13OJ1J4oJ02J8j20K6L9L8L8j06Q8k4K45j61l6L86L644L987r3k800m879j05n6
509B83N9j4k24J65j13J04N3j67j16J68j1j42J37p4j5k0j2j7J0N6n0J5J28j18L4o3J6j4m8P2
227H2J1J3o7P1l8K5p5oJ58o0J8p8l7N4J6l2L6N2M4k7j08M9RpM8j19N4R1L6j58J20j39J68m9
-92A55%o0J0pq3Q0K3j0k9N3k3QNo2O7p4J0M0l1M5j9L2M0j56J41m0O5Nr9p7R7l1
-392G5
##PAGE=	F1=-1002.76
##FIRST=	4405.895418600002813,	4405.895418600002813,	0
##DATA TABLE=	(F2++(Y..Y)), PROFILE
$$ plain form
4406 20 35 87 134 72 118 158 96 41 52 51 141 152 151 113 60 25 100 76 148 105 159 105 120 187 123 151 54 129 4 22 44 117 60 190 149
4077 149 107 100 124 147 121 195 182 87 100 35 48 110 93 87 56 152 340 285 153 237 121 74 104 163 118 95 99 59 129 210 111 72 68 56 143
3749 143 140 167 148 109 103 201 74 74 96 81 62 30 75 36 69 63 71 60 114 125 77 25 135 79 102 77 128 101 74 112 83 180 150 104 34 86
3411 86 191 183 161 38 143 55 111 183 165 69 15 68 94 81 59 25 78 123 79 63 184 178 140 345 718 792 276 120 245 1054 849
3119 849 165 81 96 96 4 161 321 365 304 168 282 164 199 242 132 77 321 543 522 267 183 501 126 16 48 46 68 77 132 28
2838 28 92 177 180 117 96 404 503 969 537 193 160 62 126 138 141 139 188 48 65 93 53 22 89 57 75 112 93 149 58 198 190 73 121 90
2519 90 106 126 51 87 62 41 154 204 137 117 76 73 151 237 116 82 135 184 171 198 196 110 67 96 90 69 80 40 107 57 77 57 34 180 57
2190 57 142 47 62 82 54 139 161 132 223 285 479 4025 7451 2552 614 242 554 89 204 47 149 193 266 21 132 137 170
$$ packed form
4406B0J5N2M7o2M6M0o2n5J1jR0J1jl8n3l5P5k4P2m3N4n4J5O7o4K8r7P5j25J8K2P3n7J30m1
4077A49m2pK4K3k6P4j3r5J3o5J3O2j7ol1R6J88n5j32Q4j16m7L0N9m5k3Mm0P0Q1r9l9mj2Q7
3749A43lK7j9l9oR8j27%K2j5j9l2M5l9L3oQj1N4J1m8n2J10n6K3k5N1k7k7L8k9R7l0m6p0N2
3411H6J05qk2j23J05q8N6P2j8r6n4N3K6j3k2l4N3M5m4j6J21ol8K05L73P4n16j56J25Q09k05
3119H49o84q4J5%r2J57J60M4o1j36J14j18L5M3j10n5K44K22k1k55q4L18l75j10L2kK2RN5j04
2838B8O4Q5Lo3k1L08R9M66m32l44l3r8O4J2LkM9j40J7K8m0l1O7l2J8L7j9N6r1J40qj17M8l1
2519I0J6K0p5L6k5k1J13N0o7k0m1lP8Q6j21l4N3M9j3K7kq6m3K9ok1J1m0O7n0K0k0k3J46j23
2190E7Q5r5J5K0k8Q5K2k9R1O2J94L546L426m899j938l72L12m65J15j57J02M4P3k45J11NL3
$$ plain form
1936 170 180 166 8 154 119 56 88 110 98 356 116 84 99 59 182 143 400 421 1261 3522 5180 4595 2141 702 498 336
1692 336 165 74 356 35 114 281 148 47 243 290 205 404 395 711 912 1560 14664 12152 592 1415 586 161 477 345
1467 345 197 217 206 189 124 74 351 225 143 163 107 172 299 83 123 285 95 99 89 39 52 151 20 168 40 92 153 93 135 43
1185 43 90 156 153 114 87 44 49 165 115 160 121 21 161 159 136 109 117 109 106 24 70 83 146 81 84 186 96 156 80 16 18 206 202 121 102 142 35
838 35 138 55 97 75 141 31 85 19 156 18 57 13 45 56 188 192 25 76 104 153 165 88 177 114 354 194 141 443 3059 5945
556 5945 5892 3865 340 258 182 271 250 41 217 157 243 286 146 78 183 133 27 153 83 67 74 63 40 40 60 92 45 219 72 123
274 123 62 73 46 11 54 73 71 32 101 78 109 24 31 162 102 113 38 43 41 44 71 65 164 184 142 62 89 140 119 133 11 84 172 205 90 190
-64 190 37 184 156 189 115 146 125 29 145 126 107 62 147 158 127 146 65 107 4 46 94 99 120 94 157 232 33 82 101 216 180 139 30
$$ packed form
1936A70J0j4j58J46l5o3L2K2j2K58k40l2J5m0J23l9K57K1Q40K261J658n85k454j439k04j62
1692C36j71r1K82l21P9J67j33j01J96M7q5J99rL16K01O48J3104k512j1560Q23q29m25L16j32
1467C45j48K0j1j7o5n0K77j26q2K0n6O5J27k16M0J62j90Mj0n0J3R9j31J48j28N2O1o0M2r2
1185D3M7O6ll9k7m3NJ16n0M5l9j00J40kk3k7Qqlq2M6J3O3o5LJ02r0O0p6o4KJ88mq1j9M0j07
838C5J03q3M2k2O6j10N4o6J37j38L9m4L2J1J32Mj67N1K8M9J2p7Q9o3K40j60n3L02K616K886
556E945n3k027l525q2p6Q9k1k09J76o0Q6M3j40o8J05n0j06J26p0j6Pj1k3%K0L2m7J74j47N1
274A23o1J1k7l5M3J9kl9O9k3L1q5PJ31o0J1p5NkLK7oR9K0m2q0K7N1k1J4j22P3Q8L3j15J00
-64A90j53J47k8L3p4L1k1r6J16j9j9m5Q5J1l1J9q1M2j03M2M8NK1k6O3P5j99M9J9J15l6m1j09
$$ plain form
-374 30 99 73
$$ packed form
-374C0O9k6
-392G3
##PAGE=	F1=-1021.54
##FIRST=	4405.895418600002813,	4405.895418600002813,	0
##DATA TABLE=	(F2++(Y..Y)), PROFILE
$$ plain form
4406 30 47 88 116 81 148 160 100 49 40 83 165 110 128 115 29 38 92 99 147 109 160 83 158 197 99 147 61 142 44 80 36 101 67 170 123 126 107
4058 107 103 125 145 189 141 67 129 45 77 158 94 96 79 158 339 224 115 211 109 60 117 161 103 78 92 72 119 160 114 101 63 74 133 109
3739 109 164 166 94 114 208 81 62 101 73 51 61 105 47 78 84 71 39 123 132 59 31 111 68 105 91 148 119 59 99 83 176 152 89 33 78 246
3401 246 229 196 16 152 89 124 172 133 65 32 53 108 47 9 76 98 119 92 70 203 163 149 477 889 951 432 78 215 1049 794
3119 794 254 67 102 101 36 133 296 337 267 260 294 137 246 262 107 113 298 679 572 231 133 467 125 8 83 24 102 104 109 35 98
2828 98 221 177 123 65 334 393 999 562 170 190 84 106 86 147 115 206 63 62 49 7 19 49 60 62 105 62 142 49 184 216 68 113
2528 113 70 127 134 45 40 49 79 159 182 129 104 48 97 176 222 130 98 162 165 154 219 154 88 115 97 138 115 82 54 132 51 9 22 38 175 91
2190 91 114 13 88 94 38 96 131 105 154 383 304 2887 4915 1976 426 185 541 66 245 22 178 184 269 10 139 52 171
$$ packed form
4406C0J7M1K8l5O7J2o0n1rM3Q2n5J8j3q6RN4PM8l8N1p7P5L9r8M8q6Q1r8L6m4O5l4J03m7Lj9
4058A07mK2K0M4m8p4O2q4L2Q1o4Kj7P9J81j15j09R6j02m9N7M4n8k5J4k0M7M1m6j3l8J1N9k4
3739A09N5Kp2K0R4j27j9L9k8k2J0M4n8L1Oj3l2Q4Rp3k8Q0m3L7j4N7k9o0M0j6R3k4o3n6M5J68
3401B46j7l3j80J36o3L5M8l9o8l3K1N5o1l8O7K2K1k7k2J33m0j4L28M12O2n19l54J37Q34k55
3119G94n40j87L5jo5R7J63M1p0pL4j57J09J6j55OJ85L81j07l41r8L34l42j17P5n9P8KNp4O3
2828I8J23m4n4n8K69N9O06m37l92K0j06K2k0O1l2R1j43jj3m2J2L0J1KM3m3Q0r3J35L2j48M5
2528A13m3N7Pq9nRL0Q0K3n3k5n6M9P9M6r2l2O4Lj1O5o5o6K7j8M1k3l3k8P8q1m2J3J6J37q4
2190I1K3j01P5On6N8L5k6M9K29p9K583K028k939j550k41L56m75J79k23J56OQ5k59J29q7J19
$$ plain form
1936 171 190 150 37 157 149 95 87 146 123 392 148 116 44 97 118 182 340 272 609 1848 2916 2519 1257 531 421 251 128
1683 128 141 470 166 155 332 221 104 218 325 439 701 712 1174 1370 2267 25106 21286 811 1240 711 504 715 532
1467 532 313 303 233 292 175 38 414 245 105 235 118 189 336 39 146 366 90 158 120 5 27 185 20 203 76 115
1223 115 118 114 104 78 82 159 132 113 99 84 40 135 95 188 106 17 170 177 124 123 155 107 72 48 50 63 132 89 116 182 72 164 49 18 50 202
885 202 206 133 141 158 71 111 63 100 95 171 45 101 30 161 22 74 19 60 70 219 210 27 66 131 167 138 96 184 96 294 170 132 308
575 308 1946 3740 3718 2449 232 182 101 189 168 20 156 144 228 240 138 109 167 104 78 115 63 55 72 59 77 12 38 122 38 219
293 219 57 134 96 66 50 21 22 74 58 58 93 107 135 22 56 132 81 96 28 72 54 3 91 34 180 185 136 76 77 180 148 111 34 84 158
-36 158 192 114 187 45 156 160 213 120 175 148 46 176 123 95 36 153 202 129 164 65 73 43 34 82 112 127 83 179 261 57 14 81 234
$$ packed form
1936A71J9m0j13J20qn4qN9k3K69k44l2p2N3K1O4J58o8L37J239J068l97j262p26j10j70j23
1683A28J3L29l04j1J77j11j17J14J07J14K62J1M62J96Q97K2839l820k0475M29n29k07K11j83
1467E32k19j0p0N9j17j37L76j69j40J30j17P1J47k97J07K20k76O8l8j15K2J58j65J83j27L9
1223A15Lmj0k6MP7k7j9j4j5m4R5m0R3q2q9J53Pn3jL2m8l5k4KJ3O9m3K7O6j10R2j15l1L2J52
885B02Mp3QJ7q7M0m8L7nP6j26N6p1J31j39N2n5M1J0J49rj83L9O5L6k9m2Q8q8J98j24l8J76
575C08J638J794k2j269k217n0q1Q8k1j48J36j2Q4J2j02k9N8o3k6L7n2qJ7j3J8o5K6Q4q4J81
293B19j62P7l8l0j6k9JN2j6%L5J4K8j13L4P6n1J5o8M4j8n1Q8n7J46Nm9o0JJ03l2l7p7N0P4
-36A58L4p8P3j42J11MN3r3N5k7j02J30n3k8n9J17M9p3L5r9Ql0rM8L0J5m4R6Q2k04m3O7J53
$$ plain form
-345 234 171 178 44 89 68
$$ packed form
-345B34o3Pj34M5k1
-392F8
##PAGE=	F1=-1040.32
##FIRST=	4405.895418600002813,	4405.895418600002813,	0
##DATA TABLE=	(F2++(Y..Y)), PROFILE
$$ plain form
4406 27 49 86 91 90 148 163 110 48 77 106 170 71 94 99 40 69 72 123 148 113 146 68 191 187 70 129 61 143 93 128 35 69 81 145 96 139 106
4058 106 71 104 145 175 102 52 145 72 100 195 98 114 99 162 323 162 74 177 96 52 128 160 81 75 90 73 93 105 119 129 40 89 119 66
3739 66 155 167 89 131 201 93 51 93 58 78 107 122 60 85 96 69 14 124 142 59 44 108 67 104 111 169 122 55 91 75 148 135 80 42 70
3411 70 277 268 228 22 155 116 122 170 93 69 56 53 113 36 41 124 130 96 114 80 215 148 136 622 1036 1110 542 39 222 1005 688 326
3110 326 77 115 102 65 82 231 250 257 447 383 137 283 264 100 131 261 763 621 277 236 515 118 2 105 20 140 118 74
2847 74 35 107 242 193 127 64 278 342 945 523 136 190 113 80 36 140 95 209 81 58 17 43 60 11 71 59 108 65 130 49 166
2556 166 216 62 105 51 151 147 73 44 36 96 152 150 109 88 55 119 188 199 118 109 180 143 124 205 107 84 148 111 179 151 98 77 166 86 44 19
2218 19 72 169 119 92 21 115 145 35 45 90 98 115 518 124 1267 2141 1738 83 166 463 75 245 38 169 160 241 44 113 81
$$ packed form
4406B7K2L7NjN8J5n3o2K9K9O4r9K3Nn9K9LN1K5l5L3p8J23mj17N9o8Q2n0L5r3L4J2O4m9M3l3
4058A06l5L3M1L0p3n0R3p3K8R5r7J6j5O3J61j61q8J03q1m4P6L2p9oJ5j7K0J2J4J0q9M9L0n3
3739F6Q9J2p8M2P0j08m2M2l5K0K9J5o2K5J1k7n5J10J8q3j5O4m1L7PN8m7o7L6j6P3j3n5l8K8
3411G0K07rm0k06J33l9OM8p7k4j3lO0p7NQ3Ol4J8l4J35o7j2M86M14P4n68n03J83P83l17l62
3110C26k49L8j3l7J7J49J9PJ90o4k46J46j9j64L1J30N02j42l44m1K79l97j16J03q5J20k2m4
2847G4l9P2J35m9o6o3K14O4O03m22l87N4p7l3m4J04m5J14j28k3m1K6J7m9O0j2M9m3O5q1J17
2556A66N0j54M3n4J00mp4k9qO0N6km1k1l3O4O9J1q1rP1l7j9Q1r8k3O4l7O8k8n3k1Q9q0m2k5
2218A9N3R7n0k7p1R4L0j10J0M5QJ7M03l94J143Q74m03j655Q3K97l88J70k07J31rQ1j97O9l2
$$ plain form
1946 81 114 195 92 45 136 155 127 74 155 173 379 160 101 27 87 50 197 244 135 163 630 1105 924 573 360 342 162 158 167 485
1664 485 222 203 278 225 96 237 485 474 734 687 1162 1225 2044 24538 21019 788 510 731 596 650 495 300 255 168 346
1429 346 133 39 372 201 120 248 86 158 332 30 175 380 65 177 127 18 51 181 18 200 91 112 62 128 80 79 78 125
1166 125 103 108 75 126 42 91 59 203 108 23 172 178 107 122 182 128 42 55 40 36 101 95 137 149 55 150 32 27 106 189 185 138 162 146 100 73
828 73 94 102 108 180 65 101 65 147 60 76 42 93 103 236 209 71 52 164 176 113 112 174 107 221 147 145 193 1045 1923 1923 1287 139 126
518 126 82 108 101 64 103 120 211 191 122 111 158 128 122 80 56 65 74 57 110 23 80 135 56 203 52 148 122 57 73 48 28 74 85 88 85 141 164
171 164 27 81 95 75 93 35 93 85 36 101 6 185 193 144 94 69 220 183 85 62 75 135 177 118 165 53 135 146 228 108 186 161 73 177
-148 177 111 84 15 149 228 117 164 68 24 72 39 70 110 134 73 198 250 84 39 52 227 162 188 44 75 49
$$ packed form
1946H1L3Q1j03m7R1J9k8n3Q1J8K06k19n9p4O0l7J47M7j09K8M67M75j81l51k13j8j80mRL18
1664D85k63j9P5n3j29J41K48j1K60m7M75O3Q19K2494l519k0231k78K21j35N4j55j95m5q7J78
1429C46k13r4L33j71q1J28j62P2J74l02J45K05l15J12n0j09L3J30j63J82j09K1n0O6m8jjM7
1166A25k2Nl3N1q4M9l2J44r5q5J49Op1J5O0n4q6J3j5mO5oM2J2r4R5j18nP9Q3mm7K4j6m6k7
828G3K1QOP2j15L6l6Q2q7J6l4N1J0J33k7j38j9J12J2o3jO2o7J14p4kM8Q52Q78%o36j148j3
518A26m4K6pl7L9J7R1k0o9j1M7l0om2k4RRj7N3q7N7N5p9J47j51R6k6o5J6k5k0M6J1LlN6K3
171A64j37N4J4k0J8n8N8qm9O5r5J79Qm9n0k5J51l7r8k3J3O0M2n9M7j12Q2J1Q2j20P8k5q8J04
-148A77o6k7o9J34P9j11M7r6m4M8l3L1M0K4o1J25N2j66m5J3J75o5K6j44L1k6
-392D9
##PAGE=	F1=-1059.1
##FIRST=	4405.895418600002813,	4405.895418600002813,	0
##DATA TABLE=	(F2++(Y..Y)), PROFILE
$$ plain form
4406 1 66 82 67 100 108 162 135 33 101 111 153 69 55 67 63 107 45 141 146 114 121 69 219 152 42 99 55 126 150 153 57 37 96 120 77 149 102
4058 102 28 90 124 155 73 47 151 97 117 216 96 132 121 167 294 111 42 133 90 58 142 160 65 81 91 56 53 60 124 142 14 94 104
3749 104 18 138 149 90 133 183 111 48 74 52 111 161 124 62 89 93 64 31 115 159 71 51 111 85 96 130 184 104 61 94 70 107 104 79 53
3420 53 72 275 294 255 40 146 126 108 170 63 83 50 50 107 54 66 159 175 53 139 100 220 140 111 740 1115 1247 583 51 241
3138 241 995 619 360 117 118 99 88 83 149 127 312 634 519 176 307 249 118 138 206 798 635 329 348 594 104 21 105 22
2875 22 171 117 38 25 111 234 208 129 107 254 401 848 431 95 166 137 67 4 119 77 190 100 50 19 71 105 15 92 53 108 95
2584 95 106 64 150 187 45 95 21 159 153 114 66 30 82 132 119 79 63 78 138 173 180 76 114 180 135 87 155 78 86 154 135 200 165 120 91
2256 91 203 123 63 52 87 175 114 95 31 124 183 83 29 77 88 124 594 93 108 2456 1820 294 220 346 140 208 86 122 155
$$ packed form
4406AO5J6j5L3QN4k7j02O8J0M2q4j4J2mM4o2R6Nl2Pn2J50o7j10N7m4P1K4Lr6k0N9K4m3P2m7
4058A02p4O2L4L1q2k6J04n4K0R9j20L6j1M6J27j83o9R1m3l2Q4J8r5J6J0l5lPO4J8j28Q0J0
3749A04q6J20J1n9M3N0p2o3K6k2N9N0l7o2K7Mk9l3Q4M4q8k0O0k6J1L4N4q0m3L3k4L7lk5k6
3420E3J9K03J9l9k15J06k0j8O2j07K0l3%N7n3J2R3J6j22Q6l9J20q0k9O29L75J32o64n32J90
3138B41P54l76k59k43Jj9j1nO6k2J85L22j15l43J31n8j31K0O8N92j63l06J9K46m90q3Q4q3
2875B2J49n4p9j3Q6J23k6p9k2J47J47M47m17l36P1k9p0o3J15m2J13r0n0l1N2L4r0P7l9N5j3
2584I5J1m2Q6L7j42N0p4J38ol9m8l6N2N0j3m0j6J5O0L5Pj04L8O6m5m8O8p7QO8j9O5l5m5k9
2256I1J12q0o0j1L5Q8o1j9o4R3N9j00n4M8J1L6M70n01J5K348o36j526p4J26k06O8j22L6L3
$$ plain form
1983 155 190 80 57 199 62 166 7 46 102 139 146 68 158 237 314 156 46 13 42 43 175 113 17 175 376 236 288 157 223 272
1702 272 137 256 106 377 182 374 116 154 108 242 595 207 406 223 546 435 646 9778 8696 502 720 915 339
1486 339 227 164 111 50 68 293 28 53 207 100 126 187 21 93 266 86 217 319 80 143 146 63 52 127 82 150 90 82 45 121
1204 121 85 37 86 47 66 82 62 148 77 41 32 194 134 45 175 147 81 93 181 143 75 50 58 39 66 93 144 89 59 108 39 46 140 184 150
875 150 144 161 104 108 71 125 89 113 155 87 82 93 115 120 76 48 135 156 232 182 118 64 181 167 88 136 135 136 146 113 142 105 457 729 776 542
537 542 75 109 116 38 62 90 64 94 189 155 97 87 155 183 142 61 67 85 85 73 124 58 132 128 71 171 61 161 128 63 97 81 51 54 124 104
199 104 74 168 182 41 105 76 115 107 63 103 105 70 98 24 177 208 157 111 62 256 212 53 73 55 106 164 104 136 61 126 107 234 86
-111 86 179 157 110 152 109 81 32 134 227 91 140 81 42 77 62 58 93 138 85 208 209 119 58 22 194 148 163 36 51 32
$$ packed form
1983A55L5j10k3J42j37J04j59L9N6L7Pp8R0P9P7j58j10l3K9JJ32o2r6J58K01j40N2j31O6M9
1702B72j35J19j50K71j95J92k58L8m6J34L53l88J99j83L23j11K11R132j082q194K18J95n76
1486C39j12o3n3o1J8K25k65K5J54j07K6O1j66P2J73j80J31J02k39O3Lq3j1P5m5O8o0ql7P6
1204A21l6m8M9l9J9J6k0Q6p1l6rJ62o0q9J30k8o6J2Q8l8o8k5Qj9K7K7N1n5l0M9o9PR4M4l4
875A50oJ7n7Ml7N4l6K4M2o8nJ1K2Nm4k8Q7K1P6n0o4n4J17j4p9M8jJJ0l3K9l7L52K72M7k34
537E42m67L4Pp8K4K8k6L0R5l4n8j0O8K8m1q1OJ8%j2N1o6P4mn7J00j10J00l3o5L4j6l0LP0k0
199A04l0R4J4j41O4k9L9qm4M0Kl5K8p4J53L1n1m6m9J94m4j59K0j8N1N8o0L2p5O5j9J27j48
-111H6R3k2m7M2m3k8m9J02R3j36M9n9l9L5j5mL5M5n3J23Jr0o1l6J72m6J5j27J5j9
-392C2
##PAGE=	F1=-1077.88
##FIRST=	4405.895418600002813,	4405.895418600002813,	0
##DATA TABLE=	(F2++(Y..Y)), PROFILE
$$ plain form
4406 44 108 76 46 108 38 161 172 36 104 99 120 94 42 56 77 143 38 147 136 112 105 91 238 97 16 61 49 91 207 151 90 82 112
4096 112 101 63 159 106 30 83 100 131 59 49 152 116 122 226 81 140 141 177 260 81 58 78 89 67 164 158 89 90 102 40 5 44 130 138 55
3767 55 89 88 40 120 116 91 114 156 131 57 52 69 129 216 121 52 87 78 55 71 102 179 108 49 103 108 80 141 189 70 72 108 87 72 69 86 61 89
3411 89 242 300 270 52 125 120 103 163 66 102 10 53 89 77 76 175 226 2 160 131 217 157 95 801 1090 1319 549 85 252 1060 671
3119 671 351 172 103 93 102 160 91 15 378 748 622 228 313 220 158 144 142 806 615 351 401 643 104 56 86 29 188 116 22 24
2838 24 105 199 208 151 159 284 507 777 316 50 131 150 90 33 87 66 151 114 40 26 89 149 29 121 39 94 122 77 92 141 134 19 83
2528 83 23 149 143 154 69 33 41 110 95 54 26 83 152 135 168 14 119 166 149 61 81 86 81 134 161 203 154 149 103 234 161 55 77 76 194
2199 194 74 136 48 113 201 159 30 112 51 143 558 139 747 2881 1541 484 250 222 209 155 121 57 181 133 119 66 279 45
$$ packed form
4406D4O4l2l0O2p0J23J1j36O8nK1k6n2J4K1O6j05J09j1k4pj4J47j41q1M5j2M2J16n6o1qL0
4096A12j1l8R6n3p6N3J7L1p2j0J03l6OJ04j45N9JL6Q3j79k3K0J1k2R7oo9JJ2o2l5L9Q6Qq3
3767E5L4jm8Q0mk5K3M2k5p4nJ7O0Q7r5o9L5rk3J6L1P7p1n9N4Nk8O1M8j19KL6k1j5lJ7k5K8
3411H9J53N8l0k18P3nj7O0r7L6r2M3L6j2jR9N1k24J58k9Q6o0o2P06K89K29p70m64J67Q08l89
3119F71l20j79o9j0RN8o9p6L63L70j26l94Q5r3o2j4kO64j91k64N0K42n39m8L0n7J59p2r4K
2838B4Q1R4Rn7QJ25K23K70m61k66Q1J9o0n7N4k1Q5l7p4j4O3O0j20R2q2N5K8m5J5M9pj15O4
2528H3o0J26oJ1q5l6QO9j5m1k8N7O9j7L3j54J05M7j7q8K0NnN3K7M2m9nm6J31p3j06K2jJ18
2199A94j20O2q8O5Q8m2j29Q2o1R2M15m19O08K134j340j057k34k8j3n4l4o4J24m8j4n3K13k34
$$ plain form
1936 45 100 84 70 94 126 162 110 197 301 217 166 75 30 93 155 159 33 103 209 558 727 523 162 198 255 244 381 23 178 141 642
1645 642 210 176 248 306 399 351 215 590 531 1133 1532 15421 13545 202 1672 1303 357 428 381 240 244 283 167 271 224
1410 224 72 201 165 119 154 135 175 189 303 234 173 80 229 137 80 62 183 80 108 69 139 115 134 44 111 66 51 42 153 147 139 84 87
1101 87 154 175 80 195 85 62 40 149 137 138 64 90 98 62 91 140 20 100 60 61 78 153 190 138 152 145 58 109 116 149 64 111 112 111 56 111 73
753 73 190 101 39 179 218 210 137 161 107 178 141 75 158 72 169 100 67 126 49 272 421 606 343 44 135 164 20 54 104 40 90 163
453 163 140 66 67 153 242 138 54 85 118 103 104 118 88 175 103 82 126 83 173 120 90 115 111 61 16 156 105 67 185 182 59 132 99 180 126
124 126 105 110 110 98 86 51 156 230 164 126 53 280 226 20 63 32 78 151 80 130 72 129 64 232 70 161 131 148 115 139 86 65 114 197
-195 197 52 94 101 114 69 85 47 67 135 128 205 167 161 48 15 143 121 114 48 33 76
$$ packed form
1936D5N5j6j4K4L2L6n2Q7J04q4n1r1m5O3O2Mj26P0J06L49J69k04l61L6N7j1J37l58J55l7N01
1645F42m32l4P2N8R3m8j36L75n9O02L99J3889j876j3343J470l69r46P1m7j41ML9j16J04m7
1410B24j52J29l6m6L5j9M0J4J14o9o1r3J49r2n7j8J21j03K8l9P0k4J9r0O7m5j5rJ11oqn5L
1101H7O7K1r5J15j10k3k2J09j2Jp4K6Ql6K9M9j20Q0m0JJ7P5L7n2J4pq7N1PL3q5M7Jjn5N5l8
753G3J17q9o2J40L9qp3K4n4P1l7o6Q3q6R7o9l3N9p7K23J49J85k63k99R1K9j44L4N0o4N0P3
453A63k3p4JQ6Q9j04q4L1L3j5JJ4l0Q7p2k1M4m3R0n3l0K5mn0m5J40n1l8J18lj23P3l3Q1n4
124A26k1N%j2j2l5J05P4o6l8p3K27n4k06M3l1M6P3p1N0n8N7o5J68j62R1l0J7l3K4n3k1M9Q3
-195A97j45M2PJ3m5J6l8K0O8pP7l8oj13l3J28k2po6j5M3
-392G6
##PAGE=	F1=-1096.66
##FIRST=	4405.895418600002813,	4405.895418600002813,	0
##DATA TABLE=	(F2++(Y..Y)), PROFILE
$$ plain form
4406 83 150 68 27 109 58 165 203 65 86 78 79 117 66 85 80 166 64 140 120 109 109 116 247 35 19 39 60 48 253 131 121 146 133 92
4087 92 47 169 125 71 78 103 108 63 53 157 127 110 236 56 138 152 186 232 76 94 17 82 67 192 150 133 107 128 62 42 63 138 124
3777 124 99 81 68 82 106 74 89 83 125 142 72 35 95 131 260 134 38 74 71 41 112 86 190 168 35 82 116 59 137 175 41 80 130
3467 130 123 70 56 95 64 110 192 281 265 50 96 102 130 141 85 114 50 83 63 93 81 173 271 50 167 159 207 197 92 785 949 1285 455
3157 455 111 268 1198 839 308 225 79 81 108 227 105 85 391 749 632 274 295 186 204 151 108 799 598 334 387 641 134
2903 134 92 59 45 190 132 36 43 88 150 193 196 198 354 573 779 234 11 100 154 123 60 54 71 104 115 35 29 103 182 36 150 26 71
2594 71 134 68 125 134 73 26 73 61 124 116 179 56 42 5 100 73 62 33 63 153 88 149 49 123 148 167 71 47 110 71 101 180 194 128 178
2265 178 122 251 197 53 92 50 215 20 194 87 105 208 235 18 159 14 169 422 307 610 1661 808 453 220 121
$$ packed form
4406H3O7q2m1Q2n1J07L8j38K1qJL8n1J9nQ6j02P6k0j1%PJ31k12j6K0K1j2K05j22j0K5j3m1
4087I2m5J22m4n4PK5Nm5j0J04l0j7J26j80Q2J4L4M6j56J8p7O5j5J25m2j7k6K1o6k0K1P5j4
3777A24k5j8j3J4K4l2J5oM2J7p0l7O0L6J29j26r6L6ll0P1k6J04k2j33M7L4n7P8L8j34L9N0
3467A30pn3j4L9l1M6Q2Q9j6k15M6OK8J1n6K9o4L3k0L0j2R2R8k21J17qM8j0j05O93J64L36q30
3157D55l44J57R30l59n31q3j46KK7J19j22k0L06L58j17l58K1j09J8n3m3O91k01k64N3K54n07
2903A34m2l3j4J45n8r6PM5O2M3LKJ56K19K06n45k23Q9N4l1o3oJ7L3J1q0oP4P9j46J14j24M5
2594G1O3o6N7Ro1m7M7j2O3qO3j23j4l7R5k7j1k9L0R0o5O1j00P4K5J9r6k4O3l9L0P9J4o6N0
2265A78n6J29n4j44L9m2J65j95J74j07J8J03K7k17J41j45J55K53j15L03J051q53l55k33r9
$$ plain form
2030 121 248 111 137 23 204 86 152 144 294 23 36 146 95 121 137 170 157 261 343 124 193 152 65 172 250 188 146 179 145 490
1749 490 786 425 280 238 280 364 470 159 56 231 880 441 300 358 668 450 1033 871 1377 1556 2353 3512 39624 34281
1523 34281 420 1974 1584 987 1030 907 573 489 502 137 500 389 293 379 226 189 281 242 177 283 399 221 263 69 329
1288 329 208 135 95 275 77 143 110 219 139 184 118 135 176 75 46 257 131 198 149 145 94 206 110 223 20 67 23 104 111 187 96
997 96 110 159 85 94 131 65 148 72 78 106 149 193 167 155 126 83 121 153 161 45 104 98 130 45 116 42 253 154 25 213 268 184 95 191 149 165
659 165 108 74 164 15 194 114 22 116 27 299 482 728 348 38 178 213 62 56 116 22 121 141 142 39 105 147 287 116 47 95
378 95 164 123 125 108 109 199 72 97 70 107 179 121 120 133 129 60 30 171 96 69 186 164 75 158 134 238 139 146 119 103 116 75 73 133 252 161
40 161 134 40 287 220 20 43 41 55 133 63 166 91 141 83 219 66 138 87 175 99 181 93 94 98 146 12 54 117 176 70 94 39 36 129
$$ packed form
2030A21J27j37K6j14J81j18O6qJ50k71J3J10n1K6J6L3j3J04Q2k19O9m1q7J07P8o2m2L3l4L45
1749D90K96l61j45m2M2Q4J06l11j03J75O49m39j41N8L10k18N83j62N06J79P97J159L6112n343
1523C4281l3861J554l90n97M3j23l34q4J3l65L63j11r6Q6j53l7R2l9o5J06J16j78M2j94K60
1288C29j21p3m0J80j98O6l3J09q0M5o6J7M1j01k9K11j26O7m9mn1J12r6J13k03M7m4Q1PP6r1
997I6J4M9p4RL7o6Q3p6OK8M3M4k6j2k9m3L8L2Qj16N9oL2q5P1p4K11r9j29J88N5q4q9R6m2J6
659A65n7l4R0j49J79q0r2R4q9K72J83K46l80l10J40L5j51oO0r4R9K0Jj03O6M2J40j71o9M8
378I5O9m1Kj7JR0j27K5k7L7P2n8jJ3mo9l0J41p5k7J17k2q9Q3k4J04r9Pk7j6J3m1kO0J19r1
40A61k7r4K47o7k00K3kJ4P8p0J03p5N0n8J36j53P2n1Q8p6Q2q8JMM8j34M2O3N9j06K4n5lR3
$$ plain form
-280 129 179 190 155 192 20 27 88 83 81 75 48 127
$$ packed form
-280A29N0J1l5L7j72PO1nkok7P9
-392A27
##PAGE=	F1=-1115.44
##FIRST=	4405.895418600002813,	4405.895418600002813,	0
##DATA TABLE=	(F2++(Y..Y)), PROFILE
$$ plain form
4406 95 165 63 23 93 126 169 203 76 49 58 44 130 81 101 68 166 84 121 102 108 116 124 233 19 47 72 88 26 273 108 136 184 164 92
4087 92 25 171 147 91 66 119 93 77 58 160 128 79 243 29 141 146 181 217 89 115 40 68 52 216 133 170 134 161 94 84 87 150 107
3777 107 125 72 38 107 102 48 83 54 96 134 80 28 113 120 283 157 32 46 88 33 143 70 181 230 9 60 96 38 116 140 55 80 154
3467 154 156 88 76 101 60 123 145 236 238 31 65 86 170 98 90 110 112 125 32 95 90 164 293 81 152 169 188 240 83 696 721 1131 329 134
3148 134 311 1392 1062 246 265 59 61 109 250 143 112 325 644 530 305 256 155 236 148 157 766 612 307 322 594 180 114
2894 114 44 58 182 158 54 55 61 105 166 235 215 409 550 822 238 39 73 154 140 86 39 77 65 94 35 37 117 192 44 158 28
2603 28 50 125 81 149 116 32 52 60 79 100 76 177 45 56 32 96 39 82 71 25 133 55 110 91 114 133 165 91 86 129 52 73 179 179 100
2274 100 190 141 241 211 73 97 37 222 27 237 119 124 202 278 25 186 67 191 243 496 59 571 586 258 160 69 238 86
$$ packed form
4406I5P0j02m0P0L3M3L4j27k7Rj4Q6m9K0l3R8q2L7j9OQQJ09k14K8K5J6o2K47j65K8M8k0p2
4087I2o7J46k4n6k5N3k6j6j9J02l2m9J64k14J12NL5L6j28K6p5K8j6J64q3L7l6K7o7j0LO3m3
3777A07J8n3l4O9nn4L5k9M2L8n4n2Q5PJ63j26j25J4M2n5J10p3J11M9k21N1L6n8P8K4q5K5P4
3467A54Ko8j2K5m1O3K2R1Kk07L4K1Q4p2qK0KJ3r3O3nP4J29k12P1J7J9N2j57O13K5M10q02j95
3148A34J77J081l30q16J9k06KM8J41j07l1K13L19j14k25m9j01Q1q8RO09j54l05J5K72m14o6
2894A14p0J4J24k4j04JOM4O1O9k0J94J41K72n84j99L4Q1j4n4m7L8j2K9n9KQ0P5j48J14j30
2603B8K2P5m4O8l3q4K0QJ9K1k4J01j32J1k4O4n7M3j1m6J08p8N5j9K3J9L2p4nM3p7K1J06%p9
2274A00R0m9J00l0j38K4o0J85j95K10j18NP8P6k53J61j19J24N2K53m37N12J5l28r8r1J69j52
$$ plain form
2011 86 137 50 195 68 163 190 245 112 54 150 100 139 147 145 155 298 338 58 196 178 59 197 279 203 188 191 126 319 511 164 326
1720 326 212 260 406 453 218 159 276 947 517 318 334 1337 1903 1601 1222 1716 1959 2710 4091 48580 42061 686
1514 686 1318 1532 1345 1225 1110 717 526 575 175 587 435 389 443 216 252 319 272 214 295 431 250 293 85 377 228 147 116
1260 116 305 107 143 130 236 163 189 150 128 244 81 61 316 107 224 174 164 29 200 112 224 52 64 49 70 68 195 107 96
988 96 192 95 87 115 107 171 108 68 113 138 168 200 140 101 123 134 151 152 39 91 122 132 43 101 39 291 208 25 219 291 181 70 199 169
669 169 154 72 64 145 52 198 141 15 123 32 267 380 644 266 44 210 247 87 52 124 19 153 133 151 33 158 136 299
406 299 90 27 93 209 134 119 105 115 194 51 112 10 120 170 139 136 159 130 52 65 159 88 72 163 133 81 173 161 266 136 167 128
105 128 92 118 75 79 123 258 152 130 28 273 195 39 41 61 34 107 70 218 119 164 127 192 60 116 50 183 105 204 96 104 98 96 53
$$ packed form
2011H6N1q7J45j27R5K7N5j33n8R6n0L9QkJ0J43M0k80J38j8j19J38Q2p6j5Lo5J93J92l47J62
1720C26j14M8J46M7k35n9J17O71m30j99J6J003N66l02l79M94K43P51J381M4489o519m1375
1514F86O32K14j87j20j15l93j91M9m00M12j52m6N4k27L6O7m7n8Q1J36j81M3k08K92j49q1l1
1260A16J89j98L6j3J06p3K6l9k2J16j63k0K55k09J17n0j0j35J71q8J12j72J2j5K1kJ27q8j1
988I6R6r7qK8qO4o3m0M5K5L0L2o0l9K2J1J7Jj13N2L1J0q9N8o2K52q3j83J94P2j10j11J29l0
669A69j5q2qQ1r3J46n7j26J08r1K35J13K64l78k22J66L7j60l5P2j05J34k0J8j18J25k2J63
406B99k09o3O6J16p5j5j4J0P9j43O1j02J10N0l1lK3k9p8J3R4p1j6R1l0n2R2j2J05j30L1l9
105A28l6K6m3MM4J35j06k2j02K45p8j56KK0k7P3l7J48r9M5l7O5j32N6o6J33p8R9j08Qokm3
$$ plain form
-205 53 68 119 208 75 82 45 7 122 217 168 154 193 6 24 51 69 92 80 60 146
$$ packed form
-205E3J5N1Q9j33Pl7l8J15R5m9j4L9j87J8K7J8K3j2k0Q6
-392A46
##PAGE=	F1=-1134.22
##FIRST=	4405.895418600002813,	4405.895418600002813,	0
##DATA TABLE=	(F2++(Y..Y)), PROFILE
$$ plain form
4406 74 140 66 47 54 156 164 154 46 30 44 46 135 64 77 32 139 81 103 90 112 102 100 191 38 84 122 123 48 257 94 130 177 204 93
4087 93 7 162 157 74 39 115 94 91 72 153 116 57 237 10 165 122 154 206 103 112 86 61 37 226 112 185 164 193 112 119 104 165 82 123
3767 123 63 17 112 109 77 87 36 70 105 73 40 120 107 277 176 47 20 113 52 157 48 151 269 33 54 49 19 78 79 77 88 183 174
3458 174 94 99 95 49 121 115 168 191 23 37 81 195 49 68 86 155 158 24 85 95 171 277 88 112 150 154 263 56 565 485 910 217
3157 217 156 372 1612 1285 196 286 46 32 112 222 171 73 189 479 349 315 215 135 238 129 242 690 635 301 231 519
2913 519 222 113 54 57 176 169 77 48 31 81 133 243 209 408 426 844 301 88 41 154 127 109 63 65 50 45 56 60 133 170 65 132
2612 132 51 51 94 87 158 77 41 77 33 62 93 47 141 48 81 30 76 31 87 88 52 83 50 54 102 80 109 138 94 93 139 13 63 148 151 88 170
2265 170 144 200 190 78 110 56 206 32 235 114 165 185 261 71 167 94 168 88 559 455 2194 1130 165 157 62 174 109 134
$$ packed form
4406G4O6p4j9PJ02Qj0j08j6J4KQ9p1J3m5J07n8K2j3K2j0kR1j53M6L8Jp5K09j63L6M7K7j11
4087I3q6J55nq3l5P6k1lj9Q1l7n9J80k27J55m3L2N2j03Rk6k5k4J89j14P3k1K9q1Pj5O1q3M1
3767A23o0m6R5ll2J0n1L4L5l2l3Q0j3J70j01j29k7R3o1J05j09J03J18k36K1nl0N9JkJ1R5r
3458A74q0Nmm6P2oN3K3j68J4M4J14j46J9J8O9Lj34O1J0P6J06j89K4L8MJ09k07N09q0M25o93
3157B17o1K16J240l27j089R0k40j4Q0J10n1r8J16K90j30l4j00q0J03j09J13M48n5l34p0K88
2913E19k97j09n9LJ19pr2k9j7N0N2J10l4J99J8M18n43k13m7J13k7j8m6Kj5nJ1MP3L7j05O7
2612A32q1%M3pP1q1l6L6m4K9L1m6R4r3L3n1M6m5N6Jl6L1l3MM8k2K9K9m4jM6j26N0Q5Lo3Q2
2265A70k6N6j0j12L2n4J50j74K03j21N1K0P6j90R6p3P4q0M71j04J739j064r65qr5J12o5K5
$$ plain form
2002 134 64 139 90 143 174 190 214 49 84 118 131 134 84 85 273 284 19 137 132 20 140 209 144 144 113 145 160 95 88 253 108 163 313
1692 313 282 163 96 180 748 335 231 321 2253 4040 1829 983 1283 1286 1683 2466 31185 27107 1079 669 1276 1108 769
1476 769 759 516 261 421 57 434 274 254 305 86 189 215 164 149 178 345 215 232 42 323 183 74 56 235 86 70 88
1223 88 158 139 119 112 70 238 89 25 296 115 202 143 127 53 151 68 167 65 57 26 47 46 147 87 33 171 103 52 88 107 145 107 34
913 34 94 135 113 203 99 60 119 122 107 116 24 81 131 112 33 63 51 290 249 52 181 276 217 49 184 158 154 38 27 107 67 177 142
603 142 37 128 75 160 264 428 167 64 212 249 89 54 112 63 161 145 154 56 183 134 262 80 18 85 233 132 83 96 108 155
321 155 51 114 52 114 134 159 132 195 118 49 72 116 92 72 112 93 72 163 181 249 118 153 132 90 100 84 61 138 233 139 115 16 235 156
2 156 51 65 64 26 70 85 253 157 197 136 147 34 97 77 171 101 187 101 83 119 82 106 91 112 196 59 60 70 16 119 223 159 127 148
$$ packed form
2002A34p0P5m9N3L1J6K4j65L5L4J3Ln0JJ88J1k65J18nj12J20O9o5%l1L2J5o5pJ65j45N5J50
1692C13l1j19o7Q4N68m13j04R0J932J787k211q46L00LL97P83K8719m078k6028m10O07j68l39
1476G69j0k43k55J60l64L77j60k0N1k19J03K6n1j5K9J67j30J7j90K81j40j09j8J79j49j6J8
1223H8P0j9k0pm2J68j49o4K71j81Q7n9j6p4R8q3R9j02ql1K1jJ01o0n4J38o8n1L6J9L8l8p3
913C4O0M1k2R0j04l9N9Lj5Rr2N7N0j9p9L0j2K39m1j97J29R5n9j68J35k6mj16j1Q0m0J10l5
603A42j05R1n3Q5J04J64k61j03J48L7j60l5N8m9R8j6Rr8J27m9J28j82o2O7J48j01m9J3J2M7
321A55j04O3o2O2K0K5k7O3p7o9K3M4k4k0M0j9k1R1J8O8j31L5k1m2J0j6k3P7R5r4k4r9K19p9
2A56j05J4jl8M4J5J68r6M0o1J1j13O3k0R4p0Q6q6j8L6l7K4j5K1Q4j37JJ0n4J03J04o4l2K1
$$ plain form
-317 148 20 40 47 109 100 44 41 111
$$ packed form
-317A48j28K0PO2rn6lP0
-392A11
##PAGE=	F1=-1153
##FIRST=	4405.895418600002813,	4405.895418600002813,	0
##DATA TABLE=	(F2++(Y..Y)), PROFILE
$$ plain form
4406 89 75 81 77 29 142 167 63 39 89 39 85 141 19 26 29 102 57 104 83 118 59 69 120 29 124 171 154 60 210 95 117 125 246 90
4087 90 32 145 156 37 2 80 108 100 99 130 108 116 212 6 204 95 109 188 117 93 117 87 68 213 98 183 196 216 110 156 112 178 42
3777 42 104 60 75 105 126 129 116 24 49 82 54 72 119 104 244 181 87 64 133 86 148 19 109 273 89 77 27 3 28 2 81 132 223 172
3458 172 83 111 77 58 106 110 86 149 72 37 98 194 78 30 53 165 172 54 74 85 208 220 84 51 100 104 256 42 446 367 748 170
3157 170 174 422 1808 1459 209 290 29 29 120 154 191 17 73 314 217 298 203 127 205 111 318 575 625 312 143 432 256 97
2894 97 79 43 177 153 107 45 57 87 109 206 186 346 228 820 370 148 32 156 88 130 117 39 66 59 102 102 154 118 104 70 97 74
2594 74 43 74 161 20 71 119 40 45 111 76 78 72 127 65 46 106 87 76 127 18 78 71 115 55 65 122 94 49 161 54 88 91 110 120 119 139
2256 139 146 165 61 162 106 180 52 178 74 224 198 180 158 95 100 73 74 418 469 2479 1164 303 212 80 71 193 153 95 58 152
$$ packed form
4406H9j4Omm8J13K5j04k4N0n0M6N6j22PLP3m5M7k1L5n9J0N1r1R5M7j7r4J50j15K2QJ21j56
4087I0n8J13J1j19l5P8K8qjL1k2QR6k06J98j09J4P9p1k4K4l0j9J45j15Q5J3K0j06M6m4O6j36
3777D2O2m4J5L0K1Lj3r2K5L3k8J8M7j5J40o3r4k3O9m7O2j29R0J64j84j2n0k4K5k6P9N1R1n1
3458A72q9K8l4j9M8Mk4O3p7l5O1R6j16m8K3J12Pj18K0J1J23J2j36l3M9MJ52k14M04p9L81n78
3157A70MK48J386l49j250Q1k61%R1L4L7j74N6K41r7Q1r5p6P8r4K07K57N0l13j69K89j76j59
2894I7j8l6J34k4m6o2J2L0K2R7k0J60j18N92m50k22j16J24o8M2j3p8K7pM3%N2l6j4l4K7k3
2594G4l1L1Q7j41N1M8p9NO6l5KoN5o2j9O0j9j1N1j09O0pM4o0J0N7k8m5J12j07L4LJ9J0jK0
2256A39PJ9j04J01n6P4j28J26j04J50k6j8k2o3Nk7JL44N1K010j315q61r1j32rJ22m0n8l7R4
$$ plain form
1974 152 120 113 241 274 20 44 207 144 152 132 107 206 247 127 28 132 173 107 76 54 156 92 118 26 344 133 69 269 244 85 73
1683 73 225 173 298 291 156 512 741 3302 6558 1647 120 411 512 1079 1844 13342 11315 1681 2288 1592 530 389
1476 389 160 70 313 187 263 37 131 140 32 261 35 56 86 63 126 180 192 176 129 165 184 121 151 61 103 80 80 39 54 69 72 56 157
1166 157 187 75 197 215 164 137 70 135 141 40 59 42 133 54 42 129 58 112 79 93 160 52 82 78 69 57 103 97 170 86 169 57 43 61
847 61 81 88 70 26 106 104 100 91 55 96 247 273 102 99 236 283 32 153 141 168 44 67 101 42 140 115 72 113 143 43 269 239 133 91
528 91 177 212 70 101 71 128 137 174 144 102 168 173 175 91 66 94 224 124 71 61 105 87 57 96 111 102 70 171 114 235 109 65 47 59 114
199 114 86 48 56 50 125 200 186 108 104 132 99 63 99 19 182 173 131 103 5 176 113 76 101 61 60 43 90 258 200 238 100 91 23 77 124 152
-139 152 71 126 117 37 159 111 156 85 125 147 32 86 105 31 119 189 188 79 68 41 93 55 156 84 41 34 22
$$ packed form
1974A52l2pJ28L3k54K4J63o3Qk0k5R9M1j20r9J04M1o6l1k2J02o4K6r2L18k11o4K00k5j59j2
1683G3J52n2J25pj35L56K29K561L256m911j527K91J01N67P65J1498k027r634O07o96j062j41
1476C89k29r0K43j26P6k26R4Rj08K29k26K1L0k3O3N4J2j6m7L6J9o3L0r0M2k3%m1J5J5Lj6J01
1166A57L0j12J22J8n1k7o7O5Oj01J9j7R1p9j2Q7p1N4l3J4O7j08L0mrj2M6oP3q4Q3j12j4J8
847F1K0Pj8m4Q0kmrl6M1J51K6j71lJ37M7k51J21j2K7j24K3L4n9R8k5m3M1L0j00K26l0j06m2
528I1Q6L5j42L1l0N7RL7l0m2O6NKq4k5K8J30j00n3j0M4j8l0L9J5rl2J01n7J21j26m4j8J2N5
199A14k8l8QoP5P5j4p8mK8l3l6L6q0J63rm2k8r8J71o3l7K5m0jj7M7J68n8L8j38ro8N4M7K8
-139A52q1N5rq0J22m8M5p1M0K2j15N4J9p4Q8P0jj09j1k7N2l8J01p2m3pj2
-392B2
##PAGE=	F1=-1171.78
##FIRST=	4405.895418600002813,	4405.895418600002813,	0
##DATA TABLE=	(F2++(Y..Y)), PROFILE
$$ plain form
4406 174 8 98 99 96 114 200 74 130 144 38 135 153 61 92 100 102 29 123 71 122 28 114 37 35 158 207 171 58 151 114 121 43 277 83
4087 83 56 135 161 79 47 36 121 102 137 98 127 200 184 6 238 101 90 167 137 81 139 127 122 179 105 182 228 226 95 197 111 182 17
3777 17 103 77 139 106 146 178 160 37 41 118 51 111 121 118 193 183 140 112 147 111 120 16 79 246 144 119 93 10 26 86 72 203 269 158
3458 158 72 108 53 106 88 129 14 148 124 71 131 171 145 64 50 146 165 82 82 59 257 138 98 36 39 46 223 76 385 396 752 182
3157 182 181 445 1917 1532 284 286 12 71 128 100 204 128 210 200 305 249 229 123 154 126 369 492 559 320 117 344 277 90
2894 90 114 36 184 112 137 85 108 109 117 131 146 249 13 790 416 205 75 149 61 154 177 48 94 151 154 152 179 59 149 31 156 102
2594 102 11 56 182 43 112 176 102 113 143 128 40 113 183 144 73 185 116 48 204 82 130 157 174 113 6 180 126 51 205 136 137
2303 137 57 97 177 91 151 144 217 73 241 180 180 138 90 87 298 280 70 270 12 144 79 196 105 77 1304 586 318 240 116 67
$$ packed form
4406A74j66R0JlJ8Q6j26N6J4j06R7J8r2L1QKp3R4n2N1r4Q6p7kJ23M9l6j13R3l7Pp8K34j94
4087H3k7P9K6q2l2j1Q5j9L5l9K9P3j6j78K32j37j1P7l0n6N8j2nN7p4P7M6kj31J02q6P1j65
3777A7Q6k6O2l3M0L2j8j23MP7o7O0J0lP5j0m3k8L5l6Rj04O3J67j02k5k6q3J6O0j4J31O6j11
3458A58q6L6n5N3j8M1j15J34k4n3O0M0k6q1j4R6J9q3%k3J98j19m0o2LPJ77j47L09J1L56n70
3157A82jK64J472l85j248Kk74N9N7k8J04p6Q2j0J05n6k0j06L1k8K43J23O7k39k03K27o7j87
2894I0K4p8J48p2K5n2K3JQJ4J5J03k36P77l74k11j30P4q8R3K3j29M6N7LkK7j20R0j18J25n4
2594A02r1M5J26j39O9O4p4J1L0j5q8P3P0l9p1J12o9o8J56j22M8K7J7o1j07J74n4p5J54o9J
2303A37q0M0Q0q6O0pP3j44J68o1%m2m8lK11j8k10K00k58J32o5J17r1k8J227p18k68p8j24m9
$$ plain form
2021 67 284 199 146 85 226 160 132 349 268 128 188 321 208 251 279 283 199 322 263 157 293 358 264 205 207 329 292 173 267 642
1739 642 281 242 556 519 206 422 513 530 701 309 695 1017 1321 4289 8949 1256 1109 1688 2757 3955 6403 70134
1533 70134 60651 2172 3395 2587 1538 1744 1349 825 938 560 683 484 596 612 459 607 308 359 398 330 423 260 366
1317 366 331 306 58 343 336 362 169 232 258 219 244 67 239 206 183 93 333 204 82 353 197 257 136 222 252 144 115 66 247
1044 247 167 93 233 110 218 201 17 252 137 130 99 44 27 217 161 242 163 123 97 117 31 60 169 79 74 162 59 143 188 119 166
753 166 180 286 160 5 198 352 79 125 164 200 84 166 150 25 119 93 124 79 212 166 260 258 104 115 117 151 61 174 14 193
471 193 93 210 125 159 120 246 64 108 120 120 186 130 132 6 124 23 54 62 163 116 27 176 102 269 111 100 13 73 152 119 63
180 63 55 39 69 220 98 132 62 133 113 16 123 44 237 96 131 115 12 107 89 116 142 82 100 66 85 231 236 274 44 58 64 57 156 151
$$ packed form
2021F7K17q5n3o1J41o6k8K17q1j40O0J33j13M3K8Mq4J23n9j06J36O5r4n9KJ22l7j19R4L75
1739F42l61l9L14l7l13K16R1J7J71l92L86L22L04K968M660p693j47N79J069J198K448O3731
1533G0134r483n8479J223q08j049K06l95n24J13l78J23j99J12J6j53J48k99N1L9o8R3j63J06
1317C66l5k5k48K85pK6j93O3K6l9K5j77J72l3k3r0K40j29j22K71j56O0j21Q6L0j08k9m9J81
1044B47q0p4J40j23J08j7j84K35j15pl1n5j7J90n6Q1p9m0k6K0q6K9J09r0nQ8j03Q4M5o9M7
753A66J4J06j26j55J93J54k73M6L9L6j16Q2j6j25R4k6L1m5J33m6R4kj54J1KL4r0J13j60J79
471A93j00J17q5L4l9J26j82M4J2%O6n6Kj26J18j01L1QJ01m7q9J49p4J67j58j1q7O0P9l3n6
180F3qj6L0J51j22L4p0P1k0r7J07p9J93j41L5j6j03R5j8K7K6o0J8l4J9J46NL8k30J4OpR9n
$$ plain form
-139 151 36 55 143 57 201 142 200 47 176 97 84 147 131 38 116 125 245 97 80 77 147 72 179 85 147 97 96
$$ packed form
-139A51j15J9Q8q6J44n9N8j53J29p9j3O3j6r3P8RJ20j48j7lP0p5J07r4O2n0j
-392I6
##PAGE=	F1=-1190.56
##FIRST=	4405.895418600002813,	4405.895418600002813,	0
##DATA TABLE=	(F2++(Y..Y)), PROFILE
$$ plain form
4406 238 66 98 103 157 117 237 156 196 158 36 182 165 119 164 150 123 37 136 53 113 63 185 33 69 171 223 167 57 104 132 133 35
4105 35 282 75 74 133 178 141 77 64 117 97 170 70 151 258 175 14 254 139 125 163 155 82 145 154 168 138 115 191 249 217 68 232
3805 232 101 172 71 129 94 184 122 155 215 195 64 42 165 73 134 129 141 148 189 182 132 159 112 86 35 68 208 178 155 138 13 67 157
3495 157 67 268 302 141 81 92 40 161 87 152 58 175 154 108 168 143 184 123 68 113 141 94 104 32 287 72 121 94 52 25 180
3204 180 95 358 457 830 197 175 450 1884 1464 356 280 18 106 127 137 198 228 346 157 422 178 255 115 117 149 385 548
2950 548 445 339 188 248 272 96 143 46 184 66 148 127 137 119 137 48 86 160 159 811 436 232 104 117 87 172 216 72 106 228
2669 228 182 185 192 56 177 98 195 113 42 48 213 81 145 214 150 185 167 161 80 146 222 211 118 233 160 44 253 141 170 218 244 175 57
2359 57 260 163 128 238 199 169 83 128 215 131 160 183 310 117 298 245 197 218 53 146 349 365 93 361 110 212 231 319 272 928
$$ packed form
4406B38j72L2NN4m0J20q1M0l8j22J46j7m6M5j4k7q6R9q3O0n0J22j52L6J02N2n6j10M7K8Jr8
4105C5K47k07jN9M5l7o4j3N3k0P3j00Q1J07q3j61K40j15j4L8qp3O3RJ4l0k3P6N8l2j49J64
3805B32j31P1j01N8l5R0o2L3O0k0j31k2J23r2O1nJ2PM1pn0K7m7k6n1L3J40l0k3j7j25N4R0
3495A57r0K01L4j61o0J1n2J21p4O5r4J17k1m6O0k5M1o1n5M5K8m7J0p2K55k15M9k7m2k7J55
3204A80q5K63R9L73o33k2K75J434m20j108p6k62Q8K1J0O1L0J18j89K65k44P7j40KL2K36J63
2950E48j03j06j51O0K4j76M7r7J38j18Q2k1J0j8J8q9L8P4jO52l75k04j28J3l0Q5M4j44L4J22
2669B28m6LPj36J21p9R7q2p1OJ65j32O4O9o4L5j8oq1O6P6j1r3J15p3j16K09j12K9M8K6o9j18
2359E7K03r7l5J10l9l0q6M5Q7q4K9K3J27j93J81n3m8K1j65R3K03J6k72K68k51J02J9Q8m7O56
$$ plain form
2077 928 1680 551 150 194 131 139 316 228 160 149 266 213 210 394 203 209 285 381 248 342 378 413 252 412 346 273 429 486 389 354
1795 354 327 459 440 276 480 730 534 433 731 706 417 691 728 794 992 739 1094 1355 1712 4961 10577 1052 2003 2712
1570 2712 4325 5942 9453 110628 96160 2119 2878 3476 2669 2701 2214 1404 1319 911 991 880 933 961 760 830 521 594
1364 594 630 530 642 435 537 493 421 209 479 492 506 351 322 382 323 422 143 372 321 258 172 438 300 116 444 251 378
1110 378 210 278 361 216 226 101 322 259 141 302 209 310 278 110 317 201 170 153 126 86 303 211 299 235 105 148 171 110 92
838 92 239 115 110 204 44 192 268 159 222 120 288 196 95 177 385 121 115 218 234 101 253 177 62 121 109 167 48 250 280
565 280 184 338 39 114 61 102 77 229 45 226 55 231 108 203 80 308 69 107 157 132 134 145 179 60 141 64 36 36 197 141
284 141 85 169 100 282 109 136 59 120 178 138 107 92 61 44 223 20 154 101 130 117 38 144 91 271 47 125 138 21 54 83 141
$$ packed form
2077I28P52j129m01M4o3QJ77q8o8j1J17n3lJ84j91OP6R6j33R4L6L5j61J60o6p3J56N7r7l5
1795C54k7J32j9j64K04K50j96j01K98k5k89K74L7O6J98k53L55K61L57L249N616r525R51P09
1570B712J613J617L511J01175j4468r4041P59N98q07L2m87q10q5m08Q0j11N3K8k01P0l09P3
1364E94L6j00J12k07J02m4p2k12K70J3J4j55k9O0n9R9k79K29n1o3q6K66j38j84L28j93J27
1110C78j68O8Q3j45J0j25K21o3j18J61r3J01l2j68K07j16l1j7k7m0K17r2Q8o4j30M3K3o1j8
838I2J47j24nR4j60J48P6j09O3j02J68r2j01Q2K08k64oJ03J6j33J52p6j15N9j2N8j19K02L0
565B80r6J54k99P5n3M1k5J52j84J81j71J76j23R5j23K28k39L8N0k5KJ1L4j19Q1p7k8%J61n6
284A41n6Q4o9J82j73K7p7O1N8m0l1j5l1j7J79k03J34n3K9j3p9J06n3J80k24P8J3j17L3K9N8
$$ plain form
-7 141 166 111 120 98 77 184 246 283 60 68 84 38 167 164 47 79 155 112 225 160 237 4 225 89 139 183 131 41 101 57 285 146
-308 146 158 98 175 102 164 117 235 131 189
$$ packed form
-7A41K5n5Rk2k1J07O2L7k23QJ6m6J29lj17L2P6m3J13o5P7k33K21j36N0M4n2r0O0m4K28j39
-308A46J2o0P7p3O2m7J18j04N8
-392A89
##PAGE=	F1=-1209.34
##FIRST=	4405.895418600002813,	4405.895418600002813,	0
##DATA TABLE=	(F2++(Y..Y)), PROFILE
$$ plain form
4406 211 60 60 85 175 113 217 152 176 98 48 213 163 128 171 142 92 47 129 44 81 60 209 53 82 152 213 135 66 58 117 110 69 243
4096 243 71 85 116 172 155 94 91 87 94 181 57 136 253 175 50 245 167 154 182 143 53 123 150 189 108 98 191 233 178 35 239 81
3796 81 140 105 146 79 178 144 137 231 201 73 19 164 79 120 135 156 124 184 181 99 160 81 68 26 44 176 165 157 134 17 86 188 73 290
3476 290 301 132 85 60 50 187 108 148 80 183 140 134 186 128 167 145 52 93 102 82 116 42 265 56 113 121 92 44 153 59 301 532
3176 532 830 199 163 466 1698 1241 367 270 2 119 112 189 151 288 410 190 443 115 242 105 100 129 360 696 304 368
2932 368 285 122 233 85 142 62 156 35 123 130 112 85 118 50 7 113 249 864 463 200 82 44 106 159 203 49 73 247 158
2659 158 171 172 65 159 128 179 97 28 44 215 67 133 189 143 200 153 147 85 136 212 213 110 210 180 50 242 146 151 212 261 188 112 291
2349 291 148 160 212 211 137 72 132 188 143 106 165 343 130 278 251 165 228 50 140 319 363 150 364 145 222 300 364 518 1655
$$ packed form
4406B11j51%K5R0o2J04o5K4p8n0J65n0l5M3k9n0m5Q2q5L7k1J49j56K9P0O1p8o9qN9pm1J74
4096B43j72J4L1N6j7o1lmPQ7j24P9J17p8j25J95p8j3K8l9r0P0K7L9q1j0R3M2n5j43K04j58
3796H1N9l5M1o7R9l4pR4l0j28n4J45q5M1J5K1l2O0lq2O1p9j3m2J8J32j1qk3j17O9J02j15K17
3476B90J1j69m7k5j0J37p9M0o8J03m3oN2n8L9k2r3M1Rk0L4p4K23k09N7Qk9m8J09r4K42K31
3176E32K98o31l6L03J232m57q74r7k68J17pP7l8J37J22k20K53l28J27j37nK9K31L36l92O4
2932C68q3j63J11j48N7q0R4j21Q8Pj8k7L3o8m3J06J36O15m01k63j18l8O2N3M4j54K4J74q9
2659A58J3Jj07R4l1N1q2o9J6J71j48O6N6m6N7m7oo2N1P6Jj03J00l0j30J92r6NO1M9p3p6J79
2349B91j43J2N2jp4o5O0N6m5l7N9J78k13J48k7q6O3j78R0J79M4k13K14k19P7P8O4J54J137
$$ plain form
2077 1655 3827 1460 196 51 70 135 226 175 74 136 210 186 208 294 92 182 259 308 176 330 332 391 209 373 280 250 409 448
1814 448 335 317 259 392 401 230 497 536 613 356 611 608 365 661 639 713 869 692 990 1188 1585 5083 10851 1174 1736 2074
1570 2074 3735 5022 7876 98242 86231 1283 667 3655 2642 2394 2020 1289 1075 826 907 836 828 875 671 708 471
1373 471 558 595 473 579 376 490 462 347 180 437 451 447 360 252 344 281 447 90 348 294 190 208 411 281 112 398 205
1119 205 386 173 247 365 182 223 47 283 266 137 281 225 308 240 123 290 182 138 149 133 71 296 176 284 237 106 130
866 130 145 116 77 226 96 96 188 19 176 274 120 223 105 254 181 119 133 334 103 132 245 234 63 280 122 50 112 118 163
594 163 87 227 305 200 324 55 81 33 97 66 221 51 195 56 214 100 200 89 310 129 67 150 105 93 135 152 80 112
331 112 78 51 36 198 126 99 127 79 255 78 146 79 112 158 108 95 128 74 68 182 15 123 134 108 97 69 141 94 242 44 89 141
$$ packed form
2077A655K172k367j264j45J9O5R1n1j01O2P4k4K2Q6k02R0P7M9j32J54KN9j82J64r3l0J59L9
1814D48j13j8n8J33Rj71K67L9P7k57K55lk43K96k2P4J56j77K98J98L97L498N768r677N62L38
1570B074J661J287K854R0366j2011q4948o16K988j013k48l74p31k14k49Q1p1qM7k04L7k37
1373D71Q7L7j22J06k03J14k8j15j67K57J4mq7j08R2o3J66l57K58n4j04J8K03j30j69K86j93
1119B05J81k13P4J18j83M1j76K36j7j29J44n6Q3o8j17J67j08m4J1j6o2K25j20J08m7j31K4
866A30J5k9l9J49j30%R2j69J57R8j54J03j18J49p3o2J4K01k31K9J13j1j71K17j58p2O2OM5
594A63p6J40P8j05J24k69K6m8O4l1J55j70J44j39J58j14J00j11K21j81o2Q3m5j2M2J7p2L2
331A12l4k7j5J62p2k7K8m8J76j77O8o7L3M6n0j3L3n4oJ14j67J08J1k6j1k8P2m7J48j98M5N2
$$ plain form
30 141 13 56 57 115 140 100 115 101 69 141 207 230 69 49 52 19 161 156 39 103 134 119 211 159 258 39 221 64 131 153 85 48 66 30
-289 30 256 124 160 65 151 130 109 111 248 73 197
$$ packed form
30A41j28M3JN8K5m0J5j4l2P2O6K3j61k0Ll3J42nj17O4L1j5R2n2R9k19J82j57O7K2o8l7J8l6
-289C0K26j32L6r5Q6k1k1KJ37j75J24
-392A97
##PAGE=	F1=-1228.12
##FIRST=	4405.895418600002813,	4405.895418600002813,	0
##DATA TABLE=	(F2++(Y..Y)), PROFILE
$$ plain form
4406 56 72 57 86 139 67 149 8 17 61 120 211 139 72 100 108 53 97 124 67 33 44 171 79 126 135 179 76 85 67 57 92 54 151 76 95 70
4068 70 106 110 172 57 64 105 161 83 43 173 166 128 219 159 144 214 95 45 100 113 172 97 28 166 173 129 105 196 51 82 104 162 61 97
3749 97 174 79 215 177 60 72 80 76 53 140 152 123 155 119 36 153 82 78 37 42 152 112 97 63 67 90 156 110 246 276 155 47 31 94
3429 94 153 169 97 115 157 71 139 169 145 117 101 44 116 71 63 123 94 169 27 58 93 100 30 168 55 176 667 706 205 160 516 1387
3129 1387 898 289 274 72 119 98 193 42 314 380 293 354 104 167 145 63 57 300 786 235 367 390 51 212 93 111 129 82
2866 82 49 92 82 28 25 29 71 135 131 253 847 560 97 25 115 100 87 125 57 69 174 96 83 129 40 92 128 75 143 96 115 147 58 73
2547 73 68 50 117 99 61 71 63 152 128 19 93 181 91 146 147 43 147 179 167 202 223 58 135 104 198 31 60 98 89 65 79 37 249 165
2227 165 152 168 57 110 64 20 163 207 175 228 139 130 218 249 499 1884 5087 2025 604 210 125 178 59 40 159 150 9 127
$$ packed form
4406E6J6j5K9N3p2Q2j41RM4N9R1p2o7K8Qn5M4K7n7l4J1J27r2M7RM4j03Rj8j0L5l8R7p5J9k5
4068G0L6MO2j15PM1N6p8m0J30pl8R1o0j5P0j19n0N5J3N9p5o9J38Pm4k4R1j45L1K2N8j01L6
3749I7P7r5J36l8j17J2Qmk3Q7J2k9L2l6q3J17p1mm1NJ10m0j5l4MK3O6m6J36L0j21j08j6O3
3429I4N9J6p2J8M2q6O8L0k4k8j6n7P2m5qO0k9P5j42L1L5Pp0J38j13J21M91L9n01m5L56Q71
3129A387m89o09j5k02M7k1R5j51K72O6q7O1k50O3k2q2oK43M86n51J32K3l39J61j19J8J8m7
2866H2l3M3j0n4lMM2O4mJ22N94k87m63p2R0j5j3L8o8J2J05p8j3M6q9N2L6n3O8m7J9L2q9J5
2547G3nj8O7j8l8J0qQ9k4j09P4Q8r0N5Jj04J04L2j2L5K1j65P7l1R4j67K9L8rk4J4m2K12q4
2227A65j3J6j11N3m6m4J43M4l2N3q9rQ8L1K50J385L203l062j421l94q5N3j19j9J19rj41J18
$$ plain form
1964 127 195 41 140 148 96 61 133 221 87 127 125 145 72 75 160 156 104 59 118 127 72 111 255 100 297 168 91 135 112 187 61 157 78 147
1645 147 104 246 746 4632 9450 2252 566 1234 829 488 2634 6037 6403 1168 4398 3233 742 335 256 106 136
1448 136 37 228 70 18 125 42 73 53 85 164 91 109 88 91 113 149 165 235 96 94 88 95 58 32 236 249 113 75 101 203 175 109 151
1138 151 139 122 199 67 127 203 63 32 174 70 150 168 154 131 184 35 106 131 56 65 41 95 95 148 70 155 159 159 54 22 20 84 114 84
819 84 62 77 98 59 154 42 169 178 166 138 61 117 174 47 217 222 166 118 205 49 63 140 79 82 198 149 227 351 206 85 127 24
518 24 115 29 118 72 77 130 145 125 132 151 212 149 99 79 60 91 86 19 49 42 16 147 65 164 31 65 98 69 179 31 106 55 41 72 55 53
180 53 156 52 65 71 50 28 100 107 46 72 101 43 121 77 104 100 26 67 51 46 52 33 165 54 64 128 120 89 34 58 60 20 147 100 47 34 154
-167 154 81 153 134 259 40 127 61 27 31 20 75 35 64 128 62 39 82 97 143 81 59 140 135 103
$$ packed form
1964A27O8j54R9Qn2l5P2Q8j34M0kK0p3LQ5mn2m5N9Rn5L9J44j55J97j29p7M4k3P5j26R6p9O9
1645A47m3J42N00L886M818p198j686O68m05l41K146L403L66n235L230j165k491m07p9j50L0
1448A36r9J91j58n2J07q3L1k0L2P9p3J8k1LK2L6J6P0j39koPl7k6K04J3j36l8K6J02k8o6M2
1138A51j2j7P7j32O0P6j40l1J42j04Q0J8j4k3N3j49P1K5p5Rk4N4%N3p8Q5M%j05l2kO4L0l0
819H4k2J5K1l9R5j12J27Rj2k8p7N6N7j27J70Nn6m8Q7j56J4P7o1LJ16m9P8J24j45j21M2j03
518B4R1q6Q9m6NN3J5k0PJ9O1o3n0k0j9L1no7L0pk6J31q2R9j33L4L3k9J10j48P5n1j4L1j7k
180E3J03j04J3Ok1k2P2Po1K6K9n8P8m4K7mp4M1j6nOj9J32j11J0O4ql1n5K4Km0J27m7n3j3J20
-167A54p3P2j9J25k19Q7o6l4Mj1N5m0K9O4o6k3M3J5M6o2k2Q1nl2
-392A03
##PAGE=	F1=-1246.9
##FIRST=	4405.895418600002813,	4405.895418600002813,	0
##DATA TABLE=	(F2++(Y..Y)), PROFILE
$$ plain form
4406 309 302 219 178 157 241 341 301 304 321 251 168 137 184 234 293 306 239 188 104 116 229 232 252 304 227 150 19 155 252 172 282 162 38
4096 38 90 117 131 93 198 361 63 149 140 137 190 144 169 210 259 209 111 144 273 186 228 221 105 112 89 105 192 189 213 263 92 49 64 128 274
3767 274 206 71 250 46 163 175 132 230 118 167 83 164 134 169 171 145 203 190 204 116 141 176 183 187 55 86 158 132 50 216 155 329
3467 329 247 49 98 181 42 293 123 259 173 97 130 138 230 225 53 198 200 145 127 179 193 47 134 127 42 122 66 242 248 17 866 555
3166 555 270 193 599 1008 548 186 354 217 175 156 148 140 379 253 462 247 153 98 282 111 206 257 720 397 310 520 273
2913 273 358 244 180 276 73 152 204 154 202 220 151 82 307 248 207 672 758 164 196 329 171 69 154 259 269 17 218 96 202
2641 202 167 186 254 138 338 290 286 36 247 208 190 149 102 173 125 233 162 232 204 207 165 278 245 135 330 221 264 118 294 388
2359 388 81 219 246 226 349 269 278 248 255 165 391 260 81 384 205 192 277 184 333 301 194 127 354 129 341 257 179 73 211
$$ packed form
4406C09pq3m1k1Q4J00m0LJ7p0q3l1M7N0N9J3o7n1q4J2J13LK0N2p7p7j31J36R7q0J10j20j24
4096C8N2K7J4l8J05J63k98Q6rlN3m6K5M1M9n0r8L3J29q7M2pj16Pk3J6Q7lK4N0j71m3J5O4J46
3767B74o8j35J79k04J17J2m3R8j12M9q4Q1l0L5Kk6N8j3J4q8K5L5PMj32L1P2k6q2J66o1J74
3467C29q2j98M9Q3j39K51j70J36q6p6L3QR2nj72J45Kn5j8N2J4j46Q7pq5Q0n6J76Ok31Q49l11
3166E55k85p7M06M09m60l62J68j37m2j9qqK39j26K09k15r4n5J84j71R5N1M63l23q7K10k47
2913B73Q5j14o4R6k03P9N2n0M8J8o9o9K25n9m1M65Q6n94L2J33j58j02Q5J05J0k52K01j22J06
2641B02l5J9O8j16K00m8mk50K11l9j8m1m7P1m8J08p1P0k8Lm2J13l3j10J95j09M3j46J76R4
2359C88l07J38K7k0J23q0Rl0Pr0K26j31j79L03j79j3Q5r3J49l2j07o7K27k25K12q4p8j06J38
$$ plain form
2087 211 1532 5097 2105 1045 586 474 510 486 397 562 472 387 481 560 516 507 579 438 467 605 529 497 427 637 501 624 558
1833 558 490 514 725 732 844 798 651 818 761 904 648 1192 1058 1037 1094 928 1136 1336 1528 1874 1781 1652 1380 4203 6706 5063
1589 5063 5092 7685 8633 11222 18918 200145 170146 3547 9397 5484 4606 4602 3793 2721 2262 1600 1403 1575 1671 1545
1401 1545 1473 1230 1030 906 877 1035 991 1033 809 663 833 862 788 659 696 549 715 542 568 384 834 550 529 645 509 306
1157 306 409 601 384 554 248 480 379 238 446 383 586 349 284 444 309 297 324 371 403 247 289 338 248 361 410 204 367
903 367 179 252 364 296 323 289 360 272 319 245 157 339 248 117 343 253 357 143 280 222 357 200 271 401 240 78 361 78
640 78 349 294 320 132 92 373 235 226 523 223 133 321 156 207 213 166 270 168 297 123 229 116 309 57 261 302 74 173
378 173 178 162 237 195 225 134 295 158 171 162 220 287 225 124 141 23 129 213 176 236 226 204 18 78 130 213 245 87 244 63 69 107
$$ packed form
2087B11J321L565k992j060m59j12L6k4q9J65r0q5R4P9m4rP2j41K9J38p6l2p0K10j36J23o6
1833E58o8K4K11PJ12m6j47J67n7J43k56N44j34k1N7j66K08K00J92L46r3j29k72K823K503j643
1589E063K9K593R48K589P696J81227k9999j66599N850l913q78mq09j072m59o62j97J72R6j26
1401A545p2k43k00j24k9J58m4M2k24j46J70K9p4j29L7j47J66j73K6j84M50k84k1J16j36k03
1157C06J03J92k17J70l06K32j01j41K08o3K03k37o5J60j35j2K7M7L2j56M2M9r0J13M9k06J63
903C67j88P3J12o8K7l4P1q8M7p4q8J82r1j31K26r0J04k14J37n8J35j57P1J30j61j62K83k83
640G8K71n5K6j88m0K81j38rK97l00r0J88j65N1Om7J04j02J29j74J06j13J93k52K04M1k28R9
378A73Nj6P5m2L0r1J61j37J3rN8O7o2j01J7j18J06Q4l7O0j0k2j86O0N2Q3L2j58J57j81OL8
$$ plain form
77 107 165 154 246 287 50 101 77 209 223 205 190 344 49 89 173 175 161 232 253 241 85 138 82 226 161 341 218 143 92 241 98
-214 98 85 310 242 201 181 125 129 190 208 353 246 325 209 157 209 263 160 509 310
$$ packed form
77A07N8j1R2M1k37N1k4J32J4j8j5J54k95M0Q4Kj4P1K1j2j56N3n6J44o5J80j23p5n1J49j43
-214I8j3K25o8m1k0n6MO1J8J45j07P9j16n2N2N4j03L49j99
-392C10
##PAGE=	F1=-1265.68
##FIRST=	4405.895418600002813,	4405.895418600002813,	0
##DATA TABLE=	(F2++(Y..Y)), PROFILE
$$ plain form
4406 786 640 442 327 364 590 773 755 771 658 427 90 247 477 588 641 673 450 316 141 263 515 518 534 594 414 176
4162 176 108 299 526 435 594 396 196 115 168 324 336 480 633 255 289 194 201 365 420 428 386 437 261 93 272 390 445 486 455
3889 455 211 17 94 291 369 411 435 474 66 125 180 270 503 443 314 390 178 75 282 308 458 392 351 258 227 157 291 334 391
3617 391 448 324 378 184 292 366 345 424 265 291 279 238 132 397 229 540 402 204 208 309 151 479 333 493 320 290 145
3364 145 204 389 480 258 417 350 296 262 319 347 285 364 331 181 240 191 381 503 250 1088 669 435 283 703 617 495 366 540
3101 540 427 319 289 163 386 570 96 690 393 260 275 489 309 493 347 472 665 299 691 519 645 489 400 487 261
2866 261 326 418 383 480 495 405 206 512 437 198 342 1016 445 443 600 361 289 406 548 556 291 489 347 422 405 454 532 440 625
2594 625 562 530 280 525 502 540 438 415 411 380 510 435 521 550 523 492 524 492 429 658 576 601 424 601 668 318 561 564 596 690 642
$$ packed form
4406G86j46j98j15L7K26J83j8J6j13k31l37J57K30J11N3L2k23j34j75J22K52LJ6O0j80k38
4162A76o8J91K27r1J59j98k00q1N3J56J2J44J53l78L4r5PJ64N5Qm2N1j76j68J79J18N5M1l1
3889D55k44j94P7J97P8M2K4L9m08N9N5R0K33o0j29P6k12j03K07K6J50o6m1r3l1p0J34M3N7
3617C91N7j24N4j94J08P4k1P9j59K6j2m1j06K65j68L11j38j98MJ01j58L28j46J60j73l0j45
3364A45N9J85R1k22J59o7n4l4N7K8o2P9l3j50N9m9J90J22k53Q38m19k34j52M20q6j22j29J74
3101E40j13j08l0j26K23J84m74N94k97j33J5K14j80J84j46J25J93l66L92j72J26j56q9Q7k26
2866B61O5R2l5R7J5r0j99L06p5k39J44O74n71kJ57k39p2J17J42Qk65J98j42P5j7M9P8r2J85
2594F25o3l2k50K45k3L8j02k3ml1J30p5Q6K9k7l1L2l2o3K29q2K5j77J77O7l50K43LL2R4m8
$$ plain form
2303 642 607 571 624 495 831 671 449 761 598 531 679 615 746 748 647 616 726 575 749 698 639 582 557 1087 4522 1872 1489
2049 1489 1071 975 1030 1081 938 1110 986 951 1079 1190 1197 1069 1255 1080 1156 1293 1232 1269 1239 1432 1301 1459 1349 1345 1442 1713 1759 1893
1786 1893 1893 1687 1864 1929 2114 2041 2678 2600 2566 2537 2486 2863 3332 3857 4439 4485 4334 3981 5164 5051 9442 11838 16939 20451
1561 20451 26619 43514 492472 422452 6471 13036 12606 12297 11313 9405 6772 5250 3983 3676 4015 4124 3908
1401 3908 3553 3050 2515 2367 2322 2514 2503 2410 2083 1775 1905 1889 1852 1750 1775 1492 1611 1398 1389 1193 1685 1403 1321 1416 1107 1010 1060
1148 1060 1294 1123 1231 893 1086 922 799 1035 1001 1175 945 777 895 790 767 851 940 902 726 732 765 652 823 883 686 848
903 848 592 604 698 692 768 716 781 689 679 545 496 695 652 530 765 559 634 393 597 572 744 618 619 665 442 287 699 367 751
631 751 638 611 358 348 606 536 529 743 532 353 589 370 406 497 513 582 477 548 302 409 339 579 360 532 593 291 370 351
$$ packed form
2303F42l5l6N3j29L36j60k22L12j63o7J48o4J31Kj01l1J10j51J74n1n9n7k5N30L435k650l83
2049A489m18r6N5N1j43J72j24l5J28J11Pj28J86j75P6J37o1L7l0J93j31J58j10mR7K71M6J34
1786A893%k06J77O5J85p3O37p8l4k9n1L77M69N25N82M6j51l53J183j13M391K396N101L512
1561B0451O168J6895M48958p0020m15981O565m30l09r84j908k633j522j267l07L39J09k16
1401C908l55n03n35j48m5J92j1r3l27l08J30j6l7j02K5k83J19k13rj96M92k82q2R5l09r7N0
1148A060K34j71J08l38J93j64j23K36l4J74k30j68J18j05k3Q4Q9l8j76OL3j13J71O0j97J62
903H48k56J2R4oP6n2O5r2j0j34m9J99m3j22K35k06P5k41K04k5J72j26JM6k23j55M12l32L84
631G51j13k7k53j0K58p0pK14k11j79K36k19L6R1J6O9j05P1k46J07p0K40k19J72O1l02P9j9
$$ plain form
368 351 399 585 491 522 360 479 312 322 447 524 595 478 275 310 173 336 516 473 523 497 309 136 213 399 470 578 303 474
105 474 186 140 263 417 494 522 557 186 207 150 439 521 513 471 605 201 162 278 426 493 556 537 478 183 153 267 491 474 636
-167 636 511 305 87 228 262 395 676 614 512 384 191 272 419 597 795 656 674 446 216 400 621 567 1032 778
$$ packed form
368C51M8J86r4L1j62J19j67J0J25P7P1j17k03L5j37J63J80m3N0k6j88j73P7J86P1J08k75J71
105D74k88m6J23J54P7K8L5l71K1n7K89Q2qm2J34m04l9J16J48O7O3j9n9k95l0J14K24j7J62
-167F36j25k06k18J41L4J33K81o2j02j28j93Q1J47J78J98j39J8k28k30J84K21n4M65k54
-392G78
##PAGE=	F1=-1284.46
##FIRST=	4405.895418600002813,	4405.895418600002813,	0
##DATA TABLE=	(F2++(Y..Y)), PROFILE
$$ plain form
4406 1338 1030 692 496 658 1027 1299 1292 1320 1019 623 76 431 844 1018 1057 1101 695 463 178 430 856 904 879 943 630 253
4162 253 204 497 849 762 960 685 398 149 252 565 652 834 943 497 442 259 353 582 749 769 646 639 363 198 487 565
3918 565 772 783 736 364 98 150 506 634 719 708 705 256 230 331 485 795 723 600 574 333 39 463 537 730 716 580 456
3664 456 319 252 470 577 711 723 518 563 274 464 584 601 713 528 526 414 376 358 627 483 838 591 396 335 459 400 701
3411 701 604 773 530 513 215 378 596 781 531 666 545 476 423 510 538 590 659 573 382 421 349 568 783 496 1289 1070 676
3157 676 424 813 271 792 713 788 675 508 455 333 665 860 302 944 720 421 536 730 571 828 561 225 924 495
2932 495 889 749 980 778 689 729 489 546 669 666 802 814 699 414 727 649 333 362 1280 772 724 894 605 559 717 883 885
2678 885 636 804 640 697 698 778 884 796 951 870 813 599 846 856 952 779 797 708 683 840 768 889 978 900 870 850 791 801 1047 1000
$$ packed form
4406A338l08l38j96J62L69K72pK8l01l96n47L55M13J74L9M4m06k32k85K52M26M8k5O4l13l77
4162B53m9K93L52q7J98k75k87k49J03L13Q7J82J09m46n5j83R4K29J67K0j23pk76j65K89P8
3918E65K07J1m7l72k66N2L56J28Q5j1lm49k6J01J54L10p2j23k6k41k94M24P4J93j4j36j24
3664D56j37o7K18J07J34J2k05M5k89J90J20J7J12j85kj12l8j8K69j44L55k47j95o1J24n9L01
3411G01r7J69k43j7k98J63K18J85k50J35j21o9n3Q7K8N2O9q6j91L9p2K19K15k87P93k19l94
3157F76k52L89n42N21p9P5j13j67n3j22L32J95n58O42k24k99J15J94j59K57k67l36O99m29
2932D95L94j40K31k02q9M0k40N7J23lJ36J2j15k85L13p8l16K9R18n08m8J70k89m6J58J66K
2678H85k49J68j64N7JQ0J06q8J55q1n7k14K47J0R6j73J8q9k5J57p2J21Q9p8l0k0n9J0K46m7
$$ plain form
2396 1000 1016 835 979 1001 706 970 975 1042 1115 1072 992 970 1059 904 1333 1156 955 1218 1070 973 1153 1142 1245 1280 1184 1187 1197 1124 1256
2124 1256 1252 1253 1190 1306 1524 4546 1674 1923 1624 1572 1648 1748 1586 1733 1604 1626 1804 1945 1969 1775 2048 1848 1950 2094 2106 2175
1880 2175 2203 2378 2253 2438 2299 2367 2555 2875 2979 3122 3178 2922 3108 3334 3525 3757 4421 4399 4358 4250 4339 4912 5718 6616 7486
1645 7486 7676 7468 7067 7684 8220 14791 19897 27785 34358 44562 72049 839497 722628 9717 13267 23825
1495 23825 22059 19218 15913 11636 8612 6806 6415 6937 7037 6697 5997 5170 4277 4105 4050 4277 4285 4032 3589 3098 3165 3109
1288 3109 3123 3049 3037 2626 2652 2403 2359 2188 2692 2416 2259 2311 1851 1846 1842 2123 1993 2025 1675 1786 1583 1487 1729 1740 1866 1639 1388
1035 1388 1436 1374 1351 1505 1599 1507 1294 1255 1266 1140 1384 1448 1267 1406 1101 1040 1100 1161 1289 1234 1286 1179 1099 900 905 1118 1131 1032 1252
763 1252 951 972 732 981 1005 1202 1115 1028 970 757 600 1081 789 1200 1046 948 654 651 869 909 933 1055 896 693 883 636 672
$$ packed form
2396A000J6j81J44K2k95K64NO7P3m3q0k2Q9j55M29j77k01K63j48r7J80j1J03L5r6LJ0p3J32
2124A256mJo3J16K18L022k872K49k99n2P6J00j62J47j29K2J78J41K4j94K73k00J02J44J2O9
1880B175K8J75j25J85j39O8J88L20J04J43N6k56J86K26J91K32O64k2m1j08Q9N73Q06Q98Q70
1645G486J90k08m01O17N36O571N106P888O573J0204K7487P67448j16869p12911L550J0558
1495B3825j766k841l305m277l024j806l91N22J00l40p00q27q93j72n5K27Qk53m43m91O7n6
1288C109J4p4j2m11K6k49m4j71N04k76j57N2m60nmK81j30L2l50J11k03r6K42J1J26k27k51
1035A388M8o2k3J54R4r2k13l9J1j26K44O4j81J39l05o1O0O1J28n5N2j07q0j99NK13J3r9K20
763A252l01K1k40K49K4J97q7q7n8k13j57M81k92M11j54r8k94lK18M0K4J22j59k03J90k47L6
$$ plain form
509 672 843 938 960 830 846 546 635 632 927 765 889 931 551 587 583 699 976 867 870 628 674 501 552 784 899 953 778 510 496
237 496 387 602 872 830 852 802 467 287 412 712 783 965 599 740 330 267 478 723 901 858 861 381 329 281 704 871 878 811
-26 811 894 381 263 425 732 872 950 870 731 303 205 513 805 869 971 869 532 163 258 488 772 1110 1056 862 596 263
-270 263 437 725 1062 1312 1142 1078 714 326 612 1053 1076 1636 1344
-392 1344
$$ packed form
509F72J71R5K2j30J6l00Q9lK95j62J24M2l80L6mJ16K77j09Lk42M6j73N1K32J15N4j75k68j4
237D96j09K15K70m2K2n0l35j80J25L00P1J82l66J41m10o3K11K45J78m3Lm80n2m8M23J67Po7
-26H11Q3n13j18J62L07J40P8q0j39m28r8L08K92O4J02j02l37l69R5K30K84L38n4j94k66l33
-270B63J74K88L37K50j70o4l64l88K86M41K3N60k92
-392A344
##PAGE=	F1=-1303.24
##FIRST=	4405.895418600002813,	4405.895418600002813,	0
##DATA TABLE=	(F2++(Y..Y)), PROFILE
$$ plain form
4406 1861 1399 924 652 966 1470 1819 1815 1855 1339 805 189 633 1216 1439 1463 1517 923 594 221 590 1193 1295 1223 1288 824
4171 824 334 287 712 1165 1094 1313 968 580 186 351 808 978 1185 1234 743 576 323 525 803 1076 1101 920 830 473 337
3936 337 718 761 1106 1066 1007 513 213 246 711 915 1033 975 915 442 341 482 717 1088 995 876 763 474 163 656 776 999
3692 999 1029 808 641 414 377 666 828 1033 981 716 728 370 625 792 890 992 795 748 540 512 594 865 763 1138 774 587
3448 587 458 602 662 920 877 1043 736 724 313 582 807 1066 815 898 749 648 578 712 733 891 962 805 589 613 505 767
3204 767 1041 725 1413 1529 933 584 910 330 1111 1062 1037 916 695 620 552 932 1169 623 1162 1068 602 793 961 844 1151
2969 1151 809 592 1112 782 1073 917 1293 1056 986 957 714 771 909 943 1111 1119 979 647 924 836 581 895 1504 1082 991 1161
2725 1161 848 832 1018 1208 1195 986 1102 924 970 991 1096 1237 1144 1258 1157 1086 927 1150 1206 1353 1112 1173 1005 984 1162 1098
$$ packed form
4406A861m62m75k72L14N04L49mM0n16n34o16M44N83K23K4N4n94l29l73L69O03J02p2O5m64
4171H24m90m7M25M53p1K19l45l88l94J65M57J70K07M9m91j67k53K02K78K73K5j81r0l57j36
3936C37L81M3L45m0n9m94l00L3M65K04J18n8o0m73j01J41K35L71r3j19j13k89l11M93J20K23
3692I99L0k21j67k27l7K89J62K05n2k65J2l58K55J67R8J02j97m7k08k8Q2K71j02L75l64j87
3448E87j29J44O0K58m3J66l07j2m11K69K25K59k51Q3j49j01p0J34K1J58P1j57k16K4j08K62
3204G67K74l16O88J16n96l49L26n80P81m9k5j21k21p5o8L80K37n46N39r4m66J91J68j17L07
2969A151l42k17N20l30K91j56L76k37p0k9k43N7J38L4J68Qj40l32K77q8k55L14O09m22r1J70
2725A161l13j6J86J90j3k09J16j78M6K1J05J41r3J14j01p1j59K23N6J47k41O1j68k1J78o4
$$ plain form
2481 1098 1254 1400 1271 1231 1180 1085 1171 1418 1418 1422 1247 1343 1324 1106 1373 1389 1482 1531 1484 1364 1367 1480 1320 1810 1630 1463 1670 1524
2218 1524 1418 1614 1668 1736 1800 1700 1735 1668 1658 1760 1809 1876 1775 2013 2250 5225 1742 2326 2172 2168 2253 2376 2233 2327 2219 2305 2530
1964 2530 2680 2707 2509 2813 2611 2718 2874 2986 3058 3156 3309 3189 3392 3249 3374 3664 4009 4182 4320 4430 4148 4330 4706 4934
1739 4934 5468 6116 6150 6101 5937 6167 6934 8081 9335 10484 10796 10513 10067 10651 13142 20176 27889 38351 47921 61909
1551 61909 99430 1181917 1019453 13687 8748 38484 32517 26988 22069 16435 11747 9583 9160 9839 9910 9422
1401 9422 8375 7221 6006 5822 5760 6021 6024 5616 5064 4403 4395 4308 4368 4331 4261 3754 3656 3384 3311 3181 3684 3406 3179 3176 2594 2673 2614
1148 2614 2943 2846 2795 2452 2454 2244 2171 2408 2471 2543 2312 1997 1964 1946 1937 2154 2231 2107 1850 1765 1755 1629 1945 2009 1842 1939 1608 1466
885 1466 1492 1620 1795 1753 1789 1646 1503 1247 1318 1535 1602 1538 1721 1335 1310 1075 1357 1442 1647 1594 1422 1260 1089 921 1441 1231
$$ packed form
2481A098J56J46j29m0n1r5Q6K47%Mj75R6j9k18K67J6R3M9m7j20LJ13j60M90j80j67K07j46
2218A524j06J96N4O8O4j00L5o7j0J02M9O7j01K38K37K975l483N84j54mQ5J23j43R4j08Q6K25
1964B530J50K7j98L04k02J07J56J12P2R8J53j20K03j43J25K90L45J73J38J10k82J82L76K28
1739D934N34O48L4m9j64K30P67J147J254J149L12k83m46N84K491P034P713J0462R570J3988
1551F1909L7521J082487j62464j005766m939K9736n967n529m919n634m688k164m23O79P1m88
1401I422j047j154j215j84o2K61Lm08n52o61qq7O0l7p0n07r8k72p3j30N03k78k27ln82P9n9
1148B614L29r7n1l43Kk10p3K37O3P2k31l15l3j8rK17P7j24k57q5j0j26L16O4j67R7l31j42
885A466K6J28J75m2L6j43j43k56P1K17O7o4J83l86k5k35K82Q5K05n3j72j62j71j68N20k10
$$ plain form
640 1231 1618 1448 1265 960 947 1118 1279 1324 1421 1223 1067 1151 906 948 1192 1361 1334 1164 1135 781 865 920 1289 1173 1246 1260 807
387 807 784 832 1001 1341 1257 1207 891 849 688 794 1116 1277 1292 1070 741 666 613 876 1220 1181 1166 1080 641 445 624 1017 1092 1337
124 1337 905 989 469 407 697 1026 1304 1192 1143 579 443 432 957 1212 1235 1152 1157 557 370 587 1032 1235 1342 1195 949 426
-120 426 283 765 1112 1278 1282 1224 751 257 337 732 1150 1537 1491 1188 776 327 599 1053 1513 1813 1613 1467 954 449 815
-355 815 1479 1593 2217 1901
-392 1901
$$ packed form
640A231L87j70j83l05j3J71J61M5R7j98j56Q4k45M2K44J69k7j70k9l54Q4N5L69j16P3J4m53
387H07k3M8J69L40q4n0l16m2j61J06L22J61J5k22l29p5n3K63L44l9j5q6m39j96J79L93P5K45
124A337m32Q4n20o2K90L29K78j12m9n64j36j1N25K55K3q3No00j87K17M45K03J07j47k46n23
-120D26j43M82L47J66Mn8m73m94Q0L95M18L87m6l03m12m49K72M54M60L00k00j46n13n05L66
-355H15O64J14O24l16
-392A901
##PAGE=	F1=-1322.02
##FIRST=	4405.895418600002813,	4405.895418600002813,	0
##DATA TABLE=	(F2++(Y..Y)), PROFILE
$$ plain form
4406 2249 1671 1091 764 1226 1827 2227 2221 2270 1552 935 300 811 1519 1763 1776 1839 1084 678 270 712 1459 1607 1499 1555 953
4171 953 389 345 900 1413 1365 1581 1181 706 217 448 1005 1250 1458 1446 940 665 376 674 985 1337 1355 1144 971 554 458
3936 458 909 932 1376 1278 1214 626 306 349 866 1148 1288 1179 1063 585 439 609 913 1316 1205 1087 917 571 275 814 978
3702 978 1213 1266 988 774 485 488 837 1028 1293 1175 870 842 449 742 950 1146 1204 1012 913 632 613 794 1065 997 1370 908
3458 908 737 556 711 884 1091 1095 1250 888 881 404 762 974 1283 1054 1063 921 778 697 883 891 1134 1211 980 761 774 626 936
3204 936 1228 912 1402 1904 1135 723 963 712 1332 1326 1229 1102 837 751 755 1134 1419 934 1275 1366 750 996 1138 1075 1397 1028
2960 1028 1069 1194 1029 1198 992 1519 1266 1228 1124 890 953 1091 1157 1348 1349 1189 846 1071 959 874 1403 1649 1317 1192 1349
2725 1349 1038 1056 1244 1458 1426 1272 1323 1139 1188 1226 1344 1516 1415 1484 1366 1294 1198 1376 1482 1667 1374 1463 1244 1225 1411 1360 1540
$$ packed form
4406B249n78n80l27M62O01M00oM9p18o17o35N11P08K44J3O3p55m06m08M42P47J48j08N6o02
4171I53n64m4N55N13m8K16m00m75m89K31N57K45K08j2n06k75k89K98L11L52J8k11j73m17r6
3936D58M51K3M44r8o4n88l20M3N17K82J40j09j16m78j46J70L04M03j11j18j70l46k96N39J64
3702I78K35N3k78k14k89LL49J91K65j18l05k8l93K93K08J96N8j92r9k81j9J81K71o8L73m62
3458I08j71j81J55J73K07MJ55l62pm77L58K12L09k29Rj42j43q1J86QK43P7k31k19J3j48L10
3204I36K92l16M90N02p69m12K40k51O20or7j27k65q6ML79K85m85L41R1o16K46J42o3L22l69
2960A028M1J25j65J69k06N27k53l8j04k34O3J38O6J91Jj60l43K25j12q5N29K46l32j25J57
2725A349l11J8J88K14l2j54N1j84M9L8J18J72j01O9j18p2r6J78J06J85k93Q9k19j9J86n1J80
$$ plain form
2472 1540 1731 1563 1504 1443 1310 1470 1693 1750 1739 1575 1610 1569 1434 1689 1721 1829 1850 1792 1651 1680 1807 1660 2165 2001 1871 2023
2227 2023 1868 1772 1972 2088 2118 2204 2095 2154 2042 2070 2157 2259 2381 2211 2508 2606 5675 2023 2648 2618 2642 2724 2846 2752 2776 2709 2859
1974 2859 3111 3243 3279 3116 3392 3224 3311 3479 3697 3743 3911 4038 3925 4132 4014 4168 4554 4891 5136 5246 5400 5125 5283 5766
1749 5766 6088 6814 7425 7511 7451 7265 7611 8537 9959 11483 12837 13227 12871 12394 13127 17278 24508 34239 46555 58456
1561 58456 75222 120184 1452944 1255072 18947 3749 55292 41966 33183 26528 20127 14056 11777 11386
1429 11386 12151 12178 11542 10215 8800 7357 7183 7119 7403 7376 6843 6211 5435 5354 5249 5337 5348 5205 4650 4424 4146 4058 3972 4465
1204 4465 4175 3897 3841 3180 3336 3223 3588 3518 3386 3070 2958 2776 2717 2939 3047 3072 2832 2482 2374 2394 2412 2664 2714 2581 2284
969 2284 2164 2138 2022 2397 2452 2296 2340 2015 1797 1791 1977 2183 2172 2190 1997 1810 1518 1658 1860 1970 1947 2083 1630 1580 1354 1648
$$ packed form
2472A540J91j68n9o1j33J60K23N7j1j64L5m1j35K55L2J08K1n8j41K9J27j47N05j64j30J52
2227B023j55r6K00J16L0Q6j09N9j12K8Q7J02J22j70K97R8L069l652O25l0K4Q2J22r4K4o7J50
1974B859K52J32L6j63K76j68Q7J68K18M6J68J27j13K07j18J54L86L37K45J10J54k75J58M83
1749E766L22P26O11Q6o0j86L46R26J422J524J354L90l56m77P33M151P230R731J2316J1901
1561E8456J6766M4962J332760j97872j236125j5198N1543j3326q783o655o401o071k279l91
1429A1386P65K7o36j327j415j443j74o4K84k7n33o32p76q1j05Q8J1j43n55k26k78q8q6M93
1204D465k90k78n6o61J56j13L65p0j32l16j12j82n9K22J08K5k40l50j08K0J8K52N0j33k97
969B284j20k6j16L75N5j56M4l25k18oJ86K06j1J8j93j87k92J40K02J10k3J36m53n0k26K94
$$ plain form
725 1648 1795 1993 1962 1721 1475 1361 1186 1709 1608 1925 1762 1494 1214 1178 1301 1578 1625 1740 1458 1382 1338 1124 1170 1473 1697
490 1697 1625 1415 1352 959 1054 1143 1590 1506 1525 1518 1012 923 1049 1243 1607 1584 1467 1093 971 829 996 1378 1583 1542 1297 919 789
237 789 808 1102 1492 1455 1402 1275 789 580 804 1259 1333 1619 1158 1169 578 527 876 1267 1628 1453 1344 742 526 569 1149 1479
-7 1479 1514 1425 1338 694 457 726 1272 1517 1651 1446 1086 528 367 978 1349 1621 1503 1501 912 331 429 944 1457 1874 1830 1428
-252 1428 888 365 730 1339 1860 2201 1971 1761 1118 547 978 1813 2019 2661 2333
-392 2333
$$ packed form
725A648J47J98l1k41k46j14j75N23j01L17j63k68k80l6J23K77M7J15k82p6m4k14M6L03K24
490A697p2k10o3l93R5Q9M47q4J9pn06q9J26J94L64k3j17l74j22j42J67L82K05m1k45l78j30
237G89J9K94L90l7n3j27m86k09K24M55P4K86m61J1n91n1L49L91L61j75j09o02k16M3N80L30
-7A479L5q9q7o44k37K69N46K45J34k05l60n58j61O11L71K72j18kn89n81R8N15N13M17m4m02
-252A428n40n23L65O09N21L41k30k10o43n71M31Q35K06O42l28
-392B333
##PAGE=	F1=-1340.8
##FIRST=	4405.895418600002813,	4405.895418600002813,	0
##DATA TABLE=	(F2++(Y..Y)), PROFILE
$$ plain form
4406 2418 1784 1156 810 1387 2015 2434 2425 2476 1612 985 374 926 1689 1921 1929 1999 1136 699 315 772 1596 1770 1650 1685 984
4171 984 405 371 1018 1541 1517 1708 1275 753 234 520 1116 1410 1591 1532 1046 690 411 764 1090 1476 1476 1266 1030 585 532
3936 532 1019 1034 1526 1372 1309 678 363 430 937 1283 1431 1276 1117 657 506 686 1030 1430 1311 1188 1004 602 354 902
3711 902 1101 1326 1376 1083 830 517 556 945 1128 1435 1269 941 886 491 788 1029 1312 1302 1137 985 675 659 919 1185 1137
3476 1137 1481 960 811 609 762 1019 1179 1213 1348 951 953 462 876 1058 1390 1196 1124 1021 837 757 986 976 1273 1348 1062
3242 1062 861 867 685 1037 1307 1038 1220 2117 1220 804 941 1114 1420 1449 1316 1190 900 822 897 1230 1550 1178 1236 1565 824
3007 824 1104 1223 1216 1517 1170 1424 1169 1158 1231 960 1609 1360 1363 1193 981 1049 1178 1262 1465 1455 1282 963 1141 994 1147 1748
2763 1748 1685 1430 1284 1417 1133 1187 1348 1582 1525 1439 1423 1241 1309 1352 1470 1659 1553 1579 1450 1393 1357 1475 1629 1827 1510 1605 1377
$$ packed form
4406B418o34o28l46N77O28M19rN1q64o27o11N52P63K32QP0q63m37l84M57Q24J74j20L5p01
4171I84n79l4O47N23k4J91m33n22n19K86N96K94J81n9m86l56k79L53L26L86%k10k36m45n3
3936E32M87J5M92j54o3o31l15O7N07L46J48j55j59m60j51J80L44M00j19j23j84m02k48N48
3711I02J99K25N0k93k53l13L9L89J83L07j66l28n5l95K97K41K83j0j65j52l10j6K60K66m8
3476A137L44n21j49k02J53K57J60L4J35l97Km91M14J82L32j94p2j03j84q0K29j0K97P5k86
3242A062k01Oj82L52K70k69J82Q97q97m16J37J73L06K9j33j26k90p8P5L33L20l72N8L29p41
3007H24K80J19pL01l47K54k55j1P3k71O49k49Lj70k12O8J29Q4K03j0j73l19J78j47J53O01
2763A748o3k55j46J33k84N4J61K34n7q6j6j82O8M3J18J89j06K6j29n7l6J18J54J98l17R5k28
$$ plain form
2509 1377 1358 1534 1500 1686 1905 1715 1634 1581 1413 1639 1815 1925 1900 1751 1721 1683 1622 1853 1898 2013 2004 1928 1795 1842 1972 1855 2323
2256 2323 2194 2093 2203 2033 1963 2153 2315 2309 2405 2289 2362 2239 2277 2362 2513 2666 2412 2705 2535 5546 2384 2807 2862 2887 2955 3060
2011 3060 3030 2982 2963 3170 3421 3511 3572 3454 3660 3560 3606 3780 4088 4087 4311 4407 4310 4502 4434 4584 5040 5332 5640 5704 5884 5647 5762
1758 5762 6295 6748 7506 8072 8199 8126 7951 8369 9387 10951 12608 14047 14455 14052 13571 14480 19561 26828 37598 50656
1570 50656 63730 81691 129896 1595885 1380209 25459 16272 72169 48767 36636 28228 21768 15115 12936
1439 12936 12631 13388 13361 12608 11130 9579 8039 7907 7844 8129 8054 7452 6787 5980 5839 5733 5825 5886 5672 5127 4790 4530 4443 4396
1213 4396 4866 4560 4266 4167 3479 3699 3539 3921 3872 3673 3398 3189 3068 3013 3209 3348 3342 3090 2738 2575 2623 2678 2924 2948 2826 2508
969 2508 2368 2335 2237 2649 2683 2534 2524 2238 1965 1929 2155 2370 2402 2405 2158 1956 1658 1856 2024 2159 2176 2264 1771 1723 1512 1795 1987
$$ packed form
2509A377j9J76l4J86K19j90q1n3j68K26J76J10k5j49l0l8o1K31M5J15rp6j33M7J30j17M68
2256B323j29j01J10j70p0J90J62oR6j16P3j23L8Q5J51J53k54K93j70L011l162M23N5K5O8J05
2011C060l0m8j9K07K51R0O1j18K06j00M6J74L08jK24R6r7J92o8J50M56K92L08O4J80k37J15
1758E762N33M53P58N66J27p3j75M18J018J564J657J439M08m03m81R09N081P267J0770J3058
1570E0656J3074J7961M8205J465989k15676j354750r187N5897k3402j2131q408o460o653k179
1439A2936l05P57k7p53j478j551j540j32o3K85p5o02o65q07j41j06R2O1k14n45l37k60q7m7
1213D396M70l06k94r9o88K20j60L82m9j99k75k09j21n5J96J39ok52l52j63M8N5K46K4j22l18
969B508j40l3r8M12L4j49j0k86k73l6K26K15L2Lk47k02k98J98J68J35J7Q8m93m8k11K83J92
$$ plain form
716 1987 2169 2145 1862 1568 1513 1340 1828 1845 2060 1919 1584 1365 1295 1378 1749 1778 1910 1571 1562 1407 1245 1285 1628 1878 1767 1534
471 1534 1445 1043 1159 1251 1762 1694 1663 1650 1126 980 1184 1375 1721 1777 1596 1194 1015 890 1114 1517 1750 1647 1406 1009 841
237 841 934 1231 1632 1589 1515 1347 874 666 911 1388 1454 1752 1302 1242 640 599 977 1391 1812 1585 1418 836 557 661 1238 1617
-7 1617 1654 1573 1400 765 504 811 1405 1663 1808 1567 1113 587 433 1111 1467 1826 1585 1641 977 367 503 1077 1629 2049 1999
-242 1999 1531 904 366 803 1522 2029 2397 2137 1896 1169 587 1071 1982 2268 2873 2546
-392 2546
$$ packed form
716A987J82k4k83k94n5j73M88J7K15j41l35k19p0Q3L71K9J32l39rj55j62M0L43K50j11k33
471A534q9m02J16R2N11o8l1j3n24j46K04J91L46N6j81m02j79j25K24M03K33j03k41l97j68
237H41R3K97M01m3p4j68m73k08K45M77O6K98m50o0o02m1L78M14M21k27j67n82k79J04N77L79
-7A617L7q1j73o35k61L07N94K58J45k41m54n26j54O78L56L59k41N6o64o10J36N74N52M20n0
-242A999m68o27n38M37P19N07L68k60k41p27n82M84R11K86O05l27
-392B546
##PAGE=	F1=-1359.58
##FIRST=	4405.895418600002813,	4405.895418600002813,	0
##DATA TABLE=	(F2++(Y..Y)), PROFILE
$$ plain form
4406 2332 1714 1099 779 1418 1991 2396 2381 2427 1505 942 397 957 1688 1879 1887 1960 1065 653 342 755 1578 1750 1643 1649 908
4171 908 381 364 1037 1523 1514 1664 1225 712 234 550 1118 1427 1551 1471 1040 646 424 778 1096 1463 1440 1258 991 555 545
3936 545 1026 1042 1519 1329 1271 660 377 471 909 1286 1436 1241 1064 641 528 699 1042 1400 1291 1156 1004 558 389 903
3711 903 1120 1312 1334 1070 797 500 565 964 1104 1430 1246 909 855 488 753 1012 1348 1266 1146 948 660 641 943 1199 1152
3476 1152 1447 914 789 606 742 1036 1165 1207 1317 910 927 474 899 1036 1371 1210 1065 1028 813 743 999 966 1282 1343 1034
3242 1034 870 873 671 1046 1260 1089 874 2135 1159 801 829 1471 1380 1404 1276 1162 870 821 949 1198 1531 1304 1041 1629 804
3007 804 1098 1197 1239 1486 1207 1581 1062 1130 1161 833 1544 1316 1355 1147 965 1034 1151 1235 1438 1412 1238 969 1123 937 1339 1868
2763 1868 1596 1398 1249 1343 1114 1201 1307 1554 1469 1454 1380 1206 1312 1343 1444 1634 1529 1523 1391 1363 1371 1422 1619 1800 1496 1564 1377
$$ packed form
4406B332o18o15l20O39N73M05j5M6r22n63n45N60P31J91QP3q95m12l11M13Q23J72j07Op41
4171I08n27j7O73M86rJ50m39n13m78L16N68L09J24q0m31l94k22L54L18L67k3j82k67m36j0
3936E45M81J6M77j90n8o11k83R4M38L77J50j95j77m23j13J71L43L58j09j35j52m46j69N14
3711I03K17J92K2k64k73k97O5L99J40L26j84l37n4l67K65K59L36q2j20j98k88j9L02K56m7
3476A152K95n33j25j83J36K94J29M2J10m07J7m53M25J37L35j61j45l7k15p0K56l3L16O1l09
3242A034j64Lk02L75K14j71k15J261r76l58K8O42r1K4j28j14k92m9J28K49L33k27k63N88q25
3007H04K94R9M2K47k79L74n19O8L1l28P11k28L9k08j82O9J17Q4K03k6j74k69J54j86M02N29
2763A868k72j98j49R4k29Q7J06K47q5j5p4j74J06L1J01J90j05oj32k8QN1J97J81l04O8j87
$$ plain form
2509 1377 1356 1503 1489 1659 1887 1695 1596 1564 1365 1648 1758 1907 1873 1740 1646 1640 1632 1830 1884 1996 1960 1861 1765 1818 1944 1864 2249 2172 2086
2237 2086 2172 1985 1951 2117 2299 2267 2362 2246 2327 2222 2241 2333 2524 2678 2348 2606 2272 4953 2649 2724 2833 2838 2887 2970 2999 2892 2916
1983 2916 3167 3386 3421 3523 3437 3556 3546 3539 3707 4071 4014 4270 4329 4260 4416 4418 4531 5017 5234 5588 5589 5772 5599 5660 6185 6758 7403
1730 7403 7909 8063 7978 7845 8282 9301 10836 12466 13847 14211 13804 13359 14391 19576 26572 37218 49738 62584 79908
1551 79908 126440 1579829 1367796 32299 31785 86531 51764 36768 26707 20774 14791 12820 12626 13279 13199
1410 13199 12386 10922 9394 7901 7841 7782 8041 7910 7305 6667 5924 5744 5653 5722 5830 5562 5080 4672 4454 4379 4362 4794 4476 4206
1185 4206 4082 3420 3689 3492 3868 3834 3591 3364 3100 3055 3000 3161 3308 3293 3031 2711 2523 2584 2683 2876 2886 2786 2476 2339 2307 2227
941 2227 2648 2650 2505 2446 2232 1938 1875 2112 2311 2397 2386 2096 1908 1639 1873 1990 2128 2173 2227 1729 1706 1517 1767 1977 2138 2106 1813
$$ packed form
2509A377k1J47j4J70K28j92r9l2j99K83J10J49l4j33r4oqJ98N4J12l6r9r6N3J26q0L85p7q6
2237B086Q6j87l4J66J82l2R5j16Q1j05J9R2J91J54l30K58l34K681k304P5J09NM9Q3K9j07K4
1983B916K51K19L5J02q6J19j0pJ68L64n7K56N9o9J56KJ13M86K17L54JJ83j73O1N25N73O45
1730G403N06J54q5j33M37J019J535J630J381L64m07m45J032N185O996J0646J2520J2846J7324
1551G9908M6532J453389k12033j335497n14N4746l4767j4996j0061n933n983j971j94O53q0
1410A3199q13j464j528j493o0n9K59j31o05o38p43j80r1O9J08k68m82m08k18p5j7M32l18k70
1185D206j24o62K69j97L76l4k43k27k64m5n5J61J47j5k62l20j88O1R9J93J0j00l10j37l2q0
941B227M21Kj45n9k14k94o3K37J99Q6j1k90j88k69K34J17J38M5N4m98k3j89K50K10J61l2k93
$$ plain form
687 1813 1515 1514 1350 1771 1897 1994 1884 1511 1379 1274 1329 1761 1758 1872 1547 1563 1342 1244 1262 1622 1863 1725 1499 1386 1019 1159
443 1159 1222 1766 1702 1627 1624 1127 947 1208 1365 1662 1797 1564 1173 974 856 1124 1507 1744 1584 1370 993 812 968 1236 1609
209 1609 1552 1480 1285 871 685 919 1377 1431 1706 1305 1189 643 605 981 1372 1824 1556 1345 842 530 688 1206 1596 1625 1561
-26 1561 1329 754 502 819 1406 1647 1775 1529 1027 588 464 1141 1439 1849 1508 1612 930 359 535 1103 1631 2027 1959 1478
-252 1478 822 323 803 1560 1982 2361 2071 1840 1099 555 1074 1946 2290 2804 2492
-392 2492
$$ packed form
687A813k98jj64M21J26R7j10l73j32j05N5M32lJ14l25J6k21r8J8L60K41j38k26j13l67J40
443A159O3N44o4p5lm97j80K61J57K97J35k33l91j99j18K68L83K37j60k14l77j81J56K68L73
209A609n7p2j95m14j86K34M58N4K75m01j16n46l8L76L91M52k68k11n03l12J58N18L90K9o4
-26A561k32n75k52L17N87K41J28k46n02m39j24O77K98M10l41J04o82n71J76N68N28L96o8m81
-252A478o56m99M80P57M22L79k90k31p41n44N19Q72L44N14l12
-392B492
##PAGE=	F1=-1378.36
##FIRST=	4405.895418600002813,	4405.895418600002813,	0
##DATA TABLE=	(F2++(Y..Y)), PROFILE
$$ plain form
4406 2009 1475 930 679 1316 1753 2119 2103 2133 1255 814 367 900 1514 1646 1660 1727 881 551 340 662 1409 1550 1480 1453 738
4171 738 325 328 950 1366 1357 1459 1041 596 215 532 1013 1299 1346 1275 926 543 417 713 1001 1300 1255 1123 857 470 494 931
3927 931 951 1357 1157 1106 575 354 463 788 1157 1305 1079 917 545 505 644 947 1230 1151 1001 916 449 376 815 1034 1171
3692 1171 1150 953 684 441 514 889 959 1280 1115 780 758 442 642 903 1243 1103 1039 808 595 563 864 1104 1044 1275 774
3458 774 678 550 657 930 1052 1080 1160 775 810 437 825 912 1234 1093 896 942 712 659 918 861 1166 1199 903 788 792 589 962
3204 962 1096 1055 441 1980 963 712 642 1739 1253 1209 1113 1023 752 750 903 1050 1366 1283 736 1546 702 986 1063 1142 1313 1134
2960 1134 1527 913 951 999 643 1336 1140 1205 994 848 907 1017 1084 1274 1229 1064 862 1022 806 1414 1764 1381 1230 1093 1139
2725 1139 985 1098 1128 1381 1265 1318 1205 1041 1198 1203 1270 1444 1350 1325 1204 1207 1238 1226 1459 1590 1338 1352 1246 1222 1323 1330 1465 1686
$$ packed form
4406B009n34n45k51O37M37L66j6L0q78m41m47N33O14J32J4O7q46l30k11L22P47J41p0k7p15
4171G38m13LO22M16rJ02m18m45l81L17M81K86M7p1l49l83j26K96K88K99m5j32k66l87K4M37
3927I31K0M06k00n1n31k21J09L25L69J48k26j62l72m0J39L03K83p9j50q5m67p3M39K19J37
3692A171k1j97k69k43P3L75P0L21j65l35k2l16K00K61L40j40o4k31k13l2L01K40o0K31n01
3458G74r6j28J07K73J22K8Q0l85L5l73L88Q7L22j41j97M6k30n3K59n7L05L3k96j15Mk03L73
3204I62J34m1o14J539j017k51p0J097m86m4r6r0k71kJ53J47L16q3n47Q10q44K84P7P9J71j79
2960A134L93o14L8M8l56O93j96O5k11j46N9J10O7J90m5j65k02J60k16O08L50l83j51j37M6
2725A139j54J13L0K53j16N3j13j64J57NO7J74r4k5j21LL1j2K33J31k52J4j06k4J01PJ35K21
$$ plain form
2462 1686 1507 1401 1395 1173 1502 1535 1698 1665 1548 1401 1450 1466 1626 1685 1785 1729 1602 1572 1615 1730 1687 1959 1943 1857 1936 1740 1740 1874
2199 1874 2048 2005 2085 1980 2068 1996 1979 2077 2298 2429 2053 2284 2102 3949 2610 2355 2517 2495 2529 2590 2662 2518 2572 2846 3010 2993
1955 2993 3140 3060 3102 3183 3124 3272 3649 3537 3799 3817 3789 3891 3969 4025 4490 4617 4994 4922 5089 4990 5001 5469 6095 6545 6966 7129 7039
1702 7039 6967 7371 8298 9634 11085 12278 12549 12184 11819 12877 17455 23742 33169 43976 55268 70273 110583 1408388
1533 1408388 1220639 38005 45831 95828 50556 33741 22266 17108 13281 11467 11364 11849 11724 10930 9640
1392 9640 8290 6970 7005 6950 7156 6976 6432 5877 5285 5088 5026 5049 5194 4902 4523 4095 3935 3878 3880 4256 3943 3734 3604 3012 3314
1157 3314 3094 3440 3418 3159 2978 2712 2738 2683 2804 2936 2935 2669 2407 2226 2287 2431 2527 2544 2469 2197 2085 2059 1996 2396 2356 2216 2125
903 2125 1998 1726 1640 1855 2018 2159 2135 1826 1678 1466 1703 1764 1888 1939 1981 1513 1529 1369 1571 1765 1908 1856 1585 1323 1366 1218
$$ packed form
2462A686j79j06ok22L29L3J63l3j17j47M9J6J60N9J00n6j27l0M3J15m3K72j6q6P9j96%J34
2199A874J74m3Q0j05Q8p2j7R8K21J31l76K31j82J847j339k55J62k2L4O1P2j44N4K74J64j7
1955B993J47q0M2Q1n9J48L77j12K62J8k8J02P8N6M65J27L77p2J67r9J1M68O26M50M21J63r0
1702G039p2M04R27J336J451J193K71l65l65J058M578O287R427J0807J1292J5005M0310J297805
1533A408388j87749j182634P826M9997m5272j6815j1475n158l827j814j03M85j25p94j290
1392I640j350j320L5n5K06j80n44n55n92j97o2K3J45k92l79m28j60n7KL76l13k09j30n92L02
1157C314k20L46k2k59j81k66K6n5J21J32jk66k62j81O1J44R6J7p5k72j12k6o3M00m0j40r1
903B125j27k72q6K15J63J41k4l09j48k12K37O1J24N1M2m68J6j60K02J94J43n2k71k62M3j48
$$ plain form
659 1218 1546 1757 1743 1661 1290 1257 1121 1160 1614 1571 1626 1392 1388 1157 1124 1104 1457 1659 1506 1318 1184 898 1053 1063 1597 1530 1428
406 1428 1445 1018 834 1112 1216 1445 1641 1375 1035 856 730 1026 1350 1567 1363 1195 879 709 906 1118 1428 1350 1308 1108
180 1108 778 636 830 1227 1270 1490 1169 1025 592 544 888 1214 1668 1374 1138 760 451 646 1061 1421 1434 1390 1140 665 450
-54 450 746 1275 1479 1561 1337 850 530 450 1066 1272 1685 1287 1420 782 313 519 1019 1465 1810 1716 1283 657 240 725 1443
-289 1443 1734 2105 1785 1606 925 455 986 1715 2084 2466 2181
-392 2181
$$ packed form
659A218L28K11j4q2l71l3j36L9M54m3N5k34mk31l3k0L53K02j53j88j34k86J55J0N34o7j02
406A428J7m27j84K78J04K29J96k66l40j79j26K96L24K17k04j68l16j70J97K12L10p8m2k00
180A108l30j42J94L97M3K20l21j44m33m8L44L26M54k94k36l78l09J95M15L60J3m4k50m75k15
-54D50K96N29K04Q2k24m87l20q0O16K06M13l98J33o38m69K06N00M46L45r4m33o26m17M85P18
-289A443K91L71l20j79o81m70N31P29L69L82k85
-392B181
##PAGE=	F1=-1397.14
##FIRST=	4405.895418600002813,	4405.895418600002813,	0
##DATA TABLE=	(F2++(Y..Y)), PROFILE
$$ plain form
4406 1520 1119 683 533 1106 1354 1662 1653 1657 918 624 298 769 1207 1275 1300 1346 626 416 306 511 1129 1214 1196 1140 507 254
4162 254 271 774 1102 1079 1135 764 432 182 466 824 1057 1017 983 733 403 394 583 824 1024 962 894 656 348 389 761 780 1073
3908 1073 896 849 443 305 411 600 920 1073 822 706 396 443 531 767 954 923 758 758 300 327 657 861 933 865 758 517
3664 517 351 418 733 725 1019 906 581 617 366 483 725 1020 849 846 595 494 444 701 921 838 1002 568 504 451 522 725 865
3411 865 864 912 574 628 360 671 712 1011 873 649 782 557 523 757 684 952 951 695 636 644 463 803 845 932 227 1706 687
3157 687 558 421 1871 1097 912 859 804 573 626 772 818 1094 1115 401 1328 552 794 848 950 1037 968 1306 755 670 780 448
2913 448 1031 869 942 764 657 694 804 845 1010 945 799 669 860 634 1378 1490 1063 959 850 840 776 903 851 1101 954 1066
2669 1066 934 780 995 967 984 1129 1055 1024 930 958 986 928 1190 1242 1073 1016 1015 984 1031 1060 1145 1348 1195 1092 1111 875 1238 1197 1342
$$ packed form
4406A520m01m36j50N73K48L08rMp39k94l26M71M38O8K5M6p20k10j10K05O18Q5j8n6o33k53
4162B54J7N03L28k3N6l71l32k50K84L58K33m0l4k50l30rJ89K41K00o2o8k38l08M1L72J9K93
3908A073j77m7m06j38J06J89L20J53k51j16l10M7Q8K36J87l1j65%m58K7L30K04P2o8j07k41
3664E17j66O7L15qK94j13l25L6k51J17K42K95j71lk51j01n0K57K20q3J64m34o4n3P1K03J40
3411H65jM8l38N4k68L11M1K99j38k24J33k25l4K34p3K68jk56n9Qj81L40M2Q7p05J479j019
3157F87j29j37J450p74j85n3n5k31N3J46M6K76K1p14R27p76K42N4J02Q7o9L38n51q5J10l32
2913D48N83j62P3j78j07L7J10M1J65o5j46j30J91k26P44J12m27j04j09j0o4J27n2K50j47J12
2669A066j32j54K15k8J7J45p4l1r4K8K8n8K62N2j69n7jl1M7K9Q5K03j53j03J9k36L63m1J45
$$ plain form
2396 1342 1322 1221 1038 1153 1162 1285 1347 1426 1362 1206 1256 1280 1377 1364 1513 1558 1462 1547 1353 1378 1474 1615 1584 1633 1553 1652 1613 1554 1652 1892
2115 1892 1984 1603 1843 2079 2434 2159 1733 1969 1931 1951 1999 2090 1931 1999 2273 2373 2319 2502 2405 2396 2550 2447 2565 2913 2760 3004
1871 3004 2978 3001 3037 3183 3178 3574 3611 3989 3846 3981 3950 3927 4305 4886 5139 5438 5598 5512 5507 5838 6595 7601 8768 9679 9831 9550
1626 9550 9295 10268 13778 18906 26317 34589 43364 54873 85768 1118656 970606 41130 55311 98176 45571
1486 45571 28385 15945 11325 11046 9181 9108 9409 9258 8557 7565 6512 5447 5582 5530 5664 5457 5022 4591 4205 4010 3984
1288 3984 3952 4119 3835 3579 3179 3085 3048 3058 3361 3079 2954 2836 2341 2658 2434 2727 2715 2468 2323 2110 2186 2135 2217 2313 2341 2081
1044 2081 1896 1750 1797 1983 1952 1997 1943 1732 1666 1644 1593 1950 1865 1730 1627 1588 1379 1277 1437 1552 1743 1706 1407 1317 1179 1384 1395
791 1395 1494 1525 1581 1172 1228 1103 1251 1397 1531 1451 1227 1028 1101 977 1197 1463 1359 1299 966 1024 870 904 1341 1255 1231 1127 1084
$$ packed form
2396A342k0j01j83J15RJ23O2P9o4j56N0K4R7j3J49M5r6Q5j94K5R6J41l1M9q0R9l9n9R8K40
2115A892R2l81K40K36L55k75m26K36l8K0M8R1j59O8K74J00n4J83r7rJ54j03J18L48j53K44
1871C004k6K3L6J46nL96L7L78j43J35l1k3L78N81K53K99J60q6nL31P57J006J167R11J52k81
1626I550k55R73L510N128P411Q272Q775J1509L0895J032888j48050r29476J4181M2865n2605
1486D5571j7186j2440m620k79j865p3L01j51p01r92j053j065J35n2J34k07m35m31l86j95k6
1288C984l2J67k84k56m00r4l7J0L03k82j25j18m95L17k24K93j2k47j45k13P6n1Q2R6K8k60
1044B081j85j46M7J86l1M5n4k11o6k2n1L57q5j35j03l9k09j02J60J15J91l7k99r0j38K05J1
791A395R9L1N6m09N6j25J48J46J34q0k24j99P3j24K20K66j04o0l33N8j54L4M37q6k4j04m3
$$ plain form
537 1084 893 913 845 1170 1310 1156 1031 879 711 862 812 1295 1221 1111 1145 824 668 916 961 1118 1347 1070 814 688 539
302 539 843 1084 1257 1033 917 694 553 765 904 1127 1027 1035 859 613 530 665 971 1009 1153 926 783 498 428 721 956
68 956 1382 1078 839 609 340 544 835 1129 1123 1096 872 517 360 609 1039 1200 1211 1031 625 424 390 907 1004 1368 971 1106
-176 1106 566 245 461 845 1169 1446 1323 989 448 134 583 1196 1343 1682 1340 1245 685 312 821 1338 1701 1927 1680
-392 1680
$$ packed form
537A084j91K0o8L25J40j54j25j52j68J51n0M83p4j10L4l21j56K48M5J57K29k77k56j26j49
302E39L04K41J73k24j16k23j41K12J39K23j00Qj76k46q3J35L06L8J44k27j43k85p0K93K35
68I56M26l04k39k30k69K04K91K94ok7k24l55j57K49M30J61J1j80m06k01l4N17R7L64l97J35
-176A106n40l21K16L84L24K77j23l34n41l14M49O13J47L39l42r5n60l73N09N17L63K26k47
-392A680
##PAGE=	F1=-1415.92
##FIRST=	4405.895418600002813,	4405.895418600002813,	0
##DATA TABLE=	(F2++(Y..Y)), PROFILE
$$ plain form
4406 969 722 409 370 834 879 1119 1127 1098 564 412 216 593 831 845 882 890 352 276 245 330 800 814 852 777 262 187 203 546 787
4134 787 740 755 454 257 144 367 596 756 630 654 509 257 359 418 602 692 622 624 426 216 250 558 563 728 601 553 291
3880 291 248 329 383 623 794 523 475 237 358 381 542 629 657 482 565 153 260 461 640 647 539 525 331 250 300 528 454 704
3617 704 664 357 459 281 309 511 726 557 610 353 380 311 489 690 582 682 336 306 331 363 467 645 609 623 350 417 261
3364 261 469 483 748 599 376 586 382 362 550 473 687 653 451 448 460 322 603 551 731 505 1376 415 376 218 1824 951
3119 951 585 569 550 371 474 585 555 771 840 154 1016 397 567 595 705 712 748 1004 608 415 556 331 692 557 621 503
2875 503 438 439 555 568 703 623 497 435 672 472 1262 1137 684 641 568 500 532 658 534 772 595 754 621 479 745 687 643
2622 643 753 706 678 626 664 671 586 872 828 756 633 733 692 684 738 766 943 822 734 768 531 915 816 913 913 832 631 809 790 878 940
$$ packed form
4406I69k47l13l9M64M5K40Qk9n34j52j96L77K38J4L7Qn38p6l1Q5M70J4L8p5n15p5J6L43K41
4134G87m7J5l01j97j13K23K29J60j26K4j45k52J02N9J84R0p0Kj98k10L4L08NJ65j27m8k62
3880B91m3Q1N4K40J71k71m8k38J21K3J61Q7K8j75Q3m12J07K01J79Pj08j4j94q1N0K28p4K50
3617G04m0l07J02j78K8K02K15j69N3k57K7o9J78K01j08J00l46l0K5L2J04J78l6J4k73O7j56
3364B61K08J4K65j49k23K10k04k0J88p7K14l4k02lJ2j38K81n2J80k26Q71r61l9j58J606q73
3119I51l66j6j9j79J03J11l0K16O9o86Q62o19J70K8J10PL6K56l96j93J41k25L61j35O4j18
2875E03o5JJ16J3J35q0j26o2K37k00P90j25m53m3p3o8L2J26j24K38j77J59j33j42K66n8m4
2622F43J10m7k8n2L8Pq5K86m4p2j23J00m1qN4K8J77j21q8L4k37L84r9R7%q1k01J78j9Q8O2
$$ plain form
2331 940 996 936 753 881 884 954 961 999 1098 987 1085 906 941 998 1092 1095 1098 1053 1167 1153 1056 1143 1393 1441 1093 1376 2070 518 1413 977
2049 977 1300 1265 1274 1316 1406 1249 1317 1567 1609 1539 1738 1612 1583 1777 1649 1731 2019 1843 2053 1986 2063 2029 2225 2171 2462 2424 2787 2581
1786 2581 2677 2697 2663 2933 3378 3491 3636 3785 3717 3767 4005 4545 5154 5995 6589 6624 6449 6318 7106 9391 13042 18083 23497 29342
1561 29342 36897 57140 770709 669615 40717 58193 92877 37906 21928 9384 4567 8687 6448 6313
1429 6313 6470 6319 5764 5131 4433 3648 3872 3821 3874 3668 3366 3078 2913 2730 2740 2659 2829 2582 2446 2114 2080 2059 2072 2292 2067
1195 2067 2031 1937 1546 1859 1653 1875 1872 1660 1538 1421 1514 1469 1523 1567 1633 1391 1286 1192 1217 1436 1268 1359 1319 1180 1170 1146 1102 1401
932 1401 1278 1151 1058 1088 969 865 943 1014 1234 1188 926 898 839 981 959 1031 1017 1109 778 863 775 873 950 1083 976 816 688 774 679
659 679 790 1080 916 874 607 732 575 611 997 869 782 794 724 601 659 542 821 892 750 697 533 501 626 524 922 843 743
$$ packed form
2331I40N6o0j83J28LP0PL8R9j11R8j79L5N7R4LLm5J14j4r7Q7K50M8l48K83O94j552Q95m36
2049I77L23l5RM2R0j57O8K50M2p0J99j26k9J94j28Q2K88j76K10o7P7l4J96n4K91l8L63k06
1786B581R6K0l4K70M45J13J45J49o8N0K38N40O09Q41N94L5j75j31P88K285L651N041N414N845
1561B9342P555K0243P13569j01094o28898J7476L4684n4971j5978j2544m817M120k239j35
1429F313J57j51n55o33o98p85K24n1N3k06l02k88j65j83J0q1J70k47j36l32l4k1J3K20k25
1195B067l6r4l91L13k06K22lk12j22j17R3m5N4M4O6k42j05r4K5K19j68R1m0j39j0k4m4K99
932A401j23j27r3L0j19j04P8P1K20m6k62k8n9J42k2P2j4R2l31Q5q8R8P7J33j07j60j28Q6r5
659F79J11K90j64m2k67J25j57L6L86j28q7J2p0j23N8j17K79P1j42n3j64l2J25j02L98p9j00
$$ plain form
406 743 786 587 483 659 654 748 976 709 556 505 323 615 765 883 660 593 477 375 579 641 763 655 718 593 410 388 465
152 465 661 701 773 631 515 382 282 515 658 1028 732 508 420 221 405 576 781 757 738 578 342 253 439 745 870 801
-92 801 678 406 290 297 698 690 965 624 736 329 179 375 622 810 1008 859 659 244 55 401 871 900 1180 831 835 429
-336 429 169 609 897 1223 1298 1094
-392 1094
$$ packed form
406G43M3j99j04J76nR4K28k67j53n1j82K92J50J18k23o7j16j02K04O2J22j08O3j25j83k2P7
152D65J96M0P2j42j16j33j00K33J43L70k96k24q8j99J84J71K05k4j9j60k36q9J86L06J25o9
-92H01j23k72j16PM01qK75l41J12m07j50J96K47J88J98j49k00m15j89L46M70K9K80l49Mm06
-336D29k60M40K88L26P5k04
-392A094
##PAGE=	F1=-1434.7
##FIRST=	4405.895418600002813,	4405.895418600002813,	0
##DATA TABLE=	(F2++(Y..Y)), PROFILE
$$ plain form
4406 464 363 175 222 556 428 594 634 561 262 213 156 409 462 447 492 443 117 159 171 157 487 427 512 432 58 133 135 314 479
4134 479 410 394 175 112 110 253 381 456 261 351 299 143 319 248 376 369 302 374 220 99 101 372 340 392 331 274 147 194 236 178 321
3842 321 525 239 273 139 265 219 319 317 401 235 380 114 198 262 412 369 236 298 166 156 187 312 216 396 437 158 308 205
3580 205 161 302 423 284 379 141 274 191 269 458 328 378 121 130 212 208 209 440 371 348 143 217 158 259 283 491 327 138 393
3307 393 219 210 333 277 422 364 218 268 276 199 401 269 480 704 1032 249 206 80 1581 808 314 303 310 183 323 381 315 457
3044 457 529 199 671 262 351 348 455 399 523 723 477 435 388 341 389 265 310 261 246 194 315 307 418 323 219 221 502 370 1115
2772 1115 819 306 335 302 178 300 412 240 455 254 446 324 195 495 421 313 388 371 348 351 377 356 263 572 433 449 279
2519 279 454 407 346 427 401 549 463 397 429 213 601 464 490 514 459 258 480 425 483 543 576 529 331 515 504 538 555 512 648 525
$$ packed form
4406D64j01j88M7L34j28J66M0p3k99m9n7K53N3j5M5m9l26M2J2j4L30o0Q5q0l74P5KJ79J65
4134D79o9j6k19o3kJ43J28P5j95R0n2j56J76p1J28po7P2j54j21KK71l2N2o1n7j27M7M2n8J43
3842C21K04k86L4j34J26m6J00kQ4j66J45k66Q4O4J50m3j33O2j32j0L1J25r6J80M1k79J50j03
3580B05m4J41J21j39R5k38J33q3P8J89j30N0k57RQ2mJK31o9k3k05P4n9J01K4K08j64j89K55
3307C93j74rJ23n6J45n8j46N0Qp7K02j32K11K24L28p83m3j26J501p73m94j1Pj27J40N8o6J42
3044D57P2l30M72m09Q9lJ07n6J24K00k46m2m7m7M8j24M5m9j5n2J21qJ11r5j04KK81j32P45
2772A115k96n13K9l3j24J22J12j72K15k01J92j22j29L00p4j08P5j7k3LK6k1r3L09j39J6j70
2519B79J75m7o1Q1k6J48q6o6L2k16L88j37K6K4n5k01K22n5N8O0L3m7j98J84j1L4J7m3J36j23
$$ plain form
2237 525 638 488 512 534 577 637 576 575 704 704 577 645 893 908 612 942 1970 1497 799 330 652 640 628 675 748 602 665 869
1974 869 873 808 996 840 821 1014 883 933 1141 962 1133 1034 1158 1061 1280 1202 1373 1288 1620 1369 1427 1470 1451 1612 1869 1923 1898 2039
1711 2039 1997 2081 2225 2541 2766 3304 3597 3542 3475 3461 3996 5172 7267 10053 12800 15878 19754 30131 431093 375377
1523 375377 36605 54024 80669 28999 15612 5165 3214 6781 3816 3512 3604 3486 3092 2808 2450 1917 2202
1364 2202 2150 2129 1957 1782 1630 1658 1492 1527 1421 1577 1381 1343 1100 1111 1102 1115 1254 1102 1143 1077 780 1070 906 1044 1052 889 777
1110 777 773 855 815 857 841 944 730 701 657 661 896 607 749 719 650 692 657 618 854 706 598 538 595 575 487 467 522 732 679 474 502
819 502 510 571 537 590 516 654 406 501 447 508 511 648 525 429 365 448 388 401 689 496 465 283 441 291 334 644 486 380 444 387
537 387 337 417 268 479 486 366 378 223 312 389 260 553 475 394 434 351 313 392 360 403 603 363 310 343 128 386 455 519 319 294
$$ packed form
2237E25J13j50K4K2M3O0o1jJ29%j27O8K48J5k96L30J028m73o98m69L22j2j2M7P3j46O3K04
1974H69Mo5J88j56j9J93j31N0K08j79J71r9J24r7K19p8J71q5L32k51N8M3j9J61K57N4k5J41
1711B039m2Q4J44L16K25N38K93n5o7j4N35J176K095K786K747L078L876J0377M00962n5716
1523C75377l38772J7419K6645n1670j3387j0447j951L567k965l04R2j18l94k84l58n33K85
1364B202n2k1j72j75j52K8j66L5j06J56j96l8k43J1rJ3J39j52M1o6k97K90j64J38Qj63j12
1110G77mQ2m0M2j6J03k14k9m4MK35k89J42l0o9M2l5l9K36j48j08o0N7k0q8k0N5K10n3k05K8
819E02QO1l4N3p4J38k48R5n4O1LJ37j23r6o4Q3o0J3K88j93l1j82J58j50M3L10j58j06O4n7
537C87n0Q0j49K11Pj20J2j55Q9P7j29K93p8q1M0q3l8P9l2M3K00k40n3L3k15K58O9O4k00k5
$$ plain form
256 294 272 208 385 380 404 316 419 362 211 235 274 357 404 439 347 271 264 136 310 398 676 402 208 230 118 256 337 444 409 384 311
-36 311 172 148 270 450 554 421 361 243 154 193 482 392 555 314 381 121 131 283 396 458 579 411 357 129 115 210 530
-289 530 511 691 367 460 205 125 388 480 745 698 537
$$ packed form
256B94k2o4J77nK4q8J03n7j51K4L9Q3M7L5r2p6pj28J74Q8K78k74j94K2j12J38Q1J07l5k5p3
-36C11j39k4J22J80J04j33o0j18q9L9K89r0J63k41O7k60J0J52J13O2J21j68n4k28j4R5L20
-289E30j9J80l24R3k55q0K63R2K65m7j61
-392E37
##PAGE=	F1=-1453.48
##FIRST=	4405.895418600002813,	4405.895418600002813,	0
##DATA TABLE=	(F2++(Y..Y)), PROFILE
$$ plain form
4406 107 126 122 113 323 145 180 278 139 63 56 140 247 166 199 198 72 59 87 100 65 246 131 239 160 112 93 83 119 225 171 135 45
4105 45 64 91 149 239 209 66 125 141 101 276 102 183 110 76 201 121 26 38 248 146 124 131 59 35 148 153 19 75 314 49 162
3814 162 158 181 74 138 82 196 102 243 190 159 94 217 147 22 115 83 86 98 125 141 145 266 77 180 151 88 132 178 76 196 108
3523 108 191 115 79 267 126 145 63 42 114 81 26 295 212 149 36 59 70 77 179 279 116 127 238 98 117 150 152 203 132 49 136
3232 136 126 125 227 79 226 739 698 248 90 8 1180 652 214 144 120 42 194 199 151 204 280 283 368 154 203 144 246 143 344
2960 344 561 366 649 316 397 198 70 98 95 147 4 128 109 217 99 76 121 390 338 996 661 62 116 104 78 125 207 21
2697 21 201 44 196 102 27 288 221 83 110 106 86 147 157 98 28 349 168 201 39 226 195 81 179 118 229 176 160 149 92 361
2415 361 199 144 187 171 33 217 132 172 220 237 207 73 212 204 194 213 134 280 150 278 183 164 162 159 289 151 206 332 351 199
$$ packed form
4406A07J9mrK10j78L5R8j39p6pQ4J07q1L3jj26j3K8J3l5J81j15J08p9m8j9j0L6J06n4l6r0
4105D5J9K7N8R0l0j43N9J6m0J75j74Q1p3l4J25q0r5J2K10j02k2Pp2k4J13Nj34N6K39k65J13
3814A62mK3j07O4n6J14r4J41n3l1o5J23p0j25R3l2LJ2K7J6MJ21j89J03k9o3M4M6j02J20q8
3523A08Q3p6l6J88j41J9q2k1P2l3n5K69q3o3j13K3J1PJ02J00j63J1J11j40J9L3KN1p1q3Q7
3232A36j0jJ02j48J47N13m1m50j58q2J172n28m38p0k4p8J52Nm8N3P6LQ5k14M9n9J02j03K01
2960C44K17j95K83l33Q1j99j28K8lN2j43J24j9J08j18k3M5K69n2O58l35n99N4j2k6M7Q2j86
2697B1J80j57J52r4p5K61o7j38K7mk0O1J0n9p0L21j81L3j62J87l1j14R8o1J11n3j6j1n7K69
2415C61j62n5M3j6j38J84q5M0M8J7l0j34J39qj0J9p9J46j30J28r5j9klJ30j38N5J26J9j52
$$ plain form
2134 199 243 469 477 228 565 1743 2847 885 463 165 190 133 198 233 136 177 305 314 277 405 224 274 393 278 302 430 274
1880 274 397 280 453 291 507 452 498 427 683 406 437 478 491 554 628 686 507 658 636 730 795 911 837 1146 1196 1091 1114 1187 1449
1608 1449 1825 2550 3568 4237 5162 6205 9091 155572 136588 29491 44018 63595 20249 10318 5607 8539
1457 8539 5682 1814 1226 1314 1264 996 1008 885 534 855 795 717 616 540 493 651 497 544 448 579 424 453 306 332 338 348 455
1204 455 349 447 393 178 424 336 367 392 282 182 269 334 280 333 266 386 217 259 230 239 452 100 266 254 238 312 262 226 399 241
922 241 199 217 194 256 206 118 247 320 267 126 197 245 226 198 248 151 291 117 199 173 215 171 294 170 131 123 175 153 125 358 160 143
622 143 107 212 79 123 342 175 112 133 132 143 250 147 200 170 72 126 120 176 189 92 254 187 119 148 154 181 171 151 138 289 93 117
321 117 229 76 196 217 227 85 114 117 100 215 168 107 143 202 200 76 93 134 113 164 257 143 95 161 42 140 265 380 145 24
$$ packed form
2134A99M4K26Qk49L37J178J104j962m22k98K5n7O5L5r7M1J28Rl7J28j81N0J19j15K4J28j56
1880B74J23j17J73j62K16n5M6p1K56k77L1M1J3O3P4N8j79J51k2R4O5J16p4L09N0j05K3P3K62
1608A449L76P25J018O69R25J043K886J46481j8984j07097J4527J9577m3346r931m711K932
1457H539k857l868n88Q8n0k68J2j23l51L21o0p8j01p6m7J58j54M7r6J31j55K9j47K6OJ0J07
1204D55j06R8n4k15K46q8L1K5j10j00Q7O5n4N3o7J20j69M2k9RK13l52J66j2j6P4n0l6J73j58
922B41m2J8k3O2n0q8J29P3n3j41P1M8j9k8N0r7J40j74Q2k6M2m4J23j24l9qN2k2k8K33j98j7
622A43l6J05j33M4K19j67o3K1jJ1J07j03N3l0r8N4oN6J3r7J62o7o8K9OK7j0k0j3J51j96K4
321A17J12j53J20K1J0j42K9Lj7J15m7o1L6N9kj24J7M1k1N1R3j14m8O6j19R8J25J15k35j21
$$ plain form
40 24 73 47 124 164 177 143 96 112 35 65 138 213 305 178 208 170 41 116 295 175 209 97 102 50 103 204 208 176 234 54 132 164 182 45
-280 45 233 282 290 156 195 52 185 199 167 350 244 110
$$ packed form
40B4M9k6P7M0J3l4m7J6p7L0P3P5R2j27L0l8j29P5J79j20L4j12Nn2N3J01Ml2N8j80P8L2J8j37
-280D5J88M9Qj34L9j43J33J4l2J83j06j34
-392A10
##PAGE=	F1=-1472.26
##FIRST=	4405.895418600002813,	4405.895418600002813,	0
##DATA TABLE=	(F2++(Y..Y)), PROFILE
$$ plain form
4406 166 132 197 78 178 223 138 177 143 54 45 144 128 40 236 47 178 128 60 53 126 102 125 100 10 181 62 68 19 54 138 173 135 97
4096 97 83 82 204 50 231 64 56 110 232 5 47 76 128 146 164 36 148 202 15 68 46 72 45 108 97 84 130 185 141 170 196 113
3796 113 54 32 106 65 133 182 249 138 47 81 10 125 16 114 58 37 33 217 35 181 131 83 120 86 73 115 56 93 187 140 110 57
3495 57 145 69 83 156 76 49 9 144 228 174 113 124 56 15 51 179 132 75 233 141 38 125 73 140 56 19 107 90 57 106 93 155 143
3185 143 656 410 308 77 73 763 522 258 151 38 61 97 69 106 106 208 293 188 108 169 13 109 42 257 554 286 832 294
2922 294 430 164 136 149 112 161 115 64 53 141 52 169 170 349 324 958 704 243 143 88 238 68 90 104 62 193 53 103 155
2650 155 160 121 158 128 57 93 39 125 81 161 233 205 78 127 81 147 132 23 100 53 6 148 48 216 245 48 101 31 68 185 63
2359 63 59 95 37 66 38 219 37 51 68 22 153 35 97 51 146 95 132 137 111 139 133 98 177 112 97 163 222 114 252 1423 3252 1097
$$ packed form
4406A66l4O5j19J00M5q5L9l4q9rR9j6q8J96j89J31n0o8pP3k4K3k5r0J71j19Om9L5Q4L5l8l8
4096I7j4jJ22j54J81j67qN4J22k27M2K9N2J8J8j28J12N4j87N3k2K6k7O3j1j3M6N5m4K9K6q3
3796A13n9k2P4m1O8M9O7j11r1L4p1J15j09R8n6k1mJ84j82J46n0m8L7l4j3M2n9L7R4m7l0n3
3495E7Q8p6J4P3q0k7m0J35Q4n4o1J1o8m1L6J28m7n7J58r2j03Q7n2O7q4l7Q8j7l3M9j3O2j2
3185A43N13k46j02k31mO90k41k64j07j13K3L6k8L7%J02Q5j05q0O1j56R6o7K15K97k68N46n38
2922B94J36k66k8J3l7M9m6n1j1Q8q9J17JJ79k5O34k54m61j00n5J50j70K2J4m2J31j40N0N2
2650A55Nl9L7l0p1L6n4Q6m4Q0P2k8j27M9m6O6j5j09P7m7m7J42j00J68K9j97N3p0L7J17j22
2359F3mL6n8K9k8J81j82J4J7m6J31j18O2m6R5n1L7Nk6K8ol5P9o5j5O6N9j08J38J171J829k155
$$ plain form
2058 1097 682 189 161 198 161 91 250 188 122 195 241 85 161 266 44 117 96 65 222 70 187 206 194 54 210 160 345 87
1795 87 202 190 188 176 178 178 96 381 335 217 201 175 180 455 330 373 473 380 246 263 500 664 882 1333 1636 2375 4100 24990
1533 24990 24435 20726 30659 44526 12705 6331 6751 12118 5318 1057 829 490 464 491 493 131 349 195 171 224 311 317
1326 317 281 149 171 167 205 207 181 121 208 171 177 139 323 156 180 72 239 33 167 85 121 111 243 49 162 76 60 178 90 156 171
1035 171 57 153 158 271 42 149 98 90 99 100 112 65 207 259 110 51 55 204 310 87 68 100 80 74 43 45 75 237 88 79 16 15 36 153
716 153 64 50 54 89 43 6 189 133 60 68 186 134 123 49 140 86 84 95 28 52 202 216 13 91 113 63 226 103 61 117 73 86 57 53
396 53 41 100 95 130 35 101 76 51 166 150 70 134 44 129 152 65 101 97 78 95 204 143 116 104 32 68 60 40 250 120 67 83 94 34 263
68 263 180 55 138 52 14 40 97 66 78 120 34 53 27 70 124 157 187 254 154 52 117 160 130 26 73 88 108 80 148 88 25 86 171 30
$$ packed form
2058A097m15m93k8L7l7p0J59o2o6P3M6j56P6J05k22P3k1l1J57j52J17J9j2j40J56n0J85k58
1795H7J15j2kj2K%q2K85m6j18j6k6NK75j25M3J00r3j34J7K37J64K18M51L03P39J725K0890
1533B4990n55l709R933J3867l1821o374M20N367o800m261k28l39k6K7Kl62K18j54k4N3Q7O
1326C17l6j32K2mL8Kk6o0Q7l7Ol8J84j67K4j08J67k06J34q2L6j0J32j94J13q6j6J18q8O6J5
1035A71j14R6NJ13k29J07n1qRJJ2m7J42N2j49n9MJ49J06k23j9L2k0ol1KL0J62j49ro3jK1J17
716A53q9j4ML5m6l7J83n6p3QJ18n2j1p4R1n4kJ1o7K4J50J4k03P8K2n0J63j23m2N6m4J3k9m
396E3j2N9nL5r5O6k5k5J15j6q0O4r0Q5K3q7L6mj9J7J09o1k7j2p2L6qk0K10j30n3J6J1o0K29
68B63q3j25Q3q6l8K6N7l1J2M2q6J9k6M3N4L3L0O7j00j02O5M3l0j04M7J5K0k8O8o0o3O1Q5j41
$$ plain form
-252 30 204 211 94 19 232 26 297 112 57 227 97 88 107 181 169
$$ packed form
-252C0J74Pj17p5K13k06K71j85n5J70j30rJ9P4j2
-392A69
##PAGE=	F1=-1491.04
##FIRST=	4405.895418600002813,	4405.895418600002813,	0
##DATA TABLE=	(F2++(Y..Y)), PROFILE
$$ plain form
4406 224 161 218 109 134 272 249 198 247 49 97 137 57 103 307 32 302 124 46 45 169 40 201 119 82 180 52 86 71 57 176
4124 176 262 137 104 78 73 212 42 301 106 43 108 187 54 32 153 177 140 198 38 223 197 88 132 61 111 77 73 74 132 220 133
3833 133 192 194 198 62 123 45 155 30 148 165 266 117 109 46 47 159 53 139 66 18 90 254 108 175 154 19 101 75 124 177 95
3542 95 72 210 118 143 132 88 108 127 189 72 24 47 199 205 187 153 168 105 32 119 186 52 118 277 107 34 160 122 154 34 95 155
3242 155 94 80 104 10 220 297 563 300 382 106 196 617 480 286 166 91 100 30 62 111 171 226 251 152 167 195 67 67 147 259 629
2950 629 258 938 258 441 169 190 196 159 191 150 104 88 128 93 217 208 348 289 994 834 334 218 141 303 97 91 128 87 256
2678 256 60 158 194 125 95 219 201 120 173 19 194 146 229 200 270 122 142 46 190 218 46 167 108 78 203 144 257 224 16
2406 16 211 139 105 227 86 131 167 108 125 101 282 125 91 182 141 265 81 204 66 207 201 245 268 84 279 223 97 173 221
$$ packed form
4406B24o3N7j09K5J38k3n1M9j98M8M0q0M6K04k75K70j78p8jJ24j29J61q2l7R8j28L4j5j4J19
4124A76Q6j25l3k6nJ39j70K59j95o3O5P9j33k2J21K4l7N8j60J85k6j09M4p1N0l4mJN8Q8q7
3833A33N9KMj36O1p8J10j25J18J7J01j49qo3JJ12j06Q6p3m8P2J64j46O7k1j35Q2k6M9N3q2
3542I5k3J38r2K5j1m4K0J9O2j17m8K3J52Oj8l4J5o3p3Q7O7j34O6J59j70p3J26l8L2j20O1O0
3242A55o1j4K4r4K10P7K66k63Q2k76R0M21j37j94j20p5Rp0L2M9O0N5K5r9J5K8j28%Q0J12L70
2950F29l71O80o80J83k72K1Ol7L2m1m6j6M0l5J24rJ40n9P05j60n00j16p7J62k06oL7m1J69
2678B56j96R8L6o9l0J24j8q1N3j54J75m8Q3k9P0j48K0r6J44K8j72J21n9l0J25n9J13l3k08
2406A6J95p2l4J22j41M5L6n9J7k4J81j57l4R1m1J24j84J23j38J41oM4K3j84J95n6j26P6M8
$$ plain form
2134 221 201 17 159 254 86 1232 2973 1097 604 272 197 297 234 191 346 270 252 279 345 161 313 370 201 255 237 242 390
1880 390 263 360 326 383 241 337 354 535 181 445 435 460 415 458 513 416 739 673 544 542 543 651 979 875 1013 1094 981 830 1027
1608 1027 1325 1997 2592 3601 4391 5769 8884 103740 90464 11944 16964 26494 6930 3451 6329 13397 5287
1448 5287 1234 1559 1001 861 980 857 504 715 490 528 618 612 612 546 346 440 445 419 429 435 367 393 388 370 329 503 323 300 248 394
1166 394 203 249 293 282 255 390 169 255 238 138 331 202 275 251 177 230 36 401 171 242 167 96 193 206 116 205 283 309 226 72
885 72 45 310 367 142 153 176 127 18 140 130 100 349 103 149 116 115 73 242 78 132 117 129 128 56 282 28 158 145 239 175 201
594 201 76 96 158 77 220 71 52 208 264 86 160 170 124 263 77 56 145 61 128 132 129 77 64 150 168 93 124 127 105 130 175 19 173
284 173 30 171 178 82 126 60 132 197 231 175 94 146 117 62 117 101 251 158 101 31 132 52 271 105 104 167 108 9 50 88 106 126 216
$$ packed form
2134B21k0j84J42R5j68J146J741j876m93l32p5J00o3m3J55p6j8K7O6j84J52N7j69N4j8NJ48
1880C90j27R7l4N7j42R6J7J81l54K64j0K5m5M3N5r7L23o6j29kJJ08L28j04J38Q1j13j51J97
1608A027K98O72N95J009P90J378L115R4856j3276p8520N020R530j9564l479K878P068q110
1448E287m053L25n58j40J19j23l53K11k25L8R0o%o6k00R4Nk6J0Oo8K6nj8m1J74j80k3n2J46
1166C94j91M6M4j1k7J35k21Q6j7j00J93j29P3k4p4N3j94L65k30P1p5p1R7J3r0Q9P8K6q3j54
885G2k7K65N7k25J1K3m9j09J22j0l0K49k46M6l3jm2J69j64N4j5J2jp2K26k54J30j3R4o4K6
594B01j25K0O2q1J43j49j9J56N6j78P4J0m6J39j86k1Q9q4O7Mln2j3Q6J8p5L1Lk2K5M5j56J54
284A73j43J41Pr6M4o6P2O5L4n6q1N2k9n5N5j6J50r3n7p0J01q0K19j66jO3n9r9M1L8J8K0R0
$$ plain form
-26 216 62 91 39 56 162 105 216 289 140 96 154 85 170 137 93 154 105 54 112 57 93 152 262 52 199 201 172 100 200 113 354
-317 354 106 75 227 111 128 113 278 255
$$ packed form
-26B16j54K9n2J7J06n7J11P3j49m4N8o9Q5l3m4O1m9n1N8n5L6N9J10k10J47Kk9p2J00q7K41
-317C54k48l1J52j16J7j5J65k3
-392B55
##PAGE=	F1=-1509.82
##FIRST=	4405.895418600002813,	4405.895418600002813,	0
##DATA TABLE=	(F2++(Y..Y)), PROFILE
$$ plain form
4406 182 126 184 147 128 211 249 161 229 16 121 109 39 88 315 44 320 72 35 49 174 49 196 126 83 132 79 105 71 97 156
4124 156 285 74 84 73 91 205 51 280 117 59 84 139 67 60 165 159 113 191 22 258 201 128 124 72 85 84 44 71 147 236 131 179
3824 179 188 171 26 153 73 133 36 115 148 251 91 131 69 45 128 46 132 83 56 101 238 122 198 142 48 83 54 160 196 87 65
3533 65 181 110 177 153 56 100 120 170 40 26 50 190 182 184 159 176 113 46 131 165 28 112 265 113 25 174 149 140 46 117 146 96 92 95
3213 95 69 215 426 567 423 462 129 327 753 475 272 134 120 105 21 112 101 216 194 189 127 246 206 88 62 208 288 715
2950 715 285 987 209 464 148 189 169 163 209 123 117 79 104 90 210 212 347 267 1025 953 329 246 156 295 110 107 85 102 234 52
2669 52 151 164 124 70 199 192 106 179 8 223 129 227 188 251 153 71 42 199 228 44 151 119 69 206 165 218 214 44 229 159 89 189
2368 189 119 120 162 120 135 102 249 158 84 210 162 279 96 202 79 202 214 256 282 61 305 225 137 156 240 215 97 136 324 247
$$ packed form
4406A82n6N8l7j9Q3L8q8O8k13J05j2p0M9K27k71K76k48l7J4J25j25J47p0m3M9n3K6l4K6N9
4124A56J29k11J0j1J8J14j54K29j63n8K5N5p2pJ05om6P8j69K36n7p3mn2J3jm0K7P6Q9j05M8
3824A79Rj7j45J27q0O0r7P9L3J03j60M0o2k4Q3q2Q6m9k7M5J37j16P6n6r4L5k9J06L6j09k2
3533F5J16p1O7k4r7M4K0N0j30j4K4J40qKk5J7o3o7Q5L4j37Q4J53j52q8J49k5rr4P1K9n0mL
3213I5k6J46K11J41j44L9l33J98M26k78k03j38j4j5q4R1j1J15k2no2J19m0j18k6J46Q0M27
2950G15m30P02p78K55l16M1k0oM6q6ol8K5j4J20KJ35q0P58p2o24q3r0J39j85lk2J7J32j82
2669E2R9J3m0n4J29pq6P3j71K15r4R8l9O3r8q2k9J57K9j84J07l2n0J37m1N3mj70J85p0p0J00
2368A89p0JM2m2J5l3J47r1p4J26m8J17j83J06j23J23J2M2K6k21K44q0q8J9Q4k5j18L9J88p7
$$ plain form
2087 247 1407 3013 1136 284 237 95 245 170 139 293 206 231 219 319 177 283 322 207 221 194 235 364 248 309 313 343 245
1833 245 303 324 498 183 408 397 451 404 454 470 398 681 643 476 517 528 670 942 833 967 1013 907 756 1073 1298 1996 2544
1579 2544 3427 4062 5305 7725 103708 90440 4639 5739 12056 3113 1560 4552 12561 5197 1258 1726 957 740
1410 740 921 809 455 682 496 542 613 539 568 491 344 438 478 356 417 417 354 350 383 345 289 487 283 293 264 375 210 204 318 291
1129 291 227 358 158 238 247 109 329 227 252 228 188 207 43 373 167 220 139 104 211 222 138 219 240 256 232 104 103 318 324 160
847 160 152 153 120 31 149 131 98 346 107 143 142 143 79 239 111 113 97 98 151 48 295 13 165 134 239 196 228 54 112 145 2 248
547 248 55 51 193 264 127 164 139 119 228 82 71 123 55 119 135 129 99 55 164 157 87 161 90 130 98 149 9 191 30 142 145 76
246 76 123 68 175 218 188 183 107 148 179 93 100 127 200 153 102 19 132 68 244 125 98 131 124 31 64 58 97 113 230 51 90 46 41 172 84
$$ packed form
2087B47J160J606j877q52m7j42J50p5l1J54q7K5j2J00j42J06L9j15J4k7M1J29j16O1ML0r8
1833B45N8K1J74l15K25j1N4m7N0J6p2K83l8j67M1J1J42K72j09J34M6j06j51L17K25O98N48
1579B544Q83O35J243K420R5983j3268q5801J100O317q943j553K992Q009p364l939M68p69k17
1410G40J81j12l54K27j86M6P1p4K9p7j47R4M0j22O1%o3mL3l8n6J98k04J0k9J11j65oJ14k7
1129B91o4J31k00Q0Rj38K20j02K5k4m0J9j64L30k06N3q1l5J07J1q4Q1K1J6k4j28jK15Oj64
847A60qJl3q9J18j8l3K48k39L6jJo4J60j28Kj6JN3j03K47k82J52l1J05m3L2j74N8L3j43K46
547B48j93mJ42P1j37L7k5k0J09j46j1N2o8O4J6ol0m4J09pp0P4p1M0l2N1j40J82j61J12Lo9
246G6M7n5J07M3l0np6M1L1q6PK7P3m7n1q3J13o4J76j19k7L3pr3L3oL9J6J17j79L9m4nJ31q8
$$ plain form
-83 84 173 262 120 116 170 73 176 140 60 140 59 32 88 58 112 155 247 37 159 163 207 138 120 144 308 53 55 194 125 88 139 262 210
$$ packed form
-83H4Q9Q9j42mN4r7J03l6q0Q0q1k7N6l0N4M3R2k10J22MM4o9j8K4J64k55KJ39o9l7N1J23n2
-392B10
##PAGE=	F1=-1528.6
##FIRST=	4405.895418600002813,	4405.895418600002813,	0
##DATA TABLE=	(F2++(Y..Y)), PROFILE
$$ plain form
4406 126 60 125 169 116 89 181 102 146 94 136 67 59 51 283 145 270 12 38 45 159 115 143 98 50 87 116 112 51 115 101 263 60 53 69
4087 69 115 182 46 207 132 86 51 86 54 69 144 114 66 158 25 258 210 135 81 101 37 82 24 75 157 200 150 129 155 136 23 150
3786 150 120 82 28 61 131 217 66 123 81 61 73 26 109 99 96 78 191 99 225 125 83 64 84 175 179 96 44 137 101 201 139 31 55
3476 55 75 125 66 32 29 150 148 161 140 170 100 59 106 132 44 90 220 135 13 168 143 105 30 113 101 103 84 71 111 160 503 663 568 516
3157 516 144 421 807 387 240 109 129 92 49 154 104 224 118 143 76 294 194 82 47 243 302 779 345 999 226 518
2913 518 136 164 97 142 223 75 111 44 99 91 178 201 326 336 979 1021 308 257 155 251 121 101 59 87 163 15 103 97 112 48 127 135
2612 135 59 143 55 214 67 184 181 174 154 40 30 174 191 7 84 81 28 175 140 134 183 113 197 129 96 135 138 77 104 80 104 71 169 142
2293 142 33 174 120 239 53 137 102 161 168 201 227 106 268 164 138 97 195 158 123 96 337 376 1701 3753 1365 143 224
$$ packed form
4406A26o6O5M4n3k7R2p9M4n2M2o9qqK32j38J25k58K6PJ14m4K8m5m8L7K9mo1O4j4J62k03pJ6
4087F9M6O7j36J61p5m6l5L5l2J5P5l0m8R2j33K33m8p5n4K0o4M5n8N1Q2M3n0k1K6j9j13J27
3786A50l0l8n4L3P0Q6j51N7m2k0J2m7Q3j0lj8J13r2J26j00m2j9K0R1Mq3n2R3l6J00o2j08K4
3476E5K0N0n9l4lJ21kJ3k1L0p0m1M7K6q8M6J30q5j22J55k5l8p5Q3j2Kj9j3M0M9L43J60r5n2
3157E16l72K77L86m20j47j31K0l7m3J05n0J20j06K5o7K18j00j12l5J96N9M77m34O54p73K92
2913E18l82K8o7M5Q1j48L6o7N5qQ7K3J25J0O43M2p13n1j02R6j30k0m2K8P6j48Q8oJ5o4P9Q
2612A35p6Q4q8J59j47J17lpk0j14j0J44J7j84P7ln3J47l5oM9p0Q4o8l3L9Lo1K7k4K4l3R8k7
2293A42j09J41n4J19j86Q4l5N9PL3K6j21J62j04k6m1R8l7l5k7K41L9J325K052k388j222Q1
$$ plain form
2040 224 72 119 60 24 163 101 114 76 223 196 156 180 128 94 53 121 226 126 150 208 178 131 157 148 319 72 221 212 282 252 279 225
1739 225 206 389 401 206 275 297 428 581 448 531 552 478 326 693 765 1195 1452 1882 2068 2780 3546 58667 51277 1064
1514 1064 2758 3637 1586 1410 2240 10217 4809 1103 1482 547 459 585 505 177 431 295 342 378 256 339 257 202 289 362
1288 362 139 249 254 193 191 251 198 124 333 132 200 211 265 104 96 241 196 109 222 97 144 173 5 230 174 151 139 144 118 57 255
997 255 93 120 48 77 161 177 102 164 123 153 166 102 189 274 220 112 82 87 73 46 90 80 74 266 78 98 119 129 44 170 107 41 38 19
678 19 124 14 256 51 120 88 221 187 224 49 90 77 88 208 22 70 152 237 152 155 65 76 164 106 58 78 41 89 107 86 92 61 130
368 130 114 71 158 21 130 72 93 17 179 61 84 105 46 96 60 193 194 120 170 130 129 217 150 35 121 120 125 87 41 101 61 199 154 60
49 60 77 112 58 56 5 53 63 192 31 76 44 20 142 58 101 205 97 129 155 100 151 75 12 82 42 31 71 50 127 102 171 37 107 116
$$ packed form
2040B24j52M7n9l6J39o2J3l8J47k7m0K4n2l4m1O8J05j00K4N8l0m7K6rJ71k47J49rP0l0K7n4
1739B25j9J83J2j95O9K2J31J53j33Q3K1p4j52L67P2M30K57M30J86P12P66N5121p390n0213
1514A064J694Q79k051j76Q30P977n408l706L79r35q8J26q0l28K54j36M7L6j22Q3q2n5Q7P3
1288C62k23J10No1kO0n3p4K09k01O8J1N4j61qJ45m5q7J13j25M7K9j68K25n6k3j2Nk6o1J98
997B55j62K7p2K9Q4J6p5O2m1L0J3o4Q7Q5n4j08l0Nj4k7M4j0oJ92j88K0K1J0q5J26o3o6lj9
678A9J05j10K42k05O9l2J33l4L7j75M1j3J1J20j86M8Q2Q5q5Lr0J1Q8n8m8K0l7M8J8k1Ol1O9
368A30j6m3Q7j37J09n8K1p6J62j18K3K1n9N0l6J33Jp4N0m0jQ8o7j15Q6jNl8m6O0m0J38m5r4
49F0J7L5n4kn1M8J0J29j61M5l2k4J22q4M3J04j08L2K6n5N1p6o3P0m0j1M0k1P7k5O9j34P0R
$$ plain form
-270 116 211 128 84 136 216 33 21 147 108 13 125 172 97
$$ packed form
-270A16R5q3m4N2Q0j83j2J26l9r5J12M7p5
-392I7
##PAGE=	F1=-1547.38
##FIRST=	4405.895418600002813,	4405.895418600002813,	0
##DATA TABLE=	(F2++(Y..Y)), PROFILE
$$ plain form
4406 145 8 72 168 101 78 98 110 63 155 151 26 87 82 243 245 196 42 46 41 146 179 79 66 17 102 146 106 60 125 75 227 144 27
4096 27 68 148 160 67 120 161 107 24 32 39 84 118 98 29 120 45 230 214 125 50 135 67 85 13 81 171 142 164 75 108 110 52 124 178 89 23
3758 23 20 135 180 57 103 94 110 52 77 96 112 125 66 140 60 242 123 104 42 141 181 162 144 23 118 81 206 112 43 24 27 74 117 40
3439 40 9 117 110 126 121 159 82 80 70 103 77 88 166 157 25 149 121 67 29 97 44 123 79 34 127 84 545 781 661 514 147 442 637
3129 637 184 220 162 127 75 62 184 131 209 45 153 84 301 169 72 42 258 294 800 415 972 332 586 160 142 40 117 227
2866 227 71 106 13 132 111 153 196 287 479 855 1019 351 280 152 207 140 85 120 68 80 48 46 30 92 73 39 81 54 93 94 186 71
2565 71 134 178 98 137 143 59 139 144 29 17 37 58 141 100 46 140 179 164 87 166 147 160 79 35 29 87 76 103 106 23 112 59 193 39 59 175
2227 175 133 105 129 157 190 219 94 132 60 124 77 146 133 321 431 1797 4296 1520 518 281 228 65 124 116 56 147 69 118 138
$$ packed form
4406A45j37O4R6o7k3K0J2m7R2mj25O1nJ61Km9j54MnJ05L3j00j3m9Q5M4m0m6O5n0J52q3j17
4096B7M1Q0J2r3N3M1n4q3QPM5L4k0o9R1p5J85j6q9p5Q5o8J8p2O8R0k9K2q9L3Kn8P2N4q9o6
3758B3lJ15M5j23M6rJ6n8K5J9J6J3n9P4q0J82j19j9o2R9M0j9j8j21R5l7J25r4o9j9LM7M3p7
3439D0l1J08pJ6nL8p7kj0L3k6J1P8rj32J24k8n4l8O8n3P9m4m5R3m3M61K36j20j47l67K95J95
3129F37m53L6n8l5n2j3J22n3P8j64J08o9K17j32r7l0K16L6N06l85N57o40K54m26j8j02P7J10
2866B27j56L5r3J19k1M2M3R1J92L76J64o68p1j28N5o7n5L5n2J2l2kj6O2j9l4M2k7L9JR2j15
2565G1O3M4q0L9Oq4Q0Nj15j2K0K1Q3m1n4R4L9j5p7P9j9J3q1m4oN8j1K7Lq3Q9n3J34j54K0J16
2227A75m2k8K4K8L3K9j25L8p2O4m7O9j3J88J10J366K499k776j002k37n3j63N9qo0R1p8M9K0
$$ plain form
1955 138 256 22 23 82 59 96 82 74 56 112 123 36 94 7 80 115 115 54 71 115 106 71 129 68 82 143 137 50 102 137 180 28 37 49 152 158
1617 158 212 143 205 186 106 183 47 1217 4944 4850 3035 5467 4419 1841 1995 536 7167 4031 975 1088 168 697
1410 697 380 218 130 141 100 105 106 53 111 21 139 155 227 95 57 85 34 92 90 36 92 152 38 153 183 173 31 124 153 78 60 68 91
1101 91 101 112 102 108 112 69 54 105 27 100 118 19 31 52 76 86 121 89 103 47 97 79 93 261 223 111 44 10 75 30 78 11 45 68 162
772 162 83 52 84 104 25 85 105 31 22 71 76 55 204 112 65 81 213 170 204 120 43 58 145 141 28 103 105 205 174 180 23 45 114 129 38
443 38 44 88 103 90 42 77 70 72 67 94 142 106 115 63 33 50 153 116 74 123 10 66 31 191 162 105 159 139 109 236 205 43 104 63 111 76
105 76 62 57 46 166 172 24 70 90 80 39 55 49 17 134 45 79 40 29 100 37 105 168 69 146 116 131 121 16 40 38 89 45 61 41 161
-223 161 47 83 61 60 80 201 110 153 156 147 106 8 104 77 81 111 69 60
$$ packed form
1955A38J18k34JN9k3L7j4qj8N6J1q7N8q7P3L5%o1J7M4rl5N8o1J4O1oq7N2L5M3j52RJ2J03O
1617A58N4o9O2j9q0P7j36J170L727r4j815K432j048k578J54j459O631l136l056J13r20N29
1410F97l17j62q8J1m1NJn3N8r0J18J6P2j32l8K8n1N8kn4N6O0j14J15L0j0j42R3K9p5j8QK3
1101I1J0J1j0OMm3j5N1p8P3J8r9J2K1K4J0L5l2J4n6N0j8J4J68l8j12o7l4O5m5M8o7L4K3R4
772A62p9l1L2K0p9O0K0p4rM9Nk1J49r2m7J6J32m3L4q4p7J5Q7mj13P5KJ00l1Oj57K2O9J5r1
443C8OM4J5j3m8L5pKnK7M8l6Rn2l0J7J03l7m2M9j13N6l5J60k9n7N4k0l0J27l1j62O1m1M8l5
105G6j4nj1J20Oj48M6K0j0m1J6ol2J17q9L4l9j1P1o3O8O3r9P7l0J5j0j05K4kN1m4J6k0J20
-223A61j14L6k2jK0J21r1M3Lrm1r8R6k7ML0m2r
-392F0
##PAGE=	F1=-1566.16
##FIRST=	4405.895418600002813,	4405.895418600002813,	0
##DATA TABLE=	(F2++(Y..Y)), PROFILE
$$ plain form
4406 182 38 46 144 92 175 37 142 57 179 159 37 107 115 210 305 132 56 40 45 142 212 32 54 20 139 165 92 83 122 106 197 204 11
4096 11 66 184 153 90 55 181 112 24 30 50 103 93 114 34 93 56 184 198 107 41 148 114 90 6 88 181 91 154 41 72 99 79 93
3786 93 220 138 26 21 159 150 62 87 115 148 62 139 115 124 139 98 108 22 240 126 118 30 187 184 161 191 36 128 50 188 92 66 66 45
3467 45 30 145 53 41 106 76 86 107 144 73 105 54 80 112 93 118 171 43 125 97 35 49 73 18 138 87 26 121 12 574 882 709
3166 709 447 130 381 287 263 225 236 119 76 58 190 150 179 6 215 133 273 143 67 55 252 269 757 477 890 457 631
2913 631 190 119 74 105 208 97 106 26 154 120 142 196 242 616 737 946 423 311 142 182 154 70 164 59 26 80 37 31 86 111
2631 111 33 69 84 53 107 156 138 102 174 102 113 207 93 117 107 51 78 37 91 125 70 41 99 216 153 62 229 197 181 106 22 22 95 106
2312 106 86 71 65 53 29 166 79 52 245 140 54 93 105 245 187 85 138 95 58 36 187 215 300 413 1676 4069 1384 738
$$ packed form
4406A82j44QR8n2Q3j38J05q5J22k0j22P0QR5R5j73p6j6NR7P0j80K2l4J19K6p3rL9j6R1Pj93
4096A1N5J18l1o3l5J26o9q8OK0N3j0K1q0N9l7J28J4r1o6J07l4k4q4Q2R3r0O3j13L1K7k0J4
3786I3J27q2j12nJ38rq8K5K8L3q6P7k4RJ5m1J0q6K18j14qq8J57lk3L0j55R2p8J38r6k6%k1
3467D5j5J15r2j2O5l0J0K1L7p1L2n1K6L2j9K5N3j28Q2k8o2J4K4n5J20n1o1R5j09N62L08j73
3166G09k62l17K51r4k4l8J1j17m3j8J32m0K9j73K09q2J40j30p6j2J97J7M88k80M13m33J74
2913F31m41p1m5L1J03j11Rq0J28l4K2N4M6L74J21K09n23j12j69M0k8q4R4j05l3N4m3oN5K5
2631A11p8L6J5l1N4M9j8l6P2p2J1R4j14K4j0n6K7m1N4L4n5k9N8J17o3r1J67l2j6p5q4%P3J1
2312A06k0j5oj2k4J37q7k7J93j05q6L9J2J40n8j02N3m3l7k2J51K8Q5J13J263K393k685o46
$$ plain form
2049 738 310 322 136 195 184 93 225 172 233 100 276 89 98 100 147 191 169 66 110 211 121 153 181 101 227 59 167 162 154 138 109
1758 109 82 289 174 218 94 309 228 196 101 239 288 344 284 374 480 179 278 509 724 1140 1624 1824 3685 34143 30086
1523 30086 3260 5052 4967 1896 2024 1284 4184 2926 902 745 372 1030 467 224 318 80 168 87 130 256 113 178
1317 178 225 147 158 246 84 80 153 157 42 71 222 91 135 189 185 175 133 199 110 39 140 45 121 164 132 161 39 86 99 54 94 44 128
1007 128 19 51 106 115 102 29 96 127 84 134 127 38 76 287 180 38 32 77 118 37 97 76 83 57 79 113 34 61 79 51 58 109 71 57 147
678 147 48 94 167 157 29 101 214 158 178 196 40 108 146 79 36 121 79 172 183 212 66 61 96 135 32 39 134 135 92 23 72 73 10 38 119
349 119 134 186 82 63 41 75 130 141 111 163 26 58 13 165 140 137 157 122 96 236 233 105 90 58 114 86 77 21 36 150 173 16 100
40 100 69 89 29 102 87 29 88 56 104 45 43 77 31 157 168 41 167 63 150 109 95 49 60 118 61 57 30 187 63 24 60 26 67 187
$$ packed form
2049G38m28J2j86N9j1r1J32n3O1j33J76j87RKM7M4k2j03M4J01r0L2K8q0J26j68J08nqj6k9
1758A09k7K07j15M4j24K15q1l2r5J38M9N6o0R0J06l01R9K31K15M16M84K00J861L0458m057
1523C0086k6826J792q5l071J28p40K900j258k024j57l73O58n63k43R4k38Q8q1M3J26j43O5
1317A78M7p8J1Q8j62mP3Mj15K9J51j31M4N4mj0m2O6q9p1J01r5P6M3l2K9j22M7J3m5M0n0Q4
1007A28j09L2N5Rj3p3O7L1m3N0pq9L8K11j07j42oM5M1q1O0k1Pk6K2L4p9K7J8k8PN1l8j4R0
678A47r9M6P3j0j28P2J13n6K0J8j56O8L8o7m3Q5m2R3J1K9j46nL5L9j03PR5Jm3o9M9Jo3K8Q1
349A19J5N2j04j9k2L4N5J1l0N2j37L2m5J52k5lK0l5k6J40lj28j5l2N6k8rn6J5J14K3j57Q4
40A00l1K0o0P3j5n8N9l2M8n9kL4m6J26J1j27J26j04Q7m1j4m6J1N8n7mk7J57j24l9L6l4M1J20
$$ plain form
-280 187 101 197 205 133 141 22 71 56 127 106 20 139
$$ packed form
-280A87q6R6Qp2Qj19M9j5P1k1q6J19
-392A39
##PAGE=	F1=-1584.94
##FIRST=	4405.895418600002813,	4405.895418600002813,	0
##DATA TABLE=	(F2++(Y..Y)), PROFILE
$$ plain form
4406 181 56 31 113 95 222 16 137 78 165 156 69 112 106 184 310 98 40 22 59 140 206 29 49 43 158 174 78 91 98 130 180 220 3
4096 3 62 211 165 94 36 177 103 31 79 76 116 63 122 44 83 57 130 154 87 19 132 138 88 16 95 177 70 121 34 78 96 97 74 232 167
3767 167 31 27 182 132 67 85 137 158 61 190 155 135 139 136 105 62 214 120 134 45 211 188 163 214 73 133 14 149 86 75 97 78
3467 78 5 142 71 71 99 53 39 95 122 80 126 65 66 139 76 80 175 68 100 78 7 57 61 42 138 100 83 115 42 594 957 738 333 103
3148 103 249 303 637 252 287 113 104 35 169 140 144 45 290 175 229 125 67 64 223 245 649 507 755 547 629 200 88 105 105
2875 105 160 98 104 37 141 104 131 196 206 692 718 813 451 333 124 169 152 56 163 61 39 82 69 49 101 140 73 71 92 38 92 129
2575 129 183 109 168 146 89 222 110 109 81 70 128 47 94 124 58 74 68 214 145 67 255 228 189 104 43 40 94 117 77 48 87 11 37 157
2256 157 97 84 279 162 22 107 70 254 165 117 162 123 24 64 232 273 288 345 1615 3250 978 770 269 343 158 202 177 122
$$ packed form
4406A81j25k5Q2j8J27k06J21n9Q7rq7M3oP8J26k12n8j8L7Q1O6j77K0oJ15J6r6J3PL2N0M0k17
4096CN9J49m6p1n8J41p4p2M8lM0n3N9p8L9k6P3K4o7o8J13On0p2P9Q2j07N1q7M4J8Jk3J58o5
3767A67j36mJ55n0o5J8N2K1r7J29l5k0Mll1m3J52r4J4q9J66k3k5N1j41O0j19J35o3j1K2j9
3467G8p3J37p1%K8m6j4N6K7m2M6o1JP3o3MR5j07L2k2p1N0Mj9R6l8j7L2p3N52L63k19m05k30
3148A03J46N4L34l85L5j74ro9J34k9Mr9K45j15N4j04n8lJ59K2M04j42K48k08Q2m29j12J7%
2875A05N5o2Oo7J04l7K7O5J0M86K6R5l62j18k09M5j7r6J07j02k2M3j3k0N2L9o7kK1n4N4L7
2575A29N4p4N9k2n7J33j12jk8j1N8q1M7L0o6J6oJ46o9p8J88k7l9q5o1lN4K3m0k9L9p6K6J20
2256A57o0j3J95j17j40Q5l7J84q9m8M5l9r9M0J68M1J5N7J270J635k272k08n01P4j85M4k5n5
$$ plain form
1993 122 244 230 280 80 218 131 152 85 170 209 209 103 101 238 117 206 208 124 286 120 121 212 169 169 117 124 316 194 303 104 332
1702 332 297 213 146 348 348 461 339 424 558 307 387 742 928 1478 1920 2205 3934 44655 39577 2187 2803 3502 1429
1486 1429 1441 1565 1829 1682 775 525 473 1127 499 256 351 164 192 116 187 299 125 221 258 140 121 276 112 89 211 169 101
1232 101 85 268 144 157 206 188 207 171 208 99 65 168 87 123 201 155 155 62 84 122 61 81 51 120 45 68 156 128 125 41 108 153 117 186
913 186 138 61 57 259 134 26 67 115 137 51 95 126 118 18 43 124 41 62 51 73 95 110 67 65 190 65 115 150 170 29 98 210 151
603 151 160 259 93 122 96 33 41 115 74 141 167 213 79 71 80 120 37 56 158 144 93 11 83 65 40 38 117 139 230 37 56 79 84 115 122 131 181
256 181 52 73 57 118 121 155 153 81 84 220 228 138 89 54 115 118 88 45 36 137 154 47 125 49 86 36 131 108 52 91 48 128 61 43 77 38
-83 38 178 179 59 179 9 148 122 145 22 79 117 80 52 22 187 89 32 25 8 62 168 91 184 246 127 130 34 51 57 126 90 39 175
$$ packed form
1993A22J22j4N0k00J38q7K1o7Q5L9%j06kJ37j21Q9Kq4J62j66JR1m3%n2PJ92j22J09j99K28
1702C32l5q4o7K02%J13j22Q5J34k51Q0L55J86N50M42K85J729M0721n078l7390O16O99k073
1486A429J2J24K64j47r07k50n2O54o28k43R5j87K8p6P1J12j74R6L7j18j9J55j64k3J22m2o8
1232A01j6J83j24J3M9j8J9l6L7j09l4J03q1L6P8m6%r3K2L8o1K0l0O9p5K3Q8k8lq4O7M5l6O9
913A86m8p7mK02j25j08M1M8K2q6M4L1qj00K5Q1q3K1j1K2K2J5m3kJ25j25N0L5K0j41O9J12n9
603A51RR9j66K9k6o3QP4m1O7K6M6j34qRM0q3J9J02j4n1q2P2j8k5kP9K2R1j93J9K3NL1PRN0
256A81j29K1j6O1LL4kp2LJ36Qr0m9l5O1Ll0m3rJ01J7j07P8p6L7n0R5k3n6L9m3Q0o7j8L4l9
-83C8J40Jj20J20j70J39k6K3j23N7L8l7k8l0J65r8n7pj7N4J06p7R3O2j19Lr6J7OO9l6n1J36
-392A75
##PAGE=	F1=-1603.72
##FIRST=	4405.895418600002813,	4405.895418600002813,	0
##DATA TABLE=	(F2++(Y..Y)), PROFILE
$$ plain form
4406 147 79 8 103 110 215 31 95 91 123 143 91 102 65 165 265 95 10 30 81 128 168 58 40 72 160 180 79 91 54 131 169 194
4105 194 4 59 219 187 79 43 153 92 35 119 100 121 28 112 47 82 56 76 89 61 26 97 139 80 34 99 158 77 99 36 107 98 103 78
3786 78 210 165 35 53 192 126 64 96 154 144 76 225 192 144 134 158 122 129 171 105 157 72 212 190 156 212 115 120 31 96 82 74 110 102 34
3458 34 113 93 92 93 44 20 82 100 97 138 77 91 154 33 46 178 111 73 66 31 47 93 48 128 109 139 148 68 591 991 761 202 100 77
3138 77 751 981 283 304 118 143 15 130 103 124 124 353 232 184 120 76 63 184 241 506 479 596 581 574 189 54 113 111 88 65
2857 65 95 45 93 76 111 193 183 682 765 650 403 330 111 151 130 47 119 72 49 62 92 45 121 153 80 61 76 46 56 104 192 140 166
2547 166 171 75 197 110 102 51 111 154 43 81 130 68 81 55 184 126 85 245 224 177 68 48 57 72 103 53 33 102 10 26 154 87 93 275
2227 275 186 31 126 43 224 139 134 196 130 42 78 265 288 285 264 1827 2612 570 654 174 316 127 178 110 141 224 236 269 94 100
$$ packed form
4406A47o8p1R5PJ05j84O4mL2K0n2J1l7J00J00j70q5K0N1M7M0j10j8L2Q8K0j01J2l7P7L8K5
4105A94j90N5J60l2j08l6J10o1n7Q4j9K1r3Q4o5L5k6K0J3k8l5P1M2n9m6O5N9q1K2o3P1rNk5
3786G8J32m5j30J8J39o6o2L2N8j0o8J49l3m8j0K4l6PM2o6N2q5J40k2l4N6r7Nq9O5j4qL6qo8
3458C4P9k0jJm9k4O2J8lM1o1J4O3j21J3J32o7l8pl5J6M6m5Q0j9L0Rq0N23M00k30n59j02k3
3138G7O74K30o98K1j86K5j28J15k7K1%K29j21m8o4m4j3J21N7K65k7J17j5pl85j35N9kk3k3
2857F5L0n0M8j7L5Q2j0M99Q3j15k47p3k19M0k1q3P2m7k3J3L0m7P6L2p3j9J5l0J0M8Q8n2K6
2547A66Nr6J22q7qn1O0M3j11L8M9o2J3k6J29n8m1J60k1m7j09k0RJ5L1n0k0O9r2J6J28o7OJ82
2227B75q9j55R5q3J81q5nO2o6q8L6J87K3lk1J563P85k042Q4m80J42j89N1o8L1Q3J2L3j75O
$$ plain form
1946 100 130 155 63 137 167 200 87 33 191 97 191 165 115 260 133 57 182 101 129 67 80 213 128 247 20 222 246 115 79 287
1664 287 213 365 179 280 431 250 236 544 561 1052 1252 1425 2359 31145 28145 720 1264 1812 681 526 1127 394
1457 394 548 554 402 370 990 425 211 282 189 121 40 128 206 47 155 217 86 65 201 59 41 195 103 118 26 234 166 128 184
1185 184 222 219 148 157 111 61 153 68 106 185 139 101 69 107 104 32 52 29 86 75 76 170 100 146 57 132 154 178 190 105 63 59 192 86 43 84
847 84 126 126 65 76 144 135 42 44 113 58 86 24 97 120 118 36 67 200 88 123 145 153 47 71 199 146 174 303 140 87 23 25 56 93 69 116
509 116 131 178 65 56 46 89 44 88 164 126 83 47 107 51 74 64 87 145 236 39 39 97 80 106 64 124 171 70 85 95 63 93 154 139 35
180 35 72 190 193 141 100 36 109 163 94 73 47 125 121 99 147 27 73 48 141 111 90 132 37 142 85 41 73 47 159 181 106 179 36 129
-139 129 147 164 30 84 94 98 45 49 171 92 48 33 29 51 140 66 128 266 104 84 54 44 58 92 58 29 169
$$ packed form
1946A00L0K5r2P4L0L3j13n4J58r4R4k6n0J45j27p6J25q1K8o2J3J33q5J19k27K02K4j31l6K08
1664B87p4J52j86J01J51j81j4L08J7M91K00J73R34K8786l000k7425N44N48j131j55O01p33
1457C94J54Oj52l2O20n65k14P1r3o8q1Q8P8j59J08O2j31k1J36j42j8J54r2J5r2K08o8l8N6
1185A84L8lp1Rm6n0R2q5L8P9m6l8l2L8lp2K0k3N7j1JR4p0M6q9P5K2K4J2q5m2mJ33j06m3M1
847H4M2%o1J1O8rr3KO9n5K8o2P3K3kq2L1J33j12L5K2Qj06K4J28n3K8J29j63n3o4KL1L7k4M7
509A16J5M7j13rj0M3m5M4P6l8m3l6O0n6K3j0K3N8R1j97%N8j7K6m2O0M7j01J5J0l2L0O1j5j04
180C5L7J18Ln2m1o4P3N4o9k1k6P8mk2M8j20M6k5R3l0k1M2r5J05n7m4L2k6J12K2p5P3j43R3
-139A29J8J7j34N4J0Mn3MJ22p9m4j5mK2Q9p4O2J38j62k0l0j0J4L4l4k9J40
-392A69
##PAGE=	F1=-1622.5
##FIRST=	4405.895418600002813,	4405.895418600002813,	0
##DATA TABLE=	(F2++(Y..Y)), PROFILE
$$ plain form
4406 113 108 29 125 134 172 53 43 117 71 125 100 80 56 149 189 106 20 67 108 103 116 89 36 96 157 188 100 107 3 119 153 142 18 72 204
4077 204 209 55 49 119 89 41 143 116 122 21 92 53 85 59 30 27 27 79 61 127 67 52 102 133 90 134 36 130 100 94 91 169 139 33 95 190
3739 190 123 59 114 164 119 121 240 214 148 134 165 141 188 128 87 181 98 198 189 144 193 153 94 65 40 73 74 107 125 56 80 110 107 113 48 66
3401 66 74 85 112 140 79 144 158 23 14 191 165 48 64 67 27 137 34 118 112 178 205 70 543 961 767 83 140 100 1120 1214 297
3110 297 289 125 176 58 92 53 139 202 383 300 146 124 93 55 154 252 397 385 449 556 483 161 56 110 115 10 18 82 61 27 58 86
2810 86 185 162 589 761 503 299 301 117 125 96 51 50 83 50 43 112 45 127 149 68 80 48 65 15 74 172 172 169 175 76 157 99 91 13 164 161 40
2462 40 94 141 99 76 60 145 102 103 216 190 144 14 66 85 40 73 69 20 117 22 11 146 63 87 241 208 73 139 62 176 117 130 224
2152 224 138 64 76 271 265 283 215 2090 2708 635 471 71 276 73 183 21 193 212 210 230 149 54 114 140 127 89 119 172 52
$$ packed form
4406A13np9R6RL8j19j0P4m6N4k5k0k4R3M0q3q6M7M1nJ3k7n3O0O1L1q8Pj04J16L4j1j24N4J32
4077B04Nj54oP0l0m8J02k7Oj01P1l9L2k6k9l%N2j8O6o0j5N0L1m3M4r8R4l0olP8l0j06O2R5
3739A90o7o4N5N0m5KJ19k6o6j4L1k4M7o0m1R4q3J00rm5M9m0n9k9k5L3JL3J8o9K4L0lOo5J8
3401F6QJ1K7K8o1O5J4j35rJ77k6j17J6Lm0J10j03Q4oO6K7j35M73M18j94o84N7m0J020R4r17
3110B97qj64N1j18L4l9Q6O3J81q3j54k2l1l8R9R8J45j2O4J07p3l22j05N4Nj05QO4k1l4L1K8
2810H6R9k3M27J72k58k04Kj84Qk9m5jL3l3pO9o7Q2K2q1J2l2J7n0N9R8%lOr9Q1n8qp8J51lj21
2462D0N4M7m2k3j6Q5m3JJ13k6m6j30N2J9m5L3mm9R7r5j1J35q3K4J54l3j35O6p7J14n9J3R4
2152B24q6p4J2J95oJ8o8J875O18k073j64m00K05k03J10j62J72J9kK0q1r5O0K6j3l8L0N3j20
$$ plain form
1880 52 81 119 118 152 85 151 188 149 176 117 32 90 64 52 60 42 121 138 70 134 60 103 129 38 168 127 136 217 163 30 126 68 278 173 171
1551 171 804 6097 6966 448 2379 1935 307 361 360 361 277 301 370 162 735 384 216 234 241 126 84 26 47 59 63 142 102 55 76
1279 76 49 115 148 39 122 69 163 171 115 149 288 219 87 82 154 61 140 18 103 135 96 34 62 152 69 14 15 73 52 119 99 165 65 166
960 166 59 153 147 245 164 48 40 74 115 78 83 91 125 101 82 54 138 139 97 66 93 76 117 32 125 127 138 40 78 185 100 127 142 117 69 60 185
612 185 139 212 327 172 26 47 67 64 66 67 99 93 118 43 19 22 49 59 124 165 94 64 100 136 46 97 98 39 141 218 93 16 93 74 97 20
274 20 95 142 81 85 117 49 57 151 114 40 61 151 147 123 107 56 108 202 99 88 61 124 86 152 173 8 55 58 136 109 141 168 59 144 109 54
-64 54 60 50 117 179 143 167 65 99 167 164 88 96 65 112 41 92 164 79 68 94 61 37 102 32 75 264 92 33 71 45 47 64 31 25 143
$$ packed form
1880E2K9L8jL4o7O6L7l9K7n9q5N8k6j2Qj8P9J7o8O4p4M3K6r1J30m1RQ1n4j33R6n8K10j05k
1551A71O33N293Q69o518J931m44j628N4jJq4K4O9k08N73l51j68J8Pj15m2n8K1J2MP9m0m7K1
1279G6k7O6L3j09Q3n3R4Qn6L4J39o9j32nP2r3P9j22Q5L2l9o2K8R0q3n5JN8k1O7k0O6j00J01
960A66j07R4oR8q1j16qL4M1l7NQL4k4j9k8Q4Jm2l1K7j7M1q5R3KJ1r8L8J07q5K7J5k5m8rJ25
612A85m6P3J15j55j46K1K0lKJL2oK5p5k4LK7J0O5M1p1l0L6L6r0N1Jn9J02P7j25p7P7j9K3p7
274B0P5M7o1ML2o8QR4l7p4K1R0mk4j6n1N2R4j03j1k7O3l8O6K1j65M7LP8k7L2K7j09Q5l5n5
-64E4Oj0O7O2l6K4j02L4O8lp6Ql1M7p1N1P2q5j1K6l3k4O5p0M3J89j72n9L8k6KJ7l3oJ18
-392A43
##PAGE=	F1=-1641.28
##FIRST=	4405.895418600002813,	4405.895418600002813,	0
##DATA TABLE=	(F2++(Y..Y)), PROFILE
$$ plain form
4406 112 125 62 150 155 121 64 38 146 19 104 97 61 104 128 109 118 30 101 138 67 69 108 47 103 164 203 128 140 50 111 131 82 42 100 174 221
4068 221 29 57 91 83 51 150 122 122 40 71 65 84 62 9 57 16 120 40 111 56 70 106 111 102 193 31 140 97 69 99 128 104 19 133 182
3739 182 117 58 132 166 96 166 235 212 146 143 164 150 220 101 79 199 117 177 182 129 165 173 68 89 31 57 81 100 150 63 75 116 117 157 62
3411 62 105 77 81 117 132 76 190 154 74 24 214 221 33 67 94 27 164 12 117 110 190 252 62 437 847 719 45 191 249 1344
3129 1344 1310 279 253 121 196 107 68 11 168 237 363 336 122 131 102 47 142 256 399 245 338 496 390 123 87 107 118 67 58
2857 58 70 80 39 59 61 172 133 438 657 419 224 251 132 97 60 68 19 86 53 54 136 64 111 123 71 140 22 89 17 39 137 185 171
2547 171 168 80 123 90 76 27 208 151 45 133 161 139 83 71 119 81 115 191 133 93 42 99 119 15 34 126 37 125 35 49 126 41 78 194
2227 194 217 115 151 104 130 112 115 230 157 80 69 241 218 271 242 2115 2975 932 296 27 238 38 217 70 256 225 176 189
$$ packed form
4406A12J3o3Q8Nl4n7k6J08j27Q5pl6M3K4j9Rq8P1L7p1KL9o1N6O1L9p5J2r0O1K0m9m0N8P4M7
4068B21j92K8L4ql2R9k8%q2L1oJ9k2n3M8m1J04q0P1n5J4L6NrR1j62J09m3k8L0K9k4q5J14M9
3739A82o5n9P4L4p0P0O9k3o6lK1j4P0j19k2J20q2O0Nn3L6Qj05K1n8K6K4J9N0q7J2M1JM0r5
3411F2M3k8ML6J5n6J14l6q0n0J90Pj88L4K7o7J37j52J05pQ0O2j90L75M10j28o74J46N8J095
3129A344l4j031k6j32P5q9l9n7J57O9J26k7k14Rk9n5R5J14J43j54R3J58j06k67l6K0J1n1r
2857E8J2J0m1K0KJ11l9L05K19k38j95K7j19l5l7Qm9O7l3JQ2p2M7J2n2O9j18O7p2K2R8M8j4
2547A71lq8M3l3j4m9J81n7j06Q8K8k2n6j2M8l8L4P6n8m0n1N7K0j04J9R2q9Q8r0J4P7q5L7J16
2227A94K3j02L6m7K6j8LJ15p3p7j1J72k3N3k9J873Q60k043o36k69K11k00J79j47J86l1m9J3
$$ plain form
1964 189 190 152 107 143 199 75 127 141 64 162 84 161 128 17 206 117 179 279 72 104 127 130 121 95 61 87 254 129 33 163 207 32
1664 32 204 53 330 247 114 213 252 259 606 446 778 835 2152 16372 13691 944 2723 2337 726 903 318 363 649
1448 649 126 394 33 504 426 273 251 312 241 187 102 103 124 123 84 175 100 51 120 218 123 121 123 145 123 170 135 127 339 212 40 41 197
1138 197 76 155 31 113 83 62 24 58 187 40 43 17 136 41 171 120 157 58 174 56 157 151 293 131 13 9 72 76 116 127 93
847 93 118 81 96 41 124 133 126 101 81 82 138 52 142 124 155 72 88 160 104 124 130 80 84 92 175 130 247 330 184 65 90 103 48 46 85 84 65 54
490 54 33 29 62 20 85 148 160 66 41 142 160 63 114 126 12 123 191 139 23 71 75 80 91 52 103 86 75 118 91 39 156 83 69 50 110
162 110 107 98 99 96 119 224 104 90 72 134 60 188 197 32 36 66 120 114 186 182 94 136 129 74 43 41 82 179 161 146 77 70 170 157 138 120 43 117
-195 117 46 131 175 61 87 139 99 41 57 16 88 249 114 53 79 45 27 71 39 48 120
$$ packed form
1964A89Jl8m5L6N6j24N2J4p7R8p8P7l3j11J89q9O2J00k07L2K3Lrk6l4K6J67j25r6J30M4j75
1664C2J72j51K77q3j33R9L9PL47j60L32N7J317J4220k681j2747J779l86j611J77n85M5K86
1448F49n23K68l61M71p8j53k2O1p1n4q5JK1jl9R1p5m9O9R8r5kKK2k2M7l5qK12j27j72JJ56
1138A97j21P9j24Q2l0k1l8L4J29j47Lk6J19r5J30n1L7r9J16j18J01oJ42j62j18mO3MM0J1l4
847I3K5l7J5n5Q3Rpk5k0JN6q6R0j8L1q3J6P2n6K0On0MQQ3m5J17Q3j46j19K5J3n5kL9jj9j1
490E4k1mL3m2O5O3J2r4k5J01J8r7N1J2j14J11O8n2j16M8MNJ1l9N1j7j1M3k7n2J17p3j4j9O0
162A10lrJlK3J05j20j4j8O2p4J28Rj65ML0N4oP2mq8M2pn5l1kM1R7j8j5o9pJ00j3j9j8p7P4
-195A17p1Q5M4j14K6N2m0n8J6m1P2J61j35o1K6l4j8M4l2RP2
-392A20
##PAGE=	F1=-1660.06
##FIRST=	4405.895418600002813,	4405.895418600002813,	0
##DATA TABLE=	(F2++(Y..Y)), PROFILE
$$ plain form
4406 129 119 82 160 163 87 54 53 155 24 79 86 62 136 101 63 119 34 124 163 26 45 103 60 93 187 222 156 170 89 114 107 33 78 133 145
4077 145 217 11 71 73 69 64 144 117 115 49 48 78 77 62 37 94 67 132 31 93 50 90 114 97 115 238 18 139 91 32 98 109 70 22 155
3749 155 173 106 67 143 160 79 190 213 185 140 157 163 143 217 94 89 204 126 157 168 112 136 170 54 104 64 38 86 95 173 53 95 106 126
3429 126 199 84 131 92 81 107 116 73 210 144 106 59 241 266 56 67 101 51 165 37 121 101 171 268 79 290 658 580 128 229
3148 229 351 1424 1281 230 212 105 198 145 41 47 178 208 298 311 128 136 93 41 138 240 465 149 271 440 335 78 110
2894 110 103 120 123 111 59 97 85 61 39 149 91 269 477 415 282 190 137 68 35 86 66 79 56 73 168 87 75 75 102 207 10 111 34
2584 34 22 104 173 164 159 75 99 90 61 64 223 125 47 169 190 175 102 79 116 62 127 182 66 42 81 127 145 14 12 176 76 116 50 86 92
2256 92 27 74 146 203 141 171 132 98 117 95 207 170 90 60 174 163 241 328 1820 2913 1153 158 59 191 45 233 120 292
$$ packed form
4406A29j0l7P8Lp6l3jJ02j31N5Pk4P4l5l8N6q5R0L9j37J9N8m3L3R4L5o6J4q1K5pp4M5N5J2
4077A45P2k06O0KmnQ0k7ko6jL0jj5k5N7k7O5j01O2m3M0K4j7J8J23k20J21m8n9O6J1l9m8J33
3749A55J8o7l9P6J7q1J11K3k8m5J7Ok0P4j23nJ15p8L1J1n6K4L4j16N0m0k6M8RP8j20M2J1K0
3429A26P3j15M7l9j1K6Rm3J37o6l8m7J82K5k10J1L4n0J14j28Q4k0P0R7j89K11L68p8m52J01
3148B29J22J073j43j051j8j07R3n3j04OJ31L0R0J3j83Qm3n2R7J02K25l16J22J69j05k57L2
2894A10pJ7Lj2n2L8j2k4k2J10n8J78K08o2j33r2n3o9l3N1k0J3k3J7R5q1j2%K7J05j97J01p7
2584C4j2Q2O9rnq4K4rk9LJ59r8p8J22K1j5p3k3L7n4O5N5j16k4L9M6J8j31kJ64j00M0o6L6O
2256I2o5M7P2N7o2L0l9l4J9k2J12l7q0l0J14j1P8Q7J492J093j760r95r9J32j46J88j13J72
$$ plain form
1993 292 236 152 154 186 194 119 158 236 88 165 110 103 200 84 178 122 55 226 79 190 305 69 140 157 163 155 149 75 155 298 206 52 193
1683 193 241 122 277 120 412 315 171 244 334 435 827 748 1166 1148 2778 26467 22566 841 1936 1901 858 988 633
1467 633 105 619 100 389 135 363 438 274 241 345 313 223 150 187 114 190 59 203 108 115 145 285 146 178 105 173 143 151 140 118
1185 118 339 190 65 49 214 85 172 61 111 73 83 31 49 190 33 46 33 182 35 208 120 148 61 161 54 136 165 307
922 307 107 44 27 39 91 146 155 94 102 73 100 44 114 116 117 130 89 73 138 57 138 117 156 81 82 134 104 108 107 55 85 126 174 117 257 314 173
575 173 121 107 118 14 36 114 74 43 34 51 74 98 58 117 151 144 49 22 155 174 94 128 137 59 95 167 170 55 40 80 64 143 20 60 84
246 84 56 98 126 75 164 50 80 39 73 83 74 69 124 133 224 113 85 77 141 46 191 207 65 22 68 96 133 213 168 120 121 142 85 37 27 78
-92 78 178 158 121 76 50 151 145 169 142 35 115 58 160 193 50 92 159 137 61 12 47 121 231 146 90 82 50 23 76 48 67 100
$$ packed form
1993B92n6q4KL2Qp5L9P8j48P7n5pR7j16R4n6o7J71j47J11J15k36P1J7Oqop4Q0J43r2j54J41
1683A93M8j19J55j57K92r7j44P3R0J01L92p9M18j8J630K3689l901k1725J095l5j043J30l55
1467F33n28N14n19K89k54K28P5j64l3J04l2r0p3L7p3P6j31J44r5PL0J40j39L2p3O8l0Qj1k2
1185A18K21j49j25j6J65j29Q7j11N0l8J0n2J8J41j57J3j3J49j47J73q8K8q7J00j07Q2K9J42
922C07k00o3j7J2N2N5Ro1Qk9K7n6P0KJJ3m1j6O5q1Q1k1L9p5JN2l0Mjn2L0M1M8n7J40N7j41
575A73n2j4J1j04K2P8m0l1rJ7K3K4m0N9L4pr5k7J33J9q0L4Rp8L6P2Lj15j5M0j6P9j23M0K4
246H4k8M2K8n1Q9j14L0m1L4J0rnN5RR1j11k8qO4r5J45J6j42m3M6K8L7Q0m5m8JK1n7m8j0N1
-92G8J00k0l7m5k6J01oK4k7j07Q0n7J02L3j43M2O7k2p6m9L5P4J10q5n6ql2k7N3k8J9L3
-392A00
##PAGE=	F1=-1678.84
##FIRST=	4405.895418600002813,	4405.895418600002813,	0
##DATA TABLE=	(F2++(Y..Y)), PROFILE
$$ plain form
4406 137 93 86 152 152 76 25 45 138 56 53 74 85 133 86 87 108 64 134 183 22 44 75 67 81 219 242 177 182 111 122 89 37 120 161 138 199 30
4058 30 92 60 61 78 128 101 97 56 22 89 72 54 64 101 114 111 17 76 49 112 128 93 127 255 15 135 95 24 94 108 49 57 160 164 90 83
3720 83 146 147 62 183 179 138 138 172 169 122 176 88 115 196 123 142 148 88 109 141 56 115 82 23 85 97 189 27 112 82 133 222 110 142 117 79
3382 79 83 93 74 194 132 114 93 267 295 100 60 86 72 145 77 124 85 127 247 123 219 499 336 229 244 401 1386 1166 172 180
3101 180 87 184 163 18 95 157 125 231 228 169 135 67 37 130 210 510 217 245 418 329 31 121 97 121 157 144 51 105 103 66 19 119
2800 119 44 139 292 447 400 127 128 44 36 97 82 68 49 85 204 100 29 28 139 262 35 126 34 61 84 139 150 152 62 72 97 54 95
2490 95 206 84 41 188 222 200 119 82 125 33 153 180 20 68 95 139 157 14 60 201 117 94 63 110 59 19 73 108 164 144 198 135
2190 135 88 118 79 160 159 93 53 76 117 189 423 1287 2518 1270 46 77 128 52 214 133 290 225 139 119 138 174 144 168 232 94
$$ packed form
4406A37m4pO6%p6n1K0R3q2lK1J1M8m7JK1m4P0M9j61K2L1qJ4J38K3o5Np1J1l3n2Q3M1k3O1j69
4058C0O2l2JJ7N0k7mm1l4O7j7j8J0L7J3lr4N9k7O3J6l5L4J28k40J20m0p1P0J4n9QJ03Mp4p
3720H3O3Jq5J21mm1%L4lm7N4q8K7Q1p3J9Oo0K1L2q5N9l3n9O2J2R2j62Q5l0N1Q9j12L2k5l8
3382G9MJ0j9J20o2j8k1J74K8j95m0K6j4P3o8M7l9M2J20j24R6K80j63j07J5J57R85k20r94Q
3101A80r3R7k1j45P7O2l2J06ln9l4o8l0R3Q0L00k93K8J73q9k98R0k4K4L6j3r3N4kl7m7J00
2800A19p5R5J53J55m7k73Jq4qO1j5j4j9L6J19j04p1jJ11J23k27R1r2K7K3N5J1Kr0J0K5m3M1
2490I5J11j22m3J47L4k2q1l7M3r2J20K7j60M8K7M4J8j43M6J41q4k3l1M7n1m0N4L5N6k0N4o3
2190A35m7L0l9Q1jo6m0K3M1P2K34Q64J231j248j224L1N1p6J62q1J57o5q6k0J9L6l0K4O4j38
$$ plain form
1908 94 195 98 140 193 70 160 116 74 197 80 172 253 73 124 138 154 134 114 41 166 265 204 73 137 189 124 223 96 342 258 162
1617 162 188 263 354 685 610 948 724 2182 22089 19021 478 619 971 657 689 524 272 345 63 311 139 260 362
1401 362 202 160 327 307 188 131 194 113 201 38 171 73 118 122 307 194 179 62 146 167 105 119 118 285 148 89 34 204 92 170
1119 170 85 93 103 122 7 30 158 53 25 34 204 35 224 105 136 48 127 55 91 178 287 94 47 48 21 107 150 164 99 83 71 101
819 101 65 116 91 73 146 109 59 114 46 112 111 141 63 63 114 103 76 71 45 79 143 181 100 236 283 142 145 114 102 45 35 133 84 15 68 85
481 85 109 118 105 147 135 110 36 23 136 172 127 137 131 96 64 153 189 89 33 80 72 166 49 44 79 38 64 142 125 166 17 72 42 45 67 52
143 52 23 133 142 205 125 82 77 135 38 160 198 100 19 61 67 167 218 130 132 104 149 82 41 38 85 173 142 93 71 45 116 127 180 153 42 107
-195 107 72 175 206 48 76 152 165 80 27 79 133 222 164 110 90 73 48 59 42 84 77
$$ packed form
1908I4J01r7M2N3j23R0m4m2J23j17R2Q1j80N1J4J6k0k0p3J25R9o1j31O4N2o5R9j27K46q4r6
1617A62K6P5R1L31p5L38k24J458J9907l068j8543J41L52l14L2j65k52P3k82K48j72J21J02
1401C62j60m2J67k0j19n7O3q1Q8j63J33r8M5MJ85j13j5j17Q4K1o2J4jJ67j37n9n5J70j12P8
1119A70q5QJ0J9j15K3J28j05k8RJ70j69J89j19L1q8P9p2L6Q7J09j93m7Jk7Q6M3J4o5j6j2L0
819A01l6N1k5j8P3l7n0N5o8O6jL0p8%N1j1k7nk6L4O4L8q1J36M7j41Ll1j2n7j0R8m9o9N3J7
481H5K4Rj3M2j2k5p4j3J13L6m5J0ol5l2Q9L6j00n6M7qR4j17nL5m1K6P8j7M1j49N5l0LK2j5
143E2k9J10RO3q0m3nN8r7J22L8r8q1M2OJ00N1q8Kk8M5o7m1lM7Q8l1m9k2k6P1J1N3k7j11O5
-195A07l5J03L1j58K8P6J3q5n3N2N4Q9n8n4k0j7k5J1j7M2p
-392G7
##PAGE=	F1=-1697.62
##FIRST=	4405.895418600002813,	4405.895418600002813,	0
##DATA TABLE=	(F2++(Y..Y)), PROFILE
$$ plain form
4406 132 65 72 128 126 74 25 44 99 70 32 66 110 96 106 125 89 107 136 198 59 50 39 67 91 252 256 185 175 117 127 79 65 157 177 157 173
4068 173 60 119 49 84 93 108 76 69 73 42 101 88 38 91 80 145 64 9 72 57 135 145 93 139 243 29 135 123 70 90 104 43 92 150
3749 150 154 74 104 141 129 46 150 137 94 151 181 184 94 107 74 146 178 107 131 126 59 81 92 70 131 79 10 78 106 192 12 113 53 138 221
3420 221 128 137 147 76 50 65 77 147 116 100 124 289 301 146 48 53 84 122 117 125 71 73 197 170 359 563 95 346 231 407 1261 1001
3119 1001 144 164 86 152 156 80 150 120 56 251 155 226 128 56 31 121 194 517 303 236 413 340 10 127 91 121 169 154 45 99 95
2828 95 89 12 85 31 136 169 477 488 73 112 43 53 98 65 61 32 93 234 104 49 70 168 295 70 127 22 99 79 101 140 147 44
2528 44 42 106 62 118 163 39 40 187 244 212 128 80 137 17 192 169 59 126 91 133 151 10 109 201 145 73 71 122 63 28 71 83 109 126
2209 126 227 119 106 110 75 106 123 87 59 36 87 131 485 719 1887 1256 66 87 71 60 174 118 254 197 127 86 63 119 166 168
$$ packed form
4406A32o7PN6kn2m9J9N5k9l8L4M4j4J0J9l6J8K9O2j39rj1K8K4J61Mp1j0n8J0m8j4R2K0k0J6
4068A73j13N9p0L5RJ5l2pMl1N9j3n0N3j1O5q1n5O3j5P8J0n2M6J04k14J06j2n3K0J4o1M9N8
3749A50Mq0L0L7j2q3J04j3m3N7L0Lr0J3l3P2L2p1K4no7K2J1k2O1n2o9O8K8Q6j80J01o0Q5Q3
3420B21r3RJ0p1k6J5J2P0l1j6K4J65J2j55r8NL1L8nQn4KJ24k7J89K04m68K51j15J76Q54k60
3119A001q57K0p8O6Mp6P0l0o4J95r6P1r8p2k5R0P3L23k14o7J77p3l30J17l6L0M8j5j09N4m
2828I5op7P3n4J05L3L08J1m15L9o9J0M5l3mk9O1J41j30n5K1R8J27k25N7j05P7k0K2L9Pj03
2528D4kO4m4N6M5j24JJ47N7l2q4m8N7j20J75k3j10O7l5M2J8j41R9R2n6p2kN1n9l5M3J2K6J7
2209A26J01j08j3Ml5L1J7l6k8k3N1M4L54K34J168o31j190K1j6j1J14n6J36n7p0m1k3N6M7K
$$ plain form
1927 168 199 93 214 136 177 165 60 124 110 71 133 111 139 169 72 79 81 120 79 18 45 129 188 149 83 80 84 66 95 20 171 123 114 153 104
1598 104 103 305 224 341 143 835 7927 7006 359 681 653 323 213 124 463 254 51 177 138 156 225 146 47 281 240 117
1354 117 70 155 243 174 35 103 43 79 91 296 247 133 23 98 171 47 103 128 198 98 89 27 185 119 151 127 70 138 152 55 35 101
1054 101 94 38 27 208 74 221 106 120 35 82 55 46 180 243 93 26 57 92 108 131 157 107 83 70 110 96 127 64 15 148 124 62
753 62 75 38 74 112 119 48 45 94 95 34 30 46 82 143 193 81 188 244 104 132 125 64 86 43 131 106 24 94 120 125 121 146 171 107 62 19 40 92
396 92 154 155 138 112 124 39 150 201 124 64 72 100 164 80 83 81 35 26 140 172 164 19 60 68 27 47 34 26 123 137 176 137 82 76 115 32 101 170 133
30 133 26 46 40 206 205 81 131 89 150 68 41 60 77 166 120 72 78 53 74 103 171 154 59 94 83 181 210 54 45 128 174 90 57 112 122 227
-308 227 167 117 107 108 77 45 27 109 61
$$ packed form
1927A68L1j06J21p8M1j2j05O4j4l9O2k2K8L0r7PKL9m1o1K7Q4N9l9o6lMj8K9p5J51m8rL9m9
1598A04jK02q1J17j98O92P092r21o647L22k8l30j10q9L39k09k03J26l9J8O9p9r9K34m1j23
1354A17m7Q5Q8o9j39O8o0L6J2K05m9j14j10P5P3j24N6K5P0j00ro2J58o6L2k4n7O8J4r7k0O6
1054A01pn6j1J81j34J47j15J4q5M7k7rJ34O3j50o7L1L5J6K3K6n0k4j3M0j4L1o3m9J33k4o2
753F2J3l7L6L8Pp1lM9Jo1mJ6L6O1N0j12J07N6j40K8po1K2m3Q8k5q2P0K6NmK5K5o4m5m3K1N2
396I2O2Jj7k6J2q5J11N1p7o0QK8O4q4Lkm6rJ14L2qj45M1Qm1K0j3qR7J4L9l9n5oL9q3O9O9l7
30A33j07K0oJ66jj24N0m2O1q2k7J9J7Q9m6m8Ok5K1K9O8j7r5L5j1R8K9j56rQ3M6q4l3N5J0J05
-308B27o0n0j0Jl1l2j8Q2m8
-392F1
##PAGE=	F1=-1716.4
##FIRST=	4405.895418600002813,	4405.895418600002813,	0
##DATA TABLE=	(F2++(Y..Y)), PROFILE
$$ plain form
4406 121 54 49 90 93 71 58 81 57 68 34 68 126 40 141 156 72 143 139 211 90 55 47 66 115 277 259 180 154 110 127 67 89 181 178 180 150
4068 150 88 143 37 118 107 88 48 37 96 85 115 128 25 119 41 153 18 33 91 73 155 160 93 144 209 38 135 165 114 87 91 50 113
3758 113 131 140 59 125 129 106 38 103 95 95 175 182 206 68 27 50 172 154 80 120 107 29 53 36 88 156 58 9 74 114 179 42 97 32 139
3429 139 202 131 118 172 76 20 33 74 78 96 75 149 304 286 183 35 48 90 112 150 125 75 59 140 205 555 774 403 469 193 383
3138 383 1059 801 160 158 95 108 130 153 201 111 107 344 185 279 117 88 20 120 218 536 321 220 390 334 41 137 91 114 166 146
2857 146 39 84 77 122 33 59 69 196 126 515 519 49 99 66 69 87 34 69 17 104 250 103 101 127 181 305 104 114 13 121 79 97
2556 97 144 138 28 44 113 77 134 108 39 57 174 242 210 126 73 145 66 227 146 85 170 78 115 128 15 153 181 152 66 75 122 85 46 70
2237 70 75 60 97 251 95 140 97 84 78 81 78 79 140 79 108 495 695 1144 1076 183 83 91 81 149 93 203 161 105 59 46 87 167 161 162 95
$$ packed form
4406A21o7nM1Lk2j3K3k4J1l4L4N8q6J01J5q4P1mP2j21l5qJ9M9J62j8p9k6m4J7o0K2R2lKl0
4068A50o2N5j06Q1j1j9m0j1N9j1L0J3j03R4p8J12j35J5N8j8Q2No7N1O5j71R7L0n1k7Mm1O3
3758A13J8Rq1O6Mk3o8O5q%Q0PK4j38m1K3J22j8p4M0j3p8K4j7N2O8r8m9O5M0O5j37N5o5J07
3429A39O3p1j3N4r6n6J3M1MJ8k1P4J55j8j03j48J3M2K2L8k5n0j6Q1O5L50K19l71O6k76J90
3138C83O76k58o41ko3J3K2K3M8r0mK37j59R4j62k9o8J00R8L18k15j01J70n6k93R6m6K3N2k0
2857A46j07M5pM5q9K6J0J27p0L89Mm70N0l3LJ8n3L5n2Q7J46j47kK6N4J24k01J0j01J08m2J8
2556I7M7oj10J6O9l6N7k6o9J8J17O8l2q4n3P2p9J61q1o1Q5r2L7J3j13J38K8k9q6RM7l7l9K4
2237G0Nj5L7J54j56M5m3j3oLlJO1o1K9L87K00M49o8q93j00Qj0O8n6J10m2n6m6j3M1Q0oJo7
$$ plain form
1908 95 225 187 209 155 89 96 104 65 63 146 116 151 60 37 12 86 52 88 100 103 113 105 101 175 24 14 117 92 30 74 129 242 104 221 107
1579 107 376 361 996 557 8004 7121 357 1243 1092 351 219 345 490 484 162 37 204 136 94 202 116 234 150 88 19 133
1335 133 393 148 59 64 81 60 105 265 284 65 58 111 160 39 119 142 109 74 77 81 172 155 129 179 56 165 163 106 65 43 137 78 24 204
1016 204 121 212 130 104 51 54 56 74 174 193 101 23 58 155 103 101 142 113 105 73 126 126 143 45 55 141 125 80 45 57 56 116 103 74 41 73 75 27
659 27 18 52 100 134 198 58 123 198 83 95 141 25 104 56 109 123 62 107 141 120 113 172 185 77 16 19 57 60 124 172 128 89 145 21 155
331 155 211 157 91 56 126 151 93 125 91 48 27 123 207 165 55 70 93 21 22 41 67 102 120 148 147 80 72 86 24 38 127 159 34 30 29 238
-7 238 181 37 123 83 142 50 34 68 53 161 98 82 97 69 40 82 144 150 81 74 87 182 207 62 10 96 158 92 78 141 103 236 164 117 119
-336 119 138 103 75 23 131 69
$$ packed form
1908I5J30l8K2n4o6PQl9kQ3l0L5r1k3k5P4l4L6J2LJ0qmP4j51j0J03k5o2M4N5J13j38J17j14
1579A07K69j5O35m39P447q83o764Q86j51p41j32J26J45ol22j25J67o8m2J08q6J18q4o2o9J14
1335A33K60k45q9NJ7k1M5J60J9k19pN3M9j21Q0K3l3l5LMR1j7k6N0j23J09kn7m1k2R4n9n4J80
1016B04q3R1q2k6n3LKJ8J00J9r2p8L5R7n2kM1k9ql2N3%J7r8J0Q6j6m5l5J2jO0j3k9l3L2Km8
659B7rL4M8L4O4j40O5P5j15J2M6j16P9m8N3J4o1M5L4k1pN9J3j08o1LL8LO4M8m4l9N6j24J34
331A55N6n4o6l5P0K5n8L2l4m3k1R6Q4m2j10J5K3p2JJ9K6L5J8K8jo7qJ4o2J4Q9L2j25mjK09
-7B38n7j44Q6m0N9r2j6L4j5J08o3j6J5k8k9M2O2Oo9pJ3R5K5j45n2Q6O2o6j4O3l8J33p2m7K
-336A19J9l5k8n2J08o2
-392F9
##PAGE=	F1=-1735.18
##FIRST=	4405.895418600002813,	4405.895418600002813,	0
##DATA TABLE=	(F2++(Y..Y)), PROFILE
$$ plain form
4406 108 54 38 37 66 70 76 126 44 65 50 80 131 13 166 180 65 158 148 224 108 55 85 70 136 289 247 160 128 95 120 56 107 186 163
4087 163 188 133 106 158 24 142 117 68 31 36 115 121 127 172 50 142 25 134 64 56 119 92 167 168 89 136 162 42 131 204 147 83 82 69 116
3758 116 108 122 49 144 115 78 49 58 64 139 203 170 227 46 53 28 186 130 44 106 91 9 24 39 99 184 23 40 78 115 152 63 66 29 137
3429 137 177 116 88 184 80 21 7 64 4 67 59 167 306 253 203 28 100 95 109 173 122 102 99 112 215 710 929 750 574 135 338
3138 338 771 560 181 153 96 70 103 213 236 146 145 431 238 312 106 128 15 135 263 635 259 215 334 298 63 156 93 97 157
2866 157 126 30 79 76 152 55 62 108 234 142 606 496 75 98 87 80 65 49 94 16 116 246 102 141 169 173 292 128 93 33 118 75
2565 75 125 156 118 15 74 116 91 142 61 84 79 155 208 193 115 64 143 116 241 112 80 187 67 88 88 29 184 153 132 63 76 114 92
2256 92 56 70 78 61 74 261 78 169 85 95 92 73 78 100 218 90 145 454 1299 1265 803 311 70 153 110 158 76 155 125 69 31 105
$$ packed form
4406A08n4j6jK9MON0q2K1j5L0N1j18J53J4j15R3j0P6j16n3L0j5O6J53m2q7l2l3K5o4N1P9k3
4087A63K5n5k7N2j34J18k5m9l7NP9OOM5j22R2j17J09p0qO3k7P5Jp9M7K6j20Q9P3n7o4jj3M7
3758A16qJ4p3R5k9l7k9ROP5O4l3N7j81Pk5J58n6q6O2j5q2J5J5O0Q5j61J7L8L7L7q9Ll7J08
3429A37M0o1k8R6j04n9j4N7o0O3qJ08J39n3n0j75P2nJ4O4n1k0lJ3J03M95K19j79j76m39K03
3138C38M33k11l79k8n7k6L3J10K3r0jK86j93P4k06K2j13J20J28L72l76m4J19l6k35R3o3MO0
2866A57l1r6M9lP6r7PM6J26r2M64j10m21K3j1pj5j6M5p8J00J30j44L9K8MJ19j64l5o0Q5m3
2565G5N0L1l8j03N9M2k5N1q1K3nP6N3j5p8n1P9k7J25j29l2J07j20K1%n9J55l1k1o9J3L8k2
2256I2l6J4Qj7J3J87j83R1q4J0lj9NK2J18j28N5L09Q45l4m62m92k41Q3m3M8q2P9l0n6l8P4
$$ plain form
1955 105 105 143 148 139 93 224 214 227 175 117 84 83 57 9 162 110 204 30 20 47 69 90 162 126 129 73 111 114 271 91 44 224 130 161 151
1626 151 163 315 204 428 366 652 782 1476 1383 18254 16047 160 1098 1147 561 428 672 394 586 240 71 249 196
1410 196 45 259 198 187 87 113 35 152 490 148 67 92 107 94 129 221 285 37 87 167 146 70 136 140 43 90 69 128 159 180 116 217
1110 217 49 176 158 133 87 28 167 101 35 199 154 205 149 86 70 72 75 126 161 148 112 55 61 194 103 75 121 110 124 80 136 144 155 37
791 37 99 129 109 94 69 82 76 119 95 112 48 52 43 66 40 58 117 122 186 32 58 146 91 58 153 40 94 66 75 121 89 109 139 96 98 179 185 54
434 54 55 58 70 83 91 176 110 67 159 8 165 219 187 103 34 136 140 87 147 103 60 59 96 224 173 93 102 105 28 15 69 87 75 93 128 150 69
86 69 61 54 19 65 77 172 44 30 34 248 153 23 115 89 126 31 23 57 26 160 76 122 119 90 21 69 106 149 100 53 83 180 199 67 22 63
-252 63 118 85 89 160 90 235 164 111 116 152 123 109 37 138 87
$$ packed form
1955A05%L8Nrm6J31j0J3n2n8l3jk6m8J53n2R4j74j0K7K2K1P2l6Ln6L8LJ57j80m7J80r4L1j0
1626A51J2J52j11K24o2K86J30O94r3J6871k207j5887R38M9n86j33K44k78J92l46j69J78n3
1410A96j51K14o1j1j00K6p8J17L38l42q1K5J5j3L5R2O4k48N0Q0k1p6O6Mr7M7k1N9L1K1o4J01
1110B17j68J27j8k5m6n9J39o6o6J64m5N1n6o3j6KLN1L5j3l6n7OJ33r1k8M6j1J4m4N6QJ1j18
791C7O2L0k0j5k5J3oM3k4J7o4MrK3k6J8N9NO4j54K6Q8n5l3R5j13N4k8RM6l2K0L0m3KQ1Oj31
434E4JLJ2J3QQ5o6m3R2j51J57N4l2q4o9J02Mn3O0m4m3jL7J28n1q0RLp7j3N4J8j2J8L5K2q1
86F9qpl5M6J2R5j28j4MK14r5j30R2k6L7r5qL4l1J34q4M6lk9o9M8L7M3m9m7L0R7J9j32m5M1
-252F3N5l3MP1p0J45p1n3NL6k9j4p2J01n1
-392H7
##PAGE=	F1=-1753.96
##FIRST=	4405.895418600002813,	4405.895418600002813,	0
##DATA TABLE=	(F2++(Y..Y)), PROFILE
$$ plain form
4406 93 42 57 28 53 67 71 156 64 87 64 101 126 48 172 205 64 152 157 232 108 47 116 85 151 281 217 128 106 75 111 79 121 170 134
4087 134 173 120 112 159 17 148 119 46 44 67 127 141 134 207 96 154 59 99 112 77 140 108 167 162 77 114 112 63 119 230 163 74 94 101 103 84
3749 84 98 44 158 100 52 67 39 60 181 223 143 240 29 113 22 186 109 4 88 80 3 13 90 94 205 18 78 92 111 115 67 34 29 133
3429 133 158 89 52 178 89 32 32 47 68 34 66 176 291 207 200 27 162 106 94 183 114 134 134 128 202 796 946 1028 639 65 274 384
3129 384 269 183 139 83 82 108 246 247 180 155 481 239 315 99 153 31 157 296 802 146 267 267 237 87 183 93 69 146 101 18
2847 18 107 100 170 76 89 141 238 209 758 448 117 111 95 84 37 88 131 18 127 223 105 162 190 140 260 135 87 62 89 63 150 164
2547 164 85 9 96 116 103 144 42 122 94 144 143 163 97 64 127 154 226 75 47 179 60 58 41 52 202 129 88 49 74 101 76 49 72
2237 72 85 88 70 253 74 181 81 101 109 95 94 111 257 114 187 385 1916 2410 715 435 86 207 135 179 79 123 89 27 8
$$ packed form
4406I3n1J5k9K5J4MQ5r2K3k3L7K5p8J24L3j41Q8NP5j24o1O9l1O6J30o4q9k2l1L6l2M2M9l6
4087A34L9n3qM7j42J31k9p3kK3O0J4pP3j11N8r5M0J3l5O3l2N9nq5L7km9N6J11o7q9K0PKj9
3749H4J4n4J14n8m8J5k8K1J21M2q0R7k11Q4r1J64p7j05Q4qp7J0P7MJ11j87O0J4J9Mm8l3nJ04
3429A33K5o9l7J26q9n7%J5K1l4L2J10J15q4pj73J35n6j2Q9o9K0%oP4N94J50Q2l89n74K09J10
3129C84j15q6m4n6jK6J38Jo7k5L26k42P6k16N4j22J26J39N06o56J21%l0j50R6r0k4P7m5q3
2847A8Q9pP0r4J3N2R7k9N49l10l31oj6j1m7N1M3j13J09R6j18N7K8n0J20j25m8k5K7k6Q7J4
2547A64p9p6Q7K0j3M1j02Q0k8N0jK0o6l3O3K7P2j51k8J32j19kj7J1J50p3m1l9K5K7k5k7K3
2237G2J3Lj8J83j79J07j00K0Qj4jJ7J46j43P3J98J531M94j695k80l49J21p2M4j00M4l4o2j9
$$ plain form
1964 8 146 122 114 132 134 80 206 207 228 201 120 77 39 40 14 148 105 236 51 35 80 74 121 179 112 153 81 118 112 306 98 32 261 92
1645 92 208 157 149 303 214 477 390 660 834 1435 1479 19453 17284 477 501 893 602 398 753 257 501 264 110 222
1420 222 218 52 251 220 130 83 113 25 168 504 160 50 107 93 122 123 168 247 81 89 203 134 80 128 116 20 109 77 149 129 181 110
1119 110 225 46 167 141 129 94 47 180 100 52 195 163 202 143 65 71 102 116 162 145 117 120 81 78 201 115 71 94 95 125 88 132 145 155
800 155 32 116 116 88 98 110 95 100 116 87 136 72 48 39 100 49 60 120 110 153 14 40 90 100 54 157 59 65 70 42 103 95 106 110 60 81 169
453 169 172 57 103 110 78 118 67 167 89 47 165 21 175 227 209 99 12 132 133 65 143 108 65 88 61 220 186 130 137 97 46 34 95
143 95 81 56 62 118 148 49 48 31 33 125 30 171 58 48 38 229 121 36 113 104 105 15 19 31 37 158 54 167 136 112 8 61 79 152 117
-186 117 51 69 172 185 68 40 32 65 70 91 162 92 219 169 101 91 145 134 121 57 123 92
$$ packed form
1964HJ38k4qJ8Kn4J26JK1k7q1m3l8Jk6J34m3J31j85j6M5oM7N8o7M1p2L7oJ94k08o6K29j69
1645I2J16n1qJ54q9K63q7K70J74O01M4J7974k169j6807K4L92k91k04L55m96K44k37j54J12
1420B22mj66J99l1r0m7L0q8J43L36l44j10N7j4K9JM5P9j66QJ14o9n4M8j2r6Q9l2P2k0N2p1
1119A10J15j79J21k6j2l5m7J33q0m8J43l2L9n9p8OL1J4M6j7k8Ll9lJ23q6m4K3JL0l7M4J3J0
800A55j23Q4%k8J0J2j5NJ6k9M9o4k4rO1n1J1O0j0M3j39K6N0J0m6J03r8ONk8O1qJ1Mn0K1Q8
453A69Lj15M6Pl2M0n1J00p8m2J18j44J54N2j8j10q7J20Jo8P8l5m3K3k7J59l4n6Pm0n1j2O1
143I5j4k5ON6L0r9jj7KR2r5J41j13j0j0J91j08q5P7rJr0MJ2OJ21j04J13l1k4j04N3J8P3l5
-186A17o6J8J03J3j17k8qL3NK1P1p0J27n0o8j0N4j1j3o4O6l1
-392I2
##PAGE=	F1=-1772.74
##FIRST=	4405.895418600002813,	4405.895418600002813,	0
##DATA TABLE=	(F2++(Y..Y)), PROFILE
$$ plain form
4406 74 15 82 94 51 60 47 166 81 128 75 125 113 56 160 230 62 132 158 227 91 35 141 112 165 254 172 93 92 54 108 129 129 139 97
4087 97 140 113 107 148 28 137 111 25 67 98 132 144 128 228 142 151 84 73 143 95 148 117 153 141 60 80 68 103 103 237 161 64 120 139 83
3758 83 60 70 41 162 88 41 82 44 75 202 229 103 240 19 150 29 169 94 39 67 76 9 29 129 74 213 59 115 110 111 78
3467 78 55 46 31 128 151 77 28 158 102 36 56 34 122 23 85 174 254 156 173 26 219 122 65 178 101 156 148 156 171 810 839 1215 648
3157 648 10 188 121 174 167 114 64 130 140 250 238 190 205 497 202 288 96 157 49 177 298 968 148 339 247 175 116 212 93
2885 93 39 134 79 22 146 126 174 99 123 168 210 284 921 434 158 131 86 80 28 112 168 19 135 188 113 161 193 85 216 128 114 94
2584 94 39 45 156 158 47 14 102 108 114 144 44 144 101 151 58 119 79 81 99 176 186 52 5 150 54 35 42 86 208 118 34 33 72 85 43
2256 43 23 77 90 102 79 228 73 177 85 98 112 102 123 106 252 140 201 329 2302 3404 917 520 128 241 148 191 98 114
$$ packed form
4406G4n9O7J2m3Rj3J19q5M7n3N0j2n7J04P0j68P0K6O9j36n6J06k9N3Q9q2p9jl8N4K1%J0m2
4087I7M3k7oM1j20J09k6q6M2L1L4J2j6J00q6Ro7j1P0m8N3l1L6j2q1K0j2L5%J34p6r7N6J9n6
3758H3k3J0k9J21p4m7M1l8L1J27K7j26J37k21J31j21J40p5n5K8Ro7K0J00n5J39j54N6nJl3
3467G8k3rj5R7K3p4m9J30n6o6K0k2Q8r9O2Q9Q0r8J7j47J93r7n7J13p7N5qQJ5O39K9L76n67
3157F48o38J78o7N3pn3n0O6J0J10j2m8J5K92k95Q6j92O1j08J28J21O70q20J91r2p2n9R6j19
2885I3n4R5n5n7J24k0M8p5K4M5M2P4O37m87k76k7m5on2Q4N6j49J16N3p5M8L2j08J31q8j4k0
2584I4n5OJ11Kj11l3Q8OOL0j00J00m3N0r3O1m0KJ8P7J0j34m7J45r6j9PM4J22r0q4jL9J3m2
2256D3k0N4J3J2k3J49j55J04r2J3J4j0K1j7J46j12O1J28J973J102k487l97l92J13r3M3r3J6
$$ plain form
1993 114 57 22 57 165 116 110 119 141 58 173 174 216 215 95 75 22 26 15 109 96 219 116 80 92 99 140 147 72 147 125 98 106 279 59 43
1664 43 230 4 175 96 101 214 146 381 220 437 577 980 1224 12902 11753 964 395 801 481 260 613 146 294
1448 294 245 97 128 185 88 185 191 86 94 73 18 161 438 168 41 89 47 127 93 114 183 112 72 205 123 77 96 80 56 117 95 142
1148 142 78 157 105 201 66 140 118 112 90 50 177 84 65 191 147 202 110 44 54 126 168 177 130 107 121 92 105 180 134 89 63 73 109 91
828 91 116 130 138 26 108 102 82 101 146 93 109 110 73 142 115 70 82 125 48 59 108 99 102 33 80 38 93 70 151 57 46 67 26 77 78 100 69 44
471 44 69 146 150 94 139 165 81 137 65 148 70 30 162 41 183 237 221 81 6 120 123 35 116 102 59 112 34 199 197 158 162 77 68 46 108
143 108 52 66 37 115 141 40 53 39 56 170 28 156 73 68 35 183 87 56 114 122 89 8 26 13 65 149 36 198 144 133 30 49
-158 49 101 161 135 74 48 155 166 70 44 23 35 49 86 145 107 193 177 88 57 121 134 106 76 92 81
$$ packed form
1993A14n7l5L5J08m9oRK2q3J15JM2jj20k0n3Mj1R4j3J23j03l6J2PM1Pp5P5k2k7QJ73k20j6
1664D3J87k26J71p9NJ13o8K35j61K17J40M03K44J1678j149j0789n69M06l20k21L53m67J48
1448B94m9j48L1N7r7R7Oj05Qk1n5J43K77k70j27M8m2Q0l4K1O9p1m0J33q2m6J9j6k4O1k2M7
1148A42o4P9n2R6j35P4k2ok2m0J27r3j9J26m4N5r2o6J0P2M2Rm7k3J4k9J3P5m6m5k6J0L6j8
828I1K5J4Qj12Q2ok0J9M5n3J6Jl7O9k7m5J2M3p7J1M9rLo9M7m2N5k3Q1r4j1K1m1N1JK2l1k5
471D4K5P7Mn6M5K6q4N6p2Q3p8m0J32j21J42N4j6j40p5J14Lq8Q1j4m3N3p8J65kl9Mq5rk2O2
143A08n6J4k9P8K6j01J3j4J7J14j42J28q3nl3J48r6l1N8Ql3q1J8j3N2Q4j13J62n4j1j03J9
-158D9N2O0k6o1k6J07J1r6k6k1J2J4L7N9l8Q6j6q9l1O4J3k8l0J6j1
-392H1
##PAGE=	F1=-1791.52
##FIRST=	4405.895418600002813,	4405.895418600002813,	0
##DATA TABLE=	(F2++(Y..Y)), PROFILE
$$ plain form
4406 52 21 98 151 49 50 14 157 86 166 80 145 94 42 140 251 53 111 142 206 58 39 168 148 175 210 118 69 90 39 113 179 128 99
4096 99 62 99 119 98 133 43 115 93 28 85 121 130 135 110 231 177 130 93 85 156 112 143 115 126 104 43 48 57 147 89 225 143 62 140 174 67
3758 67 40 41 37 158 78 54 91 46 86 194 216 60 223 21 163 36 138 90 73 47 79 33 40 151 53 206 97 144 131 127 51 32
3458 32 85 52 123 147 96 42 129 116 41 73 38 157 55 104 160 201 116 129 21 262 139 50 159 90 162 142 173 137 763 694 1317
3166 1317 598 77 87 663 552 148 80 66 171 168 234 225 172 305 490 208 234 95 141 56 190 263 1067 314 357 300 174 144
2903 144 230 99 48 118 66 42 173 141 163 124 154 189 152 324 1038 491 189 152 62 69 48 114 191 42 143 151 124 142 180 15 166
2612 166 112 155 128 25 34 140 133 33 30 96 90 130 149 42 142 105 175 42 65 65 104 63 180 138 62 62 114 52 46 93 122 211 117 35 52
2284 52 71 72 9 25 90 87 97 83 195 72 167 95 88 109 82 149 85 211 162 186 328 2322 3746 1101 523 149 250 145 189 123
$$ packed form
4406E2l1P7N3j02Jl6J43p1Q0q6O5n1n2R8J11j98N8L1O4j48j9J29k0K7L5r2m9K1n1P4O6n1k9
4096I9l7L7K0k1L5r0P2k2o5N7L6RNk5J21n4m7l7qP1m4L1k8J1k2o1NRR0n8J36q2q1P8L4j07
3758F7k7JmJ21q0k4L7m5M0J08K2j56J63k02J42j27J02m8j7k6L2m6PJ11r8J53j09M7j3mp6j9
3458C2N3l3P1K4n1n4Q7j3p5L2l5J19j02M9N6M1q5J3j08K41j23q9J09o9P2k0L1l6O26o9O23
3166A317p19n21J0N76j11m04o8j4J05lO6rn3J33J85k82K6j39M6q5J34P3Q04p53M3n7j26l0
2903A44Q6j31n1P0n2k4J31l2K2l9L0L5l7J72P14n47l02l7r0Pk1O6P7j49J01Qk7J8L8j65J51
2612A66n4M3k7j03RJ06pj00lO6oM0J9j07J00l7P0j33K3%L9m1J17m2p6%N2o2oM7K9Q9r4q2J7
2284E2J9Jo3J6O5lJ0j4J12j23R5p2pK1k7O7o4J26m9K4J42J994J424k645n78l74J01j05M4o6
$$ plain form
2002 123 121 42 42 103 172 98 120 112 148 32 130 138 196 208 54 83 84 48 21 58 82 164 164 126 95 129 155 90 37 118 171 71 96 211 52
1673 52 111 167 102 105 33 92 96 50 219 112 142 246 416 1397 4171 3436 1264 766 952 296 297 385 89 71 209 72 10 132
1410 132 157 95 143 102 94 14 61 142 322 164 67 52 27 120 85 74 128 120 51 181 107 82 53 60 107 116 110 114 13 117 94 156 100 104 92 122
$$ packed form
2002A23kp9%O1O9p4K2qL6j16R8QN8J2j54K9Jl6k7L7K4Q2%l8l1L4K6o5n3Q1N3j00K5J15j59
1673E2N9N6o5Lp2N9Mm6J69j07L0J04J70R81K774p35k172m98J86o56JQ8k96j8J38j37o2J22
1410A32K5o2M8m1qq0M7Q1J80j58r7j5k5R3l5j1N4qo9J30p4k5k9PM7RoMj01J04k3O2n6Mj2L0
$$ [...]
-392C5
##END NTUPLES=	nD NMR SPECTRUM
##END=	
##END=	
