##TITLE=	3VhjF73SRCiapJoe4lbiBw.54.ser
TM-VI-167 hmbc

##JCAMP-DX=	6.0	$$ MestReNova 14.3.1-31739
##DATA TYPE=	LINK
##BLOCK_ID=	1
##BLOCKS=	2    
##ORIGIN=	Mestrelab Research S.L.
##OWNER=	hrzepa
##$MNOVA/LINK_BLOCK_TYPE=	ITEM	$$ NMR Spectrum
##$MNOVA/ITEM/POLYGON=	(XY..XY)
5321,5835
8722,5835
8722,8208
5321,8208
5321,5835
##$MNOVA/ITEM/Z=	0
##$MNOVA/ITEM/ANGLE=	0
##TITLE=	3VhjF73SRCiapJoe4lbiBw.54.ser
##JCAMP-DX=	6.0	$$ MestReNova 14.3.1-31739
##BLOCK_ID=	2
##DATA TYPE=	MNOVA NMR VIEW DATA
##DATA CLASS=	MNOVA VIEW DATA
##$MNOVA/2D/THRESHOLD=	4.5470566749572753906
##$MNOVA/ITEM/ZOOM/X=	-0.47501081208716700033,	14.504330000039219684
##$MNOVA/ITEM/ZOOM/Y=	-9.5107036222489718114,	249.98529999918474687
##END=	
##TITLE=	3VhjF73SRCiapJoe4lbiBw.54.ser
##JCAMP-DX=	6.0	$$ MestReNova 14.3.1-31739
##BLOCK_ID=	3
##DATA TYPE=	nD NMR SPECTRUM
##DATA CLASS=	NTUPLES
##NUMDIM=	2
##ORIGIN=	Bruker BioSpin GmbH
##OWNER=	nmr
##.OBSERVE FREQUENCY=	400.41280287000000726
##.OBSERVE NUCLEUS=	^1H
##.SOLVENT NAME=	CDCl3
##.PULSE SEQUENCE=	hmbcgplpndqf
##LONGDATE=	2021/11/17 00:38:06.000
##.ACQUISITIONMODE=	SIMULTANEOUS (DQD)
##$ORIGINAL FORMAT=	Bruker XWIN-NMR
##$MNOVA/SCALES_VERSION=	9
##$PARAMETER FILE=	(acqu2s, ASCII, /private/var/folders/f6/rjf_tdyn2v98c5c0wvkgn4s80000gn/T/3VhjF73SRCiapJoe4lbiBw/54/acqu2s, 0)
$$ ##TITLE= Parameter file, TOPSPIN		Version 3.2
$$ ##JCAMPDX= 5.0
$$ ##DATATYPE= Parameter Values
$$ ##NPOINTS= 129	$$ modification sequence number
$$ ##ORIGIN= Bruker BioSpin GmbH
$$ ##OWNER= nmr
$$ $$ 2021-11-17 00:57:42.540 +0000  nmr@CZC10666PP
$$ $$ /opt/topspin/data/agmb/nmr/Nov16-2021/54/acqu2s
$$ $$ process /opt/topspin3.2/prog/mod/go
$$ ##$ACQT0= 0
$$ ##$BF1= 100.683175
$$ ##$FnMODE= 1
$$ ##$NUC1= <13C>
$$ ##$NusJSP= 0
$$ ##$NusT2= 1
$$ ##$NusTD= 128
$$ ##$O1= 12080.308799824
$$ ##$SFO1= 100.6952553088
$$ ##$SW= 259.972631192251
$$ ##$SW_h= 26178.0104712042
$$ ##$TD= 128
$$ ##END=
$$ 
##$PARAMETER FILE=	(acqus, ASCII, /private/var/folders/f6/rjf_tdyn2v98c5c0wvkgn4s80000gn/T/3VhjF73SRCiapJoe4lbiBw/54/acqus, 0)
$$ ##TITLE= Parameter file, TOPSPIN		Version 3.2
$$ ##JCAMPDX= 5.0
$$ ##DATATYPE= Parameter Values
$$ ##NPOINTS= 12	$$ modification sequence number
$$ ##ORIGIN= Bruker BioSpin GmbH
$$ ##OWNER= nmr
$$ $$ 2021-11-17 00:57:46.324 +0000  nmr@CZC10666PP
$$ $$ /opt/topspin/data/agmb/nmr/Nov16-2021/54/acqus
$$ $$ process /opt/topspin3.2/prog/mod/shimcntl
$$ ##$ACQT0= 1000000
$$ ##$AMP= (0..31)
$$ 100 100 100 100 100 100 100 100 100 100 100 100 100 100 100 100 100 100
$$ 100 100 100 100 100 100 100 100 100 100 100 100 100 100
$$ ##$AMPCOIL= (0..19)
$$ 0 0 0 0 0 0 0 0 0 0 0 0 0 0 0 0 0 0 0 0
$$ ##$ANAVPT= -1
$$ ##$AQSEQ= 0
$$ ##$AQ_mod= 3
$$ ##$AUNM= <au_zg>
$$ ##$AUTOPOS= <53 >
$$ ##$BF1= 400.41
$$ ##$BF2= 100.683175
$$ ##$BF3= 400.41
$$ ##$BF4= 400.41
$$ ##$BF5= 400.41
$$ ##$BF6= 400.41
$$ ##$BF7= 400.41
$$ ##$BF8= 400.41
$$ ##$BYTORDA= 0
$$ ##$CAGPARS= (0..11)
$$ 0 0 0 0 0 0 0 0 0 0 0 0
$$ ##$CFDGTYP= 0
$$ ##$CFRGTYP= 9
$$ ##$CHEMSTR= <none>
$$ [...]
$$ 0 0 0 0
$$ ##$ShimPowMaxUC= (0..63)
$$ 130000 130000 130000 130000 130000 130000 130000 130000 130000 130000 130000
$$ 130000 130000 130000 130000 130000 130000 130000 130000 130000 0 0 0 0
$$ 0 0 0 0 0 0 0 0 0 0 0 0 0 0 0 0 0 0 0 0 0 0 0 0 0 0 0 0 0 0 0 0 0 0 0 0
$$ 0 0 0 0
$$ ##$ShimPowMaxUG= (0..63)
$$ 524287 524287 524287 524287 524287 524287 524287 524287 524287 524287 524287
$$ 524287 524287 524287 524287 524287 524287 524287 524287 524287 0 0 0 0
$$ 0 0 0 0 0 0 0 0 0 0 0 0 0 0 0 0 0 0 0 0 0 0 0 0 0 0 0 0 0 0 0 0 0 0 0 0
$$ 0 0 0 0
$$ ##$ShimPowRcbType= 3
$$ ##$ShimPowRes= (0..63)
$$ 1e-20 1e-20 1e-20 1e-20 1e-20 1e-20 1e-20 1e-20 1e-20 1e-20 1e-20 1e-20
$$ 1e-20 1e-20 1e-20 1e-20 1e-20 1e-20 1e-20 1e-20 0 0 0 0 0 0 0 0 0 0 0 0
$$ 0 0 0 0 0 0 0 0 0 0 0 0 0 0 0 0 0 0 0 0 0 0 0 0 0 0 0 0 0 0 0 0
$$ ##$ShimPowRng0= (0..63)
$$ 1 1 1 1 1 1 1 1 1 1 1 1 1 1 1 1 1 1 1 1 0 0 0 0 0 0 0 0 0 0 0 0 0 0 0 0
$$ 0 0 0 0 0 0 0 0 0 0 0 0 0 0 0 0 0 0 0 0 0 0 0 0 0 0 0 0
$$ ##$ShimPowRng1= (0..63)
$$ 1 1 1 1 1 1 1 1 1 1 1 1 1 1 1 1 1 1 1 1 0 0 0 0 0 0 0 0 0 0 0 0 0 0 0 0
$$ 0 0 0 0 0 0 0 0 0 0 0 0 0 0 0 0 0 0 0 0 0 0 0 0 0 0 0 0
$$ ##$ShimPowRng2= (0..63)
$$ 1 1 1 1 1 1 1 1 1 1 1 1 1 1 1 1 1 1 1 1 0 0 0 0 0 0 0 0 0 0 0 0 0 0 0 0
$$ 0 0 0 0 0 0 0 0 0 0 0 0 0 0 0 0 0 0 0 0 0 0 0 0 0 0 0 0
$$ ##$ShimPowRng3= (0..63)
$$ 1 1 1 1 1 1 1 1 1 1 1 1 1 1 1 1 1 1 1 1 0 0 0 0 0 0 0 0 0 0 0 0 0 0 0 0
$$ 0 0 0 0 0 0 0 0 0 0 0 0 0 0 0 0 0 0 0 0 0 0 0 0 0 0 0 0
$$ ##$ShimSysFunc= (0..63)
$$ 1 2 3 4 5 7 9 11 15 16 8 10 12 14 6 17 13 18 19 20 0 0 0 0 0 0 0 0 0 0
$$ 0 0 0 0 0 0 0 0 0 0 0 0 0 0 0 0 0 0 0 0 0 0 0 0 0 0 0 0 0 0 0 0 0 0
$$ ##$ShimSysMatrix= 0
$$ ##$ShimSysType= 1
$$ ##$TFXNUM= 0
$$ ##$TRIPLO2= 0
$$ ##$VTU= 2
$$ ##$VTUETH= <149.236.99.20>
$$ ##$VTUTY= <no>
$$ ##$WBREFAM= (0..15)
$$ 135 116 100 100 100 100 100 100 100 100 100 100 100 100 100 100
$$ ##$WBREFLM= (0..15)
$$ 0 0 0 0 0 0 0 0 0 0 0 0 0 0 0 0
$$ ##$WBREFPH= (0..15)
$$ 71.66 -68.25 0 0 0 0 0 0 0 0 0 0 0 0 0 0
$$ ##$WBSGU= (0..15)
$$ 0 0 0 0 0 0 0 0 0 0 0 0 0 0 0 0
$$ ##$XFAC= 2
$$ ##END=
$$ 
##$DECIM=	3328
##$DSPFVS=	20
##.ACQUISITIONSCHEME=	NOT PHASESENSITIVE
##NTUPLES=	nD NMR SPECTRUM
##VAR_NAME=	FREQUENCY1,	FREQUENCY2,	SPECTRUM
##SYMBOL=	F1,	F2,	Y
##.NUCLEUS=	13C,	1H
##.OBSERVE FREQUENCY=	100.69525530880000019,	400.41280287000000726
##VAR_TYPE=	INDEPENDENT,	INDEPENDENT,	DEPENDENT
##VAR_FORM=	AFFN,	AFFN,	ASDF
##VAR_DIM=	512,	512,	262144
##UNITS=	HZ,	HZ,	ARBITRARY UNITS
##FIRST=	25169.313707327481097,	5807.6787752999953227,	0.37232786417007446289
##LAST=	-957.56783717514929322,	-190.19907926730809322,	0.5616607666015625
##MIN=	-957.56783717514929322,	-190.19907926730809322,	0.00058659678325057029724
##MAX=	25169.313707327481097,	5807.6787752999953227,	58.835422515869140625
##FACTOR=	1,	1,	0.0029526752709538518944
##PAGE=	F1=25169.3
##FIRST=	25169.313707327481097,	5807.6787752999953227,	0.37232786417007446289
##DATA TABLE=	(F2++(Y..Y)), PROFILE
$$ [...]
##PAGE=	F1=4615.49
##FIRST=	25169.313707327481097,	5807.6787752999953227,	0.22231350839138031006
##DATA TABLE=	(F2++(Y..Y)), PROFILE
1653 112 181 76 101 80 266 229 192 97 64 211 202 155 243 249 7 167 183 77 177 126 78 198 34 292 61 151 92 16 49 23
1300 23 58 91 55 67 81 131 185 63 28 62 80 26 104 107 221 314 180 96 127 40 209 231 93 214 92 24 109 52 189 236 118
937 118 73 158 185 87 175 226 156 74 111 158 36 118 113 44 58 72 56 53 112 174 78 142 224 136 87 68 226 148 143 172 105 130 171 92 135 196
514 196 212 43 125 36 68 47 304 317 149 111 162 117 88 73 249 136 115 166 227 158 111 23 79 99 88 137 108 204 89 199 85
150 85 171 110 312 158 84 36 77 217 237 101 91 155 49 175 95 96 305 168 31 180 80 397 181 120 182 103 73 159 131
-190A31
##PAGE=	F1=4513.23
##FIRST=	25169.313707327481097,	5807.6787752999953227,	0.17753612995147705078
##DATA TABLE=	(F2++(Y..Y)), PROFILE
5808 72 148 134 199 211 210 213 227 84 101 102 276 244 18 61 115 82 142 163 148 75 194 131 50 61 173 283 112 211 173 114 40 111 174
5420 174 111 165 112 140 164 126 117 54 50 64 113 127 94 54 72 150 88 218 98 52 129 73 119 140 95 39 205 269 34 207 179 72 73
5033 73 143 207 162 21 49 98 80 169 188 197 103 207 118 82 163 102 62 63 52 18 88 146 142 153 170 182 177 246 247 130 94 166 43 81 63 220
4610 220 155 43 36 146 60 100 188 198 104 51 96 39 89 135 173 76 53 188 121 170 251 183 152 148 121 156 228 75 142 118 211 143 50 62
4211 62 127 221 83 146 68 98 110 177 120 186 140 165 61 128 80 110 207 133 208 158 46 16 112 161 122 158 70 252 59 118 281 301
3836 301 209 54 67 86 317 226 44 69 151 116 141 56 76 81 126 146 22 146 131 184 192 89 132 113 27 114 35 53 125 197 180 110 53
3448 53 208 119 169 215 61 129 42 195 222 147 177 288 189 189 169 102 148 94 96 101 105 161 120 12 162 151 48 45 155 138 62 115 69 44
3049 44 355 373 234 170 158 151 102 219 204 189 119 53 155 70 111 170 19 191 117 79 138 73 38 113 112 126 169 244 277 143 81 135 121
2662 121 199 137 54 37 150 304 116 157 77 192 174 66 181 137 105 169 325 83 71 148 114 193 225 216 83 131 116 97 223 91
2310 91 155 101 141 16 255 226 174 35 191 240 140 270 151 233 258 176 192 71 208 93 218 278 72 178 160 205 33 150
1981 150 132 199 173 97 224 108 74 78 150 165 31 119 127 143 127 283 192 118 174 104 82 77 101 98 212 144 90 129 168 78 93 33 222 190
1582 190 167 75 32 174 180 134 216 226 55 162 208 116 139 79 104 213 82 240 32 163 94 51 116 71 85 60 92 42 41 80 179 108
1207 108 24 121 99 81 110 89 166 283 150 105 143 83 167 225 126 262 94 79 146 24 175 273 176 52 123 167 102 153 238 168 33
843 33 118 191 66 211 119 10 59 84 57 53 47 199 79 131 187 135 60 88 201 187 204 193 87 150 154 130 124 256 254 48 85 44 56 38
444 38 293 298 127 78 129 102 72 25 287 129 126 168 228 139 141 19 122 128 77 181 149 149 107 199 86 189 93 331 201 110 85 43 251
56 251 216 54 133 157 92 175 99 130 309 131 57 193 83 429 192 89 121 130 38 135 112
-190A12
##PAGE=	F1=4410.97
##FIRST=	25169.313707327481097,	5807.6787752999953227,	0.22084726393222808838
##DATA TABLE=	(F2++(Y..Y)), PROFILE
5808 80 175 147 196 221 222 202 204 67 101 60 266 265 58 29 121 144 96 136 161 152 236 173 27 37 164 244 103 245 146 134 44 120 158 99
5409 99 153 126 116 176 146 142 61 71 62 171 170 106 71 61 145 78 234 102 54 155 34 150 166 52 87 160 279 46 239 180 89 53
5033 53 111 196 144 81 108 67 54 139 209 227 105 226 108 68 147 56 69 33 42 9 120 151 165 150 167 177 126 241 293 176 99 193 14
4646 14 126 90 182 145 125 87 133 108 164 184 185 129 103 136 66 93 146 193 97 42 147 110 146 257 198 145 181 149 133 222 71 117 113 224
4247 224 181 30 49 72 163 49 133 50 87 94 165 128 157 157 86 64 91 109 92 230 125 192 147 75 62 94 136 99 154 71 196 45 106
3859 106 296 279 205 66 34 125 295 214 52 91 156 113 112 67 76 69 136 157 38 199 142 177 238 90 175 118 40 76 29 57 97 160 196
3472 196 119 56 229 125 165 257 80 104 16 205 205 159 168 255 193 162 194 135 189 128 147 125 89 135 130 46 142 139 55 63 154 129 37 94 61
3061 61 65 315 337 230 175 173 158 98 210 219 135 111 61 122 69 76 143 29 197 150 101 137 49 4 148 119 76 155 241 256 91 112 95 151
2662 151 222 142 48 18 132 281 122 172 125 156 126 88 124 93 92 201 316 67 133 107 68 207 224 183 46 137 129 172 249 126 118 97
2286 97 137 13 218 208 191 26 181 202 157 232 103 248 272 203 174 47 260 85 246 265 104 201 133 175 28 165 176 161 207
1946 207 132 215 110 83 110 149 162 68 170 188 148 130 328 237 105 168 82 84 65 59 120 183 110 105 132 148 108 107 21 178 143 129 59 55 119
1535 119 112 107 186 207 119 140 227 157 96 44 127 221 130 188 70 174 119 88 174 136 106 25 130 76 16 37 162 155 65 168 117 108 111 64 95
1124 95 257 118 127 141 104 135 201 154 309 90 125 152 11 146 286 227 29 79 171 108 109 236 198 21 135 198 102 304 199 23
772 23 74 88 77 67 65 249 94 97 138 133 49 110 172 218 242 218 67 141 110 151 121 276 258 43 51 95 99 67 274 258 91 38 88 92 69
361 69 44 294 90 159 166 194 124 160 44 145 166 93 234 193 100 120 177 79 179 91 318 218 127 115 10 259 188 50 178 166
9 166 137 172 96 144 281 77 86 182 85 430 197 94 88 166 101 89 85
-190H5
##PAGE=	F1=4308.71
##FIRST=	25169.313707327481097,	5807.6787752999953227,	0.24189463257789611816
##DATA TABLE=	(F2++(Y..Y)), PROFILE
5808 74 192 148 173 216 215 160 159 52 106 22 234 263 93 123 136 217 94 105 188 225 269 194 65 26 152 185 92 250 105 137 36
5444 36 121 138 95 132 130 80 168 152 148 58 104 85 203 194 115 79 34 108 61 238 106 58 169 12 179 179 16 130 99 271 91 267
5068 267 158 91 56 93 176 119 135 152 51 43 120 216 257 112 239 105 81 108 16 73 33 26 4 166 152 190 143 147 149 74 248 317 199
4681 199 108 208 37 176 152 140 135 194 170 121 161 209 152 169 139 140 147 85 89 125 174 118 50 112 93 113 255 216 146 217 195 95 211 64
4282 64 102 96 231 220 6 55 48 116 43 95 11 85 84 143 130 108 161 31 102 44 130 83 237 116 164 119 98 98 57 104 87 138 93 137 46
3871 46 122 318 260 194 101 74 168 249 198 83 117 155 157 120 69 97 60 136 167 50 229 136 155 261 92 207 120 71 38 58 64 68 113
3484 113 195 119 84 237 126 153 289 120 85 24 214 192 172 153 220 184 133 188 143 232 184 183 127 82 71 90 83 127 132 70 95 164 145 32
3085 32 137 38 79 273 275 195 188 182 146 92 209 225 90 106 94 92 68 61 118 54 187 193 150 128 11 13 184 129 60 122 224 219 46 136 58
2674 58 159 218 142 63 5 101 256 138 201 168 111 72 122 54 66 72 211 302 66 177 57 24 242 225 152 29 125 136 249 250 150
2310 150 85 86 117 32 173 182 195 32 168 154 169 160 49 269 254 210 149 32 311 97 247 235 127 209 102 125 44 175 193 115
1958 115 208 176 194 113 87 126 137 139 98 203 212 131 109 325 257 109 145 81 102 55 16 136 145 83 122 119 118 131 135 70 154 105 80 64 81 99
1535 99 26 86 158 193 180 110 236 193 70 53 137 222 163 148 110 173 166 121 206 184 112 67 161 122 31 41 136 195 117 196 131 107 98 76 21
1124 21 254 103 158 131 99 120 159 170 345 82 154 127 15 106 270 256 18 39 190 95 70 224 240 73 166 183 132 379 280 51
772 51 103 91 112 98 134 292 118 49 94 141 54 118 149 242 258 251 55 110 78 147 123 252 227 24 53 135 144 98 249 209 67 15 41
385 41 86 72 64 266 36 197 152 127 102 163 72 143 199 115 281 229 85 120 145 68 165 119 281 212 129 121 43 237 142 104 216 176 168
-2 168 161 85 140 238 58 120 151 78 406 200 124 98 189 161 38 77
-190G7
##PAGE=	F1=4206.45
##FIRST=	25169.313707327481097,	5807.6787752999953227,	0.15517191588878631592
##DATA TABLE=	(F2++(Y..Y)), PROFILE
5808 52 200 138 130 198 190 99 108 53 102 48 190 240 115 208 154 283 151 101 217 280 286 186 92 29 136 120 90 230 61 117 35 105
5432 105 120 99 104 125 36 145 148 144 45 124 109 199 195 109 78 26 44 46 230 106 62 168 53 198 181 64 156 47 249 135 279 113
5056 113 76 76 102 149 114 180 177 52 48 116 205 275 138 246 95 99 58 45 69 34 67 9 215 148 217 146 116 109 28 265 316 197 124 215
4657 215 70 222 217 106 122 237 229 113 208 231 98 167 135 159 129 100 86 75 119 129 86 88 79 75 250 230 149 248 233 52 195 49
4282 49 98 75 230 258 48 75 68 91 54 60 41 102 100 120 132 66 159 53 132 7 126 88 226 110 128 82 106 118 11 64 76 120 133
3894 133 129 63 146 336 253 177 154 145 206 188 184 99 142 152 212 158 67 121 82 132 167 61 227 109 120 250 86 219 105 106 39 90 65
3507 65 35 68 177 111 115 227 121 142 304 166 99 55 216 182 180 132 187 155 118 160 128 271 239 200 119 93 15 21 126 112 112 88 131
3120 131 171 155 42 179 18 80 245 215 141 204 190 115 94 221 222 50 103 116 73 55 77 96 68 163 236 211 130 64 7 196 150 99
2744 99 77 195 175 83 150 31 145 187 132 88 16 64 240 146 216 192 69 60 164 15 70 52 203 283 77 195 6 56 274 230
2392 230 142 60 98 132 297 226 154 55 75 85 39 135 153 183 38 158 113 189 67 19 274 202 194 129 43 345 128 215 188 138 203 71
2016 71 77 76 168 167 76 172 203 152 125 77 123 113 107 108 207 191 101 74 281 252 132 113 99 137 63 26 139 104 73 138 93 79 130 166 118 155
1594 155 93 32 90 93 141 46 76 138 182 232 90 234 220 94 82 128 216 176 127 143 162 220 153 207 202 107 134 178 156 56 76 106 216
1207 216 161 204 136 87 75 118 80 269 104 180 121 77 112 104 175 361 81 166 84 28 60 222 255 25 21 199 54 104 209 281 113
843 113 204 159 150 423 333 74 142 102 154 133 194 316 146 32 76 160 55 108 143 257 262 293 65 83 131 126 129 193 167 11 76 158 164
455 164 115 216 173 94 57 21 87 70 60 211 64 230 119 63 68 153 94 119 222 130 309 250 98 107 120 74 178 168 235 185 112 99
80 99 80 189 75 155 236 177 171 140 66 125 200 105 157 108 62 367 196 146 109 186 198 54 106
-190A06
##PAGE=	F1=4104.2
##FIRST=	25169.313707327481097,	5807.6787752999953227,	0.096141591668128967285
##DATA TABLE=	(F2++(Y..Y)), PROFILE
5808 18 203 120 74 171 159 46 85 70 84 86 147 202 126 264 163 338 221 128 232 307 282 159 108 39 112 61 98 195 23 78 49
5444 49 78 115 113 75 115 9 115 136 143 45 118 126 165 172 88 72 69 47 51 213 103 63 157 91 203 177 109 160 57 217 162 267 58 49
5045 49 81 117 115 134 213 183 64 58 117 176 275 170 244 76 101 18 78 57 40 133 10 255 137 244 169 81 76 19 279 292 178 147
4669 147 220 98 255 270 88 111 257 253 106 237 230 61 188 124 166 93 112 95 25 44 127 132 81 80 39 242 235 150 268 249 20 175
4294 175 29 97 62 220 291 95 99 86 82 61 69 95 135 135 105 140 70 157 83 149 60 97 103 203 109 88 53 95 121 54 19 65 109 172 172 102
3871 102 164 335 250 156 205 214 229 126 174 100 165 153 254 198 64 138 129 139 150 76 195 67 76 206 66 213 70 134 61 114 62
3507 62 13 37 146 104 134 195 112 142 297 201 135 80 206 171 179 108 151 109 127 133 99 303 277 207 122 103 97 101 165 89 69 105 167 163 148 61
3085 61 188 49 78 232 190 92 216 204 74 110 241 210 17 96 118 68 34 107 69 71 133 267 268 151 133 15 179 174 150 34 156
2721 156 134 141 155 10 116 134 108 98 21 33 232 141 203 190 43 102 205 67 80 36 183 257 97 184 36 106 283 234 154 101
2369 101 65 116 308 188 134 31 72 59 31 123 127 159 42 151 97 233 73 67 250 127 162 117 59 352 167 157 128 138 184 37
2016 37 76 116 144 108 75 107 210 90 156 51 100 83 77 95 182 133 85 66 213 228 151 77 130 183 85 61 126 64 80 148 59 37 100 198
1617 198 159 166 101 22 126 100 178 76 82 130 176 267 86 220 233 143 99 104 204 168 123 172 149 265 184 179 189 100 197 180 176 83 104 83
1218 83 206 186 191 127 61 47 151 161 279 100 187 117 64 97 46 171 353 96 163 48 51 27 152 225 26 22 181 22 183 198
866 198 312 132 238 141 151 430 345 97 187 123 192 160 236 321 179 70 89 188 46 84 158 263 265 338 98 92 206 104 131 116
514 116 97 58 84 156 149 116 176 164 142 95 64 89 57 39 144 121 246 71 117 32 138 108 85 233 127 310 254 105 91 117 106 210
138 210 218 188 141 74 59 108 128 24 186 230 161 141 105 45 107 176 148 192 69 50 321 184 147 96 151 206 104 145
-190A45
##PAGE=	F1=4001.94
##FIRST=	25169.313707327481097,	5807.6787752999953227,	0.27694436907768249512
##DATA TABLE=	(F2++(Y..Y)), PROFILE
5808 26 201 100 12 143 140 68 106 95 61 107 116 159 131 284 160 379 279 155 225 303 258 137 118 51 83 25 112 158 13 29 63
5444 63 65 135 133 55 107 49 84 122 152 77 85 137 112 126 57 69 114 128 70 192 99 59 138 116 192 169 130 143 92 180 165 227 44 45 61 122
5021 122 76 154 229 175 76 70 119 137 253 190 227 61 83 49 96 38 64 196 18 280 119 266 199 63 60 53 277 248 158 172 226 117
4646 117 267 300 81 108 264 242 98 246 211 108 226 114 164 62 117 115 84 51 117 173 86 93 14 231 227 148 273 241 9 152
4294 152 7 94 60 202 308 134 114 85 75 55 94 136 171 167 102 149 97 159 98 160 113 60 122 177 114 54 62 67 119 112 45 59 107 195 204
3883 204 143 175 306 237 130 241 268 235 71 164 95 189 165 274 225 58 141 180 165 116 86 140 34 54 137 41 203 25 148 72
3531 72 125 64 61 38 115 111 132 147 99 156 270 214 168 96 185 156 167 90 104 53 146 126 72 322 291 217 131 99 154 182 174 68 37 115 196
3120 196 136 134 81 161 81 88 214 177 55 215 225 50 134 260 191 25 89 105 81 49 140 30 65 105 276 302 172 190 51 139 188
2756 188 190 40 111 102 180 154 13 87 75 79 85 16 28 217 133 165 158 38 141 239 96 81 25 158 226 120 147 66 145 262 235 171 138
2369 138 49 110 285 168 94 26 82 86 32 131 112 131 45 146 109 296 178 108 194 60 132 112 67 330 200 98 76 132 155 15
2016 15 114 151 111 73 106 66 196 30 205 33 60 55 74 67 142 60 107 90 141 188 151 44 165 231 102 96 103 38 91 151 26 21 46 227
1617 227 186 169 117 43 161 111 181 61 105 134 183 284 83 196 234 188 97 88 189 145 124 196 150 291 204 129 150 103 247 173 188
1254 188 107 122 77 162 190 162 105 42 25 160 229 268 82 180 120 80 70 48 164 323 123 150 60 76 35 76 173 19 40 129 113 261
878 261 186 319 129 258 136 135 400 316 124 233 148 216 174 256 316 212 94 110 218 29 60 181 256 267 378 145 118 255
549 255 104 125 43 68 122 66 128 101 102 133 180 181 121 102 87 36 39 81 147 240 19 208 32 136 116 63 231 104 286 247 92 77
174 77 131 145 237 254 147 86 21 18 122 67 99 192 195 127 83 60 39 93 157 168 222 62 64 278 168 131 71 90 189 139 169
-190A69
##PAGE=	F1=3899.68
##FIRST=	25169.313707327481097,	5807.6787752999953227,	0.39421701431274414063
##DATA TABLE=	(F2++(Y..Y)), PROFILE
5808 77 197 84 47 126 148 113 133 120 41 107 97 119 134 272 147 402 313 165 198 272 216 141 121 59 48 40 126 129 22 24 71 82 176
5420 176 151 57 101 76 57 108 169 120 44 141 69 65 28 72 145 191 85 167 99 48 118 126 170 155 119 113 117 144 141 165 90 76 38 125 36 153
4998 153 226 158 88 84 120 99 217 191 193 59 62 83 99 17 90 239 32 290 97 276 222 84 50 87 252 191 153 194 225 124 255
4634 255 303 79 110 266 204 95 234 181 180 269 114 150 53 109 134 151 121 110 205 94 106 30 215 203 147 261 208 9 125 20
4282 20 86 57 175 301 157 111 60 69 37 96 156 196 175 110 153 116 165 98 170 161 37 141 159 119 56 99 41 128 163 100 59 116 194 200
3883 200 168 184 256 203 102 255 300 224 37 153 93 212 190 274 235 47 129 217 201 68 82 83 63 93 64 43 201 23 147 75
3531 75 123 88 117 62 100 129 112 95 87 175 230 199 183 110 155 135 146 92 53 11 155 135 61 328 279 241 139 77 169 214 138 94 104 113 206
3120 206 93 135 97 104 98 111 171 129 26 204 248 68 155 266 167 49 93 88 113 97 172 24 55 86 257 304 175 223 93 92 191 212
2744 212 75 65 84 193 149 43 81 54 68 50 5 38 189 131 113 104 35 160 262 97 84 46 137 193 140 91 83 170 215 234 174 167 74
2357 74 138 241 191 43 51 103 148 60 140 108 104 49 139 128 359 272 131 117 75 126 107 67 285 211 80 67 125 120 51 141 172 96 136 131
1958 131 130 166 74 260 59 11 56 100 59 115 68 132 103 82 137 133 20 197 274 104 137 88 40 102 147 34 50 23 245 190 162 138
1582 138 43 185 126 153 21 131 142 211 289 68 165 226 217 76 110 177 116 117 206 166 294 209 72 99 123 276 167 194 124 138 85
1218 85 88 183 122 72 29 34 145 277 233 72 177 126 101 37 106 159 276 150 136 99 92 50 45 111 37 86 54 215 321 164 294 110
843 110 255 138 105 339 252 154 274 168 218 172 257 310 240 91 130 242 11 49 192 232 262 400 191 131 263 121 108 15 115
502 115 202 27 82 33 87 102 203 202 136 127 79 16 75 38 132 210 48 275 57 155 124 78 215 67 241 235 69 62 148 172 244 265 111
115 111 27 45 33 115 37 163 177 136 83 55 14 59 88 128 163 242 84 100 240 155 106 77 20 154 151 175
-190A75
##PAGE=	F1=3797.42
##FIRST=	25169.313707327481097,	5807.6787752999953227,	0.36008405685424804688
##DATA TABLE=	(F2++(Y..Y)), PROFILE
5808 128 191 70 98 127 174 145 148 143 39 90 86 89 130 239 139 405 316 159 162 224 163 158 117 66 20 67 142 114 16 67 80 106 225 157
5409 157 80 87 88 39 99 186 165 77 140 79 33 39 77 159 221 89 137 107 39 104 119 141 137 76 90 135 112 97 96 130 108 74 136 14 132 202
4986 202 140 99 100 123 71 181 173 148 56 73 107 94 19 102 248 39 291 74 272 230 123 32 114 203 128 164 207 206 117 220 277 81
4610 81 105 262 156 102 206 150 238 307 126 125 56 87 146 197 168 120 224 96 112 55 196 167 148 231 159 40 95 50 72 54 142 271
4235 271 161 86 20 78 37 70 155 200 153 134 147 122 166 87 180 200 51 156 153 119 80 136 58 154 202 151 57 131 175 156 167 197 212 145
3836 145 79 245 308 203 37 140 101 233 219 262 228 28 99 231 229 21 63 65 99 148 64 67 206 60 135 86 108 128 167 94 107
3472 107 152 83 68 90 191 185 163 176 127 122 108 124 112 57 48 145 136 60 318 244 275 173 51 142 186 87 163 184 108 186 44 156 113 40
3073 40 96 131 113 69 17 195 267 96 166 250 144 67 108 81 152 143 201 89 49 76 215 275 155 224 137 65 191 208 102 27 89 190
2697 190 140 72 99 88 88 40 23 46 167 133 63 42 35 157 272 75 107 95 128 161 154 38 100 182 155 233 154 181 116 189 191 238 52 82
2298 82 128 208 90 139 106 83 59 132 137 400 339 132 39 119 133 100 63 231 188 90 79 120 90 89 143 179 112 204 134 211 130 129 304 93
1899 93 40 84 128 88 120 133 129 91 47 83 105 15 212 307 91 184 95 59 114 142 68 80 92 241 167 155 167 21 193 134 113 30 143
1512 143 147 253 295 43 132 216 223 44 149 171 86 93 194 181 274 195 30 72 153 284 175 195 134 164 93 3 182 80 38 25 63
1148 63 118 301 184 107 195 139 106 48 163 162 220 169 130 140 95 51 87 52 74 145 41 308 357 125 235 85 229 138 71 259 167
784 167 180 303 177 199 157 241 308 255 66 155 255 5 48 180 188 243 398 223 124 230 133 85 39 175 293 74 74 66 95 104 218
420 218 209 145 135 68 27 110 31 82 159 94 306 72 184 140 112 194 48 190 224 63 43 155 177 233 251 83 45 107 50 93 57 193
45 193 151 60 62 129 41 86 90 87 140 247 105 141 208 144 84 120 68 111 143 162
-190A62
##PAGE=	F1=3695.16
##FIRST=	25169.313707327481097,	5807.6787752999953227,	0.20039489865303039551
##DATA TABLE=	(F2++(Y..Y)), PROFILE
5808 173 184 57 133 136 198 165 157 175 66 65 82 74 113 201 144 387 292 146 132 167 112 164 102 77 25 90 156 117 21 98 97 121 271 150
5409 150 110 60 88 40 100 199 204 149 130 116 99 74 81 155 212 77 107 124 46 101 96 112 123 13 99 150 90 49 65 151 125 125 150 38 112
4998 112 165 127 108 113 133 56 161 145 116 37 105 123 88 41 93 215 34 287 69 257 222 161 41 128 140 71 177 208 162 93 172
4634 172 228 89 85 243 114 108 167 119 269 335 146 98 76 70 150 212 184 146 234 87 116 80 180 124 144 190 107 84 62 82 52 64 116
4247 116 224 148 52 62 105 78 27 140 179 108 171 131 121 154 71 191 226 74 166 157 112 90 163 91 186 226 187 47 147 152 97 140 214
3859 214 205 69 73 214 290 174 51 125 116 255 245 249 207 5 55 219 238 51 38 91 116 196 123 82 205 83 115 104 82 172 202 127
3484 127 132 175 64 76 119 203 144 118 150 143 88 76 116 129 105 67 110 116 55 298 196 299 237 41 91 117 131 236 248 127 133 8 181
3096 181 140 52 80 142 84 131 7 193 282 118 164 208 128 77 122 83 188 171 225 156 61 71 163 234 123 195 176 67 202 178 120
2732 120 40 110 191 127 93 116 118 112 86 43 58 177 130 28 58 69 136 272 40 150 155 140 137 161 67 130 186 92 232 111 178 157 231
2345 231 149 279 113 111 152 246 107 128 99 71 72 127 127 407 371 113 34 141 127 101 59 186 130 75 79 117 78 114 117 177 138 235 106
1958 106 269 112 157 321 114 84 112 142 119 135 176 92 66 39 42 81 28 203 327 75 231 123 86 126 136 99 105 148 211 119 159
1594 159 196 20 183 134 76 50 135 148 298 309 49 103 204 206 26 177 167 69 54 160 187 235 167 31 114 185 274 201 188 138 203
1230 203 95 86 192 44 24 49 90 92 306 139 164 233 163 93 102 214 180 161 175 138 182 85 40 122 9 109 202 117 370 367 77 149
854 149 74 182 131 47 174 80 196 315 173 166 134 213 309 253 46 187 258 21 49 141 127 211 367 230 106 170 129 63 48 227
502 227 382 163 146 142 124 127 219 209 148 127 63 48 133 66 51 105 126 301 75 206 163 145 178 85 145 208 86 17 142 157 211 217 69
115 69 97 154 45 93 76 184 138 22 92 213 73 112 94 51 108 240 115 176 175 127 65 164 132 75 121 139
-190A39
##PAGE=	F1=3592.91
##FIRST=	25169.313707327481097,	5807.6787752999953227,	0.074553191661834716797
##DATA TABLE=	(F2++(Y..Y)), PROFILE
5808 206 178 45 148 142 209 176 169 218 116 46 80 77 88 168 155 348 251 142 114 115 81 145 73 96 39 103 164 135 58 116 119 134 304 133
5409 133 137 32 89 59 109 205 230 210 114 144 165 110 87 137 171 49 91 149 71 108 63 93 125 57 137 159 85 44 97 152 129 156 157 62 127
4998 127 126 122 109 118 150 56 163 115 132 18 130 135 85 62 70 144 25 280 99 237 207 190 82 124 80 32 185 199 99 55 127 166
4622 166 100 55 203 90 101 125 92 268 345 166 87 117 90 150 199 171 175 234 78 132 100 171 87 131 156 86 127 34 109 33 94 111 173
4235 173 130 83 133 136 128 37 122 134 90 215 110 120 126 50 200 241 97 169 166 98 74 176 111 207 235 201 39 162 149 87 96 224 232 18
3836 18 87 174 252 143 61 110 131 278 266 245 177 21 12 187 225 92 43 114 107 226 172 80 187 95 95 119 52 207 215 154 166 197 61
3448 61 91 168 215 118 79 112 154 57 46 126 130 140 61 71 79 53 272 143 273 278 45 66 42 208 291 286 176 70 39 200 183 98 64
3061 64 146 67 204 68 182 296 131 148 143 117 80 119 79 211 174 240 216 95 70 126 215 120 151 203 70 224 124 129 73 126 204
2697 204 111 100 119 125 123 130 56 78 216 114 13 116 126 107 264 15 197 212 168 125 163 121 170 185 39 229 72 153 191 247 121
2333 121 299 170 133 167 255 107 112 89 71 80 121 98 378 366 81 71 143 96 128 58 161 54 31 80 113 80 115 67 174 156 217 53
1958 53 290 134 152 303 117 119 131 139 131 138 188 55 84 53 32 75 63 163 330 75 268 162 119 136 131 122 127 183 155 71 179 216 63
1570 63 163 126 53 42 108 139 333 329 89 82 184 170 43 177 156 75 17 113 181 179 132 32 181 216 250 237 174 142 242 88 150 203
1195 203 21 53 92 106 68 297 114 213 280 198 72 159 262 214 104 165 158 220 83 19 135 11 131 241 168 388 353 62 53
854 53 83 125 115 51 96 11 202 310 157 126 109 180 310 236 65 223 258 47 62 80 74 173 310 211 84 103 110 54 74 266 454
491 454 248 227 200 152 145 203 209 145 107 69 57 141 119 118 75 143 274 73 211 190 173 177 131 117 180 106 11 108 119 187 175 82 133 177 31
80 31 142 82 141 155 99 136 276 87 141 100 51 79 220 111 199 137 96 46 190 173 64 96 109
-190A09
##PAGE=	F1=3490.65
##FIRST=	25169.313707327481097,	5807.6787752999953227,	0.11833391338586807251
##DATA TABLE=	(F2++(Y..Y)), PROFILE
5808 223 170 40 140 140 206 177 187 262 175 40 74 94 83 140 158 293 214 151 111 79 86 106 38 116 39 102 160 157 102 122 140 153 318 121
5409 121 150 54 104 79 119 207 236 245 94 154 211 143 105 113 113 20 103 179 104 115 37 99 141 116 178 157 94 75 128 137 128 156 148 85 167 99 126
4974 126 99 111 171 65 176 90 182 78 139 141 85 82 49 56 46 269 147 223 195 208 123 100 63 29 185 187 46 32 109 104 111 50 142 80
4575 80 79 88 72 237 330 173 95 164 132 153 165 139 195 222 98 171 111 172 63 109 156 121 154 34 123 26 131 125 134 125 163 199 160 169 80
4164 80 107 76 150 258 89 119 83 30 207 246 122 167 173 79 35 177 116 209 229 186 63 172 169 139 54 218 257 83 110 134 196 106
3789 106 68 98 142 301 282 248 142 48 55 149 194 115 70 123 80 238 200 65 154 102 74 120 30 224 206 167 202 218 57 100 220 227
3413 227 111 58 72 157 35 57 146 113 148 43 102 58 74 242 96 146 249 43 100 36 241 315 300 229 114 64 215 233 121
3073 121 63 154 63 219 197 143 309 134 122 63 102 74 97 61 218 152 250 261 146 79 117 235 169 118 212 65 240 64 132 96
2721 96 122 217 96 90 103 106 123 155 57 100 254 92 19 157 187 82 251 39 239 252 202 128 166 155 205 185 24 219 103 109 216
2357 216 237 113 297 214 143 169 232 93 98 77 84 70 109 55 318 331 48 78 145 51 176 62 154 40 43 110 107 73 89 12 173 162
1981 162 156 51 275 175 122 251 101 144 140 121 123 129 174 101 140 87 39 91 117 99 309 91 288 206 158 138 122 130 146 196 85 91 205
1594 205 216 100 143 120 46 19 71 117 353 344 130 64 149 128 55 146 134 89 58 65 166 113 100 11 242 242 214 268 160 152 266 72 178
1207 178 201 15 93 138 110 41 286 121 240 322 237 67 210 309 259 52 139 180 239 110 15 129 8 134 256 180 355 322
878 322 102 32 97 72 88 69 32 38 198 288 134 87 86 151 308 210 96 257 263 85 90 24 108 135 236 171 63 52 87 63 120 290
502 290 495 308 285 228 163 150 172 207 130 85 88 49 136 175 190 87 146 240 75 194 209 191 187 159 101 135 108 37 70 77 168 135 114 148
103 148 173 46 205 78 89 192 162 170 307 83 177 112 65 58 189 97 205 93 54 25 195 190 80 78 75
-190G5
##PAGE=	F1=3388.39
##FIRST=	25169.313707327481097,	5807.6787752999953227,	0.21140213310718536377
##DATA TABLE=	(F2++(Y..Y)), PROFILE
5808 221 156 44 114 129 194 165 209 289 226 40 67 115 122 119 143 227 199 164 114 62 104 61 54 131 26 87 143 173 141 123 158 178 311 123
5409 123 139 99 128 92 121 206 219 244 79 147 226 167 134 92 64 51 132 209 141 113 61 128 165 157 210 141 105 93 143 113 130 127 126 109 203 90
4986 90 138 83 89 190 75 185 69 231 151 139 144 90 102 56 85 84 247 196 221 198 212 151 63 94 47 183 175 75 79 117 58 113 88 71
4587 71 75 46 63 72 181 287 161 104 201 167 160 125 103 203 196 153 225 109 175 54 81 189 175 158 54 121 42 163 139 113 143 246
4211 246 247 171 190 108 95 38 228 293 72 117 32 28 210 244 151 160 175 60 21 169 118 184 217 144 106 179 195 190 45 191 258 131 130
3824 130 103 129 67 74 93 148 321 299 255 114 75 101 128 154 113 82 128 55 231 209 61 113 111 55 111 36 217 182 165 228 235 44 108
3437 108 258 234 116 59 37 154 31 102 163 85 130 63 184 90 110 205 72 124 242 63 138 80 229 308 298 264 211 85 229
3096 229 277 119 70 168 279 266 336 76 316 127 98 40 84 60 65 31 209 112 261 287 207 104 112 265 233 118 202 51 231 47
2744 47 129 104 95 210 85 65 70 64 125 161 49 120 273 79 43 175 238 74 235 60 269 264 226 142 177 162 226 186 46 201 169
2380 169 53 229 214 127 279 240 142 156 183 73 94 67 109 39 88 16 243 276 20 59 157 51 222 70 153 75 84 146 98 44 39
2016 39 67 170 156 70 135 235 206 78 179 71 160 145 97 101 121 146 167 190 138 69 127 177 42 258 100 286 249 196 124 104 119
1653 119 164 192 21 147 224 195 119 131 117 56 41 31 80 353 345 159 40 99 97 50 89 103 102 113 35 149 54 86 40 287 262 172 282
1265 282 149 169 267 51 166 179 26 141 181 106 44 284 157 240 349 272 85 244 357 307 11 101 195 229 158 59 107 25 118
925 118 247 152 278 283 138 93 102 37 55 81 19 53 189 254 110 55 65 137 304 184 116 280 277 127 123 65 186 104 154 123 39 37 74
538 74 86 168 297 496 330 302 223 152 146 128 198 110 76 121 21 126 217 235 104 141 214 88 155 214 196 192 162 87 78 90 55 75 69 161
138 161 104 151 143 148 71 249 69 79 226 201 185 305 81 221 136 60 44 149 75 188 43 10 10 183 190 101 76 52
-190E2
##PAGE=	F1=3286.13
##FIRST=	25169.313707327481097,	5807.6787752999953227,	0.3587061464786529541
##DATA TABLE=	(F2++(Y..Y)), PROFILE
5808 202 136 46 82 115 178 137 233 282 254 46 77 133 176 113 112 162 204 168 114 48 112 44 109 138 6 59 115 175 163 123 168 195 287 128
5409 128 106 133 143 92 113 202 186 208 73 131 206 179 161 78 53 96 164 235 174 100 110 166 188 177 224 112 106 92 150 84 134 78 99 131
5010 131 220 94 152 69 55 201 79 188 53 262 218 138 144 103 122 75 176 114 214 236 227 219 202 162 23 120 74 184 159 116 136
4646 136 131 44 101 128 50 73 13 48 93 110 216 126 101 216 186 170 97 74 196 154 216 277 92 173 48 67 223 217 137 66 100 64 186
4258 186 141 111 174 311 270 166 189 118 80 69 287 316 60 112 12 47 208 237 181 151 171 45 70 156 133 136 207 91 147 181 212
3894 212 220 63 148 234 153 141 80 56 46 83 100 149 333 315 261 104 98 133 131 121 85 70 134 62 212 200 79 75 126 35 108 51 189 153
3495 153 149 235 245 46 114 268 228 121 81 13 151 43 147 172 67 92 114 263 128 142 160 85 524 525 123 156 124 214 285 289 268
3132 268 285 107 238 302 104 76 180 608 537 387 17 309 119 91 126 77 43 48 19 187 68 275 293 268 140 82 272 284
2803 284 134 175 27 190 87 120 97 55 171 80 28 34 34 144 156 35 134 270 86 72 170 269 80 214 70 284 245 232 157
2462 157 199 151 228 189 60 176 220 22 226 201 155 252 249 133 129 119 71 108 57 142 47 78 47 176 214 2 28 171 92 249 81
2099 81 150 66 90 161 85 9 31 127 159 139 43 218 191 211 42 122 31 168 154 75 75 119 117 206 215 198 131 173 228 93 178 90 261 280
1700 280 227 97 71 89 183 181 51 183 224 155 118 129 111 84 69 21 46 336 328 173 6 47 94 35 17 74 115 168 39 135 50 94
1324 94 91 309 273 131 273 146 190 247 35 118 141 54 190 214 99 98 297 204 218 352 291 106 256 402 349 21 57 198 184
984 184 209 113 73 65 88 223 90 173 246 144 123 90 24 25 86 56 44 177 213 93 31 49 142 299 161 126 286 292 161 147 106 252
608 252 80 75 85 19 48 77 118 204 287 456 310 273 189 121 139 79 180 104 87 163 33 118 233 248 110 136 202 112 104 201 183 177 140
221 140 74 26 62 66 120 94 166 85 184 126 111 80 255 61 117 244 209 181 275 101 264 173 42 34 102 49 150 7 31 27 160 184
-155 184 113 91 80
-190H0
##PAGE=	F1=3183.88
##FIRST=	25169.313707327481097,	5807.6787752999953227,	0.36228290200233459473
##DATA TABLE=	(F2++(Y..Y)), PROFILE
5808 170 109 40 74 103 163 95 261 240 250 62 106 144 221 124 78 117 214 157 100 26 101 61 157 137 19 29 82 164 164 126 172 193 256 120
5409 120 64 144 141 79 98 195 146 145 74 115 155 176 175 66 57 130 190 250 198 85 161 198 207 184 215 78 92 77 161 55 131 31 75 140 217
4998 217 102 163 70 38 196 79 192 41 271 267 143 141 119 142 88 242 127 177 260 236 248 180 160 17 126 107 190 139 130 183 134
4634 134 47 78 156 114 69 15 39 124 52 125 74 80 211 193 182 86 50 180 98 268 309 64 163 41 83 238 237 99 65 64 82 201
4258 201 131 126 204 346 270 145 168 119 63 101 309 324 54 102 41 67 199 222 207 141 165 34 103 138 163 72 207 77 173 180 218 234
3883 234 77 98 194 160 143 57 25 83 97 112 148 333 329 264 112 113 146 145 114 38 39 140 83 185 178 99 53 144 18 126 65 146 128 125
3484 125 226 247 78 110 242 202 116 108 2 150 55 177 172 74 44 164 316 142 157 109 116 1021 998 200 154 154 223 266 280 238 311
3120 311 129 235 302 89 80 175 973 1022 249 19 283 115 102 212 85 54 56 50 160 48 288 279 316 175 26 243 308 139
2791 139 133 15 121 113 105 80 47 106 79 26 53 92 178 151 24 145 259 111 99 155 274 87 189 71 283 201 215 167 227 150 218
2427 218 192 62 146 237 72 202 203 184 223 241 126 88 68 99 133 46 175 124 107 82 137 157 17 32 170 112 243 90 142 18
2075 18 74 143 72 59 98 171 136 109 113 279 173 183 54 136 14 168 174 61 57 113 97 204 215 257 208 213 257 160 82 60 216 288 244
1688 244 95 23 44 209 172 89 181 198 103 104 134 97 125 79 89 84 304 297 174 35 49 108 37 53 68 133 222 58 131 79 108 135 306
1300 306 275 114 242 150 208 213 40 47 96 93 230 233 96 155 318 242 184 323 283 119 244 434 375 40 28 188 114 251 169 40
948 40 111 50 192 10 81 218 119 130 61 14 11 85 85 36 159 170 88 14 43 161 294 139 127 276 300 176 157 117 285 61 9
584 9 66 49 68 89 150 222 264 383 253 206 132 83 128 44 161 122 105 207 97 117 221 232 107 143 205 146 58 170 152 140 98 63
209 63 35 36 71 159 114 177 79 210 112 79 70 222 56 149 243 187 164 227 139 295 214 67 23 54 26 91 56 49 55 134 186 109 119 130
-190A30
##PAGE=	F1=3081.62
##FIRST=	25169.313707327481097,	5807.6787752999953227,	0.17250692844390869141
##DATA TABLE=	(F2++(Y..Y)), PROFILE
5808 131 77 22 95 98 149 51 288 181 221 87 137 146 244 139 70 106 214 128 72 30 71 70 181 128 33 37 46 144 144 133 172 171 227 102 63
5397 63 129 119 58 83 184 111 72 79 108 84 159 166 44 45 142 203 250 207 81 208 217 215 179 183 43 66 56 174 30 113 43 57 133 195 105
4986 105 163 83 81 172 84 200 31 264 294 144 130 127 159 94 271 118 150 267 240 266 144 151 37 112 135 200 123 127 214 127 47 49 169
4599 169 176 55 43 33 153 81 43 26 46 195 200 198 81 17 164 39 295 311 29 145 37 112 227 228 56 57 25 92 208 117 151
4235 151 221 346 257 115 134 118 45 111 291 314 57 91 47 82 185 197 222 136 158 27 111 112 196 55 212 123 180 176 218 237 83
3871 83 55 154 167 143 30 93 137 114 126 147 319 332 260 125 116 141 154 134 18 56 136 93 155 147 104 54 157 16 158 89 98 109 96
3484 96 206 239 114 89 184 156 100 125 9 150 56 184 164 84 24 200 331 128 153 59 143 1529 1517 273 135 152 218 270 274
3143 274 180 281 144 215 278 76 90 146 1282 1696 354 59 232 113 123 286 94 91 65 79 135 72 291 249 338 195 64
2826 64 191 302 124 79 57 51 114 87 63 76 33 80 84 104 163 215 148 22 152 250 142 118 141 252 89 157 68 267 154 179 172 257
2451 257 183 208 192 56 110 215 111 156 199 202 194 223 133 35 85 137 153 36 202 211 156 101 126 112 43 60 147 94 201 93 126 62 88
2063 88 105 64 105 153 194 108 78 160 304 190 123 92 197 60 170 200 62 59 92 86 164 196 304 282 236 255 202 58 16 160 267
1700 267 244 150 45 38 246 172 113 142 147 54 94 144 81 170 71 177 158 264 256 165 80 90 117 56 107 83 157 268 81 136 86 114 160
1312 160 283 262 132 200 157 217 177 57 34 60 138 253 238 101 194 331 257 153 263 244 117 213 442 377 49 52 168 56 279
972 279 216 60 154 20 160 71 104 201 69 131 25 25 7 91 106 51 133 132 90 7 51 186 288 115 113 251 294 167 146 98 278
608 278 36 44 68 93 95 101 174 223 234 292 175 130 66 63 104 45 149 143 113 240 168 119 184 201 104 162 225 181 49 126 104 89 48 52 61 16
185 16 77 174 114 185 84 228 110 61 69 163 55 159 227 143 142 176 174 307 247 130 10 43 31 19 102 43 95 111 197 87 149 171
-190A71
##PAGE=	F1=2979.36
##FIRST=	25169.313707327481097,	5807.6787752999953227,	0.14152310788631439209
##DATA TABLE=	(F2++(Y..Y)), PROFILE
5808 88 46 7 114 100 134 36 304 157 184 115 158 144 240 143 87 118 199 83 52 70 28 61 171 112 35 68 18 123 106 145 170 141
5432 141 205 105 101 91 87 40 74 172 87 41 88 106 23 129 137 6 18 127 197 232 200 92 243 223 208 159 133 14 38 38 177 32
5056 32 80 76 41 108 160 95 152 103 138 127 101 208 27 257 301 137 104 116 170 101 261 92 139 258 236 262 97 138 41 83 147 211
4681 211 128 152 232 115 49 30 167 217 28 74 34 177 142 105 55 22 186 215 221 65 29 157 16 288 282 8 121 40 137 198
4329 198 194 28 59 43 90 205 107 173 218 312 243 89 98 124 26 100 238 286 68 85 49 91 169 159 222 138 154 24 98 80 218 129
3953 129 212 168 166 171 218 234 88 29 129 182 147 34 152 186 129 134 143 290 313 245 132 105 121 155 163 71 121 121 85 121 114 92 72 158 25
3542 25 191 134 52 100 67 186 219 139 51 112 98 82 121 28 147 42 165 149 83 64 221 310 96 134 33 158 1948 1960 325
3202 325 106 138 177 300 268 109 201 146 178 232 56 121 96 1454 2548 1164 262 162 114 158 340 95 128 77 102 121 104 275
2873 275 208 326 190 148 149 272 93 25 84 55 89 68 58 94 73 83 149 151 221 239 144 24 156 246 173 131 133 212 88 124 62 239
2498 239 138 135 172 282 235 209 183 53 69 162 127 89 171 199 169 198 153 24 135 167 155 35 216 287 197 102 120 79 73 78 107 40 132
2110 132 84 103 109 115 85 68 128 185 198 92 95 175 290 219 50 134 254 113 189 230 73 77 61 77 101 171 332 337 233 223 207 138 35
1723 35 101 217 229 227 107 97 287 179 135 85 78 42 100 155 82 204 54 270 228 220 214 151 122 120 113 65 136 97 178 299 111 143 63 107
1324 107 160 244 233 163 161 159 216 145 75 105 59 182 255 228 113 205 322 239 142 183 176 100 171 419 350 56 79 148 89 291 244 115 187
937 187 37 128 139 170 190 16 138 35 54 20 114 120 67 95 112 87 20 69 210 279 98 77 220 273 137 116 63 233 22 76 91
573 91 133 121 108 181 212 205 200 101 111 44 79 60 56 142 146 102 247 231 124 137 169 103 184 252 208 61 79 45 49 13 36 87 14 81 164 93 183
138 183 96 243 114 64 112 108 63 146 204 93 125 129 200 299 262 193 7 83 56 60 138 19 145 93 206 48 171 189
-190A89
##PAGE=	F1=2877.1
##FIRST=	25169.313707327481097,	5807.6787752999953227,	0.28771099448204040527
##DATA TABLE=	(F2++(Y..Y)), PROFILE
5808 43 29 29 120 110 123 60 300 199 169 139 162 142 215 129 97 126 171 31 85 104 22 49 130 92 26 94 32 109 61 159 168 119 188 149 126
5397 126 40 67 47 70 165 75 79 97 100 55 91 94 45 35 86 169 197 175 106 262 218 183 115 79 9 27 30 165 61 38 98 25 74 120 71
4986 71 138 129 187 76 131 211 33 267 299 120 64 85 173 106 223 62 132 236 221 232 40 124 28 61 143 213 156 226 248 106 58
4622 58 40 156 232 22 106 40 191 191 194 94 66 200 239 247 39 88 156 50 249 225 35 94 45 147 163 149 28 81 91 76 186
4258 186 98 181 194 254 233 86 68 138 6 78 162 241 82 88 85 96 159 108 205 145 162 27 90 56 225 208 200 183 136 167 220 223 93 12
3859 12 121 194 157 79 195 218 140 133 130 246 268 212 131 84 96 152 185 109 187 101 64 78 86 66 97 141 34 222 193 29 120 46 168
3472 168 184 147 21 80 39 85 97 52 144 34 127 134 70 103 228 264 71 114 44 154 2187 2223 344 75 172 135 338 258 75
3132 75 121 134 135 173 26 181 58 1469 3536 2282 585 79 155 214 368 109 157 113 126 116 128 242 162 277 158 215 159
2815 159 227 51 48 82 95 49 50 72 85 145 85 209 185 253 240 134 24 155 239 200 139 123 168 87 98 54 202 157 100 172 298 281
2439 281 218 163 65 28 94 119 13 119 176 154 170 178 81 173 178 132 52 215 337 218 87 115 64 98 85 72 38 76 66 81 116 115 105
2052 105 80 122 189 188 104 154 165 241 239 62 175 292 170 225 258 88 102 50 63 35 146 336 365 208 168 180 194 78 51 147 204
1688 204 289 156 156 325 195 164 76 24 60 113 160 113 217 31 349 277 174 175 137 157 130 98 64 134 102 192 310 149 142 28 88
1324 88 136 192 188 186 138 151 203 123 91 162 80 217 239 205 128 188 284 194 153 101 90 68 130 364 296 73 85 135 144 288 249 172 207 60
925 60 99 181 208 176 53 144 72 77 59 153 124 67 47 123 79 48 89 227 268 107 18 196 243 98 68 44 161 72 94 134 162 138 108
538 108 169 194 184 122 76 162 92 105 39 59 133 124 72 222 273 130 93 146 97 199 275 224 53 48 18 69 44 22 140 59 75 136 63 168
138 168 108 253 107 94 172 98 82 115 186 62 122 88 220 281 253 236 24 125 80 131 162 27 199 81 204 1 177 179
-190A79
##PAGE=	F1=2774.84
##FIRST=	25169.313707327481097,	5807.6787752999953227,	0.39475330710411071777
##DATA TABLE=	(F2++(Y..Y)), PROFILE
5808 12 46 47 123 126 118 78 270 258 185 152 152 141 178 99 84 123 139 34 136 118 70 60 68 83 20 111 59 104 20 171 168 116 180 203 124 13
5385 13 76 67 66 169 79 102 96 84 78 49 62 100 73 40 120 150 139 112 262 208 144 45 64 15 33 37 145 90 31 111 21 46 82 37 128 158
4963 158 217 82 168 204 41 298 295 98 23 43 167 101 168 52 117 206 200 191 26 106 5 70 131 198 186 316 266 106 69 55 138
4599 138 225 68 129 43 193 221 261 114 116 237 267 269 24 147 152 65 187 154 54 66 48 139 137 122 43 111 136 63 151 84 169 152 191
4211 191 219 99 47 155 30 56 78 184 92 97 144 100 159 54 176 155 191 34 118 60 218 269 174 164 97 162 225 205 94 18 123
3848 123 190 170 131 216 226 144 121 101 190 193 159 123 56 79 149 193 127 235 92 51 35 71 45 120 112 39 259 253 45 167 64 145 136 139
3448 139 54 118 22 116 73 75 144 80 91 125 58 131 226 211 76 101 59 131 2198 2244 324 55 206 108 352 238 130 167 115 95
3096 95 127 9 273 109 1400 4548 3515 980 44 255 284 365 153 190 165 155 107 144 201 120 199 116 248 192 179 6 91
2779 91 54 110 3 41 102 53 199 83 253 202 255 213 121 21 149 221 217 144 109 144 87 89 44 158 176 89 174 304 305 221 135 90 45
2392 45 51 91 73 57 136 147 140 197 126 186 163 100 84 206 353 213 67 127 74 114 86 70 121 115 67 83 131 135 129 92 92 170 173 128 211 147 171
1958 171 242 132 211 310 229 262 280 97 128 76 44 14 118 317 367 170 103 129 204 109 26 71 179 318 181 204 349 213 196 132
1606 132 73 65 121 156 152 207 10 397 296 129 145 126 183 128 80 85 105 105 198 299 189 129 68 67 93 128 132 193 131 138 179 115 106 199 97
1195 97 238 212 169 138 153 223 136 175 56 20 25 98 288 223 101 71 127 180 273 238 223 210 70 86 195 209 155 90 134 96 83 102 194
807 194 116 53 26 158 72 88 108 235 254 143 53 190 207 75 16 68 79 142 101 193 180 145 96 141 174 171 76 107 210 135 127 116 81
420 81 119 87 52 170 284 138 63 136 84 201 289 233 21 57 68 114 70 49 220 116 56 101 46 146 111 254 81 149 223 124 109
56 109 73 176 57 139 51 245 271 218 251 40 157 97 189 170 64 241 72 183 50 165 148
-190A48
##PAGE=	F1=2672.59
##FIRST=	25169.313707327481097,	5807.6787752999953227,	0.44763320684432983398
##DATA TABLE=	(F2++(Y..Y)), PROFILE
5808 58 74 54 141 144 117 78 218 298 210 151 134 139 143 63 48 112 118 77 172 106 111 84 33 103 37 127 78 105 27 178 166 126 185 237 96 59
5385 59 94 83 57 177 103 98 79 64 66 8 78 148 101 76 59 106 97 105 242 197 100 42 103 25 35 57 131 108 70 123 41 45 53 7 118 182 220
4951 220 149 213 192 41 336 295 79 49 46 159 83 111 71 95 173 179 177 99 82 25 96 129 162 203 389 281 107 72 63 117 205 113 134
4564 134 44 181 233 296 116 155 277 293 280 48 191 137 64 120 85 64 40 45 118 122 133 77 136 173 69 99 60 141 103 147 194 110 36
4176 36 166 62 38 11 129 93 107 197 101 165 51 141 163 239 48 168 78 205 303 144 117 62 156 228 179 89 47 126 168 183 180 215
3801 215 210 139 103 57 125 99 90 115 39 87 141 188 126 260 102 82 61 67 46 137 96 44 300 296 59 221 107 109 78 119 84 156 60 150
3401 150 87 87 150 148 95 132 60 149 217 167 87 95 69 93 1987 2021 269 62 153 18 314 206 205 287 107 70 135 41 390 196 1403
3038 1403 5415 4618 1366 117 384 348 331 206 234 211 185 90 150 167 90 113 110 244 205 138 41 106 46 105 39 53 144 13 232
2697 232 74 274 203 231 157 111 15 138 194 221 143 101 148 86 92 36 110 173 91 181 297 301 208 111 120 98 88 63 143 38 88 139 108 203
2298 203 149 174 128 96 124 197 336 189 69 162 100 117 93 84 186 186 102 114 209 216 140 95 62 137 162 142 238 135 104 226 178 237 314
1911 314 282 279 293 97 148 100 32 44 85 279 345 132 52 71 170 128 32 35 167 304 177 236 351 228 221 181 117 51 120 140 183 180 28
1523 28 405 281 88 128 123 201 122 74 140 61 125 200 273 223 107 130 59 51 54 80 184 135 140 149 120 122 217 103 244 182 125 137 118 154 95
1113 95 192 71 82 35 81 204 141 131 60 112 199 250 221 263 196 66 100 182 182 125 105 102 100 73 137 222 97 35 72 199 79 132 127 234
714 234 239 184 122 198 174 82 56 97 6 214 108 258 189 141 73 102 152 160 81 137 229 158 142 202 136 107 57 90 117 263 143 62 138 71
315 71 195 295 246 28 78 101 152 83 93 301 171 25 68 57 122 101 239 38 218 251 147 137 30 166 53 174 33 278
-14 278 278 167 234 55 175 105 227 163 90 260 63 145 97 135 114
-190A14
##PAGE=	F1=2570.33
##FIRST=	25169.313707327481097,	5807.6787752999953227,	0.34830039739608764648
##DATA TABLE=	(F2++(Y..Y)), PROFILE
5808 105 100 48 175 161 109 64 157 308 225 133 115 132 122 38 26 104 129 106 182 79 140 97 76 140 58 147 85 108 55 177 159 139 201
5420 201 238 61 91 102 88 44 181 136 88 55 50 25 38 118 176 122 146 31 84 59 85 202 186 61 128 143 56 42 87 135 108 102 140
5033 140 68 55 43 19 96 194 193 217 261 182 29 364 293 67 85 87 153 62 62 97 86 142 166 219 173 51 52 114 144 107 206 427 283 105
4634 105 65 65 93 183 146 116 44 158 228 299 108 171 303 308 272 73 207 108 63 75 48 67 25 38 96 106 161 126 152 199 91 40 33
4247 33 105 74 139 150 108 29 160 93 15 73 100 85 109 226 96 169 108 104 166 288 68 211 93 194 306 119 63 56 145 227 148
3883 148 80 78 121 157 198 220 193 178 131 85 2 58 35 35 112 55 118 125 184 125 262 121 139 128 65 50 141 114 48 334 311 56 260 152
3484 152 61 20 92 94 167 92 168 123 84 159 213 133 158 89 156 200 147 86 92 79 53 1613 1613 188 100 53 180 217 159 266 391 121
3108 121 64 187 60 511 278 1556 5945 5345 1651 188 507 388 273 231 275 229 210 70 144 144 71 81 155 205 178 103 85
2791 85 85 70 93 75 79 183 24 246 53 265 194 192 82 111 26 127 164 212 136 115 162 79 93 45 67 149 93 189 280 271 188 118 150 149
2392 149 141 69 195 74 49 124 83 196 146 147 82 133 169 195 295 163 102 203 124 111 114 83 216 237 144 149 284 275 140 89 82 102 163
2005 163 135 222 133 86 197 188 249 310 317 266 292 89 162 105 48 64 46 230 303 99 54 21 119 141 33 78 171 254 148 249 329 232
1629 232 231 202 136 31 118 117 198 150 52 375 237 50 123 127 213 119 88 203 14 171 204 236 242 84 176 68 86 44 59 164 148 166
1254 166 128 135 139 218 98 232 152 76 129 91 94 91 198 86 129 80 81 131 69 152 98 79 209 228 211 286 168 58 123 149 141 95 109 59
854 59 85 63 152 226 69 23 110 231 97 168 145 226 226 214 166 205 147 92 108 117 48 276 129 319 190 129 39 66 127 143 109 149 224
467 224 162 155 268 200 108 57 143 122 221 136 91 152 77 192 301 269 82 89 108 177 86 132 361 210 29 41 69 104 80 207 16 281
92 281 252 160 159 32 147 49 217 63 307 297 122 190 71 181 105 247 148 97 251 65 94 133 92 99
-190I9
##PAGE=	F1=2468.07
##FIRST=	25169.313707327481097,	5807.6787752999953227,	0.3616263270378112793
##DATA TABLE=	(F2++(Y..Y)), PROFILE
5808 141 121 38 209 175 86 47 104 294 228 95 98 122 118 48 88 101 166 116 169 78 152 92 106 173 74 172 75 113 74 164 141 150 215 205 56
5397 56 111 97 84 35 174 165 112 76 44 41 79 153 183 142 204 80 92 38 57 147 170 36 194 163 101 69 123 148 88 116 166 94 58 58 30
4986 30 62 196 141 265 301 180 20 367 284 62 102 113 153 72 26 121 97 114 158 283 240 24 74 116 164 42 201 425 266
4646 266 91 51 68 73 166 163 82 44 126 212 270 99 164 305 304 241 83 190 69 76 80 62 66 33 25 95 85 182 172 154 209 107 21 13 74
4235 74 86 152 91 92 24 136 120 23 126 117 74 97 218 79 167 164 82 163 325 88 234 102 194 281 104 52 85 129 217 118 72 102
3859 102 110 186 217 247 157 142 126 81 55 29 110 79 119 87 156 103 199 146 248 142 201 190 64 41 128 146 48 346 293 40 274 188
3484 188 8 28 67 85 156 119 166 148 65 164 256 167 198 143 154 175 157 77 100 91 38 1167 1122 97 154 260 427 98 102 297 454
3120 454 149 69 233 71 607 329 1748 5983 5518 1760 237 591 392 205 203 287 209 221 64 126 125 50 136 200 143 117 70
2803 70 120 30 85 84 104 101 204 43 245 16 228 182 154 32 122 56 122 139 195 127 148 166 65 83 81 60 119 96 194 252 223 185 155
2416 155 176 190 181 99 222 99 49 105 88 175 121 126 46 171 211 206 245 156 146 231 138 103 143 62 202 257 171 172 284 240 131 81 125 74
2016 74 177 110 161 129 121 164 161 243 303 326 221 280 77 170 91 75 91 10 176 243 72 81 24 128 155 31 110 182 182 107 244 285 218
1629 218 223 194 130 44 122 95 197 126 67 316 179 20 128 130 223 121 111 248 27 227 213 194 236 69 192 89 168 118 76 137
1277 137 171 198 139 157 159 205 85 206 119 39 132 68 69 99 191 86 143 111 92 81 49 159 162 41 208 211 207 289 133 67 137 105 106 75
878 75 122 69 59 75 146 203 51 12 128 242 111 189 163 213 218 224 172 197 132 91 143 134 74 319 165 368 183 107 6 58 93 116 135
491 135 142 206 154 168 300 250 125 61 177 176 187 111 131 172 103 200 315 295 125 88 88 186 83 155 382 226 71 16 67 98 72 161
115 161 71 325 228 167 172 68 111 80 256 103 318 309 114 132 89 175 100 253 136 85 218 89 38 157 49 105
-190A05
##PAGE=	F1=2365.81
##FIRST=	25169.313707327481097,	5807.6787752999953227,	0.57550066709518432617
##DATA TABLE=	(F2++(Y..Y)), PROFILE
5808 157 132 34 229 184 46 62 77 268 226 43 88 112 126 77 156 102 208 115 151 123 149 69 105 189 82 195 50 119 85 139 109
5444 109 154 217 147 73 123 86 72 51 165 182 168 139 39 97 114 173 175 170 239 124 107 48 33 84 144 25 227 159 150 112 162 160 59 113
5045 113 199 116 55 90 52 57 195 73 286 321 180 41 342 260 61 103 111 157 107 32 144 108 86 146 331 293 61 89 104 182 41
4681 41 196 389 235 67 38 73 64 150 165 47 46 91 191 220 91 141 280 271 188 77 142 33 95 102 80 61 45 27 122 69 189 200
4305 200 143 201 104 68 16 63 113 160 27 69 20 102 145 69 161 152 64 70 173 48 154 203 93 160 337 101 230 110 202 237 90
3941 90 82 119 110 200 93 70 118 95 240 238 257 116 120 129 92 101 70 173 128 132 117 189 86 233 190 232 162 249 234 79 49 95 164 42 324
3531 324 244 50 259 213 42 58 57 62 137 142 145 151 36 158 261 184 247 214 146 145 196 72 139 103 55 743 661 16 190 404 574 82
3155 82 42 288 468 172 73 247 83 647 328 1816 5471 5080 1660 258 611 355 148 123 256 151 211 77 97 95 19
2862 19 193 220 74 37 45 138 58 112 79 127 112 197 41 232 41 170 174 125 80 133 90 126 120 176 124 179 160 43 71 133 90 101 98 190
2462 190 215 172 212 194 199 214 203 121 225 116 78 98 126 148 87 132 45 186 239 222 204 171 188 238 141 104 170 49 147 248 172 178 191
2075 191 105 109 86 156 78 200 83 68 114 158 143 107 221 292 307 153 261 67 177 71 94 120 11 127 172 48 99 60 206
1735 206 170 45 117 190 110 68 222 224 182 199 167 109 76 130 79 185 115 69 244 134 2 137 126 233 126 128 254 59 276 225
1383 225 151 203 65 175 130 254 175 91 106 199 212 179 185 177 180 72 172 79 54 162 37 77 99 173 83 131 118 103 53 93 152 219 82
995 82 187 199 203 273 102 93 135 61 89 73 152 126 35 100 124 160 74 24 128 231 112 190 176 195 215 214 136 168 131 82 156 151 75 338 207
584 207 396 169 74 48 81 51 89 150 126 189 145 181 291 268 152 56 180 223 193 70 168 191 134 214 333 312 144 84 52 177 78
221 78 154 360 219 105 8 52 107 109 113 117 336 191 168 172 97 63 126 274 133 297 303 141 76 107 161 92 249 136 61 178 129 18
-155 18 170 40 114
-190A14
##PAGE=	F1=2263.55
##FIRST=	25169.313707327481097,	5807.6787752999953227,	0.60126245021820068359
##DATA TABLE=	(F2++(Y..Y)), PROFILE
5808 148 128 39 230 189 18 103 75 241 231 42 86 107 139 113 212 96 237 111 149 172 131 44 77 186 80 204 13 127 88
5467 88 99 65 145 199 83 77 132 81 60 88 168 188 223 202 44 131 138 178 169 198 248 154 107 70 39 58 109 22 222 133 193 156 195 169 61
5056 61 100 232 131 55 129 95 110 197 7 280 312 171 71 291 219 60 115 83 155 137 73 165 102 62 119 347 325 116 97 84
4704 84 198 105 194 332 205 41 31 81 67 122 158 39 61 61 165 162 83 117 234 209 116 60 76 46 104 110 88 54 49 57 155 77 185 195
4305 195 124 178 78 99 27 76 133 156 40 54 21 82 169 117 177 176 60 32 102 20 128 214 126 163 319 106 203 118 209 186 65 98
3930 98 148 96 176 73 70 129 83 279 254 252 76 109 134 101 127 103 199 143 144 140 212 89 266 238 224 178 270 247 114 108 44 160 30 268
3531 268 172 97 219 232 76 64 78 35 124 158 113 130 11 137 225 180 296 284 135 123 245 68 210 126 61 409 319 43 166
3190 166 285 438 91 19 234 442 185 66 222 95 609 267 1680 4471 4119 1371 249 556 285 119 69 193 62
2920 62 179 89 63 49 18 226 213 26 52 54 136 125 167 77 146 109 158 26 212 114 101 178 104 113 133 115 141 107 159 135 198 158 29
2533 29 76 192 117 110 100 172 170 139 248 214 215 216 205 121 203 138 106 110 172 125 68 152 57 178 244 235 179 192 219 225 135 115 182 85 68 219 150
2099 150 173 56 131 85 103 160 117 222 81 54 88 186 144 58 191 274 266 81 239 65 188 69 101 132 15 91 102 37 109 104 286
1735 286 179 73 101 186 58 38 185 152 126 164 134 78 101 132 68 168 120 58 175 123 14 151 114 243 130 132 214 91 302
1394 302 232 110 148 70 130 191 324 199 89 72 221 197 222 217 188 145 62 136 31 92 211 19 94 98 149 90 114 105 104 33 138 135 251
1007 251 165 133 185 190 246 84 118 119 32 82 77 185 174 29 114 97 115 119 67 127 200 100 171 177 168 211 185 76 115 135 75 151 165 61 332
596 332 242 399 147 33 90 106 56 89 153 112 174 146 194 247 247 184 71 151 246 228 41 191 201 155 224 343 309 137 81 54 151 79
221 79 129 302 202 125 36 33 126 168 94 147 314 154 160 162 117 25 159 260 149 245 277 170 45 120 142 86 237 142 33 160 169 63
-155 63 171 72 115
-190A15
##PAGE=	F1=2161.3
##FIRST=	25169.313707327481097,	5807.6787752999953227,	0.40771743655204772949
##DATA TABLE=	(F2++(Y..Y)), PROFILE
5808 115 109 46 219 192 70 144 82 222 247 114 96 103 154 154 244 81 249 110 161 202 101 48 47 165 67 193 29 134 91 47 18
5444 18 125 163 37 63 137 89 52 134 184 187 261 245 77 133 149 166 180 215 235 171 86 88 57 106 99 26 189 96 224 193 216 179 98 87
5045 87 258 139 65 163 141 167 198 49 254 270 145 96 224 163 55 156 47 141 144 121 180 76 49 78 325 331 163 97 68 216
4693 216 158 193 268 189 58 26 94 69 76 154 53 102 43 137 113 74 104 176 124 47 43 15 80 98 103 94 48 44 97 177 104 175 157 116 146 37
4270 37 112 43 106 142 140 93 59 26 87 191 157 171 178 72 36 45 64 90 191 155 172 275 106 160 123 207 143 35 93 167 91 152 47
3883 47 69 140 82 280 258 236 37 92 130 99 126 117 186 121 148 155 223 106 278 275 227 182 255 226 156 188 41 141 14 186 90 148 167
3495 167 248 86 47 122 9 116 160 79 99 26 103 150 159 335 333 119 119 282 71 308 180 41 196 125 85 95 275 283 43 68
3143 68 150 391 184 52 167 98 493 160 1351 3169 2843 959 212 433 194 97 127 123 38 126 90 51 5 54 239 193 66
2826 66 116 91 116 152 200 60 162 97 95 19 189 192 53 193 98 103 121 125 161 98 143 149 200 170 47 104 247 127 145 106 141 124 142 264
2427 264 205 224 197 185 99 161 166 127 127 206 119 76 162 59 156 215 233 168 199 235 201 126 128 175 132 64 183 116 158 82 268 91 114 140
2028 140 159 233 100 149 69 207 160 73 161 243 213 65 216 71 206 88 91 116 31 73 60 53 119 151 338 175 100 71 168 46 27
1664 27 138 77 54 123 104 47 114 121 56 149 138 36 120 126 21 167 98 251 130 120 132 133 301 226 72 85 80 71 261 362 185 74
1289 74 42 231 154 247 242 186 104 59 111 23 126 255 64 119 116 127 99 114 94 90 11 173 120 248 247 48 158 168 218 77 132 98 36
901 36 69 73 206 196 33 108 75 95 160 118 143 165 77 142 159 130 200 146 78 46 131 75 136 172 47 305 260 376 130 38 121 121 125 123 146
491 146 111 158 157 206 184 198 217 119 114 250 254 75 195 195 162 220 339 285 105 77 102 115 90 86 225 184 129 65 16 149 221 117 158 263
92 263 125 139 145 127 57 164 211 148 170 239 190 60 123 117 84 213 143 11 177 203 97 160 103 115
-190A15
##PAGE=	F1=2059.04
##FIRST=	25169.313707327481097,	5807.6787752999953227,	0.20046149194240570068
##DATA TABLE=	(F2++(Y..Y)), PROFILE
5808 69 72 60 203 196 120 169 95 214 268 184 116 92 169 194 245 57 243 105 168 200 76 79 64 131 41 162 70 140 102 26 44 104 114
5420 114 31 38 131 105 53 179 199 185 273 256 121 101 143 142 204 212 208 180 49 91 68 159 146 41 144 61 238 219 219 191 131 89 272 143
5021 143 83 180 177 206 190 80 216 201 105 115 157 100 47 210 67 115 125 169 184 39 60 45 273 310 190 87 61 234 195 193 204
4657 204 183 105 26 114 61 20 159 61 164 35 105 89 76 97 119 31 72 49 44 101 75 90 108 49 33 131 180 129 160 95 138 116 9
4270 9 111 61 139 145 121 132 74 40 102 208 183 145 161 108 84 95 126 40 136 168 179 213 111 114 116 192 117 26 72 171 97 134 14 65 155
3859 155 96 235 247 216 6 55 106 88 99 117 146 66 139 162 224 120 261 290 237 169 206 173 192 265 111 121 7 94 58 190 120
3495 120 260 73 15 177 39 108 146 54 82 39 65 53 131 352 345 95 131 293 121 420 271 5 92 24 144 285 1295 1330
3167 1330 340 115 127 342 173 63 107 93 325 73 912 1820 1529 520 154 260 110 52 149 62 132 62 80 76 57 80 241
2850 241 184 110 155 137 99 127 162 21 174 84 24 29 164 259 93 212 124 50 107 120 181 92 119 154 187 188 77 136 286 120 195 131
2474 131 101 100 163 246 169 226 166 148 68 115 187 140 140 218 130 90 147 50 140 154 213 159 187 235 177 123 137 150 161 148 157 88 133 129 236 117
2052 117 109 111 179 221 119 215 85 229 176 107 135 199 166 112 191 86 222 106 67 73 77 63 77 76 131 189 353 156 114 39 134 62 59 91
1653 91 20 22 84 79 35 120 101 45 124 165 16 85 114 35 181 87 251 124 90 34 180 278 207 41 36 93 48 322 358 139 61 53 227
1265 227 92 242 250 169 57 57 103 69 154 281 111 150 148 113 101 122 108 63 18 197 112 213 312 59 112 142 194 72 134 90 49 48
890 48 61 209 189 33 82 71 100 185 163 175 143 53 112 122 81 179 102 157 32 111 75 126 170 46 261 259 338 137 94 134 121 203 160
502 160 134 119 135 169 216 128 151 243 172 122 251 253 123 181 172 151 200 318 247 59 67 141 80 107 45 156 168 117 95 17 169 254 150
115 150 154 195 105 111 127 132 94 136 135 133 92 203 203 83 114 88 83 177 131 0 204 224 119 136 123 118
-190A18
##PAGE=	F1=1956.78
##FIRST=	25169.313707327481097,	5807.6787752999953227,	0.18822412192821502686
##DATA TABLE=	(F2++(Y..Y)), PROFILE
5808 20 23 88 194 200 156 172 115 215 282 233 140 67 180 221 214 29 222 90 162 167 88 111 100 96 6 117 103 143 123 82 86 98 60 28 18
5397 18 112 118 63 214 194 186 260 231 153 45 121 108 225 186 181 183 31 73 78 188 214 69 107 43 236 231 202 196 147 109 274 148 106 176
4998 176 191 220 168 87 174 119 71 130 115 40 44 251 120 83 85 209 173 11 89 78 202 266 191 68 72 242 213 197 146 176 151 50
4622 50 140 49 55 174 65 239 31 73 85 101 80 72 53 134 75 58 103 40 88 134 62 37 151 163 144 136 46 181 98 44 99 76 166 146
4223 146 105 156 87 72 115 216 195 104 142 162 130 161 184 21 56 163 179 149 125 86 93 163 110 44 47 158 115 131 55 60 175 128 152 220
3824 220 199 46 21 61 94 57 111 103 20 117 163 219 123 221 282 245 139 140 101 216 323 177 113 34 44 127 221 105 264 40 36 235
3448 235 84 105 120 56 94 37 34 46 103 343 315 66 143 269 216 532 382 70 64 138 240 648 2705 2822 780 169 250 321
3120 321 156 111 86 103 150 102 477 688 459 153 94 67 108 101 145 84 204 40 66 108 93 89 242 196 138 167 183 118 116 69 70 177
2744 177 78 40 32 137 297 157 223 175 35 119 113 193 92 85 140 164 189 101 160 299 99 245 172 74 131 176 201 120 220 131 105 62
2369 62 104 189 144 148 203 142 96 106 33 135 68 181 143 157 220 160 129 139 113 164 220 153 72 108 317 127 147 97 116 161 183 132 239
1981 239 117 253 183 114 115 148 136 156 170 107 223 109 31 31 134 50 112 96 143 206 334 125 111 35 90 84 104 62 59 92 52 58 61 123
1582 123 83 47 89 190 46 69 78 64 189 87 236 110 46 106 222 251 181 40 52 109 99 360 310 83 60 94 215 25 204
1242 204 235 141 9 57 104 100 177 281 146 180 175 107 94 117 133 34 47 208 104 153 351 165 49 125 169 66 129 104 56 58 53 194
866 194 156 32 52 95 103 186 192 203 143 34 90 73 31 144 62 230 111 75 67 125 157 62 211 242 300 175 152 125 106 271 179 121 124
479 124 107 171 222 104 147 254 211 174 258 225 156 158 140 121 165 284 202 20 53 154 60 121 60 126 144 97 121 56 180 262 170 141 127
92 127 86 93 117 134 115 84 50 108 39 178 213 97 96 57 77 129 108 14 218 233 135 98 129 122
-190A22
##PAGE=	F1=1854.52
##FIRST=	25169.313707327481097,	5807.6787752999953227,	0.26213002204895019531
##DATA TABLE=	(F2++(Y..Y)), PROFILE
5808 24 31 129 197 201 171 151 134 221 279 248 158 34 186 228 154 10 190 69 150 114 134 136 121 68 34 70 126 143 144 129 113 112 9 24 19
5397 19 86 124 76 231 165 188 228 177 159 18 89 71 233 143 170 182 76 40 112 187 266 104 85 41 221 231 172 189 143 143 264 153
5021 153 130 152 183 210 139 79 135 50 76 143 120 12 60 266 161 56 35 235 147 22 130 134 126 205 167 38 99 231 213 205 97
4657 97 159 182 94 168 50 118 194 74 316 42 54 77 134 45 40 115 175 109 40 83 1 107 165 88 59 149 134 150 105 83 222 93
4282 93 61 83 91 179 141 95 168 95 121 136 214 201 68 155 218 162 207 230 82 32 141 170 102 140 93 58 122 112 52 29 125 146 141 119 55
3871 55 194 170 55 184 191 88 86 9 130 39 104 88 83 85 156 214 115 172 251 243 100 103 45 224 347 219 113 67 99 202 241 128
3495 128 250 19 78 284 130 115 93 80 115 27 27 127 84 306 256 64 144 216 321 619 485 135 70 289 360 1062 4262 4449
3167 4449 1276 238 402 337 138 163 97 137 18 100 151 110 359 139 90 117 185 236 263 202 242 98 58 132 107 84 241 218 151
2826 151 162 224 168 212 168 145 165 85 87 34 110 291 208 219 224 136 156 117 193 101 73 106 135 165 116 174 282 70 277 211 90 195 171
2439 171 160 86 204 105 71 86 144 172 136 157 163 143 97 45 25 128 32 159 121 118 194 150 139 141 82 143 264 169 61 121 668 526 198
2052 198 102 158 103 124 146 224 137 273 181 88 111 99 128 182 162 133 199 97 9 77 186 26 139 111 151 199 290 90 91 56 42 101
1676 101 142 75 97 141 30 47 90 120 83 73 46 201 87 69 24 102 189 102 202 89 4 203 242 240 167 72 86 133 152 367 226
1312 226 77 63 134 197 43 139 203 112 37 64 101 106 195 256 164 202 189 107 84 90 140 24 83 209 88 90 358 252 50 130 136 64 123
925 123 126 59 108 64 170 113 39 55 134 93 163 200 215 157 24 78 51 56 97 32 277 183 34 54 128 134 83 163 218 274 222 202 105 87 318
514 318 175 109 116 86 156 223 107 176 243 229 220 262 182 167 135 119 74 122 245 160 43 60 136 60 125 103 136 108 76 140 116 182 248 172
115 172 127 70 73 104 119 134 124 34 23 76 39 166 215 99 71 30 63 77 77 40 211 232 150 50 123 122
-190A22
##PAGE=	F1=1752.27
##FIRST=	25169.313707327481097,	5807.6787752999953227,	0.30794483423233032227
##DATA TABLE=	(F2++(Y..Y)), PROFILE
5808 46 80 170 209 192 166 113 145 227 253 220 174 61 186 210 73 31 152 63 152 77 181 153 121 51 71 30 140 147 157 152 125 130 45 60
5409 60 22 73 124 86 227 121 187 189 116 129 72 52 33 226 107 181 177 123 62 174 157 279 140 64 41 197 222 142 173 129 185 245
5033 245 155 152 117 161 182 113 71 102 61 101 150 146 42 86 249 179 41 35 238 117 17 180 179 59 136 125 7 135 201 202 214 66
4657 66 133 195 145 188 64 169 211 87 380 70 60 52 157 9 39 148 185 143 57 48 43 140 192 124 84 127 113 156 72 130 246 91
4282 91 54 65 119 177 124 92 170 103 178 162 205 207 74 203 262 177 231 256 136 109 107 157 81 143 118 41 77 116 52 24 83 182 156 177 50
3871 50 204 209 65 145 192 121 158 79 174 73 96 99 133 47 138 209 102 135 204 228 65 139 78 219 334 228 109 104 156 255 250 163 219
3484 219 56 110 312 164 131 83 107 121 35 40 174 71 245 203 106 133 150 405 656 550 179 87 406 474 1441 5638 5865 1717
3155 1717 313 530 372 120 196 87 172 60 71 87 355 616 246 148 265 261 352 409 295 242 152 59 145 98 67 231 237 158 148
2815 148 252 224 315 301 174 133 109 120 61 99 235 237 206 253 231 190 133 180 124 123 59 104 113 123 186 238 35 279 227 132 261 149 159
2427 159 95 174 93 62 109 190 142 116 169 107 127 102 47 56 104 115 161 99 92 167 144 141 153 82 118 276 187 54 157 955 906 255 114
2040 114 192 30 59 155 189 134 283 179 44 128 63 133 191 173 159 148 74 45 130 219 14 156 117 153 174 234 67 66 71 33 105 157
1664 157 108 112 157 22 56 102 103 99 108 8 186 119 82 33 142 182 132 156 72 54 262 234 248 176 106 110 165 189 344 128 126 55 161 176
1265 176 94 75 171 92 76 88 93 84 210 212 168 210 187 109 81 58 118 33 120 203 65 64 337 304 145 158 98 77 116 141 65 164 84 143 85
854 85 51 91 167 81 124 188 208 172 24 73 87 110 46 24 293 244 49 38 131 101 101 126 194 259 256 239 112 95 343 159 95 94 85 133 216
444 216 110 191 209 228 236 246 154 161 117 128 21 76 206 120 72 90 91 67 109 138 152 66 72 149 186 178 220 161 124 36 94 139 132 133 130 51 67 43
-2 43 44 158 199 87 51 31 46 31 46 71 189 229 171 11 106 113
-190A13
##PAGE=	F1=1650.01
##FIRST=	25169.313707327481097,	5807.6787752999953227,	0.26732993125915527344
##DATA TABLE=	(F2++(Y..Y)), PROFILE
5808 50 115 200 221 171 142 73 147 229 207 154 193 133 186 173 15 51 110 82 169 115 211 158 107 35 100 6 155 164 157 146 128 140 89 111 26
5397 26 91 129 85 201 95 178 149 94 70 110 18 13 212 113 206 170 154 135 249 118 248 165 33 39 171 211 126 153 118 224 219 148
5021 148 167 88 140 149 103 79 83 97 110 148 165 59 109 206 173 41 75 219 102 17 239 204 21 72 82 43 170 160 187 214 56 104
4646 104 191 191 196 78 206 221 91 418 101 76 12 159 60 57 156 166 173 130 16 83 172 209 165 102 92 124 170 49 151 245 86 30
4270 30 48 163 166 91 96 161 113 230 180 194 211 105 255 279 178 237 259 175 161 66 146 74 129 138 82 35 124 63 36 77 215 159 216 45
3871 45 200 230 140 113 196 136 215 148 200 104 82 104 147 9 110 206 91 125 145 200 54 193 119 205 284 200 105 137 195 277 244 193
3495 193 177 88 125 308 177 145 99 126 106 65 58 180 61 173 213 160 113 109 447 623 555 187 113 451 554 1700 6521 6749
3167 6749 2000 375 610 401 110 197 45 185 95 219 137 301 563 251 205 360 318 375 409 254 203 185 68 150 74 35
2862 35 205 247 169 128 258 270 345 314 114 93 147 155 101 124 134 238 201 255 302 206 146 156 157 189 25 70 46 126 206 187 23 243 210
2474 210 176 316 123 179 121 133 102 72 115 216 111 83 179 56 98 111 124 104 67 172 164 89 104 150 141 124 166 107 120 250 182 55
2099 55 147 869 877 242 86 180 74 44 140 158 110 278 187 55 146 55 139 185 193 181 85 57 69 159 226 61 159 114 147 152 185 70 57
1711 57 74 71 90 147 140 109 139 41 70 89 77 121 139 48 143 131 100 81 174 172 167 111 70 98 272 196 254 196 131 122 197 206 299 76 169 33 166
1277 166 153 132 90 157 88 100 122 89 41 219 156 163 205 176 110 90 68 78 43 153 193 55 97 296 320 242 194 83 105 104 145 78 210
890 210 103 121 89 65 132 180 82 92 168 187 184 28 71 125 153 31 33 283 290 100 18 137 65 108 97 169 244 265 255 168 140 347 152
502 152 73 65 103 134 203 108 170 160 217 218 204 160 151 107 159 43 32 172 81 91 119 33 82 77 157 162 64 91 147 250 180 188 146 137 40 143 180
68 180 148 134 139 76 70 22 54 147 160 64 45 53 43 5 34 99 159 228 195 59 84 97
-190I7
##PAGE=	F1=1547.75
##FIRST=	25169.313707327481097,	5807.6787752999953227,	0.25890591740608215332
##DATA TABLE=	(F2++(Y..Y)), PROFILE
5808 39 129 212 221 133 104 57 145 224 151 89 226 206 186 137 95 63 70 101 184 177 215 150 86 10 117 8 178 191 146 116 131 141 123 159 32
5397 32 123 153 67 161 120 157 115 130 56 130 15 40 199 150 232 162 166 211 317 105 178 175 10 39 149 204 126 135 118 247 186 129 166
5010 166 80 131 126 110 108 89 107 90 133 168 66 121 152 149 62 103 179 113 74 300 209 39 26 58 85 193 117 180 203 48 84 179 222 187
4610 187 92 231 221 80 423 125 88 38 134 110 80 150 123 190 207 43 116 195 210 205 110 68 158 192 53 145 220 81 10 28 209
4247 209 155 48 99 140 126 263 172 187 209 131 284 261 168 227 240 191 178 30 143 68 101 147 136 18 133 87 61 125 229 141 228
3883 228 43 185 227 184 93 199 131 247 199 197 112 61 93 124 27 82 198 78 133 84 163 72 232 134 186 210 138 113 157 216 266 222
3507 222 214 144 101 120 271 160 157 127 131 75 95 80 148 52 111 274 207 94 127 442 524 499 155 142 414 580 1783 6711 6907 2065
3155 2065 404 633 402 120 160 42 175 116 374 117 157 345 192 239 395 348 245 313 112 138 190 83 152 60 52 164 248
2838 248 187 97 242 297 270 180 48 100 183 196 134 174 31 214 219 228 342 201 147 126 186 237 65 39 38 129 242 169 71 175 160 215
2462 215 352 106 178 140 85 136 87 108 216 85 41 183 48 66 115 196 157 53 194 138 92 145 154 134 98 161 137 161 183 133 99
2099 99 86 95 65 91 72 99 128 79 80 141 95 254 207 110 143 71 138 170 208 196 77 59 73 158 206 117 143 106 135 158 170 84 74 65 102 60
1676 60 127 164 96 96 74 75 51 93 141 160 85 87 123 115 114 186 159 200 91 82 126 233 136 239 204 143 119 218 202 246 135 191 32 151 129
1265 129 157 147 164 98 101 152 107 38 225 97 155 189 164 114 111 105 65 62 171 179 74 132 248 308 321 223 111 138 83 140 88 236 116
878 116 103 105 88 168 167 92 110 152 161 194 28 72 142 179 72 39 256 320 150 12 148 61 100 63 141 216 248 252 238 195 335 171 41
491 41 37 127 187 186 107 118 104 207 183 144 183 147 102 188 88 15 152 47 106 135 29 107 65 164 168 112 120 137 294 194 158 142 159 62
92 62 193 214 163 140 152 69 38 31 95 130 109 48 49 76 62 30 68 116 129 228 216 106 60 80
-190H0
##PAGE=	F1=1445.49
##FIRST=	25169.313707327481097,	5807.6787752999953227,	0.49543535709381103516
##DATA TABLE=	(F2++(Y..Y)), PROFILE
5808 21 119 204 203 78 56 66 145 211 102 141 265 265 184 132 155 67 39 100 177 223 193 127 73 22 127 5 205 215 130 74 139 138 145 197
5409 197 34 149 195 36 123 164 122 89 170 140 143 35 64 195 184 251 155 162 270 362 135 98 167 42 41 134 200 133 115 120 242 150
5033 150 101 143 85 132 134 136 148 116 89 43 106 155 63 116 103 118 108 115 132 129 144 356 197 57 26 67 119 198 81 188 179 23 84 167
4634 167 231 166 114 250 214 55 393 137 93 89 85 148 108 143 72 184 261 72 140 205 198 238 115 79 191 217 70 119 175 77 40 22
4258 22 241 149 36 95 105 139 266 133 186 201 149 280 209 153 202 201 184 164 47 142 62 76 145 187 38 139 108 92 177 215 101
3894 101 214 44 173 202 192 88 197 120 256 219 165 94 45 83 80 59 80 181 61 148 29 129 104 254 131 161 128 54 135
3554 135 154 220 228 186 229 140 92 100 206 114 180 152 120 49 119 98 91 55 104 336 236 91 170 402 404 415 100 158 314 547 1678 6186
3178 6186 6334 1911 388 603 364 169 94 108 161 76 389 41 241 215 125 243 374 353 169 914 655 105 166 109 159 111
2873 111 175 133 241 209 55 215 298 123 200 254 166 200 233 150 226 149 174 249 177 351 178 138 99 198 248 111 40 100 127 290 204
2509 204 126 86 92 246 363 109 140 147 36 187 107 94 205 68 14 181 69 51 110 252 209 93 194 71 96 193 181 111 108 123
2157 123 165 233 77 29 230 307 1586 1791 411 291 59 142 98 61 132 132 209 237 149 122 102 119 147 213 200 139 67 54 131 168 177
1793 177 107 103 121 186 197 85 91 57 115 24 136 176 84 81 112 74 19 166 157 171 113 76 97 122 134 170 142 221 97 93 137 163 73 198 185
1383 185 142 98 217 179 197 208 194 74 123 114 174 185 178 119 79 166 140 85 226 39 152 165 158 126 140 127 101 97 165 159 95 151 206 284 362
972 362 234 151 170 55 133 86 235 127 87 115 125 194 136 95 162 155 139 198 18 70 137 187 106 36 221 331 195 58 161 99 75
608 75 16 111 172 213 229 293 241 314 202 17 20 145 264 171 112 47 56 205 160 95 198 147 101 204 113 47 150 38 129 137 72 141 118
221 118 162 175 164 148 124 306 215 132 154 179 82 227 229 170 151 161 30 34 40 142 108 82 59 55 97 86 46 116 120 100 222 223 144 48 62
-190F2
##PAGE=	F1=1343.23
##FIRST=	25169.313707327481097,	5807.6787752999953227,	0.69078028202056884766
##DATA TABLE=	(F2++(Y..Y)), PROFILE
5808 16 88 179 168 35 41 74 150 191 79 245 294 297 171 158 186 60 21 74 143 242 160 93 75 57 131 6 224 225 113 36 144 136 156
5420 156 224 32 162 239 35 111 196 83 68 191 225 157 55 81 193 200 257 148 148 302 376 165 87 149 62 44 125 194 137 85 114
5056 114 206 110 75 94 86 131 169 179 188 145 55 29 69 127 54 92 70 98 165 116 98 130 210 397 175 70 32 81 139 184 49 209 147
4669 147 20 102 156 214 140 145 269 203 25 335 137 94 135 26 171 145 141 55 153 281 86 155 199 187 262 123 103 206 235 87
4317 87 88 121 76 81 60 250 144 78 81 65 144 235 67 191 191 174 241 131 137 165 149 159 131 85 136 61 73 138 232 53 139 112 120 211 173
3906 173 73 182 56 181 165 174 96 190 127 256 208 119 55 49 96 80 83 109 153 37 168 26 113 142 264 132 132 76 43 161 125
3542 125 205 177 148 240 153 63 70 127 46 211 164 98 68 136 106 23 75 147 371 240 106 204 360 383 385 87 147 196 468 1425 5110
3178 5110 5223 1604 325 533 285 259 99 156 188 157 171 310 668 652 253 229 308 340 657 2063 1520 180 137 148 175 210
2873 210 351 167 229 229 12 198 269 102 437 412 228 187 250 144 266 275 132 265 110 337 148 129 85 184 221 146 82 149 113
2533 113 339 254 174 26 59 267 347 135 70 152 7 241 131 79 217 58 58 176 73 60 96 287 258 135 202 53 87 241
2204 241 224 64 178 72 192 333 104 147 445 744 4187 4723 1131 634 287 162 109 224 142 201 141 276 161 133 143
1911 143 83 120 207 193 198 65 21 96 124 235 54 111 114 217 245 64 97 65 113 8 184 169 76 136 145 80 74 249 166 178 130 126 67
1523 67 111 152 124 122 226 105 94 128 103 53 140 140 134 60 190 140 160 262 190 120 99 113 186 190 193 141 55 156 170 115 221 15 155 138
1124 138 159 152 173 120 132 135 136 130 101 152 177 260 354 226 179 192 27 132 66 206 135 67 119 171 206 107 85 212 171 121 194 14 65 113
725 113 184 124 25 191 325 231 115 168 142 40 49 80 115 172 190 314 265 285 221 57 18 152 331 161 117 27 48 215 167 106 193
361 193 136 112 204 111 75 168 55 167 134 93 176 190 156 182 205 171 110 282 229 127 177 185 89 236 222 169 164 165 51 91 41 169 79
-26 79 105 77 63 115 106 53 159 112 73 202 211 170 59 43
-190D3
##PAGE=	F1=1240.98
##FIRST=	25169.313707327481097,	5807.6787752999953227,	0.68855965137481689453
##DATA TABLE=	(F2++(Y..Y)), PROFILE
5808 30 49 143 128 87 97 77 155 168 79 328 297 296 141 178 187 41 23 26 89 233 145 56 96 84 132 26 223 213 94 16 139 138 158
5420 158 243 49 159 268 79 133 211 59 53 191 283 171 79 97 184 193 251 144 129 300 361 170 137 132 60 52 118 177 138 42 97 148
5045 148 71 70 24 82 118 209 232 211 162 45 100 30 91 58 59 48 98 218 113 92 110 256 416 153 89 33 89 143 153 21 232 116
4669 116 76 124 138 176 122 174 289 192 25 263 129 97 168 53 180 186 146 100 102 267 88 160 177 197 274 136 116 196 239 99 64
4305 64 78 74 136 113 237 132 114 66 68 141 178 34 200 187 214 180 43 116 121 91 124 104 110 118 63 84 132 271 62 126 100 142 229 118
3906 118 121 146 85 203 126 142 112 178 160 264 175 100 17 55 125 140 93 146 114 14 196 56 122 181 268 153 115 103 133 180 73 173
3531 173 131 126 248 158 30 41 53 39 237 160 73 109 147 107 40 104 191 374 219 125 220 342 512 456 137 108 150 374 1105 3814
3178 3814 3938 1253 233 443 176 384 233 170 287 577 492 836 1588 1487 568 226 216 319 1282 3457 2535 292 154
2909 154 200 199 336 557 252 219 251 53 201 209 140 460 386 253 142 240 123 290 366 105 251 45 313 114 133 94 146 164
2580 164 168 134 178 80 380 284 206 103 101 276 307 169 25 167 37 284 160 60 270 53 96 172 57 68 87 300 304 157 242
2239 242 172 67 286 267 67 266 138 222 459 278 360 721 1305 7469 8470 2091 1054 557 269 145 419 200 268 73
1958 73 320 146 211 185 55 91 194 180 233 53 51 103 90 285 8 122 118 236 287 24 90 95 105 32 237 139 67 205 167 101 128
1594 128 312 165 191 135 167 49 82 172 59 98 213 101 87 104 117 82 81 79 123 39 141 92 133 298 189 154 96 120 199 165 212
1230 212 155 94 120 182 110 205 66 160 112 163 189 209 87 138 168 100 92 88 138 159 242 296 204 192 201 8 144 51 152 136 40 130 219 203
831 203 102 76 241 187 108 184 52 57 81 174 127 11 173 301 253 176 167 172 53 113 56 52 136 142 295 265 252 215 101 24 141 365
455 365 155 115 81 80 229 178 148 170 106 141 189 80 92 197 70 214 142 93 202 252 150 182 231 190 94 229 227 159 198 168 78 218
80 218 193 161 174 166 132 133 56 165 48 131 83 82 130 123 47 182 96 56 163 178 184 82 20
-190B0
##PAGE=	F1=1138.72
##FIRST=	25169.313707327481097,	5807.6787752999953227,	0.53923255205154418945
##DATA TABLE=	(F2++(Y..Y)), PROFILE
5808 42 32 106 110 155 158 83 152 146 86 368 266 268 99 170 168 22 44 33 33 203 166 39 130 93 130 56 195 178 82 27 123 140 158 258
5409 258 81 140 268 120 164 209 70 54 174 309 179 107 121 159 170 237 150 107 267 327 142 164 125 37 68 108 145 136 10 72
5056 72 99 43 87 70 86 87 235 282 203 160 85 164 13 62 103 56 35 112 253 112 98 74 269 407 137 116 57 88 131 114 32 248
4681 248 93 134 137 108 123 118 191 305 180 48 193 114 104 185 106 180 224 158 151 55 231 80 155 142 233 276 144 112 161 226 109 52
4305 52 79 73 204 166 207 112 131 69 131 133 108 102 212 184 261 123 40 93 80 44 92 102 112 85 59 86 134 308 67 99 82 158 251 111
3906 111 203 119 126 220 88 120 131 163 194 288 149 122 60 43 141 195 84 174 70 32 229 76 142 212 265 180 135 157 206 185 37 130
3531 130 108 120 248 140 48 24 30 115 247 139 53 141 156 110 92 135 217 346 171 136 221 344 673 560 174 69 211 316 839
3190 839 2809 3031 1004 178 352 67 527 403 160 453 1216 1381 1568 2930 2610 972 271 129 299 1897 4809
2944 4809 3497 392 222 255 220 463 755 336 214 279 98 205 120 36 202 132 237 108 205 100 299 408 107 207 68
2650 68 288 80 160 123 95 106 179 187 193 36 404 284 215 173 138 272 252 196 91 199 62 308 191 38 343 52 121 173 42
2310 42 63 102 295 349 152 302 285 58 326 301 181 343 278 259 592 458 587 1021 1909 10974 12508 3168 1489 832 439
2016 439 217 603 292 316 131 361 121 309 220 94 67 179 172 241 66 109 174 79 322 64 129 133 240 310 45 74 134 107 66
1676 66 271 91 64 254 174 127 161 336 157 213 124 176 47 46 195 73 81 183 90 79 74 171 100 49 54 108 75 87 60 114 318 193
1300 193 169 114 126 212 119 239 158 167 67 169 70 175 111 161 91 164 230 241 45 127 190 100 48 69 121 146 221 200 187 191 196 8 165
913 165 97 78 126 22 149 258 189 113 84 244 188 105 179 104 50 47 159 116 14 163 262 255 231 165 185 113 169 46 11 110 89 239
538 239 242 219 187 133 31 113 357 147 104 111 116 237 165 179 134 60 186 165 37 95 225 74 262 161 85 216 288 143 169 240 201
174 201 72 164 209 212 206 126 50 180 147 151 171 169 211 147 103 135 16 128 83 116 142 140 37 176 81 56 110 129 188 104 17
-190A7
##PAGE=	F1=1036.46
##FIRST=	25169.313707327481097,	5807.6787752999953227,	0.36863759160041809082
##DATA TABLE=	(F2++(Y..Y)), PROFILE
5808 46 59 81 123 203 203 91 138 128 92 359 207 230 79 129 144 44 75 90 54 162 196 55 166 82 125 96 140 125 91 69 111 137
5432 137 165 269 111 104 233 142 189 196 99 81 151 303 180 138 158 119 142 224 166 79 212 290 88 149 125 1 89 95 99 125 58 50 112
5045 112 54 109 164 103 37 238 316 160 135 124 209 40 77 167 98 47 127 265 109 91 42 249 371 129 143 96 82 112 76 67 250
4681 250 86 185 135 70 67 124 191 314 160 62 147 93 110 183 136 177 248 173 189 65 189 70 139 97 276 268 134 92 108 194 120 45
4305 45 102 80 271 205 169 87 126 90 205 130 49 157 223 175 295 106 101 70 61 52 76 109 90 41 49 71 149 343 75 61 75 174 295
3918 295 179 275 108 166 214 45 125 150 146 211 320 165 146 109 7 129 221 57 189 29 60 258 91 158 230 251 194 183 204
3578 204 250 178 88 83 120 119 234 97 91 28 51 176 241 109 42 160 158 124 131 159 217 299 101 133 210 338 776 624 170 94 275 335
3202 335 767 2712 3053 975 247 276 97 666 577 172 667 1986 2463 2395 4441 3820 1383 361 120 289 2364 5809
2944 5809 4185 460 291 304 228 563 904 384 210 312 131 190 20 509 1087 702 246 163 160 98 299 401 138 155 131
2650 131 267 64 203 158 68 92 179 238 200 56 405 262 200 225 145 257 205 199 131 247 89 310 214 38 405 50 136 181 68
2310 68 51 134 276 389 122 355 361 88 356 317 322 392 419 307 707 614 786 1290 2457 14116 16166 4191 1869 1065 609
2016 609 303 737 381 339 264 385 108 386 237 162 62 162 180 229 119 160 265 89 339 109 135 154 232 309 107 53 174
1700 174 124 118 276 44 83 273 166 145 169 312 156 236 95 155 50 63 215 157 81 140 79 83 63 209 98 56 105 89 113 72
1347 72 85 103 324 195 162 145 122 222 68 263 153 233 16 133 8 129 146 154 78 160 266 262 68 135 203 146 14 79 117 137
995 137 192 89 188 182 178 27 194 171 8 101 49 169 281 178 114 104 220 165 120 188 161 48 16 148 99 25 153 211 238 271 172
631 172 189 178 205 54 64 92 50 158 206 190 149 144 35 72 308 135 84 116 145 225 129 191 99 47 234 140 68 89 245 70 298
268 298 178 84 217 292 133 141 234 199 42 121 178 263 193 64 28 132 94 144 153 172 273 128 165 106 9 90 105 164 154 159 71 139 71
-120 71 62 58 75 180 117 42
-190D2
##PAGE=	F1=934.202
##FIRST=	25169.313707327481097,	5807.6787752999953227,	0.3026612699031829834
##DATA TABLE=	(F2++(Y..Y)), PROFILE
5808 42 83 78 145 218 219 91 115 112 94 312 138 208 119 63 135 83 106 129 97 122 210 72 195 60 116 141 71 65 120 129 126 122 180 275 124
5397 124 55 168 143 204 180 126 128 132 277 180 169 198 70 122 214 187 55 148 256 30 95 124 35 105 85 50 105 91 45 161 85 124
5021 124 249 124 34 215 330 92 94 147 227 62 121 228 141 70 139 254 102 65 47 200 312 129 156 130 73 93 47 95 236
4681 236 97 222 117 56 32 129 174 310 131 66 136 64 108 166 138 171 253 187 207 98 156 61 118 46 301 253 97 63 53 150 134
4317 134 40 114 92 320 219 129 66 103 110 271 140 44 181 233 158 299 125 133 53 74 90 74 105 49 47 38 45 173 374 92 40 83
3941 83 194 350 260 324 114 195 182 14 154 164 130 202 343 210 145 147 56 89 211 20 194 5 82 274 111 157 236 224 187
3601 187 229 236 256 158 144 44 162 115 206 36 130 55 51 212 237 88 38 164 149 144 160 173 193 247 28 118 191 305 784 618 130
3237 130 152 303 407 894 3407 3781 1123 369 225 187 775 728 226 890 2744 3526 3150 5774 4841 1704 469 185
2979 185 292 2575 6213 4429 486 324 334 217 608 970 377 199 340 154 153 105 1267 2669 1735 372 265 122
2721 122 117 297 358 189 142 180 248 87 250 185 86 119 177 282 205 121 383 239 163 258 123 236 202 174 133 302 118 294 224
2380 224 72 438 48 154 198 108 66 163 250 419 75 384 384 134 371 315 459 407 529 362 776 722 916 1480 2854 16338
2075 16338 18792 4980 2125 1217 728 384 793 438 340 398 381 120 422 232 223 80 145 209 202 185 192 347 107 336 133
1782 133 153 176 217 285 157 38 209 143 180 258 62 115 261 145 146 157 245 179 252 55 120 54 118 229 229 94 90 71 98 86 220
1418 220 87 66 157 67 128 113 132 105 319 191 135 182 108 224 31 274 145 270 42 80 83 70 166 138 70 151 289 264 136 182
1066 182 212 198 50 121 137 135 151 43 202 172 149 58 223 239 87 72 85 176 284 182 97 116 173 116 149 208 216 61 16 154 87
702 87 37 140 153 209 290 184 194 239 217 71 103 84 66 70 164 162 120 133 35 37 235 118 58 103 161 187 112 194 75 96 272 124 142
315 142 98 253 64 316 183 96 207 263 118 103 211 179 34 140 142 294 158 44 59 91 46 147 123 169 308 88 227 120
-14 120 24 29 158 224 178 182 138 88 70 60 43 28 161 117 63
-190F3
##PAGE=	F1=831.945
##FIRST=	25169.313707327481097,	5807.6787752999953227,	0.3732350468635559082
##DATA TABLE=	(F2++(Y..Y)), PROFILE
5808 37 89 92 157 198 203 78 86 97 88 245 89 209 179 27 141 116 127 139 118 94 197 78 204 67 104 182 51 19 149 190 167
5444 167 101 200 271 118 3 84 125 207 163 151 189 125 246 187 198 233 26 118 207 197 61 85 221 65 20 117 62 108 86 12 81
5080 81 102 54 193 111 130 309 138 105 168 320 66 57 153 222 76 163 263 168 79 147 227 94 27 63 135 236 132 147 144 65 79
4716 79 29 109 206 115 241 88 90 46 127 147 288 98 70 146 31 94 140 115 162 236 191 204 110 134 60 107 11 296 231 39 33 38 106
4329 106 149 39 106 103 333 202 89 56 69 119 318 158 64 173 242 156 262 139 135 44 103 119 71 81 1 111 31 40 199 397
3977 397 119 75 100 214 389 322 345 132 202 131 73 186 172 114 170 349 249 118 172 126 31 170 50 195 24 94 274 139
3648 139 135 230 188 163 252 250 221 127 177 40 219 119 165 35 162 101 40 220 251 92 39 157 129 158 181 175 149 212 93 94 164 246
3272 246 697 546 96 205 293 479 1074 4223 4574 1298 472 199 248 830 825 285 1069 3320 4338 3659 6595 5414 1855
3002 1855 569 242 301 2479 5915 4164 469 306 337 188 585 934 314 177 353 173 128 211 2201 4586 2946 580
2744 580 358 106 136 299 297 247 188 208 223 123 284 197 106 138 180 314 209 179 341 240 112 275 84 212 242 127 105 349
2416 349 143 265 215 106 433 51 184 223 138 110 175 223 431 28 384 352 177 368 297 567 391 586 420 783 771 950
2110 950 1556 3033 17252 19926 5392 2213 1265 768 448 758 448 326 506 346 135 415 207 266 106 133 253 169
1852 169 241 201 401 124 311 138 185 192 200 248 183 56 236 149 235 223 111 143 223 118 129 137 150 231 252 22 91 70 162 234 265 104
1477 104 40 67 116 117 208 82 69 188 51 117 157 173 120 309 182 97 217 82 215 22 265 136 267 66 30 160 28 167
1148 167 116 58 141 296 248 204 241 215 232 86 164 165 140 102 111 203 161 113 95 244 284 153 54 113 164 265 195 69 109 112 44 183 226
761 226 263 88 32 183 98 59 128 96 182 286 188 210 290 207 86 120 83 114 33 126 127 110 104 35 49 165 97 27 83 161 129 159 202 66
361 66 141 290 119 212 146 246 60 310 172 106 189 212 94 63 175 141 86 194 106 299 118 118 102 68 18 161 107 161 313 41
9 41 272 157 33 46 215 287 217 204 209 77 75 49 67 24 133 104 73
-190G3
##PAGE=	F1=729.687
##FIRST=	25169.313707327481097,	5807.6787752999953227,	0.47339323163032531738
##DATA TABLE=	(F2++(Y..Y)), PROFILE
5808 43 78 110 156 147 167 59 64 83 67 182 90 217 225 90 146 130 133 118 116 83 159 76 188 116 90 213 113 52 161 236 213 94 216
5420 216 255 97 56 28 99 203 148 179 256 131 226 201 225 254 22 123 199 186 97 38 174 118 64 107 74 93 106 23 74 90 66 195
5045 195 125 127 330 145 173 100 288 133 60 153 199 84 186 259 171 63 153 198 96 14 60 69 154 133 110 135 61 81 26 103 165 131
4669 131 245 65 132 63 120 114 249 75 81 153 19 69 122 86 145 199 179 180 96 121 72 122 53 256 200 55 10 64 76 155 43 81
4294 81 103 305 155 69 64 33 118 342 174 74 141 250 192 186 141 118 40 138 132 57 46 45 177 35 68 220 408 148 119 122 226 391
3918 391 355 342 154 188 80 131 211 168 96 125 334 260 75 184 189 39 112 102 203 33 95 258 168 92 214 147 138 240 240 150 90
3554 90 182 70 273 139 119 98 192 158 59 207 281 114 47 146 113 162 191 165 97 214 186 72 133 173 539 439 118 241 257 519
3202 519 1194 4755 5043 1391 524 196 275 816 845 311 1154 3572 4711 3794 6688 5383 1797 642 267 307 2103
2955 2103 4984 3452 416 240 313 149 495 803 217 142 344 192 159 297 3129 6459 4095 793 416 117 139 305
2697 305 238 296 248 219 188 146 296 187 104 132 196 330 203 219 284 261 56 279 51 193 288 85 72 375 155 228 189 127 389
2357 389 66 223 252 154 161 163 201 417 52 357 278 206 349 270 624 353 583 468 721 760 880 1510 2971 16736 19408 5358
2052 5358 2121 1205 722 484 644 406 307 567 288 133 378 170 287 127 135 294 132 274 187 412 131 268 129 219
1770 219 193 186 209 181 99 250 137 267 182 146 154 170 104 101 128 58 292 234 43 80 95 180 227 259 101 12 70 131 138 184 81 75 192
1383 192 43 90 184 199 140 299 172 57 238 46 201 15 238 124 225 66 58 215 76 148 95 35 132 283 223 261 286 209
1054 209 241 112 192 186 149 50 148 175 147 71 129 251 297 195 57 132 132 226 200 60 82 53 41 209 230 299 122 37 218 130 94 122
678 122 47 168 263 178 236 330 185 88 114 86 161 87 91 78 101 68 48 81 135 74 43 74 144 77 223 220 62 164 282 112 269 215
303 215 224 60 282 149 103 165 154 63 36 129 87 155 244 71 278 119 189 133 59 33 183 139 152 291 5 291 178 49 102 254
-49 254 341 263 218 263 123 85 34 83 43 107 81 70
-190G0
##PAGE=	F1=627.429
##FIRST=	25169.313707327481097,	5807.6787752999953227,	0.50316369533538818359
##DATA TABLE=	(F2++(Y..Y)), PROFILE
5808 61 59 123 149 77 143 59 64 74 30 141 113 209 246 138 136 120 128 74 100 81 108 82 148 171 79 230 169 88 151 256 245 121 219 226 71
5397 71 104 85 74 193 141 211 324 145 217 216 248 257 33 121 185 152 134 43 119 149 132 99 77 64 149 35 90 70 76 166 125 123 309 160
4998 160 226 32 234 196 90 157 169 87 181 211 153 21 156 172 120 39 35 16 72 129 53 110 63 106 55 82 119 137 239 66 163 65
4622 65 107 77 198 82 101 149 47 34 122 88 115 145 149 140 65 106 92 156 90 185 165 137 11 76 68 148 47 48 89 241 88 99 90 9
4223 9 113 346 181 88 100 255 255 84 149 102 47 168 125 39 39 78 232 51 93 228 405 171 148 146 220 349 354 326 178 162 52
3859 52 172 220 153 75 79 297 240 39 188 228 85 51 142 221 33 90 232 186 32 187 111 127 192 202 65 58 164 107 311 166
3507 166 77 147 221 216 98 187 306 134 64 139 115 160 185 148 58 241 265 66 100 104 348 334 156 255 213 511 1200 4812 4996 1343
3155 1343 512 209 269 736 781 289 1118 3432 4558 3516 6025 4746 1542 670 256 301 1540 3640 2464 337 146
2909 146 270 112 360 603 153 97 310 210 221 352 3844 7869 4931 951 428 145 122 311 191 322 295 222 144 147 280
2615 280 157 85 103 221 328 178 240 224 282 9 272 61 180 310 85 66 371 149 190 155 130 309 88 256 278 162 204
2298 204 132 192 373 100 307 186 223 318 238 620 303 524 500 602 701 722 1359 2693 14955 17410 4898 1874 1054 605
2016 605 487 479 325 287 570 229 116 334 133 288 138 159 317 96 274 156 376 124 210 121 239 173 176 175 157 145 250 107
1688 107 268 139 161 147 118 121 71 135 66 345 203 64 78 120 164 205 213 83 37 84 137 142 157 68 82 174 33 72 191 207 156 294
1312 294 168 23 235 15 187 13 206 108 160 54 110 238 124 114 81 2 123 248 204 299 303 189 226 125 195 188 153 5
984 5 143 114 139 27 148 239 277 209 65 145 86 171 184 98 43 59 128 219 220 321 152 32 240 169 136 123 24 166 228 157 261 354
608 354 161 73 85 90 198 125 57 20 77 42 70 104 148 54 96 89 118 85 262 242 61 161 248 96 310 281 188 60 237 121 87
244 87 133 110 27 35 82 30 224 279 37 239 168 237 146 51 53 205 197 152 247 16 278 170 75 130 261 372 300 217 287 165 96 23
-132 23 86 53 103 53 58
-190E8
##PAGE=	F1=525.171
##FIRST=	25169.313707327481097,	5807.6787752999953227,	0.45619833469390869141
##DATA TABLE=	(F2++(Y..Y)), PROFILE
5808 76 47 127 138 15 158 82 89 78 19 126 137 180 241 158 114 87 126 53 95 76 64 107 89 215 79 233 201 110 124 248 255 161 207
5420 207 189 57 139 131 60 182 153 248 383 156 210 229 266 244 32 103 165 98 163 86 104 158 177 97 85 56 210 52 108 73 82 116
5045 116 113 129 249 193 255 78 164 229 113 166 140 85 151 124 118 41 157 153 155 45 15 36 6 117 68 91 69 146 98 64 76 130 228 84
4646 84 178 55 92 36 146 104 124 132 69 9 139 125 73 80 106 92 35 80 112 190 110 102 139 208 19 73 70 127 47 25 64 156 16 143
4247 143 123 33 113 334 177 119 68 257 317 25 174 104 73 185 104 44 68 101 264 73 103 220 388 182 151 163 195 276 324
3906 324 307 200 146 50 186 214 125 50 41 239 195 44 186 233 101 14 163 240 24 87 203 183 39 150 95 129 118 137 91 67
3554 67 132 142 323 183 50 174 246 261 132 173 309 147 88 139 130 159 159 132 69 267 319 80 73 51 168 262 166 242 175 453 1076
3190 1076 4341 4396 1142 438 221 234 609 642 226 963 2925 3918 2887 4768 3655 1157 648 217 276 918 2187 1424
2932 1424 245 68 223 91 217 377 197 48 253 225 270 371 4177 8473 5254 1017 394 175 90 314 154 316
2674 316 322 224 99 124 241 109 74 58 246 308 133 247 171 287 35 252 90 175 293 106 72 334 128 154 123 117 202 110 274
2333 274 295 168 229 102 200 298 136 239 107 230 283 203 556 251 427 512 449 607 509 1142 2259 12298 14369 4110
2052 4110 1520 848 451 454 300 222 263 515 194 109 302 107 274 138 198 312 65 241 119 302 102 143 125 238 132
1758 132 169 149 129 178 237 70 235 97 155 126 92 159 54 145 116 376 164 68 80 134 120 172 140 56 49 101 126 132 136 42 82 140 38
1371 38 91 178 199 162 292 172 21 205 51 176 60 188 95 116 73 156 229 148 74 71 46 119 190 199 312 290 158 193 127 175 170 147
995 147 41 106 38 155 24 149 210 235 198 70 157 42 110 144 153 49 111 203 210 201 327 170 42 240 201 177 126 32 167 187 136
631 136 273 359 147 41 48 101 216 139 28 48 46 51 86 111 164 54 151 121 100 122 257 258 69 138 193 74 338 325 145 56 184
268 184 99 75 97 106 32 37 45 38 282 299 14 192 216 252 141 38 70 221 252 165 190 23 235 135 101 128 230 370 316 195 273
-96 273 182 109 23 79 58 123 30 44
-190D4
##PAGE=	F1=422.913
##FIRST=	25169.313707327481097,	5807.6787752999953227,	0.42649671435356140137
##DATA TABLE=	(F2++(Y..Y)), PROFILE
5808 77 49 118 124 71 190 110 125 92 64 126 165 142 217 153 97 45 142 114 124 62 64 144 43 239 92 224 206 119 92 218 241 189 179
5420 179 152 62 163 153 61 172 187 280 425 157 196 236 275 220 43 66 139 41 182 134 161 153 194 105 105 99 278 91 122 102 83 60
5045 60 99 156 164 238 257 152 85 229 124 172 117 79 111 33 79 103 155 138 187 33 67 65 68 98 153 103 76 185 139 86 41 109 219 102
4646 102 178 45 72 6 112 120 143 111 78 47 158 163 34 15 70 44 23 47 128 209 113 59 136 252 29 75 65 98 48 31 44 84 50
4258 50 173 153 56 120 313 165 155 60 252 358 119 206 119 108 187 74 81 85 126 268 93 103 203 365 178 129 166 155 198 271
3906 271 288 218 154 49 172 197 92 33 36 167 141 61 178 200 86 45 159 251 15 95 186 154 102 110 109 132 52 68 183 113 98 171
3531 171 305 184 49 177 259 286 150 163 285 151 116 148 139 163 113 120 99 273 343 99 54 23 34 217 140 198 149 356 844 3432
3178 3432 3354 825 320 218 175 462 458 157 727 2168 2943 2050 3213 2364 735 578 166 234 368 918 542 154 77 192
2897 192 91 114 170 266 23 184 235 292 354 4048 8118 4985 975 320 195 65 312 119 279 329 225 63 82 188 63
2603 63 98 11 254 273 73 253 140 271 56 220 113 172 237 111 58 270 99 123 102 95 80 125 274 297 175 233 109 223
2275 223 202 155 157 81 235 246 162 446 200 314 506 292 497 284 903 1745 9262 10853 3146 1123 625 294 386 146 120
1981 120 231 417 190 144 293 100 252 136 241 277 50 180 85 204 79 76 144 213 75 162 128 112 187 216 38 178 57
1664 57 132 102 107 199 59 147 134 378 127 58 87 132 72 134 58 33 47 111 96 125 121 50 68 108 86 124 155 174 154 285 178 48 158
1277 158 90 164 116 195 94 145 122 190 200 140 35 58 89 125 108 200 299 254 123 152 122 140 132 130 69 51 75 193 67 129 166 186 176
890 176 86 172 34 62 92 200 100 157 257 185 179 316 170 74 217 219 205 126 40 163 149 120 268 344 145 11 45 117 211 132 37
526 37 102 62 73 85 104 159 77 196 159 105 136 209 263 88 103 127 76 357 334 98 42 131 91 90 61 130 78 31 33 77 316 304 45 143
127 143 234 235 124 29 82 223 287 183 129 31 172 85 115 107 168 332 306 152 224 170 124 33 72 60 146 18 31
-190C1
##PAGE=	F1=320.655
##FIRST=	25169.313707327481097,	5807.6787752999953227,	0.43469697237014770508
##DATA TABLE=	(F2++(Y..Y)), PROFILE
5808 58 54 100 104 130 203 137 161 110 100 131 200 130 186 133 114 47 171 187 171 43 98 180 81 239 105 201 189 122 82 178 202 189 147 128
5409 128 81 181 160 76 164 230 295 440 147 169 236 271 192 76 22 107 49 190 177 227 146 185 121 123 151 335 139 147 132 76 18 92
5033 92 196 74 277 233 209 37 206 127 169 110 76 104 110 53 152 147 129 208 26 121 83 121 75 230 126 79 208 163 138 23 74
4669 74 214 118 164 51 50 42 101 124 155 97 73 82 168 187 56 57 85 16 21 73 139 209 97 113 156 258 47 98 51 69 56 42 53 88 98
4258 98 174 169 71 131 287 151 179 68 237 369 179 225 134 141 174 53 123 77 162 244 106 106 189 341 162 92 156 112 148 203 268 226
3883 226 177 51 134 175 61 49 65 96 112 71 165 138 62 72 133 246 46 114 191 105 150 79 142 139 86 93 255 164 67 190 264 171 63
3495 63 157 252 285 148 147 241 146 141 163 138 169 53 114 121 253 336 116 39 21 46 173 90 133 128 240 559 2289 2103 466 186 194
3132 194 106 327 275 142 473 1329 1854 1185 1699 1157 383 473 124 182 66 45 71 81 104 182 103 94 49 291 60 131 239 290
2803 290 307 3491 6884 4181 835 223 198 88 310 85 224 320 220 44 31 135 83 136 37 236 228 48 257 136 240
2509 240 61 178 127 165 152 91 42 192 72 101 93 73 40 129 264 284 178 215 148 252 105 156 72 96 241 204 123 308 154 206
2157 206 482 180 384 86 684 1230 6326 7418 2167 742 425 163 291 45 35 185 296 190 206 306 113 229 139
1887 139 277 225 67 106 63 101 82 62 167 173 36 153 110 104 169 192 21 113 22 100 84 143 225 82 138 117 353 96 48 100 112
1523 112 72 98 24 34 38 108 57 137 111 100 45 110 153 150 137 135 136 262 183 85 111 112 144 171 216 100 201 178 211 165 103 4 39 118 146 7
1101 7 191 263 209 101 111 114 108 83 104 83 23 149 227 105 91 112 146 155 114 185 55 64 56 226 144 187 281 152 154 288 150 112 180 217
702 217 215 117 45 153 119 98 248 309 146 52 81 130 186 112 67 135 113 95 62 84 133 100 218 193 126 120 134 256 108 70 60 117 365
315 365 306 55 15 91 97 119 38 154 125 36 45 93 319 296 83 97 213 191 107 31 80 212 299 199 79 40 100 38 112 88 88 265
-61 265 274 95 152 139 138 53 70 59 156 25 24
-190B4
##PAGE=	F1=218.397
##FIRST=	25169.313707327481097,	5807.6787752999953227,	0.44999107718467712402
##DATA TABLE=	(F2++(Y..Y)), PROFILE
5808 23 50 78 80 179 185 166 192 127 122 143 231 164 162 111 156 89 197 249 217 39 132 207 133 219 107 165 158 130 105 139 145 157 127 129 111 198 161
5373 161 96 156 265 280 423 128 129 224 253 167 114 52 70 97 185 204 268 144 153 137 128 185 364 183 194 146 62 35 92 235 25 293
4998 293 188 241 91 177 127 161 129 83 145 204 55 176 132 131 215 44 162 92 161 51 276 134 76 209 163 192 33 31 213 139
4646 139 139 70 26 66 98 113 156 90 59 107 169 191 99 115 131 41 43 148 143 191 66 171 175 229 71 130 36 51 68 49 76 131 125 148 165
4235 165 77 138 258 135 181 78 209 349 197 223 144 161 154 53 158 43 209 199 108 127 188 317 140 80 141 78 139 128 245
3894 245 224 198 79 83 156 40 78 97 79 125 80 148 71 81 95 92 221 92 136 215 79 178 62 179 166 143 175 290 211 37 196
3531 196 209 151 79 121 222 258 133 120 187 133 153 174 133 168 12 109 132 219 302 125 17 23 58 112 43 62 106 128 286 1172 924
3167 924 175 95 156 82 226 161 179 272 579 870 459 507 324 226 355 104 132 246 406 325 64 100 182 115 99 104 258 97 144
2826 144 236 276 241 2643 5063 3025 630 121 182 135 313 53 172 298 207 36 19 97 154 167 64 187 181 101 249 144
2521 144 203 57 133 133 152 78 57 75 117 60 87 98 61 145 119 256 258 172 181 184 274 61 138 46 104 250 155 100 166 118 117 442 168 279
2122 279 59 510 774 3842 4485 1310 422 273 74 185 25 23 126 179 173 264 330 139 212 150 297 185 99 42 63 10 118
1805 118 127 185 134 82 142 92 83 129 171 11 69 15 74 78 176 230 117 124 77 306 77 50 113 77 106 73 79 48 36 97 56 166 101 142 21
1394 21 152 219 162 136 91 116 216 181 129 88 110 114 212 234 96 241 231 220 138 56 17 38 123 175 102 167 212 169 102 78 106 99 28 72
995 72 87 70 191 235 134 43 53 126 145 143 192 71 91 71 220 165 198 274 123 122 246 115 149 144 198 204 94 56 140 110 59 221 259
608 259 138 93 113 130 151 85 90 137 154 118 23 56 96 107 211 217 148 81 59 238 120 50 12 169 361 250 21 29 76 107 139 35
232 35 168 162 62 62 81 286 278 118 61 160 131 106 34 57 193 293 209 67 42 36 42 94 84 14 184 231 33 75 100 148 76 74 52 150
-167 150 43 38
-190C8
##PAGE=	F1=116.14
##FIRST=	25169.313707327481097,	5807.6787752999953227,	0.43507155776023864746
##DATA TABLE=	(F2++(Y..Y)), PROFILE
5808 50 37 69 59 218 141 191 213 141 136 161 249 213 155 100 200 124 208 291 248 58 157 218 164 188 100 116 127 147 137 106 86 102 139 148 142
5397 142 216 159 110 146 280 233 376 104 82 197 221 143 146 110 31 132 163 206 270 143 109 145 119 192 351 212 249 144 45 53 88
5033 88 258 68 279 129 248 148 159 128 155 165 99 190 264 67 170 112 141 212 57 183 98 185 35 276 117 65 189 138
4704 138 237 52 13 216 169 106 84 13 73 87 91 144 80 46 118 165 178 131 158 172 61 88 220 134 158 28 205 180 172 97 153 25
4329 25 43 77 55 91 159 138 101 142 73 141 224 117 158 90 171 302 175 204 150 165 137 60 178 17 254 146 102 163 194 287 120
3965 120 116 136 60 136 54 223 213 216 125 34 143 42 101 118 125 150 100 134 66 125 114 52 179 137 156 242 132 191 49 212 214 177 238
3578 238 290 251 26 188 150 138 97 81 172 211 115 85 133 111 143 171 131 157 70 103 138 194 247 126 22 27 39 48 47 9 81 40 94 330
3178 330 179 174 135 127 140 164 162 205 183 88 155 114 246 422 248 249 101 94 289 465 339 90 81 179 119 77 129 179 122 204 225 260 174
2791 174 1701 3064 1769 405 40 154 178 323 24 149 268 188 37 61 88 227 186 67 117 139 154 218 145 171 56 99
2486 99 129 133 116 26 124 72 68 76 121 68 223 101 253 226 157 140 196 279 104 104 113 90 256 101 113 41 94 59 387 213 192 144 383
2099 383 415 1995 2277 657 190 181 35 90 29 54 62 88 137 302 349 166 202 163 298 184 121 48 85 65 159 199 194 118 136 130 72
1735 72 41 99 157 30 71 40 71 81 198 212 155 115 32 248 67 53 125 35 125 62 118 63 45 89 98 189 90 156 22 206 268 164
1359 164 146 69 104 151 170 170 87 91 82 231 238 72 254 282 223 123 47 33 70 104 202 205 136 160 142 120 55 100 104 22 39 89 108 192 206 154
937 154 25 8 121 141 159 196 84 106 97 179 157 192 240 112 82 194 68 185 126 166 171 55 76 125 125 30 205 205 117 125 130 112 125 67
538 67 97 110 171 146 54 29 63 90 175 227 162 44 48 207 122 51 49 216 342 182 12 76 88 108 137 53 171 183 89 91 48 223 249
150 249 146 54 93 75 117 30 35 187 278 212 94 47 14 92 76 78 51 107 188 21 55 62 150 96 86 38 126 68 73
-190G3
##PAGE=	F1=13.8818
##FIRST=	25169.313707327481097,	5807.6787752999953227,	0.35613107681274414063
##DATA TABLE=	(F2++(Y..Y)), PROFILE
5808 115 22 78 48 244 84 204 219 155 152 181 249 250 169 106 230 146 202 310 257 78 170 210 171 157 104 63 112 169 163 77 76 54 177
5420 177 173 163 229 146 113 135 267 159 305 80 39 156 183 120 170 162 33 148 124 182 234 135 66 140 106 171 293 220 287 127 34
5056 34 61 73 260 86 242 65 237 187 155 128 156 202 114 214 283 69 139 95 151 202 48 178 111 191 45 226 84 51 155
4716 155 97 264 73 51 220 202 71 85 30 63 72 64 123 60 40 113 163 158 147 183 194 65 135 265 110 119 39 215 169 110 120 162 21
4329 21 33 77 64 96 169 144 50 109 63 138 181 95 116 102 132 236 133 178 154 152 127 56 179 77 286 104 94 198 192 246 103 158
3953 158 138 61 117 13 211 203 232 173 39 136 68 109 121 167 164 132 134 117 153 128 53 128 169 169 257 203 201 26 235 268 189 265 266 282 60
3542 60 168 98 143 116 55 119 155 114 64 85 79 108 148 126 132 115 93 146 197 182 118 62 39 76 74 70 36 52 30 73 295 496 249 203 144
3132 144 200 135 186 196 161 260 245 308 506 556 253 173 97 73 232 298 239 106 92 174 113 33 111 78 133 260 206 240 132 862 1295
2768 1295 660 204 65 124 206 331 15 155 234 167 55 87 98 282 193 40 80 110 185 158 128 149 57 86 113 113 191 21 157
2427 157 80 89 64 152 87 266 85 253 197 138 105 182 258 136 60 168 61 253 53 146 57 80 54 317 243 135 172 294 168
2087 168 802 830 232 97 143 46 59 33 63 16 33 90 313 347 187 200 166 277 207 120 75 120 125 190 259 193 134 172 117 54 34 121
1711 121 150 73 82 59 85 90 207 174 186 118 11 187 65 43 139 33 119 68 139 80 60 88 132 189 79 137 40 251 288 160 149 94
1336 94 103 75 152 200 86 85 76 223 224 36 244 329 231 119 78 45 110 67 218 286 112 119 133 149 41 99 102 64 18 95 129 153 147 171 70
925 70 66 125 134 160 204 99 104 106 113 124 170 186 122 58 142 16 226 130 130 124 13 101 110 150 87 208 164 84 146 133 86 121 77 88 58 159 178
491 178 122 37 50 53 117 227 165 48 75 163 116 64 79 251 310 123 38 121 112 98 117 92 165 185 105 131 28 140 213 164 68 51 74
103 74 127 17 90 214 264 213 123 79 34 147 72 58 85 51 157 61 108 32 142 106 108 21 87 94 115
-190A15
##PAGE=	F1=-88.3761
##FIRST=	25169.313707327481097,	5807.6787752999953227,	0.25403040647506713867
##DATA TABLE=	(F2++(Y..Y)), PROFILE
5808 177 23 90 57 254 31 197 209 167 173 197 237 264 194 124 241 159 180 306 244 89 169 184 162 139 140 44 118 187 177 48 126 87
5432 87 219 190 165 228 121 111 129 228 75 220 57 30 108 146 98 188 201 74 146 70 140 175 119 59 118 102 132 196 205 288 101 28
5056 28 69 48 236 72 205 17 220 212 157 126 153 223 121 212 265 56 97 96 153 187 18 147 130 179 73 135 71 54 119 59 270
4693 270 92 78 225 231 49 70 48 43 72 37 99 41 46 94 168 149 151 187 195 51 169 266 75 81 86 205 149 80 140 160 17 13 65 75 92
4282 92 169 151 30 77 51 130 129 76 67 111 103 171 110 154 150 126 126 40 160 132 298 91 91 221 168 192 85 176 135 74 85 65 214 201 250
3871 250 216 77 130 104 105 99 185 159 167 149 154 152 132 91 83 180 172 251 252 213 27 246 304 194 252 235 301 97 141 66 166 135 49 90 110 138
3448 138 73 42 38 55 106 107 97 140 83 155 221 118 99 97 49 145 140 83 58 40 58 85 421 574 230 244 200 232 125 181 158 120 303 343
3049 343 339 432 457 204 135 84 65 146 87 199 104 133 175 101 16 74 24 133 289 182 208 146 287 85 157 63 107 101 218 321 29
2685 29 169 201 146 86 94 107 308 191 31 141 97 189 77 92 136 53 85 87 98 236 29 160 104 116 47 179 108 276 88 249
2333 249 183 117 87 144 210 135 18 195 23 238 20 178 115 64 90 246 242 113 159 227 53 187 45 8 140 147 71 87 42 57
1981 57 56 18 48 299 317 194 203 155 240 222 90 78 153 171 205 299 185 163 186 104 51 103 169 149 121 74 66 101 97 203 126 201 128 27
1582 27 134 72 20 157 73 99 88 145 107 84 87 141 161 72 92 65 275 272 155 133 133 101 32 133 209 73 115 105 189 195 52 219 369
1195 369 247 127 93 47 140 44 215 334 104 96 143 189 34 114 97 92 31 105 134 89 91 189 108 117 131 120 157 221 119 91 100 62 74 136
796 136 124 136 78 97 34 267 143 104 77 45 122 97 166 155 223 151 52 159 126 77 126 107 65 6 121 207 183 66 55 20 59 220
420 220 160 66 76 107 107 82 94 272 274 88 73 154 139 82 103 145 153 171 106 172 71 62 174 172 77 81 136 128 1 172 265 254 213 141 128 33
-2 33 195 80 58 93 26 144 81 157 24 130 103 136 17 38 110 151
-190A51
##PAGE=	F1=-190.634
##FIRST=	25169.313707327481097,	5807.6787752999953227,	0.1751009821891784668
##DATA TABLE=	(F2++(Y..Y)), PROFILE
5808 225 30 92 89 249 11 165 182 176 190 203 222 252 218 142 230 168 152 283 211 92 161 147 156 145 196 85 138 195 177 19 174 143
5432 143 248 192 141 206 86 118 129 170 17 134 40 58 76 118 82 202 223 114 131 35 103 122 100 91 89 106 93 81 168 245 69 18
5056 18 84 34 191 35 193 46 207 230 158 116 136 217 115 189 222 26 65 115 147 168 43 96 142 152 106 22 94 80 91 54 252
4693 252 111 92 228 250 59 46 59 33 90 17 87 53 66 75 175 161 151 172 180 32 179 223 49 49 131 184 131 96 159 155 8 17 57
4305 57 82 84 169 159 54 59 43 119 73 72 29 109 95 136 138 135 133 92 132 30 127 166 289 107 98 224 121 137 66 159 115 89 65 100 230
3894 230 207 260 247 112 120 142 106 52 179 140 200 164 164 121 122 131 87 167 165 219 263 221 74 247 311 203 209 209 306 117 110 74 196 150 46
3484 46 96 103 174 90 6 10 47 70 75 74 147 74 160 241 72 75 115 51 200 189 95 93 77 72 58 316 398 156 255 265 233 116 158 118 53 198
3061 198 253 260 194 259 129 120 64 72 82 123 231 88 171 188 93 48 48 90 126 285 156 163 198 191 608 552 45 124 93 217 285 35 176
2674 176 174 130 121 81 104 299 182 101 217 92 169 23 38 130 52 79 61 87 238 40 137 122 142 26 190 123 260 105 242 197
2322 197 94 85 92 139 109 40 193 13 215 10 202 141 37 129 196 216 110 123 174 69 168 294 83 178 184 102 105 36 41 87 34 31
1946 31 266 261 184 205 129 192 218 43 59 171 198 203 313 173 185 180 90 60 167 205 155 163 43 62 118 96 191 80 194 133 25 102
1570 102 86 27 176 107 90 112 137 139 111 77 130 116 66 44 98 274 223 149 98 161 98 83 127 198 57 154 140 133 159 111 191 398 261
1183 261 149 77 40 149 67 192 342 107 88 169 235 33 144 121 105 50 110 125 20 101 201 129 158 138 99 164 242 146 82 90 92
819 92 21 94 76 142 106 69 81 298 149 109 64 80 133 84 167 209 236 155 61 165 113 97 124 139 36 70 70 227 224 88 60 58 59 211
420 211 146 69 50 51 103 107 96 282 248 82 113 169 167 83 120 195 138 156 92 203 114 53 141 171 67 125 210 123 21 245 309 242 214 147
21 147 175 24 224 87 109 82 22 143 87 189 38 121 86 165 31 26 109 174
-190A74
##PAGE=	F1=-292.892
##FIRST=	25169.313707327481097,	5807.6787752999953227,	0.16664867103099822998
##DATA TABLE=	(F2++(Y..Y)), PROFILE
5808 250 31 84 135 234 27 113 144 176 192 196 205 216 228 147 199 175 125 246 166 90 149 111 169 172 251 130 160 191 168 22 201 179 255
5420 255 172 94 162 51 138 132 103 49 55 41 85 87 104 82 210 231 148 113 70 92 111 84 127 79 103 75 51 118 166 38 11 107 51 131 31
5010 31 202 71 204 245 153 96 105 183 96 158 173 17 77 143 135 147 103 41 138 123 134 93 113 113 77 70 212 129 94 229 254 81 42 67
4610 67 52 106 16 90 83 95 76 179 180 152 143 154 52 172 150 65 25 167 158 123 108 184 158 4 54 85 79 74 175 167 73 61 48 108 28 86
4188 86 40 97 98 147 179 117 100 57 141 58 90 172 263 140 111 208 60 107 67 109 78 95 78 111 246 210 252 262 141 107 176 138 17
3801 17 152 114 228 167 153 72 103 167 139 138 149 165 237 215 123 239 282 212 154 192 296 113 81 105 221 159 42 102 124 206 95 47
3425 47 63 108 81 51 92 137 68 155 243 61 66 110 40 227 208 110 146 130 82 51 126 152 112 246 314 213 100 142 106 45 54 112 162 52
3026 52 97 55 113 50 90 63 167 218 68 193 211 95 69 47 124 120 253 134 118 257 250 709 618 73 120 109 207 223 27 173 153
2662 153 125 154 52 88 256 166 175 268 80 134 100 24 126 74 60 59 79 198 60 95 135 161 8 181 127 227 118 241 230 70
2310 70 86 37 56 85 78 172 40 191 18 217 148 25 162 191 178 104 80 129 71 199 342 104 198 233 138 111 41 26 92 63 53
1946 53 228 193 158 201 93 141 203 59 56 162 200 192 301 160 194 163 73 61 210 212 164 189 6 50 144 80 176 44 165 130 11
1582 11 104 105 63 190 124 100 132 121 171 132 54 123 84 59 50 131 246 149 141 49 175 108 125 147 175 46 172 161 65 124 168 169 411 255
1183 255 177 35 49 132 90 149 315 106 89 200 278 42 175 178 108 66 99 107 35 139 196 130 189 146 76 182 261 183 92 90 136 19
807 19 52 75 133 115 59 118 309 138 138 95 92 126 65 151 241 237 154 101 164 100 124 108 163 13 126 34 232 234 93 56 95 98 201 129 58
397 58 11 49 106 138 93 281 240 92 152 167 190 122 156 227 121 152 73 213 136 88 130 162 39 161 281 120 37 290 325 226 213
33 213 149 204 43 223 97 169 63 36 143 94 205 48 125 57 189 43 86 92 179
-190A79
##PAGE=	F1=-395.15
##FIRST=	25169.313707327481097,	5807.6787752999953227,	0.21667554974555969238
##DATA TABLE=	(F2++(Y..Y)), PROFILE
5808 252 35 80 185 213 30 59 99 164 173 175 184 158 212 132 153 178 105 203 119 92 138 87 190 212 293 164 176 179 155 55 204 184 235
5420 235 129 36 101 28 157 129 41 55 20 64 104 117 98 92 208 228 174 99 105 95 133 77 157 105 84 75 143 67 82 12 37 133 72 75 83 200
4998 200 74 210 256 139 69 64 123 60 134 140 68 122 171 125 124 156 36 117 108 155 183 103 136 76 75 155 145 88 225 242 94 74 76 75 106
4587 106 22 93 105 124 94 171 187 153 103 125 97 172 84 92 8 187 131 125 96 213 172 18 94 143 60 70 188 173 83 77 69 98 45 101 57
4176 57 79 98 173 204 100 56 36 147 98 63 153 229 182 123 180 12 115 103 42 39 87 102 100 251 199 216 260 164 96 202 194 90 114
3789 114 87 248 160 134 29 87 199 197 109 127 97 186 187 160 224 225 209 116 177 268 85 58 134 233 163 59 86 144 227 86 94 115 158 115
3390 115 67 130 119 64 138 225 67 86 81 18 219 195 119 199 180 92 67 108 142 142 223 330 188 86 140 121 93 95 114 107 211 70 49
3002 49 113 56 115 84 120 142 57 202 232 103 87 49 127 119 204 120 97 308 234 476 465 95 102 146 194 148 6 163 141 133 182 16 78
2615 78 190 143 230 282 56 92 160 88 119 113 33 79 73 128 80 47 142 168 13 154 119 185 115 251 262 44 82 17 30 93 109 158 55
2228 55 176 44 225 154 69 183 215 143 83 42 84 51 173 277 111 210 274 173 127 108 38 74 92 88 195 128 120 186 61 93 197
1864 197 119 105 120 172 179 265 149 188 144 53 43 229 190 173 195 54 44 173 51 163 18 119 116 23 125 126 94 195 121 109 143
1500 143 103 197 138 23 151 95 48 73 154 195 68 124 15 176 134 141 188 160 41 157 161 6 104 210 156 411 220 201 28 97
1148 97 88 94 93 260 98 89 226 307 59 190 241 115 78 69 88 63 149 165 114 213 153 55 193 272 229 123 102 149 37 28 102 108 101 54 142
737 142 294 110 169 129 81 99 39 123 255 223 134 141 160 89 139 83 173 15 172 66 217 213 75 47 111 120 186 118 55 26 93 112 171
350 171 92 273 246 113 178 154 204 178 184 231 101 159 57 200 137 95 154 148 12 189 339 127 45 297 304 205 203 150 210 79 188
-14 188 124 211 39 61 134 116 203 45 143 19 202 50 144 88 171
-190A71
##PAGE=	F1=-497.407
##FIRST=	25169.313707327481097,	5807.6787752999953227,	0.23364682495594024658
##DATA TABLE=	(F2++(Y..Y)), PROFILE
5808 232 56 99 225 190 28 52 56 140 136 141 150 81 168 94 102 178 95 159 78 102 128 72 204 252 316 187 186 164 143 88 193 161 186 69
5409 69 57 45 17 160 115 29 25 82 98 115 141 98 102 199 220 193 96 116 82 148 72 184 145 48 71 206 53 81 10 70 157 82 56 134
5010 134 167 63 217 259 119 56 28 54 8 135 136 117 177 195 121 106 192 68 93 116 166 233 59 140 83 64 92 158 81 215 219 94
4634 94 114 89 90 89 33 83 113 145 105 151 172 149 56 94 136 197 102 103 19 188 105 137 72 236 193 29 132 210 27 80 201 179 86 103
4235 103 96 89 75 106 64 64 91 184 210 92 7 53 143 138 55 123 196 225 127 150 52 132 155 72 50 68 122 69 236 174 152 237 177 96 220
3824 220 252 164 74 62 261 155 126 51 87 224 242 106 108 39 141 141 175 204 159 185 112 156 227 41 43 151 228 161 93 43 155 232
3448 232 67 133 158 181 132 92 153 101 59 109 189 61 118 42 12 181 156 113 235 216 101 58 158 209 167 195 304 168 106 137 133
3085 133 118 146 165 119 274 67 98 120 71 146 129 48 42 63 204 241 108 106 55 116 125 156 117 115 343 249 143 252 129 82 191 180
2709 180 92 26 148 137 142 198 17 105 119 114 253 263 27 56 192 143 99 148 25 92 74 61 94 14 143 162 19 120 101 139 91
2345 91 273 276 22 73 69 93 113 137 177 63 166 75 231 169 119 192 237 128 58 23 37 35 161 212 126 215 289 196 156 194 65 41 108
1958 108 131 180 77 78 159 61 51 210 160 173 50 123 168 209 140 174 132 41 49 227 146 177 182 99 53 197 16 151 4 62 96 46
1582 46 141 145 119 192 101 98 144 93 213 123 36 205 118 43 70 154 131 25 95 57 169 156 139 239 174 32 110 140 71 111 231 148 402
1195 402 160 215 83 159 28 79 32 192 83 82 236 313 74 180 285 137 91 39 74 58 121 118 88 232 151 34 183 275 274 164
843 164 114 126 32 42 118 74 72 45 149 257 81 186 146 70 56 23 90 255 203 95 173 157 81 137 66 165 21 206 107 183 165 39
467 39 41 104 116 163 117 74 47 124 117 199 103 259 252 132 183 145 204 232 201 204 79 164 53 164 121 68 201 133 52 202 374 144 46
80 46 263 255 182 179 151 197 115 127 158 224 7 83 115 149 179 31 169 29 202 56 190 132 160
-190A60
##PAGE=	F1=-599.665
##FIRST=	25169.313707327481097,	5807.6787752999953227,	0.214878082275390625
##DATA TABLE=	(F2++(Y..Y)), PROFILE
5808 199 86 133 245 161 23 96 25 109 88 97 102 8 97 39 63 176 90 120 45 122 114 53 199 283 319 199 189 152 138 113 182 117 119 43
5409 43 119 57 15 140 88 67 33 143 133 119 151 102 107 186 208 205 102 99 42 143 64 208 177 27 52 230 81 133 30 101 171 80
5033 80 83 174 112 69 218 255 108 78 25 62 59 166 150 157 232 217 123 96 208 77 88 129 169 240 12 119 92 44 48 164 74 198 190
4646 190 92 150 101 93 67 55 62 109 154 90 125 133 140 7 60 157 233 158 91 46 167 82 156 91 236 208 36 166 272 41 105 205 180
4258 180 85 131 118 83 90 99 66 62 79 174 202 93 40 86 129 169 51 107 178 255 122 131 76 136 201 150 93 52 140 36 204 141 71 195
3859 195 175 102 232 296 220 53 39 265 163 142 86 99 233 262 131 106 68 136 93 168 182 117 140 121 129 187 11 40 153 202 150
3495 150 123 18 161 222 46 155 185 172 119 107 150 94 53 71 139 42 144 38 38 127 105 91 244 234 107 46 124 170 160 167 241 150
3120 150 152 131 132 122 130 160 176 288 76 129 126 77 187 173 71 43 74 202 233 104 114 75 114 134 130 126 147 356 286 127 177 160 71 229
2721 229 164 102 58 130 136 144 195 43 160 83 85 236 221 32 50 197 182 64 164 45 86 77 78 105 47 135 144 17 95 77 96 56 299
2333 299 268 30 60 118 134 114 167 226 88 149 97 234 187 158 190 241 138 80 26 19 30 159 198 153 205 266 199 184 269 87 38 107
1958 107 175 187 45 54 123 88 27 234 166 238 35 73 153 140 134 161 125 55 116 215 93 173 155 130 64 206 27 138 27 14 75 60
1582 60 143 157 139 186 66 64 133 88 216 93 80 256 121 47 38 130 66 71 53 91 155 156 138 288 207 15 53 109 125 145 232 142 386
1195 386 96 221 124 213 53 63 27 125 62 64 227 293 82 141 296 171 101 77 62 27 65 112 64 240 135 10 149 270 305
854 305 206 121 76 23 55 113 41 49 28 137 209 84 178 144 92 23 56 56 250 185 49 194 161 77 119 69 139 25 233 137 132 101 28
467 28 50 79 91 131 122 103 48 132 118 217 123 239 247 136 162 156 191 272 223 159 54 159 60 114 107 16 253 126 92 200 382 169 35
80 35 202 199 161 136 145 173 146 50 183 207 36 98 98 185 134 49 198 73 190 71 218 203 154
-190A54
##PAGE=	F1=-701.923
##FIRST=	25169.313707327481097,	5807.6787752999953227,	0.21126569807529449463
##DATA TABLE=	(F2++(Y..Y)), PROFILE
5808 161 112 168 238 126 17 137 24 80 46 55 51 93 28 24 56 174 84 86 21 147 96 27 180 300 306 205 187 147 141 124 177 74 67
5420 67 102 161 89 18 103 56 96 96 196 166 117 151 115 112 170 190 212 111 68 22 117 54 232 196 71 24 221 100 153 70 125 171 72
5033 72 106 200 103 110 205 245 127 113 34 124 135 214 160 179 275 236 126 99 214 58 104 133 168 212 75 74 96 31 64 160 70 176 165
4646 165 110 180 107 88 74 86 67 99 152 45 111 78 127 40 29 154 253 197 58 84 126 63 179 156 205 207 39 198 319 100 135
4282 135 192 169 77 151 129 79 95 80 74 67 68 153 192 97 75 115 107 189 33 117 177 261 110 128 79 121 226 209 127 55 157 50 161 110
3883 110 55 136 152 108 236 317 250 65 19 254 177 178 106 108 217 254 163 127 122 156 68 142 163 124 95 120 97 166 48 54 138 157 125 139
3484 139 82 167 197 34 152 194 139 76 123 120 111 50 49 81 29 157 66 57 74 58 64 226 235 113 88 91 80 138 145 164 133 195 129 123 120 75 122
3049 122 238 297 118 131 120 68 230 202 84 83 80 198 208 94 99 101 131 141 128 141 174 346 279 222 233 175 74 253 144 139 86 107
2674 107 129 138 167 70 215 106 68 185 173 65 74 182 200 14 152 62 61 79 137 115 83 118 115 20 94 57 71 54 323 248 64 48
2298 48 158 145 89 198 282 141 117 104 237 196 176 182 228 159 149 36 72 28 151 226 190 172 209 177 198 312 94 77 93 214 211 48
1923 48 75 93 114 51 253 139 288 117 59 124 78 129 156 118 90 200 204 44 157 119 142 67 199 55 122 48 51 64 62 132 158 159 186
1535 186 28 15 114 82 208 70 122 289 109 49 16 82 23 93 32 111 134 129 162 326 236 7 65 91 163 194 215 137 362 88 226
1171 226 141 240 116 69 71 74 55 52 201 250 81 80 271 206 105 143 47 22 34 178 59 229 101 20 97 255 312 240 122 16 48
807 48 55 87 19 58 29 103 165 118 148 126 135 72 100 24 243 175 37 206 174 76 96 86 94 39 252 157 70 42 81 76 49 56 90 124 133 40 118
373 118 114 221 147 215 228 119 120 189 169 290 266 131 36 144 74 60 112 51 296 131 118 181 362 198 12 129 167 142 78 126 152
9 152 172 29 184 170 88 107 106 215 81 105 227 111 172 95 223 270 154
-190A54
##PAGE=	F1=-804.181
##FIRST=	25169.313707327481097,	5807.6787752999953227,	0.28235709667205810547
##DATA TABLE=	(F2++(Y..Y)), PROFILE
5808 127 125 193 208 87 30 165 34 65 47 55 39 166 92 84 68 169 76 57 21 169 71 36 160 302 282 205 185 149 153 117 167 62
5432 62 99 159 173 93 18 59 35 112 151 236 191 116 144 139 122 148 161 214 121 55 96 77 57 252 205 116 18 189 97 130 132 139 153 69 114 209
5010 209 174 163 177 228 171 141 29 163 207 257 151 178 295 250 126 118 219 32 127 122 165 167 125 14 96 45 91 142 65 150 151 151 207
4622 207 108 80 114 121 110 86 150 33 123 25 113 85 59 126 241 220 22 130 71 51 194 224 141 182 41 228 343 160 160 162 144 62
4247 62 157 128 79 100 57 87 70 61 133 187 94 97 134 85 195 12 135 187 240 99 132 76 93 223 235 144 61 171 88 116 93 135 73
3859 73 108 117 227 309 244 80 23 228 186 220 113 103 170 219 191 158 162 166 71 105 150 151 95 105 66 173 69 72 115 96 82 138 136 174 162
3448 162 38 130 185 95 12 152 89 150 67 83 23 47 152 80 65 46 26 46 186 221 121 135 135 56 119 133 115 123 218 138 114 122 25 88
3049 88 271 300 144 104 97 46 263 214 44 86 77 190 172 84 59 122 164 143 130 154 188 317 220 182 243 171 87 254 119 159 106 81
2674 81 109 130 121 109 254 139 71 114 130 97 102 159 196 46 116 65 42 74 184 123 110 98 78 37 102 53 89 102 342 238 107 39 180
2286 180 131 73 227 327 211 68 97 236 195 169 175 207 181 226 55 123 39 155 274 223 120 127 134 197 315 83 109 73 242 237 78
1923 78 113 85 131 89 258 95 316 176 69 76 79 122 155 104 128 277 195 10 131 80 136 61 179 69 102 61 85 65 56 113 148 178
1547 178 199 48 38 88 79 192 84 155 295 104 37 71 23 40 85 84 120 105 103 205 343 246 29 116 107 183 241 185 136 326 133 235
1171 235 137 230 159 90 101 56 87 78 165 194 69 18 218 227 100 199 22 68 78 255 77 195 53 61 44 224 294 261 122 44 81
807 81 42 49 6 94 63 48 140 150 105 103 171 130 140 28 233 172 70 210 187 77 84 105 35 64 261 168 6 48 130 112 30 24 49 121
408 121 161 49 86 104 211 166 192 197 83 68 229 150 281 323 149 45 125 88 16 134 119 324 148 126 153 318 224 29 64 159
56 159 120 20 97 138 193 100 158 129 137 119 134 237 95 169 254 136 151 119 210 315 157
-190A57
##PAGE=	F1=-906.439
##FIRST=	25169.313707327481097,	5807.6787752999953227,	0.37859284877777099609
##DATA TABLE=	(F2++(Y..Y)), PROFILE
5808 102 119 207 163 58 66 179 37 65 76 94 67 211 165 130 73 160 70 32 40 178 36 70 150 292 250 203 187 149 165 104 136 78
5432 78 157 192 149 66 11 35 44 114 189 256 205 116 136 172 134 113 122 211 131 81 166 37 82 264 206 147 43 149 79 88 207 141 121 72
5033 72 108 202 247 204 135 202 214 157 14 165 260 277 121 155 286 261 122 152 230 61 154 101 164 129 142 49 95 71 101 107 56 122 154
4646 154 200 228 108 74 158 155 156 68 154 126 150 42 105 127 120 79 194 234 50 177 29 45 197 274 54 141 45 256 340 208 175
4282 175 128 115 44 149 119 78 111 35 97 75 58 125 190 84 107 140 68 186 55 146 199 196 98 137 87 70 188 223 142 56 177 117
3906 117 80 85 201 62 54 140 203 274 206 76 41 185 193 261 109 82 94 166 214 183 184 152 73 68 142 175 148 79 43 191 72 87 98 29
3507 29 23 125 170 175 119 51 110 165 64 69 187 105 194 109 137 40 66 133 74 67 43 4 50 135 200 138 156 156 76 119 127 119 118 216 148 112 127 24
3061 24 83 260 281 152 68 62 20 273 209 28 83 65 178 137 78 8 133 203 142 120 154 187 277 141 91 202 153 101 232 89 158
2697 158 115 64 74 131 94 163 268 158 85 49 100 126 124 135 173 99 70 57 73 65 218 124 124 85 38 58 104 65 127 152 351 250 149
2310 149 33 177 106 123 246 352 280 19 86 229 192 143 171 189 193 288 80 161 60 167 308 239 64 40 86 192 282 62 123
1970 123 57 259 257 113 147 97 134 125 247 84 317 199 66 13 125 112 150 83 160 329 179 9 96 47 118 48 155 69 81 69
1617 69 98 72 46 98 126 191 225 99 85 60 97 174 116 172 271 124 8 120 44 51 61 145 129 74 126 244 334 232 47 143 135 180 270
1230 270 145 139 276 169 244 122 183 173 110 120 67 136 124 127 140 52 56 157 228 86 235 9 102 107 304 107 139 38 111 39 176
866 176 259 264 125 87 106 29 44 36 145 101 30 140 167 85 96 186 180 168 65 222 170 93 208 192 78 98 122 31 94 257 171 60
491 60 85 161 153 40 14 54 121 182 74 54 90 188 178 182 162 45 47 265 146 243 371 187 72 107 101 24 158 180 333 171 118 127 257
103 257 241 82 16 148 97 59 67 129 208 158 118 100 170 133 158 251 184 224 278 146 131 135 185 330 162
-190A62
##PAGE=	F1=-1008.7
##FIRST=	25169.313707327481097,	5807.6787752999953227,	0
##DATA TABLE=	(F2++(Y..Y)), PROFILE
5808 93 94 207 117 49 108 179 36 64 98 128 77 219 208 160 63 148 76 17 58 169 12 94 159 276 215 200 194 140 171 107 82 95 194
5420 194 198 100 20 23 51 61 105 207 255 204 116 127 205 138 61 77 201 140 110 218 53 116 261 203 160 62 113 72 103 284 135 81
5045 81 80 95 180 287 221 85 162 238 162 22 129 279 263 83 121 248 267 116 194 240 106 186 76 169 120 128 98 95 97 90 60 43 98
4657 98 167 241 242 112 67 189 186 184 41 164 225 177 78 104 172 184 22 122 247 98 217 67 50 183 297 61 116 54 276 313
4305 313 236 179 118 111 35 129 112 76 127 16 103 93 56 131 198 69 107 134 52 165 109 151 209 142 111 144 108 76 133 175 123 41 171
3918 171 126 65 78 235 111 54 174 173 220 146 49 55 131 212 298 99 55 22 109 231 191 189 119 59 38 135 196 213 58 35 201 61
3542 61 93 100 40 48 110 178 165 75 68 131 141 64 149 212 155 229 169 185 82 74 106 63 75 41 29 56 85 176 166 143 122 78 140 118 134 116 196
3108 196 151 115 134 24 108 216 248 163 55 59 29 254 191 104 103 48 163 122 79 61 138 240 139 104 136 171 234 78 47 156 125
2744 125 113 187 55 140 108 67 29 139 139 220 252 160 99 62 83 154 137 112 138 135 48 41 116 56 245 122 124 87 30 75 102 74 159 186 349
2333 349 271 183 29 146 99 200 249 356 334 57 81 213 198 117 169 178 191 319 103 183 81 164 299 231 40 43 76 191 232 62
1981 62 120 53 264 262 140 170 110 125 155 226 125 294 184 79 62 156 94 136 59 177 342 153 13 56 40 94 28 132 62 61 82
1617 82 89 71 38 91 103 195 254 144 119 43 132 158 133 169 218 151 38 156 99 42 64 194 145 46 182 261 299 196 57 132 153 155 270
1230 270 103 142 214 176 248 118 112 162 131 135 85 179 163 92 108 41 96 122 209 63 246 42 114 105 312 141 74 91 166 81 115 218
854 218 250 131 117 119 36 90 88 205 130 111 164 165 115 114 180 218 182 99 211 165 93 199 182 82 127 136 96 127 239 168 117 106 170 191 60
444 60 21 108 132 191 93 65 77 151 180 190 134 38 78 288 155 181 387 210 101 87 116 35 176 228 327 192 103 110 189 241 145 31
68 31 126 78 107 55 120 215 198 93 87 179 139 164 261 280 254 294 145 113 139 156 315 166
-190A66
##PAGE=	F1=-1110.95
##FIRST=	25169.313707327481097,	5807.6787752999953227,	0
##DATA TABLE=	(F2++(Y..Y)), PROFILE
5808 100 52 196 80 54 140 163 29 60 107 141 56 191 213 173 44 138 93 25 75 141 69 101 188 257 182 195 203 118 167 136 53 116 202
5420 202 185 55 56 51 70 75 93 212 239 187 112 121 230 128 8 48 184 150 125 246 106 149 240 197 158 75 81 100 178 347 128 42
5045 42 95 85 150 280 207 39 106 230 158 44 64 257 216 83 108 189 268 111 237 239 136 220 56 181 137 102 121 98 116 65
4693 65 31 35 78 178 263 245 120 53 200 210 185 14 173 312 195 98 115 220 238 41 48 257 141 242 114 66 159 289 149
4352 149 150 65 281 269 241 176 140 141 44 107 114 70 137 6 115 125 51 146 210 58 105 118 34 137 157 154 214 91 135 150 121 114 96 106
3953 106 91 26 150 113 71 65 231 149 110 205 151 166 89 32 58 71 249 327 89 58 105 58 242 177 181 78 39 33 134 218 272 78
3578 78 48 196 47 92 114 96 119 102 163 146 32 86 184 120 72 219 218 197 238 233 214 104 81 85 78 94 38 68 52 48 156 198 109 62 113
3167 113 169 101 133 115 170 145 121 141 31 146 169 215 180 71 112 54 211 161 159 140 36 147 130 85 111 141 263 135 105 103 143 194
2791 194 78 95 142 87 125 127 30 113 80 87 24 144 213 265 209 150 109 106 72 178 140 86 101 143 62 26 145 58 264 128 117 100 66
2404 66 87 107 67 167 199 334 279 199 24 98 129 266 234 339 356 98 82 186 212 119 164 177 172 312 120 185 95 143 240 204 50
2040 50 93 113 192 189 98 114 58 260 253 156 182 119 106 179 201 167 250 139 138 125 157 65 115 33 174 312 120 17 17 53 68 7 117 58
1641 58 44 103 69 60 34 89 93 190 272 170 139 48 165 150 126 146 142 163 86 176 138 25 96 220 164 27 224 246 242 148 60 84 152 110
1242 110 238 78 145 144 161 243 135 54 139 161 153 103 205 185 64 111 51 107 129 175 30 238 67 104 81 276 171 50 143 219
890 219 134 70 181 219 135 139 124 51 137 147 258 139 194 208 150 158 142 160 241 178 123 199 155 73 182 154 94 152 145 148 160 211 161 162 110 156
467 156 221 84 28 161 150 184 93 116 81 99 173 215 122 54 112 294 164 103 362 203 123 66 139 31 183 257 308 205 94 98 124
103 124 225 209 71 123 72 135 60 108 210 217 106 78 162 129 153 275 360 249 297 141 101 130 125 275 167
-190A67
##PAGE=	F1=-1213.21
##FIRST=	25169.313707327481097,	5807.6787752999953227,	0
##DATA TABLE=	(F2++(Y..Y)), PROFILE
5808 118 6 176 60 63 149 134 17 61 100 129 28 144 177 172 34 136 114 41 92 98 134 95 234 236 156 185 208 84 156 171 117 148
5432 148 185 163 74 111 76 80 87 85 205 216 160 103 123 242 103 68 61 158 159 124 250 160 172 202 189 147 88 51 140 250 385 135 18
5045 18 124 83 119 231 165 47 39 191 152 63 30 199 147 133 145 121 262 108 273 224 144 245 45 198 165 101 115 108 125 46 74
4681 74 50 65 179 258 237 127 31 192 224 159 45 178 372 203 104 133 267 271 91 56 258 175 245 144 92 132 252 214 213 77
4329 77 265 220 226 166 164 173 56 88 117 59 138 16 137 160 43 162 219 55 110 94 15 113 192 156 211 55 161 146 121 158 122 50
3953 50 56 23 118 81 84 52 193 155 154 220 148 139 80 83 48 15 290 344 82 92 185 25 243 140 163 46 47 74 148 236 315 135 86 176
3554 176 39 91 129 132 182 103 132 122 7 103 233 102 67 265 203 212 215 291 218 104 108 80 115 120 38 99 40 32 143 224 90 41 152
3167 152 188 83 123 116 154 137 127 142 55 173 151 197 191 92 171 71 161 128 185 176 39 134 143 94 136 144 265 129 137 75 112 162 145 221 171
2756 171 37 137 63 35 93 41 109 71 139 275 287 146 134 117 131 58 191 134 61 76 121 67 19 147 75 272 145 114 115 100 94 126
2380 126 38 141 191 305 268 195 17 52 172 303 202 301 340 118 78 151 220 144 151 182 137 269 131 170 99 128 154 167 46 113
2028 113 153 184 171 140 119 68 247 233 163 184 126 80 197 179 184 192 93 210 168 129 31 91 11 147 245 98 26 19 59 37 58 111 63 30
1629 30 121 61 51 28 86 109 180 271 171 148 60 181 145 93 110 51 149 126 186 157 27 114 217 178 20 236 204 177 100 57 11 131
1254 131 62 181 92 147 81 146 230 155 76 120 198 172 122 209 187 46 141 76 87 145 138 10 222 77 76 65 208 184 96 180 264 202 112
866 112 147 176 130 158 124 59 169 195 288 126 268 266 132 187 167 136 248 158 130 186 139 41 155 112 114 164 147 178 185 181 151 192 101 128
467 128 236 107 44 194 164 163 71 175 110 43 157 242 122 61 139 282 163 24 298 165 138 56 166 15 181 263 278 204 97
127 97 81 75 196 262 114 158 84 144 63 95 188 212 129 68 133 105 133 300 407 206 285 141 94 115 91 220 157
-190A57
##PAGE=	F1=-1315.47
##FIRST=	25169.313707327481097,	5807.6787752999953227,	0
##DATA TABLE=	(F2++(Y..Y)), PROFILE
5808 137 50 147 53 73 124 94 18 66 78 104 89 128 110 162 42 145 132 55 110 47 196 94 280 211 146 171 204 43 144 194 185 181
5432 181 155 135 111 146 89 79 99 81 183 194 136 92 138 236 77 121 92 122 166 112 237 205 185 154 177 135 104 15 173 298 391 160
5056 160 40 160 91 93 154 101 97 50 136 153 75 96 120 79 190 207 61 246 110 293 198 134 251 45 212 191 125 100 126 126 69
4693 69 121 75 58 166 224 221 131 18 167 220 113 83 183 394 198 101 154 303 277 128 106 249 198 231 155 124 115 192 242 263 86
4329 86 228 178 196 153 172 185 58 75 114 43 127 35 163 187 33 168 213 64 129 63 19 102 209 152 201 35 179 124 117 189 169
3965 169 86 48 39 97 50 91 43 132 127 170 212 151 146 100 138 28 32 317 348 77 124 233 26 227 84 138 31 83 135 181 237 333 196
3578 196 141 151 38 96 143 146 226 108 93 102 36 113 259 87 48 279 175 197 165 333 195 85 154 87 148 148 28 107 32 37 144
3214 144 231 119 60 145 180 77 114 110 155 128 132 130 70 176 168 222 204 121 213 81 124 102 187 201 50 123 143 104 133 147 249 120 177
2826 177 92 96 139 211 355 216 23 151 12 52 93 50 129 108 121 309 278 77 117 121 133 37 190 120 54 69 72 46 16 124 98 260
2451 260 160 120 128 125 102 149 13 81 165 262 240 176 13 48 208 304 159 247 285 118 68 114 209 160 132 186 94 206 138 141 94 128 90
2063 90 133 22 106 175 160 163 167 137 80 226 213 166 178 137 49 211 163 171 126 97 264 182 90 43 75 13 104 159 107 41 37 48 8 123 114
1653 114 74 19 124 77 69 23 86 141 167 246 147 151 64 175 141 44 96 58 112 151 186 156 36 98 186 182 20 218 145 118 72 56 75 93
1254 93 60 113 122 144 75 157 210 165 114 106 234 190 143 191 176 39 182 100 57 142 109 55 204 69 40 89 128 172 138 202 295 280 193 111
854 111 125 115 173 121 59 177 214 287 94 323 324 119 192 181 122 238 124 126 167 115 25 119 64 136 158 138 180 195 155 144 206 82 100
467 100 232 119 69 195 166 137 28 232 153 53 138 262 124 71 166 255 150 66 212 104 148 69 186 12 168 244 239 188 101
127 101 56 48 160 295 150 195 107 145 60 81 148 187 142 64 118 95 116 331 414 131 256 147 87 102 51 161 130
-190A30
##PAGE=	F1=-1417.73
##FIRST=	25169.313707327481097,	5807.6787752999953227,	0
##DATA TABLE=	(F2++(Y..Y)), PROFILE
5808 152 96 113 55 80 65 57 53 68 46 97 170 180 30 144 51 157 149 62 121 10 247 109 308 179 152 153 191 8 140 196 220 194
5432 194 129 94 120 154 86 71 105 69 141 172 135 83 162 215 80 154 123 82 170 96 214 235 187 109 161 127 125 29 192 318 367 193 71
5045 71 194 105 74 68 29 149 124 99 164 77 144 56 51 232 265 47 221 115 293 167 117 235 49 216 207 146 124 152 122 117 156 93
4669 93 55 141 168 204 134 51 141 194 57 105 189 378 177 98 171 316 259 151 133 232 209 205 150 154 113 119 231 283 89 174 146 161 137
4282 137 160 171 49 69 103 25 112 62 181 196 30 160 185 85 164 30 38 108 208 143 190 25 179 89 123 194 189 135 76 87 134
3918 134 75 87 42 69 81 152 182 144 158 104 173 22 64 321 337 77 139 242 39 189 19 110 26 124 198 220 213 321 242 195 128
3554 128 45 104 162 138 245 109 55 92 57 114 256 71 38 254 140 157 116 350 150 56 201 93 166 173 15 83 42 65 162 215
3202 215 163 85 94 142 75 105 88 162 118 138 100 67 157 201 293 233 163 228 87 110 93 181 213 69 110 126 117 109 147 224 111 206 136 110 124
2791 124 225 392 228 74 163 26 63 113 97 143 132 93 309 243 44 103 121 116 9 173 102 73 68 9 7 12 95 122 226 156 127 141
2416 141 138 116 162 79 19 128 201 202 156 18 66 228 270 113 181 198 117 56 88 182 152 109 187 68 156 141 105 79 115 85 110 9 85
2028 85 176 120 145 167 153 90 195 204 170 170 157 20 221 152 130 58 142 281 169 73 92 78 30 68 103 134 64 37 24 52 189 125 81
1641 81 9 112 93 108 41 98 170 152 204 113 160 58 153 135 34 137 149 58 159 179 141 29 45 134 171 32 181 85 81 79 66 155
1265 155 48 96 60 143 129 131 195 188 159 130 84 258 203 165 162 162 45 223 118 75 117 97 95 179 47 7 125 75 134 157 210 310 354
878 354 273 78 78 92 178 110 55 160 193 254 54 352 366 115 173 182 120 212 86 116 144 88 49 75 44 148 134 118 155 183 140 141 204
491 204 56 92 207 115 95 164 160 113 29 285 194 109 119 266 122 106 196 216 131 124 126 34 158 88 187 33 144 204 191 159 99 28 49
103 49 122 300 169 199 131 148 57 65 100 153 141 83 136 133 115 356 380 41 212 157 74 98 7 106 88
-190H8
##PAGE=	F1=-1519.99
##FIRST=	25169.313707327481097,	5807.6787752999953227,	0
##DATA TABLE=	(F2++(Y..Y)), PROFILE
5808 157 132 80 63 84 20 53 101 57 17 128 241 254 71 124 48 163 160 60 119 52 282 132 303 140 167 133 169 34 140 175
5456 175 209 172 115 32 95 140 70 58 97 37 80 146 155 82 187 185 111 163 151 54 166 85 189 243 181 82 140 124 145 71 199 314 318 221
5056 221 100 213 117 62 10 45 197 189 112 182 76 159 79 68 252 306 75 191 120 271 134 104 200 50 200 209 151 187 175 118
4704 118 168 177 94 54 110 103 192 146 89 131 145 20 105 191 325 141 101 177 305 227 164 136 214 209 179 136 179 118 48 189 270 81 113
4317 113 118 130 119 140 141 30 73 95 25 101 94 185 186 36 141 142 116 208 33 54 120 192 138 187 23 154 80 138 165 167 152 109 160 211 131
3906 131 68 46 50 74 110 137 120 154 84 175 45 78 304 309 81 131 218 47 128 65 82 46 167 252 249 163 280 259 230 110 70 110 185
3519 185 113 233 99 22 93 67 111 224 52 61 196 103 106 123 340 91 35 234 90 164 191 69 32 59 111 191 177 193 138 91 90
3155 90 57 95 52 165 106 152 59 49 137 233 370 261 205 216 93 102 100 188 219 95 94 93 131 89 145 208 105 215 171 143 112 162 260 159
2756 159 104 171 34 66 140 126 147 143 59 280 192 82 96 124 86 22 140 80 100 57 50 37 28 96 146 177 135 126 157 144 136 160 150 112 86
2345 86 123 161 147 37 74 230 211 73 112 96 137 54 83 150 114 88 183 81 150 140 71 55 81 78 104 31 73 158 88 112 140 152 98 155
1946 155 211 176 165 181 31 227 142 74 11 184 260 139 88 135 94 43 85 136 159 96 23 34 96 242 141 81 11 110 98 152 86 128
1570 128 185 129 157 95 182 44 121 133 90 198 223 8 151 163 118 8 38 90 148 50 145 38 66 101 91 217 27 115 50 144 97
1207 97 193 236 164 142 137 48 264 211 186 135 158 65 254 129 130 79 91 118 136 37 23 146 98 81 151 210 308 403 335 79 63 80 169 93
807 93 54 121 134 201 24 353 381 112 133 172 126 172 56 114 128 74 73 27 78 143 98 93 117 150 139 139 189 26 111 166 92 118 123 154 94
397 94 91 329 222 146 107 252 118 157 218 168 117 155 72 48 169 96 164 55 113 166 142 129 92 48 70 89 278 167 161 150 151 61 48
9 48 80 127 137 113 169 194 137 362 312 67 160 167 56 100 37 63 39
-190C9
##PAGE=	F1=-1622.24
##FIRST=	25169.313707327481097,	5807.6787752999953227,	0
##DATA TABLE=	(F2++(Y..Y)), PROFILE
5808 151 154 59 69 97 109 72 151 32 41 170 283 310 151 113 39 152 160 52 100 89 300 149 261 98 180 110 145 59 138 139 153 114
5432 114 112 53 44 115 51 47 71 18 29 110 174 92 199 155 142 155 173 65 154 90 167 231 170 81 118 123 158 104 198 292 252 234 120 210 121
5021 121 58 66 107 237 232 138 197 84 142 116 79 253 326 99 164 121 229 103 99 154 41 164 197 150 249 187 112 214 188 78 51
4657 51 81 71 191 173 124 140 79 61 81 184 249 100 112 170 272 202 178 120 197 201 157 118 195 121 46 131 232 58 56 83 109 97 128
4270 128 117 20 83 108 47 103 126 173 160 39 128 117 154 254 71 62 131 167 144 194 22 104 125 150 106 102 129 138 242 290 181 38 59
3883 59 76 123 62 89 85 132 67 145 65 73 274 268 86 101 181 49 64 137 59 97 208 283 262 94 218 242 234 97 105 107 202 79 190 74
3484 74 6 98 70 119 172 24 94 114 62 57 169 305 39 47 243 80 146 200 142 69 74 163 217 130 202 194 176 87 15 103 24 161 91 176
3085 176 20 42 136 255 410 263 231 185 99 83 108 226 245 126 80 54 144 102 141 214 119 205 183 181 101 199 274 36 99 171 21
2721 21 68 172 132 141 142 26 238 142 121 91 147 56 45 101 62 122 37 92 69 54 134 168 133 118 113 177 145 162 145 207 199 43 37 118 148 69
2298 69 81 217 143 45 48 22 182 71 90 126 56 71 180 106 169 132 54 30 93 44 111 35 86 131 99 73 90 133 101 111 222 185 168
1911 168 206 57 227 130 52 68 205 212 108 99 161 113 49 133 191 173 130 36 73 123 272 159 74 25 159 108 193 146 166 180 96 124
1535 124 106 214 43 88 137 143 246 266 60 129 141 96 45 130 107 117 65 121 12 70 120 129 251 66 103 51 127 53 242 263 137
1171 137 120 154 36 250 213 201 118 167 93 265 137 178 54 81 111 70 67 37 148 140 50 124 200 290 413 369 116 95 104 152 73 58
796 58 74 65 149 33 326 362 105 80 152 131 122 42 124 142 102 86 25 119 117 58 75 101 102 150 132 165 0 137 125 51 138 141 156 75 149 360
373 360 230 148 103 222 121 207 223 115 115 155 65 108 181 87 119 79 79 168 100 119 91 93 97 74 236 144 86 161 146 70 38 111 122 138 142
-38 142 191 246 181 344 224 146 110 173 46 104 76 37 22
-190B2
##PAGE=	F1=-1724.5
##FIRST=	25169.313707327481097,	5807.6787752999953227,	0
##DATA TABLE=	(F2++(Y..Y)), PROFILE
5808 138 163 65 70 130 183 80 193 14 71 197 286 332 214 120 52 120 142 42 66 117 306 152 194 73 183 82 124 76 125 96
5456 96 68 38 110 138 19 91 55 64 30 93 92 67 176 114 189 135 163 138 178 95 131 109 154 202 159 95 107 126 160 122 194 258 184 231 127
5045 127 180 110 66 100 155 266 251 144 203 111 103 122 77 239 326 114 144 116 175 86 101 108 23 113 174 155 283 182 98 247 196 51
4669 51 43 61 106 199 210 151 150 24 105 38 167 164 95 125 153 226 204 201 96 182 187 134 97 203 114 98 83 184 21 20 41 100 69 132 120
4258 120 41 94 139 70 112 148 149 125 37 133 148 193 293 107 64 133 139 154 201 27 41 177 152 49 5 73 167 313 348 209 28 80
3883 80 92 164 44 45 47 105 98 93 76 52 242 224 92 55 164 48 88 200 41 161 243 287 259 20 149 197 203 88 141 94 203 60
3507 60 119 53 27 99 67 149 112 15 118 33 17 24 198 251 66 82 225 72 124 198 210 159 87 206 225 107 195 222 248 150 57 143
3132 143 33 151 76 201 33 74 152 264 395 229 233 151 103 51 105 300 312 151 80 39 152 134 139 250 171 184 169 215 100 491
2779 491 852 328 66 159 6 77 221 150 133 135 32 200 113 148 81 192 47 54 66 54 141 47 103 77 81 172 190 136 138 93 203 145
2404 145 188 125 237 252 12 54 73 150 110 108 198 79 34 22 91 232 106 91 105 16 60 181 125 174 118 64 26 164 47 126 42
2040 42 115 110 136 47 53 101 98 83 222 195 181 224 72 220 111 109 115 197 159 86 96 164 123 47 173 219 180 157 76 107 121 269 171 65
1641 65 40 239 143 229 214 204 152 56 115 118 246 66 61 146 183 263 271 107 91 120 79 94 211 160 87 74 117 11 99 130 176 259 109
1254 109 60 39 105 54 272 266 108 99 179 85 219 209 206 111 182 121 252 146 203 75 61 72 31 101 39 134 166 76 80 179 256 381 368
866 368 154 132 148 137 61 64 54 100 129 39 275 315 93 24 125 129 75 35 138 187 160 89 77 150 72 27 81 132 49 165 115 138 19
479 19 155 112 7 159 222 162 55 198 372 216 112 109 180 133 243 208 60 121 127 65 152 187 64 76 104 57 211 76 136 93
127 93 127 119 87 185 107 29 169 130 78 41 148 130 145 160 197 272 238 304 133 198 71 178 55 104 103 40 52
-190E2
##PAGE=	F1=-1826.76
##FIRST=	25169.313707327481097,	5807.6787752999953227,	0
##DATA TABLE=	(F2++(Y..Y)), PROFILE
5808 123 158 84 78 175 223 64 219 51 92 203 253 317 252 139 85 75 103 42 28 136 304 146 136 83 174 47 115 88 100 51 43
5444 43 78 108 208 75 70 99 112 50 177 168 35 162 147 152 135 172 122 162 120 98 131 151 166 153 113 113 132 147 122 188 217 129 216 119 130
5033 130 86 85 113 187 279 243 127 200 147 57 95 69 216 311 129 128 103 116 99 111 67 6 75 147 163 278 162 71 261 200 23 26 46
4646 46 148 213 250 168 147 81 141 22 145 88 145 134 135 180 228 234 73 167 173 105 71 202 97 138 78 148 23 49 32 99 30 145 138
4258 138 67 99 171 87 120 151 119 90 36 144 199 229 317 132 59 124 114 155 198 50 44 202 149 96 104 54 197 352 373 207 66 101
3883 101 89 175 56 17 17 86 149 49 90 25 220 189 101 27 184 60 164 243 28 222 268 269 245 46 89 141 148 84 168 77 187
3519 187 92 53 84 44 95 62 192 70 64 133 63 28 13 187 189 130 128 182 82 125 183 254 240 102 229 205 142 191 209 281 214 132 202
3132 202 37 138 62 216 58 120 169 258 331 174 214 133 100 19 98 410 411 158 97 67 154 154 140 314 251 161 133 238 121 870
2779 870 1592 708 82 137 25 100 292 222 144 123 59 173 103 163 65 243 67 49 55 66 162 99 81 65 99 192 208 184 177 78 231
2416 231 146 210 112 229 256 37 125 43 142 152 148 179 33 37 53 146 275 149 79 68 77 63 189 142 153 111 89 48 223 94 144 81
2040 81 146 103 166 48 92 80 87 102 203 206 202 234 75 213 83 173 145 156 117 79 98 147 120 47 194 214 187 167 111 126 86 237 170
1653 170 66 52 318 195 263 279 234 103 23 119 111 266 99 44 149 210 244 236 141 33 118 67 135 263 206 78 80 133 29 147
1300 147 130 226 244 146 18 47 97 110 279 246 84 80 193 131 176 195 197 107 194 138 216 158 204 112 31 38 123 122 33 111 173 102 37 146
901 146 207 318 333 176 157 191 133 70 70 87 187 143 26 210 253 82 32 92 117 78 28 148 239 223 93 129 171 25 26 105 178 31
526 31 171 87 115 28 162 139 48 179 306 165 36 236 360 185 57 126 133 148 258 175 10 126 85 62 178 181 46 80 125
185 125 57 254 65 158 82 137 128 115 143 64 100 182 111 86 51 160 141 157 163 189 269 295 255 56 215 55 183 71 100 118 58 67
-190F7
##PAGE=	F1=-1929.02
##FIRST=	25169.313707327481097,	5807.6787752999953227,	0
##DATA TABLE=	(F2++(Y..Y)), PROFILE
5808 113 140 94 104 215 219 31 226 90 103 189 195 270 264 157 116 47 50 52 18 151 299 136 127 108 155 30 121 98 66 7 121 156 111
5420 111 246 114 47 162 173 113 253 228 68 158 186 94 158 177 116 125 130 60 143 154 133 153 128 124 138 119 109 176 174 101 201 105 79 58
5021 58 113 115 206 275 215 100 196 182 33 44 60 186 287 149 111 83 62 132 125 36 24 92 124 160 234 139 38 251 201 22 9 28
4646 28 169 226 283 170 126 145 166 65 125 40 203 137 124 143 256 266 57 149 161 68 41 196 72 161 101 131 61 85 75 102 30
4282 30 157 149 87 101 195 93 120 134 85 66 47 138 232 259 320 144 47 106 95 138 181 89 102 189 149 164 203 138 225 350 360 180 109
3894 109 114 83 154 60 54 3 82 187 62 124 39 215 177 115 68 222 88 225 260 18 264 278 238 229 92 56 106 84 84 181 69 168
3519 168 152 113 141 56 85 61 229 86 115 140 120 69 8 136 129 195 180 124 112 169 155 257 293 122 228 157 208 206 162 277 257 197
3143 197 260 26 123 51 213 70 162 179 239 242 136 189 138 89 37 122 544 517 141 119 104 147 151 142 389 335 144 91 247 158 1240
2779 1240 2322 1104 169 116 34 135 375 330 185 110 73 146 94 169 47 281 91 43 61 95 185 158 31 64 104 189 215 236
2451 236 198 80 254 146 222 112 181 210 62 171 55 124 187 182 165 17 51 77 182 305 190 66 18 130 83 199 170 117
2122 117 135 113 75 238 122 158 126 172 107 174 52 149 96 70 153 172 210 228 235 69 215 50 220 156 89 84 88 123 120 103 56 194 183
1735 183 194 162 124 129 25 180 154 81 60 374 241 300 330 255 52 48 124 87 268 129 51 138 217 191 168 160 39 143 55 157 273
1371 273 229 103 95 161 48 194 121 269 215 174 87 90 107 162 265 207 76 61 183 158 131 174 175 102 198 141 170 173 191 141 18 110 210
984 210 123 38 91 165 103 45 102 144 250 273 176 161 218 139 97 74 127 252 167 11 140 195 86 71 57 97 132 42 148 274 277 111
608 111 180 184 65 36 132 213 65 160 54 102 35 162 177 87 195 359 156 25 262 320 145 102 152 89 159 249 137 39 126 62
256 62 82 186 158 68 118 135 66 269 57 166 44 118 123 144 117 23 158 205 101 89 58 142 153 171 156 177 238 338 211 14 200
-108 200 68 188 80 92 123 77 61
-190F1
##PAGE=	F1=-2031.28
##FIRST=	25169.313707327481097,	5807.6787752999953227,	0
##DATA TABLE=	(F2++(Y..Y)), PROFILE
5808 110 112 85 139 234 175 40 214 123 106 164 136 203 252 173 131 74 21 67 42 164 288 129 150 127 128 69 133 108 51 34 169 206 127
5420 127 246 135 23 226 230 170 307 266 123 189 226 53 192 183 128 83 126 32 140 152 111 160 134 120 137 83 94 160 134 96 191
5056 191 103 90 45 146 111 211 252 174 79 201 206 60 17 49 150 259 169 89 56 25 165 137 21 35 131 107 140 163 127 38 219
4693 219 200 50 50 33 166 236 299 152 94 193 182 96 111 37 243 129 120 122 275 287 49 125 152 28 18 184 42 167 118 127 83
4329 83 119 114 106 92 160 149 97 103 204 85 110 100 50 57 65 109 236 278 302 151 30 86 88 105 160 135 143 139 150 201 271 226 243 308 317 149 145
3894 145 117 87 114 61 108 18 93 203 90 175 73 224 184 129 109 253 121 253 246 21 276 274 206 214 111 62 107 38 87 179 85
3531 85 171 213 206 187 67 75 65 246 129 159 144 152 97 12 62 81 251 229 63 152 233 119 217 309 146 206 94 273 238 102 253
3167 253 271 235 295 21 106 45 193 68 189 179 208 155 143 179 151 71 69 182 674 603 102 142 136 138 122 142 450 398 138 64 241
2803 241 193 1521 2886 1432 261 113 25 174 449 432 239 93 69 106 77 165 49 292 107 62 62 130 210 211 37 104 95 168
2474 168 206 267 181 94 263 142 218 124 99 125 74 189 78 104 205 195 156 27 72 103 213 318 215 81 88 171 111 205 207 95
2122 95 191 132 104 206 121 159 152 185 112 163 45 190 126 52 210 160 204 250 226 67 231 16 242 151 55 57 110 154 94 76 72 174
1746 174 145 194 153 106 123 54 111 125 100 66 395 266 337 357 271 71 87 128 67 254 151 80 120 204 115 80 166 116 179 44 153
1383 153 242 230 142 127 188 61 225 105 297 178 191 155 132 119 191 237 158 87 43 149 160 100 151 144 99 191 133 129 190 180 157 61 194
995 194 268 105 60 83 151 82 76 61 81 215 202 156 146 225 143 128 71 156 278 186 50 78 162 106 91 24 80 195 79 134 280 311
620 311 144 224 192 122 45 155 232 96 132 43 99 41 163 203 110 203 369 132 27 275 254 109 208 182 59 163 221 106 74
279 74 120 94 122 178 119 115 152 128 68 250 60 152 26 76 110 174 112 13 178 229 103 87 59 99 166 181 143 173 192 358 186 23
-96 23 160 105 194 77 82 122 91 41
-190D1
##PAGE=	F1=-2133.53
##FIRST=	25169.313707327481097,	5807.6787752999953227,	0
##DATA TABLE=	(F2++(Y..Y)), PROFILE
5808 107 75 57 167 227 107 87 191 149 107 134 110 137 221 190 127 104 62 79 54 171 262 133 166 133 101 120 143 116 86 76 176 217
5432 217 155 222 145 45 272 270 206 327 278 171 241 258 93 227 194 156 72 111 44 126 136 103 167 124 93 123 48 89 137 100 92 183 125
5045 125 155 52 176 105 204 213 131 77 217 219 97 69 43 109 225 180 67 28 24 185 141 26 33 154 98 105 84 129 78 172 204 90
4669 90 107 74 144 241 293 111 62 219 191 108 104 38 254 113 117 112 281 288 45 92 143 21 33 170 9 156 121 127 80 148 139 109 157
4282 157 148 141 97 108 195 60 88 64 18 56 81 82 219 281 263 160 18 87 93 70 148 177 159 65 140 195 300 291 244 243 256 157 173 116 99
3871 99 80 89 164 40 118 202 103 225 100 234 186 130 131 266 146 244 202 42 256 259 180 203 104 85 115 35 89 164 117 201 263 272 205
3484 205 88 69 74 234 164 186 147 156 106 30 48 57 291 267 49 189 293 84 142 285 171 176 75 323 269 49 223 257 237 290
3132 290 20 87 50 160 55 196 169 171 92 167 192 155 50 96 244 759 648 49 168 163 133 75 135 474 420 146 71 223 209
2791 209 1657 3159 1617 330 133 12 204 495 496 287 71 51 51 66 151 79 273 113 98 56 159 228 251 104 153 83 141
2474 141 176 267 126 112 248 134 196 144 11 24 69 185 90 90 202 182 150 53 92 141 251 311 218 123 180 203 132 202 244 110 253
2110 253 141 127 141 107 146 143 178 115 141 31 203 143 37 260 194 187 259 209 78 251 15 233 146 136 76 137 166 75 48 78 143
1746 143 119 175 153 59 116 127 49 93 114 74 377 269 372 354 280 130 120 134 81 227 161 119 126 169 32 9 159 181 207 40 124
1383 124 182 215 176 170 202 61 231 85 304 141 195 203 157 123 193 205 108 103 35 100 144 100 140 113 97 174 125 105 204 183 156 111 254
995 254 284 74 88 89 137 50 87 51 79 224 138 124 116 214 135 149 57 171 261 194 96 33 159 130 91 37 86 248 117 110 253 318 182
608 182 255 194 163 55 174 240 118 102 78 97 42 160 207 117 199 336 92 40 273 173 84 306 205 53 162 179 88 94 109 141
256 141 163 156 65 167 171 105 61 205 89 116 109 49 98 204 129 46 161 242 111 78 52 58 171 181 132 185 146 352 174 13 111 151
-120 151 196 66 73 120 95 29
-190B9
##PAGE=	F1=-2235.79
##FIRST=	25169.313707327481097,	5807.6787752999953227,	0
##DATA TABLE=	(F2++(Y..Y)), PROFILE
5808 97 32 42 178 196 39 122 167 169 110 104 128 99 181 209 110 115 85 82 53 169 214 143 163 128 85 168 145 118 132 114 142 195 189 200 151 88
5385 88 286 283 214 311 264 203 280 275 142 251 208 191 100 87 72 119 105 106 169 96 44 91 39 96 110 72 74 168 155 219 58 195 94 185
4986 185 165 98 102 244 228 132 106 51 65 183 172 53 7 35 189 134 41 40 153 98 63 40 135 118 126 215 139 170 123 113 239 258 47
4599 47 41 222 195 112 99 27 235 94 115 105 274 266 42 57 132 51 53 158 26 126 116 129 52 167 150 107 215 118 126 88 111 172
4223 172 23 50 53 21 54 91 113 203 263 208 176 31 118 109 59 146 209 155 18 112 151 292 321 232 184 195 205 196 122 106 79 135 215 71
3824 71 151 195 103 259 111 228 167 110 131 259 154 207 132 72 212 238 164 198 79 114 105 32 87 143 146 236 290 294 185 126 70 84 192
3437 192 180 191 148 138 98 46 113 64 309 286 90 212 331 65 54 228 191 159 128 348 283 18 204 222 206 246 31 69 61 126
3085 126 33 182 156 137 50 173 209 145 44 120 278 768 638 11 198 180 136 26 121 449 394 164 87 198 198 1623 3079
2768 3079 1616 363 158 34 214 501 510 320 40 47 29 79 127 115 229 112 136 59 173 239 274 156 184 87 118 130 237 57
2439 57 130 207 122 159 170 113 66 50 173 92 88 178 146 148 93 106 188 290 281 197 164 257 228 139 188 267 130 294 137 136 63 105 121 94 149
2028 149 118 122 21 189 135 29 296 255 161 248 183 94 261 36 194 161 222 140 156 153 59 26 66 110 116 131 158 15 113 178 58 76
1653 76 113 88 325 264 395 322 278 177 145 143 111 197 159 164 174 131 39 81 140 219 213 47 74 128 195 197 211 204 50 211 62 290 109
1265 109 184 224 158 124 171 183 66 113 40 49 122 126 154 91 90 156 132 89 211 196 143 160 273 255 41 114 106 127 46 68 73 139 244 90
866 90 91 83 190 111 150 31 169 208 191 136 13 171 150 78 79 116 285 143 81 198 299 214 268 183 180 69 188 250 133 97 124 91
491 91 33 143 186 108 184 274 45 54 256 98 71 371 216 61 161 133 81 99 95 181 194 123 14 219 177 72 49 163 133 68 194
127 194 82 95 234 167 82 120 234 116 67 42 74 161 171 129 211 114 321 166 29 66 190 189 53 64 121 91 46
-190D6
##PAGE=	F1=-2338.05
##FIRST=	25169.313707327481097,	5807.6787752999953227,	0
##DATA TABLE=	(F2++(Y..Y)), PROFILE
5808 78 15 90 173 151 23 137 149 183 113 77 153 104 147 225 97 104 78 69 42 157 145 152 148 113 86 209 136 110 165 144 83 153 215 198 151
5397 151 127 261 267 196 261 227 211 283 272 164 258 221 216 121 58 96 136 81 113 163 54 29 44 61 105 80 48 41 143 179 264 55 195
5010 195 72 155 122 86 148 280 241 158 121 59 40 135 143 55 24 39 178 118 60 78 140 104 28 74 135 146 105 223 183 226 167 83 229
4622 229 197 36 40 206 197 127 91 25 192 87 117 92 259 223 38 70 120 72 64 153 59 79 110 133 6 172 150 97 254 77 108
4258 108 73 103 149 30 5 71 36 47 98 178 211 227 142 195 46 160 135 88 145 227 142 80 67 94 266 316 218 158 144 255 216 140
3883 140 103 93 176 250 106 175 198 103 270 107 199 119 68 108 232 140 160 50 103 159 214 154 199 53 151 88 7 82 123 165 252 291
3507 291 266 130 175 79 91 133 172 174 143 108 78 59 155 78 302 281 121 215 334 66 56 150 196 170 181 343 271 12 199 178 162
3143 162 197 81 61 70 100 32 158 147 114 17 152 209 124 70 139 269 686 572 48 225 181 142 41 101 378 333 182 94 171 166
2791 166 1434 2667 1428 358 171 57 200 468 472 335 2 67 79 97 97 144 172 106 170 81 167 242 277 183 187 112 103 83 189
2451 189 85 150 147 108 118 199 210 127 22 164 87 94 144 98 154 136 109 232 314 229 159 188 301 243 129 167 273 126 297 117 123
2087 123 29 126 103 31 117 123 120 24 153 100 26 315 308 130 215 150 106 248 50 134 200 278 205 167 131 49 22 32 84 127 68 149 85 112
1688 112 195 109 80 96 105 249 270 401 266 256 198 165 158 135 170 146 208 237 123 88 125 115 224 193 56 15 136 177 199 236 203 45
1312 45 175 35 262 98 156 217 140 133 136 176 41 111 53 48 110 156 187 84 71 149 154 65 210 205 125 200 249 189 29 132 129 120 85 27
913 27 92 198 246 58 69 70 164 75 128 39 153 131 176 165 7 184 163 72 122 152 302 148 65 128 258 231 258 158 176 90 195
549 195 267 145 120 165 78 55 103 139 92 163 202 43 59 225 86 57 389 208 65 161 96 80 90 76 211 215 80 76 269 174 48
185 48 35 158 176 23 259 122 100 258 212 123 71 202 113 58 46 114 134 155 134 240 103 276 161 83 43 203 169 43 56 122
-167 122 82 66
-190F6
##PAGE=	F1=-2440.31
##FIRST=	25169.313707327481097,	5807.6787752999953227,	0
##DATA TABLE=	(F2++(Y..Y)), PROFILE
5808 54 61 147 158 102 47 134 139 191 111 60 164 118 132 228 102 83 45 41 20 137 71 149 122 92 96 239 122 90 172 159 25 104 222 206
5409 206 141 154 203 239 167 188 174 195 244 247 155 249 227 220 116 28 120 172 103 119 152 17 82 30 86 109 57 46 23 119 189 281 53 177
5010 177 38 115 105 88 201 316 260 171 117 52 67 81 99 69 35 39 155 97 80 129 143 114 31 103 125 162 109 216 212 264 198 62 209
4622 209 123 129 56 180 191 163 72 40 139 100 130 77 236 164 36 129 112 80 63 153 86 35 106 131 48 163 146 78 268 54 96 56
4247 56 80 143 83 64 89 34 42 105 236 237 178 74 208 53 194 167 130 134 235 127 117 31 87 240 280 212 157 109 281 234 161 97
3871 97 104 198 264 144 180 221 111 258 99 151 46 13 69 187 105 127 45 128 118 191 143 205 59 190 101 39 76 110 170 243 264 192
3495 192 63 224 98 94 85 142 140 134 92 57 72 161 83 275 250 125 197 300 73 120 66 182 197 208 307 232 27 195 145 143 206 138
3120 138 70 72 90 73 131 143 112 41 103 180 98 112 153 221 524 462 69 239 159 139 83 84 282 264 190 91 144 133 1140 2018 1101 323
2744 323 168 68 164 404 397 335 49 79 115 97 70 162 120 103 198 110 147 245 261 181 160 142 94 84 146 162 167 79 96 99 223 281 149
2357 149 23 155 81 100 115 70 168 173 102 261 310 161 118 188 300 240 106 146 265 91 257 81 89 108 161 111 94 126 135 146 45
1993 45 113 52 24 314 337 98 163 115 112 210 67 73 245 292 253 179 132 64 35 30 69 139 17 111 150 109 173 153 95 64 122 163 287 383
1594 383 198 212 192 182 180 148 152 127 245 286 151 106 137 99 208 151 61 46 194 163 183 237 208 62 138 20 232 123 119 188 117 152
1218 152 98 179 35 98 73 101 118 178 223 85 39 162 182 28 203 202 118 227 195 106 49 141 147 115 134 44 96 234 224 27 65 78
843 78 144 33 89 91 124 54 148 176 7 191 170 94 159 184 302 134 79 59 206 232 227 120 174 122 193 283 151 140 195 58 121 53
467 53 73 79 144 147 92 48 188 128 32 357 187 60 161 87 76 72 51 230 229 34 144 311 168 50 25 186 207 32 290 142
115 142 110 267 250 166 36 154 96 50 74 139 98 142 143 259 105 226 167 143 40 178 132 40 46 121 76 77
-190G7
##PAGE=	F1=-2542.56
##FIRST=	25169.313707327481097,	5807.6787752999953227,	0
##DATA TABLE=	(F2++(Y..Y)), PROFILE
5808 32 99 186 143 56 54 127 132 191 103 56 158 116 133 212 120 63 22 30 18 122 85 130 81 68 102 256 110 61 150 157 39 56 202 195 118
5397 118 165 134 222 153 106 121 168 171 201 127 228 223 201 87 33 148 207 154 116 140 42 116 85 115 107 63 74 60 115 183 270 65 151 7
4998 7 76 120 88 243 338 272 167 100 26 106 25 52 96 33 38 120 71 99 176 172 121 57 109 110 166 114 193 221 274 212 63 177 99 218 77
4587 77 157 172 208 36 51 98 118 149 78 203 103 46 187 113 73 53 151 101 64 104 112 92 140 144 52 252 79 108 41 40 154 133 126 103
4188 103 25 59 114 269 259 127 20 210 52 215 203 177 120 233 109 126 60 128 221 223 210 147 93 273 251 180 93 112 197 255 177
3824 177 163 265 130 232 106 95 60 45 30 129 58 117 111 137 99 169 124 210 86 220 144 92 73 109 163 213 215 95 90 261 124 93
3448 93 97 96 96 122 106 42 88 137 73 236 195 100 162 233 74 155 31 148 222 208 246 176 61 172 136 167 256 173 87 67 101 128 105 146
3049 146 128 85 36 125 77 154 157 154 317 330 69 231 114 120 118 84 185 228 181 82 121 121 808 1274 715 272 150 66 118 324 303 321
2674 321 107 63 129 73 58 165 91 107 218 139 133 250 228 163 112 166 90 142 146 214 175 33 87 124 237 320 133 48 138 73 100 109 94
2286 94 185 197 88 267 276 97 92 161 253 217 81 131 251 36 180 36 45 191 203 139 177 178 155 195 84 91 54 27 292 333 68 98
1911 98 85 114 156 94 66 280 262 276 199 159 91 55 93 61 141 76 39 196 101 122 183 114 25 135 79 297 343 134 150 165 197 208 152
1523 152 145 104 270 306 176 94 121 111 196 102 63 94 249 151 153 211 218 91 126 65 214 171 96 146 106 171 68 179 46 77 103 154
1148 154 139 190 249 91 18 188 208 22 196 187 125 238 143 38 75 145 152 109 177 99 88 241 187 13 72 90 136 33 64 144 90
784 90 71 108 168 28 190 173 128 181 207 288 108 104 32 153 218 177 76 202 164 177 283 148 140 210 39 201 91 31 86 135 124
420 124 137 21 154 165 16 284 163 63 155 108 64 50 21 243 238 38 199 339 164 55 39 217 219 51 281 146 116 255
92 255 270 203 45 101 59 60 117 142 67 138 148 258 112 181 186 198 34 114 80 47 37 115 73 78
-190G8
##PAGE=	F1=-2644.82
##FIRST=	25169.313707327481097,	5807.6787752999953227,	0
##DATA TABLE=	(F2++(Y..Y)), PROFILE
5808 14 121 194 132 15 59 135 128 184 101 58 136 95 137 176 139 58 73 74 67 125 166 97 25 50 101 256 107 34 105 139 63 15 155 155 87
5397 87 157 86 233 171 28 97 157 79 138 108 205 208 165 53 75 180 230 203 99 138 67 115 129 149 102 89 106 95 133 165 233 86 142
5010 142 55 60 145 79 260 333 266 145 81 28 133 32 39 132 18 39 77 52 112 206 207 119 82 98 102 160 108 169 220 253 212 90 136 168
4610 168 290 94 148 139 248 15 56 100 128 167 106 158 63 65 221 121 53 42 136 101 113 100 72 116 104 146 37 209 104 142 30
4247 30 12 162 176 176 123 61 95 123 272 262 87 55 196 52 224 240 222 125 228 81 111 91 152 200 158 201 112 95 235 264 195
3883 195 94 116 175 226 200 131 321 158 203 130 45 153 93 54 62 40 111 149 124 89 151 90 211 107 230 180 141 80 120 149 177 153
3507 153 72 173 279 144 90 141 46 59 110 126 39 102 97 46 193 129 53 121 145 68 156 86 102 237 190 173 117 99 123 136 199 284 169
3120 169 102 57 128 186 77 158 151 119 33 57 61 186 146 111 113 203 54 198 65 89 145 102 114 231 154 73 101 119 502 587 385 218
2744 218 124 54 82 246 212 293 170 20 133 37 74 152 91 120 233 169 150 256 182 158 56 183 100 210 185 229 169 56 80 173
2392 173 236 322 94 63 111 63 92 121 137 199 205 72 252 219 80 85 118 172 173 68 117 233 29 85 48 26 266 247 161 232 233 180 254
2005 254 134 101 106 39 251 296 43 32 59 115 97 124 107 295 199 271 220 176 111 83 157 52 129 123 56 221 97 64 201 131 10
1641 10 143 15 280 287 91 80 129 213 238 148 146 83 277 291 174 60 89 138 209 68 68 120 279 139 118 163 225 120 145 128 212
1277 212 225 123 99 119 182 50 166 67 53 135 194 165 193 264 104 58 214 229 65 196 167 138 235 140 55 107 160 140 98 204 138
913 138 75 218 145 48 84 104 147 78 86 183 59 142 75 143 51 178 175 153 182 217 268 87 121 68 111 195 116 33 257 206 149 255 131
526 131 118 211 25 272 181 112 120 141 122 170 38 128 182 57 187 159 99 141 139 50 34 28 252 242 87 231 342 164 49 77 233
162 233 211 49 240 148 111 218 269 228 71 58 4 105 160 125 56 140 142 235 123 143 211 240 28 20 38 61 32 101 66 75
-190G5
##PAGE=	F1=-2747.08
##FIRST=	25169.313707327481097,	5807.6787752999953227,	0
##DATA TABLE=	(F2++(Y..Y)), PROFILE
5808 3 124 170 122 22 79 168 124 177 123 62 99 71 136 135 155 71 125 120 125 145 236 62 44 41 92 237 112 30 69 109 65 33 94 91 63 131
5385 131 73 254 204 32 115 173 16 66 121 186 179 128 67 124 209 235 233 68 145 69 80 148 187 95 109 125 114 149 137 176 102 167 95 81
4986 81 161 61 247 289 234 106 69 73 139 94 62 174 19 40 35 70 116 215 225 104 106 84 117 144 94 171 228 208 201 131 89 252 334 98
4587 98 148 96 276 68 64 139 125 180 140 101 72 84 220 127 22 34 105 86 140 92 34 119 63 147 59 151 103 179 29 65 148 208 207 157
$$ [...]
-190A90
##END NTUPLES=	nD NMR SPECTRUM
##END=	
##END=	
