##TITLE=	m3WAEYS0SN2AoopBhzLM7Q.52.ser
TM-VI-167 hmqc

##JCAMP-DX=	6.0	$$ MestReNova 14.3.1-31739
##DATA TYPE=	LINK
##BLOCK_ID=	1
##BLOCKS=	2    
##ORIGIN=	Mestrelab Research S.L.
##OWNER=	hrzepa
##$MNOVA/LINK_BLOCK_TYPE=	ITEM	$$ NMR Spectrum
##$MNOVA/ITEM/POLYGON=	(XY..XY)
5321,5835
8722,5835
8722,8208
5321,8208
5321,5835
##$MNOVA/ITEM/Z=	0
##$MNOVA/ITEM/ANGLE=	0
##TITLE=	m3WAEYS0SN2AoopBhzLM7Q.52.ser
##JCAMP-DX=	6.0	$$ MestReNova 14.3.1-31739
##BLOCK_ID=	2
##DATA TYPE=	MNOVA NMR VIEW DATA
##DATA CLASS=	MNOVA VIEW DATA
##$MNOVA/2D/THRESHOLD=	4.2814621925354003906
##$MNOVA/ITEM/ZOOM/X=	-0.98001264966690615488,	11.003459999979801509
##$MNOVA/ITEM/ZOOM/Y=	-9.7479769829748601495,	190.10579999390242278
##END=	
##TITLE=	m3WAEYS0SN2AoopBhzLM7Q.52.ser
##JCAMP-DX=	6.0	$$ MestReNova 14.3.1-31739
##BLOCK_ID=	3
##DATA TYPE=	nD NMR SPECTRUM
##DATA CLASS=	NTUPLES
##NUMDIM=	2
##ORIGIN=	Bruker BioSpin GmbH
##OWNER=	nmr
##.OBSERVE FREQUENCY=	400.41200205000001233
##.OBSERVE NUCLEUS=	^1H
##.SOLVENT NAME=	CDCl3
##.PULSE SEQUENCE=	hmqcgpqf
##LONGDATE=	2021/11/16 18:32:26.000
##.ACQUISITIONMODE=	SIMULTANEOUS (DQD)
##$ORIGINAL FORMAT=	Bruker XWIN-NMR
##$MNOVA/SCALES_VERSION=	9
##$PARAMETER FILE=	(acqu2s, ASCII, /private/var/folders/f6/rjf_tdyn2v98c5c0wvkgn4s80000gn/T/m3WAEYS0SN2AoopBhzLM7Q/52/acqu2s, 0)
$$ ##TITLE= Parameter file, TOPSPIN		Version 3.2
$$ ##JCAMPDX= 5.0
$$ ##DATATYPE= Parameter Values
$$ ##NPOINTS= 129	$$ modification sequence number
$$ ##ORIGIN= Bruker BioSpin GmbH
$$ ##OWNER= nmr
$$ $$ 2021-11-16 18:41:56.345 +0000  nmr@CZC10666PP
$$ $$ /opt/topspin/data/agmb/nmr/Nov16-2021/52/acqu2s
$$ $$ process /opt/topspin3.2/prog/mod/go
$$ ##$ACQT0= 0
$$ ##$BF1= 100.683175
$$ ##$FnMODE= 1
$$ ##$NUC1= <13C>
$$ ##$NusJSP= 0
$$ ##$NusT2= 1
$$ ##$NusTD= 128
$$ ##$O1= 9059.81359838393
$$ ##$SFO1= 100.692234813598
$$ ##$SW= 200.226863172749
$$ ##$SW_h= 20161.2903225806
$$ ##$TD= 128
$$ ##END=
$$ 
##$PARAMETER FILE=	(acqus, ASCII, /private/var/folders/f6/rjf_tdyn2v98c5c0wvkgn4s80000gn/T/m3WAEYS0SN2AoopBhzLM7Q/52/acqus, 0)
$$ ##TITLE= Parameter file, TOPSPIN		Version 3.2
$$ ##JCAMPDX= 5.0
$$ ##DATATYPE= Parameter Values
$$ ##NPOINTS= 12	$$ modification sequence number
$$ ##ORIGIN= Bruker BioSpin GmbH
$$ ##OWNER= nmr
$$ $$ 2021-11-16 18:42:00.897 +0000  nmr@CZC10666PP
$$ $$ /opt/topspin/data/agmb/nmr/Nov16-2021/52/acqus
$$ $$ process /opt/topspin3.2/prog/mod/shimcntl
$$ ##$ACQT0= 1000000
$$ ##$AMP= (0..31)
$$ 100 100 100 100 100 100 100 100 100 100 100 100 100 100 100 100 100 100
$$ 100 100 100 100 100 100 100 100 100 100 100 100 100 100
$$ ##$AMPCOIL= (0..19)
$$ 0 0 0 0 0 0 0 0 0 0 0 0 0 0 0 0 0 0 0 0
$$ ##$ANAVPT= -1
$$ ##$AQSEQ= 0
$$ ##$AQ_mod= 3
$$ ##$AUNM= <au_zg>
$$ ##$AUTOPOS= <53 >
$$ ##$BF1= 400.41
$$ ##$BF2= 100.683175
$$ ##$BF3= 400.41
$$ ##$BF4= 400.41
$$ ##$BF5= 400.41
$$ ##$BF6= 400.41
$$ ##$BF7= 400.41
$$ ##$BF8= 400.41
$$ ##$BYTORDA= 0
$$ ##$CAGPARS= (0..11)
$$ 0 0 0 0 0 0 0 0 0 0 0 0
$$ ##$CFDGTYP= 0
$$ ##$CFRGTYP= 9
$$ ##$CHEMSTR= <none>
$$ [...]
$$ 0 0 0 0
$$ ##$ShimPowMaxUC= (0..63)
$$ 130000 130000 130000 130000 130000 130000 130000 130000 130000 130000 130000
$$ 130000 130000 130000 130000 130000 130000 130000 130000 130000 0 0 0 0
$$ 0 0 0 0 0 0 0 0 0 0 0 0 0 0 0 0 0 0 0 0 0 0 0 0 0 0 0 0 0 0 0 0 0 0 0 0
$$ 0 0 0 0
$$ ##$ShimPowMaxUG= (0..63)
$$ 524287 524287 524287 524287 524287 524287 524287 524287 524287 524287 524287
$$ 524287 524287 524287 524287 524287 524287 524287 524287 524287 0 0 0 0
$$ 0 0 0 0 0 0 0 0 0 0 0 0 0 0 0 0 0 0 0 0 0 0 0 0 0 0 0 0 0 0 0 0 0 0 0 0
$$ 0 0 0 0
$$ ##$ShimPowRcbType= 3
$$ ##$ShimPowRes= (0..63)
$$ 1e-20 1e-20 1e-20 1e-20 1e-20 1e-20 1e-20 1e-20 1e-20 1e-20 1e-20 1e-20
$$ 1e-20 1e-20 1e-20 1e-20 1e-20 1e-20 1e-20 1e-20 0 0 0 0 0 0 0 0 0 0 0 0
$$ 0 0 0 0 0 0 0 0 0 0 0 0 0 0 0 0 0 0 0 0 0 0 0 0 0 0 0 0 0 0 0 0
$$ ##$ShimPowRng0= (0..63)
$$ 1 1 1 1 1 1 1 1 1 1 1 1 1 1 1 1 1 1 1 1 0 0 0 0 0 0 0 0 0 0 0 0 0 0 0 0
$$ 0 0 0 0 0 0 0 0 0 0 0 0 0 0 0 0 0 0 0 0 0 0 0 0 0 0 0 0
$$ ##$ShimPowRng1= (0..63)
$$ 1 1 1 1 1 1 1 1 1 1 1 1 1 1 1 1 1 1 1 1 0 0 0 0 0 0 0 0 0 0 0 0 0 0 0 0
$$ 0 0 0 0 0 0 0 0 0 0 0 0 0 0 0 0 0 0 0 0 0 0 0 0 0 0 0 0
$$ ##$ShimPowRng2= (0..63)
$$ 1 1 1 1 1 1 1 1 1 1 1 1 1 1 1 1 1 1 1 1 0 0 0 0 0 0 0 0 0 0 0 0 0 0 0 0
$$ 0 0 0 0 0 0 0 0 0 0 0 0 0 0 0 0 0 0 0 0 0 0 0 0 0 0 0 0
$$ ##$ShimPowRng3= (0..63)
$$ 1 1 1 1 1 1 1 1 1 1 1 1 1 1 1 1 1 1 1 1 0 0 0 0 0 0 0 0 0 0 0 0 0 0 0 0
$$ 0 0 0 0 0 0 0 0 0 0 0 0 0 0 0 0 0 0 0 0 0 0 0 0 0 0 0 0
$$ ##$ShimSysFunc= (0..63)
$$ 1 2 3 4 5 7 9 11 15 16 8 10 12 14 6 17 13 18 19 20 0 0 0 0 0 0 0 0 0 0
$$ 0 0 0 0 0 0 0 0 0 0 0 0 0 0 0 0 0 0 0 0 0 0 0 0 0 0 0 0 0 0 0 0 0 0
$$ ##$ShimSysMatrix= 0
$$ ##$ShimSysType= 1
$$ ##$TFXNUM= 0
$$ ##$TRIPLO2= 0
$$ ##$VTU= 2
$$ ##$VTUETH= <149.236.99.20>
$$ ##$VTUTY= <no>
$$ ##$WBREFAM= (0..15)
$$ 135 116 100 100 100 100 100 100 100 100 100 100 100 100 100 100
$$ ##$WBREFLM= (0..15)
$$ 0 0 0 0 0 0 0 0 0 0 0 0 0 0 0 0
$$ ##$WBREFPH= (0..15)
$$ 71.66 -68.25 0 0 0 0 0 0 0 0 0 0 0 0 0 0
$$ ##$WBSGU= (0..15)
$$ 0 0 0 0 0 0 0 0 0 0 0 0 0 0 0 0
$$ ##$XFAC= 2
$$ ##END=
$$ 
##$DECIM=	4160
##$DSPFVS=	20
##.ACQUISITIONSCHEME=	NOT PHASESENSITIVE
##NTUPLES=	nD NMR SPECTRUM
##VAR_NAME=	FREQUENCY1,	FREQUENCY2,	SPECTRUM
##SYMBOL=	F1,	F2,	Y
##.NUCLEUS=	13C,	1H
##.OBSERVE FREQUENCY=	100.69223481359800587,	400.41200205000001233
##VAR_TYPE=	INDEPENDENT,	INDEPENDENT,	DEPENDENT
##VAR_FORM=	AFFN,	AFFN,	ASDF
##VAR_DIM=	512,	512,	262144
##UNITS=	HZ,	HZ,	ARBITRARY UNITS
##FIRST=	19140.455529915001534,	4405.895418600002813,	0.059463270008563995361
##LAST=	-981.45727250430979893,	-392.40686505384644533,	0.25263112783432006836
##MIN=	-981.45727250430979893,	-392.40686505384644533,	0.0014845617115497589111
##MAX=	19140.455529915001534,	4405.895418600002813,	52.312564849853515625
##FACTOR=	1,	1,	0.0028777386274389128024
##PAGE=	F1=19140.5
##FIRST=	19140.455529915001534,	4405.895418600002813,	0.059463270008563995361
##DATA TABLE=	(F2++(Y..Y)), PROFILE
$$ [...]
##PAGE=	F1=-6218.67
##FIRST=	19140.455529915001534,	4405.895418600002813,	0
##DATA TABLE=	(F2++(Y..Y)), PROFILE
1063D6J13n2r0Q7l8P0M3N4n3m5j3m9L5l9J29k2n3pJ8l2L3L7L4j3l0l1nK3oo3MJ9L8n7k2m5
$$ 46 159 107 17 104 66 136 179 233 180 135 122 73 108 69 198 176 123 116 134 102 135 172 206 193 163 132 127 150 144 81 85 104 142 85 63 18
725A8oRO6j9K7o7J23lJ1n3P2l2o9M5p9N2mR8p5j0N8n2O6pj35N4j6lN7l7K8j4l7K0m8j7K67
$$ 18 12 21 87 68 95 28 151 148 159 106 178 146 77 122 43 95 91 189 114 104 162 110 176 169 34 88 72 69 126 89 117 103 66 86 38 21 288
378B88J2j89o3N5KR1l1q8qJ08k3O0O6j77Pp1J65k0J28n3j67K1J5No9K5K5N8j29Q0O3p3Rk1
$$ 288 300 111 48 103 105 196 165 77 69 177 154 214 280 103 110 39 204 184 312 259 92 113 128 133 64 89 114 172 43 123 186 113 122 101
58A01pj2J26r7l3k4M5LL5m1o0O3q6R2l8N0QJ00K6j46LJ02j1p9p3Q5J27K4r3q4J40L4r9n9O5
$$ 101 94 82 208 111 78 54 99 102 137 96 36 99 13 105 67 117 125 225 251 105 108 210 199 120 47 132 259 283 190 106 246 280 181 122 187
-270A87q4PqN8M1k5L1m8j13J07k3r0M
$$ 187 103 110 102 160 201 176 207 159 46 153 130 40 44
-392D4
##PAGE=	F1=-6297.42
##FIRST=	19140.455529915001534,	4405.895418600002813,	0
##DATA TABLE=	(F2++(Y..Y)), PROFILE
4406A12N2mq0M2qn1P8m0l3N1n0P2J30n8o9O7k4m2j35J73p4k4k5ol3M3N2k9K2M9j3J33l3o1
$$ 112 164 160 80 122 114 63 141 101 68 119 69 141 271 213 144 211 187 145 10 183 109 85 60 54 21 64 116 87 109 158 145 278 245 184
4087A84j08MO9L7j62J31N0o5q7J50Jj23J36q4J07m9j55J8J27N3n6k9m2N7Pj2J8m7Ql8K9n4
$$ 184 76 80 149 186 24 155 205 140 53 203 204 81 217 133 240 191 36 54 181 234 178 149 107 164 171 159 177 130 138 100 129 75
3786G5N8o3J27p0O4J37J0p6j80j2R9k9j1J5lm7N8J5l3j6J57k1J5j06q9K6J20j18oR4j24J35
$$ 75 133 70 197 127 191 328 338 262 82 70 169 140 129 144 141 94 152 167 134 118 275 254 269 163 74 100 220 102 96 190 66 201
3486B01o6M5j34MJ54jj06K4N0j28kK29N1k23kL4J12j79P0m4J61N7k07Pm8k4R6l0MP3K8j22
$$ 201 135 180 46 50 204 203 97 121 171 43 41 270 321 98 96 130 242 63 133 89 250 307 100 107 59 35 131 101 105 178 206 84
3185H4P0q6jL7j7J63k7n1m7jN7Lj41J03rJ35k18J29J23k00O1n5k0m0K32k2j88O3k6n8M0j1
$$ 84 154 68 67 104 87 250 223 172 125 124 181 184 43 146 137 272 54 183 306 106 167 112 92 52 284 262 74 137 111 53 93 82
2885H2R4P9k1j38qQ6p9R7N6k23K24j31k2p2P6m9O5pP0M2j31J54p5m8k3N8K3km7n3k3lQJ35
$$ 82 176 255 234 96 88 174 95 192 248 25 249 118 96 24 100 51 116 109 179 221 90 244 169 121 98 156 179 177 130 77 54 51 59 194
2565A94l0K2k5o4P6%Rqrjk2N0j4n5N8k4QK5j21K1n1K5J45rl1n4o9P7l8j8K3q4J14K4q1K3J4
$$ 194 164 186 161 97 173 173 182 174 165 164 142 192 178 123 181 157 165 190 69 90 39 64 209 200 169 115 46 123 85 67 90 6 120 144 63 86 100
2218A00J11q8q3l5N6l1k4J31r4M0L7l6K2N8K37M05m65j39l9p0L3nJ18k05J37L2j2p4O1o2J49
$$ 100 211 123 40 5 61 30 6 137 43 83 120 84 106 164 401 806 341 202 163 93 126 121 239 34 171 203 191 117 178 116 265
1927B65j3q9m6o9k7J6M6Q1P0n9L7k7Ro0L1L0j70J35j11J73n3j13J64j19J78p8l6j38QM8RJ03
$$ 265 252 163 117 48 21 37 83 164 234 175 212 185 194 134 165 195 25 160 49 222 169 56 220 101 279 201 165 27 35 83 92 195
1626A95J8j8q1rNQ6j31K37kQ66k19n54q3j32l8Q2k02R7l5j5J93l4j11l1O2%J58M7k48Q7m1
$$ 195 213 195 114 105 110 196 65 302 300 1166 947 393 310 178 140 222 20 117 82 67 260 226 115 84 146 146 304 351 103 190 149
1335A49j6J25n1j40j4Ml9J38r6M4kM2p0p0J10k8J7J02m5o5J19L7q4l9n9N6J47j5k40J70j17
$$ 149 133 258 207 67 53 57 18 156 60 104 102 144 74 4 114 86 103 205 160 95 214 251 167 128 69 125 272 257 17 187 70
1044G0jP2o2P5J7P8q4k0j8q1J35m9NM4o9l4L6k1RJ6M2L9m4l8O6mnq8m0Q3L8q6J5m6K3j8M7
$$ 70 69 141 79 154 171 249 165 145 127 46 181 132 137 181 112 78 114 93 102 118 160 199 155 117 183 179 174 86 46 129 167 81 96 50 73 55 102
697A02p3J11p6J10n9jn4J31l2j7Lr9M9m5J20n7J2K0j1N7m0j46P0J1J8L0p1O7l6q5O1l0L2K45
$$ 102 29 140 64 174 115 114 60 191 159 142 145 46 95 50 170 113 125 145 134 191 151 5 75 86 104 134 63 130 94 9 70 40 72 317
378C17n1j93j4P7j1L5jm7o0J11J8mM6j54Pk1J03J0J66m3j94oK9%q2J5O7N5j22M2J07r5L3j0
$$ 317 266 73 59 136 125 160 159 112 52 163 181 177 223 69 76 55 158 168 334 291 97 91 120 120 38 53 120 175 53 95 202 107 140 130
58A30m5J4J11q9j6l7K0N8K8n7m0l1K9R1r5M0LJ39P1j74n6J18Mp2r7Q2J29L4p3r9J05M0q5j0
$$ 130 85 99 210 121 105 68 88 146 174 117 77 46 75 166 71 111 114 253 324 150 94 212 216 144 47 129 258 292 219 120 225 265 180 170
-261A70rr2O0kqM7j7L0k8j00J05n5n3K0
$$ 170 161 69 129 127 119 166 149 179 151 51 156 101 48 68
-392F8
##PAGE=	F1=-6376.18
##FIRST=	19140.455529915001534,	4405.895418600002813,	0
##DATA TABLE=	(F2++(Y..Y)), PROFILE
4406A18K7k9n4J2K1l4P2mq8M9l7R8J13o1p1O4k6l6r8J61p8l2k7Rm1P1N5j12J07N9m5Q9qn4
$$ 118 145 116 62 74 95 61 133 129 41 90 53 151 264 203 132 196 170 134 36 197 119 87 60 69 28 99 154 42 149 208 163 252 244 190
4087A90j32J1J00L8j70J23N8o2j20J79l6r7J30q6J21n7q7n3Q8O6l6k5n6N0J7K4J7o5J1l3%
$$ 190 58 69 169 207 37 160 218 156 36 215 179 82 212 126 247 190 103 50 138 204 168 143 87 137 154 178 195 130 141 108 108
3796A08m8M0m6J18m9P8J04Qq7j73L1Q3m4QL3n5n8P9j7K0m3J90k8N4j34r3k5J44r9k5R8j36
$$ 108 60 100 54 172 123 201 305 313 226 53 84 167 123 131 164 109 51 130 113 133 90 280 252 306 172 79 54 198 99 74 172 36
3495C6J77j08O8j21K2J59J4j39K7N7j36K6J43Q4k11J1J8J17j76O5m8J52R1k08l5j0k1J18o0
$$ 36 213 105 173 52 74 233 247 108 135 192 56 82 225 309 98 109 127 244 68 133 85 237 328 120 85 75 54 172 112
3223A12%J24L2j83O7o8K7J7l0J95l9j02p1P2J6K4j47R7lJ05j52Q9J21j80N0n0k4n3K48k7k45
$$ 112 112 236 268 85 152 84 111 128 98 293 254 152 81 153 169 193 46 143 140 245 93 182 303 123 173 123 99 46 294 267 22
2932B2J56kj32L4j7O8J06nj22m9J14k7M4J2j89J96j09L3n3k1J3N5PQR9j48J71r7nm2L5J0L
$$ 22 178 176 44 78 61 129 235 230 108 59 173 146 190 202 13 209 100 133 80 59 72 127 134 142 241 93 264 167 162 120 155 165 168
2622A68p4n4j7M5j8J18lM9j6p8L4NJ9J4Plk4j0Om0QoL2M0j28O1o7J0P3L8j3l7n9kj2j8L8k8
$$ 168 94 40 23 68 50 168 165 214 198 120 154 159 178 192 199 196 172 162 168 128 136 130 162 202 74 135 68 78 151 189 176 139 80 78 66 48 86 58
2265E8M5K4o7O4N8P3j46j4l0j6Lk3J61j18j9J48m5n1M6K85M00n03r9l7j46K7M4J14j74R5N4
$$ 58 103 127 60 124 182 255 109 95 65 49 52 29 190 72 53 201 156 105 151 436 836 333 234 197 51 78 122 236 62 157 211
1974B11j5m0P5r7J38Lj23p8n4L2RN6O9L7j1k2l2K5q0L5Q1j81J57j44J43o2n3J60j40J44m8
$$ 211 196 156 231 134 272 275 152 74 20 52 61 117 186 223 212 190 158 183 103 138 219 38 195 51 194 132 79 239 99 243 195
1683A95J8j77RJ02j5O0kL3o8k5j09R2p1K50m9Q87j59o14l1j00n3P0k13J10j2m9J56j1j21p0
$$ 195 213 36 45 147 132 192 190 223 155 130 21 113 42 292 243 1130 971 357 326 226 173 243 30 140 128 79 235 224 103 33
1401C3J68k3J23K6k34J10n4k5J08q2o9m7OK0O6l9lj2P5q4k9J10j7JM0rr6J43J4o2l6j8J4J69
$$ 33 201 178 301 327 93 203 149 124 232 150 81 34 40 60 126 87 84 72 147 63 34 144 127 128 168 159 63 206 220 158 122 104 118 287
1082B87m5k28J99j32M5N5q8Q7k1Q8r7Jl3j04K22l9r1P7r1m3N7Nk5k1M4Q0m2n4J32k5Mp1p1
$$ 287 242 14 213 81 126 181 93 180 159 247 150 151 118 14 236 197 106 183 92 49 106 111 86 65 109 189 147 93 225 200 204 133 62
772F2Q6L3j03O0o2L6l9K8n8J41q2R1j04j1o2J82k8L1l4j11K9o7J29k2K0k0J7N3o2r9L7L9K2
$$ 62 148 181 78 138 76 112 73 101 43 184 102 193 89 78 16 198 170 201 167 56 85 18 147 125 145 125 142 195 133 34 71 110 132
462A32Jq1Q1m5m7J9L5K5J98r5j90N5P2j1j8L1j6j06Q6N6l4J8j43K5K6K2L7J90k5j86l9L8J2
$$ 132 133 52 133 88 41 60 95 120 318 223 33 88 160 149 131 162 146 40 126 182 148 166 23 48 74 96 133 323 298 112 73 111 123
152A23j02JQ9L4p4j2J32r7O9Rp0PP1o4J4o1qJ19J6p0k2r8J48P0j52J1pJ85J16j88j17J43K0
$$ 123 21 22 111 145 71 59 191 94 163 172 102 109 180 116 130 69 61 180 196 126 104 6 154 224 72 83 76 261 377 189 72 215 235
-158B35o4j32O8J41K6l7j07M7N1m1J8q3p2Q6Jn4N5jJ8j7p6R5q6j8K7
$$ 235 171 39 107 248 274 237 130 177 228 187 205 122 50 136 137 83 138 137 155 138 62 157 71 53 80
-392H0
##PAGE=	F1=-6454.93
##FIRST=	19140.455529915001534,	4405.895418600002813,	0
##DATA TABLE=	(F2++(Y..Y)), PROFILE
4406A12km3j9k1N7j2L9K9j25M8k5J10R8n0p4M8k7j7o0J26p2m4rlJQ9K8j58J71N1n5L0J4m9
$$ 112 110 67 48 27 84 72 111 140 15 63 38 148 246 196 122 170 143 126 66 192 120 76 67 64 65 154 182 24 195 246 191 221 235 186
4087A86j52J5J45J7j65J04O7n3j18J78p3p4J11o8J17n1k5p6nP3j0j7n8L4L0O4op3Rkn9j6M6
$$ 186 34 49 194 211 46 150 217 164 46 224 151 77 188 120 237 186 161 85 80 153 143 126 68 102 132 196 190 117 126 124 65 49 95
3777I5o0J12k6P5O1J5p9j78Q2O3o8L3P0j13n5P7m4O2n7J99k2P8j47q8k0J47j32k4R0j18J97
$$ 95 35 147 121 196 257 272 193 15 97 160 92 125 195 82 27 104 60 122 65 264 242 320 173 85 65 212 80 56 146 28 225
3486B25j48Q2r6M3J53K3j62K4N8j23L1P2R7j81J3JJ18j62N4m1J32R6j91o1M1j5J07q3OJ51
$$ 225 77 159 63 106 259 282 120 144 202 79 110 182 279 98 111 112 230 68 122 81 213 309 118 57 98 83 190 107 113 264
3204B64L7k13M8m1L8Rk5K00n9j48p9J46l3L5j38Q5oP3q0O7Q9j44L9m9j6o2K30l0j90J58J9
$$ 264 301 88 136 95 133 142 117 317 258 110 31 177 144 179 41 126 120 193 113 180 269 125 164 115 99 37 267 237 47 205 224
2913B24j53J9n9K5J37K8q8r7J31K0j5j7j21J46r5P2m0q3N5N1L1o2J33j67J86j06M4n9MlJ9
$$ 224 71 90 31 56 193 221 133 36 167 187 172 155 34 180 85 157 117 34 89 140 171 109 242 75 261 155 199 140 144 141 160
2622A60j01j7j9O9kL1J2R0oq2kK4J9K8K2pk1o1Olm6oR5L0j36J10r6K5k1P4L0m6o0n8Rk0N2
$$ 160 59 42 23 92 90 121 133 223 217 135 133 157 176 204 226 219 198 137 143 140 94 88 183 213 77 187 91 116 95 169 199 153 93 35 44 24 76
2274G6L7j2K0k7J08M8K9j73L7j3q6L0j6J74j29o8K13m4p4OL22L87n37o1m6r9qL3Q9j28N5Q6
$$ 76 113 101 121 94 202 250 279 106 143 130 44 74 58 232 103 35 248 204 130 136 458 845 308 247 201 102 94 127 216 88 143 229
1974B29k8k3Q9j02J10K0j52j14j7Q0J9N3M1JK7p8l6N6j12J2J44j73J66j12J00n1m9J46j47
$$ 229 201 178 267 165 275 295 143 29 12 92 111 164 205 206 233 155 119 175 63 75 219 46 212 100 200 149 100 246 99
1702I9R4k4P0j64J9J00m3L5l4R4n4m1o8l0l3K83MQ13p7p26Np2l8M5j98Q9K6o6R2J8j15p9K21
$$ 99 193 169 239 75 94 194 151 186 152 246 192 151 83 53 20 303 307 1120 1043 317 322 250 212 257 59 148 174 108 200 218 103 24 245
1392B45m8Q5J4k15J39p0l1Q8j16rj5kN7k2J5k8m6R0p1MJ16rk0l6L0n7P8Rm3j9L6n4J87o3j94
$$ 245 197 282 296 81 220 150 119 207 91 82 67 65 122 100 115 87 41 131 60 64 180 171 151 115 145 88 166 175 132 113 149 95 282 219 25
1063B5K01r6N0L2j04R3m8O0r3L7n7q0K39k3j11M7j04k3O1M3l4o3K4R1l2o5J74l4J3l9p1M6
$$ 25 226 130 180 212 108 201 153 213 120 157 100 20 259 236 125 172 68 45 106 149 115 52 76 167 135 70 244 210 223 184 113 159
763A59K0j09J11r4M2l9JrJ31p9O8j23j9l8J75k0O7o7j12Nn8J14J3J6n8L2N2o6n4K1N2J8l1
$$ 159 179 70 181 87 129 90 91 82 213 134 202 79 60 22 197 177 244 177 65 70 12 126 139 155 97 129 181 115 61 82 134 152 121
453A21o4P0m3pk1Q5K0J35j15j71J20M0lm3M8Kj29L9P4k8%r4M1J0n5N1J99Jj49p4N8K7j34k
$$ 121 57 127 84 77 56 141 161 296 181 10 130 170 167 124 172 174 45 84 158 130 130 36 77 87 32 83 282 283 134 60 118 145 11 9
133IP8Nk8l8J34p4R5L2p9k5J4qL7q7l4J68%p3k4m9J68M7j97k4j8K19J52j91j63J73L7n4j74
$$ 9 87 92 64 26 160 86 181 213 134 109 123 115 152 65 31 199 199 126 102 53 221 268 71 47 29 248 400 209 46 219 256 202 28
-176B8M5J59Pjj06k1O1J3K8j37lN6lp4Q9K3j9k4m0P9j07lK9
$$ 28 73 232 239 238 132 111 172 185 213 76 73 129 126 52 141 164 145 121 81 160 53 50 79
-392G9
##PAGE=	F1=-6533.69
##FIRST=	19140.455529915001534,	4405.895418600002813,	0
##DATA TABLE=	(F2++(Y..Y)), PROFILE
4406I6l1m7J8j0N4J1pM9j29L8j3J05Q4k6o6J7l2Ql4Q4n0n0J3l5M3J12pj19J61L2n0l2K6m7
$$ 96 65 18 36 26 80 91 84 133 4 42 29 134 218 192 126 143 111 119 85 169 119 69 82 47 90 202 195 76 237 269 219 187 213 166
4087A66j63K6J84k2j33P4O7l9j08J65r4m2O8k4R2l2J6p8q6N8J3rm9J4M6Q8l9n8oM8j31L3O6
$$ 166 3 29 213 191 58 132 199 160 52 217 123 81 149 125 217 185 201 123 37 95 108 99 50 64 110 198 159 101 95 143 12 45 111
3777A11q0J03j1N5J8K8m3j45P6M2q1L9J18j31j9%n6P2n6J91lQ0j47p0K7J38k07J0O0p4J84
$$ 111 31 134 123 178 196 224 181 36 112 154 73 112 230 99 80 80 24 96 40 231 228 308 161 91 118 256 49 59 119 45 229
3486B29j77R1o5N8J40K5j74J2N2q3K3J4Q4j38J2j0J10j44M0j7J02P5j66o1R3j7O9q9J8J49
$$ 229 52 143 78 136 276 301 127 139 191 108 131 145 229 91 103 93 203 59 99 82 184 259 93 32 125 108 177 88 106 255
3204B55M1k17L7j7K7LJJ85p3j82KJ32q1L5j22P3j3N4l0O5M3j04K6n0Lo5J80j9p5R6L6j44J6
$$ 255 296 79 116 99 126 129 130 315 242 60 62 194 113 148 26 99 86 140 110 175 218 114 140 90 93 28 208 189 114 210 246 102 118
2894A18r3J4R8O3l7j13J00N3o0l6m3J05r7R2l6r2O3N5M9r3J22j88J94j12R8o6k8j3M1j09J5
$$ 118 25 39 137 200 163 50 150 203 143 107 64 169 72 164 128 36 99 154 203 110 232 44 238 126 224 158 130 117 158 49 64
2603F4k2P4L1o2qJ30J4p7l1M5K0K5L2lk1r5j1L6q6j8J86rj16J29j44N9q9Q4P9p1o2k4l6PL2
$$ 64 42 116 147 85 77 207 221 144 113 158 178 203 235 232 211 116 105 141 55 37 223 214 98 227 83 142 53 137 216 145 83 59 23 30 62
2274F2R8m3PJ2J22L4j2j69N6J5j21K8oJ67j25n6J81l9m9j3L02L79n42n2o1jRm8M6p1M5J01
$$ 62 160 117 124 136 258 292 280 111 167 182 61 89 83 250 125 69 250 211 162 149 451 830 288 236 175 174 183 135 181 110 155 256
1974B56l9k8R1p7P1L6j71q8j7R7L2N4jl1N0j26l8R1j16k3J76j48J56q9R5k9o9J23j34N8m2
$$ 256 217 189 280 203 274 310 139 51 34 131 163 217 216 185 235 109 71 162 46 23 199 51 207 118 213 184 115 238 104 162 120
1683A20J14j23J1R2o9L5p3J49l3o4nl0j16L17J22P40l8q50J4o5pK0j65M7O4o3J7M2q9n7K21
$$ 120 234 111 122 214 145 180 107 256 223 159 154 124 8 325 447 1187 1149 299 313 248 241 261 96 143 207 144 161 203 114 57 278
1392B78o9M4J0j90J64q9l0O7j46L1K3J3P1n8K2m6n8O0j7RJ33qm2j14P3J3l8L2m5PR4j19J82
$$ 278 209 253 263 73 237 148 118 185 39 70 93 106 177 119 141 95 37 97 80 89 222 214 172 58 131 144 106 138 93 100 194 75 257
1082B57o5j60J89m4M6Mj05Q4m8j3p6R4q5l1K02op6j7r4NM6Q1k7q6KN9j8m9J67k7J7po0Kkj01
$$ 257 192 32 221 177 223 227 122 206 158 145 69 163 78 47 249 243 167 150 56 61 107 188 161 75 77 136 118 69 236 209 226 219 159 161 159 58
744E8J57j26M8j8l0K5J12p2M2j04k6j5J36j2Q6r5r8j3m8R7M2J0r5M1M5n0j6J8N0J2o1l3M6
$$ 58 215 89 137 119 89 114 226 154 196 92 66 51 187 175 261 166 68 55 7 104 146 156 61 102 147 97 81 99 149 161 100 67 113
434A13l8J8m0J17K1O8j16q9J18oJ1m2M5J7j37J8L3kJ6l0L7m0n1j4K00K4r8j03Q7K8j48J4K4
$$ 113 75 93 53 170 191 259 143 54 172 166 177 135 180 197 60 78 111 109 125 95 132 92 41 27 227 251 153 50 137 165 17 31 55
124E5Jk5j9J16l5R7N5p7o8m4Q1K9j03l6J75j6n9n3J8J69K5k08l0K0J48J70j85j63J84N3m4
$$ 55 56 31 12 128 93 190 245 168 100 56 137 166 63 27 202 186 127 74 92 261 286 78 48 68 216 386 201 38 222 275 231
-167B31k06L5J52jJ2r5q4O2N4K7j36N9mqp2J41M3o6m8J2N1j06j4K9
$$ 231 25 60 212 211 223 128 44 106 160 187 51 110 106 98 26 167 210 144 96 108 159 53 39 68
-392F8
##PAGE=	F1=-6612.44
##FIRST=	19140.455529915001534,	4405.895418600002813,	0
##DATA TABLE=	(F2++(Y..Y)), PROFILE
4406G2n5OQK9K1L5n2M9r1KJ4P5P4Jm9j3m7L3k0M2j8l7K5p0P2J22m1o3J40Pl6q4K4m6r3%J82
$$ 72 17 23 31 60 81 116 64 113 22 24 38 113 187 188 139 126 79 112 92 134 116 79 104 34 106 228 187 124 264 271 235 151 175 129 36 36 218
4058B18o6p6M7M7k5r8J43r8PJ2L1M9mK8o6o4j8Jnk9KO1Q7p5k0l5J03r5j3P6o5P6j6L3j6M2
$$ 218 152 76 123 170 145 47 190 92 99 111 142 191 187 215 149 85 67 68 63 34 36 97 184 109 89 54 157 62 49 125 60 136 120 153 137 179
3720A79Oj11N7K0o2PJ65j03j1q3k9K5m1J69K3O0j37l8O9J35k86O6J9m5J64j81R4l4N9J23K4
$$ 179 185 74 131 151 89 96 261 158 147 64 35 60 19 188 211 271 134 96 165 300 14 80 99 54 218 37 131 97 156 279 303
3429C03j76j1M0k1K3n0N6q3PjQ1j17K3K0O3M0j38j8J12k7J3p7L5J11M2j99N0JqmM2J60p1j93
$$ 303 127 116 156 135 158 108 164 81 88 87 168 51 74 94 157 197 59 41 153 126 139 62 97 208 250 51 101 102 94 90 132 292 221 28
3110B8Q5Q8j17K4j01O1j7O7l1Q3J0o3%o0L3o6J13K0J2K2N0j15K3r4P6n1Q2K3j02L5P2p7n2
$$ 28 113 201 84 108 7 68 51 118 87 170 180 117 117 57 90 24 137 157 169 191 241 126 149 55 131 80 162 185 83 118 190 113 61
2800F1K8P4j01R0l6o7N5O2N8p5P4k10J86j15J55p0m6j4N3p4lk8P9O6q3n1J02M3o2n9N7K4J1
$$ 61 89 163 62 152 116 49 104 166 224 149 223 13 199 84 239 169 123 109 162 88 85 57 136 202 119 68 170 213 151 92 149 173 184
2490A84M3J0k9j08m4O8j08kK49o0n8J02k02J07j30P3J15r3o2N0r6N5j4J41m9j4M2J09K5m3
$$ 184 227 237 208 100 56 124 16 14 263 203 145 247 45 152 22 95 210 117 55 105 9 64 50 191 142 128 170 279 304 261
2209B61j39M3M8j33J4LJ38j04k6J04l2LkK34L76m95q8p9J01M8j35moO0R3m0m2O6l0L2M8j79
$$ 261 122 165 213 80 94 97 235 131 105 209 177 180 178 412 788 293 205 126 227 275 140 136 130 190 283 243 201 267 237 269 317 138
1908A38m8m3J14M4O1m7n7N5j62l1J15p4M2O6j17J35p5Q7lq1R1r7P5j33J40n9rP8q9N5j10J89
$$ 138 90 47 161 205 266 219 162 217 55 24 139 65 107 173 56 191 116 203 200 119 210 113 188 55 195 136 127 205 116 171 61 250
1608B50%r3M0J9j68K92K39P80q2r57jq2J7Mj19j4R5m0m6M4m3n0K16q3KJ1j53J74j12k5N3j42
$$ 250 250 157 197 216 48 340 579 1359 1277 320 319 237 254 258 139 125 220 180 134 178 135 85 301 218 220 231 78 252 140 115 168 26
1307B6L0L8M1Q1m7po9l6kN6kJ54j4n6j57J04N6j25O9r0L3J49j54J40n2j18J49J0M6k5r5N8
$$ 26 56 94 135 216 169 162 93 57 55 111 109 263 249 193 36 140 196 71 140 50 83 232 78 218 166 48 197 207 253 228 133 191
1007A91j9j18j6J34j14QJ50Pj5p6o6J2L2J05j9j10LJ2klJ08qJ5J9l8l7k9p8J83j46O9%n1L8
$$ 191 172 54 38 172 58 66 216 223 208 132 66 78 110 215 196 86 89 101 99 96 204 196 211 230 192 155 126 48 231 85 154 154 103 141
687A41Q5o6J4m9l5j9R8oQ8j17p1k2k5O9N7J6j07L1J9k7J6K3M2Oq8OJ4l3L2m3J29K8J1j09j4
$$ 141 226 160 174 125 90 71 169 163 251 134 63 41 16 85 142 158 51 82 101 74 90 113 155 161 73 79 93 60 92 49 178 206 217 108 94
359I4J15n9K9l2L4L2j37L8o5K5N5J8L2q7oo0J53L4n3j18J08J6j43K4k4P7q1kJ03j5Q0P4o1
$$ 94 209 150 179 147 181 213 76 114 49 74 129 147 179 92 86 26 179 213 160 42 150 166 23 47 23 100 19 17 120 105 185 259 198
49A98j15j9J14rj06j9J45k8k7q2P1J47Oj80oL8M4J62j70r9J57O6l9k06M9J02K4j6q2p8QO1
$$ 198 83 64 178 169 63 44 189 161 134 52 123 270 276 96 90 128 172 334 164 65 222 288 249 43 92 194 218 202 120 42 50 111
-252A11K1n1N6o4j0m8J74N6j03p9P5J1q7l2J9
$$ 111 132 81 137 73 63 15 189 245 142 63 138 149 62 30 49
-392D9
##PAGE=	F1=-6691.2
##FIRST=	19140.455529915001534,	4405.895418600002813,	0
##DATA TABLE=	(F2++(Y..Y)), PROFILE
4406E0k3K4j7N4nN9r1M0n1j3K9M0O9J6l0l2o9N3j5NJ8j7L8r8Q0J11o2pJ13j6k2j09Ll6ok2
$$ 50 27 51 34 88 83 142 51 91 40 27 56 96 165 181 151 119 50 103 88 93 111 94 132 34 114 225 163 156 269 253 231 122 125 89 83 61
4068F1J45j02j1M1Jj5q4J13r2O7k5O4KK2J9m6j4m8o8Kj0J2O4O0r2J4o5J41l9o2P1k8M9l8J6
$$ 61 206 104 93 134 135 120 36 149 57 124 99 163 165 187 206 160 146 98 30 32 22 34 98 158 66 80 15 156 117 55 126 98 147 109 125
3739A25l5M6M9q7N0Ll1m1K01o0nj55qk9OJ09N4K4j22RQ5J31l06R2j2m8J49j57R1j5M8J07K4
$$ 125 90 136 185 98 148 151 120 79 280 220 215 60 52 23 29 138 192 216 94 103 188 319 13 105 93 45 194 37 128 113 161 268 292
3429B92j67l8J5N1M6j27K0j0qL2J8o4J3M6K1Lj01L1J09m3n7l9N6L7L0j61J00Qo2j6Q8J33l8
$$ 292 125 87 102 153 199 72 92 82 74 106 124 60 73 119 140 143 42 73 182 139 82 43 99 136 166 5 105 113 51 35 123 256 218
3119B18j72R9N5j37Pn3K0j2J01p2J14J0l0l2p4N2o7N4Q5L5m5N9p3L9j07J40j53N2Q1p6m1Q5
$$ 218 46 145 200 63 70 17 37 25 126 54 168 178 148 116 42 94 27 81 166 201 156 215 142 181 74 214 61 113 194 118 77 162
2819A62n5p9P7M6r2O6l3l0M4P0N9l6K4k07J36r9J91p4m5%M6k9l8m1R0R1n8m3j9P4m5q4N8K2
$$ 162 107 28 105 151 59 125 92 62 106 176 235 199 223 16 152 53 244 170 125 125 171 142 104 63 153 244 186 143 124 198 153 69 127 149
2500A49lO1K9l8r7r9Q9o7L5K27j05K4M1k12J22j44M2J24r6n2J07j27Q6n2J60l8l5O0P3K4n3
$$ 149 146 207 236 198 101 2 91 24 59 286 181 205 246 34 156 12 54 178 82 30 137 10 96 44 204 166 131 191 264 288 235
2209B35j01PQ2j40MQR1p0NJ8j4N0J9J60L78l93j82r7J90R0k01l5M8P4O8k9m6J4K1NN6j79k4
$$ 235 134 141 223 83 87 95 186 116 121 139 125 175 194 354 732 339 157 60 250 340 139 104 152 226 294 265 219 233 254 259 315 136 112
1899A12o3J31M8P8r1p9M7j73K9P3k7R8k2j00J20n4M5K6q6N4n1J30k23J09J3l1O8j01P7j26
$$ 112 49 180 228 306 215 136 183 10 39 112 85 183 161 61 181 127 172 198 112 166 115 245 22 131 144 113 181 80 157 31
1617C1K06M1j14M2Q8j89K34L22R27j84j034k7r6RKp6q5J17pp0QJ6o0K14r3l2J1j05J67j38
$$ 31 237 278 164 206 294 105 339 661 1588 1404 370 343 247 256 258 182 97 214 207 137 145 161 101 315 222 190 201 96 263 125
1335A25k5N3j00RJ0O6R0j8l1j05on0J23j9J71k9m7j55J10O1j17N8j47L4J95j59Q2l3p0Q4N6
$$ 125 100 153 53 62 72 138 228 210 179 74 68 18 141 122 293 264 217 62 172 233 116 174 27 61 256 97 179 146 76 160 216
1044B16N5n0q2K2K8j34N7O9j34L6R3PN8j10m6NL1J04j8j29J2k8K5L9L1J9OL8pp1n5l7J76j51
$$ 216 271 221 139 161 189 55 112 181 47 83 176 183 241 131 85 90 121 225 207 78 90 62 87 126 157 176 182 220 213 142 87 50 226 75
725G5J08ko3N1M8o6j3K9m4m2O7nP4j29l6j7J5K5N4M0p1Jj9m1M6L8L0%j07M4k1j4L0m1J24L7
$$ 75 183 181 118 169 217 151 138 167 123 81 148 143 217 88 52 35 50 75 129 169 98 99 80 39 85 123 153 153 46 90 69 55 85 44 168 205
387B05k6j05N4J08j08M4k5K7N0j27N8j33J6R0N3K9j14J6n4R5K2k1j13J01Lj20K7m4J47q7n1
$$ 205 179 74 128 236 128 172 147 174 224 97 155 22 38 128 181 210 96 112 58 153 175 154 41 142 145 25 52 8 155 68 17
96A7J25l1N8Q2l6j51O1R2n6r4j3J08l0J3o3O4J02jj27QM0m2J26j45j2J19P9m2j83O5N5O9p2
$$ 17 142 111 169 251 215 64 125 217 161 67 54 162 132 145 82 146 248 247 120 128 168 126 252 107 95 214 293 251 68 133 188 257 185
-214A85p3k8j7k3J6O3K5j14PpJ57N8j21j05J44m1m8l3j8
$$ 185 112 84 67 44 60 123 148 34 41 34 191 249 128 23 167 126 78 45 27
-392B7
##PAGE=	F1=-6769.95
##FIRST=	19140.455529915001534,	4405.895418600002813,	0
##DATA TABLE=	(F2++(Y..Y)), PROFILE
4406D4J3Mj7O4k1P8j25M4k6nK2K1O4J0j4l7r2O8j3l2N4mO1j28Q6P6o7L7Q0l0qj02k2NM6n4
$$ 44 57 61 44 108 87 165 40 84 58 53 75 96 160 170 156 119 27 95 82 50 104 100 161 33 119 195 128 165 245 215 207 105 83 88 134 80
4068H0R7j04K5N5m8j3n4O8o3J00l3O7l9M4Kk5L8n6j37K9j8K6O2K8m2j7l5J01J2r2N5K0L0p3
$$ 80 177 73 98 153 105 92 38 106 43 143 110 177 138 182 184 159 197 141 4 33 15 41 103 131 89 72 37 138 150 58 113 133 163 90
3749I0Rm6L9Q1p0N5j0op6K17j9Qk05ql5L5L5P6k2r7O1P3J13k74J02k4p8J39j17Q8j0K6R6L1
$$ 90 99 53 92 173 103 158 148 142 66 283 264 272 67 59 24 59 94 170 148 51 112 185 298 24 126 102 24 163 46 134 124 150 246 277
3429B77j49m0m5J13Q8j97k3P3k1O6o9J3J3M9j5k6n7N2J09n9j33L2P0l0k7mO9Pp9jN2J10J6
$$ 277 128 88 43 156 244 47 24 97 76 142 73 86 99 148 133 107 50 102 211 152 19 51 121 91 64 60 129 136 57 56 108 218 234
3119B34j69R2L6j40rmj7pJ12r7J40L1j4m9q7N1o5M0J14J4q7N9k7O2j42K02j75l8J33l9p8P5
$$ 234 65 157 193 53 44 40 23 16 128 31 171 202 188 139 52 103 38 78 192 206 119 178 151 213 71 273 98 60 193 154 76 151
2819A51j0j01P4J8o4K3k6J0L5P3N5Mj8j99Q0l8J71p7k8J9K6J9p2o8J09J01k5k7j34R7l0j00
$$ 151 141 40 114 132 68 91 65 75 110 183 238 242 224 25 105 67 238 161 133 152 178 197 125 57 166 267 242 215 81 178 148 48
2519D8M6J2lQ0M4l3p0p2RQK3J90j26J08l6j25P4j22mP3o0j3R9j36J06p5J53j5m9O6K1L2l6
$$ 48 94 106 103 183 227 194 124 52 61 69 92 282 156 264 228 103 177 55 51 124 64 51 150 14 120 45 198 183 134 200 221 253 217
2209B17p5l4J17j50mPL1k7K7l9O1K1K8J22L95k70l16r5K26J22k32j9O4O9L4j2k7m6N7mN5j73
$$ 217 142 108 225 75 71 78 109 82 109 70 131 152 180 302 697 427 111 16 242 364 132 113 177 246 280 268 241 195 252 248 303 130
1908A30j3p7J50M2J01j28r5L2q0J8J1NJ35o1j02J15k4j0N3j04J1oJ85k01j2N9m2O6q7O2r2
$$ 130 117 40 190 232 333 205 110 142 62 80 91 96 231 170 68 183 159 149 202 98 109 103 288 87 75 134 92 158 71 133 41
1617D1J90P8j10j9J72j76J46L53J117l02j068o0q5k3J5n1j50J33J9n2n8P8q2K10r5n3Ro3J54
$$ 41 231 309 199 180 352 176 322 675 1792 1490 422 362 277 254 269 218 68 201 220 168 110 188 106 316 221 168 177 114 268
1345B68j61l8O9o3J6m2N8J02J4l6j47K2l1J33l4J75n1j1j70J32M6p4L0j54j8K32j55M2j7k6
$$ 268 107 69 138 75 91 49 107 209 223 187 40 62 31 164 130 305 254 243 73 205 251 177 207 53 35 267 112 154 137 111
1063A11%R5P7p0p8rP8n6M7j1j25M6L7nJ21j19l7mM2P6k7j29J9o0P8N0m2M5kN0K8r8p4J1J35
$$ 111 111 206 283 213 135 126 204 148 195 184 59 105 142 137 258 139 102 98 140 216 189 60 79 19 97 147 105 150 148 198 226 128 54 65 200
734B00j43J53k4o3P0Qp1l5J14n0p5M2nN2j31QrM2qL2P9k4k0k1j12N7O5K0j5j14P2n1L0Qm0
$$ 200 57 210 186 123 193 201 130 95 209 159 84 126 121 173 42 50 41 83 75 107 186 162 142 121 9 66 131 151 136 22 94 43 73 81 41
406D1J09M1m4j01J09R6j44M9k5K7O8j02O1j02j1M7P4L3j20J2n1O7jMq7O0No9Lj5J53q7p9J51
$$ 41 150 191 147 46 155 251 107 156 131 158 226 124 185 83 72 119 193 226 106 118 67 134 133 137 50 110 115 46 49 34 187 100 21 172
86A72o2M0O9oj66J21P1q3p6k6P2k1M7k5L0M7Oo9RK7q4N7q5N1P8R7n6j44O8M4R7j26o8MNq5
$$ 172 110 150 219 213 47 168 239 156 80 54 126 105 152 127 157 204 210 141 150 177 93 150 65 116 194 291 235 91 159 203 300 174 106 110 115 30
-252C0j8J41mj46M5LJ17M9j17p3J63j00J1k3p2
$$ 30 12 153 149 3 48 51 168 217 100 27 190 90 101 78 6
-392F
##PAGE=	F1=-6848.71
##FIRST=	19140.455529915001534,	4405.895418600002813,	0
##DATA TABLE=	(F2++(Y..Y)), PROFILE
4406E8J2j6jO5k4Q2j47O9k2PQJ9N4nll6r1O6kp7Q4pR4j67J08K6o4O2M5l3Lo6j8M5M9q8M7n0
$$ 58 70 54 53 118 94 176 29 98 76 83 91 110 164 159 156 120 29 95 93 16 100 93 187 20 128 154 90 152 197 164 167 101 83 128 177 89 136 86
4049H6jP8p9k0lK0jP6l8O0o9O3rrQ2o0j59L3l9L2N7J0L6p9jM0M5r8L7O7K3j06Qn7J7J11o1
$$ 86 85 163 84 64 61 81 80 156 118 178 109 172 163 154 236 176 17 50 11 43 100 110 146 67 66 106 151 53 90 157 180 74 82 25 42 153 92
3702I2O5j7Oq1K05J2K6k23k5j2M0nO3o2l2O8L7Q1k19J23k3j04J26q7R1j4oR4N0j30j4p5R1
$$ 92 157 140 146 65 270 282 308 85 60 48 88 83 146 84 52 120 157 238 19 142 119 15 141 54 145 131 125 219 269 139 125 50 141
3392A41J39k26k5R4k2P5j58R8QM7l9m7l5P5J11o7j23L0P9j0o4N1L0Ko0K4l5R2O8j79Q3K3j32
$$ 141 280 54 29 123 101 176 18 116 124 171 132 85 50 125 236 169 46 76 155 145 81 132 162 164 104 128 93 185 253 74 157 180 48
3082D8k1L7j5k6Q7p7J41N3j3n0j05M5n1M7J03j6j01N6J3R0k00K58j56j26J66Ln1M6Nj28O3
$$ 48 27 64 49 23 110 33 174 227 214 164 59 104 53 100 203 187 86 142 155 245 45 303 147 21 187 190 139 185 190 62 125
2791A25pl2k7j3M0L5O9M8L6o1j89L9L3J23o7nK7%P2r6j11J37Q9Nrk16J09j8j01K4NK3P4M6
$$ 125 118 86 59 46 86 121 190 238 274 213 24 63 96 219 152 147 174 174 246 150 39 176 265 270 261 45 154 136 35 59 64 87 161 207
2472B07nm7o4j8L8%J40j14J72j04l8M6j11j2l3J4J5N9j32J19p7J21J2n0N9l5M6J5p8n7J46
$$ 207 202 155 91 73 111 111 251 137 309 205 167 213 102 90 57 71 86 145 13 132 55 176 188 138 197 162 208 223 145 88 234
2180B34j52l1%nlK8nJ40p2OJ43M35j92m07k9J17J41k24K1N6M2nOJ2q0N9NM0j55lr9J73K4J24
$$ 234 82 51 51 46 43 71 66 206 134 140 283 718 526 119 90 207 348 124 145 201 243 238 244 256 176 235 240 280 125 122 23 196 220 344
1861C44j59r3J1R%k5J8J39n7j13J11Lk3N7j40k9K2K19j59k5Jl5P1n1Lm4J87R8q3j31K59j29
$$ 344 185 92 103 112 112 87 105 244 187 74 185 188 165 222 82 53 75 294 135 110 111 76 147 96 99 55 242 340 257 126 385 256
1561B56M8L32J292m06j065j07m9n6M2n1j72J35K5j5j22J26j08J97p9p4J1l8J46j79o4J02m0
$$ 256 304 636 1928 1522 457 350 301 245 287 236 64 199 224 209 87 213 105 302 223 149 160 122 268 89 25 127 87
1307H7M1m2l9J11M3j7j74K8K1J22m8J64q0N3k09J58L1l2Jj35p3K55j49L5j1Or0J27J06q6q4
$$ 87 128 86 47 158 201 184 10 38 59 181 133 297 217 270 61 219 250 218 219 84 11 266 117 152 141 147 57 184 290 204 120
1016A20k6J20NL9q2q3M1k3j9J59j14k4kM9K5m1q6Rl5R3K8r4O6pN4O0j16q2M6P9j27J89n6n3
$$ 120 94 214 219 258 176 93 134 111 92 251 137 113 111 160 185 144 58 67 32 125 153 59 125 118 172 232 116 34 80 159 32 221 165 112
697A12R3l2p2m4J85n1j04J9jK8r9L2j1M8k4MJ25J7l8qj15k4R5J8l7j08P7o6P3j0m5R2L8m7
$$ 112 205 173 101 57 242 191 87 106 105 133 34 66 55 103 79 83 208 225 187 179 64 40 135 153 116 8 85 19 92 82 37 129 167 120
378A20o6J28P3j61M0l4L1Q5n8N0p8kk0P1N3j11j3n4N1k3L4n5QM6k8l5RJ27q5n8J46q7L1L4
$$ 120 54 182 255 94 134 100 131 216 158 208 130 128 108 179 232 121 108 54 105 82 116 61 69 115 87 52 61 188 103 45 191 104 135 169
58A69J9j50J46N6p3o6m9L3RN6L%jL0l2LPp7l1M8K6L6J23p6j01N5O8R4j62o1J3L5n9k3R4j5
$$ 169 188 38 184 240 167 101 52 85 94 150 153 153 152 182 150 153 160 83 52 100 126 162 285 209 108 163 231 325 163 102 115 150 91 68 162 147
-280A47j09K2JO4K9r2J0J29j52P5rr9
$$ 147 38 60 61 125 154 62 72 201 49 124 115 16
-392A6
##PAGE=	F1=-6927.46
##FIRST=	19140.455529915001534,	4405.895418600002813,	0
##DATA TABLE=	(F2++(Y..Y)), PROFILE
4406G7j0l1K5N7j5P0j38Q8l2J6pK5L3n%l1p6O0J7q1O3k1J21j80J17qp2O8J0l2J3k3J4N5L9
$$ 77 67 36 61 118 103 173 35 123 91 107 100 125 158 153 153 122 46 106 123 42 105 84 205 25 142 134 62 130 140 108 121 98 112 167 206
4077B06j16%K8o3R9q3k9M4kL7M5n9O0r0Q2pNJ07o4j75L3m8M2L1J2R7j26J3j1N5q1K4J03K7
$$ 206 90 90 118 55 154 71 42 86 84 121 166 107 167 77 159 152 157 264 200 25 58 10 52 83 95 192 66 79 68 123 42 66 169 196
3758A96j18Jn4j7J33o9O9j6On3J70K5M4k06m8nN6pJ7o6L7L0j3L9j30J34j5j02J01q0R9j9m4
$$ 196 78 79 25 8 141 72 141 125 131 78 248 273 317 111 63 58 114 107 124 58 95 125 112 151 21 155 140 38 139 59 158 139 95
3448I5R5Q0j18J2o6J2J86k19j4R0j5N7j64J10lM0n0n4m0J11J09o2r5RQ3L7m0J5j2lm3N2j14
$$ 95 190 270 152 164 98 110 296 77 63 153 138 195 31 141 138 178 128 74 34 145 254 192 97 106 189 226 186 201 189 186 143 195 81
3138H1P6J06j84P4J0j15j6N9jm7L9m9J30P5j8m7j10K6k1M1P9l7r6N8M0J18k62K96j11j54J41
$$ 81 157 263 79 153 163 48 32 91 90 43 82 33 163 238 220 173 63 89 68 109 188 151 55 113 153 271 9 305 194 40 181
2847A81L9oK3j0j54O9k9qo1LM9M2N4M2O0j08j45j3Q0P9l3J2J5k6J28j05j52J54N7K9Rk65J17
$$ 181 220 214 237 227 73 142 113 105 44 47 96 138 192 234 294 186 41 28 108 187 154 166 181 155 283 178 26 180 237 266 275 10 127
2537A27lq8pM6L4K9L7L9l9o9J0K7k6Q4p1K03j39RM3j04j4j02N9K8J4j15J20n6O5M0l6L9p6
$$ 127 124 36 29 75 109 138 175 214 175 106 116 143 117 201 130 333 194 203 246 142 128 26 85 113 127 12 132 76 141 181 145 184 108
2227A08N9Q1j01n3J60j29r2NP0m8j2N0J83j40l8J92M90j88m14k4jJ49j87M5M8Ol5RO3o7K7
$$ 108 167 248 147 94 254 125 33 38 108 60 48 98 281 141 103 295 785 597 183 159 158 307 120 165 213 219 184 193 256 189 216
1936B16K4J1j25J2j30J96qJ40j85o0j6P8k3l4K2J09k9j21R5K3QM2j72m9RK25j02K8r5j8O8
$$ 216 240 251 126 138 8 204 196 336 151 91 75 153 130 96 118 227 198 77 172 195 203 245 73 24 33 258 156 184 89 71 139
1645A39k0n7j2K12J07n2k38L05n0k5K83J434m71j077j77qp5Q0p2j39J27J6J7j53J38j27J64
$$ 139 119 62 50 262 369 317 79 384 334 309 592 2026 1555 478 301 293 218 298 226 87 214 230 247 94 232 105 269
1392B69l5j10K6l5J47j88m1R4l2P0j1r8L0N9K3j27k6P2J05n8J38j12J29k34J48K7jk6r6p9
$$ 269 234 124 150 115 262 74 33 127 95 165 154 56 86 145 168 41 15 87 192 134 272 160 289 55 203 230 229 203 107 28
1110B8K26j37M4pL2j76J47J29r3r9k4J43M3L3j32k6L5r2j9J59r6%J2M2l7m8j0j1J8P3j1j21
$$ 28 254 117 161 154 186 10 157 286 193 94 70 213 256 289 157 131 166 74 55 214 118 118 130 172 135 87 77 66 84 157 146 25
810B5P7pN1Q6j24q4O7J9q9J91q9l3J07o8o3j0K07m9j19qQJ4n2L3j6K9k5j4J65M7n3Jj03q5
$$ 25 102 95 146 232 108 24 91 110 21 212 123 90 197 129 66 56 263 214 95 87 95 109 57 90 74 103 78 64 229 276 223 224 121 36
490C6J01K1o3q1M9m9Q0k3m6Q8K6m2LJ15L4j59J9m9L4R9lM0p2J2p1M4Q9r7m2n6L2j9M8k9MQ4
$$ 36 137 158 95 14 63 14 94 71 25 113 139 97 100 215 249 90 109 60 94 193 190 230 158 170 99 143 232 135 93 37 69 50 98 69 73 157
152A57k6o0J9O9p6lJ12r0K0j3L4j01J31N1l0o5o6j7N8L2J5k0k1N6k1nj5l3k1Q4k8nJ55r7o5
$$ 157 131 71 90 159 83 80 192 102 122 109 143 42 173 224 194 129 63 46 104 136 151 131 110 166 145 140 125 92 71 155 127 122 277 180 115
-176A15K8J11O6j78m7OO3l2l6N2Jq2nMRPn6Q4Q9j72J11Rj18
$$ 115 143 254 320 142 95 101 164 132 96 148 149 67 62 66 75 82 26 110 199 27 138 147 29
-392B9
##PAGE=	F1=-7006.22
##FIRST=	19140.455529915001534,	4405.895418600002813,	0
##DATA TABLE=	(F2++(Y..Y)), PROFILE
4406I2m0k7L9M6MM3j01R6m7J7k3L0MK4j2k0o2O0L2q2M1k3J26j56J00j1r6P2nn1QRM9N3K6j27
$$ 92 52 25 64 110 114 157 56 152 105 122 99 129 133 157 145 125 63 123 155 73 114 91 217 61 161 150 54 126 121 70 78 87 136 189 215 88
4068H8m1J01j08R0p0l1P1rN5L4r7P6j08J00kK1J16p1j87L4n1O6k3L2J29j53J3m0L9l2J1J12
$$ 88 47 148 40 130 60 29 100 91 146 180 83 159 51 151 149 170 286 215 28 62 11 77 54 86 215 62 75 35 74 42 53 165
3767A65L8j05om2LQ9p9M8pmJJ24K4M7j55o8j9Q4mk7k0M6j0n5kj8J20mj09R6q2J05k2q5R7J10
$$ 165 203 98 92 50 53 142 63 111 104 100 101 225 249 296 141 73 54 138 134 107 87 133 123 68 66 48 168 164 55 151 69 174 152 67 164 274
3429B74j13K4n5o2K19j92j6J00pJ8j22Q8j5K2m5l9o1J49R1l9r1J0P7P1j6j4o0Jl7Q8j70N6
$$ 274 161 185 130 68 287 95 79 179 172 190 68 156 141 163 118 79 18 167 258 219 128 138 215 286 270 256 196 197 160 248 78 134
3129A34J23j67N5nq7J5N2J3o1Rm2R2J03k4n0q2k0J9K5N2m5q4O6N3J43k28K26n4j65J10N8L8
$$ 134 257 90 145 140 53 68 120 133 72 81 39 131 234 210 160 78 58 77 102 154 109 25 91 144 287 59 285 231 66 176 234 272
2828B72jl1j68Q5n3J7o9J7L1N3L2L9P6j56o4o8Q6N0J8J6j3m8J81r7j49J20J0M7L4k37P1J2
$$ 272 271 240 72 157 104 121 52 69 100 153 185 224 300 144 80 12 98 148 166 182 169 121 302 205 56 176 186 233 267 30 101 113
2528A13o8l9J12J7k7K7P7l4q3O1Om7K8j0K00j33JN5r3j0o3PL5k5r2J02j7%O5j3J1p3N0J36
$$ 113 45 6 118 135 108 135 212 178 95 156 162 115 143 133 333 200 201 256 163 153 90 97 132 107 15 117 100 100 165 152 163 90 140 276
2209B76j21n0J66r3j58L6J22o5oJK19j57n4J99N40k42l63m0j04J62j49M3M4k7j9l3J07k1j0
$$ 276 155 105 271 178 20 56 178 113 107 108 327 170 116 315 855 613 250 210 106 268 119 162 206 179 160 127 234 213 203
1936B03M5k4r3K9j45J93m5J46k02lk6J03m5k9L1N5Kj21O8L6M9K4j79l3k6J81m8R5j52j4M7
$$ 203 248 224 131 160 15 208 163 309 107 104 78 181 136 107 138 193 195 74 142 178 227 251 72 39 13 194 146 241 89 75 122
1645A22mo7l0K51J18l2k31K22N2o1K59J540m76j161k45nq9J27j09p7J23J7L3j53J19j31J06
$$ 122 118 51 21 272 390 358 127 349 401 340 599 2139 1663 502 257 252 163 290 181 104 227 244 277 124 243 112 218
1392B18L3j66N6m8J55j86J9O1l9R2K5p5j06K6P4p3j8P1Q0o5J05j48K02j95N8L7J7n1l6o7J76
$$ 218 251 85 141 93 248 62 81 142 103 195 220 145 39 65 139 66 48 119 199 134 239 91 293 98 156 193 210 159 123 56 232
1101B32j16N3jN7j73P7J38q6j18j4J54N3K6j49K5L5j69PJ21o0K5L4J9r7j4L2j5N9M3m8j15
$$ 232 116 169 168 225 52 129 267 181 63 49 203 256 282 133 158 193 24 31 152 92 117 151 170 73 59 91 76 135 178 130 15
810A5P1nL8J05j21o7O5l6j4J31j11rJ05q7m9N8J81m6j17l8J6Mk0M5k1j1j3j3J88O5o4jp8r7
$$ 15 86 81 119 224 103 36 101 65 51 182 71 62 167 80 31 89 270 224 107 69 85 89 69 114 93 82 69 56 244 309 245 244 166 69
490F9O7K1p5n4MoM5l1k8R2J0l6P5R8j7j40mo7L4R9O0L8q9K5r9KJ35q2o4l4L3K3j4j8N3Q4m0
$$ 69 136 157 82 28 32 26 71 40 12 104 114 78 153 251 234 94 90 23 57 156 216 254 165 190 91 93 228 146 82 48 81 104 90 72 125 209 169
143A69o6J7rl3L7N9o7nn0L7l1Q6N2K4n9p3p2J13j4Mk6%O6l0j0l0J9K9N2o6m1J86j12m3j0J56
$$ 169 103 120 111 78 115 174 107 102 52 89 58 144 196 220 161 88 16 129 115 119 93 93 159 129 119 89 108 137 189 123 82 268 156 113 103 259
-195B59K6j78k4pQ4j2n1J9L6o1l2K0l5J3l2J11M9j40Q9L6j33
$$ 259 285 107 83 76 160 148 97 116 152 91 59 79 44 57 25 136 185 45 134 170 37
-392C7
##PAGE=	F1=-7084.97
##FIRST=	19140.455529915001534,	4405.895418600002813,	0
##DATA TABLE=	(F2++(Y..Y)), PROFILE
4406A00n9JK1L5K8Rn8J01o1J3m2L5l3P6l5Kn7O2L4q2K6kJ10j25P7jj03Q3Rq8l5K6Q1M7J1j19
$$ 100 41 42 63 98 126 135 77 178 117 130 88 123 90 166 131 133 76 138 172 90 116 114 224 99 176 175 72 155 164 76 41 67 148 195 206 87
4068H7o6J51r1K4n7k3P4j2N9N4j22R4j15R5rM4J16q3j89M3o5J00r1P0J21j61Pl9J4L8j1R2
$$ 87 21 172 81 105 48 25 99 87 146 200 78 172 57 152 143 187 303 220 31 74 9 109 18 88 209 48 55 16 30 68 57 149
3767A49M9q3lm3J1O7p2mRj8N8Q7K3K1p9q3m9J22oo1K1L9m5n2OJ1J05Qj30J08p3J03k1j29J00
$$ 149 198 115 112 69 80 147 75 71 80 62 120 207 230 251 172 89 40 162 156 95 116 155 110 58 64 75 180 188 58 166 93 196 175 46 146
3439A46J26j14K6m1j13K26j50j7J02Kl0q0P5j2j7k9nn5J48N4jj09L9N8Q4Kk7j11J6l6J26j96
$$ 146 272 158 184 143 30 256 106 89 191 193 163 83 158 146 129 100 95 40 188 242 241 132 171 229 313 315 288 177 193 157 283 87
3138H7M4J08j30K0j6n0N0L5K1o8J2l5%J37k0p0k3q3N7QK9m2l0L1N4J64j75J39mj73R4N5P2
$$ 87 131 239 109 129 113 63 113 148 169 101 113 78 78 215 195 125 102 19 76 84 113 71 41 72 126 290 115 254 250 77 171 226 298
2828B98k7m9j59R5p8N2o5L0jO1QM1Q4j97L2q5L0L9O3J3m1o1K15p5j23O4l9N6O8j71%K3m5l7
$$ 298 271 222 63 158 80 132 67 97 96 157 165 206 290 93 125 40 70 109 172 185 144 83 298 223 100 164 125 181 249 78 78 101 56 19
2509A9J27%p0K4Q6k2q4J01j7n5j5M6J69r8m8P5p8lj2l4L4n0o6O0L1o0Q9J0k2k3K0J57j16p4
$$ 19 146 146 76 100 186 164 80 181 164 109 94 140 309 211 163 238 160 157 145 111 145 95 29 89 120 60 149 159 137 114 134 291 175 101
2190A01J71n4k02N7J38n9L3r7K55j37m0J67N85l46k80n4j72J86j39K3M0m0N7r7R5K9k7O1m2
$$ 101 272 218 16 73 211 152 185 88 343 206 166 333 918 572 292 238 66 252 113 136 176 136 193 96 191 220 193 254 212
1918B12q0M3j52J80q2J42j97M7MP7o7j2M4KJ8j13L7M9P3Mj57l3J6P3k0J56j52k5Qoj3n2K35
$$ 212 132 175 23 203 121 263 66 113 117 194 127 115 159 161 179 66 103 152 225 229 72 39 55 128 108 264 112 87 95 89 76 24 259
1608B59J39k7j57P4J60p7K89J613m25j310k45q2j23J75j52j5J18L4M8j38Q7j18K6J08k24Q7
$$ 259 398 371 214 288 448 371 660 2273 1848 538 293 211 88 263 111 96 214 248 296 158 245 127 153 261 37 124
1364A24o1J62j78P0N1n1R7N8m5j19p0O0k3J2O8M7o9P5j83K50j19o8N5K2p1L7n1J22q1M7PQ6
$$ 124 63 225 47 117 168 117 214 272 227 108 38 98 75 87 155 202 133 208 25 275 156 88 143 165 94 131 80 202 121 168 175 261
1063B61j66NJ28n5j37nJ56L5K4j33N4M8j76j6N6lL2N6j3j28O8oLQ6Po9q6M7lK1J17j04k1L5
$$ 261 95 100 228 173 36 31 187 222 246 113 167 215 39 23 79 76 108 164 151 23 91 85 88 174 181 112 26 73 70 91 208 104 83 118
744A18p4M3N4r9mR5n1m6Q9J39m4j02n9QoOO9k7o3J6oJ93P1p2j2m7p7K3Ro5l3k9J4J1k6K5O2
$$ 118 44 87 141 42 38 133 82 36 125 264 220 118 59 67 61 67 136 109 46 62 56 249 320 248 236 189 112 135 144 79 46 17 31 42 16 41 103
396A03kl7J33Q0p0j06j4m7PO7J19M3j19L2j06m1J77o6p4j3O5M3q1k1J03P4n6n6J2r0O8J6l
$$ 103 101 64 197 277 207 101 87 40 47 114 233 276 157 189 83 42 219 153 79 66 131 174 93 72 175 249 193 137 149 59 127 143 140
86A40k3n0m2L2K2L0N5P2m1q0j08J53o3l1k3N7N3m4rl6N9M9J7p1o7K08j24k9n2J86j8j55%j3
$$ 140 117 67 25 57 79 109 164 236 195 115 7 160 97 66 43 100 153 109 100 64 123 172 189 118 51 259 135 106 54 240 222 67 67 54
-233E4R2%n8nP4m8n1M9m5L8o1J07J4r7N1O8j43
$$ 54 146 146 88 83 157 109 58 107 62 100 39 146 160 63 114 182 39
-392C9
##PAGE=	F1=-7163.73
##FIRST=	19140.455529915001534,	4405.895418600002813,	0
##DATA TABLE=	(F2++(Y..Y)), PROFILE
4406A01n4J5nL1M8j5l0J05o9J1o7M6p9J33o2L4n8O3J9q2J8L1R3r9N5Jq5R4K5j20q8K8J13M0
$$ 101 47 62 57 88 136 121 91 196 127 138 71 117 38 171 109 143 85 148 167 85 103 134 227 128 183 184 99 193 218 98 10 38 151 191
4087A91pj01n9J69o2l5o5kN4rN0J01j06Q7j21P4k9P1J12r6j86O2q3J30j25R3P1j54MkM0L9
$$ 191 184 83 24 193 131 96 31 29 83 74 124 225 119 206 85 159 130 201 313 217 31 93 10 140 15 108 179 25 29 27 67 106
3786A06l4N1N3n6Rn3PN5m1o3K3rQ2O3M4m4Rr3q1J55qq6L9L1p4JK6k4J01K1j61J32n3R2j7j69
$$ 106 72 123 176 120 129 76 83 138 97 34 57 48 130 193 237 193 202 109 28 183 175 89 128 159 85 86 112 88 189 210 49 181 128 220 203 34
3448C4J09J12j13K2k3r4J62r5j3P9J4p2m6O7J5o9%J4m2J43JM7j44R8K6P6Qk6j61M6l2J56j93
$$ 34 143 255 142 164 141 47 209 114 101 180 194 122 76 143 158 89 89 103 61 204 205 252 108 206 232 308 316 290 129 175 143 299 106
3138A06M6O1q1k8k4pP7K0J9o5J8rj17J67Oj18M6q4L2nJ5k9M4l0M0J74j14N4K9j72R3L1R4n7
$$ 106 152 213 132 104 80 73 150 170 189 124 142 133 16 183 189 71 117 33 65 60 75 46 90 60 100 274 160 214 243 71 164 195 289 232
2819B32n6j30R2j00R6n0L7m0O1j0M8Q3k18J22r6l3L7Q3Rm9m7J97m4q6J1p0M3J10j09o5K5j6
$$ 232 176 46 138 38 134 84 121 81 142 132 180 263 45 167 71 38 75 158 167 118 71 268 224 138 149 79 122 232 123 58 83 67
2519F7j2R1kp4J5M9Ql3P8l4n2k5O9J18n1j00R6o5jL7n2L1o5l7KP0r1J04K7n8L3KJ41q3j28
$$ 67 55 146 144 70 85 134 142 109 187 153 101 76 145 263 212 112 208 143 142 179 127 158 93 56 58 128 37 141 168 110 143 145 286 203 75
2190G5J76j6k14N2J31l9Q9k03K94j00k6J38O35m81k02o4j99K12j47j3K7j9J36j05lO5k3O7
$$ 75 251 235 21 73 204 165 254 51 345 245 219 357 992 511 309 245 46 258 111 98 125 106 242 137 134 199 176 243
1927B43k8r2N8j48J55j10J28j48M7N4L1q6J9N3k9Qr6RP6O1k5j16m9O9K1n7K00j15k4l9l2O0
$$ 243 215 123 181 33 188 78 206 58 105 159 190 104 123 176 147 155 59 68 144 205 180 64 15 84 105 48 248 133 109 70 38 98
1626I8k0J42J68k8p3n9K52q5L45J692l51j496j74j61j56J42j38l9J04O0P6j13N0r1n6J64j97
$$ 98 78 220 388 360 287 228 480 395 740 2432 2081 585 411 250 94 236 98 59 163 223 299 186 236 145 89 253 56
1373E6M0n5J51j62J09O0n5P4Q7k0j03n1p7J1N2P1J5p3N9j39J84l1j77O0K1q7J13l8P1l1K5
$$ 56 96 41 192 30 139 199 144 218 305 285 182 131 54 65 117 188 203 130 189 50 234 203 26 86 107 20 133 95 166 135 160
1082A60J0J12j60n2J04%j48J9J28rL7r4M9P5j38p1NM2K0P5m6n4N6o4M1R8l1o9n3K2oRJ14o9
$$ 160 170 282 122 70 174 174 26 45 173 164 201 107 156 231 93 22 27 69 89 164 118 64 120 56 97 195 164 95 42 64 58 67 181 112
763A12L8%r0N7k0k8m2J03J9p2P6R4m6q0n7k7pL0R5l7r2M4lJ76O6p9l0j7k4j7k4l4j7k6j5M5
$$ 112 150 150 60 117 97 69 27 130 149 77 153 247 201 121 64 37 30 60 155 118 26 70 67 243 309 230 200 183 159 142 118 84 67 41 26 71
425G1RKK9jn3J60O3j12o2ok4oPJ67M2j47L6j00k8J58m8q5oJ05N4j25k6J29O4o5l5Mj40J60
$$ 71 80 82 111 110 57 217 280 168 106 100 76 70 77 244 286 139 175 75 47 205 157 72 66 171 225 100 74 203 267 202 167 171 31 191
105A91l3o2L2j09L1L5J5qM1J05j4q7j31J86j01p0jR2L3n5Jk7P4L2j5m3p5K11j38qo9J68n5
$$ 191 158 96 128 19 50 85 100 92 133 238 224 137 6 192 91 21 20 112 145 90 91 64 138 170 155 112 37 248 110 102 33 201 146
-205A46j00NOP7Ol4k0Q2m4o0P4m8M6r6J03j1o0J1J02j46
$$ 146 46 51 57 134 140 106 86 168 124 64 138 90 136 40 143 132 72 83 185 39
-392C9
##PAGE=	F1=-7242.48
##FIRST=	19140.455529915001534,	4405.895418600002813,	0
##DATA TABLE=	(F2++(Y..Y)), PROFILE
4406I9l5Rk5L4N7k0k2J02o6K3q5N2j11J51p9O6n9N9qq5J7O5Q5q3M1j4m3Q8L2j37p5j7J34L5
$$ 99 64 73 48 82 139 119 97 199 133 156 71 123 12 163 84 150 91 150 142 57 74 139 224 141 182 168 125 213 245 108 33 16 150 185
4087A85k7r0k6J69m3o0q8K2J9J0K6J52p3O8j37N5n1R7J04j08j77Q1q5J45j29R6kj27M3NO7
$$ 185 158 68 42 211 168 108 20 42 61 71 97 249 176 244 107 162 111 208 312 204 27 108 23 168 39 135 133 6 49 54 121
3796A21K2n3MM6l1K5o3j2N0Qo7j4L7N3N4Q9j33R3r9r5J61kj08L6K5r7O8J6n1J08L4j92J63
$$ 121 143 90 94 140 109 134 71 59 109 117 50 36 73 126 180 269 136 229 130 35 196 194 86 122 147 50 118 134 83 191 225 33 196
3486A96l4P8j0j95J19O7j08K2Mn1P1l7pK7L3q4l5O2N6j04L4ok7J41n8R3j83J74j5N4jj5k04
$$ 196 162 240 230 35 154 221 113 135 139 88 159 122 115 142 175 91 56 118 174 70 104 98 71 212 154 247 64 238 223 277 276 261 57
3176E7R0j2J65j69N1jl1p0m1M2Q8J1Rn2J0L7j17P6N3j74Q7m4k1pJ4nR3q4J6J70n4j9L9j60
$$ 57 147 135 300 131 182 181 150 80 39 81 169 180 189 137 147 184 67 143 196 22 109 65 44 37 51 46 139 55 71 241 187 168 207 47
2857D7J07pJ03q5n3q7P1p0R9k4L4q3N1rN7P1j76J54j03o7J6P5Oj7j2J17j2m3k2n6j1J39n2
$$ 47 154 147 250 165 112 25 96 26 125 101 135 52 103 94 151 222 46 200 97 30 46 121 127 110 98 215 203 160 138 82 71 210 158
2547A58j14J7K1K0J4L5m5j9j5N8M2jl9l9MM6N8oq6R6p3j3O5m4L1p7jk5N4p7R9L6r9P4J0R5
$$ 158 44 61 82 102 116 151 106 87 72 130 172 171 132 93 97 143 201 195 109 205 132 119 184 140 171 94 93 68 122 45 144 180 81 155 165 260
2209B60k9j90J75J1j97K4J26l1J49k76L25n8k2J33O93o07j69o8k04K24j41n2j3L5J68p6j06
$$ 260 231 41 216 227 30 54 180 149 298 22 347 289 267 400 1093 486 317 249 45 269 128 76 63 98 266 190 84
1955H4O6nO3Qj10Q1j33J25j13Q4p8NJ05j5j01O7N7m2j5p0j6J15K4p2o8k1P1M1j11J66n4%o0
$$ 84 150 145 208 216 106 187 54 179 66 150 72 77 182 167 66 133 190 148 133 63 47 162 186 114 46 25 96 137 26 192 138 138 78
1645G8k9M8L4K9J98j6jj25K98o3L94J867l08j746j05j72j71K8m6j39K7Q2J22p9J6n8p7J46
$$ 78 49 97 131 160 358 342 341 216 514 451 845 2712 2404 658 553 381 210 238 192 53 80 162 284 205 221 163 86 232
1382B32j08m7j9R8j41J34Q1m8L1J07mp7k6j65mR1P8j2p6N8p9P0N2j48m2M1k2P6l2L0K5%nJ30
$$ 232 124 77 58 156 15 149 230 182 213 320 316 239 213 48 44 135 213 201 125 183 104 174 226 78 36 77 55 131 99 129 154 154 149 279
1063B79j50q7P9N7j47M6Q3o4Q1o3J7J08j10j05L1NLQ7p0K4J5r7Q2Q9o4n1j9kj0MR1j3R5l0
$$ 279 129 42 121 178 31 77 160 96 177 114 131 239 129 24 55 60 63 150 80 104 119 22 104 193 129 78 59 57 47 51 142 129 224 194
744A94j15N4o2L1p1J39M9j00N1N0n0n8l8p0O0%J13n7o4M0MJ37M5q9n2J0O0n3p4KLl3l4J05
$$ 194 79 133 71 102 31 170 219 119 170 220 170 112 74 4 64 64 177 120 56 96 100 237 282 193 141 151 211 158 84 86 89 56 22 127
425A27J7k2jJ6p6J47M3j31j2J6k0j5l0J91K8j61M1q9K5R4k9j06j2J41N8j37k2J24N5o3j0k
$$ 127 144 122 121 137 61 208 251 120 108 124 104 89 59 250 278 117 158 69 94 188 159 53 41 182 240 103 81 205 260 197 187 185
124A85j31J87q1j10Q6r3K8N1nqkJ18J3r4j33K10j23k5oN1J8n7J6KN6j7l9Oo1J96j54K9m3Q3
$$ 185 54 241 160 50 136 43 71 122 117 109 107 225 238 144 11 221 98 73 67 118 136 79 95 97 153 136 97 103 42 238 84 113 70 153
-195A53p4j1k3L1N2J7Mk6O5n3o7R2n2M2j22J05k8k7k6J30j43
$$ 153 79 68 45 76 128 145 149 123 188 135 68 160 108 150 28 133 105 78 52 182 39
-392C9
##PAGE=	F1=-7321.24
##FIRST=	19140.455529915001534,	4405.895418600002813,	0
##DATA TABLE=	(F2++(Y..Y)), PROFILE
4406I9k1ll9M0N4j3k0Q6n1N2q6M2j02J06q2Q5n2N0l9q7J9Q9Q3p8M1m1PO5K8j30l2k7R8L5m3
$$ 99 78 75 36 76 130 117 97 183 132 184 98 140 38 144 62 147 95 145 106 19 38 127 210 132 173 132 139 204 232 102 70 43 141 176 133
4077A33r3K9J52l0o0r5K3j1M0jJ78m0M5j54L5n9J13R5j16j69R5o9J52j42J08o8o8P7j5Q1P
$$ 133 40 69 221 191 131 36 59 48 88 87 265 225 270 116 151 92 205 300 184 15 110 41 193 51 159 91 23 100 85 166 173
3786A73o7m1K8rM0n9m9N0O3l7p1P9J9N4J34k12J58r8j01J44Nj20K1K2j17J37j7o7J22M5k11
$$ 173 106 65 93 84 124 65 16 66 129 92 21 100 119 173 307 95 253 155 54 198 203 83 104 126 9 146 129 62 184 229 18
3495A8J96k6O0kk04J23Qr7L1L8k3pJ8om6O4n4m0N4Q1r9N2m6j9J41j19J28j89K27o0K9k6%j72
$$ 18 214 188 248 246 42 165 173 76 107 145 122 115 133 127 81 145 91 51 105 186 87 139 93 74 215 96 224 35 262 202 231 205 205 33
3176C3Q1L2J42j32M6n8J0q2n9P5P8J0ok9j5Q9q5k7J13j43KQo5K5J5J5J08j26JJ38lp8L2j10
$$ 33 114 146 288 156 202 144 154 72 13 88 166 176 170 141 126 215 130 103 216 73 75 83 18 43 58 73 181 55 56 194 191 113 145 35
2857C5J08n0J08j10m7j8J6L7K7J1K3j30L2K8N2N1q6J30j06o6k7N1PM5QJ8J1Qk6l5o8J39jj30
$$ 35 143 93 201 91 44 26 42 79 106 117 140 10 42 70 122 173 87 217 111 45 18 69 76 121 129 147 158 166 140 105 37 176 175 45
2537D5ON8M4q7J18l1o6k6P6R3r1l3k0M5MJK7lQ1r8l5N4k1M0q8M3j6j6m7R6M3j45R4M6K9L4
$$ 45 51 109 153 66 184 153 87 61 137 230 139 106 86 131 135 136 163 160 241 143 108 162 141 181 93 136 120 104 57 153 196 51 145 191 220 254
2199B54k03J30K7j68%J53o5J84k65L08k3k3J59P42o93j78o4k21K19j08o5n9O5J49l4j43J4
$$ 254 51 181 208 40 40 193 128 312 47 355 332 309 468 1210 517 339 275 54 273 165 100 41 106 255 221 78 92
1946I2J8M7M7j16J10j16J15j00K1l9m7J41l4j24J29N6n3k1m9m5J53Lj49kL0K8Q0p3RJ1M5m4
$$ 92 110 157 204 88 198 82 197 97 118 79 32 173 139 15 144 200 147 126 77 32 185 188 39 37 67 95 175 102 111 122 167 123
1645A23Mn6J03q0K17K3N0j23L00J1M26K186l35k074r5j39k08n8J8j65j06O1J75l9j4l0k4O2
$$ 123 127 71 174 94 311 334 384 261 561 572 998 3184 2849 775 680 541 333 275 293 128 22 83 258 219 205 175 151 213
1382B13k6q7qL8j17J35J06l4j2J10J0n4mj83n3J09Q1k6q2O6l7m1J18q4r1P1%J0l9J0P6j6m5
$$ 213 187 100 92 130 13 148 254 220 208 318 328 274 270 87 34 143 224 198 116 182 145 104 222 138 47 118 118 128 89 99 175 159 114
1072A14J31j27r5P5P9j40O5L9j03J50o5k7J33r3j02M7Ll6Q2p1O4l6k2M6N6q3k3J2k1jpM9N5
$$ 114 245 118 23 98 177 37 102 141 38 188 123 96 229 136 34 81 84 48 130 59 123 87 65 111 167 84 61 73 52 51 44 93 148
763A48J41m6j54M0n4N1p8J68N2j14K3J0n6m0j1l4P6m0J18q5k8L7K6R2Nj02p4K9J64q5j27K9
$$ 148 289 243 89 129 75 126 48 216 268 154 177 187 131 91 80 46 122 82 200 115 87 124 150 242 247 145 71 100 264 179 52 81
462H1K3m9j2J29K1m1k4M4r0Q6K5j26L9M6k7l2l2J88kj55N2p6O3L9j2j33j5J49N8j24KR1M2
$$ 81 104 55 43 172 193 152 128 172 82 168 193 67 106 152 125 93 61 249 247 92 144 68 131 170 158 25 10 159 217 93 95 186 228
152B28n0J8pj11J91j09j31J15m7k1O7j3J1n5J13L0r8r0K01j33J7k3J2Om4L1M2J7q6m9N8l2
$$ 228 178 196 189 78 269 160 29 144 97 76 143 130 141 86 199 229 131 41 242 109 126 103 115 121 77 108 150 167 81 32 90 58
-148E8J71j62P1k9kl5L0n0L9K7L9L3l1N0o9q1J01m7K9j22J01l5Jm7J38j31
$$ 58 229 67 138 109 107 72 102 52 91 118 157 190 159 209 140 59 160 113 142 20 121 86 87 40 178 47
-392D7
##PAGE=	F1=-7399.99
##FIRST=	19140.455529915001534,	4405.895418600002813,	0
##DATA TABLE=	(F2++(Y..Y)), PROFILE
4406A06k2j5m3M5L3%j5O0k5R0p9J8j12Q5p7P8l4M1n4j9l4P5Q3q3N5p3N5L0J5r0Pk3M3L8n0
$$ 106 84 69 26 71 104 104 89 149 124 214 135 153 41 126 49 127 93 134 80 61 27 102 185 102 157 84 139 169 184 94 101 78 121 159 109
4077A09r6R1J16j6m8r5J3k6N9j0J69j1K7j60Kn0J20Q4j19j56R5m0J52j57J18r4m9J24m4R2
$$ 109 13 104 220 204 156 61 74 48 107 97 266 255 282 122 124 74 194 278 159 3 98 58 210 53 171 77 28 152 108 200
3796B00op5p6jJ1N1k8k4mQ4mj07R1J9N2J54k67K00r0j10J16Rj18MK3o1J31o5p9J38N1j96K14
$$ 200 194 119 43 42 53 104 76 52 48 132 128 21 112 131 183 337 70 270 180 70 186 195 77 81 104 43 174 109 30 168 219 23 237
3486B37l4L4Ok01J17m4n8L4O9j5o3O5j4j03R6j8l2N4O5q3O5o6k6J38j71J36j09J95j05J0o1
$$ 237 203 237 243 42 159 115 57 91 160 145 82 147 133 30 126 108 76 130 195 112 177 111 85 223 52 188 79 274 169 179 118
3195A18J6j7l7R2R7r0K3r7L5o2rL1M8J0k2Ln1J29m7q8J56j03j12O0o2O1J4J0J02j54J7P1L3
$$ 118 134 117 80 172 269 179 202 105 140 78 69 100 148 158 136 139 88 217 170 82 238 135 23 83 21 82 96 106 208 54 71 142 175
2885A75j14J6MN3p0J05r5l2J9lO3m0M8J1j01mN3J3K2lR4j05n6l9L3JQ6J1p3K6O5pm6q8J05
$$ 175 61 77 81 134 64 169 74 42 61 58 121 81 129 140 39 35 88 101 123 120 214 109 53 14 47 48 134 145 72 98 163 156 110 22 127
2556A27M8j12lQ9N0j90K23m3j16M0L9J13j71j5%Q5l8m3M6P5Q2j22m2%J2N0r4Q5Kr7j7R4N8
$$ 127 175 63 60 149 199 9 232 189 73 113 152 265 94 79 79 164 126 83 129 204 286 164 122 122 134 184 90 175 177 80 63 157 215
2246B15j81Q3J01m4R2j65O2L5j51K6J87j06J44k17K79Qk7K08P71p53j96n1k50J94o7n0n5K3
$$ 215 34 117 218 174 266 101 163 198 47 73 260 154 298 81 360 368 341 549 1320 567 371 320 70 264 197 147 92 115
1983A15J05Rj23k9J9K2O4j11J34j01J32j04rm2l8R5lq8J03N6p6Nm8p4J82K1j76K7L3j0J02
$$ 115 220 229 106 77 96 118 182 71 205 104 236 132 123 81 43 138 135 47 150 206 130 135 87 13 195 216 40 67 100 90 192
1692A92k4r0NJ06j7L3j80J78j35J82P7R8j12K87J19M45K538m15k381j35r5k44j20M3j54j00
$$ 192 168 78 83 189 172 205 25 203 68 250 327 425 313 600 719 1164 3702 3287 906 771 676 432 312 355 201 101
1448A01k9J57%l8j5L3oK8q4k9J2j11J17J25j4l3Q9L2m2Oj77o3Q1Q0k4r3P6j3j24J56k4r0R4
$$ 101 72 229 229 191 176 209 203 231 147 118 130 19 136 261 247 214 303 335 293 299 122 59 140 220 196 103 179 166 42 198 174 84 178
1138A78j3l7o0J7J06j4j02J07q8p6R1N8j25O7Nq7J81q0p6J43q3o7M5O5p8N2m2L5o7O9qNp0
$$ 178 165 128 68 85 191 177 75 182 94 18 109 167 42 109 114 27 208 128 52 195 112 45 90 155 77 129 87 122 55 124 116 121 51
828E1LK6l1K6m0PJ16J71m1j94J0j4M9o2J64M4j05nk5o5k4J9PQ3o4J20j20%L7N6O0m5j17n9
$$ 51 54 80 49 75 35 42 158 329 288 94 104 90 139 77 241 285 180 175 150 85 61 80 87 170 106 226 106 106 143 199 259 214 97 38
509C8K3K46j11j62L5M2p2L5J18K4n1m0Q0q7rOj00Q6Q1m1n8j8J69l8j29O5o6Q3KJj07K4M3M9
$$ 38 61 307 196 34 69 111 39 74 192 216 165 125 205 118 109 115 15 101 182 141 83 65 234 196 67 132 66 149 151 152 45 69 112 161
190A61r1M6L8K2k6N0j6r1J82j08j08R3j3p3P5oK8r2Q7L6r6j8J72j40M7l9k0%k1M3Q2k9j51
$$ 161 70 116 154 176 150 200 184 93 275 167 59 152 139 66 141 135 163 71 158 194 98 80 252 112 159 120 100 100 79 122 204 175 24
-120B4QM0MJ45j48R4l1o1L1K7p0L9pO8M8l6M6q3j01R9l3J4p3O8l8K4m5J21j10
$$ 24 32 72 76 221 73 167 136 75 106 133 63 102 95 163 211 175 221 138 37 136 103 117 44 112 74 98 53 174 64
-392F4
##PAGE=	F1=-7478.75
##FIRST=	19140.455529915001534,	4405.895418600002813,	0
##DATA TABLE=	(F2++(Y..Y)), PROFILE
4406A19l5k2m7N0lJ6mK9PJ27p2j6j15R5p8L3%L1k7L1o7K2P9j00P9q3P3LNk0Oj2j5M2m5m1R3
$$ 119 84 62 15 65 62 78 74 103 110 237 165 149 34 129 51 84 84 115 88 119 52 74 153 53 132 49 122 125 130 110 116 104 89 131 86 45 138
4058A38P1J1m1r6Kl6O0nJ44J6J8j42n3l1J17Q1j17j17O0j1J46j62J20p8o4J66p9J04j5p9r4
$$ 138 209 220 179 83 85 49 109 104 248 264 282 140 87 56 173 254 137 20 80 69 215 53 173 95 31 197 118 222 207 128 34
3767C4qjO2J4J1k5L4L1j21Q3N9M1J41l03K25p4j21P9Kr1j1K8KJ10j09q9J46M8j53K18n0mJ3
$$ 34 26 25 87 101 112 87 121 152 31 114 173 214 355 52 277 203 82 161 163 72 61 89 91 201 92 3 149 197 44 262 212 208 221
3458B21j93R9p1L0PQ6k6r3J04k5n1N4k9j2Q0K7q2P7n8m1J32j87R4j7J40j40Jq1L9J04j34J43
$$ 221 28 127 56 86 93 179 153 60 164 139 88 142 113 101 181 208 126 203 145 104 236 49 143 126 266 126 127 46 85 189 55 198
3157A98N4n5j4j06K9k4M3nJ7pl3L8q2J33j2r1J67o8j44L3k0P8J5j3Q4j64M9KM8p3j7Q3j4l7
$$ 198 252 197 183 77 106 82 125 120 137 130 97 135 53 186 174 83 250 182 38 71 51 129 144 131 215 51 100 102 150 77 60 143 129 92
2838I2Q4l6m7RK2J9q4P6Pn3K9Ol4qN3N3r7m3mM7nN1Nj34M1J18J3q9p6N9R2p5j7J24L2j90K33
$$ 92 176 140 93 102 124 143 59 135 142 89 118 124 90 82 135 188 91 48 44 91 86 137 142 8 49 167 180 91 15 74 166 91 74 198 230 40 273
2490B73o9j57J05QJ08k23J0J6J21o9n8M6J02R4j40k3o0M1N7r7J18K0j62RQ2Q3j67J2J60j09
$$ 273 204 47 152 160 268 45 55 71 192 123 65 111 213 307 167 144 84 125 182 85 203 223 61 70 152 235 68 80 240 131
2209A31J35j15OM7j54P0K19j15M6j55K39M1l3K65P72q00k13k5k68J42l4j4n0j8P2L8j03jj2
$$ 131 266 151 157 204 50 120 339 224 270 115 354 395 362 627 1399 599 386 361 93 235 201 187 137 119 191 229 126 125 113
1936A13K2M7j27J39q4J59j19km9KLP7o6L0N8j08N3o4o2J62P4j39qJ1k4P8L5m9j29J63J3O3
$$ 113 135 182 55 194 110 269 150 148 99 101 104 181 115 145 203 95 148 84 22 184 258 119 111 122 98 176 211 162 33 196 209 272
1636B72k21J77j04N0J20J64j07K43K39M67K789n12k582j63p2k55j78M4j24r5j4O0L7n6j2O7
$$ 272 51 228 124 174 294 458 351 594 833 1300 4089 3577 995 832 760 505 327 371 247 152 138 198 235 179 167 234
1392B34l6M8n5o0J9j27Q9J30Rk6M7P4l8Mj69m7L2P6lj10P5Jj12J16J5q2J24l0o6q7M2J08N
$$ 234 198 246 191 131 150 23 112 242 251 225 272 346 308 312 143 96 128 204 201 91 166 167 55 171 186 104 228 198 132 45 87 195 200
1082B00j38M1l1n6J04K8j01M8rm8J76q2j28J32o9j2M1J44j15L9k7k7j4P7o2m5JoJ6l1N8q5
$$ 200 62 103 72 16 120 148 47 95 86 38 214 132 4 136 67 55 96 240 125 164 137 110 96 173 111 66 67 61 77 46 104 19
781A9j7J48J84j4k14m7L7M9l5J24L5p1l2n4p1j1N0L6Q0o4J18j50J3K9Q7M4q3j27L1j1K48j26
$$ 19 2 150 334 320 106 59 96 145 110 234 269 198 166 112 41 30 80 116 196 132 250 100 113 142 229 273 190 63 94 83 331 205
481B05j68J8N0q1Q2Q0K3n0m7J16o7r9k5qO3J14n0r0jJ34n9r4O9n5Q5j5J1m5L2p3L6n5J01j8
$$ 205 37 55 105 24 106 186 209 159 112 228 161 62 37 29 92 206 156 66 65 199 140 46 115 60 145 130 141 96 128 55 91 36 137 119
162A19j2J4Q1l0o8J64q8q6O6Nj15O7J5L2j00M0L6q9O8J26j43O6n3l9kOM8J14p2j27K6j8M0
$$ 119 107 121 202 172 104 268 180 94 160 165 50 117 132 164 64 104 140 51 119 245 102 168 115 76 74 80 128 242 170 43 69 51 91
-148I1J17j16R9m1r1O9L3r1N0n7R5M9l7M8q8j21Q4j6LjL3m4L9l6R5q2
$$ 91 208 92 191 150 59 128 161 70 120 63 158 207 170 218 130 9 93 77 80 79 112 68 107 71 166 84
-392H4
##PAGE=	F1=-7557.5
##FIRST=	19140.455529915001534,	4405.895418600002813,	0
##DATA TABLE=	(F2++(Y..Y)), PROFILE
4406A36n4k4n4O0m4K9NJ0L0J53o5n3p0J02r4m2L9K7K3M6r5rO6j17Q9k7K6J2K7J9m2Po3M0l1
$$ 136 82 58 4 64 20 49 54 64 94 247 182 129 59 161 67 25 64 91 114 160 65 56 122 5 94 67 93 105 132 151 109 116 53 93 62
4077F2J6R0L0M5m6r7j1m5M8JJ17M3K2j03j14k5J11R5j08r1K5J0J33j49J09n1n7J68j16J23
$$ 62 78 168 198 243 197 100 89 44 92 93 210 253 275 172 58 33 144 239 131 40 65 75 208 59 168 117 60 228 112 235
3796B35k0q3q5K3m9P0L3L6l4l1O6j16P2J10K9J09l23K28n2j27L7j7k8l0L2M9Q9j40n6J06L5
$$ 235 215 132 47 70 21 91 124 160 126 95 161 45 117 227 256 365 42 270 218 91 128 111 83 53 85 134 223 83 27 133 168
3504A68j03K22o6n5K1j73N4j4P6j7Q1m7j02J37l3MK3p5RJ21jj03Q6l8n6J25j80L6N4Q3j53
$$ 168 65 287 221 166 187 14 68 54 130 113 194 147 45 182 149 153 176 101 110 231 230 127 213 175 119 244 64 100 154 237 84
3213H4oKK7J32j94J71K9l1n7q9%J7R1l1Mn0l7O7o7O6Qn2J54l1j14l6K3R4J3m6N8j53Q1m1N1
$$ 84 78 80 107 239 45 216 245 214 157 68 68 85 176 145 149 99 62 129 62 128 136 84 238 207 93 57 80 174 187 141 199 46 127 86 137
2885A37Pl2Q4o8J7O7jq3J2M4m2q9Q4Oj3O4l8o8k7O8J1p8k2L2O3knkq0L4J10J7j55j7K1J06
$$ 137 144 112 196 128 145 212 211 128 140 184 142 53 137 143 130 194 156 88 61 129 140 62 40 72 135 133 128 126 46 80 190 207 52 35 56 162
2547A62l7l2J49Jj77K22r4j75J46j3R1k32L0K1J52q0o2M9O3J14j54J0q3N3N1r2J35L4k03M2
$$ 162 125 93 242 243 66 288 194 19 165 152 243 11 41 62 214 134 72 121 184 298 144 154 71 124 175 83 218 252 49 91
2265I1M5J16j32p3K10j58J55n8m7O3j65J10K39r9n0r8J87P5l8L03P54q23k43J3k56O0j4L6
$$ 91 136 252 120 47 257 99 254 196 149 212 47 157 396 297 247 149 336 411 373 676 1430 607 364 377 121 181 167 203
2002B03l7m5P3M0j11M9l9N0M8j76J03o4J83j28K2l1J4m7J48p3o1O7j33J10r2k1J00J44r7m4
$$ 203 166 121 194 234 123 172 133 183 231 55 158 94 277 149 171 140 154 107 255 182 121 188 55 165 73 52 152 296 199 155
1720A55Jk7j2J06L7j61Q9M7R9k02J49n4p2R2K55p0J33L75N49L142o38k929j13j10k32k43K2
$$ 155 156 129 117 223 260 99 188 235 334 132 281 227 155 247 502 432 565 940 1489 4631 3993 1064 951 841 609 366 388
1467C88j09r2J5m3Q6o0j9O9k8K5lq9L3j34O0J00L3Lj3J35k1Kj77k3k9P6L6j29M4J5n4P6J7
$$ 388 279 187 202 159 245 185 166 235 207 232 229 140 173 39 99 199 232 235 222 357 336 338 161 138 109 185 221 92 136 151 97 173 190
1157A90q5J62m5q4r1N5Q3L4j24m8J6l0Q2J2p8J6K6n9J72o2o7j1n1N6L8K05j40M9l1q8O3L5
$$ 190 105 267 222 138 47 102 185 219 95 47 63 33 115 127 49 65 91 32 204 142 75 64 13 69 107 312 172 221 190 102 165 200
856B00j07n7O3k4nl1R1j05OQ9J83L5k07j30Q9N8j1N7L5j9n8p5m7j5P2M2O5l6J09j67J1KJ16
$$ 200 93 36 99 75 70 39 130 25 31 120 303 338 131 1 90 148 137 194 229 210 152 77 30 15 87 129 194 158 267 100 111 113 229
547B29M6q8j29Q4j1K02j28j61NM1m9R0L0J7l9n1J48l6j14l5OK0J43m8j18J7P2k8q1N5l8P1
$$ 229 275 187 58 142 131 333 205 44 49 90 41 131 161 178 139 88 236 200 86 51 57 77 220 172 54 71 143 115 34 89 51 122
246A22j7J7K2L2j72L8k4J33n9n9P9R4n2m4J45o5o9M7J1j21J9M0K0p1k1M3o3J27O5j40P4o2
$$ 122 105 122 144 176 4 42 18 151 92 33 112 206 154 110 255 190 121 168 179 58 77 117 137 66 45 88 25 152 217 77 151 89
-54H9m1lK9M5J34j01p3Qo0P1R2q2R6n4r2P3N2j07P3j11J03L9l3N1q1q6J3kOO5Rn6M4k3O8n2
$$ 89 48 45 74 119 253 152 79 87 27 98 190 108 204 150 58 131 183 76 149 38 141 180 147 198 117 31 44 42 48 113 122 66 110 87 155 103
-392A03
##PAGE=	F1=-7636.26
##FIRST=	19140.455529915001534,	4405.895418600002813,	0
##DATA TABLE=	(F2++(Y..Y)), PROFILE
4406A52o6k5l8M2qj6%J9J7J67n9q4KJ00j08k9k4K3O6M2j14JM3l7j9O1n5O6P0Pj18L5p7J6j5
$$ 152 86 61 23 65 57 41 41 60 77 244 185 101 103 203 95 66 42 65 131 173 59 60 103 66 47 108 53 119 189 196 78 113 36 52 37
4077C7N8R4J5O8o7r4k4m4L0j0R5P1L3n9j46n3J06J25r1q6%K3J14j22R0l3k5J37j48J51k6q7
$$ 37 95 189 204 272 205 111 87 43 73 63 158 229 262 203 57 4 110 235 144 58 58 81 195 73 163 130 105 242 94 245 219 132
3777A32o0L7p6Q3K4M8m2q9R8r5O8J47K0P9l25J98k6j20pl8O4o1L2P8O6j65k5P9J2n6K23p1
$$ 132 72 109 33 116 140 188 146 57 155 60 128 275 295 374 49 247 221 101 94 56 120 59 91 169 235 70 45 124 136 80 303 232
3476B32j08L8j09m1J04N0k6O0p0q5J53l7L6J0j24J5J66qj35Q9k2o4J11j68J0Q0L2j31k2J00
$$ 232 124 162 53 12 116 166 140 200 130 45 198 161 197 207 83 98 264 256 121 210 188 124 235 67 77 157 189 58 36 136
3195A36J4J10k15J74L3j6r8o8mM0J13n4J3j01m3Q4k7k9MNJ30J2q0p8N1J05Nq3K8j26J08o0
$$ 136 150 260 45 219 252 236 138 70 66 106 219 165 178 77 34 118 91 62 66 71 201 213 133 55 106 211 216 133 161 35 143 83
2894H3O7N5l8O6j04P3N3J2j25K7N6j01n8P1kJ6J02p4r1k7M3k5m4NN6O8No0Jm1O7R0Lk16N7
$$ 83 150 205 167 233 129 202 255 267 142 169 225 124 66 137 135 151 253 179 88 61 104 79 35 40 96 164 169 109 110 69 136 226 229 13 70
2565G0K3P6j1l4J48l1j78K11j08j52J40k5P7j67OJ1J73p1q8P8j6J40j71M2o7N5L5q2J41L9
$$ 70 93 169 158 124 272 241 63 274 166 14 154 129 206 39 45 56 229 158 70 148 132 272 101 143 76 131 166 84 225 264
2284B64k24Q3j2J52r6j32K37j90J47Mj03P2j68J42K41p6r6p1J33J03k5L02P32q05l06O2k14
$$ 264 40 123 111 263 167 35 272 82 229 233 130 202 34 176 417 341 245 174 307 410 385 687 1419 614 308 370 156
2030A56l7mP1Kn1P6L3j46R8o0Q7Q2k09Om6J98j21N3PLo2J98q9j67Q6j11J40j13KL3K06l6r0
$$ 156 119 115 186 188 137 213 246 100 198 138 225 307 98 104 58 256 135 188 195 198 136 334 245 78 164 53 193 80 82 115 321 285 195
1720A95L2m6j53J86J30j24l0Q4J28j71J60j3o1nL09K0K4N21Q00M188q29m033m0k14k26k96
$$ 195 227 181 28 214 344 220 190 274 402 231 391 378 317 312 621 641 665 1186 1986 6174 5345 1312 1272 1058 832 536
1476E36l0j41q7J3j36J28m0l4N9Jo2P0j02K4j28Q0J7M6K8r2K10K6J5k05j0q6Q1P8j38l6M5
$$ 536 506 365 278 291 155 283 243 209 268 269 207 277 175 199 71 151 168 214 242 150 360 386 401 196 186 100 181 259 121 85 130
1185A30nR5nj24K07n6r7p1M7L9P2r2m5k9OK5J8o1j9R9q8J49l6oj10j0O4J7K42j47P1m3j33
$$ 130 125 220 215 91 298 242 145 74 121 160 232 140 95 66 72 97 115 54 35 134 46 195 159 153 43 33 97 114 356 209 280 237 104
875A04J16j9j43J8M3l7j5m0J21q9k1M6J66R0j79r7J3P5kj9N0L4q2q4J3l6P0K7M3J6R3j66m
$$ 104 220 201 58 76 119 82 67 27 148 59 38 84 250 340 161 64 77 152 150 131 181 215 133 49 62 26 96 123 166 182 275 109 105
565A05m8J40P2o3j30R2NJ41j15j54RJ3JP8j9Oj2o3J72%r6l6l2qJ65l5j34L6j2P2j15J4rN3
$$ 105 57 197 269 206 76 168 173 314 199 45 54 67 68 146 127 133 121 58 230 230 134 98 66 58 223 188 54 90 78 150 35 49 40 93
246I3j5K1Q1K4j77L8j9J06p2l2Q2P4p7j8J28m4n5L5J4q8o5N8qrj7K9j6J02nj22O8n9l0pM2
$$ 93 78 99 180 204 27 65 46 152 80 48 130 204 127 109 237 193 138 173 187 99 34 92 84 75 58 87 71 173 168 46 114 55 25 18 60
-83F0L4J40j09k9Jq8Q4O9m9Q9o5o7N2P4j14R3j34P7K1k8N7o5m6j7OK0P2Jp0L8qL9k3
$$ 60 94 234 125 96 97 9 93 162 113 202 137 70 122 196 82 175 41 118 139 111 168 103 57 40 46 66 138 139 69 107 99 138 115
-392A15
##PAGE=	F1=-7715.01
##FIRST=	19140.455529915001534,	4405.895418600002813,	0
##DATA TABLE=	(F2++(Y..Y)), PROFILE
4406A63o7k1k2RM3n2MK1j7J68m7r7N7J00j09J3j05PP7L2j12L0K2K2p0R5j38J32J04j2k00O7
$$ 163 96 75 53 62 105 53 57 78 61 229 182 85 142 242 133 146 41 48 125 157 45 75 97 119 49 144 6 138 242 230 30 97
4105I7m3l6LP1J13K1P4r4q8l6k4K9o2P6J04L9k2j51m3M6J63p3q6k5M1R0r4P0k7J4R2j66J83
$$ 97 54 18 21 92 205 226 300 206 118 82 58 87 25 101 205 244 222 71 28 74 237 164 78 53 94 184 90 160 133 147 239 73 256
3796B56l3r3l5M0q9J00%M7m7j27J20o5O8J63J7O1l20J48%r6m7rJ12r0K4R3L7j89J6N7j2k0
$$ 256 223 130 95 135 46 146 146 193 146 19 139 74 142 305 322 383 63 211 211 115 68 59 171 81 105 198 235 46 62 119 107 87
3495H7K19o5j44O3n6j2Q6Mk1L0q8l9J42l6M9Qj45j0K02Lj63Q8j7o6Q2j41K7M9rp1l2J46KQ3
$$ 87 306 241 97 160 104 92 178 182 161 191 103 64 206 170 219 227 82 72 274 277 114 202 185 119 201 60 87 136 127 56 24 170 172 255
3176B55k12J66O2kj42n8K9N2J06q0K5j29o1Q9J0m3%j5J02N6n5r2O5J08rj17kr1J27o5R5O9
$$ 255 43 209 271 269 127 69 98 150 256 176 201 72 11 100 110 67 67 52 154 210 155 63 128 236 227 110 108 17 144 79 174 243
2875B43k5L5j21J24L8Mj64N2N6j43j4N4k6L3J42q9j17j0Pk4k1J5O6O0J3j07K4m0J14Q5k1j94
$$ 243 218 253 132 256 294 298 134 186 242 99 85 139 113 146 288 199 82 72 79 55 34 49 115 175 188 81 105 65 179 264 243 49
2575D9N5K5N4Kk1J15m4k03K11j02j16J14m0P3j10nQJ72n1j31J25o9J48j84M2m2O7J5o3J41
$$ 49 104 129 183 185 164 279 235 32 243 141 25 139 99 172 62 57 65 237 186 55 180 111 259 75 117 75 142 157 94 235
2293B35K6k35J34q1J85o6j57K48k07J09O5j56O7j53J67K21o0r1p2Q8J14K2K69P46p66l84J00
$$ 235 261 26 160 79 264 198 41 289 82 191 256 100 167 14 181 402 342 251 179 267 381 403 672 1418 652 268 368
2040C68j68q0MK3P1m2M3M6j85J29p4J16J28k12r8l5J86j01Q4N8j9o9K34j08k79J32n1J37j21
$$ 368 200 120 124 147 218 176 219 265 80 209 135 251 379 167 69 34 220 119 203 261 242 173 407 299 20 152 101 238 117
1767A17jJ1K10M0j44R3q0j20J02J84n7j06J08J25j30K00J8Ml9L22J06M2O64J216O133j108
$$ 117 116 127 337 377 233 326 246 126 228 412 355 249 357 482 352 552 570 574 535 857 963 1005 1669 2885 9018 7910
1523G910o013q0l28l00l45r9j99r0k4j65J05j5n4Q4Oj74J24r1rj29J37l4K3J3j95K89J00M5
$$ 7910 1897 1817 1489 1189 844 745 546 456 432 267 372 357 303 387 393 219 343 252 243 114 251 217 240 253 58 347 447 492
1260D92k41j5j05P1J05j36j54J07J6J49j5j93K44o9j01n3L1LJ08o2k9q2N0m4M2m2l6J37q7
$$ 492 251 236 131 202 307 171 17 124 140 289 274 81 325 256 155 102 133 136 244 182 153 71 121 77 119 77 41 178 91
988I1J12k7M6j30k7P0k9K61j35R6n8j51J30o9j62J03lm0mo0J51p1o6P2J07J18j40o6m5Q4j6
$$ 91 203 176 222 92 65 135 106 367 232 328 270 119 249 180 18 121 118 78 74 14 165 94 28 100 207 325 185 119 74 158 142
697A42p8P5P0j03p6N7n5O4OJ8P9P2j45k4o9J18J17l2j34O8L9P8r3j53K0k0N2N8o2%M1r8J85
$$ 142 64 139 209 106 30 87 32 96 102 120 199 271 126 102 33 151 268 236 102 170 209 287 194 41 61 41 93 151 89 89 130 32 217
387B17K9p9m8n0l4J84j9j25M6k7J15j70j8J1M3k1K0J23J5j77N1k2P5m8K0M1L7r8MJ16k2m4
$$ 217 246 167 119 69 35 219 200 75 121 94 209 39 21 32 75 54 74 197 212 35 86 64 139 91 111 152 189 91 95 211 189 145
86A45K9K3n1r3Om5P1M2Nj8O7p7o6K8j4l0j7L3J8J37q6j0K3q5M2N0j8P6o9k9K9P8j04R3j31
$$ 145 174 197 146 53 59 14 85 127 132 114 181 104 38 66 52 22 5 38 56 193 107 97 120 35 77 127 109 185 116 87 116 194 90 183 52
-242E2L5Qk8O6m4k1KK3J4M0Pp4J8RJ1%
$$ 52 87 95 67 133 89 68 70 93 107 147 154 80 98 107 118 118
-392A18
##PAGE=	F1=-7793.77
##FIRST=	19140.455529915001534,	4405.895418600002813,	0
##DATA TABLE=	(F2++(Y..Y)), PROFILE
4406A69o3oj2l5Q5q0K9Jm2J60k5q8P4J07r7L9j49j5M3L1p2L8LO5n0N6j17J05J13k1k14M6o
$$ 169 106 100 88 53 138 58 87 88 46 206 181 93 167 274 177 216 67 52 95 126 54 92 95 160 110 166 49 154 267 246 32 78 72
4096G2l7K1J7J43L4P7j25p8m7MM7r1K9J33K9mj46j5j4J88n7p9m9O3P1p8N2l0M5M5j63K14m3
$$ 72 35 56 73 216 250 327 202 124 77 81 128 37 66 199 228 224 78 63 49 237 180 101 52 115 186 108 160 130 175 220 57 271 228
3786B28r8j9L5q0J07k7L2m4q9P0l3O7J65J9N2l19J04J9o0o7M8J13j08RR9Kk10O7L3l4J1K03
$$ 228 130 111 146 66 173 146 178 134 45 115 82 149 314 333 385 66 170 189 129 62 110 223 115 124 223 225 15 82 115 81 92 295
3486B95n6j45Q1k4J4O1n2r%r1J5J15l7N9J6j36o3K19K3j76Q6k5n3K7q3M9j3l6mlJ25j5O7k02
$$ 295 239 94 175 151 165 226 174 165 165 74 89 204 167 226 242 106 43 262 285 109 195 170 117 144 61 110 97 61 57 54 179 164 231 29
3166B9J58J09J1j91m3N2P4R5j18K9j24o5N7L8K1L8j15R6O0m9r5P6J07l1j39k1l6J11n0J04
$$ 29 187 296 307 116 73 125 199 294 176 205 81 16 73 111 132 170 55 151 211 162 67 143 250 219 80 59 23 134 84 188
2885A88O3K2pj29J62K5k6j95Q5M6j58L5L5n3K1J85p4j56J7kK6o1J1P2M3J4j44P0n9J48R4n0
$$ 188 251 273 266 137 299 324 298 103 188 234 76 111 146 93 114 299 225 69 86 84 110 49 60 132 175 189 45 115 56 204 298 248
2584B48j56L6J9M1J1%O1l0j90J89p7j29J18o5P5p8mK5J44k5j72J70m9J14j74j5j2P9pl4J43
$$ 248 92 128 147 188 199 199 260 230 40 229 152 23 141 76 151 73 69 94 238 213 41 211 162 276 102 87 75 154 147 113 256
2293B56j1k19J67j41K08n2j59K56k12N2J12j92M8p6J43J79o2n6q2N4J01J05K40Q33p65m23
$$ 256 245 26 193 52 260 208 49 305 93 145 257 65 113 37 180 359 297 241 159 213 314 419 659 1492 727 304
2049C04J02j58m9Op4J33l2k8R3j91J17q3J27J57j84j47j6J20q7J13J09l9o6K37j22k88J28
$$ 304 406 248 199 205 131 264 232 204 297 106 223 140 267 424 240 93 77 197 110 223 332 293 227 464 342 54 182
1795A82k1J30j28qN0J50J11j95J58j14n1L2J74J1j15J10Q7p9K47M2P9m1L52J52J55Q20J694
$$ 182 161 291 163 155 205 355 466 271 429 315 264 296 470 481 366 476 563 484 731 773 852 811 1163 1315 1470 2290 3984
1542C984Q508j433q363k38m18m41l94j80k45j01p5j53M6mp3J34j6k40J20o7m6j47K00l8mm7
$$ 3984 12492 11059 2696 2458 2040 1599 1205 1025 780 679 604 451 497 493 420 554 538 298 418 351 305 158 358 320 316 269
1298B69k15K70J77P7k69l0q9M6J19j28j39M5K4J98j2k42K41q4r1m8J0J3J22m6l0j10Q9r9P0
$$ 269 54 324 501 578 309 279 190 236 355 227 88 133 157 355 343 101 342 258 167 119 129 142 264 218 188 78 167 68 138
1025A38k3n5J43o6Q8l9Q0j51k9Q7q6K63j10J16p1j43J06j07r7J10n8l1K2o1J62o4q2J23M1
$$ 138 115 60 203 137 225 186 266 115 86 173 87 350 240 356 285 142 248 141 44 154 96 65 87 26 188 124 42 165 206
753B06Q5r8m0n9P0m9p0O3Q2j18n3P9o3M5qlJ36M9j06m3J2J8J42j8j31K9Q4K2p4j55L0l9Q7
$$ 206 291 193 153 94 164 115 45 108 190 72 19 98 35 80 72 69 205 254 148 105 117 135 277 259 128 157 241 263 189 34 64 25 112
443A12L1q9J1J03j35J81L6p2o3k6p7K02j1q3L5L7O6k15L4m8M7l7J6J42Nj81O1j9N3KM1Knj11
$$ 112 143 54 65 168 33 214 250 178 115 89 12 214 203 120 155 192 258 43 77 29 76 39 55 197 202 21 82 63 116 118 159 161 156 45
124D5K4J11Kl9K4M4k4q4q2M7K6R9j8l3L5j40K9l9O6o1j6KRJ17k7k6O6q7pK3J2O1o8J4J7N5
$$ 45 69 180 182 143 167 211 187 103 21 68 94 193 175 142 177 37 66 27 93 32 16 18 27 144 117 91 157 70 63 86 98 159 91 105 122 177
-214A77q1O9j03j4K6n4P4j8j4K2N1l%K5o4qK4j2J4
$$ 177 96 165 62 48 74 20 94 76 62 84 135 132 132 157 93 85 109 97 111
-392A11
##PAGE=	F1=-7872.52
##FIRST=	19140.455529915001534,	4405.895418600002813,	0
##DATA TABLE=	(F2++(Y..Y)), PROFILE
4406A68o0K1pp5J04j06O9l3m9J51Mp6P2J16p6L8j68k5k5O7k3K0j8R7j7Lo5O6R2k2j57j6Qp
$$ 168 108 129 122 47 151 45 114 81 32 183 187 111 183 299 223 261 93 68 43 110 87 107 89 186 169 172 107 173 265 243 86 70 78 71
4087G1L9n9J67M5Q8j55o5n7L2O0r2J2J28Rj1j39K2l7J74m8n7n5O5O5p5L0l6O4Mj34K36n7r8
$$ 71 110 51 218 263 351 196 131 74 106 166 74 86 214 223 212 73 95 58 232 184 127 72 137 202 127 157 121 185 189 55 291 234 136
3777A36j5K9o1J04m9Lk2m1LoO2J63K5M0l19Q3K4k2o1Q0J09j13j3J07l9j71O6Rm7M1J69n2j19
$$ 136 121 150 89 193 144 147 125 84 87 81 143 306 331 371 52 135 159 137 76 156 265 152 139 246 207 36 102 111 64 105 274 222 103
3467A03Q8lK9L2j05J0l1p6O3Q2m0P6L7j26j06K01M4j70Q7m1l0n1RM4p5j8J4M0P7l3O5j85J49
$$ 103 191 188 217 249 144 154 123 47 110 192 152 228 265 139 33 234 278 108 195 154 124 73 82 126 51 33 47 87 164 131 196 11 160
3157A60J61J9k41kL7J03R8j66J8r7m1pN7Q6Q0j85J30Qo1r8R3J02n6j42PnO6oO5M5J04m3j44
$$ 160 321 340 99 97 134 237 335 169 187 90 49 42 99 185 265 80 210 218 157 59 152 254 198 56 63 58 124 118 183 228 332 289 145
2847A45J80J6p5k12J27K4j43Q2J3m5n2K32l4k05M8J6M9j10J5P6K2Lj69J26l8J26J09q3j14
$$ 145 325 341 266 54 181 205 62 144 157 112 60 292 258 53 101 117 166 56 71 147 169 172 3 129 91 217 326 243 129
2575A29OQL1J8K5lQj13J52n8j91J39p8O3n2oN7R9%j76J77oP5j69o5K3P0k7%J45o9j48J57j62
$$ 129 135 143 174 192 217 214 222 109 261 203 12 151 73 136 84 78 135 234 234 58 235 229 304 135 70 93 163 136 136 281 212 64 221 59
2256E9J95n9j37K51k04kJ25k00L3K9R7J09q7j2p8M1N1K10K45R72q31m24Q8j79j2jj01J34k1
$$ 59 254 195 58 309 105 103 228 28 61 90 187 296 209 197 119 160 211 421 666 1638 807 383 471 292 280 279 178 312 291
1983B91j12J63j87R9r1J16J56j34j78JP9r3J40J47n2m4J95j28k49J25j7J10j42mJ07Q3J55
$$ 291 179 342 155 254 163 279 435 301 123 124 203 110 250 397 345 301 496 368 119 244 227 337 195 191 298 381 536
1730E36k30K04j41RJ0J23O2p4R2L3j8K81N5J44l4L95J61K96R64K114J0652j711j0454m41m74
$$ 536 306 510 369 378 388 511 573 499 591 624 606 887 942 1086 1052 1447 1608 1904 2868 4982 15634 13923 3469 3028 2554
1495B554n96m32k64k62j09j31j19j8j4q1J81n0k53P2l5p1j77K47k5j6j19j20J37K30R9k80
$$ 2554 1958 1526 1262 1000 891 760 641 623 609 528 709 659 406 478 443 372 195 442 417 401 282 162 299 529 628 348
1251C48m1o0J4J30j16r3m2M2K18nk49J94r8o4n7j4Q1J05m7m6j09J12j36R8qr5J39l8P5n2Q6
$$ 348 307 247 261 391 275 182 140 182 400 395 146 340 242 178 121 107 188 293 246 200 91 203 67 165 157 62 201 163 238 186 272
960B72j69NR1j22K40q3J27q0j15N7j29rQ5j12qM8m7J66p3n4J40%Ro0j7l7M4r2OlP6j20k3Q1
$$ 272 103 108 199 77 317 234 361 281 166 223 94 85 170 58 50 98 51 217 144 90 230 230 239 179 162 125 169 77 83 80 156 36 13 94
640I4m4mKj9J74K6n9n6Q2k8J16k3j16mJ29k3o5j56L9k9Q6%o7J9J33j56J81J3p6p5M0j16J88
$$ 94 50 46 48 29 203 229 170 114 196 168 284 261 145 141 270 247 182 26 65 36 122 122 55 74 207 51 232 245 169 94 134 18 206
331B06qj9NJ10qk33Q4j09N2m2PJ39mj63N4k5M4N8M2l5m5j03K8J16K1l7J6P9j4p2j20J17m2
$$ 206 198 179 184 294 286 53 137 28 80 38 45 184 180 17 71 46 90 148 190 155 110 7 35 151 172 135 151 230 216 144 24 141 99
21I9J41m1m4Rj30N8m0Q4r9k0J7J7M8M5n0R9r0k4l1M1M1o1N5J3Rm8K5l5p4Q8m6kJ0k0L1Q2k8
$$ 99 240 199 155 164 34 92 52 136 37 17 34 51 99 144 94 193 103 79 48 89 130 69 124 137 146 98 123 88 14 102 56 54 64 44 75 157 129
-327A29l8N4l7m0L7k8J9
$$ 129 91 145 108 68 105 77 96
-392I6
##PAGE=	F1=-7951.28
##FIRST=	19140.455529915001534,	4405.895418600002813,	0
##DATA TABLE=	(F2++(Y..Y)), PROFILE
4406A60o4O1j1q0Q3j30J15p1m1J42L5p6P7J16m8Pj71j7o3J09j8Om1J18J3n0jM2M7k6r2n0j0
$$ 160 96 157 146 66 149 19 134 63 22 164 199 123 200 316 268 275 104 87 24 133 115 121 80 198 211 161 160 202 249 223 131 81 71
4096G1L3O3j26J63N8J08j85m5o9O1N7r1K3J14nm0j30O2l2J35m9k5m0M4O8p6Km0P3l0q5K47
$$ 71 104 167 41 204 262 370 185 140 71 132 189 98 121 235 230 190 60 122 90 225 176 151 111 155 223 147 149 109 182 152 67 314
3796C14p5r1pJ3m4R4o1l6J9j8m9J3N7J56L5J8l15R4J1Qm0R0J04j05m0J18p7j18M7j0l9O4J18
$$ 314 239 148 141 154 110 204 143 107 126 108 59 72 129 285 320 338 23 117 128 136 96 186 290 185 145 263 186 68 115 105 66 130 248
3486B48o0q0R4PL3kj40M0o5l6Q3N0m5J02O8j25j27J53N9j48R0n7qj25R7K2q2L0m9R1J5n2P6
$$ 248 188 108 202 209 242 240 100 140 75 39 122 172 127 229 297 172 45 198 257 109 199 142 134 9 106 128 46 76 27 118 133 81 157
3176A57j20R3K09J7k68M8j0J34J15k12j0o0j2n6N9J28J15k30J81n8p9r6J07R7q0j23P0k2L8
$$ 157 37 130 339 356 88 136 126 260 375 163 153 93 81 25 84 212 327 97 278 220 141 45 152 249 169 46 116 94 132
2903A32L8j0K6K00n9j68J75Pj34j97J62j3j04J21pnj60K71J3k28N6L3M8j40K4P7Jk1q5Q6J7
$$ 132 170 160 186 386 327 159 334 341 207 10 172 159 55 176 169 164 4 275 288 60 116 149 197 57 81 158 159 138 53 139 156
2612A56P2J18j19o3m1lJ8K8M3o0N1k4J41n6k36J23o6L1qj9R6M9J8j58J56K8M0j72o9M5M9m5
$$ 156 228 346 227 164 123 120 138 166 209 149 200 176 317 261 25 148 82 113 105 86 182 231 249 91 247 275 315 143 74 119 168 123
2312A23L3J37j33m7J26j52J62q4r5K23j84l4R9j38J1J02N5J8j29K4m4Q2k4K87K82J096r37
$$ 123 156 293 160 113 239 87 249 165 70 293 109 75 174 36 47 149 204 222 93 117 73 155 131 418 700 1796 859
2058H59m17Q1k05J4k5o4R9jj81K21j93J05j05R7J25p4k06J9O9j08J64J63n7j0J22j22k00J35
$$ 859 442 523 318 332 307 243 342 341 160 381 188 293 188 285 410 336 130 149 218 110 274 437 380 370 492 370 170 305
1795C05j1O9j58RJ57L7J59k39K24j57M3K0O1R0jN5k0M7K90N6J86k4M26J39M22J049K374J1983
$$ 305 294 363 205 214 371 408 567 328 552 395 438 458 519 609 608 663 643 690 980 1036 1222 1198 1624 1763 2185 3234 5608 17591
1533A7591j856j1739o19m88p19m41l36k47j05j88o5p5l8p5K07q7k22JKq0k00K65j5j4j82j9
$$ 17591 15735 3996 3377 2889 2170 1729 1393 1146 1041 853 788 713 675 600 807 720 498 499 501 421 221 486 471 457 275 256
1288B56K9K36J02k71l8l1k1J44r9m7j29P9K05lk15J18j09k3p1m1J75P7n6p3q9J16j54J30o
$$ 256 285 521 623 352 314 283 262 406 307 260 131 210 415 412 197 315 206 183 112 71 246 323 267 194 105 221 67 197 191
1016A91j53J39j8O8n1O7j71O3P3j08J78o1J26q4p9Nj37O2N7j40K4M9k5J72r4j0J26k6p3k9
$$ 191 38 177 159 227 176 243 72 135 208 100 278 217 343 259 180 185 48 110 167 27 51 100 75 247 153 143 269 243 170 141
734A41MJ0J3j15N6o2O5r7jP1op9M3l3J92kj2o3J25m2O4l4r0j4J59n9o5j46M1j2O7k9RnJ35
$$ 141 145 155 168 53 109 47 112 15 14 85 79 0 43 10 202 200 188 125 250 208 272 238 148 134 293 234 169 23 64 52 119 90 99 94 229
406B29j69K01k5r3o9J09j42J52pN1l4J73q7k20J12j54M6l2OJ16j3j00M4n6L2J02L5o1q0j1
$$ 229 60 261 236 143 74 183 41 193 186 237 203 376 289 69 181 27 73 41 47 163 150 50 94 38 70 172 207 146 66 55
124E5l0J08K0k5JJ22k3o5r6J29r3J58o3m4ro5K5j5P8j30l0N4K5k4J05n8J01q2rr4O6J8n2Q5
$$ 55 25 133 153 128 129 251 228 163 67 196 103 261 198 154 145 80 105 90 168 38 8 62 87 63 168 110 211 129 120 26 92 110 58 143
-195A43Qm6j1k1N6p4R7k9r7L5k3J0J06n3p0R3kp2M7l6J4
$$ 143 151 105 94 73 129 55 152 123 26 61 38 48 154 101 31 124 122 50 97 61 75
-392G5
##PAGE=	F1=-8030.03
##FIRST=	19140.455529915001534,	4405.895418600002813,	0
##DATA TABLE=	(F2++(Y..Y)), PROFILE
4406A45p5J06k0n6L9j23J29j02j9J32N2q7J04R6j8m2j64J0k3Q4l7Mo5J29L1r5O3L2Nm3l2o1
$$ 145 70 176 156 100 139 16 145 43 24 156 208 121 225 321 303 261 97 107 84 168 131 135 70 199 230 135 198 230 235 192 160 99
4105I9m2P3Q2j66J23Q6J25k15j7q1R1L5r6M2J09j0p8j16R2j2J01o7J4j6RP6p2l5m4R0o4l2
$$ 99 57 130 212 46 169 255 380 165 148 67 158 193 97 139 248 238 160 44 136 124 225 158 172 156 165 241 169 134 90 180 116 84
3805H4K53r9p3Rrm4P8n7p9O8j9p7K5N3J41N1j2k65R1j6K4j1Q5R4r1p1J37j03q4L2k0rP0O3
$$ 84 337 238 165 174 165 121 199 142 63 131 112 35 60 113 254 305 293 28 119 103 127 116 201 295 204 133 270 167 83 115 95 86 156 219
3486B19p5l9J06QK4m1j37P8r2JP6K2n2J27J03j26j38J01O4j17R2o5jp5N6%k9K6j04J30m3o9
$$ 219 144 105 211 219 243 202 65 143 51 52 128 150 98 225 328 202 64 165 229 112 204 139 138 63 119 119 90 116 12 142 99 30
3185C0Q8m3K3K43Ok49P5o3J62J35k41n4k1J2n2L0J29J33k49K25j14r1o6R5R4r7q8J22n0L9
$$ 30 118 75 98 341 347 98 173 110 272 407 166 112 91 103 51 81 210 343 94 319 205 114 48 143 237 140 52 174 124 163
2903A63O2r1PK77m8j94J56nj84o8R2o0n7J44j5L4j46J86N1k09L5L7L2j31J7P5j5n6K0L2Q2
$$ 163 225 134 141 418 370 176 332 327 143 75 167 107 50 194 179 213 67 253 304 95 130 167 199 68 85 160 145 89 109 141 223
2612B23K0J09j51lr7j7JM1N3j05Q2P0J35o0k45O8l3j7O3l9J30MK8j37J20M4J0j76k7L6L7n6
$$ 223 243 352 201 198 101 84 85 126 179 74 156 226 361 301 56 124 91 74 137 98 228 232 260 123 243 287 297 121 94 130 167 111
2312A11N3J16j87O5R0j38J29j16m2J70j49m1M4j8k9J42K2p7j08k2L9J59KK21L41J157j053
$$ 111 164 280 93 158 248 110 239 123 81 251 102 61 105 87 58 200 222 145 37 15 54 213 215 436 777 1934 881
2058H81m28Q3k18L4p0LN5L4k21K35k04J33j15P5P9j9k18K5P5j15J81J56n6J8L9j01j44J37
$$ 881 453 536 318 352 282 285 340 374 153 388 184 317 202 277 356 337 119 144 219 104 285 441 385 403 442 341 197 334
1795C34J6J7j74K1J90J3J31k16K22j72N1M0NR8Q6Po0J03K75M2J93rM30R9M95J048K407J2144
$$ 334 350 367 193 214 404 417 548 332 554 382 433 473 478 576 662 669 609 712 987 1029 1222 1213 1643 1742 2237 3285 5692 17836
1533A7836j820j1886p22m55p73m15l80k05q1k44Jj14o8n7K07j16j61p8M0p6j99K48j8%k25
$$ 17836 16016 4130 3408 2953 2180 1765 1385 1180 1099 855 856 742 674 617 824 708 547 469 509 433 234 482 464 464 239
1298B39Q3m3J99Q6k45k0j1n5J63p9j2k01J23J71j1j46L1j13J8q3o0K55N5o3j01o7J09j52J57
$$ 239 322 279 478 564 319 299 288 233 396 317 305 104 227 398 387 241 272 159 177 94 34 289 344 281 180 113 222 70 227
1025B27k0j99J48l0O8l4L4j19Q6M0o5J00m1J12p9n4k4j37J03L4r5J4K3KJ76j18L2R0m9j31
$$ 227 207 8 156 126 194 160 194 75 161 201 136 236 195 307 228 174 150 13 116 150 55 69 92 94 270 152 184 274 225 94
744I4j0L4N8j8r2N0r8M8k6k3O5K5n9lm0K03l4K6o8J38m1Qm0o3KJ68q7o7j25L7kM0m4R0l9J16
$$ 94 84 118 176 158 66 116 18 66 40 17 82 107 48 45 5 208 174 200 132 270 229 237 197 134 136 304 217 150 25 62 60 100 56 146 107 223
406B23j62K23o0j16m4J54j55J06JJ07p0K15j53j85J16j73K8j5J9Q1k3l6N8p9NJ19K7o6j05
$$ 223 61 284 224 108 64 218 63 169 170 277 207 422 269 84 200 27 55 40 59 140 117 81 139 60 65 184 211 145 40
133D0N5m4P7oJj9J61m1o7m7J19j21J43q0k4k2j9nJ3O9j44k7P5L0q9J51m4P0o7J9j26P3km2
$$ 40 95 51 128 122 123 104 265 224 157 110 229 108 251 171 147 125 106 101 114 183 39 12 87 117 28 179 135 205 138 157 31 104 102 60
-186F0R9mr1K1k7J10o8R8j2j39K3j5m3J19o7k6P1K7j03N5l9L
$$ 60 159 155 64 85 58 168 100 198 186 47 70 55 12 131 64 38 109 136 33 88 49 52
-392E2
##PAGE=	F1=-8108.79
##FIRST=	19140.455529915001534,	4405.895418600002813,	0
##DATA TABLE=	(F2++(Y..Y)), PROFILE
4406A22q7J46l3j9Jq5J04j21J5J17N2j07J42O2J2r2j59N4QO0n4Pp9J26L1j25J12L1j4o8J8
$$ 122 35 181 148 129 130 45 149 28 43 160 212 105 247 309 321 229 70 124 132 192 138 145 66 192 223 98 210 241 227 159 177
4115A77o5p2J02R1j86O7J40J22k37Nq6J23Lj16O3J12qj11r6J08J8P8r9N3J1l0Q1n6q0m7J19
$$ 177 112 40 142 233 47 114 254 376 139 144 58 181 184 68 131 243 235 124 28 136 154 232 133 186 197 167 248 192 112 65 184
3824A84r2OK53j23m5K7l7n5N8l8j11R7k5p0K4M7J16P1l1j91O7m5K8J8P6P2p3j05J58j10p7
$$ 184 92 98 351 228 183 210 173 118 176 138 27 124 99 29 53 100 216 287 256 65 132 87 115 133 209 281 208 103 261 151 74
3533G4K8k4L4N9J3q6mJ21MRq5n9Q4q7qN7Jo0J38J31j14j37N2O0q3Q8o0j6k4PpK2J4j23J38
$$ 74 102 78 112 171 184 98 94 215 219 228 143 84 168 81 73 130 131 71 209 340 226 89 141 201 118 206 146 130 106 113 106 128 142 19 157
3204A57q1m9N8K2m2K59j3j94P9j01J87J42k43j05J1K0k2J2Q5J31k43K52j51r2%M5R1j01m0
$$ 157 76 27 85 107 65 324 311 117 196 95 282 424 181 76 87 107 85 97 182 313 70 322 171 79 79 124 215 114 74
2932G4J53q6O1O6j49oL01j6k08J40k8j94L3K8j09j7J42mN7j21J11P0j62LL1Rq5j7P1k4q6J21
$$ 74 227 141 202 268 119 113 414 398 190 330 302 108 141 169 60 43 185 181 238 117 228 298 136 139 170 179 94 77 148 124 38 159
2631A59k3J36j2P9j73O1j46k9k1O4M9j18O8J54J22o0k19Pko9J46n8J51k7L1j18O9M5j6j64
$$ 159 136 272 260 339 166 227 81 52 31 95 144 26 94 248 370 310 91 98 96 27 173 115 266 239 270 152 221 266 250 86
2349H6L8rN1n8M3R0k18J68N5j32J04j40J3R9j05m1lR9q8J79Kj45O7l8m8K07Q5J27M14J160
$$ 86 124 115 166 108 151 241 23 191 246 114 218 78 91 190 85 44 41 140 52 231 233 88 155 117 69 276 361 488 902 2062
2068B062j168m69Q7k17N7j37P8RQ2k33K04k20J74j11N0M2J3j90jQ5j07J87J28m9L2m0p0p7
$$ 2062 894 425 512 295 352 215 293 302 384 151 355 135 309 198 248 290 303 113 112 197 90 277 405 356 388 348 278 201
1805B01J19N7k8j78J8K05JQ5j66K12j89L5N3m1R3J70m1q0J37K39J9J64J2L98N4M98R56K207
$$ 201 320 377 349 171 189 394 395 480 314 526 337 372 425 384 477 647 606 526 663 902 921 1085 1097 1495 1549 2047 3003 5210
1542E210J1090j602j0860p32l75p50l53l87j47l2k94O3j29r1l8J84j30q1j53P0o3j62K03m2
$$ 5210 16300 14698 3838 3106 2731 1981 1628 1241 1094 1062 768 831 702 611 573 757 627 546 393 463 400 238 441 399
1317C99J7k40J72p6J39N5k10J1kq7J83n5Nk37J49J29k7n5m5j12M2q0l7K63M5o1j20n6R9j29
$$ 399 416 176 348 272 411 466 256 267 265 178 361 306 311 74 223 352 325 270 225 113 155 75 38 301 346 285 165 109 208 79
1035G9J69m8j31J04r2P4rJ8m6N2J8k7L6k5R3o5n0j8j13Q7J8l2orK7J77j37O2M1o4j55qQ4Q2
$$ 79 248 200 69 173 81 155 146 164 118 170 188 161 197 172 265 200 150 132 19 106 124 92 86 77 104 281 144 206 247 183 28 20 104 186
716A86m8m4J9p3lL3n5P6L2l7m8JJ78o0N1p2J26l5m2l6m2L7J57j05o5r8L0rK6k2J18o9Q3j25
$$ 186 138 94 113 40 37 70 15 91 123 86 38 39 217 157 208 136 262 227 185 149 107 144 301 196 131 33 63 54 80 58 176 107 190 65
396F5K24q1j33k0J69j46N6J8J36r3K30j94j37R9j61OpM6M0l4J3Q0r2qJ09J7n3j11Q1m8N7m2
$$ 65 289 208 75 55 224 78 134 152 288 195 425 231 94 193 32 38 31 77 117 83 96 176 84 76 185 202 149 38 119 71 128 86
96H6L6m5J81m9q4K1R5j27R6r0J9l0%k0L6N9j38j0P2L7j24J53j0J5n4M9j33P0rl1R3j4j21M5
$$ 86 122 77 258 209 125 146 241 114 210 120 139 109 109 89 125 184 46 36 108 145 21 174 164 179 125 174 41 111 102 71 164 150 29 74
-223G4J8R9o3J00Nj56Pj1m8P1l0L4J1L6j28O2l8j2
$$ 74 92 191 128 228 233 77 84 73 25 96 66 100 111 147 19 81 43 31
-392C1
##PAGE=	F1=-8187.54
##FIRST=	19140.455529915001534,	4405.895418600002813,	0
##DATA TABLE=	(F2++(Y..Y)), PROFILE
4406I1p2J53m6J7k3n2Q4j27M8R9L6j27J74K3L9j16j67J00K3M1n4Lp8J08K2j39J34L3rr0N7
$$ 91 19 172 126 143 120 68 152 25 73 172 208 81 255 278 317 201 34 134 157 198 144 147 69 177 199 60 194 227 218 128 185
4115A85p0q4J10Q2j82J8K02R7k38Jp4J46k1j57Q0J32j2j30o8J05N2O3j35R1L4o5Q0l0j27n2
$$ 185 115 31 141 223 41 59 261 358 120 121 47 193 172 15 95 227 215 85 17 122 174 237 102 193 227 162 242 212 85 33
3833C3J60j03J0K46j42pL2n9p0K8Jq7N8j3m3OM1Q6R3k6j53N6o6K1M8O7L6n3j40J76r4j00L7
$$ 33 193 90 100 346 204 197 229 170 100 128 129 42 100 87 44 50 91 177 270 244 91 147 81 102 150 217 253 200 60 236 142 42 79
3523G9k4Q3L1k8q0K1J24Onj18M5O4q0k9M4j3o5J24J44q7j18J2N1n7Q1m8m3J3l9ON2Oj27J36
$$ 79 55 138 169 141 61 82 206 212 207 89 134 198 118 89 133 120 55 179 323 236 118 130 181 124 205 157 114 127 88 94 146 152 25 161
3204A61q6j9J3N8r3K58l3j36P6j08K01J34k22j52L5KK7QJ2J12k18K56j55p8O6k1Q4r0J1J62
$$ 161 75 56 69 127 34 292 259 123 199 91 292 426 204 52 87 89 116 124 136 248 30 286 131 53 119 98 182 92 103 265
2922B65j23Q7O6j77pK56L1k02J40o5j52P9k0j27j7J07L3N5q0M5P3r8k6J9kl8o8O5k0o0J54
$$ 265 142 229 295 118 111 367 398 196 336 271 119 198 178 51 34 141 174 229 149 194 267 169 143 162 160 122 54 119 99 39 193
2631A93o5J67k4L2j78J20j65k3mN4L2n9m7K07J03n9j61j0j4o5J73p1J56m4K8r9J3K9l3j11
$$ 193 128 295 271 303 125 245 80 57 53 107 139 80 33 240 343 284 123 113 99 34 207 136 292 248 276 177 190 219 186 75
2349G5Q2q5J03n5lP2j20J37L1j39Q2j43O9J5n1m0%J50j44J95Lj49J63j8j44K17J81N8N03J134
$$ 75 157 72 175 120 117 189 69 206 237 98 180 37 106 121 70 30 30 180 36 231 234 85 248 230 86 303 484 542 1045 2179
2068B179j267n37R4k05P4k02J40l9J31k21J46k40K08q5K6L1Pj17m7Q4r2J83R5m1L7j22l4M
$$ 2179 912 375 469 264 338 136 276 237 368 147 293 53 261 176 202 233 240 123 76 160 68 251 346 305 342 220 186 190
1805A90P2J02n2j59qK03lL1r9K13k08J4L2p4P6K37p6p8J42J91oJ06L2L43J4M30P99J828R102
$$ 190 262 364 312 153 145 348 345 376 277 490 282 296 328 254 330 567 491 413 555 746 740 846 878 1221 1235 1665 2464 4292 13394
1533A3394j254q937o62k61o53k74l52q9L6l32J09j18r9k7J51j29Jk15Q4m6r0J50q7K3k24K32
$$ 13394 12140 3203 2541 2280 1627 1353 1001 912 948 616 725 607 508 481 632 503 504 289 373 327 237 387 300 323 99 331
1288C31p9Q5K4j84M9Jj15J96l0Pk20J31R3m6L7r1j05L8n7%K14M5m5j24n9Q9r6J64q1m0R4j53
$$ 331 252 337 361 177 226 227 112 308 278 285 65 196 289 243 280 189 84 122 65 65 279 324 279 155 96 185 89 253 172 132 226 73
988G3O9kM1l0QK2j5jj3P6l8o8J6j05N9LJ9k0l6N0J73j48P3ln8j04K1O1O3p5Pj1m2j5M8r5J02
$$ 73 142 140 181 151 159 181 166 165 152 228 190 122 138 33 92 95 114 94 58 108 281 133 206 203 145 41 62 123 186 111 118 107 65 50 98 3 105
640A05J6j6o9N2J25o7P1p6J00k3q1k6l8Q0J34j13n8p1L4m5O0KQ1q8M8n5J93q6j28k1J59j15
$$ 105 121 105 36 88 213 146 217 141 241 218 137 111 73 153 287 174 116 45 79 34 94 96 177 89 137 82 275 189 61 40 199 84
340H4QL8J37r9K22k07q4P0j20pk1P2Jm7M4R7r6QQ0Kl8j08R2n1M9p0O8q5J85l7j03Q8O8j17
$$ 84 92 130 267 168 390 183 99 169 49 42 21 93 94 47 91 188 92 100 180 182 144 36 128 77 126 56 124 39 224 187 84 172 240 123
21A23L0r6P6k8j1j4M3N2j19LO7M7j03R0L9m6o3P4j11N2oj1O2j1j24N1N9O7n9J05J7j59krl4
$$ 123 153 57 133 105 94 80 123 175 56 59 126 173 70 160 199 153 90 164 53 105 99 88 150 139 15 66 125 192 133 238 255 96 94 85 51
-308E1J8L0M1k1L2j37O7l9j9
$$ 51 69 99 140 119 151 14 81 42 23
-392B3
##PAGE=	F1=-8266.3
##FIRST=	19140.455529915001534,	4405.895418600002813,	0
##DATA TABLE=	(F2++(Y..Y)), PROFILE
4406E5oJ01n7M3l4j5O7j18P5P8J0j32J74pO0r8j65R8K7L7l9j5o1P5K1j33J10M0Qr4Q2q6n8
$$ 55 49 150 93 136 102 87 154 36 111 189 199 67 241 234 294 196 31 129 156 193 154 139 78 153 174 41 151 191 199 105 187 101 43
4096D3R1N0j48K7K01O5k06m7l0J45k1j09j4J71l7j29m1R1Q4M6j64J28M4q9P0Kj64n1J90q9
$$ 43 134 184 36 63 264 329 123 76 46 191 170 61 47 218 181 52 11 102 186 232 68 196 240 151 221 223 59 8 198 109
3814A09k3K28j49L6J7o9q0j2O2m6j6M9m4j4N4M8J01Kj54N4p8J5Q0N8ol4j69J82o3j03K5k3
$$ 109 86 314 165 201 218 149 69 57 119 73 57 106 62 48 102 150 251 253 99 153 75 90 170 228 222 188 19 201 138 35 60 37
3514C7J25mo5n8L8J01J7j0r2R4L4p7m2L8k2o9R3J38m9q5j1M0m2P0l0o9K8q2L5O0Rj22J31p7
$$ 37 162 158 93 35 73 174 191 181 89 183 217 140 98 136 114 45 138 276 227 142 131 171 129 199 169 100 128 46 81 141 150 28 159 82
3195H2qjO1j10K44n2j09P9q4J97J15j85j82M8m5R3Pn9Q0j58K12j18l8Q3p9O4o3N6J48j48J05
$$ 82 74 73 134 24 268 216 107 186 102 299 414 229 47 95 50 143 150 91 171 13 225 107 69 152 73 137 74 130 278 130 235
2903B35O6j79MJ54Q6j71J51j12r9J08n0j05m3K0R3L1k6rO2k7m8J1J2k5j06M8j0QJ26q5J68
$$ 235 301 122 126 280 366 195 346 234 135 243 193 88 45 65 158 189 163 154 216 189 141 152 164 139 33 81 71 79 205 120 288
2612B88j8k2j65J64j56kJ1M4L2m6p2J50R2o8q4J0o1k0J57p7J46n1K4p9l2lm0j8Q1j70J78n1
$$ 288 270 248 83 247 91 89 100 144 176 130 58 208 300 232 148 158 97 77 234 157 303 252 276 197 165 162 122 104 185 15 193 142
2312A42p7Q8k1P8J7j47M6j04J07o5Npj8J54j37J40K9j22J91J6k06J72K82RN94J124j348o22
$$ 142 65 153 132 210 227 80 126 22 129 64 69 62 44 198 61 201 230 108 299 315 109 281 563 572 1166 2290 942 320
2049C20R9j69O0k18J70r6J64j89J02j83J19l8MO0l2m1m5M3q5J68P0l3O1k27oJ00mJ34n4j11
$$ 320 419 250 310 92 262 166 330 141 243 60 179 141 145 205 173 132 87 130 45 213 283 250 311 84 78 178 174 308 254 143
1767A43m4J84oj5l3K30k07J1m1q0K0K78q2o6J29J38j9L2L4K85j0L12O15J373O706q59o620
$$ 143 99 283 277 262 229 459 252 263 222 142 162 440 358 292 421 559 540 572 606 891 881 1193 1808 3181 9887 9028 2408
1514B408n58j33n07k01k82m9J20l52J29r1q9k8J19j19Q4k58O7l4PJ17j30j0j84K53o7N5J9
$$ 2408 1850 1717 1210 1009 727 678 798 446 575 484 395 367 486 367 451 193 260 226 233 350 220 210 26 279 212 267 286
1260B86j84Q2Pj39J93jMj69P3O8n8J07r8r6J0j8J6J42N4j9j11p2Q1o2J45j14N4R6j67N5k2
$$ 286 102 184 191 52 245 244 248 79 152 220 162 269 171 75 85 67 83 225 279 260 149 77 158 96 241 127 181 277 110 165 143
969A43P7o2k8N5l9JqO7jp4K8j19M6j5M7k7n4P3J63j48O3k9j5p2M9M2J7q8M8l7k9%M5j03J02
$$ 143 220 158 130 185 146 147 139 206 205 131 159 40 86 71 118 91 37 110 273 125 188 159 144 72 121 163 180 92 140 103 74 74 119 16 118
640A18j7Jl4O9M7m4Q8p8Q0j4j03k1m9J22R9j09m6m9N1q9J13oK0r4J8L3J41p7r6l1J02o7k9
$$ 118 101 102 68 137 184 140 228 150 230 216 113 92 43 165 264 155 109 60 111 22 135 129 149 55 73 106 247 170 74 43 145 78 49
331D9N6J14q5J93j98k2M4p4k5l9R0k8o7N6J06r0N2M4j6l8r0R2m6M0p4Q3j10J53mq6J01N1j00
$$ 49 105 219 134 327 129 107 151 77 52 13 103 75 8 64 170 80 132 176 160 122 32 124 78 118 44 127 17 170 166 80 181 232 132
21A32l2o9J01j7m4J4K7N2j02J3O4N7p7K4J02p4j34R6o1QPK1RJ5j07L9P5L6o2J14K4j46r%l1
$$ 132 100 31 132 115 71 85 112 164 62 75 139 196 119 143 245 171 37 133 72 80 87 108 117 132 25 64 139 175 113 227 251 105 96 96 65
-308F5%N6K8l4L0j27O7l7j8
$$ 65 65 121 149 115 145 18 85 48 30
-392C0
##PAGE=	F1=-8345.05
##FIRST=	19140.455529915001534,	4405.895418600002813,	0
##DATA TABLE=	(F2++(Y..Y)), PROFILE
4406B7M7M2n9N3m0L7M4r4R2N6j2j09J26k4Q0n5j46M5L1M9l3l8l6L6M9j11M1M5K7q1R0j06n
$$ 27 74 116 57 110 70 107 151 57 149 205 193 84 210 186 266 211 65 110 141 190 157 119 83 119 168 57 98 143 170 89 179 73 68
4096F8O3lr5O8J47M3j48j25M5J11Rm6o9J64r0r7l7Q0J00K6j69J52L5j01N9K9j78lJ58o1p4
$$ 68 131 128 33 101 248 291 143 18 63 174 183 137 68 232 142 45 8 88 188 214 45 197 232 131 190 219 41 38 196 135 61
3805F1J93j38P5j9n6q3LQ2k5o3J17o9l0J00%Q1L1j73N8q2J5J12M9m3k0j32J19k7l9l6k0J39
$$ 61 254 116 191 172 116 33 36 118 93 30 147 78 48 148 148 229 260 87 145 63 78 190 239 196 176 44 163 136 97 61 41 180
3504A80l0j01l6N4N2L2kk2R3kp8m3M1l2p7O6J17j4n1rK9m1O3j5p9K3j10N3O4J6j00J11o5n
$$ 180 150 49 13 67 119 151 149 127 220 218 140 97 138 106 29 95 212 198 147 138 167 126 189 174 95 118 8 61 125 141 41 152 87 82
3185H2KN2q9K27o3j28Q7m6J72R3j38j87N0j09J61Mp6K1o6J06m7rP5j11K2k4Q6J15j54J11O6
$$ 82 84 136 47 274 211 83 170 124 296 389 251 64 114 5 166 170 94 115 49 155 108 99 174 63 85 61 147 262 108 219 285
2894B85j61K8J6J38j18J62j58o2J42n9p7n9m3J03mL3m7L7L6n9QM4m6p6pj2N9Q6p6J40Kp1j33
$$ 285 124 152 168 306 188 350 192 130 272 213 136 77 34 137 133 166 119 156 192 133 141 185 139 63 56 44 103 189 113 253 255 184 51
2584E1J80j32J9J5L9N6p2n6O7J08r7j4K7j03J5J50p9J27n5J7n5m8n2m1P0O1j43J54m4j49J50
$$ 51 231 99 118 133 172 228 156 100 167 275 178 164 191 88 103 253 174 301 246 263 208 160 108 67 137 198 55 209 165 16 166
2293A66QL9Rj21k8l3J14j06L2L3q0J67r2N4P1j13J84N8k14Q6L75j2O84J202j454p35O8r3j
$$ 166 174 213 222 101 73 40 154 48 80 113 33 200 108 162 233 120 304 362 148 234 609 597 1281 2483 1029 294 362 269 268
2021B68j68J67j42J56j47J08q3p4J6rJ10m3l6J8or9J32O3k1J25k70k7J32r5J48m7m6o1J47
$$ 268 100 267 125 281 134 242 159 85 101 92 202 159 123 141 135 36 168 231 210 335 65 38 170 75 223 176 130 69 216
1749B16pm8J9K49j69K6j15qj35K68n0o0J24Q1mk3k1K43pJ81M43R72M540n12m508m91k4l39
$$ 216 209 161 180 429 260 286 171 163 28 296 246 186 310 391 387 364 343 586 579 760 1203 2175 6715 6203 1695 1204 1180 841
1486H41j62j91m5K04l41J21n8p1k6R2j16J72k65Mm2J08J14j20r6q8J68m7M8N4j99Q8J9j41
$$ 841 679 488 443 647 306 427 369 298 272 364 248 420 155 159 117 225 339 219 123 35 203 156 204 258 59 147 166 25
1223B5J58K8J4j38J4N7n5J35p8q6j1J3J5O4O0J3q1r2P3l3J20j43J33R6j65N7l6Q8j07m4J02
$$ 25 183 211 225 87 101 158 103 238 160 74 63 76 91 155 215 228 147 55 128 95 215 72 205 301 136 193 157 245 138 94 196
932A96r2L3lO1M0n7Lj39M8l6O0l2o6R7J44j36M0l1M4q7P2M4l2p3O3o4k4J7M0r2R2n5J1L0N9
$$ 196 104 137 134 195 235 178 181 42 90 54 114 82 16 113 257 121 161 130 174 87 159 203 171 98 161 97 73 90 130 38 130 75 86 116 175
603A75n0J9R3p4P3j4j20oo4J47N7r6l3l5P6r4J14k6m2q6J5R7R0n9o3j4lj5m9O5P5n4J57j74
$$ 175 125 144 237 163 236 222 102 96 32 179 236 140 107 72 148 54 168 142 100 14 29 126 216 157 94 80 77 62 13 78 153 99 256 82
284H2M1L4m5o3m1J02m4k2k2J05p7J12J7k5o4n3Q1k8J4o1R0n2N5K1k7M0N1q2n7jN1lq0M7JN4
$$ 82 123 157 112 49 8 110 66 44 22 127 50 162 179 154 90 37 118 90 104 43 133 81 136 157 130 170 221 139 82 81 132 129 49 96 97 151
-54A51q8K0O2O0m6l1J72o0j97O5j3n2K5N6n6O5j01L7P1J5q0J25K6j20j9K6m3jN0J0l9L8j08
$$ 151 63 83 145 205 159 128 300 240 43 108 95 43 68 124 68 133 32 69 140 155 75 200 226 106 87 113 70 69 119 129 90 128 20
-364B0P0l2k3
$$ 20 90 58 35
-392C5
##PAGE=	F1=-8423.81
##FIRST=	19140.455529915001534,	4405.895418600002813,	0
##DATA TABLE=	(F2++(Y..Y)), PROFILE
4406D4L8qm9M5m3R8J2n8J01L6k3p6N3k2R9k0j37qM9N9n0m9j1nJ10j09LJ9L5n5Q1j00L7M1o9
$$ 44 82 74 25 70 27 125 137 79 180 216 193 117 170 148 247 227 90 82 131 190 140 91 80 75 185 76 79 98 133 78 159 59 96 137 68
4077F8m4R4Q8M3q7j12L5O0N4jo2J31j55n3l9P2R1Jj24J39Qj01N0M5j71L8J23l3j11J38j13
$$ 68 24 118 206 249 162 50 85 145 199 198 136 267 112 59 20 92 183 184 60 199 207 106 156 201 30 68 191 158 47 185 72
3786G2R4o9mm2Q0%l7j1J02r8k4J48m3L6M5j88N6o8K4J35L5o0j7q9N4KL0q0l1J36l6j27MK6
$$ 72 166 97 93 51 131 131 94 83 185 87 63 211 168 204 249 61 117 49 73 208 243 183 166 77 131 133 163 83 52 188 152 25 29 55
3467E5J4K5J5M7Q4l6q2l9N0m6q5N5J01Jl2J6J5m4O0pp3J5n1k4Q7J1o5P2m7k%N4p5K40o5j44
$$ 55 69 94 109 156 240 204 122 83 133 87 2 57 158 159 127 143 158 114 174 167 94 109 58 34 121 132 67 139 92 90 90 144 69 309 244 100
3129A00P1k7J34P4q5j60L3p3J19ql5k4m8K3J5PO5j03k7PR6P0j42J06N7j20N7j28J77n1J57
$$ 100 171 144 278 352 267 107 140 67 186 178 143 119 71 94 109 116 181 78 51 58 154 224 82 188 245 125 182 54 231 180 337
2838C37j91l6J78n5m8p4K1j1k8P5n3j8Q4n5%P0p6nl8n5Q2M3l9Q7L6j01p9J47j00L9J4K5R2
$$ 337 146 110 288 233 185 111 132 121 93 168 115 97 181 126 126 196 120 115 77 22 104 147 108 195 231 130 51 198 98 137 151 176 268
2528B68j10m4K7J46j25J0K2j23L7J54p8J04n8Nl2l5j02m2J37L4q7R9k8j09J32j3L5ko4r4j0
$$ 268 158 114 141 287 162 172 194 71 108 262 184 288 230 235 203 168 66 24 161 195 108 207 179 70 202 189 224 222 158 64 54
2237E4J17j06K6O9j32J85o9J9Q7j21J36J10j82L0M22K7P63J427j640q68n1%o1j35J73j50J21
$$ 54 171 65 91 160 28 213 144 163 250 129 265 375 193 223 645 672 1435 2862 1222 354 303 303 242 107 280 130 251
1983B51j23J42l8j45j0k2J43K0j12R1j8j30P0O2KK04k28l0L4j35J12n6K0l9R5ko2M4K44j08
$$ 251 128 270 232 87 77 55 198 218 106 197 179 49 119 181 183 387 159 129 163 28 140 84 104 65 160 158 96 140 384 276
1702B76L7j25N6j21M2J7p1J56K6L5mj56K01L0R7K99P33L165l04l103n12K1j94j57j05r8K75
$$ 276 313 188 244 123 165 182 111 267 293 328 324 168 369 399 496 795 1528 4693 4389 1286 774 795 601 444 339 241 516
1448E16k92R9l9n8lO7j27K55k40n2q7J66J31p3j40n8O0k7M7J08j86N0K5j17J11M8L4j41k2
$$ 516 224 323 284 226 223 290 163 418 178 126 39 205 336 263 123 65 125 98 145 253 67 117 142 25 136 184 218 77 55
1176E5N8l2J16n2p7oK0J4%M5M3l9j06N6pR5j67J83Q9j57P1k5O9j42m2J43j56P3J1N5P7l4l4
$$ 55 113 81 197 145 68 62 82 96 96 141 184 145 39 95 88 183 16 199 288 131 202 177 246 104 62 205 49 122 133 188 265 231 197
866A97j48N1n4P2l7p3J09J16j14J5k5R8j06P2O2p4m0N4q1j5J3L4p3Q6p8J6Q6K6j36J11P5o6
$$ 197 49 100 46 118 81 8 117 233 119 134 109 207 101 173 235 161 121 175 94 79 92 126 53 139 61 77 163 189 53 164 239 173
565A73P4k7j39L6p1J48J1q1j8l0R7q3Q4m3p1k2L6O2N2l8m1J6r2Ok5L8L3j6J25j20P3L2l3j16
$$ 173 247 220 81 117 46 194 205 124 106 76 173 90 174 131 60 38 74 136 188 150 109 125 33 39 14 52 85 69 194 74 147 179 146 30
246C0j3J02m9K3o4M6m8J59Qk2j09k1P5nk7m4R5J1J4lK6m5O4o2n5K9J6Nj02O9k4N4p5L0N7M9
$$ 30 17 119 70 93 29 75 27 186 194 172 63 42 117 112 85 41 136 147 161 158 184 139 203 141 86 115 131 136 34 103 79 133 58 88 145 194
-92A94qp0K38k9k13J6j4p5J2Q3j17J22r9M0O0J1j11J23K8q3l7O2n8j2M1jn7N8r0P7k4l9
$$ 194 186 116 354 325 112 128 114 39 51 134 17 139 40 80 140 151 40 163 191 108 71 133 75 63 104 103 46 104 14 91 67 28
-392B8
##PAGE=	F1=-8502.56
##FIRST=	19140.455529915001534,	4405.895418600002813,	0
##DATA TABLE=	(F2++(Y..Y)), PROFILE
4406G5lm1j7J0kJ11k5rR7K1j9n4rj0J14oj31l7Q2M2r1k6mm1J84j26L4m4K1l1N8k7K1L0j24
$$ 75 72 31 14 24 22 133 108 99 196 217 198 144 135 125 239 233 102 65 147 189 98 72 68 27 211 85 119 75 96 65 123 96 117 147 23
4077B3pQ7M1N7l5o4lQR7K9l6J06j93k8l6O7O0k7n1J07l3r3N0N0j51O8R8j4j03Q5q3N4j07P8
$$ 23 16 103 144 201 166 102 99 107 204 233 197 303 110 82 46 113 173 146 95 202 169 76 126 176 25 93 191 177 74 159 76 130 23 101
3758A01PJ13p0p3P1N7j18NJ77p6k0M3j90M4k8L8J40J4n7k4o0J4J7Q9j04n1J24k3j24M2m2O7
$$ 101 108 221 151 78 149 206 88 93 270 194 174 217 27 71 43 81 221 235 178 154 94 108 125 214 110 59 183 160 36 78 36 103
3458A03l1K5P2P5o7q3l5N8n9qk0J21j1n7N6Jm9O5rn9J9ko5J09j8l0J6j8kqP1p6K61o1j29L9
$$ 103 72 97 169 244 177 94 59 117 58 50 30 151 140 83 139 140 91 156 147 88 107 105 40 149 131 101 117 99 97 89 160 84 345 284 155 194
3119A94m1R3N9k7j11Jl7P0k9K5m1q1j5L2K3O2p5j9j3R1K3j26R9L1o2Q0j48R9J5J31k05OJ89
$$ 194 153 246 305 278 167 168 131 201 172 197 156 75 60 92 115 177 102 83 70 161 184 58 157 188 126 206 58 157 172 303 98 104 293
2810B93m5k0r4P7r6qO6k9r5J12l8k2Q2r1O9m4j04P1jK0J9P9q2m3P4n4N1J4pJ29j44m3M3J71
$$ 293 248 228 134 211 115 107 173 144 49 161 123 101 183 92 161 117 13 84 83 103 122 201 119 76 150 96 147 161 154 283 139 96 139 310
2490C10j19j1pj21M2J69p8Q4o0j5j5qj32k6J62Pm0L9jn6J01m9O1k0Lj17m6J16r3J5R7j30J93
$$ 310 191 180 173 52 94 263 185 269 209 194 179 171 39 13 175 182 142 181 180 124 225 176 237 217 220 103 57 173 80 95 192 62 255
2180B55j01N9O0j10K9J73j41N3L94J32Q16J717j872r82k09M3m4j69J68j33J22j31J50k0q7
$$ 255 154 213 273 163 192 365 224 277 671 803 1619 3336 1464 482 273 316 272 103 271 138 260 129 279 259 172
1946A72p4n5J33J10j79J31Jj75MN8L4K55j97k5m6o0K3q3L6LN2Qm7M1J95m8L8j07Q9r6j20P9
$$ 172 98 43 176 286 107 238 239 64 68 126 160 415 218 193 147 87 110 27 63 66 118 126 79 120 315 267 305 198 287 191 71 150
1645A50q0K01kN7M9j94P7P1J02J85O43K648k50k477n41k3j33j31o2k14L22k19Q9m5m8K4N1
$$ 150 70 271 269 326 375 181 258 329 431 616 1259 3907 3657 1180 639 616 483 352 290 76 398 179 268 223 175 199 250
1392B50j33L04k15m5o8P8J43k5j26r4JqK8J49j53PJ2r0R8M7M7j57k9O7pQ0l7o5PJ5K7ll9O4
$$ 250 117 421 206 161 93 171 314 289 163 69 70 62 90 239 86 93 105 15 113 160 207 50 21 88 81 161 124 59 66 81 108 105 66 130
1072A30J1r3J3J9P4j20J30P4j40Q7J1L1j52l9J75j98Q4L5M5J06j9o3j33M3o5R1l9o7Q4Q5r0
$$ 130 141 48 61 80 154 34 164 238 98 185 196 227 75 36 211 13 97 132 177 283 264 201 68 111 46 137 98 31 115 200 110
781A10Kl1J47j02L8Q7j04oL3p4Rk5K5n6Q6p5K0J14j8r5J15L0o2P6m4j57J07q3J40l3p1ll5
$$ 110 112 81 228 126 164 251 147 141 174 100 109 84 109 53 139 64 84 198 180 85 200 230 168 244 200 43 150 67 207 174 103 100 65
471F5J08o1L2m3j9nM9QL0k3j9L9r1n6J5J0MMJ03l5N6K6k7j57L5R0n7N1n9k1NJ42J9j4j47k6
$$ 65 173 112 144 101 82 77 126 134 164 141 122 161 70 14 29 39 43 47 150 115 171 197 170 13 48 138 81 132 73 52 57 199 218 204 57 31
133C1R2Po9j8Q4P0Pm4O1j28Q2l5o3M4MOj08Q0m2M5n4M5M8K0L7r9K92Kk20kn7l3l0Q0r9J05
$$ 31 123 130 61 43 127 197 204 160 221 93 175 140 77 121 125 131 23 103 61 106 52 97 145 165 202 103 395 397 177 175 118 85 55 135 36 141
-205A41q5L7N8J5j15O9L5m4o2R7n5m2M7J6j05P4p8Q4j4o4
$$ 141 56 93 151 166 51 120 155 111 49 146 91 49 96 112 7 81 3 87 73 9
-392I
##PAGE=	F1=-8581.32
##FIRST=	19140.455529915001534,	4405.895418600002813,	0
##DATA TABLE=	(F2++(Y..Y)), PROFILE
4406I8n4k3OmM3N6m9M1Q2J4j2m7l7KJ18rj16l1J00jj41M4j7k1J86j50Q4q1j1k4K7P6k4K8j33
$$ 98 44 21 27 23 66 122 73 114 196 210 198 151 114 116 234 225 109 78 178 177 36 80 63 42 228 78 162 81 70 46 73 149 125 153 20
4077B0J9K7QP5Mk0l5l0J20M6QQ5j94j9l4O3K0n9K7P3p4q3N4M8j18Q1Q4j0p1R4r0l2J1L0M0
$$ 20 39 66 74 149 153 133 98 68 188 234 242 327 133 114 80 143 163 104 131 204 130 47 101 149 31 112 196 186 115 209 119 87 98 128 168
3749A68J24j28j04J48kj23M3J82r3p0K6j49JL5M1J30j4m6k7m3oJ6J30j06o1R5oj06P6q2J25
$$ 168 292 164 60 208 206 83 126 308 215 145 171 22 23 58 99 229 215 169 142 99 93 109 239 133 72 167 161 55 131 49 174
3458A74l8J4K4N7q7o2n4O1m9O6q4J62j6j35R0j2m8O9j5m7L6L7o0J07n3Jm6J7j3rR1q8K68n0
$$ 174 136 150 174 231 144 82 28 89 40 106 22 184 168 33 123 111 63 132 117 70 106 143 83 190 137 138 92 109 96 87 178 90 358 308
3138C08j01J6p4N9M0L7n4l7lJ8o0Q5m5j22kML5O4m5Ol7Q3j1j18R6k1kR4r0k8P0Q7j97Q0J58
$$ 308 207 223 149 208 248 285 231 194 191 209 149 234 189 67 65 69 104 168 123 129 92 175 164 46 142 121 119 213 123 95 165 252 55 135 293
2810B93l9Qj28J20j36K5L7Jj65J22pn7P1o6J12m4j31L6m2Q4n0J33k7n1mQN3J3n7J61j67n2
$$ 293 254 262 134 254 118 143 180 181 16 138 131 74 145 79 191 147 16 52 10 94 44 177 150 99 95 103 156 169 112 273 106 54
2509E4Q9J69q8k9m5j00K2J84q2O9n0l9j5K3j32J2J38j1j1k1K9kN6p7R5m1P1j27r2J17p3lJ14
$$ 54 143 312 224 195 150 50 72 256 174 243 193 154 139 162 30 42 180 169 158 137 166 164 220 143 238 197 268 141 49 166 93 90 204
2199B04j19K30j67J18K9p0j36K57j12J04L22K84Q36J939k062j040l07l3N4k03R8j17J76j41
$$ 204 85 315 148 266 295 225 89 346 234 338 660 944 1780 3719 1657 617 310 277 331 128 226 109 285 144
1974A44J04j8%r3r5Q6J93j89J26L8k28m3O1N4K53j55j5j05J3lk0o8K2K3K0j6L1J07mL9r7J09
$$ 144 248 230 230 137 42 128 321 132 258 296 68 25 86 140 393 238 223 118 131 128 108 40 62 85 105 89 120 227 223 262 165 274
1673B74o8j71P5n4K10lN3P7j51j8O0J36J16N80K436k45k156n03p8j69n1n1k33K11j49J10p7
$$ 274 206 35 110 56 266 263 316 393 242 224 284 420 536 1116 3552 3307 1151 648 570 401 350 299 66 277 128 238 161
1420A61j6J4N4r2K80j90j4m0k6J34Rr3j27J6kj0J47j09k0k1j9P3K4M6j46k7P5LO5m9m2%K4
$$ 161 145 159 213 121 401 211 197 157 131 265 274 181 54 70 68 58 205 96 76 55 36 109 133 179 33 6 81 84 149 100 58 58 82
1110H2N4K9j49N8N7n4n0M7N9n9L7N1j02Q6O4rj39n3K03j47kO4L1J24j5p6r5K8p3J11m0o4M6
$$ 82 136 165 16 74 131 77 27 74 133 74 111 162 60 146 210 201 62 9 212 65 63 127 158 282 267 191 96 124 51 162 122 58 104
800A04N7p0Jm8J91p8j6J06j23K5Om3L8p4Pn1R1o2L2J22o2K3O3l2o2P6o1j19J45j00J29p4o7
$$ 104 161 91 92 44 235 157 141 247 124 149 155 112 150 76 83 32 123 61 93 215 153 176 239 207 145 221 160 41 186 86 215 141 74
490G4J6m8J00k9k7nM7k7O4m5J8j4RN0p6r6K7OJ9k4R0L9K0J1k1j32M3P8p8O1m8j9J2J07M2j2
$$ 74 90 42 142 113 86 81 128 101 165 120 138 124 133 183 107 11 38 44 63 39 129 168 188 199 178 46 89 167 89 150 102 83 95 202 244 232
152B32j72n7J23Nr6J4N0J14Oo8Q1j92R7jp6M2RPj04Q6n3K7k6O8M2k2P3j20L22K9k11j1j12
$$ 232 60 3 126 131 35 49 99 213 219 151 232 40 137 136 60 102 111 118 14 100 47 74 48 116 158 136 209 89 411 440 229 218 106
-158A06K2n3N3n8O3n3K2O9J1j04%M7rr4J24k7o3N2M3r6J2m5N4km9
$$ 106 128 75 128 70 133 80 102 171 182 78 78 125 116 22 146 119 56 108 151 55 67 22 76 74 25
-392B5
##PAGE=	F1=-8660.07
##FIRST=	19140.455529915001534,	4405.895418600002813,	0
##DATA TABLE=	(F2++(Y..Y)), PROFILE
4406A09j03M6j8K5M1lk3N4N3J6j2m9k8MJ07j5p9k0J02n1j12O4k7J3J35j72J25q2l9m1nJ77
$$ 109 6 52 34 59 100 97 74 128 181 197 185 136 108 112 219 204 125 105 207 156 44 108 81 94 229 57 182 100 61 20 15 192
4105A92p9L6j28N0k3qN3K9J7n3m1J12M7O6O4j72j0l7O1k0r2R5M2j02p2M9M4p0P5O7ql8J30
$$ 192 113 149 21 71 48 40 93 122 139 86 45 157 204 270 334 162 152 115 176 156 64 159 201 99 27 76 120 50 125 192 184 146 276
3796B76j18j03J27l3P2J15j72q7J80o5j18P6J67q8j03jo5nK5M1J15m9l7j8l3j2KJ49q9m2M2
$$ 276 158 55 182 149 221 336 164 77 257 192 74 150 317 229 126 125 60 55 80 121 236 187 150 132 99 87 89 238 149 107 149
3504A49%p6R9p6J36k2J9m8J8q6j2q1K7K4Q9j27J86Kj50L1k5l1N7k0m2N7O9l8R2p5K8q3L2l7
$$ 149 149 73 172 96 232 210 229 181 199 113 101 20 47 71 160 33 219 221 71 102 77 46 103 83 41 98 167 129 221 146 174 91 123 86
3185H6OR6r8K50l2p2Oj03L2J8J04pp2K7l1r4J32l8j54L7k1K7N9k2K4m9P9k6j02Q0p5K9J01
$$ 86 92 188 90 340 308 236 242 139 171 189 293 286 214 241 210 116 248 210 56 93 72 99 158 136 160 111 190 164 62 142 67 96 197
2875A97m7r8J04L4j53J39J14m0L4j77J50j38M5K6K1j93J02K7p9K8KJ05m1j42J9L4Pm1J32J7
$$ 197 150 52 156 190 37 176 290 250 284 107 257 119 164 190 211 18 120 147 68 96 98 203 162 20 39 73 80 39 171 188
2594A88p9p0Q8M6Lr8J65j70o0J21J46m3j7o6r0mJ82r0N2k0m3n0N9j13K4J16j7Pn9K8N9jr9
$$ 188 109 39 127 173 176 78 243 73 13 134 280 237 220 154 64 60 242 152 204 184 141 91 150 37 61 177 160 167 108 136 195 194 95
2284I5J30o9J40j27j18J23o0m6J35j27K95k06J27K1qk56K97o7J15K17M91R34K174k321j116
$$ 95 225 156 296 169 51 174 114 68 203 76 371 165 292 313 305 49 346 279 394 611 1102 2036 4210 1889 773
2049G73l27k31J66j65m7j22K36j06Jk1Q2p0j17MK49j42Q7Q6k79n2J07K1J87r1oj42Q4k5M0
$$ 773 446 215 381 216 169 47 283 177 178 157 239 169 52 56 305 163 250 336 57 5 112 133 320 229 223 81 165 140 180
1777A80q4k1j6K3J8L3LJ3N6j15J23l1j46J4NJ76RL9Q2j06k4mJ51P8M71K177k18j814m07j03
$$ 180 96 75 59 82 100 133 136 149 205 90 213 182 36 50 55 231 240 279 361 255 231 227 378 456 927 3104 2886 1072 665 562
1495E62k40L2k8j25n2q9J61j39O4m6Q0j9J89j56J6pr3Q2L2n3j40O1qj4Q9o1l4l8M7L3nL8p0
$$ 562 322 354 326 201 149 60 221 82 146 100 180 161 350 194 210 203 110 192 224 171 31 92 84 70 159 98 64 26 73 106 101 139 69
1185F9o2P9kP4p9j0k9O2P8M9j68j4P0rr2N3N0j8m1J6MJ5J22l8j09m4J81j02o9Q0J6J31k2p5
$$ 69 7 86 84 158 79 69 40 102 180 229 61 47 117 108 16 69 119 101 60 76 80 95 217 179 70 26 207 105 36 116 132 263 241 166
866A66m2J3p5J17m1n3mN4o9J0l5J89m8o6J01j30N7k3JO5j04j9n5Q0n2M8J26q5J27J6r7p0P6
$$ 166 124 137 62 179 138 85 81 135 66 76 41 230 182 116 217 87 144 121 122 187 83 64 9 89 37 85 211 126 253 269 172 102 178
556A78o7k3J25j12J14j04p5M0n0N7Qn9P8M9n2P5r0J8j5M5M9o2r2RJ3L4m3P8Q7j9j0j8q4N1
$$ 178 111 88 213 101 215 111 36 76 26 83 91 32 110 159 107 182 92 110 95 140 189 127 35 44 57 91 48 126 213 194 184 166 82 133
237A33O6j05M8l3OPP6O3j3j92nO6mr6L3kJ41%o2R0j80N6L6n0rK0J7r3Q8n4R%Q5M2m6P2j37
$$ 133 199 94 142 109 115 122 198 261 248 56 51 117 113 17 50 48 189 189 127 217 37 93 129 79 70 90 107 14 102 48 57 57 142 184 138 210 73
-111G3L25M8j84j6j67P8o0K1k9K4okP9%r6m6O1J9j00J15J4o2L0O3r5k7j5J7Rj2
$$ 73 398 446 262 246 79 157 97 118 89 113 107 105 184 184 88 42 103 122 22 137 151 89 119 182 87 60 45 62 71 59
-392E9
##PAGE=	F1=-8738.83
##FIRST=	19140.455529915001534,	4405.895418600002813,	0
##DATA TABLE=	(F2++(Y..Y)), PROFILE
4406A06o3K9m2N3L5l0L4K1J3L0k8m8MJQ0j8k3k8R7q5k7K5k3K6P9j87J38n0n4n0K7J69j27N0
$$ 106 43 72 30 83 118 88 122 143 156 186 158 110 114 115 195 177 154 126 223 138 111 136 113 139 218 31 169 119 65 15 42 211 84 134
4087A34j22P8rKm3M2M2n1nO5K1J31M3j49Ol9N9n3j20J42J3j08m7K4K6rN6L7Lj0J58j37j08
$$ 134 12 90 81 83 40 82 124 73 68 133 154 285 328 179 185 146 205 152 32 174 187 79 32 56 82 73 129 166 169 159 317 180 72
3777G2J75r3J09R1k02l3J76j22j09R6J37o4j10l1NKJM2J05r2l8J2k9j1j8J45o4%rj8m0J05
$$ 72 247 154 263 354 152 119 295 173 64 160 297 233 123 92 97 99 100 142 247 155 117 129 100 89 71 216 152 152 143 125 85 190
3476A90m2J15lL9j07m3n4L6p6m7J03R2j57J95L0j36m3n2K2Qj3m8P4R2pO2q1N8q0J4n9K2P8
$$ 190 148 263 260 299 192 149 95 131 55 8 111 203 46 241 271 135 92 40 62 70 57 9 83 175 168 230 149 207 127 141 82 104 182
3166A82r5K09rn1J1j11OnJ64K1j00N7p5j16J50k1j66Q0k8LM1qL0n1P4k8o5M1o5j7J02j6j18
$$ 182 87 296 287 236 247 136 142 137 301 322 222 279 204 88 238 217 51 131 103 106 147 139 169 118 192 164 99 140 75 58 160 144 26
2857B6J18j6o6J39Q2n0N9k37J73j17N0L8L3j95P2O1p5l5O8P0l5j39M2P7q0M2P9K9j12q2J46
$$ 26 144 128 62 201 283 233 292 55 228 111 161 199 232 37 109 170 95 60 128 198 163 24 66 143 63 105 184 213 101 19 165
2565A65M0l2p4J14j52MM1J21kK1p0r9j1J57j04L2K9j3j05R3j15L5J01k1L2n0m2J34o0j32J79
$$ 165 205 173 99 213 61 65 106 227 225 246 176 77 66 223 119 151 180 167 62 155 40 75 176 155 187 137 95 229 169 37 216
2274B16j10K00j17r4J37p6j22J75j60L68j70N6L7O3j76J94J5Q5J25P42J374K863l075j480
$$ 216 106 306 189 95 232 156 34 209 49 417 247 303 340 403 227 421 436 521 646 1388 2762 5625 2550 1070
2049A070l45l86J19r8j28q2R8qj21J6P4qj00n8J99l9RJ40k99n0J56j6O7Jnj61J57o3R5o0m6
$$ 1070 725 339 458 360 232 150 248 240 119 135 209 201 101 43 242 203 212 352 53 3 159 143 210 211 206 45 202 139 234 174 128
1758A28r5K6M2N2r4KJ01j28R6K7j26L9qJ10K4K5Q6q4L5q0J53O3L17J916j79j485k82j16k75
$$ 128 33 59 101 153 59 61 162 34 130 157 31 70 62 172 196 221 307 223 258 178 331 394 711 2627 2448 963 681 565 290
1486B90M6J2k8k79k6K09j99J43o0P6K2O8j11L8L2r6k7M9j3j31R3j6jK2j9l8OL5nk4N1kj11
$$ 290 336 348 320 41 15 224 25 168 108 184 206 274 163 201 233 137 110 159 146 15 108 92 91 113 94 56 62 97 92 68 119 117 6
1176FR4k1Q6j05K6m6J00R3M8j84j4J9L3r1K0M5Nn3j9R2r0J72m8o9l7J32o9r4P3lJ28l6o3J4
$$ 6 100 79 165 60 86 40 140 233 281 97 83 102 135 44 64 109 114 61 42 134 44 216 168 99 62 194 125 31 104 101 229 193 130 144
856A44Jo5J01m2k7n5Q6q8K2RJ29k3j02P3j25R0m9M1Q9j08l7mj6k5M1J28o4J78k3j52p3P1n8
$$ 144 145 80 181 139 112 57 143 55 77 86 215 192 90 163 38 128 79 120 209 101 64 60 44 19 60 188 124 302 279 127 54 125 67
547F7N6R8j14R6j17p5N4j5m2M5M0P0Rp8Q1j28N2m1Q3M0m8p1j0J6L3m3P6J08n2l4j7l2O3N5
$$ 67 123 221 107 203 86 11 65 50 8 53 93 163 172 94 175 47 99 58 141 181 133 62 52 68 101 58 134 242 190 156 139 107 170 225
227B25j25J6k3L7NN8O7j2j88N0j8mo8K8j5R5ol5R6r4l2O3Np1J3L7q4R5m8J1JR1M1l7L0j46
$$ 225 100 116 93 130 135 193 260 248 60 110 92 88 20 48 33 128 122 87 183 89 57 120 125 54 67 104 20 115 67 78 79 170 211 174 204 58
-111E8L02N7j41j5k18J25n7jj3rM3l3Q0j3q7n8O7M0p0O8N0n3j3P4q1n0J5j2J6K0
$$ 58 360 417 276 261 43 168 111 110 97 88 131 98 178 165 78 20 87 127 57 125 175 122 109 183 102 52 67 55 71 91
-392I1
##PAGE=	F1=-8817.58
##FIRST=	19140.455529915001534,	4405.895418600002813,	0
##DATA TABLE=	(F2++(Y..Y)), PROFILE
4406I1lj2o2P4L4PM6j9k4M5m9k1K0oN1k2L5m3Q8r5K6poK5L0j65R1jo3j3L7J14j50N7o2L9K9
$$ 91 88 76 14 88 122 129 175 156 132 177 128 107 127 121 172 150 185 142 230 135 161 154 148 173 203 38 129 128 65 52 89 203 53 110 48 87 116
4058A16J2j05K1N3k2L9L0n0J92K7j36K5l0N3p4j40J63j3r8j6K0l5N6L3pK5J1J72j40o7J74
$$ 116 128 23 44 97 75 114 144 94 286 313 177 202 172 225 151 11 174 161 63 47 67 32 88 121 114 139 150 322 182 115 289
3767B89j44J47O0k17K4J62j58j01R7R2k7r4n8N3mnM3J01j39m9O1k9j1l1J21m3N0m1n3rQ9J5
$$ 289 145 292 352 135 159 321 163 62 159 251 224 130 72 125 121 116 159 260 121 72 133 104 93 62 183 140 190 149 96 87 176 191
3467A91P6KO8j35j09lO1o1k4P0R3j72J89N7j21p9r5Q1n6K2k8M5R6K7K1p8R1n4j7n0J2M0p4
$$ 191 267 269 337 202 93 90 151 90 66 136 229 57 246 303 182 103 8 89 33 55 27 72 168 195 216 138 229 175 158 108 120 160 86
3157H6J55J3l4K0r5k7j5K01K8j17Q7j03j00J12jj51J13m7j3K0JL0n7O3j4j4j4mp6O4J3j07
$$ 86 241 254 220 240 145 118 103 304 332 215 302 199 99 211 210 59 172 125 112 132 133 163 106 169 155 141 127 123 47 111 124 17
2857A7J11n2K5J00O5o3P9k68J80j01M5O9L6j91N5R2p2q1J05L2l1j28P5R5j46J10M7J2j34k5
$$ 17 128 76 101 201 266 203 282 14 194 93 138 207 243 52 107 199 127 46 151 183 152 24 99 194 48 158 205 217 83 58
2575E8J57M0r9lN1j13K7m1J12J2O4q0j02pJ28j25J7P4M2j35J07j57P5J05n0O6k6j40K18j04
$$ 58 215 255 156 153 204 91 118 77 189 201 265 185 83 76 204 79 96 170 212 77 184 27 102 207 157 223 197 57 275 171
2293A71j43K15j44K05j00l1J62j17j55J82j29L50r8k1M1J43q8J59R0Q6J49R64K220M271m536
$$ 171 28 243 99 304 204 173 335 218 63 245 116 466 368 347 388 531 443 602 692 778 927 1891 4111 8382 3846
2058C846k258m43m76l1r5j09r0j11J08j37P2p0N0p1l7J5J03j20J98k46n2J47l2o9J13pj71
$$ 3846 1588 1145 669 638 543 434 344 233 341 204 276 206 256 185 148 163 266 146 344 98 46 193 161 92 205 198 27
1805B7K19r4J25k1m8j87N8K5P2j56OJ23k7j2Q5j45J15q4K4M0J8J12r7J02j19J62O6J62J743
$$ 27 246 152 277 256 208 21 79 104 176 20 26 149 122 110 195 50 165 81 105 145 163 275 178 280 161 323 389 551 2294
1533B294j54j268j74j26k54k4M8N9l08j5J60j38R0J1L0Om4o4M6P5o1j56O9J8j08J09l0Rk1
$$ 2294 2140 872 698 572 318 294 342 401 93 78 238 100 190 201 231 237 193 129 175 250 189 33 102 120 12 121 91 100 79
1260G9Pl7L5Qk6nP8J3j38J08m6Q1j15O3l7J12J02L3k03J9k8N0q1j4M6J0j3LP4j60J92m2k7
$$ 79 86 49 84 92 66 61 139 152 14 122 76 157 42 105 68 180 282 315 112 131 103 153 72 58 104 114 101 104 178 18 210 168 141
950A41n0P8m5r1O8l2J22n4m9O2nl9O6n0J4p7J16j07L6K6O0pj22L2n3O7o5O5J05r9l7L5q1M9
$$ 141 91 169 124 33 101 69 191 137 88 150 145 106 172 122 136 59 175 68 104 130 190 183 61 93 40 107 42 107 212 113 76 111 30 79
631G9l2J04%J62n2j87j4J2j8P6P4j04P8j04j9J3J1ol8J32M4m3r9P5j29J13r3J00K9l2m7k5
$$ 79 47 151 151 313 261 74 60 72 54 130 204 100 178 74 55 68 79 73 35 167 211 168 69 144 15 128 35 135 164 132 85 60
331F0J9Rk8Q1J10p5n4j7J3P2M9j23k0l2O3PN9M6pj44P6j07L4o7M1L7n8J3j9J02kq4N2N6r1
$$ 60 79 88 60 141 251 176 122 105 118 190 239 116 96 64 127 134 193 239 232 88 164 57 91 24 65 102 44 57 38 140 138 54 106 162 71
2G1j7N1p9J11m4J6oQ8L2j0j9j43K62M9q8rk58J55m7pml2P5o6O9j6q0l7N5N5l3K1O7m4o7P8
$$ 71 54 105 26 137 93 109 103 191 223 213 194 51 313 362 274 265 7 162 115 108 104 72 147 81 150 134 54 17 72 127 94 115 182 138 71 149
-336A49m1n9L4j6RL7
$$ 149 108 49 83 67 76 113
-392A13
##PAGE=	F1=-8896.34
##FIRST=	19140.455529915001534,	4405.895418600002813,	0
##DATA TABLE=	(F2++(Y..Y)), PROFILE
4406G1N4n4m8M8M8O9K2m6m8N0m8K8nj7L8l6P9m5P8r5M3k6K2J5nj14oN2p0L7K7N0r8K2J6n0
$$ 71 125 71 23 71 119 188 210 164 116 166 118 146 141 124 162 126 205 160 238 143 186 160 182 197 192 78 72 124 54 91 118 168 70 92 108 58
4068E8P6L3j13j2L0K2O8J7j37K29J9j37M6qM3q4j42J46l1p6J0N3p6N6J7o4N4K4J73j19j6J52
$$ 58 134 167 54 42 72 94 162 179 42 271 290 153 199 191 234 150 8 154 123 47 57 110 34 90 107 43 97 121 294 175 159 311
3767C11j85J80L2k16O4J49j65j00Q2L8J0o8p6P8j6J4L8R7j76p1J25l4k0k8Q5l4R2m3r5J8M6
$$ 311 126 306 338 122 186 335 170 70 152 190 200 132 56 134 118 132 170 267 91 20 145 111 91 63 148 114 206 163 68 86 132
3476A32Q6L6j8R8j28j24NP1l9LJ8J03j76J71P3j10p5r7P9r7N4j3L1O4N9k3o9J24k6m6j6j5
$$ 132 218 254 236 334 206 82 87 158 119 122 140 243 67 238 311 201 126 29 108 11 65 52 83 147 206 183 114 238 212 166 150 135
3176A35rl7J04K8j9K5p8n8MK00K2j24J17j12n8L7J0j05J26q4j9J1PM3q9M4L3K4p7O5n9l9M2
$$ 135 126 89 193 221 202 227 149 91 95 295 317 193 310 198 140 177 187 82 208 124 105 116 123 166 77 121 154 178 101 166 107 68 110
2866A10q9Q5m6P8M5N6p8R3j67R9j14K9J13K4j82N5J22q5j15J36ll2j15J09R1j76J50K6j4j21
$$ 110 21 106 60 138 183 239 161 254 87 186 72 101 214 238 56 111 233 148 33 169 166 134 19 128 219 43 193 219 205 84
2584H4NJ87M2j94Q0J6p2J2p2J10j3Q7j10p4pJ04j49N7O0J01j49J16k05J45J25j04Q3j3j93
$$ 84 89 276 318 124 204 220 148 160 88 198 185 272 162 88 81 185 36 93 153 254 105 221 16 161 286 182 265 252 59
2312E9K63j26j00K10j47J38p9N2J84j63j47J69p4K93m0l8JK33j6J72J37J32K61J163L261O104
$$ 59 322 196 96 306 159 297 218 270 454 291 144 313 239 532 492 454 455 688 672 844 981 1113 1374 2537 5798 11902
2068A1902o393l259o11n70j60j67o6j17k43J53r9R4j60L7n5k9j11K03k87K56j44n4J04m4p8
$$ 11902 5509 2250 1639 1069 909 742 676 559 316 469 370 464 304 341 286 257 146 349 62 318 174 120 224 180 102
1833A02J21pj65K38r8J17K3l8k25P6qO4j29L0N5M8j3R7j90J56j45m8O1J7J45j11J23j21J81
$$ 102 223 216 51 289 191 308 331 293 68 144 136 200 71 101 156 204 191 288 98 254 109 61 122 139 284 173 296 175 356
1561C56P5O6J606j76j126j18j20k12j16N8J35k74l2J21q4M1R6j0l9j19k7L8J16k0k06N3J6
$$ 356 431 497 2103 1927 801 683 563 351 235 293 428 154 122 243 159 200 296 286 247 128 101 139 255 235 29 82 98
1307I8q9J25m6Ol4J3k8L0k2j4N0P8mj34J27o1L8j01R7l3J12J10Pk19O7m4L4o5m9N6mL4K2M6
$$ 98 9 134 88 94 60 73 45 75 53 39 89 167 163 29 156 95 133 32 129 96 208 318 325 106 173 129 163 98 49 105 101 135 157 203
988B03j67J65k9Rp9L4l0p6Q2o2J13o9m6R1kmK8p0O5o6J13j18N5K2ljj29K3M9rn8N9R8q4k3
$$ 203 36 201 172 181 102 136 106 30 112 50 163 94 48 139 137 133 161 91 156 90 203 85 140 162 159 158 29 52 101 92 34 93 191 107 84
659H4O5q6Q2o3L0P2J00p0j86Q4p6L0M0N6q2O2o1J6j4J0M5o3J47J9q5j11N2j5J02j26O8J5j4
$$ 84 149 63 145 82 112 184 284 214 28 112 36 66 106 162 80 142 81 97 83 93 138 75 222 241 156 45 97 82 184 58 126 141 127
349A27k6l3K4l6qR1J01q5o1j6L6P8M5r8l3p0P5J4P9mjp4P8j59Q9j14Q5O1j19M7p2P6Q3r7J
$$ 127 101 68 92 56 48 139 240 155 94 78 114 192 237 139 106 36 111 125 204 200 199 125 203 44 133 19 104 165 46 93 21 97 180 83 84
21H4Q9q2k9L7n6J19m4J0oP7J3K6m9j34K19K0l5Kk32J17l7kQl7P1r2N3Mp3k4L9O5Nj9O2l8r5
$$ 84 173 91 62 99 43 162 118 128 122 199 212 238 189 55 274 294 259 261 29 146 109 107 115 78 149 57 110 114 41 17 56 121 126 107 169 131 36
-327C6N6K7n8L1%qM0
$$ 36 92 119 61 92 92 84 124
-392A24
##PAGE=	F1=-8975.09
##FIRST=	19140.455529915001534,	4405.895418600002813,	0
##DATA TABLE=	(F2++(Y..Y)), PROFILE
4406E3R7p8j3k6R7J04j9n5n3L8rN9m7l5N2n3R2k0O9j05M2l4O1jk9o9p3O4p0Q7jj4J3j8P1j49
$$ 53 150 72 59 33 130 234 215 160 107 145 136 195 148 113 165 112 204 184 253 148 190 156 217 216 187 118 45 109 39 126 125 111 124 106 177 28
4068B8J15N4j22mlN3Q6Lj69J97J9j45O7K6L0q9j20Q8l5m5K4R9o6j6K7n0jK7J71p5K6J20k18
$$ 28 143 197 75 71 68 121 207 210 41 238 257 112 179 205 235 146 26 114 79 34 58 157 91 75 102 52 51 78 249 174 200 320 102
3758A02K03J5k04Q2J37j42j05N6k0M0m1q5Q2j5M6K1Q8j90l8J29m3l4j9M8l4J15j8j29N3l4
$$ 102 305 320 116 198 335 193 88 144 124 164 123 38 120 105 151 172 260 70 32 161 118 84 65 113 79 194 176 47 100 66
3476F6J61J5p5J23q3o6o9Q9k5L0m3J28j72J41P5j03m4r0N4p2K9lM2QQ5o1o0J49Lp3K2l7n8
$$ 66 227 242 167 290 207 141 72 161 136 166 123 251 79 220 295 192 148 58 112 40 69 66 108 116 201 140 80 229 232 159 181 144 86
3166H6J2O4L7qK0p9p9M7J72J6j29J44j04j9l2Ll2J11j29j9K5RP9j48J4J15K4j30J24j6j17
$$ 86 98 162 199 191 211 132 53 100 272 288 159 303 199 180 148 151 119 230 101 82 107 116 195 47 61 176 200 70 194 178 61
2875F1M2p3M6MQ9oL9r2J02o2M9j39mJ59oj67P3J53j13j29J64l9l7j00J40O2j69J65Nk9o4j0
$$ 61 103 30 76 80 169 163 202 110 212 150 199 60 56 215 209 42 115 268 155 26 190 151 114 14 154 216 47 212 217 188 124 114
2575A14K26M4l00J55Qk8k7n7R6m4Q0j60mj7Q5j60J40j6J48j62J28j87J75J49j55O9j4j95K57
$$ 114 340 384 84 239 247 219 192 135 231 187 267 107 103 86 171 11 151 135 283 121 249 62 237 386 231 300 286 91 348
2303C48j31n8K12j40N4n4J36J94k00j33J58k3K42j9Mo8L27K6K03J57J96L92J327M234P867
$$ 348 217 159 371 231 285 231 367 561 361 228 386 363 605 586 590 522 849 875 1078 1235 1431 1823 3150 7384 15251
2068A5251q149m203p97o60k52k71k2j45k95J40n5R4j85k0m7l2j48K21l84K43k8m4O6q0J5M1
$$ 15251 7102 2899 2102 1442 1190 919 897 752 457 597 542 636 451 431 384 352 204 425 41 284 256 212 278 198 213 254
1824B54qj49K29r3Q7O5k2k34Q5j7K4q5K3J4Q2K2J12k35J60j77m5O1J7J42r8J10j25K04Q6L4
$$ 254 246 97 326 233 320 385 363 129 214 197 221 136 159 173 255 277 389 154 314 137 92 153 170 312 214 324 199 403 489 523
1542E23J440k57r83j11q7j81j68K7J95k32k3Q0l9J8J57l6q7j43oJ4J46J7j98K9k2o0J32o1
$$ 523 1963 1706 723 612 525 344 176 203 398 166 143 223 184 202 359 323 236 93 87 101 247 264 66 95 73 13 145 84
1279H4nl0Rj2ok5L5P4M8k8r5J49n7l2o0J10m6J05J18k3k32J22l2pm1r0P8k9P1L9J9j64J44
$$ 84 79 49 58 46 40 15 50 124 172 144 49 198 141 109 49 159 113 218 336 313 81 203 171 164 123 33 111 82 153 192 211 47 191
969A91k0L2j09Rk7l5Q8p2R6p2m0O9J2L1Jr7J11m5Q8j18P8J1n9kr1P5N2n4m7M0N4o8NQ0q5J17
$$ 191 171 203 94 103 76 41 129 57 153 81 41 110 122 153 154 57 168 123 211 93 171 182 123 121 30 105 157 103 56 96 150 82 87 167 82 199
631A99p5l1J12J1p6p7R4j28M9j7M8n4M4%L3l4j0Q6n9J38lj08r5mJ04R5j52L2pjj1k8L1q3J
$$ 199 124 93 205 216 140 63 157 29 78 61 109 55 99 99 132 98 88 174 115 253 250 142 47 43 147 242 90 122 115 114 103 75 106 23 24
302B4J00Q8q3m0k8M1P7L9n8k9j00N9K3J10o5oKO5j40J02j70J35N9r0L8r0kJ50q9p0J03n3k2
$$ 24 124 212 129 89 61 102 179 218 160 131 31 90 113 223 158 152 154 219 79 181 11 146 205 115 153 63 61 211 122 52 155 102 80
-7H0JnJ09m7rlO3pO1n0j25J87k9NJ5j84O5k9KK2k8M2j07O4L3p1m1K2P9L6n2M0l0k4l3Q8n7
$$ 80 81 76 185 138 129 126 189 182 243 193 68 255 226 231 246 62 127 98 100 122 94 136 29 93 126 55 14 36 115 151 99 139 109 85 52 140 83
-355H3J3K1l0L6
$$ 83 96 117 87 123
-392A23
##PAGE=	F1=-9053.85
##FIRST=	19140.455529915001534,	4405.895418600002813,	0
##DATA TABLE=	(F2++(Y..Y)), PROFILE
4406E1J11p5Qp9J49Q9o2m5m1KN2O5q4n8R1o4P2K6O2j28M1l8J07j6n1l6o0Jm4J10m4p1J39l0
$$ 51 162 87 95 16 165 254 192 147 106 108 160 225 141 83 174 110 182 208 270 142 183 145 252 236 185 149 89 90 46 156 112 41 180 150
4087A50R3j70P9O4j37J8j3O4R4k0j46J14K7j50Q5O2J6q8q7Ok1j0K5J37n7r0O9J2r8OJ71j8
$$ 150 243 73 152 216 79 97 84 148 242 222 76 190 217 67 152 214 230 142 55 61 40 30 55 192 135 45 114 126 28 34 205 187
3786A87N4Q0k40K07J3j86Q2J18q8j17K5p2O2k3p1N2L4N5rO9j65J0R6m7m6j5J2l1J09L0j48
$$ 187 241 321 81 288 301 115 197 315 227 110 135 63 125 102 31 83 117 172 163 232 67 77 173 126 80 65 77 46 155 185 37
3495C7R1j20K09K7j62J30nmj60J35l9M5q9J63j60R4O7j02Qp5J0l8lPN9m4R7p7n8J64K8r6M8
$$ 37 128 8 217 244 82 212 207 203 43 178 139 184 95 258 98 192 259 157 165 90 100 62 59 66 125 81 178 101 43 207 235 139 187
3185A87m6r3O6L0M5rJ1j04n9P8J34K2j40J67r0Qp6k5N7P3j64k4O2LJ29j81j3J59oj57J59L5
$$ 187 141 48 114 144 189 180 191 87 28 106 240 262 122 289 199 207 131 106 163 236 72 48 110 113 242 61 48 207 201 44 203 238
2885B38j51Jm8JO5Q3l5Kj01J12K5J1j38l1J77n5j39R5J85j51p4J47p8m7o4J52Qj38J69k1j7
$$ 238 87 88 40 41 106 189 154 156 55 167 192 203 65 34 211 156 17 112 297 146 72 219 141 94 30 182 190 52 221 200 183
2594A83mm5K60M4l94K10J5K4q0l2P0n1N3k11Q7l5O8j16J62q4J69j74J43j47J93J65j86L2k5
$$ 183 179 134 394 438 44 254 269 293 213 181 251 200 253 42 129 94 162 46 208 124 293 119 262 115 308 473 287 319 294
2321B94j78K20j14j3K01j26k1k4K04J90k25j14J44J8K00k9P4j40M14L2K31J55K49N00J410
$$ 294 116 336 222 209 410 284 263 239 443 633 408 294 438 456 656 627 701 561 975 1007 1238 1393 1642 2142 3552
2087C552M903R091r338m837r50p16l16l55J2j61l05J10j1P4j74q6l8l5j66K15l49J27P6k5
$$ 3552 8455 17546 8208 3371 2421 1705 1389 1034 1046 885 580 690 679 753 579 493 455 420 254 469 120 247 323 298
1861B98N3j39R2k9qj18K06r8M5J07qk15Q1rk5l1mlP9N8J40k65J27j77qN8J8J06q0J19j52K22
$$ 298 351 212 304 275 267 149 355 257 302 409 401 186 267 258 233 202 198 195 274 332 472 207 334 157 149 207 225 331 251 370 218 440
1561D40J05L0J276l72q61j24l9j61j57m6K33j96K0L2rK7J82n0j22j22Jj5J51M2j86L7p6j0
$$ 440 545 575 1851 1479 618 494 455 294 137 91 324 128 148 180 171 198 380 330 208 86 87 72 223 265 79 116 40 30
1298C0J20o9j7k0jJ2j0N8j0O1om2l4J67m4q9k6J12p7J00J26n2k47J78nn5j3j36J08m7P9N8
$$ 30 150 81 64 44 43 55 45 103 93 154 148 106 72 239 195 106 80 192 115 215 341 289 42 220 215 160 147 11 119 72 151 209
997B09Jj66J39k3L6j28J4l7K7O9o9Q5p0j3lL5N6j2r6J18k7N1j04R5%j02rpR8K6n3n6L5k8m7
$$ 209 210 44 183 160 196 68 82 45 72 141 72 157 87 74 71 106 162 150 54 172 145 196 92 187 187 85 76 69 167 193 140 84 119 91 44
669D4M3Q1r3J55q2m3J01q8n7O8N3j56N6m1M2k7JO1L8m9m1J10m2J22j7j07o2o2J91Q6j70J6
$$ 44 87 168 75 230 148 105 206 118 61 129 182 26 82 41 83 56 57 118 156 107 66 176 134 256 239 132 70 8 199 285 115 131
368A31l9JJj2L6o5m1R0P0p5Nn6M6O9K3j2k5j10L5L3J43j15l4O8M5r3R7k03J66L9o1K8q6m8
$$ 131 92 93 94 82 118 53 12 102 172 97 102 46 92 161 184 172 147 37 72 105 248 133 99 167 212 119 216 13 179 218 157 185 99 51
49E1J77o6j51J09j5ql9O2P9m6l6kM6k0R0l1j18J63p9K5K8j22J2j4j2L2j2Qq9R8L4q4n6KJ00
$$ 51 228 162 11 120 105 97 58 120 199 153 117 115 161 141 231 200 82 245 166 191 219 97 109 95 83 115 103 111 22 120 154 70 14 16 116
-280A16N4o9Qj7N7o0O9n7nL7n3L4
$$ 116 170 101 109 92 149 89 158 101 96 133 80 114
-392A14
##PAGE=	F1=-9132.6
##FIRST=	19140.455529915001534,	4405.895418600002813,	0
##DATA TABLE=	(F2++(Y..Y)), PROFILE
4406F4R9n9J9n7J49L0r8j7j7n8J13N5j00q8J50o7K9P7N7j56N0m3J52k9p7j0l3n7jJ00q8l9
$$ 64 163 104 123 66 215 245 147 130 113 55 168 223 123 35 185 118 147 224 281 125 175 132 284 255 178 168 135 78 77 177 89 50
4105E0J74k4R1j60L0N5j47M3nO2R3n0j08L3M6j24P7Q0Qq6m9m0k1MK8J48m9j53J26M7j21k5
$$ 50 224 200 291 131 161 216 69 112 107 169 262 212 104 137 183 59 136 216 224 138 89 49 28 32 60 208 159 6 132 179 58 33
3805C3J37M0P5L2k45J81K6j62O6R3j7j28rq7N4rl7j4J33K9m9M4j10L6O7m6m4k2k3lO1Q6j46
$$ 33 170 210 285 317 72 253 279 117 183 276 259 131 122 35 89 80 43 29 162 191 142 186 76 112 179 133 89 67 44 41 102 188 42
3495D2J11p6J12O6j93O9P1L9k09J78q7M6r0J80j41M1M7j00P3m9n1pl8K6O3p4R4n8o8J59M6
$$ 42 153 77 189 255 62 131 202 241 32 210 123 169 79 259 118 159 206 106 179 130 79 72 34 60 123 49 143 85 17 176 222
3204B22j04M6l9j02J09nN9l1Qj20M0K3J09L8j60J80q0K8r2o5J37K4j64m7J06qJ72j79pJ30
$$ 222 118 164 125 23 132 127 186 155 163 43 83 106 215 253 93 273 193 221 129 64 201 225 61 14 120 112 284 105 98 228
2922B28m9j50J66Q3j57o5%k5R3P3m6m9j00J37P0k9j03KJ22r4m5L2K16j85NJ19j17n5j7J51
$$ 228 179 29 195 278 121 56 56 31 124 197 151 102 2 139 209 180 77 79 201 107 62 94 310 125 130 249 132 77 60 211
2641B11o3q9J67n0K5K3p4K77L8m52K37K9P6j32j6L2k8K2j63Q5n0N1p4J60j25J62j78J60j04
$$ 211 148 59 226 176 201 224 150 427 465 13 250 279 355 223 207 239 211 233 70 155 105 156 82 242 117 279 101 261 157
2368A57J96J68j94j0l4j59J56o7K4J70r8q0PK46J71k33r5J26M1J67n3J44j95M74QK39J39K75
$$ 157 353 521 327 317 283 124 280 213 237 407 309 229 236 482 653 420 325 451 492 659 606 750 555 1029 1037 1276 1415 1690
2105A690N57J376N103R452r642m991j032p15l51l88L0j59k90Q0L4L9j43j47k2l1j89K04k88
$$ 1690 2247 3623 8726 18178 8536 3545 2513 1798 1447 1059 1089 930 640 720 754 793 650 503 481 450 261 465 177
1889A77K8J59pN9k01J38q3j0o4J76j13j1J49%j72O2Po2K3m4LN2Q0J75k73O2j49L6N1K2N7p5
$$ 177 205 364 357 416 215 353 270 260 196 372 259 248 397 397 225 287 294 232 255 211 214 266 346 521 248 310 161 197 248 270 327 252
1589B52J61j90K28J31L4J152m43q30j26nj42j00o7J73j77R3j7LN5J74n4j38p8Rl3J17N6j68
$$ 252 413 223 451 582 616 1768 1325 495 369 364 222 122 55 228 51 144 127 130 185 359 305 167 89 98 65 182 238 70
1326G0O4j19L1J01o9k0j4j1L7L7Q6n6L8o2k7J1J68k7j15j4J09j06R9J32p3k68K22K9r9J6j45
$$ 70 134 15 46 147 78 58 44 33 70 107 193 137 175 113 86 97 265 238 123 109 218 112 211 343 270 2 224 253 154 170 25
1035B5R7l7M6Q0%j76J45l7J4j20M1n2P6L7o5Q4p0K2o6N6O1j9n8Q5j5J1q0R8nj31j7P8R8mj8
$$ 25 122 85 131 211 211 35 180 143 157 37 78 26 102 139 74 158 88 110 44 100 161 142 84 169 154 165 85 183 178 47 30 108 206 202 184
706A84p6M2j25J1N3P3j18J86q3k0N6j75R5R2rj69O1JL8k3o0R8L6o1p4J13k0J08k1q5l7m2J78
$$ 184 108 150 25 36 89 162 44 230 147 127 183 8 103 195 186 17 78 79 117 94 34 132 168 107 33 146 126 234 213 128 91 49 227
396B27Q1j77K1p1j2J1PL7k8m6L5M6o8N0q2N9O2j2L2k4j07K0M8J63j36q3J10K6m2Q0k04J77
$$ 227 308 131 152 81 69 80 87 124 96 50 85 131 63 113 31 90 152 140 172 148 41 61 109 272 136 53 163 189 147 227 23 200
96B00J2m2K2o9m0J44l2j59O0J6kn7J10L7l9n7j1K7j8J04j0j02J33j13L0M4n6m1K0n1L1Oj7
$$ 200 212 170 192 123 83 227 195 36 96 112 110 53 163 200 161 104 93 120 102 206 196 94 227 114 144 188 132 91 111 60 91 97 80
-214H0l4J11J6r8n8nJ13O4o8j1KQ0o0K9n5j1M1p2L4
$$ 80 46 157 173 75 17 12 125 189 121 110 112 192 132 161 106 95 136 64 98
-392I8
##PAGE=	F1=-9211.36
##FIRST=	19140.455529915001534,	4405.895418600002813,	0
##DATA TABLE=	(F2++(Y..Y)), PROFILE
4406H4P3m5K5l2J54m2j16K0Rq6J15L0q5p9J70o1j4J04N8j78O4m7J84l1j08Rj2q7L1Q1j16N9
$$ 84 157 112 137 105 259 217 101 121 130 44 159 189 104 25 195 134 120 224 282 104 168 121 305 274 166 175 163 76 107 188 72 131
4105A31J20j1P0j40rL3j48P0J1M9R0q1o4k2P4p3M3O9Kp8j2j0p3LM0J23m6j27J04O2j12k1P8
$$ 131 251 240 310 170 161 194 46 116 127 176 266 185 121 99 173 100 143 212 214 136 124 114 41 44 84 207 161 34 138 200 88 67 145
3796A45Q2R9j9k25J22N3j35L7N9N9j31m7l3jNk0k4J89j1q5Pm4N3M1m0l0k9m1K3LJ22j25J06
$$ 145 227 326 307 82 204 257 122 159 218 277 146 99 66 65 70 50 26 215 204 119 126 82 135 176 136 106 77 36 59 62 184 59 165
3486A65l3J3J17j26j5O2N8j68J70j54K7k2J52j14mJ7r5J43j3j19J6o5M4M2n8O4j1o6J15N4
$$ 165 132 145 262 136 121 183 241 73 243 89 116 94 246 132 128 145 50 193 180 61 77 12 56 98 40 104 93 27 142 196
3204A96q7J0j7p8J27m3P2o8J3k8N4m6J08M1j71J79p7M4q9j04J87k3j31n4J08j7K01j62oQ6
$$ 196 109 119 102 24 151 108 180 112 125 97 151 105 213 254 83 262 185 229 140 36 223 200 69 15 123 106 307 145 139 225
2922B25q5j10J47J17j39j35N5j2P1N9n2j01OJ00N6p3m5N1N3n1%p0K31j97P5R2j45n8K7J41
$$ 225 140 30 177 294 155 20 75 63 134 193 141 40 46 146 202 129 84 135 188 137 137 67 298 101 176 268 123 65 92 233
2641B33j34k4J56p9P7K0r0K72K7m51K23M7J15j70j8pJ6np9L9n5L8l6J36j41J31j67J79q0J87
$$ 233 99 75 231 152 229 249 159 431 458 7 230 277 392 222 204 197 213 208 129 168 113 151 115 251 110 241 74 253 173 360
2359C60J55j78m0l6j44P1J6L8J18n2j25L1K58J46k25q0J07M3J41p7J92k23M98l6K21J16K66
$$ 360 515 337 297 261 117 188 204 242 360 308 183 214 472 618 393 313 420 463 604 527 719 496 994 958 1179 1295 1561
2105A561N51J224M783Q859q981m619j023o52l57l62L5j39k60N6P8lj03j92lj4k12J89k15m2
$$ 1561 2112 3336 8119 16978 7997 3378 2355 1703 1346 984 1019 880 620 676 754 751 648 456 453 439 227 416 201 159
1880A59K12PP1k47J52j19j2LJ51j29q5J88kj11L4J9p5O4q5K3K2Q4K07k57k0j01P1L7L0J5r3
$$ 159 371 378 449 202 354 235 223 226 377 248 163 351 349 238 272 291 216 280 195 218 240 324 531 274 254 153 224 261 291 306 213
1589B13K16k19K20J61M0J056m11r03p0k9j03n7L5j0r2R9o6nQ5J47n1j37l0K0l1M8N8j30R0
$$ 213 429 210 430 591 631 1687 1276 373 303 274 171 114 149 139 47 146 80 75 160 307 256 119 89 109 78 126 184 54 144
1317A44r1KP9n6j7rk1N3Q1J05r4J6q6J2KJ48j0j14j9J04j17J02J36q3k25J72O7j29M0j24M7
$$ 144 53 55 134 78 61 52 31 84 165 270 176 192 106 118 120 268 258 144 125 229 112 214 350 267 42 214 281 152 192 68 115
1025A15lj7J09J2j90J58m9m2o3N0m8Q8Np0R2p0N9o8M2M4l1qM4rk2n3Q2kj32NJ14P6l5L3r0
$$ 115 112 95 204 216 26 184 135 93 30 80 32 120 125 55 147 77 136 68 110 154 123 115 159 150 128 75 157 155 23 28 142 218 183 216 126
697A26N2j24K2K0O5j33J73q0J8Ol8R9N0q3j30K6M5M8k3r2R0L3o7p8O7jJ01nn7k9k6J56P6j66
$$ 126 178 54 76 96 161 28 201 121 139 145 107 206 256 173 43 69 114 162 139 47 137 170 103 25 92 91 192 187 130 101 75 231 307 141
378A41L9r4l8K8J2L4Pl8j0J7o8Q1p4N7O1n9O8j9r5J3N7J67j39j15J16J2lN8j70J65rl1K5n8
$$ 141 180 86 48 76 88 122 129 91 81 98 30 111 37 94 155 96 164 145 50 63 120 287 148 33 149 161 158 216 46 211 202 171 196 138
58A38rP8Oj28K7J7qm7J24j1k2o5k9L%R4Op3Q9j19K8O8qq7O5r3J6J5j9J4J09nr9n1OJ02P7n4
$$ 138 129 207 213 85 112 129 121 74 198 187 165 100 71 74 74 168 174 101 190 71 99 167 159 72 137 44 60 75 56 70 179 174 75 24 30 132 209 155
-299A55j1J0N4o3%n1KK8p7L0
$$ 155 144 154 208 145 145 94 96 124 47 77
-392G7
##PAGE=	F1=-9290.11
##FIRST=	19140.455529915001534,	4405.895418600002813,	0
##DATA TABLE=	(F2++(Y..Y)), PROFILE
4406A03M3m1L3j4J59j01r2L5K8l7K6qk8j6J15n5j8P9O1j87P0m2K01k3j36K1kr4M2O5j05J23
$$ 103 146 105 138 124 283 182 90 125 153 116 142 134 106 90 205 150 132 211 272 85 155 113 314 291 155 176 174 80 122 187 82 205
4105B05N5KL3j15l7Rj34R2L3K7Q2j04ql5P9l8K6L7ro2J2L2j35K3M9P3m3p7N6O4q8j3M1R9J22
$$ 205 260 262 295 180 143 152 18 110 143 170 252 148 140 105 184 146 172 209 200 138 150 182 47 70 119 192 149 72 128 192 104 91 132 231 353
3777C53o5j82M1R0j08MJ7J21j20p8K8m9J9l1L0J83l7j03m8J2O9K0l2j1l1l7J8%R7q3Q1Mq4
$$ 353 288 106 147 237 129 133 150 271 151 73 101 52 71 40 70 253 216 113 65 77 146 166 134 123 92 55 73 73 170 87 168 172 88
3467H8J60m8rm7N9q8J45k07k2R1R3q1k3k8o6J86L3j72K2m2K0qJK5K6p1P2N1m7l9Qn1J33p1
$$ 88 248 200 191 144 203 115 260 53 31 122 215 134 111 83 17 203 236 64 86 44 64 56 57 82 108 37 109 160 113 74 82 31 164 93
3148I3P4j11K6Q9L9j04J24K0j63J72p4N5q3j27J92n5r6l8Q2k1K11j31j6M2j09m8J15J27j01
$$ 93 167 56 82 171 210 106 230 250 87 259 185 240 157 30 222 167 71 33 115 94 305 174 158 200 91 43 158 285 184
2875A84j31L7MM2M8o5q8O2Q5Mj15J6R7oM9lj51J88j65J06O9j53n9O3J24j84M1J39r9J12Kr7
$$ 184 53 90 94 136 184 119 31 93 178 182 67 83 180 174 223 220 69 257 92 198 267 114 55 118 242 58 99 238 139 251 253 156
2575A56K53J0l97J77O4J34j86l7m0P1k9j5Ln0K9LJ00j37P4j31J94q6J70J26j45m7k9j27j9
$$ 156 409 419 22 199 263 397 211 174 134 205 176 161 164 114 143 146 246 109 183 52 246 160 330 456 311 264 235 108 89
2303H9J18K3N0Pj53L4K47J22j99p4R3K1J22r2K10k25M82q6J83Q8K30M88R81M028P476p529
$$ 89 207 230 280 287 134 168 415 537 338 264 357 378 500 408 618 393 875 789 972 1060 1290 1778 2759 6787 14263 6734
2058F734l812r30n42l29k96L3j07k21L7J19m3n9k17PJ5k10J55j41q2K38J1Q9k73J39j39j6
$$ 6734 2922 1992 1450 1121 825 858 751 530 567 686 643 584 367 374 389 179 334 193 111 349 360 449 176 315 176 160
1814A60P4J37j32j78K21j5m4NK1o0Q7j26M6PP4K34k25j02m6R2J8L5mj23K50k17J89J90N9R65
$$ 160 234 371 239 61 282 267 223 228 249 189 276 150 196 203 277 511 286 184 138 230 248 283 279 156 406 189 378 568 627 1592
1533A592l11j005M8j02m4p1J13j19M5J3j08k8J04J10m1j21J1K7k0l4N4m6P4m8l6N6l3j4jk4
$$ 1592 1281 276 324 222 178 107 220 101 146 159 51 23 127 237 196 75 86 113 93 59 113 67 141 93 57 113 80 66 65 41
1251D1N6J03J22j15Mp5K4k1J06J3r8l8R8j01J01J38q6k01J21J05j41N7r6k1M0q6J42K4j93
$$ 41 97 200 322 207 211 136 160 139 245 258 160 122 220 119 220 358 272 71 192 297 156 213 117 96 136 50 192 216 23
979B3J69m5j28L7K5l8P7j0r2J02o2R2l8J8J9n1L9J0j1l9l4N0Op0L1R5L1o4Q4r3O2p6mj5O7
$$ 23 192 147 19 56 81 43 120 110 18 120 58 150 112 130 149 98 137 147 136 97 63 113 119 49 80 175 206 142 226 133 195 119 115 100 167
650A67q9P2p1N7k8Q6J00J0j52o5k4O7N8j1j14P1K9o2m5k9J3J07L2m2m1j2J30P3j40O0j09o1
$$ 167 78 150 79 136 108 194 294 304 152 87 63 130 188 177 63 134 163 101 56 27 40 147 179 137 96 84 214 287 147 207 98 37
349C7N1oL4L8k4m1qp7R3m1L8O6r3Q6oq2J2N4J53j28j11Q8OJ5L1j00J31j7k4L7o8K5%M3q3K3
$$ 37 88 82 116 154 130 89 81 4 97 56 94 160 67 153 147 65 77 131 284 156 45 133 139 154 185 85 216 199 175 212 144 169 169 212 129 152
11A52Mk5m0J28n5jo1l5l5K8O0J6l4L8r4L3Q4Qj08R9j13Oj3J6L0R3k3p7m1J4P6J01l8rRPp3
$$ 152 156 131 91 219 164 163 102 67 32 60 120 136 102 140 46 79 163 171 63 162 49 55 42 58 88 181 158 81 40 54 130 231 193 184 193 200 127
-336A27j0m8L0Kn6P
$$ 127 117 69 99 101 45 52
-392E2
##PAGE=	F1=-9368.87
##FIRST=	19140.455529915001534,	4405.895418600002813,	0
##DATA TABLE=	(F2++(Y..Y)), PROFILE
4406A18J6m7M6j2J60j20m0J3M1J6n4n8N4J3O3n1J6J6O4j85O0k1K05nj56K8mr6L9N3o3J51j0
$$ 118 134 87 133 121 281 161 121 134 175 191 137 79 133 146 209 158 174 190 254 69 129 108 313 308 152 180 176 80 119 172 109 260 250
4096B50J2j2r2n2mr1Q5N7KO8j17P4l4M8j3K8Ml2m1K5O8j90O1M8J8l7k8jO0n9lL5Q0J38r1j28
$$ 250 262 250 158 106 102 11 96 153 155 223 106 180 146 194 181 209 213 181 140 165 233 43 104 152 170 133 105 104 164 105 102 137 217 355 264 136
3758A36m0J26q8j6l5J57r5q1O3q4K6l9O5J72l3r6j05K9Q6Ok8Ok8l5PL1L9k0M8K3j64J73K9
$$ 136 96 222 134 118 83 240 145 64 127 43 69 30 95 267 234 138 33 62 148 154 126 132 104 69 76 107 146 126 174 197 33 206 235
3448B35K7j70M6LJ14j78mO8K6m6j3p9K1J55Q4k08K2k6Nm7M7J2K4q2M3L7%m8J1m9J37p9O0j35
$$ 235 262 92 138 141 255 77 73 141 167 121 108 29 50 205 289 81 103 77 82 35 82 94 118 36 79 116 116 68 79 30 167 88 148 13
3129A3K9J80K5j33J32j7j32J63o5N8q0j43J71o7p9j1N9k2J99r0l5Lj12J3Q7J09n2j05kJ7J7
$$ 13 42 222 247 114 246 229 97 260 195 253 173 30 201 134 55 44 103 81 280 190 155 158 46 59 146 255 203 98 96 113 130
2838A30M4q3KM6P4n4j17M3J19m3J43oj72O5p9Q3M8j37o2R0R9j83P5J22j09J19j4j03K29j3
$$ 130 174 91 93 139 213 159 42 85 204 161 304 298 126 191 112 195 243 106 44 134 233 50 125 247 138 257 243 140 369 356
2556C56l17J26P5J34j81o8n9J20n2K7k2l3K6L7P3j19kn7J84j17J46Q0j02l2j4r7k8J31Kl1
$$ 356 39 165 240 374 193 125 66 186 134 161 139 106 132 169 242 123 121 64 248 131 277 357 255 223 209 112 84 215 217 186
2274A86P0j62RK23J03j49q9R2k1J14r7J99k13M39j27J36N5J81L86P09L025N683n672k775p79
$$ 186 256 94 103 326 429 280 191 283 262 376 279 478 265 704 577 713 768 949 1335 2044 5069 10752 5080 2305 1526
2040A526m09k71k28L3p2j82K1J58p5j6k18lM4j53R0q4r1K40NJ21k85J10j41l5J32J43j16k08
$$ 1526 1117 846 618 651 579 397 418 576 501 485 267 264 308 155 245 161 70 310 315 436 151 261 120 85 217 360 244 36
1777C6J70l4J6j7J3k9R4j59N9NO8K49j84j71J0R7%L3Kj35K27j78J41K09R7Q87k25j060J47
$$ 36 206 172 188 171 184 155 249 90 149 154 222 471 287 116 126 223 223 256 258 123 350 172 313 522 619 1506 1281 221 368
1504C68j45j1j03J42j23R9n0j36nP1N5k4q2L1K2oq8N2M2J4Pp4L1nj6J4j3M1J00J36j10ko9
$$ 368 223 212 109 251 128 227 177 41 36 107 162 138 56 87 109 103 15 67 109 123 130 56 87 82 66 80 67 108 208 344 234 232 163
1195A63J1k5N4M4p4p3R0o9R4J42q7j84P4J39j35O4o4r4P9j19J54K0j81J74l0j00J7ok9N7Q
$$ 163 174 149 203 247 173 100 190 121 215 357 270 86 160 299 164 228 164 70 149 30 184 204 23 197 167 67 84 78 49 106 114
903A14o0K2l6J09%kMp1O9j5j9m0k5J0J7ON4P1k3r3J19q2O9k8k3m8P0m2l4m6P4k7J47J04j2
$$ 114 54 76 40 149 149 147 151 80 149 134 115 75 50 60 77 83 137 208 185 92 211 129 198 170 147 99 169 127 93 47 121 94 241 345 333
575C33j99oo3O8N4J3j31N6K8m8k1n1j1J04P0m9o9jJ04P2j01P3j19o7O4l5M7N9j0o0k4o5O2
$$ 333 134 128 65 133 187 200 69 125 153 105 84 33 22 126 196 147 78 77 181 253 152 225 106 39 103 68 115 174 164 104 80 15 77
265G7j2J7P6r7Q2Qp7K2L7J30r8j05O6MRMj1Q1j8j2N3r1M5p2P2k5K7mn1m5J37r0J7n5j7o9M9
$$ 77 65 82 158 61 143 151 74 96 133 263 165 60 126 130 139 143 132 213 195 183 236 145 190 118 190 165 192 188 137 92 229 139 156 101 84 15 64
-83F4OK9JLl5K2P6kp9R5j19K5p3O6K3O8l5m2l0K1L5J35k4j8Kl4r3J3o1O5l6j1l0
$$ 64 70 99 100 103 68 90 166 164 85 180 61 86 13 79 102 170 135 93 63 84 119 254 230 212 214 180 87 100 39 104 68 57 27
-392B7
##PAGE=	F1=-9447.62
##FIRST=	19140.455529915001534,	4405.895418600002813,	0
##DATA TABLE=	(F2++(Y..Y)), PROFILE
4406A29j0n3O1k1J49r4lj9N0O0j00r3J09J8K2n2O2m5O1j77L6J6J97K1j63L1j5j08K8M7j0J54
$$ 129 119 66 127 106 255 161 158 139 189 249 149 56 165 183 205 153 215 170 231 54 90 106 303 324 161 192 177 69 97 144 134 288
4105B88o5J7n1q1m4Ol9M3Q4j1L5j13J72m2j3J4M3j6o7k1K7Q9k21J03M0k9k6Rn4N7m0PN7L3
$$ 288 223 240 189 108 64 70 31 74 158 147 182 69 241 199 186 200 243 227 160 139 166 255 34 137 177 148 122 131 77 134 94 101 158 191
3786A91J36q4p9r8J45p6j3r4J60n4m5N0j08K9J1K8J58Mp9j25j3J02%l4K3k7l9KO3k1N8K2J6
$$ 191 327 243 164 66 211 135 122 28 188 134 89 139 31 60 71 99 257 261 182 57 44 146 146 112 135 108 69 71 134 113 171 193 209
3476B09j48P4J07O3k34mP6R0q9L8l8l3j7Qp3N2J18J29k29J9j7jk5L8Rkr4K4K7L2j1op1J37
$$ 209 61 135 242 305 71 67 143 233 144 182 144 111 94 102 29 81 199 328 99 118 101 100 75 113 122 120 26 50 77 109 98 92 21 158
3157A58o7L5q0j6K11J7j32J19n9p7J54n4N0p5j56J39n9q2K1N6k6J64m7o1k4p5L4O9P4np9l8
$$ 158 91 126 46 30 241 258 126 245 186 109 263 209 259 184 28 167 108 26 47 103 77 241 194 133 109 34 68 137 211 206 127 89
2857H9K6JN1r7P1M0O1r8o5K8R4m9K03Pj64q6K9K9L3j05p1J07P1j37P7J07j05R5j6j11K09m2
$$ 89 115 116 167 70 141 181 242 144 79 107 201 152 355 362 198 112 141 170 203 98 27 134 205 68 145 252 147 242 226 115 324 282
2556B82k25P8P3J22j62r0n2J29o6N6m8rL0O2O5r6o4K0J61j33R7J1n5j2Nn0K5O1mj11J20j44
$$ 282 57 135 208 330 168 78 26 155 89 145 97 88 118 180 245 149 85 105 266 133 230 241 186 174 179 129 154 215 211 100 220 76
2256G6l2J83R2o6j36J05o1J06r3J71j99L79j36R5J5J30K76M80K025L967l901j779o09k87j84
$$ 76 44 227 319 253 117 222 161 267 174 345 146 525 389 484 499 629 905 1385 3410 7377 3476 1697 1088 801 617
2021F17k01M2m5j47mJ96r1K5j98m1N4m6J0m5q2K26oJ71k91Q2j11r9J66J68q3j51K4n2N5k2
$$ 617 416 458 413 266 262 458 367 392 194 153 207 161 171 126 44 270 264 435 144 226 115 16 182 350 267 116 140 88 143 121
1739A21JnR6j33LJ3P8K50j44k22O6R2qK2J5j10J43j16J00K01J43Q37k01j040J81j47j0j09
$$ 121 122 117 213 80 83 96 174 424 280 58 124 216 208 230 245 135 278 162 262 463 606 1443 1242 202 383 236 226 117
1476A17J21p5J17r4j43L0N0k7%k9L4NKl0L1M2n3O7r9mK0k3L2J1J4P7J46q3lr0j2oRQ3n5j19
$$ 117 238 163 280 186 43 73 123 96 96 67 101 106 108 78 109 151 98 165 66 62 82 59 91 102 116 193 339 256 253 163 151 145 154 237 182 63
1138F3Q1l7Q1J55q9j67L3J61j14O7l5j59J10q1J19j6j52J74k0m4k6l0k2L3N1j3q7kJ01M0k1
$$ 63 144 107 188 343 254 87 120 281 167 234 199 40 150 69 188 172 20 194 174 130 104 74 52 85 136 123 36 34 135 175 154
847A54Lo9O4k7l7l1j9j4RP5Q1N0p1j06J14o0P0J7k9q5O7Lj03J3L4MJ34J11j2k15L0q0O3K5
$$ 154 157 88 152 125 88 57 38 24 33 108 189 239 168 62 176 116 186 203 174 89 156 159 56 69 103 107 241 352 340 125 155 75 138 163
528A63M2j39M5L3l7rk1nO7Q1o4j05J6P0P4n9P5j22n0O0o7P8O6oo5k8p2M0JkQ5p8O6J6q3M5
$$ 163 205 66 111 144 107 98 77 72 139 220 156 51 67 137 211 152 227 105 55 115 48 126 192 186 121 93 21 61 62 60 145 67 133 149 66 111
190A11RJ11m4j10M9Jpk2Q1K2k3%O9j05M4j23R2L3L7rq2o1J59j09K0n0J2o6N2j2K1lJ8kj0O2
$$ 111 120 231 187 77 126 127 120 98 179 201 178 178 247 142 186 63 155 188 225 216 134 73 232 123 143 93 105 39 91 79 100 97 115 113 103 165
-148A65k6j0O2j26M9p8O8RM4m3j2j5K9j1J68qm1j0n0j06N8p2O7q1L6k9
$$ 165 139 129 191 65 114 36 104 113 157 114 102 87 116 105 273 265 224 214 164 58 116 44 111 30 66 37
-392C7
##PAGE=	F1=-9526.38
##FIRST=	19140.455529915001534,	4405.895418600002813,	0
##DATA TABLE=	(F2++(Y..Y)), PROFILE
4406A34l1n2P1k9J23m0J2m7M9R0j17r8J22Qmo1J06q5N0j64J0O1J78N1j62L8l0j37K8L2M0J38
$$ 134 103 51 122 93 216 176 188 141 190 280 163 65 187 195 191 130 236 151 201 37 47 108 286 337 175 213 183 46 74 106 146 284
4105B84j05K2o2r8K1K1m3PJ07Mk4q4K54n6q9M1O5k2j00qJ6R1k04J27K5o2qL0r5O3m6K0Q9j7
$$ 284 179 201 139 41 62 83 40 47 154 158 134 50 304 248 159 200 265 243 143 135 151 242 38 165 190 128 120 150 55 118 72 92 181 164
3786A64J08l7n0j27J45p5lj19J22MlNj19L7Q5m0J32N8o2j48l4R9Km9M0l2m8J0Q8q1J41Mpr1
$$ 164 272 235 185 58 203 128 125 6 128 132 129 134 15 52 137 97 229 287 225 77 43 142 144 95 135 103 55 65 153 72 213 217 210 119
3467A19p4J82R0j99n5N8Q7MO3j45p4%K6k2M2Q4J59k35J3j2LjL5mk9j04J0M1L2L1j5r8J25m0
$$ 119 45 227 317 118 63 121 208 212 275 130 56 56 82 60 102 186 345 110 123 111 114 113 148 144 115 11 21 62 94 125 110 12 137 97
3148I7Ql7j1J75J5j08Q4r6kJ38n0L6o6j47R8m1o5J2P8l6J13j2q7l6mQN6M4K7n5o7L4qO8j06
$$ 97 105 68 57 232 247 139 223 127 125 263 213 249 183 36 134 93 28 40 118 82 195 183 96 60 56 64 120 164 191 136 69 103 95 163 57
2819E7J09M7M7j23k5M0K1k8K24L6j42k02R9k4K4o9p0R7M2p4O8R3q5M3%j21J94o7j41M4N9J07
$$ 57 166 213 260 137 112 152 173 145 369 405 263 61 160 136 160 91 21 118 160 86 154 247 162 205 205 84 278 211 70 114 173 280
2519B80j41p1j1N7m4Q1j06J6M2P1P3p7o9N4J42j05K8q1pj5K4NN3jJ4j52J21j00oP0Q2L5j90
$$ 280 139 68 57 114 70 151 45 61 103 174 247 170 101 155 297 192 220 139 132 117 141 146 199 198 212 60 181 81 75 145 227 262 72
2209G2J10n0P1q4J45j69K97j08P7j8O9K02L57J281K771k673j099m63k00r2k19N8l5j05n9K17
$$ 72 182 132 203 119 264 95 392 284 361 343 412 614 971 2252 5023 2350 1251 788 588 496 277 335 300 195 136 353
1964C53p8N5j61q4J1O3l2j7o9K00k1K29k96P7p2j06Q6K06l9j33q1l0M0j4J4k5J04l8j29J6
$$ 353 275 330 169 85 96 159 127 110 41 241 220 449 153 230 158 52 138 344 305 172 91 61 101 87 101 76 180 142 13 29
1683B9J14K32j02k37R4Q6kRJ4q0N1o1R9J51J77Q01k28r46J58j32k1q6O3oJ23j22j28N1N7j08
$$ 29 143 375 273 36 130 216 214 223 237 157 208 147 246 397 574 1375 1147 201 359 227 206 120 183 177 300 178 50 101 158 50
1401E0K3MM5j2KJ8M1J0j05J25j06m8L3l1M4M3j4M6J47m4oj28m3L1j1J12m5j48O2k4O8J79q7
$$ 50 73 77 122 110 112 130 171 181 76 201 95 47 80 49 93 136 122 168 315 271 265 137 94 125 114 226 181 33 95 71 139 318 231
1091B31j49pJ69q6O8j2j99J24l1R7q1r4J51k5J3n4m4qOQ6L3j15k3O1P9l6J0n4M1k8o5lk2K2
$$ 231 82 75 244 158 226 214 15 139 108 205 124 30 181 156 169 115 71 63 69 155 188 73 50 111 190 154 164 110 151 123 58 55 33 55
772E5m9J09J13L2r6r0N4k8O1N7j7j28N4M2r8L7j4K5Q4J13J4k06L7p6O4k9P2j27L3L9l8lMO
$$ 55 6 115 228 260 164 74 128 100 161 218 201 73 127 169 71 108 94 119 203 316 330 124 161 85 149 120 192 65 98 137 99 96 100 106
453A06M8P6p3j22M2QP7j4O3j16j8M7r4J17O1j7n3k2q9K8J7l1P9m6M7K0r4O7j8J12J2j28L5
$$ 106 154 230 157 35 77 85 162 148 211 95 77 124 30 147 208 191 138 116 27 55 72 41 120 74 121 141 47 114 96 208 220 92 127
143A27mk0m2J55l2m1PQ5r1J6j42R5Q7N1j6j17p8J94j18Pm4M5n3O1J3mm5O0Mn4N0m8O8K4j39
$$ 127 123 103 61 216 184 143 150 235 144 160 18 113 200 251 235 118 40 234 116 123 79 124 71 132 145 141 96 156 160 106 156 108 176 200 61
-186F1O5n9O1mK9m5kjL5m6J86J1p2k3l8p6O6o1L0j07N1P
$$ 61 126 67 128 124 153 108 106 105 140 94 280 291 219 196 158 82 148 87 117 10 61 68
-392F8
##PAGE=	F1=-9605.13
##FIRST=	19140.455529915001534,	4405.895418600002813,	0
##DATA TABLE=	(F2++(Y..Y)), PROFILE
4406A31m6m2P2k6Q6J7J6n8K5J01j15r8J27pj5p6J34j00L5j43PQ4J50Q5j57M5l9j67O4k8P8
$$ 131 85 43 115 89 175 192 208 150 175 276 161 63 190 183 168 92 226 126 161 18 25 109 259 344 187 232 193 26 90 62 140
4115A40J10j29L2j6r2O3Np3k3J23L9q8k6K83o5j58N6Q7j5j08j1j0P0j31J20J0q4J3L8j23Q2
$$ 140 250 121 153 137 45 108 113 40 17 140 179 91 65 348 283 125 181 268 253 145 134 124 194 63 183 193 109 122 160 37 119
3824A19p6L4J20m7N1M4n0j28J28q6Jr4O3O8K0n4q5M3J39j00P9J10m4j77j0O9Rp0O0m6n1K5
$$ 119 43 77 197 150 201 245 195 67 195 109 110 16 79 147 167 113 28 71 210 110 189 299 255 78 68 137 146 76 136 90 39 64
3523F4J05j41K19j0l8k9r5J27J03j32o1l2J15P2P3k35q3pL9K6L7N3J63k23K%QJ0N4k8n2r5
$$ 64 169 28 247 237 199 170 75 202 305 173 112 80 195 267 340 105 22 15 54 80 117 170 333 110 112 112 120 130 184 156 104 9
3223InO7OO0j1j05R3j5j0k2J8J29J2p9L7j18P9J16n7J7n0j20O0k6k3m2J14m9O3J1j08j5M3
$$ 9 4 71 77 137 126 21 114 99 89 67 85 214 226 147 184 66 145 261 204 221 171 51 111 85 62 20 134 85 148 159 51 36 79
2913G9l3M6L3L6l7q6M4j2R1j19J25O2L7j33kP1p2QK08P7j18k12O6n5K1l1m5L7J9j0N6P8n1
$$ 79 46 92 125 161 124 38 82 70 161 42 167 229 266 133 131 202 130 138 346 423 305 93 159 104 125 94 49 86 105 95 151 229 178
2603A78k8K5j24J77q0p1L0L2R3j25k0jj3K6R7j88K4N6O5Q2o3m4P6J27o5k2j37K0p3L9N8N2
$$ 178 150 175 51 228 148 77 107 139 232 107 87 86 73 99 196 8 32 88 153 235 172 128 204 331 266 244 107 127 54 93 151 203
2303B03l9M1j28O1m3L3k4N4J20k00P0RJ5p1J36j09K03p2P6j2nJ95L26R47K200k127q47l60
$$ 203 164 205 77 138 95 128 104 158 278 78 148 157 172 101 237 128 331 259 335 323 318 513 839 1786 3986 1859 1012 652
2040F52j70l8k00M9l6m6j24J74l1O5j27p9p6J13j0Qo4J60l4K72k95Q5m8j11LK50Mj42j49L1
$$ 652 482 444 244 293 257 211 87 261 230 295 168 89 13 126 116 124 60 220 186 458 163 248 200 89 92 342 346 204 55 86
1758H6j0rM5p6J14N0j50j2J04J80n2j73M0P5J1J0Lp3om2J37Q0J87P58k72p98J09j10m9m3j6
$$ 86 76 67 112 36 150 200 50 38 142 322 270 97 137 212 223 233 236 163 157 115 252 332 519 1277 1005 207 316 206 157 114 98
1467I8O5J25j35j03O4O4j39K5NO8k2NM6N1k3j28J65j01q3K8k9M5O5l5L1J36j2j1j57o4M8k
$$ 98 163 288 153 50 114 178 39 64 69 137 115 120 166 217 194 66 231 130 47 75 46 91 156 121 152 288 276 265 108 44 92 90
1166I0J14l9j12J9n1N2K16p3j36n4J61n1O2Ok00J16J5Q9j45k1J00m7O7o6l6Qk0R3P8r9n8M
$$ 90 204 165 53 72 21 73 289 216 80 26 187 136 198 204 4 120 135 224 79 58 158 111 178 112 76 84 64 157 235 136 78 82
866H2J20m7J3l9J8j9r4N4n2N1m8O1J44K1j00p2j2OM3Q4J1j69L2P1o2L5l5J7L6J06O1j88J5
$$ 82 202 155 168 129 147 128 34 88 36 87 39 100 244 265 165 93 81 87 130 214 225 56 88 159 97 132 97 114 150 256 317 129 144
556A44o0P2q7R8q7PM2n4KK2K1K7O6o8q7N5q6Q1K8M1r8K3L0j04J44N1m3l2qq8J1N6o9L9lJ8
$$ 144 84 156 69 167 80 87 129 75 77 99 120 147 213 145 58 113 27 108 136 177 79 102 132 28 172 223 180 148 140 52 63 119 50 89 86 104
218A04L1q4N3k2J28L8j49K4j3k0m5J91o3p6%J00m1l6p6L3J23O6k8j48q5K27j23j2l4P7k9O8
$$ 104 135 51 104 82 210 248 99 123 110 90 45 236 173 97 97 197 156 120 44 77 200 266 238 90 5 232 109 97 63 140 111 179
-83A79L6l0q6R4Nr5L8n8J34j0j47O1k1N1j5K5l4j2mL7n9J81K8r9l4j4l5N8m1j3p7KM9
$$ 179 215 185 99 193 198 103 141 83 217 207 60 121 100 151 136 161 127 115 111 148 89 270 298 199 165 151 116 174 133 120 43 45 94
-392I4
##PAGE=	F1=-9683.89
##FIRST=	19140.455529915001534,	4405.895418600002813,	0
##DATA TABLE=	(F2++(Y..Y)), PROFILE
4406A20n1l4O4j7N9O0J8m2l3R6j00r2J28j8j6r3J36r4K6j14M9N1J16J26j51M8m2j54R4j20
$$ 120 69 35 99 82 141 201 219 177 144 240 140 48 176 158 142 49 185 91 117 3 52 103 219 345 194 242 200 46 140 20
4124B0R5Q4j36M4O8n9M2k0j01k0J03P1j13J5K66o6j93M5J06%p9l2m9K6k1R5jj00L2M0j43J06
$$ 20 115 199 63 107 175 116 158 138 37 17 120 191 78 93 359 293 100 145 251 251 172 140 91 117 96 191 190 90 122 162 19 125
3824A25j04L9J40m6k5J34p0r5R3j12pm8L6J11K2j11k1N2J68j36LJ35j7k05L6L5J3q6Q2o6k9
$$ 125 21 60 200 154 129 263 193 98 191 79 72 24 60 171 193 82 61 113 281 145 148 283 266 61 97 132 145 59 141 75 46
3533D6K4J14j64K45j0p6L2k8lJ05p6o5j09J60J05O9k86l8j8L1L8L1K7J38j90j5K6QJQ9n4o7
$$ 46 70 184 20 265 255 179 211 183 180 285 209 144 35 195 300 369 83 45 27 58 96 127 154 292 102 87 113 121 122 211 157 90
3232I0o2jN1j8P6%r5O8j3j6k5M8J08jo5kj13J39R0o9j3l0q4L7k4J5p4J17n3K3K1q4L8K3m8
$$ 90 28 27 78 60 136 136 41 109 96 80 55 103 211 210 145 143 30 169 259 190 177 147 63 100 76 91 17 134 81 104 125 41 79 102 54
2903E4K3K7J5k6q5O3j3J02j28J21P5L3j34J9R5j56M2J68J22j01j82Oo6K5J3k5l2mM4M5N7r
$$ 54 77 104 119 93 8 71 58 160 32 153 228 261 127 146 241 85 127 295 417 316 134 140 74 99 112 87 55 51 95 140 197 188
2603A88r9M9j16J48p5j7L4nQ1j10J9Rn0Q5J09j99j4L1N4Q5n3j2J04J11l4n1j24Pj24RJ03L1
$$ 188 89 138 22 170 95 78 112 107 188 78 97 106 56 141 250 51 37 68 122 207 154 142 246 357 323 272 148 155 31 40 143 174
2303A74n0N7r0KJ6N0o2QJ70j72jO8l2n9J41o2J56p4P4K4p4K30L10Q50J903j894p85k78j97
$$ 174 124 181 91 93 109 159 97 105 275 103 102 170 138 79 220 158 314 240 314 338 264 494 804 1654 3557 1663 878 600 403
2030D03k3j18K1l7Oj27M4L4O3r2p9J5m6P1J2n7J11m7K85k77Q8k9j18m9K85L8j61j98Q3k7q
$$ 403 380 262 283 246 252 125 169 203 266 174 95 110 64 135 147 90 201 154 439 162 250 221 103 54 339 377 216 18 101 74 66
1739F6N0p1P9J07j40MP1R3J5r5m1N5K0K7%q0k8o1J86K1J79P06l07o49P8q3r7J1j10J18J23
$$ 66 116 45 124 231 91 95 166 259 274 179 138 193 213 240 240 160 132 71 257 278 457 1163 856 207 285 202 105 116 6 124 247
1448B47j28q2O6O6j23K3k0Q5k6J9O4N3n0j30J79q4j08J9j3M2N6m2M2J15%j8j33qn3J8R2l4
$$ 247 119 37 103 169 46 69 49 134 108 127 191 244 194 64 243 159 51 70 57 99 155 113 155 270 270 252 119 111 58 76 168 134
1148A34m4J8n3m3K51n2j30n6R4j3M4K1j62Q8N1Q9j59J6L6p9J13o5jJ1m1P1J16o5q3m7J54n0
$$ 134 90 108 55 12 263 211 81 25 119 106 150 171 9 97 148 237 78 94 130 51 164 99 98 109 68 139 255 190 107 60 214 164
847A64Ol3NJr7R0q6N6m0lJ70K1r3o4n4M0K1R1M2j93KR0k6K3k8j4M0O4J19j77l1m0Q6j09R5
$$ 164 170 137 142 143 46 136 50 106 66 63 233 254 161 97 43 83 104 195 237 44 46 136 110 133 105 91 131 195 314 137 106 66 152 43 138
518A38l4k1L8q2J0K9L5jN8n0k6O2j23J8O5J3p2O8J6r7J50L8p7j2J4o9kR6j08j1M4k5O1n7N
$$ 138 104 83 121 39 49 78 113 112 170 120 94 156 33 51 116 129 57 125 141 44 194 232 155 143 157 88 86 182 74 63 107 82 143 86 91
190I1J1J24K7j61K0k3rl2J90n9j23k7J12L5r0qk4J38P5m7j63k4J88j30k2k1J08MO8M4n5j10
$$ 91 102 226 253 92 112 89 80 48 238 179 56 29 141 176 86 78 54 192 267 220 57 33 221 91 69 48 156 160 228 272 217 107
-111A07J08Mj13J6m1J64m0j35L5L8K9k5L1j7k3l5L3m2J45M1j13l9PmN0qn4n1l5P3
$$ 107 215 219 106 122 81 245 205 70 105 143 172 147 178 161 138 103 136 94 239 280 167 128 135 131 181 173 119 68 33 106
-392A06
##PAGE=	F1=-9762.64
##FIRST=	19140.455529915001534,	4405.895418600002813,	0
##DATA TABLE=	(F2++(Y..Y)), PROFILE
4406I9m5k3M1j0N2R2J3jj16Q1q1n2J01j0pq3O5o1K4n1N2QP9J72j39L6l8j19J10j66N5P9q4
$$ 99 54 31 72 62 114 206 219 218 102 183 102 50 151 141 134 51 116 55 79 28 80 88 167 339 200 236 198 79 189 23 78 157 73
4096G3kJ44m2K4m4j09QM7R0p9RK14n9j82QJ19J4j8o1r4l1J00N7kj09M1M3j42J13q4%J46l0
$$ 73 71 215 173 197 153 44 52 99 189 110 119 333 274 92 100 219 233 215 154 60 29 129 186 184 75 116 159 17 130 46 46 192 162
3786A62q6K04r6l9M7j49k2L5RJ25J2j46L6O7J82j51o6J14K2k24Q7ORr3J01q5J2NJ18j40K11
$$ 162 76 280 184 145 192 43 21 56 65 190 202 56 92 159 341 190 124 238 260 36 123 129 138 45 146 61 73 78 196 56 267
3495B67J0j20R2K9j15J08n5o7j09J53J16N9k89nj1L6J7J8LR3j28m5O7mk8J28p1p7k2nK9k3
$$ 267 277 157 249 278 163 271 216 149 40 193 309 368 79 74 63 99 116 134 137 230 102 57 124 120 92 220 149 72 50 45 74 51
3195E1O9K2q2P4m3j5pL8J17k4o7k0o0J41O7p6n1j9m7K9k9M4n3N6m2oL6oL8j0j9Qj9k2k2k0
$$ 51 120 142 60 134 91 76 69 107 224 200 133 113 53 194 261 185 134 115 68 97 68 112 59 115 73 67 103 97 135 125 106 114 95 73 51 31
2857C1N1j0Q6j08Q9P2L1j27M5R5k06N8J21J62r6j47l5p2L3O9j7n7l3N0L7L5L1j25L7q2Q6m4
$$ 31 82 72 158 50 139 211 242 115 160 255 49 107 228 390 294 147 112 40 73 142 125 68 35 85 122 157 188 63 100 18 104 60
2556F0K2L6m7P6r0L0L5m8R7J16k09pk8M6Q3m7J5J36Q6j4o5q8j9r0n7R6Mm2N0n3l4P1M4o9l9
$$ 60 82 118 71 147 57 87 122 74 171 287 78 71 43 89 172 125 140 276 362 348 283 195 176 86 29 125 129 87 137 84 50 121 165 96 57
2227E7J90j23p8J12p2l8J35k0J42j07N8P0j36K62K88P51J602j654o89j74k65k5j8jl7M5r9
$$ 57 247 124 46 158 86 48 183 163 305 198 256 326 190 452 740 1491 3093 1439 750 576 311 286 268 267 230 275 176
1974A76j03J00O2m5j14J14j47J33j2m4O1n9K65k37P5qj23n4K90N6j81j74O8j5J0NpK6J23j35
$$ 176 73 173 235 190 76 190 43 176 164 120 181 122 387 150 225 217 94 40 330 386 205 31 99 84 94 99 92 118 241 106
1692A06K6O2nR1k5j28K7K2N2J6q3m4p0J99rJ70O56l16n63R2n6j34M8l8rR4r2o9M7N9p9M0l1
$$ 106 132 194 189 280 255 127 154 176 228 244 161 117 47 246 237 407 1063 747 184 276 220 86 134 96 87 181 89 20 67 126 47 87 56
1382E6N6k3M0Q0M8o7j31J72n9j24J9J2M7Rl9O6R8mk5o0L4j37j3P7k6J4M9n0o0J77l2j24nk5
$$ 56 112 89 129 209 257 190 59 231 172 48 67 79 126 135 96 162 260 256 231 171 205 68 55 132 106 120 169 119 59 236 204 80 75 50
1063E0M0nM3j01M9P5Q5j19Qk6m8R7o6N7pn5L1J39k5r2p1J69n1j0l5KK9r2J09j09M6l0p3J89
$$ 50 90 85 128 27 76 151 236 117 125 99 51 148 82 139 132 77 108 247 222 130 59 228 177 167 132 134 163 71 180 71 117 87 14 203
744B03L2q5o5o8P2OO7O5j84l6J02%K%n0J03mJ65j80q0l7J15o3M1Lm0K9q1ROM8l4M9k6M4O3
$$ 203 235 150 85 17 89 95 162 227 43 7 109 109 111 111 61 164 160 325 145 65 28 143 80 121 124 84 113 32 41 47 95 61 110 84 128 191
406A91j02q4Q1j2m0J13Pr0J48J9j07%L5l8KJ18j46k9O6p2R8m1k3M3R3%j59K5l5J4k0J73l2
$$ 191 89 5 86 74 34 147 154 64 212 231 124 124 159 121 123 241 95 66 132 60 158 117 94 137 230 230 71 96 61 75 55 228 196
96A96j60NM5J06j12J9n4J34P4p1j48K1J42j37j9rJ38M2O4L5q1j11J02oj05j5OJ54o7j05KJ15
$$ 196 36 41 86 192 80 99 45 179 253 182 34 55 197 60 41 32 170 212 276 311 230 119 221 215 110 95 101 255 188 83 85 200
-205B00j2l1M3pk5q2K3lQ1M7j06l4J4J8M4K8q9l0k2M2
$$ 200 188 157 200 193 168 86 109 106 187 234 128 94 108 126 170 198 109 79 57 99
-392I9
##PAGE=	F1=-9841.4
##FIRST=	19140.455529915001534,	4405.895418600002813,	0
##DATA TABLE=	(F2++(Y..Y)), PROFILE
4406F9k3nlKM9J26pN3k08P7p3K2M7K5J2o7o3K7OpM2l7M6K20j22Ml1q0J16j62KR7j7q8J85k9
$$ 69 46 41 38 40 89 215 208 261 53 130 57 79 126 151 163 96 33 60 66 59 101 64 110 330 208 212 181 101 217 55 57 154 137 49 234 205
4068B05J3o0r9K6%R0k2j2J36n0j40k8J29J4N6q3j38L4Q3J1J1j05K9N9j22R6n2l8J30j3r2K17
$$ 205 218 158 59 85 85 175 153 141 277 227 87 59 188 202 258 175 37 71 154 165 176 71 100 159 37 133 81 43 173 160 68 285
3767B85j10J6Pj82K9N3k8J26kj39N7R0J80j48r4L1O9k14J15j2pq5J14r9M5j3J17j23J81M2
$$ 285 175 191 198 16 45 98 70 196 194 55 112 202 382 234 140 171 240 26 141 129 122 37 151 52 97 84 201 78 259 301
$$ [...]
-392H7
##END NTUPLES=	nD NMR SPECTRUM
##END=	
##END=	
