##TITLE=	Jan24-2022.63.fid
TM-VI-251, Na+PMB-pyr 13C

##JCAMP-DX=	6.0	$$ MestReNova 14.3.0-30573
##DATA TYPE=	LINK
##BLOCK_ID=	1
##BLOCKS=	2    
##ORIGIN=	Mestrelab Research S.L.
##OWNER=	hrzepa
##$MNOVA/LINK_BLOCK_TYPE=	ITEM	$$ NMR Spectrum
##$MNOVA/ITEM/POLYGON=	(XY..XY)
5321,5835
8722,5835
8722,8208
5321,8208
5321,5835
##$MNOVA/ITEM/Z=	0
##$MNOVA/ITEM/ANGLE=	0
##TITLE=	Jan24-2022.63.fid
##JCAMP-DX=	6.0	$$ MestReNova 14.3.0-30573
##BLOCK_ID=	2
##DATA TYPE=	MNOVA NMR VIEW DATA
##DATA CLASS=	MNOVA VIEW DATA
##$MNOVA/ITEM/ZOOM/X=	-31.150195598113686657,	251.15679998888273872
##$MNOVA/ITEM/ZOOM/Y=	-631.6188812255859375,	6685.24627685546875
##END=	
##TITLE=	Jan24-2022.63.fid
##JCAMP-DX=	6.0	$$ MestReNova 14.3.0-30573
##BLOCK_ID=	3
##DATA TYPE=	NMR SPECTRUM
##DATA CLASS=	XYDATA
##NUMDIM=	1
##ORIGIN=	Bruker BioSpin GmbH
##OWNER=	nmr
##.OBSERVE FREQUENCY=	100.64143946071199309
##.OBSERVE NUCLEUS=	^13C
##.SOLVENT NAME=	MeOD
##.PULSE SEQUENCE=	zgpg30
##LONGDATE=	2022/01/24 23:05:00.000
##.ACQUISITIONMODE=	SIMULTANEOUS (DQD)
##$ORIGINAL FORMAT=	Bruker XWIN-NMR
##$MNOVA/SCALES_VERSION=	9
##$PARAMETER FILE=	(acqus, ASCII, /private/var/folders/f6/rjf_tdyn2v98c5c0wvkgn4s80000gn/T/w4MdF2cJTeOZYX9zORZ+NQ/63/acqus, 0)
$$ ##TITLE= Parameter file, TOPSPIN		Version 3.2
$$ ##JCAMPDX= 5.0
$$ ##DATATYPE= Parameter Values
$$ ##NPOINTS= 11	$$ modification sequence number
$$ ##ORIGIN= Bruker BioSpin GmbH
$$ ##OWNER= nmr
$$ $$ 2022-01-24 23:05:38.317 +0000  nmr@CZC2439F63
$$ $$ /opt/topspin/data/agmb/nmr/Jan24-2022/63/acqus
$$ $$ process /opt/topspin3.2/prog/mod/shimcntl
$$ ##$ACQT0= -1.90126054427203
$$ ##$AMP= (0..31)
$$ 100 100 100 100 100 100 100 100 100 100 100 100 100 100 100 100 100 100
$$ 100 100 100 100 100 100 100 100 100 100 100 100 100 100
$$ ##$AMPCOIL= (0..19)
$$ 0 0 0 0 0 0 0 0 0 0 0 0 0 0 0 0 0 0 0 0
$$ ##$ANAVPT= -1
$$ ##$AQSEQ= 0
$$ ##$AQ_mod= 3
$$ ##$AUNM= <au_zg>
$$ ##$AUTOPOS= <51 >
$$ ##$BF1= 100.63037
$$ ##$BF2= 400.2
$$ ##$BF3= 100.63037
$$ ##$BF4= 100.63037
$$ ##$BF5= 100.63037
$$ ##$BF6= 100.63037
$$ ##$BF7= 100.63037
$$ ##$BF8= 100.63037
$$ ##$BYTORDA= 0
$$ ##$CAGPARS= (0..11)
$$ 0 0 0 0 0 0 0 0 0 0 0 0
$$ ##$CFDGTYP= 0
$$ ##$CFRGTYP= 9
$$ ##$CHEMSTR= <none>
$$ ##$CNST= (0..63)
$$ 1 1 145 1 1 1 1 1 1 1 1 1 1 1 1 1 1 1 1 1 1 1 1 1 1 1 1 1 1 1 1 1 1 1 1
$$ 1 1 1 1 1 1 1 1 1 1 1 1 1 1 1 1 1 1 1 1 1 1 1 1 1 1 1 1 1
$$ ##$CPDPRG= (0..8)
$$ <waltz16> <> <waltz16> <> <mlev> <mlev> <mlev> <mlev> <mlev>
$$ ##$D= (0..63)
$$ 0 1 0.00345 0 0 0 0 0 0 0.06 0 0.03 2e-05 3e-06 0 0 0.0002 0 0 0 0 0 0
$$ 0 0 0 0 0 0 0 0 0 0 0 0 0 0 0 0 0 0 0 0 0 0 0 0 0 0 0 0 0 0 0 0 0 0 0 0
$$ 0 0 0 0 0
$$ ##$DATE= 1643065537
$$ ##$DE= 6.5
$$ ##$DECBNUC= <off>
$$ ##$DECIM= 704
$$ ##$DECNUC= <off>
$$ ##$DECSTAT= 4
$$ ##$DIGMOD= 1
$$ ##$DIGTYP= 12
$$ ##$DQDMODE= 0
$$ ##$DR= 21
$$ ##$DS= 4
$$ ##$DSPFIRM= 0
$$ ##$DSPFVS= 20
$$ ##$DTYPA= 0
$$ ##$EXP= <c13>
$$ ##$F1LIST= <111111111111111>
$$ ##$F2LIST= <222222222222222>
$$ ##$F3LIST= <333333333333333>
$$ ##$FCUCHAN= (0..9)
$$ [...]
$$ ##$Sgu3PowerLevels= (0..7)
$$ 0 0 0 0 0 0 0 0
$$ ##$Sgu4PowerLevels= (0..7)
$$ 0 0 0 0 0 0 0 0
$$ ##$Sgu5PowerLevels= (0..7)
$$ 0 0 0 0 0 0 0 0
$$ ##$Sgu6PowerLevels= (0..7)
$$ 0 0 0 0 0 0 0 0
$$ ##$Sgu7PowerLevels= (0..7)
$$ 0 0 0 0 0 0 0 0
$$ ##$Sgu8PowerLevels= (0..7)
$$ 0 0 0 0 0 0 0 0
$$ ##$SguType= 3
$$ ##$ShimPowMaxUA= (0..63)
$$ 130000 130000 130000 130000 130000 130000 130000 130000 130000 130000 130000
$$ 130000 130000 130000 130000 130000 130000 130000 130000 130000 0 0 0 0
$$ 0 0 0 0 0 0 0 0 0 0 0 0 0 0 0 0 0 0 0 0 0 0 0 0 0 0 0 0 0 0 0 0 0 0 0 0
$$ 0 0 0 0
$$ ##$ShimPowMaxUC= (0..63)
$$ 130000 130000 130000 130000 130000 130000 130000 130000 130000 130000 130000
$$ 130000 130000 130000 130000 130000 130000 130000 130000 130000 0 0 0 0
$$ 0 0 0 0 0 0 0 0 0 0 0 0 0 0 0 0 0 0 0 0 0 0 0 0 0 0 0 0 0 0 0 0 0 0 0 0
$$ 0 0 0 0
$$ ##$ShimPowMaxUG= (0..63)
$$ 524287 524287 524287 524287 524287 524287 524287 524287 524287 524287 524287
$$ 524287 524287 524287 524287 524287 524287 524287 524287 524287 0 0 0 0
$$ 0 0 0 0 0 0 0 0 0 0 0 0 0 0 0 0 0 0 0 0 0 0 0 0 0 0 0 0 0 0 0 0 0 0 0 0
$$ 0 0 0 0
$$ ##$ShimPowRcbType= 3
$$ ##$ShimPowRes= (0..63)
$$ 1e-20 1e-20 1e-20 1e-20 1e-20 1e-20 1e-20 1e-20 1e-20 1e-20 1e-20 1e-20
$$ 1e-20 1e-20 1e-20 1e-20 1e-20 1e-20 1e-20 1e-20 0 0 0 0 0 0 0 0 0 0 0 0
$$ 0 0 0 0 0 0 0 0 0 0 0 0 0 0 0 0 0 0 0 0 0 0 0 0 0 0 0 0 0 0 0 0
$$ ##$ShimPowRng0= (0..63)
$$ 1 1 1 1 1 1 1 1 1 1 1 1 1 1 1 1 1 1 1 1 0 0 0 0 0 0 0 0 0 0 0 0 0 0 0 0
$$ 0 0 0 0 0 0 0 0 0 0 0 0 0 0 0 0 0 0 0 0 0 0 0 0 0 0 0 0
$$ ##$ShimPowRng1= (0..63)
$$ 1 1 1 1 1 1 1 1 1 1 1 1 1 1 1 1 1 1 1 1 0 0 0 0 0 0 0 0 0 0 0 0 0 0 0 0
$$ 0 0 0 0 0 0 0 0 0 0 0 0 0 0 0 0 0 0 0 0 0 0 0 0 0 0 0 0
$$ ##$ShimPowRng2= (0..63)
$$ 1 1 1 1 1 1 1 1 1 1 1 1 1 1 1 1 1 1 1 1 0 0 0 0 0 0 0 0 0 0 0 0 0 0 0 0
$$ 0 0 0 0 0 0 0 0 0 0 0 0 0 0 0 0 0 0 0 0 0 0 0 0 0 0 0 0
$$ ##$ShimPowRng3= (0..63)
$$ 1 1 1 1 1 1 1 1 1 1 1 1 1 1 1 1 1 1 1 1 0 0 0 0 0 0 0 0 0 0 0 0 0 0 0 0
$$ 0 0 0 0 0 0 0 0 0 0 0 0 0 0 0 0 0 0 0 0 0 0 0 0 0 0 0 0
$$ ##$ShimSysFunc= (0..63)
$$ 1 2 3 4 5 7 9 11 15 16 8 10 12 14 6 17 13 18 19 20 0 0 0 0 0 0 0 0 0 0
$$ 0 0 0 0 0 0 0 0 0 0 0 0 0 0 0 0 0 0 0 0 0 0 0 0 0 0 0 0 0 0 0 0 0 0
$$ ##$ShimSysMatrix= 0
$$ ##$ShimSysType= 1
$$ ##$TFXNUM= 0
$$ ##$TRIPLO2= 0
$$ ##$VTU= 2
$$ ##$VTUETH= <149.236.99.20>
$$ ##$VTUTY= <no>
$$ ##$WBREFAM= (0..15)
$$ 135.5 97.7 100 100 100 100 100 100 100 100 100 100 100 100 100 100
$$ ##$WBREFLM= (0..15)
$$ 0 0 0 0 0 0 0 0 0 0 0 0 0 0 0 0
$$ ##$WBREFPH= (0..15)
$$ 72.26 -67.22 0 0 0 0 0 0 0 0 0 0 0 0 0 0
$$ ##$WBSGU= (0..15)
$$ 0 0 0 0 0 0 0 0 0 0 0 0 0 0 0 0
$$ ##$XFAC= 2
$$ ##END=
$$ 
##$DECIM=	704
##$DSPFVS=	20
##XUNITS=	HZ
##YUNITS=	ARBITRARY UNITS
##FIRSTX=	25274.001712016048259
##LASTX=	-3134.6557087493106337
##DELTAX=	-0.43348832563920586258
##XFACTOR=	1
##YFACTOR=	0.083649649860578240146
##FIRSTY=	-2.3338568210601806641
##MINY=	-23.8691864013671875
##MAXY=	6077.49658203125
##NPOINTS=	65536
##XYDATA=	(X++(Y..Y))
$$ [...]
10656I2k7k6j1J5L8L7Rj9j5J9M2L2kk6k4rMJ0J0Plj2j1KJ7J5mk3k3pLkj2j0JQkj5j4QK9K7
$$ 92 65 39 28 43 81 118 127 108 93 112 154 186 184 158 134 125 129 139 149 156 153 141 130 132 149 164 160 137 114 107 110 108 96 86 87 95 93 78 64 72 101 128
10638A28Oj0oRJ1jj1qLRRJ1J3J2QOO%j1j9j3kQNj0k7l6k8mK1K9J6nj2jJ3J0loNJ6J1nj8k0
$$ 128 134 124 118 127 138 137 126 118 121 130 139 150 163 175 183 189 195 195 184 165 152 150 158 163 153 126 90 62 58 79 108 124 119 107 106 119 129 126 120 125 141 152 147 129 109
10619A09pJ4L1K7%k6l1j2J1K1J6jj8k2j2jMOJ9K9J6j3k7rK0K5Qj2j7j8j8j8j1mjJjmrroLJ4
$$ 109 102 116 147 174 174 148 117 105 116 137 153 152 134 112 100 99 103 109 128 157 173 160 133 124 144 169 177 165 148 130 112 94 83 79 78 79 78 74 65 56 50 53 67
10600F7K3J9Nqj0mln%Njj5j2J8M9N3L2J0jrj5j6oJ%jLNok4l3k9l0l4k5JK8M0M0L6K8Ok3m2
$$ 67 90 109 114 106 96 92 89 84 84 89 88 73 61 79 128 181 213 223 222 213 198 182 176 177 177 176 179 184 178 154 121 92 62 28 3 4 32 72 112 148 176 182 159 117
10581A17m0k3lQJ3J0RJ2J2OmqmJMPNpk7l2j4Klk1k1jJ6J4JJQQkj0oJjnKJ2J5J2J3J9J0k0m5
$$ 117 77 54 51 59 72 82 91 103 115 121 117 109 105 106 110 117 122 115 88 56 42 44 41 20 -1 -2 14 28 29 30 38 46 44 34 28 29 28 23 25 37 52 64 77 96 106 86 41
10561D1l5LL7M8M0L1K1J4Mpk1l7m6m7l6j5J2L4L5K2Noj9k6j8NL2M3M2L2J2j1k5j9pmj2j4o
$$ 41 6 9 46 94 134 165 186 200 204 197 176 139 93 46 10 -5 7 41 76 98 103 97 78 52 34 39 71 114 156 188 200 189 164 145 138 134 122 108 102
10544A02NRJ1J2J1QML%knnqqkJ3K8L5K9J7OJmj3j7nJ5J6rl2l3k4j9j3PK7K4Kj6j5j4k2j8L
$$ 102 107 116 127 139 150 158 162 165 165 163 158 153 145 137 135 148 176 211 240 257 263 264 260 247 230 225 240 256 247 215 182 158 139 126 133 160 184 186 170 155 141 119 101 104
10525A04K8L0J5MOJ6K3K0Mk1m1m2k5mJ2J3RL%nj3k2k3j7nPJ0kk4l2j2J6K0kk3k5j4pMJ6J7
$$ 104 132 162 177 181 187 203 226 246 250 229 188 146 121 117 129 142 151 154 154 149 136 114 91 74 69 76 86 84 60 28 16 32 52 50 27 2 -12 -19 -15 1 18
10507A8ok6k3jJ9K3L3N0O4O2M1J0j2j8j0j1k0k7k4j8j8j6KJ9J8Lqj1j6k3k2j6rLK4M6M2J8
$$ 18 12 -14 -37 -38 -19 4 37 87 151 213 254 264 252 234 224 213 193 166 142 124 106 90 92 111 129 132 124 113 97 74 52 36 27 30 54 100 142 160
10490A60jpj5l0l3j0K0K7J5KJPJ3J2jj4j6%J5J3kj4k1k6k2j0PJ4J1RQLnj0pkNJ7K8K5Nj1j3
$$ 160 159 152 137 107 74 64 84 111 126 128 129 136 149 161 160 146 130 130 145 158 156 142 121 95 73 63 70 84 95 104 112 115 110 100 93 91 96 113 141 166 171 160 147
10472A47oj0k8m0l8k2lJ3K2K7K6K0J4OjjNJ4J2nk8m1l5j4J2K9K9Pk5m5m0j6JONRJ7J8J5J9
$$ 147 141 131 103 63 25 3 0 13 35 62 88 108 122 128 127 126 131 145 157 152 124 83 48 34 46 75 104 111 86 41 1 -15 -14 -8 -3 6 23 41 56 75
10454G5L1L6K5NojMmj9l0k9k2j0J2L1L4J6j3l1l0j5LJ5K1K0J5Kj3j7nJ0J1PJ0K3K4Nj7k7k6
$$ 75 106 142 167 172 166 165 169 165 146 116 87 65 55 67 98 132 148 135 104 74 59 62 77 98 118 133 135 122 105 100 110 121 128 138 161 185 190 173 146 120
10437A20k3j9j1kjqj6k4k3j4KJ4J8K2K7K4J0LPQrk8k9j5mMK0L8M0K3J2J2Qnj4kJ9K9K3Opj1
$$ 120 97 78 67 65 64 56 40 16 -7 -21 -19 -5 13 35 62 86 96 99 106 114 105 77 48 33 29 33 53 91 131 154 166 178 186 181 167 165 184 213 236 242 235 224
10419B24n%oj5j4%Kj1k0j4kJmnllLK2L6K5pl4m5l7j7J5L5K6ok8k4j1ormJ2K9K9Pk1l4j9MN
$$ 224 219 219 213 198 184 184 186 175 155 141 139 140 136 131 128 125 128 150 186 211 204 170 125 88 71 86 121 147 141 113 89 78 72 63 59 71 100 129 136 115 81 62 66 71
10400G1j2k2rJ1J6OPK2L4L2J6%qj0mRK6L8M0L0J3pk4l4l7k6pJ0J2jj7k4j9j6j8k0rJ0K4K3
$$ 71 59 37 28 39 55 61 68 90 124 156 172 172 164 154 150 159 185 223 263 293 306 299 275 241 204 178 171 181 193 192 175 151 132 116 98 78 69 79 103 126
10382A26J2M%j%NQP%lKKmj5k6k7k2qRJ7J3jj5k2j2RK5K4OqromJK2M7N2L5J8J5J5kk9m0k5m
$$ 126 138 142 142 141 141 146 154 161 161 158 160 162 158 143 117 90 68 60 69 86 99 98 83 61 49 58 83 107 113 105 96 90 86 87 109 156 208 243 261 276 291 289 260 220 195 191
10362A91K%KRJj9l9m0k9j5qpj4k4j9LK6L0J1n%K0L9M8L7J5pj3ojqj5j6j3rj2j8k6k6j0J7K9
$$ 191 193 193 195 204 205 186 147 107 78 63 55 48 34 10 -9 -6 20 50 61 56 56 76 115 163 200 215 208 195 189 188 180 165 149 136 127 115 97 71 45 35 52 81
10344H1J8lrkLjlJONJMJ1J5J6J9K6K8J1k6n9p1n5k1J1L5M5M2L8L2K1lk4k4nPOOJ6K7K2Poj5
$$ 81 99 96 87 85 88 87 84 85 91 96 97 101 112 127 143 162 188 216 227 201 142 71 16 -5 6 41 86 128 166 198 219 216 192 168 163 170 176 182 198 225 247 254 248 233
10325B33k5l0k1nNPJ1J1Jj4j5KJ6J8J3J3J6J0j0l1m3l9k0RK7K6Qrj7qMNj0k3j7NJ8J4OMPK
$$ 233 208 178 157 152 157 164 175 186 187 173 158 160 176 194 207 220 236 246 236 205 162 123 103 112 139 165 173 164 147 139 143 148 138 115 98 103 121 135 141 145 152 154
10307A54j1j8j4mQJ4Pqj3kJ6K7L0K5J1j0k8l2k3j8j8j8j7j5r%QNjNK8M2L1Kj9j6KJ7J9J5R
$$ 154 143 125 111 107 115 129 136 128 115 113 129 156 186 211 222 212 184 152 129 111 93 75 58 43 34 34 42 47 46 51 79 121 152 154 135 119 121 138 157 172 181
10289A81PMLMJ0J3J2ROpk1k9j5NPqk3j9mRJ6J4Mrj7j4j0j2j5pJ6L0K1Jj1lPjk5m3l6j3LNO
$$ 181 188 192 195 199 209 222 234 243 249 242 221 192 177 182 189 181 158 139 135 144 160 174 178 169 152 138 128 116 101 94 110 140 161 162 151 148 155 154 129 86 50 37 40 45 51
10270E1J5K5K6J8Mj4k9k7pJ3J6NMK2M4M1J0l0n0l7oJ8J6kj8k4k4j9pJ4K5J8kj7j2KJ6K1K2
$$ 51 66 91 117 135 139 125 96 69 62 75 91 96 100 122 166 207 217 187 137 100 94 112 128 126 108 84 60 41 34 48 73 91 89 72 60 62 78 99 121
10253A21K1J5RQJ5J9J1j3l4l9k8j6pMJ3J2LlNK0K0PonMP%okPJ0%j7l2l8l0j8p%OORJ5K6K5
$$ 121 142 157 166 174 189 208 219 206 172 133 105 89 82 86 99 111 114 111 116 136 156 163 157 152 156 163 163 157 155 162 172 172 155 123 85 55 37 30 30 36 42 51 66 92 117
10233A17J0ppLJj5k5j7oqj2JJ7J2j0j3J2L6L2J1jMJ5K4K7J7nk6l1k8k0pJ1J8Jj9j6J3L4K5
$$ 117 127 120 113 116 117 102 77 60 54 46 34 35 52 64 54 41 53 89 121 132 131 135 150 174 201 218 213 187 156 128 108 101 112 130 131 112 96 109 143 168
10216A68KmOQpk9l7l1j9oQK1L1K6J3%kK%nj0j5j8j7nJ2J9J5J0J1Qqk6l1k2j2pprj4k3k4KM7
$$ 168 170 166 172 180 173 144 107 76 57 51 59 80 111 137 150 150 148 150 150 145 135 120 102 85 80 92 111 126 136 147 155 147 121 90 68 56 49 42 33 19 -4 -28 -26 21
10197B1Q8R1N7J2k2m3n6n8m2j4J0K5K9J6j1l3l3j4MJ4K7L8L3J1rj2j2j8j7QL4L3Nj6rJ1J7
$$ 21 109 200 257 269 247 204 148 90 48 34 44 69 98 114 103 70 37 23 27 41 68 106 139 150 141 129 117 99 82 90 124 157 162 146 137 148 165
10181A65Jk1l6l4k0rqoPJ9J6nj8nJ5K0%k0k2JK4L3L2L1L2K6J2JMPql3m6l5rJ6K5J4j1k6k0
$$ 165 166 145 109 75 55 46 38 32 39 58 74 69 51 46 61 81 81 61 39 40 64 97 129 160 192 218 230 231 235 242 234 201 155 120 111 127 152 166 155 129 109
10163A09njjJ2L5L6Ok7k9oJ3J9K1K6K6J0k1m9o0m9l1k1j6pQJ6J6J1J2J1QJ2K5K8J4qk2k4k8
$$ 109 104 103 102 114 149 185 191 164 135 129 142 161 182 208 234 244 223 174 114 65 34 13 -3 -10 -2 14 30 41 53 64 72 84 109 137 151 143 121 97 69
10146F9l5l4k6j7qLJ6K5K9K8K0J0PJ4J9J5J1Pjk0k7j2J2J6jj8k0k1k4k0kJ8K9L2K5J3Jkpk0
$$ 69 34 0 -26 -43 -51 -48 -32 -7 22 50 70 80 87 101 120 135 146 153 152 132 105 93 105 121 120 102 82 61 37 17 15 33 62 94 119 132 133 131 124 104
10129A04l2k7qNPJ7M1N6L9Kk6l4k3mRLj1j3JJ4J1Knj1j8j0RK0OpLK1K3J3J1J6Pj4k6j7qj1
$$ 104 72 45 37 42 49 66 107 163 202 204 178 144 121 117 126 129 118 105 106 120 131 133 128 117 99 89 98 118 124 117 120 141 164 177 188 204 211 197 171 154 146 135
10111A35j9k7l5l8k6jJ9K8L2L6K6Lj5j3k%kKMmj1jJ8L2M0M0L1Pj9l1k6k0k2k5j9qMJ8L0L6
$$ 135 116 89 54 16 -10 -11 8 36 68 104 130 133 118 105 103 103 101 103 107 103 92 91 109 141 181 221 252 259 240 209 183 163 141 116 97 89 93 111 141 177
10093A77L5L0K0Mj5l5m7m1j8NLj8k7j3Jkj5j4LJ4J8K1J9NqlJ4Qk0l8k5n%jNJ4On%J6J6lk0
$$ 177 212 242 262 266 251 216 169 128 110 115 118 100 73 60 61 59 44 30 33 47 65 86 105 110 102 99 113 121 101 63 38 33 33 32 37 51 57 52 52 68 84 81 61
10075F1j1J2L3M0L6K3Oj1j7j8j7j6rjRJ1Lrj4lJ2K2J7lk9m5l5LL8M4K2joLJ4J8J0pj7j1Kk
$$ 61 50 62 95 135 171 194 200 189 172 154 137 121 112 111 120 131 134 125 111 108 120 142 159 156 127 82 47 50 88 132 154 153 147 150 164 182 192 185 168 157 159 157
10056A57j8j9NK5J5j0j9j1nnNL4N0L2j0l6l7k6k3k0oJ4J9Nj8k9k4pJ4K9L1J9O%nj8l2l2k3
$$ 157 139 120 125 150 165 155 136 125 120 115 120 154 204 236 226 190 153 127 104 84 78 92 111 116 98 69 45 38 52 81 112 131 137 137 132 114 82 50 27
10039B7k2k9k5JK8K7J1MJ0Nj5k6j7NJ2N%QK1L1L3L0K3J7J4QKnqrj1j3j6k1j7LL2L9J3k5l4
$$ 27 5 -24 -49 -48 -20 7 18 22 32 37 22 -4 -21 -16 -4 1 1 9 30 61 94 124 147 164 178 186 188 183 175 166 155 142 126 105 88 91 123 162 175 150 116
10022A16j3O%k0l1l0k6k0nJ8L4L7L1K3J8J5J2Prl1m2l3j1OJ1Olj2j7j7qNJ8J9J2MMNjj0oJ5
$$ 116 103 109 109 89 58 28 2 -18 -23 -5 29 66 97 120 138 153 165 172 163 132 90 57 46 52 63 69 66 54 37 20 12 17 35 54 66 70 74 79 78 68 62 77
10004G7L6M1L1J6nl7o2n4j4J8J6noJ2K1J5MPPpk9m2l6j8nOJ2J1Moj3j0MJ9K8K5J5kj6k4k5
$$ 77 113 154 185 201 196 159 97 43 29 47 63 58 52 64 85 100 104 111 118 111 82 40 4 -14 -19 -13 -1 10 14 8 -5 -15 -11 8 36 61 76 74 58 34 9
9986Ij8j4mQJ5J0KjJQK3M4N3L1pl0k3rnqmMLMJ5L3L9L0K1J5%k1l6l1k0k1l0l0j7LJ2Ppj4j1
$$ 9 -9 -23 -27 -19 -4 6 8 7 8 16 39 83 136 167 160 130 107 98 93 85 81 85 88 92 107 140 179 209 230 245 245 224 188 157 137 116 86 56 39 42 54 61 54 40 29
9966B9KJ7K3J9Mj8l3l5k0%K2M5N5N0L1J1oj7k3k3k3k3k2j3LJ4J5PkqmNJ2RQJ8L4L3J3oj1l
$$ 29 31 48 71 90 94 76 43 8 -12 -12 10 55 110 160 191 202 196 179 156 133 110 87 65 52 55 69 84 91 89 81 77 82 94 103 111 129 163 196 209 203 192 189
9948A89PJ1J1Pjrj3j4j2rojPJ8K3J2pj9j5pnqj0j5j9j5nkpnJ3K9K5Kj6k5l7m9m0rK5M2M6M6
$$ 189 196 207 218 225 224 215 202 188 176 167 161 160 167 185 208 220 213 194 179 172 167 159 149 134 115 100 95 93 86 81 94 123 148 150 134 109 72 23 -17 -26 -1 41 87 133
9929A33L8K1PKOJ0Qkj5k0rRRj1k9j8J0K6J4oj2nkj5l3m3l7j7QL7N5N0K3j1k8k3j2qj3j5j3
$$ 133 171 192 199 201 207 217 225 223 208 188 179 188 197 186 157 139 149 175 189 183 171 166 164 149 116 73 36 19 27 64 119 169 192 181 153 130 118 110 97 82 69
9911F9oMJ0P%jJ2K4K3J5J3J9J7kk4k9j6oj2k1j5LJ7J3jrj0roNJ6J7Kj5j9oJ2K6K4Pj4k3k0
$$ 69 63 67 77 84 84 83 95 119 142 157 170 189 206 204 180 151 135 129 117 96 81 84 101 114 113 104 94 85 79 84 100 117 119 104 85 79 91 117 141 148 134 111 91
9893I1j7k0j8j2nJJ4K3J5j3l3k5lLLJ4L0K5lk5k3j3j0j3kJ1J5J4J9K8K0mk5k8j7KK2L7M0L1
$$ 91 74 54 36 24 19 20 34 57 72 59 26 1 -2 1 4 18 48 73 70 45 22 9 -1 -14 -16 -5 10 24 43 71 91 87 62 34 17 19 41 78 118 149
9875A49K1K0K6L2L4K3kl3n3n0l5j8pmqj7k3j8lJ3K9M3M2K2nj5JK1J9lk5k5rOPKllmj0j1rj1
$$ 149 170 190 216 248 282 305 303 270 217 167 132 114 107 103 95 78 55 37 34 47 76 119 161 183 178 163 164 185 204 201 176 151 142 148 155 157 154 151 147 137 126 117 106
9857A06j9j5J0M1M8K5lpPK1K2J4mk5l8l9m0m6m3j4K6M2K4joJNok0k6j7NK7M2M6M7L6Ml4m7
$$ 106 87 72 82 123 171 196 193 186 193 214 236 250 246 221 183 144 104 58 15 1 27 69 93 92 86 87 92 86 66 40 23 28 55 97 143 190 226 230 196 149
9839A49k6mrl1l5j5J0K5L1J9ql8m4k4%J4J5J4J2Lj3k8l0j6QK3K2Pqj4rJ1L3L9K3MjMKmjNK
$$ 149 123 119 110 79 44 29 39 64 95 114 106 68 24 0 0 14 29 43 55 58 45 17 -13 -29 -21 2 24 31 23 9 0 11 44 83 106 110 109 113 115 111 110 115 117
9821A17j0j2LJ3Pnoj%LJ2K0J6QRJ2Nrj7j7rJJ6K8K3Kj9k7l3l4k7j1LOK%NJ0RONQJ7K4J8Kj7
$$ 117 107 95 98 111 118 113 107 106 106 109 121 141 157 165 174 186 191 182 165 148 139 140 156 184 207 209 190 163 130 96 69 58 61 67 69 69 74 84 93 99 104 112 129 153 171 173 156
9800A56k6k0lJ4K3J7RJ0K2K9J8pk5k5j5rj1j3qmmmJRJ3J1RPJqj2rmKORLj4k6k7k3j9j2l%p
$$ 156 130 110 107 121 144 161 170 180 202 231 249 242 217 192 177 168 157 144 136 132 128 124 125 134 147 158 167 174 175 167 155 146 142 144 150 159 162 148 122 95 72 53 41 38 38 31
9780C1j2oJkj0lJ1K3K9L6M1L0Nj7k1j7j5j7k0k0k0j5rqj3mK0L7L3J1l%RJ1jj4j5nJ0J4J0O
$$ 31 19 13 14 12 2 -1 10 33 62 98 139 169 174 157 136 119 104 87 67 47 27 12 3 -5 -18 -22 -2 35 68 79 76 76 85 96 95 81 66 61 71 85 95 101
9762A01ONJMJ9L5L4J6jqkJ1J6J1%j1k1l0l1j8knk7l9k8nQJ0J7K0J2KJPNkMK1K9J7mk2m5o7
$$ 101 107 112 113 117 136 171 205 221 220 212 210 221 237 248 248 237 216 186 155 137 135 130 103 64 36 31 39 49 66 86 98 100 101 108 113 111 115 136 165 182 178 156 111 44
9743D4p1n0j5J0K6M1M7L7J0p%K2L7L0Kk7l8k7rJMQRkj9k6j5JQJ1J5J8J1mj4j1PK4L1J7nj7
$$ 44 -27 -77 -92 -82 -56 -15 32 69 79 72 72 94 131 161 163 136 98 71 62 63 67 75 84 82 63 37 22 23 31 42 57 75 86 82 68 57 64 88 119 136 131 114
9725A14j1jmj8k4j5mllOJ6Rrj7mK0L9M9M9L2jl4n2n6m8k4J0L9M1J9mj9l2m6m3j7J7L4L5L0
$$ 114 103 102 98 80 56 41 37 34 31 37 53 62 53 36 32 52 91 140 189 221 220 186 134 78 30 6 16 55 96 115 111 92 60 14 -29 -46 -29 5 40 70
9707G0K5J9J3RJ0J5J9J3lk0k6j8o%MJ0J3Mj6k5j0J4K7K2Pnj1j7k0qJ5L5L2J5%pj2j4j2prj4
$$ 70 95 114 127 136 146 161 180 193 190 170 144 126 120 120 124 134 147 151 135 110 100 114 141 163 170 165 154 137 117 109 124 159 191 206 206 199 187 173 161 154 145 131
9689A31rLOlmJ8M3M1J4rj4j7k7l7l0j1QJ8J8RJjjnj5k5l0k9j8ML3M6L0jk4k4rKNQJ1J1QQJ4
$$ 131 122 125 131 128 124 142 185 226 240 231 217 200 173 136 106 95 103 121 139 148 149 148 147 142 127 102 72 43 25 29 62 108 138 137 113 89 80 82 87 95 106 117 125 133 147
9670A47J7J4MLJ0J4J2J2J2Pj1l4m8m2j9J2K9K0qk2pJ7K2OlPK3K5J1jnKJ6K7K2Lj3j4pkjj2
$$ 147 164 178 182 185 195 209 221 233 245 252 241 207 159 117 98 110 139 159 151 129 122 139 161 167 164 171 194 219 230 229 224 226 242 269 291 294 281 267 260 258 257 245
9652B45k8l5j9RK0OmQK3J0j8k7j0PRjrj7k3j8jJ3Rql1m8n0k6J4M6N6M9M0K6Kk3l4k8j8j0k
$$ 245 217 182 163 172 192 198 194 202 225 235 217 190 180 187 196 195 186 169 146 128 127 140 149 141 110 62 12 -14 0 46 102 151 191 217 219 196 162 134 116 106 104
9634A04J3L4M4L5Qj9k6j7rrj2rl%knlJ0L2M2L2J0llj2k9l3j0J8K4J1ok2l1k6nRJj4j5j3l1
$$ 104 117 151 195 230 238 219 193 176 167 158 146 137 134 134 132 127 124 134 166 208 240 250 247 244 232 203 170 160 178 202 213 207 185 154 128 123 132 133 119 104 91 60
9616F0n0l8OL6K8Mqqj0j1jOJmMJ9K1J2PJ0J0MJMJnqmKJ3L0M2L6J7O%k0n2o6n1k2ojPK0K7K3
$$ 60 10 -28 -22 14 42 46 38 30 20 9 8 14 15 11 15 34 55 67 74 84 94 98 99 103 104 99 91 87 89 102 132 174 210 227 233 233 213 161 95 44 22 16 15 22 42 69 92
9595I2J8J7J7J6J1Jj3j8rNPKjlj0j5j0JMkqppj1j0KJ4J8J2MKOK0L9M4K6kk0k9l7m4m2l4l1
$$ 92 110 127 144 160 171 172 159 141 132 137 144 146 145 142 132 117 107 108 112 110 102 95 88 77 67 69 83 101 113 117 119 125 145 184 228 254 252 232 203 166 122 80 46 15
9576A5l4l6k1KK0K8K8L1L4L1J8mj7rJ5K7J9KlMLoj6j2JJ2J7J4Lrk4l5l4j8KJ2Qlj1j4j6j1
$$ 15 -19 -55 -76 -74 -54 -26 2 33 67 98 116 112 95 86 101 128 147 149 146 150 153 147 131 119 120 132 149 163 166 157 133 98 64 46 48 60 68 65 54 40 24 13
9558A3QL5M9M0K0OLOPJ1J5J3Kj3k4j7MK1K0Jj7k3k4k8l2l0k5j8kK8M9L9Rj2rJ%lNK1K0kk4
$$ 13 21 56 105 145 165 171 174 180 187 198 213 226 228 215 191 174 178 199 219 220 203 180 156 128 96 66 41 23 21 49 98 137 146 134 125 126 126 123 128 149 169 167 143
9539A43k0LK0J6lj6j2jPNJJLQJ2J7J6P%mjmj8l6m5l5j3JNOJ9K8K4RMJ5K2J4kqj0j2j6j6j6
$$ 143 123 126 146 162 159 143 131 130 137 142 143 144 147 155 167 184 200 207 207 203 202 198 180 144 99 64 51 52 57 63 82 110 134 143 147 162 184 198 196 188 178 166 150 134 118
9520A18k0k1mJ6K4J7Onk1l7l7k2qokJ4L3L0Mk7m4l7j5J1J9J0ljJ3K5K2J5J1J3J2Jj4k1j2M
$$ 118 98 77 73 89 113 130 136 131 110 73 36 14 6 0 -2 12 45 75 79 52 8 -29 -44 -33 -14 -4 -7 -8 5 30 52 67 78 91 103 104 90 69 57 61
9502F1J3J6K3K9K8J1%JNpk5k8j1Jj1l5l8j2K2L5K3Lqqrj1pQK2K8K2J0j1l2m4m0k8k2j9kK5
$$ 61 74 90 113 142 170 181 181 182 187 180 155 127 116 117 106 71 33 21 43 78 101 104 96 88 79 68 61 69 91 119 141 151 140 108 64 24 -4 -26 -45 -47 -22
9485b2L9K9Nj1rjLKNQO%lNJ7J7OkKNjj3j1QK5K8K2J7J7J6J0M%jlj0j7k4k5k6k7j7ML2M2K6
$$ -22 17 46 51 40 31 30 33 35 40 48 54 54 51 56 73 90 96 94 96 101 100 87 76 84 109 137 159 176 193 209 219 223 223 222 219 209 192 168 143 117 90 73 77 109 151 177
9465A77%j8k2j6pMJ4J7Qrl0l4j0K7M0J5k4l7j9jok1j7JJ5J3QJ3K1K1J3PJ1J6J4Nlrj2k1l6
$$ 177 177 159 137 121 114 118 132 149 157 148 118 84 74 101 141 156 132 95 76 75 69 48 31 32 47 60 68 81 102 123 136 143 154 170 184 189 186 177 165 144 108
9447A08m9m6k1QK2K0J0RJ3J4J1J1J4J8J8K0K0J1JJJ0J3Noj0k2m2n8n2k1J5L9M2K2j5m2l9p
$$ 108 59 13 -8 0 22 42 52 61 74 88 99 110 124 142 160 180 200 211 212 213 223 236 241 235 225 203 161 103 51 30 45 84 126 148 133 91 52 45
9430D5K6L7K6PpnJ4K9K0rk8k2l%j5j9pP%j4j6KJ7J2oj0LJ8J6%j1j4j3j6k0j7rMJ9L2L7L0J8
$$ 45 71 108 134 141 134 129 143 172 192 183 155 133 130 130 115 96 89 96 96 82 66 68 85 97 91 81 84 102 118 118 107 93 80 64 44 27 18 22 41 73 110 140 158
9412A58QMkj4k7k6qJ3J6MqqmkKRJ2LmJJ3Qj6l5k8LL5M4K3j1k5mL2M6K3nj7j8k2k6j8qj6l5
$$ 158 166 170 168 154 127 101 93 106 122 126 118 110 106 104 106 115 127 130 126 127 140 148 132 97 69 72 107 151 174 163 138 134 166 212 235 230 213 195 173 147 129 121 105 70
9393G0l8k3nk%J3K0Qj8l7l9k7rMJ0J1J3J6J2lj3oQJ8K0K4K4J7ONJ2Oj7l3k5lJ0J0RJ5J3Kj3
$$ 70 32 9 4 2 2 15 35 43 25 -12 -51 -78 -87 -83 -73 -62 -49 -33 -21 -24 -37 -43 -35 -17 3 27 51 68 74 79 91 97 80 47 22 19 29 39 48 63 76 78 65
9374F5j7j2lQJ8L0L6L3J5qj8j3lmqkJ1J5Omj2j8k5k2j3poJJ7K6J7Jj2j8k5k2j0jpj5rPJ3L
$$ 65 48 36 33 41 59 89 125 158 173 165 147 134 131 127 119 117 128 143 149 145 133 115 90 68 55 48 42 43 60 86 103 104 92 74 49 27 17 16 9 -6 -15 -8 5 8
9355Hrj2jJ8K9J5j6l2rK3L2J5LJ6L0L0K3J6Kk1m2m5l8l0k2oK2M8O0M4Rj7rJ3J4j2l4l2k0j6
$$ 8 -1 -13 -14 4 33 48 32 0 -9 14 46 61 64 80 110 140 163 179 181 160 118 73 35 5 -17 -23 -1 47 107 151 160 143 134 147 161 149 115 83 63 47
9338D7j5lJ5K5K9L1K6RJJ0K4K0Lj0roojPJ2J6K1Rj8m3m5l2k6k6j8rj2j9j0OJ6J8L2M9L9Lk1
$$ 47 32 29 44 69 98 129 155 164 165 175 199 219 222 212 203 197 191 190 197 209 225 246 255 237 194 149 117 91 65 47 38 26 7 -3 3 19 37 69 118 157 160 139
9319A39j2Knk2k5j2MJ9L4L5J9nj2%J5K4K0Plmnj2j8j6j5k5l5j9RK1J5J5K6K9K6N0R4J18J22
$$ 139 127 129 124 102 77 65 69 88 122 157 176 171 159 159 174 198 218 225 222 218 213 201 183 167 152 127 92 73 82 103 118 133 159 188 214 264 358 476 598
9303E98J75K71K85J22j37k94k77j77j08q1o4n8o4m6OM9L3j4l6k1jkj1j5j1%J5K2J1mnMLj1
$$ 598 773 1044 1329 1451 1314 1020 743 566 458 377 313 255 191 145 151 200 233 219 183 162 161 159 148 133 122 122 137 159 170 166 161 165 168 157
9288A57k4l1l4k7pJ4K0J2J2K6L4K2OKRPj0k6k8j9j1qlMMmqnjpj4pJ1J7Kj0kJ5J8POJ9L2K7
$$ 157 133 102 68 41 34 48 68 80 92 118 152 174 180 182 191 198 188 162 134 115 104 96 93 97 101 97 89 84 83 76 62 55 66 83 85 75 73 88 106 113 119 138 170 197
9269A97J0kkMNmk0l0k7j5rj0j7j9j2JQOlj4j9j7qLQPJ1K5L1J7qk0rPJ2J2J7J9J4J2J7J7Oq
$$ 197 207 205 203 207 212 208 188 158 131 116 107 97 80 61 49 50 58 64 61 47 28 11 3 6 14 21 32 57 88 105 97 77 68 75 87 99 116 135 149 161 178 195 201 193
9250A93oOJ0QJj5l9m7k0K1K9qm8n7m0k3qJ0K6L4L3K6J2jKJ7K7J6krkJ2K8M0L5Pk9m1k5lPK
$$ 193 187 193 203 211 212 197 158 111 91 112 141 133 85 28 -12 -35 -43 -33 -7 27 60 86 98 97 99 116 143 159 157 148 146 158 186 226 261 268 239 198 173 170 177 179
9231A79%NJ1J0Jj0pRK0J3qk7k9j4OJ1pl2l4j1J1Pj1j8j2rnJ1L1K7kk5j5POk0l7k7lRMjKJ4
$$ 179 179 184 195 205 206 196 189 198 218 231 223 196 167 153 159 170 163 131 97 86 97 104 93 75 63 54 49 60 91 118 116 91 76 83 89 69 32 5 2 11 15 14 16 30
9212C0K4K5J8Npj5j0OK7L8L4J9Jj4l2m8n5m7k8kK3L5L8K9K0Pqj9j3RK4Ql1n4m0mK0K5J6Nm
$$ 30 54 79 97 102 95 80 70 76 103 141 175 194 195 181 149 101 46 -1 -29 -31 -8 27 65 94 114 121 113 94 81 90 114 122 91 37 -3 -7 13 38 54 59 55
9195E5j1pNJ1NpqLJ7K4K0Mj7k8j8%Lj5l3l4k0kJ1J8J7QOJ1J8K2J8PnrNK7M4M5L3J5nj7j6j
$$ 55 44 37 42 53 58 51 43 46 63 87 107 111 94 66 48 48 51 36 3 -31 -51 -53 -42 -24 -7 1 7 18 36 58 76 83 78 69 74 101 145 190 223 238 233 216 200 199
9176A99J3J2%qj0pokNJ5K6L0K2Lj3j5rqj8k6k6k3k8l1j9NK1J6lk2k7j7PL0L4J7lnJ0K2J2j3
$$ 199 212 224 224 216 206 199 193 191 196 211 237 267 289 292 279 264 255 247 229 203 177 154 126 95 76 81 102 118 115 93 66 49 56 86 120 137 134 129 139 161 173 160
9157A60l3l2j8JJ6K7L1K9K0Qmj3j5j4j0prj1rQK9L3J7mj1j2k7m3l9j0J6J8ROQJrj1kLKPJ6
$$ 160 127 95 77 78 94 121 152 181 201 209 205 192 177 163 153 146 137 126 117 125 154 187 204 200 189 177 150 107 68 58 74 92 101 107 115 116 107 96 94 97 99 106 122
9139A22J9J5ROLlKJ6J8Kk0k5j3%RJ4Ppj9j5ljomQJ1L%RJ6Oj8l1k6j4mMJ2J7J8J1OOJ3J5Mj7
$$ 122 141 156 165 171 174 171 173 189 207 209 189 164 151 151 160 174 181 174 155 140 137 136 130 126 134 145 148 148 157 173 179 161 130 104 90 86 90 102 119 137 148 154 160 173 188 192 175
9118A75l1k8j1LMjqoJJ4J8Rqk0k0j5j8k1j3PK1J4lj1LK4L2J6j7m3m3j4K0L5K7Qrj9k1j5JJ1
$$ 175 144 116 105 108 112 111 103 97 98 112 130 139 131 111 91 76 58 37 24 31 52 66 63 52 55 79 111 127 110 67 24 10 30 65 92 100 91 72 51 36 37 48
9100D8ROJ8M2N2L0pl7m9m9m1k7j2kNJ6L1M0L1Mk7m6l7j0J6K0OnJJ0J2PLKmj0oJ5L9M8L3J0
$$ 48 57 63 81 123 175 205 198 161 112 63 22 -5 -17 -19 -14 2 33 73 104 108 81 35 -2 -12 4 24 30 25 26 36 48 55 58 60 56 46 40 55 94 142 175 185
9082A85pj5k7m0m0j6J7L5L0Ok5n1o0m8j7J0K2K3J9J5Nj2k7l1qL3O1N2J7oNK8K9J3NJ5K3J8
$$ 185 178 163 136 96 56 40 57 92 122 128 103 52 -8 -56 -73 -63 -41 -18 1 16 21 9 -18 -49 -57 -24 37 89 106 100 105 133 162 175 180 195 218 236
9065B36PMJ0J3Nqk3l0k7j9j5j4j0rj9l5l9j3K6N1M7K2kj2j3j5j9j4QK9K9Pk1l4k9j6ojNRP
$$ 236 243 247 257 270 275 267 244 214 187 168 153 139 129 120 101 66 27 14 40 91 138 160 158 146 133 118 99 85 93 122 151 158 137 103 74 58 52 51 56 65 72
9048G2kj0kK2M2L9J3j6l5m2l6k2rlJJ8M4N3L7J2%PJ1Oj1k7k6kL0M2J8j8m1l9k4mJ8L6L8K5
$$ 72 70 60 58 80 122 161 174 158 123 81 45 23 14 11 12 30 74 127 164 176 176 183 194 200 189 162 136 134 164 206 224 206 165 126 102 98 116 152 190 215
9030B15PkJRJ2Nqj8j9j4jK0L2J6k1m8m5k4j0kMnl4n3l1J9N0L7J2MJ3J9J3Opj7j5LJ6J0moj
$$ 215 222 220 221 230 242 247 239 221 202 188 187 207 239 255 234 186 141 117 107 105 109 104 70 17 -14 5 55 92 104 108 121 140 153 159 152 135 120 123 139 149 145 139 138
9012A38JlmkkkLOPJ4K7K9Pk4l4k1mMKok6m3m6l2j9q%PQJ4L0N1M7J9qj4qprlPQJqj0qkNRQM
$$ 138 139 136 132 130 128 126 129 135 142 156 183 212 219 195 161 140 136 140 142 136 110 67 21 -11 -30 -38 -38 -31 -23 -9 21 72 119 138 130 116 108 101 92 89 96 104 105 97 87 79 77 82 91 99 103
8990A03Llj4j8j5j1j4k2j9j5j1mJ6L5M8M6M0L1J3loKKpj2pnj4k1rJ0J4mk6l2j8JJ2Lj1j4N
$$ 103 106 103 89 71 56 45 31 9 -10 -25 -36 -40 -24 11 59 105 145 176 189 186 180 182 184 177 165 158 153 139 118 109 119 133 129 103 71 53 54 66 69 58 44 49
8971D9K1J9%j7k4k4k1j2%RJ2J6J7J2ok5l3l2j7jJ3K1K2J9J4J0J2J8K0J0ooJ1K4K2J1NLKMO
$$ 49 70 89 89 72 48 24 3 -9 -9 0 12 28 45 57 51 26 -7 -39 -56 -57 -44 -23 -1 18 32 42 54 72 92 102 96 90 101 125 147 158 163 166 168 172 178
8954A78Mj5k9k1PK5J9LlMRQOLJjmj2l0m3m5l7k7j8oMJ0Plj0oK1N3O9M9J3j0j5j4j7j9j8j5
$$ 178 182 167 138 117 124 149 168 171 168 172 181 189 195 198 199 198 194 182 152 109 64 27 0 -18 -24 -20 -10 -3 -6 -16 -22 -1 52 121 170 183 173 158 144 127 108 90 75
8935G5pNJ4J6J5K0K3Qrj1NNj5l4l2j7pkOJ4J3J2J7K6K1Nj2j8j6qKOlj7k2j5kORMkLJ5K1Mj7
$$ 75 68 73 87 103 118 138 161 169 160 149 154 159 144 110 78 61 54 52 58 72 85 97 114 140 161 166 154 136 120 112 114 120 117 100 78 63 61 67 76 80 78 81 96 117 121 104
8915A04k0nQJ0J1J8J9Nj3j5oKjpj2j3j2j2j3j5j0KJ9L1K9J7joMJ3Qqj7qLMlj4k4l0k4pNKm
$$ 104 84 79 87 97 108 126 145 150 137 122 116 118 117 110 98 85 73 61 48 33 23 25 44 75 104 121 120 114 118 131 139 131 114 106 109 113 110 96 72 42 18 11 16 18 14
8896A4JJ2K3K8K4Pj5k1kJ9J7pk3j8%J6L4M5M3K7J2Kj2l6m7l0JJ8J8J7J7Nk4m3k8PK4J4JNK0
$$ 14 15 27 50 78 102 109 94 73 71 90 107 100 77 59 59 75 109 154 197 224 236 238 226 190 143 113 114 132 150 167 184 189 165 122 94 101 125 139 140 145 165
8878A65K1Oqj3k0k5j8LK2J6rk8k3NL1L1Qk0k9k3j2nMJ0Nj0j4JJ3Nj1j5j1j5j9oJ8K6J0lNJ7
$$ 165 186 192 184 171 151 126 108 111 133 149 140 112 89 94 125 156 164 144 115 92 80 75 79 89 94 84 70 71 84 89 78 63 52 37 18 12 30 56 66 63 68 85
8860H5J2lj2oKNPRQPQMj0k0j9j2j2j9j6jJ8K4J8RPJ5K6L3L0K3J3%j6k1j4oj1k6k3LK7K4Jj5
$$ 85 97 94 82 76 78 83 90 99 107 114 122 126 116 96 77 65 53 34 18 17 35 59 77 86 93 108 134 167 197 220 233 233 217 196 182 176 165 139 116 119 146 170 171 156
8840A56j3jJmqj2k0k2j5KQ%j0rMK0L0L7L2J2j6l4l7k9k1nJ1J8J0jJJ7K6J6J%J7K9J6j9m1l3
$$ 156 143 142 143 139 131 119 99 77 62 64 72 72 62 53 57 77 107 144 176 188 172 138 101 72 51 46 57 75 85 84 85 102 128 144 145 145 162 191 207 188 147 114
8822A14j3kkJ1L6M2J6j8k4oOoj9j3PK2K1J2lk0l7l7j4J8L9L6K5J5Rnk1k3qNK%K0M4L6ml9m0
$$ 114 101 99 97 108 144 186 202 184 160 154 160 154 135 122 129 151 172 184 181 161 124 87 73 91 130 166 191 206 215 210 189 166 158 163 165 165 185 229 265 261 222 182
8804A82k2j1j3j6j5j8k3k0lK1L5L3J3j0k3j8jJ6K5J7mk5l3j8MJ6J0lrj1j7k9l8l6j9JJ1J3
$$ 182 160 149 136 120 105 87 64 44 41 62 97 130 143 133 110 92 91 107 132 149 145 120 87 69 73 89 99 96 87 76 59 30 -8 -44 -63 -62 -51 -38
8788c8J1J6J6Pj2l1l7k8j2LJ6K8K6J3JRL5N1L5QkJ0K1J6Olj3j8mK7M1J7k7m6k2J6L9L8J9l
$$ -38 -27 -11 5 12 0 -31 -68 -96 -108 -105 -89 -61 -35 -22 -21 -12 23 74 109 117 115 125 146 162 168 165 152 134 130 157 198 215 188 142 120 136 175 213 232 229
8770B29j5oK0L8L2Ok1l6l5k5j6j8k6l0k7j6p%QJ2J1J2J8K2J9OlnKRPpk9l7j5K9O0N5K6Kqj5
$$ 229 214 208 228 266 298 304 283 247 212 187 171 153 127 97 70 54 47 47 55 67 78 90 108 130 149 155 152 147 149 158 165 158 129 92 77 106 166 221 247 249 241 226
8752B26k8l7l8l3l3l5l0j8onmPK5L3L3K9L0K5J1kkOJ2QLOJ5J7Oj5l0k8j2QK1K4K1J5J2Qmk0
$$ 226 198 161 123 90 57 22 -8 -26 -32 -37 -41 -34 -9 24 57 86 116 141 152 150 148 154 166 174 177 183 198 215 221 206 176 148 136 144 165 189 210 225 237 245 241 221
8734B21k4qJ6K6J3j2l3m6m5l0qRJ1KoqqqnLJ3K4K9K7J5lk1l5l6j9OK5K5J4Klklnrj7k0j6j
$$ 221 197 189 205 231 244 232 199 153 108 78 70 79 90 92 86 78 70 62 57 60 73 97 126 153 168 165 144 109 73 54 60 85 110 124 126 123 121 118 113 104 87 67 51 50
8715E0J9L3L1J4nj2mKLjqk0l2k9oJ6J2oj6lJ3K0J8K2L1L5K3j1n2o6l3J8L7J5j2j1NRJ%J0J5
$$ 50 69 102 133 147 142 130 126 128 131 130 122 102 70 41 35 51 63 57 41 38 51 71 89 111 142 177 200 189 137 71 38 56 93 108 96 85 90 99 100 100 110 125
8697A25Ppj4j9j7qOK0L1M1M0K4NjKJj0j1kKj2k7k6j0QK1K7J9nk7k9j3jlrj2j4k0j9rOJ5J6
$$ 125 132 125 111 92 75 67 73 93 124 165 205 229 234 233 235 236 226 215 213 215 203 176 150 140 148 169 196 215 210 183 154 141 140 137 128 116 102 82 63 54 60 75 91
8678I1J6J3J1PKjlkpj7k8k2jK0K5J6Kj2k5k9k3rJjplJ4L2L4J8nj8j1J2L5M3K5pl2l8k5qMM
$$ 91 107 120 131 138 140 139 136 134 127 110 82 60 59 79 104 120 122 110 85 56 33 24 25 24 17 14 28 60 94 112 107 89 78 90 125 168 193 186 154 116 91 83 87 91
8659I1k%J5K9K6Kj0LK8L5J7ok1l0l7l3j7NQpk7l4k8j2KJ1J6Prk0j8lJ3J2QRK0K7K4J1Lmj3
$$ 91 89 89 104 133 159 161 151 154 182 217 234 228 207 177 140 107 90 95 103 96 69 35 7 -5 -3 8 24 31 22 2 -16 -19 -6 6 14 23 43 70 94 105 108 104 91
8640I1k4k7j9pnj0k3l2k8rJ5L1L6L0K1J2QMpk5l7l1pJ8K4J2jqkQJ5J7K1K2J3oj9j2PJ7J5J1
$$ 91 67 40 21 14 9 -1 -24 -56 -84 -93 -78 -47 -11 19 40 52 60 64 57 32 -5 -36 -43 -25 -1 11 10 2 0 8 23 40 61 83 96 90 71 59 66 83 98 109
8622A09O%qoPJ5Rlpk%ok0k8k4j4nnj1j5j5j3lJ2K4K3J7K0L2L8K9J4QJ2J8J6Jk2m5m9l1j0l
$$ 109 115 115 107 101 108 123 132 129 122 120 120 114 94 66 42 28 23 18 7 -8 -23 -36 -39 -27 -3 20 37 57 89 127 156 170 178 190 208 224 225 203 158 109 78 68 65
8603F5orj2j3j0MJ3J5J7K0J3rk1KM1N3K9lrKNnj6k4k3j6okpj0j3j7j9j0J5L1K3Lnj%rj3kJ1
$$ 65 59 50 38 25 15 19 32 47 64 84 97 88 67 69 110 163 192 189 180 182 187 182 166 142 119 103 97 95 88 78 65 48 29 19 34 65 88 91 86 85 85 76 63 61 72
8584G2J8K0K8L7L5J0k2m1l2pJ6K3J5kj9k4rJ5L1L3K5J5ok9m6m2l0k3k1j9j2olmj5k4j8jQn
$$ 72 90 110 138 175 210 220 198 157 125 118 134 157 172 170 151 127 118 133 164 197 222 237 231 202 156 114 84 61 40 21 9 3 0 -4 -19 -43 -61 -62 -54 -59
8566e9j7nJ6J6nj6JK1K5K0K5L5K4Lm%M%LJ6K0Mj3j3KJ5K4L4M1L1Kk9m4m6m1l3j9ojkKJ5K7
$$ -59 -76 -81 -65 -49 -54 -70 -69 -48 -23 -3 22 57 81 84 80 80 84 84 87 103 123 127 114 101 103 118 142 176 217 248 250 221 177 131 90 57 38 32 31 29 31 46 73
8548G3L1K8K0J2OKjj0k5l7l2j2LJqj5j4j0KJ6K6K1Mj3k2j8nJ5L5M5L8K4Qmj3j5mJ2J7jk9m2
$$ 73 104 132 152 164 170 172 171 161 136 99 67 55 58 59 51 36 22 12 14 30 56 77 81 68 46 28 23 38 73 118 156 180 188 184 171 156 152 164 181 180 151 109
8530A09k4QK5K0J4J9K7J9%j6k0j9j8qJ0K2J1j1k3j8okKPNqk7l1k1j0qj3j3mK%kmOK1K8K3J5
$$ 109 85 93 118 138 152 171 198 217 217 201 181 162 144 136 146 168 179 168 145 127 121 119 121 128 133 125 98 67 46 36 28 15 2 -2 0 0 -2 -6 0 21 49 72 87
8511H7J0QJ0J7K7K4Nk0l0j5NQok4l1k4oJ6L6M2L5J6j0l4l5rK5L9K2mj7j6j2rmJjj0k4k9k0
$$ 87 97 105 115 132 159 183 188 168 138 123 128 136 130 106 75 51 45 61 97 139 174 190 180 146 111 102 127 166 188 184 167 151 139 130 126 127 126 116 92 63 43
8493D3JJ7J8J0jlJJ1K2K1Nj5j9nOONJ1J3%j9k1qLkj4j9j4jJ8L0L0J7Lmqj0rjORJ1J3Qjppq
$$ 43 44 61 79 89 88 85 86 97 119 140 145 130 111 106 112 118 123 134 147 147 128 107 99 102 100 86 67 53 52 70 100 130 147 150 146 138 128 119 118 124 133 144 157 165 164 157 150 142
8472A42j7k5k2rJQJ6K4K0Jj9k3j4npj6j4lJ1J4J5K1K0Nj5k3j3jQJ9L8M8L5J1mj0j5k4k4j3
$$ 142 125 100 78 69 70 78 94 118 138 139 120 97 83 78 71 55 41 38 49 63 78 99 119 124 109 86 73 72 80 99 137 185 220 231 227 217 202 178 154 141
8455A41jkrk0k8k5nJ6J9Lrrl%LJ4K2J5KkNJ0Qjj1k0k0j1LJ0Krj2nJ0J8J3rk8k7nJ6J8Kj0r
$$ 141 140 138 129 109 81 56 51 67 86 89 80 71 68 68 71 85 107 122 124 122 127 137 145 144 133 113 93 82 85 95 97 88 76 71 81 99 112 103 75 48 43 59 77 79 69 60
8435F0llrj2oKnj9k6j7OK7M3N6O2M8J4k7m8l8j2J0J8K0K1J5pl1l3j6krk1j8njpmPJ2NKQJ4
$$ 60 57 54 45 33 27 29 24 5 -21 -38 -32 -5 38 94 156 204 218 191 143 105 93 103 121 141 162 177 170 139 106 90 88 79 58 40 35 34 27 23 30 42 47 49 57 71
8416G1J0NJ1J9Ok1l2j5J4K2Kj6rJ9L4K3KlQQj0k7k3okj2j2NK2K0jk3l3l0j8JJ9K9L1K5J1r
$$ 71 81 86 97 116 122 101 69 54 68 90 92 76 67 86 120 143 145 142 150 158 148 121 98 92 90 78 66 71 93 113 112 89 56 26 8 9 28 57 88 113 124 115
8398A15k0j7jJ0Qpj3nRJ8K7L6M0K5j0l5l6k2j8j8j1PJ5Kk1k7j1J2J6%j9j6J0L5M2L2K0Qj1
$$ 115 95 78 77 87 95 88 75 70 79 97 124 160 200 225 215 180 144 122 104 86 75 82 97 99 78 51 40 52 68 68 49 33 43 78 120 152 172 180 169
8381A69k8k8j1NJ1J3J2kk5l5j4K2L5J6j2k5j9j0oj5k8k4KL0L8K9K3K2J0j4k7j1J2Rk5n5n5
$$ 169 141 113 102 107 118 131 143 141 116 81 67 89 124 140 128 103 84 74 68 53 25 1 3 33 71 100 123 145 155 141 114 103 115 124 99 44 -11
8365a1l3mJ6K2J0lj2%K1L5L2K2J1Jrj5j0KQJ1J1J5J6J3J3R%roNQjlOJ2Jj3j0kpk5l1j9rj0
$$ -11 -44 -48 -32 -10 0 -3 -15 -15 6 41 73 95 106 107 98 83 73 75 83 94 105 120 136 149 162 171 171 162 156 161 169 168 165 171 183 184 171 161 159 152 127 96 77 68 58
8345E8j2%J1PkLK1L1K3J0OJ5K1J3j4m7o2n2k8oLJ0K2L9M7M1K3RMkj6k7j8LJ4J5J9L2L5J6l
$$ 58 46 46 57 64 62 65 86 117 140 150 156 171 192 205 191 144 82 30 2 -4 -1 9 31 70 117 158 181 190 194 192 176 149 131 134 148 163 182 214 249 265 262
8328B62mJ0J5Pmrj3j8k5l5m8n1l1JK0J1lmKKnlQK0K4K5K1Pj7l3k4kJ3J7K2L1K4ol6l1jJ0j3
$$ 262 258 268 283 290 286 277 264 246 221 186 138 87 56 57 77 88 85 81 83 85 80 77 85 105 129 154 175 182 165 132 108 106 119 136 158 189 213 207 171 140 139 149 136
8309A36l8l0kPoj8j7j1%J7L1K9J3MJ1J2KqqmjLRLpj0ljj3k0mJ8K1J0joj9l1k8j0KJkKLjkN
$$ 136 98 68 66 73 67 49 32 21 21 38 69 98 111 115 126 138 140 132 124 120 119 122 131 134 127 117 114 113 100 80 76 94 115 125 124 118 99 68 40 30 32 33 31 33 36 35 33 38
8288C8OjpnJmj2j2%J3J7J2Kj2k3k3qJ6L2L7L4K6J6jj7k1j2nj5k8k8rQPj1k1j8KJ6J3jj4j4
$$ 38 44 43 36 31 32 28 16 4 4 17 34 46 48 36 13 -10 -18 -2 30 67 101 127 143 142 125 104 92 87 72 44 16 7 15 22 11 -10 -28 -26 -10 3 2 -12 -26
8270b6jJ1J2Kj4k0pJ4K5J7O%J%KJ3L1M3M0K5QmqjRJ1J1J7K7K9K2Pqk3l8m6m0k4oMJpj3oKM
$$ -26 -27 -16 -4 -2 -16 -36 -43 -29 -4 13 19 19 20 20 22 35 66 109 149 174 182 178 170 169 178 189 200 217 244 273 295 302 294 271 233 187 147 123 117 121 122 115 102 96 98 102
8250A02KLLkroQJ8J6Npj1oQJ6Rrj7rLMNJ6L0L2J6nk2k3j4mlroJ2K5J2j2k3pJ7K7K0QJMJ4J8
$$ 102 104 107 110 108 99 93 101 119 135 140 133 122 116 124 140 149 140 123 114 117 121 126 142 172 204 220 215 193 170 156 152 149 140 134 146 171 183 171 148 141 158 185 205 213 214 218 232 250
8229B50Qj1k4k8k6k2j7k0l6m6l5rJ0J2J2J0Nj2k1j7LJ7K4K0J8J7K2K5K2K2L0L6K3pk9k2o%
$$ 250 258 247 223 195 169 147 130 110 74 28 -7 -16 -6 6 18 28 33 21 0 -17 -14 3 27 47 65 82 104 129 151 173 203 239 262 255 226 204 198 198
8212A98nlJ1J9J7J2Pnk5m1m3l5k6j7mJ0J7J8J3Ork5l2k6j5%J1K2K7K7J3nj6qJ4K7K8K5K4J8
$$ 198 193 190 201 220 237 249 256 251 226 185 142 107 81 64 60 70 87 105 118 124 115 90 58 32 17 17 28 50 77 104 117 112 96 88 102 129 157 182 206 224
8195B24nl0m2m0l6l1j7PJ8J2LNQok6k4mOrk5j6QJ7LmQL2M1K8QjlJjoj1rkKkj2j5qKRJ9L0L1
$$ 224 219 189 147 107 71 40 23 30 48 60 63 68 76 70 44 20 16 22 13 -12 -28 -20 -3 0 -4 4 36 77 105 113 112 109 110 109 103 92 83 81 83 81 69 54 46 48 57 76 106 137
8174A37J4nnJ3K1Pj2j2krl1m1k6lQPRRjj8k6k2j5j3j2kQJ3J0QMPJ3K2K0J2J0K0K2Kk8l9j5
$$ 137 151 146 141 154 175 182 170 158 156 147 116 75 49 46 54 61 70 79 78 60 34 12 -3 -16 -28 -30 -22 -9 1 9 13 20 33 55 75 87 97 117 139 141 113 74 59
8156E9K2L9K3j1l2k7j0MNNJ1K4L5L6K3Nj4k4k3j4jOKrj1QL1L9K0j0k5k4j7j5j0LK6M2M4L0
$$ 59 81 120 143 132 100 73 63 67 72 77 88 112 147 183 206 211 197 173 150 136 135 141 143 134 123 131 162 201 221 211 186 162 145 130 120 123 149 191 235 265
8138B65J3MMlk1m1m9m3l7l0j9o%kKJ7K7J9lj3lJ5K3J6%j3j5pMOkrkJ0J6J3J1Rmk6l8k9qKL
$$ 265 278 282 286 283 262 221 172 129 92 62 43 37 37 35 37 54 81 100 97 84 81 96 119 135 135 122 107 100 104 110 108 99 97 107 123 136 147 156 152 126 88 59 51 53 56
8119E6RK2K5J0j3k0j4j1k1k7j6J3L9M1K2kj5j7j3j2j1lJ3L2M2L2J0j6k6j5KLj7l8m2k2%J3
$$ 56 65 87 112 122 109 89 75 64 43 16 0 13 52 93 115 113 98 81 68 56 45 42 55 87 129 161 171 155 129 114 116 119 102 64 22 0 0 13
8102A3J4J2J3J6J4RJ1J8K4J8PMRJ3Oqj5qPK2K6J5j0l0k3KK1J2mmJ1J9Oj8m2n6n3l3oPJomP
$$ 13 27 39 52 68 82 91 102 120 144 162 169 173 182 195 201 193 178 170 177 199 225 240 230 200 177 179 200 212 208 204 215 234 240 222 180 124 71 38 32 39 40 34 30 37
8083C7J4J4QjoJJ5J7KnJ4M2M5J5j5j7jPlrKK0K7J7Jo%PJk0m0m2k2KJ3Lj5k4k1j5k0m0n7n9
$$ 37 51 65 73 72 66 67 82 99 101 96 110 152 197 212 197 180 179 186 183 174 176 196 223 240 241 235 235 242 243 223 183 141 119 121 134 137 122 98 77 62 42 2 -55 -114
8064a14m0j6lMJ7L4M4M0L0K4K1J1mj3oNRLoj5j7j1lLMJ2K5L1J9kqPK1J7%j2j2pnm%J0J9K4
$$ -114 -154 -170 -173 -169 -152 -118 -74 -34 -4 20 41 52 48 35 29 34 43 46 40 25 8 -3 -6 -3 1 13 38 69 88 86 78 85 106 123 123 111 99 92 87 83 83 93 112 136
8045A36J6%j6k1j8j6k1k3k1j0LJ8L1M0L3J2j1k3k1j3qmjlonjjmjJ4K4Nk5l6j5J6K7K0RJ0J8
$$ 136 152 152 136 115 97 81 60 37 16 6 9 27 58 98 131 143 132 109 88 75 67 63 62 59 53 48 47 46 42 41 55 79 84 59 23 8 24 51 71 80 90 108
8027A08K7L0K5J3Njj1k2k1oROoj0lJmj3j9k3k3j6mNPN%np%KlkJ7M7N6M0J1noMJ6J0j0k4j2
$$ 108 135 165 190 203 208 207 196 174 153 147 156 162 156 146 143 144 140 127 108 85 62 46 42 47 54 59 59 54 47 47 49 46 44 61 108 164 204 215 210 204 208 224 234 224 200 188
8007A88QKk9m1j5K1K8K0J7K1Rj3k0rM%kRJ8Qk4m8m4j5J8L2K7J5J0J1Pmk0l1l4l1k2j2rj0o
$$ 188 196 198 169 128 113 134 162 182 199 220 229 216 196 187 191 191 189 198 216 224 200 152 108 93 111 143 170 185 195 206 213 209 189 158 124 93 71 59 50 40 34
7989C4OK0K6K0Pkmjoj5k3k0nJ5L4M8M7L8K0lk8m0l4j7j2k1k5oJ6J6mj8j2MJ3J8K4K2QkLJ0
$$ 34 40 60 86 106 113 111 107 106 100 85 62 42 37 52 86 134 181 219 239 236 208 168 134 117 105 84 59 53 69 85 81 63 51 55 68 86 110 132 140 138 141 151
7971A51Pqj4qkmj2j4j3j5j9j5jJ2J9K1K6L0L0K0Opk3l2k4nJ1J0%oppm%MOJ0J7J7J0KPJ6J4
$$ 151 158 150 136 128 126 122 110 96 83 68 49 34 33 45 64 85 111 141 171 191 197 190 167 135 111 106 117 127 127 121 114 107 103 103 107 113 123 140 157 167 169 176 192 206
7952B06JpJP%j1j4j0j4k6l5l4k0LK5L4K7J5Nkqrooj9l7m0k4MK2K7K7K5J9PlokJKPJ0Orj6j0
$$ 206 207 200 201 208 208 197 183 173 159 133 98 64 44 47 72 106 133 148 153 151 143 134 128 122 103 66 26 2 6 28 55 82 107 126 133 130 124 122 123 125 132 142 148 139 123 113
7932A13jmj3j0NRnj3LL5N3M6K0j7m7n2k4J2K8K2J1J1J2OnpJRJ0jk0l2l0j7pqj9k4j5PK8L2
$$ 113 112 108 95 85 90 99 94 81 84 119 172 218 238 221 174 122 98 110 138 160 171 182 194 200 195 188 189 198 208 207 187 155 125 108 101 93 74 50 35 42 70 102
7914A02J6mj7j9k1k3j5jJ3K3K8L0J7ql1l8k7rLRRJ1J6K1J7Jj1qLRJj2j3jJ1Qqj9rJ7K9J5n
$$ 102 118 114 97 78 57 34 19 18 31 54 82 112 129 121 90 52 25 16 19 28 37 48 64 85 102 103 92 84 87 96 97 85 72 71 82 90 82 63 54 71 100 115 110
7895A10oJ1J7Lj6k0j2kNJ0J0MLJ0K2K6J8J1J5K4K9L1K7J0j4l0k5qqk4l9m0l7l9m0k7lJ7J9
$$ 110 104 115 132 135 119 99 87 85 90 100 110 114 117 127 149 175 193 204 219 243 272 303 330 340 326 296 271 263 255 231 192 152 115 76 36 9 6 23 42
7878D2Pj3k6j4J5M4M8L7K2J1ok1k0oLlr%J4J6J2J0J2Lj7l0k7j0J0K5K8J7%j3j5j0jNMnj0k
$$ 42 49 36 10 -4 11 55 103 140 162 173 167 146 126 120 123 120 111 111 125 141 153 163 175 178 161 131 104 94 104 129 157 174 174 161 146 136 135 140 144 139 129 127
7860A27J7K8K3Oj4l4m8m5k9j6j4j0PK8L1Qj5j5RL5M6M3L2J6Lpj3k0k3j5lJnj7j9j0pj3k1j5
$$ 127 144 172 195 201 187 153 105 60 31 15 1 -9 -2 26 57 65 50 35 44 79 125 168 200 216 219 212 199 179 156 141 138 139 134 117 98 88 81 68 47 32
7843C2ljrj0J0L2L0Kk2j6J2L0K3J0OJ1Prj9j5orj9j8mMoj9j3OJ7J6J5J8Rk1m1k8QK3Nk5l4
$$ 32 29 28 19 9 19 51 81 83 61 45 57 87 110 120 126 137 144 135 116 101 95 86 67 49 45 49 43 24 11 17 34 50 65 83 92 71 30 2 10 33 38 13 -21
7824b1k4qRK4L0L0K7K4J6lk7l9k7oJ0J6K1K7L1K2kk4k7j1J2K5K8L3L8M1L7K3jk7m0l5k8k8
$$ -21 -45 -53 -44 -20 10 40 67 91 107 104 77 38 11 5 15 31 52 79 110 132 130 106 79 68 80 105 133 166 204 245 282 305 304 277 237 202 174 146
7807A46l0k3j6j9k7j7J1M0N4N4M3J5k1m0l0nJ2J6K1K5K1Lj6k4j6MK1J9Lj1j0j0k4m2l8j1J2
$$ 146 116 93 77 58 31 14 25 65 119 173 216 231 210 170 140 135 147 163 184 209 230 233 217 193 177 181 202 221 224 213 203 193 169 127 89 78 90
7791I0J1nj4j4j0mJ3L4M6M2K7J0jpj0j0nOK3L2K3lk6l3k4qJ3K7K3Kk0l0k3qPK0K1Rj0k4k7
$$ 90 101 96 82 68 58 54 67 101 147 189 216 226 225 218 208 198 193 199 222 254 277 274 248 215 191 183 196 223 246 248 228 198 175 167 174 194 215 224 214 190 163
7774A63k6k2j7rljjlj2k4j7MJ8Nj6j6OK4K5K1K3K7K1Oj2k0k0rNQLnlNJ3J5RJkPJ4Rj1k2j0
$$ 163 137 115 98 89 86 85 84 81 69 45 28 32 50 55 39 23 29 53 78 99 122 149 170 176 164 144 124 115 120 128 131 126 123 128 141 156 165 166 164 171 185 194 183 161 151
7754A51J7K9J0k8n9n9l3%J8J9K0K4L0L3K8J9Jj8k4j3OJ9J8Pj3k9l2j9nJJ%j0k8l6k6oMMPJ8
$$ 151 168 197 207 179 120 61 28 28 46 65 85 109 139 172 200 219 220 202 178 165 171 190 208 215 202 173 141 122 117 118 119 119 109 81 45 19 13 17 21 28 46
7736D6K3J2j4l7l9k0J3M2N7M8K1j9m7m6j7J1J9J1%j4k3j6PK9K9K1K1L3M0L2Rk5n7o8m8j8l
$$ 46 69 81 67 30 -9 -29 -16 26 83 131 152 133 86 40 23 34 53 64 64 50 27 11 18 47 76 97 118 151 191 223 232 207 150 82 34 16 13
7720A3LQOj1k6j7OJ5%j1o%jKRRJJ1K9K8POL9P1O2K1j4l3m2l9k5j3k1l2k6qLjjORKj0j9k0j2
$$ 13 16 24 30 19 -7 -24 -18 -3 -3 -14 -20 -20 -21 -19 -10 -1 0 11 40 68 75 81 120 191 253 274 260 227 185 146 121 108 87 55 29 21 24 23 22 28 37 39 29 10 -10 -22
7700b2PK3K2J0LMRJ4K0J2ok0j3%%j0j1kNOQOnj1NK0J2j5k4rjj3k7k1nOJ3J9K1J3RJ7K0Roj1
$$ -22 -15 8 30 40 43 47 56 70 90 102 96 76 63 63 63 53 42 40 45 51 59 65 60 49 54 74 86 71 47 38 37 24 -3 -24 -29 -23 -10 9 30 43 52 69 89 98 92 81
7680H1p%NPNjJJ1J6RLLKopJ0K5K1Onj2k0k4j5nmoKJ4Qpj5pKLJ1K4K7J2qj5j2j1j8l2m5m0j6
$$ 81 74 74 79 86 91 90 91 102 118 127 130 133 135 129 122 132 157 178 184 179 167 147 123 108 103 99 93 95 109 117 110 95 88 90 93 104 128 155 167 159 144 132 121 103 71 26 -14 -30
7660c0RJ5OLJ2J7J4J8L3M1K2rk6k2j2j1j4j8j5mLNLOJ1OmnQJ1qk5j1K3M0K8J0Kmk0l6l8l0
$$ -30 -21 -6 0 3 15 32 46 64 97 138 160 151 125 103 91 80 66 48 33 29 32 37 40 46 57 63 59 54 62 73 65 40 29 52 92 120 130 132 128 108 72 34 4
7641Dj7qNJ2RQJ9L5L7K2Nmqj0nJ0K3K3J1%j0j7k5l0k5nK6M5L3lk7k3JK2K8K4J1mpjJj1k6k9
$$ 4 -13 -21 -16 -4 5 13 32 67 104 126 131 127 119 109 104 114 137 160 171 171 161 144 119 89 64 59 85 130 163 160 133 110 111 133 161 185 196 192 185 184 185 174 148 119
7622A19k2j6lK3M5M3J6pj2j2j3j0lnj9k3oJ4J6Oqk0l1k9rJ4K0J7K1K6J6qj9j2jKLLnj9k5j0
$$ 119 97 81 78 101 146 189 205 198 186 174 161 151 148 143 124 101 95 109 125 131 123 103 72 43 34 48 68 85 106 132 148 140 121 109 108 110 113 116 111 92 67 57
7604E7J6L2L4K1Lj4k3k4j6mPJ8J8J1Kk%JKLRJ4J2kk5l9l6k0qkMJ3J8J5OLJ2K7L2K2PNJ2Kl2
$$ 57 73 105 139 160 163 149 126 102 86 82 89 107 125 136 138 136 136 137 139 142 151 165 177 175 150 111 75 55 47 45 49 62 80 95 101 104 116 143 175 197 204 209 221 223 191
7584A91o1n7k5LJ5J8J3lk2k4j0JKklkOK6M2L4ll2l5k1qRL3M7L5Oj4k1k4k8k1pKOJ1J5Qoj8
$$ 191 130 73 48 51 66 84 97 94 72 48 38 39 41 39 36 34 40 66 108 142 139 107 72 51 43 52 85 132 167 173 159 138 114 86 65 58 60 66 77 92 100 94 76
7566G6k2k4k8k2j0KNLMPJ2J9K3J7OMJ2J3mk3k2%K6L3K4Plnnj%NJ3K1K0J3NPJ9K1J0mojpl0
$$ 76 54 30 2 -20 -30 -28 -23 -20 -16 -9 3 22 45 62 68 72 84 97 93 70 48 48 74 107 131 138 135 130 125 124 124 129 142 163 183 196 201 208 227 248 258 254 248 247 240 210
7546B10m5l8j5jMOJ1J6J4RJornmj0j9j3OJ7J1Jllj0j6nJ7L0J8pl0l5k5mJ8K7J8%j6k3k1rO
$$ 210 165 127 112 111 115 121 132 148 162 171 172 166 157 152 148 138 119 106 112 129 140 141 138 135 125 109 104 121 151 169 162 132 97 72 68 86 113 131 131 115 92 71 62 68
7527F8K1K4K3K2J8Lj9k9j6OJ8J6RKqk3k8k2nJ8L8M0J6k2m5l8j1J3J9J6RQRLrj7j7j4j9k4k0
$$ 68 89 113 136 158 176 179 160 131 115 121 139 155 164 166 158 135 107 85 80 98 136 176 192 170 125 87 76 89 108 124 133 141 150 153 144 127 110 96 77 53 33
7509C3jJ7K6K5J7OKJ2J8Kk2k6lJ5RJPPj9m3l2PK8K4J9K8K6Nj3j6j5k2k0PL5L0ml8m3l0k0j4
$$ 33 32 49 75 100 117 123 125 137 155 157 135 109 106 121 130 131 138 145 126 83 51 58 86 110 129 157 183 188 175 159 144 122 102 109 144 174 170 132 89 59 39 25
7491B5pOJ2Nj0j8nJ6K9K7J5OMMPP%j0j6j9j8j1JMj2l1k9nK3L6L1K0Qoj9k2j5jJ3J5LoPL4M9
$$ 25 18 24 36 41 31 13 8 24 53 80 95 101 105 109 116 123 123 113 97 78 60 49 50 54 42 11 -18 -23 0 36 67 87 95 89 70 48 33 32 45 60 63 57 64 98 147
7471A47L3Kj9k2j5o%knMK0K0QNK1L1J3j3j9pJjkJmj4j7j1j1j8k0pJ1J7J5Qkj3j1LJ8K1J2M
$$ 147 180 182 163 141 126 120 120 118 113 117 137 157 165 170 191 222 235 222 203 196 197 196 194 195 191 177 160 149 138 120 100 93 104 121 136 144 142 129 118 121 139 160 172 176
7452A76rk1k4oJ4J4ok4j9NK4K4Rkol%LQJ0J0O%j1j7j7j0nk%MJj0j9j9j7j6j2%J1J1kj0qnp
$$ 176 167 146 122 116 130 144 138 114 95 100 124 148 157 155 149 146 146 149 157 167 177 183 183 172 155 138 128 123 121 121 125 126 116 97 78 61 45 33 33 44 55 53 43 35 30 23
7432B3pjOPLMJ0J9K2K1J2nl1n4n0j6K8M8L9K5J9J3j0l2l5j8jNLMNPJ2J8J9Qpk2k9j9KJ5Qj
$$ 23 16 15 21 28 31 35 45 64 86 107 119 114 83 29 -21 -37 -9 39 78 103 122 135 125 93 58 40 39 44 47 51 56 63 75 93 112 120 113 91 62 43 45 60 68 67
7413F7PK6K6Jj7pJ1J1mj0KJ6J8RKJKrk4k3mJ1Mk3l5k5oKLPJ2J5R%rj1mNRQJ1K1K3J2oj4j2
$$ 67 74 100 126 127 110 103 114 125 121 111 113 129 147 156 158 159 161 152 128 105 101 112 116 93 58 33 27 29 32 39 51 66 75 75 66 55 51 56 65 73 84 105 128 140 134 120 108
7393A08%J2J9J9K1K7K7Qj8k5j2kj2l1l3j5OK2K4J4lj4j6j3j1okpj4kK3L6L0K8M3N5L5jj6j2
$$ 108 108 120 139 158 179 206 233 241 223 198 186 184 172 141 108 93 99 121 145 159 156 142 126 113 102 96 94 87 73 71 94 130 160 188 231 286 321 320 304 292
7375B92j3k3k0%J7J0oj3qoj3k2k1rNJj5j9oOjj5pJ9L3K1MMJ9K6J6nk4k7j0PJ3Pmj8l4l4j0
$$ 292 279 256 236 236 253 263 257 244 236 230 217 195 174 165 170 171 156 137 131 137 136 121 114 133 166 187 191 195 214 240 256 251 227 200 190 197 210 217 213 195 161 127 117
7357A17J6J6nk1k1j9j4LK7L7K9K4L1L1Pj2qPQnqLPql4m8m0pK6L2J0j4j7j1j3j8qJ5L1K7J2
$$ 117 133 149 144 123 102 83 69 72 99 136 165 189 220 251 258 246 238 245 253 248 240 243 250 242 208 160 120 113 139 171 181 167 150 139 126 108 100 115 146 173 185
7339A85nk1l6m4l7j5RK4K1J2J4J9J0j2j8kJ3OmOK6K3jj9j6mlkMRPnk1k8k4q%mrkJ2J7J5J8
$$ 185 180 159 123 79 42 27 36 60 81 93 107 126 136 124 106 104 117 123 119 125 151 174 173 154 138 134 131 129 133 142 149 144 123 95 71 63 63 59 50 48 60 77 92 110
7320A10L0L4K7J5Lmo%Jj3l3l7j6NJ2QKmj3j9j9j4jJ7L2L6K6J3Kj0j5qNMj1j8qjj0k3k1pOJ5
$$ 110 140 174 201 216 219 215 209 209 210 197 164 127 111 116 128 136 138 134 121 102 83 69 68 85 117 153 179 192 194 184 169 161 166 170 159 141 133 132 122 99 78 71 77 92
7301I2K2K5J9J0PPkj9k7k2qRK1K2J5MmomLJ2J0JmJKj0k0j6%QRQKj4l2l8l4k9k1mJ6K1J6K1
$$ 92 114 139 158 168 175 182 180 161 134 112 104 113 134 156 171 175 171 165 161 164 176 186 187 183 184 186 176 156 140 140 148 157 165 167 153 121 83 49 20 -1 -5 11 32 48 69
7281F9M0M4K4KjNMorqk0m0n2m9l6j8QK7K4MrKK4L6K7Mj7k8k3nJ1J1jj0qOJ4RKJ0L1M4L0Jj6
$$ 69 109 153 177 179 178 183 187 181 172 164 144 104 52 3 -33 -51 -43 -16 8 12 3 5 29 65 92 96 79 51 28 23 34 45 44 34 26 32 46 55 57 67 98 142 172 173 157
7262A57j7j6k3k5rJ1J2pk4k0JK1K5J4JmJJ1J8K1K2K1J0j2l4l6j5J1K3J6Jrj1o%mj4k1k1j4
$$ 157 140 124 101 76 67 78 90 83 59 39 40 61 86 100 101 97 98 109 127 148 170 191 201 189 155 119 104 115 138 154 155 146 135 129 129 125 111 90 69 55
7244E5kK0M2N0L4Kj9k1j6j7j5nKlj2j1LJ4J3PKKKMJ0J3RPQJ1jk2l8l9k9j6%J6K7K7J1j5l7
$$ 55 53 73 115 165 199 201 182 161 145 128 113 108 110 107 95 84 87 101 114 121 123 125 127 131 141 154 163 170 178 189 188 166 128 89 60 44 44 60 87 114 125 110 73
7226G3l5j1J8K6J5PJ3J8Pqj0jKoj0n%mj2j3j3j1mJ0J7J4J1K3L4L1J4OJ0Rrk6k3nKj4l8m5k8
$$ 73 38 27 45 71 86 93 106 124 131 123 113 112 114 108 98 93 93 89 77 64 51 40 36 46 63 77 88 111 145 176 190 196 206 215 206 180 157 152 154 140 102 57 29
7207B9jJ9K5K1J5J0J1K2L0J7j4l2k0RK4J3pk1k4j6jJ1J1PJ4K9K6%k7k6nJ0Mj0j7j0kNJ1J5
$$ 29 28 47 72 93 108 118 129 151 181 198 184 152 132 141 165 178 171 150 126 110 109 120 131 138 152 181 207 207 180 154 149 159 163 153 136 126 124 129 140 155
7190A55K2K2Nj8k9j6JJj5j8nJ1PnoQK1K4J4%j2j7k1k2k2j9j3j1oJ0K4K7J3JKOMjk%rk6l6k1
$$ 155 177 199 204 186 157 141 142 143 128 110 105 116 123 118 112 120 141 165 179 179 167 150 129 107 85 66 53 42 36 46 70 97 110 111 113 119 123 122 120 120 111 85 49 28
7171B8J4N0O3M9J3j7l0k8k5k4j5kLJLJ9L3K8Nj1j3ommJOQPJ5K6K5J0pj5k0k5k5j3KKj4k5j9
$$ 28 42 92 155 204 217 200 170 142 117 93 78 76 79 80 83 102 135 163 168 157 144 138 134 130 131 137 145 152 167 193 218 228 221 206 186 161 136 123 125 127 113 88 69
7152F9oKLJ3K5K9K3J8K2K3Rj2k3j7kMrl2m6l7j0J6K7K6K1J4Moqmkoj3j2qoj1j6rOK3K7K2J3
$$ 69 63 65 68 81 106 135 158 176 198 221 230 218 195 178 176 180 171 139 93 56 46 62 89 115 136 150 154 148 140 136 134 128 115 103 95 89 78 62 53 59 82 109 131 144
7133A44J0J2J6J3kj9k4j2MJ1J4J9K2Qj4k4j6kOQJ1Opj8j8j4j4j1nok3l6k8j1oj2JL1N2L6M
$$ 144 154 166 182 195 193 174 150 138 142 153 167 186 208 216 202 178 162 160 166 174 185 191 184 166 148 134 120 109 104 98 75 39 11 0 -6 -18 -17 14 66 102 106
7115A06j6j5lOJ3J5Mj2j8j1JMmj7k4k2j2kOJ2J0NQK4L6K5LojKnqOK3K6J8Rlj6j9nJ1J5J0Q
$$ 106 90 75 72 78 91 106 110 98 80 69 70 74 70 53 29 7 -5 -7 -1 11 21 26 34 58 94 119 122 116 115 117 112 104 110 133 159 177 186 183 167 148 143 154 169 179 187
7096A87Jj8l2k1RK1kl6m7k9JK7L7L1J7PKj1l2m0k0QJ9Oj1j2m%mqp%RK2K8K2NlLJ7J7Kp%J3
$$ 187 188 170 138 117 126 147 145 109 62 33 34 61 98 129 146 153 155 144 112 72 52 60 79 85 74 62 58 58 54 46 39 39 48 70 98 120 125 122 125 142 159 161 154 154 167
7076A67J6J4J5J1ql2l8k5j2roMJ4J9J4Kj8l5l8k8j7rJJ5K4K3K2K6K3Rmj2j7k3j9%J2Lj4j5
$$ 167 183 197 212 223 215 183 145 120 108 99 93 97 111 130 144 146 128 93 55 27 10 1 2 17 41 64 86 112 135 144 140 128 111 88 69 69 81 84 70 55
7059E5MK1K3J5PLQK2L1K1pl3l8k3kRQjjPJ3J1QMj4m8o5m2lJ9J7J6L1M5L7J3j1l0m0m1l2k3
$$ 55 59 80 103 118 125 128 136 158 189 210 203 170 132 109 107 116 124 123 122 129 142 153 161 165 151 103 38 -4 -7 12 29 45 76 121 158 171 160 130 90 49 17 -6
7041fk2j4KJ0kj7j4RK6J8lj0LK0K0J9K6M1M6K9J2PJ0OJJ2L0L0Qj1j2j2k4l7l2j6j1k2l3k7
$$ -6 -28 -42 -40 -30 -32 -49 -63 -54 -28 -10 -13 -23 -20 0 20 39 65 106 152 181 193 200 210 216 217 229 259 289 297 286 274 262 238 201 169 153 142 120 87 60
7023F0lK7M8M5K1pk0j6j0j2k3l0k4nJ4J7Jj1kJ7K5J7lk1l0k1jJ6K1K2K2J6nl0l7k5j5j4j3
$$ 60 57 84 132 177 198 191 171 155 145 133 110 80 56 51 65 82 83 72 70 87 112 129 126 105 75 54 53 69 90 112 134 150 145 115 78 53 38 24 11
7006A1kPMpj1kJ2J4PjJJ3K1J3mj4rMQ%j3j3kJ5K2J9J0RJ4J5QJmjKnk2l1k1OK4K3J8K4L1K1
$$ 11 9 16 20 13 2 0 12 26 33 32 33 46 67 80 76 62 53 57 65 65 52 39 37 52 74 93 103 112 126 141 149 150 146 145 147 142 120 89 68 74 98 121 139 163 194 215
6986B15nk6k7k1k0k0k0k4l3l1j2J5K3J1mlJ0K2K2J2%kOK1L0K4Qnropj2k1k7k9k9j8JJ3J3Q
$$ 215 210 184 157 136 116 96 76 52 19 -12 -24 -9 14 25 21 18 28 50 72 84 84 82 88 109 139 163 171 166 157 151 144 132 111 84 55 26 8 9 22 35 43
6969D3J4K6L2K2Qlj3j6qPJ4Lj2j4JJ4J6J1OPNKqj4j1jMJlQK8L5K0pk3k0j2j3k3k9j5OJ4Mp
$$ 43 57 83 115 137 145 142 129 113 105 112 126 129 117 103 104 118 134 145 151 158 163 165 157 143 132 131 135 136 133 141 169 204 224 217 194 174 162 149 126 97 82 88 102 106 99
6949I9mMLnlJ3K6K0jk3l3k9j8nNJ1RMknjJkjJ1L3L6Ol4n1l3lJ4J4J1J5J7J5J1Q%j4k1j2mq
$$ 99 95 99 102 97 94 107 133 153 152 129 96 67 49 44 49 60 69 73 71 66 65 66 64 63 74 107 143 149 115 64 31 28 42 56 67 82 99 114 125 133 133 119 98 86 82 74
6929G4k1k2mK1L6L9K6Oj5k6k4k2j6KK8M1K9RjKPJ0QJqr%Omj8k0oPRjj9l0k2MK1J3mjJ5J7k
$$ 74 53 31 27 48 84 123 149 155 140 114 90 68 52 54 82 123 152 161 160 162 169 179 187 188 180 171 171 177 173 155 135 129 136 145 144 125 95 73 77 98 111 107 106 121 138 136
6909A36j6oPKj1j2jNJJNKlm%kqlJ5K1Nk0k8j5MJ4J8J4Lj0j8j0LOK%PJ1jj8k3j4l%NJ2Pj5k8
$$ 136 120 114 121 123 112 100 99 104 105 106 111 113 110 106 106 104 96 93 108 129 134 114 86 71 75 89 107 121 124 114 96 86 89 95 97 97 104 115 114 96 73 59 56 56 61 73 80 65 37
6888C7rK3L0Rj0lJ3K0K5L4K9Jl6m6k4OK2K4J6Kj2j7j3j0j7k2k4k9l1k2RL6L8K2J9L8N8N4L2
$$ 37 28 51 81 90 80 77 90 110 135 169 198 199 163 117 93 99 121 145 161 163 151 134 121 111 94 72 48 19 -12 -34 -25 11 49 71 90 128 186 240 272
6871B72J3QOnk8m3m2l1k3k3k1j3kKKNJ5K2K4K2J8J4QNQJ0QOOJ2J4Kk3m2l8k4j6j8pJ8L1J5
$$ 272 285 293 299 294 266 223 181 150 127 104 83 70 68 70 72 77 92 114 138 160 178 192 200 205 213 223 231 237 243 255 269 271 248 206 168 144 128 110 103 121 152 167
6853A67j1k1j3plRK5K4Kj4j6j8k9l2k0pj4k1mL2O0O1M7K9Rj1k4l0l7l4j5J2K4J4%j1k4m0m5
$$ 167 156 135 122 115 112 121 146 170 172 158 142 124 95 63 43 36 22 1 -3 29 89 150 197 226 235 224 200 170 133 99 84 96 120 134 134 123 99 59 14
6836A4l0j4qj2j5pNK0L6M0L4K1J3J1Jj6k4j4J0K6K6K0J6Qj3l8m6l4j7j1rkNmj7j6KJ3NKJ2
$$ 14 -16 -30 -38 -50 -65 -72 -67 -47 -11 29 63 84 97 108 109 93 69 55 65 91 117 137 153 161 148 110 64 30 13 2 -7 -9 -4 -8 -25 -41 -39 -26 -21 -19 -7
6818gJ4%j4kK4L4J9KKQQKLN%j1j5j4j3j5j1LK2L1K7J2mj5k2k4k0j6j2lJ0K2J9NpnJLkkNQj
$$ -7 7 7 -7 -9 15 49 68 70 72 80 88 90 93 98 98 87 72 58 45 30 19 22 44 75 102 114 110 95 73 49 29 13 1 -2 8 30 49 54 47 42 43 46 44 42 47 55 54
6798E4j6k3j7j1j0j3mK3M2L6QrmQJ1J1J7K3J2nj1KK2L9M4K9lk8k6j1mqj3j3j7k5l3l9m5m6
$$ 54 38 15 -2 -13 -23 -36 -40 -17 25 61 69 60 56 64 75 86 103 126 138 133 122 124 146 185 229 258 255 227 201 190 186 178 165 152 135 110 77 38 -7 -53
6781e3k7OL0L6L6L5K7J7K0L7M5L0Plnj3k8l9m1l2j2J4K6J9NKMLLJ2K5K5J3Kkoj8l1l8l2j4
$$ -53 -80 -74 -44 -8 28 63 90 107 127 164 209 239 246 243 238 225 197 158 117 85 73 87 113 132 137 139 143 146 149 161 186 211 224 226 224 218 200 169 131 99 85
6763H5KRPJ0K3L0J2j6k0JJ8J1j0k1k3k2k0mK3L9L0Nj3qRJ3MlLJ3J3NJKKlj1j6j4lJ4K3Ok3
$$ 85 87 96 103 113 136 166 178 162 142 143 161 172 162 141 118 96 76 72 95 134 164 169 156 148 157 170 174 171 174 187 200 205 206 208 210 207 196 180 166 163 177 200 206 183
6744A83m1m0l2k9k5j2KJ2J4J7J8J4LmlPK0K7J5qk5k4j4qpkKkj0rMJ4Qoj0mL%ll%j%J1K7L4
$$ 183 142 102 70 41 16 4 6 18 32 49 67 81 84 80 77 84 104 131 146 138 113 89 75 67 60 58 60 58 48 39 43 57 65 59 49 45 48 48 45 42 42 41 41 52 79 113
6724A13K9K5K9K2pl9m3j8MLn%J8K7K1Qkm%Kmj0qNPok0j7lJ2K1K6K4Oj4k3k4k9m0l2%L7N3M5
$$ 113 142 167 196 218 211 172 129 111 115 118 113 113 131 158 179 187 185 181 181 183 179 169 161 166 173 167 147 130 127 139 160 186 210 216 202 179 155 126 86 54 54 91 144 189
6705A89K7Qj4l1l3k3j5j6j8j0RK7K9J7MNJ1J5Nj0k0j8oOPMJ0K7L7K2rk7k3j5j4j1J0L1L1J3
$$ 189 216 224 210 179 146 123 108 92 74 64 73 100 129 146 150 155 166 181 186 176 156 138 132 138 145 149 159 186 223 245 236 209 186 171 157 146 156 187 218 231
6687B31KOMj4k8k3j3k1m1m2j1K2K4Kj3nRNppJ5L4L1Pqn%j5m4o0m8j6J6L3M1L3J1j6k8j9kQ
$$ 231 233 239 243 229 201 178 165 144 103 61 50 72 96 98 85 80 89 94 87 80 95 129 160 167 159 154 154 139 95 35 -13 -29 -13 20 61 94 105 89 61 42 40 48
6669D8RJ5K6L4K7J2mj0oLQJj3j9j0%lk1l0k3j0opkJ1J5MjJ5L7L7Nl5n2m2j1J9K8Qk1k0J3M3
$$ 48 57 72 98 132 159 171 167 157 151 154 162 163 150 131 121 121 118 97 67 44 34 28 21 19 30 45 49 48 63 100 137 142 107 55 13 2 21 49 57 36 16 29 72
6650G2L6Kj9pJ1J7J6J8K2K0J4J2Onj1lKqk4k8k2k4l6l7j5RJ5NjQJ8K0J0%LJ9L5L5K1QRK2K9
$$ 72 108 110 91 84 95 112 128 146 168 188 202 214 220 215 204 201 203 195 171 143 121 97 61 24 9 18 33 38 37 45 63 83 93 93 96 115 150 185 206 214 223 245 274
6632B74K2Jk3m0m5l6k5j6qjMJmpkJ0J8J3mk5l6l1j5PK7L2J3j7l4k5pMJ0J5K0J7J1J0J5K0K3
$$ 274 296 297 274 234 189 153 128 112 104 103 107 108 104 97 95 105 123 136 132 107 71 40 25 32 59 91 104 87 53 28 21 25 35 50 70 87 98 108 123 143 166
6614A66K1J3jj3j3mjkjLO%rj9k7k9k3j5j8k3j8lMrl0l6j8RL1L9L0J7PRJ6K7L9N2M9K3j5m1
$$ 166 187 200 199 186 173 169 168 166 165 168 174 174 165 146 119 90 67 52 34 11 -7 -10 -6 -15 -45 -81 -99 -90 -59 -20 10 27 34 43 59 86 125 177 226 249 234 193
6596A93m4k9qJ1K2J6mk2k5j6qrj1j1kOQjj0j5j4j9k9l3j9PK3J7%nJ4L8M6L0J4J4K4J8lk1k2
$$ 193 149 120 112 123 145 161 157 135 110 94 86 77 66 55 53 59 67 66 56 41 27 8 -21 -54 -73 -66 -43 -26 -26 -31 -17 21 67 97 111 125 149 167 164 143 121
6578A21j8k3k9k6j3oqj1olkjNPOPK5M2L5Kl2l7j9KQJ0J3J8J7J0Ljmqj1j7k5l0k1nJ1J7K1K9
$$ 121 103 80 51 25 12 6 -2 -13 -19 -22 -24 -25 -20 -13 -7 0 25 67 102 104 72 35 16 18 26 36 49 67 84 94 97 96 92 84 73 56 31 1 -20 -25 -14 3 24 53
6559E3L3K4Jj6j6qoroOK1K4K0J4J5J4RK%MJ5K2J8Kk0l4l5k7j5lJpj8k3j7qj0j6j4kOlj7j5
$$ 53 86 110 111 95 79 71 65 56 50 56 77 101 121 135 150 164 173 175 175 179 194 216 234 236 216 182 147 120 105 102 103 96 78 55 38 30 20 4 -10 -12 -6 -9 -26 -41
6540d1J0L5M2K5NLJ1J3%j5j6m%orOK6K8QrnJ2K0Qj2k5k6j4PK7L2K4J5J2Rlj2pQJ0j2l1k6l
$$ -41 -31 4 46 71 76 79 90 103 103 88 72 68 68 62 53 59 85 113 121 112 107 119 139 147 135 110 84 70 77 104 136 160 175 187 196 193 181 174 182 192 180 149 123 120
6521A20J2Ooj1omkKOJj1j9k7l4l8k7%K5K9K3J7K0K4K5K7K7K2Onqoj5l0l8k9j5nNJ7K4J5lr
$$ 120 132 138 132 121 115 111 109 111 117 118 107 88 61 27 -11 -38 -38 -13 16 39 56 76 100 125 152 179 201 207 202 194 188 173 143 105 76 61 56 61 78 102 117 114 105
6502A05PK4K0Jj2k1l3m5l8rJ5K1K0K8L9L4J1j2j7j1%ONMQK1L1K5Nj2j3nkqj4rjkj9m0m1k0
$$ 105 112 136 156 157 145 124 91 46 8 -1 14 35 55 83 122 156 167 155 138 127 127 133 138 142 150 171 202 227 232 220 207 202 200 192 178 169 168 166 147 107 66 46
6484D6MJ1ONQQQK0K9J2k7n2m2j3J2K9M2M0J8kjJ3J3ok3l1m0m7l7oJ6J7Kj0j2pRL0M2L2J7P
$$ 46 50 61 67 72 80 88 96 116 145 157 130 78 36 23 35 64 106 146 164 162 161 174 187 181 158 127 87 40 3 -3 13 30 32 22 10 3 12 42 84 116 133 140
6466A40ok7m7l8kL5M9M0K1J2J7K6K3NpJJ6J5rl3l7k6j4pLJ2J3NnokJ%JLjj1j5nJ5K3J4Lmj3
$$ 140 134 107 60 22 20 55 104 144 165 177 194 220 243 248 241 242 258 273 264 231 194 168 154 147 150 162 175 180 175 169 167 168 168 169 172 171 160 145 140 155 178 192 195 191 178
6446A78k5k8j7oj0j6nJ5J1j8m2l7j1J2K2J6mk1j7LK2K1Ok%OJ3K0J8PKNQjmRL3M1K9J3RJ1J9
$$ 178 153 125 108 102 92 76 71 86 97 79 37 0 -11 1 23 39 35 14 -3 0 22 43 49 47 47 53 66 86 104 111 113 118 126 125 121 130 163 204 233 246 255 266 285
6428B85K5K1Lk2l6l8l0k0ojj3k8k3JJ1jk1k4j1LJ1J2Lj0j2JJ3J0JKKqk0j6mKllLmk5l8k7%
$$ 285 310 331 334 312 276 238 208 188 182 181 168 140 117 118 129 128 107 83 72 75 86 98 101 91 79 80 93 103 104 106 108 100 80 64 60 62 59 56 59 55 30 -8 -35 -35
6409c5K4L2K8Pj7k6j0J5J9Kk5m0l9k1NK0K2K1K9M1M4L2J6QPJ0J2J0Jj0j5qRK4K1Kk8m7m1k0
$$ -35 -11 21 49 56 39 13 3 18 37 39 14 -26 -65 -86 -81 -61 -39 -18 11 52 96 128 144 152 159 169 181 191 192 182 167 159 168 192 213 215 187 140 99 79
6391G9KRPKok0k9k1LK7L3J6j1k7k1KJ8J5Kqj1j4j3jJ3J8Oo%J1J3MkOJ7J7RNKj0l1m3l2lJ8
$$ 79 81 90 97 99 93 73 44 23 26 53 86 102 91 64 43 45 63 78 80 72 61 47 34 33 46 64 70 64 64 75 88 92 90 96 113 130 139 144 146 136 105 62 30 27 45
6372D5J9Npnkjoj0j3j6j2JJ6K2J7J1J4J7J3Mj%kj3k4j8MK5K4PjJ6L3K9Jk4l3l1k5j1RK1K0
$$ 45 64 69 62 57 55 54 48 38 25 9 -3 -2 14 36 53 64 78 95 108 112 111 111 109 96 72 54 58 83 107 114 113 129 162 191 192 168 135 104 79 68 77 98 118
6353A18K3L7M5K5pk4k4k5l8m2k3%J2J3Qlj7k1nJ5K6L0L3L0J3j0j6lRJ1QRQLjmj7l6m4l0j6
$$ 118 141 178 223 248 241 217 193 168 130 88 65 65 77 90 98 95 78 57 52 67 93 123 156 186 199 189 173 170 179 190 198 207 215 218 217 213 196 160 116 86 70
6335G0j6k3j2J8M3M9M0K5J1KOJ9K2Pj4k6k3j6j3k3l4l5k5j2rqLK4L3K2Lj1j8k0mK0L1J5kL
$$ 70 54 31 19 37 80 129 169 194 205 207 213 232 254 261 247 221 198 182 169 146 112 77 52 40 31 23 26 50 83 105 108 97 79 59 55 75 106 121 119 122
6318A22J9J9OJJ2J1ok1j8j4j7j1J0K1Mk2j3K0L4J4lNJ8Kl0m3k1K%k3l8k7n%j6l0j8J2L2K1
$$ 122 141 160 166 167 179 190 184 163 145 131 114 103 113 134 138 116 103 123 157 171 168 173 191 193 163 120 99 101 101 78 40 13 8 8 -8 -38 -56 -44 -12 9
6301IKjJ7M3N1L8Nk4l1j4J1K6K3J6J1RNkj7l2l6k6j2nmLJ6K0jl0l4nK5K7Ppmlj5k2kJ9J2k3
$$ 9 11 10 27 70 121 159 164 140 109 95 106 132 155 171 182 191 196 194 177 145 109 83 71 66 62 65 81 101 100 70 36 31 56 83 90 83 79 76 61 39 37 56 68 45
6282D5m1k1QK2K0Rmk1k3lK0K5J5K0M5N8L4rm1m5l2j8j2j1j1lQJ3OmpjPJ3Oj5l5l0lL0M3L0
$$ 45 4 -17 -9 13 33 42 38 17 -6 -9 11 36 51 71 116 174 208 199 158 113 81 63 51 40 29 26 34 47 53 49 42 41 48 61 67 52 17 -13 -16 14 57 87
6263H7Qrj1%J7K3Oj8k4qJ1J1mj6j3onj1j5j1mJNMkroQK3K6J8J3J5J2Jj0j3nMP%j1j4mORJ1
$$ 87 95 86 75 75 92 115 121 103 79 71 82 93 89 73 60 54 49 38 23 12 8 9 14 18 16 7 1 9 32 58 76 89 104 116 117 107 94 89 93 100 100 89 75 71 77 86 97
6243I7K1L2K4lk6k9j7rj0nPK0K6K5K0J1nk1l1k8j2KOKKMJqnJ4L1K9J0nqpkJ0J9J0j1k3j7o
$$ 97 118 150 174 171 145 116 99 90 80 75 82 102 128 153 173 184 179 158 127 99 87 89 95 97 99 103 104 96 91 105 136 165 175 170 162 155 153 163 182 192 181 158 141 135
6224A35qj8k1j5j3k2l4l1j3OJ8K1K8L6L5K4J6K3L7L8K5jk9n4p1o8m0mK6L7L4J6ok5l4k8j2
$$ 135 127 109 88 73 60 38 4 -27 -40 -34 -16 5 33 69 104 128 144 167 204 242 267 266 237 183 112 44 4 0 26 63 97 113 107 82 48 20 8
6208HMJ3J6K1K6K2Kj7j9j1j1j9k0mJ4K0J9J8J2kj9k0qMJ1J1J4K2K8K2Lj8l0k8k7k7j6RK8L2
$$ 8 12 25 41 62 88 110 112 95 76 65 54 35 15 11 25 45 64 82 94 92 73 53 45 49 60 71 85 107 135 157 160 142 112 84 57 30 14 23 51 83
6191H3K8K9L3K0lj4qjrj5jK7N1N4L6Ll7o3o2m0j5jMMNJ1J9K5K5K1J1rl4l8j4J3J5mj5oPJ1
$$ 83 111 140 173 193 190 176 168 167 158 143 142 169 220 274 310 313 276 213 151 111 96 95 99 103 108 119 138 163 188 209 220 211 177 139 125 138 153 149 134 128 135 146
6172A46J4K6L0J5j1k8k9k4j4kLnj8k4k7k7j6KJ3Oo%J7K0%j7j5nkoo%J1K5M0M2K4Kj4k3k9k6
$$ 146 160 186 216 231 220 192 163 139 125 123 126 121 103 79 52 25 9 11 24 30 24 24 41 61 61 44 29 24 22 16 10 10 21 46 86 128 152 154 140 117 88 62
6154F2oJ5K1J2LNQQjj1j2LK2K4Rllkj9l6l2j2nj3j8j3rj7j4OK4K4J6J2J4J2QNOJ0RJj4k6j8
$$ 62 56 71 92 104 107 112 120 128 127 116 104 107 129 153 162 159 156 154 135 99 67 55 50 37 19 6 -3 -20 -34 -28 -4 20 36 48 62 74 82 87 93 103 112 113 99 73 55
6135E5NJ6Mj7k1j0%jm%QOlj3j3lMLJQK3L1L1L3M6M8K9%j9k1j4lOlk1k6%L9N6M0Qk6n1n8m5
$$ 55 60 76 80 63 42 32 32 31 27 27 35 41 38 25 12 9 13 16 17 25 48 79 110 143 189 237 266 266 247 226 212 209 215 212 191 165 165 204 260 300 308 282 231 173 128
6115A28l1l0l5k9j5j1qJ5M7O5N0K4Mj0k1k0jJ8J3koRL1L8K3nl2m3m6m3l2oK2K8J7QJ4J0j6
$$ 128 97 67 32 3 -12 -23 -31 -16 31 96 146 170 174 164 143 123 122 140 153 151 145 154 185 223 246 241 209 166 120 77 45 39 61 89 106 114 128 138 122
6098A22m4l9nL0M6M5K8Mj0%K1K0kj7pNnl1m0k1LQlqork5l5k1OJ7OnKK3L4K5Nj3k2j6%J0Nj6
$$ 122 78 39 34 64 110 155 183 187 177 177 198 218 216 199 192 197 192 161 121 100 103 111 108 100 94 85 60 25 4 10 27 33 28 30 53 87 112 117 104 82 66 66 76 81 65
6079F5l2k8oJ7L6M5M1K7Mj6k1j3mj1k4k2lJ0lk2k1KK1J9RJ0K0K2J0j2k5k3k1l0m6m9l0kJ4
$$ 65 33 5 -1 16 52 97 138 165 169 153 132 119 115 104 80 58 55 65 62 40 19 21 42 61 70 80 100 122 132 120 95 72 51 21 -25 -74 -104 -106 -92
6062i2K0K7L4L1K2J1NMJ2K1K3J2lqj0j9k4nK5L5J7mnNQJ0J5J5kk5l5k9k4k6k6j2J0L0L7L5
$$ -92 -72 -45 -11 20 42 53 58 62 74 95 118 130 127 119 109 90 66 61 86 121 138 134 129 134 142 152 167 182 180 155 120 91 67 41 15 3 13 43 80 115
6044A15L6M2M0J6k0m1m2l7k9j3J9L8K5pk7k4j7j0LK1K8J8kk1l8n3m8k1J5L7L8K8J9RNLNMl
$$ 115 151 193 233 249 229 188 146 109 80 67 86 124 149 142 115 91 74 64 67 88 116 134 132 111 73 20 -28 -49 -34 3 41 69 88 97 102 105 110 114 111
6028A11p%J3J7OnKK2L3K0jj0qj2k0k1j5j3j6j2LJ5J8J6J5J0KJJ3K5K2Qoj8k5k6j4MJ3J5J6
$$ 111 104 104 117 134 140 135 137 159 192 212 211 201 193 181 161 140 125 112 96 84 87 102 120 136 151 161 163 164 177 202 224 232 226 208 183 157 143 147 160 175 191
6010A91K3K7K4J2lj8k1j3jKJKOQQPJj5k9l4l0l3l3j4K2M4L2LqMK1K7K5J9Nj2j9j6qkKLjqo
$$ 191 214 241 265 277 274 256 235 222 221 223 224 226 232 240 248 255 256 241 212 178 148 115 82 68 90 134 166 169 161 165 186 213 238 257 262 250 231 215 207 205 207 210 209 201 195
5990A95MQ%nMK0K0Jj8k6k2j9k0k3j9lJ4J5pl1k3NK0%l0l6j1K0L7L5J8ok3k4j3oorj7k0qK7
$$ 195 199 207 207 202 206 226 246 247 229 203 181 162 142 119 100 97 111 126 119 88 65 70 90 90 60 24 13 33 70 105 123 117 94 70 57 51 45 36 19 -1 -9 18
5972A8N8N0Qk7l0j6j2j3mJ5K4J8QQJ0J4K2L2K7Qj2j9j7j5j4qmnj1j5k1k3j4MJ5Oj2k3k0j1
$$ 18 76 126 134 107 77 61 49 36 32 47 71 89 97 105 115 129 151 183 210 218 206 187 170 155 141 133 129 124 113 98 77 54 40 44 59 65 53 30 10 -1
5955aLK9N1M7J0l4n3m3j6OK4L7L9L4K6J6MlmKOJ0J1Pj2l7m6l0lJ3J3Lmj5k5k2mJ6K4K1K1K6
$$ -1 2 31 82 129 139 105 52 9 -7 -1 23 60 99 133 159 175 179 176 172 174 180 190 201 208 196 159 113 83 80 93 106 109 105 90 65 43 39 55 79 100 121 147
5937A47K2Prj0l%nj0j6k3k8k4j2LJ6L0M1M2K9J1lj2j9k6k8k6j7kJ3J6OnmJ4L3L5J5j8l7k7
$$ 147 169 176 167 157 154 154 149 139 123 100 72 48 36 39 55 85 126 168 197 208 205 193 174 148 120 94 77 75 88 104 110 105 101 115 148 183 198 180 143 116
5919A16JJ1ql1l4k0j6k2j7J1L5M3L7L4K6Mk7l7k0J1L9M7L6Qj3j6kN%j0j8k3k2j8j8k3l4l4
$$ 116 117 128 120 89 55 35 19 -3 -20 -9 26 69 106 140 166 170 143 106 86 97 136 183 219 227 214 198 196 201 201 191 173 150 128 110 92 69 35 1
5903Aj6QK9M3M4L2J3LNRPLJ3K9L0J3pj2pj4l5n1n0l5j9%J6J6lj7lK7M0K3jj5j7j1PL0L3Qk3
$$ 1 -15 -7 22 65 109 141 154 157 162 171 178 181 194 223 253 266 259 247 240 226 191 140 90 55 36 36 52 68 65 48 45 72 112 135 134 119 102 91 98 128 161 169 146
5884A46l1j5kJnprrpqj8k8j9lPPJ3K3K6K0J8K8M1M0K8Pj7k6j5ORrk2j5jMMMpl0n3n8m5k7n
$$ 146 115 100 98 99 94 87 78 69 62 54 36 8 -11 -14 -7 0 13 36 62 82 100 128 169 209 237 244 227 201 186 192 201 192 170 155 154 158 162 166 159 129 76 18 -27 -54 -59
5865e9K0L7L6L4K9J2j8l5j9K1N3O3N8M4K4Qoj8k0JL3M7M0O2J41K39L30M57O30P02M84pm90
$$ -59 -39 -2 34 68 97 109 91 56 37 58 111 174 232 276 300 308 302 284 264 265 298 345 385 447 588 827 1157 1614 2244 2946 3430 3423 2933
5850B933o90o04m26l02k20j37o5l1l0l6l8l8l8l5l3k9j3LKrrKlk3l4rK7M0K2pk3k3oJ3K0J2
$$ 2933 2243 1639 1213 911 691 554 489 458 428 392 354 316 278 243 210 181 168 171 173 164 155 157 154 131 97 88 115 155 177 170 147 124 118 131 151 163
5835A63Jlrj6j7NL8N1L2jj7lJ7K0%j5j2Jjj9l3l3k8k6j9p%qj4pOJ6J8J8J4KnNK1K6J5PPPO
$$ 163 164 161 152 136 119 124 162 213 245 244 227 224 241 261 261 246 234 235 234 215 182 149 121 95 76 69 69 61 47 40 46 62 80 98 112 114 109 114 135 161 176 183 190 197 203
5815B03RJ5Qj7l5l0rJok0j8lJ8L2L7L2J6pk7k8rJ2J5Lnopj5j6nMMNJ7K9K1nk9l8l3j7J0L4
$$ 203 212 227 235 218 183 153 144 145 139 119 101 98 116 148 185 217 233 226 199 171 162 174 189 192 187 181 174 159 143 138 142 146 151 168 197 218 213 184 146 113 96 106 140
5797A40M2K9J4J6J9J0j8m2m9l6j6%Llj0j0j2j5j7rKJ3K2K4J7kj3pJ1J8J4RQKrpRK3J5oj9j9
$$ 140 182 211 225 241 260 270 252 210 161 125 109 109 112 109 99 89 77 62 45 36 38 51 73 97 114 112 99 92 103 121 135 144 152 154 145 138 147 170 185 179 160 141
5778A41j3j1j0rppnn%Kok5m3l7j1QJ2J3K2K5Jk7k7mJ7J9J8K5K2kl3m3k0OK3K7K4J7Oqj6j3
$$ 141 128 117 107 98 91 84 79 74 74 76 70 45 2 -35 -46 -38 -26 -13 9 34 35 8 -19 -23 -6 13 31 56 78 76 43 0 -20 -14 9 36 60 77 83 75 59 46
5760D6JJ5J7J1LjkLJ3J3ol0k4J6N5N2J4k6n0o0o1n0k9nJ3K7L2K0KjJ4K8K4J6J3J3OjLJ5J5
$$ 46 47 62 79 90 93 92 90 93 106 119 113 83 59 75 130 182 196 170 120 60 -1 -51 -80 -85 -72 -45 -13 7 9 8 22 50 74 90 103 116 122 121 124 139 154
5742A54kk7m0l5j6NJ3Qkrj3j9k0j9j1n%RJ8K1K2K5K7K1NrpPJ5PnpLJ3J4J1J5K9M4M4K4ol2
$$ 154 152 125 85 50 34 39 52 60 58 49 36 17 -3 -22 -33 -38 -38 -29 -11 10 32 57 84 105 110 101 94 101 116 123 118 111 114 127 141 152 167 196 240 284 308 302 270
5724B70m6n0n0m2j7J8L7K6pk6j4J2K5K2J4J0NljJ4K7J7j3m3m7l6j9nJ4L6M1K1rk3j5kOQQ%
$$ 270 224 174 124 82 65 83 120 146 139 113 99 111 136 158 172 182 187 184 183 197 224 241 228 185 138 102 83 78 92 128 169 190 181 158 143 141 147 155 163 163
5706A63j5k6k3j1%MRJ2J2J3J0Kqj6j6k0l0k5NL6M0J7jKMpk5k4j0LPOJ2K1K7K6Qk0m0l6j9k
$$ 163 148 122 99 88 88 92 101 113 125 138 148 150 142 126 110 90 60 35 40 76 116 133 132 134 138 131 106 82 72 75 82 88 100 121 148 174 182 162 122 86 67 65
5688F5PJ1Pj0l3m0k1OK2L0L3L4K7K0J8K1J5Jj3k0j4mOJ1J1OJnj5k8l8l3qK2L4J8oj6oOJ1L
$$ 65 72 83 90 80 47 7 -14 -8 14 44 77 111 138 158 176 197 212 213 200 180 166 162 168 179 190 196 197 192 177 149 111 78 70 92 126 144 138 122 116 122 133 136
5670A36pj7j9j0MQlj6j0J0K6K1Lj4k4k6k8l0l1k8j1MLj3k3j2J2K7K5J4Mrj8j0J4L3K7Oqj0
$$ 136 129 112 93 83 87 95 92 76 66 76 102 123 126 112 88 62 34 4 -27 -55 -66 -62 -59 -72 -95 -107 -95 -68 -43 -29 -25 -34 -52 -62 -48 -15 12 18 10 0
5653@j6k7k3LL0L7L3L1L3K0j0l3l7k7k0j2NK1K5J8J6K5K8J7%j0ompj6k5l2l4k1lJ5J7J6J9
$$ 0 -16 -43 -66 -63 -33 4 37 68 101 121 111 78 41 14 -6 -18 -13 8 33 51 67 92 120 137 137 127 121 117 110 94 69 37 3 -18 -21 -6 11 27 46
5636D6K5K3J5QOKpqJ1L2L3J1j3j8r%Lpk6m0k8PM0M2J7qj9k4k5j2J2K9K4Lj5k5k6k2j7j5j4
$$ 46 71 94 109 117 123 125 118 110 121 153 186 197 184 166 157 157 160 153 127 87 59 66 106 148 165 157 138 114 89 77 89 118 142 145 130 105 79 57 40 25 11
5618A1mQNj3k4j0J3J4j1k9k2%K0L6M6L8Ol0l9k5j2qMK1K6J1j0k0k1k6k3mK5M2L7K6K0J9J8
$$ 11 7 15 20 7 -17 -27 -14 0 -11 -40 -62 -62 -42 -6 40 78 84 54 15 -10 -22 -30 -26 -5 21 32 22 2 -19 -45 -68 -72 -47 -5 32 58 78 97 115
5601A15Qrk0j5KJ3J5J6K2K4J1mmNJ3J6K0J5j7n6o9l9LK5K6K4K0Rqj6j4lLLmj5j5okj5l0k6
$$ 115 123 114 94 79 81 94 109 125 147 171 182 178 174 179 192 208 228 243 226 170 101 62 65 90 116 140 160 169 161 145 131 128 131 134 130 115 100 94 92 77 47 21
5583B1mJ4Qrj3NL4N3N3L9J7ok2k5j3KP%rj3k2k6j2K2M3K8qk6k1j5k3l1k8k0j6j0NK0K8L5L9
$$ 21 17 31 39 30 17 22 56 109 162 201 218 212 190 165 152 154 161 161 152 139 117 91 79 101 144 172 164 138 117 102 79 48 20 0 -16 -26 -21 -1 27 62 101
5565A01L5J8Jpj1k2k9k2j3j4j8nK4L8K4ok6k3kK4L9L4K2J6K1K3Rj6l2l1j9pjmqqqk0l7m0j5
$$ 101 136 154 155 148 137 115 86 64 51 37 19 14 38 76 100 94 68 45 43 67 106 140 162 178 199 222 231 215 183 152 133 126 125 121 113 105 97 77 40 0 -15
5547a5K4M7L3NrjJ1J2lj4j2J0L9M7K6rk0jK0J3rj8qkj1k0oJ9K9K3Qlj6k3j8kJ2J3Krj4qPK1
$$ -15 9 56 89 94 85 84 95 107 104 90 78 88 127 174 200 191 171 170 190 203 194 176 168 166 155 135 129 148 177 200 208 205 189 166 148 146 158 171 173 164 150 142 149 170
5528A70K1Mk0l1k1LK1J7mj7j2lj1k7k8j1K%o%J3J3L%J3K0Pj1j1RK7K3J2QRjk4l7k8lJ3J3J
$$ 170 191 195 175 144 123 126 147 164 160 143 131 128 117 90 62 51 53 53 47 47 60 73 76 76 89 109 116 105 94 103 130 153 165 173 182 181 157 120 92 89 102 115 116
5510A16j3j6qPJ7J9J2Jj4k2j7olkMJ3Mk0k3MK9K1nj4nkqpOJ4J1J0J3Lk0m0l8j8JJ7K9K9J6
$$ 116 103 87 79 86 103 122 134 135 121 99 82 76 73 71 75 88 92 72 49 53 82 103 98 84 79 77 69 62 68 82 93 103 116 119 99 59 21 3 4 21 50 79 95
5491I5JlJJ0K1K5K0Nnooj2j6rLJ1Lqj4mJ2J0j6m4m7k5KJ5J9J7RlnJON%pj1JK4L7K2%KK2L2
$$ 95 96 93 94 104 125 150 170 175 170 164 158 146 130 121 124 135 138 130 116 112 124 134 118 74 27 2 4 19 38 55 64 61 56 57 63 68 68 61 50 51 75 112 134 134 136 158 190
5471A90K9L7M5K9jkK2K8LqJ6L3J5j1j0kqnK0L8M2P2J45K01K46L97O68P97M90j55o81p72n59
$$ 190 219 256 301 330 329 327 349 377 380 372 388 421 436 425 415 413 405 400 420 458 500 572 717 918 1164 1561 2229 3026 3516 3361 2680 1908 1349
5456A349l52k60j97j14o2n9m8j2Lj4k3j0lj3nK0L2J3klj8m8n5k0J8K0%j1j0qJK1L5K0lqLJ0
$$ 1349 997 737 540 426 364 305 257 245 248 234 211 201 198 185 180 200 232 245 243 240 222 174 119 99 117 137 137 126 116 108 109 130 165 185 182 174 177 187
5440A87MLJ1K2K4J4ok7l7k5p%oj1m%j3l1k7OM4N8M3K8K4K0Jk5l6l1k2k5k6j9kK3M8N7L6nm0
$$ 187 191 194 205 227 251 265 259 232 195 170 163 163 157 146 142 142 129 98 71 77 121 179 222 250 274 294 295 270 234 203 181 156 130 111 109 132 180 237 273 268 228
5422B28n4n0l7j4RJ8J0lqroMK4L8L3K0J1Mnj2j4j9k8k6oJ5J4rl3l9k8rJ5L3L8L0K6K4J4j7
$$ 228 174 124 87 73 82 100 110 107 99 90 84 88 112 150 183 203 214 218 213 201 187 168 140 114 108 123 137 128 95 56 28 19 34 67 105 135 161 185 199 182
5405A82n4p1n8l1nJ1K3L4M1L5K0PORRONM%pj9k6k9k1lK2M0M1K4NlPJ5J0kj1j2j7k2j4J0K6
$$ 182 128 57 -1 -32 -37 -26 -3 31 72 107 127 134 140 149 158 164 169 173 173 166 147 121 92 71 68 90 130 171 195 200 197 204 219 229 227 216 204 187 165 151 161 187
5386A87J3j7m1m1k1LJ6J0mj5j5j5j7j6LL0M9M6K9J0nj8l0l3k8j6lJ0J9K0RorLJ8K2J8J3J0
$$ 187 200 183 142 101 80 83 99 109 105 90 75 60 43 27 30 60 109 155 184 194 189 171 141 108 80 64 61 71 90 110 119 113 104 107 125 147 165 178 188
5370A88Jj6l3m2m0k7rMKlNK3L1J6lj0ojJPJ5K3K6K0kk9l8k4%J3J7J9J2j0k4j7KQLQK1K4Pj2
$$ 188 189 173 140 98 58 31 22 26 28 25 30 53 84 100 97 87 81 80 81 88 103 126 152 172 170 141 103 79 79 92 109 128 140 130 106 89 91 99 102 110 131 155 162 150
5350A50rPJ9J4jj2j1kJj0k3k8k6k1rJ4K6Rk5l3j4Lpk1j0K4M5M2K8J4kk5m2l9k0KJ1J2QNpk5
$$ 150 141 148 167 181 180 168 157 155 156 146 123 95 69 48 39 53 79 88 63 30 16 19 12 -9 -19 5 50 92 120 134 132 107 65 26 6 8 19 31 39 44 37 12
5332A2l4k0J1L4L7K7J6J0RRNoj9k7l0l4l1k0mQJ2J9K8L3K7K1K1K2J7J6J8J1lj1kPjj7k9k8
$$ 12 -22 -42 -31 3 40 67 83 93 102 111 116 110 91 64 34 0 -31 -51 -55 -47 -35 -16 12 45 72 93 114 136 153 169 187 198 195 184 182 189 188 171 142 114
5315A14k3j3NJ7J8J8K7L4K1rl4m4l6j9jMrj8lK8M3L1J0mj3j3qlj2k1qK5M2K5jj5k5n0p2n8
$$ 114 91 78 83 100 118 136 163 197 218 209 175 131 95 76 75 79 70 52 49 77 120 151 161 157 144 131 123 120 108 87 79 104 146 171 170 155 130 80 8 -50
5298e0j0L6M9M3L7L4J9qk8k7j1LRJ7K5K3Lk4l5j9J2L6M3L2J7PJj2l0m4m2l1k6k1rJ2K6K8K1
$$ -50 -60 -24 25 68 105 139 158 150 122 95 84 87 96 113 138 161 164 140 105 86 98 134 177 209 226 233 234 222 192 148 106 75 49 28 19 31 57 85 106
5281A06J2%qmMlk4l4j7J1K1J3KPK4M4N0L3Lj4j3j0j6k1rOJj5j3QK0J1kkLmj3%K7L5Nm2o8n9
$$ 106 118 118 110 106 110 107 83 49 32 43 64 77 79 86 110 154 204 237 240 226 213 203 187 166 157 163 164 149 136 144 164 175 173 171 174 170 157 157 184 219 224 182 114 55
5262E5l1oQJ9L0L4K8K2K3J9kl5n4l8JK9K0j4m0l7j1J0J4Mnj1j4qNK2K9K1Jk0l0k1%J2RKPJ8
$$ 55 24 18 26 45 75 109 137 159 182 201 199 164 110 72 73 102 122 108 68 31 20 30 44 48 43 32 18 10 15 37 66 87 88 68 38 17 17 29 38 40 47 65
5243F5K1J0%kkpj6j7roj3j9rJ7M4M4J7rj2JPlj1pNQ%j5k2j1J1K3J1j2k1qPRPJ1K3K6J7jj3
$$ 65 86 96 96 94 92 85 69 52 43 37 24 5 -4 13 57 101 118 109 97 98 105 102 91 84 89 97 97 82 60 49 60 83 94 82 61 53 60 69 76 87 110 136 153 152 139
5224A39j8j8j3%J3J8J0qk4l0j8NK8L5K3Plqj6j7KL1L5Mk8k1J0K4Lk6l2k0mRK1K6K4K6L3L3
$$ 139 121 103 90 90 103 121 131 123 99 69 51 56 84 119 142 149 146 138 122 105 107 138 173 177 149 128 138 162 165 139 107 87 83 92 113 139 163 189 222 255
5207B55J2j2k7l5m9o1n5k9%K2L9M1K5Lj0j2j9l1l5j7QJ8Nj8k2mL3N7N1K6OjnqmL%k0l6l1q
$$ 255 267 255 228 193 144 83 28 -1 -1 21 60 101 126 129 119 107 88 57 22 5 13 31 36 18 -4 -8 25 82 133 159 165 164 159 151 147 150 150 130 94 63 55
5189E5J0J3Kj2k2j9qlrj2nJ2K3J4mj1jJ5K0Nj7k2mJ6K3J2NQJ4J4J2J0J4J8K0J3mk2l0k2pM
$$ 55 65 78 80 68 46 27 19 16 7 -5 -10 2 25 39 35 24 23 38 58 63 46 24 20 36 59 71 76 84 98 112 124 134 148 166 186 199 195 173 143 121 114 118
5171A18OMNPOMJjJRK1K9K8J4Koj2k0k5j9mjj6l5l5j9KJ1P%kMJ3J8J4QNMJmrj0rnkJmj3k0j8
$$ 118 124 128 133 140 146 150 151 150 151 160 181 210 238 252 254 248 236 216 191 172 168 167 151 116 81 62 64 75 82 82 80 84 97 115 129 137 142 146 147 143 134 124 115 110 108 109 105 92 72 54
5149E4j0mjnlPK0K4J4%okMJ6L5M5L1%k1k3j9k4k7j6KPkj5j4qqj4j6oJ2K3J4mj0RL2L1Mk7l9
$$ 54 44 40 39 34 31 38 58 82 96 96 90 88 92 108 143 188 219 219 198 175 156 132 105 89 91 98 96 81 67 59 51 37 21 15 27 50 64 60 50 59 91 122 126 99 60
5129F0l1j2QK0J3%nKOjpkPPkqpj4k3j9%K1K3J1LONpk4k8j5OK4L0J9kj6j2%J0RKklpk0l3l9
$$ 60 29 17 25 45 58 58 53 55 61 60 53 51 58 65 63 55 48 34 11 -8 -8 13 36 47 50 56 61 54 30 2 -13 -7 17 47 66 64 48 36 36 46 55 57 55 52 45 25 -8 -47
5109d7k2J2L7L7K4J7K4K2kl0l3rJ4J5Lj0j8k3k3j0J0J7J4J7L2M0K8RMJ2J1lj3mM%j2qMPpj5
$$ -47 -69 -57 -20 17 41 58 82 104 102 72 39 30 44 59 62 52 34 11 -12 -22 -12 5 19 36 68 108 136 145 149 161 172 169 156 152 156 156 144 136 140 147 140 125
5090A25nJ0Nj5k6j3J2J9RkOK1K3J1jloj9k9j9RK5J4j4l4l4k0rnrj3j0NK6M1M0K9K1K2K6K0
$$ 125 120 130 135 120 94 81 93 112 121 119 125 146 169 180 179 176 170 151 122 103 112 137 151 137 103 69 49 40 35 26 13 3 8 34 75 115 144 165 187 213 233
5073B33qm2n9m6j4MKkOK2K4Pj2j5kJ2J1pl4n0m4k0J5L8M6L5K0Nrk1j9LL6N5M7K2Loj2k0k6
$$ 233 225 183 124 78 64 68 70 68 74 96 120 127 115 100 98 110 121 114 80 30 -14 -34 -19 19 65 100 120 125 116 95 76 79 115 170 217 239 242 236 224 204 178
5055A78k6k3k4k4j8lJ4K3K1Pqj4rmj0k6m0k9KL9N7M6J7jNK1K4Oj5k1j5j6k6k5nJ8J9kk2j8
$$ 178 152 129 105 81 63 60 74 97 118 125 117 103 94 90 80 54 14 -15 -13 26 83 129 146 145 150 171 195 201 186 165 150 134 108 83 78 96 115 113 91 73
5037G3LK2K5J3oj5j1JJ0O%NJ8K1Oj6k8k2qnj8l6m0k5j0pj3nJ7L7M0K9K1J8K2K3K2Nk1m5n1
$$ 73 76 98 123 136 130 115 104 105 115 121 121 126 144 165 171 155 127 105 97 92 74 38 -2 -27 -37 -44 -57 -62 -45 -8 32 61 82 100 122 145 167 172 151 106 55
5020E5l9j8kRJ1PKJ0K1K1J6K2M5O1M8J6oropq%QKk0l9l9k2qqj7j6mOPOLnk0l0k2qJKQJ7K0
$$ 55 16 -2 -4 5 16 23 25 35 56 77 93 115 160 221 269 285 279 270 264 257 249 249 257 259 239 200 161 139 131 123 106 90 86 92 99 105 108 103 83 53 31 23 24 26 34 51 71
4999G1J5J6J9J7RRJ1Mj3j8KJ8J2oj3j1j4j5%K1K5J0kLJ2J0KklmKK2L5K6Lj3j3j1j5j3jJ5K1
$$ 71 86 102 121 138 147 156 167 171 158 140 142 160 172 166 153 142 128 113 113 134 159 169 167 170 182 192 194 192 189 185 187 209 244 270 273 260 247 236 221 208 207 222 243
4981B43J2kj3j7k0k1j5o%nj4j8j9k0k1j0J2L1M2M4L8J6j3l3l1j8ojLONPJ2Rj0k9l2j7KK0L2
$$ 243 255 253 240 223 203 182 167 161 161 156 142 124 105 85 64 54 66 97 139 183 221 237 224 191 160 142 136 135 138 144 149 156 168 177 167 138 106 89 91 111 143
4963A43L0J3rk1l0m6n2l2%J2LJK4M3L4RkJ%rj1k%pj4j2prj0rkNKpj7k2j9j3qKJ3K0J5J2J8
$$ 143 173 186 177 156 126 80 28 -4 -4 8 11 12 36 79 113 122 120 121 121 112 101 99 99 92 78 66 59 50 40 31 29 34 36 29 12 -10 -29 -42 -50 -48 -35 -15 0 12 30
4943C0K3J5%%K0L7L0Lj0JJ9K1Qqj6k1j9j2j%j3l0l1k3j7j8j6%K4M0M3K7jk4l3k0lJ3K1K5J9
$$ 30 53 68 68 68 88 125 155 158 148 149 168 189 197 189 173 152 133 121 120 120 107 77 46 23 6 -12 -28 -28 -4 36 79 106 105 81 48 28 25 38 59 84 103
4926A03Poj0qNK2L7L2Pj7j9mJ0Oqk2k0jK3L5K5Ooj6l1m3l9j9m%PK3L3K6J7K1K9K7J8J5J9J7
$$ 103 110 104 94 86 91 113 150 182 189 172 153 149 159 165 157 135 115 114 137 172 197 203 197 181 150 107 68 49 45 45 52 75 108 134 151 172 201 228 246 261 280 297
4907B97Oqk1l7m6l3kJ8J6Ljkj4k9l1k0oNJ5K1J8J6K5L9L6J9Mmj4k9l5l2m2n9n5k0J0J1JQK2
$$ 297 303 295 274 237 191 158 156 174 190 193 192 190 176 147 116 96 90 95 110 131 149 165 190 229 265 284 288 284 270 241 206 174 132 73 18 -2 8 19 20 28 50
4890E0K0KkQJ7J3RMklQJ6Lj9j9NK5K2Qqk3l3k6oJ3K4L4M2L8L3L4K5qm2m5k1qk0l3k6qJLPR
$$ 50 70 72 70 78 95 108 117 121 119 116 124 140 143 124 105 110 135 157 165 157 134 101 75 69 82 106 140 182 220 253 287 312 304 262 217 196 188 168 135 109 101 102 105 112 121
4870A21J4J9J8RRJ9K2Lj2qkolJ7K3J5L8R7J13N8QJ9K7okQ3J45J28J80L80N64P05J159K029
$$ 121 135 154 172 181 190 209 231 234 222 214 212 206 203 220 243 258 296 393 506 564 572 591 618 612 610 693 838 966 1146 1526 2090 2795 3954 5983
4855E983K501J557n41k227k383j520q18o17m75k07p7j49j57l6jq7q4K1K9o7o4M8O0l0k6O8
$$ 5983 8484 10041 9500 7273 4890 3370 2552 1935 1460 1253 1176 1027 870 834 833 746 662 683 712 645 581 629 689 659 633 701
4844G01N4m6l0Q5R7N2J45K78J87j9rJ52J46O9K43N14N02M58R00J549J912K739N069P447O334
$$ 701 755 709 679 764 861 913 1058 1336 1523 1504 1495 1647 1793 1862 2105 2619 3121 3579 4479 6028 7940 10679 15748 23195 29529
4833B9529P07n544p742n736l094k059j756j041l94m17n54k62Pj51k85n0J17q4k03N3K25K3
$$ 29529 30236 24692 16950 11214 8120 6061 4305 3264 2870 2453 1899 1637 1644 1493 1208 1158 1275 1191 988 1041 1266 1289
4824A289j21O6J72l0r8J58K64N0L9L69M17J9j14K53M03J20K03Q34J091Q71J388K812L785M680
$$ 1289 1168 1234 1406 1376 1278 1436 1700 1750 1789 2158 2575 2594 2480 2733 3136 3256 3459 4293 5384 6255 7643 10455 14240 18920
4813A8920Q187J3880J5280O976o753j5357j4130q342m738l869k860j302p64j105q82j72j12
$$ 18920 27107 40987 56267 63243 56490 41133 27003 18661 13923 10054 7194 5892 5128 4023 3141 2969 2857
4806B857n41m30N5J3l53k16J86P0l00j61K11Q2k47o2L02J51j34J46N26K62j27J65N91L33N5
$$ 2857 2316 1886 1941 1954 1601 1385 1571 1641 1341 1180 1391 1473 1226 1164 1466 1617 1483 1629 2155 2417 2290 2455 3046 3379 3434
4795C434O44J314J110J092K467M044M796P263J3579J8760J4151o57j4793j8242j2731o932
$$ 3434 4078 5392 6502 7594 10061 14105 18901 26164 39743 58503 72654 71997 57204 38962 26231 19299
4788A9299m861m004k301j075j218j343o27j51m90o49j54R6k73m08MJ58k02k94R5J96j71k35
$$ 19299 14438 10434 8133 7058 5840 4497 3870 3719 3229 2580 2426 2522 2249 1841 1845 2003 1801 1507 1602 1798 1627 1392
4779A392J61K42j10j02L43L75o9r6L71M27O1K56R52J042P29J415K910L743M856R063J4863
$$ 1392 1553 1795 1685 1583 1926 2301 2232 2136 2507 2934 2995 3251 4203 5245 5974 7389 10299 14042 18898 27961 42824
4770D2824J5034N325q256j5368j3121p599m592l780k635j243q99j140q04k12k46n68m09o0
$$ 42824 57858 63183 54927 39559 26438 18839 14247 10467 7832 6589 5690 4550 3746 3534 3288 2720 2311 2251
4762B251j55l88k10O1o9k80j07J33Kj85j7J83K4j59QJ89L5q6J60L53J41rK80N12L48M36J179
$$ 2251 2096 1708 1498 1559 1490 1210 1103 1236 1238 1053 1036 1219 1243 1084 1092 1281 1316 1230 1390 1743 1884 1875 2155 2667 3015 3451 4630
4750D630J843K165L512O437Q154N184j560o946p511m912k735k038j623r09m87n32m89k08j02
$$ 4630 6473 8638 12150 18587 26741 31925 30365 23419 15908 10996 8261 6223 4600 3691 3204 2672 2183 1975 1873
4742A873k34k32m9k0j58j61qJ6r1p7N2M6q3r8%lr6p4L4L1n3j6R4O9k9K3J61J59J05K65N38
$$ 1873 1639 1407 1358 1338 1180 1019 1011 1027 936 859 911 957 874 776 776 773 677 603 637 668 615 599 693 762 733 756 917 1076 1181 1446 1984
4728A984O67R06J712K629K378N15j685k600k049j144o97n67l89j99j54j74j19l7k6m5l3l0
$$ 1984 2651 3557 5269 7898 10276 10791 9106 6506 4457 3313 2616 2049 1660 1461 1307 1133 1014 977 951 906 873 843
4719H43p0q8m4kj7m8m1j5j0oQJ1oj4KRj3l1k4rlLJ8J5JOM1P5R3J26J79K33L08M58O30O33L41
$$ 843 773 685 641 639 622 574 533 518 508 502 510 521 515 501 503 512 499 468 444 435 432 435 453 468 469 475 516 591 684 810 989 1222 1530 1988 2618 3251 3592
4703C592j24m80n74m87l73k93k28j62j14q9p5o0m6k8j0%mj4j8k5l5m0k7qmqlJ3K3J8Plj6k8
$$ 3592 3468 2988 2414 1927 1554 1261 1033 871 757 668 593 533 487 459 449 449 445 431 413 388 353 313 286 278 274 266 263 276 299 317 324 321 305 277
4688B77k5%K1K0NpmJLkqj8j9j1jJ%kmj1j2mjk1m3l8pJ4Mj1qOJ0PRK0K0J1L%mrj1ommMJ6K5
$$ 277 252 252 273 293 298 291 287 288 291 289 281 263 244 233 232 233 233 231 227 216 204 200 199 178 135 97 90 104 108 97 89 95 105 112 121 141 161 172 175 175 171 162 151 145 141 137 141 157 182
4667A82J7Mk%K%KPJ2Oqj7j3KJ2Rmj8k0rQJ9J8Mj0j5j0pqrjRJ1PLkj2k2j7kLrj7jL7N5L9Lj8
$$ 182 199 203 201 201 203 203 205 212 224 230 222 205 192 194 206 215 211 193 173 164 172 191 209 213 203 188 178 171 163 154 153 162 173 180 183 181 169 147 130 128 131 122 105 104 141 196 235 238 220
4646B20j9j3j5k2k1j5rqj4j9k2k4j8lJ7L3L7K9J5lj3qJ0J9Rj0j6mRJ4J5J6J7K1K9L8K9Lk0
$$ 220 201 188 173 151 130 115 106 98 84 65 43 19 1 -2 15 48 85 114 129 126 113 105 115 134 143 133 117 113 122 136 151 167 184 205 234 272 301 304 284
4629B84k9l5m3l7j4Mnl0l9k6oJ6L7N1M6L0J6Plj0%J4J4kj2j8l2n5o2m0mK0L2L6K3Kj4j3qj6
$$ 284 255 220 177 140 126 130 125 95 56 30 24 40 77 128 174 204 220 227 224 214 214 228 242 240 228 210 178 123 61 21 17 37 69 105 128 130 116 103 95 79
4611G9k7l2k5j7nPOJNK8M7M6L2K6K2J2PJ1Rj1l0k1MPj7l0j8lqk7l4k4nJ3K1J1lnQJ7J3J1K3
$$ 79 52 20 -5 -22 -27 -20 -14 -13 -8 20 67 113 145 171 193 205 212 223 232 221 191 170 174 181 164 134 116 113 105 78 44 20 15 28 49 60 57 52 60 77 90 101 124
4593A24L3K9J4J0J1Rjj2k4l2k9j6opoJ0K6K1%j6j0OJ6J5QLOJ6J9Nj8l0k7k3k5k7j9pmj1k4
$$ 124 157 186 200 210 221 230 229 217 193 161 132 116 110 103 97 107 133 154 154 138 128 134 150 165 173 176 182 198 217 222 204 174 147 124 99 72 53 46 42 31 7
4575Gk9k3jK5M3M4L3J9Qjj3k3k1jK4L2K0jj0mjqj7j7rNJ8K9L5L1K2J4Mj2l1l5j9j%j1k0j7
$$ 7 -22 -45 -46 -21 22 66 99 118 126 125 112 89 68 67 91 123 143 142 132 128 127 119 102 85 76 81 99 128 163 194 216 230 234 222 191 156 137 136 136 125 105 88
4557H8j0ppqrrmKJ1J3J7J9J9J3Mkpj1j0n%lmNJ8J8Nqq%NJ0J5J7J4Nnj7k6k7k0j0jOQKj3j9
$$ 88 78 71 64 56 47 38 34 36 47 60 77 96 115 128 132 130 123 112 102 97 97 94 90 95 113 131 136 128 120 120 125 135 150 167 181 186 181 164 138 111 91 81 80 86 94 96 83 64
4536F4LL9N6L2j3n0n5l1RL9L6J1j2oJ8L4K6Lj4j9j7j2qqj0j1j2q%QOj3l6l8pL8O7O1L9K0J1
$$ 64 67 106 162 194 181 131 76 45 54 93 129 140 128 122 140 174 200 203 189 170 153 141 133 125 115 104 92 84 84 92 98 85 49 11 4 42 109 170 209 229 240
4518B40Kj0k3l0l3l6l1j7KJ7K0J0pk1k2j1knj9k2nJ3J9Jj9k0oPRPLMKJ%%%LJ2K3K2J5QOJj2
$$ 240 242 232 209 179 146 110 79 62 64 81 101 111 104 83 61 50 48 43 24 2 -3 10 29 30 11 -9 -15 -8 1 8 11 15 17 18 18 18 18 21 33 56 78 93 101 107 108 96
4498I6j9lK7M2L2Nk1l0k4j1JLKJ%nj2j3onj4k2j6JK3M1N3N4L4Mk1k3oJ9L6L8K2%j7j9j5j2
$$ 96 77 74 101 143 175 180 159 129 105 94 95 98 100 101 101 96 84 71 65 60 46 24 8 9 32 73 126 180 214 218 197 174 168 187 223 261 283 283 266 247 232 220
4480B20k1l7m5m4l1j4NK1K4J5PQJ3J4Q%qj6k3k1pOJ3J4J5RkqjR%j8k0LL1L6J1k0l6l4k4j6
$$ 220 199 162 117 73 42 28 33 54 78 93 100 108 121 135 143 143 135 119 96 75 68 74 87 101 116 125 123 115 114 123 123 105 85 88 119 155 166 146 110 76 52 36
4462C6j2%K5M8M8K2lj1njlrj4j6pJ3K8K5Oqj0qj4j6j1mnrj5j7j8j6j0%J1K7M1L8K0OJ2K5K3
$$ 36 24 24 49 97 145 167 164 153 148 147 144 135 121 105 98 111 139 164 170 162 152 144 130 114 103 99 94 85 70 53 35 19 9 9 20 47 88 126 146 152 164 189 212
4443B12Jj8k2pJ5L5L6J3j4k2j3nj1j2nKj0l0l6k5%K3L5K8RkNJ5Roj5j4j3nJ0J7ll6m2j7PJ
$$ 212 213 195 173 166 181 216 252 265 251 229 216 211 200 188 183 185 175 145 109 84 84 107 142 170 179 177 182 197 206 200 185 171 158 153 163 180 177 141 99 82 89 90
4425I0j6j7jOok3k4pK1M3M3L1K2K9K9Mk9l9j9KQN%j6l9n1l5oJ2J1OQJ8K7K7J5lrjJ5J8J2N
$$ 90 74 57 56 62 56 33 9 2 23 66 109 140 162 191 220 224 195 156 137 139 147 152 152 136 97 46 11 5 17 28 34 42 60 87 114 129 126 117 116 131 149 161 166
4406A66ML%pk3m3m9k9LK0J7QRK0K6J9Kj4k0j3pj0j8j7pKNPJ4J8J7J5J4J2%j1j7j7j5oNPpj3
$$ 166 170 173 173 166 143 100 51 22 25 45 62 70 79 99 125 144 146 132 112 99 92 82 64 47 40 42 47 54 68 86 103 118 132 144 144 133 116 99 84 78 83 90 83 70
4387G0pjk0m8n7k7J9N0N1L5J0j0k1k4k4k1nJ1J7J7K1K5J4oj6mOok4j9KJ6J2QJ8K6J0j8k8j1
$$ 70 63 62 42 -6 -63 -90 -71 -21 30 65 75 65 44 20 -4 -25 -30 -19 -2 15 36 61 75 69 53 49 55 49 25 6 8 24 36 44 62 88 98 80 52 41
4370D1J4K0jk3k8j6KPLoj3rJ0L3M0K9J3PNjpjJ3J9J8J3Qkj4j5nQJ3ROlj5l3m6m3k5kJ0Lpr
$$ 41 55 75 74 51 23 7 9 16 19 13 0 -9 1 34 74 103 116 123 128 127 120 119 132 151 169 182 190 188 174 159 154 162 175 184 190 187 172 139 93 50 25 23 33 36 29 20
4350B0jMOJ0J4J1RJ9M2N3L3pl6m1k8j0KQJ1J1J2R%pjJ4K7K3Mj3j2KJ3Lj6k3qJ2J6kl2n2n0
$$ 20 19 23 29 39 53 64 73 92 134 187 220 213 177 136 108 98 100 108 119 130 142 151 151 144 143 157 184 207 211 198 186 188 201 204 188 165 157 169 185 183 151 99 49
4331D9k9j1mnKJ3J4ONJ4J2nj7oROj5l0k5rJ0K4L1K4J4J6K3K2J0NRJ3ll5o3o8m2mK2K2J5J8
$$ 49 20 9 5 0 2 15 29 35 40 54 66 61 44 38 47 53 38 8 -17 -26 -16 8 39 63 77 93 116 138 148 153 162 175 172 137 74 6 -36 -40 -18 4 19 37
4313C7L4M6L9J4j1k0j3%ONMOmk1k7pJ8K6J8J9K4J7qk4k2j8k8l6l0k0k0j9oJ4K0J1KKOPJ0J3
$$ 37 71 117 156 170 159 139 126 126 132 137 141 147 143 122 95 88 106 132 150 169 193 210 202 178 156 138 110 74 44 24 4 -15 -21 -7 13 24 26 28 34 41 51 64
4295F4J1Njlpj6k2j7jQJj2j2NL0L6J9pk1k1j7j4nJ1K6K6J0pqNJ6J6J6K5L6L0Rrj2pj0j9k8
$$ 64 75 80 79 76 69 53 31 14 13 21 22 10 -2 3 33 69 88 81 60 39 22 8 3 14 40 66 76 69 61 66 82 98 114 139 175 205 214 205 193 186 176 157 129
4276A29k8j4J2L6L6Rj6j9pLPJ5K0Rj1j8pJ0J7J5J6J4Pnj2j0NK0K5Qj8l1j8JQNQJ7K0Qj3k6
$$ 129 101 87 99 135 171 180 164 145 138 141 148 163 183 192 181 163 156 166 183 198 214 228 235 230 218 208 213 233 258 266 248 217 199 200 208 213 221 238 258 266 253 227
4258B27k3j1mnoLJ4J8Rpk0k5k1j2mMJ0Poj7j3KRKpqj0j8j7NL3L7K0PKqk4l0j3Jlj4rJ2K7K3
$$ 227 204 193 189 184 178 181 195 213 222 215 195 170 149 137 133 137 147 154 148 131 118 120 129 131 124 116 106 88 71 76 109 146 166 173 175 167 143 113 100 101 98 84 75 87 114 137
4238A37PmkJ3K1J2rk7l3l2k8k1j1nqqJJ0J1PRJ0MmmNJ4J9J7RJnj0j5j3LK1K5Oj5k1j4qm%N
$$ 137 144 140 138 151 172 184 175 148 115 83 55 34 23 18 10 2 3 13 24 31 40 50 54 50 46 51 65 84 101 110 111 106 96 81 68 71 92 117 123 108 87 73 65 61 61 66
4218F6jp%J8L3L5K5Qj2k6k6k2k1k0j1NJ7J6J4J0Kj0j4jJ7L0K3Kk1l3k7j5mNJ6K0J3LLJ1J5
$$ 66 65 58 58 76 109 144 169 177 165 139 113 91 70 50 39 44 61 77 91 101 103 93 79 78 95 125 148 150 129 96 69 54 50 55 71 91 104 107 110 121 136
4200A36J5J8J9RnoPJ0nj4kJ7J5kj5j8j7j9j0NJ7J1kj7k2j7nK%qrJJ2K0L0L6L2J5jkOJ4J5J1
$$ 136 151 169 188 197 192 186 193 203 198 184 182 199 214 212 197 179 162 143 133 138 155 166 164 147 125 108 103 105 105 97 88 89 101 121 151 187 219 234 233 231 237 251 266 277
4181B77Lj2l6n2n5m6l9l2j6NK0J8NmkQJ2J1RRJ5J8J2j0l5l6oL6N3M1K0RRJ0RNlj5k9l6l7l7
$$ 277 280 268 232 180 125 79 40 8 -8 -3 17 35 40 36 34 42 54 65 74 83 98 116 128 118 83 47 41 77 130 171 191 200 209 219 228 233 230 215 186 150 113 76
4163G6l7l2j8nMJ2K7L6K7OnOK1K2J4K1L8M0J7pj1j1k5m6m1rJ6J8PNMj8m8n9l9mK1K7K1J1K
$$ 76 39 7 -11 -16 -12 0 27 63 90 96 91 97 118 140 154 175 213 253 270 263 252 241 216 170 129 120 136 154 161 166 170 152 104 45 6 2 23 50 71 82 84
4145H4NJ8K5Rj8k9j4NNj4k9l1k7k4j4J1L7M5L4J4pk7l7k7pNJnNK4L6K4Kj0rmmojJ3K7K7Qj8
$$ 84 89 107 132 141 123 94 80 85 90 76 47 16 -11 -35 -49 -38 -1 44 78 92 85 58 21 -6 -13 -8 -7 -12 -7 17 53 77 79 69 60 56 52 46 45 58 85 112 120 102
4126A02l4k9pJ2K3K5J7%j9k6j3PJ9J7J1QOjpnj%JJmk0l1k6oPLjJ0K4K5Lk4m0k9nJ7K2J0LJ0
$$ 102 68 39 32 44 67 92 109 109 90 64 51 58 77 94 105 113 119 118 111 106 105 105 106 107 103 83 52 26 20 27 30 29 39 63 88 91 67 27 -2 -7 10 32 42 45 55
4107E5J5Pqj3KK1K6J7MNJ7K6J5j2k5j6%MmkNMj3k8l0k5k3j3J1L0K3mj8j1J0K0J7RJJJ0J5R
$$ 55 70 77 69 56 58 79 105 122 126 131 148 174 189 177 152 136 136 140 136 134 139 143 130 102 72 47 24 11 22 52 75 71 53 42 52 72 89 98 99 100 110 125 134
4088A34mj1qpj0j2nmj2j6JL0M6L9K5J2kj8k5j0J3K0J0pj6k4l4m3l7j3J1J7MqlJ3K6L0K5J2
$$ 134 130 119 111 104 94 82 77 73 61 45 46 76 122 161 186 198 196 178 153 143 156 176 186 179 163 139 105 62 25 12 23 40 44 36 33 46 72 102 127 139
4071A39qk4k1JL0M8L8Jm3o4m8j0J9J7%j1mJ6L4M3L5J8kj0j0pj4l0m6m5k5LJ8K1K3K5K2J3O
$$ 139 131 107 86 87 117 165 203 204 161 97 49 39 58 75 75 64 60 76 110 153 188 206 204 194 184 177 163 133 87 42 17 20 38 59 82 107 129 142 148
4054A48%j9n1p4o3l0jJ1J9L0L7L8L0K4J8J2MJkoj5j7j2nKLjj0k0k2j9j4j5rJ0L2M2K9R%jp
$$ 148 148 129 78 4 -59 -89 -90 -79 -60 -30 7 45 75 99 117 129 133 134 132 126 111 94 82 77 79 82 81 71 51 29 10 -4 -19 -28 -18 14 56 85 94 94 93 86
4036H6j8j7PL2L6J9JqrlJ2K4J8ql5m5k9LL2L9K3Jpk%j2k2j8nNRQPNJ0K0K7J9mk6m0l8k5lJ1
$$ 86 68 51 58 90 126 145 146 138 129 126 138 162 180 172 137 92 63 66 98 137 160 161 154 152 152 140 118 100 95 100 109 117 124 129 139 159 186 205 201 175 135 97 72 69 80
4016H0J3QPJ3K5L4K8Kk7l3j8jkj2j5rmJMjk1m2l7j4PRjj1j8k2j8nJ1J9K0K3L0L7L5K3Lj5j9
$$ 80 93 101 108 121 146 180 208 210 183 150 132 131 129 117 102 93 89 90 94 93 72 30 -7 -21 -14 -5 -6 -17 -35 -57 -75 -80 -69 -50 -30 -7 23 60 95 118 121 106 87
3998H7pJ1K4K0Nj1j2%PLj0j6j4j1qkJ1K4L2L5L1J3j4l8m2l0rRJ9J9J5J3Nj6l7m3k5mPQOJk
$$ 87 80 91 115 135 140 129 117 117 124 127 117 101 87 76 68 66 77 101 133 168 199 212 198 160 118 88 79 88 107 126 141 154 159 143 106 63 38 34 41 49 55 56 54
3979E4OK2L6L1J3mj3j5j2kPJ2J1RQMknpj4k4l1l2k7rJ5K4Oj4j2J3K6J5%NJ7J4lj5j8j8k1j4
$$ 54 60 82 118 149 162 158 145 130 118 116 123 135 146 155 163 167 165 160 153 139 115 84 52 25 16 31 55 61 47 35 48 74 89 89 94 111 125 122 107 89 71 50 36
3960C6LK1L3M1M3L4J0j7l1l2k6j7jJ6K5J5ok6k7j5kkj2j1OL0M0K2lj9j9j4j4j1lNjk4m2l5
$$ 36 39 60 93 134 177 211 221 204 173 141 115 98 97 113 138 153 147 121 94 79 77 75 63 52 58 88 128 150 147 128 109 95 81 70 67 72 71 47 5 -30
3943c0pK5L8L3K7L0L7L5K1%j6k5l0k8k3j4%J0J2kk0k3j0J3K3J6lj8k2j4jPPMQK0L2L2K2Pl
$$ -30 -37 -12 26 59 86 116 153 188 209 209 193 168 138 110 87 73 73 83 95 93 73 50 40 53 76 92 89 71 49 35 34 41 48 52 60 80 112 144 166 173 170
3925A70mjNJ9L0K6Nk0l0k9k2j0RK6K7J5Kqk3m0l7j1J0Oj5k0lJ4J0j1k8l0k1qjKPK0L4L9L2
$$ 170 166 165 170 189 219 245 250 230 200 171 149 139 148 174 201 216 218 210 187 147 110 99 109 115 100 80 77 91 101 90 62 32 11 3 2 4 11 31 65 104 136
3907A36J5lj4j2jJ0QKloj4k4k3j1KQNlrj4pRK7L4L2K3J3kj8l2l4j9MJ9J9R%mqlQJ5RoqMJ7
$$ 136 151 148 134 122 121 131 139 141 138 132 118 94 71 60 62 70 75 72 63 49 42 51 78 112 144 167 180 178 160 128 94 75 79 98 117 126 126 122 114 111 119 134 143 137 129 133 150
3887A50K1J4lk8n1n4l5qPJ3J4J3PQJ2J8K3K7L3K6Lj7j5prk5l4k9k2k0j3NK0K3J6J3J8K2J5
$$ 150 171 185 182 154 103 49 14 6 13 26 40 53 60 68 80 98 121 148 181 207 210 193 178 171 162 137 103 74 52 32 19 24 44 67 83 96 114 136 151
3870A51OKQJ5Ok0m3m2k1jOORQJpj2j4j4jK4M1L5K2J9K8K5%k5k5j1lqj0LJ4Mk8n7o4n1k8mJ6
$$ 151 157 159 167 182 188 168 125 83 62 61 67 73 82 90 91 84 72 58 44 43 67 108 143 165 184 212 237 237 212 187 176 173 165 155 158 172 176 148 91 27 -24 -52 -56 -40
3851d0K7K3J5NKKMQJ7K6K3Pj3k1j2kmj4j6jJ8K6K3J9J7Mj9l0j9LJ4J1J3K7L4K4Pnj5l3m7m1
$$ -40 -13 10 25 30 32 34 38 46 63 89 112 119 106 85 73 71 67 53 37 36 54 80 103 122 139 143 124 94 75 78 92 103 116 143 177 201 208 203 188 155 108 67
3833F7j4QJ4J1OLmoLJ9L5L8K1rl1k7jJ4Lk1k6j0%j5l5l6qK5M6M0K0MKPLmnNJ2Rmj3j0JRJk2
$$ 67 53 61 75 86 92 95 91 85 88 107 142 180 201 192 161 134 133 147 150 129 103 93 93 78 43 7 -1 24 70 110 130 134 136 143 146 142 137 142 154 163 159 146 136 137 146 147 125
3812A25m0m2k5pOJ6K5K2QNK1L9L5J6joqoKJ0J0LnppmL%j4k9k7j3pj0lJ3J4rl3l0j4qj1nJ2
$$ 125 85 43 18 11 17 33 58 80 88 93 114 153 188 204 203 197 189 183 185 195 205 208 203 196 189 185 188 188 174 145 118 105 98 88 85 98 112 103 70 40 26 18 7 2 14
3793A4K2J8J2J6J5Mj0r%NjpmMJ1RLlkLRJ4K0K2J7Lj2j5j0oj4k6k8j5LK0L1L7L0Mk5m2m1k9
$$ 14 36 54 66 82 97 101 91 82 82 87 86 79 75 79 90 99 102 99 97 100 109 123 143 165 182 185 173 158 148 142 128 102 74 59 62 82 113 150 180 184 159 117 76 47
3774D7j7nQJ6K0K3K4K2J5J1QOLLKj4l9n1l4lJ7J5J1J2K0K7L1K5Pj7k2qN%j2j3kOJrqkJnj5
$$ 47 30 25 33 49 69 92 116 138 153 164 172 178 181 184 186 172 133 82 48 45 62 77 88 100 120 147 178 203 210 193 171 163 168 168 156 143 141 147 148 139 131 129 130 125 110
3754A10j3KK3L4L2J9Qoj9k3j2KMqk3k8k4j6nPJ5J8J4QKnprj4k4k3oJ7K8K1J3J1Pok1k2j1j0
$$ 110 97 99 122 156 188 207 215 209 190 167 155 157 161 153 130 102 78 62 57 64 79 97 111 119 121 116 109 100 86 62 39 33 50 78 99 112 123 130 124 103 81 70 60
3736F0k2l5l0j2J1L1M4M9M0K1jk2l4l2k6k3k5k0nQQkm%OJ3L0N3N4K8qk3j6mknj0j4j6j8j7
$$ 60 38 3 -27 -39 -28 3 47 96 136 157 156 134 100 68 42 19 -6 -26 -31 -23 -15 -17 -21 -21 -15 -2 28 81 135 163 155 132 116 112 110 105 95 81 65 47 30
3718C0j2pLJ2K1K0J3Mjjmj0j2jK2M2M5L0J0oj3j7k3k8l1l1l3l4k9qK2M4M4K2ok1k2j7j8k4
$$ 30 18 11 14 26 47 67 80 84 83 82 78 68 56 55 77 119 164 194 204 198 185 168 145 117 86 55 22 -12 -41 -49 -27 17 61 83 77 56 34 17 -1 -25
3701b5j9KL0M2L2Pj7l2l1j5QK1K5K4K0Lk7m8m0j0J8L1L3K9J4pj2KK3K7J4JlmnlOJ7J9PmnM
$$ -25 -44 -42 -12 30 62 69 52 20 -11 -26 -18 3 28 52 72 75 48 0 -40 -50 -32 -1 32 61 75 68 56 58 81 108 122 123 120 116 111 108 114 131 150 157 153 148 152
3682A52J2Oqj7j1LJ6J9RkmLOmk3l8l4k1j1j5k4k3rJ0J2jrkJ3J9QmplMJ1J4J2J5K3K6J1j2k1
$$ 152 164 170 162 145 134 137 153 172 181 179 175 178 184 180 157 119 85 64 53 38 14 -9 -18 -8 4 3 -6 -8 5 24 32 28 21 18 22 33 47 59 74 97 123 134 122 101
3663A01pRJ2PJ2K2K3Pj5k9k9j6LJ7J4NKJj0l2m0j9J5L6L5K5J5%j8l5l4j8KJ2J2RJ3J7J6Pk
$$ 101 94 103 115 122 134 156 179 186 171 142 113 97 100 117 131 136 138 139 129 97 57 38 53 89 124 149 164 164 146 111 77 59 61 73 85 94 107 124 140 147 145
3645A45mmlJMjj9m0n1m0j4J9L6L3J6Jmnoppj0j4pJ4K9K4Omoj2l1m6m2j8J3L6L9L1K1J6Orj3
$$ 145 141 137 134 135 139 138 119 79 28 -12 -26 -7 29 62 78 79 75 70 64 57 50 40 26 19 33 62 86 92 88 82 70 39 -7 -49 -67 -54 -18 21 52 73 89 95 86 73
3626G3PL7M2J8nlJ2J1ok7m1m7m3k6q%JRK4L2K7K2J8J1kj2qjjmjJ2J6Rj%Lnk5l9k5%J2NKJ7
$$ 73 80 117 159 177 172 169 181 192 186 159 118 71 28 2 -6 -6 -5 4 28 60 87 109 127 138 136 124 116 115 114 110 109 121 137 146 145 145 148 143 118 79 54 54 66 71 73 90
3606I0L0K0ok4k4k3k0j0%nj9j3J4L9K8KpNJ4J0PJ0Oj0k4j6OL0L6K2%j4rOJ1Jj3j9j9j6j3j3
$$ 90 120 140 134 110 86 63 43 33 33 28 9 -4 10 49 77 79 72 77 91 101 108 118 124 114 90 74 80 110 146 168 168 154 145 151 162 163 150 131 112 96 83 70
3588G0j4pJ1K6K2Mompj7k3j4kKLROrj6JL0M0K4Lmnorrrq%J5K5K4J7J1JqpNJ4Lj0nJ3K0Nj5
$$ 70 56 49 60 86 108 112 106 102 95 78 55 41 39 41 44 53 59 50 34 35 65 105 129 132 128 123 117 108 99 90 82 82 97 122 146 163 174 175 167 160 165 179 182 172 167 180 200 205 190
3567A90k1j4kPJ3J1Jj0j6j5j3oJ0K4K9K0Nj3k8l5k5oPjj9k8j6RL1L7K3Kj4j8j2njmj4k5k6
$$ 190 169 155 153 160 173 184 185 175 159 144 131 125 135 159 188 208 213 200 172 137 112 106 113 112 93 65 49 58 89 126 149 151 137 119 107 102 101 97 83 58 32
3549C2j0OJ2J1J3K2K6K0Plmnoj0j8k4k2j2KJ0J1NJOJ8K4Rk0m0l8j6NJ2J1J5K4L1K8J7mk7m2
$$ 32 22 28 40 51 64 86 112 132 139 136 132 127 121 111 93 69 47 35 37 47 58 63 64 70 88 112 121 101 61 23 7 12 24 35 50 74 105 133 150 146 119 77
3531G7l8j8k%kLJ4J5QLJ1J8J5J0J4J7QorJRMqj4j1plKLKKOPkj3j8j7j5oORJqoLOMLjj4k1j1
$$ 77 39 21 19 19 17 20 34 49 57 60 71 89 104 114 128 145 153 147 138 139 148 152 144 130 119 112 109 111 114 116 118 124 131 129 116 98 81 66 60 66 75 76 68 62 65 71 75 78 77 63 42 31
3508C1QJ0oj3%J1%j8k2j6j8j9nK0L6L1J5OMJ1K2L2K8Qj7l2l2k3kJ9L0K3Kk1l8l8k1MK1K2J6
$$ 31 39 49 43 30 30 41 41 23 1 -15 -33 -52 -57 -37 -1 30 45 51 55 66 88 120 148 156 139 107 75 52 50 69 99 122 124 103 65 27 6 10 31 53 69
3490F9ROJk%MOPJ2J9J3ql4m1k5l%j8l3k6JJ7J1JJ3L5M0J4k0l6l6l5l2j7J1L6M0L6M0N3N5K8
$$ 69 78 84 85 83 83 87 93 100 112 131 144 136 102 61 36 33 33 15 -18 -44 -43 -26 -15 -14 -1 34 74 88 68 32 -4 -39 -71 -88 -77 -41 -1 35 75 128 183 211
3472B11j6m6m8l0k0j4jK2L3J8j1k9k2kJ9L7M3K3j3l6l5k0j4k2k6j7MK6M3M2K4Noj1j7k4k3
$$ 211 195 149 101 71 51 37 36 58 91 109 98 69 47 45 64 101 144 167 154 118 83 63 49 27 1 -16 -12 14 57 99 123 128 122 111 94 70 47
3456D7j0NJ4J8J7J3QMJKOJ2Nj6l2j5K2M3K6oj9j0oj5k3j9j2qkJ0J7R%%P%j9l4l0j3LJ8K3J6
$$ 47 37 42 56 74 91 104 112 116 117 119 125 137 142 126 94 79 101 144 170 164 145 135 129 114 91 72 60 52 50 60 77 86 86 86 93 93 74 40 10 -3 0 18 41 57
3437E7kj1lJ3J5LLJ9L1J9krnqk6l7k9qQJ4Rpk6l2k4pNQPJ0J7L1L3K1KrlLNPJ3J1nk2j9mMj
$$ 57 55 44 41 54 69 72 75 94 125 144 142 133 128 120 94 57 28 20 28 42 51 44 18 -14 -38 -45 -40 -32 -25 -15 2 33 66 87 89 80 77 80 85 92 105 116 111 89 70 66 70 69
3416F9JJ6K6J4j3l1k1OL2L7J2j7k5qPJj4j4LJ8K4K0J2nk7l9l5j9mNJ3K6L6K7Jk5k4KK5K6J1
$$ 69 70 86 112 126 113 82 61 67 99 136 148 131 106 98 105 106 92 78 81 99 123 143 155 150 123 84 49 30 26 31 44 70 106 133 134 109 85 87 112 138 149
3398A49jqj2j0LJ9K2J1mj2j6j2m%oj1qpj5k6j3J5K9J4mkJ1RlpjKqj7j3KJ4K0J8J2PJ4K1J5
$$ 149 148 140 128 118 121 140 162 173 169 157 141 129 125 125 119 108 100 93 78 52 39 54 83 97 93 91 102 111 108 101 100 102 94 77 64 66 80 100 118 130 137 151 172 187
3379A87j1l3l2rJ2J8J2Mqk0k8k1mPOj0k7k6jL0M1K1j4k7qK5L7K0nj9j4mjj0k4l0j5J1L2L4
$$ 187 176 143 111 102 114 132 144 148 140 120 92 71 67 74 80 70 43 17 16 46 87 108 94 67 59 84 121 141 136 117 103 99 98 88 64 34 19 30 62 96
3362I6K1J6J9K2J6Mm%RJ5J2nk4l6l8l4k3mJ4J9PnnJlj4j6%J9K5J4jpqmKNJj1j6j0KRJ7L4N7
$$ 96 117 133 152 174 190 194 190 190 199 214 226 221 197 161 123 89 66 62 76 95 102 97 92 93 90 76 60 60 79 104 118 117 110 102 98 100 105 106 95 79 69 71 80 97 131 188
3342A88O6M9J4j8l3k9j6jNmj8k1j2kpk1k6j4Jjj3k2j8j7k2k2pJ2J4LmKJ0Kj0j4pkJPJ7L1L6
$$ 188 254 303 317 299 266 237 221 220 225 221 203 182 170 168 161 140 114 100 101 100 87 65 47 30 8 -14 -21 -9 5 8 4 6 16 18 8 -6 -13 -15 -14 -7 10 41 77
3323G7K1rl9m7l4j7roMJ7K4K4K1J2nj7pK2M0L9K7J7Lj2k3j5pj2k8l5k2lJ5K1J9PjKPJqlJ7
$$ 77 98 89 50 3 -31 -48 -57 -63 -59 -42 -18 6 27 39 34 17 10 32 72 111 138 155 158 146 123 108 101 89 61 26 4 1 16 37 56 63 62 64 71 72 64 61 78
3305G8L5M0M2M0K7Jk3k5j9k0k9k6j0lj4k1rJ7K4Oj4j0J0K1J7J1J7K2J4NOJ1Jk0l2k7j8k1j9
$$ 78 113 153 195 235 262 263 240 215 196 176 147 121 111 108 94 73 64 81 105 111 97 87 97 118 135 146 163 185 199 204 210 221 222 202 170 143 125 104 85
3288H5lJ0Kj5j1J0J8pm1m5j1L1N4M5K4RMJllKNj2l5m4l6k9k8k5jK3K6RJQJ4Mj1k2j9qJ4L5
$$ 85 82 92 94 79 68 78 96 89 48 3 -8 23 77 122 146 155 159 160 157 154 156 161 149 114 70 34 5 -23 -48 -49 -26 0 9 10 18 32 36 25 3 -16 -24 -10 25
3269B5M3L7L3M3M4J7j8l2k0mNJ5K9L2J3j0k0k3l2m5m8l5j6JJ6L2L8L0Rj3l0l8l7l6k9j4QK0
$$ 25 68 105 138 181 225 242 224 192 172 168 173 188 217 249 262 252 232 209 177 132 84 49 33 34 50 82 120 150 159 146 116 78 41 5 -24 -38 -30 -10
3253a0J0qpJ5L1L2K0Qmj5j1QK5J9lk3l1l1j8QK7J9nj6nJ0J0QK4N0N8L8Mk1k2j0JQPnk0k7k0
$$ -10 0 -8 -15 0 31 63 83 91 87 72 61 69 94 113 110 87 56 25 7 15 42 61 56 40 35 45 55 63 87 137 195 233 237 216 194 184 185 193 200 195 175 148 128
3234A28omj3k4k5k2j4MK1K1jj3jJ4Lk0k2MK9L8M0L6J8oj6j0rk1k1KK2J1j8l0k1lJ4L0L2Rj5
$$ 128 122 118 105 81 56 34 20 24 45 66 65 52 51 65 68 48 26 30 59 97 137 173 191 185 169 159 150 129 108 110 132 143 125 95 74 71 85 115 147 156 141
3216A41j1J1K5J6PRJ0NPJ6J6Jj3j7j3j6k0k2k1j8j0PJ7J7Qmk0l0j7J6L3J7j0k3k1j6rQK6K6
$$ 141 130 141 166 182 189 198 208 213 220 236 252 253 240 223 210 194 174 152 131 113 103 110 127 144 152 148 128 98 81 97 130 147 137 114 93 77 68 76 102 128
3199A28Qrj4j3j8j7oQJ2RJ0J9L2L2J3j4l3l0j3MJ1QMJkj1k4l3k8rNO%lkNJ5K6K7J1j5l2l2
$$ 128 136 127 113 100 82 65 59 67 79 88 98 117 149 181 194 180 147 117 104 108 119 127 131 132 130 119 95 62 34 25 30 36 36 33 31 36 51 77 104 115 100 68 36
3180C6k2j0lKQJ7K6K9K3J8J3Nrk4l2l8m0l1rKrk5j5J9M0L4K2J9K2K0J8K5K7J0j7l0k0MK2K7
$$ 36 14 4 1 3 11 28 54 83 106 124 137 142 133 109 77 39 -1 -32 -41 -39 -48 -73 -88 -69 -29 5 27 46 68 88 106 131 158 168 151 121 101 105 127 154
3163A54J5ql0m0l5k6j6mJ1K6M3N3M9K5j5m2m0j3J5K3Rrj8k4l3l4j8J1L1K6Opj0j1qJJ2J3K
$$ 154 169 161 131 91 56 30 14 10 21 47 90 143 192 217 202 160 120 107 122 145 154 145 127 103 70 36 18 29 60 86 92 85 75 64 56 57 69 82 84
3146H4rj0kJ6L1L6K8J2mj9k6k5j5j2j8j9nJ8K6J8Ojpj6k1j6pJJ7L7M4K6pl3l5k4j4nJPJ0J5
$$ 84 75 65 63 79 110 146 174 186 182 163 137 112 97 85 67 48 43 61 87 105 111 110 103 87 66 50 43 44 61 98 142 168 161 128 93 69 55 50 51 58 68 83
3128H3K5L1K5PnOK6K6%k4k8j7j1j2nLjj4j2PK4J7kj4j6j9k1j5jJ2J9K4K6J5nj6oK4N1N4L0
$$ 83 108 139 164 171 166 172 198 224 224 200 172 155 144 132 127 130 129 115 103 110 134 151 149 135 119 100 79 64 63 75 94 118 144 159 154 138 132 156 207 261 291
3110B91mk7l3k9k5k3j9k0k6k4rQRjnNJ2J2RQKj0j5j2j1j6j5LK4K7J2ljJ3K6K7J2j1k9l6l7
$$ 291 287 260 227 198 173 150 131 111 85 61 52 60 69 68 63 68 80 92 101 109 111 101 86 74 63 47 32 35 59 86 98 95 94 107 133 160 172 161 132 96 59
3092E9m0l5j7J6M1M4K5nk1j1J0J7ml0l1oJ9K7L0L7L4J9Kmj0k3k9j5RK0J2MMjj4k1j5j1j6j7
$$ 59 19 -16 -33 -17 24 68 93 88 67 56 66 83 79 49 18 12 31 58 88 125 159 178 180 176 166 143 114 99 108 128 140 144 148 147 133 112 97 86 70 53
3075E3%J6J0j2k2rJ0J9K0K4K6K2J2Lloj1j8k7l2k8j5JJ2J5J1kj9l1k6qJ4K2J6KjJ5L3L4J6
$$ 53 53 69 79 67 45 36 46 65 85 109 135 157 169 172 169 163 152 134 107 75 47 32 33 45 60 71 69 50 19 -7 -15 -1 21 37 39 38 53 86 120 136
3058A36rk3k2j1LJ1Lk2m2m1k1lRJ7K9L7L4K5J7Qok1k5j8j1j2j2JK3L3J8j0k2rPNj3k7k9k1
$$ 136 127 104 82 71 74 85 88 66 24 -17 -38 -41 -32 -15 14 51 85 110 127 135 129 108 83 65 54 42 30 31 54 87 105 95 73 64 71 76 63 36 7 -14
3040a4j1OK6L5K5RMJ1J4Pknnj0j5j4j0nKJ2J6J0pk1k2j0J4M0N3M3J6pj3q%NN%nj3k7m5n8m5
$$ -14 -25 -19 7 42 67 76 80 91 105 112 110 105 100 90 75 61 51 46 48 60 76 86 79 58 36 26 40 80 133 176 192 185 172 164 164 169 174 174 169 156 129 84 26 -19
3021a9j2J4J1j1k3j8oMJ5K4J8MJJ0J5Kj3qRK1K5L2M9N2L1Lj4j4j1rojjoj4j5j0kOJ0QMpk4
$$ -19 -31 -17 -6 -17 -40 -58 -64 -60 -45 -21 -3 1 2 12 27 29 16 8 17 38 63 95 144 196 227 230 216 202 191 182 176 175 174 168 154 139 129 127 133 143 151 155 148 124
3002A24l7l7k0KJ6K9L5K8Jl0m3l6j9kJ1J9K0J6J8K2J6LlRK7K7Kl1m9l8rJ6K1Rpj3oJ4L1L0
$$ 124 87 50 30 32 48 77 112 140 141 111 68 32 13 11 22 41 61 77 95 117 133 136 133 142 169 196 198 167 118 80 71 87 108 117 110 97 91 105 136 166
2985A66J1j0j6j1j4k4k4j0jj2k6k4j0jKLKkJJ9L1J9oj4KJ4J0MPPnj8j6rkQK0K2Jk1j6RK8K4
$$ 166 177 167 151 140 126 102 78 68 67 55 29 5 -5 -6 -4 -1 1 -1 0 19 50 69 63 49 51 65 75 79 86 93 88 70 54 45 43 51 71 93 94 73 57 66 94 118
2966A18J1kj0j0JRLj3k0j6j3j6j4LK2K8K5K0J5Nj2k6k8k4j4KK2L8L8K0jj6j7j3qqpnkkoj6
$$ 118 129 127 117 107 108 117 120 107 87 71 58 42 28 31 53 81 106 126 141 146 134 108 80 56 42 44 66 104 142 162 161 145 128 115 107 99 92 87 85 83 77 61
2948F1k6k0JK5L1K6K1K3K1J5J3J2Pnj6j7j6j9j4NK1K0%j3mJ2J4lk2k5j6j5l1m5l5j1NJlOJ8
$$ 61 35 15 16 41 72 98 119 142 163 178 191 203 210 205 189 172 156 137 123 128 149 169 169 156 152 164 178 175 153 128 112 97 66 21 -14 -25 -20 -19 -22 -16 2
2930BJ9N%PJ5J5J4J5K0K4K8L1K5J4Nmj4k6l1k3j1mjJ%rj4pJ4L2L3K0Nkmqj5k5l3l5k3PL5M2
$$ 2 21 26 26 33 48 63 77 92 112 136 164 195 220 234 239 235 221 195 164 141 130 126 125 126 126 117 103 96 110 142 175 195 200 198 194 186 171 146 113 78 55 62 97 139
2911A39K3ok0k1j4oNJ7K1J5Nrk2k5j8j0j6k4j4J7M4M3K4Mpk1l0k4JK1J8qk8l0j1J2K6K2Kk1
$$ 139 162 156 136 115 101 95 100 117 138 153 158 149 127 102 84 74 58 34 20 37 81 124 148 152 145 124 94 70 71 92 110 102 74 44 33 45 71 93 95 74
2893G4k6pJ9L5L0J8RNK%kqj9l0l2l1k9k2j2JLnj3j3j2k0k9l0j5J2M0N7N6M1J5j5m2m7k2J8
$$ 74 48 41 60 95 125 143 152 157 159 159 157 149 130 100 68 37 8 -14 -26 -25 -22 -27 -40 -53 -65 -85 -114 -144 -159 -147 -107 -50 6 47 62 47 5 -42 -64 -46
2876d6L8K6OkOJ3J0MLOJ0J5K0J9J7J3J2J1Mqj7j6lRRnj7j5%K1L1J5k0n0m4j0K0K1Ploj2j1
$$ -46 -8 18 24 22 28 41 51 55 58 64 74 89 109 128 145 158 170 181 185 177 160 144 141 150 159 154 137 122 122 143 174 189 169 119 75 65 85 106 113 110 104 92 81
2857H1J0L9M9L2J7J9K8K2RLQNj2l3m0l2j8qjJ0J0mk6l7l4k8l2l5k4j1rj7j9kK0L6L8L4K5J8
$$ 81 91 130 179 211 228 247 275 297 306 309 317 322 310 277 237 205 187 179 178 188 198 194 168 131 97 69 37 2 -22 -33 -42 -59 -78 -80 -60 -24 14 48 73 91
2840I1J5J0KojJ1J9J4%j1rOK3K6Qk0l7l7k4qRJ5RJ0K8M8L6om0m3k3JK1K8J8mj1MJ4jk7l3k3
$$ 91 106 116 118 112 111 122 141 155 155 144 135 141 164 190 198 178 141 104 80 72 81 96 105 115 143 191 227 221 181 138 115 116 137 165 183 179 168 172 186 185 158 125 102
2821A02j4j4rLJ2J8K2J9Kj3rOJ1OJ1K7K6kl4m1l2k4j8j4j4k0j9%K8M0L2K3J9J5J3J2J0ml0
$$ 102 88 74 65 68 80 98 120 139 141 128 119 125 136 142 153 180 206 204 170 129 97 73 55 41 27 7 -12 -12 16 56 88 111 130 145 158 170 180 176 146
2805A46m5l7k0qmjNJj0j0PK3K3MrkJ4J9Qj4l7m9m5k7qkj2k4k4oK2M3M6L5K5K6L2K9J7PLKp
$$ 146 101 64 44 36 32 31 36 37 27 17 24 47 70 74 65 63 77 96 104 90 53 4 -41 -68 -76 -78 -90 -114 -138 -144 -122 -79 -33 2 27 53 85 114 131 138 141 143 136
2786A36j7j8j2ojMJmnMJ4J5OnrojPJ0PkqnNJ1Lj6k9k4mJ2J3OPJ9K8J5j5m6n4l8pJ7K8J9Pj
$$ 136 119 101 89 83 82 86 87 83 78 82 96 111 117 112 103 97 96 103 113 120 118 110 105 110 121 124 108 79 55 51 63 76 82 89 108 136 151 136 90 36 -2 -9 8 36 55 62 61
2766F1knqpljrj9j9j2jJ0K1L4L3K3J8K2J9Kj7j6mKlmmk2n4o6m1kK1K0J7J9K4K1J5RkmOK1K4
$$ 61 59 54 46 39 36 35 26 7 -12 -24 -25 -15 6 40 73 96 114 136 155 157 140 124 120 122 119 115 111 89 35 -31 -72 -74 -53 -33 -16 3 27 48 63 72 70 66 72 93 117
2746A17Nj5j9lJ8L0K2Jk3l7l5k0JJ4J2jq%J2J3J2J5J8Qj1j1J1L1K6NqrpmKMpk1j8NK5J8j0
$$ 117 122 107 88 85 103 133 155 156 133 96 61 41 42 56 68 67 59 59 71 84 96 111 129 137 126 115 126 157 183 188 180 171 164 160 162 166 159 138 120 125 150 168 158
2727A58l0l3l0l3l5k4%K1K8L0L3K9J2qj1NJ3kk8l4k0j1k2l5k9oJ1J0NOJ7L0M7N7N1K7nk2k3
$$ 158 128 95 65 32 -3 -27 -27 -6 22 52 85 114 126 118 107 112 125 123 95 61 41 30 8 -27 -56 -62 -51 -41 -36 -30 -13 17 64 121 172 199 194 172 149
2711A49j5j1mPJ3Oj5l7m2l2j1J1K8M0M6M3K6Jj7k2j6rmlqj7j9oJ2J9J2mj6j9j0KPkj0lJ1J5
$$ 149 134 123 119 126 139 145 130 93 51 19 8 19 47 87 133 176 202 203 186 164 148 139 135 132 124 107 88 82 94 113 125 121 105 86 76 78 85 83 73 70 81 96
2692I6QPJ8K1ProRJ6J1ONkj6k9k7k0j2oMJ3J7J7J4QJLJ7K8K3Oj4k3k1j4j0j2k1k6j5OJ9J1
$$ 96 104 111 129 150 157 148 142 151 167 178 184 189 187 171 142 115 95 83 77 81 94 111 128 142 150 151 154 171 199 222 228 214 191 170 156 146 134 113 87 72 78 97 108
2674A08qk2j6JJ7K7K4J3%l%jj5l2l7k9j8j1j0rqoKJ8L3M0L6K5J0kqj1j8k9l1j8KNj2l1l0m
$$ 108 100 78 62 63 80 107 131 144 144 141 141 140 125 93 56 27 9 -2 -12 -21 -29 -35 -33 -15 18 58 94 119 129 127 119 108 90 61 30 12 14 19 7 -24 -54 -58
2655e8L2N7O5N0K1j1l5l1jK7K5ll2l7k7j1J1L8N1L4MpMPqk3j5KPlj0jJ6K3K1J0mk0l5m1l2
$$ -58 -26 31 96 146 167 156 121 90 89 116 141 138 106 69 42 31 42 80 131 165 169 162 166 173 165 142 127 129 136 133 123 122 138 161 182 192 188 168 133 92 60
2638F0j2J2J9J0%kLPOQJ0Mj3l0l8k9nJ9K6Rj4k4j9pJ1L1M5L8J1j3j3jjk0l5k0J1L2K1pk2j2
$$ 60 48 60 79 89 89 87 90 97 103 111 121 125 112 82 44 15 10 29 55 64 50 26 7 0 11 42 87 125 136 123 110 109 108 88 53 33 44 76 97 90 68 56
2619E6PJ5J2PRPpk4k7rJ2K2K3K4K5J3rk5k3rJOJ4K4K6K1K0L0L0J4oj0qj9m6o5o3m6k6j0OJ8
$$ 56 63 78 90 97 106 113 106 82 55 46 58 80 103 127 152 165 156 131 108 99 100 106 120 144 170 191 211 241 271 285 279 269 261 242 196 131 68 22 -4 -14 -8 10
2601A0J9J1LMJ1K2K5K3K2K4K1Mj6k1j4qj2k3l1l0j5J0K8K0rl0k2%QJpmMMjnlPK1K9K6J9J8
$$ 10 29 40 43 47 58 80 105 128 150 174 195 199 183 162 148 140 128 105 74 44 29 39 67 87 78 48 26 26 34 35 28 24 28 32 31 26 23 30 51 80 106 125 143
2583A43K3J8lk6l4k1JJ5J5PJ%loqlJkpnjnj8k5j9nRJ8J7PorjOJ0J2J6J0j1k7k1%J3QMJ3K4
$$ 143 166 184 181 155 121 100 101 116 131 138 139 139 136 130 122 119 120 118 111 106 105 100 82 57 38 33 42 60 77 84 78 69 68 74 84 96 112 122 111 84 63 63 76 84 88 101 125
2562A25J9RMN%j7k6j7LRlj9k3j6lJ0J3Lj4k1nK4M7N2M1J9ok2j5J6M1M0J4j2k3k6k3j1NRnl0
$$ 125 144 153 157 162 162 145 119 102 105 114 111 92 69 53 50 60 73 76 62 41 36 60 107 159 200 219 213 191 176 192 233 273 287 275 252 226 203 192 197 206 201 171
2544A71m7n0m2k6pKRJ9L4M0L4K7K4J6lk4l1k2j7j3LK8L2Rj8k9k5k6k8j8OK4K4J1LMRJ2Ppj9
$$ 171 124 74 32 6 -1 1 10 29 63 103 137 164 188 204 201 177 146 124 107 94 97 125 157 166 148 119 94 68 40 22 28 52 76 87 90 94 103 115 122 115 96
2526I6k3j4LK1L5K8Mk5k9qJ9K6J5mj4j1jRJ4J2Nj1l0l9k6jJ5J7J8K7K8J2rj8j5j3j0kRPpj7
$$ 96 73 59 62 83 118 146 150 125 96 88 107 133 148 144 130 119 118 127 141 153 158 147 117 78 52 51 66 83 101 128 156 168 159 141 126 113 103 101 110 117 110 93
2508I3j4qqkJ4K7K0nk4k7k3j5lJ0J8J9K3K9L2K4J1LLQQjj6k7k4j1j%%RJ7Lk6m5l5pQkj3qP
$$ 93 79 71 63 61 75 102 122 117 93 66 43 28 25 35 53 72 95 124 156 180 191 194 197 205 213 212 196 169 145 134 133 133 133 142 159 162 136 91 56 49 57 55 42 34 41
2489D1J3J2J0J0Kj7k6pK4L8J8rj8j1pj5j3J3M8N9M2J3j0k5l2l2k0KJ5J4kj9k1lK5L8L4K4K2
$$ 41 54 66 76 86 88 71 45 38 62 100 118 109 91 80 73 58 45 58 106 165 207 220 210 185 153 121 101 103 118 132 130 111 90 87 112 150 184 208 230
2472B30K7K3Pj0j8k1k5l2k8j0J9L5K0j1l8m4l5k2nJ2J9J4Mkok2l8l5j5KNMJLOJ6K7L2K8K7
$$ 230 257 280 287 277 259 238 213 181 153 143 162 197 217 206 168 124 89 67 62 74 93 107 111 109 103 81 43 8 -7 -5 0 4 5 8 14 30 57 89 117 144
2454A44K7J8KoLJ0Lj3j7j0lJLjk1m7n9m8k3%J1J3RNKnrOL5N3L8J4QR%j5j3LRlj5j2pqoNQp
$$ 144 171 189 191 185 188 198 201 188 171 161 158 159 162 161 140 93 34 -14 -37 -37 -26 -13 -4 1 3 -2 -11 -5 30 83 121 135 143 152 152 137 124 127 136 133 118 106 99 91 85 90 98 91
2434I1k6k9k1j5j2kQOOJ2J7R%NJ5J1nj1KJ1Ooj1nRK7L0Pk7l7j4J5K7K2J3Npj9j9qJ0K6K8J1
$$ 91 65 36 15 0 -12 -14 -6 0 6 18 35 44 44 49 64 75 70 59 61 72 78 72 61 56 65 92 122 129 102 65 51 66 93 115 128 133 126 107 88 80 90 116 144 155
2414A55j5k2rQRjnkJ%kl%OJ0Kj6k6k0qlOK4L5J8j5k9j5lj0k3k5j4mLPPLNK0L3K8J7J2J1j1
$$ 155 140 118 109 117 126 125 120 118 119 119 117 114 114 120 130 132 116 90 70 62 59 65 89 124 142 127 98 83 80 70 47 22 8 4 7 14 21 24 29 49 82 110 127 139 150 139
2394A39m7o5l4J5M6L5J1MJ2J1nj7j7omj1j9j8%L0N1M8J8j6k9k0jJ0J3Kj8l4l3k2j7j8j6kJ5
$$ 139 92 27 -7 8 54 89 100 104 116 127 122 105 88 82 78 67 48 30 30 60 111 159 177 161 132 112 111 121 134 136 118 84 51 29 12 -6 -22 -24 -9
2378iK5K9L1L3K6J5Llolj%jk%KKKNNlqkRPj6l8l7j5NMj1k3j8jJ4J8Qnj0JK1M0M4L7K6J2kj4
$$ -9 16 45 76 109 135 150 153 150 144 141 140 140 139 137 137 139 141 143 148 153 150 142 140 149 156 140 102 65 50 55 59 48 25 7 6 20 38 46 41 31 32 53 93 137 174 200 212 210 196
2356A96j8j4porrmJmj1qNJ3Mk1l7l2j2jpk0k7j0J7L3K6ROK2K9Qk8m8m1k1KJ9K2J4Kqj8k6l0
$$ 196 178 164 157 151 142 133 129 130 126 115 107 112 125 129 108 71 39 27 26 19 -1 -28 -38 -21 12 38 47 53 75 104 112 84 36 -5 -26 -24 -5 17 31 33 25 7 -19 -49
2337d9j4QJ3KoNK4L2K8J8QJLJ2J6R%%OMpj7k1k0j3jJ2K2L0L1J7j1l3l5k7k5k5j7JJ4K2L2M1
$$ -49 -63 -55 -42 -40 -46 -41 -17 15 43 61 69 70 73 85 101 110 110 110 116 120 113 96 75 55 42 41 53 75 105 136 153 142 109 74 47 22 -3 -20 -19 -5 17 49 90
2319I0L9K8K5K0ll0l1mJ5Kj9j8MJ3PLJ2J5jk1l4k9j3LKk3m7l0J3M0K4j2k2LL1L7K5J1OOJ0
$$ 90 129 157 182 202 199 169 138 134 149 151 132 114 118 131 138 141 153 168 167 146 112 83 70 73 75 52 5 -25 -12 28 52 40 18 21 52 89 114 125 131 137 147
2301A47J3Rkj5k5k9k5j7j5j9k5k8k5j9j1LJ7K5K2J8K4L7M3L5K1J1jj2j9j7j5k5l6k6QL5K8
$$ 147 160 169 167 152 127 98 73 56 41 22 -3 -31 -56 -75 -86 -83 -66 -41 -19 -1 23 60 103 138 159 170 169 157 138 121 106 81 45 19 27 62 90
2285I0Kr%lk5l6rL2L9Rj7j4NJ4J1Njj0rOK2J8%rlQJ2J1Kj1k6l3l3l7l5j6J4L5L2J8jj8k1l
$$ 90 92 83 83 80 55 19 10 42 81 90 73 59 64 78 89 94 93 83 74 80 102 120 120 111 108 116 128 139 141 130 104 71 38 1 -34 -50 -36 -1 31 49 48 30 9 6
2266FJ8J5j3k9j2J9L3K3J2RPJ0K2L5L5K8K8K6Lk7m1k9j8k5l6k9kK5L3J9qk7k4j1j0k3k4kK5
$$ 6 24 39 26 -3 -15 4 37 60 72 81 88 98 120 155 190 218 246 272 275 248 207 178 160 135 99 70 68 93 126 145 137 110 86 75 65 42 18 16 41
2249D1L6K4Mj9l5l4j7jKKLJ%OJ2Lj5j3K0N6O0M1K5J0j7m2l7pNj6m6n2l5j3JNMRK6L7K7%j6
$$ 41 77 101 105 86 51 17 0 -1 1 3 6 7 7 13 25 28 13 0 20 76 136 177 202 212 195 153 116 109 114 98 52 0 -35 -48 -47 -42 -38 -29 -3 34 61 61 45
2230D5j7j7j7nJ9L1K1J2J7K2J4NJ4K7K0nk9l5l4l0k3j3kRJ6J0oj2PL2L3J6KMQMjmj8m2n2l6
$$ 45 28 11 -6 -11 8 39 60 72 89 111 125 130 144 171 191 186 157 122 88 58 35 22 20 29 45 55 49 37 44 76 109 125 127 131 139 143 142 138 120 78 26 -10
2212a0pJ9L4L6K6Prj4j6k1k1rJ6L2L4K0Lj2k4k7j9oPJ8K3K2J3%j0j2j0j2j2q%MLMJ1J9K5L0
$$ -10 -17 2 36 72 98 105 96 82 66 45 24 15 31 63 97 117 120 108 84 57 38 32 39 57 80 102 115 115 105 93 83 71 59 51 51 55 58 62 73 92 117 147
2194A47L1J8j0l3l8k2%J1Pj3l3m0k5kJ7L1K8Rj4j7PK7J3k0l2j8loj3pLRJ1J0kk7m1k9lJ3J5
$$ 147 178 196 186 153 115 93 93 104 111 98 65 25 0 -2 15 46 74 83 69 52 59 86 99 79 47 29 26 20 7 0 3 12 23 33 31 4 -37 -66 -69 -56 -41
2176d1J7K2K7K9K5J4Jol%qj5qJ1L0L7L0Ok6m8m7k3QL1M7M6K4mk0j8j1j4k0k3j9pMNrk4k3m
$$ -41 -24 -2 25 54 79 93 94 88 85 85 77 62 54 65 95 132 162 168 142 94 47 24 32 63 110 156 180 176 156 138 127 113 93 70 51 44 48 53 44 20 -3 -7
2158gJ6K5K1J7J8J4OkNK4M2M0K0rk7l2k8j8jJ4K0J2lj8k5j9o%oj1o%pj6j0J6L6M2L5J5j7m1
$$ -7 9 34 55 72 90 104 110 108 113 137 179 219 239 230 203 171 143 125 124 138 158 170 167 149 124 105 99 99 93 82 76 76 69 53 43 59 95 137 172 187 170 129
2140A29l3JK2J2lPK6K4om1o3o3l9lK6L5L9M9N4L4ok9k2pMJ1J6Nj9l1j8KP%JJ3J7J0Kjklln
$$ 129 96 97 119 131 128 135 161 185 179 138 75 12 -27 -30 -4 31 70 119 173 207 201 172 150 143 147 158 174 179 160 129 111 113 120 120 121 134 151 161 163 162 160 157 154 149
2121A49j6k8l2k2pJ1K6L1K1MkNJ0Noj4rMJ7J5mk6l0j5llj1j3rJJ6K4J7KkJ7L7L2Mk0k1oJ3
$$ 149 133 105 73 51 44 55 81 112 133 137 135 140 150 155 149 135 126 130 147 162 158 132 102 87 84 81 70 57 48 49 65 89 106 108 106 123 160 192 196 176 155 149 162
2102A62K7L5L5L2K7J1j4l9m3l3k3k3k5j8oJNJ0J4Mj8l8m1k2MK1K1QJLLlnNJ7J5kj5qJ1K3K1
$$ 162 189 224 259 291 318 329 315 276 233 200 177 154 129 111 105 106 111 121 135 139 121 83 42 20 24 45 66 74 75 78 81 78 73 78 95 110 108 93 85 96 119 140
2084A40QKRK5L0J8pk0j5mJmqqj0j4j7j4jJ0J0%qnKLnrJJ0J1Krj7j8j1%%j0k1j8rrj2JK8L6
$$ 140 148 150 159 184 214 232 225 205 190 186 187 183 175 167 157 143 126 112 111 121 131 131 123 118 120 123 118 109 110 120 131 133 124 107 89 78 78 78 68 47 29 20 11 -1 0 28 64
2063F4Qk4k0J6M7M7K1ok2k3qJ0K1J9J0mj5j1J3M1M2J3j2oJ5J3j4l3k2NK1J6kk3m6n7m6k2L
$$ 64 72 48 28 44 91 138 159 153 131 108 100 110 131 150 160 156 141 130 143 184 226 239 227 221 236 249 235 202 180 185 206 222 220 197 151 94 48 26 29
2046B9J3J3J5K1L2L5K7J3jj2k5l2j8J4L4K1nj3plqkK0L2J4j3k1j2k%RJ8J2qk2j6orj2JK9L9
$$ 29 42 55 70 91 123 158 185 198 197 185 160 128 110 124 158 179 174 161 154 151 143 141 161 193 207 194 173 161 159 159 168 186 198 190 168 152 146 137 125 126 155 194
2028A94J4l0n9o2m6k4jK2L8L1QlPK2K0jj7j9j0omKJ9L3L2J5pk1k4k5k7j9MK7K7Jk6k8pJ5K3
$$ 194 208 178 119 57 11 -13 -14 8 46 77 85 82 89 111 131 130 113 94 84 78 74 76 95 128 160 175 168 147 123 98 71 52 56 83 110 111 85 57 50 65 88
2010H8J9J6J4Qkonlpj3j1mOQMlj0j0jJ2J8J1kj3k4l2l0j8oj2l3l8j9J5L7L7K1Nqj1j0nLJ1
$$ 88 107 123 137 145 143 137 132 129 122 109 98 94 100 108 112 109 99 89 88 100 118 129 127 114 90 58 28 10 4 -8 -41 -79 -98 -83 -46 -9 12 17 9 -2 -12 -17 -14 -3
1991cJ4RKJ3M4O2M2kk9k4rrj8j5j%j5k3nK5L4J6nj2oKOJ5K4J9Kj2qNNjnjjnlJ1K0J4krNK1
$$ -3 11 20 22 35 79 141 183 181 152 128 119 110 92 77 76 76 61 38 33 58 92 108 103 91 85 87 93 108 132 151 153 141 133 138 143 142 137 136 135 130 127 138 158 172 170 161 166 187
1971A87K7J6kj8k8l0k4pJ3K2J4oj7j1JLj1k1j2J2K8K1Kj6j8j0lNJ0J5J1Moj9l3m2l2nK1L0
$$ 187 214 230 228 210 182 152 128 121 134 156 170 164 147 136 137 140 129 108 96 108 136 157 159 143 125 115 112 117 127 142 153 157 151 132 99 57 25 20 41 71
1953G1K1Oj0k1j9oORJ0J1Pj3l4l3j3NJ0J6K6K7J1j2k0j3mOJ7L2M0L2J7Kmqj0rjKmk0l0k5j0
$$ 71 92 98 88 67 48 42 48 57 67 78 85 72 38 5 -8 -3 7 23 49 76 87 75 55 42 38 44 61 93 133 165 182 184 180 172 162 153 152 154 150 130 100 75 65
1935F5JKMO%rj3mjj0j4jJ2kk9l7j2J7L0L5M5M9L2R%L%j5j8qKKLJ3K0J1mj4j4j1qqj3k7m0l8
$$ 65 66 68 72 78 78 69 56 52 51 41 27 26 38 36 7 -30 -42 -25 5 40 85 134 166 175 175 178 178 163 145 137 139 141 144 157 177 188 184 170 156 145 137 129 116 89 49 11
1915A1k2mJ1J9J7PloKRJ2RJ0J3J6J4OKJ1K3J9qk9k2%Pj1l0l3k2pQK1K0%k2l4l7l2j1K7N3M7
$$ 11 -11 -15 -4 15 32 39 36 30 32 41 53 62 72 85 101 115 121 123 134 157 176 168 139 117 117 124 113 83 50 28 21 29 50 70 70 48 14 -23 -55 -66 -39 14 61
1896F1J3j6k4k2j6j1pj0k0k1nJ1J8J9K4K4J4pj8j3kPJ2J6J9K3K8K9K2Mj6k9l3l2k8j8mJ3K9
$$ 61 74 58 34 12 -4 -15 -22 -32 -52 -73 -78 -67 -49 -30 -6 18 32 25 7 -6 -8 -1 11 27 46 69 97 126 148 152 136 107 74 42 14 -4 -8 5 34
1879C4M0M4M2K9Prj7k0k8l1j4K0M2L8J4lopqj1rmMJ7L0L5K8J3ok4k5oJ3Qj9m3m4k9j3LJ7K3
$$ 34 74 118 160 189 196 187 170 150 122 91 77 97 139 177 191 188 182 175 167 156 147 143 147 164 194 229 257 270 264 240 215 209 222 230 211 168 124 95 82 85 102 125
1861A25J3nj1n%j%J2K8L5K7Mk1l3k3mJ3K4L6M5L5J6jj0k7m6m4j6Mrl7l7oK2K4Pj0k6l5l0n
$$ 125 138 133 122 117 117 116 116 128 156 191 218 222 201 168 145 141 154 178 214 259 294 310 309 299 272 226 182 166 170 161 124 87 81 103 127 134 124 98 63 33 28
1843B8J7K0Mrj0nKJnj1rLJ4J1OJ3K6L1K0RJ0J3Nj3k7l0k4j3kNNjlNJ9K8K3J2Kloj5k2j9lJ3
$$ 28 45 65 69 60 50 45 47 48 43 32 23 26 40 51 57 70 96 127 147 156 166 179 184 171 144 114 90 77 75 80 85 84 81 86 105 133 156 168 170 167 161 146 124 105 102 115
1823A15J8J0LLRJ1Mnj0nPJ6J5NkjKnk2l6l2j4MJ2J3J4Pqk3k7j6MK3L8L9J6j8l8k3NJ9Qqj1
$$ 115 133 143 146 149 158 169 173 168 158 153 160 176 191 196 194 193 195 190 168 132 100 86 90 102 115 129 136 128 105 78 62 66 89 127 166 182 164 126 103 108 127 135 127 116
1804A16JJ3J1jj4j5j2rj3j2mOPM%knplLPMmj2j2MK4L3J9Jolmj3j7j1ooj0roKJ3K5K6J7J2J5
$$ 116 117 130 141 140 126 111 99 90 77 65 61 67 74 78 78 76 71 64 61 64 71 75 71 59 47 51 75 108 127 128 122 119 115 102 85 74 68 62 52 43 37 39 52 77 103 120 132 147
1783A47J6NokJ0J4Pnj1qNK8M4K9j7o4q0n4nL7M7K9Onlmj5k5l0k4kK9M8L0j3m5m1j8oj0j7j3
$$ 147 163 168 162 160 170 184 191 186 175 167 172 200 244 273 256 192 112 58 53 90 137 166 172 167 164 160 145 120 90 66 64 93 141 171 158 113 72 54 48 38 21 8
1765HjJ1K2K2J4MNJ4K4L0K6J2oj6j6j3k1l3l2k2j1ojJ5K9K8Qj1j9j7r%J2K1J9Oqj6j4qLJ7
$$ 8 7 18 40 62 76 80 85 99 123 153 179 191 185 169 153 140 119 86 54 32 21 15 14 29 58 86 94 83 64 47 38 38 50 71 90 96 88 72 58 50 53 70
1747G0K7K8K3J8Roj7j5jNjj5k2k5k8k5j4nnj1oJ1K2K6J8Mj3k4j8%J5J6Jj2j6j0lnj1oJ3K8
$$ 70 97 125 148 166 175 169 152 137 136 141 140 125 103 78 50 25 11 6 1 -10 -16 -5 17 43 61 65 52 28 10 10 25 41 42 30 14 4 1 -4 -15 -21 -8 20
1729B0K1%qLJ5J4J0RLj3k1j1Llj9j8KJ4jk1k2kJ8K5L1M3N1M6K7Lj5k0qOPqk1j5LJ4J5J4J4
$$ 20 41 41 33 36 51 65 75 84 87 74 53 42 45 42 23 5 7 21 20 -1 -23 -25 -7 18 49 92 143 189 216 219 204 184 176 182 189 181 160 145 148 162 177 191 205
1710B05J1PLmj7k8k0MJ8Kk5l3j4QJ6J2RPOnk0k9k2mJ0RKlnqJK4L9J9k0m2l2j1%NJ8K6J5nj1
$$ 205 216 223 226 222 205 177 157 161 179 181 156 123 109 117 133 145 154 161 167 162 142 113 91 87 97 106 108 105 100 92 93 117 156 175 155 113 81 70 70 75 93 119 134 129 118
1691A18pj6l5m0j9RJ5MlJ1L3M1K3rk9j8OJ5%k5l2j0K9N7N9M0J5nk4l2k2J2M7N5L7Qj6l2m1
$$ 118 111 95 60 20 1 10 25 29 26 37 70 111 134 125 96 78 84 99 99 74 42 32 61 118 177 217 232 227 203 171 149 161 208 263 300 308 292 260 219
1674B19l8l1k6k5j8lQNlqrj4j8j1MJ5K3K7K4Mk4m1l9k2rJ0L9O4N4Rl4m2j9pj6k7j5J2K3J5
$$ 219 181 150 124 99 81 78 86 91 88 80 71 57 39 28 32 47 70 97 121 125 101 60 21 -1 -10 0 39 103 157 166 132 90 71 64 48 21 6 18 41 56
1656E6Kmrj2lJ7L0K5Rnj4j9j9j0MJ0RJ0J1J0LKJ2K8M0M0K7Nj5k3j8rpj4k1k3j7j3j8k0lL2
$$ 56 58 54 45 33 30 47 77 102 111 106 92 73 54 44 48 58 67 77 88 98 101 103 115 143 183 223 250 255 240 217 199 190 183 169 148 125 108 95 77 57 54 86
1638H6O2N6J9j9l1k0j0j5k0pK1M5M1J4j6l0l3l0k2nJ4J4lj7j5kRJ2QKlnqj5k5k4jL0M1K3%
$$ 86 148 204 223 204 173 153 143 128 108 101 122 167 208 222 206 176 143 113 91 86 100 114 111 94 79 77 86 98 106 108 105 100 92 77 52 28 27 57 98 121 121
1620A21kJ6L3L1Rj9l4k4NK9L1J4nj6k3k8k5j6j0j0j0lRJ9K3K1RopPJ8Pj7k9k2j3pOK4L4K1
$$ 121 119 135 168 199 208 189 155 131 136 165 196 210 205 189 166 138 113 97 87 77 67 64 73 92 115 136 145 139 132 139 157 164 147 118 96 83 76 82 106 140 161
1603A61O%jqj4mJ5K3J6J2K0L1L5K6J0pk4l4l4k9k0rmj2k7l2k0mMkmLJ7K0Mj8k6j0J3K1Ror
$$ 161 167 167 166 158 144 140 155 178 194 206 226 257 292 318 328 321 297 263 229 200 180 171 167 155 128 96 76 72 76 74 70 73 90 110 114 96 70 60 73 94 103 97 88
1584H8%J0J0%j0j2o%krj0prk1k9k7j4ppkJ1K4K4J5RJ5K4J9QOK0K7J3j0k0qLKnrj6k7l3k2j
$$ 88 88 98 108 108 98 86 80 80 78 69 59 52 43 22 -7 -34 -48 -55 -62 -64 -53 -29 -5 10 19 34 58 77 85 91 111 138 151 141 121 113 116 118 113 104 88 61 28 6 5
1564EJ7K6K6J6lj1%J5J9J2J0J3J0MRL1M4K6j5m4l9j4PJ0NLLJoj0rqnjNOMPK3M0L1Jl0m3l6
$$ 5 22 48 74 90 87 76 76 91 110 122 132 145 155 159 168 199 243 269 254 210 171 157 164 174 179 182 185 186 180 170 161 153 148 147 152 158 162 169 192 232 263 264 234 191 155
1545A55k1nRJ2J2J5K5K6J0j4k4j9j5k7l5k1LJ4%j5j7o%KLMJj1k1k2j8rnoj3j7pJ2K9L6M7N4
$$ 155 134 129 138 150 162 177 202 228 238 224 200 181 166 139 104 83 86 100 100 85 68 62 62 64 67 71 72 61 40 18 0 -9 -14 -20 -33 -50 -57 -45 -16 20 67 121
1527A21N1L3J1jj0k0k6k1nOJ1QJj1k0k5l3l8l1pRJ4K2M3N5L1j7m3l3j3oJJ3J3j2l9l3lJ8J9
$$ 121 172 205 216 215 205 185 159 138 133 139 150 158 159 148 128 103 70 32 1 -6 3 17 39 82 137 168 151 108 75 62 56 57 70 83 71 32 -1 -4 14 33
1509C3J1J0J4J4J0LmnkKKKkj1j6j0OJ2mk3k4j2nnlOJ6K6L6L9J9j3l2k9j8j5j7j2MK5M0M1K1
$$ 33 44 54 68 82 92 95 91 86 84 86 88 90 88 77 61 51 57 69 65 42 18 6 1 -4 -7 -1 15 41 77 116 135 122 90 61 43 28 11 -1 3 28 68 109 130
1491A30j0l3l6k5qNJ3J0KkloqpllomNJ3J2MjLJ4K5K5J4jnJO%j3k4k4j1J0K1Nk3l0%M0M8K3
$$ 130 120 87 51 26 18 23 36 46 48 46 43 37 29 22 19 16 10 6 11 24 36 40 39 42 56 81 106 120 119 114 115 121 121 108 84 60 49 59 80 85 62 32 32 72 120 143
1471A43mj2j0j5k4k6j5lQK1L8M1K3%mQJ1lj5qOPj0k5l0k3pJ5K6J4pj6lJ1J3Lqj6j6jJ6J8M
$$ 143 139 127 117 102 78 52 37 34 42 63 101 142 165 165 161 169 180 177 162 154 160 167 157 132 102 79 72 87 113 127 120 104 101 112 125 128 120 104 88 87 103 121 125
1452A25qrqj5j8j0LJ2K1L4M7N2M8K8j3n7p3n3k4j4j5j3prnJ1K7K3PQJ8J9RJMKlJJ2J3jj5k1
$$ 125 117 108 100 85 67 57 60 72 93 127 174 226 274 302 289 232 159 106 82 68 53 40 33 24 19 30 57 80 87 95 113 132 141 142 146 148 145 146 158 171 170 155 134
1433A34l0l4k6oMnrOK7L6L2J8j0m2m8j5K1K8J3RK3K7J1j4k2rJ1J6kk9m0j8J6L2K6J2Njj0k4
$$ 134 104 70 44 38 42 37 28 34 61 97 129 147 137 95 47 32 53 81 94 103 126 153 164 150 128 119 130 146 144 115 75 57 73 105 131 143 148 147 137 113
1416A13l6l8k4oJrj6mK4M2M0K3OkLK0L5L4J7mj8k5k4j5mqk5l7k7jJ6J7PJjkpj5j9j3KJ6K3
$$ 113 77 39 15 9 10 1 -15 -19 5 47 87 110 116 114 117 137 172 206 223 219 201 176 152 137 133 125 100 63 36 35 51 68 75 76 75 73 66 51 32 19 21 37 60
1397F0J3joKJ1J0kqlKOOJj0j7oJ1J4jj5j5j2j0jJ6K7K3J4J3J2Kp%J4K2J9J2mk3k9k1r%J2K7
$$ 60 73 72 66 68 79 89 87 79 76 78 84 90 91 81 64 58 69 83 82 67 52 40 30 29 45 72 95 109 122 134 136 129 129 143 165 184 196 192 169 140 119 110 110 122 149
1378A49K9J6J5K9K5nk1J0M7O0P6J32K04K83M50P24Q90O49J3o17q55p10m72l18k16j10m0l7
$$ 149 178 194 209 238 263 258 237 247 294 354 430 562 766 1049 1499 2223 3113 3762 3775 3158 2303 1593 1121 803 587 477 437 400
1366D00m9l0prj7NL1K8Nj2k4l7l6j3J3J6Mll%LPll1n3m5j5J2K5K5J4JLK0K8J0j4j6JPoj9k1
$$ 400 351 321 314 305 288 293 324 352 357 345 321 284 248 235 248 264 268 265 262 262 265 272 269 238 185 140 125 137 162 187 201 202 205 225 253 263 249 233 234 241 235 216 195
1347A95j9j9j2LOrk0j2MOmj0ppj0j3j2qlLQPOJ2K2K0Jj9k1jJ9K3J1mj2j3j0kOJ7L1L4J4k2
$$ 195 176 157 145 148 154 145 125 113 117 123 119 109 102 95 85 72 60 52 49 52 60 67 73 85 107 127 128 109 88 87 106 129 140 136 124 111 101 99 105 122 153 187 201 179
1328A79m8m5k0JMoj3j2JJ7K9K3Ppj1o%NN%kPJ6RpnJ9L7K2pk0j8k1l6m2k4PK8L1J5mj5j0jm
$$ 179 131 86 66 67 71 65 52 40 41 58 87 110 117 110 99 93 93 98 103 103 101 108 124 133 126 121 140 177 199 192 172 154 133 97 55 31 38 66 97 112 108 93 83 82 78
1309G8k1l8l3j5JJkJ2L7N5M3J3onkj0j8j3JPKJRJ5J0LJkj3k6k9j6LJ0Jo%J7K8K3J0K%OJ1M
$$ 78 57 19 -14 -29 -28 -27 -29 -17 20 75 118 131 125 120 118 108 90 77 78 85 87 88 97 112 122 125 126 124 111 85 56 40 43 53 54 48 48 65 93 116 126 128 128 134 145 149
1289A49k2n3o4m4j9jJ2L1M2L5J2MK1L5K2j1m0m2k4KJ4Mj8k5j1J4L1K8Pj7k5rJ5K7K0Pmj1k0
$$ 149 127 74 10 -34 -53 -54 -42 -11 31 66 78 82 103 138 160 149 109 67 43 45 59 63 45 20 9 23 54 82 89 72 47 38 53 80 100 107 103 92 72
1272G2k7k4qK2N5O6M1Lj3%J3%j9rK0L0Pk4l8l1k0j0llqj1lJ9M4N7M7J5j9l7l2j7j0rj1q%J1
$$ 72 45 21 13 35 90 156 197 200 187 187 200 200 181 172 192 222 229 205 167 136 116 106 103 100 92 81 78 97 141 198 245 260 241 204 172 155 145 136 125 117 117 128
1254A28J2jj5j1PK1J5KjRJ7J8J9K1J5mk3k9k6k4k4j8okoj1kJ2J7J5J4K2K8J2j5l0k7j4j1q
$$ 128 140 139 124 113 120 141 156 158 157 166 183 201 220 241 256 252 229 200 174 150 126 108 102 100 94 83 81 93 110 125 139 161 189 201 186 156 129 115 104 96
1236I6%Nlj6j5jLnj0KJ7J3joklokOKj1j6qlnjJ1J5PMJ5K1Mj5j2OJ0qk5k8k5j9nOMrrRK3K5
$$ 96 96 101 98 82 67 66 69 64 54 56 73 86 85 79 77 74 68 66 72 74 63 47 39 36 31 30 41 56 63 67 82 103 107 92 80 86 96 88 63 35 10 -9 -14 -8 -4 -13 -22 -13 10 35
1215C5K5K6J8jj2%J7J6PRK1K4Pj6k4j9j2r%J4K8K6J1jjkj0j6oM%j7j9kJ3J0MJkj5k7k3j7j7
$$ 35 60 86 104 103 91 91 108 124 131 140 161 185 192 176 152 133 121 112 112 126 154 180 191 190 189 187 177 161 155 159 159 142 123 121 134 144 148 149 147 132 105 82 65 48
1195D8j9j5rmQK3K2lk1j4KJoQL6M2K3J1J4Ok3l5qK8L1J1MJ8K2Mj6j9j2j1j9k8k4rKJprJJ4
$$ 48 29 14 5 1 9 32 54 51 30 16 18 19 13 21 57 99 122 133 147 153 130 95 87 115 146 157 161 179 201 205 189 170 158 147 128 100 76 67 69 70 63 54 55 69
1176F9J6QKKLrk6l8l1j3MJ6K7K9J9OJ2L5M8K6rk7k2j8k1j7jJ1Pkm%LJ2K2K2J1joj3k6k9j3
$$ 69 85 93 95 97 100 91 65 27 -4 -17 -13 3 30 59 78 84 96 131 179 205 196 169 147 129 108 91 90 101 108 106 102 102 105 117 139 161 172 171 165 152 126 97 84
1158H4MNKJ0K1J6jnJ1K1J0j2k3k6k5k0nJ0K1K0J1jrnQK1K6K1Qj0k7l1k1lJ2J3ql1l1%L5M0
$$ 84 88 93 95 105 126 142 141 136 147 168 178 166 143 117 92 72 67 77 98 118 129 128 119 114 122 143 169 190 198 188 161 130 109 106 118 131 123 92 61 61 96 136
1140A36J8lqj0k6m2l8j3J4L3L9L2Pk5m1k7lRLKJ3J6lk7k8jK4K3J1LJoj4j1PK5K8J5pj8qJ4
$$ 136 154 151 143 133 107 65 27 14 28 61 100 132 139 114 73 46 43 52 55 57 70 86 83 56 28 27 51 74 85 88 89 83 69 58 65 90 118 133 126 108 100 114
1121A14J6jj2OL3K8mk9l1k8l3k9%L3M1K6Omj1j7j1QK4K0LqlKoj8rK1M6M7L7L9L7J6k2m5m5
$$ 114 130 129 117 123 156 184 180 151 120 92 59 30 30 63 104 130 136 132 121 104 93 101 125 145 148 140 137 139 133 115 106 127 173 220 257 296 333 349 327 282 237
1104B37m1m2k8LK0Nk5l1qQOlnnj3k8l2k1jJ9L7N1N3L8J3nnOMj4k5j8kNjnl%%%npKK2L8L0P
$$ 237 196 154 126 129 149 154 129 98 90 98 104 101 96 91 78 50 18 -3 -4 15 52 103 156 194 207 202 197 203 207 193 168 150 148 153 152 147 144 144 144 144 139 132 134 156 194 224 231
1083B31j2j7k1k9l3k6qJ2L1M3L9J5rj4mLqk4k5j2%Jkkpk1l7m2k9j0J0K9M2L4Pj6j3QK3J4j2
$$ 231 219 202 181 152 119 93 85 97 128 171 210 225 216 202 198 201 193 169 144 132 132 133 131 129 122 101 64 22 -7 -17 -7 22 64 98 105 89 76 84 107 121 109
1065A09l4l6qK9M8L6J0j0qLJ8K6K2Jk2l0k4j4j0lOJ2J5J9K1J5Krp%KOJ1J2jk3l8l8k9k1j3
$$ 109 75 39 31 60 108 144 154 144 136 139 157 183 205 206 184 154 130 116 106 103 109 121 136 155 176 191 193 184 177 177 179 185 196 208 207 184 146 108 79 58 45
1048D5JK5M8N0L1J0LNKj1k0k3l0m5n0l7j2PJ5K2K4J8QJPJ9K7K0Jj4j5o%kmjMPONkj5k4k0q
$$ 45 46 71 119 169 200 210 213 218 220 209 189 166 136 91 41 4 -8 -1 14 36 60 78 86 87 94 113 140 160 161 147 132 126 126 124 120 119 123 130 136 141 139 124 100 80 72
1028G2lnpJJ1J7J5Onj4j2JJ6J5lk1j4J3L6L0Jk7l1j9qpj4j8j1NK4K7J4j1k7k8j5PK7L4K7J0
$$ 72 69 64 57 58 69 86 101 107 102 88 76 77 93 108 105 84 70 83 119 149 150 123 92 73 65 58 44 26 15 20 44 71 85 74 47 19 4 11 38 72 99 109
1010A09lj0j9l3m1l1j1QJ5J6J8K0J7J4J6J5jk5l6j9RK1J2KNNnj8j5nqk3k5MM6O5M9K1PRJ4
$$ 109 106 96 77 44 3 -28 -39 -31 -16 0 18 38 55 69 85 100 99 74 38 19 28 49 61 63 68 73 68 50 35 30 22 -1 -26 -22 24 89 138 159 166 175 189
992A89J5J5J2QJnrj4k3k9k7j7lMMok2k9k1jJ5K6L1K6Rj0j7rkqk2k9j8QL0L5K0%pk%mpjOPj
$$ 189 204 219 231 239 240 235 226 212 189 160 133 116 113 117 121 115 93 64 43 42 57 83 114 140 149 139 122 113 111 103 81 52 34 42 72 107 127 127 120 118 118 114 107 106 112 119 118
972A18j3k5k7j1J0J3nk4j6LJ5J0Lkj0j8qJ6L4K9Qrj3j1j0j1j0JJ7L1L1K0RNQJ0J8K8K9J4p
$$ 118 105 80 53 42 52 65 60 36 20 23 38 48 51 49 39 21 13 29 63 92 100 91 78 67 57 46 36 37 54 85 116 136 145 150 158 168 186 214 243 257 250
954B50k2k5k1j3jQKj1j6kJ6J7lk7l3k2pKOQJ5J7Pj3k5j9%J2Qjrk0l7n2n1l3j1OJ7K0J5PQJ4
$$ 250 228 203 182 169 168 176 178 167 151 149 165 182 179 152 119 97 90 92 98 106 121 138 145 132 107 88 88 100 108 107 98 78 41 -11 -62 -95 -106 -100 -83 -63 -48 -41 -33 -19
935a9K4M2N6N2K2j2k3j1nrjK6M1K4jjJ2Rj4l0k8k7l3l3j8lJ%MPQQQ%j3j1QK4K0QMMpk0j4Q
$$ -19 5 47 103 155 177 165 142 131 126 117 116 142 183 207 206 205 217 226 212 182 154 127 94 61 43 40 41 41 45 52 60 68 76 76 63 52 60 84 104 112 116 120 113 93 79 87
915H7K4K1kk9m8m7k5MJ8K0J4QJnmQJ8K0J1mj3qRK9L7L6K9J6mk9m6m5l2k1j6j1%J4J9QmmOO
$$ 87 111 132 130 101 53 6 -19 -15 3 23 37 45 46 41 37 45 63 83 94 90 77 69 78 107 144 180 209 225 221 192 146 101 69 48 32 21 21 35 54 62 58 54 60 66
896F6orQK7K4Jj0MK1K3Ppj4j8k0j5JJ5J8J3RJ2K0K9L5L2J4j0k5k2j0oj1j6j7j1mNRjk4m7n2
$$ 66 60 51 59 86 110 111 101 105 126 149 156 149 135 117 97 82 83 98 116 129 138 150 170 199 234 266 280 270 245 223 213 207 196 180 163 152 148 153 162 161 137 90 38
877C8l2jK9M2L6J8jqmJ1L0M2L7K4J0jj4k1j3NQj9m7m7j9NJ1O%j0j8k1j2jQJ6J7Pj2k3k1nQ
$$ 38 6 5 34 76 112 130 129 121 117 128 158 200 237 261 271 270 256 235 222 227 235 216 169 122 103 108 119 125 125 115 97 76 64 63 71 87 104 111 99 76 55 50 58
859E8J5J3RLJJJLPQMNJ6K0Qrj0K%k2l9k5PK5K2RkplJ3K9K0j2m7o2m9k1JJ1J5K1K5K1J0K%l
$$ 58 73 86 95 98 99 100 101 104 111 119 123 128 144 164 172 163 153 155 155 133 94 69 76 101 123 132 130 123 120 133 162 182 170 123 61 12 -9 -8 3 18 39 64 85 95 97 97 94
838I4j4k1j4LJ9K3J8Nlm%jqromnkjj1k8k6kK4K5J3jj4k6k7nK6L8K6J5J4J2RRJ1Omn%mj8k5
$$ 94 80 59 45 48 67 90 108 113 110 106 106 105 97 88 82 78 73 71 70 59 31 5 3 27 52 65 64 50 24 -3 -8 18 56 82 97 111 123 132 141 152 158 154 149 149 145 127 102
818A02j5nrj2lMjj4oJ9L7K6nl1l6j9MJ0KnOK7L3J5j7l5l0pRNj4k1nJ9K7J8N%Jlj3k7l6k9j5
$$ 102 87 82 73 61 58 62 61 47 41 60 97 123 118 87 51 32 36 46 48 43 49 76 109 124 107 72 42 35 44 49 35 14 9 28 55 73 78 78 79 76 63 36 0 -29 -44
798d4lLJ4L5N8N8L6Rrj4j3j5k3l3l0j3MPKJLjrqKMmmJ6L4L3J8Mpk1k6j5Jjj0pMLj5k8j7PK9
$$ -44 -47 -44 -30 5 63 121 157 166 157 143 130 115 92 59 29 16 20 27 29 30 33 32 23 15 17 21 17 13 29 63 96 114 118 111 90 64 49 50 49 39 32 36 39 24 -4 -21 -14 15
778A5M3M4L0J2LQNj6l4k4KJ5Lj3j2LK1K6J9NJRJ8J1j1k9l6l7k9j2LKj1j7oJ1K5L5L9K0j7m5
$$ 15 58 102 132 144 147 155 160 144 110 86 88 103 106 93 81 84 105 131 150 155 156 165 183 194 183 154 118 81 52 40 43 45 34 17 11 22 47 82 121 141 124 79
759G9l6pPKnkLJmJJ2J6J0jolRJ6J5J4K0K2J6Lnj0j7k7l2k7k2j8j4nMJ2K1K8K1PojJ1K2K5J8
$$ 79 43 36 43 45 40 38 41 42 38 39 51 67 77 76 70 67 76 92 107 121 141 163 179 182 177 167 150 123 91 64 42 24 10 5 9 21 42 70 91 98 92 91 102 124 149 167
739A67Jj8k3j4kjnj2j5rQK3J4j9m3l2mJ1PPK0K9K2J1POM%oj7k9l3k5j4pJJ4L1L9L6K6Qj5k8
$$ 167 168 150 127 113 111 110 105 93 78 69 77 100 114 95 52 20 16 27 34 41 61 90 112 123 130 136 140 140 134 117 88 55 30 16 9 10 24 55 94 130 156 164 149 121
720A21k4pNPPJ1Nj4l1l3k0oKRJ2J5J4J8J9Lk5m5m0j8JJ3K5M0M8M1K3lk4k8j2Jkr%K4L2J1k0
$$ 121 97 90 95 102 109 120 125 111 80 47 27 21 23 32 44 59 73 91 110 113 88 43 3 -15 -14 -1 24 64 112 153 176 173 149 121 109 110 108 99 99 123 155 166 146
702A46l6l9l4k0RL7M2L1J9J4Mrj8k2k8l7m0k7j3JJ2J6J1%l%JnlLjk1l4k3LJ9K3L0L8K3qk7
$$ 146 110 71 37 17 26 63 105 136 155 169 173 164 146 124 96 59 19 -8 -21 -20 -8 8 19 19 16 16 17 12 9 12 11 -10 -44 -67 -64 -45 -22 8 46 69 61 34
684C4j1K0L4K2LonJQJ2J4J0Jpj3j9k7l3l2j8lNJqj2oKRJ8K6L1J8nj4lJ9L0K4QmpnjjkMJ6K0
$$ 34 23 43 77 99 102 96 91 92 100 112 126 136 137 130 117 98 71 38 6 -12 -15 -10 -9 -17 -29 -35 -33 -24 -6 20 51 69 64 50 47 66 96 120 128 124 117 112 111 110 108 112 128 148
663A48Prk1k9l4k1J2M3L7Lj6mPkj4qLj3m0m3qK4L0J6OQRLoj0j2j3j8k2j8oJ1K4K2Prj5pOJ0
$$ 148 155 146 125 96 62 41 53 96 133 136 120 116 123 121 107 99 102 89 49 6 -2 22 52 68 74 82 91 94 88 78 66 53 35 13 -5 -11 0 24 46 53 44 29 22 28 38
643C8QMNJj6k8j7OK3J7OMMkmRK1J4pk3k4j6j2rpj3k1j6KJ5QllPJ6K1K6L1L2K7K1Rj0k6k3J
$$ 38 46 50 55 56 40 12 -5 1 24 41 47 51 55 53 49 58 79 93 86 63 39 23 11 2 -5 -18 -39 -55 -53 -38 -30 -33 -36 -29 -13 8 34 65 97 124 145 154 144 118 95 96
623I6K2K6J7Lj1k0k3j8j2j1j4j8j8pJ8M7N3L4RNJ1Rmj5j7k3k9k6j6j0j7j9lK3L9L9K9J6QR
$$ 96 118 144 161 164 153 133 110 92 80 69 55 37 19 12 30 77 130 164 173 178 189 198 194 179 162 139 110 84 68 58 41 22 19 42 81 120 149 165 173 182
606A82J2Qrk1k2j7j6k0j8qllmj%%KOOKKLmk0l8m0k6ML3M5L3Nk3l2k1nQJ2NkjRJ2P%JONjjJ2
$$ 182 194 202 193 172 150 133 117 97 79 71 68 65 61 60 60 60 62 68 74 76 78 81 77 57 19 -21 -47 -43 -10 35 68 73 50 18 -3 -8 0 12 17 15 14 23 35 42 42 43 49 54 53 52 64
584F4K8M0L8J8j2l0k3lQ%olKkqOL3M8M0K8L0L3J4k1m6m2k2qj0k0l6m5l4pJ6K1J4R%k5m8m1
$$ 64 92 132 170 188 176 146 123 120 128 128 122 119 121 119 111 117 150 198 238 266 296 329 343 322 276 234 212 204 194 174 138 93 59 52 68 89 103 112 112 87 39 -2
566boL0M3L7K3QnmN%l0o3o4l8j1MJ9L6M3L6K2J7J8J7Oqk2l0k6j3nmpkPJ5K6L8M2L0J2PJ4K0
$$ -2 -8 22 65 102 125 133 128 124 129 129 99 36 -28 -66 -77 -73 -54 -18 25 61 83 100 118 135 141 133 111 81 55 42 37 33 26 24 31 46 72 110 152 182 194 201 215 235
547B35J7J1P%ornpj8k5k1mJj1l3m3l7k9k9l6k8lK0K5K5L0M3L9J6pj8j9j9j2LJ8J7OjlmnjJ2
$$ 235 252 263 270 270 264 255 250 243 225 200 179 175 176 165 132 89 52 23 -6 -42 -70 -73 -53 -28 -3 27 70 109 125 118 100 81 62 50 53 71 88 94 93 90 86 81 80 92
527I2K0K0J3MkKK1L3J4k5n1l8oJ2P%%nj8l2l1j5JJ3J5J2Olj0j5j7j4j3j6j5pJ0K5K8K1J3J4
$$ 92 112 132 145 149 147 149 170 203 217 192 141 103 97 109 116 116 116 111 93 61 30 15 16 29 44 56 62 59 49 34 17 3 -10 -26 -41 -48 -38 -13 15 36 49 63
509F3K6L8M0L0J8J1Mkj0j5k7l9m3k7nM%nkPJ3K0K2K1J4J3K0K5J8Mpj6k7l4k7j1kqj6j3JJ1
$$ 63 89 127 167 197 215 226 230 228 218 203 176 137 94 67 62 66 66 61 59 66 79 99 121 142 156 169 189 214 232 236 229 213 186 152 125 114 112 104 88 75 76 87
491H7J5J7J8K3L3M7M7K3j4l2k4j9l8n8m3kK1Pj0pQMr%K5M0K2%ploj8k1j3j5l4n1m3j5J5J7
$$ 87 102 119 137 160 193 240 287 310 296 264 240 221 183 125 82 80 101 108 98 91 99 103 94 94 119 159 181 181 174 171 165 147 126 113 98 64 13 -30 -45 -30 -13
473a3jj8j0J3K9J7lk1k2pK1M6N5M4K7J6Onj3r%PROmj9k7j6k%pnL%j3j5kPmj9j6PK6K5J1%l
$$ -13 -14 -32 -42 -29 0 17 14 -7 -29 -36 -15 31 86 130 157 173 179 174 161 152 152 159 168 174 170 151 124 108 106 106 99 94 97 97 84 69 67 74 70 51 35 42 68 93 104 104 101
453A01lKQOrk4k9j6JJ3J7K1J9Qrk0j7pLJ2J9K1J8J1Kj4k5j6J0L0K0nk0qJ2K3J7jk2l7m0k8
$$ 101 98 100 108 114 105 81 52 36 37 50 67 88 107 115 106 86 69 62 65 77 96 117 135 146 148 134 109 93 103 133 153 148 128 120 132 155 172 171 149 112 72 44
435D4nJ9L4L4J5lrnoj1qMOpk4k8j8lRJ9K3K0J4Jk0l3k2MJ6OkOJ7J5QPLj8m0m0j3J1K2K0J3
$$ 44 39 58 92 126 141 138 129 124 118 107 99 103 109 102 78 50 32 29 38 57 80 100 114 115 95 62 40 44 60 66 64 70 87 102 110 117 120 102 62 22 9 20 42 62 75
415G5kpMK2J3j8m3m3k9j7jJ9K4PKK2N2N5L1Nj2k3l0k3lJ3J3NJMONOOjj8l8m4k4J1L3K6QJN
$$ 75 73 66 70 92 105 87 44 1 -28 -45 -46 -27 -3 4 6 28 80 135 166 171 159 136 106 83 80 93 106 111 112 116 122 127 133 139 138 120 82 38 14 25 58 84 92 93 98
396I8Kj2k0j1KMOK0L9L7J8jpj1k3l1k7j6j2j3oJ2K2J4kmNJ1Lj2k0j9j3kJ2K2J9MolPQkj1r
$$ 98 100 88 68 57 59 63 69 89 128 165 183 182 175 164 141 110 83 67 55 42 36 48 70 84 82 78 83 94 97 85 65 46 33 31 43 65 84 88 82 79 86 94 92 81 72
376G2NK0K7K7K5K7L4L4J7j0k5k0j3j7l0k5jJ8Nl1n6l9PM4M7K5Lj0j7k0j9j8j4nJ2K7K6J3O
$$ 72 77 97 124 151 176 203 237 271 288 278 253 233 220 203 173 148 147 165 170 139 83 44 51 95 142 167 170 160 143 123 104 86 72 67 79 106 132 145 151
359A51J0J7R%%QRN%mj2j5j0mpj7j8mPPKjmrpMQlj9k2qNMqj4rPJ6RnqJJ1J5J8K4K2Pqj1j3k4
$$ 151 161 178 187 187 187 195 204 209 209 205 193 178 168 164 157 140 122 118 125 132 134 133 129 120 113 117 125 122 103 81 73 78 82 74 60 51 58 74 83 78 70 71 82 97 115 139 161 168 160 149 136 112
337A12l3l0j1LLlkJ3K7K9J4poJ4K8J0k3m0k9j4j2k2k9k7j1J1K3J5joLJ4K2K1J5%j0oL%j5k4
$$ 112 79 49 38 41 44 41 39 52 79 108 122 115 109 123 151 161 138 98 69 55 43 21 -8 -35 -46 -35 -12 3 2 -4 -1 13 35 56 71 71 61 55 58 58 43 19
319A9j7pkOK2L1J6oj3kJ0J3Opk1k2nJ3J6Lj0j5j2nNJ2J6J9K2K0QonMJ1J0J0Rmk3l2k2%J4K1
$$ 19 2 -5 -7 -1 21 52 68 62 49 47 57 70 76 69 48 26 21 34 50 53 43 28 16 11 16 28 44 63 85 105 113 107 102 106 117 127 137 146 142 119 87 65 65 79 100
299A00K2J5jj4qJ2K4J8NLROpj9k1j3mMJ5K5J9lk6l6k7j0LO%qqm%LQJ2J0KMJ5J8QJONj7m5m7
$$ 100 122 137 136 122 114 126 150 168 173 176 185 191 184 165 144 131 127 131 146 171 190 187 161 125 98 88 91 97 97 89 81 77 77 80 88 100 110 112 116 131 149 157 158 164 169 152 107 60
278F0j3L0M8L6J2mrkPJ7K3J5pl0l1j0Mj2l4l7j7oj2j0J0L3L4K2J1RPOLkonlpj7k2j0%JOK3
$$ 60 47 77 125 161 173 169 160 158 165 182 205 220 213 183 152 142 146 134 100 63 46 40 28 18 28 61 95 117 128 137 144 150 153 151 145 140 137 130 113 91 81 81 82 88 111
259A11L7K9Nj0kJ2J2Mlklpj2k1l1k9j6%KjLK2L5L1J3%lmj1k2l1l2k1jJ7J7jj6j0J2K4J8QQ
$$ 111 148 177 182 172 170 182 194 198 195 193 190 183 171 150 119 90 74 74 76 75 78 100 135 166 179 179 176 172 161 139 108 76 55 54 71 88 87 71 61 73 97 115 123 131
240A31P%pn%mj5k0j0KJ0J4K2K9L1K3J5Oj2k9k9j1Oml3m8l2j0qj9j9kJ5K0K3K8K3Oj1qJ0K7
$$ 131 138 138 131 126 126 122 107 87 77 79 89 103 125 154 185 208 223 229 217 188 159 148 154 150 117 69 37 27 19 0 -19 -21 -6 14 37 65 88 94 83 75 85 112
221A12K8J6Lm%O%j8l7m1k5LK5L6L2K7L0L2J6j7m4m9m3l4k3kJ9K7K6K1J3%j2j2j1j5k4k4j6
$$ 112 140 156 159 155 155 161 161 143 106 65 40 43 68 104 136 163 193 225 241 224 180 131 88 54 31 29 48 75 101 122 135 135 123 111 100 85 61 37 21
205B1j2j3nJ8M0M0K3J0OPnk4l6k8j1jkLJ6J9OoNK6K6Kk1k3j8k0k6k4j4KK0K9J6qj5LK6L0J9
$$ 21 9 -4 -9 9 49 89 112 122 128 135 130 106 70 42 31 30 28 31 47 66 72 66 71 97 123 125 104 81 63 43 17 -7 -21 -19 1 30 46 38 23 26 52 82 101
186A01QM%lLJ5J8PqrLJ5J5MkKOnk2l0k0rj2j3KK3L4K9J7Kj9m1m6l2j4njQJ7J8Orj7j2%J1J5
$$ 101 109 113 113 110 113 128 146 153 145 136 139 154 169 173 171 173 179 174 152 122 102 93 81 68 70 93 127 156 173 175 156 115 69 37 23 18 17 25 42 60 66 57 40 28 28 39 54
165E4J0%j0j4j3rqnMJ2J0jqjJ6K9L0J8Kj0pOJ5Oj2k5k4j2lmk3m5m5qM5P0O1L8J9Oj3k7k7k2
$$ 54 64 64 54 40 27 18 10 5 9 21 31 30 22 21 37 66 96 114 116 106 99 105 120 126 114 89 65 53 50 46 23 -22 -67 -75 -30 40 101 139 158 164 151 124 97 75
146G5k2k3rJ4K3J2j1k3k2j3OK5L5K3LnOJ9J7Lpj1j9k6k3oJ2J4PKMRJ4K1K5J1j0k0pJ5K1J2
$$ 75 53 30 21 35 58 70 59 36 14 1 7 32 67 90 93 88 94 113 130 133 126 115 96 70 47 41 53 67 74 76 80 89 103 124 149 160 150 130 123 138 159 171
128A71ONJj2j7mJ5J6ol0l5k6j6lJ3L1L6K9J4Kj3l2m2l6j7JJ3K0K3J8J0LM%j6l6m2k2J5M3M8
$$ 171 177 182 183 171 154 150 165 181 175 145 110 84 68 65 78 109 145 174 188 190 177 145 103 67 50 51 64 84 107 125 135 138 142 142 126 90 48 26 41 84 132
110A32L0J0jnqj5j7j2lQJ7J6Prk7m2m6l3mJ9L0K7K5K1Rj1k1j5nKJkmrrooj1j8j5%J7K8K3P
$$ 132 162 172 171 166 158 143 126 114 111 119 136 152 159 150 123 81 35 2 -2 17 47 74 99 120 129 118 97 82 77 79 80 78 74 65 56 50 44 33 15 0 0 17 45 68 75
91G5j5k1j3JQQJ5K7L0J9lk2l1k6j1J4M0M6K8kj5oRJ0%%PNrj6kK0K5Mk0k8j7kMLMRJ7J5Opj4
$$ 75 60 39 26 27 35 43 58 85 115 134 131 109 78 52 41 55 95 141 169 167 152 146 155 165 165 165 172 177 168 152 150 170 195 199 179 151 134 132 136 139 143 152 169 184 190 183 169
71A69j8k3k2j2KRPNNkj3j9j7j0NK4L2K0jlJ5K2jk8k3PK4J5MJ2J9mn0p3m7LL2J6k0l6j8J8L9
$$ 169 151 128 106 94 96 105 112 117 122 120 107 88 71 61 66 90 122 142 141 138 153 175 174 146 123 130 154 169 173 185 204 200 150 77 30 33 65 81 61 25 7 25 64
52F4L8K7K3J9Mj8l1k1KJ8J9J0Lmj1k1k3k0j4j0nLJ1J4J4Pjj1j5j0%QJ1J0RPQPJmlJ2K3J2j9
$$ 64 102 129 152 171 175 157 126 105 107 125 144 154 157 153 142 121 98 78 64 54 49 52 63 77 91 98 97 86 71 61 61 69 80 90 99 106 114 121 122 118 115 127 150 162 143
32A43l9k8nMnrJJ1J4J7K1K3J4Mkj3l0m1l4k2j6qJ8N3O5M6J9%j4k9l0rJ8K6J4mj1rrj3k4l2
$$ 143 104 76 71 75 70 61 62 73 87 104 125 148 162 166 164 151 121 80 46 24 8 0 18 71 136 182 201 201 187 158 128 119 137 163 177 173 162 153 144 131 107 75
14G5k9j5%MK%%LJ1J8J7Lj7k9l1k1KL2M9L7J0kkoj4pJ2K1J0j0j6j7k1j6MJ6jl5m7k3PJ7J3J6
$$ 75 46 31 31 35 37 37 37 40 51 69 86 89 72 43 12 -9 -7 25 74 111 121 119 117 111 97 90 102 123 133 123 107 90 69 53 57 73 72 37 -10 -33 -26 -9 4 20
-5B0K5K5J1kj0j6k2k3j4qjJ3K4K3Mj6j6KK2L7M0L0Kk6k8nJ3Pj2k1j6rmKQJ1J3J7J5Lj9l7m0
$$ 20 45 70 81 79 69 53 31 8 -6 -14 -15 -2 22 45 49 33 17 19 41 78 118 148 150 124 96 91 104 111 99 78 62 53 49 51 59 70 83 100 115 118 99 62 22
-24B2k9oK2M0L2QqnKNQJ3J2Kj1j4rjKok1l0j8QK0J2PK2M3M1K1J1J7J7jj7j8j8l2m6l9j4NR
$$ 22 -7 -13 9 49 81 89 81 76 78 83 91 104 116 118 107 93 84 83 85 79 58 28 10 18 38 50 57 79 122 163 184 195 212 229 228 211 193 175 143 97 58 44 49 58
-43E8OMKJJ3K9K8J0lQK3Rk4l6j1J8J7j5l8l2mJ9K5J7J3K1K7J8mj3JK0J7jj5j4j6k6l2k1JK0
$$ 58 64 68 70 71 84 113 141 151 148 156 179 188 164 128 117 135 152 137 99 67 63 82 107 124 137 158 185 203 199 186 187 207 224 223 208 194 178 152 120 99 100 120
-61A20K8K6J7OOJ7K4Ok7n0m6l1k0j6j1nmj1k0j6jJ7K2Qj3k5k6k7k1lJ7K5J9J7L0M5M5K6kj4
$$ 120 148 174 191 197 203 220 244 250 223 173 127 96 76 60 49 44 40 29 9 -7 -8 9 31 39 26 1 -25 -52 -73 -76 -59 -34 -15 2 32 77 122 148 146 132
-78A32j0%Kqj3kJ5J3lrJ0L4L3Ok6m1l3j0J0J2Jj0oPR%ol%rj8j1MJ1LokJ3K0J3nk0k6j8jK0
$$ 132 122 122 124 116 103 101 116 129 126 117 127 161 194 200 174 133 100 90 100 112 113 103 97 104 113 113 107 104 104 95 77 66 70 81 84 78 76 89 109 122 117 97 71 53 52 72
-98G2L5M1L2J1j2k6k2j4j1j6j6p%oj6j5%J7K2J8J4PjkPJ5Qoj0KQjqOK6K3nk4j6JNnj1j2j7
$$ 72 107 148 180 191 179 153 131 117 106 90 74 67 67 61 45 30 30 47 69 87 101 108 107 105 112 127 135 129 119 121 129 128 120 126 152 175 170 146 130 131 136 131 120 108 91
-118I1k3j9%J7J6QLlj4k3j8KJ6J6J0J4K5L4L3K4J3Mjmj3k3k7k2j6j6j6qRK3K0Mj6k6k8k4j5
$$ 91 68 49 49 66 82 90 93 90 76 53 35 37 53 69 79 93 118 152 185 209 222 226 225 221 208 185 158 136 120 104 88 80 89 112 132 136 120 94 66 42 27
-135B7pjlKJ6L0K2lk4k1KK0K6K4K6L0K5J0j0k5k9k5j5mPJ9K3K0J5J0KjRK9L6J7qj9k0k5l4
$$ 27 20 19 16 18 34 64 86 83 59 38 40 60 86 110 136 166 191 201 191 166 137 112 97 93 100 119 142 162 177 187 189 188 197 226 262 279 271 252 232 207 173
-153A73l8l1k5j7OL2L7J1j7k3j6j6j8j3noj0oLjj4j7pNOKMJ0K0K8L1J8kj5rQK4L2K7Mk5l4
$$ 173 135 104 79 62 68 100 137 148 131 108 92 76 58 45 40 34 24 18 21 20 6 -11 -18 -13 -7 -5 -1 9 29 57 88 106 104 89 80 88 112 144 171 175 150 116
-171A16j7MLj5k6k3j9k2k6k3qJ4L5M5M0K1Nklnj4k1k3j8j2j0j9k5j6J0L0K7RolPJ2J2RNLP
$$ 116 99 103 106 91 65 42 23 1 -25 -48 -56 -42 -7 38 78 99 104 102 99 94 80 59 36 18 6 -4 -23 -48 -64 -54 -24 3 12 6 3 10 22 34 43 48 51 58
-190E8J2Pj1k4j7kNLRK1K9J9PLkj8l4l5k0nklrj4qQK6K8J7J5K6L4K6Nj1j6j0jQOoj9j7rkL
$$ 58 70 77 66 42 25 23 28 31 40 61 90 109 116 119 117 99 65 30 10 5 3 0 -9 -23 -31 -23 3 31 48 63 89 123 149 154 143 127 117 116 124 130 124 105 88 79 77 80
-209H0RJ2J0LKRJ9K6K4J6Kj2j9k3k8k8j9jJ6J9J2%rrNK3K9J6nj9j9j9l0m3l9j2K0L7K7Mj7
$$ 80 89 101 111 114 116 125 144 170 194 210 212 200 181 158 130 102 83 82 98 117 129 129 120 111 116 139 168 184 179 160 141 122 92 49 10 -2 18 55 82 86 69
-227F9l1l9m2l0j1MJ4K6L5M1M6M8M7L6K0OJoj9l5m5m6l7j5NOqk0j2QJ7J3NlnLK0L5L3K7L1
$$ 69 38 -1 -43 -73 -84 -80 -66 -40 -5 36 82 130 177 213 233 239 240 234 215 180 135 89 52 37 42 48 40 20 8 16 33 46 51 48 43 46 66 101 134 161 192
-245A92L4J8j9m8m6l0j9j5KK3L1K0M%PJ7K3K3J4JmLQJj9l1k7j2%jpoJ0K8K4ll1l3j3MMkmm
$$ 192 226 244 225 177 131 101 82 67 69 92 123 143 147 147 154 171 194 217 231 232 228 231 239 240 221 190 163 151 151 150 143 137 147 175 199 196 165 132 119 123 127 125 121 117
-264A17j2k0k3k3k3k3j8kJ5K3K9L0K3RmrpmKJ3K2J9No%J7K5J2j3k9k2KK0K2Rlrj2j3qMJ2J2
$$ 117 105 85 62 39 16 -7 -25 -27 -12 11 40 70 93 102 98 89 82 78 80 93 115 134 139 133 133 150 175 187 174 145 123 125 145 167 176 173 164 152 139 131 135 147 159
-283A59J0J0J0Jj1j7j9j9j9j9j6j5j2j0j0j3j0J1L4L3Mk7l7k8j0J6L6L5J1j4j8j1qj4j3nl
$$ 159 169 179 189 190 179 162 143 124 105 86 70 55 43 33 23 10 0 11 45 78 82 55 18 -10 -20 -4 32 67 78 64 46 35 27 13 0 -5 -8
-299hJJ8M0M0J5j5k6k3j8j0PJ6Rqj3jJ9L1K8Rrj2KJ0jj7j0J2K4J1pj1KJ4K1K6K9K2Pj4k7k2
$$ -8 -7 11 51 91 106 91 65 42 24 14 21 37 46 38 25 24 43 74 102 111 102 90 92 102 101 84 74 86 110 121 114 103 105 119 140 166 195 217 224 210 183 161
-317A61rkoj5j5mPJ6K1J7%k0k6rJ2J3nk4k3lJ9K9J7j1l0k5kJ8J9RJmj1j7k1k0j2kORJ2J7K9
$$ 161 152 150 144 129 114 110 117 133 154 171 171 151 125 116 128 141 136 112 89 86 105 134 151 140 110 85 83 101 120 129 130 126 115 98 77 57 45 43 49 58 70 87 116
-336A16L4K2pl0k8pJ0Oj4k6k1oLMNJ6K4J8%j9k6k4k0j5lJ2J9J4Jj0j7j9j8j3mJ0J9J5lj4n
$$ 116 150 172 165 135 107 100 110 116 102 76 55 49 52 56 61 77 101 119 119 100 74 50 30 15 12 24 43 57 58 48 31 12 -6 -19 -23 -13 6 21 18 4 -1
-353aJ7L5L2K0J7K2J5nk1k0j0pj3j3LK9M1L3J4%pj7l4m5m4l3k5k3j7%K0L4L5K8J6Mpj3j6j5
$$ -1 16 51 83 103 120 142 157 152 131 111 101 94 81 68 71 100 141 174 188 188 181 164 130 85 41 8 -17 -40 -57 -57 -37 -3 32 60 76 80 73 60 44 29
-371B9rkMJ0RMnnLJ3J3LmlQJ8K5K4K1J3%j7l5l8k3kJ0J7K4L6L6K6J2Jpj7j8rNJ3J3J1Pmk1
$$ 29 20 18 22 32 41 45 40 35 38 51 64 67 63 60 68 86 111 135 156 169 169 152 117 79 56 54 64 81 105 141 177 203 215 216 209 192 174 165 170 183 196 207 214 210 189
-390A89l3k8j5mlmmjkjOJ4Qj1j9nJ7K3J0Jkoj2jK5M4L7J5MPJ1Q%pj3j6j1j0j8k9l1k3j9j2
$$ 189 156 128 113 109 106 102 98 97 95 94 100 114 122 111 92 87 104 127 137 138 136 130 118 117 142 186 223 238 242 249 260 268 268 261 248 232 221 211 193 164 133 110 91 79
-409G9KK3K8J7Jnj1k4l0j6PJ9J2lqkRJ9K4J8Kj6k6j9jJ5J8Qkonloj5k1k3k0j7j5j1lLQJ6K5
$$ 79 81 104 132 149 150 145 134 110 80 64 71 90 102 99 91 89 98 117 141 159 161 145 119 100 99 114 132 140 138 132 127 124 118 103 82 59 39 22 7 -4 -7 -4 4 20 45
-429D5K9K0Kqrqj4k0j8pJ2L4N6O1M3Qk2l0j9kN%KJ4K8K6Qnrrj2j2pJJKMKj1k5k7j5kJJJNP
$$ 45 74 94 96 88 79 71 57 37 19 12 24 58 114 175 218 226 204 174 155 153 158 158 160 174 202 228 236 231 222 213 201 189 182 183 184 186 190 192 181 156 129 114 112 113 114 115 120 127
-450A27jj3k3j4RL1L3J8OOJ4J8K0J5Oqj6j8k3k9k9j6lknjJ2K0J5QKlj7l4m1k9jK4L2K4Qmq
$$ 127 126 113 90 76 85 116 149 167 173 179 193 211 231 246 252 244 228 210 187 158 129 113 110 108 103 102 114 134 149 157 159 156 139 105 64 35 34 58 90 114 122 118 110
-468A10rj1j5k0k0j2LK1L7L9L1K0J0jj9l7m8m4k5qKjnnkmrmJ6L2K9J2NJ1J6J7K0L1K7Jl0m1
$$ 110 101 90 75 55 35 23 26 47 84 123 154 174 184 183 164 127 79 35 10 2 4 3 -2 -7 -9 -13 -22 -26 -10 22 51 63 68 79 95 112 132 163 190 191 161 120
-486A20l6k8k3j0OJ1NLJ2K2J8O%KJnj1j4j0KK0L4L3J9JqoKNlj6k1j2jkpp%Lok0k6j7kJ0J9
$$ 120 84 56 33 23 29 40 45 48 60 82 100 106 106 108 109 104 93 79 69 71 91 125 158 177 178 170 164 166 171 168 152 131 119 118 116 109 102 102 105 99 79 53 36 34 44 63
-506F3J6QNJ7M0N2L9Qj9l0k9j9mRPnj1j1j4k4k7mL2N3M5J7j1k8k7j7ojkJMNPROj1k3j9k%j7
$$ 63 79 87 92 109 149 201 240 248 229 199 170 151 147 156 163 158 147 136 122 98 71 67 99 152 197 214 203 175 148 131 125 124 122 123 127 132 139 148 154 143 120 101 99 99 82
-526H2k7j7%JqoJ0J7QjOJ7J0j3k4j3LMj0j7JL0M9M4K7Oqj2pLQ%j2j8j6j1rokORO%rj5k0j9
$$ 82 55 38 38 39 31 25 35 52 60 59 65 82 92 79 55 42 45 49 39 22 23 53 102 146 173 179 171 159 152 155 163 163 151 133 117 106 97 91 89 95 104 110 110 101 86 66 47
-546D7oJ1J4nk7k6jJ8Qj3j7lNLMJ8K5J3nlJ9L7L3Pk6m9m5j6J8L6L5K2Oj3k7j4J9L7J9k2m6
$$ 47 41 52 66 61 34 8 7 25 33 20 3 0 5 8 12 30 55 68 63 60 79 116 149 156 130 81 36 20 38 74 109 131 137 124 97 83 102 139 158 136 90
-564I0l5qJ1J1MKJ1K8M2L7J3j2k5k1j1jNLpj3qMJ3J7J8J8J0NJ1K4K7J6lj9k7l1k8k1j4j0l
$$ 90 55 47 58 69 73 75 86 114 156 193 206 194 169 148 137 136 141 144 137 124 116 120 133 150 168 186 196 201 212 236 263 279 276 257 230 199 171 150 136 126 123
-582A23QJ3Omqooj5k1j3LJ3Qrk2k2rPJ9K6K2J3PJ4J9J0qj3MJ9J1pj3pj0l0m6m1k3j2j2rJ4
$$ 123 131 144 150 146 138 132 126 111 90 77 80 93 101 92 70 48 39 46 65 91 113 126 133 147 166 176 168 155 159 178 189 182 169 162 152 122 76 35 12 0 -12 -21 -7
-600gL9N1L6Lk2l2k7j9pOJ9K4J7OjJMMmj7k3k3j4o%ln%J7K1rn4p4m7KL0L1K0J2J4K9N3O8N3
$$ -7 32 83 119 122 100 68 41 22 15 21 40 64 81 87 86 87 91 95 91 74 51 28 14 8 8 5 0 0 17 38 29 -25 -99 -146 -144 -114 -83 -63 -51 -37 -8 45 113 166
-620A66J5j5k6k5k1j6j4k0l5l9k6j0mlKJ3J9K2K6L5L5L1K0Qpj5j2noqlQJ1Lpj2j0mQK0K5J9
$$ 166 181 166 140 115 94 78 64 44 9 -30 -56 -66 -70 -73 -71 -58 -39 -17 9 44 79 110 130 138 131 116 104 99 93 85 82 90 101 104 97 85 75 71 79 99 124 143
-638A43QkjRJ6J2JmJJ0J4J3J1Jj6k8k4j2j1k3l1j9KJ4Nj0j5qNJ5K1K2J4mk9l7k4jQkj0oJk
$$ 143 151 149 148 157 173 185 186 182 183 193 207 220 231 232 216 188 164 152 141 118 87 68 70 84 89 79 64 56 61 76 97 119 133 129 100 63 39 38 46 44 34 28 29 27
-657B7rqPK2K3J3jj1j1n%MORPnk3k3JL4M8L5K0J7K3J6%mRJ9J0j3k4j5LJ4J0%nk%rk4k3lJ5
$$ 27 18 10 17 39 62 75 74 63 52 47 47 51 57 66 73 68 45 22 23 57 105 140 160 177 200 216 216 212 221 240 250 237 213 198 201 215 225 225 220 218 218 209 185 162 159 174
-677A74J7NK%j1k7k9j5nj0j1OK7L0J4kj5k1k4j2NJ5J8J6J8J6Omj0pklj3k4k4j1LQMjkjPJ5
$$ 174 191 196 198 198 187 160 131 116 111 101 90 96 123 153 167 165 150 129 105 93 98 113 131 147 165 181 187 183 173 166 164 161 148 124 100 89 92 100 104 103 101 100 107 122
-696A22J8Oqrjmj7k3j0Lnk6l3j6NK0K3K2K4K8L1K6J3nj2oKMJKMJpoQK7L0Ol1o1o2m0pJ9K7
$$ 122 140 146 138 129 128 124 107 84 74 77 72 46 13 -3 2 22 45 67 91 119 150 176 189 184 172 166 168 172 173 175 179 180 173 167 175 202 232 238 207 146 84 44 37 56 83
-715H3J7kj4j3onj0j1lMkj3j6mJ0J2RJ2K5L4K6J0jJJj0j9j6lJpj1lQNl%J4K1J3QJ5K6K1jk4
$$ 83 100 98 84 71 65 60 50 39 36 40 38 25 9 5 15 27 36 48 73 107 133 143 142 143 144 134 115 99 96 97 90 79 76 84 89 86 86 100 121 134 142 157 183 204 203 179
-735A79k9j7J0M0N4M2Qk4l7l3k8k4j8j4j6k1j8oJ0K2K5K2J2nj6j1J2K7J9j0l8n3n7n0l1mJ4
$$ 179 150 133 143 183 237 279 287 263 226 193 165 141 123 109 93 72 54 48 58 80 105 127 139 134 118 107 119 146 165 155 117 64 7 -43 -74 -78 -64
-751f4J3J4K9M8M4Pl2m4l2j6NL1N1M6J8oqJLjnoj3k0j2J0K4J4jkQJ1%pKJ2jk2l0j7jNJ2K4
$$ -64 -51 -37 -8 40 84 91 59 15 -17 -33 -28 3 54 100 118 112 104 105 108 107 102 96 83 63 51 61 85 99 98 96 104 115 115 108 110 122 121 99 69 52 51 56 68 92
-770I2L0J4j2k4j5%MkpnJ1K8L3K2LplNPjrj7j9j7j4j3j8j4JK1L2K8J9J5J2ml2n6n0j4K7M5
$$ 92 122 136 124 100 85 85 89 87 80 75 86 114 147 169 172 165 162 167 174 173 164 147 128 111 97 84 66 52 53 74 106 134 153 168 180 176 144 88 38 24 51 96
-789I6L0%k1j9%K1L3L6L2K5J4ONQNnj9l3m2l4j3J1K4K4K2K1J2j2l4l3j3J3K4J7mk2k4j3oj2
$$ 96 126 126 105 86 86 107 140 176 208 233 247 253 258 266 271 266 247 214 172 138 125 136 160 184 206 227 239 227 193 160 147 160 184 201 197 175 151 138 132 120
-806A20k1j8j4j8k5k3j3qlPJ6J3JLK1L0J1j5j6MJ7RkLK0K6J6%j3j8j0J2L5M1K3Lnoj7l1k7
$$ 120 99 81 67 49 24 1 -12 -20 -23 -16 0 13 14 17 38 68 79 64 48 52 69 78 76 79 99 125 141 141 128 110 100 112 147 188 211 214 209 203 186 155 128
-824A28mQqk7j8J1K6J4oj3j0ppplMJ3J6J0%oopj3j7j6j4j2qLJ2J2RMmqlROj3l3l5k2pPJ7J5
$$ 128 124 132 124 97 79 90 116 130 124 111 101 94 87 80 77 81 94 110 120 120 114 108 101 88 71 55 41 29 21 24 36 48 57 61 57 49 46 55 61 48 15 -20 -42 -49 -42 -25 -10
-844a0%nJ4M2M6K0jkjj8l7l1oJ2J1J1K2L4L0J5J1K8M3L6Qj5j7j7l3n5o0m2k0j1j1oOJ2Kk0
$$ -10 -10 -15 -1 41 87 107 106 104 103 85 48 17 11 23 34 45 67 101 131 146 157 185 228 264 272 257 240 223 190 135 75 33 13 2 -9 -15 -9 3 5 -15
-861a5l6l0jK9M4L8K8J9Qjoloj4k1qJ7L8M5L6K1%k4m7n6m1pK5L1J3j0k4l3m0m3k9kK5M8N9
$$ -15 -51 -81 -82 -53 -9 29 57 76 84 83 77 74 68 54 33 25 42 80 125 161 182 182 158 111 55 14 7 32 63 76 66 42 9 -31 -74 -103 -105 -80 -32 27
-879B7N4L3J1M%j3k7j7J4L6K2j5l8l4j9oKJ8L3L8L1K1J2kk0k7j4J0K4J7Jpllrj9j8j2noj3
$$ 27 81 114 125 129 129 116 89 72 86 122 144 129 91 57 38 32 34 52 85 123 154 175 187 185 165 138 124 134 158 175 176 169 166 163 154 135 117 105 100 94 81
-897H1j7pJ9N0O1M0Jl0l3j6lnj7k2j6kQJ3J4J3Qkj8l0k7j8k0k8k7kK5K9J4jmnkPK6L1J7pk0
$$ 81 64 57 76 126 187 227 228 198 165 149 146 141 124 102 86 84 92 105 119 132 140 138 120 90 63 45 25 -3 -30 -32 -7 22 36 35 31 26 24 31 57 88 105 98 78
-915G8k0rJ2L4L7J0k4l2j3Ljj0rlKQK5M3L9Rk5l9l0k4l0l9k9%K7L1J9LmomknnKJ4Qk2n2n6
$$ 78 58 49 61 95 132 142 118 86 73 76 75 65 56 53 55 63 88 131 170 179 154 115 85 61 31 -8 -37 -37 -10 21 40 43 39 33 29 27 22 17 19 33 41 19 -33 -89
-934h9k8J0M3O4O6M4J7PJ3J0qk2j9j5l0m5l1PM0M9L5J6%pkMjj8l1k7j3jNOJ1J8K6L2L3K5J3
$$ -89 -117 -107 -64 0 66 110 127 134 147 157 149 127 108 93 63 18 -13 -6 34 83 118 134 134 127 125 129 128 110 79 52 39 38 43 49 60 78 104 136 169 194 207
-952B07kj6k9l7l8k9j3MJ5J6J9K6L1K6J6Plj5k3j6jNlj3j6j2oLJ5J5lk6k9j5MJ2J3J3Oj0l0
$$ 207 205 189 160 123 85 56 43 47 62 78 97 123 154 180 196 203 200 185 162 146 145 150 147 134 118 106 100 103 118 133 130 104 75 60 64 76 89 102 108 98 68
-970F8l4j6PJ4MqrJRJ9K8L0J7jj2j5j4qJQjk0k9k0lPJ0J5K9M3M3K6%j5k0k2l0l4j6J5K8Pk4
$$ 68 34 18 25 39 43 35 26 27 36 55 83 113 130 129 117 102 88 80 81 89 88 68 39 19 16 23 33 48 77 120 163 189 189 174 154 132 102 68 52 67 95 102 78
-988G8l2j4MQNPK1L5L6K2Lp%RRmj6j8j6j5j8j9j1J0K5J4j6m1l9j9%OJ1K2L2L2K2PpqQK7L3
$$ 78 46 32 36 44 49 56 77 112 148 170 173 166 166 175 184 180 164 146 130 115 97 78 67 77 102 116 100 59 20 1 1 7 18 40 72 104 126 133 126 118 126 153 186
-1007A86J8kj3j1jMRJ5K4K7K0Jj7k9l3l1k4j1LJ1J2O%kjlj5k7k4oPNOJ7K2Kk3k2%Nj2k9k3
$$ 186 204 202 189 178 177 181 190 205 229 256 276 277 260 231 198 167 143 132 135 146 158 164 164 162 161 158 143 116 92 86 93 98 104 121 143 145 122 100 100 105 93 64 41
-1026D1j6k0k2kK6L7K5J2Mj1k8l6k5j6j3j4mJ4K7L0K1PoqnkmnJRK0K5K1Qpj3j2j8k3j9jJ7
$$ 41 25 5 -17 -19 7 44 69 81 85 74 46 10 -15 -31 -44 -58 -62 -48 -21 9 30 37 31 23 18 16 12 7 8 17 37 62 83 91 84 71 59 41 18 -1 -2 15
-1044A5K6K0Rnj6k1j8j5j7j4lPJj6k7j7NJ9J8OJMJ5K7L7L3J8K%J2K3K5J8J5J0nj9j7%J3Oq
$$ 15 41 61 70 65 49 28 10 -5 -22 -36 -39 -32 -31 -47 -74 -91 -86 -67 -49 -43 -42 -38 -23 4 41 74 92 94 94 106 129 154 172 187 197 192 173 156 156 169 175 167
-1062A67qLPok3k7j7qrpNK1K5RqqMJ3Pj%J3L2L9K6Kj1mNjj9k4k0j7k0j6jOmj6j0NJ0QQJ1R
$$ 167 159 162 169 163 140 113 96 88 79 72 77 98 123 132 124 116 120 133 140 139 139 152 184 223 249 251 240 236 241 240 221 197 177 160 140 124 123 129 125 109 99 104 114 122 130 141 150
-1083A50MOPJj2j6j0oo%J3K5K5K1J1%j0oPPj8m2l8j6PJ9K7K4RplJ1Rj4k9k0rk0l9m0j8klq
$$ 150 154 160 167 168 156 140 130 124 118 118 131 156 181 202 213 213 203 197 204 211 193 151 113 97 104 123 150 174 183 176 173 184 193 179 150 130 121 101 62 22 4 2 -1 -9
-1102iQL5N1M7K7Oj0j1mMNKok5m6m7j6J8K4NnJ0K3J2j5l5l2j6MK8M3L9K8K2J6Kj1pRJ2j0l5
$$ -9 -1 34 85 132 159 165 155 144 140 144 149 151 145 120 74 27 11 29 53 58 53 63 86 98 83 48 16 0 4 32 75 114 142 164 180 182 171 164 173 185 175 140
-1120A40m0l0k2j5%J8K2J1MLkp%J7K5J3k%J9L0K8K6L1L0J2j3k5k4k3k4j1J7L0Mm1n5k7J1K1
$$ 140 100 70 48 33 33 51 73 84 88 91 89 82 82 99 124 137 135 135 154 184 212 238 269 299 311 298 273 249 226 202 191 208 238 242 201 146 119 130 151
-1137A51NnnlolNJ1J2J8K4K0QjJlj7k6j8j%ooJnk0j8J2L8L2kk9l6k3pJ0K0J8Omqj6k8l4k5
$$ 151 156 151 146 143 137 134 139 150 162 180 204 224 232 231 232 229 212 186 168 167 167 161 155 156 151 131 113 125 163 195 193 164 128 105 98 108 128 146 152 148 140 124 96 62 37
-1156C7pNRRRQNJ1J9J9%k5l0j0J3J9J2J1K4L8L4J4j5l9m3k6mPNMRJ1Nlpj4k8m1l4j1NPKMJ3
$$ 37 30 35 44 53 62 70 75 86 105 124 124 99 69 59 72 91 103 114 138 176 210 224 209 170 127 101 97 104 109 113 122 133 138 135 128 114 86 45 11 0 5 12 14 18 31
-1176C1K6L3L2K0RNQMj0k1k5k6k1%K9M6L5Pj1j7k1k2j8j0oo%ROj1k3k4j8j7j4jJ7J9J1%m%
$$ 31 57 90 122 142 151 156 164 168 158 137 112 86 65 65 94 140 175 182 171 154 133 111 93 83 77 71 71 80 86 75 52 28 10 -7 -21 -22 -5 14 25 25 21 21
-1194B1Kjqj4j3kJ2K1K9L3L0J5mk0k5k2j1Jkj9l1k8pJ6L2L9K5pl0k3RL7M3K9Pj8l8m3k7mJ2
$$ 21 23 22 14 0 -13 -15 -3 18 47 80 110 125 121 101 76 54 43 44 42 23 -8 -36 -43 -27 5 44 69 62 32 9 18 55 98 127 134 116 78 35 8 4 16
-1212A6J7J8J3jj6k1j8j2qQL3N2M5J5j4k3j3nlkKJj0k4k7j9nJJloNJ8J7jj5j0NNj0j5JK6M4
$$ 16 33 51 64 63 47 26 8 -4 -12 -4 29 81 126 141 127 104 91 86 83 81 83 84 74 50 23 4 -1 0 1 -2 -8 -3 15 32 31 16 6 11 16 6 -9 -8 18 62
-1231F2M6L4J2njJ5J8Jj6j1QJ5Ork3l6m2l7k3j3nOK0K2J1nj7k5k5j5MJ9J7Pkoo%J7L6M7M4
$$ 62 108 142 154 149 148 163 181 182 166 155 163 178 184 175 152 116 74 37 14 1 -4 2 22 44 55 50 33 8 -17 -32 -28 -9 8 15 13 7 1 1 18 54 101 145
$$ [...]
-3135A01
##END=	
##END=	
