##TITLE=	Jan24-2022.60.fid
TM-VI-251, Na+PMB-pyr

##JCAMP-DX=	6.0	$$ MestReNova 14.3.0-30573
##DATA TYPE=	LINK
##BLOCK_ID=	1
##BLOCKS=	2    
##ORIGIN=	Mestrelab Research S.L.
##OWNER=	hrzepa
##$MNOVA/LINK_BLOCK_TYPE=	ITEM	$$ NMR Spectrum
##$MNOVA/ITEM/POLYGON=	(XY..XY)
5321,5835
8722,5835
8722,8208
5321,8208
5321,5835
##$MNOVA/ITEM/Z=	0
##$MNOVA/ITEM/ANGLE=	0
##TITLE=	Jan24-2022.60.fid
##JCAMP-DX=	6.0	$$ MestReNova 14.3.0-30573
##BLOCK_ID=	2
##DATA TYPE=	MNOVA NMR VIEW DATA
##DATA CLASS=	MNOVA VIEW DATA
##$MNOVA/ITEM/ZOOM/X=	-4.0107147498308073352,	16.011019999997905927
##$MNOVA/ITEM/ZOOM/Y=	-1380.3682528659701347,	15182.9229736328125
##END=	
##TITLE=	Jan24-2022.60.fid
##JCAMP-DX=	6.0	$$ MestReNova 14.3.0-30573
##BLOCK_ID=	3
##DATA TYPE=	NMR SPECTRUM
##DATA CLASS=	XYDATA
##NUMDIM=	1
##ORIGIN=	Bruker BioSpin GmbH
##OWNER=	nmr
##.OBSERVE FREQUENCY=	400.20240119999999706
##.OBSERVE NUCLEUS=	^1H
##.SOLVENT NAME=	MeOD
##.PULSE SEQUENCE=	zg30
##LONGDATE=	2022/01/24 17:11:00.000
##.ACQUISITIONMODE=	SIMULTANEOUS (DQD)
##$ORIGINAL FORMAT=	Bruker XWIN-NMR
##$MNOVA/SCALES_VERSION=	9
##$PARAMETER FILE=	(acqus, ASCII, /private/var/folders/f6/rjf_tdyn2v98c5c0wvkgn4s80000gn/T/YaIYKrc8RbmlNc5YhQmF3A/60/acqus, 0)
$$ ##TITLE= Parameter file, TOPSPIN		Version 3.2
$$ ##JCAMPDX= 5.0
$$ ##DATATYPE= Parameter Values
$$ ##NPOINTS= 11	$$ modification sequence number
$$ ##ORIGIN= Bruker BioSpin GmbH
$$ ##OWNER= nmr
$$ $$ 2022-01-24 17:11:41.324 +0000  nmr@CZC2439F63
$$ $$ /opt/topspin/data/agmb/nmr/Jan24-2022/60/acqus
$$ $$ process /opt/topspin3.2/prog/mod/shimcntl
$$ ##$ACQT0= -2.36344537815126
$$ ##$AMP= (0..31)
$$ 100 100 100 100 100 100 100 100 100 100 100 100 100 100 100 100 100 100
$$ 100 100 100 100 100 100 100 100 100 100 100 100 100 100
$$ ##$AMPCOIL= (0..19)
$$ 0 0 0 0 0 0 0 0 0 0 0 0 0 0 0 0 0 0 0 0
$$ ##$ANAVPT= -1
$$ ##$AQSEQ= 0
$$ ##$AQ_mod= 3
$$ ##$AUNM= <au_zg>
$$ ##$AUTOPOS= <51 >
$$ ##$BF1= 400.2
$$ ##$BF2= 400.2
$$ ##$BF3= 400.2
$$ ##$BF4= 400.2
$$ ##$BF5= 400.2
$$ ##$BF6= 400.2
$$ ##$BF7= 400.2
$$ ##$BF8= 400.2
$$ ##$BYTORDA= 0
$$ ##$CAGPARS= (0..11)
$$ 0 0 0 0 0 0 0 0 0 0 0 0
$$ ##$CFDGTYP= 0
$$ ##$CFRGTYP= 9
$$ ##$CHEMSTR= <none>
$$ ##$CNST= (0..63)
$$ 1 1 145 1 1 1 1 1 1 1 1 1 1 1 1 1 1 1 1 1 1 1 1 1 1 1 1 1 1 1 1 1 1 1 1
$$ 1 1 1 1 1 1 1 1 1 1 1 1 1 1 1 1 1 1 1 1 1 1 1 1 1 1 1 1 1
$$ ##$CPDPRG= (0..8)
$$ <> <> <> <> <mlev> <mlev> <mlev> <mlev> <mlev>
$$ ##$D= (0..63)
$$ 0 1 0 0 0 0 0 0 0 0.06 0 0 0 0 0 0 0.0002 0 0 0 0 0 0 0 0 0 0 0 0 0 0 0
$$ 0 0 0 0 0 0 0 0 0 0 0 0 0 0 0 0 0 0 0 0 0 0 0 0 0 0 0 0 0 0 0 0
$$ ##$DATE= 1643044300
$$ ##$DE= 6.5
$$ ##$DECBNUC= <off>
$$ ##$DECIM= 2496
$$ ##$DECNUC= <off>
$$ ##$DECSTAT= 4
$$ ##$DIGMOD= 1
$$ ##$DIGTYP= 12
$$ ##$DQDMODE= 0
$$ ##$DR= 22
$$ ##$DS= 2
$$ ##$DSPFIRM= 0
$$ ##$DSPFVS= 20
$$ ##$DTYPA= 0
$$ ##$EXP= <proton>
$$ ##$F1LIST= <111111111111111>
$$ ##$F2LIST= <222222222222222>
$$ ##$F3LIST= <333333333333333>
$$ ##$FCUCHAN= (0..9)
$$ 0 2 0 0 0 0 0 0 0 0
$$ ##$FL1= 90
$$ ##$FL2= 90
$$ ##$FL3= 90
$$ [...]
$$ ##$Sgu3PowerLevels= (0..7)
$$ 0 0 0 0 0 0 0 0
$$ ##$Sgu4PowerLevels= (0..7)
$$ 0 0 0 0 0 0 0 0
$$ ##$Sgu5PowerLevels= (0..7)
$$ 0 0 0 0 0 0 0 0
$$ ##$Sgu6PowerLevels= (0..7)
$$ 0 0 0 0 0 0 0 0
$$ ##$Sgu7PowerLevels= (0..7)
$$ 0 0 0 0 0 0 0 0
$$ ##$Sgu8PowerLevels= (0..7)
$$ 0 0 0 0 0 0 0 0
$$ ##$SguType= 3
$$ ##$ShimPowMaxUA= (0..63)
$$ 130000 130000 130000 130000 130000 130000 130000 130000 130000 130000 130000
$$ 130000 130000 130000 130000 130000 130000 130000 130000 130000 0 0 0 0
$$ 0 0 0 0 0 0 0 0 0 0 0 0 0 0 0 0 0 0 0 0 0 0 0 0 0 0 0 0 0 0 0 0 0 0 0 0
$$ 0 0 0 0
$$ ##$ShimPowMaxUC= (0..63)
$$ 130000 130000 130000 130000 130000 130000 130000 130000 130000 130000 130000
$$ 130000 130000 130000 130000 130000 130000 130000 130000 130000 0 0 0 0
$$ 0 0 0 0 0 0 0 0 0 0 0 0 0 0 0 0 0 0 0 0 0 0 0 0 0 0 0 0 0 0 0 0 0 0 0 0
$$ 0 0 0 0
$$ ##$ShimPowMaxUG= (0..63)
$$ 524287 524287 524287 524287 524287 524287 524287 524287 524287 524287 524287
$$ 524287 524287 524287 524287 524287 524287 524287 524287 524287 0 0 0 0
$$ 0 0 0 0 0 0 0 0 0 0 0 0 0 0 0 0 0 0 0 0 0 0 0 0 0 0 0 0 0 0 0 0 0 0 0 0
$$ 0 0 0 0
$$ ##$ShimPowRcbType= 3
$$ ##$ShimPowRes= (0..63)
$$ 1e-20 1e-20 1e-20 1e-20 1e-20 1e-20 1e-20 1e-20 1e-20 1e-20 1e-20 1e-20
$$ 1e-20 1e-20 1e-20 1e-20 1e-20 1e-20 1e-20 1e-20 0 0 0 0 0 0 0 0 0 0 0 0
$$ 0 0 0 0 0 0 0 0 0 0 0 0 0 0 0 0 0 0 0 0 0 0 0 0 0 0 0 0 0 0 0 0
$$ ##$ShimPowRng0= (0..63)
$$ 1 1 1 1 1 1 1 1 1 1 1 1 1 1 1 1 1 1 1 1 0 0 0 0 0 0 0 0 0 0 0 0 0 0 0 0
$$ 0 0 0 0 0 0 0 0 0 0 0 0 0 0 0 0 0 0 0 0 0 0 0 0 0 0 0 0
$$ ##$ShimPowRng1= (0..63)
$$ 1 1 1 1 1 1 1 1 1 1 1 1 1 1 1 1 1 1 1 1 0 0 0 0 0 0 0 0 0 0 0 0 0 0 0 0
$$ 0 0 0 0 0 0 0 0 0 0 0 0 0 0 0 0 0 0 0 0 0 0 0 0 0 0 0 0
$$ ##$ShimPowRng2= (0..63)
$$ 1 1 1 1 1 1 1 1 1 1 1 1 1 1 1 1 1 1 1 1 0 0 0 0 0 0 0 0 0 0 0 0 0 0 0 0
$$ 0 0 0 0 0 0 0 0 0 0 0 0 0 0 0 0 0 0 0 0 0 0 0 0 0 0 0 0
$$ ##$ShimPowRng3= (0..63)
$$ 1 1 1 1 1 1 1 1 1 1 1 1 1 1 1 1 1 1 1 1 0 0 0 0 0 0 0 0 0 0 0 0 0 0 0 0
$$ 0 0 0 0 0 0 0 0 0 0 0 0 0 0 0 0 0 0 0 0 0 0 0 0 0 0 0 0
$$ ##$ShimSysFunc= (0..63)
$$ 1 2 3 4 5 7 9 11 15 16 8 10 12 14 6 17 13 18 19 20 0 0 0 0 0 0 0 0 0 0
$$ 0 0 0 0 0 0 0 0 0 0 0 0 0 0 0 0 0 0 0 0 0 0 0 0 0 0 0 0 0 0 0 0 0 0
$$ ##$ShimSysMatrix= 0
$$ ##$ShimSysType= 1
$$ ##$TFXNUM= 0
$$ ##$TRIPLO2= 0
$$ ##$VTU= 2
$$ ##$VTUETH= <149.236.99.20>
$$ ##$VTUTY= <no>
$$ ##$WBREFAM= (0..15)
$$ 135.5 97.7 100 100 100 100 100 100 100 100 100 100 100 100 100 100
$$ ##$WBREFLM= (0..15)
$$ 0 0 0 0 0 0 0 0 0 0 0 0 0 0 0 0
$$ ##$WBREFPH= (0..15)
$$ 72.26 -67.22 0 0 0 0 0 0 0 0 0 0 0 0 0 0
$$ ##$WBSGU= (0..15)
$$ 0 0 0 0 0 0 0 0 0 0 0 0 0 0 0 0
$$ ##$XFAC= 2
$$ ##END=
$$ 
##$DECIM=	2496
##$DSPFVS=	20
##XUNITS=	HZ
##YUNITS=	ARBITRARY UNITS
##FIRSTX=	6407.6102040000005218
##LASTX=	-1605.0880428824991668
##DELTAX=	-0.12226593800080109986
##XFACTOR=	1
##YFACTOR=	0.020500892982121991098
##FIRSTY=	12.309164047241210938
##MINY=	-0.10250579565763473511
##MAXY=	13802.6572265625
##NPOINTS=	65536
##XYDATA=	(X++(Y..Y))
$$ [...]
2878A871K5M0N3M9L0J4j1m5n8k5K6M0J5LK6N6O0M8L6K1lj0J8O1P6N6L7M4O0O2M8L3K0J0J7
2873B803M6Q1R0P9Q4J06J06P1N2R2J45J45R8Q7J27J55J31J01J17J49J60J65K04K44K47K40
2870F125K79L38L51L31L48M08M45M45M80N69O41O59O92Q02R35J004J032J088J166J208J222
2868B0568J264J322J337J301J284J313J368J451J622J889K203K548K994L579M236M879N517
2865F0675O206O924P575Q058Q317Q305Q001P411O553N412L994K386P28q71k345l622m605n238
2863A23864n563n670n625n432n090m644m207l881l677l532l421l379l415l467l453l377l279
2861E2752l161k980k744k494k241j954j629j316j040p82n20k59J1L12O28R15J170J451J780
2859C7899K105K393K680K988L258L417L505L597L689L716L687L686L760L882M059M359M826
$$ plain form
2878 1871 1896 1936 1989 2038 2068 2082 2071 2026 1968 1943 1969 2009 2024 2027 2053 2109 2169 2217 2253 2274 2271 2261 2279 2340 2416 2472 2509 2553 2613 2675 2723 2756 2776 2786 2803
2873 2803 2849 2930 3020 3099 3183 3289 3395 3466 3518 3610 3755 3900 3998 4085 4212 4367 4498 4599 4716 4865 5025 5190 5394 5638 5885 6125
2870 6125 6404 6742 7093 7424 7772 8180 8625 9070 9550 10119 10760 11419 12111 12913 13848 14852 15884 16972 18138 19346 20568
2868 20568 21832 23154 24491 25792 27076 28389 29757 31208 32830 34719 36922 39470 42464 46043 50279 55158 60675
2865 60675 66881 73805 81380 89438 97755 106060 114061 121472 128025 133437 137431 139817 140545 139674 137329 133707 129102 123864
2863 123864 118301 112631 107006 101574 96484 91840 87633 83752 80075 76543 73122 69743 66328 62861 59408 56031 52752
2861 52752 49591 46611 43867 41373 39132 37178 35549 34233 33193 32411 31891 31632 31643 31955 32583 33498 34668 36119 37899
2859 37899 40004 42397 45077 48065 51323 54740 58245 61842 65531 69247 72934 76620 80380 84262 88321 92680 97506
2857I7506N396N959O457O857P095P071O718O018M979L630K025K26j679l578n344o872q101
2855A34363q957r381r392r118q688q128p417o601n791n048m339l642l023k559k235j972j740
2853C6332j583j529j533j526j497j484j512j545j533j469j384j299j215j125j031r39q46p63
2850A2519p13p07p09o71n93n17m67m22l62l03k74k63k39k15k23k53k52k06j61j59j70j53j13
2848D374r5j04j21j33j36j16o8l5n6j05j23j06r3q6m6J2K3k7p4p7p9j07j04l3L3J1n7o7j4
2844B391Om2r1q7n0j7J5L7J4m6q0m5J4K7j1n1n4k3Npm8q0o7m2m3n6l6OJ3j6k9lK0PoNJ1pj9
2839A515rlk3l7j7J1J2NQLk5l7j2J0j0k8rjm4p8k4O8P0j6p6m4J3K9J8J5QnnMj6o3o8j3L1N
2834A162m7n3k1lmLK0K0Kj7k8l7l4j3J6L5L3Rl1n7l8QK7%k9k4kJ6L6N1K9k9n6j6L2K2j3pL4
$$ plain form
2857 97506 102902 108861 115318 122175 129270 136341 143059 149077 154056 157686 159711 159937 158258 154680 149336 142464 134363
2855 134363 125406 116025 106633 97515 88827 80699 73282 66681 60890 55842 51503 47861 44838 42279 40044 38072 36332
2853 36332 34749 33220 31687 30161 28664 27180 25668 24123 22590 21121 19737 18438 17223 16098 15067 14128 13282 12519
2850 12519 11806 11099 10390 9719 9126 8609 8142 7720 7358 7055 6781 6518 6279 6064 5841 5588 5336 5130 4969 4810 4640 4487 4374
2848 4374 4279 4175 4054 3921 3785 3669 3601 3566 3510 3405 3282 3176 3083 2997 2951 2963 2986 2959 2885 2808 2729 2622 2518 2485 2518 2529 2472 2405 2391
2844 2391 2397 2355 2264 2177 2127 2110 2125 2162 2176 2130 2050 2005 2019 2046 2035 1984 1930 1907 1912 1905 1857 1777 1710 1668 1625 1569 1533 1539 1552 1536 1507 1504 1524 1531 1525 1530 1541 1534 1515
2839 1515 1506 1503 1480 1443 1426 1437 1449 1454 1462 1465 1440 1403 1391 1401 1391 1363 1354 1353 1309 1231 1207 1275 1345 1329 1253 1209 1222 1251 1269 1284 1292 1287 1282 1286 1270 1207 1139 1126 1157 1162
2834 1162 1115 1062 1041 1038 1034 1037 1057 1077 1079 1062 1034 997 963 950 966 1001 1034 1043 1012 955 917 925 952 952 923 899 897 913 949 1000 1029 1000 944 928 960 982 969 962 996
2830I96L9om8n5n0m7l2kRkpJ4L6L2Qj2rJ6M1K8k9p5n5K0P1N6Nl1l7k8j7j2k2l8l2lK7L3K5
2825H07J9J1mj7j2J1K9K7J5K0M0M3J0l5m1mJ8nl5j6L8O9N9M9N7N8K9mpK8O5P2M3J5L2R0J20
2820A694O5k9o7k5K3K6J3K6M4K8j4m1m6m8m5k2J0J4rk5lL3M3K3%qpj4k8l0j6%lk7n7o3m1j3
2816A361k0o5r8p0j1ln8r3m3L7N6K2LJ9K1rk3MK6Rk2k7j3PL5P0Q2N0Mj5PM9R0R4N4ONM3N2
2811A636Pl9m0j9j4j8j8l2n5l6L5P8K9m9n9j7ml4m0pQj6l0oK0J3j2m0p3q5n3j1j4m7m5kOl1
2806H86m2NL8J4j3J3L7Jm6l5Jj1n5n5qJ6QJ6M2L4j3l7j6Kj1j9LK9K9Rj9m5m7KN8N3ol9rK1
2801G91Kj7%J3k1m8j2L7J8l7m1J5M1J5oPMk6l4NL1jm0j6L6M5Nk3qK7M7L7qo3p6k9K0J7j4n
2796F88M2N9K3j5j3Llj2JK5K8J2lj0j2mJ7K8Pl0m7l3mK8N6O2L9Jk2k4k6l6l3qK1L1K5J6Nr
$$ plain form
2830 996 1035 1029 981 926 876 829 797 795 804 802 795 809 845 877 885 873 864 880 921 949 920 845 790 810 881 937 942 911 874 846 829 817 795 757 725 722 749 782 807
2825 807 826 837 833 816 804 815 844 871 886 906 946 989 999 964 923 919 937 932 897 881 919 988 1047 1096 1153 1211 1240 1236 1229 1257 1322 1394 1437 1452 1484 1574 1694
2820 1694 1759 1730 1663 1638 1661 1687 1700 1726 1770 1798 1784 1743 1697 1649 1604 1582 1592 1606 1597 1572 1569 1602 1645 1668 1668 1660 1653 1639 1611 1581 1565 1565 1562 1535 1478 1415 1374 1361
2816 1361 1341 1276 1178 1108 1097 1094 1036 943 900 937 993 1015 1018 1037 1058 1049 1026 1030 1056 1065 1043 1016 1003 1010 1045 1115 1197 1247 1251 1236 1243 1292 1382 1476 1530 1536 1541 1584 1636
2811 1636 1643 1604 1564 1545 1531 1513 1495 1463 1408 1372 1407 1485 1514 1465 1406 1389 1385 1351 1311 1304 1312 1296 1266 1260 1280 1293 1281 1241 1168 1083 1030 1019 1005 958 913 911 917 886
2806 886 844 849 887 901 888 901 938 939 893 858 859 848 793 738 730 746 754 770 812 846 833 796 780 782 771 752 755 784 813 822 803 758 711 713 771 824 818 779 770 791
2801 791 793 776 776 789 768 720 708 745 763 726 685 700 741 756 750 757 761 735 701 706 737 736 696 680 716 761 766 743 735 762 809 846 838 775 699 670 690 707 693 688
2796 688 730 789 812 797 784 787 784 772 773 798 826 838 835 825 813 809 826 854 861 831 784 751 747 775 831 893 932 933 911 887 861 825 792 784 805 836 861 877 882 873
2792H73j9j7j5k1k3jL9N5K1k8m6j8J4K4J6J6J8J1nj2oLOOL%KPKj2j8kJ9J4j5k5JM1O7O5M0
2787A080rn0m7NN9P0M4K0J3K2M1O1N5J4l6n0k8JOj8m9o5m6KM2M4J0k5n0o1o3m8j2K7M6L1j4
2782A022n0m2ML5K8J1J9L6K9Kj4j0ljok9n9n1J6Q6Q9L6OK5M9M3K5J6MnPL6L5jj6J2L2J3rP
2777A427L1Ql3k9J0K5pk6oJ9J4lNK7L1Rj7k7k7j7jJ7J6j4n0o3m3j2lj2k0k4k9l5l3k5j4lJ3
2772A079J4nk1%L3K3k5m9j6K4J8rnK0J2l1m8rM2N1K1pnJ0Kk5l4ON5N3%k8NM7M7K3K0K5RoK1
2767A337O5O9L3J6L3L6Lj3J7N7N7L7M3Q3J36J76J79J48J13J26J88K38K26J81J57J54J29O6
2764D090jl4m1m8p8j17j47j60j57j43j19r2p5o7m2jOn2j31j57j19p8o6n7l7l1n8q3p1l7nK4
2760A816L7J0m5o2pN6N1lk3PM0N6R1J36J29N5j7j5L3N5M0M3Q6J26J23Q9P7R3J08J08J12J37
$$ plain form
2792 873 854 837 822 801 778 777 816 871 892 864 818 800 814 838 854 870 888 899 894 882 876 879 885 891 894 894 896 903 905 893 875 873 892 906 891 866 867 908 975 1040 1080
2787 1080 1071 1021 974 979 1038 1108 1152 1172 1185 1207 1248 1309 1364 1378 1342 1292 1264 1265 1271 1253 1204 1139 1093 1095 1137 1181 1191 1166 1116 1055 992 944 932 959 1005 1036 1022
2782 1022 972 930 934 969 997 1008 1027 1063 1092 1094 1080 1070 1067 1066 1060 1031 972 921 937 1023 1112 1148 1154 1179 1228 1271 1296 1312 1316 1311 1318 1354 1389 1388 1372 1384 1416 1429 1420 1427
2777 1427 1458 1466 1433 1404 1414 1439 1432 1406 1400 1419 1433 1430 1435 1462 1493 1502 1485 1458 1431 1414 1413 1430 1446 1432 1382 1319 1276 1264 1261 1249 1229 1205 1176 1141 1108 1083 1069 1066 1079
2772 1079 1093 1088 1067 1067 1100 1123 1098 1049 1033 1057 1075 1066 1061 1081 1093 1062 1014 1005 1047 1098 1119 1112 1107 1117 1119 1094 1060 1066 1121 1174 1174 1146 1151 1198 1245 1268 1288 1313 1322 1316 1337
2767 1337 1402 1471 1504 1520 1553 1589 1592 1579 1596 1653 1710 1747 1790 1873 2009 2185 2364 2512 2625 2751 2939 3177 3403 3584 3741 3895 4024 4090
2764 4090 4089 4055 4014 3966 3888 3771 3624 3464 3307 3164 3045 2953 2878 2811 2769 2768 2774 2722 2591 2434 2315 2237 2171 2114 2077 2046 1988 1905 1834 1797 1792 1816
2760 1816 1853 1863 1818 1756 1749 1805 1856 1853 1830 1837 1877 1933 2024 2160 2289 2344 2327 2312 2345 2400 2440 2483 2569 2695 2818 2907 2984 3077 3185 3293 3405 3542
2756C542J59J40J02Q9J14J30R4K7k4m6o2j04j64j99j83j29q5p7r1r2q1p4p6o4m0k1j5oPLk2
2752B752m0l1qJ3L1L9K3l%L1M8K5lLK5L2L1M5O0N0L0K9L9L8L8N5O3L9J2L8R6J17Q5N4O4R3
2748D013J10J18J37J63J85J92J85J64J55J74J99J95J80K04K65L07L07L11L49L94M16M44N18
2745I685O18O96P49Q25R44J081J201J301J392J481J561J621J651J650J612J526J405J296J244
2743C3539J255J322J470J747K149K642L224L932M774N728O781P939R126J0179J0962J1433
2741A18202J1576J1299J0461Q983O893M322J490j333l905o051p632q551q822q610q096p374
2739A12852o497n592m811m210l764l472l381l477l664l860m039m173m182m030l766l468l154
2737D3312k808k439k082j752j439j138q58n96l45r4J66M35P02R54J223J545J923K308K671
$$ plain form
2756 3542 3701 3841 3943 4032 4146 4276 4370 4397 4373 4327 4265 4161 3997 3798 3615 3486 3401 3324 3233 3141 3060 2986 2910 2846 2806 2785 2770 2764 2771 2774 2752
2752 2752 2712 2681 2673 2686 2717 2756 2779 2776 2776 2807 2855 2880 2877 2880 2905 2937 2968 3013 3073 3123 3153 3182 3221 3259 3297 3352 3415 3454 3466 3504 3600 3717 3802 3856 3920 4013
2748 4013 4123 4241 4378 4541 4726 4918 5103 5267 5422 5596 5795 5990 6170 6374 6639 6946 7253 7564 7913 8307 8723 9167 9685
2745 9685 10303 10999 11748 12573 13517 14598 15799 17100 18492 19973 21534 23155 24806 26456 28068 29594 30999 32295 33539
2743 33539 34794 36116 37586 39333 41482 44124 47348 51280 56054 61782 68563 76502 85628 95807 106769 118202
2741 118202 129778 141077 151538 160521 167414 171736 173226 171893 167988 161937 154305 145754 136932 128322 120226 112852
2739 112852 106355 100763 95952 91742 87978 84506 81125 77648 73984 70124 66085 61912 57730 53700 49934 46466 43312
2737 43312 40504 38065 35983 34231 32792 31654 30796 30200 29855 29761 29927 30362 31064 32018 33241 34786 36709 39017 41688
2734D1688L012L325L558L673L685L622L494L319L147L044L039L165L467L987M700N513O312
2732A05750O981P408P500P198O461N243L548J466q50l227n477p405q853r761j0148j0044r509
2730H6281q693p794o931o093n248m432l723l132k623k180j814j517j276j114j061j106j182
2728B6362j243j302j363j401j389j343j281j198j096j007r41q68p64o70o27o01n29m21l64
2726G954l81l91l29k39k01k12k16j98j90j89j66j20r7j13j35j23r8r2j17j47j65j55j24q8
2723C668p7q5q6p2o7q9j18j19q9n7m5m7m1k3j0k8p5j05p7j7Qk9p3n9lK4rn8p5n9m5l6k2j1
2719A894k3n3o1l1Kj2n4o8k7K6M2K4Lj6l6l9oL0J1n2q4l4M3O3J9k8k8nlk3m0l6k6k5l1k4M
2714A296L1L1J1LJ3J4j1m0m7l2j7o%RJ9L0K9%m4o5n0k3qKJ7K0Jj2mnm1p6n7KL3J9J2L6M6J2
$$ plain form
2734 41688 44700 48025 51583 55256 58941 62563 66057 69376 72523 75567 78606 81771 85238 89225 93925 99438 105750
2732 105750 112731 120139 127639 134837 141298 146541 150089 151555 150705 147478 142001 134596 125743 115982 105834 95790 86281
2730 86281 77588 69794 62863 56770 51522 47090 43367 40235 37612 35432 33618 32101 30825 29711 28650 27544 26362
2728 26362 25119 23817 22454 21053 19664 18321 17040 15842 14746 13739 12798 11930 11166 10496 9869 9268 8739 8318 7954
2726 7954 7573 7182 6853 6614 6413 6201 5985 5787 5597 5408 5242 5122 5025 4912 4777 4654 4556 4464 4347 4200 4035 3880 3756 3668
2723 3668 3591 3506 3420 3348 3281 3192 3074 2955 2866 2809 2764 2717 2676 2653 2643 2615 2540 2435 2358 2341 2349 2320 2247 2188 2185 2209 2200 2142 2067 2008 1963 1927 1905 1894
2719 1894 1871 1818 1757 1726 1728 1716 1662 1594 1567 1593 1635 1659 1662 1646 1610 1571 1565 1595 1606 1554 1470 1436 1479 1542 1561 1533 1505 1500 1497 1474 1434 1398 1372 1347 1316 1292 1296
2714 1296 1327 1358 1369 1372 1385 1399 1388 1348 1301 1269 1252 1246 1246 1255 1274 1304 1333 1333 1289 1224 1174 1151 1143 1145 1162 1182 1183 1171 1167 1162 1121 1045 988 990 1023 1042 1054 1090 1136 1148
2709A148k4j4J2Ml2m3k2jPJ5J7pm7n4j2L3L3QMJ7J4k0m5l3KJ9NoJ4M7N8K5k1l9k5j0j5k8k6
2705I58pPPMRK0J8Lj0oJ2K2Kl3m8k8PK3J6OQJ2Kj7j9olk7o3o9k9K8O1N9L4Jl1m4k5J2K5nn0
2699H36n9k7J1K6K3K3K7J7ql9o0n2j1M9Q5O6Nn3p1n4k8rJ0L3M8L4j0n6o9n1k2PL5O0O2L7J0
2695H25PJ9K1Nj1k2l0l3k4qLRJ1%k5l4PO8P3No3o0lL2J4j5k7l2l7j7M2Q8P0ln9m3J0L0mm8
2690G41n4l2j8k2k2jK3K1jj9j4J5M6N7M4K8K2J1k3n8m9JL8K1k0l4k2k3m8o5m7pK8M6N0L9J5
2685F67prMK5L2J6k4n9n9j7K3K3pj7J5N1M4Lk0r%j9k0K3O5L1m8p3j0N9N7Qk2k5j3J2M4L1l1
2681G44o3j2N9N1j0k8kj6p0o4K5P7J8o4o6k2j1j4K9P1L4m4m8K9O1jn5j5N2N0kj7J7K6j8o0
2676F41m9LL7L2Kk8l7k6lJ9L4L7J5j9k8KM0L8Kj0J9L3j5p7o7J0O0K9l1l1K5N8L1j2k6j9j0
$$ plain form
2709 1148 1124 1110 1122 1126 1094 1051 1029 1028 1035 1050 1067 1060 1013 959 947 980 1013 1021 1025 1042 1056 1036 991 958 960 979 984 978 992 1039 1097 1122 1101 1062 1037 1027 1012 984 958
2705 958 951 958 965 969 978 998 1016 1019 1009 1003 1015 1037 1039 1006 958 930 937 960 976 982 990 1002 1004 987 968 962 959 932 869 800 771 799 860 919 953 954 923 879 854 866 891 886 836
2699 836 777 750 761 787 810 833 860 877 869 830 770 718 707 756 841 907 912 859 788 734 706 697 707 740 788 822 812 756 687 636 614 621 656 716 778 815 825
2695 825 832 851 872 877 866 844 814 781 757 749 752 761 772 772 747 713 720 788 861 866 803 743 740 772 786 771 744 712 675 658 700 788 858 855 796 753 763 793 789 741
2690 741 687 655 637 615 593 592 615 636 635 616 602 617 663 720 764 792 814 825 802 744 695 696 734 755 735 701 679 656 608 543 496 489 517 563 613 652 667
2685 667 660 651 655 680 712 728 704 645 586 569 592 615 608 591 606 657 701 704 684 675 675 656 636 659 724 755 707 634 624 683 740 748 726 701 688 700 744 775 744
2681 744 681 669 728 779 769 741 739 723 653 589 614 691 709 645 579 557 546 532 561 632 666 622 574 603 664 663 608 593 645 695 693 676 693 719 701 641
2676 641 592 595 632 664 666 638 601 575 572 591 625 662 677 658 630 632 672 710 712 702 721 754 739 662 595 605 665 694 663 632 657 715 746 734 708 689 679
2672F79JK6L9J5k5l9j7J4K0Rnj2k2l0k1QM2N2K2k4m6l2%K3K2om7o2l3J3K0oj4K2N2K8j7k7
2667F22JJ4MOL0M2K1j0j4NK4K3Ok0l6k6MK2J4nj0lkj2k4j8J6O0Q7P6M2Pk2m2m2j0L2L9Pj9
2662H89pK7M3L9L5M2M5L6J8J4J9J6ok3oM1O5L3l7r1r4m5K2N4K6k3k4K1M1po3n8k2k9o6n9j0
2658H56Qk3l4MK9Oj3K1N8L5j8l4j0Jopmj6j9J2M8L5j5m2l4k8l0nM6O6L2jJ8P0R7P6L4MKJ8
2653A237J8mj7LK8Pl9m7qOl9p9n0K3N6K0l2m8j7K6M9L3ql4l0j5j1k1k0rlj0k6l6l1j5j1l3
2648H13o9q1n4j8nomMJ1J6K2J9Pnm%j0k4k6j2J0K1J2j1k2LM6N4Jo5q0m4nJj0j2KK0K1J0QL0
2643E64N2M1j0m9m6j5PJ3J3Kj5k1LK9K8OjJ1J3ok1k1j9k6k4rNQQJ5K4K0Qj2k5j8J2L4K4qk3
2638E71j3lpj1mlpnPLpJ0N1O1Oo2p9m4lK3M1M6K3j0k2j1MQQLrqJ8L9J6l2m8j7J6J9N%rk7l6
$$ plain form
2672 679 680 706 745 760 735 696 679 693 713 722 717 705 683 653 632 640 682 734 756 732 686 654 654 677 699 693 646 584 551 564 584 578 564 586 638 666 649 622
2667 622 623 637 641 647 677 719 740 730 716 721 745 768 774 754 718 692 696 718 732 727 717 714 712 700 676 658 674 734 821 897 939 946 924 882 840 830 862 901 908 889
2662 889 882 909 952 991 1026 1068 1113 1149 1167 1181 1200 1216 1210 1187 1181 1222 1287 1320 1283 1192 1098 1053 1075 1129 1155 1132 1108 1129 1170 1163 1100 1042 1020 991 925 866 856
2658 856 864 841 807 811 840 846 833 854 912 947 929 895 885 886 880 873 869 853 834 846 894 929 914 872 838 810 780 775 821 887 919 918 936 1006 1103 1179 1213 1217 1219 1237
2653 1237 1255 1251 1234 1237 1265 1272 1233 1186 1178 1184 1145 1066 1016 1039 1095 1115 1083 1035 1018 1044 1093 1126 1118 1084 1054 1039 1028 1007 987 978 975 965 939 903 872 857 846 813
2648 813 744 663 609 591 586 580 576 580 591 607 629 648 655 650 646 646 636 612 586 574 584 605 617 606 584 587 633 687 688 623 543 499 494 495 485 473 475 495 516 526 534 564
2643 564 616 657 647 598 552 537 544 557 570 572 557 536 539 568 596 602 601 612 625 619 598 577 558 532 508 499 504 512 520 535 559 579 587 575 550 532 544 578 602 594 571
2638 571 558 555 548 537 533 530 523 518 525 528 521 531 582 643 649 587 508 464 461 484 525 571 594 584 562 551 555 563 571 574 565 557 575 614 630 598 550 533 549 568 573 573 564 537 501
2633E01j6K0M1L7K0KjNlk8m1j5J7Pl1l2J3L1j0n0l7mj2l6j7L3N3L7L6N6M4rl7j6mm0p7m9J9
2628D07N0K5j0j9j1JJ8L3L1J2KNNjPL3M6J6k7l6oJ3j1m2l2J0K6NpJ7M2K6%PL5K6k2n2m3l6
2623E43n0m3J6P3O8J9j0lJj1k0j6rML3N5M3J1l%j9n3n4pL2K1j5k7k2k6k8j4Lok9l1j1J6M4
2618D75O8O5J7l9m2OM6L6J1OJ3Prj6k2l3l0%L0J7l0n4k0L1M1Ll3l1kJ8J1rk1j2J9N3O0K0m3
2613F07q2o9k5QJ6J0QLj0k4pM4R8R4K5m9o0j9Mk9o7m1L5P7M6j4m1k5jJ4J8Rj5l1k0J3L3K2
2609E55mk4j6J9N8N8Rm6m8lK2kl1j4K7L0pl7l2j2PK4K7lm1l5J9N4K7j7k2OPk0l6j8NOk%J5
2604E05L6M6L4Mj7rP%j9k3j8k7l7qM5O1K3j9j7QK0J8J2lk4k4MJ8nl3k7%J3J2J8K3J2jMJ3%
2599F25j0PK5Ll8l8NK7kl3j8J6K4pm3n5l3J2M6M5J1k6m7m1rL3M3Ok8j2K4K3j5k5PK6Mk4k3
$$ plain form
2633 501 485 505 546 583 603 605 604 609 606 578 537 522 539 546 515 483 496 527 517 467 430 426 414 378 361 394 447 484 520 576 620 611 574 558 554 514 437 388 407
2628 407 457 482 472 453 442 443 461 494 525 537 539 544 549 548 555 588 634 650 623 587 581 594 583 541 509 519 545 550 543 560 602 628 628 635 670 696 674 622 579 543
2623 543 493 450 466 539 607 626 616 613 614 603 583 567 558 562 595 650 693 704 701 701 682 629 575 568 600 621 606 579 557 531 503 489 492 486 457 426 415 431 475
2618 475 543 608 625 586 544 550 596 632 643 649 662 669 660 644 622 589 559 559 589 606 576 522 502 533 574 577 544 513 511 529 540 531 510 498 517 570 630 650 607
2613 607 525 456 431 439 455 465 473 476 466 442 435 479 577 671 696 647 587 568 572 543 476 435 470 547 593 579 538 513 512 526 544 553 538 507 487 500 533 555
2609 555 551 527 511 530 588 646 655 609 561 558 580 578 547 533 560 590 583 546 514 502 509 533 560 557 516 481 500 554 581 564 542 548 555 535 499 481 486 492 490 490 505
2604 505 541 587 621 625 608 599 606 606 587 564 546 519 482 474 519 580 603 584 567 575 595 613 625 622 598 574 578 596 591 558 531 531 544 556 574 597 609 608 612 625 625
2599 625 615 622 647 650 612 574 579 606 604 571 553 569 593 586 543 488 455 467 513 558 569 543 496 455 446 479 522 528 500 488 512 535 520 495 502 528 532 508 485
2594D85j4lK3N3L6k5n2oM7L4j6k7JOj9l0j5qk1k5j4nML2O6N8Rk5j3J4J2ooJ7L3J7j9n1m7j4
2589D86J4J7J1J7J7j5n0l7J9N6M6K1Kj7l4j4M0O5K3m5p6o7m5pN2R2O5Kk9j1J2J4J9L0J4l0
2585F57n2k6Nj3n8o4k8lj4k0J3N7N9J5l1l6j0J9K5J6MJkk0m3m3j0K6K9Lj1MK4L6M3M7L6Pp
2580F35KLk7n5l8J1K9pm8m8rL8N8L7rm0k0K4M0J7kJ1K5Qk4k7nLrj2PK4J5JOK5K1j5m4k9J3
2575E85L7J6j6k6k0k3l1l0j3QK9M9N0K1j4k4k1l3n5m8j2K0L2M9O7M5k1n4rN2N2%k4jJ4j0m0
2570F01m5l3j6J1M0M1Mk8j9QJ7LjJ9M4M6K1j8m3l8j4joj5j9k0k2j5PL2M3K4k0o1o0j0M4N0
2566E51J2j5j7k5m6l5K0O2L4l0n1j0L7M2K0NLQJ9L0K6Nj5k4k0j1nj2l4m6k3J8L1Jl0j9J6K9
2561E01J6J0K7L5Pl7n9m9l4k3pK2M2M0L4M6O2L9k1o1m4%J3pk1j0KLRK4K4rm2m0j1O%j0qJQ
$$ plain form
2594 485 471 468 491 544 580 555 503 497 544 578 562 535 536 542 523 493 478 470 449 424 410 405 409 441 507 565 574 549 536 550 562 556 550 567 600 617 598 547 500 486
2589 486 500 517 528 545 562 547 497 460 479 535 581 602 604 587 553 539 579 644 667 622 546 479 434 427 479 571 636 638 609 598 610 624 643 673 687 657
2585 657 605 579 584 571 513 449 421 418 404 384 397 454 513 528 497 461 451 470 495 511 515 516 514 494 451 408 398 424 453 456 445 449 473 509 552 599 635 642 635
2580 635 637 640 613 558 520 531 560 553 505 457 448 486 544 581 572 532 512 536 576 593 591 602 627 635 611 584 579 582 573 561 568 592 607 608 614 639 660 645 601 572 585
2575 585 622 638 622 596 576 553 522 492 479 487 516 565 615 636 622 598 577 544 489 441 429 449 481 530 597 642 621 567 558 610 662 662 638 637 651 641 601
2570 601 556 523 507 518 558 599 603 575 556 564 581 584 583 602 646 692 713 695 652 614 600 599 593 578 559 539 517 502 509 541 584 608 588 527 467 457 501 551
2566 551 563 548 531 506 460 425 445 507 541 511 460 450 487 529 549 554 557 565 584 614 640 645 630 606 586 575 570 558 524 478 455 473 504 505 475 456 472 501
2561 501 517 527 554 589 596 559 500 451 417 394 387 409 451 491 525 571 633 672 651 590 546 546 559 552 531 521 523 526 535 559 583 574 532 492 481 487 487 477 469 470 478
2556D78K3L8L9K1NLok9m5k9KK2K0RLmmJ5M5M6Jn6n9j0L1Qm9n9rL3J9j7j6J5K3lj7KJ4lj4J3
2551D99M4K9k0m6k6OJ8J9J1qk5k5kJ6J4KjJ0K9L5J4j9k4QK7pn1m0J6L7Rj0J5L6Pk9j3L3M0
2546F28%l8l8j5J2K5J5oj2PJ7ql0j2J8Rk1j2L7N5J3l3l3j1j0k3j3J4K5RmQK7K7Jk8l4j5MO
2541E61kpj3k4j7J4M7L8NqJ3K9J4j4k4j3JMrl0l6j6QRMJ8L0Mm7o6l7j2j9k2NL5L6K8L9N2L6
2536F14Mj1qpj0j4j8j0J6L8J4l9n2pL0J4oJ6M0J6k8k8klj8JM1L9ll6m3n4n4j6K8J3l5k2N8
2531D58J05O6Kk8m2n3k8L7O6K1k5j1J9Nl1k5RJ7NJ1J8mk3ML5Mn7n6J7O5L4j5j8Kmk3k0jLo
2527E33%L3O2N7J6l1m4k1Kjj1JJ9J0k1l7k0NJ4Qjo%K0K5Nj8j3Jj5m2l0J8L8Nl0k5PK7L1L2
2522F03K4NmLLj3k3j3lnKJ9Nl9n5j0L5J8k3k0J2Nk9j4N8R8N1j6l8k7l1l2kL3K4j2j3K0L2K
$$ plain form
2556 478 501 539 578 599 604 607 601 572 527 498 500 522 542 551 554 550 546 561 606 652 653 597 538 528 559 567 518 459 450 483 502 485 469 484 507 504 487 489 503 500 486 499
2551 499 543 572 552 506 480 486 504 523 534 526 501 476 474 490 504 506 505 515 544 579 593 574 550 558 585 578 527 487 503 540 549 539 554 590 597 568 555 588 628
2546 628 628 590 552 537 549 574 589 583 571 578 595 587 557 545 563 572 551 539 576 631 644 611 578 567 557 534 521 535 560 569 565 573 600 627 628 600 566 551 555 561
2541 561 559 552 539 515 498 512 559 597 602 594 607 636 650 636 612 599 600 604 595 565 529 513 521 530 534 552 582 586 539 473 436 424 405 383 388 423 459 487 526 578 614
2536 614 618 607 599 592 582 568 550 540 556 594 608 569 517 510 540 554 548 564 604 620 592 564 562 559 541 542 583 622 619 583 540 486 432 416 444 457 422 400 458
2531 458 563 629 631 603 561 508 480 517 583 604 579 568 587 592 561 536 545 562 567 578 596 592 569 573 608 612 555 499 516 581 615 600 582 584 580 557 537 536 539 533
2527 533 533 566 628 685 701 670 626 605 607 606 595 596 615 625 604 567 547 552 566 574 573 567 567 587 612 617 599 586 587 572 530 500 518 556 561 531 506 513 540 571 603
2522 603 627 632 628 631 634 621 598 585 582 577 579 598 603 564 509 499 534 552 529 509 521 526 497 483 541 639 690 674 636 609 578 546 544 577 601 589 576 596 628 630
2517F30j8kJ4ml0k2J0J8nl0k4%J6J7Nj2k8l4k6j0OK6L8L3Pj9k6j6pnmKJ1J7K4K7K1Jk1l8m1
2512E01k6JK7L6K3KlRJ5qm4o1l4J0L0J5omPQmrkOJ4K4L2K7J1mj5j8pJ4K0%j5KK6Rl2m0rLk5
2506E06l7NM6L0j5k2J1L5L3K1Kl5o0l1K4L1j1k9OL8K7J1J7J4k4n1k5J2Mk9k5Jml1k3K1L9J0
2501D92qJ9M1J3l4m2k3k2k7nM2O6N6M0K6jl4l0J1K9om2k6K2L8J1k0l3m4m9k1K9M9K0pNK3O
2497E64k3j4K0L0J1MJ0kk4j6J5%o7j02m4L9N5J6jK2M0L4K6J9j2m9m0J1M5K1j7k0KJ5Oj1k2
2492E41j8JJ3Lj2lJ1j1o1p0j3M6M5Kk2j4LJ7L3L5J8RJ5Nl1m5j4J4j9o4l3N5Q9L3l1k6J1K1
2488E33OJ1L2L3Km3p5o3lO6P3J1n0m4PL9L5J2j9n4n5mN2M6j1m5k7%kj2pJj1j3J6M6K7j8k4
2483D68K4N2J5l8l0K2M0%l4j8QO%K1L1j2o6n2K1N1Pk5J4O7N5nm7m1j6J5M8N7K0k1k2kj4l7
$$ plain form
2517 630 612 610 624 620 590 568 578 596 591 561 537 537 553 570 575 563 535 501 475 465 471 497 535 568 575 556 530 514 507 502 498 500 511 528 552 579 600 601 580 542 501
2512 501 475 476 503 539 562 564 561 570 585 577 533 472 438 448 478 493 487 483 490 498 494 485 483 489 503 527 559 586 597 593 578 560 553 567 587 587 572 574 600 609 577 537 528 531 506
2506 506 469 474 520 550 535 513 524 559 592 613 615 580 520 489 513 544 533 504 510 548 575 586 603 617 593 542 517 529 533 504 479 480 476 445 422 443 482 492
2501 492 484 503 544 557 523 481 458 436 409 404 446 512 568 608 634 633 599 569 580 609 603 561 535 557 595 606 586 553 509 460 439 468 517 537 530 535 558 564
2497 564 541 527 547 577 588 592 602 600 576 560 575 575 508 406 362 401 456 472 471 493 533 567 593 612 600 551 511 522 567 588 571 551 553 568 574 563 541
2492 541 523 524 537 540 528 525 536 525 464 394 381 427 472 474 452 438 441 458 491 526 544 553 568 573 542 497 483 497 478 414 381 436 525 558 527 501 512 533
2488 533 539 550 582 615 617 574 499 436 433 499 572 583 533 489 496 535 570 582 563 509 454 450 502 548 537 492 465 465 463 451 444 445 434 421 437 483 510 492 468
2483 468 492 544 559 521 491 513 553 553 519 501 509 515 515 536 567 555 489 437 458 509 516 491 505 572 627 622 575 534 518 533 581 638 658 637 615 613 599 562
2478E62k2K7M5J3j2kJ1ok7k6j8j7pJ2Ml4m8mN3N1Kk9j6NOkJJ2K6M0M0J9j0j8j1j4k9l0j5p
2473E25j9k6j1J3K5K1J4Jj3j3J2L5K0j9l8j3J9K5J3J3K1J8OKLj5m9n8j9L0M3J2k4l4j6J1K6
2469E41Rj8j7J6L7J3j3KL3J7m0o7l6J0K8K2J6Kk1k4NL8L8J0j8l3k2J2M2K8j2k5JPl8o7k5L8
2464D89M0j1l4j3PjJK9L8Rj9rJ4J1j2k4j2QK1K6J9ol9m8k3K0L7J1l1n2m5l7k5J4O5P2K1k7
2460D84j4K2J2k4l1mMj3lL8N0J1k2pK1J7oj5j1nPK4K5Jj0J3L2Ql6n1l5j2%ROlNL3M4Ql6l4
2454E02LJ6j2l9k7J2M7M6Kn4o7j4M5N0J6MJ8K0KlQPj2lM1O5K5m1n9k5J4J8lk2k5oK3L0Jl7
2449E66m6j3K9M9L9J1j7l3l3j8jN%njJ0J8J4%k2m0l5%M5N8K7k8o4n8j2L5L7kk7jL6K2k1k9
2445D95NK1qk2QL3K5K7N9N2l7j15p7K0M0j3j5N5Q6K3l6j8Rk2n6j3N7N2j6n6l7j3jK0M7L6q
$$ plain form
2478 562 540 567 612 625 613 611 622 616 589 563 545 528 521 533 537 503 455 451 504 555 557 528 512 517 523 521 522 534 560 600 640 659 649 631 620 606 577 547 532 525
2473 525 506 480 469 482 507 528 542 543 530 517 529 564 584 565 527 514 533 558 571 584 605 623 629 631 634 619 570 512 493 523 566 578 554 520 504 515 541
2469 541 550 532 515 531 568 581 568 570 603 620 580 513 477 487 515 537 553 555 534 510 515 553 591 601 583 550 528 540 582 610 598 573 574 581 543 476 451 489
2464 489 529 518 484 471 478 477 478 507 545 554 535 526 540 551 539 515 503 511 532 558 577 571 532 484 461 481 518 529 498 446 401 364 339 353 418 490 511 484
2460 484 470 492 504 480 449 445 449 436 433 471 521 532 510 503 524 541 535 520 509 504 511 535 560 561 551 564 596 604 568 517 482 470 470 479 485 482 487 520 564 572 536 502
2454 502 505 521 509 470 443 455 502 548 550 496 429 415 460 510 526 530 548 568 570 567 575 582 570 567 608 673 698 657 598 573 587 605 602 580 555 549 572 602 603 566
2449 566 520 507 536 585 624 635 618 585 552 534 533 538 538 533 532 542 560 574 574 552 512 477 477 522 580 607 579 515 457 445 480 517 515 488 487 523 545 524 495
2445 495 500 521 513 491 499 532 557 584 643 695 658 543 466 486 526 513 498 553 639 662 626 608 617 595 539 526 583 635 619 563 526 513 512 532 579 615 607
2440F07k6%J7ol6l0nRLkomMK0J8rl9m2k0Jmk2k0QL0J0l7o1l0K1N7P6P7M1k2o1l5K0M0J6qj5
2435E35k2k8j1K0K3j1l9l3nK0L1K9J0rnK1L5K7J2mk6m0j9K2K9ok2%J3k1n8m0NJ4qnK4L1%q
2430D81K9O6N3J0k0l5m7l9KL6J6l6m4PM8K9j5j0L7O1K1l6m8pL7M7K5JjK0L1Kn8r3p1j9J6K0
2426E16J4Onj1NL5M3Rl5n3m0oM0P1M9j9o6l5L9O7K9j4j8j5m4o0qP2P9%o6l8L2M9Qk2k2k1k6
2421E39lL8L7k1o0k4L6M7J9LKk2n6n2j0K2K5J8J2j4m5m0lJ2pj5RJ9pk5MM7N4L2K1J5ql8m3
2416E18k0PJ9J7Kj8j8%lk9k5L5Q5N1k6m1J8O2L7j7l6k4j6j9k5l3l8k2KJ1JJ0L9M9K1j2k0j4
2411E28k0k4pJ0lk3qL6O1M7J9Krj9j7JJ3Mj5k0oKrj9mK5K6j1n0m2ML9L7J4npLJ2jl1n0k7J5
2406D71K8Pj1nJ1K0L4M7L2j5n2m1jK6L0K1ROK7M9K6l9p5l9J3J2k6l5j4j7m3l4K0N3K7JK8O5
$$ plain form
2440 607 581 581 598 592 556 526 521 530 533 531 525 521 525 545 563 554 515 473 453 454 450 428 408 416 446 456 419 358 328 349 406 482 559 600 578 517 482 502 542 558 550 535
2435 535 513 485 474 494 517 506 467 434 429 449 480 509 519 510 505 526 561 588 600 596 570 530 511 533 562 556 534 534 547 526 468 428 433 447 439 434 458 489 489 481
2430 481 510 576 629 639 619 584 537 498 500 536 552 516 472 479 527 556 541 531 568 629 650 614 566 559 596 643 668 669 668 688 719 721 663 570 499 480 496 516
2426 516 530 536 531 520 525 560 603 612 577 524 484 478 518 589 638 619 553 518 557 624 653 639 621 606 562 502 494 566 645 645 579 541 573 622 630 608 586 565 539
2421 539 536 574 611 590 530 506 542 589 608 611 613 591 535 483 473 495 520 538 550 536 491 451 448 460 453 438 447 466 459 434 438 485 539 571 592 607 599 561 518
2416 518 498 505 524 541 543 525 507 507 504 475 450 485 570 621 595 554 572 634 671 654 618 594 578 559 534 501 463 441 443 454 455 465 504 553 574 562 542 528
2411 528 508 484 477 487 484 461 453 489 550 597 616 618 609 590 573 574 587 591 576 556 550 552 543 524 520 545 571 560 510 468 472 511 548 562 557 550 553 565 564 533 483 456 471
2406 471 499 506 495 490 501 521 555 602 634 619 567 526 525 551 581 602 611 617 644 693 719 680 605 566 579 591 565 530 516 499 456 422 442 495 522 523 551 616
2401F16M9rm1l7k9l2k1J9N1M7K5J9K9K7jl7n1l9k2j7j7pJ3K5J7MonJJ4K2J2j5m3m6k1J9M7
2397E60L7kl2k1J0K0LnKJj6j8NJ7j2m4l3JKl2m1NO3P4L4j7m5l9j6PJ6J3Qjj6j8NM0N1K7nk3
2392E65l3l4j5J6K3j4o0o5k0L4O1N3K5pk6k6j4LK2L9M2J6k1m2m1k7j1J0L0K8J2PK1K4jk2%
2387E52L8L5j9n9l6K2N6N1K9Oj6k1OL5K3l0o4n3l7m9n9k0M2O0K2j7k1j6k6k6J1O2P7M6Lk0
2383E87j9qMMlKK4L2jn4o8l4JLqOL5L6Pj5qPOJQJ8Rj6k0MK9K0mlL0N5L2k0n2l9j3or%K0J4
2377E94k1m5k1K6M6J3l1m1j4J4J7NRL1M5K2k2m3k5LKk3l8k8j6j6pK1M9M6K0LJ1K5J7j8n5o0
2372D95j4N0P6L7k2m6l1j3j5j8j1noQL0K5k3n4rO6P6mq2p4qL7L7L3M0K7k0n9m2J4M2K3nlK3
2368E75L4J7j4l5l0kK2Rl9p2n3LM6N3M1J8k2n6m1K4P8O5J6oLLj6j4K3N3L8pl4l3j5JQlk7m5
$$ plain form
2401 616 665 656 615 578 549 517 496 515 566 613 638 657 686 713 712 675 624 585 563 546 529 522 535 560 577 581 575 570 571 585 607 619 604 561 515 494 513 560
2397 560 597 595 563 542 552 572 575 570 572 573 557 539 544 561 549 505 472 473 475 443 402 407 470 544 578 561 516 477 461 468 484 497 505 504 488 470 475 515 566 593 588 565
2392 565 532 498 483 499 522 508 448 383 363 397 458 511 536 529 503 477 463 466 488 527 569 585 564 522 481 454 443 453 483 511 523 530 551 575 574 552 552
2387 552 590 625 606 547 511 533 589 640 669 675 659 638 644 679 702 672 608 555 518 469 410 390 432 492 514 497 476 460 434 408 419 481 558 604 607 587
2383 587 568 560 564 568 565 567 591 623 622 568 500 466 467 470 462 468 503 539 546 531 523 530 536 537 545 563 572 556 536 540 569 589 585 582 612 667 699 679 627 588 575 569 560 560 580 594
2377 594 573 528 507 533 579 592 561 520 506 520 537 542 551 582 627 649 627 584 559 562 564 541 503 475 459 443 436 457 506 552 572 575 586 611 628 610 555 495
2372 495 481 531 607 644 622 576 545 532 517 499 488 483 477 485 515 540 517 463 454 520 596 592 510 436 428 465 502 535 575 602 582 523 481 495 537 560 555 552 575
2368 575 609 626 612 577 547 545 567 576 537 465 412 415 461 514 555 573 551 495 454 478 556 621 637 631 634 637 621 607 630 683 721 714 680 647 632 633 641 638 611 566
2363E66l6pK1K8J2nmK5N0L6j1m7l7KK6J9rl5m6l0jPj3k3LM2M4J0j9j6J1M5O6N5Pm7n7k3%j4
2358E95l6k5J1L4L3K8K0Kk0k8k0j5k0j6jJ1J0Ljqk7m1k2K6O1M9nm9n0j9PRkj2j2KK0K3Kk6
2353D91k5RM2N1M2L1J3j1j4J4M2K8j6l2oK3J7j2k8l2l8l4nK9K5j3l6nM3N7J8k9m7l2j1lj1
2349E35j7j3NK4K6RnLJ9J8rl7m2k4QM2O2M0j9o5n3jJ7k2o5n6j0J5J2J6L8M9L5K2K1J1j9l4
2344E36KN4O1J6l1m5l2j1PJ4ll0k6K0O1N0nm7l8%J7j0m6l9J8O1L3l1m7OM7J8l9l9J4M3K6P
2339E92J3Rk4m7k6RJ4JJJk8o0m0K3O2N5M1M2K3l2o6l2L1M4Lj7J4L3po2n7RN1J7m8o9k7J9K3
2334D88JoRJ4jrOL1L4K0Kj0j8j5m%j5k4LM0M0kl2k3KOkLPmj1J2M1L1j6m5k4RJ0j6l3k4nLm
2329D69pJ1L9M0Jl2k0J6K2lj1J2K1mk2kJ8Oj0OJ7j7n8l7K2L1j6m2j1J8RQM3O8L1k7m2k1j7
$$ plain form
2363 566 530 523 544 572 584 579 575 600 650 686 675 628 591 593 619 638 629 594 548 518 517 524 511 488 491 533 577 587 568 552 563 608 674 729 736 689 632 609 609 595
2358 595 559 534 545 579 612 640 660 662 642 614 594 579 559 543 542 553 563 566 565 557 530 489 467 493 554 603 598 549 499 480 487 496 494 482 470 472 492 515 517 491
2353 491 466 475 517 568 610 641 654 643 629 643 685 713 697 665 659 682 699 687 659 627 589 555 550 579 604 591 555 550 593 650 668 639 592 560 549 546 535
2349 535 518 505 510 534 560 569 564 567 586 604 595 558 516 492 500 542 604 644 625 560 507 506 523 501 436 380 370 385 397 413 451 500 535 557 578 589 570 536
2344 536 538 592 653 669 638 593 561 550 557 571 568 538 512 532 593 643 638 591 553 553 570 560 514 475 493 554 587 556 509 515 562 580 541 502 516 559 585 592
2339 592 605 614 590 543 517 526 540 541 542 543 515 455 415 438 500 555 596 638 661 629 563 531 562 606 609 592 606 639 632 570 513 522 573 590 542 473 446 465 488
2334 488 489 483 492 506 505 496 502 533 567 587 589 579 561 546 542 542 527 503 506 546 586 584 552 529 531 537 535 538 545 541 530 542 583 614 598 553 529 538 548 532 499 475 470 473 469
2329 469 462 473 512 552 553 521 501 517 539 536 525 537 558 554 532 530 548 554 544 550 567 550 492 455 477 508 492 450 439 457 466 474 517 585 616 589 547 526 509
2324E09k3pK0J6mJ1M9N1%m3l7j0nj6j3JNLRJ6J1j0k7k4LL1L3Rj4j2KKmJ3L8L2nk4JK2km1l6
2319E30J3M4K7mj3JJ1J8L5N1L8j5o4o1j6J9Mk8l4j4kj1j4%Qjj2%K7M3L8K0N%Jj5o0r2o4PN4
2314D74M5K3L4N7M4Nj8j1klnj0k4l9m2l2j1J9L9J2n1q1l5L5N2K7K1L2J1m1n0LM8L2lKK8K9
2309F14J1N%k7m7k6ROk1j3L0L8j3n9l7J6L3J0j2rLK3N2O4K3m8p3k0L8K5l4n0LN4M2pl1j8n
2304E49j5l1l8l4j6K1N1N2L3K2K3J4qj0RJ4j5m7n0l6k6rK7O2N6J2l1m0j5K0L8K1j2k4lK5K6
2300F15J4J0Pj8m9m8j6P%rLK6L2J2j5k6pJ8J0l1n6k7K1K8j1l4j4J8K4J9K6L5K8J5J0J3J3J7
2295F60L0L5K2Nlj3l7n9n0k3rj5k2rJ3K4J8NjJOPN%j1k7l2j7OJ6K3L9M6J8k2k9jRqj0J7K1
2290F28k4n5j8L1J8l0k4K9M0j7o0m4j2j0pL1N5K5k5k7QK1Kj1MK3K5J1j3l1k7KK0Lk0j0J8J9
$$ plain form
2324 509 486 479 499 515 511 522 571 622 622 579 542 532 527 511 498 499 504 507 516 532 543 533 506 482 485 516 549 558 544 532 534 536 532 545 583 615 610 586 587 609 607 566 530
2319 530 543 587 614 610 597 598 609 627 662 713 751 736 672 611 595 614 618 590 556 542 540 529 515 515 523 522 510 510 537 580 618 638 643 643 644 629 569 477 413 420 474
2314 474 519 542 576 633 677 682 664 653 651 648 643 633 609 570 528 496 485 504 543 555 504 423 388 423 475 502 523 555 566 525 475 478 526 558 555 557 585 614
2309 614 625 630 630 603 556 530 539 545 524 511 541 579 566 507 470 486 519 529 517 508 511 534 586 650 673 625 552 532 570 595 561 511 514 568 610 603 572 554 549
2304 549 534 503 465 431 415 436 487 539 572 594 617 631 623 613 622 636 621 574 524 488 462 453 480 542 598 610 579 539 524 544 582 603 591 567 564 589 615
2300 615 629 639 646 628 579 531 515 522 522 513 516 542 574 586 571 545 538 556 566 535 479 452 473 501 490 456 442 460 484 503 529 564 592 607 617 630 643 660
2295 660 690 725 747 752 749 736 699 640 590 567 558 543 521 512 525 549 567 572 571 572 578 585 590 590 579 552 520 503 509 525 548 587 633 651 629 600 599 608 600 590 607 628
2290 628 604 549 531 562 580 550 526 555 595 578 518 474 462 452 445 476 531 556 531 504 512 533 535 524 528 551 576 587 574 543 516 518 538 541 521 511 529 548
2286E48pk0rORJ1K1K7K4J8Rok0j6rj1j3RK4Jl9l8J0L9K0%J0K1om9n6k5LJ2OorJ4M2L5j4m4
2280E22j9J9J4j6j3J4J6lPN5P6K6n3r2p5k8J9M4L3PnKKj3j1K3M5K0j7j8J4K1k2o8o8j8L9O4
2276E43M7Pl0m6l9j8kjnMK5L0J2KK2M2K0k4l2NL3J6j0j1jqrJ3L3K1qj5pj1j7kJ6on2o2j7K3
2271D81J7oLL2L1pl4j8K6N3L9Jl4l3NN3O6K5m0o7l4J5J9j2k6kJ7Mj0LRk7o9n1K2P6O3J4k1
2266E83k9j7RL4L1jl1l3j7QL3M1J3k8m3l0j3%L5P3O2lm5j5L9M2kl2k2rj3k4k0mJ7K5Pk1l1
2261E69j1Mlj2jPj0j8RM2L2klK2J9j6k5J5M9L3qk6k2k7l6k9lOj1k4%M4N5K1j6j0K5L1ll1j9
2256F17MJj8k8l1k9oM9Q1M3k6n2k6qj5j3MNmJ4N1N0PpK8L3m2j22j11l0K9L2J7J8J8J1MONO
2251E65J0Oj0j3MJ5QJ5M3M8oo3n4lJ3j0pL4N4K1j8j6KNLJ3J2pk1lK0J7lqJLj4m4q1j02p1K
$$ plain form
2286 548 541 521 512 518 527 538 559 586 610 628 637 631 611 595 586 575 562 571 595 596 557 519 529 568 588 588 598 619 613 564 508 483 486 498 504 498 489 503 545 580 566 522
2280 522 503 522 536 520 507 521 537 534 541 596 672 698 645 553 478 450 469 513 546 553 548 550 552 539 528 551 596 616 599 581 595 616 594 526 458 440 479 543
2276 543 590 597 567 521 482 464 462 461 456 460 485 515 527 529 551 593 613 589 557 562 595 611 601 590 589 581 572 585 618 639 631 616 609 598 581 579 595 589 537 475 458 481
2271 481 498 492 495 527 558 551 517 499 525 578 617 618 584 551 556 609 675 700 660 593 559 574 593 581 555 553 570 574 564 567 576 549 480 429 451 527 590 604 583
2266 583 554 537 546 580 611 610 579 546 529 537 570 611 624 596 553 523 510 510 545 618 680 677 632 617 656 698 696 664 642 633 620 596 576 572 589 614 621 600 569
2261 569 558 562 559 547 546 553 543 525 534 576 608 606 603 625 644 628 603 618 667 700 692 666 644 617 581 552 549 555 544 520 520 564 619 640 624 614 639 670 667 636 617
2256 617 621 622 604 576 545 516 510 559 640 683 657 605 579 571 556 543 547 552 548 562 613 663 670 663 691 724 682 560 449 419 448 480 497 515 533 544 548 554 559 565
2251 565 575 581 571 558 562 577 585 600 643 691 685 622 568 565 578 568 561 595 649 670 652 636 638 643 646 659 671 664 643 640 660 677 674 666 667 670 656 612 531 429 358 360
2246C60O0N9K5Lnj9l0j2K5L8J7kJ5M3M2J0j8k1j0qj9k2nK1K7J0j5k1oJ3K7K7J6ONQjk2l3k9
2241E59j7qkrk8m0j9K3M2J6k0k7j7rOM4O8L0m5o9qP2Q1J9l7l9j5j6l0j5L7O7L4k5l8%K2nl4
2236E48j5K6K9JlK0J9j7l7j3Qj6m8k7L5O6M3J6K0K6mn1o5k5K7M4J3k3k3J4L6J1m0n5j9K8L9
2232E88K0QKj4m4n6k8J8M3M0L3L9L7Pl1l9j2Mj7m8l6J4M2K6%MK9L1Pk4m4n6m4%M4M7Pk6k0
2227E51LQrk8l3j2K4M1J5k3nO1P6nr5p3K9P0Mo8n9j0%j3J7O4N7nl8nL4K2j4k6j8k0k3lK1J0
2222E22k0k0K3O1O6N8N2K2m2q7o8qK1OnJ3K4Jj7PM6L9j8n0j3M6M4k3p6n0K3N3J0m5m3KK4j
2218E77k7k0KNkRK4J1j6j6jj2m1l2K6O5L6j6j6K4L9J1j7k1l0n3m9kL9K4j8k1J6L4jm4l7RM3
2213E02L9J4oj8k8k7oK0K3MoJ7N1M8ln3n1j0K2K2K4N3Q0N9mn1m9k5j4j1kJ0PKQJ5Oj0rRJ1
$$ plain form
2246 360 420 479 504 507 502 483 453 441 466 504 521 519 534 577 619 629 611 590 580 572 553 531 526 547 574 584 569 548 542 555 582 609 625 631 636 644 643 621 588 559
2241 559 542 534 532 523 495 455 436 459 501 517 497 470 453 444 450 494 562 592 547 478 470 542 623 642 605 566 551 535 505 490 527 594 628 603 565 565 587 582 548
2236 548 533 559 588 589 586 606 625 608 571 558 566 550 502 475 510 576 619 635 655 681 677 626 561 536 563 607 620 597 574 588 624 635 595 540 521 549 588
2232 588 608 616 618 604 560 504 476 494 537 577 610 649 686 693 662 623 611 615 598 550 514 528 570 596 596 600 629 660 667 643 599 543 499 499 543 590 597 571 551
2227 551 554 562 553 525 492 480 504 545 560 537 532 593 669 664 569 496 525 595 599 531 472 462 462 449 466 530 587 582 544 539 573 595 581 555 537 517 494 491 512 522
2222 522 502 482 505 566 632 690 742 764 722 635 567 559 580 586 581 594 618 619 602 609 655 694 676 626 613 659 703 680 604 554 577 630 640 595 552 554 578 577
2218 577 550 530 532 537 535 544 568 579 563 547 546 534 493 461 487 552 588 572 556 580 619 630 613 592 562 509 460 458 497 521 503 482 498 532 531 487 450 459 502
2213 502 541 555 549 531 503 476 470 490 513 517 511 528 579 627 624 571 520 510 532 554 578 631 711 770 766 715 666 641 627 616 614 624 631 633 641 656 662 652 643 652 663
2208F63oj7j2noLJ9J9rm0m2k3LL2N5N2J8j8k4rOJ3J8Pk0l1pJ6mm8o0k3K2M4M5L0j0n6o6j9
2203E10M7P7N5J0k0j4N%m5q8q0k7J5J5LJ4L4L6K3J8K6K9K1%k3l4k1OJ5%j3%J9J4j0l1l3k5
2198E28j4%J1J2MnpKJ9L3K5ml1l1j0J1J4Mj6l4l1KL9N1K2j9m3l3JL3M1K4POJ6K0J9J6%l1o2
2193E89o2k6K3N3N2K8OnqnJJ1J6J3OLql9o8n2J2O9O8J8l2n0k7J9M8K2m4p7l7K8M3Qj9oK3L2
2188F26J8j1m1m4pL6L1j1l4j2J1lk7j6K5N0M7L1J6ok5k4qnk0k5%L7L9jm0l9j5nnK0O2P1J7
2184G13m9o4l2KJ8K5J4k4n0l0Ojl7l4J5M6K8J4L0K3k7n1LO0L1m6n3J1M9J4k6j7Mqk4j0RKr
2179E25MJ1j8m7j9M2O6K9j4j8mqk3k8j7NL2N0L3j8n1l0K2M2J4j7j4M%k5l2qK0K7K1K0J8Nj3
2174E86j3KRpk8k8kL2M2J1l5n1j6L3M4J8KJ7L8L2Mk0l0l3k2olk8n2m5j7LJ0K2K9K0OK4O3P0
$$ plain form
2208 663 657 640 628 623 617 620 639 658 649 609 567 544 547 579 634 686 704 686 662 653 659 672 690 697 677 646 639 655 651 603 543 520 542 586 631 661 651 595 529 510
2203 510 557 634 689 699 679 665 670 670 625 537 457 430 445 460 463 477 511 547 570 588 614 643 664 664 641 607 586 592 607 607 594 594 613 627 617 586 553 528
2198 528 514 514 525 537 541 536 529 531 550 583 608 604 573 542 532 543 557 561 545 511 480 482 521 572 594 575 532 499 500 533 574 598 605 611 627 647 666 682 682 651 589
2193 589 527 501 524 577 629 657 663 658 650 645 646 657 673 686 692 695 687 648 580 528 540 609 677 695 663 613 586 605 653 675 631 554 517 545 588 596 577 571 594 626
2188 626 644 633 592 548 541 577 608 597 563 551 562 559 532 516 541 591 638 669 685 679 654 630 622 617 597 572 572 609 648 647 607 568 553 548 543 563 625 696 713
2184 713 664 600 568 570 588 613 627 603 553 523 529 528 491 457 472 518 546 560 590 613 586 535 538 598 629 583 530 541 590 604 578 561 565 557 533 523 532 534 525
2179 525 529 540 522 475 456 498 564 593 579 561 557 549 526 498 481 486 518 568 601 583 532 502 524 566 580 563 549 553 553 528 496 488 508 535 556 576 594 599 586
2174 586 573 575 584 577 549 521 519 551 593 604 569 518 502 535 579 597 599 616 654 686 690 670 640 607 585 579 576 548 496 451 434 437 447 469 498 518 524 548 611 681
2169F81J9l6l8PM0L1Kk1l4k9j5rk3l8k9qmrJ2M6M0j3m0J2R5J07L3n0o5k2K6M2K9J0PQj2n6
2164F96q0m5J6M3K2pj1mKJ2J5ol5k0L4O6L5pmJ6j1o3p0k2J0qk4LL5J7l3n4l1KJ3QMJ0K3L3
2160E80K9Jl0m1l2j8pJ0K7K9Pj3pJ9L1J6j0j8rpj8k7j0K8N4L8pl4j0L5M8J8j7k1j0j3k2qK0
2155F01L1J7lk4n3o4k4M7P8M3j0l5l2j9JJ3j1n1l7M4J06P6Qj4Omn2o7k7K0L6K5Jk9l1J8N9
2150F43K8l8l5K7M9rn1k2J5nl7j4K3Rk9k6OJ4loMj6n0n0j4J1J7K5L1J6PM2Q7P0km2j8J6J0
2146F83j4j8j1j2k2l0m3l8J1Q0R3K8l4k3L0M2km2l0MJ6pk8k1PJ6mk0mJ7J1qpOpl8l3J5M8K5
2141F36j9m2l7k1PL3L2%k8k7j5oOK6L0J1omjKL4Q0Q0Qo5o6j7J3J0Mj2m9p5m3K3N6L9J9Qj6
2136F08m9m9rK8K9K1K5K4Jk9m1l8k7j7j2pJ3N2O5K3l9m8NN6N3Ql6o3n6j1M1N1J6%L1O4M7r
$$ plain form
2169 681 700 664 626 633 673 704 706 685 651 622 607 598 575 537 508 500 496 487 499 545 585 572 532 544 639 746 779 729 664 642 668 710 739 749 756 764 752 696
2164 696 616 571 587 630 652 645 634 630 632 644 659 653 618 598 632 698 733 726 722 738 727 664 594 572 582 574 550 553 588 605 572 518 487 489 502 510 514 524 547 580
2160 580 609 610 580 539 507 489 482 492 519 548 555 542 535 554 585 601 591 573 564 557 539 512 502 530 584 622 615 581 571 606 654 672 655 634 624 611 589 581 601
2155 601 632 649 646 622 569 505 481 528 606 649 639 604 572 553 554 567 556 505 468 512 618 694 702 688 694 690 638 571 544 564 600 625 626 597 566 584 643
2150 643 671 633 598 625 674 665 614 592 607 602 565 551 574 583 554 528 534 548 545 539 543 527 477 427 413 424 441 466 497 513 520 562 649 719 717 675 657 673 683
2146 683 669 651 640 628 606 576 533 495 506 586 679 707 673 650 680 722 720 678 648 652 668 661 633 612 619 635 631 611 607 624 635 627 620 626 619 581 548 563 611 636
2141 636 617 575 538 517 524 557 589 589 561 534 519 513 519 545 575 586 580 576 575 577 611 691 771 779 714 648 631 644 654 658 646 597 522 479 502 558 597 616 624 608
2136 608 559 510 501 529 558 579 604 628 629 600 559 521 494 477 465 458 471 523 588 611 572 524 529 585 638 646 610 547 491 480 521 572 588 588 619 683 730 721
2131G21m5l3J4N7N8Kn8o1j1K1Lj2J8M2On5o7k9nj1nK7N0L7Rj0k5m0l5rJ6K2J5Lj5l4m4l8k6
2126D53j1QK9L9L4J5j0k8j7K0M3K1j3j5NNk2l4j7lj5k0QM6N5M0K8K2Qj2k4k3j1NJ5J6J7K8
2122F85K1k9q9q0JN6J0o9p0J0P6P7N3M3K9pm1m6l4j1K2M2J7l6m3RM6J4l6l0J2K0lRN8P3J6
2117G75n3o8l6ML1L9K0j6l9l6k8j9J0M3L4j9m6j4J8qn3l9J6K9pk0K5P1N9Lm2n8m6j9N%j9m
2113D93N1Q5O1J5j1l2p4j07q0nM8M8K2QQJ3K2K9K2Jqj0k1m3m5oL5L3qk9lL5L9J8J1K5K0k3
2108F37o8o5j6K9M2K9Nj0kK9M1Lm1k9K1K7l4q4o2qJ1J0L1N9M5mk0J3N0N1K2k0o3p4l7K0L3
2103E71Kk3j2J2K7L8L5Kl6l8oNj5j8J9M3K0j0pQMKK7L5j0o2m6J4M3K3Njk4n3l5K3M9J3k6j3
2098E85J6Pl2m5k0J6L8M1K4KlJ9L9K9pm0n4n3l2mMj6l2rL1L5nl2j5J4J2o%K5K7%j6PL7M0K0
$$ plain form
2131 721 676 643 657 714 772 774 716 655 644 665 668 656 674 716 722 667 600 571 566 555 550 577 627 664 673 663 638 598 563 554 570 592 607 610 595 561 517 479 453
2126 453 442 450 479 518 552 567 557 529 512 532 575 596 583 568 573 578 556 522 505 502 487 467 475 521 576 616 644 666 674 662 638 615 604 609 624 640 657 685
2122 685 706 677 588 508 509 565 575 506 436 446 522 599 652 695 724 717 676 630 596 585 607 649 666 630 587 596 642 656 620 590 602 622 619 628 686 759 775
2117 775 722 654 618 622 653 692 712 696 657 621 593 574 584 627 661 642 596 582 600 592 539 500 516 545 538 518 543 614 673 676 634 576 530 511 516 516 497 493
2113 493 544 629 690 705 694 662 588 481 401 396 444 492 514 522 530 543 565 594 616 617 609 599 578 535 490 484 519 552 544 515 512 547 586 604 615 640 660 637
2108 637 569 504 488 517 559 588 593 583 581 610 651 654 613 584 605 632 598 514 452 444 455 465 496 555 600 596 576 589 639 690 712 692 629 555 518 538 571
2103 571 573 550 538 550 577 615 650 652 616 578 572 577 562 544 563 606 626 616 609 617 621 623 650 685 675 613 567 581 624 647 652 651 627 574 539 562 611 624 598 585
2098 585 601 608 576 531 511 527 565 606 630 632 629 648 687 716 709 669 615 562 530 526 530 514 482 473 504 539 534 502 487 501 513 507 507 532 559 559 543 550 587 627 647
2093F47Pmk5m7l9j1kj1MN2Q2M9j1l6j8j0l0m9l3jJ9K2J0qk1j3J8M2L4Mj9j6J4M2L6j2o3p0
2089E33l4%J0J7L9N7M8J8j4l9n7n3j7K1L6L4L8L5Qk8l6j4mj9k9pK0J3k2l6j0K7M5M6M5L9K1
2084G31jrrj4k6k2PK9J2l6o4m7j1QLj1k1k2kL4N7M7J5pj0qkJ7M1M0Ll9n3l6j6lMMLRJ7Rj2
2079F09j5J4L6J6k4k6MJ1j9l4%L7L0KKJ8Qj4pK3K3j2k5J5N7N1J3k2m7o4n0lK7Qk6k2MQj1j9
2074E76j8k1j4K0M5J6l8m3RM7L5Rmk3m6k9L0O4K9k6l7j6j1k0rJ7K8K8M0N1K4l6p1m7RM2K3
2070F33k0l8qK6J3l4m2QM6K0k3j2K7K8jJL1K5l0n8k2K8K9ok4j0J0K0J7ll0l8nM3O9N9K4j6
2065G37m0m3k5%K5L5Rl2m6rL8M0J0nok6n2l4K4M6Jm4k6K9M8K0j2j7n%j5l8l8PN6N1Lj5K7N8
2060G36J9m2m5%K1jj9oJj6l2j6K1M5M0J0k2l4k7j6j3KL1M0Qk5rL3L1k1o0m7rJ4K0K2Ok5m1
$$ plain form
2093 647 654 650 625 578 539 528 526 515 519 571 653 702 691 655 637 627 597 548 515 514 533 555 565 557 536 523 541 583 617 621 602 586 600 642 678 666 603 533
2089 533 499 499 509 526 565 622 670 688 674 635 578 525 508 529 565 599 637 672 680 652 616 602 598 579 550 543 563 576 554 518 508 535 580 626 671 710 731
2084 731 730 721 712 698 672 650 657 686 698 662 598 551 540 548 551 540 519 497 495 529 586 633 648 641 631 623 621 638 679 719 722 683 630 594 578 575 579 583 586 595 612 621 609
2079 609 594 608 644 660 636 610 614 625 606 572 572 609 639 641 643 661 669 655 648 671 694 682 657 672 729 780 793 771 724 660 610 607 634 642 616 594 598 606 595 576
2074 576 558 537 523 543 588 604 566 523 532 579 614 623 619 596 550 521 551 615 644 618 581 565 554 534 525 542 570 598 638 689 713 677 606 559 568 610 633
2070 633 613 575 567 593 606 572 530 538 584 604 581 569 596 624 623 624 655 680 650 592 570 598 627 621 597 587 597 617 634 631 601 563 558 601 670 729 753 737
2065 737 697 654 629 629 654 689 698 666 620 611 649 689 699 694 688 662 610 576 600 646 647 603 577 606 654 674 662 645 640 640 625 587 549 556 612 663 666 651 678 736
2060 736 755 713 668 668 689 688 669 663 664 648 616 600 621 666 706 716 694 660 633 617 604 606 637 677 685 660 651 684 715 694 634 587 578 592 612 634 640 615 574
2055E74k1J5L1J6ok0k0j3NK3L6L5K2%k0l1l5m0k8NM4M9K1rj7j0mOK4L6K2mj5MK9K7rm7n1j6
2050F08L1N7M6Nl3l7nK1%l5l3OJ9j1j7L4P5M4j0nM0L6k2m6pJ5k4o4l7K7N0K7RJ8L2L9M3M5
2046I41L7K5J2j1m1m6j6K4M2M5N8P4Q5R3J01Q8N5L2M4O4O2N9P5Q6O5L9M8P0N2pn2m8k1oj2
2041B116m0q9j32j31r2o5o7p2n9m5m5m4l3l6n9p1m5rrm5o8m9oK9L4J7jKJ8J0l0o7n5j0J4%
2037G66j4NL2K3j6l5j2J9K0krJ3L4K4pl7n0m0j5J6L2K4Jk2l1k8j7plJJ4K0J0pkK0K4LrJ%m1
2032F98q6p6j3L7M4L4L9M4L0jl1n1m5jN6P5L7j1k2omk1k4pKrj2K4O4N8Pl3k3%ql8l2J6M7K4
2027G82j5j4K1L8J9knrk2k2MK4J3j6l4k8qJ9M4M9K8Knmj0k2j6NJ1j5m2l6ML8L7J3m%Pkj9k5
2022G83j0J3L0L1K2J0Ojk3m8m2QN8N9Rl7l2J1L8K4j0k5j6j0k5m7m2j3K1L5K5rm6m5J2P5P1
$$ plain form
2055 574 553 568 599 615 609 589 569 556 561 584 620 655 677 677 657 626 591 551 523 528 572 621 642 633 616 606 602 608 632 668 690 686 671 675 704 731 722 675 624 608
2050 608 639 696 742 747 714 677 672 693 693 658 625 631 650 639 622 656 731 775 765 760 800 836 814 768 761 776 752 688 651 678 728 755 764 782 814 853 896 941
2046 941 978 1003 1015 1004 963 917 901 925 967 1012 1070 1144 1229 1322 1423 1511 1566 1598 1642 1706 1768 1827 1902 1988 2053 2092 2140 2210 2262 2255 2203 2155 2134 2128 2116
2041 2116 2076 1987 1855 1724 1632 1567 1500 1428 1369 1324 1279 1235 1202 1166 1107 1036 991 982 973 928 860 811 805 834 868 885 884 886 904 914 884 817 762 752 766 766
2037 766 752 757 789 812 796 761 749 768 788 786 777 790 824 848 841 804 754 714 699 715 747 771 772 750 719 691 674 667 664 665 679 699 709 702 700 720 744 747 738 739 739 698
2032 698 612 536 523 560 604 638 677 721 751 750 719 668 623 622 678 753 790 779 757 751 747 726 702 695 697 688 676 700 764 822 829 796 773 773 765 727 695 711 758 782
2027 782 767 753 774 812 831 829 824 815 793 771 775 799 812 796 762 734 726 745 789 838 866 868 863 859 849 827 811 816 827 812 770 734 738 776 813 826 822 822 829 827 808 783
2022 783 773 786 816 847 869 879 885 884 861 813 771 779 837 896 905 868 836 847 885 909 899 874 858 848 823 776 734 721 742 777 802 793 747 702 714 789 860
2017H60Lm2j5K7K1nJ0M8M2kj7PJ2k4m6k1Nnj5J4M7K9k3m3j7J4J6PJ4L1L3Rk2l1j1Pkk8k5Q
2013H70L1K0JKJ2Pqj4j6k8l6j8J3L4M0M1L0ll8l9JM3M4Ml3k8NJ7nk2MM1L2qj7RJ7lMN2O6O
2007A130n1l3J6J0k8j9L5M8Lk8lL7L9J3pj8k5k3k1k8l3j4J8K8J8K0L4L5K0J5K3Pl1m3rL0L1
2003A196J1OJ4J2jlJ7L8M1K2J2L3O4M5k9p5l5L2L7j4l1LK3LpJ2J2k5l4J6N8L2j0jL0J7j7k
1998A502N5P3M1K0M5P0N3J0j7j2J8O3R9R7N9J7nKL7P9R2N5J1QL2K2l8r1q3l1Lqk4qK6L3mm9
1994B252n8m6n1o2l9K3O4M5%k0j4oLK9N5M5Rj1OL8N0M6M0M5N0M2K0J0L3N6L3k4l9K0Q7R0M7
1989B868K2K1R%L1P7P3J6j3K1O3N4K3J9K9J4nK5R2J23Q1K5K2O7J05J09R9R3P4M9O0J09J36
1985D591Q9L5O0J42J68J08N8R0J43J33R0Q4J03R7Q0J09J69J91J66J52J85K24K39K48K64K74
$$ plain form
2017 860 863 821 806 833 854 849 859 907 949 947 930 937 949 925 879 858 863 858 843 857 904 933 910 867 850 864 880 887 901 932 965 974 952 921 910 917 915 887 862 870
2013 870 901 921 922 924 936 943 935 921 905 877 841 823 836 870 910 951 981 978 940 901 902 945 989 993 960 932 937 954 949 927 931 972 1004 996 979 988 1005 1002 1006 1058 1124 1130
2007 1130 1079 1046 1062 1072 1044 1025 1060 1108 1111 1083 1080 1117 1156 1169 1162 1144 1119 1096 1075 1047 1014 1000 1018 1046 1064 1084 1118 1153 1173 1188 1211 1218 1187 1144 1135 1165 1196
2003 1196 1207 1213 1227 1239 1238 1235 1252 1290 1331 1353 1365 1398 1462 1507 1478 1403 1368 1400 1437 1423 1392 1395 1418 1421 1414 1426 1438 1413 1379 1395 1453 1485 1475 1474 1504 1521 1504 1502
1998 1502 1557 1630 1671 1691 1736 1806 1859 1869 1852 1840 1858 1921 2020 2117 2176 2193 2188 2190 2227 2306 2398 2453 2464 2472 2504 2526 2488 2397 2314 2283 2286 2278 2254 2246 2272 2305 2301 2252
1994 2252 2194 2148 2097 2035 1996 2019 2083 2128 2128 2108 2094 2088 2091 2120 2175 2220 2229 2218 2224 2262 2312 2358 2398 2443 2493 2535 2555 2565 2598 2654 2687 2663 2624 2644 2731 2821 2868
1989 2868 2890 2911 2920 2920 2951 3028 3101 3117 3104 3125 3188 3242 3265 3284 3313 3327 3322 3347 3439 3562 3643 3668 3690 3757 3862 3971 4070 4163 4237 4286 4346 4455 4591
1985 4591 4680 4715 4775 4917 5085 5193 5251 5341 5484 5617 5707 5791 5894 5991 6071 6180 6349 6540 6706 6858 7043 7267 7506 7754 8018 8292
1982H292K80K95L08K93K57K52K91L38L64L82M08M30M44M56M77N07N61O38P02P29P52Q23R26
1979A9205J008J068J162J293J416J521J668J872K081K270K493K797L140L480L844M291M812
1977E9421N363N959O657P499Q467R524J0647J1825J3055J4310J5520J6592J7449J8018J8206
1975B38512J7920J7107J5764J3890J1511Q708N590K233j271m735p937j0749j3159j5122j6539
1973B61723j7378j7708j7593j7059j6192j5162j4068j2886j1611j0355r228q205p225o318
1972H0735n545m871m231l639l149k760k417k103j824j562j313j112r69q27o48m85l63k16J0
1969D2711K61M77P12J045J444J856K324K911L586M323N209O313P571Q995J0832J3282J6143
1967A29995J8950K1380K3224K4116K3706K2095J9629J6178J1092M134l906j1785j8622k3865
$$ plain form
1982 8292 8572 8867 9175 9468 9725 9977 10268 10606 10970 11352 11760 12190 12634 13090 13567 14074 14635 15273 15975 16704 17456 18279 19205
1979 19205 20213 21281 22443 23736 25152 26673 28341 30213 32294 34564 37057 39854 42994 46474 50318 54609 59421
1977 59421 64784 70743 77400 84899 93366 102890 113537 125362 138417 152727 168247 184839 202288 220306 238512
1975 238512 256432 273539 289303 303193 314704 323412 329002 331235 329964 325229 317292 306543 293384 278262 261723
1973 261723 244345 226637 209044 191985 175793 160631 146563 133677 122066 111711 102483 94278 87053 80735
1972 80735 75190 70319 66088 62449 59300 56540 54123 52020 50196 48634 47321 46209 45240 44413 43765 43280 42917 42701 42711
1969 42711 42972 43449 44161 45206 46650 48506 50830 53741 57327 61650 66859 73172 80743 89738 100570 113852 129995
1967 129995 148945 170325 193549 217665 241371 263466 283095 299273 310365 314499 310593 298808 280186 256321
1965B56321k6882k7256k5448k2649j9848j7320j4994j2911j1127r526p987o596n503m681l983
1964C9610l366k875k514k215j937j689j482j314j189j104j021r17q22p71p51p04o12n21m89
1961A3317n29n68n30m27l63m06m75m45l29k51k77l26l01k17j56j59j97k28k31k01j67j62j81
1958F191j76j23p1q0j35j75j59j06n3l3m7p8r6j02j13j32j38j14q1n4l8l2m3o9q1p4o8p2o6
1955C582m0k3m4q1r2o9m1k2j0oj2j1MOl2q9j11q3n5m6k9J8L8j1q1q3k1J3k2n8l0Pk5r4r9k8
1951B220K7Lm8n6k4LJ3K1J7j0l5l7k4k2j7RK8Lm6o1l5k0l4m2j7J5K1Npj2j8k2j9j5rLRJj1
1946A757rL%k0k3lPj4m7n9m9l4k1oNRRJ0Npj9l0m6n7m8k4rj0rJ1K7J6oj4lMQK3N0O0L5ok5
1941A441j2Oj3n5o7k9J6K7J0QK3K0qk3j8k1m3m7j2K6L0J1jlj7k9rK9L6qo2p3k7L4M9Mn8o7
$$ plain form
1965 256321 229439 202183 176735 154086 134238 116918 101924 89013 77886 68360 60373 53777 48274 43593 39610
1964 39610 36244 33369 30855 28640 26703 25014 23532 22218 21029 19925 18904 17987 17165 16394 15643 14939 14327 13806 13317
1961 13317 12788 12220 11690 11263 10900 10494 10019 9574 9245 8994 8717 8391 8090 7873 7717 7558 7361 7133 6902 6701 6534 6372 6191
1958 6191 6015 5892 5821 5741 5606 5431 5272 5166 5113 5080 5033 4955 4859 4757 4644 4512 4374 4260 4179 4125 4087 4055 4012 3943 3862 3788 3720 3648 3582
1955 3582 3542 3519 3475 3394 3302 3233 3192 3170 3160 3154 3142 3131 3135 3141 3109 3020 2909 2826 2771 2725 2696 2714 2752 2741 2660 2577 2556 2569 2547 2489 2459 2466 2441 2347 2248 2220
1951 2220 2247 2250 2202 2146 2122 2125 2138 2159 2176 2166 2131 2094 2070 2048 2031 2040 2068 2071 2025 1964 1929 1909 1875 1833 1816 1831 1852 1857 1850 1838 1820 1798 1779 1764 1755 1758 1767 1768 1757
1946 1757 1748 1751 1751 1731 1708 1705 1712 1698 1651 1592 1543 1509 1488 1482 1487 1496 1505 1515 1520 1513 1494 1464 1418 1361 1313 1289 1280 1270 1261 1272 1299 1315 1309 1295 1292 1296 1304 1327 1377 1437 1472 1466 1441
1941 1441 1429 1435 1422 1367 1300 1271 1287 1314 1324 1332 1355 1375 1367 1344 1326 1305 1262 1215 1203 1229 1259 1270 1269 1266 1249 1220 1211 1240 1276 1268 1206 1133 1106 1140 1189 1193 1135 1068
1936A068j5M0M6J9MNLorpk6o0p4n6k6rOL1M5L2NlJ0J8J2J3K4J9j1l2j3J5Ll8m3mJ5k1m9kP9
1931A008R3K6m1m8k5j4pJ2K4J3pj8k3j9jK0J3j4k2nKqKL0J9m2p1qP1O9kn3n0k9jM7P5K9n4
1926I91p8k6K0Oj8KL3K1k2m0j4J8K7J0onJ4J9mk0KL8K7k5n1k3RPLK7N5M7K0Lql7o0l9J1L0
1921I64lm1l4J1N5N7J2n2p9n3lK6K4J4Lj6l3k8NL4L1RnMJ4jl5n5l3K0N6M7J0k2l0j6LJ5J6
1916H91J6K0J6ol4l9j3J4J7Jj5k2l0l1k4pJ4K9L6K4%j9j5%Qok7l5j7PJ0j0k5j2J3K8L0K9J8
1912H34j0l4l1j2oj0QL8L8J0LL7N6K4j7j4K5M2K6QPJ6K0J3mj7jK7K6j8m9l5kJ0J8N3Q9P7L1
1907A276J2L6O7P8P7P6P6P9R9J14J02P3N8N3L7K3L3M8J5m6o8l5nk6o2p6q8j12j20r3o5p6r8
1903A462q9n6l6l3j9%rm0m9k2Lj6n0m7LM8L6j6l6jK9mp1q3l1J4PrRL3K2jj%k3m6k8Kj0m2k7
$$ plain form
1936 1068 1053 1093 1139 1158 1162 1167 1170 1164 1155 1148 1122 1062 988 932 906 897 903 934 979 1011 1016 1013 1023 1041 1053 1066 1090 1109 1098 1066 1053 1068 1071 1033 990 986 1001 980 931 929 1008
1931 1008 1101 1127 1086 1038 1013 999 992 1004 1028 1041 1034 1016 993 974 973 993 1006 992 970 965 967 959 961 991 1010 968 897 889 960 1029 1027 974 924 895 894 941 1016 1045 991
1926 991 913 887 907 913 895 897 930 951 929 889 875 893 920 930 924 919 933 952 948 928 930 968 995 970 919 896 905 912 915 942 997 1044 1064 1067 1059 1022 962 923 934 964
1921 964 961 920 886 897 952 1009 1021 969 890 837 834 860 884 898 901 885 852 824 829 863 894 903 898 902 916 915 880 825 792 812 868 915 925 903 873 857 860 875 891
1916 891 907 927 943 937 903 864 851 865 882 883 868 846 816 785 761 754 768 797 833 857 857 838 823 823 831 825 798 763 746 753 763 753 728 716 729 757 787 816 834
1912 834 824 790 759 747 741 731 739 777 815 825 828 865 921 945 928 914 939 981 1007 1015 1022 1038 1058 1071 1067 1050 1049 1076 1102 1084 1035 1000 998 1008 1026 1079 1168 1245 1276
1907 1276 1288 1324 1391 1469 1546 1622 1698 1777 1876 1990 2092 2165 2223 2276 2313 2336 2369 2417 2432 2386 2318 2283 2278 2252 2190 2114 2026 1914 1794 1701 1636 1560 1462
1903 1462 1373 1317 1281 1248 1229 1229 1220 1180 1131 1109 1112 1096 1046 999 1002 1050 1086 1070 1034 1033 1062 1058 987 904 873 887 894 885 894 927 949 948 947 947 924 878 850 852 842 800 773
1898G73L1M7%l7j4K1J3j7k5k7n4p6m6K3N8M8L1L6M0K7J2Lj9n1n2j2K6K3JJJ5J2j4k7j8j1j4
1893G27rJ2K4Jl4m8k6OK3J3j6l6k1J9L9J4k5k4J4M4L2pl6l8k1QL2L8J7j6l3k4OM0O2N4K0j9
1889H12l4j6J4K5Mk0k0NK0RkJ2L2J9k7o6n6j3K1K3Kj6j2MJ2%j5j6j1j5j5ML2K8jj8JK4K4R
1884G63kj5l2k1J9M3J9j5j4Jk2n8l7L5P6M0j4j7RJ3j0k2j7k1k4j0J5J5prK0L4J2j2LK9K3r
1879G81k0njk8m7k4RJ4jlJ2Oj9l0mL3N5N5L0k3p1n9PN0K1l3l6%J3qj3QJ4j1k1QM0K6k4n3l9
1874F09kK9L2Nj9nL3M7J6j5j7j3k8m0j6K4L6J4qj6j3OL3M3J2k3k2KLj5rJ8J5k7m9l0qrKM9
1869F44P8L9k4l3LK1mk6k5k0k5j7OJ8PnJPOJ0J9K3K1L5N4L7k6p7o8j9J7L1M5N6L1j8m6l5j3
1864G28j3k7k8j2PK3L3L2J7jj0qNJ7J2j2l6k5J1L1J1k8m6l2j0NJ4J7Lj8k8j3PRpk1j5%J0J2
$$ plain form
1898 773 804 851 851 814 800 821 834 817 792 765 711 635 589 612 670 718 749 785 825 852 864 867 848 797 745 733 759 782 783 784 799 811 797 770 752 741 727
1893 727 718 730 754 755 721 673 647 653 676 689 673 637 616 635 674 688 663 639 653 697 729 722 686 648 627 635 667 705 722 706 673 649 655 695 757 811 831 812
1889 812 778 762 776 801 805 785 765 770 790 799 797 809 841 860 833 767 711 698 719 742 744 728 716 720 732 732 717 701 690 675 660 664 696 724 723 705 706 730 754 763
1884 763 761 746 714 693 712 755 774 759 745 746 724 666 629 664 740 780 766 749 758 771 761 739 722 701 677 667 682 697 690 681 701 735 747 735 738 767 790 781
1879 781 761 756 755 727 680 656 665 679 678 675 687 693 674 644 640 673 728 783 813 790 719 660 667 717 738 705 669 669 682 674 661 669 683 672 651 659 699 725 701 648 609
1874 609 607 636 668 673 654 649 682 729 745 730 713 700 672 632 616 640 676 690 682 666 653 659 692 735 747 724 702 704 707 692 683 701 716 689 640 610 602 593 595 644
1869 644 722 761 737 704 707 728 724 698 673 653 628 611 617 635 642 637 638 645 651 661 680 703 724 759 813 850 824 747 679 660 677 708 753 809 840 822 776 741 728
1864 728 715 688 660 648 655 678 711 743 760 759 749 741 746 763 775 763 727 702 713 744 755 727 681 649 639 644 658 675 678 660 632 619 626 635 628 607 592 592 602 614
1860F14J1MnLL0M6K2k1k1K8N5Oo5p7k9MnoL3O9N1Mk1j1PK2L0J3k6l7nK1k0p6n9K4O6K2k3Q
1855F86O5N0k4o9l8J0J8mj2LJ5J1LPJ8K3Oj4j7kJj6l1j9J4L4K8Lj6j8jJ4J0j0j8j1j5l5l6
1850F13JL2J6j4%L9L7j2l3JL1J1k6k1%lk0j4PJ0PL5O5M2k6o1l7qj3j9%J5ol0qM1O1L3j5m7
1845F84n6l8kK1J4jOJ9Ml8o1m2JL1K8lk8j1M0O0J7l8l6QK4LoJ8L5J6rj0oj0lK5L7J0j4lJ4
1840G00nl4j5L9O1K3k7l9j4K1L6K3j3m8n3l0jK1K7Ll7n1j4L4L9Qj0KJ1mj7qJ6L7N8O4L6j5
1835H24m8m0qJ3J5Kk0l1j6J1J1j4k7j0OJnMJ3J4K0M0L8lm0l3lPrj6rj3l7n1l7qJ2J3%j3j0
1830E43J6M5N8M4J1k7m1j4M1O5L2j3k1kkk5l6k4j5k5k3NK8J2k9m7j8L0N0K9nj5ork5j9J8L1
1826F17j2n9l0N3Q8L0m4m9NM3L6J1oj0kK3M0J8l6o0k7K0J2m2o9l0L3N1K0pKJ9J6kqmLQQrl3
$$ plain form
1860 614 625 629 624 627 657 703 725 704 683 711 766 772 707 630 601 605 600 594 627 696 747 751 730 719 726 748 778 791 765 728 723 744 724 648 589 613 679 701 678 686
1855 686 751 801 777 708 670 680 698 694 682 685 700 711 714 721 739 762 768 754 737 735 736 720 689 670 684 718 746 749 733 715 714 728 738 728 710 699 684 649 613
1850 613 614 646 662 648 648 687 724 712 679 680 711 722 696 675 675 672 652 638 645 655 662 697 762 804 778 717 680 672 659 640 640 655 649 619 611 652 713 746 731 684
1845 684 628 590 588 609 623 622 628 647 651 613 552 510 511 542 570 567 539 528 568 628 645 607 571 579 603 606 600 618 653 669 660 650 644 634 631 656 693 703 689 686 700
1840 700 695 661 646 685 746 769 742 703 689 710 746 769 756 708 655 625 624 645 672 675 638 587 573 607 646 654 644 646 657 653 636 628 644 681 739 803 839 824
1835 824 776 736 728 741 756 758 738 707 691 702 713 699 672 662 668 669 664 668 681 695 715 755 793 790 750 717 714 721 712 696 687 674 637 586 549 541 553 566 566 553 543
1830 543 559 604 662 706 717 690 649 635 676 741 773 760 739 737 735 710 674 650 635 610 587 592 620 632 603 556 538 568 618 647 642 627 621 612 587 568 586 617
1826 617 605 546 516 569 657 687 643 594 599 642 678 689 683 673 671 694 734 752 716 656 629 649 661 619 550 520 553 604 624 617 619 638 654 652 644 640 643 651 659 650 617
1821F17l3J0N0L7j4m5k9kLKJ8L8L9J7jjJ0J4ml1m5l2kK7M2L6Pk6l1oJ1mj8JK4Jm3m5J0N1L6
1816F89jj3ppnKkk5l6j0J4kl4k6J7L8J0k9l0KK3J2qnK0M4M2K2%j8l2k6ML3K9jk1k0k0k9l5
1811E59l3l2j1M4R7Q4Qm7l7j6k7l7qK1nm3k4L6N7K3rqj3l2k4J6L9J2k3k0%OMK0M4M4J6j6k8
1806F37j7MJ5LpJ1M1L3k0n7l5J0K9K4L4N2M5J0k5m5o3p5o1k2J2K1K5L7L9J3k1k3nj0m1n2j2
1801E04M0M2Pj5qqk4k0K3N7L6rk3oMlLK8L5J4rrLOMPNpj8j6onj2j9j7kJ4J7PJ0M4P4O4J7j9
1796H10j6oj5l9m9l2KK5Rl0m3j0K9K9J3K3L8Mo0p0rL9J6k4k2pk3l3RO1N0j0l1J2M9J9m3o9
1791E96m7qJ7K3J5NkqnNJ4Oj1j0ONk2k9jJ8MmL5O5J8o2o6NM9Rm3l6NK4K8L6L4Jl3l0kNo%K6
1786F29M1K0j7l9k9NL2K5j0l1k0%PJ3L0L4Pk8l3oK0K0%k6l9k7mnk8l3KL6K0j7j0M6P7M5j5
$$ plain form
1821 617 584 594 644 681 667 622 593 591 594 596 614 652 691 708 707 706 716 730 726 695 650 618 616 643 685 721 728 702 671 665 676 672 654 655 679 680 637 592 602 653 689
1816 689 688 675 668 661 656 658 656 631 595 585 599 597 563 537 554 592 602 573 543 545 568 580 572 567 587 631 673 695 695 677 645 619 623 656 685 684 663 643 623 594 559
1811 559 526 494 483 527 624 708 716 669 632 616 589 552 544 565 560 517 493 529 586 609 600 592 579 547 523 539 578 590 567 547 547 553 557 577 621 665 681 665 637
1806 637 620 624 639 642 635 646 687 720 700 643 608 618 647 671 705 757 802 812 787 742 679 604 543 521 533 554 579 616 655 668 647 624 619 609 568 516 504
1801 504 544 586 593 578 570 562 538 518 541 598 634 625 602 596 600 597 600 628 663 677 668 659 662 668 672 679 684 677 659 643 637 632 620 601 584 582 596 613 620 630 674 748 812 829 810
1796 810 794 788 773 734 685 653 655 680 689 659 616 606 635 664 677 700 738 742 682 612 603 642 658 634 612 605 582 549 558 619 669 659 628 640 689 708 665 596
1791 596 549 541 558 581 596 601 599 591 586 591 605 611 600 590 596 601 579 550 549 567 571 567 602 667 685 623 557 562 611 620 577 541 546 570 598 634 668 669 636 606 604 609 603 603 629
1786 629 670 690 673 634 605 610 642 667 657 626 606 606 613 626 656 690 697 669 636 630 650 670 670 644 605 578 574 569 541 508 510 546 566 549 539 585 662 707 692
1781F92m2k6NK0J1j6l3j2K6L9Qk7k4RK8J0l1n9n0j7Opk8j3L8P2N6K6J6Pk4m9k1L5N2J4j9j0
1776F62Mk0m7k5L2O3L8rl8m6l7j4J0K6K7K4J8Jj3rNLqLL0K5j9m5j1K6Rl7l4J2L5J4%J6K3l
1771F91j3J9M5J1m8m9MM3L1%j3j0jJ1J3j0m9p0n8l6j0K2N0M2Nj1J4L5J3j4RN6O1J3k8k8rL
1767G34J7L4K7j0m1k9MJ6PRL0M2L7K2Pj1k4j1J4J7qk0kRj4m5l0K5N9L7ol2l2k2qJ2K6J5j3
1762H42l0k1nj2l8n1l3LJ7OmJ6M8O1M0Pj4j5%J7J9Lk0j9J1M8N9M8L9M9O4O1M6L8M8O1N8M1
1757A488J5k1n8p7o4l9l1m4n0m2l7l9l1j1lj2j5nol2m7j9K2K9kk7k7k0j6kK1L1J9Kqj3j3l
1753H13J5L1L2K0ok9j6L6P6O3K3J4L8M7L2L3N6O0K8NK0L1jm2m6k2k0m3n7m6l6m2n8o5o2m9
1748H33k3JJ5J8J2jj3j5nLK%mj8l3l2j9j3qK1O0O2J7j3NK7Jm5n3k8j1jK0L7J8j0kL3N3M8M0
$$ plain form
1781 692 650 624 629 649 660 644 611 599 625 664 672 645 621 630 658 668 637 578 528 511 517 510 482 469 507 579 635 661 677 684 660 611 590 625 677 691 672 662
1776 662 666 646 599 574 606 669 707 698 660 614 577 563 573 599 626 650 668 669 656 647 652 655 647 650 680 705 686 641 630 656 665 628 594 606 641 655 655 671 694 691
1771 691 678 697 742 753 705 656 660 703 734 734 721 711 710 721 734 724 675 605 547 511 501 523 573 615 620 609 623 658 671 657 666 722 783 796 768 740 731 734
1767 734 751 785 812 802 761 732 736 752 759 768 798 840 877 899 906 895 871 860 874 891 883 863 861 870 856 811 781 806 865 902 896 864 832 810 802 814 840 855 842
1762 842 812 791 786 774 736 685 652 655 672 678 674 690 738 799 839 846 832 817 817 834 853 856 836 817 828 876 935 983 1022 1071 1135 1196 1242 1280 1328 1389 1447 1488
1757 1488 1503 1482 1424 1347 1283 1244 1213 1169 1119 1077 1040 1001 970 959 956 944 929 924 918 886 839 820 842 871 869 842 815 795 779 777 798 829 848 850 842 829 816 813
1753 813 828 859 891 911 905 876 860 896 972 1035 1058 1072 1110 1157 1189 1222 1278 1338 1366 1371 1391 1422 1421 1379 1333 1311 1291 1248 1191 1145 1109 1067 1009 944 882 833
1748 833 810 811 826 844 856 855 842 827 822 825 827 827 823 805 772 740 721 708 700 721 781 843 860 847 852 879 880 835 782 754 743 742 762 799 817 807 805 838 891 939 979
1743I79L1kl4k5J0J4k8o3n2k3qnj3l7n7l2K8O2M0JrKRQQPJ1J7J1k6o4n8j8Noj6j0j1j3K0P6
1738G29Q1J9k8mL5J4m0n7k8mJRJ7RPL6N9L1j8k6Jmn2p7l8J5K8Qj0j1qLJ7J9jk9l6k6j3nJM
1733F28JnnJ1L1L2Pk1k1%RLJ4M7N3Mm5k9K9N1J3l3l9j2K1M2M1J8rk2l0m3m2j6QOmJ7M1K3k7
1728G47m0qRj4k9lK7J8o%K5L3K6J3j2m9n2LP1P9K9k0l2k0j0pj2k7l4k0KJ0J2K5L9K9Pljrk6
1723G70j7J6K9Kl6m6k2J7O0P9N1j6o2n3j8mmJ5N1N5J3l6n0l5k3j1J3L7L7Pk2k8j1J%rmK0M4
1718H10M4K2Koj8k8j1M0P6M6l0p7o8l8j4J6M8M6Jl1j3J0mk2J0O6O8J4k5j1Lk5o6o9l8rNJ8
1714G42L4L9K5%j9j5J7N2N3K8J0Kk4o5p0k3K9L4J0PK2K0KlJ2K4J7KlMK5N0M5Ll0qN4Q0L9k0
1709A201k9J3M8L4j2m3k6J5M2L2R%MJ9M4Q4J19J15O8J3j6jM8R2R1M3krJj7n6o8l1PNk4m1l4
$$ plain form
1743 979 1010 1008 974 949 959 973 945 882 830 807 799 794 781 744 687 655 683 745 785 786 777 779 788 796 804 811 822 839 850 824 760 702 684 689 683 667 657 646 633 653 729
1738 729 810 829 801 797 832 846 806 749 721 717 718 727 744 753 760 796 855 886 868 842 843 839 787 710 672 687 715 723 713 702 694 697 714 733 732 703 667 641 628 623 624 628
1733 628 629 624 619 630 661 693 700 679 658 658 667 670 684 731 784 788 743 714 743 794 807 774 735 723 744 786 827 845 836 814 784 741 699 683 691 697 693 710 751 774 747
1728 747 707 699 708 694 665 662 689 707 701 701 726 759 785 798 786 737 685 688 759 838 867 847 815 795 785 778 766 739 705 685 687 697 709 734 773 802 809 806 805 796 770
1723 770 753 769 798 800 764 718 696 713 773 852 903 887 825 772 754 750 746 761 812 867 880 844 794 759 736 725 738 775 812 819 797 769 758 759 759 750 746 766 810
1718 810 854 876 878 872 854 826 815 855 931 977 947 870 802 764 750 766 814 860 861 830 817 827 823 801 811 877 945 959 934 923 926 901 835 766 728 719 724 742
1714 742 776 815 840 840 821 806 823 875 928 956 966 968 944 879 809 786 815 849 859 866 888 908 910 907 919 943 960 962 959 963 988 1038 1083 1086 1056 1048 1102 1182 1221 1201
1709 1201 1172 1185 1233 1267 1255 1212 1186 1201 1243 1275 1284 1284 1288 1307 1351 1435 1554 1669 1737 1750 1734 1733 1781 1873 1964 2007 2005 1996 1997 1980 1924 1856 1825 1832 1837 1813 1772 1738
1704A738k1j9j9j3onj3k1k1k1k0j7%K8N4N4K9krJ7N0N5K8%NK7K8NqLJ9K8L7M9L6nk9%M7O6
1699B154O1P0R4R7O9M2K8K4K6N2Q3P9M6M1Q7J34J35J11J10J29J32J13J15J51J91K07K09K22
1696E012K49K74K91L11L49M04M68N30N89O55P52Q81J023J147J264J427J685K010K326K595
1693B4242K861L164L457L629L617L436L107K602J881R73j9r75j814k491k974l235l270l122
1691C5069k881k625k373k108j832j579j374j191r93p87o07m72l56k38j27m4K1J02K10L12L83
1689A6510M50N56O96Q35R60J101J284J499J745K045K399K776L172L637M222M908N664O531
1686F0990P550Q661R694J0510J1032J1193J0878R974Q415O181L345J35l102o033q413j0064
1684A30946j0885j0938j0456r695q808p872o959o135n396m708m074l503k988k511k091j748
$$ plain form
1704 1738 1717 1698 1679 1666 1660 1655 1642 1621 1600 1579 1559 1542 1542 1570 1624 1678 1707 1705 1696 1713 1763 1818 1846 1846 1851 1878 1906 1911 1903 1906 1925 1953 1990 2039 2075 2070 2041 2041 2088 2154
1699 2154 2215 2285 2379 2476 2545 2587 2615 2639 2665 2717 2800 2879 2925 2966 3053 3187 3322 3433 3543 3672 3804 3917 4032 4183 4374 4581 4790 5012
1696 5012 5261 5535 5826 6137 6486 6890 7358 7888 8477 9132 9884 10765 11788 12935 14199 15626 17311 19321 21647 24242
1693 24242 27103 30267 33724 37353 40970 44406 47513 50115 51996 52969 52950 51975 50161 47670 44696 41461 38191 35069
1691 35069 32188 29563 27190 25082 23250 21671 20297 19106 18113 17326 16719 16247 15891 15653 15526 15482 15503 15605 15815 16127 16510
1689 16510 16960 17516 18212 19047 20007 21108 22392 23891 25636 27681 30080 32856 36028 39665 43887 48795 54459 60990
1686 60990 68540 77201 86895 97405 108437 119630 130508 140482 148897 155078 158423 158558 155456 149423 141010 130946
1684 130946 120061 109123 98667 88972 80164 72292 65333 59198 53802 49094 45020 41517 38529 36018 33927 32179
1683C2179j463j201r63p61n95m54l44k60j57j1J48K92M48O62R14J166J422J724K067K428K832
1680D0073L335L942M616N364O242P257Q331R378J0308J0971J1181J0841R968Q550O469L678
1678A60504M03k931n942q407j0186j1155j1307j0834j0053r200q336p439o537n722n045m450
1676D3363l855l272k778k404k088j765j458j223j075r72q77p87p07o31n59m91m28l53k53j30
1674A7257JJ24K32L51N07P02R08J111J323J569J855K174K519K862L156L355L422L323L038
1671D9789K573J947J153J86q75j873k674l241l592l713l610l373l126k899k623k274j935j701
1669A8139j559j423j260j094r45q00o61n57n02m72m43m12l91l63l18k85k90l15l05k48j91
1667E305j86k09k05j61j22j28j62j77j59j24r9q7q6r9j18j23r7n7l3l5l9k4j2l3o6o1j2J7
$$ plain form
1683 32179 30716 29515 28552 27791 27196 26742 26398 26138 25981 25970 26118 26410 26858 27520 28434 29600 31022 32746 34813 37241 40073
1680 40073 43408 47350 51966 57330 63572 70829 79160 88538 98846 109817 120998 131839 141807 150357 156826 160504
1678 160504 160907 157976 152034 143627 133441 122286 110979 100145 90092 80892 72556 65117 58580 52858 47813 43363
1676 43363 39508 36236 33458 31054 28966 27201 25743 24520 23445 22473 21596 20809 20102 19471 18912 18421 17993 17640 17387 17257
1674 17257 17258 17382 17614 17965 18472 19174 20082 21193 22516 24085 25940 28114 30633 33495 36651 40006 43428 46751 49789
1671 49789 52362 54309 55462 55648 54773 52900 50226 46985 43393 39680 36070 32697 29571 26672 24049 21775 19840 18139
1669 18139 16580 15157 13897 12803 11858 11058 10397 9840 9338 8866 8423 8011 7620 7257 6939 6654 6364 6049 5744 5496 5305
1667 5305 5119 4910 4705 4544 4422 4294 4132 3955 3796 3672 3573 3486 3400 3301 3183 3060 2963 2906 2873 2838 2799 2775 2763 2730 2664 2603 2591 2608
1663B608k3r0j07o7l2l9n1l5j2j4l3l9l5l5l7k0jkk1k7j2JJj0l1o0o9k2N3P4J7m7n3k4k9m9
1659A628k4L7N2mn0k5J3qn7m9J2L9on8n2j1J3Pnj3k3k3j0lj5l1l5k9k6j5OJ9J0lllj1j2PK1
1654A260J6PPrm8o0rM9M8NpJ0%m9o9k9K1M0L2J6j9m7l1K1L9J1j1QK5Lk6k7j9k0j1Lj7o6o8
1649I79%M6Om6j9M7N5J4OK9K2j6k0Nom7l9K4M9nn3k1L7L9j2m4l0LK1J0k2l7j4K4K1k6n9n9
1644H62n1m1LO7Q4L3j6j0Rol1j6J5J6LJ7L6K0j9k9nJ2Lj0k4l6k3L1P8N1l1p7m7KJ0j1j8lJ7
1640H65L3L4J0k7m4k5PK3K4K0J2pk3j9ML0L7K4Mj1k4m0m7k0K9N0J2m4n8k7KJ3K1L7M0J8j4
1635I19l2k9pJ3Mk9m9k2L1N4L9K0J1ol7n5m3j7J0L1L0kl1j4L2L9rm5j8L2M4K6J3jl9o7l0M2
1630H08O4On9n6kL6K3rj8MK9K4j0l6k2J0J6j6m4m3k8k6k5j2OPKJ1L8N1L3LrMJ9K3J6J5J8N
$$ plain form
1663 2608 2585 2495 2388 2321 2289 2250 2199 2164 2152 2138 2105 2066 2031 1996 1959 1939 1938 1936 1915 1888 1876 1877 1878 1868 1837 1777 1708 1686 1739 1813 1830 1783 1730 1706 1677 1628
1659 1628 1604 1641 1693 1689 1639 1614 1627 1619 1562 1513 1525 1564 1558 1500 1448 1437 1450 1457 1452 1439 1416 1393 1383 1380 1365 1334 1299 1270 1244 1229 1235 1254 1264 1261 1258 1255 1244 1232 1239 1260
1654 1260 1276 1283 1290 1281 1233 1173 1164 1213 1261 1266 1259 1269 1269 1220 1151 1122 1143 1183 1215 1231 1212 1165 1134 1155 1194 1205 1194 1202 1227 1230 1204 1177 1158 1138 1127 1130 1113 1047 979
1649 979 979 1025 1031 985 966 1013 1068 1082 1088 1117 1139 1123 1103 1108 1102 1055 1016 1040 1089 1084 1031 1010 1047 1086 1074 1030 1000 1003 1024 1034 1012 975 961 985 1006 980 921 862
1644 862 811 770 773 840 924 957 941 931 940 934 903 887 902 918 921 938 974 994 975 946 941 953 956 946 922 886 863 894 972 1023 992 915 868 870 880 869 851 848 865
1640 865 898 932 942 915 871 846 853 876 900 920 932 925 902 883 887 917 954 978 982 971 947 907 860 840 869 919 931 887 829 802 804 817 838 875 915 933 919
1635 919 887 858 851 864 868 839 790 768 799 853 892 912 923 917 880 825 782 765 775 806 836 834 803 789 821 860 851 806 788 820 864 890 903 902 863 796 766 808
1630 808 872 878 819 763 761 797 820 811 793 797 826 850 840 804 782 792 808 792 748 705 677 651 626 614 620 627 629 640 678 729 762 765 756 760 779 802 818 833 851 856
1626H56k9n6m5JL3K3j4k4OL8K4k7o0l1L2O1K5k8l7jK2Nj8j5j%j3qJ4K3J1klJKRJ8J1j9m0k0
1621G24K4M1J7j3j2J7L8K7%j2MK8L2J5PK3L8K3j3l6k7qKoj7k0rMPJlOJ0%mRJ3k8r2j00k7O5
1615G48R0M2j7m0k9nJ9L3L3J9%j9l9m5k4J3M0M2M0M7O2N5K3j0j0K1N0N0M1N6Q8R2M7pk2ML4
1611A522L2%m1o5n8l7k7m0n7n4m2l9m3l7k0jRJ0LlLJ0lm0o2m3j0LjnomJ3M9O0J4m6m2K7P5
1606A004N5J0nNJ1K2N3Q1O7J7j9MO4R9O8%k8J0M7J0o8r6m7Jj5p1j04r7o8l7j2j7m1m4rJ7M
1601H71j1PL2J2l5m7j7J0J1Mkj4j5J0L6J6l3m1lJ4j7l9%M6K5l2l5K9O8L0k8k7K5O3N9L8K1
1597A031ll1k6J3M0J5k3k0J9L3km5n3m1l2k7k1k8n4o0k2K6L4J4J3L8M0Ll1k3J0J8j4n3n4j5
1593F69K2J0l4n1j4L4L4LqJ1K5J8J4K7L5J9kj2j9k1lL4N3K9j4l2k1rp%J3J4lj7oJ5J5lj5q
$$ plain form
1626 856 827 771 726 727 760 783 769 745 751 789 813 786 726 695 727 788 813 785 748 747 769 774 756 741 740 740 727 719 733 756 767 765 762 763 765 774 792 803 784 744 724
1621 724 748 789 806 793 781 798 836 863 863 851 855 883 915 930 937 960 998 1021 1008 972 945 937 939 933 916 896 887 891 898 899 896 902 912 912 908 917 930 902 810 710 683 748
1615 748 838 880 863 823 794 789 808 841 874 893 893 874 835 790 766 779 819 861 901 948 1010 1065 1088 1078 1068 1089 1139 1189 1230 1286 1374 1466 1513 1506 1484 1488 1522
1611 1522 1554 1554 1513 1448 1390 1353 1326 1286 1229 1175 1133 1094 1051 1014 994 993 1002 1012 1015 1012 1015 1025 1022 982 920 877 867 870 869 864 858 854 867 916 976 990 944 902 929 1004
1606 1004 1059 1069 1064 1069 1080 1102 1155 1236 1303 1320 1301 1305 1369 1468 1536 1536 1508 1518 1565 1575 1507 1411 1364 1365 1350 1279 1175 1078 1010 973 961 944 903 859 850 867 871
1601 871 860 867 899 911 876 829 812 822 833 837 835 821 806 816 852 868 835 794 791 805 788 749 749 795 820 788 753 782 850 880 852 825 850 913 972 1010 1031
1597 1031 1028 997 971 984 1024 1039 1016 996 1015 1048 1046 1001 948 907 875 848 827 799 745 685 663 689 723 737 750 788 828 831 800 777 787 805 791 738 684 669
1593 669 691 701 667 616 602 636 670 673 665 676 701 719 733 760 795 814 812 800 781 760 757 791 844 873 859 827 806 797 790 790 803 817 814 797 791 806 821 818 803 795
1588G95kj7l5k1J3K5Kk9l4k0ML6O5N8J3l3n4n8n5k1M4P6L8j5j3K2J5k9m4k3j2j8QN4M5k3n9
1583F98k0K7K8J7L7L5k2o6k9L8L8j1j6L2N5K2j1oJ4J8J7J3jj3KL1K9ml0k8j3RL8N5N3O5J11
1579A212J37Q8K5M8J47K01J71J43J75K19K20K19K59K96K70K03J41O3n1j60k03k09k41k85k88
1576B800k45k02j82j64j52j54j43r6m8m6o8n4j3lk3k3rl4r3r8l2J2k0n7j7N0M4k1m1J2N9L2
1572I71l7p3n2j1Olk0j8JJ5J2jpoOK2K3pm7n0j1K3J8MJ6K8Jl8k6K7M1pn2l4K2M9L4Pnqppj4
1566G85k1pK5M3K7pk3j8nNOj3m4n4k6RJ7PJ0J9Pk3l8k7j3jJ9M3M0Jm4n4k6K3O9P2K5k7k5J0
1561G66Ol9m6J6O8L9j7j1L5K6l6o2k6ll2m6%M3K2j4J2O7N2k6o4j6L9K9j5l1j1NJ4K8L3J4j3
1557H06j3J4L7L7K6J2jqj4k6l4j3L8O3J8m4m1K4N9K6j4%L9N6O6R0R9P0M5P0J07R9P0Q1J10
$$ plain form
1588 795 793 776 741 720 733 758 760 731 697 677 681 717 782 840 853 820 766 708 653 632 676 752 790 775 762 784 799 770 726 703 691 673 681 735 780 757 698
1583 698 678 705 733 750 787 822 800 734 705 743 781 770 754 786 841 863 852 846 860 878 895 908 907 894 896 927 956 952 922 894 881 890 928 983 1036 1101 1212
1579 1212 1349 1437 1462 1510 1657 1858 2029 2172 2347 2566 2786 3005 3264 3560 3830 4033 4174 4237 4186 4026 3823 3614 3373 3088 2800
1576 2800 2555 2353 2171 2007 1855 1701 1558 1462 1414 1368 1300 1246 1233 1230 1207 1184 1175 1141 1048 950 918 930 910 853 836 886 930 909 868 880 939 971
1572 971 934 861 809 798 804 801 781 763 764 779 791 790 783 777 783 805 828 821 774 724 713 736 754 758 774 802 803 765 739 766 807 800 748 714 736 785 819 826 821 813 806 799 785
1566 785 764 757 782 825 852 845 822 804 799 804 810 797 753 699 673 682 699 706 716 735 742 719 681 654 641 640 659 702 742 743 699 645 619 642 711 783 808 781 756 766
1561 766 772 733 687 703 771 810 793 782 817 843 807 745 719 716 684 638 638 681 703 689 701 768 820 794 730 714 753 782 767 736 725 730 744 772 805 819 806
1557 806 793 807 844 881 907 919 918 910 896 870 836 823 861 924 942 898 857 881 940 966 952 952 991 1047 1113 1203 1302 1372 1417 1487 1594 1693 1763 1844 1954
1553A954Q0Kl0mrq0j22p9l1o1j18j06n0m5r4j14p5l2j3KJ8J0j5j6MKj5jL3K7k6n0j4K3Ok0
1548I41jK9K1okK0J0k4l0mJ4Q%jj2k4k0qj2k5j4J4J6j4l5j5K2M8N6M6J1l3n0k7KOOK4M8M4
1543A029Pk9l2oJ1rm3l5K4O6K6n9r2m4J4K3J2K1L8K4lNL6M3J6LK0K6qm6m3pJ8K3K3L0L1J8
1539A131Kj3k1j8kJ5J6ol7o1o6m1KL0L0K6M2N8K5m2p6m8lJ2RK3M5L7Lj5pPJ9L6M4K0k6m7k2
1534A081J3K2J2Kqk4k8nK6L7K9K2K2J9Lj9l4k9mK2L8M5M6J9l7p5m8J6M9L4K1L0L2J7K6O7P4
1529A513J5m1l1nl7r3p6J5P3M6pj7PK9M5O2N5J9j1pJ6K6K5K8L8L8K4RJJ0K5K6kk5kM5N5J1
1525A902l4k9PL3M1M2L7K7J7J7J7L2P0J13J05M1j3OO9J04Q9O4N6N5N2N3N7O3O9Q1R2R7R8J03
1521C633J12J20J30J34J30J30J62K31K97L34L60M20N20O26P11P84Q56R21R58R54R01P99O45
$$ plain form
1553 1954 2034 2036 2006 2002 1993 1913 1791 1712 1681 1620 1502 1396 1346 1301 1207 1093 1018 986 973 975 993 1003 988 972 976 978 963 962 995 1022 996 946 932 955 961 941
1548 941 940 969 990 984 982 1002 1012 988 958 954 968 976 976 975 963 939 919 911 899 874 860 874 890 876 841 826 848 896 952 998 1009 976 926 899 901 907 913 937 985 1029
1543 1029 1036 1007 975 969 980 971 928 893 917 983 1009 950 858 814 828 851 863 884 922 946 943 948 984 1027 1043 1046 1066 1092 1084 1038 995 988 1006 1029 1052 1082 1113 1131
1539 1131 1133 1120 1099 1081 1079 1094 1110 1104 1067 1006 940 899 901 931 961 987 1029 1087 1112 1070 994 946 943 955 964 987 1032 1069 1072 1057 1050 1057 1076 1112 1156 1176 1150 1103 1081
1534 1081 1094 1116 1128 1130 1122 1098 1070 1065 1091 1128 1157 1179 1201 1220 1223 1204 1170 1141 1137 1159 1197 1242 1288 1307 1270 1195 1147 1163 1212 1246 1267 1297 1329 1346 1372 1439 1513
1529 1513 1528 1487 1456 1451 1414 1321 1245 1260 1333 1379 1372 1355 1362 1391 1436 1498 1553 1572 1561 1554 1570 1596 1621 1649 1687 1725 1749 1758 1759 1769 1794 1820 1818 1793 1791 1836 1891 1902
1525 1902 1868 1839 1846 1879 1920 1962 1999 2026 2043 2060 2077 2109 2179 2292 2397 2438 2425 2431 2500 2604 2693 2757 2813 2868 2920 2973 3030 3093 3162 3243 3335 3432 3530 3633
1521 3633 3745 3865 3995 4129 4259 4389 4551 4782 5079 5413 5773 6193 6713 7339 8050 8834 9690 10611 11569 12523 13424 14223 14868
1518A4868M54K41K0k15m67o94q28q31p57o83o32n79n10m45l91l29k58k07j80j50j17j01r8
1515G111p1mO4R2R5R1Q6R4J38K06K33K02J78K13K63K64K32K34K72K98K94L07L60M13M31M24
1512A2520M37M95N69O04N78N50O03P24Q11Q13Q04Q65R85J099J190J286J389J502J651J854
1509C1329K075K304K589K953L350L738M187M770N457O195P030Q063R313J0771J2498J4579
1507A31201J7040J9961K3589K8145L3501L9199M4696M9387N2520N3411N1734M7333L9733K8348
1506F59798J3473l249j9577l3747m4626n1374n3627n2046m8190m3539l8828l4253k9952k6076
1504A94187k2634j9546j6802j4438j2425j0678r176p942o952o136n429m794m211l693l267
1502D6064k935k667k441k249k059j851j666j560j503j400j244j132j117j115j035r14q34q03
$$ plain form
1518 14868 15322 15563 15583 15368 14901 14207 13379 12548 11791 11108 10476 9897 9387 8942 8551 8222 7964 7757 7577 7427 7310 7209 7111
1515 7111 7040 7036 7100 7192 7287 7378 7464 7558 7696 7902 8135 8337 8515 8728 8991 9255 9487 9721 9993 10291 10585 10892 11252 11665 12096 12520
1512 12520 12957 13452 14021 14625 15203 15753 16356 17080 17891 18704 19508 20373 21358 22457 23647 24933 26322 27824 29475 31329
1509 31329 33404 35708 38297 41250 44600 48338 52525 57295 62752 68947 75977 84040 93353 104124 116622 131201
1507 131201 148241 168202 191791 219936 253437 292636 337332 386719 439239 492650 544384 591717 631450 659798
1506 659798 673271 670022 650445 616698 572072 520698 467071 415025 366835 323296 284468 250215 220263 194187
1504 194187 171553 152007 135205 120767 108342 97664 88488 80546 73594 67458 62029 57235 53024 49331 46064
1502 46064 43129 40462 38021 35772 33713 31862 30196 28636 27133 25733 24489 23357 22240 21125 20090 19176 18342 17539
1500A7539p52o65n89n55n38n13m89m78m68m46m15l96l90l76l29k58k05j94k00j96j95k19k46
1497H427k36k06j87j79j54j33j51j83j62j11j16j87k15j52q1r1j36j23p0o0r8j16q4m8l2k3
1494E093j8l5p3r3p9n1l2k4l1n2o8n5k2LJ3J9K2K2L2P0J20J57J75J77J58J15O8L6%o0j21j48
1490E318j53j72k02k13k00j81j61j29r6q4q9p6m7l1l0oL5M8J2k1lM4O7O2O3P3P5O0L6Nm2q9
1486C873j13j14j22j44j61j47j12q2o6o0o0o9p6o7m1k5m1o9p9o3m7m2k7jJ1j2m6n1k5RK4J7
1482A972j5n6p4o0l6k6k1jJ5jl2l4mK1K3K4K6J5nj1mk2n4n4JN1M8J1j7l3n1n8l2oj1l3j8K7
1478A465N2L1jj1j2k6m3l4oJ2ml1l4%L8M3Rl0m2k7jJ2Mj9k4J0N2M6j7o7n0NL3J5oj5l3o6p6
1473A152l3L5P7P5M4%l3k9J5N1M3Lk1rQJ2J0J9K5Ml1n7m9j6K5N3M8J2k0k4j3j3j5PL4K3j5
$$ plain form
1500 17539 16787 16122 15533 14978 14440 13927 13438 12960 12492 12046 11631 11235 10845 10469 10140 9882 9677 9483 9283 9087 8892 8673 8427
1497 8427 8191 7985 7798 7619 7465 7332 7181 6998 6836 6725 6609 6422 6207 6055 5974 5883 5747 5624 5554 5494 5396 5280 5196 5148 5116 5093
1494 5093 5075 5040 4967 4874 4795 4744 4712 4688 4657 4605 4537 4482 4460 4463 4476 4495 4517 4539 4571 4641 4761 4918 5093 5270 5428 5543 5611 5647 5647 5587 5466 5318
1490 5318 5165 4993 4791 4578 4378 4197 4036 3907 3811 3727 3638 3562 3515 3484 3454 3448 3483 3531 3543 3522 3519 3563 3630 3692 3755 3828 3903 3963 3999 4004 3962 3873
1486 3873 3760 3646 3524 3380 3219 3072 2960 2878 2812 2752 2692 2623 2547 2480 2439 2414 2373 2304 2225 2162 2115 2073 2046 2045 2056 2044 1998 1947 1922 1931 1955 1972
1482 1972 1957 1901 1827 1767 1731 1705 1684 1683 1698 1697 1665 1631 1627 1648 1671 1695 1721 1736 1731 1720 1716 1694 1640 1586 1587 1638 1686 1697 1680 1647 1596 1538 1506 1500 1489 1456 1438 1465
1478 1465 1517 1548 1547 1536 1524 1498 1455 1421 1415 1427 1423 1392 1358 1358 1396 1439 1448 1418 1376 1349 1348 1360 1364 1345 1321 1331 1383 1429 1412 1345 1295 1300 1333 1348 1342 1327 1294 1228 1152
1473 1152 1119 1154 1231 1306 1350 1350 1317 1288 1303 1354 1397 1400 1379 1370 1378 1390 1400 1419 1444 1448 1417 1360 1311 1295 1320 1373 1421 1433 1413 1389 1376 1363 1348 1355 1389 1412 1397
1468A397j9L3O7K5m3m9ML4Qj9j1Jj2k4rJ4Mk2l3l1k7j5J0K1Mj8k0j8k4j8J5K5k6q3o0K5O1
1464A167On9o6l8k6j2L4P5M0m2o9kQ0P2j5q7q1l2lKJ6L7K6j5l1QM9L5rj4K2L4om9n0k6j1J
1459I61K7N0M4J0k5m5n2n2m6l9j9K1N9N5J6nJ6L9K3nnJ5J2j8m3m4l0j1J0K1J5RJ7J7ql5k3
1455I32K4N2K8k0m5l6j1J1J5jj2JL0M5L7Rk9o7p1k6L0M2Qj6KK1J0poMrk2j2P%j8pL0M0Ll7
1450I29l9j5JJ5L7N2L6Lj3j2j5k4j5J5L0J7PK5M6L1j1m0m6n4n6l1QJ0k9m6jN5N0ml6j7J5K9
1445I07L6M0L0NmJ6M0L5jm6q1q1l0L7O0K8qj0nk7n1l6J0L6L4L0L4K8J0NJ3Rj7k7JL3L3J3%
1440A099pl1n7m5LL3J6j6oM3P0M6Kj9j6k0l1k1J5L2Pl5m6k2LJ3K3L7M0K9J3OkrNM5P3O3L0
1435A363J3J9J9J0K0O1J06J22J23J38J76K11K30K47K68K78K63K27J90J48Q2j6j24k11k58k71
$$ plain form
1468 1397 1378 1411 1478 1503 1460 1411 1415 1449 1457 1438 1427 1428 1416 1392 1383 1397 1401 1379 1346 1315 1288 1273 1283 1304 1308 1290 1270 1252 1228 1210 1225 1250 1224 1141 1081 1106 1167
1464 1167 1173 1114 1048 1010 984 972 1006 1081 1121 1079 1010 1008 1088 1160 1145 1058 977 945 942 944 960 997 1023 1008 977 985 1034 1069 1060 1046 1068 1102 1096 1047 997 971 960 961
1459 961 988 1038 1082 1092 1067 1022 970 918 872 833 814 835 894 949 965 960 976 1015 1038 1033 1028 1043 1055 1037 994 950 920 909 919 940 955 964 981 998 990 955 932
1455 932 956 1008 1036 1016 971 935 924 935 950 949 937 938 968 1013 1050 1059 1030 963 892 866 896 938 946 930 932 953 963 956 950 954 945 923 911 918 918 900 893 923 963 966 929
1450 929 890 875 876 891 928 980 1016 1019 1006 994 979 955 940 955 985 1002 1009 1034 1080 1111 1100 1060 1014 960 904 873 881 891 862 816 815 870 920 916 880 863 878 907
1445 907 943 983 1013 1018 1014 1030 1070 1105 1104 1058 977 896 866 903 963 991 983 973 968 941 890 854 864 900 934 964 998 1026 1036 1041 1054 1063 1046 1019 1020 1053 1086 1099 1099
1440 1099 1092 1061 1004 959 962 995 1011 995 989 1032 1102 1148 1150 1131 1115 1095 1064 1043 1058 1090 1097 1062 1016 994 997 1010 1033 1070 1110 1139 1152 1158 1156 1147 1152 1197 1270 1333 1363
1435 1363 1376 1395 1414 1424 1444 1505 1611 1733 1856 1994 2170 2381 2611 2858 3126 3404 3667 3894 4084 4232 4314 4298 4174 3963 3705 3434
1432C434k67k54k28j92j70j71j82j71j28q8p4o9m8k7m1p8q5m0J8L2mn4p1m6oJ6J1kmkkNK0
1428A032J2l6q1o2LL6Qj4J4M0Rl5l2ok5o2m0K9M7k0p9n0K2N1L2J5K2K9J7%j2j4JK2L1J8Kj4
1424I10m5p5n6K3Q4N6k9p7n4oK0K8K8J8KJJ9L6L6K4J2ok1k1j1mqj1qplJ1K1Pk8n1l5QM2N0
1419H80L2OrnJ0K9M8N8L6pl3k2lkmQOl2p1n2KK5pl3k4ok%Ppl2k2K0L0pk8J3M9K0l4k9K0L6
1413H64RpJ1K3Rmj5l4m7k1K2K8mj3J6K5ok9qPk3o1n5j6NPJ8M0M2K2NKLRK0J6qj4J9N3K7l9
1408H98o3j6M2N0J4j6k5k8k6rK5N3O0M4J3k3m5m3k6nJ2J6Jk0k2LL1K8RJ4N9R2O0j5n0pN6O8
1404A209L3QJ2J7J3K4M5M3Rj1K0O6P2M0Qj0k8l8k1J2K1nk8k2kKj2k3j9mJ3J4j3n3p1n8l1j6
1399A216j5j9k0k1k4l6m9l2J2L6jp2r8o4k0oML6N3K0l1l5J0M2K7mqONk0m2m2j9RL0M0M1K2
$$ plain form
1432 3434 3167 2913 2685 2493 2323 2152 1970 1799 1671 1583 1509 1440 1392 1365 1324 1246 1161 1121 1139 1171 1167 1113 1042 996 990 1006 1017 1015 1011 1009 1007 1012 1032
1428 1032 1044 1008 927 865 868 904 912 898 912 952 961 926 894 888 863 801 761 790 837 817 738 688 710 761 793 808 830 859 876 876 864 850 851 873 904 922 924 910
1424 910 865 790 734 757 841 897 868 791 737 731 751 779 807 825 827 828 847 883 919 943 955 949 928 907 896 892 884 873 865 858 855 866 887 894 866 815 780 788 830 880
1419 880 912 918 909 904 914 943 991 1049 1085 1078 1045 1023 1020 1018 1014 1022 1028 996 925 873 875 900 893 860 836 830 828 828 835 828 796 774 794 824 817 789 802 851 871 837 808 828 864
1413 864 873 866 877 900 909 905 890 856 809 788 810 838 834 821 837 862 856 827 819 826 803 742 687 671 676 683 701 741 783 805 810 812 815 824 844 860 852 838 857 910 937 898
1408 898 835 819 861 911 925 909 884 856 830 821 846 899 959 1003 1016 993 948 905 879 874 886 902 903 883 861 864 895 923 932 946 1005 1097 1157 1142 1092 1085 1141 1209
1404 1209 1242 1250 1262 1279 1292 1316 1361 1404 1413 1402 1422 1488 1560 1600 1608 1598 1570 1532 1511 1523 1544 1539 1511 1489 1487 1489 1477 1454 1435 1431 1444 1458 1445 1392 1321 1263 1232 1216
1399 1216 1201 1182 1162 1141 1117 1081 1032 1000 1012 1048 1047 975 877 813 793 787 791 827 880 900 869 834 844 886 913 909 901 907 912 892 850 808 789 798 828 868 909 931
1394I31j7m1k3J8L1jl0j6J6K0j5m7n0l0%J9J3j2k5qQPRL6M5Jo2o9k4QJoJ0J6LPM1M9jm9l6
1389G27RK2NMJ9J7OJ3L4K8j0l3k6j7k1j8LK0J9J3J1jk1k0RL0J4k2l2j3J3K1J3jj1j2oRK0J5
1384H30j4m9n1j3J8%l1j9L3N9K5k2k9jK8M2L5km6n8k4J1J1jJ1L4L0lk6k4j7j9k2rJ3L8M4K5
1380H07pk2j0Kpj3J1M0K7j5l9k3kkj2j1nkj%lqp%RK3L9L5Jl4m0k1r%J7K7jm0k9K7N0Nm6l8
1374F73J2L9L3K1J1nj7pOol4l9j2J6K3K3K9M2N0M1Qk9k7RK5j5o2m2L4Q0N3kk4j1KKpk2l7l4
1370H00j0J8K9K3Kk4l7j3K6L4Kk5pL8O2N2K7Kk2l5l1j8j2nJ2L1L2Rj1j7j0kkkkjmj9l2k3J0
1365H45L5L7L2L8L5Jn2p0l3K0M5M2L6L2K1QKlj4k8k9j8j6k3j9J0L8M1K0Jj0j3%L4O3M6rm4
1360A101j6L8O4M2Kl0m9m7k1J9M2L5J7NQJ7K5K2J1NJ3J8J2J1L4N6L6j6m3j3L8O5M6jm5n6k0
$$ plain form
1394 931 914 873 850 868 899 898 868 852 868 888 873 826 776 746 746 765 778 766 741 733 741 748 757 793 838 839 777 708 684 692 693 687 697 713 716 723 764 813 812 763 727
1389 727 736 758 763 767 786 803 809 822 856 884 874 841 815 798 777 759 762 782 801 814 825 824 803 783 792 822 836 814 782 769 782 803 816 815 804 792 786 795 815 830
1384 830 816 767 716 703 721 721 690 671 704 763 788 766 737 736 764 806 841 839 793 735 711 722 733 732 743 777 807 804 778 754 737 718 696 687 700 738 782 807
1380 807 800 778 768 770 763 750 761 801 828 813 774 751 749 747 735 724 719 717 716 716 713 705 698 698 707 730 769 804 805 771 731 710 701 701 718 745 744 704 675 702 752 757 711 673
1374 673 685 724 757 778 789 784 767 760 766 760 726 687 675 691 714 737 766 808 858 899 907 878 851 860 885 870 808 766 800 880 933 931 907 896 898 900 893 871 834 800
1370 800 790 808 837 860 862 838 801 788 814 848 850 825 818 856 918 970 997 999 977 942 911 893 881 876 888 919 951 960 949 932 922 920 918 916 914 913 909 890 858 835 845
1365 845 880 917 949 987 1022 1023 971 901 868 888 933 975 1011 1043 1064 1072 1074 1071 1057 1029 1000 982 966 943 924 934 972 1013 1033 1034 1024 1011 1011 1045 1108 1154 1145 1101
1360 1101 1085 1123 1187 1229 1231 1201 1152 1105 1084 1103 1145 1180 1197 1202 1210 1227 1252 1274 1285 1290 1303 1321 1333 1344 1378 1434 1470 1454 1411 1398 1436 1501 1547 1546 1501 1445 1425
1355A425K7M4L6N2R2R6L4k9j9M0O6L9J5L2O1N7K5%J1O0J09J13P3M6P7J29J41J12J08J57K01
1352C430J89J56J72K43L08L35L61M34N46O37O91P52Q83J081J311J559J866K264K734L228L691
1349B6871M045M220M190L982L560K792J613J73j252k484l482m177m435m234l782l333k961
1347B1306k587k190j853j622j431j204r63p82o73n88m92m07l60l39l02k25j40r6r5r7p7o3
1344D720r0j29j18m6L3N6K9%jK0L7M4M8O3P9Q1P6Q5J12J26J01N8M2N9Q3R5J08J28J53J73J97
1340F422K13K08J83J72J91K32K75L08L30L45L70M26M98N42N60O03O99Q10Q85R60J106J342
1338A7680J600J847K126K508L001L561M143M719N226N586N776N836N778N498M899M077L325
1336H7186K901K879L224L936M975O101O978P455P573P296O414M876L085J630Q27O78J219K507
$$ plain form
1355 1425 1452 1496 1532 1584 1676 1772 1806 1777 1758 1798 1864 1903 1918 1950 2011 2068 2093 2093 2104 2164 2273 2386 2459 2505 2582 2711 2852 2964 3072 3229 3430
1352 3430 3619 3775 3947 4190 4498 4833 5194 5628 6174 6811 7502 8254 9137 10218 11529 13088 14954 17218 19952 23180 26871
1349 26871 30916 35136 39326 43308 46868 49660 51273 51446 50194 47710 44228 40051 35616 31382 27600 24267 21306
1347 21306 18719 16529 14676 13054 11623 10419 9456 8674 8001 7413 6921 6514 6154 5815 5513 5288 5148 5052 4957 4860 4783 4720
1344 4720 4630 4501 4383 4337 4370 4426 4455 4455 4454 4474 4511 4555 4603 4666 4745 4826 4902 4987 5099 5225 5326 5384 5426 5485 5568 5663 5771 5899 6052 6225 6422
1340 6422 6635 6843 7026 7198 7389 7621 7896 8204 8534 8879 9249 9675 10173 10715 11275 11878 12577 13387 14272 15232 16338 17680
1338 17680 19280 21127 23253 25761 28762 32323 36466 41185 46411 51997 57773 63609 69387 74885 79784 83861 87186
1336 87186 90087 92966 96190 100126 105101 111202 118180 125635 133208 140504 146918 151794 154879 156509 157336 158014 159233 161740
1333A61740M266N850O780P077O846N817L650O04k504m995o684p487p183n798l938k362j323
1331A60356o82m85j061k475m280n918p139p873p957p285o092m860l899l224k801k729l100
1329H8496l824m667n424n968o225o155n794n250m652m088l585l132k729k397k124j868j601
1327A9013j360j182j060r57q60p75o91n96n11m64m38l99l58l42l32k88k15j70j72j73j49j28
1325G393j37j48j40j25j20j30j65k41l20l20k27j42j46j98k01j49j11j10j12r4q3q4p2n2n9
1321C707r0r2n1l4p5j16q5j2Nn2j06q9l0Mj3n1q2q6n3QN1L6k8p8p9n9n3n6n0m0m6m8k1K2K6
1317B184j6m7k9QJ5pk6l7n1n7l8j2nj0MK5J6k1m0j3K1K5Pj1k0k3j6mj5n3p5m4J0L3K0PNj6
1313A694n6o9l4J1J6rj8MJ9Lk0k3rlojJ6K7J8j5n3p6o6k4J5K4J6K1K5no3q6m1K7M7K8K4L8
$$ plain form
1333 161740 166006 171856 178636 185713 192559 198376 202026 202630 200126 195131 188447 180960 173777 167979 164041 161679 160356
1331 160356 159674 159189 158128 155653 151373 145455 138316 130443 122486 115201 109109 104249 100350 97126 94325 91596 88496
1329 88496 84672 80005 74581 68613 62388 56233 50439 45189 40537 36449 32864 29732 27003 24606 22482 20614 19013
1327 19013 17653 16471 15411 14454 13594 12819 12128 11532 11021 10557 10119 9720 9362 9020 8688 8400 8185 8015 7843 7670 7521 7393
1325 7393 7256 7108 6968 6843 6723 6593 6428 6187 5867 5547 5320 5178 5032 4834 4633 4484 4373 4263 4151 4057 3974 3890 3818 3766 3707
1321 3707 3617 3525 3474 3440 3365 3249 3164 3152 3157 3105 2999 2910 2880 2884 2871 2820 2738 2652 2599 2607 2658 2694 2666 2588 2509 2450 2397 2341 2291 2251 2205 2157 2136 2158 2184
1317 2184 2168 2121 2092 2100 2115 2108 2082 2045 1994 1937 1899 1887 1882 1872 1876 1901 1917 1896 1856 1843 1864 1889 1896 1885 1865 1842 1826 1822 1807 1754 1679 1635 1645 1678 1698 1705 1710 1694
1313 1694 1638 1569 1535 1546 1562 1553 1535 1539 1558 1561 1541 1518 1509 1506 1500 1499 1515 1542 1560 1545 1492 1416 1350 1326 1341 1365 1381 1402 1427 1422 1359 1273 1232 1259 1306 1334 1358 1396
1308A396K5k3n8m4rORK2K9Rk8m5l4j3MJ7K9K7J7Ook6m1l4j0Mok1k4j4JJ8L5L5Rk9n2l7QM3
1303A195L2j1l3j0J8%m3m8kK6qn9o2j5J6Lk1k3j0kOK3L9L0LoJ3K7Pl2m5j9Mmk8k2J2L9L7J8
1298A045KkLNj1m0m9qM8N1mm6k4J9K4QJ9L6On6o2MN9M0j3k5jJ1J0J7J6k1p2p0j0M5N4L7L3
1293A078L4K6J0mj4j9qJ1K2J7Pmk5m7n2l9k5pK7N1K4l6n4KM8J8m7n1kJ5k6n6j8M1M4lk6MM7
1289I63L8j8n7l1L0M9J1l4l2lJ5J5J8J5j1m1l9qJ3J0Mnk6m7l9j1mj9j9J0K6K2K6M9M6jl3j0
1284H72J8nm5l3J4K7%qK3M0J4j4JK8J6l1n8l6JJ3pk2NM8N7J3l3k7J0L0K4K5L3Rn6j00p6nN5
1279H20P1N6K9Jj4j0J1L2M3K8lj7PM2M3J4LL0N2K7k6o2o3m8l8l4l6l5l0l0m6n3j8M9Q7O0R
1275I51j1oj3l1l0j2kkJ3L7K9j4m8m6l6l9l4QN4M8pm4j9L6N5K3j8k2LK2J6KJJ1J2%nJ2L7L9
$$ plain form
1308 1396 1421 1398 1340 1296 1287 1293 1302 1324 1353 1362 1334 1289 1255 1242 1246 1263 1292 1319 1336 1342 1336 1310 1269 1235 1225 1229 1223 1202 1178 1164 1165 1183 1218 1253 1262 1233 1181 1144 1152 1195
1303 1195 1227 1216 1183 1173 1191 1191 1148 1100 1098 1124 1116 1057 995 980 996 999 978 955 945 943 949 972 1011 1041 1044 1038 1051 1078 1085 1053 1008 989 993 989 961 939 951 990 1027 1045
1298 1045 1047 1045 1048 1053 1042 1002 953 945 993 1044 1040 994 970 989 1013 1021 1040 1076 1082 1026 964 968 1027 1067 1054 1029 1028 1039 1049 1066 1082 1061 989 919 909 954 1008 1045 1078
1293 1078 1112 1138 1148 1144 1130 1111 1103 1114 1136 1153 1160 1156 1131 1084 1032 993 968 961 988 1039 1063 1027 973 975 1023 1041 994 943 941 956 930 874 856 897 941 938 912 916 963
1289 963 1001 983 926 895 925 974 985 951 919 916 931 946 964 979 968 927 888 880 893 903 907 902 876 829 790 779 775 756 737 747 773 795 821 870 916 915 882 872
1284 872 890 885 840 807 821 848 848 840 863 903 917 903 904 932 948 917 859 823 824 837 830 808 813 861 918 931 898 871 881 911 935 960 993 1002 946 846 770 765 820
1279 820 891 947 976 977 963 953 964 996 1039 1067 1064 1047 1054 1096 1139 1153 1156 1186 1238 1265 1239 1177 1114 1066 1028 994 958 923 893 863 817 764 746 795 882 942 951
1275 951 940 934 921 890 860 848 846 844 857 894 923 909 861 815 779 740 706 714 768 816 809 765 746 782 837 860 842 820 823 845 861 863 864 875 887 887 882 894 931 970
1270I70Qk5l1j5lJJ9M6M7J4j2PM1L8Lj8rlj1lK8N5O0O8Q9R0O0N0R1J32J15P7Q8J43J82J88
1265B580K05K41K52K22K01K10K13J65R1L2Nnj6n8j41k22k26j67j43k01k65k37j47q2p1o7m5
1262B324l0l1k4j3l5r1j25j08o7l4j1O%l0n0l8j1nj8l7o4q2o2KN9N2kl5k6mkj5l1m3m6k9k
1258A242Kk4m9l6OM2N2L5%l2l8k1j1k6m7l6nQj4l7l3j2%OK1K7J3j3k2j6j6k3j2J9L0on7o6
1253H51k2K0J9rj6MJ8jl0k6QL5K8jk1k0j3JK5M4L0j1l3j0L0L2ml8m1l3k9j4K3M6J5l6l9J4
1248G96N2J3o0q4m9k1k7k3K2O5M8pl3j9pj4j3J0K9K0QMrl0k3L3P5M4j9l0K5N9K4k4k3NKl4
1244G85n1l4k1k9k9LL9N4N0M2K1k1n7n5j6J9K2OnJJ8K6J0l0o2m6K1Q1P9J8m6o4k9K5O0M5p
1239H23m2k3K4L7mn2m6J1O3O9K9k4n7n0k0KKjJ2L0K7Jk2k3j0MRMoj2olj7l5l3pJ6K0J4Q%m
$$ plain form
1270 970 978 953 922 907 904 905 924 970 1017 1031 1019 1026 1067 1105 1108 1090 1081 1078 1067 1064 1092 1147 1207 1275 1364 1454 1514 1564 1655 1787 1902 1979 2067 2210 2392 2580
1265 2580 2785 3026 3278 3500 3701 3911 4124 4289 4380 4412 4417 4412 4396 4338 4197 3975 3749 3582 3439 3238 2973 2736 2589 2507 2436 2369 2324
1262 2324 2294 2263 2239 2226 2191 2100 1975 1867 1800 1766 1755 1761 1761 1731 1681 1643 1632 1627 1609 1572 1508 1426 1364 1366 1425 1477 1475 1440 1414 1410 1408 1393 1362 1319 1273 1244 1242
1258 1242 1244 1220 1171 1135 1141 1183 1235 1270 1270 1238 1200 1179 1168 1142 1095 1059 1054 1062 1048 1011 978 966 966 972 993 1020 1033 1020 998 982 966 943 931 950 980 974 917 851
1253 851 829 849 868 859 843 847 865 864 834 808 816 851 879 878 857 837 824 825 850 894 924 913 880 870 900 932 928 890 849 816 787 773 796 842 857 821 782 796
1248 796 848 861 801 717 668 647 620 597 619 684 732 725 692 673 666 652 639 649 678 698 706 710 701 671 648 681 756 800 781 751 776 835 859 835 812 817 819 785
1244 785 734 700 679 650 621 624 663 717 767 809 830 809 752 697 681 700 722 728 723 724 742 768 778 748 686 640 661 742 821 839 793 729 700 725 785 830 823
1239 823 781 758 782 819 815 763 717 728 791 860 889 865 808 758 738 740 742 741 753 783 810 811 789 766 756 760 769 773 767 755 749 746 729 694 661 654 670 690 704 712 712 708
1234G08kLpk5k5OM8O2M5J6jk%j5m1o0m8k5k4m0l3OL5K5QK7O3N5mn2m6kL8N6N2K0k1l9k0%p
1229G34k0j3RRj0j9nJ4K8M1M6K4k2n3m5j2J4K3J5kk2l3k9j4NM0P0N9op2p4j9L5N2M4K3j3m9
1224G53m1J2N2K8l2o1m1qJ0K9N6O5K8l1n4j6L5L8ql8rM0L2l8r6p6j0L0J2k2l3rL2N8M8J8L
1220G56J2J1j9m0oN2O8K9ojJ0j0m2n3m0j4K2N6N4Nm5m9j6OKnkOK0L7K9j9p0o4pL1J9j2j3P
1215F99J7RjmnMK6M7M2J5j7l2k4JK4J5l1p3o7j6K8K8P%J4J8MpKOj9m7l9QL8K0j1j9oqj8pK3
1210F44L4J5NK4M0J2m4p2m0K0N7M5mm5m3pK6L0K0K2L2K6jk4k3mJ0J2Lqj2mRJ0mj6nK8M8L8
1205H54J1j1l2o4q5o2kM1L0rk1PL7L5J5PJ5J8NoLK3K4nk2LM6M5%l1j4Oj4m8m6k1j5k4jM4M9
1200G85Jl6j2L0K9nk7k1rqk3m4m6qN0P0L6j%Ok4n4l3J7L2Mj7j3rj8j9JJ7K1L1M4K9k0m9j8
$$ plain form
1234 708 706 709 702 677 652 658 706 768 813 829 828 826 826 811 770 710 662 637 613 573 540 546 581 606 614 641 704 759 755 703 657 655 693 749 801 821 800 761 741 741 734
1229 734 714 701 710 719 709 690 685 699 727 768 814 838 816 763 718 706 720 743 758 756 734 701 672 658 663 703 773 832 826 754 680 661 696 748 792 815 802 753
1224 753 712 724 776 804 772 711 670 662 672 701 757 822 850 819 765 749 784 822 814 776 767 807 839 801 705 629 619 649 661 639 606 597 629 687 735 753 756
1220 756 768 779 760 720 714 766 834 863 857 856 866 856 814 761 721 707 729 785 839 844 799 750 734 740 742 737 735 741 761 798 827 808 738 674 667 698 717 705 692 699
1215 699 716 725 724 720 715 719 745 792 834 849 832 800 776 777 801 816 785 712 645 629 657 685 692 692 706 724 728 721 723 729 710 663 624 632 670 690 679 660 654 646 628 621 644
1210 644 678 693 698 722 762 774 730 658 618 638 695 740 736 691 648 641 667 697 717 739 771 797 796 772 749 745 755 767 770 762 750 746 755 765 761 745 740 768 816 854
1205 854 865 854 822 758 673 611 609 650 680 671 650 657 694 729 744 751 766 784 789 783 786 809 833 828 806 809 855 900 900 869 855 861 847 799 753 732 717 693 692 736 785
1200 785 786 750 738 768 797 792 765 744 735 727 704 660 614 606 656 726 762 761 761 767 743 689 656 673 705 709 692 679 670 652 633 634 651 672 703 747 776 756 707 689
1195F89L8O3M1pn2p0n2oL2M4L8K7Kl7o0m2LK9K3NLJ4J9Pj2k1j4rj5k1j0J4L5M1L1mn3o9k3
1190F21L4L6j2l3KL8K5pk2k8l9k9J1M1K7%J0L7K8j1l2k8l9n5k6M8R3N8j6n6l8NL2K8lk9j8
1186F53J7L0Ll0k7LL0M1M2L7K4J1J1J0pl3m2l4k2j8oJ6L1J8j1k7k0j0qkJ9L6K8NNK6K7j4o1
1181G51o4k9QK9L5L0J2qj9l4n3m2K0Q1O0k0o1k0K8J2l4l1J0K5mk4oJ8K0K4M7O5L7k1m6j3L4
1176H17K7l6q1n2QK1k4m4OP3P9K8j0j3j3k9l3j3Pmk5k7qJ4K2Rk2m5k8K3N5L5qk4j2nj2j0M
1171F50J1OMJ3J5RJ1K0J0k1l1RO2N9Jn2n2j3L2O4P0L3l4q2q1m4j4jMJojK0L0J4JJ9L2jn4m5
1166F68K6O9K9l1l4kkk8k7RK3nl1k0QJ7J3J2J5Rok1k9k5pPNKJ3K6Mm2n3oM2K9j8l1OM3M7L8
1161G42L6J7l6p8n8RN0K5k3k3K0M0Ol9m1kK2Nk5k3J9O6Q1O0K1mj8l8o6p4l9KOk1k6J3M3K4
$$ plain form
1195 689 727 790 831 824 772 702 650 644 676 720 758 785 787 750 690 648 651 680 703 708 711 725 744 751 739 718 704 695 680 659 649 663 698 739 770 766 713 644 621
1190 621 655 691 679 646 648 686 711 704 682 654 615 586 597 638 665 665 675 712 740 729 697 669 630 575 549 597 690 748 732 676 638 643 675 703 700 671 653
1186 653 670 700 703 673 646 649 679 720 762 799 823 834 845 855 848 815 773 739 717 699 693 709 740 758 747 720 700 690 682 680 699 735 763 768 773 799 826 812 751
1181 751 687 658 666 695 730 760 772 764 745 711 658 616 636 717 777 757 696 676 704 716 682 651 661 686 682 658 652 670 690 714 761 826 863 842 796 783 817
1176 817 844 808 727 675 683 704 680 636 642 715 794 822 812 799 786 757 724 711 718 714 689 662 654 668 690 699 677 632 604 627 682 717 709 685 673 668 656 646 650
1171 650 661 667 671 684 699 708 719 739 749 728 697 706 768 827 828 776 724 711 743 807 877 910 876 794 713 669 655 654 658 659 653 652 672 702 716 717 736 768 767 713 668
1166 668 694 763 792 761 727 725 723 695 668 677 700 695 664 644 652 669 682 694 709 718 712 691 662 637 630 637 642 644 657 683 687 645 592 586 628 657 639 608 614 657 704 742
1161 742 778 795 759 681 623 632 682 707 684 661 681 721 727 688 647 645 667 672 647 624 643 709 790 850 871 867 849 811 745 671 632 634 640 619 593 606 649 673
1157F73k1l0J4O4O7K8j8m0l9l1k1NL7M1jn8p6l8RK8K4L5N4N0J2l7o3m8qK9L5J1j3j5llj5j6
1152F22KJ4Nj3mK8M8L1KOL8N0J8k5l7k9l9n8m7oK1RrjJ0LnK3O3O3J9j8k1j7l1m1k2J7L5K1
1147G25nk3l0l6k6J2O3P4K5m8p6m2KJ1qj5jJ8K8L2K6Jl4n6m7lN2P3L4l0m6oK2j3o2l8M3Q1
1142F77L0m3n6j8J4J5OJ1K9M1L7J6pj6oJ1K6K9Pl7o3k9L5N2J0l3k8mpk4j4J4J7j1l9m1k2Q
1138E87M6O4M4jk8k1QL2L3Nl1l6lJ6j7o5n6LL9J4j4LM4M9J2k4m3m9m9l1ojrJL9O5L9j0k7l
1133F19J3nj8J2N4M1j5m7k1J3J2jJ1K6Qk4k2OJ1j0j6kj0l3k6K4N8L9J3K4L5mn7n3NM4L5K5
1128G64L7M0ln7o7l1J5M6N5M2Km4n6j9L1M8J6k4l1rNk%K5L3%m1l7pj1n3o8j6N5P6N1K7J5o
1124H01l2k8LJ6j4n7n8j2L8M7Ql9m4LN1M0j9n7l1K8N7M4J5pk3l3k9j3OJ3Rqk4k6lJ8J4pj3
$$ plain form
1157 673 652 622 636 700 767 795 777 737 698 667 646 651 688 729 728 670 594 556 565 593 617 652 706 756 768 731 668 620 612 641 676 687 674 659 656 653 638 622
1152 622 624 638 643 630 626 654 702 733 735 741 779 829 847 822 785 756 717 659 612 606 627 636 627 626 636 639 634 657 720 783 802 784 763 746 715 674 652 669 704 725
1147 725 720 697 667 631 605 617 680 754 779 731 655 613 615 626 618 603 602 620 648 680 706 707 673 617 570 567 619 692 726 696 650 644 666 653 591 553 596 677
1142 677 707 664 608 590 604 619 625 636 665 706 743 759 752 736 730 741 767 796 803 766 703 674 709 761 771 738 710 706 699 675 661 675 692 681 642 601 579 587
1138 587 633 697 741 740 712 691 699 731 764 769 738 702 699 715 698 633 577 580 619 633 619 622 666 715 727 703 660 611 562 531 525 524 515 516 555 620 659 649 622 619
1133 619 632 627 609 621 675 716 701 654 633 646 658 657 668 694 702 678 656 662 673 663 647 645 635 602 576 600 658 697 710 734 769 765 708 655 660 704 739 764
1128 764 801 841 838 781 714 683 698 744 799 841 843 799 743 724 755 803 819 795 764 755 760 758 758 783 816 816 775 738 731 720 667 599 583 638 714 765 792 807 801
1124 801 769 741 744 760 746 689 631 619 657 704 712 673 629 632 683 723 704 647 616 644 701 745 760 753 730 697 668 655 661 674 683 675 651 625 622 640 654 647 634
1119F34oj6l6k1M1Q6O1jj7J9M1J6j1QL7K7j2k7oJ6Mk2m1m0k9j1Kmj6rJ9L3J8rj4QK4J9mk9
1114G32l8k1J3L6K7nk6l3l4k0K2O7O7On3n5j2J8J6N%qj1KL0L6J0k4m6n7o1m1NM7N9M3J7oj6
1109F91mJ4Mk8l9pL0L2Rpk1l6l6lK2QqK6O7M1l5n5MM4Lm9l2J4J1k5k3J5K1k1m9l3mOJ8M7O6
1104F78M8Ok1j8MJ9Nl2n0j9L0M6K4%j0j9k1kK1J1k5l6j2jj7j4K6M6Rl2j6K0Rl0k8K3N8M3J6
1099G39jk1m3l2PJ3l0o4k6M7P5L3k8m6k0J5J6k1n4l6J9M6J9j6j4jj3k5RN7M6k2n7j6M1M8J7
1095F61mqj0KL4N2K1k6l8j8kKK0L8J8k5l6nPj6k6QL0om9k9K6K9k7o2k9K2L3J1LJ6K6K0Oll
1090F63J3K6J7rk2kK9L8K2nl3n2n0k8nMQJ2J5J1J3K0K5J8J1Oj5m3m3jL2J3l3m8k2KJ3L1N8
1085F89N4J1k9l2j1%jkkprj2l5p1o7mO5P5L8OLRJ8L5L9Ll8k3L0L4l6r0n5J4K3j4j5L9P3M8
$$ plain form
1119 634 628 612 576 555 596 682 743 742 725 744 785 801 790 798 835 862 850 823 817 833 837 815 774 734 705 694 696 692 676 667 686 719 737 728 714 722 746 765 761 732
1114 732 694 673 686 722 749 744 718 685 651 631 653 720 787 793 740 685 673 691 707 712 712 704 693 695 725 761 771 747 701 644 583 542 547 594 653 696 713 707 691
1109 691 687 701 705 677 638 631 661 693 702 695 674 638 602 599 621 629 621 647 714 755 720 665 669 713 716 667 635 649 660 635 612 627 648 627 578 545 541 547 565 612 678
1104 678 726 732 711 693 697 716 721 689 639 620 650 696 720 720 710 691 670 668 689 700 675 639 627 626 609 595 621 667 676 644 628 648 657 627 599 622 680 723 739
1099 739 738 717 674 642 649 662 632 568 542 589 664 697 669 623 603 618 634 613 559 523 542 588 607 591 577 576 563 538 547 604 650 628 571 555 596 644 661
1095 661 657 649 639 641 675 727 748 722 684 666 664 666 686 724 742 717 681 676 683 667 641 649 679 673 624 595 621 650 623 561 532 554 587 598 601 617 643 663 669 666 663
1090 663 676 702 719 710 688 686 715 753 775 770 737 685 635 607 602 606 614 626 641 652 665 685 710 728 739 745 730 687 644 643 675 688 655 607 585 587 600 631 689
1085 689 743 754 725 693 682 682 681 679 677 670 661 649 614 543 476 472 537 612 650 656 659 668 686 721 760 763 725 702 732 766 730 640 585 599 622 608 593 632 705 753
1080G53Jk0j5JJ6J9j1n2n9k6J1K5K9J8k2n7k7N2Q0J4n5m2J2J5j9j5K5K8k1n3l5j4j1RM7N0
1076F51%l6j0K6Pl7m0OL5K4NJ2L4M8L9Pk3k9j1KJMJ2mm2n3j0L6L4jj8j2pr%QLOL4M9Qn2o6
1070F31k5QJ3J6K0Mk6k1J5L2J2NK6L4jl3j9J3J5lkJ0Rj1l1m6m3j4L1L7rn1l2K1M1J7nlKnj0
1065F22lRRJlmmpj1rNJ5OqJK3K2koK6M3J5j7j0Rpl1%O8R8O2J2j8n4r6r6l0N3P6K9l2n7l6%
1060F63Rj6m6m0kL6N1M7L1Mj7j7j2j6j7KK2Nk7j1M6N9j2j01j10m0L9Q1Q2N7J9rj6j8k5k3j
1056F77J6Nk9n2m3oL8O0L7nj5J1K3rl7j5L1L3nk0LK4J5pj9k5k3mK1K1mj9j0QJ5J9J8Jk2j5
1051F92J9K3j9n0j3N8Q1L5l4o7n4j8J0J4qk0mK4K8Oj6j5qolNPKKPJk6m7k9J8N0M3J6KJ0K7
1046G43K9Nl1m7k0K3L4J2LL1M6Rm9n7j8Jk1l4j5rm1o2j8M5N3J7PL2L4rm0k9ojjNmk9l2kJ3
$$ plain form
1080 753 754 734 719 720 736 755 744 692 633 607 618 643 672 690 668 611 584 636 716 730 675 633 645 660 641 626 651 679 658 605 570 556 545 554 601 651
1076 651 651 615 605 631 638 601 561 567 602 626 631 643 677 725 764 771 748 719 708 710 711 715 727 723 681 628 618 654 688 687 669 657 650 641 641 649 652 658 692 741 749 697 631
1070 631 606 614 627 643 663 667 641 620 635 667 679 684 710 744 743 710 691 704 719 716 714 724 733 722 691 645 602 588 619 656 647 596 564 585 626 643 638 635 637 632 622
1065 622 619 628 637 638 635 631 627 620 609 600 605 620 626 618 619 642 664 662 656 682 725 740 723 713 722 715 684 684 752 850 912 924 906 852 756 660 630 683 759 788 756 699 663 663
1060 663 672 656 610 570 568 604 655 702 733 737 720 703 691 675 658 660 682 687 660 649 695 754 742 641 531 491 530 611 693 750 769 760 744 726 701 678 677
1056 677 693 698 669 617 574 568 606 666 703 698 683 694 717 708 671 656 687 720 715 695 698 722 737 730 711 686 663 659 680 701 697 678 668 676 691 710 728 729 707 692
1051 692 711 734 715 665 652 710 791 826 792 725 671 653 663 677 669 649 645 669 697 703 687 672 664 658 655 660 667 669 671 678 679 653 606 577 595 645 688 704 706 716 743
1046 743 772 777 746 699 679 702 736 748 751 782 828 837 788 731 713 714 693 659 644 635 594 532 514 559 612 629 636 668 702 693 653 624 618 617 616 621 617 588 556 554 567
1041E67rk4J0N6N1Pj5%J9K9L7L1km1l6RL2J2k3m1m7m2j3L4N1K0k6m8m3k0K4O8O5Jo4o2j1K9
1036E85L8L6L1J5LK1N4N3Mn0o2l6mJ6J9J1Jjkj4k9l3l2m7p0n5J1Q3R5M3k3n4l1K7P0N7jl9
1031F90j8K6K6j8n6m8j7NJ5K0Kl3n0j5L5L9kk5OM9N4K5kk3m5m8pM8N1jm1j9K6L5K0J6J6k2
1027G14p3o8%M4J0m2k9L1N3J2k1ON7O5K4j8k8j9rj0k2l7l3JM4N8L2Jj1j8l4m7k6J5L6K3J0
1022F91K1L4K0moJ0Lk9m7l5k3k8k2K0O7N6qn9m8JL6L1%l0l8j5J7L2J8MRK5K1pl1k7lOj7m7
1017E98m3KM6M3nm4m1j5kpKL3N8M8Rk2k5j5j0kJ9M4M2Rk7l9l9l8k7QM0L7kk7k0%LLJ7K7Ok9
1012F15k9J7N8M6ll1j6J3J9PKRLj7k6mK7L5J6j2l4m3k8J2M3M3K1Lrl3m7k0K9L8ol7rL2K5j8
1007F91l6oL0M0L0J9J0%k0n4q7p7j8L5K2l4o0k6K5M6L9K5J8K7M9N5J9l4n8m3j9JK5L5Jm7m2
$$ plain form
1041 567 558 534 544 600 651 658 643 643 662 691 728 759 757 716 680 689 721 733 710 669 622 580 567 601 652 672 646 598 555 535 559 627 692 693 629 567 556 585
1036 585 623 659 690 705 708 729 783 836 840 790 728 692 688 704 723 734 735 734 732 718 689 656 624 577 507 452 463 546 641 684 661 607 576 603 673 730 729 690
1031 690 672 698 724 706 650 602 585 590 605 625 627 594 544 529 564 603 601 576 582 631 685 710 708 685 640 592 585 633 684 683 642 623 649 684 704 720 736 714
1027 714 641 573 573 617 627 585 556 587 640 652 631 637 694 759 783 765 737 718 709 699 677 640 607 608 652 710 742 743 732 714 680 633 607 622 658 681 691
1022 691 712 746 766 762 756 766 769 740 693 658 635 607 585 605 672 728 720 661 613 614 650 681 681 651 613 598 615 647 665 669 678 703 724 717 686 659 656 662 645 598
1017 598 555 557 603 646 641 597 556 541 539 532 534 567 625 673 682 660 635 620 610 608 627 671 713 722 695 656 617 579 552 560 600 637 635 608 588 588 591 594 611 638 644 615
1012 615 586 603 661 707 704 673 657 670 689 696 698 707 710 693 667 663 690 725 741 729 695 652 624 636 679 722 743 746 737 704 657 637 666 704 698 661 652 684 709 691
1007 691 655 649 679 719 749 768 778 778 758 704 617 540 522 557 579 545 485 459 484 530 569 594 612 639 688 743 762 728 670 627 608 609 634 669 670 623 581
1003E81J1K2l9p9j8Q0R9M0NK9M5Kn6o7l3MK7L1J2j6k6j2Jj%J6K3NlK0L9J6k9l6JK8Jm6n4n
998F18N5P7M7ml8m1l5l8l6j0L9P0N4Ql3m4k7OL4L0j6p1q7m6J6N4O4O0M6J3k2k8nQpk4j7nj9
993F46m6m3lM1O1N6L1ql4k2RPk7l6MM0J7k5j5L6N5J2l2m3m8o7o0jO0O0K0jlk2n1l3K7N2Pl9
988E82rO8Q9K2n9p5k5K4K9jk0qK0L7L9K7nn4q4n9KL5K3kj1k0l9l6J0N5N2K2J3K2J5J1K7L3
984G50k0q7p5J0N5J3l9j6M1M9Pj6%K2J8ml0m6l8j2QJ7L6N7M9Mk7j8lj4j7RJ1n0j03n8M6Q8
979F17L7k0j7Lmj3OK9K7Rnk2k8MN4M7k9q9o1J4N2M3K3Rj4l0j1J7Ol2l8NL7J0m6o7l3J7M1L3
974E81J5M%jLMj1k9k8MK8J6j2j4QJ5JjJ7L0K9L3M4K6j9m4k7j1k2k2J5M2K1j1JK7J4k2k1PO
969F96j6kM5N7J4k2k1k2n1o7l7JLj4kL0M0Pl6n3l0K4O4O0K4OJ0Nk3l7j0J9J7kKJ9J6jmkk3
$$ plain form
1003 581 592 614 575 496 478 558 657 697 702 731 776 778 722 655 622 626 653 684 696 680 654 642 643 642 642 658 681 686 683 703 742 758 729 693 694 722 723 677 623 618
998 618 673 750 797 793 755 714 679 641 605 595 634 704 758 766 733 689 662 668 702 732 716 645 558 512 528 582 646 706 752 765 743 715 710 718 711 687 670 665 646
993 646 600 557 554 595 656 712 743 735 701 679 688 695 668 632 636 676 693 668 653 689 744 756 724 681 633 566 506 505 565 625 645 644 641 619 568 535 562 614 621 582
988 582 573 641 730 752 693 618 593 617 646 645 625 617 637 674 713 740 735 681 597 538 540 575 598 596 585 565 526 490 500 555 607 629 642 664 679 690 717 750
984 750 730 643 568 578 633 646 607 591 632 681 688 672 672 694 712 708 678 632 594 582 590 607 643 700 749 753 726 708 705 691 674 683 694 644 541 483 529 617
979 617 654 634 617 620 616 603 609 638 665 674 669 647 619 623 677 724 695 606 545 559 611 654 677 686 672 642 631 648 654 622 584 589 626 636 590 523 490 507 548 581
974 581 596 600 600 599 602 606 595 566 538 542 570 586 574 560 568 583 584 583 600 630 659 692 736 762 743 699 672 661 639 617 632 674 695 684 685 712 726 704 683 690 696
969 696 680 678 723 780 794 772 751 729 678 611 574 575 578 564 562 592 632 639 603 550 520 544 608 668 692 698 708 713 690 653 643 662 679 677 679 698 714 713 709 707 684
964F84n9o1j9L0M6L6K5J9Pqk5m0n0m2j0K3L2J9J0J7K6K0kk7m1l8j6J3L1K8J9J2Mj6k6lM4O9
959G31M4Kk7m2m7k4K7O3L6k3m6j9J7K8K8K2mm0n1k6qj6j7J4L9J7l6o0k9K2N5N2K3j6m3m6l0
955E70lL0N0M3J4j3k4k7j7RK9Rl7n1j2L1K9MjRMj0rNJ2J1J7J6ok7lM6O2J8m1n8k5QRj3j2K5
950F71M7J1n2m9K3O4J1o0n0N%n9o7J1Q8Q4K6j7l4l6k0LJl5n0j4L5M6L0J6Prj9j4j3j6J0O3
945F38Q0K1l9k5K9K4l3n4j3Rk7m7MO2L9l6o5k1L3M4K3Jj0oJ7M2L1j6n2l9J1N2N6K2k3m6l0
940F56OJ8pl0j2J8J0k5l0J0L8Om7m8J3P2Q0L4k5o4o3k6RJ0j1j3J7L8J2m6p1l7J9M1J6j1KL6
936E95L9Kj9J5O1N2rm8k7N%k5k2J2K9J5jJ3M0L8lm3m2j0Rjj2%J3ml0j8K3K6k7p7o6j3K1K5
931E36K4L0K7Oj2nK2M4L3j0m5l3J0L1Kl4l0lQjJJ5K2J5J2J9K1J4Mok5m4m2j9J4M0M7L6J3N
$$ plain form
964 684 625 564 545 575 621 657 682 701 708 700 675 635 585 543 533 556 588 607 617 634 660 680 678 651 610 572 556 569 600 628 647 659 663 647 621 618 662 731
959 731 775 777 750 708 661 637 664 727 763 740 694 675 692 720 748 770 766 726 675 649 641 625 608 622 661 678 642 582 553 575 630 682 705 689 646 600 570
955 570 567 597 647 690 704 691 667 640 623 632 661 670 633 582 570 601 630 634 633 642 646 636 627 632 644 655 672 688 682 655 652 698 760 778 737 679 654 662 671 658 646 671
950 671 718 729 677 628 651 715 726 666 616 621 621 562 495 506 594 678 704 687 653 617 597 600 601 566 516 502 537 583 613 629 636 627 608 594 581 565 575 638
945 638 718 739 700 675 704 728 695 641 628 637 610 563 567 629 668 632 567 546 579 623 646 647 637 631 648 690 721 705 653 614 625 677 733 755 732 686 656
940 656 662 680 673 643 631 649 659 634 604 614 652 658 611 563 576 648 728 762 737 673 610 584 593 603 592 579 596 634 646 600 529 492 511 552 568 557 559 595
936 595 634 636 617 632 693 745 736 688 661 666 666 641 619 631 660 675 674 687 727 765 762 719 677 667 676 675 663 663 676 672 642 624 647 673 646 569 503 490 511 536
931 536 560 590 617 623 611 606 628 672 705 695 650 617 627 658 660 626 596 593 601 600 601 616 638 653 665 684 705 719 723 717 692 648 606 587 601 641 688 724 737 742
926G42J6J8ol8l8j2QOnj5l0m8m9l3j7j1kJ8L6L9K5J2J4L3M8L6Lj4pmk3l6k1jj0l2k1J9M4M2
921F86L2J4k7o1m6lPk1k5J3L1nk9PN1L7pj5QQk0k1J1L2K3Ppk5k9QN9O8K5j6k0j4k7m2m3l4
916E90k0OL0K2j6l4pL1M1L0J9Nj2j7lLj8l6j9J1J1j4k2QL7M0K6J9J8Qj7l9m0j7J1K0Ooqqj8
911F21k0nQpl2l5rJ8K8K9L0K3QLJ2J6jj5JL3L7Nk7l0j0PJ6J9J7NjJ1K3Pl6o1m0LJ8PjOPpj3
906F68KRmj4KJ4j1n0m5OM1K2j5k3pkrj3j6l5n0l2J6N4N8M4L2J9jk0k5j5PL4N0M0Rj3j2oqq
901F93NJ3Nrj5k2l6l7j0K7K7j0m3l9nL4N5M1kl6k4J2J8j8m1j4K9M2K5Mj3l4m1j5K4L5J4j%
896F38nj6mL7O5L7l0p4n5NM4K7j8l7nL4M1K3J2Rj3m2m1lK2J1qnMJnLOj5k8lL2K3k1l9rJ6j
891F13l1k6J4N1O2M6Pl9o4m8j2J2J7J5Lj3j5J1M5L8j2m7k0M2N9J1m6m9qJ4%nK5N0L2NK3O1
$$ plain form
926 742 758 776 770 732 694 682 690 696 691 676 646 598 549 516 499 488 486 504 540 579 604 616 630 663 711 747 750 736 729 725 702 666 645 644 634 602 581 600 644 686
921 686 718 732 705 644 598 595 602 581 556 569 600 595 566 573 624 661 654 639 647 655 635 614 625 657 680 687 680 655 626 634 693 761 786 770 750 736 709 667 624 590
916 590 570 576 606 628 612 578 571 602 643 673 692 697 685 668 665 668 650 614 595 606 617 603 581 589 626 666 692 711 729 737 720 681 641 624 635 655 661 655 647 639 621
911 621 601 596 604 597 565 530 521 539 567 596 626 649 657 660 672 688 687 672 673 706 743 748 721 691 681 688 704 723 740 745 744 755 778 785 749 688 648 651 669 676 675 681 688 681 668
906 668 670 679 675 661 663 677 666 616 571 577 618 640 625 602 595 593 584 571 555 520 470 438 454 508 566 610 642 661 660 640 615 600 607 641 691 731 740 727 715 709 701 693
901 693 698 711 716 707 692 670 634 597 587 614 641 631 588 549 544 578 633 674 672 636 612 624 642 624 583 569 598 640 665 669 656 622 581 566 590 625 639 638 638
896 638 633 617 613 650 715 752 722 648 593 598 642 669 651 614 609 643 684 707 719 728 715 673 632 629 651 662 654 649 653 654 649 652 658 643 615 612 644 667 646 607 598 614 613
891 613 582 556 570 621 683 729 736 697 633 585 573 585 602 617 620 607 592 603 648 686 674 627 607 649 708 719 673 624 616 630 630 625 650 700 732 737 760 821
886H21M5l1p3l5J5Jm5l5K8N6Pn2m4PL8K0j8m5m4j2L5N7K8k9n8m4j2JlkJ9L7K6j4m3l3lQMJ0
881E88K5K0mj1J2K0pk8pK0Ok5k8nKJ0M8Q7O0j2l7OL0j8o7m0K2L7ml3l1j5J3N8P8L3l9n0%K4
876G38j4n0k5K1K3nj5oj3l1j7L2O6N4J9ok4l9l5kK9K4pj8KK1J2j3k0oJj2k4j3J5M5O7P7O7
871I18M2K5L9P1P8M7KrMjm0o8m4QK3j2m2k3J5K0j2l8m2l6k5lPk3p2q2m1jQNPj0n4p1k5L5L4
866F14j4l9j7J5K6K6L1L0K5J7jk9l9j4Rj0m2l1J7M7M3M0L7Jn2n0J0M9K7j3k5l2n1l6L0P2L6
862G07j9j3K6K1k3k2K8N5K2j6j6LJ3J5J4%j9j3J5K8J3PK3L6K8J8J9Ll7o1m0rpk6k0J5M6M0
857H54Nl2m0qL1J8m4q6n3J0K6j2l8j2K5K8QMJ5J5lj5rNK2L8M4J7k4m0k9l1n9n6QO9M0n1q8
852E52k2O8R9P7M4jn7p4k9J8Rk5j6J5J1k5k3J7K6j5l5KM4K9j9m1l4k1qPQqj5qj2l3l1J4N0
$$ plain form
886 821 866 835 762 727 742 743 698 663 691 747 754 702 658 665 703 723 705 660 616 604 639 696 724 695 637 593 581 582 579 577 596 633 659 645 602 569 566 574 578 588
881 588 613 633 629 618 630 650 643 615 608 628 634 609 581 576 578 588 636 723 783 771 734 740 770 752 685 645 667 704 700 667 636 621 634 692 770 803 764 714 714 738
876 738 724 674 649 670 693 688 673 667 654 623 606 638 704 758 777 771 747 708 673 671 700 724 717 699 701 722 734 721 701 695 696 684 660 647 662 707 774 851 918
871 918 960 985 1024 1095 1173 1220 1222 1213 1217 1216 1176 1108 1064 1072 1095 1083 1041 1018 1033 1053 1041 1003 961 925 900 897 904 881 809 727 686 685 693 698 705 695 641 570 545 580 614
866 614 600 561 544 559 585 611 642 672 697 714 713 684 645 631 640 630 588 557 574 621 664 704 741 742 690 640 650 699 726 713 688 656 605 569 599 671 707
862 707 688 675 701 722 699 677 705 760 782 766 750 753 766 781 795 795 776 763 778 806 819 826 849 885 913 931 950 953 916 855 815 806 799 773 753 768 814 854
857 854 859 827 787 779 810 828 784 698 645 655 681 669 631 619 644 672 680 684 699 714 711 696 687 692 714 752 796 813 789 749 720 689 630 574 582 651 691 640 552
852 552 530 598 697 774 818 817 760 686 657 675 684 659 643 658 669 644 621 638 664 649 614 616 660 689 670 629 595 574 566 573 581 573 558 550 538 505 474 488 538
848E38K6j8j5L1N2K1k2k8jL2M7L2ll1k9j5qoRK0Kk5k8JK3J1j3k2k1k3k7j9KK6M1M2L6L1K2
843F91J1J0J9J8j5n7n9j2K4J2j5lL0L5Pj4j3j3k6k5mJ5QkJ0L3L8J6j2k6j8LJ4J0lj1j9l1l6
838E90j4J1Qk3l5lL8L8nl6j8K8M5J4k6k8JJ4nj7KJ9%l2k3J8L4Pj2QL0J1l2m6k5%J2K0K6K1
833F15QJ0K4K9Pk0k3oJrj4KK5K4Mj1j2qq%J7K4Ok2k8j3KLkMK5M3L7%l0k0J8L0Lj7lJ4ll2l0
828F64JK1J4j2m6o6k5O5J21P3k2n5k5j6n6o7qN4M6pl3j8MJ4Kk7m8k3K7L5oj9L5Q0M7j5j5K2
823G16J1m6n7NN5K9k5l5oOnr%Jj3k7k3j0%JJPK0K7K2Lk4m4m3qM3O3L4j3l8m0l5k3JK1K2J8
818E82K7L3Ol7n3k7J0K2K1K4L4L7K8J1j1l4m4k8ML2L4J0j6k2j4j5k1oK8L7%m0l7oP%LK0K2
813F21RJ1K7K2qk9k0opj0MJ8Pj9l5l1pK2L5K0lkJ7J7j8n4n2j7J9L4K4rl8l2J8O5O2J5k1j6
$$ plain form
848 538 564 546 531 562 614 635 613 585 584 616 663 695 692 661 632 617 609 603 612 632 634 609 581 582 605 616 603 581 560 537 510 491 493 519 560 602 638 669 691
843 691 702 712 731 749 734 677 618 606 630 642 627 624 654 689 696 682 669 656 630 605 601 616 624 622 632 665 703 719 707 681 663 666 680 690 687 676 657 626 590
838 590 576 587 595 572 537 534 572 610 605 569 551 579 624 638 612 584 585 599 594 577 579 598 598 566 543 561 595 602 590 598 628 639 607 561 536 536 548 568 594 615
833 615 623 633 657 686 693 673 650 644 645 636 622 624 649 673 677 666 654 646 638 638 655 679 685 663 635 622 624 627 625 629 654 697 734 734 704 684 702 732 735 718 715 729 726 694 664
828 664 665 686 700 688 642 576 551 616 737 810 788 733 708 692 636 569 561 615 661 654 621 603 607 621 623 596 548 525 552 587 581 562 597 677 724 709 694 716
823 716 727 681 624 629 684 713 688 653 647 653 648 639 639 640 627 600 577 567 567 568 569 576 596 623 645 648 624 580 537 529 572 635 669 656 618 578 543 520 521 542 564 582
818 582 609 642 648 611 558 531 541 563 584 608 642 679 707 718 707 673 629 601 605 637 671 681 665 643 629 614 593 587 615 652 652 612 575 569 576 576 579 599 621
813 621 630 641 668 690 682 653 633 627 620 610 614 632 639 620 585 554 547 569 604 624 621 619 636 653 635 581 529 512 531 565 589 580 542 510 528 593 655 670 649 633
808F33J4K6J6Ljj2l8n4l6lJk5j7L4O0J4n2n0PL7K3K1M2L2k3n7l2kj3k4NL1J1k0nL9M1J0JJ4
803F51Km6o5k2L3M4J7jLRKj4k1lK4L2Mk8l0nJ8L1L8L2Jm3o0l3OK4J4j0k8k2QM1M4J6j7k6j7
798F03nlpoPK8L5K3Qok4l6k2J5L2Pk2j0K6L2J2KJ0Jk7l2%K3Pk1k3nlk0l2k7oK0M0L9J2j6k1
793F08rkqj3lK0L5K2j0m0m8l2mL3N9M9Rj8mK1J0l0m9k2J3K9L0L0J8JMK7K7j1m3k0L0M1Jl9
788G12l7j5j2l0m4m2l4k6oL2O4O2K5j1k0j0nlkMOJ1J2kl2m3j1L7M8J0l1m3l1j4QL1L8K4QK
783F30qk3k3JK9L2J5jkJ1L0L0Oj6%L8M6J0j6mJ0j7n4n4j8QJ0J0J0%j2rPJ2J5K8L4Ln9r3o3
778E53ON6N1Lm4m5MM8M3Nj9j0J1K6L1K1lk0j4lj1j9oJ0rm0k9K4N3K5j2pJ5J3j0j8lJ3J8K1
773G28J8QKQJ7J7J5J9J6%mJ3K4%l4l0lLj2RO9R7L8m4m6L0Q5N7MJ0P5J25J19P4K5pnM3J09J37
$$ plain form
808 633 647 673 689 692 691 679 641 587 551 548 549 524 507 541 601 615 563 513 520 557 580 601 643 675 652 595 563 561 548 524 529 560 571 551 546 585 626 636 637 651
803 651 653 607 542 520 553 597 614 613 616 625 627 613 592 589 613 645 649 621 591 586 604 635 673 705 706 663 603 570 576 600 614 604 576 554 562 603 647 663 646 620 603
798 603 598 595 588 582 589 617 652 675 683 677 653 617 595 610 642 649 627 617 643 675 687 689 699 700 673 641 641 664 671 650 627 622 619 599 567 540 534 554 594 633 645 629 608
793 608 599 597 589 576 573 593 628 650 640 600 552 520 516 549 608 657 666 648 644 665 675 645 596 574 587 616 646 676 694 695 699 726 753 742 699 679 709 750 751 712
788 712 675 660 648 618 574 532 498 472 466 498 562 624 649 638 618 608 603 600 598 602 608 619 631 629 597 554 543 580 628 638 607 564 533 519 527 558 596 620 628 630
783 630 622 599 576 577 606 638 653 652 650 661 691 721 727 711 711 749 795 805 789 785 795 778 724 670 652 660 670 680 690 690 678 669 676 688 703 731 765 768 709 616 553
778 553 559 615 666 669 625 580 584 632 675 680 661 651 662 688 719 740 737 717 703 700 689 670 664 674 665 625 596 620 673 698 686 679 694 707 697 679 676 689 707 728
773 728 746 754 756 764 781 798 813 832 848 848 844 857 881 881 847 817 814 817 805 814 883 980 1018 974 928 958 1043 1100 1104 1114 1189 1314 1433 1507 1532 1525 1520 1563 1672 1809
769A809J27J31J85K53K90L07L32L71M23N16O68Q41R72J057J118J142J092R80Q46O75L97Nm19
766A4118p79j052j215j234j125r84q86q06p02o02n53n21m38l27k64k54k13j21o1r0j47j34
763A610o1j5l4o7o0l1l3o6p6l8J2J3l9p8o0pK0Rj2k0j8k2l0l4k8pK3M1K7rl2k9k2k8l5k4%
759G40J5Rj0k6j9J7N2N9L1nk8m1m4l0ML5M3L1J4j1m4o3m7mK7J8j2l1k5j6k4m1l4PN3O6M0P
754G13j2l1n2n4j3M5O2K6k4m1k3lQJ3OqoK7N8M0k1n7l1J1Ll5k9K6N7K3k4j8K3L0j2m5l1J4
749F15M7M9K0k4m6k6J8L7Mm1n6l4pOKjJ2L8N1L8Ronlj1k1k8l6l0MM1M1J0%K3L8J7mJ0K3kl9
744G33l4KRk0k6J0L9J9j8l1k8k2mL5N3J3n1o8k7J7K5Rlj1j9k2j1j%lRK6L2K2J2Nrl8o7o1r
739D87N4P2L3k2m4l3k3j9oK0L0J1j1j0MJ2J6J9J0j1j8J6N3M0j4m2j1K9K1j7k4OK6Rj4j1LM
$$ plain form
769 1809 1936 2067 2252 2505 2795 3102 3434 3805 4228 4744 5412 6253 7225 8282 9400 10542 11634 12614 13460 14135 14532 14537 14118
766 14118 13339 12287 11072 9838 8713 7729 6843 6037 5335 4733 4180 3659 3221 2894 2630 2376 2163 2042 1981 1891 1744 1610
763 1610 1549 1534 1500 1433 1373 1342 1309 1243 1167 1129 1141 1154 1115 1037 977 970 990 999 987 967 949 927 897 863 835 828 851 892 919 910 878 849 827 799 764 740 740
759 740 755 764 754 728 709 726 778 837 868 863 835 794 750 720 724 759 802 833 847 836 792 729 682 678 705 723 711 680 655 639 615 574 540 547 600 666 706 713
754 713 701 670 618 564 551 596 658 684 660 619 596 593 601 614 620 612 606 633 691 731 710 653 622 633 636 601 572 598 655 678 654 636 659 689 677 632 601 615
749 615 662 711 731 707 661 635 653 690 694 653 597 563 556 562 564 563 575 613 664 702 711 705 700 697 686 665 637 601 571 575 616 657 667 667 690 728 745 741 751 774 772 733
744 733 699 701 710 690 664 674 713 732 714 683 655 633 629 664 717 730 679 611 584 601 626 635 632 621 602 580 569 568 568 565 574 600 632 654 666 671 662 624 557 496 487
739 487 541 613 646 624 580 547 524 505 499 519 549 560 549 539 543 555 571 590 600 589 571 587 640 680 666 624 613 642 663 646 622 628 654 663 649 638 641 645
734F45jOK2K2QKNJj7l0k2njpj0kJ3L2M2K7ql7l5j8k4n6o4k3M2O5K2m3n8qN7O8J9k9k9LJ4j
729E87j0oj0j4QM0L4j2l0J3M0pp2o0LJ6l4m5K3P8M2k7l1K5N5L2pl0m5m4j7J2Lk4j2L8O8M1
725F21lj9pJQK1L1K0rl9n6n3k7OK1J3NJ1K2K1J5Lj5l2k7kOj0k1OM4M4Kk8rK6K9mk0OL6K9m
719F62j5LJ0j0k4j2j0m1n8j3M1L1k1k1M0P0K0l7l0OJ0mQK8Qk7k2P%l6l3K0N1K1j0J1M7L3k0
715F83n4n0l5k5j3RL6N0M8J9k5n5m4j1Pmj0J5N2N8K2j9k6mJ8J9J1Njj0j8k4k6k0lJ1pm7p0
710D62m8mK7M1M8M7L1Rqj6k0j0J0K2J8J8K2Jm9p8m5OJ5mjK4J8j5k3OK0PRL3K9k1n5k5K4L3
705E58J8J8J7k0n8m6%J8%NL9M8Jn3o1k5K0N1N8L7pl9l5j0RQQJ6K3J3j4m2m0oL7O0N0J0l9p1
700E56o0j7J6J0j2rJ6L2L0K7L3K9J4%Jjk1m6m4j0K8M2K9Qlrj1oJ9M1L4Mj9j8j0nJ1L0K6mk0
$$ plain form
734 645 644 650 672 694 702 704 709 710 693 663 641 636 635 628 618 616 629 661 703 730 722 685 650 632 608 552 488 465 507 572 594 551 493 485 542 610 629 600 571 574 588 587
729 587 577 571 561 547 555 595 629 617 587 600 640 633 561 501 504 520 486 441 464 542 584 557 526 551 606 638 631 601 556 512 495 507 510 486 474 512 580 621
725 621 618 599 592 593 601 622 653 673 664 625 569 516 489 495 516 529 534 545 567 588 603 606 591 559 532 530 536 526 505 511 555 599 601 573 564 590 619 615 595 601 637 666 662
719 662 647 650 660 650 626 614 604 563 505 492 533 564 543 522 562 632 652 615 585 591 601 597 605 633 641 614 592 599 599 563 530 550 601 622 612 623 670 703 683
715 683 629 579 544 519 506 515 551 601 649 668 643 588 544 533 540 536 526 541 593 651 673 654 628 624 642 661 672 677 676 666 648 624 598 578 575 586 579 532 462
710 462 414 410 437 478 526 573 604 613 605 589 569 559 569 591 609 627 649 650 601 523 478 484 499 495 494 518 536 521 498 504 524 531 540 573 602 581 526 501 525 558
705 558 576 594 611 591 533 487 487 505 505 510 549 597 598 545 484 459 479 530 588 625 618 579 544 534 543 551 559 575 598 611 597 555 515 509 546 606 656 666 627 556
700 556 496 479 495 505 493 484 500 532 562 589 622 651 665 665 666 665 644 598 554 544 572 614 643 651 648 639 628 622 641 682 716 720 701 683 673 668 679 709 735 731 711
695G11LK6Rl8o5n4j7K0M0K4j2k3lQj5k9RN7M1l1q2p0k6J4L0J9j0k1J1M1K1k6l9j6kmJ7M9L3
690F00j8l9j5ok8k7J4L3PlL8O1J3m9n3j7jOK9L4j4n9m2NJ2pOL0Ol5k1L1M2Lj0J8K8OPL6L2
685F53j6l5mJ0k5m3mL5K2jK2M3J1l4k6J3J1k5l8j3RJ3K1L2K9J5RQoj1LNl5p4m8K1M8J0k5j5
680E65J5K1J3QN%OJ8J0k2l7j3K4L3Rj4j2J3L6L3ml8l7j3j0k6k6LL1L4L0K0j6p3q5k5M8O4L2
676F20J1J0jk8k8kOl0n8k9M2Q5O3Mm5n2k2K2M7M5K6Lj7k1OM6N2Pn1o9l6%J4J2RJk5n1n2k7
671D87LK4L3K9J3mqkjnNK3K3rm8n7m0k1mL2P5P9K4n2q2m6J7N6N5L3J4Jpqoj3l0l7j2J9K1m
666E70j9pO%qmj1l1k1M2R4P0Mk0NMm3o4k0L5M1K1K3K3j3m9k9J9K6j3l1kK5J2j2rJ7M0M1J9
661G31j3k0J2L5Mn4o9l0jj3j9J9O1N2J0k1k3j6%K7L3Kl6l4nMj3k5k2j7j3J1M2M1Oj9mK3L5
$$ plain form
695 711 714 740 749 711 646 592 575 595 635 659 647 624 621 629 614 585 594 651 692 661 579 509 483 497 527 546 536 515 526 567 588 562 523 507 505 501 518 567 600
690 600 582 543 528 522 494 467 481 514 521 518 556 617 630 581 528 511 510 516 545 579 565 506 464 469 481 474 480 510 516 481 460 491 533 536 526 544 572 578 585 621 653
685 653 637 602 598 608 583 540 536 571 593 592 614 657 668 634 608 621 632 607 569 556 565 578 599 631 660 675 684 692 686 675 678 683 648 574 526 547 595 605 580 565
680 565 580 601 614 622 627 627 633 651 661 639 602 589 613 646 655 641 629 642 678 711 707 669 632 619 609 583 557 560 591 625 655 675 659 586 501 476 524 588 620
676 620 631 641 640 612 584 582 588 558 500 471 513 598 661 665 620 568 546 568 615 660 686 689 672 651 657 703 755 762 711 642 606 606 620 632 641 642 617 566 514 487
671 487 490 514 547 576 589 585 577 575 574 569 574 597 620 611 563 506 466 445 441 473 548 627 651 599 517 471 488 544 599 632 646 647 640 632 626 613 583 546 534 553 574 570
666 570 551 544 550 550 542 538 527 496 475 517 611 681 685 665 670 674 631 567 547 582 623 644 667 690 677 628 599 618 644 631 600 598 623 635 623 614 631 671 712 731
661 731 718 698 710 745 749 695 626 596 595 582 563 582 643 695 705 684 661 645 645 672 705 707 671 637 632 636 623 598 576 559 546 557 599 640 646 627 623 646 681
656F81L3L1J5k0n2m6nK9L0Oj6j2NJ0mrJ5L8J7m3q0n5MM1M1J9lj8k1pRJ3Lj0j4kK2L1Km2n4
651E82j3L8M7J3k9m2k8mJ1P%J1K8K3kk4k5k7k5MM9N5Mm0k1J6Ok3KN9O0jl9j4K0J6OJ1lm7o6
646E95k3J8Kk4J0O5N6pl4mJ6ql3k1LJ6J7Pk8n9m0J5M3K5PJ4Km0m7J4P0M0m0o5j5M0M7K6Oj6
641F50l6l8j3J3K2K1J5OmkJ3J8Qj1k5l4l6l0k4j5QN1Q2P0J6l9o9o3l1MQj6l3j5QLrJ3N0M6
636E82jl2k0PJ7K0J8kl4l5jK1RMK8M2Lm0j9L7M3j7p2p0l6pJ7M7O3M5Rj9k5qK2M0J8k8m5j6
631E65J7J9jj2qpr%R%j3JL6N4L5Jk2m1o6p4l6K4N5M6L1K9J6j8m0j6K5K8jj5l%j0LM6N9Pn0
626F64m6jJ1j6k2J2M0K4njL2M6J7l2n7m0mQj4l0rK3K4Ml%j7m0k3L1N3Om6l6J3L0%l0l0k1k5
621D90k7qK3M0K7lk7k7j0MNJKL%KOPNJ2K8K5jk0mK1K4J0RJ9Pl1n5l8LK9K7QnolLJ4K6K7Oj6
$$ plain form
656 681 714 745 760 740 688 642 637 666 696 702 686 674 679 689 685 676 691 729 746 703 623 568 572 613 654 673 670 652 631 624 633 646 649 639 625 623 645 676 678 636 582
651 582 569 607 654 667 638 596 568 564 575 582 582 593 621 644 642 618 593 566 541 545 594 649 653 613 592 608 614 591 593 652 712 711 672 658 678 694 700 711 708 661 595
646 595 572 590 592 568 578 643 699 692 658 654 670 662 629 608 611 627 644 651 623 564 524 539 582 607 614 628 630 590 543 557 627 667 627 562 547 587 634 660 666 650
641 650 614 576 563 576 598 619 634 640 636 634 647 665 673 662 637 603 567 537 513 498 506 557 639 709 725 686 617 554 523 527 535 519 486 471 479 482 473 486 536 582
636 582 581 549 529 536 553 573 591 589 555 520 519 540 549 553 581 623 626 586 567 604 647 630 558 488 452 445 462 509 572 617 626 607 582 574 596 636 654 626 581 565
631 565 582 601 600 588 580 573 564 564 573 573 560 561 597 651 686 687 665 624 558 484 448 472 527 573 604 633 649 631 591 575 600 628 627 612 609 609 599 602 648 707 714 664
626 664 618 617 628 612 590 602 642 666 661 660 692 738 755 723 666 626 622 630 616 586 577 600 624 628 625 625 608 568 545 576 629 635 589 553 566 596 596 566 536 515 490
621 490 463 455 478 518 545 542 515 488 478 482 487 488 490 493 493 495 501 508 513 525 553 578 577 557 553 574 598 608 617 636 643 612 557 519 522 551 578 586 581 575 572 575 589 615 642 648 632
615F32k1k2l9n4k5L8P1M0LOK1qm7l6J2K7rl0lK0Mk2j8OJ5J4J5J2jJL2N3L2j1l9m6m5k7J7N1
610F19L8rl5k5qmKMj8n9o1kN6M2k4n5j7K8J8k3k3K2M3Km6l3J6L2Nj7j0kpML8M9K1mMJ2j5l7
605E21qL6L1j4k6J0K7j0n0m1ML3L6K3%k1j6J7L3Nl2k7J4L8L1J4ml1m5j5M2N9J5l9m3j8j3k2
601E14mM6P8O4J8k7n0m5qK6K4j0k2OL3K0j0rK0L7K7J0kkK2O9J05R9P0O4P8P5N8O1P6N5nm7
596A514l5k1n5r5q4l2pk9n8p0p1n6k5PNk2l6k9k7l5l6j9mmj4j9j0K7P9Q7K4m6l2N0R1M1k7
592I27k6K2L9J0pJ2M1N3O6R9J39J56J44J26J20J24J15Q0L4N%pl7q5j31j51j35r7p7r0j04q7
588A278n2m4n9n3j5Ll8q7q4k9J6J2k3m6l2NK4Jl6l3J2N1M3Rj7k8k3OM5N3J9rJ0N1N8L0J4K5
583A057L8L5L2N0Q3J07R6M7j0m7n7n5m4k3j4n1j15j30o4OOl6m5j4Nlj2j3l6o1m1K1N4K9j1
$$ plain form
615 632 611 589 550 496 471 509 580 620 623 629 650 642 595 559 571 598 589 559 556 576 580 558 540 546 561 575 590 602 601 602 634 687 719 708 669 623 578 551 568 619
610 619 657 648 613 588 580 576 578 582 564 505 444 442 498 540 516 461 444 472 490 467 444 466 509 511 465 432 448 480 485 468 458 456 449 453 491 540 561 557 561 573 558 521
605 521 513 549 580 566 540 550 577 567 517 476 480 513 549 572 572 551 535 552 585 590 558 531 545 583 614 628 624 593 548 533 575 634 649 610 567 549 536 514
601 514 510 556 634 698 716 689 639 594 586 612 636 626 604 610 643 663 653 644 664 701 728 738 736 734 756 825 930 1029 1099 1163 1241 1316 1374 1435 1511 1566 1561 1514
596 1514 1479 1458 1403 1308 1224 1192 1185 1156 1098 1028 957 901 876 883 888 866 830 801 774 739 703 684 680 676 662 643 633 660 739 826 850 804 772 822 913 954 927
592 927 901 923 962 972 965 977 1018 1071 1137 1236 1375 1531 1675 1801 1921 2045 2160 2240 2274 2279 2279 2272 2235 2150 2019 1868 1733 1636 1559 1469 1365 1278
588 1278 1226 1182 1123 1070 1055 1058 1020 933 849 820 836 848 825 779 747 752 776 777 741 708 720 771 814 823 806 778 755 761 806 859 878 869 879 930 988 1018 1032 1057
583 1057 1095 1130 1162 1212 1295 1402 1498 1545 1535 1488 1431 1376 1332 1309 1295 1244 1129 999 935 941 947 911 866 852 857 854 842 829 793 732 691 712 766 795 784
579G84k0j5l0m5l2mRPQJ1mk7l9l0j0PJ4Nj1oK0M3L9J7%m%%%LJ1Pk3o2o6j4N3O6L1LJ1J8%j3
573G12KK3K4J1Mjk0l8l8k6j1MJ6J3NK2O3P5K4m3n7k8j4k7k2J9M6K5j3j9MJ0j4l6k5NK2K0K0
569G37K2Pj9j8J8L6kn6n2JK8Mj3J9M9L0j4l2k7k3j7NJ6j1m5l4RL1J8J4K7K9Pj0qPJ9L3L5Q
564H28k9l5j1jj5j4J6L3Ml3k6NQk3l8j0K3K4OJ8N8P9L5l7o7l1J5J3j7j9J3L6K7J2Onk7k7P
559H01M1K6l0p1n5MN6P0N2K3Kj8l1k1J4L1Ml4k6K6O0L9mj4RK8J9kj4KL2N1L6Jk2k3j6lJ5K0
554A078pm7l6K5P4N8J0j1nkjK3N2M7J0j3kJ1ll3n1m6k6QL9M4J5j6j5K5O6P1L6kj7j4j4pK5
549A349O4O2J3l2l0qrk5j3K9N9O1N0L7Ql0m0oL7N1L4K0K8M0M5M1L7M2M4L0QJK3M9M5Rj3J2
545B122N8P8O1K8J0J0K2L6L9L1L1O2J05J13O9K8L7O6N4RMO7J25J13P3P5J16J31J10R9J15J17
$$ plain form
579 784 764 749 719 674 642 638 647 654 662 673 669 642 603 573 563 570 584 589 578 572 592 635 674 691 691 687 687 687 687 690 701 708 685 623 557 543 596 662 693 696 707 725 725 712
573 712 714 737 761 772 776 775 755 717 679 653 642 646 662 675 680 702 765 840 864 821 764 736 722 695 673 692 738 763 750 731 735 745 731 695 670 675 697 717 737
569 737 759 766 747 729 747 783 781 725 673 674 702 706 693 712 761 791 777 745 718 695 678 683 699 688 643 609 618 649 667 681 708 737 744 734 726 733 752 785 820 828
564 828 799 764 753 752 737 723 739 772 776 743 717 722 730 707 669 659 682 706 712 730 788 867 902 865 798 767 782 795 778 759 772 808 835 847 853 848 821 794 801
559 801 842 868 838 767 712 716 772 842 894 917 919 901 870 849 863 894 898 864 838 864 924 963 959 945 954 982 1001 999 985 987 1019 1070 1106 1107 1085 1062 1046 1043 1058 1078
554 1078 1071 1024 988 1013 1087 1145 1155 1144 1139 1137 1136 1159 1211 1258 1268 1255 1253 1264 1261 1228 1177 1131 1105 1113 1152 1196 1211 1195 1180 1205 1271 1342 1378 1376 1359 1345 1331 1324 1349
549 1349 1413 1475 1488 1456 1426 1418 1409 1384 1371 1400 1459 1520 1570 1607 1615 1585 1545 1539 1576 1627 1661 1681 1709 1749 1794 1835 1872 1914 1958 1988 1996 1997 2020 2069 2114 2123 2110 2122
545 2122 2180 2258 2319 2347 2357 2367 2389 2425 2464 2495 2526 2588 2693 2806 2875 2903 2940 3006 3060 3069 3073 3140 3265 3378 3451 3526 3642 3773 3883 3982 4097 4214
541D214R3Q9J25J56J45J22J29J53J60J58J71J89J80J61J77K34K78K84K82L15L80M30M47M56
538I528M93N54O03O35O98Q23R66J070J148J264J440J633J840K107K443K803L182L645M240
535D1115M939N734O677P782Q948J0041J0984J1687J1968J1681J0808R335P138M166O97k763
533A60937n835q355j0174j1100j1149j0618r849q989q078p184o356n554m752m025l438k931
532D2550k434j984j639j350j036p23m86l00q6J59L76N63P81J043J307J578J893K247K620L049
529D8128L591M219M895N677O668P853R163J0663J2526J4778J7232J9659K1854K3511K4247
527B34664K3854K2329J9562J5210R144J907n491j2182j7666k1563k3554k3674k2485k0721
526A79334j8822j6898j4977j3155j1502j0010q651p446o410n512m727m066l548l131k751k373
$$ plain form
541 4214 4307 4396 4521 4677 4822 4944 5073 5226 5386 5544 5715 5904 6084 6245 6422 6656 6934 7218 7500 7815 8195 8625 9072 9528
538 9528 10021 10575 11178 11813 12511 13334 14300 15370 16518 17782 19222 20855 22695 24802 27245 30048 33230 36875 41115
535 41115 46054 51788 58465 66247 75195 85236 96220 107907 119875 131556 142364 151699 158837 163003 163700 160937
533 160937 155102 146747 136573 125473 114324 103706 93857 84868 76790 69606 63250 57696 52944 48919 45481 42550
532 42550 40116 38132 36493 35143 34107 33384 32898 32598 32512 32671 33047 33610 34391 35434 36741 38319 40212 42459 45079 48128
529 48128 51719 55938 60833 66510 73178 81031 90194 100857 113383 128161 145393 165052 186906 210417 234664
527 234664 258518 280847 300409 315619 324763 326670 321179 308997 291331 269768 246214 222540 200055 179334
526 179334 160512 143614 128637 115482 103980 93970 85319 77873 71463 65951 61224 57158 53610 50479 47728 45355
524D5355k026j744j510j282j038q01n85l79j62P1L14N70Q45J133J439J807K274K819L385L986
521E4471M709N627O695P817Q918R928J0698J1048J0873J0176Q919O972M277J036k334n443
519A54387q055r993j1097j1332j0901j0133r253q331p387o479n660m925m262l694l238k878
517C6769k582k345k169k032j899j760j615j465j313j188j107j036r40q24p30o76o41o01n44
515A1302m74m06l58l43l38l26l13l18l14k73k20k15k50k54j89j18j06j32j34r9p5p7q3p6p1
512E740o9m7JM3N2N1P5J06J04O4K5K6N8O1Jr9j74j86j70j84k32k60k32j83j64j75j77j53j22
508C780r8q0o7p1q5r2q6q0p0m6k0qj8k3k8m9p7p4l8k6n8p7l4L1L6j2l9j1Rk5p5p8l2RJ0j5
504B283l3k5JJ7%l3m6k0J4J8j7o0p0l0L5O4J8n9r0m2K6M1Ml3l5lK9L1j4p7j04o6j0J2jj1m
$$ plain form
524 45355 43329 41585 40075 38793 37755 36954 36369 35990 35828 35899 36213 36783 37628 38761 40200 42007 44281 47100 50485 54471
521 54471 59180 64807 71502 79319 88237 98165 108863 119911 130784 140960 149879 156851 161128 162164 159830 154387
519 154387 146332 136339 125242 113910 103009 92876 83623 75292 67905 61426 55766 50841 46579 42885 39647 36769
517 36769 34187 31842 29673 27641 25742 23982 22367 20902 19589 18401 17294 16258 15318 14494 13764 13088 12447 11846 11302
515 11302 10828 10422 10064 9721 9383 9057 8744 8426 8112 7839 7619 7404 7154 6900 6711 6593 6487 6355 6221 6122 6047 5970 5887 5811 5740
512 5740 5671 5624 5625 5668 5720 5771 5846 5952 6056 6120 6145 6171 6229 6290 6291 6192 6018 5832 5662 5478 5246 4986 4754 4571 4407 4232 4055 3902 3780
508 3780 3682 3602 3535 3464 3379 3287 3201 3121 3051 3005 2985 2977 2959 2936 2908 2859 2782 2708 2670 2644 2586 2509 2475 2506 2542 2530 2491 2480 2489 2464 2389 2311 2279 2288 2298 2283
504 2283 2250 2225 2226 2243 2243 2210 2164 2144 2158 2176 2159 2099 2029 1999 2034 2098 2116 2057 1967 1925 1951 1992 1996 1963 1928 1925 1954 1985 1971 1894 1790 1724 1714 1726 1725 1714 1710
499A710pj8j1K0L8J7rJJ7j2p0q9l7K5L3jj7kQnj4pj0l6m4lM3L6k1o1n0j1K4L9K6j2m1k5J8
495A442K2k0m6j2L5L2mj5J%l1m7k3Mkk6k6jJ9J7RQJk4n2m2MM2L3QJ0L2K3k0m2j0K5J0l6m7
490A251j4Rnk6j5J5J4k6n8l6K1M2J1k2KM5M0mj5K6M4%l8qM3L8pj8J5L0Nj8kK7M6M7L0LoJ5
485A501L6K3oj0pm2r0p6j2J4l3q3p6m2k5rK3M0J8j1nJ7J8J7L5L8oo3p2k5L0N7O1M9L4L5M8
480A401M3Ml2k9j5k6m0l2k5n3q9p1qL9L8J8Kj0k0j3qj8l4k6ploOJ9Oj9j7KL%K5N2K4m2n5P
475I91N3K4j8j1J4Kk2qK2J3k7l4nJ2JKL4O6O3L6Oj6k7j5OJ2lj5lK6M6M5L8M5N8N4K2nRN7Q8
470A636P0L5L0M9M7Nn4q9q6n7l4m1o0o0m2l7n7o5l1J5K9Ok2k9j6PK6J7j7k9%L3Qn5p9l7K0
466A036K8mk2NM8O4L2mJ1P7J22R5L9L8Q5J09Q1O7J12J71J64J05O5P5Q8N6ro3q7r4j10j32j37
$$ plain form
499 1710 1703 1685 1674 1694 1732 1749 1740 1741 1758 1746 1676 1587 1550 1575 1608 1607 1590 1588 1596 1591 1577 1570 1560 1524 1480 1477 1520 1556 1535 1474 1424 1413 1437 1476 1502 1490 1449 1424 1442
495 1442 1464 1444 1398 1386 1421 1453 1449 1434 1435 1435 1404 1357 1334 1338 1336 1310 1284 1283 1302 1319 1328 1336 1337 1313 1261 1219 1223 1265 1298 1306 1316 1348 1371 1351 1309 1299 1324 1334 1298 1251
490 1251 1237 1246 1241 1215 1200 1215 1229 1203 1145 1109 1130 1172 1183 1161 1163 1208 1248 1244 1229 1255 1299 1299 1261 1253 1296 1334 1327 1309 1324 1354 1359 1341 1339 1366 1412 1459 1489 1492 1486 1501
485 1501 1537 1560 1554 1544 1537 1495 1405 1329 1317 1331 1298 1215 1139 1097 1072 1063 1086 1126 1144 1133 1128 1145 1163 1180 1215 1253 1247 1184 1112 1087 1117 1174 1235 1284 1318 1353 1401
480 1401 1444 1448 1416 1387 1372 1346 1306 1274 1249 1196 1107 1036 1028 1067 1105 1123 1125 1115 1095 1082 1074 1056 1022 996 989 986 980 986 1005 1011 992 975 977 980 980 1005 1057 1081 1039 984 991
475 991 1044 1068 1050 1039 1053 1055 1033 1025 1047 1060 1033 999 994 1006 1007 1009 1043 1109 1172 1208 1214 1198 1171 1156 1162 1174 1171 1156 1153 1179 1225 1270 1308 1353 1411 1465 1487 1482 1491 1548 1636
470 1636 1706 1741 1771 1820 1867 1872 1818 1729 1643 1586 1552 1511 1451 1391 1349 1312 1255 1190 1159 1174 1203 1209 1187 1158 1142 1149 1175 1192 1175 1146 1146 1179 1187 1132 1053 1016 1036
466 1036 1064 1060 1038 1043 1091 1155 1187 1183 1194 1271 1393 1488 1527 1565 1650 1759 1840 1907 2019 2190 2354 2459 2524 2599 2687 2743 2734 2671 2584 2490 2380 2248 2111
462B111j11q4q6j11j19q8m8k6k1j0Klk8m3l7j5jrl2m2k1J0J4mpJ1J2k7n6k8K9M4Qk6k1RM1
457A187P0Q7O5J1j6J4P0R5Q0N5M6M9M5J9k8p2q9p6o1o6p5p2o1m8l3k3k9n0m8qL5L1rm8o1n7
453I29l5LK9Mn1p1k9K2L4J8P%j2j4RL6L8J8Nmk7m3k0J7J1m0o3j6N1O1J8k0j9njMK1L7K7Lj4
448I18k5m2n4l7NL1K2JNK7L5J7lppj2k2l1l4k2QK9J3k7l9oK3J1j3JL6L3j4m2k3J5K9K8K7J5
443H69j9m0k4J2L0K5J0j7n4o9l6K3N3L7Qj1k9m3l7oJ7J6J7M2O2M0jrJ2Nn0r7p4rL2K9K2K2
438G58Nl2l8ML8J6k9l8j0OOK5N4M3j2n0l3j0k6m5k5J2J7OK0M2K1l7n1kM9L6j0j6K4N3L4j2
434G93l4j9RJ5Krj5k1k7qL6O1L8krJ0Qk5m8l3nMqj9j3OK7L6K8J8J2jl0n4m3jK8K4Nj4l0l2
428F60j0Qol3j7M0O7L0j4j1J6J6klkk6n1k4M0P3M6Lj9k8l6l4j8j6l2k8J4M5K2k4l2QL6K6J6
$$ plain form
462 2111 2000 1916 1830 1719 1600 1512 1464 1438 1417 1407 1409 1406 1378 1335 1298 1283 1282 1273 1241 1199 1178 1188 1202 1198 1191 1202 1214 1187 1131 1103 1132 1176 1184 1158 1137 1146 1187
457 1187 1257 1344 1409 1420 1404 1418 1488 1583 1663 1718 1764 1813 1858 1877 1849 1777 1688 1612 1551 1485 1410 1338 1277 1229 1196 1173 1144 1094 1046 1038 1073 1104 1095 1047 986 929
453 929 894 897 926 930 879 808 779 801 835 853 860 860 848 834 843 879 917 935 940 936 909 866 846 863 874 834 771 755 806 867 885 865 846 841 840 844 865 902 929 932 918
448 918 893 851 797 760 765 796 818 819 824 851 886 903 900 893 886 874 852 821 787 765 773 802 815 788 749 743 766 777 764 765 801 834 820 778 755 770 799 827 854 869
443 869 850 810 786 798 828 853 863 846 792 723 687 710 763 800 808 797 768 725 688 682 699 715 732 774 836 876 875 866 878 883 833 736 662 653 685 714 736 758
438 758 763 731 693 697 735 751 722 684 674 680 686 711 765 808 796 746 713 703 677 632 607 619 636 642 662 704 725 688 637 635 684 720 710 694 718 771 805 793
434 793 759 740 749 764 766 757 742 721 694 686 722 783 821 819 810 820 828 803 755 722 717 721 713 694 681 687 714 750 778 796 808 807 777 723 680 679 707 731 736 722 692 660
428 660 650 658 652 619 602 642 709 739 725 714 730 746 744 741 739 713 662 638 678 751 797 800 781 753 717 683 665 649 617 589 603 648 670 646 614 622 658 684 700
424G00L4M7J3m5n7jN1L5l0o2l0K2L3J0ommj5j7KK2J7j1k9k3j0nlJ7L9K8j9m6j8L5M9J9p%M
419G35j4l8m5m4l3J0P2Q5K9l4l5onk3rK9L2mj8QK9J3qJK0K3J2kk6n1n1k0%j0j8NK4Rj1LL1
414F65K0k6m5rM5O3L4j0l7l2mJ2%k5k8jK9L2J0j2j1mj0k1rK5L4on2m7JK7PqJ3L1J1k3k8qQ
409F11J6K5K3QOK8L7jm1j6M6N8ko7p2l4LL2M9M1J0pPJ1j6m9m5j2J2K0K3K1Lj8j8%MomJ3K2
404G21QqnNNrj5lJ7L3L2J8ql4n7o6m6ON4N6Ln5n7lM9N2K1NJ3J6j0m2m5j7RJ8Qmj2qRJ6jk5
398F44k4OL2L1J3klRK0J7mj2J2M2L2j7m1j6J0j1m6l2K3N6L8Qpj3k5k8j4MK2M4O0L9j1m0k2
394G94PMj7k3j4j4j6pJk2n2m0J4N6M8Nk5k4mMj5m2l5J3M0Lm7k7M7O5pp1l7L8M9nk9J9P4O7
389G75J1l9m9k5J2L3K8J0LJk2o2q3o5k2K8O3O2K5j0oJ3jl1k1K7M5Kl8k8pk5o2n2kL7L4K0J2
$$ plain form
424 700 734 781 794 749 692 691 742 777 747 685 655 677 710 720 714 710 706 691 674 676 698 715 704 675 652 642 637 634 651 690 718 699 653 635 670 719 738 731 731 735
419 735 721 683 638 594 561 571 643 728 757 723 688 682 677 654 645 674 706 702 684 692 721 734 726 727 747 770 782 780 754 703 652 632 632 622 604 609 633 642 631 634 665
414 665 685 659 614 605 650 713 747 737 700 668 664 676 676 651 623 622 651 683 693 681 670 666 656 635 626 651 685 679 627 580 581 608 615 607 620 651 662 639 611 603 611
409 611 627 652 675 683 689 717 754 753 712 696 742 800 798 731 659 625 628 660 709 750 760 753 760 771 755 706 661 649 661 681 704 725 728 710 692 692 696 690 686 699 721
404 721 729 721 716 721 726 717 702 699 716 749 781 799 791 757 700 634 588 594 648 704 707 652 595 592 641 693 714 719 732 748 738 696 651 634 643 661 669 665 653 645 654 670 669 644
398 644 620 626 658 689 702 700 697 706 726 743 739 727 739 781 813 796 755 739 749 738 692 660 683 739 777 785 778 765 740 712 698 702 724 768 828 867 856 816 794
394 794 801 805 788 765 751 737 721 714 715 693 641 601 615 671 719 724 699 675 671 675 660 618 583 596 636 639 592 565 612 677 670 599 562 600 649 644 615 634 708 775
389 775 786 747 698 673 685 718 746 756 759 760 738 676 593 528 506 534 597 659 684 674 668 681 680 649 628 655 700 702 664 636 629 604 542 490 488 525 559 579 591
384E91Lj7k6j2J8L5K2j1l1j3K0K0rj7J8M9L9J2OOj5k9qK3J4j3pK2K0j2j5J5K0j8l7pK7J8o
379F95nLqk0oJ7K9L6N3O1M2J5J1J0j4l7j2M6O8K9k4l2%L0L0Pj5j8jJ6J8J2Lnk1l7l8k1OK2
374I45J9LMK1L4J3j9j9J4L1Kl7m4k1KJ1J2Qqj7rQJ6J2J1K3M2N2L9Jl6k6K8P4P5N6N3O6N8J8
369A515l3o3o1l0jpl8n1l4k3l8l6J3N4K3n0p7m3j0j9l3k1qk0l2j6PNj8l0j8jJ0K1L9N3L9r
365I59n9p1m4j8pK1P7J02N0k9n4rL9N2N0N0M1J9Pjl3p7q7m9rQL0N0K7m7r6o2QK7kj8mLk0m6
360G78n0l3j3%lj8k7j7mmpLK6N0O1M9J8JJ8M2J9l5m6QM4Nn8o3j9Mj2k5j0J2K4J9j0n1n1J5
355F40P9O5NqL3M2k2p9o1pOj8k8KK9K8J0KJ1J8ll1k8J5N0L8kj4pk1n5o2k7J9M1M6M2J1l0m2
350F87j5Olj1J0L9L6Kl0l9k3RK4Kl4l8pJ3QJ1L7M4J0k4j3J5J0k4n1o2o2m0OM3L9J8J0Rqk0
$$ plain form
384 591 594 577 551 539 557 592 614 603 572 559 579 599 590 573 591 640 679 691 697 703 688 659 651 674 688 675 668 690 710 698 683 698 718 700 663 656 683 701 695
379 695 690 693 685 665 659 676 705 741 794 855 897 912 923 933 919 882 870 916 984 1013 989 957 957 987 1017 1024 1009 991 990 1006 1024 1036 1039 1034 1013 976 938 917 923 945
374 945 964 967 971 992 1026 1039 1020 1001 1015 1046 1048 1011 967 946 948 959 971 979 971 954 945 953 969 981 992 1015 1057 1109 1148 1149 1113 1087 1115 1189 1264 1320 1373 1439 1497 1515
369 1515 1482 1419 1358 1328 1327 1320 1282 1231 1197 1174 1136 1100 1113 1167 1190 1140 1063 1020 1010 991 958 937 929 909 877 861 868 873 855 825 807 806 816 837 876 929 968 959
365 959 900 829 785 767 760 781 858 960 1010 981 927 918 957 1009 1059 1109 1150 1169 1176 1175 1142 1065 978 929 920 928 958 1008 1035 988 892 830 838 865 863 845 841 844 824 778
360 778 728 695 682 682 679 661 634 617 613 609 602 605 631 681 742 791 809 810 828 870 889 854 808 816 860 865 807 744 725 729 717 692 682 694 718 737 727 676 625 640
355 640 719 784 789 781 814 856 834 755 694 687 693 675 647 649 678 706 716 718 729 747 744 713 685 700 750 788 786 772 765 744 689 627 600 619 660 706 748 759 729 687
350 687 672 678 675 664 674 713 749 751 721 682 659 668 692 694 660 622 615 628 636 647 684 728 738 714 701 716 726 702 651 589 527 487 493 536 575 593 603 612 604 584
345E84j0PNJ0M1N9K8j9j3L7N8K4k1m2n1m4qL6M3J6PJ6kn4p6l8J6L6K9K1Oj7j9J%l2l7J1N3
340F61L3j4j9%j4n8o3k0J0lk3j8LJ7L2N2N3K9nk4j7RL1K4j4l8k0J2J1j0qJ3Qk0k3OJ0k9m7
336E27oM0K6k2l6j2J2K9N2O4L2k1l5KL2K4Mlj0l1m4l8l5m4l9NM8M4QnJ1K1ml3l4j3J1K6L7
331E90M3L7J8nk1j5LJ0pl5l4mK4K9K3K5K6Pk7m3k2J8M4L1j1m4l6JK7Qk9l7j3ml4o7n4NO0O8
326E55L7KkJ8L4Rm7p6m1K5M8J6j3%J6ol3qM8N3mm9k5K2K4nlL2M1lm5l9lJ5Kp%J2Rnj7j1PJ6
321E99Lj3j0J4K4Qj2nJ8J7j0k8j3K1L8K1j7m3l7qJ3J1lKK4L0Jl3l6j0Lj1k0RN3N6Om8n3j7
316E44K4M0L6J7pk5k0kKj3l0l2j2K0M6M8K3j3l7l9l1j2K1M6L9Lk2j5MRMJ1K8L9K2k2p2q7m7
311D88K0M6J5k1rK3K2j2j9K0N7M8Ok7l1k2k2l0l5k6nJ7L2M0L5J6rj5ook9l7oL3K6j5k8MK9
$$ plain form
345 584 574 581 586 596 637 696 724 705 692 729 787 811 790 748 697 653 645 681 724 740 747 763 761 707 631 593 609 645 674 695 701 684 665 666 666 634 597 608 661
340 661 694 680 661 661 647 589 526 506 516 513 490 472 475 492 524 576 629 658 653 629 612 621 652 676 662 624 604 616 627 617 609 622 630 610 587 593 603 574 527
336 527 521 561 587 565 529 517 529 558 610 674 706 685 650 652 684 708 712 709 699 668 624 586 551 507 468 473 521 565 573 568 579 600 596 563 529 516 527 553 590
331 590 633 670 688 683 662 647 650 660 653 618 584 580 604 633 656 681 707 714 687 644 622 640 684 715 704 660 624 625 652 660 631 594 581 577 543 476 422 427 487 555
326 555 592 594 592 610 644 653 606 530 489 514 562 578 565 565 581 575 542 534 582 635 631 582 557 579 603 598 595 627 668 665 620 581 578 593 595 588 588 600 609 604 587 576 583 599
321 599 602 589 579 593 617 625 613 608 626 643 633 605 592 613 651 672 655 612 575 567 580 591 588 590 614 644 645 612 576 566 569 558 538 547 600 656 662 614 561 544
316 544 568 608 644 661 654 629 609 607 609 596 566 534 522 542 588 636 659 646 609 570 539 527 548 594 633 636 614 599 603 612 616 627 655 694 716 694 622 535 488
311 488 508 554 569 548 539 562 584 572 553 573 630 678 684 657 626 604 582 552 517 491 486 503 535 575 610 626 617 602 596 590 561 524 518 551 577 562 534 538 567
306E67J4j3j9j5k7l2pK6L1Pj5j6j0LK5M3L9K3J2Jk9o0n0lL3J8j9k3J2M3M0J1j6k8k3%L1M3
302F17J0m6o6k0M9O7K5j0lPk0n1l3J1J4j5j2L2M4k0q3o1J0L6lk8kL4L8K8L2K9nm1l7rj0k9
297D79rN3Q8N9RlRj1n3n8j2K8J6j1lL1L4%l0k8k1l2l8j0L7N2J5l3m8l0qJ0L0M1K2j1j5K5O2
292F36M3j9n7l7JPj7k9j2Nrl3k7J1L9L0RK0O0P1K9k5l7j4lk0l7l4k7k5j8mLkNK5L2J5KJ7K9
287F03Jm5n2j7Qlj4J1N4O7M6J2rj7j8j9k1k2j5OK1K0%k1k5rJ7K8J6krrk6n0m2J0P2Q9N9J8
282G13ljJ0Pk5p6r8n9QL9J8mPK8K2JjMj5m5m6j9LJ0L1O5N2k3q1m6M1P7L8%PK1jl1k9oPJ8L8
277F56M7J3l3m6l1k5l2j0M2O5K2m6p3m5kJ7Qj5k8j6K0N3N5J3m2o4l3J9M3K1rkL9O7M5j3o3
272F17o8l5LK1K1J8J7Rjmqk3l6j3L7M9kn5l6L5Q1O0J2k3l8l6j3RJ0%KJ3RoJK3J3l1n3j6L5
$$ plain form
306 567 581 568 549 534 507 475 468 494 525 532 517 501 491 494 519 562 601 624 636 637 608 548 498 495 528 546 527 504 516 559 599 610 594 566 543 543 574 617
302 617 627 581 515 495 544 611 636 626 623 630 610 559 526 537 551 536 524 556 600 580 497 436 446 482 479 451 449 483 521 549 581 610 605 564 527 518 508 479
297 479 470 523 611 670 679 676 685 674 621 563 551 579 595 584 581 612 646 646 616 588 567 535 497 487 524 576 591 558 510 480 472 482 512 553 575 564 549 574 636
292 636 679 660 603 566 567 574 557 528 516 521 512 479 452 463 502 532 541 561 621 692 721 696 659 645 642 622 585 551 524 499 481 477 480 478 483 508 540 555 557 574 603
287 603 604 559 507 490 498 495 481 492 546 613 659 671 662 645 627 608 587 565 550 556 577 597 597 576 551 542 559 587 603 601 592 583 557 507 465 475 547 636 695 713
282 713 710 709 719 726 701 625 527 468 476 515 533 529 536 564 586 587 586 590 575 530 484 465 468 478 509 574 626 603 522 476 517 594 632 632 639 660 659 628 599 593 600 618 656
277 656 703 716 683 637 606 581 549 539 581 646 668 622 549 504 502 519 527 512 484 468 488 541 596 609 567 503 470 489 532 553 544 542 581 648 693 680 617
272 617 549 514 517 538 559 577 594 603 602 598 590 567 531 518 555 604 602 547 511 546 627 687 699 676 638 602 589 598 608 608 610 623 632 626 627 650 663 632 579 563 598
267E98M1Nl3n6o7n4k2MMLK2L6K6RJ7L4K6LjJ1Nk4l8k2JJ2J7J5MoLK5K4%j4jJ1ql9m6j7J6K1
262E45ml3l5j3QQqj6nK0L7M0K6Oqk1l7m6k7J4M3L7J9J3J1mj8j2Kkj9k2jK3L4K5Lj9k4j0J%
257E31%J6K8K0OJj3m5o2k9K5M2J8jNJ3PLOKmlj3m7o5j5N5N3k8p5k3N5O1%m3l3nJ5K7K9J3o
252E21qJ0K5K7J0k1l9k0K5M3K2mokj9l2j4K0K9J4%pj3j4ppj7j4QJ8OOL5N1J7k9l5j1JNK3K9
247F26qn5m2J2L1%k8l1k8k2K0P5O7j1p0m7J4N0N4M7K0l1n9l9j3k6n0l2J6M2L0Nj7l0k4J3M8
242E07M7K6J8J2j1m0l2JJ1j1k2%K9L7K7J7Pqj9k6l1k7oJ3Lk4l1lK2J5mlJ7L8N8P1O1J2m4n9
237F48k6O%k9l8j1K6L4Rk1l1k3k3l7l5pK2J6j3j3K7O8O1J1l8m7j3L4N6L1k7o4m8LL5K8Qqk3
233E48m5m9k4J5L6M1M1L4Pk6l4j6LONQJ4K0L3N0M5Rl0m5l8l6l7k5jNqj5OL0K5OJ2M9N8On8
$$ plain form
267 598 639 644 611 555 488 434 412 416 420 423 445 481 507 516 533 567 593 596 595 606 611 587 549 527 528 540 557 572 576 570 573 598 622 622 608 607 618 610 571 525 508 524 545
262 545 541 508 473 460 468 476 468 452 447 467 504 544 570 576 568 547 510 464 437 451 494 531 550 563 574 570 552 540 542 540 521 499 498 521 555 580 583 564 540 530 531 531
257 531 531 547 575 595 601 602 589 544 482 453 478 520 538 537 542 555 562 565 571 573 569 566 553 506 441 426 481 534 506 431 408 463 524 524 481 448 443 458 485 514 527 521
252 521 513 523 548 575 585 564 525 505 530 573 595 591 585 583 564 532 518 538 567 581 581 574 561 547 540 533 516 502 510 528 534 540 575 626 643 614 579 568 569 574 597 626
247 626 618 563 521 533 564 564 536 505 477 455 475 550 617 606 536 489 503 553 607 654 674 643 584 545 532 506 456 424 440 482 512 517 500 470 446 459 507
242 507 554 580 598 610 599 559 527 528 539 528 506 506 535 572 599 616 623 615 596 570 539 512 506 519 522 498 467 464 486 501 497 494 511 549 607 678 739 751 707 648
237 648 622 628 628 599 561 550 576 610 619 598 567 544 521 484 449 442 464 480 467 454 481 549 610 621 583 536 523 557 613 644 617 553 505 508 543 571 579 571 548
233 548 503 454 430 445 481 522 563 597 604 578 544 528 531 537 542 550 564 584 617 667 712 721 691 646 608 572 535 510 509 514 506 491 497 527 552 558 570 619 677 683 625
228F25n9nK9Qj7PM6M8J4j1k3m5p4o9k4J7J9OPJ5J9K6L5K5nk3j0%k7o3n2NM4K8j5l4j2K2L5
223E12J8j1k1kK1J6j2k6KN3P7M0l0p6o3k0Nmj5jK6L3J4j5k8j7PK4K5J9J7J1j3l7k9J0L6J9
218E65rj7lJ2J0kk0l2k2NK7K8K3J5qm2n1k3J1K2J8K2K3QqoQQKJqk7l3lL1L2J1OJ3Qno%j3l7
213E34l1JK2J3jpnQL2L6Ll1j9J4Ql5m8j8nl1l6RM8L5Ojnk8k4M2J13J00J3o1p7n6k4J6M3L5
208E88Lk1l1l7k9RM7M6J5jjj1l3l0jJ1j0l1j5J4K4J5J1K2L5M2K9j3n8o0lN9O5K1k1k2rk4n5
203E40n6j3K7J6k6m0j2J5J2NJ8K2kk3JL8L4LOM7O0Qn3n7j9jk4n6n6j6L8P2O0J7j7k1j1nNJ8
198E54J5qk3j0J1RolJ2km3o6m6pJ4J8K9M0K3rj9%J5PlNPk1m9l0J7L2RLL4M7Nl8k0K5J3m7o9
193D25j7N0O4L2jj4j8j3mPK1M3N0Rn6q6n5j1KkJ6M2M0Qj2lJ3J1nj8k2k3j7OL7N8N0K0ljJ2
$$ plain form
228 625 566 561 590 598 581 588 634 682 696 685 662 617 543 474 450 467 486 492 499 514 533 559 594 619 614 591 581 581 554 491 439 444 488 516 501 467 455 477 512
223 512 530 519 498 496 517 533 521 495 497 550 627 667 637 561 498 478 483 479 464 463 489 522 536 521 493 476 483 507 532 551 568 579 566 529 500 510 546 565
218 565 556 539 536 548 558 556 536 504 482 487 514 542 565 580 572 530 479 456 467 489 507 529 552 560 552 546 554 562 564 565 557 530 497 494 525 557 568 574 587 595 590 584 584 571 534
213 534 503 504 526 539 538 531 526 534 566 602 605 574 555 569 577 542 494 476 471 440 404 413 461 496 502 501 496 468 444 486 599 699 712 651 574 518 494 510 553 588
208 588 591 570 539 502 473 482 529 575 590 589 588 577 544 514 513 524 514 483 468 482 506 521 532 554 589 631 660 647 589 529 526 585 650 671 650 628 619 595 540
203 540 484 471 498 514 488 448 436 451 463 468 486 508 506 483 484 522 556 559 565 612 672 680 627 570 551 550 526 470 414 398 436 508 568 585 568 547 536 531 536 554
198 554 569 561 538 528 539 548 542 539 551 549 506 440 394 387 401 419 448 488 511 502 483 483 498 505 502 507 514 493 444 414 431 463 472 475 509 556 561 523 503 528 541 494 425
193 425 408 458 522 554 553 539 521 508 504 511 532 575 625 634 578 492 437 426 428 426 442 484 524 532 520 517 530 541 536 518 496 473 456 462 499 557 607 627 624 623 635
188F35J0jj0j6l2m1j8K3L9Pm1o3n1j2L4M7Kp2r1k7N8Q7O1L0J2koKkl5n4j7L7L0l2o4k6K1J7
183D39kK1O6O8J9j8pJ3Lk4l3j7mJJ1K3J8j%L4O4K9m8q7m7Ojn2o2j0M0L2jnJ6K3J1J0J9J9N
178E71PL0L9J2l1n0l9k1jK0L0Pk8l4nK2K1J0J7K7Pl1m3j7J1J0lopj7k4j2LMJK2M6L5rm5l8
173D91lK3K4Lk4k9lL4M3J2k9m7l6qK7N3M6Mm1n0j8K2L2J1j2rJ0Rj7k9RN6M6j8o1m0j0k9o9
168C73n9MN7N6L0J4Nrj7NM5O1L9pm3m9k2J8M2L0OJJ2J5%j3JK3K4Opj0k7n6o5k7K4L4Nj2MJ9
163E30Kk6k4OK2Mj9j9JJ8K1K0K5L0J6j1k7j2J3J3j9m3l0MK6K7K2J3ok9l0qKj5l1j6PPmJ2N2
158E24O3J9k9l0QK3%k2j1POj2k0j3pkJ5L8M4J8j9m1m0k9k3j4OK8L3Ok9l7j4RJ0MJ6L8M1J7
153E81j5k7j9PL1K8ll0j8RLl4m9kO1P1K3k6l5k6l3n2m2J3P0P6K9j2oJ8J2k0l1j5j2k9j8K9
$$ plain form
188 635 645 644 634 618 586 545 527 550 589 596 555 492 441 429 463 510 512 440 349 322 380 467 528 558 570 568 562 564 562 527 473 456 493 523 491 427 401 422 439
183 439 437 458 524 592 611 593 586 599 602 578 545 528 524 525 536 559 577 576 576 610 674 703 655 568 521 527 526 474 412 402 442 474 473 468 484 507 518 528 547 566 571
178 571 578 608 647 659 628 578 539 518 517 537 567 574 546 512 507 529 550 560 577 604 611 580 537 520 531 541 538 532 525 508 484 472 475 479 480 502 548 583 574 529 491
173 491 488 511 535 538 514 485 482 516 559 571 542 495 459 451 478 531 577 581 540 490 472 494 526 537 525 516 526 535 518 489 498 554 600 582 521 481 471 442 373
168 373 314 318 375 431 461 475 480 471 454 459 504 565 604 597 554 505 483 501 543 573 579 580 592 607 607 594 595 618 642 648 641 631 604 548 483 456 480 514 519 507 511 530
163 530 532 506 482 488 510 514 495 476 477 495 516 536 561 591 607 596 569 557 570 583 564 521 491 495 521 548 570 583 577 548 518 510 512 497 466 450 457 464 460 472 524
158 524 587 606 577 547 555 578 578 556 545 552 558 546 526 513 506 504 519 557 601 619 600 559 519 490 467 453 459 487 520 526 497 460 446 455 465 469 485 523 564 581
153 581 566 539 520 527 558 586 583 553 535 544 547 513 464 462 523 594 617 591 556 530 497 445 403 416 486 562 591 579 573 591 603 583 552 537 525 496 478 507
149E07M6mn5l1L9O4K5mQJ1k2m4k1J0Lk0j0J6J3j8k7rjj1%M2O6L1k8n0k1J6K6J5OJ%kKMKJL
143E79K%JNjj4j6QL8M0J7mj5l2n1l8PL5Nm3m5KL4J7j2oK6L4Ll0l3j3NLj5k3oK0K6J0NK2L0
138E77Ll3l4mNj0jM4O5J7m7m3K2N8J6m6n6k5rk1k3LK7K7J3MOPKj1k7l6k8j3kOJ7K8K4PKJ4
133E25K0Nj2j6j1j3k7k8lM1O6M6ml2rK0Lm0l5K4M9op2n4K2N7J9k8k7MK0J5Pkj2j1J2L6L2r
128E72m8m1RM8K5l6n5nM8L1j5j2L9N6J2k8k3rl1n6l7MK2J7K4L6K2j2k5rRKj8k9k6j1krk3j3
123D03K5N2L4Jojl1p6o0K6R6Q0J5k1j0kj8k7qJ2PolJ5Ol5o8m5K8Q3P0J2k5j9pk4m6l3J1L5
118D40J4j1rRQrj3%OPK6N3M4om6l1J6L8L6L7L6Ml7l4J1K3j9n7m4j3j0mL6O5K4n2o8j5J6k0
113D51o6n6qL0N0O7O9L4j0j7J1K2rm6m5j2J8K2Rqk4k9qM3P9O1rp5q2l7J3L4K5J3J7L5L6Nl7
$$ plain form
149 507 553 549 494 463 502 566 591 587 595 606 584 540 519 529 532 512 502 518 531 513 486 477 476 465 465 507 573 604 576 526 505 521 547 562 568 569 569 567 569 573 575 576 579
143 579 581 581 582 587 586 572 556 564 602 642 659 655 640 608 557 519 526 561 566 523 478 480 514 531 519 513 539 573 576 546 513 500 505 508 493 470 464 484 510 520 525 547 577
138 577 580 547 513 509 514 504 503 547 612 629 582 539 561 619 635 589 533 508 499 478 455 458 485 512 525 529 535 542 544 533 506 470 442 429 427 433 450 478 502 509 511 525
133 525 545 550 538 522 511 498 471 443 440 481 547 593 589 557 548 568 571 531 496 520 569 563 491 437 459 516 535 507 480 484 504 519 526 524 512 501 513 549 581 572
128 572 524 483 492 540 565 529 474 469 517 548 533 521 560 616 628 600 577 568 537 481 444 448 470 487 511 547 569 557 532 523 532 534 516 487 461 450 448 439 416 403
123 403 428 480 514 515 509 508 477 401 341 367 463 543 558 537 527 525 507 480 472 484 491 485 482 497 503 468 400 355 383 466 536 548 523 504 497 473 427 394 405 440
118 440 454 443 434 443 451 442 429 429 435 442 468 521 565 559 513 482 498 536 572 609 645 649 612 578 589 612 593 536 492 479 469 465 501 566 590 538 470 455 471 451
113 451 385 329 321 351 401 468 537 571 561 544 555 577 568 522 477 465 483 505 514 506 482 453 445 488 567 628 619 544 462 425 438 472 497 510 527 562 598 603 566
109E66m7k2KPQJ6J3pj7NK1jk9k0J5K1MMK4K4j2m5n4m9l3kK4J5jK5P2N7j5m3PM4kn7k8L1J2
104E33n5n8J7N5Pm4l0J0J2ML4O5L7k9n2j2K7Qm2n2qL8L5nk5mK5K6J0PPj8m7l4K5P3O6K8ql0
99E96l2nL8M9J2k3j3Prm3l5J6M4K2j3k2k6m5o1m3lK9M0M0L0Qj6k2qlj9l3j9K2N1M3Nk7l1j1
94D90J6L0K9J4KPK6L2Nm2o8n3j3J6J8Nrj7rJ1J9mm2n4k4J5K2Lj2ronMK0K2QOL1N5M2ll8l5
89E05j5KQJ5J9Nk1l3j6J2K1J1kqk0l5l4j0J0OkJ5M4M3J1rJ2L9L1mk8k8j0J8L4K1j2l7l2k3
84E03k4k0MK7K9K6L6K9j9n7k9L5M6j1n4k8K0K3j2l2k2lJ3K3J6j1k8qL3N2M0J5JkLKnj3j2j1
79E75l2n8m8MM0K6%OK8J8j5k2JOj1j3J3K4mk6oK1J1j4KM8M6k5q8o8JL3Qj1J7M6L3OQJ9lk9
74E67MP6Q0j3r7q0j4jl1k0L6M3j9n9j4O0O6Ql9m3k8k0j4jJ1J0KjNJ6J7mk8k0K1N2M0kl0k8
$$ plain form
109 566 519 497 499 506 514 530 543 536 519 524 545 544 515 495 510 531 535 539 563 587 575 530 476 427 394 392 416 431 430 455 527 584 569 526 533 577 575 518 490 521 533
104 533 478 420 437 492 499 455 425 435 447 451 485 550 587 558 506 494 521 529 487 435 427 465 500 495 470 466 491 517 527 534 541 523 476 442 467 540 606 634 626 596
99 596 564 559 597 646 658 635 622 629 620 577 542 558 602 624 611 589 563 518 457 414 411 440 480 520 550 558 542 520 512 509 490 457 438 460 511 554 559 532 501 490
94 490 506 536 565 579 581 588 614 646 651 609 541 488 475 491 509 514 505 488 479 490 509 505 463 409 385 400 422 425 413 404 398 393 397 417 439 447 453 484 539 581 578 540 505
89 505 490 492 500 515 534 539 518 485 469 481 502 513 511 503 483 448 414 404 414 420 418 433 477 520 531 522 534 573 604 600 572 544 534 552 586 607 595 558 526 503
84 503 479 459 463 490 519 545 581 610 591 534 505 540 586 575 521 493 513 536 524 492 470 467 480 503 519 508 480 472 505 557 597 612 613 611 614 616 611 598 586 575
79 575 543 485 437 441 481 507 507 513 541 559 544 522 523 529 518 505 518 542 538 512 506 527 538 524 526 574 620 595 507 439 440 473 481 470 487 533 566 572 580 599 596 567
74 567 571 647 727 714 617 537 523 522 491 471 507 550 531 472 458 518 584 592 553 510 482 462 448 447 458 468 470 469 474 490 507 503 475 455 476 528 568 566 536 508
69E08pJ3J6jk2k4j6k3l8k7J0L3J7PL8O9M4j4l9j4Mj2k0LK3Kl0k2J6L4J6o%J1Lk0k6jK8L1J1
64E75jNLk4n0l8QL8K5nk5l1k8KN1P1L1k7l6PM5L6%k7l8l6k3j1j4k2oL0L2j8o9n7JM1M1L6M3
59E35L5J2KJ2%n4r2n2K7O2K5j6qL0M0J3k1k6NM3M7op3q1j4O3P7L7jj4k4m7n7l7j2mlRK5K8
$$ plain form
69 508 501 514 530 529 507 483 467 444 406 379 389 422 439 446 484 553 597 583 544 530 534 522 502 505 528 530 500 478 494 528 544 538 538 549 552 532 506 505 533 564 575
64 575 574 579 582 558 508 470 478 516 541 536 511 480 452 454 505 576 607 580 544 551 596 632 632 605 567 531 508 497 483 461 455 485 517 499 430 373 374 415 456 492 535
59 535 570 582 584 596 596 542 450 398 425 487 512 496 488 518 558 571 550 524 529 572 619 613 540 459 445 508 585 622 621 607 583 536 479 442 430 426 423 432 457 485
$$ [...]
-1605E08
##END=	
##END=	
