##TITLE=	1cws$cUnSyme0Jmn2E3sNg.64.ser
TM-VI-251, Na+PMB-pyr hmbc

##JCAMP-DX=	6.0	$$ MestReNova 14.3.0-30573
##DATA TYPE=	LINK
##BLOCK_ID=	1
##BLOCKS=	2    
##ORIGIN=	Mestrelab Research S.L.
##OWNER=	hrzepa
##$MNOVA/LINK_BLOCK_TYPE=	ITEM	$$ NMR Spectrum
##$MNOVA/ITEM/POLYGON=	(XY..XY)
5321,5835
8722,5835
8722,8208
5321,8208
5321,5835
##$MNOVA/ITEM/Z=	0
##$MNOVA/ITEM/ANGLE=	0
##TITLE=	1cws$cUnSyme0Jmn2E3sNg.64.ser
##JCAMP-DX=	6.0	$$ MestReNova 14.3.0-30573
##BLOCK_ID=	2
##DATA TYPE=	MNOVA NMR VIEW DATA
##DATA CLASS=	MNOVA VIEW DATA
##$MNOVA/2D/THRESHOLD=	5.1498150825500488281
##$MNOVA/ITEM/ZOOM/X=	-0.47893103590269503478,	14.508270000071124883
##$MNOVA/ITEM/ZOOM/Y=	-9.5608721214139968936,	250.07129999451962021
##END=	
##TITLE=	1cws$cUnSyme0Jmn2E3sNg.64.ser
##JCAMP-DX=	6.0	$$ MestReNova 14.3.0-30573
##BLOCK_ID=	3
##DATA TYPE=	nD NMR SPECTRUM
##DATA CLASS=	NTUPLES
##NUMDIM=	2
##ORIGIN=	Bruker BioSpin GmbH
##OWNER=	nmr
##.OBSERVE FREQUENCY=	400.20280139999999847
##.OBSERVE NUCLEUS=	^1H
##.SOLVENT NAME=	MeOD
##.PULSE SEQUENCE=	hmbcgplpndqf
##LONGDATE=	2022/01/24 23:06:14.000
##.ACQUISITIONMODE=	SIMULTANEOUS (DQD)
##$ORIGINAL FORMAT=	Bruker XWIN-NMR
##$MNOVA/SCALES_VERSION=	9
##$PARAMETER FILE=	(acqu2s, ASCII, /private/var/folders/f6/rjf_tdyn2v98c5c0wvkgn4s80000gn/T/1cws$cUnSyme0Jmn2E3sNg/64/acqu2s, 0)
$$ ##TITLE= Parameter file, TOPSPIN		Version 3.2
$$ ##JCAMPDX= 5.0
$$ ##DATATYPE= Parameter Values
$$ ##NPOINTS= 129	$$ modification sequence number
$$ ##ORIGIN= Bruker BioSpin GmbH
$$ ##OWNER= nmr
$$ $$ 2022-01-24 23:25:51.014 +0000  nmr@CZC2439F63
$$ $$ /opt/topspin/data/agmb/nmr/Jan24-2022/64/acqu2s
$$ $$ process /opt/topspin3.2/prog/mod/go
$$ ##$ACQT0= 0
$$ ##$BF1= 100.63037
$$ ##$FnMODE= 1
$$ ##$NUC1= <13C>
$$ ##$NusJSP= 0
$$ ##$NusT2= 1
$$ ##$NusTD= 128
$$ ##$O1= 12075.7644147886
$$ ##$SFO1= 100.642445764415
$$ ##$SW= 260.109045168497
$$ ##$SW_h= 26178.0104712042
$$ ##$TD= 128
$$ ##END=
$$ 
##$PARAMETER FILE=	(acqus, ASCII, /private/var/folders/f6/rjf_tdyn2v98c5c0wvkgn4s80000gn/T/1cws$cUnSyme0Jmn2E3sNg/64/acqus, 0)
$$ ##TITLE= Parameter file, TOPSPIN		Version 3.2
$$ ##JCAMPDX= 5.0
$$ ##DATATYPE= Parameter Values
$$ ##NPOINTS= 12	$$ modification sequence number
$$ ##ORIGIN= Bruker BioSpin GmbH
$$ ##OWNER= nmr
$$ $$ 2022-01-24 23:25:54.604 +0000  nmr@CZC2439F63
$$ $$ /opt/topspin/data/agmb/nmr/Jan24-2022/64/acqus
$$ $$ process /opt/topspin3.2/prog/mod/shimcntl
$$ ##$ACQT0= 1000000
$$ ##$AMP= (0..31)
$$ 100 100 100 100 100 100 100 100 100 100 100 100 100 100 100 100 100 100
$$ 100 100 100 100 100 100 100 100 100 100 100 100 100 100
$$ ##$AMPCOIL= (0..19)
$$ 0 0 0 0 0 0 0 0 0 0 0 0 0 0 0 0 0 0 0 0
$$ ##$ANAVPT= -1
$$ ##$AQSEQ= 0
$$ ##$AQ_mod= 3
$$ ##$AUNM= <au_zg>
$$ ##$AUTOPOS= <51 >
$$ ##$BF1= 400.2
$$ ##$BF2= 100.63037
$$ ##$BF3= 400.2
$$ ##$BF4= 400.2
$$ ##$BF5= 400.2
$$ ##$BF6= 400.2
$$ ##$BF7= 400.2
$$ ##$BF8= 400.2
$$ ##$BYTORDA= 0
$$ ##$CAGPARS= (0..11)
$$ 0 0 0 0 0 0 0 0 0 0 0 0
$$ ##$CFDGTYP= 0
$$ ##$CFRGTYP= 9
$$ ##$CHEMSTR= <none>
$$ [...]
$$ 0 0 0 0
$$ ##$ShimPowMaxUC= (0..63)
$$ 130000 130000 130000 130000 130000 130000 130000 130000 130000 130000 130000
$$ 130000 130000 130000 130000 130000 130000 130000 130000 130000 0 0 0 0
$$ 0 0 0 0 0 0 0 0 0 0 0 0 0 0 0 0 0 0 0 0 0 0 0 0 0 0 0 0 0 0 0 0 0 0 0 0
$$ 0 0 0 0
$$ ##$ShimPowMaxUG= (0..63)
$$ 524287 524287 524287 524287 524287 524287 524287 524287 524287 524287 524287
$$ 524287 524287 524287 524287 524287 524287 524287 524287 524287 0 0 0 0
$$ 0 0 0 0 0 0 0 0 0 0 0 0 0 0 0 0 0 0 0 0 0 0 0 0 0 0 0 0 0 0 0 0 0 0 0 0
$$ 0 0 0 0
$$ ##$ShimPowRcbType= 3
$$ ##$ShimPowRes= (0..63)
$$ 1e-20 1e-20 1e-20 1e-20 1e-20 1e-20 1e-20 1e-20 1e-20 1e-20 1e-20 1e-20
$$ 1e-20 1e-20 1e-20 1e-20 1e-20 1e-20 1e-20 1e-20 0 0 0 0 0 0 0 0 0 0 0 0
$$ 0 0 0 0 0 0 0 0 0 0 0 0 0 0 0 0 0 0 0 0 0 0 0 0 0 0 0 0 0 0 0 0
$$ ##$ShimPowRng0= (0..63)
$$ 1 1 1 1 1 1 1 1 1 1 1 1 1 1 1 1 1 1 1 1 0 0 0 0 0 0 0 0 0 0 0 0 0 0 0 0
$$ 0 0 0 0 0 0 0 0 0 0 0 0 0 0 0 0 0 0 0 0 0 0 0 0 0 0 0 0
$$ ##$ShimPowRng1= (0..63)
$$ 1 1 1 1 1 1 1 1 1 1 1 1 1 1 1 1 1 1 1 1 0 0 0 0 0 0 0 0 0 0 0 0 0 0 0 0
$$ 0 0 0 0 0 0 0 0 0 0 0 0 0 0 0 0 0 0 0 0 0 0 0 0 0 0 0 0
$$ ##$ShimPowRng2= (0..63)
$$ 1 1 1 1 1 1 1 1 1 1 1 1 1 1 1 1 1 1 1 1 0 0 0 0 0 0 0 0 0 0 0 0 0 0 0 0
$$ 0 0 0 0 0 0 0 0 0 0 0 0 0 0 0 0 0 0 0 0 0 0 0 0 0 0 0 0
$$ ##$ShimPowRng3= (0..63)
$$ 1 1 1 1 1 1 1 1 1 1 1 1 1 1 1 1 1 1 1 1 0 0 0 0 0 0 0 0 0 0 0 0 0 0 0 0
$$ 0 0 0 0 0 0 0 0 0 0 0 0 0 0 0 0 0 0 0 0 0 0 0 0 0 0 0 0
$$ ##$ShimSysFunc= (0..63)
$$ 1 2 3 4 5 7 9 11 15 16 8 10 12 14 6 17 13 18 19 20 0 0 0 0 0 0 0 0 0 0
$$ 0 0 0 0 0 0 0 0 0 0 0 0 0 0 0 0 0 0 0 0 0 0 0 0 0 0 0 0 0 0 0 0 0 0
$$ ##$ShimSysMatrix= 0
$$ ##$ShimSysType= 1
$$ ##$TFXNUM= 0
$$ ##$TRIPLO2= 0
$$ ##$VTU= 2
$$ ##$VTUETH= <149.236.99.20>
$$ ##$VTUTY= <no>
$$ ##$WBREFAM= (0..15)
$$ 135.5 97.7 100 100 100 100 100 100 100 100 100 100 100 100 100 100
$$ ##$WBREFLM= (0..15)
$$ 0 0 0 0 0 0 0 0 0 0 0 0 0 0 0 0
$$ ##$WBREFPH= (0..15)
$$ 72.26 -67.22 0 0 0 0 0 0 0 0 0 0 0 0 0 0
$$ ##$WBSGU= (0..15)
$$ 0 0 0 0 0 0 0 0 0 0 0 0 0 0 0 0
$$ ##$XFAC= 2
$$ ##END=
$$ 
##$DECIM=	3328
##$DSPFVS=	20
##.ACQUISITIONSCHEME=	NOT PHASESENSITIVE
##NTUPLES=	nD NMR SPECTRUM
##VAR_NAME=	FREQUENCY1,	FREQUENCY2,	SPECTRUM
##SYMBOL=	F1,	F2,	Y
##.NUCLEUS=	13C,	1H
##.OBSERVE FREQUENCY=	100.64244576441500101,	400.20280139999999847
##VAR_TYPE=	INDEPENDENT,	INDEPENDENT,	DEPENDENT
##VAR_FORM=	AFFN,	AFFN,	ASDF
##VAR_DIM=	512,	512,	262144
##UNITS=	HZ,	HZ,	ARBITRARY UNITS
##FIRST=	25164.767445380970457,	5806.2096540000038658,	0.42446875572204589844
##LAST=	-962.11409912165936476,	-191.66820056731904742,	0.16390357911586761475
##MIN=	-962.11409912165936476,	-191.66820056731904742,	0.00099453574512153863907
##MAX=	25164.767445380970457,	5806.2096540000038658,	57.112697601318359375
##FACTOR=	1,	1,	0.0033199791189446269633
##PAGE=	F1=25164.8
##FIRST=	25164.767445380970457,	5806.2096540000038658,	0.42446875572204589844
##DATA TABLE=	(F2++(Y..Y)), PROFILE
$$ [...]
##PAGE=	F1=-9705.16
##FIRST=	25164.767445380970457,	5806.2096540000038658,	0
##DATA TABLE=	(F2++(Y..Y)), PROFILE
5032 98 81 204 87 91 103 173 56 31 47 184 142 42 65 112 258 193 147 152 177 46 280 141 74 196 213 140 111 180 68 72 108
4668 108 92 53 120 66 152 288 382 236 109 182 244 163 128 99 182 154 123 156 169 66 117 56 112 235 253 68 92 207 61 35 42
4304 42 61 76 94 162 205 6 167 134 38 32 111 129 255 199 233 55 94 120 253 130 177 138 120 100 47 65 188 114 158 176 232 170
3928 170 85 109 53 94 149 66 50 155 71 65 113 91 89 193 61 154 182 68 194 117 192 168 178 97 153 185 103 38 83 121 75 146 155 119
3529 119 143 77 76 93 76 126 111 179 177 136 179 87 51 200 99 154 141 84 132 7 44 238 184 20 204 127 48 94 94 108 86 141 159
3142 159 92 177 83 149 109 52 76 76 52 34 101 133 135 47 142 196 187 65 70 125 153 150 184 171 11 58 69 39 26 137 104 69 68 81 201 161
2719 161 138 180 73 107 253 277 105 87 97 24 104 198 72 22 216 274 92 67 204 173 111 169 107 127 151 165 174 7 105 59 346
2355 346 127 104 74 135 218 285 155 123 160 32 99 83 31 82 14 74 131 124 86 136 106 126 313 304 107 118 34 213 90 28 230 330
1980 330 205 295 156 88 153 72 104 158 183 286 392 259 166 196 208 169 277 276 107 82 182 85 154 285 205 170 288 148 163 244
1628 244 136 88 74 79 102 97 130 6 139 157 61 158 160 47 56 68 82 68 82 120 194 147 114 113 175 181 206 128 48 84 278 189 309 281 215
1217 215 230 82 86 151 33 208 82 343 241 374 263 63 64 70 182 205 353 116 124 114 104 93 84 91 63 157 75 139 167 83 61 114
841 114 226 80 167 183 46 89 30 74 211 127 104 234 131 184 162 148 178 250 192 25 208 253 35 93 153 203 76 35 67 83
489 83 130 51 64 282 177 137 168 82 122 117 125 84 54 111 49 178 104 116 30 95 114 112 193 105 131 223 136 52 78 114 190 202 199 116 82 40
67 40 106 231 264 208 264 159 99 286 378 242 159 137 62 44 161 78 53 37 98 37 36 62
-192F2
##PAGE=	F1=-9807.42
##FIRST=	25164.767445380970457,	5806.2096540000038658,	0
##DATA TABLE=	(F2++(Y..Y)), PROFILE
5806 92 115 34 63 94 107 315 184 121 259 233 189 173 136 91 83 104 175 63 101 55 134 169 289 149 92 24 83 88 96 132 207 266 171 90
5407 90 88 49 186 177 83 110 151 166 91 138 144 146 99 147 57 144 56 132 85 214 181 32 70 286 166 134 73 231 185 179 74 59 52 189
5008 189 135 96 164 202 16 27 27 145 145 61 111 119 266 260 155 127 120 51 278 119 121 205 142 55 170 181 67 58 43 139 68 131 86 131
4609 131 257 339 193 109 219 211 124 131 87 167 141 147 174 173 71 118 36 152 266 265 103 87 146 34 33 86 77 74 134 202 221 49 122 105
4210 105 25 51 59 113 281 226 217 76 54 128 207 96 156 142 113 106 29 44 182 143 166 129 188 132 84 157 77 96 153 154 6 181 86 80
3811 80 133 89 107 219 104 127 142 66 276 137 208 160 175 96 141 169 111 16 18 185 107 135 178 122 149 113 32 83 48 110 129 194 176
3423 176 146 177 37 105 211 161 122 131 115 116 38 62 258 207 28 172 104 81 105 69 115 114 122 210 165 182 91 173 155 74 85 65 58 3 91
3013 91 128 155 57 114 192 198 75 52 119 147 130 165 168 59 36 34 33 48 129 161 78 74 50 198 175 97 187 82 87 211 254 129 125 82 60 167
2590 167 202 90 50 202 208 138 112 164 162 108 156 78 138 135 132 183 33 72 91 353 173 86 33 157 204 252 151 94 139 53 107 61 59 83
2191 83 62 59 90 119 71 143 79 134 312 298 136 96 25 178 82 41 179 284 198 332 181 86 147 48 88 150 148 269 385 257 150
1827 150 152 151 167 281 267 91 76 162 89 141 283 248 204 272 147 125 238 133 93 61 43 85 74 109 22 137 105 35 169 171 28 37
1452 37 106 150 120 97 201 204 93 149 121 146 168 236 171 66 71 328 236 260 260 213 236 96 99 175 29 190 79 327 232 418 307 98
1076 98 71 90 175 253 380 88 102 90 67 65 133 124 109 126 105 127 143 109 62 101 218 96 127 177 49 97 47 140 260 88 58 285
700 285 142 173 127 161 211 275 185 33 240 216 16 99 124 165 80 21 50 66 109 37 71 234 145 136 117 42 170 158 114 90 65 133 29
313 29 189 71 165 54 103 102 111 184 73 83 218 149 68 120 87 241 227 196 136 86 67 97 217 251 234 305 174 128 327 380 266 157
-63 157 115 17 59 172 92 57 18 122 53 32 59
-192E9
##PAGE=	F1=-9909.68
##FIRST=	25164.767445380970457,	5806.2096540000038658,	0
##DATA TABLE=	(F2++(Y..Y)), PROFILE
5806 89 129 29 57 71 96 256 174 151 263 197 215 247 168 52 108 108 139 135 170 50 145 213 262 95 97 27 106 97 126 121 150 307 218 92
5407 92 132 84 193 196 57 107 114 115 55 147 80 100 90 180 66 133 52 127 71 149 154 70 34 292 189 106 89 243 202 135 82 23 20 178
5008 178 178 100 190 200 27 66 91 87 143 93 155 131 262 293 185 133 56 53 274 127 171 212 130 31 228 171 69 54 32 196 138 128
4632 128 115 117 208 290 150 96 239 165 71 113 67 145 143 162 177 148 74 127 16 196 280 249 148 78 89 20 73 132 96 78 170 212 228
4245 228 100 92 75 23 73 38 101 284 242 165 83 37 146 152 63 138 139 116 114 59 23 160 155 176 82 139 103 85 193 94 103 145 229 36 200
3834 200 104 93 151 82 107 234 136 93 101 95 337 156 194 148 171 108 129 144 138 26 54 248 149 132 218 134 164 135 17 69 33 81 144
3447 144 210 160 138 150 58 155 216 222 97 123 148 101 52 86 268 217 47 145 69 110 106 33 132 122 98 233 233 182 101 173 178 78 108 73
3048 73 69 26 94 157 175 102 72 178 191 73 80 101 118 92 125 161 103 51 51 32 109 107 183 96 84 20 175 177 57 191 82 88 154 224 150
2637 150 148 63 94 222 188 80 88 189 140 165 157 147 139 85 113 52 129 123 107 195 64 79 104 334 204 87 37 165 157 199 130 70 150 90
2238 90 132 56 104 84 105 46 55 123 132 154 82 149 290 279 167 90 16 130 64 65 119 225 167 328 201 129 141 25 83 136 108 220 341
1851 341 232 110 99 82 153 279 224 104 129 150 96 124 261 278 237 248 132 97 217 122 104 75 27 84 64 67 50 127 66 51 167
1487 167 161 11 15 141 199 167 113 276 262 70 166 127 107 168 261 209 95 77 366 291 205 213 201 238 117 99 174 25 157 98 302
1123 302 200 426 326 130 61 107 148 297 379 74 64 76 39 32 182 163 149 101 135 103 116 126 53 84 182 99 92 156 51 104 94 184
747 184 282 49 16 326 149 141 65 162 233 271 140 90 284 191 33 98 101 151 95 30 19 68 79 34 65 164 92 143 78 56 198 197 77
360 77 69 46 127 8 201 29 214 79 106 82 105 181 99 13 193 161 83 165 93 268 241 189 148 126 114 93 192 209 246 334 187 144
-16 144 338 345 261 145 126 24 40 168 102 79 8 130 107 78 56
-192E6
##PAGE=	F1=-10011.9
##FIRST=	25164.767445380970457,	5806.2096540000038658,	0
##DATA TABLE=	(F2++(Y..Y)), PROFILE
5806 79 140 42 65 41 104 176 151 173 241 165 249 305 188 94 136 94 92 197 227 64 158 246 223 45 103 70 129 93 146 122 146 317 256
5419 256 112 181 123 180 205 27 104 72 66 93 157 24 56 77 197 110 109 66 126 96 72 120 104 66 293 213 85 83 226 210 93 124
5043 124 78 50 176 203 95 177 173 64 81 139 27 137 124 189 151 257 291 217 151 49 55 276 165 214 212 160 90 272 165 64
4691 64 75 83 231 200 106 137 103 154 245 110 68 241 126 52 68 37 121 151 173 161 101 73 150 13 239 275 214 181 68 71 5 126
4316 126 168 111 88 197 190 223 144 80 46 48 84 83 107 264 243 86 81 53 157 97 64 128 131 123 119 101 8 138 150 180 42 97 88 88 212 102
3893 102 113 125 275 67 209 120 101 155 70 86 228 155 63 76 143 356 164 158 118 159 123 116 112 172 46 117 294 189 136 257 147
3529 147 168 138 8 48 44 49 151 227 134 109 106 128 200 220 272 91 118 173 95 48 85 254 211 72 128 38 145 96 22 153 115 74 223
3142 223 281 174 110 165 181 74 143 104 73 52 107 194 187 146 59 148 161 75 121 73 67 51 74 157 134 71 70 38 149 93 171 119 93 76 137
2731 137 170 83 195 62 105 92 190 161 155 67 114 256 169 52 107 181 90 159 190 167 106 50 48 37 112 112 95 207 95 103 95 301 219 96
2332 96 78 153 83 139 94 67 166 127 158 98 159 86 141 29 28 134 217 162 91 156 255 256 191 109 63 85 55 82 64 173 119 295 213 191
1933 191 149 10 96 114 96 154 267 195 68 44 18 132 271 160 121 191 149 100 115 225 291 261 221 107 91 184 110 116 87 35 100
1569 100 94 16 65 121 48 81 148 134 8 11 168 216 193 129 322 320 102 166 122 70 172 273 227 116 106 388 322 161 145 173 228 138
1193 138 93 154 22 115 132 286 152 397 318 158 46 127 101 329 347 86 35 64 23 10 223 198 173 98 155 70 87 139 36 73
841 73 127 75 79 137 65 106 128 197 277 25 52 352 165 97 31 151 240 239 69 158 325 191 53 97 88 158 111 8 32 71 46 34 51
454 51 92 27 137 52 104 204 225 26 50 59 95 50 209 66 259 99 104 53 97 187 162 65 168 171 89 193 99 266 231 166 145 166
78 166 150 98 158 149 239 348 201 149 321 279 226 119 167 55 9 145 104 99 35 121 164 111 56
-192E6
##PAGE=	F1=-10114.2
##FIRST=	25164.767445380970457,	5806.2096540000038658,	0
##DATA TABLE=	(F2++(Y..Y)), PROFILE
5806 61 147 72 93 51 119 109 117 177 193 160 277 333 198 165 152 70 62 235 261 78 167 262 176 48 115 101 144 70 150 120 161 296 277
5419 277 137 221 153 143 205 6 102 61 66 147 165 34 18 66 201 162 74 91 124 124 20 93 131 106 284 227 83 62 187 211 63
5055 63 154 140 101 179 197 82 138 134 85 68 159 33 125 146 205 181 252 266 246 164 93 59 282 195 233 197 179 126 294 168 60 116 113
4668 113 230 238 71 147 82 113 205 72 25 227 123 93 12 21 103 159 182 141 49 66 178 33 275 253 175 189 61 90 33 171 185
4304 185 116 100 215 147 207 170 84 61 85 79 106 117 226 231 10 81 71 159 64 91 127 126 136 119 140 17 125 139 170 18 72 82 92
3916 92 207 97 117 96 284 88 205 128 96 133 56 50 199 158 55 96 191 328 156 113 77 147 133 104 85 199 59 162 317
3576 317 222 143 277 150 154 126 17 27 74 70 144 241 105 64 68 195 236 219 298 105 112 186 110 38 59 222 194 93 124 45 184 79
3200 79 61 172 99 63 183 296 150 121 167 175 78 184 150 73 71 123 219 185 179 106 104 109 90 153 42 11 56 48 158 149 79 78 59 161 100
2790 100 136 141 101 131 101 161 136 198 25 119 37 153 155 147 102 116 262 162 49 104 179 66 119 204 197 73 17 24 47 108 101 101 224 122
2391 122 113 73 269 224 99 109 121 8 94 49 89 164 150 167 167 215 92 173 9 17 148 288 163 94 154 216 229 201 141 128 62 79
2015 79 90 22 137 70 261 221 247 174 7 118 88 122 108 178 163 76 3 53 104 256 115 113 228 161 106 128 183 285 269 197 90
1651 90 105 146 104 128 84 37 119 133 29 57 127 25 97 113 97 8 27 181 197 194 139 326 341 134 153 111 60 168 266 222 129 143 389
1264 389 316 139 66 126 205 151 95 127 43 90 160 278 97 343 288 179 36 153 38 336 289 105 53 43 41 47 247 216 180 106
912 106 157 35 56 148 22 71 66 29 95 143 92 95 134 176 250 47 87 362 202 70 107 131 228 191 59 224 349 202 65 96 82
548 82 168 119 44 79 65 25 34 42 73 40 112 59 153 192 236 48 93 121 49 84 207 123 290 110 95 22 83 197 222 139 153 177 78 200
149 200 95 238 192 124 122 183 164 103 119 88 217 349 212 144 283 199 171 86 210 81 62 109 94 108 59 104 214 120 65
-192F5
##PAGE=	F1=-10216.4
##FIRST=	25164.767445380970457,	5806.2096540000038658,	0
##DATA TABLE=	(F2++(Y..Y)), PROFILE
5806 36 147 106 130 96 128 110 82 164 132 184 283 325 204 224 150 54 79 243 266 77 157 257 131 82 131 112 141 33 139 103 159
5442 159 254 281 153 242 165 93 201 30 103 83 104 183 167 56 15 66 200 200 36 122 115 133 59 93 153 128 256 224 88 53 148 208
5067 208 71 161 186 154 176 158 65 95 97 84 50 149 66 108 152 204 214 243 230 271 170 121 65 280 196 216 168 170 139 294 178 84 165
4679 165 116 195 245 33 144 55 100 169 29 28 201 150 134 82 71 105 168 188 132 57 56 198 56 295 219 146 172 63 109 80 198
4316 198 176 115 114 220 98 191 172 96 116 118 63 88 125 180 208 85 100 83 156 81 116 130 129 154 109 167 34 118 131 143 30 67 78 97
3916 97 179 76 106 72 255 104 185 127 78 86 38 18 148 147 71 141 226 259 128 88 57 153 136 92 83 206 62 185 317 246 151 269
3541 269 138 135 104 42 18 107 119 124 249 79 16 82 246 260 204 288 121 102 188 144 53 35 185 169 102 130 64 217 63 97 185 78
3165 78 71 124 278 113 135 181 171 95 226 199 81 86 139 224 166 197 161 46 56 109 165 25 65 110 93 160 149 75 78 92 146 110 91 160
2766 160 116 162 84 152 173 197 21 118 39 116 129 127 146 100 242 175 94 86 181 62 52 199 212 51 23 88 71 127 94 122 250 140
2391 140 102 58 249 224 91 126 72 89 98 18 121 146 149 154 242 261 105 202 40 27 158 328 153 90 150 181 194 193 172 198 69 115
2015 115 94 10 120 39 251 225 283 203 22 132 60 151 124 110 155 115 38 97 75 229 139 65 227 185 124 164 143 261 258 178 96 123
1639 123 106 116 145 76 26 135 160 56 24 136 25 93 65 65 27 38 175 149 179 136 290 313 143 135 102 88 148 240 198 136 174 363
1264 363 274 133 11 67 167 148 112 106 76 122 171 262 38 278 249 192 39 187 34 310 214 113 78 35 66 86 251 211 170 106
912 106 144 21 36 153 34 71 15 25 122 170 124 69 112 130 209 80 103 355 256 83 172 107 200 149 134 270 345 203 64 97 85
548 85 165 108 103 116 47 31 36 52 118 90 74 93 193 179 234 99 151 176 5 98 193 167 299 118 79 34 66 198 264 196 141 177 51
160 51 188 90 193 130 82 80 169 152 98 80 41 195 341 213 133 233 127 111 58 236 98 109 71 68 109 78 91 253 103 93
-192I3
##PAGE=	F1=-10318.7
##FIRST=	25164.767445380970457,	5806.2096540000038658,	0
##DATA TABLE=	(F2++(Y..Y)), PROFILE
5806 11 136 136 165 138 126 153 64 137 79 211 256 285 207 259 133 58 106 225 245 57 124 230 100 108 150 104 115 51 118 71 135 203 267
5419 267 151 241 157 69 196 47 106 96 133 194 160 54 34 81 201 217 27 153 96 113 82 131 172 124 203 201 86 71 131 204 109
5055 109 150 215 201 160 95 57 70 76 62 93 119 75 89 144 191 233 217 194 291 171 125 72 263 165 159 132 133 134 277 188 137 212 97 136 224
4644 224 19 136 47 115 137 26 88 166 178 159 164 136 130 186 189 134 103 47 205 72 291 182 139 134 73 120 133 205 144 115 132 213 65
4257 65 192 154 114 174 142 43 35 147 138 179 146 137 84 153 118 129 128 142 179 92 180 60 100 129 110 61 78 77 99 133 43 76 72 200 120 151
3834 151 116 61 47 23 48 86 126 91 181 242 164 91 96 83 180 134 77 99 188 64 195 302 258 161 232 114 126 83 59 18 131 158 94
3447 94 247 59 51 131 276 267 169 238 124 85 182 182 89 57 156 140 96 139 66 234 61 124 191 56 85 62 230 69 149 192 170 116
3071 116 257 235 93 102 153 212 133 202 204 18 82 117 155 45 120 167 147 153 144 71 75 129 111 100 46 172 144 159 86 144 189 193 67 106 71
2661 71 79 93 98 185 74 208 202 143 60 182 72 28 185 209 51 40 137 99 159 96 146 284 147 72 77 243 219 78 129 18 158
2297 158 133 57 150 132 122 125 305 285 126 231 79 38 161 329 135 81 154 155 151 170 199 259 91 147 108 36 114 45 256 228 291 220
1921 220 40 134 38 164 170 131 176 141 57 126 56 191 194 17 184 213 153 208 113 225 229 164 120 137 68 144 177 103 7 146 167 56
1545 56 32 136 97 78 21 62 68 40 149 88 177 116 229 245 128 116 100 124 113 205 167 140 189 310 216 140 65 24 115 127 129 91 110 184
1146 184 169 223 24 218 210 200 62 223 110 251 141 103 81 74 77 123 231 178 144 88 126 43 50 151 55 67 18 75 141 191 153 33
771 33 96 87 163 109 102 333 314 102 204 84 160 128 190 285 313 185 50 100 95 142 77 153 132 38 62 52 77 157 117 35 123 214 181 235
372 235 132 188 199 31 87 170 192 284 127 55 71 54 188 282 233 115 170 31 163 96 145 72 95 24 125 120 83 46 19 188 327
8 327 195 116 177 91 72 52 237 103 132 62 32 109 90 88 274 62 142
-192A42
##PAGE=	F1=-10421
##FIRST=	25164.767445380970457,	5806.2096540000038658,	0
##DATA TABLE=	(F2++(Y..Y)), PROFILE
5806 27 116 155 193 169 116 180 75 106 60 217 195 223 203 260 105 68 112 201 217 25 72 184 88 127 168 82 69 117 94 30 104 155 237
5419 237 131 218 135 103 191 54 107 83 142 182 144 28 45 98 204 210 54 176 71 65 84 189 189 93 121 173 73 89 139 195 148 137
5043 137 228 237 133 62 73 69 71 26 166 100 60 76 132 171 226 170 164 300 168 113 74 230 118 74 102 78 120 254 197 194 248 72 70 183
4644 183 28 138 77 141 127 93 150 128 192 167 231 202 163 210 186 136 136 50 201 73 259 152 145 85 86 130 179 197 96 121 155 199 62
4257 62 218 128 137 226 155 34 59 195 108 151 175 180 76 150 148 129 114 161 205 71 177 93 69 125 89 96 97 80 99 79 36 51 95 136 140
3846 140 112 103 79 98 22 78 25 109 106 202 235 67 75 105 108 210 131 60 113 152 77 200 282 258 170 177 89 131 70 58 24 141 173 58 232
3435 232 45 97 183 287 257 116 158 105 64 171 214 124 86 132 114 81 137 55 230 79 144 188 35 94 22 165 50 157 186 166
3083 166 126 266 243 98 116 161 190 92 197 231 82 148 107 123 74 153 214 183 131 145 82 70 158 76 72 9 174 182 123 91 135 189 184 110
2684 110 104 90 55 85 67 213 64 177 229 179 46 178 93 108 176 196 72 48 173 126 191 113 159 313 144 39 124 250 211 71
2332 71 123 51 204 164 96 173 142 79 94 342 281 152 264 109 42 155 294 117 66 164 143 105 135 214 302 122 170 145 65 109 61
1968 61 249 228 272 218 55 123 30 156 202 198 211 150 63 142 61 145 230 112 110 239 188 249 95 186 191 152 146 144 42 177 218 168 29
1581 29 149 157 30 94 123 172 80 51 80 118 34 116 58 202 80 167 168 106 97 107 154 88 183 142 143 179 232 173 151 95 59 55 93 131 77 138
1158 138 240 163 163 87 171 172 204 97 252 178 170 99 83 62 121 64 158 191 120 106 57 119 59 82 144 68 61 27 104 140 185 175 26 145
759 145 107 123 133 91 299 359 104 196 71 116 117 203 266 261 170 35 105 104 105 42 179 126 69 111 78 111 176 121 32 132 210 200 248 147
360 147 186 182 52 56 147 199 251 134 27 99 59 171 273 245 74 153 63 134 111 113 82 152 34 66 78 62 22 24 198 303 156 97
-16 97 120 96 81 63 212 91 124 88 45 116 96 86 274 14 203
-192B03
##PAGE=	F1=-10523.2
##FIRST=	25164.767445380970457,	5806.2096540000038658,	0
##DATA TABLE=	(F2++(Y..Y)), PROFILE
5806 51 90 160 206 183 104 177 87 79 59 195 109 150 187 230 74 80 92 209 213 44 23 127 96 148 180 60 22 184 78 32 92 119 195
5419 195 108 177 108 140 180 56 109 45 131 156 121 15 47 106 202 187 72 182 53 29 89 248 197 40 21 175 62 86 151 172
5067 172 170 134 231 256 105 131 109 76 65 15 229 120 28 76 124 151 193 105 139 296 153 96 72 188 99 44 89 17 110 234 208 241
4691 241 268 73 19 136 29 159 115 166 151 167 205 93 188 161 271 257 187 229 181 130 151 72 189 67 208 140 154 38 96 141
4339 141 208 182 44 130 183 191 72 260 112 162 265 159 43 140 254 97 128 170 220 63 140 164 119 87 176 226 53 162 126
3999 126 59 117 94 125 117 92 102 64 86 89 121 102 164 88 115 126 165 27 93 25 108 113 199 205 52 103 96 109 220 124 44 120 124 99 209 263
3576 263 242 177 132 80 132 65 39 49 134 168 26 202 41 125 229 285 232 56 91 66 44 154 231 149 93 103 91 68 120 45 209
3212 209 105 163 175 36 92 42 99 76 152 158 154 119 244 219 88 121 157 164 58 189 240 134 200 78 78 100 159 242 190 91 155 103 61
2825 61 168 65 54 37 168 220 75 92 128 184 173 153 126 92 65 121 43 224 87 162 248 198 66 168 117 174 186 190 112 49 204
2461 204 146 214 138 152 325 137 54 184 265 196 74 113 102 224 178 122 187 174 51 74 344 247 176 298 122 40 138 235 105 59
2109 59 175 146 63 94 211 321 155 187 201 100 100 73 219 224 232 198 67 106 26 130 206 253 252 159 66 149 83 102 236 197 44 252
1733 252 217 278 85 151 158 140 164 146 39 199 257 237 56 146 140 22 152 100 229 108 90 92 166 23 110 89 233 38 133 140 103
1369 103 75 123 171 109 192 130 144 144 142 169 155 93 92 33 52 114 63 157 276 165 97 143 138 134 205 131 270 230 83 118 60 27 155 29
970 29 190 137 51 63 32 134 64 116 132 69 55 16 107 114 148 189 63 222 164 95 150 81 257 381 90 151 74 82 99 167 221 204 196 66
571 66 107 102 76 42 177 112 115 168 100 147 180 112 61 118 179 224 273 152 145 132 73 20 131 197 208 131 9 106 67 159 239 235 36 125 103
160 103 111 126 111 128 203 85 9 42 56 15 53 209 267 100 86 64 104 105 70 167 62 89 115 92 127 99 83 252 67 262
-192B62
##PAGE=	F1=-10625.5
##FIRST=	25164.767445380970457,	5806.2096540000038658,	0
##DATA TABLE=	(F2++(Y..Y)), PROFILE
5806 65 66 151 201 181 98 148 82 67 42 147 45 83 158 173 45 104 49 257 248 91 61 72 119 176 178 46 55 240 79 73 106 100 153 108
5407 108 126 83 151 160 57 116 21 104 127 96 66 47 99 185 157 76 166 58 96 121 289 188 51 98 226 66 61 152 128 165 140 228
5032 228 256 91 209 152 90 50 45 261 156 15 87 119 136 142 35 116 277 125 85 71 150 130 125 82 47 109 216 218 266 266 99 14
4656 14 97 48 189 145 182 189 237 249 65 170 151 282 290 193 234 177 118 152 108 174 95 169 150 160 5 102 149 213 168 4 134 207 203
4269 203 78 303 112 185 286 154 65 201 303 109 111 136 248 54 126 164 102 48 184 237 44 144 150 102 109 110 141 130 113 120 111
3905 111 143 155 140 122 185 107 167 173 211 25 93 56 118 109 173 159 113 137 71 81 202 112 41 122 134 123 224 244 211 177 128 93 120 64
3506 64 18 84 119 158 15 156 52 131 265 272 198 14 135 28 27 130 229 157 74 64 71 67 86 45 180 133 186 151 58 79 61 49 106
3118 106 134 112 131 92 188 164 65 112 139 138 51 183 236 166 223 37 45 122 141 248 164 37 165 116 46 153 66 82 72 159 245 68
2743 68 87 129 182 162 196 164 80 93 160 49 215 119 158 249 200 101 155 134 215 204 197 162 53 232 151 224 163 125 309 134 99 246
2367 246 280 174 77 104 136 224 173 131 193 209 72 65 310 185 189 329 116 36 110 169 95 75 187 157 29 55 187 316 181 199
2015 199 262 140 94 88 173 220 180 170 77 96 22 95 183 282 291 178 67 150 104 74 214 248 90 247 237 292 86 117 139 127 172 142
1639 142 45 199 278 289 74 135 127 67 192 85 252 138 113 88 200 11 149 125 244 33 132 172 126 48 146 173 160 222 131 142
1287 142 86 87 188 143 63 108 88 16 81 65 161 283 172 64 180 114 107 199 154 276 259 8 163 41 15 170 49 218 81
947 81 48 19 46 156 59 147 120 62 55 25 92 73 87 192 89 281 208 83 161 83 211 377 77 93 90 72 83 90 168 158 263 122
571 122 102 94 72 70 150 113 153 214 110 183 183 109 83 92 132 240 297 160 73 79 108 12 122 191 163 108 33 91 60 162 184 208 46 93 126
160 126 108 135 123 155 231 117 34 22 75 14 94 206 221 40 100 14 92 115 65 113 22 39 132 130 136 106 89 209 131 302
-192C02
##PAGE=	F1=-10727.7
##FIRST=	25164.767445380970457,	5806.2096540000038658,	0
##DATA TABLE=	(F2++(Y..Y)), PROFILE
5806 67 55 134 178 166 99 106 61 79 27 81 107 32 125 105 23 142 20 313 296 128 101 42 152 207 161 41 94 276 91 104 122 109
5431 109 134 141 94 68 129 127 60 138 78 69 101 78 118 50 76 144 131 79 128 77 170 164 300 158 126 207 297 80 23 136 67 130 143 215 237
5020 237 96 264 194 114 25 61 254 177 48 97 104 129 87 37 93 245 87 85 74 127 165 186 67 103 116 189 222 266 243 122 6
4656 6 76 93 210 160 183 214 287 276 51 145 144 268 295 178 223 173 107 152 151 163 164 186 172 162 17 107 149 192 156 32 129 219 226 83
4257 83 337 110 204 285 137 96 224 329 138 97 85 259 56 114 149 81 14 180 234 41 129 157 155 106 119 141 130 138 157 165 190 218
3881 218 150 156 198 150 235 207 225 26 88 69 127 94 131 108 156 156 59 30 156 92 59 122 169 140 241 220 167 165 154 116 95 68 45 118 110
3470 110 162 26 101 77 117 286 249 161 46 218 62 20 97 209 147 45 22 47 72 43 43 153 157 214 114 78 62 75 35 121 107
3107 107 62 101 50 114 91 39 88 109 114 69 183 228 170 213 14 79 137 106 230 114 25 162 116 33 120 52 114 97 154 252 110 77
2731 77 139 183 153 235 197 60 115 177 76 189 143 147 226 187 133 148 138 229 211 213 208 74 256 136 214 175 84 268 143 142 296 283 144
2344 144 70 99 145 214 156 126 196 232 97 71 247 106 188 348 110 47 73 117 89 103 201 167 14 25 147 286 186 205 318 176
1992 176 102 106 147 220 127 143 91 105 49 64 138 283 318 197 59 143 119 58 176 251 150 225 242 293 113 80 138 115 170 132 50 169
1616 169 272 308 77 119 122 98 205 94 235 152 114 67 216 14 198 144 222 68 138 207 152 23 167 161 207 246 138 139 16 124
1264 124 202 110 30 123 141 8 44 87 146 260 175 87 191 95 115 185 159 272 266 45 203 29 53 167 112 234 54 110 20 69
912 69 175 52 172 108 56 61 65 82 66 44 181 95 299 223 90 168 94 166 350 79 82 111 85 112 31 126 130 336 175 88 99 86 103
524 103 108 136 173 232 105 216 193 120 92 75 98 243 310 178 14 93 156 17 123 188 121 59 53 73 29 180 114 173 64 71 126 128 139
137 139 132 156 233 125 59 12 103 7 137 183 170 47 136 24 56 101 48 64 31 11 137 149 139 122 115 154 184 309
-192C09
##PAGE=	F1=-10830
##FIRST=	25164.767445380970457,	5806.2096540000038658,	0
##DATA TABLE=	(F2++(Y..Y)), PROFILE
5806 71 64 116 137 140 101 72 55 112 82 8 174 10 105 53 17 184 76 347 328 147 117 52 186 233 131 41 109 288 108 119 122 141
5431 141 159 182 118 59 80 86 66 173 133 35 74 72 163 59 41 80 114 97 75 97 231 198 273 111 189 292 354 92 43 105 48 74 140
5043 140 188 202 103 284 226 138 8 62 211 172 70 97 71 133 42 81 74 207 55 97 79 123 176 212 42 150 122 149 216 249 203
4679 203 135 34 79 143 210 158 166 210 304 285 48 119 147 249 269 144 205 168 106 160 196 161 243 243 195 161 16 119 150 151 145 47 117 212
4280 212 243 90 357 95 218 261 105 129 204 323 167 78 31 251 67 112 121 63 57 164 218 40 118 143 190 107 119 124 115 164 204
3916 204 208 224 268 152 178 201 194 295 223 214 57 87 71 130 78 82 61 182 155 81 33 91 73 87 118 194 149 257 191 117 143 171 137 67
3517 67 75 79 141 117 181 25 69 106 98 285 217 124 71 278 112 25 61 172 125 61 19 34 75 39 27 139 175 245 65 86 55 87 39
3130 39 121 80 35 72 6 90 27 22 62 75 95 92 186 227 144 179 56 136 144 66 193 66 86 142 110 55 92 15 126 104 161 242 147 60 152
2719 152 179 151 260 213 36 122 166 105 156 158 122 175 164 150 157 129 215 191 227 230 118 267 102 185 169 45 209 161 177 320 262 108
2344 108 56 97 125 203 137 114 201 237 100 97 178 21 172 346 134 75 37 94 98 124 213 169 42 9 105 236 166 197 355 198 124
1980 124 125 159 230 78 117 110 127 101 53 87 262 328 197 41 127 124 35 139 208 182 191 235 286 168 48 155 107 162 117 68 113 237
1604 237 291 65 100 117 102 186 117 185 143 99 37 211 23 236 146 171 91 133 218 163 28 181 141 235 250 142 138 51 176 199 64
1240 64 70 155 178 13 14 114 115 212 165 112 175 81 148 169 144 263 260 68 228 33 82 152 165 232 79 158 54 80 182 48 186 92
865 92 64 71 106 102 112 84 151 80 278 210 115 174 102 127 307 84 136 133 101 173 129 102 118 387 210 67 131 110 149 62 162 170 213 87
466 87 242 207 133 94 83 112 233 307 202 101 147 205 43 144 187 81 15 60 113 24 205 34 148 56 86 104 164 144 137 136 218 110
90 110 72 23 129 22 171 144 123 100 174 48 17 66 31 47 75 49 132 148 134 149 148 97 217 280
-192B80
##PAGE=	F1=-10932.3
##FIRST=	25164.767445380970457,	5806.2096540000038658,	0
##DATA TABLE=	(F2++(Y..Y)), PROFILE
5806 101 88 105 81 108 98 61 91 150 155 62 211 21 101 77 36 213 126 346 328 149 108 61 214 249 95 57 103 273 124 114 103
5442 103 176 205 214 170 51 22 43 75 211 172 30 41 82 193 69 2 17 110 130 19 114 270 211 210 56 222 342 378 96 87 65
5078 65 114 47 135 147 156 98 269 242 149 40 51 151 142 78 87 33 145 21 103 62 172 40 111 79 127 159 207 46 187 119 99 202
4703 202 230 158 148 93 106 184 182 142 133 183 284 280 56 95 156 238 219 101 193 165 121 174 239 171 304 295 211 157 3 139 160 105 139 48
4304 48 104 185 238 100 362 67 228 215 60 153 147 286 180 54 32 229 81 119 88 59 110 141 192 40 108 110 197 102 115 96 85
3940 85 187 251 233 241 302 150 181 197 225 330 219 191 103 95 70 126 78 34 32 197 148 104 85 25 78 114 107 196 150 269 158 70 112 165
3541 165 156 50 85 102 145 136 201 16 112 133 94 257 176 89 86 302 147 34 50 124 102 112 38 64 75 85 35 144 185 275 14 82
3165 82 60 98 32 115 63 48 53 50 162 62 18 57 46 86 116 187 229 90 136 96 186 143 36 145 92 138 113 117 96 108 40 116 95 178
2766 178 220 164 40 155 164 160 264 209 24 113 133 130 131 169 84 103 140 149 184 108 178 137 230 214 177 264 61 146 142 30 147 182 203 313
2367 313 214 81 55 98 81 199 128 101 213 223 82 135 128 57 152 317 187 114 14 91 130 130 214 161 75 1 78 171 123 176 366 199
1992 199 145 140 183 245 39 82 137 148 159 60 56 228 315 168 45 106 118 4 117 137 187 157 218 273 230 65 187 104 158 102 101 43
1616 43 178 244 41 83 103 74 136 131 122 116 76 35 190 29 252 139 104 91 112 205 158 52 184 125 238 230 131 142 105 194 178 14
1240 14 132 197 194 22 22 138 89 148 141 119 141 76 170 160 111 250 254 69 235 58 106 132 192 208 111 180 79 79 177 50 187 70
865 70 83 85 140 133 155 124 104 49 244 192 153 180 93 98 256 74 191 151 107 235 222 77 111 400 217 43 170 137 195 21 172
501 172 147 157 72 261 219 142 97 99 150 212 287 227 176 188 243 108 195 187 56 96 55 195 89 229 50 155 22 121 67 203 152
137 152 142 112 196 81 85 52 147 56 191 107 88 143 197 54 68 16 50 72 111 69 120 132 130 185 172 47 226 221
-192B21
##PAGE=	F1=-11034.5
##FIRST=	25164.767445380970457,	5806.2096540000038658,	0
##DATA TABLE=	(F2++(Y..Y)), PROFILE
5806 157 123 103 22 78 90 62 134 182 224 126 216 26 96 123 72 222 158 305 292 138 81 54 231 255 65 85 94 236 135 91 66
5442 66 197 243 230 213 41 44 34 91 241 188 56 37 110 205 79 38 93 117 159 26 125 284 202 122 30 217 347 359 93 117 30
5078 30 174 96 131 102 104 83 226 238 142 69 33 98 97 74 72 64 164 43 105 63 144 32 118 69 125 124 180 89 210 102 61 192 230 120
4679 120 170 155 145 206 132 117 103 163 231 265 79 76 171 236 152 55 191 167 153 184 271 186 330 320 213 150 19 163 179 84 142 41
4304 41 97 147 210 113 352 41 233 160 33 157 69 227 169 45 69 201 94 128 78 68 159 114 162 42 98 67 174 89 114 60
3952 60 54 204 290 241 245 320 153 168 193 241 329 200 171 151 109 69 117 97 10 25 209 151 106 117 46 110 129 95 176 147 277 126 45
3564 45 76 137 174 53 98 110 132 156 212 28 181 152 115 204 129 55 97 293 162 40 83 72 97 159 42 105 82 129 83 165 184 297
3189 297 53 70 67 101 15 114 60 55 53 88 237 106 10 66 22 92 140 177 224 20 110 131 223 136 48 93 157 177 89 141 133 151 96 96 76
2778 76 194 197 161 32 139 141 177 246 184 37 92 95 150 121 184 55 23 122 129 220 78 126 56 223 162 236 246 38 108 99 43 107 200 221
2379 221 275 144 91 83 109 39 203 135 93 228 190 57 168 118 115 139 260 240 163 16 84 164 127 193 146 100 22 61 95 75 153 344
2003 344 179 152 146 192 254 25 30 168 157 210 69 57 191 283 122 97 92 100 55 104 74 178 135 198 260 280 116 224 105 168 90 133
1628 133 53 108 180 12 69 78 22 64 125 73 83 61 64 157 33 247 129 35 66 79 180 140 68 175 126 215 189 100 151 136 170 144 36
1240 36 183 234 190 55 43 158 119 80 107 114 103 77 164 161 67 231 256 68 220 88 128 110 185 166 128 174 98 80 162 54 172 45
865 45 105 104 162 155 170 136 52 32 238 198 194 186 66 77 203 44 229 161 101 279 286 39 106 374 196 26 195 148 218 14 158 116
489 116 84 75 270 228 151 113 105 174 184 250 248 236 202 263 190 266 183 83 179 52 279 150 245 130 185 36 152 27 236 166 148 99
114 99 172 60 97 81 155 95 194 103 69 174 197 49 125 37 92 106 136 76 103 108 133 223 180 19 210 159
-192A59
##PAGE=	F1=-11136.8
##FIRST=	25164.767445380970457,	5806.2096540000038658,	0
##DATA TABLE=	(F2++(Y..Y)), PROFILE
5806 216 161 105 58 73 81 55 158 203 275 178 196 30 79 157 123 211 168 232 226 120 61 45 237 249 58 112 107 180 137 57 21 194 260
5419 260 231 233 44 84 65 117 253 181 83 80 154 196 87 67 174 131 170 54 127 273 177 29 58 178 313 297 85 127 27 204
5067 204 139 126 75 59 66 169 214 120 92 29 69 55 69 62 118 182 82 105 77 123 28 109 56 114 93 141 134 214 68 56 198 249 95 198
4668 198 207 183 208 74 95 109 189 163 245 113 65 188 229 81 11 190 178 194 179 284 196 311 311 201 140 36 179 191 103 152 32
4304 32 94 122 166 125 330 50 232 112 73 138 41 155 133 70 98 175 110 139 111 82 196 91 135 37 95 53 129 74 119 32 56 216
3928 216 314 233 238 325 165 148 194 240 292 172 156 189 128 71 100 114 49 25 219 167 82 120 92 146 129 91 143 142 280 100 45 39 100 189
3529 189 77 116 106 104 171 208 57 239 161 142 141 75 22 109 260 160 40 123 24 115 188 48 136 96 159 133 189 176 304 102 57
3165 57 67 94 6 120 67 47 69 110 283 133 15 61 14 104 163 153 197 65 117 159 242 122 83 62 219 199 80 161 152 184 141 87
2790 87 67 196 181 144 50 98 117 187 210 146 53 65 80 165 114 200 77 64 112 93 252 52 79 51 220 112 283 217 53 94 50
2426 50 55 107 219 233 219 96 130 121 131 83 211 151 84 234 140 61 186 120 145 130 182 274 218 27 63 178 126 146 125 110 61 26 26
2038 26 70 153 290 144 139 141 181 249 49 32 198 148 242 79 59 160 241 97 156 101 67 105 87 77 172 131 178 246 306 168 251 109
1663 109 186 82 150 120 43 120 23 61 61 43 22 98 54 61 63 84 122 40 226 122 23 19 49 154 115 71 159 145 172 135 51 157 145 113
1264 113 102 69 211 249 170 98 66 174 188 19 70 106 86 82 131 165 20 205 256 84 190 112 149 90 149 115 130 145 110 94 143 63
888 63 142 22 124 122 171 157 151 124 55 64 269 235 225 191 40 67 154 22 250 161 80 300 312 24 104 322 156 27 197 125 204
524 204 33 120 95 64 91 272 236 169 138 104 176 155 204 263 278 190 261 267 340 171 143 248 80 340 190 246 195 214 96 166 28
160 28 253 182 149 106 143 80 99 101 150 131 182 141 64 194 171 49 166 83 133 139 149 76 85 86 146 257 175 29 173 143
-192A43
##PAGE=	F1=-11239
##FIRST=	25164.767445380970457,	5806.2096540000038658,	0
##DATA TABLE=	(F2++(Y..Y)), PROFILE
5806 257 193 103 115 95 77 37 153 207 301 216 163 38 56 174 183 192 158 142 146 102 73 60 232 230 71 129 133 114 130 24 32 170 253 223
5407 223 224 74 99 88 146 244 155 102 125 205 169 93 84 239 144 157 63 118 238 141 65 78 129 254 203 74 122 38 199 152 110 87 64
5020 64 56 116 173 92 107 66 53 51 76 63 155 194 125 115 92 105 61 86 66 91 98 92 165 195 23 58 227 273 78 218 236 206 194 53 87
4609 87 145 245 117 222 151 64 205 204 34 43 181 198 234 159 270 193 254 274 177 131 43 177 182 133 161 27 90 131 132 134 297 77
4233 77 227 88 114 102 111 79 80 97 125 159 128 157 161 95 212 80 111 24 110 102 89 70 128 58 84 227 323 214 225 318 181 128 202 228
3834 228 230 140 141 213 152 78 79 116 89 33 222 181 43 92 120 171 109 94 112 134 274 82 47 20 70 201 110 136 95 71 183 193 81
3447 81 272 156 161 103 19 10 121 216 146 33 153 26 138 197 73 147 111 173 168 204 165 289 136 47 58 82 26 126 85 41 88
3083 88 118 293 152 50 28 62 111 183 113 146 140 135 180 241 101 121 90 265 205 75 161 150 193 160 93 78 179 170 118 84 38 98 179
2696 179 163 101 62 37 94 174 98 209 121 126 99 44 266 65 77 144 230 152 307 180 69 119 9 67 130 244 239 166 138 166 154 164
2320 164 153 219 172 69 218 77 86 185 110 141 111 95 276 273 58 35 161 135 77 99 109 116 40 67 108 177 216 103 113 126 158 228 77
1933 77 92 218 122 249 89 46 136 199 125 204 127 27 138 68 100 177 147 161 231 303 211 252 117 198 74 146 169 18 80 52 54 80
1557 80 100 93 54 43 65 74 85 93 51 195 116 65 51 54 134 88 63 143 167 121 81 31 150 138 41 60 84 207 236 145 140 91 186 256 37 36
1135 36 98 99 86 94 162 38 173 239 108 162 125 167 83 95 70 118 101 116 117 129 77 103 10 138 135 167 142 104 111 105 109 299 276 239 189 61
712 61 76 112 63 256 149 50 298 303 72 106 262 119 38 179 72 158 36 61 95 116 104 266 241 196 160 102 159 129 159 270 299
348 299 158 237 321 400 154 207 292 125 363 198 224 234 228 145 160 59 247 194 143 138 105 124 86 105 128 156 154 193 66 204 124 73
-27 73 184 113 157 167 150 79 72 71 165 284 170 43 125 178
-192A78
##PAGE=	F1=-11341.3
##FIRST=	25164.767445380970457,	5806.2096540000038658,	0
##DATA TABLE=	(F2++(Y..Y)), PROFILE
5806 268 206 93 152 122 76 17 123 195 299 238 129 49 64 175 244 181 133 58 66 87 100 88 216 194 92 136 151 57 114 24 73 133
5431 133 228 217 189 117 88 93 168 219 118 111 155 253 129 99 90 282 153 122 68 101 189 103 124 79 115 206 91 63 120 34 160 131 79
5043 79 110 113 53 89 124 78 114 117 41 81 91 69 164 193 160 129 104 84 107 64 103 62 135 31 175 156 28 46 274 287 59 217 238
4656 238 205 171 94 93 176 284 126 194 185 68 216 163 69 96 159 219 265 132 228 180 179 223 156 125 39 152 148 150 160 28 80 160 130 139
4257 139 260 101 215 81 134 84 172 14 36 104 151 156 146 182 203 100 203 86 94 32 139 169 101 77 136 103 106 241 317 190 207
3893 207 295 190 109 216 215 169 107 127 218 178 92 64 102 132 52 214 175 32 41 131 178 71 96 91 122 257 70 43 50 62 206 140 152
3506 152 85 47 194 173 94 277 140 167 125 45 38 132 173 130 32 166 53 150 183 108 140 124 172 179 204 159 255 152 39 45 71 42 123
3118 123 106 51 103 114 274 174 92 39 124 108 199 64 80 200 143 192 221 75 153 145 291 199 59 135 129 173 149 97 95 145 152 86 127
2731 127 39 84 150 114 62 66 17 114 178 70 200 154 164 70 25 254 110 112 215 248 240 300 140 79 160 18 81 150 274 240 140 212
2355 212 182 175 196 210 218 189 56 176 11 103 169 90 107 72 25 249 317 102 35 111 143 13 70 103 182 131 127 139 204 140 67 85 103
1968 103 134 190 99 131 221 84 230 98 28 116 158 164 231 156 51 149 75 89 187 176 145 215 276 238 221 129 192 72 124 191 46 69
1592 69 76 42 119 140 149 29 26 86 85 66 86 62 157 107 93 118 84 121 61 50 136 180 81 65 93 125 124 27 28 81 169 196 126 172 110 195 305
1158 305 75 12 86 125 86 92 148 81 144 192 127 160 131 179 102 54 49 99 53 117 132 125 92 65 12 144 136 154 113 45 119 144 153 300 296 229
736 229 175 93 98 78 103 250 128 49 278 265 112 111 212 111 53 156 41 108 14 19 99 149 105 255 241 216 169 103 139 112 135 266
360 266 294 117 194 340 436 130 258 307 163 342 169 178 238 220 172 139 85 220 199 133 192 56 173 60 93 89 162 113 239 71
8 71 205 81 113 182 126 157 181 140 85 74 63 185 298 174 49 79 211
-192B11
##PAGE=	F1=-11443.5
##FIRST=	25164.767445380970457,	5806.2096540000038658,	0
##DATA TABLE=	(F2++(Y..Y)), PROFILE
5806 245 194 74 160 135 73 16 79 169 271 248 102 63 103 166 292 181 103 57 1 78 126 109 188 139 119 137 154 67 94 41 103 98 201
5419 201 217 143 158 55 78 175 186 77 108 163 286 85 108 88 300 159 73 84 87 142 67 153 67 149 207 20 52 138 11 102 82
5055 82 36 118 161 49 89 76 89 118 164 61 105 100 80 145 178 179 130 107 58 145 62 142 50 174 40 170 107 78 39 328 285 46 187
4668 187 219 178 140 134 101 180 283 155 164 209 70 211 119 113 149 130 236 278 118 163 164 120 169 154 123 27 103 100 151 143 35 62 181 149
4269 149 141 222 117 199 67 133 124 212 63 71 87 173 160 161 207 224 97 167 103 84 70 173 233 142 78 139 137 110 259 299 167 186 257 181
3870 181 82 235 209 146 69 123 207 203 107 74 96 174 71 196 144 66 22 130 167 28 88 79 104 224 61 37 75 63 202 154 157 80
3494 80 47 206 151 93 257 117 163 162 93 59 138 137 121 52 164 65 144 149 135 123 138 161 168 187 156 206 152 35 37 71 58 103 123 60 115
3083 115 106 242 201 133 115 182 95 212 53 57 236 136 196 183 49 175 198 293 189 45 96 108 133 110 87 103 108 119 60 173 100
2719 100 66 117 73 35 71 12 130 179 35 167 163 177 22 88 214 156 138 247 256 309 264 104 97 195 24 99 158 300 231 147 262
2355 262 170 180 214 244 208 194 66 113 51 104 149 95 78 15 61 202 338 144 63 44 141 87 53 101 250 231 168 149 212 87 41 72
1980 72 80 111 141 108 138 204 43 191 105 35 92 124 184 236 178 109 150 120 41 191 207 130 196 236 246 160 144 162 89 98 190 61 83 93
1581 93 22 151 162 182 79 38 109 92 45 103 65 117 92 112 175 112 110 38 41 144 181 89 107 151 82 108 73 25 62 98 139 123 187 116 201
1170 201 327 102 15 67 150 79 119 124 116 130 113 137 181 136 187 132 60 49 79 14 111 130 119 97 40 15 140 122 135 78 31 136 165 187
771 187 268 284 194 149 104 120 52 122 229 106 100 246 209 131 116 177 125 72 147 86 88 36 91 93 142 95 240 230 216 162 103 131 104 144 248
360 248 261 83 144 322 441 103 283 296 180 283 113 111 205 191 171 117 105 184 193 130 256 13 217 36 66 51 149 64 273 75
8 75 197 89 157 175 125 130 176 115 92 87 62 203 295 177 45 59 214
-192B14
##PAGE=	F1=-11545.8
##FIRST=	25164.767445380970457,	5806.2096540000038658,	0
##DATA TABLE=	(F2++(Y..Y)), PROFILE
5806 195 157 50 138 130 63 27 61 132 224 250 88 80 140 152 318 179 73 105 45 74 146 115 152 70 157 138 150 116 76 58 118 80 190
5419 190 223 110 186 16 46 164 153 38 92 149 295 46 117 79 290 162 32 102 93 124 35 153 52 181 244 116 47 172
5090 172 27 42 26 33 109 196 52 90 36 115 117 194 100 114 95 100 106 152 178 111 98 30 160 73 166 74 198 113 163 82 122 63 373 268
4691 268 55 132 189 132 99 161 104 155 239 168 135 220 67 184 88 139 191 109 242 271 126 92 149 114 121 174 126 22 37 89 138 112
4316 112 48 45 179 161 137 190 127 183 37 124 191 232 120 124 69 185 164 171 221 219 86 110 119 82 109 200 283 168 71 128 152 98 282 273
3916 273 150 162 200 155 39 258 209 164 25 129 182 219 118 104 128 206 82 167 90 93 82 118 140 39 68 78 82 175 62 47 80
3553 80 64 194 144 145 82 60 218 135 84 223 92 154 179 125 73 137 111 120 76 148 61 120 98 145 107 158 145 144 160 157 154 141 42 43 85 77 69
3118 69 129 56 132 99 214 226 169 189 222 82 221 107 118 246 119 194 132 30 183 238 269 185 61 79 108 82 51 73 93 93 68
2754 68 64 211 139 52 117 65 29 87 13 145 181 36 114 146 173 41 154 156 189 138 237 241 339 207 84 127 210 35 121 151 308 205
2379 205 170 272 130 167 205 254 190 185 95 58 102 96 136 139 116 51 99 157 332 172 86 57 124 156 74 98 309 319 183 134 194 77 22
1992 22 70 66 87 89 101 115 176 32 141 114 46 63 115 182 225 190 158 157 171 35 182 225 119 176 193 233 82 159 111 124 89 178 78
1604 78 120 102 14 168 179 194 136 63 127 96 55 122 59 77 66 127 213 131 95 29 46 161 167 132 164 191 32 93 94 35 30 26 91 137 186 110
1182 110 203 323 118 29 48 171 69 136 90 138 136 18 136 199 141 197 158 78 47 59 26 96 108 96 84 31 18 124 94 117 44 72
806 72 140 171 201 212 242 142 119 87 133 40 115 189 95 161 210 148 130 115 147 133 90 156 111 111 112 164 77 107 76 225 207 193 144 95 134 105
383 105 168 217 199 81 102 277 416 75 273 267 166 206 46 46 143 148 144 115 118 165 177 140 310 50 251 31 36 82 127 36 288 71
8 71 181 136 196 176 117 88 150 76 97 100 62 216 274 165 31 68 184
-192A84
##PAGE=	F1=-11648.1
##FIRST=	25164.767445380970457,	5806.2096540000038658,	0
##DATA TABLE=	(F2++(Y..Y)), PROFILE
5806 137 106 28 96 111 46 32 95 88 168 247 91 97 161 139 317 163 53 131 68 73 164 107 119 10 203 143 157 156 62 85 116 83 197
5419 197 230 107 194 51 35 135 125 12 70 119 277 20 122 61 252 158 55 107 114 135 12 137 47 189 274 185 61 206
5090 206 77 28 48 79 88 209 74 78 8 147 112 196 126 106 74 126 62 122 163 80 73 8 146 72 168 108 198 177 177 109 156 87 390 237
4691 237 73 64 171 77 44 178 101 104 166 161 109 215 61 136 71 143 210 103 238 244 138 44 133 132 78 198 130 32 39 142 118 69 65
4304 65 53 152 153 127 166 127 173 4 127 257 233 165 165 102 182 159 174 219 192 72 43 120 86 135 210 306 161 78 96 146 75 307 246
3916 246 141 138 128 136 32 280 213 187 41 136 149 223 122 136 184 219 80 133 23 107 131 96 106 80 42 91 69 113 89 83 55 77 186
3529 186 113 117 91 69 228 125 76 189 68 146 172 137 82 129 98 122 91 121 40 88 37 135 98 183 128 128 127 156 111 125 62 60 104 101 35
3118 35 123 49 162 97 199 242 193 241 229 85 222 163 173 234 102 187 81 16 179 264 224 189 92 110 131 42 22 87 65 108 15 95
2743 95 232 148 75 159 93 45 116 8 159 189 85 50 107 162 107 212 106 196 109 196 206 328 140 81 159 196 77 142 132 289
2391 289 159 196 238 65 140 163 249 170 162 122 81 137 93 134 190 187 109 109 139 303 176 97 119 98 203 119 82 346 373 174 111 158 83
2003 83 9 63 63 70 49 80 102 154 52 91 140 38 50 152 167 208 191 185 176 205 110 156 220 120 155 155 200 9 167 51 168 100 171 105
1604 105 166 106 52 169 200 193 187 71 131 94 86 127 47 43 33 142 231 142 72 48 62 177 142 177 217 207 36 81 103 40 8 103 109 165 170
1193 170 93 197 293 123 40 70 188 66 130 51 148 159 91 130 191 142 216 171 78 38 43 42 70 85 56 54 17 16 100 59 107 15 96 123 167
783 167 184 153 179 84 102 47 134 54 87 131 99 212 174 94 122 107 113 124 103 169 100 166 196 226 66 81 55 210 173 157 135 84 135 112
383 112 185 176 120 112 92 222 370 59 232 233 123 146 42 80 68 100 97 134 124 175 158 151 334 82 269 31 42 152 117 70 282 55
8 55 160 175 224 186 103 69 109 30 92 105 56 217 238 132 28 78 132
-192A32
##PAGE=	F1=-11750.3
##FIRST=	25164.767445380970457,	5806.2096540000038658,	0
##DATA TABLE=	(F2++(Y..Y)), PROFILE
5806 100 80 27 72 89 27 39 133 46 117 236 106 115 162 130 288 129 47 132 76 70 182 88 109 82 248 148 181 177 52 123 102 91
5431 91 210 235 113 177 99 85 95 103 34 61 80 237 19 115 33 186 143 93 90 135 146 15 121 50 172 272 223 94 230 131 54
5067 54 88 116 69 201 108 57 16 181 100 165 127 80 47 146 35 97 140 51 33 9 106 52 145 133 170 226 213 147 179 86 370 196 80
4679 80 50 180 45 27 191 96 40 103 139 82 189 61 79 53 130 202 105 227 200 129 48 111 130 38 210 133 45 105 203 101 24
4316 24 86 88 108 126 115 149 112 175 47 144 309 221 190 192 162 167 141 170 204 152 60 27 103 89 142 196 293 123 119 42 131 52 325 223 139
3905 139 117 48 163 104 299 214 196 97 133 116 214 120 160 236 211 68 98 54 123 165 65 76 106 17 116 85 48 139 140 2 105 181
3529 181 67 78 100 71 230 118 77 171 47 141 154 134 89 122 99 122 91 94 19 73 42 108 90 206 110 135 92 154 89 107 94 79 116
3142 116 119 47 109 70 200 99 190 247 202 256 197 106 211 199 200 205 96 174 56 10 165 280 176 191 112 148 156 41 87 137 26 131
2766 131 78 128 233 128 130 205 123 75 154 10 170 207 144 13 58 150 164 251 104 176 68 158 167 290 73 81 179 152 132 153 113 243
2391 243 110 222 170 13 114 91 249 156 135 137 132 154 103 132 230 245 143 93 149 261 157 100 157 80 224 168 53 354 380 149
2038 149 110 119 86 23 50 68 84 41 52 153 157 62 69 187 35 88 211 146 196 181 181 190 210 169 110 192 133 135 127 151 58 164 14 213 109
1628 109 172 136 207 110 96 165 225 189 229 58 113 86 109 111 47 36 28 161 242 149 42 74 83 182 112 212 255 198 77 74 114 38 45 187
1229 187 171 202 147 73 180 240 119 50 125 203 72 110 31 147 190 178 123 156 134 243 171 57 29 43 43 28 116 67 34 24 8 77
853 77 29 113 30 106 95 155 133 103 108 51 105 5 128 78 47 62 110 240 137 67 117 96 85 97 105 166 73 220 260 271 76 109 36 194
454 194 134 137 148 83 120 122 181 127 59 154 114 174 312 64 170 204 63 143 89 150 36 64 47 160 123 195 143 153 315 88 265 15
78 15 80 213 133 109 256 25 139 188 238 194 85 100 77 35 78 96 39 206 204 91 59 78 72
-192G2
##PAGE=	F1=-11852.6
##FIRST=	25164.767445380970457,	5806.2096540000038658,	0
##DATA TABLE=	(F2++(Y..Y)), PROFILE
5806 96 112 41 105 82 22 55 155 38 93 215 125 133 144 122 237 87 50 114 75 61 196 64 126 140 280 149 209 177 53 159
5454 159 82 91 215 235 104 136 140 142 59 89 59 84 50 182 33 93 34 102 122 120 59 152 138 35 111 51 146 235 233 140 244 179 65 107
5055 107 131 63 175 139 51 49 215 81 109 103 45 55 149 38 83 118 42 33 7 60 16 104 139 126 254 252 167 191 54 310 148 70 108
4668 108 211 79 105 200 95 33 101 118 63 141 74 57 57 110 167 106 212 145 92 57 99 98 12 203 137 58 153 240 91 39 108 134 66
4280 66 88 113 137 79 184 82 159 341 202 192 204 210 151 106 159 183 112 55 85 68 85 127 159 246 70 171 31 127 40 332 206
3916 206 143 104 41 227 173 310 210 188 142 124 100 192 112 172 267 183 53 75 116 153 187 51 64 110 24 140 122 44 193 202 69
3553 69 138 180 26 42 102 67 223 107 96 171 29 138 145 127 96 130 105 120 77 88 47 92 108 82 77 217 92 155 57 152 85 90 131
3165 131 92 110 125 74 94 107 229 104 177 243 196 229 132 138 183 206 193 166 104 155 72 28 148 292 151 176 114 165 172 61 144 199 40
2778 40 144 152 155 219 93 187 233 133 114 194 25 173 230 202 63 36 134 204 268 138 133 75 161 151 243 31 73 182 83 183 147 122
2402 122 180 127 244 83 95 121 40 272 155 118 142 168 157 116 123 249 269 147 64 158 218 120 101 160 78 220 215 55 331 339 125
2038 125 151 90 103 41 47 76 122 49 38 235 177 54 101 242 86 147 258 123 194 166 146 182 183 197 49 153 150 123 115 101 93 151 55
1651 55 251 105 171 158 229 120 136 166 243 194 263 61 77 82 122 73 64 64 72 181 261 153 20 94 105 173 86 231 272 169 106 69 124
1264 124 32 68 237 230 243 127 57 149 174 108 56 186 214 72 95 66 141 221 233 122 105 117 272 162 27 40 72 34 39 196 149
900 149 80 76 35 66 28 130 65 110 86 133 52 75 44 66 109 46 120 98 16 6 115 238 98 77 112 83 80 62 96 137 63 226 274 291
501 291 96 147 22 172 96 154 172 96 89 131 153 73 97 194 143 144 257 73 108 187 43 167 117 204 83 57 50 184 120 203 138 145 249
114 249 65 238 18 119 249 157 133 215 30 120 170 239 192 71 135 83 78 62 75 13 185 194 86 97 76 22
-192B2
##PAGE=	F1=-11954.8
##FIRST=	25164.767445380970457,	5806.2096540000038658,	0
##DATA TABLE=	(F2++(Y..Y)), PROFILE
5806 101 157 51 151 88 42 80 160 67 106 181 146 150 112 111 171 54 52 91 73 46 198 43 149 172 288 146 228 157 81 176 63 75
5431 75 209 227 76 80 167 188 58 83 74 124 48 128 56 60 83 52 112 139 63 165 111 63 104 49 135 170 227 191 250 213 63 105 123 69
5032 69 137 157 74 93 238 57 51 70 27 98 130 44 84 105 54 99 16 61 27 57 124 101 262 276 162 188 25 222 101 48 156 245
4656 245 127 181 201 97 87 128 114 91 76 93 102 109 107 117 108 197 88 38 67 121 52 42 179 138 76 177 243 89 83 134 185 77 48 128
4257 128 121 44 188 100 157 348 185 169 205 232 142 64 138 166 86 55 134 50 71 96 109 176 53 209 103 146 46 323 191 152 103
3893 103 116 292 216 309 201 168 165 113 118 163 100 172 266 146 48 79 163 189 203 92 70 95 55 156 160 95 235 255 142 160 178 39
3517 39 38 92 62 208 89 132 185 13 137 153 125 102 159 108 119 57 110 88 117 166 90 70 212 77 170 40 151 83 78 164 93 84 116
3130 116 80 78 141 237 109 155 234 174 166 50 173 135 185 162 124 118 130 95 51 135 306 159 138 102 154 173 92 186 258 90 148 218 177
2743 177 203 64 230 240 118 151 230 37 164 247 249 93 65 112 226 266 168 95 131 191 164 204 62 56 167 2 217 120 166 135
2391 135 208 260 11 169 165 126 313 166 118 150 189 150 123 104 244 252 122 58 146 176 79 102 128 83 198 255 119 286 258 118 203
2027 203 76 138 54 61 89 163 46 61 307 195 30 147 289 153 199 275 98 199 151 89 151 131 190 38 130 163 125 122 80 99
1675 99 132 78 276 92 155 162 230 135 166 176 251 209 289 111 35 101 136 22 82 95 118 196 288 155 35 105 127 150 75 228 264 125
1299 125 126 75 117 25 70 239 267 279 122 53 109 124 100 56 236 217 54 92 103 136 248 249 125 83 101 294 154 15 71 116 36
935 36 117 286 238 140 135 81 73 38 145 105 117 112 117 44 78 10 84 95 70 117 105 32 61 114 208 52 98 97 70 91 31 81 104 106 153 221 283
501 283 109 161 14 145 69 183 186 114 47 135 109 40 162 226 168 124 218 68 69 181 96 173 128 236 117 71 91 204 123 193 143
137 143 141 145 19 194 57 148 253 169 140 171 86 102 123 226 176 67 147 111 110 73 45 25 166 207 126 126 79 15
-192A5
##PAGE=	F1=-12057.1
##FIRST=	25164.767445380970457,	5806.2096540000038658,	0
##DATA TABLE=	(F2++(Y..Y)), PROFILE
5806 101 185 50 177 92 67 105 152 88 130 136 162 164 74 94 96 60 48 78 69 37 181 45 166 174 269 141 231 121 127 168 52 41 198
5419 198 214 36 22 178 215 86 79 74 166 70 91 86 43 134 108 132 149 110 176 75 100 100 66 146 93 218 235 251 224 54 93 96 76 99
5020 99 160 104 140 239 38 60 67 51 140 91 49 97 107 92 171 45 108 68 43 91 128 251 277 137 171 84 126 64 40 178 270 168 243
4632 243 193 100 130 136 139 151 19 111 150 173 122 78 122 180 44 72 108 167 57 69 143 138 98 175 213 91 121 161 236 126 14 145 93
4245 93 86 178 100 135 330 175 127 202 229 142 50 108 154 76 59 176 94 49 59 80 108 86 215 160 173 66 295 171 161 113 178 335
3870 335 222 289 185 140 159 104 151 135 86 160 233 119 62 105 190 216 217 154 80 81 95 165 183 128 251 281 199 164 170 68 64 71 61 187
3470 187 69 174 201 21 144 167 127 105 199 102 123 48 140 123 123 205 133 90 193 72 172 69 150 75 76 186 80 41 98 55 65
3107 65 168 220 112 124 224 137 85 64 209 70 148 131 84 127 104 109 73 131 320 172 81 86 120 160 141 212 305 134 145 272 197 195
2731 195 66 249 232 84 181 260 42 147 252 273 102 89 96 235 255 187 107 182 211 185 178 104 41 142 81 229 78 223 153 286
2379 286 266 71 225 218 221 353 187 127 168 209 139 121 84 215 199 83 92 108 126 61 97 72 78 169 284 194 236 155 120 241 68 173
2003 173 61 68 113 195 30 93 352 201 19 179 314 207 228 254 75 201 144 25 108 66 156 109 144 165 135 130 103 84 111 76
1651 76 281 83 122 145 214 149 179 187 253 229 306 169 36 136 167 39 91 117 154 199 305 156 53 104 144 115 76 204 232 75
1299 75 151 106 86 44 45 191 279 301 132 63 70 139 107 50 265 205 14 89 123 140 265 227 130 116 96 303 151 39 108 160 70 204
923 204 364 309 187 187 131 96 38 152 144 125 146 146 138 112 35 81 57 67 114 102 40 94 111 159 3 114 78 54 103 34 65 135 205 9
524 9 114 247 107 144 24 113 63 193 175 121 12 130 79 88 210 246 188 104 196 46 56 181 144 147 134 244 126 87 120 218 140
160 140 172 150 160 26 46 140 93 160 231 160 136 146 146 82 54 200 147 64 129 129 126 110 14 59 157 217 163 137 84 30
-192C0
##PAGE=	F1=-12159.3
##FIRST=	25164.767445380970457,	5806.2096540000038658,	0
##DATA TABLE=	(F2++(Y..Y)), PROFILE
5806 104 187 40 175 87 92 124 139 92 146 87 167 170 50 79 23 91 38 87 59 55 145 79 174 147 227 135 220 75 179 142 47 27 193
5419 193 201 2 41 172 217 110 76 59 202 96 84 115 76 173 159 165 150 156 176 52 137 116 111 166 30 218 263 248 208 42 83 59
5043 59 79 79 147 125 183 210 53 110 98 74 165 46 70 116 131 153 232 77 152 101 74 46 176 219 253 102 141 145 52 42 60 174 280
4656 280 197 284 176 104 158 124 183 206 61 124 180 221 136 83 149 156 55 145 163 207 110 82 105 134 118 157 159 94 150 187 280 171 20
4269 20 145 47 162 152 87 94 290 176 77 201 218 146 81 72 141 74 66 213 149 31 25 105 86 101 183 188 189 90 254 138 165 128 221 349
3870 349 190 250 162 105 130 94 177 117 71 138 173 113 93 140 198 224 226 212 85 95 137 173 186 138 236 273 224 148 154 89 88 42 71 169 60
3459 60 210 210 38 161 178 127 102 239 93 129 53 156 145 103 224 179 134 169 74 161 105 145 62 76 186 57 10 88 5 66 196
3095 196 184 112 89 214 90 59 145 244 3 131 132 63 121 82 122 97 137 329 170 50 77 86 133 202 229 339 166 140 310 220 201
2731 201 91 242 214 67 203 284 36 128 241 273 97 96 111 239 244 196 154 210 202 189 166 136 38 116 159 220 62 272 212 328 265
2367 265 105 257 256 292 373 211 135 191 236 130 121 76 168 124 61 133 59 63 86 84 11 60 145 297 258 198 52 112 253 67 192 67
1992 67 64 144 214 10 118 365 199 50 184 312 232 224 200 54 190 146 29 70 12 113 167 171 156 142 124 134 62 85 54 258 81
1628 81 86 113 191 155 177 191 252 243 312 210 60 167 210 87 90 125 174 192 293 151 61 93 155 80 72 164 191 57 195 158 49 89 3
1240 3 106 271 303 141 81 55 187 127 39 268 174 43 78 116 157 270 180 130 153 99 295 157 64 145 194 119 284 416 347 213
888 213 218 171 129 38 146 175 124 168 219 211 156 47 59 10 45 105 98 28 100 116 111 39 124 88 37 117 55 59 211 321 149 22 192 90
489 90 105 51 89 79 173 135 117 46 111 105 155 236 248 201 77 181 35 43 182 174 94 146 235 118 100 127 222 166 149 155 195 106 111 88 114 153
67 153 199 133 128 151 198 59 28 158 108 45 86 132 130 150 14 86 152 200 177 125 81 33
-192C3
##PAGE=	F1=-12261.6
##FIRST=	25164.767445380970457,	5806.2096540000038658,	0
##DATA TABLE=	(F2++(Y..Y)), PROFILE
5806 114 167 22 148 75 114 133 129 78 144 41 155 166 61 79 64 124 25 110 40 85 111 128 177 99 171 129 196 37 222 125 42 75
5431 75 202 196 26 79 153 199 117 81 32 227 120 93 137 121 188 169 185 138 180 158 62 166 154 171 180 59 223 267 242 167 29 82
5055 82 23 77 94 121 132 213 154 90 150 131 85 163 60 110 132 169 220 270 100 180 124 103 2 208 167 209 73 103 181 57 27 81
4679 81 149 275 211 301 158 106 172 112 229 232 93 127 187 237 133 112 176 120 96 197 202 225 151 80 83 122 129 137 96 98 168 203 310 196
4280 196 55 119 17 233 114 76 44 235 184 32 206 214 145 109 33 124 72 76 238 185 50 27 147 109 81 118 183 183 111 209 93
3916 93 157 140 245 337 135 197 138 68 103 81 187 113 57 106 101 116 131 173 190 210 226 253 82 127 170 185 165 126 193 237 214 119 132 102
3517 102 103 27 89 158 61 228 205 52 186 183 127 95 269 94 129 61 155 155 56 225 213 187 152 76 142 126 135 52 71 161 41 56 100
3130 100 73 93 231 151 108 55 204 40 126 205 269 72 160 160 79 96 65 140 132 149 325 155 101 74 88 96 262 244 359 187 135 332
2754 332 241 217 124 222 186 109 221 299 21 114 224 252 85 88 153 242 236 201 190 213 166 168 162 152 42 98 224 198 99 299 267 321 258
2367 258 102 261 268 329 363 231 134 206 265 126 131 88 114 79 78 164 63 26 122 68 61 34 128 292 299 178 45 81 232 81 187 77
1992 77 73 170 216 23 132 352 199 76 159 282 218 185 127 32 158 151 61 52 53 84 193 184 138 140 94 153 59 52 24 210 79 67 73 170
1592 170 154 162 183 247 238 304 220 68 179 249 121 85 117 174 184 245 133 60 75 158 79 57 135 169 106 251 212 83 145 61 34 259
1217 259 282 137 99 77 220 146 27 244 128 100 70 82 186 262 123 127 167 95 269 170 97 173 209 168 340 430 347 213 219 188 164
853 164 52 128 191 107 174 301 248 198 55 30 65 31 88 110 12 81 131 103 64 131 133 34 134 67 66 266 390 237 97 130 65 56 81
466 81 94 103 127 73 112 81 78 147 213 236 228 207 52 157 72 44 180 187 35 163 213 105 114 110 211 195 126 157 224 202 169 46 114 129 176
55 176 96 122 173 230 31 103 104 65 10 30 122 126 179 38 100 136 148 163 92 64 31
-192C1
##PAGE=	F1=-12363.9
##FIRST=	25164.767445380970457,	5806.2096540000038658,	0
##DATA TABLE=	(F2++(Y..Y)), PROFILE
5806 119 131 3 103 71 132 130 125 54 123 7 126 147 90 98 128 149 17 139 18 110 123 183 175 43 113 128 166 54 247 140 45
5442 45 120 218 198 31 94 128 170 108 106 7 239 139 96 146 157 175 132 178 110 177 118 92 177 199 233 179 104 221 248 234 109 30 84
5055 84 5 76 128 87 125 228 115 133 178 158 97 135 116 159 144 209 271 274 112 194 138 118 45 216 98 157 57 64 184 90 34 90 116
4668 116 256 215 298 147 109 178 117 263 221 92 116 174 216 110 135 192 72 137 212 206 217 168 66 88 100 129 131 48 104 174 203 318
4292 318 197 96 67 91 282 70 79 8 176 198 14 216 217 138 118 11 100 67 86 243 193 87 67 180 135 28 48 158 157 123
3940 123 176 51 137 136 247 303 85 147 120 47 117 75 176 115 55 69 57 111 168 198 170 178 216 269 73 151 184 198 125 112 142 200 174
3553 174 91 112 103 103 47 111 157 60 221 179 58 211 185 130 85 283 107 118 66 139 155 15 218 226 234 149 73 124 122 117 59 60 113 49 88
3142 88 125 155 136 266 142 101 30 193 7 183 235 279 122 205 185 112 52 50 157 176 155 306 143 152 70 118 62 307 260 368 205
2778 205 138 339 258 234 156 209 150 168 241 305 2 115 217 227 74 80 200 239 229 203 201 197 112 122 159 150 47 86 270 177 139 298
2402 298 299 268 249 65 240 253 330 324 245 120 201 286 126 148 104 90 127 100 177 120 90 148 57 110 16 111 268 312 166 102 33 182
2027 182 100 160 94 109 181 198 37 137 318 203 86 110 231 167 119 62 21 108 153 69 57 92 78 181 172 117 130 47 159 84 33
1663 33 44 143 73 69 32 152 149 140 164 234 211 283 197 79 165 270 139 85 95 155 182 166 98 54 57 152 116 57 162 190 165 303 251 144
1264 144 196 115 113 258 243 118 111 112 222 154 19 202 85 140 78 38 216 242 75 125 152 76 230 189 136 186 204 205 358 407 313 191
888 191 193 174 191 69 103 184 75 170 364 246 235 67 43 123 62 64 139 48 43 149 139 60 147 178 58 150 70 84 265 353 184 99
513 99 75 52 19 109 123 129 66 26 122 106 45 168 248 210 188 203 40 115 117 87 176 193 61 181 187 95 134 84 185 220 105 159 230 257
114 257 208 21 95 93 165 61 115 189 235 13 165 55 32 58 29 108 118 192 56 100 106 82 130 48 35 27
-192B7
##PAGE=	F1=-12466.1
##FIRST=	25164.767445380970457,	5806.2096540000038658,	0
##DATA TABLE=	(F2++(Y..Y)), PROFILE
5806 109 90 14 54 82 144 118 129 34 89 13 95 115 118 118 170 159 29 167 29 119 174 234 167 16 70 137 134 92 244 164 67 145 227 196
5407 196 21 85 106 143 86 144 32 236 148 85 139 178 136 58 142 69 152 64 126 166 235 288 164 135 198 217 231 48 48 82 22 87 163
5020 163 49 105 227 172 176 201 181 122 91 166 209 153 236 289 240 114 196 141 118 79 204 28 112 48 31 156 119 71 86 95 229 216
4644 216 281 151 119 178 126 275 174 70 89 143 163 74 149 194 45 172 191 178 194 162 44 107 68 119 143 48 113 167 183 296 173
4280 173 139 29 163 297 40 89 52 122 213 13 229 212 127 109 45 69 60 90 223 170 122 114 205 163 53 85 146 118 128 169 68
3916 68 116 114 224 255 75 124 114 60 162 81 150 110 74 47 88 90 195 209 140 139 198 256 58 153 173 204 75 121 109 199 126 80 107 91
3517 91 87 72 130 166 47 191 134 56 225 181 137 78 274 118 93 70 120 149 78 210 218 265 159 79 117 90 96 87 49 54 63 100 147 225 181
3107 181 291 152 87 30 180 42 211 233 270 147 233 186 142 13 34 164 218 148 276 142 174 65 137 48 328 272 368 224
2778 224 162 331 265 241 183 215 104 215 263 302 18 130 236 215 62 87 234 224 223 200 185 176 63 59 149 132 65 74 292 174 156
2414 156 266 303 184 239 10 199 215 296 266 255 93 174 289 125 156 107 125 197 107 172 171 142 157 56 138 27 86 232 300 152
2062 152 125 63 113 110 115 116 152 170 165 39 136 273 202 79 54 168 91 44 51 66 54 149 66 79 120 77 134 138 101 116 24 158 117 76 89
1651 89 84 76 80 33 134 141 118 138 212 165 248 150 128 131 265 144 91 64 124 185 90 58 46 48 135 151 103 234 227 204 331 262 188 230 147 188
1229 188 270 195 94 118 143 195 143 15 153 82 150 95 62 237 214 52 126 116 44 185 208 171 182 181 221 330 351 255 153 158 128 201
853 201 76 85 155 33 164 394 212 265 82 81 164 96 45 172 91 12 162 182 23 180 203 84 155 72 107 209 197 24 14 29
501 29 75 51 130 154 148 23 83 141 122 64 156 254 161 141 189 45 63 153 143 170 199 116 195 164 95 156 90 158 238 98 166 206 266 222 5
90 5 63 53 150 34 101 186 209 45 202 66 49 120 70 94 110 195 70 87 84 91 93 23 13 25
-192B5
##PAGE=	F1=-12568.4
##FIRST=	25164.767445380970457,	5806.2096540000038658,	0
##DATA TABLE=	(F2++(Y..Y)), PROFILE
5806 83 52 21 12 97 149 100 136 38 54 19 93 71 140 125 181 151 50 185 60 108 214 272 149 58 65 157 109 119 211 167 98 146 220 180
5407 180 25 60 97 134 61 184 60 223 140 60 120 182 80 46 93 26 115 34 157 136 253 329 140 151 147 193 235 20 64 78 32
5043 32 110 192 13 80 215 275 215 224 198 155 62 201 248 159 242 269 178 114 192 131 111 104 189 69 92 34 20 106 155 114 73 100 200 218
4644 218 258 165 139 175 123 260 106 76 48 100 96 37 159 187 98 197 160 154 175 142 19 123 29 101 170 69 126 149 142 242 134 174
4269 174 83 219 280 76 98 88 85 223 7 240 189 113 96 82 28 57 84 176 123 144 157 226 199 126 153 169 74 127 182 119 105 76 173
3881 173 193 79 133 126 75 200 90 117 94 102 77 123 55 203 201 101 105 179 217 38 139 143 199 40 155 113 234 101 86 123 63 54
3506 54 92 142 183 25 149 79 48 222 169 144 81 241 113 58 70 110 139 129 200 192 273 177 112 127 43 86 124 47 4 65 94 160 269
3118 269 217 299 162 66 48 164 62 210 204 243 148 231 161 160 72 18 153 246 125 243 142 162 61 130 55 321 269 354 244 209
2766 209 315 262 229 197 231 58 241 281 292 35 150 273 219 47 108 249 191 227 190 148 162 58 21 132 107 101 66 287 196 144
2414 144 210 282 98 227 51 148 167 236 209 263 55 131 272 117 145 90 179 251 102 151 201 168 147 60 144 43 52 195 271 130
2062 130 118 137 42 112 62 136 179 138 126 37 135 226 188 59 39 107 40 36 73 126 37 142 79 104 138 68 72 91 90 101 68 160 145 136 132 80
1639 80 103 102 77 119 133 99 113 189 109 205 100 199 103 234 143 99 42 89 186 95 68 38 48 110 162 167 309 245 205 323 245 200 235 148
1240 148 228 282 148 91 120 160 152 113 16 109 108 126 110 118 243 183 47 124 73 28 144 223 189 160 149 208 262 272 190 110 145 61 192 70
841 70 87 116 30 160 387 155 287 87 114 185 120 53 193 125 51 167 214 42 233 204 98 149 85 128 154 76 286 116 14
501 14 109 96 141 179 154 52 137 154 129 115 114 231 95 117 167 48 30 174 195 164 208 155 202 148 101 176 138 157 250 110 175 155 236
114 236 208 12 25 22 119 15 79 162 153 80 208 109 78 169 92 80 102 196 81 65 110 169 77 56 39 33
-192C3
##PAGE=	F1=-12670.6
##FIRST=	25164.767445380970457,	5806.2096540000038658,	0
##DATA TABLE=	(F2++(Y..Y)), PROFILE
5806 55 26 14 17 105 144 80 143 49 44 19 122 23 151 114 161 122 72 192 91 87 217 287 121 89 89 180 95 131 153 138 122 130 195 144 52
5395 52 47 103 148 45 216 82 203 117 19 100 173 38 137 69 26 80 70 178 106 253 354 113 151 75 188 241 45 70 73 41 135
5032 135 213 21 66 198 368 245 245 203 177 79 216 265 157 225 216 104 115 185 106 104 121 188 135 95 12 32 58 196 150 59 119 172
4656 172 221 238 180 168 169 102 223 39 117 23 55 57 12 170 186 165 210 166 188 170 125 14 129 26 77 207 86 141 123 90 161 95
4280 95 191 136 248 242 144 105 116 78 221 47 247 148 99 96 120 36 71 67 111 63 150 186 244 236 176 190 203 37 121 202 162 101 52 100 123
3870 123 61 152 153 74 215 88 88 63 123 122 129 20 189 175 57 88 168 161 9 131 111 183 62 196 135 272 116 94 154 46 12
3506 12 112 145 202 18 116 63 41 199 142 148 95 189 89 36 64 110 127 152 182 155 256 198 160 143 49 100 157 57 39 54 73 167 277
3118 277 236 294 162 41 72 144 65 189 158 205 140 202 110 161 125 10 135 256 88 216 123 122 58 100 61 289 244 324 259 264 294
2754 294 250 196 203 237 22 245 289 277 42 168 310 228 44 132 242 142 243 176 100 156 85 72 111 92 145 84 260 232 120 143
2402 143 241 57 209 99 98 123 159 173 266 30 83 238 98 110 54 222 280 94 115 213 168 120 65 137 64 48 170 240 106 92
2050 92 198 55 118 6 146 183 96 99 59 139 193 157 38 67 64 96 80 81 183 64 139 110 113 135 47 24 42 76 78 98 165 162 189 168 115
1639 115 137 127 107 122 123 86 97 178 57 163 86 264 119 188 138 104 52 71 177 152 117 35 49 85 143 223 359 223 160 273 206
1276 206 182 210 116 233 282 113 114 122 159 108 70 19 76 124 85 121 157 231 154 40 112 47 52 114 225 182 124 116 172 169 184 135 79 170 18
865 18 163 61 106 101 75 157 348 91 300 80 135 186 131 78 195 147 87 168 228 125 294 184 95 141 99 135 179 232 440 187
513 187 30 128 131 147 197 143 82 167 150 129 159 60 189 25 135 140 43 55 184 230 154 218 172 198 140 105 185 187 193 259 122 176 96 183
114 183 168 35 10 38 73 4 48 119 73 108 185 136 89 191 99 62 99 204 88 40 159 234 88 83 61 46
-192D6
##PAGE=	F1=-12772.9
##FIRST=	25164.767445380970457,	5806.2096540000038658,	0
##DATA TABLE=	(F2++(Y..Y)), PROFILE
5806 44 21 13 30 103 129 60 147 51 68 38 147 36 148 88 116 80 94 185 117 82 177 273 88 105 114 198 88 129 85 97 127 112 156 96
5407 96 78 79 124 179 48 232 92 178 84 31 95 155 74 206 94 48 62 94 182 107 236 360 94 137 51 191 244 50 66 73 55
5043 55 151 223 51 78 180 427 262 261 192 172 97 212 252 136 189 144 49 112 175 70 103 131 203 184 103 15 46 45 232 171 50 132
4668 132 150 224 227 188 195 157 71 173 15 146 64 42 87 8 184 201 217 212 214 254 167 121 33 124 74 51 248 102 155 95 53 82 89 188
4269 188 165 249 210 217 120 138 100 205 100 249 100 85 108 159 96 95 48 53 7 137 191 253 257 189 188 219 20 105 216 185 82 79 35 51
3870 51 54 171 190 55 201 70 70 24 125 155 104 28 158 141 36 84 171 99 25 149 111 161 100 232 158 293 141 94 185 80
3517 80 46 136 139 217 44 108 111 42 162 100 148 119 140 52 60 49 119 110 138 153 114 224 223 205 156 106 132 181 82 51 41 49 172 250 228 282
3095 282 160 42 98 121 57 170 108 166 145 171 44 146 159 17 139 256 50 198 79 65 52 55 63 242 197 275 268 308 271 229
2743 229 149 209 225 9 233 280 260 39 178 331 224 63 152 216 83 267 165 52 150 104 108 97 99 185 126 227 265 132 90
2402 90 188 79 183 121 65 102 76 167 255 61 58 192 68 58 29 244 282 93 69 217 156 85 72 129 99 92 162 213 85 70 229
2038 229 112 141 43 143 168 56 96 99 148 189 117 32 76 55 151 94 82 223 78 143 135 95 102 31 18 7 50 39 103 170 165 227 196 141
1639 141 159 126 96 146 112 77 99 183 38 137 118 300 159 139 133 99 72 84 157 191 154 51 47 68 97 256 368 156 74 188 161 147
1264 147 164 61 213 264 95 140 127 139 73 28 23 58 117 73 141 166 203 127 30 89 47 69 100 209 148 79 85 124 75 105 103 85 204 77
865 77 120 77 126 130 113 151 289 32 303 59 146 172 135 101 179 157 114 170 222 208 347 154 87 131 97 113 204 235 286 84 18 117 149
477 149 155 206 116 107 169 131 122 187 46 153 34 161 118 35 73 186 244 137 219 172 185 129 94 180 216 242 269 108 169 86 133 110 57
90 57 40 71 31 7 12 73 28 128 137 140 78 187 106 35 102 221 91 16 198 265 107 93 65 53
-192E3
##PAGE=	F1=-12875.2
##FIRST=	25164.767445380970457,	5806.2096540000038658,	0
##DATA TABLE=	(F2++(Y..Y)), PROFILE
5806 46 25 50 36 92 111 36 145 46 94 77 151 84 127 54 62 40 110 168 137 114 104 231 56 110 131 205 87 118 49 98 107 105 113 50 99
5395 99 126 153 214 61 228 83 151 57 88 110 137 122 240 119 51 64 93 165 139 205 348 84 118 133 182 236 31 58 77 74 153 224
5020 224 85 103 165 443 265 270 166 132 86 191 204 90 140 76 52 101 161 61 111 132 216 213 103 39 60 59 253 178 46 132 133 228
4644 228 227 185 209 134 43 116 30 139 103 84 120 27 197 226 239 203 256 303 147 122 50 115 121 28 284 119 168 68 75 107 119 166 170 228
4245 228 206 278 144 159 131 175 154 247 55 76 123 196 154 114 49 79 42 105 170 248 248 160 150 208 36 74 220 185 37 120 90 28 113
3858 113 195 226 36 163 39 61 19 99 161 55 52 121 114 68 79 185 39 67 177 146 146 128 259 176 292 157 88 208 126 89 164
3494 164 132 225 73 118 163 51 125 43 146 149 135 11 91 39 135 88 93 116 77 190 247 230 162 152 168 191 127 42 41 37 179 199 192 265
3095 265 165 84 125 97 50 175 70 140 161 167 27 118 168 41 181 257 65 184 15 11 48 27 72 187 141 213 271 328 245 200 111
2731 111 223 201 2 211 253 242 28 180 325 198 92 167 176 41 284 168 32 135 109 121 96 119 211 173 208 279 203 96
2402 96 132 95 147 115 55 105 4 172 221 92 72 146 29 40 70 242 260 104 29 219 146 54 79 129 145 139 161 185 70 74 224 148
2027 148 174 81 124 145 35 116 140 153 207 78 35 57 65 181 80 93 239 74 147 144 49 40 96 51 47 21 15 85 169 158 245 214 148 155 72
1616 72 56 178 105 75 118 196 66 134 148 296 187 104 126 78 82 108 128 199 162 75 49 61 39 258 332 54 74 81 123 113 128 8 182
1229 182 232 92 153 137 113 52 39 23 54 92 110 174 144 171 100 42 59 42 65 103 175 99 34 51 86 44 63 93 126 222 111 73 115 136
829 136 169 134 138 224 40 298 33 152 151 136 113 158 159 135 177 202 272 380 126 110 104 76 60 169 424 520 303 96 80 160 177 200
454 200 89 146 147 105 116 196 73 149 72 163 112 33 67 184 239 116 204 162 176 109 65 157 215 278 278 60 167 136 121 59 75 62 102
67 102 36 8 34 77 130 139 76 123 48 172 129 21 107 238 87 3 215 264 123 89 51 44
-192D4
##PAGE=	F1=-12977.4
##FIRST=	25164.767445380970457,	5806.2096540000038658,	0
##DATA TABLE=	(F2++(Y..Y)), PROFILE
5806 42 33 96 48 76 102 13 137 39 113 122 129 127 89 37 19 34 118 143 151 156 48 168 36 106 136 200 95 109 83 141 65 103 72 43 118 164
5384 164 181 236 73 205 49 129 63 144 133 123 153 236 120 36 75 91 133 169 165 319 81 122 210 152 218 21 54 85 93 143 222 126
5008 126 128 152 420 256 273 145 68 51 156 126 26 90 28 68 92 141 106 121 123 216 226 94 56 78 60 254 178 49 118 119 237 235
4632 235 177 208 102 25 57 30 93 131 133 133 64 205 246 223 185 263 307 104 112 61 111 159 24 307 132 182 43 115 196 158 135 160 201
4245 201 224 311 167 179 162 139 202 244 38 76 133 222 192 113 75 141 74 60 127 227 210 98 95 181 61 43 215 164 44 153 156 78
3870 78 189 227 251 55 107 20 52 54 46 135 6 64 91 108 106 64 203 20 110 190 188 144 146 270 181 275 164 78 217 154 113 185 131 224
3470 224 105 126 195 61 109 27 140 179 181 27 108 52 158 63 51 80 60 171 264 224 163 176 203 190 185 55 45 55 193 153 134 240
3095 240 175 130 145 75 61 205 58 133 169 192 91 80 154 79 238 268 114 168 59 49 68 58 87 133 106 146 270 318 211 163 106
2731 106 240 173 18 189 213 221 18 174 291 146 117 178 132 80 286 187 67 110 103 120 112 137 219 212 214 267 293 138 82 97 106 87 50
2344 50 115 70 166 162 103 95 111 17 95 111 220 219 124 68 215 140 36 88 139 194 176 152 147 67 88 192 159 199 97 93 126 41 153 167 146
1933 146 228 54 38 18 69 186 60 116 233 59 142 136 42 80 217 158 98 71 71 55 157 145 241 223 147 122 55 176 212 106 73
1569 73 140 203 95 140 156 250 187 90 117 38 82 128 92 183 137 93 58 60 37 233 256 77 198 29 96 92 138 55 154 195 99 154 150 104
1170 104 49 73 15 61 63 141 215 97 147 72 72 36 28 43 116 125 76 14 26 79 86 81 94 178 217 110 52 153 131 193 132 119 167 90 288 21
747 21 165 129 143 113 153 163 155 190 181 302 384 133 172 52 106 88 280 1259 1779 989 274 114 200 224 176 96 204 114 86 122 197
383 197 86 171 81 135 126 41 50 182 221 94 167 154 195 85 30 117 184 287 281 16 196 182 149 80 87 73 127 60 4 81 140 231 146 25
-16 25 96 36 170 165 71 108 244 77 16 212 238 138 83 23 21
-192B1
##PAGE=	F1=-13079.7
##FIRST=	25164.767445380970457,	5806.2096540000038658,	0
##DATA TABLE=	(F2++(Y..Y)), PROFILE
5806 49 50 144 73 62 117 34 123 39 125 161 94 162 41 60 21 53 121 115 161 184 109 98 34 93 129 183 107 109 117 172 10 93 38 68 132 185
5384 185 200 236 80 168 13 132 92 192 154 114 164 204 98 11 91 132 104 181 121 278 84 155 259 108 191 65 57 90 109 129
5032 129 220 169 149 141 366 240 274 157 65 56 114 56 64 46 15 75 100 117 160 128 103 201 227 78 66 102 44 240 183 56 95 105 249
4644 249 247 171 196 67 23 13 54 22 152 178 126 107 205 246 170 153 227 265 57 86 67 115 183 39 311 137 196 25 141 271 200
4280 200 106 148 181 240 305 178 196 184 105 237 243 73 87 140 228 198 87 98 194 93 25 71 194 152 24 61 159 86 77 202 129 126
3905 126 179 197 115 250 259 257 93 49 52 51 76 34 76 66 71 78 113 132 40 220 80 147 174 225 155 152 260 164 248 161 69 208 154 115 188
3494 188 135 215 143 125 200 67 121 98 128 202 237 57 105 76 186 42 82 52 71 172 271 188 164 177 230 184 244 104 41 84 210
3130 210 157 63 200 180 164 155 58 84 237 58 144 154 214 138 41 130 119 279 280 155 146 122 88 111 97 101 89 113 87 268 282 171 120
2743 120 125 249 150 50 170 168 194 31 159 233 75 130 182 94 138 269 210 103 82 92 125 139 147 208 233 232 233 370 176 46 99 68
2367 68 66 41 121 117 144 90 90 109 97 58 142 126 184 169 143 127 197 128 27 102 155 232 200 135 97 82 85 158 150 205 90 66 112 61 199 172
1945 172 128 240 54 52 33 61 170 70 136 210 47 121 115 107 191 373 319 160 148 115 28 135 137 221 223 145 71 235 395 257 109
1581 109 62 155 196 112 134 134 173 159 86 107 13 81 142 56 153 85 97 73 62 73 192 155 200 309 116 73 83 175 89 136 158 107 152 163
1182 163 119 57 96 15 67 50 146 254 41 142 54 101 28 66 41 133 70 112 38 53 91 108 106 96 226 198 75 78 178 113 194 109 99
794 99 129 133 276 32 192 112 160 105 172 178 173 207 177 292 357 200 243 99 212 231 631 2502 3516 1915 525 243 289 296 145
454 145 146 268 91 84 138 204 79 191 69 90 151 50 57 186 206 80 114 155 240 81 58 64 135 268 272 103 252 199 183 135 91 69
78 69 144 84 8 131 210 315 147 51 73 84 197 204 139 106 233 66 23 197 206 155 86 31 19
-192A9
##PAGE=	F1=-13181.9
##FIRST=	25164.767445380970457,	5806.2096540000038658,	0
##DATA TABLE=	(F2++(Y..Y)), PROFILE
5806 90 74 182 108 57 143 62 102 49 136 183 69 190 48 90 29 65 131 103 171 187 172 46 41 72 107 155 118 115 130 169 46 71 37
5419 37 90 139 183 205 211 81 128 94 172 118 227 166 104 157 161 64 13 110 206 112 172 80 230 90 191 276 76 165 113 62 87 118 120 224
5020 224 203 166 129 293 226 284 200 139 113 80 110 138 14 26 92 126 91 202 128 81 184 223 60 67 131 17 217 198 63 68 89 252
4644 252 257 176 184 48 37 78 95 68 176 214 109 144 192 223 98 107 159 194 79 56 68 119 191 53 297 135 209 32 148 316 245
4280 245 90 145 171 241 262 173 208 192 79 259 247 123 105 142 206 166 38 108 228 106 58 20 157 94 45 76 156 105 144 184 90
3916 90 201 206 206 134 283 279 245 128 41 87 76 80 113 21 114 83 72 108 141 30 233 143 173 137 257 174 149 224 126 214 149 66 184 124
3517 124 103 167 134 201 185 116 180 66 133 164 113 210 282 82 82 99 215 41 130 29 96 182 267 128 166 163 242 182 289 155 27
3154 27 110 220 202 17 147 172 176 147 57 108 250 46 166 114 208 159 27 110 148 289 284 172 120 160 112 159 129 106 55 131 47 261
2778 261 230 135 74 141 244 135 82 159 127 160 55 139 159 15 125 179 72 185 235 224 122 59 77 144 166 153 183 237 246 188 414
2414 414 200 33 106 44 87 48 116 138 111 71 62 112 95 93 163 105 140 119 153 176 162 106 18 122 178 253 213 110 42 114 58 157 143 190
2015 190 63 72 95 89 244 153 103 239 74 81 77 45 144 103 144 181 45 90 88 159 294 542 504 227 227 131 32 107 143 189 215 148 61 445
1616 445 643 321 100 32 156 170 114 103 87 82 109 83 96 66 90 148 38 119 23 81 87 69 81 156 76 302 378 168 57 82 198
1252 198 103 129 125 111 157 167 142 57 107 42 74 55 132 288 13 154 67 118 22 136 78 146 50 156 53 95 96 104 116 99 259 184 35
865 35 112 181 90 177 71 91 118 162 259 47 231 101 194 97 198 205 183 222 190 247 309 298 300 236 340 396 1072 3914 5425 2922
513 2922 810 397 401 381 143 206 322 101 101 150 221 76 198 55 85 175 56 86 194 205 74 71 163 290 114 107 25 85 229
172 229 248 178 305 180 207 183 92 52 159 114 19 176 270 369 139 88 64 136 234 236 210 110 204 69 23 180 181 171 94 77 55
-192E5
##PAGE=	F1=-13284.2
##FIRST=	25164.767445380970457,	5806.2096540000038658,	0
##DATA TABLE=	(F2++(Y..Y)), PROFILE
5806 143 96 203 145 69 163 76 78 71 154 180 81 212 110 111 38 68 162 136 185 165 199 55 49 41 71 118 118 122 127 130 88 42 76 109 134 158 197
5372 197 173 85 99 182 233 133 247 172 91 142 129 43 29 126 274 159 147 52 179 100 208 263 83 146 153 67 77 120 122 230 213 173
4996 173 120 210 222 309 246 197 159 86 194 193 7 50 124 148 71 222 123 76 184 219 45 60 161 17 193 222 65 46 73 240
4644 240 259 190 181 51 63 149 128 138 202 238 92 164 161 180 82 52 99 136 136 58 65 115 185 63 269 132 216 54 137 327 292 92 151
4257 151 166 232 194 157 208 181 67 269 255 170 121 134 150 102 25 102 242 119 96 33 124 55 82 96 161 113 206 161 59 245 228 190
3881 190 143 284 280 220 154 82 114 124 70 181 106 142 104 61 87 138 54 238 198 183 105 287 196 140 165 87 177 128 72 152 79 99 128
3494 128 119 181 224 101 139 58 128 212 101 195 304 105 47 128 242 61 151 33 121 195 259 59 167 146 233 189 311 189 11
3154 11 126 215 247 73 88 154 164 124 79 126 236 15 190 63 169 150 52 104 153 263 273 159 95 172 120 199 151 102 31 133
2801 133 36 247 175 113 34 142 225 128 105 157 101 122 83 118 88 88 98 166 70 215 194 219 114 52 60 161 181 158 150 227 251 144 414
2414 414 209 43 104 42 125 85 106 132 82 128 48 110 84 119 153 52 94 77 148 202 116 81 17 142 206 252 222 87 7 155 44
2050 44 184 164 160 46 103 72 115 271 115 81 223 106 112 107 26 113 132 141 153 53 62 55 177 365 689 670 286 292 115 73 79 162 151
1663 151 198 159 118 637 863 397 69 40 146 126 103 51 31 21 51 82 84 104 110 148 69 91 50 47 96 77 56 134 115 370 392 177 72
1276 72 87 195 104 126 91 105 170 158 162 37 110 81 97 56 124 312 37 176 92 117 3 203 113 153 84 178 63 125 94 83 117 101
900 101 271 192 71 141 163 76 153 36 106 122 172 234 64 266 95 243 97 210 239 177 229 205 184 256 391 328 383 448 546 1487
548 1487 5197 7107 3796 1074 536 494 463 186 259 353 132 131 147 239 98 190 63 135 188 59 108 202 212 72 96 166 323
231 323 158 137 72 58 188 210 224 329 134 219 221 91 62 182 142 36 212 310 383 115 112 66 175 259 258 274 121 169 92 19 167
-133 167 173 184 93 126 82
-192H2
##PAGE=	F1=-13386.4
##FIRST=	25164.767445380970457,	5806.2096540000038658,	0
##DATA TABLE=	(F2++(Y..Y)), PROFILE
5806 187 109 202 179 91 167 69 59 99 180 153 110 229 171 119 64 69 210 201 206 126 191 83 61 8 34 80 105 130 119 69 108 26 118 125 123 119
5384 119 180 152 100 92 261 294 136 250 174 75 132 123 61 43 134 315 217 119 49 131 112 196 233 98 141 181 70 64 120 132 231 196 167
4996 167 120 124 232 348 277 217 171 122 251 218 22 79 152 155 76 216 126 95 209 214 46 46 185 41 173 243 59 40 63 212 251
4632 251 210 193 54 92 212 138 179 219 251 82 158 114 125 157 49 123 138 174 96 60 103 173 72 236 130 210 74 112 313 333
4280 333 109 158 162 226 131 138 194 150 70 270 264 203 126 109 64 35 86 88 233 134 113 49 101 48 81 102 158 106 245 136 49 242 236 162
3881 162 148 258 259 192 174 115 130 177 68 223 190 151 124 42 63 130 83 231 232 175 115 316 218 124 96 93 141 104 87 125 57 117 83 91
3482 91 157 254 85 92 44 102 235 93 154 299 125 40 172 269 90 138 80 137 210 251 12 159 140 199 198 306 196 12 125 188
3130 188 267 120 37 131 133 97 116 138 194 42 211 41 103 112 79 104 133 205 251 120 83 177 126 223 156 92 16 118 49 223 127 107
2754 107 30 129 200 135 109 161 93 94 115 99 59 159 53 145 83 223 155 193 75 61 42 158 175 159 113 210 246 107 369 204 67
2391 67 82 42 149 133 103 106 66 170 72 110 55 139 117 28 60 53 129 204 69 72 39 155 237 229 227 69 34 195 107 208 210 126 89 132 55
1980 55 130 270 68 68 188 151 139 116 24 85 149 137 128 70 59 19 159 388 781 780 325 329 84 136 55 184 114 173 176 172 765 1001 463
1592 463 24 119 135 72 90 46 70 83 29 94 72 119 135 137 120 87 101 2 100 77 4 115 184 397 354 149 110 100 167 99 116 53 90
1205 90 179 136 184 32 109 123 141 43 141 326 38 205 104 98 31 250 131 153 122 172 82 137 96 56 125 99 258 215 123 169 129 78
829 78 135 55 136 124 161 198 86 284 98 297 108 195 272 152 220 208 128 213 447 323 503 504 646 1772 6048 8171 4335
513 4335 1259 629 539 520 234 293 354 162 158 130 243 128 174 73 179 186 65 111 208 212 73 149 154 326 190 139 129 64 167 165
160 165 233 311 82 224 249 88 126 216 150 71 234 327 351 76 126 69 192 265 267 321 129 148 121 16 162 181 187 73 169 90
-192I0
##PAGE=	F1=-13488.7
##FIRST=	25164.767445380970457,	5806.2096540000038658,	0
##DATA TABLE=	(F2++(Y..Y)), PROFILE
5806 212 108 183 200 115 154 41 61 129 212 113 138 239 220 114 95 74 254 266 230 84 157 99 78 53 54 60 84 140 121 4 104 37
5431 37 146 133 113 78 159 172 120 101 320 344 128 239 176 64 135 139 100 68 128 318 266 107 61 90 123 154 204 92 153 199 71
5067 71 61 123 141 219 153 143 137 41 259 392 287 193 145 154 270 211 33 102 160 144 106 187 146 117 240 207 64 23 196 59 159
4703 159 255 54 39 65 175 229 233 218 48 118 255 122 183 216 255 85 129 57 73 230 112 193 171 181 134 55 90 161 80 208 126
4339 126 186 86 79 284 357 131 161 161 229 122 117 161 112 84 261 268 214 120 68 44 89 129 82 203 153 107 39 88 71 49 107 145 90 254
3940 254 106 63 194 217 134 156 214 222 172 187 130 134 224 96 233 247 145 133 20 74 126 100 209 235 153 149 340 239 105 50 127
3576 127 108 84 107 113 82 137 62 63 129 269 68 58 36 63 231 86 90 267 139 82 229 296 120 100 131 139 226 245 53 139 147 145 206
3189 206 278 177 21 108 143 258 153 25 109 101 93 158 148 132 108 224 75 59 61 101 100 94 130 225 71 89 200 144 226 140 80 27 98
2801 98 75 190 89 101 56 108 176 158 93 167 99 91 148 86 93 218 40 121 102 210 130 150 10 80 43 129 146 152 76 194 239 81 295
2414 295 188 101 39 34 149 176 124 91 51 169 99 121 40 158 71 106 61 47 105 184 40 94 72 160 263 192 226 58 35 220 184
2050 184 211 257 99 150 145 64 134 243 20 70 132 204 162 107 35 65 158 138 104 90 75 49 120 361 796 806 338 327 94 209 43
1686 43 199 84 140 195 201 798 1021 499 55 207 132 45 91 112 137 125 73 120 71 118 154 109 172 117 133 51 98 71 63 84 225 388
1311 388 279 105 148 117 130 91 95 18 75 173 105 212 83 103 160 192 22 168 330 42 239 96 69 72 262 134 148 152 140 117
959 117 129 106 27 148 89 226 233 153 197 97 86 129 92 169 113 136 150 108 276 109 341 126 152 295 109 192 196 104 182 446 291
595 291 570 487 671 1859 6255 8357 4405 1323 657 521 537 254 304 323 186 165 109 227 146 157 67 191 169 75 94 211
290 211 195 86 184 125 299 200 121 178 72 165 123 214 252 87 225 267 79 207 250 127 123 240 321 277 61 135 71 186 252 260 346
-74 346 125 152 140 19 172 199 177 34 201 76
-192G6
##PAGE=	F1=-13591
##FIRST=	25164.767445380970457,	5806.2096540000038658,	0
##DATA TABLE=	(F2++(Y..Y)), PROFILE
5806 212 93 153 204 133 137 2 86 153 241 94 165 244 252 105 120 86 280 312 254 58 117 104 96 107 103 75 62 147 137 52 84 44 148
5419 148 124 108 61 139 216 129 111 351 376 114 216 179 65 147 165 146 102 107 286 294 121 78 64 125 89 184 57 180 209 71 68 125
5043 125 144 192 94 104 168 44 300 428 277 136 93 166 249 181 37 118 149 127 143 143 178 129 254 196 86 14 192 77 148 253
4691 253 64 37 78 144 193 257 251 45 142 272 85 156 188 251 102 82 44 40 274 168 255 189 155 163 51 90 146 84 190 119 143 91
4316 91 43 254 356 153 153 162 234 163 92 112 99 106 240 263 201 114 15 159 163 141 93 155 172 99 26 85 119 46 120 130 72 232 71 91
3916 91 114 170 109 166 160 179 166 196 131 134 253 136 216 262 130 124 11 111 127 100 170 202 128 170 349 257 86 64 146 76 73 128 110 101
3517 101 138 76 68 99 265 54 58 51 46 209 71 10 209 145 126 285 319 142 54 171 129 232 231 84 107 157 80 211 234 144 41
3154 41 86 86 226 171 35 85 90 124 200 158 65 177 226 113 122 71 118 91 73 56 203 69 105 238 174 209 103 69 47 85 106 150 64
2766 64 84 77 88 159 184 60 169 112 102 175 77 136 268 94 105 117 180 127 105 75 101 74 76 106 134 39 181 231 88 225 161 142 29
2379 29 23 127 203 170 126 36 117 109 145 93 175 61 173 76 46 91 155 54 145 111 159 276 149 213 56 12 220 240 196 289 84 207
2003 207 139 92 137 208 19 93 78 257 186 84 39 53 160 140 79 101 89 106 101 292 726 742 324 285 144 275 36 202 71
1663 71 107 209 201 729 918 489 113 275 144 76 105 170 185 139 113 151 97 119 150 64 220 160 143 100 91 73 125 41 229 351 191
1299 191 90 173 138 102 76 68 53 74 146 84 242 143 90 181 230 23 186 322 84 271 68 55 112 237 135 142 180 99 159 106 118
935 118 3 173 70 180 233 154 219 94 88 132 117 192 86 105 91 129 245 125 363 148 90 306 57 145 173 103 149 384 249
595 249 571 395 617 1726 5762 7610 3989 1252 613 446 505 233 288 267 209 141 104 193 148 140 55 168 142 91 66 214 166
278 166 110 190 80 247 187 113 217 68 160 102 181 170 139 218 270 60 283 269 81 183 231 298 177 120 142 74 161 227 238 348
-74 348 107 165 141 27 195 213 152 18 219 41
-192D1
##PAGE=	F1=-13693.2
##FIRST=	25164.767445380970457,	5806.2096540000038658,	0
##DATA TABLE=	(F2++(Y..Y)), PROFILE
5806 189 71 126 189 140 130 44 114 166 260 124 195 241 265 108 132 105 278 326 269 48 91 103 112 157 142 104 49 141 156 83 64 38 123
5419 123 92 100 82 126 256 117 119 358 388 104 185 177 83 157 190 185 133 74 232 291 148 96 57 108 15 173 9 211 212 74 76 115 135
5032 135 151 41 59 200 108 346 450 253 68 56 154 200 146 30 139 136 117 173 98 205 125 241 178 101 53 174 102 140 235 82
4679 82 55 92 125 148 277 285 64 164 262 36 112 141 243 130 33 98 38 281 202 295 182 105 182 49 104 121 85 185 114 82 95
4316 95 24 228 326 168 130 162 227 203 76 55 129 134 205 246 172 130 42 267 214 117 109 93 189 132 68 93 181 100 125 125 65 185 31 124
3916 124 57 103 84 173 104 149 175 201 124 142 257 168 193 235 110 99 24 143 125 83 116 147 107 165 337 267 74 79 136 44 65 147 106
3529 106 88 113 92 99 71 241 45 72 79 79 190 46 77 134 146 160 329 333 145 27 189 118 217 203 106 70 161 28 216 187 115 80
3154 80 81 31 180 173 30 58 105 159 234 171 27 232 215 146 205 140 131 83 97 29 188 118 119 263 192 177 58 73 66 78 131 110 59 59 90
2743 90 74 148 202 32 164 131 99 187 68 173 308 144 107 122 140 146 89 159 118 115 20 97 106 24 172 226 121 211 127 179 89 28 90
2355 90 209 224 188 71 22 105 175 159 183 101 212 75 41 98 129 94 217 156 157 272 112 189 66 29 192 258 175 305 76 250
2003 250 113 126 154 193 47 131 110 297 209 54 35 43 152 135 54 99 96 159 127 202 586 604 291 210 184 313 25 194 76 84 208
1639 208 176 580 716 433 164 301 165 108 118 204 206 131 145 182 141 134 108 79 255 193 139 137 82 96 167 65 200 295 119 119 181 170
1264 170 95 61 52 103 94 108 84 262 190 67 176 239 50 191 306 137 292 28 74 145 184 145 138 210 79 197 80 124 39 184
912 184 44 128 215 130 228 122 82 137 123 199 47 83 36 150 201 138 357 169 44 304 13 85 146 101 98 272 219 515 247 496
560 496 1408 4685 6106 3187 1066 508 333 429 172 247 201 234 84 113 153 135 126 77 122 110 108 39 213 140 137 171 25 180 159
219 159 144 246 50 141 110 152 102 183 196 255 30 338 258 88 235 207 263 97 194 147 79 123 203 202 333 79 165 120 34 222 213
-145 213 113 73 219 12
-192A2
##PAGE=	F1=-13795.5
##FIRST=	25164.767445380970457,	5806.2096540000038658,	0
##DATA TABLE=	(F2++(Y..Y)), PROFILE
5806 150 65 113 162 138 137 83 134 166 260 175 220 234 261 125 135 125 252 306 270 46 99 99 127 196 166 127 45 115 166 89 68 37 92 45
5407 45 87 123 129 279 77 127 347 381 107 157 166 108 159 206 201 146 37 174 251 171 112 59 66 59 163 63 234 205 82 76 87 112 108 30
5008 30 28 218 154 385 454 224 35 84 119 144 131 14 174 147 120 190 74 214 108 203 157 109 97 151 130 136 203 95 98 98 114 104
4632 104 285 311 91 182 231 25 79 85 233 169 35 148 45 255 208 307 161 53 191 48 123 85 97 187 122 12 103 54 209
4292 209 273 177 90 161 204 229 105 38 170 161 162 218 136 168 93 354 238 61 113 38 197 203 121 116 241 144 106 137 79 128 37 157 114
3905 114 37 54 171 50 147 195 201 118 166 235 181 192 175 95 62 44 157 112 51 53 100 95 141 299 268 77 67 107 14 59 158 101 39 66
3506 66 100 129 55 199 41 80 106 118 202 44 160 69 145 184 352 329 118 30 181 124 174 157 128 40 158 50 222 149 105 129
3154 129 106 29 133 156 10 44 124 178 255 189 51 260 191 180 270 203 134 80 128 57 177 161 125 250 178 136 41 97 83 64 148 87
2778 87 64 40 92 64 141 203 66 154 154 80 181 57 207 331 170 130 113 98 175 117 225 125 152 61 140 82 64 165 223 151 254
2414 254 91 204 145 47 55 190 271 246 136 97 100 203 207 169 144 221 52 45 119 110 142 297 199 155 253 91 156 85 76 146 232 165 313
2027 313 74 275 71 163 183 208 64 171 194 312 224 27 28 30 131 118 51 81 100 198 161 113 404 424 251 118 194 309 8
1686 8 180 92 83 192 144 396 465 341 230 274 188 118 120 217 197 110 166 207 181 145 44 190 271 204 130 159 70 131 179 137 146 230 86
1299 86 146 175 215 103 63 62 147 131 91 97 267 217 37 141 209 75 188 286 175 295 18 98 169 119 162 138 237 99 219 55
947 55 120 87 170 16 79 183 93 217 154 75 146 108 188 4 72 51 176 163 143 325 185 87 297 34 21 118 95 35 140 214 428
583 428 74 340 981 3279 4192 2191 809 366 212 325 91 187 140 257 9 114 118 113 122 127 82 81 120 35 204 128 158 147 33
243 33 110 125 191 265 22 109 132 136 100 203 155 223 38 364 212 180 264 175 221 126 254 149 86 81 185 159 303 49 146 80 36 241
-133 241 193 72 119 204 62
-192F2
##PAGE=	F1=-13897.7
##FIRST=	25164.767445380970457,	5806.2096540000038658,	0
##DATA TABLE=	(F2++(Y..Y)), PROFILE
5806 104 93 110 131 131 149 107 146 151 242 217 230 224 243 138 129 140 214 258 252 62 131 92 142 219 177 144 44 75 165 78 88 62 103 57 81 167
5384 167 151 281 14 138 327 363 116 142 140 129 151 207 184 135 25 129 179 185 126 59 2 122 150 118 236 185 90 70 43 74 85
5020 85 42 47 215 180 403 440 195 67 118 74 117 144 23 220 187 130 189 82 197 86 158 134 111 140 137 153 135 161 92 149 92 99
4644 99 79 275 320 109 192 188 69 79 33 229 213 66 179 51 207 186 292 143 53 192 47 136 56 130 194 143 65 121 89 196
4292 196 210 186 44 162 174 243 170 87 194 178 127 187 106 208 130 409 237 14 98 70 196 277 160 153 283 162 64 164 121
3952 121 74 87 186 176 57 21 153 7 172 216 195 119 196 192 172 213 110 92 29 70 155 86 22 14 103 84 113 234 255 92 36 82
3576 82 16 58 159 102 37 40 106 151 57 148 43 83 122 143 243 90 228 85 147 198 350 303 64 35 159 153 106 100 151 33 152
3212 152 79 229 125 107 179 136 72 99 123 22 71 137 170 258 208 62 250 152 210 304 242 125 79 137 68 169 181 122 197 130 100
2848 100 69 134 107 43 154 104 56 40 84 52 134 184 112 145 176 85 170 44 235 327 170 168 103 61 202 151 260 120 183 117 196 87
2473 87 116 158 220 158 301 59 211 190 73 72 147 296 283 196 215 110 223 223 128 179 205 48 75 143 94 182 365 237 152 226 90
2109 90 123 105 115 116 177 177 323 84 280 29 196 209 230 68 201 265 298 223 36 31 13 95 96 82 52 104 217 176 67 219 244 217
1733 217 32 180 260 40 164 107 102 161 122 234 225 233 344 228 207 106 112 222 169 87 175 226 199 133 139 333 266 191 123 164 64 162
1358 162 160 202 81 160 84 146 161 263 119 82 79 175 171 129 103 256 223 4 77 143 90 184 269 182 281 61 113 186 65 171 136 250
982 250 128 217 32 109 146 129 25 37 148 57 191 176 76 163 78 161 43 67 93 201 153 138 282 193 147 293 55 43 92 99
630 99 63 51 222 346 86 190 536 1852 2281 1219 536 218 115 219 38 120 100 268 77 97 93 90 128 172 86 59 120 46
301 46 181 131 172 141 87 51 97 221 273 11 84 149 139 133 196 101 183 96 362 138 280 262 141 177 199 285 146 101 47 175 116 261
-74 261 20 120 33 32 245 156 66 146 179 108
-192A08
##PAGE=	F1=-14000
##FIRST=	25164.767445380970457,	5806.2096540000038658,	0
##DATA TABLE=	(F2++(Y..Y)), PROFILE
5806 60 134 104 106 122 155 114 153 127 210 241 218 212 216 131 114 146 180 193 215 96 167 78 157 228 180 157 49 50 155 62 105 97 151 122 104 200
5384 200 182 264 65 148 306 340 119 144 97 140 134 196 139 101 49 97 87 190 136 64 81 166 134 154 214 154 95 71 37 33 100 37 76 195
4985 195 187 391 408 169 96 128 48 136 168 52 261 235 140 172 98 156 70 134 115 108 173 139 162 131 114 71 193 69 79 83 247 305 108
4597 108 189 141 100 98 17 232 254 82 190 58 149 144 251 137 86 181 50 138 77 178 201 167 129 150 118 191 160 196 38 165 154
4233 154 250 238 131 192 179 122 164 85 231 149 430 219 87 67 136 191 333 173 200 299 157 64 198 185 55 138 205 207 104 35
3881 35 113 45 203 230 182 122 217 135 146 236 82 102 32 98 146 60 54 65 130 70 108 149 225 106 46 85 33 61 149 112 127 94 117 165
3482 165 68 101 49 87 122 149 284 144 279 145 152 208 328 254 45 65 138 193 25 49 164 40 146 91 230 118 105 219 153
3142 153 114 94 82 49 106 139 136 241 224 49 199 97 222 301 249 104 77 123 61 165 178 112 127 73 81 92 171 140 47 154 143 25
2766 25 46 62 51 128 147 144 141 193 143 178 30 248 289 161 213 115 35 216 171 259 109 202 159 238 115 169 152 215 138 320 46 198
2391 198 222 112 126 84 290 295 232 307 131 231 203 64 204 177 107 125 165 89 197 402 263 147 201 102 97 117 138 135 120 202 336
2027 336 106 269 63 215 219 237 63 213 302 260 206 67 37 15 54 79 125 22 111 215 165 101 78 98 201 52 173 176 84 149
1675 149 118 123 126 122 159 55 128 501 265 217 80 100 230 136 65 167 238 184 96 292 481 243 157 115 157 71 183 117 246 50
1322 50 89 86 114 153 301 141 98 88 185 208 187 102 232 212 29 22 53 96 188 258 157 255 97 122 199 58 160 127 240 146 187 24
947 24 98 213 68 50 10 121 31 161 186 85 191 49 125 83 63 116 214 164 123 241 189 193 296 61 97 65 115 135 109 223 292
583 292 202 79 155 676 731 460 299 95 72 141 84 61 83 258 143 74 70 69 135 197 111 53 105 53 148 138 180 157 128 43 80 221
207 221 269 51 81 151 166 147 170 54 144 159 340 81 361 229 117 132 250 284 138 126 29 170 81 211 39 115 35 23 235
-133 235 131 102 151 155 141
-192A41
##PAGE=	F1=-14102.2
##FIRST=	25164.767445380970457,	5806.2096540000038658,	0
##DATA TABLE=	(F2++(Y..Y)), PROFILE
5806 26 171 87 95 113 157 105 167 97 179 244 181 198 184 98 89 143 156 123 163 135 194 56 168 228 185 172 62 74 148 52 113 127 189 180 144
5395 144 207 212 231 147 157 286 317 107 154 40 136 114 180 111 53 72 70 29 190 145 86 161 185 113 168 180 125 99 92 87 38 130 33 100 174
4985 174 179 347 359 143 121 116 75 171 188 76 287 272 149 143 104 100 66 142 99 103 190 152 151 116 74 38 220 41 64 97 206 266 86
4597 86 175 100 107 106 38 240 283 79 181 65 95 91 192 141 106 161 57 129 115 221 205 182 167 184 136 194 152 201 74 166 152 257
4222 257 291 156 166 159 145 160 74 226 148 419 193 144 41 198 190 358 160 250 288 150 130 226 259 95 182 210 203 134 90 55 82
3858 82 223 228 163 122 213 74 111 242 90 112 58 120 137 61 98 100 138 53 133 62 182 110 92 99 48 62 130 126 215 159 126 170 76 80 55
3447 55 93 99 136 302 187 310 194 157 212 292 191 122 119 132 237 83 55 158 37 136 93 220 126 105 244 153 156 115 46 65 128
3083 128 131 85 204 232 36 118 32 205 264 224 80 75 103 47 169 158 91 89 61 83 97 201 176 75 151 181 45 52 28 84 124 98 154
2696 154 142 202 211 214 13 239 221 166 255 151 22 213 172 227 95 210 188 254 140 215 149 207 96 304 60 169 243 164 186 28
2344 28 252 283 230 355 150 226 153 44 222 150 176 178 179 122 175 396 276 141 178 116 77 115 138 167 92 222 343 132 248 125
1992 125 212 211 224 55 205 295 204 185 98 30 36 29 74 164 35 121 197 136 148 92 18 208 92 197 76 126 140 122 137 98 135 159 97
1604 97 46 664 401 215 57 94 241 117 46 141 246 141 57 432 608 214 109 100 147 95 192 73 263 106 29 82 59 156
1276 156 313 167 97 85 175 230 232 103 199 191 54 103 63 102 198 247 111 230 124 137 211 89 132 103 207 149 131 65 92 274 36
912 36 67 26 111 26 142 188 97 227 64 87 116 60 118 208 176 98 213 177 222 304 58 143 39 129 186 154 204 259 256 29 115 90 273
524 273 147 133 19 71 112 122 39 73 224 179 90 44 54 132 198 123 71 78 52 113 145 189 173 152 87 82 193 253 97 91 132 204 136 134 57
114 57 115 213 308 135 409 177 105 88 274 263 122 162 26 171 56 158 102 148 80 28 219 148 139 138 140 156
-192A56
##PAGE=	F1=-14204.5
##FIRST=	25164.767445380970457,	5806.2096540000038658,	0
##DATA TABLE=	(F2++(Y..Y)), PROFILE
5806 2 197 62 99 102 160 85 193 69 159 225 127 182 152 48 57 137 138 56 106 164 205 28 170 224 199 187 77 102 148 57 111 141 197
5419 197 218 178 178 239 187 221 165 266 296 81 160 27 122 92 168 156 4 88 45 100 185 156 125 228 178 86 162 170 119 107 123 125 80 155
5020 155 56 119 178 165 276 297 115 150 100 110 196 197 87 292 288 154 105 95 49 67 149 89 96 187 161 125 88 63 23 228 57 67 102
4632 102 162 207 50 158 81 87 97 46 244 292 63 159 64 54 37 123 144 107 134 69 112 135 247 200 185 170 212 140 200 175 190 102 161
4245 161 157 266 316 163 128 122 169 175 85 194 127 383 160 172 66 250 198 353 138 292 254 165 191 234 326 154 215 202 176 148 153
3881 153 15 111 225 206 138 115 178 25 79 224 80 114 87 130 131 88 132 115 117 47 170 88 143 103 128 107 70 49 106 136 285 216
3506 216 129 165 81 87 59 93 56 110 290 212 326 222 155 208 250 129 194 172 137 285 172 92 132 22 119 95 203 145 125 252 138
3142 138 193 147 47 65 128 111 37 146 227 75 76 34 158 204 175 71 79 111 37 186 131 56 93 75 104 84 224 206 94 148 204 122
2766 122 74 12 134 120 45 147 141 201 256 252 10 208 135 193 285 186 23 196 155 173 75 204 207 241 145 244 152 196 51 264 81
2402 81 133 254 220 239 88 191 257 185 354 159 211 91 115 235 130 227 220 178 179 119 344 274 137 153 125 58 95 113 172 88 219
2038 219 338 154 223 183 182 192 203 64 184 246 128 173 124 13 54 35 70 190 73 132 173 100 181 144 52 228 98 234 51
1698 51 153 142 121 138 86 151 151 143 26 786 546 203 61 99 252 118 46 99 251 100 66 521 690 191 56 77 144 125 195
1358 195 79 252 170 68 78 30 169 291 189 80 69 151 234 253 117 157 159 67 181 152 118 210 226 86 216 137 161 227 130 99
1006 99 66 160 138 56 125 90 313 89 72 44 110 41 145 191 106 260 109 56 139 61 104 185 176 67 194 160 234 312 53 178 14
642 14 133 206 156 163 222 251 34 264 418 666 250 59 11 72 106 135 47 62 169 181 142 52 56 117 182 116 103 44 45 81 149 202 174
254 174 159 137 108 148 225 145 97 100 236 106 96 82 98 245 274 225 423 129 95 47 277 242 96 205 17 176 36 119 178 202
-98 202 118 52 208 190 160 122 139 152
-192A52
##PAGE=	F1=-14306.8
##FIRST=	25164.767445380970457,	5806.2096540000038658,	0
##DATA TABLE=	(F2++(Y..Y)), PROFILE
5806 20 207 36 115 89 166 66 227 47 144 188 65 161 127 52 39 134 126 29 61 178 206 9 157 221 223 199 83 108 158 77 103
5442 103 139 173 232 194 113 260 140 276 179 238 269 53 156 83 110 75 153 220 32 101 44 149 170 167 170 270 148 64 142 201 135
5078 135 124 153 137 116 166 80 131 205 147 193 227 85 176 101 133 209 195 83 278 279 152 66 75 49 63 131 95 87 162 159 101 52 79 50 220
4668 220 107 85 97 123 134 33 149 96 46 70 41 236 278 41 126 49 25 20 60 143 95 108 83 91 124 247 186 178 135 226 128 202 197 158
4269 158 123 154 152 278 310 158 90 77 181 198 118 143 89 330 119 171 113 285 209 325 133 319 203 192 219 215 367 211 237 181
3916 181 140 157 216 83 129 204 169 117 103 116 42 65 188 41 114 119 128 121 112 151 114 75 57 205 182 143 90 144 115 94 23 81 145 326
3517 326 264 135 149 84 93 58 80 11 75 254 216 329 227 139 191 211 86 232 211 138 337 244 122 86 30 94 101 185 167 165 248 113
3142 113 219 183 86 48 111 91 58 71 207 134 160 90 88 146 114 80 87 143 42 215 110 28 79 65 140 64 238 223 94 145 206 201 114
2754 114 52 183 111 7 136 131 190 260 268 30 161 55 221 297 200 34 171 127 108 42 185 220 199 126 251 162 180 41 214
2414 214 100 99 255 271 278 162 131 224 106 314 158 194 55 170 242 116 246 242 159 234 88 253 256 135 115 125 32 57 67 137
2062 137 99 201 325 171 202 228 127 183 186 88 160 170 33 177 143 49 69 35 50 197 107 138 157 74 193 158 77 245 75 250
1710 250 122 161 160 115 127 87 165 118 158 68 834 639 182 80 117 261 136 77 58 255 120 89 535 711 181 13 57 151 151
1369 151 196 122 221 218 130 77 92 180 234 202 70 37 124 218 248 139 111 116 67 231 213 145 220 188 113 212 133 189 246 171 89 39 113 116 33
959 33 186 89 320 136 66 58 107 62 162 199 110 278 148 40 149 67 86 169 168 34 174 150 227 311 51 201 26 132 195 126
606 126 107 168 206 81 320 411 615 200 53 8 69 97 132 42 56 107 157 195 104 81 93 162 97 135 15 33 50 145 219 159 155 191 146
219 146 101 189 190 98 87 246 71 64 90 86 245 237 296 406 103 79 19 271 247 58 248 3 180 23 115 251 256 146 82 207 222
-145 222 161 121 146 133
-192A33
##PAGE=	F1=-14409
##FIRST=	25164.767445380970457,	5806.2096540000038658,	0
##DATA TABLE=	(F2++(Y..Y)), PROFILE
5806 49 203 23 132 82 172 65 255 37 118 137 18 136 117 114 55 140 131 73 59 181 211 23 128 217 258 203 77 93 174 109
5454 109 91 127 124 225 186 43 273 91 304 201 195 228 70 146 121 108 76 124 251 43 113 67 158 137 176 214 287 105 84 114 241
5090 241 149 144 174 124 140 163 87 133 228 128 117 159 52 186 124 140 216 184 66 247 244 134 28 54 72 54 86 114 80 122 143 103
4715 103 49 90 70 201 151 105 91 86 57 69 153 131 69 31 28 219 243 24 86 21 5 57 38 137 82 90 92 71 84 221 164 167 68 222 102
4304 102 193 196 117 148 158 129 286 274 151 60 47 175 219 159 84 50 271 71 152 149 297 215 288 151 323 143 209 205 170 370 254
3940 254 249 155 106 165 264 137 140 161 124 113 94 34 78 73 145 65 126 147 113 102 120 150 105 28 75 235 264 187 82 143 134 112 22 60 158
3529 158 332 296 153 124 88 84 49 55 74 43 208 203 322 212 106 162 185 72 226 230 128 386 291 144 29 77 77 100 174 185 202
3165 202 233 89 228 218 131 30 92 96 110 43 177 191 255 124 30 131 59 89 91 173 62 247 100 83 43 57 181 56 245 220
2813 220 87 137 182 263 159 88 218 90 32 133 108 177 219 250 47 118 43 228 289 186 51 149 92 42 12 152 230 138 89 234
2461 234 176 157 58 168 109 78 240 304 298 222 117 193 40 257 154 180 87 185 240 110 230 241 123 270 164 143 222 137 61 115
2109 115 4 24 37 69 145 192 317 187 182 253 58 200 177 111 139 97 79 186 151 107 79 20 20 185 127 134 155 68 182 145 98 243
1733 243 41 233 171 149 188 108 115 91 174 77 166 116 791 650 156 93 142 273 165 116 70 252 175 83 468 668 178 37 60
1393 60 163 162 196 154 178 243 181 78 150 181 150 209 101 17 106 189 226 157 78 63 58 242 231 174 228 136 149 215 117 213 266 201 113 71
994 71 87 89 113 235 84 290 159 55 67 93 76 180 209 112 272 169 38 145 88 82 185 159 8 151 154 200 293 48 209 59
642 59 129 162 91 47 103 155 144 325 232 340 73 45 51 79 97 126 15 59 52 121 233 162 119 72 153 74 154 11 22 17 126 235 136
254 136 151 241 179 66 150 227 101 126 227 50 43 77 72 212 197 333 370 91 56 29 262 277 17 282 32 170 28 138 305
-86 305 302 166 111 214 226 147 143 159 105
-192A05
##PAGE=	F1=-14511.3
##FIRST=	25164.767445380970457,	5806.2096540000038658,	0
##DATA TABLE=	(F2++(Y..Y)), PROFILE
5806 88 190 31 143 82 172 81 262 43 69 84 42 109 128 167 76 151 156 117 86 177 226 28 90 210 297 199 60 79 197 147 73
5442 73 117 70 206 156 102 270 43 302 224 136 167 120 138 128 108 105 74 229 25 123 86 128 83 180 249 282 67 135 80 254 145
5078 145 159 183 96 153 148 71 129 227 111 78 99 17 178 158 133 222 166 39 199 187 97 6 49 79 45 42 134 81 79 117 130 93 84 73 174
4668 174 170 121 94 44 15 107 166 172 156 12 30 198 197 22 41 28 32 88 74 132 76 79 91 61 27 176 137 156 14 206 84 169 169 102
4269 102 182 172 91 284 216 149 32 67 154 234 193 47 64 215 28 141 166 281 210 257 167 299 84 202 159 110 334 269 250
3928 250 132 79 166 284 166 144 106 83 127 94 53 104 89 108 148 148 161 88 73 108 131 93 37 95 258 321 238 87 131 158 115 67 46
3541 46 176 305 306 177 96 93 56 33 24 137 26 165 184 308 178 59 129 173 79 179 235 106 417 310 166 33 133 92 86
3200 86 169 193 217 210 73 218 239 168 50 85 135 163 142 144 238 318 131 88 160 50 82 84 182 87 271 107 156 88 81 209 73 243
2825 243 202 104 126 136 294 192 118 235 57 41 139 74 174 142 202 59 100 76 212 264 150 72 138 70 34 72 109 236 69 58
2473 58 200 189 126 64 135 105 70 208 312 296 258 155 170 110 216 153 173 136 155 227 116 185 220 77 278 264 50 173 148 22
2121 22 98 28 69 94 47 204 206 329 204 156 252 25 237 172 117 117 91 175 192 150 165 88 42 66 153 124 119 162 78 151 121 110 211 54
1722 54 186 189 129 214 102 117 92 171 48 172 171 669 579 130 95 166 283 197 145 120 239 215 47 338 571 171 68 85 172 153
1369 153 195 161 135 242 210 76 189 169 56 212 157 80 101 157 198 159 79 22 49 213 202 196 243 94 161 215 107 225 281 210 143
1006 143 120 91 62 177 260 74 230 163 46 69 64 75 191 217 110 240 166 35 124 126 103 226 155 16 128 173 156 253 43 200
653 200 89 120 123 78 32 60 130 195 316 67 138 119 49 99 104 121 121 28 63 22 90 251 213 157 64 162 52 151 13 21 45 96 243 111
254 111 151 276 191 53 114 252 116 186 185 67 43 50 51 159 158 335 325 67 56 58 255 312 44 303 65 141 44 160 326 335 180
-110 180 135 220 198 124 176 176 85
-192H5
##PAGE=	F1=-14613.5
##FIRST=	25164.767445380970457,	5806.2096540000038658,	0
##DATA TABLE=	(F2++(Y..Y)), PROFILE
5806 134 173 46 142 81 166 94 244 66 13 57 71 87 153 195 84 157 186 150 110 171 238 15 63 197 325 184 40 92 222 182
5454 182 43 116 32 182 107 182 246 44 274 233 83 90 168 142 101 101 146 35 155 28 133 92 75 22 180 272 262 60 180 41
5102 41 227 128 163 177 69 159 135 38 121 193 101 92 61 23 157 195 112 229 146 9 138 120 52 32 65 68 44 80 146 98 63 87 157
4715 157 144 67 64 141 157 129 107 17 79 132 182 217 249 54 50 182 152 29 21 77 69 109 109 132 78 71 78 66 34 124 105 147 89 194 113 130
4292 130 122 142 214 182 60 266 147 151 11 111 120 239 211 75 113 170 61 151 159 236 195 240 165 249 46 172 108 62 272 257 238
3928 238 123 51 153 269 166 145 62 60 146 98 131 122 99 91 222 160 155 57 41 84 100 74 68 116 273 349 270 98 118 176 100 112 39 192
3529 192 251 284 191 78 96 17 10 8 185 32 128 167 287 130 23 109 176 113 109 241 74 415 304 192 86 191 127 55 163
3189 163 186 199 180 67 194 234 181 84 90 182 215 247 115 270 337 118 149 190 79 64 64 170 108 276 129 219 161 87 218 96
2837 96 230 175 146 112 77 288 203 143 233 22 40 140 37 187 52 146 68 111 81 179 229 114 94 139 92 97 133 61 232 15 74
2473 74 163 195 95 61 113 84 69 158 292 273 267 200 159 182 212 154 166 184 88 200 132 129 185 36 261 339 83 119 165 76 82 52 131 163
2074 163 129 236 220 356 215 118 224 71 272 161 101 91 133 229 196 141 209 100 95 139 107 97 103 166 90 115 97 112 153 105 123 185
1698 185 120 230 97 140 88 152 36 175 226 501 451 123 87 178 279 220 153 166 212 222 39 180 447 160 87 117 173 119 189
1358 189 137 101 220 212 65 204 145 40 215 212 149 100 133 177 140 94 59 54 152 133 205 267 108 146 207 122 223 283 195 167 161 106 43
970 43 214 254 60 159 159 41 67 46 62 192 218 104 186 141 24 91 173 147 268 160 31 113 199 115 189 33 171 107 96 101 85
606 85 70 80 132 218 309 113 236 197 76 130 131 147 120 80 63 18 81 250 253 189 62 185 37 122 38 33 98 72 232 89 148 282
231 282 176 69 92 265 149 240 132 103 60 24 22 123 132 305 278 22 90 94 247 336 86 307 93 99 58 168 309 350 193 157
-121 157 221 144 103 210 195 93
-192I3
##PAGE=	F1=-14715.8
##FIRST=	25164.767445380970457,	5806.2096540000038658,	0
##DATA TABLE=	(F2++(Y..Y)), PROFILE
5806 183 158 61 132 73 155 93 202 98 80 85 92 75 184 196 82 152 206 173 127 158 234 12 79 176 331 158 30 120 239 209 3
5442 3 114 28 162 47 227 194 98 230 223 105 27 200 160 64 101 184 96 48 96 146 88 58 59 178 280 232 75 205 29 175
5090 175 126 154 155 55 170 143 4 111 133 100 134 58 54 140 227 84 232 127 24 83 55 58 50 89 62 48 139 149 125 83 60 172
4715 172 185 67 57 108 110 127 122 80 129 144 203 264 330 86 66 173 125 32 78 130 109 122 128 134 81 66 54 83 90 86 71 134 142 200 176 84 86
4280 86 203 231 179 88 233 80 154 48 157 83 233 210 124 153 140 115 171 128 167 171 235 143 181 75 129 109 75 215 236 210 130 26
3905 26 120 218 139 141 74 60 157 97 190 133 97 97 264 148 132 47 58 73 76 43 84 134 276 346 274 109 112 181 70 151 40 196 180 227
3506 227 176 75 94 23 19 19 206 43 90 155 260 73 53 117 186 173 58 254 34 372 279 219 124 240 159 15 151 165 151 140
3154 140 70 160 195 163 108 94 220 262 334 97 282 309 96 186 203 99 60 47 144 115 252 156 258 204 74 226 111 204 153 187
2801 187 97 24 251 187 169 218 40 58 128 33 210 54 125 83 133 60 144 193 107 114 145 144 153 179 17 214 53 113 139 189 75 67 107
2414 107 50 76 101 247 233 249 232 158 216 227 151 151 223 39 163 146 83 145 31 225 369 134 80 175 126 75 71 186 215 199 215 220
2038 220 381 214 71 172 97 283 145 66 73 156 222 223 130 227 116 150 210 65 60 109 158 100 102 85 127 105 153 69 172 129 225 96
1663 96 171 82 126 42 189 274 330 307 152 79 171 248 225 135 197 174 199 97 69 328 154 93 149 166 67 175 87 90 186 185 42 196
1287 196 115 103 212 254 208 94 118 168 103 92 107 74 80 40 200 297 156 111 187 151 207 270 169 179 192 119 39 220 217 48 106 157
912 157 38 71 87 52 183 212 95 120 98 16 56 219 200 294 172 58 114 219 117 101 18 121 106 61 111 88 101 113 134 212 299
548 299 108 258 215 104 133 147 153 128 128 61 14 105 233 282 209 62 212 47 70 89 46 143 74 199 79 132 249 139 104 90 273
184 273 198 272 92 142 79 18 25 150 132 255 234 37 127 135 233 340 114 294 107 72 67 165 264 348 210 181 216 77 88 236 211
-180 211 120
-192A20
##PAGE=	F1=-14818.1
##FIRST=	25164.767445380970457,	5806.2096540000038658,	0
##DATA TABLE=	(F2++(Y..Y)), PROFILE
5806 225 144 69 121 54 139 79 163 131 150 124 110 77 213 176 77 132 207 188 140 140 209 45 113 148 303 121 29 140 237 227 69 98
5431 98 28 148 28 226 116 152 186 200 184 99 207 184 101 137 208 166 66 173 165 77 114 119 182 269 193 88 200 77 151 158 132 116
5055 116 46 195 172 33 99 59 110 188 78 78 135 244 62 228 113 58 88 10 106 60 112 87 46 183 155 151 104 46 173 213 97
4691 97 61 108 40 112 134 143 165 147 225 305 387 104 63 166 126 32 142 178 146 124 129 129 82 72 40 105 137 79 40 117 159 213 239 54 117
4280 117 255 228 166 150 190 42 156 90 200 61 217 196 166 172 124 161 184 82 90 143 235 112 109 127 93 158 112 204 242 174 139 56
3905 56 76 139 95 129 113 68 154 86 224 142 87 114 269 107 102 83 119 99 92 17 85 145 264 317 252 125 117 176 30 179 45 182
3529 182 107 135 125 80 88 58 48 19 197 53 49 144 225 16 83 144 198 242 78 270 27 292 245 240 141 272 179 38 136 136 82 94
3154 94 73 119 124 122 115 102 243 294 384 87 274 246 81 192 197 103 84 70 115 106 198 176 266 208 144 261 118 168 153 210 81 48 195
2766 195 149 194 202 77 93 102 64 226 115 149 111 160 32 124 160 123 128 151 193 192 198 38 178 83 140 127 173 78 86 125 50 93 75 183
2367 183 181 216 252 162 204 235 137 125 245 112 128 149 61 108 49 182 351 146 79 165 154 83 93 228 238 236 144 235 383 198 43
2003 43 106 96 261 122 33 85 148 173 281 120 216 136 194 262 82 66 143 145 104 116 89 183 151 190 58 165 139 195 106 192 73 115
1628 115 67 220 308 198 195 201 73 142 188 210 91 212 131 156 144 127 254 161 78 175 150 5 154 23 110 156 133 20 172 86
1276 86 131 193 273 245 80 103 165 56 69 150 94 58 61 185 321 195 67 151 173 176 244 151 181 213 130 44 200 154 41 97 155 34
900 34 87 149 61 165 200 85 54 46 45 54 256 249 300 185 105 138 225 165 7 1 51 84 69 150 73 120 134 132 191 280 34 171 198 118 111 141
477 141 129 150 166 68 37 148 201 301 220 66 234 77 6 152 57 168 86 146 92 100 180 103 142 103 280 250 277 93 177 95 20
114 20 66 204 151 194 198 96 144 172 211 323 123 265 103 94 72 160 211 328 233 207 204 17 78 245 212 147
-192A47
##PAGE=	F1=-14920.3
##FIRST=	25164.767445380970457,	5806.2096540000038658,	0
##DATA TABLE=	(F2++(Y..Y)), PROFILE
5806 250 132 66 114 29 115 69 169 159 195 152 123 95 238 148 73 99 192 200 156 123 170 72 136 115 243 78 21 147 214 239 150 62
5431 62 18 138 86 187 26 189 152 191 264 175 187 201 186 202 211 211 159 242 190 67 171 160 193 239 143 94 168 133 201 198 99 67 56 231
5032 231 203 49 86 14 129 247 99 94 133 238 64 216 104 94 140 18 138 66 130 130 35 210 176 163 112 49 164 225 130 67
4679 67 151 51 85 142 189 187 146 243 330 411 108 38 155 152 27 205 212 179 115 114 108 80 94 62 127 178 95 27 93 141 215 285 75 181
4280 181 289 203 162 212 149 65 159 120 233 79 191 175 196 166 116 190 188 41 54 111 229 90 75 176 92 205 135 231 292 152
3928 152 140 112 61 47 53 106 137 77 138 71 234 151 82 134 246 55 85 128 186 142 138 72 77 151 236 267 217 156 136 171 26 197 46
3541 46 149 50 25 40 86 84 79 70 24 161 53 25 127 186 36 95 176 205 298 101 281 79 190 206 249 138 279 184 89 136 102
3177 102 47 46 70 77 33 110 105 129 254 304 385 80 243 164 66 169 182 92 113 115 98 100 117 180 243 191 241 302 123 126 174 210 63 82 140
2766 140 100 216 195 105 122 74 88 223 145 176 145 192 62 124 132 133 134 153 224 205 187 72 128 91 148 110 157 92 105 159 101 112 111 112 127
2355 127 181 265 162 154 227 109 95 240 177 104 141 55 76 59 142 294 118 102 132 155 98 123 253 229 240 60 266 352 171 72 41
1992 41 78 206 90 48 116 119 134 330 107 177 158 216 285 135 109 183 143 103 130 111 263 247 209 82 171 139 142 124 194 60 131 91
1616 91 251 325 130 157 245 68 97 109 187 33 215 89 109 166 180 245 181 45 184 130 55 129 45 151 157 73 44 141 68 121 154
1252 154 266 253 60 83 159 23 42 191 107 105 140 165 327 211 25 105 175 132 207 152 178 231 139 47 171 76 43 109 145 35 108
888 108 203 74 143 188 83 3 34 82 87 281 279 283 194 164 175 210 215 100 27 47 48 130 205 44 134 147 141 175 248 90 45 172 115 81 112
477 112 77 180 187 91 70 189 158 309 222 72 247 111 71 213 68 165 83 87 118 53 100 106 166 117 284 291 254 115 202 106 11 103
102 103 241 169 135 171 139 135 196 182 289 114 226 81 127 72 170 181 295 257 230 186 48 69 231 193 162
-192A62
##PAGE=	F1=-15022.6
##FIRST=	25164.767445380970457,	5806.2096540000038658,	0
##DATA TABLE=	(F2++(Y..Y)), PROFILE
5806 250 117 50 104 25 81 87 220 175 207 164 121 124 257 126 69 57 166 213 176 115 130 82 141 85 157 43 13 146 172 250 236 16
5431 16 11 130 131 146 93 202 119 221 327 228 147 204 261 266 194 219 210 289 220 62 210 178 205 188 78 100 115 190 276 217 64 53 106
5043 106 262 219 47 76 70 154 294 112 104 127 203 79 196 101 130 182 15 136 75 145 174 27 224 209 156 109 71 149 223 141 58
4679 58 204 126 49 146 204 199 143 251 330 397 99 17 138 187 16 256 227 210 97 94 78 74 117 97 146 212 113 33 69 109 197 299 109
4292 109 233 301 162 180 260 116 103 165 131 250 113 158 158 207 137 112 201 188 53 103 78 209 85 111 217 119 232 140 252 357
3940 357 168 134 165 104 53 54 81 140 82 115 64 224 156 89 155 216 77 87 160 245 181 181 133 63 153 196 205 189 202 171 175 69 205 36
3541 36 106 61 113 67 89 93 85 81 47 108 36 44 106 150 76 91 200 203 329 95 282 133 84 165 247 121 256 177 137 158 69 103 37 59
3142 59 38 63 166 87 166 262 285 336 73 192 83 35 122 167 69 129 158 94 125 41 165 201 189 258 285 133 86 202 198 57 97 103
2766 103 56 230 205 122 129 57 99 197 140 181 173 228 119 134 105 123 129 149 227 189 149 93 71 81 135 79 155 104 119 194 151 125 153 52 87
2355 87 159 271 153 92 205 73 79 209 202 95 122 49 54 59 115 213 64 126 83 133 115 161 259 193 219 27 240 286 146 105 51 64
1980 64 128 50 83 141 86 102 307 86 121 176 211 275 178 141 210 164 97 126 148 340 330 208 107 190 132 72 142 171 44 154 101 260
1604 260 325 117 165 265 61 49 28 176 39 210 54 73 165 183 274 212 48 167 108 101 108 97 202 200 75 77 115 68 84 98 234
1240 234 236 34 59 145 53 56 228 111 141 188 145 311 203 14 71 159 87 166 157 175 244 143 48 159 23 56 114 124 46 122 235
876 235 75 120 175 94 45 83 115 121 296 277 243 196 221 212 175 248 187 57 136 13 191 262 13 147 161 163 170 209 163 58 135 100 80
489 80 68 10 201 193 122 99 211 110 305 215 69 247 141 134 257 77 135 63 59 142 6 106 140 167 123 277 309 210 125 212 121
125 121 26 128 249 180 88 156 153 101 200 153 244 98 182 47 143 71 198 186 249 271 241 158 88 61 191 152 162
-192A62
##PAGE=	F1=-15124.8
##FIRST=	25164.767445380970457,	5806.2096540000038658,	0
##DATA TABLE=	(F2++(Y..Y)), PROFILE
5806 223 100 34 87 64 53 119 270 178 186 164 97 160 269 115 58 14 136 228 200 113 95 75 131 72 64 55 32 138 120 260 310 57
5431 57 14 121 151 155 191 185 68 278 365 251 113 193 307 309 159 188 213 303 245 61 230 178 209 121 29 112 51 242 332 202 51
5067 51 102 171 277 213 43 77 105 179 315 116 111 122 143 87 165 100 164 196 29 99 92 158 212 45 231 239 129 112 106 136 208 120 32
4679 32 240 180 19 144 185 205 137 244 303 344 82 69 116 218 4 287 219 241 86 91 72 64 132 128 158 232 123 32 57 104 156 279
4304 279 127 252 290 109 207 287 93 135 170 118 247 140 122 149 196 95 111 195 186 82 153 50 173 84 160 245 148 234 131 241
3952 241 402 208 128 204 149 132 80 72 121 78 93 71 202 148 100 173 203 141 93 169 284 204 210 184 49 156 154 140 178 253 218 190 111
3564 111 208 13 66 105 234 179 91 117 81 75 69 57 7 49 89 133 100 81 211 189 329 67 273 179 13 121 234 107 203 160 179
3200 179 190 40 156 72 37 15 136 236 76 190 271 242 250 67 129 25 17 68 158 38 128 186 95 167 111 130 154 256 211 159 143
2837 143 60 222 193 85 93 90 48 231 225 127 108 61 95 154 111 164 185 259 173 139 74 94 113 139 204 149 95 102 31 64 108 54 175 109 124
2426 124 216 180 128 169 60 84 153 271 133 75 177 61 82 161 183 89 100 44 40 58 101 129 4 148 55 98 131 198 246 139 184
2062 184 103 71 191 129 119 99 62 64 45 120 153 65 101 174 55 66 184 180 238 195 145 213 197 91 108 192 393 376 191 130 214 130 28
1675 28 146 124 30 160 92 238 308 126 166 257 57 32 43 187 96 197 26 85 156 149 307 253 122 128 89 124 96 122 251 264 140
1311 140 96 103 85 67 51 189 208 6 47 124 83 90 251 105 148 197 124 277 177 50 88 135 71 126 147 179 247 135 58 176 82
947 82 77 116 107 64 123 238 59 99 154 106 75 131 135 142 303 242 181 187 264 236 129 261 248 86 218 33 228 310 35 158 180 183 166
560 166 166 185 118 104 85 109 49 61 206 186 150 115 205 67 285 190 55 234 168 174 272 82 91 63 95 154 44 187 165 149 115 254
184 254 298 156 111 203 147 67 137 232 184 58 152 136 73 182 139 190 96 144 24 140 69 230 200 191 265 232 125 113 53 131 100 150
-192A50
##PAGE=	F1=-15227.1
##FIRST=	25164.767445380970457,	5806.2096540000038658,	0
##DATA TABLE=	(F2++(Y..Y)), PROFILE
5806 174 87 51 66 122 82 142 288 168 149 159 51 198 277 114 42 26 112 242 221 104 65 66 114 83 50 89 51 115 65 264 360
5442 360 112 20 117 143 203 268 144 29 339 375 248 125 171 313 322 118 127 175 280 256 58 235 164 199 64 106 130 15 283
5102 283 354 151 78 150 224 266 186 70 82 116 199 299 115 118 129 70 82 121 97 189 182 72 58 113 170 241 77 231 256 89 126 147
4726 147 131 183 67 43 247 204 49 137 136 210 129 225 256 257 73 124 91 235 42 292 188 273 112 107 109 51 134 151 161 228 119 20
4351 20 69 140 103 229 124 230 256 53 227 291 72 158 168 87 224 153 95 150 166 54 111 178 180 95 181 38 124 77 197 256 161
3987 161 211 119 199 411 241 132 221 170 189 97 84 83 71 82 77 175 121 103 187 208 184 96 153 296 206 219 216 38 161 123 81 173 295
3600 295 270 212 146 210 45 54 147 329 278 94 148 76 54 74 50 72 26 87 140 109 78 206 167 300 47 256 210 65 74 219 117
3236 117 126 137 210 216 12 180 102 11 22 177 282 77 186 276 187 157 64 72 28 80 69 161 13 113 192 95 196 207 80 113 452
2872 452 528 164 150 60 226 210 137 76 89 68 218 243 118 62 82 83 105 74 132 180 280 213 137 51 62 91 125 164 97 46 99 42 55
2484 55 74 89 201 109 126 220 179 125 149 100 106 155 263 107 109 146 102 86 109 129 77 79 45 35 61 99 68 49 165 83 60 144 229 215 84
2074 84 146 326 290 92 124 111 133 59 106 102 173 152 64 395 247 20 52 175 134 192 181 128 188 219 95 97 234 413 375 164 149
1710 149 233 141 83 132 64 26 143 72 193 279 133 150 229 65 58 96 213 136 180 20 146 158 105 329 301 206 98 74 123 95 116
1346 116 286 322 199 93 94 110 106 87 149 189 26 59 99 98 110 251 94 129 171 102 229 140 85 134 115 101 99 116 192 234 111 85 208
959 208 132 102 124 105 81 113 214 39 81 120 109 96 168 138 150 300 176 101 167 285 240 95 258 280 109 273 56 232 341
618 341 67 164 197 184 149 125 169 163 137 81 135 85 118 191 172 168 116 174 48 251 139 63 209 194 183 255 82 70 120 144 154 78 251
231 251 165 133 97 212 262 114 69 171 180 116 130 210 188 44 155 92 110 147 146 131 120 125 38 131 67 253 198 123 233 202 96 130 48
-156 48 65 64 130
-192A30
##PAGE=	F1=-15329.3
##FIRST=	25164.767445380970457,	5806.2096540000038658,	0
##DATA TABLE=	(F2++(Y..Y)), PROFILE
5806 113 88 84 67 190 147 148 264 146 123 149 11 231 282 128 31 61 109 250 234 81 58 82 105 104 118 114 53 65 45 256 378 153
5431 153 34 124 111 242 312 86 128 391 356 233 170 144 283 309 81 57 114 224 243 49 231 146 178 99 193 146 77 306 340
5090 340 78 111 176 243 228 150 114 81 107 209 245 117 127 148 44 68 70 83 202 148 113 101 134 181 260 106 221 253 53 142 180
4726 180 138 150 29 107 225 200 92 127 75 213 128 200 204 151 90 163 68 237 97 272 138 300 170 122 153 43 134 167 152 199
4374 199 99 34 90 181 66 165 102 168 201 30 233 276 50 164 153 47 185 148 96 155 123 39 112 156 164 89 186 43 71 68 216
4010 216 249 154 167 111 139 384 247 141 218 160 221 97 93 34 88 91 72 151 75 97 193 212 190 102 123 279 189 213 226 43 164 114
3635 114 41 157 317 317 235 168 216 106 72 181 386 346 98 179 84 41 58 80 153 26 97 157 105 80 187 144 253 58 233 220
3283 220 90 30 205 145 35 108 221 226 19 175 116 28 26 182 293 82 149 271 136 105 66 63 38 133 119 177 46 93 173 95
2931 95 193 280 27 83 778 1188 565 158 92 210 239 194 55 87 89 190 250 91 18 113 71 66 46 98 161 287 230 131 77 54 78
2567 78 107 133 49 64 92 55 63 36 143 217 107 125 205 150 129 96 125 122 155 250 81 130 116 163 73 65 63 59 64 52 44 72 102 61 80 176 115
2132 115 34 156 250 169 47 103 698 833 97 141 92 151 41 183 163 246 145 93 887 694 25 84 151 102 167 140 116 140 216
1792 216 113 115 267 400 329 137 158 237 156 130 99 34 33 108 56 146 241 122 127 198 83 74 145 239 153 159 44 226 174 79 334 343 274
1405 274 130 60 102 102 80 300 357 231 70 76 138 148 150 133 192 57 78 73 101 110 225 83 91 126 74 170 98 114 176 107 137 103 71 207
1006 207 200 82 129 238 160 123 136 107 89 104 173 43 64 70 96 110 194 125 146 283 98 36 135 280 219 103 248 287 118 293 64
642 64 207 351 95 161 201 158 119 85 143 209 205 88 144 123 153 161 156 169 105 140 56 207 60 114 174 219 161 207 75 98 195 190 147 97
243 97 275 145 153 76 156 214 109 7 118 210 169 114 202 202 43 157 34 174 102 163 72 157 128 48 135 65 257 174 55 181 157
-121 157 92 143 45 25 79 106
-192A06
##PAGE=	F1=-15431.6
##FIRST=	25164.767445380970457,	5806.2096540000038658,	0
##DATA TABLE=	(F2++(Y..Y)), PROFILE
5806 54 106 109 92 260 214 139 200 115 123 132 76 259 288 161 42 95 129 245 234 65 97 117 109 123 163 123 28 22 104 232 363 171 50
5419 50 133 61 252 313 45 242 430 313 224 209 120 228 285 54 57 62 146 201 47 221 130 156 169 258 149 132 310 300 45 132
5067 132 174 217 169 120 157 68 81 203 163 129 136 161 97 48 52 52 201 109 136 174 153 187 266 124 199 226 50 147 195 151 120 110 177 189
4668 189 175 129 119 33 214 139 174 176 83 126 178 50 232 164 233 79 315 234 123 180 52 147 180 132 158 63 70 108 206 96 118 70
4292 70 77 129 77 226 249 40 148 122 22 140 124 116 157 79 53 112 135 135 77 171 47 26 67 218 224 128 108 110 78 330 220 144 200
3905 200 124 226 81 83 48 142 120 55 130 37 92 192 207 158 113 98 237 158 198 219 65 161 115 54 120 311 347 254 174 228 171 91
3529 91 203 397 371 97 205 108 68 25 104 231 91 104 162 94 79 163 129 202 69 200 210 88 6 199 172 57 77 209 214 46
3177 46 146 117 59 20 163 273 88 97 252 107 117 70 86 34 154 154 196 91 79 130 99 154 315 48 79 1187 2002 1048 183
2837 183 144 179 263 243 36 80 108 152 242 48 65 148 67 52 41 71 137 279 222 124 131 80 92 87 139 39 122 84 48 74 10 182 213
2449 213 104 123 177 106 148 57 135 121 149 232 66 124 91 221 43 36 55 40 55 68 64 90 109 84 88 175 121 42 163 257 115 52 50 1168
2050 1168 1485 187 194 79 159 21 244 204 322 136 148 1491 1239 51 119 121 120 181 80 143 75 181 140 150 285 359 250
1733 250 122 155 219 161 153 59 86 49 65 57 123 200 82 130 180 101 74 194 258 147 138 74 304 197 84 319 365 310 190 45 71
1369 71 113 26 287 361 230 39 47 163 161 199 142 209 80 94 56 94 96 175 85 47 85 38 103 51 130 205 114 158 129 29 215 150 90
982 90 180 263 167 137 144 93 88 105 129 66 49 15 69 119 206 109 134 248 59 93 97 253 175 138 233 278 110 274 61 163 341 122 150
595 150 188 107 89 47 119 230 250 100 133 142 161 122 140 157 83 140 65 161 40 176 134 239 115 137 66 131 265 235 138 104 258 128
219 128 208 73 99 167 130 73 55 226 219 110 205 224 58 151 35 223 64 182 61 192 143 48 152 63 239 135 45 121 108
-121 108 116 155 44 53 104 80
-192H0
##PAGE=	F1=-15533.9
##FIRST=	25164.767445380970457,	5806.2096540000038658,	0
##DATA TABLE=	(F2++(Y..Y)), PROFILE
5806 6 130 116 116 318 270 122 113 88 132 108 132 280 293 204 60 130 157 223 219 88 150 146 118 136 180 117 25 128 180 198 323 167 54
5419 54 132 16 231 274 87 343 452 253 229 223 105 163 268 32 118 78 61 137 63 208 120 147 221 287 132 177 298 246 109
5078 109 135 157 147 101 109 191 41 49 180 68 148 144 157 135 24 96 11 184 86 132 226 170 180 257 126 168 176 64 140 183 159 113 190
4691 190 236 160 142 156 117 48 206 155 153 190 147 164 167 47 229 228 189 23 312 285 111 183 73 180 189 101 137 25 102 118 214 157
4316 157 123 45 44 48 118 214 219 59 113 79 43 100 85 130 153 59 62 113 120 103 84 140 42 8 80 203 185 89 57 111 41 265 164 137 176
3905 176 77 210 57 48 114 208 158 46 113 79 101 184 198 99 121 97 181 124 181 200 90 152 106 93 67 275 352 266 168 244 224 101
3529 101 208 366 350 89 226 139 108 14 119 290 155 99 147 84 71 144 126 158 65 156 181 74 26 203 185 132 51 175 182 70
3177 70 107 109 85 13 141 235 107 91 225 110 125 76 92 28 133 155 204 133 75 68 112 101 309 102 109 1594 2797 1508 227
2837 227 204 145 271 275 19 68 122 124 216 34 111 175 72 57 51 58 118 260 193 122 181 118 119 67 176 63 177 81 23 78 44 193 196
2449 196 101 115 139 76 176 135 155 102 136 208 71 101 84 264 29 44 96 24 46 96 87 110 120 101 83 162 101 72 165 250 65 73 26
2062 26 1645 2123 259 268 85 165 36 278 213 381 128 211 2086 1765 72 149 102 160 212 25 193 20 119 167 181 288
1757 288 300 159 119 141 175 148 156 41 133 69 33 69 127 155 47 179 176 108 65 239 267 124 121 106 362 215 106 285 355 308 233
1393 233 28 39 120 32 251 335 199 49 41 182 141 225 155 223 91 109 54 82 77 116 103 31 79 43 28 3 130 221 133 160 155 20
1017 20 213 95 138 230 285 161 137 141 55 81 119 94 88 34 62 42 123 206 109 113 201 106 159 58 213 114 169 213 258 84 229 48 117
630 117 312 148 135 163 41 82 11 89 208 254 113 109 141 143 82 122 143 55 173 65 126 148 225 100 248 78 59 62 146 314 276
266 276 129 104 216 140 269 98 70 132 147 153 76 220 259 139 197 246 85 130 83 240 57 201 120 218 157 64 168 57 201
-74 201 93 92 78 74 145 167 44 69 107 52
-192E2
##PAGE=	F1=-15636.1
##FIRST=	25164.767445380970457,	5806.2096540000038658,	0
##DATA TABLE=	(F2++(Y..Y)), PROFILE
5806 25 150 103 123 352 310 108 61 88 125 82 170 292 292 242 75 163 177 187 192 125 195 158 124 143 176 98 101 246 251 159 265 143 37
5419 37 119 57 192 204 148 412 448 183 237 206 102 104 262 4 169 125 12 65 89 201 121 152 241 270 92 209 280 187 168 120
5067 120 149 52 34 116 215 6 52 139 31 162 148 130 141 14 137 63 155 86 98 240 184 156 232 114 138 109 67 138 143 150 134 241
4691 241 270 152 109 166 120 58 187 163 143 230 235 193 135 59 227 272 154 37 291 308 95 160 94 217 189 69 159 62 122 120 206
4327 206 213 154 48 138 44 138 205 194 87 66 31 61 77 39 124 138 77 57 115 116 89 109 106 32 12 104 174 136 51 56 109 49 204 93 133
3916 133 147 62 181 38 21 175 263 193 64 97 133 119 169 196 30 113 107 122 100 162 171 111 141 81 132 31 216 331 267 154 258
3553 258 253 107 192 302 287 76 243 168 135 45 129 314 203 88 112 84 57 135 132 125 66 117 140 60 32 217 185 179 37 131 135 85 71
3165 71 98 104 15 136 196 146 143 209 129 101 83 71 25 84 119 190 161 81 15 137 102 267 143 146 1903 3389 1843 276 257 125
2813 125 260 286 17 61 126 128 178 99 139 181 89 75 72 66 112 233 151 122 213 163 139 48 214 82 215 83 10 74 81 174 181 99 99 98 80
2402 80 199 242 207 71 112 171 83 80 95 282 61 78 118 14 34 129 103 128 138 114 83 140 69 109 161 229 46 90 86 2022 2612 295
2027 295 338 98 175 49 279 184 404 122 256 2534 2157 96 179 102 185 232 61 231 65 43 184 202 279 235 90 125 124
1710 124 111 115 147 61 161 87 35 79 137 110 114 246 175 100 57 265 264 93 110 137 388 221 132 238 311 274 240 13 13 113 79 200
1334 200 289 151 86 85 195 95 232 157 223 89 129 70 70 65 69 129 58 105 107 72 61 121 225 156 147 169 31 201 56 180 269 304 152
947 152 125 128 27 84 138 76 105 19 117 43 124 195 129 83 158 152 197 25 174 55 189 188 232 56 184 30 88 269 167 125 140 31
571 31 102 25 56 154 222 127 87 122 105 52 97 140 51 205 62 117 245 246 86 244 97 12 72 137 335 304 114 102 168 172 319 134
196 134 101 112 145 221 154 193 280 190 162 256 115 95 116 224 77 219 185 232 165 109 171 48 155 60 122 72 68 168 177 42 67 87
-180 87 23
-192B3
##PAGE=	F1=-15738.4
##FIRST=	25164.767445380970457,	5806.2096540000038658,	0
##DATA TABLE=	(F2++(Y..Y)), PROFILE
5806 43 161 76 110 355 330 105 124 122 102 74 183 290 278 260 86 183 179 144 156 148 221 150 123 146 160 74 190 351 300 118 195 106
5431 106 21 115 107 148 123 200 436 413 112 232 168 106 59 258 29 203 164 63 56 110 209 137 154 230 214 38 229 269 133 204 97
5067 97 163 84 35 130 230 38 103 85 103 163 149 95 118 51 152 129 121 94 46 216 192 114 194 95 122 50 58 160 80 120 161 250 269 149
4668 149 77 161 129 51 160 159 144 272 297 208 92 73 213 279 130 70 258 296 85 119 102 239 175 50 199 122 129 118 188 250 172
4304 172 66 213 112 134 201 179 108 28 15 65 73 7 96 111 104 45 120 124 103 130 95 37 2 131 134 86 26 84 105 81 162 36 150 108
3905 108 90 148 41 82 220 291 216 90 79 164 138 151 199 33 87 107 75 94 136 132 120 129 45 160 73 145 287 253 137 255 251 110
3529 110 159 219 195 81 259 189 140 52 133 300 226 87 68 90 45 131 144 96 93 119 94 55 32 237 179 192 30 105 84 92 48 86 116
3142 116 23 146 161 195 187 216 146 59 91 36 25 114 54 158 170 99 83 168 160 203 165 167 2034 3628 1974 308 290 129 233 274
2790 274 33 66 120 155 135 172 152 162 118 111 97 91 121 199 108 124 223 213 144 35 233 91 230 90 36 73 109 134 186 99 71 58 91
2402 91 207 337 279 41 76 121 87 65 100 270 92 108 112 31 17 158 107 142 158 127 98 117 66 148 148 194 61 105 140 2207 2842
2038 2842 295 381 102 192 42 249 122 384 115 269 2724 2325 130 213 100 180 230 110 242 115 39 187 214 263 175
1745 175 93 138 111 49 68 138 76 170 94 49 82 143 75 200 299 177 76 57 262 247 70 109 164 379 208 155 188 242 228 213 16
1381 16 16 93 105 149 240 104 112 129 203 51 224 149 209 78 153 96 78 66 63 151 84 131 179 162 123 114 217 171 125 168 29 186 59
994 59 191 291 318 145 101 114 72 106 159 76 119 5 151 63 122 176 154 46 145 169 202 5 151 61 197 162 205 70 172 36
642 36 85 215 177 125 132 90 121 56 53 107 176 139 88 95 58 59 59 150 95 218 61 132 316 233 91 231 143 64 93 112 326 310 92 96 134
231 134 200 348 164 154 103 122 264 219 148 274 240 99 244 140 61 136 182 97 232 234 233 164 161 158 35 115 40 122 77 73 180 181 35
-156 35 70 61 0
-192@
##PAGE=	F1=-15840.6
##FIRST=	25164.767445380970457,	5806.2096540000038658,	0
##DATA TABLE=	(F2++(Y..Y)), PROFILE
5806 54 156 44 83 326 331 113 196 166 84 94 174 269 251 254 96 180 160 103 120 146 227 126 113 146 141 53 278 425 316 78 116 72
5431 72 81 146 146 108 73 234 417 347 51 205 120 112 31 243 62 220 183 85 106 117 233 170 142 198 135 26 239 274 89 221 82
5067 82 182 180 83 142 236 82 163 66 152 148 147 100 90 95 134 184 92 101 41 162 185 61 149 90 119 79 57 200 26 71 171 218 232 128
4668 128 61 145 141 60 132 146 148 301 324 207 49 82 177 240 105 86 224 257 84 69 95 234 144 62 228 182 126 113 160 261 167
4304 167 81 252 158 114 202 174 113 36 49 59 68 40 70 74 123 40 130 141 130 133 124 61 26 155 88 50 20 101 98 118 151 70 186 51 113
3893 113 121 54 144 241 286 223 109 70 158 150 129 195 81 47 92 56 94 102 82 119 119 36 172 119 84 230 221 113 225 217 115 115 134 98 124
3482 124 274 197 120 28 130 251 221 102 46 93 51 122 159 68 131 163 59 61 43 260 178 173 17 117 45 92 42 71 120 36 156
3118 156 128 240 197 232 148 59 100 55 50 221 33 119 153 126 152 195 209 140 166 163 1947 3449 1870 311 298 139 196 245 46
2778 46 80 115 178 98 235 164 125 155 154 118 119 141 162 78 132 217 262 133 44 230 94 218 101 49 82 122 98 209 98 34 23 84
2402 84 195 400 341 40 35 65 82 48 83 227 111 122 87 59 7 177 100 147 174 143 123 104 97 180 127 149 76 121 171 2152 2766 273
2027 273 384 92 214 38 196 67 329 102 241 2605 2233 173 249 74 145 207 144 221 143 106 175 216 244 131 131 157 104
1710 104 78 16 140 71 168 85 58 81 152 85 265 318 187 43 68 231 220 78 122 185 336 176 169 144 161 199 163 27 52 74 108
1346 108 108 200 85 120 160 210 56 213 145 183 64 171 125 118 85 73 159 101 142 240 241 181 120 199 169 101 156 18 178 83 162 294
970 294 322 140 72 106 115 137 175 94 130 21 160 77 118 155 170 40 161 155 180 3 149 103 193 138 180 113 195 76 101 159 181 132
595 132 136 128 127 87 89 103 136 147 110 68 22 97 16 158 152 209 69 153 351 193 97 215 173 92 116 80 290 288 66 82 113 210 356 181
196 181 206 95 84 277 253 93 238 274 40 205 154 66 148 129 100 232 262 220 153 198 131 28 99 28 97 65 73 181 177 27 98
-168 98 66 9
-192I
##PAGE=	F1=-15942.9
##FIRST=	25164.767445380970457,	5806.2096540000038658,	0
##DATA TABLE=	(F2++(Y..Y)), PROFILE
5806 63 135 21 52 272 316 126 248 202 95 121 156 229 216 228 107 150 123 80 97 120 217 88 91 147 121 49 358 459 296 69
5454 69 49 78 154 195 166 81 91 247 363 262 42 159 79 113 11 207 86 222 181 79 137 109 262 220 114 162 71 65 241
5114 241 291 58 226 79 184 244 121 146 234 123 215 129 172 118 146 163 110 135 89 211 76 107 96 96 155 56 102 112 112 132 81 234
4738 234 75 11 156 161 174 80 89 129 148 98 116 132 145 305 313 193 21 85 117 161 70 84 198 210 85 22 77 201 100 82 238
4374 238 237 123 106 124 242 141 90 251 175 94 210 177 101 46 67 49 48 56 88 28 130 54 144 161 157 112 168 86 55 169 53 56 15
3987 15 102 94 150 165 121 222 28 117 101 64 184 236 252 212 117 82 119 155 108 177 114 33 70 62 93 59 25 114 115 70 180 152 59 172
3588 172 170 74 162 167 121 71 63 70 191 285 190 82 24 121 182 193 117 68 84 79 104 175 55 157 209 59 79 68 281 190 132 20 136
3200 136 37 88 51 54 118 54 161 89 268 171 235 127 98 106 108 96 325 103 90 113 153 209 217 221 108 149 142 1659 2884 1559 279
2837 279 280 140 154 204 49 96 128 179 81 277 182 107 187 190 126 135 163 123 74 150 210 298 117 72 212 95 188 118 48 96 116 103 237
2449 237 95 32 14 59 164 416 368 63 38 50 79 28 39 160 132 117 66 84 27 184 85 142 182 157 149 109 120 195 98 99 81 139 176
2062 176 1868 2409 248 346 68 236 82 136 118 263 77 179 2204 1906 216 281 40 96 171 162 175 148 154 151 206 222 111
1745 111 157 185 102 151 43 154 43 162 67 61 86 172 132 297 303 205 51 87 181 187 108 143 200 270 131 166 113 85 199 118 40 99
1369 99 83 94 85 166 98 115 176 217 84 207 157 155 50 169 149 173 118 68 147 108 128 276 292 227 138 171 151 74 132 13 181 111 99
982 99 279 314 131 43 104 137 164 180 117 130 43 142 83 114 140 173 83 176 119 144 22 160 122 178 119 161 149 218 125 126 128 193 140 138 140 115
560 115 113 138 110 116 148 130 52 53 141 60 152 199 185 84 168 348 137 92 201 177 103 136 52 237 242 56 58 90 201 345 178 247 78
172 78 39 258 246 41 178 286 86 143 158 106 158 82 83 216 265 197 133 210 97 40 105 25 53 37 66 172 165 36 132 91 11
-192A1
##PAGE=	F1=-16045.1
##FIRST=	25164.767445380970457,	5806.2096540000038658,	0
##DATA TABLE=	(F2++(Y..Y)), PROFILE
5806 68 96 26 27 205 284 141 276 221 119 140 147 180 185 192 119 96 76 84 101 82 201 38 52 147 98 63 422 459 247 124 102 126 219
5419 219 236 159 96 109 238 290 182 81 100 52 107 7 149 96 209 158 54 137 89 282 277 83 140 76 82 230 309 39 222 79
5067 79 163 263 147 138 223 151 246 209 167 81 147 244 177 159 31 204 71 118 137 51 103 119 59 146 90 159 111 248 125 47 119 131
4691 131 134 50 142 118 143 138 117 129 128 276 269 170 31 78 71 79 29 69 181 184 84 30 70 150 51 93 233 286 124 98 87 199 107 94 217
4280 217 163 95 225 183 72 44 70 53 17 50 132 19 122 73 157 180 181 72 200 103 80 166 58 83 23 95 96 166 185 160 244 115
3905 115 112 84 67 192 211 201 185 117 113 74 154 88 148 139 76 62 73 94 27 44 114 120 103 210 176 69 125 107 22 77 125 128 35 27 129 258
3482 258 284 165 35 96 120 112 147 112 94 66 117 80 188 76 162 233 81 105 95 296 210 84 55 133 38 85 68 40 112 71 158 47
3107 47 269 119 210 87 122 109 154 144 390 150 69 61 168 248 237 194 117 120 125 1235 2063 1117 215 246 127 113 158 39 113 153
2754 153 156 95 292 203 139 198 207 117 131 173 82 97 172 214 311 107 108 189 94 157 141 48 106 92 148 253 93 77 37 29 117 380 346 88
2355 88 78 100 102 38 26 91 166 100 75 98 48 181 72 127 178 163 171 122 116 187 67 50 79 156 158 1420 1863 234 274 34 252 136
1980 136 101 197 216 47 97 1619 1425 253 298 92 83 135 167 127 131 180 124 182 199 119 168 219 106 215 89 177 9 153 65 61
1628 61 105 202 180 296 264 218 102 116 129 159 135 159 205 196 93 146 94 38 210 109 57 149 113 78 82 130 117 114 184 225 103 211 180
1240 180 135 33 141 161 226 155 47 114 105 86 280 308 258 160 135 119 39 99 24 192 145 59 247 298 118 20 106 138 175 168 132 113
865 113 62 107 89 112 137 164 127 170 75 112 59 173 109 150 100 142 161 223 175 155 143 220 150 131 127 90 128 187 105 115 140 133 57 89 179 122
442 122 130 227 155 100 170 312 84 77 192 160 117 149 36 177 182 72 30 59 180 317 155 269 45 6 213 201 48 105 276 147
90 147 77 160 144 162 58 51 189 249 163 112 194 69 61 112 41 9 37 63 153 143 58 156 106 43
-192D3
##PAGE=	F1=-16147.4
##FIRST=	25164.767445380970457,	5806.2096540000038658,	0
##DATA TABLE=	(F2++(Y..Y)), PROFILE
5806 70 46 55 9 137 237 153 284 217 131 149 160 152 162 158 127 33 43 105 119 54 184 19 17 143 68 84 467 440 183 195 184 177 259 253
5407 253 128 153 92 207 215 140 116 53 43 96 24 75 97 182 119 30 109 59 284 329 87 133 102 68 199 314 31 209 67 125 239
5043 239 157 116 204 164 250 277 142 49 149 318 249 163 47 164 66 139 151 70 54 185 32 173 50 150 131 235 150 90 68
4703 68 166 160 118 188 110 119 162 131 138 96 217 200 141 44 66 119 125 49 46 165 184 79 64 94 108 35 87 216 321 131 91 64 146 80 91
4292 91 164 131 113 249 193 38 59 66 74 62 27 167 63 95 89 165 190 201 30 206 106 94 146 80 106 46 93 109 160 201 189 247 203
3905 203 120 73 66 165 172 148 148 113 145 96 146 73 125 158 120 83 82 111 64 100 123 134 128 266 194 83 88 48 66 76 124 138 37 45 176 308
3482 308 263 122 21 169 146 59 86 83 104 59 156 58 186 105 145 224 99 127 119 302 229 55 89 99 36 83 86 38 103 77 144 17
3107 17 243 54 158 66 119 110 183 179 403 163 39 48 167 267 263 140 139 91 130 768 1164 657 131 208 107 76 113 19 137 174
2754 174 110 125 281 214 183 178 196 93 103 161 41 127 191 226 294 105 142 174 89 146 174 63 110 57 199 252 97 120 58 33 63 296
2379 296 280 109 104 152 146 60 103 75 204 86 100 96 64 167 67 103 161 153 178 127 83 151 55 21 79 166 134 906 1255 226 183 6
2003 6 259 174 105 247 197 59 22 984 904 278 291 179 126 112 159 116 98 188 102 145 177 146 170 252 113 258 122 200 58 139 90
1639 90 62 133 231 211 273 225 211 150 149 93 141 142 156 201 128 90 114 84 59 210 126 74 190 138 73 98 85 130 131 194 233 118 225 197 125
1229 125 9 87 158 264 184 21 65 94 20 254 285 271 177 95 83 7 77 55 200 178 121 201 280 108 11 111 130 171 138 129 81 74
853 74 62 104 113 142 151 154 138 55 97 107 183 71 119 80 120 145 212 222 183 185 248 165 121 99 60 125 223 101 125 119 113 81 113 204 175 98 232
419 232 128 111 155 255 57 60 189 146 151 151 32 118 123 95 39 29 156 277 114 265 25 47 154 130 98 46 248 179 67 168
67 168 169 156 51 34 159 219 125 93 158 64 77 108 62 48 80 68 125 114 78 159 107 94
-192I4
##PAGE=	F1=-16249.7
##FIRST=	25164.767445380970457,	5806.2096540000038658,	0
##DATA TABLE=	(F2++(Y..Y)), PROFILE
5806 72 37 98 30 80 175 165 277 195 125 151 185 167 143 132 129 53 63 126 129 65 172 77 67 129 33 107 489 419 120 252 238 212 268 251
5407 251 108 220 40 161 154 151 137 74 65 84 40 24 103 143 73 31 65 23 268 362 126 129 99 32 144 295 31 185 45 83 184
5043 184 149 84 180 163 226 323 106 41 146 373 304 145 95 108 60 170 135 105 87 234 38 181 2 113 133 198 145 110 23 218
4691 218 214 195 210 97 76 164 150 157 55 144 115 113 49 58 193 221 97 22 141 182 75 92 135 110 70 63 191 335 145 89 65 110 76
4304 76 86 116 97 129 273 207 40 100 67 103 133 7 182 98 47 113 163 190 210 49 186 92 93 113 89 122 65 106 131 131 209 211 234 277
3905 277 145 85 67 116 130 106 103 107 166 155 134 61 120 164 153 121 87 146 117 144 134 149 146 327 206 103 57 62 147 179 151 148 90 62 195
3494 195 329 219 66 59 226 189 31 33 61 102 86 191 43 161 118 111 183 106 135 140 296 238 57 106 50 64 82 98 43 93 67 116
3118 116 35 194 12 109 115 98 118 201 189 364 140 39 100 150 267 296 80 154 80 141 352 374 314 45 177 91 52 74 4 167
2766 167 176 54 156 248 205 198 125 160 66 57 125 13 151 202 231 249 101 168 168 76 167 216 80 111 25 238 229 112 152 78 54 24 181
2379 181 196 125 107 189 191 65 177 114 227 78 117 75 73 142 72 79 135 126 160 109 31 91 75 37 81 166 120 429 709 216 90 50 258
1992 258 182 115 250 189 111 61 434 453 284 253 255 168 110 144 149 60 185 91 101 160 181 165 271 119 280 139 218 114 114 116 70 157
1616 157 246 219 241 204 179 181 180 87 132 123 128 189 78 107 79 86 88 193 136 84 210 143 73 127 34 138 160 201 237 139 244 196 122 29 21 140
1193 140 282 199 20 14 78 61 210 227 266 183 54 49 65 120 105 195 198 192 147 263 112 7 123 122 160 93 106 51 78 17 118 116 145
806 145 142 159 91 71 89 155 195 60 107 55 97 107 198 263 204 227 262 184 113 66 37 99 231 106 135 88 75 117 122 209 206 77 215 111
407 111 119 123 188 60 51 186 154 194 144 35 62 79 106 79 38 141 232 76 231 83 82 94 54 145 56 208 176 117 183 180 140 43 73 133
8 133 183 85 81 120 80 87 92 76 84 123 80 89 80 88 146 107 150
-192A50
##PAGE=	F1=-16351.9
##FIRST=	25164.767445380970457,	5806.2096540000038658,	0
##DATA TABLE=	(F2++(Y..Y)), PROFILE
5806 76 90 146 71 45 104 180 262 174 118 152 203 200 113 114 120 104 101 135 122 103 162 123 115 104 4 131 482 402 75 275 247 222 246 242 155 276
5384 276 32 111 118 175 140 126 103 73 53 97 122 96 27 40 18 29 242 371 165 121 69 42 63 247 40 148 40 52 118 125 58 157
5008 157 162 183 342 65 49 137 400 331 110 123 61 60 206 91 129 149 256 58 164 41 61 116 145 116 107 37 242 247 244 200 84
4644 84 21 145 170 183 14 101 34 88 50 75 244 283 130 5 106 155 83 114 174 143 104 46 159 318 161 93 76 118 90 89 106
4280 106 72 133 288 223 77 144 77 131 202 44 177 120 28 155 150 175 200 93 144 62 73 74 78 130 74 135 157 87 215 229 207 323
3905 323 170 122 79 93 100 79 58 99 167 190 117 51 124 150 173 162 89 183 169 173 137 159 162 360 203 137 29 113 220 269 171 157 160 72
3506 72 187 314 154 24 89 255 226 32 77 105 94 129 216 34 111 106 76 122 104 128 163 278 234 62 95 84 119 80 105 47 80
3142 80 41 73 45 135 59 123 178 81 142 218 169 283 95 104 152 121 249 322 42 159 96 136 54 229 256 63 159 81 51 46 14 197
2766 197 157 0 178 206 178 169 61 115 75 45 71 38 160 205 219 188 88 183 167 51 210 259 79 120 21 257 186 139 168 100 61
2402 61 53 70 157 133 88 206 219 53 233 142 219 72 119 40 73 110 84 69 108 86 118 64 42 38 103 53 79 152 121 75 321 198 16
2015 16 94 250 161 108 207 172 162 101 94 160 264 185 297 183 122 122 184 33 176 89 58 150 212 154 268 119 279 141 223 164 81
1651 81 122 85 162 238 201 205 194 124 190 205 104 129 85 77 168 53 111 55 103 100 163 128 80 203 127 65 155 15 142 185 195 231 159 257
1252 257 170 118 69 74 111 280 196 27 42 61 132 164 144 243 171 17 27 132 202 164 167 192 232 97 248 130 11 144 113 159 63
888 63 67 65 76 29 120 117 139 139 143 55 88 74 192 210 114 130 28 78 57 198 294 213 256 251 199 110 54 31 61 205 108 140 72 51 154 118
466 118 187 209 90 186 103 124 77 121 73 62 175 175 224 127 32 12 60 98 117 64 139 187 98 168 147 107 45 52 178 88 161 142 159 199 177
55 177 115 30 116 106 146 48 75 97 94 91 72 80 105 159 95 53 45 86 126 123 197
-192A97
##PAGE=	F1=-16454.2
##FIRST=	25164.767445380970457,	5806.2096540000038658,	0
##DATA TABLE=	(F2++(Y..Y)), PROFILE
5806 77 137 183 113 32 38 200 244 180 137 151 199 218 69 111 100 128 140 125 107 149 155 149 139 78 42 152 439 376 59 256 206 203 201 232 232
5395 232 307 105 68 104 183 124 173 140 60 62 164 142 42 16 41 21 78 218 357 188 119 44 103 37 175 53 104 70 47 70 91
5032 91 60 140 177 151 337 27 51 122 395 328 63 124 47 70 243 30 143 187 243 73 121 67 25 89 88 78 93 66 226 239 253
4668 253 158 88 47 110 189 213 21 131 66 71 66 112 257 292 139 11 73 115 111 126 204 168 129 83 119 270 170 103 84 155 112 111 141
4280 141 54 120 282 237 113 175 87 151 257 74 160 128 106 215 131 145 166 128 101 20 39 51 51 130 80 178 186 39 225 246 172 335
3905 335 180 163 106 140 97 63 22 89 148 182 98 46 117 124 183 196 90 207 217 190 129 160 171 347 183 179 33 151 273 323 170
3541 170 162 231 88 165 269 86 84 110 250 241 56 143 176 85 168 230 23 42 72 76 70 99 113 190 247 218 62 55 167 178 75 110 48
3154 48 66 25 19 39 84 94 182 220 84 183 241 123 183 68 172 190 93 218 325 47 156 128 108 100 507 310 136 150 68 72 27
2790 27 21 218 122 42 186 163 143 100 91 109 130 101 44 62 155 201 184 129 70 188 171 19 259 295 56 144 32 250 127 169 169 122
2414 122 52 87 82 193 130 64 200 222 50 260 136 178 70 106 3 65 81 98 81 89 45 68 35 95 96 126 59 69 127 124 169 160 178 53
2015 53 136 242 123 94 129 156 195 111 159 84 219 98 294 164 131 98 195 30 166 88 22 148 230 134 237 117 260 132 217
1675 217 205 65 104 96 144 207 161 164 180 60 183 223 127 129 91 35 141 55 92 56 130 94 126 104 61 172 99 47 173 55 144 195 173
1287 173 213 167 255 122 114 104 146 79 262 177 19 75 45 174 126 54 201 136 24 37 197 283 224 116 157 237 89 228 149 38
935 38 173 96 177 96 23 101 71 62 100 115 122 138 114 66 94 47 209 227 174 166 4 70 29 212 308 215 269 223 208 110 83 36 50 158 96
524 96 139 96 89 183 104 141 187 123 153 96 134 33 71 83 91 147 183 228 104 14 42 66 70 141 82 147 148 170 94 194 120 35 101 193 108 119
102 119 97 179 208 169 87 15 146 73 114 25 82 96 91 100 63 77 112 189 109 36 11 72 111 150 223
-192B23
##PAGE=	F1=-16556.4
##FIRST=	25164.767445380970457,	5806.2096540000038658,	0
##DATA TABLE=	(F2++(Y..Y)), PROFILE
5806 71 161 194 143 29 41 217 224 208 180 148 166 208 55 134 73 118 179 105 112 196 150 150 131 82 77 165 362 329 65 201 128 161 146 215
5407 215 291 308 161 45 102 165 89 208 164 46 65 208 147 12 48 38 45 129 205 328 191 125 80 163 140 95 62 67 105 74 76 61
5032 61 80 130 203 160 312 17 45 105 361 295 20 102 36 82 272 44 151 186 194 79 59 72 48 71 39 57 86 86 173 192 220 92
4656 92 118 105 68 202 235 48 181 129 73 103 151 231 246 123 15 60 114 151 125 223 176 149 144 73 206 163 114 88 193 136 147 189
4280 189 34 92 248 241 146 187 85 154 288 94 138 127 187 282 117 104 113 154 86 30 36 65 23 125 92 224 216 15 245 260 137
3916 137 315 168 193 144 201 120 54 34 75 119 132 82 59 88 110 189 217 96 210 258 202 112 149 172 286 147 213 57 166 299
3564 299 335 148 168 286 121 140 215 91 151 126 212 226 90 192 235 79 195 232 24 43 38 109 84 99 103 223 206 193 77 33
3212 33 243 227 69 114 48 54 67 43 51 57 112 229 228 100 229 270 65 91 95 218 210 85 181 298 62 144 160 67 132 551 292 192
2837 192 140 44 105 14 47 224 81 63 178 126 115 45 175 159 198 155 88 73 139 188 127 100 58 185 173 24 301 313 56 185
2484 185 37 221 61 196 159 140 44 105 146 231 120 60 172 195 78 253 98 122 88 86 49 54 71 107 98 84 39 76 116 130 173 140
2109 140 60 49 96 124 252 153 156 89 172 237 92 97 44 159 204 94 162 66 161 46 249 120 128 76 179 35 148 80 7 146 227
1745 227 105 182 118 225 114 203 235 102 72 94 104 158 105 116 158 12 171 236 144 128 170 88 108 80 50 81 154 78 89 71 48 130
1369 130 79 37 178 80 141 191 142 179 154 235 60 115 125 196 53 236 148 11 89 35 174 100 60 147 85 55 64 250 340 275 52
1006 52 101 215 133 199 158 73 204 69 200 157 25 129 65 82 60 115 101 136 85 91 87 28 200 239 213 191 23 75 52 225 303 218
630 218 265 192 213 123 127 39 83 111 74 134 132 142 198 86 75 150 158 126 80 148 51 64 91 126 102 162 200 78 23 91 94 28 148 88 156 116
207 116 246 78 216 115 62 128 188 124 104 68 179 205 163 62 14 159 36 94 37 100 101 70 116 78 74 109 217 124 60 19 54 108
-168 108 168 220
-192B20
##PAGE=	F1=-16658.7
##FIRST=	25164.767445380970457,	5806.2096540000038658,	0
##DATA TABLE=	(F2++(Y..Y)), PROFILE
5806 55 159 170 149 38 79 219 199 228 223 140 110 172 117 176 48 76 214 112 150 234 149 130 103 126 105 169 264 255 76 124 48 109 97
5419 97 177 306 283 189 42 104 123 40 230 169 49 62 222 130 63 72 47 55 171 208 296 180 133 131 211 230 40 64 57 132 114 106 69 94
5020 94 120 222 197 272 40 41 88 303 242 48 70 3 89 287 107 158 148 113 75 30 67 79 83 11 73 95 102 99 119 157 18 155 151 26
4621 26 203 240 72 210 169 99 149 179 173 157 86 19 61 159 191 110 229 173 168 201 33 171 141 124 91 224 162 183 232 27 59 187
4245 187 229 182 185 68 141 292 106 112 125 259 342 120 60 72 175 99 73 90 94 24 114 113 263 249 48 272 270 121 272 137 202
3881 202 185 239 146 46 59 54 107 56 75 87 42 128 194 224 111 192 289 217 91 129 166 189 109 228 73 154 298 308 111 184 308
3517 308 166 124 184 162 209 139 153 180 123 217 266 72 206 226 46 111 52 144 122 110 110 259 167 161 106 103 292 254 63 115 53 49 119
3130 119 107 107 49 113 245 201 118 269 295 29 75 136 229 212 105 151 243 75 124 184 34 87 437 231 227 127 12 147 40 94
2778 94 219 45 64 159 100 106 122 242 217 263 188 127 71 114 170 57 108 58 175 161 61 323 309 130 240 52 181 50 212
2438 212 143 156 67 107 171 225 112 76 123 142 106 215 43 85 117 72 90 45 81 108 106 83 59 130 212 141 233 149 67 35 72 122 240
2050 240 130 130 106 198 234 83 126 52 177 194 59 93 94 130 115 179 70 111 63 140 42 119 66 35 137 201 72 120 124 178 91 185 257
1663 257 164 63 77 60 102 45 73 143 38 161 247 149 121 264 155 81 116 17 124 173 80 65 41 72 107 93 54 174 93 131 177
1299 177 122 133 127 200 5 127 124 215 34 206 115 38 83 47 132 93 141 95 62 84 92 281 363 310 63 60 178 187 162 153 108 230 41
912 41 209 213 56 147 59 80 47 121 89 127 66 100 69 54 167 241 223 195 42 99 65 227 281 232 246 172 222 155 169 38 113 86 55
524 55 131 154 185 197 72 8 114 192 107 54 163 94 86 92 155 67 113 148 53 74 137 137 31 136 81 159 92 306 143 209 94 91 124 165
125 165 144 124 68 171 190 168 39 25 154 26 102 63 118 104 31 132 102 80 105 246 137 89 45 37 110 164 191
-192A91
##PAGE=	F1=-16761
##FIRST=	25164.767445380970457,	5806.2096540000038658,	0
##DATA TABLE=	(F2++(Y..Y)), PROFILE
5806 40 131 117 124 69 95 198 164 219 250 129 48 119 189 216 43 15 234 164 197 255 149 100 87 178 122 164 172 162 79 56 79 63 69 116
5407 116 270 241 189 45 112 74 27 241 159 80 58 209 91 108 86 74 59 195 225 271 165 133 171 241 287 55 56 68 146 151 129 105
5032 105 98 105 220 225 220 61 54 68 230 179 94 67 60 84 282 153 166 100 9 61 90 78 111 108 13 98 103 113 37 43 83 56 183 182 24 189
4609 189 221 95 214 183 140 188 185 98 50 40 36 47 193 216 79 224 171 185 243 47 200 125 133 95 244 186 209 258 52 54 107 202
4233 202 223 184 36 118 270 121 79 129 311 384 137 24 97 197 104 102 147 119 35 99 131 285 281 78 298 273 133 220 95 187
3881 187 216 244 157 33 72 24 127 25 83 114 24 159 197 220 129 157 309 238 69 102 157 78 82 218 76 120 276 255 74 213
3529 213 294 208 121 198 227 250 148 89 116 144 216 264 61 203 214 67 154 78 164 139 128 129 292 151 127 130 173 307 257 66 111 65
3154 65 53 165 166 174 57 95 229 148 139 293 304 56 123 163 203 199 139 140 176 91 97 193 35 37 269 201 238 109 32 193 87 148 207 22
2754 22 52 151 103 109 201 273 257 314 190 137 61 77 161 21 122 62 156 123 96 315 279 221 297 82 157 109 213 124 173 110 95 160 171
2367 171 111 86 61 68 124 165 50 92 135 75 120 46 97 111 100 70 62 176 295 137 271 158 82 56 68 125 185 88 95 112 212 231 81
1980 81 159 93 184 179 26 125 197 153 182 125 59 84 66 91 64 81 62 63 115 155 45 90 127 127 66 170 270 227 102 48 59 51 26 81 145
1569 145 46 145 253 142 105 347 209 82 155 80 177 188 115 69 26 111 120 129 77 168 99 115 158 121 77 95 161 59 143 98 203 12
1193 12 176 88 61 64 76 61 116 207 84 115 109 114 283 347 330 138 87 140 225 121 132 132 244 23 195 248 78 157 59 52 104 131 97
806 97 112 58 89 38 87 114 231 204 175 54 137 50 218 256 255 214 161 241 200 197 36 128 90 53 136 152 210 188 66 68 102 225 96 45
407 45 173 128 102 82 169 108 82 103 33 127 175 183 80 110 61 152 76 335 204 179 82 112 96 128 163 147 70 162 168 182 24 39 136 48
8 48 133 88 123 105 16 142 120 92 108 269 147 110 67 26 112 141 145
-192A45
##PAGE=	F1=-16863.2
##FIRST=	25164.767445380970457,	5806.2096540000038658,	0
##DATA TABLE=	(F2++(Y..Y)), PROFILE
5806 45 82 77 73 115 91 155 122 182 252 115 60 67 244 240 62 60 231 231 229 251 142 69 110 215 126 153 137 76 72 46 131 33 65 39 191 193
5384 193 169 50 124 65 81 246 143 119 62 178 41 141 96 109 71 195 244 261 163 119 195 245 302 67 43 78 146 170 140 143 95
5020 95 82 193 227 159 78 80 40 153 118 137 113 127 64 254 177 173 121 103 41 139 104 150 126 18 113 94 118 74 60 26 106 196 198 57
4621 57 158 179 119 198 177 183 208 165 20 60 14 67 5 185 216 41 209 172 197 261 88 252 143 139 102 249 201 216 261 70 78 36
4245 36 170 263 189 23 113 233 144 46 142 341 404 161 16 148 224 90 109 189 137 30 85 137 285 305 104 310 266 152 170
3905 170 56 154 228 215 149 14 74 11 152 83 94 131 77 178 192 212 139 121 316 262 49 73 151 23 72 183 73 83 242 192
3553 192 67 249 251 235 131 231 267 272 151 58 59 151 195 233 48 191 200 76 158 82 163 129 151 149 313 165 93 132 218 287 238 84
3177 84 106 85 59 199 210 229 91 66 188 84 163 298 289 76 157 174 150 178 174 151 118 107 71 187 39 63 136 217 229 91 64 236
2801 236 139 191 196 16 45 169 137 114 240 265 269 341 164 114 47 31 167 71 128 66 128 57 125 276 228 302 344 121 170 161 198 102 195
2414 195 152 74 140 80 111 77 9 20 150 147 107 95 128 88 135 54 109 126 82 39 40 201 354 139 287 170 99 91 77 135 130 63 58 112
2015 112 211 222 68 178 94 168 173 45 201 270 185 220 138 87 55 83 46 99 59 90 85 80 107 33 119 119 89 45 162 273 279 145 14
1628 14 97 11 74 130 157 45 112 247 129 77 405 248 113 186 147 233 203 156 88 33 138 143 163 87 166 105 95 132 121 20 67 127
1252 127 95 157 50 163 20 150 77 67 42 110 33 156 248 116 175 129 127 256 301 334 201 131 104 236 89 99 138 240 19
912 19 156 255 91 162 76 2 164 134 119 92 52 65 18 111 52 215 162 134 57 178 18 204 233 278 177 146 266 239 203 38 135
548 135 124 70 152 127 218 180 71 121 125 255 91 79 174 154 106 64 165 182 139 116 17 164 197 219 117 78 30 132 69 328 240 141
172 141 117 127 54 87 171 151 58 157 142 197 33 50 109 56 170 108 108 105 60 142 128 105 121 274 150 121 85 25 117 109 93
-192I3
##PAGE=	F1=-16965.5
##FIRST=	25164.767445380970457,	5806.2096540000038658,	0
##DATA TABLE=	(F2++(Y..Y)), PROFILE
5806 64 33 124 25 165 83 102 93 138 232 103 114 37 268 244 86 126 203 283 239 224 120 37 136 226 117 138 167 74 61 60 144 18 77
5419 77 36 93 151 143 56 135 111 127 249 128 151 73 144 35 157 112 147 89 172 253 264 181 97 205 220 271 51 44 80 132 167 139 175
5032 175 93 56 150 199 94 88 110 3 81 67 173 169 182 29 207 178 176 197 205 21 160 122 192 136 39 113 63 117 133 115 38 130 192
4644 192 200 79 119 124 139 175 161 216 205 125 45 136 38 107 64 129 187 40 185 168 203 254 119 282 182 144 112 234 198 202 238 63
4269 63 90 75 155 292 198 59 148 193 171 43 159 349 402 185 20 185 255 80 92 207 144 14 73 126 263 314 130 298
3940 298 247 156 129 45 119 215 161 122 28 65 44 153 103 98 132 127 182 175 200 131 97 311 277 33 46 147 92 67 133 78 94 204 131 88
3541 88 282 204 235 147 250 277 276 145 88 74 148 167 184 36 176 188 69 123 64 141 102 172 165 314 191 64 102 228 239 207 116
3177 116 114 109 60 215 228 252 138 48 136 27 189 284 249 74 162 175 87 154 200 171 90 122 63 168 31 81 75 224 205 77 82 268
2801 268 183 210 185 21 56 204 181 119 231 223 256 342 123 64 35 33 175 98 129 76 92 44 149 212 162 353 365 164 207 192 170 78
2426 78 222 183 50 145 24 99 55 60 112 206 190 154 65 94 99 134 64 116 152 54 10 6 211 382 154 288 188 119 117 83 151 103 76
2038 76 37 112 195 203 49 178 55 135 181 78 220 276 189 227 180 101 35 106 17 135 87 140 103 60 104 38 159 98 99 48 164 262
1663 262 307 169 27 127 20 116 177 161 88 64 225 123 36 433 273 144 200 206 278 217 185 104 45 143 152 186 81 167 111 75 93
1299 93 99 42 43 104 108 161 18 106 64 132 84 52 33 144 102 192 262 145 211 141 129 205 240 322 236 159 67 215 79 64 121 212 25 102
900 102 232 99 157 107 61 200 123 139 72 50 45 71 125 18 201 106 82 53 207 58 193 206 288 150 119 290 263 183 46 147
548 147 179 98 166 89 212 176 84 151 168 279 89 119 167 173 106 46 148 246 227 169 8 173 198 233 133 53 31 106 67 288 250 114
172 114 181 143 36 50 163 129 50 157 118 204 52 56 78 53 199 123 74 102 93 134 125 119 135 254 144 122 98 35 128 94 51
-192E1
##PAGE=	F1=-17067.7
##FIRST=	25164.767445380970457,	5806.2096540000038658,	0
##DATA TABLE=	(F2++(Y..Y)), PROFILE
5806 85 60 198 80 210 92 67 99 128 195 98 151 42 257 229 112 176 153 305 225 182 86 11 136 209 97 121 202 126 64 45
5454 45 121 36 95 93 40 121 122 54 139 158 156 250 120 170 82 125 77 154 137 180 107 131 240 275 210 77 208 169 204 26 68 86 107 145
5055 145 127 194 99 39 109 150 33 91 139 37 29 36 202 218 213 43 148 158 171 267 282 27 149 117 227 146 79 100 23 111 181 150
4679 150 52 127 172 187 91 84 74 151 156 147 231 180 79 89 174 49 153 148 40 133 77 159 150 212 226 132 271 213 144 126 195 172 169 196 29
4269 29 75 128 169 300 200 92 197 168 187 75 171 342 383 208 14 202 280 112 57 200 140 15 66 105 223 305 157 256
3940 256 221 138 93 68 110 180 98 83 58 51 63 121 82 87 126 167 178 143 179 104 89 295 273 22 28 144 125 65 78 95 147 165 77 106 300
3529 300 186 206 160 241 260 263 128 124 122 141 142 133 28 158 183 49 61 42 100 84 187 179 293 204 44 44 206 176 174 152 142 139 55 214
3130 214 214 235 174 65 87 21 209 255 190 63 140 174 42 130 211 189 85 135 79 140 27 71 53 202 171 67 83 280 211 196 168
$$ [...]
-192D9
##END NTUPLES=	nD NMR SPECTRUM
##END=	
##END=	
