##TITLE=	Jan24-2022.62.ser
TM-VI-251, Na+PMB-pyr hsqc

##JCAMP-DX=	6.0	$$ MestReNova 14.3.0-30573
##DATA TYPE=	LINK
##BLOCK_ID=	1
##BLOCKS=	2    
##ORIGIN=	Mestrelab Research S.L.
##OWNER=	hrzepa
##$MNOVA/LINK_BLOCK_TYPE=	ITEM	$$ NMR Spectrum
##$MNOVA/ITEM/POLYGON=	(XY..XY)
5321,5835
8722,5835
8722,8208
5321,8208
5321,5835
##$MNOVA/ITEM/Z=	0
##$MNOVA/ITEM/ANGLE=	0
##TITLE=	Jan24-2022.62.ser
##JCAMP-DX=	6.0	$$ MestReNova 14.3.0-30573
##BLOCK_ID=	2
##DATA TYPE=	MNOVA NMR VIEW DATA
##DATA CLASS=	MNOVA VIEW DATA
##$MNOVA/2D/THRESHOLD=	7.1784157752990722656
##$MNOVA/ITEM/ZOOM/X=	-0.57569381887933257502,	10.597560000003785063
##$MNOVA/ITEM/ZOOM/Y=	-9.5463849045685140737,	230.0176000018207958
##END=	
##TITLE=	Jan24-2022.62.ser
##JCAMP-DX=	6.0	$$ MestReNova 14.3.0-30573
##BLOCK_ID=	3
##DATA TYPE=	nD NMR SPECTRUM
##DATA CLASS=	NTUPLES
##NUMDIM=	2
##ORIGIN=	Bruker BioSpin GmbH
##OWNER=	nmr
##.OBSERVE FREQUENCY=	400.20200099999999566
##.OBSERVE NUCLEUS=	^1H
##.SOLVENT NAME=	MeOD
##.PULSE SEQUENCE=	hsqcetgpsi2.ph
##LONGDATE=	2022/01/24 17:55:00.000
##.ACQUISITIONMODE=	SIMULTANEOUS (DQD)
##$ORIGINAL FORMAT=	Bruker XWIN-NMR
##$MNOVA/SCALES_VERSION=	9
##$PARAMETER FILE=	(acqu2s, ASCII, /private/var/folders/f6/rjf_tdyn2v98c5c0wvkgn4s80000gn/T/O5JV6JMgS+mQH8CbmaRQDA/62/acqu2s, 0)
$$ ##TITLE= Parameter file, TOPSPIN		Version 3.2
$$ ##JCAMPDX= 5.0
$$ ##DATATYPE= Parameter Values
$$ ##NPOINTS= 241	$$ modification sequence number
$$ ##ORIGIN= Bruker BioSpin GmbH
$$ ##OWNER= nmr
$$ $$ 2022-01-24 18:05:00.212 +0000  nmr@CZC2439F63
$$ $$ /opt/topspin/data/agmb/nmr/Jan24-2022/62/acqu2s
$$ $$ process /opt/topspin3.2/prog/mod/go
$$ ##$ACQT0= 0
$$ ##$BF1= 100.63037
$$ ##$FnMODE= 6
$$ ##$NUC1= <13C>
$$ ##$NusJSP= 0
$$ ##$NusT2= 1
$$ ##$NusTD= 240
$$ ##$O1= 11069.4607123918
$$ ##$SFO1= 100.641439460712
$$ ##$SW= 240.006397974962
$$ ##$SW_h= 24154.5893719807
$$ ##$TD= 240
$$ ##END=
$$ 
##$PARAMETER FILE=	(acqus, ASCII, /private/var/folders/f6/rjf_tdyn2v98c5c0wvkgn4s80000gn/T/O5JV6JMgS+mQH8CbmaRQDA/62/acqus, 0)
$$ ##TITLE= Parameter file, TOPSPIN		Version 3.2
$$ ##JCAMPDX= 5.0
$$ ##DATATYPE= Parameter Values
$$ ##NPOINTS= 12	$$ modification sequence number
$$ ##ORIGIN= Bruker BioSpin GmbH
$$ ##OWNER= nmr
$$ $$ 2022-01-24 18:05:03.395 +0000  nmr@CZC2439F63
$$ $$ /opt/topspin/data/agmb/nmr/Jan24-2022/62/acqus
$$ $$ process /opt/topspin3.2/prog/mod/shimcntl
$$ ##$ACQT0= 1000000
$$ ##$AMP= (0..31)
$$ 100 100 100 100 100 100 100 100 100 100 100 100 100 100 100 100 100 100
$$ 100 100 100 100 100 100 100 100 100 100 100 100 100 100
$$ ##$AMPCOIL= (0..19)
$$ 0 0 0 0 0 0 0 0 0 0 0 0 0 0 0 0 0 0 0 0
$$ ##$ANAVPT= -1
$$ ##$AQSEQ= 0
$$ ##$AQ_mod= 3
$$ ##$AUNM= <au_zg>
$$ ##$AUTOPOS= <51 >
$$ ##$BF1= 400.2
$$ ##$BF2= 100.63037
$$ ##$BF3= 400.2
$$ ##$BF4= 400.2
$$ ##$BF5= 400.2
$$ ##$BF6= 400.2
$$ ##$BF7= 400.2
$$ ##$BF8= 400.2
$$ ##$BYTORDA= 0
$$ ##$CAGPARS= (0..11)
$$ 0 0 0 0 0 0 0 0 0 0 0 0
$$ ##$CFDGTYP= 0
$$ ##$CFRGTYP= 9
$$ ##$CHEMSTR= <none>
$$ ##$CNST= (0..63)
$$ [...]
$$ 0 0 0 0
$$ ##$ShimPowMaxUC= (0..63)
$$ 130000 130000 130000 130000 130000 130000 130000 130000 130000 130000 130000
$$ 130000 130000 130000 130000 130000 130000 130000 130000 130000 0 0 0 0
$$ 0 0 0 0 0 0 0 0 0 0 0 0 0 0 0 0 0 0 0 0 0 0 0 0 0 0 0 0 0 0 0 0 0 0 0 0
$$ 0 0 0 0
$$ ##$ShimPowMaxUG= (0..63)
$$ 524287 524287 524287 524287 524287 524287 524287 524287 524287 524287 524287
$$ 524287 524287 524287 524287 524287 524287 524287 524287 524287 0 0 0 0
$$ 0 0 0 0 0 0 0 0 0 0 0 0 0 0 0 0 0 0 0 0 0 0 0 0 0 0 0 0 0 0 0 0 0 0 0 0
$$ 0 0 0 0
$$ ##$ShimPowRcbType= 3
$$ ##$ShimPowRes= (0..63)
$$ 1e-20 1e-20 1e-20 1e-20 1e-20 1e-20 1e-20 1e-20 1e-20 1e-20 1e-20 1e-20
$$ 1e-20 1e-20 1e-20 1e-20 1e-20 1e-20 1e-20 1e-20 0 0 0 0 0 0 0 0 0 0 0 0
$$ 0 0 0 0 0 0 0 0 0 0 0 0 0 0 0 0 0 0 0 0 0 0 0 0 0 0 0 0 0 0 0 0
$$ ##$ShimPowRng0= (0..63)
$$ 1 1 1 1 1 1 1 1 1 1 1 1 1 1 1 1 1 1 1 1 0 0 0 0 0 0 0 0 0 0 0 0 0 0 0 0
$$ 0 0 0 0 0 0 0 0 0 0 0 0 0 0 0 0 0 0 0 0 0 0 0 0 0 0 0 0
$$ ##$ShimPowRng1= (0..63)
$$ 1 1 1 1 1 1 1 1 1 1 1 1 1 1 1 1 1 1 1 1 0 0 0 0 0 0 0 0 0 0 0 0 0 0 0 0
$$ 0 0 0 0 0 0 0 0 0 0 0 0 0 0 0 0 0 0 0 0 0 0 0 0 0 0 0 0
$$ ##$ShimPowRng2= (0..63)
$$ 1 1 1 1 1 1 1 1 1 1 1 1 1 1 1 1 1 1 1 1 0 0 0 0 0 0 0 0 0 0 0 0 0 0 0 0
$$ 0 0 0 0 0 0 0 0 0 0 0 0 0 0 0 0 0 0 0 0 0 0 0 0 0 0 0 0
$$ ##$ShimPowRng3= (0..63)
$$ 1 1 1 1 1 1 1 1 1 1 1 1 1 1 1 1 1 1 1 1 0 0 0 0 0 0 0 0 0 0 0 0 0 0 0 0
$$ 0 0 0 0 0 0 0 0 0 0 0 0 0 0 0 0 0 0 0 0 0 0 0 0 0 0 0 0
$$ ##$ShimSysFunc= (0..63)
$$ 1 2 3 4 5 7 9 11 15 16 8 10 12 14 6 17 13 18 19 20 0 0 0 0 0 0 0 0 0 0
$$ 0 0 0 0 0 0 0 0 0 0 0 0 0 0 0 0 0 0 0 0 0 0 0 0 0 0 0 0 0 0 0 0 0 0
$$ ##$ShimSysMatrix= 0
$$ ##$ShimSysType= 1
$$ ##$TFXNUM= 0
$$ ##$TRIPLO2= 0
$$ ##$VTU= 2
$$ ##$VTUETH= <149.236.99.20>
$$ ##$VTUTY= <no>
$$ ##$WBREFAM= (0..15)
$$ 135.5 97.7 100 100 100 100 100 100 100 100 100 100 100 100 100 100
$$ ##$WBREFLM= (0..15)
$$ 0 0 0 0 0 0 0 0 0 0 0 0 0 0 0 0
$$ ##$WBREFPH= (0..15)
$$ 72.26 -67.22 0 0 0 0 0 0 0 0 0 0 0 0 0 0
$$ ##$WBSGU= (0..15)
$$ 0 0 0 0 0 0 0 0 0 0 0 0 0 0 0 0
$$ ##$XFAC= 2
$$ ##END=
$$ 
##$DECIM=	4464
##$DSPFVS=	20
##.ACQUISITIONSCHEME=	ECHO-ANTIECHO
##NTUPLES=	nD NMR SPECTRUM
##VAR_NAME=	FREQUENCY1,	FREQUENCY2,	SPECTRUM
##SYMBOL=	F1,	F2,	Y
##.NUCLEUS=	13C,	1H
##.OBSERVE FREQUENCY=	100.64143946071199309,	400.20200099999999566
##VAR_TYPE=	INDEPENDENT,	INDEPENDENT,	DEPENDENT
##VAR_FORM=	AFFN,	AFFN,	ASDF
##VAR_DIM=	512,	512,	262144
##UNITS=	HZ,	HZ,	ARBITRARY UNITS
##FIRST=	23146.756194512010552,	4241.1435120000014649,	0.1867815554141998291
##LAST=	-960.65624510154020754,	-230.39266631542668051,	-0.24830864369869232178
##MIN=	-960.65624510154020754,	-230.39266631542668051,	-2.2157835960388183594
##MAX=	23146.756194512010552,	4241.1435120000014649,	70.59881591796875
##FACTOR=	1,	1,	0.0046872417946985447945
##PAGE=	F1=23146.8
##FIRST=	23146.756194512010552,	4241.1435120000014649,	0.1867815554141998291
##DATA TABLE=	(F2++(Y..Y)), PROFILE
$$ [...]
##PAGE=	F1=-11575.5
##FIRST=	23146.756194512010552,	4241.1435120000014649,	0
##DATA TABLE=	(F2++(Y..Y)), PROFILE
4241a5l7J87p4j43J0M1No8P6kK9o7K9k3J09kq8R0j78J11P4O0j46lJ9o6J59j44R7o8Q3qK8j8
3944E7J4n6m1J7J6o8p2Q1MQ8J0k01K23j5RR5k31O5j9N4lk8l3J13j43r4J34jN5k8L9l1J2J9
3646D1l0m8P2R6q8j5o7J57j05o1J05l4k7O9j04p6J27j58J61j24K6K9O5NN5j31l6J50K7l3J9
3375F7j3M5j9k15O7Q7l7r7J86oM0j02M8pj2qj9j3J0J8q0R9r1J04n5n2j4L8O9j9R3j36LJ9r7
3069i9J94N3j98k9ML1p0J49L1L6j50N7j14J80O3j56N5N9j5r1o0J89j12n3Q8n8j46J29L4o0
2806e9O6k5J02j25Q5N8j02lL4p3N9o8q3J63K1o1j2L7J7J0m6N9j17O5mL0j7L1j15J36p7K4r7
2517h7J22j71J27P4Q7j31k0jn4O9J03k85K17K8j45J31p1q3J57k7j10Q5m3nk5L4N6M6p6rJ16
2246A09J2j25q6J2J01J4N1n3J18j92PJ15j6O1j05jj10M5P8k3J5o4L2j28P3K26k24n4R3l3L1
$$ plain form
4241 -15 -52 135 61 -82 -72 -31 -26 -94 -18 -20 9 -58 -29 -52 57 55 -33 57 -121 -10 64 124 -22 -25 -6 -72 87 -57 40 -28 55 47 75 57
3944 57 71 15 -26 -9 7 -61 -133 -52 -48 40 50 -151 72 57 66 161 -70 -5 -24 30 27 -1 -34 79 -64 -158 -24 -25 30 2 41 10 22 41
3646 41 11 -37 35 131 43 28 -39 118 13 -48 57 23 -4 65 -39 -115 12 -146 15 -109 -83 -54 11 16 71 -60 -96 54 81 48 67
3375 67 54 99 80 -135 -68 19 -18 -115 71 65 105 3 51 44 32 24 5 -8 2 20 -60 39 -52 52 -3 -55 -69 -31 38 19 112 -24 -21 -2 -99
3069 -99 95 148 -50 -79 -75 -44 -114 35 66 102 -48 9 -105 75 138 -18 37 96 81 -10 -70 119 7 -46 42 -16 -162 -33 1 -59
2806 -59 7 -18 84 -41 44 102 0 -3 31 -42 17 -51 -134 29 50 -11 -23 14 31 41 -5 54 -63 2 -2 28 11 42 -73 63 -14 10 -87
2517 -87 35 -136 -9 65 152 21 1 0 -54 15 118 -167 50 78 -67 64 -7 -90 67 40 -70 15 -28 -33 -58 -24 32 78 2 -7 109
2246 109 121 -4 -90 -78 23 37 88 35 153 -39 -32 83 67 128 23 22 -88 -43 35 12 27 -37 -5 -133 -60 166 -58 -112 -19 -52 -21
1975b1j7L2j2Q3p4R2k0j9q1O0r9J06r2P0M1R8kl9j18k2q1P8JP7n6M6LN4j53J6J50P84K795
1686C680N27k780j343o3j1Kq9J0NJ39o6q8%m3J76m6k07K28J63k64J65n8J1k0J15j71J26r8
1441@N1r4N4r0M1n6L2M3J38l8l7p0K7Kl0PJ36n5o1j2L4k2m7J84m0j12j7j6N1L0n4O5j31J39
1143E2q0Q5o4Nl2O6K0k7o4J11J2q6Q9p4n1q6P5R9j32P5pJ68j50J4m0Q3j33m3J71P1j95O2J08
855A02r4K4R2Qj00l2j03J89j14J10q2k0P5j71J46J5o1k2R7Kk1L2q6j22P7j8L3j2O9Q1j17R8
575G5q2k9M0n5K57j57q0J94j27M0j02P8l7j6J5R7j06nJ5k6O9l2jM8j51m6O9L7m0R2k0o0q9
286a35J91k7J2qm4j1K8j15R2o4J25O0r5Rp9J78k06Qr9J55M2J1p0J1j9O3j3p9J06rJ08m4o7
-3A5k55K52R0j46l2j4Q3K6o7N8j03J3P7jO7p7J45n4l9l8n0J69j16j05J58M8
$$ plain form
1975 -21 -38 -6 -18 65 -9 83 63 44 -37 23 -76 30 -62 8 49 147 145 106 -12 -34 -115 -37 -36 41 -15 31 34 88 -65 -49 101 885 3680
1686 3680 4207 1427 84 21 10 12 -77 -67 -62 77 11 -77 -77 -120 56 10 -197 31 194 -70 95 37 48 28 143 -28 98 0
1441 0 51 -43 11 -79 -38 -94 -62 -19 119 81 44 -26 1 3 -27 -20 116 61 0 -12 22 0 -47 137 97 -15 -32 -48 3 33 -21 44 -87 52
1143 52 -28 57 -7 -2 -34 32 52 25 -39 72 84 -2 87 13 -38 -124 -49 50 -82 -7 -14 154 4 18 -22 61 -72 -115 56 127 -68 -6 102
855 102 8 32 124 132 32 0 -103 86 -28 82 0 -20 55 -116 30 45 -16 -38 59 61 40 72 -14 -136 -59 -77 -44 -56 13 94 -23 75
575 75 -7 -36 4 -51 206 49 -31 163 36 76 -26 52 15 -1 14 111 5 0 15 -11 58 26 25 73 -78 -124 -55 -18 -58 34 14 -46 -135
286 -135 56 29 41 33 -11 -22 6 -109 -17 -81 44 104 9 18 -61 117 -89 -81 -180 -25 17 28 -42 -31 -50 13 0 -79 27 18 126 82 15
-3 15 -240 12 102 -44 -76 -90 -7 19 -48 10 -93 -80 -3 -4 63 -14 131 77 38 0 -50 119 3 -102 56 104
-230A04
##PAGE=	F1=-11669.8
##FIRST=	23146.756194512010552,	4241.1435120000014649,	0
##DATA TABLE=	(F2++(Y..Y)), PROFILE
4241Fq2K18j27r4K1K6J7jk0n3J11q1K2oN3jn2J05j94J18Q3K1j61O2lj08J45j10J36j01J09
3970E9k6L8%mo3k5K1Jm2m7N8oO5M4k00J52K3L1R6k48L9L9M7o3j9k3J23j49p5J25K8oRM8p1
3664b1M8L1o7rN0J17p7l6p5J44p9l5N1k4qR9j76j03J94j79J75o7m0K8L1Q5K3j41J5J23k0j3
3384D4%l1O2m2k00P5J05%j05Q5O1Q8j97J23k0%k1l2j4N1J9j10Q3k9O4j4j30NL8L3j8J49j41
3095a9J0J8q3J51K3j57n2M1L6r2J42L6kj44O5o9J91P8k12Q2J6jp0l3J03n1pN0r8j46J81l0
2815d3O5L3p5O7j61J83J1o6NJ9n6O0j05l0J40Qq1k4P5N6k3n6L1n0O7o3K0K2L6j08R5n1N8r7
2517c8P8j71O6J52Q1r2o6Qr5R8J22k57J83L9j97J46q6q1J96l9j25J00m3k3j0O5K6M1o4l3O4
2246D5J4m4j20J31KKL5n7Q2r2l5J58p3O5l4m9j31Q8K6j2K5n9L2j49O6K13k02K7jJ3L7jK3l9
$$ plain form
4241 6 -76 142 15 -79 -58 -32 -15 -16 -36 -89 22 -59 -37 -43 10 9 -43 62 -132 -14 69 90 -71 -9 -12 -120 25 -85 51 -50 59
3970 59 33 71 71 67 4 -21 0 1 -41 -88 -30 -36 29 73 -127 25 48 79 175 -73 -34 5 52 -11 -30 -53 70 -79 -154 -29 -1 -7 2 50 -21
3664 -21 27 58 -9 -18 32 149 72 36 -39 105 26 -9 42 18 10 109 -67 -170 24 -155 20 -47 -87 -59 -28 57 80 -61 -46 77 57 44
3384 44 44 13 75 33 -167 -92 13 13 -92 -7 54 142 -55 68 48 48 27 -5 -19 32 51 -59 24 -5 59 45 -85 -80 -42 -9 -27 122 -19
3095 -19 -9 9 -74 77 100 -57 -109 -68 -32 -124 18 54 52 -92 -27 -96 95 173 -39 43 59 58 -12 -45 58 7 0 50 -48 -194 -13 -43
2815 -43 22 55 -20 47 -114 69 80 14 19 38 -18 42 -63 -93 47 55 -26 -50 25 81 58 2 33 -17 50 -13 7 29 65 -43 52 1 59 -38
2517 -38 40 -131 -65 87 168 76 10 18 -77 21 143 -114 69 108 -89 57 -29 -110 86 47 -78 22 -21 -44 -54 11 37 78 14 -19 45
2246 45 59 15 -105 26 28 30 65 8 90 -2 -37 121 48 113 79 30 -101 -13 13 1 26 -33 -1 -150 -84 129 -73 -46 -47 -34 3 2 25 -14
1948a4P2m4M5n1J0m3N3j35J30n4P3J3K1n0R1j37k3p3O4kJ02n4O7k8O1j68M3Q3M42J581L48
1677B423j668p15l5j8j2r6M0M3P4m9p6K4J9J08j01j14K31R1l15J10N8O%J36j72O8q9Q2o7M0
1415B6j32N0o7N7j4J78o1Lo6Q1l0j7j4J33m1m6m0jl6j1J79k8j53J3M3J8L8m0N6j53P9l9J23
1126H8j04o1O8L9K1j0m7R6qp2N5o4m3n0P5M4j10Q4j5J90j83K9o8Q5l8r4J21R1j90R4M3q0P3
837E9J09l1j35k6j05K45j41J01p5J0L5j20O6K3j8k2O3k7J5L6m1j32Q0jQj2J13J2p6P8j12K9
557HM4q9J06r1j4J99j58O4q3N7oPj8Q2r3j2k1J8Q8o6L1J1j26p3J02L4n2R5l8Kj22K15%J4j01
251A4QJ1lr2R3r6J44J3r2j4q5J63j16o0j19J99M4J0m1j8nQ6o4k3R6l9J01r0l6k06K82M4j23
-38a4n2l2Q3O5o3R0j36J5N6j2M9o2J35m6mn7n2J63r5j18J30M2
$$ plain form
1948 -14 58 14 59 8 18 -25 28 -107 23 -31 42 55 76 26 117 -20 -43 -116 -52 -54 48 -6 61 33 94 -74 -31 52 494 2075 2423
1677 2423 755 40 5 -13 -25 -121 -81 -38 36 -13 -89 -65 -46 62 -39 -153 78 169 -146 -36 22 28 28 164 -8 60 -29 53 -14 26
1415 26 -106 -56 -123 -66 -80 98 37 40 -26 55 25 8 -6 127 86 40 0 -1 -37 -48 131 103 -50 -37 6 24 62 22 78 -75 4 -35 88
1126 88 -16 -77 -9 30 51 41 -6 90 82 10 65 1 -42 -92 -17 27 -83 1 -14 176 -7 22 -46 39 1 -93 28 119 -71 23 66 -14 59
837 59 168 137 2 -24 -129 116 -25 76 1 11 46 -74 -8 15 -3 -25 38 11 26 62 21 -111 -31 -32 -24 -36 77 89 13 91 -21 8
557 8 52 -37 69 -22 -36 163 5 69 -14 43 37 44 26 108 15 3 -18 0 88 22 53 64 -62 -135 -33 1 -51 44 6 8 -114 101 101 115 14
251 14 22 33 30 -62 31 -65 79 92 0 -14 -99 64 -52 -112 -231 -32 12 22 -19 -37 -42 44 -20 -43 53 14 115 25 -11 -217 65 109 -14
-38 -14 -66 -98 -15 50 -13 77 -59 -44 12 0 49 -13 122 76 72 15 -37 126 31 -87 43 85
-230H5
##PAGE=	F1=-11764.2
##FIRST=	23146.756194512010552,	4241.1435120000014649,	0
##DATA TABLE=	(F2++(Y..Y)), PROFILE
4241A7j04K24j47n8J4L0QO2r7q5J75o9lnmJ2k8J06j73J14P6pj86J32qj20Q3n1J31j00J16j6
3961C9J2K8l7m6pL2k5j6l4M3j4M6P0j69P8K6M5Q1k21KJ02K5r9k7J8J09j24m4J05Qm3K1O9j09
3664e6P9K1m8OK1J32n1n3r3R1j9j1Pj6jJ09j98j06J97j68J87jq9MpJ47j7j29O0Q5n2Lk7k7
3366b0L9qj77O6J14Rp3l8J11J32k57J75qJ2l4n2pP9J5j46Q0K5PJ9j65M8j2J5nJ87j42K0Op8
3069f3J32qj11m8N0L5j08J26J6k1j28O6j5J72R3k23O8l3%j2j4J3K0jN4j09j60J95m8J51J6
2797A05j39N7j88K33k6k6L9j9m6O2j17L3P4k0n1j5Q1R1n9p6PK9L2r1nP1J9o5N7k1P6j15N2
2509C9j52J6J88Q4n0j31O0j27J19R1j59R4M9k06J08o5p5K12p3r4J01k9n1L1N1LJ0k2m4mJ3
2237a3N3j23J93o8k5L4m9J2J3n6J83j14M0On9j16J14l8KL4n1M3j58O4J85j67N3o1K2J11j0
$$ plain form
4241 17 -87 137 -10 -68 -54 -24 -16 46 -51 -136 39 -30 -33 -38 -42 -30 -58 48 -125 -11 65 58 -128 4 -4 -124 -41 -92 39 -61 55 39
3961 39 51 79 42 -4 -11 21 -4 -20 -54 -11 -25 21 91 -78 0 26 71 152 -69 -67 35 60 -39 -66 -48 61 -63 -107 -2 6 -37 -16 53 -56
3664 -56 23 44 -4 2 23 155 104 51 -42 49 30 19 26 10 9 118 -80 -186 11 -157 30 29 -60 -56 -63 84 67 -62 -2 83 31 34 7 -20
3366 -20 19 11 -166 -100 14 23 -50 -88 23 155 -102 73 65 77 43 -9 -16 63 78 -68 12 37 44 63 -102 -54 -66 -51 -56 131 -11 9 15 -63
3069 -63 69 61 -50 -98 -48 -13 -121 5 21 0 -128 -62 -77 95 188 -35 33 0 0 -12 -26 -13 7 6 60 -49 -209 -14 -62 89 105
2797 105 -34 23 -165 68 42 16 55 36 -10 52 -65 -32 42 22 -29 -44 37 128 69 -7 0 29 61 -30 -35 36 55 -10 47 26 102 -13 39
2509 39 -113 -97 91 175 125 -6 54 -73 46 137 -22 72 121 -85 23 -42 -117 95 22 -72 29 0 -51 -20 31 34 44 22 -22 -26 -13
2237 -13 40 -83 110 42 17 51 2 14 27 -29 154 40 80 86 27 -89 25 -13 -11 23 -28 15 -143 -79 106 -61 -8 -69 -47 64 54
1966E4k5k8O0k0n2l8N5pL2j63J43k1Q6l1l6p3J71j00l6m7N6k2R6m0O8n5O6j85P0QJ85N27K04
1677I02p16j60m3l0Rj07O6P7k2j9o7N2R2M5j43j9J83J6l38L2J83J5J0J50j52qn2P2j7L7j46
1406i8M7q1O1o5K06p1L7p3J08j3On9J29k7o1k7l3n6L4J33j4j52L3J07jjk0N0j71K5QJ66j43
1117a6j16J42L9kk4J4M7ro2L8o4l3jO3j9p4O3J0J55j80O3q2O8O1j56P6P3j60J29k2k6R7J01
828A93o3j80No6K20r6M4n7L4Ll4o0M3K7m3L4n0M4L5J2j17O7%J5lR0n6LN5j19P1K6j17L2m5
522e3pJ91j34M0m9L4J5L9o5P9o4Kq8O0J13r1O8n7r0n8J03N4q1R3m7N8j41J91L9lj69Q3M4o2
225D7o0R3r9J16l7o4n7o2J29k4r3j26J94O7lj5m8jJ11j04L9P7o6Q5j17%j42K50Jp1p9l4O3
-64c0R7n3J13j30LK5j3J3pQ2l5nl5n1J43m1j50J18M
$$ plain form
1966 54 29 1 61 41 -11 -49 6 -1 31 -132 11 -10 76 45 9 -64 107 7 -29 -76 -20 -42 54 14 82 27 93 -92 -22 -14 171 698 902
1677 902 186 26 -17 -47 -38 -145 -79 -2 -24 -43 -110 -58 34 79 -64 -83 100 116 -222 -190 -7 8 18 168 16 8 -44 28 11 48 -98
1406 -98 -51 -132 -71 -136 70 -1 36 -37 71 58 64 5 134 107 46 19 -14 -70 -36 97 83 -69 -36 71 70 69 49 99 -72 -47 -39 127 -16
1117 -16 -132 10 49 47 23 37 84 75 13 51 -13 -46 -47 16 -3 -77 -14 -4 151 -29 34 -48 20 81 -75 1 74 -86 43 21 -5 92 193
828 193 130 -50 -45 -111 109 13 57 0 34 37 3 -57 -14 13 -30 4 -46 -2 33 45 -72 -5 -5 10 7 97 41 44 99 -20 51 77 -40 -8 -53
522 -53 -60 131 -3 37 -12 22 37 76 11 90 26 28 -60 0 113 22 90 33 -57 -115 -12 42 -39 54 7 65 -76 115 154 151 -18 65 109 47
225 47 -13 80 -19 97 60 -4 -61 -123 6 -18 -111 -237 -43 24 21 6 -42 -43 68 -36 3 80 14 99 -18 -18 -160 90 91 20 -59 -93 -30
-64 -30 67 14 127 -3 0 25 12 25 18 100 65 60 25 -26 117 76 -74 44 48
-230D8
##PAGE=	F1=-11858.5
##FIRST=	23146.756194512010552,	4241.1435120000014649,	0
##DATA TABLE=	(F2++(Y..Y)), PROFILE
4241Gr4K09j28m5j1P2k8J04j31j03J84l0k7j1l7J9k4J10j43R7O8j8j99J66jr5OMQ9p7J00L5
3961F8m5N4m9l6PM5n0Kk7L1k5L7Q5j13K0mM1O3j62m1J42Pj07l6O5P9q2j8Q8m2m3OR5j49J12
3655A8j1J5JJJ16op5j12J5O9kj8j5jR7j69p7J39j31J74N7r7m4k2J64n3r6Q0O4o1Ln3Jj6N9
3349A4j44M6J10nk2j39J24J35k38J93MK6m1q3PR7Nj67R6M4o2N2j41Q4r6K8RJ96j32L5j9r7
3069h1J53l2o7k4L1K3j10R3j5j0j07P9J1J43Q5j65J0p9QN2rm7O5k6P5q3j84J83k7J61M4j91
2789d1N5j82K17n7J8P8n7m3O1j02Q0Kn8J4MO7J03p4j11j3Q4j0p0l9R9onK9k0J10j46N9j27
2500h1MJ50R0k1j83J37j51J31K5k5j8N4j66L3j2p2J95j12l7R0Jp7P5Nll8L1k5p1rJ33p4J54
2211A33p3n5N4l4o9R0n9J79j17KJk1q2J02r9K5K7l2Q1j70O0J60j41K5n4rK12l0r8jO5k2j33
$$ plain form
4241 7 -87 122 -6 -51 -62 10 -18 86 -45 -148 36 6 -21 -32 -69 -50 -74 36 -107 -10 58 40 -159 7 6 -89 -83 -79 10 -67 33 68
3961 68 23 77 28 -8 -1 44 -6 -4 -31 0 -25 12 97 -16 4 0 41 104 -58 -99 43 50 -57 -93 -28 51 -31 -49 39 -3 -46 -40 55 -94 18
3655 18 7 22 23 24 140 134 59 -53 -38 31 29 11 -4 -5 92 -77 -154 -15 -146 28 85 -12 -56 -78 86 33 -63 17 81 20 23 -30 -29 -45 14
3349 14 -130 -84 26 21 -1 -140 -16 119 -119 74 78 104 63 -20 -13 84 89 -78 18 62 0 52 -89 -5 -101 -73 -64 132 0 35 16 -81
3069 -81 72 40 -27 -51 -20 3 -107 -14 -29 -39 -146 -67 -56 87 172 7 17 -62 -54 -2 -11 -58 7 -19 56 -27 -211 -28 -55 106 150 -41
2789 -41 14 -168 49 -8 10 88 31 -12 49 -53 27 29 -29 -15 -11 56 159 85 -26 -39 45 35 -35 -74 25 19 14 43 23 133 -13 46 -81
2500 -81 -77 73 163 142 -41 96 -55 76 101 76 58 112 -54 -21 -33 -105 90 -22 -59 31 32 -45 30 35 32 -6 25 0 -71 -80 53 -21 133
2211 133 60 5 59 25 -44 46 -13 166 49 51 52 31 -51 51 -48 -23 4 -28 53 -117 -57 103 -38 -13 -67 -76 136 106 8 7 72 50 -83
1922h3jJ09LOj74J40lJ08o7n7q0J75k1m0l7O7m6N5k3M6o0O3j91Q9n2Q6nJ24k32J38p1n2N3
1633c3j07Q1Q3j00K0n8N7J40Qj53N3J02j7j43K77k49L3J7J29j03o3KJ6K9L6j15L4q0L0r0K01
1362C7n8N4p0Q9L2L0r2J04nj16K5m2o6P7N2mj04K7J52Jp8KO4j79qL2K03j57j46J72L7j8o1
1073a4Q6kLn5L6p3k6M9K6o1m6L2N0Q0j42J12q0L5J08j80N5K2j22J52o0L8J03O6q5k14N5j0
793f2J27Ol8l5M2j5N2j64M8O5o6J5o6O1K8N2p7L0lM8PK0j04Q9L0q5P1j7j16N1k9o0J77q5L
487@j3K7J1M9q9Q9l0J1j52R5J24q3P9j18o3jP3P4j13R5n3R4j38J26P8j4k06J56N4j00l9Q6
207A09q0N4o5k7q5k0Q2K8q3j13J51P7qJ0p4nJ28j25Q5O4q9P6j13Qp5J52Jrj23j7L6J04k8J24
-90A50r7oj2j5j5O1Jk6k3Km7J24K8j83J12n6
$$ plain form
1922 -83 -84 25 28 34 -140 0 -3 105 38 -19 -99 76 55 15 -22 45 -1 54 31 77 17 80 -111 -22 -74 12 7 131 -101 37 -34 -86 -33
1633 -33 -140 -59 24 -76 -56 -114 -57 83 91 -62 -9 93 76 -67 210 -39 -6 11 140 37 -26 -24 -8 21 57 -58 -24 -104 -74 -164 37
1362 37 -21 33 -37 52 84 114 22 126 121 5 30 -12 -78 -1 51 47 -57 -30 122 123 45 47 111 -68 -76 -44 159 2 -144 28 65 47 -14
1073 -14 72 70 73 18 54 -19 -45 4 30 -31 -77 -45 5 85 -57 55 -25 10 118 -62 -7 15 -107 45 -15 23 126 192 107 -107 -52 -62
793 -62 65 71 33 -2 40 25 77 -87 -39 26 -40 -25 -91 -30 -2 50 -27 3 0 48 55 75 -29 60 90 5 76 59 -57 -6 -35 -95 82 -3 0
487 0 -13 14 25 74 -15 74 44 55 -97 -2 122 39 118 0 -63 -64 9 83 -30 65 12 106 -32 94 172 158 -48 108 162 62 23 109
207 109 29 83 18 -9 -94 -114 -32 -4 -87 -200 -49 28 20 30 -44 -49 79 -46 39 103 14 90 -23 -15 -90 62 63 54 -69 -86 -50 54 26 150
-90 150 53 47 35 20 5 66 67 41 18 20 -27 97 125 -58 54 -2
-230b
##PAGE=	F1=-11952.9
##FIRST=	23146.756194512010552,	4241.1435120000014649,	0
##DATA TABLE=	(F2++(Y..Y)), PROFILE
4241a2o2J67q0m8l3J38p9J15j20j08J28J9l1mm9J0l6J23j13N4O7j5j77J52Km0m9K3M2o0P4
3970bJ06j03O5j5n5RN0n5Nk8K3m2L8R3n2j6l8J1O0r9p6J36J0r6k4R3M3n7J3P4q3j9j5J11j97
3664a32J53n4Q6j2LP0M2j00j19o4J64ql1j8kP9j17l1N3q6J32R5o9r7j0J37p6m5P2O9n0j3p5
3375e4M4q8J20r0K1R5l0K5j88R6Q5j44J74NN1m4j19J4J12Kj62J21K3j26R1r0Q6j60O5J0J73
3104A18j08N3m5j40K02m7l3Oj1J2r0M7l5J1q4J10pJ22M5o1n5j16K9R5j2o4O4n4P9k8j96J46
2824d7PJ21R7k04L5j29J56r8O0R4o3m7N5o4R5m0j00P6K6N2Q8o3j41l7R4l6k1n2Q5k1N5rm6
2535b2J73j75R5j05J6N3R1Lj90J90j80J38l9R2j05M8r1m5N6p3J49j47K1P8L3r2J01l9Mq6P2
2264B4J6j16n4J81J3M0l9p1Q6j4j39J23m7J44q0j8m3M6n8N7j38N7LJJ29j74M1J41j37k2Om5
$$ plain form
4241 -12 -74 93 13 -35 -68 70 -9 106 -14 -122 6 25 -6 -10 -59 -49 -85 38 -75 -21 46 31 -146 6 8 -32 -81 -58 -16 -76 -2
3970 -2 104 1 66 51 -4 5 55 0 5 -23 0 -42 -4 89 37 21 -17 -6 54 -45 -121 15 25 -71 -95 -2 41 -16 -3 71 -12 -31 -46 65 -132
3664 -132 21 -33 53 41 44 114 156 56 -63 -127 37 29 -2 -20 -22 57 -60 -91 -38 -124 8 103 34 -63 -73 64 -12 -57 15 84 34 21 -54
3375 -54 -10 -98 22 -68 -47 48 18 43 -145 -49 36 -108 66 71 122 78 -41 -27 85 87 -75 46 69 -57 34 -56 30 -130 -65 -55 118
3104 118 10 63 18 -122 80 33 0 6 -5 7 -83 -36 -71 -60 -144 -34 -41 81 126 65 10 -106 -77 18 6 -58 6 -48 31 3 -193 -47
2824 -47 -40 81 178 -26 9 -120 36 -62 -2 92 29 -18 37 -27 68 28 -72 4 30 82 170 107 -34 -71 23 -13 -34 -86 -1 -22 33 24 -22
2535 -22 151 -24 71 -34 -18 35 126 129 -61 129 -51 87 48 140 35 83 -8 -53 3 -70 79 -68 -47 31 64 -28 73 34 38 -48 24
2264 24 40 -76 -130 51 64 104 65 -6 80 66 -73 50 3 147 67 49 6 52 -6 51 -87 -30 -27 -26 103 -71 -30 111 -26 -48 -42 -87
1983h7K78l9j68J0Q4m8j46K7J51rj8j63J19NJ20o4n4q1J17N6j2n9Q7n1nk0Pl1M4j62R3q3P9
1695b3p9Q7j39K07q2q6Q9r3Q9O6j24M6m8K9J43rj14Q6L6J5M69J206j837M8L6O4k9q1N2o1O0
1423B3J6m3Rm4k1q1J50k6M8m0L9O6M4r2M2L3j91Q3j5n2R8k7j2k5%J54K0j52K0J05j76k2K4
1135d5K12j29j49J58J2j5r8J37j7J9n1K7p3k6Q7l2o6m4K7Q2kr8J64o2rQ3j36M5k9r6J59o4
855b9Q0J04J0r8k13J02M1J1J04j03j4M1l2J03j83K6P7o7Mp0O8%Q3l2j0j1R0%m7j23J46J1j4
566E5K5o9q1R2k0j29J72m5k5K0L2j2K8p1J03qMj84J13J10m1N6j45n4P7K9P5j33R9o2J14j22
286CM2J03Nk13J93L7r7l1O8n7j0n7lp9J2M2K7m4q4J02M2J4K9q1k0J33j30J00P5j06P1p5k0
-3ik1K2N6L5j74J7NQ3RJ31n7nm8l6j8J06p3j6l0K0l7J13Q5j92J03j15
$$ plain form
1983 -87 191 152 -16 -6 78 30 -116 -89 62 53 35 -128 -9 -4 116 52 -2 -83 34 90 78 19 106 55 50 30 37 6 50 -112 -19 -102 -23
1695 -23 -102 -15 -154 53 -29 -115 -26 -119 -30 36 -88 -42 -90 -61 82 73 -41 45 81 96 565 1771 -66 -18 18 82 53 -28 24 -37 23
1423 23 39 -4 5 -39 -60 -141 9 -17 31 -9 30 96 140 48 90 123 -68 15 0 -52 46 19 7 -18 -18 136 156 4 24 129 -47 -69 -45
1135 -45 167 38 -111 47 59 44 -54 83 66 85 34 61 -12 -38 49 17 -49 -93 -66 16 14 -84 80 18 9 92 -44 1 -28 -124 35 -29
855 -29 51 155 165 67 -146 -44 -3 8 112 9 -5 36 4 107 -76 -50 27 -40 -36 -106 -38 -38 45 13 3 -8 82 82 35 -88 58 69 55
566 55 80 11 -70 22 2 -127 45 0 -25 -5 27 15 43 -28 75 67 71 -113 0 110 69 125 -20 -74 3 32 107 -26 73 11 125 3
286 3 45 148 153 -60 133 170 73 42 110 53 43 -14 -17 -96 -84 -42 -15 -59 -143 -41 1 15 44 -37 -57 76 -54 46 121 15 86 11 -9
-3 -9 -30 -8 48 83 -91 -74 -69 14 23 154 97 92 44 8 -10 96 23 7 -23 -3 -40 73 158 -34 69 -46
-230d6
##PAGE=	F1=-12047.2
##FIRST=	23146.756194512010552,	4241.1435120000014649,	0
##DATA TABLE=	(F2++(Y..Y)), PROFILE
4241b5k8J04k3n0l5J97j25R5q5q4K6N3j1K1n5j1m7J31p6pN9rj19J17j7K9o8QJ3o8M5J74j37
3952hN3O3r6mL9l7ol7J7n4M0J05ol9m6m2P8n8q7Q9L2q3J8R6Jo7N4N6p5JrR4k46J99r2J26p
3629F2K0J7P3j26j01j22K22j1n4qkP1p7Qj5n3P7J07k5j37K2Q6q4J4M4R3l5l2r7R5j58J46k3
3340ckQ3o0N9j90N4%k0J24kQ4m6j43JJ20K1j38J39j3j64J33o4N4j56J01nJ19p2P1o0j89K44
3060H0m7j8K8o1K3n8Rk9Qo5J44m8J09j5L3p0j38N1J13j6n3K4n4M0L5j73Q2L6P9J34j75j5m0
2771d7R1j46Q5P0l0n1M9j7Q4l8j39J01M6M5O2m1j49o1P3n0J2j4L0j0R3o9p5K51j82J30q3K2
2491D2n7Q6M1j54J82k19J51p1J45j31L2j5r6J20q0R3j65O0P0M3p9R4n2J6j18Q6M2j22j00K07
2229E1Q4o8k8n6J13Mj77J19l1R1k3mj01J08o0J0j52R6l0M5J48j47%J23j52m0P0m9K72l9k03
$$ plain form
4241 -25 -53 51 28 -22 -57 140 15 110 25 -59 -33 20 9 30 -25 -36 -83 48 -28 -35 24 15 -104 13 -4 25 -43 -35 -22 -90 -45 129 -8
3952 -8 45 108 12 8 47 10 4 -33 -16 -70 -30 75 69 30 -16 -58 20 -38 -125 -36 -4 -87 -69 27 28 -39 15 71 -4 -3 -12 82 -164 35 -57 69 62
3629 62 82 99 172 46 -55 -177 45 34 -20 -28 -30 41 -36 -28 -43 -96 -19 88 63 -74 -52 34 -50 -36 8 101 66 34 -63 32 -126 20 -3
3340 -3 -5 78 18 77 -113 -59 -59 -79 45 43 127 81 -62 -61 59 80 -58 81 68 -96 37 -27 27 -129 -28 -33 86 14 85 25 -164 80
3060 80 33 15 43 -18 5 -53 -44 -73 -65 -130 14 -34 75 60 93 23 -115 -64 49 33 -20 4 -50 -10 25 -148 -66 -30 49 183 8 -7 -47
2771 -47 44 -102 -17 53 23 -28 21 4 88 50 -89 12 58 103 165 124 -25 -86 -13 -63 -51 -65 -35 -45 48 -21 -96 155 -27 103 20 42
2491 42 -15 71 112 -42 140 -79 72 1 146 15 47 32 -64 56 -24 69 -96 -36 34 77 -2 92 40 56 -62 24 66 -56 -156 51
2229 51 135 67 39 -17 96 100 -77 42 11 102 79 75 -26 82 22 32 -120 -24 -54 -9 139 -8 -8 115 -37 -77 -7 -56 216 177 -26
1957b6KR6p9r4K6J60k6l3j39J01OJ11k3m6q1M5Q7M0r6R1j5o0m6k4K4Nq8P8q4O1K5N8j68J75
1660F3o3j10Q8p6J01L9r3L3l5j4J11k0l8Q0K1J02J457K758m500O1P4k2M3o6P5j18P6k5L3j9
1397A6K0n9m5O6QK4QpO2M5o1n4Q3k49J15L9j4Q0o8l7N4k3J02M3j81L4J61j69k9LJ71o9j24
1108e5J22l8Jj15J50J2K9m9Ln6l2R5q0l7o6O2Q4n1q1J98k7n5Rl7L5o8q5J66n1Q4J04m9j07
820A5j66J21P8q0J43j25OM2o2J08j07k0O6m2ko8O8m8J12J1l5k4J15l5p1j17J51J0O4l8j12
548d2k9R3Lj70J84l1l4M2L3l6j2j4J03jk0j76J16P1J4K2j36o2J51j4N8j36R3o7J25j06m1J12
268I3N8k03J79J0o2l0M8n4m0k0mn0J3L1j4Qn3O3l5O4M3n3m9J16j17P9J11j15N8j1o3Mr2J45
-29E8M1k07N4k6M8M3J40k8Op5p7mJ11j07nj9Oj6J06J13j68R2j52
$$ plain form
1957 -26 -24 72 -7 -101 -75 85 59 26 -113 -12 -6 105 82 36 -45 0 87 127 31 122 107 47 1 -23 1 6 -82 -4 -88 -27 -2 56 -112 63
1660 63 0 -110 -22 -98 3 42 -51 -18 -53 -67 44 24 -14 66 87 189 1646 4404 -96 -35 39 17 60 -6 69 -49 27 2 35 16
1397 16 36 -23 -68 -2 6 30 38 31 93 138 77 23 106 -143 -28 11 -3 77 9 -28 26 3 105 148 -33 1 162 -7 -36 -33 138 69 -55
1108 -55 67 29 30 -85 65 77 106 57 60 4 -28 67 -13 -50 -116 -54 30 -21 -102 96 69 14 23 -14 21 -47 -132 34 -17 67 171 122 15
820 15 -151 -30 48 -32 111 -14 -8 34 -28 80 -27 -47 19 -23 -25 -93 -25 -73 39 50 15 -9 106 71 0 -117 34 44 108 70 -42
548 -42 -71 22 25 -145 39 8 -26 16 49 13 1 -13 90 89 69 -107 9 80 94 116 -20 -82 69 55 113 -23 70 3 128 22 -19 93
268 93 151 -52 127 137 75 45 93 39 -1 -21 -25 -75 -62 -31 -45 -37 -90 -27 -62 2 45 -8 -57 59 -58 21 132 17 75 64 1 5 -87 58
-29 58 99 -108 -54 -80 -32 11 151 123 129 54 -23 -27 84 -23 -28 -47 -41 -57 49 162 -6 86 -66
-230f6
##PAGE=	F1=-12141.6
##FIRST=	23146.756194512010552,	4241.1435120000014649,	0
##DATA TABLE=	(F2++(Y..Y)), PROFILE
4241b1rL4K4l9j3K22j53N6m7k3r0O8K1M9p3j9n8J17k2n6K4j1m5R5o5R9o6j2Qr1J3K18j38J7
3944A4J50j27l4K6rk7n7K3m7L2J23Lm4k4j01J09n4o1K9M1o9P1R2m9r6R4L1k0OL5L9k74K34
3655E9j10J12K7L8j9P4j47o3j46K23Lq7J4pQ2o0J5l8m3L0R7K1j57N5M9r0P4LJ20l1m6j16J47
3366H3k09J41L1l0R0r1Q2j57K2p7P6N0kJ06m4j38k8J06N9j07J44l6j67J66q8Rq1J16k3M1l3
3095A1Q6o7k12K50m2k0L5q8O1l5j1jk6n4J53q0J01p2Q1j6j43N7J18k0l7k7j9l1Q1j15lO1O2
2806C8J28j15r3N4N5j83P7K1K0m5M9L0N3pj58P7N8M6M5k8j27q4M9n5KO8l9K4R8j36q9L01j53
2517a9J34m7Qj35P0R5r3J13k48J70o8J21r9J8L1j21J68q7M5j55Q5N1K8m1N6k0K2j34P6K7r0
2246c9j12K12R3j01p5jJ12K0j83J02j2K9L0L2j43J36p9pj50J38o2Q8J12p9o1J06j67%Q5j2
$$ plain form
4241 -21 -30 4 28 -11 -24 198 45 101 54 31 -59 9 30 79 6 -13 -71 46 24 -32 -8 -19 -64 31 -34 65 -1 -13 -5 -96 -83 135 -3 14
3944 14 164 37 3 29 20 -7 -64 -41 -88 -56 67 70 26 2 -99 10 -44 -105 -76 -35 -104 -33 59 10 -86 8 39 19 25 60 99 -175 59
3655 59 -51 61 88 126 107 181 34 -29 -175 48 51 -36 -22 -29 53 -7 8 -30 -73 -43 54 75 -82 -27 22 -68 6 9 129 98 52 -64 83
3366 83 -126 15 46 16 106 15 97 -60 -38 -115 -39 11 9 115 71 -67 -95 11 70 -37 107 71 -96 70 -18 -9 -90 26 3 44 11
3095 11 97 30 -182 68 26 6 41 -47 14 -21 -32 -33 -59 -113 40 -40 61 -11 70 54 -89 -32 86 66 29 2 -17 -48 33 -82 -85 -24 38
2806 38 166 51 -42 12 67 -116 -39 -18 2 -43 6 36 89 82 -76 1 59 105 150 122 -5 -89 -40 -95 -93 -25 -64 -40 58 -78 -167 134 -19
2517 -19 115 68 76 -59 11 106 13 126 -122 48 -20 101 2 20 51 -70 98 11 56 -99 -14 37 65 24 80 60 82 -52 24 51 -39
2246 -39 -151 61 154 53 -22 -23 89 109 -74 28 16 45 75 107 -36 100 21 14 -136 2 -60 28 140 61 0 106 -61 -61 24 12
1983A2J99n0j81mQ3r7k6J5J16k8m1j08J04oQ8J9l5p3mO9Q2j21P0M9r0r1k8Q1m1RL9n5OQ9K9
1677H0j41J29l0j05N4o9J15K0l7k9j4l6O5l4M2M4N8K05K422M291p160P5J22j01R2m1O2j27
1432d8R0p1P7m6Q2o8J2k1L5j7N5k9K5M0j7j57J27k54R8R8L7K0n5o8J10j7KO0j59N3K02j58
1152C8l1j4R1j5p9R5r3J2j07J35N3K8l8k8k5l3O1r1Lq8J14O3o4r3J96K0r1n9O2J5q5q0J88
863F0n2O4R1q7j10r1J00J10j23J08j07K5N1j05Q0J8o6M5lj5o5O5r9J40N4m0m3J11r3m2r8R9
583a8L5J15q1j31J6N2L3j61K02l1l8N6J3n0m1N1P2Rm6j39R5L7M7Rj03q0J92m1L3j30P2m9J25
295A25r8j14J15J24j87J26kk6k4L8p9l2K6k3j2k8N5o1O3m0L2j16J23N0Oq7P4q0L2J51j08K9
15E2M7q1Qj62K16J6k07P6n0J6O7J42j2K4q7j24J6P6r0J0nl2J2R8J13j28R5j59
$$ plain form
1983 12 211 161 -20 -24 59 -38 -64 -49 67 39 -2 -110 -6 -12 76 95 60 -13 -17 52 134 13 83 132 42 -49 -77 4 -37 -28 11 -44 -38 51 80
1677 80 -61 68 38 -67 -13 -82 33 53 16 -13 -27 -63 2 -32 10 54 112 317 2739 7030 -130 -55 67 -34 58 17 79 -48
1432 -48 42 -29 48 2 84 16 28 7 42 25 80 51 76 116 99 -58 69 -185 -87 11 48 68 13 -55 55 38 40 100 -59 -6 196 38
1152 38 7 -7 84 69 -10 85 -8 4 -103 32 85 113 75 47 22 -11 50 -41 -38 -126 -12 51 -13 -106 90 110 19 -40 22 37 -48 -128 60
863 60 8 72 163 76 -34 -125 -25 85 -38 70 -37 -12 39 -66 14 32 -34 11 8 -7 -72 -7 -106 34 88 48 5 116 23 -19 -117 -18
583 -18 17 132 51 -80 -64 -12 21 -140 62 31 -7 49 62 12 -29 22 94 103 57 -82 13 50 97 106 3 -77 115 74 107 -23 49 0 125
295 125 27 -87 28 152 -35 91 89 63 39 77 -2 -34 -8 -31 -43 -71 -16 -77 -14 -54 -22 -138 -15 35 41 -46 28 -52 -20 131 23 52
15 52 99 18 26 -136 80 96 -111 -35 -85 -69 -2 140 128 152 65 -59 -43 33 -57 -47 -52 -84 -72 26 139 11 106 -53
-230e3
##PAGE=	F1=-12235.9
##FIRST=	23146.756194512010552,	4241.1435120000014649,	0
##DATA TABLE=	(F2++(Y..Y)), PROFILE
4241bqk0N2k0J5K03j59K8k3O1j92Q5M6M8r4%p5P6M0n6m1l4J9J01j28J49o1kJ1r4l4K38j23
3952Fl2K12j30o8L0Ln0p6M5j9OJ45l0j8Nj46J41q8mpJ2n4J05R5r1j16J10J1M1PJ01l9k63K47
3655I1j17N7Q2M6k3M7j61k2j35J74K9j14M2k5J08n7mk8m9LO4P8j64P4M6j03J22m1J32m2n5
3384E5j27J97k29J30N0o7J14j11R4j05Lj02J04k6RR8l8j04n5O6R4p4J40m2j33J77j48k3J9
3130c4J17l3l8oR6p4j93K11m0k2K1o8J03m1j6L7p1m7J17p8R9j06P6Q0j38N1J10k2k9n9L3r6
2850f0R0n3p8Q2O7Q9n3j65J15N1j94L5k0O1k8N7O4J0K9j46K7N5M8M6l3q6j07M9n5m4J57q9
2570g9O1Q0j79r2K93r2R9knj51L2J42k2Pk34J76n1N4m5J7L9j35J95r2J3j10J04J7pOJ1M3J5
2281A08j44O2k9l6p7J86L6m1j58P8P5L5j65Q8J1m0O6O0j46J17r1J4j44J84r4J13L3K0j30R8
$$ plain form
4241 -2 -10 -30 22 2 17 220 61 89 66 127 -65 20 66 114 20 20 -55 21 61 5 -36 -70 -51 50 -78 71 10 8 19 -75 -109 129 6
3952 6 -26 186 56 -12 18 21 -29 -105 -60 -79 -73 72 42 24 29 -117 24 -64 -68 -75 -63 -117 -12 83 -8 -124 -14 -3 38 45 146 107 -156 91
3655 91 -26 31 113 159 136 183 22 0 -135 39 68 -46 -4 -29 79 22 18 -10 -59 -56 8 86 -78 -4 42 -61 61 20 152 110 55
3384 55 -72 125 -104 26 76 9 123 12 106 1 4 -98 6 -20 -11 87 49 -55 -110 -44 50 -24 116 74 -59 118 -30 -53 -34
3130 -34 83 50 12 6 102 28 -165 46 6 -16 5 -63 40 -1 -17 20 -51 -98 19 -59 40 -66 10 90 -48 3 113 91 62 3 36 -60
2850 -60 30 -23 -101 -19 48 137 84 -81 34 85 -109 -74 -94 -33 -61 -4 60 70 99 -47 -20 35 83 129 96 10 -97 -48 -103 -147 10 -79
2570 -79 -18 62 -117 -209 84 -8 91 89 84 -67 -35 107 85 92 -142 34 -17 37 -8 9 48 -87 108 16 29 -81 23 40 33 39 50 93 108
2281 108 -36 26 -3 -39 -116 70 106 65 -93 -15 60 95 -70 18 29 -11 55 115 -31 86 -5 9 -135 49 -45 68 101 121 -9 89
2019H9j66Q8L5M8O9p3r3J1M1r1RJ4L1j0m6p4J27l3O5K1j1m8k4L3Q6j20L3J05q7j38J1J06p8
1730g0R5k0ll9P3nm1Q8j3o6Rp4J11K1J6j14J0k0K7m5Q9j4J17K74K837M958q360R1J56j53J08
1458D3j5J9r0J02r6P3n1R9m7P5q0M4o6Q6k5k5M2K1k35J54k11M9J29Q6n8j0p8J25J3j06O1j00
1178g2P1K07j38k1l0J3Nl1R7j35Oq4J15O4K4pn8Pk3%n8L1r8J45M1n3j23J63P3j04r0J09%r0
881d4p1K28q8M7N3r3r2k2M6J41j23L3p0L5O8j40M1J11q4L4M0m4p0N9j24J52J02m6m9P8j50
610d2J1p6J2Q1J21q3j22M2J4M5j17K03k0n2O1j9n2m4R1J3L6o4q8N1L7L8K5n5j00J87m8J3j30
321c1M2RJ01r7j65J18J68j61O3lmj3M3j13kN3m7L3r5R3q3J04l8kj61J54N3P8j22J4k6j5J63
32A11p9pP4o3J4j90K34k0j78O9n2%P3J24%M3q1j49K6K8m4K8j0o4K9R1R4r1J11j35
$$ plain form
2019 89 -77 11 46 94 163 90 -3 8 49 -42 -33 -19 12 2 -44 -118 9 -24 41 62 51 3 -21 12 98 -22 11 116 29 -109 -98 8 -70
1730 -70 25 5 2 -37 36 31 -10 78 65 -1 8 -66 45 66 82 -32 -22 -42 -15 -60 29 15 132 406 3243 8201 -159 -68 88 -65 43
1458 43 28 47 -43 59 -37 36 -15 84 37 112 32 76 10 96 71 46 88 109 -126 28 -183 -134 -5 81 23 13 -65 60 73 -33 28 -72
1178 -72 -1 206 68 47 17 30 35 4 101 -34 -28 -112 3 67 91 84 26 33 10 10 -48 -17 -115 30 71 18 -105 58 131 27 -63 46 46 -44
881 -44 -115 113 25 72 125 32 -60 -82 -36 105 -18 15 -55 -20 48 -92 -51 60 -24 10 50 6 -64 -5 -129 23 125 79 30 108 -42
610 -42 -31 -107 -95 -14 107 24 -98 -56 -42 3 -114 89 69 17 78 59 7 -37 54 67 103 39 -49 2 39 77 102 47 -53 134 86 99 -31
321 -31 11 20 121 24 -141 -23 145 -16 47 44 40 27 70 -43 -45 8 -39 -6 -101 -8 -91 13 -25 -27 -188 -34 19 97 -25 -11 -37 -52 111
32 111 32 25 99 36 50 -140 94 74 -104 -35 -87 -87 -14 110 110 153 72 -77 -51 -23 -67 -39 -49 -113 -84 7 101 10 121 -14
-230a4
##PAGE=	F1=-12330.3
##FIRST=	23146.756194512010552,	4241.1435120000014649,	0
##DATA TABLE=	(F2++(Y..Y)), PROFILE
4241B6k1m6O2oL6J51j53L4j3J20k54J25N3Lr7M5j07K7P9Kj06q0N3J25j81J65o5M5J1n5j00
3970a22K39j10q1K34j04r2N5np1q5P7J7k7J62q3L4J5j59J63j41N6pm5l7J00J02r9j08Q2J0
3707c0O9J2J58j05k19K33j18j3J31M3OPj58mj05J13M8j10N9n6J35m9l2j6n2oJ4J48j66P5P3
3436H5j18J43p5J17o2o1j15K32k18J33L4j09J31j04R6m2k0o9P0q7K9O4m0m7o4PJ03l7J36m7
3174F5p5J61k02k3P6J25l3q7pJ08r3j32J47n8kj8LJ10o6k1P0r2m3M6l9R9j05M0J58j26N5P3
2894A14k1l8n4Q9j29N5j8j05R2P2N3j6k04J28O8j77l2k4P3nO4Q3l6N1j03j4L5M7N1m4m1j37
2614a23P9n1r4K20j09Q0N8j71j05K35k5M6L8Mj10k9J52M5q6j65J40k9rj4L6K3j49J99r4lm1
2342e2J23k8m4L4qJ09j0j55O1j05L0j6J16l5N8k08J39J3M9j33Q3L6j13P8O5j08O1p8N1j37
$$ plain form
4241 26 5 -41 21 15 51 202 49 83 70 190 -64 61 114 117 20 65 -42 -15 64 66 -40 -120 -67 58 -123 42 -23 22 33 -22 -122
3970 -122 117 7 -74 160 56 -36 19 14 -57 -142 -65 -48 -75 87 4 38 53 -106 57 -84 -28 -35 -80 -117 -17 85 -14 -122 -40 -30
3707 -30 39 51 209 104 -115 118 0 -13 118 161 167 174 16 12 -93 20 68 -42 17 -39 96 47 15 -1 -53 -59 -45 103 -63 12 85
3436 85 -33 110 35 152 90 29 -86 146 -72 61 95 -14 117 13 109 67 47 -22 48 -39 -10 54 14 -33 -97 -90 13 -24 112 65
3174 65 -10 151 -51 -74 2 127 94 7 0 108 15 -117 30 -28 -30 -48 -45 65 -1 -22 48 -44 -87 -41 -80 19 -86 -46 112 -14 41 114
2894 114 93 55 1 90 -39 16 -2 -107 -15 57 110 94 -110 18 86 -91 -123 -147 -74 -79 -15 68 32 83 -20 -34 1 48 99 55 14 -123
2614 -123 -44 -95 -189 31 -78 2 60 -111 -216 19 -6 40 78 82 -28 -57 95 140 54 -111 29 0 -9 -23 13 36 -113 86 -8 -11 -52
2342 -52 71 43 -1 33 25 134 124 -31 30 -75 -45 -61 55 20 78 -130 9 22 71 -62 21 57 -56 22 87 -21 40 -38 13 -124
2080a24K26j28J06l8J16j92J10j43J81n8R8q6q5L1N2j7o6jK4o1K8m6m9J50p0N5k8L5ol2J0
1808hN3j00JJ19n7j66P3Q9r3J39q0N9k9K4m0O3L9j5j1k1q5P5L5N6j73K8J3Nl5P5p2J60K81
1520D02K456M361p380R6J53j68R8Mk7l1J02q7M0l5N8j0J26j02L9j09J04j4o5N1M4k54J48j40
1275a40nJ12J19j11K5n5J05M3j81M2l2Q8J67j02Mn2k8nLJ21j58k3m8J03K8K8L6p8K8om8rL4
986Er8J34L7l8j52J22J23q5q2P7Rr5n2K68j56M9mo9l9J2k1J71j15k6l6L1Q8j55LJ26n4L8Q0
697I6q7q2M7j03J28J54p7k9K9j65M4n6p5J27R4m8r5N1K2J4o4J72J5p8O1m6m8k0Q1n0P5p1l1
408a5oP6qN2jj10J33l2Pj46K5R2M7r0j84J14J68j17K3j7QrN9j20J8M7o6Q2j53J18p0J13l3
120El6j65J48N0J33j44m5L0l1J31l2l8O9l3M4k01K11m8j39K5j5mO9P2J6N9o0j43K0MoM6l5
$$ plain form
2080 -124 102 -26 80 42 158 -34 76 -67 114 56 154 68 -17 14 66 49 -17 -18 6 -55 -27 -73 -122 28 -42 13 -15 20 14 -18 -8
1808 -8 45 -55 -54 65 8 -158 -85 4 -89 50 -30 29 0 24 -16 47 86 71 60 39 -46 29 64 120 -53 -25 -12 -7 -42 33 -39 121 402
1520 402 2858 7219 -161 -65 88 -80 18 22 -5 -36 66 -21 19 -16 42 32 158 56 95 -14 90 76 11 62 106 -148 0 -140
1275 -140 -145 -33 86 -25 0 -55 50 93 -88 -46 -78 10 177 75 79 27 -1 -6 -3 118 -40 -63 -111 -8 20 48 84 6 34 28 -20 -29 5
986 5 -93 41 78 40 -112 10 133 48 -34 43 52 -43 -95 173 17 66 62 -7 -46 -34 -55 116 1 -25 -61 -30 58 -97 -94 32 -22 16 96
697 96 9 -73 -26 -129 -1 153 76 47 76 -89 -45 -101 -176 -49 45 -3 -98 -47 -25 -11 -75 97 112 34 95 49 1 -19 62 12 87 16 -15
408 -15 -21 55 47 99 98 -12 121 89 96 -50 -25 67 114 24 -160 -46 122 5 28 11 19 10 69 -51 -33 14 -52 30 -123 -5 -75 38 5
120 5 -31 -196 -48 2 135 -9 -54 -24 -55 76 44 6 75 42 86 -115 96 48 -91 -66 -81 -85 -16 56 72 131 71 -72 -52 -48 -54 -8 -43
-169d3o8J6R1O7o8J32r8
$$ plain form
-169 -43 -111 -95 -4 63 -5 127 29
-230B9
##PAGE=	F1=-12424.7
##FIRST=	23146.756194512010552,	4241.1435120000014649,	0
##DATA TABLE=	(F2++(Y..Y)), PROFILE
4241F0m1m3M9lL6R7j42P3rJ15k66J81N2o8p4Q7j36j3Q2P6j25j35N3J42j98J46q4J08PJ7j63
3970a19K18j06j11K24o6r8P9k1q4p7R9M2m4J68j24R1qj36J70j87Q6K1r2j6M9J03n5q9K6L0
3707b7N4J6J80j33j57J99j24p2J59L1N0k5j25k7p0P6M2p6O5r6J54l8m1k0m1j1l8K13j63O4
3445A9J08j20J26q8Q0q0o3q0K43j84J39Qj39J21o9R4J5n5j2Kj07N0K5n9J4n3m9P2OJ38o6j3
3165B3J29k15oO9J44l0q9l4J26j15o3R1r8M9q2J00O2q6k9R0p4m1k8L3Q6p8rJ82j05P5jj1n6
2876Ik4J34j19pk1o8Q3O9M1k2j92J00Q9j45j00NO9QN8Q3o5N3m1k9NN1L4m6nj70J28o0j12K43
2579C6r0O5M2j19j28J58K1J1M9M1m3r7J16R8j36o1N6nl3k1O4Mj58J87r3j2K3J34o5o8L2J2
2299B0J52m4j69O9j61R4L6J7o4J25j82J52n4O1r7P7N8j78P2N4m6lm5O5j24K61j64O5n2J67
$$ plain form
4241 60 19 -24 25 22 58 155 13 86 77 192 -74 107 159 91 17 104 -32 -45 37 113 -12 -147 -94 48 -150 -4 -88 20 27 44 -119
3970 -119 99 -7 -118 106 40 -58 21 0 -84 -161 -62 -20 -64 104 -20 71 63 -73 97 -90 -4 17 -75 -91 -42 61 6 -83 -57 -27
3707 -27 27 43 223 90 -67 132 8 -64 95 126 176 151 26 -1 -71 5 47 -29 36 -60 94 56 15 -5 -46 -57 -95 118 -45 19
3445 19 127 7 133 45 125 45 -18 -98 145 -39 100 108 -31 90 21 115 130 75 63 65 -42 8 33 -26 -12 -65 -114 -42 -36 102 36 23
3165 23 152 -63 -69 0 144 114 25 -9 117 2 -61 30 -68 -19 -101 -1 61 -25 -54 36 -38 -79 -107 -74 12 -66 -75 107 2 77 76 65 9
2876 9 -15 119 0 -7 -28 -96 -13 56 97 75 -117 -17 72 -73 -173 -168 -99 -91 -33 50 -15 38 -3 -32 -27 24 58 12 7 -163 -35 -95 -207 36
2579 36 -54 11 53 -66 -194 -36 -15 -4 45 86 43 -54 62 160 24 -37 19 14 -19 -40 24 28 -130 57 -36 -48 -25 109 44 -24 8 20
2299 20 172 128 -41 28 -133 -39 -3 14 -50 75 -107 45 -9 52 -45 32 90 -88 -16 38 -8 -11 -56 9 -115 146 -18 47 -5 162
2036A62k22J40j16K29j37J19k10q3J44J00o7l5l0K1j20P3l2l8J49j04N1r1R5K5l0qK3p5k2
1782h9Q8j0j72J28M3r0J38j12J09K4j1q1J24j1j2L3l1q4QM1Q9j68K8K3kQjj08J64K36J530
1511A832K878m835Q2J09j50Q1On1L2P2o4K1oj3J7J53r4K0j30J14lq7N3N4k05J07o9m0N9J23
1248F6j13K7j2P1M8j98ML4R5Q9m7L3q0k4j2QJ50j68o3qR7l5N1O7q4L0Mm5K3J7r6P9N2k3j66
942a29R3J62m4n7j1M4r8l1K77k19N5n3l0M1Np0J88j21m6rJ4J04j48k5P1J2M8J16j31q9K6m1
662i6N8J95j32J6j7j17L3m0j31J50O2%o0M5P3n4k1J06P3j06N8n3m0J7L1r2J00o9K1n2J28o8
382A8P3M4r9M6OJ4j69K6J63k6o4j68R3J30n5J8o3K2k0P2q0K0Qp3J22j71J13l4P7on7j51J17
93e4M3J53j49q0O1qP0K0n6N3k9J05k15J80n6j05m2M9rO7%L4O4l5j15jK8rO0n3m5l6J04M5n5
$$ plain form
2036 162 -60 80 -36 193 56 175 -35 -118 26 126 59 24 -6 15 -105 -32 -64 -102 47 -57 -6 -97 -2 23 -7 -15 8 -67 -89
1782 -89 -1 -11 -183 -55 -12 -102 36 -76 33 57 46 -35 89 78 66 99 68 -16 -8 33 122 -46 -18 5 3 11 10 -98 66 302 1832
1511 1832 4710 -125 -43 66 -84 -3 3 -48 -16 56 -8 13 7 -6 11 164 70 90 -40 74 71 -16 37 91 -114 -7 -76 -116 -57 66
1248 66 -47 -20 -32 39 87 -111 -107 -73 22 111 64 97 17 -7 -19 -11 139 -29 -92 -100 -3 -38 13 80 -4 26 30 -15 8 25 -71 8 60 37 -129
942 -129 -36 126 82 25 14 58 -40 -71 206 -13 42 -11 -41 0 5 -65 123 2 -44 -53 -39 65 -83 -108 -37 -25 23 139 8 -81 -55 -96
662 -96 -38 157 25 41 24 -93 -60 -100 -231 -81 -19 -19 -79 -34 39 -15 -36 70 143 37 95 42 2 19 50 -42 58 -11 10 -42 86 18
382 18 91 135 36 82 88 102 -67 -41 122 96 32 -136 -43 87 32 50 -13 9 -11 61 -19 1 9 -64 58 -113 0 -34 43 37 -20 -171 -54
93 -54 -11 142 -7 -87 -26 -34 36 56 0 53 24 129 -86 94 38 -67 -109 -60 -69 -2 -2 32 96 61 -54 -55 -27 -36 24 -29 -74 -110 -6 39 -16
-213a6J38o0
$$ plain form
-213 -16 122 62
-230F2
##PAGE=	F1=-12519
##FIRST=	23146.756194512010552,	4241.1435120000014649,	0
##DATA TABLE=	(F2++(Y..Y)), PROFILE
4241I3o0k4J3jJ7O4j33J22lM8k36K27M7j31k5J00j40l1N3J10p8j70L0J35j69J01j05J48NQ6
3979I3j92J74j09j13J99k5r0O6k2q9n1Q9M8k5J62j28J19m5r1J59k04O8O5j05J0l1R2K6q9k0
3716e9N9K0RJ59j24q8J50j26j04J58PR2l5o3q6l5P1J4l2O0j27J61l9k4l3j8j8p2K34j52N7
3445A6J24r0P0p2L9r1n5l6K20j32J21kj34P3k3R9M1q3K6o3q4O9oq8O7l7q3PN4J40r6L3R9j78
3147e5LK0J61l0n1q1J60j29j9O6j52J24j63J80j5p8l5R4l2l8p4J23M6m0o4J53p3J01r4J2p4
2876e4JJ64q5o7m0J8M4P3M3n5j47N1J12j13j42L6O3%L7O6o3M1K0k8j5O9j8l2K3j98J75r4q8
2587b03K33l7J5L9n6j43R2L5OL1Q2J6j51N6J27j35L2m8J9j0n3Q1Lj55J72r0j4M7J30q1o5J0
2307a5N1J59p3j76O5j71J49M6o6l7J27r1J09j07P1o3N9O7k09N7M9Qm8j2L9j00K88k01J6rJ52
$$ plain form
4241 93 33 9 22 21 38 102 -31 91 88 136 -100 127 174 43 18 118 -22 -53 0 110 32 -138 -108 27 -142 -41 -146 2 7 93
3979 93 -99 75 -34 -147 52 27 -63 3 -19 -108 -159 -70 -22 -47 115 -13 106 61 -30 129 -75 -7 58 -47 -37 -68 24 50 -39 -59
3716 -59 0 20 29 188 64 -24 126 0 -104 54 61 153 118 55 -31 -66 5 19 -13 47 -80 81 42 18 -15 -33 -51 -123 111 -41 16
3445 16 140 50 120 48 87 -4 -59 -95 125 -7 114 112 -22 51 28 127 168 85 111 48 -36 33 27 -61 6 -31 -114 -107 -53 87 -9 24 123 -55
3147 -55 -52 -32 129 99 48 -33 127 -2 -21 45 -107 17 -146 34 19 -59 -94 0 -32 -70 -144 -21 25 -15 -79 74 1 102 8 20 -54
2876 -54 -53 111 26 -41 -81 -63 -19 54 97 42 -105 -54 58 -55 -197 -161 -98 -98 -61 5 -58 -17 3 -25 -40 29 11 -21 2 -196 -21 -115 -203
2587 -203 30 -7 8 47 -9 -152 -60 -25 -19 12 94 110 -41 15 142 7 39 -9 10 0 -53 28 31 -124 48 -42 -56 -9 121 40 -25 -15
2307 -15 36 195 122 -54 11 -160 -11 35 -31 -68 59 -32 77 -30 41 -22 37 104 -105 -48 1 9 -39 -51 -12 -112 176 -25 -9 -18 134
2036A34k08J70j01K15j60J11k53p9J97J40r3on4j2j28J15lm2J21j21L7j08J27K7j2l6J9n5
1791e8k9K6M1j59J48Jq7J20r9J20P3k5j11J26m5K7M1k9n9o4K4J10r4Nj6J0P0j09j00J26J71
1520A55N98J341k159N1M5j08O9j3m5R0J4n5M0J6o8K6J46p1j2j13J16Mr1M0N0j07L7qn3lR2
1248B4n5JK2M2K6j64l6Q7Q7pJ8M4r2RPj8J58j66r6L0Q5q4Q8O6q0J9jRK2mr2MO5jj55P1J77
925A10Pl2j08Q5r4j4K37k43N0p4J2J17k6q0J78j41l6J3mJ09j23m4j2R2N3J33j53q2JK8l2K02
645A29j78O2m6k3ll3j46J31N2M3k9K5J34j25rK3J39j22N7m0k5N0l0j10R7o1N5o0J52j13Q2
373G8O1o5m2N5K7j82L8J85q9k2j26M9Q8LM2j29M2m6P3j0K3n2o4J25j39Q5JJ1L0n1j40Q8L4
85a9J45j45q4N6M3QN8o6N4p0J82k29J75n4q4j01J12k4O9o2M2O1j5q6l3Q6m3O8m8j3j07J27
$$ plain form
2036 134 -74 96 -5 210 50 161 -92 -171 26 166 73 67 13 1 -127 -12 -15 -57 64 -57 -20 -128 -1 26 14 -22 -3 -58
1791 -58 -87 -61 -20 -179 -31 -30 -117 3 -96 24 97 72 -39 87 42 69 110 81 22 -42 -18 92 -2 3 -13 -3 67 -42 -142 -16 155
1520 155 753 2094 -65 -14 31 -77 -8 -21 -66 24 38 -17 23 39 -29 -3 143 72 60 -53 63 67 -24 16 66 -41 -4 -12 -65 -68 24
1248 24 -31 -30 -8 34 60 -104 -140 -53 34 27 45 89 -3 6 13 -5 153 -13 -109 -79 6 -78 10 76 -4 15 14 23 45 41 -51 -47 18 17 -138 -67 110
925 110 117 85 -23 62 -32 -46 191 -52 -2 -76 -64 53 27 -53 125 -16 -52 -39 -43 66 -57 -101 -113 -21 32 165 12 -70 -69 -41 -73 129
645 129 -49 13 -33 -56 -59 -92 -238 -107 -55 -12 -41 -16 118 -7 -16 7 146 24 81 41 16 66 36 -74 23 -38 17 -43 109 -4 78
373 78 139 74 32 87 114 -68 -30 155 66 44 -82 -33 55 58 100 -29 13 -33 40 30 53 1 -63 62 -77 8 9 20 50 -1 -141 -53 -19
85 -19 126 -19 -103 -47 -4 4 62 -4 50 -20 162 -67 108 54 -30 -131 -19 -43 26 -36 6 67 52 -34 -67 19 -24 44 -4 -17 -124 3
-195CL3m1J16l4
$$ plain form
-195 3 36 -5 111 77
-230G7
##PAGE=	F1=-12613.4
##FIRST=	23146.756194512010552,	4241.1435120000014649,	0
##DATA TABLE=	(F2++(Y..Y)), PROFILE
4241A15p4Kl9J9j5N5j34J53J0l7j82K31L5j52L3Q2j14k5J2P6J7j67KJ09j08M5j14J43J0J13
3979A01j63J07j06r5J70J8p9J3rq5qM1L5L2J42r3R9p0m9J39j91J8J09r1M6j12P8J00j17l4
3716e4Q6mj4J17j09j4R9j20j01J31k2J14k7J1j50jP5rj0N0j32J57o9Ok6%k3p6J86j33P2J03
3436A13l2ll4J8j07k2j2J72p0O2J6r1jJ3J23J6p2K5j08l2P6l0r9J03l6q5o0R1J33j31N9Q1
3156G6j04j4j6J45l3kj19J99j31j0P1k02K01k37K09p0m3m0Q4J3l3q3K11k3oj14R9m1J15j70
2894f8N4q9KJ72n2r6m7J08j9R5M5q3j05lJ33p8j45M0O1k8J1L7k2J2P2m2%R8q8j1M6k16K05
2605aj43m0J99M0n4M2j4j22L8L2J9qJ04M3j70NJ26r7Q0j23L0M1q5P3K3j38J68q6oK4J03p5
2325B8l4qP4J35q4j63L1j35J87J4r9J4Q4QM3j37P6m1L1N9j94N2N7L1n4j0j5o0L04k28qN3P6
$$ plain form
4241 115 41 43 4 23 8 63 -71 82 92 55 -127 104 139 -13 20 102 -12 -37 -25 51 68 -99 -97 12 -96 -51 -165 -22 -12 101
3979 101 -62 45 -61 -156 14 32 -47 -34 -43 -128 -136 -95 -60 -28 114 21 120 50 1 140 -51 -33 76 -15 31 -81 -3 97 -20 -54
3716 -54 32 28 14 131 22 8 107 -13 -114 17 -5 109 82 93 -57 -58 17 8 -2 48 -84 73 4 10 -16 -16 -39 -115 71 -62 10 113
3436 113 81 78 44 62 -45 -67 -79 93 23 85 101 10 9 22 145 161 89 114 6 -26 50 20 -79 24 -12 -97 -157 -66 67 -64 -5 76
3156 76 -28 -42 -58 87 54 52 -67 132 1 -9 62 -140 61 -176 33 -37 -80 -120 -36 -23 -56 -139 72 49 43 -71 28 -13 102 -68
2894 -68 -14 -103 -101 71 19 -77 -124 -16 -35 60 105 22 -83 -86 47 -31 -176 -136 -75 -103 -92 -55 -77 -65 7 -35 -35 63 -25 -36 10 -206 -1
2605 -1 -144 -184 15 55 1 43 29 -93 -55 -23 -4 -12 92 135 -35 -30 96 -1 79 -44 -14 27 -58 15 38 -100 68 -18 -24 0 103 28
2325 28 -6 -14 60 195 111 -52 -21 -156 31 45 -54 -40 44 52 95 -42 34 -7 24 83 -111 -59 -2 29 -25 -35 -50 -110 194 -34 -42 11 87
2036H7j55J79j08J64j23R1k39p0J85J72j01J7n7o9j05J43L5n0Q3j16Nm9R7kL3q7L8l7k3l6
1773i8Q6j41J27j0r1J03m7Q9P9k3j06Q4o1R4J2k1qj19j9J13Rk7r7M0J25k07m3O3J18P2L83
1502D79m88J3mn8O3n5j1J40n2p4R0J5p1J3J02l8m5o5J08Pq3J5L4jl5L0n2m3L5L7k6K0L0jj07
1196g8o1J18O5j00Q4K3o9M7M8o4J33j47j05N8N5r2J23L4o6Kj5P2%j4p1o7O1L0j14K4J63N0
916A27oj68J08q1LJ51k11K2o2M4J52n4m8J41j57k3L1rR8p6o1p7J52N4J08j33o1j7O6j10J73
645G6j89R4o4P8k3m2j30P5P3P1j2oJ64j62k6n1J88j13N9j7mN9o3j18Q2n1N3k2J25j25R1L8
365A08j9r8R7L7j72L5J52j06J7p6j1P0L7P4j78O0p0N4N1M0j01m6Q3p9M3L4n2M9k7j33P9L1
85a7J24j33p0K0R3k9P5p4P4j41K51k24J91n3p3j28J44l9O6q5K8O1qp0o3J37p0N4k2Qj54J46
$$ plain form
2036 87 -68 111 3 167 44 135 -104 -174 11 183 82 99 42 -27 -132 11 46 -4 79 -37 -32 -81 16 14 47 -40 -2 -39 -62 -98
1773 -98 -12 -153 -26 -36 -127 -24 -71 18 97 74 -32 52 -9 85 97 76 68 -51 -70 43 52 25 -72 -32 93 -114 -157 -94 24 96 479
1502 479 -9 4 0 -58 5 -50 -61 79 27 -47 43 58 -13 0 102 64 19 -46 62 69 -14 1 35 34 -1 29 -23 -66 -31 6 -20 0 30 29 -78
1196 -78 -139 -21 44 -56 28 51 -18 29 77 13 146 -1 -106 -48 7 -85 38 72 6 8 -7 65 65 51 -20 -87 -26 4 -110 -86 77 127
916 127 121 -47 61 -20 -17 134 -77 -55 -117 -73 79 25 -23 118 -39 -62 -31 -40 58 -18 -79 -156 -4 50 158 25 -36 -53 13 -97 76
645 76 -113 -19 -83 -5 -28 -70 -200 -125 -52 19 7 1 165 3 -23 -74 114 1 60 43 39 98 35 -83 -1 -52 1 -21 104 -21 70 108
365 108 89 -9 88 125 -47 -12 140 34 51 -25 -36 34 71 145 -33 27 -43 11 62 102 1 -45 38 -41 2 36 -16 33 6 -127 -48 -17
85 -17 107 -26 -96 -76 17 -12 63 -11 63 -78 173 -51 140 87 14 -114 30 -9 57 -28 0 61 53 -17 -80 57 -13 41 19 27 -127 19
-195A9L1k8P7k0
$$ plain form
-195 19 50 22 99 79
-230G9
##PAGE=	F1=-12707.7
##FIRST=	23146.756194512010552,	4241.1435120000014649,	0
##DATA TABLE=	(F2++(Y..Y)), PROFILE
4241A15p9K4q2O3n0N2j44J47L5r0j29J90Qj24Q5N2p6jk1rJ09j24j7P7m2pj02R4K4R3q7L5r2
3952g3p8J46N9p5n6J5q0M9l2J4J02J07l9M1o6k5J10j54k7J35p2Q9j63O6J24j44k9J02nl7Q2
3681H6j17O8N5j19o1Q1l9J15j4N9j81M1N3pj7L5j05J41j14K3J0Lj5n5Q5j14J12M9L3o3J1K1
3401F0j32L2j7J05Lk5N2l0p3K8J57n7pQj43J8O8n5o6J16n8n9r7J11J06j65P1P1j9m7j0Q8k9
3112EK1j30K36j21k7Q4k39K57k73J79o6Mm9O4M4k2p1K68r6J6j38M9l3J19k14J13r9j8J58m0
2850a9p8l2J60r5J32M2p6q7o5J52l6j08J1N1n7nLM0k6J00p6N3J17j32MO4k27K06j73QJ41J17
2570A09j12M2Lo1k2L5K3n0J01M1j48k2R8m5Q3j37J7R1j04M1N8j15J76r1J3j0N3n5J5j1O0Q9
2290A65o1j29l4p3K05m3p9L9N4O1pj46P5l2oM3j43O7O6K0k7m3n8j7L06k32QQ6k7q1J49j20
$$ plain form
4241 115 36 60 -22 41 -9 43 -101 46 81 -9 -138 52 60 -64 21 73 -3 -4 -25 -34 75 -49 -66 11 -31 -38 -140 -46 -22 71 -16 19 -73
3952 -73 -151 -5 54 -21 -77 -62 -142 -93 -125 -111 -9 98 59 100 34 9 119 -35 -62 73 1 90 -73 -7 117 -27 -56 46 41 4 86
3681 86 -31 37 92 -27 -88 -7 -46 69 55 114 -67 -26 27 20 3 38 -67 74 -40 -17 -7 -4 -19 -74 11 -103 9 58 91 28 39 60
3401 60 -72 -40 -57 48 51 26 78 48 -25 3 160 103 96 104 -39 -21 47 -8 -74 42 -16 -75 -172 -61 45 -120 -49 22 3 -44 -54 34 5
3112 5 26 -104 132 11 -16 68 -171 86 -187 -8 -74 -70 -119 -55 -11 -33 -104 164 68 84 -54 -5 -38 81 -133 -20 -119 -137 21 -19
2850 -19 -97 -129 31 -64 68 110 34 -53 -118 34 -2 -110 -99 -48 -105 -110 -107 -67 -93 7 -69 -16 101 -31 -27 37 -190 16 -157 -149 -8 109
2570 109 -3 39 42 -19 -41 -6 17 -33 68 109 -39 -61 37 -8 75 -62 -45 46 -58 -17 41 -74 102 11 24 14 67 12 27 16 76 165
2290 165 104 -25 -59 -132 73 30 -49 -10 44 105 98 -48 27 -5 -11 32 -111 -44 22 42 15 -28 -86 -103 203 -29 -21 65 38 -43 106 -14
2010a4J12n5P9k54k8J47J97j04L8n6j10q8J49O8m9N5q9l8O0Rl6Q6j33M7k0%q5J22j28P8J5
1738b5r3Q9K0K9M3qn5K3p3J52k9j5N2j49o4J00Q3m7j80Q2J45k62M3JQ5rP0J1j4j7k6N6r8M1
1441c9J65r9j03J38qk5pK7on3j9J06j2o7%J3O6p7L6m9m9k6J25k9k5L4j4n3n9J19L1j66J42
1152A7j4j4O3Q3j02Q3j15p9O8Mo2J37jm6j6k4R4j8mk7j10L6N9m4p0J26P3L2j76J01o5K5N4
863F8j47pl6N6J25n9OQ9j40l1L6OP4rp9j06J75O2L1p3l9j8O4j56J26j59J04p7J42%o5j05M
575a38J16Q5j5l3J40j51n7r1K04q1O2ROM3n9j26P7l6J2M8N3r4R4oJ6j06J12L9j39MR3p0L7
286D8l4p0Q4L6R0j80O8p4J7P8N8j09k8J7k9kP0q4M4nj22Q6L9R8j10n4k9J25m1P2q2J01k05
-3a27K91j89K01o8n2j25J36m6N1o2j0P8j1o9p1J34n2J3NJ1j46J39L6j7L6j1
$$ plain form
2010 -14 98 43 122 -132 -160 -13 184 80 118 62 -48 -136 13 81 32 87 -2 -40 20 29 -7 79 -54 -7 -27 -27 -112 10 -118 -40 -25
1738 -25 -118 -29 -9 20 63 55 0 23 -50 102 73 58 110 -39 -103 -3 80 33 -147 -65 80 -182 -139 -138 -53 -62 8 19 5 -12 -38 18 -80 -39
1441 -39 126 27 -76 62 54 29 22 49 43 -10 -29 77 65 -2 -2 11 77 0 36 -13 -62 -88 37 8 -17 17 3 -50 -109 10 41 -125 17
1152 17 3 -11 52 135 33 116 1 -78 -10 -6 -68 69 68 22 6 -18 76 58 54 27 -83 -47 12 -32 -102 24 97 129 -47 54 -11 14 68
863 68 -79 -86 -122 -66 59 0 6 95 -45 -76 -40 -34 40 31 -48 -154 21 83 114 41 2 -16 48 -108 18 -141 -37 -114 28 28 -37 -142 -138
575 -138 -22 63 48 15 155 4 -53 -144 60 -21 41 50 56 99 40 -86 -9 -45 -33 15 68 -26 68 62 78 -28 84 123 -16 -12 81 11 48
286 48 14 -56 28 64 154 -26 42 -32 -15 63 121 12 -16 1 -28 -30 40 -44 0 -5 -127 -41 -2 96 -14 -68 -97 28 -13 59 -23 78 -127
-3 -127 164 -25 176 108 56 -69 67 21 72 10 0 78 67 -2 -73 61 9 22 27 38 -108 31 67 50 86 75
-230G5
##PAGE=	F1=-12802.1
##FIRST=	23146.756194512010552,	4241.1435120000014649,	0
##DATA TABLE=	(F2++(Y..Y)), PROFILE
4241I6q0L8r7J18p3L2j54J06P1r1q8J27l6n5J11L2n4L3m4r1J50o0k3N3mm5o8K5M7M9Kk5o9
3952f7p6J25R4q0r6L7p9J05r5nJ51M9J0k7k8k6P1r4m6J35o0J19j61O0Q2j30m1J09Pm3P2j54
3672h2J42L3j37MJ7k7J05j6N8j62R3j0K5m1J6n4J12j48J6N7lRk8k4r5J62k1Q0q9M6L6j67R1
3384bl5K8P2r5Q8J9j24L6J75j47Q6J4j78L3N1q2J2J02r5j5q6J08O6k02Q5N4O0q0L0J5j4kj05
3095a28K56j04m6Q7k61K77k49J00pM4o6L4O1mo0K70j34K2j14J0n6J26k33J75j07l3J32n5k3
2841h6j0J62j67J59M5k7r6j32J67J1m8l6K6o8rj3Q0n5R9j13J19J02j07OO9k36J75j54L8N8
2579d1J68j36M3J0J4r5M8Rp7Q5K8r3l3O1kN9j00rJ05j09LJ01r0J82j05K9k2pk8O3nJ7L5nq4
2272A9j02j6K01r0m7J7P5N1j6j38O8l4m3K7q3R8O7j3Rq8o5J7K85j99M2O7j04j4Q3j20Q5QQ8
$$ plain form
4241 96 16 54 -43 75 2 34 -120 -14 57 -34 -122 5 -31 -86 25 57 3 36 -8 -99 51 -9 -32 21 17 -28 -96 -71 -24 25 27 2 -67
3952 -67 -143 -18 76 -4 -100 -63 -142 -37 -132 -137 14 63 73 46 18 -8 63 -31 -77 58 -2 117 -44 16 98 -32 -73 36 43 0 72 -82
3672 -82 60 93 -44 -40 -23 -50 55 39 97 -65 28 18 43 2 18 -36 76 -72 -56 1 -2 7 -21 -45 -140 22 1 81 -8 38 74 -93 -2
3384 -2 -37 -9 63 -32 56 75 -49 -13 162 15 101 115 -63 -30 21 -61 -49 53 -42 -57 -143 -35 31 -171 -86 -32 28 -52 -22 -7 -21 -23 -128
3095 -128 128 24 -22 65 -196 81 -168 -68 -75 -31 -97 -63 -2 -6 -66 204 70 92 -22 -12 -68 58 -175 0 -107 -140 -8 -63 -86
2841 -86 -96 66 -101 58 103 76 -20 -152 15 26 -22 -58 -32 -100 -109 -122 -42 -97 2 -111 8 110 3 9 78 -158 17 -137 -99 -41
2579 -41 127 -9 34 44 58 -37 11 20 -57 28 56 -37 -70 -9 -11 48 -52 -61 44 -65 -62 39 -51 131 26 55 33 26 -2 61 56 73 108 103 19
2272 19 -83 -99 102 12 -35 -18 57 108 92 -46 22 -12 -55 -28 -111 -13 54 41 50 -38 -103 -86 199 0 42 109 5 -9 74 -46 39 47 135
1983A35l17K8J19K11j10N5o2j04j00J33P9k6M2n1p7J72j06m0J18j48K8JK5j12J42j19K1N5
1738hp5P0O6k7oJ0K0k2q1J59n5pQ8j63p8Q0R0l8k24J23J17k56J21m5O1J21P7r6j9qk7M3j18
1450a07J01J40j12j03J53l6M0j8o5J4k3JJ14n9m7NJ0O7p0Km1k6o2J63lr0M1Kk0l7R1mj86J74
1152Il0M6L3R7j07K9p9l1O4o0k1J22j1k9k2k5O3k6L0K8j14KP2L4j91Q6P1Q1j46P4n9N3k5p4
855e6k1j2M2M8l7N8L7q2n7J7K9N0O3q9j09J59Q6p4%k6j0M4j74R3j16J05r3J59N8r8q3n2J59
566A8Q4l7m2P2j10o9q7J75l5O4L0nNk6j36R6j7m9J27m0k4P3m0K5p7R5L3r4n1M6KL1Nj21J07
260B8J5P3j34P0n8k5Q1N1o9k7k9j4m6J15p8K5Jj04R6N7O2p5l8p5J29l4N6q5J18k37K94j34
-20IJ83r4j2j13R8k8J5j4m4J07k2p6m2O1J8n1J6Kp7R6L7j1Rk
$$ plain form
1983 135 -182 -154 -35 176 66 121 59 -45 -145 -12 67 41 83 32 -45 127 21 -19 99 -49 -21 -20 5 -107 35 -84 -63 -8
1738 -8 -83 -13 53 26 20 30 50 28 -53 106 51 44 132 -31 -109 -29 61 23 -201 -78 39 -217 -96 -141 -80 41 118 22 3 -5 -32 11 -107
1450 -107 -6 134 22 -81 72 36 76 58 -7 7 -16 -15 99 40 -7 -2 8 75 5 7 -34 -60 -122 41 38 -52 -11 -9 -29 -66 25 21 -165 9
1152 9 -21 25 58 155 48 77 -2 -33 31 -29 -50 72 61 32 10 -15 48 22 52 80 -34 -32 40 74 -117 -31 40 121 -25 49 -10 43 18 -56
855 -56 -77 -89 -47 1 -36 22 59 -23 -80 -63 -34 16 79 -10 -119 40 126 52 52 26 16 60 -114 -21 -137 -32 -125 34 92 -6 -89 -141 18
566 18 102 65 23 95 -15 -84 -171 4 -31 33 63 58 63 37 -99 -3 -20 -69 58 18 -6 67 27 52 -25 70 103 9 -42 4 6 37 42 -79 28
260 28 43 116 -18 52 -6 -31 50 101 32 5 -24 -38 -84 31 -47 -22 -21 -125 -29 28 90 15 -23 -98 31 -3 53 -32 86 -151 143 9
-20 9 192 98 86 -27 71 43 58 44 0 107 85 9 -33 28 46 -5 11 13 -64 32 69 58 67 65
-230F5
##PAGE=	F1=-12896.4
##FIRST=	23146.756194512010552,	4241.1435120000014649,	0
##DATA TABLE=	(F2++(Y..Y)), PROFILE
4241G0q1M2p7J56p3j2j49L7J17n1n9P1q8L5R9K6n4O6o3j26J24Jk4M4mo8k6l2P3J9O2o1m3q7
3944a36J07J08q9q3N0p6J35j19j5J60k4L3p2K3l6J9j4m1J05n0J21j07N5jo2q9J11J7l2Q9j96
3672a09J78M0j76O9l9OR7l8J8j12J58r9O3o3jQP1j46lP6kL9j9r1p5J96q3R5q2O7L9j91J31
3384B2m1n1J18j14J18L3j45N8J40k10J67N6k10nM1r3J02O4j26K9l7Q7L1k43J08K5J14r4O4
3130Hk6Jo3n6K58q3n3P4k66K57j68LN7P5q3pP1J2n0K14j16Mm2j6r9J45k41K15j11k3J01p4
2850h2L3lJ34k11J49O4L5j08j90J76M7J1p5j9m7mkP4o3Q0j27J54M7ooN3k37J15q4M9k9J77
2570A05j28N1K5O3j61N6j1q0P4K3l2m7L9J9K5m5k5P1j07j7J38o2J71j19K0ln0kQ7oj6k5P1
2281A02l2j48J4J79r7m7l6J34PPj14N1l4o7Rm1J24O5m7K5j06m2L9K36j27M9J4j21K9jj00Q3
$$ plain form
4241 70 -11 31 -46 110 37 25 -124 -87 30 -21 -80 -9 -97 -62 37 63 9 75 12 -114 10 11 -13 31 27 -41 -67 -99 -26 -7 55 -6 -49 -136
3944 -136 -29 79 -10 -93 -43 -119 16 -103 -118 42 18 51 -21 2 -34 -15 -29 -70 35 -15 106 -1 54 53 -9 -98 13 30 -2 87 -109
3672 -109 69 109 -67 2 -37 -31 66 28 46 -66 92 -7 56 -7 -8 0 71 -75 -78 -2 -4 35 16 -75 -150 46 -37 58 -24 43 82 -109 22
3384 22 -19 -70 48 -66 52 85 -60 -2 138 -72 95 151 -59 -64 -23 -116 -14 50 -76 -47 -84 3 34 -209 -101 -76 38 -56 8
3130 8 -18 -17 -80 -136 122 39 -14 60 -206 51 -117 -114 -57 18 -65 -72 -1 11 -39 175 59 63 21 5 -94 51 -190 25 -86 -109 -8 -82
2850 -82 -49 -52 82 -129 20 84 119 11 -179 -3 44 55 -20 -39 -86 -90 -92 -18 -81 -1 -128 26 73 67 61 114 -123 -8 -92 -43 -72 105
2570 105 -23 28 53 116 -45 11 0 -80 -6 17 -15 -62 -23 -4 21 -24 -49 22 -85 -102 36 -26 145 26 46 43 -7 -9 78 72 56 31 102
2281 102 70 -78 -64 115 18 -29 -65 69 76 83 -31 20 -14 -81 -72 -113 11 76 29 54 -52 -94 -55 181 54 103 117 -4 25 24 -76 7
2001GM5J13l11lJ11J97j17P0q4n0j28R9P0J0L1kj06K40j99kJ09j20j1K2M0j15J27r9k2P4k7
1730c1M3P0m9m1J7Q2l4o9J12o3J6P1j72m0O9K1kk08J47N5j99J60p0L7K30R6k30Jqn9L2j10
1450a26J62O2j06m9J27m8Q5j1j49K0L6j0J15j15k9K5L8J3j1o6k7Pn9J31M0j42L2N0qj1L9k7
1170a2j56J68nR2n5R3p2ko1J8N7j10mQ8Rk4ll2J6l9Q6O0q3k3O4R5k89O1N0J25j06M5o9P7o7
863hj3j8J2J0m3oQ5Olq5j9L1M1J12q0r4J12J14j46M9l0OK8j78Q7r1J07j06J45J10j26n5q1
575a27J86O3o2l4j0o7m9n0J17J0N9L9l4l7J5j40J22Rr5J79j10O0J1l8Qm1N8K9m6j03K4P0O
286B2M8j53J10kK2o7P1l1n6Q5KLm5l9k3p4J48n0J1Nr8J05P3J5l5k6j01J06j4L6q3J21k34K62
-12A14p3J26j08M0j08N5Ok9K7m9J23l5p3J1m7J02j15J7lRL6K0nmQ
$$ plain form
2001 7 52 165 -146 -149 -38 159 42 112 28 -22 -150 -51 19 29 60 58 -48 192 -7 -9 100 -20 -31 -9 31 -84 43 -56 -78 -4 -31
1730 -31 12 82 33 -8 9 91 57 -12 100 37 53 124 -48 -88 -19 2 0 -208 -61 -6 -205 -45 -115 -78 152 248 18 19 11 -48 -16 -126
1450 -126 36 98 -8 -57 70 22 107 96 -53 -33 3 -7 108 -7 -36 -11 27 40 29 -37 -64 -57 -116 15 55 -87 -55 -5 -13 -24 15 -12
1170 -12 -168 0 -5 87 32 125 53 51 -10 8 65 -45 -49 39 48 24 21 -11 5 -34 52 112 29 6 70 165 -124 -63 -13 112 6 51 -18 59 -8
863 -8 -21 -39 -27 -17 -60 -66 19 25 22 -63 -82 -51 -10 102 22 -72 40 154 8 57 27 33 61 -117 -30 -121 -14 -120 25 135 9 -46 -127
575 -127 59 122 60 26 16 -51 -100 -150 -33 -23 36 75 41 4 19 -121 1 10 -85 94 -16 44 55 17 25 -16 42 71 25 -78 -54 16 22
286 22 70 -83 27 25 47 -20 51 20 -36 49 51 54 9 -30 -53 -127 21 -29 -18 -13 -111 -6 67 82 47 21 -80 26 12 48 -35 86 -148 114
-12 114 41 167 59 99 -9 46 52 23 50 1 124 89 16 27 -20 82 -33 -16 -19 -10 26 46 41 37 45
-230D5
##PAGE=	F1=-12990.8
##FIRST=	23146.756194512010552,	4241.1435120000014649,	0
##DATA TABLE=	(F2++(Y..Y)), PROFILE
4241E3q6M1m2J59m9o4j20l9J59ml0L0j25J22N0K4o3P9o6j12N7M8m1M6k5q2J3o1R4J4Q4p6j6
3952b8r8R3R2r5l0O1o7J19r8j3J28q5K6q4P5m2m8P6l1O0k7Q6k8M5q0K8j45J12J4k1J14k10
3672a01J57O5k14J16o6L5Q7o5k6p2K26j77Q3p4mO1K8j06j7M5J9O0l6j02m6J97j27Q3n4P3K5
3401G3j89J43l2j08J20p7J36J5j37R2M8k18K18R9k17q3M9p4J65J3j32N1J8N9K7k78J26mJ35
3147C8r3O5j0Nj30pK39n9m0N2k47K06o0q4P4J05q6n8Q0J9l0J29o4l5N0l2j33J60k32K07r4
2876f5PO1p3O1j9J13k17R9R5P2r9k13J72N6N0r0p5KJK5K9m3N2r8J24k5J23k0K3k18M2LN2r2
2579h5J54j14P3M1N9j78M2j8o3P5L0Po6M3J6j6%k0Lr4j2J61l3J43j15k6K2o0K7P4j6j8q4J37
2281H9K5j61J9J39n7q7q2J84l5L4p4K8k7p2qk8J20P5o1J0p9k1N3J69l0Ll9q7M8p0p7R1O0J38
$$ plain form
4241 53 -33 8 -34 125 76 12 -108 -147 12 8 -22 8 -117 5 55 79 16 95 29 -83 -26 22 -19 27 2 -80 -67 -128 -34 -20 64 -12 -28
3952 -28 -126 -33 59 -36 -66 -5 -72 47 -51 -64 64 -21 5 -79 -4 -46 -94 -18 -49 11 -16 70 42 87 7 35 -110 2 16 -5 109 -101
3672 -101 56 121 -93 23 -43 -8 79 14 -12 -84 142 -35 48 -26 -30 31 59 -47 -64 -19 0 60 24 -78 -124 73 -54 29 -25 48 73
3401 73 -116 27 -5 -113 7 -70 66 81 -56 36 84 -134 84 183 -34 -117 -68 -142 23 36 -96 -45 -27 32 59 -219 -93 -97 38
3147 38 -55 10 0 5 -125 -132 107 48 8 60 -187 19 -41 -125 -51 54 -32 -90 -10 9 -21 108 44 9 59 27 -106 54 -178 29 -65
2876 -65 -58 3 -70 -9 -28 85 -132 -33 62 134 35 -178 -6 50 100 10 -65 -63 -62 -37 -8 -51 1 -97 27 2 125 105 128 -90 -48 -45 7 -85
2579 -85 69 -45 28 69 128 -50 -8 -26 -89 -14 16 23 -43 0 16 0 0 -20 -17 -111 -123 38 5 148 33 7 29 -31 -4 70 54 36 -48 89
2281 89 114 -47 -28 111 54 -33 -115 69 34 68 -6 22 -5 -77 -85 -113 7 82 21 31 -48 -69 -16 153 123 126 87 0 48 -22 -99 -8 52 190
1983A90j71j47J10J46j14Q2j14J8j36N4N4L8J2M5j24K56k40N6P6p2m4L6L7r4P0n5l9N1L4J8
1721C3K7j7n3J2J07l1k8M6o2N6Kj73M3O0r0M0j44J44j1j10J45p9J4K44N7k05L5l2j05L1q7
1450a31K14m2j14N3P6k6Q6Rk00J0J02k1P9j37m1L6R7n0P1j47jK9k2M6P5j53mJ23opk2k6r1
1161a35J17N4J14j75Q0qjo2M4M8j22j8N2L7l1M2n1rp2J61M0l4l3L8J26l12N1K4J52q0J9q7
881c1R4r1L8j5N0k5j15J7Q0NO7r9n4%L7J23m2p0M9J30j44N7m1J7K3j74J03r0J02j05J22J27
601A45j38j0q6J86K1o3l2o3m5j2mN7M2L9M4o8o5M8j39J31M4j06J86j29J34q5j1j8j5K0L0k
321C6j17PJ05k5Q9j55Q7j1l5j4P2pp0J08p2O9p4j5l7o7J39j4LK3j13J13Q2l4j2j5r5O0J8J9
23D8q7J21k12K07k6M7q3Q1j07K2M5o2M7k8R9m0n1N0j32J54j47K1ON5qj3KpJ4
$$ plain form
1983 190 19 -128 -18 128 14 96 -18 0 -136 -82 -28 10 22 67 -57 199 -41 15 91 19 -25 11 48 -46 24 -31 -70 -19 15 33
1721 33 60 43 -10 2 109 78 50 96 34 90 92 -81 -38 22 -68 -28 -172 -28 -39 -149 -4 -83 -69 175 232 27 62 30 -75 -44 -131
1450 -131 83 41 -73 -20 56 30 116 125 -75 -65 37 16 95 -42 -83 -47 50 0 71 -76 -77 -48 -70 -24 51 -102 -106 17 11 4 -18 -44 -135
1161 -135 -18 36 150 -25 55 47 46 -16 28 76 -46 -64 -12 25 -6 36 -15 -24 -96 65 105 71 38 76 202 -110 -59 -35 117 37 56 -31
881 -31 63 -28 10 -5 45 20 -95 -78 2 7 74 -25 -79 -79 -42 81 39 -31 18 148 4 61 20 37 60 -114 -11 -101 1 -104 18 145
601 145 7 -3 -89 97 118 55 23 -40 -85 -97 -101 -44 -2 37 81 13 -52 -4 -143 -12 32 -74 112 -17 117 32 21 3 -12 8 38 36
321 36 -81 -74 31 6 95 -60 27 16 -19 -33 39 32 -38 70 -2 67 -7 -22 -59 -126 13 -1 2 25 -88 25 107 73 61 46 -49 11 29 48
23 48 -39 82 -130 77 51 98 15 96 -11 11 56 -6 41 13 112 72 21 71 -61 93 -54 -33 -27 28 20 7 9 2 16
-230A6
##PAGE=	F1=-13085.1
##FIRST=	23146.756194512010552,	4241.1435120000014649,	0
##DATA TABLE=	(F2++(Y..Y)), PROFILE
4241E0q6L9k5J35j8r5p3r5J73L5kLj41J91k4J5o3O4m8p1pP1p1N0l8r1L9n6R3K6P3o9Qj00Q7
3935b1N0r3K9P3m8M8m2lP2j09J2p7J09l2j16J48k5K0NK7M5K8j20R2j60J08Jk5J24j93J01Q1
3655A09k19J29m6L2O5p4l6p1K77k16P5p3J5R6j2n2k1j5N4O5q2o4j2J67j50N9k0O1Nj48J23
3384B1j9j18P0qJ42j8j12J25p6j67K42R6j78j56O5l5J82l5j08M3M8L1O3k92J19j5J24q8L6
3130a8M2Nj67J5J99l4qK8j99J46L2j38L3J24o6j06Q6J4J1N5j7r0J23l5j35J47j88J55n6L3
2867iJ4n0M7l8J22j97L6J21O9o5j91J50M2N7p3j35O5MM2j9j4M1m3L5q0K07k1lj74k3P2N6j14
2579f9J27j21J03L5J5j34Rll9Q2L8J6q7P5Ko8K8no5o7jJ69lJ11q5r2K4m2N9L5k5Pj38J68Q7
2272A46j47RP5J9j32j03J86n0L6k1J1k4n8j8l7P5J11n3j8k0l1O1J10N7p5o8l1M2j00o8R0O9
$$ plain form
4241 50 -36 3 -22 113 95 0 -73 -168 5 40 38 41 -100 91 67 82 19 83 35 -36 -43 28 -43 7 -31 -122 -83 -139 -46 -20 53 -16 -8 -108 -21
3935 -21 29 -64 -35 38 -10 38 -4 -7 65 -44 -32 -109 0 -32 -148 0 -25 -5 0 27 72 100 -20 72 -88 20 21 -4 120 -73 28 109
3655 109 -110 19 -27 5 70 -4 -40 -111 166 -50 25 -48 -33 63 51 -1 -22 -37 17 82 0 -64 -76 91 -59 0 -20 41 46 -102 21
3384 21 2 -116 -46 -54 88 70 -42 83 7 -160 82 178 0 -156 -91 -126 56 21 -87 -44 4 35 98 -194 -75 -90 34 -54 -18
3130 -18 24 29 -138 -123 76 42 34 62 -137 9 41 -97 -64 60 -6 -112 -26 -12 -1 54 37 -53 70 35 -100 47 -141 14 -42 -9
2867 -9 5 -45 2 -36 86 -111 -75 46 115 50 -141 9 51 108 35 -100 -35 -31 11 -8 -22 19 -24 11 -69 138 117 114 -60 -83 -11 45 -69
2579 -69 58 -63 40 75 90 -44 -35 -38 -77 5 43 59 -28 47 49 -19 9 4 -61 -128 -129 40 37 148 63 -29 -5 -47 12 47 22 29 -109 59 146
2272 146 -1 8 83 102 -30 -133 53 3 39 18 29 5 -53 -71 -108 -33 78 25 7 -13 -44 17 127 184 109 41 10 52 -48 -116 -26 43
1992D3J47p7k26J27O9r4R5j46O7j03NM8M2j9Q3j32K29k26J04M7l3n8M3J8n4j2Oj8j6Q1Lm4
1712aN5m1LR8m0K8Np5J05q8j47J35L9j97P1o4J15n1k5Q9p6%K07L5j25O3p2j36L9o6K37j19
1432Aj50J55L1K4M7K6k06JJ46OK3r7j42L0J62p9J43k15L4K7K8n2R0j19o1K04nl4p7Mk7M0J14
1143G2J15k80O1N9K8p6L8M4r7m7K7M8m3J01p2mj11K26k1Ol4kJ45k57L7K0J55q3jj07J18j17
863e2P5l0J13m5j46J2M9K7J03r2o7n1K9J02Nl1j2J26q2L4l9J5J3j57J18r1P6q4J07R8j26M8
583D5p8J58l1j8o2o4m6RK8K5M8QN8r6p0O8j43J10R2q5J49r3J72j75Rk8mnL8K3p4k7J01n1J11
277A02j25N1j7o8J3O5J1p5J34j36J05r4J7m0j7P8J8oN9j40J24P8o4k0j2n3jN5J2j08J27j79
-3a06J41Jk8j6R0r1JP3o9M9j2L8l5rL8j42J50j38L8K8L5j6m2JpJ5
$$ plain form
1992 43 190 113 -113 14 83 -11 84 -62 5 -98 -93 -45 -3 -22 61 -71 158 -68 36 83 50 -8 35 53 -1 -13 -7 -25 -41 40 43 -1
1712 -1 54 13 16 114 74 102 107 32 137 49 -98 37 76 -121 -50 -114 1 -50 -75 14 -62 -62 145 180 55 118 46 -90 -51 -117 120 1
1432 1 -149 6 37 61 108 134 -72 -71 75 81 104 7 -135 -105 57 -22 121 -94 -60 -33 -5 -57 33 -86 -147 57 52 18 -59 -55 -82 -42 72
1143 72 187 -93 -32 27 55 -21 17 61 -36 -83 -56 -8 -51 50 -22 -26 -137 89 68 74 40 38 183 -74 -37 -17 138 55 54 -53 65 -52
863 -52 23 -7 106 61 -85 -73 -24 3 106 14 -53 -104 -75 27 32 1 -11 115 33 67 28 43 56 -101 17 -74 2 -82 25 123 -3 45
583 45 -33 125 94 76 14 -50 -96 -87 -59 -34 14 22 80 -16 -86 -18 -161 -51 41 -44 105 12 184 9 18 -10 -14 -19 19 42 -32 -59 42 -9 102
277 102 -23 28 11 -57 -44 21 32 -43 91 -45 60 -34 -17 -57 -74 4 22 16 75 -65 59 137 73 53 41 -12 -13 42 54 -54 73 -106
-3 -106 35 36 8 -8 82 -9 -8 65 -4 45 33 71 36 27 65 -77 73 -65 -27 1 36 20 -22 -21 -28 -13
-230a3
##PAGE=	F1=-13179.5
##FIRST=	23146.756194512010552,	4241.1435120000014649,	0
##DATA TABLE=	(F2++(Y..Y)), PROFILE
4241E2p0M0m3J03Kq5k6j08J43N6K2k5j38K27r1On3L0j1l2l8P0r3M5k9r4N4l2O8L0M9m7L1r7
3944h4Q8Oq2O1Q8l2m8K1LK2r5J7p0J19j4j62J77k1kL7l1Q4Oj17J00j01R3j7m1J11j61M2O8
3655F5j78J18LLK2m9mj01K82k15N1n4M3J08m4ql3n2Q3O3j50qK4J23j55M8KK7kp7Q5j6p4j9
3357h9O2J33m7q4J30j72q2K42K9r1j77P1j2J67o6p3J8M8J1J14k79Q5nR2q1NQ1Rj46kJ37j4
3077A4M1J2j37R7Q1j53l2J17l2j31Q2PN5K4qj41J57k8j06R4j03R3j5L5l0k4J0m3J48j71kJ30
2797D1L8j9j37J16K2K7l8j75J20NK7m1KN8J1p1r4J98Kj2j17o1J08N7j00J25j54J19Jl8n9j3
2517e2K8k9Q2L8Lr7J14%j28M5Pj01l3pJ65J8Q7l6j46J2k6R3nk7L7j68J44J45j21%j1R9j38
2229hj01J38m5J0L9Qm0m2ln6KJ73l3l5L4p7P2P0J10j41p0J1K0q7p3P4P3J44k78l5J84j0o1
$$ plain form
4241 52 -18 22 -21 82 84 -1 -27 -135 8 64 86 61 -77 150 59 65 12 42 31 -1 -39 31 -62 -17 -46 -140 -86 -118 -50 -20 29 -18 13 -84
3944 -84 4 10 -72 -11 77 45 -3 18 21 43 -52 -35 -105 14 0 -162 15 -6 -8 29 -2 82 88 -29 71 -30 63 46 5 116 -45 -3 65
3655 65 -113 5 8 11 33 -16 -20 -121 161 -54 -3 -57 -14 94 50 42 9 -43 40 103 -47 -55 -31 92 -63 -15 -13 14 12 -65 20 4 -70 -89
3357 -89 -27 106 59 -25 105 -67 -149 93 122 31 -146 -75 -87 80 14 -59 -41 7 18 132 -147 -62 -67 25 -56 -51 30 39 -107 -109 28 14
3077 14 55 67 -70 27 108 -45 -77 40 8 -123 -41 -34 21 45 37 -104 53 25 -81 13 -90 3 -12 23 -7 -31 -21 -64 84 -87 -89 41
2797 41 79 60 -77 39 61 88 50 -125 -5 0 27 -14 -12 46 57 -14 -108 90 92 80 -37 -98 10 67 -33 92 -62 57 58 20 -39 -52
2517 -52 -24 -53 29 67 70 -27 87 87 -41 4 11 -90 -123 -130 35 53 140 104 -42 -30 -56 37 32 5 42 -126 18 163 42 42 31 130 -8
2229 -8 -109 29 -16 -6 33 41 1 -41 -44 -100 -98 75 42 7 41 -36 36 106 216 75 5 16 36 -51 -124 -50 23 167 -111 -146 38 28 -33
1940c3J15j65P6m7l9P1Rn3J15j34J73j75J31L4j3o0M2%nq8O2L6j01Q8Kj17J40j8nP9o4O5K
1651A23j02J39j52q5J96jk53P8%P1n4K4K0o4J2J59O5r3P2r2j42M7n1K14j31j96K05J3P7mK9
1380A24j81MJ68P3N0k9l91J9K02o3J86k56P5NO3j17Q6o7j11K56J0q8j05M9Ok9J37J09l21J8
1117a18J14O4r1J5M8n7o5J4L1m6J45p1Qj29K48r1K9l3n2J76j71PN2J42j14j2j22J55j47Q2
855A1n5J84m8j35j8LN1J09o9m9q7KP7K9K2n2J08j8Qj7jj8j17J15p4L5n2R6M1r8J12p6J18p5
557F2N8j13k3o8PL7K6K8l0R3j19m7P1j60P9J45o1R1k3J64k18kqnj7N0K0J3q3P7o7J04p6K5
260C0l3n6K4L9K8q2J41j61J03q9L4l7O8j3L9k6R4j49J29P4p5m6j8Mo9Q8K3j40J32j32P6J0
-20A0q2O8O6n3j6Q6m3M6l4k9k1M0k7p9J06j02N7N5k7Om9k3lJ6
$$ plain form
1940 -33 82 -83 -7 -54 -93 -22 -13 -66 49 -85 88 -87 44 78 65 5 47 47 42 -46 16 52 -49 39 41 -76 64 46 41 120 56 121 123
1651 123 21 160 8 -77 119 118 -135 -57 -57 14 -40 -16 4 -60 -48 111 176 83 155 63 -79 -32 -83 131 0 -196 9 22 99 95 124
1380 124 -57 -53 115 188 238 209 -182 -163 39 -24 162 -94 -19 -14 49 -68 18 -49 -160 96 106 18 -87 -38 -32 -61 76 185 -136 -118
1117 -118 -4 60 -31 -16 32 -25 -90 -76 -45 -91 54 -17 -9 -138 110 19 48 15 -37 139 -32 -25 27 169 55 43 -79 76 -71 11
855 11 -44 140 92 -43 -61 -58 -7 102 33 -16 -103 -101 -24 5 27 -25 83 65 73 56 55 37 -80 35 -39 -4 -56 40 81 -17 95 19 137 62
557 62 120 7 -16 -84 -77 -40 -14 14 -16 77 -42 -89 -18 -178 -99 46 -15 76 53 217 -1 -3 -11 -16 -33 17 37 50 -33 44 -23 81 5 30
260 30 -3 -59 -35 4 32 -50 91 -70 33 -56 -22 -59 9 -4 35 9 103 -46 83 157 82 36 18 22 -47 41 64 -76 56 -76 0 10
-20 10 -72 -4 62 9 -7 79 36 82 48 19 -2 38 11 -68 38 -64 -7 48 21 27 -22 -45 -48 -32
-230c2
##PAGE=	F1=-13273.8
##FIRST=	23146.756194512010552,	4241.1435120000014649,	0
##DATA TABLE=	(F2++(Y..Y)), PROFILE
4241D8l7M4q7Q3Kn1J9p6P1O4K6n4j21K23j28J7n3NK4ql3M2p8K1J0q8N4nL3J0K6k2O0j03R3
3935C1k3n9N4R6k1j24P2pmo4N3p4J01Pj78J71k4pN5p0R0j2r2O8%O4k4n3Q0j37NK8j04R7M5
3629D0k3k9kM6j21K23j87K2j5O8R7p3K2o6l8R1O6k16L3M6Q5j36O3Mk2QkN0k7Jj13J11J11o8
3331D9n7J04k10MK11o8K0j30M7k7J47p2n3KL3KJ38k41M4J1N5o7JO2L2p0m9N7oR4J2q7P2Q6
3034A46j42o7P2Lj20N8J4O8L6l1j62J54j8o8K0j0O6kK1n8j6k6k8J61j50kJ25KK5q9Q9J6l4
2745E3lj74J51kj6l1kR3L8j42p1J03M7mo3p0J14N5p3J47j83R4l8o6qrO7l9N8L5lr7J41J9j75
2439e4M7J9j01j1l7J56K8O4J4j59K0m5J23k2k8N2j56P7J75r4kr6J49q7r2P1l9l6J01K4p9m4
2159f2M0o8o6K39k7j9N6j35Q2L8J25j61n0K5pn1o8M1O4J51n08J60K38n7k5J32j59M8j0o1J19
$$ plain form
4241 48 11 55 -32 51 53 2 21 -55 16 80 106 52 -69 154 26 43 -10 -5 19 11 -22 20 -58 -37 -27 -115 -61 -66 -33 -23 3 -19 41 -62 31
3935 31 8 -51 3 99 78 -46 26 19 15 -49 4 -70 31 38 -140 31 7 0 55 -15 75 63 -29 39 39 103 79 26 106 -31 -26 2 -102 -5 40
3629 40 17 -12 -14 32 -89 134 -53 -31 -46 22 119 46 68 2 -36 55 121 -95 -62 -16 69 -67 -4 0 -22 -14 -16 34 7 8 -105 6 117 49
3331 49 -8 96 -114 -110 101 33 53 -77 -30 -57 90 18 -35 -33 0 2 140 -101 -57 -46 9 -58 -57 5 37 -33 -82 -25 -31 63 75 -12 60 146
3034 146 4 -63 9 12 -108 -50 -36 32 68 37 -125 29 11 -57 -37 -47 19 17 38 -20 -36 -62 -90 71 -79 -81 44 46 71 -18 71 87 53
2745 53 50 -124 27 25 9 -22 -24 69 107 -35 -106 -3 44 40 -23 -93 21 76 3 150 -33 61 23 -43 -51 -60 7 -32 26 61 58 -39 102 121 -54
2439 -54 -7 12 -89 -100 -137 19 47 111 125 -34 -14 -59 64 42 14 66 -90 -13 162 68 66 -30 119 32 -60 11 -28 -64 37 61 -18 -62
2159 -62 -22 -90 -156 83 56 37 93 -42 40 78 203 42 -8 17 10 -41 -109 -68 -4 147 -361 -201 37 -20 -45 87 -72 -24 -34 -95 24
1887B4n3p5J46j31J00j14J44K5Jo3M1pL5j26R0J01j71N7J5j73J95kj1O9p4N8K4j25J32j60
1625b8NJ92l9k37O7K6K6k6J9l2n1N9J02R8r2O3p2j28M6m0J46p6k15J84K3R4l0K0j49K3J80
1353A58J44K71k5p58K1J98l0J97k58J05k0P3j40Q7k7j26K40L8j44q9Q9lo6J22R8k82n6J49
1108c4Q8j01pO6l1o2J2%m1J55l8Lj08K03j28M0k8j12K33j13l6J17J18j55j2j28J94j60M9o7
846h3K29m2j01n5m3N5J02l7j2q2l2N6J3P8n5Q7mmJ8k5o2o4R1l7Rl1Q1j6o4J60q3Q5r3J21j48
540A2K1j00%L1M2op2J48j41%N1j81O5J86n5L9M2J17k05l5M6j7k4N9rJ07j42N8o9P8k9J0o1
251c4j0M2mM9r0J13j48Q2n9K4l8J61r1L7m5J07j20J13Q0p9o6k1M0j25J02M9j59J24p1K1Qj09
-29a17J35K5ol2Q1J0L6r1o2j3R1j06NN3n8N7O9p4L1k9o8RK1
$$ plain form
1887 24 -29 -104 42 -89 11 -103 41 66 67 4 45 38 73 -53 37 138 -33 24 39 -134 61 59 48 117 43 101 125 0 132 -28
1625 -28 -23 169 130 -107 -40 -14 12 -14 5 -27 -78 -19 83 181 89 152 80 -48 -2 -42 104 28 -187 -3 20 114 84 104 -45 -22 158
1353 158 302 573 548 -210 -189 9 -21 176 -82 23 3 76 -64 23 -4 -130 110 148 4 -85 4 1 -65 57 155 -127 -183 -34
1108 -34 54 -47 -54 12 -19 -81 -69 -69 -110 45 7 10 -98 105 -23 17 -11 -123 110 -3 -39 78 196 41 29 -99 95 -65 -16 -83
846 -83 146 104 3 -52 -95 -40 62 25 13 -69 -101 -45 -32 46 -9 78 74 70 88 63 1 -63 28 -9 0 -31 50 34 -30 130 47 132 39 160 12
540 12 33 -67 -67 -36 6 0 -72 76 -65 -65 -14 -195 -130 56 1 40 82 199 -6 -41 5 -12 -36 23 14 121 -21 37 -32 46 17 27 -34
251 -34 -44 -2 -6 43 -47 66 -82 0 -59 -35 -73 88 -3 34 -11 96 -24 89 169 90 24 3 43 -82 20 69 -90 34 -37 -16 -8 -117
-29 -117 18 43 37 5 86 96 132 41 -21 -34 57 -49 -44 9 -49 8 77 3 34 5 -63 -54 -33
-230c3
##PAGE=	F1=-13368.2
##FIRST=	23146.756194512010552,	4241.1435120000014649,	0
##DATA TABLE=	(F2++(Y..Y)), PROFILE
4241C5LM2j23P2j3j4O8k6k3O8Kp0r7J80j22N5q7J5L9Pj1ok8j3O5p2L3K1Pl2QlR2j22Q8j8k6
3917fJ3Q7j5j38J02m3Qm2J02q1N3K5j65J55l4j8O4p6P5k5p0L4Q0K4j2n1N5j25j1j6l3P8M3
3629C7j3o4M0Q5j00J12j49lL8P8O8j02M5j12J4P5P9k47L3M7O1q3R9j7o7J9N7L3m3O6j74J29
3349D1Q5q2l5O9k01O7J40j38J20n3%p0J41n8o1J1K7kJ13j91K5J8J8l6K8j9P5K8j00k8oJ28
3069E4L1o5O4O8j24m7QK1p7J5M0K8P0m7j46J30j1m9m3N5Q4k7J2o1l6l6j0J41j28J5J16k3N7
2780G9p1Q9L0j14J3j19J52k4o1prJ22K7j52l4k5R4J6k0o1R2M9m8J70j80L4m7p0rQJ12n8J0
2491a2L8J7r3J41N0j90K4M5q2j3o9J43L3K7M8j31O7r8J39j5l6N3j04nJ63p4Rj56J58Lr2J8
2211Fm4q2J54N3j26p1R4n4j08K79m7K5M1j68R1qJ19j42k2K4k7j5l5kL6J90K81n70J42n9QJ27
$$ plain form
4241 35 38 80 -43 29 16 2 70 44 21 89 91 21 -76 104 -18 37 -50 -35 4 11 0 -6 -34 -47 18 -54 -21 0 7 -25 -17 -20 72 -50 38 20 -6
3917 -6 7 94 79 -59 43 0 8 -34 68 -13 40 65 -100 55 21 3 67 -9 66 41 -29 5 85 109 97 46 101 -24 -35 -51 -84 -6 37
3629 37 24 -40 0 85 -15 97 -52 -55 -17 61 129 27 72 -40 -26 49 128 -119 -86 -39 22 -61 38 21 -46 -27 30 63 20 86 -88 41
3349 41 126 44 9 78 -123 -56 84 -54 66 13 13 -57 84 26 -35 -24 3 1 114 -77 -52 -34 -16 -52 -24 -43 32 60 -40 -68 -74 54
3069 54 85 20 84 152 28 -19 -11 10 -67 -52 -12 16 86 39 -107 23 12 -37 -80 -25 59 32 44 -17 -53 -89 -99 42 -86 -71 45 22 79
2780 79 8 97 127 13 26 -93 59 35 -26 -33 -42 80 107 -45 -79 -104 -10 6 -14 -75 17 66 18 188 8 42 -5 -75 -84 -76 36 -22 -12
2491 -12 26 43 -50 91 141 -49 -25 20 -62 -75 -144 -1 32 59 107 -24 43 -55 84 69 33 86 -18 -23 140 66 75 -81 77 80 -12 6
2211 6 -38 -120 34 87 -39 -110 -16 -70 -178 101 54 79 120 -48 43 35 154 12 -10 14 -13 -28 -63 -65 -29 161 442 -128 14 -45 -37 90
1931I0j27Nk3n2J74j25o6J71j26L1p0J53JL2p4M1MM8j23Q6J45j98J2M3k07J96mj8P3m8J1M8
1651A03j31R4j22R3J21n3j52M7J4j2Rk1n5m1J27L0R0q0N3k1j08L3k9N2J0j79J13M9N2j6J1
1380H1j23M6J97J61O81j41j111M0J57k2J90k22J16l5O0j39J12j6q9J40P6j78l4J09l5p6R5
1143D0Q0j88j46J64R1j05j8R8l1m5J9k2l6J26J0j5o1J10j23N0j0j70K99j08p6J86Q6j80%j18
881i3J93j29j3n3K35m9o1p8p7L7R3%K6n0n0L4l5J25k4O8m3LM1m5r5j3N5oL2m1N5m3m3J86j07
575C5Q3q6J28j27L4j33K2J6M8l4j09J96j60N6J6j89P8K03o9J2P1M8j59o2J18m7l3O5m4J66
312A43j75N2n4O3j1%q8L5Q0n3P2r0N9j14N9k2km9K32j24Om6R4o4P8R4r2o1mK3j52R6P1j33
15g7Q7mj6Mj13J61j5K6l6N3P2J7j47m6j7J36j56N1K0k1K9N8o8L8Kj14K7L1
$$ plain form
1931 90 -37 -32 -55 -107 67 -58 -124 47 -79 -48 -118 35 36 68 -6 35 39 87 -36 50 195 -3 9 52 -155 41 37 19 92 44 55 103
1651 103 -28 66 -56 37 158 105 -47 0 14 2 11 -10 -65 -106 21 51 141 61 114 93 -15 18 -11 41 51 -128 -15 34 86 70 81
1380 81 -42 4 201 362 1043 902 -209 -169 -12 -34 156 -66 50 15 75 -64 48 32 -57 83 159 -19 -53 56 21 -55 40
1143 40 120 -68 -214 -50 41 -64 -82 16 -15 -60 -41 -63 -99 27 37 22 -39 71 -52 -2 -12 -182 117 9 -67 119 205 25 25 -93
881 -93 100 -29 -42 -95 140 91 30 -48 -125 -88 5 5 31 -19 -69 -35 -70 55 31 99 56 59 100 55 -40 -53 2 -4 28 -13 42 -1 -44 142 35
575 35 118 32 160 33 67 -66 -44 -28 20 -14 -123 73 -87 -31 -15 -204 -126 77 8 20 91 139 -20 -82 36 -11 -44 21 -23 143
312 143 -32 20 -34 29 18 18 -70 -35 45 -8 64 -26 33 -81 -22 -44 -46 -95 137 13 19 -27 67 3 81 175 83 22 18 41 -111 -15 56 -77
15 -77 10 6 -10 -6 -119 42 27 53 17 70 142 159 12 -34 -51 85 -71 -20 0 -21 8 66 -2 36 38 -76 -49 -18
-230a8
##PAGE=	F1=-13462.5
##FIRST=	23146.756194512010552,	4241.1435120000014649,	0
##DATA TABLE=	(F2++(Y..Y)), PROFILE
4241B5K5K9j27O4l3MJ27J1j05O8l9o2o7J15q8J07j52N9L3K1Ro0K5m5J30n5j5N5Lq6kMJ18j43
3944d7O4J1J5m3N8lq7J08q9M6l3J21p0j8M0j33J52n7m2O7n4N5k7n9K2Q5j4K3m2N1j07k5m2
3655g4J2O5j0L3o7O1R2l7j4j04k7Q4P0L2j22P0j48N7M5R7k10j9L0M7kJ35n1q5J4Q9M1o4R1
3366A31j75J11O6q7j6N3j89R8M8j53J84Mm5j11J45l3q5L7L8j2N4j38M0Rk4J3O8j22J21J09
3104A39j31j04lJ23O5o2N6M9j14J6m3J2j7l3O7l5R5l1j10R8%o0o9P1J14p4K9n3o9j1rJ08r7
2815h3J6J05l8P3p5J17M8j80jk8J28n8q6J5MJ21pj13qj21J09M3J4m3L9M3l2J72j31l9j0o3
2535f9m5JJ59o8m4N5M9q2J12P2j67k2P8n6l8p2J25M1k7N9q3J28j50J37jn0M8m3o0J09o1L9
2255G4j78J31R4r7ro3j11J89Q0j51j10J30pj20K69q6P1J0j56R7o7J08j14KK3l2NJ9l8JK56
$$ plain form
4241 25 50 79 -48 16 -17 -13 114 125 20 88 49 -13 -80 35 -53 54 -98 -39 -6 15 24 -36 -11 -56 74 19 4 59 62 -24 -26 -22 96 -47
3944 -47 17 28 43 0 58 55 -32 76 -13 33 0 121 51 33 73 -60 92 35 -7 60 6 61 34 -25 -3 82 68 91 49 100 -7 -32 -74
3655 -74 -62 3 -7 26 -41 20 112 75 61 -43 -70 14 84 116 -6 64 -84 -27 18 115 -95 -114 -84 -37 -39 96 45 -40 -26 63 104 40 131
3366 131 -44 67 133 46 30 83 -106 -8 40 -113 71 75 30 -81 64 31 -54 -17 21 9 63 -75 -35 -26 -50 -37 31 -91 30 139
3104 139 8 -96 -99 24 89 27 83 132 18 34 -9 3 -14 -47 20 -15 80 49 -61 37 37 -23 -92 -21 93 19 48 -5 -74 -85 -94 14 -83
2815 -83 -67 38 0 73 -2 115 163 -17 -18 -46 82 24 -62 -47 -43 78 71 -42 -50 -171 -62 -19 -5 -48 -9 34 2 174 43 4 -6 -69
2535 -69 -114 -113 46 -22 -66 -11 38 -44 68 140 -27 -49 29 -27 -65 -137 -12 29 2 61 -22 106 -44 93 92 42 90 47 -13 96 35 74
2255 74 -104 27 121 24 15 -48 -159 30 110 -41 -151 -21 -28 -148 121 35 106 116 -40 57 -10 98 -16 -14 9 -23 -18 1 -37 -36 220
1983B20L183l155k54k4L0Q3q4l0p6j6K02j70k3J73j20j0n6J49l2Q9r4L7L3K7j00O9J42j74
1738A9j9Q4k17J37j6k0Q4jm6N6j18N7o9J45J8l7l2K7k2l7K6o4l9m8J92m3N1o0O0L2r6J6k7
1450gl3Q0r7N3O5m2K4J2r8O5K09J02J100l39j269O6R3n0J73j57J01k9L5j35J60k7k1j2J17
1196A39j76L4R6o5p1Q2N5q4k13J52Q3r7k7J28m2l1L8k4l5O7L9k3j6J5q8N5K5k02L38j37j02
925h7K21M9j62J5q9J24n5o3l2K17q0k6p3r5J5Q5L5M1k4l5Lq5J50K3M7j01L1L0m6j01K3K3l
636b5R8p9J7k6m2J96j44J11o8O9n2J6j48P4j2L6l7j30K01j68J01rj73J05J94r0QN5j2j23n2
365a09J76r2m7O7n1J73j71M7k3P4k2pj09N0J33r1Q0p5J1q2M3Nl0o0K56j03m7k7O9lL6J00j11
76F0m0M2m4j41O6P3n7L0M9l3Or8J39m4L2j8RJ18rj64jl4J83j59K7J2J8k5K5k1K6K0j31M4M2
$$ plain form
1983 220 3403 248 -6 -30 0 83 -1 -31 -107 -123 79 -91 -114 59 -61 -71 -127 22 -10 79 -15 22 55 82 -18 51 193 19
1738 19 0 84 -133 4 -12 -32 52 51 5 61 -57 0 -69 76 94 57 25 52 30 -7 19 -45 -84 -132 60 17 68 8 68 100 4 20 -7
1450 -7 -40 40 -57 -4 61 19 43 55 -43 22 231 333 1433 1094 -175 -109 -16 -66 107 -50 51 22 57 -78 82 55 34 22 139
1196 139 -37 -3 93 28 -43 39 94 10 -203 -51 32 -65 -92 36 -6 -37 1 -23 -58 9 48 25 9 24 -64 -9 16 -186 152 15 -87
925 -87 134 183 21 36 -53 71 16 -47 -79 138 58 32 -41 -136 -121 -36 -1 40 16 -19 -16 -101 49 72 119 18 49 79 33 -68 -45 -22 -25
636 -25 73 -6 11 -15 -57 139 -5 106 38 107 55 71 -77 -3 -15 21 -16 -146 55 -113 -12 -21 -194 -89 105 15 23 78 66 -57 -109
365 -109 67 -25 -72 -5 -56 117 -54 -7 -30 44 22 15 -94 -44 89 -2 78 3 14 -68 -25 -20 -50 -110 146 43 -4 -31 38 35 71 171 60
76 60 20 62 18 -123 -57 16 -41 -11 38 5 11 -87 52 8 40 22 31 149 140 -24 -25 -59 124 -35 -8 4 22 -3 22 1 27 47 -84 -40 2
-230B
##PAGE=	F1=-13556.9
##FIRST=	23146.756194512010552,	4241.1435120000014649,	0
##DATA TABLE=	(F2++(Y..Y)), PROFILE
4241B7K2Nr7N0n0lJ87J6j46O2p3l2l8N7m6J38k18J13K2L4K0r4L5o4J88l8p8J00Pj32%QJ17
3952I9j46K4M5N9r1RJ9pR4j16Q9k5Q5l5q9M9q9J55q4q0P7j7L3j7n4J6L5m3O8l2O0o1m8m3K3
3646c8O1r6R2m7O4P5L0j06n0m7R5M7Kj20R5j53N4J8J03j00j04LL3Q6J37p6p1j0J05O3r3P3
3366A25j15O3O3q0qP0k05J06k7j19K00Mn9j24J43nr7N5N2l4Mq8P2po9N5R8j92J47J50j34j59
3086a15RQ8R9o2M2L7j11P9m6k8L4o0P2p1Q7J7p7N7K3q8n1M5J11j08O7n3r4L3k0R4o3j3Q9m7
2789b4P0q0J55N2j99m0O1R3q3r3L0M6P7l1o8Oj56P8O7M4j7l9M0k2J50o7q0N0n9o9n7K02o3
2500b6p6Q1N9n4N9P0j17o8Q7j5p1l1R5M8p6N9m8J56j58J17No3M6ro7L4m5P9j70R0J52r3k4
2211B6q3j10J91R9j40j36J29N9j12K05j18R8j7j08R6j09R2r0JK7j7PO1m7k8L16Q006p368r32
$$ plain form
4241 27 49 54 -43 7 -43 -46 141 157 11 73 0 -32 -70 -13 -59 79 -139 -26 -4 30 50 -44 -9 -73 115 77 -1 99 106 -26 -26 -18 99
3952 99 -47 -23 22 81 -10 -1 18 11 105 -11 78 53 138 103 14 63 -26 129 45 -35 42 25 58 41 -13 3 38 -5 63 31 91 30 -18 -61 -38
3646 -38 23 -73 19 -28 36 111 141 35 -15 -62 33 80 82 -38 57 -96 -42 -24 79 -21 -125 -122 -89 -3 134 58 -13 -23 82 145 52 125
3366 125 10 73 136 56 48 118 -87 19 -8 -127 73 77 18 -106 37 32 -65 -10 42 8 12 -76 -4 -11 -80 -25 73 -119 28 178 44 -115
3086 -115 -106 -18 81 19 61 98 -13 66 20 -8 26 -34 38 -33 54 71 -6 51 74 -14 -65 -20 91 -17 50 -3 -97 -64 -84 10 -53 -66 23 -24
2789 -24 46 -34 121 173 -26 -66 -5 88 5 -88 -58 -12 65 34 -34 -28 -184 -106 -39 5 -12 -51 -11 -33 117 50 -30 20 -39 -108 -165 37 -26
2500 -26 -102 -21 38 -16 43 113 -4 -72 15 0 -71 -102 -7 41 -35 24 -24 132 -26 91 96 33 79 70 3 37 -8 71 -99 -9 143 50 26
2211 26 -57 -167 24 123 -17 -153 -24 35 -77 128 10 108 91 -17 79 -30 62 -28 -27 0 -17 -10 51 4 -24 292 8298 930 -2
1957bL0L7Kn7l8j28K7J82j63L6J42j12mq2J22m7J63j16J1P5k6o9N8R8j11k8J26k08M1j8j5
1686g4R7K8q7N1r7N7l5J43o1j5Q2Po0n4J3p6J3p0K18q7K0n9Q6O3r4km1p6J07qM4O0j51N6K2
1380B0n9P3K01mJ283m96j144R0K7r1J51r2O7KRj39K05m2N4j59J49j39P7M7o7o5Q4L1kk26J10
1108d5P3o7m7J37m5k8P5j8l2lL4j3Ol2m7L6O9j91L27j63j17K13J5j01J6n0ML8o9l3K03j23
828B2km1j08J9O6N9K5k6Nk0j12J45N2K8j37P5j8j9q2L9Lk2J63j20k7L2o1J94j81J49o1j9M3
540F3j1j36J26n3J6j3j20J44j59J16Nj40J19J69r5MJ2l1j24nJ92j37o1O3j1J44j45K9J8J02
277H1n2%j22L2J77j05N7m4j1n9K5J6l6o6K34n7r5mN3L1J6Q4j23k1R5j14j02J8M8M2k6P4k8
-12A8J4o7P7o0J4K5l6J34k4j49M4n0K25j35m7K6O9q8j9L2NRr6M2N3
$$ plain form
1957 -2 28 65 67 10 -28 -156 -129 53 -110 -74 68 -44 -48 -130 -8 -55 108 -8 3 78 52 -17 41 139 28 0 126 -82 -41 -59 -74
1686 -74 23 51 -36 15 -82 -25 -60 83 22 7 89 96 36 -18 -5 -81 -68 -138 80 -7 13 -46 40 103 9 7 -34 -110 -3 -11 33 93 -58 -2 20
1380 20 -39 34 235 231 1514 1018 -126 -36 -9 -100 51 -41 26 28 37 -102 103 61 115 -44 105 -34 43 90 23 -42 42 73 71 -155 -45
1108 -45 28 -39 -86 51 6 -22 53 35 3 0 34 21 27 -5 -52 -16 53 -138 189 26 -91 122 137 36 52 2 6 44 -25 -58 145 22
828 22 20 -21 -129 -110 -44 15 40 14 19 -1 -113 32 84 112 -25 50 32 13 -69 -30 -27 -49 114 -6 -33 -1 -62 132 -49 100 39 20 63
540 63 52 -84 42 -11 5 -8 -128 16 -143 -27 -22 -162 -43 126 31 35 47 16 -108 -113 79 -58 -119 -56 -67 77 -68 -39 -21 81
277 81 29 29 -93 -61 116 11 68 24 13 -46 -21 -5 -41 -107 127 70 -25 -29 24 55 71 155 32 11 106 -8 -110 -92 -44 -2 -28 46 18
-12 18 32 -35 42 -18 -4 21 -15 119 95 -54 -10 -60 165 30 -17 9 78 -10 -29 3 8 17 -79 -37 16
-230A6
##PAGE=	F1=-13651.3
##FIRST=	23146.756194512010552,	4241.1435120000014649,	0
##DATA TABLE=	(F2++(Y..Y)), PROFILE
4241C8Ok0n4L0o2k1K18kj33M6p6pj4K1kJ24k50J43K1M4K8r7j2p0K28k5j36J46Nj51J0K3P9
3952G8j23j3N7J01j09n4M2N7O7j00J07mPJ1j28M8m1J39r4j15R6QJ0Jm6lj1o6J06k6O6J2p1
3664Il9J3O3j72J31k9O7N5N8j37Pm9O1J3j7q7J06j25PJ0Q8M6j90j4J4J42J00p9m5l3J16P8
3384A68j23K7k0OP0n5j5R7k35J06n7o7J69m3k6j15J27K1q2M7N6p0jm8R2k2j06O5J11j97J44
3112B4J48j18j81K3M7J15m9K8K2r8J05Kr4P1n8M6m6M3O7o3RN6j04nLN6j10J05o4r6O6k0J12
2824D2m6n0O6n4M8o9J72M1j54r1J05O1p9r3M4R4Nk2n3K6j42J6P6P1J5j11L6k1J20k6p1R7o1
2535hn0j47K25m7p8J12K0omN0o0q4M8M4r8L7N0M8r1O1m3J35j15Q7lo5M6k1k5l7k3J10j47N1
2237b8J67p0m1r1p5J50J07r9j29R9J11r8J12j24J05l5n8Q6r2O1o6l4K8J0%O4k2m0L21J2756
$$ plain form
4241 38 44 24 -30 0 -62 -83 135 133 0 46 -30 -37 -51 -30 -32 92 -158 -15 6 50 78 -19 -31 -101 127 102 -34 112 117 -34 -24 -1 78
3952 78 -45 -58 -1 100 -9 -63 -21 36 103 3 110 106 113 124 -4 44 3 142 48 -67 29 37 47 48 2 -1 -12 -78 28 2 68 80 9
3664 9 -30 -17 46 -126 5 -24 43 98 156 19 26 -23 38 51 34 -53 53 -72 -65 -55 33 79 -111 -125 -111 31 131 52 7 -26 90 168
3384 168 45 72 52 58 128 73 58 155 -80 26 -31 -98 71 28 2 -113 14 35 -47 0 56 -14 -15 -63 29 7 -99 -34 77 -120 24
3112 24 172 54 -127 -104 -57 58 9 37 59 -39 66 68 -26 45 -13 33 -13 30 97 34 43 99 -5 -10 -7 49 -61 44 -20 -116 -50 -70 42
2824 42 -4 -54 12 -42 6 -63 109 150 -4 -95 10 71 -8 -101 -57 37 42 20 -33 -7 -149 -133 -57 14 29 -82 -46 -67 53 27 -44 53 -8
2535 -8 -58 -205 20 -27 -105 7 27 21 17 67 7 -77 -29 15 -83 -46 4 52 -39 22 -21 114 -1 86 83 18 64 43 18 -19 -42 68 -79 -28
2237 -28 139 69 28 -63 -138 12 119 20 -109 -10 101 3 115 -9 96 61 3 89 -3 58 -8 -42 -14 -4 -4 60 38 -2 319 13075
1975A3075j1431j615Q0K8q8n6j5j45N5J19j04Q0Q0r6L5j29P1k2K26j35m1J15r4k4O1M2l9k7
1730FJ48j75o5RnJ01J7r5M1p6Q9k7R8p5j2J47j1q2n8l4m7Q3q5J90j02J7q0J21O5j01j1o7o5
1441a41Q5N6Q6L4k29N0L9nP3J60r4J107n01q05J08k9j04J22n9L9N2j5j40K07m8J08k49J71
1196G8q2P2k7m1m9Q2J4M7j84N5O2k1p3J10l1l2J19j6j2o8Q%Rk5j3j4R9j31K69j66j27J78o
907H4k3qrj16J14k8p1K06j51J5jj24N5L2P2k1n0M4kj17J14M0J7j37J30q7K6n3M4lm0J82j39
618eo6J04q5J70j92J72p5q6J09j4r9J43j04OJ6p0L9j36R6O0r5R9J43q1j5l4Nj53N8J56j64
347i8o7N2O4J09j21pO0J17p6K4j20mJ89r3Mpmm5pK8j8o5J77j5j05lN2L3K8M6j19j5J28j45
50b3n2l4LJ19n5P1oJ7k7Kn9j7P3o1J22j5j29O4n0K47j12j23M9J28j31o3O1j5k2j9RO3
$$ plain form
1975 13075 1644 29 109 137 49 -7 -22 -167 -112 7 -97 -17 63 -33 2 -127 -56 -78 148 13 -28 87 -7 -31 30 72 33 6
1730 6 154 -21 -86 -77 -82 19 36 -59 -18 -94 -5 -32 66 -9 -21 126 115 33 -25 -59 -106 -23 -108 82 -20 -3 -83 38 103 2 -9 -76 -141
1441 -141 -56 0 86 120 -109 -59 -20 -25 48 208 114 1221 720 -85 23 -6 -110 12 -47 -8 44 29 -111 96 48 156 -93 78
1196 78 -4 68 41 0 -49 33 47 94 -90 -35 27 6 -67 43 12 -20 99 83 71 3 11 11 20 -5 -18 -32 67 -64 205 39 -88 90 84
907 84 61 53 44 -72 42 14 -57 149 -2 13 12 -112 -57 -25 47 26 -24 20 18 -99 15 55 72 -65 65 -22 4 -49 -5 -8 -48 134 -5
618 -5 -71 33 -52 118 -74 98 23 -63 46 32 -67 76 -28 -22 -6 -76 -37 -173 -77 -17 -112 -13 130 49 34 0 5 -148 -90 66 -98
347 -98 -165 -113 -49 60 -61 -68 -8 109 33 57 -63 -67 122 29 33 26 22 -23 -30 -2 -20 -85 92 77 -28 -31 21 54 82 128 9 -6 122 -23
50 -23 -75 -109 -106 13 -42 29 23 40 13 15 -44 -61 12 -49 73 58 -71 -7 -57 190 78 -45 4 132 1 -62 -1 -16 -38 -57 -48 15
-230A5
##PAGE=	F1=-13745.6
##FIRST=	23146.756194512010552,	4241.1435120000014649,	0
##DATA TABLE=	(F2++(Y..Y)), PROFILE
4241D4kl2k2J2p1m1K05k3p5K1m5j4RNL5P5k27J31L5M3L9p7q0p7K42j6j65J64Kj37K0N0J0q1
3944d3j8K7J42r0j26N1Q5L2l9Q9K2o8M2j14L7jQ8p6j32J26Kj3J6k9m3Mr0J22k1N6Q4p5n0n
3646hO3k01J31l0Q1N3L1j10N6l0jl0k0l6J01q1n2K4N7J65k42qj2J48M0o1k7l7J19P8j32k8
3366AN8l3Q4k1l5J05k41J04m4k2J05r2L6j00R8L8m6K2M9j21M2k2Q7l6j17L2J13j42J15J20
3104A37j01j61K0L6J00k9L2j2o4Q9P0j57Q9l6NJ9j3Q7n7m4Q7q7L7l3j5r3J20o2p7N2J2J37
2824H8n8n9M4n4J7n0J50K7o3j33R4L0m2q8N4J20o7K2p5O2j08l8N7P8N7j42K9l2R5l1k4J05
2544F5o0Pk25K21l0n9J39n9N4o9L4j2n8k6J01j07R1kL7o7P6n7Q7n5N3j1o4M7o1M0q5J2J03
2255F0j16K0J50l6n8q5j0P1J05m3j01O4J22q1K8j10J09n1m2P3j0J5l1r2J2M0qL6J5l2K53J4794
$$ plain form
4241 44 42 10 -12 0 -71 -112 93 70 -5 16 -29 -43 -34 -29 6 81 -146 -15 20 63 102 25 -55 -132 110 94 -71 93 95 -42 -22 28 38 -43
3944 -43 -61 -34 108 18 -108 -57 28 60 21 110 132 64 106 -8 29 28 116 40 -92 34 36 23 39 10 -33 -29 -119 3 -18 38 122 47 -3 -8
3646 -8 55 -146 -15 -45 36 89 120 10 66 36 35 5 -15 -51 50 -31 -83 -59 -2 163 -79 -87 -99 49 89 28 1 -36 83 161 29 1
3366 1 59 26 110 89 54 159 -82 22 -22 -44 61 -31 5 -95 3 41 -5 17 66 -55 -13 -35 52 16 -101 -69 44 -98 17 137
3104 137 36 -125 -105 -69 31 2 34 22 -42 47 117 -40 49 13 18 37 24 111 54 10 97 10 47 14 -1 -94 26 -36 -113 -61 -49 88
2824 88 30 -29 15 -39 -22 -72 78 105 42 -91 3 33 -9 -97 -43 77 10 32 -43 19 -89 -127 -70 8 65 -77 -48 -80 15 -16 -40 65
2544 65 5 12 -213 8 -22 -81 58 -1 53 -16 18 6 -52 -78 23 -84 7 5 42 -25 51 -6 81 26 79 68 4 51 -10 30 -55 -43 60
2255 60 -56 -36 114 78 20 -65 -75 -4 101 58 -43 21 143 62 90 -20 89 38 -4 69 59 74 43 -49 -37 3 -5 31 46 14 267 15061
1975A5061j3059j932J08%j44p1L1j28O7M1k7Q2J3o5P8j75K0L0K50j37j14J38j52L7P5RJ3l9
1730A0J40j17j57O5lR1j9o9L2n7J16l6M7l5k8J51k4q0m4r6pJ49o7J16r9K4r6J40M7j05j0q9
1450a10j5L8P9J40jk47J6N0M8O7R2j20O82l56m33J22o7p0R1p6K8J15l1j29J48l9J26k59J72
1196F1k3L1j03kj1N4RP0j18J8M2J7q7N6ql9J58l0K7j00j4oRjJ4p5R6m8J92j49j31J50j2L3
898H0n4K6j79J47L5j26K12j46K1L1j39J00rP7p8p4O1P5j18O3qK2j08J70j50P1k9N2ol6J50
627A33j34p9J53j01J12j58J75j13r8J24Rn3J11j39J0K6Mp6j00M9J26l4M5J20n5m7o5Q1j78
373a52J06Q5j65n4L4J28R3j12m7R0J01q1N3r5l8J67o7n3K9Pl7m8N5Mn9J12Rp3k7N2J5N9J0
85A01j02k6J23j16k0o3m7J50n1N4J9PRo1l4n1J02n4R5J7j25N6l5K35j14j47P4J70j38r0O1
$$ plain form
1975 15061 2002 70 178 178 34 -37 -6 -134 -67 -26 -53 29 42 -23 55 -120 -100 -70 180 43 -71 67 -85 -48 27 36 49 10
1730 10 150 33 -124 -59 -62 29 10 -59 -27 -84 32 -4 43 8 -20 131 107 27 -17 -113 -120 29 -38 78 -21 3 -93 47 94 -11 -21 -110
1450 -110 -125 -87 -8 132 131 -116 -100 -50 -2 65 157 37 719 363 -70 52 -15 -85 6 -70 -42 73 42 -87 61 22 148 -111 61
1196 61 38 69 -34 -36 -47 7 16 86 -32 -14 28 45 -42 14 6 -33 125 95 122 22 8 2 11 10 24 -51 45 -3 189 40 -91 59 47 80
898 80 26 52 -127 20 55 -71 141 -5 16 47 -92 8 -1 76 -2 -76 -15 60 -58 5 -3 19 -89 81 -69 2 -27 25 19 -17 133
627 133 -1 -80 73 -28 84 -74 101 -12 -110 14 23 -30 81 -58 -48 -22 -18 -94 -194 -145 -19 -53 -8 112 57 10 -55 26 -152
373 -152 -46 39 -126 -180 -146 -18 75 -37 -84 6 107 26 79 -16 -54 113 46 -7 22 29 -8 -56 -1 3 -56 56 65 -8 -35 17 32 91 101
85 101 -1 -27 96 -20 -40 -103 -150 0 -51 3 22 29 38 -23 -57 -108 -6 -60 35 52 -73 -17 -52 183 69 -78 -4 166 28 -62 -1
-187am1n1O6m7P2
$$ plain form
-187 -1 -42 -93 -27 -74 -2
-230b
##PAGE=	F1=-13840
##FIRST=	23146.756194512010552,	4241.1435120000014649,	0
##DATA TABLE=	(F2++(Y..Y)), PROFILE
4241C0J3k7j2Pq0n7J63l7kmMo1M1j2O3K1j54Q0M9L6N0n1j21r4K34j1j55J34J4r8K2P5o9l3
3944d2J2l5J75m3j95M3Q6jL5M8M0j10N1n4J6J1K6l8j32J60l7k5K0j1p8Q6j22J13j8L5J26o2
3664H0p2k4N0j70R2m3R7P3k2n8Q1Ln1p3k3J9Q5l9r4N1K4K14k52K2m1J07ll9j7j8R7O7q9q7
3366e3P5l1R6Ln2Q4j94R2k2J0L5j10R8q6O1L5j3OM4j79J09j3O4n2r2k8J10o2Q3P4q4j09mN9
3069d6N8j5O7p3j5N4J16j85R0j6k3O6m2O8m1r1J01m0N0m6o0q7J13k9m9k2P4J36q1l2L3m6%
2780a3m4R4K4L4j49M3nRo7N0J10j06P0j16J10p3n6J2N8R6j26L0n5Q0p6L1Q6n1O4k53J97k1
2500a3m0J53j30R9j26M5J4kq2J03q5J03m8J6k4J04p5N4j9K2j1o6M7r2R8j00M4N3p6pJ21j2
2220F8o3p2O8k0R8J1q0M5R4o1j8r4J21o9p7O9R9l0J1j43j9O2k0J6L0mJ29J2898j1251j699
$$ plain form
4241 30 43 16 4 11 -69 -126 37 0 -2 -6 -2 -63 -22 -34 29 50 -104 -24 25 61 111 60 -61 -155 79 68 -87 47 61 -37 -15 60 -9 -42
3944 -42 -30 -65 110 67 -128 -85 1 0 35 83 123 13 64 10 26 37 63 25 -107 53 16 -9 11 0 -78 8 -114 -1 -19 16 142 80
3664 80 8 -16 34 -136 -44 -87 10 83 61 3 84 87 36 -37 -60 -41 44 5 -89 -38 -14 200 -52 -30 -71 36 33 -6 -23 -41 56 123 34 -53
3366 -53 22 -9 87 90 38 122 -72 20 -2 8 43 -67 31 -55 6 41 28 34 78 -101 8 -5 59 7 -85 -113 -3 -65 18 92 8 -101 -105 -46
3069 -46 12 -3 64 -9 -24 30 146 -39 51 35 12 78 36 104 63 -28 73 33 83 37 -23 -110 3 -26 -75 -97 -23 113 32 0 33 -13 -13
2780 -13 -57 37 61 95 -54 -11 -16 -7 -74 -24 86 -20 50 -66 44 -29 -85 -73 -15 81 -45 -15 -70 10 -66 -35 51 0 64 -189 8 -13
2500 -13 -53 100 -30 69 -57 -12 2 0 -82 21 -64 39 -9 7 -17 87 12 66 47 69 58 -8 39 -53 45 -55 -11 42 -34 -41 80 68
2220 68 5 -67 1 -19 79 90 10 55 149 88 70 -24 97 28 -49 20 119 89 100 -43 -62 0 -20 -4 26 22 151 13049 1798 99
1957I9R8l6j39p4P1j00P8k4L2M1l6j7R0j87j1P1K25j14j76J35j78R4R2J7K9p4J14m9k23J29
1695b3j3P1m9k3K7l3R8m7J5K1m5J09k9n7oj48J0J91nK4r8L2j02J28J3r0J0r8M0rP3J67l4k06
1397h6j5N4O7N9J6q1K58j67j81J22p4pN9j22L2J70l5j01M5j4J05k08J49L0k2j52K9M7KJ2P4
1126F5o4K0RK0o5lJ8n7J80n9P3q5j6l2J1%L5j11O3J8J22j29j11J45j4M7j01N2j58J29Q2j60
846g6J99j13J1M5j36J17m4R1j29p1M2J81j23J0o4M0n9J65j85Q8nO4j6j3J06j26n7J57r9K6
583B6q3J68j69m8J00L4j9N2j42K0PP2j59n8nJ60M9k6J04l7o9p5J51j66J20Oj41k0J3J35R9
312I9j11p0J01O2p2O9n3o0J29m1q5O5ml0q7J02Ln0N9J9k0n7L2NP8J0r1m1Q5m9k8m1r3J34k1
6e2L6L7j5J9q8J5p7R3k2P1M7j24L4j5J80j39r4Q5J74j06r6N3p9n4J10r9P3
$$ plain form
1957 99 197 161 22 -52 19 -81 -3 -27 5 46 10 -7 83 -104 -115 -44 181 67 -109 26 -152 -58 34 51 80 6 120 71 -152 -23
1695 -23 -36 35 -14 -37 -10 -43 55 8 23 44 -1 108 79 22 16 -132 -122 69 64 88 -10 22 -80 48 61 -29 -19 -117 -77 -86 -13 154 120 -86
1397 -86 -101 -47 20 79 95 14 272 105 -76 46 -28 -35 24 -98 -66 104 69 -32 13 -1 104 -104 45 75 53 -99 -70 -23 -21 -9 65
1126 65 1 21 30 50 -15 -18 0 -57 123 64 137 52 36 4 15 15 50 -61 2 20 142 13 -98 47 33 80 -21 31 -127 2 84 -76
846 -76 123 10 21 66 -70 47 3 94 -35 -106 -64 117 -6 4 -60 -20 -79 86 -99 -11 -16 48 32 19 125 -1 -58 99 0 26
583 26 -57 111 -58 -106 -6 28 9 61 -81 -61 -54 18 -141 -199 -204 -44 5 -21 83 46 -23 -98 53 -113 7 13 -128 -148 -135 0 99
312 99 -12 -82 19 81 9 78 25 -35 94 53 -32 33 29 -1 -88 14 17 -33 26 45 25 -32 0 5 83 93 2 -39 46 -3 -31 -72 -165 -31 -52
6 -52 -16 21 6 25 -63 -48 -125 -32 -54 17 64 -60 -26 -41 139 0 -94 -9 165 59 -37 16 -63 -117 -7 -106 -33
-230c3
##PAGE=	F1=-13934.3
##FIRST=	23146.756194512010552,	4241.1435120000014649,	0
##DATA TABLE=	(F2++(Y..Y)), PROFILE
4241bM0pj8J6q7o9J25m8N5k2N2j27Q6m4P1j0o2K2N1K0N5l1j13j17K13j1j11O8M4n3J8P7j33
3952e2QN6j00J98lk38L0Q2k1P9J1M1j16N1K0j3j2j6Nj26J80q2k0J6lp8J89j60Q4j2J6J24n0
3664H8q0m2J9j02L8n7J06J02o3j0Q0K0n3j05l8O4P2j2j12P3J6J83k34O2p3N0nk7lJ4M1N6J0
3375G8j42K7mJ03Nn2N3j04O3k5L3j2q9J28o8K2KJ1J3N4k31J67k2M6o8m6q4R6J8O3J5n4n3l4
3077i1R5jj8J31j48K9L1J17j65P5j2k5N8j9K5pj25J02jK6k2o1j10J08K4k7j34J39J01q6J6
2806B5L1l1J4o1K0L6R5j28j9m6M7k1K1Q2j00R1j51J51m5l6l3J2J14q1M2p5O7j30P0O2m1R1
2526G3k21J65k0l0J39j37J07j74Q5J6N8q0J7k4P2p6%NJ26p5N3l1Kjp3M8q8J25q3N1ql4l1R8
2229E4j8m6o2J33q4Q6N6q5M0N2l8k1r3J41q5j40P6J77n1L8j56n5P2m1L5OM0KQ261p113j073
$$ plain form
4241 -2 38 31 13 29 -58 -127 -2 -50 5 -17 35 -92 -6 -50 21 11 -51 -29 22 42 97 66 -47 -164 49 38 -73 -5 39 -14 4 81 -52
3952 -52 -44 12 -88 110 107 -131 -101 -19 -40 39 50 91 -25 26 46 33 21 5 10 -116 64 -18 -38 -22 -25 -103 86 -74 10 -2 14 138 88
3664 88 8 -34 -15 -117 -79 -136 -30 72 9 -1 79 99 46 -59 -97 -33 39 27 -85 -12 4 187 -47 15 -58 -8 -13 -40 -43 -29 12 68 78
3375 78 -64 -37 -41 62 67 15 68 -36 27 2 35 23 -66 62 -6 16 18 29 42 96 -135 32 10 56 -12 -58 -142 -46 -28 35 50 -4 -57 -91
3077 -91 4 3 -15 116 -32 -3 28 145 -20 55 43 18 76 57 82 75 -50 52 51 77 55 -6 -116 -8 16 -11 -145 -6 95 9 25
2806 25 56 25 39 -22 -2 34 129 1 -18 -64 -17 -38 -17 65 -35 56 -95 56 11 -25 -58 -46 68 -13 29 -46 21 -109 -39 23 -18 73
2526 73 -148 17 -3 -33 106 -31 76 -98 -13 3 61 -19 -2 -26 46 -30 -30 -25 101 26 79 48 50 49 -24 24 -64 61 -22 29 21 -13 -44 54
2229 54 36 -10 -72 61 -23 63 119 34 74 126 88 67 -26 115 30 -110 -34 143 92 130 -26 -81 -9 -50 -15 -9 31 33 8294 1181 108
1957A08N1o8p6n8R0q6R7n8N3k4n1M3O2j58j8P2J58o7j96J18j67J10J06N3J6j20R8Nk59J74
1695Hk6M8n8J9L4j2M1n0QM2l7N2k7k1N4j79kJ97Q3n6j08M0j03Q2l0m4M3q8O6l9N6J55n7j32
1397d1j4M2M6N1n0j4L1n1q2R6n2N2L2j58K7K00k4o3n0J8N4j33R9P8n5j60L8J07n9J6O6l5N3
1108F5l1k2om5M9r4J83r1J01k8on5Rk9M3r6K6L6O4j08o4J57k4L1j29P0p6P0R4j54J63p8j3
820A2M6j01Q5n4J25j61m7jK54j25k5r7N2LJ10j84O4L1O8l0RQ7j33j1J20p5o1QJ60k26L5O2
540@L9nnj12K3k2J03j93j7m6J39J48q6R8m1o7o7J76j12J01o0j00K4jP6J08j04o3R1K4n6O3
260E6j5p1J00k4p3R6m3k7j02J49l3l7L0K2K6p2j6K9N3O7q9o3L8J4p3L7j30R5J2K2M3l2np6
-38i2O6q2N6PN5N4j00J7JR5j72K0P4J31m5q5M6j19k4R1j23N9
$$ plain form
1957 108 159 91 15 -43 47 -39 58 0 53 29 -22 21 83 -75 -93 -21 137 70 -126 -8 -175 -65 41 94 110 -10 88 93 -166 8
1695 8 -18 30 -28 -9 25 13 54 4 12 54 17 69 42 21 75 -104 -106 91 174 118 10 50 -53 29 -1 -45 -2 -90 -24 -63 -7 148 91 -41
1397 -41 -55 -13 33 84 34 20 51 0 -82 14 -38 14 46 -112 -85 115 91 28 -22 -4 50 -83 16 94 39 -121 -83 24 -35 -19 47 12 65
1108 65 34 12 6 -39 10 -84 99 8 109 81 75 20 29 0 43 -53 -27 9 73 -35 -99 58 34 65 -64 6 -70 0 94 -60 103 25 12
820 12 58 -43 42 -12 113 -48 -95 -96 158 33 8 -89 -37 -34 76 -108 -44 -13 55 25 34 121 -12 -23 97 22 -39 -31 129 -97 -62 0
540 0 39 34 29 -83 -60 -82 21 -172 -189 -235 -96 52 -34 64 23 -44 -111 65 -47 54 -6 -106 -82 -83 -7 101 -3 -66 25 49 -7 56
260 56 41 -30 70 46 -27 69 26 -1 -103 46 13 -24 6 28 54 -18 -34 -5 48 115 26 -37 1 15 -58 -21 -151 -56 -44 -22 21 -11 -16 -92
-38 -92 -26 -108 -52 -45 10 64 -36 -19 -18 77 -95 -75 -1 130 85 0 46 -73 -97 -6 -129 -70
-230g0
##PAGE=	F1=-14028.7
##FIRST=	23146.756194512010552,	4241.1435120000014649,	0
##DATA TABLE=	(F2++(Y..Y)), PROFILE
4241c7O3J4l2L7q9o7J04o0P4k9Q7j78J36p9N0j8J0j1M6nM2j1o8j31J80j2n5kP8k1J9M3j58
3952h0L5Q1j32J97Rk34J8R0k8P5jK8j08O1P1m4n7j7L9j22J58r5%J0kl9K45j80M5oJ4Q2n5n2
3655Fn2k2m1nn8J06J15o4J1P2kpj08p8J04O1pj09P7M7J09k16R6j11NL1k1K5L4l7N5J32j80
3366c2n2K4R7j1m0M7j7K4n5M6k1m8J14m1j6m9K8L5P4k53J93l9M1p5qj03O0Q6N6n3kk3m6J17
3069E8o3l1J96k03M6K8Q3j08N3l2qQM7j7L5j35R7mk2M2m6j51J28O4j9k37J80N7n6N0K8rO1
2780A20j00n4O2J07p6p0p9N0M0l0O0n4O9j64J67k2nm0m7R8m0O3p9N8j68R7M0l9Q7j56J34k4
2500Ek8R2o6Q4k11J37lJ03l4j34P3K5q3mNJ21n2P2p9kJ3p0M4n4J14m3K5l9%n7R2n5j6n3J59
2194H1r8P5Q7j14M0J8j4Jj01J56q7j88P2J98l9L5j25q4P0p1R6m5Q6p3L484k936m20j2q9K2
$$ plain form
4241 -37 26 40 8 45 -44 -111 -7 -67 7 -22 65 -113 23 -56 -6 -24 -14 -25 21 16 58 47 -21 -152 28 16 -39 -41 37 16 35 78 -80
3952 -80 -45 36 -96 101 110 -124 -106 -16 -44 31 30 58 -50 11 82 38 -19 -36 3 -119 39 -56 -56 -46 -48 -87 158 -22 23 17 31 113 58 6
3655 6 -46 -68 -109 -114 -172 -66 49 -15 -4 68 66 59 -49 -127 -23 38 31 -78 -1 46 155 -61 35 -76 -71 -40 -61 -36 -2 -39 16 148 -32
3366 -32 -84 -60 37 26 -14 33 16 40 -15 31 10 -38 76 35 19 -30 -2 33 107 -146 47 8 49 -26 -34 -137 -77 9 65 12 10 -13 -59 58
3069 58 -5 -36 160 -43 3 31 114 6 59 27 19 27 74 57 92 -43 54 50 28 70 24 -127 1 65 46 -191 -11 46 -10 40 68 59 120
2780 120 20 -34 28 135 59 -11 -90 -40 0 -30 30 -24 45 -119 48 26 21 -19 -66 32 -8 55 -24 34 -134 -37 3 -36 51 -105 29 5
2500 5 -23 69 3 87 -124 13 10 113 79 -55 18 43 -40 -44 -39 82 30 102 23 21 34 -36 8 -46 68 25 50 11 11 -46 46 -9 -25 -78 81
2194 81 -17 58 145 31 71 89 75 76 -25 131 44 -144 -72 126 87 122 -3 -87 -17 -88 8 -37 49 -24 3460 524 104 92 3 25
1931B5m3Q6r4J24o9M3q0l7J04Lj00j3L7P0rj64J05j36P9J04Q8j0j47J12J9k64J89k8K6m9L8
1660IN2%k1m8J8J2LLk4J9J10j81k1J76J47j01j22M3r8K2p4L0P0o4N0m5L5J21o6n5J3J7JM7
1362G8r1K9K5m2p4M8j1Q1Qj55MJ95ok5r9N3op5M3J14n2j43L0J54j13J8M6k4Q1n4q9P1o2R1
1065D8j50J72j09Q8M3Km7j3n2L0l8KJ1J5r0mJ69m6J5j24P3K5pQ0j25J18o8k8M2n1K4l8J72
776A39j70j3n3K49j05l6r8M9O4L5j57J4P8N4m0J7R3j51L2O8m1j14Q8J44k65J17L5J6j0l9o9
505f9J4l4R3j81J0o7Q4K26j12J07p0l9n9J55l9O7j12m3N9oj8J01q6k9P1Mn0N6np7Q8ol3J10
207A10q5k5r5J75q0j9K0J7M4o2q1Q7j3J65r0r3J0M7j31J40j60N6L6J2L7l0n3l9R4o6J5J8M2
-82CL2l9OJ4Qj93J42M1O0L6p1K8j34K6K4j12K9
$$ plain form
1931 25 -18 68 -26 98 29 72 -8 -45 59 62 -38 -51 -14 56 47 -117 -12 -148 -69 35 123 113 -34 78 97 -167 22 -6 20 -29 9
1660 9 61 61 40 -8 10 22 25 28 4 23 133 -48 -69 107 254 153 31 74 -24 -2 -76 -46 24 -40 10 -35 0 121 55 0 13 30 31 78
1362 78 -13 16 41 -1 -75 -27 -38 43 51 -104 -100 95 89 64 -35 18 12 -63 -20 94 42 -101 -71 83 -30 -12 34 10 91 37 -52 19 -43 48
1065 48 -102 70 -39 49 92 94 47 34 -18 12 -26 -24 -13 2 -88 -92 77 31 46 -78 -5 20 13 93 -32 86 18 -10 32 -19 5 -33 139
776 139 -31 -44 -97 152 47 11 -87 -38 26 61 -96 -82 -4 50 10 27 120 -31 1 69 28 -86 2 146 -119 -2 33 49 39 0 -69
505 -69 -55 -89 4 -177 -167 -234 -150 76 -36 71 1 -38 -97 58 19 86 -26 -69 -10 -16 -34 67 -19 -48 23 27 -23 33 28 -49 39 33 0 110
207 110 25 0 -95 80 0 -19 1 18 62 0 -81 6 -7 158 68 -25 -15 32 -99 41 -119 -63 -27 -15 22 -8 -61 -100 -6 -72 -57 -39 3
-82 3 35 -4 2 16 24 -169 -27 14 74 110 39 67 -67 -41 -17 -129 -100
-230a00
##PAGE=	F1=-14123
##FIRST=	23146.756194512010552,	4241.1435120000014649,	0
##DATA TABLE=	(F2++(Y..Y)), PROFILE
4241e2O6K6m8N7p5n1Q7o2M9k8J09j96J75r1J5k8L5KL7k9J1K2k3j26J29orm4R4pK2qj39M8O4
3935B6j14J67j0j79J0J02k5L4J9Rj01P9Q1o9r5J3O4j22Q8n8K0J3oJ1K25j64LOK6J6p1J0m0
3646c2n6k9j6n1J09R1l1J3P4n9M6p4j35J42M7k4r2O7J01M3k12J20j51k0Q0pN5K4j03N8K23
3375B01j85j03K5P5k7k7O9L7j0r8N2jj5O8j0m5r5N0M9Q7k26J79n0M3o7Jq0LJ46M1j09O9l5
3086A2l2J16j19m2K31k08L9K5M7m4L7p1Lm2J24l7O1j20R9n6o1J22n2j81J76O1k1k82J73M4
2824BqN6MK7J14j49j00R0Q3j5j03q6K3Q8q7N8QK4j59J56oJ6mr2N5k3P6n7N6j79J18J3m1P2
2526C0r4J08k9l0J8M5O2k31J71l2J25J0k73J77j1p5Oj7Q0qQ0j33J4K5m8K6j8Q5mk3j6J3q6
2237e3J06j04J0l7J38o7O4J04j43L3rJ3K3r9J58o8j91L8J76j2J4p8r4O3j06J73r1J13q0N59
$$ plain form
4241 -52 14 40 -8 49 -26 -77 10 -52 -3 -31 78 -118 57 -34 -19 -47 -12 -10 27 -2 9 31 8 -118 11 5 -4 -48 46 39 61 53 -86 -38 26
3935 26 -88 79 69 -110 -100 2 -23 11 30 39 -62 17 98 29 -66 -53 11 -111 -23 -81 -61 -48 -54 -43 182 18 21 27 53 69 -2 8 -32
3646 -32 -88 -117 -133 -184 -75 16 -15 -2 72 13 59 -15 -150 -8 39 15 -77 -10 91 134 -78 42 -109 -129 -49 -56 -1 23 -80 -22 201
3375 201 16 -87 -62 13 -14 -41 28 65 55 -43 9 8 -7 61 51 6 -89 -39 10 97 -129 50 0 43 -24 -23 -103 -100 46 87 -22 47 12
3086 12 -20 96 -23 -65 166 -42 -3 22 69 25 62 -9 -6 -48 76 39 100 -20 79 23 -38 84 32 -149 27 88 67 -215 -42 2
2824 2 -6 50 54 81 195 46 -54 36 119 104 1 -85 -62 26 -61 -3 5 29 -130 26 20 36 32 -60 -5 -28 48 -9 47 -132 -14 -1 -42 30
2526 30 -64 44 15 -15 3 48 110 -121 50 18 143 153 -120 57 46 -29 -23 -40 40 32 112 -21 -7 18 -30 -4 -22 63 59 36 20 33 -53
2237 -53 53 -51 -41 -78 60 -7 57 161 18 51 42 55 78 -21 137 69 -122 -84 92 80 94 16 -78 -15 -121 52 -39 74 -6 553
1975E53m22l5n8r1J13n8P6j10J39p8L2j07oJ48o4m4pnkL4r8J06j11L5P5R2k4j39J48nk47J83
1695B3j9Pl9L6P4%n3m7L0m2N8l1k7N0J40j64j5J46J45j04j31L9q4k5r1J05P2m1Pl8J9Q3o3
1406B0J0L7j3m2N1j05L0J22q6p9oK8P4kj18k5J62Lpq9R1n3n6KJ33j7j30K4J74j50J8K0j1P3
1108H3n0j45J38o0J32k01J52j04M0Q7Jpn3k9KK8j4j7k9p8L9J73p3J4q4M8J10p4O1j05Q0q6
828b1nL0j2k7oK03j56J6r1J65n3l3q4L4J09j5j25l2J18L2l3NR7j61N2K1j1j13J41R9k61J61
548D4L1k2k2n0l7Kj3N8j44J8p0L8K38r7J27j11jo7J19K9L1j50J8P2nr2O4o1J6M8Nn6O4k3q2
242h1Q1K3J2Q9r3k7q1J73j00KJ6KL3l9j41J64r8K62q4j28J8N0j68K12j75J9N7NJ8j0r1pQ8
-47Al8j2J4L0rM0LK5n7j83K06LqJ23o7j5j02P1m4q2j0
$$ plain form
1975 553 131 96 38 -53 60 2 78 -32 107 29 61 -46 -52 96 32 -12 -19 -24 -26 8 -90 16 -95 -60 15 107 83 -56 92 87 -160 23
1695 23 4 11 -28 8 82 82 29 -18 12 -30 28 -3 -30 20 160 -4 -19 127 272 168 37 76 -8 -33 -124 -19 53 12 19 -19 0 83 20
1406 20 30 67 54 12 63 -42 -12 110 24 -55 -61 -33 41 39 -79 -104 58 61 54 -35 56 3 -53 -51 82 65 -65 -41 133 -17 1 21 10 83
1108 83 33 -112 26 -34 98 -103 49 -55 -15 72 73 66 13 -16 -14 14 0 -17 -46 -124 -85 88 15 29 -55 -7 103 29 90 -15 65 -21
828 -21 -26 4 -8 -35 -41 162 6 22 -69 96 43 10 -74 -40 69 54 -71 -103 15 47 14 19 116 -45 7 28 17 -96 45 144 -117 44
548 44 75 53 31 -19 -56 -54 -67 -9 -153 -135 -205 -167 71 -26 101 -10 -11 -78 41 70 101 -49 -31 41 36 -56 8 -53 -37 11 16 -40 24 1 -81
242 -81 0 23 35 124 31 4 -77 96 -4 -2 14 16 49 10 -131 33 -65 197 113 -15 3 53 -115 97 -78 -59 -2 3 21 11 -80 -87 1
-47 1 -37 -49 -35 -5 -14 26 29 54 -3 -186 20 23 15 138 71 56 -46 25 -19 -101 -111
-230a11
##PAGE=	F1=-14217.4
##FIRST=	23146.756194512010552,	4241.1435120000014649,	0
##DATA TABLE=	(F2++(Y..Y)), PROFILE
4241c8N1K3o0N9l6l0N3m3%k2J16j84J83o2Mo2J1M1L7m5k3O4Nj04N7J5Nn0R3pQm5p6M6J6o4
3926f4J11m0r5KJ06k5j3O0rr2Q8N6p4j03M7P4j12j0J5K5K8j4M2J40j06m2K5M6o0p4P5Np2o6
3629a26kl8J19L7LJ0R5j23N7qj87J72K2m7o2N3J35K3k16J39j81l7J15L3N7qj35N2K48j47j03
3357e0MM6l6k0R4M5j5j27N4K1oJ1Rn2j02P4L0Q4j48J30m6M0n1j9k8n4J90%j30J38o9j0J01
3069A08j53m8K22j61J9ML7NL9j23j0o1J80l2N7q2J11j23p4J77r3j71K21K1k0k49J17P1L3L7
2806E9m5P4J45j97r7J15M0L1j15o6j3J08j38O9O9k0j41J22%K6N2j09Qk4O3j6P0j71J29k9l3
2535c4O9o1Q5l1l5n3J23P6k23J59n4J24J4l26K56l2o2K2m0K0L8O8j77M9L2j0qNN4J2o5M3R
2246D7j17J34j40J7nQ6k1M9J09j51J2l2L9L0o5J38l6j48k2J38Ojm0r4O3j33K30j08J10n0k88
$$ plain form
4241 -38 13 36 -24 35 -1 -31 22 -21 -21 -43 73 -111 72 10 14 -48 -37 4 41 -4 -27 37 42 -62 -5 10 15 -35 58 51 59 14 -62 -16 0 -64
3926 -64 47 7 -88 -86 20 -5 -18 42 33 -59 29 85 11 -92 -45 29 -83 -93 -78 -53 -25 -39 3 143 37 -5 20 66 6 -68 7 12 -60 -126
3629 -126 -128 -166 -47 -10 -7 3 98 -25 32 24 -163 9 31 -16 -78 -25 110 133 -83 56 -125 -162 -47 -14 43 35 -100 -48 200 53 -50
3357 -50 -46 0 -36 -56 38 83 68 -59 -5 16 10 21 30 -22 -124 -50 -20 64 -84 46 0 40 -11 -30 -58 -112 78 78 -52 86 17 7 108
3069 108 -45 -93 129 -32 -13 -9 28 33 72 -51 -61 -122 58 26 83 1 112 -11 -85 92 -1 -172 49 70 50 -199 -82 -11 22 59
2806 59 14 88 233 36 -61 54 94 125 10 -56 -69 39 -99 -30 39 19 -122 0 0 26 78 -31 -23 -47 16 0 70 -101 28 -1 -34
2535 -34 35 -26 59 28 -7 -60 63 139 -84 75 21 145 159 -167 89 57 -5 17 -23 -3 35 103 -74 -25 7 -3 -11 -6 48 60 -5 38 47
2246 47 -70 64 -76 -59 -64 22 1 50 159 8 20 -12 27 57 -8 130 94 -54 -76 62 68 67 27 -67 -4 -137 93 -15 95 45 -243
1975b43K94L3o3p5J69j08P8j19J31r7L2r7K2J63j18k0kj6m2N1k7J10j10K3K0O4j7j04J78m4
1712F6k20J79qj7l3K8R0j1n1m3L5q3J00n2l8O5J30j30K1J22P1p7j24K9o3l4o8J48M6l4l6l2
1432b4K0M8n2O4J8k4o5N5q8pJ92j03p0m4N0M1J0p0l9J21pj9m7J31p6o9mJ25L3j39L1J63j67
1143a2K1JNK9k1j66J73n0J49k18J32q7j5Q0JM4r7M2k5P7m3j0o2q3M3J78r4K5l0KJ50j07N9
855I1j09N4j15O5%jl8K6J88j20L7j10N3J9m0p5K2J21j1j07m3J29K4j1j8P3j45M1pOp9J69L0
566A19k13J57L8n0k9n7k4MK7K5j02J0o4L1J71n6J45j47L3r7J06P7oj67O6P3j3j04ol7N0K7
286a3K4p0Q3l7r4O2O8M3L1n0l4q3J55p9L0Mk1J1k2j76K23j55L08p1j52O3L8j73K17j66j8Q0
6B6jrJ4j00QO0j8k5K0J8n4J07JK8q3j34J80k8l9K00q1p6l2R4p6n1n0
$$ plain form
1975 -243 51 84 21 -54 115 7 85 -34 97 0 32 -65 -43 120 2 -18 -20 -36 -78 -27 -54 56 -54 -31 -11 53 36 -68 110 66
1712 66 -154 25 17 0 -33 -5 85 74 23 -20 15 -68 32 -20 -58 7 137 7 28 150 221 144 20 49 -14 -48 -116 32 78 44 8 -24
1432 -24 -4 44 -8 56 74 50 -15 40 -48 -55 137 34 -36 -80 -30 11 21 -49 -88 33 26 7 -40 91 15 -54 -58 67 100 -39 -8 155 -12
1143 -12 9 10 15 44 23 -143 30 -20 129 -89 43 -44 -59 21 22 66 -31 11 -14 63 20 10 -52 -135 -92 86 -8 17 -13 -11 139 32 91
855 91 -18 36 -79 -14 -14 -15 -53 -27 161 41 78 -32 21 40 0 -75 -53 68 57 -50 -93 36 60 49 31 104 -41 0 -7 -1 -80 89 119
566 119 -94 63 101 51 22 -35 -59 -55 -28 -3 -105 -95 -159 -128 43 -13 132 -15 18 -79 27 104 98 -69 -3 70 57 -47 -53 -90 -40 -13
286 -13 11 -59 24 -13 -107 -45 23 66 97 47 13 -70 85 6 36 40 19 30 8 -168 55 -100 208 137 -15 48 86 -87 130 -36 -54 26
6 26 25 16 30 -70 -62 -2 -20 -45 -25 -7 -61 46 47 75 -8 -142 38 10 -29 171 90 14 -18 76 0 -51 -101
-230a01
##PAGE=	F1=-14311.7
##FIRST=	23146.756194512010552,	4241.1435120000014649,	0
##DATA TABLE=	(F2++(Y..Y)), PROFILE
4241hL1J6o6L3K5k1mkl8j6J05j57J54JL6j09m0O6M4l6n0R8J3o9k0M4j4l4R0j2m2l6NK7k0k7
3926c3N2o3j5pR3l3m6J08k6o8P1J8m5q5O5N8q5q5P7J6M4j8L9L3k7q4M4P1j30n0J07Q1p5j18
3629a16J4k0J22j9J0K1J23j66MQ1k15J82j1o0k4M0J21M5k09J60j87o3J29R9J8m8j36L2K13
3375A40p9o4j8K2l2j9R0K4J1j27N2L1j9m1J0l7n8Q5j6O5m4O1k6L2m2m3K6q7J99n9j04J69q8
3086A4MQ5j57n3J80r4Ol6N6L3O0j76m4m9J94pK2l4J30j64o2J75j36j25K27j9j0j62L0J16N5
2815E9Nr8J20J36k31m0J27j3N2j09l2l7J03j71P7J18n0j11P0ML2Q4r2j3l6L5K0Q9j55J21p1
2544gj3Q7o0O8l2m3r4J20J34j83R0m8J00j8k74K89m9n4L7n1k3O6M1j98R1K5K7m7K0L2lq6J01
2255D5%j39J65j48%L7M0J0K3J05j37j5m9O3J8kQ9oq4p0R9JOk6q9O3j27K42r6Q2k4r9J54p0
$$ plain form
4241 -8 23 39 -27 6 31 10 6 4 -34 -50 55 -102 52 53 89 -20 -60 6 50 14 -36 62 75 6 -14 30 16 -18 72 60 18 -18 -13 14 -6 -33
3926 -33 19 -44 -59 -66 27 -6 -52 56 30 -38 33 51 6 -79 -14 44 -41 -126 -49 -33 11 -7 32 65 38 -46 -2 69 -61 -111 -4 77 2 -116
3629 -116 -102 -122 0 -19 -9 12 135 -31 -27 54 -161 21 10 -50 -74 -34 87 132 -77 83 -104 -167 -38 61 79 31 -105 -73 140
3375 140 61 -3 -21 1 -31 -50 40 64 75 -52 0 31 12 -29 -19 -56 -114 -29 -45 20 -24 37 11 43 1 -42 -16 -103 96 37 -67 102 14
3086 14 18 103 -54 -107 73 -21 -15 -51 5 38 98 -78 -122 -171 23 16 38 4 134 -30 -92 83 -53 -178 49 30 20 -142 -112 4 59
2815 59 64 -34 86 222 -9 -49 78 65 117 8 -24 -61 42 -129 -52 66 16 -95 -25 -21 11 95 3 -10 -46 -11 9 98 -57 64 -7
2544 -7 -20 67 7 75 43 0 -94 26 160 -23 67 19 119 101 -173 116 67 13 50 -1 -24 42 83 -115 -24 1 28 -19 1 33 30 -56 45
2255 45 45 -94 71 -77 -77 -40 0 10 33 138 1 -14 -63 0 18 16 105 99 15 -55 44 45 51 25 -64 -1 -128 114 18 100 76 -23 131 61
1957F1k7m3J77j68R2j13J06j20L6n6L0J55j46m2NJ6m6M4K5R2j26N7m0K6J1p6J72n9j99J89
1695C3j1m2k5K9R7k3m2k9K7q6J11o0m9N0J00q5O7J02m3l6r5J9n1Jk0J53Ln5n4l6M6J4m2J14
1397H2m6%p3N0m5n9J82o1n6n9N4kM0k6l8R2l0m8j6J68q6q4K4R3P3j59M8J22j61K7%J1k1J3
1100Ij47J72l7J29j98J20p6m6L1J3P3j24J30m1J11r9L7p5j15K3J86j03L5J0l9J41j05P3j11
846b3K9j35J56n3kj4M4J26p0M1j04l0Q6p3p8L0R7L7j12j1J01M3K3m7K5j03J0j1Lm1J75l3j48
557f2J21M4n3k8p8k2K9N8J3p5%n4N5O0j2J46j67N5j33J20J11n0j51Q2Q0m0n1r6j9O8qO4q4
268g7R5j9j11K3J18N5m1K3m8r6J32k8O3k3l6qk5j81K47j61K84o3j52J29K8j64J62j32n5J09
6D8j0l0K1p7OK9j4l1M9Rq6J38KJ0p2n2Q1m9k9K56j13j26M6R0o0l1p9
$$ plain form
1957 61 34 -9 168 0 92 -21 85 -35 1 -55 -25 130 -16 -58 -53 -37 -83 -39 -14 78 -48 9 -31 -5 6 -70 102 43 -156 33
1695 33 22 -20 -45 -16 81 58 16 -13 14 -72 39 -21 -70 -20 80 -5 62 164 121 85 -10 9 -42 -41 -61 92 95 40 -14 -50 -4 10 -32 82
1397 82 36 36 -37 13 -32 -91 91 30 -26 -85 -31 -33 7 -19 -57 35 5 -43 -59 109 23 -61 -37 56 129 -30 18 140 -21 6 6 17 -4 9
1100 9 -138 34 -3 126 -72 48 -28 -74 -43 -30 43 -81 49 8 119 20 57 -18 -133 -110 76 -27 8 18 -21 120 15 88 -23
846 -23 6 -129 27 -26 -28 -42 2 128 58 99 -5 -35 51 -22 -100 -70 27 64 -48 -59 42 85 108 61 86 -17 -7 -18 -15 -56 119 86 -62
557 -62 59 103 50 22 -56 -78 -49 9 22 -53 -53 -107 -52 8 -4 142 -25 30 -103 17 128 78 -73 9 89 49 -2 -98 -117 -49 -57 7 -77
268 -77 18 -1 -112 -89 29 84 43 66 18 -78 54 26 89 66 30 22 -3 -184 63 -98 186 123 -29 100 128 -36 126 -6 -61 48
6 48 38 8 29 -48 -42 -13 -27 -58 -9 0 -86 52 54 64 -8 -60 21 -28 -57 199 86 -40 6 96 36 5 -74
-230g4
##PAGE=	F1=-14406.1
##FIRST=	23146.756194512010552,	4241.1435120000014649,	0
##DATA TABLE=	(F2++(Y..Y)), PROFILE
4241A5J3K1o0j3Q8l8o0M7m2j1O4j13Q9P7R3j36r2M8N5Jn6R2J2k5p0N5m4j5R5j8j18J5P3pj1
3935B4l0J4p7L6nO1m4o1J44m1l0M0j8K0o6O6Rm7j01R7%N6j6J1n3M0j10N1R7j81kQ3J69p5j35
3629g4KQJ00l8k2M8J41j81q7J75k10J58l9n0J4K3O5P9j86J82j62j07J34J70n0o9j31RJ53p
3366D8k3l2K4k6j7N1pN6r7M1L3l8q5Nj5J5P2o2M5L9%MJ9m6n1N8q8J68j04m7J48p4OP6j31n9
3051i4J29m7%p2Q2M8Q7k10q3k1J67K6k8JJ57j59n0J25j43p2J89l2Ko6n8J49O0k8j28J45R9
2780A75k38M5J16o9N7q6j2l8Q7j77P2J51o8p6J2J4M2P3n7%m6J0L6R4j39Q5q6J2J13p1O1m1
2500E1n6q8M3K13j28rj6N5m8j55K76p0n1M1n2j7N9J5j92J21lN7p6M1Rk8r1J27Mj47J92j37
2220f0k8O7K9J6qR6j23l1m8P8nP0OLj5p1N8k2K6k5q0N2q6K07o5N1l9J20K7j75K2%J45k03J05
$$ plain form
4241 15 28 49 -11 -24 64 26 -34 13 -29 -40 24 -89 0 77 170 34 -58 -10 45 46 -10 82 94 69 -1 54 10 -5 90 72 -46 -31 42 35 24
3935 24 -6 8 -69 -33 -38 23 -21 -82 62 21 -9 31 13 33 -33 33 42 -5 -106 -9 -9 47 31 42 -11 29 -81 -30 67 -114 -116 -33 136 61 -74
3629 -74 -72 -64 36 -2 -24 24 165 -16 -103 72 -138 20 -19 -69 -55 -32 33 112 -74 108 -54 -161 -27 143 93 24 -107 -98 55 48
3366 48 25 -7 17 -9 -26 25 18 74 -23 18 51 13 -72 -67 -82 -67 5 -57 -12 27 27 31 50 4 -47 11 -77 91 -13 -60 88 14 20 96 -35 -94
3051 -94 35 -12 -12 -84 -2 46 133 -77 -160 -181 -14 12 -16 -15 142 -17 -67 58 -85 -157 32 0 2 -64 -122 27 87 59 -69 76 175
2780 175 -63 -18 98 29 86 0 -12 -50 37 -140 -68 83 15 -61 -49 -35 7 80 23 23 -23 -13 23 117 -22 63 -23 -11 102 31 92 51
2500 51 -5 -93 -50 163 35 26 10 65 17 -138 138 68 17 58 6 -11 48 63 -129 -8 -11 46 -30 11 20 -8 -99 28 32 -115 77 -60
2220 -60 -88 -21 8 24 16 112 -11 -42 -90 -12 -17 53 59 62 47 -24 34 12 38 13 -67 -15 -101 106 41 92 53 173 200 25 47 47 192 -11 94
1913I4r5Q2j33K9KJ4J40j52r2J7P4l3K8N1M0j36J10p9%M9p4J20l0j87K06l6o1mM3R4l2m1%
1625HMo1Q8m7n4OP5l8R9Q0j46jn1J8o0O8J3J30l0r6m2n1R3j4m6J58j23N4p7K8J2j10J26Rn3
1318c1n4N4m1P1J1m1P9m7o3j6J83j00o9O8N1Q3j61N7N7j27K7J9nm5L3r1J37k2Q3j61J22r1
1038c0l6k9L8O6j17J80m1J46j69Q1n5j66J0J92j03L7K1n2R1q3Q8q1Kj42K22j06RJ5N0M9k9
767E8J9p9n3J25j19q9O8M3R1j31M3N2P1O5q0j7n4k1Qj4k4J66n1j09Q5L2l1j9j19k1P3O2K1
478E1p3Km6Q2l5J3J33j69O1j47J28J41r8r5N8R8p6K8j81kP9o6J19q7Q1K9j24j9J53M5q7Q0
198G6o1r9R7K8R2n8l2j8m1j61K37j21K10p4j23J88J9j64Q7q0q4J36k6k6Nm2%Qk8l0R1oq5J31
-99D6Qk7m5M0k8p2RK79j58j37J02O7j8j5r6
$$ plain form
1913 94 -1 81 -52 -23 -21 -7 133 -19 -111 -94 -20 -53 -25 26 66 -70 40 -39 -39 10 -64 56 26 -161 45 9 -52 -56 -13 81 49 8 8
1625 8 12 -49 39 -8 -62 -56 19 -19 80 160 14 13 -38 -20 -80 -12 1 131 101 5 -37 -88 5 -9 -55 103 -20 34 -43 -15 -3 -113 13 22 -31
1318 -31 -85 -31 -72 -1 10 -31 48 1 -62 -78 105 5 -64 4 55 138 -23 34 91 -36 -9 10 5 -40 -7 -98 39 17 100 -61 61 -30
1038 -30 -66 -95 -57 9 -108 72 31 177 8 89 34 -132 -122 70 -33 4 25 -27 64 -19 69 -12 -10 -152 70 -36 -27 -12 38 87 58
767 58 77 -2 -55 70 -49 -138 -70 -27 64 -67 -24 28 99 164 84 67 13 -8 0 -14 -38 128 77 -32 53 85 54 35 -84 -105 -32 30 51
478 51 -22 -20 -66 16 -19 -6 127 -42 19 -128 0 141 43 -52 6 104 28 56 -125 -127 -48 -114 5 -82 -1 28 -96 -115 38 83 -4 76
198 76 15 -84 13 41 133 75 43 25 -16 -177 60 -61 149 75 -48 140 159 -5 82 2 -82 54 28 2 7 -35 -35 -27 -55 -85 6 0 -85 46
-99 46 54 27 -18 22 -6 -78 -69 210 52 -85 17 84 66 51 -45
-230d5
##PAGE=	F1=-14500.4
##FIRST=	23146.756194512010552,	4241.1435120000014649,	0
##DATA TABLE=	(F2++(Y..Y)), PROFILE
4241B3j1N0m6o3J29p4q1P8j3pmm3KJ48J24j20j26lO2N2m0M2MK3p3L0m8mR2k1j86Q0J03n2N4
3935H1p6Pq6N6J1J5m3o6J56n8J1K1l6R5o9N9n7j0o3O4oO1%l0r1O4j04M6J12j93L8K1K31p3
3637H8r4m5M0N1mp8P9J34j71j64K47j75J04n5k2L9nJ1R3j49J86j10j60J45K03j07o2j35kJ08
3375a0M0ln1O1j9k0Nl6R4l9J4L9m4j19J2j4P2M6q3L2Q0m1L4Nn5l9N9p0J12j08J1R2l8J5O6
3069A00r6n4Q5l7j0q3Q9N7J05k10j12K0J04N6o8JJ92j19n4O7j05m0J26j6Jmj07J48O0n6j13
2797g3J35N6k07J05P9j08O2n6k1j7O9j55N7J63p0n1l3L0N0L8l1L3m9RK4O9j22L8o6L0J27p3
2517D2O4o1p5m3o0K77p9r6K6%m9k9K29q8n0L4m6L2K2lj56J17m7Q1p6O2j8m2q7J17K4j36K04
2229I0j25n1O3N8Qk9P8j28j7k1P3l4J32r7j7M7j3J7m5L0j9n8J4l1J43k9L9q3Q7J14k08N3M5
$$ plain form
4241 23 12 62 16 -47 82 8 -73 5 -8 -15 -19 -62 -60 88 212 92 -34 -37 25 77 37 79 83 106 33 63 15 11 103 82 -104 -24 79 27 81
3935 81 5 12 -74 -18 -7 8 -35 -101 55 -3 8 29 -7 88 19 78 21 11 -52 12 6 67 67 37 -54 10 -94 -48 64 -129 -91 -70 161 88
3637 88 -6 -51 -11 40 36 -42 37 171 0 -164 83 -92 12 -43 -65 -26 -31 -20 73 -76 110 0 -160 -15 188 81 19 -116 -118 -10
3375 -10 30 27 -24 37 18 -2 3 -33 61 22 36 75 31 -88 -76 -90 -18 28 -55 -23 57 16 50 55 0 -39 20 -50 62 -46 -35 57 19 34 100
3069 100 4 -50 35 -2 -12 -95 -6 51 156 -54 -166 -146 -42 14 -54 -53 139 20 -34 33 -72 -112 14 -2 -1 -5 -112 36 96 40 -73
2797 -73 62 118 -89 16 95 -13 49 -7 -28 -45 24 -131 -74 89 19 -32 -65 -35 15 53 22 55 6 15 39 108 -14 24 -42 -12 115 42
2517 42 106 45 -30 -73 -133 144 65 -31 -5 -5 -54 -83 146 58 8 42 -4 28 50 47 -109 8 -39 42 -34 28 10 -32 -119 -2 22 -114 90
2229 90 -35 -86 -23 35 43 14 92 -36 -53 -74 -1 -35 97 0 -17 30 17 34 -11 19 0 -58 -44 -75 68 39 78 -5 82 196 -12 41 86
1940H6R1k01J13q2P2j21NO4k1J35j45j44L3J24l2K3O0l1j22J35p7oP9r1L8L4j75K04p0o2K6
1668e8N8Q2l4m3M0k9l2M1j8m6m9O9MJ01N4j99J6jJ3p9J39jJ03l6j31j5o5J34l2o0J82j70J13
1380E1q0oN7j46P7O1o1l6N8o1P6N2p4P5m0l9m1J58j16k1J07J7N2j21L8j6p0J6M7m0k7K3JP3
1082D4kL6j32J27j22qo0O5K8p7J67l2J93k21P2Lk21K8J86r8L6jl4L0o6R1j4k1j40K20j22L8
802gK5N1%j4l5m4k5J25j44j00J29l1J25j47R0RP2J09j05l9rl3L8l9k2J38pj23P3M%pj75nJ13
496a0M0L5q9K0m1R0p5J3J16j59N1j19R6J62j30j4OJ17r7Q9k40J1J02j35J67p5M5P5j17m3J55
225D6J3q2R1o5p2L8P3J09q8j9j8n8j28K18o5J27j04p9K19Kj78L0k3r6J49m7Rj7j9n%n6j5J28
-73A8m2m3R9K2o5l4J18r3r4M0K73k06r8J17M3K0%r9
$$ plain form
1940 86 177 -24 89 7 79 -42 -37 27 6 141 -4 -148 -115 9 -23 0 60 29 -93 42 -35 -41 38 -53 -15 19 -156 48 -22 -84 -58
1668 -58 0 82 48 5 45 16 -16 25 7 -39 -88 -19 -15 86 140 -59 -43 -44 -31 -110 29 28 131 95 -36 -51 -116 18 -14 -74 108 -62 51
1380 51 -29 -35 22 -124 -47 14 -47 -83 -25 -86 -10 42 -32 43 3 -36 -77 81 -35 -56 51 68 120 -1 37 21 -49 -33 14 -26 -53 -30 -29 44
1082 44 42 78 -54 73 -49 -57 -117 -52 -24 -101 66 34 227 6 78 81 -140 -112 74 -24 12 11 -23 7 -59 32 18 -3 -143 77 -45 -7
802 -7 18 69 69 55 20 -24 -49 76 -68 -168 -39 -70 55 -92 -2 7 79 188 83 44 35 2 40 1 -21 117 110 -13 60 64 64 57 -118 -123 -10
496 -10 30 65 -24 -4 -45 45 -30 -17 99 -60 -9 -128 -32 130 0 -14 -8 109 12 101 -139 -128 -26 -161 6 -69 -24 51 -66 -109 46
225 46 59 -23 68 3 -69 -31 42 151 63 44 26 -32 -160 58 -7 120 16 -63 156 158 -20 10 -13 -109 40 -7 2 -15 -34 -39 -39 -95 -110 18
-73 18 -24 -67 32 54 -11 -45 73 -20 -114 -74 199 -7 -105 12 55 75 75 -24
-230b4
##PAGE=	F1=-14594.8
##FIRST=	23146.756194512010552,	4241.1435120000014649,	0
##DATA TABLE=	(F2++(Y..Y)), PROFILE
4241A8m1R2k8r5J32j10n3Q1J8kp9M6q8K15R2p4j30m9N5R2rk9j0O7m2k1j4NN6k1k00J18Q1q4
3944a1J43j32J7r2N6L3l1j4p2J40q0L9L3l4J45r4N5j03J6k0OKN9L0p0q2M5o7L9J06j66M4m2
3655a02K44o6j6j03O2pO8j29R6J02j49j79K71j22L5n7LN0m2jP5j05J56m3k06J65J69j29k9
3401A1j46J6R1M7Kr4J23lm2j5o1J15K9k4M6k4j37L4n3Q6K0o8L5P5n7O1j8m9k6L0m6O0o4M3
3104cL4j2M9M9p1l6N4m8l6p2P4N8J09j80j23P6K3O7o5m5K26o1p6L1m4l7O5Qk2J3r7J22N8p7
2806A1o3J00K1j43J12K5j15P2l1m7J0M8j09M0J47m4n2m3M3M3J4l2O1l8L1pJ7j04J3l4K6J17
2526H9m8O8p9j00Pj32L06n6j34M9m0k6O7J58q5m3J4l4Q6k0rr9P1q5J04m6O0m4l0q1Q8N1j12
2237h5J94j19n7K1R7Kk1M6j41K6RN5n9J60j77o1J03O8j1o0Ojk0m6OP4MN2j24OJ99j87O4P4
$$ plain form
4241 18 -23 69 41 -54 78 -32 -85 -4 14 12 -67 -21 -109 106 198 124 -6 -55 0 92 83 54 44 111 69 48 34 39 95 74 -126 -8 73 -11
3944 -11 132 0 17 -75 -19 14 -17 -31 -103 37 -43 -4 29 -5 140 46 101 -2 14 -6 0 2 61 91 21 -61 -16 -83 -44 62 -104 -60 -102
3655 -102 142 76 60 -43 19 12 80 -49 47 149 0 -179 92 -30 5 -52 -49 1 -41 -42 33 -72 84 41 -165 0 169 40 11
3401 11 -135 -119 -28 19 21 -73 50 47 5 -10 -71 44 73 49 95 71 -66 -32 -85 1 21 -47 -12 63 6 67 49 0 -26 4 -42 18 -46 -3
3104 -3 31 19 68 117 46 10 64 16 -20 -92 -18 40 149 -31 -154 -78 -55 12 -53 -98 128 67 -9 22 -22 -59 6 14 -8 5 -92 30 88 11
2806 11 -52 48 69 -74 38 63 -52 20 -11 -58 -48 0 -109 -69 78 34 -18 -61 -18 25 39 7 68 30 61 54 71 -33 -20 -54 -28 89
2526 89 41 109 30 -70 -63 -195 111 55 -79 -30 -70 -96 -29 129 44 1 15 -19 67 47 38 -61 10 -75 29 -17 43 -1 -31 -112 -24 27 -85
2237 -85 109 -10 -67 -46 51 53 32 78 -63 -37 -28 27 -32 128 -49 -110 -7 61 50 -10 -4 -5 -25 -71 -65 9 13 65 -59 -53 146 -41 23 97
1940I7L8j77J23q5O8q1k0J11n4J37j41j64N0J40o2L2O5q7q7J20m3rQ2q8m2R3j49J68r6m2N6
1668d7N5O8l7k5P5n0k8oJ2l6q3O7L6P7L0j96J7M6mr8J98o8R1j3j37Nn9J38l7p6J77j62J44
1380G4p6l9P0j64P0O6o4j5O3n3N7Q5j39P3lJ0o4R5j19L5J26Nj1m7j2o7qpO8p8K1rJ16oJ9K
1065G4j15J11j38Qm5Q0k7j9J11k6K39k23KP5k53O4J73r6M0m1j1rn8P4N9l4j28J47p6N9J7N4
785H8mk5j08rK0J00j27j11J91j06J33j51J09lK0J49j11m1K2j0N1n7k0R2P5j75Q7k9K3Qk29
513a48K5J30J1L3r9M7m1Q2o4mJ09j42K5n5K3J54j25O0n2J28q1R6k57J9J44j86J71n2J3Q5q3
242c4l8J28m2k3N4n2k3l8J00J15j04k2j6n7r7K13k8P2j38m4K24l5j77kK6r2J45o7O1k6j5j2
-38d4Lr3J8J41j01K9N9L9q0m7J55r9j02M2K50k48k0R8K3M2J3r2
$$ plain form
1940 97 135 -42 81 -4 64 -17 -37 74 20 157 16 -148 -98 42 -20 12 77 -10 -97 23 -20 -29 53 -35 -77 16 -133 35 -61 -103 -47
1668 -47 8 76 39 14 89 39 11 5 17 -19 -102 -35 1 78 108 -88 -71 -25 -29 -127 71 3 94 81 -56 -51 -110 28 -9 -85 92 -70 74
1380 74 -2 -41 29 -135 -65 1 -63 -78 -15 -68 -11 74 -65 8 5 15 -49 46 -73 -38 88 93 82 35 23 -44 -52 -59 9 -69 -48 -57 59 53 72 74
1065 74 -41 70 -68 -60 -105 -25 -52 -71 40 14 253 30 32 107 -146 -82 91 -5 35 -6 -17 -26 -84 -10 49 15 -113 34 -42 17 34 88
785 88 84 59 -49 -58 -38 62 -65 -176 15 -91 42 -109 0 -3 17 166 55 14 36 26 77 20 0 92 167 -8 79 50 73 81 -148
513 -148 -123 7 18 51 -48 -1 -42 40 -24 -28 81 -61 -36 -91 -68 86 -39 21 -31 97 16 112 -145 -126 18 -168 3 -49 -36 49 -34
242 -34 -72 56 14 -9 45 -7 -30 -68 32 147 43 21 5 -52 -149 64 36 108 -30 -74 150 115 -62 -64 -38 -130 15 -52 9 -17 -32 -44
-38 -44 -41 -134 -116 25 -76 -47 12 51 -29 -76 79 -20 -122 -80 170 -78 -98 0 23 65 78 -14
-230a4
##PAGE=	F1=-14689.1
##FIRST=	23146.756194512010552,	4241.1435120000014649,	0
##DATA TABLE=	(F2++(Y..Y)), PROFILE
4241A6p2J25k3r6J05j23JO7K7Nj34J15j49K75Pl3j04o2L5J06Rp2k4R3pp2M4Rj1j1j47R7L0
3952B6q2K03j61K2q7M3N6o8L7p9J06j02L4P7j9J46j24O6j01K4j5n0L4N1N7r4m5mj0L4Q2j15
3672e8J1o8K07n3O5j46O7n3J37j45P9O5j19j26K31o1l0n3J2M9p2L3M1o3R7K0k30J82P6j11
3410a6Qj50O1R5J4J4j57J82K4q0pp6J19Q5n7L7J9j31O0j22O6jl5N7M8n7Q3n1k5k5j9j9K9M
3112b3M3Mk1J05K6o6KK1m3q0n8M6M7J07j36j24J41n3N2j2j11K43jr6J8Nm7J0K6n6%l9R3N1
2815G4r5nO4po5P1j8q9P7j4o8K1K5n8K7J07J1p2k1M5K2J2n2P3k0N3l0m1q9K4j4oQ3PN9p4j23
2491a06K5j43L02o0j20M1m0lJ16P4n3k7j6qQ9l6Jl6mj00J22QJ9o1ln9N6O7q3J63j19m7l6J11
2194C4LJ7Lj23O4J7L6p5J51j96r8J32J23ro5l7K2K5j01MK5K5P8j27K1J47j52O9P8lj60J53
$$ plain form
4241 16 -56 69 46 -50 55 -68 -67 0 27 32 -102 13 -136 139 146 113 9 -53 -18 88 97 25 1 94 87 15 59 68 57 46 -101 -4 26
3952 26 -56 147 -14 8 -79 -36 20 -48 -11 -90 16 -86 -52 25 6 152 28 94 -7 17 2 -48 -14 37 94 0 -45 -49 -59 -25 57 -58
3672 -58 -47 -115 92 39 104 -42 25 -28 109 -36 43 108 -11 -137 94 33 3 -50 -38 11 -61 -28 13 -50 47 67 -163 19 95 -16
3410 -16 -8 -158 -97 -2 12 26 -131 51 75 -5 -12 -88 31 116 59 96 115 -16 44 -78 -12 -13 -48 9 57 0 83 32 7 -18 -37 -56 -27 -23
3112 -23 20 24 3 108 134 68 70 91 48 -32 -90 -44 3 110 -26 -150 -9 -62 -10 -22 -133 110 109 13 31 36 -11 -1 25 -31 -31 -70 23 74
2815 74 -21 -26 38 31 -34 37 19 -70 7 -7 -75 -54 -29 -87 -60 47 58 -14 -35 10 32 44 -8 65 45 98 68 27 -62 -38 -52 -58 25 32 91 17 -106
2491 -106 -81 -224 78 18 -102 -61 -101 -104 12 86 33 6 -10 -18 71 35 36 0 -4 -104 18 26 45 -16 -19 -78 -22 45 -38 125 6 -41 -77 34
2194 34 37 54 57 -66 -2 15 51 -24 127 -69 -167 -35 88 79 14 -23 -1 24 -77 -73 -48 -23 55 -72 -51 96 -56 13 91 88 -72 81
1913H1j08N9l2k5J34p3J34j44j36N9J17j17N3P2j10l9P8kk6M7l3q7J08j04J02r5j4P6L2N1
1651E8m4J7R0l9n1l6K2l3q0M9O8K9J9j49JR0l3j11K31j52R8K7j13%k0R7l5q4J47j11J42o9
1371B5n7M8j65J03L0n1kN9j5L1R5k07O7N0M7o9K2q6N8J27Pp7L1p6q1L4k8P9j00O2m3K26p8
1082F6L6k3r7N9j12pNP6q0L2N2k2K57j69q9J33k49Q5J64r9N1q3qj2m8M2J01l9q9L7J0M8LN9
785I0J7l8j74K3M4P6p7j19K23j60J26j39J02Oo0J62q7l5L6M1L3o6lL8J42k19J12m9K7J9k53
513a62O1J19rjp8P0m0P3l6k0J07j19j0J9o1J01p5R7r0J19k1M6k38K5J93j90J13l4PN4l4j2
233b6R0r9N5mk5K3r8J03J14r8n7j3m0p2K16j6M3j50l1K13q5j36k7O7p8J30p6Q7pk2j8Oj26
-55a57O2J26j55R2K4M8o0p6J37p3p9J7K25k66O7O1%N6K2q0
$$ plain form
1913 81 -27 32 0 -25 109 36 170 26 -110 -51 66 -51 2 74 -36 -75 3 1 -25 22 -11 -98 10 -94 8 -87 -101 -25 7 58
1651 58 14 31 121 82 31 -5 17 -16 -96 -47 21 50 69 -80 -79 11 -22 -133 98 -54 44 71 -42 -42 -62 35 0 -84 63 -48 94 25
1371 25 -32 16 -149 -46 -16 -67 -69 -10 -25 6 101 -106 -39 11 58 -11 11 -75 -17 110 117 40 71 -5 -86 -52 -80 -1 -101 -39 -82 144 66
1082 66 102 79 -18 41 -71 -78 -73 3 -77 -45 7 -15 242 73 -16 117 -132 -47 117 18 69 -14 -22 -34 -82 -40 61 22 -67 -30 -20 28 31 90
785 90 107 69 -105 -82 -38 38 -39 -158 65 -95 31 -108 -6 0 -60 102 15 -20 16 57 90 24 21 59 201 -18 94 45 72 91 -162
513 -162 -101 18 9 8 -70 0 -40 33 -3 -23 84 -35 -45 -26 -87 14 -61 36 -54 65 44 90 -148 -123 70 -120 -7 -41 -34 20 -14 -26
233 -26 64 -35 20 16 -9 14 -84 19 133 35 -22 -35 -75 -147 69 53 96 -54 -85 128 43 -93 -120 -53 -131 -1 -77 10 3 -19 -37 -31 -157
-55 -157 -95 31 -124 -32 -8 40 -20 -96 41 -32 -111 -94 131 -135 -68 -7 -7 49 71 -9
-230i
##PAGE=	F1=-14783.5
##FIRST=	23146.756194512010552,	4241.1435120000014649,	0
##DATA TABLE=	(F2++(Y..Y)), PROFILE
4241B8r2J21l0p0P3j08M0O0MJ8j50J20j59L17q4j8n1n4J8Q5on2l2R7J1r9Q5Mp4J1n3K0j4m4
3944g8K04j58J5o4J9P2p8P7p6O9j09j0J31nR9j39J00n4J7m9r3Q7L1P1r4j3m5L6K7N5o1m5m5
3655a06J45l9J19j56N6q0J68j16K8M2q5l0J37Jp6n3PL7q1P5K0k4L7N6k22J78l1p3K7j34J14
3384e9J01m1M0k07K11N7j28J9q3J15J10o9QO6j05P8j86L1j6oR3K0n3J08q6Pl6p9K3JP0K5M
3095C3o2J56Oo5L9j6%j26o3J9K9J05r1j25J90r9J0P3j57K36N3j01MK7m8n1L6p7k0K9Q3L9j15
2806d9L3N0l3kK2k4o1O5Jo7LMj6J6N8Q0q5LM2pK4p1P5rN5k3q2q3N6j1o3M0P3L6m0j27nj02
2474b24K81p6q3J5KJJ27j0qnn3L9K2j4K4J5p9q4J18P4n1o9K2j7L1N4n1J23j14l0p5Q2NO5l9
2167A8m2N6mK6q1J12j37j08J17J31J5o2o9L4N9j28k5PL1J05r2O0M0j26R1N1k9j65K11j40L6
$$ plain form
4241 28 -64 57 27 -43 30 -78 -38 22 26 44 -106 14 -145 172 88 70 19 -35 -17 68 62 10 -22 75 86 -13 72 76 2 13 -40 -20 -34 -78
3944 -78 126 -32 -17 -81 -62 10 -68 9 -67 2 -107 -117 14 9 108 -31 69 15 32 -17 -110 -23 8 79 -15 -28 -73 -37 -10 45 -16 -61 -106
3655 -106 39 0 119 -37 19 -61 107 -9 19 61 -24 -54 83 84 8 -45 -38 -1 -82 -7 13 -11 26 82 -140 38 7 -66 -39 -173 -59
3384 -59 42 1 41 -166 45 102 -26 -7 -90 25 135 66 74 140 35 113 -73 -42 -58 -64 29 49 -4 104 18 25 -11 -90 -67 -66 4 29 33
3095 33 -29 127 133 68 107 91 91 -35 -98 -79 -50 55 -36 -161 29 -70 -60 13 -144 92 145 44 48 75 27 -24 12 -65 -85 -56 27 66 -49
2806 -49 -16 34 1 -1 21 -3 -64 1 2 -65 -62 -58 -74 -58 0 80 -5 -2 40 33 57 -14 61 52 107 84 2 -81 -25 -36 -99 -59 14 50 10 -117 -122 -224
2474 -224 57 -19 -102 -87 -85 -84 43 33 25 20 -33 6 28 14 38 53 -26 -110 8 82 31 -38 -16 -33 -2 52 1 124 10 -20 -95 -13 -8 57 18
2167 18 -24 32 28 54 -27 85 -52 -160 -43 88 103 41 -28 6 65 -63 -88 -81 -50 55 -37 23 63 -63 28 79 50 -115 96 -44 -8
1896hNjJ29o9J14j55o6N0O8j55O8P8j00KL4K5n7j5O0p7O4m7L1o3OP9%K8m7O1Q6Rr6l4Pm3n0
1572g9J3J00k8J4q0j6J21n9j19K35k15J24O0p6l2M5L6l0q3J06m8J20o5o4J5j56J47j9j6j1
1310f0M3M1K1P1k40N1J05L7o1k3j6L4J13J1j23P8j15n9L3l9Q9r2O5n4K85j16M3m9o7j5n0l5
1030i4N5O0j22N6K4k2K38q0j46J49k06O3J68j03O5j13l2Pk8RJ00m0j2o7Q2J0mN9K6j7k09M3
750h1L3P3l3j12K02j78J18j13P7K4j28J37l6l6L8R6po8K7rJ46k10J29m9J8J7k28R1Q5j2n9
478d8k0Q0l2O7j7k5R7r1m0P2j17K0j1Q9r0R3N9l4k01L9K17j39Rl6K6J2KK1N9j33J14n3ON0
181D5j13P3J13p5j05j1j6n9K10k2K2j19l9J96j31o2n2R9o4J16p4O5K7k8j4Kj34J03Q4j67J09
-90b1lM0j5r2O9m9k9j4K06k46J30K4l8P7K6o7
$$ plain form
1896 -8 -3 -4 125 56 170 15 -51 -1 67 -88 -20 58 -42 -40 -6 19 -38 -53 7 -70 -6 -53 -22 -85 -79 0 0 28 -19 42 128 137 41 7 14 -29 -79
1572 -79 -66 34 6 20 -60 -76 45 -14 -133 102 -113 11 71 -5 -37 8 44 14 -69 37 -11 109 44 -20 -5 -161 -14 -33 -49 -60
1310 -60 -17 24 45 116 -124 -73 32 69 8 -15 -31 3 116 127 4 82 -33 -92 -59 -98 -9 -101 -36 -90 195 79 122 73 6 -9 -59 -94
1030 -94 -39 21 -101 -45 -21 -43 195 115 -31 118 -88 -25 143 40 105 -8 -40 -33 -61 -52 48 8 -4 -71 11 21 17 76 102 85 -124 -81
750 -81 -48 25 -8 -120 82 -96 22 -91 -14 10 -118 19 -17 -53 -15 81 74 6 33 24 170 -40 89 40 58 75 -153 -62 23 11 -48
478 -48 -68 12 -20 47 30 5 102 11 -29 43 -74 -54 -65 24 -66 27 86 52 -149 -110 107 -32 -23 -59 -33 -21 -19 2 61 -72 42 -11 -5 45
181 45 -68 5 118 43 -62 -73 -89 -148 62 40 62 -57 -96 100 -31 -93 -145 -46 -110 6 -68 -3 24 -4 -18 -16 -150 -47 37 -130 -21
-90 -21 -24 16 1 -91 -22 -71 -100 -114 92 -154 -24 0 -38 39 65 -2
-230b
##PAGE=	F1=-14877.9
##FIRST=	23146.756194512010552,	4241.1435120000014649,	0
##DATA TABLE=	(F2++(Y..Y)), PROFILE
4241D7r6Q3m5k6N8p7L6P3l4L9j29M3j15L28j36j9Nn0J7M3n7K1l3Q8K2j04Q8k0r4M5K9p8k4
3952g2QJ55j40Ok7j8Q4n2P4n8L7r0p5J68j3L6j34J60J1or1j21J57pO7p1qm9M7J1L9k4r8J3
3655h1Q6l0J45j46M3r0J52n8m0M2n4O5K8M6q9o2KPn7Q2L0MQM9j78J37q9l4J6j05J48J06r5
3366a2O2k10K04P6j66L9q0J04J06o5j4R1p2P4k01Ml0OJ26mm7J33j02K2l7j32P4n0J23QJ0j09
3086f9J75Jm8N7n8P2j49q9kRJ00l9j35K11j11m9J54j48K03Q2q6k4L2l2j21M4p4l0O8R8K8j39
2806f9M3N6m8K5kRo2M4J7m4m7LJPK2J23o1kL2j7L3p3P4j6M2J5j05p8P1kj29KJ17J8lq9p1l4
2474a98K54r0n3j1O2rJ13p7K9Rq3R2p6K7N4M1j18o3P9J36j09p8L7L4J3J4j4R3j06j5p9K1N
2185f6Q9n8R7j6l9L1q5O7l5q7O1J04L3n2o2K9O4j21m6J7J9J26m4L0j0j15J30Om8j78K77j57
$$ plain form
4241 47 -49 34 -11 -37 21 -56 -20 53 19 58 -71 -28 -143 185 49 30 35 -15 2 45 -12 9 -24 64 86 -18 70 50 -44 1 30 -48 -72
3952 -72 -64 91 -49 -43 -70 -88 -4 -56 18 -40 -3 -93 -168 0 -13 23 -111 49 60 54 -37 -158 -1 -8 59 -12 -20 -69 -22 -11 28 4 -94 -81
3655 -81 5 -25 120 -26 17 -73 79 21 -19 23 -31 34 62 108 19 -43 -41 -34 -91 -9 21 25 33 82 -96 41 -48 -82 -66 -171 -23 83 -12
3366 -12 50 -160 44 120 -46 -7 -87 17 123 58 44 135 63 137 -64 -60 -90 -84 42 38 -9 124 22 44 7 -125 -51 -101 22 30 40 -69
3086 -69 106 107 59 116 58 130 -19 -108 -110 -101 -1 -40 -175 36 -75 -124 30 -118 85 167 81 57 89 57 -64 -20 -94 -124 -56 42 70 -69
2806 -69 -26 30 -18 7 5 14 -48 -4 13 -31 -78 -75 -74 -67 -45 78 17 15 47 30 63 -10 64 48 90 105 0 -78 -7 -9 -138 -136 -19 -1 -4 -93 -164 -198
2474 -198 56 -34 -87 -98 -36 -45 68 -9 20 29 -54 38 -38 -11 43 84 -34 -97 -18 118 9 -69 -32 2 15 29 15 108 2 -13 -92 -71 -66
2185 -66 23 -35 62 46 7 38 -47 20 -15 -102 -41 63 96 44 -18 11 75 -46 -92 -75 -56 70 26 56 46 -69 61 67 19 -159 118 -39
1905c9%J3M5R9m7Q1j62J4K2J2j33N5Q1p8K9pL7p9q3J53k6j7Nk6pJ0P0k5jl8Q0P1P6j46Mk9
1590A4n5k4j3J21p6%j5j7J20o1j18K07k28J54O4m2p9J10nj6p5O3nJ01q0o0Kj47J70n5L2m2
1310e5J6J05K1L5k24J8J47rn4l4P2qQ1J2j45Q2j06k8jm3J10n4K2l6K67j08M3p5l5p7J4m2P1
1021a8M3j45N3L0k6J90J4j45J15j38NJ79j05P7j20p0J9Kk1Q1l6Q6j32R6j9rM5J1M7k08M2J
741e6Q2j8p5J27j62J14p2M3L3j50Q5J6m0L5J25m1o9N1k9P9j42J29l6RJj66J06M3Mj15N3P0
461C4j2O0j5j4P2o8n7R8j34n7L4N7n9N7J23j05j57O2J96o1q3o7N1j9J3N1L9j22J21p8L4O2
181E6q4K0J06m6j23mon8J80k5j5m7o0J76j52Jo6J19n2J21p1%N2k0Jj2j03J31J7j20P4k1J7
-108a4L3q3k6l1J8k7J93j91J50mr4J06L1n4
$$ plain form
1905 -39 -39 -26 19 118 71 152 -10 4 26 38 -95 -40 41 -37 -8 -15 22 -57 -140 13 -13 -30 -25 -51 -58 -48 22 -3 -4 -42 38 109 185 39 43 14
1590 14 -41 -65 -78 43 -33 -33 -48 -65 55 -6 -124 83 -145 9 73 31 -48 62 57 41 -34 29 24 125 45 -15 -13 -160 10 -45 -13 -55
1310 -55 -39 66 87 122 -102 -84 63 54 0 -34 38 30 111 123 -22 60 -46 -74 -75 -118 -8 -62 -40 -76 191 83 126 51 16 -61 -47 -89 -18
1021 -18 25 -120 -67 -37 -63 127 141 -4 111 -27 -22 157 52 129 9 -61 -42 -40 -61 20 -16 70 -62 34 15 6 51 62 109 -99 -57 -56
741 -56 26 8 -67 60 -102 12 -60 -17 16 -134 -49 -33 -73 -38 87 46 -23 28 -1 78 -64 65 29 38 39 -127 -21 22 26 -89 -36 34
461 34 22 82 67 53 125 57 0 98 -36 -93 -59 -2 -61 -4 119 14 -143 -81 115 54 -29 -96 -45 -64 -51 0 39 -83 38 -40 -6 56
181 56 -28 -8 98 52 -71 -75 -81 -139 41 16 1 -46 -106 70 -82 -81 -147 -28 -80 41 -30 -30 22 2 3 -9 -112 19 36 -84 -10 -31 -14
-108 -14 19 -64 -90 -121 -103 -130 63 -128 22 18 -76 30 61 7
-230G
##PAGE=	F1=-14972.2
##FIRST=	23146.756194512010552,	4241.1435120000014649,	0
##DATA TABLE=	(F2++(Y..Y)), PROFILE
4241F2r2L0n3K6N6m4pR3o0O3q2q9l2L01j37j5L2n2L0Lj26J04l4P6N3j04O3o5o8R1O2j52jL4
3944c4J02j35K3ln2Q1RK6l3J3m8j28J70m8oj17K31N2k9j05j45K22n6O4m3l4oK0j7L8oj34P7
3655e1M4k5J56j36M0r5J08Kr9N6k8J33o2O3o6q1Ol7j0M5O2J4J7Jj04O9p0pj9p3J39J21j33
3366b0N6j56J75O8j82M4p1Q6Q7o9J5P9n4M5j45om4NJ28k5k9J44q3J0j1j68J15j30J64Mmj23
3086i5J44K0j2M1r2J43j39j16j6j1Q3K9j47K07j05j07J93p7J55O8o6m6L8j2j84N2n7k3O2J27
2824E7K7j60L4O5l8K0oN8j01L6K8j7j03K6j0PRJ14Lm7J5J3L0o1O6l3K7O9j20o5M6L2j74k6
2526a79J09K5Oj0j35L1K24r6l3l2J00j7R3j18N0Kr0J28j42N5P8L3j01n9MJ79j09r9L6Q0Jl6
2246b2K6Q8j03nn3m1jO7m5K48j31m9L7r0L6N0n1mP6J9l0k2J1M3r9l3L7JJ41j5l7rj13J65m0
$$ plain form
4241 62 -30 0 -53 -27 29 -15 -22 71 11 74 -8 -97 -129 172 35 20 52 0 30 33 -93 11 -23 53 106 2 65 0 -68 23 85 -67 -68 -34
3944 -34 68 -67 -44 -47 -99 -18 -9 17 -16 -3 -51 -179 -9 -57 -63 -180 51 103 74 -31 -176 46 -10 54 11 -23 -29 -9 -26 12 6 -128 -51
3655 -51 -7 -32 124 -12 28 -67 41 43 -56 0 -28 105 43 106 40 -41 -35 -72 -82 -37 25 39 56 57 -47 22 -48 -55 -74 -147 -8 113 -20
3366 -20 36 -120 55 123 -59 -15 -86 0 87 18 33 112 58 103 -42 -48 -92 -87 41 16 -13 131 48 58 47 -121 -6 -136 28 32 28 -95
3086 -95 49 69 57 98 6 149 10 -106 -122 -133 -50 -21 -168 39 -66 -173 20 -57 98 166 100 54 92 80 -104 -52 -109 -132 -70 57
2824 57 84 -76 -42 23 -15 5 -1 57 -44 -8 20 3 -100 -74 -84 -77 -68 46 49 2 17 30 60 -1 65 32 59 128 8 -57 -11 21 -153 -179
2526 -179 -70 -45 -39 -49 -184 -153 71 -25 -58 -90 10 -7 86 -32 18 20 -70 58 -84 -29 49 82 -19 -78 -74 105 -4 -103 -67 13 14 -22
2246 -22 4 92 -11 -16 -69 -110 -111 -44 -89 159 28 -21 16 -74 -38 12 -39 -43 33 52 22 0 11 54 -45 -78 -41 -40 101 86 49 40 -73 92 52
1940E2n5j85L21j41l9qJ03M0k0N3j54P2j5l7m1OP8o0L5m8N0o6j32K02K7q9L2n7N1ON5l8l8
1651d0QM7O6J26j86N7o3n1k2jJ08r5l2K8RP9l2j04J46j91J71K8j0j20J46mJ8o9K3J0Q8j13
1371B5m7K2j40J60p2P5p6j2J61OJ7j66l6J69m8o0l2J48l0L1K3j64O0n2j6l7m7J30Ml8pJ84
1091A35o0L6q6k0r3M2rM2L1j46M2N1m0J38P8j00M6o5n2J82j02Q4j00j06RK9m7P6k1J64j58
820b0N0Jk4K1j5J29j81J1j9P3j9j3K9j37J17k2LL5j29L4M4m3M0J09m9o6N4k2j5n4J05j9J8
531B6j9j03J07NL1j29Q9M8K3L4j9JM2n8n9J10j29r3M3K6j8J6J48j32j07P9J36Oj23j10N7k8
251a00RO5K6p2P5p6N7P3m7k7Q5k2q8J3j6p5J34j2o6L6q0J51j41Qn2J18l7J49p4o6M9JJ6k7
-47a3m3J44o8l3J2l0j0O1n5r9j1K9j7J82j22J31k6j48J26M4l8
$$ plain form
1940 52 -3 -188 133 -8 -47 -55 48 88 68 121 -33 39 24 -13 -54 -48 30 -30 5 -43 7 -59 -191 11 38 -51 -19 -76 -25 -19 36 -2 -40
1651 -40 -32 15 81 207 21 78 15 -36 -58 -59 49 -46 -78 -50 -41 38 6 -98 48 -143 28 56 46 -74 72 68 86 17 40 50 138 25
1371 25 -22 0 -140 20 -52 23 -53 -65 96 102 119 -47 -83 86 38 -22 -54 94 64 95 118 -46 14 -38 -54 -91 -138 -8 -4 -42 -49 135
1091 135 75 111 25 5 -88 -46 -55 -13 18 -128 -86 -35 -75 63 141 41 87 22 -30 152 50 134 34 -72 -63 -34 -81 -5 -26 138 -20
820 -20 30 31 7 28 13 142 -39 -28 -47 26 7 -6 23 -114 3 -19 -16 19 -110 -76 -32 -75 -35 74 25 -41 13 -9 -24 -78 27 8 26
531 26 7 -96 11 16 47 -82 7 55 78 112 93 94 136 78 19 129 0 -93 -50 -24 -42 -26 122 -10 -117 -38 98 104 -19 -129 -72 -100
251 -100 -91 -26 0 -72 3 -73 -16 57 10 -17 68 46 -42 -29 -45 -120 14 2 -64 -28 -108 43 -98 -90 -142 -24 -61 88 14 -52 -3 -2 14 -13
-47 -13 -56 88 20 -13 -1 -31 -41 20 -35 -134 -145 -116 -133 49 -73 58 32 -116 10 54 16
-230A6
##PAGE=	F1=-15066.6
##FIRST=	23146.756194512010552,	4241.1435120000014649,	0
##DATA TABLE=	(F2++(Y..Y)), PROFILE
4241F4r2kn2Q0M7k4n2R4o2P9k3k16N6K45j05%J4m0M2j6j76J42l5O3J09j02L1j20j7J38M2j70
3961e8L2PQ0j44P3ro4N0Q7l3j9qoj31J33q7j2j11K87O1m1q2j66K56r9P6l2p0O5k7m6M4oj42
3664a42J16J2j0J56j28M6j05O7L8j22O0mJ64j13N7k1j06K2q7M1oR0jM5o5j6%%J1n9m2Q4J52
3375A34j44J2p4J47L3j74L6n3N3P2r3J09L5o1ml6Jn7LQ4l6%J26k9k2L4j72J23k08J86J3m0
3095bq5P1N0L2oj04J89j02j33j5l5N4J04j44J93j03j51J84K1J05Pn7l4N8ok03N3m9oK6J50
2824F2K9j57J9O0Jjj6R2j49O0K2jj39O7m7K2J7N9P4j00j6Q0K2n0L3l7K5J09j32l7j1Q7j77
2535a30m6M8O0j9Q1j66P3J85q7j4n6R8j5P8j34O6k6p1J34j44O0Q3om0p9p8J87m3j26K0J09
2264Bro4N6J08j09lj8p7j7OOL44k36k0L0q9K3Q2k4l7O1k6QK1rJ5q8J3M9j4J46j0o2j7j08J66
$$ plain form
4241 64 -28 -30 -82 -2 45 21 -31 63 1 80 57 -159 -103 142 37 37 51 11 53 37 -139 3 -32 31 140 38 69 -51 -68 70 112 -58
3961 -58 -26 -19 61 -83 -10 -19 -83 -33 54 21 2 -6 -12 -143 -10 -97 -109 -220 67 128 87 5 -161 95 -4 72 40 -30 35 8 -38 6 0 -142
3664 -142 -26 -14 -24 132 4 50 -55 12 50 -72 -12 -16 148 35 92 71 -35 -13 -100 -59 -65 25 24 69 4 -12 -12 -12 -1 -60 -102 -18 134
3375 134 -10 2 -72 75 108 -66 -30 -83 -30 42 -51 58 93 32 28 -8 -7 -64 -61 23 -13 -13 113 84 62 96 -76 47 -161 25 38 -2
3095 -2 -87 -16 34 66 60 -44 145 43 -90 -105 -140 -86 18 -126 67 -36 -187 -3 18 123 130 73 39 97 91 -112 -59 -108 -114 -88 62
2824 62 91 -66 -47 13 14 13 -3 89 -60 0 22 21 -118 -51 -98 -76 -59 0 74 -26 -42 38 60 10 43 6 31 140 8 -29 -40 47 -130
2535 -130 -176 -128 -68 -87 -6 -172 -99 86 -1 -15 -71 27 12 90 -44 22 -4 -75 59 -85 -25 58 52 12 -67 -145 42 -1 -127 -107 2
2264 2 -7 -71 -15 93 -16 -19 -37 -114 -131 -125 -119 225 -11 -31 -1 -90 -67 15 -9 -46 15 -11 -3 18 9 24 -64 -51 -2 -16 130 120 58 41 -67 99
1948I9o0m5j83L21j00o1m0J56m5kN2j23P3l2p4Q0p0P6m7K3r3P9j4j52K00M7j24L0o5R1LM3
1668D3m3p7Q7k3P3J35k08R4q3j7l4N4M5p0p6M2N8QK0q8P3j28J55k9K0j31J40L1P1o9j6NP6
1380A38j54j8O0j26J23p9R7q8l2J93m4M1r3j04J76n5p1m9J92pl1N2j99M0J5l2l7n3J22O3p2
1108c2LQ5OK2p5k4o3K6M5j0K3j26L9O5n7Q9R8l8l6%q0J75r6Q4o3j32j5M1o8R5QJ83j59j3P2
802G2n7Mk5J79j40m3qK6j1M7m3j24J23K4m1M2r1J3L4m5O0N9l4m6K6mq0J7N0%M6k4q4J03j7
496HN0q5O6K7O1rk7OK9o2m9J26j29q6L0J7Qj8J32j10m3O8O0L4j04j35L4k1J3N6J1j1Mn2Q0
190b1Q6m0m4N1nk5M5m2j07J00Rj11R1q8J21j02m5j3R3k0J90p8r9K3K4J8k8J6J40j45M7m6k4
-99b9k7N7l2j03J4JOJ60o5Q9m4j75J26O1k6
$$ plain form
1948 99 39 -6 -189 132 32 -29 -69 87 42 40 92 -31 42 10 -64 16 -54 22 -25 -2 -95 -16 -30 -182 18 65 -59 -29 -94 -3 0 43
1668 43 0 -77 10 -13 60 195 -13 81 -2 -19 -53 1 46 -24 -100 -58 0 8 28 -60 13 -115 40 11 31 -100 40 71 142 73 57 62 138
1380 138 -16 -34 26 -100 23 -56 41 -47 -79 114 70 111 18 -86 90 35 -36 -85 107 100 69 121 -78 -38 -23 -55 -92 -145 -23 40 -32
1108 -32 -29 56 62 84 9 -15 -78 -52 -7 -17 6 -120 -81 -16 -73 16 114 76 40 40 -40 135 39 123 60 -72 -87 -46 -114 -19 -11 172 13 0 72
802 72 15 19 -6 173 33 -10 -18 8 -3 44 1 -123 0 24 -17 25 -66 -53 -19 -64 -4 55 21 -25 1 -3 -83 -66 -16 -16 30 6 -78 25 8
496 8 58 -27 39 66 127 118 91 97 126 64 15 141 12 -74 -44 -27 -19 -37 95 -15 -58 10 70 104 0 -135 -101 -122 -109 -53 -42 -53 -49 -101 -21
190 -21 65 25 -19 32 27 2 47 5 -102 -2 7 -104 -13 -101 20 -82 -127 -140 -47 -67 123 45 -54 -31 -7 11 -17 -1 139 -6 41 -5 -29
-99 -29 -56 1 -31 -134 -120 -119 -113 47 -18 71 27 -148 -22 39 13
-230A3
##PAGE=	F1=-15160.9
##FIRST=	23146.756194512010552,	4241.1435120000014649,	0
##DATA TABLE=	(F2++(Y..Y)), PROFILE
4241E1r1km4J28J1k1o6P1m9P9L4k91J20J79o4Rl5JM0rj85J13k1L8J63r1J7j68L3J68pj30M7
3952B8o6R7j49J36m2m7mJ50n5l6k6J4p6O8j03K0j34L03N2l7l8j81K35j11R9m1q5J32p3o1M9
3681A8k7j21J17j7J7J45j09M0j13M8M3j00K9L3J69j34M3K2j28M2j30Q0l4R5l4O2j10N5m3O5
3419B3K4q0j4RJ89j31m9j0J27j0j41K0l3J9N8j25K29j8q3n7P7K2o9JJ4l0L5P1N0o7P6j44J06
3130H9k45J71K8q5%k0P6N8o3q8K07o0j39Op0L8J59j20J76j08j74J42R9O1o8p1J6R7j9j66L4
2859c9o0J3j3J55J8j14PL8N5k0m6R4j67J11pqj38J10r9M6M0mJ10j27n9J61J1n1k3j4L7J12
2579A29j29mo6J29j31o7l1J02n0J35j50Q0J38n7Or2P2qO5j30R2n5m6J20j00N6N7o0L4j09j28
2307a98J58N7j43j0J22k4m4N8J38j16qKp9m0o7Q1L48k88L9lo4J2O3j1j9M4p3N9L8k5Jr3O0
$$ plain form
4241 51 -40 -42 -86 42 53 32 -34 37 -12 67 101 -190 -70 109 45 54 19 20 60 51 -134 -21 -42 -4 159 68 85 -83 -50 118 111 -19 28
3952 28 -38 59 -90 46 4 -43 -47 103 48 12 -14 0 -76 -8 -111 -91 -225 78 130 93 55 -126 109 -2 97 56 -29 103 30 -31 18
3681 18 -9 -130 -13 -30 -13 132 23 63 -50 -2 41 -59 -30 3 172 38 81 103 -25 17 -113 -33 -67 28 -6 56 -54 1 -42 23
3419 23 47 -33 -47 -38 151 20 -29 -39 88 78 -63 -43 -76 -57 1 -124 105 87 4 -53 24 46 -23 -22 -8 -38 -3 68 118 51 127 -17 89
3130 89 -156 15 43 -42 -42 -62 14 72 9 -79 128 68 -71 -65 -135 -97 62 -58 118 10 -164 -22 77 138 70 -1 15 112 93 -73 -39
2859 -39 -99 -86 -99 56 74 -40 -33 5 60 40 -6 88 -79 32 25 17 -121 -11 -110 -64 -24 -28 82 -45 -104 57 68 17 -6 -20 17 129
2579 129 0 -4 -70 59 -72 -139 -170 -68 -118 17 -133 -53 85 28 34 -58 14 6 71 -59 33 -22 -68 52 -48 8 65 5 39 -70 -198
2307 -198 -40 17 -126 -136 -14 -38 -82 -24 114 -2 -10 -8 -87 -127 -194 -113 235 -53 -14 -17 -81 -69 -6 -17 -36 8 -65 -6 32 7 8 -85 -25
2019b5M1j6J28qk7m9r4J25l7j0j89K74n1o0o0J88j32jP2o8J7j7r1J64j45P9k7rj24J18N7j45
1738a22J65K0j18J1o0J05MM2m0j17J75r8Q4J01k10R7r2M5l2J24n5j7j08L9J06o1O6q3J6o2
1476g5J01p3M0j06J14O6J15p2m7%N6j90L2P8q9P7q1Q9o6m5J91j15R6k1j64J76m6p5q8J97N1
1205A26r2Q9k47M3O4n9Qn6P1J01n4k2J1P0Ln0l2j8pQ0m5J0r5M9N9o1M2P9K2j08M3p0J66q6
907C4O8k4j50l5M0p1J24K9J44j40n6J54j00J2j4J68r1r7K2m3J8P6o0j24J25N3q7O4o0J9Nn5
627e2Q5Pj1rk2Kq1N6l4K4P4Kj27J07j7M8j1KK8Q3n8l7qL9o4k8J45j43o4K0K4J3k8R7o2K9K6
303E5rK5o4j13roL6K4rK9n5rJ01Q6o9k7J6J3J8Q6o5j48Q6L0j28J02q4R2m9j13K1N0lK20p4
-3E6r8J1L2%j4M8J28j92R6r7jk8K3k9k8L6m1K5J16l3M9n1j69J04P9k3
$$ plain form
2019 -25 16 0 128 120 93 44 -50 75 38 28 -161 113 62 2 -58 130 -2 -3 69 1 18 1 -90 74 -71 8 -19 -28 -152 -34 23 -122
1738 -122 43 63 -55 -44 -104 1 5 47 7 -110 65 -33 51 152 -58 39 -53 -8 -40 84 29 12 -96 -57 49 -12 54 -29 -13 -75
1476 -75 26 -47 -7 -113 1 67 182 110 63 63 119 -71 -39 39 -50 27 -54 35 -31 -76 115 0 96 75 -89 87 41 -34 -122 75 126
1205 126 34 123 -124 -81 -17 -76 -68 -124 -53 48 -6 -28 -17 53 56 6 -26 -44 -51 29 -16 -6 -101 -52 7 -54 -12 67 89 -19 24 -46 120 34
907 34 102 78 -72 -107 -67 -138 -14 15 159 19 -37 117 17 29 15 183 92 -5 17 -26 -8 68 8 -116 9 62 -25 39 -21 -2 3 -52
627 -52 33 40 29 20 -2 0 -81 -25 -59 -35 39 41 -86 21 4 52 41 43 71 154 96 59 51 90 26 -2 143 0 -64 -44 -20 -7 -35 62 0 29 55
303 55 46 71 7 -106 -115 -121 -85 -61 -70 -41 -96 -105 -4 82 13 -14 2 15 33 119 54 -94 -8 22 -106 -4 -88 4 -45 -158 -137 -87 -90 130 56
-3 56 -42 -31 1 1 -13 35 163 -29 67 -30 -31 -59 -36 -65 -93 -57 -98 -73 43 10 59 8 -161 -57 22 -1
-230a
##PAGE=	F1=-15255.3
##FIRST=	23146.756194512010552,	4241.1435120000014649,	0
##DATA TABLE=	(F2++(Y..Y)), PROFILE
4241C5q2K4m2J61n0l4l8M1l6O0P3k95J39J18l0%p0M5K5J3j56M2K5pJ80o0J9j92P4J63n1o1
3961C3M1j51J22j31J84p7j5n5J65k2q4l0LRnp8P2j89K71N4l0Jj73J64q4J07m9o8J69j10m7
3690cM9o4p9Q1m6N0J18o4Oj04M4L2m2m0Q9J57j38L0M5j38O0j52Q7j6P7p4N8j14R2m8P9L1p2
3401iRm9K06r5r1JJ06m1q5kj9OK7j31L09n4j07q6J44N4q3j0m4%N8pJ37j22R3r4R1k25J11L8
3104C6j14R6r1Q0N2j03n1K11l0j50M1j07N4J68q2J51j04j79R3J21L0j07j07P2J50m6q1pq3
2850h7K1l0J40k0k8nJ3R4k6p9P2j45J58m6k8j12J42j52O5O8l8J01j19r4K12on6p6J9N7P5r3
2570cJ5r2J33o2q2q1J15n1J34j10O0Q5oJ4j31O0rM0j05J22n5m6J03o1P0Qj03P8j20j23J04
2299i9J40j37m6J26n0J8K9J55j11k0J2o4o4j21J56K76k75R2n0j1j4K5nL0J0r1J07J9l1Or6
$$ plain form
4241 35 -47 -23 -65 96 46 12 -26 15 -21 39 112 -183 -44 74 44 44 -26 19 44 57 -99 -57 -32 -39 141 81 100 -92 -18 145 94 33
3961 33 74 -77 45 -86 98 21 6 -49 116 94 10 -20 -17 -8 -13 -91 -19 -208 63 117 87 88 -85 79 -5 102 53 -15 154 44 -3
3690 -3 46 -18 -97 -16 -62 -12 106 42 48 -56 -12 20 -22 -62 27 184 46 76 121 -17 43 -109 -22 -38 39 -35 23 -91 1 -47 32 63 -9
3401 -9 0 -49 157 62 -29 -28 78 37 -48 -50 -69 -63 -36 -167 142 88 -19 -105 39 93 10 0 -44 -44 14 7 144 22 115 21 112 -113 -2 36
3104 36 -78 18 -73 7 59 -44 -95 116 86 -64 -23 -130 -76 92 10 161 57 -122 -29 92 122 15 -92 -20 130 84 3 -4 -87
2850 -87 -66 -96 44 24 -4 -9 4 98 72 -7 65 -80 78 32 4 -108 34 -118 -53 15 -23 78 -41 -135 77 71 15 -61 -42 15 90 -3
2570 -3 12 -80 53 -9 -91 -172 -57 -108 26 -84 -24 61 55 69 -62 -2 -11 29 -76 46 -9 -55 48 -13 57 65 -38 40 -80 -203 -99
2299 -99 41 -96 -142 -16 -66 -48 -19 136 25 5 17 -47 -111 -232 -76 200 -75 17 -33 -44 -58 -33 -38 -8 2 -89 18 37 6 12 -84
2027h4P1K0mP5J9J6p1p3O4K3M3k16J96k2k7n8J86j81k3Q9Oo9K0q3J67j86R2Kn2j28J47J19
1747G8j21J19k8r5Jn3R9MN3l4j54K31j30P4M4j91P1r6J10JJ68j51L4j14L8J25r7Q8r8j1jK7
1467iq2L4m4R2O8J20p0n8J0K8k14R6N5l3L4p1O2k5n5J57j76J51M1j94J88o5o4j30J79J10j39
1196dJ09k83O7Q8p3P2n0mJ01Jp0k2J22k0k9k1Mj9O8m0j7o1O1L9l8oM1P4j64O6l9J62p2L7J
890H1j62m1L8n1J43K5P7r9p0J97j34M6RJ01l5j24M0j01N2O7k9j17J18N5j28R5l3K1qq9J04
618D8k1J1K7o7nm3Q7j28N3P4N4k08J19J2K1M2n1N4P8j00m7l3N7m8JJ51j55o1K7L1QnO6l1R6
312A14k4o4Km3m2n1J4O8k5j9L1p6M4J03O7j07LoL5J1J19o6j83Q6M0j10P8p1P2Jj47L2mRK17
6A08n9r0M1K8l0JN1J15j92J04j44L4j8l0m2R3L6o1L2N1k3K7l6j46P2R4l5
$$ plain form
2027 -84 -13 7 3 78 97 113 42 -31 33 56 99 -117 79 57 30 -28 158 -23 -46 43 49 -20 0 -83 84 -102 -10 -8 -60 -188 -41 78
1747 78 -43 76 48 -47 -46 -99 0 4 57 23 -131 100 -30 44 88 -103 -32 -128 -18 -17 151 0 34 -80 -42 83 -14 74 -24 -35 -36 -9
1467 -9 -91 -57 -101 -9 59 179 109 51 61 89 -125 -29 26 -7 27 -44 18 -7 -62 95 -81 70 111 -83 105 40 -24 -154 25 135 -4
1196 -4 105 -178 -111 -23 -96 -24 -74 -78 23 24 -46 -68 54 34 5 -16 -12 -31 37 -3 -20 -81 -20 19 -19 -25 16 90 -74 -8 -47 115 43 80 81
890 81 -81 -122 -84 -135 8 33 110 11 -59 138 4 50 59 160 125 1 41 -60 -8 59 30 -87 31 86 -42 53 20 41 33 -56 48
618 48 27 38 65 -2 -7 -50 37 -91 -38 36 90 -118 1 13 34 76 25 79 157 57 10 -23 34 -14 -13 138 -17 -78 -51 -20 -12 -17 49 18 114
312 114 90 26 28 -15 -57 -108 -94 -26 -51 -70 -39 -115 -71 32 99 -8 -5 -11 24 35 154 88 -95 -9 31 -79 -1 -72 0 1 -146 -114 -118 -109 108
6 108 49 -41 0 28 -2 -1 50 165 -27 77 -67 -33 -51 -81 -123 -30 6 -55 -23 28 5 32 -4 -150 -78 16 -19
-230a9
##PAGE=	F1=-15349.6
##FIRST=	23146.756194512010552,	4241.1435120000014649,	0
##DATA TABLE=	(F2++(Y..Y)), PROFILE
4241B3n7N7n3J71j17m5JL9l5L3P9k43J15O7nk4o6N8J6K6j12k4R9n6J42j7L2j88J07J16o6J0
3961H3J1k04J25q9K01r8J3o5J19L9j37j1k3O4n6k4J23k51K04P6l7K7j43P6k6P2k0l7J66j37
3699D1oM3j02l2K7p0P3Q0jn2o4L6K2K5j19J49J31j29J3M8j33O9j41O2L0N9j10M5q5R2k3L6
3419A4K6m2J9o1J85m2r0m1P5n4j3k6j9K2k0r9L04n4j29n6J33Q1q7l5n9L5O3q1K14j82Q3m1
3139B3R9j69J9M2j16J60j12N8J5j06j4K18j3j78P1j31J04J33n4J21q6j66N5Q6J5p8j45Q1K05
2885A37o8J7o0j01J1k2J10p4Q1j8JR7k2q8M9j03J70p5m9q0J55j79N7R8l3O4r9j06K14k9n7
2614bq3K6P8J6l0J7r2J06pr0o0P8j7Q8o6K7L5M9j0j45Q2k3Jn8J33j0r1R3n8J06m1j15P2r7
2316h8p1M8J64j06o4J17p9Q1j4J47q9l3K8n2p5j50K10J75k18J12r1N8o0lNP4m0p1J38j9k9
$$ plain form
4241 23 -34 23 -30 141 24 -21 -20 19 -16 17 96 -147 -32 35 30 6 -60 -2 14 40 -72 -96 3 -53 89 72 104 -84 23 139 73 83
3961 83 94 -110 15 -74 127 29 42 -23 96 135 -2 -13 -36 28 -28 -52 71 -180 24 100 63 90 -53 23 -3 69 49 12 178 41
3699 41 35 78 -24 -56 -29 -99 -26 54 53 1 -63 -27 -5 20 -99 50 181 52 65 113 -20 49 -92 -30 0 59 -51 -6 -91 1 -22 14
3419 14 40 -2 17 -44 141 99 9 -32 43 -11 -24 -50 -69 -47 -67 -166 138 84 -45 -101 32 113 26 -9 -68 -33 30 -51 163 -19 64 23
3139 23 122 -47 -28 14 -102 58 -54 4 19 -87 -101 117 104 -74 -3 -134 -30 103 49 170 84 -82 -27 59 74 -4 -149 -68 137
2885 137 69 86 26 -75 -64 -86 24 -50 31 13 14 111 89 1 50 -53 117 42 -7 -87 68 -111 -54 44 11 75 -24 -130 84 55 -2
2614 -2 -85 -59 19 35 5 22 -70 36 29 -61 -121 -43 -60 28 -38 -11 24 73 63 -82 0 -23 -22 -80 53 43 -48 45 -13 93 52 -63 9 -88
2316 -88 -159 -111 53 -53 -117 0 -79 2 -12 135 46 13 41 -11 -86 -236 -26 149 -69 43 -48 10 -50 -53 -48 26 -14 -85 53 34 5
2045EK0q1L5jK1nP3L1o4o2K5R0Q9k54J13k2K7l8J50j62n8P3P7j35M6n2J01j76J07L3r5j00
1765a89J43J51q6O9n3q3K0n2P7J1O6k4j86K28r2L0j0j59M2r7J52M7J67k04N2q9M4J11q9P9
1502G6j26j1N5l8o1KL9P5L8P7n7m2L1Pk23J53lK1rk5K4J1o2J07j96J72Q6j85K18j27n3j42
1222a68J58J43j66Q7k78R5J05o2J10l4o6P5M8j14k5J51m1k4J1lkJ6lm4m0O2K0Om2PJ07j98
942a09O9nJ62n7%Qj57m6M5j1J44j2K6m0p1J80j39Q1J7K5K1j11K2j15O4M2J0q2J00L5j61J25
662F0mlJ8j49J04j5L2L0p9j8j0J39k04P0L6J12k81J35N5j2M4n7Q7N1j23n2n5O5j4L5J25j47
382b5p8M1K3J3M0M6m3J36m2j05j1n1M8q1L7Q5o9mjn9R4P3L5j22K3j8O5l2J31m3j90P1M3p6
85d6N2n6N8L5j24J8n4J1J79l9r8J06K1o3LN0J11j60Q5j82O8jq2o1J92K2m6J9j8k7L4Lj31M2
$$ plain form
2045 5 25 -56 -21 -22 -1 -6 67 98 34 -28 -3 87 176 -78 35 13 40 2 152 -10 -68 5 82 -53 -7 -59 42 -134 -27 6 -89 -189
1765 -189 -46 105 19 88 35 -48 -28 -80 -3 8 74 50 -136 92 0 30 20 -139 -97 -194 -42 5 172 -32 20 -69 -25 86 -3 76
1502 76 -50 -61 -6 -44 -105 -103 -64 11 49 126 69 27 58 65 -158 -5 -8 13 4 -21 3 14 -48 59 -137 35 121 -64 154 27 -26 -168
1222 -168 -10 133 -33 54 -224 -129 -24 -86 24 -10 -76 -1 47 -67 -92 59 18 -6 5 2 0 16 13 -31 -71 -9 11 17 -25 -18 89 -109
942 -109 -40 -45 117 60 60 68 -89 -135 -90 -101 43 31 57 17 -54 126 -13 68 85 110 131 20 42 -73 -9 33 43 -39 61 96 -65 60
662 60 56 53 71 -78 26 11 43 73 -6 -24 -34 105 -99 -29 7 119 -162 -27 28 16 60 3 90 141 18 -34 -89 -24 -38 -3 122 -25
382 -25 -103 -62 -39 -26 14 60 17 153 111 6 -5 -56 -8 -89 -52 33 -36 -40 -41 -100 -6 67 102 -20 3 -15 50 18 149 106 -84 -13 30 -46
85 -46 6 -50 8 43 -81 -63 -117 -106 73 34 -64 42 63 0 3 53 164 4 89 -93 -25 -26 -108 -169 23 45 -1 18 0 -27 7 10 -121 -79
-213g9J07n2
$$ plain form
-213 -79 28 -24
-230b4
##PAGE=	F1=-15444
##FIRST=	23146.756194512010552,	4241.1435120000014649,	0
##DATA TABLE=	(F2++(Y..Y)), PROFILE
4241A7k4Q3o8J52j66m1K1P4m5J2M6j52N6L0J3m3l1K1L1J8p4n3J72q4O6J4N1j61J32L7m6N8
3961A16l4j94R0l7J95j08J9j8L0Q1j59K8l8N2p3L6J51k84J32J01o2M1r9J2L3oN4j7J33j49
3699B6N0K6j23Mk4q2P7L9N5j09PNK3P9j70J87Q3r7j8L5j05O6j01K1P2N8j36L7m4P0J1l4Nq
3401a5J0l0J29K4n0j04L5n3N4m4l2N0n7n1K24k0j46K9O2Q2p3o5l3N2N5j26K59k28O2%J23j15
3121Ho6M4r7J66q2K7l9o7LK28%k11P2j28J58Q2n1R9p1j27L1K1J4Jj49K2K31p2R6r4j11k1k
2832h5Q1j22J79k4MO8k5n1L4p2J38q7n2n4J49j63K3J13lK0r1r1J82n4m7k9rR4l7L1Op9P2J1
2535C0r6L4NK1L6l3LkP3o2j12J26m7l9MJ05P0j63Q4q8J44o7q5K1n0lLJ31o2n2R7r8J08m8J14
2229A02n7m3O5n3o8j52K20R1j50R5j02J20j16qQR7q7k9J44n5j7K4m0l1j0M6q8J36K3n1o1L0
$$ plain form
4241 17 -7 76 8 160 -6 -47 -26 48 3 15 61 -91 -35 -5 8 -35 -66 -45 -14 4 -70 -123 49 -35 31 45 96 -65 67 104 58 116
3961 116 82 -112 -22 -59 136 28 47 29 59 140 -19 9 -29 23 -50 -14 137 -147 -15 86 24 65 -34 -22 11 5 59 42 175 26
3699 26 76 102 -21 -17 -41 -123 -46 -7 48 -61 -54 -49 -26 53 -117 70 153 56 38 73 -32 34 -67 -46 26 84 -52 -15 -59 11 22 -12 -7 -15
3401 -15 -5 -35 94 118 68 -36 -1 -54 0 -44 -76 -26 -83 -134 90 70 -76 -47 15 97 24 -41 -74 -22 33 -93 166 -62 0 0 123 8
3121 8 -58 -14 -111 55 -27 0 -39 -106 -103 125 125 -86 -14 -142 16 98 47 146 75 -52 -21 0 14 15 -134 -112 119 47 143 49 -62 -83 -85
2832 -85 -4 -126 53 29 33 101 76 25 59 -13 125 38 -14 -68 81 -82 -59 54 51 71 -20 -111 71 17 -30 -59 -68 26 -11 20 26 -53 19 30
2535 30 -66 -32 -27 -6 30 -3 0 -2 71 9 -103 23 -24 -63 -59 46 116 -47 37 -51 93 26 -59 -38 -88 -91 -88 43 -19 -71 26 -72 36 -12 102
2229 102 45 2 67 14 -54 -206 14 105 -45 50 -52 68 -48 -56 -48 49 -38 -67 77 22 5 29 -11 -42 -52 -6 -94 42 65 14 -47 -17
1948a7J34R8k73M7m5Q7j2Q8q3q8J7J21j38M2k2J8j27J19N5j30n4J01J57m8J5k8r7P0o0M4L4
1677B5O9j8k02J72%m2l3j31M3j01J56Q3J25j96K9m5M3P9m6N3j48j1J10o8m7l0J28M3rJ4l4
1406A1qN2Jk15J78o2M9n6N8j4L1o4O2j71J50J07j60K65k03n4j17J50J41j73K4k23J03J38l7
1152c7R6j5q5M2N0j29pJ49o0l3M8j2K0m4L3n3l8N7QM7n0j2J06j98O0J4J55m8k8Oj21o2O0L1
855e0J30n7PJ6p3J19j15Q9Pj4O2q0j3q8L7L8J7k2Q1Lj79J43L0n2P6k15Q9ON3j5m3k0j8K08
557A57k31N5k1J49l06J40Q8k4Qj8R7K3j29n3n0N4K0O1O7j11r2M7PK2Q9K4r5J49j4j26jo7J05
268B4r8N6Q1q3K8n0k0J27J0J5j11L5l6R3o7J21j5j58K9M6m9M8m7M9M0o3lr0LJ24k5j11J65
-20F8J9q5pO3J16j29N7j91Q5K6j14q3K25Rpk0n8m1O4O2j37J7J12n4
$$ plain form
1948 -17 117 215 -58 -11 -56 31 19 107 24 -64 -47 74 -64 -22 -44 -26 -153 -34 21 -109 -163 -62 95 47 62 34 -63 7 -53 -9 25
1677 25 94 76 -126 46 46 4 -29 -160 -117 -218 -62 21 146 -50 -21 -66 -23 56 10 63 -85 -96 14 -54 -101 -131 -3 40 31 45 11
1406 11 3 55 56 -159 19 -43 6 -50 8 -6 25 -39 23 -148 2 109 -51 214 11 -43 -160 -10 131 -42 -18 -241 -138 0 -37
1152 -37 59 44 -41 1 51 -78 -85 64 4 -29 19 7 27 -17 16 -37 -75 -18 -10 37 -13 -25 81 -117 -57 -43 112 64 36 42 -79 -141 -81 -50
855 -50 80 23 30 46 -27 92 -23 66 73 59 121 41 28 -60 -23 15 32 10 91 94 -85 58 88 36 112 -103 -14 -8 45 30 -13 -33 -51 157
557 157 -74 -19 -40 109 -197 -57 31 7 15 -3 94 117 -12 -65 -115 -61 -41 20 87 -24 -116 -69 -62 -40 49 73 -22 127 113 -13 -14 -81 24
268 24 -74 -18 63 -20 8 -42 -62 65 75 90 -21 14 -22 71 4 125 110 -48 -19 27 -22 26 -21 28 68 5 2 -88 -85 39 14 -97 68
-20 68 87 2 -5 58 174 45 102 -89 -4 22 -92 -175 50 59 52 32 -26 -67 -3 59 -78 -61 51 -3
-230c
##PAGE=	F1=-15538.3
##FIRST=	23146.756194512010552,	4241.1435120000014649,	0
##DATA TABLE=	(F2++(Y..Y)), PROFILE
4241A2LR8p0J05j87j0LJ24n6Rj5m0j5JL6n4kl3O3mm8n1K05p0rJ7P1j16J33n2NQ0r2j22K9P
3926d5J87j32J3N8o0Q2j29O6l0j8n9Q1J37k57P7J10r2M7n9j0P6j07J46j7Q7j37R4Kj14J4n2
3655d1p9O2KQ5j39R1m9L5R7j65J89J3l7o2J0n8N4m9mP7P4j51M1j9N0M1j00k9J5j4K2O1R5o
3357A12j41lm0Q6m4n5O3m7l1J23K8j54J30k5N0m7o8jL5N3j31K49k36M5K0J43q3j10M4p5J26
3086A6k7J1r3moK24J4k20M1r7J83L5o4J01q8o0K6m3J8Q4j04p4J98n0J33q3j16o7J1N6j28K21
2806D8pJ3L4m8J8K4p1Q0q4l3k3J26j10j5R7J9j9q8o3J52p3l5N3o1R5n5M9No3M4mj08J66o8
2509eK4J6qj1k0M7j12m2J53o3n7N8M5J46k11O8j23J53o4k6n2JN1l6P8j5j9P2r8R1n9O9l5l8
2211b2J15n6n3j33J81M1r5N6p5J57j65OnR7j03LJ31p3MPJ2r0LN1j44J75J2o0n9P8J35N9k46
$$ plain form
4241 12 15 113 43 148 -39 -49 -46 78 22 31 16 -24 -39 -38 -2 -56 -58 -91 -28 -32 -80 -131 74 4 -5 12 83 -33 100 48 53 133 41 -81 -52 -45
3926 -45 142 10 23 81 21 103 -26 40 10 -8 -67 14 151 -106 -29 81 -11 36 -23 -33 43 -64 82 65 152 15 109 111 -3 11 -41
3655 -41 -120 -58 -56 29 -110 -19 -68 -33 64 -101 88 101 64 2 12 -46 8 -41 -45 32 106 -45 -4 -23 27 68 -32 -61 -46 -60 -38 23 118 112
3357 112 -29 -32 -72 14 -30 -85 -22 -69 -100 23 51 -103 27 2 52 5 -63 -64 -29 24 -107 142 -94 -49 -29 114 31 -79 -35 -110 16
3086 16 -11 0 -93 -97 -103 121 135 -85 -44 -141 42 77 13 114 26 -34 -8 -51 -33 51 -53 -127 71 21 154 71 -45 -112 -101 -45 -173 48
2806 48 41 54 88 40 58 82 11 91 7 -26 -49 77 -33 -48 49 68 49 -39 -102 50 -23 -58 -5 -66 29 -26 23 28 -35 9 5 -103 63 -5
2509 -5 19 35 27 16 -4 43 -69 -111 42 -21 -78 -20 25 171 -40 28 -95 58 -6 -32 -84 -83 -32 -68 10 -5 -24 48 -50 41 -18 51 16 -22
2211 -22 93 37 -16 -149 32 73 -22 34 -41 116 -49 -43 -48 49 -54 -51 80 7 11 18 30 -60 -57 -6 -150 25 37 -23 -82 -4 131 190 -56
1922e6Mp0J40PK1J0j03m8J20p6J4rl9o6J24N9j50j3M1J48j9l0L8j32J31p1oQ9M9k3j91R5J01
1633H9j14j7j20Q0j11J34R1N9j45pMJ2M5J7L4j53k5J54n7o8m2K05j4n2j5k0K5N8Rj92J64q7
1353e9M0j02J57n4M1n2L9j25J03R9j49L10k42p1o6J53J10j59o0j35Q9J82k0M3%o5L1Lj17K7
1091d9J13q0l7O3J1K0r2N0l4n6O4oO5k8qN6j49L9J8J28n0l7J0n0r1P0O2J00p8J3M3p9O1q1
793a9N9j4JP2n2k8n7j0O5j4M1P0l1j78J49N7r4J25k53O7L0N9q9K7pn6K57k01Ko5J55k71J27
505g6R0j2j4K1P3J0j26n0j5L5L4O4Jn9q0L9jK1J18j5j47J44M1j14K9p6J02j14P2O3n6N9j00
216c9J7J37o0J9r5N6p6J10o1J06j3r8k1N3m5O7m8M7J3mrj09j2P6j7j04J77K4r6j9R1J20j18
-73F9L3j60Q1O4j18j09J88J8L4q7n0n7R2J23j45j1J04l2
$$ plain form
1922 -56 -52 -122 18 25 46 56 -47 -95 25 -51 -37 -46 -85 -151 -27 32 -118 -131 -90 58 39 9 47 -85 46 -25 -31 58 107 84 -107 -12 89
1633 89 -25 -42 -162 -82 -193 -59 32 91 -54 -61 -57 -45 0 17 51 -102 -127 27 -30 -98 -140 65 51 -1 -16 -36 -11 47 56 -136 28 -59
1353 -59 -19 -121 36 -18 23 -29 10 -115 -12 87 -62 248 6 -65 -131 22 132 -27 -87 -222 -133 49 29 72 72 7 38 41 -76 -49
1091 -49 64 -16 -53 10 21 41 -51 -1 -35 -91 -27 -33 32 4 -4 52 -97 -58 -40 88 38 1 11 -39 -130 -60 2 102 24 37 80 1 62 -19
793 -19 40 26 27 99 47 19 -38 -48 17 3 44 114 83 -95 54 111 17 142 -111 -44 -14 45 -44 -17 -24 -80 177 -24 -22 -87 68 -203 -76
505 -76 14 2 -12 9 82 92 -34 -84 -99 -64 -30 34 35 -24 -104 -65 -66 -45 73 58 -89 55 96 -18 11 -65 37 -77 -5 58 2 61 -39
216 -39 -22 115 55 74 -21 35 -41 69 8 114 101 3 -18 35 -10 57 9 56 69 65 56 -53 -65 11 -6 -110 67 91 -5 -24 67 187 69
-73 69 102 -58 23 87 -31 -140 48 66 100 13 -37 -94 -2 121 -24 -35 69 37
-230C7
##PAGE=	F1=-15632.7
##FIRST=	23146.756194512010552,	4241.1435120000014649,	0
##DATA TABLE=	(F2++(Y..Y)), PROFILE
4241EJ4J01n3M6j83L4l1J48n8K5q0P1p2k2O8n9j6n7R4k2k9m2J83k3n0JP6o4J08j20O2Q6j50
3952ik0l5K9J91j81J5J12j13N3n6Q0Jj00l9J08Q1j70M4R7j08M2l4QR0k04K16j8L7r9J05j6
3681A07q2%n1o2L4k1Q4j29J48j03N3O9j08J59n6M2r7l2nM0j5J3L5R5j51M0qM0O0j45n9K4l6
3392a17O0J5J54Mj23k3k7P4k1q0M5J6o3N9O3j43J88q8Nk9k5J1mO2j07J84j96L6J9J41o8j06
3112h4M5o7P6J7K3j27N0k5J89J8j85Nn8J65jo9J24j43K7L1q3K4J15j7j52J08pJ23k5j14j14
2841a31NL9q7J90L9J2J9q6Q5J2r0K1p9%L1R1n4k3N0Mn8o1l3J40q6k9J10q0P5k5J3J8m6K1l1
2535b4j29K80j11mK9K0k0k8j2j33L4J33o0m3Q0j2J78j84L9j43J20m6L8j12L8P6p9M9J8ON9
2264E7q4N7m4J8k9j4J47n1m1q7R7K3o4J9k3J65j97L4l0Q2q2%J14p8M0k9N4j16M1J5j56J73
$$ plain form
4241 5 19 120 67 113 -70 -36 -67 81 23 48 -32 39 -33 -55 13 -46 -62 -119 -25 -47 -76 -118 65 42 -8 -7 69 5 113 -7 55 141 -9
3952 -9 -29 -64 -35 156 -25 -10 102 -11 42 -14 66 67 -33 -72 36 117 -53 -9 88 -20 22 -12 -4 86 -118 98 80 117 18 123 107
3681 107 25 25 -26 -88 -54 -75 9 -120 28 -75 -22 47 -61 98 42 84 -13 -45 -50 -10 -25 -12 23 118 -33 7 -1 39 99 -46 -105 -81 -117
3392 -117 -57 -42 112 116 -7 -30 -57 17 -4 -84 -39 -23 -86 -27 36 -107 81 -7 -2 -31 -56 -45 -49 13 -94 90 -106 -70 -51 90 22 -84
3112 -84 -39 -106 -30 -13 10 -117 -67 -92 97 115 -70 -65 -123 42 41 -28 96 -47 -20 11 -72 -48 67 50 -102 6 -1 122 97 -17 -131
2841 -131 -126 -87 -174 16 55 67 86 0 85 97 7 28 -51 -51 -20 71 17 -6 44 48 -10 -71 -104 36 -50 -79 31 -49 26 1 14 32 -14 7 -24
2535 -24 -153 127 16 12 41 61 41 13 1 -132 -98 35 -25 -68 12 0 178 -6 33 -110 10 -36 2 -110 -72 4 -75 -26 -8 -2 57
2264 57 -27 30 -14 4 -25 -39 108 57 16 -71 26 49 -15 4 -19 146 -51 -17 -47 35 -47 -47 67 -11 29 0 54 -62 -21 -6 -162 11
1983A1Pr3l4J28J01qj69j6q1J75Rl4O7r6q2P9J3j2j5n7k3J18M8j50NjJ24km8J00j59J65p3
1695co7J67J3m5j49K5J69j58L5j30J32j30J07Q0j3q5j9L4m1J6Q2L6j44m7J69k0j19k6K50q3
1432C6p2Qk3L5N0J9j65J19o3J7j29K16p8M6k3L6q2N3O6j61L28k13r5qJ51O2j26j33m3O0K16
1161A04k3j9J0l0M2n6r6P2N9j07k3N2O5j0j15M6Qq9R6l4N3J7J1l0n4PJ2P6n7l0K0M5j19O5
863c2P9N4o6L0K8q2L8o1Rk5M7M4l8Nn8m6J00n5Q5O3n6j57J44P3j08J27k35M8N1L4j54J01R
575dr0K50j25p0p0J29j97J05O0JPM0J9K0j28m7L8K4K7L9n0qm3K3J3qJ22o5j58J26Q4n8O2q7
277a9M5j21R1M1lO2j36M8J22j07M2r3J00j37J04j1J01n3l1m8N9o4R6n7N3l2K1lj10k5N0lp1
-12h9J38K8r7j3J06J09j21K3j05O7J00j02j35J22M9N9j65%o6R4J62j34l9Q0Q
$$ plain form
1983 11 18 -75 -109 19 120 112 -57 -73 -154 21 30 -4 63 -33 -115 -36 -23 -35 -50 -107 -130 -12 36 -114 -109 -110 14 12 -36 64 -95 70 -3
1695 -3 -70 97 110 65 -84 -59 110 -48 -13 -143 -11 -141 -34 46 33 -52 -71 -37 -78 -62 20 56 -88 -135 34 14 -105 -131 119 36
1432 36 -36 -28 -51 -16 34 53 -112 7 -56 -39 -168 48 -30 16 -7 29 -53 0 66 -95 233 20 -75 -83 68 130 4 -129 -172 -112 104
1161 104 81 62 72 42 84 28 -68 4 63 -44 -67 -15 50 40 -75 -29 -21 -110 -14 -48 5 22 33 3 -51 -44 -32 44 -13 -43 -23 22 -97 -32
863 -32 47 101 35 65 93 11 49 -12 -3 -28 19 63 25 30 -28 -74 26 -29 56 119 63 -94 50 123 15 142 -93 -45 6 40 -114 -13 -4
575 -4 -94 156 31 -39 -109 20 -177 -72 -12 -11 -4 36 55 75 -53 -100 -62 -38 -11 28 -22 -30 -73 -50 -37 -45 77 12 -146 -20 64 6 68 -19
277 -19 26 -95 -4 37 34 96 -40 8 130 23 65 -28 72 -65 39 28 129 76 45 -3 56 -8 88 31 84 52 73 70 -40 -65 -15 -18 -89
-12 -89 49 77 -20 -33 73 182 61 84 -21 46 146 44 -91 31 80 139 -26 -26 -92 2 164 30 -9 71 79
-230G9
##PAGE=	F1=-15727
##FIRST=	23146.756194512010552,	4241.1435120000014649,	0
##DATA TABLE=	(F2++(Y..Y)), PROFILE
4241fJ7R4k5qj68O8m6J27m9M6j26J65j02m0J06p4o2l9J07j7j8m3J24K6m5j4N9j6O4j48R6Q9
3961A42j85O5p9K4J98k39M2J17j24L0K1O1M0j39l7J19Mn9K3P6r7K2k0M1Q3k70K27Mmn6Q1j9
3681I2l7l6k5l1j1k1O6r5J65j34O3Rl1J19q9J17j17q0M0K8k5P6l3R6j26K4jL5O8j68p5L7m1
3392a41O5LJ88l2n7k6k3L2K0j03J0R8j31N4P0j06J72j15k7l4N7Kl7P5p3R1j34L3KJ26n3p6
3112g0M3q0N3L1O1j47Q1l2J24nj06j6k4J18l3n3J42j97J10L0r4L4P5P6j67nL6P8N8j03j44
2841a26j5K6k2J09R7mL4j25J23pj01k7p9L5J01N8l3Qqm3j06J6j3J33q7l9J16m6L7M6n2L3k2
2552A7qn5j42L30j13l5N5M9l2l4o4j18P9P5m0j2O7l8J59q0Lj48O0l1Q2j41O2P9j29N3L7%O4
2264E1p5M7j2l2l9L7J26l6l7k0pK8n2j0L5J45k07P5m5N3m2l9J00p6R0p0P2j08R3n4j28J28
$$ plain form
4241 -6 11 105 80 72 -96 -28 -74 53 4 50 -76 89 -13 -53 53 -21 -83 -122 -15 -32 -50 -93 31 57 12 -2 57 41 105 -43 53 142
3961 142 -43 22 -57 -33 165 -74 -32 85 -39 -9 12 73 113 -26 -63 56 60 1 24 100 3 25 5 46 129 -141 86 90 86 30 111 92
3681 92 55 19 -6 -37 -48 -69 -3 -98 67 -67 -4 5 -26 93 4 121 4 -76 -36 -8 -33 43 10 106 -20 4 3 38 106 -62 -137 -100 -141
3392 -141 -76 -73 115 83 26 0 -23 9 29 -74 -64 34 -97 -43 27 -79 93 -22 -49 -83 -26 -24 -61 14 -59 32 -102 -69 -67 59 6 -70
3112 -70 -27 -107 -54 -23 38 -109 -28 -60 64 59 -47 -63 -87 31 -2 -55 87 -110 0 30 -64 -30 45 121 -46 -51 -15 63 121 18 -126
2841 -126 -141 -115 -137 -28 69 65 99 -26 97 90 -11 -38 -117 -82 19 77 44 52 44 1 -105 -89 -102 31 -56 -95 21 -25 12 58 6 39 17
2552 17 9 -46 -188 142 29 -6 49 98 66 32 -32 -150 -71 4 -36 -48 19 -19 140 60 63 -85 -25 -56 26 -115 -53 26 -103 -50 -13 -13 51
2264 51 -24 23 11 -21 -60 -23 103 67 30 10 3 31 -21 -31 4 149 -58 17 -28 25 -17 -56 44 -32 58 -12 60 -48 45 -9 -137 -9
1983iJ6j32J5J41N3o2p6j7o8J86j0p3Q0p7o4K0Q5k5j7n1j6J00L0j26jkP7J6m2J21j53J54o4
1695Ij20K37k5p1r1k0J84j55R1j51J68j47R1O3p6l9ML2q2j3J32N8j37n2J40K5j69JK42j19
1432A0o4N9l4J2L9J5j45O8lRj31K05p0M5J3M4n7J5K1j73K96j31j08M4J20K1p7j81L0L0K13
1161A35m3n7K0qO4q7p6J02Oj29J3K1J24n1j21M4N1j28J40q2L7N9M0j18N9l2JQn5k3L0J43j38
872e1M5P8Ml5M6rq1N0o2l5j8R1j0k8P2r8m7J12p3R6N1o2j25J34P9r3P5j69L4Q2k5j75J36K5
575A4r9J81k4j28m3Q3j14R1RqN9M5m1L9j36m0Q0L0J3lp2L2nMM0n1J09j07j16R3R5K9P6j18
277A7k1j08J21J0M4L4j51P6Q7j10O4j04J65k03P6N4J05j19J9l6N6q8J13o7O8p3J5kj00k8M6
6d0K8m1Q4K8q6QP9Q5j14K7o3N9J20q0j52P1Q5O6k26O5n8N7J67r4o3M2M5
$$ plain form
1983 -9 7 -125 -110 31 84 22 -54 -71 -139 47 37 -36 44 -33 -97 -77 8 -17 -34 -85 -101 -1 29 -97 -98 -100 -23 -7 -49 72 -81 73 9
1695 9 -111 126 101 30 -61 -81 103 -52 39 -112 56 -91 0 63 -13 -52 -48 -16 -98 -111 21 79 -58 -110 30 55 -114 -113 129 10
1432 10 -54 5 -29 -17 22 37 -108 -40 -43 -34 -165 40 -30 15 28 72 15 30 51 -122 174 43 -65 -21 99 120 43 -138 -108 -78 135
1161 135 92 35 55 47 111 24 -52 50 56 -73 -60 -39 85 34 -87 -43 8 -120 20 -62 -25 34 74 -44 15 -17 -16 -8 -63 -86 -56 87 -51
872 -51 -6 72 76 41 87 78 -3 47 -15 -50 -68 23 13 -15 57 -41 -88 24 -49 47 98 36 -89 45 124 31 106 -63 -29 53 28 -147 -11 14
575 14 -85 96 72 -56 -99 -16 -130 -39 -30 -38 21 66 25 64 -72 -112 -32 -2 11 8 -64 -32 -37 -33 7 -44 65 -42 -158 -65 30 59 135 17
277 17 -4 -112 9 19 63 97 -54 22 109 -1 63 -41 124 -79 -3 51 156 37 56 20 76 -12 101 34 102 29 44 42 -58 -86 -40
6 -40 -12 -53 31 59 -27 -19 60 145 31 58 -5 54 174 94 -58 13 98 164 -62 3 -55 2 169 75 12 54 99
-230I9
##PAGE=	F1=-15821.4
##FIRST=	23146.756194512010552,	4241.1435120000014649,	0
##DATA TABLE=	(F2++(Y..Y)), PROFILE
4241a9K5P7Jm0j53O7j9P3l0N2j39K21j05m6J29r8r9lR3J9k6m8O8M1mj7K3J1L5j28P7R6j77
3952d3R8r3pJ91k68R4Q0j05K0P1K2O7j13o6J18o0L7jO2n9rj0P1N9k87J79N1k6m4N4j5Op4P
3655GOp2QM4o7J51j30N3m5K7Q8o9J68j25j11O3J7p6J51q8O7p6oK2J9O6j74p4O5k3L3K7J88
3366A34r4K6k2m1pN9j19j0J45j88R2M9n0R9j19k8o0J43j5m1P4m3J8q6L3l0J09k0n4L4j07O7
3086e2K8J08j72R2j3N1n7j3j2rP1n8k7J35k02J64np1M9nJ28j18r1N7K2J26p6j49k7QL5K0J38
2797G5k4O4j43J15j8q6o3q3N7J67K8n2N9n5q7j56J19KJ01o8o6Q7K2lJ20r9L2Pm2o5j32L00
2517A13q2m8P2O9m5m4p4p8P9Qj5J8K7k3J08N9m2j39kk2R1j35Q0O7j61O6M2l4Q0q9P8L4p9n6
2220g7J01N1j6l6N1j03N3m7l9R2R4j97J25l1J1j3r7Q9o2J37r8O7q5J46j34p2N2N0j60O8J02
$$ plain form
4241 -19 6 83 84 44 -109 -42 -61 12 -18 34 -105 116 11 -35 94 -4 -103 -106 -13 6 -20 -68 0 41 37 20 43 54 89 -39 38 134 -43
3952 -43 55 -38 -45 146 -122 -28 52 -53 -33 38 60 127 14 -52 66 6 43 42 104 45 36 26 97 156 -131 48 99 73 29 83 68 74 0 7
3655 7 13 -59 -51 -7 -74 77 -53 0 -45 -18 70 1 169 44 -67 -4 13 -63 88 0 67 -9 -15 7 26 92 -82 -156 -91 -114 -81 -54 134
3366 134 40 66 44 3 -4 55 -64 -74 71 -117 -25 24 -26 73 -46 -74 -134 9 -6 -47 27 -16 2 -84 -51 -81 28 8 -46 -12 -119 -52
3086 -52 -24 84 -88 4 -9 42 -15 -28 -40 -49 22 -36 -63 72 -130 34 29 -42 7 2 130 12 -79 -22 0 126 50 -99 -126 -118 -83 -63 75
2797 75 51 115 -28 87 69 -17 -80 -163 -106 61 89 37 96 41 -46 -202 -83 -81 20 -48 -114 -27 -5 -8 112 13 45 52 10 -55 -187 113
2517 113 31 -17 55 124 79 35 -39 -117 -38 -30 -45 -27 0 -23 85 144 102 -37 -39 -61 30 -105 -25 42 -119 -53 -11 -45 35 -54 24 58 -21 -77
2220 -77 24 75 59 23 74 -29 24 -23 -62 30 124 -73 52 21 32 19 -78 11 -51 86 -12 55 -30 116 -18 -90 -38 12 -148 -80 22
1948B2J6p9pJm0J72m9r7P8n8j7k1J14l2Mm0m1P4J2q0k1L0lN9l4R6j02J08n6j36K66n4q4m1
1651d0m4J62j11J11j61J71j47Q6M4j14j1M2kp8l8J53Q5j46k4P6N6j88L0J76r9k6Q9m0l0L9
1388B1rj37L0N6L1j12J40k0K5M2N1n2j5j8j47K12l8j00P8O2Ok1k10P9OJ70o1o9L4pQ1p2o1
1100b5Q8k8j28N9nJ43p4j13N4Q3j65J61j37N1P9O5j78J57o9j5o5k7j7K6K16j51K8N5l2j0N5
828H1k8q9Q0p6n2RR8o4rJ29j45j5Q7n9P5K8m4q8J11Q3o6Kr1K7J15r1j43J14N2r6Q3O8j44m
531f2K7m5R1l6l8R0O3q9N1j40j9Q4M6J0m3o9O2J1j8O2q0R2j22m4M3Q0J06N9j62m8p3J58l3
242A4M9mj42J00M4q0Q2j16K32k48K9J03J00j66M2jM5j06J13p5Q4q9Nk2q8j2N1O7m4M7L6o8
-38a8L9NN8q1L7o0O8J14o7j41N1J04O4k49J16l4j0J41m5o2nO4
$$ plain form
1948 22 38 -41 -48 -47 -87 85 36 -61 17 -41 -58 -79 35 3 7 -33 -74 0 12 -68 -89 -59 -62 -3 -37 59 -43 65 9 -127 139 85 1 -40
1651 -40 -84 78 -33 78 -83 88 -59 27 71 -43 -54 -12 -14 -92 -130 23 108 -38 -62 14 70 -118 -88 88 -11 -37 52 12 -18 21
1388 21 12 -125 -95 -39 -8 -120 20 0 25 67 118 66 51 33 -114 98 60 -40 38 100 106 85 -125 -46 -40 130 69 0 34 27 108 36 -25
1100 -25 63 35 -93 -34 -39 104 30 -83 -29 54 -111 50 -87 -36 43 108 -70 87 18 3 -62 -89 -106 -80 136 -15 13 68 36 26 81
828 81 53 -36 44 -32 -84 -75 23 -41 -50 79 -66 -81 6 -53 22 50 6 -82 29 112 46 48 -43 -16 99 8 -135 -21 31 -65 18 86 -58 -62
531 -62 -35 -80 11 -25 -63 27 90 1 52 -88 -107 -23 23 33 -10 -79 -17 -6 -24 38 -42 50 -72 -116 -73 7 113 172 10 -38 -111 47 14
242 14 63 59 -83 17 61 -19 63 -53 179 -69 -40 63 163 -3 39 38 83 -23 90 15 99 10 15 -7 -95 -107 -56 11 -33 14 50 -18
-38 -18 21 26 84 3 40 -20 48 162 95 -46 5 109 173 -76 40 6 -4 137 92 30 25 89
-230H9
##PAGE=	F1=-15915.7
##FIRST=	23146.756194512010552,	4241.1435120000014649,	0
##DATA TABLE=	(F2++(Y..Y)), PROFILE
4241b7M0N9J2m5j42L0M0J9pK8j21K37r3l9J18j16q5J1O0P0n5m9M4J1N0j4j2J1M0p1PR7j21
3952a3P5p8n1J61k46J49M0p7OQ5j5O9m3j17J12q5P7j7O1j1l5mQ7L0k56R9J02j8q3O0k7M2r5
3664a6L3L0j38N6L0p1J39j03K0o5N3O8j9J96j45r6O1J5j44J85r6J6j0l7O7oM4j61o8J04J0
3392d8k6P6J59j47Q6k1p6k0P5j21MJ31j98J34J7MK0j19lq7K00l8j2N3k8Jp2L4o5R3K2n1J8
3104ej30R9L3J38k15J04K4nj22O5Jj1L8o0j0R9j39J71p8k3P1p8J17l1j22M0k4J56l2j39j3
2832h1k0P0l7J36l2R1j36O7j2l8r4q4O1K00Mq9R5q3r4j82J97J2M0l1r3N4Q1k6J60j01PL4o6
2544A0n7r8K11l6m9P0O7m9n5l5l3M7m3%M2j9OO8J63r1j16m8lO5j02R1N0j56M9N1p1Q4j16J31
2246B8Q4j13p5J58m3%m1J01j66R2l4p7J44K5j78J65J7l9oj55Q9l2J58j10N3o4J78j92Jl6J03
$$ plain form
4241 -27 13 72 84 39 -103 -73 -33 -14 -21 7 -114 123 30 -9 109 -7 -92 -81 -21 49 -6 -55 -11 0 50 36 24 35 75 4 11 108 -13
3952 -13 62 -16 -67 94 -152 -3 37 -40 -34 51 36 105 62 -55 57 -28 49 32 93 82 47 43 130 160 -96 3 105 87 4 64 37 79 -16
3664 -16 17 47 -91 -35 -5 -76 63 -40 -20 -85 -32 36 17 213 68 -28 33 48 -96 89 -7 9 -1 -38 29 23 67 -94 -162 -58 -48
3392 -48 -74 2 161 14 100 79 3 -17 58 -63 -59 72 -126 8 25 29 49 -70 -73 -160 40 2 -10 43 15 16 -56 -22 -87 6 28 -23 -5
3104 -5 -135 -36 -3 135 -80 24 48 43 -79 -14 -13 -24 14 -46 -56 43 -96 75 -3 -26 45 -33 84 53 -69 -29 -53 103 71 -68 -81
2832 -81 -101 -31 -68 68 36 127 -9 58 46 8 -86 -170 -109 91 95 6 101 18 -76 -258 -61 -49 -9 -40 -133 -79 2 -24 136 35 42 76 10
2544 10 -47 -145 66 30 -19 51 118 69 14 -21 -54 -7 -50 -50 -8 -27 -21 47 210 119 3 -45 -48 17 -85 6 56 -100 -51 0 -71 13 -103 28
2246 28 112 -1 -76 82 39 39 -2 99 -67 25 -9 -86 58 83 -95 70 87 48 42 -113 -24 -56 102 -8 45 -19 159 -33 -32 -68 35
1975C5j70R8L7Ko4J4L4j0J35r5j12R3m7K6k4J02m1M1l4p8N7qk5m2P2j04J27m9N8k5N7o4r8
1686a02K44p3o9k2n9J39n4P4j52J44j13Q8J6j19J3N4n1k2m8J39R9j69K8MO3j75O7P5m6L4O6
1415G3k3o5N0m5j34RQ6O3q4P8M7j3M9N5o8l8m0o6R6K7o6Q1KJ4M1k21R8j3J03o2o2M3j1Q0k8
1108E6l8K5m3j02R8j1J12p0q6O3J05j86J31j80J07P2P0j89K06q5m0j23K0mMK44j59L0Ml4%
837cM7pj10J07q6m0M3O2r5J5J46j61L1M0l4K8J3j6n3P5Q6m3n1l2K1J36j36p2M5J00j04JJ26
548G9j25L1k3oJ03o7n8O5R8j14M2j15J2N1N3J3o2m7Q4Lm1O1p9Q3j07J8qN6J35J7j84j9m1J87
251I5p6Mk3j18J14Qm1J02j27K80k53k1J16O6j56N2K2K5j08R6p3R1p6J9p8o8K1N5R8r1L0O4
-29D9m6P5r3L8k9L5r0R6R2o2r9N1Q6N7k26J40Kq8R8ql4n3O4
$$ plain form
1975 35 -135 -37 0 2 -62 -48 -14 -24 111 16 -96 -3 -50 -24 -48 54 13 54 20 -58 -1 -9 -34 -76 -4 -108 19 -30 28 3 60 -4 -102
1686 -102 142 69 0 -22 -81 58 4 78 -74 70 -43 45 61 -58 -45 9 -42 -64 -112 27 126 -43 -15 -11 52 -123 -56 19 -27 7 73
1415 73 50 -15 35 -10 -144 -135 -49 14 -70 8 55 42 91 146 78 40 0 -66 30 57 -9 72 74 88 129 -92 6 -7 96 34 -28 15 4 84 56
1108 56 18 43 0 -102 -4 -15 97 27 -59 4 109 -77 54 -126 -19 53 123 -66 140 55 15 -108 -88 -92 -88 156 -3 27 31 -3 -3
837 -3 44 37 -73 34 -52 -92 -49 13 -82 -67 79 -82 -51 -11 -45 -17 -4 -20 -73 2 88 45 -6 -38 -17 119 -17 -89 -44 56 -48 -47 79
548 79 -46 -15 -38 -44 59 -8 -66 -1 97 -17 25 -90 -78 -27 26 39 -23 -70 14 17 -24 37 -42 41 -66 -48 -56 0 135 152 -32 -51 -92 95
251 95 19 23 0 -118 -4 4 -37 65 -62 218 -35 -56 60 126 -30 22 44 69 -39 57 -16 75 -1 18 -60 -128 -107 -52 46 -45 -15 49
-29 49 3 78 -15 23 -6 29 -61 35 127 65 -34 17 103 160 -66 74 76 -12 86 78 44 -9 55
-230E5
##PAGE=	F1=-16010.1
##FIRST=	23146.756194512010552,	4241.1435120000014649,	0
##DATA TABLE=	(F2++(Y..Y)), PROFILE
4241c0N8M9Pl0j36k6J06pJ4k4q7K21q3k0Q2j22j5oK3J08q7n2N2m2R4k2k7kP6qp7P8m8K9l8
$$ plain form
4241 -30 28 77 84 54 -82 -108 -2 -9 5 -19 -106 115 32 12 94 -28 -43 -49 -26 82 -5 -57 -5 -47 47 25 -2 -4 72 64 -13 65 17 46 8
$$ [...]
-230e2
##END NTUPLES=	nD NMR SPECTRUM
##END=	
##END=	
