##TITLE=	Jan24-2022.73.fid
TM-VI-252, Na+Ph-pyr 13C

##JCAMP-DX=	6.0	$$ MestReNova 14.3.0-30573
##DATA TYPE=	LINK
##BLOCK_ID=	1
##BLOCKS=	2    
##ORIGIN=	Mestrelab Research S.L.
##OWNER=	hrzepa
##$MNOVA/LINK_BLOCK_TYPE=	ITEM	$$ NMR Spectrum
##$MNOVA/ITEM/POLYGON=	(XY..XY)
5321,5835
8722,5835
8722,8208
5321,8208
5321,5835
##$MNOVA/ITEM/Z=	0
##$MNOVA/ITEM/ANGLE=	0
##TITLE=	Jan24-2022.73.fid
##JCAMP-DX=	6.0	$$ MestReNova 14.3.0-30573
##BLOCK_ID=	2
##DATA TYPE=	MNOVA NMR VIEW DATA
##DATA CLASS=	MNOVA VIEW DATA
##$MNOVA/ITEM/ZOOM/X=	-31.150195598113686657,	251.15679998888273872
##$MNOVA/ITEM/ZOOM/Y=	-629.87728118896484375,	6653.6180419921875
##END=	
##TITLE=	Jan24-2022.73.fid
##JCAMP-DX=	6.0	$$ MestReNova 14.3.0-30573
##BLOCK_ID=	3
##DATA TYPE=	NMR SPECTRUM
##DATA CLASS=	XYDATA
##NUMDIM=	1
##ORIGIN=	Bruker BioSpin GmbH
##OWNER=	nmr
##.OBSERVE FREQUENCY=	100.64143946071199309
##.OBSERVE NUCLEUS=	^13C
##.SOLVENT NAME=	MeOD
##.PULSE SEQUENCE=	zgpg30
##LONGDATE=	2022/01/25 00:00:14.000
##.ACQUISITIONMODE=	SIMULTANEOUS (DQD)
##$ORIGINAL FORMAT=	Bruker XWIN-NMR
##$MNOVA/SCALES_VERSION=	9
##$PARAMETER FILE=	(acqus, ASCII, /private/var/folders/f6/rjf_tdyn2v98c5c0wvkgn4s80000gn/T/VSXicLpTTY2uLq69fF6jKA/73/acqus, 0)
$$ ##TITLE= Parameter file, TOPSPIN		Version 3.2
$$ ##JCAMPDX= 5.0
$$ ##DATATYPE= Parameter Values
$$ ##NPOINTS= 11	$$ modification sequence number
$$ ##ORIGIN= Bruker BioSpin GmbH
$$ ##OWNER= nmr
$$ $$ 2022-01-25 00:00:15.769 +0000  nmr@CZC2439F63
$$ $$ /opt/topspin/data/agmb/nmr/Jan24-2022/73/acqus
$$ $$ process /opt/topspin3.2/prog/mod/shimcntl
$$ ##$ACQT0= -1.90126054427203
$$ ##$AMP= (0..31)
$$ 100 100 100 100 100 100 100 100 100 100 100 100 100 100 100 100 100 100
$$ 100 100 100 100 100 100 100 100 100 100 100 100 100 100
$$ ##$AMPCOIL= (0..19)
$$ 0 0 0 0 0 0 0 0 0 0 0 0 0 0 0 0 0 0 0 0
$$ ##$ANAVPT= -1
$$ ##$AQSEQ= 0
$$ ##$AQ_mod= 3
$$ ##$AUNM= <au_zg>
$$ ##$AUTOPOS= <52 >
$$ ##$BF1= 100.63037
$$ ##$BF2= 400.2
$$ ##$BF3= 100.63037
$$ ##$BF4= 100.63037
$$ ##$BF5= 100.63037
$$ ##$BF6= 100.63037
$$ ##$BF7= 100.63037
$$ ##$BF8= 100.63037
$$ ##$BYTORDA= 0
$$ ##$CAGPARS= (0..11)
$$ 0 0 0 0 0 0 0 0 0 0 0 0
$$ ##$CFDGTYP= 0
$$ ##$CFRGTYP= 9
$$ ##$CHEMSTR= <none>
$$ ##$CNST= (0..63)
$$ 1 1 145 1 1 1 1 1 1 1 1 1 1 1 1 1 1 1 1 1 1 1 1 1 1 1 1 1 1 1 1 1 1 1 1
$$ 1 1 1 1 1 1 1 1 1 1 1 1 1 1 1 1 1 1 1 1 1 1 1 1 1 1 1 1 1
$$ ##$CPDPRG= (0..8)
$$ <waltz16> <> <waltz16> <> <mlev> <mlev> <mlev> <mlev> <mlev>
$$ ##$D= (0..63)
$$ 0 1 0.00345 0 0 0 0 0 0 0.06 0 0.03 2e-05 3e-06 0 0 0.0002 0 0 0 0 0 0
$$ 0 0 0 0 0 0 0 0 0 0 0 0 0 0 0 0 0 0 0 0 0 0 0 0 0 0 0 0 0 0 0 0 0 0 0 0
$$ 0 0 0 0 0
$$ ##$DATE= 1643068814
$$ ##$DE= 6.5
$$ ##$DECBNUC= <off>
$$ ##$DECIM= 704
$$ ##$DECNUC= <off>
$$ ##$DECSTAT= 4
$$ ##$DIGMOD= 1
$$ ##$DIGTYP= 12
$$ ##$DQDMODE= 0
$$ ##$DR= 21
$$ ##$DS= 4
$$ ##$DSPFIRM= 0
$$ ##$DSPFVS= 20
$$ ##$DTYPA= 0
$$ ##$EXP= <c13>
$$ ##$F1LIST= <111111111111111>
$$ ##$F2LIST= <222222222222222>
$$ ##$F3LIST= <333333333333333>
$$ ##$FCUCHAN= (0..9)
$$ [...]
$$ ##$Sgu3PowerLevels= (0..7)
$$ 0 0 0 0 0 0 0 0
$$ ##$Sgu4PowerLevels= (0..7)
$$ 0 0 0 0 0 0 0 0
$$ ##$Sgu5PowerLevels= (0..7)
$$ 0 0 0 0 0 0 0 0
$$ ##$Sgu6PowerLevels= (0..7)
$$ 0 0 0 0 0 0 0 0
$$ ##$Sgu7PowerLevels= (0..7)
$$ 0 0 0 0 0 0 0 0
$$ ##$Sgu8PowerLevels= (0..7)
$$ 0 0 0 0 0 0 0 0
$$ ##$SguType= 3
$$ ##$ShimPowMaxUA= (0..63)
$$ 130000 130000 130000 130000 130000 130000 130000 130000 130000 130000 130000
$$ 130000 130000 130000 130000 130000 130000 130000 130000 130000 0 0 0 0
$$ 0 0 0 0 0 0 0 0 0 0 0 0 0 0 0 0 0 0 0 0 0 0 0 0 0 0 0 0 0 0 0 0 0 0 0 0
$$ 0 0 0 0
$$ ##$ShimPowMaxUC= (0..63)
$$ 130000 130000 130000 130000 130000 130000 130000 130000 130000 130000 130000
$$ 130000 130000 130000 130000 130000 130000 130000 130000 130000 0 0 0 0
$$ 0 0 0 0 0 0 0 0 0 0 0 0 0 0 0 0 0 0 0 0 0 0 0 0 0 0 0 0 0 0 0 0 0 0 0 0
$$ 0 0 0 0
$$ ##$ShimPowMaxUG= (0..63)
$$ 524287 524287 524287 524287 524287 524287 524287 524287 524287 524287 524287
$$ 524287 524287 524287 524287 524287 524287 524287 524287 524287 0 0 0 0
$$ 0 0 0 0 0 0 0 0 0 0 0 0 0 0 0 0 0 0 0 0 0 0 0 0 0 0 0 0 0 0 0 0 0 0 0 0
$$ 0 0 0 0
$$ ##$ShimPowRcbType= 3
$$ ##$ShimPowRes= (0..63)
$$ 1e-20 1e-20 1e-20 1e-20 1e-20 1e-20 1e-20 1e-20 1e-20 1e-20 1e-20 1e-20
$$ 1e-20 1e-20 1e-20 1e-20 1e-20 1e-20 1e-20 1e-20 0 0 0 0 0 0 0 0 0 0 0 0
$$ 0 0 0 0 0 0 0 0 0 0 0 0 0 0 0 0 0 0 0 0 0 0 0 0 0 0 0 0 0 0 0 0
$$ ##$ShimPowRng0= (0..63)
$$ 1 1 1 1 1 1 1 1 1 1 1 1 1 1 1 1 1 1 1 1 0 0 0 0 0 0 0 0 0 0 0 0 0 0 0 0
$$ 0 0 0 0 0 0 0 0 0 0 0 0 0 0 0 0 0 0 0 0 0 0 0 0 0 0 0 0
$$ ##$ShimPowRng1= (0..63)
$$ 1 1 1 1 1 1 1 1 1 1 1 1 1 1 1 1 1 1 1 1 0 0 0 0 0 0 0 0 0 0 0 0 0 0 0 0
$$ 0 0 0 0 0 0 0 0 0 0 0 0 0 0 0 0 0 0 0 0 0 0 0 0 0 0 0 0
$$ ##$ShimPowRng2= (0..63)
$$ 1 1 1 1 1 1 1 1 1 1 1 1 1 1 1 1 1 1 1 1 0 0 0 0 0 0 0 0 0 0 0 0 0 0 0 0
$$ 0 0 0 0 0 0 0 0 0 0 0 0 0 0 0 0 0 0 0 0 0 0 0 0 0 0 0 0
$$ ##$ShimPowRng3= (0..63)
$$ 1 1 1 1 1 1 1 1 1 1 1 1 1 1 1 1 1 1 1 1 0 0 0 0 0 0 0 0 0 0 0 0 0 0 0 0
$$ 0 0 0 0 0 0 0 0 0 0 0 0 0 0 0 0 0 0 0 0 0 0 0 0 0 0 0 0
$$ ##$ShimSysFunc= (0..63)
$$ 1 2 3 4 5 7 9 11 15 16 8 10 12 14 6 17 13 18 19 20 0 0 0 0 0 0 0 0 0 0
$$ 0 0 0 0 0 0 0 0 0 0 0 0 0 0 0 0 0 0 0 0 0 0 0 0 0 0 0 0 0 0 0 0 0 0
$$ ##$ShimSysMatrix= 0
$$ ##$ShimSysType= 1
$$ ##$TFXNUM= 0
$$ ##$TRIPLO2= 0
$$ ##$VTU= 2
$$ ##$VTUETH= <149.236.99.20>
$$ ##$VTUTY= <no>
$$ ##$WBREFAM= (0..15)
$$ 135.5 97.7 100 100 100 100 100 100 100 100 100 100 100 100 100 100
$$ ##$WBREFLM= (0..15)
$$ 0 0 0 0 0 0 0 0 0 0 0 0 0 0 0 0
$$ ##$WBREFPH= (0..15)
$$ 72.26 -67.22 0 0 0 0 0 0 0 0 0 0 0 0 0 0
$$ ##$WBSGU= (0..15)
$$ 0 0 0 0 0 0 0 0 0 0 0 0 0 0 0 0
$$ ##$XFAC= 2
$$ ##END=
$$ 
##$DECIM=	704
##$DSPFVS=	20
##XUNITS=	HZ
##YUNITS=	ARBITRARY UNITS
##FIRSTX=	25274.001712016048259
##LASTX=	-3134.6557087493106337
##DELTAX=	-0.43348832563920586258
##XFACTOR=	1
##YFACTOR=	0.085543612184354828054
##FIRSTY=	-3.0319390296936035156
##MINY=	-25.00289154052734375
##MAXY=	6048.74365234375
##NPOINTS=	65536
##XYDATA=	(X++(Y..Y))
$$ [...]
10758I9J4Jj7k0kJ5J4LkKJ5K8L2J4k3m9m2j6KLKLjj2j5lJ0J3J0J0J3J2OJnj3j7j1jJ%MQMk
10739H8MK6M0K6mk5k7j1PJ7J4%j4j5jJ2J2Jj1j3qoKJ2K5L5L9L5J0l1o5o4l3jJ3J6J5Nk0l8
10721F7l5pK2L7L9K9Ok0l9m2l6k2j4rpMK0K4J0j1pJ7L4K5kk0j5%P%j0j1%J8K8L2K8K2Pj6l9
10704A14n4m4qL2M7L0JqKJ0J1J2J9J5lj6j3nooMJ1kk2j8NQj7m5l8j4lpJK5M7M6L3K3J8J0%
10685A95rj5j7j1NJ7K0K0K2J6kj7j1J0K3K1J2Npj7j1J1K3J0j8l6l6k6j1KOkj0j4j8j8qNMj6
10668I7k8j3QQj0j7j0qj4j2JJ4K2K9L4K5RLJ0Qnj9j8j2pjPLrj6rj%MQjj9j9QL3K6%j0mK%K
10648I9NNNPLj8l6k6JJ2kj4mJ5J6Lj2k3l0k4j2mnj2j1oPK1K5J4jLK4L6K4OKjqj3oNNMQJ5J1
10627A13%jKok1k2nJ0QkokLLJKNNLjmlJNJ1J4J5J0KonOJ6J2nk1k4k0j9j8qMOnj8j5KK4M1M0
$$ plain form
10758 99 113 114 97 77 75 90 104 107 105 107 122 150 182 196 173 124 82 66 68 71 73 76 75 63 48 45 55 68 78 88 101 113 119 120 115 102 85 74 73 74 74 78 86 90 88
10739 88 92 118 158 184 180 155 128 117 124 141 155 155 141 126 125 137 149 150 139 126 118 112 114 126 151 186 225 260 270 239 174 110 77 76 89 105 120 125 105 67
10721 67 32 25 47 84 123 152 158 138 99 57 21 -1 -15 -24 -31 -27 -7 17 27 16 9 26 60 85 83 63 48 48 55 55 45 34 34 52 80 112 140 162 169 153 114
10704 114 60 16 8 40 87 117 118 110 112 122 133 145 164 179 176 160 147 142 136 130 134 145 143 121 103 108 116 99 54 16 2 -1 -8 -7 18 65 111 144 167 185 195 195
10685 195 186 171 154 143 148 165 185 205 227 243 241 224 213 223 246 267 279 284 277 260 249 260 283 293 275 239 203 177 166 168 174 172 162 148 130 112 104 109 113 97
10668 97 69 56 64 72 62 45 35 27 13 1 2 16 38 67 101 126 135 138 148 156 151 132 114 102 95 94 101 104 95 79 70 69 69 73 81 80 61 42 50 83 109 109 99 95 97 97 99
10648 99 104 109 114 121 124 106 70 44 45 57 55 41 37 52 68 71 59 36 6 -18 -30 -34 -39 -51 -62 -68 -61 -40 -15 -1 -2 1 25 61 85 91 93 92 84 71 65 70 75 79 87 102 113
10627 113 113 112 114 108 87 65 60 70 78 76 70 68 71 74 75 77 82 87 90 89 85 82 83 88 99 113 128 138 140 134 129 135 151 163 158 137 113 93 74 56 48 52 58 53 35 20 22 46 87 127
10606A27K3LjMol3m5k4NJ1rk3j5NJ6K0J8J5J3J5Qmj3oKql0l7j5J6L6L7K2ol1l5j6NMpj1kO
10587C4Nrk1j2J5M5N0K9OJJoj4j4rpnjlj1j4kJ4J3JmJQNJMNNRJ6J5Kj0nRJ3%j6j5LK1K0Kj4
10566A61j2jPQNmj8k6j8nlj6k3j4MJ0LmkNJ4K1J8OnKJ8K2Oj2j9j8j8j7lJ7K7J3j0k4k0j1o
10547E8pqpnmmjQJ8K8K4Pj3k2j1J0J7Lj6j8kJ4J3OOJ1Pqk0j7mRJ9K2J7PKLMmj4k0j7pJ1K4
10527A19K4J0nojKmopqj3j7j2mPK1K8J8kj6j1%PMKPJ3J4Kk3m6m8k3J1K9K1Jj3j3kJ1J6J4J0
10508A11RNlmNJ9J9%k4l3j9QK9K6Pj1j9k0k0j3J2M4O0M3Qj9k7k4k1k7l4l0j3OJ4J6K0K1J3
10491A34LMJ5J3j3l3k0J4L3K1JpojPJ7J2j1l3k9j2mj0j5j1plOK0K6J5mj1j0j1k0k2j0QK2K1
10473H9Qj0k3k6j6kJ0ROQK5M3L9Lm2o1l5J4N2N8L8J2pj0jJ2J6%k3l6l3k6k4j5LJ9J7NjKLJ
$$ plain form
10606 127 150 153 152 156 150 117 72 48 53 64 55 32 17 22 38 58 76 91 104 119 127 123 110 104 106 98 68 31 16 32 68 105 127 121 90 55 39 44 48 41 30 28 34
10587 34 39 30 9 -3 12 57 107 136 142 143 144 138 124 110 101 94 89 88 85 74 60 58 72 85 86 82 83 91 96 97 101 106 111 120 136 151 153 143 138 147 160 160 144 129 132 153 173 175 161
10566 161 149 148 155 163 168 164 146 120 102 97 94 78 55 41 45 55 58 54 52 57 71 92 110 116 111 113 131 153 159 147 128 110 92 75 72 89 116 129 119 95 75 64 58
10547 58 51 43 36 31 27 23 22 30 48 76 100 107 94 72 61 71 88 91 75 57 55 69 82 88 94 105 112 104 84 67 63 72 91 113 130 137 139 142 146 142 128 108 91 84 95 119
10527 119 143 153 148 142 141 143 139 133 126 118 105 88 76 72 79 100 128 146 144 128 117 117 124 128 130 137 150 164 166 143 97 49 26 37 66 87 88 75 62 60 71 87 101 111
10508 111 120 125 122 118 123 142 161 161 137 104 85 93 122 148 155 144 125 105 85 72 84 128 188 231 239 220 193 169 148 121 87 57 44 50 64 80 100 121 134
10491 134 137 141 156 169 156 123 103 117 150 171 172 165 159 158 165 182 194 183 150 121 109 105 95 80 69 62 59 65 85 111 126 122 111 101 90 70 48 38 46 68 89
10473 89 97 87 64 38 22 20 30 39 45 53 78 121 160 163 121 60 25 39 91 149 187 199 192 182 181 193 209 209 186 150 117 91 67 52 55 74 91 96 95 97 100 101
10455A01LJ3J8J0KkjJLMMJj%jpj2nLKlLK1L0K2Nqj4j7j5oMKqj2oMPJj1j8j6mOQjrj3j6k1j6
10433C5QL3L7J7oj5j1orj6k2k6k2j5jJ6L2L8K4rl3l7k7k1j5jJ3J8J1PRJ5J6J9J7Kj7k0pKj
10415C2lKOjmNJ4QJOJ8J3%JJ4K7K8J6qm2o8n9k7n%J2L8O5O2M4K5Qrj6qOQNOQKkLRkj9j9lR
10394B06jj6k5k5k3j8j1pp%J5K5J9Oloj8l3l9l1j4kJ1L0M3M3K7Pl%LJj1k1k1oJ7L6M0K6jk3
10376A90k2oJ0J0%pomplOJ0Jrrlpj9k3j6rokKnj8k3j1QJ9K5K7K1J0Kkpj3qLMj2k7j8KJ3J5
10356G6J6J6Qlj4k2l2k4QL9L9J6LRRkrLJ0LmOK2J8ql3l9k9j3LPlj3pRJ7QoqJJ2J7J5OlqkJ0
10335A24J7J2ok3k7k1j1qj1pNK5L5K8J4QJ3J2%j8l0l3l0j5PK1J1j1k4k2j5j1kQJ2J3K1L6M1
10318A38L1J9J9K1J3Jnj4k3k8k1j2rpOK1K2J4J2J5Oj5l2l5k4pOJ1LpoKOlj6k5k0oJ2J4ol0
$$ plain form
10455 101 104 117 135 145 147 145 144 145 148 152 156 157 156 156 155 148 136 131 134 136 133 136 157 187 209 214 206 192 175 160 154 158 160 152 140 134 138 145 146 135 117 101 97 103 111 110 101 88 72 51 35
10433 35 43 76 113 130 124 109 98 92 83 67 45 19 -3 -18 -19 -3 29 67 91 82 49 12 -15 -36 -51 -52 -39 -21 -10 -3 6 21 37 56 73 75 58 38 31 33 32
10415 32 29 31 37 36 32 37 51 59 60 66 84 97 97 98 112 139 167 183 175 133 65 6 -21 -26 -26 -14 24 89 151 195 220 228 219 203 195 201 209 214 220 228 230 228 231 240 238 219 200 197 206
10394 206 205 189 164 139 116 98 87 80 73 73 88 113 132 138 135 129 111 78 39 8 -6 -8 3 33 76 119 146 153 150 150 153 154 143 122 101 95 112 148 188 214 213 190
10376 190 168 162 172 182 182 175 169 165 158 155 161 171 172 163 154 151 144 125 102 86 77 71 69 71 66 48 25 14 22 41 66 93 114 124 126 124 117 104 96 99 103 91 64 46 48 61 76
10356 76 92 108 116 113 99 77 45 21 29 68 107 123 126 135 144 142 133 136 146 149 145 151 173 191 183 150 111 82 69 72 79 76 63 56 65 82 90 84 76 77 89 106 121 127 124 116 114 124
10335 124 141 153 147 124 97 76 65 57 46 39 44 69 104 132 146 154 167 179 179 161 131 98 68 53 60 81 92 81 57 35 20 9 7 15 27 40 61 97 138
10318 138 169 188 207 228 241 242 237 223 200 172 151 139 130 123 129 150 172 186 198 213 219 204 172 137 113 106 112 123 126 119 113 115 121 118 102 77 57 51 63 77 71 41
10300D1l5j5RK5K7J9Pkmmqj8j9j3ookRK2J7mk0k0mJ6L3L6K7RloNK0K3Pj3j9pORJmlKPJ0QK
10279A62qj5j0QK8K9Lk7l1j2PJ0Jmpj8l0l2j5LPok7k8qK4M2L1Mj8k7k2j4ojQJ9K6K3J2NNK
10260I3oj1q%QJ3J0Jj0j2o%OJ4K7L3K8J8Pmj3j3jOKqnMOnk0k6k4j7j1lJ1K8L3J7jpJMpk0k4
10240A08k6k4j0J9L7K6Jj1o%jjMRJ1J2J1KolPRPLnj9k7j3J5L1K5J6Oqk7l1k0j3k0k1nJ5J1
10221H8oj2jJ0NmJK1L4K1rl3l8l2k9k0PM3N0J7j4pK6M4L4J4%nnKJ1J1lj8k2k0j7j5j4j1%J6
10203A20K3J6NLPjj6j9lQLnm%oj8j5NK2J5j0k7j9NJ9J3rk0j6lLNJ2J9J8Qmj0rnJLJkjlj0j9
10182H0j4lJj5l3k9qJ2J9J6J1Lqj5rNQ%qkJ3K2K2J9J9J6jk6l9l0oJ4K1J8J2QMMPJ4J4Q%lm
10163A37pj6k4k4j1JMrk9m0m0k1J0M2N6N0L0J8J4Lk1l7k2J9N3N6L0Jj6j9j5j2j2j3j4j0JJ3
$$ plain form
10300 41 6 -9 0 25 52 71 78 76 72 68 60 42 23 10 4 -2 -4 5 27 44 40 20 0 -4 12 45 81 108 117 114 108 113 133 156 163 150 131 124 130 139 140 136 133 135 142 152 160 162
10279 162 154 139 129 137 165 194 197 170 139 127 134 144 145 141 134 116 86 54 39 42 49 43 16 -12 -20 4 46 77 81 63 36 14 0 -6 -7 1 20 46 69 81 86 91 93
10260 93 87 76 68 68 76 89 99 100 90 78 72 72 78 92 119 152 180 198 205 201 188 175 174 180 182 174 169 173 179 174 154 128 104 87 76 73 84 112 145 162 161 154 155 159 152 132 108
10240 108 82 58 48 67 104 130 131 120 114 114 113 112 116 125 136 148 159 161 155 152 159 168 175 178 173 154 127 114 129 160 185 201 207 199 172 141 121 108 88 67 62 77 88
10221 88 82 70 69 79 84 80 81 102 136 157 148 115 77 45 16 -4 3 46 96 113 99 92 118 162 196 210 210 205 200 202 213 224 221 203 181 161 144 129 115 104 104 120
10203 120 143 159 164 167 174 173 157 138 135 143 146 141 137 137 131 113 98 103 125 140 130 103 84 89 108 121 112 92 76 73 76 81 93 112 130 138 134 124 115 110 111 114 115 113 112 109 99 80
10182 80 66 63 64 49 16 -13 -21 -9 10 26 37 40 32 17 8 13 21 21 13 11 24 46 68 87 106 122 121 95 56 26 20 34 55 73 85 93 97 101 108 122 136 144 144 141 137
10163 137 130 114 90 66 55 56 60 51 22 -18 -58 -79 -69 -27 29 79 109 127 141 144 123 86 64 83 136 192 222 223 207 188 173 161 149 136 122 112 113 126
10146A26K0J3jj2j3qj0k3l7l4oL1N2L9Oj4j0NJ0NMJ1J5J1Jrk0k3j6n%qj5j3j4j7j1J8N2N9
10129A59L1mj9j6rjQJ6Oj0j5omj6k7k1lQQNKkljjj0j8nK2L7L2K2J8J1j1l0k5oLoj2kQO%KJ1
10108A32J5Oqk4l1k9k5k2j5nRJ7J3OPRLqj3j0j4l1n2n2l0kK0L8N1N4M3K2Noj5j6nRPj2k6j9
10090djJ1J2OKKMKJKJ1K7L9M3M2L7J6k1m7m2j4OMj4k8l4l3k3oLRJ4K0K4K4K6K6K0QJjmj0j1
10071A49oloqonqj5k0k4j7MK4K8K4K8M0L6Pj9j5OJ3Lj3k4k7j4PJ9Qj6k2mJ9L1K9J4j0l1l6
10053A40l4l0k2lJ5J1qj6mJ5K1K1K3K7K6J4mk1k6j5JPKllj1k5l1j7lkplJ3K5K4J7J2J6K0J7
10036A79jk3k6j3mpj2nPPKLJ1J6J3Jj6l6m0k3j%rj4mNRJ5K7L1K0%j5k1k2j9j3qmKJ1J8K4K9
10017I4K8J5oj9j8j5j7j8oRJ1jpMK4K6Qk0l3l0k2k0k1j2NJ5J2RJ6K6K1nk9l3k0kPJ3K0L2L4
$$ plain form
10146 126 146 159 158 146 133 125 115 92 55 21 15 46 98 137 143 129 119 124 134 139 143 154 169 180 181 172 152 129 113 108 108 100 85 72 58 41 30 48 100 159
10129 159 190 186 167 151 142 141 149 165 171 161 146 140 136 120 93 72 69 77 85 90 92 90 87 86 85 75 57 52 74 111 143 165 183 194 183 153 128 122 125 119 107 105 113 119 119 121 132
10108 132 147 153 145 121 90 61 36 14 -1 -6 3 20 33 39 46 55 58 50 37 27 13 -18 -70 -122 -152 -154 -134 -96 -45 9 52 74 79 73 58 42 37 46 53 41 15 -4
10090 -4 -5 6 18 24 26 28 32 34 35 37 48 75 114 157 199 236 252 231 184 142 128 134 138 124 96 62 29 6 0 3 12 26 46 70 94 120 146 166 174 175 174 170 160 149
10071 149 143 140 134 126 120 115 107 92 72 48 31 35 59 87 111 139 179 215 222 203 188 194 207 210 197 173 146 132 139 158 166 150 128 124 143 174 203 217 207 176 140
10053 140 106 76 54 51 66 77 69 53 49 64 85 106 129 156 182 196 192 171 145 130 131 138 140 137 134 123 98 67 50 47 45 38 35 48 73 97 114 126 142 162 179
10036 179 178 155 129 116 112 105 93 88 95 102 104 107 118 134 147 148 132 96 56 33 32 32 23 9 5 10 19 34 61 92 112 112 97 76 54 35 22 14 10 12 23 41 65 94
10017 94 122 137 131 112 94 79 62 44 38 47 58 57 50 54 78 104 112 92 59 29 7 -13 -34 -46 -41 -26 -14 -5 11 37 58 53 24 -9 -29 -31 -24 -11 9 41 75
9999G5K6J9J7J3RQJ6K3J4rk9l3k4j5qom%NJ0PNPJ0OklNJ7K1J4Jj2j4JK5L6K3nk6k7j4%NJk
9979A86OJ5J6QLkj6l6m3k5MJ6NooKjj9k9j3K2M2K7j3m3m6k9mK3L9L1QpjJ0Lj7l1l4l2k0%K2
9960A5K4%k5l4k8rJ0K2J5nj9rQJ5J0PJ0J8K0K0K0K1J8Roj9k7k6j9rRK4K9K6K2K4K1J1konm
9942A76LJ2Qj2l2l0j0QPnk0k4j7mLmj5j0J2L3L9L4K7K2J8J6J5J3Nqk6m2m2k3jKj2k2j5%RJ8
9924A06L1L9L1J2mj3j7k0j8j3nLJ0Opj2mKj2l7m1k3ljqj1oJ0L2N2M6K0kppj7l1l2k3k1k9l9
9906f3l4j5J2L8M6L7L0L4M4L7J7jj3j8j9oQQj1k9k8k2k3k2nK3M5M7L4J5lrlJ1J6J4J5J9J4
9889B40j0l6m3k2J0K9J9ok1j4QK2K1J4QOlk0m3n7n6m0j5JQJ0J2J1POPJ1J5K2K2J0j5l5l5k7
9871B1k2k2pJ9L2K2J3L1N9O2K3k1l8k9j9k1k3k1j7k0j7KK8M2L2Rrj1%J6K3J1j3k6j1J5K9J6
$$ plain form
9999 75 101 120 137 150 159 167 183 206 220 211 182 149 125 110 102 96 92 92 97 107 114 119 126 136 142 140 137 142 159 180 194 195 183 169 170 195 231 254 249 223 196 182 182 187 188 186
9979 186 192 207 223 231 234 232 216 180 137 112 116 132 137 131 125 127 126 107 78 65 87 129 156 143 100 54 25 21 44 83 114 122 115 114 124 127 110 79 45 13 -7 -7 15
9960 15 39 39 14 -20 -48 -57 -47 -25 -10 -15 -34 -43 -35 -20 -10 -3 7 25 45 65 85 106 124 133 127 108 81 55 36 27 36 60 89 115 137 161 182 193 191 185 180 176
9942 176 179 191 199 187 155 125 115 123 130 125 105 81 64 60 63 59 44 34 46 79 118 152 179 201 219 235 250 263 268 260 234 192 150 127 126 128 116 94 79 79 88 106
9924 106 137 176 207 219 215 202 185 165 147 134 129 132 142 148 141 129 125 127 115 78 37 14 11 10 2 -9 -15 -5 27 79 125 145 143 136 129 112 81 49 26 5 -24 -63
9906 -63 -97 -112 -100 -62 -16 21 51 85 129 166 183 182 169 151 132 126 134 142 131 102 74 52 29 7 2 25 70 117 151 166 163 154 151 162 178 192 207 226 240
9889 240 230 194 151 129 139 168 187 181 160 146 154 176 197 211 219 225 222 202 159 102 46 6 -9 -8 0 10 22 33 40 46 53 64 79 101 123 133 118 83 48 21
9871 21 -1 -23 -30 -11 21 43 56 87 146 208 231 210 172 143 124 103 80 59 42 22 5 7 35 77 109 118 109 98 98 114 137 148 135 109 98 113 142 158
9855A58pj8j0OJ1Kk3m7m7k0J5L3L1L1L9M1K4OJNJopmqj5rOPrj5%J7J8QKnk3l9l3qMj0k7k7
9835D9j2%J1K6L9L7J9Koj0j5j4kJ7L0K9K3K2K3Rj7l7l0nOnk1k3j3ookRJ9J7Kj4k2j6jJ5K5
9817A52K7J9Kk0l5l7k6j1JMMOJ9L3K9Ok1k8j7j1j7k4j9oKL%KJ1K2K5Ok9n7n2k0J4K9K1RLN
9799B4J1K2L1L6L6L3K6Rj7l3l2j7okMJ9L7M8M4K5jj9j9rnj9l6l9k7k2k1j0J5L4K5kk1j5jj
9782A05j5l6m5l8j7RK0J0jKK0L3L0J7J2RMlkPRJlQK1J5qk2rJ2J5mk3k4rKM%nppjLjokRJ0q
9760I1k6k4lRKj6k1j2LJ4K2K5K3Rj1k6k9k2j4rKK0L4K8RookjkKNLoj4j8k2k0j2KJ5K4L9N1
9741A10N6M6K7Nj3k4k6j6%J4J7J1Lnpm%MJpj2j0mnj3j5nJ1J7Kk2l6k5PL5L2jl8m8l4j9j2j5
9723a8j3qJJ2K0K5L0L1K7J7RPJj7m2n6n0l3j2NJ8K2K2J7Rrj7pJ1J8J0J0J9J8jj1OK9K5ml0
$$ plain form
9855 158 151 133 123 129 140 142 119 72 25 5 20 53 84 115 154 195 219 225 226 231 232 226 219 215 207 192 183 189 196 187 172 172 189 207 215 217 212 189 150 117 109 113 103 76 49
9835 49 37 37 48 74 113 150 169 171 165 155 140 126 124 141 171 200 223 245 268 277 260 223 193 188 194 189 168 145 132 126 120 118 127 146 163 165 151 129 113 112 127 152
9817 152 179 198 200 180 145 108 82 71 72 76 80 86 105 138 167 173 152 124 107 96 79 55 36 30 32 35 35 37 48 70 95 101 72 15 -37 -57 -43 -14 7 16 19 24
9799 24 35 57 88 124 160 193 219 228 211 178 146 129 123 121 125 144 181 229 273 298 297 278 259 250 245 226 190 151 124 102 81 71 86 120 145 143 122 107 106 105
9782 105 90 54 9 -29 -46 -37 -17 -7 -8 -6 14 47 77 94 106 115 119 116 114 121 130 131 128 136 157 172 164 142 133 145 160 156 133 109 100 102 106 106 101 94 87 86 89 88 82 80 89 99 91
9760 91 65 41 38 47 49 33 12 0 3 17 39 64 87 96 85 59 30 8 -6 -15 -13 7 41 69 78 72 66 64 63 61 63 68 71 65 51 33 11 -9 -21 -19 -4 20 59 110
9741 110 166 212 239 244 231 207 181 165 165 179 196 207 210 205 198 194 194 198 199 192 180 170 166 161 148 133 128 139 156 158 136 100 75 82 117 149 148 110 62 28 9 -3 -18
9723 -18 -31 -39 -38 -26 -6 19 49 80 107 124 133 140 141 124 82 26 -24 -57 -69 -64 -46 -24 -2 15 24 15 -2 -9 2 20 30 40 59 77 76 65 71 100 125 121 91
9705I1l1j7nlppMJ8J5%lJ9M3L7Qj0jR%k0l5l7l2j9nNJ0J4J4OjMK0L5M0M1L3J2j9l2j6NJ0j
9686A92oNK0K3J8Nqk1k5k1rNJ4Oj2k8l2k4j2mlj0j3kK0K7J1j5k7j9mQJ6J6RLNPjj6k5k4j8
9667C1j0llrj0rj0k1k7rK4M6M1K6J2NmnjJlnRK9M2L4J2pj3kJ5K1Qj2l0l8l6j3K3M9N2L7J9
9648B56Kj6k9l1k8l0k9j7jJpqMQQJ9M1M9J8k8n9o2m7k2JJ2Oon%JMK1M2M2J5j0j6rqj2j2nJ
9629E4Mlj6k8k2mJ2J0J1K4L7L2J2NJ6K9K9K2J4Lj2k6k4j0PJ1Jrj0LJ2Oqj3mJj0k0k0j2j1j6
9611G7j0QK4K5J1%JQLj0j3JJ8K0J1ONnk0k4j2pk2l7l0pJ3K2K4K3J6QOQO%l%KNJ0J3Qqk6l7
9591A11l7k6pJ0J6J6J5J3Jj3j5nOPJ2J9J7P%MNqj8j3klj6k3j4mkqj1j5j5j1pqrJK3M0M7M1
9572A21L5K7J9J2J2J0%j4k1j9j0lLPJj2k3k2j1JOKpj5j1NK3K9K0N%J2K4J5j8n4o0l1PK5J9
$$ plain form
9705 91 60 43 38 35 28 21 25 43 58 58 55 74 117 154 162 152 151 160 160 140 105 68 36 17 12 17 27 41 55 61 60 64 84 119 159 200 233 245 226 194 178 183 193 192
9686 192 186 191 211 234 252 257 249 228 203 182 173 178 192 198 186 158 126 102 90 86 83 73 60 58 78 105 116 101 74 55 51 59 75 91 100 103 108 115 114 98 73 49 31
9667 31 21 18 15 6 -4 -13 -23 -44 -71 -80 -56 -10 31 57 69 74 70 65 64 65 62 57 66 95 137 171 183 176 163 161 176 197 205 193 163 125 89 76 99 148 200 237 256
9648 256 258 242 213 182 154 124 95 78 77 78 71 63 67 75 83 102 143 192 210 182 123 61 14 -8 -7 5 11 5 0 0 1 5 26 68 110 125 115 99 90 82 70 58 53 54
9629 54 58 55 39 11 -11 -15 -3 7 18 42 79 111 123 128 144 173 202 224 238 241 229 203 179 169 176 187 188 179 169 172 184 190 182 169 165 166 156 136 116 104 93 77
9611 77 67 75 99 124 135 135 136 144 147 137 124 125 143 163 174 180 185 180 160 136 124 117 95 58 28 21 34 56 80 103 119 127 133 141 147 147 144 144 146 151 161 174 182 174 148 111
9591 111 74 48 41 51 67 83 98 111 112 99 84 79 85 92 104 123 140 147 147 151 156 148 130 117 115 112 96 73 59 55 53 45 34 19 4 -7 -14 -22 -31 -30 -7 33 80 121
9572 121 156 183 202 214 226 236 236 222 201 182 172 169 172 179 180 168 145 123 112 113 119 121 114 99 88 93 116 145 165 170 170 182 206 221 203 149 89 58 65 90 109
9554A09QRJ8K0Pj3k1j1RJ4lk5k6pRP%PJ9J5lnJ4L5L2Mk4l9l5k2p%koj1j7k1j3J0L1L3K1J4
9536A34J6J6Oqj0OK3L3K6J1krj4k2k7j9mRJ5J5Pj3l6m2k9rLJ0J9K7K9K9K8J8%j7j9qjoj5k5
9518A45m0n2m9k8j1ojJ4L0K8Kk6l2k3qKJ1K1K7K3Oj0j4qLJ5K6L8L9L0J6J2J2Qkj3k3k9k8j9
9500H6qlKJ9L7L5Rj9l0k9l3l6k5lJ6K7L6M5M8L9J8mk5l4k4plj2j6%K0K8K1Nj2j9rPMj7k8o
9482A00K4K7Jk4k8j9rOK4L4L4K6K0J2LLQRmj6j8j5j0lQJ9K0J2%j2k0k0j7j6j8j6nNJ1ROmj6
9463A31k3j6NL2N2N2K1k0m1l4k3k7l5l0j5nJPJ6K1K3L0L3J8kkJ5J8rl7l7j4QJ3J1RJ1J5J5
9446A87Nj7l3k9j7rjJ8M0M4K7PJkj3k5j8JRLnjPjk3l8l0oJ2J6J2RNjpj0j2j6j7rKOKomJ0K3
9426I6K8K0Mrj5j1opj0lJ7L1K3mk6k4mJ3J7J2PK%LQQLnrj9k9k7rJ2J0j3l4l5k1pRK4L2K5J4
$$ plain form
9554 109 117 126 144 164 171 158 137 126 135 149 146 121 95 88 97 104 104 111 130 145 142 137 151 186 218 222 198 159 124 102 95 95 93 87 76 59 38 25 35 66 99 120 134
9536 134 150 166 172 164 154 160 183 216 242 253 251 242 228 206 179 160 156 165 180 195 202 189 153 111 82 73 76 86 105 132 161 190 218 236 236 219 200 192 191 185 170 145
9518 145 105 53 4 -24 -35 -41 -42 -28 2 30 32 6 -26 -49 -57 -55 -44 -23 4 27 33 23 9 1 4 19 45 83 122 152 168 180 192 200 198 185 162 133 105 86
9500 86 78 75 77 96 133 168 177 158 128 99 66 30 5 2 18 45 81 126 174 213 231 227 202 168 144 137 134 122 106 106 126 154 175 180 168 149 140 147 151 134 106 100
9482 100 124 151 152 128 100 81 72 78 102 136 170 196 216 228 231 234 242 251 247 231 213 198 188 185 193 212 232 244 244 232 212 192 175 159 141 125 120 125 136 145 151 147 131
9463 131 108 92 97 129 181 233 254 234 193 159 136 109 74 44 29 24 25 32 48 69 92 122 155 173 171 169 184 202 193 156 119 105 113 126 137 146 157 172 187
9446 187 192 175 142 113 96 87 86 104 144 188 215 222 223 221 208 183 165 166 175 178 173 172 179 178 155 117 87 81 93 109 121 130 135 134 127 117 105 89 72 63 65 71 73 67 63 73 96
9426 96 124 144 148 139 124 113 107 100 90 87 104 135 158 154 128 104 100 113 130 142 149 151 151 154 162 170 173 168 159 140 111 84 75 87 97 84 50 15 -6 -13 -4 20 52 77 91
9407I1J1J8J9J2Kkoj1j6j5j2nOJ9K2J1nrk%oqKJ2Nj8l7l1nJ7J6%j1lPJ1J2K0K7J8mj6oJ0J1
9387A51PPJ5J3%j1pOJ6J2mk6l5k5oJ0J6J5Oj4l1k9qLkj4j2oljJ2L2L9K5J0RJ2OkJJ3J3mj9
9368A90j4PK3K4J5Ok%PPlj2JK4K0j1k8oK5K8Oppj6l0k3mJkK6Q0J22J58K44L57L49J26j90l70
9351A121l36k07j21q7n3k0j2k0j2ok7n5n1j9%mlJ3J9Pqrrj9k8j9lONjmrj5j6j8rOJ9J7RMK
9333B8qk4l2j6J3L6M2L0RnnPPoj6j3mKQK0K8K1QKOPOLjpj7j9pJ2K6K5Ok1m2m5l1j2%OJ3K5
9313F5M3N7N6L9J2qk4l4l3j8kkj9l0k2nJ0J4J0kj5j6KK2K6J9J2Nrk5k8j3jJnonmMJ8K6J8L
9294A36%PNj3k9k0%J0Noj1j2j0jPLj0j4mRRKKJ0J3Kj0j0NJ7K2J8J3PkrpjJnj0ooj4k6k2nJ0
9274E0RPJ1J5Qqj6j4nnpj0pkJ0K0K5J7J0QRLj2j7%K9M1K9Pmmj0j8j6JJ5J2j%J4J8%l0m1l0
$$ plain form
9407 91 102 120 139 151 153 151 145 134 118 103 91 86 92 111 133 144 139 130 128 128 122 114 116 128 133 115 78 47 42 59 75 75 64 61 68 79 91 111 138 156 152 136 130 140 151
9387 151 158 165 180 193 193 182 175 181 197 209 205 179 144 119 113 123 139 154 160 146 115 86 78 81 79 65 53 47 44 43 55 87 126 151 161 170 182 188 186 187 200 213 209 190
9368 190 176 183 206 230 245 251 249 249 256 263 260 248 249 273 293 282 254 248 273 301 307 300 293 277 247 224 220 221 219 245 325 447 605 849 1206 1555 1681 1491 1121
9351 1121 785 578 457 370 317 297 285 265 253 247 220 165 114 95 95 91 88 101 120 127 119 110 101 82 54 35 32 38 43 42 38 29 14 -2 -20 -29 -23 -4 13 22 26 28
9333 28 20 -4 -36 -52 -39 -3 39 69 78 73 68 75 82 76 60 47 43 45 53 73 101 122 130 132 138 145 151 154 153 146 129 110 103 115 141 166 172 151 109 64 33 21 21 27 40 65
9313 65 108 165 221 260 272 264 240 206 173 155 153 151 132 102 80 75 85 99 109 107 92 76 78 100 126 145 157 162 153 128 100 87 86 87 82 76 71 67 71 89 115 133 136
9294 136 136 143 148 135 106 86 86 96 101 95 84 72 62 61 68 71 61 47 43 52 61 63 65 75 88 90 80 70 75 92 114 132 145 152 150 141 134 133 134 129 119 113 107 93 67 45 40 50
9274 50 59 66 77 92 100 92 76 62 57 52 45 35 28 26 36 56 81 98 108 116 125 128 116 99 99 128 169 198 205 201 197 187 169 153 154 169 181 180 180 194 212 212 182 141 111
9254A11j8j5j7oK0L6L0J4QJ4J2pl0m4m2k8oK3L9L5J8Mjrj8j9j3j2k0j5J3M8N2K8Kn%pk6m1
9237A08l7j9JROkrok%lm%M%mJJ8L0J7j6l9l6j8j3k0k2pPKj0rJ0K3J7RJ7L4L9K7J2Koj6j7o
9217G2PJ1POOMLNJ0Kj6k6j0J9L6K7PomKQJ0J3J2Kj5k4k1j3j1j8k3j5%J0Lk1l7k3QL1J8qj1
9198C7J2K7K1QPPkj2pLok5l3j4J6L5L3K0ONJ1Pk1n2n9l7j8j2rLJ4Mrj0NJ7J6J1MlpjJ2J9J3
9178C6J0K3L9L9J9ok2k1j5j3j9k6k1kK0L3L2K0Mj0j7j3kOJ3J5J7Qqj6pJ2J6Kj5j3%Nj%J6L2
9160A70K9J6ONNkj2k1k9l2k9k3j4mPJ2Noj3k0k6j4K0N3M8J6mNJ5Oj1j2mkjPJ5Mk0k6qJ3J5
9141A39LprrnJ3L8M8L4Kk4l0j9j3j6j9j3lNJ3K5L0K4J3J6L0L5K2ml3n8o5m3nJ6J6J0QOpj2
9124A52jJ9K4K0J9K0Qj7l5l3j9qj1j9k2j4lOJ0Mqk4l3k2%J6J4Jj6k8l1j7J0K4Nk3k9pK0L4
$$ plain form
9254 111 93 78 61 55 75 111 141 155 163 177 189 182 152 108 66 38 32 55 94 129 147 151 150 141 123 104 91 79 59 44 57 105 157 185 187 182 182 175 149 108
9237 108 71 52 53 62 68 66 57 51 49 49 46 42 42 46 46 42 43 61 91 108 92 53 17 -1 -14 -34 -56 -63 -56 -54 -64 -73 -63 -40 -23 -14 3 37 76 103 115 117 111 95 78 72
9217 72 79 90 97 103 109 113 116 121 131 133 117 91 81 100 136 163 170 164 160 162 170 180 193 205 207 192 168 147 134 123 105 82 67 67 77 80 59 22 -1 7 38 56 48 37
9198 37 49 76 97 105 112 119 117 105 98 101 95 70 37 23 39 74 107 127 133 138 149 156 135 83 24 -13 -31 -43 -52 -49 -35 -31 -40 -50 -45 -28 -12 -1 3 0 -7 -8 4 23 36
9178 36 46 69 108 147 166 160 138 117 102 89 70 44 23 21 41 74 106 126 130 120 103 90 88 94 107 122 139 147 139 123 116 128 144 146 131 118 118 123 122 122 138 170
9160 170 199 215 221 226 231 229 217 196 167 135 106 83 69 65 72 84 89 83 70 50 24 10 30 83 131 147 143 148 163 169 158 146 142 140 139 146 161 165 145 119 111 124 139
9141 139 142 135 126 117 112 125 163 211 245 247 223 193 174 161 145 126 113 110 115 128 153 183 207 220 236 266 301 323 319 286 228 163 120 115 131 147 157 165 171 164 152
9124 152 151 170 194 214 233 253 261 244 209 176 157 149 138 119 97 83 80 86 96 100 92 68 35 13 13 29 43 44 28 0 -31 -48 -38 -14 -9 -32 -61 -68 -48 -14
9106a4M0M2L2Lk2l0j8%J3J8J3KLJ4K4J5jjJ5K3Pj4j4J2L5L3J0j9l1k5rPJ4Rjj3k4l5m2l6j4
9088B1J7L6L3J4j1l0l2j8KJ5J9J6J5J3J1PQROMK%mm%jnqkOLnoQJ7Lk2k9j4PRjrj1j9k6k0%
9068B4J4J1QK0L8L1Lk1k0olj4k6k1lJ8K9K1Noqj5k8l1j3J6L2K4NLJ9L6K9jk9l4k7k4k3oK3
9050E0L7K3LJJ1J3MjOJ2Rjj1j8k0j5j1j4j9j5LK1K4J3KljNOL%%MNLPJ9K9K8J5M%qj9k4j8r
9029A53rj2nJ2K0Mk1k9j2QJ1NOJ2J5Rmj4j5pJoj6j1MNk0m3l0NK5K4K4L1K8J4QK1L2K5J0OK
9011B66j4k5j3J1K3J3jj6l3m8m2j7NJ5K1K8K3%k1l0k5j6mJ3K4K0Npj3j6j7j5j2j2j9k6k5j4
8994a4ok%J0K7M2L5Pk0k9j3QJ4jk0k6j5%L%qqmoj5k4k1OM2O4N4J9j4k2rRRj1l3l2rJ3J8J1
8975B9MMJmj2k1k9k3JK6K9J7QPLqj4j1jRJ6J3lk3k8j3PJ9K2J7RLJ2K5K5RlNJ6J0rk6k7j9m
$$ plain form
9106 -14 26 68 100 103 81 51 33 33 46 64 77 79 82 96 120 135 134 133 148 171 178 164 150 162 197 230 240 221 190 165 156 163 177 186 185 172 148 113 71 35 21
9088 21 38 74 107 121 110 80 48 30 32 47 66 82 97 110 121 128 136 145 151 155 157 157 153 149 149 148 143 135 133 139 142 137 131 139 156 159 137 108 94 101 110 109 100 89 70 44 24 24
9068 24 38 49 57 77 115 146 149 128 108 102 99 85 59 38 35 53 82 103 108 102 94 79 51 20 7 23 55 79 84 87 106 142 171 170 141 107 80 56 33 27 50
9050 50 87 110 113 114 125 138 142 141 147 159 168 167 156 138 118 103 92 78 59 44 47 68 92 105 107 104 103 108 114 117 117 117 121 126 129 136 155 184 212 227 231 231 223 204 180 162 153
9029 153 144 132 127 139 159 163 142 113 101 109 120 125 131 143 158 167 163 149 134 127 128 122 106 95 99 104 84 41 11 16 41 65 89 120 148 162 170 191 223 248 258 264 266
9011 266 252 227 214 225 248 261 260 244 211 163 121 104 109 124 145 173 196 196 175 145 120 104 100 113 137 157 162 155 142 126 109 94 82 70 51 25 0 -14
8994 -14 -20 -22 -22 -12 15 57 92 99 79 50 37 45 59 58 38 12 -3 -3 0 0 -8 -16 -20 -26 -41 -65 -86 -80 -38 26 80 99 85 63 54 63 72 61 28 -4 -13 0 18 29
8975 29 33 37 38 34 22 1 -28 -51 -50 -24 5 22 30 37 40 32 18 7 6 15 31 44 41 18 -10 -23 -16 3 25 42 51 54 66 91 116 125 122 127 143 153 144 118 91 72 68
8956F8QJ1PJ0K1L2K9J2qk4l8m6m0k3KK7L8L1J2%kmo%RQoj8j3ookRJ0lpJ0K8J7rk4k7l0l3k3
8936ApnoJ3L8M0J3j0j4j8k8k5j0Jqj0J1L5L8K3J2Lj6l2k8rjoj2nkpj5j8pJ5L8M3K7Oqj3j2
8918B5ML3N3M3J3j0j8j5mJ7L8L7Pk9m4l4pJ6J9Lj9l4l1j9jRRNRJ9K2K4L5N3M8Lm5n6l7j8j1
8900A12KJ3Qqj0PJ1j0k3qJ2Nj6k5k1k6l3k5JJ7Qj5k8k7j8oOJ1J2J8K6K8J6J0J3K1K6K7K6J5
8883A52rl4l9k1kMMJ1J8J0j9m4m1j7OJ4J2PK%OJ4J1nk1j8%J5J3rl0k9%K8K8J3NJ4Rj6l5k5
8864a8jJ1J0J2K2K4J7RKnj3j4rlPK0K9J7rk9k4jK7M5M6K9Rmj5l1n1n2l1PL5M6L6J4oj7j4j
8846A26J5K5J4j1l0k5lJ2J2Nmj6k7k4qRJ3J4J5J0mj0kJ0Ppj5j3oJJ0K2K5J6mk4l2k7j2LJ1
8828G1J3J0MlokJKjpj8k6j5J1K8J9mj1MJ9J6Mmrj7k1j7mKLOK0L0K5Qj0k1k4j7%K0L0K5J3K
$$ plain form
8956 68 76 87 94 104 125 157 186 198 190 166 128 82 42 19 21 48 86 117 129 129 127 123 117 117 126 134 128 110 97 91 85 83 92 102 99 92 102 130 147 138 114 87 57 24 1
8936 1 -6 -11 -17 -4 34 74 87 77 63 45 17 -8 -18 -17 -25 -35 -24 11 49 72 84 87 71 39 11 2 1 -5 -17 -22 -24 -31 -46 -64 -71 -56 -18 25 52 58 50 37 25
8918 25 29 62 115 158 171 161 143 128 124 141 179 216 223 194 150 116 109 125 144 147 128 94 63 44 43 52 61 66 75 94 116 140 175 228 276 279 234 178 141 123 112
8900 112 114 127 135 127 117 124 135 125 102 94 106 111 95 70 49 23 -10 -35 -34 -17 -9 -24 -52 -79 -97 -103 -97 -86 -74 -56 -30 -2 14 24 37 58 84 111 137 152
8883 152 143 109 70 49 47 51 55 66 84 94 75 31 -10 -27 -21 -7 5 12 14 14 20 34 45 40 19 1 1 16 29 20 -10 -39 -39 -11 17 30 35 49 58 42 7 -18
8864 -18 -19 -8 2 14 36 60 77 86 88 83 70 56 47 44 51 71 100 117 108 79 55 54 81 126 172 201 210 206 191 160 109 57 26 33 68 114 150 164 158 141 127 126
8846 126 141 166 180 169 139 114 111 123 135 140 136 120 93 69 61 70 83 97 112 122 118 108 106 116 123 116 101 88 82 83 93 115 140 156 152 128 96 69 57 60 71
8828 71 84 94 98 95 89 87 88 90 89 82 64 38 23 34 62 81 77 66 70 89 105 109 105 96 79 58 41 37 39 42 48 68 98 123 131 121 100 76 59 59 79 109 134 147 149
8809A49j1k7l0j4QJ8J2M%JQK2L0K0%j5j8j6rQK9K5ol5l3j1JkmRK4K7J4qk4k1KK1J7mj3JJ8
8790A67K1Oqj0nlqj0LK3K3mk5j7KKk3l8l7l2l0j5J8L7K5MKJ2%l1m3k4OK8M1M4L1Kk4l0k6k0
8772C4j4LK8M4M3L2J9Nj4k7k8j7jJ1J7K1K4K8K6J6lk2l1k4pQJ6J6J2kk7n2o5n4k1J0K8K3J3
8755F8J4K8L3K0JnJLjppjPPj4m1m7j9J3J2j4k5j0Ook5k3LK6K3J3NLJJKNJ1J4J3jj8k2j5j0
8736B2j7k5k6j4kJ1K5L7M1L4K3J6Npj2pmlLJ3K1J4QJ2K0J5nj7j5j2j8k7k4j3kMRJ1LqoJ0K4
8717A17K1QjLJ3J7Nj3k3j7lLKJNRJ3J6J4LqrLRjj5k5k9l2l1j5OK0K4K1K0J7Poj2rKJ3J5Nj0
8697A53j5oRJ2lk7l7k6mRJ1Nrk5l1j2J9L2J5kLK3K7J0nlMpk7l2j9%J2J5J8K6L8M7M1J7k0m3
8679A93l8j3PQnj4j5j0pmMJ3J8J4R%ljMPONNOLjnprnLQKj5k9k7j5ommOK0K8J3j4m0m6l6j6
$$ plain form
8809 149 138 111 81 67 75 93 105 109 109 110 118 140 170 190 190 175 157 141 132 140 169 194 188 153 120 109 110 108 104 113 137 164 178 170 146 125 127 148 165 161 148 149 167
8790 167 188 194 186 176 171 168 160 150 153 176 199 195 170 153 155 157 134 96 59 27 -3 -18 0 37 62 66 68 80 80 49 6 -18 -12 16 57 101 132 134 110 80 54 34
8772 34 20 23 51 95 138 170 189 194 180 153 125 108 107 118 135 156 180 208 234 250 247 225 194 170 163 171 187 203 215 213 186 134 69 15 -6 4 32 55 68
8755 68 82 110 143 163 164 159 160 163 162 155 148 147 154 161 147 106 59 40 53 65 51 26 16 22 16 -9 -32 -29 -3 20 33 38 41 42 43 45 50 61 75 88 87 69 47 32 22
8736 22 5 -20 -46 -60 -62 -51 -26 11 52 86 109 125 130 123 111 104 100 97 100 113 134 148 156 168 188 203 198 181 166 154 136 109 85 72 70 74 83 94 97 89 83 93 117
8717 117 138 146 145 148 161 178 183 170 147 130 127 130 132 133 138 147 160 176 190 193 185 176 179 188 187 172 147 118 86 55 40 46 66 90 111 131 148 155 149 137 128 130 143 158 163 153
8697 153 138 132 141 153 150 123 86 60 56 65 76 81 72 47 16 4 23 55 70 68 71 94 121 131 126 123 127 120 93 61 42 42 54 69 87 113 151 198 239 256 236 193
8679 193 155 142 149 157 152 138 123 113 106 102 106 119 137 151 160 160 157 156 160 167 173 178 183 189 192 191 186 179 170 165 168 176 178 163 134 107 92 86 82 78 84 104 132 145 131 91 45 9 -7
8658gMJ8J9PqqRK8L5K5MpKJ8J6pk0jK7K5nk9l0k8l8m9l8qJ7K3J4MnoMJ6J9J2%qj5j1LJ7J7
8638E5J3J7K8K1mk6k3kJ4J0nj5qJ3L3L4J3qj0RL0L5K2lk2k5j7j2j5j1MJ1mk8l4k2j5k4k9j8
8621a8JJ1J6K3K8K4J7J5Oj6l6k7OL2L2J9PMKOJ2Oj0k1j1K%j6k5k0rookMJ0J2Nqj5jK1K6J1
8602A11mmQRKjOJ4J6J3Onj6k1k4l4m9m7k6%RKmjPJ5K0J8Oj3j8nJ9L3K7Qj1j9j4%J7K8K5Qj4
8582I7k1nK0L1K0PPJ6J3qk8l9l9l1j7kMQK3N3P5O5L2Jj3j5j6j9k7l6m0l3k5j9j1%QJj3j7p
8564@LJ1K1K5J7NPK1J6j1k5mL5M4J7j7l2k9j5MK0K1J1KJlj8l5l9k9j6kJ2K0K2K1J9J9J7Po
8547A37qLK0K2Mj5j6kKrj9rJ0K0J6OMOjk1l8l7j4PRj1l2l7l3l0k7j7JJ8K7K6K1J9K0J7R%j
8528D7PJ3J9K4K8K6J9J8K1K0Mj3j6pKLmrj5k0k1j8j2JJ6K1Qj9l5l2j2J0K5K8K1Qlj2j5j4q
$$ plain form
8658 -7 -3 15 34 41 33 25 34 62 97 122 126 119 121 139 155 148 128 127 154 179 174 145 115 87 49 0 -38 -46 -29 -6 8 12 7 1 5 21 40 52 52 44 29 18 21 38 55
8638 55 68 85 113 134 130 104 81 79 93 103 98 83 75 88 121 155 168 160 150 159 189 224 246 243 221 196 179 167 152 141 145 156 152 124 90 68 53 29 0 -18
8621 -18 -17 -6 10 33 61 85 102 117 123 107 71 44 50 82 114 133 140 144 146 152 164 170 160 139 128 130 130 114 89 69 60 54 48 46 50 60 72 77 69 54 53 74 100 111
8602 111 107 103 111 120 122 121 127 141 157 170 176 171 155 134 110 76 27 -20 -46 -46 -37 -35 -39 -40 -33 -18 2 20 26 13 -5 -10 9 42 69 77 66 47 33 33 50 78 103 111 97
8582 97 76 71 91 122 142 149 156 172 185 177 149 110 71 40 23 21 25 33 56 109 184 249 281 282 269 254 238 219 192 156 116 83 58 39 28 28 36 37 24 7 0
8564 0 3 14 35 60 77 82 89 110 126 115 90 86 121 165 182 165 133 104 89 93 113 134 145 147 148 145 127 92 53 24 8 6 18 38 60 81 100 119 136 143 137
8547 137 129 132 152 174 178 163 147 145 147 138 119 110 120 140 156 162 166 172 171 150 112 75 61 68 77 66 34 -3 -36 -66 -93 -110 -109 -91 -64 -38 -17 2 22 39 48 48 47
8528 47 54 67 86 110 138 164 183 201 222 242 246 233 217 210 212 215 211 202 187 167 146 128 116 117 133 154 162 143 108 76 64 74 99 127 148 156 153 141 126 112 104
8510A04%kj2j7p%ql1m6l7rJ8K9K3J9K0K9L1J4j0j7%J4Qqj0PJ7RjPK4K8J7ONMMM%qj9k0j3j0
8491A56k0l2l6k4oJ1J7J7J6K6L8L8J9j1l6m7l6j0J1Rqj3m%omJ3K3J0j0j2lNRJ8K4Pk5m2k7
8473E5KK5L2K2jk2k5j1KOQJ4K0K0J9J7J1jj4k0j7%K2L3J9mj4j0j3k5k8j0J4K0J1kj2j8j5p
8456A03lmKQKk3l7k2QL2L6K7Ok0l0j3J6L0K3Jk2m1l8j2K3M2M4L3J3j1k4j4lj6m3m7k0RJ7Q
8439D0KMJ1J9J9J0OJ8L9M3J8j7m4n6m9l0r%MJ5K7K2N%J3J9Mj4j8j4qmjj1k9k5J4N4O2M0J6
8421A95jj5j7LK5K3Kj4j0oj6k9l5l1k1r%NJ2K3K7J2j1j5LJ6Oj9l1k0KK2K4Pj9l6k7lJ9J9%
8403F0j7j1RJ7Mq%J6J4lrkJqj3%Qlj7j2RJ9J1nj6j4kQMj4k0kK4K8Rqj0oqj5j8oJ6M1M1J6j5
8383I3j9OL1L2J5KKMnk0k4pJ9K7J3j0k0k1k3k3j1RJ4MojRJ2J2J9K4J4lqlkj5k2j1ORlrnJk
$$ plain form
8510 104 104 102 90 73 66 66 58 27 -19 -56 -65 -47 -18 5 24 44 73 104 118 108 91 91 105 113 105 95 102 119 128 127 134 158 186 203 209 214 218 222 226 226 218 199 179 166 156
8491 156 136 104 68 44 38 49 66 83 99 125 163 201 220 209 173 126 90 80 91 100 92 79 75 75 69 65 78 101 111 101 89 86 91 100 118 142 149 124 82 55
8473 55 57 82 114 136 135 113 88 77 79 85 93 107 127 147 166 183 194 193 179 159 142 142 164 197 216 212 198 188 175 150 122 112 126 146 157 155 143 125 110 103
8456 103 100 96 98 106 108 85 48 26 34 66 102 129 135 115 85 72 88 118 141 142 120 79 41 29 52 94 138 171 184 173 149 135 132 116 73 26 6 15 32 40
8439 40 42 46 57 76 95 105 111 129 168 211 229 212 168 112 63 33 24 24 28 43 70 92 97 97 110 129 133 119 101 87 79 75 74 63 34 9 23 77 139 179 195
8421 195 194 179 162 165 190 213 215 201 191 185 169 140 105 74 53 44 44 49 61 84 111 123 112 97 100 116 122 103 72 52 54 76 100 107 88 52 25 22 41 60 60
8403 60 43 32 41 58 62 54 54 70 84 81 72 70 71 63 50 50 58 55 38 26 35 54 65 60 44 30 28 36 40 26 6 4 28 56 65 57 47 41 33 18 0 -6 10 51 92 108 93
8383 93 74 80 111 143 158 160 162 166 161 141 117 110 129 156 169 159 139 118 95 72 61 70 84 88 82 81 90 102 114 133 157 171 168 160 157 155 140 118 107 113 122 119 110 105 106 104
8363A04kNOnk0j4QK3J5mj5k0k2j9mK2M3M3K5Lrj2j6k3k8k4qNJ0PjqnJ5L6M1K3%qonn%MKom
8342A47OJ5J1%nkQJ5J6OjKJ0Lj9l7l7k3pJkj9l6l7j9nlKJ5L2L0K2K0K4K4J8J4Jk6m9l9jJ9
8324I4%k5k1KJ8J7J8J8Kk5l7k2JJ0NKjomJ4L3L1Oj2nJ3J9Oj6l1l9l2j4MOmj0mJ0K1K6L0L0
8305A28K3Roj2oQJ5Qj6l8m3k8oJ4K3J7KqlJ0J4J1J4K3K9K2Mj8l7m7m1j9LQkj2j5j1JJ5K5K2
8287H0OomJ3L0L0Pk4l9k8JK1J9Jj0j1nj1l1n0n2k4J3L7L6K2Qlj1j8k5k4j3NJ8J8J3J1J4J5
8270B9J0%ojJ4L3L6K0jj1j6k5l3k4lJ2J3RPMoj2lNOLPJ9K1J4Klkjok0k9k0MJ7Lj1nJ8K8J9
8250A15J3J6J0rk3j4OJ0kj2j7k0k2j5kJ2K2K9K9J7jj3oMJ1J4J8J7Kk4m5m3k0LOqk1k0pLJ0
8232B3J4J7PppRK1J1j6l3k9rJ0K5L4L6K6J1lj4k4l0k3pPLoqjNlpLK3L8M3M7M8L8J1k1l2k3
$$ plain form
8363 104 102 107 113 108 88 74 82 105 120 116 101 81 59 40 36 58 101 144 169 172 163 151 135 112 84 60 52 57 67 74 73 65 60 75 111 152 175 175 167 161 156 151 151 155 157 151 147
8342 147 153 168 179 179 174 172 180 195 211 217 216 218 228 231 212 175 138 115 108 109 107 88 52 15 -4 -9 -12 -10 5 37 67 89 109 133 157 175 189 190 164 115 76 75 94
8324 94 94 69 48 50 68 85 103 121 123 98 61 39 40 50 55 57 56 50 46 60 93 124 130 118 113 126 145 151 135 104 65 33 19 23 29 25 15 11 21 42 68 98 128
8305 128 151 160 154 142 136 144 159 167 151 113 70 42 36 50 73 90 92 84 81 91 105 116 130 153 182 204 208 190 153 106 65 46 49 57 55 43 28 17 18 33 58 80
8287 80 86 80 76 89 119 149 156 132 93 65 66 87 106 107 97 86 81 70 39 -11 -63 -87 -74 -37 -1 21 29 26 15 -3 -28 -52 -65 -60 -42 -24 -11 0 14 29
8270 29 39 39 33 32 46 79 115 135 134 123 107 82 49 25 22 34 47 56 63 67 61 49 46 51 57 60 67 86 107 121 123 120 118 117 111 91 62 42 46 63 66 55 50 68 96 115
8250 115 128 144 154 145 122 108 114 124 122 110 93 73 51 36 34 46 68 97 126 143 142 129 123 127 138 152 170 187 189 165 120 77 57 60 66 58 37 17 10 13 23
8232 23 37 54 61 54 47 56 77 88 72 39 10 1 11 36 70 106 132 143 140 126 102 72 49 42 49 52 46 38 37 42 39 32 35 58 96 139 186 234 272 283 262 230 207
8213B07oJKJ0K0K3J2nj0JJ0Mj4l3l9l3k2j3plKMOMKMJ2J8J6Lj4k3j8qoj2j7rNJ3J0lj4k1k1
8194C8j8j1kNNrk0j7jJ0POJ8L3L1J7J0RMj3k6k7k7k4j3PJ5QKJ7L3K4JpMJ0JJJ8L0J4j6k8k0
8175I9j0qqjONmj1j7j3mQPnj1KK8M5L8K0%j6l2m5m1j3K4L9K1j7m4m1j8LNlqLK0L2K9K0K0K5
8156A29K5J2oj9j7j2j3k2l3l7k7j6okLJ0J7K4L5M4M0J5j6k2qkk6n1l9MM2N0M1L1K1Jk3l4l0
8139H3j6kQPqk4k9j8jJ5J9Rrj3kQJ1RJ3J1%j0lJ5K3K0K4L4L0Pj5j9j5j1oOJ2nk8l2j1J2J7
8120A16RLNPkj6k4j6LJ4Qrk0j2JLpj7j1J1K8K4Jj2lJ9L1K5Qqj7j8rLRLqk0k7k4rJ0K5K3Lk2
8100H1l5k9j6j0rkPLj3j8mJ2RjKJ7K0J2NRJ5Pj0k2k0kK4L9L2J9J4J7J1j0k8k3mQOjmKJ0J4
8081A34QmrjQNnj3j2nkj1k2j7J1M5M8J7j6k4j3mPK1L4K9Rqj4j5j4oORmj6j3LJ4J6J5J8J2l
$$ plain form
8213 207 201 202 204 214 234 257 269 264 254 255 265 269 255 222 183 150 128 115 108 105 107 111 117 121 123 127 139 157 173 176 162 139 121 113 107 95 78 69 74 87 97 94 80 59 38
8194 38 20 9 7 12 17 8 -12 -29 -30 -20 -13 -7 11 44 75 92 102 111 115 102 76 49 22 -2 -15 -8 7 15 17 34 67 91 92 85 89 99 100 101 119 149 163 147 119 99
8175 99 89 81 73 72 78 83 79 68 51 38 34 42 49 44 33 35 63 108 146 166 166 150 118 73 32 19 43 82 103 86 42 1 -17 -14 -9 -12 -20 -17 3 35 64 84 104 129
8156 129 154 166 160 141 124 112 99 77 44 7 -20 -36 -42 -44 -41 -31 -14 10 45 89 129 144 128 106 98 96 70 19 -20 -16 26 76 117 148 169 170 147 113 83
8139 83 67 65 73 80 72 48 19 1 0 15 34 43 34 21 19 27 38 47 60 71 71 61 58 73 96 116 140 174 204 211 196 177 162 151 145 151 163 158 130 98 87 99 116
8120 116 125 128 133 140 138 122 98 82 85 99 107 98 78 66 67 70 63 46 35 46 74 98 99 87 84 103 134 159 167 159 142 124 115 118 127 130 122 102 75 51 42 52 77 100 103 81
8100 81 46 17 1 -9 -18 -20 -13 -10 -23 -41 -45 -33 -24 -25 -23 -6 14 26 31 40 55 62 52 30 10 8 32 71 103 122 136 153 164 154 126 103 99 107 113 112 108 110 120 134
8081 134 142 138 129 128 136 141 136 123 111 106 104 93 71 54 65 110 158 175 159 135 122 118 125 146 180 209 218 210 196 181 167 161 167 176 172 156 143 146 160 176 191 209 221 218
8062B18j7j6lJj3k8k1MK1J7Njkoqppj6k4j3J0K1J5NJnj7k7k3oJ6L6M8M1J5j2k8l3l1k6j3L
8044G4J3J0oj8j6KJ8Pk5m7l3jK2K4K0K0J4Kpo%NNQJ8L6N3N5L0j0l9m3k6kJ9K5J0k1m4m5l7
8026F4k9k0KK8L9K9J6J7K1J9J0QJ1J0QJ0Pj1l9n3m1k2j2rmkj0k1j2J6L9L8K2Noj1j2j2j2q
8009G3OK0J7lk2k7k2j1PK4J9rl2l0j0%jOK4K8J5k%J2K3J9kl3m8l0%J0pk2j5LPpj7j0J0L1M4
7990C8M2K6RMJnmJ1K5J5j0k2pJ3J6Om%RJ4Mj3k3j3NJ5R%pk0l8m3k5%J2QPP%j7l0k3rOJ8L5
7970D2M0K5JpRK5J4k0m7m6k2NK0L0L1K5J2kqoKP%k4m5m2j1K5L7L1K3K4J9Kj8k8k4j9j7j2L
7952E4K0L0K2lk7l8k8j1MJ3K1K4K4K0J7J6J1Loj2j7k7l7l5j9kJopPK4K3Lj5j5kMKMJ5J8Mj2
7934F5j6j0j3k2j5JJ0LLJ6L0K8J7J5J5Kj2rJ2K0Nj0nJ4J9Opqmjj%OJ3Qqk5l2k8k4j9qRJ8J0
$$ plain form
8062 218 201 185 182 183 170 142 121 125 146 163 168 167 165 159 151 144 137 121 97 84 94 115 130 135 136 131 114 87 64 58 74 110 158 199 214 202 174 141 110 84 71 74
8044 74 87 97 91 73 57 59 77 84 59 12 -21 -22 0 24 44 64 78 80 73 67 67 72 77 85 103 139 192 247 277 267 228 185 159 157 176 201 211 190 146 101 64
8026 64 35 15 17 45 84 113 129 146 167 186 196 204 215 225 233 243 250 239 200 147 106 84 72 63 59 57 47 26 14 30 69 107 129 134 128 117 105 93 81 73
8009 73 79 99 116 113 91 64 42 31 38 62 81 72 40 10 0 0 -1 5 29 57 72 70 70 82 105 124 122 89 41 11 11 21 14 -8 -23 -20 -13 -20 -37 -47 -37 -6 38
7990 38 80 106 115 119 120 115 111 122 147 162 152 130 123 136 152 158 154 154 163 177 181 168 145 132 137 152 161 161 154 134 96 53 28 28 40 48 55 62 62 45 15 -8 -17 -11 7 42
7970 42 82 107 108 101 110 135 149 129 82 36 14 19 39 69 100 125 137 135 127 121 123 130 130 106 61 19 8 33 70 101 124 148 167 169 151 123 99 80 63 51 54
7952 54 74 104 126 123 96 58 30 19 23 36 57 81 105 125 142 158 169 172 166 154 137 110 73 38 19 17 18 12 5 12 36 59 62 47 32 30 34 36 40 55 73 77 65
7934 65 49 39 26 4 -11 -10 0 3 6 22 52 80 97 112 127 129 117 108 120 140 145 135 130 144 163 169 162 154 150 149 148 148 154 167 175 167 142 110 82 58 39 31 40 58 68
7914F8j0k6l4l6k9j6pnNK3L1K1RJ3K2J3j1j8OL3L3J3%KOLj%lj2k1k0rNJ5K4L2K9J3j0j5JK5
7895A62L1J3j6l7m3k9jK1J9ok4k3oMKKJ3K2J6JpjNnk1k2jK3K6J3jplPJ5J5LrqMPrk7k9rJ8
7876I8L3K8Kk6m0l1j2jMNPOLLMONkj8l0k9j4RK5L0L1K2Rqj7j3KJ7K0Qj1k5k5j9j2j1k0k8k9
7856d4rJ3J8KqMK2K2Lj2j1mj0j9k0j2JJ4K4K9K1QNJ7K8J8oj8lK0K7J5LLM%lMRnk8m3l9k5p
7837HJ2K8L5K9J7Kj0j9j6pKRJ7L0M0L6J8kj5j4mNRNlj6k4j4J2K9J9rk1rOJ1RQ%j7l1l0j7o
7818A12NJ7K5K2Roj0p%NMlj2j3j0opj7k4j5J5M3M1J2j9l1l4l9l2qJ5J6KKJ4K1J2%NJ5J6J1
7800A46kk1m2m8k8%Mj0j7jK0K0Nl%%j0j2NK0J1j6k8j9lKMJ3J9J2kqnoj0%J5K0OrnOJ0PQJ6
7780F4J6ml0m5l3mK8M2L6J1j5k9k2%K3L1L1K7K7K8K3J1nj4rjnj8k6j4MJ3J0PNmk3l5l2j4R
$$ plain form
7914 68 58 32 -2 -38 -67 -83 -90 -95 -90 -67 -36 -15 -6 7 29 42 31 13 19 52 85 98 98 100 106 109 108 108 105 93 72 52 43 48 63 87 119 148 161 151 136 137 162
7895 162 193 206 190 153 110 81 80 101 120 114 90 67 61 65 67 69 82 104 120 121 114 113 118 113 92 70 69 92 118 131 130 123 120 127 142 157 160 151 143 147 154 145 118 89 80 98
7876 98 131 159 161 135 95 64 52 51 55 60 67 73 76 79 83 89 94 92 74 44 15 1 10 35 65 96 118 127 119 102 89 91 108 128 136 125 100 75 56 44 33 13 -15 -44
7856 -44 -53 -40 -22 -20 -28 -24 -2 20 23 11 0 -4 -14 -33 -53 -65 -64 -50 -26 3 24 32 37 54 82 100 94 76 73 93 120 135 138 141 145 145 142 146 155 150 122 79 40 15 8
7837 8 20 48 83 112 129 131 121 102 86 79 81 90 107 137 177 213 231 229 214 200 196 201 210 215 212 196 172 158 170 199 218 209 188 179 185 196 205 213 213 196 165 135 118 112
7818 112 117 134 159 181 190 184 174 167 167 172 176 173 161 148 138 132 125 108 84 69 84 127 168 180 161 130 96 57 25 17 32 48 50 52 66 87 99 99 104 119 135 146
7800 146 144 123 81 33 5 5 9 -1 -18 -19 1 21 26 23 23 23 13 1 6 26 37 21 -7 -26 -29 -27 -23 -10 9 21 19 11 6 0 -10 -10 5 25 31 22 17 23 33 40 48 64
7780 64 80 76 46 1 -32 -36 -8 34 70 81 66 37 15 15 38 69 100 127 154 182 205 216 211 197 188 187 182 164 138 124 128 141 151 158 163 159 136 101 69 55 64
7762F4K8L4K4J0RJ8J0k0m8m8k1NJ2LopKJ1J7J4J1J1J3J0kk1m1n0m5m1m2l7j5K1M7N2M2L2K0
7745G6J0PJ6K3J5%pJJ0J0pk9l7k4jOrk2j5KPjrj2j2rLJ5J6NjNQRJ3K1K3Qj2k6k8k0j0KJ2K3
7725E5L2K5Jk1j8OK2J7NLOJj0j6j1nlpoMJ5J9J7J9K3K3J1j3l2l6k8j8j3j4j2LK3K6Rj0qMJ3
7706A01J8L0L6J5k2m1k4jJplJ3K5K0Rmj4j2jO%j1pJ2K7K6J8Q%qj5k5l8m0k4JQkj5j9j6j4l
7688HJ8K9J6j6l9l5j9pjQK6L9M0L0K0Rrk3k1lRLplRJ7J2M%kjLRJ7J9J7RL%ok2m4n5m8k7pN
7667a6J0J1J4K2L3L3J8lj3j4rMK2L3J8j6m2m0j4J4K2Kk3k7j3qk3l4k1NJ8K2L2M4L5Nj4j5r
7651F3j4j9j5rn%Jnj0LK7L2Oj9j3RJ4nj5JK7L9L2J5Jpj0j4j2lJ3K2J4kj7k7l4l3k7j9j6lJ9
7632a5L8L9K0Krj7k5k7j6lJ1K3L1K9J5pk7l4k3jJ5J8J7K1K6K4Pj5l1l0pJ6J0j6k8lL6M6K7
$$ plain form
7762 64 92 126 150 160 169 187 197 177 129 81 60 65 77 80 74 67 69 80 97 111 122 133 146 156 154 133 92 42 -3 -44 -86 -123 -138 -117 -70 -18 24 56 76
7745 76 86 93 109 132 147 147 140 141 151 161 154 125 88 64 63 69 60 38 23 25 32 31 22 10 -2 -11 -8 7 23 28 27 32 40 49 62 83 106 114 102 76 48 28 18 20 32 55
7725 55 87 112 113 92 74 80 102 119 124 127 133 134 124 108 97 92 89 82 76 80 95 114 131 150 173 196 207 194 162 126 98 80 67 53 41 44 67 93 102 92 84 88 101
7706 101 119 149 185 200 178 137 113 112 113 106 103 116 141 161 170 166 152 140 139 145 145 134 127 139 166 192 210 218 218 210 195 170 132 92 68 69 77 75 60 41 25 11 8
7688 8 26 55 71 55 16 -19 -38 -45 -46 -38 -12 27 67 97 117 126 117 94 73 70 79 82 75 72 81 98 110 114 114 112 111 114 123 140 159 176 185 188 188 182 160 116 61 13 -14 -21 -16
7667 -16 -6 5 19 41 74 107 125 122 109 95 86 90 112 145 163 147 105 65 51 65 87 89 66 39 26 18 -5 -39 -60 -55 -37 -15 17 61 96 101 87 72 63
7651 63 49 30 15 6 1 1 2 -3 -13 -10 17 49 55 36 23 32 46 41 26 27 54 93 125 140 141 134 124 110 98 95 108 130 144 142 125 98 64 31 4 -15 -31 -34 -15
7632 -15 23 62 82 84 75 58 33 6 -10 -13 -2 21 52 81 96 89 62 28 5 4 19 37 54 75 101 125 132 117 86 56 49 65 75 59 31 28 64 110 137
7615A37Nj0k6l8k5NK0Lj9j6%QK%N%qjJ9L1J7j0k5k2j2kQJ3J4J4J5J8J8J1Nkj3k6k8j2J2K2
7597A07J9J3Jk2n0n7k9NK0J7J4J7K0J3Lnj1rMJ8J4mj4lJ3J4NnolJ1K4K2%k1k6j9j8j9rJ1K3
7579G8J8lk3k9j9JJ6J6QLJknkKlqNL2N2M4J4j4k5j6kLnj6j5okpj4j6j9j6nJ0J2Kj1j6j5j3
7559a0j1l%qj4kJ5K3J2LKLMRK3L2K2Jj3qKMMJ1K1K1Qlqrj6k3j7kJ3J8J4LnlQJ9J8J0PO%j0
7538A71k1k7l1l0j5J2L2K9Mk7m8m9k9jJ7K0J2Mlj2j3rjNJ0K5L9L6J5oj4j1prj3rNK0K0Mj5
7520H0j6kRKj2j6j4k0l5m4l2qJ2K1K7L8M8M6K3rk8k3nLnk0k5k2j0NK3L2K5Mj5k1j3JJ7L1L3
7503H5K1J0Klrj4j0kLPJ5K5K5J1j0k2k3j6kJ5L0L4K0mk4k9k0qmlJJ1J5J0OJ0J8K4K4J2rk7
7485A95k3kJ4J1J%PQ%j0j8k4k7k0j1ponlpk1l0k5j2NK5M1M1K3KmJ%j4k5k3j0J%nmPJ7K1J9
$$ plain form
7615 137 142 132 106 68 43 48 68 71 52 36 36 44 46 46 51 51 43 42 61 92 109 99 74 52 40 38 46 59 73 87 102 120 138 149 154 152 139 113 85 73 85 107
7597 107 126 139 140 118 68 11 -18 -13 7 24 38 55 75 88 91 86 75 66 70 88 102 98 84 81 94 108 113 108 102 99 110 134 156 156 135 109 90 72 53 44 55 78
7579 78 96 93 70 41 22 23 39 55 63 66 67 65 60 58 60 57 49 54 86 138 182 196 182 157 141 139 142 137 121 106 100 98 91 77 61 42 26 21 31 43 45 34 18 3 -10
7559 -10 -21 -24 -24 -32 -46 -48 -33 -10 2 5 7 10 14 23 46 78 100 101 88 80 82 86 90 101 122 143 151 148 140 131 115 92 75 73 86 104 118 121 116 113 121 140 158 168 175 181 181 171
7538 171 150 123 92 62 47 59 91 120 124 97 49 0 -29 -30 -13 7 19 23 20 8 -5 -14 -15 -10 0 25 64 100 115 109 95 84 77 68 55 46 51 71 91 95 80
7520 80 64 62 71 73 61 45 31 11 -24 -68 -100 -108 -96 -75 -48 -10 38 84 107 98 70 47 42 45 40 20 -5 -27 -37 -32 -9 23 48 52 37 16 3 4 21 52 85
7503 85 106 116 118 115 106 92 82 80 83 90 105 130 155 166 156 134 111 95 93 108 138 172 192 188 164 135 115 107 103 100 101 112 127 137 143 153 171 195 219 231 222 195
7485 195 172 170 184 195 196 196 203 211 211 201 183 159 132 112 101 94 88 83 80 73 52 22 -3 -15 -10 15 56 97 120 122 118 119 119 105 80 57 47 48 48 43 39 46 63 84 103
7465A03J3Okj0j5j2pjOJ2J2RPONjqj5j7j4ojlj1j7j9j8j6j3qnoqqmJJ5K9L5K5Nqj2j5j4j1
7445a6lkppNJ6J5J2J8L2L9L2K4K2J8Nk0m1m9l3mK2K6J4OJ1J2kk0j9KJ4J0PJ3Pk2n5n1j0K7
7427D8L0Nj8k2j3KJ9L2K7Pj5k4j9pJNJ4K7L7L9L8M0L8J6j9m1l5j4mj0j7j8j6j7k2k6k2lK2
7410F5L6L3J9Noj6k3k6k4k6k3rJ3K9K9K2J4Lj4k9l4k6j1PK3L6M2M0L3K0Olqj7l2m8n0l4lK2
7393C5K4J1lkOQ%orj0qNK2K9J9Npk0l4l3qK7M7M0K2QKMQRLrj5j3pjmj3k4k2qJpj9j2K0M1L3
7372A35OqMK2K0pm1n8m6j8JRJ5K0J6Jq%J9K3RomPJ2lk3l0j5OJ1JmLJ4J3OJnj9k9j8J0K6J6
7353H4mkJ7L5L1J6jj3k5k9k0jJ5Rj4l6l9k0LJ2NllQJ8K4K1J1kj1j3j6k5l0j5J1K3J0j1j2M
7335A2J6J3OJ0J5Pj3k9k9j5JOOLJ4L4M5L8K3J2RKrj6j6j4j4j1lLQK0L2L4J4j3l8m9m9l6k0
$$ plain form
7465 103 116 122 120 110 95 83 76 75 81 93 105 114 121 127 132 131 123 108 91 77 71 70 67 56 39 20 2 -14 -27 -35 -40 -46 -54 -62 -66 -65 -50 -21 14 39 44 36 24 9 -5 -16
7445 -16 -19 -21 -28 -35 -30 -14 1 13 31 63 102 134 158 180 198 203 183 142 93 60 56 78 104 118 124 135 147 145 125 106 108 122 132 139 152 159 137 82 31 21 48
7427 48 78 83 65 43 30 32 51 83 110 117 102 78 59 52 53 58 72 99 136 175 213 253 291 307 288 247 212 198 194 184 167 149 133 116 94 68 46 43 65
7410 65 101 134 153 158 152 136 113 87 63 37 14 5 18 47 76 98 112 115 101 72 38 12 1 8 31 67 109 149 182 202 208 205 197 180 148 100 50 16 13 35
7393 35 59 70 67 65 71 79 79 73 64 54 46 51 73 102 121 126 119 99 65 32 24 51 98 138 160 168 170 174 182 191 194 185 170 157 150 149 145 132 108 86 78 79 72 53 41 61 102 135
7372 135 141 133 137 159 179 172 131 73 27 9 10 19 34 54 70 71 63 63 82 105 114 108 104 111 123 120 97 67 52 58 69 70 66 69 83 96 102 103 98 79 50 32 42 68 84
7353 84 80 78 95 130 161 177 176 163 138 109 89 88 103 112 98 62 23 3 6 18 23 20 17 25 43 67 88 99 97 86 73 57 32 2 -13 -2 21 31 20 8 12
7335 12 28 41 47 57 72 79 66 37 8 -7 -6 0 6 9 23 57 102 140 163 175 184 186 177 161 145 131 117 106 103 106 114 134 166 200 214 201 163 114 65 29 9
7317IkJ4L5N1M0Ml3l8k0pj3k8k7j3NJ2JqkJ7K5J7%kNN%MJ2J0qk5k0lJ3K0K1J4NLQKk0m5m7
7298ik9LL3M8M5K4Lmqj9k3nK4M1L3J8Lj0k6k7j1Kmk5l6k8j4j1j0kJ2K5L3L2K5J9J5J4PJj%
7279A58ok2l2j8J2L3L3K0J0jj6k7k2j0j3l5m9l7j0J0J3Noj5j1NK6L0K0QJ2K7L3K5Lj5k3j7
7263I8p%joj4j4qOJ7J4%j3j5mQQmj7j6%J5J0j0k2j7ok%J2L7O1O5M1mm2n1l9k7k0rJ2K5J4n
7244G0nJ6K8J4j5l2k6mJ6K1J2KJQJ0%k0m0m8m0k5j4j3j5mJ8L7M4M1L7L4K4Qj3k5k2j5j3j7
7227C5j4jLj1k8k8qJ4K7L1K6Oj9k6j0MNnroMJ8L1L8L2K7K1J5%j1qmj1k8l3j6OPqk0j9pmj4
7208Bk5k5qJ5K6K2J4PNMLJkkKKmj0j0%J3K0K6L6M3L7J2j5k4j7j2j8k5k1j1npoj%jMJ5K0Qj0
7188G8j5mJ0J7J3PKlj2k1j9%J5Qj6k1nJ0jj8j2RJ8J2J7L3L3Qj4oJ4J6ok9m0l8k8j4mnpJK0
$$ plain form
7317 9 7 21 56 107 147 151 118 80 60 53 40 12 -15 -28 -23 -11 -10 -18 -20 -3 22 39 39 37 42 47 47 51 63 73 65 40 20 17 30 50 71 85 90 93 101 103 83 38 -9
7298 -9 -38 -35 -2 46 91 115 118 114 106 87 64 59 83 124 157 175 178 168 142 115 104 106 102 77 41 13 -1 -12 -22 -24 -12 13 46 78 103 122 137 151 158 159 158 158
7279 158 152 130 98 80 92 125 158 178 188 187 171 144 122 112 99 64 15 -22 -32 -22 -9 -4 -10 -25 -36 -31 -5 25 45 53 65 92 125 150 153 138 115 98
7263 98 91 91 90 84 70 56 48 54 71 85 85 72 57 53 61 69 65 48 32 32 47 57 47 25 8 2 0 0 12 49 110 175 216 212 170 119 80 53 33 24 36 61 75 70
7244 70 65 81 109 123 108 76 50 46 62 83 95 97 98 106 116 116 96 56 8 -32 -57 -71 -84 -99 -103 -85 -48 -4 37 74 108 132 140 127 102 80 65 52 35
7227 35 21 20 23 12 -16 -44 -52 -38 -11 20 46 52 33 7 -3 1 6 1 -8 -14 -10 8 39 77 109 136 157 172 172 161 153 149 138 110 77 61 67 74 66 46 27 20 16 2
7208 2 -23 -48 -56 -41 -15 7 21 28 33 37 40 41 39 37 39 41 37 27 17 17 30 50 76 112 155 192 204 189 165 148 136 118 93 72 61 56 49 43 42 42 41 45 60 80 88 78
7188 78 63 59 69 86 99 106 108 105 93 72 53 53 68 76 60 39 34 44 43 25 13 22 40 52 69 102 135 143 129 123 137 153 147 118 78 40 12 -2 -6 -11 -18 -17 3
7169CM0L9K6J0%mj5l6n7n8l2OL0L0J7Kj1k6l7l7k1QL9N6M3J1k1l2k3JK3L8M7N0M2K1lj8k1
7152A30k6l0k3%K1J8%pKJ5J4NlonJQJj2j6jJ4J1pj9j8j6j9k1j2KK0L0L0K2Rok3l5l5j0K5M4
7134G2L4J0oonj5k4j0K0M3L8J2j3k2j8oRK2J7%j5j5pJQJ2Orj6qMPRK2L6K8%j9j7rj2j9j6l
7115A20PMmj3k2k4j2l%JJ2K3J9LnNJ9K2J5Jj5k4j7KJ1%j8k9l1k3%L3N4M9K6J0J2J7J5Lj6l1
7097A96l5k7k4l4m2k8lJ1Pkqj1rLK3K8J0njJ2K0K3L2L5K4Mqj1k1l7m3l6k7k2j5%RPNJ5L2L3
7078H0J4j7l7l3oJ9K1Nnlnj8k4nK9M7L2Pl%MKjmj5k9k5kK1J9rl0j7J5L5K6Onpj1k0k2j4lM
7059A6J2J9K3K0J7J9K4K4J7Noj9l2l8k9j2LLor%J8K8K2NlJ2L6M2K5kj1qj0k3l2k9j3PK4L1
7041A70K1Lj2j2j1j7k1j4mjrj5qRK3K0%k2k8j8j2j6j3J0M1N2L8J3lj0j2oJKnqrj5j9j1J0K3
$$ plain form
7169 3 43 82 108 118 118 114 99 63 6 -52 -84 -78 -48 -18 -1 1 -10 -36 -73 -110 -131 -123 -84 -28 15 26 5 -27 -50 -49 -26 12 59 109 151 172 169 151 130
7152 130 104 74 51 51 72 90 90 83 85 100 114 119 116 110 105 106 114 115 103 87 86 100 111 104 85 67 51 32 11 -1 1 21 51 81 103 112 106 83 48 13 3 28 72
7134 72 106 116 110 104 99 84 60 50 70 113 151 163 150 128 110 104 113 135 152 152 137 122 115 116 124 136 142 133 117 109 113 120 129 151 187 215 215 196 179 170 158 139 123 120
7115 120 127 131 127 114 92 68 56 53 53 54 66 89 108 111 106 111 130 152 167 168 153 129 112 114 125 125 107 78 47 24 24 57 111 160 186 196 208 225 240 243 227 196
7097 196 161 134 110 76 34 6 3 14 21 19 11 0 -9 -6 17 45 55 50 49 61 81 104 136 171 195 199 191 180 159 122 79 43 16 -6 -21 -21 -12 -5 0 15 47 80
7078 80 94 77 40 7 1 20 41 46 41 38 33 15 -9 -14 15 62 94 101 98 98 102 104 103 99 84 55 30 28 49 68 59 29 12 27 62 88 94 89 82 71 51 29 15 12 16
7059 16 28 47 70 90 107 126 150 174 191 196 190 171 139 101 72 60 63 66 60 51 51 69 97 119 124 121 133 169 211 236 234 223 215 205 182 150 121 108 115 139 170
7041 170 191 194 182 170 159 142 121 107 103 102 93 78 70 79 102 122 122 100 72 54 42 26 13 23 64 116 154 167 164 154 142 136 137 139 134 126 117 102 83 72 82 105
7023A05J6nk5l7m2l3j4PK4L6M4L5RrkJ6J8Jj4j7j1lJ3L2M0K6Kk3m1m5l7k3j5qOK1K1Lj1pO
7005E9RLmj2j9j5KJ4%l4n0l1OL3L9L0K2J9K4K7J4rk5k8k7l0k4nK1L8L5K6J7J0MJJmj2nK2M6
6987A88M1Pk6l5k3j2j1j5j8j7k0k2k0j5qrqJJ4J3KpOL7N5M9L0J4Jj2k2k7k6k6j5OK1J8Kj3
6970I8j9k9l6l1j0J4K3K1J5RJj1j9j9qjqk7l6j4J9L2J8LOJ5J8J3QKqj4pKJlMJ8K4J8J1P%j1
6950H9j6j5j7k3k4j3jLKQK3L6L1Pj5j4J0L1K7PJJ2J5%j2lPmk1j8MK1J7Mj0k4l9m2k4QL4L9
6932A01K1lj7j0%mk0k8j8MK6L8L3Mk8l2oJ5Pj6k1lJ4K1K6L7M4M0K1kj5j6nKNJ2K4K5Ok5m2
6914B15m1l6l7l5k1NK5K7Ok5l8j4K9N1M1K2J9K3J5krlMOKpk5l6k5KK0J2oj5j2qrrm%kkKNj
6895A09j4k0pJ2J8Qpj2j1qp%J2K4L0K3Jl1n1m5j7J1J7Lj0pPJ6Nj2k1j7j2pKK1L8L5K2J3J3
$$ plain form
7023 105 121 116 91 54 12 -21 -35 -28 -4 32 76 111 120 111 109 125 143 144 130 113 102 99 112 144 184 210 212 189 148 103 66 43 28 20 26 47 68 71 60 53 59
7005 59 68 71 67 55 36 21 23 37 37 3 -47 -78 -72 -39 0 30 52 71 95 122 136 127 102 74 47 17 -7 -12 9 47 82 108 125 135 139 140 141 137 125 120 142 188
6987 188 229 236 210 175 152 140 129 114 96 79 59 37 17 2 -6 -15 -23 -22 -8 5 7 0 6 43 98 147 177 191 192 180 158 131 105 79 64 70 91 109 111 98
6970 98 79 50 14 -17 -27 -13 10 31 46 55 56 45 26 7 -1 -2 -10 -37 -73 -87 -68 -36 -18 -15 -9 6 24 37 45 47 39 25 18 20 21 18 22 40 64 82 93 100 100 89
6950 89 73 58 41 18 -6 -19 -20 -17 -15 -7 16 52 83 90 75 61 71 102 129 136 137 149 164 164 152 149 156 152 131 113 117 138 155 159 149 125 86 44 20 28 62 101
6932 101 122 119 102 92 92 88 68 40 22 26 52 90 123 127 99 67 61 76 83 67 46 43 57 78 104 141 185 225 246 244 229 213 208 210 215 227 251 276 282 257 215
6914 215 174 138 101 66 45 50 75 102 108 83 45 31 60 111 152 174 193 216 231 229 220 217 221 227 229 222 197 161 136 138 158 170 164 149 137 129 120 111 107 107 105 103 105 110 109
6895 109 95 75 68 80 98 106 99 87 76 68 61 61 73 97 127 150 151 120 69 24 7 18 35 38 28 21 28 44 49 37 16 -1 -13 -20 -18 3 41 76 98 111 124
6877A24J4RML%lJPJrqNJ1LlJ0K5J2k2l8k5mOJ0J7J2ok5k2qLPJ9L0J9j1l6l4k4k1k8k2jK4L6
6858F2K6PmPK5K5Oj1rlj3l5m1k2l%qpNJ5J9J6Qpj7qQJ1j0k9k2LK2K3J3NNPJ1J1P%mKJ2J2m
6837A16k5l0j3QJ8J5QJ1J8K5K0Mj8l6l9l0j9j0jNJj0j7j2%J0J4J7J0lj1%K1L7L5J3j5l6l0
6820E1mK0K6K0J8K3J8Mmpj2k7l5k7rjjjKOJ1J8J8J2J4K4L1K0mk2l5m5m4k4PK2J2oj5j1noo
6802B6ppjRJ2PJLJ2J6J5RMKMJ3J9J3Korj3j3mPJ0Jqj1j0j6k6k7k0j1pjQRKlMK1L6L7K9K1J7
6781A69J7K0J8Oj3k5k7j9j0kNO%pj2j5oJ4L2L1Pj5j3MJ0kj3j6j4j3pLRLqj6k1k2j7ojLJ2L5
6762H4N7O1M9K9Nj9l0k2j1k1m2n2l3kJ7J3ok8l5k7j4lLNLj%J3K6K6J3PQQJnrj4k3k4pJ6L6
6743E2M6M4L3J4qk5l7l8k8j4j6l0l3oK6L4K1RNLpk1k6k2qRJ8J7J6K1L0K9J6RJ5K4J5rl3l6
$$ plain form
6877 124 138 147 151 154 154 151 152 159 160 151 143 148 159 162 159 169 194 206 184 146 121 117 123 133 150 162 156 131 109 101 104 111 130 160 179 168 132 98 74 53 25 3 2 26 62
6858 62 88 95 91 98 123 148 154 143 134 131 118 83 42 20 17 17 9 2 7 22 41 57 65 58 41 33 41 52 42 13 -9 -6 16 39 52 57 62 69 80 91 98 98 94 96 108 120 116
6837 116 91 61 48 56 74 89 97 108 126 151 171 175 157 121 82 52 33 23 22 27 28 18 1 -11 -11 -1 13 30 40 37 26 26 47 84 119 132 117 81 51
6820 51 47 67 93 113 131 154 172 176 172 165 153 126 91 64 55 54 53 52 54 60 71 89 107 119 133 157 188 208 204 182 147 102 58 34 41 63 75 69 54 43 38 32 26
6802 26 19 12 11 20 32 39 40 43 55 71 86 95 99 101 105 118 137 150 152 146 137 124 111 107 114 124 125 117 106 96 80 54 27 7 -4 -11 -12 -4 5 7 4 8 29 65 102 131 152 169
6781 169 186 206 224 230 217 192 165 146 136 134 139 145 145 138 126 111 105 119 151 182 189 174 161 165 175 173 160 144 130 117 110 113 122 125 117 101 80 58 41 35 34 37 49 84
6762 84 141 202 251 280 285 266 236 214 203 182 140 88 55 53 70 83 77 49 14 -13 -27 -30 -27 -22 -19 -20 -20 -7 19 45 58 65 73 81 82 77 68 54 31 7 0 16 52
6743 52 98 142 175 189 181 156 119 81 53 39 23 -7 -40 -46 -20 14 35 44 49 52 45 24 -2 -24 -32 -23 -5 12 28 49 79 108 124 133 148 172 187 178 145 109
6726A09j5J3L0K8J8Qok3l2k4j3j0j1pLLjkJKJPJ6Rrj9j2KJ1K2L6L6J3j3j8j4k1l6l7j4OOj
6707D2RL2M2K9Nnkjj1k2j7rj2k4k2JJ9J1qqJ0K2K3K3K8K8J5Jqj2j3pkok2l1k5rKNKkonPJ9
6687H6K8K6J0j1j6PL7L8Qj6j4loj6j2OJ1qk9l2j6QK1J7mk0j3RK3K0J2Kj1k4j7OJ8Kk3l1j7
6670E6jJqj6j6pjnj3j2LJ9K5L4M6M6J7k0l1pK2K9J0j3k9k8j1QJ8J7Nj1k7l4k2JJ9K6K2J3m
6652A21k2k6j2RJ8J2kj5k6k7j6mjJRK4L2K8K4K7K7J3j3l3l2j9j0j0j0kMJnKJ8K2Jk8l3j5%
6634C2OJ0K2K9K4J6J6J5NnkQQpj7j1nj4k8k4%K2J6j0k5j7NJ5J0mj6k2j6OL7N3L9Qj6j5JJ0
6616A59P%nkNJ1J0mk0k4j2kmj4k1j5%J5K5K2Pj2k1j6mOJ7K4J7pl2l9k3JJ6J5PkkOJ3J4J0J2
6597A38J6J1mj5qJjj1qQJ2mk1j0J9L4J5j7l7l5j8MK3K9K2J2RLrj5NL3L3ml9l6j2ql1m1j6J9
$$ plain form
6726 109 94 107 137 165 183 191 185 162 130 106 93 83 72 65 68 71 70 68 69 71 72 79 95 104 95 76 64 66 77 99 135 171 184 171 153 139 118 82 45 31 37 43 42
6707 42 51 83 125 154 159 154 152 151 140 118 101 92 80 56 34 35 54 65 57 49 59 81 104 127 155 183 198 199 191 179 166 159 157 151 129 98 73 64 66 71 73 71 65 60 67 86
6687 86 114 140 150 139 123 130 167 205 213 197 183 180 174 158 146 152 163 155 126 94 78 86 107 124 120 100 87 96 119 139 151 153 142 118 101 107 125 127 104 73 56
6670 56 55 56 48 32 16 9 8 3 -10 -22 -19 0 25 59 105 151 168 148 117 110 132 161 171 158 129 101 90 98 116 133 138 127 100 66 44 45 64 90 112 125 121
6652 121 99 73 61 70 88 100 98 83 57 30 14 10 9 10 19 43 75 103 127 154 181 194 181 148 116 97 87 77 67 65 69 70 65 67 85 107 108 80 47 32 32
6634 32 38 48 70 99 123 139 155 170 175 170 168 176 184 177 160 149 144 130 102 78 78 100 116 106 81 64 69 84 94 90 74 52 36 42 79 132 171 179 163 148 149 159
6616 159 166 166 161 159 164 175 185 181 161 137 125 123 119 105 84 69 69 84 109 131 138 126 105 89 85 91 108 132 149 142 110 71 48 49 65 80 87 85 83 89 102 116 126 138
6597 138 154 165 161 146 138 139 138 127 119 127 139 135 114 104 123 157 172 155 118 83 65 69 92 121 143 155 164 167 158 143 148 181 214 210 171 135 123 115 84 43 27 46
6579D6K8J2j0j9k2k0j1kQK1L8M9M0J7jooqj2j6j4pPJ2Jk2m0l7k3j5j9k6k2rQJ4OqrNJ9J8R
6560b6NQPJlkKJ1L0M1L2Oj4j0J0K4J8%j6k4j7mPOnj5j5%K1L1K7J1Knj6k9l6k5j1rj6k5k9j9
6541g1ML4M3K6kpJ4K9K0Jrj0j2j4j2nLJ2K7L9L1Jk8l3j6NQjrn%mrLK6L8K8J1RJ2Nj3k4j5%
6521A30QPJrk1k3j6rj4j9rJ3L1L0J9QN%j1l0m9n3m0j2J5K9L0L1K9K4J2nj6j9j8j6qJ0L2L9
6504A06K4lk2k0nRJ7J7J5Qqk8l9k9j0KK%NJ4J6Prj4LL5N4M2J5KOJk7n1m8k9j5rQL0L5J8mj5
6485A06j4lRJ2Jj6k0j6j2nK0N0N4L1J2J6K4J0j7k2kJ3Lk1l6m0l7l0j8lJ0J2lk2l7l4j7J2M2
6468A2N7L9kl0k7qkrj0LJ7K4K6K6J8Lj8l6m5l8j9RL1M3M0K2nk1j2J4K5Ll6n9m6j7OPkjJ2J0
6450Dj4n2n8k6J8M9O0N8M4J7qj4oOK3M7N7L3j4m4l7j3mj8l1k8j0J0K5L1K8Rj6l3l2j5KJ0J1
$$ plain form
6579 46 74 86 76 57 35 15 4 2 10 31 69 118 158 175 174 168 162 154 142 126 112 105 112 124 125 103 63 26 3 -12 -31 -57 -79 -88 -80 -66 -60 -68 -77 -72 -53 -35 -26
6560 -26 -21 -13 -6 -5 -8 -10 -8 3 33 74 106 112 98 88 98 122 140 140 124 100 83 79 86 92 87 72 57 57 78 109 136 147 149 144 128 99 63 38 27 18 2 -23 -52 -71
6541 -71 -67 -33 10 36 34 27 41 70 90 91 82 72 60 46 34 29 32 44 71 110 141 142 114 81 65 70 78 77 68 63 63 59 50 53 79 117 145 156 165 177 182 169 145 130 130
6521 130 138 145 146 137 116 93 77 68 54 35 26 39 70 100 119 127 132 132 121 91 42 -11 -51 -63 -48 -19 11 42 71 95 107 102 86 67 49 33 25 35 67 106
6504 106 130 127 105 85 80 89 106 123 138 146 138 110 71 42 32 34 36 36 41 55 71 78 69 55 58 93 147 189 204 206 212 213 186 135 87 58 43 34 42 72 107 125 121 106
6485 106 92 89 98 110 111 95 75 59 47 42 62 112 166 197 209 225 249 259 242 220 218 231 234 213 177 137 100 70 52 49 59 71 68 46 9 -25 -42 -30 12
6468 12 69 108 106 76 49 41 39 30 20 23 40 64 90 116 134 137 119 83 38 0 -19 -10 21 64 104 126 121 100 88 102 127 130 94 35 -11 -28 -22 -15 -17 -18 -6 4
6450 4 -10 -62 -120 -146 -128 -79 -19 39 83 100 92 78 72 78 101 148 205 238 224 180 143 130 126 108 77 49 39 49 74 105 133 142 126 93 61 46 48 58 69
6433F9J0OKnrj0qKJ3K1K3J6Lj6l1k7pQ%k1k9j0J9L4K3kk0k2j4nlj%k%J0K3K5J1npnpj6j8j4
6413Dj1qQK9L6K1MJM%rqLRNJPJ2Pqj7j0MJ1JrmJ3K0Rqj5rKJ3J7J2mj5j4noj1r%mj7j6PK1N
6391F9k3k6kJ5QkLJ3J0LJ0K2J4j5l7m1l8m5m8l4j2jMJ4K3J1j4k1J0M6N1K5NJ0L0L7K8J4%j6
6373A00k4k0oRK0L3L9K4mk1j3QK0J3nk4l5k7mJ1Oj1k2k4j8lK4M2L0lj8JK5K4Kj8k3j3JJ5J7
6356A28Ork1k5k8k3qLKnLJ5J3qk6k4j3rj4j4%K2L7L7K1PNJ6K2J4mk1k5j4MJ7J5QKlj0j3j0
6337G0lj%PJ3Rj0k2j4NK0K2J1nj7j7p%jnrj1qLJ7K2J6QMKjJ0L0L4J3j3k1j0moJJ1Pj0j7kJ9
6317A40J8Kqppj3k2k6k2j4jJ7L8N0M1Rk6m4l9k1qnMK7N5N9K5k1m3l3j4kMJ2J2pl0m1l7k6o
6299a0J8K8J3plJ3J4jnOJ2LqqnlQK7K8nl8k6K3O1N0Pk9l7k8k5l1l5k2nLnpPK2K4J2NMOJ0J4
$$ plain form
6433 69 79 85 87 82 73 63 55 57 70 91 114 130 133 117 86 59 52 60 60 39 10 0 19 53 76 74 54 32 18 13 10 9 9 7 7 17 40 65 76 71 64 59 52 36 18 4
6413 4 -7 -15 -7 22 58 79 83 84 88 88 79 71 74 83 88 89 96 108 115 107 90 80 84 95 96 87 83 96 116 125 117 102 93 95 108 125 137 133 118 104 99 93 82 73 73 69 52 36 43 64 69
6391 69 46 20 18 33 41 39 42 55 65 68 78 100 114 99 62 21 -17 -62 -110 -144 -156 -157 -153 -139 -116 -105 -119 -140 -130 -84 -33 -8 -3 7 37 74 102 116 116 100
6373 100 76 56 50 59 79 112 151 175 171 150 137 145 165 178 173 149 114 87 83 94 100 89 67 43 25 22 46 88 118 115 97 98 123 147 149 131 108 95 96 111 128
6356 128 134 125 104 79 51 28 20 23 25 20 23 38 51 43 17 -7 -20 -29 -43 -57 -57 -35 2 39 60 67 72 88 110 124 120 99 74 60 64 81 96 104 106 103 93 80 70
6337 70 67 66 66 73 86 95 85 63 49 54 74 96 107 102 85 68 61 61 60 55 46 35 27 30 47 69 85 93 97 99 98 108 138 172 185 172 151 141 137 131 132 143 150 140 123 121 140
6317 140 158 160 152 145 138 125 103 77 55 41 40 57 95 145 186 195 169 125 86 65 57 52 56 83 138 197 222 201 158 125 111 109 113 125 137 130 100 59 22 -4 -10
6299 -10 8 36 49 42 39 52 66 65 60 66 78 81 73 65 60 57 65 92 120 115 77 51 74 135 185 192 163 126 98 73 42 7 -15 -20 -17 -22 -29 -22 0 24 36 41 45 51 61 75
6279G5Qj2l5l9k9j0PJ6J4NOJ2J1kj2pJoj6nK8N3N3L0Kk3l5k3jRLqj3j7j5%K7L9K5Jro%NNj
6259A11j5k2j4jOOL%llKJrk0k0j4oMJ8K9L1K2Qj2k7k7pK0L4L5K9J8lk9m3k9JK8L5K0nk0k1
6240A11k1k8l7k9rOJ0J4K0K0MrkK0K7Nk4k8mK0K6J8J4J7J7J1L%konMJ4J1mj9k3j5qj3l2m0
6222C4k5MJ8J1NJ0J7J1%OK7L2J2k1m0k8kJ7J1%KK0K5Nj8j6OK0J6Onk1l8l5j1OKnOK1J4qj8
6204G3kK4L1J3j2k7k2lJ3J8J5O%JJ1J8Pj9l1j4J5K7J1rj8j6j2j2j4rLJ2Qqj6lJ6K1J6J4J8
6186A44K0J8J7J4rm7p2o5l6j2KJ1J5J3J0J0J2Poj6j1KJ7K7L1K2Mj0j3qrj7k0j2LJ2J9J8J0
6169I5mqNK0J5j3m1m8l3j4kPJ2J6J7J0LJJ2K6L2K3Rmj6k8m0m2l3j9lJ0J5J5J6L0M7M9K5j0
6152A52l7l8k1kNMOK0L6M0K7Nk4n0o9o9n4l1mK0L6L7K4Rnj6k2j5%J4J8J2J0OlqjJ7L3L6K9
$$ plain form
6279 75 83 71 36 -3 -32 -42 -35 -19 -5 0 6 18 29 27 15 8 9 3 -13 -18 10 63 116 146 148 125 90 67 66 75 78 70 57 40 25 25 52 91 116 117 108 102 102 107 112 111
6259 111 96 74 60 59 65 71 74 74 71 68 70 71 62 42 22 8 2 6 24 53 84 106 114 102 75 48 41 61 95 130 159 177 174 145 102 73 74 102 137 157 152 132 111
6240 111 90 62 25 -4 -13 -7 3 17 37 57 61 52 50 70 97 102 78 50 46 66 92 110 124 141 158 169 172 172 170 164 159 163 177 188 184 165 142 127 119 106 74 34
6222 34 9 13 31 42 47 57 74 85 85 91 118 150 162 141 101 73 71 88 99 99 101 121 146 151 133 117 123 143 159 165 160 139 101 66 55 61 63 58 64 85 99 91 73
6204 73 71 95 126 139 127 100 78 75 88 106 121 127 127 128 139 157 164 145 114 100 115 142 153 144 126 110 98 86 72 63 66 78 86 78 62 59 75 96 112 126 144
6186 144 164 182 199 213 204 157 85 20 -16 -28 -26 -15 0 13 23 33 45 52 46 30 19 21 38 65 96 118 122 112 99 91 82 65 45 33 36 48 67 85 95
6169 95 91 83 88 108 123 110 69 21 -12 -26 -28 -21 -9 7 24 34 37 38 50 76 108 131 140 136 120 92 52 10 -23 -42 -45 -35 -20 -5 11 41 88 137 162 152
6152 152 115 77 56 54 59 63 69 89 125 165 192 197 173 123 54 -15 -69 -100 -104 -84 -48 -11 13 22 17 1 -21 -36 -36 -22 -4 8 18 24 21 13 12 29 62 98 127
6134A27K1J7J0ql2m6m0k0kJjkJKQJ8K8L0K2Npj1rj4k9l9k5PK8K1kj6j7j0JJ8L0L2L2L3L0J1
6116B03j4k0nOkj4j0%Ll%RJ3J2J8L4M4L1Kj4qRJ6J1kj8l6m7n0n0n4n1k8MK5K2J6J8K0Nr%K5
6097A11K9%l0l5k2j2oMJ0Kj0j1JRRQJ4K0J9J4Jj7l1l1j9pLJ0J5Rqj4LK5L5K6J5J0N%KMmk2
6078A34l2k3nJj1k0k1j5j2j0lOJ0J5L0M6M1J8llKkj2j7j9k4l1k6j4oj0mJ2K3J9NmmLJ7L2L3
6060A16J7mj5j7j4pLLj3l2k9oJ2J4OJLJ2K5L3K3PKJ3K2Rj5k7j2J3K1Nj3rJ7K9J1j3j4kj0l6
6041A29m2j4K2L0J9J4K3K6J6%j1j1nkj2k4k4oPLj0rPK2L1L6L5J7pj5pmj6l0k6j4oj1j8j9j0
6024H4RK3J5j4m1m8l5j6%K0L8N1M9L9J9jj6j7lJ4K0J0j0k7l0k3j0KJ3K0J3nk8m1m3l1qQRo
6006Ck1j7mL%lKRJ0QOJqj2mJ5L2L6J8j1k9k5mJ2J6Qjpj2j2r%J1J9J7Mrj3lJ3K4K6J4ok3k4
$$ plain form
6134 127 148 165 175 167 135 89 49 29 27 28 27 25 26 28 36 54 82 112 134 139 132 121 112 98 69 30 5 12 40 61 59 43 26 16 17 35 65 97 129 162 192 203
6116 203 189 169 164 170 168 154 144 144 147 144 144 153 166 178 196 230 274 305 307 293 285 294 310 321 319 301 265 218 168 118 64 13 -15 -11 14 36 52 70 90 95 86 86 111
6097 111 140 140 110 75 53 41 35 39 49 51 41 30 31 40 49 57 71 91 110 124 125 108 77 46 27 20 23 33 48 57 49 35 38 63 98 124 139 149 154 154 156 160 156 134
6078 134 102 79 74 75 64 44 23 8 -4 -14 -17 -11 -1 14 44 90 131 149 146 143 145 143 131 114 95 71 40 14 0 -6 -16 -20 -8 15 34 39 35 31 34 51 83 116
6060 116 133 129 114 97 83 76 79 82 69 37 8 2 14 28 34 35 38 50 75 108 131 138 140 153 175 184 169 142 130 143 164 169 156 147 164 193 204 191 177 175 165 129
6041 129 87 73 95 125 144 158 181 207 223 223 212 201 196 194 182 158 134 128 135 138 128 119 126 148 179 215 250 267 260 245 238 234 218 188 162 148 142 131 113 94 84
6024 84 93 116 131 117 76 28 -7 -23 -23 -3 35 86 135 174 193 192 176 159 156 170 190 200 190 163 133 110 100 102 115 135 148 143 115 74 31 0 -8 0 9 3
6006 3 -18 -35 -39 -36 -36 -39 -37 -28 -18 -10 -4 -3 -11 -23 -27 -12 20 56 74 63 34 9 5 17 33 41 40 33 21 9 0 0 11 30 47 51 42 29 26 39 63 89 103 97 74 50
5986E0pJ2K5K8K9K8K2Rj1l2m5m2k2KJ5J3PKKQJ8K6K7J3j2l0k6rNOLJ0J2jj9j4J0K7J3j5l2
5969A05k7j2nj0k9m5m5k3JJ1J4K5M2M2K4Kj3k7l5k4J2M2M4K0kmOJ5J8J1kj2oLLj2k6j8J0L6
5951A09L6J1j4j7j4k8n3n5k4J0J4lj0mqj5mK6L4Lk3j1K7L8J8pj6j2kJ5L2L1J1mj%j3k4j0K1
5934F4M1L3J3%lmk%QJ9K6K5J2ok0k5k1pQJ4RJJPPjqlJ5K7K5Pj4j8rJmj3j0PJ9J5%j5k2k5j8
5914A56qJok1k8k1nQJ4J6J5RKmojPJ8K2J5kj6k2j9qPJ8J4pk9l2j7%PJ1J6J8J0loklqq%J2J6
5893A30J7J3MjPK6L6K5Pnj3k6m3m2k1MJ5J5J5J8J7J0KMMlk0k9k5rPJ1Nrk0k1qQK1K7K6J8L
5875B00lMJ9J9Jj9j9LK2J9ol3m1k7lJ7K0J0mrKJ5K0J5J0J0J9L8P2J05J19J24J54K15K85L84
5859A757N68P96Q41M90j66p44r22p41m82l23k43j66j05q3p6n0k9m3p6q0n0j1J3K5K1LoNJ9
$$ plain form
5986 50 43 55 80 108 137 165 187 196 185 153 108 66 44 46 61 74 81 83 85 93 111 137 164 177 165 135 109 100 105 111 114 124 136 135 116 102 112 139 152 137 105
5969 105 78 66 61 51 22 -23 -68 -91 -90 -79 -65 -40 2 44 68 70 57 30 -5 -29 -17 25 69 89 87 83 89 104 122 133 131 119 113 116 119 107 81 63 73 109
5951 109 145 156 142 125 111 83 30 -25 -49 -39 -25 -28 -38 -42 -50 -65 -69 -43 -9 -6 -29 -40 -13 25 43 36 20 8 6 21 53 84 95 91 90 90 77 53 43 64
5934 64 105 138 151 151 148 144 142 142 150 169 195 220 232 226 206 181 160 153 161 175 184 185 186 193 200 199 191 188 203 230 255 262 248 230 221 222 218 205 195 202 221 236 236 221 199 174 156
5914 156 148 149 143 122 94 73 68 76 90 106 121 130 132 128 122 121 128 146 168 183 181 165 143 124 116 123 141 155 148 119 87 70 70 77 88 104 122 132 129 123 121 118 110 102 102 114 130
5893 130 147 160 164 163 170 196 232 257 264 259 246 220 177 135 114 118 133 148 163 181 198 208 210 214 218 215 195 166 141 132 139 150 155 146 126 105 97 105 126 153 179 197 200
5875 200 197 201 220 239 240 221 202 205 227 246 240 207 166 139 136 153 173 183 179 170 172 187 207 222 232 242 261 299 371 476 595 719 873 1088 1373 1757
5859 1757 2325 3121 3962 4452 4286 3542 2620 1879 1397 1074 831 665 560 477 401 351 322 279 203 123 73 62 75 100 121 124 118 123 142
5846A42Pj7k0LK4J7lj8k1k7l4l7k0MK1J9OPK2L0K1N%%oj1mNLlLQkk0j4J3L6L3J7O%j0k0k8
5827A37l5m0l2j0J1J9K3L0M0M1L1Rj8l8l7j6jmj8j9oPJ3J4J1%rrjLMMKnj1j4j3j7j6jK2L1
5809H2J8mj6j3nK%qj8j6kJ6K5K0J6J6J6J1Jm%LJlOK7M2L7J9jj4k0j3JJ2J1NNMnj7j3KNj4l2
5789A85l1j9j1r%RMj7l5l2j3MQKop%POkj4k3k0j0NJ5J0%mKQKrqQK7K9J7lj9k5j8JK0K8K4J7
5769A03J6J3PNJ8L2K6Pqj1j7l5m9l9j1J0QloKJ3J4Nqj2kJ2J3%rplj%Kjj4k2qJ9L4K6Oj0k2
5749I3k9k5qQJ1L%PJ6K4L0K9K0Pmj1k1l0k9j5l%kKJ1Poj1kJ2J8J1NJjpj6j7j1l%n%J9L3J7
5729A28j9m2l3qMj%J1J2kj4jK4L1J4pj5j0kJMLnj7k6k9k9k7j3QK5K7J1j2l0k8nK3L6L0J6J0
5711D3J1J7J4lk2k8j2J7L3K7QnmRK3K5J1pj6j8j5j1JJ5K1J2lj2j7j4mJ5K1J0nrnoj5j6qpp
$$ plain form
5846 142 149 132 112 115 139 156 153 135 114 87 53 16 -4 0 21 40 46 53 75 105 126 131 131 131 125 114 110 115 118 115 118 126 124 104 90 103 139 172 189 195 195 185 165 137
5827 137 102 62 30 20 31 50 73 103 143 184 215 224 206 168 131 115 114 110 92 73 67 74 87 101 112 112 103 94 93 96 100 104 106 101 90 76 63 46 30 29 51 82
5809 82 100 96 80 67 62 64 64 56 38 22 20 36 61 81 97 113 129 140 141 137 137 140 141 138 144 171 213 250 269 268 254 234 221 222 234 245 250 255 259 254 237 224 226 231 217 185
5789 185 154 135 124 115 115 124 128 111 76 44 31 35 43 45 39 32 32 39 45 43 29 6 -14 -24 -19 -4 6 6 2 4 12 14 5 -3 5 32 61 78 75 56 31 13 14 34 62 86 103
5769 103 119 132 139 144 162 194 220 227 219 208 191 156 107 68 57 67 75 72 66 68 81 95 100 92 80 78 90 103 103 94 87 84 83 83 85 84 70 48 40 59 93 119 125 115 93
5749 93 64 39 31 39 50 53 53 60 76 100 130 159 179 186 182 171 150 120 91 76 73 73 71 73 84 91 85 74 72 84 102 113 118 119 118 111 95 78 67 64 64 59 59 78 111 128
5729 128 109 67 34 26 30 29 29 40 52 50 36 35 59 90 104 97 82 72 70 71 75 78 73 56 30 1 -28 -55 -68 -60 -35 -8 3 -9 -39 -67 -72 -49 -13 17 33 43
5711 43 54 71 85 82 60 32 20 37 70 97 105 100 96 105 128 153 164 157 141 123 108 97 98 113 134 146 143 131 114 100 96 111 132 142 137 128 123 117 102 86 78 71 64
5692F4MK8M3L1QojJ0K0K4K1Pnpmj3l4m3l1rjqj5rJQPOKnj0oLLrj9j2JPPRJ3Oj1j9j1nj2k1
5671Gj4%PPJ4L0L8K6Mj2j4qMK0K8J6j5m6n0k8%Orj4JK1L0K0J6K5L2K8J7J0Mkpppj3k0j9j6
5653A10j4j6j8j3kQJ2QLJ2L0L7J9qk3j9rpj0lJ0K2J6lk1k2nJ8K6J4rk7l0j4RK3K1Rnj6j8j1
5634H4KJ2Rnj2j0mmjJ7L6M1K4KlOJ4Rmj8k2j5nLKkjKmk5m6m7k8nJ2J9K0J6J4J6J4MplJ4K5
5614A46K5K2K4J9Jj7k0rmpj5k0k6k4rJ4K3J2KJMMNJ3K3K0Ooj2j4j4roj4k6k6j2PJ5J0Llj3
5596I3l0m5m7l4j2OJ8L0M0M7L6J0j5k7j8mLLKkj0j6pJ1J6lk6k4lJ4J0nj1j2j7k2j3PK2J9M
5578a2kJ2L6N0L7Lk4l3k4rRK6K7J4krj4k9l5j7J7L4K6J2PLJQK4K7Pk0k4j1Jkqj2pKRKj2j3
5559G5OK2J2j3k6j4jKlnj0k0k2j0lmjJ7L8L7K0QJ1J4Oj2k3k6k2j8j6j2mJ0K5L2K2Kj8k3j7
$$ plain form
5692 64 68 96 139 170 178 172 171 181 201 225 246 253 248 241 237 224 190 147 116 107 106 98 83 74 75 83 90 96 98 93 83 77 80 83 74 55 43 44 51 58 67 80 86 75 56 45 40 28 7
5671 7 -7 -7 0 7 21 51 89 115 119 107 93 85 89 109 137 153 138 92 42 14 14 20 11 -3 -2 19 49 69 85 110 142 170 187 197 201 199 192 185 178 165 145 126 110
5653 110 96 80 62 49 47 55 67 75 78 90 120 157 176 168 145 126 117 110 100 97 107 129 145 142 121 99 94 112 138 152 143 116 86 72 81 104 125 134 129 113 95 84
5634 84 86 98 107 102 90 80 76 72 71 88 124 165 189 191 188 194 208 217 213 195 173 158 153 156 158 156 155 157 153 128 82 35 7 2 14 33 53 69 83 99 113 117 110 107 121 146
5614 146 171 193 217 236 237 220 200 191 187 180 165 145 119 95 86 100 123 135 137 138 142 146 151 164 187 207 213 207 195 181 167 158 152 138 112 86 74 81 96 106 109 106 93
5596 93 63 18 -29 -63 -75 -69 -51 -21 19 66 102 112 97 70 52 48 51 54 56 54 44 28 21 32 48 45 19 -5 -8 6 16 11 0 -12 -29 -51 -64 -57 -35 -16 -12
5578 -12 -14 -2 34 84 121 124 100 67 43 34 43 69 96 110 108 99 85 56 21 4 21 55 81 93 100 103 104 112 136 163 170 150 126 115 116 114 106 94 87 89 98 100 88 75
5559 75 81 103 115 102 76 62 61 63 60 55 45 25 3 -7 -10 -14 -15 2 40 77 97 105 116 130 136 124 101 75 53 35 19 7 3 13 38 70 92 94 76 53 36
5541C6j4j7j9nJ9L6M0L2J8lk2k1NK7K9J8J9K3J3rj6mPok8m2m4l5j9KJ7J9J6J5J0%pNK3K9J7
5523A64Jj2k0k9l6l2k1qKLMRJ8J8PJJ4L0K9Oj4j2JJ1R%j5l2m0l4j8plKPLj0k5k5j2QJ9J9R
5504a1pk4k6j1J5L0K7J0pk0k1mK1L4K3L%J2K2Pk0m1m0k7oJ3J8J4RPPRJ5K1J7JnNJ9J9J3J2
5486A33J5Pnqnj1k2k6j2NJ5J2Kj3k3j7nJjPK9M1K4rk6k2j2lJ1K9L9L4J8OKjnol%ok8m9n0k8
5467C4jJ2J3RKoj3j0lMJ2J9J9Npj0prj1rqj2rJ4M3M9K5LLJ5J3Kprj3j9k2k0j4qKJ4K5K8J6
5447A54pk8k5jJ4RJQK4K9K2J3PjolNNMOJ3RmoJJj3k3j5lok1k0KJ7Qj8m2m6k9jK2K4Mk5l9l1
5427a1j1J6L7M9M1Rl2n5l8KL4L1Qj5k1j7mJ6L4L8K0ok0j4jMj1k7k3KK7K6Jk4k5qQJ0jj4k7
5409Hk8j6RK9L5K7J6J0KllMOok4k9k0mMNJjQK2L1K5J6J5J7Lj9k8j3Klj7j3MOj0j9mJ5J3lj0
$$ plain form
5541 36 22 5 -14 -19 0 36 76 108 126 123 101 80 85 112 141 159 178 201 214 205 189 185 192 186 158 116 72 37 18 20 37 56 72 87 97 97 90 95 118 147 164
5523 164 165 153 133 104 68 36 15 7 9 12 16 25 43 61 68 69 83 113 142 148 134 122 123 134 143 143 128 96 56 22 4 -3 -6 -4 3 6 -4 -29 -54 -66 -58 -39 -20 -11
5504 -11 -18 -42 -68 -79 -64 -34 -7 3 -4 -24 -45 -49 -28 6 29 32 32 44 66 73 53 12 -28 -55 -61 -48 -30 -16 -7 0 7 16 31 52 69 70 65 70 89 108 121 133
5486 133 148 155 150 142 137 126 104 78 66 71 86 98 100 87 64 47 42 43 42 49 78 119 143 134 108 86 74 71 82 111 150 184 202 208 210 209 204 198 195 195 189 161 112 62 34
5467 34 33 45 58 67 69 63 50 40 37 41 53 72 91 96 89 79 72 63 52 43 35 23 14 28 71 120 145 148 151 166 179 181 174 165 152 133 111 91 77 69 71 85 110 138 154
5447 154 147 119 94 93 107 116 117 125 149 178 200 213 220 219 213 210 215 220 224 230 243 252 248 242 243 244 231 208 193 190 184 163 143 145 162 170 152 110 64 35 34 56 80 84 59 20 -11
5427 -11 -22 -6 31 80 121 130 98 43 5 7 41 72 80 65 44 27 23 39 73 111 131 125 105 91 90 94 83 56 33 35 62 88 89 65 40 32 40 50 49 35 8
5409 8 -20 -36 -27 2 37 64 80 90 92 89 86 90 96 90 66 37 17 13 17 22 23 22 30 52 83 108 124 139 156 159 140 112 99 101 98 81 68 72 78 68 49 45 60 73 70 60
5389F0mLPJ3J5Rnj2rl%lqpjOOnj7j5n%oj4j1%J4K7L1K6J4jpj2j5j4oJJoj2nPJ7J5QMJlpoK
5366F8OLKJ4L0L0Rj0j1jjj0j7j6j6k9m0l0nJ9J9Jj5j5omj9l3l2j8nJPJ9K8K9J9J2J7K6L2J9
5348G7nj9j8nKpj7j0J0L2L1J5KOJ7J9J1PJ5K4K5K1J2jj7k5j6MJ6J2Mjj2k3j6PK1%m0n6l6m
5330F2J3J7J8J3jj0mJ0J1kq%J2J5R%j0j7j9j2%RO%KJ1J5Pqj0J1L5L5Qk2l5k6rMOpk2k1nPl
5310H5j9j5QK1J0kKK2K9K1J4J6J2nk9m0m1m1l7k1JJ8K1J2LJRK2K9K6J5RROKjmk2n1p1o1l2
5292f9kJ6L1L7K9RLK0L8L5J9RQLlnlpj7k2k3k8m0m4l1pJ0J2OKRK6L6K8J3NPJj2j7jK1K6Pj8
5272A17k8j6PJ7Mj7j0K7N7M1ll7m0k3p%jj1j4JK4K8J7PJj9m7n2k3QRmKK3K7Qj0pRJ7J9J0o
5254A05k5l5k5j1%J2K0K1J2LLO%qrJJ3K1K1J2%qj1j9l6m6l8k4j7j2KK7M5M6L8K6J6Olj0j8
$$ plain form
5389 60 56 59 66 79 94 103 98 86 77 74 74 71 63 56 55 61 67 62 45 30 25 25 19 5 -6 -6 8 35 66 92 106 105 98 86 71 57 51 52 53 47 35 30 37 54 69 77 81 82 79 72 66 68
5366 68 74 77 79 93 123 153 162 152 141 140 139 129 112 96 80 51 11 -19 -24 -5 14 15 0 -15 -21 -25 -44 -77 -109 -127 -132 -131 -124 -105 -77 -48 -29 -17 0 26 58 77
5348 77 72 53 35 30 32 25 8 -2 8 40 71 86 88 94 111 130 141 148 163 187 212 233 245 244 227 202 186 190 206 218 222 221 209 186 170 177 198 198 158 102 66 62
5330 62 75 92 110 123 122 112 108 118 129 127 119 119 131 146 155 155 145 128 109 97 97 106 112 112 114 125 140 147 139 129 140 175 210 218 196 161 135 126 130 136 129 107 86 81 88 85
5310 85 66 51 59 80 90 88 90 112 141 162 176 192 204 199 170 130 89 48 11 -10 -9 9 30 42 45 46 55 77 106 132 147 156 165 171 173 172 168 146 95 24 -37 -69
5292 -69 -71 -55 -24 13 42 51 54 74 112 147 166 175 183 186 183 178 175 168 151 129 106 78 38 -6 -37 -44 -34 -22 -16 -14 -5 21 57 85 98 103 110 111 99 82 81 102 128 135 117
5272 117 89 73 80 97 101 84 74 101 158 199 196 159 119 96 89 89 88 77 63 64 88 116 133 140 141 122 75 23 0 8 17 13 15 38 65 73 63 56 65 82 101 111 105
5254 105 80 45 20 9 9 21 41 62 74 77 80 86 86 78 69 70 83 104 125 137 137 129 118 99 63 17 -21 -45 -62 -74 -72 -45 0 46 84 110 126 132 129 119 101
5236A01k4k1j0PK0K7J8ql3l0JL3L3Nk1k6j0J3L0L1K1Olqj3j5j6j2rmMJ4J7J2Koj3j5j1jJ1
5218I7J7K2K2J3nk0j9nOPJj%mj4k5l2m0m4l9j3K2N1N2K9mk6k2MK5K5QpqkLNQJ0J3J6K0J8J5
5199A79J4Qj0l9n2l4lJ4J3Jj1k4k9j6NJ4RNJ3J9J8J0%j4k8k6j0%nlJ7M2M6L1J8J1jj9k9k4
5182A10j7k1l2l7k5mJ7J9Nj2j3kNJmQK6L0Pk9n6n4k7NK1J7J4K3L7M2L2J4nj4qJ4L7M7L2Kk3
5164A82k5lK6L7K7Qoj6l0m4m7l7j9jJ5K0J5KnKJ1J5J1PJ0Rlj8k1j0knj3j0jkk0l4k5KK2K3
5146D7Pj1j9j3PL1M4L8J6j2l1l5k7j1OK0K7K4J5OJKPJ4J2Jj0mJ4K8K3RJkpj2rJRLj3l3m5l9
5127H0k1kQOlj2j2KJ5J3KNK4L3J4j4j7MK0J9J2Ojj1j0%P%j0j2qj4k1j4JNj2l0k6KK8L3K0R
5108A18QJ4J4Rlj4k2j8jJ5J6Nkmj0k1k3rPJ4Rpk8m3l9j6RJ8J8J7J5Poj6k0j8pPNrj6LK5K7
$$ plain form
5236 101 77 56 46 53 73 100 118 110 77 47 48 81 114 119 98 72 62 75 105 136 157 163 160 152 139 124 108 96 87 83 87 101 118 130 132 126 113 98 87 86 97
5218 97 114 136 158 171 166 146 127 122 128 135 136 135 135 131 117 92 60 20 -24 -63 -76 -54 -3 49 78 74 48 26 30 55 80 88 81 73 71 74 79 87 97 110 126 146 164 179
5199 179 193 201 191 152 100 66 63 77 90 91 80 56 27 11 16 30 39 44 57 76 94 104 104 90 62 36 26 26 21 18 35 77 123 154 172 183 182 163 134 110
5182 110 93 72 40 3 -22 -26 -9 10 15 3 -10 -12 -7 -6 -10 -2 24 54 61 32 -24 -78 -105 -100 -79 -62 -48 -25 12 54 86 100 95 81 73 87 124 171 203 205 182
5164 182 157 154 180 217 244 252 246 230 200 156 109 72 53 52 67 87 102 104 99 101 112 127 138 145 155 164 161 143 122 112 110 105 92 82 81 79 59 25 0 2 24 47
5146 47 54 43 24 11 18 49 93 131 147 135 104 69 42 31 37 57 84 108 123 129 130 132 139 153 165 166 156 152 166 194 217 226 227 225 218 206 197 198 207 210 197 164 119 80
5127 80 59 57 65 71 68 56 44 46 61 74 76 81 105 138 152 138 121 125 145 164 176 182 181 170 160 160 167 167 157 145 137 123 102 88 89 94 82 52 26 28 56 89 109 118
5108 118 126 140 154 163 160 146 124 106 105 120 136 141 139 135 125 104 81 72 79 93 102 95 67 24 -15 -31 -22 -4 14 31 46 53 47 31 11 -7 -14 -7 -2 -11 -27 -24 1 28
5089B8J0OJ9K5Rj2j6mPJ2J9K5K5J3%j3j8k2k8l3l2k1pMMKKJ1K3K7K0Omrj6k6k6j4mj0k1k4
5070f3j8j1KK7M8L7Kk4j8OJ9K1K3L3M3L6J0j0rRJ9Mk4l9k8nJ4K3J6kk0k1j4j9l1l0j4j0k1
5054c9k6pJ2Pqj0oj0j3KK7L0J5J0K1K8J1mMJ9J9Jj3j3qnj1k3l2k9pJ7K6J7RKnj5k0pJ8L3K5
5035D2LnLJ2J1J2K4K7Nk2k2NK5K0Ook1l2k4MK5J6j0j9rNOpk3l6k8qJ1J5J0OJrj1kPNJMQkj4
5014IkK3K9Nj5j0LJj0mJ6K8J8ok3k3j3JLJNJ5J8J0JkmokJ4K8K2Lq%J2J4Kj2k0j2MJ6J1%j0
4995A30j5j8j3MJ8J6KnKN%kORjj1nJ1J4PKRJ0lj3j2prj6j1jMMJ1K7L3K0Krj8l1l3j1J6J8l
4975A33j8j0JKQK4L5J8j7l5l2l1m1m5k8KJ9K1K6L5L8K3NlKJ3K1K3K2Qj4l4l4k0rj0j5j4j2
4958E7k1k9k3nOkrJ2M8O7M7Pk5l0k1mJ2K0J5Jj1k1l2m2m0k4KK2L0K9K0Npj2j0pnKJ2K1K3K1
$$ plain form
5089 28 38 44 63 88 97 85 69 65 72 84 103 128 153 166 166 153 135 113 85 52 20 -1 -8 -4 0 2 4 15 38 65 85 91 87 78 62 36 10 -4 -8 -18 -39 -63
5070 -63 -81 -92 -90 -63 -15 22 24 0 -18 -12 7 28 51 84 127 163 173 163 154 163 182 186 162 123 95 90 104 127 143 141 121 100 86 67 36 6 -8 -18 -39
5054 -39 -65 -72 -60 -53 -61 -71 -77 -87 -100 -98 -71 -41 -26 -16 5 33 44 40 44 63 82 83 70 57 49 44 33 10 -22 -51 -58 -41 -15 2 11 13 8 -7 -27 -34 -16 17 42
5035 42 45 40 43 55 66 78 102 129 134 112 90 95 120 140 146 140 119 87 63 67 92 108 98 79 70 75 81 74 51 15 -13 -21 -10 5 15 21 22 13 2 0 7 12 13 17 25 23 9
5014 9 7 30 59 64 49 39 42 43 33 29 45 73 91 85 62 39 26 27 30 31 36 51 69 79 80 78 74 68 66 80 108 130 133 125 125 137 151 153 141 121 109 113 129 140 140 130
4995 130 115 97 84 88 106 122 124 119 121 126 126 124 130 139 138 127 122 133 147 154 156 165 175 172 159 147 140 131 115 104 103 107 111 122 149 182 202 204 195 177 146 113 102 118 136 133
4975 133 115 105 106 108 116 140 175 193 176 141 109 78 37 -8 -36 -34 -15 6 32 67 105 128 133 130 132 145 166 189 211 219 205 171 137 117 108 98 83 69 57
4958 57 36 7 -16 -21 -15 -17 -26 -14 34 101 148 155 130 100 79 75 87 107 122 123 112 91 59 17 -23 -47 -45 -23 7 36 56 61 54 42 32 25 20 22 34 55 78 99
4939I9K0K2K1J3Jj4k8l5k9j7qj1k1k5k2oJ4L0M0L8K3Lj1rLKj3k6k0%J8K6L3L7L3K4J7J6Pr
4922B36k2j5NK6L5K6Pj6k6k2j7k1k7k7k1k1k3j6JJ6K1K3K9L3J7j5m5m7k6kLrk3k9k2j0J0K4
4906A0K9K0J4QJrpQK5L0K1J0KJJlk0m0m3k8pRK0K5J8mk5k7mK3L5K8Kk6m0k9pKj1k2j6J5L7
4887B6L3J1mKJ3J3MmljQJ7J7QNK3M3L0ql4k4JK2L1K2nl5m4k9j3mQK2K6J7J5J5PmnKnj3PM4
4868B57O1M8K7Pk0k2K0O4N1J3J3L5J6k8k0K6L3K3P7J53J59J66L15N26O60R46J712K514K220
4855A0052M20j703k571j999j115p30o12l65j30j36j99r8J4l8j11l6M2k6r8l6L1k4n9K9Q1j1
4844E72o5L8J15N0M9J96K34M3q0M9J58R1J35M02N20M12O17J285J817K300L976O803P776M039
4833C1532k703p303p065m299k440j976j491p07m23o05m95j06o2k96k35M9L0j93j29J13O7j37
$$ plain form
4939 99 119 141 162 175 176 162 134 99 70 53 45 34 13 -12 -34 -40 -26 4 44 82 105 108 97 88 91 93 80 54 34 34 52 78 111 148 181 205 222 238 245 236
4922 236 214 199 204 230 265 291 298 282 256 234 217 196 169 142 121 100 77 61 62 78 99 122 151 184 201 186 141 94 68 66 69 60 37 8 -14 -24 -14 10
4906 10 39 59 73 81 82 73 66 74 99 129 150 160 162 163 164 161 141 101 58 30 23 32 52 77 95 91 66 39 35 58 93 121 123 97 57 28 21 23 12 -10 -26 -11 26
4887 26 59 70 66 68 81 94 98 94 91 90 98 115 132 140 145 168 211 241 233 199 175 176 198 229 251 246 211 167 138 125 121 129 151 177 194 209 224 231 227 222 224 219 206 213 257
4868 257 318 366 393 400 380 358 378 442 493 506 519 554 570 542 522 548 581 604 681 834 993 1159 1474 2000 2660 3606 5318 7832 10052
4855 10052 10472 8769 6198 4199 3084 2354 1742 1377 1247 1111 912 814 828 790 679 643 685 659 561 525 556 532 473 502 583 572
4844 572 507 545 660 710 759 955 1189 1232 1152 1201 1359 1450 1585 1987 2507 2919 3536 4821 6638 8938 12914 19717 27493 31532
4833 31532 28829 21526 14461 10162 7722 5746 4255 3548 3125 2520 2025 1919 1857 1561 1326 1375 1405 1212 1083 1196 1263 1126
4824A126n0J64O3j47nK65J85mJ72M10J88j34N5L93K48M0M46R56Q44Q47J919L227L944N957
4813B1109J1033J5437J2149L33j1530j4936j0710n881m088l419k012q95r52j089n20j15m23
4806C491n97j52J18k07l92n1J29j67k73P6K09j03j83J63K48p3o8L64M07l3o4M34N35J62L23
4795D296J038J187R01J637L287M286N516R968J6200J6472N921r126j7196j4794q567n116m193
4788A1717k917j343r68j274r01k20k64o18l78N5q8l90j53J87qk97p7K04k1k76rK91Q5j24J72
4777B385M24J27j05K52N47K66J57P44J161Q97J089K406L592M256O788J2002J4777Q901l766
4769E6900j3697j4506r392n148l790k984j597p94r30q92l45j33m25m53p9K7k30k42N4R7j35
4760A306j27J24J26j00p9J48J14j11n9J83J47o0L3K97K38L5K17N72N33M13R06J675K038K769
$$ plain form
4824 1126 1076 1240 1303 1156 1151 1416 1601 1597 1769 2179 2367 2233 2288 2681 2929 2969 3415 4371 5215 6062 7981 11208 15152 21109
4813 21109 32142 47579 59728 60061 48531 33595 22885 17004 12916 9497 7485 6590 5638 4549 4029 3914 3491
4806 3491 2894 2742 2860 2653 2261 2210 2339 2172 1899 1975 2184 2081 1898 2061 2309 2236 2168 2532 2939 2906 2842 3276 3811 3973 4296
4795 4296 5334 6521 7422 9059 12346 16632 22148 32116 48316 64788 70709 61583 44387 29593 21026 15910 11717
4788 11717 8800 7457 6489 5215 4314 4094 3830 3212 2834 2889 2801 2411 2258 2445 2437 2140 2063 2267 2246 1970 1961 2252 2337 2213 2385
4777 2385 2809 2936 2831 3083 3630 3896 4053 4797 5958 6855 7944 10350 13942 18198 24986 36988 51765 60666 56900
4769 56900 43203 28697 19305 14157 10367 7383 5786 4992 4062 3170 2825 2692 2267 1814 1735 1762 1532 1290 1344 1441 1306
4760 1306 1179 1303 1429 1329 1250 1398 1512 1401 1342 1525 1672 1612 1645 1942 2180 2215 2432 3004 3537 3950 4856 6531 8569 11338
4749A1338N065P473O358P02n584p888o021l353k103j670j045m91m36m97k81q1j76k86j59k7
4741H38r1j46l4M2m5r2J5P6k4q7jO1kk8O0Q7kk7P8J16L4L6J71K09J15J75M56O67Q14J363K284
4727G118K517J171j064k503k380j471q29o21m72k72j83k05j82j01p1q9o9k1j9m8l8JJ3mkR
4716A85mk5rK1J0l9o5n1k7j6%K1L6L5L3L6L5K9K6K1Rrk0k7l1k1kJ0Kj6k4k1j1QK8K9Kk0j1
4699A27K0L6K8J1jj2k0k0j6j8k3j8jJ6K2K3K6K5J8J0NJ0J9J9Kk7m7m1k0j2j9k2j6j1j4j7p
4683C5RK0K3K2K4K7K6J6mk8m3m7m4m0l1qROj6k9k0MK3K6K1J7J2Pmj7k3j7%J5K1J4KlOK0K3
4665E4J4POLj3k8k6j1pk3l5k4%J2RNJ4K3K0ROJ8L1L0J1pj3pJQJ5J5PjJJ3J8J1jrj1j4j3kJ2
4646A28K0K0J6J3J1QRJ3J3Qlj3j9k2k2j8j0noj1j1%Nql1m1k2PK6K6K0J2PQJ4J4%k1l3k3nK
$$ plain form
4749 11338 16403 23876 30234 30936 25352 17464 11443 8090 5987 4317 3272 2781 2345 1848 1567 1486 1310 1024 865 838
4741 838 747 601 567 609 564 472 487 563 539 452 451 512 510 482 542 629 627 600 678 794 828 864 1035 1244 1359 1534 1990 2657 3471 4834 7118
4727 7118 9635 10806 9742 7239 4859 3388 2559 1938 1466 1194 1011 806 624 523 452 363 294 273 254 206 168 169 182 178 176 185
4716 185 181 156 147 168 178 139 74 23 -4 -20 -20 1 37 72 105 141 176 205 231 252 261 252 232 205 174 153 151 161 163 147 123 102 91 99 127 156 158 138 127
4699 127 147 183 211 222 221 209 189 169 153 135 112 94 93 109 131 154 180 205 223 233 238 248 267 286 288 261 214 173 153 141 122 100 84 73 59 42 35
4683 35 44 64 87 109 133 160 186 202 198 170 127 80 36 -4 -35 -43 -34 -28 -44 -73 -93 -89 -66 -40 -19 -2 10 17 13 -4 -27 -44 -44 -29 -8 6 8 5 11 31 54
4665 54 68 75 81 84 71 43 17 6 -1 -24 -59 -83 -83 -71 -62 -57 -43 -20 0 9 15 33 64 94 105 98 85 78 79 87 102 117 124 123 124 137 155 166 165 156 145 131 118 116 128
4646 128 148 168 184 197 208 216 225 238 251 259 256 243 224 202 180 162 152 147 141 130 119 119 124 116 85 44 22 29 55 81 101 113 120 128 142 156 156 135 102 79 74 76
4627G6mj7j7jJ6J4oj9j0RK2K7K7J5j1l2k5MK6L2K8J9mk7l0j2ORJ0J9J9Orj2j6k9l5k0JNKJ1
4609F7K6K0pk2qJ1Pqj2LJ7J7Qkpj0qqqqj2k0k5j8JK0K9K1Nj3k6l4l3k2rLJ2J6Roj1NL4M8L8
4590H0J1j0j5j4j3nJ0K8L4K6J3knNJ6J0j4l4l1rJ4L6N5O2M3Nk4l1k8k7l1l4l2j8J2L8L5Kk6
4573A32k8j2pj4j8j3j3j9k1j1QK2K5J4%roOJ6J9J1rk4k6j5omkJ0L3M7N3N2M1J3j9k9j1PMk1
4555A76m5m4k0RJ8Kj9j9MK6K8J6LloonoqkOOoj9j6nKLJ2K7L5K2kj5rLRKolRJ4Nrj0oj5l3l1
4534F9kK1Rk1l0rJ7K1J7J4J3OmrrpJJ2J3Jj4j5pqj8k3j2KRJ3K4M0M9M7L9L1K1jl2n1m4j7L
4515A59%j2j9j9j5j4j7k1k6j8jPpl4l8j2K1L6L6L6L6K2JrkJ3K2K0Nj3k3j5JR%j8l4l1j1J9
4498C4L4K5Mm%LmqjJ0J0Jj0j7j9j4MK4L2K6J8Qnk4m0l9k4qJ1L1M5L7Mk9m3l8k8j3J0L7M0J3
$$ plain form
4627 76 72 55 38 37 53 67 61 42 32 41 63 90 117 132 121 89 64 68 94 126 154 173 169 142 112 100 106 115 125 144 163 169 160 148 132 103 68 48 49 54 56 67
4609 67 93 113 106 84 76 87 94 86 74 77 94 111 119 117 110 100 92 84 76 68 56 36 11 -7 -6 14 43 64 69 56 30 -4 -37 -59 -68 -65 -53 -37 -28 -34 -45 -40 -6 42 80
4590 80 91 81 66 52 39 34 44 72 106 132 145 143 138 143 159 169 155 121 90 81 95 131 186 248 291 296 272 241 213 186 155 121 89 71 83 121 156 158 132
4573 132 104 92 85 71 53 40 27 8 -13 -24 -16 6 31 45 45 36 30 36 52 71 82 73 49 23 8 2 -2 -4 6 39 86 139 191 232 245 226 197 186 193 197 176
4555 176 131 87 67 76 94 96 77 58 62 88 116 132 135 132 126 120 115 109 101 99 105 111 105 86 70 65 67 70 82 109 144 166 164 149 140 143 152 154 148 145 154 168 173 164 154 148 133 100 69
4534 69 67 88 97 76 46 37 54 75 92 106 119 125 121 112 103 96 97 109 122 123 109 94 87 79 61 38 26 28 37 50 74 114 163 210 249 280 301 300 268 217 173 156 159
4515 159 159 147 128 109 94 80 63 42 16 -2 -3 4 -3 -37 -75 -87 -66 -30 6 42 78 100 101 92 90 103 125 145 150 137 114 99 100 109 109 91 57 26 15 34
4498 34 68 93 97 93 93 96 92 84 83 93 103 104 94 77 58 44 48 72 104 130 148 156 151 127 87 48 24 16 27 58 103 140 144 115 72 34 6 -7 3 40 80 93
4480I3j7k4rkqj1LJ7J7MnLK1L8M5L1Mj6j5rj2k6l0j8kJLRK1K3J2KJQJ6J7J5Jk0m0m0j9RJ6
4460A07Kj8k3j4jOPkj2j0J3L8M3K5Okqk4l8k8mNj1l4l5k0nNJ8L5L9J3l0n6m8j7PJ7K2L3M1
4443D2L4J5Kjjpj5j5jJ5J8Qrk0k2j9j1mNJ4J5Lj5k5k0qQK0L2L8M0L5K3Jk5m2l8j6MJ8K8L2
4425A36K4RLJ0J6Pj2k5k4j6pMJ2J2Okpj3j9k3k7k9k5nK4L7K4lk0j7pl%NJ5K2K1J3NjmpmNJ3
4405A23Rlj1pkqj9j8poj5j8oQJ2NLQJ1Ojnpommoj3k2l1k8j2J5L8M3L6L2L9M4K3j7n3n3l0r
4385C4kJJ1K1J4jj2j4j1mJ4L5L8K0QJ4K7K2QPJ9K0Jk6l6k8j4npj7l3m1l8k5j1KRJ1KpqKK2
4367B2M2L8J5j5k4j2RK3K8K6J5KKJ4J9Pj0j2oj1k2j8%J0Kj0j3j2k2l2k7nK4M4N8O2M4J1j9
4350B47k4j3j1k2m0m6m1l1j8oKRJ4J4R%nOK7M6M8K9lk8l2j8%Lnj0mM%j3k3k2j7j0%PJ2J0R
$$ plain form
4480 93 76 52 43 41 33 22 25 42 59 63 58 61 82 120 165 196 200 184 169 160 148 122 92 74 72 73 76 85 106 129 141 143 144 152 168 185 200 201 181 141 101 82 91 107
4460 107 109 91 68 54 53 59 66 64 52 42 55 93 136 161 167 165 157 133 95 67 63 68 57 23 -12 -32 -37 -32 -14 21 60 73 43 -13 -61 -78 -71 -54 -32 1 42
4443 42 76 91 93 92 91 84 69 54 53 68 86 94 85 65 43 24 13 9 14 28 43 46 31 6 -14 -22 -14 6 38 76 116 151 174 175 150 108 70 54 58 76 104 136
4425 136 160 169 172 182 198 205 193 168 144 128 121 125 137 149 155 153 146 133 114 91 64 35 10 5 29 66 90 87 67 50 43 40 40 45 60 82 103 116 121 120 116 109 105 110 123
4405 123 132 129 118 111 109 101 82 64 57 51 36 18 12 20 32 37 40 48 59 65 64 59 52 46 42 38 32 19 -3 -34 -62 -74 -59 -21 22 58 90 129 173 196 179 126 73 43 34
4385 34 32 33 44 65 79 78 66 52 41 37 51 86 124 144 152 166 193 215 223 230 249 269 270 244 208 180 166 161 154 137 104 63 25 0 -11 -9 0 11 13 6 -2 0 22
4367 22 64 102 117 102 78 66 75 98 126 152 167 169 171 185 204 211 201 189 183 172 150 132 132 142 144 134 121 109 87 55 28 23 47 91 149 211 255 266 247
4350 247 223 210 199 177 137 91 50 19 1 -5 -3 6 20 34 43 43 38 44 71 117 165 194 191 163 131 113 113 116 111 101 97 101 101 88 65 43 26 16 16 23 35 45 54
4331E4J3K7L6K8Oj2j2LQnj9k1j4j6k7l9l9k9lK3K8Kl0l3j0K0L3L5L2J9kj1pjj1k2j9lJ0J2
4314DJ6J9K6L3L6L1J2j4k6k1rknj2j9j3JJ4J8J5J6J1rl4m0k2%RRJ3K0K1J3PRJ4J7RlrmJjj1
4295A40j5j5j3j3j1jjj4l1l4k8k1j6j1%RJ0N%LJ1J8J8J6K2K9K5Rpq%MMNPMpj6k1k4k3j6qM
4276a1J5L4M9M4K4RJ0J9J2rk1j1OQj1l5m0l0j5j3k0k6k8j8jJ7K7K0J1RJ9K7K5J1pj5j0JNm
4258G7j5j0J6L8L8K5J6J7K1J9J3%k0l3l2k2j6j8j7j0mnmNJ9K5J9QJK%j0k5l2k2mMJkMJ6K3
4240A06K0Qqj7j0PJ5RNJ4K4J5j6m0m4l6k1jK5L9K9Kk3k6qJ7L3L3J8jk2l6l4j4NOljJ1J3nj6
4222G2kK4K8J4RK0K1kk9l4k1pKOQLrk8m5n2l4ML3L3J8J5K6L2K6J7RJqj6k1j6LL4N5M6Rk9n4
4203A61o3n8l8j4l%J3K9L4K0QRLj6k5rJ4J0j3k7j8oMJ4K3J5qk3j3NJ0PJ0K1K5J3mrLJ8K2J1
$$ plain form
4331 54 67 94 130 158 164 152 140 143 151 146 127 106 92 76 49 10 -29 -58 -61 -38 -10 -8 -38 -71 -81 -61 -28 7 39 58 56 45 38 37 26 4 -15 -18 -8 4
4314 4 20 39 65 98 134 165 177 163 137 116 107 105 100 88 69 56 57 71 89 104 120 131 122 88 48 26 26 35 44 57 77 98 111 118 127 141 158 167 164 155 151 152 151 140
4295 140 125 110 97 84 73 72 71 57 26 -8 -36 -57 -73 -84 -84 -75 -65 -60 -60 -57 -46 -28 -10 6 28 57 82 91 84 76 76 80 84 89 96 100 93 77 56 32 9 -7 -15 -11
4276 -11 4 38 87 131 155 164 174 193 205 196 175 164 170 178 167 132 92 62 47 34 14 -12 -40 -58 -59 -42 -15 5 16 25 44 71 96 107 100 85 75 76 81 77
4258 77 62 52 68 106 144 169 185 202 223 242 255 255 235 202 170 148 132 114 97 87 83 78 74 79 98 123 142 150 151 153 153 143 118 86 64 60 64 65 63 67 83 106
4240 106 126 134 126 109 99 106 121 130 135 149 173 188 172 132 88 52 31 30 55 94 123 125 102 76 68 85 118 151 169 168 146 110 76 62 67 73 70 69 80 93 88 72
4222 72 70 94 122 136 145 165 186 184 155 121 100 93 95 101 109 112 103 75 30 -22 -56 -52 -19 14 32 47 73 105 131 148 157 158 150 134 113 97 100 134 189 235 244 215 161
4203 161 98 40 2 -12 -15 -15 -2 27 61 81 89 98 101 85 60 51 65 75 62 35 17 11 15 29 52 67 59 36 23 28 38 45 55 76 101 114 110 101 104 122 144 155
4185A55JKKj1l2m3k8nON%mqlRK4K1Lj6k5k4j9j4j7k4k9k0KK0K4J2LOJ0Npj1nKjoMK7L5K5R
4165F0J0L1M6L8Nl0m6l0KK3K3J6J9K2J1nj0lql1m9m8k8pJ3L3M0L1J6J4K2K2Lk2m2n5n7l6n
4148a2K1K4J1NQJ3J4J0QRJ3J6J7Roj9k4j4LJ1MqqKjk1l2j7J0K2K1K2L0K4Jj6qPPqj9j7rlJ
4129A01LOJ4K7L1K0Loj3k9m2l6j2%noJ0K7K1%mPJ6Oj1k2j6KK3L4L0K3K1K0Qqj5j1npj5k4l7
4110A29m7m2j1K3L8K8Nj1j0NK0J8Kq%K0K9K5Rrk7l8l3j4KLmj0j0%J3K1J3j3l4l5j5MJ0QRJ5
4092G8J6J1lj8l1k7rPQkKK3M1L2Kk5l4k9j8jK1L2K5J0LNMJj%PQJj9m1m5k7mRJ4K3L2J9rk5
4073F6j0J0J0nj1QL0L5K3RJJJmj9m1n1l8pK5L3K1jj7j8j5j0rqnmpj4nJ7L7M1K8J5J5K1K3J7
4054A88Plj8l2k8pJ8K1QnnOK2L7M1K2j2l4k9rMKnmLJ2K0K3J2j1k9l0k1k1k9l6k8rJ3K8K7J6
$$ plain form
4185 155 156 158 160 149 117 74 46 41 47 52 52 48 40 37 46 70 91 94 78 53 29 10 -4 -21 -45 -74 -94 -92 -72 -48 -36 -33 -27 -17 -12 -19 -30 -35 -33 -34 -40 -36 -9 26 51 60
4165 60 70 101 147 185 190 160 114 84 86 109 132 148 167 189 200 195 185 182 174 143 94 46 18 11 24 57 97 128 144 158 180 202 205 183 141 86 29 -7 -12
4148 -12 9 33 44 49 57 70 84 94 102 111 124 140 157 166 160 141 117 103 106 117 121 113 105 107 106 85 53 36 46 68 89 111 141 165 166 150 142 149 156 148 129 112 103 100 101
4129 101 104 110 124 151 182 202 205 199 186 157 115 79 67 67 62 56 66 93 114 114 110 117 133 139 128 106 90 92 115 149 179 202 223 243 251 243 228 217 212 205 190 166 129
4110 129 82 40 29 52 90 118 123 112 102 107 127 145 147 139 139 159 188 213 222 213 186 148 115 101 103 106 102 92 82 82 95 116 129 116 82 47 32 36 46 54 63 78
4092 78 94 105 102 84 53 26 17 24 32 30 32 55 96 128 130 105 71 42 24 23 44 76 101 111 114 119 123 124 123 123 130 138 139 120 79 34 7 3 12 26 49 81 100 91 66
4073 66 56 66 76 71 60 68 98 133 156 165 166 167 168 164 145 104 53 15 8 33 66 87 86 69 51 36 26 17 9 4 0 -7 -21 -26 -9 28 69 97 112 127 148 171 188
4054 188 195 192 174 142 114 107 125 146 154 149 144 150 172 209 250 272 260 226 197 188 192 194 189 185 188 200 220 243 255 244 215 185 164 143 114 78 50 41 54 82 109 125
4036A25KJJ0K0K1J5J3J2Kk2m5m9l0nRJ3Qmk1k9j9NK0J7KolNPKoj2j5rkMMKLNM%jMJ3K3L4M0
4015A67L6K0jk5m7o2n3j3L9O9N5Rl6n8n7l9j7npoJ1L3L7J6j0k2k1j4%K3K8Lk3j7J4K9J9MR
3998H8J8J5OKlj9l2k7j4m%Ljj4k5j6MJ4J0J3K1K0Mj3nK5M9N2K9jk2k1rNJ2J0ql3m8l2NL7M4
3979A39L7K3Lj6j9lJ4J5MJ%j0k7l0j4Ljj9k5rJ6J9%qJ4M8N2K2noJrl2m0l3k9l1k5j3onKJ7
3961A5K7K0J3J6K1J7Njlpj4j6j7k0j4kRJ2J5K2K3J2mj1olmorqmPJ1lk5l2j4J2K1Qj5k7j3K2
3942C0M7L9Qj1KK0J9JoRK5K3Mj4k2j9j1kJmj2k0k3k0j4qllloonljOJ6K2J9J4J4J8K2J9J2K
3922A76j4k8k6oJ5J3pj2MK4K3RPJ7J7nl0l4k3j8k1j6PL0K7Kk0k1j0mpj2r%J3K8L4L0J5jj3
3904A54j4j1kNO%nlOROJkpj9l2l2k3j1jJ1J8J4KNK1L2K2JkJ3K5K2J3Mj1k8l3k1j0j8l7m7m1
$$ plain form
4036 125 127 128 138 158 179 194 207 219 221 199 154 105 75 70 79 92 100 96 75 46 27 32 52 69 71 65 62 67 74 76 70 58 43 34 32 36 40 42 45 50 54 54 53 57 70 93 127 167
4015 167 203 223 222 197 150 88 35 22 61 130 185 194 158 100 43 4 -13 -18 -25 -31 -20 13 50 66 56 34 13 -1 -1 22 50 53 30 13 27 56 75 79 88
3998 88 106 121 127 129 126 107 75 48 34 30 30 33 32 18 -7 -23 -19 -5 5 18 39 59 63 50 45 70 119 171 200 199 177 156 147 152 164 174 166 133 85 53 58 95 139
3979 139 176 199 202 186 167 164 178 193 197 198 198 188 161 131 117 120 119 100 75 66 82 101 101 93 107 155 207 229 224 218 219 210 178 138 105 76 45 20 7 1 -4 -2 15
3961 15 42 62 75 91 112 129 134 133 130 123 109 93 76 56 42 40 49 61 76 98 121 133 129 118 112 109 105 99 90 82 78 85 96 93 68 36 22 34 55 63 48 21 8 30
3942 30 77 116 124 113 115 135 154 155 149 158 183 206 210 196 174 155 144 142 143 139 127 107 84 64 50 42 39 36 33 27 21 16 13 12 18 34 56 75 89 103 121 143 162 174 176
3922 176 162 134 108 102 117 130 123 111 115 139 162 171 178 195 212 207 177 143 120 102 81 65 72 102 129 131 111 90 80 76 69 57 48 48 61 89 123 153 168 167 154
3904 154 140 129 127 132 138 138 133 130 136 145 151 152 150 143 124 92 60 37 26 25 36 54 68 70 75 96 128 150 151 149 162 187 209 222 226 215 187 154 133 123 105 68 21 -20
3885b0k8oK3M2L3lk8j5J2K5J0ojJ2J5lk4l0j6MJ6J9K0K6L3L2J3j2k3j3NOj1k8k8j9rkJ1K4
3868E6L1K4PonNJ4J0lj1rqj6k5l2m1m7l5MM3N2L6K0J3%r%K9L8J5j9k7j6rnOJ6Nj5j6PJ7nl4
3849E5l9j8pj4l1l5k0LJ7J5J0J2K3K5J9K4M1N5M7K7J3Nj0k9l5k0JOnk4l5l3j9lLMRJ9K1J0
3832H7jnJKLJ2K3K3jk8l4j0K1L3J8j2l2l5k2nJ0J4J5J1J0O%mjOJ0QNNLnj4j6qMJ3J3Oqk2k8
3812G1k3j6qJJ3J6J1ORJ6J3ORK0K4J5JoomkkJJJKNNjrj6j8j1%Lnj5j7j1mJJ1K7L4K2lk3k3
3791A21pQQqk5l2l0k4j6oPK0L0L8M3M2K6%j9qK4N4M9J3k7l9k6j5j9k7l0k8k5j5MK2J9jj9j8
3773F4mJ2J4Mj2k4k2j4m%jLRJ4J5Mj0k3k0pMJ1J2J0PLKORPjnppl%LKnj0qkknlNJ3J0kj1j1
3751B0mLNQPkj4j8oQJ2POJ4K4K5K2J3Mj0k3k7k7k2j1KJ0Oknpj8l0k0QK8J9%qqj0j5rPK0K0
$$ plain form
3885 -20 -48 -54 -31 11 44 41 13 -2 10 35 45 39 38 50 65 62 38 8 -8 -4 12 31 51 77 110 142 155 143 120 107 112 118 107 79 51 32 23 21 32 56
3868 56 87 111 118 112 107 112 126 136 133 122 113 105 89 64 32 -9 -56 -91 -87 -44 8 44 64 77 77 68 68 97 135 150 131 104 88 79 74 80 96 101 86 70 77 94 89 55
3849 55 16 -2 -9 -23 -54 -89 -109 -106 -89 -74 -64 -52 -29 -4 15 39 80 135 182 209 222 227 217 188 153 133 134 140 135 111 76 43 24 21 24 28 37 56 77 87
3832 87 86 81 82 84 87 99 122 145 144 116 82 72 93 126 144 132 100 65 43 38 48 62 77 88 98 104 104 100 99 105 115 123 128 133 136 131 117 101 93 97 110 123 129 121 99 71
3812 71 48 32 24 25 38 54 65 71 80 96 109 115 124 144 168 183 184 178 172 168 166 164 165 166 167 169 174 179 178 169 153 135 124 124 127 122 107 90 79 75 76 87 114 148 170 167 144 121
3791 121 114 122 130 122 97 65 35 11 -5 -11 -4 16 46 84 127 169 195 195 176 168 192 246 295 308 281 242 216 201 182 155 125 97 72 57 61 83 102 101 82 64
3773 64 60 72 86 90 78 54 32 18 14 14 13 16 25 39 54 58 48 25 5 -2 2 13 25 35 42 45 47 53 62 69 68 63 56 49 46 46 49 51 46 36 28 26 24 19 16 21 34 44 42 31 20
3751 20 16 19 24 32 39 37 23 5 -1 7 19 26 32 46 70 95 117 130 134 124 101 74 47 25 14 16 26 32 30 25 18 0 -30 -50 -42 -14 5 5 -3 -11 -21 -36 -45 -38 -18 2
3731BJ9J3pk7k6KK2Ok6l7j8JM%RK3L1K8K5K1J9K4K9K5J1rk3l3l3k0NK6L0K2J5J0kj5j7nJ0
3714A34J4Pmj4k0j9qJLmj3k1k4j8nJ2J8Rqj4oJ2K8L1K2Kj5j9j1lqj7j4NJ5Mk2l5k6jK5L8L1
3695F2Qj2nJ7K7J5nj2qj1k2k5j4jRRJ0J0RNLOJ8L0L1J5pk0j7qjKPJ5K2J7kk4l3j8PJ9J0oq
3675A24Jjk1m6n2l3nJ5K1J6PNPJ3J9K4L2L4K4Kj7j5JQpk5k2%J4QmJJ5K0J2Jlqj9l6n2n8m7
3657d7k8j3rrLK3L2J6qj8j3KJ7L0L4L1K7K2J4lj4nJ3K0Qqj9k7k8j7PK6K6J1jool%%kl%OJ0
3637I1J3J7J8J1JlJNONJj0k5l1k3pKmj7j9oJ1K3K5K3K0J7J3P%j0k3l7m5l8j2K6N4N2K6OJj
3619A64j2k4j8OK3K6J8Qkj8l3l8l1k1j4q%NOJonOJ4J7J2QLknn%NJ1J4J9K0J7Plj1j1kMKmJ
3598A44K1M3N0M0J6pj5oLjj9k6j9j3k1l1k6pPLqj4qMJ0Pnj1kJ6K1J0qk0k4k6j9rNJ5K2K2Q
$$ plain form
3731 2 21 34 27 0 -26 -24 -2 4 -22 -59 -77 -76 -72 -72 -63 -40 -9 19 44 65 84 108 137 162 173 164 141 108 75 55 60 86 116 138 153 163 161 146 129 124 134
3714 134 148 155 151 137 117 98 90 91 94 90 77 56 32 14 9 21 39 48 40 26 20 32 60 91 113 115 100 81 70 67 59 42 28 33 48 52 30 -5 -31 -32 -7 31 62
3695 62 70 58 53 70 97 112 107 95 87 76 54 29 15 14 23 32 42 52 61 66 69 75 93 123 154 169 162 142 125 117 116 118 125 140 162 179 177 153 120 102 109 128 138 132 124
3675 124 125 124 103 57 5 -28 -33 -18 3 19 26 31 38 51 70 94 126 160 184 186 169 154 155 163 156 131 109 109 123 131 127 128 143 163 175 176 173 165 146 110 58 0 -47
3657 -47 -75 -88 -97 -106 -103 -80 -48 -32 -40 -58 -71 -69 -52 -22 12 43 70 92 106 103 89 84 97 117 125 117 98 71 43 26 33 59 85 96 95 89 83 80 80 80 78 75 75 81 91
3637 91 104 121 139 150 151 148 149 154 160 165 166 156 131 100 77 70 72 68 51 32 26 37 60 85 108 128 145 158 165 165 155 132 95 50 12 0 26 80 132 158 164 165 164
3619 164 152 128 110 116 139 165 183 191 189 171 138 100 69 48 34 26 26 31 37 38 32 27 33 47 64 76 84 87 85 80 75 75 80 91 105 124 144 161 168 165 154 143 141 145 147 143 144
3598 144 165 208 258 298 314 307 292 286 289 288 269 243 224 211 190 159 133 126 133 136 128 114 106 110 120 127 122 111 109 125 146 156 148 128 104 78 59 50 55 70 92 114 122
3580A22j3k1mK2L1J0k1l7l9l8l2j2K1M0K7lj7nJ0J0%mJMORQkr%J2Pj8m1l6j2J0J3JolJ3K6
3561C0K2J1MJ0J3RPJ2J2pl0l2j7lpj3qJ1K7L6L8K9Oj4j5KJ3nl1l3mK6K6Qom%qk2l0k6j3ln
3542A6j6k3j2J2K5J9J1J5K3J2j1k5j7jOM%KJrk3k3oJ7K2Kj7j2J0K7K1Mnnlnj1j5j0LK1K6J3
3523F3mj0onj2j7qQK0K1J8J4J2J0Nnj6k3k0j5j0o%OMj0j8rJ4L2L2K1J2Jj3k4k4j1PK5L3K4
3505A16Jj5nK2L9K9J1OJ3J3Jpppj2j7j5j3j3oJ5L6L4J1j4k1j4lPJ7J9Pj5k8k4j0jlj2j5j1
3487A09kkj6k3pK2L1Qk3k8mK1K3Kj5j1J7M4M2Nl6m4j7J9L8L4J7ol0m0l4j2J1J9Rj4l1k4JJ6
3470F9OrpJ0J5jj8rJ5K4J1JJ4M0N0L2kl5o0p0n2j2K2K5QkMJ3J2J6K8L9K9Rk%kj5k6k2j0oq
3451A24PL1M3K3qk2j9j2j3j5j4j7k2k1j2proPK9M2M5L5J5qk1j8j2k0l1l2j9pkQK1K9K5K1K0
$$ plain form
3580 122 109 88 84 106 137 147 126 89 50 12 -20 -32 -11 29 56 53 36 31 41 51 51 47 48 52 58 67 75 73 64 64 76 83 65 24 -12 -24 -14 -1 0 -6 -9 4 30
3561 30 52 63 67 77 90 99 106 118 130 123 93 61 44 41 34 21 13 24 51 87 125 154 160 146 131 133 146 141 110 77 73 99 125 133 127 123 123 115 93 63 37 24 21 16
3542 16 0 -23 -35 -23 2 21 32 47 70 82 71 46 29 28 34 38 38 40 41 32 9 -14 -20 -3 19 21 4 -8 2 29 50 54 49 44 41 36 25 10 0 3 24 50 63
3523 63 59 49 43 38 26 9 1 9 29 50 68 82 94 104 109 104 88 65 45 30 20 14 14 20 24 14 -4 -13 1 33 65 86 98 99 86 62 38 27 34 59 92 116
3505 116 117 102 97 119 158 187 198 204 217 230 231 224 217 210 198 181 166 153 140 134 149 185 219 230 216 195 181 178 185 202 221 228 213 185 161 151 150 147 135 120 109
3487 109 107 105 89 66 59 81 112 120 97 69 65 86 109 111 96 85 102 146 188 193 157 113 96 115 153 187 204 198 168 128 94 82 93 112 121 107 76 52 53 69
3470 69 75 66 59 69 84 83 65 56 71 95 106 107 121 161 211 243 241 206 146 76 24 12 34 59 67 65 69 82 94 110 138 177 206 215 213 213 211 196 170 148 138 132 124
3451 124 131 162 205 228 220 198 179 167 154 139 125 108 86 65 53 46 37 31 38 67 109 154 189 204 196 175 157 145 125 94 62 43 36 34 42 63 92 117 138 158
3434A58J5LqqmKKkj1k2k7k2j6j1LK2L3K6J0ok2l5k9pJ2Oj3j5QL7N2M3J2k5m1k8mLonJ0K5K2
3415A37Nrj8k4k5k0rMJ3K0K2K8K8J2j9l5j7J2J6mj8qLkoMJ2MqqJLLRJ4%k0k1KJ9J4lj0kJ4
3396A13K1J4jj3j4rolLQJ0J8L2L7J6k0l7k5mJrj5j0mlpj0qkNPMlomPK5L7L4J7lj2j4j8k1j9
3376A09j0OJ7J9Pj4l2l2rK1L6L5L4L9L2Ok0k2lOnj6pJ5K8K9K1Lk3l7l3k2k7l7l2rJ2J5J2J7
3359A29K7L6L2J5rk3j3NPnoJ4L2L4K2J1kk2l9m0l1k7k6k2k2l6m8m3j4J6L0L0K7J9J3J0Nkq
3342G6ronnjOJ2K1L2L3J3k3m5l9j2K0L9L6J2qrMJ1QJKjoj3j5k3l4l5k5j5oJ2M3N8M2J2JMM
3323A67lonj7m0m7l0qOJ3K4K5Nk5l3j5OPmj4j0qj2k1k5rK7O0P2M9J3j1qPJ4R%j0k1l0k5j1
3304E6jnj0mRRlnPJ4Jj6rJ5K9K1Lj1k5l8l3kL1M0K6J2J3J8J7J4K1L0K4kk4k8j8j0rrpnnjJ4
$$ plain form
3434 158 173 176 168 160 156 158 160 158 147 125 98 76 60 49 52 74 107 133 143 137 115 80 51 44 56 62 49 34 42 79 131 174 186 161 120 92 88 91 85 80 90 115 137
3415 137 142 133 115 91 66 46 37 41 54 74 96 124 152 164 145 110 93 105 121 117 99 91 94 92 86 90 102 106 98 90 91 94 97 106 120 120 100 79 81 100 114 111 101 99 113
3396 113 134 148 147 134 120 111 105 102 105 113 123 141 173 210 226 206 169 144 140 141 132 117 107 103 100 93 83 75 73 78 85 89 86 80 76 83 108 145 179 196 193 181 167 149 128 109
3376 109 99 105 122 141 148 134 102 70 61 82 118 153 187 226 258 264 244 222 219 225 220 204 197 212 240 269 290 293 270 233 200 178 151 114 82 73 85 100 112 129
3359 129 156 192 224 239 230 207 194 199 206 201 195 209 241 275 297 308 306 284 245 205 174 147 121 99 77 41 -7 -50 -64 -48 -18 12 39 58 71 81 86 84 76
3342 76 67 61 56 51 50 56 68 89 121 154 167 144 99 60 48 68 107 143 155 147 138 142 153 161 162 164 163 157 144 129 106 72 37 12 -3 -9 3 46 104 146 158 159 163 167
3323 167 164 158 153 136 96 49 19 11 17 30 54 79 84 59 26 11 17 24 20 6 -4 -12 -24 -45 -70 -79 -52 8 80 129 142 131 123 130 144 153 153 143 122 92 67 56
3304 56 55 50 40 36 45 54 51 46 53 67 68 52 43 58 87 108 111 100 75 37 4 2 33 73 99 111 124 142 159 173 194 224 248 246 222 194 176 166 157 148 141 136 131 130 144
3285A44K9L0J2j2j9j1JJrj9k0j6j3j1j4j3mJ6L3L6J8%j0j3k1k5j3PJ7J0l%QKj7k6qK3L8K6
3268A54PkJkj6l6n0n0l4oK2L5L5L0K9K7Ok5l9k9j1JRJ6J6ok6k4%J1kj2jJ7J5pk1j6qrj6j3
3249c0MK5L7L8K9K3K5K2Jk7l7k0J0K4K1J4Q%onNJ5J2kk1l5l1j9j4k3k9j5RK5K5K3L0L4K3m
3232A64k8m5n1m3k4NL6N4M1Ll0l2j3mj0pJ9M3L5Lk6m3n0m4j3L0N3M1Nk9m8m4j9OQmjJ9L2K1
3215A0QJ4L2L6K6K1K3J8%j8k3j7j0rj7k9l7k8oJ0J2Jj5k6k7rJ8L6L8L7L5L0J7%j0j4rJJ0R
3197A38lpjQRLmj2k4l2k5j2j2k6l4k3MK2K5J5J0J0J2J1Ml%QJ0L%J0K0J9Lj5k8l4k8mK0K4J0
3179G1jOJ4Nj3j7mJ1J6J4J2%j5k0rJ0K4K9K8J4pj8j0NJ1Lrk2l6m8m6l2j4KK2M1M6K6KkJ1J6
3160A16jk0k4rOPmj4j6ql%PJ9K0Lk0j6J4M4M6K1j1l5n1n5n0l6j6NJ7J6QLJ1J4Mj1j2mqk8m6
$$ plain form
3285 144 173 203 215 203 184 173 174 175 166 147 127 111 98 87 73 60 56 72 105 141 159 159 149 136 115 90 77 84 101 111 108 108 116 118 101 75 67 90 128 154
3268 154 161 159 160 158 142 106 56 6 -28 -34 -12 23 58 88 117 144 150 125 86 57 46 47 56 72 88 82 56 32 32 43 41 29 28 45 60 53 32 16 8 -1 -17 -30
3249 -30 -26 -1 36 74 103 126 151 173 174 147 110 90 100 124 145 159 167 167 161 156 161 176 188 186 165 130 99 80 66 43 14 -1 8 33 58 81 111 145 168 164
3232 164 136 91 40 -3 -27 -22 14 68 109 112 82 50 37 33 23 16 35 78 113 116 90 47 -3 -47 -60 -30 23 64 69 40 -8 -52 -71 -65 -57 -61 -62 -43 -11 10
3215 10 18 32 64 100 126 147 170 188 188 170 147 130 120 111 94 65 28 0 -6 4 16 17 2 -24 -51 -60 -42 -6 32 69 104 134 151 151 141 127 118 119 129 138
3197 138 135 128 127 135 144 147 143 131 107 75 50 38 26 0 -34 -57 -53 -31 -6 9 19 29 41 52 56 53 53 61 71 74 74 84 104 123 126 111 83 49 21 17 37 61 71
3179 71 70 76 90 95 82 65 61 72 88 102 114 114 99 79 70 80 104 133 161 175 168 150 140 145 156 159 150 128 92 44 -2 -34 -48 -46 -24 17 63 89 91 89 100 116
3160 116 115 95 71 62 68 75 71 57 41 33 30 30 37 56 76 79 59 43 57 101 147 168 157 122 71 16 -34 -70 -86 -81 -64 -48 -40 -37 -26 -12 -8 -19 -31 -35 -43 -71 -117
3142a17l8nK8M1L7K5K5L0L6K5Pmj0j7l2l7l2k1j5oJ6L7L7K6K2K8K9J6RJ5J4rl8m3k4nNJ5K7
3125I7L4K6J4Lqj9j8j2oj1j4rj0j9k1MM1N4L4QJPNnoLRLj1k1k5k3j6mMOkj0j3q%LKKJ%%LR
3104H2PkqKJ9J8nk6k0PK5J4j0k2j5NK4L5M1L6K0mk8n1o4n1j5K0K9J4KJ3K6K2jj7j4m%KRJ5
3085A30J2KlKJ0J2MooNJ6J6mk7l3j5J5M2M9L5Ok1l4k8j4j%j1k7l3k8j7j2pMJ9K7K9L2L3K0
3068A93pl0l0j5JRJ1Plj1j1pllkmj4k4j9qqj7j4RL7M8M0K8K0Qqk0j6jJ2K1K5K3J0qk4l3l7
3049A25l2j7KJ1Kj0j4mPJ4J9K0J5lj8j2J0K5J9Lj0j7k7m2m4k1RK8K9K8L5L8K2ol0l8l1j5N
3032G5J8J4mj5qJ1J4%j6j5lOLrk1k4j3LJ7K2K5K4K0J4J3J7J2%j0mOP%pqj1j8k1j9j8k0k3j7
3014A7mJ3L1M3L7J6nrkJj0k7l7l0j5JOQJ3J8J6%j4qJ0J7OqrlKKQJ6J9Prk1j9j3mJ0K5L3K1
$$ plain form
3142 -117 -155 -160 -132 -91 -54 -29 -4 26 62 87 94 90 80 63 31 -6 -38 -59 -74 -80 -64 -27 10 36 58 86 115 131 140 155 169 160 122 79 55 50 55 70 97
3125 97 131 157 171 174 166 147 129 117 111 100 86 77 67 48 27 31 72 126 160 168 169 176 181 176 170 173 182 185 174 153 128 105 89 85 89 95 93 83 70 62 62 65 67 69 70 70 70 73 82
3104 82 89 87 79 81 100 118 113 87 67 74 99 113 103 81 66 71 95 130 171 207 227 223 195 144 80 29 14 34 63 77 79 92 118 140 139 122 108 104 104 106 115 130
3085 130 142 144 141 143 153 165 169 163 157 162 178 194 190 163 130 115 130 172 221 256 262 241 207 179 165 164 164 153 126 93 65 48 36 29 33 52 79 108 140 173 193
3068 193 186 156 126 111 112 121 132 139 136 125 114 107 104 101 99 95 81 57 38 30 22 5 -9 0 37 85 125 153 173 181 173 153 137 136 148 169 194 217 227 219 195 162 125
3049 125 93 76 78 89 91 81 67 63 70 84 103 123 138 135 117 105 115 140 159 162 152 135 108 66 22 1 10 38 67 95 130 168 190 184 154 116 85 70 75
3032 75 93 107 103 88 80 91 105 105 89 74 71 77 80 71 50 26 13 16 33 55 80 104 124 138 151 168 180 180 170 166 172 179 179 172 164 153 135 114 95 77 57 34 17
3014 17 13 26 57 100 137 153 148 139 137 138 128 101 64 34 19 20 26 34 47 65 81 81 67 59 69 86 92 84 75 72 74 76 84 100 119 126 117 96 77 64 60 70 95 128 149
2994A49mk1j9kMpj5jK0K6J3lpJJ2K0K6K2J0Kjqk6m2l7j0RRmnOJ3QLNMqk4k5nJ6J5Krj0j1j7
2974G4j4KJ9K1J3QNpk5l4k4lJ4K3K6J9Onrj0j6j7mJ0J3%j2qNJ9K4K3K0J7J1jj1j2JJ5J1lq
2955A76LQmk8m2m0l4k6j6oKLJLJ3J9J4%j1rJMoj7j0QK1Rj8l4k5LL1M2L6J6rl0l3k2pNNmj2
2935b0oORql3m1l0k1l0l9k9JL2M8M7L0Nj1jK3M1L8K1MopkKkj1j5j7j3lJ5K9K6J1NJ3J4pl0
2917C8k3OK2Qj5j9kJ4J4Jj5k2j6%J5K6K6J5%qpoomOJ4J0%jPQjqp%J0J7J9Kk5l8k4nLjnrj4
2896@j4MK1J9LJJ7K9K1MkQJ8J9J1lrkJ2J4Lpmnj8l2l1j7j2j1ML5N7M9K0rk7l1k4nJ6K4J9J1
2877A76Jj2k8m1m4l2j3QJ9K0J6J0QQJ1J6J5Mrj2rj4l0m0k7KL0M2L7J9nj4oJ0J3%j5j5j0ok
2859H1PJ6J1pk1k2j9j7j6nJ5L4L3J1j6k6j4QJ7J4J2K0K8J3k5n4n1j9Lkj9k0JJ7J5RJ2J2Jj4
$$ plain form
2994 149 145 124 105 103 107 100 85 84 104 130 143 140 133 134 146 166 192 214 224 226 225 217 191 149 112 102 111 120 116 111 117 130 138 141 146 150 142 118 93 88 104 119 121 112 102 91 74
2974 74 60 62 81 102 115 123 128 121 96 62 38 35 49 72 98 117 123 118 109 99 83 66 62 72 85 85 73 65 70 89 113 136 156 173 184 183 172 160 161 176 187 184 176
2955 176 179 187 183 155 113 73 39 13 -3 -9 -7 -4 -3 0 13 32 46 46 35 26 27 31 25 8 -2 6 27 36 18 -16 -41 -38 -7 35 71 87 78 48 15 -7 -14 -9 -4 -8 -20
2935 -20 -26 -20 -11 -19 -52 -93 -123 -144 -174 -213 -242 -241 -209 -161 -114 -84 -79 -90 -91 -68 -27 11 32 36 30 23 21 23 21 10 -5 -22 -35 -38 -23 6 32 43 48 61 75 68 38
2917 38 15 21 43 51 36 17 15 29 43 44 29 7 -9 -9 6 32 58 73 73 65 58 52 46 42 48 62 72 72 71 78 86 85 77 70 70 80 97 116 118 93 55 31 26 29 28 23 14 0
2896 0 -14 -10 11 30 33 34 51 80 101 105 103 111 129 148 159 156 147 145 157 171 174 167 163 158 140 108 77 60 48 37 41 76 133 182 202 193 166 135 111 106 122 146 165 176
2877 176 177 165 137 96 52 20 7 15 34 54 70 80 88 96 107 123 138 142 133 121 112 98 68 28 1 3 33 75 112 131 126 112 106 116 129 129 114 99 89 83 81
2859 81 88 104 115 108 87 65 46 29 13 8 23 57 90 101 85 59 45 53 70 84 96 116 144 157 132 78 27 8 11 9 -10 -30 -29 -12 3 12 24 36 37 23
2842B3j4jQQNQNkqj2j6k1j4QL5M7M1L1K7K1Pj0j7pJ5K8K4J0%jpk0l0k8j3k%qj1qmj1k3k6j2
2822B5%ok2k0QL6M2L0J9J3Nqj6j5rLK1L4K8jl0l4j2J5K5K1J5K2K7J7j1l3l1rJ6K9K2Oj1j8
2805A93k0k9m2m3k7nPJ3J9J5JpLJ5Nj4j2J5K7J4JQJ4lk6k5mJ0QPJ0Opj5j3j1j2kJ8L0K5J0
2787A57J0K3K9J8nk6l8m3m2l6k0LJ5QqrJ3L3K7ml3m4l2j5J0K7L1Rk6m6l8j0J5K3K2J5J2J0
2770C5J5K7L4K7J2%onPK9M2L1kk5j9JOkj1j1j2j4j7j5j9k9l5k4JJ9J5%pjRPoj7j8j7j5j4o
2752c0JJ%QJ9K4J3oj7j2JJ4J9K3K3J8Mj1k0k2k1k3j6jJ5K0J3QJ4K2K4J5NKPPJj0j4roj0j9
2733G4k6k0%K9N5N9L3ql4k9nJ3J0%nKPOOJ2J1mj9j9qjnoOJ5Qqj5j2lNJ9K9K3ml8n6n5l9j4
2714a1NJ1PPJ4J8J1kj1j4j3pNJ8K4K5K6K8K5J2rk9l9k7LL1L4J2j6k2kK0K3Nj2j7j5j5j4pL
$$ plain form
2842 23 9 8 16 24 29 37 42 40 32 20 4 -17 -31 -23 12 59 100 131 158 179 186 176 159 152 167 195 219 229 229 228 221 201 171 143 130 128 128 120 109 101 97 86 63 37 25
2822 25 25 19 -3 -23 -15 21 63 93 112 125 130 122 106 91 82 85 106 140 168 167 137 103 91 106 131 152 167 189 216 233 222 189 158 149 165 194 216 222 211 193
2805 193 173 144 102 59 32 27 34 47 66 81 82 75 78 93 98 84 72 87 114 128 129 137 151 148 122 97 93 103 111 118 128 134 127 112 99 88 76 74 92 122 147 157
2787 157 167 190 219 237 232 206 168 125 83 47 27 30 45 53 45 36 49 82 109 105 72 28 -4 -19 -9 18 49 58 32 -14 -52 -62 -47 -24 -2 13 25 35
2770 35 50 77 111 138 150 150 144 139 146 175 217 248 246 221 202 203 209 207 196 185 173 159 142 127 108 79 44 20 21 40 55 55 48 47 56 63 57 40 22 5 -10 -24 -30
2752 -30 -29 -28 -28 -20 -1 23 36 30 13 1 2 16 35 58 81 99 103 92 72 50 29 6 -10 -11 4 24 37 45 59 81 105 120 125 127 134 141 142 132 118 109 103 93 74
2733 74 48 28 28 57 112 171 204 196 162 133 128 141 151 151 146 148 155 161 167 179 190 186 167 148 140 139 134 128 134 149 157 149 134 122 119 124 143 172 195 191 153 97 42 3 -11
2714 -11 -6 5 12 19 33 51 62 60 49 35 22 15 20 38 62 87 113 141 166 178 169 140 101 74 77 108 142 154 138 116 114 134 157 162 150 133 118 103 89 82 85
2696H5LMJ9M0M4K1rk6l4m0m2l1rJ2K2K0Oj4k5k0rlLJ2J7OokJ2J0j1k9k3pkKJ4K5J5kpLRNP
2676F5J7J9Lj5j6nko%K0L4K7Opj1j1j3rMJ4J3PNQRjj4k3k1j4pnolOJ5J3JqmPJ6J7J1PJ0J4
2656A67J3%j7k3j3j%qj4j6j2plmj4k7l1k8k0qJ0L1L6K3%j6rJ6M0M2J5j7l2l2l0k8j8MJ4Mj1
2638b4nJ4K2J6QJ6L0L7L0J5PJ1J6J2nk4k9k1j1jJ0J1nk6l1j5LNKMRLj0j5pLMLQJ4J4PKjnr
2618I2j1nPJ2PnrkPNoj1kRJ1L%KPRQMpj9k4rJ1J0j3l7l2kK7L6K8J4jj4j6mJ3J6Mj1j0KJ3J8
2597A25J8J8J6Oj0k2k9k8k6j8kJ6K1J0lqppqmORQQJ0Rjj1j9k3k3j7mJ0J4Jj7l0l1k1qMJ7K3
2578b8K0RKjpk1k2LL6M6L6K2K0J9RKQNj4l2k1QK5J5nj7k0j4LJ8J4j5m5n8n5l6kL0L8J5okJ7
2560aK3J9K3L3K8ll2l5j5MJ5J7K0K2K1J4%j4k1j0RK1J7%j9l1l0k2j0jMMQJ3J5QmrKJ7J5qk5
$$ plain form
2696 85 88 92 111 151 195 216 207 181 147 107 65 34 25 37 59 79 85 71 46 26 17 14 17 29 46 52 46 44 56 66 55 26 3 -4 -6 -4 10 35 50 48 41 44 53 58 65
2676 65 82 101 104 89 73 68 66 60 60 80 114 141 147 140 129 118 105 96 100 114 127 134 139 147 156 155 141 118 97 83 76 71 65 62 68 83 96 97 89 85 92 108 125 136 143 153 167
2656 167 180 180 163 140 127 126 126 118 104 88 76 69 66 62 48 21 -10 -38 -58 -66 -56 -25 11 34 34 18 9 25 65 107 122 105 73 41 11 -17 -35 -31 -17 -13 -24
2638 -24 -29 -15 7 23 31 47 77 114 144 159 166 177 193 205 200 176 147 126 115 114 124 135 130 104 73 58 61 66 68 72 81 84 74 59 52 55 59 62 70 84 98 105 107 106 101 92
2618 92 81 76 83 95 102 97 88 86 93 98 92 81 79 88 99 102 102 104 111 120 128 132 125 106 82 73 84 94 81 44 12 10 37 73 101 115 114 100 84 80 93 109 113 102 92 94 107 125
2597 125 143 161 177 183 173 151 122 94 68 50 48 64 85 95 92 84 77 70 62 58 64 73 81 89 99 108 107 96 77 54 31 14 10 20 34 35 18 -12 -43 -64 -72 -68 -51 -28
2578 -28 -8 1 3 2 -5 -26 -48 -45 -9 37 73 95 115 134 143 145 153 158 144 112 91 99 124 139 134 117 97 83 86 104 118 103 58 0 -55 -91 -93 -63 -25 -10 -16 -18 -1
2560 -1 22 41 64 97 125 122 90 55 40 44 59 76 96 118 139 153 153 139 118 108 117 138 155 155 136 105 75 53 43 42 46 50 58 71 86 94 90 81 83 100 115 107 82
2541H2j8RK4Rk3m6m3k7oJ0K2K5J9OjJOJonJ2K7K4QljOJ0J0Qjj2j8j4rj5k5k1jJ7J9Mj3j7j1
2521B3MJ5J6PLJ3K2J0k3m5l4KK6K2OJQJ1JokOOllRK0K1J5J8K1J2j0l0l6l1j7KJ8J2j0k9k6
2503D5pNRJ2J5J1%rj0mOK1L7L9K2kj3j4oKRJ0Njmnj2j8j7j6j7j6j4j3j9k1qRJ1JmPJ5PmMK2
2482G0K7J2pj6k1k7l0j9oJjqj4j3mJ6L6M0L6K5J4LnJJ4K1J7Nlrj1mJ2K5K4J3NLRJ8K4K0Kj8
2463B77k4j5rj4k5l3l6m0l6k2oNKrj3pMJ0J4K1L5M7M6L3K0J1Kj0j7k1l0l9l7k2o%klkkPK0
2445G4K3Lk0k4nJ1Ppj3j4j9j6mJ5K6K4K5K7J9kk0k1j3j1j7k0j7qPL1N1N2L3J0oj5k1j7lMj0
2427A19k5k1KJ3Jj6j3NK1K3J8J3QJkJJoq%RLj8l4k5MK4J6rk3j0J0J6Mj6k9l0k0qkkKJ4K3J7
2408E1LlKLnoJJ0PMJ3K8K5jk4k0J1M5N9M5J6j8m1m6l8k3j0k%%nnLJ4J7J4QMjpmJ4K7K4J1j
$$ plain form
2541 82 64 73 97 106 83 37 -6 -33 -39 -29 -7 18 37 43 42 43 49 50 44 39 51 78 102 110 107 106 112 122 132 140 139 127 109 95 86 71 46 25 24 41 60 64 51 34 23
2521 23 27 42 58 65 68 81 103 113 90 45 11 13 39 61 67 68 76 87 88 82 80 86 92 89 86 95 115 136 151 169 190 202 192 162 126 95 78 80 98 110 100 71 45
2503 45 38 43 52 64 79 90 90 81 71 67 73 94 131 170 192 190 177 163 157 159 168 178 183 182 178 173 161 143 126 110 93 77 63 50 31 10 2 11 22 23 19 26 41 48 44 48 70
2482 70 97 109 102 86 65 38 8 -11 -17 -16 -17 -25 -39 -52 -56 -40 -4 36 72 97 111 114 109 110 124 145 162 167 164 155 144 140 152 177 201 214 219 222 231 249 273 293 295 277
2463 277 253 238 229 215 190 157 121 81 45 23 17 22 24 15 2 -5 -1 9 23 44 79 126 172 205 225 236 238 228 211 190 160 121 84 62 56 56 54 51 49 47 54 74
2445 74 97 100 80 56 51 62 69 62 49 35 16 0 -4 11 37 61 86 113 132 130 110 89 76 65 48 28 11 3 10 41 92 144 177 187 181 166 145 128 125 129 119
2427 119 94 73 75 88 89 73 60 65 86 109 127 140 148 149 147 148 149 143 135 135 144 147 129 95 70 74 98 114 105 82 72 82 98 102 86 57 27 7 -1 -3 -5 -3 11 34 51
2408 51 54 51 53 56 51 45 46 56 63 67 80 108 133 132 108 88 99 144 203 248 264 246 205 159 121 98 88 86 86 86 81 76 79 93 110 124 132 136 135 128 124 138 165 189 200 199
2388A99npmPJ3ml1l4oK3K3Lj1j7j9j4KJ5Ok0l5l2k3k0j6rmKJ5L1L5J5k%J3J6J0QOqj8j2J0
2369A01J7Lj5j4MJ8K1J1jj5k3k1pJ3K9K9J2kKJ1J3Lqj3k6m8o7o8n1k6mNPOJ4K7L4K9K2K1K3
2352F6J7Qnk0k9k0OK4K0OMJ6K6K2J7J3QlnLJ3Ppj7rLMj6l8m0j7J0J6Jj0lJ5K8K8J6MJJ6L1
2332B10K4rm4n2m1k6j8rKJ0J0QJj0j6j0jJpqkLLMNJrj1%J3J6J5J6Rrk6j8PK1J3Jlqk0k4mK4
2312C2L7K6R%%Klj3k3k1kK4L4K3J2J8K9K7Oj6k4k5k9k6j2QJ6J2J1J9K8K5Pk0m1m9m4l0j5l
2295IPJ2J0Llqj2j2ojoqLK2K8Rj2pRJ4LqmNJ0J0MnqNK6K5Jk5k7j4pj4j5lJ7L5L8K8J0jLRJ
2274A50k5m8m6j4K7N0M3J6jKJ0RKMJ2J2jj8k5k5k9l3k6j4oonLJ7K2J8Opj8k2j9j5j3j0JJ7
2256eK4K5K2K4K4J2j4l4l3j9j2j9k6j6PK1J9J2Lpj5j7pOJ2J4K1K5K2J7K3L8L7J3k0m2m8m8
$$ plain form
2388 199 194 187 183 190 203 199 168 134 128 151 174 177 166 149 130 116 118 133 139 119 84 52 29 9 -7 -16 -20 -18 -3 28 63 78 76 76 89 105 115 123 129 121 103 91 101
2369 101 118 121 106 92 96 114 135 146 145 130 107 86 79 92 121 150 162 160 162 173 186 189 181 168 142 94 27 -41 -92 -118 -122 -117 -110 -104 -90 -63 -29 0 22 43 66
2352 66 83 91 86 66 37 17 23 47 67 73 77 93 119 141 158 171 179 176 171 174 187 194 187 170 161 164 168 152 114 74 57 67 83 84 74 71 86 114 142 158 162 163 179 210
2332 210 234 225 181 129 88 62 44 35 37 47 57 65 66 56 40 30 29 30 23 15 13 16 19 23 28 29 20 9 9 22 38 53 69 78 69 43 25 32 53 66 67 64 56 36 12 8 32
2312 32 69 95 104 104 104 106 103 90 67 46 44 68 102 125 137 155 184 211 217 201 177 152 123 97 85 93 109 121 132 151 179 204 211 191 150 101 57 27 12 9
2295 9 16 28 38 41 38 30 18 6 0 -1 -7 -15 -12 10 38 47 35 28 37 51 54 46 42 47 57 67 71 66 58 63 89 114 115 90 63 49 42 28 13 10 27 62 100 128 138 137 140 149 150
2274 150 125 77 31 17 44 94 137 153 152 154 164 173 175 179 191 203 202 184 159 134 105 72 46 32 26 20 15 18 35 57 75 81 74 56 34 15 0 -13 -23 -22 -5
2256 -5 19 44 66 90 114 126 112 78 45 26 14 -5 -31 -47 -40 -19 0 12 15 8 -7 -24 -31 -25 -13 1 22 47 69 86 109 147 184 197 177 135 87 39
2239C9l9j0L0O0N5K9PJLJpj8k2k0j4j5k2k2pK0L7L7K1Kj3k6l0l0k2rKjj5k6j8J0L1K5Orqn
2221Hqj1r%MMOQKqpJ3L5K9Kk2l1l2l2k3nLoj8j4MJ7J6PkkMJ6K5K7K3J7RjLK5M8L8mm5n2k4
2201C7PK3K4J8OloOK2K5J2oj3j0prp%NKpj4j6j9j9oRJ2Jj1j0mnj2j6j3j0qokPJ4J2kj9k0m
2180d2J2J2QJ4L0L0J2lmKJonkqj8k0qNJ2J2J0Ll%K0L7L3J0kQK2J7%j3qLJ4J7Qj3l3l6k0lN
2160A10RJ6K3J6Jj2j6j4nMJ1Onj4j5j4j7k6l5l4k0jJ3K0K6K9K6J4N%mj0j6j8j0MK0K5J1qj4
2143H1kMpj8j2JLkjORQJ2J6Lj5j8MK3K5K1J8J5Lj4k6m1n1m2pK6L3J4J%lj9l0k0LK4L7L8L1
2124A31J0j4k6k4j4ojJ0K7L9L7K2Q%npLJ9K5Pk0l5k6nJ7L0K9J4nk1k8k3qJ3K7K6J7Pok4l8
2106A82l3j2Kjj0j3j4j9k0j0OJ4QNLkj7k7j6J1K9K1LlPRpk9l0j7mlmJQROKlnPK8L9K8Nrj0
$$ plain form
2239 39 0 -10 20 80 135 164 171 172 175 176 169 151 129 109 95 80 58 36 29 49 86 123 144 146 133 107 77 47 25 16 18 17 2 -24 -42 -32 -1 24 30 21 13 8
2221 8 0 -11 -20 -20 -16 -12 -6 2 4 -4 -11 2 37 66 68 46 15 -17 -49 -72 -77 -74 -80 -98 -112 -108 -91 -75 -68 -70 -72 -68 -52 -27 0 23 40 49 48 51 76 124 162 158 113 61 37
2201 37 44 67 91 109 115 112 106 112 134 159 171 165 152 142 135 126 119 119 124 126 119 105 89 70 51 45 54 66 67 56 46 42 37 25 9 -4 -14 -22 -28 -30 -23 -9 3 1 -18 -38 -42
2180 -42 -30 -18 -10 4 34 64 76 73 69 71 72 66 61 59 51 33 13 5 10 22 34 44 47 44 44 64 101 134 144 142 150 172 189 189 176 168 171 185 202 210 197 164 128 108 105 110
2160 110 119 135 158 174 175 163 147 133 128 132 143 149 144 130 115 101 84 58 23 -11 -31 -32 -19 1 27 56 82 96 101 101 97 87 71 53 43 47 67 92 103 95 81
2143 81 79 83 76 58 46 47 50 48 47 53 62 70 82 98 101 86 68 72 95 120 141 159 174 177 163 137 96 45 3 -4 22 55 69 70 70 67 48 18 -2 1 25 62 100 131
2124 131 141 127 101 77 63 57 56 66 93 132 169 191 199 199 194 187 190 209 234 241 221 186 160 155 172 202 231 245 240 219 191 168 160 173 200 226 243 250 244 220 182
2106 182 149 137 139 138 128 115 101 82 62 52 58 72 80 85 88 86 69 42 26 37 66 87 90 87 94 103 96 67 37 20 16 13 9 10 18 27 33 35 32 27 34 62 101 129 134 125 115
2085A15j0j5k0j3PK2K0OkLJ0Oj0k1k4k1k0j2NJ7J7J2J3K2K4J8J4J6J6Mj8l2k6qJ2K2K1Qj5
2069A63l5m2l2j5KJ3K2K2J1JKJ2J4Jj6k6k8k4j2NJ0jj7j8o%oj3qNJ9L3L4K2MnjNORK2K9J6
2050A77j2l9m8m2l1k2k3k6j4RK7K3NomKjqqjMRJ9K9L0J8lk0k7k3qJ0K3K4J5nk3l1k2nOQJ2
2031bJ8K2J9J5J5Qj0k8l2j7KJ8K1J0qj8mK4M3M1K7J6J0Ojj2k4k8j7LJ9K2J7J2J0Jpj1j0qq
2013A54j6k4l2l2k3j4pjLkj4k7k0LK0K1PllOJ6K8M0M4L5J6jkOQkj8k7k9k5j2J1K9L3K8K5J9
1995B18Mj4j9j0JN%pj1nJ3K6J9nj8j3koj7k1k2k2j9rK%pqLJ0OklQK2K5J5j0l1l8k9j2%krq
1975bPL1M3L5K0J4J5Qrk1j4jPJ1J6K2J3j0l6m5l5j3J3K9K7J0j0j3lPOJkoj6k4j7KJ7J9J9K0
1957A35J7Lj4k1k3k3k2j2lmj4j4QK8K5Jk2k3j0J4L6M3K9KrNK4K0jj7j1%jrj6j9k2j8qKM%O
$$ plain form
2085 115 105 90 70 57 64 86 106 112 110 113 123 129 119 98 74 53 33 21 26 43 60 72 85 107 131 149 163 179 195 199 181 149 123 115 127 149 170 178 163
2069 163 128 86 54 39 41 54 76 98 109 110 112 124 138 139 123 97 69 45 33 38 48 47 30 12 6 6 0 -13 -21 -16 3 36 70 92 96 91 90 95 101 110 132 161 177
2050 177 165 126 78 36 5 -17 -40 -66 -80 -71 -44 -21 -16 -22 -26 -24 -25 -33 -41 -42 -38 -29 -10 19 49 67 64 44 17 -6 -14 -4 19 43 58 53 30 -1 -23 -28 -22 -14 -2
2031 -2 16 38 57 72 87 95 85 57 25 8 10 28 49 59 51 33 29 53 96 137 164 180 190 196 195 183 159 131 114 117 136 158 175 187 197 198 191 180 170 162 154
2013 154 138 114 82 50 27 13 6 5 8 6 -8 -35 -55 -52 -32 -11 -4 -7 -10 -4 12 40 80 124 159 175 174 172 178 186 184 166 139 110 85 73 84 113 146 174 199 218
1995 218 222 208 189 179 180 185 185 178 167 162 175 201 220 215 197 184 182 176 159 138 116 94 75 66 68 68 61 53 56 66 72 70 67 75 97 122 137 127 96 58 29 17 17 15 6 -2
1975 -2 5 36 79 114 134 148 163 171 162 141 127 126 133 144 160 182 195 185 149 104 69 56 69 98 125 135 125 112 109 116 122 123 121 115 99 75 58 60 77 96 115 135
1957 135 152 155 141 120 97 74 52 40 37 33 19 5 13 41 66 67 45 22 12 26 62 105 134 136 127 132 156 176 175 158 147 147 146 137 121 102 80 62 54 56 60 60 66
1938F6J4J5%j5k1j9j8j5oNPOJ1K0K3K1K2L6M9M3K1kj3j1kMLnj5k2k1j8j2JJ8K3J0j0j9j2q
1921A54j5k3j7kNmj3j2rj5l5n4n1j8K7N3M6K2OJkplJ1K1K2J6Rlj8l1l5l1k0NK9L4J4qlK0K8
1902I4Lk9m0k0J0K8K2Poj3j6oJ7M0L5Nj7j0J1K0J3J2K4K7Qj9l1l1k7l0k7j5LJ1N%NJ7K0J3
1885A13J1J8J8%k2k8k4j9j4jJ1QmkJ3K1J2oj9l1l4k0LJ4J0PJ9L0K3POJ1Pj2l3l9k5KK4K0q
1867F7k8j7J0K8K8K1J1kj7j9j0LJ1J3Nrk0k1j6j4j5oMMkOK4L4J5j2k2nJ8K4Pprnj3l1m0l2
1849c9j6JJ9L5L3Rk0k7j4LJ2J6J6J2RJ2J3JrNL7N1K7ok5k7k7k6j4NJ5Nj8l1j6K0N4N5L0Lp
1831A76j1j7j7nJ3K6L0K4Mk5m6m8l6j4RK7L0K2J4Pnk2k4r%rk1j2OQnj6j8k5k9k1NL0M0L7K1
1814I4KqlMlj5j7rprjJ8K8J8PQJ3J6J9K2J4j3l9m4l1j8rJQPKJOJ3K2L2L0J0j4k4k0j4j2pM
$$ plain form
1938 66 80 95 95 80 59 40 22 7 1 6 13 19 30 50 73 94 116 152 201 244 265 263 250 239 237 241 244 239 224 202 181 163 151 152 170 193 203 193 174 162 154
1921 154 139 116 99 97 102 98 85 73 64 49 14 -40 -91 -109 -82 -29 17 39 45 46 44 37 34 45 66 88 104 113 110 92 61 26 -5 -25 -20 9 43 57 49 46 66 94
1902 94 97 68 28 8 18 46 68 75 69 56 40 34 51 91 126 131 114 104 115 135 148 160 184 211 219 200 169 138 111 81 54 39 42 53 58 58 63 80 100 113
1885 113 124 142 160 160 138 110 86 67 53 52 63 71 67 65 78 99 111 105 86 55 21 1 4 18 28 35 54 84 107 114 120 131 138 126 93 54 29 31 55 75 67
1867 67 39 22 32 60 88 109 120 118 101 82 72 75 86 99 104 95 75 54 38 24 9 3 7 11 9 15 39 73 88 76 54 49 67 91 98 91 82 77 64 33 -7 -39
1849 -39 -55 -54 -35 0 33 42 22 -5 -19 -16 -4 12 28 40 49 61 74 75 66 71 108 159 186 180 155 128 101 75 61 66 81 86 68 37 21 41 95 150 180 183 176
1831 176 165 148 131 126 139 165 195 219 223 198 152 104 68 54 63 90 120 142 156 163 158 136 112 103 103 94 73 61 67 75 70 54 36 11 -18 -39 -34 -4 36 73 94
1814 94 96 88 85 89 86 71 54 45 38 29 28 46 74 92 99 107 120 136 155 177 191 178 139 95 64 46 37 38 46 53 55 56 62 75 97 129 159 169 155 131 111 97 85 78 82
1794H2J3J1LopJJ5K2J6QJ1J6Qk0m6n2l9k1mPRKmkQOqk6k8j7LK0K3J8J0PJ0J2J4J4J5Mj6l3
1775E9k2J0L2K7Porj7l0l0j3MPLOJ2J1NMQPkj2j7j6nJ0K2K1J4Lqk1k3rJ4K9L1K2J0kkJ4L4
1756A82L0Lj9j2J0K1J1oj9k5k1pOQNMPJj2j3lLrk4j3J9M0K6lj7qJ0J4Npj3j1oJNNKklk%%L
1735A66J1J4J0K%MLj0k8l3j6J2L5L8K1rl7m5k7jQnk2k2oQQJnj0j7j6jJ7J7Ln%Nnk1k5j9r%
1716a1J1J5Nj0rJ1K7L1K6K1Nk4m5m0j3NLjQK3L0K6J7J4J0jj7k2mK3K9J0rj2j0j5k0qJ7L1L6
1698A63M1M0J2m0q3q5n3j6J3K8K8J1opJ1L0L8L6K7J9RLqk2k8j5QK3K5J4Jj0j5rOJ6J1ok8m2
1681A40l6j8noj2j2lRJ7K6K6J8QPJ0O%k%Jmj0k0l1l3qK3L3J3orj1k5l8k6LK2K4K3K5K4J5P
1662A65%mnjlj6l3l2j6npoLLj7m2m6k1MJ3LlKK3M3N3L8J0j2j8j0%lj2j9j7nNJ1J2J2QK%MP
$$ plain form
1794 82 95 106 109 103 96 97 112 134 150 158 169 185 193 173 127 75 36 15 11 18 27 29 25 23 31 37 29 3 -25 -42 -39 -19 4 22 32 39 49 61 75 89 104 108 92 59
1775 59 37 47 79 106 113 107 98 81 51 21 8 12 19 22 28 40 51 56 60 68 75 73 61 44 28 23 33 55 76 90 93 85 64 41 32 46 75 106 128 138 136 134 148 182
1756 182 212 215 196 184 194 215 226 220 201 176 155 148 154 162 167 171 178 179 167 154 151 154 145 121 108 127 167 193 190 173 165 175 189 194 187 174 163 157 158 163 168 170 168 165 163 163 163 166
1735 166 177 191 201 203 203 207 210 200 172 139 123 135 170 208 229 220 183 138 111 110 118 113 91 69 63 71 79 80 75 65 48 32 31 48 65 68 63 63 68 63 42 17 -2 -11 -11
1716 -11 0 15 20 10 1 12 39 70 96 117 122 98 53 13 0 5 8 7 15 38 68 94 111 125 135 134 117 95 91 114 143 153 144 132 122 107 87 79 96 127 163
1698 163 204 244 256 216 133 48 -5 -21 -8 20 48 59 53 46 57 87 125 161 188 207 216 219 211 189 161 146 154 177 202 216 217 207 192 183 189 205 216 210 182 140
1681 140 104 86 81 75 63 51 48 57 74 100 126 144 152 159 169 175 175 173 173 174 170 160 140 109 76 68 91 124 137 131 122 111 86 48 22 25 47 71 94 119 143 158 165
1662 165 165 161 156 155 152 136 103 71 55 50 43 37 40 43 26 -16 -62 -83 -79 -66 -63 -66 -64 -41 2 55 93 103 91 73 63 63 60 48 29 12 7 12 23 35 47 55 57 57 61 68
1642F8NMJ3K9L5K5Mj5k3j9mPLrj5j1lnroQK1K3J3kqmJjnoLJ4J4Jj8l7m7m2j9NJ5PomOJ1%j2
1621Ej5j0kJ4L7N6M6Ol0l1JK7K5Kj5qNOqj6qOR%qrj1j7k3j7jJ3J5PMPJ2Mj4k6j6OK5L1L1L2
1601A47K4Pj5l2l7j8J7M6M7J9pj1PK0J8Jk2l4k3LK3K4J6QKrpJ2K7J1k1l5k0oj2k0rJ6K9K1
1583B07Mrj7j8j6j6j7rOJ4Q%LMmj5qRJ5Mj4k1k2j9j4o%OJ3J5P%LJ1Roj5rNJ0Noj7k4j9JK4
1563F2L0K1Nlnoj1j6j3%OM%RK0J2k1n2n7m0k2j4JL0O4P4N1J2j3j3LJ1QLkpqkPNj1k8k6pJ5
1544G6K1J3%nJJ0J7J7J2Lqj4j4j7k4k7j2J1J7%j8j5m%n%PQlj2j0pkQK3L2K3Jj9k4j2RK2J9
1524I8J2RJ6K1J8J7J5Qmj3j6j9k6l0k6j9j2oPJ7J9Orj7j3lOPNRJ5J8J6J4J0jj5j7lRNnmJn
1505A15j9k3j3pj3k2j9j0ppNK3L4K5Lj5j9j5qJJ4K7L7L8K6J0jjOJ0Ook1l4l8k7pOOLMLrk4
$$ plain form
1642 68 73 77 90 119 154 179 183 168 145 126 122 129 132 123 108 97 94 89 80 74 82 103 126 139 137 129 125 126 125 120 114 117 131 145 146 128 91 44 2 -17 -12 3 10 4 0 6 17 17 5
1621 5 -10 -20 -22 -8 29 85 131 137 107 76 77 104 129 131 116 108 113 119 111 95 87 93 102 102 94 85 74 57 34 17 16 29 44 51 55 62 74 78 64 38 22 28 53 84 115 147
1601 147 171 178 163 131 94 76 93 139 186 205 198 187 194 214 232 233 211 177 154 157 180 204 220 228 230 221 214 226 253 264 243 208 188 182 170 150 141 157 186 207
1583 207 211 202 185 167 151 135 118 109 115 129 137 137 140 144 140 125 117 126 141 145 131 110 88 69 55 49 49 55 68 83 90 90 93 104 113 107 92 83 88 98 103 97 80 56 37 38 62
1563 62 92 113 118 115 110 104 93 77 64 64 70 74 74 83 103 115 94 42 -15 -55 -77 -91 -90 -60 4 78 129 141 128 115 118 129 137 140 138 131 123 121 128 133 122 94 68 61 76
1544 76 97 110 110 105 106 116 133 150 162 165 157 143 129 112 88 61 49 60 77 77 59 44 40 40 35 35 42 50 47 35 25 18 16 24 47 79 102 103 84 60 48 57 79 98
1524 98 110 119 135 156 174 191 206 214 210 197 181 162 136 106 80 61 49 43 50 67 86 92 83 66 53 50 56 63 68 77 92 110 126 140 150 149 134 117 114 123 128 123 119 120 115
1505 115 96 73 60 53 40 18 -1 -11 -18 -25 -20 3 37 62 65 50 31 16 8 9 23 50 87 125 151 161 160 159 165 175 181 175 154 120 82 55 48 54 60 63 67 70 61 37
1486C7k1NL3L6J7%kM%qoJ1K9L0Rj7l4l4k0kRPlj8k5k3j2%K%LJ0J3Lj1j7j4j4qJ1M0N6M5J9
1467A40kj6k2j9q%NJ3K1K0Jj3j2pj7k9j8J5M0M0L5L2K2pl7m1k3oMJ4J9Qj5k3mK0K8K3J6J0
1449B07%rpRJ9Ll0n2m7k0klj8k6k2oJ3K9L2K4J8J8J3nl1m4l1rPOPK4M7M8J9j1j6lnk2k7pJ4
1431A04Pj2k0j1pj6k6l0l0k5j6kQJ5K6L8M0L0J6Nqj6j2QK5J8kj9j4MJ6J3nj9j9nJ3K4K2J3
1414A31PPRjj7k2j0OPnj3j5j4j2nQK1K4K4K6K7J8%k1l5l4k4j0NJ7K0J2LJJj0l0l3pK3K7J8
1395A24J4J3kl0m3k9nQLj1k1k0mNNRK0K1ol7l5lK0K0J2RJ1J8L8N1L3%qPJ5%j1pnoJ4M5M7K3
1376C02K2N0O0N5J05K19L28M40O72R89J051N52l12r64j053p65m79l31k22j11n7p0p6m6k5k8
1365C06k2JOj5k2kQpk0j0kj6l3k1MJ6Qlommj0k1k1oJ1J1ok0k3k3k3j2LJ1LjLNnj3pLJ2J6K0
$$ plain form
1486 37 16 21 54 90 107 107 105 109 109 101 95 106 135 165 174 157 123 89 69 67 76 83 80 62 37 14 2 2 4 4 7 17 30 33 22 5 -9 -23 -31 -20 20 76 121 140
1467 140 138 122 100 81 73 73 78 91 112 132 133 120 108 101 84 55 37 52 92 132 167 199 221 214 177 136 113 107 111 125 144 152 137 114 110 130 158 181 197 207
1449 207 207 198 191 200 219 222 192 140 93 73 71 68 50 24 2 -4 9 38 70 94 112 130 143 138 107 63 32 23 30 36 43 67 114 162 181 170 154 151 146 124 97 90 104
1431 104 111 99 79 68 61 45 19 -11 -41 -66 -82 -84 -76 -61 -35 3 43 73 89 94 86 70 58 66 91 109 107 88 74 78 94 107 102 83 64 59 72 96 118 131
1414 131 138 145 154 153 136 114 104 110 117 112 99 84 70 58 53 61 82 106 130 156 183 201 201 180 145 111 87 77 82 99 119 131 134 135 136 126 96 63 56 79 106 124
1395 124 138 151 149 119 76 47 42 50 53 42 21 1 -3 2 7 16 36 57 51 14 -21 -24 -4 16 28 37 48 66 104 155 188 188 180 187 202 202 191 184 179 173 187 232 279 302
1376 302 324 374 434 489 594 813 1141 1581 2253 3242 4293 4845 4533 3569 2516 1751 1272 941 719 608 551 481 405 359 334 306
1365 306 284 285 291 276 254 252 260 253 233 223 221 205 172 151 155 171 179 176 170 166 162 152 131 110 104 115 126 120 100 77 54 31 19 22 33 36 35 38 43 38 25 18 21 33 49 69
1345F9J6O%OJ2J2PNkokMJqlJ8K6Nk5l2j7%QJ5K8L5L0Qj6k7j6lnk2l0k0nJLOkj4j2J1K4Jl6
1325E4l9mK2J7%JK2L4L0J6QOOnk8m2l4j0J2K3K7K6J5MNJ5J1j1l0k8j6j1oJ0L0K7Lj6rQJ4Q
1306A65MOlk4l9l1qMrl4m1k5NK0K0K0K6L0K6K0K0J8Pnj0rk0l7l8j6J1J6J1J7L0K9J0%PJ5O
1289A94pjJ3J4mj9j7plJQJ0mk3k9j3RK1J8QONKj0j9j1J0K5K3Rnpqj5k5k7j7MK0L4M6N5M9K2
1270C35j4l8m8n1n1m3k9j1JNJnqlRJ6J4Ork4l2k1mMJjJ3K8K3kk5k3kK0L4L2K0Jj1qLJ0J0Q
1251A31Loj8k6k4j3KJ3J1rl2l2mK6L5K2J3J9K2Nj8k5j2%%mrj8k7k5rKoj6pJ6J6j3l4j8J7L6
1232a6K4QMM%LJ6K4Rj9l3j4J8L8L4J6nj7j5kMnl1n1n4k7J2M2N2M8L5K5J4Olj5k2j6%J0Mpq
1214I0oj1k0j9j3j3j5mK0L8L2J7PLj%QJ1LLJ8L2K4%j4j3j0qmmj7l6l5j3NOKKkj0nJ1K2Qpm
$$ plain form
1345 69 85 91 91 97 109 121 128 133 131 125 123 127 128 120 117 135 161 166 141 109 92 92 100 115 143 178 208 216 200 173 157 154 149 127 97 77 72 73 76 82 80 66 54 65 89 90 54
1325 54 15 11 33 50 50 51 73 107 137 153 161 167 173 168 140 98 64 54 66 89 116 142 157 161 166 181 192 181 151 123 107 96 90 100 130 157 160 144 135 143 157 165
1306 165 169 175 172 148 109 78 70 74 65 31 -10 -35 -30 -10 10 30 56 86 112 132 152 170 177 172 162 153 133 96 58 42 53 69 80 97 127 156 166 166 173 188 194
1289 194 187 186 199 213 209 190 173 166 163 164 172 182 178 155 126 113 122 143 161 169 175 180 182 172 153 142 152 177 200 209 204 197 189 174 149 122 105 109 129 163 209 264 313 335
1270 335 321 283 235 184 133 90 61 50 51 56 57 52 44 41 50 66 80 86 77 53 21 0 -4 0 1 0 13 41 64 62 37 14 12 32 66 98 118 119 108 100 103 113 123 131
1251 131 134 128 110 84 60 47 49 62 73 64 32 0 -4 22 57 79 92 111 133 138 120 95 83 83 83 79 70 52 25 0 -9 -7 -13 -29 -36 -20 -4 -17 -51 -69 -52 -16
1232 -16 8 16 20 24 24 27 43 67 76 57 24 10 28 66 100 116 111 94 79 77 81 76 45 -6 -60 -87 -75 -33 19 67 102 127 141 147 144 129 107 91 91 101 105 98 90
1214 90 84 73 53 34 21 8 -7 -11 9 47 79 96 103 106 105 105 113 124 127 130 148 180 204 204 190 177 167 159 155 151 134 98 63 50 55 61 63 65 63 53 48 59 81 89 82 78
1194G8QKj8k6j0J2K1J7J1NJJKkj5k3k3j5mJ0K2K2J1M%qk4l1j5PJ6OJJ1K3K1Oqj1qj1k4l2k3
1175a3jJ3Jj7j9MK7K4Oj0j6k0j8KK9M2L1Nq%J6K6K1J4J0J1J1Njoj7l6n0l6mJ7Nk8m2l0KK3
1156b7K0ql7l5nK1J4mjK1K1j0l3j8J5K8K3J6J9J6PKKlj5j5kJ3Pj5l8m7k8QM1N3N6N9O2N0J9
1139B52j3l1l4l2k2lJ6K3J7Okj3k9m5m5k5QL8M8L8J7nk3l0k9k1j3rokPJ6J1j0l3l4j1J9K9
1122B5K8L0L4K4jj8j1PK0J8Roj9k1qJ2K0J7J0QMoj4j5kJ7K7K1RMOkj7k6j4QK2J3pk7l5l0k3
1103I1j9j9j5qrk3l5k6LL2N0N4M2J6rj9j2jNJ0J5J7Oqj8j5nOPnj7k5k4j8j0%QJ2J3J9K5K1
1085A12Jj8k3j0OJ1lk3l6k8pJ0J0NOJ9L0L5L6L4K7J6OMMqk6l6k4%J1kl0m6l4nJ5J0oj3LL1
1067F4N4N6L4Mj9k3j5j5k0k1j2mmrok%RK6L2J1j1pJ4J4j5l3k0nj0k5j7OJ6J1RR%j0kJ5J4l
$$ plain form
1194 78 86 88 70 44 34 46 67 84 95 100 101 102 104 102 87 64 41 26 22 32 54 76 87 91 91 83 59 28 13 20 36 42 43 54 77 98 104 96 85 77 66 42 10 -13
1175 -13 -14 -1 0 -17 -36 -32 -5 19 25 15 -1 -21 -39 -37 -8 34 65 70 62 62 78 104 125 139 149 160 171 176 175 169 152 116 66 30 26 43 48 20 -22 -52 -50 -27
1156 -27 -7 -15 -52 -87 -92 -71 -57 -61 -62 -41 -20 -30 -63 -81 -66 -38 -15 1 20 36 43 45 47 44 29 14 12 25 32 17 -21 -68 -96 -88 -47 6 62 121 183 233 252
1139 252 239 208 174 142 120 117 133 156 173 179 177 164 135 90 45 20 28 66 114 152 169 164 141 111 82 61 48 39 33 31 38 54 65 55 22 -12 -23 -4 25
1122 25 53 83 117 141 140 122 111 118 138 156 165 159 140 119 111 123 143 160 170 178 182 176 162 147 145 162 189 210 219 223 229 227 210 184 170 178 200 213 206 179 144 114 91
1103 91 72 53 38 30 21 -2 -37 -63 -60 -28 22 76 118 134 125 106 94 93 98 108 123 140 146 138 120 105 100 106 113 108 91 66 42 24 14 14 22 34 47 66 91 112
1085 112 113 95 72 62 68 79 76 53 17 -11 -18 -8 2 7 13 32 62 97 133 167 194 210 216 220 224 216 190 154 130 130 141 139 109 63 29 24 39 49 43 30 33 64
1067 64 118 174 208 212 193 170 155 140 120 99 87 83 79 70 64 62 62 71 97 129 140 129 122 136 150 135 102 82 77 67 42 25 31 47 58 67 76 76 66 64 79 93 90
1048I0j3okj0j5%J2NoLK4L0K0QKMLJjnj1k0k8k8j2J1J9%k2k3pQJ1J1J9K5J7nk1k5j7qoqj1
1029A3j3j8k4j9j0%PK3M2N0L6K2J4J2RJ6L1L4J2j7k5j5j3k2k6j5%QQJrj5nJ2J4jj2qJ%qj2
1010G8j5k2k9k5j5lQK2K6J2j1k3j7nKPQJj0pJ9M9M9J4k9m8l5rQK6M6O2O0L6Jk3l0k0j2j5k4
993A07k8j6MK0J9RL%lj6k8k8j3JPPJ2J4PllRJ4jk8m2k6JK2K6J2l%J8L1K9J2qk9m1l1mJ4Or
973D4jK1K5Mj0%J9K1J2MNPQPnl0m6l5KM1O2N5K8lk2k7l4m8n1k9%J6J5J1J5J8J4PjqqjKj3l1
954F0k5NK9K5kk4k9k0j2qpKJ4J9J7J8L0M1L3Rj4k9l5l3k4j7k1k9k1l%j1j1J3L0J5j2j3J2K4
936dQj0mK1L7K7J2J0K0K8K0Nrk2l3l5k1KJ2Om%J3J6PkJQRpk8l9k5JJ2lk2k2j4qoOK2K3Oj4
916@j1RL4N1N0K6nj8pJ4K2J5Jpj1qjNLoj8k1j3MJ7J4j0l4l8j8PK2K4J9J1OMLrk7l4k4mJ2K1
$$ plain form
1048 90 77 71 69 59 44 44 56 61 55 58 82 112 132 140 142 146 149 150 149 144 133 113 85 57 45 56 75 75 53 30 23 31 42 53 72 97 114 109 88 63 46 38 32 24 13
1029 13 0 -18 -42 -61 -71 -71 -64 -41 1 51 87 109 123 135 144 160 191 225 237 220 195 180 167 145 119 104 104 112 120 121 112 97 92 104 118 117 105 97 98 98 90 78
1010 78 63 41 12 -13 -28 -31 -23 -1 25 37 26 3 -14 -19 -17 -10 -2 -1 -11 -18 1 50 99 113 84 36 1 -8 0 26 72 134 194 230 231 208 178 158 146 131 107
993 107 79 63 67 87 106 115 118 118 115 99 71 43 30 31 38 45 57 71 78 75 72 81 95 94 66 24 -2 -1 21 47 59 56 56 74 105 134 146 138 109 68 37 33 47 53 44
973 44 43 64 89 93 83 83 102 123 135 139 144 151 159 166 161 131 85 50 52 93 155 210 238 235 213 186 152 104 53 24 24 40 55 66 81 99 113 120 119 111 103 102 104 91 60
954 60 35 40 69 94 92 68 39 19 7 -1 -8 -6 8 27 44 62 92 133 166 175 161 132 97 64 40 23 2 -27 -48 -51 -51 -62 -73 -60 -30 -15 -27 -40 -28 -4
936 -4 4 -6 -10 11 48 75 87 97 117 145 165 170 161 139 106 71 50 52 64 70 66 66 79 95 102 100 101 109 118 111 83 44 19 20 32 29 7 -15 -29 -37 -43 -37 -15 8 14 0
916 0 -11 -2 32 83 133 159 154 136 129 143 165 180 181 174 163 155 154 159 162 156 138 117 104 108 125 139 129 95 57 39 46 68 92 111 122 128 132 135 126 99 65 41 37 49 70
897G0K5J8jj7j4MJ3P%LLnj5j3moj1oJ0J6Oj3k5k7j8KL3N5N1K6Kj0ojlj3j8j1JKnqJJ3J5J2
877A38Omj5j5nkj4k6k3qoj3oK2M5L6Pj1mJ5K6K6K1J4Kj7k9k4nPlk5l2j9jLjjRJ9J7J1PQLj0
857A23j9j2PK3L0K9K6J4ok3l1k6j6%J9K7J6lj1rj2k0j9j6j7k3rK1M5L5Oj8k4k0j2KJ6K0J3
840A26Mnj4j4JK3L8L4J9Kj3k8l5l1j1ORJlJ0L0L3J4j0j8rJM%j1k9m4l6j2PJj3j5JJ4J0mj4
821A9j7j8j7nJ6K9K0kj2nOKpjJ6L1K8J3Kjknj4k6l7l9l0j0J1K2K2J6J9K6K8J9Njlrk1k0nJ5
802E8K8L0K4J6NLJ0J5RmrkMqk9m1l3j3JPJ3K0J9Lj4j8plorKJ3QnqLJ4J5PKjmqqplLOJrj6j9
780E5j6j2JK1L3K3lk6m0m2l3mL1M8L8J6J5K6K9Ok2l7l6k5qQJ7J4J6L0N0M8J8k1m2l7k1j5k0
763H3k6k2oJ3K8L1K6J8RPOLMJ1J9J5JqkJ4K0J2lk3m1m4k7%J3RNJ2J8J2kj2j3lQLk5n5n1j0
$$ plain form
897 70 95 113 112 95 81 85 98 105 105 108 111 106 91 78 74 68 57 51 61 77 83 70 45 18 0 2 35 90 141 167 169 159 153 152 149 136 118 107 108 110 105 97 98 111 126 138
877 138 144 140 125 110 105 103 89 63 40 32 26 13 7 29 74 110 117 106 102 117 143 169 190 204 206 189 160 136 131 138 135 110 78 59 58 61 60 59 68 87 104 115 122 130 133 123
857 123 104 92 99 122 152 181 207 221 215 192 161 135 119 119 138 165 181 178 167 158 146 126 107 91 74 51 42 63 108 143 149 131 107 87 75 77 93 113 126
840 126 130 125 111 97 98 121 159 193 212 214 201 173 138 107 96 102 111 112 109 119 149 182 196 186 168 159 160 164 164 153 124 80 44 32 39 40 27 12 13 27 37 33 19
821 19 2 -16 -33 -38 -22 7 27 25 13 8 14 16 9 8 24 55 83 96 98 97 95 90 76 50 13 -26 -56 -66 -55 -33 -11 5 24 50 78 97 102 101 98 89 68 48 43 58
802 58 86 116 140 156 161 164 174 189 198 194 185 183 187 179 150 109 76 63 64 71 84 104 123 126 112 94 87 84 78 69 71 84 92 87 79 82 96 111 118 120 119 115 107 99 92 89 92 98 99 90 74 55
780 55 39 27 28 49 82 105 102 76 36 -6 -39 -43 -12 36 74 90 105 131 160 166 144 107 71 46 38 46 63 77 93 123 173 221 239 218 176 139 118 103 83
763 83 57 35 29 42 70 101 127 145 154 161 167 170 174 185 204 219 220 212 210 224 244 256 253 230 189 145 118 118 131 140 145 157 175 187 185 173 160 157 165 168 143 88 37 27
744B7K7K4nk3j4PJ6J7J4Kj1j5kJ6K1J5RJ0J1Kj3k1j0J6L2K0j0k8k5k1k6k9k0qj0k1j8kJ7K9
726@M2N1M5J8rj6mJ1K6L7M0K0j9n4o5n2l2j4MK2L1K4jk5k4JL1M2L2K2J6J0lj2kJ5J8Mj4k3
709A93k7l2l4k6j3mkmoonmljRK2K3J2QK1L1J0k2l3qJ8J5qk0j1KQNJ%KJjJQJ3Mj5k8k2nJ0K1
688I8L0L1K0M%NP%j2k4k9k2lJ7K5K5K2K2J5jj9l4l9l2j4QJ8J7J3QLnj2j4j3j0lJ0K0K0J1m
670A59k1l3l1j5KJ3J8J1oj9lK8L9J0k4k8j1j0k7l3j0K1L0J9Lj0l0m8m4j4K1L8L2J8Npj7j5
654A1%J3Nj1pJ8L5K1jlJ1J1jnJ1J7Lj1j0qk5m3l3rJ1J7K9L8K3nk0qJrk0j2LJj7k8k7j7rl%
634f3JPJ8K5J9J2RPLKJ4K9K3Lj3j7j9k0j4PK4K5J4%j1j3LL3M9L5Lk6l7l3j8kLpj5jK9M8M6
615A82L0J1rk9l4k7k2k5k6j9j6k2k8j2J3K2J0JQJ4Kj4rJ2K3J4OJ7L5L6J6lj1k2m6o7n6j7K6
$$ plain form
744 27 54 78 73 50 36 43 59 76 90 92 81 66 64 80 101 116 125 135 146 148 135 114 104 120 152 172 162 134 109 88 62 33 13 5 -5 -26 -44 -46 -29 0
726 0 42 93 138 156 147 131 127 138 164 201 241 261 242 188 123 71 39 25 29 51 82 106 105 80 56 57 88 130 162 184 200 210 207 195 193 208 226 230 216 193
709 193 166 134 100 74 61 57 55 51 45 39 34 30 27 26 35 57 80 92 100 121 152 162 140 107 99 117 132 124 104 93 95 103 108 109 109 111 112 111 112 120 133 137 122 94 72 67 77 98
688 98 128 159 179 183 183 188 195 195 183 159 130 108 105 122 147 172 194 216 231 230 211 177 138 106 92 100 118 135 148 156 159 154 142 128 115 105 102 112 132 152 163 159
670 159 138 105 74 59 61 74 92 103 97 78 75 103 142 152 128 100 89 79 52 19 9 30 60 79 82 72 42 -6 -50 -64 -43 -5 27 45 50 43 26 11
654 11 11 24 29 18 11 29 64 85 84 81 92 103 102 97 108 125 128 117 107 99 74 31 -2 -11 0 17 46 84 107 102 82 74 75 66 46 34 37 38 21 -7 -34 -51 -60 -63 -63
634 -63 -62 -55 -37 -12 7 19 28 35 38 40 54 83 106 109 96 79 60 40 26 33 57 82 96 96 85 72 75 108 157 192 195 169 132 99 81 79 82 75 60 59 88 136 182
615 182 212 223 214 185 151 124 102 77 51 32 16 -6 -34 -46 -33 -11 -1 0 8 22 24 10 1 13 36 50 56 73 108 144 160 157 146 124 78 11 -45 -62 -36
599c6L9L2K2K2K1Rrk4l0k4rQJ5PnlRJ6RKKOOPJ5K1K1J6J4J4RKJQJ0%j5k4k5k1j5j0qnKPmk4
578H1l3k3j1j1j3kJ0RJPK6L1J4j2k5k6k0oPJ7K2K6L3K8Rj3k0j7j1n%KJ%MPOMRJ6Rqj9j9j2
558G3rokQJ5J7J0KJJ5L0L3K3Nj3j8rJ1K1Rj1k4k6l0l4k9j5kJnj3j7pJ6M1M3J6k1m3l7j4J2
540A7K7K2Qknj0j4rjjrjK6M8M4K3Qjj2k5k8j8q%J2K3K6Qj5l3l4k3lJ9K6K0J1RNpk9m1k8JK5
521E1K7J5PK0L6L8K1kj9k6k6j6jJ1J2RRLj6m7o6n3j4K7M6L2RkKOJqk0l4m4l7jL5L9J0k4k8
502a8oJ1LmJ2M3N2K9LLK0K5J0mork0k7j5JN%LJ3K0J2lj7k7k4oJ7K3J0pj4j1onlkjJNJ0J5J5
482A26J2OOQJ2J3J1Nok2k9k2rlnqj3k2k6k0qmqmJ1J6NKK2N0M8J8rj4prj9k6k2j0QK5K8J9J0
462A36OOlj8k8k4j2jJ0J9K7K7J3qk3k3j0MJ2RLKRJ9J9Prj8k0k0j8pJ1K1J9J1Jj2k6k7oK0L4
$$ plain form
599 -36 3 35 57 79 100 109 100 76 46 22 13 21 36 43 38 35 44 60 69 71 73 79 85 92 107 128 149 165 179 193 202 204 205 213 223 223 208 184 159 138 123 113 105 100 102 109 105 81
578 81 48 25 14 3 -10 -12 -2 7 8 15 41 72 86 74 49 23 3 -3 4 21 43 69 102 130 139 126 106 89 78 73 73 75 76 76 80 87 93 97 106 122 131 123 104 85 73
558 73 64 58 56 64 79 96 106 108 109 124 154 187 210 215 202 184 175 186 207 216 205 181 155 125 91 62 47 45 46 41 28 11 4 20 61 104 120 99 56 19 5 17
540 17 44 66 74 72 67 57 43 34 33 32 23 22 48 96 140 163 171 170 158 133 105 87 79 79 91 114 140 148 133 100 66 43 40 59 85 105 116 125 130 123 94 53 25 26 51
521 51 78 93 100 120 156 194 215 213 194 168 142 126 125 136 148 157 166 169 153 106 40 -13 -27 0 46 78 87 85 87 93 94 86 66 32 -12 -49 -50 -15 24 34 10 -18
502 -18 -24 -13 -10 -14 -2 41 93 122 125 128 148 173 183 179 173 164 144 117 102 103 108 108 111 124 144 156 153 136 109 85 79 96 119 129 122 108 97 91 86 83 81 80 81 86 96 111 126
482 126 138 144 150 158 170 183 194 199 193 171 142 120 111 108 103 95 82 60 34 14 6 2 -6 -10 1 17 22 24 46 96 144 162 153 139 132 123 104 78 56 46 54 79 107 126 136
462 136 142 148 145 127 99 75 63 62 72 91 118 145 158 150 127 104 94 98 110 119 122 124 133 152 171 178 169 151 131 111 93 86 97 118 137 148 149 137 111 84 78 98 132
444A32L0J5jj5j8j2qj9l2l0j6kJLJ3K7L6M0M2L7J9ok2j7nKpk1k4mK4L4K1mj8k1k2k3j8rmo
426I2nOK2K5J9J2J3Qmj9k5j8plopKJ7K4J0j5l1k3lQOjlk%KJ1K3L3L6K9J6jj7l3m1l4j8l%p
406H8nRK0J3koQK6K7J4mj9k2k0j3oj%jKPPjj0qPJ6Qj1k6l3k9j3J3L5L8K1kk2k9j7J1L1K6P
386A34%QJ0jqmM%qj3j1j0omj1k3j7J3M2M0J3qj7k6l3k5oMLNJ5J4mk8l7l0k0mJ5K4K1J7K0K4
367G2K6L3M0K7rm2m2j1J4J8Pjlk%K%JORJj1rLQKn%RJ5J8J7Kk4m1l0%K2K5J8J1kk3m3m8l5j5
347A0OK0K5K2J4J0RRQJ2K5L4K6kl0l8k3jRlk1l0j8PK6K2Nj2k0j8j0oprmNMllJ0K5K8K4K7L1
327A95J9j0l2k8j2j1l0m7l3OM7O0M7L3L4L5K0nk1k6l5m3m0k4j5k1k1nJ5J7J5J7J6Mro%pk2
310G7j5J4K9J9PJ4K5K0Mmj4l7o0m8MM7M5Ll5m3l3k0j0PK0J9Jj2mJ9L2K2KpmjlnJQJ0Nkpj0
$$ plain form
444 132 162 177 176 161 143 131 123 104 72 42 26 24 25 28 41 68 104 144 186 223 242 236 214 197 192 194 187 166 142 138 162 196 217 213 195 174 152 129 111 102 98 92
426 92 87 93 115 140 159 171 184 192 188 169 144 126 119 116 110 103 105 122 146 156 141 110 87 84 92 98 97 94 92 92 94 105 128 161 197 226 242 241 224 191 150 116 98 95 95 88
406 88 83 92 112 125 123 117 125 151 178 192 188 169 147 127 114 108 107 107 106 108 115 122 121 111 103 110 126 134 123 97 64 35 22 35 70 108 129 127 105 76 59 70 101 127 134
386 134 134 142 152 151 143 139 143 143 135 122 111 101 95 91 80 57 40 53 95 135 148 140 123 97 64 39 33 37 40 45 60 74 70 42 5 -25 -45 -49 -34 -10 11 28 48 72
367 72 98 131 171 198 189 147 105 94 108 126 133 132 129 127 127 129 129 130 136 145 146 135 126 129 137 139 134 134 143 158 176 193 195 171 130 100 100 122 147 165 176 174 151 108 60 25 10
347 10 16 36 61 83 97 107 116 125 133 145 170 204 230 228 198 160 137 136 145 142 121 91 73 80 106 128 133 121 101 83 73 67 60 51 47 52 56 53 50 60 85 113 137 164 195
327 195 214 204 172 144 132 121 91 44 11 17 64 124 171 204 238 273 293 288 267 241 206 163 123 99 84 63 42 37 52 69 84 101 117 121 112 106 106 99 77
310 77 62 76 105 124 131 145 170 190 194 190 176 139 79 31 35 82 127 130 95 52 19 -1 -11 -4 16 35 36 24 20 39 71 93 95 88 84 83 80 75 76 84 94 99 97 90 80
291H0pMRPmpMK0K5J8Qjj1k0k0rK%mKJ5K4K0Oj0k3k9k9l0l9m4l4qJ1J4RJ4K6K9K3J7J7J9J4
272A08Mqk4l3k2J1L9M1J6j1k3j6KJ8K4J8Pknnmlj2k9l5j7J5K2%j8nJ8J7mj2LJ3lk2j8KJ1K
253F0qj1j0j0lJ0J9J5OJOJ4J4Noj1nKPOJ1J8K0J3kj4k0j5qloonmj2j4mJ1J7J1NNRJ6K7K4k
233A73l2l4rPlj7nJ8J7pk0oJ9L6M2L4J2j8l4k5jJ9K7K3Rj0k5k7j6mkj1k4l0k3pLjj4k1j3N
214EJ5Pj2k4k8k3j9mK2M8M7J9j7l0j9pLRJ3J9J6R%mjMOok8m2k9OL7M4M1L8L8K6nl2l8k6j5
196F3j0j1j7k0rJ0K6K1PjPJ7J9J8J0jj2j1%QJ2J5K2K5J0j9m7n6l6ML5L7J4qj2oKLkj2k3k1
178E1rKL%JJ1K0K1J5QNJ4K6L3L0K2J3mk4l4l3l0l1k9k1j5j2pRK4K6K1K2K3J5jj3j6rQL0M2
159B07K9Jj6j4rj5k4k4j3ljpj5j1%Nj2l4l9j7QK3K5J9J0MMJj2k8k8j4m%J0L2L9K3LjNok3k8
$$ plain form
291 80 73 77 86 93 89 82 86 106 131 149 157 156 145 125 105 96 98 98 94 96 111 135 155 161 151 128 99 70 40 1 -43 -77 -85 -74 -60 -51 -37 -11 18 41 58 75 94 108
272 108 112 104 80 47 25 36 75 116 132 121 98 82 84 102 126 144 151 149 144 139 135 132 120 91 56 39 54 76 76 58 53 71 88 84 72 75 88 85 63 45 47 58 60
253 60 52 41 31 21 18 28 47 62 68 69 75 89 103 108 102 91 86 88 95 101 112 130 150 163 161 147 127 112 104 101 95 89 84 80 68 54 50 61 78 89 94 99 108 124 151 175 173
233 173 141 107 98 105 102 85 80 98 115 108 88 82 101 137 179 213 225 207 173 148 147 166 193 216 225 215 190 163 147 143 141 130 106 76 53 46 49 48 34 13 0 5
214 5 20 27 15 -9 -37 -60 -79 -83 -61 -13 34 53 36 6 -13 -20 -17 -8 5 24 40 49 49 45 44 48 54 48 20 -22 -51 -45 -8 36 77 115 153 179 174 142 104 78 63
196 63 53 42 25 5 -4 6 32 53 60 59 66 83 102 120 130 129 117 106 106 114 126 141 163 188 198 179 132 76 40 44 79 116 130 122 110 104 106 109 107 95 72 51
178 51 42 44 47 47 48 59 79 100 115 123 128 142 168 201 231 253 266 262 238 204 171 141 110 81 60 45 33 26 35 59 85 106 128 151 166 165 152 136 127 135 165 207
159 207 236 237 221 207 198 183 159 135 122 119 118 111 96 85 85 90 78 44 5 -12 -4 19 44 63 73 77 81 82 70 42 14 0 -4 -4 6 38 77 100 103 102 107 101 78 50
140E0j2LLKQJ4J1LLOQONJ0J3J2QL%kpj4k9m1m3k8oPNKJ1L0L0Ro%J6K4K5L4M8N1L1Ppj3j7k4
120B49l5m3m1k4kKrj7rRK0K3J9Mj2j9rJ1K4K4K1J6Rkj0k2l8m8m1j6J0J9K0K2K6K4J3lj6k6
102A23k8j4J0L0L2J3j3l6m8n3n2n2m7l1LM5P2O9M4J2j0j8j3LK3L5K4lk0j2J4K8J4j2k0lJ6
86A25J6jk1k8k8k1j2JJ6K8K9J9Pkpj4k6l1k1lRMj0j8j2KJ7K2K0J5Oj4l5m0k2J0L3L8K2kj9
68E2j8nMKKNPlj4j5rqprpoNK4M0L3J2LJ2J8J5RQkj8k4j1Kqk7k9pJ6J5nk7k9j7%Loj2qjjkN
46d3J9K6K7J6lk3l0j8LJ7K1K5K4Qrj0PK1J8jj4j9j4pLJ2K0K1J5QJ2J8J1j9m3m2k0%MMPQJ1
28G1K0K8K1kj9j6opj5k1k3k0lK3M0L7K6J8J2%j1lJ1J2nk3k6k0j0oj0k0k0qJmj6j3kLkMK5M1
9F2L8K9K6J1k2n1m4j3RRPJ5J8Rkpj8l5m0j7J0K0J0krj4j0J2L6L3J1MK4M7M9L4J0j6m2n3m1
$$ plain form
140 50 38 41 44 46 54 68 79 82 85 91 99 105 110 120 133 145 153 156 156 154 147 133 104 63 20 -8 -14 -7 -2 0 11 41 71 80 74 74 90 114 139 173 221 272 303 310 303 290 273 249
120 249 214 171 130 106 104 106 97 80 71 80 100 123 142 146 134 115 106 117 141 165 186 202 211 209 199 177 139 91 50 34 44 63 83 105 131 155 168 165 149 123
102 123 95 81 91 121 153 166 153 117 69 16 -36 -88 -135 -166 -163 -118 -46 23 67 79 69 51 38 41 64 99 123 120 100 88 102 130 144 132 112 109 125
86 125 141 140 119 91 63 42 30 31 47 75 104 123 130 128 121 107 81 50 29 26 35 39 29 11 -1 1 18 40 60 75 81 67 32 -8 -30 -20 13 51 73 71 52
68 52 34 29 33 35 37 42 49 46 32 17 8 0 -7 -16 -23 -29 -24 0 40 73 85 88 100 118 133 142 150 148 130 106 95 97 89 62 33 26 42 57 52 25 -4 -21 -21 -18 -24 -36 -44 -45 -46 -48 -43
46 -43 -24 2 29 45 42 19 -11 -29 -26 -9 12 37 61 69 60 50 57 78 96 95 81 62 48 41 44 56 76 97 112 120 132 150 161 142 99 57 37 37 41 45 52 60 71
28 71 91 119 140 138 119 103 97 90 75 54 31 11 8 31 71 108 134 152 164 164 153 150 161 173 168 145 119 99 89 83 73 53 33 25 26 22 6 -7 -9 -6 -8 -4 21 62
9 62 100 129 155 166 144 93 49 36 45 54 61 76 94 103 101 94 76 41 1 -16 -6 14 24 22 13 -1 -11 1 37 70 81 85 109 156 205 239 249 233 191 138 97
-9I7k1j1nJ0K5K1Jj3qKnk0k6j1K3N6O1K5k4m3k2Kj0m1n0k9qLJ1K2L0K2J4J3J0j1l7m7l2j6
-27d2nJOOKJ0K2K6J1kJ4L5K9rm0l5j5j0j6j1QK1K5K3J8Nj7k1jK3K9J7Mqk3l3k6JL2N0M5J7
-45A66j9l9l4j7n%OJ7K5K4J7OmlMJ0Lj3k1j5mMJ0J3J1Mlnpj0j4j5j5j3mOQLKOQJrj2oJjqj7
-66D2j8j2j1j3j0PK7L0J4JJ0K2J9LjQJ6J0ok1k8l0k5j5mMRJ4J2RPJ3J9J5Kj4k4l3l5k8j5o
-84c6j3k3j6QK6K5K0K4L2K4MoMJ3RKQK7M0L3J2j0j9j4%J0J0Jj3k8l8l8l5l5l4k7j4%J2K1K1
-102a3RnmJ4L0L3L0L2L0J0k0m2m9m6l0pJ4J8J2J4K8M0L6J6qk1j9j1j0j5rMNj9m4l4lK3K7K3
-119C9K1J1mrOK4K5J0qj7j2KJ2Mj1j2QK2J3j1k3j9j2j4j8j1PK0J0j6l4k0RK4J6MMJ1J0J0J5
-137H6K2J4ok0k4j9j2jLkj2qOK1K7K8K3PqmJ9L6K5rl9m6k8%J3PmkORNJ1K2J7j1l8l3rQPjp
$$ plain form
-9 97 76 65 60 70 95 116 117 104 96 98 93 73 47 36 59 115 176 201 177 134 112 114 104 63 13 -16 -24 -21 -10 12 42 64 78 91 101 90 53 6 -26 -42
-27 -42 -47 -46 -40 -34 -32 -22 0 26 37 35 49 84 113 104 64 29 14 4 -12 -23 -15 6 31 54 72 77 60 39 38 61 90 107 111 103 80 47 21 22 54 104 149 166
-45 166 147 108 74 57 52 52 58 75 100 124 141 147 143 140 144 154 157 144 123 108 104 108 118 131 142 146 143 138 131 121 107 92 77 64 60 66 74 77 79 85 93 94 85 73 67 68 67 59 42
-66 42 24 12 1 -12 -22 -15 12 42 56 57 67 89 108 111 110 118 134 144 138 117 89 59 34 19 15 19 28 42 54 63 70 83 102 117 119 105 81 48 13 -15 -30 -36
-84 -36 -49 -72 -88 -80 -54 -29 -9 15 47 71 75 69 73 86 95 97 105 132 172 205 217 207 188 174 174 184 194 195 182 154 116 78 43 8 -26 -53 -67 -67 -55 -34 -13
-102 -13 -4 -9 -13 1 31 64 94 126 156 166 146 104 55 9 -21 -28 -14 4 16 30 58 98 134 150 142 121 102 91 81 66 57 61 66 47 3 -31 -34 -11 16 39
-119 39 60 71 67 58 64 88 113 123 115 98 86 88 100 104 93 81 89 111 124 113 90 71 59 45 27 16 23 43 53 37 3 -17 -8 16 32 36 40 51 61 71 86
-137 86 108 122 116 96 72 53 41 40 43 41 29 21 27 48 75 103 126 133 125 121 140 176 201 192 153 107 79 79 92 99 95 93 99 108 113 124 146 163 152 114 81 72 80 87 86 79
-157G9j2k2k9k4j2KJ1J5J2Noj6j7j3jPRJ1J1Qoj6nK2M4L4Qj2j2kJ2L1N0O0M4J1k1l6l5k8k2
-175A39j5rlll%PJ3J9K1J3ok6k9j3M%k1l3k0kLoqQJ9Ok8n1m2qK4L4L0K6K6K9K3J5J2J3J0n
-193A63k5l1j6J0K3J3j2k9k4oMmj1lJ9L7L7K3J0LKjnplKJpj6j2JJ4K0K0J4jk2l1j8JNj0k2
-212A06j3MMk2m8m9l4j6KK3M2L9J5n%J3Qrj4kN%kMOoj7qJ3K8L3K9K1NmNK8L4J3j2j3RK5J3
-231B53k0m2l6j5qk1l5l1j6prpJRP%LJ3J9J4kj3j2PK3J9rm4n9m7k0OK2L0L5L6K3kk8l4j5J2
-249@K7K2QNRJ5J3J0J0RO%j%JLKj0l4n4m8j7J4K0Kj4j1J3L1L1J4MRK4L3K9J7Nkprj4k2k6k0
-269I7qj%klpj1rjKjjK%n%K3M3L5Pj1rrk3l2k0MJ9J8Pj1k5k6j0NM%J1L2L2Mk7l7l4k9k1J0
-289a8M7O9N9L4J0qk2k5j6kjnnKJ0J7J8J1lj6j2mnj7j5NK0Pj7k1oOKjQJ2jj5lK1K6Jk1j2J5
$$ plain form
-157 79 67 45 16 -8 -20 -18 -7 8 20 25 19 3 -14 -27 -28 -21 -12 -1 10 18 12 -4 -9 13 57 91 99 87 75 73 85 116 166 226 270 281 260 224 189 161 139
-175 139 124 115 112 109 106 106 113 126 145 166 179 173 147 118 105 109 109 88 55 35 33 36 30 22 30 49 55 27 -24 -66 -74 -50 -16 14 40 66 95 118 133 145 158 168 163
-193 163 138 107 91 101 124 137 125 96 72 66 70 66 55 52 71 108 145 168 178 181 183 182 177 170 167 169 170 163 147 135 136 150 170 190 204 203 181 150 132 133 138 128 106
-212 106 93 97 101 79 31 -18 -52 -68 -66 -43 -1 38 53 48 48 61 69 60 46 44 49 49 47 51 57 51 34 26 39 67 100 129 150 155 151 156 184 218 231 219 206 215 240 253
-231 253 233 191 155 140 132 111 76 45 29 22 13 6 7 16 23 23 26 39 58 72 70 57 45 52 75 94 85 41 -18 -65 -85 -79 -57 -27 8 44 67 65 37 3 -12 0
-249 0 27 49 57 62 71 86 99 109 119 128 134 134 133 133 134 137 139 129 95 41 -7 -24 -10 10 12 -2 -13 0 31 62 76 80 89 113 146 175 192 197 195 188 179 165 143 117 97
-269 97 89 88 88 86 83 76 65 56 55 57 56 55 57 57 52 52 75 118 153 160 149 140 131 108 76 56 60 79 97 104 93 68 42 32 37 41 41 52 84 116 120 93 56 22 -7 -28 -18
-289 -18 29 98 157 191 201 193 171 146 130 128 127 122 117 119 129 146 164 175 172 156 144 140 135 118 103 108 128 135 118 97 91 97 99 98 106 118 117 102 99 120 146 147 126 114 129
-309A29K9J6pj1KJ4J1kj3j7j5j1lRJ9J8Qoj5j2mPJ4K2L1L1J9lj9k9m0m5l6j0J0Pj1j9nJ3J6
-327I2LqkJ4K9K5J0nj2j4j2nRJ9Rj4l4l6k3j3qnKMjj2j2KK4M4N7N7L5kl1l5k3j6k2k0%J9K5
-345A14J9Rok5l4k3mLLJ2L0M6M7L3Ok8m1j8J5K2Jj4kRlk3l0k6k5k2rNLo%K2L1J4j1k1k0j8
-363C5j7j2pj0j2pOJ6J6J0LJOJ7J9Oj6l3l4j9lNOKmj4k2j7LK5L7L2K3J1LMRNj1k9k9j3JML
-383aORLjOJ4Pj2k5j8nNJ2K1K6K4J5Mj%OJ4J2Jj3k3k0qMJ0J6K4K3Lk7m4l5j4kJMJ1J7K2K9
-402A00M0L9J6j4l5l8k6lJ8J8pl6m2k5lJ3K0K4J7Jj9l0k7j2KJ2J5J2OkqqQK7L6L0J2lj6k7
-420H5l8m1k5JK1J5j3k7j0K5L7J7ppJ0J8RmlQK1K2J1j1k3j5QK7K8K0J4J4J0kj8k6j8kRLj6
-437A27k8k9k1j4j1rnPK0K6J9J0QP%j6k0rQK0K5K5J4j0k7k2KK0J7%j5k0j7j5j6j9j9j0OK4
$$ plain form
-309 129 158 174 167 156 158 172 183 181 168 151 136 125 122 131 150 168 176 170 155 143 139 146 160 182 213 244 263 260 241 212 172 127 91 81 91 98 87 68 63 76 92
-327 92 95 87 85 99 128 153 163 158 146 132 120 115 124 143 152 138 104 68 45 32 24 19 21 25 24 12 0 2 26 70 127 184 219 217 186 151 128 112 90 70 70 89 114
-345 114 133 142 136 111 77 54 50 53 56 68 98 144 191 224 230 202 161 143 158 180 181 167 165 174 171 148 118 92 67 45 36 41 44 38 38 60 91 105 94 73 53 35
-363 35 18 6 -1 -11 -23 -30 -24 -8 8 18 21 22 28 45 64 70 54 21 -13 -32 -35 -30 -24 -22 -26 -40 -62 -79 -76 -51 -14 18 41 52 55 59 68 73 62 33 4 -9 -8 -4 -1
-383 -1 5 14 17 16 22 36 43 31 6 -12 -17 -12 0 21 47 71 86 90 89 89 95 109 121 122 109 86 66 58 62 72 88 112 135 138 111 67 32 18 16 17 21 32 49 71 100
-402 100 140 179 195 181 146 108 82 79 97 115 108 72 30 5 2 15 35 59 76 77 58 28 1 -11 -9 3 18 30 36 34 26 18 26 53 89 119 131 128 112 85
-420 85 47 6 -19 -18 3 18 5 -22 -32 -7 30 47 40 33 43 61 70 66 63 71 92 114 125 114 91 76 84 111 139 159 173 187 197 195 177 151 133 131 140 143 127
-437 127 99 70 49 35 24 15 10 17 37 63 82 92 100 107 107 91 71 62 70 90 115 140 154 144 117 95 97 117 134 134 119 99 82 67 51 32 13 3 9 33
-455C3K6J2rk2j5jNLJoj5k3j8%J6K2K4K9K9K2J1RR%j5k3j0J2K7K8J5qk7l3k3kJ9K9K6Nj8l1
-473A13k7j8pl%%JJKKKPJ3J3LoqlMJ4K3J9Mqj0pppPK9M1L3J8Mj4l5m3k8nQQNNmj9k1qNKpq
-495H3jNMnk5m6m8k5RK4J1mrJJ5K5K5Pj1oJ1J5NNK8M5K9nk9l1k7j5J2M0M4K5J2J3Oj4k3mJ9
-514A90J2k3m3l3rKJJPRnk4l5k9j4ollOJ9L2M2L8J6j6l7l3j8j1qmLJ0J3K1L4L5J8qk2j2J0
-532A23J4mk1j5MQqj4OL1L2J0qrKJ2J9J6Lj5k3j3MJ4J4Lmonj0j7j7mNlj2oJ1J4Nnmkpqmmr
-553I3j0jLlqjJ2J1Lkkjnnpj3j2NK8L4K0Mjoj4j9j8j5k2k3pJ8L1K4Lj4j8oJ6L5L6J3j5l0k5
-572H6j1nj3k2k2j6j5j8j3LK4L2L1K0J2J1J6K7K4Kk3k6nJ5Ok4m0k8mMlj1j4j4j5mJ4K3J6K
-590B2kOJ6K0K9M1M8M2K7J7Qql1m3l0pjj2k1j2%Knj0rj1j0kRRlj3rpj4k1oK0L0J4pkK2M1M1
$$ plain form
-455 33 59 71 62 40 25 24 29 32 33 27 12 -11 -29 -29 -13 9 33 62 91 113 124 133 142 142 127 104 94 106 133 161 176 168 141 108 85 83 102 131 157 162 144 113
-473 113 86 68 61 58 58 58 59 60 62 64 66 73 86 99 102 96 88 85 89 103 126 145 149 141 131 124 117 110 117 146 187 220 238 242 228 193 150 122 117 125 133 138 143 139 120 99 91 96 98 91 83
-495 83 82 87 91 86 61 15 -33 -58 -49 -25 -14 -18 -27 -26 -11 14 39 46 35 29 40 55 60 65 93 138 167 162 133 102 75 60 72 112 156 181 193 206 212 198 175 171 190
-514 190 202 179 136 103 94 96 97 98 105 114 109 85 50 21 7 1 -2 -5 1 20 52 94 132 148 132 95 62 44 33 25 21 24 34 47 68 102 137 155 147 125 113 123
-532 123 137 133 112 97 101 109 101 87 93 124 156 166 158 149 151 163 182 198 201 186 163 150 154 168 182 185 181 175 170 160 143 126 122 127 124 112 106 117 131 136 131 127 125 118 110 106 102 93
-553 93 83 82 85 82 74 73 85 96 99 97 95 94 89 84 77 64 52 57 85 119 139 143 142 136 122 103 85 70 48 25 18 36 67 91 94 80 62 56 72 107 143 156 141 111 86
-572 86 75 70 57 35 13 -3 -18 -36 -49 -46 -22 10 41 61 73 84 100 127 151 153 130 104 99 114 120 96 56 28 24 28 25 14 0 -14 -29 -33 -19 4 20 22
-590 22 20 26 42 62 91 132 180 222 249 266 274 266 235 192 162 155 154 142 121 109 109 111 106 96 87 76 66 64 73 82 79 66 57 50 36 15 9 29 59 73 66 64 86 127 168
-609A68L0K9L2J9j3m4n2m0l3l9l8j7OJ5RRJ6K1J7ROKrj5j4j0j9l2m1l6j7PK8L6K1%j9k4j5
-626d7mK%jJ1K9L5K3LkRK2K3J3kj4j3%K1L3K7J0qk0k8k6j3PK0J8J1RJ0lk7l7j6K0K8Jl4m2
-644D8k7j0nmoj4k3j7LK4L1K8K0J2Kj0j9k3j9j0LJ6J9J5J0PMjjLJ4K0J4ql1l7j8J0K3K1K0
-662H4K8L5L0J9RKj2k4j6J0K5J7kpnpj1oQRpk9l6l4k5mK4L6J9j8m2l5j0RJ4J1RRNnj3j0KJ2
-681F8J7J8K0J6NmkKjkQK3K6J5L%mj7l2m0m1l6j8QJ8Jk3j7J9N5N9L0j3m4m6j7K3M4L5J3JK
-699A72joJJ9K0ll2l3j1QJ0J3K5L1J1k2m0l8k7k1j9k2k8l0k1KK2K6K5J8Nj5k6j9jJ0J0LJO
-717B3J5K4K6J7Kj2k3k1qJ4K7K4Rlj1j9k5k0lJ0J2PNOPOOO%onKJ0Pkj0j1lNJ4J5J7J5Rmj8
-737A36k5j4JPNLJ0J5Mj3j5MK3K0ok8l4k1nRJ9K2J9J3Jj4k6k8j8oKQJ5J9J5Qlj2j9j7rlJJ
$$ plain form
-609 168 198 227 259 278 265 221 169 129 96 57 19 2 8 23 32 41 57 78 95 104 110 112 103 88 74 64 45 13 -28 -64 -81 -74 -46 -10 11 11 -8 -32 -47
-626 -47 -51 -49 -49 -50 -39 -10 25 48 51 49 58 80 103 116 114 100 87 87 108 141 168 178 170 150 122 96 83 90 110 128 139 148 158 155 128 91 75 95 123 124 90 48
-644 48 21 11 6 2 -4 -18 -41 -58 -55 -31 0 28 48 60 62 52 33 10 -9 -19 -16 0 19 34 44 51 55 54 53 56 70 90 104 96 65 28 10 20 43 64 84
-662 84 112 147 177 196 205 207 195 171 155 165 190 207 205 198 193 186 175 169 177 186 179 150 114 80 55 51 75 111 130 112 70 35 25 34 48 59 68 77 82 77 64 54 56 68
-681 68 85 103 123 139 144 140 138 140 139 137 145 168 194 209 212 212 208 191 159 119 78 42 24 32 50 51 28 11 30 85 144 174 161 117 71 54 77 121 156 169 170 172
-699 172 171 165 166 185 205 202 170 137 126 134 144 157 182 213 224 202 162 124 97 76 57 35 7 -23 -44 -42 -20 6 31 49 54 39 13 -6 -7 3 13 16 17 23
-717 23 38 62 88 105 107 95 72 51 43 57 84 108 117 114 103 84 59 39 36 46 58 65 70 76 83 89 95 101 101 95 90 92 102 109 107 97 86 83 88 102 117 134 149 158 154 136
-737 136 111 97 98 105 110 113 123 138 142 129 114 118 141 161 155 127 93 72 67 76 95 117 136 149 150 136 110 82 64 58 60 68 83 102 117 125 122 110 91 74 65 62 63 64
-756F4LJljJ1K6L2K2kk9m4l3kJ7Oj6k1oMKNK1L4K6J2QNql0l2j2PRKLJ2J3Olpj1j0%J8L3L9
-776A71L4K5Mk6n1n2k8JJ4J8K2K6K0Mqj0j0j2qOJ1nk1j4J0K1Mj9k3rJJ%Ljj6l2l1j5L%j4k0
-794b6LL4M6K9J0J1J7Oj8k8qJ7K2Rrj5j4j0j0j5j7j2JJ1RPJ3K5L1K5J3%j5k9l2k4j7j3rJP
-812B6MjJ0L5N3M3J0j8k1pKmj7j9j0MJ8L2L6K8J0qj2j0j2k2k8k1oNJrj1%J1J4Ln%K2M3M2J5
-831B26j9l4k8j7j6k2j7PL0L8K5J1RJ4Rqj9j4%Mlj0olqj7k3k4k1j9j3LK4M1L9K1nj5rLRJ4
-849A57K0J8RJJ3K8K0j9n9o3l8j4j0j3kK2L4K1mj8j2noj1mRJ6Rmj2j2nRK0K2J1j1k8k8j0J4
-867F5K6J8ok3k2mJ5K2J3jnOJ3Mj9k8j5JPPJ6L0L4K1Mqj0p%K%JJ8L9L7Ll6n1l7j6lJMOJ1J7
-887A50J5Kqqlpk1k7j3PJ9K2K5L1K8J3pj6j1JPNpj4pRJ9J5Jj2k3k8k7k1j5j4j0PK5K8J8PJ4
$$ plain form
-756 64 67 68 65 64 75 101 133 155 153 124 80 47 45 62 68 52 31 25 29 31 36 57 91 117 129 137 142 134 104 72 60 67 76 78 81 93 106 112 109 102 91 81 81 99 132 171
-776 171 205 230 234 208 157 105 77 78 92 110 132 158 178 182 174 164 154 142 134 140 151 146 125 111 121 142 146 127 104 95 96 97 97 100 99 83 51 20 5 8 8 -6 -26
-794 -26 -23 11 57 86 96 107 124 130 112 84 76 93 115 124 115 100 86 76 66 51 34 22 23 34 43 50 63 88 119 144 157 157 142 113 81 57 40 27 18 19 26
-812 26 30 29 39 74 127 170 180 162 141 134 136 132 115 96 86 90 108 140 176 204 214 206 194 184 172 150 122 101 95 100 101 92 81 81 92 106 109 104 104 126 169 211 226
-831 226 207 173 145 128 112 90 73 80 110 148 173 184 193 207 216 208 189 175 175 179 176 166 160 157 149 132 109 85 64 45 32 35 59 100 139 160 155 140 131 134 143 157
-849 157 177 195 204 205 218 246 266 247 188 125 87 73 63 50 48 70 104 125 121 103 91 86 80 69 65 74 90 99 95 83 71 66 75 95 117 128 117 89 61 51 65
-867 65 91 109 103 80 58 54 69 91 104 103 98 104 117 121 102 74 59 60 67 74 90 120 154 175 179 171 161 154 154 156 156 157 175 214 251 254 218 167 130 114 111 112 116 122 133 150
-887 150 165 167 159 151 148 141 120 93 80 87 106 128 153 184 212 225 218 202 191 192 199 204 197 183 176 185 204 219 220 208 185 157 130 109 94 80 70 77 102 130 148 155 169
-905A69K6L0J7mj9k1j3%J3J6J0ql2m9m8l0j3oj2j1ML2N1N3L1Mj8k4k3k1k4l0l2k1%K3L7L1
-922H8J0opPJ9J8P%KP%j1j2lLj0k4k4qPJ5K2K3Qk4m7m6k1jJ7L4M7M5K3mk0k7k6k4j4KJ6J6
-940G7jk0j7LK3K4Rqj5j2lKMQK0L5L7J6j5l5l6l1k4j5MK9M5M3L0J4Mlj4k2j8o%j0k3l2l9m1
-959a3k1J8M4K9lqRJ1j2j8J7N2M2Lj6kRLmRK1J5jj1qkJjj1k5k9k0rpnKJ1Qmj1pNJ7J4pl5m0
-979A0j4J7K4LrLK3K9K4K5K8K5J3J0K2L6L0Mk9n2n8n1l3j5jJ2K1K5K4J9J7J3jk5m5m4k5nL
-996E3kj3k1j3KJ7J4JojJ1K3K9L3L1J7%j1pJPJj0k2k5j6lQJ9K9L4K8J5kk0l4l5j4J1K2K2K5
-1014A98L6L3Rk3l9l7k8k4k0j4nJ3K9L4J7nj9j7lJ1K2K4J3lj3j4qKJ3J5Lj5k8l8n4o4n4j9
-1031g2J8L3K6J7J6K1K3K0J6R%rj2oLOMPJ8K6J7ok5l3k9j4QK5K0jj4qJ2K7L0K3Rrj7j4j4k3
$$ plain form
-905 169 195 225 242 238 219 198 185 185 198 214 224 216 184 135 87 57 44 38 26 15 19 51 102 155 186 190 172 148 125 104 80 50 18 -3 -3 20 57 88
-922 88 98 92 85 92 111 129 136 136 138 145 145 134 122 119 122 112 88 64 56 63 78 100 123 131 107 60 14 -7 -8 9 43 90 135 158 154 134 107 81 57 43 45 61 77
-940 77 76 56 39 42 65 89 98 90 75 63 60 62 66 74 94 129 166 182 167 132 96 65 41 26 30 59 104 147 177 191 195 192 178 156 138 132 132 122 99 67 28 -13
-959 -13 -34 -16 28 57 54 46 55 66 54 36 53 105 147 150 134 132 141 144 140 149 170 185 184 173 165 163 164 163 152 127 98 78 69 62 57 59 70 78 74 63 56 61 78 92 85 50 10
-979 10 -4 13 37 40 31 34 57 86 110 135 163 188 201 211 233 269 299 303 274 222 164 113 80 65 64 76 97 122 146 165 182 195 194 169 124 80 55 50 53
-996 53 51 38 17 4 6 23 37 38 32 31 42 65 94 127 158 175 175 164 157 158 165 166 156 134 109 93 90 98 117 146 180 208 223 221 201 167 132 118 129 151 173 198
-1014 198 234 267 276 253 214 177 149 125 105 91 86 99 128 162 179 174 155 138 135 146 168 192 205 202 189 175 167 169 182 197 200 185 157 119 65 1 -53 -72
-1031 -72 -54 -21 5 22 38 59 82 102 118 127 127 118 106 100 103 109 113 120 138 164 181 175 150 117 88 74 82 107 127 126 112 104 116 143 173 196 205 196 179 165 151 128
-1049A28l0k4j3j4k1j9kJ4K0J7J1Jj3k0j4jRJ5J4J0QJ6K7K9J5nj7j0RK3K0mk9l9l6k2oJ2K0
-1066G9Qj4k2j3LJ2J7K4K9K7K5K4K2J1mj6k4k9k8k0rkk%LLkj5k2j8nKqj7nK5M7M0J8Jrj7k5
-1084I4k5j9k0k3k0j0PK5L9L9L0J8Qrl4m4k6MJ4KmPJ9J8J1J3J4J1Mpk0l2k9qJ3J3NLQQjmQ
-1103A00K1K9K5J2rk7l0j4OJ7J7Qqk6l3j8QJ8Jk3l0qJ9L2K9K4J8Roj5j5j7j7j0QJ6Oj1j8j6
-1120G2j2oOPj1k6j0K3L1Lk2j4K0M1L7J6pk7l8l8k5pJ3K6K8K0RNPMrk4l0k3oJ2K1K5K6K3J2
-1138A52lj6k7l3l0j1J3J9Lj0oOJ0Knqj6k4k4j6kJ5K7L0K4J7J3Nj2k5j7OJ8J2kqqkONpj6m
-1157E1K0K8J0j1rNJ3J1Nlj9l1k2jJ0QLLkj6k5j8pl%J0K1K2J7J4J0M%%jqj3oPJ6J5J5J6Qq
-1176A39j7mK1L2J8j1l3l2j5OJ9K4K7K2Jl6o4o3l8j6kOJ1NnqJ0K3K1Kj2j4j7k0rJ7M0M8L8
$$ plain form
-1049 128 98 74 61 47 26 7 5 19 39 56 67 68 55 35 21 20 29 44 58 68 76 92 119 148 163 158 141 131 140 163 183 179 150 111 75 53 47 59 79
-1066 79 87 73 51 38 41 53 70 94 123 150 175 199 221 232 228 212 188 159 131 111 102 100 98 98 101 104 102 87 65 47 42 44 36 19 14 39 86 126 144 145 136 119 94
-1084 94 69 50 30 7 -13 -23 -16 9 48 87 117 135 143 134 100 56 30 34 48 50 46 53 72 90 101 114 128 139 143 136 116 84 55 47 60 73 78 81 89 97 96 92 100
-1103 100 121 150 175 187 178 151 121 107 113 130 147 155 147 121 88 70 78 96 97 74 44 36 55 87 116 140 158 167 161 146 131 114 97 87 95 111 117 106 88 72
-1120 72 60 54 60 67 56 30 20 43 74 77 55 41 61 102 139 155 148 121 83 45 20 13 26 52 80 100 109 114 121 125 116 92 62 39 33 45 66 91 117 140 152
-1138 152 149 133 106 73 43 32 45 64 67 57 51 57 67 69 64 56 40 16 -8 -24 -26 -11 16 46 70 87 100 105 93 68 51 57 75 87 85 77 69 67 73 78 71 55 51
-1157 51 71 99 109 98 89 94 107 118 123 120 101 70 48 47 57 65 68 71 69 53 28 10 3 0 0 10 31 53 70 84 94 98 98 98 97 89 76 70 77 93 108 123 139 147 139
-1176 139 122 118 139 171 189 178 145 113 98 104 123 147 174 196 197 161 97 34 -4 -20 -22 -16 -5 0 -5 -13 -3 20 41 43 31 17 0 -20 -29 -12 28 76 114
-1193A14L1L0L1J9ml0m5l4j0QOpj3rqj5k2j4PK1J4nj2jJ2Oj9l4k3KK3K7J5JprokJjj1k1k1
-1212a5oJ2J7J7K2K8K0kj5rnj6l0k4qmj2rPJ0oj6lJ2J0JLJ0RMRJ7Qj0j3JQkoJ1L3L5K0Omj6
-1232I9k6k2lJ1J0koJRJ1MorlRJ9K1J4Kqj1mQJ5J9J7J1jqpmj2k7l4k0QL2L7K4QKJ1K4J8mj4
-1252B13%K4K5ll4m9n1n2m8k5NK6K6J5J0Kj0j3JK3K6J0%RK1J2j9m3l9j1K1M0M0K7J6J0QJ1
-1268B24J7K4K1Qrk6m3n2m0j3J2Qj6l3k7r%%%Jmj2j2OK8L3J7lj2rrj3j3p%MJ3K4L0J9NjJK
-1287A34mj3j8j2%P%j4k3j0J5L1L3K6K0J2jj2j8k3k9k4JL2M2K5%j1j5k4l8l5j3OOnjJ3J8O
$$ plain form
-1193 114 145 175 206 225 221 191 146 112 102 110 116 109 96 87 79 64 42 28 35 56 70 65 53 52 64 70 51 17 -6 -4 19 46 61 62 55 46 40 38 39 38 27 6 -15
-1212 -15 -21 -9 8 25 47 75 95 93 78 69 64 48 18 -6 -14 -18 -30 -39 -32 -22 -28 -44 -47 -35 -25 -24 -21 -11 -2 2 11 28 36 26 13 14 22 20 14 25 58 93 113 119 115 99
-1232 99 73 51 48 59 69 67 61 62 71 82 86 80 71 68 77 96 117 131 133 125 114 110 118 133 152 169 180 179 171 164 160 148 121 87 67 75 107 144 168 176 178 189 213 231 227 213
-1252 213 213 237 262 259 225 176 125 73 25 0 5 31 57 72 82 84 74 61 62 85 111 121 121 130 151 163 144 101 62 51 72 112 152 179 195 205 213 224
-1268 224 241 265 286 294 285 259 216 164 124 111 123 131 115 82 55 46 46 46 46 47 43 31 19 25 53 86 103 100 88 79 70 57 44 37 37 41 54 78 108 127 132 131 132 134
-1287 134 130 117 99 87 87 94 94 80 57 47 62 93 126 152 172 184 183 171 153 130 101 77 78 110 152 177 177 166 151 127 89 54 41 47 53 48 47 60 78 84
$$ [...]
-3135A29
##END=	
##END=	
