##TITLE=	Jan24-2022.70.fid
TM-VI-252, Na+Ph-pyr

##JCAMP-DX=	6.0	$$ MestReNova 14.3.0-30573
##DATA TYPE=	LINK
##BLOCK_ID=	1
##BLOCKS=	2    
##ORIGIN=	Mestrelab Research S.L.
##OWNER=	hrzepa
##$MNOVA/LINK_BLOCK_TYPE=	ITEM	$$ NMR Spectrum
##$MNOVA/ITEM/POLYGON=	(XY..XY)
5321,5835
8722,5835
8722,8208
5321,8208
5321,5835
##$MNOVA/ITEM/Z=	0
##$MNOVA/ITEM/ANGLE=	0
##TITLE=	Jan24-2022.70.fid
##JCAMP-DX=	6.0	$$ MestReNova 14.3.0-30573
##BLOCK_ID=	2
##DATA TYPE=	MNOVA NMR VIEW DATA
##DATA CLASS=	MNOVA VIEW DATA
##$MNOVA/ITEM/ZOOM/X=	-4.0107147498308073352,	16.011019999997905927
##$MNOVA/ITEM/ZOOM/Y=	-563.97027182579040527,	6208.686279296875
##END=	
##TITLE=	Jan24-2022.70.fid
##JCAMP-DX=	6.0	$$ MestReNova 14.3.0-30573
##BLOCK_ID=	3
##DATA TYPE=	NMR SPECTRUM
##DATA CLASS=	XYDATA
##NUMDIM=	1
##ORIGIN=	Bruker BioSpin GmbH
##OWNER=	nmr
##.OBSERVE FREQUENCY=	400.20240119999999706
##.OBSERVE NUCLEUS=	^1H
##.SOLVENT NAME=	MeOD
##.PULSE SEQUENCE=	zg30
##LONGDATE=	2022/01/24 17:14:00.000
##.ACQUISITIONMODE=	SIMULTANEOUS (DQD)
##$ORIGINAL FORMAT=	Bruker XWIN-NMR
##$MNOVA/SCALES_VERSION=	9
##$PARAMETER FILE=	(acqus, ASCII, /private/var/folders/f6/rjf_tdyn2v98c5c0wvkgn4s80000gn/T/1nj8mYC8TM2KC+e9zaKerA/70/acqus, 0)
$$ ##TITLE= Parameter file, TOPSPIN		Version 3.2
$$ ##JCAMPDX= 5.0
$$ ##DATATYPE= Parameter Values
$$ ##NPOINTS= 11	$$ modification sequence number
$$ ##ORIGIN= Bruker BioSpin GmbH
$$ ##OWNER= nmr
$$ $$ 2022-01-24 17:14:22.866 +0000  nmr@CZC2439F63
$$ $$ /opt/topspin/data/agmb/nmr/Jan24-2022/70/acqus
$$ $$ process /opt/topspin3.2/prog/mod/shimcntl
$$ ##$ACQT0= -2.36344537815126
$$ ##$AMP= (0..31)
$$ 100 100 100 100 100 100 100 100 100 100 100 100 100 100 100 100 100 100
$$ 100 100 100 100 100 100 100 100 100 100 100 100 100 100
$$ ##$AMPCOIL= (0..19)
$$ 0 0 0 0 0 0 0 0 0 0 0 0 0 0 0 0 0 0 0 0
$$ ##$ANAVPT= -1
$$ ##$AQSEQ= 0
$$ ##$AQ_mod= 3
$$ ##$AUNM= <au_zg>
$$ ##$AUTOPOS= <52 >
$$ ##$BF1= 400.2
$$ ##$BF2= 400.2
$$ ##$BF3= 400.2
$$ ##$BF4= 400.2
$$ ##$BF5= 400.2
$$ ##$BF6= 400.2
$$ ##$BF7= 400.2
$$ ##$BF8= 400.2
$$ ##$BYTORDA= 0
$$ ##$CAGPARS= (0..11)
$$ 0 0 0 0 0 0 0 0 0 0 0 0
$$ ##$CFDGTYP= 0
$$ ##$CFRGTYP= 9
$$ ##$CHEMSTR= <none>
$$ ##$CNST= (0..63)
$$ 1 1 145 1 1 1 1 1 1 1 1 1 1 1 1 1 1 1 1 1 1 1 1 1 1 1 1 1 1 1 1 1 1 1 1
$$ 1 1 1 1 1 1 1 1 1 1 1 1 1 1 1 1 1 1 1 1 1 1 1 1 1 1 1 1 1
$$ ##$CPDPRG= (0..8)
$$ <> <> <> <> <mlev> <mlev> <mlev> <mlev> <mlev>
$$ ##$D= (0..63)
$$ 0 1 0 0 0 0 0 0 0 0.06 0 0 0 0 0 0 0.0002 0 0 0 0 0 0 0 0 0 0 0 0 0 0 0
$$ 0 0 0 0 0 0 0 0 0 0 0 0 0 0 0 0 0 0 0 0 0 0 0 0 0 0 0 0 0 0 0 0
$$ ##$DATE= 1643044462
$$ ##$DE= 6.5
$$ ##$DECBNUC= <off>
$$ ##$DECIM= 2496
$$ ##$DECNUC= <off>
$$ ##$DECSTAT= 4
$$ ##$DIGMOD= 1
$$ ##$DIGTYP= 12
$$ ##$DQDMODE= 0
$$ ##$DR= 22
$$ ##$DS= 2
$$ ##$DSPFIRM= 0
$$ ##$DSPFVS= 20
$$ ##$DTYPA= 0
$$ ##$EXP= <proton>
$$ ##$F1LIST= <111111111111111>
$$ ##$F2LIST= <222222222222222>
$$ ##$F3LIST= <333333333333333>
$$ ##$FCUCHAN= (0..9)
$$ 0 2 0 0 0 0 0 0 0 0
$$ ##$FL1= 90
$$ ##$FL2= 90
$$ ##$FL3= 90
$$ [...]
$$ ##$Sgu3PowerLevels= (0..7)
$$ 0 0 0 0 0 0 0 0
$$ ##$Sgu4PowerLevels= (0..7)
$$ 0 0 0 0 0 0 0 0
$$ ##$Sgu5PowerLevels= (0..7)
$$ 0 0 0 0 0 0 0 0
$$ ##$Sgu6PowerLevels= (0..7)
$$ 0 0 0 0 0 0 0 0
$$ ##$Sgu7PowerLevels= (0..7)
$$ 0 0 0 0 0 0 0 0
$$ ##$Sgu8PowerLevels= (0..7)
$$ 0 0 0 0 0 0 0 0
$$ ##$SguType= 3
$$ ##$ShimPowMaxUA= (0..63)
$$ 130000 130000 130000 130000 130000 130000 130000 130000 130000 130000 130000
$$ 130000 130000 130000 130000 130000 130000 130000 130000 130000 0 0 0 0
$$ 0 0 0 0 0 0 0 0 0 0 0 0 0 0 0 0 0 0 0 0 0 0 0 0 0 0 0 0 0 0 0 0 0 0 0 0
$$ 0 0 0 0
$$ ##$ShimPowMaxUC= (0..63)
$$ 130000 130000 130000 130000 130000 130000 130000 130000 130000 130000 130000
$$ 130000 130000 130000 130000 130000 130000 130000 130000 130000 0 0 0 0
$$ 0 0 0 0 0 0 0 0 0 0 0 0 0 0 0 0 0 0 0 0 0 0 0 0 0 0 0 0 0 0 0 0 0 0 0 0
$$ 0 0 0 0
$$ ##$ShimPowMaxUG= (0..63)
$$ 524287 524287 524287 524287 524287 524287 524287 524287 524287 524287 524287
$$ 524287 524287 524287 524287 524287 524287 524287 524287 524287 0 0 0 0
$$ 0 0 0 0 0 0 0 0 0 0 0 0 0 0 0 0 0 0 0 0 0 0 0 0 0 0 0 0 0 0 0 0 0 0 0 0
$$ 0 0 0 0
$$ ##$ShimPowRcbType= 3
$$ ##$ShimPowRes= (0..63)
$$ 1e-20 1e-20 1e-20 1e-20 1e-20 1e-20 1e-20 1e-20 1e-20 1e-20 1e-20 1e-20
$$ 1e-20 1e-20 1e-20 1e-20 1e-20 1e-20 1e-20 1e-20 0 0 0 0 0 0 0 0 0 0 0 0
$$ 0 0 0 0 0 0 0 0 0 0 0 0 0 0 0 0 0 0 0 0 0 0 0 0 0 0 0 0 0 0 0 0
$$ ##$ShimPowRng0= (0..63)
$$ 1 1 1 1 1 1 1 1 1 1 1 1 1 1 1 1 1 1 1 1 0 0 0 0 0 0 0 0 0 0 0 0 0 0 0 0
$$ 0 0 0 0 0 0 0 0 0 0 0 0 0 0 0 0 0 0 0 0 0 0 0 0 0 0 0 0
$$ ##$ShimPowRng1= (0..63)
$$ 1 1 1 1 1 1 1 1 1 1 1 1 1 1 1 1 1 1 1 1 0 0 0 0 0 0 0 0 0 0 0 0 0 0 0 0
$$ 0 0 0 0 0 0 0 0 0 0 0 0 0 0 0 0 0 0 0 0 0 0 0 0 0 0 0 0
$$ ##$ShimPowRng2= (0..63)
$$ 1 1 1 1 1 1 1 1 1 1 1 1 1 1 1 1 1 1 1 1 0 0 0 0 0 0 0 0 0 0 0 0 0 0 0 0
$$ 0 0 0 0 0 0 0 0 0 0 0 0 0 0 0 0 0 0 0 0 0 0 0 0 0 0 0 0
$$ ##$ShimPowRng3= (0..63)
$$ 1 1 1 1 1 1 1 1 1 1 1 1 1 1 1 1 1 1 1 1 0 0 0 0 0 0 0 0 0 0 0 0 0 0 0 0
$$ 0 0 0 0 0 0 0 0 0 0 0 0 0 0 0 0 0 0 0 0 0 0 0 0 0 0 0 0
$$ ##$ShimSysFunc= (0..63)
$$ 1 2 3 4 5 7 9 11 15 16 8 10 12 14 6 17 13 18 19 20 0 0 0 0 0 0 0 0 0 0
$$ 0 0 0 0 0 0 0 0 0 0 0 0 0 0 0 0 0 0 0 0 0 0 0 0 0 0 0 0 0 0 0 0 0 0
$$ ##$ShimSysMatrix= 0
$$ ##$ShimSysType= 1
$$ ##$TFXNUM= 0
$$ ##$TRIPLO2= 0
$$ ##$VTU= 2
$$ ##$VTUETH= <149.236.99.20>
$$ ##$VTUTY= <no>
$$ ##$WBREFAM= (0..15)
$$ 135.5 97.7 100 100 100 100 100 100 100 100 100 100 100 100 100 100
$$ ##$WBREFLM= (0..15)
$$ 0 0 0 0 0 0 0 0 0 0 0 0 0 0 0 0
$$ ##$WBREFPH= (0..15)
$$ 72.26 -67.22 0 0 0 0 0 0 0 0 0 0 0 0 0 0
$$ ##$WBSGU= (0..15)
$$ 0 0 0 0 0 0 0 0 0 0 0 0 0 0 0 0
$$ ##$XFAC= 2
$$ ##END=
$$ 
##$DECIM=	2496
##$DSPFVS=	20
##XUNITS=	HZ
##YUNITS=	ARBITRARY UNITS
##FIRSTX=	6407.6102040000005218
##LASTX=	-1605.0880428824991668
##DELTAX=	-0.12226593800080109986
##XFACTOR=	1
##YFACTOR=	0.02103585522970829666
##FIRSTY=	11.334169387817382813
##MINY=	0.45575356483459472656
##MAXY=	5644.26025390625
##NPOINTS=	65536
##XYDATA=	(X++(Y..Y))
$$ [...]
1947A317K5k0o0n7k8rj0%K6M0K2j8n6p8p2m1pJ0J1J3K1J4j4l9l9rL5O9O9L6OOJ0j4m5l5OK5
1943A110Lj3qj4n1o2qN9N9Ll8l4k4l6n5n3k7NK4K3J0RJ9Rk7m7j3M1O1L6Jk7m8m3%M4M2Mj5
1938I19mj0l7m0KL0Kn1o1k4K3M2K9ml1k2J6L4Ql2m1j9PK6M0M3K7Kj5k1j7nlk6n5n3j9NjjK7
1933F90N1L4jrMjj8k0nkj2k0j3kK3N7P1K9l5o4l9KK5K5Rj5k8k1k1m9p3m4K7O8M8Pj4rJ0L3
1928F98L4on2m3K4P4O2L0L1L9Kn6p5l7qk1m4k4L1O5M5lk6j3jrj8nJ7K0OJMqk6k1NJ8J7K4L5
1923G86J2m1o4l4RK5K1J5nl5l2J4M6K0k0j8J1J5MNJ2pk9qL5M3J0j2qmq%Kl1o4l7K9M4j2m6
1918F43LO4M5l2o7k3M5O9M2%k5k1plkJ2L1K1oj3NPk0l9l0j9k6k0J4K5j4n3k7L2M4Nk5j3J0
1913F32J6K2L1J8j9m7m6l7k6jL6M8K4lm%k3n5m5J4P6Q2L3j9k0RJ7j4k9OM3K6k6l9j5j6m8m6
$$ plain form
1947 1317 1342 1322 1262 1205 1177 1168 1158 1158 1184 1224 1246 1228 1172 1094 1022 981 974 984 995 1008 1029 1043 1029 990 951 942 977 1046 1115 1151 1157 1163 1173 1159 1114 1079 1085 1110
1943 1110 1113 1100 1092 1078 1027 965 957 1016 1075 1078 1040 1006 982 946 891 838 811 816 840 863 873 882 901 910 883 836 823 864 925 961 962 935 887 844 844 888 930 934 919
1938 919 915 905 868 828 830 860 862 811 750 726 749 791 820 816 785 763 779 813 821 789 748 729 736 762 802 845 872 874 859 838 821 816 813 787 732 679 660 665 664 663 690
1933 690 741 775 774 765 769 768 750 730 725 723 711 691 678 676 699 756 827 856 821 757 718 720 745 770 779 764 736 715 694 645 572 528 555 623 671 678 664 655 665 698
1928 698 732 726 674 631 655 729 791 821 852 891 893 837 762 725 717 696 652 628 659 724 769 766 740 727 726 717 699 694 711 731 737 738 742 734 708 687 692 710 727 751 786
1923 786 798 757 693 659 668 693 714 729 724 689 657 671 717 737 717 699 710 725 729 734 746 739 710 702 737 780 790 778 770 766 758 758 760 729 665 628 657 701 689 643
1918 643 646 710 755 723 656 633 678 747 789 789 764 743 736 733 731 743 774 795 789 776 781 788 768 729 699 680 654 634 648 673 659 606 579 611 655 660 635 622 632
1913 632 648 670 701 719 700 653 607 570 544 543 579 627 651 648 644 644 621 566 521 535 611 693 726 707 687 696 713 699 670 676 719 745 719 680 665 649 601 555
1909E55RM7K6LK4L6j8p7m6M4P4J6l4j4K7K6Lnj0l1l8oL2L1J0Okl8o3k7L4L9j1l2jJ9j1l6%
1904E61M9M9J1r%LkKKk6n4l6J3L5J7RK5K6%j0J6K8j4n9m7J3N6N7L3jm1o7n7k0OJ3J8K9K4k
1899F50k7k3KJ7Pk2m1k3K0N0M2J4j3k6l6k9oJ4J0j1j6KK6L6K9Oj6j2K3M4J1n1q0o1k9kL2O9
1895E80O4Lo0o9l1LJ2J4J8K1K4K8K6RrkK4L6K3PLLpj7qJ0Pk5n6m6pK0J1j5j9NL6M3K2j3l7
1890F31l4j5kNJ4K4J3j3j3L3O6L4l3n4j5J3j1l6oM9N4Jn3n8k7PK1J2j0k0qK0L4K9J3j1l3l1
1885E90J0O4P7L7j7l7k4qkmnj2k3k2nJ1Pj4l1l2j9%K3K9jm9o4k6K6L2JqK2N2M4J7Joj7k4r
1880E84J5K0Qkjknmkj0j8j0OJ0MJ4M9P5N1j6o6n6rK2J6MJ2J8kl7n0l8k5k6j7MK3L0L3L1Pl3
1875F07m7j3K6L1Rop%J3L2L3Lk6j1K8M7L2Qoj4j0RJ4k1o9p1j8L6M3J7noJ1L3L9J8j1j9lOj0
$$ plain form
1909 555 564 611 637 640 664 700 682 605 559 603 677 693 659 645 672 698 701 696 686 655 617 611 643 674 684 690 688 650 587 560 594 633 622 590 589 608 597 561 561
1904 561 610 659 670 661 661 664 662 664 666 640 586 550 563 598 615 624 649 675 675 665 681 709 695 636 589 602 658 715 748 747 706 639 582 562 568 581 599 628 652 650
1899 650 623 600 602 619 626 604 563 540 560 610 652 666 653 627 591 562 556 570 580 569 553 555 581 617 646 652 636 624 647 691 702 651 571 510 481 479 511 580
1895 580 644 647 587 518 487 490 502 516 534 555 579 607 633 642 633 631 655 691 714 721 724 727 720 703 695 705 712 687 631 585 578 598 609 594 575 580 616 659 681 668 631
1890 631 597 582 580 585 599 623 636 623 610 643 709 743 710 656 641 654 643 607 601 650 704 705 652 594 567 574 595 607 597 577 569 589 623 652 665 654 621 590
1885 590 600 664 741 778 761 724 700 692 690 686 681 669 646 624 619 630 637 623 592 560 541 541 564 593 592 543 479 453 479 511 512 504 526 578 622 639 640 634 617 593 584
1880 584 599 619 627 625 624 622 617 613 611 601 583 573 579 589 593 607 656 731 782 766 700 644 635 657 673 677 689 707 705 668 618 580 555 529 512 516 539 569 602 633 640 607
1875 607 560 547 573 604 613 607 600 600 613 645 678 681 655 644 672 719 751 759 753 739 729 738 752 731 662 591 573 609 652 669 664 658 669 702 741 759 748 729 726 732 722
1870G22l3m6m3k6JK6M1N1N4K0n6j04n3N5R8L4m6m9nRj4k1JRrj8nOpk3j7NJ2kj4jK0J6j1k2
1865E55QM3K7k2m0pK6K2RJ3J4pk9k4omjJ7L5L0J3Jk1n5n2K0R3P8mn3l3mj0k5j3QJ3J6K3J6
1860F70pqK5L9kn1m3PK8%k9j9JMljkj7l3k3RL0J7onK4N1L8nl7k7J6M2K8rk7k3k4l9l8LN3N5
1855F62J1k0j1J0Jj8j8j2k6m9l0K5N8L5j2k5KL0K5rl9l7JL4K6pk0ML2K5j0l7l9l1k7j7NK9
1850E21L6K1LjJ2J9Qrj3lQOjo%J4J4rl1k2J4K7PLL5N9K5k7l6j5k0m0rO2Q0J2n1l2J9K4poJ6
1845G07Ol2m3j4RKqnlKK4M4K0m3q0n9j6RK7M2K9j8m9k6K1L9L0K9L7K4%JK2J9j5k6RL1lo0o5
1840F18k3Lj3l4k4MK6M5O4O3K6j5l0j9qqnlj3k9l1j2RK0K5K3J4PJ7K7Ql1n0k4J7L1Rj8k7j3
1835F26J1J9J0rk0k6l3l1pK1L1K5L2M8L8Jk8k6j7j5oJ8K8Nk0j9j3k8m3k7qk0l2KM9M3kj4K5
$$ plain form
1870 722 689 643 600 574 575 601 642 693 747 767 711 607 554 609 707 741 695 646 641 650 636 615 616 625 616 598 593 599 592 569 552 557 569 567 553 552 572 588 577 555
1865 555 563 606 633 611 571 564 590 612 621 634 648 641 612 588 582 578 577 594 629 659 672 673 652 597 545 565 658 736 732 679 646 642 632 607 594 602 615 631 654 670
1860 670 663 655 680 719 717 666 623 630 658 658 629 610 611 615 612 611 609 592 559 536 545 575 592 586 581 605 656 694 689 652 625 641 683 711 702 675 652 628 589 551 554 607 662
1855 662 673 653 642 652 653 635 617 605 579 530 500 525 583 618 606 581 583 613 638 629 590 553 554 588 614 607 587 591 623 648 638 601 562 531 504 487 492 521
1850 521 557 578 581 580 592 611 619 610 597 594 602 608 607 601 601 615 629 620 589 567 581 608 615 618 653 712 737 710 674 659 639 599 590 652 732 744 693 661 680 704 697 691 707
1845 707 713 681 638 624 633 635 627 622 619 621 645 689 709 666 586 527 511 520 547 589 618 600 551 525 546 585 615 644 681 705 705 706 728 747 732 706 715 746 743 683 618
1840 618 595 598 585 551 527 531 557 602 666 729 755 740 710 691 683 675 670 667 654 625 594 582 591 611 636 659 673 680 697 724 732 701 651 627 644 675 684 666 639 626
1835 626 637 656 666 657 637 611 578 547 540 561 592 617 649 697 735 736 708 682 665 650 644 662 690 695 675 656 643 615 572 545 537 517 485 487 536 579 577 563 588
1830E88L9kl6j2K5J4j3LM5M8Jm0m0j9jJ6K9J9j5l9l3j1J0L1M6L6jj8RL8Po9j00m5M0P2M3J5
1825F80K2L6K7Nojjj5k7k8j5LJ1J2J9L9M5Rn5q6m9J2L8K5J8K8K2j0l9m0k3j9k3j4J3L0J1k1
1821F33k1J9N3L6j9m9l1LK0J7Oj7m1l2J0L4J2j4QN0N4J8j0j6k4l6j7J9K5j0l7k7j4j4kL3M7
1816F66J6j1PL9K6k5o0m9j3J6J7pk7j2K8L7Jl1j7J7K6J0jj2l1m2k1ROj7j9J0M1N3M7K6nj5
1812F83MJ6j1l6j2L7L4j7m1qK2%l7m0j5MJ2K2L0K0KonjMQ%oMK2Pm4p0l1K2K3k0m1j5K8N2O5
1806F65O5L4k2n4k5K2K5k1n8m1RM1L6Mk6l0kL4K5k8o3k4M6N7%l9j4K4J2k7l6k1j8pM0Q4N4
1802G21k3m6OM6J4l7m3k1j8j5J3M3L0qj9KJ6J0Jj0l2m5j8K3K7lj0K0M2K2j4k8j6JK0L7K9r
1797G08m2m2j9oljKqk0qK3L3Pk2pL6N1J9k4k7LK0%l6m5k2J4L7L6J8Jj0j0KK1K4qn6o1kO2O3
$$ plain form
1830 588 627 625 589 577 602 616 603 606 651 699 700 660 620 601 600 616 645 664 649 610 577 566 576 607 653 689 688 670 679 717 724 655 555 510 550 622 665 680
1825 680 702 738 765 770 764 763 762 747 720 692 677 680 691 703 722 761 806 815 760 674 625 637 675 700 718 746 768 758 719 679 656 637 614 600 613 643 654 633
1821 633 612 631 684 720 701 652 621 624 644 661 667 650 609 577 587 621 633 619 627 677 731 749 739 723 699 663 646 665 690 680 643 616 602 588 586 619 666
1816 666 682 671 678 717 743 718 658 609 596 612 629 622 595 583 611 648 649 618 601 618 644 654 653 641 610 568 547 556 562 545 526 536 577 630 677 703 698 683
1812 683 687 703 692 656 644 681 715 698 657 649 671 671 634 594 579 583 595 617 647 667 669 663 658 657 661 669 669 663 667 689 696 652 582 551 573 596 576 535 520 548 600 665
1806 665 730 764 742 688 663 685 710 689 631 590 599 640 676 680 654 624 622 656 681 653 590 566 612 669 669 630 616 640 652 625 589 568 550 543 583 667 721
1802 721 698 652 658 704 718 681 638 617 599 584 597 640 670 662 643 645 661 671 672 662 630 585 567 590 617 614 604 624 666 688 674 646 630 631 651 688 717 708
1797 708 666 624 605 599 596 595 597 589 569 561 584 617 624 602 595 631 682 701 677 650 653 673 673 637 592 570 584 621 657 675 676 666 656 658 679 703 695 639 578 576 638 701
1792G01J4j9qLmKL0L6qn2l9J1K1j9n4m1jK6L2K6J3jj4k9l8k9jK1K1K1L4L8Mm6n9l2nnj1MK8
1787E71L7L2K8K7J9kk3k4kJ4nm0l4K5O4J9o1p5j2L9L7L1N6O1Lo1n9j1J4OJ2L6K9j8n3m4j8
1783F18j2k2k6j5J1M5O0K6l4n7k0K9M4L2K2J0j8k8KM2L0k3m7j9J1NoJ1K3ll3j3M0N0jm9m2
1778F43pJ1J4K7M2L1%k2k3k0k1j7rKJ9M7O8N5J2k3k4j2onQK9L4J8nj4nPJ0QQMrj8pJ8J7j2
1773H73k6MM1K8k6n6l6nKlMJ1Mj2j6q%J1K6L6K9Oj3j5mJ1J4J0J5L6M3J5k2k2J5M7M4K3J2J6
1768A112L5O3P3L8j6l5j2%j4lO2J10P9J0j5QMm1o7m5k1l5o0n4k7j3j3j0lj0k4k5qJ1J2kj4
1764A050j8j0KOnk8n0m3jM5M6Lk7oL5N2M2K8Ml6m9QR6J24P3J5J3M4N1L6K8K6Mk7l9k7j3pj5
1759A430l6o4o2k1K4K1k4n7n2l3k8l5l3k0lJ0J8J2kqQL6M0Nn1p7n5j2J2QOK3L2J5j0j7omj3
$$ plain form
1792 701 715 696 688 691 687 689 719 755 747 695 656 667 688 669 615 574 573 599 631 657 670 669 655 626 588 559 558 579 600 621 655 693 697 651 592 560 555 550 539 543 571
1787 571 608 640 668 695 714 712 689 665 663 677 672 632 598 623 687 706 645 570 558 597 634 665 721 782 785 724 665 654 668 674 686 722 751 733 680 636 618
1783 618 606 584 558 543 554 599 659 685 651 594 574 603 647 679 701 711 693 665 667 709 739 716 669 650 661 666 660 671 694 691 658 645 685 735 734 685 643
1778 643 636 647 661 688 730 761 761 739 716 696 675 658 649 651 670 717 785 840 852 829 805 793 787 782 790 819 853 871 866 852 847 854 864 872 880 884 875 857 850 868 885 873
1773 873 847 851 892 920 894 838 802 797 799 796 800 811 815 803 787 779 779 790 816 852 881 887 874 859 855 866 880 890 905 941 984 999 977 955 970 1017 1061 1084 1096 1112
1768 1112 1147 1210 1283 1321 1305 1270 1258 1258 1244 1241 1303 1413 1492 1502 1487 1495 1499 1458 1391 1346 1325 1290 1230 1176 1149 1136 1123 1113 1110 1100 1076 1051 1043 1054 1066 1064 1050
1764 1050 1032 1022 1024 1030 1025 997 947 904 903 948 994 997 970 964 999 1051 1093 1121 1125 1089 1040 1048 1144 1268 1341 1356 1369 1413 1464 1500 1528 1554 1558 1531 1492 1465 1452 1445 1430
1759 1430 1394 1330 1268 1247 1271 1292 1268 1211 1159 1126 1098 1063 1030 1010 1007 1017 1035 1047 1045 1037 1045 1081 1121 1126 1075 998 943 931 943 951 957 980 1012 1027 1017 1000 994 990 977
1754I77j8j6j4j6j1%OJ2L0N3O2M2J1j0k0l0m0l6j6J0J7ol7l9pJ6j0n9p1k8K6M0K0Kj%NK2M6
1749I12M4Km8o7n0j9OK9M7L7j4o7o2JN3M3j0m3l0lJ8K8K6Lk2j6K3M7K5j5l1k2j9k6k2lJ6K6
1745G97L0L0K2J2J8L4L6J5j1k2k1k4m3n6l3K2P3O8K2j0QK7Mm3m9pK8K6J1Qjj9k6j2qj9j7J0
1740H80K5OjL3N2On8m9J0J6m1p0j9M3M4J5J4K8K4RJ1J7OoPK0R%J7K9jl9k6K1L3nl8l5k1j3
1735I53jJ3Mj1jL2M0J2rmkj5j9j1j6l3j5L5N3J7j1J3L9J1k5j4K0J1k0kN5N9pn4k4K4J4l1l4
1730A046RL5J5rJ0M8M9Ml7l3okj5pK3K8rl4rL3L3lk3rJ0K2K5J2k3m8j8M1O4L1oj1NJ6K1Rk6
1725A261n6l0L2N9K4pJ0L7K0qNL8K7k0l4J0N6N3J7j3k6l0k4oJ4K3K2J5jk1k0MK8K5jj3J0N2
1721A532P1N1Oj8rPjk3j8J3M1L9L1M2N5L6j2m4l0NK4K1J6J6J1NJ4L2L5K0J6L7M6J2k7j5M2
$$ plain form
1754 977 959 943 929 913 902 902 908 920 950 1003 1065 1107 1118 1108 1088 1058 1018 982 966 976 993 987 950 911 904 920 910 851 780 752 778 818 838 840 839 839 844 866 912
1749 912 956 958 910 843 793 774 780 809 856 893 879 812 750 751 804 847 837 794 764 761 779 807 833 836 814 798 821 868 893 878 847 825 806 780 758 755 771 797
1745 797 827 857 879 891 909 943 979 994 983 961 940 916 873 817 784 806 879 947 969 959 967 994 998 955 906 899 927 953 964 972 971 952 926 914 906 887 870 880
1740 880 905 911 910 943 995 1001 943 894 904 920 879 809 790 833 877 892 906 934 958 967 978 995 1001 995 1002 1022 1031 1031 1048 1077 1076 1037 1011 1032 1065 1060 1022 987 966 953
1735 953 952 965 969 958 957 989 1029 1041 1032 1028 1026 1011 992 981 965 932 917 952 1005 1022 1011 1024 1063 1074 1049 1035 1055 1066 1046 1044 1099 1158 1151 1097 1073 1097 1111 1080 1046
1730 1046 1055 1090 1105 1096 1106 1154 1203 1207 1170 1137 1131 1129 1114 1107 1130 1158 1149 1115 1106 1139 1172 1169 1146 1137 1147 1169 1194 1206 1183 1135 1117 1158 1222 1253 1247 1236 1241 1257 1278 1287 1261
1725 1261 1205 1175 1207 1266 1290 1283 1293 1330 1350 1342 1347 1385 1412 1392 1358 1368 1424 1477 1494 1481 1455 1425 1401 1395 1409 1432 1454 1469 1468 1447 1427 1431 1459 1484 1483 1470 1480 1532
1721 1532 1603 1654 1660 1642 1633 1640 1639 1616 1598 1611 1652 1691 1722 1764 1819 1855 1843 1799 1769 1774 1798 1819 1835 1851 1862 1867 1881 1913 1948 1968 1984 2021 2067 2079 2052 2037 2079
1716B079P4M3lj6jRJ7L9N7M2P%K3L0Kj7J5O2N8Nk4K2Q7R2L2k0j6J5L3M6O2O3K7rkL2L8J4J1
1711C028M7P5N8L4M3O8O6L8K4L4M5M6N6P8J00J05R4O9N2O5J09J45J39J12J02J08R8P7Q4J34
1708E333J78J74J40J25J42J63J65J71K10K70L02K80K35K14K32K79L43M12M52M40M16M37N05
1705A1618N62N93O50P53Q40Q66Q86R75J111J217J297J404J540J635J684J756J885K012K073
1703C5357K076K047J968J814J602J348J038O62K49j62n65r54j273j478j589j643j645j585
1700C7267j501j427j331j168r70q21p33o33m68k88j61q9pJ26K84M20N24O28P74R52J116J243
1698C3737J370J539J745J954K162K395K665K948L227L513L821M150M489M831N161N454N693
1696I0854N883O004N990N766N313M671L878K919J766M39r71k345l590m627n391n848o035o021
$$ plain form
1716 2079 2153 2196 2193 2177 2176 2185 2202 2241 2298 2340 2347 2347 2370 2400 2402 2385 2400 2462 2520 2525 2501 2523 2610 2702 2734 2714 2698 2713 2746 2792 2854 2917 2944 2935 2933 2965 3003 3017 3028
1711 3028 3075 3150 3208 3242 3285 3353 3419 3457 3481 3515 3560 3606 3662 3740 3840 3945 4039 4108 4160 4225 4334 4479 4618 4730 4832 4940 5038 5115 5199 5333
1708 5333 5511 5685 5825 5950 6092 6255 6420 6591 6801 7071 7373 7653 7888 8102 8334 8613 8956 9368 9820 10260 10676 11113 11618
1705 11618 12180 12773 13423 14176 15016 15882 16768 17743 18854 20071 21368 22772 24312 25947 27631 29387 31272 33284 35357
1703 35357 37433 39480 41448 43262 44864 46212 47250 47912 48161 47999 47434 46480 45207 43729 42140 40497 38852 37267
1700 37267 35766 34339 33008 31840 30870 30049 29316 28683 28215 27927 27766 27677 27670 27796 28080 28500 29024 29652 30426 31378 32494 33737
1698 33737 35107 36646 38391 40345 42507 44902 47567 50515 53742 57255 61076 65226 69715 74546 79707 85161 90854
1696 90854 96737 102741 108731 114497 119810 124481 128359 131278 133044 133483 132512 130167 126577 121950 116559 110711 104676 98655
1693I8655n855n559n190m829m509m192l840l470l120k780k432k100j813j551j277r96p54n50
1691D3838l38r9J21L01M76O95R45J185J410J643J904K185K482K794L118L441L770M107M453
1689G8431M797N135N446N685N794N743N520N128M557L796K833J670L39j085k494l784m867
1687A22644n682o197o422o409o241n995n708n384n031m672m325l979l624l271k950k659k379
1685D1716k113j886j697j511j313j125r67q18o60n13m10l46k62j22N5K13L19L94M91O28P79
1682C0852R02J009J136J289J428J521J577J610J615J575J480J316J062P26L53l9m64r19j343
1680D6686j675j918k107k231k260k212k142k066j954j802j654j543j448j350j246j149j052
1678A6877r61q88q32p59o64n84n49n32m87m26l82l66l44l13l01l20l38l15k62k18k02j93j77
$$ plain form
1693 98655 92800 87241 82051 77222 72713 68521 64681 61211 58091 55311 52879 50779 48966 47415 46138 45142 44388 43838
1691 43838 43500 43401 43522 43823 44299 44994 45939 47124 48534 50177 52081 54266 56748 59542 62660 66101 69871 73978 78431
1689 78431 83228 88363 93809 99494 105288 111031 116551 121679 126236 130032 132865 134535 134874 133789 131295 127511 122644
1687 122644 116962 110765 104343 97934 91693 85698 79990 74606 69575 64903 60578 56599 52975 49704 46754 44095 41716
1685 41716 39603 37717 36020 34509 33196 32071 31104 30286 29626 29113 28703 28357 28095 27973 28028 28241 28560 28954 29445 30073 30852
1682 30852 31754 32763 33899 35188 36616 38137 39714 41324 42939 44514 45994 47310 48372 49098 49451 49412 48948 48029 46686
1680 46686 45011 43093 40986 38755 36495 34283 32141 30075 28121 26319 24665 23122 21674 20324 19078 17929 16877
1678 16877 15916 15028 14196 13437 12773 12189 11640 11108 10621 10195 9813 9447 9103 8790 8489 8169 7831 7516 7254 7036 6834 6641 6464
1675F464j61j54j43j21j11j40j75j57r1n8j04j73j80j33j02j03q9n6m9q4j05p9m9n8p5o1l9
1672C614n3q0p1l2j5k7l8l8l9m3l2k3n1r6r3l6Rkk4rJ8kn1p0m8l7n9q2o3k2%llJ1J4ok5j6
1667B377%j7o1p8m0Jj1n5o2k7j3m8p1l4J8J5k6l5NK9nn3m9nJ8lk7pL6M5Nl5k4J4K4ml0k6k0
1662A721l8m7mO1P6J8m3m4KJ4k9p8p1k6rl5n2j8L5N3L4K0J5j9o8p3rM8L2k1l2MK6%m2n9m2
1658A300j3Mj0l9l7J5O0L6l0n4j5K3J9QJ7K4RjJ2J4k0n3m5j4j%J3J9lk0J3O7O3mn9n2j7mj2
1653A213j7j6j3lJ4J6jj7j5qj0oK3M8K5l9q2o2%M2M6K6Mj6l7l5mL7M8K2j4l1k5mJ4Pk4n2m2
1648A012nJ4O%J4J6nj0K0L9Jn5m9J1N5M3J3lj7l8m5k3RK3J6Nl%J3J0j5l2j0K2K2j1l1l3m6
1643I33o5l3M9J05Q1J3k8l6l7l2qJ5J5LPJ7J9K2L3L5Pl7n8m8k1JRlj2PL1J5l8n5mM4K5k5l3
$$ plain form
1675 6464 6303 6149 6006 5885 5774 5634 5459 5302 5211 5153 5049 4876 4696 4563 4461 4358 4269 4213 4164 4080 3975 3896 3847 3789 3714 3653 3614
1672 3614 3561 3481 3410 3378 3363 3336 3298 3260 3221 3178 3146 3123 3072 2976 2883 2847 2856 2854 2830 2821 2839 2837 2786 2716 2668 2631 2572 2490 2427 2405 2405 2402 2399 2410 2424 2418 2393 2377
1667 2377 2377 2360 2299 2221 2181 2182 2171 2116 2054 2027 2014 1966 1895 1861 1879 1894 1868 1833 1838 1867 1862 1809 1760 1755 1773 1770 1743 1736 1772 1817 1822 1787 1763 1777 1801 1797 1767 1741 1721
1662 1721 1683 1636 1632 1693 1769 1787 1744 1700 1702 1716 1687 1609 1538 1512 1503 1468 1416 1398 1433 1486 1520 1540 1555 1536 1468 1395 1386 1434 1466 1445 1413 1417 1443 1443 1401 1342 1300
1658 1300 1287 1291 1281 1242 1205 1220 1280 1316 1286 1232 1217 1240 1259 1267 1284 1308 1317 1316 1328 1342 1322 1269 1224 1210 1209 1209 1222 1241 1238 1218 1231 1298 1361 1357 1298 1246 1229 1225 1213
1653 1213 1196 1180 1167 1164 1178 1194 1193 1176 1161 1153 1143 1137 1160 1208 1233 1194 1112 1050 1050 1092 1138 1164 1168 1152 1115 1080 1076 1113 1161 1183 1169 1138 1113 1109 1123 1130 1106 1054 1012
1648 1012 1007 1021 1027 1027 1041 1057 1052 1042 1062 1101 1102 1047 998 1009 1064 1107 1120 1117 1100 1062 1017 994 1003 1026 1042 1047 1044 1044 1057 1067 1052 1020 1010 1032 1054 1043 1012 979 933
1643 933 868 835 884 989 1070 1083 1055 1019 982 950 942 957 972 975 982 999 1018 1040 1073 1108 1115 1078 1020 972 951 952 961 958 946 953 984 999 961 906 902 946 971 946 913
1639I13JJ6Lpkmrpj4m3m7J2P5O4Nj0K5L3ok2lom4m5J5N2J0l7j6L6L8MoJk2m7j8M5P0L6mk8
1633A007o2j00r5l1L3N2L9K1Lj2mK5M4L3J3Jpj7k7l5m1k9J6O0N4Jm0l5k0k2j6K2N8M6ml1j8
1629H82MJ2J6L2M5M7M3M0K9Lk2l6m3m3k4QK4J0pRL3J6l7o3l0J3J3oRL8K4k8m5LM4Po8q2j4
1624H56N5N6Jm7m7j3K1K8J9J0J8K5K0J0J8L9N5N3M1K9K1K0L4N2M9J7j5j3K4N8N8K6pl0n3p6
1620A412q0m9lK0Lk8m3l4j8j2k0k6j8%Lj8l4j4K0K0k0m8l6j0oj0J0M3N0K8jj8j7JK5L3K0J3
1615A138L2M7K3j8k4J1N0O9P7P3N1K2Rjk3m1j9J4Mm5n9j5L3K8j3m2n3n7n9n8o7p4m5J4M2O
1611A030m3m9j8JMNj0n2p6m1K6N4L2RJ0RnmK0M3L9J9Jn%J2Mk1k4L1R3P9j1p8n6jNl2m4j3K1
1606I64K5J7Oj5l9m2k0jpk9m1l3pK2L0Ml0l7pJ7Rj1pJ5K0LLK6L4lm5m5j8j4l8m4j3J5J0kJ0
$$ plain form
1639 913 914 930 933 926 924 920 911 904 890 847 800 812 887 951 956 946 971 1004 998 976 973 967 923 878 893 945 955 918 902 938 976 980 974 975 953 906 888 933 1003 1039 1035 1007
1633 1007 945 845 750 719 752 804 843 864 867 855 851 876 920 953 966 967 960 943 916 881 840 811 827 887 941 942 902 867 847 825 809 831 889 935 931 900 882
1629 882 886 898 914 946 991 1038 1081 1121 1150 1153 1131 1095 1052 1009 985 993 1017 1027 1020 1029 1062 1078 1041 978 948 961 974 968 977 1015 1039 1011 966 969 1013 1020 952 870 856
1624 856 911 967 968 921 874 861 882 910 929 939 957 982 1002 1012 1030 1069 1124 1177 1218 1247 1268 1288 1322 1374 1423 1440 1425 1412 1436 1494 1552 1578 1571 1541 1488 1412
1620 1412 1332 1283 1280 1300 1303 1275 1232 1198 1180 1168 1148 1122 1104 1104 1107 1089 1055 1041 1061 1081 1061 1013 977 967 961 951 961 1004 1054 1082 1081 1063 1046 1047 1072 1105 1125 1138
1615 1138 1170 1217 1240 1222 1198 1209 1259 1328 1405 1478 1529 1551 1560 1559 1536 1495 1476 1490 1494 1449 1390 1375 1408 1436 1423 1381 1328 1271 1212 1154 1087 1013 968 982 1024 1030
1611 1030 987 938 920 921 925 930 920 868 792 751 777 831 863 872 882 891 886 882 902 945 984 1003 1004 999 999 1011 1015 994 970 1001 1094 1173 1162 1084 1028 1027 1032 1000 956 943 964
1606 964 989 1006 1012 997 958 916 896 895 888 859 818 785 778 800 830 834 804 767 760 777 786 775 768 783 803 806 809 835 869 866 821 776 758 744 706 662 649 664 674 672 682
1601F82L2L0J7J2Rj6m3l6ML2K8Qnj3jL9P2M4m1r4n7K1M8Nm2l6J2N1N2J8l0o3o3k9K1O2O8L7
1596H35j3m3m1k0MK6L9K8rl9l0J1L8K9OjJ6L0J9j1k9k0JRKMK2K4kl4m1l1j7%L4N3K6k1l5q
1591H11Qj6l6j2K2J3k6m1j3K2L4L0J6j9n4m6jJ3l1o3k1N5O7J3j9PL2Qj5J1M3J3m8n3JL8K3
1587G66OK0K3j1l5j1J4k0q3q9k4L6L7J2J1L0K7j1n1o1l6OL9M4K4LLK0L4K8Rj1k0k1k0j7mJ4
1582F81L1L8L2J3j7l1nM5N8J3l8k9J8K3m2j04q3NP1O1Km2m5k5j2j5j4RM9P9P7L9j5n3n0j1
1578G13J3j7q1j16q5nP1J05Q8L7oj4Kjl1l9QO8O5jn7n2nK8L2L1K6J4lKK5L3kn2o9m2mJ4J2
1573G05J8L6M6K3j9m5l7j0Kqj2NK0km7n8j0N1O6M0J0mk3m0k5J7L2pn6n6j2K7L7L3K9J8OLJ3
1568G66J4Pkj7m9p0m6J8O0M7Oj2jJ3J6Qj2l0j5K5L3k3q5q2j7K9K2JJ2L4L7J9MmrqMJ7K6K8
$$ plain form
1601 682 714 744 761 773 782 766 723 687 691 723 751 759 754 741 740 779 851 895 854 760 703 724 772 777 735 699 711 762 814 832 802 739 676 647 668 730 798 835
1596 835 822 779 738 718 722 748 787 815 806 767 737 748 786 815 821 820 836 866 885 874 845 825 826 835 837 841 863 887 885 851 810 779 762 762 796 849 875 854 819 811
1591 811 819 803 767 755 777 790 764 723 710 732 766 796 812 793 739 693 692 705 674 611 590 645 712 725 706 713 745 753 738 749 792 805 757 704 705 743 766
1587 766 772 792 815 804 769 758 772 752 669 580 556 592 629 641 652 682 709 698 647 586 550 556 595 639 663 666 669 689 723 751 760 749 729 708 688 671 667 681
1582 681 712 750 782 795 778 747 742 787 845 858 820 791 809 832 790 686 603 608 679 740 742 700 655 630 618 603 589 598 647 726 803 842 827 774 724 713
1578 713 726 709 628 512 427 422 493 598 686 723 717 703 705 704 673 634 642 710 775 774 717 665 660 688 720 751 777 791 788 790 815 848 846 794 725 683 679 693 705
1573 705 723 759 805 828 809 764 727 717 719 711 699 704 724 722 675 617 607 658 724 764 774 770 747 707 682 699 731 724 668 612 600 627 664 697 726 744 750 753 766
1568 766 780 787 785 768 719 649 603 621 681 728 734 722 721 734 750 758 746 716 701 726 759 736 651 569 552 581 603 604 616 650 687 706 710 706 697 689 693 710 736 764
1563G64J7j6m4l5MK0j4n0l8J1L7K3LJJ3J9J5RPJ0Jk5m5j7L9N0j2o7l0M7N1k7p5k9M2M8RjK9
1558G44M7L4J4nl0n2m0lOk9p0p1l5PL1M1M6M6L6Nl2n1m1j6NJ6K1K3K1K1J9Oj7k0ML4L7L1M2
1554H25N1J8m3p8n0pJk2k8LM0M5J8j0k0j6j0KJ7J7ql7l3LK8J5j6k7j4MJ9L0K1rl3k2K%k8l9
1549F09j5K4M0L2J1noLJ1J0J3J9J4pj1K0M1Ql9l6OJ0l2n1j7J2j0l1KM9M4jj7J0K9J3j5l3l9
1544F65l0KL6M2J3k0l1k0OL0K7ml0k0J4L5L0Rj6l7k8J1L2Ml5k1K6M0Jk7pK8L8K6J5NrqPMk4
1539G79m4k8MRqj6kJ2J6R%nkKrk9k9rKj2k0JL1L8K8K6K5Nk8l5nL5M7K3k1n3m0PM3K6j9l7j1
1534G06K0K0%kJ5K7Pk8m5k8njmJ3M3M2Nk6k3rk0l2j0L2M4K3Knj2k2j6OJ3%j1j2j6k4j5PJ4
1529F73LlMNojJ2lm3n3rK3om0pO3P7K1j9kK6K1L%j1l9m4NN8N2kl2k5j8l1k8ML3L1K1L0M1K8
$$ plain form
1563 764 781 765 721 686 690 710 696 646 608 619 656 679 682 683 696 715 730 739 746 756 757 732 687 670 709 759 747 680 650 697 748 721 646 617 659 707 716 715 744
1558 744 791 825 839 834 804 752 712 709 715 686 616 545 510 517 548 589 635 681 717 722 690 639 598 582 587 603 624 647 668 689 708 714 697 677 681 715 752 783 825
1554 825 876 894 851 773 723 716 717 695 667 670 710 755 773 763 743 727 717 719 736 753 745 708 675 678 706 721 705 678 664 668 687 717 738 729 696 674 676 676 648 609
1549 609 594 618 658 690 701 696 690 693 704 714 727 746 760 753 742 762 803 811 772 736 742 752 720 669 652 664 654 623 625 674 718 717 700 710 739 752 737 704 665
1544 665 635 637 673 715 728 708 677 657 663 693 720 716 686 666 680 715 745 754 738 701 673 684 716 720 685 664 690 730 731 704 697 725 763 789 804 809 800 792 799 803 779
1539 779 735 707 711 720 712 696 694 706 722 731 731 726 724 726 717 688 659 650 652 640 620 621 652 690 718 744 769 774 746 711 706 741 788 811 790 737 697 704 747 773 754 717 706
1534 706 726 746 746 744 759 786 793 765 720 692 687 686 682 695 738 780 785 759 736 727 707 675 665 697 741 764 766 761 749 727 711 717 730 730 719 707 691 667 652 659 673
1529 673 676 673 677 682 676 675 687 684 641 588 579 602 596 556 549 612 689 710 691 689 715 736 739 739 728 689 645 650 708 760 758 726 701 683 652 624 628 661 692 713 743 784 812
1523H12lj9j7j4j3PM6O5M7J3kkj3l9m8k2J1J0rmL6N7J9m3n9k0K0J7j0j9LL8N6M2Ml3m3k8r
1519H34QL1L8Mn7p7k9L2L8%j5NJ8LoRK6K8K0Qj8m6l8ML4J4k1k8qJ0J8J8Qqj1NPj7l1rK1J3
1514H35j4j3J5K4Oj4k5m6o0k0N9R1L2o4j11q2j7M0N7K3k8l2K2P5O5J0l4m1k8lK7L2Jl6k8R
1509G27K1j1l6j5L4N6M1Oj6pK1M7M6L0J3ll0n0l3J3L4Ll7l5LK6K1J6K4K1mk7j8J1J9jk1qJ8
1504H99K5PpjPj1l6l5nJ7J0nKK2K8J1%J8N0P1O4L2%mK6N7O1L5J5K1L2K7NrlJ4K0Rqj9j8j0
1499A414MK0J8j4o8r8q1l7j8l4m6k6J6M3L8J2j4k2j1rl0m5j8K7K6l1o3j8M9N5Rj6ojk2k5M
1495I82J9jj9nJ1ol1k8ojpnkj0j7oRJ0J3L3L6mm2k8J8K4j3l2pJ0j3l9k5J0K7K2Pj%K0M3L9
1490I85Oj4nP%j2j2oJJ6L3L0RJ1L9M5J2k2k2j7l1l6KN3O8N6N2N0L2K1L6N1L3K1N6R7P4J7J7
$$ plain form
1523 812 809 790 773 759 746 753 799 864 911 924 922 920 907 868 820 798 809 819 810 806 842 899 918 875 816 796 816 833 823 804 807 845 901 943 947 914 871 843 834
1519 834 842 873 911 915 858 781 752 784 822 822 807 812 830 833 827 836 862 890 910 918 900 854 816 820 854 868 847 819 811 821 839 857 865 857 846 851 858 841 810 801 822 835
1514 835 821 808 823 847 853 839 814 768 708 688 747 838 870 806 695 613 596 636 693 716 688 656 678 753 818 828 794 753 725 722 749 781 782 746 718 727
1509 727 748 737 701 686 720 776 817 823 807 800 821 868 914 944 957 954 924 874 841 854 888 891 854 819 822 848 869 885 909 930 926 899 881 892 911 910 889 881 899
1504 899 924 931 924 923 930 919 883 848 843 860 870 865 867 889 917 928 928 946 996 1067 1131 1163 1163 1159 1185 1242 1303 1338 1353 1374 1406 1433 1438 1429 1426 1440 1460 1469 1461 1442 1424 1414
1499 1414 1418 1438 1456 1442 1374 1276 1195 1158 1140 1106 1060 1034 1050 1093 1131 1143 1129 1107 1096 1087 1057 1012 994 1021 1047 1016 953 935 984 1039 1048 1032 1026 1025 1003 978 982
1495 982 1001 1000 981 976 987 981 950 922 916 915 908 903 901 891 874 868 877 887 900 933 969 965 923 895 913 937 924 892 885 895 882 843 818 828 855 877 884 883 883 903 946 985
1490 985 991 977 972 979 979 967 955 949 950 966 999 1029 1038 1049 1088 1133 1145 1123 1101 1084 1053 1017 1019 1072 1140 1196 1248 1298 1330 1351 1387 1438 1471 1492 1548 1645 1719 1736 1753
1485A753Q3J15P8M4P3J19J18R5J02J29J36J29J48J79J81J44J06R3Q2M0l0j01j41j48j47j53
1482C227j60j45j23j17j25j26j19j25j29j00m8k4m9q1q5p9p8o6l5j4k3l1j8j1l0m5k4lk0m8
1478A146m7k1olKol4l9ON4M0oj3J3Jm8n7qK9Ll4l1j0j1k4k6k8m3m1kL7M4K9K3J2j6l4pL4M1
1473I19J0j4rLJ4K1J5k0n6n3j4J5RmLK1K6J4kj5k1j3J5M7N9M1J5K%qk5k3OK8J8lNL3L6J0j
1468A104K0K9%l2k3J8M8N6N5M5J6qj1j7m6o8m1J3L0ll0j6J5K3J1NJ0J6J4ll5n4m5k6l6o4n8
1464I12mM8N0J7j0l0n3o4l9J2M9M8K4Lrj0pj0k4l4k0RK9K2ql1l2rJ7K4J0pj9l0m1m4k4J1M2
1459G68M4J9j6l4k7pQJ9L0L2Pl5o4o4l9mK8L7J8LK0N0L7k6p3m7L2Q6P2J1m5n9k8K0L6Ol1l3
1454G51NL8L8Pk9l9j0L1L8J2JL0N4L0j5k0QJ0l1n5k9QJk4k0J2K4ml8l9lL5M4K2%KJ5Pk2l0
$$ plain form
1485 1753 1836 1951 2029 2073 2146 2265 2383 2478 2580 2709 2845 2974 3122 3301 3482 3626 3732 3825 3907 3947 3917 3816 3675 3527 3380 3227
1482 3227 3067 2922 2799 2682 2557 2431 2312 2187 2058 1958 1910 1886 1837 1756 1671 1592 1514 1448 1413 1399 1376 1345 1327 1316 1286 1241 1217 1214 1194 1146
1478 1146 1099 1078 1072 1069 1071 1065 1031 992 998 1052 1092 1086 1073 1086 1087 1039 982 974 1003 1006 972 941 931 920 896 870 842 799 758 756 793 837 866 889 901 885 851 844 878 919
1473 919 929 915 906 909 923 944 959 939 883 830 816 831 840 836 839 860 886 900 898 883 862 849 864 911 970 1011 1026 1028 1028 1020 995 972 978 1006 1024 1021 1026 1059 1095 1105 1104
1468 1104 1124 1153 1153 1121 1098 1116 1164 1220 1275 1320 1336 1328 1317 1300 1254 1186 1145 1158 1188 1185 1155 1139 1154 1177 1188 1193 1203 1219 1233 1230 1195 1141 1096 1070 1034 970 912
1464 912 908 956 1006 1023 1013 983 930 866 827 839 888 936 960 963 954 944 937 927 903 869 849 858 887 909 901 870 838 829 846 870 880 873 854 824 783 739 715 726 768
1459 768 812 831 815 781 754 747 755 774 804 836 843 808 744 680 641 637 665 702 720 723 743 793 830 804 731 684 716 802 874 885 840 781 753 773 809 815 784 751
1454 751 756 794 832 839 810 771 761 792 830 842 843 873 927 957 942 922 930 940 909 854 825 833 834 810 790 802 826 822 784 745 742 777 821 843 843 845 860 867 845 815
1449H15JL1J6l2n4k4K6N1M2K0jk1l6l1qJ0Lj5j8ppk2j5K1M1J1l1k3K4L8ml5j0L1K6nrJ0Ok5
1444G90m1j9RK1K8L6K3j5m0j9K5M7K7j2m5n1k5K0M5K7j6m2l5j6jK3N7P3M6MqJ4L2Pl5m7k0
1440H67Q%l0m3j5K3K9pm6m1QN0M5Rj1%J6J8Qmj6k6j8J0K9K0oj8j7j9k8k4%K2K2OpoJ3L9M9
1435I09K6j9n2n0k6%J8K3J4krpj3l8n0k2K9N2K9NK0L9J3m5o3j7L2K9JNL4J8m6q9n6J2M4L2
1430G80J3Lrk0j9rooLJ2QjRK2Km0n1rM6O8N3J5l5p5p0j7L7M8K2qk5l2k1J1L4K6%qKRJ3K6K6
1425H27j7q2r3k2O6Q6L4k6l4NN3P0M3j3o2p4m0J2M3L3ml1k3PJ9kk4pM3P0L5l1o0k8K3M2K2
1420H60mj2nKJj2k2pK9N1K9kON0P0L6j7m8o2p1n4KN3N1J1j1jOqj6jJ1MrmJ4K4J5krLL0N2N2
1415A085L1Orj2KK5K6qn3o9m7j5lj1k8m3l9LO0Q2M9j0m4m1j5J7M3N2L8J3j1k7l1k2lJ4J3l
$$ plain form
1449 815 816 847 863 831 777 753 779 830 872 892 891 870 834 803 795 805 808 793 775 768 761 739 724 745 786 797 766 743 767 805 801 766 756 787 813 808 799 809 815 790
1444 790 749 730 739 760 788 824 847 832 792 773 798 845 872 860 815 764 739 759 804 831 815 773 738 722 721 744 801 874 920 924 916 930 962 969 934 887 867
1440 867 875 875 845 802 787 810 839 832 786 745 753 803 848 857 846 846 862 880 888 884 868 842 824 834 863 883 877 859 842 823 795 771 771 793 815 821 814 808 821 860 909
1435 909 935 916 864 814 788 788 806 829 843 841 832 825 812 774 724 702 731 783 812 817 837 876 889 844 781 764 796 825 826 831 865 883 837 748 692 704 748 780
1430 780 793 796 787 767 748 739 733 727 730 742 750 749 758 780 782 742 691 682 728 796 849 864 829 754 684 667 704 752 774 766 741 709 688 699 733 759 759 751 753 762 775 801 827
1425 827 810 728 635 613 679 765 799 773 739 744 797 867 910 897 835 761 721 733 776 809 805 774 751 758 777 775 751 744 787 857 892 861 801 773 796 838 860
1420 860 856 844 839 841 842 830 808 801 830 881 910 908 914 964 1034 1070 1053 1005 943 872 818 820 873 924 935 924 923 929 921 905 904 915 919 910 906 920 944 959 957 948 951 981 1033 1085
1415 1085 1116 1122 1113 1101 1103 1128 1154 1146 1093 1024 977 962 959 948 920 877 838 841 901 983 1032 1022 978 937 922 939 982 1034 1072 1085 1074 1047 1016 994 991 1005 1018 1015
1410A015j8j5J1L7L7K0K2N6Q1O7L8M1O5O2L4K4N2O7M8K7L0L0jl0k4%om3p2o9m2nK6J5l6q0
1406A464p2l4j7j3QL6L0qk5pOj2k3mK1J6llK0L1K8K2L3N2O3N3K5%NK5L0J9K0M9Q1R2R0P4L2
1401B204l5p4m7RK3nk3mkn1j05r6l5Nj1m1l9k7o1j22j39p3K4P8O6J9l2p8r5o3nK6J0j6pK8
1397A206L5qo9r5p0l1j1j1oJ4L2L2K1Opj3ML9N5L1pj7MK7M3M8K8j7m8l1Lkl6l2J6L4j2n6l8
1392A061J2K0k0n3m8j6J2K3Rk3l9l3k4j9J0N7P2K1l5l0POl5m3nK3J3JJ2J3j7l7nN2P6M7qn4
1387A003o1k3K6K2k8m6OO1M4k0m9l2l2n5l8L4Q2M0l1l6K2N3K1j1nJl1n8k3M2N4Ll3rL5L9J3
1383I80oj5l1m4l4j7j5qL0O6N0pl2KL8K8%lJ7K7J5j0l8n2l2J7M2K2olRok2KM1L4j9n0k9J2
1378I53L4L9M1K2j8m7l6oROJ0K6L3K5J0mrLK4K6kl7m0j1J0RPJ7J7j0l7k5J4K8%k9j7J2J3k3
$$ plain form
1410 1015 997 982 993 1030 1067 1087 1109 1165 1246 1313 1351 1392 1457 1519 1553 1577 1629 1696 1744 1771 1801 1831 1830 1800 1776 1776 1770 1727 1655 1586 1544 1539 1565 1580 1544 1464
1406 1464 1392 1358 1341 1328 1336 1372 1402 1394 1369 1362 1368 1356 1333 1329 1350 1366 1363 1360 1380 1411 1439 1461 1494 1546 1609 1662 1687 1687 1692 1717 1747 1766 1786 1835 1916 2008 2098 2172 2204
1401 2204 2169 2095 2048 2057 2080 2075 2052 2048 2046 1995 1890 1794 1759 1764 1753 1712 1673 1646 1585 1463 1324 1251 1275 1353 1419 1438 1406 1328 1233 1170 1165 1191 1201 1185 1178 1206
1397 1206 1241 1233 1164 1069 999 968 957 946 940 954 986 1018 1039 1045 1038 1025 1029 1068 1123 1154 1147 1130 1134 1161 1204 1252 1280 1263 1215 1184 1187 1185 1149 1117 1133 1167 1155 1099 1061
1392 1061 1073 1093 1073 1020 972 956 968 991 1000 977 938 905 881 862 872 929 1001 1022 987 957 964 970 935 892 887 910 923 924 936 949 932 895 890 942 1018 1065 1057 1003
1387 1003 942 919 945 967 939 893 899 960 1004 984 935 903 871 816 778 812 894 934 903 867 889 942 963 952 947 948 917 859 836 878 932 935 902 893 928 967 980
1383 980 974 959 928 884 850 833 818 810 840 906 956 949 917 919 957 985 985 982 999 1026 1041 1031 993 941 909 926 968 990 984 981 990 984 962 964 1005 1039 1020 970 941 953
1378 953 987 1026 1067 1089 1071 1024 988 982 991 997 1007 1033 1066 1091 1101 1097 1088 1091 1115 1141 1139 1102 1062 1051 1061 1070 1077 1094 1111 1101 1064 1039 1053 1081 1081 1052 1035 1047 1060 1037
1373A037m5j5M9Q7O3oo2o4j8L5N7M9K2j5m2l1RK6j7p0n7J8N6J0n1l9L4P8N6J3rpmLJ1Rpj1
1368A152QL4M6L4Jl6m8mO1P1kq8r9l5K4L4K9M5O0K6l3n2j2K4Pl1k5K0M2J6qJ3N6N9K1j6j7
1364A377MK2K3J1oj0%J4J8K1L4M5K5k2o5p4m8%M6N9K5j7j6K8N7L4jJL0M0J1l2n5m9j6K9O0
1359A603O1L6J5J5K3J1k6n5k8M4R8Q1K7MK9M9L6K3L2L6Nl2k6J2L6L2K6L1M0M6M9M1K5K4M7
1355B470O4N8M9O4P6N3K0L0O7P6N4N5Q8R8O6N3R5J36J20Q8J02J46J64J54J53J69J77J86K19
1352E350K60K65K53K80L50M02M12M30M83N40N72O18P06Q01Q53Q89R62J066J138J161J168J175
1349B0134J152J069R37P64N45K78j7l15o05q61j049j154j206j223j189j099r95r17q64q05
1346A2580p27o44n61m74l96l56l46l32k93k45k10j88j62j30r5o0l7m2o2o1j7L2M8N1P6J05
$$ plain form
1373 1037 992 977 1026 1113 1176 1170 1108 1044 1026 1061 1118 1167 1189 1174 1132 1101 1110 1136 1119 1049 992 1010 1066 1076 1025 986 1020 1098 1154 1167 1158 1151 1147 1150 1161 1170 1163 1152
1368 1152 1160 1194 1240 1274 1275 1239 1191 1187 1248 1319 1317 1229 1130 1095 1119 1153 1182 1227 1287 1313 1280 1228 1216 1240 1247 1216 1191 1211 1253 1269 1261 1274 1330 1389 1410 1394 1377
1364 1377 1381 1403 1426 1437 1431 1421 1421 1435 1453 1474 1508 1553 1578 1556 1491 1417 1369 1369 1415 1474 1499 1482 1466 1494 1551 1585 1584 1585 1615 1655 1666 1634 1579 1530 1514 1543 1603
1359 1603 1664 1700 1715 1730 1753 1764 1738 1683 1655 1699 1797 1878 1905 1909 1938 1987 2023 2046 2078 2114 2119 2087 2061 2073 2109 2141 2167 2198 2238 2284 2333 2374 2399 2423 2470
1355 2470 2534 2592 2641 2705 2781 2834 2854 2884 2951 3027 3081 3136 3224 3322 3388 3441 3536 3672 3792 3880 3982 4128 4292 4446 4599 4768 4945 5131 5350
1352 5350 5610 5875 6128 6408 6758 7160 7572 8002 8485 9025 9597 10215 10921 11722 12575 13464 14426 15492 16630 17791 18959 20134
1349 20134 21286 22355 23292 24056 24601 24879 24862 24547 23942 23081 22032 20878 19672 18449 17260 16161 15166 14249 13385 12580
1346 12580 11853 11209 10648 10174 9778 9422 9076 8744 8451 8206 7996 7808 7646 7516 7421 7361 7324 7282 7220 7159 7142 7174 7222 7273 7349 7454
1343G454R2N1N6J19J58J16M9N9J32J77J53J24J48J91K08K01K18K57K96L27L59L78L64L35L38
1340A2360L79M23M52M94N70O51O96P05P14P44P94Q63R52J061J177J289J392J490J603J738
1338C0547J892K060K254K485K725K929L092L255L436L581L647L659L673L672L600L471L387
1336H3365L391L433L451L484L589L729L820L838L823L775L610L277K854K479K225K083K012
1334A38238J994K021K059K055J956J718J316P45L7p35j462k046k433k633k682k620k493k360
1331A32675k276k293k451k760l169l571l869m027m076m055l975l839l662l478l327l243l247
1329G5357l331l463l589l671l689l639l522l347l131k912k705k499k283k072j904j783j671
1327B6146j537j391j261j154j060r75r05q46p83p24o77o34n75n12m70m59m45m07l63l42l48
$$ plain form
1343 7454 7546 7597 7653 7772 7930 8046 8095 8154 8286 8463 8616 8740 8888 9079 9287 9488 9706 9963 10259 10586 10945 11323 11687 12022 12360
1340 12360 12739 13162 13614 14108 14678 15329 16025 16730 17444 18188 18982 19845 20797 21858 23035 24324 25716 27206 28809 30547
1338 30547 32439 34499 36753 39238 41963 44892 47984 51239 54675 58256 61903 65562 69235 72907 76507 79978 83365
1336 83365 86756 90189 93640 97124 100713 104442 108262 112100 115923 119698 123308 126585 129439 131918 134143 136226 138238
1334 138238 140232 142253 144312 146367 148323 150041 151357 152102 152139 151404 149942 147896 145463 142830 140148 137528 135035 132675
1331 132675 130399 128106 125655 122895 119726 116155 112286 108259 104183 100128 96153 92314 88652 85174 81847 78604 75357
1329 75357 72026 68563 64974 61303 57614 53975 50453 47106 43975 41063 38358 35859 33576 31504 29600 27817 26146
1327 26146 24609 23218 21957 20803 19743 18768 17863 17017 16234 15510 14833 14199 13624 13112 12642 12183 11738 11331 10968 10626 10278
1325A0278l51l38l10k81k56k35k19k13k21k37k43k16j65j17r9j15j54j91j99j66j20j04j27
1322E601j43j29j10j26j51j37p7l1m1q7j23j24r7o2m5n3p1p7p3p1o7m8l8o4j08j09n8j2j7
1318C252l9k9nql6n2n2n3n8m4j9j4l3n1n1m0j9LKl9p6n9j5ok7j6L1L5k6p0l2K7K4j5j7J0L
1314B386k8l0kj5o7p7j9K5j6q9j03n6j6j2j4kJ3K4K9K3mk9j6K0K9rm8m0JJ9ml1k2RJ3k6o5
1309A751o0k2Llk0k6k2nJ8K0j8o4n2J6O8N0%k2j5j5k9k6jK0K1Roj8k1j4j6l4l4OM8M1ql5k2
1304A463j0k8m2k3J1K7K4J8%l2n3l4QK6Jl4l9rL8O0M4Rj2j9l0l9j6K9M5Ql2l1j5k8m5j6M8
1300A272P2L1j9k3JJ6J3Nmj4rJ6L6K9Jj7j9j6qNJ2PQL5P2Q3M7j0m2l0J5O5R2Q9P7Q2J03J11
1295B184Q9N3M2O3Q2O3J6j1QL8K7l5j07j38j12n5j4k1o2q2n8l2n1r7r3l2J5j0o4p4m5l1m7
$$ plain form
1325 10278 9927 9589 9279 8998 8742 8507 8288 8075 7854 7617 7374 7158 6993 6876 6777 6662 6508 6317 6118 5952 5832 5728 5601
1322 5601 5458 5329 5219 5093 4942 4805 4728 4697 4656 4569 4446 4322 4225 4163 4118 4065 3994 3917 3844 3773 3706 3658 3620 3556 3448 3339 3281 3269 3252
1318 3252 3213 3184 3179 3171 3135 3083 3031 2978 2920 2876 2857 2843 2810 2759 2708 2668 2649 2652 2654 2615 2539 2480 2465 2459 2432 2416 2447 2482 2456 2386 2354 2381 2405 2390 2373 2383 2386
1314 2386 2358 2328 2326 2311 2244 2167 2148 2173 2157 2068 1965 1909 1893 1881 1867 1865 1878 1902 1931 1954 1950 1921 1905 1925 1954 1945 1897 1857 1858 1877 1873 1842 1820 1829 1842 1816 1751
1309 1751 1691 1669 1672 1669 1649 1623 1601 1596 1614 1634 1616 1552 1500 1516 1584 1634 1634 1612 1597 1582 1553 1527 1526 1546 1567 1576 1570 1552 1531 1517 1501 1467 1433 1439 1487 1528 1520 1485 1463
1304 1463 1453 1425 1383 1360 1371 1398 1422 1440 1440 1408 1355 1321 1329 1355 1356 1322 1283 1274 1312 1372 1416 1425 1413 1394 1364 1325 1309 1338 1383 1391 1359 1328 1313 1285 1240 1224 1272
1300 1272 1344 1375 1356 1333 1334 1350 1363 1368 1364 1350 1341 1357 1393 1422 1423 1406 1387 1371 1363 1368 1380 1387 1395 1430 1502 1585 1632 1622 1580 1550 1565 1630 1722 1811 1888 1970 2073 2184
1295 2184 2273 2326 2368 2431 2513 2576 2592 2581 2589 2627 2654 2619 2512 2374 2262 2207 2193 2172 2110 2028 1970 1938 1887 1790 1697 1665 1680 1670 1606 1532 1487 1456 1409
1291A409n5l5pJ1K3K1j0n3n3NN8M2k2o5n1j3J2J0lj0mJ2K6K4Oj8l6m1k7jK5L3K1kk7n0n7m8
1287A050l0pJ6K1kl3l3kJ5rl5j5K6L7PrJ0K9J4j4k4k1k9l5k2OK7L0J6j1l8m1nL2L3Mj4rpk2
1282I06l3k0KOlKK5M6M2J8nrjOkj8k2jK3J7l0p6p5k8J7K6J8L4N5M4nl7k4MOmRL5L3Kj4lJk7
1276I40o2o4l1MK4L0K5Nj0lJ3Qj5k6oK6M1L3J6%mJQPOJ7L4K6j3m7l5MJ8j1l8k5J2L0K8L1L5
1271A032Rm1o4l3K0L9J9mnNJ5K3L2M4N4N7M0Nl3n0m8l5qM0Q4Q9N0J7J6K9K9K3K5L2M0N4P6
1267A677Q6O6L5K1K5L3M9P7R8Q8O8P0Q3O6K6MJ9L0K4K3L5J4n1r8p6k4k4p0r1p3n9o9n9j5J1
1263B019k4p9q5m3pkj4k6m2n0m2l0l0l6k5lLrj3lMlj1j9l5l9j0M0N3J0l3k6PJ1k0m3m2l9m2
1258A222l3j1%j3j9jK0J4rk4k9l2l6l1j3PJ7Rj3l7m2k3MK4K4Kk3l8l1rJ1K6L4K5jl2m3k6k
$$ plain form
1291 1409 1354 1319 1312 1323 1346 1367 1357 1304 1251 1256 1314 1356 1334 1269 1218 1205 1217 1227 1224 1214 1210 1222 1248 1272 1278 1260 1224 1183 1156 1155 1180 1213 1234 1232 1205 1155 1098 1050
1287 1050 1020 1013 1029 1050 1048 1015 982 980 995 986 951 936 962 999 1006 997 1007 1036 1050 1036 1012 991 962 927 905 911 938 968 984 973 935 894 889 921 954 958 944 935 928 906
1282 906 873 853 855 861 858 860 885 931 973 991 986 977 976 982 980 962 940 939 962 979 949 873 798 770 787 813 831 865 920 964 959 922 898 902 908 904 913 948 981 983 969 966 967 940
1276 940 878 814 783 787 811 841 866 871 861 858 871 879 864 838 832 858 899 932 948 948 944 945 953 960 966 983 1017 1043 1030 983 948 952 970 959 921 896 908 938 966 997 1032
1271 1032 1041 1000 936 903 923 962 981 977 972 977 992 1015 1047 1091 1145 1202 1242 1247 1214 1164 1116 1081 1073 1113 1197 1286 1336 1353 1369 1398 1427 1450 1475 1507 1547 1601 1677
1267 1677 1763 1829 1864 1885 1910 1943 1992 2069 2167 2255 2323 2393 2476 2542 2568 2572 2591 2621 2645 2668 2703 2717 2666 2568 2492 2468 2444 2374 2283 2210 2151 2082 2023 2008 2019
1263 2019 1995 1916 1831 1788 1781 1779 1765 1739 1697 1647 1605 1575 1545 1509 1484 1481 1484 1475 1462 1459 1463 1460 1449 1430 1395 1356 1346 1386 1439 1449 1416 1390 1397 1408 1388 1345 1303 1264 1222
1258 1222 1189 1178 1178 1165 1146 1145 1165 1179 1170 1146 1117 1085 1049 1018 1005 1012 1029 1038 1025 988 946 923 927 951 975 977 954 916 885 876 887 913 947 972 971 939 896 870 868
1253H68J0%k0l0j2K5M0Pm3o1m4l1l0oL6M6kn4m1J9N6M4J5jj6l0k3J4M6L9%l8m7l2j0OJ2J3
1248G25J5J4J2J6K4J6j1l9m5l3j9JK8M0J5k7l7lL4M0J6j8m1l5jL0J8k5m9k8J1K8K1%k7m2k4
1244F00K2M9K9npJ4K1Jj5j4qj0j3pJ9M8M9Rm0m1PL2jl3oL1Lo2n6L2Q1J7p4p6jM4K9J1K5L3
1239G37J5KJ5J8j2l7k0Plk8rM7N3j9r2q2j1K3kk5KM1K8j9m0j2K6L3K3J8J7Jk0j9PL0L3K8L3
1234G87L5J5k7o7q1o1j5K8L8J2j9k6j8j6j2J6M5L3j2k7J0M1J6k9k8J2K3nk3%K3J1oLJ7Kk5
1230F70k3J0L6L0Jl1m9m3pL7N9M8K2ONPpl1m4k6LJ0lJK6L0pm1l0QL2L5L2J3k9n9l9MJ7rk1
1225F43nQMOK6K7jk0lK1J6pk0j4nJ0K7K8J9K2L7J9m2q2m1L3N0Oj9J2L7Jn3n3oK3J3%J0K0O
1220G53j8k6j9j4qJ4K7Mm3n4oM1L0k0l4kK5Nk5j7J5K5Mj0%J6Ll4n3k5K8N2L2NNJ3pl8l0J6
$$ plain form
1253 868 878 878 858 828 816 841 881 888 845 784 740 709 679 673 709 755 753 699 658 677 733 777 792 791 775 745 722 736 782 821 821 783 736 704 694 700 712 725
1248 725 740 754 766 782 806 822 811 772 727 694 675 676 704 744 759 732 695 692 726 766 782 764 723 688 687 717 735 710 661 633 644 672 693 693 666 624 600
1244 600 622 671 700 695 688 702 723 724 709 695 687 677 664 657 676 724 773 782 742 701 708 740 739 706 700 731 734 672 616 648 729 746 672 596 595 639 668 679 704 737
1239 737 752 754 769 787 775 738 718 725 722 694 685 732 785 766 674 592 581 604 602 577 579 620 648 629 589 577 603 636 659 677 694 695 675 656 663 693 726 754 787
1234 787 822 837 810 743 662 601 586 614 652 664 645 619 601 585 573 589 634 667 655 628 638 679 695 666 638 650 673 668 645 645 668 679 673 676 693 695 670
1230 670 647 657 693 723 724 693 644 601 594 631 690 738 760 766 771 778 771 740 696 670 673 683 680 681 707 737 730 689 659 667 699 734 766 779 750 691 652 656 673 664 643
1225 643 638 646 650 656 682 709 708 688 685 706 722 715 695 681 676 686 713 741 760 782 819 838 796 714 673 706 756 762 743 755 792 793 740 687 681 704 717 717 727 747 753
1220 753 735 709 690 676 668 682 709 713 670 616 610 651 681 661 627 625 650 655 630 613 628 653 657 647 647 663 666 632 579 554 582 634 666 671 676 689 682 644 614 630
1215F30M3K4oj5j4k0qL5O2L1k7n2k8pj1j7nJ0J3J0J2J8J7Mk2m2l4kJ6Jk3j9JJj6j3K1M6M2
1210F56K5K2L0L0J6pk7k7oPj2m1l6NM2M4K1ql4l8jN1N8Lo1p8m6jL8N2K3l1n3j9K7L0MoJj3
1205F40m0m1nK4J9J1K4L8K2oj4KJ3RJJLLQJ2Rqj7oRPrj8p%j0l0l4k0lJ0J5J6J8L2M7L3j6n4
1200F88m1MJ9nk0kK0K2K1K6J3k6m6j2L9M4jm5m9l0nJ6K9K7J4Lj7m7n6j7L8N1J4j8nL0M7L9
1195G62K0nk5k8j8k3m2k9K8O5K7m3n3OM7J9l1l4njj8pL5N3K0j6j8rk8l9%N8O2Jn3n1k6k2k4
1190E55NM1M0Mj9pJ8K8K8K2J3Onk5n0n6k0K5L9K1PJ7L1K3%k0k5qJ5Ql6p1m1L6P9N0lk0j1r
1185F85j9j8mOLm%J3K4J8j5n1n0j1L3M8L4J7JojRMj2j1J4L0J0k6m0k9j9j3o%JJ0K0J3j1j6
1180F31K1N6L7j8m7l5j7j1RM0L9j0o0o5l1jRPjpjJ0J2OJ7L8L1k0o3m9LL2J7njK5N1N8L8Mk7
$$ plain form
1215 630 673 697 691 676 662 642 634 669 731 762 735 683 655 648 637 620 615 625 638 648 660 678 695 699 677 635 601 599 615 616 593 574 575 576 560 547 568 614 656
1210 656 681 703 733 763 779 772 745 718 712 719 707 666 630 635 677 721 742 734 700 662 661 712 770 773 712 634 588 587 625 677 700 669 616 597 624 654 658 652 653 640
1205 640 600 559 554 578 597 608 632 670 692 686 672 674 687 696 697 698 701 704 712 724 733 725 708 702 711 718 709 691 684 684 674 644 610 590 587 597 612 628 646 678 725 758 742 688
1200 688 647 651 670 665 645 643 663 685 706 732 745 719 673 661 700 744 743 698 649 619 614 630 659 686 700 703 686 639 583 566 604 655 669 651 646 676 723 762
1195 762 782 777 752 724 706 683 641 612 640 705 732 689 636 642 689 708 677 643 638 637 619 612 647 700 720 704 686 677 649 610 610 668 730 731 678 627 601 579 555
1190 555 560 601 641 645 626 619 637 665 693 715 728 734 729 704 654 598 578 603 642 663 670 687 718 741 741 721 696 688 703 711 675 604 563 599 678 728 725 705 694 685
1185 685 666 648 644 650 653 649 649 662 686 704 689 638 588 577 610 658 692 709 710 704 703 712 716 704 693 707 737 747 721 681 652 633 620 614 614 615 625 645 658 647 631
1180 631 652 708 745 727 680 645 628 617 626 666 705 695 635 570 539 538 547 554 553 546 545 555 567 573 590 628 659 639 576 527 530 562 579 574 573 598 649 707 745 749 722
1175G22l2k2j3qLK1L2J9qk4j6QJ8Qqj3j5k8l2qL0K3l7q4o0J3N3K8k1l8j2K9N0L2lj3J4L8K4
1171F70j6l4k4j1pNJ7%l6l8J3N9M5rm0k0J6L5K4mk1mK2J5k9m8nN1M8%j3K7N0J7k6k5%kk7l1
1166F44kL0M5M8L7Ll9n6m0j5PL0M2K0k5m7k8qj3k5pK6L1Nj5nJ0Ooq%LLOJ0QLKMQJ4J6km4q0
1160E96o4%N7O0K0j0qO%j3kL1N5M3J5mj0k3m1m4j8J2J2j4l0j8OJ2mrJ1M6N7L0j8n1n1l1pJ4
1155F13K6J7qk5j3J0J7J1K1L9K9qj6K4M8Po5q6m1J0L1L5L7K9J3PPj3m0l3J0L5J7kLjl3m2J1
1151F81O7M9j0k4Kj0p3r6m0K9L8J3QK2K3J6J9J8ql3k5kj0l6l3%J8Kj2OL7M1J7nj3j0qqoNJ0
1146F59nm0o5n3j1L4O0N7K8j3l6k8pJ5K9L4J1l0l8PN6M5rl6j9nk1k9JL3K6mrJ4K9J5rk3k5
1141F38k0pMmk4l3jN5Q9O4po9p1k7J8K7J3%JJ4J9Oj9k3OL1Qm8p2l9J4M6N8O3M1pm5l5mOlm
$$ plain form
1175 722 690 668 655 647 650 671 703 722 714 690 674 682 700 708 700 687 672 644 612 604 634 657 620 536 476 489 542 570 549 511 499 528 578 610 607 594 608 646 670
1171 670 654 620 596 585 578 583 600 600 564 526 539 598 643 634 594 574 590 625 649 645 624 620 642 657 628 580 575 626 674 674 661 688 738 755 729 704 704 702 675 644
1166 644 642 672 717 765 802 805 766 710 670 655 662 692 734 754 729 682 654 646 633 608 601 627 658 663 648 643 653 659 653 645 645 648 651 657 667 675 678 680 684 692 706 722 720 676 596
1160 596 532 532 589 649 669 659 651 657 657 644 642 673 728 771 786 782 772 749 708 664 646 658 670 656 626 608 614 626 622 613 624 670 727 757 739 688 637 606 599 613
1155 613 639 656 648 623 610 620 637 648 669 708 737 729 713 737 785 792 727 641 600 610 641 676 713 742 755 762 769 756 716 683 693 728 745 743 746 745 712 670 681
1151 681 748 797 787 763 765 755 682 586 546 575 613 626 634 656 679 695 714 732 724 691 666 664 654 618 585 585 603 605 593 599 636 677 694 689 676 666 658 650 644 649 659
1146 659 654 614 549 496 485 519 579 636 664 651 615 587 580 595 624 658 669 639 601 608 664 709 700 664 645 640 619 590 591 624 650 646 637 651 680 695 686 663 638
1141 638 618 611 615 611 587 554 553 608 697 761 754 685 614 587 605 632 645 645 646 660 679 685 666 643 649 680 688 640 568 529 543 589 647 710 751 744 699 664 660 666 663 659
1136F59J4K4J5jj4l0l4k2nqj7%L7M6Rl7m3j2J9L4L3J8j8m9m5mL0K2rj1L6P8N4k1o0k1L3K3
1131G23l6n3oL6J4k7j5M3O9K0n1p2l1J5K4LqLJ0lj3QM1L6j5n9n1j7lpOL5L9J2oJ5L8K4j9m2
1126F80k6PL2M2K4k3p4p6j8L9M0OmK3L5mn1n3j5J6J5NPJ2J1J3J9J9J0%ok2m3m6j7J5J1roK3
1121F11K8lk8rJ8jl9l3J8M8K6RL4N7L2qj3nl4o8m5J3K3k5m3PM3Rl7k5J7K1MJ3L8L0NQK0j8
1116F98p6o5J7O7K9l2l8j3lmPJ3ok7k2j7l2l4J2O4N8Mk8j9j0j6mK6L7Ol0k5PK3kl8m8j6K8
1112D91L6ll6j3M1O9M9J3rj3jK4L4Ql7m7j3J9K5K8L9K8k2o5n9j6K0L7M3K5k1o2o0l1j8j5J6
1107E04O0O2K0%K8N0J2m4n1j7ok3j8K1M2J1j8QO1O8Qo2q4o0k7mJ6K9K3jk2j7NK3K8M3O9O2
1102G99lp9q2lP1O5J1j9j6j8k2nJ9Kn1o9k2K5J8j4j4RJ2kkJ1RnML8M9J4l1m2j9K%k0l6k8l
$$ plain form
1136 659 673 697 712 711 697 667 633 611 606 598 581 581 618 664 673 636 593 581 600 634 667 685 667 618 573 569 599 621 612 601 637 715 769 748 688 667 700 723
1131 723 687 634 628 664 678 651 636 679 748 768 717 645 614 629 653 656 648 651 661 658 645 653 694 730 715 656 605 588 585 578 584 619 658 670 664 679 717 741 722 680
1126 680 654 661 693 735 759 736 662 586 568 607 647 653 649 672 707 703 652 599 584 600 615 620 627 639 650 663 682 701 711 711 705 683 640 594 577 592 603 594 588 611
1121 611 639 636 608 599 617 616 577 544 562 610 636 645 679 736 768 760 747 742 708 640 595 608 631 606 563 570 613 622 585 560 577 598 602 615 653 683 688 696 716 698
1116 698 622 557 574 641 670 638 600 587 584 580 587 600 594 567 545 528 496 462 474 538 596 600 572 553 543 527 523 549 586 592 562 537 544 567 565 527 479 463 491
1112 491 527 524 488 475 516 585 634 647 638 625 624 648 682 690 653 606 593 612 637 665 704 732 710 645 586 570 590 627 670 695 674 612 552 521 503 488 504
1107 504 564 626 646 646 674 724 736 692 641 624 618 595 577 598 640 651 633 641 702 770 778 716 632 572 545 541 557 586 609 608 586 569 574 597 625 668 737 799
1102 799 796 717 635 632 703 768 779 760 744 726 704 699 718 720 669 600 578 603 621 607 593 602 614 612 610 621 630 625 629 667 716 730 699 657 638 640 640 620 584 556 553
1097E53J4Lj3lK1J8rj6J7M8L6nk2pJ2J6Qnk2l9m5l7k8k5j5QL1L1Pj0OM1N9M2Mk4l9l8j4K0
1092E79L2RrJ4N0M4ol8k3MLj0nKj7m2l2J2N6O8N6J8l5p2n7oK7J7oj0j0k3l2j0K9N4M6K2QO
1088G13J1J5J8J0qk1j8nMlj1j2j7l0l3lL3K1m7j03p5QN4L0mJ3O1O8K4k1k4npl3n0l1PL5L9
1083F03K3Nnjjj8m6m9j9J2J9J2J7K3%m1m7jN5P0M2Mj6k2j7j0n%J0K3J8JjJ9L9L2K3K6K4j6
1078G85p2q6m7mJk1k1J3N1N2Rl6m0lK8J7j9l1j0J3K1J5Lrj4kJ4J2j1k7k0MK2K7J9Mj0k6l3
1073E68k1RL4K0j3j1L8P1L8k1m0k3k3m9m7jL9M7L7K4j1n3m9QN1K9k9o2o0l2J5O2O3J2j8J8
1069F20O2M0k0l7rKk2k3J0K1j4m6l9j6j0j0OK3K2J5K2K8J7kj4j1LJ7K4J4JJ3L6K8j7n3m0k
1064F39J3lk0k1qNJ4J1OJ1J5Jk1j3J8K4j6m5j8L6N3L5K2K2Jl1l5pJ1Lqj3l4o8o4pM7M7K4K2
$$ plain form
1097 553 567 570 557 554 575 593 584 568 585 633 669 664 642 635 647 663 671 666 644 605 560 523 495 470 455 463 494 525 532 522 528 569 628 670 674 650 611 573 559 579
1092 579 611 620 611 625 675 719 713 675 652 656 659 649 644 646 629 587 555 567 623 691 747 765 730 658 601 595 622 639 633 623 613 590 558 548 577 631 677 699 707 713
1088 713 724 739 757 767 759 738 720 715 719 716 705 693 676 646 613 610 643 664 617 514 439 447 501 531 527 540 601 669 693 672 648 643 636 603 553 522 529 564 603
1083 603 626 631 626 625 624 606 560 511 492 504 523 535 552 575 575 534 487 486 541 611 653 657 641 619 602 592 587 587 597 620 638 639 638 657 696 728 751 777 801 785
1078 785 713 627 580 576 577 556 535 548 599 651 660 624 584 581 609 626 607 576 566 579 600 615 618 609 595 593 607 619 608 581 561 565 587 614 633 637 627 601 568
1073 568 547 556 590 610 597 586 624 695 733 712 672 649 626 577 530 529 568 615 652 676 665 612 563 571 622 651 622 560 500 468 483 545 608 620 602 620
1069 620 682 722 702 665 656 658 636 613 623 644 630 584 545 529 519 509 515 538 560 575 597 625 642 640 626 615 618 635 659 673 674 687 723 751 734 681 641 639
1064 639 652 649 629 608 600 605 619 630 636 647 662 663 642 629 647 671 655 610 592 628 681 716 738 760 761 730 695 688 699 702 694 681 647 579 515 508 555 602 626 648
1059F48L3K0j1k2k0l5n8l2L8Q0M6qoK8K3l3o1k3K9L4J1J5L5K6k2m6j8K1J7k1l9k4lqk6l3k0
1055E35LJ4Qj4k9j7J3L7L7K0Mnj7l3l6mM4N8J7l4l9jJ9jk2rRj0m1k7K6N4K2k9l8JM2N5L6P
1050F55j3j4pj4l5m7l4j0QK5M3M8K7mk0j1MJ3J0ok5k0J1L7K5k0n3m9j5J7L3K7J2QJ8K4J1j2
1045F47j2RJ5j4m9m7j1J4QjJ5L8K7j0k9mL3M2K6J7J7Rj2l3m7n2l1J3M2J9k6k9J4L8J2j4RM5
1041F88L7j0m3m0k6j9j3nOK5L5J1n0q3m0L6N7J3k9k3LJ3J4J7Qqj2MK3K9K7J2k5n3l9orl1n
1036D89O6Q9K4m0k9J6K1%nj8o3q3j7O5N6j6l1L4O7K2k5j9pl1m3nL7L4J3J5K0%j2J1K9Jl3k2
1031F10Qpm3l5J4L3QnJ5K0rk5JL3K4lnJ6J9jk1k0j3j3j2oPJ7J8RJKPlk9m6l1RL6K8Nmmk2m9
1026E34l7K6P7N6qk8QL1Jl6l1pOJ2K6K5j3m9l4K1N8N6K8rm1m6j6J1ml7l8nL0N3O3L6k8o2j8
$$ plain form
1059 648 681 701 690 668 648 613 555 523 561 641 687 679 673 701 724 691 630 607 636 670 681 696 731 757 735 689 671 692 709 688 649 625 622 614 588 555 535
1055 535 538 552 560 546 517 500 513 550 587 607 611 606 589 556 520 516 560 618 635 601 562 561 580 579 557 548 557 547 506 479 505 559 581 552 514 515 557 612 648 655
1050 655 642 628 621 607 572 525 491 481 489 514 557 605 632 628 608 597 601 614 624 618 593 573 584 621 646 626 573 524 509 526 559 586 598 606 624 648 659 647
1045 647 635 644 659 645 596 549 538 552 560 559 574 612 639 629 600 596 629 671 697 714 731 740 728 695 648 596 565 578 620 639 613 584 598 636 648 634 643 688
1041 688 725 715 672 632 606 587 574 569 575 600 635 646 596 513 473 509 566 579 550 527 530 543 557 574 582 574 562 566 589 618 645 657 632 579 540 534 525 494 489
1036 489 555 644 668 628 599 615 636 636 631 613 550 467 450 515 571 555 524 558 625 647 622 603 596 565 522 517 554 588 601 616 636 636 624 635 664 665 632 610
1031 610 618 611 568 533 547 580 588 583 598 618 609 584 585 618 642 639 634 650 669 668 647 627 614 601 589 583 590 607 625 634 635 637 644 641 612 566 535 544 580 608 613 609 605 583 534
1026 534 497 523 600 656 648 620 628 659 660 624 593 586 592 604 630 655 642 593 559 580 638 694 722 713 672 626 610 621 617 580 542 537 567 620 683 719 691 629 611
1021F11M2L1l2m7rkl7k9L9P3K6rK8N4j2r2p1K0M8Mj7J9L3j0m2j5K6K9K0L1L8J2k0k1nj4l6
1016F64l4oJ1KqJK5L6K5Q%J1K5L2J9j2n6q5p2k0K4K8J1J6L9M2Om3p3o8k7K4N2L7J8K8M9K2
1012G51m4q1n2jJ1j6l8l6j1K6O5P5M3pl9m1l0j5RL5M1K5jj4j5%K3M0L2qm9n3j2L2K7k1n0j7
1007E84L3L1k0n0j9J8%m6n0lL1J2j7jM7P1M7J2JRNj3k1qPNjKJ1Roj9j7rjKRJ8K4J8lk8l3j9
1002F22pj6l3l4j3J8L8M0J8j1k7j8mKOK3L6K6J1K3M5K7l6q7p5j7K8L1J0nJK1K8Nk5k6nj1m7
997E62n1J3R7J11M7k1l5j0ROqk2l0k4JK0Qk5m0j2L2M5K1mmkj0k0rOOLJ4J7j5n3n0j1J1jqR
992E73J6j0l4k9k1k0JN4Q4N0kj2J6L2K7J3j5n6o4j1M9M6qm3l8k1JL6N1Ql9j8M4M5k5n8j1L1
987F42Ll5j7J8Pk1KM8L9j2l1JJ1k4n1k3K3K6j5m9l0L6R6Q6Qo0m9KOm8q0l4M0O6M3K5K3Nm0
$$ plain form
1021 611 653 684 652 605 596 594 557 528 567 640 666 657 685 739 727 635 564 584 632 636 619 638 671 661 619 604 630 659 679 710 748 760 740 719 714 700 664
1016 664 630 624 635 637 629 630 655 691 716 724 724 735 760 792 811 799 743 658 586 566 590 618 629 645 684 726 732 689 616 548 521 545 597 634 652 680 729 751
1012 751 707 626 574 573 584 568 530 494 483 509 574 649 692 685 646 605 575 560 569 604 645 670 669 655 640 640 663 703 735 727 678 625 613 645 672 651 601 584
1007 584 617 648 628 578 559 577 577 531 481 478 509 521 504 503 550 621 668 680 681 690 695 682 661 653 660 665 664 666 677 686 680 661 644 635 634 636 645 663 687 705 702 674 641 622
1002 622 615 599 566 532 519 537 575 615 633 622 595 577 573 575 581 604 640 666 677 700 745 772 736 649 574 557 585 616 626 621 622 643 671 676 651 625 620 609 562
997 562 511 524 621 732 779 758 723 713 722 728 720 698 668 644 645 665 673 648 608 596 628 673 694 690 686 684 674 654 645 651 657 660 674 691 676 623 573 562 573 572 564 573
992 573 589 579 545 516 495 475 476 530 614 664 662 650 666 698 725 738 723 667 603 592 641 687 679 636 598 577 578 614 665 673 634 616 660 705 680 622 611 642
987 642 645 610 593 611 618 597 599 647 686 674 643 644 655 631 580 557 580 606 591 542 512 548 644 730 738 678 629 631 637 589 509 475 515 581 624 649 672 677 637
982F37o8m2J4M4K1j1rK0K9Lj0K0N3L0m3q8n8J6O7O1J7k9m3j6K3M0K1nj8k4l5m6m8l1ON1P6
978F25M9j1m8l5nKpML0L9K5J3J3jk9l9j1J8J4rj3lmrQL4K4j3k5QL1J0j8j0J4J1r%K6K1j5l2
973F73j0Nnj5nLkLK1J3l4o3k7L2L5j4m1rM1N7K9j5m9m5oL7M7K5jj3j8j9j3j1j8k7j7J2K9K2
968F07RQK3M0M1K1j3m4n7n2l3LL8L5mk9qK2J3j7j5K6M5J5k4l8k7j6mQJ1QJ4L2M0K9J4Lj5l2
963F77j9K2N0L8J2JKj0k4k8k0mRLl5p1n5J4O5M8ml0j5QK4K7J4oNM4N2jn5l7K4L4k4o5l5K0
958F55M4M4M6M7K7PJ1K6K4J0Jj0l3m4qN3O7J5m6n3j2J6J2NJ4J2l0q0q0k7J5jm5n8k8J4L6M0
953F86K8Pj5k7k5j8j1n%kl%RJ6K6L7M0K4Lqj3k3l5l8l9m4m2j1L4N7M7K5Pj2k8l1j6kOJ1J5
948F30Oj0j2qk4n2m6RN3L9jnK5K9ol6k2J5L2J6qj6qQJ5J0MRJ5Kk5l8k6j0nLK8N8O0K6j5l1
$$ plain form
982 637 569 527 541 585 606 595 586 606 635 638 628 648 701 731 688 600 542 558 625 686 703 674 631 615 638 678 699 694 676 652 617 571 523 492 498 549 625
978 625 674 663 615 580 575 577 570 574 604 643 668 681 694 693 664 625 614 632 646 637 624 621 617 608 616 650 674 661 636 644 675 685 667 657 671 682 673 673 699 720 705 673
973 673 663 668 663 648 643 646 644 647 668 681 647 584 557 589 624 610 569 560 601 658 687 672 623 578 572 609 656 681 680 667 649 630 617 606 588 561 544 556 585 607
968 607 616 624 647 687 728 749 736 692 635 583 550 553 591 626 622 593 585 607 620 603 588 614 659 674 650 612 585 569 565 573 584 592 606 638 678 707 721 724 709 677
963 677 658 680 730 768 780 781 783 773 749 721 701 697 706 709 674 603 548 562 627 675 671 641 626 634 658 685 699 693 698 742 794 793 738 701 725 759 735 670 635 655
958 655 699 743 789 836 863 870 881 907 931 941 942 932 899 855 847 900 967 982 936 883 871 887 899 904 918 930 900 820 740 713 728 727 682 624 596 610 646 686
953 686 714 721 706 679 654 636 625 620 620 618 615 615 624 640 666 703 743 767 770 762 749 726 691 653 614 570 528 517 551 608 655 680 687 675 647 616 600 598 604 615 630
948 630 636 626 614 606 582 530 484 493 546 585 584 579 604 633 627 591 569 584 616 632 624 608 600 608 623 633 637 646 661 663 638 600 574 564 559 562 590 648 708 734 719 688
943F88j9j3k5l9k6KJ8J4J4K9L4Rj7j1J0Pl0n9m2NM0L9J3j2j4OK5J4k1m6l6qJ1J3Omj7k1pJ6
938E46L0K1LlJLmj1%K2K1j8o6p0k3L0M8K6ok9l2j1J8K9Ok1oM7Q4O1pn7n5j6J4K1J6J9K0Oj9
933F38k7qOpk5nL5M5J3j5kK6K3lj5oKNJ4J6j6o2o7j7K9K7kpPJk4l2mK5K9J8J4J4Oj5l3k8q
928E65Qll0l1NM2M7K7K1K6J2j9k9kK5J7qj7j0qj4pRNk0l2nL9N4J9l3n5k7J9M4L5J4pk5l9l5
923E77j2Ojk4m2l5oK7L9K8J9L4N2L5j2m0k4NPkJll3o2l7K3N1K2KL5Q0O8Jm8l7KJ6rm1n3m5
918E64l5k3pJ5L1L9L5J8j0l6l2JK9K1j0l0k3LL6O1O0K6j0k1j0mj1j3mNMjj5m5n8k3L7O0L3
913F57%jMj4l5l0rMMNpl0m3j7K4M8N0M6L5J3lLJ1OLJ2Ql0o6n4k2j8k4J5P7Q1J7l5l1k0m6n9
908E29j7L9M4J4kkk1m1k5J7L1J0lPJ4OLQlk3k3OK0Nj2pNKnnmlJ1L5K7k4p3o2pL3L5K3J9J1
$$ plain form
943 688 669 656 631 592 566 568 586 600 614 643 677 686 669 658 668 675 645 586 544 549 589 628 641 629 615 621 646 660 639 593 557 549 560 573 579 575 558 537 530 546
938 546 576 597 600 597 598 601 597 586 586 608 629 611 545 475 452 482 530 556 550 521 489 478 496 525 531 510 504 551 635 696 689 632 577 561 575 596 612 631 651 657 638
933 638 611 603 609 602 577 572 607 652 665 650 648 674 697 694 679 673 675 680 694 710 694 632 565 548 577 604 602 595 602 603 579 547 543 568 597 615 629 643 649 634 601 573 565
928 565 573 570 540 509 514 556 603 630 651 677 689 670 641 639 664 681 673 656 646 638 624 617 626 631 611 579 574 613 667 686 653 598 571 590 634 669 683 676 651 612 577
923 577 565 571 570 546 504 469 463 490 529 557 576 610 662 697 685 645 621 626 633 631 632 629 596 534 497 520 571 593 595 630 710 778 779 731 694 696 712 703 662 609 564
918 564 529 506 499 514 545 584 619 637 627 591 559 560 589 610 600 570 547 550 586 647 707 733 723 702 692 688 677 664 660 665 669 668 653 608 550 527 564 624 657
913 657 657 656 660 646 611 581 572 576 580 585 578 548 505 488 512 560 610 656 691 704 701 704 715 721 724 736 744 714 648 594 572 554 530 545 622 703 720 685 654 634 588 529
908 529 512 551 595 609 607 605 584 543 518 535 566 576 573 580 594 600 603 611 608 585 562 568 588 593 581 574 579 581 576 571 567 564 575 610 637 613 540 478 471 504 539 562 581 592
903E92kpKKj6l0j0K2K7ml1k2J3L4K8J1Lpk4l7k2PK7K1%j8k5j1K4N8N5J2k4k1OJ7QPK7M0K4
898G56j1l4k7jJ8K0K3L1K5j6o9p3j4M3L1k6m9j3K7K0j1j9j0k0m8m9j0L6N1L4J4PJj6l4l1J
893E57L4L4Kk0mK3K0mmL3N6L2ppK3K1l2p9o6j5J2JrMJ2ql4l3lK9M5M7K9ol1k4KJk5k9PM1L3
888F58MJK0K1lj5lKj6k2OL0J1k3j6J7J7k5m2nL0Pl8l4RJ6l1o5l4K3L6PoJ9M5L9Qj6k7l2l4
883E39k5kK3L4K7J7J2%l1n5l2L0N9K5k1j0L8M5%l3k3mlKK3K0j7m1k2nk5m6mO4Q0L3olJ1Mq
878F70j4k5k9kM1M7J7jJ9K7pl8k3J5K8K2K7K8mn4p6o1l6j3J0J6mk7j7Lmk5pM5O4K4k0j3K0
873F23K4j4m4l4OM4M6Ol6k9K9Q0O9J1l5l5j0RJ6J3LooKRPNJ0K0L0K8J1rk4l1l1k2mPNKJ0K1
868G76J6PJ6K2on3n1J3O0L2k3k6J6L0lk5qQpk8k2oj5l4l7k0lJ0K2K0mk5j5J3L4L9L5K5RLM
$$ plain form
903 592 590 583 585 587 571 541 531 553 580 576 545 523 536 570 598 609 612 605 581 544 522 529 556 577 577 559 534 523 547 605 660 672 648 627 633 650 658 665 692 732 756
898 756 745 711 684 683 701 721 744 775 800 784 715 642 628 671 702 676 627 614 641 661 650 631 621 601 553 504 494 530 581 615 629 636 637 621 587 556 557
893 557 591 625 627 607 603 626 646 642 638 671 727 759 752 745 768 789 757 678 612 597 609 610 601 605 617 609 575 542 539 568 613 660 689 683 652 628 630 631 606 577 584 625 658
888 658 662 663 683 704 701 686 683 685 669 647 653 683 694 671 655 672 689 664 622 617 647 654 616 582 591 607 576 511 477 500 536 543 537 556 601 640 648 632 605 573 539
883 539 514 512 535 569 596 613 625 625 594 539 507 537 596 621 600 590 628 673 673 640 617 613 610 612 635 655 638 597 575 570 545 499 495 559 639 672 666 663 674 678 670
878 670 656 631 602 600 641 688 705 704 723 750 743 705 682 697 725 747 774 802 798 744 668 607 571 558 568 584 580 553 536 539 535 510 503 548 612 636 616 603 623
873 623 647 633 589 555 561 605 651 657 621 592 621 701 770 781 746 711 701 710 726 739 742 736 730 732 741 748 753 763 783 813 841 852 843 819 788 757 735 731 738 743 745 755 776
868 776 792 799 815 837 831 778 727 740 800 832 809 783 799 829 826 801 793 801 794 766 744 738 723 689 652 632 629 639 661 681 677 652 637 650 684 723 758 783 792 795 799
863G99qm9q4p3k2J6K2K1K9K8J1oj6l2m7k8K5O1M4OkJ3Nl5n9m5k2j2lJ8K8Rk2k5%J8Rj0k1k1
858E20j7qJ2K6J7pj2J6M8M7J9klnk5m0k7KK4L0K8J6nj8j3j0j7j3K4N7M2nl1k2j9l4k5K0M2
853F32lo2n6QN1L8J5K3M0K5j1k2NL4K2j7m1l0j1j1j9qJ2J0j2j7JRlmK2L7K0KJ6K5om4m2j4
848F14nrJ6N5N8K2KOj1m9n8k1Jk2m2j9J5J5OJ7L1J7j0k2k7m1m3j1K3J5qNM5O2M2J7J0Lj1j2
843F76MJ1j3m4m9qM7O5J7m6n0LK2k6n5%P5N5l9q1k7L0J8j6qK7L7J6mj1j8k8l8m6l1K1P3O5
839F24nn4l2J2J6qj1RRrj1J1K4J0jJ0K8L3J6j2m1n6n0k5NK3K4J0JJ8M9O1L1k4o4o7l3J5K5
834E61j6n9l5L2N2Nk2K2O9L5l5m4MK2rk2J0K9J0mJ7K5j4n0l5JKk1j6J4K4%j2J9O1N4mn9n5
829E56KM8L3rj6J4K2rl1j1J3ml0j1L6N1K4LMnl7m5qK7J1k7k6J0K5ml0pL3M4J6j2k1k3k0%L1
$$ plain form
863 799 791 742 658 585 563 579 601 622 651 679 690 684 668 636 589 561 586 647 691 697 695 708 713 678 619 574 552 540 537 555 583 592 570 545 545 563 572 562 541 520
858 520 503 495 507 533 550 543 531 547 595 642 661 659 656 651 626 586 559 561 585 615 643 659 654 636 623 613 596 583 607 664 706 701 670 648 629 595 570 590 632
853 632 629 567 511 519 570 608 623 646 686 711 700 678 683 717 739 722 681 651 640 629 610 602 614 624 612 595 596 605 602 598 620 657 677 679 695 720 714 670 628 614
848 614 609 600 616 671 729 751 753 759 748 699 641 620 621 599 557 538 553 568 574 591 622 639 629 607 580 539 496 485 508 523 515 520 565 627 669 686 696 699 688 676
843 676 680 691 678 634 585 577 624 689 706 660 610 613 635 609 554 554 629 684 645 564 537 567 585 569 561 588 625 641 637 626 608 580 542 496 465 486 559 624
839 624 619 565 533 545 561 553 542 551 560 551 540 551 575 585 584 594 622 655 671 659 618 562 512 487 492 515 539 549 550 568 617 678 709 685 621 554 521 536 561
834 561 545 486 451 483 535 540 518 540 609 644 609 565 569 591 582 560 570 599 609 605 622 647 633 583 548 549 551 530 514 528 552 552 540 559 620 674 670 611 556
829 556 558 606 639 630 614 628 650 641 610 599 612 608 578 567 603 654 678 681 685 680 643 598 590 617 628 601 575 585 610 606 576 569 602 646 662 650 629 606 586 586 617
824F17M4L0Oj0k2k6j2J2J9QJ4M7N9J1m9n8l2l4o6o5j6K2J1lJ7L5J1j5jJ6j3o0n5JM2M2M5O0
820F32M8kl3j3J7Mk6k2LJk9l3ML5K3j3m0m2k4QM1M9L1J6K4K5j8p6q4k7K6L0J0J3K5Lm4n9k9
815D54OK4L9N7M6kl6j4K7L4QmPJ6J8K1J8j2m9l6K4O3L9j3l3k0j4k6k7LM1N1K7%nKml3n4n2
810E91m0l3k4kJ3OOL7O3K7m1n6KN2M0J3K2K8k0q1p1JM3J5k1j3J7K0nk7k4kK0K4J0kLOj9m7
805E31m5j1J9L0M1M7K9j1k6j2ok8l7mL8M2K0L%j1k5k4j0oj1j2j2k2k5jL4L7Rj1lJ8L0L1K9
800F35J3j1k5j8kQJ2Qkj1j0jJqk2k7j6J2M4M9J4l0l4lJ4j2m4m2%L9M3J2k8l6qL0M0J9pj4j0
795E72KK2L3K0jlRMj9k9j5j1k2j5L0O4L7k4o1n6k7OK9J6k7m7j6K0J9J4M9P8K7p0j04m9OJj0
790D52K7O6N0ll2k5mK2M7M3Kl3k8pqrK0M3J8k4j6L1M0ml0qJ5rm9m5pK4K3jl0m3k4K0M7L9J6
$$ plain form
824 617 661 691 697 687 665 639 627 639 658 666 680 727 786 797 748 690 658 624 558 493 477 499 510 507 524 559 570 555 554 570 557 497 442 443 485 527 572 632
820 632 680 678 645 632 649 653 627 605 608 609 580 547 551 586 609 596 556 514 490 498 539 588 619 635 659 684 666 590 506 479 505 535 545 558 583 586 542 483 454
815 454 460 484 523 580 626 624 588 574 601 635 643 639 646 662 680 701 719 707 658 622 646 709 748 735 702 682 668 642 615 618 659 710 737 737 732 734 730 697 643 591
810 591 551 518 494 492 505 511 517 554 617 644 603 547 549 601 641 654 676 704 684 603 532 533 576 591 570 557 574 594 589 562 538 536 556 580 590 588 591 597 578 531
805 531 486 475 494 524 565 612 641 630 604 592 586 558 521 517 555 597 617 620 620 609 584 560 550 544 533 521 509 487 462 461 495 532 541 530 527 545 575 606 635
800 635 648 637 612 594 592 600 612 620 618 607 597 596 597 589 567 540 524 536 580 629 643 613 579 576 590 578 534 492 492 531 574 586 558 522 514 544 584 603 596 582 572
795 572 574 596 629 649 648 645 654 658 639 610 595 584 562 547 577 641 678 654 593 537 510 516 545 561 534 487 471 491 510 524 573 651 678 608 504 455 461 462 452
790 452 479 545 595 592 560 535 531 553 600 643 645 612 584 577 569 560 580 623 641 617 601 632 672 668 638 630 645 636 587 542 535 559 582 581 551 508 484 504 551 590 606
785F06L%mLJ7K1OnMRrk9j8QJ2qrJ1K0%j3lJ0mk6k4nJ0J6J9K0J1lqmoj3j0jmk3k5OL7K8j3m0
780E70k9j0qqJ1L3K1rj3J8M3K3j1j6OJ6LnOJ2ql2k4LJ5kk0rK1M3M1K7J5J0nl5o0n1j0K6J9
775F17j6l0lK8L0J3Jj1l4n3l3J9N3M5K6K3K1Kj7j4%jj2LM0N7L3%j4pQL1N3N6L3J5J9L4K9Q
770A052j0rKJ9L9N8O6O0M9M6O6R4R6O3L7P1J43J84J57J07Q6Q4O8M0K7K5Nk1k5k2n9j28j70
766B300j55j18j05j03r8r3r4q7o9o6q5q9n2j2j8m7m4r%k5l9j6Qom2n5l7j6j4k3k5j2QJ9J4
761F95J2K2K7mm8n0lL9K9PK3N8M5k6q5p4k0J6J3KJ4L0K6jj8rLj2l8k7K3O5N0kl8l9k3lRjm1
756F46o9m7J0L7J5jK4N4M2kl3l3j3OK2K0Lj9k8k3j5o%j0k7j6K7N2K8j5k9k0j8j5J3L7J8l8
752E77o5m4j5rnOJ2kqPK4K7K4K7K9K4J8Rj4l3j3K7K7k3n0j8K1Rk4k0J7L6L1K5J4k1n2m3pJ1
$$ plain form
785 606 609 609 605 608 625 646 652 647 651 660 651 622 604 612 624 616 607 618 638 638 625 622 632 628 602 578 573 583 599 618 638 649 646 638 634 628 615 605 604 600 577 552 558 595 623 610 570
780 570 541 531 523 515 526 559 580 571 558 576 619 642 631 615 621 637 640 635 641 653 645 613 589 592 607 605 585 576 597 640 681 708 723 733 728 693 633 582 572 598 617
775 617 601 571 568 596 626 639 640 629 595 542 509 528 581 626 652 675 696 698 681 667 667 666 654 657 697 754 787 787 773 766 774 805 858 914 947 962 981 1015 1044 1052
770 1052 1042 1033 1035 1054 1093 1151 1217 1277 1326 1372 1438 1532 1628 1691 1728 1799 1942 2126 2283 2390 2476 2560 2628 2668 2695 2720 2725 2704 2679 2657 2598 2470 2300
766 2300 2145 2027 1922 1819 1721 1628 1534 1447 1378 1312 1227 1138 1086 1074 1056 1009 965 956 956 931 892 876 884 878 836 781 744 728 714 691 666 654 662 681 695
761 695 707 729 756 752 704 654 651 690 719 726 749 807 852 826 741 667 647 663 676 678 692 722 748 747 729 720 723 711 673 646 669 734 784 782 744 705 682 679 688 687 646
756 646 577 530 540 577 592 591 615 669 711 709 676 643 630 636 658 678 681 662 634 611 596 590 590 580 553 537 564 616 644 629 600 580 562 547 560 597 615 577
752 577 512 468 453 444 439 445 457 455 447 454 478 505 529 556 585 609 627 636 622 589 576 603 630 607 557 539 560 569 545 525 542 578 609 634 648 627 575 532 525 536
747E36QJ9K8J0j8nL3L2j0k2J0K5mj5K5N2Pn0m1J4L0mk8j2P%rpmj0kJ7K2Kj4nJ7K3J1nj9l4
742F10l1lL3M6L2J5J4J4kk5l1j9plPJ9Jm7p1l4K1K4qpM2O7K7k1j3K4J9k0l7pK7L3J8pl4m4
737F22k1K0L9L0J2MKOJ5Pk6m3j3L4K7l3o6l1J8J3l0m6k2MPnmJ3M0N5M2J0oJNj8m6n0k4J3M8
732F03O3L5k4n2j5L8L6k1n8m7k2pK1O2N5j8q4n9J9M6Jl8j6K0Rk2j2L3N0J7j0LK9K2qk5j8j4
727E92j7rJ2K6K2J4J6J0rk7k2jOoj3nJ3K1J4%j7k9l0j8%J6L4N1M3kn4o1j2M3N0J1k8l7k3P
722E81L7M3Ql3l4kJl4m0K0Q2P3J4j3Jom6o2k1L2M8L7J9ol5l6j1Lj5k2J0L6Rl7m6j9j0j9lL8
717E42N7L2jj7k1j3NJ3j2m9m6rRjNM3O5L8RJ5L2J5j3pJ9K4Lrmrk6l8l6k2J1O2Q7M8j9m9l3
712G00k5l4k6J1K0j8m9k7J3J0j5kM9O7J6n8q9n8lL6M3K8J4P%lKJ4J1k%L0M6Pn2o6k0J9Rk5
$$ plain form
747 536 544 563 591 601 583 578 611 643 633 611 621 646 642 627 652 704 711 661 620 634 664 660 632 620 627 627 618 611 607 597 595 612 634 636 622 617 634 657 668 663 644 610
742 610 579 576 609 655 687 702 716 730 728 703 672 653 646 643 650 669 670 623 552 518 539 563 555 548 590 657 684 663 650 674 693 673 636 629 656 689 707 700 666 622
737 622 601 621 660 690 702 706 708 714 729 736 710 667 654 688 715 682 616 585 603 616 586 540 518 522 529 524 520 533 573 628 670 680 674 675 680 662 616 566 542 555 603
732 603 666 701 677 625 610 648 684 663 605 558 536 529 550 612 667 649 565 506 525 571 572 534 518 538 547 525 513 546 596 613 603 606 635 657 649 624 606 592
727 592 575 566 578 604 626 640 656 666 657 630 608 607 613 607 594 589 602 623 637 637 620 591 561 543 543 559 593 644 687 685 631 570 558 601 651 662 634 597 574 581
722 581 618 661 669 636 602 600 601 567 527 547 629 702 716 703 704 698 652 590 569 601 649 686 705 699 664 628 617 620 605 583 593 629 638 601 555 536 526 507 504 542
717 542 599 631 630 613 592 579 584 597 585 536 490 481 490 489 494 537 602 640 649 664 696 711 698 691 710 734 737 728 724 715 689 651 615 593 604 666 753 801 782 733 700
712 700 675 641 615 626 646 628 579 552 565 575 560 558 607 674 690 632 543 485 482 518 561 589 603 610 610 607 609 623 634 632 632 662 708 715 663 597 577 596 605 580
708E80k8JK2Km0o1l0L0O9N9L1L3M9L0l1p9p0k7MK2M1N5M4J6rk3l5m1l5k5k1j2J2L8M3L2J5
703F61pk9l0JK5J1j4kM0N1J2l3m3k6qMjk6m8l0J3K8Mj5MK4J2oLJ4ol0j4K9M1J6jNJk6l9j9
698E46MLqlJ1J1%rnNJ6J2qk8j4L2N7L0k7n2k8OJ6J0J1K4K1ql7k8J2L5J1k4k6JJ4OJ2L6L2k1
693F48o6m3K8O1K6k1l1j1KQK4L6J7j5j9QK5Pj5j0Kqk2j3Nnl4k8J0K5mk4nJ6OpJ7L9Rl6j8N0
688F34O9J6l2rL8L8Kj6pj4m8o5l4K9P2O0J2k1KN0N1j6q4q4k7K2K0j5n0n7l3J3N2N7J8l7o7
683E39n1j1J2Jj0J1M0L7J4J0K7J9j6k7LK8Qj3OL9M4K7J4om5o1pN8N2j0l5RN3M0Mrj3l9p2q1
678E89n3OP0Q5J5p3p3J9P7J9p3p4NN2K8MK9O0L7k0n1l3JJ3Npj1k3l9l4ON0M8kl8k0K1K3j2
673F26k8qK2L1K3J5Mj2k7l6l6j9K0N4N1J1k1j5J4K7Qk0k3LK8J5l2n9l0K4M5K5Jqk8n8o0pN7
$$ plain form
708 580 552 553 575 577 537 476 446 476 545 604 635 668 717 747 716 637 567 540 544 566 607 662 706 722 713 690 655 614 579 554 533 521 533 571 614 646 661
703 661 654 625 595 596 621 632 618 616 656 707 719 686 643 617 609 613 612 586 538 508 521 549 553 538 542 566 578 572 575 589 583 553 539 568 609 625 624 629 630 604 565 546
698 546 550 553 545 542 553 564 564 555 550 555 571 583 575 547 533 565 622 652 625 573 545 551 567 577 588 612 633 625 588 560 572 607 618 594 568 569 583 589 601 637 669 648
693 648 582 539 567 628 654 633 602 591 593 601 625 661 678 663 644 652 677 684 669 659 661 653 631 618 623 618 584 556 566 591 587 563 558 574 580 573 590 629 638 602 584 634
688 634 703 719 687 678 716 754 756 740 733 719 671 606 572 601 673 733 745 724 726 776 827 811 727 643 616 638 658 643 593 536 503 516 568 625 643 606 539
683 539 488 477 489 490 480 491 531 568 582 592 619 638 622 595 598 626 634 621 627 666 710 737 751 745 700 639 632 690 742 732 697 706 759 799 803 794 781 742 670 589
678 589 536 542 612 697 712 639 566 585 662 681 608 534 539 591 619 623 652 712 749 729 678 645 646 659 664 657 646 623 584 550 556 606 654 652 614 594 615 638 626
673 626 598 590 612 643 666 681 685 673 646 610 574 555 575 629 680 691 670 655 669 696 704 684 661 664 692 707 675 616 586 610 655 680 681 673 645 587 527 520 577
669E77P0K5k6l9j2K1K9%l1k3K6O3L5l2p2o2k8%K1L4L4K3J6J2j1m7m8JM4K8k2m1j0J6J1JJ0
664E93K5K4J6J1kk5k2K2N6L0k5m4j3J2KpQJ4j7n2n1k5rML9P7O8Mm9m5oJ2kj5j0kmj0mNJ2K6
659F21M0L2om0k4K6N0J5l1l4jK2J3lj4j9j6JJ4OpNL0K3j4k4J5M7L0pj2RK0J7J1kl3n5k9J9
654F95K8rm0k8%OJ%nk9n0m3oL2M8L8J6PJ6K1J1jJ5L5K1k9o0l2K4M9K7j3l8l0jJ6Kk3k0J3L2
649F96J5j0qONj0j1NJ8J8J8J8RqqK4O1N7Ko0o8j7L5L2j8n4n5m1l2j4K5N3M5J2j0j5j2nPLj6
644F92k3kJ8Pk1k1NK3J9J3QMJOll2m5oM5K9m4p9l4L1M4J1j6k1j1J6M4L4k1n8k9J2J2oJ6O0
639F78N3%k7nJ5kj7pLnNL7M0j0n1l2Q%l8m6j4J3K0K6K6ml8l3RL8L3K6K3Mk4k5kNkK0O5N4k4
634G95p5l1L9L8j4l1p%k1j8J6K5rk9j3j5n0n2K3R4O3m3j04n8K3N5K8jQM0M5Km3l6K0N7L2j7
$$ plain form
669 577 647 672 646 607 595 616 645 645 614 591 617 680 715 683 611 549 521 521 542 576 610 633 649 661 650 603 555 556 600 628 606 565 555 571 582 583 593
664 593 618 642 658 669 667 642 620 642 698 728 703 659 646 658 660 653 661 675 658 606 555 530 521 525 564 641 709 713 664 619 613 625 623 608 598 596 592 582 578 583 595 621
659 621 661 693 687 647 623 649 699 714 683 649 648 670 683 680 666 647 631 632 646 652 645 650 680 703 689 665 680 727 757 750 738 747 767 784 795 793 760 705 676 695
654 695 723 714 674 646 646 652 653 653 648 619 569 526 520 552 600 638 654 661 677 698 709 708 723 758 779 750 690 658 682 731 758 745 707 677 676 692 694 671 651 664 696
649 696 711 701 693 699 704 694 683 688 706 724 742 760 769 761 753 777 838 895 897 837 769 752 787 819 801 747 692 651 619 605 630 683 728 740 730 715 703 698 705 708 692
644 692 669 667 685 692 671 650 655 678 697 710 718 722 723 729 726 694 649 643 688 717 673 594 560 591 635 646 630 609 598 614 658 692 671 613 584 596 608 602 618 678
639 678 731 731 704 699 714 712 695 688 691 686 691 728 768 758 707 675 683 683 645 599 585 598 618 644 670 666 628 595 604 642 675 701 724 728 704 679 677 682 680 700 765 819 795
634 795 720 689 728 766 752 721 714 714 693 675 691 716 707 678 665 650 600 548 571 665 728 685 581 523 546 601 629 628 636 676 721 723 680 644 664 721 753 736
629G36k8JK8K8J5MkQK9L1j5p4r4o4l3k2rK0L4J4j6k0RM2O1N7K9pj9NK5Km4m9KN0M5kk8oL6
624G79N1L3Ppj2j9k6l4l8m1l2rJ2Rj3l1k1J2M3N3L5Kk8l8j8K8P3P9K9l3n4k5%j9m7l2J9N2
620G39M2Qj9k8j5K0M0J3m0n7k3QjrJ8N0L5j3l5j9kjjJkKK4M1J6k3k5PJ2j7j7K4L5k0o9l9K5
615F85L7KnJ9J2k7l1J3L0pk3K5O4J8n5n5J2M1Kl4j8K1K8J3jj2j9JM3O3L6j0k9k0j0j7k8l6
610G28k2J9O2N8%m3j9L8M6nm9l4J4M3M0K2jk2k3NM1N8N1L0Nk0l1j4RJ0j2j3L4Q8R4M1rqL2
605A243O3N8K8kj2QN1P0L7k6n1j5L7M9K0j9m6o3o2l9q%j8m0l8j1J5J5j5l8k7oj5m8n1j0L0
601A064M2N3O6L2n5j03m0N8O7qm5JN1M9K8L8N3N2O1Q8R4N9L2M7P6Q2Q4R8Q0Rm9l4Rlm8m7K
596B043J2m5r8r0m3j2rl0p0j11j09o7k9k7l7k6KJ8Nl1o3o8m4j3OK6M6M8K0nRL2K9J5K8L9o
$$ plain form
629 736 708 709 737 765 780 784 782 790 819 850 835 761 667 603 570 548 539 559 593 607 591 571 580 622 683 740 769 762 743 748 773 775 731 682 684 734 779 777 749 743 779
624 779 830 863 870 863 851 832 806 772 734 693 661 652 664 673 660 629 608 620 663 716 751 753 725 687 669 697 770 849 878 845 791 766 766 747 700 668 687 739
620 739 781 789 770 742 727 747 787 800 760 703 680 688 687 678 696 746 781 768 733 714 712 711 710 711 709 711 735 776 792 769 744 751 763 746 729 753 788 768 699 660 685
615 685 722 724 719 738 750 723 692 705 735 728 705 730 794 812 757 702 714 755 757 723 705 726 754 767 766 754 735 736 779 842 878 868 839 819 809 792 764 728
610 728 706 725 787 845 845 802 783 821 867 862 813 779 793 836 876 898 897 875 852 857 898 956 1007 1037 1042 1022 991 977 986 996 984 971 1005 1093 1187 1228 1219 1211 1243
605 1243 1306 1364 1392 1390 1378 1386 1437 1507 1544 1518 1467 1452 1489 1538 1558 1539 1493 1430 1368 1329 1321 1321 1303 1263 1225 1214 1229 1244 1229 1191 1164 1158 1143 1095 1044 1034 1064
601 1064 1106 1159 1225 1257 1202 1099 1059 1117 1184 1176 1131 1132 1183 1232 1260 1298 1351 1403 1464 1552 1646 1705 1737 1784 1860 1942 2026 2124 2204 2213 2164 2130 2139 2136 2088 2041 2043
596 2043 2055 2010 1912 1822 1779 1767 1758 1728 1658 1547 1438 1371 1342 1315 1278 1252 1254 1272 1277 1246 1183 1115 1071 1058 1064 1090 1136 1184 1204 1199 1208 1240 1269 1284 1312 1351 1345
592A345p4p3PP7Q0N6M9L8OnL3O2L1k0k6QK5J9J8J7j1n5p4n6l5k7k7l1m2m0pK9K5j4m5m0j4
587A209RJ9Nk8n1l7mQjkJ2J6%j8k9m2m8k6J8M4L3Qoj3k2j5QK6K0Jj0j5j4j0j0k1k9pM1O1K5
582A105k4l5j0J0J0J3K8K8ll9m5j3L0M9L1ql2j6K3M1K0j8m2l8j9KJ9K7J0k7n8m6MM9N0J5j2
578A079KL4L8jm3l9PM7M0jl1k8nJ7K8K5J3RK1L1K0KjKk2n6m2K5P4N3RjJ0ql3qM6N3Nj8K2O4
572A439M6mk3rJorpkJ7M8N7J8l1l7kJ8Jk3j4J5K8J0k4m6l0J4M5L1jpK0L9K2rj3PK7L3K9J9
567A687mk8l6k5oOJ0J4K1L6N5N7J8m6p8m0L1N8K8PL0N4L0j9k6PK3PKL3N6L3j1l6l7k9j0K4
563A896N2N4L8K3QlNK6K5kmL3M8jn1j6O7Q6L1lK6M7Rl3j5L0L8J7J6K9K0JJ5N7P3M2%k1j7J0
558B656N1P4M8JpK6M3J8mPK4J5PL1O1N1J8J7N4P7O0L9M9P0O9N5M5L6J9J3M0Q1R3P3O2P5Q0
$$ plain form
592 1345 1271 1198 1205 1282 1362 1418 1467 1505 1511 1506 1539 1601 1632 1612 1586 1594 1619 1638 1656 1673 1662 1607 1533 1477 1442 1415 1388 1357 1315 1275 1268 1297 1322 1308 1263 1223 1209
587 1209 1218 1237 1242 1214 1163 1126 1122 1130 1129 1127 1139 1155 1155 1137 1108 1066 1018 992 1010 1054 1087 1095 1089 1076 1054 1039 1047 1073 1093 1094 1084 1069 1055 1045 1035 1014 985 978 1019 1080 1105
582 1105 1081 1046 1036 1046 1056 1069 1097 1125 1122 1083 1038 1025 1055 1104 1135 1127 1095 1079 1102 1143 1163 1145 1103 1065 1046 1048 1067 1094 1104 1077 1019 973 977 1026 1076 1091 1079
578 1079 1081 1115 1153 1152 1109 1070 1077 1124 1164 1163 1132 1104 1099 1116 1144 1169 1182 1191 1212 1243 1263 1265 1264 1266 1244 1188 1146 1171 1245 1298 1307 1306 1316 1308 1275 1267 1313 1366 1371 1353 1375 1439
572 1439 1485 1481 1458 1449 1450 1444 1435 1428 1426 1443 1491 1548 1566 1535 1498 1496 1514 1515 1492 1478 1493 1521 1531 1507 1461 1431 1445 1490 1521 1520 1513 1533 1572 1594 1585 1572 1579 1606 1639 1668 1687
567 1687 1683 1655 1619 1594 1588 1594 1604 1618 1639 1675 1730 1787 1805 1759 1681 1641 1672 1730 1758 1765 1795 1849 1879 1860 1834 1841 1864 1871 1873 1906 1962 1995 1984 1948 1911 1882 1872 1896
563 1896 1948 2002 2040 2063 2071 2068 2073 2099 2124 2122 2118 2151 2199 2198 2147 2131 2198 2284 2315 2312 2338 2385 2394 2361 2346 2376 2414 2431 2447 2476 2496 2497 2512 2569 2642 2684 2684 2663 2646 2656
558 2656 2707 2781 2829 2830 2823 2849 2892 2910 2906 2913 2937 2952 2959 2990 3051 3102 3120 3137 3191 3268 3328 3367 3416 3486 3555 3610 3655 3691 3710 3723 3763 3844 3937 4010 4072 4147 4227
553D227N8L9M9P0P4O9Q1R9R2O9P0R4R6O2M3P6J28J38J08R0J05J17J04R4J09J35J48J48J52
550F944J60J58J49J47J58J68J76J86J97K03K02K04K13K26K48K81L18L30L16L14L52M06M25
547A2481M09M13M64N19N34N39N87O66P05O97P18Q19R35R81R84J043J179J305J364J420J553
544C0315J750J931K081K252K460K669K868L114L437L784M089M368M689N064N436N763O055
542I2125O320O505O532O361N988N412M617L617K439J109l50j847l233m355n158n658n894n895
540A08635n709n426n106m749m333l881l455l082k709k294j870j499j182q66n37k40MK53N71
538F2525R44J304J614J903K216K576K980L420L874M332M811N336N914O523P155P822Q531R274
536A43054J0029J0775J1463J2026J2376J2433J2124J1419J0330Q863O975M620J829j230m309
$$ plain form
553 4227 4285 4324 4373 4443 4517 4586 4667 4766 4858 4927 4997 5091 5187 5249 5292 5368 5496 5634 5742 5832 5937 6054 6158 6252 6361 6496 6644 6792 6944
550 6944 7104 7262 7411 7558 7716 7884 8060 8246 8443 8646 8848 9052 9265 9491 9739 10020 10338 10668 10984 11298 11650 12056 12481
547 12481 12890 13303 13767 14286 14820 15359 15946 16612 17317 18014 18732 19551 20486 21467 22451 23494 24673 25978 27342 28762 30315
544 30315 32065 33996 36077 38329 40789 43458 46326 49440 52877 56661 60750 65118 69807 74871 80307 86070 92125
542 92125 98445 104950 111482 117843 123831 129243 133860 137477 139916 141025 140675 138828 135595 131240 126082 120424 114530 108635
540 108635 102926 97500 92394 87645 83312 79431 75976 72894 70185 67891 66021 64522 63340 62474 61937 61697 61701 61954 62525
538 62525 63469 64773 66387 68290 70506 73082 76062 79482 83356 87688 92499 97835 103749 110272 117427 125249 133780 143054
536 143054 153083 163858 175321 187347 199723 212156 224280 235699 246029 254892 261867 266487 268316 267086 262777
534B62777p152r542j1342j2513j3102j3189j2885j2324j1641j0888j0062r204q401p698p032
532A05802o335n637n013m470l958l462l027k663k325j972j612j270r46o37l49q0J91M69P42
530F3448J022J347J712K078K411K750L132L532L899M236M591M964N281N465N483N342N035
528A25728M542L858K979J893O06q21k266l603m734n609o221o579o705o627o393o075n725n358
525G2890m963m552m166l828l518l215k931k691k481k274k065j884j743j627j521j419j314
523B6698j200j090j012r59q96q15p56p38p23o73o13n85n73n41m97m74m69m43l88l45l29l27
521A2252l29l38l43l18k77k65k82k78k44k24k40k38j83j28j40j94k07j62j15j05j19j29j37
518G257j45j43j30j24j27j28j21j11j05r7r0q7q4p5o8p2p9p7p7q4p9n1l0m7p4p2n6o6r4r4
$$ plain form
534 262777 255625 246083 234741 222228 209126 195937 183052 170728 159087 148199 138137 128933 120532 112834 105802
532 105802 99467 93830 88817 84347 80389 76927 73900 71237 68912 66940 65328 64058 63112 62475 62126 62046 62237 62706 63448
530 63448 64470 65817 67529 69607 72018 74768 77900 81432 85331 89567 94158 99122 104403 109868 115351 120693 125728
528 125728 130270 134128 137107 139000 139606 138785 136519 132916 128182 122573 116352 109773 103068 96441 90048 83973 78248 72890
525 72890 67927 63375 59209 55381 51863 48648 45717 43026 40545 38271 36206 34322 32579 30952 29431 28012 26698
523 26698 25498 24408 23396 22437 21541 20726 19970 19232 18509 17836 17223 16638 16065 15524 15027 14553 14084 13641 13253 12908 12579 12252
521 12252 11923 11585 11242 10924 10647 10382 10100 9822 9578 9354 9114 8876 8693 8565 8425 8231 8024 7862 7747 7642 7523 7394 7257
518 7257 7112 6969 6839 6715 6588 6460 6339 6228 6123 6026 5936 5849 5765 5690 5622 5550 5471 5394 5317 5233 5154 5103 5073 5026 4952 4880 4824 4758 4664 4570
514D570o1m6p5j03q7m6j2PMl2q4r7n7k6n1q4o8l4m5q1n9K3P2L8k0l4k7n1r2p8j0L7J3m0n4
510C210k4nk5n9o0k5Jj3n3o8m3%K3J6mk0l4m6m4k1PRj3k7j4J0Rk0m5m1k3k0l6m9m0j5mk7n5
505B312m0K0N8K8k4k6J6K8j4m4j4J7j4p1p3k6j0m5o0j2N5O9K9k2n2n4k8J0K1qm8n8l4JK6L5
501A948K7Lj9k2j1mpj6k3k4j7oln%Qjk8l6j0J3Jk7k5J1L5K2j0k9l8m2k8RM7N3J8l3o7n8j3
496A593L4N2M1K9L0K6Lk0l0k8l2m0l8l1l1l5k1NJ7jj7%L2L4%k9k4okJK5M8L4jMM5N1j2p5n7
491A574K0O2K6l0l9qK0K0PLK5O0P2M1kj0K0M7L9J5MOJ7M5Q1R8Q4N7L7J9lj5j4j7l2l9k5k3
486B242m4n6k8RJ1lOK5Nm5o5l3%ok4j9KJ0J0RJj5j9qnk0j9J8N1L4qj4K5O2O4M9M2M5O1R1J15
481B556R7N1L8Q4J41J43R4M9L8L7J9pk4l8o6r4r2n8l2m4p8r2p6n1l2j6%ll0n4m9k3l%rk5n0
$$ plain form
514 4570 4509 4463 4388 4285 4198 4152 4140 4147 4151 4119 4035 3938 3881 3855 3804 3720 3652 3618 3573 3492 3433 3456 3528 3566 3546 3512 3485 3434 3342 3264 3254 3291 3304 3264 3210
510 3210 3186 3181 3156 3097 3037 3012 3013 3000 2947 2879 2836 2836 2859 2875 2871 2851 2817 2771 2727 2706 2713 2722 2709 2682 2668 2678 2687 2667 2622 2581 2558 2538 2502 2453 2413 2398 2394 2367 2312
505 2312 2272 2292 2350 2378 2354 2328 2344 2372 2358 2314 2300 2317 2303 2232 2159 2133 2123 2078 2018 2006 2061 2130 2159 2137 2085 2031 2003 2013 2034 2026 1978 1920 1886 1887 1913 1948
501 1948 1975 1978 1959 1937 1926 1922 1915 1899 1876 1852 1835 1829 1826 1821 1821 1829 1828 1800 1764 1754 1767 1768 1741 1716 1727 1762 1784 1774 1745 1707 1665 1637 1646 1693 1746 1764 1731 1664 1606 1593
496 1593 1627 1679 1720 1749 1779 1805 1808 1788 1758 1730 1698 1658 1620 1589 1558 1523 1502 1507 1524 1523 1506 1506 1538 1572 1572 1543 1519 1513 1511 1512 1537 1585 1619 1618 1622 1667 1718 1706 1631 1574
491 1574 1594 1656 1682 1652 1613 1605 1625 1645 1652 1655 1680 1740 1812 1853 1851 1841 1861 1908 1947 1962 1966 1972 1989 2034 2115 2213 2297 2354 2391 2410 2407 2392 2378 2361 2329 2290 2265 2242
486 2242 2198 2142 2114 2123 2134 2131 2137 2162 2167 2122 2057 2024 2024 2018 1994 1975 1977 1987 1997 2006 2007 1992 1973 1965 1960 1940 1921 1939 1990 2024 2016 2002 2027 2089 2153 2202 2244 2289 2350 2441 2556
481 2556 2653 2704 2742 2826 2967 3110 3204 3253 3291 3328 3347 3340 3316 3278 3212 3118 3026 2968 2936 2892 2814 2722 2646 2595 2563 2547 2547 2544 2514 2460 2411 2388 2385 2385 2376 2351 2301
477B301o7n0pK0Jl5m7k3Lkl2n9n2j8J2K2J4MMJ6L6N7N9L7J2J1K9M0M0M2N4N6L2ol6n3n4k8
472B333J5M7M2J5MJ6L0L1K9L7M8M6L5K6J5k0p5j19j05m9j3l7q3p9l3k1p7j27r9l1j6n8p9m6
468A602j9m5p3m0K2L2k3p2o5k1J7L6L6J5j7m0l6qL0O3O3J5m2m6QN5M3LjL5O2M1kk7j1K6M9
463A665K9j5l3j2Ppl0j4K1J8k9n9m3k7m5o1k6L2L5k4p2o3k5rj3lJ1pn2o4j4M5M3j3m6j1M6
459A135N3jm9m3%L1L3K6J5kk5l4j6J1J8ll0l9k7j5j3pJ1L4L5J3rj6k4l4k7J3N9O4J9l2n6n6
454A012n7n9m1LM9O7M3om6n5l6j0MJj2j1J1M4M8J0m1n7k8J4K7Nk7l7j3K3L5Ql6n6l8oJ9L1
450G82M0M1M0L3J6j4l9k9RM2M0J3j8m2n6m6pK5K2lnJ9K6qm6l6J5N1L8RKQql9m3rJ6kk9j6J1
445H03jm6m9J4O6L7l1m6RO2O8M5J8j9n5n4oL8K6k3n4m5k3mJ2K2J3jLK6L7K8J5Nk5p2q1j8N7
$$ plain form
477 2301 2234 2184 2177 2197 2198 2163 2116 2093 2096 2094 2062 2003 1951 1933 1945 1967 1981 1985 1989 2005 2041 2098 2157 2194 2206 2217 2246 2286 2326 2368 2422 2478 2510 2504 2468 2415 2361 2333
472 2333 2348 2395 2437 2452 2456 2472 2502 2533 2562 2599 2647 2693 2728 2754 2769 2749 2674 2555 2450 2401 2388 2351 2268 2189 2156 2135 2058 1931 1832 1801 1785 1727 1648 1602
468 1602 1583 1538 1465 1425 1447 1479 1456 1384 1319 1298 1315 1351 1387 1402 1385 1345 1309 1301 1331 1394 1457 1472 1430 1384 1392 1447 1490 1493 1492 1527 1589 1630 1628 1601 1590 1616 1665
463 1665 1694 1679 1646 1634 1641 1634 1604 1590 1611 1629 1600 1541 1498 1471 1426 1365 1339 1371 1406 1382 1310 1247 1222 1213 1200 1197 1208 1201 1149 1085 1071 1116 1159 1146 1100 1089 1135
459 1135 1188 1187 1138 1095 1095 1126 1159 1185 1200 1198 1173 1139 1123 1134 1152 1149 1119 1080 1053 1038 1025 1018 1029 1063 1098 1111 1102 1086 1062 1028 1001 1014 1073 1137 1156 1124 1068 1012
454 1012 955 896 855 858 907 974 1017 1011 965 910 874 864 868 869 857 846 857 901 949 959 918 861 833 847 874 879 852 815 802 825 860 868 832 776 738 732 751 782
450 782 822 863 903 936 952 938 899 870 879 921 961 974 956 914 858 812 805 830 852 849 844 863 889 881 835 799 814 865 903 912 914 922 914 875 832 823 839 837 808 792 803
445 803 802 756 707 721 787 824 793 747 756 818 886 931 949 930 875 821 815 853 879 856 802 757 734 730 742 764 777 776 779 805 842 870 885 890 865 793 712 694 751
440G51M9l2q0k9N6P2J7l1k4KMrj6j0mQJ8J4pk3k1j1j0j4j2jMPQJ3J8K6L4L5K1lk9m4l4J2N9
435G84N7Ql7m3l1k7j7J9N5N3K9J1%k1l3j3J1rm9m0K2O2L0k0l0j3k1m6m0nK1K0J7K8L1Ok9m4
430F96l4j8qmKJj7l4j8L3P1N4kk7JL4K9nk4j9romjJOJ2J2OOJ3Lk8m9k3K6M6J9k0l7k3ML2M6
425G43L6J4NJ8L0J6k0m9m7k8j2rkK4M9M7J4rpNkj7k1j4j9l5m1k3J3M7N7L4ok9k5k2l5m3j8
420F19J6K1lj7mJ3J3LKJ1K2K7J2j6l6k2OJ4LlNNomJ0J1pj6JJ8R%PJ2j6n0m6qJ3%j4OM4N2J8
415G25l1n2k3L4P5O2J2l4m4l0j4nJ0K4J8j5l9k6NJ9PJJ3J6nk8k1NJ8J3Nlj3%M2O6K2m9o8l0
410F62j5m4n0K0R0P1rn0k2J2OpOK9K4lk5l1l1k6mL0M3J6l1m6nN1O3K6j0pJ1Rpj2jMMJ2K0N
404G78k1l1j5PK0K3J5mj9j0PMj8k3pjk1l5j0L7N7L5Jj4p%oqMJ9J3j3k9k1j5k8l2kL4L6J3J2
$$ plain form
440 751 800 768 688 659 715 787 804 773 749 751 755 746 730 720 716 724 742 756 749 726 705 694 684 670 658 657 661 668 676 689 707 733 767 802 823 820 791 747 713 725 784
435 784 841 849 812 769 738 711 694 713 768 821 850 861 861 840 807 794 805 796 747 707 729 791 821 801 771 758 737 691 651 646 667 687 704 732 763 769 740 696
430 696 662 644 636 632 634 635 618 584 566 599 670 724 722 695 696 730 759 754 730 711 702 696 692 691 692 698 710 722 728 734 747 750 722 673 650 676 722 741 721 684 661 665 697 743
425 743 779 793 798 816 846 862 842 793 746 718 706 697 695 719 768 815 829 820 813 818 816 799 778 764 745 710 669 646 659 706 763 797 791 762 737 715 680 637 619
420 619 635 656 653 636 632 645 658 661 663 674 696 723 735 719 683 661 667 681 684 681 686 691 685 681 691 702 695 679 680 698 707 707 714 726 710 660 614 606 619 619 605 611 655 707 725
415 725 694 642 619 653 728 790 802 768 724 694 680 675 685 709 727 712 673 647 652 671 678 679 692 708 703 675 654 659 677 690 695 692 679 679 721 787 809 760 692 662
410 662 647 603 553 573 663 734 725 675 653 665 671 664 670 699 723 720 695 664 633 607 603 633 676 692 661 615 610 661 724 750 740 733 744 753 746 734 733 737 741 753 773 778
404 778 757 726 711 718 738 761 776 772 753 743 750 754 736 713 706 705 684 649 639 676 733 768 769 755 748 748 742 734 738 757 770 757 728 707 692 664 632 630 664 700 713 725
399G25L4K6j8m4j9J3Pk5m1l9k8qL1N5L7mk5j7lPJ5J6jj7jL3M2J7j0j4qj0j1%J2J4J4J9J3j1
394G76l7l7j3J0J3Lqj2j6j6j5oJ0K7L5M1M7M2J0l9o1l0J5K4ok1OL3K1rj3J0K1Kj6pPPJJ0K3
389H32K3J4jk6o0p4l6K2M5J7j5j9j0lPK0J2k5m7j6L4L7j4n1k5K8M5K2%JLpj1NJ9Jl0k2K5N6
385G76L3rj6J1K8J3rk4l5l7j1L2N3M1K1J9J8Kj5j8j7k0j7%Qqj3J3M3L2j1l4k7j4j1MM3P4O6
380I84L1nk7l2k2PL7M8L2jk5k6mJ7K6M7Q8J21J00L9pqOkj6JM2N5J7l4l8QN3N6L1J7K1J2j4
375A635k1J2M4J6n6q6l1N4P6J6o3q9n4jL9N1M0Ol3m9k4K1N4O6O4M6J1j9j7J1L2L3L9N5N6M3
371A977N7R8J08M7j9j2M2O8M6K7K1j2p0r5o3l3m7o9o2m5n2q0r5r2p0k5K4L0j6n7n4l3k8j6
366A400L1O0J7n5n6J5O1K4l9n7l2j0LK1L8K8jj5LL4M7L4RpjJ9M2M9L2j4p0r8q3m2oK9O9Q2
$$ plain form
399 725 759 785 767 723 704 717 724 699 658 619 591 583 614 669 706 702 677 660 657 664 679 695 694 677 676 709 751 768 758 744 736 726 715 715 727 741 755 774 787 776
394 776 739 702 689 699 712 715 707 695 679 663 648 642 652 679 714 755 802 844 854 815 754 724 739 763 757 736 742 775 796 787 774 784 805 807 791 784 791 798 799 809 832
389 832 855 869 868 842 782 708 672 694 739 756 741 722 712 709 716 736 748 723 676 660 694 731 717 666 641 669 714 736 736 737 740 733 722 727 746 747 717 695 720 776
385 776 809 800 784 795 823 836 827 803 768 731 720 752 805 846 867 886 904 906 891 873 856 836 819 819 827 819 806 819 862 894 883 849 822 808 797 801 844 918 984
380 984 1015 1010 983 951 929 936 973 1021 1053 1052 1027 1001 997 1014 1040 1087 1175 1296 1396 1435 1428 1420 1426 1424 1408 1409 1451 1506 1523 1489 1451 1459 1512 1568 1599 1616 1637 1649 1635
375 1635 1614 1626 1670 1686 1630 1544 1513 1567 1643 1659 1596 1507 1453 1452 1491 1542 1582 1588 1555 1506 1482 1503 1557 1623 1687 1733 1744 1725 1708 1719 1751 1784 1823 1878 1934 1977
371 1977 2034 2132 2240 2287 2268 2256 2298 2366 2412 2439 2460 2448 2378 2283 2220 2187 2140 2071 2009 1964 1912 1832 1737 1645 1575 1550 1574 1604 1588 1531 1477 1444 1416 1400
366 1400 1431 1491 1508 1453 1397 1412 1473 1497 1458 1401 1369 1359 1362 1383 1421 1449 1448 1433 1436 1470 1517 1551 1560 1553 1552 1571 1613 1662 1694 1680 1610 1512 1429 1387 1381 1410 1479 1561
362A561L1n7r8o2oKk7l9k6k0l2l2rKj6l0j8lk4n7m8PL7Pm4n6k2J0J3MjNJ6K5J5k4n9n3k3j2
357H37l2l5jL0K3LRL0K4j5m7m0qJ9J5j4l7k9OK8J9OQRqk2qK3L7K3%j3oK4N1L2l2q2p0k7oj2
352G12j2%LKJ8L7K9nk7l3l6k2K2O3M6rl8k2j1k0qK4J0n2p0J2J01Q7Lm6l1j1k0k5lK5L5L0J7
347G75JKK1J9k8p0m7J2K7j2l1QM1K0k1j7J8L1J2qj2k0m4n8l8OL9M0J8JLJ1J1jj0j4j3nJ5K9
342G11J0m5q5p1j9J3PnJ5M8N7L5J7J9K5J2rk5m0n4m5JM5M1Lj9r%nML0L7Jm1m9l5k3rJ6L6L5
337F30K7L0L0Qj3j0Kpk3j5NQlmrm0o9n0%K0mk2j0JlNL4M4K6J8M3O4M3Lj0k%j2k5l4m3l5j2
332E86PRJ4K9L7K1nk2l6m4k9PK4MoK3M9K2l3m7j3J6J3LNnl6m9k1K0K7lk8j7J7M2M6M0L4J9
327G20rk6oK4Qn6r6o1RL9K6K3L8L8J1j6k5l1l1nM1N8J8l7n4k4RJ1j4l0j7QJ0j0k1qO%lK1N2
$$ plain form
362 1561 1592 1535 1437 1375 1369 1371 1344 1305 1279 1259 1227 1195 1186 1188 1172 1142 1124 1121 1097 1040 992 999 1036 1043 999 943 921 931 944 948 947 952 968 993 1008 984 925 872 849 837
357 837 805 770 769 799 822 825 834 864 888 873 826 786 778 797 812 798 761 732 738 766 785 791 799 808 800 778 770 793 830 853 853 840 834 858 909 941 909 827 757 730 724 712
352 712 700 700 703 705 723 760 789 784 757 724 688 666 688 751 797 788 750 728 717 697 689 713 723 671 601 613 714 801 804 758 727 716 696 671 668 693 728 758 775
347 775 776 778 799 818 790 720 673 685 712 700 669 677 718 738 717 700 718 749 761 753 741 721 677 619 581 587 626 666 684 685 688 699 710 709 699 685 672 667 682 711
342 711 721 676 591 520 501 514 521 516 531 579 636 671 688 707 732 744 735 710 670 616 571 572 617 658 661 642 633 633 628 632 662 699 700 659 610 575 552 543 559 595 630
337 630 657 687 717 725 712 702 704 697 674 659 664 672 669 665 656 616 547 497 497 517 513 491 481 482 479 484 518 562 588 606 649 713 756 759 749 747 747 735 710 676 633 598 586
332 586 593 602 616 645 682 703 698 676 640 596 567 574 598 602 596 619 668 690 657 610 597 613 626 629 634 629 593 544 523 543 570 567 539 522 539 581 627 667 701 720
327 720 711 685 679 703 711 655 559 498 507 546 572 595 633 671 682 666 641 610 579 574 615 673 691 654 600 576 585 596 582 552 535 543 553 543 522 514 520 520 517 538 590
322E90M5Ok2k2k2k9j3K8N1K7k1m2k0J9M5L5j2o4p8m5mJ3J6J9J8Mj3j6kJ8L4L9K5%j6j6j7k1
317E37j4QK1Qj7j8J7O0O6K3m0o2l2Jlj9KL9K9k1l5PM3J9k3k5nlj2mLqj2K4N6K7l6o2l7pJ0
312E05L6N5J5o4q8k2N5O4K6Jpl3n9m0J7M9L0joJ0K4K2J0j2l7m3k4NJ9J5RJ9L1K0j7l8k1J1
308E36J6rl0j7QK1J7%k1l6k6JJ6NrpmnQM5N8J7m5n3jL9K4omJ2jk9k0L0O2L6j9m1k0J6K7J2
303F03j1k3j6QL4L7Rl1n0l9j0J1J8J5Nj2l1l2mL8O2M8Qk7l2pJ9K1pl6m3k3%RLorqnNK4M1M0
297E96J7qk2k4l1l5j7K2M8L3NNL6M8J2l5m5k1mpoJ0J8Pqk1l7n2l9LL5L1J6K1K0j5n8m8J5N4
292E19K3l7m9jN3O2K4k1m2l2j2koj5k5l5l3j4KLkJ2L8M5K2%JOPJ7L8M7K0j7l0k1j2rrk0l6
287D59l7lL3K9jj0J8M6M9M1M0L4Nm1q1r6p0lN6N3%l7k5%KjK3M1K1pQM8L6l8q8n1K3M6J7pO
$$ plain form
322 590 635 641 619 597 575 546 533 561 612 639 618 576 556 575 620 655 643 579 501 456 452 465 481 500 518 522 509 493 491 509 543 582 607 607 591 575 558 537
317 537 523 531 552 560 543 525 542 602 668 691 651 589 557 558 555 536 538 577 606 585 550 557 600 619 596 571 566 563 551 547 550 542 530 554 610 637 601 539 502 495 505
312 505 541 596 611 547 459 437 492 556 582 583 576 543 484 444 461 510 540 539 533 543 567 589 599 587 550 507 483 488 507 522 531 550 581 601 584 546 525 536
308 536 552 543 513 496 504 525 542 542 521 485 459 460 476 481 472 465 461 456 464 509 567 584 539 486 485 524 548 542 538 550 549 520 500 530 592 628 609 568 548 564 591 603
303 603 592 569 553 561 595 632 641 610 560 521 511 522 540 555 560 548 517 485 481 519 581 629 637 610 578 571 590 611 604 568 525 502 502 511 514 508 499 491 486 491 515 556 596
297 596 613 605 583 559 528 493 476 498 546 579 584 589 625 673 685 650 605 584 580 573 567 577 595 602 594 573 536 484 445 448 483 514 530 551 571 556 498 450 465 519
292 519 542 505 456 455 508 570 594 573 531 499 487 485 479 464 439 404 371 357 359 362 360 372 410 455 477 477 478 484 491 508 546 593 613 596 566 545 533 524 515 495 459
287 459 422 419 452 481 480 470 488 534 583 624 664 698 703 662 581 485 415 412 468 521 521 484 459 459 461 460 483 524 545 538 546 594 630 592 504 453 476 522 539 532 538
282E38K0J0j4k6k4j7mJ5L1K9J3oj5j2olkKRQj%J4J5j5m3l2J2L0Oj6KL1K1j8l8j9QJ2KkKlj3
277E01j9k5l4m2k5K3O8P2K7j7j5J2J4j9l9j9kk1m1rN1O4K6%J1J7j1l4k2knnK7N6L8j0k9j4
272E48Jkj1k6n3o3k2L7N1J3qJ9M6K2k5l5j2Llj0nPJ2Oj5k9pM7Q0M7k4o7n6k3NK0K1PmJ2M4
267E48N3K3k0m1m1k8kK4K5rl3j2K8L0lj8RL4K1pqNol8m4j7ONOK4K8kl4k0J9L1Pj0NK6J6k4
262E56o3o7j8N3Q9N8J1LK4Rm4o7k3K4Rl8m8oL4M3L6K2pm1m6k1oj1LN2P8L0n1p2j8L0Kn2m9
257D18J0M8K4rMM1M2Mj9lK2J9Lnj3l2m6l6qJ5K4K2J0rj8%K7L0%k9l2oK9N1M6K1lppk2m3m2
252E21k4j3j5j1LJ4J4J7L0K6ql6k2K0L9K1kjJ7K3Pk4m8m4j5J6K3J6J8K6J3k5m9k3L0N7M2J6
248F49J2J7Nk0l0j4J1K4J5j7m8m9j6Qk2p9r5l8L9P0M8J5KKKmj0nJ1K6K1JpLKj9l0JN2P4M8
$$ plain form
282 538 558 568 554 528 504 487 483 498 529 558 571 565 550 538 532 529 527 529 538 546 545 545 559 574 559 516 484 496 526 532 516 518 549 570 552 514 495 503 515 517 515 517 514 501
277 501 482 457 423 381 356 379 447 519 546 529 514 526 540 521 482 463 461 440 399 390 441 505 531 531 542 559 548 514 492 490 485 480 507 563 601 591 562 548
272 548 549 547 536 510 457 394 372 409 460 473 465 484 530 552 527 492 480 483 480 470 465 472 484 490 475 446 439 486 566 613 589 522 466 443 448 468 489 496 492 504 548
267 548 601 624 604 563 522 494 492 516 541 532 499 487 515 545 542 524 533 567 588 581 573 578 572 534 490 473 479 484 490 514 542 540 506 486 505 536 543 533 538 564 580 556
262 556 493 426 408 461 550 608 619 622 646 655 611 544 521 545 554 516 468 462 496 539 575 597 590 549 503 482 476 465 468 520 598 628 577 505 487 517 519 467 418
257 418 428 476 500 491 495 536 578 582 563 560 582 601 604 599 586 554 508 472 464 479 503 525 535 526 508 508 535 565 565 536 504 498 527 578 624 645 642 635 628 606 563 521
252 521 497 484 469 458 461 475 489 506 536 562 554 518 496 516 555 576 574 573 590 613 620 596 548 504 489 505 528 544 562 588 601 576 527 504 534 591 633 649
248 649 661 678 683 663 633 619 630 654 669 652 604 555 539 547 525 446 351 313 352 422 470 485 487 489 491 487 477 472 483 509 530 531 524 527 529 510 480 481 533 607 655
243F55pn9p6m0K2M9J2l2j8L5N9L7J3Pj4m8m4OM5L2Mnj0l4l8NM6K7k6m2j4jj8j9J1K6Lk2j8
238E09j1k2k7OM7N2K1jllpmjj7m5n2k2QJ4J7L8N5K7l4o8m4JK4K2J6J7J7J7J8Pk4m8m0j3pk0
233D20j5J6M0K6kj4mQJ1Onj2r%klJ7L4J2m3o4j6M3M6Pj3%J2RJ1J5ll0l4qRQJ5M0M8J7k0k8
228E45rJ5L3L5J2k1k5LK1Oj7j3NNj2j3NJ7Mj7j9mJ0Jk2l4j8OJ0pk5l1k6j0K1M6L2j0l0oJ5
223D78jk4pK5J6l1n4k0L1N2L9J1j7k7pK9L9J4j5j2Kjj8j8RL7M4J9k1m6k6K4L8j7q0o6J7O2
218D78J0o3n8J4M8J9qJ1L5J7lK0N6L5l3p2n3j5OJ4K0Rj5j8J0L2K3Loj7l9n0k3J6L0K2J8J3
213D86rl0k2PJ8NJJ6K7J3pj5j2nQK2K2nl9n8n1k5%Qjj2pJ1K9L4K6J0pj1lLjjQOj4k0J0M0L7
208D92J1J0K9K9%k1j6j3j7nK4K5j7m6j9L7N0Rl2l4j2MNMOjj9k8jM2N0Jm9m0J7M9L2J4K6L4
$$ plain form
243 655 648 589 513 473 495 544 556 524 506 541 600 637 650 657 643 595 551 557 602 634 638 633 623 589 551 556 602 629 603 561 547 546 528 509 520 546 549 527 509
238 509 498 476 449 455 502 554 575 574 571 568 561 557 556 539 494 442 420 428 442 459 497 552 579 545 477 433 434 458 480 496 513 530 547 565 572 548 500 460 447 440 420
233 420 405 421 461 487 485 471 467 475 486 492 487 475 466 466 464 461 478 512 524 481 417 401 444 490 497 484 484 496 505 516 531 528 498 464 456 465 473 488 528 576 593 573 545
228 545 536 551 584 619 631 610 585 588 609 615 598 585 590 595 583 570 575 592 596 579 560 556 566 567 545 511 493 499 509 502 477 446 420 410 431 477 509 499 469 463 478
223 478 477 453 446 471 487 456 402 382 413 465 504 515 498 471 464 493 532 546 531 519 521 520 502 484 493 530 574 593 572 526 500 524 562 545 465 399 416 478
218 478 488 425 367 381 429 448 440 451 486 503 500 520 576 611 578 506 453 438 444 458 478 487 472 454 464 496 519 522 516 499 460 410 387 403 433 455 473 486
213 486 477 447 425 432 450 455 456 472 499 512 505 490 478 473 481 503 525 520 481 423 372 347 347 355 354 342 335 346 375 409 435 445 438 427 424 427 426 425 433 439 425 405 415 455 492
208 492 503 513 542 571 571 550 534 521 504 499 523 548 531 485 466 503 553 562 530 496 484 488 493 497 503 502 483 455 454 496 546 547 498 458 475 524 556 570 596 630
203F30Jm4n1j7J3K2J6Lj2j7pJnmJ4K2ll0pM8N9%n6m8LK6kl4l0jJ4nk7k2MJ8Lj0NL1L3J1ol
197E36Jj2k9l2k3pQJ2Lj4j7mJ4J7Pqk1l1l0qK9N4L8j5n9m9KL9L6K0J4Oj7k8nJ8Oj8%M6O1K8
192E68kKOj8m3l5j1lML4N0J4m9o4j9K9K9J1J2K8K3%j1okj1k0k1k8l9k6J4M4K1l3m3J7Q1Q0
188E83L0qrqk6m0k6JJ2Kj7l2j9K6P4O8Nm8l8NJ7j0j8J3M6K7l0p1n0QN5N5K7J6K3Ql9o8l0L9
183E53N3pp1o4KO5P4L1k6n3m7k7j9j3QL2K4jKL9N5K1k3k3MMj9j9J0J4k6o4m8LK9J2j8l2k8
178D07j8lJ1K5M1N4M4Qk6k9j1kj2k1j6j0qOL6M7J3m6o8k4N1Q7N2k2o7m9kJ9ll5l1KL1L3J3
173D77jMK2K7Ok8m1k2J0K4J7J1J4K7L5L1J6%j0k0m0o1n3j9J4K0J3J6J9Mj6k6k8l5k9OM3M0
169D67Kk5j9pnLK2K7J5PJ0Mj5k1rj8n6o2jP0P1J2k2JK7J3k0k9rJ1J4Mj3k0lL2M8K0k8n4l1
$$ plain form
203 630 631 587 536 519 532 554 570 573 561 544 537 538 533 529 543 565 562 532 525 573 632 632 576 528 531 557 555 521 491 490 504 499 472 450 454 472 475 465 470 501 534 545 539 536
197 536 537 525 496 464 441 434 442 454 457 443 426 422 436 453 460 452 431 400 370 362 391 445 483 468 409 360 362 401 437 457 471 477 460 432 427 445 451 433 433 479 540 568
192 568 566 568 574 556 513 478 467 464 468 502 552 566 517 453 434 463 492 503 515 543 566 566 555 549 547 536 516 495 467 428 402 416 460 481 448 405 422 503 583
188 583 613 605 596 588 562 522 496 497 509 511 494 462 443 469 543 611 616 568 530 535 552 542 524 537 583 610 580 509 459 467 522 577 604 620 643 651 612 544 514 553
183 553 606 599 528 464 466 531 605 636 610 557 510 483 464 451 459 491 515 514 516 555 610 631 608 585 589 593 574 555 565 579 553 489 441 444 473 485 467 435 407
178 407 389 386 397 422 463 517 561 569 543 514 503 501 489 468 452 442 434 440 476 523 536 490 422 398 449 536 588 566 499 450 448 467 464 429 398 400 431 464 477
173 477 476 480 502 529 535 507 466 444 454 478 495 506 520 547 582 613 629 629 619 599 559 498 445 426 440 460 473 489 508 512 496 470 442 407 378 384 427 467
169 467 469 444 425 418 413 416 438 465 480 487 497 501 486 465 456 438 382 320 319 389 460 472 450 451 478 491 471 442 433 444 458 462 449 429 426 458 506 526 498 444 413
163D13J8M8L1j9n7n6k5PK5L0K4J6J7K7K3Jj9j0Lj3m1m0kL2K8Mj0qLK0L4K7ll1k8qJmpjlrL
158D41M1P2N3ml9k5OPj1j5mj6m5m3PN2L8j1k8nJ7Oj6k4j5LJ5Pk2m2k7%ROJ7L3K2j1k2oJj0
153D12qJ2Rk6m7k3J3L0L9O0N9J5l0k3J7L2Nk6l6k6LL7M8J3l6n3l0MK7K8Lk9k9J2M5K2j9j1
148D93M6P3L2l2o0m0kK7L2Qk7n6p0o9l6K8P3N3ql8j9KnoK0L3%l6k5J2J6j1j7J8M0J2l3l9K
144C91L9K6j3l0nK1J4onJ6J8%oRJ1j6l9k1J9M6M4K4kj6nK4K8ml7l2nJ0PQJ0MpnKJj1k0k8m1
138D18m6k3J4L5L2K3J7OnOK5K3mj7ML1K6ll0l6k2QL3L3Oj4PN0O5L1k7o4o5m4j5J6M0M3K6J4
133F17J6J1j8l6j0K8Rn9p8qO2L5m5n6J4N4Mn7n2oJ0JJ4M2M1J1j1k0l8n2l3MJ7QJ2K3Kn3p1
129C32j5O1Q2M1ql6m7l5LM7N8L8J8J3J5K0K6K6Nk6l9k8j2j2j5j1nnjPMj4k5j1J1Qj0qJ9L5
$$ plain form
163 413 431 479 510 491 434 378 353 360 385 415 439 455 472 499 522 523 504 494 497 484 443 403 401 433 461 465 455 447 450 470 504 531 528 497 469 461 462 458 451 450 447 438 441
158 441 482 554 607 603 564 539 545 552 541 526 522 506 461 418 425 477 515 504 476 471 488 494 478 454 439 442 457 464 442 400 373 373 382 388 405 438 460 449 427 421 422 412
153 412 404 416 425 399 352 329 342 372 411 471 530 545 515 492 509 541 546 520 484 458 461 498 546 559 523 470 440 444 471 499 502 473 444 456 501 523 504 493
148 493 539 612 644 612 552 512 510 537 569 577 550 494 424 355 319 347 420 473 465 427 408 410 405 399 419 452 452 416 391 403 419 408 391 409 449 461 428 389 391
144 391 430 456 443 413 408 429 443 437 432 448 466 466 460 469 480 464 425 404 423 469 513 537 535 519 514 538 566 562 525 493 488 498 505 513 523 527 520 515 517 518 507 487 459 418
138 418 372 349 363 398 430 453 470 476 471 477 502 525 521 504 508 539 565 562 532 496 474 482 515 548 554 540 547 597 662 693 666 602 537 493 478 494 534 577 603 617
133 617 633 644 626 590 580 608 617 558 480 472 534 569 524 468 482 536 540 483 431 425 435 436 450 492 533 544 533 513 475 423 390 394 411 419 431 454 456 403 332
129 332 317 378 460 501 493 457 410 375 378 425 483 521 539 552 567 587 613 639 644 618 579 551 539 527 512 501 496 491 490 497 501 487 462 451 462 470 460 452 471 506
124E06J6j8k9rJ2J0npJ3L7L8J0j8k1q%jMJ4J5J3K0L5K5k1n5m4pJk6l3jL3K7jj4j3k3l8k4J8
119D31M6K9j4m2m9m0j3L5O3M0j0k6ML1J9qj4l%oj0j1j5rJ2K4Jk8j8K8M9K3j4k1j2j2j5pkk3
114D13n7o0k1K5M4L7K9L0K3P%J8L1Ln6p9k7M7O7K9njMj7l2j2J5K0J2K1L2J6j7k1MJ8Nj5j8
109E12j6j6rLMj0k6k2jK2K8J6oj4JK2K4J0mj2k9l5j0L4N0J8k7m2k0J9N8O8L5k5p0p6n4k0J5
104C95L2J6j4k1JJ1lj1J2L2J7lPL4K7j1l0oK4K1pk8k6j2rj6k0qLrl0k2K8N9K3l9n2nL4K8P
99D29J0J5mk5j4J0%l6m2RP3R3P0M0J6j6m3m2nK1Mm0n9l9j1jKPNj1k5qK8N1M5L0K1J7Kj3k1
94E43k8m5o1m6JM1L1j6m0j9J0RqLL5M5J7j9l0k0lJ3J6PRL4N4K2m0n0MM4J1l9l2OJ3nPM1L9
89E54pl8l0j6k1j3K7N6M2Mk4l6m6m6l1j9j8rJ7L6L2J3krj1jJ1J0j0k5k2j3%K3M9M7J5j0nO
$$ plain form
124 506 522 504 475 466 478 488 483 476 489 526 564 574 556 535 527 527 526 530 544 559 572 592 627 652 631 576 532 525 526 500 467 466 499 526 525 511 498 475 437 413 431
119 431 477 506 492 450 401 361 348 383 446 486 476 450 454 485 504 496 482 479 479 473 463 452 437 428 440 464 465 437 419 447 496 519 505 484 472 460 445 438 436 413
114 413 356 296 275 300 344 381 410 440 463 470 470 488 519 522 466 387 360 407 474 503 498 497 501 484 452 440 455 475 487 508 540 556 539 518 522 540 545 530 512
109 512 496 480 471 474 478 468 442 420 419 441 469 485 479 465 466 488 512 522 518 506 477 442 432 466 516 534 507 465 445 464 522 590 625 600 530 454 400 380 395
104 395 427 443 429 408 409 420 417 406 418 450 467 464 471 505 532 521 491 485 509 530 523 495 469 457 448 432 412 404 407 398 368 346 374 433 456 417 365 360 394 422 429
99 429 439 454 450 425 411 421 421 385 343 352 425 518 588 628 644 628 585 543 538 559 563 523 464 425 414 413 415 422 427 416 391 383 411 462 507 537 558 575 577 564 543
94 543 515 470 409 363 364 405 436 420 380 361 371 380 372 375 410 455 472 453 423 403 400 413 429 436 445 479 533 555 515 465 469 513 524 485 453 459 472 467 474 515 554
89 554 547 509 479 463 442 429 456 512 554 558 534 498 452 406 375 356 338 329 346 382 414 427 425 416 405 404 415 425 415 390 368 355 355 378 427 474 489 479 474 480
84D80%j7k6k4j0K5N5K7m6q1l0M2N0J7J5M5L7k3p3n6NM8N0K1j3k4rLqj9mK1J4j7k5jJ6PnjN
79D71jmNJ2J4J8J9ml7l9qJ4NpPK2J5Jjjj8l3k2lNRK5L2J1j4j2Kj2m2m1%L7K7mj6kOpk5k0J3
74C97M8N2K3j1k4j9j7j5%L1N2M3Km4o2l9%J2qk7j1K9N2L7%k4k3JK4K4OqnKnj2JK6L2Kl8m7
69D57k1J5J8qk9j6J6K5Mj4j2mlkPJ6J7J6Rj3l7k7J3L1Nj9jK6J8%J8M7K8k8n1k6j0j9oM4P2
64E56L1k6m2l4n2p5m8J5N3L9J4J7K9K5OlPK5L0Rl1o0m6mK7K2kj7rQOj7l7j7L1N3K0l3m3nL9
59D61M4J3k4l4j1J9J9j2l2j2K0K9Pj6k9l5j8J5L4J8OL6P2M7k0l7J2L5j9p7n4RK5j1k6lOql
54D46L0L5qm5k1K2J9j9l3mK6K7J6J1J1Q%j3l3m0k0OQjJ3M6M3ml3nL3J5l4m7j7Lqj0MJk2j7
49C89K6N0K1kL1O4K0o7r1l2K8K7%j3j3j6lK3L3J6LJ1Jl4m7kM6L4j6k7K0N9M6Lk2j7PL0L4J7
$$ plain form
84 480 480 463 437 413 403 428 483 510 464 383 353 395 445 462 477 522 559 536 463 407 412 460 510 531 518 494 485 488 480 461 457 478 492 475 450 449 465 472 467 466 471
79 471 470 466 471 483 497 515 534 530 493 454 446 460 465 458 465 487 502 503 502 501 483 450 428 425 430 439 464 496 507 493 481 483 471 429 388 388 425 452 448 432 430 436 429 404 384 397
74 397 445 497 520 509 485 466 449 434 434 465 517 560 562 518 456 417 417 429 421 394 383 412 464 501 501 477 454 455 479 503 509 501 496 498 493 481 482 508 540 542 504 457
69 457 436 451 469 461 432 416 432 457 461 447 435 431 428 426 433 449 466 482 491 478 441 414 427 458 463 444 443 469 487 487 505 552 580 552 501 475 465 446 440 484 556
64 556 587 561 519 485 433 358 310 325 378 417 431 448 477 502 508 505 512 537 567 576 545 485 439 435 462 484 482 465 456 464 470 453 416 399 430 483 503 470 427 422 461
59 461 505 518 494 460 449 468 487 475 443 431 451 480 487 471 442 407 389 404 438 456 462 498 570 617 597 560 572 607 588 511 457 466 491 480 454 451 457 449 446
54 446 476 511 503 458 437 459 478 459 426 422 448 475 491 502 513 521 521 508 475 435 415 421 429 428 441 487 530 526 493 488 521 536 502 455 438 441 433 423 427 428 406 389
49 389 415 465 486 484 515 579 599 532 441 409 437 464 464 451 438 422 419 442 475 491 494 505 506 472 425 423 469 503 487 460 480 539 585 588 566 549 556 586 620 637
44F37rk4l1m4o2o1l0J7N6N6J7k9l7lJ9jk4oL3M4K8J7Qk8o0m1J4L3Jk3qMj8l5k2ok0k7%K8J3
39C76j0QM9N7L5K4K0nm0l8KL0K2kk0l4l7j7J5K3J1RK0K2J9K1J5k6p0n7QN0L4PMml7m8nM3L8
34E12lk7k5k0j2J7M0K5KJ8N1K9n4j07p4OO0O2L1j0m4n1l1qJPK1L1K0mrJ5M6M4%m9m4J8O2K5
29E71n2p4j9L2J3l8m3mJ8JpJ3K9Ml4l6mK2K2J4J6K1J5LLQNj4k8j9PK6K3QLJ5J9jk7l2k0k8
24D31n1m7jM0K5j0MN6P7L8j3l4m4o3o2k4J3J5NK0M0L5K0L1M7J9m0n6j1L4K9pk2j0J0J1j1m6
19D48n4j6K9K3j6j5L4N7J6l7l4%Kk3k0J8M3K9Jj4k4k2JK8L5K3K5L9J7m4p9l2N7Q5K7m6n4r
14D98J5rm2l8j2ORJ0J1KpkJ3K5L3N2N4J5m5o9m1lRJ0Rk1p6r6l2N4P7L6PK1L1%m5n4j5L9O9
9D98N4Ml7l5nJ1nk6k5lK2L0Ln0p2k4N0O7J5l6k7J5M2M0J6k5o4o9l5oj1k2mK1J5qjL7N6L1q
$$ plain form
44 637 628 604 573 529 467 406 376 393 449 505 522 493 456 453 472 471 447 441 474 518 546 563 571 543 483 442 456 489 490 467 459 463 445 410 388 382 362 335 335 363 376
39 376 366 374 423 480 515 539 559 554 514 476 478 508 530 528 508 474 437 420 435 458 469 478 498 520 539 560 575 549 479 422 430 480 514 521 525 521 484 436 431 474 512
34 512 509 482 457 437 425 442 482 507 509 527 578 607 553 446 372 378 438 500 531 521 477 426 395 387 388 395 416 447 467 463 454 469 515 559 559 510 466 484 546 571
29 571 519 445 426 458 471 433 390 386 404 405 398 411 440 444 410 374 370 392 414 428 444 465 480 483 486 494 499 485 457 438 445 471 494 502 505 520 539 538 511 479 459 431
24 431 380 333 332 372 397 387 391 447 524 562 549 515 471 408 346 322 335 350 355 375 415 450 470 501 548 567 527 471 460 494 523 516 494 484 494 505 494 448
19 448 394 378 407 430 414 399 433 490 506 469 435 435 437 414 394 412 455 484 485 471 447 425 426 454 489 512 537 576 593 549 470 438 495 580 607 561 507 498
14 498 513 504 462 424 412 418 427 437 448 450 443 441 454 479 512 564 618 633 588 519 478 475 484 494 503 482 406 310 278 332 409 445 452 473 504 504 459 405 390 429 498
9 498 552 556 519 484 479 490 485 459 434 431 453 483 486 436 364 340 390 457 472 436 409 424 466 506 522 497 433 364 329 323 312 290 286 307 322 314 313 350 406 437 429
4D29k5k7l4m6l4J2O5P7L3k6l7RN6N8K4qj9k2k9k5mK6M7M4J1l0m8k8RL1K6QkPK1J7pk6j6PM
-1E28k0k8j1%rj1PJ8kk3j2J7K8K0J3J1OLPjk8m5k5RJ7PJj0m1n3oN4N1ol7j9j3l3k6L5P3L1
-6D77l0k9J7L7J8K%k1m2k3K9M8J6j5nPj7n0m1ML5K4Jnlj1k6k1J3N2N6K2j5k6j7j4k3k6j1J0
-11C97K0J9J6J0rl0l1KL8M7J8j1j6JJ0kl0m5k8J7M7K7k0l8LN0N1Rk0j7kKJ0K2J9jj7k0l1n3
-16D14n6k3J5K3J5K0L2K0pj6LK1J2pj4OL9N9L4l4r0p8nO4P7M1Lj6k2l7n5n7k9PJ7JmK3N0M5
-20D91J7mqlRK4K0j6m3l1KNj2oK3J5l3n0QP1O1rm9k4J0Rk0l9l0JL8N3K8j6l7k2LJ7J1lj4p
-26D40K2M5K8j8m3k1J1J1pmJ0qn6o7j6M8N3Ml4l6k7k6j1L0O4N1Pj6J0N9Q6O0j0p6r0m6JNj4
-30D19lL1L5j0m9l1J4K1j6m2k3J2K2KrQL4L3Qj3j2j0k5m2k6J1L3K6J5Rlj0NL5L4KqK3L9jm6
$$ plain form
4 429 404 377 343 297 263 275 340 417 450 424 387 396 452 510 534 526 507 485 456 431 427 453 500 544 555 525 477 449 458 489 515 523 521 528 549 566 559 533 517 524 528
-1 528 508 480 469 469 460 449 456 474 472 449 437 454 482 502 515 526 532 535 542 541 513 468 443 452 469 476 477 467 426 373 367 421 472 466 429 410 397 364 338 373 446 477
-6 477 447 418 435 472 490 492 492 471 429 406 435 483 499 484 479 486 469 419 378 382 417 441 442 437 434 423 397 376 389 441 497 519 504 478 461 447 424 398 387 397
-11 397 417 436 452 462 453 423 392 394 432 479 497 486 470 471 481 479 449 404 376 393 440 467 447 409 412 462 513 522 502 485 483 485 495 517 536 535 518 498 467 414
-16 414 358 335 350 373 388 408 440 460 453 437 440 461 473 466 452 458 497 556 590 556 466 388 383 447 524 565 568 552 530 493 438 381 352 359 376 377 373 396 446 491
-20 491 508 504 496 493 502 526 546 530 487 456 458 463 451 445 468 483 450 400 408 479 540 531 482 458 468 477 457 418 388 389 427 480 508 492 455 433 436 453 464 461 447 440
-26 440 462 507 535 517 474 453 464 475 468 464 474 466 410 343 327 375 428 432 398 362 335 309 298 328 392 443 450 434 444 503 589 649 639 563 473 427 428 433 419
-30 419 416 447 482 472 423 392 406 427 411 369 346 358 380 382 373 381 415 448 456 443 431 421 396 354 328 339 372 398 413 422 419 409 414 449 483 485 477 500 539 538 492
-35D92k9K6L9Lj8MK0lk8j2J5Qk7n3n3l9j7K2O1O7L2j5l2qK8L7J7LQMl6p3m4L5P4K6n0o3j5
-40D06K1J0j9k7j6JJ7K3Qk3l4j0K5L7K2RQMj0j8kK4K4kj6OL0K0j3k0%Oj7l0j1J3QpoNQJ4L7
-45E05M0no0o7k4J0J0NJ4K3J9J7Qk9p2o1LM1Ln1m5LK6J9K2M5M7K4J3K5K4j3n6p4n5j1M1O8
-50D32M3rl2pJ1mk4rJ2pn0n3jN5O6L1j1l3l3k9k3JN0Q2M1n5j16q0MM9M0K9K8Kl9l3K8O8L9
-55D63ojK8J2l8n1j1K1J1j3j4plK0O1P2K1l9m6j2Jj8k0J0L3J0l1m4k8qPK5M4M0Qk8m2l5j3
-60C79J8N1P2O2K8j1k5rJ0km0o3l9LQk6l8ON1L4k4m4j2K3K6K6M2L7pl5kM3K8l2n3j3K5J7o
-64E08j2j2j8j1J5J8j7n1m0j5j1j4J4M9M5J2nPK5L8N3N1nq1j02n3MJ4JRK4J3k1l5j1K0K5J
-69D32j9qK6M4J8k4l6j9mkJ6M5M1rm8k9K0L8J5j2j6nOkk9n0l1K6O3M0JNL4K3l2n1rK8pp3p2
$$ plain form
-35 492 463 489 528 531 513 517 537 534 506 494 509 517 490 437 384 345 328 350 411 478 510 495 463 455 483 520 537 540 548 552 516 443 399 434 508 534 484 421 406
-40 406 427 437 418 391 375 376 393 416 424 401 367 357 382 419 441 450 458 462 452 434 432 456 480 478 462 468 498 518 505 485 485 491 474 444 433 446 454 447 441 446 454 468 505
-45 505 545 540 480 413 389 399 409 414 428 451 470 487 495 466 394 333 336 377 380 329 284 287 313 332 354 399 446 470 483 508 532 519 463 389 334 323 364 432
-50 432 475 466 434 427 438 434 410 401 413 406 356 303 302 357 423 454 443 410 377 348 325 326 376 458 499 444 328 248 252 301 341 370 398 400 361 328 356 424 463
-55 463 457 456 484 496 458 407 396 417 428 415 401 394 391 411 472 544 565 526 480 468 469 451 431 441 474 484 453 409 381 373 380 405 449 489 497 469 427 392 379
-60 379 397 448 520 582 610 599 574 565 575 573 533 470 431 434 442 416 378 384 435 469 445 401 389 412 438 464 506 543 536 501 499 542 570 538 485 472 497 514 508
-64 508 496 484 466 455 470 488 471 420 380 365 354 340 354 403 448 460 455 462 487 525 578 629 624 543 441 388 392 406 407 416 440 453 432 397 386 406 431 432
-69 432 413 405 431 475 493 469 433 414 410 408 424 469 510 501 453 424 444 482 497 485 469 464 470 468 439 389 358 384 447 487 488 493 527 550 518 467 458 486 479 406 334
-74C34J1P8N3l5q1l9L8P7O1L6K0%k8l7j8rl2n7m0NK5J6J9M6M9Ko2p6k6M1P0M4NlJ6K2Kj0l
-79E14j3n9q1k5N1N6Lj2L4M7k2q5o1J7N0K8J3K3K8J1nnJJ3K4J2l0o8n3oK4K3J7K4K7K2K0J9
-83E76jk8l4k4l0m6l5J8O5N9J9pjPml0m1k7pqk2j4K5O0N2L0L0L9J5k8l0K2N0Lp3r4m3K1N1
-88E15N0L8K2ol6n1m9m0l7l2mM0N3J2m0m4JL1J9pj3lNJ8L0L0J1j2k6m6n5k5L5N4Ql8j8L1K6
-93D47k6m6nM3M8K6Omj5j0OJ0mj4kPnj8qOol4l5oJ8Rj2pJ7K5Jj2J2M5L9Jk1j2qk9l2J0M7K6
-98D78k8m1rJ6J3J3K0on2n0K0P1K3p0j01m5K0L8L0K6K5J7QJ1J6Qrk6l8l7j8J3K9K7J4MJLL
-103D17jrj0NK3K2PmlmpLK3K2j0m2l4%J2j4l5j2L8N7K2k5m3k4kJ2K8M6M7K1j3l8m5l9j5J3
-108C89K2NmJ3L4J6l1n6k8K1N2L6k0p9q8k6N6Q6N1Qrj8l3l0JK3Ok0j2K4M3L5J8Kk2l7j9J4
$$ plain form
-74 334 345 423 476 441 360 321 359 436 497 533 553 553 525 488 470 461 429 372 332 337 362 378 397 443 492 494 432 356 330 371 441 485 490 487 503 525 527 517 514
-79 514 501 442 361 336 387 443 446 434 468 515 493 408 347 364 414 442 455 478 506 517 512 507 508 521 545 557 527 459 406 400 424 447 464 488 515 537 557 576
-83 576 575 547 513 489 459 413 378 396 461 520 539 532 531 538 534 504 463 436 429 421 399 385 410 470 522 552 582 621 636 608 578 600 650 653 580 486 443 464 515
-88 515 565 603 625 619 583 532 483 443 406 374 370 410 463 475 435 391 392 423 442 435 422 419 424 442 472 502 513 501 475 429 374 349 384 438 446 408 390 421 447
-93 447 421 375 370 413 461 487 493 489 474 464 470 480 476 462 460 467 462 444 436 442 436 402 367 361 379 388 376 369 386 411 412 400 412 457 496 497 476 464 456 427 395 405 452 478
-98 478 450 409 400 416 429 442 462 456 404 354 374 445 468 398 297 252 272 310 340 366 391 408 416 427 443 451 442 416 378 341 323 336 365 392 406 410 411 414 417
-103 417 416 407 397 402 425 447 454 450 447 443 436 439 462 484 474 432 398 398 410 396 361 349 387 444 466 441 398 374 372 384 412 458 505 526 513 475 430 391 376 389
-108 389 411 416 412 425 459 475 444 388 360 381 433 469 449 370 282 256 312 398 449 457 448 430 397 367 368 391 397 377 365 389 432 467 485 487 465 428 409 423
-113D23K6Oj3rNJ1J6J1j1l0j3L0M3Ol9m1qJ6K1Rj7n5o9l2K3L5Lk7j8J0K9K9J8%j0%K4L8L3
-117D73J7Kj2j5OM1M6Mm3l9J3N7L5l9r5q0qM4L4jMM9P0L1k3m0k4j7k5k5lJ6Rj1j7kJ5J4lj3
-122D45nQRQK4L6J8k7n0j8L3M8J6l3o3o3l8mJ2MoNK5K7J4OJ3J9J3jj8l8m3j6L4O0L7j1k9n
-127D46J7j1o6p7j4N6M9j0l2OL0j0n0k5K3J8k7l2J8N7M7K0Lrj4NL4K9pj8LPk2m2k3ok1k2K5
-132C55P6P1K5j3k2j7KK6K5pk6lK0kl9m0j4mpRL1K1jMK9K5mj0PKj9j3J9J2m4p3k7L4M0Lj6
-137D35ML6N1L7Jk6j7Opm9n0J7P3N1kjL1J7n3r4n7J1M2K4j1l3l0pRLnJ0L9M2J6j0j7k5l2j4
-142D15K8M0on5m5PL2J2NL3M2lm9l3K1L4pk7LL4J6j6j3jj9m5k9J0J8nnK6L3ml2k4j0j5rK1
-147C78L2%k7j0K3K6J7L5N1K3k3k9jOmJ7O2O0km9l2MMk0k5j8k1k7j7oj2j9mK3K8J3kqj0j1
$$ plain form
-113 423 449 455 442 433 438 449 465 476 465 435 422 452 495 501 462 421 413 429 450 459 442 387 318 286 309 344 347 320 302 312 341 370 388 388 378 378 402 440 473
-117 473 490 492 480 465 471 512 558 562 519 480 493 550 585 546 451 371 363 407 441 440 444 493 563 594 571 531 507 490 465 440 437 453 462 451 434 432 447 461 458 445
-122 445 440 448 457 465 489 525 543 516 466 448 481 529 545 512 449 386 348 344 356 360 354 359 384 411 425 431 444 463 476 475 457 419 376 360 394 454 491 480 451 446
-127 446 463 452 386 309 295 351 400 390 358 364 394 384 334 309 332 350 323 291 309 366 413 433 436 427 413 418 452 481 474 456 459 466 444 402 379 373 352 330 355
-132 355 431 502 527 514 492 475 477 503 528 521 495 492 512 510 471 431 417 413 406 415 446 467 466 470 499 524 520 510 517 519 500 487 506 518 474 401 374 408 448 451 435
-137 435 439 475 526 563 564 538 521 527 520 471 421 438 511 562 560 559 590 607 554 460 403 414 456 480 469 436 406 399 408 411 406 416 455 497 513 503 486 461 429 415
-142 415 443 483 477 422 377 384 416 428 433 466 508 505 456 423 444 478 471 444 447 481 497 481 468 467 448 403 374 384 402 397 392 418 451 447 415 391 381 366 357 378
-147 378 410 410 383 373 396 422 439 474 525 548 525 496 495 501 497 514 576 636 634 585 553 557 561 541 516 498 477 450 433 427 415 396 392 415 443 456 454 446 436 425
-152D25jQPjLJ5K3K4J9J3jk1m5o2n7j9K8L4qm7k9K6N8M2Qj0j1mJ1K4J8j3m4m7k6plj1j6r%
-157B94LjNL4P0P7O1M0J9k3p2q2l4J6J0k4k4PRk5k9K4O2K7k5j9K6K8j9m3j5J4QkPJ8QKJ5K4
-161D71J2qk3l8m7k1K7L6j5n1j6M3M7J1kJ6J3j4k6j0OPKjoJK6L0j1m6k7J3Ll9m1kJ5kLL5K8
-167C99j8l2JPl2m1J4N6L1RL7N4Om1j2K7nn6j9O2O1k3n9oL7J3k0nK2J8J1K7K8j4n3m0NL3K9
-171E11Rj4k4qK3L6K2Kqj4j5jLk5n3l2J7K1k0l0J9N6K2l3m0j5qk0j9mORJ1jj2J1N8N9jl8k
-176D58M2J1m7l9K9N2Lm3k5J9L4J9kj8k5j9j4k2k4lJ6jk6mM8N2j3o4m5PK7J9J8K5J2rrJ4L3
-181D86K7J2lj1j4j9k7k5qJ0%k6k6OL1K3J7L6N0K6j4k8j8k0k9k3j2k5m5k7K9O4M5RJJ0Ooo
-186D76kj6k8j1K6L0j5o2o1k2J3J5lj7j8mJ8L3J7j6l1j3J5K1PPK7L9K0orJnl2l9j7Okj9nL3
$$ plain form
-152 425 424 432 439 438 441 456 479 503 522 535 534 513 468 406 349 330 358 392 384 337 308 334 392 434 442 432 421 417 428 452 470 457 413 366 340 333 330 319 303 294 294
-157 294 297 296 301 335 405 482 543 583 602 579 507 425 391 407 417 393 369 376 385 360 331 355 417 444 419 400 426 454 435 392 377 391 399 397 404 422 430 432 447 471
-161 471 483 475 452 414 367 346 373 409 394 343 327 370 417 428 426 442 455 441 415 405 411 418 420 419 413 414 440 470 459 413 386 399 402 363 322 320 335 333 336 371 399
-167 399 381 349 350 357 325 284 298 354 385 394 431 485 491 450 438 465 460 404 385 447 508 485 426 420 457 470 450 445 467 485 496 523 551 537 484 444 449 482 511
-171 511 520 506 482 474 497 533 555 557 549 535 520 519 522 497 444 412 429 450 430 400 419 475 497 464 424 409 401 381 362 358 364 373 384 383 371 382 440 499 498 460 458
-176 458 500 511 464 425 454 506 509 466 441 460 494 513 511 493 468 449 435 413 389 386 402 401 375 371 419 471 458 394 349 356 383 402 420 445 457 448 439 453 486
-181 486 513 525 522 511 497 478 451 426 418 428 428 402 376 382 413 436 453 489 539 565 551 523 505 485 456 433 421 396 351 324 353 417 462 471 472 482 488 482 476
-186 476 474 458 430 419 445 475 460 398 337 315 328 343 340 323 305 301 319 352 369 353 322 309 324 345 352 359 386 425 445 439 430 431 426 394 355 338 344 342 323 318 351
-191C51M7K1rj4ojRL8N5K5m0p4n1j1lj5kL2M4J9pmJ0Mj7l3l7l8k7QM9N8K8%kNnk2k0mQJ1J4
-196C94J5QLJ5K6J8J%%k3n0l0J7K5k0m8j4K9K1j0j1OJQN3Q3K8n6o1MJ6n4q8qQ6P4rm3j0J9
-201D15%k2rK4M9M2%n1o0pN3O1K3pk1l2l7k7l1o3p2qP8R4L7%K7O0M9J8QPrk3j8nqj9k1k2k8
-206D45k6%K7L4J5j2l4k9%J2j8n7m3J9O5O1M6L7J2l1m6j2J1j1l4j1L0K7nk2k7l7l1J8N7K0
-210D50n2n5J8N7Rm3k0M0M4Jj9MK2Mk5l3k4oK1M7M5J3j3j2nj4j9OL5J9l4n3j0L7K8rj7MLj5
-215D29mM4P0L4k6n8m8j3K4L4mo0o8k1K1J6LJ9L3J3j3pQj1l1nL2J3m3m7J4N2K5j4qPmj8LL1
-220D22K6mj7j8k9l7rL4M1Pj1J5M6L1j1l1k2k1m1n1k7OJ2lkJ6J6j%L4N6M2K0J8J6pk5j7j2
-225D62l5m6kN1M5MOM2L0l7o9j8L6J7l5m7k3rqRL2L5J8RRRPJ0PnpM%k8m3k2QRj1j8pJ6M0M1
$$ plain form
-191 351 398 419 410 396 390 389 398 436 491 516 476 402 351 340 337 322 320 352 396 415 408 404 414 418 401 368 331 293 266 274 323 381 409 409 407 412 407 385 365 361 369 380 394
-196 394 409 417 420 435 461 479 480 480 480 457 407 377 394 419 399 351 337 366 387 377 366 372 373 381 434 517 545 489 428 432 448 394 306 298 384 458 449 406 396 415
-201 415 415 393 384 408 457 499 499 448 388 381 434 495 518 511 490 458 421 394 363 300 228 220 298 392 429 429 456 516 565 583 591 598 589 566 548 543 535 516 495 473 445
-206 445 419 419 446 480 495 483 449 420 420 432 414 357 314 333 398 459 505 542 554 523 477 465 476 465 431 420 450 477 472 450 423 386 355 373 430 450
-210 450 398 343 361 418 427 384 364 404 448 449 430 434 456 460 435 402 378 372 393 440 485 498 485 473 468 454 435 441 476 495 461 408 398 435 463 454 437 441 444 429
-215 429 425 469 539 573 547 489 441 428 452 486 482 422 354 333 354 370 373 392 425 438 425 418 426 415 384 379 411 424 381 334 348 400 425 411 403 410 406 388 391 422
-220 422 448 444 427 409 380 343 334 368 409 416 405 420 466 497 486 455 433 412 371 320 293 299 311 308 306 322 338 337 337 371 427 469 489 507 523 516 491 474 462
-225 462 427 381 379 430 475 479 485 527 557 520 451 433 469 486 451 404 381 372 364 373 405 440 458 467 476 485 492 502 509 504 497 501 501 473 430 408 416 425 414 396 389 405 445 486
-230D86j1p4o4K3Q1L8m2n7rK8L7M2K7k2n7k4L5L6rk9j3j8l7j1L8K9l9o4j1L7K0oJ5L9J1l5
-235C90l9j5j3k4j4J6L1L2K9Pl2m7k1Kj7m1j6L9O2L6PlKJ4K3Ol4n2j8J4lm2l6J3M0L0K1K1
-239C68J0rML9M4Ml3k8nJJPJ1LpqpJK0L2J0k9l5lK1Kj9j0J9L6L7L3J5j5k9j3Mrl0l2j9j1m
-245C67J2K2Pj8j9jJ4J6K0L1K9Ml3n1l0K6O7M7k0o1l8PJ6oj7kJ2Ppk4l2j8J9M4K3j6k7oJ4
-249C78K1J8km8p3k1O4P7Jn5j2O2N6j5m3MN3M1j5o7q8o7JO8P1Om1j0N0N4%m3l6j0oj6qL0P1
-254D50Q2M4k0n8l7QJ6k6n8l4J2J8k0l5KM4L5j5n2m8k3OM2P6P9M4MmJ1Ql0p4q6n5qK9M1L8
-259D06L0K1Mj9l3j6K2M4K3k9n9l5J9M8K9mkK5L4Pk9l3j7j1k3k3KL3M3L1Nk1m0m1l2j8lJ4
-263C52K4J6nj0QK3J1j9l6k8j6lK2M8M1ol9j6L5M1rm9l1J0J4j0rJ5J5k1l5J3P4P1J5k8k3o
$$ plain form
-230 486 475 401 337 360 441 479 437 380 371 399 436 478 505 483 426 402 437 473 464 435 422 404 367 356 394 423 384 320 309 346 366 360 375 414 425 390
-235 390 351 336 323 299 285 301 332 364 393 400 368 321 300 302 285 244 228 267 329 365 372 369 371 385 408 414 380 328 310 324 321 279 243 256 296 326 347 368
-239 368 378 369 373 412 456 460 427 399 394 395 396 403 414 417 410 402 395 396 416 448 458 429 394 391 412 414 395 385 404 440 477 510 525 510 481 468 472 463 433 401 382 371 367
-245 367 379 401 408 390 371 370 384 400 420 451 480 484 451 400 370 396 463 510 490 429 391 398 414 408 391 389 401 408 401 377 345 327 346 390 413 397 370 364 378
-249 378 399 417 415 367 294 273 337 414 415 360 348 410 466 451 408 412 465 506 491 424 336 269 270 338 409 415 374 364 414 468 468 425 389 379 373 357 349 379 450
-254 450 532 576 556 498 461 469 485 459 401 367 379 397 377 342 344 388 423 408 356 308 285 291 333 409 488 532 536 532 543 551 521 447 361 306 298 327 368 406
-259 406 436 457 461 442 409 393 415 459 482 453 394 359 378 426 455 451 449 474 508 515 486 453 436 425 402 379 381 414 457 488 493 472 432 391 359 341 338 352
-263 352 376 392 387 377 385 408 419 400 364 336 320 317 339 387 428 422 383 367 402 443 434 385 354 364 378 368 359 374 389 368 333 346 420 491 506 478 455 449
-268D49j0k0j3MPKLJ2J6J5J6J1kqNK9K6j1n3o8n3k6jK3L5K3nk6j1K0L0kl7l6nJ6OrkJ7K8K7
-273D22K6J5pj9kK8L2Lk8l9l4k3nJ8L3K7J1%oj6k8k6pJ5J6nk3j5J5L2J1l1n6l9nJ7J6MLJ9
-278C49K7Ol2l8JM0K5k2l6KL2J0k9k5K1N4M3Rk0l1j5K8O3M7j3n8m1NJ7j4l6k2krk8j7K2M4
-283C57K9J0J0J5Kj7j5KRmj6j2%J2J4Lj5k3rLj0k6rL0M3Mm3n0k0J2K9L6M1M3L7J6j3k1MK7
-288D85Mn2o8k0K7J8j5qL0M0J0k0j8qqlJ4K6K0Lj0k5l7l5j4QJ8K6L8M2K2j4l7k8RL7L4Nj5
-292D81j3rj9k7qK1J9j2l3j7J0J6Omj2k8m1k9QL7M3K7J1jj5k0kK4J7l5p8n4J1L4mk3K1O1J7
-297C80o6p2K1J02Q4Om7m3nL0M2J6k4l2KL4K6j1m3n0l6%L9M0Jl4k6KJ4J7L1M7L4MnLrm4o5
-302C63m6nK4L3K4Lj1mK1L4J7j4k8rK5M2J0o0j12q5PQ1P1Rj9J2L9Pm6m6J6O4M5Jj3%lj5nK2
$$ plain form
-268 449 439 419 406 410 417 419 422 434 450 465 481 492 490 482 487 516 542 531 478 410 357 331 330 353 388 411 406 380 369 389 419 417 380 344 339 355 361 352 350 367 395 422
-273 422 448 463 456 437 435 463 495 498 470 431 397 374 369 387 420 447 458 458 452 436 408 382 375 390 406 401 378 363 378 410 421 390 334 295 290 307 323 327 330 349
-278 349 376 382 350 312 313 353 378 356 320 322 354 364 335 310 331 385 428 437 417 386 371 399 462 509 496 438 397 402 419 405 369 347 345 336 308 291 313 357
-283 357 386 396 406 421 423 406 391 393 402 398 382 370 370 382 396 399 384 361 352 355 345 319 310 340 383 387 344 294 274 286 315 351 392 435 472 488 475 454 458 485
-288 485 489 437 369 349 376 394 379 371 401 441 451 431 413 405 397 394 408 434 454 457 447 422 385 350 336 344 362 388 426 468 490 476 439 411 420 457 491 496 481
-292 481 468 459 440 413 405 426 445 433 400 383 393 409 415 411 399 371 330 301 309 346 389 416 427 426 411 391 389 413 430 395 317 263 274 308 304 281 302 363 380
-297 380 314 242 263 365 449 455 408 365 360 390 432 448 424 392 394 428 454 443 400 350 314 314 353 393 394 360 334 336 350 367 398 445 479 483 478 481 472 428 363
-302 363 317 312 336 369 393 396 385 381 402 436 453 439 411 402 427 469 479 419 307 222 229 310 381 390 371 383 422 429 383 337 353 417 462 463 450 450 447 432 427 449
-307D49L0K0K4L5On0o0j4Rm1q9n3L4P3M6J6J4J1jKK1J4k0l5nL2M1K0ql6o4p4n9l4qJ7L9M6
-312C48L3Rj2k1jL6N1J5l8m8j1K1K2J2J5J9J5PJj2k6j9MJ4Lj3k4l2k6J7P3P7K1l8m7l0k9l4
-316C52k6kK1M0N4M3Nl4n1n3m0nL9M6Qk4j6lj7k3ML1J2k1pM1N7K8mj8k6k3J3N4M3j7o0m2L
-321C82K7K6J4nj9j3J0J8RQK1K5Kk1k5k5k9k2JJ4RRK8L8Qk8k2J5K5j2n1l8K5P1N2j2m7j7L0
-326D81K1l7p8o0j5J4L0L6J5l3o1l0K3L6J1JK3L5J3rJL3N0L8Mk9m5l6j3j%J0K0Rk6m4k2J1
-330C76J7JkJ1J1j0k3j9j0j7k3j2J4L2K6Mj5nK8M6L0PJ7L6J1m9o1MO6M2k5l8LQm0n9mM6K1
-335D45l3k7K7N2K3lmrk8k1K2N4L5j0l3k8j8j2mjoj4lK0K8oo2q6l8M5P2J5n5n4LK9Jk7rK0
-340C00K3J8L0M4K0k5m5k2J1K0jl2l8oM2O2L9QJMJkRJ5LqNJ2j7n9n2OM9K7k6m3qL2L4%l2k7
$$ plain form
-307 449 479 499 523 558 564 514 454 440 449 408 319 266 300 373 419 435 449 460 459 461 482 496 476 441 436 468 509 529 521 485 421 347 288 254 246 263 302 348
-312 348 381 390 378 357 356 392 443 458 420 372 361 382 404 416 431 450 465 472 473 461 435 416 420 434 437 424 400 368 342 359 432 509 530 492 445 415 386 352
-316 352 326 324 345 385 439 482 487 453 402 349 309 304 343 389 397 373 357 354 337 314 318 349 361 340 333 374 431 459 455 437 411 388 401 455 498 481 421 379 382
-321 382 409 435 449 444 425 412 422 440 449 457 478 503 505 484 459 434 405 383 384 398 407 416 444 482 490 462 440 455 480 468 417 379 404 475 527 515 468 451 481
-326 481 502 465 387 327 312 326 356 392 407 374 313 283 306 342 353 354 377 412 425 416 417 450 500 538 542 513 468 432 419 418 418 428 448 457 431 387 365 376
-330 376 393 394 392 403 414 404 381 362 352 335 312 300 314 346 372 376 361 356 384 430 460 467 484 520 531 482 421 425 491 533 508 470 473 481 441 382 378 424 445
-335 445 412 385 412 464 487 484 480 471 443 422 444 498 533 523 490 462 444 432 428 427 421 407 404 424 452 446 384 298 260 305 377 392 337 283 286 315 316 289 280 300
-340 300 323 341 371 415 435 410 365 343 354 374 373 341 303 297 339 401 440 448 449 453 454 452 461 476 479 471 476 488 471 412 360 366 415 442 416 373 365 397 431 431 399 372
-345C72RL4K0k0m3k3J7L3J3k1l1j3jj1k0NN1O1K4j9k9j4LK1L3Qm3o4j9L2K1k8l0J8M1Mk8o
-350C57K2km9m5J5O5N5J0k4k0NK2J0j5j5J5K6rn4n2rJ8PnJ3L5L1J3RJ5Lk0k1QL3K7Nj4k4l3
-355D08l1j5LJj5j4MJ5jk0j3J9M0K9KpJ4L6K6j1l8k4J3L2J6j0j4MK0Rk4m2k4J0J6j1k9qJ6
-359C82Lk9k8JJ3jML5L6j3m8k1K1J2k5l2j4j4k7lM2M8Qj7JJ8OMK5K4k1n8l7QJ2j2nM0O4M0
-364D42Kj4j3j6j6jJ8J7j0l0j3L1N3K2l1n3l1ppj3o%rrQK6J8KPK5L1K0J2Qlk1k7k1j4qnj0
-369C54k6k6lJ3nl3j9L2O0L2j6m0l3j0J7K9Pl7n1j3L7M5K1J3K9L2jl8m5k3JJ3J3J0jrjJ8K7
-374C73Rk2l6k9mL0N8N6J0m2n2j4J5kk8j3K6L3jk6j4OJ4K7M3L2j7n5l4J2J3k6l2K4P5M9k1
-379D37n4l3j3k4l1kM2N6M5L3K6Nk5l3j4Jnj7j2%KnkPRRJ9L6L4J4jLJ3%l7p3p9m9j1J1J5J4
$$ plain form
-345 372 381 415 435 415 372 349 366 399 412 391 360 347 346 335 315 320 371 432 456 437 408 394 397 418 451 459 416 352 333 365 386 358 328 346 387 391 363 357
-350 357 379 377 328 283 298 363 418 428 404 384 389 411 421 406 391 406 432 423 369 317 308 326 333 328 341 376 407 420 429 444 447 427 406 414 447 474 479 465 441 408
-355 408 377 362 365 366 351 337 341 356 355 335 322 341 381 410 412 405 419 455 481 470 432 408 421 453 469 459 445 449 469 478 454 412 388 398 414 403 374 366 382
-359 382 385 356 328 329 342 341 345 380 416 403 355 334 355 367 342 310 296 282 255 252 294 342 350 333 334 352 358 362 387 411 390 332 295 303 315 303 298 338 402 442
-364 442 444 430 417 401 385 384 402 419 409 379 366 397 450 472 441 388 357 350 343 330 324 324 315 306 314 340 358 360 367 392 423 443 455 463 460 439 412 391 377 369 364 354
-369 354 328 302 299 312 307 274 255 287 347 379 363 323 290 280 297 326 333 296 245 232 269 314 335 348 377 409 408 370 325 302 303 316 329 339 338 329 328 346 373
-374 373 382 360 324 295 291 321 379 435 445 403 351 337 352 350 322 309 335 368 367 341 327 333 347 374 417 449 432 377 343 355 368 342 310 334 409 458 437
-379 437 383 350 337 313 282 280 322 378 423 456 482 487 462 429 415 416 411 394 382 382 384 379 377 384 393 402 421 457 491 505 504 507 520 520 483 410 331 282 271 282 297 311
-384C11K2L0K4Mk3m9n7l8%K4J6MJ2L0K3pk0ML3J9k5m8k1K1K8NpJ8N0M9J9j1l1m7n0j5L5M3
-389C75Kl0mM3N8L7J3j0m3n9l0J6K2j1k9j6kojK4M1L3K2K5J9ql1k8k1k6k1J2L8K0j7k0J2L6
-393D35K5jj6k2k4j7oMJ3K5L2K7J1%oj1j2pmj4k1j1ORnmJ6L3J4k5n1l8oJ1QKQJ1qm0n1k3K1
-398B88N0M9K7jj6oRLk0l6k9j6pPK9L5J2j0j1NJ1J2K5L6K2j2l5l9l0k2j4plOK3L6K6Nmloj6
-404C73j5J0L4L2Rj3j2RK0Nk4m2l1lK8L8J6k7m9k1K8L0j1k2K8P2L9l5n8k3%k7n6m9k3j2j3
-408B05qRK9M9N8M2Oj5j0MRLj2k7k4PL9K7k6p0o9l7pNMQL5P2P2J4m6l2L9P4M1j%J1lj0J8L9
-413E22Rl3j9L1L5k4p6n8KL6J9qj0QJ2qk4jL5L4j2l6oK7Nm2m3NL9K4qj4lnk3l2j7J3K8J0k0
-418C72j4L3P0M9LrJ1J8%j1j0k6n8o2k3K2L5L3L5K4j3m2l3jJ0KmMKqj0mj1l3m4k2NMk3l2m
$$ plain form
-384 311 333 363 387 391 368 319 262 224 224 248 264 268 280 310 333 326 306 310 343 362 337 289 268 289 317 322 315 333 383 432 451 440 409 362 312 297 332 375
-389 375 377 347 343 386 444 481 494 484 441 382 352 368 390 379 350 334 332 326 325 349 390 423 445 470 489 481 450 422 401 375 354 366 404 424 407 387 399 435
-393 435 460 459 443 421 397 380 374 378 391 416 448 475 486 486 480 469 457 450 446 432 411 400 406 415 410 406 422 455 469 444 393 355 349 360 368 370 378 389 381 341 290 267 288
-398 288 338 387 414 413 397 391 400 403 383 347 318 302 295 302 331 366 378 368 357 362 373 385 410 446 468 456 421 382 352 330 316 309 306 312 335 371 397 402 398 395 389 373
-404 373 358 368 402 434 443 430 418 427 447 452 428 386 355 352 380 418 434 407 358 337 365 395 384 362 390 462 501 466 408 385 385 358 302 253 230 218 205
-408 205 197 206 235 284 342 384 390 375 365 369 378 381 369 342 318 325 364 391 365 295 226 189 182 187 191 199 234 306 378 392 346 314 353 427 468 467 467 478 475 465 483 522
-413 522 531 498 479 510 545 521 445 387 389 425 444 436 426 434 446 438 414 413 448 482 470 434 428 455 460 418 375 380 419 443 435 421 418 413 390 358 341 354 382 392 372
-418 372 358 391 461 510 513 504 515 533 533 522 512 486 428 366 343 365 400 433 468 492 479 437 404 403 413 415 411 415 417 409 399 395 384 351 307 285 290 294 271 239 235
-423B35L3M0J5nLK2K4J3QK2K9J1k4m3k1K4L9Ol6l2J3L6J4j7j1Oqm1m7j7J4K8L3L4J6j7l6l2
-428C31j9pRK5K1rm3o0n1k0J3K1KjL9Q0N8j6o1m2jJ7K2K9K4J2K2N0M3j8o5m3PJ9RJ9L3jn5
-433C93n4J2N1J4m5m6KL9L1kl0l6k1lOPQJ2J8K9M4M6K5%olk1m5m1oPj5m0k6NJ7NlOJ5J1jq
-438C51MK0J9pk6j3K1L0RpNK1J4pj5m%j3k5j1K0L6J4k0k7NK7J1j7rJ5Qk3k3J4K9pl7j1K5J1
-443D07l2l7KK0lk0JL2L4Nl3o2o9l8J7O0O2L2PPK1K3Lj5mK9L5lm6m5qJ0jj4k2l6m3j3M4O2
-448C69J8l9n0j9K0M8O0M7J6kOJ5JqQK4Ml9n3k5J1L1K8Pk5m2k8npl0l2rQQJ2K9L7J6j8m0l8
-453C14j1K7N1L7Nj4j3jQJ4Mk7n0k4K8M7K5J1K3K6kk4rJ3J0mrj8n0p3n1pJ6J7K7M1L6J8J4
-458D25J7%j6kK9K6j4l3rK3K9J9J0nk6l0j6j2k5k4OL5L5K2K0J4j4m2l3KJ8nl4l0PL2J8k1l3
$$ plain form
-423 235 268 308 323 318 321 343 367 380 388 410 439 450 426 383 362 386 425 431 395 363 376 412 426 409 398 404 396 355 308 291 305 333 366 400 416 399 363 331
-428 331 312 305 314 339 360 351 308 248 197 177 190 211 213 212 251 331 389 373 312 270 269 286 308 337 361 373 395 445 488 470 405 362 369 388 397 416 449 448 393
-433 393 339 351 402 416 371 325 327 366 397 395 365 329 308 305 311 318 326 338 356 385 429 475 500 500 494 491 470 425 384 378 385 370 330 304 309 326 331 328 334 349 360 359 351
-438 351 355 375 394 387 361 348 369 399 408 401 406 427 441 434 419 415 415 402 377 366 386 422 436 416 389 394 421 432 415 406 421 429 406 383 397 426 419 382 371 396 407
-443 407 375 338 340 360 357 337 338 370 404 409 376 314 245 207 224 284 346 378 385 392 413 436 439 424 420 449 484 481 435 390 382 392 391 377 355 319 276 263 307 369
-448 369 387 348 298 279 299 347 407 454 470 468 474 489 490 482 490 514 518 479 426 401 412 443 471 478 453 411 383 378 371 341 309 300 308 316 328 357 394 410 392 352 314
-453 314 303 330 381 418 423 409 396 395 403 417 421 394 344 320 348 395 420 431 454 480 478 454 445 458 468 464 455 437 387 314 263 256 272 289 316 357 393 411 425
-458 425 442 442 426 424 453 479 465 432 423 446 475 494 504 499 473 443 427 415 390 366 372 407 442 464 484 498 484 442 409 411 429 424 390 360 367 399 417 396 363
-462C63nJ8Nk6k9qrk9k8J4N4N2K8Mj5l4k5J0L8K5%oKOK0M8N0Lm9m4jRl2o4l9J0L8K8MnRK7
-468D17J1m3p1k6M8O1Nl4nM2L0k0l1J4N2K5l9o3j7L8K3m6p6k1N1N9J9J0M2N3J2l1l6k3j7r
-472D04J3J9nj8J1M2K1k8m7k6rj2j6njoML5M5Mn2n7mM9M3pl9k5%ml0l2kK9K1j9n0l3K6Q3Q3
-477D05K8k5l4j3KJ2L1L7Ll6k2K1Rn2o0K1Q6M2m7o2j8j0m2l0L6O1Ln2k2M4N9K9K4M8L8k3o9
-481D22n2pPqqK3M2J8k0k8p%j5j6K2O2N0j0o1o6m8l5l4j7K2O3P6M7Pj1kNpk6l0j9pKMmj7j4
-487C03MRMJ6M4M5kl8j9J4Mk7j1L1K8k6l6K4P3M3j6l0j1qk2pK4K7nl0k3kJ0J1J0RJ1J0pl0
-491D04l5j8opjK2K5ql5j3K4K1j0j1J9J9k2m8k8nqrK1N2L6KLL5M3Ml2k9okj0jK3K6ol7l4q
-497C50PKMK1L2K1Jj2k8n5o8m1QL5L0K4L2K9ml9l6MK7J0j8j6MOk1l9j8J6L0K6K8L8K5j0k9
$$ plain form
-462 363 358 376 381 355 326 318 309 280 252 266 320 372 400 404 389 355 330 340 378 403 403 397 399 405 425 473 523 526 477 433 432 441 409 345 306 316 354 382 386 381 390 417
-468 417 428 385 314 288 336 397 402 368 363 405 435 415 384 398 450 475 436 373 356 394 417 371 295 274 325 384 403 413 455 508 520 489 453 430 413 404
-472 404 417 436 431 413 424 466 487 459 412 386 377 365 349 344 343 337 341 376 421 425 373 316 312 361 404 397 358 333 333 329 299 267 265 294 315 296 246 213 239 322 405
-477 405 433 408 374 361 363 375 406 443 446 410 388 409 418 366 306 327 413 455 408 346 328 318 276 246 282 343 346 294 272 316 375 404 428 476 514 491 422
-481 422 370 363 370 362 354 377 419 437 417 389 382 382 367 351 373 435 485 475 414 348 300 265 231 214 236 299 375 422 429 418 416 421 414 388 358 339 332 334 338 334 317 303
-487 303 307 316 320 336 380 425 423 385 366 380 384 357 346 377 405 379 343 367 440 483 467 437 426 418 396 389 413 440 435 405 382 380 390 401 411 420 431 441 434 404
-491 404 369 351 345 338 337 359 384 376 341 328 352 373 363 352 371 390 368 320 292 287 279 270 291 343 379 381 384 419 462 466 434 405 399 397 387 386 409 435 429 392 358 350
-497 350 357 359 363 384 416 437 438 426 398 343 275 234 242 277 307 331 363 392 388 349 313 317 344 354 336 320 324 330 309 270 252 268 298 324 352 390 415 405 376
-501C76j5Mjj1KK7L0Nj2qok3l7k5NK5K0jj1LK3K1%nJ9L2ln3n4rJ5j4m5j9L5N4K0j3oK7N0M4
-507D66J9j1l2l3j4MJ1J3K3K9J7j5l6k9j2j5l5l8j1K4L4J5qk7m7n5l5J1N1N9L6Jl0l6qL9O4
-511C89M1j4n4n0k3mnoLJ6J8J5K1K5J5klJ4J5j2k8oK1J1j8j1L5O1L1j3j9OJ8j0n0o2l9kJ2
-516C36K%J7K4j0m8m1%Pk7l5J0M6K1j9qK8J4m3o2j8L3M2L0L6M3K7Lj1j7k4j0L5O3L1k9m6q
-520C92K1nl6j6L3M1kl3j9kk3m4j8L2L9Jj5J4L0%k8oL5L8Ok3l8n2n1j2K9K2j8k8NL1K7K6M1
-525C94L0j7m5j5L2L9J0j8l1l9k9PL8L3J3J6K5lm3m2qpn4p9l7K2L6J9K6N6O5L5mk5k1OM0M6
-530D71jo5p9k7L2L5LnK3M5K9ql5l8k3QM3N0K0j8k7qmk8m6k7OQk0l9k5jJ3J5J6J9K2L4M3K2
-535D33k2m3j0L7L5j4m9l9oJ7L2L8J8k3m0oL6K5k0m1k4j4k6k4J0L6K2lplj6k4kL0L6J7PNp
$$ plain form
-501 376 361 365 364 353 355 382 412 417 405 397 391 368 331 306 311 336 356 355 344 347 370 391 391 386 405 437 434 381 327 318 333 319 274 255 290 344 364 351 345 372 422 466
-507 466 485 474 442 409 395 399 410 423 446 475 492 477 441 412 400 385 350 312 301 325 359 374 366 339 292 237 202 213 264 323 359 360 330 294 286 325 389
-511 389 430 416 362 312 289 285 280 274 277 293 311 326 347 372 387 385 382 396 411 399 371 365 386 397 379 368 403 464 495 482 463 469 487 477 427 365 326 324 336
-516 336 338 338 355 379 369 321 280 280 287 260 225 235 281 302 283 275 303 317 274 212 194 227 269 299 335 378 405 408 397 380 356 346 381 444 475 446 400 392
-520 392 413 408 372 356 389 430 428 395 376 374 351 307 289 321 360 361 346 360 390 390 362 356 391 429 435 412 374 322 271 259 288 310 292 264 269 300 327 353 394
-525 394 424 407 362 347 379 418 428 410 379 340 311 318 356 389 402 418 443 440 397 355 347 340 286 207 170 192 228 247 273 329 394 429 425 400 379 385 425 471
-530 471 470 405 326 299 331 366 369 364 387 432 461 453 418 380 357 365 408 458 478 460 433 425 421 393 347 320 326 334 314 275 250 249 262 277 293 312 334 368 411 433
-535 433 411 368 358 395 430 416 367 328 322 339 371 409 427 404 364 358 394 419 399 358 334 320 294 270 280 316 338 335 328 325 309 285 283 313 349 366 373 378 371
-540C71j5J3N6N4jn2n0j6J0K1K4Qk7m7l0%J9L1M3K7l0p3m8J7M6J8j2pLmj0NJ9Nj5qJ1Oj5j7
-544C30LQj3k4qJ5J8J6K7K5j6p4q1j7N1O0K2lQK0Oj3oJ5K8K3J1j1m1m5qL8M0%k3qKk6m7j2
-549B90M5M8j0n2k8K1L3J1JJ0Pj3j5K4O6O4J6l5n6n4m2k2J1L7L5J3MJ8K3rm7m4oJ9Jk4k5r
-554C06oj3qQRj2k7k0lLkmJJ1J9K0Qnrqj7l9n1k9J2M5N5M8L2J2j2l1l0JN4Q4O2no4o7k4K0
-559C24L4J7nj4r%RK4M3M1mo0o8j7L3K3k2l9lM8P0N4J4k5m6l7pJ7J8mk6l1j0J4J0k0l2jL9
-564C52M4K0MQKk1l4k2j0j5k3j5RL5M4K3k7o3m0K7O5L7j5l3j0J8K5J2j7l8k4J2K2j2m5k9R
-568B75J8KOK9K9j2m9m5j1K5M5L4j0n7n6KO0P4N4L7K6Mj9k3j2j4l2l7j0J9J1k5l9j3K1K5K
-573C34j2pj0k7k1K1O1M7Mj0K0M3J7k6m4l0j0kmj1j6KL2M5J8j2lL0L2j8o6o1k1OQJ2K5K8J9
$$ plain form
-540 371 356 369 425 479 478 426 376 360 370 391 415 423 396 349 319 319 338 369 412 439 409 336 288 305 351 369 357 350 353 349 339 344 363 368 353 345 356 362 347 330
-544 330 333 341 328 304 296 311 329 345 372 397 381 307 226 209 260 320 342 339 347 367 373 360 354 369 397 420 431 420 379 334 326 364 404 404 381 373 375 349 302 290
-549 290 335 383 373 321 293 314 347 358 359 369 376 363 348 372 438 502 518 483 427 373 331 309 320 357 392 405 409 427 450 441 394 350 344 363 364 340 315 306
-554 306 300 287 279 287 296 284 257 237 234 237 235 231 232 243 262 282 290 285 276 268 251 212 161 132 144 189 244 292 324 336 324 293 263 264 318 402 464 459 395 328 304 324
-559 324 358 375 370 356 347 347 356 380 423 464 460 400 332 315 348 371 349 310 307 355 425 479 493 468 422 385 378 395 413 409 383 352 342 356 366 346 314 313 352
-564 352 396 416 420 428 430 409 375 353 343 328 305 290 299 334 378 401 374 311 271 298 363 400 385 352 342 360 385 397 380 342 318 330 352 340 295 266 275
-568 275 293 295 301 330 359 347 298 253 242 267 312 346 336 279 223 225 285 359 413 450 476 480 461 438 426 412 380 343 333 352 363 338 299 286 307 332 334
-573 334 322 315 305 278 257 278 339 386 390 380 400 443 460 434 390 360 350 348 344 333 317 319 351 396 414 402 399 429 461 443 377 316 295 301 309 321 346 374 393
-578C93J5J8Kl0l5jL0J1k4j5K4K5k4n7l3J4M0M8N1L7%k4j2jk2m0k0J1Jl5m4k0kKJ8L2J0k4
-582C19j2L3M6J1lL0M6Jn5o4m6l8j8L6P6M9j0k5LRk5m1qL0L2Pj0oJ2L0K7Mj0JJ0j2l2kM4L8
-587D77k6o9m3jLj2MM3N1J3k6k5NK7J7j3l5l2j6kJ4K8K2mj6J2L7Nn8o7QP8O0k0o2k7L5N9L6
-592D80ol6l8j7NPoj4j2olj%KjopLJ3J6J2J6L0K5j4o5o8j4M7N8J7k4l5k6j6j3kJ3K6L1K2j
-597C92k5l0nK7K2k4o7n7nL0K1NK0N5O6M6J6j1m1o4n9k9NK6M4M6J9k7n2k7J6M0L0Lj5oK4M2
-602D51J9k9n6l9LL3L8J4k4m2k1J2J8kmK0K5ol5k6oorNJ3j1l7j8K6M8L6K2K1J2%J2L1J1m7
-607D52q1n1kJ5%pLPRJ7K1Mk3k2J3L9K2j6l0pJ8K3J9K2Rl0n8l0L2N7K3j5j2Oml0l5k3j3%L0
-612C52M9K3l6o6m1NL9M0J4k9n3l1J8N4O0N0L0pl1j7J2Qk6l1LJ9j7n6m3JK7K3K0K4J7Knrk1
$$ plain form
-578 393 408 426 428 398 363 362 392 403 379 364 388 413 389 332 299 313 353 401 452 489 489 465 453 452 430 390 370 381 382 347 303 283 281 283 301 333 343 319
-582 319 307 340 386 397 394 424 470 471 416 352 306 268 250 286 362 411 401 376 379 388 363 322 314 344 376 383 373 367 379 409 436 440 430 431 441 429 397 395 439 477
-587 477 451 382 339 338 341 329 333 376 427 440 414 389 394 421 438 425 390 358 342 340 354 382 404 400 384 396 433 438 380 313 321 399 459 439 377 350 385 444 480
-592 480 474 438 400 383 388 395 389 375 363 357 354 353 353 355 354 348 341 344 357 373 385 401 431 456 442 377 309 295 342 400 417 393 358 332 316 303 301 314 340 371 393 392
-597 392 367 337 332 359 381 357 290 233 228 258 279 284 304 359 425 471 487 476 435 371 312 283 288 314 358 404 423 396 344 317 333 373 403 406 391 385 409 451
-602 451 470 441 385 346 349 382 420 434 410 368 347 359 377 375 371 391 416 410 375 349 343 337 328 333 346 335 298 280 306 354 390 412 433 445 445 457 488 499 452
-607 452 371 320 318 333 333 326 329 336 345 362 383 387 364 342 355 394 416 400 370 363 381 404 423 445 454 424 366 336 368 425 448 433 421 427 423 393 358 335 322 322 352
-612 352 401 424 388 322 281 286 325 365 379 350 297 266 284 338 398 448 478 471 440 423 435 443 417 386 389 408 391 335 292 293 320 343 363 387 404 406 401 392 371
-616C71l0j5J8M1L7J4j6l7l6k1j0j5j4%Rqk2LM8O4L8QMJ2Oj0j0OK1J9Nqj3k2l3l9k6nJ1K2
-621C67L6M2K5rk7j9qrj2jQjj8k1j4j1j1%K0L8M2K5pl4k6kjk7l0J4M5J6l8n1k5rqJ6M7L2k3
-626C31m0PN1L1k0l6j6npJK1K0kk1j8JK5M3L0ql5j2L5O0M8L3K2pn2p1l4J8K1k4o1n1j6OJ8
-631B86K7K8J2jQL1K7qm0m7m2m1k3K1N3L4lKN2Q5N3j1m6l5qNkk1l3k8j8j8k4j4J3L1K3J3J4
-636C55J4ql8m4k4KJ6J6MpLK4K5ql6k4J5L4K2J6L3M9L2ql6k6K0N6L6k7n4j1L9J5n6p1j6J4
-640C46l3q6n7J8M3J0j0OQk0k4K1N4K2l9m8%M1M2K0Mj3l2l4j1K0L2K4Mj4j1K0N2M8J3j6j4
-645C86mlNK9L0j2n4m3J0M0K2mj0j5k9l4j9oj1j7j0oj2%L9N9K6k3k1K3L6ll9k4J4K8RpjJ3
-650C62Rj7m2l2J4N2M3nl6k8rKK6O6P8K4n5p8k6L6N0K7J1J4J1j6n0n8k8K6N4K4m1p8o5l1j5
$$ plain form
-616 371 341 326 344 385 422 436 420 383 347 326 316 301 287 287 296 288 266 269 317 381 419 427 431 443 449 439 429 435 456 475 480 472 459 437 404 365 339 334 345 367
-621 367 403 445 470 461 434 415 407 398 386 385 393 392 374 353 339 328 317 317 337 375 417 442 435 401 375 373 372 345 315 329 374 390 352 301 276 267 259 275 322 354 331
-626 331 291 298 349 380 360 324 308 303 296 297 318 338 336 315 297 298 323 366 396 388 353 341 376 436 484 517 539 532 480 409 375 393 414 390 329 278 262 268 286
-631 286 313 341 353 352 360 391 418 410 370 323 281 240 217 238 291 325 322 324 376 461 514 503 457 422 414 419 417 396 363 335 317 299 275 261 274 305 328 341 355
-636 355 369 361 323 279 255 257 273 289 293 286 289 313 338 330 294 270 285 319 341 357 390 439 471 463 427 401 421 477 513 486 432 421 460 475 419 348 332 346
-640 346 313 227 170 188 231 241 231 237 245 225 201 222 276 298 259 211 211 252 294 314 318 305 273 239 228 248 280 304 308 294 283 303 355 403 416 400 386
-645 386 382 379 384 413 443 431 377 334 344 384 406 402 392 377 348 314 295 289 278 261 251 245 233 233 272 331 357 334 313 336 372 369 330 306 320 348 357 350 349 362
-650 362 371 354 312 280 294 346 389 384 348 320 311 313 339 405 483 507 452 374 348 384 434 461 472 486 497 481 431 373 345 371 425 449 408 330 265 234 219
-654B19pK5P3R6P2K0k8n8n8k6J6L0Nk1j0J6J0k8m7j9K5M1K5mk4l1k1okpKL7O3M8Lk5k6j6j4
-659C48oJ6L8L9J8j1l5l7j0K2K2pj7J4M0J1l8l4K0M4on9l5M2P0J6m9n0j2PmqMjk0k0J3L7K0
-664C82qKL3L5pl6j4K7K7j2l3j1J7mo1q9m4L7P9N5Rj2plqrJMjpKK0L1K6Jk6l1mK7K6j1m2l6
-669C25nJ3Lj9k2NL9M2Ol6l6LK9J7rj0ORjj0pJJ5K7K1j2l7k6LNj8j5K0M1J8j5j7KPooJ2K7
-674C89L0K2J1LQJ4on1p1m1jKj6jK9J5m1o9l6NRJ6N5Q3M9k0m9l1rPL2M5J1m6n8j6J6Lj4lR
-679B84lj1J1L5K5mj8k1l0k9NM4M4Rj7j2RK8L1Pl3m5j1L3L5RkRJ2OJ3K5Rk1k8nNoJL0L5qn2
-685C98m4kK2Qk0k8nL6N3K3k1l3k3k9m6k3L3N0Qj9RL2nm3j5L8K2m8o7pM5K8j4j8J5L8L1Rr
-689C79oK4M8L3j3m4m0k4nK0L8J8k6m5j5J9K1Mmqk5l9k9j1j0j4NM5N4Pn2n5J3P9O4k1p4l2
$$ plain form
-654 219 212 237 310 406 478 498 470 412 354 328 344 374 379 358 348 364 374 346 299 280 305 346 371 367 343 312 291 285 283 276 278 315 378 426 429 404 378 362 348
-659 348 342 358 396 435 453 442 407 370 360 382 404 397 380 394 434 445 407 373 393 437 431 372 337 379 449 465 416 366 354 361 357 349 353 352 332 312 325 362 382
-664 382 374 376 409 444 437 401 387 414 441 429 396 385 402 398 337 248 204 241 320 375 384 372 365 362 354 345 346 350 349 342 344 364 395 421 422 396 365 361 388 414 403 361 325
-669 325 320 333 336 317 295 300 339 381 387 351 315 318 347 364 355 345 351 360 359 349 342 343 358 385 406 394 357 331 334 339 321 306 326 367 385 370 353 355 362 356 350 362 389
-674 389 419 441 452 455 463 477 471 420 349 308 307 309 293 292 321 336 295 226 190 195 204 220 275 358 407 387 338 307 298 305 337 382 393 347 289 273 289 292 278 275 284
-679 284 281 270 281 316 341 337 319 298 268 239 244 288 332 341 324 312 321 349 380 387 354 309 298 331 366 375 373 382 394 400 413 438 447 426 398 393 398 392 393 423 458 450 398
-685 398 354 352 374 382 362 334 329 365 418 441 420 387 364 335 289 266 299 349 357 338 347 379 374 331 316 354 376 328 261 254 299 327 313 295 310 348 379 388 379
-689 379 373 397 445 478 465 421 381 357 352 372 410 428 402 357 342 361 382 386 382 374 349 310 281 270 260 246 251 296 350 357 305 250 263 342 406 385 311 279
-694B79M1N2Lk2PL0J6JQon8q6m4J3J4j8pM7P0L9%k0l9n2l2J4L7K0RK3K3j5m9l8lJ0lj6j7r
-699B22J7N8P2L3k7m8k1J6L4L4J9nk3j5LJk7m9m2j8QK5J8j3l8j4M3O9L5olK6K5j2l5k6j1q
-704C17njpk0j1K5N0L2%j0koj4mK1K9J7J3K9L5Nl7m8j9K2L4J2k3m0l6k7j8mQNpjJ8J5j6k5
-709C06J5N7M2qk5pkk3k8j6k7n8m2L2Q3N3j3l3oJ9K3J9Pj5j6J2K8Kk2LM1K9j3k0Lmm2m5kK6
-714C33OqK7O5M3j9n9n1j4K5M1K2j8l4mM0N1K8rm1n8n8m0j8%K0K9Jm5n4oM4L8lj5J3L5J6j8
-718C05k5mRj0m2m3oK9J8k5m2mN5Q8Q4N3mn7o7k7J1jl4l6mJ7Pj3k2j7LL5N7M7J7NK2M3M3K2
-723D87j2m3n8l8OM2M4J7j0k0j2nqk3k8k0qmnjJlj0j4j8j8NM5O0K7j8k1J8M6L4lk9l6l1j7
-728C19JK3N1P1N8Qm8o6m2pJ4J9Pj8k9j2J7K4NpjQJ2J5J2j0l2k7%J3OjOkk6l4oK0J0j5j2J7
$$ plain form
-694 279 320 372 375 353 360 390 406 407 415 409 351 265 221 234 248 230 223 270 340 379 379 359 320 268 236 250 287 307 316 339 362 347 298 260 257 267 264 248 231 222
-699 222 239 297 369 402 375 327 306 322 356 390 409 404 381 366 369 370 343 294 252 234 242 267 285 272 234 220 263 332 367 361 358 384 409 397 362 336 325 317
-704 317 312 311 304 284 273 298 348 380 380 370 368 362 348 344 365 394 411 424 453 488 493 456 408 389 411 445 457 434 394 358 331 313 309 317 322 315 314 332 347 331 306
-709 306 321 378 420 412 387 380 378 355 327 311 284 226 184 216 299 352 339 306 300 319 342 361 368 353 337 349 377 379 357 360 401 430 417 397 400 396 354 309 307 333
-714 333 339 331 358 423 466 447 388 337 323 348 389 411 393 359 355 395 446 474 465 424 366 308 268 250 250 270 299 300 255 201 195 239 277 274 259 272 307 323 305
-718 305 280 276 285 275 233 190 184 213 231 206 164 160 215 303 387 440 436 379 312 285 296 295 261 225 221 238 245 232 210 193 196 231 288 335 352 357 379 422 465 487
-723 487 475 432 374 336 342 384 428 445 435 415 403 398 390 367 339 319 311 307 302 301 302 299 289 275 257 239 244 289 349 376 358 337 355 401 435 432 403 367 336 319
-728 319 320 343 394 465 523 531 483 417 375 368 382 401 408 390 361 349 366 390 395 388 387 395 407 422 434 424 392 365 365 378 384 383 389 387 361 327 321 341 351 336 324 341
-733C41L1J8oj9k1j3nlroJ6L2J5k7m1pM4N6K4j2k2j6j7k6k7k6l4l8rM2O8M4NmKmrQJ8j0n4
-738B99n1mK7J9J3K4J7k2m5k3Lrl3k4J1L3L8L9L2J4QK2K6lk6pJ8pn8o1j0K8J2j9k6j4NK5L4
-743C05Ol4l1J5M1J4j1J4M4J6m6o3k0K0J2j3j2Njk1k2LJ7Kj8qK1L5K8J6RJoNK4J5j8l8k6k1
-748B59l6l2J7O0M1j2j3L6N6K1j5rJj8l5qL0L1%j6j0lLJ4J4j3m5m5k0JJ5M0O4N4J6j9l7m7
-753C40m3mM3M1j0l9kM7L8j8m2j6J3J2LJ6K5Ml0l5qQj0l7m6l3j2K0N3N1np1o8LO1M5j2l0K
-757B54K6Ok2j0L1M8K2pNL8M2Kl4k3J7L0nm2m5j9jOJ9L7L1jk4rL1M2Rk9k7NJ5j5m4l0PJ7l
-762C50j6ook6l4lL6K9j1k8mJ9Rj3kL3N0K7rk5k1j7k2k0roj3%M0O5L4k0k3L4O9L3k7m1j5%
-767D11oLK6K2rk7j3rl1m3j7J0RLK7O0N1Rj3lOj1k5j6KPKqk0k5j4Kol7m2%N2O2L4Oj6m3o0
$$ plain form
-733 341 372 390 384 365 344 331 326 323 314 308 324 356 371 344 303 296 340 396 420 408 386 370 353 327 300 274 240 202 193 235 303 347 352 348 350 346 337 345 363 353 299
-738 299 248 244 271 290 303 327 344 322 277 254 257 248 215 191 202 235 273 312 344 358 366 388 414 411 385 378 396 389 331 270 260 288 300 281 255 241 246 271 305
-743 305 311 277 246 261 302 316 305 319 363 379 333 270 250 270 282 269 257 262 261 240 218 221 238 240 222 214 235 270 298 314 323 324 318 323 347 362 344 306 280 259
-748 259 223 191 208 268 309 297 284 320 376 397 382 373 374 356 321 313 343 374 374 358 348 345 348 362 376 363 318 273 253 254 269 309 373 427 443 424 387 340
-753 340 297 293 336 377 367 328 326 373 411 393 351 335 348 360 363 379 404 408 378 343 335 343 333 296 250 217 205 225 278 329 324 253 185 188 249 294 282 252 254
-757 254 280 286 264 254 285 333 355 348 353 391 433 435 401 378 395 425 420 378 333 314 313 319 338 375 406 405 381 372 403 445 454 425 398 403 418 403 359 329 336 353 350
-762 350 334 328 322 296 262 259 295 324 313 285 281 300 309 296 294 327 377 404 395 370 349 332 310 290 281 275 262 262 302 367 401 381 358 392 461 494 467 426 411 411
-767 411 405 408 434 456 447 420 407 398 367 324 307 317 326 329 356 416 467 476 463 460 466 455 430 414 416 423 425 417 397 372 358 360 354 317 275 275 327 389 423 429 413 370 310
-772C10l1K7M7Kn4n0MN0N4K9Nj2j7jK7L8J9j5l6m0m2m2k9RN3O8L2k7o0m1JJ7jj9pK7M3K1j8
-777C41l0KL7L1j4m9m0oK2M1N6N7L0lj7k5m8o6m6kJ8Qjmk5n0k6M3P7L7j6j6J4K0QJ8M2L6O
-782D60pRJ9J1lj7l9m4j9J8K1kj4oNPQjl0n2l2jpl1j7K7K5k4m0J3N7K9j8j2K5J9j6j9K0M0
-787C62J9ljkk4l6rL2L8lm6m3MM6L6j2m4j8L2M6J5k0k1LJ0qk7j1L1N3K9j0k3j2j2k6k7j3m
-792C01%J7L6J7k6k8K2N1Mo2p4l2J1M3P6Q9N5Pm%k5n8l5K8M5qn6n2l1l4k0L7P9M7k5n0k4q
-796C13l3n2k6K4N1M4K5J6J1Mrj7j6j4j3j2jJ2J7Qqk2l0j8J3L9K9nk3j0J4K6L3M0L2Oj6j2
-801D20NMj7m2m6k2J8M0L0Jj3JJ9K1om8p8n9NO5O8K6rk5l9m9k6K3M7L2J4K4L4J9jnnj2jL6
-806D49N1J5l1k6Jj6o6p4j8K6Ol8l6OK4LqK6O4M8j6n8l5J7L4J2njOQJ9L1J5j9l2j3lj8j3K5
$$ plain form
-772 310 279 306 353 355 301 251 255 305 359 388 393 381 364 363 390 428 447 432 396 356 314 272 243 252 305 373 405 378 318 277 278 295 294 275 268 295 338 359 341
-777 341 311 313 350 381 367 318 278 272 294 335 391 448 478 475 458 433 385 319 273 271 289 297 296 292 267 217 191 234 311 348 332 316 330 350 358 376 418 454 460
-782 460 453 462 481 492 489 472 433 389 370 388 409 407 393 387 392 399 407 406 376 324 292 291 284 253 236 263 288 264 224 237 294 323 305 293 318 337 321 302 322 362
-787 362 381 378 377 375 351 315 306 338 376 373 327 284 288 334 370 358 314 296 328 374 389 369 348 351 361 353 326 315 346 399 428 418 395 383 371 345 318 305 301
-792 301 301 318 354 371 345 317 339 390 394 332 258 226 237 280 356 445 500 507 503 503 478 420 385 413 458 450 394 342 311 277 257 294 373 420 395 345 321 313
-796 313 280 228 202 226 277 321 346 362 373 377 368 351 335 321 308 296 295 307 324 332 324 302 272 254 267 306 335 330 307 297 311 337 370 410 442 448 432 420
-801 420 425 429 412 370 324 302 320 360 390 391 378 379 398 419 413 365 287 228 233 298 366 392 383 358 319 270 244 267 314 346 360 384 418 437 436 431 426 414 413 449
-806 449 500 515 484 458 459 443 377 303 285 311 317 279 243 249 273 276 268 294 358 406 390 332 297 314 348 360 355 354 360 368 387 418 433 414 382 369 366 348 335 360
-811C60M0nn5m2J5L8J7%QJ2MKLk0n3m7KM9N5M1K9Ok5m7m3l1j9KK1J8LPK6K3j6m6l0QK7L0L1
-816C98K1qk8j0K8L9Kn2q4p4l6LJ7J1PJ0J3J5K2K8J4llJ6J8mk1j1J4L0L0J0k9o0m6QM4K7j3
-821C43l1k9k2qRJ1nj0J0J7pl0j2J6Km4o3l1K0N3O0M2Rj7j4NJ7J5RNlommlJ8N0N5J6k1k0q
-826C90k2l9j6K8L9J6OJ8J2j6k9j4qk0j7RK6J2lKJ0LjPNj8k7LL9L3pl4l4k8k5j9%J5J7Jk1
-831B93k6mK8L2Pj8j6OK8M3M2J3k4l6j5PQMQLk2l6j3K1K7RLK6M3L3jl6n3m5j5J6K7J2j8m4
-836C17m1j1J4Nk0k0PK0Kj0OJ7j1m1k0L6O3M3Oj1j7k2j9rMPPMPJ7K9K3pk9k1MK0K2J7%k5l6
-841C27j3J9K8J7Mrl5m3j1K6J5l0m0JL5K8QJ2J6mk2qJ8J4j5k5j0PMj3k8l0j9jJ6K8L5L3K0
-845C55RPpm3p3n0NL3J3kK4M6J6m0n2pL8M3K5J9L5M9L2pm4m5j6J5K2J1qk4k3NL3K2k6m9j6
$$ plain form
-811 360 400 395 340 298 313 351 368 368 376 388 392 394 397 377 324 277 279 328 383 424 453 459 434 387 344 313 294 296 317 335 338 345 371 394 378 332 302 310 337 367 398
-816 398 419 411 383 373 401 440 442 390 306 232 196 199 216 227 234 244 257 272 294 322 336 333 330 346 364 360 339 328 342 372 402 412 383 323 277 285 329 356 343
-821 343 312 283 261 253 262 273 268 258 268 285 278 248 236 252 254 210 147 116 136 189 249 291 300 283 269 274 291 306 315 320 317 311 307 303 300 318 368 423 439 418 398 390
-826 390 368 329 313 341 380 396 402 420 432 416 387 373 365 345 328 337 363 375 372 374 384 387 386 393 398 380 353 356 395 428 421 387 353 325 300 281 281 296 313 314 293
-831 293 267 263 291 323 330 312 296 302 330 373 415 428 404 368 353 360 368 372 380 383 361 325 312 333 360 369 372 398 441 474 473 437 384 339 324 340 367 379 361 317
-836 317 276 265 279 284 264 244 251 271 273 263 269 286 275 234 214 250 313 356 362 351 334 312 293 284 288 295 302 306 313 330 359 382 375 346 325 329 349 371 388 388 363 327
-841 327 314 333 361 378 382 373 338 295 284 310 325 295 255 256 291 319 327 339 355 351 329 321 339 353 338 313 303 310 314 301 273 243 224 223 239 267 302 335 355
-845 355 364 371 364 321 248 198 203 236 249 247 271 317 333 293 241 234 272 315 340 359 394 443 475 468 424 379 363 378 400 411 403 379 356 361 394 416 390 341 325
-850C25L5M8K2j4m4n7l6J0L5J8KK5N2K3l8n8k5jj2j8QL5L1J5PRMjmj2j3QL2K3j4k7%K1Lk6
-855C91k6j0JNJ6K4J4OQ%k6m4l5j6oRL7L8j2n9l4M2P6L4k8m9l5j2J5L7K9pl0j0K2K5pl0k8
-860C25j0kjJJ4K9L3J8kj8k9m3l8kM2N4J8k8m7l5j0K1L9K3k3o2n2kM0L7Pj2jJ1Jk0k1LK3J5
-865B96nj3qnjJ6K7J2j1lK9L8Qk8l4k4j5%L2M2Lm8m5J6O4M4qk9pJ1ol6m4m0m4m5j2M4O7L2
-870B70oLM1M6J7mjlk1l3j7J0K5L1K8Qk5l7j6J1J3kj9k5j6PK3Oj4NM4L5k8o2j8M1M1RMRk7
-875C53o9m0M1P2K1l7m1k2k6l0pJ7J7J3K7M6L5J1KJ0J5Poj9k7j9klk0k4kJ5J2J2K5K2j2m3
-879C24l1LJ8J3J1J2ol1l4j4jj1k5l5m0l3pL0N5N5L5Mj6lK8L6J1j5j2ONj0j6j6k3j8RL1K0
-884C09NK2M6K1l4m5NM8L6M%J2nl8m7k0QMk6m2j5L3L9j3o6n1PK8mk6nJ6OlK5O2O6M5K8Km4
$$ plain form
-850 325 360 408 430 416 372 315 279 289 324 342 344 369 421 444 406 348 323 322 310 292 300 335 366 381 388 397 401 400 396 384 371 379 411 434 420 393 393 414 417 391
-855 391 365 355 356 361 377 401 415 421 429 429 403 359 324 308 302 311 348 386 374 315 281 323 399 433 405 356 321 309 324 361 390 383 353 343 365 390 383 353 325
-860 325 315 313 312 313 327 356 389 407 405 387 358 315 277 275 317 371 389 361 314 279 269 290 329 352 329 267 215 213 253 290 297 285 284 295 296 276 255 258 281 296
-865 296 291 278 270 265 264 280 307 319 308 305 334 372 380 352 318 294 279 279 311 353 356 308 263 279 343 387 379 350 343 354 348 312 268 228 184 139 127 171 238 270
-870 270 264 267 308 354 371 367 366 363 342 309 292 302 327 358 386 394 369 332 316 327 340 338 319 294 278 285 308 314 300 305 349 384 356 294 276 317 358 367 371 380 353
-875 353 284 244 285 357 378 341 300 278 252 222 215 232 249 262 289 335 370 381 383 393 408 415 409 390 363 344 342 339 319 295 293 308 320 332 357 379 367 324
-879 324 293 296 314 327 338 350 344 313 279 265 264 253 228 193 153 120 113 143 198 253 288 292 276 273 301 337 348 333 321 327 332 322 306 290 267 249 258 289 309
-884 309 314 336 382 403 369 324 329 377 413 417 417 429 424 386 339 319 327 331 305 263 248 281 320 307 241 190 197 225 221 195 190 206 212 209 234 296 362 407 435 437 393
-889C93p5m8RL1J5PK3K4jj6KK4J4j4l1k5j9k2k4j3OK3K3J6J5K1J2j4l6l4j7kJ1K6K9Jl0k2
-894B82J6L2Nk5j6J2J1j8l9k4PK1J1nnRK7L3K7K0J8J9J3lk0k4j4%LKJ1K0Ol7p1o0j7J5J6j
-899B57%J9L2J7k1m9l0J7M2J0m3n2oM4M3%l1j8J2J9mk0qJ6K3J1KNKrpJ2K4Ok4k8kK5K8Ok2
-904B98l2j2K1K5j0l9j3M0N5J5j8jL5L3j4n5n8l7j4RK9L5J5j2k1j1oj5j6OL0L2K3M0Q0R1M3
-908E71k4n6m6k3j2j4k5m3m7l0kJ3K2L1L4K2Kj3k4m0m0j0K4K9J3RJ8J6kj5k7m3l6J4P1O9R
-913C95m1m4l3l3l0k0j8j3K5P7O5j3o9m2J0J0j3JL6L9J4OLk6n1rP6J04M0m1o3m1k0mOJk2k4
-917B38J4O2P6O1L8Ol4o3o3m0j6RL8N7M6J7j1l5n4n6l1JJ0rj7QM0L2k6q0o6OO5O2K9K7M8M2
-922D31pn0m7j0K1K9J2k5n1m0oRoj2J7M8L9OlJ7L7L6K4J5Kj8k9j9PL1K9jl2l5j0J7K7K5J8
$$ plain form
-889 393 318 270 279 310 325 332 355 379 378 362 364 388 402 388 357 332 313 291 267 254 260 283 306 322 337 358 370 356 320 286 269 267 278 304 333 334 304 282
-894 282 298 330 335 310 294 306 317 299 260 236 243 264 275 270 265 274 301 334 361 381 399 418 431 428 408 384 370 370 373 375 386 406 412 375 304 244 227 242 258 257
-899 257 257 276 308 325 304 255 225 242 284 294 251 199 193 237 280 280 249 231 243 262 258 238 230 246 269 280 282 287 289 280 273 285 309 315 291 263 261 286 314 320 298
-904 298 266 254 275 300 290 251 238 278 333 348 330 329 364 397 383 328 270 233 219 228 257 292 307 295 274 263 257 242 226 232 262 294 317 357 437 528 571
-908 571 547 491 445 422 410 396 371 328 281 251 249 262 284 315 349 371 373 360 336 296 256 246 270 299 312 321 339 355 353 338 311 268 232 246 317 386 395
-913 395 354 310 277 244 214 194 176 163 188 265 330 317 248 206 216 226 213 214 250 289 303 309 312 286 235 226 302 406 446 405 342 301 281 277 283 284 262 238
-917 238 252 314 390 451 489 495 461 398 335 295 279 288 326 383 429 446 435 400 346 290 259 260 270 261 244 252 292 324 298 218 152 158 223 285 314 341 389 431
-922 431 424 374 327 317 338 367 379 354 303 263 257 266 260 248 265 313 352 358 355 372 409 445 469 484 486 468 439 420 427 458 487 486 454 419 409 426 453 478 496
-927D96pn3p6m3K4O2M1rl9l4k0k6m6m9k0J1Qj3pK9M3Lm2l1K4N1J7k9l3mJ5Mq%J8K8K6K7K6
-932C64Qk3l5j5RPmJ4M4L7pk9%L2J6k4k9mll1l4QM2J9l6o0l2RK5J6J3K6K9%m5o2k7K5M9L8
-936C30J7NJknnPL1M9K8k4n5l8jJ1J5L8N9L7j8m8k9npk7m1m2k0K0M0Rm3m9jL3J1k2k2JJ3K2
-941B73M0L8ll7qN4O8Lp4r2m4J8L6Jm8n4j4K8L7L2M0L7mm7l7J3L2QkK7L7j0n1j9N8P7J3n7
-946C69o3k9rj6j5jJj1j4LJ6%k8k5J1M2L6Lk2k4j1LOJMK8O4O9L7lk0k2k8k5OL7L4PMK7K4k1
-951D45n3l2J0J4j9m1l1j7k2m2n4m0kM7O7M7Pj1mRJ5K3L2L0Rj2k2k4k5j9qMJ9L4M0K5MJJ6
-956D20K3%l6o4p3o0k7J3K6Qj1j2JRJ8L0L5K7K0K3Lm2p0m8j1j2k9rL3L0j8k2M2Q5M0l3m3%
-961B66K0LKK2J7k1l5nK7K3RJ6K9K3J0kk1n3o1k2K5L8J3j5l0l8l2oK0K3Jj8k1j3NL3M9L9J8
$$ plain form
-927 496 489 436 360 317 341 403 444 435 396 362 342 316 270 221 201 212 220 207 200 229 272 275 233 202 226 277 294 265 232 228 243 247 239 239 257 285 311 338 364
-932 364 372 349 314 299 308 315 311 325 369 406 399 370 370 402 418 394 365 361 358 327 293 301 343 362 326 266 234 243 268 284 297 323 352 352 307 245 218 243 292 330
-936 330 347 352 353 351 346 341 348 379 428 456 432 377 339 338 349 364 402 461 498 480 432 403 398 391 364 323 281 261 281 321 330 287 238 237 270 281 259 237 238 251 273
-941 273 313 351 348 311 303 357 425 428 354 262 218 236 272 273 225 171 157 185 222 254 294 331 327 280 243 256 288 296 294 321 358 348 297 278 336 413 426 369
-946 369 306 277 268 252 237 236 237 226 212 215 231 231 203 178 189 231 267 270 248 224 213 216 222 223 227 255 319 388 425 422 402 380 352 327 333 370 404 411 415 442 466 445
-951 445 392 360 370 384 365 324 293 276 254 212 158 118 116 163 230 277 284 273 269 278 293 316 348 378 387 375 353 329 304 285 277 281 300 334 374 399 403 404 420
-956 420 443 443 407 343 270 210 183 196 222 230 219 207 208 217 235 265 300 327 347 370 373 331 261 213 202 190 161 152 185 215 197 175 217 302 342 309 266 266
-961 266 286 289 291 313 330 309 274 269 296 319 328 344 373 396 406 404 383 330 269 247 272 310 323 308 278 240 208 202 222 245 246 228 207 194 199 232 281 320 338
-965C38J3K7K9Pk7m3l3qOmk1j3K0L7J3j8j3K1L2RoJ3M2L6mm2m6k0N%k1k3MK8J8prLNomJj6
-971C23l4k0J7K3npL2M9Jo0o6k9rqJ4M6M1%k0QL9L6J2lrj2NM0M6Ql2l3j1oj5JL1K7j4l4lL2
$$ plain form
-965 338 351 378 407 414 387 344 311 303 309 305 284 271 291 328 341 323 310 331 363 372 366 379 421 457 453 411 365 345 350 350 329 306 310 338 356 349 340 343 348 342 338 339 323
-971 323 289 269 286 309 304 297 329 378 379 319 253 224 215 207 221 267 308 308 288 296 335 371 383 380 371 359 364 404 450 458 426 393 382 376 361 362 393 420 406 372 369 401
$$ [...]
-1605D79
##END=	
##END=	
