##TITLE=	XF+isBnVR1yMEv5bNBWuNw.74.ser
TM-VI-252, Na+Ph-pyr hmbc

##JCAMP-DX=	6.0	$$ MestReNova 14.3.0-30573
##DATA TYPE=	LINK
##BLOCK_ID=	1
##BLOCKS=	2    
##ORIGIN=	Mestrelab Research S.L.
##OWNER=	hrzepa
##$MNOVA/LINK_BLOCK_TYPE=	ITEM	$$ NMR Spectrum
##$MNOVA/ITEM/POLYGON=	(XY..XY)
5321,5835
8722,5835
8722,8208
5321,8208
5321,5835
##$MNOVA/ITEM/Z=	0
##$MNOVA/ITEM/ANGLE=	0
##TITLE=	XF+isBnVR1yMEv5bNBWuNw.74.ser
##JCAMP-DX=	6.0	$$ MestReNova 14.3.0-30573
##BLOCK_ID=	2
##DATA TYPE=	MNOVA NMR VIEW DATA
##DATA CLASS=	MNOVA VIEW DATA
##$MNOVA/2D/THRESHOLD=	3.4279396533966064453
##$MNOVA/ITEM/ZOOM/X=	-0.47893103590269503478,	14.508270000071124883
##$MNOVA/ITEM/ZOOM/Y=	-9.5608721214139968936,	250.07129999451962021
##END=	
##TITLE=	XF+isBnVR1yMEv5bNBWuNw.74.ser
##JCAMP-DX=	6.0	$$ MestReNova 14.3.0-30573
##BLOCK_ID=	3
##DATA TYPE=	nD NMR SPECTRUM
##DATA CLASS=	NTUPLES
##NUMDIM=	2
##ORIGIN=	Bruker BioSpin GmbH
##OWNER=	nmr
##.OBSERVE FREQUENCY=	400.20280139999999847
##.OBSERVE NUCLEUS=	^1H
##.SOLVENT NAME=	MeOD
##.PULSE SEQUENCE=	hmbcgplpndqf
##LONGDATE=	2022/01/25 00:00:52.000
##.ACQUISITIONMODE=	SIMULTANEOUS (DQD)
##$ORIGINAL FORMAT=	Bruker XWIN-NMR
##$MNOVA/SCALES_VERSION=	9
##$PARAMETER FILE=	(acqu2s, ASCII, /private/var/folders/f6/rjf_tdyn2v98c5c0wvkgn4s80000gn/T/XF+isBnVR1yMEv5bNBWuNw/74/acqu2s, 0)
$$ ##TITLE= Parameter file, TOPSPIN		Version 3.2
$$ ##JCAMPDX= 5.0
$$ ##DATATYPE= Parameter Values
$$ ##NPOINTS= 129	$$ modification sequence number
$$ ##ORIGIN= Bruker BioSpin GmbH
$$ ##OWNER= nmr
$$ $$ 2022-01-25 00:20:28.470 +0000  nmr@CZC2439F63
$$ $$ /opt/topspin/data/agmb/nmr/Jan24-2022/74/acqu2s
$$ $$ process /opt/topspin3.2/prog/mod/go
$$ ##$ACQT0= 0
$$ ##$BF1= 100.63037
$$ ##$FnMODE= 1
$$ ##$NUC1= <13C>
$$ ##$NusJSP= 0
$$ ##$NusT2= 1
$$ ##$NusTD= 128
$$ ##$O1= 12075.7644147886
$$ ##$SFO1= 100.642445764415
$$ ##$SW= 260.109045168497
$$ ##$SW_h= 26178.0104712042
$$ ##$TD= 128
$$ ##END=
$$ 
##$PARAMETER FILE=	(acqus, ASCII, /private/var/folders/f6/rjf_tdyn2v98c5c0wvkgn4s80000gn/T/XF+isBnVR1yMEv5bNBWuNw/74/acqus, 0)
$$ ##TITLE= Parameter file, TOPSPIN		Version 3.2
$$ ##JCAMPDX= 5.0
$$ ##DATATYPE= Parameter Values
$$ ##NPOINTS= 12	$$ modification sequence number
$$ ##ORIGIN= Bruker BioSpin GmbH
$$ ##OWNER= nmr
$$ $$ 2022-01-25 00:20:32.000 +0000  nmr@CZC2439F63
$$ $$ /opt/topspin/data/agmb/nmr/Jan24-2022/74/acqus
$$ $$ process /opt/topspin3.2/prog/mod/shimcntl
$$ ##$ACQT0= 1000000
$$ ##$AMP= (0..31)
$$ 100 100 100 100 100 100 100 100 100 100 100 100 100 100 100 100 100 100
$$ 100 100 100 100 100 100 100 100 100 100 100 100 100 100
$$ ##$AMPCOIL= (0..19)
$$ 0 0 0 0 0 0 0 0 0 0 0 0 0 0 0 0 0 0 0 0
$$ ##$ANAVPT= -1
$$ ##$AQSEQ= 0
$$ ##$AQ_mod= 3
$$ ##$AUNM= <au_zg>
$$ ##$AUTOPOS= <52 >
$$ ##$BF1= 400.2
$$ ##$BF2= 100.63037
$$ ##$BF3= 400.2
$$ ##$BF4= 400.2
$$ ##$BF5= 400.2
$$ ##$BF6= 400.2
$$ ##$BF7= 400.2
$$ ##$BF8= 400.2
$$ ##$BYTORDA= 0
$$ ##$CAGPARS= (0..11)
$$ 0 0 0 0 0 0 0 0 0 0 0 0
$$ ##$CFDGTYP= 0
$$ ##$CFRGTYP= 9
$$ ##$CHEMSTR= <none>
$$ [...]
$$ 0 0 0 0
$$ ##$ShimPowMaxUC= (0..63)
$$ 130000 130000 130000 130000 130000 130000 130000 130000 130000 130000 130000
$$ 130000 130000 130000 130000 130000 130000 130000 130000 130000 0 0 0 0
$$ 0 0 0 0 0 0 0 0 0 0 0 0 0 0 0 0 0 0 0 0 0 0 0 0 0 0 0 0 0 0 0 0 0 0 0 0
$$ 0 0 0 0
$$ ##$ShimPowMaxUG= (0..63)
$$ 524287 524287 524287 524287 524287 524287 524287 524287 524287 524287 524287
$$ 524287 524287 524287 524287 524287 524287 524287 524287 524287 0 0 0 0
$$ 0 0 0 0 0 0 0 0 0 0 0 0 0 0 0 0 0 0 0 0 0 0 0 0 0 0 0 0 0 0 0 0 0 0 0 0
$$ 0 0 0 0
$$ ##$ShimPowRcbType= 3
$$ ##$ShimPowRes= (0..63)
$$ 1e-20 1e-20 1e-20 1e-20 1e-20 1e-20 1e-20 1e-20 1e-20 1e-20 1e-20 1e-20
$$ 1e-20 1e-20 1e-20 1e-20 1e-20 1e-20 1e-20 1e-20 0 0 0 0 0 0 0 0 0 0 0 0
$$ 0 0 0 0 0 0 0 0 0 0 0 0 0 0 0 0 0 0 0 0 0 0 0 0 0 0 0 0 0 0 0 0
$$ ##$ShimPowRng0= (0..63)
$$ 1 1 1 1 1 1 1 1 1 1 1 1 1 1 1 1 1 1 1 1 0 0 0 0 0 0 0 0 0 0 0 0 0 0 0 0
$$ 0 0 0 0 0 0 0 0 0 0 0 0 0 0 0 0 0 0 0 0 0 0 0 0 0 0 0 0
$$ ##$ShimPowRng1= (0..63)
$$ 1 1 1 1 1 1 1 1 1 1 1 1 1 1 1 1 1 1 1 1 0 0 0 0 0 0 0 0 0 0 0 0 0 0 0 0
$$ 0 0 0 0 0 0 0 0 0 0 0 0 0 0 0 0 0 0 0 0 0 0 0 0 0 0 0 0
$$ ##$ShimPowRng2= (0..63)
$$ 1 1 1 1 1 1 1 1 1 1 1 1 1 1 1 1 1 1 1 1 0 0 0 0 0 0 0 0 0 0 0 0 0 0 0 0
$$ 0 0 0 0 0 0 0 0 0 0 0 0 0 0 0 0 0 0 0 0 0 0 0 0 0 0 0 0
$$ ##$ShimPowRng3= (0..63)
$$ 1 1 1 1 1 1 1 1 1 1 1 1 1 1 1 1 1 1 1 1 0 0 0 0 0 0 0 0 0 0 0 0 0 0 0 0
$$ 0 0 0 0 0 0 0 0 0 0 0 0 0 0 0 0 0 0 0 0 0 0 0 0 0 0 0 0
$$ ##$ShimSysFunc= (0..63)
$$ 1 2 3 4 5 7 9 11 15 16 8 10 12 14 6 17 13 18 19 20 0 0 0 0 0 0 0 0 0 0
$$ 0 0 0 0 0 0 0 0 0 0 0 0 0 0 0 0 0 0 0 0 0 0 0 0 0 0 0 0 0 0 0 0 0 0
$$ ##$ShimSysMatrix= 0
$$ ##$ShimSysType= 1
$$ ##$TFXNUM= 0
$$ ##$TRIPLO2= 0
$$ ##$VTU= 2
$$ ##$VTUETH= <149.236.99.20>
$$ ##$VTUTY= <no>
$$ ##$WBREFAM= (0..15)
$$ 135.5 97.7 100 100 100 100 100 100 100 100 100 100 100 100 100 100
$$ ##$WBREFLM= (0..15)
$$ 0 0 0 0 0 0 0 0 0 0 0 0 0 0 0 0
$$ ##$WBREFPH= (0..15)
$$ 72.26 -67.22 0 0 0 0 0 0 0 0 0 0 0 0 0 0
$$ ##$WBSGU= (0..15)
$$ 0 0 0 0 0 0 0 0 0 0 0 0 0 0 0 0
$$ ##$XFAC= 2
$$ ##END=
$$ 
##$DECIM=	3328
##$DSPFVS=	20
##.ACQUISITIONSCHEME=	NOT PHASESENSITIVE
##NTUPLES=	nD NMR SPECTRUM
##VAR_NAME=	FREQUENCY1,	FREQUENCY2,	SPECTRUM
##SYMBOL=	F1,	F2,	Y
##.NUCLEUS=	13C,	1H
##.OBSERVE FREQUENCY=	100.64244576441500101,	400.20280139999999847
##VAR_TYPE=	INDEPENDENT,	INDEPENDENT,	DEPENDENT
##VAR_FORM=	AFFN,	AFFN,	ASDF
##VAR_DIM=	512,	512,	262144
##UNITS=	HZ,	HZ,	ARBITRARY UNITS
##FIRST=	25164.767445380970457,	5806.2096540000038658,	0.52702730894088745117
##LAST=	-962.11409912165936476,	-191.66820056731904742,	0.67073810100555419922
##MIN=	-962.11409912165936476,	-191.66820056731904742,	0.0016412399709224700928
##MAX=	25164.767445380970457,	5806.2096540000038658,	34.314849853515625
##FACTOR=	1,	1,	0.0033625728699085716961
##PAGE=	F1=25164.8
##FIRST=	25164.767445380970457,	5806.2096540000038658,	0.52702730894088745117
##DATA TABLE=	(F2++(Y..Y)), PROFILE
$$ [...]
##PAGE=	F1=-11034.5
##FIRST=	25164.767445380970457,	5806.2096540000038658,	0
##DATA TABLE=	(F2++(Y..Y)), PROFILE
-192D4
##PAGE=	F1=-11136.8
##FIRST=	25164.767445380970457,	5806.2096540000038658,	0
##DATA TABLE=	(F2++(Y..Y)), PROFILE
5806B4O5l3M2l6Q0j0m3n4R0m3j8l8J12q0K53j40N0q6j05oJ02K2m8R7o2LQ8j71N7RR7m0j25
$$ 24 89 56 98 62 142 132 89 35 125 82 64 26 138 58 311 171 221 135 30 24 126 148 100 197 135 138 226 55 112 121 218 178 53
5419E3Q1l8m0k0NP9N5J03o7r7Q2j2j08Mk4k1O2K3j7m8J25r9J37q9m1L5Rl6M4q3M4rN3M1j12
$$ 53 134 96 56 36 41 120 175 278 211 114 196 184 76 80 56 35 97 120 103 55 180 81 218 129 88 123 132 96 140 57 101 92 145 186 74
5008G4M0j5Lo9J39j06pM8J23Km8j2k2Q7q1J83K9k90Q6L3q2l8rN4M0M1p5M7Rq5J7P4N5p3n2
$$ 74 114 99 102 33 172 66 59 107 230 232 184 172 150 237 156 339 368 78 164 197 115 77 68 122 162 203 128 175 184 99 116 190 245 172 120
4597A20L8l8R8J25j18j12j1j4L4j6jJ37j28q7J02J9q0JQ3J05o1j31M3q6J61k6q0J05n2r0P8
$$ 120 158 120 218 343 225 113 102 88 122 106 105 242 114 27 129 148 68 69 152 257 196 65 108 22 183 157 77 182 130 40 118
4233A18l0J2m5P3q3K5l7P8o1L7N7J2n8j0P1R2Kj26j5L0l5m9M2M7J2m2rP2J04j65j8M6p4J4
$$ 118 88 100 55 128 45 70 33 111 50 87 144 156 98 88 159 251 253 127 112 142 107 58 100 147 159 117 108 180 284 119 101 147 73 87
3834H7o5K5J32l9j23J30m7Q5o8J75M7j64j66J18j09J82l7j2J21j82N9O0K8O3K2k40J28m6j27
$$ 87 22 47 179 140 17 147 100 185 117 292 339 175 9 127 18 200 163 151 272 90 149 209 237 300 322 82 210 164 37
3494C7P8l4J08j7m8r2J05l3K68r7k15J6J64K0j15n2j2K9M2p5j2N2j03P5O7k1o5J25O6j61K4
$$ 37 115 81 189 172 124 32 137 104 372 275 60 76 240 260 145 93 81 110 152 77 65 117 14 89 156 135 70 195 261 100 124
3130A24J47j33j04K4N8Kr8L4K3J25J4K6j60L8KQp0O5q4K7m8R3m2K17l9q9k7o4N4J56k52K67
$$ 124 271 138 34 58 116 118 20 54 77 202 216 242 82 120 122 130 60 125 41 68 20 113 71 288 249 160 133 69 123 279 27 294
2754B94k4j66m3M4N1L1n3K3j18J34p2R1l7QONnR9j24j14N9J70j41m9O1n3P1j46P3J02N0p1
$$ 294 270 104 61 105 156 187 134 157 39 173 101 192 155 163 169 174 169 268 144 30 89 259 118 69 130 77 148 2 75 177 227 156
2379A56k9n6N8n8L3Lp0J0O4n5N7K3M2o6L5r1O3kQ5Jj02M4l6K0M4N9j40nk7M0j6Q1MQ7k05L9
$$ 156 127 71 129 71 104 107 37 47 111 56 113 136 178 112 147 56 119 117 202 203 101 145 109 129 173 232 92 87 60 100 84 165 169 256 51 90
1956I0J00j3j35J60M9q3l3j9J90k27R1P6r6j10l2J41Jj4k3j4Q5Rn9o5K3m1K6O6M4j0K4q7J3
$$ 90 190 177 42 202 251 168 135 116 306 79 170 246 150 40 8 149 150 136 113 99 184 193 134 69 92 51 77 143 187 177 201 114 127
1569A27Q9j03L2o7N3k7k1N8R5p8j7J7l5k4k0k2O9J07j34j1O6l1r8N8j9J2K8J34n6m1qo6lJ2
$$ 127 216 113 145 78 131 104 83 141 236 158 141 158 123 99 79 57 126 233 99 88 154 123 25 83 64 76 104 238 182 141 133 67 64 76
1170G6L9n5O9%J15O6j36o8q0O5L9K3p3l1Lk1L1K1K13l2r7m3j7J3K2j7O1r9k2O1M5oJ0n8J38
$$ 76 115 60 129 129 244 310 174 106 26 91 130 153 80 49 52 31 62 83 296 264 167 124 107 120 142 125 186 87 65 126 171 165 175 117 255
759B55Nk34J80l9l6J29l5l3Nk1n1j4j9L0P4L1j75J34J39J1j14q8q3J4j1M1k5M3pJ4oj4k0N6
$$ 255 260 26 206 167 131 260 225 192 197 176 125 111 92 122 196 227 52 186 325 336 222 134 51 65 54 95 70 113 106 120 114 100 80 136
360A36qL1Q8j71n2J84N1k18J82q4L1lq8MO4J41j77p4M7N8R1r6p5R9j08J07J07j05J71j37j03
$$ 136 128 159 247 76 24 208 259 41 223 139 170 167 79 83 147 288 111 37 84 142 233 137 62 161 53 160 267 162 333 196 93
-4I3Rp1J12q1Q4k7J65N2j74o6J45q6j05P7Kn2
$$ 93 102 31 143 62 146 119 284 336 162 96 241 155 50 127 129 77
-192G7
##PAGE=	F1=-11239
##FIRST=	25164.767445380970457,	5806.2096540000038658,	0
##DATA TABLE=	(F2++(Y..Y)), PROFILE
5806C8O3n9N5m2O5lk3o6P3n4L3lL5n5K78j53M1n9j47J3P9L6o3J52o5l0J33k32R4J7K7q3J4
$$ 38 101 42 97 55 120 117 94 28 101 47 80 77 112 57 335 182 223 164 17 30 109 145 82 234 169 139 272 40 134 151 178 95 109
5419A09K2k5q9J6j2Q8K9Q9j5p9N4or2K3n0l9M7L7j4K7J04j24Q6n5MN6n6qk5m7K9L4l7J7m5
$$ 109 131 106 17 33 21 109 138 227 212 133 187 181 89 112 62 23 70 107 93 120 224 100 186 131 135 191 135 127 102 55 84 118 81 98 53
5008E3N1jM7j35J82j43m5J05R5k4p7K5J4R5o5J67L1k58P1J6r2o1J9M6Q9l5r2Q9K4j21O4J4
$$ 53 104 103 150 15 197 54 9 114 209 185 108 133 147 242 177 344 375 117 188 204 112 51 70 116 205 170 78 167 191 70 134 148
4632A48J01r1o4O9lQ7Q4j49j23pj7M9j6NJ45j10n7R1Mp4l8J21J04q4p1L1m7O5j3JO8q1p8O9
$$ 148 249 158 94 163 160 247 331 182 59 52 35 84 68 73 218 108 51 142 146 72 34 155 259 175 104 135 88 153 140 141 209 128 50 119
4233A19nj5l4L8l1m0L9K2k3M8O1m4m1j1O1Q8nr0nnm4J2PP2lp5kRJ12j24K4L9n2Jo0L7J01l9
$$ 119 114 99 65 103 72 32 71 93 70 118 179 135 94 83 144 232 227 137 132 127 83 95 102 174 171 96 94 103 215 91 115 154 102 103 43 80 181 142
3787A42p7O0l6O3o4K02Nj53j32J25q4R8l6N3J14k22J32Kk5P6Q0k36J40q1p5N4q2P7PK8r7O2
$$ 142 65 125 89 152 88 290 295 142 10 135 51 149 113 166 280 58 190 192 167 243 323 87 227 146 71 125 43 120 127 155 58 120
3412A20j6K46p4j70q3J72L4q2j6j2MJ2r7kM1o6P6L6Kr7J32Q4j60J9J91j43r8j1O1M0r6P1m6
$$ 120 104 350 276 106 23 195 229 147 131 119 123 135 38 36 77 11 87 123 125 28 160 244 84 103 294 151 53 42 103 143 47 118 72
3024G2J10N5j1j57K9M5k2o2P9p9KK1M0k7K27o4q1k7q1J08J46k85K66rj84n6M1Q1Q6r4k9l5
$$ 72 182 237 226 69 98 143 121 59 138 59 61 82 122 95 322 258 177 150 69 177 323 38 304 295 111 55 96 177 263 169 140 105
2649A05Q2p0N5m8J6M4Ok3J01j23j22L2K19j55k8Pm0J36j44nJ50O3r7m0q2K4QM4L8q5J5L4q8
$$ 105 187 117 172 124 140 184 190 167 268 145 23 55 274 119 91 98 58 194 50 45 195 258 161 121 39 63 71 115 153 68 83 117 29
2261B9J03l0L5MK1p1Q0k2M4K0j61P7k8k4N7O3j04M0r2N3L5J08k2J05k64P1P7J4j51J68K5q2
$$ 29 132 102 137 141 162 91 171 149 193 213 52 129 101 77 134 197 93 133 41 94 129 237 215 320 56 127 204 218 67 235 260 178
1886A78k4p1J62j46R7O6j26p3l5J12lm4j9lR3L5o0o2jm2L0K3J03k3m3q4P7J52j12l7r6Q2K1
$$ 178 154 83 245 99 196 262 136 63 28 140 137 93 74 71 164 199 139 77 76 34 64 87 190 167 124 40 117 269 157 120 24 106 127
1499A27l2J9P1p2RM7n7M3r8M3N2N8j31NO1pj11K7KN8N0Q5q1o1k9K7k4JM2k5N6o3J12O5j20
$$ 127 95 114 185 113 122 169 112 155 57 100 152 210 79 84 145 138 27 54 56 114 164 249 168 107 78 105 81 82 124 99 155 92 204 269 149
1088A49j1q4J07nrr1mj3L7k6J4K41lj13m8m0M0M9l0J0o5j1M3M1Rj6p7J32K8k04J29j3n4O9
$$ 149 138 54 161 156 147 56 52 39 76 50 64 305 302 189 141 101 141 190 160 170 105 94 137 178 187 171 94 226 254 50 179 166 112 181
689A81K7j1rj3q0l8oP3Q9J0j58J31J22Pj46o7p7R7j5pl0rN5qn1L7m9J16o3J05J16j89j07J80
$$ 181 208 197 188 175 95 57 51 124 213 223 65 196 318 325 179 112 35 132 117 110 80 71 126 118 67 104 55 171 108 213 329 140 33 213
290B13Q9k03J20p4K8Nj38N5L7J38j39n0J7lJ09j38N5P6j26K2J23j07K02j16n5J0r6O6p6J15
$$ 213 302 99 219 145 173 178 40 95 132 270 131 81 98 95 204 66 121 197 71 93 216 109 311 195 140 150 54 120 44 159
-63A59j8J57Q1j54j59J93p2j26R3jn8
$$ 159 141 298 379 225 66 259 187 61 154 153 95
-192I5
##PAGE=	F1=-11341.3
##FIRST=	25164.767445380970457,	5806.2096540000038658,	0
##DATA TABLE=	(F2++(Y..Y)), PROFILE
5806D2O6o6M7k4K4oj4m3M6k3P4Qn4OK51j58K4l9j27M7PRl8J88m7o8J64k72J40K3o0p3R9m0
$$ 42 108 42 89 65 89 83 69 26 72 49 123 131 77 83 334 176 200 161 34 81 88 97 59 247 200 132 296 24 164 187 127 54 153 113
5407A13pr0M8l3P7oP7M1p4PPo1M2o6m3QO6JM0J05j21K1kJ6Q5r9%p8Kk0O1o1m9M5K1L7Q0j60
$$ 113 106 16 64 31 108 102 179 220 146 153 160 99 141 75 32 40 106 107 147 252 131 152 150 166 251 152 152 74 76 56 117 56 7 52 73 110 190 30
4961C0J80j56j8P7N6n2o9O0K6R2m9J38K1j95O0kr1p7M9OJ29r0j05J32L1j43R6n4J30q1o0Q9
$$ 30 210 54 36 113 169 117 48 108 134 226 177 315 336 141 201 199 108 31 80 86 215 125 20 152 183 40 136 82 212 131 71 160
4586A60M1N5M3j60j02L3K8n5j4K6J13q7pO1J2l5m1O7J14r8j3K7l7j8RP0N4j22m3L3J7ro2K7
$$ 160 201 256 299 139 37 70 98 43 29 55 168 81 74 135 147 112 71 138 252 154 141 168 131 113 122 192 246 124 81 114 131 122 60 87
4186H7jo6Q8oJ3J4O8q7k7%N5R1m5n6K2m1k7M9n3J27n1q6Nk6R7q9P5K3k9oo3N0O1m0Ml0jL2
$$ 87 86 20 108 102 115 129 197 110 83 83 138 229 184 128 150 109 82 131 78 205 154 68 73 47 144 55 130 153 124 118 55 105 166 126 130 100 99 131
3740A31o8K01m1j31o5J09l6%k6J08R6k25J61m3r3R0J41k21J52j07l9L5j06M0J6J06r7KjK18
$$ 131 63 264 223 92 27 136 100 100 74 182 278 53 214 171 78 168 309 88 240 133 94 129 23 63 79 185 88 90 89 307
3388C07m1j24j02Q8N2k8J3j7j1%p5l2Jk5O7J0M1p0P8J05j31l4K22j28q8k9M4N6r0J32j14Q5
$$ 307 266 142 40 128 180 152 165 148 137 137 62 30 31 6 73 83 124 54 132 237 106 72 294 166 78 49 93 149 59 191 77 162
3013A62P4k8j34oO9m7k0R7r1rP5k4LK15p2j05pp4J42J17k59K12K1j88o8K6J00J40j23p8M8
$$ 162 236 208 74 68 137 90 70 167 76 67 142 118 121 336 264 159 152 78 220 337 78 290 311 123 55 81 181 321 198 120 168
2649A68L0p4K3n5K0P5J9n0R1j22j16RK59j62K2p8k0J82j40qJ39N0j07n0n6l8R0K4O4j00K2
$$ 168 198 124 147 92 112 187 206 156 247 125 9 18 277 115 137 59 39 221 81 73 212 262 155 105 49 11 101 125 189 89 111
2285A11Jn0R6r1J1P1K9o4Q8m2ML1j44N0lp1Q9N2m0N0j26M5N8J12k4J02k77P3P1L6j57J62j1
$$ 111 112 62 158 67 78 149 178 114 202 160 164 195 51 101 98 27 116 168 128 178 52 97 155 267 243 345 68 141 212 248 91 253 242
1898B42p2k3q9J06p0R0P2j50Qo5P5jo9JoQ2O1n0n2mj0J0m3J26k5r5oO5J88j13j08l3K9P8m5
$$ 242 170 147 58 164 94 184 256 106 114 49 124 123 54 55 49 131 192 142 90 86 76 86 43 169 144 49 43 108 296 183 75 42 71 149 104
1487A04j1M1n5LP6o8J00j06O5J9Lq7JK8K4r8NK4P7M9M5o1j3j26J34m8k7L9PN4j44J10O9r8
$$ 104 93 134 79 82 158 90 190 84 149 168 171 84 85 113 137 39 44 68 145 194 239 178 165 39 173 125 98 137 144 198 54 164 233 135
1088A35J0n1J25m6l7j09M7K6J0n6j3K51K2r1m1p3L5N5l3l1j8NK7K7L0m6o9J12N7j37L2J8k9
$$ 135 145 94 219 173 136 27 74 100 110 54 41 292 314 223 182 109 144 199 166 135 117 122 149 176 206 160 91 203 260 123 155 173 144
700A44m2P1K2j6lj01n2mJ07Q6rj26J28R1rj76k6l6J69m3o2n1l3J16k5p5P6p6J58j15J81J19
$$ 144 102 173 195 179 176 75 23 19 126 212 203 77 205 296 287 111 85 49 218 175 113 62 29 145 120 45 121 45 203 88 269 388
325C88j96j12J31J04j78O1p0M3j2j41Q5LJ34j02l7Qn8J23j41J58J2j29m9J47j17K15j13PK7
$$ 388 192 80 211 315 137 198 128 171 159 18 103 106 240 138 101 109 51 174 33 191 203 74 25 172 55 270 157 164 191
-16A91j31M5q8J32J5J25R1j32j98K25m9j63J03lo6
$$ 191 60 105 17 149 164 289 380 248 50 275 226 63 166 163 97
-192I7
##PAGE=	F1=-11443.5
##FIRST=	25164.767445380970457,	5806.2096540000038658,	0
##DATA TABLE=	(F2++(Y..Y)), PROFILE
5806C5P3o8L6kj6k1k2MN5J8N9K1p7N2J62j52Kk4p7O2m3l9nK06j2j12J80k41J45K3j47K4P9
$$ 35 108 40 76 74 58 37 15 19 74 92 151 172 95 147 309 157 159 135 58 120 77 38 33 239 227 115 295 54 199 222 75 99 178
5419A78q8J4o1O7k2K9m3P8P5q0m2J6k0N9o8m9k5Q7K8MJ23r9j5K6LJ15j08j4j06K0m5N8rj0
$$ 178 90 104 43 110 88 117 74 152 227 147 105 121 101 160 92 43 18 105 133 137 260 161 146 172 175 290 182 168 62 82 37 95 86 76
5020G6k5j7Q6R0j64J65j43OL0K8r3rO7J0Q0l3J01Mj14N3k0p0p0N4l3J33j07m9J00K7j40R9
$$ 76 51 34 120 210 46 211 68 74 104 132 39 30 97 107 187 154 255 259 145 198 178 108 38 92 59 192 85 36 136 163 23 122
4644A22j00J15m3l5R2Q4RNj42m7M0N9q1o2L4N2o2N0K6M8j8m5NJ28r8L3K7n6m8L8R4N2j55o
$$ 122 22 137 94 59 151 235 244 249 107 60 100 159 78 16 50 102 40 90 116 164 146 101 106 234 136 169 196 140 92 130 224 276 121 115
4245A15j5K9K8j17L9jn4J20j2J5k4P5j07j9K3M1J04j09l3O6p5J3O1j25J93j16p2J2L7L4r9
$$ 115 100 129 157 40 79 78 24 144 132 147 123 198 91 72 95 136 240 131 98 164 89 102 163 38 231 115 43 55 92 126 27
3881B7J12%oj6o2O7K2m9Q8j06M3J4r0J73q0j02J3Q3J2o9j5J35P1j92J44n6j20M3J92k03J79
$$ 27 139 139 133 117 55 122 144 95 183 77 120 134 44 217 137 35 48 131 143 74 59 194 265 73 217 161 41 84 276 73 252
3517B52r8m6J4q5J2rJ57p9o5J3J87j0q0o3m3O7L2K9j0j8j7n9m5ooK6nQ2l3K5J12r7r0K31j07
$$ 252 154 108 122 37 49 40 197 118 53 66 253 243 163 100 57 124 156 185 175 157 140 81 36 30 24 50 45 127 94 119 231 134 44 275 168
3107A68n2k7rN9o9J79j57N5O6l6r3m5O7o0L3J10j01mJ04r1L5K04o4j60K7m9J56P2k04J43N6
$$ 168 116 89 80 139 70 249 92 147 213 177 84 39 106 46 79 189 88 84 188 97 132 336 272 112 139 90 246 318 114 257 313
2743C13j72o9QQ3J76j31j09J11pq6Pm6J5R3M1o8M9j18p3OK40j60O8j51QJ99j36K1J00L4j07
$$ 313 141 72 80 163 339 208 99 210 203 117 124 78 93 186 227 159 208 90 17 23 263 103 171 20 28 227 91 112 212 246 139
2379A39m0j9j5Q3oP0j13K3k2j0R1j30k2J08N9p5Q6n1l6K7n9Pml0P2K1JM0j00K8K8J01nQ3k48
$$ 139 99 80 65 148 142 212 99 122 100 90 181 51 29 137 196 121 207 156 120 147 88 95 91 61 133 154 155 195 95 123 151 252 247 330 82
1968H2M8Q8N4j59J51o0n4k7r2N1QN2Q9j44P4r3L4J0o1K3l5N6Q2m1l9J6J1j2r5J04j2r2P6J2
$$ 82 130 218 272 113 264 204 150 123 31 82 90 142 231 87 161 68 102 112 51 74 39 95 177 136 97 113 124 112 17 121 109 17 93 105
1569A05J86j08j50N9o8J29m0l4M8l2o3R1o0J31p2N7nm9j6pm3O9o9LK2P4L3K6oL2j45J40o4
$$ 105 291 183 33 92 24 153 113 79 127 95 32 123 63 194 122 179 174 125 109 102 59 128 59 62 84 158 191 217 211 243 98 238 174
1182A74n8L3L9M8j90R8P2p3j4l5J59p4n6j00P4O1l4o6j3K16L4m0k0j08JL9k2n7L4J8L3LN0
$$ 174 116 149 188 236 46 144 216 143 129 94 253 179 123 23 97 158 124 58 45 261 295 255 235 127 128 167 145 88 122 140 173 176 226
794B26q0n6R7R2q3n7M9Nj05M1N4j9Qr7Lp5J22P0k2j11J18N6j6j64lJ4K15o0j12p7l2J53l5
$$ 226 146 90 187 279 196 139 188 193 88 129 183 164 172 75 78 3 125 195 173 62 180 236 220 56 53 67 282 222 110 33 1 154 119
407A19o0O8q7J83j51K42J01j91j05Q3R2j48K3o6M2l2o8O8l8J26q2j8J6o8R7o9J62n8j19l5
$$ 119 59 127 40 223 72 314 415 224 119 202 294 146 169 103 145 113 45 113 75 201 119 101 117 49 146 77 239 181 62 27
55B7J25j28J92j26O7N8j74O4p6Q2O6Q6Q2j10k00K46j8k07J10qo5
$$ 27 152 24 216 90 157 215 41 105 29 111 177 263 345 235 35 281 263 56 166 158 93
-192I3
##PAGE=	F1=-11545.8
##FIRST=	25164.767445380970457,	5806.2096540000038658,	0
##DATA TABLE=	(F2++(Y..Y)), PROFILE
5806A7Q5p1M1Rl6k0L2m1J03J9J5L5m0P6N1j46k2ml1O7m8jo9J96K8j56J83j76J40J0k19J18
$$ 17 102 31 72 81 45 25 57 16 119 138 153 188 148 224 275 129 107 103 72 139 91 90 21 217 245 89 272 96 236 246 27 145
5431A45L8j11K8l4R2jk4p3P8Q8r0p2OK6O6n5n8j8O8O1n3J51q4lJ2j5J35q2m3j15PqJ5L6J5
$$ 145 183 72 100 66 158 157 133 60 138 226 136 64 70 96 162 107 49 31 99 160 107 258 174 171 183 168 303 221 178 63 70 62 77 113 128
5020A28q9pR6P3j46J40r9Rj5M0p5j5M5j8N8jN5j4l7M8l5k6n6N0ML7p4OL5J5j03P0pm6OJ8P1
$$ 128 39 32 128 201 55 195 96 105 90 130 55 40 85 67 125 124 179 165 128 176 141 115 59 109 113 150 76 82 117 132 29 99 92 46 52 70 141
4586A41J16m3k7r2lJ6Q6n7q4qJ5l1O1MR0k1n3l9J36q4N7L3r3j0N5P4N4j74K4o5K8P3j61N9
$$ 141 257 214 187 95 92 108 194 137 53 45 60 29 90 94 184 163 110 71 207 123 180 213 120 110 165 239 293 119 143 78 106 179 18 77
4186G7k1k9J51j9mn0Q2j09j2N3J3J21j72l0J22r8M9O4j42J96j77l9J6J02Oj25J10k2Rl0m6
$$ 77 56 27 178 159 155 105 187 78 66 119 132 253 81 51 173 75 124 188 46 242 65 26 42 144 150 25 135 113 122 92 46
3823D6Q7nn8J51j61P6J9j31J31r5k7L6N1M8r4PJ19M1j62J20l0m1j20K16j92K33m8r4k0n5O
$$ 46 133 128 70 221 60 136 155 24 155 60 33 69 120 168 74 81 200 241 79 199 169 128 8 224 32 265 217 123 103 48 54
3459E4k3J55m3j29L0J57J1m5k2j19M6R2K6Rj4m9o2l8M1nl5KQ9j7OR6o7j09K08r9J7k1q3N7
$$ 54 31 186 143 14 44 201 212 167 145 26 72 164 190 199 185 136 74 36 77 72 37 39 128 111 117 213 146 37 245 146 163 142 59 116
3060A16k4J81j65K7M8n2m7o0M6j6J9J17j02J3J08j48O8J99m6k36P0rJ45J8j32P6R1j42o2O
$$ 116 92 273 108 135 183 131 84 24 70 54 73 190 88 101 209 61 129 328 282 46 116 107 252 270 138 214 305 163 101 107
2708A07K8J73j12j12J36k1j02Rj8LR6O4o9k1j14QMJ75j51J01j67K5J73j32M4N8L1j05kqqR5
$$ 107 135 308 196 84 220 199 97 106 88 91 187 251 182 161 47 55 59 234 83 184 17 42 215 83 127 185 216 111 109 101 93 188
2332A88j6N0j22J7k8J0R5j24jM5R7r4P5m8p2NL8Kl1L1M8m%J5l6J2l9Q6K9O1j91OJ18P6j61
$$ 188 172 222 100 117 89 99 194 70 69 114 211 117 192 144 72 77 115 117 86 117 165 161 161 176 140 152 113 199 228 289 98 104 222 298 137
1921A37J32j15l0j7j00K8Q7l1J01q8R1j15mK9k3K0n7K0R5m1j7M6Rk8q7J2K7j3N0j5J51j00
$$ 137 269 154 124 107 7 35 122 91 192 104 195 80 76 105 82 102 45 65 160 119 102 148 157 129 42 54 81 68 118 103 254 154
1545A54j00P5r5J04Jo5R2l1j08M7l9J36k5L7j0q9M7mj19J23m5qOO4J6L6M1N3j26J20p6q7K6
$$ 154 54 129 34 138 139 74 166 135 27 74 35 171 146 183 173 84 131 127 8 131 86 78 84 148 164 200 241 294 168 288 212 125 151
1158A51O8L6j72P2O4n9n9m5K00q5o6n0N9R1r5n9QJ65K6K1J0j30n1LOm9O3K7N9k8O1j12n1R7
$$ 151 219 255 83 155 219 160 101 56 256 171 105 55 114 205 110 51 59 224 250 271 281 151 100 103 109 60 123 150 209 181 242 130 79 176
759A76J22m3j23P2K5q6n5P3k3K6o5L8j28J10M7k6j08P1K2J9o6n5N0K44n7j47m7n3J37m0l8
$$ 176 298 255 132 204 229 143 88 161 138 164 99 137 9 119 166 140 32 103 125 144 78 23 73 317 260 113 66 13 150 110 72
395G2M4p8J82j63K81P1j75q7L6O4j16Rm8mj5NM8p5J11p9J9K6m7M4rJ43j15r6OR5j10J16j21
$$ 72 116 38 220 57 338 409 234 147 183 247 131 140 92 88 73 78 126 51 162 83 102 128 81 125 116 259 144 48 54 149 39 155 34
8C4R0R5k05R8m1k0J24O1N0q9j74K49K0k49J18j9m2
$$ 34 124 219 14 112 71 51 175 236 286 197 23 272 292 43 161 142 100
-192A00
##PAGE=	F1=-11648.1
##FIRST=	25164.767445380970457,	5806.2096540000038658,	0
##DATA TABLE=	(F2++(Y..Y)), PROFILE
5806A3P6p0O8J2k8mO8q8J25Km0M1J3J06m1j52m1K1j1O6j9L7j12J40O6j94J80j05J34j2k31
$$ 13 89 19 87 99 71 67 135 47 172 174 134 175 188 294 253 101 60 81 70 136 117 154 42 182 248 54 234 129 263 251 20
5442B0J54%j05K4oJ15K2p6q6N5R6q5o4m8P3O0l4n9JL6R0j03J88j03L4j5k5J31l4o9j16k2N2
$$ 20 174 174 69 93 87 202 224 148 62 117 213 128 64 16 89 149 115 56 57 93 183 80 268 165 199 184 159 290 256 187 71 49 101
5055A01j2L1K3j01K3O5K7q5R4l1mn8Q7l2p5Rm0K5P0j0j6OL8m2L8m8M7O7q8j4J7k2jn0M9P9
$$ 101 89 120 143 42 65 130 157 72 166 135 131 73 160 128 53 62 22 47 117 107 91 97 135 93 131 83 130 197 109 95 112 90 89 39 88 167
4632A67r1n1P7K8J36q8o1j0K5l2J00k5q6l7M2k6MRJ08k6o0m4J11n6N7M1j28N6O4L7N4j79M0
$$ 167 76 25 102 130 266 178 117 107 132 100 200 175 89 52 94 68 72 81 189 163 103 59 170 114 171 212 84 140 204 241 295 116 156
4245A56j00J5J03j50M8m3MJ74l6l2n4Q0r0pQ0k7J37k00l5J53r8O4N7j05J40j91j0MJ27nj16
$$ 156 56 71 174 24 72 29 33 207 171 139 85 165 75 68 148 121 258 58 23 176 78 142 199 94 234 43 33 37 164 159 43
3881D3P6m1J5m6oR8k2l5J58j94R1L7j50O2k7J4J7J9O5r8L5Q9K1j61J08J6K2j29Q1j09K33R
$$ 43 119 78 93 47 41 139 117 82 240 46 137 174 24 86 59 73 90 109 174 76 111 200 221 60 168 184 206 77 158 49 282 291
3506B91j46o5l4KmJ10Lj35OJ31J9k1Qj04j6J37LK3Jp7q4j2Q2Op0L7K9j9J5N9l6r6J62j01J00
$$ 291 145 80 46 48 44 154 157 22 28 159 178 157 165 61 45 182 185 208 209 132 48 36 118 124 54 91 120 101 116 175 139 43 205 104 204
3095B04j2j57M9K9J43j37jM5p8jm0K9M0o1J12q8L3R4j76R2J96k3k73P4L6J14m0n7K8J14j02
$$ 204 192 35 84 113 256 119 118 163 85 84 44 73 113 52 164 76 109 203 27 119 315 292 19 93 129 243 203 146 174 288 186
2731A86n3J4k5J11o8q2J15j2j12K0J2mQ5Q1o0r0j06Q8j2J08j33J13j26K9J21j36M8K2M4j00
$$ 186 133 147 122 233 165 83 198 186 74 94 106 102 187 268 208 118 12 100 88 196 63 176 50 79 200 64 112 134 178 78
2379G8M0pk6J22J3Nj30Kj1JJ05q9J5l0J32j06N3l3j01KR2Pm9P4L1oj5m6M8qj08P2O1N2j21
$$ 78 118 111 85 207 220 225 95 97 86 87 192 103 118 88 220 114 167 134 33 35 127 134 85 159 190 184 169 123 171 163 55 127 188 240 119
1968A19l7J43J01j61R4j55kJ7p7K4J12j16Q4j4Q1j21m3N4J2Nn9j4R6m7K2O4j5k9n8l7N0J1
$$ 119 82 225 326 165 259 104 102 119 42 66 178 62 146 132 213 92 49 103 115 120 61 47 143 96 118 182 167 138 80 43 93 104
1592A04J0j7R7r2j3N8n6K6O7j09J30l8r7l9j9J20J8J2Mj09P6J4p3Q6m7l3j2N2PP3N1M9q2R5
$$ 104 114 97 194 102 89 147 91 117 184 75 205 167 70 31 12 132 150 162 166 57 133 147 74 160 113 80 68 120 127 200 251 300 218 313
1193C13q4j10K0R1J9j27N7N2n8q3q4K22p7o4j2N3J19j80l0K5J27%P1M7j34q9o3N9lM5K9R2
$$ 313 229 119 139 230 249 122 179 231 173 90 6 228 151 87 75 128 247 67 37 62 189 189 260 307 173 84 21 80 77 122 151 243
818B43o3O6j32n3J05J37j5j60Q2K6m6j32P6l1M9j5M8j58P8K6j9n4l3L3N9nj07O1K60l2j62
$$ 243 180 246 114 61 166 303 288 128 210 236 190 58 134 103 152 137 185 27 105 131 112 58 25 58 117 112 5 66 326 294 132
454A32kj08J20n1k2K7m4J42j49K88M1j51o0pM0r7J7j6q6J03qL0q3P3n7N5J2k8PJ9J14j44m5
$$ 132 130 22 142 91 69 96 52 194 45 333 374 223 163 156 196 99 116 100 14 117 109 139 56 129 72 127 139 111 118 137 251 107 62
67F2oR1r4L8Qk2J26j39N5np5J16O7mp0j18K19N3k76J30l6k
$$ 62 56 147 53 91 99 77 203 64 119 114 39 155 222 218 148 30 249 302 26 156 120 118
-192A18
##PAGE=	F1=-11750.3
##FIRST=	25164.767445380970457,	5806.2096540000038658,	0
##DATA TABLE=	(F2++(Y..Y)), PROFILE
5806D1L1n5R3K4j2k3J07j14J20j9q3K9O1J43r0j68m3L3j8N7K2M4j11O8R7k12J68m3J24l5j74
$$ 41 72 17 110 134 122 99 206 92 212 193 110 139 200 343 253 85 42 75 57 114 136 180 69 137 234 22 190 147 271 236 62
5442F2J31l1q3jL0J24M1j15q6QJ10n2n3m6M8L7j1m1J3J8R2j11K08j57P9k2k8R5J8q0j17m5
$$ 62 193 162 79 78 108 232 273 158 72 80 190 138 85 39 87 124 113 72 85 103 195 84 292 135 214 192 164 259 277 197 80 35
5067C5R7k1kJ0l4NL4l9K7K4M0k9q6J32qj01m7QqJ09p3L2l9J4k4J02m3L6J16j81K6J2o5k1R
$$ 35 132 111 109 119 85 90 124 85 112 136 176 147 61 193 185 84 37 45 37 146 73 105 66 80 56 158 115 151 267 86 112 124 59 38 47
4656D7N6J18o2j09R4k6J43j14r8Q6M4q3Q2Mo4l1N3m5n8N2Q0j9o0j3N6k3L4M5j33J02P4NM4
$$ 47 103 221 159 50 144 118 261 147 49 135 179 96 178 182 118 87 140 95 37 89 169 150 90 77 133 110 144 189 56 158 232 237 281
4269B81j72M2j09qJ03r8J8m7L7J82o1o5l2O5m6j5R7o6J45j73OQ9p8O7K9o7Q1j23j9k1J04l
$$ 281 109 151 42 34 137 39 57 10 47 229 168 103 71 136 90 75 172 106 251 78 84 173 95 162 191 124 205 82 63 42 146 143
3893A43o6K1n4QlNR1m2J8J18k04Q8N9j19m6Q9j5K4kN1r4N7P4K4k02J15N3P0j23m4M4J61N1
$$ 143 77 98 44 52 49 54 145 103 121 239 35 123 182 63 17 106 91 115 113 164 70 127 201 225 23 138 191 261 138 94 138 299 350
3506C50j78j02l4K4nN4M4j00l8J13K4j7K0o5l4J58l7J7J7p5p9JQ3J9p0P0n8k5L3J0pp3J17
$$ 350 172 70 36 60 55 109 153 53 15 128 152 135 155 90 56 214 177 194 211 136 57 58 141 160 90 160 102 77 110 120 113 40 157
3118A57j08J79Lj93J4O8P8q1k7P3q5K6k3K7N7j41R5o1M9P3j10M3J87lk28JQ1P5r9RJ4J17o2
$$ 157 49 228 231 38 52 120 198 117 90 163 78 104 81 108 165 24 119 58 107 180 70 113 300 297 69 70 151 226 127 136 150 267 205
2731B05m2J6n0Kpk5N3J5r8J4L9lO2Q8n3j26n2J03l7N4j03J01q1N4O7j52L4oO4o9N1lp2J60
$$ 205 163 179 129 131 124 99 152 167 69 83 122 119 181 269 216 90 38 141 104 158 55 156 75 129 196 44 78 72 136 67 118 115 43 203
2332B03P9n7j36k1K4k6J12m2J0o9J44r8K4j6j01O9L1kn0R9K0J3Mj64J35l7q7J7N7O7n4p4J53
$$ 203 282 225 89 68 92 66 178 136 146 77 221 123 147 131 30 99 130 128 78 177 197 210 214 50 185 148 61 78 135 202 148 74 227
1945B27J22j51K7j65L1N4o8J8J34j61L1N0O8j10q1Q3L1j6m1k6O4m3P5N2n3rk0j2J2Mm3jM1
$$ 227 349 198 225 60 91 145 77 95 229 68 99 149 217 107 26 109 140 124 83 57 121 78 153 205 152 143 123 111 123 127 84 83 124
1557A24q2O7L8rl1J27j57J45l9q1n8l7R3L5PJ5j12P0L9k4P5p0o6k2L7J6J06K7L1k8P4r0j16
$$ 124 42 109 147 138 107 234 77 222 183 102 44 7 100 135 142 157 45 115 154 130 205 135 69 47 84 100 206 233 264 236 310 220 104
1170A04J0J01Lp0M9M3o3p3k9J03n5n2KP1J43k51ML6Q4l5R8Q2j14q8m2J6K3J7K5J22r7O5j28
$$ 104 114 215 218 148 197 240 177 104 75 178 123 71 73 144 287 36 40 76 160 125 223 305 191 103 61 77 100 117 142 264 167 232 104
783A04n2J00J33Nj65P6J1%j51M9m3O8M5L8j74L6J4kK2L1L3k9k6j14L7K71Pj61K2j37R6p6j1
$$ 104 52 152 285 290 125 201 212 212 61 110 67 135 180 218 44 80 94 92 114 145 178 149 123 9 46 317 324 163 185 48 144 68 57
395E7K2RP1j05K48J9j30k3m4M2j05L2J8j8R9n3Qo0K1RM5j7j4pJ6Q1j43K2n2R4q3l1J47j27
$$ 57 79 88 159 54 302 321 191 168 124 166 61 93 111 93 192 139 147 87 108 117 162 145 131 124 140 221 78 100 48 142 59 28 175 48
-4D8J26m6mK8l3KJ00o4n3n5J64P7k85J41m8L7
$$ 48 174 128 124 152 119 121 221 157 104 49 213 290 5 146 98 135
-192A35
##PAGE=	F1=-11852.6
##FIRST=	25164.767445380970457,	5806.2096540000038658,	0
##DATA TABLE=	(F2++(Y..Y)), PROFILE
5806F8j7j7R6M7Rp4J48j20R1l5j00qJ00J74j00j79k0L4l3J8N7K3p2qJ21j60J04kJ09m4j07
$$ 68 51 34 130 177 186 112 260 140 231 196 96 88 188 362 262 83 63 97 64 82 139 162 90 82 203 43 147 145 254 210 103
5442A03J07n0o2l8O6J17N2j33q3n0J36kp0j7J1QLlJ7J5O6q6K06k19J28%m0L5N7p0j17m4J06
$$ 103 210 160 98 60 126 243 295 162 79 29 165 163 93 76 87 95 98 95 112 127 193 107 313 94 222 222 182 217 274 204 87 43 149
5055A49l2k1k7P3l4jn6J14l9P9n4r1J54Pr6p7L5K7P1r0O7j01l0L5J34m1J1J39k37M8Mn1j8
$$ 149 117 96 69 142 108 107 51 165 126 205 151 60 214 221 125 48 83 110 181 91 158 57 27 62 196 155 166 305 68 116 120 69 51
4668E1KQ2J13l6j30J03p7J36j15r2J32N3j12K4L2k6j0L7o6q2R7J8om3J6RKnM4q7R5Q6rJ6j54
$$ 51 53 135 248 212 82 185 108 244 129 37 169 222 110 134 166 140 130 167 101 19 116 134 128 85 101 110 112 107 151 64 159 245 236 252 98
4257I8L2q8j9N4k8j8oM9J66q5r0J2K3K1l8J01q9J34j15L2K1n4P0j6m1L6l3l2m1M4L4rl8o7
$$ 98 130 42 23 77 49 31 25 74 240 155 65 77 100 121 83 184 95 229 114 146 167 113 183 167 126 162 129 97 56 100 134 125 87 20
3858B0J1R2m3P0o7P7O3j90O4Q1p0n9Q9n5O0PMr7O3R3M6k07P0N9J04j07j02J55P5P0j87j07
$$ 20 31 123 80 150 83 160 223 33 97 178 108 49 138 83 143 150 154 57 120 213 259 52 122 181 285 178 76 231 306 376 189 82
3482H2n4P1l5NO1n6o4R6K9l2K0rl6J78q3j8K7l9l7lL6L0k9Q9j55NJ9l5J8n3P5r6K19K7j84
$$ 82 28 99 64 69 130 74 10 106 135 103 123 114 78 256 173 155 182 143 106 103 139 169 140 229 74 79 98 63 81 28 103 7 226 253 69
3071F9k4O3J2j9n0J19n7L1k5J6N8j65N3k0L6O0k8j1J63Rj99m0J13M2j48M9L5J02k8k7No1q1
$$ 69 45 108 120 101 51 170 113 144 119 135 193 28 81 61 97 157 129 118 281 290 91 51 164 206 58 107 142 244 216 189 194 133 52
2684E2L1M1k4M3n2k2O7PK0Q8n6j18pR7o3L1o6O4m2R3K2j73J4oO1lJ6Pr9J60J64j18j45m4N6
$$ 52 83 124 100 143 91 69 136 143 163 251 195 77 70 167 104 135 69 133 91 184 206 33 47 41 102 99 115 122 23 183 347 229 84 40 96
2273I6l5R1J2j3o4J30p4%qq9J15k4l8m3J14J2M3O3k57J53o9J4l8j3J04%j11J55J30j25o3j35
$$ 96 61 152 164 151 87 217 143 143 135 46 161 137 99 56 170 182 225 288 31 184 115 129 91 78 182 182 71 226 356 231 168 33
1898C3N9P7p2J1J53j85k2J00N7q6r1R5K8m3pj1kj4J20Qq6K7J9pk6kr6L6j3j1P5RL4n4J58j95
$$ 33 92 169 97 108 261 76 54 154 211 125 34 129 157 114 107 96 94 80 200 208 122 149 168 161 135 133 37 73 60 49 124 133 167 113 271 76
1475G6J35k5o1n8m0O3J2N8pj15M0O9J9P7j01q4j0J2L5J10j4NK3N6q7r2oQ8rj5M4M2o5n7J3
$$ 76 211 186 125 67 27 90 102 160 153 38 78 147 166 243 142 58 48 60 95 205 191 196 219 275 188 96 90 178 169 154 198 240 175 118 131
1064A31j1k6l1j5J14J58k12m0O0J6p6R8J10p4o1j2m8J7J2J6J35j24O6r8l3O0J11K1j40N5j6
$$ 131 120 94 63 48 162 320 108 68 128 144 68 166 276 202 141 129 81 98 110 126 261 137 203 105 72 132 243 264 124 179 163
700A63M3j15Pm2N9J06J1j84KJ7J4P9O9J7q3n1q3oK73M7j52K6j36P7j05MJ2O7Mn8J72J0j22
$$ 163 206 91 98 56 115 221 232 48 50 67 81 160 229 246 163 112 29 23 296 343 191 217 81 158 53 57 69 136 140 82 254 264 142
313A42K9q0O5j26L7M8O4P1q4j8k4l0P3J7l9%j2mM5j21Q7q4P8o6k4J85j55P2M2n9M9J5j14J40
$$ 142 171 91 156 30 67 115 179 250 166 148 124 94 167 184 145 145 133 129 174 53 140 56 134 68 44 229 74 146 188 129 178 193 79 219
-86B19j00m0%R3Q1k31J04m6O2
$$ 219 119 79 79 172 253 22 126 80 142
-192A42
##PAGE=	F1=-11954.8
##FIRST=	25164.767445380970457,	5806.2096540000038658,	0
##DATA TABLE=	(F2++(Y..Y)), PROFILE
5806H9n9K4R1O9L3j38J83j10M7m6q9n7J30J78r0j66kO0m4n3Q1j5j3q1J36q0L0J4R4l0m6R2
$$ 89 30 54 145 214 247 109 292 182 229 183 94 37 167 345 255 89 87 147 103 50 131 116 103 22 158 78 108 122 216 186 140 232
5431B32o0n4p1R3R2N4j28p7n6J21M2j07J3j4j2NM5J2K0K6m7J83k46J71L0p2k3P1m1j13l7R9
$$ 232 172 118 47 140 232 286 158 81 25 146 188 81 94 80 68 73 118 130 150 176 129 312 66 237 267 195 172 243 202 89 52 151
5055A51n0mn5J53p1m3N8P2p4P4p3p1J58J1p5p7J4O3L3q0Q2j18l1M4J48m5k6J36k65P3jK0l
$$ 151 101 97 42 195 124 81 139 211 137 211 138 67 225 236 161 84 98 161 194 114 196 78 47 91 239 194 168 304 39 112 111 131 128
4668A28p0J10P8j4j24J09j06J08r5l9J15N2j22m9O7PPJ0q7k3Q3l5j4nK4nJ3n0L9j9N6J03m
$$ 128 58 168 246 232 108 217 111 219 124 85 200 252 130 81 148 155 162 172 85 62 145 110 96 91 115 110 123 73 112 93 149 252 248
4280B48l2j32J9m8j8k1M9l8L1M6J29r3p6M1m5R3o9R8q9R7m1M7l7l9P9o1l5J6N1m6o1j2J22
$$ 248 216 84 103 55 37 16 65 27 58 104 233 140 64 105 60 153 84 182 93 190 149 196 159 120 199 138 103 119 170 124 63 51 173
3893A73Kp9q5N2J38r3M2q0J19Nj54K9R6j8m1M5r6J15M4m7j30N2J47O6j89ML9J24q5p4J86r
$$ 173 175 96 11 63 201 108 150 70 189 194 40 69 165 147 106 151 55 170 214 167 37 89 236 302 113 117 156 280 195 121 307 298
3517B98O4j77q1p7J06n9j2K6on4O1L1n6K6M4l6K00j21p5K1K0J0Om4L2N3Q5k41P9m2k4J2n4
$$ 298 362 185 104 27 133 74 62 88 82 28 89 120 64 90 134 98 298 177 102 123 143 153 159 115 147 200 285 44 123 81 57 69 15
3130A5L6NJ42N9j56k7J1Kj5o5J62k0L3l1mM8j52M7KlN7K9m1J25J1j87k4J06K3j49K5Q1P6j
$$ 15 51 56 198 257 101 74 85 87 72 7 169 149 182 151 147 195 43 90 92 89 146 175 134 259 270 83 59 165 188 39 64 145 221 220
2731B20j0k2p2j7m7R6q6N9Lp1R4K6l8Q0o9p8K8P3q1N1m8K3j8J35j1j83NL3K1M5k6J5m0O8K46
$$ 220 210 188 116 99 52 148 62 121 124 53 147 173 135 215 146 68 96 169 88 139 91 114 96 231 220 37 42 75 96 141 115 130 90 158 404
2320D04j64j57o2O9rM3O0n1l3J12m6j3rq9J47m8q2k9R4RP0J39k63Q4q9R7o7q8J54L2j57J65
$$ 404 240 83 21 90 81 124 184 133 100 212 166 153 144 55 202 154 72 43 137 146 216 355 92 176 87 184 117 29 183 215 58 223
1945B23J21q8j60o3O8Q8r4J2J64j94n9J31N1n8p2R1Ko9L3K3p4J7J52n6q5N6N6l6o5Nj02O4
$$ 223 344 256 96 33 101 189 95 107 271 77 18 149 200 142 70 161 163 94 127 150 76 93 245 189 104 160 216 180 115 120 18 82
1569H2m8P0M9l4N5n2J67k18J11%l9p3j0L2l4J52n2j23kR8M9Q1j31o7LQK8Q8n6j8N7L8p2k6
$$ 82 34 104 153 119 174 122 289 71 182 182 143 70 60 92 58 210 158 35 33 131 180 261 130 63 66 74 102 190 134 116 173 211 139 113
1170A13j6L0j6K9M0N1n8n6M4p2j3j1j1J24J53j40r3R7m8j19P8J21k2k6oj04lM0J0J21j42O9
$$ 113 97 127 111 140 180 231 173 117 161 89 76 65 54 178 331 191 98 195 147 28 106 227 205 179 173 69 66 106 116 237 95 164
794A64m5rlP5L9r5L1n3P7n8k5k2J7J57k2j92JK8J0J10N1rn8q1k3k6K25Q0j38J5j16O5j14K1
$$ 164 119 110 107 182 221 126 157 104 181 123 98 76 93 250 228 36 37 65 75 185 236 227 169 88 65 39 264 344 206 221 105 170 56 77
395G7j4J19l8l5R1J9j36J03j24Q8j30J7P5J26L5q6m4J7q2J17k0l9K0k1k6J1r3J47r5M3l9Q
$$ 77 63 182 144 109 200 219 83 186 62 150 20 37 112 238 273 187 143 160 78 195 175 136 156 135 109 120 27 174 79 122 83 91
20I1J63j45K2J04j07N8O0j98J56r3k5M1OO0j37M2k9P2
$$ 91 254 109 131 235 128 186 246 48 204 111 86 127 133 193 56 98 69 141
-192A41
##PAGE=	F1=-12057.1
##FIRST=	25164.767445380970457,	5806.2096540000038658,	0
##DATA TABLE=	(F2++(Y..Y)), PROFILE
5806A02q7N7Q3Q1N4j95K05q9%n2p1n9J22J41p3j22QR7o0j12R3l0J4p2P0mk5NR3klQ9o4o4q4
$$ 102 15 72 155 236 290 95 300 211 211 159 88 29 151 292 219 97 105 202 142 30 123 93 107 35 105 101 76 81 174 172 169 258 194 130 46
5395D6J05N0M7j02p1jO7O1j44L6l1j3j0R0LK4j1%J31j94J84L7j13o0N8jj05l3Q9o7M1k5J47
$$ 46 151 201 248 146 75 74 141 202 58 94 63 50 40 130 133 157 146 146 277 83 267 304 191 131 189 188 83 50 139 72 113 88 235
5008B35r6q5J74Rq6L6p6l6J54%n2o1l2R5on0R0j11j3K8J61n8o3J17k66J00%R2Pj41J29K4P
$$ 235 139 54 228 237 151 187 111 75 229 229 177 116 84 179 173 123 213 102 89 117 278 220 157 274 8 108 108 200 207 66 195 219 226
4621B26r7J00r9N8o4jJ00M1j21r0R5J8Mj0j04M5O5m7o1M4J8jK3r3M7K7J4J27J4r1j21K4j4
$$ 226 129 229 130 188 124 123 223 264 143 53 148 166 170 160 56 101 166 119 58 102 120 119 142 49 96 123 137 264 278 187 66 90 76
4233G6k9mM7k6L1L2P8p5k8L7j12J53j07R4p0L9M3M8q0l3R1q5n5L2J04o4q4J0J73j9j03j05
$$ 76 47 43 90 64 95 127 205 130 102 139 27 180 73 167 97 136 179 227 147 114 205 120 65 97 201 137 53 63 236 217 114 9
3858IQ4J75j28%n1J10m3j12LJ06J9k3Jj24J64R8p8j98L2K17P0j64n6J5J20n9j5J80q5M7j57
$$ 9 93 268 140 140 89 199 156 44 47 153 172 149 150 26 190 288 210 12 44 261 331 167 111 126 246 187 172 352 267 314 157
3494A57l2r9J18o0Lm1L3k9K8K0p4P4M7l2K13j44j26rQ1N7L2j25J3J50N8k77J37j10L6po8j2
$$ 157 125 26 144 84 87 46 79 50 78 98 24 98 145 113 326 182 56 47 128 185 217 92 105 255 313 36 173 63 99 92 24 12
3118A2Q1N7R7j22k0m0Q2j12OJ16J5L5m0k3L2j33Q4ll9N5N4m1Q2Oj90N7M3K1j01n2J31N5J6
$$ 12 93 150 247 125 105 65 147 35 41 157 172 207 167 144 176 43 127 124 85 140 194 153 235 241 51 108 151 172 71 19 150 205 221
2731B21%n8q2O9j09J21j03M8N3j06J03M6r9O4r2k5O4L1q4R7n3oj0J68l2j75JN0J0N5n5J8J8
$$ 221 221 163 81 150 41 162 59 107 160 54 157 203 104 168 76 51 115 146 62 159 106 100 90 258 226 51 52 102 112 167 112 130 148
2344A48j2L02j83j67o4M1L2PR0r1kJ02k1k2qr1J57m4r6%QJ8Q1K06k64L9q5J29r2q0J56M5k08
$$ 148 136 438 255 88 24 65 97 104 194 103 101 203 182 160 152 61 218 174 78 78 86 104 185 391 127 166 81 210 118 38 194 239 31
1956C1J92Q9m8k27OO9R5j36L0J62j86p0J28N3l9m1Q8l5q8O7O6j06LJ73j23k7N4Q2r5r1J0j6
$$ 31 223 312 264 37 43 112 207 71 101 263 77 7 135 188 149 108 196 161 73 140 206 100 103 276 153 126 180 262 167 76 86 70
1581G0L1n3R4N5q1M2l7J64k24Q9K5j5j07N7j8o8K35q7j17k5P9O5P6j48k0mK8KN6r2k3O5J4
$$ 70 101 48 142 197 116 158 121 285 61 150 175 160 53 110 92 24 259 172 55 30 109 174 250 102 82 78 106 108 164 72 49 114 128
1193A28m4O4j1o2j4N0L7P2m7o2M5m9l2jM3P2J21n7j34J31q9j49N3J02L4Oj5j49k8R7J0P9j49
$$ 128 84 148 137 75 61 111 148 220 173 111 156 107 75 74 117 189 310 253 119 250 161 12 65 167 201 207 192 43 15 112 122 201 52
806E2P4J4J2p4L9N5m3K0r0Q4Jm2pk3J89n3j82L7K5k0J21k7L3M8j84N0l3J46R7j18kq8N8j02
$$ 52 126 140 152 78 117 172 129 149 59 143 144 102 95 72 261 208 26 63 88 68 189 162 195 243 59 109 76 222 319 201 199 111 169 67
407F7L0m4J60o8k6L4M7j62J76j73R4j09k0J01J52ln8o3N2j34J41n8j4M0l7l7k3k6J58j04J2
$$ 67 97 53 213 145 119 153 200 38 214 41 135 26 6 107 259 256 198 135 187 53 194 136 122 162 125 88 65 39 197 93 105
43A05lJ6J32j19kJ34j46N3R8k15J18n2qP4p7J1k5j6j4P5
$$ 105 102 118 250 131 129 263 117 170 268 53 171 119 111 185 108 119 94 78 64 139
-192A39
##PAGE=	F1=-12159.3
##FIRST=	25164.767445380970457,	5806.2096540000038658,	0
##DATA TABLE=	(F2++(Y..Y)), PROFILE
5806A09r6P0Q0P4O8k27K10o5m0n2n7j1P5O8n5n0J0J27q1j31J09rk0k5l0N4n8rJ19PK1R9o3
$$ 109 13 83 163 237 305 78 288 223 183 131 74 63 138 206 151 101 111 238 157 26 135 126 106 81 51 105 47 38 157 164 185 284 221
5419B21r6o9J08pL2o3o1M8L3N6j41J9k4jn1J22nK4l7N4N2q9J76J4j48o3J9M1r7l4P9o0Q0o
$$ 221 125 56 164 157 189 126 65 113 146 202 61 80 56 55 4 126 121 145 108 162 214 125 301 315 167 104 123 164 67 33 112 52 132 126
5020A26J26r9r9K36n4q5j7n6jJ46j8l9l1q8J16m5KR8r8nK9J59p7q8R1j77N5NJ44K1j97J34
$$ 126 252 153 54 290 236 151 134 78 77 223 205 166 135 47 163 118 120 218 120 115 144 303 226 138 229 52 107 112 256 277 80 214
4644B14l9L4o1O8o7Ql4J7R8K0j12p1Q3J6k6qj15J01M7l6j17Q9J1JM7j34P1M1j6J56K9j38j27
$$ 214 175 209 148 216 149 157 123 140 238 258 146 75 158 174 148 140 25 126 173 137 20 109 120 121 168 34 105 146 130 286 315 177 50
4257E0M6Jl9MN1j5K6NL2l4J2L0j15J41j36Q5m8k4J30L3j05l3R9q1p3O1J16p4j19P4J87m3j14
$$ 50 96 97 58 62 113 98 124 129 161 127 139 169 54 195 59 144 96 72 202 235 130 97 196 115 42 103 219 145 26 100 287 244 130
3870A30r9P5K12j37o2QO0p4p7JJ20K0%l4j01J56J56q7k49j3K69O0j32j09K3P3l3N4J49j43
$$ 130 31 106 318 181 119 127 187 113 36 37 157 177 177 143 42 198 354 267 18 5 274 334 202 93 116 189 156 210 359 216
3517B16K9j38L4j14R8l4K6m3pJQpj9R2kj9K11j48j20k9O3R8P5j47m3K06J9k45J50j60P6qp4
$$ 216 245 107 141 27 125 91 117 74 67 68 76 69 50 142 140 121 332 184 64 35 98 196 271 124 81 287 306 61 211 51 127 119 45
3130D5k5R6k4J38r0j8n9J47k09P7N9M8L0n1k8J3j25J30j3n7M3N2j3M6Jj72J28m2L3o5n1J06
$$ 45 20 116 92 230 140 122 63 210 1 78 137 185 215 164 136 149 24 154 141 84 127 179 166 212 213 41 169 127 160 95 44 150
2754A50N1K8rr1p7J07j02J07r6M3Q3j16Q6O1j47M1j15K3R9j5o1J24p3j3j5J88l7j56ML6J2
$$ 150 201 229 220 129 52 159 57 164 68 111 194 78 164 225 78 119 4 27 126 111 50 174 101 88 73 261 224 68 72 108 120
2391A20M7p3J8P3o5L22j74j72o4j2P4QR3j22RJ04Kl8Kq5J46k6q3K4j00N0O2K43k54L1q1J25
$$ 120 167 94 112 185 120 442 268 96 32 20 94 102 195 73 82 186 188 150 152 67 213 187 104 128 28 78 140 383 129 160 79 204
2015B04j09l2J38M6k40K25L5j8j98lP2R7j75N1J54j62p0R7O7m0qQ4o4q8P8J10r8n0J81j73
$$ 204 95 63 201 247 7 232 267 249 51 48 120 217 42 93 247 85 15 112 179 139 131 215 151 63 141 251 153 103 284 111
1663A11N3M4Q6j59n3m4P4Mo6J07Q3j22J0j7J56k17P9L8Nj33J31p7l0K22r5r4j9QP3N4j46L7
$$ 111 164 208 294 135 82 38 112 116 50 157 240 118 128 111 267 50 129 167 172 39 170 93 63 285 190 96 77 85 158 212 66 103
1287A03k6N6k4K8j22K8K6k2j7J54kj43LL2L4J03m1m1pJ3n2JJ00J4N5K7j56J52j05j56N1M3
$$ 103 77 133 109 137 15 43 69 47 30 184 182 39 42 74 108 211 170 129 122 135 83 84 184 198 253 280 124 276 171 15 66 109
912A09Q2L1l1j56L0N5J6L2j48P7O7K6j45K3O3jL0r6L7M3l9nm7J94o8j22L8J8n3J20j31K01
$$ 109 191 222 191 35 65 120 136 168 20 97 164 190 45 68 131 130 160 64 101 144 105 100 53 247 179 57 95 113 60 180 49 250
536B50Q8l03J10l5O2R7r2j9o1N2p2K5n3J68r2k2L2P4j37J67k12Q7q5mP7J41l6j0p0P5j81J44
$$ 250 338 35 145 110 172 269 177 158 97 149 77 102 49 217 125 103 135 209 72 239 27 114 29 25 102 243 207 197 127 202 21 165
160A65r0L4N2n6l5n3O3J26j16oL7lJ01q2j1J43j75L9J26j90N6JPJ02j32m9Q5o1j7Q4
$$ 165 75 109 161 105 70 17 80 206 90 84 121 118 219 137 126 269 94 133 259 69 125 126 133 235 103 54 139 78 61 145
-192A45
##PAGE=	F1=-12261.6
##FIRST=	25164.767445380970457,	5806.2096540000038658,	0
##DATA TABLE=	(F2++(Y..Y)), PROFILE
5806A13r7P3P9N2O9k26J96m2o3m9l9K8K4j6m1M1JJ34r9j11J46j3n6Pj08Q8o2L5J14k8L1J20
$$ 113 16 89 168 220 289 63 259 217 154 105 66 94 118 102 61 102 103 237 138 27 173 160 104 111 3 91 29 64 178 150 181 301
5431C01n7j45k7J07o7Oj9m0Q3J1L6q8l7J5nm1P2pJ5l3R8m2K8J62l0j61l7l5P3r6k9O3j6Q7
$$ 301 244 99 72 179 112 118 99 59 142 153 189 101 64 79 74 33 105 98 113 80 178 136 164 326 296 135 98 63 136 40 11 74 58 145
5032A45j4J15q6o5K19j07p3o5j7J8J32l5l6J0j35J16q2P7J06r2qN2J31r4r3P0r8K0LJ75L8
$$ 145 131 246 160 95 314 207 134 69 52 70 202 167 131 141 6 122 40 117 223 131 123 175 306 212 119 189 91 111 114 289 327
4668C27k29J25j01P7l1J0k4k5j4K4J07mr8m6N8K1p8J9j07J26L3l5j16Q7J4rQ2j53P6M3l1J80
$$ 327 98 223 122 199 168 178 154 129 115 139 246 242 144 98 156 177 99 118 11 137 170 135 19 106 120 111 193 40 116 159 128 308
4292C08L4j58j32N3Nl0l7P5jJ4k6J1J3L1K8q5R3j31N6l7o6J97Nj15l3J03o5n5N8J11n7j19
$$ 308 342 184 52 105 110 80 43 118 117 131 105 116 129 160 188 103 196 65 121 84 18 215 220 105 72 175 110 55 113 224 167 48
3916D8O6J96n4j17p3L2K51j15j40O6pq2m9K5J39k0K1m9n9J11K05p3k75oK24M3r4j53P8k2j1
$$ 48 114 310 256 139 66 98 349 234 94 160 153 71 22 47 186 166 187 138 79 190 395 322 47 41 265 308 214 61 139 117 106
3553A06J24J01j82K6j26J05j12M2RN3j0q2K4Jl5O5P9p0MJ94j39p7jm3J34J22j20p6J67j9j79
$$ 106 230 331 149 175 49 154 42 84 93 146 136 54 78 79 44 109 188 118 122 316 177 100 99 56 190 312 192 116 283 264 85
3189H5J45j74P1Jn8l6Q9q4J72o7k6m5J70k20Q2J1Q0J3o9j2lj15J51k5n0J8K6L5K7Qj09J34
$$ 85 230 56 127 128 70 34 123 39 211 144 118 73 243 23 105 116 196 209 140 128 125 10 161 136 86 104 130 165 192 200 91 225
2813B25j22M6m5j9N4P2L3l9j11l0O5l8O2q6O5R1j18O3O4j72J7Jp3J22k8k7R4r3Pk7J88k1j40
$$ 225 103 149 104 85 139 211 244 205 94 64 129 91 153 67 132 223 105 168 232 60 77 78 5 127 99 72 166 73 80 53 241 220 80
2426H0K7oOL7q7K5J19r5L05j36j70p0NL3M4P0j26j8J13L0o4J0n5J19j0o2M7j46N5J6K39k25
$$ 80 107 101 107 144 57 82 201 106 411 275 105 35 40 73 117 187 61 43 156 186 122 132 77 196 186 124 171 25 80 96 335 110
2050A10M5r6J18j00kJ16M2j99K12k8pj34l3Q6P8j46L0J38j27p9P5P9p0J6P9o9o7O4J47p2j14
$$ 110 155 59 177 77 75 191 233 34 246 218 211 77 44 130 208 62 92 230 103 24 99 178 108 124 203 134 67 131 278 206 92
1686I2J72j79J04M9O3j94K7j02J09k4q3J19J13j52k2OJ46k09Q1M3J1j04J70j30NJ71p9o1k5
$$ 92 264 85 189 238 301 107 134 32 141 117 34 153 266 114 92 98 244 35 116 159 170 66 236 106 111 282 203 142 117
1346A17n6P6J9j24Q9n1P7m4J2q4L2Rkn4J91Pj74J4j6L4J36n1Qr6P3n5jJ42j5m0R4j53J56j04
$$ 117 61 137 156 32 121 70 147 103 115 31 63 72 70 16 207 214 40 54 38 72 208 157 165 69 142 87 86 228 213 173 267 114 270 166
947A66j54O9j8J12M9m4j12O7j7K6Kj25N8J05L2k07O5L2K8M8q3l5N9j3j6o1J74n6n4J9Ro9J03
$$ 166 12 81 63 175 224 180 68 135 118 144 146 21 79 184 216 9 74 106 134 182 99 64 123 110 94 33 207 151 97 116 125 56 159
560A59j04K14Q1l32J41k8RO4o1l2m4M3j9kk3J31j06j9R4O6j07J19k24P0o7L0L9J11o1L8o1
$$ 159 55 269 350 18 159 131 140 204 143 111 67 110 91 89 66 197 91 72 166 232 125 244 20 90 23 53 92 203 142 180 119
196A19Q5j84R7q9P4N3p4k1m0R6Q3j22j3P7m9P7l7j7J40j93K2J40j47jM7J5J26j56l1J09j05
$$ 119 204 20 117 28 102 155 81 60 20 116 199 77 64 141 92 169 132 115 255 62 84 224 77 76 123 138 264 108 77 186 81
-168H1k6J06
$$ 81 55 161
-192A61
##PAGE=	F1=-12363.9
##FIRST=	25164.767445380970457,	5806.2096540000038658,	0
##DATA TABLE=	(F2++(Y..Y)), PROFILE
5806A18r5O9Q2J6N9j99J69k7o5m2oM3k7m4qN6j3J11j09o0J95o0n7J9q9M0l0P0R6q8L7J42n0
$$ 118 23 92 174 190 249 50 219 192 127 85 79 122 95 51 43 99 86 197 88 28 223 163 106 125 36 76 46 116 212 124 161 303 253
5419B53j99L6J04j13k8J6JR6j1J0j9r7O0k0k4QJmK1R9j23J24J39p9j30j2n2N4j02K6NK5Q9
$$ 253 54 90 194 81 53 69 70 166 155 165 146 49 109 89 65 73 74 70 91 190 67 191 330 251 121 109 57 111 9 35 40 65 154
5032A54n2J18o4pJ54j44n5m0j3MJ09l9m1N1r0K1j9P6J11r9k2Q9Q2j01p6O1n2Nj5J88N9k41
$$ 154 102 220 156 149 303 159 104 64 51 55 164 125 84 135 45 66 47 123 234 135 113 202 284 183 107 168 116 121 106 294 353 112
4656A12J07j46J31j5o8J9l5rK8J24k3q7l7K7M1j30N6o9J11K9n5o8M8K9k2J12j40M9M2l2J91
$$ 112 219 73 204 189 121 140 105 96 124 248 225 138 101 128 169 39 95 26 137 166 111 43 91 120 98 210 70 119 161 129 320
4292C20K3j56j13L1Pmp9P4J2mm6M2K6K5L2m1L2q2Km1LJ55l2j08l2R9n4k4M7J04qj01rK00m3
$$ 320 343 187 74 105 112 108 29 103 115 111 65 107 133 158 190 149 181 99 101 60 63 218 186 78 46 145 91 67 114 218 210 109 100 300 257
3881B57j15m1k8K88o7k05Q7p4l2l9L9J60q0K9l8k8N4K32l9k88pJ72K2o1j72J46j30J3J81M2
$$ 257 142 101 73 361 294 89 176 102 70 31 70 230 150 179 141 113 167 399 360 72 65 237 259 198 26 172 42 55 236 278
3529B78k02M4r0J32r8k2N0Q3J1j42L4Lm3J30N2j34L0J67j26k9J3j30J62J61q0q6P2m3j01J35
$$ 278 76 120 30 162 64 42 92 175 186 44 78 81 38 168 220 86 116 283 157 128 141 11 173 334 254 168 240 197 96 231
3177B31j49J8J1j5m8O9j13J92n7m8rJ60k11R3k6J17k0r4K0op8J15m0j7pl3R3L1K4n4J19j78
$$ 231 82 100 111 96 48 117 4 196 139 91 82 242 31 124 98 215 195 101 121 115 37 152 112 95 88 55 148 179 203 149 268 90
2801I0N1l6NkJ17L4q2j13J9pN6%p8J05Q4j22M5N8j73lQ6j13R5J4k7K8r1M2k8J53J7j36N4m5
$$ 90 141 105 110 108 225 259 177 64 83 76 132 132 54 159 243 121 166 224 51 48 134 21 116 130 103 131 40 82 54 207 224 88 142 97
2402I7j0K9q2L5J33j03K50p8j59q2P3m0P6L0r5o4J09O5q8qMQ0%l7O6j35K2j9J93j57M3j22
$$ 97 87 116 34 69 202 99 349 271 112 30 103 63 139 169 74 10 119 184 96 88 92 172 172 135 201 66 88 69 262 105 148 26
2027B6J23m6k0P4L9j39J99q4j1p9m7J17J7o2pJ15q4p3P1O1j29J9P6m5l2L1J72m1j66J42j25
$$ 26 149 103 83 157 196 57 256 172 161 82 35 152 169 107 100 215 131 58 129 190 61 80 156 111 79 110 282 241 75 217 92
1663I2J01P1J1j56M9q4P3n2p9J18J27j72m1K4J37j93P3M8Jm2J90j62J2J09n2k7l6r8P0j5q5
$$ 92 193 264 275 119 168 84 157 105 26 144 271 99 58 82 219 26 99 147 148 106 296 134 146 255 203 176 140 42 112 97 12
1299A2J24p0Q3o2J7m4%L5L8q0J57K0j69%m4M7J42q0O4j77J12m4qJ64lj37J25j33J51r6j40
$$ 12 136 66 149 87 104 60 60 95 133 53 210 230 61 61 17 64 206 126 190 13 125 81 73 237 234 97 222 89 240 144 4
935DQ0m3J11O3m8o4Q8r3M6j2j00M1J18L2j93P9pM5N4o5r5M4L5k9p0J21mj2jon6O1m6M2R2j75
$$ 4 84 41 152 215 167 103 191 98 144 132 32 73 191 223 30 109 102 147 201 136 41 85 120 91 21 142 138 126 125 119 63 124 78 120 212 37
513C7J08j3K7rl5m4k8J6M9m1K4P0p9k2J63L0q9N6j95L2m1O2oQ7p1N9l8Q7j42PJ4L3M5r2kk0
$$ 37 145 132 159 150 115 71 43 59 108 67 91 161 82 60 223 253 164 220 25 57 16 78 72 159 88 147 109 196 54 61 75 108 153 61 59 39
90C9J00M0j09j6J07j14O9Mk2J24j90J7J24q7m3O4J7J36j47K0R8j65k5J41
$$ 39 139 179 70 54 161 47 116 120 98 222 32 49 173 86 43 107 124 260 113 133 231 66 41 182
-192A82
##PAGE=	F1=-12466.1
##FIRST=	25164.767445380970457,	5806.2096540000038658,	0
##DATA TABLE=	(F2++(Y..Y)), PROFILE
5806A22q3N4Q5k1L8j52J30k0n2k5K7M6n2M2qm0k0O1j00MK39j40k9J6n8L2j4O9P8j42M5J54
$$ 122 39 93 178 157 195 43 173 153 101 76 103 149 97 139 131 91 71 132 32 36 275 135 106 122 64 96 82 151 229 87 132 286
5431B86m6k26R4R4j20l3%M9Q8l6rM2j49R0l3mn1L2m1J03O2j40J46J15j17n0k2k7Oo0K1Pj9
$$ 286 240 14 108 202 82 49 49 98 186 150 141 183 34 124 91 87 36 68 27 130 192 52 198 313 196 146 124 97 103 43 64 71 52
5043E2J15j20J36m3O2P1j70k6M8o5k2P6k4k6N6n0n9J06K1J09j17m2J22K9r7l5O3l4Jm7J83
$$ 52 167 47 183 140 202 273 103 77 125 60 38 114 90 64 120 70 11 117 138 247 130 88 210 239 142 107 170 136 137 90 273
4679B73Q6k37Q1j44J62j5j39M7k7j7L9J34l1q6l9j0P4q7Nk8R2L1q2k5PN1j8J17j14J8L2k0
$$ 273 359 122 203 59 221 206 67 114 87 70 109 243 212 126 87 77 151 64 69 41 133 164 82 57 64 115 97 214 100 118 150 130
4304A30J79Jj36p0MMK2l4k5K5l0jP6pkL7J1l6j1n3m3P5R1o7q1k3P3m7%M6R8N2q8r8J93j2j09
$$ 130 309 310 174 104 108 112 134 100 75 100 70 69 145 138 136 173 184 148 137 84 41 116 207 140 59 36 109 62 62 108 206 258 170 72 265 253 144
3870A44j7q7L15mk29M6j15O5n9L4J79j29J0kqnK24J0k86rJ20Km1j11J45j55L8J54j6k01Q1
$$ 144 127 40 355 351 122 168 53 118 59 93 272 143 153 151 143 138 362 372 86 77 197 199 158 47 192 37 75 229 213 12 93
3506I3k9J00p6l2L1J16Qj67K7Ol4J75J6j76N1J37j22J6K2j02R2J81m4q2l7m6l5J27r4m7lM5
$$ 93 64 164 88 56 87 203 211 44 71 77 43 218 234 58 109 246 124 140 162 60 152 333 289 207 170 124 89 216 122 75 72 117
3130A17l9K9j01J78n7q5N1J21j86J14n7J57o3j26N8J0o5Q4o1L0j3n0Q0M7M2j7R4k00M2k8Q
$$ 117 78 107 6 184 127 42 93 214 28 142 85 242 179 53 111 121 56 140 79 109 96 46 126 173 215 198 292 92 134 106 114
2766A14n7J75K9j17j07M0m5J36o4p1J50O6j26L2M9j60oJ26j29N7P6m5n0pL0j3Q7N8j36O7m7
$$ 114 57 232 261 144 37 77 32 168 104 33 183 249 123 155 204 44 38 164 35 92 168 123 73 66 96 83 170 228 92 159 112
2402A12k1K7m5L1Q9q4J56j2j38r5J36n5O5k3m6k7K0R4p6p6P7L8%lP7j31mk1J20m3j0r2J04
$$ 112 91 118 73 104 193 109 265 253 115 20 156 101 166 143 97 70 90 184 108 32 109 147 147 144 221 90 86 65 185 142 132 40 144
2015A44Pm7kL5o7J81j16j5m3n1J63q4L7k7R1m2n4P8J6j80K1N3j1J2j5J80j5j92R3l0N7J01
$$ 144 151 104 102 137 70 251 135 120 77 26 189 105 142 115 206 164 110 188 204 24 45 98 87 99 84 264 249 57 150 120 177 278
1639B78o1n1ol3L7p7k9Q8J13j85m1K5J33j37J4O0k5L0K07j69qN1k6Jm7j11N1k7m3J35q1P5
$$ 278 217 166 160 127 164 87 58 146 259 74 33 58 191 54 68 128 103 133 340 171 163 214 188 189 142 31 82 55 12 147 66 141
1264A41q1M2l3l3O9P2r0J01M4j36l4l1O0J04j22J09j43N3k6k3J69L9j77R2j12J46r1p2L3k9
$$ 141 60 102 69 36 105 177 87 188 232 96 62 31 91 195 73 182 39 92 66 43 212 251 74 166 54 200 109 37 70 41
912D1Q4P0l6l3R8j63Q8k8p0L0R8L0j40O8k0N4L6l5j35MR7k9o2J5R0j5pl7j0qM1R2j32L4jJ0
$$ 41 125 195 159 126 224 61 149 121 51 81 179 209 69 137 117 171 207 172 37 41 138 109 47 62 152 137 130 93 83 75 116 208 76 110 109 119
489A19R3o8l4n1km6J12o5N0K1j9k7J90j2q0j0j24pj2P2n4Q3n0K2mQ8j03p3J16LL5j11J7k4
$$ 119 212 144 110 59 57 11 123 58 108 129 110 83 273 261 181 171 47 40 28 100 46 129 79 101 97 185 82 9 125 128 163 52 69 45
90D5J07lp4j0J19j73P0K5j5Q1j38L9M8j7m9K8J9J21j15N9R6k32JJ68
$$ 45 152 149 75 65 184 11 81 106 91 172 34 73 121 104 55 83 102 223 108 167 263 31 32 200
-192B00
##PAGE=	F1=-12568.4
##FIRST=	25164.767445380970457,	5806.2096540000038658,	0
##DATA TABLE=	(F2++(Y..Y)), PROFILE
5806A24o6L7Q4n1J3r3Q0j8l1ML6N0l6Q4k0j21knNj6K64k21lPk2O5k7L5O3j72O3J41n0j28N4
$$ 124 58 95 179 128 141 48 128 110 79 83 119 169 133 217 197 76 74 69 74 58 322 101 98 105 83 148 121 156 219 47 110 251 201 73 127
5395A27P1r4j4l4P4P2o0j7P8j82R6l5J5q5P5n0J31Rr8J04R8j32M1n8Nj5k9j2M9j14J70j70
$$ 127 198 104 90 56 130 202 142 125 203 21 117 82 97 12 87 37 168 177 79 183 281 149 190 132 137 122 93 81 130 16 186 16
5020A6J31l1J26Lj94J8J03j11l1L7J0K4%k7m2J25mR7j37o3J40j0q3J9P3k9np6J54J19k17M0
$$ 16 147 116 242 245 51 69 172 61 30 67 77 101 101 74 32 157 153 250 113 50 190 180 97 116 189 160 155 79 233 352 135 175
4644A75q6J52k5j44J9pl0N8J18k5r5m2n0J14kq9J7O6L3p5k0l3P4KJ01r3KJ4KJ43l0j04j1J
$$ 175 89 241 216 72 91 84 54 112 230 205 110 68 18 132 130 41 58 124 157 82 62 29 103 105 206 113 115 129 131 274 244 140 129 130
4245A30qK8K7j06J2m2Q9O5n2m2L5O7j03O4r5oR5K5q8l1pJ3k6mO4R1R8p8j54J53L1r9pj08L01
$$ 130 122 150 177 71 83 41 130 195 143 101 136 203 100 164 69 63 158 183 95 64 57 70 44 40 104 195 293 215 61 214 245 146 139 31 332
3834C32O1k23l2p6J11q7J7J97j48l8M8Nl6J58O2k64lP4j6m1kR5j01M9P2o8j00M5j0P5m6j2
$$ 332 393 170 138 62 173 86 103 300 152 114 162 167 131 289 351 87 84 158 142 101 99 194 93 142 214 146 46 91 81 156 110 98
3459I8j6J44k2j40nNk5K13k1j83N7J11j28M9L5m2PJ73k0o4j25k2j4J27k7n8q8J08noj02J59
$$ 98 82 226 204 64 59 64 39 252 231 48 105 216 88 137 172 130 137 310 290 226 101 79 65 192 165 107 19 127 122 116 14 173
3083A73o6p6P7O5j32J23r2J96j06j35O7M2p3P7q4O1pK6rM3N4RO2j98K9j8qq8K07K5j18r2J2
$$ 173 107 31 108 173 41 164 72 268 162 27 94 136 63 140 56 117 110 136 127 170 224 233 295 97 126 108 100 12 219 244 126 34 46
2696D6J2J31j18n7J85M2j27K0M2j43QJ24j22J8J24n7j22J10jOJ8P7j24N9j6j5L8m7M3K1m1
$$ 46 58 189 71 14 199 241 114 134 176 33 41 165 43 61 185 128 6 116 115 121 139 216 92 151 135 120 158 111 154 175 134
2332A34L6M8j04q7J60l1M1q8J6Ml4R0l6p3N2olL8Q0j35k4QL9O9q6l2Q6K8n4r4K1J5J49j21
$$ 134 170 218 114 27 187 156 197 109 125 129 95 185 149 76 128 122 119 157 237 102 78 86 125 194 108 76 162 190 136 42 63 78 227 106
1933A06Jk9m9K01j72R7k6P5j0k6P3l7j41N3j3l1N7o4J68mj82L0P4KJ25j32O7j01M0J5r6K5
$$ 106 107 78 29 230 58 155 129 204 194 168 241 204 63 116 103 72 129 65 233 229 47 77 151 153 278 146 213 112 152 167 71 96
1557I6O7P3j88k6LJ33n1q0P3n6R4K18j48m5Qj3J9n5j03K5Mj4J18r3P1r9Q1m8m2P7J04q2K2
$$ 96 163 236 48 22 25 158 107 27 100 44 138 356 208 163 171 158 177 122 19 44 48 34 152 59 130 31 112 64 22 99 203 121 143
1170A43Q6q6p1k2P3M3j49J24o8rj3m7J66Q3j56L8j07J32q9J6m1mN4O7ok0R3k07J45n4l0J5
$$ 143 229 143 72 50 123 166 17 141 73 64 51 4 170 253 97 135 28 160 71 87 46 42 96 163 157 137 230 23 168 114 84 99
794I9M8K9p3M6kN0mJ1j65l2J51j7n1o0J50m9J0q4N2p7K26L34k07j87j30M5J47q4n2n1J0m5
$$ 99 147 176 103 149 147 197 193 204 39 7 158 141 90 30 180 131 141 57 109 32 258 592 385 198 68 113 260 176 124 73 83 38
419C8Q9m3K3MK1l8J98m2p8n9k8K1n9P2p6O4j8m0L4R4p1n3J07%K2j31L2m1J17m4l7K0J09j55
$$ 38 127 84 107 111 132 94 292 250 172 113 85 106 47 119 43 107 89 49 83 177 106 53 160 160 182 51 83 42 159 115 78 98 207 52
20E2K3K0J1Pn6N2k4M0l9k3K4P8p1P4J08k48L6J42
$$ 52 75 95 106 113 57 109 85 125 86 63 87 165 94 168 276 28 64 206
-192B06
##PAGE=	F1=-12670.6
##FIRST=	25164.767445380970457,	5806.2096540000038658,	0
##DATA TABLE=	(F2++(Y..Y)), PROFILE
5806A20m8K2P8o3j0l7K6j3j2L8K0N3mR2l0j79M0m5Q5m1K66k50l1lK4J04m9k5N6j67Q9R8o2
$$ 120 72 94 172 109 99 62 88 75 63 101 121 174 170 262 232 53 93 48 133 92 358 108 77 74 98 202 153 128 184 17 106 204 142
5419A42j0J4L4n3j1m1Q4N2p3j3P5j71O8j3J5n8P4m0J17m9m6N4R2j16J07j04M1ok3n9J00j41
$$ 142 132 146 180 127 116 75 159 211 138 125 200 29 97 84 99 41 115 75 192 143 97 151 243 127 234 130 171 165 142 83 183 42
5043D2J64j35N1k3J62k9k08N4J11j40j7J3L8O3o5j7mJ02nP7j54p2J35j9o9P6P9l0j6p2R2J56
$$ 42 206 71 122 99 261 232 24 78 189 49 32 45 83 146 81 64 60 162 157 234 80 8 143 124 55 131 210 180 164 92 184 340
4668C40j77j6k2J26l7r5m0K4k3N5P3qr6m1j5P5N6j60N5L7K7k8m4l7O0J7Q3r0QlK8Q7n9p1N6
$$ 340 163 147 125 251 214 119 79 103 80 135 208 200 104 63 48 123 179 19 74 111 138 110 66 29 89 106 189 99 107 104 132 219 160 89 145
4257A45J9k7J4Q1j25k4jJ05M8q5q2J5J20j44J15j08M0Q4l8q2J7Kn6K9n4R4Q7J13o7j53P7P4
$$ 145 164 137 151 232 107 83 82 187 235 150 68 83 203 59 174 66 106 190 152 70 87 89 33 62 8 102 189 302 235 82 159 233
3881B33q6j5o7K26J21j98j22J6J06j05j3K12j41q9R5Rk1L6J05k28J6M1l3n6J09L1m9P2j2j08
$$ 233 147 132 65 291 412 214 92 108 214 109 96 308 167 78 173 182 161 197 302 74 90 131 98 42 151 182 133 205 193 85
3529H5qK6k8O2nOn2J50o5o3o0nj1K38n7j57N4Q8j24N6N3J9o6J33j2l1j27jo7J29L5k8j24P6
$$ 85 77 103 75 137 132 138 86 236 171 108 48 43 32 270 213 56 110 198 74 130 183 202 136 269 257 226 99 98 31 160 195 167 43 119
3130A19N0j2j10J13p9L1K0Jn9J14j33K23j39o7mQ3q7R6j03N7pJ11n7NN4L1K9j86K2j1k7oJ13
$$ 119 169 157 47 160 81 112 132 133 74 188 55 278 139 72 68 151 64 160 57 114 107 218 161 166 220 251 280 94 116 105 78 72 185
2743A85K4p9n7j8L6R8j57j4J86K0j24QM0j29K7R6q7kJ22n6o3R1j4K3m4O6r2L9K3rO5q0P1m9
$$ 185 209 130 73 55 91 189 32 18 204 224 100 108 148 19 46 142 55 53 175 119 56 147 133 156 112 178 86 125 148 139 204 124 195 146
2344A46J5q3R2o1n2J35J1K5j58Q4K4n4N3Mk7pn1oQ5P7j43l6N3l1J36j44OQ6L1m4j24oN4J03
$$ 146 161 78 170 109 57 192 203 228 70 154 178 124 177 181 154 147 96 90 175 252 109 73 126 95 231 87 93 179 210 166 42 36 90 193
1945A93j09K8k4m1K13j50L6j5P9JRM5q4q8Q7l7n8Q2j01J25%j41K0J10n3J36j78J44j85J15
$$ 193 84 112 88 47 260 110 146 131 210 211 220 265 181 93 180 143 85 167 66 191 191 50 70 180 127 263 85 229 44 159
1592A59Pj03O3N6K6j75nj1J03N1j34K5l6R2K21r9r0k0pK1n1q1KM1J5P9j13Q2o5Q1q2kK9J47
$$ 159 166 63 126 182 208 33 28 17 120 171 37 62 26 118 339 240 150 130 123 144 93 12 14 55 70 149 36 118 53 134 52 50 79 226
1193B26p1p3J54m3r5l6Q4k8m3K8j5k8pkR8Q9j28M4r7O3p2J01j03j3M4M1M1k3P4j59J42p6P
$$ 226 155 82 236 193 98 62 146 118 75 103 88 60 53 51 149 238 110 154 57 120 48 149 46 33 77 118 159 136 210 51 193 117 124
806A24j1qK5%J3M2K9m7N9j81j4J38Jl1l7R2p8L8j25J02r3L14M44k48k94k05P8J50p5o5l7o
$$ 124 113 105 130 130 143 185 214 167 226 45 31 169 170 139 102 194 116 154 29 131 38 352 796 548 254 49 127 277 202 137 100 94
430I4l5N6J1l7J0L0o3J98m5q1p3O7O2j36P5n9Q%m3K9J09l6l5P7J5kj45L8n6J27p2k6Q4Q4j51
$$ 94 59 115 126 89 99 129 66 264 219 138 65 132 194 58 133 74 82 82 39 68 177 141 106 183 198 196 51 89 33 160 88 62 146 230 79
20G9lJ2M1p4K0N4m6N3j9o0K5K1k7N9J31j83L3Q3
$$ 79 76 88 129 55 75 129 83 136 117 57 82 103 76 135 266 83 116 199
-192A99
##PAGE=	F1=-12772.9
##FIRST=	25164.767445380970457,	5806.2096540000038658,	0
##DATA TABLE=	(F2++(Y..Y)), PROFILE
5806A06l1J6O3n7k2Kk1%JO4j5N3K8Q6l4k15R3o2J16m1K48k21j14qP5J30o7j01O5j14Q9M3p0
$$ 106 75 91 154 97 75 77 56 56 57 121 106 159 187 273 239 24 117 55 171 130 378 157 43 35 110 240 173 72 137 23 112 155 85
5419H5R3j7j5lk3l1Q6L5p0lL3j13L3J8j1k6O6l2R1j03J1J0R2p8J37j47Q5J4l6j09J47j15J13
$$ 85 178 161 146 143 120 89 175 210 140 137 170 57 90 108 97 71 137 105 196 93 104 114 206 128 265 118 203 217 181 72 219 104 217
5032B17j13RpJ52l6j93N4R2j34L%M8Q1j08rK0O2QM7j61L1J5J6o4J14P0l4k7l8K0J92j19p3
$$ 217 104 113 106 258 222 29 83 175 41 44 44 92 173 65 56 76 138 146 193 32 63 78 94 30 144 214 180 153 115 135 327 208 135
4644A35J6R1m6l8q7P2j1L2J8J2p7m9K3L1Q1j85O5QJ4L0o1rJ9PP6j03K7j0N4K2o7m7J10L3m6
$$ 135 151 242 196 158 71 143 132 164 182 194 117 68 91 122 203 18 83 91 105 135 74 65 84 91 167 64 91 81 135 157 90 43 153 186 140
4233A40lJ17j10n1M1Q5M1j07r9l0J61j04Q5p8N3P0r1m5L7Pj01P3o2O3R7R6n4j27PJ01o5l6
$$ 140 137 254 144 93 134 219 260 153 54 24 185 81 166 88 141 211 120 75 112 119 18 91 29 92 189 285 231 104 111 212 147 111
3858A11j1J36J66j59j94R6Q6j01n5K22j22j01J09JJ8r3J26j84M2K8n1l8J62k0j9R6q2j29M6
$$ 111 100 236 402 243 49 145 231 130 75 297 175 74 183 184 202 109 235 51 93 121 70 32 194 174 155 251 169 40 86
3517H6L4n8N0L9K8p2J22r7L6j29j9K6K31q9j18O0O5j00L6O4P2j16O7j7J3o5j3j21J06P8J1
$$ 86 120 62 112 151 179 107 229 132 168 39 20 46 277 188 70 130 195 95 131 195 267 151 218 201 214 149 136 15 121 199 210
3154B10j14jJ17Jj22N8r9J48l6n3jJ00j76K29j53Rp7J11p6J20j28L6k3K03q2m4M7N2qj69K8
$$ 210 96 95 212 213 91 149 50 198 162 109 108 208 32 261 108 117 40 151 75 195 67 103 80 283 201 157 204 256 248 79 107
2790A07j2l4N9J3K8j9k2Mj7O4j53J9J59Oj14JL7r0J2O2l2K1M7m6%M6LL6r4K6m8L4L6j0J05
$$ 107 95 61 120 133 161 142 120 124 107 171 18 37 196 202 88 89 126 36 48 110 78 99 146 100 100 146 149 185 91 117 69 103 139 129 234
2379B34j24J10j08P0j54Q7j2rQ5N1K1k15J42L6o0LL1K9m9j01JJ31O1j44m9J05q6J54j44j5
$$ 234 110 220 112 182 28 115 103 94 179 230 251 36 178 214 154 157 188 217 168 67 68 199 260 116 67 172 86 240 96 81
2027H1R7L0k5r9K9jN1r7M2j3k1J88q8n2nJ02oM2lj17m7R0m7JP2j22O2Rr6Q1O7j09J42j73J21
$$ 81 178 208 183 84 113 112 163 66 108 95 74 262 174 122 117 219 213 255 252 135 88 178 131 132 204 82 144 153 57 138 205 96 238 65 186
1616A86j47J11J0r1P7M6j6j43J2J5K6J47j44p1O7pK12l2j22m6J0Jk4l6J4%N4K9j17Q4LO1j20
$$ 186 39 150 160 69 146 192 176 33 45 60 86 233 89 18 85 78 290 258 136 90 100 101 77 41 55 55 109 138 21 105 108 169 49
1229D9K3k0K02p1j57K30k1j08o4Q9r0P0jm0k7KK8P8M3j03P8r1k4j9J58j32o6O3rR3l7M2p4
$$ 49 72 52 254 183 26 256 235 127 63 152 62 132 131 91 64 66 94 172 215 112 190 99 75 56 214 82 16 79 70 163 126 168 94
841I4J11p4K7m2j7j5O1k6J06j1n2O6j56k9J16K0Pl0J7o6M4j27J18o8J53L21j94j39j27M6J10
$$ 94 205 131 158 116 99 84 145 119 225 214 162 228 72 43 159 179 186 156 173 107 151 24 142 74 227 548 354 215 88 134 244
477B44m1o8Jn4k7L4P7r6QL3r5J74j6p5m8J29R1k15Q7l9l7lK4l3J26K0m5M3L8m2j44K9o2J37
$$ 244 203 135 136 82 55 89 166 70 78 111 16 190 174 99 51 180 271 56 143 104 67 64 88 55 181 201 156 199 237 195 51 80 18 155
78A55p7m3J63N2j68j3K1O0j36P0M4k1K2J4q3J7j2MJ3J59j12L9J2
$$ 155 78 35 198 250 82 69 90 150 14 84 128 107 129 143 60 77 65 69 82 241 129 168 180
-192A80
##PAGE=	F1=-12875.2
##FIRST=	25164.767445380970457,	5806.2096540000038658,	0
##DATA TABLE=	(F2++(Y..Y)), PROFILE
5806G9j6K4L8m1j1J4n1OJ3Q1n8M5N3Q6l3k20J33p8J24k8K21j74k04NJ10J37p7j74J07p4P8
$$ 79 63 87 125 84 73 87 36 42 55 136 78 123 176 262 229 9 142 64 188 160 381 207 3 8 118 255 178 4 111 37 115
5442A15ol3J28l6o6M9m4j6Q3K1n2J1l9k4J3L1l5lM9k6O1j44P1k0Q5l6J42j83J36L8p0j43J79
$$ 115 109 76 204 168 102 151 107 91 174 195 143 154 115 91 104 135 100 97 146 120 181 37 108 88 173 137 279 96 232 270 200 57 236
5055B36p8N5j00QJ4J02m2j66M6O2o7Ml9N7Q4j21LL5K0OJ7j11J00j10Q8o7J07M8l8l8J2l4K19
$$ 236 158 213 113 121 135 237 195 29 75 137 70 74 35 92 176 55 58 93 113 119 136 25 125 15 103 36 143 191 153 115 127 93 312
4668C12n2j08J4M1m6J8j24J36pOl4K3m6o4M2PQ2j75N4j4J0P0n9NJ1m3Q7q4J3j0P6k7qm2R1
$$ 312 260 152 166 207 161 179 55 191 184 190 156 179 133 69 111 118 200 25 79 65 75 145 86 91 102 59 146 62 75 65 141 114 106 64 155
4257A55K7o3j0J32p8o4P5M3N3j25q4j7J10j7J1k5L3O6j19j1M0Qj03Q0n3mJ34N2l4r2m2J02
$$ 155 182 119 109 241 163 99 174 217 270 145 61 44 154 137 148 123 156 222 103 92 132 140 37 117 64 60 194 246 212 120 78 180
3881A80l7o3M5M8J90j08j89R7N9o9r8K15j01o1Q1j9N6j63J05j38O1L7p2PJ61m7j7J13j31q7
$$ 180 143 80 125 173 363 255 66 163 222 153 55 270 169 108 189 170 226 63 168 30 91 128 56 63 224 177 160 273 142 55
3529E5K1N8n6RP3O1q2O9r1J15k00j4N7K02j16p5P3M2p6K2N1J17j40ql2N9mk6j15K5R3N3q2
$$ 55 76 134 78 87 160 221 139 208 117 232 32 18 75 277 161 86 159 201 125 147 198 315 175 167 135 194 190 164 49 74 167 220 138
3142A38q0J83K1j30J1j10K42q0q6K1Q6j97J96j51Q0j01Q7l4J34j61L2o4K88j02q0L5P8m4j56
$$ 138 58 241 262 132 143 33 275 195 109 130 216 19 215 64 144 43 130 96 230 69 101 37 325 223 143 178 256 212 56
2801E6M5k1k5Q4o4L2L4J7L7q6L3q1lJ20Rj06J6J6l7k6L7K1N4m9l2L6mN5M1j23j3l5O7Jj0J47
$$ 56 101 80 55 139 75 107 141 158 195 109 142 61 58 178 187 81 97 113 76 50 87 108 162 113 81 117 113 168 209 86 73 38 105 106 96 243
2379B43j54J38j35J03j16j8L4L7L4P2K5k19J46M8o7m3M2Q2o0j51J7J62L3j30p2J56j22J33
$$ 243 89 227 92 195 79 61 95 132 166 238 263 44 190 238 171 128 170 252 192 41 58 220 253 123 51 207 85 218
2050B18r0q4J08L6pp4P6l8Jr1L6OQJ24k5j08j0J42j8N8o2j30l1L5k5J50K5j32KM4q5J43K3
$$ 218 128 44 152 188 181 107 183 145 146 55 91 97 105 229 204 96 86 228 210 268 206 76 45 80 55 205 230 98 100 144 59 202 225
1663B25j70J60r8n6J6N5J4n8O8L3m5j07L1L0l5K17j37j06Q9r1J84M0j27q1N0l7K9j6K1m7Q6
$$ 225 55 215 117 61 77 132 146 88 156 189 144 37 68 98 63 280 143 37 126 35 219 259 132 51 101 64 93 77 98 51 137
1299A37j7o0K8P5M6j48J0m4K55q4j33K20k7j10r6R0j06J20L7j05l4J8N0R0j1o8Q1q0j08N3
$$ 137 120 60 88 163 209 61 71 27 282 198 65 285 258 148 52 142 36 156 193 88 54 72 122 212 201 133 214 134 26 79
947G9J93j51r4P7l8J08o2mJ6O9m6L3p0N0j03R0o3J78o5J1oq2p7P6M4O4m6p6J3Jr5J51K3N5
$$ 79 272 121 27 104 66 174 112 108 124 193 147 180 110 160 57 147 84 262 197 208 202 120 43 119 163 227 181 105 118 119 24 175 198 253
548B53K11n6l79J72j00N4K2n7O6j42%K2J33j14l5O3pj8L8k4l6J52R7k71J03k7k3j9N9r6J42
$$ 253 464 408 29 201 101 155 177 120 186 44 44 66 199 85 50 113 106 88 126 102 66 218 315 44 147 120 97 78 137 41 183
184A83R3q2K2N9r7j17rm9J45o2j7J74K3k05QL7N9j24N1J6L1l4N6j02K3rRj2J44o1N3m7
$$ 183 276 194 216 275 178 61 52 3 148 86 69 243 266 61 69 106 165 41 92 108 139 105 161 59 82 73 82 70 214 153 206 159
-192A59
##PAGE=	F1=-12977.4
##FIRST=	25164.767445380970457,	5806.2096540000038658,	0
##DATA TABLE=	(F2++(Y..Y)), PROFILE
5806E0j0M3Pk5K5Lo2oK1R8r7K7O6J06k6j75J25o0R1k7J89j24k00NP4J28p9r2M9p9O3l8L8R9
$$ 50 40 83 90 65 90 93 31 25 46 144 47 74 140 246 220 45 170 110 201 174 363 239 39 44 118 246 167 75 124 45 108 70 108 207
5407B07m7r0Q5p0lP3Rk2L3j31Q5j3K8k9%K3j8L0j34R6k9N8JJ29k04J86O1j15j48J84m5Jq9
$$ 207 160 70 155 85 82 155 164 142 175 44 129 116 144 115 115 138 120 150 16 112 83 141 142 271 67 253 314 199 51 235 190 191 102
5020A02M3K3M0o4j12K3L5K4Kq7N4P1j01MN8Kl5k%R9j39Q9p1O0K3k8o1O4n2K30J1j16j5k5l7
$$ 102 145 168 208 144 32 55 90 114 116 29 83 154 53 57 115 117 82 80 80 179 40 129 58 118 141 113 52 116 64 294 305 189 174 149 112
4609A12O9j44K01j1k0p0J5k2p0M7mP3j52M0k4L8O6m7kM2j07J01pn5rQ8l3M9n0M0mo7rJ27m5
$$ 112 181 37 238 227 207 137 152 130 60 107 103 176 24 64 40 78 144 97 95 137 30 131 124 69 60 148 115 164 114 154 150 83 74 201 156
4198A56o2J03rP5j47l4J2K3P4o0K7j5P5j05kL5Jr0Q2m5q8J89jkm7p7O9nq3Q5k0J88n1j34M5
$$ 156 94 197 188 263 116 82 94 117 191 131 158 143 218 113 111 146 147 57 139 94 6 195 194 192 145 68 137 132 49 134 114 302 251 117 162
3787A62L0j8j17J73q5%M6m6P6j56N8q5M5O4r0J6J61m8l1J17j53j9m0P6j7m9Q2J01q4J0m4J55
$$ 162 192 174 57 230 145 145 191 145 221 65 123 38 83 147 57 73 234 186 155 272 119 100 60 136 119 70 152 253 169 179 135 290
3412B90k54jO4J78j40l4Q6K0o6K4J2J59j40p5n1R9L4k8r9n7Q5Q8k2j52K30L8j25j2j02K81
$$ 290 36 35 99 277 137 103 189 209 143 167 179 338 198 123 72 171 205 177 78 21 106 194 172 20 250 288 163 151 49 330
3060C30j09r1QO9j59J00j27J24o2NK8J37j92N9o9K90j27q7K6J01o3j52N7k3k7Q0r8K2O9N7
$$ 330 221 130 138 207 48 148 21 145 83 88 116 253 61 120 51 341 214 127 153 254 191 39 96 73 46 126 28 50 119 176
2708A76O9j41Pj0k2Q2L2j14M7k0J1o2L1M9Q4j20k8L4l5J29L3j25jj04J15o4K5J53j32J21j13
$$ 176 245 104 111 101 79 161 193 79 126 106 117 55 86 135 219 99 71 105 70 199 232 107 106 2 117 53 78 231 99 220 107
2344A07R5p9r6O1P4MO8K9j89J12O2p7p4M4J16m2j74K0J67kr8j04J95j27Q0j6j42R5N0Ln6J28
$$ 107 202 123 27 88 162 166 234 263 74 186 248 171 97 141 257 215 41 61 228 226 128 24 219 92 172 156 14 109 159 162 106 234
1968B34n2m2r1K3K2M0K9K8j07m0J90j9M2j15j13L6O4P5Q7n3j26j2O7j03J78Jk10J71M0r8m3
$$ 234 182 140 49 72 94 134 163 191 84 44 234 215 257 142 29 65 129 204 291 238 112 100 167 64 242 243 33 204 244 146 103
1604A03J1OpM8J1n6p8N3L6q0K56j12j02N3r1J04Q8j05j19R6o7P5j7K5q4R7m8Rl6J39L5j59
$$ 103 114 120 113 161 172 116 38 91 127 47 303 191 89 142 51 155 243 138 19 115 48 123 106 131 47 144 96 105 69 208 243 84
1229H4l2j9K67j03p4J87n3j04j10P5n1P1R7j48o1L8O9J11m0k3M0o6j37Q4K12j66q0P1j6P4
$$ 84 52 33 300 197 123 310 257 153 43 118 67 138 235 87 26 64 133 244 204 181 221 155 18 102 314 148 68 139 123 197
876A97r8o0R9K0MK9p7J27j79P7q9K41j20J11j32K5j22nP7J38r0j24J07q9J1K10J37P14R74
$$ 197 99 39 138 158 162 191 114 241 62 139 50 291 171 282 150 175 53 48 125 263 173 49 156 67 78 288 425 1139 2113
536B113m32j353N6l29l5J19j9J29k27P0j3J42q9r9J18N7j27LO2n1J42P8k60R4l2K9j7M5j50
$$ 2113 1681 328 384 55 20 139 120 249 22 92 79 221 132 33 151 208 81 84 146 95 237 315 55 149 117 146 129 174 24
196B4J53J68j33K7O8j53o5q0K2J25n8M3J32Nk55P5L3M8j00L5l9R4r6R4j16P5k8LL0O9m9P1
$$ 24 177 345 212 239 307 154 89 9 31 156 98 141 273 278 23 98 131 179 79 114 75 169 73 167 51 126 98 101 131 200 151 222
-180B22q2
$$ 222 140
-192A40
##PAGE=	F1=-13079.7
##FIRST=	25164.767445380970457,	5806.2096540000038658,	0
##DATA TABLE=	(F2++(Y..Y)), PROFILE
5806E3k6N1k2j5P7j4o3Rk6J24j04k4O9J51j7j42J17j5L6n5J61p6j76nM2J15p7j3J3r5M6o3
$$ 53 27 78 56 41 118 104 41 50 24 148 44 20 89 240 223 81 198 183 219 164 325 249 73 68 110 225 148 135 148 53 99 36
5431C6R5O0n6m1O7r1lN6pJ9O6j28R7o4K0J3j4pj0Jn4N8k2J7K8J03k02K20Q4j49j31J61l1l9
$$ 36 131 191 135 94 161 70 67 123 116 135 201 73 170 106 126 139 125 118 108 109 55 113 91 108 136 239 37 257 341 192 61 222 191 152
5032A52o2Q7J7j1j10ml9K3R6Rr2OM0n4j6R1jr0K8N5R2j48Q3n8k4J4L3p6M1l2K24O0j07m6j04
$$ 152 90 177 194 183 73 69 30 53 149 158 66 72 112 58 42 133 132 42 70 125 217 69 152 94 70 84 117 41 82 50 274 334 227 181 77
4621G7k5J17j23K29k4l9q7j3j5m6L2qO4j18M1l1P3L5l9k8J00j12N6P2j19kQ8j2O3n4Jn0k5
$$ 77 52 169 46 275 251 212 125 112 97 51 83 75 139 21 62 31 104 139 100 72 172 60 116 188 69 67 155 143 206 152 153 103 78
4233G8m1J14k4m9J28o2R4j69N4J0n1J51j09N9p8R3n8pJ8j3o3Q0l7n5J21m5M2Nj04J2J8p9R3
$$ 78 37 151 127 78 206 144 238 69 123 133 82 233 124 183 105 198 140 133 151 138 75 155 118 63 184 139 181 186 82 94 112 33 126
3846A26n0J49J1p8j0LL4j13J08p5O6J3p1P5j30N4n2J4R1r8rJ66l5m4J04j40L6q9O8L5r5O6
$$ 126 76 225 236 158 148 151 185 72 180 105 171 184 113 188 58 112 60 74 165 67 58 224 189 145 249 109 145 56 124 159 64 130
3470A30J33p9l0lJ81k72j0O0J69j59jQ8Op0L5m3J97j21j23o5J21N2j8q1m6J3Q3N5j73K08M3
$$ 130 263 184 154 151 332 60 50 110 279 120 119 207 213 143 178 135 332 211 88 23 144 196 178 97 51 64 147 202 29 237 280
3107B80r8oj11K87j17p2l1M6r7%k0N7Rp0P3J26k05R6l9K21j55o3K8J13o1j56N6j1n7O6n6R
$$ 280 182 176 65 352 235 163 132 178 81 81 61 118 127 57 130 256 51 147 108 329 174 111 139 252 191 35 91 80 23 89 33 42
2731D2L6R2R4j68j0L8k7O3O4j41P1n6N2q6L1N9J02j53k5qJ0J56K0j19J8j09P5r5Q8R3p2O9
$$ 42 78 170 264 96 86 124 97 160 224 83 154 98 150 64 95 154 256 103 78 70 80 236 256 137 155 46 121 26 114 207 135 204
2355B04o9P0n4j15M6R7rO1K2j53O2Q2r3p6M7J17pj69MJ46l5m7q7J59r9RN4j00KO0Pm1J64m5
$$ 204 135 205 151 36 82 179 170 231 253 100 162 244 151 75 122 239 232 63 67 213 178 131 44 203 104 113 167 67 69 129 136 95 259 214
1956B14q0r6L3J4P0p1N6m8o2K10roj34m2J25K37O5r5j53r9L0L6j09J68Kj66J26K08j1k46n3
$$ 214 134 38 71 85 155 84 140 92 30 240 231 225 91 49 174 411 476 381 228 129 159 195 86 254 256 90 216 424 413 167 114
1592A14k9M7L2j8n5n3P0L5j14K66o3r3rk6M1P0o9j28J03o1R3l2L0j05Q2o0O7p6J79K5j49p4
$$ 114 85 132 164 146 91 38 108 143 29 295 232 139 130 104 145 215 146 18 121 60 153 121 151 46 128 68 135 59 238 263 114 40
1217D0K1K36j21%J46q8r3q0K7mkJ58j50p2K2R0J33m8K0j7n8j14P8K09j77m0O0J0M5j34n4R5
$$ 40 61 297 176 176 322 234 141 61 88 84 82 240 90 18 40 130 263 215 235 218 160 46 124 333 156 116 176 186 231 97 43 138
841A38k8O5K2n5J67k34N2r4K73j64K07k47J24j42k6M2J95j58L8M6j21P9K94K50J633J991r68
$$ 138 110 175 197 142 309 75 127 33 306 142 349 102 226 84 58 100 295 137 175 221 100 179 473 723 2356 4347 3379
524C379k554k16m35km4M4J48k12O6n3J13n5j42J61Q9j01j31J27n2J03M0j78N4n2Q2%K0j97
$$ 3379 825 609 174 172 128 172 320 108 174 121 234 179 37 198 287 186 55 182 130 233 273 95 149 97 179 179 199 2
196BJ56K31j86O5O3j97pq4J8J26q6J12P0Lk57J14J1M0p3L2j06J41j40J14j18J48p3rQ1Np2
$$ 2 158 389 203 268 331 134 127 43 61 187 101 213 283 286 29 143 154 194 121 153 47 188 48 162 44 192 119 110 191 196 124
-168A24R0r3
$$ 124 214 121
-192A21
##PAGE=	F1=-13181.9
##FIRST=	25164.767445380970457,	5806.2096540000038658,	0
##DATA TABLE=	(F2++(Y..Y)), PROFILE
5806I0l5J9l9oJ22k8o7M2p8J32p3n2K4J90qj17J06K7j3j06J37l0j42k0J9J10p2L6j5q3K8o9
$$ 90 55 74 35 29 151 123 56 98 20 152 79 27 51 241 233 116 222 249 236 130 267 237 95 75 94 204 132 168 153 70 98 29
5431B9J04K8o5N1K6r7k3L6l2P0J01o3M4j37K0P6l9l3jl5J4L4jl5M4P8j46J90J11j45j24J21
$$ 29 133 161 96 147 173 76 53 89 57 127 228 165 209 72 92 168 129 96 95 60 74 108 107 72 116 194 48 238 349 204 80 201
5055B01m4n6j0J15Lm1j38R4j04K7J16K5p3n0qJ3n3J20j2r9P4N6Q0j56Q8k2j35P0R7n5p1nK09
$$ 201 157 101 91 206 209 168 30 124 20 47 163 188 115 65 57 70 17 137 125 26 100 156 236 80 168 146 11 81 178 123 52 47 256
4668B56Q7q7o4j69KJ18p0K22m2m6r1n1k7K0rnN7o8O0m4P0K1n0o5J71r4nJ30j64J5P9QN8n4
$$ 256 343 256 192 23 25 143 73 295 253 207 116 65 38 58 49 44 101 33 93 49 119 140 90 25 196 102 97 227 63 78 157 165 223 169
4269A69j3r1N7q8Q2l2k6J42j01R5j57J44j9j06K06j32O4j36J00J1j0j4l3j7O7k6mK3o5Q9N2
$$ 169 156 65 122 34 116 84 58 200 99 194 37 181 162 56 262 130 194 58 158 169 159 145 112 95 162 136 132 155 90 179 231
3905B31j22l1Rm6O0k5O7P1l3n2j5O8j03M1o5J28j5q1N3j13R4m6j0J04r7l7J57j2m6Q0r5O2
$$ 231 109 78 87 41 101 76 143 214 181 129 114 182 79 120 55 183 168 87 140 27 121 75 65 169 72 35 192 180 134 214 119 181
3529A81j13L6Q3j23M6J34o6l9OK07k57l2M4J78j69J6P5Lq6M8j01K30r3j40m2R0N1Po7NKJJ16
$$ 181 68 104 187 64 110 244 178 139 145 352 95 63 107 285 116 132 207 210 124 172 71 301 208 68 26 116 167 174 107 112 114 115 231
3142B31j70J44L1m4J8j48K75j01l6q2J5l2n0O6m7R7p1M5R4j91J22j1J35j77j5M4J01n0j65
$$ 231 61 205 236 192 210 62 337 236 200 118 133 101 51 117 70 167 96 141 235 44 166 155 290 113 98 142 243 193 28
2801B8N5Mp2M1lN5q1J12J15j67k2N7j3P1Q6j80Q4q5Q3r2K3O1J04j61pp1J14J30J2j24J7r1
$$ 28 83 87 15 56 53 108 27 139 254 87 65 122 109 180 266 86 170 85 168 76 99 160 264 103 96 25 139 269 281 157 174 83
2426H3M0m6Q0K2j5K0l1N1l6j21L2J01j9P5Kj18LR6j09m8O1R1K0j55j0J05n6J9m0O7n1m8R7
$$ 83 123 77 157 179 164 184 153 204 168 47 79 180 161 236 238 120 123 219 110 62 123 214 234 79 69 174 118 137 97 164 113 65 162
2038A62n1l3L0OrJ53k9j02j04N9j3R4q8JL6l2J62Qp0q2k3K14M32M4l09k52m5P4k3q6J17K0
$$ 162 111 78 108 114 105 258 229 127 23 82 69 163 75 76 112 80 242 250 180 98 75 289 721 765 456 204 159 233 210 124 241 261
1663B61j10R1L77P3m15j40r4R6K4m4n6k1P2L0j37K50Kp6q7N8L1jm2j15Q5k1Q7n9M3j08M4o2
$$ 261 151 242 619 692 277 137 43 139 163 119 63 42 114 144 7 257 259 183 96 154 185 184 142 27 112 91 178 119 162 54 98 36
1287C6J08p4J83J3j22p7K1J84j31Q8R2j25q1k1k8J1p1K06j20m0l8J12J53n5M9o1o0j02R3J84
$$ 36 144 70 253 266 144 67 88 272 141 229 321 196 115 94 66 77 6 212 92 52 14 126 279 224 273 212 152 50 143 327
935C27j81J9M3K6L1j57PJ1o0J20K0k5J69k63L5q7K72j91K75k63J37j41M4k8J87k45K38j4j04
$$ 327 146 165 208 234 265 108 115 126 66 186 206 181 350 87 122 35 307 116 391 128 265 124 168 140 327 82 320 306 202
595B02J01L84L46K668L052j562l811n49m77J1j98R5J25j82N1r1P6l0j72J93R2n5k29J44k7
$$ 202 303 687 1033 3701 6753 5191 1380 831 354 365 167 262 387 205 256 165 241 211 39 232 324 269 40 184 157
301A57N5no9J0p2J06K8Kj86J01K67k28J33M2k22M3p2pJ38j30J77NJ3k06J06j8L6m2L6j52J44
$$ 157 212 207 138 148 76 182 210 212 26 127 394 166 299 341 119 162 90 83 221 91 268 273 286 80 186 168 204 162 198 46 190
-63A90j45J07j04K04j20k4J14l4j07J08r3
$$ 190 45 152 48 252 132 108 222 188 81 189 96
-192I6
##PAGE=	F1=-13284.2
##FIRST=	25164.767445380970457,	5806.2096540000038658,	0
##DATA TABLE=	(F2++(Y..Y)), PROFILE
5806A23l0k5k4JJ39l4p7O7q1R7l4n4%J66Jq4Q6M6n3j49J12J6j07l3JJ24p3M7l4l5J3n5O6J
$$ 123 93 68 44 45 184 150 73 140 59 156 122 68 68 234 235 151 237 283 230 81 193 209 102 69 70 194 121 168 134 99 112 57 123 124
5407A24o9J39pq6n3K0o0J17J23%j3k13O2J15o9m4J4q9N8L2L2r6M7P3o3J01J47j00j45P3p2
$$ 124 55 194 187 101 48 68 8 125 248 248 235 22 84 199 130 86 100 11 69 101 133 37 84 157 94 195 342 242 97 170 98
5043I8n4N9J18j2m8p8R5j45L5R1L7l8r2o0Q0p0J06m0l2O7N4O6j48Q1K8j38O4J12m2j08m0J97
$$ 98 44 103 221 209 161 83 178 33 68 159 196 158 66 6 86 16 122 82 50 117 171 237 89 170 198 60 124 236 194 86 46 243
4668B43Q8o2o2j39K5J5j6K03o5l8q5q9L2K9o2MM8rP4o1M3L3p7l3J63o9o5J65j85L8O6K0M4
$$ 243 331 269 207 68 93 108 92 295 230 192 107 18 50 79 17 21 69 60 134 73 116 149 72 39 202 133 68 233 48 86 152 172 216
4280B16n5Jj02J02r2M7p5KJ37j16P3m5J49n4j47K38j40N0j18L3Q7qn7n3M0M7j6M0p8n1J25
$$ 216 161 162 60 162 70 117 42 44 181 65 138 93 242 188 41 279 139 189 71 104 191 183 126 73 113 160 144 184 106 55 180
3916A80Q4j27m1k7j4RK8k4J23qp4j3O9r1j5l1J54l5p3J7m3Q7n5k3R4r1lR2Rl7N5l4O3j26J9
$$ 180 264 137 96 69 55 64 92 68 191 183 109 96 165 74 59 28 182 147 74 91 48 135 80 57 151 60 57 149 158 121 176 142 205 79 98
3506I8R9j38N5Q1m6j5k4K37k13n7K5J97j62JM7K2j12N9j50K45o3j13k1M1L7M4o3N1Rl8J23
$$ 98 197 59 114 195 149 134 110 347 134 77 102 299 137 138 185 207 95 154 4 249 186 73 52 93 130 174 111 162 171 133 256
3142B56j67P3LK7N1k07K52n7Lj29k8K8l7R2j32J68l7qM4j54J29J2M8j70K7O7O4m1j75O8J5
$$ 256 89 162 165 192 243 36 288 231 234 105 77 105 68 160 28 196 159 151 195 41 170 182 230 60 87 154 218 177 2 70 85
2778H5l2J3lJ13j52O7J32j42l7N0K0R6Q6k13Q5j01J04q0LN9Q4j49K7p2J52R1K0j47ln2L8k3
$$ 85 53 66 63 176 24 91 223 81 44 94 114 210 296 83 168 67 171 91 94 153 237 88 115 43 195 286 306 159 156 104 142 119
2402A19N3j6J5oj1M5j8j31K5R1l8J13k3q0o1R4j19LP6O6K3j45j1N5n4Q6nl1lm9Q7j3k2j1Q
$$ 119 172 156 171 165 154 199 181 50 75 166 128 241 218 138 77 171 52 55 131 197 220 75 64 119 65 151 146 115 112 63 150 137 115 104 112
1992A12L6Q8j4r9j01O9m0J02pq1P3lJ01K3j26%m5K94O08J0n00l28K7R9r1m6M9M4o4Q0N15J39
$$ 112 148 236 222 123 22 91 51 153 146 65 138 135 236 259 133 133 88 382 990 1000 500 172 199 298 207 161 210 254 190 270 785 924
1616I24n31k21j56J14K7n7p7K9N4K6j04J76O5m8j69J44L0p3l1r8O7L3P0q9O8j03Mn1J09m0
$$ 924 393 172 16 130 157 100 23 52 106 132 28 204 269 221 52 196 226 153 122 24 91 124 194 105 173 70 74 23 132 92
1264I2J67nq9o7J2J20j29J86K1j52p4M1n6JnJ02p1j9l5Q8J68o5N4p3p9j02J26J39j76Q5K4
$$ 92 259 254 165 98 110 230 101 287 308 156 82 123 67 68 63 165 94 75 40 128 296 231 285 212 133 31 157 296 120 205 229
900B29K8K5j59N5o8n1J33K3lJ42k52L1r9K57k03L14k03Q5j27J13n9J46l04L82m4r7J29M53
$$ 229 257 282 123 178 110 59 192 215 212 354 102 133 34 291 88 402 199 284 157 270 211 357 53 435 391 294 423 876
571H76M11L610L926k092m849q86m70Rl11J28Q6j40J7j15M6k6j77K05O4ok64J05K1J9m1K6l0
$$ 876 1287 4897 8823 6731 1882 996 526 535 224 352 438 298 315 200 246 220 43 248 312 306 42 147 168 187 146 172 142
254A42o2P2O2jj54L5K66k47K05J8k37Q4o2l3J47j64K22m7K9j51R0m5L2j1M2j71J12j10R0r2
$$ 142 80 152 214 213 59 94 360 113 318 336 99 183 121 88 235 71 293 246 275 124 214 169 201 190 232 61 173 63 153 61
-98F1K25j55k1J08n3j30J21r6
$$ 61 286 131 110 218 165 35 156 60
-192F0
##PAGE=	F1=-13386.4
##FIRST=	25164.767445380970457,	5806.2096540000038658,	0
##DATA TABLE=	(F2++(Y..Y)), PROFILE
5806A38j1o7LLJ45l6q9P1o2O3Mn9KJ05J1l6N7L2q6j63Q5O2p4l9k1J49p7K9m5M5Lo1L6l1m1
$$ 138 127 60 63 66 211 175 86 157 95 158 162 103 105 210 221 185 242 274 188 25 110 172 98 59 38 187 110 139 94 139 142 81 117 86 45
5395D5J79k6n9q3J7k0P7J29M6o7k05R2J02r8m0L3p6kN2O6j34J9J06j2oJ94m7j79K2p7j3P9
$$ 45 224 198 139 56 73 53 130 259 305 238 33 125 227 129 89 122 46 44 96 162 28 47 153 141 135 329 282 103 125 48 35 114
5020A14J06k3l4l9R4j71N5N9K0Jj06j4M3p8O2p9N8M0O3N6j16M4Q2j26M4J06k4r6r1J81P3m2
$$ 114 220 197 163 124 218 47 102 161 181 182 76 62 105 27 89 10 68 108 171 227 111 155 237 111 155 261 237 141 50 231 304 262
4644B62m4j10N3q4K2J78q9j9p3o8J03k7p9nK8M4P4p4J0O2j03M3Q3l7j22J76j60L8N3K6L4o5
$$ 262 218 108 161 77 99 277 188 169 96 28 131 104 25 20 48 92 166 92 102 164 61 104 187 150 28 204 44 82 135 161 195 130
4269A30M1j09J11o5L4j10J6J04j06M0P6J30q2j70K41j39L0l9p1J39kj01p1J01K9j4O2j55j
$$ 130 171 62 173 108 142 32 48 152 46 86 162 292 210 40 281 142 172 133 62 201 199 98 27 128 157 143 205 50 49
3928D9J28R7j17l8n0Jl4O6o0J27mp8OM5p8l1L3J11m8m7j9M6M5p2l1P6q2O5J6Mk3M1K3M8j38
$$ 49 177 274 157 119 69 70 36 102 42 169 165 87 93 138 60 29 62 173 125 78 59 105 150 78 47 123 41 106 122 126 103 144 167 215 77
3517G7M1P4j48R4qk8K7p4K66j51p6J3K13j39m2NO9j31N1q0J33m1m8k7J6PR0o9P4Ok7J09j57
$$ 77 118 192 44 138 130 102 129 55 321 170 94 107 320 181 139 144 213 82 133 53 186 145 97 70 86 93 183 114 188 194 167 276 119
3130A19Kl8J01Q5k36J82J3K9j59q1P6j6J07j29J57ln3j2j06J24K3k2r0OQ5J4m0r0MJ5J6Kj2
$$ 119 121 83 184 269 33 215 228 257 98 17 93 77 184 55 212 209 156 144 38 162 185 163 73 79 164 178 138 48 52 67 83 85 73
2743G3J55j66k4J46j05m9L7M7J20O3k28Q2j03J14n6k0N3M3j26P1l7J45M8M4j85k9oO6l0Oq
$$ 73 228 62 38 184 79 30 67 114 234 297 69 151 48 162 106 86 139 182 56 127 90 235 283 327 142 113 107 173 143 149 141
2379A41J6mj0M8Mj44J4P7o5J57m5l5j13N9n9PQ9N7Pj52MJ1mJ15Pj08K6j0N7p%k3J3P0%qo8
$$ 141 157 153 143 191 195 51 65 142 77 234 189 154 41 100 41 48 137 194 201 49 53 64 60 175 182 74 100 90 147 140 140 117 130 200 200 192 124
1945A24p6M4m7Q4P5r4N9J7K7L7j57O4o1L40P18l2o19l62R8J02j53nj1O4m1Q9N96J77n82k76
$$ 124 48 92 45 129 204 110 169 186 213 250 93 157 96 436 1154 1122 503 141 239 341 188 183 172 236 195 284 880 1057 475 199
1592A99j51O2L2m8o8M1K2K4n6J07R6pk35K03K3j23l2o6M1Q2M6j01R3r7mk3N2lJ58l3o6n7J2
$$ 199 48 110 142 94 26 67 89 113 57 164 260 253 18 221 244 121 89 23 64 146 192 91 184 87 83 60 112 109 267 234 168 111 123
1205A23N8j02K64n4j66o3P6n5J7NJ6j9k2oO1J77o8K6n1j09r5J51P9j55J42MK0J6j39R3j22
$$ 123 181 79 343 289 123 60 136 81 98 103 119 100 78 72 133 310 242 268 217 108 13 164 243 88 230 234 254 270 131 224 102
841A02k0J10K4PR9j97L2j36K38j97L21j31L1j11J70p7J11k68L84l6j08J65M82M27M243M409
$$ 102 82 192 216 223 322 125 157 21 259 62 383 252 283 172 342 265 376 108 492 456 348 513 995 1422 5665 10074
536A0074k436n422j156m12Kl76J44M1r1l2j16K6m1j36J79J4L3k39L2Q6ln4P4o0j8j4R0J7j09
$$ 10074 7638 2216 1060 648 650 274 418 459 368 336 220 246 205 69 248 262 295 56 88 174 171 117 191 131 113 99 189 206 97
196I7rK07k17K38jk51J18n3n5J43j60K26p2M2r7O6o4K2J4M8j73P5n3Q3j02K12j73K6M7n4j18
$$ 97 88 295 78 316 315 64 182 129 74 217 57 283 211 253 156 222 158 180 194 242 69 144 91 174 72 284 111 137 184 130 12
-168A2J15j07
$$ 12 127 20
-192B0
##PAGE=	F1=-13488.7
##FIRST=	25164.767445380970457,	5806.2096540000038658,	0
##DATA TABLE=	(F2++(Y..Y)), PROFILE
5806A31J8j00L2LJ40l0j00M8k6L9L9n6nL6K8K1K5j9j13q7LJ11n1l1l5J50q3Jm3J37%r3L4p2
$$ 131 149 49 81 84 224 194 94 142 116 155 194 138 133 169 197 218 243 224 111 24 27 138 87 56 21 171 88 89 46 183 183 90 124 52
5407E2K4J60l0k2j18K9j6N4J24P0j11j43R8P8j26l5N8n8q1Q9R0j28m0J57Jj02K47k5k10k1
$$ 52 76 236 206 184 66 95 79 133 257 327 216 73 171 249 123 88 146 88 7 96 186 58 18 175 176 74 321 296 86 65
5055F5K6jL0Q5k9kl4R4j77R5N5n7L4q9J5J4j09N0J5j1RQ1N6p1k3J27j09J9Q4Lo7j14J52N0
$$ 65 91 90 120 205 176 174 140 234 57 152 207 150 184 95 110 124 15 65 80 69 78 159 215 144 121 248 139 158 242 245 178 64 216 266
4656B66l3j2j00R5j47K9J49j10On4l0J40p5p7k6J7Q9N1p6rQ6j03Q1mMj38J31r1KM8K8L1q4
$$ 266 233 221 121 216 69 98 247 137 143 89 59 199 124 47 21 38 127 178 102 93 179 76 157 153 157 19 150 59 61 109 137 168 84
4269H4R5j33J06j5L3j20J6N3q3L5J47J02r6j74K16j32J4M1j09J16Pj38m7J19K5l0N8j33J7
$$ 84 179 46 152 137 170 50 66 119 36 71 218 320 224 50 266 134 148 189 80 196 203 65 18 137 162 132 190 57 74
3928G4R8Q9r5l9m7Qj7L5j2N4j5p5L3K0o4J6K5O8n5qm4J00J2q6m4Q8n3Q2km9k3N0O3K3j41P9
$$ 74 172 261 166 127 80 88 71 106 94 148 133 58 91 111 47 63 88 156 101 93 49 149 161 75 31 119 66 148 146 97 74 124 187 210 69 148
3506A48L0j59J35p2l3P1j11K71q1q5J2K13j04r4m8J41j22Ml1L6k8K5m0K2l7J36q2O4pPJ06
$$ 148 178 19 154 82 49 120 9 280 199 114 126 339 235 141 93 234 112 116 85 121 93 118 78 100 63 199 117 181 174 181 287
3142B87j33n8l5J07J20j94M1R6L2j64o1L6pJ18r9J30K0q8n5n9J13J8n6Lm0R5l5k7Pq0ON2q
$$ 287 154 96 61 168 288 94 135 231 263 99 38 74 67 185 86 216 236 148 93 34 147 165 109 112 72 167 132 105 112 32 38 90 82
2754H2J0J63j72m6J06n7l3M1J8J33J7k14P8r0J10k8l1M1j8r6J13lJ33OP5k26l4K3R2l7n9L6
$$ 82 92 255 83 37 143 86 53 94 112 245 262 48 126 36 146 118 87 128 110 14 127 124 257 263 338 112 78 101 193 156 97 133
2379A33%J7j9N1K7j49j4O8o1J51n5J3j10j3Q0p5R3N4%j70K0kO0J10pj41K2K8M2k7J8oJ2Q9
$$ 133 133 150 131 182 209 60 46 114 53 204 149 162 52 39 119 44 137 191 191 21 41 39 99 209 202 61 83 111 153 126 144 138 150 239
1980B39q0qk8n1J3l3M5J34r1O3K9o2N1j50Q9n5L37P31p2o39l49J54R1j95J9m2P2m8J12O05
$$ 239 159 151 123 72 85 52 97 231 140 203 232 170 221 71 160 105 442 1173 1101 462 113 267 358 163 182 140 212 164 276 881
1628H81J79n64k90j27QL4k2k0J%K3k3Q3O9M5k54K02Qj44m1q%J07J6p4J06j03J9qLJ0J67o9
$$ 881 1060 496 206 79 87 121 99 79 80 80 103 80 163 232 277 23 225 233 89 48 40 40 147 163 89 195 92 111 103 106 116 283 214
1240B14o3m6K1Rl7K88j14j70l2O0m4N8m5j5L3n2K6M5J77n8k7pj39l2J12J5j20J76j0Kkr4J17
$$ 214 151 105 126 135 98 386 272 102 70 130 86 144 99 84 117 65 91 136 313 255 228 221 82 50 162 177 57 233 223 225 223 129 246
853B46j34mP9J2J2N0j15M0j70J98j66K93p8Jr9K05q7R0k00L09jj30K00M61L90M414M388k517
$$ 246 112 108 187 199 211 261 146 186 16 214 48 341 263 264 165 370 283 373 173 482 481 351 551 1012 1402 5816 10204 7687
524G687n384j303l10%l86J40kl8r4q3J1o6p2J36l9N3j76J3J13l6n3Q9q4L9j13J01M8n5j6R7
$$ 7687 2303 1000 690 690 304 444 442 404 310 227 238 172 100 236 197 250 74 87 200 164 111 200 116 155 42 143 191 136 120 217
172B17j12J80lk58J36m6p0J21r7J72o7M6m7L8o8OJ7N8j52M4J0Q5j29J68j70J10n3m7n9P1p3
$$ 217 105 285 282 24 160 114 44 165 68 240 173 219 172 210 142 148 165 223 71 115 125 210 81 249 79 189 136 89 30 101 28
-192B8
##PAGE=	F1=-13591
##FIRST=	25164.767445380970457,	5806.2096540000038658,	0
##DATA TABLE=	(F2++(Y..Y)), PROFILE
5806A04N4j16N5JJ24k1j08LJ9K9P0m3k1k6M8P8pr8j23L7pO8m3j3jP5q8Kk4J95jj37N6j13P9
$$ 104 158 42 97 98 222 201 93 96 115 144 214 171 150 124 172 250 243 145 22 59 52 120 77 64 63 138 50 52 28 223 222 85 141 28 107
5395A07J27k2J6j56N2l8L7J20O6j34q4J03O8j53m1R0m3p5N3J02j06n7J60lj31K58m5k27k0
$$ 107 234 212 228 72 124 86 123 243 309 175 91 194 262 109 68 158 115 40 93 195 89 32 192 189 58 316 271 44 24
5055B4J25j0j5N8k7L6n3Q2j58J51P4j65M6m7K1kj15P1O7j08J2O7O9k5j03J54q8LM4L1l4j01
$$ 24 149 139 124 182 155 191 138 220 62 213 287 122 168 121 142 140 25 96 163 55 67 134 203 178 75 229 141 144 188 219 185 84
4679H4J11L1m2K6r6J36j70J6J14j19K8l0j3J64j03p8l8J6J22J1p0jQ9q5Q0p7N5r6K3k1m4N4
$$ 84 195 226 184 210 114 250 80 96 210 91 119 89 76 240 137 59 21 37 159 170 100 99 188 103 183 106 161 65 88 67 23 77
4304G7K9L6j03J45j67R6L7L9j27K8Jn5O1J56P2r8j56J61j19J0J01j00N3K0j56J3Q5L8o5L4
$$ 77 106 142 39 184 17 113 150 189 62 90 91 36 97 253 325 227 71 232 113 123 224 124 177 197 41 54 139 177 112 146
3952A46m0MN7O1o5m4l3K5K2j9L6k3l2n3M3Lm7M8ML8o3M0m4J03oq1o6J49m0M5L1q8p6P7Q7p
$$ 146 106 110 167 228 163 119 86 111 133 114 150 127 95 42 85 88 41 89 93 131 68 108 64 167 161 80 14 163 123 168 199 111 35 112 199 192
3529A92j05Q1oj44J29m3o1O3m2J67rq9J5J97o3j26j07K12r7n3j8k3l1Q2m8M6p7J69r1K3j3
$$ 192 87 168 162 18 147 104 43 106 64 231 222 133 148 345 282 156 49 261 164 111 93 70 39 121 73 119 42 211 120 143 130
3165A30L1J31r7j07L3K9J49j40q7J61J5j43k0j9j8J22p5J14K8j11p7j7J00ll6L6o2R6o7L4
$$ 130 161 292 195 88 121 150 299 159 72 233 248 105 85 66 48 170 95 209 237 126 49 32 132 129 93 129 67 163 96 130
2813A30M7j53QL7j3O1J37j66j4L1okN2l8J28m3j64P2o2R0ok4K9p7k2Q4K0J27k8J00k54J1J9
$$ 130 177 24 32 69 56 117 254 88 74 105 99 97 149 111 239 196 32 104 42 132 126 102 131 54 32 116 136 263 235 335 81 92 111
2426A11P4j8j25Q6j5M2l0N2M5j45n8P6LN6n2N4p5K8Q8j59R6M6J7j36k2PJ02J00m1j39JN1M1
$$ 111 185 167 42 128 113 155 125 177 222 77 19 95 98 154 102 156 81 109 197 38 134 180 197 61 39 46 148 248 207 68 69 120 161
2038A61n9K4L5lQ9j24nmk7k5j1J4J62q3R3L6j63O8j10P9l7K92O42j03n54k91J78P6k10J8l4
$$ 161 102 126 161 158 247 123 118 114 87 62 51 65 227 144 237 273 110 178 68 147 110 402 1044 941 387 96 274 350 140 158 124
1675A24O1p9J36N46J47m86k60r2l3L7PJ5m0NK3k0R6JJ03k66J77kj29o1N0l8J02j8mR8j20N5
$$ 124 185 106 242 788 935 449 189 97 64 101 108 123 83 88 111 91 187 188 291 25 202 200 71 10 60 22 124 106 102 200 80 135
1299A35Lj7rJ93j08p6k9K5j6L5K67j45j68RMl2J05j21J4P4q4L5M7J59l4q9M4j62K9O6m8o9
$$ 135 138 121 112 305 197 121 92 117 101 136 403 258 90 99 103 71 176 55 69 143 59 94 141 300 266 177 221 59 88 154 106 37
923C7J77j9j3l3l4J29j12%N1j5J7Kl3N6j75J24j06K29n4Nr8K15r3Q3j22J94M2j46K21L91L08
$$ 37 214 195 182 149 115 244 132 132 183 168 185 187 154 210 35 159 53 282 228 233 135 350 257 340 218 412 454 308 529 920 1228
560A228M080L874k323m738j293j83Ol40J15m1J3j54k4kq9j0R2o6M8j01O9Q9r3n4J04j00R0
$$ 1228 5308 9182 6859 2121 828 645 651 311 426 385 398 244 220 218 129 119 211 145 193 92 161 250 157 103 207 107 197
243A97j59O2O9Lj1j6MQ0J4j84O5m0n1N8NP6l5M2nRn4pj3O9r5K1N1Q8j50R7j24J79j49m0k2
$$ 197 38 100 169 172 161 145 149 229 243 59 124 84 33 91 96 172 137 179 174 183 129 122 109 178 83 104 155 243 93 190 66 245 96 56 34
-168C4M0j3
$$ 34 74 61
-192F1
##PAGE=	F1=-13693.2
##FIRST=	25164.767445380970457,	5806.2096540000038658,	0
##DATA TABLE=	(F2++(Y..Y)), PROFILE
5806F4Q9r9N6kR4pj11l9M6L8Q9k1l9o3O4J20l7j81L9k5L8Mm3NL6k1o2N0k3J91jj77Q4j25R4
$$ 64 153 54 110 108 202 195 84 45 91 129 218 197 158 95 159 279 242 61 100 75 113 117 74 79 115 94 32 82 59 250 249 72 156 31 125
5395A25J02oM0j92R1o0nJ17M6j21n3J05P4j74n9J25l0l9mJ03o8n7J31j8p5K05r4j88O9R3j4
$$ 125 227 221 261 69 160 100 95 212 258 137 84 189 263 89 30 155 125 86 82 185 117 60 191 173 98 303 209 21 90 183 169
5032A69m5L0j1O4p1M3j16K11R4k53K4RQko8O7O8j87Q0j5R3K1j60J31o0RkL6qn1O2J8o7O2q0
$$ 169 124 154 143 207 136 179 63 274 368 115 139 148 156 154 86 153 221 34 114 99 192 213 53 184 124 133 131 167 159 108 170 188 121 183 103
4621A03J55j72J5O9r7K9mj8J71j09p8k2mJ44k9o4K2P9o9N5j21J10o3m9%k1K1K6M5q4J42j50
$$ 103 258 86 101 170 73 102 98 80 251 142 64 42 38 182 153 89 111 190 121 176 55 165 102 53 53 32 53 79 124 40 182 32
4245C2M8O2N2j31N1l7k9P3J45M3r1j18Q3r7J3J38q2pM2j54M2N8N1r7mN0J0J6J9l2m9k4O1O2
$$ 32 80 142 194 63 114 77 48 121 266 309 218 100 183 86 99 237 155 148 190 36 78 136 187 90 86 136 146 162 181 149 100 76 137 199
3846A99o1O1r5m7J6Onl0N1j5J6o5Q2j7O2j1n9p2K04l9k0R1p6j42O6R7k9l1L1j7r5N9L7o3j
$$ 199 138 199 104 57 73 79 74 44 95 80 96 31 113 96 158 147 88 16 220 181 161 252 176 34 100 197 168 137 168 151 56 115 152 89 88
3435H8J6P9N4q8J8J62k0j26j35K36o8r2k9l6k0O5n3Q1r7J76q9l4K7nJ78n0j53Q7l5J61r0j48
$$ 88 104 183 237 149 167 329 309 183 48 284 216 124 95 59 39 104 51 132 35 211 122 88 115 110 288 238 85 172 137 298 208 60
3060F0J66j3r5Nm9m1J12o2J09K2j19p8J6Q6l2K3Ql9P6p1J04L9j92L3m4K4R0R3j49J5k5M1L4
$$ 60 226 213 118 123 74 33 145 83 192 214 95 17 33 119 87 110 118 79 155 84 188 227 35 68 24 48 138 231 82 97 72 113 147
2672A47M3p9J10j04q1O4k9N7kjK4o9nK1K9J33n0J06k51O3K0mL5j16N9qM7k9M7N6j36p9Q1M6
$$ 147 190 111 221 117 36 100 71 128 126 125 149 80 75 96 125 258 208 314 63 126 146 142 177 61 120 112 159 130 177 233 97 18 99 145
2273A45m8l3O6l1R6O3k29R9L2M5r8n2lJ49Q3q1j31mN3L9q3J7Q3k5O5j23J8j5np3J5J2J60p0
$$ 145 97 64 130 99 195 258 29 128 160 205 107 55 52 201 284 203 72 68 121 160 77 94 177 152 217 94 112 97 92 19 34 46 206 136
1874A36J28M4k36N9n5M8k4K31M72j18l87j93J54O5k03nQL2j16J48M41Q5l64j97m9o3M8K9L0
$$ 136 264 308 72 131 76 124 100 331 803 685 298 105 259 324 121 116 124 156 40 188 629 714 350 153 104 41 89 118 148
1534A48p6K9K8m0J15p1J59k65J28Jp2o4N7n9O8n6J02O4j43R5Pj7l5K18j40q9%Pj3Q1K20j39
$$ 148 72 101 129 89 204 133 292 27 155 156 84 20 77 18 86 30 132 196 53 148 155 138 103 321 181 92 92 99 86 167 387 248
1158B48j59L3o0k6J44j25M1P3q7MO9J20qj40Q4j72P8K6j02oJ45k5j9p3L3J28p7OL4m6J7l4
$$ 248 89 122 62 36 180 55 96 169 82 86 155 275 267 127 211 39 117 143 41 35 180 155 136 63 96 224 147 153 187 141 158 124
783A24J9Q3j75M7m6J57n0M1j09J99r6Q6m7P3P1j43K20K87K03L316K997j906l635j134n2K0
$$ 124 143 226 51 98 52 209 159 200 91 290 194 280 233 306 377 234 454 741 944 4260 7257 5351 1716 582 530 550
477E50k51P3p8N8j97M9j5j07L1N8n5L5m6J23P0j53n1J20j07J28j73M8L4N4pr8Q0j3M6r0k8
$$ 550 299 372 294 352 155 204 189 82 113 171 116 151 105 228 298 145 94 214 107 235 62 110 144 198 191 93 173 160 206 116 88
114H8l7J7m1R4k6J1L6K1j3k9Lq1P6rKO1R0j55J9k4J85k10m1nRM1
$$ 88 51 68 27 121 95 106 142 163 150 121 124 43 119 110 112 173 263 108 127 103 288 78 37 32 41 82
-192H2
##PAGE=	F1=-13795.5
##FIRST=	25164.767445380970457,	5806.2096540000038658,	0
##DATA TABLE=	(F2++(Y..Y)), PROFILE
5806B0J17n5L6lN4Rj10K7l5N0R5Nm5p4O6J42o3j93J42j12Q0l4l9J8O2j04K7M5m6J78pj84R4
$$ 20 137 82 118 115 169 178 68 95 60 110 205 210 165 91 157 299 236 43 185 73 153 119 80 98 160 56 83 128 82 260 253 69 163
5419A63j22Q8R2J6L8k19J41n4r2J12K8o2o6J00R2j81k6R1k1Ro1R3j4n6Q2l7J1J26j44m1O7
$$ 163 41 129 221 237 275 56 197 143 51 163 191 129 63 163 255 74 48 139 118 127 66 159 145 89 171 134 145 271 127 86 153
5055A53L2j2o0RK3O6o9j9o4K64J01k95j9N2pRj1N2L8k09J40j12J22O6j67N2k8K9pk6PK7RJ0
$$ 153 185 173 113 122 145 211 142 123 59 323 424 129 110 162 155 164 153 205 243 34 174 62 184 250 83 135 107 136 129 103 110 137 146 156
4656A56r5Q2l6J29j63M2J4m7J1J5l5J61q7q1Rk8J44m9o7M1O8o2J5j13J43m5m6n2O0l1K2M9
$$ 156 61 143 107 236 73 115 129 82 93 108 73 234 147 66 75 47 191 142 75 116 184 122 137 24 167 122 76 24 84 53 75 124
4280A24n9J07j05J3L4P2j28P2n2j9O9J32K1q1o7qo1J6J52o4n2P9j58N1L8N3j05l5R2M0j7k7
$$ 124 65 172 67 80 114 186 58 130 78 59 128 260 281 200 133 125 64 80 232 168 116 195 37 88 126 179 74 39 131 171 154 127
3905A27Jn4k5J12J01q8O9j67n3R6l9j1j6L2j5j7J6L0L3Mql5n3K23m1q9J57l3j71nR9l4M7m3
$$ 127 128 74 49 161 262 174 243 76 23 119 80 69 53 85 70 53 69 99 132 136 128 93 40 263 222 133 290 257 86 81 180 146 193 150
3506A50ln2k9J18n3o2N4K1J02q5K2J06J9r9j42K24l7j00m3l4RKo7J09q3J45o9n2R7j28K32
$$ 150 147 95 66 184 131 69 123 144 246 161 183 289 308 209 67 291 254 154 111 77 86 88 21 130 47 192 123 71 168 40 272
3142B72Nj96J16o9J49m7j53J33m3l1J5o5o5R8o1J05J0r5p2K6P6m1O6m9L7L3p2J52J7k01N4
$$ 272 277 81 197 128 277 230 77 210 167 136 151 86 21 119 58 163 173 78 6 32 108 67 133 84 121 154 82 234 251 50 104
2778A04o1M5O0N0j26L6m5O3P1Nr3R2j18l7P1%K2k3L4K0l6k1m0K2J50o0Q9k07P9M4j20J06p6
$$ 104 43 88 148 198 72 108 63 126 197 202 109 201 83 46 117 117 139 116 150 170 134 113 73 95 245 185 274 67 146 190 70 176 100
2391A00PK8J9j6M3O3j28p3Q0M4j01PJ7J4J48L8k57Q3K2O1o5m9k4J88N4j10j24NM5K9q2j0J25
$$ 100 107 135 154 138 181 244 116 43 123 167 66 73 90 104 252 290 33 116 138 199 134 85 61 249 303 193 69 74 119 148 66 56 181
2003A81l7Np8N7n1J6m7kOJ35m9J41N6k12l3NNk2J73K67j19j77p5Q1O4j84l6O6qr2R2L17Rk30
$$ 181 144 149 71 128 77 93 46 44 50 185 136 277 333 121 88 93 98 76 249 516 397 220 145 226 290 106 70 136 128 36 128 445 454 224
1604B24j10pq9P0L7K5j02N6L6o1J19j21K01k16K8K7kq1N8n1J8RJ08Oj61J29kj0m0K23j58q8
$$ 224 114 107 18 88 125 150 48 104 140 79 198 77 278 62 90 117 115 34 92 41 59 68 176 182 21 150 148 138 98 321 163 75
1229G5K6k8J3R4J58j00j36K4j11J2J30j7J3L1o8m3J05O9Pj64R8j68J14Lj23L7R1l4op3N1J16
$$ 75 101 73 86 180 338 238 102 126 15 27 157 140 153 184 116 73 178 247 254 90 188 20 134 137 14 51 142 108 102 29 80 196
853A96m9K4L4o3ml3J2J11j75j6nR5n1J02j31J57r2R1J3j7O4j10J91J71R9K304J968j374k327
$$ 196 147 171 205 142 138 105 117 228 53 37 32 127 76 178 47 204 112 203 216 199 263 153 344 515 614 2918 4886 3512 1185
513A185q67O4M1j46K1j14R4k07J09k0j20M2L6k4L9k4J53N5j89l3J20j04J55k06J08l8P8%j38
$$ 1185 318 382 423 277 298 184 278 71 180 160 40 82 118 94 133 109 262 317 128 95 215 111 266 60 168 130 208 208 70
172G0R8p5Q1j4r1m3P8l6O7p7J9M0K8k2oK8q8J3P4k3N6Q6j40k7N8J55k30n0J2l5Q1
$$ 70 168 93 174 160 69 26 104 68 135 58 77 117 145 123 117 145 57 70 144 121 177 263 123 96 154 309 79 29 41 6 87
-192H7
##PAGE=	F1=-13897.7
##FIRST=	25164.767445380970457,	5806.2096540000038658,	0
##DATA TABLE=	(F2++(Y..Y)), PROFILE
5806B8R6rKlJ6K3r4J20j03J5Q5K7k7q2O0J50q4j23J38j77J09n0l3L9O7j33Q0J8o5J60j7j52
$$ 28 124 115 117 114 130 153 59 179 76 91 176 203 176 94 154 304 220 97 235 58 167 117 84 123 190 57 137 155 90 250 233 81
5431H1P9j19Q0J00L3Qk28J94k7j92Q9N1Jj07Q5J14j61M3qj6N8r7O5M8n7K6n1R6K4j48P6N6
$$ 81 160 41 121 221 254 262 34 228 201 9 98 149 150 43 128 242 81 124 116 100 158 61 126 174 117 143 92 188 212 64 140 196
5055A96l4j3o3MO9M1n4p0k6K98R3k97n6O7qK1M0K9qj72J64j75J34J01j66N%K3M1j36RJ12l9
$$ 196 162 149 86 90 159 200 146 76 50 348 441 144 88 155 147 168 208 237 229 57 221 46 180 281 115 120 120 143 184 48 57 169 130
4668A30lq6O2K2O2j40Q6m3Qj1K8n5J41l9q8L5m0J13l8q4N1O1o5l3j3R8l7j6n8P8n4K7M4p1
$$ 130 127 41 103 125 187 47 133 90 98 87 115 60 201 162 74 109 69 182 144 60 111 172 107 74 61 159 122 106 48 126 72 99 143 72
4269G2Q6o2Lk5R1j14Q5m8k4N4J21Po7j2r8oKJ51n1p4J21j77N4K1M1p8k0M5Q1l6o5K6n4j9J48
$$ 72 158 96 99 74 165 51 136 88 64 118 239 246 179 167 69 63 65 216 165 91 212 35 89 110 151 73 53 98 179 143 78 104 50 31 179
3858A79J35j04O9k33l5J45o7j9j0J1J4p3J29p7R7l6j0k9j9K14m3j27J99K1j95p8Q8j5J00j08
$$ 179 314 210 279 46 11 156 89 70 60 71 85 12 141 64 161 125 115 86 67 281 238 111 310 331 136 58 146 131 231 123
3506A23K1j7j14J75k9j04O7jJ28p5K6K9N1n7j52K07rp9n3m9M0j2n7N4m3Q7l6nJ21j81J89O0
$$ 123 144 127 13 188 159 55 122 121 249 174 200 229 280 223 71 278 269 190 137 88 128 116 59 113 70 157 121 116 237 56 245 305
3130C05k26J19q6J17qj39J08n9K1K1p6p4P6o2Q4Kl6o5LP4kN8j07J38j8r7J81rj79O6k2K3R
$$ 305 79 198 112 229 221 82 190 131 152 173 97 23 99 37 121 123 87 22 25 99 97 155 48 186 168 71 252 243 64 130 108 131 140
2743A40K9j02N0l9O0J02n3q4Q4n3q5R8K7j8n6P2J1jl7r3J3J61o2N5j33O1Q2k10J33l6k7Q8
$$ 140 169 67 117 78 138 240 187 103 187 134 49 147 174 156 100 172 183 182 145 52 65 226 164 219 86 147 229 19 152 116 89 177
2367A77m4PM6O9j22p7R5J0p3K2o1N1J67J9k25L3K9M8m1nm1J93K0j22j12J6M0Rn3l8J34j5j00
$$ 177 133 140 186 255 133 56 151 161 88 110 49 100 267 286 61 94 123 171 130 125 84 277 297 175 63 79 119 128 75 37 171 156 56
1980E6mR3q5L7K7j9l6J07k2J14P7j52j38O4m4l0J35J07j42M3J1j3O9j58o4J21m8l2KK04o6
$$ 56 52 145 60 97 124 105 69 176 154 268 345 193 55 119 75 45 180 287 145 188 199 186 255 97 33 154 106 74 76 280 214
1616B14j12OQp7N7L0Qj19Q1M4p3J06j15J92j42q7P8M6j08P3l6oP8Q0o4j33J15k7Lj3J93j65
$$ 214 102 108 116 39 96 126 134 15 96 140 67 173 58 250 108 21 99 145 37 110 74 68 146 226 162 29 144 117 120 107 300 135
1240A35p3L9n5M2Q5Q9l6j03j4q1N6L6R8j0k9l6p6J31L1Jj65Q5j32J22jp9J2L8m4K4nqR4m4
$$ 135 62 101 46 88 173 262 226 123 109 28 84 120 218 208 179 143 67 198 229 230 65 150 18 140 139 60 72 110 66 90 85 77 171 127
841A27N7M6o0m5jl4J27j80j7J6J0j3J41j44Q4p6R4M5n3J3n5J39P5J5J261J011q48j088n48
$$ 127 184 230 170 125 124 90 217 37 20 36 46 33 174 30 114 38 132 177 124 137 82 221 296 311 1572 2583 1735 647 99
501I9J41P9o3l7j42J15j50J11j6q6j7L9mN3k4J59L5j82j0J00q8J75k59K00q5N4J6j40O1r2
$$ 99 240 319 256 219 77 192 42 153 137 51 34 73 69 122 98 257 292 110 100 200 112 287 28 228 143 197 213 73 134 42
149D2J06L6j16n3J13j4K0l0n2N1K1j3LM5m4n2J06m6M6Q1j21qP2J13k12m9J7m0N8
$$ 42 148 184 68 15 128 114 134 104 52 103 124 111 114 159 115 63 169 123 169 250 129 121 193 306 94 45 62 22 80
-192H0
##PAGE=	F1=-14000
##FIRST=	25164.767445380970457,	5806.2096540000038658,	0
##DATA TABLE=	(F2++(Y..Y)), PROFILE
5806F6O0J7m0Nj7L4n0J74j16n9O3M0J7j00N2J45j00o2J14k09J22m0l7P2M6j22R5j4p2J40l3
$$ 66 126 143 103 108 91 125 75 249 133 74 137 177 194 94 146 291 191 129 243 34 156 116 79 151 197 75 170 156 84 224 191
5442A91r9N5j23P8J25L7m1k19K40%j88l1J41J1j36O1J25j21R6j03j9R4r0K0R7o2k3k4J32r2
$$ 191 92 147 24 102 227 264 223 4 244 244 56 25 166 177 41 102 227 106 202 99 80 174 84 104 201 139 116 92 224 132
5090A32n3Q4M8p4l5o1M6R1pl5n9l7L04P3k67p3M5K7J4P2Qn3j15J71j81J09J25j74K7J0k4J02
$$ 132 79 163 211 137 102 41 87 178 171 136 77 40 344 417 150 77 122 149 163 235 243 190 75 246 65 174 299 125 152 162 138 240
4715B40k03J3J46o8l5k7K4M8j8p8J10r8N6k9L8p0J17L0j09N1l3M8mj03N2O0o4p3Q5L4l6J8
$$ 240 37 50 196 128 93 66 90 138 120 42 152 54 110 81 119 49 166 196 87 138 105 153 149 46 98 158 94 21 106 140 104 122
4339A22k3N0n1L7L7j13Q8k3pp8R6r7R5l1m1L2J15nm3L6j71M4j4J45m8p7J61j85L9KK0l0pj2
$$ 122 99 149 98 135 172 59 147 124 117 39 135 38 133 102 61 93 208 203 160 196 25 69 55 200 152 75 236 51 90 92 112 82 75 63
3940F3J03l4o7J7k4K5J06J58j15P3k65lJ37p8k3j3LM7q2J76j72J51m2k9m6K9J77m3r4J81O5
$$ 63 166 132 65 82 58 83 189 347 232 305 40 37 174 96 73 60 63 110 28 204 32 183 141 112 66 95 272 229 135 316 381
3576C81k10j23N4K2J18j35L1Qj09J29Nj20N4J7J22m9K3n9P9j7j69J95Rm1o1o6P0K1n5l7LK6
$$ 381 171 48 102 124 242 107 138 146 37 166 171 51 105 122 244 195 218 159 238 221 52 247 256 215 154 88 158 179 124 87 90 116
3200A16mM3J36j57P5J09k34R9j01P2L0j09R4m5L2L4p7o0L8o0L8J2K2o3k4P6M9L3j11J94o2
$$ 116 112 155 291 134 209 318 84 183 82 154 184 75 169 124 156 190 113 53 91 31 69 81 103 40 16 92 141 174 63 257 195
2837A95j45J90l4j28O4J9nm4M0p9O5m7P0J04j05p2Q8J3j43J34N1o4q2R9mM1n2j30L7J30o7
$$ 195 50 240 206 78 142 161 156 112 152 73 138 91 161 265 160 88 176 189 46 180 231 167 85 184 180 221 169 39 76 206 139
2473A39J8m6K6J14j45kJ3n1J59j27K6O8O9j16r3J16l7j7K7r7M9J45Qj51l2N1J4l1P1o3J68
$$ 139 157 111 137 251 106 104 117 66 225 98 124 192 261 145 52 168 131 114 141 44 93 238 246 95 63 114 128 97 168 105 273
2109B73j2j16q4J8L9j3pm1R2M3j38pJ11j08O2Q6k1q5Q1jO3J05r4k01J04q9l5J15J08j77J41
$$ 273 261 145 61 79 118 105 98 57 149 192 54 47 158 50 112 198 177 92 173 172 235 340 246 45 149 60 25 140 248 71 212
1745B12L8r7P3j35p6J58o5k2l9J14j11m6J39qn4K6J3rp8N4M1o6P5m0J16o8r9N6O3j27R3k4
$$ 212 250 153 226 91 15 173 108 86 47 161 50 4 143 135 81 107 120 111 33 87 128 62 137 97 213 145 46 102 165 38 131 107
1369A07k4J15O9j27q9Q0o4L2L0J34j67o0M9n1N0P2J6L9o8o8j9Q1m2J71k3q9Jq4J37J7k5j51
$$ 107 83 198 267 140 51 131 67 99 129 263 96 36 85 34 84 156 172 211 143 75 56 137 95 266 243 154 155 71 208 225 200 49
994D9N5n7R4J2n0j4kl3L5K5k4O1o1J00O4n7q2L3n5R8j84N5L5n7L4J08j35rJ4M3L5k4o1MN9
$$ 49 104 47 141 153 103 89 87 54 89 114 90 151 90 190 254 197 115 148 93 191 7 62 97 40 74 182 47 38 52 95 130 106 45 49 108
583A08N0n8L76K98m29j27j44O3J39k8r5j13P2n4P4j0j6q9Q1l6M1l3J47Pj27lP3n3J83k72K43
$$ 108 158 100 476 774 345 218 74 137 276 248 153 40 112 58 132 122 106 17 98 62 103 70 217 224 97 94 167 114 297 25 268
219B68q8j3M5j27jo6J09N9j18o6J40kj6K9j20N9QJ7nM6lp6J00o5M2Q2j15M0N0P1j58n0Km3
$$ 268 180 167 212 85 84 18 127 186 68 2 142 140 124 153 33 92 100 117 112 158 155 79 179 114 156 238 123 163 213 284 126 76 78 35
-180C5L1
$$ 35 66
-192F6
##PAGE=	F1=-14102.2
##FIRST=	25164.767445380970457,	5806.2096540000038658,	0
##DATA TABLE=	(F2++(Y..Y)), PROFILE
5806I4M5K2q5K5m4M0RJ87r9j18K4L7P3j17M0J24j08j2P4k00J12Pp0J16Jr3R1m0o7J18m9m7
$$ 94 139 161 76 101 57 97 106 293 194 76 100 137 210 93 133 257 149 137 211 11 123 130 60 176 177 84 175 135 68 186 137 90
5431I0L4j15O5J61K4r5j35K09J8j57n7J65pj48M5J16q1J35j58m5J09n0pR8o2n7L6J15k04O9
$$ 90 124 9 74 235 259 164 29 238 256 99 42 207 200 52 97 213 132 267 109 64 173 123 116 214 152 95 131 246 42 111
5078A11L7N2n8q3m0J05O8o4k4lo7K76N2k18p4NR6k2P8lq1o2J67j57O6J37j80Q3J8r7J58k14
$$ 111 148 200 142 59 19 124 192 128 104 101 34 310 362 144 70 75 171 149 227 224 143 81 248 91 157 294 114 197 215 118 276 62
4703F2K3J25p0r2L1L9J7q8K7R6j39Q3l7M5p8J06R4j45N7rl8L4r3L6O4l9k8O3l3l6M8J5J6k7
$$ 62 85 210 140 48 79 118 135 47 74 170 31 114 77 122 44 150 244 99 156 147 109 143 50 86 150 111 83 146 113 77 125 140 156 129
4304A29M3K5j64J17Ok2q2N3q4J04j1o3J0J09j7pO7j98N4j2J35n5p2J91j72J3j8JRj4QN4j1
$$ 129 172 197 33 150 156 134 52 105 21 125 114 51 61 170 153 146 213 15 69 57 192 137 65 256 84 97 79 80 89 75 83 137 126
3916A26m0k2L4M9M4J64j21Q5k46j2J13p8k0k9J2O3p0J87j66J31l4o6o9Q3J26m2j5J22R1k14
$$ 126 86 64 98 147 191 355 234 319 73 61 174 96 76 47 59 122 52 239 73 204 170 104 35 118 244 202 187 309 400 186
3564A86j22LN6J03j06NK3q1O2L9j09J9O6Q8kOj43J12J1k03J95OMo3o9R0O4n2j29M4j1lP2J57
$$ 186 64 67 123 226 120 125 148 67 129 168 59 78 144 232 230 236 93 205 216 13 208 214 218 155 86 176 240 188 59 103 92 89 161 318
3165C18j18k4J35k20P1j11RO9o4Q0qNN7o0n2Po4NM1L0m5k7N4Q7J7q5K11r5j96J78n6n4M5N0
$$ 318 200 176 311 91 162 51 60 129 65 145 137 142 199 139 87 94 30 35 76 106 61 34 88 175 192 107 318 223 27 205 149 95 140 190
2766A90l2r5Q9o4P8q1J13O4j26p8J02N8j73J59O9j09q3J04k7Q8o8j32P2O8p5j3M2rJ21p7j36
$$ 190 158 63 152 88 166 85 198 262 136 58 160 218 45 204 273 164 81 185 158 246 178 46 118 186 111 98 140 131 252 175 39
2402C9Q5q5K28j98J2J16O2j11j15J34p5K9L3q6J9R3kn5r7P6qm9J64r7J24l6r7m4J9L9l5M1
$$ 39 124 39 267 69 81 197 259 148 33 167 92 121 154 68 87 180 178 123 26 102 94 45 209 112 236 200 103 59 78 117 82 123
2027A23m3M0J11q6p2R3j17Q9J13j1j28M9J5NJ33m5k01J06j27k4R9J85j67J21K7j49O9j24o4
$$ 123 80 120 231 145 73 166 49 138 251 240 112 161 176 181 314 269 68 174 47 23 122 307 140 261 288 139 208 84 20
1686B0J68n5n9l2M0j9J6J07k8l9kpj2k1PK9n0M3L3L5j8o3J2O5j27J07j6n3J33P4j69o0N8j09
$$ 20 188 133 74 42 82 63 79 186 158 119 117 110 98 77 84 113 63 106 139 174 156 93 105 170 43 150 134 81 214 288 119 59 117 8
1287HR9M9O2j68m1N9j6K5P6o5J02l8j02J4J09q1J83l0j34M1o7J19K6n7j29L2KO0L4l1m4l5
$$ 8 107 156 218 50 9 68 52 77 153 88 190 152 50 64 173 92 275 245 111 152 85 204 230 173 44 76 78 138 172 141 97 62
912F2J9PK1JK3r2J48Q0o4j01O2l6K2j21N9P3o8LR0j31k0N0KNK5k8j7n2J49j02J54J09J58l50
$$ 62 81 88 109 110 133 41 189 269 205 104 166 130 152 31 90 163 95 98 188 57 37 87 89 94 119 91 74 22 171 69 223 332 490 140
513A40j4n1K02k1j32k8m3mP9j9N5j05J06p3j4m7J28l1l1j6L7RJ66k07J94n8r2P4j15l4m1R8
$$ 140 126 75 277 256 124 96 53 49 128 109 164 59 165 92 78 31 159 128 97 81 118 127 293 86 280 222 130 204 89 55 14 112
137A12N8j07m4J34%l7O3j49M4mO0j6L2K5q5Q6p7M8J02j39Q6K2L6q7n6k5n3K3
$$ 112 170 63 19 153 153 116 179 30 74 70 130 114 146 171 86 172 95 143 245 106 192 214 250 163 107 82 29 52
-192E2
##PAGE=	F1=-14204.5
##FIRST=	25164.767445380970457,	5806.2096540000038658,	0
##DATA TABLE=	(F2++(Y..Y)), PROFILE
5806A12L8J8j30O4o8M0N8J73o0j39k3QJ23j20L2P9j06L3K3j31N3Q3j22J52n6m6O5m5o1R5n9
$$ 112 150 168 38 102 34 74 132 305 245 106 83 91 214 94 126 205 99 132 155 24 77 160 38 190 134 88 153 108 47 142 83
5442H3j5L2m8j3K00lj36l8J46K0r8m1J39mj51M1Q3m9J57j60q5R5Qj2N3m7p8Q2Q5j93O7k2P1
$$ 83 68 100 52 39 239 236 100 62 208 228 130 89 228 224 73 114 197 148 305 145 60 155 163 151 204 157 79 161 246 53 120 98 169
5055A69Qr3lR1K2j20j8N1o7K14L5j61o8MJ41p4N9np7k9J58j21MJ50j71J29L1j71J98j97K4
$$ 169 177 84 81 172 194 74 56 107 40 254 289 128 60 64 205 131 190 185 108 79 237 116 120 270 99 228 259 88 286 89 113
4691A13R1m5j52O6Q4l9r1Q1Q0j36N9l1M8p9J13J30j90O1K2j26P1m1nO8Mj1L0r2l3O9M9nJL7
$$ 113 204 159 7 73 157 118 27 108 188 52 111 80 128 49 162 292 102 163 185 59 130 89 84 152 156 145 175 83 50 119 168 163 164 201
4292B01Pj97J60K3m3o3Oo5R4mq0j3J03l3L7Q0j85M4RJ11p0o6K08j45rl2lJ5l0O5k3K7k9m7
$$ 201 208 11 171 194 151 88 94 29 123 119 39 26 129 96 133 213 28 72 81 192 122 56 264 119 110 78 75 90 60 125 102 129 100 53
3893E3Q7O1j3J45j21J06k01l9Q3p1j1n5K7O6n3J76j18J08l4j17l5Q9P3l3N5O1J01k09r6j0
$$ 53 140 201 188 333 212 318 117 78 161 90 79 24 51 117 64 240 122 230 196 79 44 133 206 173 228 289 390 181 85 75
3541G5N0O9m8l7K0n2RO5q0k3J25L6O6k4k07J61K5j91J36k7N0m7n5Q5R7m4j87O4qm9P4J93p7
$$ 75 125 194 146 109 129 77 86 151 71 48 173 209 275 251 44 205 230 39 175 148 198 151 96 181 278 234 47 111 103 54 128 321 244
3154B44q6J25j90M9p4k0K3j0N3L3l7Q8k7n9rq3N4K3kj3j6J9J02K1o3K09j15k09J29p1K5J5
$$ 244 158 283 93 142 68 48 71 61 114 147 110 198 171 112 103 20 74 97 95 82 66 85 187 208 145 354 239 30 159 88 113 128
2778A28O7n5j11J31n6Q2j08J59j6r6r6J06Q1j68J62P8j41o3R1n3J27q6r0Q2J4q6l1J16k9R4
$$ 128 195 140 29 160 104 186 78 237 221 125 29 135 216 48 210 288 147 84 175 122 249 163 73 155 169 83 52 168 139 233
2426B33j9j84J17j39K83j94p1J78L8r9j18J24r1N3L5o4%M3k3L2j22O6J5p0K19j42P4n0o4q
$$ 233 214 30 147 8 291 97 26 204 242 143 25 149 58 111 146 82 82 125 102 134 12 78 93 23 242 100 174 124 60 52
2074E2L0L5n5Q2n5J0J53m5r1N6j13J11R8J2j52KL3n1J58pj62Q3j52rQ4K12j78J64%j58N3j30
$$ 52 82 117 62 144 89 99 252 207 116 172 59 170 268 280 128 130 163 112 270 263 101 184 32 23 107 319 141 305 305 147 200 70
1698G0k9J48k8j05nl3O2O3P3l9l1k2k3LJ5l8J6l0K2P4k0pj5k3O2j09J12j3r1J35R2j81n3N5
$$ 70 41 189 161 56 51 18 80 143 216 177 146 124 101 104 119 81 97 67 89 163 143 136 121 98 160 51 163 150 59 194 286 105 52 107
1299A07o0Q9M7qj41L2J5m%J01j12R5j1p4k4J34r4J58k9j60P5k8Q2M1p5q9L2jL3N7j6q1o3Q9
$$ 107 47 136 183 175 34 66 81 77 77 178 66 161 150 76 52 186 92 250 221 61 136 108 190 231 156 67 99 98 131 188 172 91 28 117
900A17l3mN2k0q8J58Q7q0r5R3j5o8l6L3J16q8l4Q9j32K5K5k1kN6kk2p4J88j35M18K03O1n33
$$ 117 84 80 132 112 24 182 269 189 94 187 172 104 68 101 217 129 95 184 52 77 102 81 79 135 133 111 37 225 90 508 711 772 239
513B39j31q1K49nj28j8r0jJ10n1J17j26J46j01o4m2Q5p5Q1k1k6Q5J24j34J21j4j39P5j07J3
$$ 239 108 27 276 271 143 125 35 34 144 93 210 84 230 129 65 23 108 33 114 93 67 152 276 142 263 249 110 185 78 91
160I1p7Q9M3q5j4J20mm0N6j38J1j8J10k6K4K7r1P2q1O9J31j81J12JQk2o2m9o8L7
$$ 91 14 103 146 61 47 167 163 123 179 41 52 34 144 118 142 169 78 150 69 138 269 88 200 201 209 187 125 76 8 45
-192D5
##PAGE=	F1=-14306.8
##FIRST=	25164.767445380970457,	5806.2096540000038658,	0
##DATA TABLE=	(F2++(Y..Y)), PROFILE
5806A17L2J4j56J04q6M5P1J49j1j33o2l6J50j05L1J6r3R4m3n3QJ43j45J34j08K2K0oq5O7n5
$$ 117 149 163 7 111 25 70 141 290 279 146 84 48 198 93 124 140 47 141 98 45 53 196 51 185 77 99 119 113 28 95 40
5442D0nN8Ko7K03l3j35K7O6J1j4m3J08L5j47L6L6l2J61j20j23O4O8qk1pr1R9N5r8j2q5J02
$$ 40 35 93 95 28 231 198 63 90 156 167 153 110 218 253 106 142 178 146 307 187 64 128 196 188 167 160 69 168 223 125 113 28 130
5055A30Q2p4%P0l1j63K4N0l2J30L3j16n0O3J16j16L0j2l8k2J52q3q2J76j37J38M4k23K15j54
$$ 130 212 138 138 208 177 14 38 88 56 186 219 103 53 116 232 116 146 134 96 74 226 143 61 237 100 238 282 59 274 120
4703A20J1M6jj06%J14q9k7N9Q1j21J4j1M6p0J24J35k33O8N0j97J14J7m8P2L4j4jj29j7O9P7
$$ 120 131 177 176 70 70 184 95 68 127 208 87 101 90 136 66 190 325 92 160 210 13 127 144 96 168 202 188 187 58 41 110 187
4327A87JPJ9j3j84J87K8o7m3qm7O4j4q3l1Q5m9P4P6j50N9K2P4q7n7K10j14k5l5Ppm1J01p2
$$ 187 188 195 214 201 17 204 232 165 122 114 67 131 117 34 3 88 39 113 189 39 98 120 194 107 50 260 146 121 86 93 86 45 146 74
3928G4O7n1l8J14O2m6J06j19J35j44p8N9n8Lo2J6P1m3J46o3J07m3j74P1K9K8j1Q3J5J01j97
$$ 74 141 90 52 166 228 182 288 169 304 160 82 141 83 86 24 40 111 68 214 151 258 215 41 112 141 169 158 241 256 357 160
3564A60o5PK7L6Jo5j1j7k3P5m3n3J65k0J38n3k32K04L8j76P3r5R7j0l7N6J08l3j98P3jp8J6
$$ 160 95 102 129 165 166 101 90 73 50 125 82 29 194 174 312 259 27 231 269 93 166 71 168 158 121 177 285 252 54 127 126 48 64
3177F4K39m0j11Q5j54M3j5K1j09M6QP0q1J20J2q1nj07J12qk5J2Jj3Q8N0n4J88j21j86O8p9
$$ 64 303 263 152 237 83 126 111 132 23 69 77 147 66 186 198 117 112 5 117 109 84 96 97 84 172 222 168 356 235 49 117 38
2801C8R0j9P8p7k4P9n6Q4q8J58j19k4m7L2Q2j36J43P5j50l5P4p4J38r9j9O6j5r0l1J54l0L9
$$ 38 128 109 187 110 86 165 109 193 105 263 144 120 73 105 187 51 194 269 119 84 158 84 222 123 104 170 155 65 34 188 158 197
2426A97J9j29Q4j47K67j35o0J17lq1p7O8p1M5K4l6rM8n2N7q1JO3m7K02j91M1m9jk5M9L6q1
$$ 197 216 87 171 24 291 156 96 213 210 129 52 120 49 94 118 82 73 121 69 126 45 46 109 62 264 73 114 65 64 39 88 124 43
2038D3J14p8J5J50j7p0K2j03J27M3M1j46n5N2j00J74K6j13M8j57L4L7J83j73K28k7j24K6j53
$$ 43 157 79 94 244 227 157 179 76 203 246 287 141 86 138 38 212 238 125 173 16 50 87 270 97 325 298 174 200 47
1698D7K4R8J0j19Pk1M6J01L7m4k8l5l3K7L6q8J3jJ4P4l1m3M2n7N9p8J11j4j23J22J13j66o4
$$ 47 71 169 179 60 67 46 92 193 230 186 158 123 90 117 153 65 78 77 91 165 134 91 133 76 135 57 168 154 31 153 266 100 36
1311C6P3j8O6M7o0o8M6j3j3oJ24j05J8J4k3p4J36r9J20j3j51P6K4L9M2o6m3L1m3K1P3kj15
$$ 36 109 91 157 204 144 76 122 109 96 90 214 109 127 141 118 44 180 81 201 188 37 113 137 176 218 152 109 140 97 118 191 189 74
923G4o1J40p6k0R6n5k5R5Q6r9o4J20pj54M6LJ46j00p1R5j30O7ml7J3O6qJp2J85j49L72J06
$$ 74 13 153 77 57 153 98 73 168 254 155 91 211 204 50 96 99 245 145 74 169 39 106 102 65 78 144 136 137 65 250 101 473 579
536E79P3m13j92j7K22L4j08n4p8J9J01r0J59j43J82j21q2j0L2k1O6nq9J32P3o9M4L0j33L0
$$ 579 652 239 47 30 252 286 178 124 46 65 166 76 235 92 274 153 71 61 93 72 138 133 44 176 249 180 224 254 121 151
184A51r7Q7j26R1J7n3MJ04rk5J2j02ql8J48l6L4Oj01O2p2J02J44k17J10rj6K2o1n8m3K6
$$ 151 54 141 15 106 123 70 74 178 169 144 156 54 46 8 156 120 154 160 59 121 49 151 295 78 188 179 163 185 124 66 23 49
-192D9
##PAGE=	F1=-14409
##FIRST=	25164.767445380970457,	5806.2096540000038658,	0
##DATA TABLE=	(F2++(Y..Y)), PROFILE
5806A11K5J3j11Q1q4N9L2J29M0j18r8o0J42q0M0n0o6J72r5k4L7J30j36O8j38J01j5N1j28K5
$$ 111 136 149 38 119 35 94 126 255 295 177 79 19 161 81 121 71 5 177 82 58 95 225 89 157 19 120 105 156 28 53
5454E3l3J6P5J6o0J41m8p9K6j8PQ0o4P0R6j37K9rl6J45n1j49L9J09nj00N0r5Q6L3j5o4o9N3
$$ 53 20 36 111 127 67 208 160 81 107 89 96 176 112 182 278 141 170 161 125 270 219 70 109 218 213 113 163 68 154 187 172 108 39 92
5055I2J36n5PM2q3r2N0n0L0M3M6r4nR7P6j33J9m8K1k5J46m7j63K02r4J04N2k33K01q8rj2N4
$$ 92 228 173 180 222 139 47 97 47 77 120 166 72 67 164 240 107 126 78 99 74 220 173 10 212 118 222 274 41 242 154 145 133 187
4668A87n4l7R8j14jM9R6j09k4J5M1n5J25J16k64Q8N8j84J15M9q3P7M4k6k7j37QN1J06K0j7
$$ 187 133 96 194 80 79 128 224 115 91 106 147 92 217 333 69 157 215 31 146 195 112 189 233 207 180 43 51 102 208 228 211
4304B11pk9j56K20K3r0k0ol5L5l8o6j5L2l4N1O2r2Q9K7K5r9l4J90q2l7k7K3m0l3R4q4J01j02
$$ 211 204 175 19 239 262 172 152 146 111 146 108 42 27 59 25 76 138 46 135 162 187 88 54 244 162 125 98 121 81 48 142 58 159 57
3905E7MJ07N3m6N7j14J65q5j27M5k9Nl7j1P9n1J08l1J27m9j58J28m8pJ7O2j1J06j85m1K5J4
$$ 57 61 168 221 175 232 118 283 198 71 116 87 92 55 44 123 72 180 149 276 227 69 197 149 142 159 221 210 316 131 90 115 129
3529A29J7K8p0o6L2m6P5rm5J53o6J98p1k27K25O0j79M3j31J01K7k9J8R4k7j70Q5j7k7r0K57
$$ 129 146 174 104 38 70 24 99 90 45 198 132 330 259 32 257 317 138 181 50 151 178 149 167 261 234 64 149 132 105 15 272
3165B72j1j17L5j17N0K8N1j56N2m4J05j23J42M6j12J3r1J20m7pQK8l8M8J00n7J42j11j45K9
$$ 272 261 144 179 62 112 140 191 35 87 43 148 25 167 213 101 114 23 143 96 89 97 125 87 135 235 178 320 209 64 93
2813I3p5J20n1J01j14P4J1o1R1l3J05k21P8L0n8N2r4J11N9j32j1O3o9R4r5O2K9j9q1k3J61
$$ 93 18 138 87 188 74 148 159 98 189 156 261 40 118 148 90 142 48 159 218 86 75 138 69 163 68 130 159 140 59 36 197
2449A97j8k7K9o1O0j24K16o1j3L2o4o0k5K5m3K0olj6R2m0j2l2m6R2l2J94k34N2rK8p2N4M6
$$ 197 179 152 181 120 180 56 272 211 198 230 166 106 81 106 63 83 77 74 58 150 110 98 66 20 112 80 274 40 92 83 111 39 93 139
2050A39j11J33j01L8J12mk2Pr6J34m2P1j05j07O2p8J23N7q0J4j10O9k7J21j50K65m3o4lj74
$$ 139 28 161 60 98 210 206 184 191 95 229 187 258 153 46 108 30 153 210 130 144 34 103 76 197 47 312 269 205 202 28
1698B8O9K9N3j05PJ8L9Q2J1m6k1n2l8M9N0j43J9N1QM1Mq6O5q7N3l2J03k0j07Q2J15j41o6R1
$$ 28 97 126 179 74 81 99 138 220 231 185 164 112 74 123 173 30 49 100 108 149 153 67 132 45 98 66 169 149 42 124 239 98 32 123
1299A23pL7O5r4qM9m0k4LJ38r8n7M5J6p6R3j07Q4L4j10J9Q9kJ4k9lJ3r6K4Q0J0j35NJ30j16
$$ 123 116 153 218 124 116 165 125 101 104 242 144 87 132 148 72 165 58 142 176 66 85 174 172 186 157 154 167 71 95 175 185 50 55 185 69
888F9J2R0o8J6K9Q0j15j4J31j0k15J06k2J56r2j04J08j20Q5k7k0KO6l1L3p2J74r7J24o0J41
$$ 69 81 171 103 119 148 228 113 99 230 220 5 111 89 245 153 49 157 37 122 95 75 77 143 112 145 73 247 150 274 214 355
524C55j43j92N9J31Q3r7r7m2M8P3j14J71j46J99j28q6J2J9K1K6K2j01J15K5k0k1O4r4l8p3
$$ 355 212 20 79 210 293 196 99 57 105 178 64 235 89 288 160 74 86 105 126 152 174 73 188 213 193 172 236 142 104 31
172C1J44j59J05j6j9J0Q2j4Kn2m7Qk7J18m7N0j5j14N2j8J12J21k28Q5j1m4M4n0l6j7N
$$ 31 175 16 121 105 86 96 178 164 166 114 67 75 48 166 119 169 154 40 92 74 186 307 79 164 153 109 153 103 67 50 55
-192E5
##PAGE=	F1=-14511.3
##FIRST=	25164.767445380970457,	5806.2096540000038658,	0
##DATA TABLE=	(F2++(Y..Y)), PROFILE
5806I8J9J3p0N9n8P0m3J21Q2j02j29m8R5m3M6r3L5J71j12m9Q8R1j19j2o9R4j1Q0j60pj3N3
$$ 98 117 130 60 119 61 131 88 209 291 189 60 12 107 64 110 17 52 223 111 62 150 241 122 110 41 135 124 204 44 37 24 77
5431G7O0Ll4O2k9l0Jq8N3J28q1K3J39j20K8l5p1J15L4j67N1J09rj41Q4p5M6K5L2p2l2k4J52
$$ 77 137 140 106 168 139 109 110 22 75 203 122 145 284 164 192 157 86 201 235 68 119 228 219 78 162 87 133 158 190 118 86 62 214
5043B14l6K5Qj17QO1j45Q2l0O6r4O6P6L8j25L6j05P5k3J35j9j16J25p4N5M7j88J52j3k3p7
$$ 214 178 203 211 94 102 163 18 100 70 136 42 108 184 222 97 133 28 103 80 215 196 80 205 131 186 233 45 197 184 161 84
4679H4J02jn1N4j04k7O0J08j02l4L2L5l2J07Q0k55J12K8j36J14N1j02Q4L6m0m8j06J9L2J30
$$ 84 186 185 134 188 84 57 117 225 123 89 121 156 124 231 311 56 168 196 60 174 225 123 207 243 203 155 49 68 100 230
4327B30L2n5l8l4r9K34Pj06Rqj8Qo8l8j1J3Mk7L0j9J14L3l1r8J0J47n1n1qM6p7k4O7p0J26
$$ 230 262 207 169 135 36 270 277 171 180 172 154 162 94 56 45 58 62 35 65 46 160 193 162 64 74 221 170 119 111 157 80 56 123 53 179
3916A79j63O3O7L5j5K6j11J81l2j82M0J0oj1j7Q6p3Q5m1J58m8q4J43j19m2L0J3j0J16j74k9
$$ 179 16 79 146 181 166 192 81 262 230 48 88 98 92 81 64 150 77 162 121 279 231 147 290 171 129 159 172 162 278 104 75
3553G5L2J4RM6o4r2O5o7P4Jk5J14r3K30o7k13K26Q6j86L6r5N3L5k3j7O2l1j17R7n2N6p6J43
$$ 75 107 121 130 176 112 20 85 18 92 93 68 182 89 319 252 39 265 351 165 201 106 159 194 171 154 216 185 68 165 113 169 93 236
3165B36J0j23nq3O3M3P6j50M7q8J38j47J26O8j40L7n8R9q6M3k4O6m4j3J53n9O8q6r4K4p1J14
$$ 236 246 123 118 35 98 141 217 67 114 26 164 17 143 211 71 108 50 149 63 106 82 148 104 91 244 185 253 167 73 97 26 140
2790A40p8J49j65J42m7o4J14PL2j58N2R9j18jo9Q1K9r3J4N0l3Kk3Q1j5ko3k3J53%p9KNM8q7
$$ 140 62 211 46 188 141 77 191 198 230 72 124 223 105 104 35 116 145 52 66 116 83 85 62 143 128 126 63 40 193 193 114 116 121 169 82
2379H2J61PM4l8j41l8K3K4l8rm4L4k8J29j6r5J4k9N4k4K02k64J01K4J8q6K7O0j19J25j02M0
$$ 82 243 250 294 256 115 77 100 124 86 77 33 67 39 168 152 57 71 42 96 72 274 10 111 135 153 67 94 154 35 160 58 98
2003I8N8%L2J9r6J33j39R5m0j07K9OK9P4p7j1l3R2p5O1j13K30m3Lk5j62P5n1J01q8QM0N8L5
$$ 98 156 156 188 207 111 244 105 200 160 53 82 88 117 191 114 103 70 162 87 148 35 265 222 225 200 38 113 62 163 75 83 123 181 216
1604B16J0n1kq1m2O7N7j47j6J20JlO3o6nr9N1J6Q1l1o5O8P6j26m4R4j8%J00j10K6M4o8k7J7
$$ 216 226 175 173 92 50 117 174 27 11 131 132 129 192 126 121 22 73 89 170 139 74 142 218 92 48 142 124 124 224 114 140 184 116 89 106
1193A06J42r0j04O9L8m8L8j21N7J04r7m2J64l8m1K4K8j7j48L8P6K2j35O0J26j47O5N5o3L1
$$ 106 248 158 54 123 161 113 151 30 87 191 94 52 216 178 137 161 189 172 24 62 138 160 25 85 211 64 129 184 121 152
841A52k9P5j20M1J11j4j73P1l6J42n3j36J42j06N7l9L0m2O5n2N2o7J53k2j37P5K6O8j69M7
$$ 152 123 198 78 119 230 216 43 114 78 220 167 31 173 67 124 85 115 73 138 86 138 71 224 202 65 140 166 234 65 112
489A12N1J29j06j22JN6N4j10J49j28J82j20q6K8J7L6ON0r0P3mOo5Q6n1j00j5J48j48J07n9
$$ 112 163 292 186 64 65 121 175 65 214 86 268 148 62 90 107 143 149 199 109 182 178 184 119 205 154 54 39 187 39 146 87
125H7K1LM7j3L2j16J3M0k8Q8n7N5k2j23M5N9R8P0k17N6j2p6M6k7J0j5o
$$ 87 108 111 158 145 177 61 74 114 86 174 117 172 150 27 72 131 229 299 82 138 126 50 96 69 79 64 58
-192E8
##PAGE=	F1=-14613.5
##FIRST=	25164.767445380970457,	5806.2096540000038658,	0
##DATA TABLE=	(F2++(Y..Y)), PROFILE
5806H4J9Rm5M1j3P4j33J26J09r4j13n9N4%L2l6N5J52j23q1J35N0j05q4K5N5J1R1j78Ql1P6
$$ 84 103 112 67 108 95 169 36 162 271 177 64 5 59 59 91 55 110 262 139 58 193 243 138 54 79 134 145 236 58 66 35 111
5431A11M1k0lj6L1k1k2l6N8J06o7k1J22j02M2l7j33Q1J23j83J01P4k2r7M1k9JK7L5n2l5l7
$$ 111 152 132 129 113 144 123 101 65 123 229 162 141 263 161 203 166 33 114 237 54 155 229 207 110 151 122 123 150 185 133 98 61
5055F1J12k0N1k1j02O5P9j65N9o8O8p4J14OJ8j00N4j13Q1j4J12Lo8O8p8RK7j02Q4N6k2j42
$$ 61 173 153 204 183 81 146 225 60 119 51 119 45 159 165 183 83 137 24 105 91 203 206 138 206 128 137 164 62 146 202 180 38
4679C8J35M2n7K1o8o6O0R7r5j0L1L1lP1L5j81J23m4p8J15K6j01R6J3n0o4l7RJ3J44K9r4o7
$$ 38 173 215 158 179 111 45 105 202 107 97 128 159 156 227 262 81 204 160 82 197 223 122 218 231 181 117 80 89 102 246 275 181 114
4292A14k6qK09k0j06M4k4J1k2r3j4jJ2J1jn6KJ24M8q8q0P0Q8j7p2J8O9j02l7N9n0J37j45M8
$$ 114 88 80 289 269 163 207 183 194 172 79 65 64 76 87 86 30 32 156 204 116 36 106 194 177 105 123 192 90 53 112 62 199 54 102
3893A02J0J4L2L9j21J73Nk29L2M2k1J5j1Q9r7Q7q2J88m3KJ50j67q0J6m2K8J21j66k5K6J6J9
$$ 102 112 126 158 197 76 249 254 25 57 99 78 93 82 171 74 161 79 267 224 226 376 209 129 145 103 131 252 86 61 87 103 122
3517A22O6p6l8M0p6P8j9j4O8q9K18m0j86K04J01j89L8o5L1K0j5l8K2m6n2R6q8J43o1M8K7j41
$$ 122 188 112 74 114 38 116 97 83 151 62 280 240 54 258 359 170 208 143 174 194 179 141 163 117 65 161 73 216 155 203 230 89
3142H9k5m2O6L2R1j16M8j21J78j68Q4Q2j45L9j2O4r5O8o2J11k3n5J62n2k5n6m2N0q9J00j02
$$ 89 64 22 88 120 211 95 143 22 200 32 116 198 53 92 80 144 49 117 55 166 143 88 250 198 173 117 75 125 36 136 34
2778C4K08j77J32p8m7J38%l0j0l1J44j50k8r0O3j2l3L7J8Pk8N9J5m9K2m3k5J30J9q7p2N8N0
$$ 34 242 65 197 119 72 210 210 180 170 139 283 133 105 15 78 66 33 70 88 95 67 126 141 92 114 71 46 176 195 108 36 94 144
2391A44m6J20N4R9q1k19k6O3N0n5l3m8M3m6J48J1j59M1J2j0QJ99k38R9M8np2jO0j00R8p4M
$$ 144 98 218 272 371 290 71 45 108 158 103 70 22 65 19 167 178 19 60 72 62 70 269 31 130 178 173 101 100 160 60 158 84 88
2003H8J2LO3N9j05J25k22J06K5p5j1O6j0O5j06j9M0J04j05M4q3J33l5N9l3j34O7j08J18o9
$$ 88 100 103 166 225 120 245 23 129 154 79 68 134 124 189 83 64 104 208 103 147 64 197 162 221 188 54 121 13 131 62
1651F2QM3P6pL8o2L0j23l0O6N5p7n0J25Jl9J21l8j01o1O6K4N0n1k8Q6K5j31j1Q8l4k8J30j08
$$ 62 70 113 189 182 220 158 188 65 35 101 156 79 29 154 155 116 237 199 98 37 103 127 177 126 98 184 209 78 67 155 121 93 223 115
1252A15L2L2r2k6L1J45p6j01N6M6j8nj35M8J56j00q1K36p5j09P4N1m8j26jN9L0j08Q8J31j62
$$ 115 147 179 87 61 92 237 161 60 116 162 144 139 4 52 208 108 27 263 188 79 153 204 156 30 29 88 118 10 98 229 67
888F7J08J5n8L7p6Q0j03P6N9j4j17L8l6J06Lj52J86j08lk8P8r2P5o3N3o7J27L1j45K29n5K4
$$ 67 175 190 132 169 93 173 70 146 205 191 74 112 76 182 185 33 219 111 108 80 158 66 141 78 131 64 191 222 77 306 251 275
513B75j99M6jJ65j29j10K4L8M4p5J03r3J28r5q8M1J0M4NP2o9K5qKp9J03k8j04J1J17r2R4j16
$$ 275 76 122 121 286 157 47 71 109 153 78 181 88 216 121 33 74 84 128 133 205 136 161 153 155 76 179 151 47 58 175 83 177 61
125F1P7j9%mN4j65O9P6l2O2n7L5j2j25M6J24P2J1j93L5j5p0%%O5k9r
$$ 61 138 119 119 115 169 4 73 149 117 179 122 157 145 20 66 190 262 273 80 115 100 30 30 30 95 66 57
-192E7
##PAGE=	F1=-14715.8
##FIRST=	25164.767445380970457,	5806.2096540000038658,	0
##DATA TABLE=	(F2++(Y..Y)), PROFILE
5806G4K6ml3K6L8P2j61Q6J16r3j9j04M3MPJ8Q3J11j36j00J62J5r8r2O0J6K8R6j76L6m5P0J9
$$ 74 100 96 63 89 127 199 38 124 240 147 128 24 67 71 78 96 179 290 154 54 216 231 133 41 101 117 145 241 65 101 56 126 145
5419A45m1K4p8J10l7m2M4M5Q0l3n0M6q3P2k7j48OJ98k03J70L0m4k1l4L4m1L0J5k4o4J6J6o
$$ 145 104 128 50 160 123 81 125 170 250 217 167 213 130 202 175 27 33 231 28 198 228 184 163 129 163 122 152 167 143 79 95 111 105
5032A05Q2m3l0O0J04j83L7p9M8k0J28r6J8o1N5o4M3jP7J6k3L1r5k2pmK2J10j1j84J38O7o4
$$ 105 187 144 114 174 278 95 132 53 101 81 209 113 131 70 125 61 104 103 180 196 173 204 109 87 80 76 98 208 197 13 151 218 154
4644A54L4l1m6MM1q7L6J8L1K7K9j1p5J29j38j4J04j6q0J10j6n7p3M8j3lJ48Rj24q8j0R6J58
$$ 154 188 157 111 115 156 69 105 123 154 181 210 199 124 253 115 101 205 189 109 219 203 146 73 121 108 105 253 262 138 50 40 136 294
4257B94o2q0P6m9M9n3j09JJ6RNP3n2j09J14O8j33k8J11K8J7r8M3Q4j00p9Q5l6J29j14K6l5
$$ 294 232 152 228 179 228 175 66 67 83 92 97 170 118 9 123 191 58 30 141 169 186 88 131 215 115 36 121 85 214 100 126 91
3881I1J1N0Q2j52J64K6k43RM0k4M1mQ0j11J02j23K08m4Q3J54j90j12k7q3J07J05j61j9J2R
$$ 91 102 152 234 82 246 272 29 38 78 54 95 91 171 60 162 39 247 203 286 440 250 138 111 28 135 240 79 60 72 81
3529H1N7Q0j18J6K9p7Q2m5k0L2n4J61Mj55J73R3j87L7m5L3kol8j1p1PP3q0J85m1rM1j71j7
$$ 81 138 218 100 116 145 68 150 105 85 117 63 224 228 73 246 339 152 189 144 177 175 169 131 120 49 56 129 49 234 193 184 225 54 37
3130C7LM9OQ6o4M6j50K31j86K7R6j09kM5K5n8L0p5J43J6n7J10k6j16l4mR2j11P8j16K50j49
$$ 37 40 89 95 181 117 163 13 244 58 85 181 72 70 115 140 82 112 37 180 196 139 249 223 107 73 69 161 50 128 12 262 113
2754A13O0o2j3J37n2n3J00p8J65j59j8j24M1k7K4L1k9L7N1M1n7n6L4k4k1R0L3m8p2qN5qJ02
$$ 113 173 111 98 235 183 130 230 152 317 158 140 16 57 30 54 85 56 93 144 185 128 72 106 82 61 151 184 136 64 56 111 103 205
2367B05P7J36r4k66m0Q9P9q5m4j0J2n6J57L0j56NN5p1R2J43j89P3O2l8l6rK8o4P6m6m4j4L2
$$ 205 282 418 324 58 18 107 186 101 57 47 59 3 160 190 34 39 94 23 115 258 69 142 204 166 130 121 149 85 161 115 71 57 89
1980H9L2J19j18J12j62J2M3l4k2R6j5M7j50j5R0J04j22N6n8L0l6Q9k4j06Q0n0Ok9nJ8P8k8
$$ 89 121 240 122 234 72 84 127 93 71 167 152 199 49 34 124 228 106 162 104 134 98 187 163 57 137 87 93 64 59 77 155 127
1604A27Q5p3O1j59NL0M9mo1R7J5n6J58k3j85pJ03J0J9p9mJ04oj43K4O9m6oJ11q8J6J2r4m2
$$ 127 212 139 200 41 46 76 125 121 60 157 172 116 274 251 66 59 162 172 191 112 108 212 206 63 87 156 110 104 215 127 143 155 61 19
1205A9N8J40m4o9OM4Ml1j10K7J63r7n4K54j15j48Q1O6o4n2n1J6L8m2N3J45j52J26k1o4M0r6
$$ 19 77 217 173 104 110 154 158 127 17 44 207 110 56 310 195 47 128 194 130 78 27 43 81 39 92 237 85 211 190 126 166 70
829G0Q9o7P6j3%n8K0k8N5N3j43K22j22p7K2Q7j32J01p5N5q1J03M4j08J81J8pk23N1k4J89j41
$$ 70 159 92 168 155 155 97 117 89 144 197 54 276 154 77 99 186 54 155 80 135 54 157 201 93 274 292 285 62 113 89 278 137
454A37o4JPM0k4M9m6M0n6p3N4k5N5J9Q5n2j3J2l0o5J18l3n2k1Q0rP0j77J49n4n3L0M0q0jJ13
$$ 137 73 74 81 121 97 146 100 140 84 11 65 40 95 114 199 147 134 146 116 51 169 136 84 63 143 134 204 27 176 122 69 99 139 59 58 171
31A71l2M0m4nLj15N8J60L1l0j63K2k2Pm4k9J00l8j5
$$ 171 139 179 135 130 133 18 76 236 267 237 74 96 74 81 37 8 108 70 55
-192E5
##PAGE=	F1=-14818.1
##FIRST=	25164.767445380970457,	5806.2096540000038658,	0
##DATA TABLE=	(F2++(Y..Y)), PROFILE
5806G9L4k8k2J2P1P3j29K0J01r7J01j48L8k4%M1J31N7j55q7J46j2r2k2K5k1K6J00j52O2m1
$$ 79 113 85 63 75 146 219 90 110 211 114 215 67 105 81 81 122 253 310 155 68 214 202 110 88 113 92 118 218 66 128 87
5442H7L2nn5M1q0J51n3o0J11L3N8Jo6m9p0J13k4p9k9J64k16K29jp0L7j02J01p9K2J0qr0Q7
$$ 87 119 114 59 100 20 171 118 58 169 202 260 261 195 146 76 189 165 86 57 221 5 234 233 163 200 98 199 120 142 152 144 54 141
5055A41j00OJ10n4M3M0J32k07K3p8K6L7J31k10L9j2M2j3MJ4L7J8J4J5j15l6m1P6k2J43Lj74
$$ 141 41 47 157 103 146 186 318 111 134 56 82 119 250 40 79 67 109 96 100 114 151 169 183 198 83 47 6 82 60 203 206 32
4679C2R7O6p5J02j5j4l5n4p5P5kL9N4mm3J4J38k20L7Q5o2n5J27m3o0p4J27l7j9J46k3j43p1
$$ 32 129 195 120 222 207 193 158 104 29 104 102 141 195 191 148 162 300 80 117 202 140 85 212 169 109 35 162 125 106 252 229 86 15
4292A5PJ68R5j15k9J00p9Q6q0j12KL8%JJ49n0j72N0Q7j27J7J13j5M4j22N8Q5o3j32J18k8J10
$$ 15 22 190 285 170 141 241 162 248 168 56 58 96 96 97 246 196 24 74 161 34 51 164 149 193 71 129 214 151 19 137 109 219
3916B19r2J7m5M3J1J21j99J73L6k40J6mJM0pN5j01J19j38K01n6J47J50j93j24q9PR5P6j57
$$ 219 127 144 99 142 153 274 75 248 284 44 60 56 57 97 90 145 44 163 25 226 170 317 467 274 150 61 68 163 239 82
3564H2j1N%J03P9j72N8K5p3Q0o4l4J9k4R6M6j27J53O0j84K6l2N0j9Kj7l1o6QL6K0J21j0k0
$$ 82 71 76 76 179 258 86 144 169 96 176 112 78 97 73 169 215 88 241 301 117 143 111 161 142 144 127 96 30 38 74 94 215 205 185
3165A85M8k01J0J3N0j1M2rM2j44K64j78o0J19o9n6J09j1l4k3l8J39O3n4M5J2j63m2OJ40j31
$$ 185 233 32 42 55 105 94 136 127 169 25 289 111 51 170 101 45 154 143 109 86 48 187 250 196 241 253 90 48 54 194 63
2801F3N6q5K25r6l9mJ0J14j21k8J47r4J70j45Lj30PJ5K0Rm4K5J38Oj10l3L0j4j3M2L9Nk3q0
$$ 63 119 34 259 163 124 120 130 244 123 95 242 148 318 173 176 46 53 68 88 97 53 78 216 222 112 79 109 95 82 124 163 168 145 65
2402F5J4K5J00P8J52r0k67o0Q6R4j27k8J4j3l8J60L2j46j5P1q4J56O4j36N2N3p7J1Pl2k0O9
$$ 65 79 104 204 282 434 344 77 17 103 197 70 42 56 43 5 165 197 51 36 107 23 179 243 107 159 212 135 146 153 121 101 170
2027A70l4q5j1P1m4J79j31J01q3k4k9J7pR8j6M1j81j3J03R5j31Q0k6k3m8O1pp5J22k2q3L8
$$ 170 136 51 40 111 67 246 115 216 133 109 80 97 90 188 172 213 32 19 122 217 86 166 140 117 69 130 123 48 170 148 65 103
1651A03k8l7N4k2J25p8P9j55J9j5M7M6o5O3M6o2J72k3k29L1J43%lj16J0J07rj48O1K9n1N0
$$ 103 75 38 92 70 195 117 196 41 60 45 92 138 73 136 182 120 292 269 40 71 214 214 211 95 105 212 203 55 116 145 94 144
1276A44N7n6kj8m5n0N0J24%n0m8L0J8m1p9LJ50q0NK39j56j16QP2m7po1%N0j6mJ60j24J22m7
$$ 144 201 145 143 125 80 30 80 204 204 154 106 136 154 113 34 37 187 107 112 351 195 79 87 159 112 105 44 44 94 78 74 234 110 232 185
865A85q3M2o2P6l3N3q1L8j5J7k2jQ1j06K37j42j32Q9N6j63J34r8P1j01Q7K7q8P4J35k0k02
$$ 185 102 144 82 158 125 178 97 135 120 137 115 114 195 89 326 184 52 141 197 34 168 70 141 40 127 154 66 140 275 255 53
501E3M5l5K02j14l8l6lK9J1ONo8KrM2o2L4L5R3m7k9L4p2k8J21n5mn5M6P3M3j83J79r4q1P7
$$ 53 98 63 265 151 113 77 74 103 114 120 125 57 59 50 92 30 64 99 192 145 116 150 78 50 171 116 112 57 103 176 219 36 215 121 40 117
78A17k9K6q2J42k0K2k7l8Jq3P0J58j8m0j28Nk2P1m0m9P8k3l4
$$ 117 88 114 32 174 154 176 149 111 112 29 99 257 239 199 71 76 54 125 85 36 114 91 57
-192E7
##PAGE=	F1=-14920.3
##FIRST=	25164.767445380970457,	5806.2096540000038658,	0
##DATA TABLE=	(F2++(Y..Y)), PROFILE
5806A01M1o1kmO9Q1r5jO3r6K01j76Pn1J7M2J83Rj76n2Q8l2p5M3km4pJ06j06P2k1l2k5o4N0
$$ 101 142 81 79 75 144 225 130 129 192 96 297 121 128 77 94 136 319 328 152 100 188 156 81 124 122 78 71 177 71 143 122 90 65 1 51
5395E1K7R5o1p2J48L2L8K3p3j22n2J29l4Rm3J11j72K24rr2N7j51J59j01j0L4qn7J03j59j5
$$ 51 78 173 112 40 188 220 258 281 208 86 34 163 129 138 95 206 34 258 249 157 214 63 222 121 111 145 137 80 183 24 9
5032IJ14n3Q2L3J60k29Rp0J2Q1J29k33lL1M2J3l2K2MRM5J7j24m4M5J6m7J52J7j60O8M1p8J88
$$ 9 123 70 152 185 345 116 125 55 67 148 277 44 41 72 114 127 95 117 121 130 175 192 68 24 69 85 38 190 207 47 115 156 78 266
4632B66j9J5m2j21m7M1k7N6P4j6m4M9J46k62N6O6p9n3J41o2n5m2J53m9l5J40o5j50K0J0J67
$$ 266 247 262 220 99 52 93 66 122 196 180 136 185 331 69 125 191 112 59 200 138 83 41 194 145 110 250 185 35 55 65 232
4269B32L2j62L4J01r7J12r9j01j0N2kkK10m9k04J4O5l9j8R2k8N7j32N7P3jj42J00k1R0q4K2
$$ 232 264 102 136 237 140 252 153 52 42 94 92 90 300 251 47 61 126 87 69 161 133 190 58 115 188 187 45 145 124 214 130 152
3893A52l4P9l5J36k45J97M1k46N2J2J%k1J2m3J19j40J67p6J82J36j75j12j24J17L8N3j51q
$$ 152 118 197 162 298 53 250 291 45 97 109 110 110 89 101 58 177 37 204 128 310 446 271 159 35 152 190 243 92 84
3553H4J0J1J15P1k11P6K4o6P2p5m2K6k3O3O3j05J54J4j78lk2P0k4J8Qm0l8l3L3R9J3L5PM6
$$ 84 94 105 220 291 80 156 180 114 186 111 69 95 72 135 198 93 247 261 83 80 58 128 104 122 130 90 52 19 52 151 164 199 206 252
3154B52k07POO8j1k8L3L6j00K69j45j63J52m8r4J68m1m7n7QJ27J07n8oM6j71n4j0J74j48M5
$$ 252 45 52 58 126 115 87 120 156 56 325 180 17 169 121 27 195 154 107 50 58 185 292 234 228 274 103 49 39 213 65 110
2790A10m7J68k9j20M5J6P9j73L9J17q6J69j11K1j24j1K7K7j5j0k3J96l1j26j3K9j3rNK8N3
$$ 110 63 231 202 82 127 143 222 49 88 205 119 288 177 198 74 63 90 117 102 92 69 265 234 108 95 124 111 102 107 135 188
2426A88K0r1o8N9R8O3J47p7k44p1P4R4j79L1Jk8pJ70K0j54J0N5o1J82rq7M5K2j15O3L1j01
$$ 188 208 117 49 108 206 269 416 339 95 24 98 192 13 44 45 17 10 180 200 46 56 111 50 232 223 136 181 203 88 151 182 81
2050H1K2P7l6j10OQ5q2J99j39R1k8j5j17P2J4P3k2N1j77nN6P9j27J06Kj5k9l6lk7J61j8j21
$$ 81 103 180 144 34 40 125 43 242 103 194 166 151 34 106 120 193 171 222 45 40 96 175 48 154 156 141 112 76 73 46 207 189 68
1663F8Q4m3o4k0QJ35p4P7j11mm2N4N8n5K4R1o4J64l6j95J6J69Mj4j58J9Q8J5j37R7k2n8R9
$$ 68 152 109 45 25 33 168 94 171 60 56 14 68 126 71 95 186 122 286 250 55 71 240 244 230 72 91 179 194 57 154 132 74 173
1276A73Oj6pn4J8m5K6J00L9m2r2KL0l7n3j8J25m9O6K09j91p1q1O9kln3J7P5k0o7J70r2J00
$$ 173 179 163 156 102 120 75 101 201 240 198 106 108 138 101 48 30 155 106 172 381 190 119 38 107 105 102 49 66 141 121 54 224 132 232
876B32n7j08L9J7M4j1J7j00Q3qK2k7m6P8m2K23j67j11J06J0j81J52j20Q6j09P6QK5N0Q7o7
$$ 232 175 67 106 123 167 156 173 73 156 148 170 143 97 175 133 356 189 78 184 194 13 165 45 131 22 98 106 131 181 268 201
513B01j34K2m7K04p0k8o3J3J9LnM8j21J9K9M4n3k4L6J01n2j3L0j05J9R9p6K3o1K8J11J9j28
$$ 201 67 89 42 246 176 148 85 98 117 120 115 163 42 61 90 134 81 57 93 194 142 129 159 54 73 172 96 119 58 86 197 216 88
125H8J55j28m3Q3j18J20j45J46QJ0k3l6l2l1P6J20p0rr4k1kR7l8n8N8J4n9
$$ 88 243 115 72 155 37 157 12 158 166 176 153 117 85 54 130 250 180 171 77 56 54 151 113 55 113 127 68
-192F8
##PAGE=	F1=-15022.6
##FIRST=	25164.767445380970457,	5806.2096540000038658,	0
##DATA TABLE=	(F2++(Y..Y)), PROFILE
5806A33N1j01J6j2L4R8o7J0K1r0K66j84m7o8M5L6K19j8j92j5Rm9l0P7j1m9n7J06m1N3J2j08
$$ 133 184 83 99 87 121 219 152 162 183 93 359 175 128 60 105 141 360 342 150 135 144 95 65 142 131 82 25 131 90 143 155 47
5431D7j5L3j3P5L9o4p0J48M1K3L0o8j34KN2n6J11q2Q4j28K10Nj06M2j77K03r7p0P2rnQ7j35
$$ 47 32 65 52 127 166 102 32 180 221 244 274 206 72 74 126 70 181 99 183 55 265 270 164 206 29 232 135 65 137 128 123 210 75
5043G5k7N0n0Q2M8J76k32j8n5J6R7J29j82q5M7O5J3o2K2j3qO8L5j08o9R8pn8J27K4j44O6R
$$ 75 48 98 48 130 178 354 122 104 49 65 162 291 109 24 71 136 149 87 109 96 88 156 191 83 14 112 105 47 174 198 54 120 129
4656A29l2K05m1L9k1j34n8j4n0Q0Q1lk7L5J46k51L9N3n4p6J40o6m4KJ38l7n2J22j10j31O7
$$ 129 97 302 261 300 279 145 87 73 23 103 184 181 154 189 335 84 123 176 122 46 186 120 76 78 216 179 127 249 139 8 75
4292G5L5J49k2j46M6P3r1J19j04p6k4L9J0%K42m8k25N1OK2n4M9qN5j22M3M8P2j32O2j7P5q7
$$ 75 110 259 237 91 137 210 119 238 134 58 34 73 83 83 325 277 52 103 109 131 77 126 118 173 51 94 142 214 82 144 127 202 115
3905A15L2j5J05o4J28k74K24M3k58R8O3k2m3l5m6M4J09j49J22r1J80J10j38p8p4J45k7M4j42
$$ 115 147 132 237 173 301 27 251 294 36 134 197 175 132 97 51 95 204 55 177 86 266 376 238 160 86 231 204 248 106
3564A06rK9K8Q6O8k23P0K2n7O0q4l3L4m2O5N0p3J57k2j55k9LL8j7O3Pm8m4j0Q1O7r7R6N1L9
$$ 106 97 126 154 240 308 85 155 177 120 180 96 63 97 55 120 170 97 254 232 77 48 51 89 72 135 142 94 50 40 121 188 91 187 238 277
3154B77j98j6j5R4or1N2L3m6K62j00k25J49m4r6K01n3r5m0MJ29J35o8l0O7j75l6j8J58j57
$$ 277 79 63 48 142 136 45 97 130 84 346 246 21 170 126 30 231 178 83 43 47 176 311 243 213 280 105 69 51 209 52
2801E2M9j6J00M0j16J0RL6r5M2K4o7J65o0K6j06oKN1l1K5n9K12n3j02rK8k6njrP9N4p9j32
$$ 52 101 85 185 225 109 119 128 164 69 111 135 68 233 173 199 93 87 89 140 109 134 75 287 234 132 123 151 125 120 119 110 189 243 164 32
2391C2R0Q2L3J31o8k01q2P5Q6r7j6m3QqJ62J3j62L3L9m2J95o5n0N2k0j37J05N1j57N0R5m3
$$ 32 122 204 237 368 300 99 17 92 178 81 65 22 30 22 184 197 35 68 107 65 260 195 145 197 177 40 145 196 39 89 184 141
2015A41j18J8P4m0J57j46Q5%jj00N8K6K6l1O8j60K0k4O1q1R4J7K3Mq7m6L2J62k3j21J01m7
$$ 141 23 41 115 75 232 86 171 171 170 70 128 154 180 149 217 57 77 53 114 33 127 144 167 171 84 38 70 232 209 88 189 142
1639A42p5k2j3R9n9N3m7m2k4M5L2ll9J39n9J30n3j22k1J69K2rj95K5N0N8j15J27n9p2J15l0
$$ 142 67 45 32 131 72 125 78 36 12 57 89 86 47 186 127 257 204 82 61 230 252 243 48 73 123 181 66 193 134 62 177 147
1264A47L0%q8O3m9J6Q5O0l8j13k7L2k0m3J5N5j0J12J63k09l8j23L7M4k9l1K8J10k0j16J63
$$ 147 177 177 89 152 103 119 204 264 226 113 86 118 98 55 70 125 115 227 390 181 143 20 57 101 72 41 69 179 159 43 206
900B06o3O5m5j21K3J03J4pj5n0R3k0K4m6p3N3L5J86j97l6Q1k2j65J21j12O6r1N6K2J19R7l0
$$ 206 143 208 163 42 65 168 182 175 160 110 203 183 207 161 88 141 176 362 165 129 210 188 23 144 32 98 7 63 85 204 301 271
524B71j27o5J5n8J87m2j0p3J8K9l5K5P1j04l5N6M0m1n3K3J08m6K1jj13N4N5r2K9k1K9P6Kn6
$$ 271 144 79 94 36 223 181 171 98 116 145 110 135 206 102 67 123 163 122 69 92 200 154 175 174 61 115 170 78 107 86 115 191 193 137
125A37J11j45OP8j10J02j37Q9M8Kl7lq7L2P9N3j07N5p3m6K7Q6m1n4M1N5p9
$$ 137 248 103 109 187 77 179 42 131 179 181 144 141 54 86 165 218 111 166 93 47 74 160 119 65 106 161 82
-192H2
##PAGE=	F1=-15124.8
##FIRST=	25164.767445380970457,	5806.2096540000038658,	0
##DATA TABLE=	(F2++(Y..Y)), PROFILE
5806A58P0j37K0j2j0J12m5L0j0q5K98j71j10o1O5K7K29l0j82Np5n2M6O5om8n2O0K0J2N0j72
$$ 158 228 91 111 99 89 201 156 186 176 91 389 218 108 47 112 139 368 338 156 161 86 34 80 145 139 91 39 99 119 131 181 9
5431IP9M9j7L8kp3m3J02N8K1K2m6j02J9l5n7J90j37Q6r6J90K9j12J3j72K15o6j28Q0J0K2O8
$$ 9 88 137 120 158 156 83 40 142 200 221 243 197 95 114 79 22 212 75 161 65 255 284 172 185 13 228 162 34 114 124 146 214
5055B14j08l4J5m8M8Q5J74k07o3l7L6Q2J38j42j35M6Q8Rq7J5j6j9Q4N8p8r8J14J1o3P3K6j22
$$ 214 106 72 87 39 87 172 346 139 76 39 75 157 295 153 18 64 152 161 74 89 73 54 138 196 118 20 134 145 82 155 181 59
4679E9Q7jJ4J54p2O1J7j30q7n4k4O5P1K5j4QJ30j97MM1k4p8J18n4m3M4J13lp6Q6j43n9L8P3
$$ 59 146 145 159 313 241 302 319 189 102 48 24 89 160 185 171 179 309 112 116 157 133 55 173 119 76 120 233 230 154 240 97 38 76 149
4280A49J18o0o0pJ7n2J17r3n2k1j5L7OK41n0k43J06k0L3n5j8K3M1r6K4K3J29j12K2j0O9r3
$$ 149 267 207 147 140 157 105 222 129 77 56 41 78 84 325 275 32 138 118 151 96 78 101 142 46 70 93 222 110 132 122 191 98
3905I8L0J1J16q0J06k56K23M2k46J19J12m3p9l6j00J13R4j47O8r5J46P3q2l7qJ53r4N1j28
$$ 98 128 139 255 175 281 25 248 290 44 163 275 232 153 117 17 130 224 77 145 50 196 269 187 150 142 295 201 252 124
3564A24j8O6L9J8P6k16N3J7m4N4j00rL2o4P2K6j5J39l4j15oMm6MJ22j1o7p5N7J11Lj85J72
$$ 124 106 172 211 229 305 89 142 159 115 169 69 60 92 28 100 126 111 250 216 101 95 99 53 57 179 168 101 26 83 194 197 12 184
3177A84Q5L3j81l7n1J16kj11K6L6jK51n6k51J25m8p3K10l8j42Lo7J55J35p9k5O9j71JmQ7j43
$$ 184 269 302 121 84 33 149 147 36 62 98 97 348 292 41 166 118 45 255 217 75 78 11 166 301 222 197 266 95 96 92 179 36
2801C6N6ML4R6n5p9nkN7Or3n1J62nK0q4J4l6Q5l6L5p1J99n3n3j0J6m7rK6n8P1P6n7j48R6N5
$$ 36 92 96 130 226 171 92 87 85 142 148 55 4 166 161 181 97 111 75 160 124 159 88 287 234 181 171 187 140 131 157 99 170 246 189 41 137 192
2367A92rJ14o8j41p7P0Q5Nq0n2L1l2J28K4j14j2L3k9J94j00l4O8n5j04R8N2j67M4J17n0r9
$$ 192 183 297 229 88 11 81 166 171 91 39 70 38 166 190 76 64 97 68 262 162 128 196 141 37 135 187 20 64 181 131 32
2003C2J7L7K1J10j51Q2MJ1l7L1K9m0l8Q6j38N5o2QK3RL0O0L6q8m9K3J38k4j12R9l5r1%m9O4
$$ 32 49 86 107 217 66 148 152 163 126 157 186 146 108 194 56 111 49 57 80 89 119 179 215 127 78 101 239 215 103 202 167 76 76 27 91
1592I1l1J6J1n7JK3j0Q8j09J56l8P1o8n0m7J35N3Pj98J6kJ05q5J44o4p8P8n2P9Kj13R4o5L1
$$ 91 60 76 87 30 31 54 44 132 23 179 141 212 144 94 47 182 235 242 44 60 58 163 78 222 158 80 158 106 185 187 74 168 103 134
1193A34O8O3l0j05k0j1J3n1P5k7K5J32J10k05k4r1KL1o2NJ7J42oj42J40m1J7j1r7J0J36mj6
$$ 134 202 265 235 130 110 99 112 61 136 109 134 266 376 171 147 56 58 89 27 32 49 191 185 43 183 142 159 148 51 61 197 193 177
806A77k4LQ8k5J6p1q1K3J03J34k30O3L5k5j45P2n2j7k5J4N1J44J16r1j53k5L3n4J52n2K4o7
$$ 177 153 156 244 219 235 164 83 106 209 343 113 176 211 186 41 113 61 44 19 33 84 228 344 253 100 75 108 54 206 154 178 111
430A11kM7o9Q1P5r8r6J00J7k2n5J0R9j3M4k9j13P9jj03K3M2L2JnJ7N6j43M5P4n6K9j09N7O8
$$ 111 109 156 87 168 243 145 49 149 166 144 89 99 198 185 229 200 87 166 165 62 85 127 159 160 155 172 228 85 130 204 148 177 68 125 193
20A93oo0L7j39R5P7k7q0J01p6o5M7N9m3m4K7Q6q7
$$ 193 187 127 164 25 120 197 170 90 191 115 50 97 156 113 69 96 182 95
-192I5
##PAGE=	F1=-15227.1
##FIRST=	25164.767445380970457,	5806.2096540000038658,	0
##DATA TABLE=	(F2++(Y..Y)), PROFILE
5806A67R5j63J1ol1R8k6M4k9o8K94j48j57k2O0J5K08l4j38Kj42L2M6M4j3m6l0K0O3l3Q0j40
$$ 167 262 99 110 104 73 171 145 189 160 92 386 238 81 59 119 134 342 308 170 172 30 62 108 152 139 93 63 83 146 113 193 53
5431E3J03M8k2j0k2r9K0QP2M2Pj4p0J4j03O5J43j78J09r3J56M9j07j3j16J73k9j15jN9RN4
$$ 53 156 204 182 172 150 51 71 79 151 193 200 186 116 130 27 92 235 57 166 73 229 278 171 158 42 215 186 71 70 129 138 192
5055A92p2l6mm3LJ24J55j57j17k1O5M7J58j25j56M3R4J0j03Kqj9R9P9n6j12J07M2p2K0K1p7
$$ 192 120 84 80 37 40 164 319 162 45 24 89 136 294 169 13 56 150 160 57 59 51 32 131 210 154 42 149 191 119 139 160 83
4679H3J06oK6Q4j05Q3O0j27j11o8L1K3M9N2nj3R6j06l5J9k0m7R6k8o8R3R3L2j08L7j49oNJ10
$$ 83 189 183 209 293 188 271 331 204 93 25 56 79 128 180 175 162 258 152 117 136 116 69 165 137 69 162 255 287 179 216 67 61 66 176
4280A76Q1q1K5o0n7J9J25p0n2j6l3K8J6K06n6k39J34nJnl3k5K2o1J7QJ45q7j5JP7q6%M5J09
$$ 176 257 176 201 141 84 103 228 158 106 90 57 85 101 307 251 12 146 141 142 137 104 79 101 40 57 65 210 123 108 109 186 100 100 145 254
3870B54r5Q5k11K01M3j95J03J30m8r8k7j17J25O8j25J7q4Q9L7rj7O0J48j53P5j14l0J14M0
$$ 254 159 244 33 234 277 82 185 315 267 169 142 25 150 218 93 110 26 115 152 143 126 186 334 181 256 142 112 226 266
3529B66p5R4j97L1J0j5M8j19J3K2o5M5RO9R8l2p8J3mj00K5J63j5r5r6J13J20p0j22J34R3L7
$$ 266 191 285 88 119 129 114 162 43 56 78 13 58 67 136 234 202 124 137 133 33 58 221 206 111 15 128 248 178 56 190 283 320
3154C20j57m9p5J04Lr1k9M8K0K35j9k62J04m5n0K04%j47ro1J18J01q4LN4j42L0K2k1q1L7J7
$$ 320 163 114 39 143 146 55 26 74 94 329 310 48 152 107 57 261 261 114 105 44 162 263 179 182 236 94 124 146 125 44 81 98
2778I8k2J30J7j68rK2J25j3j70N0M4M1Jo1L8o3J19l6J8o5J74l5%lj1o7k0O6r4L2Q4l4j30Q8
$$ 98 76 206 223 55 46 68 193 180 10 60 104 145 146 85 123 60 179 143 161 96 270 235 235 232 221 154 134 200 106 138 222 188 58 146
2379A46K5n3J01q5o9j7J4J02Q0j33l0K5n6P4O4m4q7K9k1J77j16m0Q4n6l6M7L1j19%J37n6o9
$$ 146 171 118 219 134 65 48 62 164 244 111 81 106 50 124 188 144 57 86 65 242 126 86 170 114 78 125 156 37 37 174 118 49
2003D9J2j1P7P2j53Q3j1K3J9J9L0j10l5R4j11Q1k6n3P8q3P4O5N0p9k1j4J22k3j12Q6oj02p
$$ 49 61 50 127 199 46 129 118 141 160 179 209 99 64 158 47 128 102 49 127 44 118 183 233 154 133 119 241 218 106 192 186 84 77
1616G7o3M2J3qK4k4k0J4jJ26j45J27jLp6ol5O0Q7K7j43j9k8J10n3J40l7p4Ro3J23j1j26J19
$$ 77 14 56 69 61 85 61 41 55 54 180 35 162 161 164 88 82 47 107 194 221 78 59 31 141 88 228 191 117 126 63 186 175 49 168
1217A68r1Q4L0N2j6p4J3q0N9o6J25r5N1J21N7j76l1n0J1k3m9J5k1J56K5j37R9k2m0L2o1L2
$$ 168 77 161 191 243 227 153 166 86 145 79 204 109 160 281 338 162 131 81 92 69 20 35 14 170 195 58 157 135 95 127 66 98
841I8J03j4k4JK3P7j5jr5p2NJ38Q0k55J64k7Lj38L3Op2J3K5K2J24J20q8j51j7N5l5J17j04
$$ 98 201 187 163 164 187 264 249 248 153 81 86 224 304 49 213 186 189 51 84 90 18 31 56 78 202 322 234 83 66 121 86 203 99
454I9P1n4m1O5q1J36O9r6j61J62k9Ql5mP1L7M8l9j11J00n3j13K1R3K8p3qP4Qj29P3P1jn5p1
$$ 99 170 116 75 140 59 195 264 168 7 169 140 148 113 109 180 217 265 226 115 215 162 49 70 163 191 118 110 184 192 63 136 207 206 151 80
43H0P9M6j9o9O0j71J44O7j01K9Q8r4q5N3L3l6l5J6J00q1
$$ 80 159 205 186 117 177 6 150 217 116 145 233 139 54 107 140 104 69 85 185 104
-192A04
##PAGE=	F1=-15329.3
##FIRST=	25164.767445380970457,	5806.2096540000038658,	0
##DATA TABLE=	(F2++(Y..Y)), PROFILE
5806A50J28j74oRk1N1j4N0m1j3K36j25j60J0M6MJ58m0o0k3j08O3RM4m5m2k0OR1o9R8r7J21
$$ 150 278 104 98 107 86 137 123 173 132 119 355 230 70 80 126 130 288 248 188 165 57 120 129 173 128 86 66 72 163 94 192 95 216
5419B16M0l7m9k1j33J04j02N8R2j4K3m3nj00J34Q8j63J17j09R8N9r4k8o0J30pp2r6J15l8M5
$$ 216 256 219 170 149 16 120 18 76 168 154 177 134 129 29 163 251 88 205 96 194 253 159 131 71 201 194 122 26 141 103 148
5055A48k3l7k0k4j6J19J30r9j48kP8mJ92j29j50L6Q6J3j06j9J4j2J14R2n2j16J06N5p9j4R
$$ 148 125 88 68 44 28 147 277 178 30 28 106 102 294 165 15 51 137 150 44 25 39 27 141 233 181 65 171 226 147 133 142
4691A42j7J13k6J3J9j32J13Q4j22j18m9N1mK4P2Nk2M4Qo0k5m1QQ4Qj22J53Q0M9j41j4j09J7
$$ 142 125 238 212 225 244 112 225 309 187 69 20 71 67 91 163 168 146 190 198 138 113 72 80 164 172 50 203 283 332 191 177 68 85
4304H5l3J35M1q2Q5q7r6O8J47n3p4j4ooJ6J58o9j42N4L2n0P8Jj32Mk7L2OJ06o2m6J4R9o2m8
$$ 85 52 187 228 146 231 144 48 116 263 210 136 122 116 110 126 284 215 73 127 159 109 187 188 56 60 33 65 71 177 115 69 83 182 120 72
3893G2Q4Q5j19P7j73J76N2j29P7J03l0r6j4j31J17K9q6j0o1L1M9K8m0J20J30j94J09j00m4
$$ 72 156 241 122 199 26 202 254 125 202 305 275 179 165 34 151 180 94 84 23 54 103 131 91 211 341 147 256 156 112
3553A12J62L6j76J22j67KjM1L0j33K0J7k8k8oJ57N0k6m7J0qr8J9J78Oj19q2J22J10j37l7R6
$$ 112 274 310 134 256 89 91 90 131 161 28 48 65 37 9 3 160 210 184 137 147 139 41 60 238 244 125 43 165 275 138 101 197
3177A97P4N1j31m7q4P0Jo8m0M0J6K15Nk56R1k6m6J86M1j34n1PN4L9p2L5L1r3M0N8j48J7KJ8
$$ 197 271 322 191 144 60 130 131 63 23 63 79 294 299 43 134 108 62 248 289 155 104 111 165 204 132 167 198 105 145 203 55 72 74 92
2778I2o0J36Q4k18N4O2O2k5j40O3n5P0k2m0N6o6J34l2j5m3J40j2M9J4m4p6m2J02j05j5P6k0
$$ 92 32 168 252 34 88 150 212 187 47 110 55 125 103 63 119 53 187 155 140 97 237 225 274 288 244 168 126 228 123 108 184 164
2402A64r7P7kn6P1j19JN5n8J40J04j61mJ5q2K7J26Qj26pnJ44j23o5R8j0jMro4jJ29o6m8Ol5
$$ 164 67 144 142 86 157 38 39 94 36 176 280 119 115 130 48 75 201 209 83 76 71 215 92 27 125 115 114 118 109 45 44 173 107 59 65 30
1980C0J15L0j40Q3l7M1M2K5K9j57j5P6n4N5K5p4Q4j24J17L1L6n9J4n6J39l1j21N7M3r7m9p
$$ 30 145 175 35 118 81 122 164 189 218 61 46 122 68 123 148 74 158 34 151 182 218 159 173 117 256 225 104 161 204 107 58 51
1604E1k0O4qj5J7m3K1K9J08j72J01M5n0p5KJ6m8J11M7n6n6JM7k8J19Oo4o0k8J18m6r9J18r8
$$ 51 31 95 87 72 89 46 67 96 204 32 133 178 128 53 55 71 23 134 181 125 69 70 117 89 208 214 150 90 62 180 134 35 153 55
1205E5J51l7L5Nl2M2j41J11q0J49j42P0Q5Qj25n6j1K6o5LqMP3P0j05M7mr8P3l5O4M3j5k2M8
$$ 55 206 169 204 209 177 219 78 189 109 258 116 186 271 279 154 98 87 113 48 51 43 47 120 190 85 132 128 30 103 68 132 175 160 138 186
794A86J7N7Rk4r9o2NJ31K9k00J90r5M8j36J0L6k6l5N8l7R0J33m3j39j3L3kQ9j78J18m1p8O5
$$ 186 203 260 269 245 146 84 89 220 249 49 239 144 192 56 66 102 76 41 99 62 152 285 242 103 90 123 121 210 32 150 109 31 96
407I6n0J58O0q6j17J23r2N0nk7L1R2L8l2r8J10r5j07L1J03J9j20j3J01Kj21Q3O7L7j28l7J35
$$ 96 46 204 264 178 61 184 92 142 137 110 141 233 271 239 141 251 156 49 80 183 202 82 69 170 172 51 134 201 238 110 73 208
31B08Kl7m7N2j67J62N1j47J32O6j16j08M5K2j7l0LR7o3
$$ 208 210 173 126 178 11 173 224 77 209 275 159 51 96 118 101 71 74 171 108
-192A08
##PAGE=	F1=-15431.6
##FIRST=	25164.767445380970457,	5806.2096540000038658,	0
##DATA TABLE=	(F2++(Y..Y)), PROFILE
5806A09J64j67j7K1rRj4N8n8P8J36j17j06QL3jR5n4L7n8l3M4k1O7r5l4k2LJ09q6R9m7J32J7
$$ 109 273 106 89 110 101 110 96 154 96 174 310 193 87 95 128 127 222 168 205 147 114 158 137 204 109 75 53 56 165 79 178 131 263 280
5407B80n7o8kr8J19q9p2J40l9N2oj9o4J41M4j27J11j12K3N6p1l4j3R7j3rq4O6q8K9L5m4k2
$$ 280 223 155 153 55 174 85 13 153 114 166 160 141 77 218 262 135 246 134 157 213 142 108 95 192 179 170 86 152 64 93 128 84 62
5020F2Mj9O9J08m1j28LO8o4K29j38j23J4Q7Qr1m2M4j8J31R4o5j07J20L4p9k5mL8J13o4j4l0
$$ 62 66 47 116 224 183 55 58 126 62 291 153 30 44 131 139 48 6 50 32 163 257 192 85 205 239 160 135 131 169 282 218 204 174
4632A74j45J54P8j19r5nK2j4LQ4K1j7k5J25o4q6l6L5P8M5j78K02P3M5j68n3m3K7p6J36%n5
$$ 174 29 183 261 142 47 42 64 50 53 137 158 141 116 241 177 91 55 90 168 213 35 237 310 355 187 134 91 118 42 178 178 123
4257A23J17q5l5K2J60m2j03qK7l0%J19r1l7m5P5j06J60L7k13Lk1O0PL8m4o6K1J30l7p4J13
$$ 123 240 155 120 142 302 260 157 149 176 146 146 265 174 137 92 167 61 221 258 45 48 27 87 94 132 88 22 43 173 136 62 175
3881A75M8j57Q9j25J23O9o0N7L0Oo7nj33Q3nn2Nm8K1J09j9q6J57R8k09J47q8n7J97K9k58J50
$$ 175 223 66 155 30 153 222 162 219 249 255 188 183 50 133 128 76 81 33 54 163 144 58 215 313 104 251 163 106 303 332 74 224
3506B24j26k9j8J13qj41K7J5LJ8j6J11J0k3j4k1ko7KJ62M5j22q6J29Q9j82K6P6L4P5j05l6
$$ 224 98 69 51 164 156 15 42 57 60 78 62 173 183 160 146 125 123 56 58 220 265 143 57 186 275 93 119 195 229 304 199 163
3130A63q9M2k0m0j9J2J6J85J9k38R5Kp0J59O9j17r5J04km2j7L4Qn5N3J01k37P6k2Qo2R9J38
$$ 163 74 116 96 56 37 49 65 250 269 31 126 128 58 217 286 169 74 178 176 134 117 151 159 104 157 258 21 97 75 83 21 120 258
2743B58k04J06O5k5l7j06P9j16Q5m6j1N3m3J15k4m2rR4%R3L6p7o6p2J19q8l2M9k9o2P2k5J9
$$ 258 54 160 225 200 163 57 136 20 105 59 48 101 58 173 149 107 98 192 192 285 321 244 178 106 225 137 105 154 125 63 135 110 129
2355A29Rp2m8J24j32J90P0j57J8Rj05N3J36K8j19o2K9R0j26j2J7P3kk8n6j8M2J04p9m4ppJ21
$$ 129 138 66 18 142 10 200 270 113 131 140 35 88 224 252 133 71 100 190 64 52 69 142 140 112 56 38 80 184 105 61 54 47 168
1968A68k4r8O7o1O6K0M7K6j39j4M8J8k3P0q7Q9r1J00qlk1L7r2J97n4j35J8R8p6r9O0r1J09
$$ 168 144 46 113 52 118 138 185 211 72 58 106 124 101 171 84 173 82 182 174 171 150 187 95 292 238 103 121 219 143 44 104 13 122
1581A22j9n1M8l7K6L3O7j65O9R2p6o4J1M7m7RO8M1r1J1mj4Q7N5n0j21P3N3j03JN3k3J52j15
$$ 122 103 52 100 63 89 122 189 24 93 185 109 45 56 103 56 65 133 174 83 94 90 76 163 218 168 47 120 173 70 71 124 101 253 138
1182A38K2L4%N3j73J57r1J46j65P8L8k9o2q5J8L6q8L0qM8m7J27o4%J1r6N6k6Q6k4jmQ7LL5
$$ 138 160 194 194 247 74 231 140 286 121 199 237 208 146 61 79 115 27 57 49 97 50 177 113 113 124 28 84 58 144 120 119 115 202 205 240
771B40L3m0o7p1J0R7j8p8J50j58Q9j21mL0L2o4P1q0N7J50kj09Ml6L5O0j73R8m8l4j1K7J22
$$ 240 273 233 166 95 105 202 184 106 256 98 187 66 62 92 124 60 131 51 108 258 256 147 151 115 150 210 37 135 87 53 42 69 191
383A91N2o3n3O9j55R5K1o2mJ36J4j6o6J05j20p1L1P8Pj20k9R6O0j32O9O4M2j74rJ89l9n0q
$$ 191 243 180 127 196 41 136 157 95 91 227 241 225 159 264 144 73 104 182 189 69 40 136 196 64 133 197 239 65 56 245 206 156 148
-4A48K0j51J68L3j25J64M4j28j20RL6Rk4k1Q0l0
$$ 148 168 17 185 218 93 257 301 173 53 62 98 107 83 62 142 112
-192A12
##PAGE=	F1=-15533.9
##FIRST=	25164.767445380970457,	5806.2096540000038658,	0
##DATA TABLE=	(F2++(Y..Y)), PROFILE
5806D9K00j45qK1j4Ll2Q1r7J77L3j33k2j0J3RL4p0J23q6L1J1l9J02j33l4j7oJ14q9Q8NJ34
$$ 49 249 104 96 117 103 106 74 155 58 235 268 135 113 103 116 125 159 89 212 126 157 168 129 231 98 64 47 41 155 66 154 159 293
5419B93k2p6o2K3m9J11p5n3N2n9O6L8po4J34J6r4R2r2m7M8m6l7K5P9n0O5m5rq3k2Q2o1J2J0
$$ 293 271 195 133 156 107 218 143 90 142 83 149 187 180 116 250 266 172 264 172 125 173 127 90 115 194 144 209 164 155 72 50 132 71 83 93
5008I3m1K2R1J2q8MN1j21K58j40q4j7J05j2p3l1M2l3J44Q9q6p9J33j1p0j9j2P1J11j07m4n9
$$ 93 52 74 165 177 89 93 144 23 281 141 57 40 145 133 60 29 71 38 182 271 185 106 239 228 158 139 127 198 309 202 158 99
4632I9m2J08L2j16m3L3k8j7nR4L4%j00K23n1j43K8rP2Q0j87J99O5K9j83p0PN6j05Q9l6RJ16
$$ 99 57 165 197 81 38 71 43 26 21 115 149 149 49 272 221 78 106 97 169 249 62 261 326 355 172 102 109 165 60 149 113 122 238
4245B38o7K1j5J41l2j23NN3l8l5J05j19N2j30J07j22J82O4k35K2m3Q3J5m0l1j0k0J26j8n5
$$ 238 171 192 177 318 286 163 168 221 183 148 253 134 186 56 163 41 223 287 52 74 31 114 129 89 58 48 28 154 136 81
3893H1J17Oj83J02n0K9Q1JN5o8M4j9mj05J3J4o5M6n1K4J52n6j00J38N1j87J72p4p0K13K3k99
$$ 81 198 204 21 123 73 102 183 184 239 171 215 196 192 87 100 114 49 95 44 68 220 164 64 202 253 66 238 164 94 307 330 31
3517C1J65q9l7m3J72n9j01J0OK5O5l8N9nk7K5p6J6l6JJ08R1r9j13J37O2j81M3O8j7J05q3k1
$$ 31 196 107 70 27 199 140 39 49 55 80 145 107 166 161 134 159 83 99 63 64 172 263 164 51 188 250 69 112 180 163 268 185 164
3130A64r2M3p3Rj3j8M6J39K6k10J19J6j07J27O8r5j24K13m3j32Q4j0j2n0R2J36k10K1l1j0
$$ 164 72 115 42 51 38 20 66 205 231 21 140 156 49 176 244 149 25 238 195 63 147 137 125 75 167 303 93 114 83 73
2778G3k9L0J73j74J51M8r9m2o8O9j13P3o8L4L2nM3ll9J6L6jJ23O0j05l6j06J11m8jJ5o5l6
$$ 73 44 74 247 73 224 272 173 131 63 132 19 92 24 58 90 85 128 125 86 102 138 137 260 320 215 179 73 184 136 135 150 85 49
2391D9P5m2J07m2j9j13J72j59K00j0j24L2J2r3J14Q2K0q4j08P6K8j25O7r0J46j5m9r4J3R3
$$ 49 124 82 189 147 128 15 187 28 228 218 94 126 138 45 159 241 261 177 69 145 173 48 115 25 171 156 107 13 26 119
2038A19Q6q7n0l9L9J24q9l1L3p0Q3k4P3K1q4m6N9P3j02P6r2J05m3N7l7n2M4K5r3K56q5j36
$$ 119 205 118 68 29 68 192 103 72 105 35 118 94 167 188 104 58 117 190 88 164 72 177 134 191 154 102 146 171 78 334 249 113
1663A13k3J38m8j19R7j51J34n1m8N1QJ4PJ2o9j2J24p2m3M3K8k2q5Q7J05j24%l0j4N5R7l8j42
$$ 113 90 228 180 61 158 7 141 90 42 93 101 115 122 134 65 53 177 105 62 105 133 111 26 113 218 94 94 64 50 105 202 164 22
1276B2J68j9j65J12l4Q1J12j74J9O7NM9j70J88j02J26j66P2lm9%o6lL1q6K6J8P8j12J42l5
$$ 22 190 171 6 118 84 165 277 103 122 189 194 243 73 261 159 285 119 191 188 139 139 73 70 101 15 41 59 137 25 167 132
912A32l4J6o1K6l7Q5p9N4NR3pK0M6k7j9j00QO2o9L3J21k05J07q6qj2R1o1N3q7K5J36K2n1L4
$$ 132 98 114 53 79 42 127 48 102 107 200 193 213 259 232 213 113 121 183 114 147 268 63 170 84 76 64 155 94 147 60 85 221 243 192 226
501B26r8L9K7j02N3q8M6n1N7N6M2l5OK8j64Q7M0j03nJ44k1Lk3Q7j27j0J0M0j1p4m5N9J50j52
$$ 226 128 167 194 92 145 57 103 52 109 165 207 172 178 206 42 129 169 66 61 205 184 187 164 251 124 114 124 164 153 79 34 93 243 91
102I1M5O9Mj78J6K08n7n3J8j5j17J54K1o1J41J7j23j05o6R3J9j4o0N9J6
$$ 91 136 205 209 31 47 255 198 145 163 148 31 185 206 145 286 303 180 75 9 102 121 107 47 106 122
-192A22
##PAGE=	F1=-15636.1
##FIRST=	25164.767445380970457,	5806.2096540000038658,	0
##DATA TABLE=	(F2++(Y..Y)), PROFILE
5806B5J91j13RJ1k9K6m8J06j49K55m0j70N8k2k4M0j1n5J46r6O6k5m5J35j27n7Qk3R7q5O8N6
$$ 25 216 103 112 123 94 120 72 178 29 284 244 74 132 110 86 126 115 60 206 110 176 151 106 241 114 57 65 42 139 54 122 178
5431A78J26p1q6l7M0jR3p6k5j6o0O0P4K9q7J20jo4M9m8r2M0k6m1N3P1j03J35pp6m6m1P9r2
$$ 178 304 233 147 110 150 149 242 166 141 125 65 125 199 228 141 261 260 196 245 197 105 145 119 78 131 202 99 234 227 151 105 64 143 51
5032E1O5mo5j3P4N7n1J2K2j38K47j23l8l1J12m2p1k3M7m5J42Q0r9l4J30o2m8j4j1P8J07j38
$$ 51 116 112 47 34 108 165 114 126 148 10 257 134 96 65 177 135 64 41 88 43 185 265 166 132 262 200 152 138 127 205 312 174
4656A74o1p6Q7M5l1r1j3O3m8m2J3Q7L6K0j39K63k9j78O9n3O6J06j64J63N7J2j73p1J8J08j11
$$ 174 113 37 124 169 138 47 34 97 49 7 20 107 143 163 24 287 258 80 149 96 162 268 104 267 324 336 163 92 110 218 107
4292A07lo6J13Q5n3N4k0Q2k3j27K7P1l9p9J20j48J07j73J14o1J00P8k06M3m8Q6L6j00j3L6
$$ 107 104 38 151 236 183 237 217 299 276 149 176 247 208 129 249 101 208 35 149 88 188 266 60 103 55 141 177 77 64 100
3940A00k2N0rlJ04l7j16L9K0k9M1N1P1j25L5L3j0n9p4R9j11O7o6J7J80n2q5P1oj10J53o0q4
$$ 100 78 128 119 116 220 183 67 106 126 97 138 189 260 135 170 203 193 134 60 159 48 115 49 66 246 194 109 180 174 64 217 157 73
3553G3K16J6k74J37o3j3n4J88r8k5m0jM3Q7o4J3Pl8O8j31L8k9L1J9J30n2j54J40L8j31J6O4
$$ 73 289 305 31 168 105 92 38 226 128 103 63 62 105 192 128 141 148 110 178 47 85 56 87 106 236 184 30 170 208 77 93 157
3177A57p2J35o2j3r0P6q8L4m9KN3Q0L1j79J51J3j28Q3L6o3m6K25o1k07J71o4k8p8J66J48j75
$$ 157 85 220 158 145 55 131 43 77 28 30 83 163 194 15 166 179 51 134 170 107 61 286 225 18 189 125 97 19 185 333 158
2813A58l3l3l3Pj5J79j54J93J9j28j7n5J5l7K6q8O9L0L5p3K2J7Jj8j0J28P7j28J4j25O9MN6
$$ 158 125 92 59 66 51 230 76 269 288 160 143 88 103 66 92 4 73 103 138 65 87 104 105 87 77 205 282 154 168 43 112 116 172
2426A72lj10k3P6l7J57q2Mj21J95j83K06j05p8L5K7l3J35Lml4j18J12l6j08J14j16J40k2o0
$$ 172 169 59 36 112 75 232 150 154 33 228 45 251 146 68 103 130 97 232 235 231 197 79 191 155 47 161 45 185 163 103
2074A03p2KJ22P3q7l9p1N8J20j55M8j5o2Q3k7N8J3k9r3J13J03j36K2q7J33K%n7q5J15k6j4
$$ 103 31 33 155 228 141 102 31 89 209 54 102 87 25 108 81 139 152 123 30 143 246 110 132 45 178 180 180 123 38 153 127 113
1698A13K53j12j19m9J41j5j25J20j70J08r6J6J0Q2j6m3m8P0o0J01m6j9O2mj6o4P3J04j53k4
$$ 113 366 254 135 86 227 212 87 207 37 145 49 65 75 157 141 98 50 120 60 161 115 96 158 154 138 74 147 251 98 74
1346G4k8qJ7J14k5n1J61p8r6P5j22J74N5j95L1R4j6L3j34K00j13R6j49M7k2n2N5om4ml1rL0
$$ 74 46 38 55 169 144 93 254 176 80 155 33 207 262 67 98 192 176 209 75 275 162 258 109 156 134 82 137 131 87 83 52 43 73
959G3Q4o6P7l2n7J2m3L2n6O1n8J11k4O0pK3L5K6J5j32JL5j22J24J03k20R0l8no9J37l3Ro5
$$ 73 157 91 168 136 79 91 48 80 24 85 27 138 114 174 167 190 225 251 266 134 135 170 48 172 275 55 145 107 102 33 170 137 146 81
560H1nQ9L3K9P0j14j1j1k7N1j37R4l8M9jJ1pM5J1j38M5N3j34M4R6o1J6J8O1j11N7k5J1m5J
$$ 81 76 165 198 227 297 183 172 161 134 185 48 142 104 153 152 163 156 201 212 74 119 172 38 82 178 117 133 151 212 101 158 133 144 99 100
149A00m7J4K13j59J9Q4o6j25L6J69m2n3K1l9p3J23J7PJ01k2r6p1o1Q0%Mj03L9O6
$$ 100 53 67 280 121 140 224 158 33 69 238 196 143 164 125 52 175 192 199 300 278 182 111 50 130 130 134 31 70 136
-192A36
##PAGE=	F1=-15738.4
##FIRST=	25164.767445380970457,	5806.2096540000038658,	0
##DATA TABLE=	(F2++(Y..Y)), PROFILE
5806H3R9p8K1Km3M6m5J13j61K74o8j82Q2k3p0P9l5LQ7q6O7m5m3J54q5q6K6l4P2q1M0J01J09
$$ 83 182 104 125 127 84 130 85 198 37 311 243 61 143 120 50 129 94 97 184 98 165 120 77 231 146 60 86 52 124 43 83 184 293
5419B93j07p7j4L5M5O3q5Jn7l5L5Q9P2j06R9rl1k1J2j00K9j2m2O3O7j52J84K5j21k3k3P1j22
$$ 293 186 109 95 130 175 238 153 154 97 62 97 186 258 152 251 242 211 190 202 102 131 119 77 140 207 55 239 264 143 120 97 168 46
5032D6R0k4n8j1K1Q4k5K9j8j00J82q8J2l1J09p0r5j1N3m9J24O7r1J5J03r9j5k1mO2J06j42
$$ 46 136 112 54 43 64 148 123 152 134 34 216 128 140 109 218 148 53 42 95 46 170 237 146 161 264 165 150 129 125 187 293 151
4656A51m5p6J44Qp5j5o3Q7k1n9JP9K3K9j17K32lj87O3p9P1J11j24J19M6Qj38p8jJ70j00j12
$$ 151 106 30 174 182 107 92 29 116 95 36 37 116 139 168 51 283 280 93 156 77 148 259 135 254 300 308 170 92 91 261 161 49
4280D9j5J59M7n7O6Qok2j09N2P8l6j23J57j66J15j71J00J4j6P8j44O7k9O8O5j25lL6j6j5j4
$$ 49 34 193 240 183 249 257 251 229 120 172 250 214 91 248 82 197 26 126 140 124 202 58 125 96 164 229 104 101 137 121 106 92
3905I2O2P9p3n3j0P7k7n5Q5R8r1m8P0j9rj32J63j30N7q8L1J70oq1J0o5pR1n0r8K17Nk27J00
$$ 92 154 233 160 107 97 174 147 92 177 275 184 136 206 187 178 46 209 79 136 48 79 249 243 162 172 107 100 191 141 43 260 265 38 138
3506A38n4L9p0J90r0K8j04KN6Q0r5j6M2n9J08j40L2n6Q4n2J33Kj79J20J8o0j9O6j32J62m2
$$ 138 84 123 53 243 153 181 77 79 135 215 120 104 146 87 195 55 87 31 115 63 196 198 19 139 157 97 78 144 12 174 132
3142A32k3o0J07l9%q8O1J5K4K8j43J71Nj18K7j4j8N6J98n8j84J37j02l1l3J60J34j32p8l7
$$ 132 109 49 156 117 117 29 90 105 129 157 14 185 190 72 99 85 67 123 321 263 79 216 114 83 50 210 344 212 134 97
2790I7n7M7l6J64j53K29j1j03K4q4n5N8j9p8N1N6P6j30k5R4l8m5QP0P8j47P4r0k0M5J15jj41
$$ 97 40 87 51 215 62 291 280 177 201 117 62 120 101 23 74 130 206 76 51 145 107 62 70 140 218 71 145 55 35 80 195 194 53
2402E3j1N4JJ54j17J0q3K03k17K16j65n3K3O2L0J23q5l1K2p5J14r7p9J29j10J07j4o3n5J3
$$ 53 42 96 97 251 134 144 61 264 47 263 98 45 68 130 160 283 198 167 189 114 228 131 52 181 71 178 164 101 46 59
2050E9J24O5q1j4q2M1J02k01J21p7l4O6N0l4MRr4J46J10j34o3o8J66L2n0o8j0P8r1J10J94
$$ 59 183 248 167 153 71 112 214 13 134 57 23 89 139 105 109 118 24 170 280 146 83 15 181 213 163 95 85 163 72 182 376
1686C76j27q7n8J12J7j24J42j82O5j21R3m9J64n6j06j4J22n9L8rjO2l6k0k7P9P1j71m7nK4
$$ 376 249 162 104 216 233 109 251 69 134 13 106 57 221 165 59 45 167 108 146 137 136 198 162 142 115 194 265 94 47 42 66
1322F6k6Q9j2N8J28j19n0L9j51J87pj64N1J11n6J4p4J91j26O4j15lj0l9R4N2o1n2K8j0j1P1
$$ 66 40 129 117 175 303 184 134 173 22 209 202 38 89 200 144 158 84 275 149 213 98 95 85 46 140 192 131 79 107 97 86 157
947A57j8M0n4p6Nl3N3o6L2N0R4o0NJM6nJ14J9j51JRj40J68Q7k15N4J4kp5J19Om6l2l4L4L8
$$ 157 139 179 125 49 54 21 74 8 40 90 184 124 129 130 176 171 285 304 153 154 163 23 191 278 63 117 131 129 54 173 179 133 101 67 101 139
524A39J03J05r1q4n3M5O9j52Q9l0N3k1n5L2M2K1j17OO6j29P2M4r2J6M3L8p9J14o4J6j03P9
$$ 139 242 347 256 172 119 164 233 81 170 140 193 172 117 149 191 212 95 101 167 38 110 154 62 78 121 159 80 194 130 146 43 122
149A22m7KK15j40j2J05j34n3M5J00Lo3Mm2l7Q8J8O2O2o6n1l7m3N7l2K7j25J2J09
$$ 122 75 77 292 152 140 245 111 58 103 203 206 143 147 105 68 156 174 236 298 232 181 144 101 158 126 153 28 40 149
$$ [...]
-192A99
##END NTUPLES=	nD NMR SPECTRUM
##END=	
##END=	
