##TITLE=	Jan24-2022.72.ser
TM-VI-252, Na+Ph-pyr hsqc
##JCAMP-DX=	6.0	$$ MestReNova 14.3.0-30573
##DATA TYPE=	LINK
##BLOCK_ID=	1
##BLOCKS=	2    
##ORIGIN=	Mestrelab Research S.L.
##OWNER=	hrzepa
##$MNOVA/LINK_BLOCK_TYPE=	ITEM	$$ NMR Spectrum
##$MNOVA/ITEM/POLYGON=	(XY..XY)
5321,5835
8722,5835
8722,8208
5321,8208
5321,5835
##$MNOVA/ITEM/Z=	0
##$MNOVA/ITEM/ANGLE=	0
##TITLE=	Jan24-2022.72.ser
##JCAMP-DX=	6.0	$$ MestReNova 14.3.0-30573
##BLOCK_ID=	2
##DATA TYPE=	MNOVA NMR VIEW DATA
##DATA CLASS=	MNOVA VIEW DATA
##$MNOVA/2D/THRESHOLD=	1.6030676364898681641
##$MNOVA/ITEM/ZOOM/X=	-0.57569417574404480042,	10.597559643135086915
##$MNOVA/ITEM/ZOOM/Y=	-9.5463928198744607556,	230.01759208461857042
##END=	
##TITLE=	Jan24-2022.72.ser
##JCAMP-DX=	6.0	$$ MestReNova 14.3.0-30573
##BLOCK_ID=	3
##DATA TYPE=	nD NMR SPECTRUM
##DATA CLASS=	NTUPLES
##NUMDIM=	2
##ORIGIN=	Bruker BioSpin GmbH
##OWNER=	nmr
##.OBSERVE FREQUENCY=	400.20200099999999566
##.OBSERVE NUCLEUS=	^1H
##.SOLVENT NAME=	MeOD
##.PULSE SEQUENCE=	hsqcetgpsi2.ph
##LONGDATE=	2022/01/24 18:16:00.000
##.ACQUISITIONMODE=	SIMULTANEOUS (DQD)
##$ORIGINAL FORMAT=	Bruker XWIN-NMR
##$MNOVA/SCALES_VERSION=	9
##$PARAMETER FILE=	(acqu2s, ASCII, //ch-nmrserv3.ch.ic.ac.uk/Av400C/agmb/nmr/Jan24-2022/72/acqu2s, 0)
$$ ##TITLE= Parameter file, TOPSPIN		Version 3.2
$$ ##JCAMPDX= 5.0
$$ ##DATATYPE= Parameter Values
$$ ##NPOINTS= 241	$$ modification sequence number
$$ ##ORIGIN= Bruker BioSpin GmbH
$$ ##OWNER= nmr
$$ $$ 2022-01-24 18:25:44.008 +0000  nmr@CZC2439F63
$$ $$ /opt/topspin/data/agmb/nmr/Jan24-2022/72/acqu2s
$$ $$ process /opt/topspin3.2/prog/mod/go
$$ ##$ACQT0= 0
$$ ##$BF1= 100.63037
$$ ##$FnMODE= 6
$$ ##$NUC1= <13C>
$$ ##$NusJSP= 0
$$ ##$NusT2= 1
$$ ##$NusTD= 240
$$ ##$O1= 11069.4607123918
$$ ##$SFO1= 100.641439460712
$$ ##$SW= 240.006397974962
$$ ##$SW_h= 24154.5893719807
$$ ##$TD= 240
$$ ##END=
$$ 
##$PARAMETER FILE=	(acqus, ASCII, //ch-nmrserv3.ch.ic.ac.uk/Av400C/agmb/nmr/Jan24-2022/72/acqus, 0)
$$ ##TITLE= Parameter file, TOPSPIN		Version 3.2
$$ ##JCAMPDX= 5.0
$$ ##DATATYPE= Parameter Values
$$ ##NPOINTS= 12	$$ modification sequence number
$$ ##ORIGIN= Bruker BioSpin GmbH
$$ ##OWNER= nmr
$$ $$ 2022-01-24 18:25:47.515 +0000  nmr@CZC2439F63
$$ $$ /opt/topspin/data/agmb/nmr/Jan24-2022/72/acqus
$$ $$ process /opt/topspin3.2/prog/mod/shimcntl
$$ ##$ACQT0= 1000000
$$ ##$AMP= (0..31)
$$ 100 100 100 100 100 100 100 100 100 100 100 100 100 100 100 100 100 100
$$ 100 100 100 100 100 100 100 100 100 100 100 100 100 100
$$ ##$AMPCOIL= (0..19)
$$ 0 0 0 0 0 0 0 0 0 0 0 0 0 0 0 0 0 0 0 0
$$ ##$ANAVPT= -1
$$ ##$AQSEQ= 0
$$ ##$AQ_mod= 3
$$ ##$AUNM= <au_zg>
$$ ##$AUTOPOS= <52 >
$$ ##$BF1= 400.2
$$ ##$BF2= 100.63037
$$ ##$BF3= 400.2
$$ ##$BF4= 400.2
$$ ##$BF5= 400.2
$$ ##$BF6= 400.2
$$ ##$BF7= 400.2
$$ ##$BF8= 400.2
$$ ##$BYTORDA= 0
$$ ##$CAGPARS= (0..11)
$$ 0 0 0 0 0 0 0 0 0 0 0 0
$$ ##$CFDGTYP= 0
$$ ##$CFRGTYP= 9
$$ ##$CHEMSTR= <none>
$$ ##$CNST= (0..63)
$$ 1 1 145 1 1 1 1 1 1 1 1 1 1 1 1 1 1 1 1 1 1 80 30 20 1 1 1 1 1 1 1 1 1
$$ [...]
$$ 0 0 0 0
$$ ##$ShimPowMaxUC= (0..63)
$$ 130000 130000 130000 130000 130000 130000 130000 130000 130000 130000 130000
$$ 130000 130000 130000 130000 130000 130000 130000 130000 130000 0 0 0 0
$$ 0 0 0 0 0 0 0 0 0 0 0 0 0 0 0 0 0 0 0 0 0 0 0 0 0 0 0 0 0 0 0 0 0 0 0 0
$$ 0 0 0 0
$$ ##$ShimPowMaxUG= (0..63)
$$ 524287 524287 524287 524287 524287 524287 524287 524287 524287 524287 524287
$$ 524287 524287 524287 524287 524287 524287 524287 524287 524287 0 0 0 0
$$ 0 0 0 0 0 0 0 0 0 0 0 0 0 0 0 0 0 0 0 0 0 0 0 0 0 0 0 0 0 0 0 0 0 0 0 0
$$ 0 0 0 0
$$ ##$ShimPowRcbType= 3
$$ ##$ShimPowRes= (0..63)
$$ 1e-20 1e-20 1e-20 1e-20 1e-20 1e-20 1e-20 1e-20 1e-20 1e-20 1e-20 1e-20
$$ 1e-20 1e-20 1e-20 1e-20 1e-20 1e-20 1e-20 1e-20 0 0 0 0 0 0 0 0 0 0 0 0
$$ 0 0 0 0 0 0 0 0 0 0 0 0 0 0 0 0 0 0 0 0 0 0 0 0 0 0 0 0 0 0 0 0
$$ ##$ShimPowRng0= (0..63)
$$ 1 1 1 1 1 1 1 1 1 1 1 1 1 1 1 1 1 1 1 1 0 0 0 0 0 0 0 0 0 0 0 0 0 0 0 0
$$ 0 0 0 0 0 0 0 0 0 0 0 0 0 0 0 0 0 0 0 0 0 0 0 0 0 0 0 0
$$ ##$ShimPowRng1= (0..63)
$$ 1 1 1 1 1 1 1 1 1 1 1 1 1 1 1 1 1 1 1 1 0 0 0 0 0 0 0 0 0 0 0 0 0 0 0 0
$$ 0 0 0 0 0 0 0 0 0 0 0 0 0 0 0 0 0 0 0 0 0 0 0 0 0 0 0 0
$$ ##$ShimPowRng2= (0..63)
$$ 1 1 1 1 1 1 1 1 1 1 1 1 1 1 1 1 1 1 1 1 0 0 0 0 0 0 0 0 0 0 0 0 0 0 0 0
$$ 0 0 0 0 0 0 0 0 0 0 0 0 0 0 0 0 0 0 0 0 0 0 0 0 0 0 0 0
$$ ##$ShimPowRng3= (0..63)
$$ 1 1 1 1 1 1 1 1 1 1 1 1 1 1 1 1 1 1 1 1 0 0 0 0 0 0 0 0 0 0 0 0 0 0 0 0
$$ 0 0 0 0 0 0 0 0 0 0 0 0 0 0 0 0 0 0 0 0 0 0 0 0 0 0 0 0
$$ ##$ShimSysFunc= (0..63)
$$ 1 2 3 4 5 7 9 11 15 16 8 10 12 14 6 17 13 18 19 20 0 0 0 0 0 0 0 0 0 0
$$ 0 0 0 0 0 0 0 0 0 0 0 0 0 0 0 0 0 0 0 0 0 0 0 0 0 0 0 0 0 0 0 0 0 0
$$ ##$ShimSysMatrix= 0
$$ ##$ShimSysType= 1
$$ ##$TFXNUM= 0
$$ ##$TRIPLO2= 0
$$ ##$VTU= 2
$$ ##$VTUETH= <149.236.99.20>
$$ ##$VTUTY= <no>
$$ ##$WBREFAM= (0..15)
$$ 135.5 97.7 100 100 100 100 100 100 100 100 100 100 100 100 100 100
$$ ##$WBREFLM= (0..15)
$$ 0 0 0 0 0 0 0 0 0 0 0 0 0 0 0 0
$$ ##$WBREFPH= (0..15)
$$ 72.26 -67.22 0 0 0 0 0 0 0 0 0 0 0 0 0 0
$$ ##$WBSGU= (0..15)
$$ 0 0 0 0 0 0 0 0 0 0 0 0 0 0 0 0
$$ ##$XFAC= 2
$$ ##END=
$$ 
##$DECIM=	4464
##$DSPFVS=	20
##.ACQUISITIONSCHEME=	ECHO-ANTIECHO
##NTUPLES=	nD NMR SPECTRUM
##VAR_NAME=	FREQUENCY1,	FREQUENCY2,	SPECTRUM
##SYMBOL=	F1,	F2,	Y
##.NUCLEUS=	13C,	1H
##.OBSERVE FREQUENCY=	100.64143946071199309,	400.20200099999999566
##VAR_TYPE=	INDEPENDENT,	INDEPENDENT,	DEPENDENT
##VAR_FORM=	AFFN,	AFFN,	ASDF
##VAR_DIM=	512,	512,	262144
##UNITS=	HZ,	HZ,	ARBITRARY UNITS
##FIRST=	23146.755397984237788,	4241.1433691826614449,	0.13899683952331542969
##LAST=	-960.65704162931024257,	-230.39280913276670049,	0.22474622726440429688
##MIN=	-960.65704162931024257,	-230.39280913276670049,	-1.5447510480880737305
##MAX=	23146.755397984237788,	4241.1433691826614449,	46.474822998046875
##FACTOR=	1,	1,	0.0046310753543016098741
##PAGE=	F1=23146.8
##FIRST=	23146.755397984237788,	4241.1433691826614449,	0.13899683952331542969
##DATA TABLE=	(F2++(Y..Y)), PROFILE
$$ [...]
##PAGE=	F1=13192.4
##FIRST=	23146.755397984237788,	4241.1433691826614449,	0.0062501430511474609375
##DATA TABLE=	(F2++(Y..Y)), PROFILE
4241AL1m5N4k6pj5nK6Kj69J78J01q8N4j37R6rj3j9j0M1n7p0K6L0m4R4l%m6Q6M6r0J2pj09J35
$$ 1 32 -13 41 15 8 -7 -12 14 16 -153 25 126 38 92 -45 51 42 29 10 0 41 -16 -86 -60 -30 -74 20 17 17 -29 57 103 13 25 18 -91 44
3917D4j71M6J42l6l6pJ43j76K8r2O2J22j76QJ06j08Q6p9P3O0m7N7l5OJ0J2N5j00K19j75j16
$$ 44 -127 -81 61 25 -11 -18 125 -51 -23 -115 -53 69 -107 -99 7 -101 -15 -94 -21 39 -8 49 14 20 30 42 97 -3 216 41 -75
3646g5Q6J36j21m5N6J03j04j35N1K52j61J1Nnj77N4L0Q0j30J02Q8q0j8m7J45p5Mj6J7p5L3
$$ -75 11 147 26 -19 37 140 36 -99 -48 204 43 54 59 54 -123 -69 -39 41 -89 13 101 21 3 -44 101 26 30 14 31 -44 -11
3375a1o7n8J36j1r6O2k25K87M7j12J68p9m4n2j35J99P7j5q5k7J03J1m2O8l4L6q1j8j45J21
$$ -11 -78 -136 0 -11 -107 -45 -270 17 64 -48 120 41 -3 -55 -190 9 86 71 -14 -41 62 73 31 99 65 101 20 2 -143 -22
3112b2L3L4p6Mk7K6j6o7L5J21j34P5o0J16p4M8L1j18Q5r8L9M9J9R7j14M6j15J39k0k01J42
$$ -22 11 45 -31 -27 -54 -28 -44 -111 -76 45 -89 -14 -74 42 -32 16 47 -71 14 -84 -45 4 23 120 6 52 -63 76 56 -145 -3
2841cJ19j05R5j22P8M2n5L7n5j32jr9J61J34j63J22j07%O4L2jqq9J21k16R0J4O9L6n5nL3j58
$$ -3 116 11 106 -16 62 104 49 86 31 -101 -102 -201 -40 94 -69 53 -54 -54 10 42 41 33 -56 65 -151 -61 -47 22 58 3 -2 31 -127
2552a27N6P6M2J4O5N0j92Q0k4l5J0j04J67k30K21q0j69K88j23J1j35J70k7M7mJ91k28L6l2
$$ -127 -71 5 47 61 126 176 -16 64 40 5 15 -89 78 -152 69 -11 -180 108 -15 -4 -139 31 4 51 47 238 10 46 14
2299A4L7q5L8J4L2j29M3MR5j98M0R4J75j51n4n5l4K15j61J38L8j33o5R0k9q2J18m3jK7J3k
$$ 14 51 -34 4 18 50 -79 -36 -32 63 -135 -95 -1 174 23 -31 -86 -120 95 -66 72 110 -23 -88 2 -27 -109 9 -34 -35 -8 5 3
2019Co1J4N2P1n9P6m3m4J7j14L1M6O5j6l8k8J15j53J19J6%M6Mj38J12j10LLn0J25p5No4Q6
$$ 3 -58 -44 8 79 20 96 53 9 26 -88 -57 -11 54 38 0 -28 87 -66 53 69 69 115 119 -19 93 -17 -14 -11 -61 64 -11 -6 -70 16
1721A6J5o5J95j57j1M3oNn6N4L0r6J3J40r5j15L2J43o1l0K3K6j3J5O4q7P6r8K0K1n5O2j32
$$ 16 31 -34 161 4 -7 36 30 35 -21 33 63 -33 -20 120 25 -90 -58 85 24 -6 17 43 30 45 109 22 98 0 20 41 -14 48 -84
1432h4P9J80n5J57r8k08kM2L2r0l1m4J46o5K4J7j12k4j2J49L3j8L3o2k7N0rO3p7M6r5L6q1
$$ -84 -5 175 120 277 179 -29 -31 11 43 -47 -78 -122 24 -41 -17 0 -112 -136 -148 1 34 16 49 -13 -40 10 1 64 -13 33 -62 -26 -107
1143a07M1J27k9l2j30M8J50l3Lo4o5O0R5L6j19J3K9k5n4O9p9Q4M6o0J38j55L6O9n5o8k4M7
$$ -107 -66 61 32 0 -130 -82 68 35 38 -26 -91 -31 64 100 -19 -6 23 -2 -56 13 -66 18 64 4 142 -13 23 92 37 -31 -55 -8
863hJ4l9Q7q6n9L2j0J11p2J8P9j54O5oQ8J8j43kJ20j9j96P6K9J16j03l9Q3M0j22O0J89j96
$$ -8 6 -33 54 -32 -91 -59 -69 42 -30 -12 67 -87 -22 -28 60 78 -65 -67 53 34 -162 -86 -57 59 -44 -83 0 40 -82 -22 167 -29
583b9m2J40p7m6O6M7r4m8%p4J78j01J33J3L1o5N1Nj20M2j8K2p4J6QJ86j36N7m8j38J32J02
$$ -29 -71 69 -8 -54 12 59 -35 -83 -83 -157 21 -80 53 66 97 32 83 88 -32 10 -8 14 -60 -44 -36 150 14 71 23 -115 17 119
303A19j11k5J3j8N6jn4Pn6O5J39k38j8P9J39m0L1l5j28n3m4J28J41j28p7J72K6M1j53l3j4
$$ 119 8 -17 -4 -22 34 33 -21 -14 -70 -5 134 -104 -122 -43 96 56 87 52 -76 -129 -173 -45 96 -32 -109 63 89 130 -23 -56 -70
32g0J66j38RPm3J57k3M8m9j12P7r2M9qL8K2Q3Lm7K7j04j2L7k5q6N6J45j05m3Q5
$$ -70 96 -42 -33 -26 -69 88 65 113 64 -48 29 -63 -14 -22 16 38 121 124 77 104 0 -12 25 0 -86 -30 115 10 -33 52
-230E2
##PAGE=	F1=13145.2
##FIRST=	23146.755397984237788,	4241.1433691826614449,	0.025030732154846191406
##DATA TABLE=	(F2++(Y..Y)), PROFILE
4241Ej9O2Qm3l9O3l9K2l4j07J22J31q9M3o6K5L0k1l1k3Q2j37k1RM2q8J03J2k9%J16O6j48l4
$$ 5 -14 48 56 13 -26 37 -2 20 -14 -121 1 132 43 86 20 45 75 54 23 0 82 -55 -76 -67 -25 -113 -10 2 -27 -27 89 155 7 -27
3944b7L1n8R3j44O0J50n7p0PR8j57M6n0L4J30j94J7J39j33L1l0O1P4o2L2j1N8j3j0P3j39K06
$$ -27 4 -54 39 -105 -45 105 48 -22 -15 83 -74 -28 -78 -44 86 -108 -91 48 -85 -54 -84 -23 51 -11 21 10 68 55 45 118 -21 185
3664A85j88n0O9J53j84k0K6J16q5j14L2K44j63M8k4Pj91M1M7M8n7J4R7QJ5j08P3k5K4J0L5
$$ 185 -3 -53 16 169 -15 -35 -9 107 22 -92 -60 184 21 69 45 52 -139 -98 -51 -3 -60 -46 51 59 74 -34 39 14 38 48 83
3392H3j35M6r8PJ09l6p9R3k46L03M3j27J31p0o1m5q9J37J27J1r9l0J25k1l5J02l1l2n5j1m1
$$ 83 -52 -6 -104 -97 12 -24 -103 -10 -256 47 90 -37 94 24 -37 -82 -171 -34 93 104 5 -25 100 79 44 146 115 83 28 17 -24
3121b4K1kN0j13M9n5K9n5l6L5J15j02M9l3J45q5Q1q0k36J54k4L2J22k1R1j02Q9j06P8n8j16
$$ -24 -3 -5 45 -68 -19 -74 -45 -100 -136 -101 14 -88 -39 -72 73 -12 69 -11 -247 -93 -117 -85 37 16 107 5 94 -12 66 8 -108
2850a08J28R5j10Q6j04P8M2n1O1l7k36J01j55J60J17j38Q6q6K4O9Pm0N0o0J31k41O5M7lOq
$$ -108 20 115 5 91 -13 65 107 56 117 80 -156 -55 -210 -50 67 -71 15 -71 -47 22 29 -11 39 -21 110 -131 -66 -19 -22 -16 -24
2579b4L7M6j89O8M3M1P3M9K9j64L9k0LNj28J44j96J85mk24K75j06Q1j56J28p5Q5L6J53j88
$$ -24 13 59 -130 -62 -19 22 95 144 173 9 48 28 31 36 -92 52 -144 41 37 -187 88 -18 63 -93 35 -40 45 81 234 46
2316D6k0L1k6l2LNJ4j17N5L1O4k28Q9J03J70k09Nm5k6J46r7J01Q2k18K7M0m1o4J30l2k5J3
$$ 46 26 57 31 -1 2 7 21 -96 -41 -10 54 -174 -85 18 188 -21 -16 -61 -87 59 -38 63 145 -73 -46 -6 -47 -111 19 -13 -38 -25
2036b5L4K0r8M6LJ21l0N4m4p4m1m8J5M4N5j5nj2J02j29O8NK6K6m0o2J09j03K1o2jJ16r2k2
$$ -25 9 29 -69 -23 -20 101 71 125 81 7 -34 -82 -67 -23 32 17 12 0 102 -27 41 46 72 98 58 -4 105 2 23 -39 -40 76 -16 -38
1738c8k2Q7Pq3J67p7o9M0J1n0OP6k0k7k5J59j27o2L4R1m9p0L3L8L8K2m2q4J06l7J2j8p1R2
$$ -38 -60 27 34 -49 118 41 -28 12 23 -27 -21 55 35 8 -17 142 15 -47 -13 78 29 -41 -8 30 68 90 48 -36 70 33 45 27 -44 48
1441D8j15N6J48j5J69j37j12n1j9L1p3lj2J60j04O6o3p9l1rJ56rN4K3j08oO0J0L5r5J08j71
$$ 48 -67 -11 137 122 291 154 42 -9 -28 3 -70 -73 -85 75 -29 37 -26 -105 -136 -145 11 2 56 79 -29 -35 25 35 70 -25 83 -88
1161h8O5j39J10J39l7j4j15L6M1NM4p9l5M9L5P9j29M2j0j0m8L6k7P6P2p2J49k09P3L7l8o7
$$ -88 -23 -162 -52 87 50 36 -79 -43 -2 3 47 -32 -67 -18 17 96 -33 9 -1 -11 -59 -23 -50 26 98 26 175 -34 39 76 38 -29
881b9o0N1J0K4Jq3k0P1m5J06p9J1N4n5M5mN5K6j44j4J58o0j37M6mJ46j31J2N6J9q8J02K22
$$ -29 -89 -38 -28 -4 -3 -86 -106 -35 -80 26 -53 -42 12 -43 2 -2 53 79 -65 -79 79 19 -118 -72 -76 70 -61 -49 7 26 -62 40 262
592B62k98o0J53l7q7N3J14n4j05l8o2K10j10Q5M9qj6N6o1r7K6j8jm0N2N1J31j37N5q7o6J01
$$ 262 -36 -96 57 20 -67 -14 100 46 -59 -97 -159 51 -59 26 75 67 51 107 46 -51 -25 -43 -44 -84 -32 19 150 13 68 -19 -85 16
312A6P1n9jMk6R7m3l8qo6K4J76k58K5L3J27MM2q9p4o7q3J09J82j09n2J09K4N5j71ok5J87j12
$$ 16 87 28 27 31 5 102 59 21 13 -53 -29 147 -111 -86 -53 74 78 120 31 -43 -110 -193 -84 98 -11 -63 46 70 125 -46 -52 -77 110 -2
15bk2nn6J26M3N3j19j21J36r5P4p3M9L3J06J2o0lp4kK6n2n2N2J43j10p8J05
$$ -2 -24 -29 -85 41 84 137 18 -103 33 -62 12 -61 -12 21 127 139 79 76 2 0 26 -26 -78 -26 117 7 -71 34
-230C4
##PAGE=	F1=13098.1
##FIRST=	23146.755397984237788,	4241.1433691826614449,	0.17426764965057373047
##DATA TABLE=	(F2++(Y..Y)), PROFILE
4241C7o9J31j7n7m9R4o8J9n5rL9J45j11M0J5o3L7Jo8J7O3j60RRK8j04J29K8o2K5J08P2j47
$$ 37 -32 99 82 25 -24 70 2 21 -34 -43 -4 141 30 70 85 22 59 60 -8 9 72 -88 -79 -70 -42 -146 -17 11 -51 -26 82 154 7
3952Go6O3m6N7q1Q8J08m7p0KJ6r4M6pJ0J13k01M2J15j05j8K8L9M5l8RJ3O9kl0P4j70J84j70
$$ 7 -59 4 -42 15 -66 22 130 83 13 15 31 -63 -17 -24 -14 99 -102 -60 55 -50 -68 -40 -1 44 6 15 28 97 95 65 139 -31 153 -17
3655a7l2N1J76k24J0j1J09p6p0j6K49j51Q6l3l4j74N8L4M1Qo9R1R2K6j37j0MQ4QM6j83M7r7
$$ -17 -49 2 178 -46 -36 -47 62 -14 -84 -100 149 -2 84 51 17 -157 -99 -65 -24 -16 -85 6 98 124 -13 -23 -19 65 73 119 -64 -17 -114
3366a14P7N5m9l6Q4k37K81jq6O1K0p6o8qM6J43Jj00j0R7l5j8J47l5q5l4K4L7n7l4M2j19O9
$$ -114 -37 18 -31 -67 17 -220 61 60 -26 35 55 -21 -89 -97 -51 92 93 -7 -17 80 45 27 174 139 54 20 44 81 24 -10 32 -87 -18
3077a8q4O4q7kL4R3p5MQJ31k4R7o5k02O3m0NJ70o2P4o8J14n6Oj10k7R9L9q1P7p5O4J0k4N1
$$ -18 -102 -38 -125 -127 -93 0 -75 -71 -63 68 44 141 76 -126 -63 -103 -98 72 10 84 16 130 74 80 -30 -57 42 81 0 77 2 66 76 52 103
2771A03l3k63J49j38J25Q7p1K0n3O8L5Lr8J14k7J04k08L0O1r2M0lP8M8j78P2J5K1R8M6oj47
$$ 103 70 -193 -44 -182 -57 30 -41 -21 -74 -6 29 32 -66 48 21 125 -83 -53 8 -84 -44 -47 31 79 -99 -27 -12 9 107 153 147 0
2491@L4l4M3m8j08J40j10J08L2j97J70n9J28j39Q8j15J01O2R6j14p6R3n3mj9k5K2r4J7Q6L0
$$ 0 34 0 43 -5 -113 27 -83 25 57 -140 30 -29 99 -40 48 -67 34 96 192 78 2 95 42 38 19 -6 16 -78 -61 25 55
2220E5k43J28J09J58k31K4l5m4R6KL1R7k70J13J7r1J9R6k5m1L3K7K9j01M2o6J54K3K2j7q5
$$ 55 -188 -60 49 207 -24 0 -35 -79 17 19 50 147 -123 -10 7 -84 -65 31 6 -35 -2 25 54 -47 -5 -71 83 106 128 111 26
1948B6j16J7OK8M4nj0J1J00r2jLN9J6p9j7J06r6M4j15L4J23j43oJ6P1m4m8J23Jr2J9K8r3P5
$$ 26 -90 -73 -67 -39 5 0 -10 1 101 9 8 11 70 86 7 -10 96 0 44 -71 -37 86 -57 -63 -47 24 -20 -68 55 56 -36 -17 11 -82 -7
1642gR5p8K2p3J60j07lkM7k5q8J7P1N3N0j40p3R9M9m7l9l4J04r2L0R7J9J50j41Rj12m4J7m6
$$ -7 88 10 32 -41 119 12 9 7 54 29 -59 -42 29 82 132 -8 -81 18 67 20 -19 -53 51 -41 -11 86 105 255 114 123 11 -33 -16 -62
1345f2j0K7J67j32R6j09m0k6m9J37k7J36j1j60J5P7JN9j13J20k19J05j57J31J61m2j2r5J4
$$ -62 -72 -45 122 -10 86 -23 -63 -89 -138 -1 -28 108 97 -63 -48 29 30 89 -24 96 -123 -18 -175 -44 117 75 63 -32 -18
1091a8n6L6Q0q1OOj7J23j13O8l2j6j9j9J2N2Q8l9J20k05N9mj0l8q0J1N3M5r0m3K4Q1n7Q4q4
$$ -18 -74 -38 42 -39 -33 -27 -44 79 -34 34 2 -14 -33 -52 -40 12 100 61 181 -24 35 31 21 -17 -97 -86 -33 12 -78 -121 -97 -16 -73 11 -73
785g3J8K1K7M4l2L4Mj01m4J63m7q1mmJ28j45M9O1j2l1J29J97l38o2J31J5j31P9J16k1j26m5
$$ -73 -55 -34 -7 37 5 39 43 -58 -102 61 14 -67 -71 -75 53 -92 -43 18 6 -25 104 301 -37 -99 32 47 -84 -5 111 90 -36 -81
505h1m4K21j26L2P5k5j8M3n8o9jL0p2J0P2R4K4j03O9j33K1J2M9kL7Jk8J21q1k2op4j3J79k21
$$ -81 -125 96 -30 2 77 52 34 77 19 -50 -51 -21 -93 -83 -11 83 107 4 73 -60 -39 -27 22 20 57 58 30 151 70 48 42 -32 -45 134 -87
198h7K6j3J02P3J9j03j7o7j12Q0J61p7QK3K5K6j38L6l7J72j03jJ4p5O6R9N2j69r1J59q8Q3
$$ -87 -61 -74 28 101 120 17 0 -67 -179 -99 62 -15 -7 16 41 67 -71 -35 -72 100 -3 -4 10 -65 1 100 152 -17 -108 51 -37 46
-82D6j14K0R0R5Mm7k7l1ok7m9n0P9J09j00q5J05
$$ 46 -68 -48 42 137 141 94 67 36 30 3 -46 -96 -17 92 -8 -93 12
-230A2
##PAGE=	F1=13050.9
##FIRST=	23146.755397984237788,	4241.1433691826614449,	0.25314605236053466797
##DATA TABLE=	(F2++(Y..Y)), PROFILE
4241E4r9J57k6n7k8R5r3J9o0J03p4J29j15N7O5j20M1J8r9O4pj33L3LK8j04J41K8r4M9P5N3
$$ 54 -45 112 86 29 1 96 3 22 -38 65 -9 120 5 62 127 7 48 66 -33 31 24 -109 -76 -73 -45 -149 -8 20 -74 -25 50 103
3961A03j06n8Q1m9K0j7J00N1k2n3J1n1m7L1M0j1O6j78M9P1o2n0Q9J9j3J7j8L3O1j1pN7j75
$$ 103 -3 -61 20 -29 -9 -26 74 125 103 50 61 10 -37 -6 34 23 89 -89 -40 31 -31 -81 8 27 14 31 13 46 107 96 89 146 -29
3672b9J30j02o4O6J71k31J4m5J07o8k6o4K56j41J24m2p2j43Q9RK4O8r6M4J34J9j26m9J2J19
$$ -29 101 -1 -65 1 172 -59 -45 -90 17 -51 -77 -141 115 -26 98 56 -16 -159 -70 -61 -37 31 -65 -21 113 132 6 -43 -31 88
3410H8j9P4k11J8o6J42kn9J1M6j98K55n0m4qJ08r1r1P4m5J60j4j05K5K4m5MJ88m5r6l1J71
$$ 88 69 143 -68 -50 -116 26 24 -35 -24 22 -176 79 29 -15 -23 85 -6 -97 -23 -68 92 78 -27 -2 22 -23 -19 169 124 28 -3 168
3130A68p7m2l5kj04O1q4R0o7%jJ01p7l4N7R1P1J12M16L25m45n18n7J60r7M7m4P8P2j0k06L9
$$ 168 91 49 14 12 -92 -31 -115 -25 -92 -92 -93 8 -69 -103 -46 45 116 228 644 969 524 6 -51 109 12 59 15 93 165 155 -51 -12
2850a2M6jl7O6m3M8k2j6K2l1j90J05p0P9M9lm7k0J11llj27J50oO5j57J5M1j55R7l5J49J9j34
$$ -12 34 33 -4 62 19 67 45 29 51 20 -170 -65 -135 -56 -7 -10 -57 -77 34 31 28 -99 51 45 110 -47 -32 9 -146 -49 -84 65 84 -50
2552e0N0oQQ0N8l3j23O0p8Q5r8q7J37j9L6J9j21O5j5J32j04M6r7Q2N4L9m0j35J50l4Rl8n2
$$ -50 0 -6 2 82 140 107 -16 44 -34 51 -47 -134 3 -16 20 39 -82 -17 -32 100 -4 42 -55 27 81 120 80 -55 95 61 70 32 -20
2264b0L1p0k2J43Rk42J40Q9J46j94K5m4o3M8J06l2O8k65J40M1j49R6O1j7n8N2J8L4p4Pj29
$$ -20 11 -59 -81 62 71 -171 -31 58 204 10 35 -9 -72 -24 82 50 118 -147 -7 34 -115 -19 42 25 -33 19 37 71 -3 4 -125
1992a25J90O0k3J7q7j40L1MJ8L8Qm6O5R4n9o9JQ6Mq6mJ11q2M1j35L6J55j97ON5N4r5j4Q0P9
$$ -125 65 125 102 119 32 -108 -77 -73 -55 -17 -9 -55 10 104 45 -24 -23 63 67 -19 -23 88 6 47 -88 -52 103 -94 -88 -33 21 -74 -88 -8 71
1686G1j10%J7j08J37J07j09L5r1J32n0L4o0M0k1o3j4Q8K3R3k12l4O2J03q9m7NJ15o8KM6N5
$$ 71 -39 -39 -22 -130 7 114 5 40 -51 81 31 65 5 45 24 -39 -53 35 58 151 -61 -95 -33 70 -19 -66 -61 54 -14 -12 34 89
1406H9J30j44J29j71n5J6l2l2M9J60j60J25j39J3j6q7Q8j5K12n3j80MR8nQ9j22Q5k14J08j49
$$ 89 219 75 204 33 -22 -6 -38 -70 -21 139 -21 104 -35 -22 -38 -125 -37 -52 160 107 -73 -69 29 24 113 -9 76 -138 -30 -179
1143a79J29J59j7l9o4Oq4L4P9o3L9m4l9J36r2R9n5k3K5n7L5J4J07kO1j71M1m8K5lr2k1P4M4
$$ -179 -50 109 92 53 -11 -5 -89 -55 24 -39 0 -44 -83 53 -39 60 5 -18 7 -50 -15 -1 106 104 165 -6 35 -13 12 9 -83 -104 -30 14
846A4j59K0L8O0m7Q4q3K7oN7M9n5J9j0m7o4J17k7k1n2oJ05j40M5J16n5J8J49J48l40n9J12
$$ 14 -145 -125 -87 -27 -74 10 -73 -46 -52 5 54 -1 18 8 -39 -103 14 -13 -34 -86 -92 13 -127 -82 34 -21 -3 146 294 -46 -105 7
566GP2j73J21P1J8j45k8mK13j60J1P6k8o4J8ml8k4Q4j34M5P4J23r7n7R3j48P7o9L5J9R5nl5
$$ 7 79 -94 27 98 116 -29 -57 -61 152 -8 3 79 51 -13 5 1 -37 -61 23 -111 -66 8 131 34 -23 70 -78 -1 -70 -35 -16 79 74 39
268C9J29j38K1K0p7m8J55j48j6l9O7J29J4r8J6k7j39N3Q7%M0l2Mk5o1O3n9J44q5K5M3q7JJ44
$$ 39 168 30 51 71 -6 -54 101 -47 -63 -102 -35 94 108 10 26 -1 -140 -87 0 0 40 8 12 -13 -74 -11 -70 74 -11 14 57 -30 -29 115
-29A15N7k16m0J45o4J06j24m1J36P4ml4n1J2j0q0n5n6J07P5p6p7J06
$$ 115 172 -44 -84 61 -3 103 -21 -62 74 148 144 110 59 71 61 -19 -74 -130 -23 52 -24 -101 5
-230E
##PAGE=	F1=13003.7
##FIRST=	23146.755397984237788,	4241.1433691826614449,	0.24700808525085449219
##DATA TABLE=	(F2++(Y..Y)), PROFILE
4241E3j13J48j6n6QP0j19L1k9J85j69Q4j18Q2Q5j34K4M2j29J05p0q7P4j7L9j03J26Mq1P3n
$$ 53 -60 88 72 16 24 94 -25 6 -23 162 -7 77 -41 41 126 -8 16 58 -71 34 -36 -123 -49 -66 -27 -130 -4 0 -81 -8 -13
3970a3N9m6m5J05p4OJ7J09m4J8nK0j04kjN5nK1j36N2J2l1l4J12J1r2P7pJ9J8RKJ8j23P4k7
$$ -13 46 0 -45 60 -14 -8 9 118 74 92 87 107 3 1 0 55 50 71 -65 -13 -1 -32 -66 46 57 -35 42 35 54 72 81 83 101 -22 52 25
3655B5j11Q5J28j84K5n5Q7q1J2n0J83r3J39m8j19p8J18k1L2Q0r7k0J21K9n9o7mJ09m0J02j93
$$ 25 -86 -1 127 -57 -32 -87 0 -81 -69 -119 64 -29 110 62 -57 -135 -17 -38 -6 74 -23 -43 78 107 48 -19 -23 86 46 148 -45
3384d5k2m3J56k9n9N0Jj57K23p3j9o4J76q4j04J39r2J31m3q7N8o0l1J9J59l6n8n7M76m31N6
$$ -45 -67 -110 46 17 -42 8 9 -148 75 2 -17 -81 95 11 -93 46 -46 85 42 -45 13 -47 -78 -59 100 64 6 -51 425 -6 50
3112E0j1m3p5N8q0J02k0k9m5J11q3m9Q3P5J36J15J516J501j452j638j78R9j02J4n6jK92L6
$$ 50 39 -4 -79 -21 -101 1 -19 -48 -93 18 -65 -114 -31 44 180 295 1811 3312 1860 222 44 143 41 55 -1 -2 290 326
2867C26l74L9K3j1j9N3l7N7m4k0Pk0r2K3MM4K9K7j11M4J20k6k5j11J40qM4j12K8oj77J53p7
$$ 326 -48 -9 14 3 -16 37 0 57 13 -7 0 -20 -112 -89 -85 -41 -12 15 -96 -52 68 42 17 -94 46 38 82 -30 -2 -8 -185 -32 -109
2579a09K03m2p2K0j1K2L7N1j4j41J12r0R4j50n5J19O5k4j5k6k5J7R1n2Jl1L8L1%J3j74J77
$$ -109 94 52 -20 0 -11 11 48 99 85 -56 56 -34 60 -90 -145 -26 39 15 0 -26 -51 -34 57 5 6 -25 13 44 44 57 -117 60
2299F0j6M0j5p7K5m8q0J88L0k49J06Q0J27j24J2p8m4L1J33o6Rj75J22M7j71J53L4l4n2N8K0
$$ 60 44 84 69 -8 17 -31 -111 77 107 -142 -36 44 171 47 59 -19 -63 -32 101 35 44 -131 -9 38 -133 20 54 20 -32 26 46
2027D6J9qk8j57J62Q3n2K9p6q1j1mJ8L5M4r0Q2P6m7o4nJ12j2j07j0J26p2J7j13J7J71k28N3
$$ 46 65 57 29 -128 34 117 65 94 18 -63 -74 -78 -60 -25 19 -71 11 87 40 -24 -29 83 71 -36 -46 80 8 25 -88 -71 100 -128 -75
1738g5M9L4j17K6O7R1r7ok1q3J48R2j18K9o6P4lO4j07M6j4j9m4J00l6J03j94Nj1J22q3k4%
$$ -75 -26 8 -109 -83 -16 75 -22 -28 -49 -132 16 108 -10 19 -47 27 24 88 -19 27 13 -6 -50 50 14 117 -77 -72 -83 39 -44 -68 -68
1450f8J00m5NJ8P4Q4j28J93j90o2QQm8L6J36j63J20j28O9k0r2MkK61o5j60j9Q6j5P7q2M5j63
$$ -68 32 -13 -8 10 84 168 40 233 43 -19 -11 -3 -51 -15 121 -42 78 -50 19 -1 -93 -89 -91 170 105 -55 -74 12 -3 74 -8 37 -126
1161a26P5j09J09R9L5o8j5k3l3M2K9l0J5n1m2J12n2J09n9j7M7o6K3J0Q4K1Oj19K2q8O8J9q3
$$ -126 -51 -160 -51 48 83 15 0 -23 -56 -14 15 -15 0 -51 -93 19 -33 76 17 0 47 -19 4 14 98 119 125 6 28 -60 8 27 -56
872e6m9N2M4j56N4K2L3j0R1o9K1KPO3o9M1k8Op8L6j0M0j04%P1q6rJ72p5K6J56R8l05l5Q7Q8
$$ -56 -105 -53 -9 -165 -111 -89 -56 -66 25 -44 -23 -21 -14 49 -20 21 -7 -1 -79 -43 -53 -13 -117 -117 -46 -132 -141 31 -44 -18 138 236 -69 -104 -17 71
557G1j55J57J5Pj36K5J6J74j70RO6qj38J4L7lk0J03j49M8N6R7j72OR7j39J08j33P5pJ41j4
$$ 71 -84 73 88 95 -41 -16 0 174 4 13 79 71 -67 -53 -16 -19 -39 64 -85 -37 19 116 -56 -50 47 -92 16 -117 -42 -49 92 78
277G8k9Q8j78R1N0q7q7J38o0o4m5K6J60Jq3RL1j13pJ1J03K7l1l3o4NO7o1J13p5L5N7q4l4J59
$$ 78 49 137 -41 50 100 13 -74 64 4 -60 -105 -79 81 82 -1 8 39 -74 -81 -70 33 60 29 -4 -68 -63 4 -57 56 -19 16 73 -11 -45 114
-29A14M9k19J4R5NR1j08q1J49K5j0k6o1L3Lj06n7p2J11N9m0m9P6
$$ 114 163 -56 -42 53 58 149 41 -40 109 134 124 98 37 70 73 -33 -90 -162 -51 8 -32 -81 -5
-230e
##PAGE=	F1=12956.5
##FIRST=	23146.755397984237788,	4241.1433691826614449,	0.17051148414611816406
##DATA TABLE=	(F2++(Y..Y)), PROFILE
4241C6j06R6J4l8M5M4j49M2J3K17k16K8j18J12J08j44k6R3j36J07q5n1J03m8N0j02J08k3l5
$$ 36 -70 26 40 2 47 91 -58 -16 -3 214 -2 26 -92 20 128 -16 -42 51 -85 22 -63 -114 -11 -59 -9 -111 -3 -26 -61
3987f1O8j11J01J1l7J26j04PPJ20j33O1M6J8j07pk1O6mnp5L2j2n4K9J25oj43J09PQk3K8J0
$$ -61 7 -104 -3 8 -29 97 -7 0 7 127 -6 55 101 119 12 5 -16 50 46 41 -34 -2 -14 -68 -39 86 80 -63 46 53 61 38 66 76
3690G6k0p0J8M7j58J03Q6j36L5n4P8q4kJ5O1j2J32n1j62j3J46n0L9R3r9q3J07M0Qp9j4L7k0
$$ 76 56 -14 4 51 -107 -4 82 -54 -19 -73 5 -79 -81 -66 -5 -17 115 64 -98 -111 35 -15 24 117 18 -65 42 82 90 11 -3 34 14
3401A4J08j36o3j9J39k5o4Q6m0j11J63o0k4q7J70m8r8J65r1R1o3o3P7r9l6J4J31k6j4p7Q22
$$ 14 122 -14 -77 -96 43 18 -46 40 0 -111 52 -8 -32 -119 51 3 -95 70 -21 70 7 -56 21 -78 -114 -100 31 5 -9 -86 736
3130G36q88J80L5q5m3P3n7O9M0o0r3J22q9p0J02R1J30J27K886K961k641l050l26Np8j8o8j02
$$ 736 -152 28 63 -22 -65 8 -49 20 60 0 -93 29 -60 -130 -28 63 193 320 3206 6167 3526 476 150 155 77 59 -9 -111
2885a11N51J17o06J1L4Ll4M4k6O8o2l0M8k3pp5O4K7K7J5j62J04J25n2n1o5R9nK5o3M5o4j50
$$ -111 440 557 -49 -38 -4 -1 -35 9 -17 51 -11 -41 7 -16 -23 -98 -34 -7 20 35 -127 -23 102 50 -1 -66 33 28 53 -10 35 -29 -179
2596a79J64j03K21p6j4j3j5L5oM5Nj59J81q3N5j90OP0J25n2n6O1q1K3K4L4m7K9rNj1L0j79
$$ -179 -15 -118 103 27 13 0 -15 20 14 59 64 -95 86 3 58 -132 -126 -56 69 17 -39 22 -59 -36 -12 22 -25 4 -5 0 -11 19 -160
2307a60J78NP5J2r9j3%j13K00N4k51O0N8P9k5J1j00j8J9J13m5q5o2R7M4j67J79M0q0m1O7K2
$$ -160 18 23 98 110 11 -2 -2 -115 85 139 -112 -52 6 85 60 71 -29 -47 -28 85 40 -45 -107 -10 34 -133 46 86 6 -35 32 54
2027E4ON2p2j30R0Q3l9Km2Lq7pK2K8P8j06P0M5m5m1RJ07Mj32k2J46n8l7o1j1J80k13Q4K9k
$$ 54 60 112 40 -90 0 83 44 46 4 7 -80 -87 -65 -37 41 -65 5 50 5 -36 -27 80 84 -48 -70 76 18 -19 -80 -91 89 -124 -40 -11 -13
1721a3j09L6N7J08q3j2m4m4J29M6j12M0m2J6K8P9j40P0j0J8m5P7o5P7j10Rq1Q4j3Lj8P3k5
$$ -13 -122 -86 -29 79 -4 -16 -60 -104 25 71 -41 -1 -43 -27 1 80 -60 10 0 18 -27 50 -15 62 -48 -39 -120 -36 -49 -46 -64 9 -16
1432a6MK0O4M8j03J90j71o1J0M6o3J9J09j52P1r9J45k6r6p6J5K79m7j39m1M4JM9o1K5r4J2
$$ -16 -12 8 72 120 17 207 36 -25 -15 31 -32 -13 96 -56 15 -84 61 35 -61 -137 -122 157 110 -29 -70 -26 -25 24 -37 -12 -106 -94
1152i4l9Q5L5P2j11M7l7J9M9j7Om0l4j7N4qJ22n9rM4m1k3L4L6K2lq2K2j10Q9J8o0o1J6L0r1
$$ -94 -133 -48 -13 59 -52 -5 -42 -23 26 9 15 -25 -59 -76 -22 -30 92 33 24 68 27 4 38 74 96 93 11 33 -77 12 30 -30 -91 -75 -45 -136
837a36M8k4L4L2J02o3PMm5N5m6O7m3N9r1m5OR5j65K2N2l5o6J90p4J5J45O4k57nO5P8j04J49
$$ -136 -88 -112 -78 -46 56 -7 0 4 -41 14 -32 35 -8 51 -40 -85 -79 16 -149 -127 -75 -110 -176 14 -60 -45 100 164 -93 -98 -33 45 -59 90
540I0k8k6q8Q7j1J38j75J3O3L6j88qO3L9j0Q0j07L0J3M4j75N0Q0j35J36j34J17o1J57k6k7
$$ 90 62 36 -52 35 24 162 -13 0 63 99 -89 -97 -34 5 -5 75 -32 -2 11 55 -120 -70 10 -125 11 -123 -6 -67 90 64 37
268C7J6j89J74R2r7j27J20L0j02l9JJ44j6p3kQ1p7n5k9J82l2K4o3r2M5M5j8O5o8M1N2r9l2
$$ 37 53 -136 38 130 33 -94 26 56 -46 -85 -84 60 44 -29 -31 50 -27 -82 -111 71 39 63 0 -92 -47 -2 -20 45 -23 18 70 -29 -61
-20f1J51N4k12O8M5O0O0p3j02J16qj7j8m8J5M5j07n0q1J07L6j3k8M5
$$ -61 90 144 -68 0 45 105 165 92 -10 106 98 81 63 15 30 75 -32 -82 -163 -56 -20 -33 -61 -16
-230a6
##PAGE=	F1=12909.4
##FIRST=	23146.755397984237788,	4241.1433691826614449,	0.055904150009155273438
##DATA TABLE=	(F2++(Y..Y)), PROFILE
4241A2q1M5NJ0M1O7j64K7M7J86k15pq0P6J60j37q2J56j42P6l9o6J44q3L7j04J01l1QP3k01
$$ 12 -69 -24 -19 -9 32 99 -65 -38 9 195 -20 -27 -107 -31 129 -8 -90 66 -76 0 -39 -105 39 -44 -7 -111 -10 -41 -33 40 -161
3970a61J54K9m9J46j15j3j6J59k07P3Q2j0n0m8j8N9jK0n7J9J8j07R6R3l9j13J02j9J7o8P8
$$ -161 -7 22 -27 119 4 -9 -25 134 -73 0 82 72 22 -26 -44 15 14 34 -23 -4 14 -93 3 96 57 -56 46 27 44 -24 54
3699E4pl8rk9R6j48P0K6p9N3j9N7o3n3R5p7N9J09n4j47OJ71n4J0Q6r7j20R2P6J9n7l2l6L4
$$ 54 47 9 0 -29 67 -81 -11 15 -64 -11 -30 27 -36 -89 6 -71 -12 97 43 -104 -98 73 19 29 115 18 -102 -10 66 85 28 -4 -40 -6
3401fJ06q1o8l6J04k1q9J46n5p7J26l2n0r8J28kq7J50r4P2l0m5P1q3m9JP0k9N6r5J019j207
$$ -6 100 19 -49 -85 19 -2 -91 55 0 -77 49 17 -33 -131 -3 -5 -92 58 -36 36 6 -39 32 -51 -100 -99 -29 -58 -2 -97 922 -285
3121b85K52Q7p1n9J49p5L0P8q3j22R9l4q7J12R2Q8J21L825L986l427m023m23o8n4o3o6j54
$$ -285 -33 54 -17 -76 73 -2 28 106 23 -99 0 -34 -121 -9 83 171 292 4117 8103 4676 653 230 162 108 45 -21 -175
2885a75P42J88q00l1O3J5l8M2m7J15q0k9R6l5Qj15P9J1O5m2j72J36J20n2n3l7K8K2mk0N1j06
$$ -175 567 755 -45 -76 -13 2 -36 6 -41 74 -6 -35 61 26 34 -81 -2 9 74 32 -140 -4 116 64 11 -26 2 24 20 0 51 -55
2605e5p7J45j12J76q5J5k8pO3l9L0L6j68K26l8l0j96N6J6J52p8p9R9n5L2m9R2p9M1j5k4J6
$$ -55 -132 13 -99 77 -8 7 -21 -28 35 -4 26 62 -106 120 82 52 -144 -88 -72 80 2 -77 22 -33 -1 -50 42 -37 4 -11 -35 -19
2325a9Jj44J39K0J31J6j36o1O4j13J61N8k07J6P7qM8M0j57N5mN8J9j57N0O8j1j22J66P5j34
$$ -19 -18 -162 -23 -3 128 144 8 -53 11 -102 59 117 -90 -74 3 -5 43 83 -74 -19 -23 35 54 -103 -53 15 4 -118 48 123 -11
2054a1k1M8NK3R8q7q1K2L9j0m1nR5j39j4%L8P8o7L8J5m5qJ7J03L5j73jJ12qq4lj3J11j64J17
$$ -11 -32 16 21 44 142 55 -26 -4 35 25 -16 -21 74 -65 -79 -79 -41 37 -30 8 23 -22 -30 -13 90 125 -48 -49 63 55 -29 -32 -45 66 -98 19
1738A9j5j3o9pN2J11o9rk7j2O8K3r7L3j5k3MR4j24M7K3K9k3K2l9J9jk0j07MP2L8l5L6qL2K1
$$ 19 4 -9 -78 -85 -33 78 9 0 -27 -39 29 52 -45 -12 -27 -50 -46 48 -76 -29 -6 23 0 22 -17 2 1 -19 -126 -122 -50 -12 -47 -11 -19 13 34
1415C4M7Mn7J13j28o0K9O5o5kP8j35J3m8J98j9p8j34L4K36j3j14m1j0RK1l5M1l6o7L4N4k7
$$ 34 81 85 28 141 13 -47 -18 47 -18 -20 58 -77 -64 -112 86 67 -11 -145 -111 125 112 -2 -43 -53 -44 -23 -58 -17 -53 -120 -86 -32 -59
1126e9Q3j31Q6j8L9N7n6N4j14rK8nL3P6l7L4J0pp2P8k0qM0q2P0j37N2M8o4k4l7J5rQp9P3O0
$$ -59 24 -107 -21 -39 0 57 1 55 -59 -68 -40 -45 -12 64 27 61 71 64 -8 70 50 42 82 0 70 -67 -15 33 -31 -55 -92 -77 -86 -78 -157 -84 -24
802b4J03o5J5Oq5K7PP9o3Q1p1j00L7Q7k13Q9pK6r7J51l9oJ04O4k06LO3O1k9R2n2q6JJ02n9
$$ -24 79 14 29 35 -50 -23 -16 63 0 81 10 -90 -53 34 -179 -90 -97 -71 -168 -17 -56 -62 42 106 -100 -97 -34 27 -2 90 38 -48 -47 55 -4
496dJ20j62K6N8P0j84j7M5P6k1L8pj7Jk2j29L3P2j20J34o6J23j05J35l6j1p8j59K36J13j18
$$ -4 116 -46 -20 38 108 -76 -93 -48 28 7 45 38 21 22 0 -129 -96 -24 -144 -10 -76 47 -58 77 41 30 -48 -207 29 142 24
225B4j48J24Q0q3l3k6R2j4r7%R3k3r1j7K29r4P2r1o6L1K3N5kl2K3nj05K5J05N7j72Q5K2R0
$$ 24 -124 0 80 -3 -36 -62 30 16 -81 -81 12 -11 -102 -119 110 16 88 -3 -69 -38 -15 40 38 6 29 24 -81 -56 49 106 -66 19 41 131
-73A31J3m5r5M8J7j8l3j2l8P8p2k7p9P5L1Ol8K6
$$ 131 144 99 4 52 69 51 18 6 -32 46 -26 -53 -132 -57 -26 -20 -58 -32
-230c2
##PAGE=	F1=12862.2
##FIRST=	23146.755397984237788,	4241.1433691826614449,	-0.058703184127807617188
##DATA TABLE=	(F2++(Y..Y)), PROFILE
4241a2m1Rk0M3L8R0j79J3O7J38j99k8m0L9K13j32j37K20j52L9N4r6J74j31K6j06R3l8M5P5
$$ -12 -53 -44 -64 -21 17 107 -72 -59 8 146 -53 -81 -121 -82 131 -1 -138 82 -70 -31 23 -73 101 -30 -4 -110 -17 -55 -10 65
3979F5k34K00K7q4J71j22q1k3K27k55P1J01m8oj05L3M9kM2l9PM9j61J64N4p8l3M4l8L1j14
$$ 65 -169 31 58 -26 145 23 -58 -81 146 -109 -38 63 15 9 -96 -63 -14 -16 26 -13 -6 43 -118 46 100 22 -11 33 -5 26 -88
3707h8J31k6n4N6p4J15j07L3l7k2P0J4L8l8j01J46j86J26Q2n1j29k1K11m5qO2j10j26J07P8
$$ -88 43 17 -37 19 -55 60 -47 -14 -51 -73 -3 11 49 11 -90 56 -130 -4 78 27 -102 -123 88 43 35 97 -13 -139 -32 46
3445D6nJ2o6r1J07Q7m5m5q2P5j6j14K07p1m1Q7ko2r3O8L1p7J35r7N3Pk2L4l6n5mM1n7R7p8
$$ 46 41 53 -13 -104 3 90 45 0 -82 -7 -23 -137 70 -1 -42 45 43 -19 -112 -44 -13 -90 45 -52 1 8 -14 20 -16 -71 -75 -34 -91 6 -72
3139g2R27j188K36J12j5r4K25r5PP1q5j35P8K0j04J21P1K0J04L801L961l341l961l96j20r
$$ -72 855 -333 -97 15 0 -94 131 36 43 114 29 -106 -28 -8 -112 9 80 100 204 4005 7966 4625 664 268 148 139
2911A39r9n6j31P45K10q21p2R2J3n7M0o9J64j00l4J38jl5r8M8QJ12j26j48J20J26m2m2j1m0
$$ 139 40 -16 -147 598 808 -13 -85 7 20 -37 3 -66 98 -2 -36 102 101 66 -32 16 24 136 10 -138 -18 108 66 24 13 -27
2649b7O3j9nK4j32J1J32j20J00o2M1m8JR1n4L6K5j59K37L3j17k07J10l4J43q0n6Q2k8M0o2
$$ -27 36 17 12 36 -96 -85 47 -73 27 -35 6 -42 -41 50 -4 32 57 -102 135 168 51 -156 -46 -80 63 -17 -73 9 -19 21 -41
2377d1J08o9nQk1K8m1p7O7K5J75J6j75q5R1n6Q0K3j41kJ22j27R3Q8j95R8KnP1j77J10M8o2
$$ -41 67 -2 -7 1 -20 8 -33 -110 -43 -18 157 173 -2 -87 4 -52 28 51 -90 -92 30 -97 -4 84 -111 -13 -11 -16 55 -122 -12 36 -26
2089b6p7J54J10j90%K9pM3J13p2l6m9mJ8q2L6J57j60k5k4M4P4Jk4j1m2J1J0J13Q3k10K2M9
$$ -26 -103 51 161 -29 -29 0 -7 36 149 77 41 -8 -12 6 -76 -40 117 -43 -68 -92 -48 26 27 3 -8 -50 -39 -29 84 167 -43 -21 28
1800B8P2j34M9j8L9q4J19n4k2k8n1M6J16n6nqK3k1L0q3K6j7l3k5J06j07K3N7L9jl0j5l7J07
$$ 28 100 -34 15 -3 36 -48 71 17 -5 -33 -84 -38 78 22 17 9 32 11 41 -42 -16 -33 -66 -91 15 -92 -69 -12 27 26 -4 -19 -56 51
1502E1n1j29p1J11Q8k6K5mM6K1K8m0j0L6q3m7O4O9q2k3M7j21n2L7K19pn8j76O8J82J0j21r
$$ 51 0 -129 -200 -89 -1 -27 -2 -6 40 61 89 49 39 75 -8 -55 9 78 -4 -27 20 -101 -153 -116 103 96 38 -138 -70 112 122 1 -8
1213ho9J5j3j2Q5j4j12Q1M6o6O7j17P6J2L8M0m9Q7j80K5M1l4P0K7j4P7k4K6j22J22p5l7Q1
$$ -8 -77 -62 -75 -87 -2 -16 -128 -47 -1 -67 0 -117 -41 -29 9 49 0 87 -93 -68 -27 -61 9 36 22 99 75 101 -21 101 26 -11 70
925G0q1J19j66RP0n3K8r8oP2l2j26J19P4Q8p5J7L7r4kO0O8j03J01n1j27R7J4k25J57o4R4j19
$$ 70 -11 108 -58 -49 21 -32 -4 -102 -108 -36 -68 -194 -75 -1 87 12 29 66 -28 -30 30 98 -5 96 45 -82 15 29 -196 -39 -103 -9 -128
636a28J01rl2O0J02j78%N0M7M8Om6j43R6R3j30J18j34L5N0R7j29k8K2P9o4L3P1m5Np0o4lM7
$$ -128 -27 -36 -68 -8 94 -84 -84 -34 13 61 67 21 -122 -26 67 -63 55 -79 -44 6 103 -26 -54 -32 47 -17 16 87 42 47 -23 -87 -90 -43
338d3j03J31L2N7r0O6l9J1j42j00K27J24j20j50J11J09j9m3n8L2J5j56L3P5Nr2L9K17j28Q9
$$ -43 -146 -15 17 74 -16 50 11 22 -120 -220 7 131 11 -139 -28 81 62 19 -39 -7 8 -148 -115 -40 -35 -127 -88 129 1 90
76I0j01j9RoJ29p1MMn3j05P9N6L3r8O8K6J00n3j6q6JO4k6n6K6r4J13l8J1o1K7J2K3m7Q
$$ 90 -11 -30 -21 -27 102 31 35 39 -14 -119 -40 16 49 -49 19 45 145 92 76 -10 -9 55 29 -27 -1 -95 18 -20 -9 -70 -43 -31 -8 -55 -47
-230d7
##PAGE=	F1=12815
##FIRST=	23146.755397984237788,	4241.1433691826614449,	-0.0047433376312255859375
##DATA TABLE=	(F2++(Y..Y)), PROFILE
4241ak1Mn0N4M1R3j83J8O5N7j61rj0LK18j28j50K56j22k6J38j05J37j47K5j06J06j5K1R4k13
$$ -1 -22 -18 -68 -14 27 120 -63 -45 20 77 -84 -93 -103 -100 118 -10 -160 96 -26 -52 86 -19 118 -29 -4 -110 -4 -19 2 96 -117
3970a17K05j9q2J43j09j45mK78k43N1R1q8L6j47Q5K1KN8rJ1M5j87J68O3j18N3j8o5M5j28J76
$$ -117 88 69 -13 130 21 -124 -128 150 -93 -42 49 -39 -3 -150 -65 -44 -42 16 7 18 63 -124 44 107 -11 42 24 -41 4 -124 52
3699E2n2l4Q2j06J05n2kq3J2P4M9J0j1j44J52k03J41N8l4j01o9K46l6k9N1j21j04J20N4l7
$$ 52 0 -34 48 -58 47 -5 -7 -90 -78 -4 45 55 44 -100 52 -151 -10 48 14 -87 -156 90 54 25 76 -45 -149 -29 25 -12
3436a2P8j11p2J68L9m1k6j10N8k4r6K35o0k9P2m0j5j16M7O2q2J07j15O3L8kpJ9q6J4M5r5J14
$$ -12 66 -45 -117 51 90 49 23 -87 -29 -53 -149 86 26 -3 69 29 14 -102 -55 7 -75 32 -83 -20 18 16 9 28 -58 -44 1 -94 20
3147B0m5O04q59J59R4N8j22K61j40K1K8n2j27M1P3j05J09OnP7K838K907k428k898k42j40q
$$ 20 -25 579 -280 -121 -27 31 -91 170 30 51 79 27 -100 -59 14 -91 18 24 19 96 2934 5841 3413 515 273 133 125
2911A25r4m5o0N45J44o33m2J02Jp0N3q7J81j34nJ35M0q6p5jL5J41j79q8O7R6Kk4j6o7J09n6
$$ 125 31 -14 -74 471 615 -18 -60 42 43 -27 26 -61 120 -14 -19 116 156 70 -5 -6 29 170 -9 -97 -30 66 68 44 28 -39 70 14
2631A4J5k6j17M7J58j04Qm9K8m4M6R1m9J2J7j30K21P4j71j85J25m0J06p0k4M5k0N0l5P9l8
$$ 14 29 3 -114 -67 91 -13 -5 -54 -26 -70 -24 67 18 30 47 -83 138 212 41 -144 -19 -59 47 -23 -47 -2 -22 28 -7 72 34
2360C4o2O2KJ9j01j0KL3J95rj80o7R2J5l6l4o6K9J63k26Q4J58k25Q2L8l2R7j41J16on5m0J21
$$ 34 -28 34 36 55 -46 -56 -54 -21 174 165 -15 -82 10 25 -11 -45 -111 -82 81 -145 -61 97 -128 -46 -8 -40 57 -84 32 26 -29 -69 52
2071E2J31k30J9Rj8O1R0m8Np0k9K3r4M6J82j50k2l8M2K2Q4o4k1j2k4rJ31J05k14M8m7J56j31
$$ 52 183 -47 -28 -19 -37 24 114 66 71 1 -28 -5 -99 -53 129 -21 -43 -81 -39 -17 67 3 -18 -30 -54 -63 68 173 -41 7 -40 116 -15
1782a5O3rpl6R0q0JQq4L9Q0k0ML2L5r9N5p7J3n6mn9J38r7j3O8N1L2r8J7o6J77r2j21q3O8J18
$$ -15 48 39 32 -4 86 6 7 15 -69 -30 50 30 34 66 101 2 57 -20 -7 -63 -67 -126 12 -85 -98 -30 21 53 -45 -28 -94 83 -9 -130 -213 -145 -27
1458b7N2Rk4N7%L2o4J7k0n1rR1M5j35nNr2o5R1J89j1l2j47Q7J09K0j39Ro2Lj1mJ20l1r6R1
$$ -27 25 34 10 67 67 99 35 52 32 -19 -28 63 108 -27 -32 -27 -119 -184 -93 96 85 53 -94 -7 102 122 -17 -8 -70 -67 -78 -82 38 7 -89 2
1143BJ9n1J0o0L0M1j3K2l1R8j76M9L1pO3k9L9Q1n1N7j35R9p4p6J41q3J38j96j8R4l2Q0j45
$$ 2 21 -30 -20 -80 -50 -9 -22 0 -31 67 -109 -60 -29 -36 27 -2 37 118 67 124 -11 88 14 -62 79 -4 134 -62 -80 14 -18 62 -83
855h3m4J27m7j60J53O9O2j04O2M9p3l3J10K2j29R3qj18J55j12k07K28j09J38j27O9kk9J7J43
$$ -83 -127 0 -47 -207 -54 15 77 -27 35 84 11 -22 88 110 -19 74 66 -52 103 -9 -216 12 -97 41 -86 -17 -19 -48 -31 112
592A12j37l4K8O7Q4o8l2j64J56L6j79J58j30M9L6J03n5o6M9L9j15Q0Q3n7L4q4k9m3K8p5J27
$$ 112 -25 -59 -31 36 120 52 20 -144 12 48 -131 27 -103 -54 -18 85 30 -36 13 52 -63 17 100 43 77 -7 -36 -79 -51 -126 1
321AJ01k3m3k5j7K5j56m4J60J07q0j60J17J08K9l8p1m1O3j90O4M5om5O3J77j06O5j00K2j0
$$ 1 102 79 36 11 -6 19 -137 -181 -21 86 6 -154 -37 71 100 62 -9 -50 13 -177 -113 -68 -74 -119 -56 121 15 80 -20 2 -8
50hj9J81j46M3lp9p0J02j0Mk0N1M7N1r0j2p1JJ04j2j02P2j35J22qK8k1l4K0L0n9J7
$$ -8 -27 154 8 51 48 -31 -101 1 -9 -5 -25 26 73 124 34 22 -49 -48 56 44 -58 14 -121 1 -7 21 0 -34 -14 16 -43 -26
-230b6
##PAGE=	F1=12767.8
##FIRST=	23146.755397984237788,	4241.1433691826614449,	0.049216508865356445313
##DATA TABLE=	(F2++(Y..Y)), PROFILE
4241A0nnm9L5M7R9j87K4O4k6j18J3oJJ79j04r8K17p8p8J95q2N2j52L8r5J18PpJ05j40J58n9
$$ 10 5 0 -49 -14 33 132 -55 -31 33 7 -111 -98 -104 -103 76 -28 -126 91 13 -65 130 48 100 -52 -14 -109 9 16 9 114 -26 132 73
3952G3p3J15r6k03K2K79j81K1P0r7M5j68J57mJ0K5L2L9Kj79J46P6j57J43q3r4N6j14J92p7
$$ 73 0 115 19 -184 -162 117 -64 -43 27 -70 -25 -193 -36 -40 -30 -5 27 66 68 -111 35 111 -46 97 14 -80 -24 -138 54 -23
3690b3pJ06j37P8j1Lq8K6N5N8J6j2j54J08j70J16N3Oj11p9K59n3j6N1j21r3J21Km1J49j50
$$ -23 -30 76 -61 17 6 9 -79 -53 2 60 76 64 -90 18 -152 -36 17 23 -88 -167 92 39 23 74 -47 -140 -19 -17 -58 91 -59
3419e9j7J62jl2pj38M9k3m1J97m2j2N6p6K7j43N7O4q6Q5j34P1O6J6j8M5j15L7N2j30J12K9
$$ -59 -76 86 85 53 46 -92 -43 -66 -107 90 48 36 92 16 43 -100 -43 21 -65 20 -114 -43 23 39 21 66 -49 -12 40 -90 22 51
3139E1K14m19M6L8J39j44K47j35K9k2oj09J5P8p2P1m2j3M2J521J471j229j471k8j61qn0n6
$$ 51 265 -154 -108 -70 69 -75 172 37 66 44 38 -71 -56 22 -50 21 -21 -34 8 1529 3000 1771 300 272 111 103 53 -3
2894clK29L9l01K2Q7qp8O9j02J68j37kJ07Q0p7r2k7R0J35k13q%M9M6nj9q8J22o1K7q3p2N2
$$ -3 -6 223 262 -39 -17 70 62 -16 53 -49 119 -18 -20 87 167 90 -2 -29 61 196 -17 -25 -25 24 70 65 46 -42 80 19 46 -37 -109 -57
2596e7J88q5q4l4J2l8R1R1m3j2Rj01J79R0j97j33J09j6O6o5RQj5N5J0Rj6p1J11K2J0j61N6
$$ -57 131 46 -38 -72 -60 -98 -7 84 41 29 38 -63 116 206 9 -124 -15 -31 35 -30 -21 -13 -28 27 37 46 30 -41 70 92 102 -59 -3
2307co2K7J99k3j73k0O3J06j34j10j1Q6J68k68L3K06k13K4R5j7O0m7P7n2m4MR5J01k19L2j8
$$ -3 -65 -38 161 138 -35 -55 8 114 -20 -130 -141 -55 113 -155 -122 84 -129 -105 -10 -27 33 -14 63 11 -33 -29 66 167 -52 -20 -38
2036c8l0Q0O8k4M0r2l2j0m5J3J81j03ql9L1m0J18n4k2K6p3m4J49J27k17P5j49K36j19K5%P
$$ -38 -68 12 80 56 96 4 -28 -38 -83 -70 111 8 0 -39 -8 -48 70 16 -6 20 -53 -97 52 179 -38 37 -112 124 5 30 30 37
1756C7rM2q6M3J5q8K8M1J4J5N2K9j33O4o3Pj23N5r8J67q6m9P8O2O9j62K5n8J81r9j08k9nJ18
$$ 37 28 70 -16 27 42 -46 -18 23 37 52 104 133 0 64 1 8 -115 -60 -158 9 -77 -126 -48 14 83 -79 -54 -112 69 -30 -138 -167 -172 -54
1458e4J32om1P1n2O6r5L7m5n1L2J22K2j89J3l7l7n2J19J34l3k6p2R0L7L0j31qk0l6J0K5J19
$$ -54 78 72 31 102 50 116 21 58 13 -38 -6 116 138 -51 -38 -75 -112 -164 -45 89 56 30 -42 48 85 115 -16 -24 -44 -80 -70 -45 74
1170G4q4j8O8kl3l0J2l0N3o9JJ3P7j34N0kN6K4n8Q8Q2q2Q3j24M0j5j59J81m5J22k05k2Q1K2
$$ 74 -10 -28 40 38 5 -25 -13 -43 10 -59 -58 -45 32 -102 -52 -54 2 26 -32 56 138 56 139 15 55 40 -119 62 17 139 -66 -88 -7 15
872A5J05j84p4J55k9j74J45O9L9j35J09N7n4m3J22k0j51Q9L9r5J69k15j62K34j19J84j35M4
$$ 15 120 -64 -138 17 -12 -186 -41 28 67 -68 41 98 44 1 123 103 -48 41 80 -15 154 -61 -223 11 -108 76 -59 -15
627a5J4j9k0J94r2q0j0P6J07j02l9j26J74m0j83J94j30M8NR6Nq7R6k9j31J30L9n3P8o9k5p7
$$ -15 -1 -20 -40 154 62 -18 -28 48 155 53 14 -112 62 22 -161 33 -97 -49 -44 52 57 -30 66 37 -94 36 75 22 100 31 6 -71
347g1J3l6J34J17r7K5r8QM4j31pP1P0k6j55J08R3O1m9o5r4J06j69Q6Ln5K4O5J15m9J4o5L7
$$ -71 -58 -94 40 157 60 85 -13 -5 39 -92 -99 -28 42 16 -139 -31 62 123 74 9 -85 21 -148 -62 -59 -114 -90 -25 90 41 55 -10 27
58B7k1k1J68j84Q1qp8rP6o6KK4L1O3J9j11j2o2K4J07K7j23P0j28J09%M0J0q8L5L9p1K5
$$ 27 6 -15 153 -31 50 42 -36 -45 31 -35 -33 -9 22 85 104 -7 -19 -81 -57 50 77 -46 24 -104 5 5 45 55 -33 2 41 -30 -5
-230e
##PAGE=	F1=12720.7
##FIRST=	23146.755397984237788,	4241.1433691826614449,	0.10537493228912353516
##DATA TABLE=	(F2++(Y..Y)), PROFILE
4241B2rOl6J3K8P9j63M9M2n8j02P2o3L4J13o7k5J13Mr7J90l0n1j50O7o6J00M6n3J15p5J26
$$ 22 13 19 -17 -4 24 103 -60 -11 31 -27 -129 -57 -120 -86 27 -40 -65 48 52 -45 145 115 64 -86 -19 -85 15 61 8 123 48 174
3961A74j09m5P4p8k15M0K27r2j0O1o3J6j75J81rL2l5N3R3q7j22J16R2j70J78j43n5N0j01J78
$$ 174 65 20 94 16 -199 -159 68 -24 -34 27 -36 -20 -195 -14 -23 9 -26 27 120 33 -89 27 119 -51 127 -16 -71 -21 -122 56
3699E6r6K4J04j40L5K3M4p5J6L1K0N5m6j06N3j23P2N5L0j34m8K45q2K3L8r3q3P0k8J7J73j77
$$ 56 -40 -16 88 -52 -17 6 50 -25 -9 22 42 97 51 -55 -2 -125 -53 2 32 -102 -150 95 13 36 74 -19 -102 -32 -60 -43 130 -47
3419d7L0J33m2j6j7j43P0k7L0J27k5m5O0j01O7j60Q2L2m7P3j25P0L2L0J6M8j43L9N0j14R6
$$ -47 -17 116 74 58 41 -102 -32 -59 -29 98 73 28 88 -13 54 -106 -24 8 -39 34 -91 -21 11 41 57 105 -38 1 51 -63 33
3147C3Q1q6r2K3o2J76j18J76r3K7k5mn7RK4l5rk3QLN27L66l30m05J50j92j2L0q5M3Q1n7q4
$$ 33 114 28 -64 -41 -103 73 -45 131 38 65 40 36 -21 -12 12 -23 -32 -55 -47 -44 483 849 519 114 264 72 60 90 5 48 129 72 -12
2859a2L1O8mq4N5q6J31j37JP0R6j7j46k8J44J08k10O5l3l9J00j6qn8O7n0L2r8j3PJ85j6j39
$$ -12 19 87 83 -1 54 -32 99 -38 -37 33 129 112 -34 -62 82 190 -20 45 12 -27 73 57 49 -9 58 8 40 -58 -71 -64 121 105 -34
2570c4k8l3j5J26R2o4m8K6n3J43K2j49o7N7J1M1n8J5j1l7P4L9m2j1l1J36J6j1j63P1r7J5J86
$$ -34 -62 -95 -110 16 108 44 -4 22 -31 112 134 -15 -82 -25 -14 27 -31 -16 -27 -64 10 49 7 -4 -35 101 117 106 -57 14 -83 -68 118
2281A18l6j10LK9J58j72j41rJ38J17k24l5K42j60m6J09RLL7M3q9j3N1M7L7j44L5l5l9Q2K5
$$ 118 82 -28 -25 4 162 -10 -151 -160 -22 95 -129 -164 78 -82 -128 -19 -10 -7 30 73 -16 -29 22 69 106 -38 -3 -38 -77 5 30
2010C0MR3j42Mm7Ol0J74q5QpL3q8Q0k8j7P9j03o3J18J27j98R0k21K62p9l3KP1j0M0r7O3J1
$$ 30 34 127 -15 -11 -58 -52 -82 92 7 15 8 41 -47 33 5 -12 67 -36 -99 19 146 -52 38 -183 79 0 -33 -31 40 30 70 -27 36 47
1712D7n5mj3R1j0M5K2j16N8p3M6j83J05j16J60r6m8Q6O2R8j91Nj5J09p9p7O5p6P8J74nn6N4
$$ 47 -8 -12 -25 66 56 101 123 7 65 -8 38 -145 -40 -156 4 -92 -140 -54 8 106 -85 -80 -95 14 -65 -142 -77 -153 -75 99 94 38 92
1423I2r5J24r6M7k4q2N2J24J7k32L9q9L0l4J09O9k5l0J3P4l5K9q0l9K6m4QM2Q2j20O3K8k1
$$ 92 -3 121 25 72 48 -34 18 142 159 -73 -34 -123 -93 -127 -18 51 26 -4 9 83 48 77 -3 -42 -16 -60 -52 -10 72 -48 15 43 22
1135B2j2n1P1n0J8j01j3Q6K6m7J6k3J01l7n2J03M7o7P8q8k7Q3k30J69J2Q4k05K5L1Q9Q0k17
$$ 22 10 -41 30 -20 -2 -103 -116 -30 -4 -51 -35 -58 43 6 -46 57 104 37 115 27 0 83 -147 22 34 118 -87 -62 -31 58 138 -79
855g9o1J81k7j54R0R8Kj40J54K8m2k3R4n3j43R1N2n1J21k41j24J85p9J81j09K9L9l2LJ89k8
$$ -79 -140 41 14 -140 -50 48 50 -90 64 92 50 27 121 68 -75 16 68 17 138 -103 -227 -42 -121 60 -49 -20 19 -13 -10 179 151
583A51j26l4O6Q3j02n3m5J54q3j58J92j13K1RQ2K2j14J36p2r2J55m3m0J01l2n6p5j5J4J56
$$ 151 25 -9 57 140 38 -15 -60 94 11 -147 45 -68 -47 -38 44 66 -48 88 16 -76 79 36 -4 97 65 9 -66 -81 -67 89
321H9P8j11O0j33J9M8q0PK1%L6j51J08Q3L1l9n2j12J37j14O4nj24Q7L5P4Jl3Qlj6j4J12j75
$$ 89 167 56 116 -17 2 50 -30 -23 -2 -2 34 -117 -9 74 105 66 14 -98 39 -75 -11 -16 -140 -53 -18 56 57 24 32 29 13 -1 111 -64
23f4R8j3p4R0jp6J4K2K3N5J8j10no1M7P3Q1j08J7q1O5nM1N0j15M8J0m4L9
$$ -64 34 21 -53 37 36 -40 -26 -4 19 74 92 -18 -23 -84 -37 36 117 9 26 -55 10 5 46 96 -19 29 39 -5 34
-230C4
##PAGE=	F1=12673.5
##FIRST=	23146.755397984237788,	4241.1433691826614449,	0.020816564559936523438
##DATA TABLE=	(F2++(Y..Y)), PROFILE
4241DKL2k4j0J0O0j53N8M9o1r8J14j18O6O3j5L1oR2j13J40L7j45j35R6l6O7O8r8J25qR1j44
$$ 4 6 38 14 4 14 74 -79 -21 28 -33 -131 -17 -135 -69 -6 -21 10 4 96 -17 123 160 15 -120 -24 -60 7 75 -23 102 94 185 41
3952D1%M3m9j96K8J48l0k5O6j7lj65J59j0N9r7P4J47j74o6Q6J12j80J84j74j9M0q8J65j12
$$ 41 41 84 35 -161 -133 15 -15 -40 26 9 6 -159 0 -10 49 -48 26 173 -1 -67 19 131 -49 135 -39 -58 -18 -106 59 -53
3690e3N7P2j11j4N5Q6o5QPj7R4q1n7mp4K7N8M9j61J5J98j05O5K5o6p1J9n2Q1J46j53N3Q4o8
$$ -53 4 76 -35 -49 6 92 27 35 42 25 119 38 -19 -23 -97 -70 -12 37 -124 -109 89 -16 49 74 8 -63 -44 -96 -15 131 -22 31 115 47
3392D7J6k7j49R2l2J01N8l2j03Q8j03J09j76J05Kj3N7q5L8MM5N1N0j66M5J7o7N8J09k51O2
$$ 47 63 36 -113 -21 -53 48 106 74 -29 59 -44 65 -111 -6 -4 -17 40 -45 -7 -3 42 93 143 -23 22 39 -28 30 139 -112 -50
3121e0Q3j38J55q8J18m1M3pm9Rjl1Jq9QL9k4J31n9k8KK54k13rJ03j22J25L95l7l00j45M2J4
$$ -50 33 -105 50 -38 80 39 82 75 26 35 34 3 4 -85 -77 -38 -62 69 10 -18 -16 238 25 16 119 -3 122 517 480 180 35 77 91
2832I1p7M1p0R4j37QL8Q3P9k35lJ91P3j76J09o3j25J56k8Kk8J2l8N2r8L1n2J67L6j78qp7P
$$ 91 14 55 -15 79 -58 -50 -12 71 150 -85 -88 103 176 0 109 46 -79 77 49 51 23 35 -3 49 -49 -18 -70 97 133 -45 -53 -130 -123
2544a23J63R3q7q5M4nJ03m9p2l0J0M0J8n2K1l0n5R6M3n9m2L7J32j8lj32L7q2k0J51l3l1J7
$$ -123 40 133 46 -39 5 0 103 54 -18 -48 -38 2 20 -32 -11 -41 -96 0 43 -16 -58 -21 111 93 90 -42 -5 -87 -107 44 11 -20 -3
2255cj4J69j52j13m9J81N7j60q3K28r7q9Q9M2m6P4J9q4kJ04%k6o9N3l7o2P0j9L1J47j93L9
$$ -3 -17 152 0 -113 -162 19 76 -84 -167 61 -36 -125 -36 6 -40 34 53 -31 -33 71 71 45 -24 29 -8 -70 0 -19 12 159 -34 5
1975Eq2N7p5J67o5K4K4L9j33J4K7l0J11r8m8M3J41j87R8k63K57l6q8rJ20LN3j07Q3Qk4l5o7
$$ 5 -77 -20 -95 72 7 31 55 94 -39 -25 2 -28 83 -15 -63 -20 121 -66 32 -231 26 -10 -98 -107 13 16 69 -38 45 53 29 -6 -73
1686g3J72l2j1K6p3J9o5J05k30J63j13J12j33j4R1N8J27k20j6K8L9o1m9J55r4K8J29J1n4N7
$$ -73 99 67 56 82 9 28 -37 68 -162 1 -112 0 -133 -147 -56 2 129 -91 -107 -79 -40 -101 -150 5 -89 -61 68 79 25 82
1423H2j38J81r5N7lj14M8R9L7k49O5j41R7j6R3LJ3o5R9N8p8kk1o3M1k1PN7K1j23R5%m7Jl1
$$ 82 -56 125 30 87 84 -30 18 117 154 -95 -30 -171 -74 -90 3 6 19 -46 53 111 33 31 10 -53 -12 -33 -26 31 52 -71 24 24 -23 -22 -53
1117e3J11l7m4j12pJ42m1M1j7m6J47r3m3Q2M1k6L8m8r0J96k85J43N2M7k05P9j3J35L1k26k7
$$ -53 58 21 -23 -135 -142 0 -41 0 -17 -63 84 -9 -52 30 71 45 83 35 -55 141 -144 -1 51 98 -107 -28 -41 94 125 -101 -128
846a28J89m3j05OJ35k8j16J68Nk6j2N9o3j13P9M9l0M9j63j23R7j4J23l7J6O5m1K8J41N0j53
$$ -128 61 18 -87 -81 54 26 -90 78 83 57 45 104 41 -72 7 56 26 75 -88 -211 -114 -128 -5 -42 -26 39 -2 26 167 217 64
575F4m1L6L5q5n4K2J19r2r8J46p7l1M6N4K4j36J21o8oJ35j10m5J04Mq6n8k8O5J75Jo5O4j40
$$ 64 23 59 94 9 -45 -23 96 4 -94 52 -25 -56 -10 44 68 -68 53 -15 -21 114 4 -41 63 67 -19 -77 -105 -40 135 136 71 135 -5
286erO8l4J6nm7Q3j61J13Q3j5m5j9j10J32l2J4K2k11J31J2M1N2p9Q0m4ooK8j35J09k1q5J74
$$ -5 -14 54 20 36 31 -16 67 -94 19 102 87 42 23 -87 45 13 27 49 -162 -31 -19 22 74 -5 75 31 25 19 47 -88 21 0 -85 89
-12H9m9n6J2MJL3M5p9mo8N5K3J42q3l6l5J3j5K8Q0r8M5j4j4N5
$$ 89 40 -16 -4 0 1 34 79 0 -4 -72 -17 6 148 65 29 -6 7 -8 20 100 2 47 33 19 74
-230G4
##PAGE=	F1=12626.3
##FIRST=	23146.755397984237788,	4241.1433691826614449,	-0.17514276504516601563
##DATA TABLE=	(F2++(Y..Y)), PROFILE
4241c7J9M2k3J1j6N0j16K8N4l5j25J53j39Q5L7RO3j05J30q5R0Q3j89j14J10k1L3O7j13J11
$$ -37 -18 24 1 12 -4 46 -70 -42 12 -23 -148 5 -134 -49 -12 -3 60 -45 85 0 90 173 -16 -130 -20 -41 -8 59 -54 57
3979E7K6Q5j59K6L8l4j18mO0mk8P2L7k2j57J12OO6r3O8J64k38oO1J09j74J55j45J0L6j28J98
$$ 57 83 168 9 35 73 39 -79 -83 -23 -27 -55 17 54 32 -125 -13 -7 59 -34 34 198 -40 -46 15 124 -50 105 -40 -30 6 -122 76
3699G6j32L8N2m3o5J03J05n8k1k2l4J16q7j4k1m9j5M5P1j80N9J37j18J10k1%n4k5o7J25P8
$$ 76 -56 -18 34 -9 -74 29 134 76 55 33 -1 115 28 14 -7 -56 -71 -26 45 -135 -76 61 -57 53 32 32 -22 -47 -114 11 89
3427H9p6J6N2p8P2m5j32R3j2J09Nl2j59J09m0J18j86J12m7K9P0l7Ll6L5R9M2j51J1k3j2J3
$$ 89 13 29 81 3 75 30 -102 -9 -21 88 93 61 -98 11 -29 89 -97 15 -32 -3 67 30 33 -3 32 131 173 22 33 10 -2 11
3147A1J39k73P1J33j72J09m7N5qQ8pq5O1Lp8J7j43N2N6m3J88J7k12m8K93k07K7J38j56L13
$$ 11 150 -123 -52 81 -91 18 -29 26 18 106 99 14 75 78 0 17 -126 -74 -18 -61 127 144 -68 -116 177 -30 -3 135 -21 292
2885B92J248J21j043n60jM1n1Om2N8j33%K9O8J36k85K5J70M1j04J35p1j65J51k6j6J4k8k7
$$ 292 1540 1661 618 58 57 98 47 53 11 69 -64 -64 -35 33 169 -116 -91 79 120 16 151 80 -85 66 40 24 38 10 -17
2631a7Q6j21R3j03J19N5j88M1r8M4J41R2r8q1K6M9N4j07klKL1J4n6L2n7n6J07K1l6p1Q4J11
$$ -17 69 -52 41 -62 57 112 -76 -35 -133 -89 52 144 46 -35 -9 40 94 -13 -15 -18 -16 15 29 -27 5 -52 -108 -1 20 -16 -87 -3 108
2342A08p5L0o9m3n1k2J00m2M0ok8J41j04k6q1J65K1p5j26J89m8p2M7L6n2N0J8l4l5J33l0l5
$$ 108 33 63 -6 -49 -100 -122 -22 -64 -24 -30 -58 83 -21 -47 -128 37 58 -17 -143 46 -2 -74 -27 9 -43 7 25 -9 -44 89 59 24
2062B4j2P3m9j07P1m9N1J77k31Q4q9O7q3J30o1K5M1Q4j48p9P9n3J11n4On2J18j34Q9k61J93
$$ 24 12 85 36 -71 0 -49 2 179 -52 32 -57 10 -73 57 -4 21 62 146 -2 -81 -2 -55 56 2 8 -44 74 -60 29 -232 -39
1791c9k0r1LJ14K7Q6j23R8%qp7o7K31o4o7N4m5k1n8J55k43J90j03N3j51M1R8j0J39j96lO1
$$ -39 -59 -150 -147 -33 -6 80 -43 55 55 47 -30 -97 134 70 3 57 12 -9 -67 88 -155 35 -68 -15 -166 -125 -27 -37 102 -94 -97 -36
1511c6l4n7jJ87o6oK3J7l2L8j53K07q5J07rj41K5J04O1k45P0j66J41k4Q8m2Q0r0J16L3p9o6
$$ -36 -70 -127 -128 59 -7 -13 10 27 -5 33 -120 87 2 109 100 -41 -16 88 149 -96 -26 -192 -51 -75 13 -29 51 -39 77 110 31 -35
1231c5O9p3J3K2MM3k8o6P1l6n1%kJ05nj00p7KJ89j01R0o7k9J51j09k9M5M8J8m3Oj33K77k76
$$ -35 34 -39 -26 -4 0 43 15 -51 20 -16 -67 -67 -69 36 31 -69 -146 -144 45 -56 34 -33 -62 89 -20 -49 -4 44 62 19 25 -108 169 -107
933a07J03M8Nj46J01l9J42j2j93k0J86q1l8o0J54k9p3J19j5NJ1K5m9p3M1M3l2j9m2j39QM4
$$ -107 -4 44 49 -97 4 -35 107 95 -98 -118 68 -13 -51 -111 43 14 -59 60 45 50 61 86 37 -36 5 48 16 -3 -45 -184 -176 -132
653a32M3O1k1J09n3O9O1J14j78j3kl7o5k5O0R0o6m2N9k4o7R2J1L0j35M9j4Q0Q3j35o6R4J5
$$ -132 -89 -28 -49 60 7 76 137 251 73 60 58 21 -44 -69 -9 81 15 -27 32 8 -59 33 44 74 -61 -12 -26 54 137 2 -64 30 45
365D5q5o4k3R3J83p1J6M0j08n8R1l6M1J1p3Q5j50R7R7n8m8j6p5J12L2j2K8k63J29L1J3N5q6
$$ 45 -40 -104 -127 -34 149 78 94 134 26 -32 59 23 64 75 2 87 -63 34 131 73 25 9 -66 46 78 66 94 -169 -40 -9 4 59 -27
76b7J26r6K2Ol0q7J09m1q7K14q2P%j4k4lQ3n1k0n6L4jJ61l6o8kk7n0M2O7o1M7n4K8L2
$$ -27 99 3 25 31 1 -86 23 -18 -105 109 27 34 34 20 -4 -7 76 25 5 -51 -17 -18 143 107 39 37 10 -40 2 69 8 55 1 29 61
-230F1
##PAGE=	F1=12579.1
##FIRST=	23146.755397984237788,	4241.1433691826614449,	-0.37110209465026855469
##DATA TABLE=	(F2++(Y..Y)), PROFILE
4241h0L8N1j9K9m1M1q0kO0j0j56J90j34P0N0J3N2j47J17m5L0J22j89j07J28moO4r3P0L0J08
$$ -80 -42 9 -10 19 -22 19 -61 -63 -3 -13 -169 21 -113 -43 7 20 72 -75 42 -3 27 149 -40 -147 -19 -23 -29 35 -58 12 42 150
3961A50j46J9L5j4m5l8%qk8Q3R0m1j47O4QN7o8Q3J30k51M7L1J09j64J01q3MO1j74K28j53J9
$$ 150 4 23 58 44 -1 -39 -39 -47 -75 8 98 57 -90 -26 -18 39 -29 54 184 -67 -20 11 120 -44 57 -26 -22 39 -135 93 -60 -41
3681d1L3K4j14J51J07o5l5l6n5J35p9j5j9nn9L3J07j84R0N9j30J54o4O5l8o8q3J69nj4k5J5
$$ -41 -8 16 -98 53 160 95 60 24 -31 104 25 10 -9 -14 -73 -40 67 -117 -27 32 -98 56 -8 57 19 -49 -132 37 32 18 -7 8
3401Hl8J17q5p7O2L9O7l7mj88J20RJ17j47P0q5O5Q1Ql6m7nJ51L8j35k5o1M1m1J56j69K3R7
$$ 8 -30 87 2 -75 -13 26 93 56 52 -136 -16 -7 110 -37 33 -52 13 94 102 66 19 14 165 203 68 43 -18 23 -18 138 -31 -8 89
3112H9j49N2j9K4pJ36kj21J11Pj24L3j97Q7O5m4L65K63n71k11K79j47N8J44j59N55K340L65
$$ 89 -60 -8 -27 -3 -10 126 124 3 114 121 -3 30 -167 -80 -15 -59 306 569 -2 -213 66 -81 -23 121 -38 517 2857 3222
2867C222k045j080m7O1l1k9j4K2j28jL0O9J09k61O4Q7M9n0J43p6j39R7j4l8N3o7j8J24j40
$$ 3222 1177 97 50 111 80 51 37 59 -69 -70 -40 29 138 -123 -59 28 77 27 170 94 -45 52 38 0 53 -14 -32 92 -48
2614d8J26j25N3N4j85J00q8N0J09Q0p0l9j7Q0K1j51N1J0pK4J1o0M4q6n6J16Kj4j02J31R2j32
$$ -48 78 -47 6 60 -125 -25 -113 -63 46 126 56 17 0 80 101 -50 1 11 4 28 39 -21 23 -63 -119 -3 -1 -15 -117 14 106 -26
2334b6O2pj23k0qO3o7R8k8m3J17n3L5p9J19J6k6j41J28k2j1j0N4l6j8L2J4o9J28l7MrR8n4
$$ -26 36 29 -94 -114 -122 -59 -126 -28 -56 -99 18 -35 0 -79 40 56 30 -111 17 -5 -16 -26 28 -8 -26 6 20 -49 79 42 46 37 135 81
2036H1j53P2p3P7J60k14R2p0P3r6R3n7J2M2J40j53j43R4l9Q3oO5j37J07n5M6k40Q6K6o5rQ1
$$ 81 -72 0 -73 4 164 -50 42 -28 45 -51 42 -15 -3 39 179 26 -117 -23 -62 21 15 80 -57 50 -5 41 -199 -113 -87 -152 -161 -80
1756h0N0J20j38J13qQj14o5K60o6j07R7o3m7n2K00k56K18r5nj54J12R3r0J18j46L3N7o2o9
$$ -80 -30 90 -48 65 57 65 -49 -114 146 80 -27 70 7 -40 -92 108 -148 70 -25 -30 -184 -72 21 -69 49 -97 -64 -7 -69 -138
1493a38M0J52j0rq1K1j6J4j19J82o7J63j6j68NJ15N7k07N6j49J67n2Q2q7J53j11R7L5n0j61
$$ -138 -98 54 44 35 -46 -25 -41 -27 -146 36 -31 132 116 -52 -47 68 125 -82 -26 -175 -8 -60 22 -65 88 -23 74 109 59 -102
1231a02J34m9k1O2j5J5m0K2Ln9m1J0J2Q2K4j60pj5K16j21Q6p1l6J36j10%ON7O5j18L5j41L03
$$ -102 32 -17 -38 24 9 24 -16 6 9 -50 -91 -81 -69 13 37 -123 -130 -145 71 -50 36 -35 -71 65 -45 -45 -39 18 83 -35 0 -141 162
942A62k19N5L9l7q7J28o2J12l2j13o8J94j10Mr2J39ml2O4l5L7L4qk0k0j4J6l6l0L3j39m8P6
$$ 162 -57 -2 37 0 -87 41 -21 91 59 -54 -122 72 -38 -34 -126 13 9 -23 41 6 43 77 69 49 29 15 31 -5 -35 -2 -141 -189 -113
653a13m0J53n7J53p5R7j4J23j75M6m0j10l5J6M3O4oj3j7M2r6J46m5K6j01n0N4J16N0j42p9
$$ -113 -153 0 -57 96 21 118 104 227 52 98 58 -52 -87 -71 -28 36 30 17 0 42 -54 92 47 73 -28 -78 -24 92 142 0 -79
382g9R1J8r2o1j1R5J65r7Q0K0p1j16J07m2O2J6m8M4j20O8J00q6l5j1m2P8P9m4K7k48R2N6q
$$ -79 12 30 -62 -123 -134 -39 126 29 109 129 58 -58 49 7 69 85 37 81 -39 29 129 43 8 -3 -45 33 112 68 95 -153 -61 -5 -13
93a3O1q9J33j23N1K2q7l8J09o1o4J77n9O5l7Jm5k8Q7Mp6k7K7j0J18Qp8N4p0q4M9M7j6N5r3
$$ -13 48 -41 92 -31 20 42 -45 -83 26 -35 -99 78 19 84 47 48 3 -25 62 66 -10 -37 -10 -20 98 106 28 82 12 -72 -23 24 8 63 -30
-213c0O9Q
$$ -30 39 47
-230D7
##PAGE=	F1=12531.9
##FIRST=	23146.755397984237788,	4241.1433691826614449,	-0.44178128242492675781
##DATA TABLE=	(F2++(Y..Y)), PROFILE
4241i5M7N4k9N1k4Mk1m2N3rj63J82j01Q6M2j2N0j55O9k9J6J36j57q7J27l1j5N5l8K2RJ12j07
$$ -95 -48 6 -23 28 4 8 -13 -55 -2 -11 -174 8 -93 -7 35 23 73 -82 -13 -42 -26 110 -47 -134 -7 -38 -53 2 -36 -14 -5 107 0
3952@rO1m1M9n6l1m3l8R5J05o5p8K3K0k7%J11P7k30N8J4J12j70P1ol6J10k19K53j65k3M9N6
$$ 0 -9 52 11 60 4 -27 -70 -108 -13 92 27 -51 -28 -8 -35 -35 76 153 -77 -19 -5 107 -63 8 2 -34 76 -143 110 -55 -78 -29 27
3664B7j43J82P8p4n1k5n7J35n9m3pM4p7LJ60j76P9J8j43J61r0J36n8n8j00J62n5N1m9l4K8
$$ 27 -116 66 144 70 19 -6 -63 72 13 -30 -37 7 -70 -67 93 -83 -4 14 -129 32 -58 78 20 -38 -138 24 -31 20 -29 -63 -35
3392c5J14j38J4K7P6J5o3L3j72J17L5R3r6J8q6Q9O6K1l1l3n8J50K8r2p9o0O3p6J66l4k2Mq6
$$ -35 79 -59 -45 -18 58 73 10 43 -129 -12 23 116 20 38 -48 41 107 128 97 64 6 156 184 92 13 -47 16 -60 106 72 50 54 -32
3104c2L3jj3k1J58l7j13J50pj17O1k20P7O5l3M52M23q48k71K57n4M5J28j51P66L102N57k770
$$ -32 1 0 -13 -34 124 87 -26 124 117 0 61 -159 -82 -17 -50 402 825 -23 -294 -37 -91 -46 82 -69 697 3799 4356 1586
2859A586j439r7P9k9l3j8nj05nL3Q6K3j91R7j3P0rJ22p0p6K4J9n8M2n7J3J19j77J40q5oL9
$$ 1586 147 50 129 100 67 49 44 -61 -66 -33 53 76 -115 -18 -31 39 30 152 82 6 30 49 -9 33 -24 -11 108 -69 71 -14 -20 19
2579A9j72J44n2JP4O7j3Ro0O8Nj14M2K0j5L5l7m0N0j21KR9l7%r2J60M9j64R0K4j79L1J2K3
$$ 19 -153 -9 -61 -60 14 81 68 77 17 85 90 -24 18 38 23 58 21 -19 31 -90 -88 11 -26 -26 -118 42 91 -73 17 41 -138 -107 -95 -72
2281g2p2J03l9o2J25l7M8j4N6L0Oj23N6n2O1k9O9%r9M7M5q5R2j4M3o5J26n7j69Q4n3O7J02
$$ -72 -144 -41 -80 -142 -17 -54 -6 -20 36 66 72 -51 5 -47 14 -15 54 54 -45 2 47 -38 54 40 83 18 144 87 -82 2 -51 16 118
1992A18j39M7l3Q1q8J5j7lMJ86j44j57J03k5L7J1J18j60Q4Rkk09j7P6j1k9M9M0R0j04J57m3
$$ 118 -21 26 -7 74 -14 1 -16 -19 -15 171 27 -130 -27 -52 -15 -4 114 -46 38 47 45 -164 -181 -105 -116 -145 -96 -56 34 -70 87 44
1712D4J0j17l7K26n4j14J50j33l2l1J81k45K35o6j9j42J33O0j43P7q6Q7J5l8q3M7J01MK9j45
$$ 44 54 -63 -100 126 72 -42 108 -25 -57 -88 93 -152 83 17 -2 -144 -11 49 -94 -17 -103 -16 -1 -39 -122 -75 26 30 59 -86
1450h6J9J1j9o0J04n6J97nj77OJ57j7j40O2j27J31m3P3r8J70q5MO1J2k26J54l2l4N9Ok4m6
$$ -86 -67 -56 -75 -135 -31 -87 110 105 -72 -66 91 74 -66 -4 -131 0 -43 30 -68 102 17 21 82 94 -132 22 -10 -44 15 21 -3 -49
1170d9J23n8q8j1kJ2N5K8j54P3l4J76r7M9n3n0J21q7J3oO3P2j41L5j30K81j37L3J0q3j7J13
$$ -49 74 16 -72 -83 -85 -73 -18 10 -144 -71 -105 71 -26 23 -30 -80 41 -46 -33 -39 24 96 -45 -10 -140 141 4 37 47 -36 -53 60
890F0p7P4nk2j35J74r1J0r0Q3L1j2Lm3O5K2J9j5O9r4nn3J3K3r4o1O6p1J77o5J65p5P7m3O5
$$ 60 -17 57 52 30 -105 69 -22 -12 -102 -19 12 0 3 -40 25 47 66 51 120 26 21 -32 -19 4 -90 -151 -85 -156 21 -44 121 46 123 80 145
583A45j29R2l5j82j4Q8j2M4L4Oo5R2r2J71j14M4o5j22J17Q8K6j25n8Q3qo3p3MO9J29q5J04
$$ 145 16 108 73 -109 -123 -35 -47 -3 31 37 -28 64 -28 143 29 73 8 -114 3 91 117 -8 -66 17 9 -54 -127 -123 -54 75 -10 94
303I4Kj7j43R1n4O8J3Mj0o5jJ09n4m9j5l1P9Q7n6Mj79M6O8k5P8p3J01j40Q7J4r6j6J06q5k1
$$ 94 96 79 -64 27 -27 41 54 58 48 -17 -18 91 37 -12 -27 -58 21 108 52 56 -123 -77 -9 -34 44 -29 72 -68 19 33 -63 -79 27 -58 -79
-3g9J14mQ8o0K4m7n4N2P2j41LM5k2M8K8n3Q9o4j36N5K0K7O4j08R4l4
$$ -79 35 31 119 59 83 36 -18 34 106 -35 -32 13 -9 39 67 14 103 39 -97 -42 -22 5 69 -39 55 21
-230B1
##PAGE=	F1=12484.8
##FIRST=	23146.755397984237788,	4241.1433691826614449,	-0.51246035099029541016
##DATA TABLE=	(F2++(Y..Y)), PROFILE
4241a10N7N6m2O7L0o0K4l0K0k9j40J46o5J05L4l6M8j64K0j1%J51j25o8J25n7k4M8L0j0k9J02
$$ -110 -53 3 -39 28 58 -2 22 -8 12 -17 -157 -11 -76 29 63 27 75 -89 -69 -80 -80 71 -54 -122 3 -54 -78 -30 0 -10 -39 63
3961F3o7l7Q9o0R7n9n2o8m7J05J07j04NkL2j11O8J39K4k08O8lJ16j77M2P1q4J55k15K27j59
$$ 63 -4 -41 48 -12 85 26 -26 -94 -141 -36 71 -33 -28 -30 2 -109 -41 98 122 -86 -18 -21 95 -82 -40 31 -53 102 -113 114 -45
3690d5m9P9L9j39J87N2p9o6j7n6J35m1p0MR5r7k6K12j68O4k5j26J39j14K11p8m7j22J51p9
$$ -45 -94 -15 24 -115 72 124 45 -21 -38 -94 41 0 -70 -66 29 -68 -94 118 -50 14 -11 -137 2 -112 99 21 -26 -148 3 -76
3427g6Q3k8j00J16O8j87J09rJ14l4q3O3j00O9K0Q6k6o5n7R9L5K0J9k3j13J32Jl7j19l6M8p1
$$ -76 7 -21 -121 -5 63 -124 -15 -24 90 56 -27 36 -64 5 25 111 85 20 -37 62 97 117 136 113 0 132 133 96 -23 -59 -11 -82
3147h2J16l1j5J5j9K5K6p4KJ10m2r5J97k0j11R4k40K9Q6oM11M35q91k43K21K1J3J09j43Q01
$$ -82 34 3 -12 3 -16 9 35 -39 -37 73 31 -64 133 113 2 96 -144 -115 -29 -35 376 811 -80 -323 -102 -81 -68 41 -102 699
2885F99L101N71k761j440j33Q9l6k2pl2q2qL4J03o1j22J30r8J06JP1n1jk1K2p4L5m3M7R0j76
$$ 699 3800 4371 1610 170 37 126 90 68 61 29 -53 -61 -27 76 15 -107 23 -75 31 32 103 52 51 30 52 -22 13 -30 17 107 -69
2614f9R9%p5J5j32J54J6p2M3N7L7N2o9j0J6n4MO1k8M3q5k0N6j55O0Q1p6J3p8J94rj51R5L3
$$ -69 30 30 -45 -30 -162 -8 8 -64 -21 36 73 125 56 46 62 8 12 73 45 88 3 -17 39 -116 -56 25 -51 -38 -116 78 69 -82 13 46
2316D6j90O7J7l4m5P8l1o2J36j7%N0RO0Pp6j3q4J04j9P8K8j47L7M8o7N4LO9j35J48o3j42Q3
$$ 46 -144 -77 -60 -94 -139 -61 -92 -154 -18 -35 -35 15 24 84 91 15 2 -82 22 3 81 109 -38 -1 47 -20 34 37 106 -29 119 56 -86 -3
2019ck6O4J5l4lJR0q3o0K3k0l5K29j37j42Q3QQoJ38j22O1O2o2j62j06J12K8l3L0J6M6p2K01
$$ -3 -29 35 50 16 13 14 104 21 -39 -16 -36 -71 158 21 -121 -38 -30 -22 -28 110 -12 49 111 49 -113 -219 -107 -79 -112 -82 -66 -20 -92 109
1721A09p8J2j19j0J72o0p2J92k30J8j4J58k34K52k4k4j11J12Kj62L1k8J39k6rr5RO7K3P6j63
$$ 109 31 43 -76 -86 86 26 -46 146 -84 -66 -80 78 -156 96 72 48 -63 49 51 -111 -80 -108 31 5 -4 -99 -90 -23 0 76 -87
1450h7%N3l8j2J5p3J99K1j70K3K14j07q8P3r8M4J9N9j10J56k7r0Q7M4k62J67k4j6K6K7o3k2
$$ -87 -87 -34 -72 -84 -69 -142 57 78 -92 -69 145 38 -50 23 -75 -31 -12 47 -63 93 66 -24 63 107 -155 12 -12 -28 -2 25 -38 -60
1170f0J94j14j13J8j3J5L0Mj19J53n2J06m4Rm0o4J07o3K6j6P3N4j31%r2K40p3M2J1j45L8R8
$$ -60 134 20 -93 -75 -88 -73 -43 -39 -158 -5 -57 49 5 14 -26 -90 17 -46 -20 -36 37 91 -40 -40 -132 108 35 77 88 -57 -19 79
890G9r3M1K6M3j68J21m1j7o1K5O6k0k7n4R6k9O7j2J53j57j2p0N3m2qn7P4m9J12p9J72p9N3
$$ 79 -14 27 53 96 -72 49 8 -9 -70 -45 21 1 -26 -80 16 -13 54 42 195 38 26 -44 9 -33 -41 -98 -24 -73 39 -40 132 53 106
601A06m2k1m3P5Ok18JJ52n9L0L8j1m6J13p5J50j60Q4m4j47J47K3J0j01k8Q3l5l5p7K6M0R0
$$ 106 64 43 0 75 81 -137 -136 16 -43 -13 25 14 -32 81 6 156 -4 80 36 -111 36 59 69 -32 -60 23 -12 -47 -124 -98 -58 32
321C2n9Q3pM3j35M8m1M0QN2o3j1p2J19om9k6k7Q0R6o9j9r9J1M4k0J01m9M6j17R6k2r7J4J03
$$ 32 -27 56 49 92 -43 5 -36 4 12 64 1 -10 -82 37 31 -18 -44 -71 9 105 36 17 -82 -71 -27 -47 54 5 51 -66 30 8 -89 -75 28
15B8j08L6O6L0Q8p7N5m2p4JJ20j71OR3o5J4K1l9J12k8j58N5j6O0O0r3R0p5
$$ 28 -80 -44 22 52 140 63 118 76 2 3 123 -48 -42 51 -14 0 21 -18 94 66 -92 -37 -53 7 67 -26 64 -11
-230a1
##PAGE=	F1=12437.6
##FIRST=	23146.755397984237788,	4241.1433691826614449,	-0.42483294010162353516
##DATA TABLE=	(F2++(Y..Y)), PROFILE
4241i1L7O2l7L3Q5j09M6J4l1mj18P0l0J42J6n4P6j85kj7RJ29q2l5J05q8n2O0J06j8p6Q3k2
$$ -91 -54 8 -29 4 89 -20 26 40 9 5 -113 -43 -73 69 85 31 107 -78 -80 -97 -88 41 -41 -76 29 -59 -111 -51 55 37 -39 44 22
3952B2p8J22q5J03o7l9p2p0J13R2j28P4j3N1j89J21J23Mj57M3K2R9j83K7O7q5J83j66J54j34
$$ 22 -56 66 -19 84 17 -22 -94 -164 -51 41 -87 -13 -26 25 -164 -43 80 84 -73 -30 -8 91 -92 -65 2 -83 100 -66 88 -46
3690d6m4J02Jr6J35J0k9p3j4k9J28m9j11JJ33r0j1K06j65Q1m9q7O8j06K31j04k4j12J31o5
$$ -46 -90 12 13 -83 52 62 33 -40 -54 -83 45 -4 -115 -114 19 -71 -82 124 -41 40 -9 -96 -28 -134 97 -7 -31 -143 -12 -77
3427g7R1Mj61J84K1k31J81k2Q9m8n6O2l0J9l0O3O0j27k3J05qJ3P5j8j39P2jK9j45k1L6n0L2
$$ -77 14 18 -143 41 62 -169 12 -10 79 31 -25 37 7 26 -4 59 119 -8 -31 74 66 79 154 136 -3 69 68 97 -48 -69 -33 -83 -51
3139e1j18PJ24J4M6L1j11O0qmr4K26m2p2J36k85KJ03J9K88L62p23j92J76O4m3R3j18O32K335
$$ -51 -169 -162 -38 -24 22 53 -58 2 -6 -10 -104 122 80 8 144 -141 -139 -36 -17 271 633 -90 -282 -106 -42 -85 8 -110 522 2857
2876B857M16k044j078j34P9m5kOm0n7oK8J11j13j14J69j15J27nMk1K9QPq9L6o0R7L3j28L4
$$ 2857 3273 1229 151 17 96 51 49 55 15 -42 -48 -20 91 -22 -136 33 -82 45 40 44 23 52 60 67 -22 14 -46 51 84 -44 -10
2605a0O7j19J2o9J03R1j53K5M4P1P9k4j15L5J2n4Q6l4N8j19nM1j60J34P6j39J8n2K37q7r7
$$ -10 57 -62 -50 -119 -16 75 -78 -53 -9 62 141 117 2 37 49 -5 81 47 105 -14 -19 22 -138 -4 72 -67 -49 -101 136 49 -48
2334d8M6J8j32J00J2q9k0O0jj17J76Nq1R2oO4J4j4p6r5R9j6J20J9j38K8Jk1J5K5M2j52J33
$$ -48 -2 16 -116 -16 -4 -93 -113 -53 -54 -171 5 10 -71 21 15 79 93 79 3 -92 7 -9 111 130 -8 20 21 0 15 40 82 -70 63
2045F3o8o8P0NN0n8L7l8PJ06q4r1O9m3p6K26j08j09Q1NK6l8J05m9M4N1r0j18j17R7M0k1N3
$$ 63 -5 -73 -3 2 52 -6 31 -7 0 106 22 -69 0 -43 -119 107 -1 -110 -29 -24 2 -36 69 20 64 115 25 -93 -210 -113 -73 -94 -41
1756d1m3J8j4K09j24L4j19JJ23o8k6K11l10O1J2J43k12K24L2J1r4M3l5j29k5J4J84r1J8p3
$$ -41 -84 -66 -80 129 5 39 -80 -79 44 -24 -50 161 -149 -88 -76 67 -145 79 111 122 28 71 36 -93 -118 -104 80 -11 7 -66
1493f6o0P3K2R2j16l4Q9j3jm6r5J58N1j30L3K31j81l1Q5q5o5J15K5p6J02Kj68J28M7k51J83
$$ -66 -126 -53 -31 61 -55 -89 0 -13 -14 -60 -155 3 54 -76 -43 188 7 -24 61 -24 -89 26 51 -25 77 79 -89 39 86 -165 18
1222A8n5J2J8K4o9J1J95j19j26L5n3J4L4k6n3J88m8J9K6Nn0r1J22m8K1l4P6L1j06m9l7J81
$$ 18 -37 -25 -7 17 -52 -41 154 35 -91 -56 -109 -95 -61 -87 -140 48 0 19 45 50 0 -91 31 -17 4 -30 46 77 -29 -78 -115 66
942F6m1N9L7j77N7P4q7L5J2Q4j42P0Ln8k8j7N0k0k4l7R5q6J06j2K13j81oq9P3j17P9l1P9%
$$ 66 25 84 121 -56 1 75 -12 23 35 119 -23 47 50 -8 -36 -53 -3 -23 -47 -84 11 -75 31 19 232 51 45 -44 29 -88 -9 -40 39 39
645C9K9j09J52o9K2rr5O1MM7k07L0J70p2KK2l6J9Q8l6P1j46Q9k0j36J42k1Kr9J6O7m2qp4L0
$$ 39 68 -41 111 42 64 55 -40 21 25 72 -135 -105 65 -7 -5 17 -19 0 88 52 123 -23 66 46 -90 52 31 33 -66 -50 17 -25 -33 -107 -77
338g7M7O0n8L1KP2q4lj6nK5O5r2J9j15J32L5n8j1n7R8J06j10j2j8k9j2lJ42m0J1p1O3p5n4
$$ -77 -30 30 -28 3 5 77 -7 -10 -26 -31 -6 59 -33 -14 -129 3 38 -20 -31 -88 10 116 6 -6 -24 -53 -65 -68 74 34 45 -26 37 -38 -92
32i2RR8j13P7O7K9N7p4O8k5p5n8J50j54j0J53j36L2nm0J00J9j62L7j4Q1L7o2Q4j04
$$ -92 -83 15 -98 -21 46 75 132 58 126 101 26 -32 118 -36 -46 107 -29 3 -2 -42 58 77 -85 -48 -62 19 56 -6 78 -26
-230b6
##PAGE=	F1=12390.4
##FIRST=	23146.755397984237788,	4241.1433691826614449,	-0.19648849964141845703
##DATA TABLE=	(F2++(Y..Y)), PROFILE
4241d2KN3k7LJ12j23J9O9n6M8j12k2rJ63J4n7J05k08qpOR6o6L2N1r3p9P3J50Oj29O1K3j20
$$ -42 -40 13 -14 -11 101 -22 -3 66 10 58 -54 -76 -85 78 92 35 140 -68 -76 -83 -77 19 -47 -15 36 -57 -136 -63 87 93 -36 25 48 -72
3944g2J59j05O3n9j5o6r2J20Q3j48J14J1O2k15J28O5jr1J7M6Q3j89ON7l7J62j12Q7j09l8J26
$$ -72 87 -18 45 -14 -29 -95 -187 -67 16 -132 -18 -7 55 -160 -32 33 32 -59 -42 4 87 -102 -96 -39 -76 86 -26 61 -48 -86 40
3672D0l8n4Q4l1K0o5Nj8J06m5j34j6J55p8J2J49j11R1p8l7Pq1K04j27Nj03J11l2J19mk01J90
$$ 40 2 -52 32 1 21 -44 -39 -57 49 4 -130 -146 9 -69 -57 92 -19 72 -6 -43 -36 -117 87 -40 -35 -138 -27 -59 60 56 -145 45
3392D5J0k13J74j5K8k7ML3J0j7o7K8J30j72L2P8k6J9Q1Nj45J5JO4j40pK5kL3J20j12l3PO7
$$ 45 55 -158 16 1 29 2 6 39 49 32 -35 -7 123 -49 -17 61 35 54 135 140 -5 10 11 75 -65 -72 -47 -49 -16 104 -8 -41 -34 33
3095C3L7j42J22j43P9j11K36o4l3J78l29k5J19K5J47K88m55j53J20O1q4Q5q7L66J248J87j019
$$ 33 70 -72 50 -93 -14 -125 111 47 14 192 -137 -162 -43 -18 129 417 -38 -191 -71 -10 -94 -9 -96 270 1518 1705 686
2859F86n70j29M7j5J5J4n1l6L2oJ07j16j27J86j04J19qn7pM3N1Qq9N3r3J31qo7m3J18j63Q
$$ 686 116 -13 34 19 34 48 -3 -39 -7 -13 94 -22 -149 37 -67 52 44 -13 -20 23 74 82 -7 46 -47 84 76 9 -34 84 -79 -71
2579g1j6M1J49j88MK6R1R1L5k04N4P7j27R6m3O9j08nL4j57J76J02k05J9k5K80j63l8m0L2m7
$$ -71 -87 -46 103 -85 -81 -55 36 127 162 -42 12 89 -38 58 15 84 -24 -29 5 -152 24 126 -79 -60 -85 195 32 -6 -46 -14 -61
2307f1R7J1j39MM3K9j72K14K2j32J05j9P3ML4j22r3R5j6J38j4j01M9p5N4k5M7j6j38J14p6
$$ -61 36 47 -92 -88 -45 -16 -188 26 48 -84 21 2 75 79 113 -9 -102 -7 -23 115 101 0 49 -26 28 3 50 34 -104 10 -66
2036f6PN7L2L3j10P3k1l3J27q5r0Q4n8j09J93n1p8P4%M2m1M0L4L3kr8o5n9K0N0J9M2q4QJ4
$$ -66 -59 -2 30 63 -47 26 5 -28 99 14 -76 8 -50 -159 34 -17 -95 -21 -21 21 -20 20 54 87 85 -13 -78 -137 -117 -67 -48 -6 -90 -82 -68
1730f8J86j53P1j19J1P4p6kK09l25P0M0J30j59J66P7L3p6k6m6o9o2J4K06j19J4k8j15R0LR4
$$ -68 118 -35 36 -83 -72 2 -74 -76 133 -192 -122 -82 48 -111 55 132 165 89 63 17 -52 -114 -100 106 -13 1 -27 -142 -52 -49 45
1458D5n2n4J15Mm0n7j22J10R5p4PK12j90j1J01p0j44J82pl7M1K6j95J16N9k34J97q6N6K4J8
$$ 45 -7 -61 54 58 18 -39 -161 -51 44 -30 -23 189 -1 -12 89 19 -125 57 50 13 54 80 -115 1 60 -174 23 -63 -7 17 35
1187C5p9M4J35j05j18N1r4J5L8n3J7J89j6m3O1Nn8j15J36l3J7n2P7Nq5o8j2J11k0Q8P3j93
$$ 35 -44 0 135 30 -88 -37 -131 -116 -78 -131 -114 75 59 16 77 82 24 -91 45 12 29 -23 54 59 -26 -94 -106 5 -15 73 146 -47
907d7L1O8o2K7kQ1n8J2M2j02Jk9Krrj0J00j53J31j7K06j41Lq7N5j65J32RJ01J8k5j49J21m5
$$ -47 -16 52 -10 17 15 96 38 50 92 -10 -9 -38 -36 -45 -54 -64 36 -117 14 -3 203 62 65 -22 33 -132 0 9 110 128 103 -46 75 30
610C0Nkr3J31j03P3j51M7J77q5k8J6n3P6N5j6k8r2P0J3j18J30j4k5j15N3M5m8K3m0LP2N2p3
$$ 30 35 33 -60 71 -32 41 -110 -63 114 29 1 17 -36 40 95 79 51 -41 29 42 -76 54 40 15 -100 -47 -2 -50 -27 -67 -64 8 60 -13
312a3l6LR3j8m1Qn6O4M2j09O1j48J57L0n2Rq3J08J08j35QM8q3o9J6J74l8MMl5r2j0NR3j18
$$ -13 -49 -46 47 29 -12 -4 -60 4 46 -63 -2 -150 7 37 -15 -6 -89 19 127 -8 0 48 -35 -104 -88 86 48 52 56 21 -71 -81 -76 17 -101
6a01J29P9k4L4q3O9Ko8p9J19r2m3K18k04O5j7o3O6P3j58K6nQ9lk4Q6j32
$$ -101 28 107 83 117 34 103 105 37 -42 77 -15 -58 160 -44 21 4 -59 7 80 -78 -52 -57 32 29 5 91 -41
-230d1
##PAGE=	F1=12343.2
##FIRST=	23146.755397984237788,	4241.1433691826614449,	0.021595239639282226563
##DATA TABLE=	(F2++(Y..Y)), PROFILE
4241Dk7K2j1l2J21j08k0J04n3J29j54o3j3J47L4o7J40k13J7q%Q1q8J13k8o3j11R3J28O7j52
$$ 4 -23 -1 -12 -44 77 -31 -51 53 0 129 -25 -88 -101 46 80 13 153 -60 -43 -51 -51 30 -58 55 27 -36 -147 -54 74 141 -11
3970a1L9K8j46J75q0Om7J4m7r0J01O4j27P9L0Q2j71J16k3Jk3j0P0N6j56m7K5J4J14o7L1p2
$$ -11 28 56 -90 85 5 11 -36 -22 -69 -159 -58 6 -121 -42 -12 70 -101 15 -8 -7 -30 -40 30 86 -70 -117 -92 -78 36 -31 0 -72
3690g2k9J50k4k5L0p5O0l2j3K0N2kj60j9J14n9P3N9n8J16j02J1j2j08J29j00N1q2R0j4J48
$$ -72 -101 49 25 0 30 -45 15 -17 -30 -10 42 40 -120 -139 -25 -84 -11 48 -10 106 4 15 3 -105 24 -76 -25 -107 -17 -31 117
3419A17l1k12J32L3j46J16ml4%O0MJ2l1r1K0J63j77M3L4J2L4L5J6j25k8J9R2j16%PL8L36J257
$$ 117 86 -126 6 39 -107 9 5 -29 -29 31 35 47 16 -75 -55 108 -69 -26 8 20 54 89 105 -20 -48 -29 63 -53 -53 -46 -8 328 1585
3130A585n17j046l0N6L5j09J44k44J70j58K07o9rK05l44l2Q1RN3L12k62j51J02Op3P9n0J28
$$ 1585 1068 22 -8 48 83 -26 118 -126 44 -114 93 24 15 220 -124 -156 -75 -66 -13 299 37 -114 -12 -6 -79 0 -50 78
2885G8L91oj98j68j30mK6J6N9o8k6N4n4J09q7j54J60m8R3J2j04K1L0Q5J1r4P1j08J26l7J6
$$ 78 469 463 265 97 -33 -37 -11 5 64 -4 -30 24 -30 79 -8 -162 -2 -50 43 55 -49 -28 2 87 98 4 75 -33 93 56 72
2614G2q9R5j59KJ0k3J84j40j0LO1J13P4k36N2O6j47Q6j8L5k7nK5j45J78J22k46J8KK67j94
$$ 72 -17 78 -81 -79 -69 -92 92 -48 -58 -55 6 119 193 -43 9 75 -72 14 -4 31 4 -1 24 -121 57 179 -67 -49 -47 220 26
2342B6K1j44N4M3Q0Rj88kM5P9k06K11L0j42P9jO9oN5j17q8Q6j5J22n9o4J07j55J19n7N1m3
$$ 26 47 -97 -43 0 80 89 -99 -101 -56 23 -183 28 58 -84 -5 -6 63 57 112 -5 -93 -7 -22 100 41 -23 84 -71 48 -9 42 -1
2062ap5N5o5L8L8M9K5j23N4O4j26J00p0j9R1p2j23J51jn0O0j9N2j8k7P1J7m8p7oKo7N8P3J3
$$ -1 -76 -21 -86 -48 -10 39 64 -59 -5 59 -67 33 -37 -56 35 -37 -160 -9 -10 -60 0 -19 33 15 -12 59 76 28 -49 -55 -53 -120 -62 11 24
1756B4j10K1J6J13j11J02j05j4O1q1PJ49k81M1Q0J38j19R8Q2P0o8p4j6n2p5j1K11r7J0Jj42
$$ 24 -86 -65 -49 64 -47 55 -50 -64 -3 -84 -77 72 -209 -168 -88 50 -69 29 111 181 113 39 23 -29 -104 -115 96 -1 9 10 -132
1485a32R3KN5Qm3J07K7q8n4j27R6R6n4J4J40j25pQ8p4j46J98k8Lj8K0j35P7N4k08K08j17O6
$$ -132 -39 -37 18 26 -17 90 117 29 -25 -152 -56 40 -14 0 140 15 8 96 22 -124 74 46 49 31 51 -84 -7 47 -161 47 -70 -4
1205dO0pq4Q3N2p7j09N7j08J0M0l1M0J61po2P5L2p3j23J29l8M9o6M3J9r8m4k2M8lR7R0j66
$$ -4 56 49 -35 48 100 23 -86 -29 -137 -127 -87 -118 -78 83 76 14 89 121 48 -75 54 16 65 -1 42 61 -37 -81 -103 -55 -58 39 129 -37
907c7rO0QLl7P4K1l1O1j11nj3o1L7j9N1N9j74J30k6J61o8%p4K8j70J31O1J08Oj9j83P8k5j
$$ -37 -46 14 22 25 -12 62 83 52 113 2 -3 -16 -77 -40 -59 -8 51 -123 7 -19 142 74 74 0 28 -142 -11 50 158 164 145 -38 40 15 14
601A4j9k2J45j80N4n5M9J69r7n8J4n5J14J4mr8m3L0O5j05R1L8k4j62O7L0l9L3NrJ00M9j23
$$ 14 -5 -27 118 -62 -8 -63 -14 155 58 0 14 -41 73 87 83 -15 -58 -28 37 -68 23 61 37 -125 -58 -28 -67 -34 -29 -38 62 111 -12
312a2o6J6M6P5n8kp6J17or5O6j27J67j4k5J3r8J22Q7j51L8Q6j32p2J1J73l9J2P7j39o0L3k1
$$ -12 -78 -62 -16 59 1 -1 -77 40 34 -61 5 -122 45 31 6 19 -79 43 130 -21 17 103 -29 -101 -90 83 44 56 133 -6 -66 -33 -54
23e4P6j04J55Q6p6J5j16R1J1m0p3M4k2n0K50k38J09l5j01L0R6j35RRJ07m4nR3j45
$$ -54 22 -82 73 159 83 98 -18 73 84 44 -29 15 -7 -57 193 -45 64 29 -72 -42 54 -81 -72 -63 44 0 -5 88 -57
-230e7
##PAGE=	F1=12296.1
##FIRST=	23146.755397984237788,	4241.1433691826614449,	0.23967909812927246094
##DATA TABLE=	(F2++(Y..Y)), PROFILE
4241E1n7rRo3R5o7l5J01l3J69j75q5j9J32N4p6J75k18M1j0mO6j26J79r1k0j41J12Q2J01j45
$$ 51 -6 -15 -6 -69 26 -41 -76 25 -8 161 -14 -99 -118 14 68 -8 167 -51 -10 -20 -24 42 -84 95 4 -16 -157 -45 37 138 -7
3970gM5Oj37J57k7n5m1N9j3j03O8N9r0L1L9P6r4P0q4kM1l6R5K7j23q4QN4N5n3Ol6k0J48K5
$$ -7 38 44 -93 64 37 -18 -59 0 -13 -116 -48 11 -79 -48 -9 67 -27 43 -41 -43 -2 -38 57 84 -39 -123 -115 -61 -6 -59 -53 -89 -109 39 64
3664F4l3Nj25R8ml3P2m5P2j51l6N6l9J32k9oJ47j17PK0j42M8p4R8o2P0oJ64p4j77N4L1l3M4
$$ 64 31 36 -89 9 5 -28 44 -1 71 -80 -116 -60 -99 33 4 -2 145 28 35 55 -87 -39 -113 -15 -77 -7 -13 151 77 -100 -46 -15 -48 -4
3366dRr3QR9Nj7j4q6K4J48j49K7nN3N0j2K7j05n7N3J05j06J2mO1R68L478j236l076r2J6Jn6
$$ -4 5 -88 -80 19 24 7 -7 -93 -69 79 -70 -43 -48 5 55 43 70 -35 -92 -39 66 -40 -28 -32 29 997 4475 3239 163 71 87 88 32
3077C2J30k59K04j81J42o8K3J97l31pJ5m5J7M56k51j30J01m7o1Q3qj0J6j09J63M0j42n3P1
$$ 32 162 -97 107 -74 68 0 23 220 -111 -118 -103 -148 -131 325 74 -56 45 -2 -63 20 12 2 18 -91 72 112 -30 -83 -12
2824a2MQ7q5j4O0j17J26m4j80J34oN0O3j21L7PQ4M1p5N0r2R0l6O9j01M4j32K0oo8J81p0J8
$$ -12 -8 79 -6 -20 40 -77 49 5 -175 -41 -47 3 66 -55 -18 -11 73 114 39 89 -3 87 51 120 19 63 -69 -49 -55 -123 58 -12 6
2535Fl9K7J30N8k22P1J4j18O6poN4rL8j14J15J38k50nN9K23j94N2k17N1J11M1L7k07l4Q5P6
$$ 6 -33 -6 124 182 -40 31 45 -73 -7 -14 -20 34 25 63 -51 64 202 -48 -53 6 229 35 87 -130 -79 32 73 110 -97 -131 -46 30
2255C0j96J83J3j07L8K0P1j7P5j12q2P7j5J07j03l2J60k03J54q8O2p3j1J2m0N5LO7J7j36L5
$$ 30 -166 17 30 -77 -39 -19 52 35 110 -2 -84 -7 -22 85 -18 -50 110 -93 61 -27 35 -38 -49 -37 -77 -22 -19 48 65 -71 -36
1983c6J50k20P0o1Q4O7o7j18R3L5k6M4j1L3K6p7P3l7j4p5M1M8j21L4J32j2j22N0kK1l9J03
$$ -36 114 -106 -36 -97 -13 54 -13 -131 -38 -3 -29 15 4 37 63 -14 59 22 8 -67 -26 22 -99 -65 67 55 -67 -17 -19 2 -37 66
1703F6q6l6O1o9jO8j92jJ07J36p6L3L3J11m2j05M2p0n4o2K20p3MK7j24Q0j1NO9l4P5K5j11
$$ 66 -20 -56 5 -64 -65 3 -189 -190 -83 53 -23 10 43 154 112 7 49 -21 -75 -137 83 10 14 41 -83 -3 -14 -9 60 26 101 126 15
1415A5k7j16R7P8n1L6K2m2J7O5q7p7J44m1N1q0J1m5NN9j73J87j17O8Q9Kj17R7Km9r9N1p2l0
$$ 15 -12 -128 -31 47 -4 32 54 12 29 94 7 -70 74 33 84 4 15 -30 -25 34 -139 48 -69 -1 88 90 -27 70 72 23 -76 -25 -97 -127
1117a27O9k7M4J17j3o3J09K7n6j35J17m2Q2q2J0K9j14Ro2j1J8J06J06j39m9O3Q4k3p2M5P7
$$ -127 -58 -85 -41 76 63 0 109 136 80 -55 62 20 102 20 30 59 -55 -46 -108 -119 -101 5 111 -28 -77 -14 70 47 -25 20 97
846I7o2R0r8n4j0p3Q6k4R8Rj58J06l8J12j1j8l3K6j60Q5R2R4J1Mj93N7j7j7n8Q7J00j75J8
$$ 97 35 125 27 -27 -37 -110 -24 -48 50 59 -99 7 -31 81 70 52 19 45 -115 -30 62 156 167 171 -22 35 18 1 -57 30 130 -45 -27
557b7K6L9J50j39n9K0m8J14jn4q5kk0J18r2N3R0k1k04N1M4l3L8N3j5Q6O5j77l8J2j8J44m0
$$ -27 -1 38 188 49 -10 10 -38 76 75 21 -64 -66 -86 32 -60 -7 83 62 -142 -91 -47 -80 -42 11 -4 82 147 -30 -68 -56 -74 70 30
268C0l9o3J59o5o8Q1r1J32m8J5Kj28J38O9j44L1J32j73m6k3J76l6MJ35k15MO9n4N9r1J59O9
$$ 30 -9 -72 87 22 -46 35 -56 76 28 43 45 -83 55 124 -20 11 143 -30 -76 -99 77 41 45 180 -35 -31 38 -16 43 -48 111 180
-12A80j12J1j50J13K0j1o3k6K2k0K32k22J08l6j27MJ04j27%L1J26q5QR8j28
$$ 180 68 79 -71 42 62 51 -12 -38 -16 -36 196 -26 82 46 -81 -77 27 -100 -100 -69 57 -28 -20 78 -50
-230e0
##PAGE=	F1=12248.9
##FIRST=	23146.755397984237788,	4241.1433691826614449,	0.34636187553405761719
##DATA TABLE=	(F2++(Y..Y)), PROFILE
4241G4p5k5jm7O4m3j3O7k9J58j39n9l3J07M6p5J82k00N8l8J5O5j84K46j53J3j12J00M4O8q6
$$ 74 -1 -26 -27 -74 -10 -53 -66 1 -28 130 -9 -68 -101 6 52 -23 159 -41 17 -21 -6 59 -125 121 -32 -19 -131 -31 13 81 -5
3970eM5m1j11J27L9p1l8Q3J3j08J2O7o3rM7O5j9K5q3l6O7l6P3Km2j11J0N3Qn5jpoJ26N1l8
$$ -5 40 -1 -112 15 54 -17 -55 28 41 -67 -55 12 -51 -60 -13 52 33 58 -25 -61 6 -30 43 45 3 -108 -98 -45 -37 -92 -93 -100 -106 20 71 33
3655C3K4j60R1K6p0J22j47J79j26l1k2qJ26q1N0J57j39qJ01k03j2j6J10l1M1k7J90j14j19
$$ 33 57 -103 -12 14 -56 66 -81 98 -28 -59 -81 -89 37 -44 6 163 24 16 117 -86 -98 -114 -4 -35 6 -21 169 55 -64
3401f4qqP1Rj6j10L3N8L1k6Mn6M7Q6r3j0l1Q7M6l7J9o1q2P1J02j19K6J1N7J702O015k001n419
$$ -64 -72 -80 -9 0 -16 -126 -93 -35 -4 -30 -26 -82 -35 51 -42 -52 -83 4 50 13 32 -29 -111 -40 62 -57 -31 -20 37 1739 7754 5753 334
3112C34j53o4j0j5J13k26J50j59N2l0K1J76k43Op5r5L2O59l57j48J20p7p9J06Nl4Qj52J94
$$ 334 181 117 107 92 205 -21 129 -30 22 -8 13 189 -54 -48 -123 -218 -186 473 116 -32 88 11 -68 38 43 9 17 -135 59
2859E9Q9j45q6P8J4Q4j13K4J5j28J12K6j88J00j2K6J18j10M5NK8Q3n9pm5O9j6O1p9J8r8O3
$$ 59 148 3 -83 -5 9 93 -20 4 19 -109 3 29 -159 -59 -71 -45 73 -37 8 13 41 124 65 58 13 82 66 127 48 66 -32 31
2579C1r1r7J83j9O1q0J8J05L0j59P5o4o2P5nn9J19lM2q9M2J46k23m1R7J56j58M0j95L3J22
$$ 31 -60 -157 26 7 68 -12 6 111 141 -18 57 -7 -69 6 1 -58 61 58 100 11 53 199 -24 -65 32 188 30 70 -125 -92 30
2307C0J1N8j76o9J13L9j13R8Po0J3K8M6k0Q2r1n3N5QM4j10j9J80k05J76p9L9p6OqJ8K1k9R3
$$ 30 41 99 -77 -146 -33 6 -107 -9 -2 -62 -49 -21 25 5 87 -4 -57 -2 6 50 -60 -79 101 -104 72 -7 32 -44 -38 -46 -28 -7 -36 57
2010E7J3j21J0K07k65Jn5J67M1l2j02N5K6lJ6JjP4p1J4o7P4q6M5M7j17K6J51l3j07N3m3k4
$$ 57 70 -51 -41 166 -99 -98 -153 14 55 23 -79 -24 2 -1 15 16 15 89 18 32 -35 39 -47 -2 45 -72 -46 105 72 -35 18 -25 -49
1721d9J9R7m0p5N8l0Mk2r1m6J09J38o9K1k6J14j5r4R4j41j3q9K03n0K9M2j09N7k0l7Q0k3O6
$$ -49 -30 67 27 -48 10 -20 -16 -38 -129 -175 -66 72 3 24 -2 112 97 3 97 -44 -57 -146 57 7 36 78 -31 26 6 -31 49 26 92
1432I2k4o5l8n9P6N1o8P7p7QN5L1q0J8P0l5M5j17J3O4o8N5j36J52p4N3O6M7j44O3lk9o9K4
$$ 92 68 3 -35 -94 -18 33 -35 42 -35 -27 28 59 -21 -3 67 32 77 -40 -27 37 -31 24 -112 40 -34 19 85 132 -12 51 48 19 -50 -26
1135b6J4j05R4l1M0O5j4n6J34Qqj46P4l7J18o5n5K0j03R9q8p7O1Q9O4p7p8P0J21l4r4K4Q6
$$ -26 -12 -117 -23 -54 -14 51 37 -19 115 123 115 -31 43 6 124 59 4 24 -79 20 -68 -145 -84 5 69 -8 -86 -16 105 71 -23 1 87
846H7q3J16p6j09k8k9J32n4J38m7j13O5m1P0L2m4K3N1j66M2R9M4M3Lj52L0j7k3r9J54N3q3
$$ 87 4 120 44 -65 -93 -122 10 -44 94 47 -66 -1 -42 28 60 16 39 90 -76 -34 65 109 152 155 3 33 16 -7 -106 48 101 18
566A8m8Q3M0Q7j68k6J3k9O1L8j42J0j2l0J58r0J1J19j7k12M3N0l0L1Q3LK0Q0j98K4mp6J63
$$ 18 -30 53 93 180 12 -14 -1 -30 31 69 -73 -63 -75 -105 53 -37 -26 93 76 -136 -93 -43 -73 -42 41 44 64 144 -54 -30 -34 -110 53
277E3j5n5k2J48q6k2N5n6Q5o5O8l4j54J68M7j25j4J72j72Oo9J30j1J8J30k32O7P2o2M7q3J12
$$ 53 38 -17 -39 109 23 1 56 0 85 20 88 54 -100 68 115 -10 -24 148 -24 -18 -87 43 32 50 180 -52 15 87 25 72 -11 101
-3A01N2p4pj68J37J7on9n3L5J8J67j55N8j4j36J1O4j08K0L5J24q7nR4r1
$$ 101 153 79 72 -96 41 58 52 -7 -60 -25 -7 160 5 63 49 -87 -76 -12 -120 -100 -65 59 -28 -33 61 -30
-230c0
##PAGE=	F1=12201.7
##FIRST=	23146.755397984237788,	4241.1433691826614449,	0.31232786178588867188
##DATA TABLE=	(F2++(Y..Y)), PROFILE
4241F7p7k8Oj6J2l8N6J7o1J11p8qm8Q4L6p2J89j83P6o6K8O1k11K83k13N2p6R7M3l2j9N0p5
$$ 67 -10 -38 -32 -48 -36 -74 -18 -1 -62 49 -29 -37 -85 -1 35 -37 152 -31 45 -21 7 68 -143 140 -73 -21 -97 0 43 11 -8 42 -33
3952c3o7Q2Q8p0k1R4K3j14m4N6n5pL5O7Rk6k6m3O0l5N5k2M0j39J1N3l8n9qK3PR1O0l0N2j64
$$ -33 -100 -18 70 0 -21 73 96 -18 -62 -6 -61 -68 -33 34 43 17 -9 -52 8 -27 28 6 46 -93 -82 -29 -67 -126 -134 -111 -104 -13 47 17 69 -95
3637i5N3O1j02J75k46K55p0l1j01J8J17j01Q2J39j27m1J62k33m2K8J05jJ5o4K00j27l6m8q6
$$ -95 -42 19 -83 92 -154 101 31 0 -101 -83 34 -67 15 154 27 -14 148 -85 -127 -99 6 5 20 -44 156 29 -7 -55 -141
3384a41J33L2o3q8M0lN6l4K3k7O6K2j3q4JP9J7k4Qk3j06Q7R9j32K2OO3K141P555k406o866
$$ -141 -8 24 -39 -127 -87 -90 -34 -68 -45 -72 -6 16 3 -81 -80 -1 16 -8 0 -23 -129 -42 57 -75 -53 -47 16 2157 9712 7306 440
3112D40j86j26jJ9R0j58K9j14j7OK1J56j58L5j49j41N2P99m61j61J43n4j50J24J3j3J06j86
$$ 440 254 128 127 146 236 78 107 -7 -24 -18 3 159 1 36 -113 -254 -202 597 136 -25 118 64 -86 38 51 38 144 -42
2867d2J33Q5j40q2O1M6L9j31P2o4p6P7P6j94P1m5L4J42p4M9Jk8J24m3o5MM6j1L9m3Qo5J08
$$ -42 91 176 36 -46 15 61 100 -31 41 -23 -99 -22 54 -140 -69 -114 -80 62 -12 37 38 10 134 91 26 30 76 65 104 61 69 4 112
2579A12j65j16J85k7J18j06M1M8Or3Q1j45J1J01j4j25J39J6N9n2m7J38j81o2J37Q8j32K0q6
$$ 112 -53 -169 16 -11 107 1 42 90 96 3 84 -61 -50 51 37 -88 51 67 126 74 27 165 -16 -78 59 147 15 35 -51
2325e1m1J15l5O3j00j04J41k7jPjj3j2L6K1k2Q9p2k2L1L3nj02l9J65j62J83p2J9n0pk4P9j2
$$ -51 -92 23 -12 51 -49 -153 -12 -39 -40 -33 -34 -47 -59 -23 -2 -24 65 -7 -29 2 35 30 -72 -111 54 -108 75 3 22 -28 -35 -59 20 8
2027Ho1J20Rr4nJ73k19o2l9J89J3J2p8M6j1K2rJ8l2R2l3n1j01J81p9k4L2n7J3J28l5p7P4j17
$$ 8 -53 67 76 -18 -23 150 -69 -131 -170 19 32 44 -34 12 1 23 14 32 0 92 59 8 -93 88 9 -15 17 -40 -27 101 66 -11 63 -54
1730e4l8N7P2K3j00N6OK9r4j8o0R2J21o3Rq2J22j4n0J12j86L9j05J68m3O7J1p6N5k6p5M5K
$$ -54 -92 -35 37 60 -40 16 22 51 -43 -61 -121 -29 92 29 38 -44 78 64 14 126 -60 -21 -126 42 -1 66 77 1 56 30 -45 0 2
1441BO6o5K6o4j4M4K8q1J07j28QJ06lp4Q3K8l5L6j52J9J45j12M8j02J13l6N4lJ16j51%K2j2
$$ 2 68 3 29 -35 -49 -5 23 -58 49 -79 -71 35 32 -42 41 69 34 70 -82 -63 82 -30 18 -84 29 -7 47 44 160 9 9 31 19
1152A9m2mR9j80J19l4L5J4j5n0J60j0M0j63K8jJ23m1j11j5n9J55q9j30J15N7Pmr5P5R9k7r6
$$ 19 -23 -27 72 -108 11 -23 12 26 11 -39 121 111 151 -12 16 15 138 97 -14 -29 -88 67 -22 -152 -37 20 27 23 -72 3 102 75 -21
863b1MR3j10J34m6j56m0K3J64j00J77j03o0L1l1M0M0m2L6R5j68LJ01rQ9m4r1K1j5k9j11J48
$$ -21 -17 76 -34 100 54 -102 -142 -119 45 -55 122 19 -41 -10 -41 -1 39 -3 33 128 -40 -37 64 55 144 100 9 30 15 -14 -125 23
583B3L2L3r9R7L5K0j81K3Jj4j3J13k20J15o5K0J76j07JP8qj51K2M6l5J6J05J5n6Q9k04J00
$$ 23 55 88 -11 86 121 141 -40 -17 -16 -30 -43 70 -150 -35 -100 -80 96 -11 -10 68 60 -91 -69 -23 -58 -42 63 78 22 111 -93 7
303Gj2j25J74Lo1K9J00q4K2K3l9K0l8J07o6j77J93K1p1q5J86j38N4j17Q3J4J9J09j94Q4M4
$$ 7 -5 -130 44 47 -14 15 115 31 53 76 37 57 19 126 60 -117 76 97 26 -59 127 -11 43 -74 9 23 42 151 -43 41 85
32H5m0L0p9O8L8Pm4j43J41kj7p7m1M8N4N9p3J1J2j23M1J6r6L2L2J22q8k3Q7k5
$$ 85 45 75 -4 64 102 109 65 -78 63 61 44 -33 -74 -26 28 87 14 25 37 -86 -45 -29 -125 -93 -61 61 -27 -50 37 12
-230A2
##PAGE=	F1=12154.5
##FIRST=	23146.755397984237788,	4241.1433691826614449,	0.20830178260803222656
##DATA TABLE=	(F2++(Y..Y)), PROFILE
4241D4q0j1L1j0j4n4J28or9M3pL2o1P3L2o9J89j64N6r6M3M3j85K92k35O0k9Q2P8j63K5N1r2
$$ 44 -36 -47 -16 -26 -40 -94 34 28 -71 -28 -35 -3 -64 9 41 -28 161 -3 53 -43 0 43 -142 150 -85 -25 -54 28 106 -57 -32 19 -73
3952g3J0O2O9n2j9J13Lr9q9M9p2J3L9N9k5m7P2m1kNL4k7N4q7j2N8n2o8k7O4J1N2K0lO4j12
$$ -73 -63 -1 68 16 -3 110 113 14 -75 -26 -98 -85 -46 13 -12 -59 13 -28 -30 -25 9 -18 36 -51 -63 -5 -57 -125 -152 -88 -77 -25 -5 -8 56 -56
3637e6QP5j18J87k91K88j2j0j67L7Q4j05R1J05r8q1J73j58o5N0P7M4l2q3J91j11J1n3j60J38
$$ -56 -48 27 -91 96 -195 93 81 71 -96 -59 25 -80 11 116 18 -63 110 -48 -113 -63 14 58 26 -57 134 23 34 -19 -179 -41
3375d1R9j01o7M7o6O3j8L8kP0m1Q4j58N2M9jJ3n0K6r7O6J00j32qRO9J978P170k189o536j78
$$ -41 58 -43 -110 -63 -129 -66 -84 -46 -48 22 -19 65 -93 -41 8 7 20 -30 -4 -101 -35 65 -67 -75 -66 3 1981 9151 6962 426 248
3104B48j68L3K0Q1q2r0m0n1L3J5J50r2N7j68j60OP69m40j43J41J5k51J23J2J9J44k27J35O1
$$ 248 80 113 133 214 132 42 2 -49 -16 -1 149 57 114 -54 -214 -208 561 121 -22 119 134 -117 6 18 37 181 -46 89 150
2850A50r7n3K9N6j3j20J33j42J1J0J21j82N2p4L1R3PK5jo1J39l5p4nP2oJ9j7J5n7J35k12r1
$$ 150 53 0 29 85 72 -48 85 -57 -46 -36 85 -97 -45 -119 -88 5 12 37 36 -25 114 79 5 0 72 66 85 68 83 26 161 -51 -142
2561a42J50n7J42j12P2j0K4o1O3j71M8J78m6j48R7J0Q9m3p7J28j65o8J44L2r7KO3j27R9o0
$$ -142 8 -49 93 -19 53 43 67 6 69 -102 -54 124 78 -70 27 37 126 83 6 134 -31 -99 45 77 -20 -18 45 -82 17 -43
2299d3O8j7j14J29r7P2l9QkJ2J5qj2R8r2K4rM5j7o5n4R0r8J81m4lk9n1pJ12l1q0J25j5l3j2
$$ -43 25 8 -106 23 -74 -2 -41 -33 -35 -23 -8 -16 -28 70 -22 2 -7 38 21 -44 -98 -8 -106 75 31 28 -1 -52 -59 53 22 -58 67 52 19 7
1983GR6j31j07j3J44jM0l1M3o2M5m0K2j6P6%q4j09K37l2j19L3j8J8N7l2k3P7j42j7K7N8P1
$$ 7 103 -28 -135 -148 -4 -5 35 4 47 -15 30 -10 12 -4 72 72 -12 -121 116 84 -35 -2 -20 -2 55 23 0 77 -65 -82 -55 3 74
1695G4j24M5N1N3j10J2p4P3J04o7oq9R8l4K6P7j97P4q2J32m8P6k5l3M8k9o1k7K3R8r2R5p1
$$ 74 -50 -5 46 99 -11 1 -73 0 104 37 31 -58 40 6 32 109 -88 -14 -96 36 -12 64 39 6 54 25 -36 -63 -40 58 -34 61 -10
1406a0K0k1K0o8R0j04m6J49j9n4Q5lpPj19J2J68j44J8n7P7KP0o1J80j46p1K5J0K0n6J63k29
$$ -10 10 -11 9 -59 31 -73 -119 30 11 -43 42 39 32 39 -80 -68 100 -44 -26 -83 -6 -4 66 5 185 39 -32 -7 3 23 -33 130 -99
1117i9J00n7O9j0J9p4J57MO5j87L0M9O9j5j56m5k0J89n6j52J33Rn1O9r7Q5L6L1j14m5J20j20
$$ -99 1 -56 13 3 22 -52 105 109 174 -13 17 66 135 120 -36 -81 -101 88 32 -120 13 22 -29 40 -57 28 64 95 -19 -64 56 -64
837f4J23k2j42n3P1J55j20J70j19Jl6jJ2K5jRJ31j56mP6l5J14q6m6LMk3q2O8L4J27j19Q3M8
$$ -64 59 37 -105 -158 -87 68 -52 118 -1 0 -36 -37 -25 0 -1 8 139 -17 -21 55 20 134 48 2 5 9 -14 -96 -28 6 133 14 97 145
540A45o2j66N9rjp8J82k59J78j02Q2J67j38M7j3j2o1K1J4k7J4J15j4j12R9j72J42k5j36J69
$$ 145 83 -83 -24 -33 -34 -112 70 -189 -11 -113 -31 136 -2 45 32 20 -41 -20 -6 -33 -19 96 82 -30 69 -103 39 14 -122 47
277D7Pl4K6N7q0O6pl8l6OJ07p4j36J85j6Mj60J67p5O1j31M9J3M8N9j44O0lJ6K5q6J8O0R2j11
$$ 47 54 20 46 103 23 89 82 44 8 14 121 47 -89 96 80 84 -76 91 16 77 -54 -5 8 56 115 -29 31 28 44 69 -17 1 61 153 42
-29D2q6J31k2k9j04j1N1Q0l5qk7K7o2M5k5q1O2OQ1o9jL4N1
$$ 42 -44 87 65 36 -68 -79 -28 52 17 9 -18 9 -53 -8 -33 -114 -52 -46 35 -34 -35 -1 50
-230E0
##PAGE=	F1=12107.4
##FIRST=	23146.755397984237788,	4241.1433691826614449,	0.10427558422088623047
##DATA TABLE=	(F2++(Y..Y)), PROFILE
4241B2q8KQ5l2l7o7K02l0j22j1N0N6p4O5K5o4J91j42Pr6M7J6j12K47k21M5K5P4R9k50M6L2
$$ 22 -66 -64 21 -11 -48 -115 87 57 -65 -76 -26 30 -44 21 46 -18 173 31 38 -58 -11 5 -107 140 -81 -36 -11 63 162 -88 -42 -10
3961a0o9O9N9J0l0j5J19l3o9j19M2r0L5M2M7o3l7J40l6o0M1J1lL8l2l2O4o6o2l2R2%Pk4N1
$$ -10 -79 -10 49 59 29 14 133 100 31 -88 -46 -136 -101 -59 -12 -75 -112 28 -8 -68 -27 -16 -19 19 -13 -45 19 -47 -109 -141 -49 -49 -42 -66 -15
3655a5M2k2o0P0r3J59k74K83J1L0k14K5Q1j13R7O6p3r0J54o1o4K7O5P9q5p2J51r0O2m6k17
$$ -15 27 5 -55 15 -78 81 -193 90 101 131 -83 -58 23 -90 7 73 0 -90 64 3 -61 -34 31 110 25 -47 104 14 76 30 -187
3384a87J28J50j33m3L9q5N1k1N8K7M9p4J49k05R9J5j9N0j08P4q6M4J00j31l4J6P7J314N111
$$ -187 -59 91 -42 -85 -46 -131 -80 -101 -43 -16 33 -41 108 -97 2 17 -2 48 -60 14 -72 -28 72 -59 -93 -77 0 1314 6425
3130F425j478m644j27j51O6MN3oj49Ko1N6NJ34l8O3j42j63k5N58k97q5J20N7l17J19PNJ37
$$ 6425 4947 303 176 25 91 95 148 142 -7 -5 -66 -10 -5 129 91 154 12 -151 -176 382 85 0 120 177 -140 -21 -14 -9 128
2876A28k38J67L7n4j0J4O2p0q2J61j72Q5p1J51j40Lq0N1j6Q8J0J1r2J59l7l0j01J15RRqPn9
$$ 128 -110 57 94 40 30 44 106 36 -46 115 -57 28 -43 108 -32 -29 -109 -58 -74 14 24 35 -57 102 65 35 -66 49 58 67 59 66 7
2587GJ53k29l9P5o9J31r1J11n9P5n6K0j64O6K36o4j54N4NJ14l7p3R1j76l8J44k6n7qJ62j64
$$ 7 160 -69 -108 -33 -102 29 -62 49 -10 65 9 29 -135 -69 167 103 -51 3 8 122 85 12 103 -73 -111 33 7 -50 -58 104 -60
2316f0R3p7N5M8j02Q2j17R3l3J0nK6pl7kJ08j11P1n6N4lo0k1Km4J69j7k5j4r7K6J00l2q1J17
$$ -60 33 -44 11 59 -43 39 -78 15 -18 -8 -13 13 6 -31 -33 75 -36 35 -21 33 30 -30 -51 -49 -93 76 59 34 20 -77 -51 49 17 -64 53
2010E3n4M4oJ5m8j02KN6NM9jN3r8O9p3K9kM6J6p9q0K13L4k01M5pN1j7l0K8Q1j67NjN0Q6j17
$$ 53 -1 43 37 52 4 -98 -96 -40 -35 14 13 66 -32 37 -36 -7 -9 37 53 -26 -106 107 141 -60 -15 -22 29 12 -18 10 91 -76 -71 -72 -22 64 -53
1686e3J9Q1O2q1K4j07P0J02p6k5o2M7p4J37J4j78P3l1R3n8N9q4L5O5l3m7r9M5J49j01J24o1
$$ -53 -34 47 109 28 52 -55 15 117 41 16 -46 1 -73 64 78 -100 -27 -58 35 -23 36 -48 -13 52 19 -28 -127 -82 67 -34 90 29
1406B9Op6L0m2O7k2j30J63l0l1N7nJ8k6q1QJ59j45j5j6M1M0R0j14K13j13j45K5K9P9q6J91
$$ 29 35 -41 -11 -53 14 -8 -138 25 -5 -36 21 16 34 8 -73 -65 94 -51 -66 -82 -41 -1 89 -25 188 75 -70 -45 -16 63 -23 168
1126A68k25L6p4J10l5N4r8J52MP5j81O2O8j5K6j86p3J8K04m2j28J36l6j06J44j00Q7l5R6j22
$$ 168 -57 -21 -95 15 -20 34 -64 88 92 167 -14 48 116 101 127 -59 -132 -114 90 48 -80 56 20 -86 58 -42 45 10 106 -16
863a6r8J42j08P5K5j05m7P8J24r8J08r0N6j08K1k3K5N3m8J34j18J3O2m9J08r8j2k6L1j1n1
$$ -16 -114 28 -80 -5 20 -85 -132 -54 70 -28 80 -10 46 -62 -41 -64 -39 14 -34 100 -18 -5 57 8 116 18 6 -20 11 0 -51
592e1j2N6J35r4N0P7j29j27N6j3J8j02J90k28J69j27J58J19j45J05r3k6J4N0m8pK2J09o4j18
$$ -51 -63 -7 128 34 84 161 32 -95 -39 -52 -34 -136 54 -174 -5 -132 26 145 0 105 12 -14 0 50 2 -5 17 126 62 -56
330e6R8j29J34j8j28J56Nk3OK4o8J04m0m5l6K1Q0n1o4J58p3N6j97J29l0Q3j29J3J3P8Qj01
$$ -56 42 -87 47 29 -99 57 62 39 45 69 1 105 65 20 -16 5 85 34 -30 128 55 111 -86 43 13 96 -33 -20 -7 71 79 -22
50b2K9n1P2J8r2lJ07J23j71l2J17l4l4j27K4O5N6p8M4p3L7K6K0n4n4P6l5M0n1L4rR8
$$ -22 7 -44 28 46 -46 -49 58 181 10 -22 95 61 27 -100 -76 -11 45 -33 11 -62 -25 1 21 -33 -87 -11 -46 -6 -57 -23 -32 66
-230F6
##PAGE=	F1=12060.2
##FIRST=	23146.755397984237788,	4241.1433691826614449,	0.073539614677429199219
##DATA TABLE=	(F2++(Y..Y)), PROFILE
4241A5r0RJ23q8j9l4K10o3j06n1M8R7r2O6K5m7J61r2m7r8K0Oj7J59j47LO1P9J02k51J5pj4
$$ 15 -75 -66 57 -31 -50 -84 126 63 -43 -94 -46 51 -41 25 50 3 164 72 25 -73 -53 -47 -64 95 -52 -49 12 91 193 -58 -43 -50 -64
3952f4J06O0p8j3pJ24q0j0j17K2r0M0O3Pq5MJ57j8j11P5nJ4k7M0j3P3p7q2k6J19l7L8p8O8
$$ -64 42 102 24 11 4 128 48 38 -79 -57 -147 -107 -44 -37 -122 -118 39 21 -90 -15 -20 -6 -33 7 -6 67 -10 -92 -118 1 -36 2 -76 -8
3655hJ1P6j33N3m5R7j96K54j3O0k25QQ2r1R0M3n6r6J12M2o0l6R3R1j35j9R5p4P9o5k09R2J64
$$ -8 3 79 -54 -1 -46 51 -145 109 96 156 -69 -61 21 -70 20 63 7 -89 23 65 5 -31 62 153 18 -1 94 20 99 34 -175 -83 81
3366H1j03k3J1p6K8m3Q1M1K8p8J59j82J02J4j5O7j65J06n3j0R2j19l1RQ1N53K571o76k318
$$ 81 -22 -45 -34 -110 -82 -125 -44 -3 25 -53 106 -76 26 40 25 92 -73 33 -20 -30 62 -57 -88 -79 2 555 3126 2450 132
3112A32n8q7P2j2J2N4j24j5j4K6M1J04k8L6o6j71k3K76r9k9P7O9k95P7mJ1R7k24K01j0%kK9
$$ 132 74 -13 59 47 59 113 -11 -26 -40 -14 27 131 103 139 73 -98 -121 155 56 27 104 173 -122 -45 -49 -38 59 -165 36 26 26 24 53
2824E3K2q3j5J35j54J27j03J51r0o9l0K5j39J77J4J4j05J56l3M3k38J75k1M1l2Km6J15j75
$$ 53 75 -8 -23 112 -42 85 -18 133 43 -26 -56 -31 -170 7 21 35 -70 86 53 96 -142 33 12 53 21 23 -23 92 -83
2570h3K3m5k7J04q4J21n0J06m1m2j28O7K49q7r6Kj7J32k9m8P1j84m0J36o5k3K7J67j41J03
$$ -83 -60 -105 -132 -28 -112 9 -41 65 24 -18 -146 -79 170 83 -13 -11 -28 104 75 27 98 -86 -126 10 -55 -78 -51 116 -25 78
2307G8j24P4N6m7Kr4N5J3J0l1M9n3l2j6J58j12O1q9L2M0n9K9o3j2J18J4j6j1j14O6K6j9q1
$$ 78 -46 28 84 37 39 -55 0 13 23 -8 41 -12 -44 -60 98 -14 47 -42 -10 30 -29 0 -63 -75 43 57 41 30 -84 -18 8 -11 -92
2019i2J38j10J06j5j7j4l5Jj1OJ3N6M4p6O0j13L5J2OJ1k5k5J35Q2k12O3n5J06p2n3O5P6j35
$$ -92 46 -64 42 27 10 -4 -39 -38 -49 -43 -30 26 70 -6 54 -59 -24 -12 -6 5 -20 -45 90 172 -40 23 -32 74 2 -51 14 90 -45
1730d5nnJ6Q0p0j8Q5N1j0lj61J14R4j03ok8mj29K34m9j18M5NQ1n0j1j26J19O0o0j4j23P3J62
$$ -45 -50 -55 -39 41 -29 -47 38 89 79 76 -85 29 123 20 14 -14 -18 -147 87 38 -80 -35 -30 51 1 -10 -136 -17 43 -17 -31 -154 -81 81
1432H1q0R3l6m2r8O5k6N4N1j90J42k4k4L2oM7k5l7qJ09j39rkJ2L8J09r3J77r3j63RM3J13r3
$$ 81 1 94 58 16 -82 -17 -43 11 62 -128 14 -10 -34 -2 -8 39 14 -23 -31 78 -61 -70 -72 -60 -22 87 -6 171 78 -85 -76 -33 80 -13
1135a3J77j69n1p8J33k2N8j02J40J3O3j90J15P4r1M4j77n2K9J56k7o0P7n6j28J83j17Q6l9
$$ -13 164 -5 -56 -134 -1 -23 35 -67 73 86 149 -41 74 148 57 101 -76 -128 -99 57 30 -30 47 -9 -137 46 -71 15 -24
881b4J34j14j34J36n3kN0m1l1N6Q7m0J7n3Q4j59L8m6K1J00j01J22p3K7O2l8M9m2k1n3N3Oj6
$$ -24 110 -4 -138 -2 -55 -57 -7 -48 -79 -23 64 24 41 -12 72 -87 -49 -95 -74 26 -75 47 -26 1 63 25 74 32 11 -42 11 17 1
592An8N7P2m0L3J05j60j00K7j0N2r2J50j59R8r6K00L6j15J43j17n7M5R7j03JN2Q2j00q9Q0
$$ 1 -57 0 72 32 65 170 10 -90 -63 -73 -21 -113 37 -122 -24 -120 80 116 1 144 27 -30 15 112 9 10 62 144 44 -45 35
321C5q7Q3j4q5J62l5j1l2Rm0R3k4o6jJ3K4KJ1J49j72Q7j80P7j2R2r9J1J0J05o2q5K5p7R6K
$$ 35 -52 31 17 -68 94 59 48 16 25 -15 78 54 -12 -13 0 24 26 37 186 14 101 -79 -2 -14 78 -21 -10 0 105 43 -42 -17 -94 2 4
15Dq8j2J66Q7j90J8R3m0j5j17K3P9Po7Q0j15K5J04k7n2l1O7n3nl6R6m2J01
$$ 4 -84 -96 70 157 -33 -15 78 38 23 -94 -71 8 15 -52 28 -87 -62 42 15 -37 -68 -1 -54 -59 -95 1 -41 60
-230F0
##PAGE=	F1=12013
##FIRST=	23146.755397984237788,	4241.1433691826614449,	0.042803525924682617188
##DATA TABLE=	(F2++(Y..Y)), PROFILE
4241Ir4J7J61j44jjK02j10n6n6MJ56j44R4K0l2J15n8q5q6noP9P1p4l8R2P7M9j66k9n9O1J02
$$ 9 -85 -68 93 -51 -52 -53 149 39 -17 -73 -69 87 -57 37 57 25 140 82 -3 -89 -94 -100 -21 50 -24 -62 30 107 156 -10 -39 -98 -37 65
3944F5L3j30jjJ41j10M8j16K1p0%R9j7q8N3J24k7j29J05k4L0r2J14MQ3q8j03k0J48p5Q5j17
$$ 65 98 -32 -33 -34 107 -3 45 -71 -50 -120 -120 -21 -38 -126 -73 51 24 -105 0 -24 6 -86 28 32 115 27 -76 -96 52 -23 62 -55
3664e5O8l3J58k22N4K3Pr0K26l8O0k05j3P8p1P9O4n4j06O6P7k0q7J35P2j53K8L6p3Q0p1j90
$$ -55 13 -20 138 -84 -30 -7 0 -90 136 98 158 -47 -60 18 -53 26 90 36 -70 -4 73 53 -34 101 173 20 48 84 11 91 20 -170
3384a70P0J33n4J6j6o7Mo6J05N4J5p6J22j04O7L8j8P4j89J07j7n9Q3j07j2J8O9L9P43j55o44
$$ -170 -100 33 -21 -5 -21 -88 -84 -150 -45 9 24 -52 70 -34 33 71 53 127 -62 45 28 -31 52 -55 -67 -49 20 59 802 647 3
3112Cj0qL4k3k4J27q5m5J8nP8P3j9j1j2j75M3N2N3%PM5k07K9k2K8P0j81K04o3M6k3P3pq5L3
$$ 3 -7 -15 19 -4 -28 99 14 -31 -13 -18 60 133 114 103 91 -84 -41 11 64 64 71 116 -91 -62 -84 -56 14 -167 37 -26 20 -3 70 63 -22 11
2797A1R1j25J19q5J39l4j38J4rk10K15K3K4j19J53l2J12l44K05m7P6o9j9j9R1j19Q4j49L1
$$ 11 102 -23 96 11 150 116 -22 -8 -17 -227 -12 11 35 -84 69 37 149 -195 10 -37 39 -30 -49 -68 23 -96 -12 -161 -130
2544a30O0r2J35l6J06Mr4q0L9K31r5k3n2l8J50k0k2N0j92m2J28j05J9O9J04q2J18j66J24L5
$$ -130 -70 -162 -27 -63 43 47 -47 -127 -88 143 48 25 -27 -65 85 65 43 93 -99 -141 -13 -118 -99 -30 74 -8 110 -56 68 103
2281A03Op7m2j2O3J5n9P1r8k8l4K06q3K1j19J2O9p3J08r5PN6J9K7m6j09J32p9np6J60j66J61
$$ 103 109 32 -10 -22 41 56 -3 68 -30 -58 -92 114 31 52 -67 -55 14 -59 49 -46 -39 17 36 63 17 -92 40 -39 -44 -120 40 -126 35
1992C5l1j1m9M9J8m6k4k0J18L9n3L7j06K2Pl5QK9K7M0J11j77O7j00J64j12o0Q6N6j04j3j0
$$ 35 4 -7 -56 -7 11 -35 -59 -79 39 78 25 62 -44 -22 -15 -50 -42 -13 14 54 165 -12 55 -45 119 7 -53 33 89 -15 -28 -38
1712c8j8P0k7k4N8K8N2j7k00J43P2j11L1j4j2j77K79p9q4OL0Q8k2r8j22J83L8r4J7r0R5J53
$$ -38 -56 14 -13 -37 21 49 101 84 -116 27 99 -12 19 5 -7 -184 95 16 -68 -62 -32 56 34 -64 -186 -3 35 -59 -42 -132 -37 116
1432A16p9M5k6p4j06R7j5P2R5k47J26j8j9J1mM8OKk7N9j33J2K7k7K2J00m4J23r1j65ON4J44
$$ 116 37 82 56 -18 -124 -27 -42 30 125 -122 4 -14 -33 -22 -26 22 28 30 3 62 -71 -59 -32 -59 -37 63 19 142 51 -114 -108 -54 90
1143I0q7J19r9j21n3J25nO6j04J26J8M8j63J40N3j33N9j72j3N9M9j3LJ5m2j15J82j16N8j3
$$ 90 3 122 23 -98 -151 -26 -31 35 -69 57 75 123 -40 100 153 20 79 -93 -106 -47 2 -11 -8 7 -35 -150 32 -84 -26 -39
881c9J20n8j34O5K5n9O1Rj6L4N7K7q7k8R5j68K0m3KJ33j09R4l1L8O2k9OK9l4q4M2N1j5p8M7
$$ -39 81 23 -111 -46 -21 -80 -19 -10 -26 8 65 92 5 -23 72 -96 -76 -119 -117 16 -93 1 -30 8 70 41 47 76 42 -42 0 51 36 -42 5
575ElK5K6J04j62p7orQ2n2P9r0K8n0J96k9o7J34q7q9J4J72j28nO5O8j25l0L1m8K8ll4J53r1
$$ 5 2 27 53 157 -5 -82 -88 -97 -15 -67 12 -78 -50 -100 96 67 0 134 47 -42 -28 144 16 11 76 144 19 -11 20 -28 0 -3 -37 116 25
268B5Ro1NkL7Pn7O5l9j8M4P5J52k54O1j16M8l0J06o5PPJ33j32p3J7n8J07j8r0k9K16Qj51N5
$$ 25 34 -27 -22 -24 13 20 -37 28 -11 -29 15 90 242 -12 49 -67 -19 -49 57 -8 -1 6 139 7 -66 -49 -107 0 -18 -108 -137 79 87 -64 -9
-38iN5m0J2r2L9P9n8m1J31j73jJ65q7m4jN9p2l9qJ40l6P5
$$ -9 46 6 18 -74 -35 44 -14 -55 76 -97 -98 67 -20 -64 -65 -6 -78 -117 -125 15 -21 54
-230E4
##PAGE=	F1=11965.8
##FIRST=	23146.755397984237788,	4241.1433691826614449,	-0.029707789421081542969
##DATA TABLE=	(F2++(Y..Y)), PROFILE
4241fo9K2J51j63J5L9J58j70L0m4m8K07j87J25qjM5k9p8r4lm4J45jpn7J19L7j7k5o6r0J20
$$ -6 -75 -53 98 -65 -50 -11 147 -23 7 -37 -85 122 -65 60 52 51 96 67 -11 -105 -108 -152 -7 -8 -15 -72 47 84 67 42 -24 -114 6
3952FP0k1j31lJ2J29r3N7r6N1l1o7J25l4n5Q5O9n7j01Q9k1J8j17J36M6Q7j06j34kJ55q9J44
$$ 6 76 55 -76 -79 -67 62 -31 26 -70 -19 -50 -117 8 -26 -81 4 73 16 -85 4 -17 1 -116 20 66 153 47 -87 -89 66 -23 121
3672A21j46M1n0J82k95O9N5m4J9K02n3Nj31jK3l0M5J10o5p4K6K2K5j06J48N5j64R3k1o5Q5
$$ 121 -25 16 -34 148 -147 -78 -23 -67 -48 154 101 106 -25 -26 -3 -33 12 122 57 -17 9 31 56 -50 98 153 -11 82 61 -4 81
3401H1q1j58N9J15n1O6k4l4l0j01J24N3j2n7N1nJ1N6J5O0j70Q9j4q6P0q9K3K3N7j33J7NOJ7
$$ 81 0 -158 -99 16 -35 31 7 -27 -57 -158 -34 19 7 -50 1 -4 7 63 78 138 -32 57 43 -43 27 -62 -39 -16 41 -92 -75 -70 -64 -47
3104d7M7k5Ln4J77m5r4K9k6J18N0j1q1K2j50J25p0J27k3o2L5j03Jn0Q3Kj24J96j07J00p1R3
$$ -47 0 -25 -22 -76 101 56 -38 -9 -35 83 133 122 41 63 -87 38 -32 95 72 10 45 -58 -57 -107 -24 -22 -146 50 -57 43 -28 65
2824F5k1n8O1K4j02R5j6J13j3j67M6o1j93K13J3L8j02J49l8J27l63J91p9J00j19j2J8N8n0
$$ 65 44 -14 47 71 -31 64 48 161 148 -19 27 -34 -227 -14 -1 37 -65 84 46 173 -190 1 -78 22 -97 -109 -91 -33 -83
2570h3J14k02P9K9j23J43qR1K5j11k9k1K02j13N1p8l5J17K0l6O1j77m3J05j18M6J06Kk0J18
$$ -83 31 -171 -92 -63 -186 -43 -51 40 65 -46 -75 -96 106 -7 44 -34 -69 48 68 32 93 -84 -127 -22 -140 -94 12 14 -6 112
2307A12j94J77LO2j29Lm3P4J4q3O6j00n0n8K58m4pj57MQ9q6J39q4L1rLQ9r3p7J90j75J5p6
$$ 112 -82 95 98 160 31 34 -9 65 79 -4 62 -38 -88 -146 112 68 61 -96 -92 -3 -89 50 -34 -3 -12 -9 80 -13 -90 100 -75 -60 -136
2019a36K11k15J63l8j0p9J12L1n0o1m6J63L9l2mn9J6k6m5j2P4Q9o0R7r9L9j12K02j24n2N3
$$ -136 75 -140 23 -15 -25 -104 8 39 -11 -72 -118 45 84 52 48 -11 5 -21 -66 -78 -4 85 25 122 23 62 -50 152 28 -24 29
1747B9M6q0%l3o4Q8J0j7L1J4N6m1j59J42N1j18R5k6jj92K24m6p4nK2R5M0j71j11J97M3j19
$$ 29 75 -5 -5 -38 -102 -14 -4 -21 10 24 80 39 -120 22 73 -45 50 24 23 -169 55 9 -65 -70 -48 47 87 -84 -195 2 45 -74
1467g4KKQ3J13n9k3mq4j01J21k0J13P6k61J19k9NNK2nM5Mj9J0q4J9M1m7MP9qM5p7j42J9L7
$$ -74 -72 -70 13 126 67 44 40 -44 -145 -24 -44 69 145 -116 3 -26 -21 -16 6 1 46 50 31 41 -43 -24 17 -30 -26 53 45 90 13 -129 -110 -73
1152g3J26n5P0l0j53mR7j8P2j03J17J7M0j21J16K4j14L7j64N0Q4p0J0O3n5mo6J29j10M2QN9
$$ -73 53 -2 68 38 -115 -119 -22 -40 32 -71 46 63 103 -18 98 122 8 45 -119 -69 15 -55 -45 18 -37 -41 -107 22 -88 -46 -38 21
872B1L0j07j9J20q9J3M8k8N0J4R1j37l6P0j20k4j4j8J25p7O1qM1L6Ol6R8l7j08K1R5m7p8N1
$$ 21 51 -56 -75 45 -44 -31 17 -11 39 53 144 7 -29 41 -79 -103 -117 -135 -10 -87 -26 -34 7 43 49 13 111 74 -34 -13 82 35 -43 8
575Ho5P6K5Q6j42o8J3m3R6j3L3n1k6J1J52q0j5Q1pj36l9K46j14n8R9M8j04J7j5l2n%%J42j42
$$ 8 -57 19 44 130 -12 -80 -67 -110 -14 -27 6 -45 -71 -60 92 12 -3 78 71 -65 -104 142 28 -30 69 117 13 30 15 -17 -22 -22 -22 120 -22
268b2M4q1J0M0l6L2l4J19q7m1Q8N9J83k90J6m2M4p4R6k4NK0J36j89n8J3k0J06l8q2n9K41p0
$$ -22 22 -59 -49 -9 -45 -13 -47 72 -15 -56 32 91 274 -16 0 -42 2 -72 24 0 5 25 161 -28 -86 -73 -93 13 -25 -107 -166 75 5
-20Eq8Q8nk3J7n8Q3N3j14k2J83k12l0J79j13k7PN4p7k8j3J60%L2
$$ 5 -83 5 0 -23 -6 -64 19 72 -42 -64 119 -93 -123 56 -57 -84 -77 -23 -100 -128 -141 19 19 51
-230E1
##PAGE=	F1=11918.6
##FIRST=	23146.755397984237788,	4241.1433691826614449,	-0.10221910476684570313
##DATA TABLE=	(F2++(Y..Y)), PROFILE
4241b2m0L1J12j52J1O1J29k16J13l6p0K28k26J59l5K9l9j6m0p2j1r5J86m0K6n0J44pq2J15
$$ -22 -62 -31 81 -71 -60 1 130 -86 27 -9 -79 149 -77 82 47 76 37 21 -19 -91 -102 -197 -11 -51 -25 -75 69 62 -20 95
3979I5j04j21J64K2m5j01nK6J04q7L7m7P6Nj33J51l3mP4L0r2p6P5j4k2j14J40O9J01j11j32
$$ 95 -9 -130 34 56 11 -90 -95 -69 35 -52 -15 -62 14 19 -114 37 4 0 74 104 12 -64 11 -3 -25 -139 1 70 171 60 -72
3707g2j0J39o4J72j45j3l4J51l22P3P2l9Q0J54l0n4o1J0l2J2J2J56p6m4j3n1N1p9J44M5j67
$$ -72 -82 57 -7 165 20 7 -27 124 -198 -125 -53 -92 -12 142 112 58 -3 7 -25 -13 -1 155 79 35 22 -29 22 -57 87 132 -35
3436c5J28m7o6Q3n9j57O6J15o1J01l2lm8j19J27L5m1m2QN7k4L1O2O2j18M7l8q0N4p5M6J6N0
$$ -35 93 46 -20 63 4 -153 -87 28 -33 68 36 33 -15 -134 -7 28 -13 -55 -47 10 -14 17 79 141 23 70 32 -48 6 -69 -23 -7 43
3147D3q0mm4nJ1R6q7O5m7J87m4j32rj3J31M6J6j49N4j34J99j18J34p5r6P0n2k4p5J66r5o3
$$ 43 -37 -41 -85 -90 -79 17 -70 -5 -52 135 91 -41 -50 -63 68 114 130 -19 35 -99 100 -18 116 41 -55 15 -37 -61 -136 30 -65 -128
2867a28J90j51J54j21J10kn9O4j0q3O7M4P4mj47L8r7r3J51mM6q9J42l7Q7k81J37q9Q9j50J4
$$ -128 62 -89 65 -56 54 52 -7 57 47 -36 31 75 149 145 -2 36 -61 -154 -3 -7 39 -50 92 55 142 -139 -2 -91 -2 -152 -138
2596a38N0K0L0R3j86R5j1j64J53K0P5M6j29K2p9J72j33J27q8j8O8M6n1P3j62m5R7j16N6J25
$$ -138 -88 -68 -38 55 -131 -36 -47 -211 -58 -38 37 83 -46 -24 -103 69 -64 63 -25 -43 25 71 20 93 -69 -114 -17 -133 -77 48
2334D8o7J6R4j83J84j3J02j35J3m9O6mr3P7j08p8m8K44J8j3j77J5O5p9J22o1Q0m8k7J36j37
$$ 48 -19 -3 91 -92 92 79 181 46 59 10 76 72 -21 56 -52 -130 -178 66 84 71 -106 -91 -26 -105 17 -44 36 -12 -39 97 -40
2062d0m0K18k41L5p7K33k34J65m7l7q0J56K6m5q9k2J57M6om3j4Po2k5o3J09J38j44R9k4Nr4
$$ -40 -80 138 -103 -68 -145 88 -146 19 -28 -65 -145 11 37 -8 -97 -119 38 84 78 35 21 28 -34 -59 -122 -13 125 -19 80 56 61 -33
1782c3K11j32m1K0L6n4J8r0q2J32J2j0OJ7J9o1n4J18Qr1J31p1M0j62J16j0o3J4j6J06J07k25
$$ -33 178 46 5 25 61 7 25 -65 -147 -15 -3 -13 -7 10 29 -32 -86 32 40 -51 80 9 49 -113 3 -7 -70 -56 -72 34 141 -84
1502h4q3J67O3j33kP9N7N7n4p6L3p9q0J30m2J39M2k58J27m1K9jM9n9Q4Nj0l8l6K4N7o6j6N8
$$ -84 -167 0 63 -70 -72 7 64 121 67 -9 24 -55 -135 -5 -47 92 134 -124 3 -38 -9 -10 39 -20 64 69 59 21 -15 9 66 0 -16 42
1205D2K9l3o2j20L2J9J10k3K7Nj59P3L4k8Q3j03J09J6L1p9R2J1q0%j71J12J11j70N5N9r2M8
$$ 42 71 38 -24 -144 -112 -93 17 -6 21 26 -133 -60 -26 -54 29 -74 35 51 82 3 95 106 26 26 -145 -33 78 -92 -37 22 -70 -22
925b2mM3p9L8k0nJ13o9r2J94q4n2O9l4P5n2J33j05o5N2o5o9J5n2J00k9M2JL0kK9n4J29k3j12
$$ -22 -26 17 -62 -24 -44 -49 64 -5 -97 97 13 -39 30 -4 71 19 152 47 -18 34 -31 -100 -85 -137 -37 -66 -24 -23 7 5 34 -20 109 86 -26
618b6j0J34q6q5Q5r8J05JO9j23l6N5q8R7%K0k9l8M8Q5r9MK5O9j68p9K71n1j32J12N1o0O0o5
$$ -26 -36 98 12 -73 12 -86 19 20 89 -34 -70 -15 -103 -6 -6 14 -15 -53 -5 80 -19 -15 10 79 -89 -168 103 52 -80 32 83 23 83 18
321A8m6rj2J8J09j55R6q7L4M0p9K5RJ33j09l8R7OK24k57m8J4N7j06P3LOL7J15k09n3lJ7J06
$$ 18 -28 -37 -49 -31 78 -77 19 -68 -34 6 -73 -48 -39 94 -15 -53 44 50 274 17 -31 -17 40 -66 7 10 16 53 168 -41 -94 -97 -80 26
23B6m7o3p3K20j36j3J20o3l1krJ41pj06l2K07k28l7J81j50K1j6O1p0j4j4J31M7J9
$$ 26 -21 -84 -157 63 -73 -86 34 -29 -60 -62 -71 70 63 -43 -75 132 -96 -133 48 -102 -81 -97 -36 -106 -120 -134 -3 44 63
-230F3
##PAGE=	F1=11871.5
##FIRST=	23146.755397984237788,	4241.1433691826614449,	-0.20697820186614990234
##DATA TABLE=	(F2++(Y..Y)), PROFILE
4241d4j2L2J07j10l6O4Q2j93J38j4p3J97k22J44j1N1q6m6pk1nj46K00n0J6j4J65p4j20K15
$$ -44 -56 -24 83 -27 -63 1 83 -110 28 14 -59 138 -84 60 49 100 14 -32 -39 -60 -65 -211 -11 -61 -45 -59 106 32 -88 127
3979A27j24j30J96k8m2p1LL4Q6r0j0j0R4L5j98J73kK8J0L5j02m9N8J0o3r8J04P4J04j19q8
$$ 127 3 -127 69 41 -1 -72 -69 -35 51 -39 -49 -59 35 70 -128 45 43 71 81 116 14 -35 23 33 -30 -128 -24 50 154 35 -53
3707e3l7J16jJ39j27o2QP4k71N8N1K3R2Q8L8j18POo7J8pJ78q5qm4j15P8l3J14O5j90J29l4
$$ -53 -90 26 25 164 37 -25 -17 57 -214 -156 -105 -82 10 98 136 18 25 31 -36 -18 -25 153 68 60 16 -99 -21 -54 60 125 -65 64 30
3419C0o6R4m7j57O6J57j14J20l8O3q9q2J09Rp6n2J3N1j8j6J10L0k7J7q8j8J1l1K4oO3j0Q7
$$ 30 -36 58 11 -146 -80 77 -37 83 45 108 19 -63 46 55 -21 -73 -60 -9 -27 -43 67 97 70 87 -1 -19 -8 -39 -15 -21 42 32 119
3130A19p6j45K2R7j16J29j2J44n8j62l9K5R6P1K0j64P8j39K34j27J15j25j12J34o0k6o6K14
$$ 119 43 -102 -80 17 -99 30 18 162 104 -58 -97 -72 24 95 115 -49 29 -110 124 -3 112 -13 -125 9 -51 -77 -143 71
2885G1j64k6J96j85J80j35P6M9q2N8pj10O7P6M6J9j10Mr0J3M9m7O0k7R5l1L4j41O9p4N5j56
$$ 71 -93 -119 77 -108 72 -63 13 62 -20 38 31 -79 -12 64 110 129 19 23 -67 -54 -5 -52 8 -19 76 45 79 -62 7 -67 -12 -168
2605a68M9M8kQ8O8j43N2j6j67J14M8Q1K2j12L8j14J79j49J29p0K9oP3p5O6j64L1P1j22Q4J02
$$ -168 -119 -71 -73 15 83 -60 -8 -24 -191 -77 -29 52 74 -38 0 -114 65 -84 45 -25 4 -2 71 -4 62 -102 -71 0 -122 -38 64
2334F4r9QM5r9J17K1J06j05j8j7N4n7l7O3j04r8J2J54M6J5j54K7K9n8R2p4J37o2o6J37j15
$$ 64 -35 -27 18 -81 36 57 163 58 40 23 77 20 -17 46 -58 -156 -144 10 56 71 -83 -56 -27 -85 7 -67 70 8 -58 79 -36
2062c6k3K31k72N5p7K09k30J58k8p4o4J52K0l2q9L8R9N4oq5M6j2m6J2j39J24J53k01J14L6
$$ -36 -59 172 -100 -45 -122 87 -143 15 -13 -87 -151 1 21 -11 -100 -62 37 91 85 0 46 34 -12 0 -139 -15 138 -63 51 87
1800H7l1o4J84j19n7k0M1m2L7j31p2J84k8k7L3K3k9p2R3M9j0o5J22j09P8j14LJ7o5P0n5R2
$$ 87 56 -8 176 57 0 -20 21 -21 16 -115 -187 -3 -31 -58 -25 -2 -31 -103 -10 39 29 -36 86 -23 55 -59 -56 -39 -104 -34 -89 3
1520CJ75k34o1R0P9q5j5J07NL5m5j01O5k0q6J17m2J06J4k25J34m5M5k4Q6j06Q6mlm5rJ2O5
$$ 3 178 -56 -117 -27 52 -33 -48 59 64 99 54 -47 18 -2 -88 29 -13 93 107 -118 16 -29 16 -8 78 -28 58 54 51 6 -3 9 74
1231G4o3lL8J4o1k2r9L3kQ0J2oK9j57J37k3l5R4j10P0K9K8m3Q8Lm2l4k14J68J21j87P7J2p0
$$ 74 11 8 46 60 -1 -23 -122 -89 -91 -11 1 -5 24 -133 4 -19 -54 40 -70 0 29 57 14 102 105 63 29 -185 -17 104 -83 -6 6 -64
933f4L8Q3l5l4J9n3n1J47n0q9K02n9j06R7m5J08j14J31j3r7K5k3j08L5o9R4KJ3NJ2m8N0m2
$$ -64 -26 57 22 -12 7 -46 -97 50 0 -89 113 54 -52 45 0 108 -6 125 112 15 40 17 -91 -56 -125 -31 -29 -16 -11 1 -47 3 -39
645c9J25k6r6JJ33j10r6J08q4J13m6N8j02%Q9q5M0J2K6j8j4N2M2j21mRJ02j79p9K22M0j98
$$ -39 86 60 -36 -35 98 -12 -108 0 -84 29 -17 41 -61 -61 28 -57 -17 -5 21 3 -11 41 83 -38 -42 -33 69 -110 -189 33 73 -125
365a25J03P9k2Q4r1p7Qj0j0N8j14J42q7Q1k3m4j3J6J22o7n1R5m6K19j75p0K0N8r6PK8K1K2
$$ -125 -22 57 35 119 28 -49 -41 -51 -61 -3 -117 25 -62 19 -4 -48 -61 -45 77 10 -41 54 8 227 52 -18 2 60 -36 -29 -1 20 42
76D2R7j81j6n3M7R9l0m4n5J41j61L9J27q7o5k6L7J77q1l0l5J58j84n3J66j57P4q5J03p6K6
$$ 42 139 -42 -58 -111 -64 35 5 -39 -94 47 -114 -75 52 -35 -100 -126 -89 88 7 -23 -58 100 -84 -137 29 -128 -54 -139 -36 -112 -86
-195h6k9P8Q2M0
$$ -86 -115 -37 45 85
-230H5
##PAGE=	F1=11824.3
##FIRST=	23146.755397984237788,	4241.1433691826614449,	-0.31173717975616455078
##DATA TABLE=	(F2++(Y..Y)), PROFILE
4241f7J8L2J03o9p9P1K0j24J38j2n1J32j87R8M3M2r8j05L7L7l0j66K14o0k5N2J76j48j11K64
$$ -67 -49 -17 86 17 -62 9 29 -95 43 31 -20 112 -75 23 66 108 10 -95 -58 -21 -51 -217 -3 -63 -88 -36 140 -8 -119 145
3979A45j31j30J93n1j5p3J5M5O9r3n7K6Q4L5k08J91QL8m2M9r8nL7L1p5j13P1Q5J06j27m5o2
$$ 145 14 -116 77 26 11 -62 -47 -2 67 -26 -83 -57 27 62 -146 45 53 91 49 98 0 -5 32 63 -12 -125 -54 31 137 10 -35 -97
3699i7R7O5P5p7j13N0Kj54K0NO9R1J8J01j48N1k6o8K1l0J99r4K5p9j35R0LP2R0k10R9J0p0
$$ -97 0 65 140 63 -50 0 2 -152 -132 -127 -58 33 51 152 4 55 29 -39 -18 -48 151 57 82 3 -132 -42 -39 33 123 -87 12 22 -48
3410d8J01l4j58O3J94j35J07n5J17j14l0R2j8j17o8O5j1K4q6J48j5O5j4j23O0l4J5kl2Q3O
$$ -48 53 19 -139 -76 118 -17 90 35 152 38 8 100 82 -35 -103 -38 -49 -25 -111 37 22 87 73 -50 10 -24 -9 -11 -43 40 46
3139D6N3m8j78M1P5j10J91J9J00p1j92o9O1O2P6Pj20J04j57K57j36R7j61j11J81q2j9m9J93
$$ 46 99 51 -127 -86 -11 -121 70 89 189 118 -74 -143 -82 -20 56 63 -57 47 -110 147 11 108 -53 -164 17 -65 -84 -133 60
2885F0j63kJ90j90J76j44M7J02j01K1K7j41O2J09J8M5o7n7n0O9l9q0Q6L3N0k6j9pJj9Kj42
$$ 60 -103 -105 85 -105 71 -73 -26 76 -25 -4 23 -118 -56 53 71 116 49 -8 -58 11 -28 -108 -22 11 61 35 16 9 10 -9 -7 -149
2605a49M2O5pJ32K9j16onj57P6P6Q8kj12M0j39J93j15Q2n1P9n4O8o4L8j92J41M0j30J10Q0
$$ -149 -107 -42 -49 83 112 -4 -10 -15 -172 -96 -20 68 66 -46 -6 -145 48 -67 15 -36 43 -11 57 -7 31 -161 -20 20 -110 0 80
2334H0j27Lj3L3j1N5R0l3o7mN7r4J8M8q9j05Q6K0O2L3j17N4pl7O4q8J88p7q2J00l6m7K20k66
$$ 80 -47 -44 -57 -24 -35 20 110 77 10 6 63 -31 -13 35 -54 -159 -73 -53 9 42 -75 -21 -28 -65 -1 -89 99 22 -60 40 4 -43 177 -89
2036h9P1q0J85k28J53j0r5l3J35Nn1n9R5L6O4pj41R0j6j6N0k15J19J49k11J14J00o4n0J42
$$ -89 -18 -98 87 -141 12 2 -93 -126 9 14 -37 -96 -1 35 99 92 -49 41 25 9 59 -156 -37 112 -99 15 115 51 1 143
1773A43r0n8o2N0m8M3j33k1K11r4m0O4J2l1j01K20nj2p2P7j01J02o3j08M9o2J10m7M0K05j98
$$ 143 53 -5 -67 -17 -65 -22 -155 -176 35 -59 -99 -35 -23 -54 -155 65 60 48 -24 53 -48 54 -9 -117 -68 -130 -20 -67 -27 178 -20
1502b0n4J6R9l3k5R1l2K5k6j26R7L9r2J12l8NJ7j53J19m4O6n2J18j23N9k4rl6L2j3N6m4K7
$$ -20 -74 -58 41 8 -17 74 42 67 41 -85 12 51 -41 71 33 38 55 -98 21 -23 43 -9 109 -14 45 21 12 -24 8 -5 51 7 34
1213C4J5%r0K0p8L3k2M8M9m1N5j56K03q1m4J07j18L3L9K5oQ4nnn1k43J90R8j56Q7o0j6J0J53
$$ 34 49 49 -41 -21 -99 -66 -88 -40 9 -32 23 -133 70 -11 -55 52 -66 -33 6 31 25 109 104 99 48 -195 -5 93 -63 24 -36 -52 -42 111
916A11r9K5Mq7n1J28n1m5J56k7j18J06n3J38j45R8P8j27J6k2j07L7o6J04J9l0Rnq2R0n3R7
$$ 111 12 37 41 -46 -97 31 -20 -65 91 64 -54 52 -1 137 -8 90 168 41 57 35 -72 -35 -101 3 22 -8 1 -4 -86 4 -49 48
636D8k6p5M1J03j13q3R1n3Q8o8O0p0J6J06m7l8K0K8lJ3K8K8j51k0K3J06j61n1J38R3k11Q7
$$ 48 22 -53 -12 91 -22 -105 -14 -67 21 -47 13 -57 -41 65 18 -20 0 28 25 38 66 94 -57 -77 -54 52 -109 -160 -22 71 -140 -53
356e3R9RP8q8r5L5k3n4K6n3J43p3J27r2Pl7qQ2rn1R8r4J72p4p1pM4l8o1M9L6PP9j53L6q7M7
$$ -53 46 55 133 45 -50 -15 -38 -92 -66 -119 24 -49 78 -14 -7 -44 -52 30 21 -30 68 -26 146 72 1 -6 38 0 -61 -12 24 31 110 -43 -7 -94 -47
32d7O1lj8J6J6j53O4J14o8r6m5N2J83j31O8j6K7j17m7J56j55J20j61J52p4P3l8MR4O2
$$ -47 14 11 -7 9 25 -128 -64 50 -18 -114 -159 -107 76 -55 13 -3 24 -93 -140 16 -139 -19 -180 -28 -102 -29 -67 -63 31 93
-230I3
##PAGE=	F1=11777.1
##FIRST=	23146.755397984237788,	4241.1433691826614449,	-0.25415861606597900391
##DATA TABLE=	(F2++(Y..Y)), PROFILE
4241e4lM0J33o8r3P8k8n4Q7ml4O7j39K8J09N2q4j52L0J16q1j24K09p1p5J08J88k24o1K58j19
$$ -54 -57 -17 116 48 -45 33 5 -49 38 34 0 67 -72 -44 65 117 33 -119 -89 27 -54 -178 31 -40 -115 -7 181 -43 -104 154 35
3970C5j33J73m6K9j11K6N6O3q0p3K0M6J8j86J95PK6o0O1n0lL7L4o8j31P3P3P1j14j0o3Q8R9
$$ 35 -98 75 29 58 -53 -27 29 92 12 -61 -41 5 23 -163 32 39 65 5 66 16 13 50 84 16 -115 -42 31 102 -12 -22 -85 3 102
3681A02kk6j21Q3l9l2o0j2Q3N1KJ37j57N4o5n7L1rJ81j02K6j08p3R4RK8R7k03N1P2l6P2p9
$$ 102 100 74 -47 36 -3 -35 -95 -107 -24 27 29 166 9 63 -2 -59 -28 -37 144 42 68 -40 -113 -19 -10 18 115 -88 -37 35 -1 71 -8
3392hj02K5J85r9R0r2J36j35N6O6nj17j07J15p6P6j39J55o4J10j7j36J58q3L2n3k3R9nl3m
$$ -8 -110 -85 100 1 91 -1 135 0 56 122 117 0 -107 8 -68 8 -131 24 -40 70 53 -83 75 -8 24 -29 -52 47 42 9 5
3121Ej46N9N1o8J94N3L6q7j86p2P9M4Q3l8m6J00k00K81j06L9j57o8J88r9Mk6R3r0J5J26j53
$$ 5 -141 -82 -31 -99 95 148 184 97 -89 -161 -82 -38 45 7 -39 61 -139 142 36 75 -82 -150 38 -61 -57 -83 10 -80 -65 61 -92
2850i2J65j66J6J57j07j7R7j73L0J36j5P9m2r0RL6q1r5J10R1kk8m5O1m5M8l1r2j6Q8PJ16J4
$$ -92 73 -93 -77 80 -27 -44 53 -120 -90 46 31 110 68 -22 -13 23 -58 -153 -43 48 46 18 -27 34 -11 37 6 -86 -102 -14 -7 109 123
2561A23j08m4L7j23JQ7J02k0j06K5j13J59o6J4qR3n9N7m9k2k00K47J7j45J19M2j10j0m6J64
$$ 123 15 -29 8 -115 -114 -27 75 55 -51 -26 -139 20 -46 -32 -40 53 -6 51 2 -20 -220 27 44 -101 18 60 -50 -60 -106 58
2299E8j56P3N6L6j02JP6j14N2K2o3p9J62j27Q4J4n4P7m8rN4r7J95q1q6L0P9q5J98k42O7q1
$$ 58 -98 -25 31 67 -35 -34 42 -72 -20 2 -61 -140 22 -105 -21 -7 -61 16 -32 -41 13 -84 111 30 -56 -26 53 -32 166 -76 -9 -90
2019i0J67k15J35Jp1j2R2kn9j2J28k0M1L7j79P8j0K5P0k55J21J05j41Q0J17p9m0O8m9n8p2
$$ -90 77 -138 -3 -2 -73 -85 7 5 -54 -66 62 42 83 120 -59 19 9 34 104 -151 -30 75 -66 14 131 52 12 80 31 -27 -99
1747i9O0n6K6o9L4J85j39p2R4k2L0j25K47k9Jq8K8o7Q3j5j47N2k9R9j0jJ66j17l5m5P9K7k7
$$ -99 -39 -95 -69 -138 -104 81 -58 -130 -36 -58 -28 -153 94 65 66 -22 6 -61 22 7 -140 -88 -117 -18 -28 -29 137 20 -15 -60 19 46 19
1458A9M0l7K7n2q3J01Q1r7R9j1j02K4q6R1%P0j05J43r9Rm0m9LN3l0L9k6N4j1J3j00L2j6jk2
$$ 19 59 22 49 -3 -86 15 96 -1 98 87 -15 9 -77 14 14 84 -21 122 23 32 -8 -57 -54 -1 -31 8 -18 36 25 38 -62 -30 -46 -47 -69
1152f9M8N6p5Q7j64K03j01j9P5j17J3N3K0KO3K2Pl2k43J52P1r3R4j10L3n6J95j04N1l8n1j3
$$ -69 -21 35 -40 47 -117 86 -15 -34 41 -76 -63 -10 10 12 75 97 104 72 -171 -19 52 -41 53 -57 -24 -80 115 11 62 24 -27 -40
872d0N4p5L1O7j3q4R2l6J34j41O6J27j39K4o1p6K0pJ13jn1kqq7J21o0N0l5n3J08N9j11n1K2
$$ -40 14 -61 -30 37 24 -60 32 -4 130 -11 55 182 43 67 6 -70 -50 -57 56 55 4 2 -6 -93 28 -32 18 -17 -70 38 97 -14 -65 -43
575d3RL0n3P1m8J4Q4L0j09NK7J4L6OL3j82oL3Q1j21j0M0J07j61M6J15J5M8o0q2L7l1p2j2J
$$ -43 -34 -4 -57 14 -34 -20 64 94 -15 -10 17 31 67 73 106 -76 -82 -49 32 -89 -99 -59 48 -113 -67 48 63 111 51 -31 6 -25 -97 -109 -108
268a08J10k8J67j43M2o0n6M5M4m7P5p5R3Om7o6M4J2p8M2K9%Q2j46J01r2K0K3L2j9J09j03j15
$$ -108 2 -26 141 -2 40 -20 -76 -31 13 -34 41 -34 59 65 18 -48 -4 8 -70 -28 1 1 83 -63 38 -54 -34 -11 21 2 111 8 -107
-20a07M9R3l4j03n4M6J46j39J51Nj00k3o4J21j21J44k16J82n3P9k0l3O6O7
$$ -107 -58 35 1 -102 -156 -110 36 -103 48 53 -47 -70 -134 -13 -134 10 -206 -24 -77 2 -18 -51 15 82
-230H2
##PAGE=	F1=11729.9
##FIRST=	23146.755397984237788,	4241.1433691826614449,	-0.19658017158508300781
##DATA TABLE=	(F2++(Y..Y)), PROFILE
4241d2k3M9J63o9j06Q5p5J6J9j0%J5q8l8J31P5m2j72lJ68j48l7K03q9j19J66J67k74J4K18
$$ -42 -65 -16 147 78 -28 57 -18 -2 17 7 7 22 -66 -104 27 102 60 -112 -115 53 -95 -132 71 -18 -137 29 196 -78 -64 154
3979A54j02j31J52m0P3j51K7N5L9k5o3k1RKj36J69nMm8J02k0k0O6Pn6j46R1P5K8j10j1KN5
$$ 154 52 -79 73 33 106 -45 -18 37 76 51 -12 -33 -24 -22 -158 11 6 10 -38 64 44 24 90 97 41 -105 -14 61 89 -21 -32 -30 25
3690B5J07n3rj00Q2k7M3j29j8O2L8J0J34j33L2j02m0M1J1J67j06mj06j6R5K2rM9j49M0J15
$$ 25 132 79 70 -30 52 25 68 -61 -79 -17 21 31 165 32 64 -38 -78 -37 -26 141 35 31 -75 -91 4 26 17 66 -83 -43 72
3419G2j3L8j54j6l3J58m6Q6j49J36j35J01O9L8r8j27J23j21R6j60J35q3R9K2j26K20j29N5
$$ 72 59 97 -57 -73 -106 52 6 92 -57 79 -56 45 114 152 54 -73 50 -71 25 -135 0 -83 16 38 -88 132 3 58
3174E8j05j5J09k3l1K4j43M9M1j1J57M7rp9j34r2J01L0P5r6K6R5k42L06p7j8j36mJ49j02K3
$$ 58 -47 -62 47 24 -7 17 -126 -77 -36 -47 110 157 148 69 -65 -157 -56 -26 49 -47 -21 74 -168 138 61 43 -93 -97 52 -50 -27
2902b7pnj8L3O2j17J54j83j3J82q3o1J58j75l1J66m4J14j8j16P4n1p7q7R9J56m7n4m0R6o6
$$ -27 -34 -39 -57 -24 38 -79 75 -108 -121 61 -22 -83 75 -100 -131 35 -9 105 87 -29 45 -6 -83 -170 -71 85 38 -16 -56 40 -26
2631b6J14o9m3p4J14K4N8J4q8p3Q0r0p3R8J15l6j01Rq6J26j8n6L7J08o5M6k2p1j92L08mj55
$$ -26 88 19 -24 -98 16 40 98 112 24 -49 31 -59 -132 -34 81 45 -56 -47 -133 -7 -25 -81 -44 64 -1 45 23 -48 -240 68 64 -91
2351i1J11j1q4j3l5K38k30O3RR2j07k4J00j32Q7ml2m6J89k25J00j1J0J00r1K0M8j02J70n4
$$ -91 20 9 -75 -88 -123 115 -115 -52 -43 49 -58 -82 18 -114 -27 -31 -63 -109 80 -145 -45 -56 -46 54 -37 -17 31 -71 99 45
2089D5r4m4J80j39J91k03M8r6J68j84Q2L9j9k6N2lo2M2R7m2K6R0k17O8j7N4P5k51J21N7o7
$$ 45 -49 -93 87 -52 139 -64 -16 -112 56 -128 -46 -7 -26 -52 0 -3 -65 -23 74 32 58 148 -69 -1 -18 36 111 -140 -19 38 -29
1817b9N0J02o2l4j1Qm2q2P0p9q%R1J27j59p6Q8m1J01j30J89kOj00j7l0O9J9j44N6NL8L7j6
$$ -29 21 123 61 27 16 24 -18 -100 -30 -109 -117 -117 -26 101 -58 -134 -46 -87 14 -116 73 71 77 -23 -40 -70 -1 18 -126 -70 -65 -27 10 -6
1520fR4l4j8p0L3M4j1Jl1K6q4qP4J12j14Q7J6j90N0n1R6L9P0j57J67p3m3n7q8M2P3m7K3qQ1
$$ -6 88 54 36 -34 -1 43 32 33 2 28 -56 -64 10 122 8 95 111 -79 -29 -80 16 55 125 -32 135 62 19 -38 -126 -84 -11 -58 -35 -43 38
1213C8l8K6j08M2M7l5k2M9O2j09J23j69J73r0j3K4q7K4N2%J1M1L4LJ8k13J00K8l6R5j13K6
$$ 38 0 26 -82 -40 7 -28 -50 -1 61 -48 75 -94 79 -11 -24 0 -87 -63 -11 -11 0 41 75 78 96 -117 -17 11 -25 70 -43 -17
933a7j04J94p3N0o1KL9kj14Q9l4j4l7R4k7J23j17N2J13j54L8r2l2J9N2J21k0p1j4j2q4J60
$$ -17 -121 73 0 50 -11 -9 30 28 -86 3 -31 -45 -82 12 -15 108 -9 43 156 2 40 -52 -84 -65 -13 108 88 17 3 -9 -93 67
653F7o7Ln2l7J76J2j02j0n9O1m4PP9l1j9K8J35j50m1N8OL7K4J5j78M6J7L0p9L2j8N9p4k0J28
$$ 67 0 3 -49 -86 90 102 0 -10 -69 -8 -52 -45 34 3 -16 12 147 -3 -44 14 20 57 81 96 -82 -36 -19 11 -68 -36 -54 5 -69 -89 39
347C9J8K5k5o9M0k8p9l1J3N7N6J58j44K7p6q9K2O2k1P1l9pO3j5j17M2O4r6L5K3qQ1j42J43
$$ 39 57 82 57 -12 28 0 -79 -110 -97 -40 16 174 30 57 -19 -108 -86 -24 -45 26 -13 -20 43 28 -89 -47 17 -79 -44 -21 -29 52 -90 53
50E3o0lj2M3m7J72j49m6NO8kr7m8J9Q9r4J86J9j77N3r9R1q1J38k03J61k4Q3pn9N0M2
$$ 53 -7 -10 -22 21 -26 146 -3 -49 -44 24 22 -75 -123 -104 -15 -109 77 96 -81 -28 -127 -36 -117 21 -182 -21 -45 38 31 -28 22 64
-230F4
##PAGE=	F1=11682.8
##FIRST=	23146.755397984237788,	4241.1433691826614449,	-0.17124927043914794922
##DATA TABLE=	(F2++(Y..Y)), PROFILE
4241c6k4O6J43q9o7Q3q0L0l6oK3Jn9o6R6Q7J6j45o2J91k10N5J78p5j39J95J28k75N9J42n7
$$ -36 -60 6 149 60 -7 76 -4 26 -10 -16 7 8 -51 -117 -21 66 82 -63 -125 66 -144 -89 89 14 -125 70 198 -77 -18 124 67
3970F7j23J28m4Q6j39j7N6K2N1l4o8om0p3J25l1Ll1J40Nn8Q7j5o6j10J30M2J0q8m9O8J2Q2
$$ 67 -56 72 28 114 -25 -42 14 36 87 53 -15 -21 -61 -134 -9 -40 -37 -68 72 77 19 106 91 25 -85 45 87 97 9 -40 28 40 122
3681A22n0j0l5K6J1P2j65l4K6L1N0J14j07l2p8n7N8N8J22q1m4q6L1P9M7o4qn6M6R9L9qk05
$$ 122 72 62 27 53 64 136 -29 -63 -37 -6 44 158 51 19 -59 -116 -58 0 122 41 -3 -89 -58 21 68 4 -4 -60 -14 85 124 116 -89
3392h9R4j02R8PQ9j90J05j04R4R8O8n8j29R2j15R2j48P1n6N7N8q1K27j60N5j11J0P1l2L9J7
$$ -89 5 -97 1 8 97 -93 12 -92 2 100 168 110 -19 73 -42 50 -98 -27 -83 -26 32 -49 178 18 73 -38 -28 43 11 50 67
3121F7j65K6N0K4Q6K3l8l9n5j14R9L6N0j11Q2K6k38L09m1q4q4N7Q9r5N7%q1M3N3j3q4J36j97
$$ 67 -98 -72 -22 2 88 111 73 34 -21 -135 -36 0 50 -61 21 47 -191 118 77 -7 -91 -34 55 -40 17 17 -64 -21 32 19 -65 71 -126
2832a26j6J75j6j08J89j40r7K03q5J36k2j21J11j37k8o2M6K05n0j21j1R3m4J35r0J4j15J23
$$ -126 -142 33 17 -91 98 -42 -139 64 -21 115 93 -28 83 -54 -82 -144 -98 107 57 -64 -75 18 -26 109 19 33 -82 41
2587D1K3j4K6o0l6R6q5j10P3J08m2p8M3r7P4Or3Q7Q7p4N2Mp7j54L13o2j07N4l0m3m3K9K29
$$ 41 64 50 76 16 -20 76 -9 -119 -46 62 20 -58 -15 -112 -38 -32 -125 -38 49 -25 27 31 -46 -200 113 51 -56 -2 -32 -75 -118 -89 140
2299A40k08K4m8J16q0l1Q0j03P0l1Rj0J72k47J03m9M3J13j14L7K5p5J41k6j06r0K36j80J69
$$ 140 -68 -44 -92 24 -56 -87 -7 -110 -40 -71 -62 -72 100 -147 -44 -93 -50 63 -51 -14 11 -64 77 51 -55 -145 91 -89 80
2045H0j34J7r0J84j27nO3K4l5L9j7n3P1Nk2K8J33k26M0pK9P0j98J31L7j3K0M4k8l1o0N6k5
$$ 80 -54 -37 -127 57 -70 -75 -12 12 -23 16 -1 -54 17 22 0 28 161 -65 -25 -32 -3 67 -131 0 37 24 44 88 60 29 -31 25 0
1756@p0Q1r5l4N3J05P5j53l8L4o7J48q6O8L8j0p2l5jL6O4j23N0N5m4P3l2K2N3op7J0QOk4j2
$$ 0 -70 11 -84 -118 -65 40 115 -38 -76 -42 -109 39 -47 21 59 49 -23 -58 -59 -23 41 -82 -32 23 -21 52 20 42 95 89 12 22 30 36 12 0
1441@M2j39O6N2J12r4L1J8j72O7o2J05L7O7j81J84m9n9n5j44O6R7n7oL0N9l9P4j22L0P9p4
$$ 0 42 -97 -31 21 133 39 70 88 -84 -17 -79 26 63 130 -51 133 84 25 -30 -174 -108 -11 -68 -74 -44 15 -24 50 -72 -42 37 -37
1161c7QL5M0r0J22j39J09n0j9j1n4N7K6j4K5j3N2J2N9j64M6qj3J06q0k2r8J47l6M9r3M9Q2
$$ -37 -29 6 46 -44 78 -61 48 -2 -21 -32 -86 -29 -3 -17 8 -5 47 59 118 -46 0 -8 -21 85 5 -17 -115 32 -4 45 -48 1 83
872H3l1j59J06r0pj3J05k7R4o1M8N8j60L9q2J9RJ02J04o3m6m7ko3J72q1nm6m7J95K0j13J8
$$ 83 52 -107 -1 -91 -98 -111 -6 -33 61 0 48 106 -54 -15 -97 -78 -69 33 137 74 28 -19 -21 -84 88 7 2 -44 -91 104 124 11 29
583B9j03Q6j08P5O9%j03J1J89j46q9R3J9jO3k3j35J18m4%l3L5j8l1Qo8J08L5J0On2L3m0l0
$$ 29 -74 12 -96 -21 48 48 -55 -44 145 -1 -90 3 22 21 84 61 -74 44 0 0 -33 2 -16 -47 -39 -107 1 36 46 52 0 33 -7 -37
286c7k7m8K3J40J17q3k9r8p7J4M6NN1J6o8R8pj40L9P9r2L8j5oR5j49J49Qm4OK6j14J90j21
$$ -37 -64 -112 -89 51 168 85 56 -42 -119 -105 -59 -54 -3 13 -55 43 36 -104 -65 14 -78 -40 -55 -61 34 -115 34 42 -2 4 30 -84 106 -15
-12a5K0k2M1K1o0m7m2M9k8J62K0j80J03j25N2n9J22j34J16k3R5j7n6N3j6
$$ -15 5 -17 24 45 -15 -62 -104 -55 -83 79 99 -81 22 -103 -51 -110 12 -122 -6 -29 66 49 -7 46 30
-230C0
##PAGE=	F1=11635.6
##FIRST=	23146.755397984237788,	4241.1433691826614449,	-0.14591836929321289063
##DATA TABLE=	(F2++(Y..Y)), PROFILE
4241c1k5Q6J22j11m3O8p1O0r3lM9j3j2p6J7J14P0j22j24K09k42J17J53n9j27J98O3k43R9O3
$$ -31 -56 30 152 41 -2 66 -5 55 -38 -41 8 -5 -17 -93 -76 38 108 -14 -138 71 -171 -54 99 40 -87 111 174 -69 30 93
3979I3j2j15R3n7Q1q2o3N4NJ27rj19K2r5j8P3q7L1j7J75J4j09J07l7o0o0J67LK3r5q4J39m9
$$ 93 81 -34 59 2 83 1 -62 -8 -3 124 115 -4 18 -77 -95 -22 -109 -78 -95 80 94 -15 92 55 -5 -65 102 105 128 33 -51 88 39
3690C9M2l3OJ3n0N9M9j61j1rK2R1R3q4r8j0q8O3R3P6n5p0m9M8L2Q7j04p0L4Q3N3R4m9k57K04
$$ 39 81 48 54 67 17 76 125 -36 -47 -56 -34 57 150 66 -32 -42 -130 -67 26 102 47 -23 -72 -24 8 95 -9 -79 -45 38 91 185 136 -121 83
3384H3j71L9N6Q7j89N7n7M7J16Q7nj17N1j20P6q7j0J3oP6n6K15j45M0j13L8L5m2R6pj72J8
$$ 83 -88 -49 7 94 -95 -38 -95 -48 68 155 150 33 84 -36 40 -47 -57 -44 -50 26 -30 185 40 80 -33 5 40 -2 94 87 -85 -67
3104f7O0N9J4%o8KK3j35R5M4M0j10J20o4k01K86l3j15m0J11O1j19Q8Oj07N1Q2q2n2J19k11
$$ -67 -7 52 66 66 -2 0 23 -112 -17 27 67 -43 77 13 -188 98 65 -50 -90 21 82 -37 51 57 -50 1 83 1 -51 68 -143
2832a43k0J63M4j04J68r9j56K40j25J57k6j29J43j67J6n5k4K26j9k22M5R0k1J09r5Q4j47J17
$$ -143 -163 0 44 -60 108 9 -147 93 -32 125 99 -30 113 -54 -38 -93 -117 109 90 -132 -87 3 -18 91 -4 80 -67 50
2587E0Po9N2j6J4R8r6j30O1Q7o3n5P6j01K9oo4J16M4q4N9K5q5q6K87j12n2l4j8Oo4Q7J57j17
$$ 50 57 -12 40 24 38 136 40 -90 -29 58 -5 -60 16 -85 -56 -62 -126 -10 34 -50 9 34 -51 -137 150 38 -14 -48 -66 -60 -124 -37 120 3
2290Cmr6Q9k4rL3r9N4n7N2L0J41k24Q7j05O0J10j22P0j3o3J28J7j13j30K42j71J44o6l0l8
$$ 3 -1 -97 -8 -32 -41 -8 -107 -53 -110 -58 -28 113 -111 -24 -129 -69 41 -81 -11 -24 -87 41 58 -55 -185 57 -114 30 -36 -66 -104
2019a04J81r0r1Q8O2m6N1o5k5N8p1J1M3J26j84jPOP0j40J14N1QJ6j5Pm3o5Q6k5n9R1q5l6N5
$$ -104 77 -13 -104 -16 46 0 51 -14 -39 19 -52 -41 2 128 -56 -57 -50 -44 26 -114 0 51 59 75 60 67 24 -41 45 20 -39 52 -33 -69 -14
1712a4P0M8j23lk5p6J48k4l0N7m5K0m9j4K3J05j06L9J03j08O8n9kJ21j2o4On8N1n0%N8j93
$$ -14 56 104 -19 -22 -47 -123 25 1 -29 28 -17 3 -46 -60 -37 68 -38 1 104 -4 64 5 3 124 112 48 54 -4 47 -3 -3 55 -138
1423a38J44L4Q1m2n0qo9O8j13J38J1M1j59J86k1p1l0j73O4R5o5l5O3L3j0R2j27K3Q1q1L4J8
$$ -138 6 40 121 79 29 21 -48 20 -93 45 56 97 -62 124 103 32 2 -171 -107 -12 -77 -112 -49 -16 -26 66 -61 -38 43 -38 -4 14
1143A4J8p2J21j09M9qn4j6k5Q5Jk8M0o9P2K2Q3j29K2j4oJ04n2p3o2P0jM9r1P1R4l0j89P6p7
$$ 14 32 -40 81 -28 21 13 -41 -57 -82 3 4 -24 16 -53 19 41 124 -5 17 3 -3 101 49 -24 -86 -16 -17 32 -59 12 106 76 -113 -37 -114
837a14NkJ02l4N6nM6Lj68N5n5N4j7J40P0r0pq5Ok6J37p5Ol7n2J67M4j27M4r3O5j37J20N5K6
$$ -114 -109 -111 -9 -43 13 8 54 57 -111 -56 -111 -57 -74 66 136 46 39 -46 -40 -66 71 -4 2 -35 -87 80 124 -3 41 -52 13 -124 -4 51 77
531G7j82mK13j11j25J40L1l9R2p4o2J61j00k8lK5J0r4K6q1R1N2nL7m4J9m3K6k7j12J1J87P2
$$ 77 -105 -109 104 -7 -132 8 39 0 92 18 -44 117 17 -11 -14 11 21 -73 -47 -128 -37 15 10 47 3 22 -21 5 -22 -134 -123 64 136
242A36k7o9j05m0L1OOL8P9j19J45l4j36N4N4q6M5n6pR4j11J24M6q4Q6kj93J34k5N4k1J0M1
$$ 136 109 40 -65 -105 -74 -68 -62 -24 55 -64 81 47 -89 -35 19 -67 -22 -78 -85 9 -102 22 68 -16 70 68 -125 9 -16 38 17 27 68
-47F8k3m5q9K4J2J10Pj37J50j55J3l8J14n8N5l5R8l4l8P0p1
$$ 68 45 0 -89 -65 -53 57 64 -73 77 -78 -65 -103 11 -47 8 -27 71 37 -1 69 -2
-230b
##PAGE=	F1=11588.4
##FIRST=	23146.755397984237788,	4241.1433691826614449,	-0.10592949390411376953
##DATA TABLE=	(F2++(Y..Y)), PROFILE
4241b2j4O6Q1r0l7M1m6R3r5k5N7J5On0o7R7R8p5j60K02k33J40R4m6r0J78J2j55Q3K1j3r1O2
$$ -22 -36 30 111 21 -16 25 -21 72 -23 -48 9 24 30 -20 -87 10 108 33 -127 75 -158 -18 76 30 -60 118 130 -25 58 79 66 -25 37
3952C7p8O2qo6M4KJ45j0j21M6j45M4N4j57O6m8K11K0j43J03k1n6k3J90n6O1j06p4J48j13K8
$$ 37 -41 21 13 -53 -9 -7 138 128 7 53 -92 -48 6 -151 -85 -133 78 98 -45 58 37 -19 -42 148 92 153 47 -27 121 8 36
3681C6LK1L5j38Q1J8j18L3j1J2J05P0o6j39N8j01J5J23K3k7n7J5Ql5J41j20r4P1J06j1J46
$$ 36 39 60 95 -43 38 56 -62 -29 -40 -28 77 147 81 -58 0 -101 -86 37 60 33 -24 -9 -1 -36 105 -15 -109 -38 68 57 203
3410B03p7k58K71j95mO3N4j27K4QqJ21N1Rq3J3j29O4pq9R4k5M5l7J83j03J9j08N2Mn2J00j4
$$ 203 126 -132 139 -56 -60 3 57 -70 -46 -38 -46 75 126 135 52 65 -64 0 -7 -96 -2 -27 18 -19 164 61 80 -28 24 28 -24 76 62
3121F2j34K7N4P0m6J3j29Q6N9j30N0L8M3p8J56j54j53K47m4j20K1Q8N5j66J32kp0L3J03j01
$$ 62 -72 -45 9 79 33 46 -83 3 62 -68 -18 20 63 -15 141 -13 -166 81 37 -83 -62 26 81 -85 47 45 -25 8 111 10
2859A0m8P6j95PJ20P8n9J01n9j78K53j32J55m8j21J68j54K3k1r9K09Kk87J04P6J9P4j04J30
$$ 10 -38 38 -157 -150 -30 48 -11 90 31 -147 106 -26 129 81 -40 128 -26 -3 -24 -123 86 88 -199 -95 -19 0 74 -30 100
2605A00j12L4Mq5N8L7M6N7p8j22O5O8q9k9R1r8Lm0MJ20Jj10O5L3p7l6K40j50Qr6L0L2q1J18
$$ 100 -12 22 26 -59 -1 36 82 139 61 -61 4 72 -17 -46 45 -53 -50 -90 -86 34 35 -75 -10 23 -54 -90 150 0 8 -88 -58 -26 -107 11
2307A1P1k0j9j07K5J3M5m2j09P8n9M0P7J02j76M5r7O2P1q5P6o8l9J27L8j36j09K08j40J15
$$ 11 82 62 43 -64 -39 -26 19 -23 -132 -54 -113 -73 4 106 -70 -25 -122 -60 11 -74 2 -66 -105 22 60 -76 -185 23 -117 -2
2045bl7l6L7J18l3j21O9N6o2J16j36KL0j17L6O9P2q3m2J3kL7r4P4J03PJ0l6L7o8m7P4k5j9
$$ -2 -39 -75 -38 80 47 -74 -5 51 -11 105 -31 -29 1 -116 -80 -11 61 -22 -64 -51 -53 -16 -110 -36 67 74 84 48 85 17 -30 44 19 0
1747@Q2q7KL1ML7p4L2o9j02J36P4r9J9p5J33o0k6PJ07r3O8Q4j28M7r2L7J27j2o0K1j20J03
$$ 0 82 -5 -3 28 32 69 -5 27 -42 -144 -8 66 -33 -14 -89 44 -16 -42 -35 72 -21 47 131 3 50 -42 -5 122 110 50 71 -49 54
1458E4q2QJ14k36J80kO9K2j27o3O3P3j73J41k5J7r8J54j6n6Nj59O5O9p8l7P7K6QR5j25K6L3
$$ 54 -28 -20 94 -142 38 36 105 127 0 -63 0 73 -100 41 16 33 -65 89 73 17 22 -137 -72 -3 -81 -118 -41 -15 -7 88 -37 -11 22
1170B2o7N2jrl3R8q1OL8r6J8K1M0j6l2O0r0Q1J1J04j28N8m6KQ4k7j18JJ5J8O7j00P3P4j7j87
$$ 22 -45 7 6 -3 -36 62 -19 -13 25 -71 -53 -32 8 -8 -40 20 -70 11 22 126 -2 56 10 12 96 69 -49 -48 -33 -15 52 -48 25 99 82 -105
855a05L2j9J6j5P9j3j0L4O2j8j99O6LO2n0J39M8r9Mo6pL0M2k9J6k5m2R7O8j44P7l4J2j18J33
$$ -105 -73 -92 -76 -91 -12 -25 -35 -1 61 43 -156 -90 -87 -25 -75 64 112 13 17 -49 -56 -26 16 -13 3 -22 -64 33 101 -43 34 0 12 -106 27
548B7OO2k40kJ85m3j33J62N4p4Q5j13NJ63j13n2J6OP0j24k3m9N7P5OK2l5J6m5N4rj69K2J81
$$ 27 33 95 -145 -147 38 -5 -138 24 78 4 89 -24 -19 144 31 -21 -5 1 71 -53 -76 -125 -68 7 13 35 0 16 -29 25 16 -153 -131 50
251E0L3J0n4j28NO5l4rM1J14j16J77r1j26P5L5r8O8r1jM9l3R4K9j06J67l0k22N3P0K8PJ3O3
$$ 50 83 93 39 -89 -84 -19 -53 -62 -21 93 -23 154 63 -63 12 47 -51 17 -74 -75 -26 -59 35 64 -42 125 95 -127 -74 -4 24 31 44 107
-47A07m3k8r2QJ8O4Jj06J61j44J2o9J15LJ1m9R3l8o5J21q1
$$ 107 64 36 -56 -48 -30 34 35 -71 90 -54 -42 -111 4 7 18 -31 62 24 -41 80 -1
-230a
##PAGE=	F1=11541.2
##FIRST=	23146.755397984237788,	4241.1433691826614449,	-0.065940618515014648438
##DATA TABLE=	(F2++(Y..Y)), PROFILE
4241a4lM7M1p1l1J7k4J27r3m4M0P7rkj53P9J24k8j85K07k09J16M1k9o8J42j7m7K1L4n2m3K7
$$ -14 -17 30 71 0 -31 -14 -38 89 -4 -48 -8 69 60 58 -95 -16 108 80 -105 102 -107 9 50 21 -47 95 78 31 52 86 34 -9 18
3952A8j03L8O0qnNJ10Qj04O9j96J21N1k41Q5r1K35J6j27O4K2n4J6J67r9J05j08n1J14j54L6
$$ 18 -85 -47 13 5 0 5 115 123 19 88 -108 13 64 -177 -92 -183 52 68 -59 5 27 -27 -11 156 57 162 54 3 117 -37 -1
3681aJ2P0L0j95N1L3q2P0j2LJ18M7m8j80J27j16l2J52l3mj3M8k8r8J92j40q3Q1R1n2J71o7
$$ -1 11 81 111 -84 -33 0 -82 -12 -24 -21 97 144 96 -84 43 -73 -105 47 14 10 -3 45 17 -81 111 -29 -112 -31 60 8 179 112
3401A12k27K67j98k6P2K1n1OP3o3J11Jlp5jj11N1P2j70J70j4j4l1J40m5J3j08O3Qq9P7J4j00
$$ 112 -115 152 -46 -72 0 21 -30 -24 49 -14 97 98 95 20 19 -92 -41 31 -139 31 17 3 -28 112 67 80 -28 35 43 -46 31 45 -55
3112e5L2M8Q0r0M1j98J62M3p4j8J3M7m1J78k00j09K05n6j25O7N1O9j96J45K2n9rJ18o5m7L0
$$ -55 -23 25 105 15 56 -142 20 63 -11 -29 -16 31 -10 168 -32 -141 64 8 -117 -50 1 70 -126 19 41 -18 -27 91 26 -21 9
2841Ij83K9J03P9K6J5o3j41K33j12J20m4j17J88j41L1K6j58J57j5k71J44N2N2L8j13J75p8
$$ 9 -174 -145 -42 37 63 78 15 -126 107 -5 115 71 -46 142 1 32 58 -100 57 42 -229 -85 -33 19 57 -56 119 41
2596D1n1jn7M8O4N1J7o2r8Q5M8j15lJ07r4k5n8Q7J08o4j05L9M9o0k3K16j46J2j06P0M7j03
$$ 41 -10 -11 -68 -20 44 95 112 50 -48 37 85 -30 -33 74 -20 -45 -103 -16 92 28 -77 -38 11 -49 -72 144 -2 10 -96 -26 21 -82
2316h2J07LN9Qj21m3M9R9j18j18J07n8lJ56N8j33Lq8O3L3m8Q2j09JJ13M2j55q5J61o5O5k6
$$ -82 25 28 87 95 -26 -69 -20 79 -39 -157 -50 -108 -111 45 103 -30 -27 -115 -52 -19 -67 15 -94 -93 20 62 -93 -178 -17 -82 -17 -43
2036d3m0J10L3Mq5J4N7p2J80k05K3Jj20M5Q5PJ8q4L5Nj2o2J8J41J6J6k7L7q9k6O4k6PN7p5
$$ -43 -83 27 60 64 -21 -7 50 -22 158 -47 -24 -23 -143 -98 -13 -6 12 -72 -37 -32 -44 -106 -88 53 69 85 58 95 6 -20 44 18 25 82 7
1730GN6Qo2K8k2L9q4j28J24J45j33l5n9J98o1m1j3J06q5R8Pq8K3j21P8J21k9n9L3j38J40j10
$$ 7 63 71 9 37 15 54 -30 -158 -34 111 -22 -57 -116 82 21 -20 -33 73 -12 86 93 5 28 -93 -15 106 77 18 51 -87 53 -57
1450e7K1J68k77K00n2O7R7j58j34J66M8j89J29n5nl7J22pl7K5r9M6K2q8l9Q9J9K7R9j23K7
$$ -57 -36 132 -145 55 3 70 167 9 -125 41 89 -100 29 -26 -31 -68 54 47 10 35 -64 -18 4 -84 -123 -34 -15 12 111 -12 15
1178A5j5n1P0j9l8OP2n8qN5j19P2N0j9l4l6R6r5P5j5J06j47J39r3MN5j3j14M5KJ6O8j08P5
$$ 15 0 -51 19 0 -38 -32 40 -18 -26 29 -90 -18 32 13 -21 -57 39 -56 19 4 110 -37 102 9 13 68 55 -59 -14 -12 4 72 -36 39
881C9M6j3j61J0L7K1j2J1J9o5O5P2k4k15O1M6N5r7J48L7q4k2k3PO6p1M7kmj9K0Q3j61J11K6
$$ 39 85 72 -89 -79 -42 -21 -33 -22 -3 -68 -3 69 45 -170 -109 -63 -8 -105 43 80 -4 -26 -49 -42 24 -47 0 -2 -6 -25 -5 78 -83 28 54
575E4l6p5J08m7R7k33l5J44J3j11J54Q4j02N6j16L8J28j02n1M0qJ20j05j28K7L5N0M0l1K4
$$ 54 18 -57 51 4 101 -132 -167 -23 -10 -121 33 117 15 71 -45 -7 121 19 -32 8 0 120 15 -113 -86 -51 -1 39 8 32
312C2Jo2O7kj77M0J22K5J7Rj62L8Q8p1k0O3J08q1J84j40j09O7M5j14Q8j10K0j6K7Q9k1j20
$$ 32 33 -29 38 36 -141 -101 21 46 63 72 -90 -52 36 -35 -55 8 116 35 219 79 -30 37 82 -32 56 -54 -34 -50 -23 66 45 -75
32g5J97qk00k1J14l7N3L0J01j08Mo6K2k2L5j3q3J50r4K1q8Q6L4j9m7R5l6j10J53o2
$$ -75 122 114 -86 -107 7 -30 23 53 154 46 50 -16 6 -16 19 6 -77 73 -21 0 -88 -2 32 13 -34 61 25 -85 68 6
-230F
##PAGE=	F1=11494.1
##FIRST=	23146.755397984237788,	4241.1433691826614449,	-0.020088434219360351563
##DATA TABLE=	(F2++(Y..Y)), PROFILE
4241dML1K7o2n7L0l9J73o7n5j5J63o0N6j83N9Q0J9j76J97j51N6ok5p6J43l2J8l9R8j13L1j9
$$ -4 0 31 58 -4 -61 -31 -70 103 36 -19 -34 129 69 125 -58 1 81 100 -76 121 -30 26 20 -5 -81 62 30 48 9 107 -6 25 6
3952Fq8j3R0O8o1K7M2K6q2R2k24J58O8k92Q5j18K28J4o2K6P0o6MJ32j05J03j00nN5j46O7j6
$$ 6 -82 -95 -5 63 2 29 71 97 15 107 -117 41 109 -183 -98 -216 12 26 -36 -10 60 -6 -2 130 25 128 28 23 78 -68 -1 -17
3672a7J15J7k10k0Q1n8J20j7k4J23K3m3j54J40j15o5J59n7l7O7M9n0j31K04j08j03O6M4k5
$$ -17 98 115 -95 -115 -34 -92 28 11 -13 110 133 90 -64 76 -39 -104 55 -2 -39 28 77 27 -104 100 -8 -111 -45 -1 -26
3419b6J59n1j87K13j37m8P0j2K9PR8p2P2m9Kj05%r1N3J26k04K13Lp8oR0J0J2j32O8P2j37L8
$$ -26 133 82 -105 108 -29 -77 -7 -19 10 17 115 43 115 66 68 -37 -37 -128 -75 51 -153 60 63 -15 -21 69 79 91 -41 27 99 -38 0
3130@M9j00M0L1Q3j05P5k30K10J2nj26JQ1n8J76j96p7J91l9j30Q0k1R5j68J01O8n8n9R9J9
$$ 0 49 -51 -11 20 103 -2 73 -157 53 65 60 -66 -65 16 -42 134 -62 -139 52 13 -117 -37 -58 37 -131 -30 38 -20 -79 20 39
2859C9n1J5j57M5P7K9J01j3q6r0J79o0N3k6q7J71j41N1N9j45Q5o5j91J53MN0M9j12J91m1j26
$$ 39 -12 3 -154 -109 -32 -3 98 85 -1 -91 88 28 81 55 -32 139 -2 49 108 -37 48 -17 -208 -55 -51 -1 48 -64 127 86 -40
2587d0J5k6K7P2jK4m4o8J06K3j30K4P2m2l1p0J51N0j02p1NN7o2l5K21j04k7o5P5L5q6N7j0
$$ -40 -25 -51 -24 48 47 71 27 -41 65 88 -42 -18 54 12 -19 -89 62 112 10 -61 -56 1 -61 -96 125 21 -6 -71 4 39 -47 10 0
2299@O5M7j10q1K5J31j40j25J28k7o7K16K5j26j0m0P1j6JQ2j34M3P6Pj58m8J16PL0n2KJ31
$$ 0 65 112 2 -79 -54 77 -63 -188 -60 -87 -154 62 87 -39 -49 -89 -18 -34 -33 49 -85 -42 34 41 -117 -165 -49 -42 -12 -64 -62 69
2019F9n6K1Jl2M6p6K18k55L4J0q4L4M3k0J20j10J1K7o7n7k9J71M9oj6N2r9oOJ1L4J4o1R0J4
$$ 69 13 34 35 3 49 -27 191 -64 -30 -20 -104 -70 -27 -47 73 -37 -26 1 -66 -123 -152 19 68 62 46 98 -1 -7 -1 10 44 58 -3 87 101
1712A01j37M9N7qr5j29J41J60j62o1j1J98p4Rm8N7o3J33r2m2K6j27J32P0m1o0J0r6J29j10
$$ 101 -36 13 70 62 -33 -162 -21 139 -23 -84 -95 103 29 38 -10 47 -16 117 25 -17 9 -118 14 84 43 -17 -7 -103 26 -84
1450h4N2K20l02J66r1P7R3j18j57J87K8j63P7n4Pk3R5Pk1M4k8K5j3j05k5P5K5jJ15q7Mk7l6
$$ -84 -32 188 -114 52 -39 38 131 13 -144 43 71 -92 -15 -69 -62 -85 10 17 -4 40 12 37 24 -81 -106 -31 -6 -7 108 21 25 -2 -38
1161c8N2qn1K2M1k2JM8j28P4P7q0j0m6J02n7N9p0J27j72K33j54lJ9qn9M6K0J2L8r7P6L0j8
$$ -38 14 6 -45 -23 18 -4 -3 45 -83 -9 68 -12 -22 -68 34 -23 36 -34 93 -79 154 0 -3 16 8 -51 -5 15 27 65 -32 44 74 56
863E6j22J8M6K2lp2O8j00N5R7k4k05O9O1J6j26J50L3l0p7J6L8Q7j51J17m5NK2l0N2j55J27
$$ 56 -66 -48 -2 20 17 -55 13 -87 -32 65 41 -164 -95 -34 -18 -144 6 39 9 -68 -52 -14 73 -78 39 -6 -1 21 -9 43 -112 15
583A5P4o1m6Q0o4Q3j58q5Q9N6q9J60Q1j04K9j06K9Q1p2o0P9kJ40m9k39J00L7kO2r4J23k6o1
$$ 15 89 28 -18 62 -2 81 -77 -162 -73 -17 -106 54 135 31 60 -46 -17 64 -8 -68 11 9 149 100 -139 -39 -2 -4 58 -36 87 61 0
295@O9k6j31L7L7L5OP3j61K3J23r1k1P5P3m3J75j71r8L2J02j18Q4j13L6p2P0Q5p3j21J90L6
$$ 0 69 43 -88 -51 -14 21 27 100 -61 -38 85 -6 -27 48 121 78 253 82 -16 16 118 0 84 -29 7 -65 5 90 17 -104 86 122
15A22j35o8R2r0O6Q4J20k05L5rM4n6Rl6n8J17k4N1j00L7MNk2P3oj62J63k6
$$ 122 -13 -81 11 -79 -13 71 191 -14 21 12 56 0 9 -27 -85 32 8 59 -41 -4 0 5 -17 56 50 -112 51 25
-230B5
##PAGE=	F1=11446.9
##FIRST=	23146.755397984237788,	4241.1433691826614449,	0.025763630867004394531
##DATA TABLE=	(F2++(Y..Y)), PROFILE
4241EJ3J4J4n6o6N8o9K03l8o9q5K35j11J13j97N4L6O5j66J87r4kn3k3q2J42m6Q4j14J45j58
$$ 5 18 32 46 -10 -76 -18 -87 116 78 9 -76 159 48 161 -36 18 54 119 -47 140 46 44 -9 -32 -114 28 -18 66 -48 97 -61
3970f1J21n5o1n0P4J49j11M6k5M8n7Q5k21J72O1k85Q2j27J79J6Qj3J17p9qJ00j12J01r1L9
$$ -61 60 5 -56 -106 -32 117 6 52 27 75 18 103 -118 54 115 -170 -88 -215 -36 -20 -12 -25 92 13 5 105 -7 94 3 42
3707D2mj21J11p4J30L6j97q0J40n9J46k3n2J28kl3j24J02j01n6J47p9o5J32L5m2j33K00r3
$$ 42 38 -83 28 -46 84 120 -77 -157 -17 -76 70 47 -5 123 121 88 -36 66 -35 -91 56 -23 -88 44 79 37 -96 104 11
3454A1j20N0jOJ14rj34J10n8n2P2m0Q6M4N2m8M1r1Qj36J3n9O4J27j80K13lj07K0M1L4M1j60
$$ 11 -109 -59 -60 -54 60 51 -83 27 -31 -83 -11 -51 35 79 131 83 124 33 41 -95 -82 -141 -77 50 -130 83 80 -27 -7 34 68 109 -51
3165e1P0J36j85JQ3j02M8%P0j12J19k12K09j3P1k20MJ05q6J42j62m9J74k3j34R6q8J07r7L8
$$ -51 19 155 -30 -29 54 -48 0 0 70 -42 77 -135 74 61 132 -88 -84 21 -65 77 -85 -134 40 17 -117 -21 -109 -2 -99 -61
2902f1R5n7j09Q5J07q6L1j35N7N6j4J26Rj15m5J24oj9j1k8J23j47O3P7q7Oj24o5J48n5L5O0
$$ -61 34 -23 -132 -47 60 -26 5 -130 -73 -17 -31 95 104 -11 -56 68 62 43 32 4 127 -20 43 120 33 39 -85 -150 -2 -57 -22 38
2622C8j10K07nk00L1NNP6n4N6o0%J04k8j10M6L2Qm2o6J71Rj21l7k8O6o6m7K26o6p2RN2K5o6
$$ 38 -72 135 130 -70 -39 -34 -29 47 -7 49 -11 -11 93 65 -45 1 33 41 -1 -67 104 113 -8 -45 -73 -7 -73 -120 106 40 -32 -23 29 54 -12
2316a2J3j6J0J24j04o5l5J29j27r9J04K0j35K71qj19k2QR3n0L6O8j60Q4M1k9j61j1P2P8op6
$$ -12 1 -15 -5 119 15 -50 -85 44 -83 -182 -78 -58 -193 78 70 -49 -71 -63 30 -20 16 84 -76 8 49 20 -141 -152 -80 -2 -8 -84
2036h4K7J39j30N3Q7p7L6p5K29k70K4O1n9J0m7RJ85j12j6M5j26n7m6J71Q6k5pO3q1j6m9N4
$$ -84 -57 82 -48 5 92 15 51 -24 205 -65 -41 20 -39 -29 -76 -67 118 6 -10 35 -91 -148 -194 -23 63 38 31 94 13 -3 -52 2
1756BO2k9o3J08L5j97P3J34n5j06j25J60J45j60p2N1J38q7P2p3J2l8J42j55m0N2q7J33K4m7
$$ 2 64 35 -28 80 115 -82 -9 125 70 -36 -161 -1 144 -16 -88 -37 101 14 86 13 25 -13 129 -26 -66 -14 -101 32 56 9
1493Io6j7k2Q9j03Q9K42k97J29j35O3O3l0j34J14J4r0J4k9M1n5Q5J8j2N4L1j0lj26j5O1K9
$$ 9 -57 -74 -96 -7 -110 -21 221 -76 53 -82 -19 44 14 -120 -6 8 -82 -68 -97 -56 -111 -26 -8 -20 34 65 55 52 -74 -89 -28 1
1213Ak9J34n5k4j1m8L4Nl6PJ6J4J1M1j36P6J03j41J5n6J09k2M5j26J52j92K96j83j7j7J1J2
$$ 1 -28 106 51 27 16 -32 2 7 -29 -22 -6 8 19 60 -76 0 103 -38 -23 -79 30 8 53 -73 79 -113 183 0 -17 -34 -23 -11
933a1L0K4j2j1m4N8M9n0o5M5K5oJ8j46J08q8nJ34j3j84O2O1j4j47J61L5K5j33L7N3Q5j54J43
$$ -11 19 43 31 20 -24 34 83 33 -32 13 38 32 50 -96 12 -76 -81 53 40 -144 -82 -21 -35 -182 -21 14 39 -94 -57 -4 81 -73 70
645G0p2J3O4n1rj48J43R1n5l3L7m4M7p8j33L5R9o2J69K9r5N1j07J6L0m3o7J24J4J47ol21J39
$$ 70 -2 11 75 24 15 -133 10 101 46 13 50 6 53 -25 -158 -123 -24 -86 83 112 17 68 -39 -23 7 -36 -103 21 35 182 176 -145 -6
356fO6q3O7j17K19n7n7P5q0n4L7m5N0%R8j38j1J40r8oQ8L9l2J41j83p2j2J46q4N9j09O1j03
$$ -6 60 -23 44 -73 146 89 32 107 27 -27 10 -35 15 15 113 -25 -36 104 6 0 88 127 95 236 53 -19 -31 115 31 90 -19 42 -61
67f1Q0N7q7j03J42Q8o4p9M2j17M6J30J32k67M7M4O0q1rn4k3O1K3R5r8j0k7L1KN6K7j91J34
$$ -61 19 76 -11 -114 28 116 52 -27 15 -102 -56 74 206 -61 -14 30 90 9 0 -54 -77 -16 7 102 4 -6 -33 -2 0 56 83 -108 26
-222B6J1
$$ 26 37
-230C7
##PAGE=	F1=11399.7
##FIRST=	23146.755397984237788,	4241.1433691826614449,	-0.048579931259155273438
##DATA TABLE=	(F2++(Y..Y)), PROFILE
4241a0L8M0j2o0r4J06r4J93nm6j48K34j34J63j88M9j1J01j60J61m2n3m9k8p4J51o3R8j65J62
$$ -10 28 68 56 -4 -98 8 -86 107 102 56 -92 142 8 171 -17 32 21 122 -38 123 81 28 -21 -49 -123 28 -35 63 -102 60
3979F0j43J88o9m4n2M6J24j34P8o8N7l5Q7j92J40K0k03P5j12R8K2O0nJ36j28qJ03j24J03q8
$$ 60 -83 105 36 -8 -60 -14 110 -24 54 -14 43 8 95 -97 43 63 -140 -65 -177 -79 -57 3 -2 134 6 -2 101 -23 80 -8
3716hN0k9o5J05j27J16P4j57j02J69p8J35l4q3J08Ql1o1M8p8l0J07o6p5J54Ol6r5J75p7j48
$$ -8 42 13 -52 53 -74 42 116 -41 -143 26 -52 83 49 -34 74 82 51 -10 38 -40 -70 37 -29 -104 50 56 20 -75 100 23 -125
3445a25N0k5N2O3K7r2jK4m4L4j9Q8J02j7j5j1q8K9j65K8jO0O6j00J71kp9M9l9J4P4j32L1J97
$$ -125 -75 -100 -48 15 42 -50 -51 -27 -71 -37 -56 32 134 117 102 91 3 32 -133 -105 -106 -46 20 -80 91 89 10 59 20 34 108 -24 7 204
3147B04k22m6J51j24K8rK9p5J06j37J79j0J05k80L2J04j16R2j15k2J35L0j20P3j32J15oj5
$$ 204 -18 -64 87 -37 -9 -18 11 -64 42 -95 84 74 179 -101 -69 35 -81 11 -104 -126 9 39 -81 -8 -140 -25 -31 -46
2902d6J04o3j25M2J56j26R6j19N3J4l7R6O8q3k2L8M2p5J1K5L3j29J03N8l5m6j46M0J34j29
$$ -46 58 -5 -130 -88 68 -58 38 -81 -28 -14 -51 45 113 30 8 46 88 13 24 49 82 -47 56 114 79 33 -113 -73 61 -68
2640f8K8P3q8J85J4k03J8NL1K1o8J15j23P1Q2q6n6L8K9M5m7m3J29l0r4j4l6O8o4l9J93k9r3
$$ -68 -40 33 -55 130 144 -59 -41 -36 -5 16 -52 63 -60 11 93 7 -49 -11 18 63 16 -27 102 72 -22 -36 -72 -4 -68 -107 86 57 -36
2351c6O8%K4n7jno5J89j02j1j14J17r8n8L7Q9j76K61Nj25k2N9R4n9L3M9j52J13J1l9j59kM4
$$ -36 32 32 56 -1 -2 -7 -72 117 15 4 -110 7 -91 -149 -112 -23 -199 62 67 -58 -80 -21 73 14 47 96 -56 57 68 29 -130 -132 -88
2062h8R9l6n8J5J36j47N6J29p6kn6K05k38K6J17n3k4j47R8J88j04n0N2j54p5j9J62R8l3k9
$$ -88 11 -25 -83 -68 68 -79 -23 106 30 28 -28 177 -61 -35 82 29 5 -142 -44 144 40 -10 42 -112 -187 -206 -44 54 21 -8
1800hQ0l9j8j22R1R4p4k5P4O7k21J00J83r3j26q4J30J13j46k7P7O0j17J47r4k1RR0j54n3Q2
$$ -8 72 33 15 -107 -16 78 4 -21 53 120 -101 -1 182 89 -37 -121 9 122 -24 -51 26 86 -31 116 22 1 10 100 -54 -107 -25
1528b5j1P9j1l1n1p0K9P2q1J00K23k60P6j27K1nO7p7QK9m2k5j2R0q2O4L7lP3L6m3L2j14k4
$$ -25 -36 43 32 1 -50 -120 -91 -19 -100 0 223 -37 39 -88 -67 -72 -5 -82 -74 -45 -87 -112 -124 -34 -116 -52 -15 -18 55 91 48 80 -34 -58
1231e8N3pm5J38J0n1J9r0lL6nk1OM1J2M2j50M1J28j35K1n9Q8K3J3j58J81k00L04j70k9n7N1
$$ -58 -5 -12 -57 81 91 40 59 -31 -34 2 -3 -24 -18 23 35 77 -73 -32 96 -39 -18 -77 11 34 47 -111 70 -130 174 4 -25 -82 -31
942c1O6%Qk3q4P1j3Q2o3j4O4j3m3M0j64J20n9p5J74k0j20K4O0l9j31J36N3P0j59%P4O3j12
$$ -31 35 35 43 20 -64 7 -6 76 13 -1 63 50 7 47 -117 3 -56 -131 43 23 -97 -73 -13 -52 -183 -47 6 76 -83 -83 -9 54 -58
653e8J26p3K8Q9m5p5j22J20J02m5m0L1j7Nl5j40K4R7n8J95l1r2J30j35%j7l8n0J57K7J22K2
$$ -58 68 -5 23 112 67 -8 -130 -10 92 47 7 38 21 26 -9 -149 -125 -28 -86 109 78 -14 116 -19 -19 -36 -74 -124 33 60 182 204
373B04l51J32J09j48N9q2K47p8l0Q1j31lL5q9P3qO6o9m2J08p1J1R2Jn4J18j63n1n7J72l1J5
$$ 204 -147 -15 94 -54 5 -77 170 92 62 143 12 9 44 -45 28 20 86 17 -25 83 12 23 115 116 62 180 17 -34 -91 81 50 65
93F5p3M7r1P6Km6q5R4J14k6n1j4q6jJ49J24k56J3M2J15p8m1p2J9J8K6J22n9m9l3L1J5L4N4
$$ 65 -8 39 -52 24 26 -20 -105 -11 103 77 26 12 -74 -75 74 198 -58 -45 -3 112 34 -7 -79 -60 -42 -16 106 47 -2 -35 -4 11 45 99
-204I9j63P3l
$$ 99 -64 9 6
-230F
##PAGE=	F1=11352.5
##FIRST=	23146.755397984237788,	4241.1433691826614449,	-0.12292361259460449219
##DATA TABLE=	(F2++(Y..Y)), PROFILE
4241b6O4O5m0p0r1J26j17J88K0k9j63J77j18J87j91L2l9J51j56J36Rj02n1l7j9J44r6R3j71
$$ -26 38 103 63 -7 -98 28 -89 99 119 90 -73 104 -14 173 -18 14 -25 126 -30 106 115 13 -38 -75 -94 50 -46 47 -124
3987a24J22p4K05m6n3m1K7N0j09J24j00K3JQ6j66R3l7j07Q4q5K6M6O6rJ43j60MJ23j21R3r6
$$ -124 -2 -76 129 83 30 -11 16 66 -43 81 -19 4 5 91 -75 18 -19 -126 -42 -127 -101 -55 11 2 145 -15 -11 112 -9 84 -12
3716a2M6ql2P6j50P4J09j22p6J44p7Q6k5r6Q8J8k9%mn5lO6m7p8J25K9l6o6J51o1j79M5kQ3
$$ -12 34 26 -6 70 -80 -6 103 -19 -95 49 -28 58 33 -63 25 43 14 14 10 -45 -48 18 -29 -107 18 47 11 -55 96 35 -144 -99 -101 -18
3419a8%N1l1r4O2k2q%P3J45q6J8m3o5J9j64L9N4N1JJ0J00Pm4M8r0qJ03j00%K03k11n4J97j57
$$ -18 -18 33 2 -92 -30 -52 -60 -60 13 158 72 90 47 -18 1 -163 -124 -70 -19 -18 -8 92 99 55 103 13 5 108 8 8 211 0 -54 143 -14
3112a4oj7j0l8R2o6J44OR0k90M8J07j44O5m7J0M1R1j00M4j19Q7M9j6O2m3j12OJ49j61J63j03
$$ -14 -20 -37 -47 -85 7 -59 85 91 181 -109 -61 46 -98 -33 -80 -70 -29 62 -38 6 -113 -26 23 7 69 26 -86 -80 69 -92 71 -32
2832c2M8j3m3L5R7l5J6n3Q7r8PN2k4j13J37J5qp0j39R9J37j77M7P0p9J62L2k06PNN4l1q4J75
$$ -32 16 3 -40 -5 92 57 73 20 107 9 16 68 44 -69 68 83 75 5 -134 -35 102 -75 -28 42 -37 125 157 -49 -42 -37 17 -14 -98 77
2535G7j85J42O0j45jK8K7P8n3j9L3l6l4k2j4O6o5k7J65k3q6J25n5K2m9nJ9j24K08j00M4j63
$$ 77 -108 34 94 -51 -52 -24 3 81 28 9 42 6 -28 -50 -64 2 -63 -90 75 52 -34 91 36 58 9 4 23 -101 107 7 51 -112
2255a12P5n0%m7J37j85K21L7j13l3R7O6l7K2K2j28R5Jl0j61LM8Q9o4l5jJ30j31L2J45m0l9
$$ -112 -37 -87 -87 -134 3 -182 39 76 -37 -70 27 93 56 78 100 -28 67 68 38 -123 -120 -72 17 -47 -82 -83 47 -84 -52 93 53 14
1975A4l9J51j74K4J67m8o3k14J60J45p9m3M0j67p7L9J22R9n2n3R8J5qj82Q3J30j13J0M0R6
$$ 14 -25 126 -48 -24 143 95 32 -182 -22 123 44 1 41 -126 -203 -164 -42 57 5 -48 50 65 57 -125 -42 88 -25 -15 25 121
1712A21k49J42J87j01j15k8N5Q0j32L5N6Nj25J93q4n4N6J9j13n4O2O7L1m6j3rr3K3O1o0J11
$$ 121 -128 14 201 100 -15 -43 12 92 -40 -5 51 56 -69 124 40 -14 42 61 -52 -106 -44 23 54 8 -5 -14 -107 -84 -23 -83 28
1441B8J77j90rr1qn9J20nq5N4Po5rJ23r4N8L7j3J07mn7Q6j03l2M1m9k9J13P8p5M9j30m1O9
$$ 28 205 15 6 -85 -93 -152 -32 -37 -122 -68 -61 -126 -135 -12 -106 -48 -11 -24 83 79 22 108 5 -27 14 -35 -64 49 127 52 101 -29 -70 -1
1143aK2m7lO7J2M4j62J0J24r9K4o7N4N2J5j56J68j90K79j28l3q4P2J01%l9l0j54J88q7J17
$$ -1 21 -26 -29 38 50 94 -68 -58 66 -33 -9 -76 -22 30 45 -111 57 -133 146 18 -15 -99 -27 74 74 35 5 -149 39 -48 69
872F9p4K6P8m7p6M9j33Q4j9j42K19k0m9k1N0m4r6P1R3O9j31o6O5O0m9P8m4K3R5k3j27r5R6
$$ 69 -5 21 99 52 -24 25 -108 -24 -43 -185 34 14 -35 -56 -6 -50 -146 -75 18 87 -44 -110 -45 15 -34 44 0 23 118 95 -32 -127 -31
583c1J07m3l4L5k0no3p7L5N7n0K23q3q3K04j72Mm6o2lJ56NQ5L4l37J10J33j72P2k7J82n2m
$$ -31 76 33 -1 34 14 9 -54 -131 -96 -39 -89 134 51 -32 172 0 4 -42 -104 -107 49 54 139 173 -164 -54 79 -93 -21 -48 134 82 78
295G8Q8j43j1K1q1R6j5oK4p7P3l6L5Q0n2o8J03j26j5p4J25L6j5m4K5p1P8m2jm9O4J01l0on7
$$ 78 166 23 12 33 -48 48 33 27 51 -26 47 11 46 126 74 6 109 -17 -32 -106 19 55 40 -4 21 -50 28 -14 -15 -64 0 101 71 65 8
-12Hl9l1J30Q0j66m0J6J45n9n8r4N8NlJ40l2n9qPPJ9R0j33J7m8
$$ 8 -31 -62 68 148 -18 -58 -42 103 44 -14 -108 -50 -45 -48 92 60 1 -7 0 7 26 116 -17 0 -48
-230d8
##PAGE=	F1=11305.3
##FIRST=	23146.755397984237788,	4241.1433691826614449,	-0.23537802696228027344
##DATA TABLE=	(F2++(Y..Y)), PROFILE
4241e0Q3R2o3o3q1Q9j00J55P5j5j55P4q0J95j72Km9J59j29J33K4r8m9o8M7J24j28Q3j23M9
$$ -50 33 125 62 -1 -82 7 -93 62 137 122 -33 41 -39 156 -16 -14 -63 96 -33 100 124 26 -23 -91 -44 80 -48 35 -88 -39
3979c9j5J70%n9j3lk5o3J46r0j7M1P2j70O4q7nO7m0m6N8N4pJ23j51L3J54j47J09j03OM1j1
$$ -39 -54 116 116 57 44 41 16 -47 99 9 -8 33 105 -65 -1 -88 -93 -26 -66 -112 -54 0 -7 116 -35 -2 152 5 114 11 17 58 47
3690D7Lj07J9R9o1l4O4n7O0j3j19N7M2j4M5l8j8jK0k6m8P7P6p3m2J31o6j45K9LQ9k0O0K5j49
$$ 47 50 -57 -38 61 0 -34 30 -27 33 20 -99 -42 0 -14 31 -7 -25 -26 -6 -32 -80 -3 73 0 -42 89 23 -122 -93 -90 -1 -21 39 64 -85
3384h5P5j3n8J9L9J71j04J3o0l2k9j01M2R5K6o5J06K6N2l6Rj01rR2m2k7J73j67j8K05k04M
$$ -85 -10 -23 -81 -62 -23 148 44 57 -3 -35 -64 -165 -123 -28 -2 -67 39 65 117 81 90 -11 -20 72 30 3 176 9 -9 196 -8 -4
3104dj1o8jP2k7R4J4Q2k27J8R0j21N8J0K8p3J27n5K1o4L0O3J5jpq8OJ02j86K01r2M4m3mkN6
$$ -4 -15 -83 -84 -12 -39 55 69 151 -76 -58 32 -89 -31 -21 7 -66 61 6 27 -37 -7 56 71 70 63 -25 -19 83 -103 98 6 50 7 3 1 57
2789E7L4L3j23R7o0k8M4k1q9J51l9Kr6j07J23J53k22J17L6n9R6M2j75OrN2o9o9J83k08J73
$$ 57 91 124 1 98 38 10 54 33 -56 95 56 58 -38 -145 -22 131 -91 26 62 3 99 141 -34 -28 -37 15 -54 -123 60 -148 25
2517B5N7j77M7L4L4O1p0K5o6qM6l7%M6o3k0J41n7l2J14o4K7o3J6O4j66J64q7O5j27L7l5N7
$$ 25 82 -95 -48 -14 20 81 11 36 -30 -38 8 -29 -29 17 -46 -66 75 18 -14 100 36 63 0 16 80 -86 78 -9 56 -71 -34 -69 -12
2229a2j42J67j64J53P5q6m7J14L9oj4qp9O7jRj42k6N6O1q2lj6J62j00k3J05j1o4rQ0p7L9J59
$$ -12 -154 13 -151 2 77 -9 -56 58 97 91 77 69 -10 57 56 65 -77 -103 -47 14 -68 -71 -87 75 -25 -48 57 46 -18 -27 53 -24 15 174
1931A74o3q6k12J74P7l9nK5j47p8P8P8R4p6n6Q4M6M0k22L8J61j23L1RJ02k31J67J33p8o1j0
$$ 174 111 25 -187 -13 64 25 20 45 -102 -180 -102 -24 70 -6 -62 22 68 108 -114 -76 85 -38 -7 2 104 -127 40 173 95 34 24
1660B4m9Q9r1M8Mkr3J69q2o0O9m2l0k2JJ21l8k8J2M7r6l0N2o3J15J31j08o8l8l0q1J10L3q8
$$ 24 -25 64 -27 21 25 23 -70 99 17 -43 26 -16 -46 -68 -67 54 16 -12 0 47 -49 -79 -27 -90 25 156 48 -20 -58 -88 -169 -59 -26 -114
1362a14Q2K2j00j3R8m8K9M9k0J19o9m6J37q2l9L9q1m1O6J59q0K8j23j03J42K2p8MQ7k2N8j57
$$ -114 -32 -10 -110 -123 -25 -73 -44 5 -15 104 35 -11 126 44 5 44 -37 -78 -12 147 67 95 -28 -131 11 33 -45 -41 46 24 82 -75
1082g5j7J08k8J0o1KO7L6j25J33j68K17o3m4q7P1J01J9p2l0j76K42j43J09o1O9Q1n9j05M8
$$ -75 -92 16 -12 -2 -63 -61 6 42 -83 50 -118 99 36 -8 -95 -24 77 96 24 -6 -182 60 -83 26 -35 34 115 56 -49 -1
820ao9L9j4j63K38k8L0q1N5m5n5J0J13M2q2j08M4P1k0L7PpP4mj37p0J02Q3l7l9P6o7Oj05R
$$ -1 -70 -31 -45 -208 30 2 32 -49 6 -39 -94 -84 29 71 -11 -119 -75 -4 -24 13 20 13 87 83 -54 -124 -22 61 24 -15 61 -6 0 -105 -96
513i6O9k2l5K27q8q8K46j80Lo7p6M6R9QK7Lk67Q3J39j38P7L8P1l5M2O2r3p6Ql6Q8Pq9J14r1
$$ -96 -27 -49 -84 143 55 -33 213 33 36 -31 -107 -61 38 46 73 76 -191 -108 31 -107 -30 8 79 44 86 148 55 -21 -13 -49 39 46 -43 71 -20
207b0K9KN3M5j07m2P8p1J0n8L8P1rk5kk6O4p9N3j9N0O0n2K6p5L2o2Q3L3n7j02lJ85m9o4r3
$$ -20 9 11 64 109 2 -40 38 -33 -23 -81 -43 28 19 -6 -8 -34 30 -49 4 -15 35 95 43 69 -6 26 -36 47 80 23 -79 -82 103 54 -10 -103
-108a03M8J9l7J21%k7K4l1j6K0J01r2kq5
$$ -103 -55 -36 -73 48 48 21 45 14 -2 18 119 27 25 -60
-230f0
##PAGE=	F1=11258.2
##FIRST=	23146.755397984237788,	4241.1433691826614449,	-0.34783256053924560547
##DATA TABLE=	(F2++(Y..Y)), PROFILE
4241g5Q8J04p6m3m5J8m9R5J19j3j17Ko0J83j24n9n3J72j02J29L9r3m8r9J11J05j63O8k9l9
$$ -75 13 117 41 -2 -47 -29 -78 17 136 123 6 8 -52 131 7 -52 -105 67 -35 94 133 40 -8 -107 4 109 -54 14 -15 -54
3979e4J8J08M6o5L2j8r6j4J37m8o4P9N8j74N9j11N8QL6q7N5K5j0J01j08L5J45j53J39r4o5
$$ -54 -36 72 118 53 85 67 -29 -43 94 46 -18 61 119 -55 4 -107 -49 -41 -5 -92 -37 -12 -22 79 -29 6 151 -2 137 43 -22
3707b2J20Qp6o5l5Q9%ql0k2M8Jj43K5O8jR1p2J8Kk8lj9K8J26j10j9J08p6o4koQ5l6P4O5j60
$$ -22 98 106 30 -35 -70 19 19 11 -19 -41 7 8 -135 -110 -42 -43 48 -24 -6 -4 -32 -35 -54 -26 100 -10 -29 79 3 -61 -63 -69 16 -20 54 119 -41
3384d1O4k5p7OOJ97r6k5m5k3o0j8L0J21Lj27J58l3R7k7o2q3PR6j1j9J03j02M7J46k27L8j8
$$ -41 23 -2 -79 -73 -67 130 34 9 -36 -59 -119 -137 -107 14 17 -110 48 15 112 85 23 -60 -53 43 32 13 116 14 61 207 -20 18 0
3095@q1L2M7jK8LN4j17k7P6r4N5P0J8j59J59j2oj5j1L1O7m6K8o3JN2j79K07p5M3p8L3rj6Q4
$$ 0 -81 -49 -2 -3 25 28 82 -35 -62 14 -80 -25 45 63 -96 63 51 45 30 19 50 117 71 99 36 37 89 -90 117 42 85 7 40 31 15 99
2780I9L3j27P3j5n2K1K9q9J41o1j8j20p1J18J40k10J82Nl3J3L7j30K1l7L3q4l3J43j76J65
$$ 99 132 5 78 63 11 32 61 -28 113 52 34 -86 -157 -39 101 -109 73 78 45 58 95 -35 -14 -51 -18 -102 -135 8 -168 -3
2517cP3j83O1M5M3M9q3N3j19jJ10n4J5K7o3j3J18q4K6N5k4L0q0KJ33j66O1m2O0n6k8k0J11
$$ -3 70 -113 -52 -7 36 85 2 55 -64 -65 45 -9 6 33 -30 -43 75 -9 17 72 48 78 -2 0 133 -33 28 -14 46 -10 -38 -58 53
2229E3k05J68j41R2J11o1n9J31lJ1l7k1l2L9oM5r2q6O8L6q5M5m7J78o9p6O5J6p4L6p%P1J02
$$ 53 -152 16 -125 -33 78 17 -42 89 86 97 60 39 7 46 40 85 -7 -93 -25 11 -74 -29 -76 102 33 -43 22 38 -36 0 -7 -7 64 166
1931A66o5r5j61J39J5PL3J0j12o3J02J9Q9j02n5P5M7J18k61rJ62j02N0j9P5j81J71O1l9J0
$$ 166 101 6 -155 -16 -1 6 39 49 -63 -126 -24 -5 84 -18 -73 2 49 167 -94 -103 59 -43 7 -12 63 -118 53 114 75 85
1668H5Qj57J00n0O2m8Qm1R9o4p5P5o1L3L6r4J12o6%N1P3p1q5L8o5J19Q5k6j28J6k7p9P0M0
$$ 85 93 -64 36 -14 48 0 8 -33 66 2 -73 2 -59 -26 10 -84 28 -38 -38 13 86 15 -70 -32 -97 22 107 81 -47 -31 -58 -137 -67 -27
1371b7j5Q3J8j53l3N8J4J5O5k5R8j06j0J54n7m2L8j14n3J8K32r5k7n1j71K10K1j09J0J08n6
$$ -27 -42 41 59 -94 -127 -69 -55 -40 25 0 98 -8 -18 136 79 37 75 -39 -92 -74 158 63 36 -15 -186 24 45 -64 -54 54 -2
1100bP3j39k8P7K6ln4n0Q2P5p5N3j31J51%m3p2M0O9N8q6k8j33J98j57R3n8J12Q3o4j26L9j2
$$ -2 71 -68 -96 -19 7 4 -50 -100 -18 57 -18 35 -96 55 55 12 -60 -20 49 107 21 -7 -140 58 -99 -6 -64 48 131 67 -59 -20 -32
811c2j3j3j20K22n1R1j34O9m6j6n1J34Qm2j26M5O7nnN8m8M1Qr5n5R6O7k3m9J13j37N4j41R7
$$ -32 -45 -58 -178 44 -7 84 -50 19 -27 -43 -94 40 48 6 -120 -75 -8 -13 -18 40 -8 33 41 -54 -109 -13 54 31 -18 95 -42 12 -129 -32
513c2Q9j15k1K31q5q3K17j17qr7q9R6M0J1l7l6j90O4J59r5R7N7l5j4P6K5nj66jJ4P6K6j58
$$ -32 57 -58 -79 152 67 -16 201 84 76 -21 -110 -14 26 37 0 -36 -226 -162 -3 -98 -1 56 21 7 83 108 103 -63 -64 -50 26 52 -106
225a06J59p8J2J7M7K6j46kO8l0K0k8l6R3j6ql0J6M5q4P8ML5K5o6N4r6Q0n5L6j4K1j34j7K27
$$ -106 53 -25 -13 4 51 77 -69 -71 -3 -33 -13 -41 -77 16 0 -8 -38 -22 23 -61 17 21 56 81 15 69 -27 53 -2 34 20 41 -93 -110 117
-82A17m6p6r3L8M9n6Q7J6kM9o3l2K1J13n1k1j22
$$ 117 71 -5 -98 -60 -11 -67 20 36 34 83 20 -12 9 122 71 50 -72
-230g2
##PAGE=	F1=11211
##FIRST=	23146.755397984237788,	4241.1433691826614449,	-0.27706182003021240234
##DATA TABLE=	(F2++(Y..Y)), PROFILE
4241e9K2J20o5l5kl4j1L8J32%p3k4n5J18k5j15p1J53o7J30P9q3p2q8R5J07j76N5N4r1QM5P9
$$ -59 -37 83 18 -17 -19 -53 -64 -26 106 106 33 9 -46 72 47 -68 -139 14 -53 77 156 73 1 -87 8 115 -61 -6 48 -43 -35 10 89
3952H9n3P3m9j00J3J02%o9R0J6j28M1r8Q5r1J20j10O1Qj6O3m7L0R1j55J60n2j46K11J3j56
$$ 89 36 109 60 -40 -27 75 75 6 96 112 -16 25 -73 12 -79 41 -69 -8 0 -16 47 0 30 121 -34 126 74 -72 139 152 -4
3681djo8O3L1J4q6k2N9J9j44K2O3J8J09q2L7ln4K7k7J5J19j07k8P5o8K2k7m0O2k3R7R2j37
$$ -4 -5 -73 -10 21 35 -51 -73 -14 5 -139 -117 -54 -36 73 -9 28 25 -29 -2 -29 -14 105 -2 -30 45 -23 -1 -28 -68 -6 -29 68 160 23
3384B3O3q4o2k8nJ97p6o5Qm9o6N8PJ08l0j42J55n3J40m4j17l7K6R6k3J6M6m5Q5O2k23R2l6
$$ 23 86 2 -60 -88 -93 104 28 -37 -29 -78 -144 -86 -79 29 -1 -143 12 -41 99 55 -62 -99 -73 23 0 16 62 17 102 164 -59 33 -3
3095cn8M5J6J8j3k3N3l0p3N4o1O5Q7K1j89J40K6k0L4m1jP9p4O3n8MK9j40J69o6N3r9O3Mo5
$$ -3 -61 -16 0 18 5 -18 35 5 -68 -14 -75 -10 77 98 -91 49 75 55 89 48 47 126 52 115 57 61 90 -50 119 53 106 7 70 74 9
2789IJ08l1o7K3L0n8mQ3j26J26l8l2j07q2J10Q5j47K21j7rn8J6n6L3m3k5q0rQ6j03J32R7j67
$$ 9 117 86 19 42 72 14 10 93 -33 93 55 23 -84 -166 -56 29 -118 103 86 77 19 35 -21 12 -31 -56 -136 -145 -59 -162 -30 67 -100
2500a00O1P2L8J0q1L2p7PJ08k6nK9j02k2J48j20P7l2K9L3q8j6K07j58m9j3N6L7r6j0J62k18
$$ -100 -39 33 71 81 0 32 -45 -38 70 44 39 68 -34 -56 92 -28 49 17 46 79 -9 -25 182 24 -25 -38 18 55 -41 -51 111 -107
2220a07J02r9O2R2m8n6J34j4nl0k2k3N3j9P3k1j46L9L8m0N0n7J67n4r0J6K6p1Q9n8K6R8L5
$$ -107 -5 -104 -42 50 2 -54 80 66 61 31 9 -14 39 20 93 72 -74 -35 3 -37 13 -44 123 69 -21 -5 21 -50 39 -19 7 105 140
1931A40o8q2j05P4QM5N3%n3q8J02jQ7j24o1O1K4J62k27m6J33n8M1k8Nj10J71jNO5Nk10P8J3
$$ 140 72 -10 -115 -41 -33 12 65 65 12 -76 26 25 112 -12 -73 -12 12 174 -53 -99 34 -24 17 -11 -6 -116 55 54 59 124 129 -81 -3 10
1633A0M0o0J7JJ2l4p1N1l4O6P2j71O5o1N0O4N5j7j06j6p5J36O4K4j41N4k1m6K8JQ2P0K3k13
$$ 10 50 -10 7 8 20 -14 -85 -34 -68 -2 70 -101 -36 -97 -47 17 72 55 -51 -67 -142 -6 58 82 -59 -5 -26 -72 -44 -43 39 109 132 -81
1336h1m7%R2OQ4k3L0j11RJ46k2j4J3r8r2J5K35r0p0K8k18K70Nj15k0J33q7P4q2l5KP6l9No5
$$ -81 -128 -128 -36 -30 54 31 61 -50 -41 105 83 69 82 -16 -108 -93 142 52 -18 10 -208 62 67 -48 -68 65 -22 52 -30 -65 -63 13 -26 -21 -86
1030h6N6J08k2k2r4P8M3n5j8j9M0N4m1k1o2N9j03P6o6J33J03p3j15M4Lm4rn0J66p4J18j34
$$ -86 -30 78 56 34 -60 18 61 6 -12 -31 9 63 22 1 -61 -2 -105 -29 -95 38 141 68 -47 -3 0 -44 -53 -103 63 -11 107 -27
750b7P9p9J7p5J14Nj3j18N3M4pk0R3j07L0J0k8n7P4N6K0o8J15j90J08j23J15R9j75lK09o0
$$ -27 52 -27 -10 -85 29 34 21 -97 -44 0 -7 -27 66 -41 -11 -1 -29 -86 -12 44 64 -4 111 -79 29 -94 21 120 -55 -58 151 91
470I1r5J49j0n1q8p9R8j4M8q0q1j14M8J50m3J31J0p0j7R6mP5k24mL8P0J9j89J62o9M1j6M3
$$ 91 -4 145 135 84 -4 -83 15 1 49 -31 -112 -226 -178 -28 -71 60 70 0 -17 79 75 150 -74 -78 -40 30 49 -140 22 -47 -6 -22 21
181B1J2j39L3M3K1%Po9P2k7pj0L8K0o8O8K0KK9p1M4q5R5l5J4n6N5j43K0K34o6o6o8mO0l5M1
$$ 21 33 -106 -73 -30 -9 -9 -2 -71 1 -26 -33 -43 -5 15 -53 15 35 37 66 -5 39 -46 49 14 28 -28 27 -116 -96 138 72 6 -62 -66 -6 -41 0
-143@K7L0K0o5j3L7R1l0j4j22
$$ 0 27 57 77 12 -1 36 127 97 83 -39
-230c9
##PAGE=	F1=11163.8
##FIRST=	23146.755397984237788,	4241.1433691826614449,	-0.20629107952117919922
##DATA TABLE=	(F2++(Y..Y)), PROFILE
4241d4m5J39n5k6L8q3K5j8J33Lm8j0l7MJ03j40p4R0k9J34J04q8p6o0L4J24j78N3J39j44kj7
$$ -44 -89 50 -5 -31 7 -76 -51 -69 64 67 19 9 -28 -24 79 -61 -135 -45 -74 60 164 76 0 -60 -26 98 -80 -27 112 -32 -34 -51
3961e1J11m0J09q3p4QN4L3m3O9po4K4q5J17j87J74j02O0j0k3K5K0K8Nj26J71k0j89K40J1j86
$$ -51 60 20 129 46 -28 -20 34 67 24 93 86 22 46 -39 78 -109 65 -37 23 13 -10 15 35 63 68 -58 113 93 -96 144 155 -31
3681c1N9j04L9O8K0r5l8N4K0j04L0QM1J31r3N8rq0M9m0L6M8q0j0J2l2J06n8p2L8j0J21J04
$$ -31 28 -76 -37 31 51 -44 -82 -28 -8 -112 -82 -74 -33 98 5 63 54 -26 23 -17 19 67 -13 -23 -11 -43 63 5 -67 -29 -39 82 186
3392A86j29P7j28l1m8k6J85q6p7P1o9n6Q8j2R9m3j33R0l6J47l7j77PM6R5l6N2j1J2J19k5j90
$$ 186 57 134 6 -25 -73 -99 86 0 -77 -6 -75 -131 -43 -55 44 1 -132 -42 -78 69 32 -145 -138 -92 3 -33 19 8 20 139 114 -76
3112g6J15n0k9N7j3L6n3m7N6K6q8K7l1O4R3Rj75R8M1lN3n3j4R1j01Q4o9K2K2r8J34q7R4j38
$$ -76 39 -11 -40 17 4 40 -13 -60 -4 22 -66 -39 -70 -6 87 96 -79 19 60 57 110 57 43 134 33 117 48 70 92 -6 128 41 135 -3
2815cP2M9q3J14j10Jk1K4j4l3J30j63J10%l1j11j13J25ol2K07k1k8p8j6K1M9n0q3p5J5L9j9
$$ -3 69 118 35 149 39 40 19 43 29 -4 126 -37 73 73 42 -69 -182 -57 -63 -95 112 91 63 -15 -31 -10 39 -11 -94 -169 -154 -115 -134
2526a34J14P6j47O5J01L1k2p3m0J5RR9j0m2M6j26l2J80j57J28j33O4M8q3j7K41j61j10J5N3
$$ -134 -20 56 -91 -26 75 106 84 11 -29 -14 -5 94 84 42 88 -38 -70 110 -47 81 -52 12 60 -23 -40 201 40 -70 -55 -2
2264bJ01j36j0K02j80j4n2M0P4l5n5J37k3k2k3k1j6O6m5Q5O6j93J0M1KN1m9J14m9n7l6L3p2
$$ -2 99 -37 -47 155 -25 -39 -91 -51 23 -12 -67 70 47 25 2 -19 -35 31 -14 71 137 -56 -46 -5 -3 48 -1 113 64 7 -29 4 -68
1975f8J38p5K8R7Jp4p4n2NL6N6M7K3pj30Q8K6Q0j52n4N8JJ45j74o4J03j4L7l2r8pJ65o5K7
$$ -68 70 -5 23 120 121 47 -27 -79 -74 -38 18 65 88 81 -49 39 65 145 -7 -61 -3 -2 143 -31 -95 8 -6 31 -1 -99 -106 59 -6 21
1677B1R9lk07N1P3L3n9J4K8p6no9K2K8P1Q3k15K9m3Q5O1J8J9q7q8n1J27M3P4j24N9j0rj4l7
$$ 21 120 117 -90 -39 34 67 8 22 50 -26 -31 -100 -78 -50 21 104 -111 -82 -125 -40 21 39 58 -29 -117 -168 -41 2 76 -48 11 1 -8 -22 -59
1371e9J65M1M3k58o0o0J70kJ02k1k2j00J3J23J3J3j2q3j02M2J80q4r4O8k12K82Jj11q1J87
$$ -59 106 147 190 -68 -128 -188 -18 -20 82 61 39 -61 -48 75 88 101 89 6 -96 -54 126 42 -52 16 -196 86 87 -24 -105 82
1108H2j19P1j2k6q8J10p4O3o5M5J12Jq2m3PQ4o6L6p5J6K0L5j9Np3m0N8p4J42J13j05o6L6P
$$ 82 -37 34 22 -4 -92 18 -56 7 -58 -13 99 100 18 -25 -18 66 0 36 -39 -23 -3 32 13 18 -55 -95 -37 -111 31 144 39 -27 9 16
811A6n9J1QR9q6R6q6P8j13N0o7O3J3K9j18N2J7j1nR7j46L7nK6o7M5N7P4q3O1j86J59p7O0J08
$$ 16 -43 -32 -24 75 -11 85 -1 77 -36 14 -53 10 23 52 -66 -14 3 -8 -13 84 -62 -25 -30 -4 -71 -26 31 105 22 83 -103 56 -21 39 147
505A47j76MJ75m3j13P2R0q3o8m6O3n6R4q8q9n9J2J26oJ54n0n2k8J15l6J00j96k4M6N2Lj91
$$ 147 -29 -25 150 107 -6 66 156 73 5 -41 22 -34 60 -28 -117 -176 -164 -38 -44 110 60 8 -20 95 59 159 -37 -61 -15 37 40 -151
225a51J34n6P3n7L3L0r9N0%N3l7L3m9M4m5l8M1N6qn9N2K5l6M7o3M0p0O4JJ4p7O5j18O1J84
$$ -151 -17 -73 0 -57 -24 6 -93 -43 -43 10 -27 6 -43 1 -44 -82 -41 15 7 -52 0 25 -11 36 -27 13 -57 7 8 22 -55 10 -108 -47 137
-82A37p4m4l3l5L2J0rL4L6l4l3L7M6O2j2j2r2
$$ 137 63 19 -14 -49 -17 -7 -16 18 54 20 -13 24 70 132 120 108 16
-230A6
##PAGE=	F1=11116.6
##FIRST=	23146.755397984237788,	4241.1433691826614449,	-0.069559216499328613281
##DATA TABLE=	(F2++(Y..Y)), PROFILE
4241a5r4J29n9%M5r8N3m0R8Pl2L1qj34K21j69m1L0oQ7J38j11l6nn0J48j69N9J78j97j0l3J14
$$ -15 -109 20 -39 -39 6 -92 -39 -79 19 26 -6 25 17 -117 104 -65 -106 -76 -82 5 143 32 -4 -9 -59 89 -80 -21 157 -40 -50 -83 31
3952C1l6J39q2o3j5M1K5j3L1oJ7k7l7J27k38J77r3P1Ll6j7M6M0q5r4J83j5j66K01Mj66J05
$$ 31 -5 134 52 -11 -26 15 40 27 58 52 69 42 5 132 -106 71 -22 49 52 16 -1 45 85 0 -94 89 74 -92 109 113 -53 52
3672E2j05J1P2K3l1p5k6K8j2M4m9L3J53j07N5ro8O1n9N1m2j7J0p2K4J33o2r5K5QJ44P7j17
$$ 52 -53 -42 30 53 22 -53 -79 -51 -63 -19 -68 -35 118 11 66 57 -11 50 -9 42 0 -17 -7 -79 -55 78 16 -79 -54 -46 98 175 58
3384E8R1j54Ql3l4J40j02n4J04p4l9O0J4L6m1o7J1nJ26k2j83J0L4J20m5M3l4M7J31p3j52J05
$$ 58 149 -5 3 -30 -64 76 -26 -80 24 -50 -89 -29 -15 21 -20 -87 -76 -81 45 23 -160 -150 -116 4 -41 2 -32 15 146 73 -79 26
3104B6n9pO0l9O3m7j7J0L0m5j9l6P8P1J5j22L5PM8M0o5K7Q2j56J13m7K2Qn4R8j35J52j47M2
$$ 26 -33 -40 20 -19 44 -3 -20 -10 20 -25 -44 -80 -2 69 84 -38 -3 4 52 92 27 54 136 -20 93 46 68 76 22 120 -15 137 -10 32
2806C2P9l2J08k03N8o4l1R0l0J03j56R4L1k0j02j28J29r9O3J62Jn8o1l7Q9L3n3q4o8L4j1L3
$$ 32 111 79 187 -16 42 -22 -53 37 7 110 -46 48 79 59 -43 -171 -42 -141 -78 84 85 27 -34 -71 18 51 -2 -86 -154 -120 -131 -98
2526i8J28K9j42P9Q6M3l7m7j52J29PO8kq4P3j28k0J82j60J45j92O8O1m9l0K21j74r9J4R8J00
$$ -98 30 59 -83 -4 82 125 88 41 -111 18 25 93 91 7 80 -48 -68 114 -46 99 -93 -25 36 -13 -43 178 4 -95 -81 17 117
2255A17j51k2K11o9j22l9M8K7k7l7J03qm2rj0j5R8q6P4J42j89m3M4K0M6n2O7n3Rp1N8r5J33
$$ 117 -34 -56 155 86 -36 -75 -27 0 -27 -64 39 31 -11 -20 -30 -45 53 -33 41 183 -6 -49 -5 15 61 9 76 23 32 -39 19 -76 57
1966E7m0J2O4j6p0l3n1KO2N6MM9J9j75O8Q0Q3j89k7O3lR5j13o6O8QO1n8j86P8J51r1N6O1p
$$ 57 17 29 93 77 7 -26 -77 -75 -13 43 47 96 115 -60 8 88 171 -18 -45 18 15 110 -3 -69 -1 7 68 10 -176 -98 53 -38 18 79 72
1660G2j27j4J15J8j2k4J9j17N4p9J3O7M5O4j98J3qQ6M8l7L8o0j40j0P3M5J06p6L9K0j5on8
$$ 72 -55 -69 46 64 52 28 47 -70 -16 -95 -82 -15 30 94 -104 -91 -99 -13 35 -2 36 -24 -164 -174 -101 -56 50 -26 13 33 18 12 -46
1371d6J70L4L3k56o2o2K03k2R2J7p0o6l3J23K5L3n6k6j00R3P3p2p6P1j65K35j3o9j50K20j15
$$ -46 124 158 191 -65 -127 -189 14 -8 84 101 31 -35 -68 55 80 113 57 31 -69 24 97 25 -51 20 -145 90 77 8 -142 78 -37
1100c7O5L3J0j62J18j09J00j7M6M5Mp2qm2P4p4P3j01J0m0R7QK5j51M0N8r4J32J02j28oJ9N
$$ -37 28 61 71 -91 27 -82 18 1 47 92 96 24 16 -26 48 -26 47 -54 -44 -84 13 21 46 -105 -65 -7 -101 31 133 5 -1 18 23
811B3p4M3M3L6o3M8n3R5j41Q2n3J1K0P1j16M4l9JK2N8j26N8m0O7q5K5P5J09j11k5j10J71m3
$$ 23 -51 -8 35 71 8 56 3 98 -43 39 -14 -3 17 88 -28 16 -23 -22 0 58 -68 -10 -50 17 -68 -43 32 141 30 5 -105 66 23
522B3nJ10j24%J53l8j37K3J43j19k9l0L3m0R9o4p3m1j7R6J5J67j08m0mJ12k9O1j06l4%N8j8
$$ 23 18 128 4 4 157 119 -18 5 148 29 0 -30 3 -37 62 -2 -75 -116 -133 -37 -22 145 37 -3 -7 105 76 137 31 -3 -3 55 37
233C7j79J01n2R8q5J5M0k7J6j7Q7j01O3nRn2o7J03J2No3M7K5p7Q4o2K2m8M7K0K5o5M2n7O3
$$ 37 -142 -41 -93 5 -80 -65 -25 -52 -36 -53 34 -67 -4 -9 0 -52 -119 -16 -4 1 -62 -15 10 -67 17 -45 -23 -71 -24 -4 21 -44 -2 -59 4
-73DJ04n2k2j2n7rP1l4J9K7r2L8N8O3J5J5k1p4
$$ 4 108 56 34 22 -35 -44 27 -7 12 39 -53 -15 43 106 121 136 115 41
-230D1
##PAGE=	F1=11069.5
##FIRST=	23146.755397984237788,	4241.1433691826614449,	-0.0031859874725341796875
##DATA TABLE=	(F2++(Y..Y)), PROFILE
4241@r6J09p1J9K5p9M7l6O0Rj9P2K7k69K92j82J5pL2nJ75j29kM7j03J41j51P3J85k20k2n3
$$ 0 -96 13 -58 -39 -14 -93 -46 -82 -22 -13 -32 40 67 -202 90 -92 -77 -84 -52 -57 118 -11 -13 34 -69 72 -79 -6 179 -41 -63 -116
3961a16J17l2J70q1n7m0O1qj4K4K1O4q7NJ41k26J16q8R5K5m3n8K4O3j19o4J76k7q9J16k3j05
$$ -116 1 -31 139 58 1 -39 22 14 0 24 45 109 22 27 168 -58 58 -30 65 90 47 -11 13 76 -43 -107 69 42 -47 69 46 -59
3681e9J16q0j5P5oO6j17j10L6Q0N7j05K4J76j21N1pn8P7p4L6j00M0K5j49Q3J14n1j07K4K5
$$ -59 57 -23 -38 37 31 97 -20 -130 -94 -14 43 -62 -38 138 17 68 61 3 80 6 42 -58 -18 7 -142 -59 55 4 -103 -79 -54
3410e4J68L7j14Q9j34M5k5m1R5j14k3Q7k9k7K4L9k3l1J3l9mQ9k2j44kJ1J34n8L2m1M2J47n7
$$ -54 114 151 37 126 -8 37 12 -29 66 -48 -71 16 -13 -40 -16 23 0 -31 -18 -57 -61 28 6 -138 -140 -129 5 -53 -21 -62 -20 127 70
3121G0j38P3l7j6O8o2Q5m4M7o3NK7l6p6R6N2J7p3ko1J37Oj04J01O9k16J45k7K4prO1j99J97
$$ 70 -68 5 -32 -48 20 -42 43 -1 46 -17 -12 15 -21 -97 -1 51 68 -5 -7 -68 69 75 -29 72 141 -75 70 43 67 60 51 112 -87 110
2824A10j43K9R7PJ06k33O7r6r3J86j1L1j32R8O2rq8j40J18j48J26Q1L9p2m4o0J59J6m1p0p8
$$ 110 -33 -4 93 100 206 -27 40 -56 -149 37 26 57 -75 23 85 76 -12 -152 -34 -182 -56 25 64 -8 -52 -112 47 63 22 -48 -126
2552a26L2k9N3J48j6j38R4N6M0m0j0k34K14RL9j0j40J16j16j2J80j39J25j80L9O2k7pJ77k13
$$ -126 -94 -123 -70 78 62 -76 18 74 114 74 64 -170 44 53 92 82 -58 58 -58 -70 110 -29 96 -84 -45 17 -10 -17 160 -53
2290e3j7l5J57O4j40m8K04K8j85l1N3j9j9k1P0Po2j%J6R8j16P5J66j34j02M1K3K4l8L3n5P4
$$ -53 -70 -105 52 116 -24 -72 132 160 -25 -56 -3 -22 -41 -62 8 15 -47 -48 -48 -32 66 -50 25 191 57 -45 -4 19 43 5 38 -17 57
2001E7j07Q3j32J12J5J4Klo4Oo6M5N2K3l4P8L0j74L0J13J02k11%O9pM3n6p0O0MQ2q1k46J34
$$ 57 -50 33 -99 13 28 42 44 41 -23 -17 -83 -38 14 37 3 81 111 -63 -33 80 182 -29 -29 40 33 76 20 -50 10 14 96 15 -231 -97
1703i7J54r7P0Qj4n1n0J27QL8o2J0j43J28j02j3R2J0M5j20lK7M1N1r3N7n2j49M1l0N1J42k9
$$ -97 57 -40 30 38 24 -27 -77 50 58 96 34 44 -99 29 -73 -86 6 16 61 -59 -62 -35 6 57 -36 21 -31 -180 -139 -169 -118 24 -5
1415eK0M0l2j0l1J23L3nj83m5m5K15o5N0Q0p5n2p5J27K2L7j04K8o7J16l4n5o1O9j02J41k9
$$ -5 15 55 23 13 -18 105 138 133 -50 -95 -140 75 10 60 140 65 13 -62 65 87 124 20 48 -19 97 63 8 -53 16 -86 55 26
1135B6k8j56K18j04O6N7K6j77Q2q6R3L8N3n5k4Qml9J7o3P3r7L4q8J10M4nj24Q2N9j12J06P6
$$ 26 -2 -158 60 -44 22 79 105 -72 10 -76 17 55 108 53 29 37 33 -6 11 -52 21 -76 -42 -130 -20 24 19 -105 -23 36 -76 30 106
846A06j43O1nnq8P5P8k6l2Pl0R9j35Q7n8jJ8J01j13L6q9K2L6Po7N5q6R8q1K9P0J22j25r4l6
$$ 106 -37 24 19 14 -74 1 79 53 21 28 -2 97 -38 49 -9 -10 8 109 -4 32 -57 -35 1 8 -59 -4 -90 8 -73 -44 26 148 23 -71 -107
540a07J83k3q6J26n4mJ28l0j61J9J37j53J2k9M8m3Q6l4m9l1n3O3L2J57j28l2J7J16j4K2j6
$$ -107 76 53 -33 93 39 35 163 133 -28 -9 128 -25 -13 -42 6 -37 49 15 -34 -65 -118 -55 -23 134 6 -26 -9 107 93 115 99
268I9m6m5O5l9j66O6m7J23r8J3L2L2j8l4J20j63R0L9j1m1j08J51o1M9o7M3J0p4J03q0J1j8
$$ 99 53 8 73 34 -132 -66 -113 10 -88 -75 -43 -11 -29 -63 57 -106 -16 23 12 -29 -137 14 -47 2 -65 -22 -12 -86 17 -63 -52 -70
-12g0K3L0L7n3K6J1N2Rk4PJ1q0o2J22k4j6K9j40J02P1Q0l1K6m4n6
$$ -70 -47 -17 20 -33 -7 4 56 65 41 48 59 -21 -83 39 15 -1 28 -112 -10 61 141 110 136 92 36
-230C6
##PAGE=	F1=11022.3
##FIRST=	23146.755397984237788,	4241.1433691826614449,	-0.048076152801513671875
##DATA TABLE=	(F2++(Y..Y)), PROFILE
4241a0l9P0r4N3j5m6J6jL3j9mR7N2l35L07j91O7j6Q9q9J54j14M4M5j05J12j03N9J53k16k1
$$ -10 -49 21 -73 -20 -35 -81 -65 -66 -33 -52 -56 41 93 -242 65 -126 -59 -75 14 -75 79 -35 9 54 -51 61 -42 17 170 -46 -67
3970f7q2J13qJ67o6n0m5R5l1p2M7N8M0j43P0J50j79M2q4J08N8o3q5nP8r1n4J55n9j8L2l7j4
$$ -67 -149 -36 -44 123 57 7 -38 57 26 -46 1 59 99 -44 26 176 -3 39 -45 63 121 58 -27 -32 46 -45 -99 56 -3 -21 11 -26 -40
3681d0Q1op3J04n7J48j32j99P2J26O3j21k1J91j27M5k3l1Q0o0J3q8M5N2k21J38P3l2j08L4
$$ -40 41 35 -38 66 9 157 25 -174 -102 24 87 -34 -55 136 9 54 31 0 80 20 33 -55 -10 42 -179 -41 32 0 -108 -74
3419g4M2J55k3p7O9j09Q1j5l6L3r0J0M3L3m8k3P3o8j8P4l6k4N4l5r0j0mJ19o4J0l5OJ87k1
$$ -74 -32 123 100 23 92 -17 64 49 13 46 -44 -34 9 42 -6 -29 44 -24 -42 32 -4 -28 26 -9 -99 -109 -113 6 -58 -48 -83 -77 110 89
3121H9j19M1k2m6N3m8R2p9J40j34k5J18l0j30R9O2j2mn5j31K30l2j49J51P8k73J74J3N1l7
$$ 89 -30 11 -11 -57 -4 -52 40 -39 101 -33 -58 60 30 -100 -1 61 49 45 -10 -141 89 57 -92 59 137 -136 38 51 102 65
2859F5j6L5k03J82q5%P3O0P8j88J8j19j41K77J7n2p6J14L2Mp7j18P7j21J22QP0o0j9p3J77
$$ 65 49 84 -119 63 -22 -22 51 111 189 1 19 -100 -241 36 53 1 -75 39 71 75 -2 -120 -43 -164 -42 -34 36 -24 -43 -116 61
2587F1Lm5l5p5L0l8O0J53p2j19J00J0L8l5J1k42K50j0L0Lj96J26o4j4J58r8O8j03K5K0J5o
$$ 61 64 19 -16 -91 -61 -99 -39 114 42 -77 23 33 71 36 47 -195 55 45 75 78 -118 8 -56 -70 88 -10 58 -45 -20 0 15 9
2307IJ33k55J02j06J90K2q9p0J62R4j84l4M8k6l4LM8j5n4j2K4L6P7j23P7J30m9j19L3rrk7
$$ 9 142 -113 -11 -117 73 95 6 -64 98 192 8 -26 22 -4 -38 -35 13 -2 -56 -68 -44 -8 69 -54 23 153 104 -15 18 9 0 -27
2027b7O2j11J01q6J05j43N5M9K4m2jj3M8j02J01kRn8J01Rj17m2J21J52k36L0O4PL2o6p3O4
$$ -27 35 -76 25 -61 44 -99 -44 5 29 -13 -14 -27 21 -81 20 18 27 -31 70 79 -38 -80 41 193 -43 -13 51 58 90 24 -49 15
$$ [...]
-230D8
##END NTUPLES=	nD NMR SPECTRUM
##END=	
##END=	
