##TITLE=	Jan24-2022.93.fid
TM-VI-254, Na+unprotect. pyr. 13C

##JCAMP-DX=	6.0	$$ MestReNova 14.3.0-30573
##DATA TYPE=	LINK
##BLOCK_ID=	1
##BLOCKS=	2    
##ORIGIN=	Mestrelab Research S.L.
##OWNER=	hrzepa
##$MNOVA/LINK_BLOCK_TYPE=	ITEM	$$ NMR Spectrum
##$MNOVA/ITEM/POLYGON=	(XY..XY)
5321,5835
8722,5835
8722,8208
5321,8208
5321,5835
##$MNOVA/ITEM/Z=	0
##$MNOVA/ITEM/ANGLE=	0
##TITLE=	Jan24-2022.93.fid
##JCAMP-DX=	6.0	$$ MestReNova 14.3.0-30573
##BLOCK_ID=	2
##DATA TYPE=	MNOVA NMR VIEW DATA
##DATA CLASS=	MNOVA VIEW DATA
##$MNOVA/ITEM/ZOOM/X=	-31.150195598113686657,	251.15679998888273872
##$MNOVA/ITEM/ZOOM/Y=	-623.43718814849853516,	6702.13134765625
##END=	
##TITLE=	Jan24-2022.93.fid
##JCAMP-DX=	6.0	$$ MestReNova 14.3.0-30573
##BLOCK_ID=	3
##DATA TYPE=	NMR SPECTRUM
##DATA CLASS=	XYDATA
##NUMDIM=	1
##ORIGIN=	Bruker BioSpin GmbH
##OWNER=	nmr
##.OBSERVE FREQUENCY=	100.64143946071199309
##.OBSERVE NUCLEUS=	^13C
##.SOLVENT NAME=	MeOD
##.PULSE SEQUENCE=	zgpg30
##LONGDATE=	2022/01/25 00:54:00.000
##.ACQUISITIONMODE=	SIMULTANEOUS (DQD)
##$ORIGINAL FORMAT=	Bruker XWIN-NMR
##$MNOVA/SCALES_VERSION=	9
##$PARAMETER FILE=	(acqus, ASCII, /private/var/folders/f6/rjf_tdyn2v98c5c0wvkgn4s80000gn/T/Q+BGW6MfRIOLSr4PahtHXQ/93/acqus, 0)
$$ ##TITLE= Parameter file, TOPSPIN		Version 3.2
$$ ##JCAMPDX= 5.0
$$ ##DATATYPE= Parameter Values
$$ ##NPOINTS= 11	$$ modification sequence number
$$ ##ORIGIN= Bruker BioSpin GmbH
$$ ##OWNER= nmr
$$ $$ 2022-01-25 00:54:52.741 +0000  nmr@CZC2439F63
$$ $$ /opt/topspin/data/agmb/nmr/Jan24-2022/93/acqus
$$ $$ process /opt/topspin3.2/prog/mod/shimcntl
$$ ##$ACQT0= -1.90126054427203
$$ ##$AMP= (0..31)
$$ 100 100 100 100 100 100 100 100 100 100 100 100 100 100 100 100 100 100
$$ 100 100 100 100 100 100 100 100 100 100 100 100 100 100
$$ ##$AMPCOIL= (0..19)
$$ 0 0 0 0 0 0 0 0 0 0 0 0 0 0 0 0 0 0 0 0
$$ ##$ANAVPT= -1
$$ ##$AQSEQ= 0
$$ ##$AQ_mod= 3
$$ ##$AUNM= <au_zg>
$$ ##$AUTOPOS= <54 >
$$ ##$BF1= 100.63037
$$ ##$BF2= 400.2
$$ ##$BF3= 100.63037
$$ ##$BF4= 100.63037
$$ ##$BF5= 100.63037
$$ ##$BF6= 100.63037
$$ ##$BF7= 100.63037
$$ ##$BF8= 100.63037
$$ ##$BYTORDA= 0
$$ ##$CAGPARS= (0..11)
$$ 0 0 0 0 0 0 0 0 0 0 0 0
$$ ##$CFDGTYP= 0
$$ ##$CFRGTYP= 9
$$ ##$CHEMSTR= <none>
$$ ##$CNST= (0..63)
$$ 1 1 145 1 1 1 1 1 1 1 1 1 1 1 1 1 1 1 1 1 1 1 1 1 1 1 1 1 1 1 1 1 1 1 1
$$ 1 1 1 1 1 1 1 1 1 1 1 1 1 1 1 1 1 1 1 1 1 1 1 1 1 1 1 1 1
$$ ##$CPDPRG= (0..8)
$$ <waltz16> <> <waltz16> <> <mlev> <mlev> <mlev> <mlev> <mlev>
$$ ##$D= (0..63)
$$ 0 1 0.00345 0 0 0 0 0 0 0.06 0 0.03 2e-05 3e-06 0 0 0.0002 0 0 0 0 0 0
$$ 0 0 0 0 0 0 0 0 0 0 0 0 0 0 0 0 0 0 0 0 0 0 0 0 0 0 0 0 0 0 0 0 0 0 0 0
$$ 0 0 0 0 0
$$ ##$DATE= 1643072091
$$ ##$DE= 6.5
$$ ##$DECBNUC= <off>
$$ ##$DECIM= 704
$$ ##$DECNUC= <off>
$$ ##$DECSTAT= 4
$$ ##$DIGMOD= 1
$$ ##$DIGTYP= 12
$$ ##$DQDMODE= 0
$$ ##$DR= 21
$$ ##$DS= 4
$$ ##$DSPFIRM= 0
$$ ##$DSPFVS= 20
$$ ##$DTYPA= 0
$$ ##$EXP= <c13>
$$ ##$F1LIST= <111111111111111>
$$ ##$F2LIST= <222222222222222>
$$ ##$F3LIST= <333333333333333>
$$ ##$FCUCHAN= (0..9)
$$ [...]
$$ ##$Sgu3PowerLevels= (0..7)
$$ 0 0 0 0 0 0 0 0
$$ ##$Sgu4PowerLevels= (0..7)
$$ 0 0 0 0 0 0 0 0
$$ ##$Sgu5PowerLevels= (0..7)
$$ 0 0 0 0 0 0 0 0
$$ ##$Sgu6PowerLevels= (0..7)
$$ 0 0 0 0 0 0 0 0
$$ ##$Sgu7PowerLevels= (0..7)
$$ 0 0 0 0 0 0 0 0
$$ ##$Sgu8PowerLevels= (0..7)
$$ 0 0 0 0 0 0 0 0
$$ ##$SguType= 3
$$ ##$ShimPowMaxUA= (0..63)
$$ 130000 130000 130000 130000 130000 130000 130000 130000 130000 130000 130000
$$ 130000 130000 130000 130000 130000 130000 130000 130000 130000 0 0 0 0
$$ 0 0 0 0 0 0 0 0 0 0 0 0 0 0 0 0 0 0 0 0 0 0 0 0 0 0 0 0 0 0 0 0 0 0 0 0
$$ 0 0 0 0
$$ ##$ShimPowMaxUC= (0..63)
$$ 130000 130000 130000 130000 130000 130000 130000 130000 130000 130000 130000
$$ 130000 130000 130000 130000 130000 130000 130000 130000 130000 0 0 0 0
$$ 0 0 0 0 0 0 0 0 0 0 0 0 0 0 0 0 0 0 0 0 0 0 0 0 0 0 0 0 0 0 0 0 0 0 0 0
$$ 0 0 0 0
$$ ##$ShimPowMaxUG= (0..63)
$$ 524287 524287 524287 524287 524287 524287 524287 524287 524287 524287 524287
$$ 524287 524287 524287 524287 524287 524287 524287 524287 524287 0 0 0 0
$$ 0 0 0 0 0 0 0 0 0 0 0 0 0 0 0 0 0 0 0 0 0 0 0 0 0 0 0 0 0 0 0 0 0 0 0 0
$$ 0 0 0 0
$$ ##$ShimPowRcbType= 3
$$ ##$ShimPowRes= (0..63)
$$ 1e-20 1e-20 1e-20 1e-20 1e-20 1e-20 1e-20 1e-20 1e-20 1e-20 1e-20 1e-20
$$ 1e-20 1e-20 1e-20 1e-20 1e-20 1e-20 1e-20 1e-20 0 0 0 0 0 0 0 0 0 0 0 0
$$ 0 0 0 0 0 0 0 0 0 0 0 0 0 0 0 0 0 0 0 0 0 0 0 0 0 0 0 0 0 0 0 0
$$ ##$ShimPowRng0= (0..63)
$$ 1 1 1 1 1 1 1 1 1 1 1 1 1 1 1 1 1 1 1 1 0 0 0 0 0 0 0 0 0 0 0 0 0 0 0 0
$$ 0 0 0 0 0 0 0 0 0 0 0 0 0 0 0 0 0 0 0 0 0 0 0 0 0 0 0 0
$$ ##$ShimPowRng1= (0..63)
$$ 1 1 1 1 1 1 1 1 1 1 1 1 1 1 1 1 1 1 1 1 0 0 0 0 0 0 0 0 0 0 0 0 0 0 0 0
$$ 0 0 0 0 0 0 0 0 0 0 0 0 0 0 0 0 0 0 0 0 0 0 0 0 0 0 0 0
$$ ##$ShimPowRng2= (0..63)
$$ 1 1 1 1 1 1 1 1 1 1 1 1 1 1 1 1 1 1 1 1 0 0 0 0 0 0 0 0 0 0 0 0 0 0 0 0
$$ 0 0 0 0 0 0 0 0 0 0 0 0 0 0 0 0 0 0 0 0 0 0 0 0 0 0 0 0
$$ ##$ShimPowRng3= (0..63)
$$ 1 1 1 1 1 1 1 1 1 1 1 1 1 1 1 1 1 1 1 1 0 0 0 0 0 0 0 0 0 0 0 0 0 0 0 0
$$ 0 0 0 0 0 0 0 0 0 0 0 0 0 0 0 0 0 0 0 0 0 0 0 0 0 0 0 0
$$ ##$ShimSysFunc= (0..63)
$$ 1 2 3 4 5 7 9 11 15 16 8 10 12 14 6 17 13 18 19 20 0 0 0 0 0 0 0 0 0 0
$$ 0 0 0 0 0 0 0 0 0 0 0 0 0 0 0 0 0 0 0 0 0 0 0 0 0 0 0 0 0 0 0 0 0 0
$$ ##$ShimSysMatrix= 0
$$ ##$ShimSysType= 1
$$ ##$TFXNUM= 0
$$ ##$TRIPLO2= 0
$$ ##$VTU= 2
$$ ##$VTUETH= <149.236.99.20>
$$ ##$VTUTY= <no>
$$ ##$WBREFAM= (0..15)
$$ 135.5 97.7 100 100 100 100 100 100 100 100 100 100 100 100 100 100
$$ ##$WBREFLM= (0..15)
$$ 0 0 0 0 0 0 0 0 0 0 0 0 0 0 0 0
$$ ##$WBREFPH= (0..15)
$$ 72.26 -67.22 0 0 0 0 0 0 0 0 0 0 0 0 0 0
$$ ##$WBSGU= (0..15)
$$ 0 0 0 0 0 0 0 0 0 0 0 0 0 0 0 0
$$ ##$XFAC= 2
$$ ##END=
$$ 
##$DECIM=	704
##$DSPFVS=	20
##XUNITS=	HZ
##YUNITS=	ARBITRARY UNITS
##FIRSTX=	25274.001712016048259
##LASTX=	-3134.6557087493106337
##DELTAX=	-0.43348832563920586258
##XFACTOR=	1
##YFACTOR=	0.080966039119152136139
##FIRSTY=	8.5741138458251953125
##MINY=	-14.152520179748535156
##MAXY=	6092.8466796875
##NPOINTS=	65536
##XYDATA=	(X++(Y..Y))
$$ [...]
14158 114 124 127 121 110 93 70 46 30 24 22 27 45 74 103 123 131 130 124 118 115 118 122 122 115 102 88 81 81 83 87 99 121 144 151 137 111 84 61 41 26 24 38 68 98
14139 98 113 116 119 126 126 115 108 119 137 144 141 142 146 139 120 101 89 79 73 81 102 120 127 132 139 140 134 130 129 113 80 48 28 3 -35 -58 -30 35 94 123 134 133 108 58 15
14120 15 1 9 18 19 12 -8 -33 -43 -34 -30 -45 -60 -54 -39 -42 -55 -43 0 43 57 50 43 40 35 33 44 69 97 124 152 180 203 212 198 154 90 24 -25 -48 -42 -15 16
14102 16 30 22 13 22 43 54 52 55 76 104 116 98 58 13 -18 -21 10 64 115 142 144 130 114 101 96 101 115 129 135 124 94 63 51 75 123 168 188 179 160 148
14084 148 151 172 207 244 272 282 274 247 206 166 140 133 139 156 181 208 224 223 217 218 222 214 192 164 139 112 77 40 17 22 51 87 113 127 133 132 118 97 82 89 113
14067 113 139 156 165 172 181 201 236 272 294 294 281 257 218 165 121 104 110 121 125 124 123 122 120 116 108 96 85 81 78 66 50 48 69 104 138 162 177 177 161 133 103 79
14048 79 65 62 67 73 71 62 54 55 67 82 95 109 124 136 138 129 119 112 102 82 63 66 94 126 134 105 49 -7 -41 -43 -22 5 31 66 119 182 235 256 242 207 172
14031 172 145 118 82 47 36 53 76 80 63 34 4 -21 -30 -8 35 75 91 83 65 50 44 46 40 15 -24 -49 -37 10 70 125 168 195 202 189 167 148 143 154
14014 154 173 192 204 204 190 170 157 163 181 195 196 187 178 169 157 145 134 126 120 122 133 149 168 193 221 236 228 210 208 224 238 229 200 164 131 111 106 107 101 86 77 90
13996 90 115 134 140 133 113 81 50 41 54 66 57 29 9 19 53 79 67 21 -27 -52 -54 -43 -24 6 46 75 84 78 70 68 79 108 150 186 201 194 179 159 136 114
13979 114 107 115 127 130 124 118 121 135 154 169 167 147 120 99 88 89 105 135 165 182 191 205 224 226 200 164 152 169 186 175 144 120 118 125 129 126 122 115 111 125 165 213 242
13960 242 241 224 207 186 156 124 108 107 106 94 80 75 81 88 87 77 65 59 69 94 121 133 131 130 141 161 181 198 216 230 231 219 206 202 202 197 187 176 167 161 164 175 181
13941 181 165 130 102 104 134 164 169 146 109 82 77 89 106 122 138 146 138 120 117 140 175 197 198 185 165 140 120 124 157 205 239 239 202 151 118 125 164 206 233
13924 233 242 237 223 205 192 186 184 185 195 211 221 224 231 247 252 232 197 174 174 178 167 147 137 148 172 194 205 211 224 246 265 273 268 245 201 141 94 85 106 128 137 143
13906 143 159 171 166 150 137 120 84 40 22 42 79 105 123 148 183 206 205 193 192 213 250 285 300 288 256 219 183 149 114 83 59 41 28 23 33 52
13891 52 76 101 125 143 151 150 152 166 193 221 241 244 231 213 202 205 219 234 241 235 226 226 236 241 223 185 152 142 147 154 155 157 166 180 194 201 198 188 181 186 195 195 183 166 154
13871 154 152 160 177 196 212 229 260 306 345 355 333 300 280 279 283 277 256 229 205 189 179 169 148 110 69 45 50 70 89 105 122 138 149 160 170 168 144 115
13855 115 113 143 183 215 245 278 298 293 272 255 250 251 256 260 254 229 189 148 115 89 68 59 68 93 123 138 130 117 128 168 208 225 229 233 224 183 122 82 77 86 92 101 121
13836 121 143 147 126 86 41 10 14 49 86 108 124 152 186 205 197 168 136 122 133 159 171 158 132 105 75 35 0 -6 18 59 95 119 126 118 109 112 116 104 79
13819 79 62 66 81 97 111 126 141 157 181 216 247 255 238 201 158 117 89 77 74 73 79 103 144 186 214 224 217 203 189 176 161 150 150 162 173 165 138 109 93
13802 93 98 118 142 161 171 174 173 166 154 146 152 169 180 174 155 136 125 110 85 62 59 77 101 122 139 156 167 165 156 147 134 115 98 92 93 94 108 152 211 241 223 181
13784 181 150 137 124 102 82 72 73 76 75 69 69 88 119 140 139 130 132 144 150 149 153 168 187 201 209 208 191 165 147 147 160 181 210 243 270 286 292 285 261 230 219 241
13766 241 280 299 285 249 211 183 168 159 150 144 148 162 176 181 173 154 125 94 77 84 109 136 154 168 183 199 210 215 216 215 215 210 196 176 165 175 198 222 238 244 243
13748 243 240 245 258 269 268 255 241 226 204 171 132 95 70 71 99 140 173 189 196 194 176 144 119 112 119 129 139 149 152 149 146 146 139 119 99 96 110 130 153 183 216
13730 216 234 229 213 204 206 213 214 206 191 173 160 155 159 173 197 218 216 183 139 116 126 149 162 157 147 146 152 154 150 149 164 192 217 227 218 193 163 146 151 174 198 203 186
13712 186 160 138 136 156 187 205 197 169 140 121 111 102 93 87 87 94 106 119 129 139 155 182 209 220 212 200 190 174 140 96 63 56 70 90 103 98 74 37 7
13695 7 -1 5 15 23 36 58 84 109 138 173 211 243 256 249 227 203 189 184 180 168 150 127 98 63 33 19 16 9 -6 -15 1 37 70 86 93 103 115 127 148 186
13677 186 227 240 213 173 149 145 145 140 136 130 109 76 52 47 50 44 39 54 94 142 183 214 229 221 194 164 153 169 207 248 268 256 222 192 179 176 168 157 151 155 161 160
13659 160 147 131 121 121 127 137 153 177 202 217 220 219 217 205 179 145 112 87 71 69 79 97 112 121 121 115 112 118 136 156 165 157 134 104 84 86 101 112 106 94 93 100 100
13640 100 86 68 51 38 29 29 42 66 100 143 181 191 162 112 63 28 8 6 24 49 69 88 117 152 176 189 206 230 246 238 215 196 180 153 118 90
13625 90 74 63 61 89 151 215 241 230 214 210 208 192 175 181 210 234 231 207 188 186 187 170 130 86 55 38 27 22 29 46 62 72 78 82 78 65 53 54 64 71 73 79 98
13606 98 127 155 171 179 187 204 222 232 233 241 260 274 263 238 223 221 214 192 169 167 183 205 221 224 216 206 207 214 206 172 134 113 106 101 103 123 152 168 170 176 189 187 157 116
13587 116 88 68 39 2 -17 -6 30 80 134 179 204 215 227 243 247 232 213 212 226 231 213 184 163 155 151 146 144 149 159 175 190 196 187 174 179 205 231 230 207 185
13570 185 175 167 148 127 122 141 168 181 168 139 114 105 108 113 119 131 146 150 137 118 109 118 139 163 180 185 176 165 166 191 232 267 272 241 198 172 165 156 128 93 71 71
13552 71 78 82 84 92 109 131 145 136 105 64 30 15 23 47 72 84 88 95 108 116 116 125 152 185 199 186 159 134 121 121 134 151 164 174 185 189 174 142 105 69 38
13534 38 22 33 60 78 78 73 78 92 111 137 158 154 127 108 119 141 143 121 96 82 78 95 143 212 264 271 239 198 172 177 209 246 264 262 257 254 245 227 214 217 226 220
13516 220 192 157 133 129 137 146 148 145 142 134 116 96 89 96 97 87 85 104 128 125 85 30 -13 -31 -22 0 15 15 12 25 50 65 60 51 59 90 132 164 176 174 170 167 162 161 178 218
13496 218 256 266 250 232 217 190 152 123 115 117 119 129 156 185 192 183 181 195 206 198 177 160 154 162 186 220 247 254 244 228 217 211 209 213 223 237 246 241 217 185 157 139
13477 139 123 103 86 81 85 87 83 80 83 93 107 125 151 181 198 188 149 97 53 28 22 33 60 95 121 129 127 133 149 161 161 156 154 150 130 100 80 83 106 135 161 182
13459 182 195 202 198 177 140 101 80 85 98 102 100 102 112 121 122 118 115 114 113 112 109 104 109 137 186 234 255 247 229 216 209 192 161 127 109 117 136 147 142 134 137 153 171 184 191 193
13439 193 186 168 147 131 125 123 119 120 133 158 183 189 177 162 158 154 134 101 76 77 92 101 101 110 133 156 165 161 156 154 149 144 154 183 219 246 262 271 271 252 223 202 195 188 168
13420 168 142 132 146 173 195 199 186 162 137 117 104 100 105 121 142 157 163 168 185 212 230 218 173 117 74 51 39 34 31 20 -8 -44 -55 -25 28 74 101 116
13403 116 120 105 78 56 48 42 36 38 59 81 82 58 27 10 16 43 79 111 134 157 180 191 180 158 146 156 176 193 202 201 189 167 139 115 99 97 113 148 192
13386 192 228 237 217 186 175 200 246 280 288 289 294 289 250 181 118 98 120 153 172 181 191 208 221 227 232 243 247 231 195 158 131 115 100 79 49 9 -30 -56 -58
13370 -58 -39 -2 42 83 101 93 82 89 108 113 95 75 79 106 139 161 162 141 109 88 86 98 114 134 159 179 186 189 200 210 200 171 147 146 156 159 152 139 121 104
13352 104 108 138 167 167 143 124 127 140 156 183 219 237 218 181 163 175 191 187 163 134 116 112 119 120 104 74 52 53 74 103 129 151 169 178 176 167 160 158 150 126 94
13334 94 75 82 105 128 145 159 162 147 125 123 148 177 188 184 183 191 197 188 162 126 98 96 126 159 165 147 137 154 180 184 162 140 138 153 175 197 219 243 264 276 271
13317 271 250 221 196 178 163 156 162 173 171 145 111 97 118 159 191 197 182 162 153 158 167 169 158 133 97 55 23 11 22 42 55 60 66 82 105 121 108 65 19
13300 19 11 48 97 117 108 97 97 94 72 44 29 29 27 17 4 3 20 49 76 86 71 42 18 11 23 54 99 141 160 152 133 127 140 163 182 194 200 198 185 159 124
13282 124 94 81 81 82 74 60 57 77 118 164 194 204 203 206 214 218 209 187 163 142 123 104 90 86 94 111 138 171 193 184 147 115 118 147 169 166 152 150 166 190 213 230
13264 230 232 220 203 190 179 168 165 174 189 204 222 245 262 255 224 187 153 121 87 56 36 30 40 60 84 108 139 179 214 224 215 208 210 208 194 183 188 202 207 199
13246 199 188 181 181 189 206 216 202 167 132 105 81 55 38 42 66 96 121 134 134 125 114 114 129 155 177 186 187 195 208 212 196 171 155 150 144 126 101 77 56 40 33
13229 33 40 60 90 123 150 163 164 167 181 206 223 219 194 168 163 182 212 233 241 244 248 252 252 244 231 213 189 154 112 80 78 107 141 150 127 95 76 79 96 115 125 124
13210 124 116 101 80 60 55 66 81 83 78 83 103 130 150 159 158 152 157 184 227 266 289 293 281 258 242 249 270 270 232 175 131 112 112 124 142 152 144 132 136 158 175 166
13192 166 133 95 62 34 7 -16 -31 -35 -36 -39 -34 -11 25 51 55 50 59 89 130 174 215 245 260 263 260 254 245 237 232 221 199 175 163 160 157 151 143 128 96 57 33 33 47
13174 47 63 95 150 215 255 256 228 191 158 134 121 120 127 134 133 128 129 143 165 178 166 129 81 46 39 52 71 89 117 152 177 175 157 143 135 127 130 167 225 258 238
13156 238 182 128 85 47 15 6 19 39 52 60 64 63 60 64 81 110 142 166 171 162 153 152 147 122 86 62 62 79 103 136 176 211 228 221 194 156 124 112 114 114 106 103 113
13137 113 128 140 150 154 142 113 87 77 81 92 116 154 178 164 122 91 92 104 108 115 140 176 201 212 228 255 271 253 205 153 119 109 115 126 131 122 102 83
13121 83 74 73 77 93 128 175 208 209 181 144 111 84 63 58 76 107 123 103 62 38 50 79 93 89 84 84 77 60 41 26 8 -13 -17 13 61 94 97 92 99 120 138
13103 138 142 139 139 143 137 110 75 66 100 149 171 153 126 121 144 180 215 238 244 235 222 213 206 194 181 171 167 164 159 152 141 131 133 148 166 171 158 134 111 104 115 136 155
13084 155 171 190 212 224 210 173 131 104 103 121 141 144 129 110 102 109 126 139 131 95 51 35 58 100 129 140 149 162 179 197 221 244 254 254 263 283 296 285
13068 285 258 235 226 225 222 219 217 221 230 239 243 242 244 254 266 273 272 271 271 269 254 224 190 170 170 175 166 150 143 145 139 114 85 68 60 54 54 71 103 137 163 179 183 177 170 176 191 198 187
13047 187 163 134 109 93 85 73 52 31 28 42 51 43 32 37 56 73 79 81 83 83 83 87 96 103 105 113 127 137 133 116 92 59 13 -28 -43 -24 8 34 44 45 45 50 64 83
13028 83 97 102 109 123 134 134 136 161 207 244 253 241 230 224 217 211 208 196 160 111 75 70 86 104 114 119 119 111 101 99 109 127 140 137 116 86 65 66 88 123 161 187 192
13009 192 181 166 153 141 129 124 135 162 196 219 223 210 193 181 168 148 125 108 98 89 84 94 116 139 153 166 181 192 193 194 202 207 201 194 205 227 238 230 218 211
12992 211 203 183 159 144 148 165 186 197 190 165 137 122 122 130 137 138 137 138 138 130 119 118 133 152 160 160 166 180 184 163 128 98 76 56 40 32 25 10 -1 6 38 79 116 149
12972 149 183 210 217 197 161 125 104 100 96 81 60 55 71 91 91 77 76 111 171 224 249 253 260 276 282 261 224 199 206 232 250 249 236 228 228 230 226 215 201 188 176 163
12954 163 150 145 152 169 187 193 182 168 170 191 211 207 179 148 136 140 149 152 145 129 110 100 106 126 149 161 155 129 93 62 41 24 3 -15 -24 -19 -9 -5 -6 -4 7 28
12936 28 44 43 31 22 29 40 39 21 -3 -28 -56 -83 -93 -77 -43 -14 2 9 12 14 18 31 56 94 141 193 236 255 248 231 220 221 229 244 263 273 255 210 162 143
12919 143 155 174 182 181 186 196 196 180 158 137 113 83 53 36 33 37 43 52 64 76 93 126 174 220 252 270 277 271 249 219 194 174 159 150 150 152 146 133 119 108 93
12901 93 73 55 49 56 76 103 124 127 112 97 95 110 135 162 186 195 190 176 155 122 80 49 50 73 95 102 98 94 96 113 153 206 243 244 220 195 184 181 171 146 112
12883 112 83 70 73 79 74 58 46 55 89 135 172 189 189 180 165 150 143 149 154 136 91 40 13 17 37 54 71 93 120 142 152 155 168 200 240 270 280 268 238 198
12866 198 160 136 128 124 111 93 88 104 129 150 163 175 192 201 190 158 125 107 102 103 100 92 82 81 96 126 153 162 148 117 78 41 26 44 83 113 118 108 96 85
12848 85 74 69 76 92 106 108 100 84 69 64 73 88 102 106 93 58 16 -3 12 47 73 77 67 51 35 21 17 22 30 39 51 58 53 45 56 95 146 188 213 226 233 231 214
12830 214 183 151 135 144 164 175 169 153 137 135 153 184 201 183 144 117 114 118 119 131 153 159 134 99 90 100 97 79 77 102 132 137 119 98 76 47 12 -15 -30 -29
12813 -29 -11 22 54 69 67 67 82 111 149 187 214 219 200 169 143 131 135 150 170 188 200 204 206 213 231 257 283 300 306 303 290 268 244 228 222 220 215 211 216 225 223 201 164
12794 164 131 115 112 109 101 92 91 103 124 139 141 133 119 101 82 69 75 101 132 151 155 151 151 166 198 229 237 219 196 196 214 222 207 180 159 146 136 125 119 121 129 138 137 119
12775 119 89 61 48 51 68 101 148 189 200 178 142 109 83 63 55 62 77 90 99 109 125 141 144 124 89 60 55 75 106 132 142 144 153 181 219 247 251 237 220
12758 220 199 172 150 149 166 175 160 131 110 106 110 110 104 96 90 91 94 89 71 54 49 54 54 52 63 90 114 115 90 56 32 30 55 96 131 141 131 118 116 120 124 123 114 94 71
12738 71 67 89 120 137 140 153 186 221 237 236 233 226 202 168 152 162 171 151 103 51 7 -28 -50 -46 -21 1 12 24 54 100 145 176 189 184 166 146 133 125 116 112
12721 112 124 149 169 168 144 113 91 88 100 113 114 101 77 49 21 5 11 38 77 117 153 178 191 196 203 209 199 166 125 98 94 99 97 86 79 84 97 111 126 150
12704 150 190 238 281 307 306 274 221 176 164 181 202 209 208 215 229 239 235 216 183 144 113 108 123 136 126 92 52 22 8 -1 -17 -37 -48 -35 -7 23 51 85
12687 85 125 159 171 160 139 116 97 94 117 160 199 213 204 187 173 157 138 120 109 103 101 111 138 176 207 217 205 175 129 80 45 31 35 42 48 53 58 60 63 69 79
12669 79 88 96 105 119 136 156 170 170 158 143 140 149 161 169 173 171 163 154 148 143 136 131 142 175 215 244 251 239 218 194 174 154 127 90 57 50 75 118 152 158 134 97 69 61
12650 61 74 104 143 181 201 192 165 145 148 168 185 187 180 176 174 157 120 85 82 107 132 138 142 167 210 245 262 264 259 246 229 218 216 214 207 208 218 224 213 193 179 171 162 152
12631 152 150 151 141 125 121 139 169 195 219 242 255 247 222 203 199 207 213 206 180 140 106 95 98 92 62 22 -5 -10 9 47 87 112 117 112 105 92 73 58 61 81 98 100
12613 100 96 99 113 133 155 173 176 157 120 89 92 134 193 232 233 213 199 199 200 198 200 212 219 208 184 164 155 152 154 165 182 188 172 135 98 81 91 116 137 142 136 134 145
12594 145 169 199 223 228 209 178 151 128 103 79 63 56 48 31 8 -13 -24 -10 34 94 134 134 113 95 86 75 58 47 46 50 55 71 101 132 147 138 116 101 107
12578 107 133 167 194 210 216 217 219 226 239 242 220 178 140 122 116 108 101 111 141 169 177 167 159 167 183 194 196 194 193 190 180 166 154 145 137 138 151 171 180 170 152 137 127 115
12558 115 101 93 91 92 98 116 141 153 142 125 123 143 172 199 219 233 234 219 191 159 127 102 85 75 65 54 45 45 55 76 99 108 90 48 5 -15 -11 8 31
12542 31 47 48 37 34 55 89 109 103 88 87 101 112 109 95 83 78 77 67 44 19 16 42 77 95 89 74 67 71 85 105 121 124 122 133 161 185 180 147 111 86 73 66
12523 66 65 68 68 57 40 29 29 34 38 39 42 54 73 95 115 131 146 161 173 180 180 173 163 156 161 180 204 220 231 245 267 282 281 268 257 247 230 204 174 145 116 95
12505 95 97 127 163 179 172 157 144 135 128 128 139 165 202 241 268 273 261 242 219 190 153 118 96 96 116 145 159 141 98 61 51 67 89 102 99 85 68 59 63 80
12488 80 107 133 150 154 154 160 178 200 222 243 260 273 285 298 298 265 206 153 131 134 146 166 195 218 217 203 197 201 192 165 143 143 152 149 136 137 167 217 267 299 300 277
12470 277 247 229 230 242 247 231 196 167 164 176 171 135 95 77 76 73 66 73 97 117 117 100 76 53 35 26 30 44 65 93 125 150 163 166 161 151 133 109 78 39 5
12452 5 -6 7 33 49 49 38 19 -1 -11 -1 17 27 20 10 8 13 25 48 85 124 149 159 162 162 156 147 148 162 177 182 182 184 188 187 179 162 133 102 82 82 89 89 88 103 129
12432 129 145 139 132 141 161 171 162 141 115 89 72 74 91 107 107 91 69 54 61 97 147 190 211 212 197 177 165 171 189 199 196 191 192 186 161 134 132 163 201 226 242
12415 242 263 281 272 230 180 156 163 173 160 128 92 66 55 60 77 91 91 87 101 136 174 200 215 226 232 229 221 218 223 228 225 203 159 100 53 38 57 94 131 159
12397 159 173 172 164 163 174 198 228 249 243 209 165 137 124 113 102 107 131 155 155 131 98 65 37 17 9 8 6 5 11 29 58 98 142 172 176 165 159 171 187 188 171
12379 171 149 140 146 158 168 178 197 221 233 222 192 163 151 160 182 200 205 198 192 188 171 131 84 64 91 149 206 240 252 251 242 226 207 193 187 183 179 179 184 188 179 160
12361 160 146 149 163 179 197 220 241 249 245 241 244 251 254 245 221 187 155 135 125 117 112 115 121 127 131 140 149 150 144 140 140 133 119 110 114 123 132 142 156 163 156 145 144 147 138 114 86 66 55
12340 55 52 61 89 133 180 215 221 197 158 127 117 125 141 155 164 170 174 171 152 126 118 140 173 193 196 198 204 201 183 166 170 196 225 244 250 249 250 254 253 244 235 234 240 242 242 252 275
12320 275 298 309 312 315 316 305 286 267 252 231 204 178 163 161 166 168 165 162 171 191 211 219 216 212 211 206 192 171 150 138 134 124 96 61 41 45 61 69 64 49 22 -8 -26
12301 -26 -14 24 74 128 180 216 220 196 173 174 195 216 225 227 228 231 233 226 208 187 180 193 218 242 261 278 286 278 260 242 232 226 226 233 245 251 251 248 243 235 229 233 245 242 211 168
12281 168 138 126 115 105 112 143 182 209 221 228 229 211 177 138 109 97 104 122 128 109 75 52 45 41 34 36 49 60 55 43 39 45 56 70 83 84 70 60 77 111 135
12263 135 133 112 85 61 56 80 114 125 106 89 105 143 173 183 178 162 138 111 90 77 75 94 133 170 177 155 131 120 119 118 120 128 138 142 138 132 128 131 144 162 175
12246 175 178 177 181 190 198 196 183 165 154 156 168 186 206 223 229 224 220 226 237 238 229 221 228 247 269 287 295 287 262 220 171 127 105 112 135 152 153 143 128 107 82 68 73 88
12226 88 96 97 101 105 95 60 14 -13 0 50 110 152 166 161 153 149 153 173 209 244 254 235 209 195 194 194 187 179 174 168 153 134 126 144 180 208 208 181 151 140 150 162 163
12208 163 156 157 172 191 200 201 199 193 174 146 124 118 121 119 111 109 118 126 128 133 146 157 152 129 97 68 50 49 67 90 100 92 78 72 73 74 74 79 93 115 134 144 140 127 114 116 145
12187 145 196 251 282 271 221 160 116 99 93 75 44 14 5 16 32 42 44 44 50 67 92 116 121 103 75 55 45 33 11 -15 -35 -41 -36 -21 6 42 70 73 52
12171 52 25 15 36 74 106 118 114 106 96 82 66 56 53 54 61 81 120 164 198 213 210 193 170 153 151 159 162 157 149 142 137 137 143 141 125 109 114 139 160 162 160 167 173 161 140
12151 140 136 158 183 191 178 151 118 92 88 103 116 113 106 107 116 120 122 134 157 179 190 193 193 191 185 176 166 153 137 126 122 117 102 81 64 60 67 83 110 148 195 239 267
12132 267 276 272 265 256 234 197 163 154 181 222 250 253 238 215 186 151 121 117 142 176 196 196 188 177 156 125 109 130 176 210 208 185 165 155 143 124 103 84 63
12115 63 42 31 28 29 38 69 119 160 164 137 107 91 85 87 98 112 112 93 71 65 77 96 116 139 162 173 165 145 131 136 158 179 182 158 115 71 47 55 88 127 156
12098 156 176 195 207 204 190 182 187 198 203 199 185 159 124 90 63 37 12 0 10 34 53 65 82 111 140 152 145 127 106 89 81 86 102 126 149 158 155 154 172 203
12080 203 232 253 272 286 287 273 255 238 214 179 148 133 129 127 130 144 161 166 159 151 143 129 108 89 79 78 84 102 124 136 132 123 121 123 118 107 95 90 93 108 133 152 152
12062 152 135 118 121 148 192 235 253 241 213 187 170 151 128 112 111 113 103 86 80 96 121 138 139 133 127 125 123 115 99 73 38 4 -18 -19 3 45 94 140 173 186
12044 186 176 151 124 103 93 95 113 138 160 170 167 155 135 109 80 56 38 29 30 43 61 78 105 150 202 228 210 165 131 122 121 112 97 92 97 98 82 54 28
12027 28 14 8 8 15 34 61 87 106 125 151 180 199 199 181 156 137 131 143 167 192 204 200 186 174 172 176 176 167 147 120 92 79 94 128 150 138 101 65 48 44
12010 44 42 39 38 44 60 82 106 130 161 206 253 282 283 269 251 231 211 205 218 241 262 275 276 253 204 152 125 118 107 82 63 63 79 94 105 106 96 76 59 52
11993 52 50 49 62 93 128 147 143 128 112 103 105 119 143 171 196 202 173 113 56 37 51 63 47 20 7 11 15 12 19 55 108 148 159 152 150 155 148 122 98 102 132 164
11975 164 180 177 163 147 139 139 142 140 137 145 165 182 184 168 136 99 83 110 171 222 232 212 190 179 177 188 216 251 276 288 296 300 289 265 236 207 181 166 174 192
11957 192 191 169 153 159 171 167 155 155 158 136 95 67 73 94 106 117 142 171 179 159 131 113 107 108 114 125 126 108 84 75 90 120 154 186 212 224 220 209 201 197 192 185 174
11939 174 157 131 110 116 148 180 190 187 194 214 230 237 244 259 272 277 283 301 327 349 359 358 346 320 279 234 200 190 206 238 258 252 230 215 214 208 181 144 123 124
11921 124 132 132 125 121 128 141 153 154 147 137 128 123 125 135 153 169 174 169 165 170 178 173 146 111 89 88 96 98 92 88 93 101 100 85 62 35 15 15 36 65 86 96 106 119 129 139 163
11901 163 201 236 251 250 251 255 238 184 107 39 1 -6 6 29 54 80 105 123 130 128 124 132 155 186 211 216 203 184 173 171 167 155 143 140 148 154 156 168 197 231 243 228
11883 228 201 182 175 175 181 200 225 242 240 228 221 227 239 241 229 209 197 199 208 211 207 201 192 172 142 119 111 111 111 110 111 104 83 64 63 77 91 100 117 148 177 188 174 139 93
11863 93 51 36 55 93 128 152 161 149 122 102 109 131 140 124 102 97 106 113 106 83 49 10 -15 -14 11 42 60 66 73 84 87 72 47 34 44 69 101 140 185 223
11846 223 234 217 188 162 143 130 121 122 137 162 182 174 133 86 72 96 135 161 174 185 190 177 146 115 100 101 109 115 120 124 120 96 52 12 6 35 66 68 52 51 71
11828 71 87 79 58 50 59 78 102 136 172 198 212 220 224 215 195 178 178 192 204 207 201 190 183 184 190 188 174 154 138 129 126 130 144 162 171 169 165 160 154 147 149 163 179 191 209 245
11808 245 287 303 279 232 194 177 167 147 120 106 112 122 115 88 64 64 92 133 174 204 213 204 189 186 200 217 221 212 198 185 171 152 132 123 135 166 204 238 261
11791 261 264 235 178 117 81 75 79 82 89 106 126 135 127 101 59 11 -21 -21 6 41 67 91 126 175 219 236 214 162 109 80 78 92 110 135 170 202 215 206 192
11774 192 182 170 144 111 93 104 135 160 165 149 126 113 122 149 177 192 199 208 216 210 186 159 147 154 176 201 213 200 167 138 131 142 159 178 204 233 251 243 214
11757 214 184 178 206 251 280 280 267 260 260 252 228 194 154 114 82 73 87 110 128 143 164 190 209 210 188 159 143 149 162 161 143 127 127 137 136 114 81 58 61 84
11740 84 111 131 152 182 209 210 181 149 139 141 133 118 119 148 187 205 191 159 134 129 136 144 152 168 192 209 206 193 196 223 253 264 251 231 221 222 226 221 212 203 199 195 190 188
11721 188 195 207 219 227 229 227 223 215 198 166 121 79 54 53 76 120 176 222 239 224 196 181 184 194 191 168 141 132 142 154 148 129 114 107 102 86 61 36 22 22 31 35
11703 35 32 34 52 80 100 106 110 126 153 171 166 143 118 105 106 108 104 95 90 95 107 122 135 139 135 129 124 121 125 139 162 177 172 154 138 132 133 139 149 156 155 149 147 144 128 99 80 85
11682 85 102 113 116 120 130 136 131 116 91 57 19 -13 -35 -39 -22 12 54 90 114 119 107 93 95 116 135 131 111 93 83 72 64 72 98 127 141 140 134 128 115 95 78
11664 78 80 107 145 170 170 152 131 114 100 89 83 81 75 64 56 56 61 66 69 67 60 47 36 32 37 50 65 69 61 51 60 89 119 130 123 114 114 120 122 115 104 90 74 59 52 61 78
11644 78 81 59 31 26 55 94 117 122 122 123 123 120 113 99 80 64 61 71 88 102 109 110 112 119 125 116 84 46 28 34 43 33 13 3 13 30 42 44 45 53 72 97 118 127 124 121
11624 121 128 142 153 157 158 156 151 144 143 155 174 186 183 171 160 156 157 157 150 140 142 165 196 209 194 173 171 192 218 239 254 265 269 264 252 237 223 219 232 255 278 292 299
11605 299 301 297 286 275 266 258 248 229 197 153 120 116 130 126 87 37 18 41 86 127 153 156 138 107 79 58 41 28 23 31 52 89 138 182 198 186 167 159 162 170
11588 170 183 199 209 205 198 203 224 252 279 300 305 288 262 247 248 258 270 290 310 313 292 264 247 238 224 202 181 166 156 146 139 139 148 163 178 182 165 131 93 71
11571 71 71 88 99 84 47 15 15 45 85 118 143 168 191 204 202 186 167 155 155 163 171 182 201 225 244 253 256 254 246 238 238 247 253 245 227 207 185 161 146 149 164 172 163 148
11551 148 139 145 166 199 233 250 243 223 213 222 236 236 213 173 135 121 140 176 205 218 226 235 233 208 166 129 106 92 83 85 95 99 85 63 46 36 30 32 53 91 135
11534 135 179 220 250 255 239 216 201 189 172 152 135 124 119 127 153 187 210 210 187 158 144 159 199 237 253 250 247 255 267 269 252 214 164 124 112 132 166 195
11517 195 210 218 229 247 265 271 260 243 239 252 270 277 271 265 262 253 230 203 182 167 149 131 127 140 147 130 102 96 122 162 198 230 258 269 254 234 240 273 310 327
11500 327 322 305 281 252 222 200 190 193 201 198 180 158 144 136 124 111 108 120 135 140 135 125 113 109 119 137 147 142 135 139 151 161 166 168 165 153 136 125 124 131 146 164 175
11481 175 168 147 129 130 155 193 221 219 185 148 143 172 203 208 192 176 167 156 134 104 77 62 69 97 132 155 153 137 122 120 129 146 168 189 198 183 149 110 85 79
11464 79 84 94 104 118 138 153 149 121 85 63 53 42 27 19 23 31 47 85 148 201 207 165 109 67 41 34 52 88 112 111 98 87 77 66 67 94 134 160 168 178
11447 178 200 221 227 224 224 224 214 188 148 107 74 60 72 104 145 176 187 180 163 147 132 108 73 39 29 50 91 127 148 164 192 241 293 321 314 283 251
11431 251 238 249 267 268 247 223 224 253 288 303 297 280 264 248 230 206 179 151 127 113 113 127 151 178 198 206 203 192 183 181 191 209 225 231 224 213 210 223 246 267
11413 267 274 264 245 219 185 143 103 78 77 95 120 146 167 177 169 142 104 66 34 10 -5 -10 -3 11 26 33 33 30 29 36 54 85 123 154 166 165 167 189 230 271
11396 271 290 279 236 166 86 25 8 27 53 66 66 69 79 92 103 115 122 117 97 71 47 32 22 19 22 26 28 33 46 65 82 102 134 179 212 203 160 127 138
11379 138 182 217 222 210 206 210 209 194 165 127 86 57 51 60 69 68 62 58 62 74 94 119 141 155 165 176 185 192 196 195 189 176 159 139 117 97 91 103 123 137 144 152 159 153 130
11359 130 101 76 60 50 57 84 117 130 114 87 76 88 110 130 145 157 162 157 143 131 128 133 134 123 104 90 94 115 141 164 183 204 231 260 277 272 245 213
11343 213 192 181 168 150 141 154 178 191 183 172 169 164 142 116 110 133 167 191 202 205 200 193 198 219 244 257 260 258 246 220 193 189 209 233 247 258 270 266 241 220 231
11325 231 264 280 258 221 199 198 203 198 182 162 149 154 172 186 185 176 177 195 229 274 309 310 262 189 129 102 97 99 99 91 70 43 36 57 86 102 109 125 143 142 119 95
11307 95 87 86 83 78 77 73 59 47 46 53 52 40 24 9 -1 -8 -11 -11 -1 31 81 121 125 105 91 91 90 76 56 37 19 3 -4 -7 -14 -21 -6 37 90 126 138 127 92 46
11288 46 18 28 62 88 98 105 117 125 125 116 99 75 62 79 116 143 146 143 155 185 226 273 316 340 342 334 324 306 272 235 208 188 162 135 123 133 155 178 199
11271 199 217 226 224 216 205 198 192 181 163 147 149 172 200 221 239 257 261 239 203 183 185 187 166 127 101 108 151 211 260 281 273 247 212 173 138 110 82 46 9 -10
11254 -10 -12 -9 -8 3 33 66 86 96 113 136 150 148 140 136 132 123 110 96 86 79 78 93 127 172 205 210 194 188 209 242 253 229 191 169 170 180 194 217 251 282 292
11236 292 281 261 241 219 189 148 99 51 22 29 68 113 144 162 176 178 154 113 88 97 125 147 160 169 172 164 158 168 190 210 221 228 235 241 247 259 269 260 229 194
11219 194 175 170 169 167 169 178 189 201 214 227 237 244 247 241 228 218 213 205 187 172 180 206 226 223 200 176 161 155 160 182 222 265 293 293 271 242 219 194 158 116 94 104
11200 104 132 144 123 80 39 18 22 38 50 52 49 51 51 42 29 27 44 73 102 130 157 178 184 174 157 142 134 137 154 181 207 225 238 253 270 278 263 221 174 148
11183 148 148 155 145 125 118 134 157 167 156 129 98 80 87 110 118 95 63 53 67 77 70 65 75 90 92 82 75 78 87 98 107 107 91 68 55 52 51 46 46 62 89 109 106
11164 106 77 35 3 2 29 67 105 139 171 194 202 197 188 181 179 188 212 247 283 314 339 358 360 334 289 245 216 200 188 176 167 165 167 173 187 208 220 207 169 130
11147 130 112 121 139 148 139 123 125 157 209 260 292 307 316 321 316 293 253 204 164 145 146 157 166 171 172 169 161 152 151 163 187 210 215 192 149 109 98 119 154 179 185 177 172 179
11128 179 190 190 174 154 144 149 159 170 183 194 197 189 179 176 186 208 236 257 262 254 247 246 238 211 167 121 84 69 85 125 165 176 156 126 107 103 107 115 120 120 114 104
11110 104 91 80 76 80 86 92 110 150 196 216 199 173 167 179 182 160 125 95 73 56 46 49 61 71 70 58 40 23 16 24 41 56 64 68 80 100 120 132 131 118 100
11092 100 90 99 122 141 138 119 106 114 138 164 184 197 202 205 217 237 249 231 182 123 83 67 61 45 19 -2 0 31 75 116 149 176 196 207 206 195 179 161
11076 161 140 118 99 93 108 138 168 185 194 203 215 222 217 206 202 217 247 276 282 258 214 165 115 66 28 15 34 69 99 104 85 53 25 15 22 35 43 45 44 43 44
11058 44 41 25 -1 -24 -25 -8 9 15 18 23 23 8 -12 -11 27 84 124 128 113 103 101 87 51 14 9 43 87 113 121 128 147 176 208 233 246 246 239 230 222 216 221 231 233 211
11039 211 171 132 98 58 8 -39 -62 -52 -21 16 47 67 76 79 82 89 92 79 50 16 -1 2 25 64 112 155 173 167 159 174 200 209 189 165 166 196 229 236 201 137
11021 137 77 53 69 99 117 117 114 113 107 89 58 28 15 26 54 82 102 115 125 126 113 90 76 81 103 126 136 136 137 144 147 138 122 114 117 118 108 95 85 77 64 49
11003 49 38 35 43 68 112 162 196 206 197 177 155 147 163 193 214 217 209 200 193 192 200 202 178 130 96 108 154 197 227 260 304 336 328 285 242 224 223 213 181 139 108
10985 108 99 106 122 147 177 201 210 216 242 290 334 351 343 333 332 332 317 282 236 198 183 189 200 204 203 199 190 171 154 157 186 225 242 221 171 113 68 44 41 56 80
10968 80 97 96 83 76 81 90 100 120 158 196 207 190 168 154 140 112 75 39 12 0 9 43 82 110 129 151 176 191 189 175 158 145 142 145 139 109 65 36 36 56
10950 56 71 74 76 95 140 206 276 332 363 373 367 349 327 304 274 233 187 150 125 104 94 108 149 192 210 201 182 163 143 125 121 133 150 165 184 202 201 165
10934 165 114 86 99 135 170 207 253 296 305 269 218 190 196 216 228 228 221 212 206 203 202 199 198 207 227 241 238 225 216 221 232 237 226 196 161 145 165 216 269 298 292 260
10916 260 224 208 225 261 292 299 286 265 245 231 225 228 231 227 212 191 173 163 162 165 163 148 120 88 69 73 90 101 98 96 113 149 189 217 232 235 228 208 170 118 64
10898 64 25 8 3 -1 -5 -2 14 37 60 89 127 173 215 239 235 204 163 134 120 107 82 55 44 52 58 51 44 58 93 126 143 148 159 177 189 183 170 163 167 168 157 140
10880 140 131 138 153 164 164 151 129 102 82 79 92 109 124 144 182 233 270 270 234 183 137 107 99 115 146 177 193 191 179 170 170 171 163 144 127 125 132 139 140 143 146 143 137 143
10861 143 179 239 296 320 302 263 233 227 231 231 223 215 205 186 165 161 183 215 243 260 265 254 225 187 145 96 42 -3 -24 -19 5 43 91 137 165 169 157 138 121
10844 121 116 131 160 187 194 174 137 101 89 110 153 189 200 190 175 159 134 102 78 76 93 110 115 107 93 74 52 38 47 80 123 159 184 203 221 237 244 236
10827 236 210 174 142 119 99 81 71 71 67 53 36 32 38 44 51 63 73 73 71 88 122 148 153 145 139 131 119 115 135 175 210 218 194 154 126 129 157 186 193 176 142 102
10809 102 70 65 84 106 122 145 182 216 231 235 247 265 274 268 252 226 194 171 174 195 208 201 187 175 154 122 102 119 160 194 205 210 230 271 322 362 377 364
10792 364 338 312 291 272 256 250 252 249 233 208 186 179 183 181 156 111 68 45 40 35 25 20 31 53 70 78 80 77 68 52 42 53 86 122 142 146 153 179 217 248 260 253
10774 253 235 217 211 224 246 265 271 265 250 236 231 238 246 244 230 210 193 186 196 229 271 294 285 252 219 196 184 186 210 250 289 308 304 281 249 222 210 210 212 211 214 228
10756 228 246 254 247 234 226 226 228 224 208 187 173 177 195 207 198 168 129 100 87 85 88 97 113 132 140 135 127 138 170 205 226 227 222 226 247 275 290 279 247 212 186 168 157
10737 157 157 172 189 192 175 145 112 81 56 47 56 72 78 70 55 45 42 45 53 70 91 109 118 130 153 184 204 199 178 164 170 191 215 234 247 252 243 217 187 165 152
10720 152 139 116 86 58 38 32 49 86 128 153 158 156 158 157 148 136 125 112 89 64 50 47 48 49 60 83 108 125 136 145 150 150 151 163 184 210 233 247 242 222 206
10702 206 204 205 189 164 153 162 165 140 98 71 76 100 124 140 149 163 186 208 214 204 197 208 225 224 201 172 156 154 160 174 189 193 179 155 127 96 62 39 39 55 65
10684 65 60 46 35 28 29 40 62 89 119 145 164 172 170 165 155 139 123 121 133 142 137 129 135 154 168 163 144 120 103 95 89 81 75 86 114 142 150 139 125 115 102 86 75
10665 75 73 76 78 84 94 98 89 74 63 61 60 54 46 46 55 60 39 -2 -29 -9 47 101 132 153 186 221 236 227 209 196 189 188 187 182 177 183 207 239 260 266 267 269 269 267 267 271 271 261 245
10644 245 225 203 176 150 132 127 133 143 144 129 103 82 81 100 127 143 137 110 83 73 81 99 125 158 192 215 223 225 228 228 217 201 189 185 187 187 179 162 149 158 201 265
10626 265 325 361 366 347 314 280 253 238 229 216 189 152 126 129 147 152 126 86 59 52 49 36 21 17 15 -4 -45 -82 -90 -65 -25 16 53 80 86 78 77 98 128 141
10609 141 131 114 96 69 31 1 0 26 65 102 130 146 154 161 170 174 167 155 156 171 189 197 193 181 171 173 190 218 245 259 254 234 218 224 245 251 225 180 144 126 121
10591 121 127 147 169 170 146 120 114 126 142 152 153 138 117 116 154 212 250 249 228 210 201 190 174 151 127 108 106 126 154 173 171 156 140 129 123 121 121 124 134 153 172
10573 172 180 169 152 148 158 162 143 112 99 117 144 149 132 119 124 130 123 117 138 185 233 258 255 233 200 176 181 213 240 237 210 188 188 202 216 225 225 216 204 197 195 189 177
10554 177 164 143 103 46 -3 -25 -21 -6 13 39 67 92 112 131 148 158 161 164 173 183 184 170 146 128 126 132 136 136 138 138 133 132 157 207 248 251 222 193 174 149 111
10537 111 73 53 52 66 87 110 124 132 147 171 189 184 157 117 72 33 18 34 75 124 170 202 203 170 123 96 99 119 141 162 187 206 211 202 191 185 183 185 185 180
10519 180 165 144 129 126 132 134 130 128 134 147 160 172 189 206 208 181 131 78 39 20 12 12 18 30 42 53 70 102 145 183 200 194 172 143 122 130 171 220 239 215
10502 215 172 140 127 120 119 142 197 268 322 337 314 281 260 261 277 299 321 334 327 301 269 240 217 195 180 174 168 153 132 119 125 148 179 213 235 232 202 165
10486 165 142 142 162 198 242 280 300 299 292 288 287 279 259 231 204 183 168 164 175 198 219 220 204 184 171 159 142 126 131 159 189 195 179 161 161 179 201 209 196 169
10468 169 141 119 97 67 37 33 71 139 203 238 237 212 184 172 181 197 206 206 209 219 220 196 151 110 92 102 126 146 152 151 153 162 170 171 171 173 174 167 154 146 143 145 153 168 178
10449 178 165 124 76 48 53 82 116 137 144 146 155 171 185 190 191 192 193 195 205 221 231 228 219 216 222 226 215 191 161 141 142 159 181 198 215 233 241 227 198 178 180 193 200
10430 200 199 201 207 201 169 117 70 48 48 60 68 65 52 35 25 34 63 109 157 188 188 162 136 127 134 141 140 137 131 113 82 59 54 58 56 49 54 76 104 124 134 137 132 121 109
10411 109 102 96 83 55 19 -9 -17 -8 2 1 -7 -13 -11 -6 4 24 52 77 91 101 111 122 129 134 144 164 189 213 225 219 194 154 104 51 7 -13 -6 21 58 91 113
10393 113 120 119 117 111 91 59 32 27 39 51 55 55 56 61 71 87 101 98 80 66 73 98 121 131 136 144 151 151 148 152 164 174 175 166 152 138 129 126 116 94 68 55 59 67 67 62 59
10372 59 57 53 57 80 115 143 150 139 125 121 131 153 175 193 208 218 212 184 152 137 140 142 136 138 159 185 187 160 125 115 137 176 200 195 176 172 188 205 206 197 194 196 188 172
10353 172 156 143 128 112 102 91 70 43 35 56 88 110 123 143 171 195 214 230 237 224 202 191 197 195 164 111 68 57 80 123 163 175 143 78 17 -7
10338 -7 -1 6 -8 -32 -38 -22 -5 -3 -6 6 31 50 59 73 100 129 147 162 187 218 237 237 224 209 200 205 230 262 275 251 202 151 119 113 129 151 159 146 122 102 98
10320 98 108 123 131 116 77 35 13 17 33 54 84 113 128 123 115 118 119 96 52 19 22 51 81 107 140 185 229 260 280 286 270 231 192 169 156 134 104 87 87
10303 87 86 68 48 45 57 69 79 92 103 102 90 79 72 68 79 112 147 153 122 83 66 76 94 111 125 137 150 166 181 186 176 150 109 55 6 -12 9 51
10287 51 84 98 100 92 65 23 -16 -38 -39 -23 6 37 61 75 86 93 93 85 81 87 105 131 159 178 177 158 131 102 63 20 -13 -23 -10 14 50 93 126 130 108 86
10269 86 83 96 111 122 135 149 154 146 132 118 103 85 72 78 100 117 112 89 68 65 84 121 160 184 179 155 134 124 115 94 63 37 30 49 89 136 171 183 174 157
10252 157 145 140 135 122 108 112 138 169 184 185 190 210 228 221 189 148 117 97 85 76 72 72 77 86 86 66 30 2 6 38 69 77 75 92 132 168 175 161 155 163 166 151 130 122
10233 122 117 94 46 -4 -35 -45 -46 -43 -32 -10 18 47 72 93 106 106 98 94 98 106 107 96 78 61 52 47 42 35 36 52 76 90 88 85 92 106 111 110 115 135 163 185 194 191 187 194
10213 194 217 242 242 204 142 87 64 77 112 142 149 136 117 100 88 82 82 84 85 89 105 129 145 145 141 140 136 131 136 156 169 160 143 147 170 185 173 139 100 66 52 65
10195 65 92 108 107 105 112 114 101 84 85 99 108 105 99 99 107 119 130 129 105 65 26 1 -13 -23 -27 -16 10 49 88 115 131 147 169 194 212 220 223 227 228 227 227 236 249 251 228
10175 228 180 125 87 76 81 88 88 81 72 64 65 82 112 144 163 158 135 111 107 128 157 174 174 173 189 220 250 268 269 252 214 162 113 86 88 111 142 173 197 213 224
10157 224 237 257 278 289 288 273 246 208 169 144 139 148 162 183 212 246 274 286 282 263 236 214 206 214 225 224 210 192 178 167 156 145 139 144 163 189 205 198 177
10140 177 163 169 181 181 162 136 114 98 85 80 82 83 76 68 71 85 101 112 122 135 148 159 168 175 174 163 149 141 137 128 106 83 79 104 144 175 181 165 142 123 118 128 148
10122 148 168 187 210 243 275 289 277 251 230 226 237 241 217 165 111 87 94 110 118 121 122 121 120 122 127 126 118 119 134 149 147 133 127 138 153 158 148 130 116 119 139 165 188
10103 188 207 227 241 243 238 238 244 245 237 223 203 169 127 93 79 80 91 115 149 169 155 117 85 84 109 149 190 222 230 210 175 147 133 131 139 162 195 216 215 200
10086 200 190 182 158 113 66 33 13 2 3 11 8 -17 -45 -49 -32 -18 -11 8 54 115 172 214 229 207 153 97 67 63 67 71 75 81 90 107 124 123 99 74 79 117 157
10068 157 175 168 150 138 144 172 209 241 262 272 270 246 206 165 135 115 105 107 120 127 119 110 115 131 137 118 84 57 55 81 129 184 232 259 260 241 213 185 161 141
10051 141 130 126 128 133 139 138 117 79 48 55 101 154 179 170 147 132 129 126 113 93 83 93 119 141 148 146 152 170 196 226 259 293 322 341 348 336 305 265 228 195 157
10033 157 119 102 116 145 162 155 139 128 124 122 128 146 172 193 199 189 166 144 141 167 203 216 191 155 142 150 142 96 36 6 23 66 107 141 178 215 236 235 220
10016 220 203 186 161 131 106 98 113 143 171 182 175 157 137 114 88 72 74 86 93 92 101 129 165 192 204 207 207 213 230 250 247 205 140 89 65 47 16 -14 -18 7
9999 7 37 47 43 45 62 85 96 96 98 108 116 110 91 76 77 88 98 105 114 129 145 157 166 172 174 168 155 142 136 135 135 130 123 114 99 79 69 86 123 151 147 122 103 107 127 149
9979 149 171 195 219 232 225 198 162 129 105 90 82 83 94 110 117 105 80 59 61 87 126 163 189 204 203 185 156 133 132 150 173 197 228 265 291 298 295 297 304 295 259
9961 259 208 162 129 101 71 45 28 23 29 46 76 114 144 148 122 82 51 37 37 47 68 100 129 142 140 132 123 110 96 83 73 64 64 80 105 111 81 31 0 11
9944 11 47 80 98 111 129 142 138 118 97 86 89 103 126 151 165 160 137 105 68 30 9 18 47 65 55 35 36 63 90 92 70 45 35 36 34 28 34 67 113 135
9926 135 117 78 54 55 70 90 117 147 167 174 182 193 190 161 118 84 70 65 62 54 38 26 39 83 129 139 112 86 94 129 160 168 156 135 112 94 88 101 124 146
9909 146 159 165 165 154 131 102 84 84 98 118 138 150 149 136 121 110 102 95 95 107 118 114 89 55 28 22 41 71 87 79 60 51 56 61 57 54 68 99 138 170 189 198 213
9890 213 237 256 255 246 250 269 277 260 229 206 189 166 146 142 149 151 147 156 184 215 225 210 180 144 109 83 73 78 88 95 103 121 154 195 229 249 259 261 252 233 223 241
9872 241 280 308 299 260 215 184 175 190 220 238 222 174 123 94 89 95 110 130 146 146 132 120 120 118 103 86 87 114 143 150 133 114 117 143 175 190 175 141 108 91
9855 91 85 81 83 98 127 157 174 172 161 149 135 115 82 40 4 -12 -4 20 49 69 73 74 91 133 188 233 253 253 242 225 201 178 163 157 151 140 131 131 137 135 126 128 158
9836 158 205 238 234 198 156 123 105 102 114 134 145 137 121 113 123 142 155 162 168 179 194 205 212 212 196 157 101 51 24 20 25 41 78 132 181 197 181 158 140 118
9819 118 72 10 -39 -53 -37 -11 14 47 92 145 195 236 264 277 272 253 229 207 191 176 152 118 89 88 110 127 120 100 90 97 105 103 99 97 96 92 89 85 71 50 38
9801 38 51 86 124 152 168 175 179 183 187 187 177 153 126 109 108 116 113 91 60 37 30 33 40 52 70 90 106 113 113 113 119 130 132 112 78 52 46 53 66 86 117 155 191 222
9782 222 246 256 246 229 220 219 211 186 156 137 132 136 142 149 157 163 175 198 225 238 223 183 134 92 68 65 84 119 151 164 155 141 136 142 150 151 137 109 85 80 89 89 68 47
9763 47 50 70 81 74 68 76 84 72 43 17 6 11 29 56 85 104 115 131 158 182 189 173 150 139 148 166 171 159 144 142 154 166 171 175 179 180 177 174 174 172 167 170 188 209 212 197
9743 197 179 174 179 181 171 153 135 130 138 149 147 132 119 120 127 129 126 130 151 187 226 249 241 197 138 94 81 96 126 161 195 221 237 245 241 222 193 169 154 139 118 102
9725 102 100 101 94 82 75 76 76 76 80 88 96 105 121 144 164 179 196 214 225 228 239 261 279 277 264 255 249 232 200 167 144 132 130 140 158 166 161 153 157 164 159 137 114 108 115 125 134
9704 134 145 156 157 146 131 121 116 109 107 119 142 159 162 167 186 212 226 218 198 173 143 112 93 95 113 130 137 142 157 180 196 195 181 165 152 138 118 96 76 63
9687 63 65 89 134 182 212 216 202 183 170 172 185 200 207 204 196 184 166 149 147 166 197 229 255 273 283 287 294 302 310 323 350 379 381 341 274 211 163 126 105 106 120 130
9669 130 129 128 136 142 135 117 102 94 81 53 12 -24 -44 -44 -34 -22 -4 25 58 75 67 42 19 15 35 77 130 181 229 280 328 349 328 276 222 181 149 121 101
9652 101 97 109 131 153 167 169 159 144 128 113 101 98 100 108 124 153 183 200 203 205 214 221 221 222 235 255 266 270 274 277 268 245 222 212 213 219 230 244 256 260 268 290 327 363
9633 363 381 372 345 314 295 294 301 300 285 265 251 238 214 170 114 71 59 84 127 159 158 129 98 85 90 102 119 144 170 183 172 144 116 106 123 159 190 195
9616 195 173 138 109 93 85 81 77 78 92 117 136 128 97 69 59 61 66 79 102 123 132 140 163 191 205 200 194 198 210 227 252 274 276 255 239 245 261 264 252 238 224 202
9598 202 179 169 174 174 156 130 109 96 82 65 60 76 100 106 86 59 47 57 71 74 64 51 41 37 34 30 29 40 61 73 65 49 44 47 42 35 45 78 108 115 111 118 132
9580 132 135 121 102 84 68 59 68 90 106 110 109 106 98 91 88 83 64 36 28 49 80 100 109 119 133 143 150 162 176 183 183 184 196 214 225 216 184 145 120 120 137 158 175 187
9560 187 187 171 144 126 130 150 168 175 174 170 159 139 115 104 107 118 128 138 146 140 117 90 81 94 114 125 125 121 115 106 93 76 58 49 63 98 139 167 177 174 165 157 160 175
9541 175 191 195 185 172 168 175 182 175 152 122 101 91 85 74 56 37 27 34 54 75 87 97 121 154 177 182 186 208 240 262 268 269 276 287 291 283 262 235 209 192 186 198
9523 198 227 251 249 226 211 219 226 205 164 136 142 173 217 266 310 337 341 327 306 281 250 214 177 145 128 122 116 98 75 58 49 40 29 12 -12 -37 -47 -35 -12
9506 -12 6 25 49 69 69 60 68 96 116 114 106 113 133 157 181 201 207 194 172 151 129 105 89 82 76 66 60 65 73 76 82 97 107 104 98 100 99 78 40 4 -20 -39 -41 -19 12
9487 12 27 23 27 55 93 123 145 162 165 153 142 146 160 162 152 143 152 179 213 234 224 185 138 108 109 140 188 232 259 267 267 263 238 180 100 24 -28 -52 -51 -30 0
9469 0 26 43 50 56 75 113 159 189 191 173 153 143 141 145 153 161 167 170 167 154 131 108 92 77 52 18 -5 -8 0 0 -12 -23 -14 12 38 49 46 41 41 48 61 77 91 95 88 80
9449 80 80 91 108 127 147 161 162 156 158 169 178 176 166 157 145 125 102 87 84 83 77 64 50 42 46 65 89 108 117 126 141 154 158 158 164 178 190 193 183 155 116 93 115 176
9430 176 230 246 234 221 211 191 160 137 135 146 158 162 156 140 120 100 76 47 25 20 20 7 -13 -13 15 54 84 110 136 146 127 97 89 107 126 126 115 111 122
9413 122 149 181 198 178 134 107 128 176 207 210 216 254 313 355 359 334 298 253 198 147 114 98 88 81 89 114 145 166 182 200 221 233 236 240 247 251 249 244 239 230 213
9395 213 197 190 192 199 205 209 210 212 219 225 221 206 189 182 178 167 151 141 143 153 157 148 124 92 62 44 41 45 45 39 35 41 56 69 84 114 162 208 221 192 134 72 24 -3 -9 1
9375 1 24 57 99 147 186 208 209 195 171 138 101 70 51 49 65 92 125 163 202 228 223 187 146 126 130 138 142 148 164 179 178 162 139 118 100 86 79 79 83 90 105 133
9357 133 176 226 269 291 285 263 252 265 292 307 294 260 217 178 146 122 104 91 83 89 114 157 206 245 262 256 237 216 199 181 163 152 150 145 125 94 67 52
9341 52 44 41 49 71 90 90 73 57 52 55 56 46 24 -4 -28 -38 -34 -22 -2 23 46 59 68 84 107 124 125 120 125 138 149 154 158 164 170 174 176 176 164 138 107 90 98 125 147
9321 147 139 102 65 55 71 85 83 77 90 121 151 157 131 89 57 50 64 82 100 125 156 174 162 130 108 110 127 144 154 160 168 188 232 298 365 406 411 386 345
9304 345 298 253 218 200 205 227 254 273 281 282 279 268 247 225 201 169 130 101 97 108 118 129 153 191 224 236 228 206 177 149 134 131 125 105 81 66 64 72 87 100
9287 100 95 62 18 -9 -11 3 23 48 79 114 146 170 182 184 189 210 241 260 252 223 200 198 212 223 219 199 173 153 148 164 194 220 222 198 164 144 152 190 246 301
9270 301 346 393 462 560 677 816 995 1211 1404 1478 1385 1162 897 663 484 355 259 185 127 87 68 68 78 87 85 77 79 104 139 155 136 93
9256 93 52 32 39 70 110 143 164 175 175 155 125 112 134 175 207 225 241 250 236 198 162 151 162 182 203 220 220 196 162 136 121 112 107 111 120 119 105 87 81 94
9238 94 117 132 123 94 67 59 59 50 28 11 13 25 31 29 26 27 27 24 30 54 97 147 189 215 227 221 189 131 68 27 23 46 77 103 118 121 117 115 125 145 165 181 191 193
9219 193 184 161 135 120 122 136 153 166 171 165 147 124 112 122 143 149 124 83 47 25 11 5 19 47 63 49 15 -1 17 57 89 95 80 55 30 4 -20 -44
9203 -44 -63 -74 -73 -57 -27 10 51 85 109 125 139 157 174 183 181 174 163 142 110 77 52 32 11 -10 -17 -3 22 46 59 66 76 94 116 123 104 73 55 58 65 58
9186 58 47 55 82 109 125 138 162 189 202 196 183 182 198 217 220 196 161 138 142 159 167 158 142 130 122 111 100 93 85 68 53 61 103 162 207 228 236 239 227 194 152 121
9167 121 108 108 112 113 102 75 44 32 48 83 122 154 172 174 162 152 152 160 167 169 167 153 127 100 87 88 90 87 85 91 97 94 85 85 100 117 120 107 93 95 117 150 182 202 199
9148 199 173 140 118 111 102 87 87 116 154 173 165 149 136 118 90 66 60 64 62 56 62 82 100 107 118 149 194 226 226 199 171 159 167 186 205 214 208 188 160 133 111 97
9130 97 94 103 118 132 144 162 186 199 189 163 142 132 125 111 92 68 42 22 23 52 94 132 157 167 160 139 118 116 134 148 131 83 34 19 42 77 93 86 78
9113 78 83 95 103 106 109 106 87 58 37 32 35 46 69 104 137 156 169 182 190 186 174 165 156 142 134 147 182 216 224 204 175 159 164 181 200 218 239 257 259 236 197 153 107
9094 107 59 22 3 0 4 25 71 125 160 172 180 197 216 228 228 205 156 100 66 58 44 9 -13 5 47 70 63 53 55 59 56 57 69 83 90 91 84 69 58 69 100
9076 100 124 128 128 141 157 166 179 211 240 230 181 132 105 87 52 13 1 27 70 103 119 126 139 164 189 198 186 167 162 172 180 172 154 144 149 161 166 159 142 122
9059 122 104 90 77 67 74 106 151 185 194 196 212 244 274 288 290 286 278 266 248 219 172 117 76 66 84 109 124 125 121 125 139 158 167 156 127 94 71 66 78 100
9042 100 123 142 149 142 125 107 98 97 104 122 148 175 194 203 197 166 114 69 58 78 97 97 92 98 111 118 118 122 130 131 118 99 84 78 84 95 106 123 153 189 204 188 161
9023 161 151 151 141 119 106 116 140 166 194 221 231 216 194 185 196 220 243 255 251 229 198 169 141 114 93 84 84 87 96 112 134 154 171 187 204 217 222 215 197
9006 197 173 156 150 144 127 106 104 126 156 172 174 172 174 175 169 154 132 108 94 107 147 196 229 234 215 179 132 86 60 64 90 123 156 187 205 206 194 184 179 173 168 166
8988 166 162 146 123 105 99 91 72 50 37 33 33 38 54 77 98 110 112 107 101 95 82 61 38 23 14 1 -19 -33 -28 -6 27 70 115 140 132 103 76 58 38 16 8 23
8970 23 48 66 78 91 106 119 131 147 162 169 163 147 125 105 102 121 155 189 218 240 251 244 221 195 181 183 197 213 216 202 180 162 152 143 136 140 151 156 147 136 133
8952 133 135 131 123 128 148 168 174 178 201 240 269 266 240 218 220 245 270 271 243 203 168 138 102 58 20 -3 -23 -44 -51 -31 11 61 103 137 156 149 118 82 60 59 69
8934 69 78 80 73 64 60 59 61 71 100 143 178 189 184 186 209 240 255 246 219 190 167 148 133 127 133 147 162 175 188 200 211 223 233 232 214 187 165 154 147 141 142 152 162
8915 162 166 172 192 220 244 257 260 251 224 179 132 106 112 138 158 149 118 94 109 159 209 232 235 245 272 300 307 296 286 286 292 286 261 213 148 78 28 11 23 47
8898 47 73 101 126 137 127 102 73 50 39 40 46 54 66 88 123 160 185 187 166 133 111 117 142 161 160 157 168 189 198 188 173 166 165 162 155 154 166 192 220 232 220 191
8880 191 157 129 115 117 123 113 80 50 44 61 79 91 103 110 99 71 47 42 51 67 95 136 174 194 207 232 263 269 236 187 152 144 156 169 173 167 158 153 149 139 123
8862 123 108 97 85 75 75 85 92 87 85 109 159 214 248 250 227 186 138 93 59 41 42 57 69 59 21 -27 -65 -88 -100 -102 -90 -67 -42 -16 14 48 74 86
8846 86 90 87 75 63 70 100 131 140 132 128 128 116 90 80 108 156 190 193 173 146 122 111 121 142 162 175 187 205 224 234 229 209 182 162 155 158 160 156 146 129 102 69
8827 69 50 50 58 59 57 65 86 109 124 135 144 145 135 120 104 85 64 55 66 89 108 127 158 197 221 216 195 173 157 150 167 211 265 300 307 293 267 235 203 178 166
8810 166 172 195 217 216 190 166 171 198 217 210 180 142 110 103 133 190 240 265 272 266 247 218 194 177 149 97 44 22 40 78 115 138 139 114 76 43 22 6 -2
8793 -2 5 26 42 44 41 49 67 77 71 59 55 73 110 155 188 195 182 170 178 204 226 226 211 204 215 236 254 266 274 268 243 209 188 188 194 191 181 177 185 192 187 177 180 205 239 258
8773 258 254 241 236 240 242 241 240 239 230 213 195 185 183 194 216 239 243 220 183 148 117 80 37 -1 -30 -51 -66 -64 -47 -28 -23 -21 1 57 124 175 204 224 245 258 253 230
8755 230 200 172 148 133 124 119 115 117 125 134 135 132 130 138 157 188 218 232 227 226 251 291 312 294 252 210 173 142 123 120 124 122 111 104 107 121 137 141 131 119 128 161 196 210
8736 210 208 206 201 177 135 98 84 93 112 128 132 124 113 106 96 71 34 8 8 29 58 88 116 132 130 117 102 81 49 13 -4 2 24 50 78 107 134 156 177 200
8718 200 217 223 226 238 257 271 265 236 191 149 132 147 177 192 178 155 153 174 189 173 138 112 105 97 79 68 93 143 174 156 112 84 86 91 80 68 78 110 145
8701 145 168 178 173 156 136 124 122 113 90 63 55 79 135 205 265 296 294 277 268 271 273 259 229 200 184 181 179 168 148 122 91 60 36 26 23 16 7 15 55 125 196 237
8683 237 230 189 150 139 149 161 164 166 167 155 127 107 111 134 158 181 207 225 216 181 143 120 109 104 104 109 113 115 123 138 146 134 111 96 98 107 102 72 28 -3 -10 2 21
8664 21 36 47 57 68 92 138 192 225 220 190 159 136 117 104 107 127 146 146 123 95 84 98 126 149 160 173 195 213 201 155 101 72 76 93 103 107 113 121 121
8648 121 114 111 120 129 126 118 120 137 153 153 140 124 113 110 116 126 129 113 79 36 0 -19 -14 7 33 54 67 70 65 63 73 95 114 121 120 118 112 109 119 142 164 172 171 176 186 194 205
8627 205 224 231 205 154 119 122 146 158 152 151 167 188 202 209 220 229 223 196 161 134 118 99 67 35 23 35 54 62 59 60 69 74 65 45 29 27 35 47 61 72 68 46 26
8609 26 31 64 96 105 99 101 119 141 159 176 196 210 210 195 176 165 167 168 151 117 84 69 70 77 88 104 116 112 98 88 84 76 60 52 60 76 85 88 89 95 109 134 169 203
8589 203 226 233 224 195 152 113 90 85 92 108 129 142 144 143 145 138 104 53 19 21 40 46 31 10 2 11 34 64 94 116 130 147 175 200 201 173 136 112 103 91 69 47
8571 47 36 35 38 43 48 49 45 45 66 114 178 227 236 207 162 123 90 56 30 30 48 57 49 44 60 77 70 42 24 30 45 51 47 42 40 45 52 58 60 70 95 126 142 137 124 111 97
8551 97 87 94 116 138 150 157 173 200 233 265 288 288 260 215 166 124 97 95 109 120 117 107 104 98 82 64 71 102 129 131 119 122 142 151 127 91 81 110 142 141 106
8533 106 75 73 92 111 127 143 160 171 179 187 190 176 147 121 111 117 128 143 157 160 147 131 128 135 131 108 83 76 79 71 50 38 55 87 110 115 109 96 72 47 37 48
8515 48 64 79 104 150 199 223 213 187 162 140 118 104 111 136 163 170 153 123 95 74 51 21 -3 0 36 85 120 126 108 80 60 57 73 102 131 146 144 132
8498 132 120 107 82 41 2 -12 1 26 44 50 50 49 54 63 69 65 57 56 55 34 -2 -25 -8 34 67 77 84 107 138 159 159 140 108 80 73 96 130 151 151 142 134 125 113
8480 113 101 93 89 89 95 108 124 136 142 150 159 162 154 140 132 140 158 175 186 193 198 195 187 185 192 197 188 170 163 169 175 172 175 193 213 208 180 161 172 199 214 204 180 154 126 102 95 113
8459 113 152 194 230 260 285 303 309 309 312 315 300 259 209 178 170 168 162 164 188 220 235 220 187 147 109 80 66 66 71 73 72 76 92 119 143 153 143 130 132 149 166 172
8441 172 172 174 181 189 193 192 190 194 209 228 239 235 226 219 218 222 234 250 258 248 222 185 142 97 57 32 22 17 10 2 -4 -4 10 42 78 91 74 45 31 42 66 83 86 74 57
8421 57 46 54 82 119 152 178 192 188 165 134 118 123 139 152 164 183 204 213 209 197 184 166 142 117 103 103 116 137 158 171 179 185 191 194 196 194 185 164 144 140 151 158 153
8403 153 146 156 177 197 209 217 220 216 214 226 249 264 259 233 202 177 166 164 157 138 120 124 149 169 169 154 141 133 127 114 93 70 63 88 139 185 199 181 157 149 162 191
8384 191 226 256 272 276 280 288 287 265 221 174 139 121 109 89 66 54 64 88 109 118 117 107 89 65 46 40 50 65 77 84 88 91 88 79 73 80 92 91 73 55 57 75 94
8366 94 109 131 160 177 173 163 172 204 229 222 189 155 138 132 131 127 111 69 13 -20 -5 42 81 89 74 53 36 36 70 133 191 213 201 183 176 184 198 208 200 169 125
8348 125 83 52 41 55 85 107 102 82 69 68 75 90 119 151 167 172 184 207 220 208 182 154 124 96 85 98 117 125 123 129 143 158 169 177 176 165 149 133 114
8331 114 85 61 67 105 154 190 198 187 176 192 235 274 276 245 212 196 183 156 123 98 89 87 86 79 59 30 10 16 42 69 77 73 76 103 146 178 174 141 110 98 97
8313 97 91 82 84 101 122 136 138 126 101 70 47 41 47 50 41 26 23 48 101 155 179 163 132 120 132 143 129 95 65 51 43 29 12 1 0 10 31 55 68 65 61 74
8295 74 94 98 79 56 49 56 72 102 139 167 171 167 179 208 235 241 230 215 205 205 205 191 157 118 96 100 119 141 156 153 125 85 57 56 74 93 109 122 134 140 140 140
8277 140 138 133 129 132 145 164 181 187 179 161 143 134 134 142 153 158 151 133 115 108 108 113 125 149 176 192 194 193 202 221 237 239 225 203 184 176 184 204 228 248 265 283 299 300 270
8257 270 215 160 130 132 151 169 174 163 138 103 69 44 32 26 20 15 21 41 63 69 54 33 25 36 56 74 88 104 122 139 152 163 180 198 200 173 125 83 60
8241 60 43 19 -3 -11 -1 9 11 9 12 29 65 114 149 146 117 97 100 108 101 93 100 113 111 99 101 119 126 102 69 62 82 106 116 117 122 131 139 146 163 195 234 261 260 233 200
8221 200 181 188 218 257 284 277 234 182 152 153 170 181 176 157 132 110 97 90 90 95 108 129 152 176 199 218 225 217 194 162 129 110 115 133 145 145 149 175 208 221 200
8203 200 165 140 130 127 129 138 146 139 105 55 14 1 15 41 65 80 86 83 77 75 85 98 107 107 101 90 78 72 81 103 127 149 173 197 208 199 176 149 120 91 80 98
8185 98 135 160 160 150 143 137 116 78 38 16 20 47 79 98 97 87 81 86 101 122 142 152 139 110 79 54 33 12 -1 -2 3 3 -6 -19 -27 -28 -17 4 33 65 102 145
8167 145 189 218 228 227 225 219 203 184 176 185 199 211 221 232 239 232 210 183 167 164 169 174 181 193 209 220 223 220 215 204 183 152 122 98 82 76 80 94 110 125 137 147 161
8148 161 184 215 234 225 195 172 170 177 176 159 128 83 29 -13 -24 -3 38 85 132 169 196 210 212 194 162 139 143 163 172 162 150 150 165 188 214 231 218 171 113
8131 113 68 41 30 33 44 51 45 37 39 51 61 70 91 122 143 145 138 141 151 155 148 148 174 220 257 261 228 185 160 162 176 179 156 114 70 38 22 17 21 29 37 42 50 70 97
8112 97 123 145 164 181 191 198 208 223 230 218 191 165 143 127 123 137 167 200 226 239 238 227 211 194 174 147 121 100 80 60 54 75 117 153 169 167 153 133
8095 133 123 130 143 143 134 138 157 170 168 168 181 195 197 196 205 212 203 187 185 193 192 179 169 172 174 167 160 162 170 174 178 189 210 241 280 319 338 328 300 275 259 238 199 148 107 89
8075 89 90 94 94 94 99 111 130 155 173 170 139 101 75 71 81 101 126 144 143 130 120 118 117 118 124 125 104 62 28 24 46 72 91 102 99 86 74 78 88 92 85 70 45 7
8056 7 -34 -62 -71 -76 -84 -91 -81 -49 -3 34 40 11 -32 -60 -58 -35 -6 13 24 33 51 80 102 100 88 90 105 105 76 38 22 30 44 55 68 82 90 88 86 85 76 57 38 29
8037 29 28 29 30 34 39 40 38 46 64 82 83 66 43 28 26 32 43 59 79 99 119 148 183 212 223 221 219 226 230 222 207 191 176 161 147 140 138 134 127 120 120 127 145 174 200 201 177
8017 177 144 124 116 111 109 121 147 172 180 165 132 88 39 -2 -30 -43 -38 -11 36 92 142 185 222 257 282 295 294 279 246 197 145 102 72 53 47 52 64 76 91
8000 91 115 152 189 212 212 189 147 96 54 36 37 38 24 0 -17 -13 16 61 106 140 164 185 199 199 190 188 198 206 193 171 167 190 222 248 265 274 271 250 216 177 139
7982 139 105 75 49 28 18 31 63 99 123 141 159 174 176 163 143 115 82 53 42 43 40 31 32 51 72 79 77 75 75 71 63 56 47 35 26 37 72 116 147 154 149 147 159
7964 159 178 194 199 196 189 175 152 115 73 38 26 44 83 121 144 148 140 125 108 97 105 132 164 184 191 190 182 161 132 114 117 123 111 88 82 104 131 137 124 115 115 117 118
7945 118 123 134 148 170 200 223 220 195 163 133 102 80 88 119 141 137 126 132 149 157 155 155 156 151 143 145 149 132 88 39 9 6 19 35 47 59 83 122 161 186 198 206
7927 206 208 192 164 140 122 103 89 95 119 134 127 112 111 127 152 180 211 233 234 215 188 164 152 161 189 225 258 281 285 262 221 188 174 164 140 104 76 58
7910 58 45 39 52 80 104 106 86 58 45 65 114 161 176 165 157 163 165 150 126 105 82 46 2 -27 -28 -12 -2 -11 -25 -18 15 56 81 82 74 72 82 104 132 156 167
7892 167 175 191 209 215 205 197 204 218 219 199 168 138 119 116 124 136 149 164 187 215 243 263 269 265 261 262 258 238 207 183 178 178 162 131 105 97 106 119 126 124 116 110 111 120 136 157
7872 157 172 172 157 138 124 114 110 117 138 160 161 133 91 63 64 81 93 98 109 133 151 147 132 128 139 147 139 123 110 93 66 39 29 45 86 138 173 165 123 88
7855 88 79 80 69 59 69 91 100 95 90 79 42 -16 -62 -70 -53 -28 4 50 100 139 161 168 158 133 106 92 93 108 136 165 173 149 104 63 42 42 54 65 64 54 50
7837 50 62 86 106 114 109 98 93 106 132 156 163 160 157 162 178 207 249 288 310 310 289 249 191 123 59 14 0 19 60 104 142 177 209 225 220 201 175 143 110 96
7820 96 115 150 177 194 215 240 250 242 228 221 216 210 205 196 173 136 96 64 45 40 48 61 68 74 88 102 92 55 16 6 29 64 90 94 81 67 68 79 81 67 53 51
7802 51 54 54 58 77 103 114 110 104 110 124 139 149 146 123 92 73 76 94 113 126 135 139 136 125 110 92 73 52 34 29 45 77 103 110 102 91 83 76 71 67 53 24 -3 -5 28
7782 28 81 131 164 175 158 122 83 51 27 15 17 24 17 -8 -29 -18 24 79 124 154 169 172 176 188 199 193 170 148 143 153 163 167 167 162 149 126 100 85 97 133
7765 133 179 213 224 215 196 175 155 135 112 85 59 45 50 70 93 109 116 124 133 138 127 105 93 103 128 142 128 94 64 57 74 107 142 170 187 195 195 192 190 190 181
7747 181 158 129 111 113 122 123 115 111 120 132 135 132 136 149 158 145 109 66 29 4 -13 -25 -21 1 37 67 78 80 93 131 181 222 243 247 241 228 209 197 200 217 225 205 160
7729 160 110 74 58 59 75 105 132 137 116 96 101 131 161 176 184 195 202 195 178 166 170 184 194 197 200 211 230 252 269 277 270 244 199 152 125 129 144 144 123 101 94 97
7710 97 94 81 67 62 63 65 67 68 65 55 46 43 44 44 40 36 36 38 41 43 44 45 50 67 100 134 147 129 95 72 69 79 87 89 90 99 121 149 168 166 145 120 105 102 96 78 48 16 -5
7689 -5 -5 18 59 101 133 158 180 195 196 187 175 165 154 145 140 138 133 127 134 160 188 195 174 141 113 96 91 93 95 89 74 58 39 12 -15 -26 -7 24 48 58 60 60 58 61 67
7670 67 63 33 -9 -29 -10 28 57 68 70 68 53 27 1 -16 -27 -36 -43 -40 -25 -2 25 48 59 56 42 18 -17 -69 -120 -153 -162 -163 -165 -157 -119 -55 10 63 110 162 210
7652 210 236 237 224 206 178 138 91 44 7 -8 1 30 62 91 121 155 183 198 202 207 217 230 243 252 256 258 263 273 277 261 224 184 162 162 166 149 108 70 64 88 112
7634 112 118 114 115 119 123 130 144 152 144 131 133 149 158 149 135 135 154 192 238 274 289 297 318 347 350 309 253 214 190 156 114 90 91 99 92 78 72 77 84 86 86 91 109 145 189 225
7614 225 243 244 235 217 194 175 166 164 166 170 179 190 201 205 190 151 107 92 121 164 182 166 145 148 172 202 229 247 251 247 248 261 273 266 240 216 213 227 246 262 279 301
7596 301 325 340 342 333 321 310 295 273 247 225 214 215 212 188 139 89 72 103 156 192 195 171 139 111 93 86 86 80 65 47 44 68 111 153 177 185 196 218 238 233
7579 233 194 140 95 73 70 76 87 101 118 132 136 127 113 103 103 112 129 151 172 185 188 188 185 167 130 86 58 48 44 35 28 32 45 65 85 97 94 80 68 65 64 57 50 57
7560 57 79 101 113 121 138 159 163 142 108 82 68 57 39 24 22 38 61 77 77 67 59 60 71 87 105 123 137 138 125 110 105 112 127 141 146 140 132 143 182 222 228 194
7541 194 155 146 164 184 187 179 171 169 174 187 203 207 187 152 118 98 93 96 95 83 66 66 93 138 178 204 223 241 247 236 215 201 195 190 182 176 172 158 130 102 91 100 116 130
7522 130 142 151 156 162 171 177 169 146 123 111 105 94 75 57 50 56 64 65 63 70 91 112 112 89 62 47 38 26 13 16 44 85 114 112 88 67 62 67 68 68 84 113 131 122 97 82
7502 82 84 98 116 137 154 160 155 148 141 130 113 100 94 86 68 47 35 33 28 18 15 36 76 110 120 113 114 135 158 163 155 158 179 201 207 196 178 161 155 170 202 227 225 201
7483 201 179 168 157 141 126 125 134 145 157 169 175 169 151 131 118 122 146 183 214 219 198 172 159 158 160 158 159 173 193 202 189 161 141 140 152 160 156 141 124 119 135 174
7465 174 220 250 255 247 249 267 285 283 259 227 208 203 193 167 131 106 102 106 107 102 94 81 64 58 82 131 179 202 204 201 202 204 208 214 215 199 163 125 103 100 100 83 51 23 21
7445 21 45 79 103 112 109 95 75 59 57 74 98 110 100 77 60 62 73 80 87 106 134 143 116 75 57 74 99 111 116 128 148 159 156 148 146 149 155 161 170 179 176 157 131 120
7426 120 136 164 189 210 229 233 199 138 96 106 150 179 171 152 150 160 153 120 78 49 27 0 -29 -37 -9 40 91 133 163 178 170 148 133 132 133 125 106 82 48
7410 48 4 -41 -74 -88 -94 -105 -122 -136 -138 -128 -111 -87 -46 13 72 104 102 91 87 85 81 81 97 115 115 100 93 103 115 115 107 104 102 84 49 16 5 17 33 40 54 92
7391 92 144 177 169 142 128 131 129 109 83 61 39 14 1 13 48 84 105 114 114 109 100 91 84 77 62 38 12 -4 -5 1 10 21 40 69 102 132 158 173 173 161 148 143 143
7373 143 138 122 97 65 37 20 19 29 43 58 75 95 115 133 145 153 159 165 162 149 138 143 163 179 186 193 203 202 180 147 124 113 104 91 79 70 56 34 16 15 32
7355 32 54 70 74 68 65 78 104 128 132 118 108 118 142 157 152 149 174 225 273 293 280 236 171 105 66 64 83 101 113 124 122 97 61 40 45 62 72 74 72 74 85
7337 85 103 115 108 89 78 84 95 100 99 95 89 79 72 70 73 83 105 134 147 129 93 69 69 84 91 80 58 46 61 95 123 131 129 136 158 179 187 178 161 146 140 140 143 150 159 163
7317 163 146 107 66 48 51 54 48 37 21 -7 -41 -49 -8 65 126 143 126 108 113 139 173 207 233 232 198 145 101 79 70 60 49 43 43 47 56 74 93 105 107 103 94 79
7299 79 59 37 17 4 6 29 64 98 125 148 165 173 176 172 159 136 114 109 121 135 138 129 116 108 107 109 109 112 135 182 227 240 225 213 216 218 200 167 131 91 47 17
7281 17 22 54 79 80 67 58 55 51 43 36 27 8 -19 -44 -55 -54 -51 -55 -64 -69 -66 -59 -51 -37 -11 24 57 77 86 92 102 115 126 126 113 98 95 108 130 149 160 165 166 162 158 161 172 174
7260 174 155 127 119 142 166 152 100 48 24 19 13 10 28 72 117 145 162 180 200 206 193 174 164 168 178 183 181 177 173 170 163 149 131 112 90 58 17 -18 -34 -24 -3
7242 -3 13 28 51 81 106 116 113 101 86 70 59 63 85 114 130 122 99 82 84 92 85 64 49 54 68 71 55 39 47 90 153 205 224 215 205 208 212 199 174 157 157 160 147
7224 147 117 81 54 42 40 32 7 -23 -39 -31 -14 -12 -32 -63 -87 -94 -81 -49 -11 18 24 5 -21 -32 -19 7 31 56 89 126 154 166 170 175 171 156 137 127 119 101
7206 101 81 77 100 134 159 165 152 132 118 120 134 141 125 92 63 53 56 60 59 55 48 35 20 15 36 85 142 178 183 170 155 147 147 151 154 153 151 151 159 175 194 205 198 169 126
7187 126 85 60 51 54 59 59 49 34 24 25 36 50 62 62 44 12 -14 -18 5 48 101 155 196 205 181 147 127 127 130 122 106 97 98 105 113 125 145 168 188 205 221 232
7168 232 227 203 167 141 136 152 173 179 159 121 86 65 52 34 12 2 13 39 72 113 161 198 210 197 175 158 144 130 112 86 54 25 11 8 -2 -30 -56
7152 -56 -60 -46 -31 -25 -16 5 36 62 79 90 96 92 74 57 54 64 70 61 48 47 55 49 20 -10 -16 6 32 38 25 8 2 5 5 -9 -34 -51 -47 -33 -30 -43 -56 -50 -28 -2 21
7133 21 41 49 38 16 6 22 60 106 144 161 152 125 101 100 115 118 88 35 -8 -18 0 35 76 116 143 147 132 116 107 99 93 102 133 163 163 133 102 90 93 97 95 88
7115 88 78 77 97 129 150 148 140 150 176 193 189 169 147 129 118 117 118 111 100 102 120 135 131 110 89 73 53 30 14 13 17 15 8 3 1 -4 -11 -15 -9 1 6 8 11 19 27 37 51
7094 51 65 67 53 36 34 50 72 93 112 128 135 133 133 143 163 186 204 215 217 211 201 190 183 181 185 186 183 183 200 228 242 228 199 176 164 152 137 125 114 98 83 81
7076 81 92 109 123 133 126 93 50 29 45 74 90 90 89 88 75 46 16 0 4 23 45 62 68 71 79 91 99 100 98 100 107 120 141 165 181 183 174 163 156 152 143 123 105 109 139
7057 139 173 185 179 179 200 231 251 255 250 250 266 294 317 316 296 282 283 277 240 181 127 97 88 94 105 114 118 126 145 164 171 171 181 203 220 219 212 210 216 227 247 269 277 260 235
7037 235 227 240 246 233 218 221 235 229 182 109 45 11 8 21 32 33 26 25 39 62 82 90 93 98 99 86 59 36 32 45 67 83 84 66 42 36 56 90 115 124 120 115 118 140
7018 140 182 225 246 242 231 228 233 235 228 212 188 170 170 190 213 219 204 175 148 134 138 148 148 133 122 134 159 170 157 139 132 129 114 92 80 83 93 100 104 106 106 106 106 104
6999 104 102 107 126 154 175 178 169 156 141 127 121 130 149 172 190 195 179 153 144 168 210 240 241 216 176 131 93 82 107 155 199 217 208 191 182 180 169 146 132 148 184
6981 184 207 202 181 162 151 148 156 174 193 208 221 234 236 221 191 156 128 110 111 128 150 163 164 164 167 175 190 213 235 245 237 217 190 158 122 92 78 82 102 132
6964 132 161 174 166 145 129 128 137 140 127 101 78 70 72 74 70 62 56 50 43 37 31 27 26 27 29 32 31 28 27 28 31 24 1 -30 -53 -60 -58 -54 -46 -30 -13 -9 -14 -14 1 25 49 70 82 78 62
6942 62 59 86 128 151 139 113 102 115 138 150 147 136 123 107 87 74 74 86 101 123 161 208 238 238 214 186 161 138 117 99 75 42 18 26 58 86 95 95 103
6925 103 114 115 109 106 113 125 133 132 120 96 69 48 37 37 47 57 52 27 3 0 14 23 8 -21 -42 -41 -22 0 17 31 46 66 94 121 137 137 132 141 177 230 273 288
6907 288 277 249 209 161 116 85 74 74 76 81 86 83 65 41 35 56 86 99 91 78 78 90 106 118 129 142 157 170 171 157 134 113 101 96 100 117 142 158 148 125
6889 125 114 131 160 177 171 157 149 142 120 81 41 19 17 28 45 69 90 92 79 70 75 74 50 20 17 49 90 119 142 167 188 192 183 170 152 133 124 138 160 166 154
6872 154 143 147 153 145 117 83 56 45 48 57 68 86 119 165 208 237 253 258 248 220 181 145 121 116 130 152 163 151 124 105 104 112 109 92 75 69 72 69 56 41 37 51
6853 51 88 142 192 212 196 169 160 172 187 199 212 229 236 229 221 224 231 234 239 250 250 218 162 115 100 111 120 111 83 45 13 -2 1 19 41 63 77 78 75 79 97 119 136
6835 136 152 171 187 187 165 131 97 72 58 59 81 117 153 176 183 183 190 204 215 212 184 136 86 58 62 81 90 83 73 71 73 73 70 69 68 64 56 46 44 56 85 125 161 186
6816 186 197 188 152 99 59 48 60 76 89 102 112 120 134 161 192 212 217 215 211 208 211 222 223 200 165 143 140 137 126 124 142 163 167 155 140 124 103 88 88 100 111
6798 111 118 124 124 110 89 77 75 66 51 51 76 107 123 127 133 140 134 116 99 91 90 95 118 165 214 239 230 205 187 180 169 143 110 89 85 89 93 100 113 126 129 124 120 116 102 81
6778 81 65 65 76 88 100 116 135 150 157 158 149 125 93 63 43 35 44 67 89 97 90 84 85 85 81 85 106 128 132 121 116 116 103 74 52 53 64 65 62 77 105 122 118 110 107 98 70
6758 70 39 26 35 38 20 -11 -31 -28 -10 7 16 21 29 43 67 99 134 160 172 171 163 151 145 157 192 227 233 202 159 133 126 124 120 122 134 145 147 146 151 158 154 136 119 115 121 127
6738 127 137 157 183 201 203 196 188 172 140 102 79 82 97 104 103 108 132 173 209 215 189 155 143 160 186 202 209 217 228 232 228 220 213 205 198 196 204 219 229 221 185 126 71 43
6719 43 41 48 54 64 78 84 76 64 64 75 88 99 112 127 141 147 145 137 122 103 86 76 70 63 51 34 10 -15 -33 -34 -17 8 34 61 95 129 150 145 122 98 88 91
6700 91 95 89 74 64 67 78 79 63 41 32 38 47 54 68 90 105 103 93 96 119 150 177 198 208 197 165 124 91 73 67 67 66 59 46 39 47 64 82 96 103 93 63 29 17
6681 17 33 59 77 82 77 59 32 12 12 22 25 21 31 60 84 85 77 87 120 155 175 186 198 208 206 195 191 197 201 191 170 142 111 79 52 36 28 28 34 45 53 57 60 71
6662 71 91 111 126 130 126 126 144 177 199 187 152 136 160 213 263 287 283 257 231 220 224 226 219 216 228 241 231 196 153 117 87 62 39 16 0 2 32 66 72 50
6645 50 34 50 92 132 156 161 147 123 104 100 103 103 98 90 80 72 82 117 161 197 216 218 192 143 96 78 86 98 103 103 98 89 92 125 173 204 212 218 233 241 233 220 209 187
6626 187 152 125 123 132 145 176 228 266 253 206 177 183 192 180 162 164 190 228 260 267 235 176 126 104 96 84 77 92 119 126 99 57 24 6 0 0 9 33 71 113 147
6608 147 166 173 176 170 147 110 70 37 14 2 6 25 52 77 101 127 156 181 196 205 221 253 288 298 264 196 129 90 82 93 109 123 127 114 91 76 82 109 137
6591 137 154 158 157 157 157 151 133 97 46 -2 -31 -42 -54 -78 -101 -97 -60 -5 44 77 86 74 45 9 -22 -39 -35 -12 20 53 81 106 130 148 155 144 116 84 65
6574 65 69 87 110 133 157 181 195 192 169 130 90 66 60 60 52 38 35 51 83 118 144 154 151 150 164 185 195 180 146 110 80 61 54 59 71 86 106 139 186 236
6557 236 270 275 245 197 158 149 167 185 172 124 62 13 -7 -8 -2 3 11 23 40 62 86 106 116 120 128 142 152 148 132 114 108 110 114 115 111 106 98 84 65 49 38 32 36 61
6538 61 111 169 212 230 234 233 224 203 173 144 118 99 90 91 97 104 119 137 138 106 55 25 41 81 109 115 114 116 112 95 73 55 35 2 -33 -40 -2 62 118 141 131 93
6520 93 44 7 0 20 43 50 40 20 5 7 39 86 123 136 140 154 173 181 172 161 156 158 172 206 248 269 249 198 142 100 82 87 110 137 153 156 151 137 116 88 64
6502 64 48 40 39 47 64 89 118 148 169 173 160 140 124 118 121 129 133 134 134 142 158 174 180 176 160 133 96 56 27 12 8 19 46 79 93 75 43 28 37 49 45 35 37 52
6483 52 69 75 68 54 37 26 28 41 60 79 97 111 122 136 152 162 161 158 165 180 188 188 192 203 208 204 201 206 205 185 155 139 141 143 128 99 72 50 25 -2 -21 -16 11 42
6464 42 62 84 129 197 252 263 236 196 163 137 115 102 102 106 104 95 88 96 120 155 187 203 195 166 131 107 106 116 114 92 70 70 88 105 115 123 130 130 123 125 141 154 151
6445 151 133 112 89 68 59 66 78 84 94 123 170 211 225 213 191 168 147 123 92 52 19 8 21 44 61 68 68 69 79 102 125 132 124 115 112 114 121 147 193 240 256
6427 256 235 192 140 86 38 10 4 8 13 26 58 97 119 110 82 53 32 19 13 17 33 56 85 120 166 215 249 253 233 210 204 211 212 196 168 138 114 98 94 99 104
6409 104 102 98 97 98 98 99 105 114 121 119 106 82 53 25 6 0 2 9 19 30 41 54 71 84 82 70 65 75 86 83 76 81 94 97 84 64 49 38 35 49 73 81 57 23 12
6390 12 27 45 48 43 41 39 33 25 23 27 30 29 26 24 31 50 75 94 100 98 93 90 95 117 150 172 168 148 135 132 128 122 125 145 164 164 142 115 103 115 146 176 184 161 121 83 56 38
6369 38 31 39 60 77 82 82 94 117 137 140 129 119 123 143 177 222 266 292 290 270 253 251 262 272 274 256 212 146 82 46 44 60 80 99 115 122 117 102 83 67 59 60
6351 60 64 58 39 20 13 14 13 12 26 63 112 148 158 144 117 88 60 32 2 -29 -50 -43 0 62 114 137 138 139 149 158 159 159 166 179 193 207 219 223 219 213 213 208 183 144
6332 144 107 73 34 -6 -30 -30 -24 -30 -39 -28 4 41 67 80 84 76 60 46 32 5 -41 -91 -121 -122 -105 -85 -64 -38 1 49 89 106 101 91 86 80 63 42 30 29
6315 29 26 10 -13 -26 -15 14 46 65 69 68 69 73 73 70 70 78 85 84 75 66 61 56 53 55 58 52 37 25 28 40 49 50 49 46 36 20 14 30 61 89 107 111 99 82 81 114 164 192 179
6293 179 144 115 102 97 94 98 109 121 119 102 78 60 55 57 58 58 65 78 86 86 85 98 125 156 181 195 197 189 178 176 194 226 254 264 254 238 231 232 222 190 145 113 108 122
6274 122 141 159 175 187 190 179 156 133 121 125 134 138 132 117 93 63 41 43 73 109 132 138 139 138 134 129 137 161 191 211 222 236 259 279 277 245 195 146 109 80 58
6256 58 50 57 59 37 -6 -42 -47 -26 -2 15 38 70 97 102 87 68 58 57 62 67 67 70 81 96 98 78 58 58 72 72 50 32 45 83 122 151 175 196 209 216 221 222 209
6238 209 181 150 127 108 88 73 68 66 54 33 14 0 -15 -25 -19 2 21 15 -12 -37 -37 -16 6 20 33 58 89 109 108 97 89 90 97 111 130 146 140 113 89 93
6220 93 129 171 191 186 169 152 139 131 133 145 159 169 178 194 216 233 242 239 223 194 164 145 136 118 82 43 23 28 48 70 86 90 83 77 79 81 64 25 -20 -58 -77 -68
6202 -68 -27 27 62 63 46 41 59 89 123 161 201 233 251 253 245 233 222 208 188 164 145 136 128 109 82 65 73 99 125 138 135 121 102 84 70 68 84 118 152 169
6185 169 165 154 149 147 141 134 141 164 180 168 135 111 112 128 139 145 155 167 165 143 125 134 172 219 252 258 235 197 167 165 186 200 182 140 98 73 58 39 16 0 -8
6167 -8 -21 -42 -52 -36 0 30 47 61 80 94 91 76 62 50 36 22 18 22 19 12 17 46 87 116 118 100 78 67 66 63 45 10 -32 -74 -104 -112 -92 -60 -40 -38 -31 -6
6149 -6 19 15 -17 -51 -59 -48 -33 -13 21 67 98 96 70 42 27 20 13 0 -18 -37 -45 -29 15 72 116 133 127 107 82 62 64 89 123 148 160 172 189 202 201 193 196
6131 196 217 242 242 207 157 123 116 121 128 144 174 206 213 191 155 123 96 77 70 74 81 95 125 168 201 212 217 236 266 285 282 266 242 211 175 147 126 104 76 53
6114 53 42 46 65 95 125 140 134 121 118 128 145 161 170 167 159 155 159 159 144 120 108 118 140 159 164 156 143 135 138 145 143 128 105 87 92 128 184 229 240 225 212 215 222 218 198
6094 198 174 158 156 166 177 181 177 172 161 137 104 78 74 87 106 122 132 141 154 168 171 155 126 104 98 100 101 99 96 90 89 113 161 206 219 205 190 185 172 145 120 108
6076 108 102 87 71 70 85 104 117 126 134 138 132 116 97 92 109 140 163 159 129 91 66 58 60 62 66 83 121 173 226 264 274 255 223 207 220 248 263 260 253 254 255 251 243 238
6057 238 233 224 218 219 223 230 244 265 277 268 244 225 218 218 211 193 163 121 72 25 -10 -30 -32 -19 -2 11 20 27 37 56 88 122 136 118 82 54 39 27 12 3 9 32
6039 32 60 82 89 78 62 51 43 31 19 20 42 74 104 125 132 122 100 80 72 78 96 117 127 112 75 32 1 -11 -2 27 61 76 75 88 135 193 223 218 201 185
6021 185 161 124 93 87 106 130 143 142 136 136 142 148 145 139 137 138 137 136 140 146 148 152 171 197 203 178 147 137 143 137 105 64 36 35 57 89 110 106 86 78 91 116 136 151 169 191
6002 191 212 227 228 213 183 152 123 91 56 35 43 75 110 139 164 184 186 168 145 134 130 122 105 87 80 95 136 186 216 204 165 135 135 158 186 205 203 172 126
5985 126 96 103 138 173 194 203 203 190 169 151 143 131 106 72 45 37 45 63 83 103 120 137 153 167 174 171 160 141 120 103 96 99 99 84 59 42 48 67 74 64 57 66
5966 66 76 64 34 12 17 38 61 85 113 137 146 137 112 79 50 40 62 107 159 200 222 217 188 147 114 91 74 61 58 65 62 38 4 -11 1 29 52 61 65 72
5949 72 84 103 129 154 168 161 136 106 84 79 87 97 101 102 112 136 163 175 169 158 154 158 164 166 164 154 133 101 67 43 32 27 25 32 57 91 112 110 97 88 82 73 67 73 85
5930 85 79 48 17 11 36 76 113 136 137 120 104 107 131 158 171 168 153 135 124 121 122 114 102 94 98 110 127 143 152 153 154 168 195 228 261 288 293 264 222 200 205 210 197
5911 197 179 172 166 141 99 66 61 80 107 121 107 66 27 16 34 66 100 134 156 153 137 136 157 179 186 185 182 170 139 104 85 85 96 111 129 140 138 128 121 119 115
5893 115 111 110 107 97 85 82 93 114 137 155 157 149 145 150 147 124 92 79 85 96 104 118 134 137 127 124 139 155 154 145 150 171 194 209 218 220 212 191 158 120 91 87 107 135 146
5874 146 132 109 98 106 115 106 78 50 36 25 0 -31 -41 -21 11 41 66 90 114 139 171 207 236 250 256 255 239 208 178 162 159 156 151 149 153 166 184 197 196 196 216
5856 216 249 262 253 263 320 398 461 518 595 691 796 938 1164 1493 1957 2615 3438 4163 4406 3999 3168 2322 1703 1300 1012 792 635
5844 635 526 449 401 370 337 301 277 267 248 209 170 150 139 125 110 100 85 60 42 49 73 97 115 127 129 114 96 92 105 124 135 136 127 114 108 119 143
5828 143 160 155 134 108 84 60 38 26 27 34 37 39 58 101 145 168 174 183 201 214 209 194 185 188 198 202 188 142 71 0 -46 -58 -49 -32 -14 9 42 73 84 71 59
5810 59 70 90 89 65 52 67 88 86 69 64 69 66 56 62 89 113 112 94 83 88 100 106 97 77 59 52 52 47 42 54 89 128 151 161 167 173 173 172 178 186 186 174 164 168 178 180 166
5790 166 145 127 115 101 86 78 80 86 97 121 164 208 226 211 184 163 153 151 162 182 191 167 114 59 25 15 16 19 23 28 31 20 -12 -54 -86 -96 -99 -111 -127 -125 -106
5772 -106 -94 -105 -126 -126 -92 -38 12 45 58 56 49 53 69 85 89 82 77 87 108 128 136 134 131 133 137 135 129 122 117 111 100 89 87 90 93 93 97 109 118 111 86 58 44 50 68 85 93 101
5751 101 115 133 141 134 119 111 111 113 112 108 106 107 112 116 114 106 106 123 146 148 119 76 50 48 60 76 101 139 182 213 227 228 228 227 221 205 178 146 121 111 116 127 134 133 125 111 94
5731 94 82 70 52 27 10 17 47 80 104 122 132 129 107 80 64 62 67 71 74 77 81 89 97 101 100 105 120 133 133 124 114 104 92 85 98 123 135 120 92 73 74 97 135 177
5712 177 210 224 224 214 197 180 167 155 136 115 107 116 125 119 112 123 153 188 217 238 249 244 223 195 173 171 195 234 260 257 234 212 199 186 169 154 149 151 156 156 140
5694 140 103 53 12 -4 1 25 54 74 71 49 32 38 69 113 152 172 168 148 126 110 99 91 82 78 85 109 138 150 136 111 101 106 110 102 93 96 103 98 76 45 21 16 39
5676 39 83 124 141 141 141 150 154 147 137 136 148 161 167 165 159 151 144 140 136 126 110 103 118 150 179 194 199 199 186 154 119 106 117 131 130 114 92 69 47 36 48 83 131 179
5656 179 216 238 246 243 225 196 175 180 203 218 209 193 188 191 184 161 136 124 125 125 114 97 92 106 122 113 70 12 -32 -55 -53 -27 10 38 47 58 92 140 175 188 199
5639 199 219 237 236 217 188 148 105 78 83 107 122 113 91 65 34 -1 -28 -27 -1 29 49 68 104 152 185 185 157 123 99 94 116 166 223 256 254 241 252 293
5622 293 341 360 340 305 291 309 329 319 277 231 203 189 182 178 174 155 118 80 60 60 65 63 56 49 43 37 33 35 41 47 53 57 59 64 79 100 116 121 111 82 34 -19 -53 -48 -13
5603 -13 24 45 52 51 48 40 31 24 18 14 14 19 30 46 60 57 31 -5 -24 -8 23 39 32 20 22 39 65 102 143 167 155 119 84 61 39 14 -1 7 37 69 84 84 80
5584 80 84 96 103 93 68 43 33 45 67 75 56 25 11 28 62 83 79 59 38 26 27 39 55 69 80 83 72 53 42 49 59 62 66 90 122 129 97 49 15 5
5567 5 18 50 92 125 135 122 96 56 8 -28 -36 -21 -2 12 23 37 51 61 64 53 31 13 8 7 -1 -18 -30 -24 -2 28 56 62 37 -1 -29 -45 -64 -93 -113
5550 -113 -114 -103 -97 -89 -66 -24 20 46 49 43 42 53 64 62 44 20 3 -4 -8 -18 -44 -85 -121 -131 -113 -90 -79 -78 -72 -58 -42 -31 -29 -36 -49 -57 -50 -30 -12 -4 -1 14 49
5531 49 91 123 136 129 108 73 37 22 45 96 145 172 181 178 162 130 88 54 38 39 55 80 110 136 147 138 113 86 70 67 73 78 72 54 29 7 -4 -1 13 37
5514 37 64 87 98 98 97 106 126 147 158 150 126 92 62 51 76 134 203 247 250 223 187 150 110 74 56 68 100 134 162 184 204 224 241 252 258 260 262 263 266 266 250
5496 250 214 168 127 94 55 7 -29 -29 3 40 63 76 92 114 139 159 162 140 104 77 66 56 35 15 7 14 25 36 45 49 47 48 61 83 106 131 157 177 183
5479 183 181 180 176 162 144 133 128 125 127 145 176 202 206 190 160 125 98 92 107 127 144 163 193 232 267 281 269 242 216 198 180 156 129 117 122 128 122 107 90 78
5462 78 73 71 67 62 65 82 105 121 130 141 154 155 141 124 114 111 114 127 151 170 172 155 123 80 35 6 5 16 21 20 30 49 60 53 43 42 52 69 92 115 125 116 104
5443 104 108 129 154 168 172 166 147 116 90 86 109 141 162 168 171 178 187 197 209 224 233 233 231 235 236 226 208 191 174 150 131 136 173 216 234 220 189 161 147 150 167 184
5425 184 189 183 170 153 125 87 51 32 38 58 75 75 52 17 -12 -21 -7 21 56 86 102 101 89 79 76 78 80 88 110 151 196 222 217 194 176 172 170 154 127 100 86
5407 86 81 79 78 83 93 109 129 155 178 191 190 179 164 153 153 164 170 156 113 59 18 2 6 5 -12 -43 -66 -68 -57 -45 -30 2 52 99 126 140 148 147 131 103 79
5389 79 61 43 32 39 65 91 100 91 76 61 47 35 25 22 37 71 108 125 116 98 90 92 89 82 83 96 112 116 111 112 129 158 191 214 222 213 198 189 190 190 178 154 133 127 130
5370 130 132 128 119 109 100 94 90 87 86 90 99 107 108 101 91 77 57 38 26 22 22 33 68 121 163 170 148 121 106 104 105 100 90 85 97 120 134 127 113 109 118 131 140 150 165 179 183
5350 183 172 152 135 135 149 158 147 124 106 95 79 56 46 58 76 73 47 23 25 55 92 115 115 99 79 64 55 52 54 52 33 -5 -40 -46 -16 32 80 121 148 152
5332 152 137 119 117 126 129 119 106 92 71 44 26 31 51 67 75 91 125 164 187 188 179 168 158 149 136 117 95 82 90 108 118 115 114 120 120 98 57 17 0 4 24 51
5314 51 77 94 99 94 86 84 92 106 110 90 53 25 22 36 55 77 108 136 138 115 86 72 67 59 47 39 33 25 22 39 72 105 120 113 86 52 31 40 71 98 114 134 164
5295 164 178 155 103 49 12 -7 -4 23 64 96 115 134 152 153 122 68 16 -16 -23 -6 22 48 68 89 118 150 180 204 220 228 233 241 247 243 234 240 271 306 316 294
5278 294 257 222 198 180 157 119 75 51 60 90 114 126 135 143 136 107 67 34 19 28 58 93 110 100 69 29 -7 -20 -2 28 39 21 -1 -6 0 10 34 82
5262 82 136 162 155 140 137 143 150 151 140 110 74 61 82 118 138 136 123 111 99 88 76 60 36 12 0 1 7 14 33 71 114 141 146 138 128 118 112 126 161 204 229
5244 229 233 228 220 205 176 141 108 76 45 26 34 65 105 141 167 183 184 167 134 91 51 36 55 93 122 138 156 181 194 180 153 142 153 169 174 166 147 122
5227 122 103 102 115 116 93 64 64 97 141 169 178 183 190 186 153 101 58 49 73 106 128 132 127 127 143 174 201 205 188 168 159 161 171 195 237 280 299 282 236 178 127 98
5209 98 100 118 134 142 143 131 93 43 15 32 75 114 137 151 156 145 121 102 100 110 121 132 140 145 150 168 201 234 253 260 267 273 273 265 255 240 213 176 140 117 113 130
5191 130 159 184 188 174 158 154 163 176 186 184 163 129 100 90 89 81 70 69 81 91 93 94 96 86 54 16 -3 5 31 65 101 134 147 130 98 83 102 139 167 168 141
5173 141 100 57 25 17 36 67 91 100 106 119 137 142 132 120 122 140 158 166 165 163 161 158 149 139 134 139 147 148 142 139 146 154 150 131 111 99 89 75 62 63 82 108 134 159 183
5154 183 200 197 170 129 88 55 33 21 21 32 49 61 58 39 17 4 3 1 -12 -34 -44 -25 19 68 97 106 114 136 168 195 201 186 161 138 117 95 78 79 109
5137 109 150 173 159 121 81 48 23 7 5 21 48 79 109 132 138 127 115 116 129 142 150 157 163 156 133 102 76 52 18 -26 -60 -57 -16 43 94 124 136 136 129 121
5119 121 119 125 137 150 160 163 160 160 173 201 235 260 266 260 257 265 280 290 282 257 225 199 181 172 166 161 153 146 139 132 129 135 152 170 174 164 147 131 118 110 113 123 118 84 33 -10
5099 -10 -39 -59 -70 -66 -47 -31 -34 -46 -47 -25 7 36 49 52 57 80 114 136 131 115 112 127 136 127 111 108 112 101 67 27 0 -9 -6 8 36 68 91 96 87 71 54 41 39
5081 39 51 76 101 115 112 97 78 56 34 20 25 44 56 46 18 -10 -27 -28 -16 0 6 3 2 15 35 45 44 44 57 81 115 155 184 179 137 85 51 37 30 35 62
5063 62 104 142 171 203 236 258 262 263 272 284 284 269 241 207 176 156 146 138 131 130 134 138 145 169 206 228 213 176 151 147 152 152 142 122 98 86 101 126 130 109 92 107
5045 107 147 183 200 198 185 169 163 167 168 151 122 101 108 142 187 224 241 241 237 236 229 206 174 154 158 181 202 204 188 170 163 167 172 176 182 184 167 131 100 97 108 105 78 49
5026 49 37 40 44 51 61 69 70 76 99 130 137 106 50 2 -17 -9 8 18 12 -3 -12 -9 -1 6 14 28 47 70 94 117 132 130 112 79 39 2 -14 -2 38 89 128 143 136
5007 136 122 108 90 63 31 9 6 20 42 64 80 84 78 73 78 95 117 137 150 156 161 177 205 231 236 219 200 202 224 244 238 200 146 103 82 78 75 65 46 17 -17
4989 -17 -47 -61 -51 -19 22 56 74 81 94 117 140 151 151 152 151 140 122 117 131 146 142 121 102 93 90 84 79 82 98 121 139 139 120 96 81 71 57 41 39 64 105 141
4971 141 161 165 155 138 120 109 109 115 117 109 90 66 47 44 63 103 149 180 187 181 178 179 174 156 126 91 59 39 32 26 7 -18 -32 -28 -16 1 35 86 130 147 144 143 148
4953 148 148 140 139 153 167 165 142 111 81 55 39 38 52 69 69 53 38 46 72 94 94 74 50 30 26 47 90 132 146 134 118 113 117 130 158 197 226 227 206 183 173
4935 173 176 189 202 207 200 191 189 192 193 191 189 187 179 165 155 157 170 188 199 198 193 200 222 237 221 184 157 155 163 161 151 143 132 113 98 106 132 154 162 170 183 188 176 164 173 200 220
4914 220 221 209 195 184 175 170 166 161 153 137 117 106 123 172 227 248 227 187 157 145 145 160 190 222 235 230 223 229 240 246 244 243 244 242 230 210 188 174 170 165 152 144 152 172
4895 172 184 180 170 162 150 133 124 131 142 139 125 117 110 89 56 39 55 96 135 157 164 170 186 212 227 214 179 148 147 177 226 276 321 355 373 368 340 312 315 348 390
4878 390 450 577 779 955 980 841 650 512 442 410 402 408 404 374 339 321 317 321 339 363 361 334 325 357 399 420 434 455 458 428 399 402 433 486 571 669
4862 669 725 734 750 790 813 835 945 1146 1345 1554 1924 2500 3220 4300 6195 8753 10697 10614 8507 5835 3937 2913 2208
4852 2208 1617 1287 1166 1019 836 776 806 756 636 588 596 546 473 493 556 545 518 594 699 699 670 763 918 1003 1098 1319 1525 1542 1510 1643
4839 1643 1834 1918 2087 2563 3147 3646 4430 5894 7840 10382 14852 22056 29490 32329 28318 20421 13493 9480 7133
4831 7133 5201 3850 3279 2896 2325 1914 1856 1768 1470 1301 1390 1392 1193 1126 1282 1330 1196 1213 1435 1510 1397 1474 1786 1954 1958 2197
4819 2197 2652 2844 2761 2911 3328 3547 3676 4347 5486 6454 7575 9937 13579 18032 25046 37479 53353 63912 61358
4811 61358 47578 32050 21703 16065 11938 8587 6765 5907 4844 3730 3282 3182 2738 2209 2149 2244 1963 1609 1664 1819
4803 1819 1622 1390 1538 1729 1569 1429 1702 1997 1927 1918 2357 2767 2731 2748 3246 3716 3817 4257 5486 6770 7810 9822 13575
4793 13575 18323 24765 36529 54572 71269 75251 63455 44657 29605 21145 15872 11478 8556 7212 6105 4738
4786 4738 3913 3770 3457 2788 2448 2522 2364 1928 1816 2025 1956 1609 1553 1775 1735 1481 1545 1846 1845 1659 1845 2262 2322 2186 2469 3003
4774 3003 3186 3310 4097 5252 6081 7200 9759 13491 18029 25715 39261 55364 64442 59821 45214 30368 20964
4767 20964 15689 11664 8551 6903 5977 4853 3834 3425 3212 2711 2256 2212 2223 1938 1659 1674 1682 1428 1217 1284 1336 1163 1052
4757 1052 1195 1295 1177 1142 1351 1486 1401 1430 1721 1921 1921 2140 2717 3228 3623 4539 6209 8230 11115 16526 24392 30885 31431
4747 31431 25687 17870 12055 8805 6639 4860 3745 3206 2707 2150 1833 1734 1556 1292 1175 1188 1125 992 941 932 829 706
4737 706 717 794 767 677 673 724 704 658 705 787 782 747 798 879 886 902 1044 1240 1411 1707 2265 2955 3762 5157 7461 9870 10799 9514
4725 9514 6959 4674 3310 2527 1918 1471 1233 1072 881 722 649 594 499 409 373 357 325 297 291 281 259 262 307 350 351 316 272 228 189
4713 189 171 173 177 180 191 208 214 201 187 175 157 133 119 119 116 104 98 111 131 148 161 177 193 204 207 195 162 119 92 93 111 127 137 148 160 164 154 131 106 93
4695 93 94 97 92 82 79 86 89 82 72 65 61 57 52 43 29 14 10 28 62 101 130 143 145 146 146 138 122 115 133 163 177 165 138 112 90 74 72 84 101 111 113 113 112 119 142 177 203
4675 203 203 186 174 170 164 147 125 105 92 94 113 140 156 159 158 163 179 206 240 259 247 213 190 191 193 169 132 114 128 156 181 206 227 233 221 205 196 186 166 148
4658 148 146 149 134 103 80 73 69 57 46 42 34 14 -1 6 36 69 94 112 122 127 126 123 116 110 116 137 149 134 102 81 76 68 53 47 56 64 57 49 59 83 103 112 120 130 146 177
4638 177 222 260 267 246 221 212 218 228 231 220 194 165 150 156 170 188 213 243 257 237 189 134 85 40 -1 -33 -49 -45 -16 35 99 157 190 196 186 179 188 211 232
4621 232 243 246 241 219 179 144 141 168 200 215 220 231 243 240 220 204 201 200 185 166 160 166 161 131 88 60 59 73 88 93 91 95 110 126 132 127 124 127 124 104 82 74 82 93 104
4601 104 114 120 119 116 122 134 139 137 133 131 127 133 163 210 244 248 230 206 180 153 136 135 143 152 163 171 159 118 71 45 44 52 59 72 90 105 116 130 145 150 146 140 132 118 105 106
4581 106 113 98 52 0 -24 -18 0 16 30 47 60 60 39 6 -18 -26 -26 -27 -25 -10 6 7 -4 0 31 67 80 72 61 55 57 73 105 144 172 185 188 187 182 183 196 210 212
4563 212 206 199 186 153 114 101 128 165 171 136 86 52 51 76 106 119 106 72 33 3 -11 -11 -4 5 23 50 77 101 131 172 202 190 140 96 92 118 143 158 180
4546 180 208 224 217 200 197 211 225 224 208 187 170 158 146 130 111 96 95 115 151 183 188 160 119 90 82 92 115 141 157 151 127 100 85 82 88 101 112 112 100 90
4529 90 98 128 164 190 198 193 190 200 227 263 292 303 293 275 261 251 240 225 214 208 201 182 158 144 148 164 179 183 172 144 105 71 56 57 62 64 65 71 85 109 142 172
4510 172 179 157 120 84 58 45 51 79 118 148 161 169 178 180 163 134 112 105 106 111 128 155 171 152 105 69 65 84 98 96 90 92 101 102 89 68 48 35 29 30 41 56 69
4492 69 77 92 120 158 187 197 195 195 199 197 181 151 116 80 46 19 4 3 8 9 7 10 18 17 -6 -43 -67 -65 -43 -15 17 49 68 69 73 101 146 181 188 173 153 135 125
4473 125 125 129 128 122 123 127 109 59 0 -30 -24 3 39 83 124 147 154 166 192 216 219 209 202 204 204 195 183 182 200 230 250 239 200 160 145 147 144 126 108 103 108 118 131 149
4454 149 164 172 173 167 151 125 95 66 40 24 31 67 112 140 139 119 105 117 163 230 291 322 325 315 306 296 281 261 240 221 208 200 192 178 152 115 67 12 -37
4437 -37 -65 -70 -58 -35 -2 33 55 53 43 44 60 73 70 54 40 42 68 110 149 165 158 143 127 110 96 89 92 95 92 91 100 120 143 161 166 155 134 114 109 116 130 145 152
4418 152 146 126 112 120 149 180 193 181 155 134 134 154 174 177 167 154 141 121 91 60 40 33 46 85 145 204 242 252 241 218 195 176 160 145 141 160 187 190
4402 190 151 89 42 27 31 43 65 103 148 183 191 168 127 91 84 107 140 163 169 171 180 199 218 223 211 194 182 171 151 125 112 120 138 152 161 167 170 163 144 118 98
4384 98 96 113 125 108 66 32 30 51 66 66 60 54 48 45 52 67 78 82 88 102 112 105 86 73 75 93 119 147 165 157 117 64 29 32 65 95 96 71 49 49 66 78 81 84
4365 84 93 97 83 52 24 12 13 21 32 50 76 110 147 178 190 178 159 147 139 120 85 55 46 53 61 67 78 97 118 135 146 154 151 129 89 52 35 43 62 77 83 86
4347 86 94 107 124 143 160 162 149 132 125 136 157 171 171 160 155 165 186 200 196 174 142 104 75 71 97 138 174 195 203 200 189 175 168 173 188 209 232 244 234 207 179
4329 179 167 167 172 174 172 164 152 139 129 121 106 84 69 77 116 168 201 198 175 162 175 209 251 287 305 298 280 269 270 271 260 239 219 207 207 214 218 203 167 132 123 147
4311 147 183 204 200 180 162 155 157 163 171 181 189 190 182 174 171 177 190 207 216 208 182 148 110 72 45 45 67 88 89 72 51 31 14 8 17 32 38 36 44 70 106 135 142 130 115
4291 115 118 136 152 151 145 146 152 154 157 171 189 195 180 162 162 188 229 263 270 250 221 202 191 176 158 147 145 150 163 187 209 207 179 139 100 63 33 29 54 91 122 145
4273 145 164 179 188 197 207 206 190 174 172 174 157 117 73 49 53 76 98 96 70 43 34 39 43 51 70 93 105 108 116 131 138 137 146 171 194 195 175 148 121 98 81 70 54
4255 54 27 3 6 34 69 95 111 124 136 145 154 166 176 181 178 166 140 104 78 75 85 82 49 4 -22 -23 -13 -7 -1 12 33 54 70 80 84 84 89 105 119 118 103 86
4236 86 71 44 4 -24 -25 -8 1 -5 -17 -15 5 39 70 83 78 72 82 108 130 136 129 123 125 133 145 150 138 109 79 71 87 109 120 117 107 94 77 58 41 27 14 8 13
4218 13 25 37 48 64 83 92 83 72 76 90 99 105 123 153 173 168 151 137 127 111 89 70 52 32 15 13 20 22 23 43 88 132 147 134 117 113 120 128 127 107 68 23
4200 23 -8 -20 -27 -46 -77 -99 -87 -31 53 135 190 214 218 212 198 174 145 122 116 134 164 192 203 197 178 149 111 70 39 24 21 15 0 -16 -11 18 57 86 103
4183 103 116 129 142 153 164 174 178 173 160 145 128 113 106 111 127 150 172 177 158 131 124 142 159 149 116 88 76 69 56 39 26 19 21 39 70 97 109 117 134 155
4165 155 166 162 157 156 156 153 153 160 168 166 151 132 112 95 97 131 191 238 238 191 131 92 84 94 110 126 138 141 131 106 73 49 47 65 85 97 106 125 150 162 155 136 112
4147 112 84 57 33 10 -16 -39 -33 5 54 82 88 89 92 87 72 61 62 69 68 54 37 28 36 60 91 118 136 147 151 146 136 132 141 158 171 182 195 204 194 161 122 101
4128 101 103 114 118 116 117 128 147 162 163 147 123 103 92 86 85 100 142 200 240 236 196 146 104 72 47 35 38 48 56 67 93 129 151 140 101 59 34 27 28 33 39 46
4110 46 50 59 81 112 128 119 91 65 48 39 39 53 72 79 67 46 30 22 26 47 78 101 100 86 77 74 65 52 50 68 92 108 111 105 90 71 60 71 97 120 122 101 68
4092 68 39 31 56 102 138 141 120 103 103 103 87 64 52 57 65 67 64 62 60 55 48 38 21 -1 -21 -32 -32 -22 0 28 57 81 105 136 166 182 179 162 134 104 83 86 114
4073 114 156 194 215 214 198 176 157 139 126 133 166 211 239 243 230 208 178 140 101 64 28 7 20 66 117 148 154 144 119 82 55 51 55 41 9 -16 -23 -19 -9
4056 -9 13 51 85 99 92 75 54 37 38 59 88 106 112 112 105 91 81 89 120 155 174 170 154 144 154 178 198 191 162 136 137 162 184 188 181 174 159 117 49 -17 -54 -55
4038 -55 -38 -22 -10 2 17 33 49 66 84 99 108 116 132 156 175 180 182 200 235 265 275 274 272 263 231 186 161 172 205 237 261 283 303 317 318 292 231 151 90
4021 90 69 75 76 67 69 93 125 140 131 106 86 91 122 162 185 183 170 157 149 143 133 118 99 89 91 91 70 30 -2 -10 -1 6 5 1 -1 0 9 26 37 31 11 -2 1 20 48 85
4001 85 125 154 156 129 95 78 84 103 120 126 122 107 85 66 60 71 90 116 149 184 210 217 205 183 158 140 134 134 127 101 66 34 9 -13 -38 -59 -73 -72 -52 -18
3984 -18 14 37 56 81 109 125 123 115 114 121 124 114 88 58 39 37 40 40 47 74 109 124 108 76 50 29 0 -35 -61 -62 -43 -17 9 37 58 65 61 63 79 100 104 80
3965 80 45 21 16 29 55 87 109 108 94 96 128 170 190 177 146 118 101 91 78 57 39 40 64 95 121 138 145 141 125 108 99 95 88 85 101 136 168 176 158 127 96
3948 96 80 81 90 97 101 108 119 125 119 104 90 83 88 106 124 121 92 64 68 105 145 165 170 172 172 163 148 143 156 174 183 183 188 200 208 201 185 176 181 188 189 182 177 186 206 223 221 205 194 199
3926 199 205 191 158 134 140 168 190 188 159 120 88 69 52 30 13 23 62 106 126 118 97 79 70 71 75 75 67 57 48 36 24 27 48 67 63 45 41 56 75 90 105
3908 105 116 108 77 46 34 35 32 23 18 18 16 14 25 57 103 145 169 174 166 154 144 137 135 143 156 167 176 184 190 185 170 162 175 199 210 194 156 115 84 72 71 69 61 54 58 71
3888 71 82 89 98 111 116 106 88 73 71 79 90 94 89 80 72 61 44 28 20 18 11 0 -6 -3 2 0 -10 -21 -25 -15 6 33 55 67 69 56 25 -17 -50 -53 -25 14 47 58 53
3869 53 46 54 73 87 86 81 84 86 69 33 0 -18 -27 -41 -59 -68 -62 -47 -31 -13 7 29 51 73 90 92 76 56 50 62 75 79 77 81 95 113 126 130 127 123 133 165 201 217
3850 217 208 191 184 182 178 180 192 205 202 188 180 180 169 138 109 105 127 155 174 183 175 147 110 80 69 69 74 84 101 116 122 123 125 127 126 130 150 179 195 190 184 196 222 238 235 220
3830 220 199 166 127 100 96 102 96 75 58 60 76 91 91 74 53 42 46 55 60 58 57 61 69 75 78 78 85 104 131 151 155 146 136 124 106 86 72 71 80 99 125 143 133 97 64
3810 64 59 80 104 111 101 84 70 71 80 84 71 47 31 36 51 63 66 65 68 77 90 105 125 153 181 190 170 129 86 56 43 45 54 48 12 -36 -63 -45 2 52 90 122
3792 122 143 144 125 105 97 93 85 80 89 108 120 120 117 120 128 141 156 163 152 125 98 81 73 75 90 113 126 118 106 115 146 181 205 222 234 228 198 157 125 113 116 119 110 90
3773 90 71 67 74 76 61 33 7 0 12 38 52 34 -4 -27 -10 32 71 92 102 114 131 156 184 200 190 162 139 138 154 169 172 163 146 124 99 70 45 35 42
3756 42 54 62 68 76 76 58 32 17 17 17 11 14 35 57 61 48 38 40 45 45 48 61 77 83 78 72 74 89 108 118 108 84 60 46 39 32 18 4 -4 -3 3 12 13 4 -8 -13 -12 -12 -16 -13
3734 -13 11 56 103 131 141 145 148 148 140 122 96 70 65 92 138 172 176 162 154 159 167 166 155 141 130 124 118 114 115 124 129 111 67 20 -1 6 32 65 100 121 110 72 38 35
3715 35 54 72 78 83 93 100 99 102 122 157 186 197 189 174 162 157 156 150 136 113 91 82 86 88 69 36 20 42 86 113 107 84 64 51 49 74 128 179 189 156 110 73
3697 73 46 27 23 30 32 27 28 44 55 48 34 30 32 25 12 6 12 17 14 13 21 33 47 64 85 103 117 131 139 131 107 82 66 55 44 44 67 107 141 153 150 143 133 111 75
3678 75 40 26 33 38 31 24 37 65 87 90 89 97 105 97 73 55 57 77 100 116 128 141 148 132 93 55 49 75 102 105 91 81 82 90 106 129 150 158 156 150 141 132 129 136 145 145 150 177
3657 177 219 243 236 215 206 210 212 208 207 215 224 224 210 188 171 163 153 138 128 134 148 154 149 148 157 160 147 130 124 130 130 123 119 130 150 160 153 139 139 165 197 206 186 160 151 158 169 179
3636 179 192 198 188 165 144 128 109 91 94 124 158 161 126 79 49 45 54 66 83 108 130 133 114 89 71 58 46 39 39 40 36 29 23 13 0 1 28 69 97 107 119
3618 119 146 171 175 159 145 143 147 150 148 138 119 96 79 76 83 96 109 110 94 68 45 30 15 -4 -21 -20 4 44 79 95 97 101 116 138 156 165 164 154 133 109 94
3600 94 91 96 110 134 161 171 154 124 101 90 81 70 69 85 105 112 101 86 82 93 110 120 114 93 72 68 85 110 120 109 92 88 108 143 175 189 182 163 147 139 140
3583 140 149 162 175 183 179 159 133 120 137 184 229 245 227 200 183 169 144 110 84 77 85 103 124 141 140 117 92 87 99 102 86 69 74 98 115 114 111 118 125 120 104 87
3564 87 73 55 33 18 16 24 30 31 26 18 10 14 37 76 119 156 177 179 164 143 131 130 127 107 75 49 44 54 65 77 98 130 159 170 162 148 139 137 145 166 192 202 188
3546 188 161 145 149 163 174 178 179 180 178 169 148 115 74 30 -10 -44 -69 -81 -79 -61 -36 -18 -21 -39 -50 -42 -22 -17 -35 -58 -55 -17 38 89 123 132 111 58 -3 -40 -32
3528 -32 3 33 37 24 11 13 37 85 149 208 242 242 210 161 116 94 101 114 108 77 40 17 14 19 22 15 3 -5 -6 0 9 13 12 6 -1 -12 -21 -28 -31 -40 -59 -79 -81 -49 8 68
3508 68 116 153 183 204 209 200 181 161 149 148 146 122 76 40 44 84 119 125 113 114 134 153 153 135 118 116 125 134 138 138 134 121 101 91 96 106 102 83 69 76 99 122 138 149
3489 149 162 177 184 167 123 73 49 61 91 119 143 166 179 169 142 122 126 146 166 177 179 182 191 201 197 175 148 137 140 136 112 81 64 67 86 110 127 122 100 83
3472 83 85 96 97 80 56 40 36 50 82 120 146 160 174 191 199 185 156 128 105 77 43 16 7 17 32 42 44 44 46 44 34 23 30 57 86 95 94 103 123 132 116 90
3453 90 74 69 66 73 102 155 210 250 272 281 282 277 267 246 211 176 160 164 170 159 141 134 142 155 166 185 212 228 219 190 161 138 113 82 54 40 31 19 12 28 64 98
3435 98 111 111 111 109 97 81 76 84 90 89 86 89 92 93 101 129 176 225 252 242 194 125 60 20 13 40 94 155 200 221 229 240 253 262 265 268 265 251 225 201 192 204 234 271 297
3416 297 292 253 193 131 83 52 34 20 7 4 14 28 31 19 3 0 14 35 54 71 93 121 143 138 99 40 -16 -65 -102 -116 -90 -32 19 44 57 85 128
3400 128 154 137 86 32 -1 -1 24 53 64 55 49 60 76 82 83 99 131 163 180 185 184 164 118 60 22 21 48 81 102 104 90 76 82 110 140 157 164 175 187 188 176
3382 176 162 160 168 178 185 185 176 162 146 121 80 27 -21 -57 -79 -88 -73 -40 -12 -2 7 41 95 137 154 160 172 182 177 160 145 139 138 147 171 203 225 228 222 214 201 173
3364 173 129 81 45 30 44 83 132 168 182 176 162 150 143 140 133 116 93 76 71 72 71 70 78 93 109 122 132 139 138 126 111 97 83 67 49 31 18 26 67 134 188
3346 188 198 172 150 159 186 201 189 163 145 141 136 112 75 54 69 102 116 97 63 39 31 27 19 11 8 12 22 39 63 90 108 108 91 69 56 44 15 -34 -80 -88
3329 -88 -47 18 76 114 134 142 145 149 161 178 185 178 169 170 175 168 151 139 138 138 126 109 101 104 110 112 111 105 87 68 70 99 131 138 116 85 64 52 44 38 35 33 26 22 32 59 94 125
3308 125 146 158 163 172 190 213 219 190 134 85 67 79 102 124 141 151 144 120 96 97 126 163 182 179 174 181 194 200 198 201 217 227 209 163 114 83 71 69 73 81 88 90 86
3289 86 80 73 64 57 53 48 41 32 26 17 -6 -45 -73 -63 -16 40 78 96 119 160 208 242 250 237 214 187 161 142 137 144 157 167 171 173 172 163 141 111 87 81 89 94 89 81 87 112 140
3269 140 150 135 110 93 93 102 107 103 90 74 64 62 64 65 65 67 72 74 73 78 87 92 86 81 87 101 111 116 126 141 142 121 89 61 40 19 -1 -15 -17 -9 11 47 92 127 137 127
3249 127 116 124 143 149 124 82 53 51 66 83 98 111 115 107 96 90 88 86 90 108 129 137 138 146 163 172 161 134 110 102 116 135 129 88 36 13 28 50 53 45 51 79 116 147
3230 147 158 145 113 74 46 34 30 25 15 0 -5 8 34 49 41 24 23 39 60 72 76 72 61 50 47 57 79 103 113 91 45 9 13 47 78 85 76 66 59 57 63 77
3212 77 89 95 104 122 136 133 111 85 63 44 27 16 6 -6 -16 -4 32 71 86 81 78 87 95 92 87 96 120 149 177 198 209 213 222 237 237 209 170 151 156 158 143 130 138
3193 138 151 143 113 85 68 61 59 64 75 82 81 81 85 89 91 89 78 59 40 33 36 35 32 45 79 118 144 160 167 157 122 77 51 51 63 70 70 63 51 40 38 42 38 24 22 44 80
3173 80 105 116 128 151 172 173 150 117 90 80 87 108 132 141 118 60 -2 -31 -13 21 34 23 24 55 96 116 121 133 156 171 168 166 180 200 207 202 201 204 199 182 164
3155 164 151 139 115 82 53 42 59 101 148 172 158 119 75 40 16 8 20 57 115 184 239 248 202 129 70 49 52 60 71 91 117 137 142 133 114 88 57 27
3138 27 5 -5 -4 11 43 82 114 131 131 120 103 88 86 101 128 156 171 167 149 129 119 116 107 87 62 47 50 75 117 161 190 191 171 141 109 78 56 50 52 55 55
3121 55 56 56 52 51 67 92 107 100 82 72 73 79 82 81 73 64 67 88 119 145 166 187 214 242 268 287 292 280 252 217 184 159 148 146 142 128 108 89 75 69 75 95 124 154
3102 154 184 204 199 167 134 129 147 159 144 112 83 65 57 56 55 45 21 -3 -18 -26 -31 -26 1 51 105 142 160 169 181 192 192 176 153 139 137 142 149 162 181 196 198 188
3083 188 175 167 167 172 168 147 120 110 126 153 171 179 187 198 196 172 135 103 85 81 89 104 123 142 156 164 166 165 162 158 160 173 185 172 130 84 68 88 121 146 158 164 167
3065 167 161 145 122 97 72 51 33 23 18 18 18 17 18 29 50 76 103 128 151 166 174 174 170 164 159 154 143 126 116 125 146 156 138 102 72 61 66 80 103 129 146 146
3046 146 139 139 145 142 128 117 125 146 159 156 139 119 98 75 45 11 -18 -30 -23 -9 -3 -5 -11 -14 -17 -19 -24 -35 -51 -60 -55 -47 -50 -58 -46 -3 44 77 98 123 143 140 121 117 141
3027 141 174 190 191 194 202 203 187 160 135 124 130 142 150 151 151 156 167 182 198 205 197 179 168 179 204 224 228 211 175 126 81 66 91 138 173 177 162 153 160 172 175 170 168 172
3008 172 175 165 137 101 79 88 129 178 217 248 270 267 233 190 167 157 127 70 19 7 22 36 46 67 101 129 140 142 147 156 169 180 183 177 169 166 168 168 171 188 215
2990 215 234 234 213 182 149 125 116 115 107 92 79 76 81 84 85 86 80 60 29 0 -19 -24 -18 -9 -4 -5 -13 -25 -32 -23 6 43 66 65 50 43 56 83 105 107 89 74 83 115 144 149
2970 149 130 103 76 61 68 95 116 101 52 3 -13 1 26 45 54 56 63 88 134 179 193 164 111 68 54 68 93 111 114 103 89 77 64 49 32 17 3
2954 3 -8 -15 -16 -7 9 31 52 67 77 86 96 100 99 97 105 119 133 145 163 189 215 235 243 235 206 169 143 136 134 125 112 108 116 126 131 130 121 112 114 129 142 139 127 115 102 80
2934 80 60 63 93 129 151 156 150 131 105 82 76 86 104 125 145 162 177 196 215 225 224 225 234 243 241 227 209 193 179 169 163 157 148 142 142 143 141 138 137 129 105 67 27 -7 -32
2915 -32 -38 -27 -16 -23 -39 -38 -15 9 13 0 -18 -35 -47 -41 -4 56 115 145 138 108 81 77 91 104 102 89 78 71 59 39 20 14 21 35 48 56 61 65 71 78 83 85 79 64 42
2895 42 24 20 27 37 44 53 77 114 147 165 169 169 168 164 153 130 94 57 40 54 78 80 57 42 59 99 129 136 125 109 100 110 137 163 174 170 169 179 197 213 219 201
2877 201 162 122 107 116 129 136 140 139 124 98 73 54 33 14 8 14 19 21 36 67 92 97 98 105 102 70 31 22 45 69 86 112 152 181 173 133 89 54 30 17 15 24 49
2858 49 94 149 190 210 217 224 223 204 182 181 204 224 215 176 136 115 116 122 121 114 112 117 127 141 160 174 172 151 131 126 134 147 161 175 178 161 132 103 83 67 59 67 87 106
2839 106 121 136 151 149 128 108 110 132 148 144 130 121 112 98 82 75 80 95 111 122 119 101 84 89 119 151 160 146 128 117 110 106 114 137 156 148 118 99 110 130 126 98
2821 98 77 89 119 133 115 84 64 66 83 102 110 104 93 93 107 127 138 134 119 96 76 62 54 44 29 16 16 23 22 7 -16 -37 -40 -18 21 59 76 77 85 112 143
2803 143 154 138 117 118 150 197 232 243 238 232 222 195 150 111 96 101 105 99 94 98 104 99 81 62 54 61 81 113 154 192 206 188 151 119 96 75 61 70 106 145 159
2785 159 149 134 128 127 123 114 102 95 98 111 120 118 113 121 137 140 119 89 67 58 59 73 105 146 178 187 170 138 101 68 41 21 9 7 15 23 30 44 75 118 151 157 142 127
2766 127 132 158 190 209 207 190 169 149 135 127 123 120 116 116 120 117 96 65 48 61 93 116 110 82 47 21 9 14 26 29 14 -11 -33 -43 -45 -41 -26 -2 24 45 59 69
2748 69 75 79 90 113 140 159 168 179 200 222 228 213 186 159 128 84 24 -35 -71 -68 -36 -1 23 37 44 44 38 36 47 71 96 114 123 125 118 110 113 128 144 150 144 133 119
2730 119 97 65 31 6 -5 -9 -17 -35 -61 -83 -91 -77 -46 -11 12 19 20 33 58 85 102 111 120 128 126 115 106 108 119 135 150 159 155 137 113 90 72 64 74 98 113 104
2711 104 86 85 106 125 126 116 114 122 132 136 132 121 111 114 126 137 138 137 144 159 178 200 221 225 200 155 122 121 143 163 165 149 128 117 121 131 130 113 89 72 70 86 113
2693 113 140 158 161 147 115 82 70 89 117 122 105 89 87 91 91 100 126 152 159 149 140 135 127 116 115 127 140 148 157 173 186 182 163 144 144 164 189 198 189 171 157 148 141 132 119
2673 119 90 41 -11 -44 -47 -37 -31 -30 -29 -24 -12 2 17 19 7 -5 -4 7 15 12 8 23 60 100 122 119 106 98 97 98 97 96 99 104 109 108 95 69 40 20 6 -13 -35 -40 -16
2654 -16 18 43 54 66 86 102 104 89 67 44 30 34 60 97 125 129 112 89 77 79 83 79 64 48 38 38 50 66 73 67 56 51 56 64 69 70 69 66 67 76 93 115 141 167
2635 167 186 200 220 251 280 291 285 275 268 251 213 162 112 72 46 38 51 78 104 118 119 111 96 81 75 83 98 112 121 124 116 94 61 35 38 74 122 153 157 143 120
2617 120 87 47 15 10 35 74 114 143 156 153 146 150 158 149 116 81 69 79 96 109 118 122 114 104 112 147 192 217 211 185 153 124 95 67 47 49 83 140 193 221 224
2599 224 216 204 191 179 176 181 188 196 209 225 234 229 211 184 151 125 116 119 114 91 62 40 19 -6 -26 -15 27 73 91 79 58 43 39 45 64 99 133 146 137 118 101
2581 101 80 48 19 10 26 51 75 94 104 91 58 32 34 59 88 111 130 143 150 146 127 88 40 12 14 20 -2 -46 -68 -42 10 54 69 59 41 39 66 95
2565 95 87 33 -25 -53 -53 -55 -60 -51 -22 7 25 45 81 124 151 155 144 133 129 127 125 125 134 153 173 179 163 131 98 79 77 89 109 133 161 181 183 169 153 145 149 163 182
2546 182 191 173 135 110 121 149 162 151 126 93 47 -1 -30 -29 -10 10 31 54 74 90 110 139 172 196 201 184 155 132 126 125 113 90 77 78 73 47 12 -7
2530 -7 -6 1 3 -1 -4 8 49 108 159 180 183 188 197 195 180 167 163 158 143 120 99 86 88 108 144 177 195 196 188 183 194 224 257 272 265 257 259 257 238 208 185 175 172 171 166 151 129
2509 129 117 127 142 131 90 46 26 35 60 96 133 157 158 144 125 104 84 75 78 76 52 14 -12 -12 6 30 54 77 96 109 116 118 107 82 55 44 52 64 68 66
2492 66 72 94 120 127 100 54 18 9 21 43 72 103 124 127 120 120 128 124 106 94 111 147 170 165 145 133 140 155 159 146 121 97 76 50 20 0 6 35 70 102 133
2474 133 160 169 160 146 139 139 133 123 116 120 127 127 114 88 55 27 10 4 2 1 8 29 59 85 95 84 60 35 20 10 1 -4 2 18 27 18 1 -6 1 24 54 85 103 96 69
2455 69 50 55 73 83 83 92 125 176 218 231 209 173 146 143 149 140 112 80 62 63 73 80 75 57 32 14 12 29 55 75 71 38 -1 -17 0 30 49 53 52 45 30 16
2437 16 19 42 67 78 79 78 81 87 98 116 129 128 114 104 108 123 144 166 187 200 202 191 174 154 135 119 111 109 103 84 58 41 42 54 57 42 20 3 -2 -2 -2 -3 -4 -1 10
2417 10 39 81 120 138 131 111 97 95 93 80 60 47 48 57 65 71 79 95 123 164 206 226 213 176 141 124 115 97 66 33 15 20 49 97 159 222 267 278 253 218
2400 218 197 195 193 175 148 127 115 102 83 67 66 82 110 143 171 182 173 154 140 138 141 148 159 167 159 132 104 98 114 131 133 119 99 79 64 56 51 47 47 61 89 118
2381 118 135 143 148 152 156 169 201 236 241 206 154 121 117 131 149 162 163 150 127 113 120 147 179 199 199 177 140 103 88 99 117 112 74 26 1 16 58 101 123 111
2364 111 69 16 -28 -55 -63 -52 -18 29 71 97 111 123 134 142 145 143 137 128 124 126 131 139 153 167 162 134 104 101 128 162 182 184 173 153 131 112 93 70 53 54 65 63
2346 63 46 35 49 76 96 108 128 158 178 173 152 126 97 60 17 -12 -14 10 36 41 25 10 8 8 3 2 16 33 35 20 5 4 21 53 92 123 132 120 95 57
2329 57 3 -49 -68 -45 -4 24 37 43 44 36 27 30 44 55 56 51 41 29 21 24 29 27 18 18 30 43 51 59 73 88 99 110 122 128 125 121 129 144 156 164 177 197 209 202 181 157
2309 157 139 137 164 218 275 302 293 266 243 222 194 166 153 154 153 143 136 138 134 110 75 54 56 67 77 93 126 171 205 215 197 157 106 59 26 9 7 22 50
2292 50 80 96 92 80 75 86 111 143 173 192 196 193 192 194 190 173 147 120 103 98 105 118 127 125 117 114 123 137 145 144 137 132 137 157 189 219 231 221 202 190 190 198 209 218 214 189 149
2271 149 112 89 73 50 21 0 -6 8 37 68 88 93 92 96 104 107 107 118 146 180 197 192 169 133 94 70 75 98 114 108 88 67 47 34 42 76 119 147 158 170
2254 170 194 217 230 233 228 212 181 143 108 79 59 60 85 116 123 95 58 43 56 78 88 85 79 78 79 74 58 34 8 -9 -16 -12 -7 -7 -8 -1 16 40 63 81 97 114
2236 114 137 163 184 182 152 107 68 44 32 21 12 11 18 27 30 26 23 27 44 70 102 134 161 175 174 164 154 150 151 160 173 185 188 184 189 211 238 246 227 201 190 194 200 203 213
2216 213 231 240 224 190 157 132 114 106 117 136 145 142 139 138 127 102 85 92 113 127 139 162 189 194 170 139 124 120 113 103 100 110 126 136 136 129 118 111 114 122 126 119 98 71
2197 71 48 32 19 1 -23 -45 -45 -8 65 147 200 213 207 209 217 211 187 161 148 142 139 142 148 137 105 77 78 106 132 137 131 128 132 135 128 113 98 100 121 150 166 164 154 154 168
2178 168 188 202 205 196 183 168 155 144 135 125 110 91 72 56 43 29 15 6 5 16 32 43 46 54 75 95 84 39 -6 -18 4 32 46 48 50 58 68 73 66 53 50
2160 50 59 68 64 58 61 65 50 25 16 34 57 64 54 42 38 47 73 109 135 141 137 135 129 110 85 71 70 69 67 79 107 133 133 101 51 0 -41 -61 -59 -36 2 53 105 143 158
2140 158 156 154 165 183 183 153 105 69 60 69 83 94 104 109 106 101 107 125 143 152 153 156 163 169 165 150 130 113 101 99 118 167 230 277 282 253 217 194 181 171 160 150 132
2122 132 103 69 44 39 49 66 86 111 139 157 152 125 96 86 95 111 127 147 173 198 215 225 226 211 182 151 126 102 73 48 42 56 71 76 79 90 106 111 101
2105 101 92 97 112 116 99 79 79 102 128 138 136 137 150 169 187 197 187 150 102 65 55 66 92 128 161 169 144 103 68 43 27 27 54 92 105 76 30 4 8
2088 8 23 28 27 35 60 97 126 135 131 133 149 167 181 198 230 263 273 252 216 178 139 99 72 63 62 55 43 41 61 93 119 123 104 82 74 79 80 67 55 56 59 48 26 18
2069 18 46 106 176 227 239 212 170 136 114 95 83 92 122 148 153 146 149 160 164 152 129 99 62 25 9 25 63 94 99 81 59 44 31 13 -1 4 35 79 118
2052 118 140 143 132 125 140 181 225 243 227 190 151 118 93 79 78 92 116 136 141 129 112 96 82 73 81 112 151 177 182 175 157 126 90 67 66 73 73 65 52 30 2
2034 2 -13 -7 7 9 0 -3 2 0 -11 -13 13 61 109 145 170 180 172 149 119 87 60 57 91 142 172 166 145 134 132 127 120 127 152 179 189 179 154 125 108 111 132 159 180
2016 180 195 207 213 214 215 219 211 182 137 97 69 51 38 36 48 72 100 128 150 155 142 123 111 109 105 97 90 91 94 96 100 109 111 98 76 63 68 78 80 79 85 98 104 97 81 63
1996 63 49 42 43 53 68 86 104 116 117 112 111 121 139 158 175 183 175 150 120 101 105 140 197 257 296 311 315 313 298 260 206 155 116 86 61 44 40 56 91 129 147
1978 147 139 125 127 137 132 111 96 104 126 140 143 137 118 81 39 7 -9 -17 -16 5 42 74 88 92 91 77 43 7 0 27 68 96 109 121 132 130 112 87 67 54 51
1960 51 56 60 42 2 -34 -45 -32 -20 -14 4 53 112 149 153 149 160 187 209 208 183 149 121 107 101 95 91 98 121 152 182 205 224 236 232 209 182 166 166 169 158 134 106
1942 106 84 71 63 59 54 45 35 32 47 78 109 116 87 35 -12 -39 -44 -39 -26 -3 30 70 109 146 174 195 216 243 262 250 201 131 64 13 -23 -49 -60 -55 -39
1925 -39 -23 -12 -1 14 34 49 53 54 69 99 120 114 90 73 79 98 115 125 132 140 156 182 213 229 215 177 142 132 140 145 136 122 114 110 108 110 122 131 123 100 82 80 88 98
1906 98 111 126 129 115 91 71 60 56 64 90 125 153 164 160 150 146 148 141 110 71 56 72 86 66 30 21 48 78 88 86 85 83 77 77 87 96 94 90 97 109 119 127 135 133 112
1886 112 80 57 50 51 58 76 100 111 101 80 63 57 60 71 90 115 137 144 137 130 144 178 214 226 208 171 134 111 107 114 117 108 103 123 167 213 234 226 202 180 171 181
1868 181 210 243 258 243 205 166 147 147 149 142 132 127 128 128 125 124 125 125 125 130 137 139 132 117 91 57 28 22 45 80 107 124 140 165 199 232 250 243 213 173 133 97 67
1850 67 49 48 65 95 133 170 193 194 176 151 127 100 69 38 19 22 43 66 76 77 84 103 128 152 176 199 212 206 193 191 202 203 182 149 119 91 63 44 48 69
1832 69 85 81 63 45 38 46 75 116 153 177 196 217 229 214 174 137 119 107 78 35 4 8 41 83 117 140 160 183 206 218 205 171 132 104 88 76 64
1816 64 58 68 92 121 144 153 148 132 106 69 27 -6 -21 -12 7 16 3 -21 -38 -34 -17 -1 11 28 54 82 108 131 149 159 165 175 187 188 168 137 112 95 75
1799 75 49 36 55 104 153 175 163 135 110 99 94 86 72 57 50 51 59 72 97 133 167 179 158 114 64 23 -2 -15 -21 -23 -22 -16 -9 -5 -2 10 42 83 110 115 109 106 110
1781 110 122 146 181 211 220 205 176 145 116 91 74 71 77 85 92 102 118 135 147 148 141 130 120 118 130 156 178 177 144 87 26 -12 -6 38 91 120 123 115 99 69 35
1763 35 20 36 64 81 88 95 103 111 123 141 152 141 112 83 70 77 103 140 169 173 156 135 126 132 158 199 236 243 212 167 135 121 108 76 27 -19 -40 -32 -10 18
1746 18 59 114 162 175 158 141 134 121 86 44 21 14 6 -8 -12 7 37 48 33 12 14 46 83 103 107 112 127 143 152 160 171 176 171 158 147 144 150 161 170 162 132 96 74
1727 74 68 63 49 33 34 59 99 134 147 137 121 113 117 124 134 151 176 200 210 199 173 142 117 94 62 21 -11 -19 -5 12 25 36 50 70 92 112 126 129 122 110
1710 110 96 85 82 88 96 98 92 80 63 38 6 -20 -29 -16 12 42 61 68 70 76 86 100 114 122 112 85 58 47 53 66 88 117 140 134 101 66 54 60 69 76 78 69 42
1691 42 9 -11 -14 -1 14 27 33 33 34 40 44 45 51 74 109 141 159 167 173 184 198 203 193 179 178 192 198 180 153 150 177 210 225 220 205 182 155 133 124 123 125 132 143 150 146 137
1671 137 129 126 127 138 162 186 196 193 194 210 229 247 265 281 279 256 228 219 223 216 180 132 103 109 145 185 201 187 151 111 76 53 52 75 105 116 97 57 13 -21
1654 -21 -36 -27 0 29 51 67 79 85 82 72 63 60 63 72 82 96 121 162 203 220 210 184 155 121 87 73 89 114 122 114 111 118 130 148 178 203 195 156 121 119 141 158
1635 158 160 152 143 142 156 179 188 173 141 113 95 89 98 118 132 126 107 97 104 123 152 183 200 187 160 147 155 159 137 102 82 86 104 126 142 145 134 124 128 147 172 202
1617 202 235 257 247 204 146 95 58 34 24 32 52 65 66 68 85 116 138 131 106 88 94 109 109 88 60 46 51 65 81 100 117 124 120 121 145 193 243 270 273 263
1600 263 256 257 259 253 234 213 207 214 213 187 151 129 128 129 119 102 90 87 86 85 85 86 84 73 52 32 27 39 49 37 6 -18 -23 -16 -9 -4 2 5 2 4 23 51 70 71 67 72 84 92 91
1579 91 88 91 99 106 103 87 66 53 56 75 107 148 188 210 200 164 123 96 91 101 114 123 124 115 97 82 88 118 152 162 144 116 98 94 104 129 163 184 175 140 105 89
1560 89 94 111 132 144 139 115 83 59 49 49 52 55 59 72 99 138 173 187 177 158 139 120 100 82 67 59 57 66 80 86 79 65 55 45 28 6 -5 0 12 28 48
1543 48 71 90 94 84 72 73 87 109 131 148 161 169 164 145 120 100 90 79 59 36 23 18 15 12 16 30 44 55 69 93 119 128 113 83 57 36 13 -12 -33 -42
1525 -42 -44 -44 -33 2 56 103 125 124 111 95 88 101 130 154 159 157 167 182 186 172 156 145 133 113 92 78 73 74 84 99 107 102 93 86 78 65 60 72 91 100 97 96 102 110 122
1506 122 144 171 180 160 126 104 99 104 109 114 118 117 116 122 139 163 187 207 220 231 248 271 287 279 247 211 189 182 181 183 192 203 200 176 137 98 71 62 71 88 99 98 94 96 101
1486 101 105 115 135 153 153 138 123 113 96 65 33 22 28 39 52 80 124 162 168 146 119 105 101 96 95 110 138 158 154 137 127 130 134 128 112 93 70 46 28 24 35
1469 35 58 87 107 103 77 54 52 62 60 37 8 -7 -3 11 32 58 84 104 109 100 86 73 57 38 29 49 96 135 138 111 80 62 60 77 115 156 175 165 140 122
1451 122 120 130 138 135 125 126 141 146 123 97 112 165 211 214 195 181 169 145 122 123 144 162 158 138 115 97 96 116 143 162 172 187 206 218 212 193 167 137 108 88
1434 88 83 91 105 114 107 87 74 80 92 89 78 82 104 123 130 132 132 113 71 27 4 0 0 -2 0 1 -5 -10 5 43 84 113 128 128 113 88 75 89 123 149 149 130 114 113 121 128
1414 128 130 134 139 134 115 85 57 40 42 62 84 93 86 79 86 104 122 136 144 145 138 130 124 114 92 63 36 20 14 16 19 20 14 4 -4 -6 0 12 23 27 27 29 33 37 50 81 125 165
1393 165 196 224 246 242 206 160 130 118 114 112 120 137 158 179 198 209 213 221 239 253 250 230 205 173 129 83 53 44 52 75 103 117 116 127 167 208 208 179 166 187
1376 187 210 209 193 178 173 188 233 299 373 480 655 908 1280 1912 2894 4000 4704 4605 3828 2881 2167 1726 1417 1170 993 868 752
1364 752 641 559 500 438 381 352 349 352 356 365 366 345 314 286 249 196 156 164 199 207 174 137 121 118 117 128 153 175 180 182 199 226 245 247 234 212 187 166 145 119
1347 119 93 83 94 114 131 152 179 197 195 180 169 170 175 187 210 240 259 249 217 183 168 176 193 207 218 230 243 247 239 217 190 168 160 163 164 157 157 175 197 202 193
1329 193 193 205 202 170 137 135 165 197 213 212 196 169 146 151 184 217 223 201 170 151 154 166 169 153 131 126 142 162 168 161 157 164 178 188 185 173 161 155 145 118 70 15
1311 15 -21 -29 -19 -10 -5 10 45 88 122 144 162 171 159 123 88 75 85 98 103 95 77 54 44 56 78 92 94 97 110 123 131 143 163 175 167 141 120 118 133 162 201
1293 201 245 277 280 251 205 163 143 152 188 241 287 301 277 237 209 200 195 179 158 146 152 175 208 246 281 300 300 288 275 261 243 222 207 202 203 193 168 138 117
1276 117 109 117 139 169 189 189 177 171 181 200 209 196 165 129 105 99 100 100 106 124 145 150 137 123 112 95 66 38 30 47 82 124 161 182 192 206 226 236 225 204
1259 204 194 197 201 193 175 151 124 109 115 130 133 119 105 108 128 154 176 185 176 152 123 106 105 114 120 118 118 131 151 156 135 104 94 111 130 128 109 91 85 91 98 95 80 65
1240 65 64 71 71 60 52 61 77 84 84 88 101 115 122 121 111 91 66 45 31 21 9 -3 -7 5 33 62 78 83 87 94 97 97 103 114 115 100 88 96 115 124 117 108 102 91 74 59 46
1219 46 31 13 2 3 7 14 35 71 105 119 115 104 92 76 64 63 66 61 46 32 25 17 2 -16 -27 -21 0 22 35 36 37 47 57 55 39 21 6 -4 -9 -4 12 34 55
1201 55 72 85 96 111 138 170 193 195 185 173 162 150 138 124 100 64 27 7 2 0 -7 -8 4 29 58 87 114 127 120 103 97 106 114 104 79 59 60 81 108 131
1183 131 146 153 148 128 95 69 64 79 97 103 102 107 119 129 133 144 173 210 232 230 210 182 146 105 79 90 133 176 193 192 193 194 171 112 36 -21 -45 -38 -11 27 65
1166 65 82 75 63 64 79 93 100 108 121 132 139 148 167 191 206 206 193 178 165 156 146 126 99 81 89 116 141 150 151 155 163 165 163 167 184 205 219 220 212 201 185 159 118 69
1146 69 33 29 56 88 94 71 45 37 46 58 70 91 123 148 152 145 144 148 141 113 74 40 18 13 21 36 47 50 51 56 63 75 101 135 153 142 121 120 142 164 170 164 149 120
1127 120 81 48 39 60 101 148 181 184 163 142 134 131 123 123 144 178 201 204 197 188 175 164 167 184 199 196 177 154 138 131 136 151 169 178 168 140 104 80 79 95 112 125
1109 125 131 120 86 41 11 7 17 27 41 67 91 96 79 57 43 30 14 4 4 0 -19 -50 -71 -75 -71 -71 -68 -50 -13 27 66 100 128 144 150 153 154 146 124 101 90
1091 90 92 97 104 119 136 141 128 108 96 89 83 77 70 58 44 44 61 78 73 52 40 49 69 95 129 165 181 167 142 129 129 126 112 92 74 65 71 94 129 159 168 157 135
1073 135 113 100 100 109 117 127 146 165 163 122 58 11 3 23 48 72 94 107 94 59 28 21 33 43 49 64 98 142 181 205 209 194 163 122 80 48 36 41 46 35
1055 35 13 1 11 38 66 93 130 179 232 274 294 292 276 258 245 235 225 210 185 152 120 98 85 69 53 46 52 55 41 19 6 6 13 29 63 107 137 139 127
1039 127 123 129 129 117 94 65 28 -7 -30 -33 -23 -8 12 38 62 76 77 70 56 42 44 71 109 128 118 95 82 82 83 77 68 58 56 67 98 138 167 174 169 170 184 199
1020 199 199 182 161 151 153 154 149 147 158 179 195 196 180 147 105 74 72 96 126 154 186 219 227 196 144 103 81 64 36 -1 -32 -38 -8 42 82 97 99 106 112 106 96
1003 96 97 104 92 66 54 65 75 68 59 72 103 132 154 173 189 199 216 248 280 283 254 218 189 166 145 133 128 120 107 102 115 135 147 147 133 104 69 55 75 108
985 108 118 91 48 17 8 16 32 47 48 28 -2 -23 -21 2 36 76 120 160 188 200 204 204 192 160 113 68 36 17 9 12 19 15 0 -13 -4 24 53 73 88 106 128
967 128 144 153 153 143 125 104 84 65 50 44 50 65 77 81 81 87 100 107 102 89 80 75 67 52 37 31 33 42 62 90 117 130 131 133 143 154 159 157 158 164 171 174 173 173 175 182 190 197 198 186
946 186 156 119 99 115 160 206 233 243 245 241 222 188 150 128 133 152 165 164 159 164 175 177 164 144 128 117 103 82 60 45 43 54 69 74 60 42 47 85 137 175
928 175 184 174 162 156 158 167 187 215 233 222 186 150 135 142 156 168 179 186 179 159 133 114 104 99 98 97 88 72 57 56 65 69 60 45 41 57 90 123 136 119 83 55 52 70
909 70 87 86 69 54 52 60 59 41 13 -9 -13 -2 15 37 61 88 109 119 119 115 110 105 104 109 121 128 119 98 71 46 26 23 44 80 106 108 93 74 57 43 37 42 48 39 11
890 11 -17 -28 -12 19 51 72 85 93 94 82 62 47 47 53 62 86 121 141 126 96 86 104 127 146 176 216 235 219 197 196 206 206 202 211 222 208 175 163 186 220
873 220 232 221 201 181 170 172 179 176 167 170 182 175 141 111 111 130 141 145 161 182 181 158 143 153 171 172 154 138 137 146 156 155 143 131 128 130 119 91 63 49 43 40 43 61
853 61 87 102 104 112 141 179 203 200 184 175 182 193 199 198 194 187 180 182 197 212 209 192 180 184 187 170 136 102 82 73 75 93 132 180 215 226 221 223 242 266 266 229 172 124 105
834 105 118 153 188 203 199 191 194 204 211 215 220 221 205 175 147 136 142 168 216 269 300 293 267 244 229 212 191 176 169 165 163 162 164 165 166 167 170 181 206 238 254 242 223 222 239
814 239 249 238 216 192 156 105 63 57 83 114 136 152 168 186 209 242 272 282 269 251 237 223 200 169 137 109 87 78 75 66 49 40 47 53 41 22 23 50 80
798 80 90 84 78 82 95 111 119 111 93 92 126 181 223 228 209 196 205 221 216 181 140 119 125 140 148 144 136 127 128 144 165 163 129 88 73 81 81 58 33 27 35 36 24 13 14 27 49
777 49 77 106 122 119 110 113 126 131 112 84 75 91 114 122 117 112 110 105 101 111 138 166 183 189 186 174 156 145 148 160 167 163 149 129 112 108 114 114 104 95 105 128 149 160 167 173 171
757 171 156 129 93 53 24 21 40 61 68 65 64 73 97 136 179 202 188 149 113 100 102 101 89 73 66 70 77 81 85 93 97 89 73 60 55 52 49 58 83 110 120 112 102 94 77 46
737 46 11 -11 -20 -24 -25 -19 -3 11 13 1 -10 -5 25 70 105 107 77 38 17 18 22 17 19 44 81 99 85 57 37 21 0 -20 -22 -12 -7 -13 -16 -5 13 30 46 67 95
718 95 124 146 151 135 113 108 123 134 123 97 80 86 106 128 145 154 154 145 124 93 67 68 109 170 217 227 210 189 182 193 204 192 149 98 64 43 18 -13 -29 -9
701 -9 31 67 87 100 111 117 120 124 126 115 92 75 80 106 139 160 159 133 93 56 39 47 68 85 86 77 67 61 60 70 100 145 183 191 174 155 142 126 101 82 82 97 107
682 107 98 74 50 38 39 46 51 59 76 94 95 75 51 42 49 61 77 103 136 158 156 134 103 71 44 34 43 67 97 129 158 181 193 196 189 164 128 97 89 104 125 137
664 137 134 118 103 99 111 130 139 130 103 64 25 0 -9 -15 -23 -20 7 52 82 83 70 72 95 125 150 168 181 187 190 193 192 178 151 121 103 101 103 96 84 78 85 104 126 154 188
644 188 220 237 239 237 234 222 195 163 144 141 144 146 149 154 157 147 124 97 80 85 111 147 179 201 214 215 200 170 138 120 121 129 135 135 132 133 146 172 202 225 236 240 243 246 240 223
625 223 197 169 145 134 130 128 124 124 131 139 141 138 143 156 164 154 133 119 120 127 132 135 142 154 169 188 207 217 210 188 163 144 131 121 113 105 98 98 115 145 171 177 172 175 185 179 141
604 141 90 60 61 72 71 57 36 14 -2 0 26 66 95 102 96 86 76 68 71 89 112 124 126 127 134 142 145 143 133 118 102 100 115 131 127 100 71 53 43 33 29 40 55
586 55 56 39 26 33 49 61 74 102 136 150 135 113 110 123 130 119 105 112 145 180 190 168 132 107 97 95 97 105 116 119 112 105 106 110 111 116 124 126 111 91 79 72 55 25 -4
566 -4 -25 -46 -65 -71 -52 -17 21 59 93 112 101 67 33 23 39 68 95 113 128 146 160 160 146 130 121 112 89 54 25 16 31 61 88 95 83 67 61 60 49 30
549 30 16 22 51 92 125 135 121 103 97 104 113 122 137 151 151 135 114 94 69 40 26 36 60 78 86 95 106 114 117 118 123 128 130 123 103 73 42 21 5 -10 -17 3 62 138
530 138 201 227 220 202 191 194 199 196 182 167 159 160 167 179 195 206 206 200 201 215 231 229 204 167 134 105 77 57 55 66 72 66 51 37 23 11 11 28 49 60 57 44 21
511 21 -8 -25 -4 44 89 115 135 159 177 185 195 218 235 222 181 138 102 65 28 12 23 38 35 19 14 24 37 46 58 76 94 102 98 84 69 63 77 103 123
494 123 130 127 120 105 88 84 101 125 131 117 109 126 158 182 191 197 208 215 204 176 145 125 120 118 103 72 36 16 20 43 71 93 101 92 71 55 53 60 71 90 122 153 161 140
475 140 113 101 107 114 115 112 113 121 134 139 128 109 105 130 167 194 208 215 210 182 145 129 144 160 152 129 111 102 89 78 82 100 117 128 142 158 154 128 104 112 149 183 189
456 189 169 147 142 160 188 205 201 181 159 147 151 171 194 205 201 198 203 206 190 159 138 142 162 185 201 206 194 171 154 152 154 148 143 159 197 234 251 253 252 250 238 217 196
438 196 181 173 170 170 171 172 177 191 207 213 209 200 187 169 154 155 175 197 207 208 217 235 247 247 244 240 230 208 184 175 180 188 188 183 179 178 172 154 133 129 143 157 154 140 140 153 154 134 116
416 116 124 147 161 165 179 203 216 205 182 160 138 114 99 95 92 82 81 103 137 157 155 153 161 170 170 173 191 218 233 232 222 208 182 144 105 77 65 64 69 83 106 133
398 133 152 155 145 139 146 160 170 175 185 209 239 257 256 243 230 219 207 186 156 121 85 51 25 11 6 9 21 42 61 63 45 19 7 19 49 83 108 116 109 98
381 98 92 93 99 112 135 162 171 151 117 103 127 169 191 177 145 122 117 117 113 103 91 74 53 33 19 9 3 7 30 70 116 153 170 160 124 77 39 24 29 39 46
363 46 48 41 25 1 -21 -31 -26 -18 -14 -15 -8 14 42 62 72 84 103 118 114 97 78 65 56 56 73 106 142 164 167 151 118 82 53 34 14 -1 -2 14 35 46 57 81
345 81 113 134 145 160 178 181 158 124 99 90 91 100 124 161 202 232 244 241 237 242 251 244 214 178 156 154 158 157 151 148 148 151 155 165 181 200 209 208 209 224 252 277 296 316 332 327
325 327 292 247 225 235 255 266 264 250 227 205 194 196 193 171 132 92 66 61 75 100 118 114 90 64 54 60 75 92 117 148 173 178 168 163 170 176 169 149 128 115 112
307 112 117 123 119 106 97 101 107 104 94 86 77 57 28 5 -2 3 19 48 81 96 86 72 74 89 104 115 126 138 143 146 157 178 193 191 170 142 118 108 111 117 119 120 128 146 173
288 173 208 242 261 255 238 232 241 243 227 204 196 199 188 149 96 55 46 64 97 129 150 155 140 116 103 117 151 183 197 197 193 186 169 143 120 115 127 139 136 118 94 67
270 67 36 13 9 19 24 17 14 28 48 59 63 70 73 57 28 9 12 26 40 53 63 66 68 84 111 125 113 91 80 78 77 91 135 190 218 200 155 112 83 74 89 119
251 119 150 174 196 221 244 258 262 260 252 242 236 235 228 205 167 122 80 49 39 51 79 108 129 138 133 121 111 108 109 119 143 179 204 192 149 105 89 103 127 141
234 141 138 129 133 152 172 175 155 125 97 72 50 40 50 81 117 141 143 126 98 72 55 49 53 61 65 59 45 36 47 81 125 159 172 175 179 182 175 160 150 155 163 161 147 135
215 135 132 135 134 127 121 121 133 157 187 206 200 163 106 52 19 10 18 30 35 23 -14 -67 -110 -116 -91 -59 -36 -19 4 33 54 62 57 40 15 -4 -4 15 34 33 11 -22 -56
196 -56 -77 -73 -45 -12 4 0 -15 -32 -48 -59 -55 -40 -29 -31 -32 -10 36 87 120 129 116 89 61 50 60 78 90 98 110 129 151 171 184 190 190 184 173 156 136 122 117
178 117 117 119 125 134 133 114 91 80 80 76 64 48 31 5 -24 -36 -19 14 42 61 84 109 119 109 98 101 114 119 112 104 108 122 137 144 141 132 122 114 113 122 134 135 112 73 43
159 43 43 71 99 104 80 41 1 -26 -36 -22 13 60 102 127 134 126 108 89 87 110 146 166 153 119 90 78 84 102 129 152 157 144 122 99 73 44 24 15 14 13 19
141 19 38 60 73 74 75 85 97 99 89 73 54 30 3 -14 -11 20 67 106 120 111 88 61 36 17 3 -13 -38 -65 -77 -69 -53 -40 -26 3 54 115 166 192 189
124 189 163 129 102 94 107 132 154 159 141 107 63 18 -10 -10 9 18 -1 -34 -47 -32 -11 1 10 20 21 12 7 18 32 33 30 48 86 114 111 100 111 147 175 168 130
107 130 87 52 28 16 22 50 91 131 162 177 167 138 113 117 150 184 196 187 174 164 152 144 153 180 204 203 183 169 181 218 258 279 272 243 212 189 167 140 108
90 108 84 78 91 116 143 167 187 206 233 264 286 284 260 234 222 225 237 261 297 323 304 241 174 147 151 151 131 116 125 147 156 152 151 157 157 142 126 119 120 118 112 112 125 135
71 135 127 106 101 130 174 197 193 182 176 166 142 125 133 155 159 134 103 85 74 67 70 87 100 90 65 50 56 74 92 110 129 143 138 114 85 69 72 84 89 83 79 88 104
52 104 113 111 109 120 145 173 195 205 201 185 162 141 132 131 128 117 99 83 66 49 39 52 84 119 143 162 187 214 231 237 243 247 236 199 150 108 76 46 21 13 30
34 30 60 81 77 47 4 -27 -27 3 40 57 48 33 28 38 57 73 75 51 14 -8 2 34 58 61 49 33 11 -13 -24 -9 16 28 16 -3 -11 -1 13 20 16 9 16 40
16 40 64 70 62 58 67 80 82 74 72 81 94 98 93 90 102 124 144 152 154 157 157 148 130 111 94 77 67 74 99 128 144 142 120 74 8 -53 -81 -68 -35 -5 13 22 20 4 -15 -19 0
-4 0 34 63 76 81 91 110 127 124 106 96 107 129 140 134 123 123 132 139 142 142 143 149 168 202 239 254 235 190 136 83 37 8 2 13 25 28 30 45 79 116 136 132 117 110
-24 110 119 136 151 157 153 145 149 173 204 216 204 193 203 222 228 221 218 214 188 133 75 38 22 20 31 51 60 46 23 19 40 72 104 128 135 124 114 124 146 157 155 160 179
-42 179 199 210 224 253 282 290 275 253 234 219 207 197 186 174 164 159 149 127 100 83 80 89 100 102 89 62 34 13 -4 -23 -35 -29 -15 -14 -27 -42 -46 -32 -2
-59 -2 34 56 48 24 12 20 30 31 28 25 17 6 11 42 75 85 74 72 92 123 147 161 168 164 154 143 136 125 107 89 80 90 121 167 214 244 250 237 212 179 142 102 68
-78 68 52 59 80 95 92 83 90 114 130 125 103 81 63 48 43 49 65 86 110 130 131 108 80 75 92 109 111 109 120 141 164 184 203 214 208 180 140 104 86 83 82 75 65
-96 65 64 75 85 85 75 64 59 62 74 92 109 124 140 157 166 158 135 113 107 121 144 168 185 193 186 159 111 55 9 -19 -39 -56 -63 -45 -4 43 74 78 59 25 -6
-114 -6 -22 -19 -3 16 40 66 81 73 46 18 4 0 0 4 17 38 57 72 88 104 113 109 98 87 80 77 79 87 100 109 107 93 76 64 60 53 36 16 14 41 81 113 127 130
-133 130 127 114 94 87 103 132 158 169 167 150 122 101 110 146 180 185 167 152 151 157 156 147 134 115 88 51 10 -24 -41 -40 -29 -19 -13 0 20 41 47 38 23 13 11 12
-151 12 19 40 86 151 217 266 289 287 261 220 179 146 125 107 87 64 39 17 8 13 17 6 -12 -24 -23 -20 -24 -30 -28 -15 4 24 35 29 13 5 21 51 79 96 102 100
-170 100 93 90 96 105 105 98 98 109 125 135 144 152 154 145 129 114 100 85 69 60 66 84 103 117 130 149 172 188 190 182 176 174 173 174 177 177 164 144 136 144 152 143 122 104 94 88 90 106
-190 106 135 163 174 169 154 138 128 123 118 112 110 115 124 131 131 133 147 174 205 226 229 224 230 255 285 291 255 189 119 73 57 57 56 51 49 56 65 77 103 144 170 154 107 70 63
-210 63 67 62 53 57 67 64 52 48 61 74 68 50 35 30 31 32 34 40 42 31 7 -14 -18 -10 -9 -21 -22 8 52 72 65 59 75 92 82 48 19 7 3 7 27 62 85 78 54 39
-230 39 44 65 90 114 131 136 133 134 143 149 134 86 15 -50 -82 -69 -35 -10 -4 -3 3 4 -20 -68 -106 -100 -48 18 65 80 76 72 77 85 94 105 116 116 103 89 91 106 117 116 115
-249 115 126 142 142 123 109 118 142 155 145 117 89 72 69 78 97 118 131 130 117 108 110 123 136 150 169 189 193 172 134 96 70 57 59 73 93 106 116 132 151
-266 151 154 136 114 108 113 108 81 46 22 20 34 50 56 57 71 104 139 150 135 117 114 121 121 121 136 168 201 214 197 155 105 70 60 72 92 114 132 136 119 86 53
-284 53 27 8 0 5 17 20 17 26 52 74 68 39 15 14 37 72 107 134 153 169 182 182 161 128 97 69 42 27 41 77 107 111 98 88 88 93 97 95 91 91 105 137 172
-303 172 201 220 231 228 209 187 174 168 151 122 95 82 79 73 56 32 12 12 35 71 110 151 199 243 261 247 215 182 151 127 122 136 155 165 176 196 208 190
-319 190 147 110 101 109 117 119 122 127 130 130 124 104 72 41 26 27 33 41 46 45 38 32 37 52 71 94 125 155 171 170 163 159 157 161 173 191 198 185 158 133 118 104 87 71 65 76 101
-340 101 128 146 153 157 156 142 118 93 80 75 72 71 76 84 85 76 65 57 54 57 63 66 64 68 91 127 153 154 142 135 138 140 137 133 133 132 122 102 84 81 93 110 124 137 157 174 167 131
-360 131 88 61 58 72 93 118 136 142 134 118 94 64 33 13 4 4 10 27 51 72 91 113 141 160 155 128 100 88 92 95 91 91 105 128 141 138 129 128 137 156 189 229
-379 229 251 233 191 165 170 181 171 143 116 102 95 99 120 152 175 176 158 140 134 142 155 160 152 133 105 71 37 20 29 57 88 117 145 160 149 116 84 69 68 71
-396 71 81 99 115 123 131 150 174 187 188 187 190 192 184 172 163 158 158 164 180 201 214 215 203 181 153 125 110 109 116 122 129 141 157 174 186 190 185 172 159 154 159 168 179 189 197 203 210
-416 210 215 210 190 159 134 129 145 170 189 192 178 157 138 116 86 60 63 100 140 150 125 87 53 28 12 8 13 17 12 3 -6 -16 -22 -18 -8 -5 -13 -20 -9 16 36 36 22
-435 22 11 13 22 32 48 79 123 160 171 155 132 115 107 97 78 52 29 21 32 51 65 69 63 47 21 -2 -10 0 19 35 52 71 80 71 58 64 98 145 179 181 154
-453 154 112 77 59 55 56 59 67 78 88 99 114 134 160 195 228 236 209 162 121 99 90 92 110 143 178 205 225 238 241 238 245 266 278 252 190 123 79 62 63 75
-470 75 93 109 117 116 106 93 78 69 69 71 59 27 -6 -19 -10 0 0 7 32 60 67 50 25 6 -5 0 37 104 169 205 215 216 214 196 157 108 65 45 59 97 132
-488 132 142 126 92 50 11 -1 24 67 90 81 59 47 49 55 68 88 113 138 166 195 209 188 136 78 41 31 37 46 56 73 104 146 182 192 172 136 107
-504 107 99 112 130 131 107 69 40 30 27 18 6 9 34 67 98 128 164 193 198 183 177 185 180 143 92 65 61 50 17 -14 -20 -5 13 29 51 74 91 107 139 188
-521 188 226 226 194 158 145 151 163 172 179 190 202 207 198 172 137 110 111 147 201 243 257 244 211 166 121 94 96 118 138 143 139 137 138 132 118 108 119 149 171 165 135 104
-539 104 83 63 42 22 10 5 5 10 19 31 56 97 141 164 161 151 150 155 162 181 214 238 228 191 156 137 127 120 118 118 109 93 78 63 44 34 60 117 166 179 171
-557 171 176 190 188 166 144 136 130 116 100 96 102 108 104 92 71 52 51 84 141 196 226 225 205 177 148 127 115 109 95 66 32 10 8 23 43 58 59 46 36 46 75
-575 75 94 82 42 3 -9 3 29 52 69 85 111 146 178 196 204 208 207 196 173 147 131 127 127 117 92 58 35 39 62 79 79 79 103 150 190 198 181 169 174 185
-592 185 186 178 172 170 164 155 149 152 155 149 133 116 102 97 109 139 170 176 153 117 94 100 125 151 160 151 139 142 162 188 201 193 169 145 145 180 240 292 309 291 270 269 281 276 238
-612 238 183 140 119 106 88 72 76 99 124 138 144 152 163 161 134 90 61 68 109 158 198 226 251 278 298 303 288 262 240 227 213 189 161 144 138 127 109 96
-628 96 101 111 105 89 86 105 130 138 129 122 137 165 182 173 153 150 162 164 140 106 87 84 87 98 124 153 158 142 134 154 184 197 184 148 92 23 -30 -46 -29 -6 1 -4 -10
-647 -10 -3 21 50 63 53 37 29 31 34 37 45 58 72 84 91 89 83 92 125 165 176 148 104 73 65 68 74 78 83 86 87 85 82 83 90 103 120 139 149 141 124 121 145 184 215 230 231
-667 231 221 197 172 156 147 132 110 92 75 43 0 -29 -28 -12 -6 -14 -24 -32 -41 -45 -31 -2 18 19 9 4 3 0 1 25 79 142 181 181 162 148 145 140 129 119 115 114 103
-686 103 78 39 -7 -49 -71 -67 -40 1 52 100 128 128 111 94 84 81 89 107 126 137 142 155 180 210 232 234 215 181 149 134 138 148 152 150 149 155 172 189 187 154 103
-704 103 62 41 31 20 16 32 66 104 135 164 193 215 220 213 204 201 201 200 202 208 205 185 159 157 183 212 217 202 184 171 157 148 156 181 194 177 138 97 63 34 11 0
-722 0 5 23 45 62 65 56 38 20 5 3 12 24 26 23 27 37 37 27 34 74 126 148 125 79 39 25 43 83 122 139 143 152 161 147 108 77 84 116 136 130 113 102 97 95
-741 95 93 93 95 105 122 132 119 89 65 64 74 79 80 93 123 158 185 202 207 198 177 160 161 177 190 196 202 215 220 202 170 150 154 168 171 159 137 110 83 71 80 96 95
-760 95 74 52 45 50 53 54 52 47 45 57 86 115 125 122 125 140 159 173 191 218 247 267 274 272 262 245 221 190 155 121 99 92 96 102 105 104 100 95 90 87 81 75 78 93 105 97 71
-780 71 45 27 12 -3 -11 4 41 83 118 144 160 159 141 107 64 18 -21 -45 -47 -31 -1 41 95 147 174 164 123 75 35 11 2 6 17 30 41 51 66 94
-796 94 138 188 225 233 214 180 144 111 85 63 43 23 9 5 6 10 24 61 113 157 182 200 225 247 250 228 190 147 109 87 82 88 96 101 101 95 94 118 174 232 257
-814 257 251 250 272 297 296 271 244 227 211 180 133 83 53 51 58 51 28 11 16 36 56 75 96 116 129 134 132 122 106 97 97 93 74 54 53 77 110 141 167 182 179 156
-832 156 120 80 35 -6 -33 -39 -28 -11 4 16 21 23 32 47 62 68 64 51 34 21 20 25 28 33 50 76 95 98 95 98 103 100 86 68 52 48 68 110 154 181 195 211 228
-851 228 227 197 152 110 80 61 57 69 90 106 105 93 87 94 105 100 80 65 74 100 120 121 110 104 115 140 166 175 169 164 174 192 195 169 124 81 52 31 7 -20 -47
-869 -47 -60 -54 -29 2 30 44 44 44 60 93 126 141 138 129 124 120 120 129 143 149 143 134 131 127 109 79 59 63 88 119 151 185 219 235 223 189 150 115 85 61 52 57 60 44
-888 44 15 -3 2 28 59 84 103 122 148 176 190 178 153 139 140 139 121 93 74 67 65 65 69 76 80 81 85 89 86 73 62 56 54 56 66 84 98 101 104 122 159 202 236 250
-907 250 238 211 189 191 205 209 194 172 153 131 97 55 23 13 25 51 74 77 50 14 -2 8 26 25 6 -8 -2 17 37 49 54 58 60 54 41 29 26 27 18 -3 -23
-925 -23 -29 -27 -40 -67 -84 -74 -44 -15 6 36 80 130 172 198 209 203 188 180 192 213 223 211 186 159 134 115 113 134 166 184 178 151 113 71 35 25 49 92
-941 92 125 136 131 124 120 113 101 87 76 71 68 68 74 92 115 130 133 126 118 109 101 101 118 146 172 184 179 164 151 158 189 224 238 226 207 201 205 197 166 120 83 80 119 174 213
-961 213 223 220 227 241 243 227 203 181 159 131 102 83 77 84 97 114 131 147 162 176 188 189 176 158 150 162 177 172 143 110 100 112 126 125 113 107 122 156 195 224
-978 224 237 235 218 185 146 124 132 161 189 204 201 178 142 110 90 76 54 28 11 10 19 38 66 90 92 78 72 82 90 82 74 86 111 127 135 147 161 157 126 89 69
-996 69 67 63 45 23 12 17 29 37 38 39 47 68 102 141 171 174 143 96 55 35 38 67 118 178 222 237 227 202 173 143 117 97 87 91 112 143 168 175 163 139 110
-1014 110 85 71 69 69 66 59 52 47 42 34 22 5 -8 -11 0 17 29 38 57 92 128 148 148 143 147 158 160 143 114 91 84 88 89 77 60 48 46 44 36 32 45 74 96 86 50
-1033 50 12 -5 -4 9 42 98 164 211 218 189 138 88 54 39 26 -1 -40 -60 -48 -17 8 27 59 107 157 190 202 197 179 155 139 135 133 123 106 87 73
-1049 73 67 73 92 109 113 104 96 95 96 92 82 70 61 64 83 110 133 143 139 123 102 92 102 120 120 94 59 43 52 78 115 156 188 204 205 199 183 153 112 81 67 57
-1067 57 37 9 -9 -16 -19 -23 -16 15 59 86 85 75 76 90 107 124 149 172 182 179 181 188 184 162 144 152 173 179 160 133 116 105 89 74 71 83 100 110 110 103 89 64
-1086 64 33 13 16 34 52 62 71 79 79 71 66 72 80 86 101 131 156 158 139 111 76 32 -5 -15 5 43 84 122 139 122 92 85 110 138 145 140 133 128 128 141 160 156 125
-1104 125 96 93 107 123 155 213 273 298 288 270 253 223 177 132 95 63 41 47 75 92 79 48 23 13 18 38 60 60 29 -11 -31 -22 0 19 27 23 16 18 23
-1121 23 19 1 -24 -48 -67 -69 -42 6 48 66 73 87 108 126 145 167 179 170 151 143 145 137 115 96 90 89 82 75 84 108 134 155 169 178 178 171 161 156 159 155 135 105 85 86
-1140 86 95 97 95 96 100 101 103 117 142 163 174 178 176 163 144 128 118 109 105 116 144 173 186 178 153 121 99 100 115 122 123 138 178 225 258 279 288 269 211 143 108 111 128
-1159 128 141 153 164 157 136 128 153 192 209 193 158 120 90 77 87 108 123 130 142 166 199 236 271 285 263 218 183 175 178 173 159 155 165 180 197 216 230 225
-1175 225 204 180 159 140 126 124 125 106 59 6 -30 -48 -59 -62 -48 -15 25 58 72 63 41 26 27 34 38 43 59 81 93 89 82 86 96 101 91 63 21 -10 -11 20 59
-1193 59 86 104 124 142 152 154 158 161 149 111 55 3 -21 -8 28 63 82 94 111 134 141 120 81 44 25 21 21 20 22 30 40 50 60 73 85 88 85 88 95 91 64 34
-1211 34 28 52 86 109 116 119 126 138 145 134 100 56 25 20 39 68 99 125 139 139 124 100 80 71 76 90 107 121 118 90 46 13 5 15 32 48 57 42 5 -24 -20
-1229 -20 6 24 31 49 80 96 76 48 52 92 140 171 190 205 210 196 173 160 167 177 166 137 120 134 162 171 155 140 137 124 78 13 -38 -62 -61 -38 9 71
-1246 71 121 149 166 184 194 187 171 160 160 171 192 211 214 195 171 162 166 167 162 172 208 250 270 264 247 226 194 155 131 138 163 178 178 178 190 194 172 126 82 58 53
-1263 53 55 57 59 63 63 54 44 54 91 137 163 159 147 147 163 182 197 202 200 195 197 208 215 213 210 218 228 225 213 207 208 201 179 158 153 155 144 118 89 68 54 43 36 32 23 5 -13
-1284 -13 -22 -14 4 20 25 27 34 44 44 34 28 38 62 90 124 164 203 225 233 242 260 280 282 256 210 158 116 89 76 77 89 113 143 172 185 169 126 80 60 76
-1301 76 113 153 185 207 209 191 164 143 129 113 90 71 62 57 47 30 16 14 25 45 68 86 96 97 96 98 102 106 112 128 160 195 213 206 187 178 184 196 200 195 189 190 198 208
-1320 208 215 216 210 194 162 119 78 56 53 61 71 82 93 101 99 91 87 94 108 116 112 105 110 126 141 148 152 155 149 126 91 55 22 -1 -5 17 52 71 70 65 70 76 72 59 48 44 44
-1340 44 52 69 83 77 49 21 22 56 108 154 180 182 161 135 123 134 158 178 189 194 197 189 167 143 137 149 164 164 148 126 112 112 118 120 119 129 160 203 237 245 230 201
-1359 201 166 130 99 80 78 92 115 139 163 191 225 255 272 279 280 275 263 250 237 217 185 156 152 173 200 215 221 224 222 212 204 200 194 173 141 109 84 75 96 144
-1376 144 189 200 180 160 158 167 174 180 192 204 201 178 146 120 114 124 136 132 109 84 74 82 90 79 50 23 18 35 65 103 145 181 196 187 164 141 123 115 127 153
-1393 153 174 183 194 221 254 275 286 297 301 281 242 215 215 224 223 211 197 182 163 148 146 157 169 181 191 194 184 163 138 116 100 89 78 61 44 38 45 63 88
-1410 88 122 153 161 145 121 112 121 138 152 155 147 135 127 122 111 96 85 81 71 50 34 37 47 48 43 49 62 63 47 40 62 104 140 148 131 107 99 107 114 100 69 45 41 55
-1429 55 83 123 163 187 183 157 117 70 25 5 21 64 104 122 119 112 117 131 139 135 123 111 106 109 122 140 148 141 132 140 161 171 158 134 111 96 94 110 138 161 166 159
-1448 159 146 121 85 61 69 105 137 144 129 109 101 113 140 167 185 196 198 181 146 117 117 134 137 116 96 99 116 121 106 85 72 71 78 86 85 72 46 15 -13 -33
-1465 -33 -43 -47 -47 -37 -10 30 75 116 151 180 195 194 189 190 193 186 166 144 131 128 133 146 160 161 144 130 146 193 240 259 254 248 254 268 277 277 268 256 243 233 224 209 181
-1483 181 141 96 50 7 -24 -38 -30 -1 38 78 113 143 165 172 169 178 209 241 239 196 140 99 73 52 41 47 67 85 88 80 67 58 59 67 63 42 26 35 62 78 79
-1501 79 88 118 153 174 182 187 188 183 178 187 206 225 239 248 244 212 152 84 39 34 62 102 130 136 127 119 123 138 154 162 159 149 137 124 112 104 100 98 90 81 86 113 149 173 181 184 189
-1522 189 190 180 166 156 150 141 122 99 80 67 59 49 34 18 12 26 51 70 71 63 66 82 100 106 102 99 105 116 122 121 126 147 180 200 186 148 119 110 103 76 38 13 5
-1540 5 6 13 39 78 101 85 41 4 0 23 55 77 88 107 143 182 201 198 191 190 182 160 134 113 93 70 57 65 86 100 106 114 120 117 109 106 101 81 49 24 14 7 -7
-1559 -7 -17 -11 0 4 9 35 80 123 147 156 161 166 167 163 160 161 164 170 184 202 202 163 102 58 54 71 82 88 105 134 153 150 129 93 40 -15 -55 -77 -100 -129 -147 -143 -128 -105
-1578 -105 -58 10 65 78 70 82 119 145 133 100 73 56 44 36 39 57 88 125 161 184 190 177 150 117 91 78 71 64 57 59 62 56 43 38 41 44 47 65 106 155 194
-1596 194 217 226 223 213 211 223 236 236 227 221 217 198 155 101 54 31 38 73 121 163 181 169 130 81 40 23 26 39 59 89 120 135 130 114 98 74 33 -15 -45
-1613 -45 -37 0 38 53 48 42 41 32 9 -8 3 37 63 67 69 88 110 109 86 71 81 97 99 87 81 87 99 113 135 167 200 225 239 246 245 232 207 177 149 128 106
-1630 106 75 38 8 -5 -8 -13 -19 -18 -6 14 39 69 96 110 108 104 105 104 92 75 64 53 28 -5 -30 -33 -23 -7 12 34 45 46 51 71 94 104 104 109 125 141 154
-1648 154 165 174 173 164 159 166 174 169 152 131 107 78 52 45 58 77 89 101 121 142 151 143 132 128 127 126 129 146 173 191 193 181 163 133 90 49 24 14 11 11 12 7 -5 -14
-1667 -14 -1 30 57 68 76 93 109 112 110 122 144 150 133 114 116 133 144 138 118 98 88 98 126 163 195 209 204 184 152 115 74 36 11 6 22 50 80 103 118
-1684 118 125 123 109 79 39 14 21 51 68 48 7 -12 9 56 97 117 126 137 154 162 152 129 109 99 95 92 95 104 111 106 91 82 81 81 74 63 50 30 3 -19 -26 -19 -9
-1703 -9 0 14 33 51 62 75 102 146 194 229 239 228 204 178 159 148 144 140 127 101 63 20 -15 -36 -43 -47 -59 -71 -70 -48 -10 31 72 105 120 117 110 110 115 115 106
-1721 106 91 72 54 42 37 36 42 60 89 108 99 69 43 29 16 -1 -12 -3 23 59 98 131 143 136 129 139 156 157 137 115 106 105 98 80 59 46 57 92 133 155
-1738 155 155 153 164 180 184 177 174 186 201 203 191 175 164 161 172 200 232 241 212 166 132 119 116 114 121 135 142 132 116 101 79 45 23 36 75 102 101 90 91 103 105 90
-1756 90 68 56 65 89 101 87 55 29 22 28 38 50 60 60 46 27 12 7 16 40 65 72 59 40 33 44 71 104 126 122 101 91 104 121 119 107 101 99 92 83 84 91 93
-1775 93 94 109 134 149 149 144 137 113 72 39 34 50 74 111 164 213 234 222 195 168 146 131 124 122 123 133 160 196 222 224 208 189 178 176 181 186 183 173 157 140 130
-1793 130 133 146 156 153 143 139 144 148 149 151 155 149 129 105 90 88 93 105 130 169 215 252 273 275 268 264 264 259 240 214 195 179 149 99 50 32 55 102 148 187 215 223 200
-1811 200 153 106 83 85 96 106 107 97 76 49 30 29 40 48 41 28 26 41 59 64 59 66 93 130 158 177 192 203 203 189 174 172 191 223 256 275 276 261 241 222
-1829 222 208 203 205 200 177 137 92 53 25 18 41 84 119 130 122 105 87 69 63 73 89 95 92 99 119 137 136 119 103 97 93 78 50 24 15 22 31 32 30 35 49 63 69 69
-1848 69 68 67 71 77 82 83 84 90 103 125 156 191 212 210 198 195 200 192 167 139 117 97 74 61 62 64 54 42 48 66 77 84 102 134 158 162 160 168 179 181 178 179 184 182 170 158 156
-1868 156 166 186 210 220 203 168 134 114 103 91 76 64 55 43 21 -10 -36 -39 -16 14 37 51 61 69 74 83 103 124 130 121 117 136 166 189 195 187 171 161 177
-1885 177 219 265 284 275 255 235 211 181 156 144 147 158 172 183 187 182 175 172 167 154 134 113 94 75 53 35 31 49 86 123 144 140 116 84 56 42 47 69 101
-1902 101 132 150 156 159 167 176 175 163 149 140 134 127 126 133 141 143 139 136 136 136 144 163 186 198 195 184 167 138 96 57 32 21 21 36 66 100 123 134 142 156 171 183 187 178 161
-1921 161 150 154 170 185 189 179 161 142 131 126 115 94 73 63 67 82 103 125 134 123 101 88 91 103 114 120 122 119 117 116 113 106 100 100 101 96 99 129 174 200 185 149 117
-1940 117 96 81 80 100 125 129 108 86 83 101 136 182 222 232 211 181 160 148 140 143 161 183 187 168 138 106 73 44 28 33 55 78 81 58 24 12 38 83
-1956 83 119 140 155 161 146 114 90 83 76 57 41 49 74 91 93 87 87 94 107 122 125 108 91 98 121 130 121 117 131 141 126 102 103 129 149 151 149 151 148 135 123 121 126 128 136 161
-1976 161 198 225 228 215 201 193 187 178 166 157 153 146 134 122 118 127 147 174 201 214 202 174 149 135 122 106 98 112 144 172 181 170 147 119 99 96 109 125 133 122 90
-1994 90 48 15 6 18 27 19 -4 -29 -42 -40 -28 -14 -2 11 26 40 48 52 56 60 62 63 70 83 94 94 83 72 73 91 117 136 140 135 132 138 154 177 200 217 223 213 180 126
-2013 126 77 65 95 139 161 154 130 101 77 69 82 105 119 123 126 133 140 150 170 193 201 191 179 178 181 176 166 160 157 150 140 132 127 127 136 146 142 119 92 75 68 59 53 58 68
-2033 68 77 87 106 129 139 127 101 71 42 21 13 11 1 -23 -52 -70 -71 -51 -12 29 53 53 53 73 106 131 144 154 171 191 202 201 197 203 227 257 265 233 177 130
-2050 130 111 102 88 73 72 83 86 70 43 19 5 0 2 5 4 -1 3 32 79 123 151 168 187 216 251 281 293 275 223 157 106 88 93 94 66 13 -41 -68 -62 -38
-2067 -38 -13 9 33 53 62 68 79 100 120 133 136 125 91 49 26 42 80 108 111 98 90 94 110 130 144 139 113 79 54 46 49 50 46 43 49 62 64 47 28 32 67 113
-2086 113 149 178 212 247 264 248 208 160 118 80 47 28 36 68 104 120 112 97 90 91 94 100 111 121 122 113 106 110 126 159 209 267 309 317 299 271 239 205 178 169
-2103 169 168 161 144 130 121 110 99 106 141 189 221 225 208 180 150 128 116 104 84 67 65 72 70 63 66 80 80 54 20 9 31 65 89 94 86 85 105 149 197 223 215 184
-2121 184 149 127 122 126 127 119 108 107 120 145 176 206 234 264 295 318 318 296 268 247 228 204 179 166 164 164 160 158 157 154 149 152 171 198 213 208 190 172 152 122 81 48
-2139 48 47 77 112 133 140 143 140 126 105 93 96 104 110 120 136 148 142 126 116 121 137 151 163 176 189 194 179 148 114 98 106 134 165 186 189 176 159 150 146 142 138 141 144 133
-2158 133 106 78 62 57 58 69 92 124 157 191 225 248 252 243 238 240 230 197 151 119 112 126 144 153 146 124 94 64 37 19 15 30 56 76 77 67 63 69 67 46 14
-2176 14 -4 -6 -7 -13 -6 22 54 71 80 102 132 138 105 59 32 29 32 32 33 47 74 113 154 184 191 170 132 95 77 86 116 145 155 142 119 101 98 108 117 115 109 115 137
-2195 137 160 166 158 143 120 87 56 49 68 86 85 71 65 78 100 120 129 126 116 107 100 93 85 80 79 72 62 60 78 104 120 127 142 172 201 211 202 184 168 157 154 159 169 186
-2214 186 214 251 277 272 240 208 197 207 225 243 256 265 274 292 315 330 325 300 267 234 204 177 157 139 122 107 103 113 132 159 187 205 199 173 150 148 163 185
-2230 185 213 247 267 248 192 136 112 115 119 109 89 69 56 54 69 95 115 118 114 119 136 153 155 145 132 120 110 103 100 105 113 116 103 75 44 28 37 64 98 131 164
-2248 164 194 221 247 269 274 250 207 175 169 179 184 179 175 174 167 154 149 160 173 172 159 153 158 163 161 154 144 123 91 67 65 80 96 102 104 106 108 108 104 95 80 67 62 60 48 29
-2268 29 20 31 53 70 78 88 103 122 142 159 165 147 110 75 62 69 74 59 34 19 24 39 54 74 107 140 148 128 107 108 128 143 143 140 147 162 178 192 206 215 216
-2286 216 203 167 110 50 12 3 11 23 42 69 94 102 94 83 82 91 112 143 176 196 194 172 142 117 99 84 66 44 28 28 47 78 111 140 159 170 181 195
-2302 195 210 217 217 211 198 178 157 138 124 117 125 154 190 206 190 155 126 121 143 181 217 232 227 214 203 189 163 132 113 109 110 109 107 107 103 86 62 43 40 52 73
-2320 73 98 117 122 114 102 90 75 58 49 63 96 128 145 147 144 130 96 44 1 -18 -29 -54 -93 -119 -113 -87 -66 -56 -51 -46 -46 -53 -61 -58 -42 -18 4 17 21 30 60 105
-2338 105 138 139 122 116 129 149 165 177 186 181 158 130 114 108 96 74 58 64 92 120 130 123 122 143 177 198 190 160 132 121 131 157 189 215 228 231 231 235 244 253 252 235
-2357 235 219 225 254 286 298 296 293 299 305 306 300 287 268 248 227 201 167 132 101 71 40 24 34 61 79 78 73 74 77 81 96 129 168 187 179 153 129 118 109 90 60
-2374 60 35 26 30 32 33 41 60 83 103 119 126 113 84 55 38 36 54 87 114 110 74 39 30 44 65 88 110 127 136 144 154 153 137 127 137 153 150 131 123 133 147 156
-2393 156 166 183 200 214 230 252 269 269 253 230 210 205 214 222 214 200 197 207 213 204 189 174 155 130 111 106 105 97 82 67 60 74 116 176 221 227 206 181 160 137 119
-2410 119 122 144 160 148 116 92 93 114 134 139 131 121 119 133 170 226 283 313 303 263 223 206 212 222 223 220 228 251 271 269 255 254 267 271 251 224 211 209 199 175 146
-2428 146 122 110 118 146 174 182 170 153 137 122 115 125 146 159 152 135 118 107 105 113 125 130 129 131 138 147 158 181 214 235 228 206 193 198 212 226 241 259 276 288 296
-2446 296 302 308 305 283 243 200 170 156 147 139 140 146 140 124 117 135 157 152 115 75 47 23 -9 -42 -59 -62 -59 -49 -23 11 41 55 52 33 -5 -56 -99 -120 -120 -106 -79
-2464 -79 -30 32 86 108 101 88 89 108 133 144 123 71 13 -19 -22 -8 6 24 50 75 92 103 121 151 187 221 241 241 219 185 158 141 126 107 87 73 66
-2480 66 65 70 85 108 133 157 176 185 187 190 201 216 224 223 221 226 239 257 276 293 303 301 293 289 296 300 291 272 262 268 276 266 237 203 171 135 92 55 41 50 79 121 158 167
-2499 167 135 83 51 57 85 112 133 151 161 149 114 70 31 8 2 14 35 57 77 100 124 143 157 177 205 229 237 231 227 224 209 175 131 95 75 73 90 124
-2515 124 158 170 155 126 98 82 78 84 98 115 132 149 169 185 188 173 147 123 109 115 140 172 191 188 179 186 215 236 226 190 161 165 192 209 188 131 69 32
-2532 32 31 50 71 83 92 97 94 86 83 84 75 48 15 1 12 30 41 48 60 84 120 159 186 182 152 122 119 139 162 174 173 158 127 90 63 55 60 69 77 84 84 78 76 84 97
-2551 97 106 113 127 141 140 120 90 59 24 -11 -36 -38 -25 -18 -21 -21 0 40 80 96 81 57 48 58 63 52 43 54 74 79 63 48 40 24 -7 -39 -48 -30 3 44 86
-2569 86 122 143 145 131 108 84 78 95 121 133 122 101 86 92 120 160 185 178 151 132 131 135 133 129 133 147 160 162 142 103 57 25 11 10 19 41 68 79 67 48 43
-2587 43 60 86 113 138 151 146 124 100 82 73 77 102 143 182 194 171 129 90 73 77 91 110 133 160 179 183 173 156 135 110 85 72 74 85 98 118 148 183
-2603 183 213 238 261 284 294 282 250 212 177 146 114 89 77 80 88 98 114 134 148 151 149 158 176 189 186 171 159 154 148 133 107 83 75 88 111 127 125 110 88
-2620 88 66 46 34 31 35 42 53 72 103 139 169 182 183 181 175 156 124 93 83 96 115 126 124 118 115 113 105 87 66 56 68 90 105 105 100 100 104 104 101 98 97 91 76 57 38
-2640 38 27 27 35 39 30 12 0 2 10 15 17 14 0 -25 -48 -47 -27 -11 -14 -23 -8 39 99 143 155 142 122 109 101 94 81 63 43 22 9 17 48 83 104 110 116 127 132 121
-2659 121 101 86 83 90 101 105 91 58 27 13 12 7 -3 -3 12 28 23 0 -26 -48 -62 -61 -39 -2 28 40 37 35 43 62 87 114 134 143 143 141 144 147 142 127 106 88 77
-2677 77 74 80 94 110 124 141 164 186 193 184 175 187 223 265 293 296 281 268 264 263 254 231 195 151 115 110 149 210 255 267 255 235 205 168 143 137 135 118 92 79 81
-2695 81 76 53 21 -4 -17 -19 -13 -6 -4 -5 2 16 29 44 74 121 168 201 217 221 213 192 168 146 126 110 105 110 110 98 81 73 72 68 57 49 45 45 51 63 74 74 69 72 83 88
-2715 88 82 74 68 58 43 29 26 34 54 87 130 165 177 170 166 179 204 222 221 200 167 128 87 52 34 40 64 92 118 146 171 186 187 181 168 143 106 68 33 -2
-2732 -2 -41 -66 -67 -54 -42 -29 -1 37 69 88 105 130 155 171 180 189 196 196 187 177 171 173 184 198 211 220 216 191 144 95 71 74 80 70 47 27 20 24 35 50 68 88
-2751 88 106 116 114 109 118 138 155 159 161 174 190 196 191 184 183 186 199 224 248 253 239 225 223 232 238 227 192 138 88 68 79 104 124 146 174 200 210 199 181 173 185 209
-2769 209 226 220 197 175 161 146 122 101 100 118 138 151 162 171 170 154 129 100 75 55 51 65 91 116 133 140 139 129 117 120 143 170 175 149 117 106 115 122 112 99
-2786 99 96 101 104 103 105 113 122 124 122 118 118 128 145 164 178 191 208 231 256 274 275 251 212 181 175 187 201 213 220 211 173 111 54 23 14 12 12 15 21 26 26 26 34 58 91 115 118
-2807 118 106 98 103 111 105 81 51 35 46 77 103 106 95 90 98 112 119 121 117 107 94 93 110 131 138 134 135 146 157 155 145 145 159 170 162 139 123 126 136 136 130 135 151 154 127
-2826 127 85 56 49 55 66 78 90 97 99 103 111 123 133 131 110 80 61 57 54 44 48 88 148 196 215 219 216 196 158 117 88 69 58 65 91 118 129 130 139 159 173 176
-2844 176 166 144 103 55 20 7 9 20 46 83 108 106 87 76 84 93 89 70 51 50 70 105 137 152 143 117 84 57 43 40 37 24 8 1 8 22 39 60 83 97
-2862 97 96 87 87 105 131 156 178 200 225 247 254 237 196 147 109 88 81 80 76 64 49 46 63 92 114 122 127 142 158 166 166 169 173 171 161 153 155 167 181 191 190 176 156 143
-2881 143 140 133 111 73 38 24 38 69 98 106 91 70 68 92 125 145 143 131 123 119 109 94 88 100 120 130 127 124 130 139 142 145 157 179 205 222 226 223 223 233 246 253 249 236
-2900 236 219 197 177 171 184 207 223 222 208 189 173 159 142 125 114 115 126 137 143 141 129 106 84 79 101 138 167 184 199 218 234 241 241 236 218 175 117 68 47
-2917 47 52 67 79 87 94 102 117 140 167 184 179 157 131 115 116 130 142 140 121 92 66 50 46 54 68 75 69 55 47 50 64 83 101 109 109 116 148 198 243 268 278 278 262
-2935 262 228 190 163 151 146 144 140 125 99 76 74 91 111 122 125 121 114 113 127 145 151 140 125 118 117 118 117 110 91 68 54 52 55 60 71 89 103 107 108 117 131 140 137 123 104
-2955 104 94 99 110 106 84 66 68 78 77 67 66 81 102 120 137 151 150 135 121 121 131 138 138 138 145 156 168 173 170 162 160 171 189 200 201 197 198 207 221 232 238 241 243 246 248 242 224
-2975 224 197 171 155 146 133 114 97 87 75 52 26 9 3 -6 -21 -25 -4 31 59 70 70 68 65 63 71 89 105 110 108 113 128 137 130 113 96 86 81 83 95 115 133 141 142
-2994 142 137 127 120 127 147 159 147 119 102 106 111 104 92 92 107 124 134 137 136 128 113 94 75 62 59 65 72 70 61 61 84 129 178 213 224 213 187 154 124 104 98 99 97 88
-3013 88 76 68 69 76 86 92 95 100 116 141 158 153 128 100 84 82 91 108 125 133 128 119 115 115 116 116 115 116 114 108 97 86 76 72 74 83 92 99 98 91 84 88 108 134 144 134 118 113 122 137
-3035 137 154 176 199 214 215 207 196 181 156 126 106 106 123 143 153 149 137 129 130 136 140 139 138 139 137 127 112 103 104 111 116 118 119 120 122 126 129 119 83 27 -18 -28 -2 30 44
-3054 44 40 35 43 59 76 85 87 84 82 85 87 77 57 49 71 112 145 154 150 151 158 159 149 137 130 126 114 92 70 59 61 67 67 59 50 50 59 71 82 88 89 82 69 62 65 72 74 74 80 90 96 95
-3077 95 103 126 157 173 167 150 133 120 110 108 123 153 182 188 166 135 121 132 144 135 110 89 87 93 92 85 79 78 75 65 55 55 72 103 136 164 185 200 206 199 184 176 187
-3095 187 212 236 243 232 215 196 174 142 108 87 91 111 127 131 127 124 126 130 132 129 120 112 115 129 146 153 152 152 161 175 189 198 203 206 213 223 232 232 217 191 157 124 102 101 121 147
-3115 147 164 171 177 189 201 201 186 159 130 111 115 139 167 182 175 157 143 140 145 148 144 139 140 149 155 154 151 157 165 166 155 146 145 146 143 140 147 157 156 134 105 86 89 108 129
-3135A29
##END=	
##END=	
