##TITLE=	Jan24-2022.90.fid
TM-VI-254, Na+unprotect. pyr.

##JCAMP-DX=	6.0	$$ MestReNova 14.3.0-30573
##DATA TYPE=	LINK
##BLOCK_ID=	1
##BLOCKS=	2    
##ORIGIN=	Mestrelab Research S.L.
##OWNER=	hrzepa
##$MNOVA/LINK_BLOCK_TYPE=	ITEM	$$ NMR Spectrum
##$MNOVA/ITEM/POLYGON=	(XY..XY)
5321,5835
8722,5835
8722,8208
5321,8208
5321,5835
##$MNOVA/ITEM/Z=	0
##$MNOVA/ITEM/ANGLE=	0
##TITLE=	Jan24-2022.90.fid
##JCAMP-DX=	6.0	$$ MestReNova 14.3.0-30573
##BLOCK_ID=	2
##DATA TYPE=	MNOVA NMR VIEW DATA
##DATA CLASS=	MNOVA VIEW DATA
##$MNOVA/ITEM/ZOOM/X=	-4.0107147498308073352,	16.011019999997905927
##$MNOVA/ITEM/ZOOM/Y=	-637.62014198303222656,	7032.83709716796875
##END=	
##TITLE=	Jan24-2022.90.fid
##JCAMP-DX=	6.0	$$ MestReNova 14.3.0-30573
##BLOCK_ID=	3
##DATA TYPE=	NMR SPECTRUM
##DATA CLASS=	XYDATA
##NUMDIM=	1
##ORIGIN=	Bruker BioSpin GmbH
##OWNER=	nmr
##.OBSERVE FREQUENCY=	400.20240119999999706
##.OBSERVE NUCLEUS=	^1H
##.SOLVENT NAME=	MeOD
##.PULSE SEQUENCE=	zg30
##LONGDATE=	2022/01/24 17:19:00.000
##.ACQUISITIONMODE=	SIMULTANEOUS (DQD)
##$ORIGINAL FORMAT=	Bruker XWIN-NMR
##$MNOVA/SCALES_VERSION=	9
##$PARAMETER FILE=	(acqus, ASCII, /private/var/folders/f6/rjf_tdyn2v98c5c0wvkgn4s80000gn/T/GczYYo$JRXaZyXzyI3hHgw/90/acqus, 0)
$$ ##TITLE= Parameter file, TOPSPIN		Version 3.2
$$ ##JCAMPDX= 5.0
$$ ##DATATYPE= Parameter Values
$$ ##NPOINTS= 11	$$ modification sequence number
$$ ##ORIGIN= Bruker BioSpin GmbH
$$ ##OWNER= nmr
$$ $$ 2022-01-24 17:19:45.359 +0000  nmr@CZC2439F63
$$ $$ /opt/topspin/data/agmb/nmr/Jan24-2022/90/acqus
$$ $$ process /opt/topspin3.2/prog/mod/shimcntl
$$ ##$ACQT0= -2.36344537815126
$$ ##$AMP= (0..31)
$$ 100 100 100 100 100 100 100 100 100 100 100 100 100 100 100 100 100 100
$$ 100 100 100 100 100 100 100 100 100 100 100 100 100 100
$$ ##$AMPCOIL= (0..19)
$$ 0 0 0 0 0 0 0 0 0 0 0 0 0 0 0 0 0 0 0 0
$$ ##$ANAVPT= -1
$$ ##$AQSEQ= 0
$$ ##$AQ_mod= 3
$$ ##$AUNM= <au_zg>
$$ ##$AUTOPOS= <54 >
$$ ##$BF1= 400.2
$$ ##$BF2= 400.2
$$ ##$BF3= 400.2
$$ ##$BF4= 400.2
$$ ##$BF5= 400.2
$$ ##$BF6= 400.2
$$ ##$BF7= 400.2
$$ ##$BF8= 400.2
$$ ##$BYTORDA= 0
$$ ##$CAGPARS= (0..11)
$$ 0 0 0 0 0 0 0 0 0 0 0 0
$$ ##$CFDGTYP= 0
$$ ##$CFRGTYP= 9
$$ ##$CHEMSTR= <none>
$$ ##$CNST= (0..63)
$$ 1 1 145 1 1 1 1 1 1 1 1 1 1 1 1 1 1 1 1 1 1 1 1 1 1 1 1 1 1 1 1 1 1 1 1
$$ 1 1 1 1 1 1 1 1 1 1 1 1 1 1 1 1 1 1 1 1 1 1 1 1 1 1 1 1 1
$$ ##$CPDPRG= (0..8)
$$ <> <> <> <> <mlev> <mlev> <mlev> <mlev> <mlev>
$$ ##$D= (0..63)
$$ 0 1 0 0 0 0 0 0 0 0.06 0 0 0 0 0 0 0.0002 0 0 0 0 0 0 0 0 0 0 0 0 0 0 0
$$ 0 0 0 0 0 0 0 0 0 0 0 0 0 0 0 0 0 0 0 0 0 0 0 0 0 0 0 0 0 0 0 0
$$ ##$DATE= 1643044784
$$ ##$DE= 6.5
$$ ##$DECBNUC= <off>
$$ ##$DECIM= 2496
$$ ##$DECNUC= <off>
$$ ##$DECSTAT= 4
$$ ##$DIGMOD= 1
$$ ##$DIGTYP= 12
$$ ##$DQDMODE= 0
$$ ##$DR= 22
$$ ##$DS= 2
$$ ##$DSPFIRM= 0
$$ ##$DSPFVS= 20
$$ ##$DTYPA= 0
$$ ##$EXP= <proton>
$$ ##$F1LIST= <111111111111111>
$$ ##$F2LIST= <222222222222222>
$$ ##$F3LIST= <333333333333333>
$$ ##$FCUCHAN= (0..9)
$$ 0 2 0 0 0 0 0 0 0 0
$$ ##$FL1= 90
$$ ##$FL2= 90
$$ ##$FL3= 90
$$ [...]
$$ 90 74 58 42 26 10 0 0
$$ ##$Sgu3PowerLevels= (0..7)
$$ 0 0 0 0 0 0 0 0
$$ ##$Sgu4PowerLevels= (0..7)
$$ 0 0 0 0 0 0 0 0
$$ ##$Sgu5PowerLevels= (0..7)
$$ 0 0 0 0 0 0 0 0
$$ ##$Sgu6PowerLevels= (0..7)
$$ 0 0 0 0 0 0 0 0
$$ ##$Sgu7PowerLevels= (0..7)
$$ 0 0 0 0 0 0 0 0
$$ ##$Sgu8PowerLevels= (0..7)
$$ 0 0 0 0 0 0 0 0
$$ ##$SguType= 3
$$ ##$ShimPowMaxUA= (0..63)
$$ 130000 130000 130000 130000 130000 130000 130000 130000 130000 130000 130000
$$ 130000 130000 130000 130000 130000 130000 130000 130000 130000 0 0 0 0
$$ 0 0 0 0 0 0 0 0 0 0 0 0 0 0 0 0 0 0 0 0 0 0 0 0 0 0 0 0 0 0 0 0 0 0 0 0
$$ 0 0 0 0
$$ ##$ShimPowMaxUC= (0..63)
$$ 130000 130000 130000 130000 130000 130000 130000 130000 130000 130000 130000
$$ 130000 130000 130000 130000 130000 130000 130000 130000 130000 0 0 0 0
$$ 0 0 0 0 0 0 0 0 0 0 0 0 0 0 0 0 0 0 0 0 0 0 0 0 0 0 0 0 0 0 0 0 0 0 0 0
$$ 0 0 0 0
$$ ##$ShimPowMaxUG= (0..63)
$$ 524287 524287 524287 524287 524287 524287 524287 524287 524287 524287 524287
$$ 524287 524287 524287 524287 524287 524287 524287 524287 524287 0 0 0 0
$$ 0 0 0 0 0 0 0 0 0 0 0 0 0 0 0 0 0 0 0 0 0 0 0 0 0 0 0 0 0 0 0 0 0 0 0 0
$$ 0 0 0 0
$$ ##$ShimPowRcbType= 3
$$ ##$ShimPowRes= (0..63)
$$ 1e-20 1e-20 1e-20 1e-20 1e-20 1e-20 1e-20 1e-20 1e-20 1e-20 1e-20 1e-20
$$ 1e-20 1e-20 1e-20 1e-20 1e-20 1e-20 1e-20 1e-20 0 0 0 0 0 0 0 0 0 0 0 0
$$ 0 0 0 0 0 0 0 0 0 0 0 0 0 0 0 0 0 0 0 0 0 0 0 0 0 0 0 0 0 0 0 0
$$ ##$ShimPowRng0= (0..63)
$$ 1 1 1 1 1 1 1 1 1 1 1 1 1 1 1 1 1 1 1 1 0 0 0 0 0 0 0 0 0 0 0 0 0 0 0 0
$$ 0 0 0 0 0 0 0 0 0 0 0 0 0 0 0 0 0 0 0 0 0 0 0 0 0 0 0 0
$$ ##$ShimPowRng1= (0..63)
$$ 1 1 1 1 1 1 1 1 1 1 1 1 1 1 1 1 1 1 1 1 0 0 0 0 0 0 0 0 0 0 0 0 0 0 0 0
$$ 0 0 0 0 0 0 0 0 0 0 0 0 0 0 0 0 0 0 0 0 0 0 0 0 0 0 0 0
$$ ##$ShimPowRng2= (0..63)
$$ 1 1 1 1 1 1 1 1 1 1 1 1 1 1 1 1 1 1 1 1 0 0 0 0 0 0 0 0 0 0 0 0 0 0 0 0
$$ 0 0 0 0 0 0 0 0 0 0 0 0 0 0 0 0 0 0 0 0 0 0 0 0 0 0 0 0
$$ ##$ShimPowRng3= (0..63)
$$ 1 1 1 1 1 1 1 1 1 1 1 1 1 1 1 1 1 1 1 1 0 0 0 0 0 0 0 0 0 0 0 0 0 0 0 0
$$ 0 0 0 0 0 0 0 0 0 0 0 0 0 0 0 0 0 0 0 0 0 0 0 0 0 0 0 0
$$ ##$ShimSysFunc= (0..63)
$$ 1 2 3 4 5 7 9 11 15 16 8 10 12 14 6 17 13 18 19 20 0 0 0 0 0 0 0 0 0 0
$$ 0 0 0 0 0 0 0 0 0 0 0 0 0 0 0 0 0 0 0 0 0 0 0 0 0 0 0 0 0 0 0 0 0 0
$$ ##$ShimSysMatrix= 0
$$ ##$ShimSysType= 1
$$ ##$TFXNUM= 0
$$ ##$TRIPLO2= 0
$$ ##$VTU= 2
$$ ##$VTUETH= <149.236.99.20>
$$ ##$VTUTY= <no>
$$ ##$WBREFAM= (0..15)
$$ 135.5 97.7 100 100 100 100 100 100 100 100 100 100 100 100 100 100
$$ ##$WBREFLM= (0..15)
$$ 0 0 0 0 0 0 0 0 0 0 0 0 0 0 0 0
$$ ##$WBREFPH= (0..15)
$$ 72.26 -67.22 0 0 0 0 0 0 0 0 0 0 0 0 0 0
$$ ##$WBSGU= (0..15)
$$ 0 0 0 0 0 0 0 0 0 0 0 0 0 0 0 0
$$ ##$XFAC= 2
$$ ##END=
$$ 
##$DECIM=	2496
##$DSPFVS=	20
##XUNITS=	HZ
##YUNITS=	ARBITRARY UNITS
##FIRSTX=	6407.6102040000005218
##LASTX=	-1605.0880428824991668
##DELTAX=	-0.12226593800080109986
##XFACTOR=	1
##YFACTOR=	0.019997228428046114751
##FIRSTY=	10.787198066711425781
##MINY=	1.7286739349365234375
##MAXY=	6393.48828125
##NPOINTS=	65536
##XYDATA=	(X++(Y..Y))
$$ [...]
4122 473 486 504 528 559 594 619 618 580 515 444 386 342 313 320 381 470 533 547 543 544 532 484 421 384 376 375 379 406 445 464 460 473 511 533 505 459 446 461 461
4117 461 440 438 476 518 525 508 504 520 524 494 436 374 332 322 340 360 367 382 437 519 572 554 488 431 414 424 436 441 445 453 463 463 448 420 393 376 367 367 384 413
4113 413 431 427 422 438 457 439 376 309 279 294 337 386 426 444 437 416 399 396 411 436 457 469 480 499 519 525 515 495 464 427 413 449 508 531 497 452 451 478
4108 478 480 436 391 391 433 474 496 522 574 623 615 543 463 430 435 436 431 453 512 566 577 541 481 425 398 412 441 445 425 419 446 479 495 500 497 466 411 381 401 435
4103 435 438 423 426 431 397 335 299 311 347 398 472 546 562 506 437 410 423 446 471 499 513 492 444 399 374 374 396 428 447 441 426 419 412 392 362 346 357 385
4098 385 407 407 390 368 348 334 336 367 411 424 388 349 366 433 491 503 487 467 440 407 394 413 435 429 410 414 442 463 457 436 421 427 463 514 539 509 440 384
4094 384 375 408 455 494 510 502 481 460 443 437 451 484 518 536 543 555 577 600 612 603 566 506 444 407 406 435 475 501 502 485 465 447 430 420 422 422 400 362 341
4089 341 352 381 409 431 442 433 410 392 375 344 314 327 390 449 465 461 466 459 419 385 412 475 498 452 388 355 352 362 373 378 377 393 435 467 446 389 357 364 373
4084 373 359 338 310 256 200 211 306 416 476 503 536 563 547 498 460 440 415 386 375 384 395 407 433 466 491 513 542 566 562 536 505 467 422 398 421
4080 421 464 473 442 420 432 443 421 382 357 350 357 387 431 449 412 350 319 332 360 376 386 403 420 424 414 407 419 452 485 496 476 443 423 425 440 450 443 423
4075 423 415 439 486 516 511 495 499 517 518 499 493 513 531 512 461 422 425 457 487 497 488 474 467 462 446 417 391 391 419 457 482 485 473 458 448 444 433 406 376 373 415
4070 415 485 546 572 561 528 496 484 488 482 460 440 440 446 442 447 487 538 542 494 460 484 521 511 464 432 417 384 342 347 404 444 415 355 332 351 373 390 428 475
4065 475 483 435 375 351 364 384 403 427 443 437 426 439 474 495 485 469 474 487 475 432 382 356 370 426 494 523 484 423 412 461 505 483 420 379 381 389 380 374
4061 374 393 427 449 450 444 438 426 407 395 401 411 398 365 344 358 382 378 347 328 350 397 441 466 470 464 476 525 590 623 608 574 541 494 435 410 445 497 498 448
4056 448 397 374 367 372 390 396 371 345 370 427 445 398 347 344 372 398 423 455 475 471 469 485 483 430 368 365 422 477 489 476 468 469 478 502 541 573 578 561 538 515 492
4051 492 469 451 439 427 419 438 504 586 610 538 428 379 405 434 416 382 374 383 385 395 429 452 429 393 406 462 505 515 518 528 521 492 468 460 449 432 435 463
4046 463 483 482 484 497 489 443 391 366 359 349 347 366 392 396 381 362 340 306 279 285 325 376 422 460 482 486 489 514 557 588 582 545 496 452 421 401 388 387 403 434
4042 434 463 481 487 483 471 468 490 521 522 483 445 450 497 546 558 521 450 398 414 487 542 524 456 403 392 401 408 406 397 391 412 459 497 492 464 454 475 509 542 562
4037 562 552 523 519 566 618 610 551 497 462 412 342 293 287 305 331 369 401 395 369 379 426 447 420 402 427 452 443 440 480 521 509 469 456 456 436 431 489 569 580
4032 580 525 496 523 544 522 502 507 492 436 400 431 484 490 462 453 471 484 486 487 477 451 440 466 487 462 425 436 477 481 441 425 463 496 479 441 424 416 389
4027 389 352 328 317 310 323 357 378 353 305 288 312 339 342 333 337 360 389 417 440 461 482 493 488 475 472 479 468 424 372 345 350 371 398 424 430 408 379 375 390 401
4022 401 401 409 431 456 469 470 462 456 474 516 539 503 433 403 443 510 548 556 554 544 513 469 431 411 409 420 432 435 446 496 576 617 570 468 401 410 454 476 457
4018 457 422 394 383 387 397 401 391 373 363 379 423 474 504 504 497 503 517 517 488 431 373 352 383 437 462 449 444 474 505 486 426 375 361 372 397 431 455 440
4013 440 393 361 374 412 441 449 446 443 450 472 496 502 489 482 496 514 508 476 441 438 474 512 502 441 394 412 462 467 414 372 389 429 439 420 419 455 501 518 485 420
4008 420 371 377 412 415 374 345 366 400 408 410 446 491 494 462 448 462 457 414 367 345 346 364 407 452 461 436 431 475 530 544 520 492 478 476 479 481 469 453 456 475 470 428
4003 428 392 394 393 342 269 248 288 323 308 279 285 324 359 373 379 389 411 442 458 438 394 375 404 450 467 451 435 441 462 485 502 512 517 527 541 532 467 358
3998 358 272 273 350 429 462 470 498 539 540 493 453 457 474 459 438 467 535 567 536 501 514 544 542 522 527 548 549 538 553 581 568 510 470 478 487 454 408 395 408
3993 408 409 402 416 448 464 458 452 444 409 360 349 405 504 592 634 615 548 473 431 423 414 394 397 441 496 519 506 478 453 448 472 516 541 533 526 546 564 531 457 401
3989 401 404 450 501 531 520 467 410 399 440 487 503 496 495 506 516 515 501 479 459 448 432 395 353 348 391 442 453 430 402 384 372 374 408 461 496 490 467 466 488
3984 488 499 476 441 430 443 442 403 356 352 393 433 440 425 402 370 347 380 484 594 630 585 522 486 474 475 490 508 502 477 475 508 531 499 432 386 376 379
3979 379 384 405 440 457 441 408 381 376 403 459 514 527 501 488 514 545 528 466 410 396 423 471 518 541 530 500 470 439 408 403 438 477 460 386 319 314 363
3975 363 430 496 541 534 477 423 415 438 451 455 473 489 474 437 423 444 470 488 514 550 567 553 532 521 510 495 494 511 511 479 443 436 446 442 429 425 427 426 438 483
3970 483 537 551 514 467 447 460 491 517 516 497 492 520 544 518 459 430 447 464 454 446 472 507 517 512 522 542 540 515 504 529 566 578 548 488 430 409 441
3965 441 495 520 497 450 410 374 330 298 314 376 437 461 467 488 520 537 538 544 556 551 527 520 545 571 576 584 615 636 595 505 433 415 428 436 428 400 346 289 274
3961 274 302 318 291 265 290 348 380 372 370 404 449 465 447 422 416 441 484 517 512 471 421 391 395 423 457 481 492 504 525 541 539 522 506 497 501 531 593 653 663
3956 663 620 569 543 526 495 471 483 514 521 498 482 499 526 530 512 500 515 550 579 577 544 514 527 571 590 550 498 504 559 591 561 510 483 472 455 450 480
3951 480 513 494 430 396 430 485 500 482 473 479 476 459 452 461 457 424 383 365 373 385 382 364 349 350 368 392 417 446 479 504 514 515 515 507 478 432 401 417 479 544 560
3946 560 515 445 408 424 463 483 472 440 401 372 368 390 421 446 464 470 447 396 354 361 410 460 482 476 454 422 396 394 415 434 431 414 405 413 430 441 433 415 416 451
3941 451 492 492 445 388 356 351 361 392 439 478 487 475 463 447 418 389 395 441 495 519 517 516 537 574 607 620 609 577 532 487 459 459 476 493 501 504 509 507 490 465
3936 465 447 439 434 425 414 401 386 379 393 421 432 407 367 356 382 411 414 403 409 443 488 530 558 555 515 467 454 472 474 442 409 413 441 464 486 525 566 577 565
3932 565 551 527 472 413 414 484 550 544 479 413 379 379 407 448 472 465 448 445 451 451 454 476 501 510 515 542 586 607 586 541 495 456 431 429 437 435 424 424 441 453 451 447 447
3926 447 434 403 390 422 473 486 443 384 362 388 442 499 541 560 547 503 445 401 392 412 430 424 400 385 390 404 417 429 437 427 401 396 449 542 607 599 552 530
3922 530 552 578 569 534 512 523 560 600 622 614 578 528 483 455 445 454 475 495 494 459 404 365 368 403 433 439 438 439 427 391 363 387 451 502 518 521 524 512 486 479
3917 479 499 504 470 439 453 490 497 473 460 472 479 455 417 396 412 472 556 613 598 532 476 463 472 470 446 407 365 345 363 394 400 383 386 424 462 475 476 485 491 475
3912 475 448 433 434 446 468 496 513 512 506 506 499 473 448 454 486 505 491 458 435 430 434 439 448 467 488 488 457 416 402 420 437 425 401 403 443 499 549 583 606 617 604
3907 604 566 521 498 500 502 492 490 509 524 504 474 482 528 555 534 500 493 504 517 542 582 600 570 518 487 469 432 382 363 386 417 422 402 383 388 422 461 471
3902 471 449 432 445 467 472 476 507 557 593 607 607 580 520 464 457 479 473 434 408 411 402 361 328 340 371 378 367 361 364 372 393 420 422 394 387 435 492 492 442 409 421 452
3897 452 482 530 590 607 547 452 400 408 428 418 388 373 379 387 382 378 395 440 494 527 518 476 438 438 475 505 495 456 424 420 434 442 423 366 297 273 330 430 507
3892 507 541 569 603 599 532 455 434 461 472 448 437 475 528 539 499 444 405 384 378 386 403 410 407 417 460 517 548 541 530 543 564 560 526 496 494 505 506 496 501 537
3888 537 576 571 507 426 393 417 445 440 428 452 492 499 466 441 446 451 429 393 374 380 402 430 445 429 405 413 457 489 483 475 502 540 546 521 500 502 524 552 554 493 386
3883 386 316 334 385 386 347 353 431 505 510 462 415 387 379 400 449 492 500 485 479 492 507 515 513 500 480 459 441 424 410 408 415 412 392 367 355 361 380 398 405 410 438 494
3877 494 534 523 488 490 526 534 486 438 436 451 433 403 425 500 556 549 520 516 531 529 506 491 493 489 475 478 511 543 532 486 448 439 440 436 436 447 454 456 479 523 531 465 385
3872 385 381 443 474 442 422 477 559 584 552 519 510 507 504 507 505 488 473 475 467 430 407 443 499 490 412 341 317 296 255 254 335 443 491 479 460 442 389 314 293
3867 293 359 450 486 453 400 361 343 343 368 416 477 540 594 624 618 585 557 549 544 508 443 395 404 457 497 485 441 411 408 407 392 378 379 388 392 400 429 477 519 537
3863 537 534 519 504 503 519 528 497 438 402 405 405 364 318 329 400 467 488 470 434 388 356 375 437 485 483 465 475 495 475 417 365 345 338 327 321 331 355 388 427
3858 427 460 467 452 436 428 423 418 428 448 458 450 449 473 505 516 495 458 424 415 450 519 579 589 548 489 434 388 357 358 387 415 424 423 437 464 483 492 515 564 617
3853 617 638 625 611 619 639 646 625 585 551 543 550 535 479 419 413 469 533 560 560 561 551 510 453 417 418 443 487 547 588 578 536 524 558 587 573 543 547 577 576 517
3848 517 432 375 372 402 429 433 430 442 475 514 551 580 582 536 462 415 426 465 482 467 452 461 491 519 530 521 510 511 514 504 490 502 530 523 456 381 372 431 496 522
3843 522 523 528 538 543 549 572 600 602 565 513 473 442 402 364 365 430 528 608 642 637 593 511 429 404 443 493 510 514 532 541 507 458 455 510 574 599 583 547 513 504
3838 504 531 559 538 475 440 476 549 593 594 578 565 542 497 435 377 343 340 360 377 376 357 336 324 321 319 313 315 343 398 453 476 464 440 419 399 390 404 436 463
3833 463 484 518 555 562 533 515 539 576 578 554 550 572 573 524 461 438 472 524 546 520 469 435 439 465 487 496 492 471 438 413 418 442 460 468 482 502 503 478 452 449
3829 449 462 468 456 431 403 396 427 475 484 423 338 312 367 446 479 462 439 440 453 456 444 436 440 447 445 438 440 451 448 422 402 430 494 532 507 459 452 479 481 437 394 390
3823 390 403 409 437 516 606 634 597 554 536 512 471 455 475 475 422 380 421 508 539 493 449 467 517 558 594 631 638 601 571 588 617 599 553 541 572 589
3819 589 574 566 582 580 537 499 510 535 518 479 481 533 575 572 556 556 556 542 535 550 562 545 516 504 496 467 434 441 485 511 490 455 456 494 533 547 535 506 472 444
3814 444 424 408 392 382 384 405 442 483 500 482 456 467 525 588 610 590 553 512 468 427 410 435 500 568 590 551 495 479 507 527 512 492 496 502 468 401
3810 401 344 330 361 424 497 545 547 531 536 559 566 556 562 590 601 567 512 471 444 415 393 397 421 438 440 443 462 491 516 528 525 516 515 529 549 562 567 572 585 607 632
3805 632 650 649 626 588 546 507 474 455 454 472 498 515 507 475 438 417 414 417 424 444 475 502 517 535 562 581 570 533 495 472 464 459 447 431 426 444 473 480 451 403
3800 403 369 361 381 432 502 544 519 446 395 416 474 504 479 429 391 370 366 384 421 452 452 433 432 460 495 523 550 583 599 573 521 485 495 542 596 624 611
3795 611 568 526 513 524 539 548 556 566 575 579 574 554 527 518 528 516 462 420 458 558 618 584 518 503 536 554 534 512 514 526 527 519 512 510 516 532 550 561 569 577 575 549
3790 549 514 500 519 554 583 592 572 525 473 441 433 444 480 528 546 501 429 405 444 483 471 437 436 471 495 480 447 430 430 423 398 373 385 443 512 542 521
3786 521 479 441 409 381 378 412 456 464 431 400 419 477 518 501 454 437 468 508 521 509 486 443 388 375 440 525 535 456 379 379 439 494 513 507 494 491 509
3781 509 525 501 446 412 419 425 395 363 373 406 420 415 419 430 424 410 418 447 473 495 529 562 566 555 561 573 548 495 476 512 551 548 527 530 550 553 533 507 476 443
3776 443 426 426 419 395 390 424 450 410 332 303 358 438 474 461 441 432 428 428 441 461 470 456 432 420 425 431 421 406 419 471 521 521 474 431 433 468 493 489 471 459 463
3771 463 481 505 519 507 480 472 502 540 539 500 476 506 559 576 545 497 456 418 393 409 465 515 531 532 548 568 570 566 575 579 546 489 457 470 489 473 425 384
3767 384 379 407 445 458 432 390 369 383 412 435 455 478 498 504 502 506 525 551 575 596 619 639 640 614 576 552 537 499 434 397 439 527 567 524 458 439 453
3762 453 441 390 357 388 458 507 512 498 493 489 467 437 432 456 476 467 444 430 417 389 362 363 385 399 411 445 480 474 445 457 527 588 592 580 600 623 593 524 473
3757 473 451 432 431 470 504 464 375 345 406 470 461 415 401 407 384 347 351 391 413 401 400 437 490 522 531 531 531 533 529 500 440 386 383 428 470 480 480 497 523 541 552
3752 552 570 587 583 556 522 500 495 502 511 508 496 486 479 463 433 406 404 424 447 460 465 468 478 510 572 638 654 595 506 462 483 518 507 459 431 458 514 553 560 552
3747 552 542 533 529 532 544 562 584 602 600 572 535 519 538 583 637 684 701 680 644 631 649 662 636 572 505 467 470 498 517 503 464 435 443 481 525 551 551 529
3743 529 503 490 489 481 463 455 474 503 510 485 450 432 442 471 495 491 468 464 511 584 623 602 560 555 597 641 636 571 486 434 440 475 493 480 465 486 538 583 592 567
3738 567 526 484 445 413 393 383 377 371 369 379 410 462 516 546 542 518 495 483 484 497 512 505 464 411 384 393 415 431 451 474 476 438 388 373 404 454 493 512 516
3733 516 508 492 467 433 402 397 416 430 422 420 453 499 511 488 473 490 520 545 562 559 521 479 485 538 571 549 519 532 562 564 543 537 544 540 535 556 586 576 521 464
3728 464 435 432 451 489 510 478 421 414 483 562 582 548 511 502 520 551 567 541 478 428 425 451 462 440 406 392 410 432 426 398 404 475 550 541 454 389 400 440
3724 440 451 455 487 525 523 490 472 477 486 494 507 508 486 474 505 547 550 523 516 534 535 504 479 490 525 564 603 629 627 608 599 597 582 566 575 586 538 434 360 382 460
3718 460 513 518 510 507 496 465 416 371 362 403 462 489 477 465 479 502 517 527 525 494 446 433 459 465 430 415 471 541 541 486 454 461 458 433 434 475 508 497 464 442
3714 442 437 457 504 537 507 436 400 422 438 413 397 437 499 520 504 477 442 404 416 494 559 524 416 343 346 382 426 491 553 556 507 488 531 567 542 502
3709 502 519 577 612 606 580 539 481 447 473 519 513 461 438 471 499 477 437 426 443 462 484 511 513 475 440 463 528 572 571 552 540 535 546 585 627 619 563 517
3705 517 518 528 501 458 441 431 388 336 348 429 491 463 393 375 432 506 545 559 574 592 600 597 594 601 626 666 698 693 664 655 683 710 693 642 595 565 547 545 569
3700 569 604 612 582 536 493 459 440 444 458 454 440 452 492 515 494 472 501 562 586 548 493 472 494 533 558 552 530 528 567 613 616 569 513 484 484 490 478 430 358
3695 358 314 342 408 442 427 412 433 468 489 508 537 555 543 524 511 480 421 382 406 456 471 463 493 560 603 599 579 566 537 496 491 534 575 573 559 571 584
3690 584 562 524 528 573 602 579 527 490 481 493 515 541 562 573 573 562 538 506 473 458 479 525 554 539 509 508 524 495 408 343 368 446 490 486 489 525 544 504
3686 504 435 394 398 426 470 537 621 685 689 626 529 443 394 375 375 401 449 483 471 433 420 433 426 380 346 369 432 481 501 510 518 512 497 494 514 542 562 567 549
3681 549 511 475 475 510 541 535 498 460 438 432 436 442 446 445 449 466 491 509 513 514 512 494 451 399 370 373 391 411 441 487 521 511 469 438 439 451 459 484 532 562 521 425
3676 425 352 358 422 482 504 498 494 507 529 537 514 472 436 418 412 417 449 511 575 596 566 517 482 462 447 450 492 559 597 567 506 480 509 539 520 471 449 468
3671 468 499 531 578 634 653 614 554 530 541 550 544 539 549 566 585 605 600 529 402 298 294 381 472 501 478 460 480 518 538 530 518 520 519 486 437 421 459 509
3667 509 524 506 493 491 480 457 454 477 492 479 467 491 535 558 559 563 570 558 539 549 594 621 588 523 478 469 481 514 575 642 665 627 563 517 493 467 428 397
3662 397 402 445 498 526 516 482 449 433 442 478 522 545 535 516 515 526 520 493 461 433 409 403 435 487 512 505 508 538 552 518 475 480 510 499 443 404 417 444 435
3657 435 398 365 349 352 389 451 502 514 511 519 525 502 464 442 430 407 390 419 479 509 489 481 527 581 575 521 495 523 554 539 502 491 508 513 495 488 509 528 509
3652 509 463 438 452 470 452 406 370 372 400 431 454 470 487 511 534 537 509 472 458 473 483 466 434 415 416 424 432 441 448 443 427 414 419 441 465 477 480 494 527 567
3648 567 586 582 571 560 541 511 483 469 464 466 476 482 453 390 346 371 446 504 510 483 457 446 458 496 535 536 493 438 404 398 419 470 531 552 510 453 439 468
3643 468 497 504 500 491 475 474 521 602 649 625 570 540 535 526 517 533 561 553 498 452 457 489 502 499 514 551 575 575 573 577 562 527 510 529 549 532 500 497 514 503 458 427
3638 427 446 492 521 516 486 448 426 437 466 493 523 575 624 615 547 496 523 591 624 604 558 508 457 430 456 516 550 536 510 502 502 490 476 487 525 568 588
3633 588 577 548 530 528 513 465 417 425 491 552 557 516 467 430 413 423 463 517 565 591 581 530 472 463 514 580 614 619 616 600 567 549 576 630 661 650 619 589
3629 589 558 528 514 527 556 584 592 572 534 503 492 491 485 478 480 490 501 512 516 500 479 493 547 576 534 471 473 531 560 531 503 515 522 487 462 500 565 582 545
3624 545 519 533 558 570 576 579 568 549 546 554 542 507 485 501 531 555 583 618 624 578 519 507 551 610 652 677 679 643 578 531 529 540 521 486 490 560 650 693 666
3619 666 602 554 554 594 635 636 589 529 495 495 508 520 540 570 595 603 601 596 586 566 549 541 532 508 486 498 542 567 533 457 395 384 415 450 469 470 465 458 453 464 506
3614 506 560 577 530 463 448 498 550 552 524 506 495 471 450 468 506 504 457 431 468 508 482 420 412 484 564 584 557 536 539 546 544 542 542 535 517 496 482 489 518 554
3609 554 575 580 592 622 650 655 640 618 584 532 477 444 435 443 472 515 534 493 415 366 373 405 427 435 431 407 373 364 392 420 423 432 490 575 628 628 604 580 556 530
3604 530 515 512 510 499 488 481 479 483 482 459 420 412 468 539 545 488 463 531 638 687 651 584 541 538 561 584 589 580 588 614 622 585 535 519 530 527 508 513 558 610 636 637
3599 637 626 602 568 548 546 536 506 481 488 506 493 444 404 408 454 511 556 582 586 570 535 480 405 326 280 294 369 469 544 565 546 526 540 587 629 627 570
3595 570 496 463 488 524 517 477 461 487 502 463 408 417 503 587 595 536 462 406 372 367 401 461 516 554 583 600 588 555 531 530 525 490 454 464 513 540 505 445
3590 445 421 436 446 429 418 448 504 543 546 534 525 511 490 484 512 553 557 510 464 474 530 566 543 486 439 420 423 446 479 486 451 410 411 452 477 459 428 419 431
3585 431 455 492 535 547 520 492 508 545 553 528 516 528 524 479 434 442 486 505 475 438 440 473 491 473 446 443 461 471 463 457 467 486 503 517 523 501 450 411 426
3580 426 481 523 532 536 554 563 545 514 504 515 524 516 494 476 482 518 564 587 569 530 502 499 511 515 489 432 382 379 417 452 460 473 517 570 594 598 606 609 578 530 513
3575 513 531 537 506 478 495 539 558 532 489 455 441 446 459 460 448 450 488 543 568 549 524 534 579 616 602 540 475 460 506 570 598 577 534 497 462 419 379
3571 379 374 419 494 559 588 580 552 523 517 544 580 588 558 520 495 471 438 426 469 537 558 513 466 476 521 540 520 501 498 480 433 394 415 482 523 486 403
3566 403 359 396 471 517 521 521 530 520 478 439 437 451 447 437 454 490 503 480 451 440 432 413 396 396 410 434 473 524 556 550 524 517 536 559 563 543 518 509 522 534
3562 534 520 485 465 473 480 461 442 455 476 446 365 317 370 482 541 494 400 345 347 370 386 405 436 459 464 470 497 530 534 499 454 430 437 469 508 526 513 495
3557 495 504 536 554 535 497 465 452 455 470 483 482 479 503 551 578 564 541 545 564 566 552 546 540 515 483 482 511 529 515 494 496 509 510 506 511 519 522 535 574 621 628 578 511
3552 511 474 484 518 549 559 548 520 492 471 455 439 422 409 399 393 404 450 527 595 610 577 544 550 591 633 651 638 598 548 511 498 495 493 499 525 555 560 531
3547 531 493 468 460 460 469 484 496 493 480 477 494 522 539 536 525 520 523 523 516 514 529 559 588 598 582 545 508 499 520 548 561 574 609 652 666 633 574 521 484 458 440
3542 440 426 414 409 419 436 442 442 456 489 519 528 532 544 556 550 524 495 482 495 533 565 559 524 509 541 585 590 563 545 548 546 535 538 561 576 567 557 564 569 554 532 517
3537 517 498 461 433 450 494 510 484 471 509 560 558 499 445 435 438 416 387 403 465 508 479 407 366 387 442 491 528 564 590 592 572 547 526 509 505 523 552
3532 552 555 517 464 438 451 481 505 516 509 486 459 457 485 522 538 535 532 540 550 552 546 539 531 513 479 440 419 429 456 469 469 480 515 539 522 478 454 474 521 570
3527 570 605 622 621 606 584 550 513 503 538 584 591 566 566 608 645 625 565 514 487 469 450 433 414 389 371 376 402 426 437 439 443 463 506 556 582 580 575 580 571 530
3523 530 491 497 539 572 584 589 586 554 504 476 484 494 473 425 378 359 383 446 511 543 542 535 527 505 477 478 510 530 513 491 507 554 585 567 513 462 452 482 516
3518 516 516 496 500 535 556 520 435 351 317 358 456 545 562 516 480 497 542 564 557 540 526 524 550 601 639 634 601 575 566 565 563 554 532 517 542 597 627 601 557
3513 557 542 545 538 532 546 553 523 486 485 503 484 432 405 424 452 463 474 491 486 451 420 414 422 431 448 466 466 458 474 508 516 490 478 507 536 519 481 473 495 512 514 518
3508 518 529 538 541 543 542 527 499 461 414 372 357 375 411 453 500 532 522 484 474 506 521 477 428 451 528 562 512 442 423 448 459 440 426 440 455 431 380
3503 380 364 417 495 526 502 480 505 561 610 626 589 503 424 427 511 577 558 502 492 531 564 577 595 607 580 529 513 540 562 542 508 490 489 495 505 503 472
3499 472 434 435 478 515 520 513 508 484 436 407 434 495 549 583 605 613 602 589 590 595 586 557 525 511 535 584 611 581 528 526 584 634 622 577 553 557 569 582 596 594
3494 594 571 560 584 610 599 568 564 590 611 617 618 611 581 541 526 534 530 512 513 550 594 615 616 605 578 540 520 540 583 614 616 596 572 560 562 567 569 578 602 624 617 587
3489 587 564 562 570 586 612 634 632 614 614 630 611 533 442 407 435 475 491 494 507 529 545 550 550 553 560 566 566 557 534 498 459 429 414 409 414 440 488 538 564 565 554 532
3484 532 499 472 476 512 552 572 575 571 571 583 611 631 611 559 521 525 537 510 451 417 438 485 510 504 498 529 588 633 635 611 603 621 632 606 555 512 492 495 515 550
3479 550 594 635 670 694 708 712 702 671 623 581 564 568 567 550 527 508 501 524 581 628 605 515 440 442 491 526 538 553 568 553 519 509 536 565 568 566 581 605
3474 605 610 580 526 474 459 490 530 532 507 501 524 530 493 452 447 460 450 426 437 489 534 536 516 510 527 546 546 523 482 446 451 508 583 624 618 603 620 662 688 682
3469 682 656 626 583 524 477 474 504 525 517 510 533 574 594 573 531 498 488 498 523 555 584 593 583 580 608 658 681 649 588 544 531 531 529 530 531 524 518 532 553 547 510
3464 510 491 524 575 588 562 544 561 586 578 532 473 427 411 425 450 461 455 455 482 525 550 534 490 461 474 507 514 489 474 495 513 475 408 395 465 545 557
3460 557 522 509 535 549 523 497 508 534 526 490 481 522 569 571 535 515 544 602 640 636 610 599 608 614 595 564 548 551 553 550 565 609 651 650 599 536 493 473 468 475 494
3455 494 521 561 609 642 629 578 537 539 570 599 618 635 637 609 561 521 500 491 501 536 574 578 549 528 540 559 554 526 498 486 498 535 575 578 525 456 426 446
3450 446 484 516 545 578 609 627 637 645 655 662 651 611 551 512 519 546 538 487 448 471 537 578 561 517 494 505 528 546 564 581 581 548 504 486 505 537 553
3445 553 557 566 582 588 572 533 483 448 460 520 572 565 514 486 503 518 491 455 458 488 495 477 480 519 547 529 492 489 528 569 580 571 573 599 627 627 593 554 546 574 611
3440 611 632 627 597 553 516 509 528 537 521 500 503 522 535 539 544 552 559 571 596 610 589 544 514 514 528 552 603 670 704 684 653 655 677 674 649 643 665 680 669 653 643
3435 643 624 603 621 690 752 749 699 665 662 648 610 597 649 728 759 722 668 645 651 655 642 634 659 718 781 814 815 804 802 810 821 829 827 807 784 788 835 903 961 1001
3431 1001 1040 1082 1120 1151 1187 1221 1239 1243 1259 1298 1328 1316 1269 1225 1204 1200 1206 1221 1230 1209 1156 1096 1055 1030 1001 967 945 939 924 869 784 714 695 718 747 760 762
3426 762 749 700 623 565 563 599 622 608 573 541 526 543 588 628 630 609 609 630 631 602 578 584 590 576 571 597 615 576 513 500 546 588 591 592 622 650 630 582 559
3421 559 573 588 575 554 553 567 569 556 556 588 628 637 610 579 574 590 612 634 648 633 592 573 611 666 666 609 573 602 655 666 637 616 616 607 570 535 540 591 655
3416 655 687 665 616 585 589 602 602 596 597 604 614 638 665 658 604 554 561 606 617 572 527 523 534 522 498 494 502 493 467 456 469 483 482 483 504 537 562 580 603 630 647
3411 647 644 632 618 611 618 649 690 711 694 663 650 651 633 577 511 477 486 518 545 550 533 501 468 441 418 395 373 357 352 373 422 487 542 571 579 576 571 576 592 601 578
3406 578 532 502 509 534 548 546 532 507 483 484 507 516 495 489 535 598 609 567 530 526 524 509 503 518 528 515 509 538 590 645 703 755 764 716 655 629 629 618 607 626
3402 626 658 652 601 558 558 577 575 551 530 523 524 528 537 545 549 548 538 513 484 475 495 527 555 578 599 611 608 598 588 570 549 550 583 623 629 604 581 572 551 512 483 487 502
3396 502 500 493 511 548 563 539 499 471 463 483 543 619 658 633 589 577 585 558 489 441 466 535 579 562 516 494 516 559 588 601 623 654 652 597 535 534 591 644
3392 644 649 628 613 598 561 514 494 511 550 589 614 621 618 612 596 562 535 550 600 631 612 571 552 555 559 566 589 611 607 592 605 649 680 666 619 576 552 538 520
3387 520 502 507 542 577 572 537 531 586 653 660 597 522 494 533 607 654 623 535 480 515 591 621 583 522 471 440 448 506 572 590 575 589 635 653 617 580 577 577
3382 577 550 529 545 565 542 498 490 526 561 566 553 546 562 602 644 654 620 568 515 458 409 417 493 565 553 473 416 432 487 535 576 622 653 639 584 533 535
3378 535 584 627 617 574 551 559 556 527 515 548 585 580 558 574 617 630 597 558 540 530 516 512 526 549 574 604 618 598 565 560 585 601 597 599 620 636 634 623 597
3373 597 542 476 449 481 532 570 601 634 641 611 578 582 603 602 578 557 547 539 535 539 541 531 526 545 573 574 549 538 567 614 634 603 535 470 433 423 424 431 450 477
3368 477 480 445 405 408 471 562 632 650 618 563 518 497 495 503 518 532 544 555 566 569 564 566 588 603 579 529 499 497 487 455 430 428 426 411 425 493 576 611 599 582
3363 582 576 565 553 561 585 593 569 536 520 521 528 529 524 521 527 531 518 505 537 619 693 705 669 627 592 560 556 597 645 651 628 626 641 620 564 531 550 579 579 573 590 619
3358 619 639 650 650 621 570 539 559 602 624 619 615 625 635 621 570 505 466 476 504 511 512 542 576 552 480 446 494 559 567 529 494 464 429 414 437 459 442 417
3353 417 436 474 474 444 446 484 512 519 541 571 553 479 423 437 489 530 558 587 598 581 567 582 601 585 550 535 543 544 530 517 509 500 506 541 587 606 587 556 536
3349 536 530 534 545 558 566 577 599 612 597 573 577 602 597 541 480 464 484 498 495 491 490 485 487 518 569 600 592 571 569 580 577 564 572 604 626 610 569 540 538 546 549 548 548 541 524
3343 524 508 503 513 532 555 579 594 583 545 498 465 453 455 473 525 614 711 762 737 660 581 539 544 572 582 552 508 498 524 549 554 573 632 692 696 651 620
3339 620 624 627 609 598 606 597 550 522 564 633 638 576 527 539 563 540 489 461 462 465 465 489 539 579 582 559 536 520 506 494 493 516 567 621 636 589 517 490 535 597
3334 597 609 568 536 556 609 642 629 584 533 491 472 486 523 553 551 538 553 601 636 619 570 534 521 511 502 514 544 550 516 488 512 569 607 617 626 633 612
3329 612 570 560 599 636 626 596 594 617 623 604 593 605 623 631 637 638 619 580 548 549 572 592 602 608 612 605 583 552 525 517 531 552 560 553 553 582 637 689 704 677 635
3324 635 613 610 601 574 554 553 547 512 479 501 571 627 631 608 594 593 600 626 663 671 638 616 646 685 664 596 563 604 657 648 582 527 521 547 564 554 529 512 522 558
3319 558 602 631 631 610 592 590 588 558 515 510 560 609 601 557 542 573 608 626 642 657 646 613 597 594 554 474 436 489 568 579 542 535 561 553 503 495 565 643 661
3315 661 649 661 679 650 584 543 551 573 584 597 618 630 616 587 558 531 514 514 528 535 526 513 507 510 528 568 612 625 597 564 561 583 598 587 559 532 520 531
3310 531 550 555 534 502 479 473 474 473 469 477 504 542 560 545 519 510 507 480 444 456 525 583 577 544 549 591 614 601 595 619 639 630 617 629 654 655 631 602 586 580 580 588 604
3305 604 631 663 674 639 574 533 547 587 610 607 593 572 551 555 596 637 636 602 579 577 563 534 531 575 617 602 547 516 547 615 680 712 697 642 587 577 611
3300 611 641 640 632 640 642 610 570 578 631 665 647 618 627 663 685 684 680 672 645 615 608 618 622 624 654 699 707 666 631 638 645 610 560 552 579 582 547 521 544 591 617 607 584
3295 584 574 586 597 582 546 529 550 578 582 583 615 661 663 608 543 510 503 505 513 527 537 544 560 575 568 550 555 584 594 568 538 531 532 524 523 544 573 601 644 697 710
3290 710 663 615 628 672 671 626 608 648 690 678 629 589 568 553 543 544 541 512 462 429 449 517 578 579 519 457 446 478 510 531 560 592 597 568 539 545 576 599
3285 599 601 592 590 609 643 659 629 569 522 502 487 465 455 470 494 513 532 553 560 553 569 628 684 675 606 542 523 532 537 542 568 605 622 603 571 562 577 586 575 569 597
3280 597 636 637 602 589 624 648 601 511 462 482 524 549 571 610 644 651 657 696 750 758 694 600 538 517 504 478 453 453 481 521 562 595 610 600 585 590 609 617
3276 617 615 635 684 726 721 682 635 583 527 497 518 559 564 534 526 558 581 558 519 510 530 553 578 616 650 648 607 553 516 508 527 556 565 550 534 537 540 524 505 516
3271 516 548 568 566 564 564 541 493 458 472 519 555 559 538 519 522 552 582 580 542 493 449 403 356 343 393 484 554 574 565 565 581 594 590 581 583 590 579 546 527 552 601
3266 601 618 594 580 610 647 630 568 525 535 565 565 531 493 476 486 521 571 616 638 637 619 592 570 568 588 609 609 590 577 591 628 659 660 633 603 588 587 593
3261 593 606 619 616 597 590 610 631 622 595 588 601 601 585 584 603 602 576 581 645 701 674 601 583 639 679 641 568 539 568 614 640 641 628 620 625 626 597 554 541 559 557
3256 557 524 518 582 661 671 610 549 533 550 582 629 668 666 629 614 648 691 701 683 664 647 619 586 558 536 514 499 493 488 488 517 576 619 604 554 530 551
3251 551 585 602 605 608 609 610 625 654 674 664 630 595 578 589 621 647 638 598 564 550 539 519 505 509 514 508 515 560 616 639 626 618 627 629 609 588 577 558 532 534 574
3246 574 598 557 480 438 451 479 494 509 534 543 529 518 532 552 550 532 518 516 529 566 618 644 621 595 614 662 674 633 589 586 611 635 660 694 716 693 624
3242 624 548 510 526 572 600 583 539 515 531 568 608 652 686 670 588 497 467 498 527 522 518 550 599 618 599 575 571 569 541 499 484 516 559 558 512 474 482 510
3237 510 515 505 516 557 597 611 607 591 552 497 462 470 498 512 504 491 471 442 421 438 492 546 577 595 618 640 647 638 627 621 615 607 602 600 595 582 567 563 571 580 576 560 546
3232 546 542 544 551 569 600 627 636 632 633 635 619 581 550 543 545 530 507 509 536 553 539 521 535 570 586 574 565 586 616 612 564 509 476 457 429 400 405 463 554 638 688
3227 688 701 683 649 626 645 698 738 725 676 639 639 657 673 688 693 666 606 555 553 583 595 577 570 608 667 705 718 727 734 721 680 635 613 616 629 636 633 626 625 634 648
3222 648 653 640 616 601 611 638 662 674 684 703 723 727 713 692 658 603 544 524 555 603 625 622 612 599 576 561 577 610 623 610 611 647 677 648 563 491 492
3217 492 552 600 581 521 500 552 617 620 569 539 559 576 548 508 511 552 588 595 579 543 503 502 568 655 683 636 581 568 582 588 594 616 637 630 596 560 535 515
3213 515 500 504 532 568 586 575 553 554 591 638 651 625 596 588 586 566 536 517 516 524 536 542 528 497 480 501 547 596 640 677 678 622 542 494 490 500 509 530 563 577
3208 577 554 527 533 566 584 567 536 520 535 573 615 645 654 641 606 561 526 512 513 526 560 615 655 653 622 596 574 535 505 538 618 661 627 585 608 670 684
3203 684 631 573 562 585 617 645 662 663 672 717 772 773 703 622 590 593 593 591 619 666 680 644 594 571 572 572 570 573 573 562 557 584 629 645 618 590 594 604 584 564 597
3198 597 668 693 636 558 534 560 583 591 611 649 674 667 631 581 534 514 529 546 525 490 499 561 615 611 565 524 509 512 522 533 539 539 542 554 573 599 628 646 644
3194 644 634 627 607 559 517 534 592 620 598 584 616 641 604 543 533 578 615 611 598 602 610 602 577 540 501 479 489 522 555 584 604 593 542 495 504 552 576 553
3189 553 525 520 514 492 502 584 703 781 783 736 685 646 619 594 567 543 534 540 548 552 553 546 519 489 487 514 531 518 508 541 600 644 659 665 663 636 588 558 565 584 581
3184 581 557 543 560 592 603 578 539 528 557 594 607 600 591 575 533 473 440 465 528 575 575 543 519 516 518 508 498 509 539 559 557 554 573 610 643 661 666 661 650
3179 650 651 669 680 652 594 543 531 559 605 638 632 593 567 592 645 674 668 664 683 696 681 663 669 675 635 568 535 558 587 578 555 573 632 677 676 657 658 678 677 643
3174 643 598 566 545 525 521 552 608 649 644 615 603 621 638 623 592 587 614 637 623 595 592 613 622 602 575 558 537 509 508 557 619 638 606 569 560 572 590 617
3170 617 642 647 643 666 714 729 678 617 624 695 761 782 780 778 763 731 711 723 743 736 703 671 644 613 580 562 556 554 552 555 556 552 557 579 588 562 528 534 565 557 496 458 503
3164 503 598 665 684 684 676 654 632 642 676 689 669 649 654 672 686 694 680 626 554 524 561 612 615 579 561 585 623 651 680 720 750 741 697 656 647 655 641 596 563
3160 563 583 638 678 683 669 642 586 522 508 563 617 601 538 510 543 586 601 611 650 698 704 653 587 569 616 676 684 636 585 570 574 575 585 610 622 602 586
3155 586 600 593 509 398 371 451 533 534 480 445 443 454 473 505 537 557 580 610 625 608 589 597 615 616 602 587 560 509 464 469 529 600 645 654 642 632 642 653
3150 653 633 592 593 657 719 698 610 535 516 527 541 562 584 586 569 566 587 604 597 576 555 526 488 471 500 567 638 675 663 616 577 570 573 556 539 573 657 725
3146 725 722 676 646 647 652 650 653 665 659 623 579 570 610 671 704 694 664 645 646 663 690 713 709 679 665 691 714 675 595 552 582 633 652 645 646 660 667 663 650 638 637 661
3141 661 692 694 672 674 715 745 727 688 670 663 641 614 608 608 587 564 576 609 623 619 628 637 611 569 574 629 658 613 539 499 496 510 548 606 641 624 595 607 646 661
3136 661 650 653 675 677 647 621 612 594 569 589 675 755 746 663 593 579 578 545 507 523 600 683 717 700 669 652 646 645 650 665 677 675 673 690 717 712 655 583 550 568
3131 568 615 671 732 780 787 757 720 693 661 620 596 610 638 648 642 636 625 598 576 587 622 640 620 577 531 500 512 569 620 604 543 521 557 581 546 504
3126 504 522 579 606 601 615 660 690 679 660 661 675 689 715 751 766 738 696 681 687 676 645 630 652 691 711 712 718 737 754 758 765 780 772 717 648 625 650 661 621
3122 621 573 569 604 637 658 672 659 607 562 584 659 716 726 720 713 687 646 636 663 668 616 556 548 584 613 619 619 612 597 601 643 684 667 592 517 481 480 504 549 586
3117 586 573 514 468 476 514 537 544 573 635 705 749 764 768 775 778 761 724 686 664 651 630 602 591 615 659 697 712 708 698 689 677 654 622 598 595 609 625 626 609
3112 609 584 573 591 625 654 673 695 715 709 670 625 597 584 580 604 658 694 673 627 622 661 683 663 646 672 714 728 715 701 685 662 655 696 757 769 704 619
3108 619 583 604 644 679 721 770 790 758 703 678 689 693 661 613 587 592 608 622 635 639 630 619 616 616 611 616 641 661 643 595 560 550 538 522 534 591 655 692 706
3103 706 713 705 677 658 667 675 654 633 662 726 762 741 704 692 698 693 669 637 606 584 579 587 585 561 533 530 567 630 689 709 678 618 574 574 612 658 687 696 703 726 755
3098 755 760 728 687 666 663 658 652 652 644 605 558 554 602 652 656 630 618 639 675 695 675 619 572 572 600 600 561 544 587 645 653 623 612 638 663 668 670 678 679 674 682 701 707 695
3092 695 686 686 673 650 652 682 691 647 594 589 617 619 587 579 626 690 720 724 745 796 841 844 814 791 797 816 816 796 765 725 679 659 709 809 883 884 849 831 825 799 767
3087 767 781 842 897 914 918 933 947 950 956 982 1020 1066 1123 1167 1162 1121 1114 1173 1244 1260 1242 1252 1296 1336 1360 1392 1418 1410 1389 1409 1470 1499 1465 1423 1419 1420 1378 1323 1313
3083 1313 1344 1362 1346 1321 1289 1220 1115 1024 979 961 940 916 905 903 894 881 882 898 913 910 889 866 859 868 876 858 813 766 744 754 783 812 828 821 789 749 729 748
3078 748 802 861 887 864 810 760 737 740 753 759 750 733 720 721 737 761 779 775 741 702 703 753 805 808 771 743 738 728 707 701 719 729 709 688 699 727 734 725 729 747 745
3073 745 719 698 705 728 751 763 748 703 667 692 759 780 709 611 584 637 697 719 725 740 744 712 666 648 664 685 701 728 776 816 818 787 764 767 770 740 690 664
3068 664 677 693 686 676 695 730 741 718 687 659 625 594 590 612 624 616 621 653 676 666 654 685 732 734 688 648 644 651 644 644 668 691 678 639 614 624 666 722 768
3064 768 772 730 676 649 655 674 691 705 716 721 728 741 743 728 720 744 779 789 775 781 815 827 778 699 661 684 722 737 738 747 750 723 675 654 687 746 786 794 789 780 757
3059 757 721 696 692 695 692 691 705 717 710 695 699 728 758 774 776 773 770 782 811 836 827 796 776 774 756 707 667 673 706 718 698 675 679 711 758 808 844 842 796 733 689 679
3053 679 692 710 724 746 786 832 851 823 774 752 772 800 805 795 808 849 891 908 903 882 842 792 768 791 829 827 775 718 704 727 752 760 756 754 764 787 805 797
3049 797 772 764 789 816 812 785 772 781 791 798 811 826 831 827 823 807 762 712 705 744 774 760 732 737 770 796 798 785 757 712 663 628 611 611 630 666 704 730 745 754 750
3044 750 739 744 776 812 833 845 849 819 747 679 673 723 775 802 824 861 902 930 942 949 962 983 994 979 950 938 938 901 815 751 777 861 911 904 898 924 930 872 785
3039 785 740 760 814 856 860 835 824 856 893 868 783 720 737 794 816 795 779 795 828 852 850 828 816 846 903 932 908 863 840 841 848 863 889 908 910 923 959
3034 959 982 963 935 945 977 975 942 939 991 1047 1057 1030 1006 1003 1010 1013 1008 996 983 967 946 928 924 927 914 894 901 937 948 912 895 956 1040 1041 961 903 915 941 939 951
3030 951 1013 1074 1075 1044 1040 1061 1064 1044 1029 1020 997 969 962 977 993 1006 1029 1064 1106 1154 1199 1210 1177 1147 1171 1220 1234 1209 1193 1195 1181 1148 1143 1173 1179 1126 1062 1047 1069
3025 1069 1082 1081 1087 1096 1088 1082 1119 1191 1246 1255 1243 1237 1237 1232 1223 1206 1177 1156 1184 1261 1330 1332 1271 1200 1157 1152 1180 1222 1246 1236 1217 1238 1308 1379 1401 1372 1336 1331 1356 1376 1362
3020 1362 1325 1314 1362 1439 1489 1499 1507 1528 1532 1495 1453 1442 1441 1407 1360 1363 1428 1496 1513 1502 1508 1537 1560 1561 1553 1551 1570 1621 1688 1731 1728 1707 1698 1691 1660 1625 1629 1676 1716 1720 1708
3015 1708 1711 1734 1764 1804 1857 1902 1917 1907 1891 1876 1862 1867 1910 1973 2011 2012 2008 2027 2047 2037 2010 2012 2056 2105 2129 2144 2171 2191 2176 2150 2167 2241 2327 2384 2417 2447 2461
3010 2461 2440 2404 2396 2427 2474 2517 2554 2585 2606 2623 2654 2702 2755 2803 2851 2903 2948 2981 3006 3026 3032 3033 3053 3103 3155 3185 3208 3260 3337 3401 3434 3454 3475 3490 3497 3525
3006 3525 3588 3664 3723 3770 3826 3885 3935 3994 4089 4201 4282 4334 4416 4551 4685 4769 4830 4920 5036 5139 5222 5309 5397 5473 5563 5703 5876 6030 6166 6325
3002 6325 6509 6667 6792 6941 7144 7350 7520 7694 7920 8170 8400 8624 8867 9104 9308 9531 9842 10215 10574 10912 11287 11709 12119
2999 12119 12496 12892 13349 13856 14401 15007 15662 16319 16972 17678 18458 19262 20061 20900 21823 22797 23804 24906 26166 27532 28906
2997 28906 30292 31792 33455 35227 37052 38953 40992 43205 45601 48173 50910 53823 56949 60311 63881 67625 71574
2995 71574 75799 80314 85062 89988 95079 100309 105593 110816 115876 120654 124990 128690 131574 133508 134409 134255 133054 130840
2992 130840 127709 123844 119446 114642 109494 104098 98610 93151 87758 82452 77303 72392 67743 63360 59277 55534 52105
2990 52105 48919 45939 43178 40631 38259 36031 33953 32043 30299 28713 27273 25960 24737 23577 22482 21457 20500
2988 20500 19604 18765 17966 17192 16444 15746 15113 14532 13985 13475 13010 12578 12148 11705 11267 10861 10487 10123 9750 9382 9053 8784 8559
2986 8559 8348 8132 7907 7674 7439 7212 6993 6765 6516 6267 6063 5925 5822 5706 5563 5415 5280 5165 5076 5013 4956 4872 4757 4640
2983 4640 4546 4464 4380 4302 4243 4192 4126 4042 3957 3865 3750 3623 3530 3484 3451 3399 3342 3307 3280 3225 3144 3078 3050 3036 2998 2917 2808 2705 2642 2624 2615 2592 2569
2979 2569 2561 2538 2460 2352 2294 2316 2364 2377 2359 2349 2350 2339 2311 2277 2236 2172 2094 2037 2020 2023 2000 1934 1852 1806 1812 1831 1822 1798 1803 1828 1813 1737 1656 1624 1619 1591 1549
2974 1549 1541 1569 1582 1561 1540 1552 1579 1587 1571 1546 1525 1509 1502 1504 1507 1507 1506 1510 1516 1515 1500 1465 1417 1376 1359 1358 1355 1339 1316 1299 1298 1321 1353 1356 1314 1261 1240 1245 1241 1217 1202 1207 1213
2969 1213 1209 1211 1231 1247 1234 1195 1153 1117 1079 1036 998 985 1005 1043 1064 1061 1072 1133 1209 1226 1174 1123 1127 1158 1156 1119 1092 1083 1058 1001 946 926 947 995 1057 1111 1121
2964 1121 1072 992 936 925 932 925 906 902 920 936 935 934 948 962 949 922 914 934 955 962 968 975 968 956 974 1025 1061 1044 1007 998 1011 1003 967 933 910 884 855 847 865 881 888
2959 888 914 969 1011 992 933 901 931 983 997 962 923 911 914 908 905 928 954 942 899 884 928 983 989 951 914 900 893 889 899 918 924 913 901 897 893 881 865 841 816
2954 816 813 840 864 852 817 796 798 797 789 792 810 825 826 820 800 759 720 719 744 744 713 704 749 814 857 875 872 835 765 713 717 749 767 776 800 821 803 751 698 660 635
2949 635 631 656 689 702 704 713 725 724 731 766 802 795 764 761 783 782 756 760 811 840 793 706 652 654 685 724 760 770 741 709 717 761 788 768 722 688 683 695 707 712 721 742
2944 742 757 736 683 645 662 717 767 794 806 808 798 782 775 778 782 793 816 837 830 791 743 713 711 740 790 824 807 752 718 735 766 762 731 720 743 771 780 775 766 741
2939 741 699 667 669 690 694 674 659 673 714 756 782 780 747 704 680 688 709 719 715 709 696 666 635 638 686 739 751 712 658 626 626 640 644 633 629 654 693 708 691 681
2935 681 712 761 772 737 706 721 768 797 786 753 726 714 703 678 636 599 598 636 683 707 709 707 709 708 701 692 678 654 627 622 642 659 646 616 602 622 656 679 682
2930 682 676 672 680 702 737 775 799 804 795 788 786 773 736 693 672 675 671 648 639 681 751 793 784 753 729 702 657 618 614 641 660 646 618 604 614 641 659 651 618 586 573
2925 573 568 550 523 513 533 571 617 667 702 688 626 567 570 635 709 748 761 778 794 777 723 679 689 746 807 844 862 856 811 742 703 724 767 769 720 662 626
2920 626 611 609 625 649 668 689 729 770 777 754 756 806 852 832 766 721 722 721 685 644 651 707 760 763 715 656 625 627 654 696 747 786 784 735 674 648 677 734 770
2915 770 747 669 582 538 545 579 623 682 741 759 718 654 622 634 658 670 672 666 654 645 644 632 595 560 568 611 640 632 621 632 641 623 598 602 629 643 635 634 650 661
2911 661 646 621 608 606 604 611 641 680 693 666 627 610 618 626 617 602 599 613 629 634 626 619 630 661 691 693 668 647 652 665 659 632 610 613 636 665 688 700 705 718 747 776
2905 776 784 767 749 755 781 805 797 755 711 706 751 809 846 866 886 893 872 844 852 892 909 876 827 809 823 848 883 939 1005 1061 1104 1140 1157 1143 1121 1132 1184 1247
2901 1247 1298 1338 1362 1352 1307 1264 1267 1317 1372 1392 1368 1311 1234 1161 1127 1152 1207 1234 1200 1127 1054 985 911 850 840 877 923 953 983 1018 1020 958 864 798 778
2896 778 775 764 751 742 729 716 721 747 771 771 750 726 705 683 664 657 667 685 693 691 694 715 741 747 722 692 675 664 643 624 638 693 749 765 735 694 672 667 645 597
2892 597 555 552 576 583 567 576 632 684 671 606 558 557 588 639 716 786 781 682 558 502 528 578 601 603 613 637 654 647 634 642 674 698 685 652 631 633 637 630 619 607
2887 607 596 596 619 644 646 632 640 673 688 654 596 561 557 567 580 591 588 572 567 595 647 695 719 713 686 669 687 725 741 730 732 764 780 742 679 648 654 658 655 680
2882 680 735 783 797 793 782 748 684 616 575 562 569 598 651 705 727 710 678 656 649 642 623 613 639 688 705 659 593 579 624 672 678 657 643 646 660 673 675 668 670
2877 670 698 730 720 658 589 562 578 607 628 639 640 628 603 573 558 578 624 660 667 679 733 798 803 737 670 658 680 689 678 660 637 611 605 626 639 620 602
2873 602 621 657 665 638 608 593 596 620 652 643 574 515 547 643 692 644 565 525 518 509 515 564 632 671 669 651 641 638 641 654 674 701 732 752 739 700 664 647 632
2868 632 606 582 564 532 491 484 537 613 664 686 698 688 645 607 613 636 625 604 643 734 778 720 624 585 611 645 653 648 643 639 643 654 650 609 558 542 576 625 654
2863 654 652 629 604 592 598 598 571 521 476 454 460 494 547 594 603 571 529 508 526 577 642 689 704 702 704 702 666 599 545 533 546 553 558 587 641 681 686 678 695 726 730
2858 730 691 651 646 660 651 620 609 631 655 665 687 722 716 640 555 553 626 683 677 661 690 752 798 812 800 767 727 707 713 711 680 644 635 645 657 682 727 756 728
2853 728 658 601 584 591 602 616 628 633 650 695 735 723 667 633 646 658 622 561 525 526 543 569 602 624 622 617 636 666 671 647 633 652 684 692 667 625 594 598 643
2848 643 696 712 668 597 554 562 595 610 597 573 558 546 530 526 557 615 657 651 613 587 588 593 578 550 533 529 510 464 423 432 496 566 599 596 584 573 555 534 522
2844 522 523 532 558 606 652 658 630 613 628 647 642 632 642 658 647 612 590 599 617 624 627 643 674 708 728 727 722 737 767 764 695 602 561 591 632 623 578 545 538 531 513
2839 513 501 508 509 487 461 461 486 511 528 556 595 606 566 507 476 473 467 457 475 524 564 571 575 611 670 713 721 692 633 568 536 553 593 621 633 642 637 603 559 531
2834 531 521 516 522 554 605 644 657 651 629 602 591 602 593 537 480 491 559 600 583 567 604 650 640 578 519 495 502 533 579 613 611 583 564 576 616 666 708 727
2829 727 728 727 709 645 555 518 575 662 679 618 558 555 581 581 544 504 481 475 478 496 536 583 601 575 541 553 602 625 596 576 624 705 730 681 620 599 604 608 614
2824 614 629 645 658 677 695 685 648 619 613 608 601 630 710 784 796 766 761 792 807 779 741 721 697 650 608 609 637 651 644 643 654 653 632 624 656 701 717 701 683
2820 683 673 651 614 586 582 589 596 619 666 705 699 660 628 621 617 600 584 581 580 565 540 531 555 603 651 681 695 698 676 612 524 472 492 545 566 541 516 517 528 527 524
2815 524 531 543 549 561 590 629 659 681 704 725 730 708 666 629 621 644 665 651 616 605 630 648 630 607 625 670 686 652 609 601 617 616 582 546 549 598 654 677
2810 677 661 634 623 623 625 633 649 653 628 587 558 553 563 577 593 597 580 554 548 563 573 562 547 550 563 561 544 536 543 544 518 478 461 487 543 597 628 641 658 685 708
2805 708 702 654 586 539 539 576 612 607 562 515 516 568 628 645 626 614 631 650 651 655 695 757 791 769 716 668 636 604 556 492 438 426 456 492 507 516 546 580
2800 580 588 583 609 658 681 661 645 659 673 646 594 553 532 528 552 602 641 641 631 641 650 631 603 606 627 621 595 594 621 634 631 646 674 655 585 545 585 648 645 591
2795 591 567 597 611 566 504 495 538 579 587 582 585 585 570 563 590 631 635 600 578 604 637 625 583 566 583 596 590 599 631 646 614 565 545 559 583 614 656 690 684 640
2790 640 591 564 565 594 649 707 728 695 636 592 585 601 614 613 601 583 560 540 549 594 647 667 651 632 629 635 632 626 621 614 603 595 588 577 565 563 567 557 526 499 491 498 519
2785 519 562 618 654 658 656 666 669 645 604 565 532 515 530 569 584 557 533 559 614 649 661 676 680 639 577 561 601 628 595 535 501 496 500 510 525 529 517 526 582
2780 582 644 642 566 486 473 521 569 572 544 526 524 511 467 426 427 464 490 482 465 474 508 539 538 492 428 399 434 497 528 528 548 609 655 637 583 558 575 595 590
2776 590 574 570 577 591 614 643 661 648 606 559 530 519 507 485 472 487 523 553 574 610 659 684 657 609 591 612 638 635 607 578 566 570 577 582 593 618 641 639
2771 639 621 619 640 649 620 570 533 515 511 531 577 613 604 561 522 500 492 509 562 613 612 568 532 520 493 448 443 520 623 662 617 554 539 587 659 701 681 625
2766 625 596 624 661 648 602 597 658 731 752 717 665 624 597 577 566 565 572 582 582 569 556 563 593 626 645 650 646 640 636 643 657 664 655 631 596 552 514 508 539 570 562 522
2761 522 500 518 552 560 535 504 496 525 579 628 643 621 587 574 588 604 597 570 546 549 571 578 549 510 514 574 646 673 648 614 608 625 633 613 576 549 551 568 572 551
2756 551 533 550 597 639 657 659 655 636 605 586 601 634 651 641 623 614 617 627 646 669 676 652 607 576 587 630 662 650 609 579 575 568 529 472 443 455 475 472 460
2752 460 482 553 638 689 692 669 647 640 647 657 654 633 610 615 654 695 693 640 572 536 549 588 615 603 560 524 525 555 594 640 696 735 713 641 591 613 668 681
2747 681 634 576 546 534 518 505 507 519 534 561 606 648 663 660 659 652 616 567 556 600 656 676 662 636 597 542 511 543 612 642 615 588 593 583 525 471 485
2742 485 529 516 451 431 500 585 608 587 581 592 588 565 544 527 504 484 484 502 527 560 587 571 514 494 572 695 753 720 666 635 605 566 557 591 609 570
2738 570 528 555 627 653 600 527 496 508 532 554 576 587 583 585 614 649 642 579 508 489 525 569 592 607 627 640 638 643 667 682 667 654 681 719 703 637 599
2734 599 622 648 614 553 537 572 605 610 613 629 639 623 597 583 579 577 575 579 584 585 587 590 584 561 532 517 520 530 546 580 631 658 624 550 499 507 546 573 583 585 574 540
2728 540 513 525 559 563 528 502 521 569 620 669 716 741 722 665 588 512 470 485 535 566 562 559 586 615 607 569 537 522 520 533 563 589 591 579 573 579 597 624 646
2724 646 641 617 612 629 620 574 557 612 676 659 582 535 549 571 576 600 657 701 698 678 674 677 673 673 676 654 606 574 585 610 609 584 559 545 549 581 631 656 633 591 568
2719 568 564 564 572 584 575 537 507 522 565 588 580 568 573 589 609 637 666 681 677 662 650 647 653 655 636 603 582 580 573 543 512 512 550 607 668 721 744 735 715 702 688 663
2713 663 647 666 708 733 722 688 651 623 614 619 611 575 534 532 570 603 590 545 525 568 649 701 684 621 564 538 537 555 586 602 577 539 551 622 678 659 587
2709 587 523 484 454 438 456 497 530 551 578 613 635 636 630 627 644 691 745 749 684 613 610 651 659 623 604 629 647 611 547 502 484 482 502 541 573 579 581 599 620
2704 620 620 601 578 553 520 488 471 465 458 451 457 474 497 532 581 627 653 664 675 683 672 637 598 578 578 578 564 542 532 539 555 570 590 617 636 629 601 567 537 513
2699 513 503 518 555 604 667 729 760 744 709 677 631 552 482 477 526 564 578 610 661 669 603 531 521 555 571 555 536 521 503 496 526 574 592 561 507 475
2695 475 494 566 650 687 659 610 585 579 567 561 585 616 613 578 553 555 562 560 562 568 564 544 529 525 510 476 443 439 458 474 481 494 525 563 580 563 535 527 540 551 553 565
2690 565 595 631 658 678 685 668 639 625 629 619 591 577 586 573 519 477 497 552 594 631 685 717 681 620 614 650 651 604 585 619 643 618 593 608 621 592 558
2685 558 573 622 653 655 654 651 637 632 662 701 710 700 713 750 766 731 671 630 625 645 668 673 650 616 596 595 596 580 550 530 542 577 593 569 539 555 614 666 682
2680 682 677 659 619 567 540 543 539 513 498 514 538 547 565 603 625 604 571 562 562 555 572 629 669 645 602 615 659 655 603 580 603 603 554 525 565 621 616 557 508 506
2676 506 543 598 639 633 586 544 536 549 563 582 608 621 616 614 627 639 638 634 629 609 579 569 584 588 566 548 559 566 540 506 506 535 550 538 517 506 512 540 576 596
2671 596 592 583 578 557 526 533 601 674 688 654 622 597 553 508 503 532 550 551 574 620 631 586 538 545 595 642 657 647 626 614 620 627 615 595 601 624 627 604 596 607 588
2666 588 525 476 489 522 519 495 505 538 536 495 480 522 572 578 560 567 599 607 569 518 509 550 592 581 515 456 458 515 571 586 581 594 629 652 630 573 521 508 537
2661 537 578 601 586 545 516 534 591 632 618 576 558 565 554 520 511 548 584 573 535 512 502 485 476 496 520 510 485 500 558 596 577 538 527 540 549 551 558 571
2656 571 588 605 600 547 466 415 430 488 546 580 578 539 496 500 549 578 551 515 520 543 533 501 504 544 564 540 508 502 514 531 559 596 621 618 604 598 603 611 610 590
2651 590 555 533 555 607 643 636 599 555 515 499 521 563 585 575 563 580 625 677 706 677 586 488 448 461 470 464 487 545 572 539 510 548 619 655 655 661 669 647
2647 647 610 587 555 474 380 364 441 520 536 526 550 602 630 616 587 576 599 644 670 652 620 628 666 670 623 587 601 611 563 503 509 563 577 525 482 509
2642 509 573 609 609 602 593 567 528 509 524 549 549 518 481 469 494 550 617 669 681 647 599 584 618 676 721 738 724 683 633 605 621 666 699 695 659 616 592
2638 592 596 608 597 566 557 601 669 704 691 663 658 673 681 659 602 533 502 535 602 639 615 567 550 576 616 641 649 653 651 636 615 614 650 695 699 653 605 591 592 567
2633 567 534 541 586 604 561 505 496 522 532 519 518 544 568 567 556 554 558 562 575 610 649 661 649 646 671 700 696 659 621 612 627 647 663 679 696 710 717 710 688 664 653
2628 653 649 624 576 550 577 624 632 596 565 563 564 554 567 615 646 613 544 504 504 505 497 514 562 607 623 620 607 575 533 522 554 589 592 577 567 556 537 534 563 589
2623 589 571 528 510 521 526 520 543 606 662 678 673 679 693 696 695 699 697 678 658 649 630 578 520 501 530 568 586 590 599 618 640 653 645 627 626 648 659 638 619 645 692
2618 692 691 631 578 583 619 641 646 650 649 633 621 627 621 571 507 487 520 555 559 556 571 597 608 596 571 539 504 466 428 406 427 489 544 539 482 432 424 444 469 489
2613 489 500 497 495 520 559 567 537 518 548 595 615 610 611 615 600 576 569 576 573 555 543 537 530 534 572 629 667 688 723 769 777 727 667 641 627 594 555 548 560 558 551 579 639
2608 639 672 640 575 531 527 547 572 590 592 590 610 649 663 614 533 490 506 539 547 538 539 552 561 568 587 604 587 536 499 516 562 580 558 545 570 596 571 509 468
2603 468 470 476 468 483 551 631 655 627 608 621 620 570 508 491 508 506 475 469 520 594 628 612 591 597 617 622 619 643 700 734 699 628 603 647 690 664 588 525 498
2598 498 493 511 559 597 575 514 489 524 554 530 493 503 550 579 580 586 611 635 648 662 671 649 593 540 523 535 546 540 531 539 579 639 681 680 650 628 630 629 599 547
2593 547 504 502 542 600 643 659 658 654 639 600 546 503 490 505 537 565 578 588 624 686 734 732 697 668 646 601 539 514 546 592 596 563 542 560 601 639 665
2589 665 679 684 676 652 618 590 582 581 567 548 554 587 613 604 572 549 547 559 579 603 617 614 598 580 557 528 508 510 526 539 554 586 632 653 619 542 472 449 469
2584 469 494 505 523 565 605 600 555 528 552 590 593 562 542 558 594 626 649 663 665 656 644 633 619 600 581 568 557 538 510 493 510 554 594 609 617 634 643 626
2579 626 605 616 644 644 616 603 607 585 538 539 617 689 668 587 546 568 607 642 693 736 715 639 587 599 626 626 630 671 724 743 728 699 659 612 590 607 637
2575 637 652 659 670 663 635 619 633 627 564 495 491 532 543 518 515 545 546 495 465 512 588 610 580 565 591 621 620 595 565 543 551 603 674 714 703 678 672 672 645 593
2570 593 545 521 517 533 572 615 617 561 490 469 506 542 523 469 450 491 552 575 563 560 584 601 581 543 523 514 488 455 465 519 555 531 490 492 516 492 419
2566 419 380 428 520 587 625 665 708 728 719 698 667 619 571 552 569 593 607 619 642 666 672 649 607 572 567 587 597 582 570 593 636 653 628 589 562 550
2561 550 551 570 601 622 624 612 595 573 556 566 604 638 639 615 594 591 599 609 612 598 576 561 558 543 504 468 476 524 569 582 580 591 611 617 605 589 579 566 544 534
2556 534 556 604 653 688 710 714 689 642 605 605 629 650 665 678 670 620 545 492 481 494 508 529 563 594 606 608 609 606 592 575 567 559 544 523 508 504 523 568 613
2551 613 621 594 587 634 697 717 700 689 696 693 668 637 607 566 531 545 605 652 641 597 571 577 607 647 676 660 592 521 492 499 513 542 606 676 695 654 606 585
2547 585 575 560 567 617 675 694 678 673 697 724 724 701 678 660 641 623 621 640 666 670 639 586 539 514 507 507 516 534 554 565 573 589 612 637 668 708 740 735 692 648
2542 648 635 640 638 634 647 665 655 610 567 562 584 601 606 610 616 614 596 567 535 511 511 538 575 593 585 563 541 525 523 544 574 584 572 565 585 615 637 648 655 650 629 612
2537 612 614 615 593 563 562 592 616 610 588 570 554 545 559 596 619 602 570 570 602 626 608 554 493 453 449 477 517 543 552 551 539 514 489 482 486 468 423 387 392 424 455
2532 455 478 506 527 515 478 471 527 605 632 592 542 533 554 559 545 542 558 563 537 497 458 410 354 329 365 436 490 512 526 544 549 538 528 532 539 548 564 579 578 571
2527 571 590 632 654 639 625 642 659 635 582 545 544 564 592 612 605 573 564 606 659 661 617 598 639 699 717 682 626 589 592 619 629 599 562 563 590 593 571 576 626
2522 626 671 672 646 616 565 492 447 469 519 539 545 584 647 674 654 637 653 669 658 639 641 649 638 619 616 628 628 605 576 565 582 613 628 604 554 518 524 555
2517 555 576 573 564 571 595 622 639 647 653 655 635 590 551 552 592 632 645 640 640 646 636 612 608 656 729 758 708 632 610 650 680 651 595 562 547 528 534 599 686 710 659
2512 659 608 607 626 628 636 676 717 721 708 718 731 704 648 617 622 622 602 606 657 715 726 696 666 647 624 599 597 626 656 656 631 615 621 623 599 567 570 616 662 670 650
2507 650 638 648 664 676 682 670 620 543 481 466 482 493 486 477 485 515 556 592 627 673 726 747 710 641 596 592 592 566 541 557 614 673 700 689 655 622 613 632
2503 632 659 669 657 633 604 578 576 611 671 713 710 669 614 556 494 440 432 489 576 624 603 561 551 558 534 488 492 578 673 684 608 518 471 468 492 528 558 567
2498 567 571 598 637 648 615 567 529 502 484 487 509 528 539 560 589 591 552 511 512 545 583 620 655 664 634 597 604 657 719 765 792 790 756 721 713 715 688 639 615
2493 615 625 629 606 586 587 585 558 524 503 498 516 574 646 671 628 580 578 590 564 528 553 638 705 706 674 651 639 631 641 669 680 654 609 569 528 489 486 535 597
2489 597 611 569 516 489 488 498 515 542 576 604 615 611 602 585 548 497 470 498 560 602 607 604 610 603 571 548 565 593 589 554 532 539 550 551 562 597 640 666 674 679 684
2484 684 682 664 629 587 571 600 647 655 612 567 569 600 609 590 585 615 647 648 636 641 659 657 628 600 586 570 557 577 643 707 715 675 637 624 617 600 597 623 660 681
2479 681 683 676 657 627 601 596 605 605 590 570 561 571 598 625 634 630 635 656 669 653 616 585 576 583 593 595 598 630 700 767 762 679 597 583 616 625 586 537 513 522 549 575 571
2473 571 535 507 527 574 594 581 578 606 633 636 634 648 665 660 635 607 579 552 535 532 542 572 625 672 675 651 660 721 774 769 728 701 682 635 570 543 574 621 637
2469 637 623 609 613 625 631 626 625 640 660 660 630 591 571 568 567 572 596 634 656 648 625 613 617 617 591 548 518 526 561 590 603 614 634 648 635 595 550 532 567 641 700
2464 700 690 625 574 574 600 612 607 599 582 556 538 535 532 529 557 622 671 661 624 621 645 651 635 630 636 623 591 574 579 577 565 579 625 660 663 662 683 706 703 675 635 584
2459 584 536 522 543 572 598 641 698 721 685 633 614 623 629 644 686 726 715 658 605 574 547 525 533 560 561 523 497 529 591 623 608 579 563 561 567 591 634 682
2454 682 714 714 679 615 542 492 487 520 563 594 610 611 592 562 552 578 614 616 578 540 538 562 583 586 582 588 609 633 640 626 612 612 611 587 549 524 519 523 535 566 590
2449 590 566 503 471 508 565 570 521 472 459 476 511 559 610 650 678 693 683 645 602 578 567 553 544 554 576 591 606 640 685 706 691 662 637 620 616 625 626
2444 626 595 549 534 566 605 612 598 601 628 644 625 594 598 645 686 674 624 589 590 597 598 618 662 675 624 559 554 599 625 614 618 657 690 684 651 611 565 531 539 580
2439 580 599 580 560 554 525 464 440 500 587 608 557 505 483 465 451 483 564 627 619 567 531 529 533 524 518 533 571 612 639 642 623 594 569 562 574 599 625 647 661
2435 661 662 650 640 653 683 692 652 579 520 512 558 625 660 642 603 600 642 674 658 623 620 648 671 675 674 669 648 624 641 703 761 764 712 644 590 564 572 613 659 668
2430 668 624 554 503 493 503 503 492 497 531 572 588 577 560 548 541 538 540 548 562 587 620 634 615 582 575 594 605 586 561 559 570 557 512 466 448 449 442 426 431 472
2425 472 524 555 569 588 604 594 563 554 582 610 601 577 577 595 597 587 598 641 687 711 722 733 744 751 751 732 692 652 645 669 690 686 667 645 622 607 617 642 644
2420 644 613 585 594 625 643 637 628 623 610 586 569 575 599 617 609 586 579 603 630 624 591 576 601 634 636 612 600 613 636 640 610 556 518 534 586 614 594 577 618 689
2415 689 722 703 684 698 715 708 689 677 660 620 574 555 566 582 586 583 576 563 552 563 602 653 693 709 696 650 591 550 541 546 542 542 570 612 620 576 528 536 590 629
2410 629 618 588 576 583 584 569 542 512 494 507 545 567 543 496 476 496 529 554 581 614 622 585 528 498 509 538 571 608 640 637 596 562 583 646 689 680 647
2406 647 624 610 585 560 561 583 597 584 562 549 555 581 624 661 659 615 560 536 555 611 679 713 678 596 544 568 634 677 677 660 639 605 567 554 576 603 605
2401 605 591 592 621 661 682 672 648 636 635 620 573 516 486 502 556 630 693 711 673 616 584 583 592 608 639 676 696 705 732 768 767 713 656 648 676 691 670 631
2397 631 591 562 557 585 618 612 572 548 575 626 653 653 657 674 678 657 636 638 646 633 610 610 630 627 581 531 527 563 591 583 558 551 577 618 650 654 639 632 647 663 650 607
2392 607 572 580 622 656 643 589 538 524 533 526 501 497 531 566 568 565 600 658 689 685 685 709 731 725 696 658 620 599 614 644 651 637 640 670 686 662 624 610 622 650
2387 650 695 740 742 688 630 615 621 602 566 566 608 640 618 554 493 470 487 521 544 554 574 614 649 660 662 675 680 651 608 597 623 652 663 670 679 675 645 599 558
2382 558 548 583 646 683 665 633 646 705 753 763 763 774 784 787 793 797 764 695 640 639 676 716 753 793 814 788 724 665 638 646 675 695 678 627 577 563 576 588
2377 588 591 595 606 621 638 648 643 633 634 638 612 550 507 530 594 636 634 619 620 625 616 595 575 560 547 534 532 554 603 656 670 635 591 581 596 600 593 607 649 674 642
2372 642 573 521 515 543 583 624 664 689 688 672 669 693 722 717 674 630 617 634 654 654 629 589 570 592 628 625 575 529 523 525 508 503 552 616 624 580 555 579 594 559
2367 559 508 494 520 562 613 660 658 590 508 482 518 566 595 607 606 590 578 596 633 656 658 664 676 659 605 563 571 597 580 516 465 483 552 609 622 617 638 684
2363 684 713 695 657 641 655 666 657 649 670 723 778 803 772 685 588 539 557 597 609 596 597 614 614 588 573 601 647 662 643 635 657 675 656 615 590 586 582 578 591
2358 591 620 632 614 598 610 634 640 636 644 663 673 677 692 708 690 639 601 612 653 686 689 661 604 549 542 595 658 676 649 606 562 525 525 580 648 667 637 615
2353 615 624 621 576 519 490 484 484 504 551 594 607 617 659 704 700 656 635 653 660 623 582 585 623 655 671 685 699 701 690 674 655 634 623 631 645 639 611 580 568 591
2348 591 647 697 688 616 554 569 644 692 662 594 562 597 674 732 723 654 589 589 632 644 604 574 602 644 630 569 540 579 633 644 629 634 664 679 669 664 687
2344 687 720 733 717 693 674 659 635 598 558 536 544 572 600 623 655 695 715 694 654 637 659 694 715 718 715 718 728 727 688 616 563 578 633 654 613 572 590
2339 590 650 694 696 670 636 612 621 660 684 664 638 663 729 768 748 713 709 727 734 725 706 673 619 561 528 531 570 627 675 688 673 662 668 674 671 675 682 657 586 509
2334 509 472 471 478 486 505 520 509 483 478 508 560 618 666 676 637 586 583 635 692 704 674 639 630 650 679 688 661 610 556 508 469 451 467 511 566 620 656 658 630
2330 630 607 613 626 614 585 571 578 583 582 585 567 498 412 390 464 568 628 642 648 654 648 637 642 664 685 691 671 623 567 542 554 563 540 518 547 615 666 671 657 655 669
2325 669 689 708 721 725 727 731 723 693 665 670 692 686 648 621 630 651 650 633 626 626 617 605 609 628 636 622 607 618 660 720 775 802 793 764 745 743 741 721 702 707 722 710 659
2319 659 608 597 623 662 702 732 720 651 573 553 592 626 612 573 543 526 529 572 649 695 669 611 587 604 620 615 600 579 556 560 603 639 614 555 546 608 669
2315 669 666 615 567 549 562 598 628 619 588 586 619 635 612 593 613 637 625 598 598 615 621 625 650 677 670 651 666 698 688 628 577 573 597 620 647 679 696 692 690 705
2310 705 715 701 676 655 632 600 573 563 558 554 571 620 664 654 596 553 573 638 691 694 666 648 659 678 673 639 602 587 604 647 694 721 724 735 776 819 809
2305 809 740 665 630 624 613 588 568 564 572 587 596 584 555 538 552 580 598 607 623 643 650 647 653 664 660 639 632 653 672 648 590 549 557 591 608 607 616 642 659 651 649 680
2300 680 723 737 720 705 691 649 582 541 553 579 573 552 564 614 667 696 703 686 648 613 610 631 651 663 670 662 629 590 584 616 665 716 761 771 724 656 633 666
2296 666 695 684 663 658 644 597 553 559 597 619 621 628 629 586 508 452 456 498 545 589 625 639 638 653 695 722 702 662 654 681 693 663 626 627 658 668 624 553 506
2291 506 508 529 519 473 449 501 608 683 674 618 588 599 606 582 555 560 589 609 617 621 617 598 580 593 635 673 678 651 612 583 578 595 613 618 624 649 676 679 666 661 658
2286 658 628 591 596 650 694 692 681 692 696 661 628 653 715 740 714 690 697 710 710 714 721 703 660 646 695 759 774 740 710 707 715 719 724 728 717 692 676 683 705 723 726 709
2281 709 679 650 637 638 637 622 596 562 522 483 463 467 486 503 518 543 585 635 681 711 720 711 699 702 726 750 749 716 666 624 604 611 640 680 721 748 747 714 679
2276 679 685 737 777 748 669 624 653 704 707 662 613 587 581 593 618 623 585 534 532 589 656 693 706 705 680 640 621 638 660 650 620 594 577 567 579 623 666 667
2271 667 633 604 598 596 588 590 620 666 704 713 699 684 678 666 629 590 595 643 667 621 550 533 574 609 603 592 611 642 655 650 642 629 615 623 665 710 719 704 702 725 736
2266 736 710 668 647 656 674 690 711 735 742 717 676 643 612 564 514 508 570 659 713 708 670 637 625 625 612 569 511 479 494 535 571 591 599 599 596 612 649 674 664
2262 664 641 646 677 702 705 691 657 609 590 639 716 740 696 652 656 683 697 706 724 730 699 656 635 638 650 674 713 745 745 719 678 609 520 465 483 546 596 620
2257 620 644 668 672 665 680 704 694 645 604 600 612 615 615 616 604 583 586 616 632 608 579 588 618 622 594 574 581 586 557 511 500 546 618 658 648 626 641 682 695 650
2252 650 592 587 633 661 621 549 521 561 617 639 648 693 768 806 766 690 650 664 693 699 684 667 669 703 757 786 762 715 705 734 747 717 681 670 666 643 624
2248 624 644 688 704 680 649 635 628 618 617 639 668 676 652 613 597 626 686 735 746 735 727 714 672 614 585 605 639 641 617 602 605 606 595 602 644 692 699 668 644
2243 644 653 661 632 595 604 657 685 656 619 642 708 744 724 691 683 678 648 611 608 630 636 618 612 630 637 604 562 560 604 651 671 670 656 629 597 586 601 614 608 595 583
2238 583 557 516 504 549 616 644 638 650 690 715 703 684 679 674 660 667 709 740 720 669 641 645 656 660 663 663 648 627 611 596 577 578 618 678 726 760 792 793 726 617
2233 617 549 565 624 673 701 719 726 723 725 734 728 694 650 614 587 574 594 651 717 758 763 736 681 621 589 591 592 577 571 598 629 637 643 677 714 708 668 652 670 675 639
2228 639 602 601 622 625 606 584 564 538 516 520 560 617 665 683 666 630 594 567 550 551 575 603 603 572 546 549 566 574 583 615 663 699 709 698 665 608 545 511 520
2223 520 554 585 597 595 597 622 668 716 744 746 727 691 657 653 680 691 645 568 526 534 549 543 543 573 601 591 566 580 638 694 710 685 636 572 520 506 530 561
2218 561 576 591 626 676 718 735 727 695 649 606 584 583 590 591 581 566 566 590 622 633 621 610 624 656 685 700 700 686 659 629 602 588 598 630 652 634 592 583
2214 583 621 648 607 534 520 591 670 678 633 610 640 675 668 637 631 657 667 631 584 575 600 614 602 596 617 638 630 609 607 618 618 605 596 585 564 555 591 650 666 615
2209 615 546 519 529 538 535 542 572 609 630 628 616 615 629 643 645 654 692 739 747 705 660 656 685 714 726 722 700 663 625 601 592 600 635 687 723 716 684 659 645 624 598
2204 598 588 601 630 668 711 745 755 750 753 769 780 774 758 737 706 668 642 637 641 637 635 657 696 712 677 618 591 621 666 677 661 667 709 747 748 725 706 682 631
2199 631 571 545 562 595 618 638 669 712 752 770 752 706 657 631 628 638 654 671 674 651 608 568 541 529 540 580 645 713 755 740 673 606 598 639 659 626
2195 626 585 579 583 567 564 611 664 657 626 653 734 774 746 724 755 777 736 679 668 682 668 642 652 690 705 689 675 678 674 650 624 614 632 673 704 677 597 543
2190 543 579 671 733 736 718 707 702 711 752 806 828 794 730 674 646 653 688 729 755 768 768 740 686 662 706 768 764 693 637 646 680 691 686 689 694 683 660 643 639 659
2185 659 700 729 703 638 605 634 676 684 677 685 685 641 580 557 577 592 584 580 595 603 585 562 559 576 603 640 688 725 726 703 694 713 729 705 651 611 610 622 617 594 573
2180 573 561 558 571 601 624 624 628 663 708 710 673 657 690 730 734 718 712 712 707 717 749 764 726 665 633 627 605 564 551 588 642 672 680 681 675 657 633 623 642 689 738
2175 738 749 715 677 677 695 677 616 569 585 648 707 728 717 699 693 704 722 738 756 779 793 778 738 698 675 665 659 650 636 624 634 670 705 698 654 624 649
2171 649 715 765 762 707 633 583 576 599 620 623 608 585 574 602 673 740 749 695 628 589 577 576 584 601 621 648 685 713 701 654 621 630 649 634 595 575 587 608
2166 608 615 614 624 650 684 714 734 745 755 756 742 726 728 746 755 746 735 720 671 586 532 562 646 704 709 702 703 686 641 611 633 683 715 725 743 775 797 794 775 752
2161 752 730 709 696 687 666 626 582 563 581 631 688 722 713 677 654 665 690 701 708 739 792 819 793 742 710 701 690 683 702 738 747 713 671 656 667 688 723 770
2156 770 797 786 760 756 768 766 749 741 740 719 677 658 688 726 717 668 643 685 765 820 828 813 801 778 725 659 628 652 698 718 707 694 695 698 694 698 729 780 827 859
2152 859 883 903 916 909 879 835 799 777 758 733 711 708 722 729 716 699 707 738 764 769 765 778 801 803 766 715 680 663 648 645 685 766 844 878 881 884 886 863 813 766
2147 766 743 732 713 686 668 681 728 779 798 784 782 826 885 893 835 757 703 668 635 614 619 644 673 713 766 806 801 764 740 750 772 774 751 729 734 759 778 768
2142 768 740 729 758 804 823 802 769 751 743 729 711 717 753 794 818 824 820 803 773 751 751 747 712 675 692 757 793 764 728 746 782 771 727 720 756 769 736 703
2137 703 705 712 697 682 691 696 678 666 696 750 784 786 768 728 670 630 631 648 645 640 663 699 709 694 693 720 752 780 811 828 801 740 694 687 693 689 684 687 692 707 752 820
2132 820 870 879 859 817 749 680 661 705 752 756 742 755 779 768 729 723 765 799 776 718 685 702 741 769 774 761 738 711 690 686 700 723 748 771 782 768 738
2128 738 722 736 758 761 749 742 739 720 684 649 621 598 595 632 684 699 671 657 690 724 707 658 645 686 732 741 717 687 656 621 578 540 527 557 620 683 723
2123 723 742 746 727 688 662 674 705 719 711 702 695 680 666 675 699 705 687 680 713 766 810 833 842 838 813 777 752 752 769 779 760 721 696 705 726 730 726 751 803 830 794
2118 794 722 678 687 719 726 697 662 659 687 706 691 672 693 744 761 712 636 600 621 660 678 671 656 650 656 665 670 669 666 667 674 687 695 692 683 692 721 740 716 663 627 626 636
2113 636 627 613 624 670 717 725 687 651 672 736 765 713 632 604 630 647 634 636 675 706 696 675 685 715 737 748 750 725 676 650 676 713 715 699 696 686 637 579
2108 579 574 612 628 609 601 622 629 605 594 624 661 673 679 703 722 711 688 679 678 672 684 726 753 726 672 653 682 718 741 756 762 740 705 698 723 739 725 716 742 776
2103 776 769 720 679 685 718 736 727 713 711 711 702 700 730 778 793 754 695 664 667 680 691 708 732 748 750 744 731 722 739 789 832 810 727 656 658 710 746 737 704 676 661
2098 661 652 642 632 625 632 664 718 771 797 788 759 741 743 740 712 676 673 705 734 730 708 696 693 685 685 708 734 726 680 635 619 622 631 655 697 730 732 722 732 759 771 761
2093 761 752 749 726 677 643 661 714 750 746 722 700 691 706 751 806 831 813 784 777 780 763 720 682 673 691 716 733 736 736 740 748 747 733 719 709 686 641 601 605 651 697
2088 697 714 708 697 680 658 643 646 657 660 669 697 727 725 696 689 739 815 853 829 782 760 761 752 726 718 753 808 846 859 855 828 776 726 717 744 761 743 706 677 655
2083 655 642 651 682 700 682 662 683 740 790 809 808 801 791 790 811 833 813 750 696 694 723 738 732 732 755 783 794 792 790 792 791 792 815 866 925 959 955 934 918 917 931 954
2078 954 967 949 914 908 954 1006 1009 967 935 941 969 1010 1066 1107 1084 1012 964 976 999 993 992 1033 1072 1043 970 928 926 910 871 859 885 887 839 793 792 804 790 778 802
2073 802 834 832 822 855 922 962 962 960 968 946 881 824 821 854 869 840 784 722 671 647 658 688 718 735 737 727 718 724 744 764 779 793 802 796 783 788 822 860 871 858
2069 858 843 844 863 884 884 854 820 823 865 899 889 860 857 887 917 930 936 940 925 878 815 756 718 717 757 817 857 860 848 844 841 828 814 812 818 826 836 846 836 790 734
2064 734 714 748 808 862 901 928 930 894 834 787 780 810 850 873 870 848 821 800 790 798 820 843 847 829 810 808 817 816 795 773 772 792 813 816 806 802 827 876 925 947
2059 947 930 889 847 825 830 848 866 886 920 962 981 958 914 887 879 871 857 854 858 838 790 751 748 758 755 759 795 840 852 836 840 878 917 935 943 945 924 883 862 888
2054 888 941 990 1023 1030 996 935 899 905 916 906 904 935 958 925 869 854 868 843 773 736 773 820 810 765 749 779 824 859 877 866 828 797 806 836 843 815 783
2049 783 780 815 881 958 1011 1013 972 924 896 897 926 974 1017 1036 1027 1006 984 967 962 969 974 963 943 927 915 900 890 900 930 961 978 977 962 945 940 948 951 939 928 938
2044 938 959 959 919 856 801 792 844 922 960 926 861 830 837 842 827 821 844 881 905 907 893 872 867 890 912 905 893 924 984 1004 963 926 944 979 965 909 873 880 899
2040 899 906 915 934 945 935 916 902 896 899 913 936 963 995 1028 1043 1027 995 981 986 981 954 933 950 997 1034 1039 1036 1060 1106 1122 1080 1007 956 926 881 820 796 833 884
2035 884 895 889 917 975 1011 1009 1003 1015 1031 1040 1054 1074 1077 1062 1045 1028 988 932 900 906 924 936 966 1034 1111 1154 1160 1160 1169 1178 1174 1154 1129 1118 1134 1155 1139 1087 1047 1044 1047
2030 1047 1022 988 991 1027 1053 1050 1037 1032 1024 1011 1011 1035 1058 1057 1039 1035 1060 1088 1083 1050 1037 1076 1136 1162 1146 1134 1146 1154 1136 1119 1126 1128 1100 1076 1097 1138 1148 1130 1131 1153
2025 1153 1149 1110 1075 1061 1044 1016 1014 1050 1083 1082 1068 1067 1079 1104 1153 1206 1211 1167 1150 1198 1244 1203 1100 1031 1029 1048 1066 1111 1185 1233 1224 1195 1203 1252 1303 1328 1316 1286
2020 1286 1271 1298 1344 1357 1313 1248 1203 1188 1192 1211 1247 1294 1339 1360 1339 1282 1239 1259 1322 1362 1348 1314 1294 1282 1266 1261 1277 1285 1271 1266 1299 1343 1345 1310 1289 1302 1321
2016 1321 1336 1366 1409 1423 1386 1343 1354 1415 1470 1479 1459 1451 1468 1488 1481 1447 1409 1385 1379 1385 1404 1432 1447 1434 1408 1399 1414 1435 1444 1444 1444 1444 1446 1454 1469 1486 1500 1510 1515 1520 1536
2011 1536 1573 1616 1638 1631 1608 1583 1561 1562 1600 1657 1685 1667 1632 1606 1581 1557 1569 1640 1724 1751 1728 1720 1746 1746 1685 1624 1639 1708 1739 1704 1664 1674 1707 1714 1707 1728 1766
2006 1766 1763 1715 1690 1736 1808 1833 1800 1765 1767 1796 1833 1871 1897 1890 1849 1811 1804 1821 1843 1870 1905 1930 1927 1921 1942 1975 1969 1921 1892 1934 2008 2034 1985 1933 1958 2057 2144 2140
2002 2140 2061 1995 2007 2081 2148 2164 2145 2132 2141 2153 2149 2131 2125 2149 2196 2242 2265 2259 2232 2200 2186 2213 2284 2379 2462 2505 2502 2469 2436 2422 2427 2442 2468 2509 2549 2563 2544
1997 2544 2517 2509 2528 2558 2583 2598 2617 2660 2725 2777 2783 2762 2763 2798 2832 2841 2843 2846 2826 2788 2787 2852 2917 2911 2871 2892 2986 3063 3069 3050 3060 3088 3100 3104 3123 3150 3171 3194 3221
1992 3221 3238 3249 3281 3328 3341 3309 3305 3389 3511 3579 3583 3594 3643 3694 3727 3775 3855 3920 3932 3921 3936 3979 4017 4040 4068 4111 4160 4212 4268 4316 4333 4326 4336 4399 4494
1988 4494 4564 4585 4593 4633 4695 4739 4769 4841 4972 5104 5170 5181 5188 5218 5263 5327 5417 5504 5549 5565 5598 5657 5708 5753 5833 5959 6080 6153 6205 6275 6360 6431 6496
1984 6496 6587 6712 6843 6949 7022 7080 7165 7308 7482 7624 7713 7790 7890 7987 8048 8097 8185 8318 8462 8597 8734 8873 9007 9149 9316 9490
1981 9490 9641 9774 9931 10123 10320 10488 10635 10794 11002 11262 11538 11764 11923 12074 12288 12558 12823 13066 13323 13618 13924 14224 14535
1978 14535 14857 15158 15439 15752 16129 16526 16893 17260 17688 18171 18641 19060 19459 19886 20361 20882 21447 22042 22646 23257 23889 24540 25196
1975 25196 25865 26585 27379 28231 29109 30008 30945 31926 32951 34015 35127 36297 37537 38847 40217 41639 43116 44661 46288
1973 46288 48015 49865 51850 53949 56123 58366 60717 63221 65895 68729 71720 74876 78206 81724 85445 89390 93581
1971 93581 98050 102824 107898 113238 118848 124786 131122 137862 144970 152439 160307 168602 177294 186343 195742 205494 215552
1969 215552 225817 236186 246571 256873 266956 276657 285803 294215 301708 308101 313222 316926 319107 319718 318752 316217
1967 316217 312139 306594 299738 291772 282889 273250 263022 252405 241605 230785 220033 209406 198985 188886 179205
1965 179205 169975 161178 152801 144854 137335 130223 123502 117179 111270 105757 100591 95726 91145 86858 82877 79191 75756
1963 75756 72504 69388 66405 63584 60944 58481 56178 54019 51993 50094 48311 46619 44982 43389 41857 40410 39055
1961 39055 37788 36609 35499 34415 33325 32257 31261 30348 29482 28635 27825 27073 26365 25657 24932 24211 23522 22871 22251 21667 21137
1958 21137 20660 20200 19710 19188 18680 18221 17801 17397 17014 16667 16338 15986 15606 15235 14895 14578 14279 14012 13781 13557 13312 13053 12805
1955 12805 12567 12315 12040 11759 11502 11284 11099 10926 10745 10560 10380 10198 10000 9793 9603 9447 9312 9191 9088 8990 8862 8695 8534
1952 8534 8422 8335 8217 8057 7898 7777 7681 7589 7496 7408 7322 7232 7149 7084 7024 6941 6816 6668 6538 6449 6383 6304 6203 6104 6011 5904 5779 5666
1949 5666 5592 5544 5498 5458 5434 5398 5321 5222 5158 5144 5141 5102 5026 4941 4876 4841 4822 4786 4712 4630 4586 4582 4580 4565 4554 4548 4516 4445 4365 4302 4241 4168 4101 4061 4029 3972
1945 3972 3901 3858 3857 3867 3850 3811 3777 3759 3738 3687 3613 3566 3575 3605 3588 3514 3438 3403 3393 3371 3343 3335 3342 3339 3318 3289 3245 3176 3100 3045 3017 3002 2998 3011 3023 3008 2978
1940 2978 2970 2985 2981 2944 2915 2928 2947 2914 2837 2776 2768 2785 2788 2767 2724 2655 2571 2513 2513 2548 2562 2539 2517 2527 2543 2526 2488 2473 2493 2502 2461 2390 2343 2338 2350 2351 2334 2304
1935 2304 2262 2210 2162 2141 2160 2199 2214 2177 2119 2096 2123 2151 2138 2111 2126 2176 2199 2166 2119 2106 2110 2087 2037 2005 2011 2031 2037 2031 2020 1996 1955 1925 1936 1969 1970 1918 1858
1931 1858 1844 1874 1902 1907 1906 1912 1914 1904 1902 1931 1979 2002 1974 1913 1850 1804 1773 1749 1731 1722 1718 1703 1670 1632 1615 1626 1650 1668 1669 1654 1627 1606 1605 1620 1632 1640 1652 1660 1648 1628
1926 1628 1638 1680 1709 1688 1641 1605 1581 1561 1557 1581 1601 1591 1578 1602 1637 1622 1556 1506 1505 1518 1519 1534 1579 1621 1622 1595 1569 1544 1506 1469 1448 1427 1385 1339 1329 1358
1922 1358 1392 1410 1422 1444 1471 1480 1454 1408 1376 1379 1388 1362 1320 1315 1350 1361 1316 1270 1276 1308 1315 1318 1364 1426 1433 1379 1338 1349 1370 1367 1358 1356 1335 1284 1246 1247 1244 1193 1126 1105 1140
1917 1140 1196 1252 1300 1322 1312 1311 1356 1408 1395 1313 1229 1194 1196 1211 1242 1286 1315 1313 1301 1292 1271 1236 1223 1260 1315 1341 1341 1344 1345 1305 1217 1136 1121 1174 1248 1291 1280 1228
1912 1228 1184 1182 1203 1194 1137 1080 1078 1121 1156 1159 1152 1166 1202 1246 1288 1318 1320 1291 1247 1205 1161 1118 1106 1144 1201 1223 1212 1218 1261 1289 1249 1162 1099 1084 1085 1078 1082 1117 1161
1907 1161 1192 1220 1264 1306 1305 1268 1239 1238 1235 1200 1145 1108 1097 1096 1090 1083 1077 1072 1074 1086 1100 1103 1109 1145 1204 1235 1200 1124 1068 1060 1089 1134 1175 1183 1126 1023 945 949 1015 1070 1076
1902 1076 1059 1060 1084 1102 1098 1091 1104 1135 1155 1141 1097 1053 1032 1031 1029 1024 1031 1056 1077 1066 1029 1000 1002 1020 1035 1046 1066 1092 1105 1093 1064 1035 1014 998 987 989 1017 1063 1095
1897 1095 1084 1041 1003 992 988 978 988 1043 1101 1090 1007 941 971 1067 1130 1113 1064 1050 1079 1105 1093 1055 1021 1001 983 953 921 904 917 954 993 1010 999 977 965
1893 965 956 932 899 889 920 970 1004 1013 1009 999 993 1017 1068 1085 1017 906 856 900 954 943 894 882 913 937 932 933 958 985 989 975 953 921 893 897 939 984 994 964
1889 964 925 906 912 927 923 898 880 892 914 900 852 824 864 955 1029 1032 969 908 915 984 1035 1008 941 921 972 1036 1065 1070 1069 1051 1010 981 985 989 952 894 869 886 907
1884 907 911 915 934 958 980 1006 1034 1037 1001 948 916 923 957 996 1025 1038 1029 991 936 898 900 926 940 936 946 984 1017 1010 984 980 995 988 948 917 937 991 1028 1019 979 940
1879 940 922 917 911 905 911 931 954 967 969 960 936 911 907 932 961 980 998 1027 1054 1061 1056 1047 1027 999 991 1021 1053 1044 1010 1000 1019 1020 984 941 910 875 824 796 823 879 909
1874 909 897 877 876 886 886 873 861 861 875 902 933 950 930 880 847 874 935 956 913 862 851 850 805 739 729 797 888 958 1010 1046 1040 992 945 934 947 956 958 955 935
1869 935 904 889 897 900 882 867 873 882 881 886 899 885 833 799 827 877 881 844 821 828 832 814 796 787 773 762 777 814 841 846 847 843 815 774 759 783 817 842 862 873 859
1864 859 826 817 851 897 918 915 909 909 920 945 967 957 913 872 858 861 867 881 901 909 904 920 964 996 986 968 989 1029 1030 987 961 988 1030 1028 982 941 936 949 945 916 882
1859 882 861 848 840 850 889 929 920 849 759 699 686 714 761 795 790 759 750 775 795 784 766 768 773 762 760 797 848 868 857 854 861 855 842 854 879 875 838 817 840 873
1854 873 885 894 919 932 904 864 852 859 850 825 816 821 811 779 754 748 746 736 730 735 732 707 681 691 751 839 905 907 849 792 791 830 839 793 746 747 764 735 666 630 658 693
1849 693 683 666 710 801 849 813 755 745 768 755 695 649 656 683 688 679 698 750 801 825 829 821 798 756 711 683 682 699 726 756 784 813 845 871 883 880 877 882 895
1844 895 908 905 874 825 797 822 877 901 868 815 794 807 828 853 891 916 888 813 750 732 738 743 757 793 820 806 768 750 759 769 770 775 779 764 740 740 765 778 753
1840 753 715 705 733 790 855 889 861 794 762 797 840 831 791 787 818 818 765 720 740 799 835 824 782 727 675 662 716 809 871 864 821 800 816 836 820 768 719
1835 719 706 734 780 822 858 887 895 871 823 779 758 755 753 750 751 752 742 722 715 734 763 778 777 778 786 790 791 805 830 839 823 812 823 821 772 711 706 757 790 766 724 712
1830 712 711 681 644 657 728 800 831 832 828 812 777 744 740 761 781 786 786 786 783 778 775 781 796 813 823 822 826 857 915 961 963 936 922 933 938 911 866 844 860 889 907 913 914
1825 914 901 867 828 814 825 835 821 790 764 750 737 718 696 682 682 690 697 708 740 791 822 799 751 742 784 819 811 799 824 854 834 785 783 829 844 800 766 790
1820 790 814 772 709 712 770 790 750 725 761 807 813 809 833 852 818 755 726 733 729 702 696 739 794 816 805 791 790 793 792 783 769 767 785 802 792 763 743 734 710 680 694
1815 694 774 862 894 873 852 848 835 812 811 845 870 853 813 793 797 798 788 792 838 918 1000 1051 1054 1015 963 930 932 953 963 951 928 918 928 948 963 971 981 991 992
1810 992 974 940 904 877 866 870 876 875 864 853 848 852 861 862 843 812 791 795 809 812 802 792 788 789 804 838 863 839 774 724 728 760 773 770 783 818 844 838 807 766 733 737
1805 737 796 872 897 851 793 787 815 816 773 730 730 758 778 779 777 780 775 755 728 710 706 713 728 749 768 779 785 798 817 830 823 796 762 733 719 715 709 693 675 676 694 702
1800 702 681 658 665 686 669 614 594 655 748 783 753 731 762 813 836 840 851 858 829 771 719 690 671 653 647 652 664 687 727 757 735 674 638 669 723 738 716
1795 716 714 759 820 854 852 830 809 797 792 776 743 714 715 736 739 712 686 693 725 748 749 739 733 733 732 720 697 674 666 678 713 766 817 828 792 751 752 783 795 791 817
1790 817 878 907 866 813 816 854 859 826 814 842 866 854 833 833 831 797 748 733 768 821 847 830 785 747 735 734 725 712 711 714 705 689 694 714 718 694 671 675 700 734 777
1785 777 816 822 789 755 750 752 726 686 666 676 694 710 730 744 737 723 719 717 698 683 705 749 756 708 658 660 700 733 747 762 791 824 854 873 869 841 822 846 896
1781 896 916 869 786 727 732 793 868 910 900 857 819 800 785 767 760 778 797 788 759 749 770 788 774 746 743 770 791 780 759 761 797 847 881 884 858 826 814 823
1776 823 828 810 781 766 771 783 793 811 851 905 940 927 880 846 856 883 881 845 814 810 815 816 827 860 884 865 814 768 740 724 732 786 868 926 926 886 843 815 805
1771 805 805 795 765 727 713 726 741 747 761 797 843 881 899 889 844 780 737 730 733 716 686 668 671 692 725 757 769 765 778 822 861 860 845 865 908 911 851 784 775
1766 775 828 904 972 1017 1030 1009 971 937 902 856 820 834 903 978 995 953 907 904 932 948 942 946 979 1019 1031 1005 962 931 930 960 1002 1032 1040 1035 1017 979 936 929
1762 929 970 1014 1018 1004 1016 1044 1039 1004 998 1053 1122 1157 1154 1129 1076 994 923 907 944 999 1042 1055 1021 959 926 954 992 972 906 870 900 958 1004 1045 1097 1143 1157
1757 1157 1139 1101 1052 1018 1033 1096 1152 1166 1163 1190 1238 1271 1288 1312 1334 1328 1311 1337 1407 1463 1471 1468 1490 1512 1490 1438 1408 1413 1426 1433 1438 1432 1387 1313 1259 1254 1271 1268 1239
1752 1239 1209 1197 1202 1215 1219 1208 1191 1191 1201 1190 1153 1132 1162 1206 1190 1098 1002 974 1012 1058 1076 1081 1099 1130 1154 1160 1160 1179 1216 1250 1258 1250 1256 1292 1336 1361 1373 1404 1465
1748 1465 1512 1502 1445 1405 1421 1450 1426 1350 1286 1285 1326 1357 1351 1318 1276 1244 1239 1263 1292 1303 1289 1250 1182 1095 1027 1004 1003 986 966 987 1048 1092 1075 1017 962 938
1743 938 951 1002 1072 1122 1133 1125 1122 1114 1092 1073 1077 1091 1090 1070 1049 1035 1029 1047 1100 1156 1178 1173 1181 1208 1214 1183 1157 1178 1224 1235 1185 1114 1081 1109 1161 1182 1149 1095 1064
1739 1064 1061 1052 1019 979 954 938 926 925 942 961 974 990 1017 1037 1029 1006 994 1001 1017 1035 1043 1015 946 889 909 997 1071 1082 1063 1069 1089 1069 995 914 878 887 909 917 915
1734 915 918 933 960 996 1037 1069 1068 1028 984 981 1017 1038 1010 965 959 993 1019 1008 983 974 981 987 990 996 1000 989 965 945 945 965 998 1025 1036 1030 1011 976 926 885 884 926 982
1729 982 1024 1047 1047 1013 954 914 924 961 982 974 957 947 947 963 997 1024 1018 991 985 1007 1013 970 915 906 948 987 980 946 935 971 1017 1025 990 965 993 1062 1127 1172 1205
1724 1205 1219 1199 1163 1139 1119 1068 1000 977 1016 1055 1052 1052 1110 1184 1191 1139 1110 1138 1173 1189 1229 1310 1363 1326 1242 1202 1231 1280 1306 1312 1308 1297 1285 1283 1288 1286 1279 1278 1279 1273
1719 1273 1262 1258 1248 1218 1183 1180 1222 1273 1299 1305 1317 1344 1370 1378 1372 1364 1367 1378 1384 1375 1349 1313 1271 1231 1207 1211 1242 1288 1340 1386 1403 1373 1311 1263 1263 1307 1365 1407 1420 1408
1714 1408 1389 1384 1403 1436 1465 1474 1460 1439 1427 1431 1440 1443 1448 1470 1517 1571 1600 1584 1542 1520 1549 1598 1604 1560 1528 1557 1612 1626 1603 1609 1661 1702 1685 1644 1637 1671 1712 1741 1760
1709 1760 1763 1753 1755 1781 1804 1791 1766 1785 1848 1894 1877 1827 1801 1808 1824 1837 1855 1874 1874 1855 1849 1886 1952 2003 2008 1979 1946 1919 1886 1859 1874 1942 2021 2064 2076 2096 2134
1705 2134 2166 2179 2184 2190 2185 2175 2194 2257 2335 2389 2406 2401 2392 2397 2429 2467 2478 2461 2459 2494 2534 2543 2537 2554 2597 2643 2690 2744 2790 2805 2802 2816 2850 2878 2900 2942 3007 3066 3107
1700 3107 3150 3205 3264 3328 3414 3503 3553 3565 3592 3657 3710 3712 3709 3777 3919 4068 4161 4187 4178 4184 4258 4397 4541 4639 4716 4817 4929 5004 5040 5091 5179 5272 5345
1696 5345 5428 5553 5712 5877 6037 6198 6370 6568 6793 7010 7188 7344 7524 7734 7934 8114 8328 8613 8940 9268 9603 9968 10351
1693 10351 10723 11095 11499 11944 12422 12942 13519 14137 14763 15395 16062 16790 17597 18494 19473 20502 21570 22708 23939 25235 26558
1691 26558 27923 29375 30911 32474 34020 35535 36994 38354 39590 40696 41638 42360 42836 43080 43101 42891 42472 41902 41220 40434
1688 40434 39572 38698 37833 36944 36022 35134 34351 33675 33079 32580 32208 31946 31767 31688 31755 31963 32259 32619 33068 33634 34326 35151 36120
1685 36120 37229 38463 39829 41336 42980 44762 46721 48903 51303 53893 56689 59732 63004 66440 70023 73802 77795
1683 77795 81929 86116 90323 94520 98606 102440 105915 108944 111405 113156 114110 114265 113655 112320 110328 107784 104808 101504
1681 101504 97958 94232 90388 86504 82673 78969 75423 72062 68929 66068 63490 61186 59146 57344 55732 54292 53068
1679 53068 52117 51418 50891 50492 50258 50238 50437 50841 51445 52242 53221 54395 55802 57463 59357 61465 63790 66345 69123 72122
1677 72122 75350 78798 82417 86166 90027 93964 97866 101604 105089 108266 111036 113252 114780 115533 115467 114583 112952 110683
1674 110683 107863 104553 100842 96860 92714 88457 84142 79864 75719 71743 67927 64281 60855 57689 54780 52096 49611
1672 49611 47315 45213 43301 41566 39983 38547 37270 36165 35231 34452 33810 33281 32839 32483 32241 32131 32140 32234 32401 32663 33044
1670 33044 33552 34176 34893 35677 36518 37427 38405 39421 40432 41411 42334 43154 43819 44306 44619 44731 44576 44108 43347 42359 41201 39919
1667 39919 38550 37111 35592 33993 32368 30787 29275 27802 26352 24961 23676 22493 21367 20270 19217 18244 17366 16565
1665 16565 15817 15121 14498 13952 13442 12916 12354 11786 11254 10785 10389 10057 9758 9461 9169 8914 8708 8512 8289 8057 7857 7684 7491
1662 7491 7263 7043 6869 6728 6591 6460 6351 6259 6157 6039 5918 5804 5692 5582 5473 5362 5239 5117 5017 4939 4857 4751 4626 4498
1659 4498 4381 4293 4248 4230 4203 4141 4058 3978 3910 3850 3799 3758 3721 3686 3650 3607 3545 3482 3453 3463 3462 3412 3339 3298 3296 3289 3248 3187 3125 3072 3047 3063 3089 3064 2981
1655 2981 2900 2872 2868 2837 2785 2748 2728 2699 2656 2628 2626 2634 2632 2615 2575 2518 2476 2472 2483 2465 2419 2390 2396 2405 2393 2377 2363 2318 2223 2130 2105 2142 2175 2169 2148 2144 2152 2153 2150 2148 2138
1650 2138 2105 2061 2037 2045 2065 2067 2046 2022 2010 2001 1972 1924 1888 1895 1934 1966 1968 1950 1930 1908 1870 1820 1778 1769 1792 1823 1834 1811 1765 1725 1714 1727 1737 1721 1694 1687 1704 1708
1645 1708 1672 1624 1617 1663 1716 1731 1709 1671 1627 1582 1558 1565 1574 1552 1515 1505 1527 1544 1534 1518 1514 1506 1480 1468 1502 1556 1567 1517 1454 1438 1470 1506 1504 1472 1450 1475 1526
1641 1526 1550 1517 1463 1446 1470 1482 1443 1373 1324 1316 1331 1345 1356 1373 1401 1427 1438 1431 1427 1444 1475 1496 1497 1483 1451 1392 1324 1300 1344 1405 1413 1370 1336 1341 1352 1339 1323
1636 1323 1332 1352 1349 1324 1304 1292 1269 1234 1208 1200 1193 1178 1168 1164 1150 1125 1116 1142 1180 1195 1186 1176 1182 1202 1232 1269 1293 1279 1234 1191 1170 1160 1145 1137 1159 1206 1243 1244 1222
1631 1222 1213 1226 1232 1199 1134 1082 1074 1093 1102 1091 1074 1066 1065 1067 1070 1070 1063 1057 1069 1101 1139 1166 1182 1186 1176 1160 1154 1167 1182 1179 1156 1130 1108 1091 1078 1069 1061 1049 1041 1044 1056 1064 1071 1091
1626 1091 1126 1159 1169 1154 1129 1112 1110 1117 1117 1104 1092 1105 1152 1211 1241 1216 1144 1073 1050 1088 1148 1177 1157 1122 1117 1148 1180 1169 1112 1046 1016 1036 1085 1127 1138 1107
1622 1107 1044 982 959 986 1032 1063 1077 1093 1112 1110 1082 1057 1059 1074 1067 1037 1018 1034 1068 1078 1044 992 973 1015 1088 1125 1090 1010 947 943 990 1055 1098 1100 1068 1038 1041
1617 1041 1064 1069 1038 1005 1013 1063 1123 1173 1223 1279 1312 1293 1236 1196 1212 1271 1324 1334 1295 1227 1166 1146 1164 1179 1160 1123 1109 1129 1152 1156 1149 1149 1160 1178 1201 1213 1194
1613 1194 1155 1138 1158 1185 1192 1196 1212 1216 1178 1128 1114 1133 1138 1131 1160 1241 1315 1332 1303 1268 1248 1247 1276 1330 1381 1409 1432 1464 1487 1483 1473 1484 1510 1525 1532 1549 1577 1599
1608 1599 1611 1615 1596 1554 1523 1523 1522 1482 1426 1400 1392 1362 1318 1313 1347 1350 1292 1234 1228 1242 1226 1192 1185 1197 1186 1147 1124 1136 1166 1194 1222 1252 1277 1294 1300 1284 1246 1210 1198
1603 1198 1196 1178 1155 1157 1183 1198 1194 1203 1244 1292 1314 1318 1332 1365 1404 1434 1447 1442 1435 1454 1497 1523 1506 1472 1467 1479 1455 1386 1335 1348 1385 1368 1289 1222 1216 1234 1215 1162 1128
1598 1128 1128 1133 1118 1097 1088 1094 1119 1167 1216 1225 1189 1150 1136 1120 1070 1002 957 947 958 983 1021 1053 1063 1067 1088 1104 1075 1012 982 1018 1077 1106 1097 1078 1064 1052 1035 1016
1594 1016 1004 1009 1026 1038 1029 1014 1021 1045 1048 1022 1000 1006 1011 981 929 906 934 979 996 972 938 932 956 969 939 893 883 917 946 939 917 915 933 958 999 1057 1090 1054 976
1589 976 934 963 1014 1015 954 879 852 887 945 976 971 969 998 1033 1029 978 914 860 819 789 775 764 735 697 693 745 824 878 883 860 847 867 905 930 924 909 919 949
1584 949 955 914 858 838 850 846 800 743 718 725 734 742 772 826 867 873 874 911 966 979 930 864 830 824 820 818 828 835 816 780 766 789 827 853 863 866 860 836 797 758 738
1579 738 743 757 755 736 729 756 798 809 772 715 682 691 731 769 781 769 749 738 743 765 801 832 839 830 833 855 868 855 834 823 808 781 775 812 859 862 822 784 764 748
1574 748 740 765 811 843 852 858 845 789 722 727 821 918 941 912 890 874 829 764 719 702 690 677 683 710 740 763 777 773 757 760 806 862 875 843 810 806 822 839 852
1570 852 867 886 911 929 915 876 857 884 918 902 840 791 779 782 782 798 829 846 839 841 881 931 941 900 837 787 767 779 803 817 818 832 873 920 943 935 901 844
1565 844 770 716 719 773 826 846 852 878 912 911 860 803 791 830 881 911 914 887 830 768 740 765 819 877 937 996 1026 1002 953 927 928 916 869 809 769 767 799 852
1560 852 896 904 879 846 826 831 865 908 920 880 827 813 837 852 840 827 821 791 725 667 658 691 736 782 824 844 842 850 889 928 920 872 833 819 806 770 733 726 750
1556 750 773 766 738 730 765 810 812 775 765 817 884 904 883 872 881 868 812 748 724 746 789 818 810 769 740 759 812 837 805 752 733 757 788 806 824 851 866
1551 866 848 808 788 811 863 910 940 956 956 930 886 853 850 861 860 852 858 879 897 891 859 818 795 809 851 888 898 896 902 903 865 786 709 683 713 761 784 772 744
1546 744 729 731 737 739 748 767 774 748 702 671 676 711 760 798 800 765 739 769 839 874 828 744 706 748 834 905 930 923 909 899 886 856 818 799 822 873 906 886 828
1542 828 784 780 792 779 746 729 738 743 717 671 629 609 618 660 710 731 720 719 750 782 790 803 845 875 843 778 759 796 831 832 834 857 862 826 790 800 837 849 822
1537 822 778 736 709 716 759 820 873 910 922 894 831 774 756 768 780 783 783 776 758 734 714 696 682 693 731 772 796 821 863 895 886 844 807 784 771 776 809 848
1532 848 852 816 773 747 734 726 724 729 740 765 803 825 805 764 749 770 792 791 779 771 761 739 720 715 718 722 732 750 766 776 793 816 823 803 773 762 771 789 806 816
1527 816 811 797 793 808 823 822 813 801 769 712 671 688 747 795 810 816 829 818 765 710 714 772 821 821 801 806 825 806 743 692 701 747 773 761 739 724 704 670 653
1522 653 681 739 772 748 697 675 709 769 806 807 805 829 866 867 815 745 707 716 748 764 750 714 687 694 727 755 757 753 771 807 825 800 753 722 731 770 813 839 845
1518 845 840 836 833 818 786 755 755 791 824 812 761 723 732 761 759 719 694 724 786 823 810 778 764 769 770 772 798 849 888 881 838 792 763 741 724 730 771 821 836 797
1513 797 746 745 802 853 834 766 729 757 800 808 801 821 855 854 819 803 821 842 861 919 1017 1081 1055 972 902 871 871 904 957 978 932 864 847 884 918 920 896 854
1508 854 803 791 853 935 945 884 851 903 987 1029 1031 1031 1032 1020 1012 1029 1050 1048 1040 1052 1067 1044 987 943 936 947 950 944 942 951 963 966 949 920 900 904 924 951 976 981 959 929
1503 929 926 955 975 961 931 913 908 908 917 934 942 928 905 893 905 948 1005 1028 976 891 862 900 918 865 809 825 887 926 945 984 1016 991 954 992 1081 1096 1002
1499 1002 913 927 994 1008 959 916 911 923 939 977 1034 1072 1066 1034 1013 1023 1057 1102 1150 1198 1223 1202 1153 1136 1184 1252 1277 1262 1255 1259 1233 1179 1154 1192 1256 1309
1494 1309 1363 1428 1473 1474 1464 1492 1554 1613 1646 1656 1656 1664 1698 1738 1742 1716 1724 1795 1874 1905 1915 1966 2058 2142 2208 2295 2424 2569 2709 2844 2976 3099 3221
1490 3221 3353 3486 3607 3735 3904 4115 4345 4590 4859 5130 5385 5659 6010 6416 6785 7088 7409 7822 8280 8668 8954 9199 9448
1487 9448 9669 9801 9824 9760 9634 9454 9221 8944 8634 8306 7968 7619 7249 6855 6454 6077 5738 5426 5119 4827 4579 4375 4164 3907
1484 3907 3641 3441 3331 3251 3129 2963 2800 2673 2571 2462 2345 2253 2215 2216 2196 2122 2027 1970 1958 1944 1896 1830 1776 1742 1723 1719 1713 1666 1571 1484 1459
1481 1459 1485 1504 1488 1453 1420 1391 1369 1371 1389 1386 1338 1271 1231 1225 1222 1205 1197 1226 1274 1293 1271 1239 1226 1213 1169 1113 1088 1101 1110 1097 1098 1143 1202 1223 1211 1212 1237 1244 1205
1476 1205 1145 1108 1102 1102 1097 1103 1131 1161 1153 1095 1031 1027 1103 1218 1312 1353 1340 1278 1188 1117 1106 1146 1185 1195 1192 1202 1218 1221 1205 1173 1136 1116 1135 1180 1207 1198 1193 1228 1275
1471 1275 1285 1260 1248 1259 1258 1233 1218 1227 1226 1194 1178 1224 1303 1339 1300 1222 1154 1121 1133 1185 1236 1245 1216 1188 1174 1157 1143 1156 1180 1150 1054 975 990 1057 1080 1041
1467 1041 1007 1016 1031 1012 980 969 973 973 974 991 1004 980 924 884 893 939 985 1004 987 942 892 860 855 862 859 845 840 858 882 885 868 871 913 957 943 873 818 829 884 924
1462 924 933 937 952 953 915 847 778 730 711 723 765 823 879 915 927 917 900 890 897 910 916 908 894 884 876 875 886 904 902 864 816 808 848 895 910 908 920 944 949 916 865
1457 865 828 826 860 900 896 832 758 736 768 796 786 763 770 815 876 921 932 915 912 953 1002 987 904 839 857 915 926 884 858 884 927 946 940 924 901 877 871 885
1452 885 896 888 873 866 864 864 881 919 946 928 874 836 852 910 965 981 952 904 879 901 951 983 975 957 964 991 983 917 837 810 849 906 935 937 927 906 877 861 875
1447 875 901 905 886 866 856 836 795 749 730 752 804 858 878 850 803 789 832 897 936 929 898 870 860 878 921 971 994 980 959 962 980 971 931 914 957 1026 1045
1443 1045 995 936 930 980 1040 1066 1047 1005 977 986 1007 995 949 910 903 906 897 892 903 908 887 865 870 882 864 839 859 923 973 988 1004 1043 1065 1035 982 960 973 981 960
1438 960 932 928 950 975 983 980 985 995 988 961 949 973 999 979 927 900 918 941 937 924 919 906 870 828 807 808 818 834 850 848 828 810 809 818 832 855 872 853 814 810 859
1433 859 899 880 836 824 833 819 796 821 886 916 876 819 802 817 825 822 826 831 819 790 753 717 698 725 803 891 934 924 903 906 935 969 989 982 945 895 863 865 880
1428 880 874 841 815 820 840 840 822 812 819 828 836 859 887 882 836 798 810 849 865 853 843 841 830 816 833 881 922 935 938 944 935 909 900 931 970 972 950 948 974 987 971 956
1423 956 964 970 944 910 916 962 990 961 900 850 819 802 820 890 980 1042 1071 1094 1102 1068 1030 1065 1166 1227 1197 1161 1212 1308 1345 1321 1324 1382 1428 1419 1394 1398 1422 1453
1418 1453 1505 1580 1643 1667 1665 1646 1612 1584 1591 1612 1594 1542 1524 1562 1587 1544 1479 1461 1471 1446 1384 1332 1299 1261 1223 1219 1241 1242 1207 1169 1158 1169 1178 1172 1144 1110 1100
1414 1100 1119 1123 1074 1000 955 943 928 908 915 952 980 986 989 994 974 932 910 920 918 878 838 841 870 882 880 895 912 887 817 763 769 813 847 871 917 993 1058 1077 1067
1409 1067 1065 1077 1077 1056 1033 1018 1003 990 997 1017 1005 950 912 945 1015 1041 1013 993 1013 1046 1072 1112 1165 1180 1132 1078 1078 1110 1113 1087 1088 1138 1198 1239 1276 1322 1355
1405 1355 1350 1329 1331 1361 1386 1377 1340 1299 1276 1277 1303 1345 1387 1411 1421 1432 1450 1462 1454 1431 1411 1399 1399 1419 1458 1484 1462 1399 1348 1342 1361 1377 1392 1414 1430 1427 1425 1443 1459
1400 1459 1430 1366 1323 1326 1337 1324 1302 1308 1330 1331 1298 1259 1234 1215 1189 1168 1165 1180 1195 1197 1183 1158 1137 1128 1118 1093 1061 1061 1100 1132 1110 1051 1014 1019 1040 1064 1112 1177
1395 1177 1203 1161 1106 1107 1154 1178 1154 1114 1086 1060 1032 1023 1037 1048 1044 1051 1079 1104 1099 1082 1085 1105 1113 1096 1059 1007 948 912 934 1004 1067 1083 1065 1054 1065 1072 1050 1012
1391 1012 1003 1040 1086 1104 1103 1123 1174 1223 1239 1225 1196 1156 1112 1076 1051 1035 1036 1069 1119 1148 1145 1138 1149 1168 1182 1198 1213 1195 1132 1067 1044 1054 1064 1069 1081 1094 1096 1105
1386 1105 1132 1145 1114 1072 1073 1101 1094 1046 1023 1060 1115 1140 1145 1162 1184 1192 1194 1195 1178 1127 1069 1044 1062 1106 1162 1219 1256 1263 1253 1241 1229 1220 1231 1263 1282 1261 1231 1231 1250
1381 1250 1239 1196 1172 1199 1244 1251 1213 1164 1143 1161 1203 1244 1260 1252 1241 1251 1278 1303 1315 1319 1328 1348 1375 1406 1436 1453 1443 1403 1356 1333 1346 1380 1411 1434 1449 1442 1401
1377 1401 1336 1283 1267 1282 1300 1308 1319 1352 1398 1426 1416 1384 1372 1400 1443 1470 1482 1499 1523 1530 1512 1504 1538 1597 1631 1619 1590 1587 1618 1665 1705 1720 1698 1646 1597 1583
1372 1583 1598 1618 1643 1688 1745 1778 1776 1773 1799 1841 1867 1873 1876 1884 1887 1884 1880 1867 1842 1826 1843 1881 1910 1925 1940 1952 1937 1901 1891 1937 2008 2056 2072 2080 2100 2128 2148 2151 2144 2145
1367 2145 2169 2206 2225 2217 2206 2218 2252 2291 2321 2331 2317 2298 2306 2353 2409 2438 2439 2449 2497 2567 2617 2624 2609 2614 2651 2684 2690 2699 2747 2812 2838 2825 2835 2904 2986 3030 3054 3096
1363 3096 3147 3175 3190 3224 3275 3308 3322 3351 3399 3437 3460 3502 3574 3639 3670 3696 3756 3836 3900 3948 4021 4132 4249 4335 4400 4469 4541 4596 4640 4708 4812 4917
1359 4917 4992 5055 5150 5278 5405 5511 5611 5724 5848 5984 6141 6299 6421 6513 6631 6799 6971 7099 7214 7380 7603 7841 8077 8324
1356 8324 8569 8779 8971 9208 9519 9864 10199 10533 10885 11240 11579 11918 12299 12736 13209 13695 14189 14709 15277 15908 16599 17341 18132
1353 18132 18966 19823 20695 21613 22628 23754 24968 26266 27676 29200 30803 32466 34234 36176 38326 40685 43260 46064
1351 46064 49098 52360 55879 59708 63892 68446 73352 78588 84153 90075 96362 102944 109690 116477 123211 129772 135967
1349 135967 141549 146257 149839 152075 152839 152134 150054 146739 142380 137212 131462 125286 118792 112106 105389 98786 92386
1347 92386 86245 80421 74986 69993 65438 61262 57399 53829 50566 47602 44887 42377 40065 37957 36046 34319 32765
1345 32765 31357 30063 28877 27810 26845 25937 25085 24339 23715 23151 22590 22067 21644 21303 20980 20667 20413 20210 19988 19718 19476
1342 19476 19344 19311 19308 19291 19262 19238 19238 19287 19402 19578 19786 20006 20241 20516 20853 21244 21644 22036 22465 22994 23618 24282 24953 25666 26462 27351
1339 27351 28323 29369 30476 31644 32915 34346 35934 37621 39389 41307 43434 45740 48159 50700 53431 56367 59441
1337 59441 62581 65779 69057 72411 75800 79182 82532 85846 89147 92478 95868 99311 102779 106256 109742 113233 116690
1335 116690 120041 123222 126203 128975 131543 133933 136212 138445 140639 142740 144698 146506 148156 149580 150658 151287 151437
1333 151437 151136 150431 149359 147974 146360 144606 142746 140752 138607 136333 133944 131394 128620 125619 122437 119111 115666
1331 115666 112163 108680 105246 101828 98406 94993 91586 88147 84671 81198 77745 74272 70763 67282 63903 60637 57466
1328 57466 54405 51468 48643 45927 43371 41010 38798 36686 34710 32935 31336 29814 28334 26953 25702 24534 23413
1326 23413 22372 21445 20608 19821 19080 18396 17746 17107 16492 15919 15384 14875 14387 13917 13453 13004 12609 12284 11993 11695 11396 11120
1324 11120 10869 10619 10359 10100 9846 9603 9376 9163 8949 8732 8532 8360 8197 8025 7864 7738 7630 7499 7341 7198 7090 6985 6837
1321 6837 6646 6474 6370 6312 6229 6089 5940 5842 5787 5724 5645 5593 5575 5531 5419 5276 5156 5061 4972 4908 4894 4894 4839 4727 4623 4567 4528 4460 4371 4293
1317 4293 4244 4211 4179 4139 4086 4022 3954 3884 3815 3755 3709 3671 3643 3636 3649 3652 3614 3552 3498 3455 3404 3349 3318 3305 3272 3220 3199 3226 3242 3191 3105 3059 3073 3099 3098 3077
1313 3077 3055 3026 2976 2911 2851 2816 2812 2830 2847 2841 2811 2777 2750 2727 2698 2657 2603 2541 2490 2473 2492 2515 2511 2482 2462 2483 2533 2559 2528 2458 2403 2383 2367 2322 2263 2234
1308 2234 2251 2290 2322 2335 2321 2273 2207 2155 2131 2117 2096 2079 2084 2098 2087 2041 1987 1955 1956 1981 2023 2069 2089 2060 1999 1958 1972 2013 2021 1979 1931 1921 1938 1940 1924 1916 1925
1304 1925 1933 1929 1919 1901 1865 1833 1849 1917 1961 1922 1835 1791 1817 1855 1847 1799 1754 1734 1732 1734 1730 1718 1712 1726 1746 1746 1726 1703 1681 1645 1605 1605 1650 1687 1670 1628 1620 1648 1671
1299 1671 1666 1652 1649 1644 1614 1555 1486 1443 1453 1506 1554 1567 1570 1599 1638 1632 1564 1485 1452 1471 1513 1552 1578 1598 1623 1646 1633 1560 1458 1391 1388 1424 1460 1483 1488 1477 1467
1295 1467 1476 1498 1514 1524 1541 1546 1505 1435 1405 1439 1482 1477 1451 1455 1487 1501 1489 1475 1469 1453 1420 1389 1372 1365 1370 1391 1420 1443 1462 1480 1483 1456 1408 1365 1339 1330 1330 1318 1275
1290 1275 1229 1246 1331 1397 1372 1305 1290 1323 1322 1267 1218 1208 1206 1205 1244 1313 1328 1259 1198 1236 1326 1351 1292 1237 1240 1262 1255 1226 1209 1214 1229 1254 1294 1340 1364 1337 1264
1285 1264 1192 1168 1181 1177 1137 1100 1093 1096 1088 1094 1142 1203 1231 1230 1238 1248 1231 1199 1197 1220 1215 1172 1159 1225 1326 1376 1346 1274 1210 1178 1180 1192 1181 1140 1103 1101 1137 1188 1230
1281 1230 1238 1200 1148 1152 1246 1376 1453 1446 1406 1399 1447 1525 1584 1585 1532 1483 1497 1567 1634 1658 1667 1706 1771 1821 1835 1835 1846 1867 1884 1892 1894 1890 1879 1853 1806 1737 1674 1649 1653
1276 1653 1634 1567 1498 1481 1501 1499 1467 1453 1471 1468 1406 1337 1328 1365 1373 1320 1254 1228 1250 1289 1309 1282 1216 1155 1147 1178 1190 1156 1114 1107 1130 1146 1141 1137 1153 1188 1223 1244
1271 1244 1252 1256 1249 1210 1143 1098 1113 1162 1177 1137 1091 1089 1128 1172 1202 1210 1180 1120 1078 1097 1157 1197 1184 1149 1140 1170 1215 1247 1260 1263 1260 1238 1191 1141 1117 1121 1125 1113 1103
1266 1103 1121 1159 1185 1187 1174 1173 1201 1257 1318 1349 1350 1356 1392 1445 1482 1494 1491 1477 1448 1410 1382 1377 1393 1415 1425 1416 1410 1447 1528 1596 1595 1539 1497 1509 1547 1564 1543 1507 1481
1262 1481 1471 1461 1434 1393 1367 1375 1401 1415 1414 1417 1420 1405 1392 1426 1503 1543 1487 1382 1325 1343 1372 1361 1329 1314 1309 1288 1253 1231 1223 1214 1206 1207 1195 1141 1071 1053 1101 1144
1257 1144 1126 1079 1066 1086 1089 1065 1052 1058 1052 1030 1024 1045 1058 1051 1060 1094 1103 1058 1007 1012 1055 1073 1051 1033 1036 1028 985 927 898 919 978 1033 1042 1007 975 963 940 888 858 899
1252 899 968 988 954 935 960 993 1008 1026 1037 998 920 883 915 936 880 803 801 864 904 887 866 875 883 861 829 816 824 842 879 939 993 1008 988 968 968 970 943 883
1247 883 826 812 851 908 949 963 961 951 938 933 944 964 974 953 898 836 816 857 912 917 869 830 836 850 830 801 801 820 826 837 891 961 973 907 835 819 848 882
1243 882 911 947 979 985 966 945 933 925 922 932 952 970 973 950 897 831 790 802 853 898 907 887 871 877 888 878 847 830 854 902 922 892 837 800 802 825 841 841 842
1238 842 863 892 895 855 796 758 763 807 878 952 1002 1021 1030 1043 1034 983 921 901 926 949 939 909 881 856 851 894 976 1032 1010 939 891 885 884 862 848 878 941 978
1233 978 955 898 866 885 921 934 922 906 889 855 816 796 794 790 787 817 880 930 934 913 903 897 876 851 847 864 885 900 912 912 899 892 914 950 969 969 971 984 989 975
1228 975 950 926 897 853 801 766 775 830 889 912 900 888 882 849 793 773 822 873 852 788 773 826 873 873 867 889 896 845 775 754 783 806 795 782 799 837 871
1224 871 882 863 825 792 787 806 829 848 870 892 898 887 873 858 833 802 785 791 801 800 806 845 898 913 874 826 826 860 868 823 762 738 754 769 751 718 707 741
1219 741 797 829 816 783 774 793 818 840 879 931 951 924 899 927 980 991 950 904 875 844 806 793 814 828 801 752 714 695 688 700 734 770 797 826 861 883
1215 883 883 879 884 882 869 875 910 932 906 867 877 932 973 968 940 912 883 868 888 925 921 857 790 779 818 854 851 821 796 796 819 834 816 781 769 788 796 760 702 676
1210 676 700 745 777 789 788 775 748 713 698 724 782 833 849 843 841 843 835 829 843 864 851 801 767 792 853 901 923 936 941 933 921 922 926 907 864 825 809 806 811 829 859
1205 859 880 877 860 855 875 907 918 894 855 845 880 928 949 930 883 813 734 686 703 759 788 765 738 759 816 856 853 831 819 820 820 808 785 762 753 766 799 835
1200 835 854 844 813 785 774 768 750 730 736 772 809 828 845 870 884 865 836 835 863 878 852 806 782 790 815 838 849 846 830 805 777 758 750 741 720 696 695 716 730
1196 730 727 741 799 863 876 842 814 814 810 789 780 803 826 823 812 813 807 786 789 842 888 862 792 762 787 803 782 773 805 833 821 808 838 881 879 845 838 865 875 837
1191 837 777 729 708 720 764 815 836 826 817 824 835 848 879 923 940 914 877 858 836 780 712 688 729 794 834 836 822 811 808 804 795 785 784 794 798 784 763 747 742
1186 742 748 765 786 794 786 788 824 879 911 907 890 885 889 892 892 885 847 768 681 630 622 619 597 579 601 655 707 745 790 844 868 837 790 797 868 933 931 878 833 821 818 805
1181 805 796 806 820 816 800 791 792 787 775 778 802 826 831 827 843 870 868 821 765 749 777 806 807 791 782 785 791 795 804 814 822 824 818 803 778 750 721 696 690 718 761 778 745 697
1175 697 680 699 715 705 688 688 708 741 788 838 859 832 772 716 684 678 704 758 816 847 852 854 853 829 795 799 863 925 912 833 771 775 815 836 824 791 737 670
1171 670 629 638 662 659 640 653 697 726 728 749 811 873 896 891 875 833 757 695 697 739 767 775 805 852 864 827 792 800 823 817 794 789 804 806 783 756 752 773 801 807 774
1166 774 721 696 724 782 823 837 844 864 882 876 844 816 825 868 898 878 824 786 778 768 737 713 731 775 802 808 821 848 860 848 846 881 935 957 925 858 790 741
1161 741 718 715 723 734 750 773 793 796 782 767 763 756 734 713 715 734 741 730 731 759 783 777 764 777 791 761 701 676 699 711 674 636 650 695 718 713 710 717 722 741 790
1156 790 836 829 785 768 792 806 782 756 754 755 743 742 764 773 743 708 719 758 777 773 783 816 841 838 829 822 798 754 725 738 764 756 717 690 701 730 747 740 714 679
1151 679 650 640 646 650 644 647 679 724 757 787 832 872 845 742 644 630 676 694 663 651 702 772 790 754 718 713 734 764 787 785 758 727 707 689 667 664 691 721
1147 721 721 711 728 766 784 779 778 777 736 657 607 627 668 661 616 598 630 677 716 755 797 812 788 757 758 785 797 783 775 803 856 886 870 833 826 863 911 933 919
1142 919 887 856 834 825 826 822 801 773 749 732 717 721 758 812 839 825 798 781 765 738 718 718 723 709 696 723 786 833 841 837 851 871 869 844 810 768 720 681 664
1137 664 665 684 734 795 805 728 622 577 612 660 678 688 719 748 749 740 747 752 724 681 669 695 721 720 709 709 722 735 740 728 702 687 706 751 784 778 739 690 654
1132 654 655 693 727 708 644 597 602 630 630 604 590 606 638 666 697 734 755 737 691 671 718 807 865 845 782 747 758 766 740 706 710 742 756 735 711 718 745 761
1128 761 750 723 697 679 671 680 708 750 788 805 802 791 785 785 785 785 784 777 764 750 746 750 745 720 689 680 709 756 792 809 817 822 817 799 771 736 701 691 721 765 768 723 676
1122 676 661 654 639 655 731 810 822 783 765 770 735 663 642 701 744 688 587 556 614 684 713 716 715 718 735 771 799 793 780 796 817 800 764 763 793 794 761 761 816
1118 816 861 841 800 801 826 816 770 738 741 756 760 760 754 732 696 665 653 661 683 712 731 733 736 758 790 798 773 744 746 781 819 825 796 756 729 713 694 677 673 667 639
1113 639 609 628 705 781 806 792 774 757 734 734 770 795 758 690 668 702 730 722 722 755 777 747 713 737 804 835 800 744 716 710 698 681 684 717 769 809 814 794
1108 794 776 779 795 811 828 850 858 834 789 758 754 762 772 790 808 799 767 761 808 859 844 772 717 712 707 667 632 653 707 734 736 760 798 781 696 627 651 729 778
1103 778 783 788 797 774 720 687 691 691 659 634 657 711 747 757 771 803 831 831 794 736 691 696 751 808 821 798 773 756 726 675 636 633 654 661 646 627 618 609 595 590 612
1098 612 658 699 723 742 766 783 779 760 741 724 700 682 692 731 770 790 782 739 668 623 660 767 857 873 847 832 831 814 788 783 796 796 774 748 720 682 659
1094 659 685 741 771 759 750 768 779 752 713 698 695 666 624 608 623 643 660 696 747 773 760 739 745 764 765 750 755 797 853 887 891 882 879 883 883 874 861 852 843 821 795
1089 795 800 850 906 905 839 766 739 742 727 698 703 753 791 769 709 663 643 629 620 640 680 700 676 637 628 663 722 777 809 805 767 711 660 628 618 627 649 686 735
1084 735 773 761 695 632 633 688 736 745 744 757 768 758 735 712 684 650 633 641 648 637 633 661 691 685 660 662 689 694 668 650 673 716 749 762 755 733 714 721 744 745 718
1079 718 700 711 732 740 744 746 725 683 662 693 739 754 750 766 792 784 747 744 794 831 799 732 704 717 711 657 611 628 687 721 710 695 704 711 690 667 684 723 724 676
1074 676 639 658 699 701 665 642 654 668 662 659 683 719 729 706 687 708 757 783 757 707 692 728 778 802 801 795 778 739 700 692 702 688 647 619 630 657 668 666
1069 666 669 677 684 698 719 730 720 698 678 660 654 678 723 744 716 669 650 662 682 715 772 830 835 777 700 650 643 672 719 745 724 688 694 737 760 741 734 771 794
1064 794 742 657 643 720 802 807 744 677 650 665 716 786 849 879 871 844 828 846 894 936 935 890 839 814 813 818 813 796 766 728 701 700 723 750 765 760 743 728 724
1060 724 722 714 701 696 697 693 683 687 709 731 730 717 718 740 774 804 826 830 812 783 763 759 759 752 735 716 699 695 707 724 730 729 734 747 747 717 667 616 578 561 569 588 589 566
1054 566 551 577 636 694 735 770 796 792 753 704 668 643 624 627 664 720 770 807 841 874 894 895 887 875 862 851 844 832 809 788 783 788 780 747 710 693 700 722 748
1050 748 767 766 749 736 743 759 755 719 666 632 645 699 755 777 771 771 785 788 765 742 756 802 845 852 821 767 715 686 684 690 692 702 728 747 734 703 681 666 637 605
1045 605 602 629 645 641 652 690 707 670 620 618 653 668 657 667 719 766 759 717 688 694 717 736 746 741 720 693 678 689 716 739 742 733 732 744 748 728 698 686 691 693 686
1040 686 681 672 644 608 610 664 725 734 696 662 657 657 632 591 569 583 617 641 640 624 617 629 648 667 698 755 828 886 905 880 819 749 710 724 762 771 743 721 738
1035 738 774 788 769 750 748 748 728 690 664 669 703 748 789 822 842 841 811 764 723 704 705 713 713 696 665 631 608 596 591 596 620 654 680 689 694 702 701 684 664 667 692 719
1030 719 730 730 728 727 728 737 745 742 733 734 751 766 763 746 727 705 682 675 696 724 730 713 700 704 704 690 684 706 738 742 709 670 652 651 653 651 659 685 728 770 788 764 710 667 673
1024 673 723 769 765 716 671 670 698 712 701 690 694 690 655 601 561 547 552 578 625 676 711 739 778 812 794 728 679 692 733 746 726 705 692 673 660 686 738
1020 738 762 743 725 746 779 785 780 805 848 845 771 678 636 659 703 731 739 736 720 687 653 641 663 703 746 787 822 824 773 703 686 748 832 861 822 772 752 748
1015 748 738 723 717 714 699 681 672 666 650 639 662 720 768 765 721 675 653 647 648 652 656 648 621 588 579 613 676 724 726 697 678 684 691 687 698 734 752 702 615 587 658 762
1010 762 816 811 790 775 757 740 741 749 736 699 669 654 633 603 600 641 694 724 734 746 758 748 720 700 700 708 715 717 710 692 668 655 659 677 702 727 743 749 754 759 754 735
1005 735 725 748 786 796 767 738 750 791 821 820 808 808 819 819 799 767 743 735 737 739 732 714 687 661 648 652 670 705 753 798 819 808 774 717 637 560 537 584 656
1000 656 696 692 666 632 598 591 629 689 733 759 787 805 775 706 652 636 626 613 637 702 734 671 570 542 610 692 717 692 651 608 570 562 597 649 688 701
996 701 690 661 637 645 683 713 704 672 649 638 631 639 680 738 774 775 774 801 830 809 724 633 598 622 646 636 625 655 712 739 725 714 733 748 728 703 717 758
991 758 780 780 799 834 828 746 638 580 591 625 639 632 629 648 682 705 689 647 629 665 726 762 768 777 801 813 798 779 778 786 784 773 761 743 722 719 748 788 803 792
986 792 775 755 722 679 650 647 656 671 691 713 718 708 702 715 736 754 768 772 755 719 694 690 680 644 608 623 694 772 807 795 764 740 735 750 771 776 755 726 716
981 716 725 722 683 626 592 600 632 662 691 723 747 751 743 746 756 761 756 742 703 639 601 639 721 753 703 650 662 701 696 650 624 633 645 653 686 735 745 702 658 650 654 643
976 643 648 692 744 756 738 739 770 798 805 803 802 799 789 772 747 715 689 693 725 750 744 716 697 704 719 707 669 651 697 787 845 827 757 697 681 703 748 794 812 781
971 781 718 663 642 645 651 661 695 753 797 780 708 653 669 723 735 682 628 624 654 687 727 788 835 825 774 740 741 742 720 691 675 663 649 649 677 721 753 757 736
967 736 706 693 707 731 739 734 736 749 753 746 759 805 855 861 811 736 677 653 657 672 689 709 721 704 658 624 637 667 655 590 537 565 669 781 831 803 736 695
962 695 711 749 758 732 708 702 695 682 686 720 763 799 839 877 875 817 749 718 718 708 683 669 678 696 711 721 718 699 683 684 683 657 631 652 719 777 784 757 735 720 688
957 688 635 595 598 637 682 718 747 766 752 696 640 636 675 693 665 644 677 729 731 688 663 682 695 659 598 568 592 646 686 682 644 626 667 738 777 761 728
952 728 712 707 709 738 793 833 823 781 742 709 666 618 593 605 642 691 734 746 722 694 703 746 778 763 707 645 615 644 711 752 721 651 621 658 706 711 684
948 684 671 675 669 650 643 654 652 627 615 647 697 716 706 710 746 782 791 788 794 798 791 786 790 781 741 701 696 718 733 737 749 758 741 712 712 743 758 741 718 704 679 646 643 678
942 678 699 675 643 646 662 653 634 638 658 672 703 772 831 813 735 675 667 681 707 776 861 880 805 720 710 754 780 770 762 772 781 780 780 786 793 802 811 811 803 814 859 905
937 905 909 876 853 869 903 925 926 921 933 969 1003 996 953 932 983 1076 1138 1142 1121 1112 1119 1141 1184 1240 1283 1300 1303 1310 1321 1328 1326 1309 1276 1237 1204 1172 1134 1106 1107 1124 1121 1095
932 1095 1080 1083 1070 1026 982 962 937 877 812 790 808 826 834 849 867 861 829 794 759 713 680 710 786 821 770 698 698 780 869 907 891 847 811 819 867 902 875
928 875 815 787 805 822 805 776 761 757 760 778 799 792 749 708 701 711 718 728 744 736 684 623 603 625 656 690 740 792 810 798 793 803 807 798 800 813 806 766 728 715 711
923 711 695 684 702 741 780 813 837 842 828 819 819 789 712 636 617 635 629 594 590 635 674 654 608 601 647 700 724 726 727 730 727 719 717 723 724 718 723 754 792 789 731 658 611 591
917 591 579 584 623 674 696 692 711 767 805 776 701 647 640 661 687 708 703 656 581 527 519 543 572 602 641 681 706 715 716 713 695 663 638 644 681 726 756 763 748 718
912 718 694 695 718 735 738 748 780 806 795 764 765 803 823 789 728 689 675 664 656 672 706 728 719 687 650 617 601 614 641 652 639 627 642 671 684 672 657 666
908 666 698 726 729 721 728 742 731 685 635 617 627 643 662 683 689 674 668 704 757 771 743 724 739 755 744 724 714 703 688 699 746 775 744 690 679 701 687 625
903 625 589 635 731 806 833 825 798 763 739 748 787 827 837 800 732 674 660 676 681 663 652 672 701 704 682 667 673 688 703 722 738 730 694 654 640 651 658 653 656 693
898 693 754 811 851 884 909 901 852 798 778 782 766 717 675 683 735 792 819 802 747 690 674 704 741 749 734 728 737 755 780 812 826 804 762 738 734 723 695 678 698
893 698 739 767 761 728 690 678 716 794 862 873 825 753 693 667 685 736 787 804 790 782 801 819 796 735 689 692 710 690 633 594 610 649 662 645 637 666 725
889 725 786 816 802 763 746 763 774 742 696 696 745 784 776 750 749 773 795 803 802 798 798 803 802 777 735 714 726 750 764 779 803 813 785 743 725 737 753 761 764 758 739
884 739 719 719 729 722 702 697 718 735 721 682 644 620 606 596 595 618 682 780 867 894 857 799 754 723 684 632 585 581 638 726 783 775 736 722 738 748 726 684
879 684 643 614 617 665 734 779 794 814 853 876 858 823 812 834 871 903 912 873 798 748 759 797 802 781 787 832 867 869 872 908 944 925 853 791 791 846 907 931 912
874 912 881 877 903 924 904 850 808 814 860 914 941 927 883 841 832 849 841 771 673 619 638 695 743 777 807 819 796 761 762 807 858 882 884 880 875 878 895 916 925 925 926
869 926 923 905 894 924 983 1011 987 957 959 968 954 942 976 1038 1069 1046 1005 987 1001 1027 1034 1003 958 949 993 1042 1048 1032 1038 1055 1042 1005 994 1020 1040 1022 985 950 921
865 921 915 950 1003 1012 961 906 895 901 876 823 791 802 838 869 879 869 852 848 859 867 861 853 859 875 892 903 906 902 908 935 965 969 953 952 964 955 917 891 903 923 920 920 954
859 954 998 1003 974 959 968 962 918 867 851 878 920 951 958 938 901 860 838 844 865 869 844 821 829 843 818 766 748 777 798 777 761 794 831 813 760 747 792 844 870
855 870 876 866 828 779 749 734 712 704 758 854 917 913 882 862 835 789 762 782 812 809 789 791 811 819 816 812 791 731 659 633 672 734 787 835 893 942 955 925 864
850 864 786 711 668 677 721 764 786 807 841 863 832 747 669 644 657 664 659 674 723 775 800 798 783 769 769 796 834 846 821 787 772 776 778 774 767 762 768 790 819 839 856
845 856 881 904 908 905 926 963 975 950 927 917 881 806 754 773 825 843 831 836 849 821 763 746 794 841 834 808 820 856 855 806 760 760 788 802 795 800 848 921 962
840 962 938 877 831 821 826 822 814 820 833 825 785 741 734 773 814 814 792 804 863 913 910 885 896 940 961 929 873 831 816 824 854 887 892 861 830 840 892 942 948 906 855
835 855 840 860 875 860 838 837 840 820 797 809 843 848 816 797 817 829 781 695 643 665 734 796 816 799 783 800 849 889 890 858 825 817 830 830 790 724 689 719
830 719 779 811 807 813 852 892 893 863 838 836 847 859 871 882 893 902 909 924 958 1002 1019 982 912 852 804 752 711 720 767 787 748 703 717 779 831 840 822 806 796
826 796 788 777 775 800 846 871 845 788 749 730 706 689 717 767 771 726 715 775 819 769 676 640 667 695 717 770 833 835 771 723 734 767 778 774 771 761 751 770
821 770 814 836 819 798 792 777 746 739 771 798 783 754 745 731 683 627 621 664 713 749 789 829 835 802 772 781 816 840 842 842 851 853 822 760 698 671 684 718 752 779
816 779 794 789 755 696 628 578 576 627 701 757 781 784 777 768 770 786 802 801 795 798 790 747 691 677 714 751 754 744 745 753 758 764 765 731 661 603 601 644 699 757 817 846 817 759
811 759 729 736 737 706 671 667 688 698 678 649 647 682 722 740 749 776 804 790 741 720 759 815 834 820 805 792 769 756 769 774 728 649 598 595 611 623 640 667 694
806 694 716 727 703 641 593 613 682 731 731 719 724 729 708 670 644 648 684 733 757 740 715 711 709 671 616 603 636 667 673 684 714 732 719 702 698 689 671 672 706 745
801 745 766 771 756 696 617 596 656 717 700 640 613 625 626 608 614 659 709 741 757 759 734 697 681 696 720 739 742 716 660 612 610 647 687 717 746 761 739 703
796 703 696 716 719 701 703 732 737 698 671 702 743 716 638 598 637 700 724 717 727 764 789 777 745 719 702 684 669 672 680 664 625 606 638 695 730 734 729 726 716 700
792 700 693 695 688 672 662 656 639 613 611 648 694 716 708 688 664 641 632 652 690 719 719 694 669 670 700 738 752 730 691 670 691 737 761 727 657 608 605 606 566 511 503
787 503 565 660 744 802 824 802 753 715 699 687 666 656 674 697 696 677 674 696 725 740 739 743 763 778 758 710 693 740 798 786 707 640 630 639 626 616 643 684
782 684 699 695 695 686 657 640 671 717 726 710 721 749 725 633 552 549 591 604 568 519 493 509 575 670 734 722 659 616 629 677 719 731 709 665 631 643 696 745
777 745 748 718 696 702 720 731 735 738 736 725 716 718 728 741 756 773 771 733 675 635 636 665 702 744 777 779 741 695 681 698 715 714 706 724 792 893 975 992 954 910 889
772 889 882 885 915 955 945 860 762 717 713 695 672 698 768 807 775 727 721 755 792 825 857 874 865 852 862 878 868 843 841 874 908 915 903 900 932 1005 1106 1199 1249
767 1249 1252 1235 1232 1256 1298 1345 1401 1478 1571 1653 1703 1739 1789 1851 1894 1906 1903 1892 1862 1818 1784 1764 1727 1660 1597 1573 1575 1560 1509 1434 1351 1277 1222 1181 1130 1058 992
763 992 969 993 1036 1061 1050 1014 993 1015 1050 1036 962 887 862 869 865 849 841 836 817 799 810 845 874 888 891 878 845 816 810 811 803 814 867 916 901 845 820 833 821
758 821 771 745 775 811 805 790 811 851 866 851 829 799 764 751 770 772 711 620 568 578 624 689 766 826 839 819 808 811 796 756 722 709 703 703 732 798 860 873
754 873 838 788 742 704 673 660 681 738 800 829 811 771 732 695 663 659 703 765 801 799 780 751 708 666 656 685 727 762 794 820 820 794 768 762 769 778 779 758 698
749 698 625 594 630 697 746 772 795 810 800 768 738 718 696 668 647 643 649 655 660 676 705 727 723 697 682 696 717 708 674 652 652 651 640 646 687 733 745 723 697 687
744 687 694 716 736 731 701 683 700 721 700 636 573 550 572 617 648 635 592 587 666 774 816 772 712 695 701 691 673 677 696 697 671 631 588 546 526 547 601 657
739 657 699 725 721 677 617 586 597 617 619 617 638 676 700 702 702 704 686 644 612 632 692 738 740 724 730 756 766 735 675 615 576 567 583 608 628 646 672 701 707 680
734 680 646 640 662 679 669 647 639 655 679 693 690 670 644 632 653 695 714 679 610 563 563 588 602 608 625 650 666 676 701 741 759 726 662 614 610 635 661 673
730 673 679 691 707 710 697 682 676 667 633 581 551 568 619 667 675 636 578 547 568 613 636 632 637 669 698 702 703 731 769 769 724 680 678 708 729 721 700 697 717 740 736 701
725 701 655 625 622 641 667 682 675 661 657 654 623 566 533 559 616 643 622 586 572 582 601 620 632 630 616 600 586 575 570 573 576 573 570 575 575 555 532 540 572 577 534 481
719 481 467 489 512 526 550 590 627 645 645 632 613 595 585 575 555 532 515 508 508 527 575 633 665 656 638 646 670 665 616 555 535 573 643 709 740 723 668 608
715 608 583 606 660 718 766 788 771 728 710 745 795 801 762 728 726 714 658 590 567 597 640 660 655 634 606 586 590 613 634 642 648 670 714 770 818 844 847 838 826
710 826 813 801 796 786 743 664 589 566 594 634 658 670 686 704 713 710 703 701 706 706 691 666 651 652 649 628 608 618 652 676 676 665 663 677 709 752 775 755 710 683 683
705 683 672 632 594 592 612 623 627 649 688 721 740 754 758 735 688 651 646 663 681 701 733 768 787 785 775 762 738 699 663 649 647 630 599 590 626 677 696 680 663
700 663 660 653 636 632 643 636 597 572 608 679 714 683 635 628 665 707 718 698 670 655 652 639 612 600 631 693 741 748 726 702 691 700 726 748 748 727 705 686 658 629
695 629 622 644 669 676 673 672 665 636 595 572 586 634 689 719 707 676 666 686 703 687 658 652 670 684 685 687 696 696 679 657 642 630 620 618 625 634 653 694 741 752 723 707
690 707 733 749 690 585 536 590 681 728 732 737 740 700 627 582 594 622 630 638 681 732 739 697 662 669 695 703 692 689 711 743 758 736 686 644 645 680 705 692 661 650
685 650 669 700 726 755 791 818 817 795 791 835 909 968 987 986 987 982 946 889 842 825 818 805 792 794 814 841 869 890 894 884 874 869 862 855 861 883 894 873 839 825 827 818
680 818 787 764 777 822 868 880 846 784 735 721 730 744 777 850 938 978 944 880 843 838 834 819 813 821 823 804 776 759 758 770 801 848 884 880 841 806 808 836 859 870
675 870 889 925 954 948 908 860 822 797 786 795 818 834 829 803 772 747 740 762 814 873 906 893 848 807 792 795 790 767 747 754 777 775 718 632 572 580 648 730 788 818
670 818 828 815 764 692 655 685 746 767 733 694 693 713 709 681 671 704 758 791 785 757 739 749 771 772 734 679 647 658 693 715 707 678 653 643 642 641 645 654 648 605
666 605 546 526 566 621 633 606 590 608 643 670 696 734 773 791 765 693 606 565 602 682 725 703 657 636 643 655 665 678 682 663 635 626 635 641 646 671 719 760
661 760 764 736 700 679 689 734 793 835 855 871 887 881 840 787 746 712 677 659 679 714 717 682 651 666 714 761 783 779 762 759 789 839 869 863 850 853 856 837 819
656 819 844 908 953 942 901 877 881 888 876 852 838 857 905 950 956 936 940 978 1002 970 912 888 903 904 860 799 762 751 761 794 839 853 813 759 750 790 825 819 792
651 792 783 802 840 882 910 902 867 845 865 905 923 910 896 895 894 883 879 894 914 917 907 897 883 853 824 830 867 894 887 882 927 1005 1051 1030 977 944 948 966 978 982 989
646 989 1008 1038 1065 1063 1031 1000 1003 1028 1033 1005 979 995 1040 1065 1050 1018 999 1001 1010 1020 1027 1022 998 965 935 907 866 811 767 757 779 821 875 925 942 907 847 816 828
642 828 852 860 864 890 938 987 1026 1049 1037 985 930 910 910 882 824 796 831 890 922 931 942 950 945 950 984 1015 996 948 924 922 890 830 810 857 897 863 797 783 831
637 831 881 905 923 947 964 973 985 983 943 878 831 816 807 784 759 736 706 688 713 760 771 734 705 719 738 720 693 706 744 759 743 729 725 704 656 605 568
632 568 554 586 675 783 852 866 849 822 799 804 851 890 850 751 698 750 843 886 875 872 910 958 979 962 923 880 847 818 776 727 708 735 782 812 817 807
628 807 778 734 705 711 724 711 701 741 809 831 787 746 762 798 792 754 748 791 831 823 775 721 681 669 702 777 849 865 822 774 772 808 829 807 765 747 760 777
623 777 769 743 730 748 788 824 839 832 815 794 771 760 775 812 844 854 855 858 846 791 710 657 660 678 657 607 591 644 719 752 742 742 787 844 858 819 761 715
619 715 684 664 654 655 661 671 686 693 680 666 681 724 751 733 691 666 663 664 666 673 679 670 662 685 737 778 781 753 721 700 697 710 719 700 660 637 654 698 737 743 712 660
613 660 622 627 664 690 683 652 619 596 601 646 709 742 738 749 809 877 887 832 768 729 710 707 730 766 772 740 716 737 776 778 741 717 732 753 740 708 697 713 721
609 721 693 643 608 606 629 663 692 700 684 666 669 693 712 710 690 664 643 642 673 718 740 733 731 749 758 732 713 761 861 921 886 807 781 830 885 888 856 845 867
604 867 874 831 773 759 787 797 754 704 705 741 748 707 677 700 741 746 721 721 758 787 778 763 776 794 784 760 769 807 826 806 779 778 785 784 792 824 853 852 846 867 886 852
599 852 788 768 805 832 812 798 838 889 889 863 879 940 979 966 946 961 997 1029 1058 1091 1111 1098 1058 1017 1007 1045 1110 1156 1156 1147 1172 1219 1243 1242 1267 1332 1389
594 1389 1403 1393 1392 1394 1385 1379 1386 1385 1360 1345 1371 1411 1409 1365 1329 1325 1324 1303 1276 1259 1238 1194 1140 1106 1108 1138 1176 1206 1222 1234 1256 1294 1337 1367 1374 1366 1354 1343 1322 1295 1288
589 1288 1322 1382 1426 1440 1456 1492 1531 1559 1600 1680 1777 1841 1856 1851 1856 1882 1926 1982 2030 2060 2084 2116 2135 2105 2031 1954 1906 1877 1849 1816 1768 1696 1621 1584 1591 1600 1566
585 1566 1497 1427 1373 1329 1288 1257 1236 1225 1223 1222 1208 1178 1151 1146 1163 1192 1233 1280 1311 1310 1298 1305 1330 1336 1307 1283 1314 1392 1461 1477 1459 1447 1453 1458 1451 1446 1452 1460 1464 1476 1497
580 1497 1507 1494 1477 1479 1484 1463 1421 1395 1404 1426 1429 1399 1335 1257 1207 1216 1261 1278 1241 1174 1110 1055 1008 988 998 1024 1055 1098 1143 1158 1132 1090 1052 1015 985 996 1052
575 1052 1108 1124 1111 1093 1056 1004 992 1060 1145 1153 1086 1037 1050 1075 1067 1050 1058 1074 1077 1099 1166 1237 1251 1205 1151 1113 1080 1053 1059 1100 1134 1138 1137 1162 1194 1194 1164 1150 1175
570 1175 1209 1205 1163 1121 1106 1109 1114 1122 1140 1165 1190 1208 1205 1169 1123 1116 1166 1226 1251 1256 1276 1293 1264 1207 1184 1212 1231 1207 1177 1178 1192 1203 1239 1316 1383 1381 1323 1269 1243
566 1243 1238 1265 1337 1410 1417 1362 1322 1346 1401 1436 1447 1450 1444 1418 1377 1330 1284 1259 1273 1312 1327 1300 1268 1275 1317 1358 1384 1406 1432 1454 1469 1485 1507 1526 1523 1491 1448 1428
561 1428 1446 1471 1462 1421 1388 1389 1412 1444 1483 1515 1516 1493 1493 1539 1591 1599 1571 1555 1572 1608 1640 1655 1645 1620 1615 1640 1656 1627 1574 1557 1594 1651 1697 1722 1720 1688 1658 1665 1699
556 1699 1713 1706 1729 1798 1857 1857 1829 1835 1880 1923 1937 1925 1899 1875 1883 1935 1991 1997 1952 1917 1942 2011 2076 2116 2145 2176 2194 2186 2167 2178 2221 2250 2225 2178 2173 2216 2250 2249 2264
551 2264 2334 2410 2414 2363 2351 2420 2506 2533 2506 2490 2523 2591 2654 2688 2697 2704 2713 2705 2675 2658 2693 2766 2826 2855 2893 2968 3042 3069 3064 3087 3159 3245 3302 3331 3367 3434 3517 3573
547 3573 3575 3551 3557 3614 3690 3743 3769 3791 3826 3873 3928 3986 4042 4095 4147 4197 4230 4246 4259 4281 4313 4360 4444 4571 4713 4836 4938 5030 5110 5170 5225 5300 5393 5475
543 5475 5544 5623 5726 5841 5956 6073 6185 6274 6345 6436 6565 6705 6834 6963 7114 7273 7409 7523 7648 7797 7953 8104 8264 8439 8614
540 8614 8777 8948 9156 9394 9624 9824 10018 10246 10520 10809 11080 11336 11608 11922 12267 12615 12961 13334 13756 14210 14657 15092 15559
537 15559 16105 16728 17387 18047 18709 19386 20094 20854 21691 22613 23604 24652 25764 26951 28205 29514 30898 32403 34049 35813
534 35813 37665 39613 41720 44049 46618 49393 52335 55444 58745 62250 65958 69880 74045 78450 83034 87715 92434
532 92434 97149 101786 106240 110394 114122 117267 119683 121293 122087 122069 121244 119679 117521 114922 111968 108714 105250 101696
530 101696 98140 94639 91262 88099 85199 82551 80143 78008 76192 74697 73490 72547 71872 71468 71324 71434 71823 72517 73515
528 73515 74791 76324 78121 80215 82647 85452 88638 92190 96104 100417 105176 110389 116029 122101 128657 135726 143260
526 143260 151170 159410 167952 176698 185467 194049 202248 209841 216562 222141 226345 228964 229830 228901 226292 222211 216863 210458
523 210458 203246 195475 187314 178869 170278 161738 153427 145448 137853 130692 123998 117769 111998 106691 101856 97464 93470
521 93470 89851 86602 83709 81150 78918 77024 75467 74224 73256 72537 72066 71864 71949 72318 72955 73857 75039 76506 78239 80223
519 80223 82467 84978 87732 90695 93859 97225 100746 104306 107779 111067 114084 116717 118831 120309 121059 121008 120121 118431
517 118431 116019 112984 109423 105452 101205 96790 92268 87686 83108 78609 74251 70077 66117 62374 58830 55494 52411
515 52411 49611 47052 44647 42349 40172 38146 36295 34623 33100 31657 30246 28911 27723 26665 25639 24605 23634 22783
512 22783 21994 21191 20406 19721 19128 18540 17927 17351 16856 16408 15967 15551 15170 14791 14374 13941 13543 13205 12916 12653 12390 12109 11823
510 11823 11561 11318 11063 10804 10596 10453 10309 10096 9834 9593 9400 9237 9084 8939 8783 8600 8413 8260 8144 8033 7914 7798 7683
507 7683 7553 7402 7252 7125 7022 6934 6848 6750 6645 6564 6515 6458 6354 6232 6159 6144 6132 6081 6002 5910 5797 5672 5577 5527 5488 5432 5380 5356 5333 5269
503 5269 5186 5134 5118 5088 5019 4939 4874 4813 4744 4686 4661 4648 4596 4484 4341 4220 4155 4144 4161 4177 4176 4158 4131 4103 4078 4053 4022 3979 3924 3863 3811 3782 3774 3767 3741
499 3741 3698 3658 3638 3634 3633 3629 3620 3608 3593 3580 3571 3558 3524 3464 3392 3344 3341 3360 3358 3317 3270 3257 3269 3271 3252 3239 3248 3248 3201 3116 3045 3020 3021 3008 2973 2949 2954 2961 2935 2883 2842
494 2842 2828 2809 2763 2724 2732 2759 2735 2645 2563 2559 2614 2660 2670 2668 2666 2643 2595 2556 2551 2561 2553 2529 2513 2518 2530 2536 2537 2533 2521 2499 2475 2460 2454 2452 2445 2430 2402 2365 2338 2343 2376 2405
489 2405 2394 2336 2262 2209 2198 2229 2283 2332 2348 2330 2301 2293 2315 2352 2378 2378 2359 2333 2298 2252 2215 2222 2271 2319 2331 2333 2367 2422 2444 2425 2411 2427 2439 2414 2377 2366 2365
484 2365 2329 2260 2209 2207 2230 2247 2244 2223 2183 2139 2115 2118 2132 2148 2166 2175 2156 2107 2061 2047 2065 2090 2108 2112 2096 2064 2036 2022 2008 1983 1959 1952 1950 1936 1917 1914 1924 1929 1935 1966
479 1966 2021 2055 2032 1982 1960 1982 2008 2007 1993 1991 2002 2001 1983 1964 1956 1951 1936 1908 1878 1862 1860 1849 1802 1727 1673 1672 1694 1685 1637 1599 1602 1627 1643 1652 1660 1653 1617 1573 1558 1579 1620
474 1620 1677 1742 1778 1755 1692 1645 1645 1679 1734 1806 1865 1871 1832 1808 1835 1872 1861 1808 1773 1790 1833 1850 1820 1763 1719 1705 1704 1691 1668 1651 1632 1598 1577 1621 1733 1838
470 1838 1873 1866 1880 1923 1953 1947 1924 1903 1896 1921 1988 2066 2109 2116 2118 2132 2139 2127 2106 2082 2053 2039 2064 2114 2144 2136 2114 2089 2042 1981 1951 1971 1988 1953 1880 1807 1745 1694
465 1694 1681 1714 1744 1716 1663 1657 1699 1721 1694 1666 1679 1708 1721 1732 1773 1830 1870 1883 1880 1868 1852 1846 1855 1870 1894 1952 2048 2143 2208 2260 2326 2392 2428 2447 2491 2566 2635
461 2635 2673 2697 2731 2769 2796 2796 2761 2700 2637 2589 2533 2447 2359 2317 2322 2327 2312 2305 2314 2296 2223 2127 2058 2013 1966 1918 1890 1875 1847 1808 1778 1755 1722 1684 1672 1691 1716
456 1716 1734 1751 1768 1769 1750 1729 1717 1708 1695 1681 1676 1686 1719 1765 1789 1771 1743 1755 1804 1853 1893 1950 2011 2019 1963 1894 1848 1798 1722 1663 1659 1667 1628 1573 1578 1634 1653 1608
452 1608 1568 1589 1629 1622 1578 1554 1560 1556 1519 1469 1427 1398 1381 1379 1382 1373 1346 1321 1313 1327 1351 1371 1374 1352 1309 1254 1200 1167 1165 1179 1173 1140 1123 1159 1225 1252 1216 1163 1145 1153
447 1153 1144 1109 1081 1083 1101 1110 1106 1106 1122 1145 1160 1159 1150 1150 1161 1170 1172 1188 1232 1281 1287 1241 1186 1164 1164 1152 1129 1126 1149 1168 1169 1173 1183 1166 1110 1055 1049 1073 1080 1063 1057 1072 1079 1074 1093
441 1093 1146 1179 1154 1113 1117 1155 1155 1104 1067 1096 1151 1162 1126 1092 1085 1090 1099 1128 1179 1221 1234 1232 1233 1232 1217 1189 1152 1100 1044 1024 1063 1123 1140 1107 1069 1066 1094 1131 1156
436 1156 1145 1088 1022 1008 1050 1086 1069 1024 996 979 942 896 888 928 982 1020 1048 1080 1110 1115 1088 1044 1014 1021 1046 1047 1011 983 1005 1050 1057 1022 1009 1048 1091 1077 1020
432 1020 983 998 1035 1044 1017 993 1014 1077 1125 1108 1039 976 956 972 1004 1046 1077 1066 1011 954 934 933 916 893 904 964 1049 1126 1169 1158 1097 1034 1029 1081 1130 1125 1078
427 1078 1038 1030 1043 1062 1088 1119 1141 1140 1128 1125 1133 1126 1092 1052 1024 1007 993 997 1028 1055 1040 995 971 984 998 1000 1015 1049 1059 1018 971 972 1006 1021 1017 1035 1075 1093 1059
423 1059 1003 965 961 989 1034 1060 1041 997 981 1011 1055 1077 1074 1062 1044 1030 1036 1057 1066 1045 1011 994 1008 1046 1087 1102 1077 1028 983 947 908 882 901 951 976 949 909
418 909 908 955 1020 1075 1095 1065 1008 975 985 998 975 938 923 925 917 911 934 962 952 916 919 974 1015 988 924 885 882 893 909 939 962 948 906 884 901 925 918 888 868
413 868 873 890 907 923 933 923 899 890 912 942 946 927 924 950 973 954 896 833 790 778 807 868 926 935 896 858 863 913 979 1031 1044 1007 949 923 956 1012 1046 1052 1059
409 1059 1073 1066 1029 994 990 1001 997 971 945 926 902 870 845 843 868 914 963 987 972 948 953 979 968 907 859 890 967 995 942 880 885 935 957 923 874 856 878 918
404 918 952 960 939 911 914 955 994 989 946 907 891 878 852 842 879 941 971 954 936 956 994 1014 1018 1020 1005 954 901 906 967 1015 1009 980 975 991 994 976 956 943 934 928 921
399 921 911 909 935 982 1010 997 967 948 934 910 890 897 921 933 920 883 819 748 720 769 857 925 959 981 984 939 857 799 799 839 893 946 976 956 899 859 870
394 870 913 955 980 975 940 905 916 967 1004 996 973 971 985 995 1004 1012 999 959 922 913 911 888 859 857 879 900 908 910 907 901 911 944 977 984 968 947 926 901 881 878 881 887 903
389 903 924 918 873 825 816 835 848 855 877 910 932 943 962 984 987 968 939 901 857 837 859 891 894 889 924 978 977 906 843 849 896 922 920 916 906 876 844 838 857 883 913
384 913 954 995 1017 1022 1023 1029 1044 1078 1118 1118 1045 937 871 877 915 939 951 984 1039 1079 1067 1017 971 952 938 904 868 861 887 924 975 1053 1129 1141 1077 1006 994 1030
379 1030 1061 1066 1062 1057 1046 1035 1032 1028 1011 992 988 987 971 952 962 992 1009 1008 1026 1078 1127 1133 1108 1090 1091 1092 1089 1097 1128 1165 1182 1167 1133 1108 1105 1115 1119 1112 1106 1115 1140 1172 1198 1211
374 1211 1215 1214 1215 1220 1229 1240 1244 1235 1214 1195 1183 1174 1166 1162 1158 1143 1127 1129 1147 1151 1132 1129 1188 1289 1370 1400 1404 1418 1433 1426 1399 1383 1392 1402 1378 1317 1272 1295 1379 1454 1466 1434 1423
369 1423 1449 1478 1476 1452 1423 1385 1333 1288 1279 1298 1315 1313 1307 1307 1300 1270 1229 1208 1214 1219 1199 1179 1197 1240 1252 1207 1146 1115 1107 1102 1118 1176 1234 1228 1162 1114 1126 1164 1183 1187 1200
364 1200 1209 1189 1143 1099 1075 1081 1123 1184 1219 1207 1173 1145 1116 1079 1061 1095 1158 1198 1199 1184 1175 1175 1185 1208 1229 1223 1190 1151 1127 1125 1145 1176 1193 1179 1140 1093 1038 980
359 980 947 960 993 1004 985 960 935 902 876 892 949 998 1008 986 950 905 870 876 914 929 897 856 858 898 936 949 941 914 873 847 859 898 935 951 940 904 860
355 860 837 844 854 848 857 900 948 957 941 942 953 938 907 922 993 1042 1007 919 848 815 802 807 839 880 898 899 911 933 929 892 855 836 815 781 763 794 850 878 859
350 859 827 825 861 905 916 879 817 771 764 782 798 812 838 874 890 874 843 825 835 865 905 940 950 928 890 864 873 917 976 1027 1051 1049 1030 995 940 874 824
345 824 808 820 847 887 933 960 947 917 907 917 899 833 761 738 763 799 832 876 931 954 904 797 692 640 647 685 727 759 768 747 708 676 671 688 713 745
341 745 784 810 804 768 728 706 707 724 744 753 748 749 773 802 800 776 773 801 816 793 776 819 902 947 916 838 759 699 664 654 661 669 681 704 724 725 720 742 781 799 790
336 790 789 816 842 836 810 784 749 703 679 711 776 823 839 848 853 829 776 738 752 804 854 875 865 826 773 732 718 723 728 729 736 750 760 770 790 819 833 822 815 851
331 851 921 969 955 905 864 843 829 827 856 904 930 914 889 890 913 930 924 895 845 792 760 745 717 663 618 624 667 701 705 695 686 681 686 710 748 783 807 814 792 746
326 746 706 703 723 733 728 726 722 699 678 701 756 788 776 770 804 846 856 853 870 881 842 766 714 709 709 687 664 667 682 683 677 690 726 756 762 754 750 748 729 694 674 695 742
321 742 774 779 783 803 821 826 838 870 889 853 781 736 743 761 754 738 744 761 752 713 684 694 725 737 721 701 706 741 789 829 847 847 836 821 794 747 690 645 630 635
316 635 643 647 656 670 677 674 677 698 738 783 813 806 757 698 676 690 689 650 615 638 703 752 766 771 784 784 757 722 701 692 688 695 707 699 664 629 621 629 630 625 638 670 694 692 677
310 677 669 673 676 671 666 671 686 693 683 668 670 691 708 709 708 722 747 767 775 767 737 685 640 631 658 687 688 661 640 657 704 742 735 691 648 626 619 625 658 710 749 757 755 753 722
305 722 653 601 626 700 741 731 733 779 812 783 729 712 722 710 684 695 741 765 750 743 773 802 790 754 729 715 698 692 717 745 734 694 675 692 710 705 699 714
300 714 739 750 746 743 748 758 768 769 757 742 741 750 744 711 671 644 639 659 709 763 775 741 724 768 832 848 813 778 763 745 728 748 805 852 862 867 893 917 905 869
295 869 840 821 798 773 756 740 721 718 740 760 747 723 729 768 807 837 874 905 880 788 687 640 648 668 675 681 700 726 750 771 786 787 774 769 790 821 815 739 616
291 616 516 501 576 684 751 747 709 702 742 779 762 708 671 663 654 640 660 719 761 744 702 687 691 680 660 665 687 688 666 653 651 637 620 639 695 729 698 632
286 632 592 601 640 681 708 718 727 739 735 704 680 707 757 749 670 602 621 691 736 744 753 768 747 691 654 676 732 770 764 727 684 665 682 722 756 767 760 757 779 815
281 815 828 793 740 721 733 716 645 585 608 687 727 696 654 654 675 667 631 606 608 618 617 616 630 657 678 680 682 717 791 867 895 860 795 743 725 726 716 682 644
276 644 635 659 678 660 620 598 609 633 644 645 650 671 703 726 721 688 640 594 569 592 668 749 766 711 655 658 695 699 652 594 559 551 561 580 602 637 704 785 815
272 815 758 672 642 665 670 642 640 694 754 771 767 777 791 784 766 761 761 755 763 802 843 837 781 711 656 620 600 600 619 648 669 659 613 563 552 575 585 569 569 608 643
267 643 633 599 589 608 629 639 642 637 629 636 656 647 591 540 547 581 580 556 575 640 683 670 642 632 626 608 605 625 623 571 523 543 620 683 686 636 567 517 515 547 566
262 566 550 532 551 592 612 605 602 621 657 705 762 809 822 807 798 801 786 733 672 643 660 705 752 771 739 671 614 606 637 671 694 714 719 689 639 618 647 682
257 682 679 656 658 692 724 738 742 732 692 640 627 664 705 714 713 729 735 709 686 710 754 756 710 664 640 614 586 592 628 632 580 529 528 555 563 557 567 586 586 582 607 661
252 661 696 685 642 597 580 607 664 711 713 683 651 624 594 570 575 603 627 630 624 624 632 647 661 660 631 590 559 551 565 604 654 683 674 656 667 701 717 698 661 617
247 617 567 529 541 607 680 721 735 749 764 763 745 729 736 768 806 824 810 778 748 733 735 753 773 765 724 693 709 747 750 714 692 718 756 770 766 768 772 759 734
242 734 716 705 689 663 629 589 555 546 560 576 590 624 676 705 685 642 627 650 687 724 756 766 746 722 727 758 781 785 791 808 819 810 784 751 719 696 689 688 687
237 687 696 721 744 730 675 616 586 588 600 604 604 617 652 680 668 623 595 603 614 599 586 615 672 714 741 777 805 778 705 649 632 612 565 537 572 637 669 655
233 655 638 650 689 735 761 743 686 625 581 543 500 482 524 613 689 710 686 655 640 644 663 682 689 673 634 588 565 579 610 633 651 679 706 704 678 659 652
228 652 636 626 662 729 748 688 623 623 646 613 542 515 545 572 569 581 630 672 680 686 720 749 731 674 612 566 549 569 608 623 602 582 599 639 673 693 697 673
224 673 637 631 674 728 758 781 817 833 788 718 690 707 718 704 702 719 713 665 625 638 675 672 622 576 581 628 673 681 645 586 536 519 549 615 680 691 631 542
219 542 492 508 548 564 562 596 688 785 807 741 666 658 703 720 679 633 638 677 706 717 724 717 676 635 644 694 718 684 638 619 610 585 565 585 623 632 613 611 635 629
214 629 554 454 417 474 568 626 643 666 714 744 715 651 615 620 625 595 556 546 565 581 580 573 576 588 597 602 613 631 642 627 597 588 616 648 653 648 677 731 757 726
209 726 673 643 642 651 664 677 674 647 609 577 550 537 563 631 700 722 691 640 600 589 610 644 655 631 598 578 571 588 652 748 805 790 759 776 816 799 725
205 725 668 669 691 695 698 727 766 781 763 727 694 685 704 723 709 682 690 732 758 740 708 692 691 689 695 710 718 709 694 676 644 611 613 648 680 697 732 785 796 731 647
200 647 609 603 583 571 613 688 717 687 654 654 655 631 611 620 632 613 573 546 543 557 585 623 649 649 629 603 570 522 469 445 471 532 586 603 605 631 684 712 685
195 685 638 616 613 591 556 546 565 584 605 658 735 772 733 665 627 617 609 603 604 586 528 470 475 545 624 669 683 672 637 605 617 673 717 710 686 697 737 749
190 749 707 646 616 626 650 671 694 720 732 715 681 657 649 639 617 599 600 600 573 539 543 597 650 653 613 578 573 584 601 632 673 695 682 657 660 692 720 721 699
185 699 657 603 564 575 627 663 647 613 609 632 641 625 610 612 610 592 586 621 681 720 712 673 636 623 632 645 640 608 561 520 505 526 565 589 581 566 583 644 714 757
180 757 755 711 639 558 493 467 493 561 625 629 571 521 541 607 639 627 633 684 718 682 621 614 663 701 691 660 642 639 645 669 708 745 766 765 739 697 675 699 746
176 746 766 745 720 721 740 752 743 709 661 627 622 626 607 578 585 633 680 701 716 737 731 671 603 592 639 672 640 574 540 563 607 631 633 637 648 643 618 607 630 651
171 651 628 588 600 668 718 708 686 703 730 708 656 647 701 761 776 755 733 722 719 722 723 708 683 669 673 667 634 596 588 609 629 628 612 597 589 598 634 694 752 769
166 769 734 676 645 659 689 684 627 556 523 538 564 569 568 597 653 680 638 557 507 519 558 582 590 603 627 650 661 658 639 610 591 596 620 643 647 623 582 560 585
161 585 633 639 589 546 566 614 621 590 588 637 674 651 600 575 579 582 581 596 628 652 648 622 597 596 623 647 634 587 558 576 615 633 629 626 628 616 590 573 580 613 665
156 665 716 740 727 707 706 706 671 614 587 606 630 619 587 570 581 610 645 670 664 630 607 625 658 660 626 597 608 647 684 701 700 690 681 688 715 742 740 701 650
151 650 616 607 609 612 625 650 666 653 628 625 651 672 660 630 616 622 625 610 584 567 570 592 616 622 614 622 662 703 697 645 597 587 596 590 581 601 649 677 655 611 599 632
146 632 674 691 691 700 713 704 672 656 681 722 731 693 633 583 563 581 630 676 684 656 631 634 655 674 686 687 669 643 635 651 650 607 564 581 650 705 707 681 656 625
141 625 581 566 610 681 709 676 625 594 581 571 577 608 637 624 569 521 521 562 599 600 570 540 534 551 579 606 627 644 660 671 660 619 567 542 555 577 582 585
137 585 609 643 649 628 622 646 662 642 615 620 641 639 619 621 649 666 652 633 623 609 592 605 654 678 633 565 554 601 633 609 564 535 507 458 410 404 442 495
132 495 533 550 558 585 651 731 766 729 662 630 644 663 651 622 612 642 698 745 753 727 700 688 672 630 579 558 571 590 599 610 622 619 597 579 580 578 559 541
127 541 550 577 589 579 567 564 562 555 563 598 638 646 617 587 590 624 656 668 670 670 655 624 603 621 660 683 680 677 681 672 648 637 648 639 585 526 526 584 637 649 635 614 582
122 582 540 522 540 562 548 511 498 526 566 597 625 662 704 741 761 751 695 608 546 553 611 662 664 622 571 546 564 612 640 613 561 551 592 621 596 564
118 564 590 657 684 642 591 583 601 602 587 589 611 625 603 551 503 495 529 555 526 465 452 519 607 638 608 569 547 535 527 526 519 487 449 449 490 535 556 554 541 524
113 524 525 565 628 670 675 672 673 655 609 574 581 601 586 545 535 578 634 654 629 584 543 530 564 639 701 686 590 488 455 491 527 519 495 499 525 538 536 546 572
108 572 587 579 570 580 602 618 627 635 637 635 634 637 640 646 662 681 682 658 627 604 589 580 577 569 538 496 476 486 492 481 487 541 619 673 696 708 710 688 659 654 674 682 664 644 652
103 652 685 723 745 731 674 596 550 564 615 655 650 611 573 568 601 648 676 677 666 658 652 634 600 565 560 592 634 649 638 625 617 594 555 528 527 533 537 556 592 609
98 609 595 596 648 704 696 637 602 611 622 612 614 640 661 656 647 647 641 630 647 689 704 663 611 592 585 561 546 569 597 578 541 552 612 653 644 623 619 616 605 610 629 619
93 619 563 518 540 602 629 600 565 572 605 624 618 610 621 651 682 695 681 648 620 618 640 669 679 662 627 594 580 591 616 643 666 686 703 712 705 691 686 702 727
88 727 737 716 676 647 647 671 692 696 681 657 631 617 625 645 651 635 618 613 607 589 586 621 666 676 647 623 620 610 580 563 582 610 610 595 593 596 574 539 530 556 576 559
83 559 521 507 539 600 651 665 650 635 641 657 662 650 630 604 584 587 622 663 673 651 631 640 672 701 706 699 710 752 786 755 660 566 524 521 526 556 629 704 714 671
78 671 657 710 768 760 694 635 615 617 615 606 612 647 700 726 690 613 558 563 601 619 607 600 622 656 665 635 590 564 561 555 535 521 530 544 542 540 571 621 641 617 592 604
73 604 636 641 601 545 518 549 617 660 638 591 588 643 704 739 771 808 812 758 686 643 622 595 570 568 577 581 600 646 677 646 584 563 590 608 596 594 620 635 622
68 622 624 670 713 695 640 625 673 722 712 651 592 567 569 578 582 590 611 640 645 593 498 426 430 496 550 547 513 503 530 569 609 658 704 709 670 630 626 642 647 647 662 692
63 692 717 731 729 699 650 626 654 683 652 581 557 605 658 656 622 603 601 598 603 620 623 590 552 550 570 576 571 582 604 602 577 571 593 601 565 523 528 579 634 664 675 673 653
57 653 623 603 608 628 640 639 629 616 599 584 583 589 577 535 491 487 520 544 539 535 567 610 620 602 602 632 656 650 642 652 642 574 485 453 500 566 594 583 557 530 525
52 525 577 682 767 763 688 630 640 687 711 695 663 636 622 618 618 619 628 647 665 670 675 696 718 704 650 604 597 600 577 543 532 535 513 468 451 491 553 586 582 569 568
47 568 572 573 575 588 613 643 672 696 714 722 717 704 695 693 690 680 670 660 640 607 578 570 574 562 530 507 516 545 556 531 496 493 525 549 526 483 474 511 547 546 530 532 546
42 546 547 538 535 527 508 502 532 577 592 579 579 598 606 589 571 573 587 612 650 680 675 648 635 627 585 524 515 578 640 642 615 614 621 595 557 561 599 611 582 556 578 646 735
37 735 799 788 694 593 566 602 617 584 555 569 587 568 537 543 589 633 651 650 646 643 636 622 608 609 634 660 651 605 562 557 583 605 607 596 589 590 594 592 583 583 608 651 683
32 683 692 689 687 687 683 672 655 636 622 626 640 648 649 654 663 662 648 638 645 662 681 699 705 682 623 552 508 513 559 609 624 598 568 570 600 623 622 621 632 638 615 573 544 543 560
26 560 577 586 593 606 618 615 604 607 632 646 623 585 565 559 540 521 542 599 639 634 613 600 585 561 556 579 596 585 576 607 657 679 662 634 605 573 549 545 555 563 580
21 580 612 638 637 624 628 637 624 598 597 615 609 577 573 625 683 683 632 595 614 662 681 644 576 533 538 568 591 609 637 664 665 650 653 672 664 614 561 550 572 592 592 588
16 588 592 610 639 660 653 630 632 681 734 735 680 623 607 625 643 642 622 603 608 647 698 726 716 691 674 667 659 652 660 690 718 715 677 639 637 668 690 668 614 581 598 632
11 632 621 552 484 481 533 580 587 583 595 612 604 575 559 571 596 616 625 626 624 622 611 576 529 513 547 596 613 610 628 662 657 595 521 488 494 514 541 574 601 611 617 619
6 619 598 554 526 539 558 540 506 514 564 607 621 648 721 801 826 786 721 670 640 634 658 707 743 726 659 595 589 636 682 689 674 672 689 703 704 699 692 679 664 660 664
1 664 662 654 649 643 616 572 539 529 525 514 512 530 542 531 529 582 670 723 710 679 683 713 733 742 760 776 756 709 682 690 688 638 573 550 576 605 606 591 582 590 614 639 635 589
-5 589 537 539 594 637 623 579 565 595 637 666 678 668 636 596 580 596 620 625 611 598 607 644 689 711 698 664 636 632 649 674 680 648 591 555 574 628 672 691
-9 691 695 686 656 620 602 601 582 535 498 504 534 540 522 524 572 638 673 659 620 595 602 630 652 644 604 553 524 537 576 604 595 559 525 501 486 489 528 587 616 583 525
-14 525 505 535 568 566 544 534 531 510 480 478 512 543 542 522 516 525 534 546 567 571 534 489 504 587 667 687 676 693 730 732 690 651 640 626 584 539 528 536 525 498
-19 498 494 535 584 603 597 600 619 618 576 531 534 579 601 575 554 602 694 747 726 674 635 602 569 565 610 670 686 658 646 687 752 787 777 749 725 703 671 643
-24 643 645 678 702 679 619 575 577 607 626 623 609 602 615 645 668 657 624 616 656 708 722 694 661 646 642 641 647 661 669 669 670 673 662 630 602 599 621 649 672 687 686 672
-29 672 664 680 700 690 648 619 636 676 693 682 671 666 640 594 572 598 640 653 646 650 657 641 616 626 672 705 696 669 638 583 503 450 467 528 579 608 632 646
-34 646 638 621 616 611 587 558 556 576 591 593 595 594 579 561 559 554 520 490 517 593 643 633 608 611 626 623 617 632 658 671 682 710 743 755 740 704 649 589 555 565 606
-39 606 648 678 687 664 625 602 594 563 507 480 515 563 557 511 484 486 490 501 546 614 657 668 681 693 658 578 522 539 594 641 670 683 660 600 554 560 592 612
-43 612 627 649 644 584 520 533 613 676 675 656 666 693 693 659 607 546 488 461 479 514 540 566 611 664 694 695 688 682 666 636 609 590 568 546 555 616 700 746 718
-48 718 637 555 514 518 539 544 532 534 579 654 706 701 656 611 596 616 652 674 649 577 505 487 525 572 591 590 595 611 628 639 647 648 637 627 633 647 647 620 578 549
-53 549 552 583 617 632 621 596 580 590 630 683 708 687 650 647 674 672 611 544 537 590 644 665 665 657 637 610 593 589 592 619 690 772 799 753 693 685 719 745 744 728
-58 728 711 690 673 668 673 684 702 720 720 707 716 754 775 737 673 653 690 729 724 689 661 658 680 717 745 745 723 698 674 645 630 653 699 731 738 739 735 705 664 661 705
-63 705 745 746 730 713 669 595 562 623 711 710 619 556 594 673 701 679 668 684 687 661 638 645 668 682 698 735 775 769 709 643 617 618 606 585 594 639 674 668 644
-68 644 631 621 607 612 646 663 621 561 561 630 693 696 663 636 618 603 599 609 613 598 588 600 616 607 583 571 582 610 652 700 726 706 652 608 599 616 628 618 589
-72 589 563 550 547 556 592 654 700 687 637 619 657 709 734 744 762 765 722 650 593 570 574 598 631 646 639 654 713 770 768 726 697 678 634 583 577 597 571 501 480
-77 480 549 624 627 598 617 669 687 667 658 657 621 560 536 563 583 568 568 626 700 724 694 660 649 646 632 610 592 589 600 603 577 534 523 572 643 676 668 666 697 737
-82 737 751 737 711 682 655 642 645 644 615 570 546 565 605 628 625 612 602 592 586 605 658 715 737 727 722 738 749 730 705 708 729 719 660 587 548 556 586 614 629
-87 629 632 636 659 703 738 731 683 625 588 586 618 670 710 707 667 629 623 630 613 570 539 549 591 632 654 658 648 624 582 533 501 505 542 600 668 738 782 767 696 629
-92 629 621 657 668 622 565 556 588 605 582 555 558 577 579 566 567 595 618 604 552 498 476 502 568 638 676 671 642 613 593 583 586 603 609 576 509 449 432 453 485
$$ [...]
-1605D22
##END=	
##END=	
