##TITLE=	NcfsBiOHTLS$w3D$5yYolg.94.ser
TM-VI-254, Na+unprotect. pyr. hmbc

##JCAMP-DX=	6.0	$$ MestReNova 14.3.0-30573
##DATA TYPE=	LINK
##BLOCK_ID=	1
##BLOCKS=	2    
##ORIGIN=	Mestrelab Research S.L.
##OWNER=	hrzepa
##$MNOVA/LINK_BLOCK_TYPE=	ITEM	$$ NMR Spectrum
##$MNOVA/ITEM/POLYGON=	(XY..XY)
5321,5835
8722,5835
8722,8208
5321,8208
5321,5835
##$MNOVA/ITEM/Z=	0
##$MNOVA/ITEM/ANGLE=	0
##TITLE=	NcfsBiOHTLS$w3D$5yYolg.94.ser
##JCAMP-DX=	6.0	$$ MestReNova 14.3.0-30573
##BLOCK_ID=	2
##DATA TYPE=	MNOVA NMR VIEW DATA
##DATA CLASS=	MNOVA VIEW DATA
##$MNOVA/2D/THRESHOLD=	3.3637630939483642578
##$MNOVA/ITEM/ZOOM/X=	-0.47893103590269503478,	14.508270000071124883
##$MNOVA/ITEM/ZOOM/Y=	-9.5608721214139968936,	250.07129999451962021
##END=	
##TITLE=	NcfsBiOHTLS$w3D$5yYolg.94.ser
##JCAMP-DX=	6.0	$$ MestReNova 14.3.0-30573
##BLOCK_ID=	3
##DATA TYPE=	nD NMR SPECTRUM
##DATA CLASS=	NTUPLES
##NUMDIM=	2
##ORIGIN=	Bruker BioSpin GmbH
##OWNER=	nmr
##.OBSERVE FREQUENCY=	400.20280139999999847
##.OBSERVE NUCLEUS=	^1H
##.SOLVENT NAME=	MeOD
##.PULSE SEQUENCE=	hmbcgplpndqf
##LONGDATE=	2022/01/25 00:55:28.000
##.ACQUISITIONMODE=	SIMULTANEOUS (DQD)
##$ORIGINAL FORMAT=	Bruker XWIN-NMR
##$MNOVA/SCALES_VERSION=	9
##$PARAMETER FILE=	(acqu2s, ASCII, /private/var/folders/f6/rjf_tdyn2v98c5c0wvkgn4s80000gn/T/NcfsBiOHTLS$w3D$5yYolg/94/acqu2s, 0)
$$ ##TITLE= Parameter file, TOPSPIN		Version 3.2
$$ ##JCAMPDX= 5.0
$$ ##DATATYPE= Parameter Values
$$ ##NPOINTS= 129	$$ modification sequence number
$$ ##ORIGIN= Bruker BioSpin GmbH
$$ ##OWNER= nmr
$$ $$ 2022-01-25 01:15:05.317 +0000  nmr@CZC2439F63
$$ $$ /opt/topspin/data/agmb/nmr/Jan24-2022/94/acqu2s
$$ $$ process /opt/topspin3.2/prog/mod/go
$$ ##$ACQT0= 0
$$ ##$BF1= 100.63037
$$ ##$FnMODE= 1
$$ ##$NUC1= <13C>
$$ ##$NusJSP= 0
$$ ##$NusT2= 1
$$ ##$NusTD= 128
$$ ##$O1= 12075.7644147886
$$ ##$SFO1= 100.642445764415
$$ ##$SW= 260.109045168497
$$ ##$SW_h= 26178.0104712042
$$ ##$TD= 128
$$ ##END=
$$ 
##$PARAMETER FILE=	(acqus, ASCII, /private/var/folders/f6/rjf_tdyn2v98c5c0wvkgn4s80000gn/T/NcfsBiOHTLS$w3D$5yYolg/94/acqus, 0)
$$ ##TITLE= Parameter file, TOPSPIN		Version 3.2
$$ ##JCAMPDX= 5.0
$$ ##DATATYPE= Parameter Values
$$ ##NPOINTS= 12	$$ modification sequence number
$$ ##ORIGIN= Bruker BioSpin GmbH
$$ ##OWNER= nmr
$$ $$ 2022-01-25 01:15:08.881 +0000  nmr@CZC2439F63
$$ $$ /opt/topspin/data/agmb/nmr/Jan24-2022/94/acqus
$$ $$ process /opt/topspin3.2/prog/mod/shimcntl
$$ ##$ACQT0= 1000000
$$ ##$AMP= (0..31)
$$ 100 100 100 100 100 100 100 100 100 100 100 100 100 100 100 100 100 100
$$ 100 100 100 100 100 100 100 100 100 100 100 100 100 100
$$ ##$AMPCOIL= (0..19)
$$ 0 0 0 0 0 0 0 0 0 0 0 0 0 0 0 0 0 0 0 0
$$ ##$ANAVPT= -1
$$ ##$AQSEQ= 0
$$ ##$AQ_mod= 3
$$ ##$AUNM= <au_zg>
$$ ##$AUTOPOS= <54 >
$$ ##$BF1= 400.2
$$ ##$BF2= 100.63037
$$ ##$BF3= 400.2
$$ ##$BF4= 400.2
$$ ##$BF5= 400.2
$$ ##$BF6= 400.2
$$ ##$BF7= 400.2
$$ ##$BF8= 400.2
$$ ##$BYTORDA= 0
$$ ##$CAGPARS= (0..11)
$$ 0 0 0 0 0 0 0 0 0 0 0 0
$$ ##$CFDGTYP= 0
$$ ##$CFRGTYP= 9
$$ ##$CHEMSTR= <none>
$$ [...]
$$ 0 0 0 0
$$ ##$ShimPowMaxUC= (0..63)
$$ 130000 130000 130000 130000 130000 130000 130000 130000 130000 130000 130000
$$ 130000 130000 130000 130000 130000 130000 130000 130000 130000 0 0 0 0
$$ 0 0 0 0 0 0 0 0 0 0 0 0 0 0 0 0 0 0 0 0 0 0 0 0 0 0 0 0 0 0 0 0 0 0 0 0
$$ 0 0 0 0
$$ ##$ShimPowMaxUG= (0..63)
$$ 524287 524287 524287 524287 524287 524287 524287 524287 524287 524287 524287
$$ 524287 524287 524287 524287 524287 524287 524287 524287 524287 0 0 0 0
$$ 0 0 0 0 0 0 0 0 0 0 0 0 0 0 0 0 0 0 0 0 0 0 0 0 0 0 0 0 0 0 0 0 0 0 0 0
$$ 0 0 0 0
$$ ##$ShimPowRcbType= 3
$$ ##$ShimPowRes= (0..63)
$$ 1e-20 1e-20 1e-20 1e-20 1e-20 1e-20 1e-20 1e-20 1e-20 1e-20 1e-20 1e-20
$$ 1e-20 1e-20 1e-20 1e-20 1e-20 1e-20 1e-20 1e-20 0 0 0 0 0 0 0 0 0 0 0 0
$$ 0 0 0 0 0 0 0 0 0 0 0 0 0 0 0 0 0 0 0 0 0 0 0 0 0 0 0 0 0 0 0 0
$$ ##$ShimPowRng0= (0..63)
$$ 1 1 1 1 1 1 1 1 1 1 1 1 1 1 1 1 1 1 1 1 0 0 0 0 0 0 0 0 0 0 0 0 0 0 0 0
$$ 0 0 0 0 0 0 0 0 0 0 0 0 0 0 0 0 0 0 0 0 0 0 0 0 0 0 0 0
$$ ##$ShimPowRng1= (0..63)
$$ 1 1 1 1 1 1 1 1 1 1 1 1 1 1 1 1 1 1 1 1 0 0 0 0 0 0 0 0 0 0 0 0 0 0 0 0
$$ 0 0 0 0 0 0 0 0 0 0 0 0 0 0 0 0 0 0 0 0 0 0 0 0 0 0 0 0
$$ ##$ShimPowRng2= (0..63)
$$ 1 1 1 1 1 1 1 1 1 1 1 1 1 1 1 1 1 1 1 1 0 0 0 0 0 0 0 0 0 0 0 0 0 0 0 0
$$ 0 0 0 0 0 0 0 0 0 0 0 0 0 0 0 0 0 0 0 0 0 0 0 0 0 0 0 0
$$ ##$ShimPowRng3= (0..63)
$$ 1 1 1 1 1 1 1 1 1 1 1 1 1 1 1 1 1 1 1 1 0 0 0 0 0 0 0 0 0 0 0 0 0 0 0 0
$$ 0 0 0 0 0 0 0 0 0 0 0 0 0 0 0 0 0 0 0 0 0 0 0 0 0 0 0 0
$$ ##$ShimSysFunc= (0..63)
$$ 1 2 3 4 5 7 9 11 15 16 8 10 12 14 6 17 13 18 19 20 0 0 0 0 0 0 0 0 0 0
$$ 0 0 0 0 0 0 0 0 0 0 0 0 0 0 0 0 0 0 0 0 0 0 0 0 0 0 0 0 0 0 0 0 0 0
$$ ##$ShimSysMatrix= 0
$$ ##$ShimSysType= 1
$$ ##$TFXNUM= 0
$$ ##$TRIPLO2= 0
$$ ##$VTU= 2
$$ ##$VTUETH= <149.236.99.20>
$$ ##$VTUTY= <no>
$$ ##$WBREFAM= (0..15)
$$ 135.5 97.7 100 100 100 100 100 100 100 100 100 100 100 100 100 100
$$ ##$WBREFLM= (0..15)
$$ 0 0 0 0 0 0 0 0 0 0 0 0 0 0 0 0
$$ ##$WBREFPH= (0..15)
$$ 72.26 -67.22 0 0 0 0 0 0 0 0 0 0 0 0 0 0
$$ ##$WBSGU= (0..15)
$$ 0 0 0 0 0 0 0 0 0 0 0 0 0 0 0 0
$$ ##$XFAC= 2
$$ ##END=
$$ 
##$DECIM=	3328
##$DSPFVS=	20
##.ACQUISITIONSCHEME=	NOT PHASESENSITIVE
##NTUPLES=	nD NMR SPECTRUM
##VAR_NAME=	FREQUENCY1,	FREQUENCY2,	SPECTRUM
##SYMBOL=	F1,	F2,	Y
##.NUCLEUS=	13C,	1H
##.OBSERVE FREQUENCY=	100.64244576441500101,	400.20280139999999847
##VAR_TYPE=	INDEPENDENT,	INDEPENDENT,	DEPENDENT
##VAR_FORM=	AFFN,	AFFN,	ASDF
##VAR_DIM=	512,	512,	262144
##UNITS=	HZ,	HZ,	ARBITRARY UNITS
##FIRST=	25164.767445380970457,	5806.2096540000038658,	0.45962411165237426758
##LAST=	-962.11409912165936476,	-191.66820056731904742,	0.51073694229125976563
##MIN=	-962.11409912165936476,	-191.66820056731904742,	0.00040161935612559318542
##MAX=	25164.767445380970457,	5806.2096540000038658,	33.426910400390625
##FACTOR=	1,	1,	0.0033117570298130567796
##PAGE=	F1=25164.8
##FIRST=	25164.767445380970457,	5806.2096540000038658,	0.45962411165237426758
##DATA TABLE=	(F2++(Y..Y)), PROFILE
$$ [...]
##PAGE=	F1=-10830
##FIRST=	25164.767445380970457,	5806.2096540000038658,	0
##DATA TABLE=	(F2++(Y..Y)), PROFILE
1229B90J25k30q4M7N9j36RJ97j4N7j39J1R7j15Nj23O2J6l0K6q8Q6L3n2o6R2njo4L8j3R3j40
$$ 290 415 185 101 148 207 71 80 277 263 320 181 192 289 174 179 56 118 134 104 130 42 128 161 109 43 135 130 129 65 103 90 183 43
841D3K04j1k26J04K3J24o7l1N6J7l7q5M2o7m7O5n2N5J9J13o9pj23j3J31q3J4J28j01%KJ1k0
$$ 43 247 236 10 114 137 261 194 163 219 236 199 114 156 89 42 107 55 110 129 242 173 166 43 30 161 78 92 220 119 119 121 132 112
454A12L9m5O8R9m1j32M2M8J6j33pM7n5M4L1Lm6P8K2Q9r6k2K8j06J9J07n5m9J42j91J76j05
$$ 112 151 106 174 273 232 100 142 190 206 73 66 113 58 102 133 136 90 168 190 279 183 161 189 83 102 209 154 105 247 56 232 127
78A27J08j8l0nj9L3j21O3m1o1J8N6%nJ39j25j10O4OM5k8N6K2
$$ 127 235 217 187 182 163 196 75 138 97 36 54 110 110 105 244 119 9 73 79 124 96 152 174
-192A74
##PAGE=	F1=-10932.3
##FIRST=	25164.767445380970457,	5806.2096540000038658,	0
##DATA TABLE=	(F2++(Y..Y)), PROFILE
5806I6m8M8N5J21m5j08r3M3n3J80o6nq8J60r4p4J10o1J25L2j19q3J44l8L7K5q5J00J27j51
$$ 96 48 96 151 272 227 119 26 69 16 196 130 125 37 197 103 29 139 78 203 235 116 33 177 139 176 201 116 216 343 192
5454A92K4j42Q4M2j30J57j5j43kP9K4j0l8K8J0l5J3O8l7j19O4N8r1N9M8p5l1RqO2%q2J00n4
$$ 192 216 74 158 200 70 227 212 69 67 146 170 160 122 150 160 125 138 206 169 50 114 172 81 140 188 113 82 91 83 145 145 63 163 109
5055A09q1K6L8JJ4m4j7J2K8O0k4Q0j5p8P0L5j21m3J0M2L1M9J87n4j90K3M7p7K7J73j0k23j2
$$ 109 28 54 92 93 107 63 46 58 86 146 122 202 187 109 179 214 93 50 60 102 133 182 369 315 125 148 195 118 145 318 308 85 73
4668G3N2q0J37o8J36k5j30k6P9J5O8n1J4P8j38p8J33P6n3p5o7l1L7k1J08r2k8O3l4jj8K6m4
$$ 73 125 45 182 114 250 225 95 69 148 163 231 180 194 272 134 56 189 265 212 137 70 39 76 55 163 71 43 106 72 71 53 79 35
4280C5M2P5K8j25k0J16J03n5q9L0K0p8O1J53k33J42m9p5Q4P3n6Q9j44K3m7M7J9q2P4q5jJ15
$$ 35 77 152 180 55 35 151 254 199 110 140 160 82 143 296 63 205 156 81 165 238 182 271 127 150 103 150 169 87 161 76 75 190
3905A90J2j45J33n1o5J67j3q4q5N7q3O8m1K5k6oJ26O7j91K0NJ15q2L56k37O6m9j82P3O0p9
$$ 190 202 57 190 139 74 241 228 144 59 116 33 101 60 85 59 53 179 246 55 75 80 195 113 469 232 298 249 67 140 200 121
3541A21n0M4l6M8L7j20Q8qKl7R3l4LJ03j48K36m8j62N7o5Q7M8p5o9k6R5J34j68r4J10j2j19
$$ 121 71 115 79 127 164 44 132 124 126 89 182 148 151 254 106 342 294 132 189 124 211 259 184 115 89 184 318 150 56 166 154 35
3165C5O2m6R0kJ7O8j11J38k36K26j56m6J21J1n1J04j8j43J13l1k8m3NQ3j13M0o3N7mL2o5N6
$$ 35 97 51 141 139 156 224 113 251 15 241 85 39 160 171 120 224 206 63 176 145 117 74 79 162 49 89 26 83 79 111 46 102
2790A02j3o4Q0R6J1o6j2p8P5n7n1N2N5j09K99p7n1n4o5J15k5N5j5q9Rn2k6R1m7K5J8p5O5J15
$$ 102 89 25 105 201 212 146 134 56 131 74 23 75 130 21 320 243 192 138 73 188 163 218 203 114 123 71 45 136 89 114 132 57 122 237
2391B37P7k00J1l4n8Q0n1J0k6P6N5j57J94j01j4J4L4M0j38J18r8lK5Q4L2L7j31K12j43j39
$$ 237 314 114 125 91 33 113 62 72 46 122 177 20 214 113 99 113 147 187 49 167 69 66 91 175 207 244 113 325 182 43
2038D3K3K8j1O1o5J45R0j67%M6Mj85R5J4L45p0k47n3O3J2N0j43Q9O8j4mn1j43J23q6Q3r0N7
$$ 43 66 94 83 144 79 224 314 147 147 193 197 12 107 121 466 396 149 96 159 171 221 78 167 235 221 217 166 23 146 60 143 53 110
1651A10n5j4J35m9m0mK4J1RO7k4j6j9Rk1m2k3m7J48n8J04j08J89k00n2J88n8k9j05J57p3q5
$$ 110 55 41 176 127 87 83 107 118 127 194 170 154 135 144 123 81 58 11 159 101 205 97 286 86 34 222 164 135 30 187 114 29
1276B9K7R7J20rJ70k13j49P0O6j49M9J32j2L8j44J21L3j11k8r4Q7L9r9Q0r3M1lJ2q4J50n8
$$ 29 56 153 273 264 434 221 72 142 208 59 108 240 228 266 122 243 276 165 137 43 130 169 70 150 57 98 95 107 23 173 115
912A15L1j07O5%R7j48J47M8j92O6M4J46r8o5N4R3n8j24M6p4n4J01o5L3L3O8o6M0j41J6M9o0
$$ 115 146 39 104 104 201 53 200 248 56 122 166 312 214 149 203 296 238 114 160 86 32 133 68 101 134 202 136 176 35 51 100 40
536D0J52O5j05o1Q0jo6M7q2J28J09q6j65J50l9Mr3oj7O9l7K5N2j14Q5O2J08j16m0L9n3o4J16
$$ 40 192 257 152 91 171 170 104 151 69 197 306 220 55 205 166 170 77 71 54 123 86 111 163 49 134 196 304 188 148 187 134 70 186
149A86m8n8J53j68J75r3J32m9m9m1K8L6j21O2l7m1j6J9M2N1J00j59j03R8j8N8J5J6J2
$$ 186 138 80 233 65 240 147 279 230 181 140 168 204 83 145 108 67 51 70 112 163 263 104 1 99 81 139 154 170 182
-192A82
##PAGE=	F1=-11034.5
##FIRST=	25164.767445380970457,	5806.2096540000038658,	0
##DATA TABLE=	(F2++(Y..Y)), PROFILE
5806A08p9P8J5J83n5j27r1PJ3J35j16Q3j23J40o5r3Q6j7J54Lj18o6J46n2MJ8j09J03J16r9
$$ 108 29 107 122 305 250 123 32 39 52 187 71 154 31 171 106 13 99 82 236 239 121 55 201 149 153 171 62 165 281 182
5454A82K5q7%M3j09J72k0j64R0L0NJ2l6L6j6o7Q7Qpo6n3O2m1L9O3j03K2JJ0M3l8o6R7m6j02
$$ 182 207 120 120 163 54 226 206 42 132 162 167 179 143 179 163 96 183 191 184 118 65 127 86 125 188 85 107 108 118 161 123 57 154 108 6
5043FL6M2k0j0J8k1J9RQ3j9M8l3l5J1N9j09n6K5K5P5M8K08p6k19L4Q6q5RJ96k5k18j6K8n2
$$ 6 42 84 64 54 72 51 70 79 162 143 191 158 123 134 193 84 28 53 78 153 201 409 333 114 148 234 149 158 354 329 111 95 123 71
4644G1R0l1J40q1n3q7N3P5L3k6J9N7j34p7J46O4r3l4Ko7mqJ15j16L1J7L9j17L9pj2K4J07J1
$$ 71 161 130 270 189 136 49 102 177 210 184 203 260 126 49 195 259 166 132 134 67 63 55 170 54 85 102 141 24 63 56 44 68 175 186
4245A86j18rJ17P5o2p7K5K2j22P6J65k59J83k7p5L9O0n2R6r1K7q7M3M8n4j5l0j3J69M0k41
$$ 186 68 59 176 251 189 112 137 159 37 113 278 19 202 175 100 139 199 147 243 152 179 92 135 183 129 114 84 71 240 280 39
3881C9J42Kr3J30l8k8o9mn7L3J0L4j5k4Q7Q1j69rmJ32m0L16l03J42j0j98K3R8l4j01P4r7P3
$$ 39 181 183 90 220 182 154 85 81 24 57 67 101 86 62 149 230 61 52 48 180 140 456 153 295 285 87 110 208 174 73 147 50 123
3494A23J9j09R1j2K3l1N4l0j2J34j43J91m6j55J13n0O2Qn6p0m2J08J31j79m9J12k3n1l5LR
$$ 123 142 33 124 112 135 104 158 128 116 250 107 298 252 97 210 160 222 230 174 104 62 170 301 122 73 185 162 111 76 79 88
3130H8J7K7Q8j18J24j58J77j43p0J43ll8J21j5j86R8k7j3l3k1J07q6J5o5O3l8Q3j02R0qq9
$$ 88 105 132 220 102 226 68 245 102 32 175 172 134 255 240 54 152 125 112 79 58 165 79 94 29 92 54 137 35 125 117 28
2766B8R1J15K0j00pj29Q3n0nN0np6L20m4j06n8m6J21l1N8oj22pom3R1n1K6J7n0K2R2R8k04
$$ 28 119 234 254 154 147 18 101 51 46 96 91 15 335 291 185 127 81 202 171 229 223 101 94 88 45 136 85 111 128 78 100 192 290 86
2367H6O0o8n1J26r9K0k0J00M6j78J47j12N6k3N1O9j49R2q4JJ8R4P9l5j09K22j27j27L0p5N4
$$ 86 146 78 27 153 54 74 54 154 200 22 169 57 113 90 141 210 61 153 69 70 88 182 261 226 117 339 212 85 115 40 94
2003I4N4m5J77O5j75l6OK6j24N6ML31n9j99n9P7l5L3j29J14Q5j7Pk3j64Q7q8R0q4P3q8m4J83
$$ 94 148 103 280 345 170 134 140 166 42 98 102 433 374 175 116 193 158 191 62 176 261 244 251 228 64 151 63 153 69 142 54 10 193
1616A93q5kj0qK3%Q3l7Ko0rpl9L7m1J55j22J25j30K22j84p1K17j20Lj26J41p1j5rL1J27NJ98
$$ 193 108 106 96 88 111 111 194 157 159 99 90 83 44 81 40 195 73 198 68 290 106 35 252 132 135 9 150 79 64 55 86 213 218 416
1217D16j77k16Q1Q3j27Q2M1NLj32K17l6r3n4o5J09L9j33J37r8kl2Q6p4J52j18O0j44R4K2R4
$$ 416 239 23 104 187 60 142 183 188 191 59 276 240 147 93 28 137 176 43 180 82 80 48 134 60 212 94 154 10 104 126 220
853B20j29N5R4j18NO7J56j33r6O1J41n9j45L8o0o9J15r0L0L2L4m5P7j27M5n5O7J45Jp7j14
$$ 220 91 146 240 122 127 194 350 217 121 182 323 264 119 157 97 28 143 53 83 115 149 104 181 54 99 44 111 256 257 180 66
489F6J36k0q5O0j33J98R9j29r9J66j07l7m2J5o6J56j03J4J05j41K6P8J34j15m3K9J3j19R3
$$ 66 202 182 97 157 24 222 321 192 93 259 152 115 73 88 22 178 75 89 194 53 79 157 291 176 133 162 175 56 149
149A49l1p7J56j06J46p9J55q1q9l0O0K3r9N5k5m2o6j2Q9J09M9j76o1R6k6O9M4j8O
$$ 149 118 41 197 91 237 158 313 232 143 113 173 196 97 152 127 85 19 7 96 205 254 78 17 113 87 156 200 182 188
-192A88
##PAGE=	F1=-11136.8
##FIRST=	25164.767445380970457,	5806.2096540000038658,	0
##DATA TABLE=	(F2++(Y..Y)), PROFILE
5806A28r5Q4k0K07m9j11j02j3Q1N5j61J70j53J13k9p9M3M4J36k5j06l9J28n5j5j5j12J23R8
$$ 128 33 117 97 304 255 144 42 29 110 165 4 174 21 134 105 26 69 113 249 224 118 79 207 152 137 122 10 133 231
5466B31n4Pl7k7K0p3J47l0j56J69j8k9L3m7N0Lj31J59l8OKj64O5M6j7N2j12O7kK3L1p0n4P5
$$ 231 177 184 147 120 140 67 214 184 28 197 179 150 183 136 186 189 58 217 179 185 187 23 88 134 117 169 57 124 122 145 176 106 52 127
5067A27k1q4L3L0m9RM3J7kqP0k0K6l2k1k6O3q1n2J2O4O6PK35q7k35P3R5q2rJ90k6k04k1J3
$$ 127 106 22 55 85 36 45 88 105 103 95 165 145 171 139 118 92 155 74 22 34 98 164 171 406 319 84 157 252 170 161 351 325 121 100 113
4656A13l2N6L3J07j25K3j43J6J30K4Qj1N0j25o0J19O9j30lR0o2j10O0Q3j29P2m1J15j77N3
$$ 113 81 137 170 277 152 175 32 48 178 202 210 199 249 124 64 183 252 122 119 209 147 37 97 180 51 123 82 197 20 73
4304G3n6P5k4R8Lq9jJ22M4q3n2J4K3j08N9J61k10J24J8p7NL9m3Q0l0L0j01J2P0lp7ol6K19
$$ 73 17 92 68 166 169 80 79 201 245 162 110 124 147 39 98 259 49 173 191 114 119 158 115 195 165 195 94 106 176 173 96 90 54 273
3905B73O0k57J02K5j06R3n2K1m8m1l8kP4J6Kn5M3Q6j11j8n1J48j5K56l48K30K0j86l8J35J8
$$ 273 333 76 178 203 97 190 138 159 111 70 32 30 104 120 122 67 110 196 85 67 16 164 149 405 57 287 307 121 83 218 236
3541B36j48P0j50J23J5j16R1j0K1l0K4j9k2J55j36J22m3r0J40l8Nj3k8m6n9J09R6j60j5J12
$$ 236 88 158 8 131 146 30 121 111 132 102 126 107 85 240 104 226 183 93 233 195 200 187 159 113 54 163 259 99 84 196
3189A96k2Oq0J9p7L5K3J02r2Q6q9J11j12p2J51k0j8J32j4k28R3kj6k2k5R8o8Pq1Q4n8J02j07
$$ 196 174 180 100 119 42 77 100 202 110 196 107 218 106 34 185 165 147 279 265 37 130 128 112 90 65 163 95 102 21 105 47 149 42
2801D2R4J0j03Q0J39K8j31k0j22Q1p2N1O4p4o3L30pj52p2lJ02l3N7Nj48j9K3k5P2o4K9J7j0
$$ 42 136 146 43 123 262 290 159 139 17 98 26 77 141 67 4 334 327 175 103 100 202 169 226 231 83 64 87 62 134 70 99 116 106
2414A06l9N4J17j58Q4q6j0J26j25J5j5J06K5j66P5r4J21n9N8R8j79P2m8%JJ11J00q9r2K20
$$ 106 67 121 238 80 164 78 68 194 69 84 69 175 200 34 109 15 136 77 135 233 54 126 78 78 79 190 290 201 109 329
2062C29r9r9K1j18J02K6l5J85K7j65l7n0M7m3Pj9K84l7j40n5P6p3J3j02J33J07k1MJ6j84O7
$$ 329 230 131 152 34 136 162 127 312 339 174 137 87 134 91 98 79 363 326 186 131 207 134 147 45 178 285 264 268 284 100 167
1698A67r7Q3p4P7j15oJ69j15L8rm3L1NP5l8J4r2L8j7PK0m9J46j46J12j43K41j39r3K29j85
$$ 167 70 153 79 156 41 35 204 89 127 118 75 106 111 186 148 162 70 108 91 98 118 69 215 69 181 38 279 140 47 276 91
1334I1L0j07P6l7L7j5m7J19J2K07j12k09qJ09q5J01m1O0m8j17K64r5o0j3n4O7J7j09J73r6
$$ 91 121 14 90 53 90 75 28 147 159 366 254 45 37 146 61 162 121 181 133 16 280 185 125 112 58 125 142 33 206 110
982A10k7J6N0m9J37j59O9j22Q6M6Q4r9l4J04l3n2Q3J54j59j20P7J50m0j49K4k9r5J18j25M6
$$ 110 83 99 149 100 237 78 147 25 111 157 241 142 108 212 179 127 210 364 205 85 162 312 272 123 147 118 23 141 16 62
630F2J4K1j3R4r4P2q2Q0J04l8j4j41J33l5p3Q1j26J87Q2j61LJ31j32q7lL3m6J60j31j1J57
$$ 62 76 97 84 178 84 156 74 154 258 220 206 65 198 163 90 171 45 232 314 153 156 287 155 68 65 98 52 212 81 70 227
266B27j15o5M6J53q9j7j0P6j21J4jr2J49l3J00o4J72j01j36K3O2No5M4j3o7k9M1j7J53nj74
$$ 227 112 47 93 246 157 140 130 206 85 99 98 6 155 122 222 158 330 229 93 116 178 183 118 162 149 82 53 94 77 230 225 51
-110E1mO5j3P0N4l6P
$$ 51 47 112 99 169 223 187 194
-192A94
##PAGE=	F1=-11239
##FIRST=	25164.767445380970457,	5806.2096540000038658,	0
##DATA TABLE=	(F2++(Y..Y)), PROFILE
5806A49j00P7n1K02k8q4j10k1J11j7o5J15j59P6Mo1J8P6J02l7q1j6R7m6j8n0m9Q7Q4k6k8k
$$ 149 49 126 75 277 249 165 55 34 145 128 63 178 19 95 99 38 56 132 234 197 116 100 197 151 133 83 34 121 205 179 151 149
5431A49j0ol9J00m2j10K15n3p4N1o7N0M9j72J92o5J1O2k01K9R9n2K5j11J06mK5L0r0o0O2P
$$ 149 139 133 94 194 152 42 257 204 130 181 114 164 213 41 233 168 179 241 40 69 168 116 141 30 136 132 157 187 97 37 99 106
5055A06n5L2Mn2L9K8M7j6k8M5j7J2j9l8k3M6l5l5j5R9M0o3K61p8k30J21P6q2j3J55k0j79k4
$$ 106 51 83 87 35 74 102 149 133 105 150 133 145 126 88 65 111 76 41 26 125 165 102 363 285 55 176 252 170 157 312 292 113 89
4668H9Ok4N2Q1O0j42Q4j85MJ50K5L2n2N2j14k0O0P9j37NJ60n7k01J38M5j27P1p8J69j71K8
$$ 89 95 71 123 204 264 122 206 21 25 175 200 232 180 232 118 98 158 237 100 105 265 208 7 145 190 63 134 56 225 54 82
4304H2k9J07q3N7Mm3lJ39Rj19jnNl8K6J32j32J1O8p3NJk5M3L1L3r0l8P0N0p8k1o9K58O6k57
$$ 82 53 160 77 134 138 95 92 231 240 121 120 115 120 82 108 240 108 119 187 114 119 120 95 138 169 202 112 74 144 194 116 95 26 284 350 93
3881I3Q6K3j14O5m5N6m0l3n6jR7oJ7p3J6O5o0km9R7j0J98k82K40L2j53j04J69P0j78L1j05
$$ 93 179 202 88 153 108 164 124 91 35 34 131 125 142 69 85 150 90 88 39 136 126 324 42 282 314 161 57 226 296 118 149 44
3506D4J14M0j40O4j1J3k9J5nlJ40j32K8l1J0J25j9o8oj1j2p3J09M2j21%J11qM6r2J1q9jNJ06
$$ 44 158 198 58 122 111 124 95 110 105 102 242 110 138 107 117 242 223 155 149 138 126 53 162 204 83 83 194 186 232 140 151 62 61 66 172
3095A72l0K8m7M5o6o0J50m2kJ40j2k67R1K0j0qrN9o4K6j02J09o5Q9q0P1L4r9M3J62K9j52m4
$$ 172 142 170 123 168 102 42 192 150 148 288 276 9 100 120 110 102 93 152 88 114 12 121 56 145 65 136 170 71 114 276 305 153 109
2708A09q5R5j09J02O8r3n9K91K0j80p9L6O9k7N0J4j58k6L9NM6q5L4K1K3r2M4J04q3Q2q3J8
$$ 109 24 119 10 112 180 87 28 319 339 159 80 116 185 158 208 222 64 38 77 82 128 43 77 98 121 29 73 177 94 176 93 111
2332A11J11j27knQ0Rj27jL5Q6r2N6J15k16P0qMk6J26R8j29p8K05n9o3Kr3R3Kl8J79j3j47j2
$$ 111 222 95 93 88 168 177 50 49 84 170 78 134 249 33 103 95 99 73 199 297 168 90 295 236 173 175 82 175 177 139 318 305 158 146
1933A46q7N2L2l9m1K05rq3m4O3r2j1n3J36J25k9nN4j95N9j18P2n1O1j23O4J12j31P0po8L1
$$ 146 59 111 143 104 63 268 259 176 132 195 103 92 39 175 300 271 266 320 125 184 66 138 87 148 25 89 201 70 140 133 65 96
1557I6K6N7k9J4j16R2j7LKm5J27j44Q1r6K09q2j20K28k19K9o6j2M4M0j4l6L5J1J96j2j58q3
$$ 96 122 179 150 164 48 140 123 126 128 83 210 66 147 51 260 178 58 286 67 96 30 18 62 102 88 52 87 98 294 282 124 41
1182D1N5m6J05p9J40o7j01K02j32j7P9o9j4l0rJ57q1m5P2k7RR4j62N0o2O5O4O7p2q1O2N2r4
$$ 41 96 50 155 76 216 149 48 250 118 101 180 111 97 67 58 215 134 89 161 134 143 237 75 125 63 128 192 259 187 106 168 220 126
794A26Q1J41j62j32R0J24mj44J1J1j26J19j00J4j9K9J7Q9n7J00p3K8M7n2P2j40P1m2l4J08
$$ 126 207 348 186 54 144 268 264 120 131 142 16 135 35 49 30 59 76 165 108 208 135 163 210 158 230 90 161 119 85 193
442A93r7J24O6j76R4Q0j22j02pM4l2J52j20l7J95r3q1qJ07m1K4m5J10r4r0M1l7P9K0M6m1J77
$$ 193 96 220 286 110 204 284 162 60 53 97 65 217 97 60 255 162 81 73 180 139 163 118 228 134 44 85 48 127 147 193 152 329
67C29j01j49N5M8j0l5L2pj06P8M7j02J57m5j46M0RK3M8N2l2J4
$$ 329 228 79 134 182 172 137 169 162 56 134 181 79 236 191 45 85 94 117 165 217 185 199
-192A99
##PAGE=	F1=-11341.3
##FIRST=	25164.767445380970457,	5806.2096540000038658,	0
##DATA TABLE=	(F2++(Y..Y)), PROFILE
5806A67j09P3p8J84Jp0j01l2J18p3L5N1j38M4J4m3K3O0P0l0n0kO5k9j8m1k8N9P9k3o3J1J9
$$ 167 58 131 53 237 238 168 67 35 153 80 115 166 28 72 86 43 66 126 196 166 116 114 179 150 132 91 63 122 201 178 115 126 145
5419A45j8jM4n5m8K39p3j09O0q3K1R3j70J81p7K5R5k04J0J04o8Mj13J45pJ2L9r2o4O8Nl8M0
$$ 145 127 126 170 115 67 306 233 124 184 101 122 215 45 226 149 174 269 65 75 179 111 115 2 147 140 152 191 99 35 103 108 70 110
5032A10k5l8M2J8O5k6n3K5pOop5K0J9J3kj8O6K6j07K40n2j85J40M2r3KJ03k1j37k1Pk3O7R4
$$ 110 85 47 89 107 172 146 93 118 111 117 111 36 56 75 88 86 68 134 160 53 293 241 56 196 238 145 147 250 229 92 71 78 55 122 216
4621B16J3j27J22k05M3J11J9M1q4O2j13M9j6P6j03j0K00n5k19J60J4j09L5p1J77j52J6K4J18
$$ 216 229 102 224 19 62 173 192 233 149 211 98 147 131 207 104 94 294 239 20 180 194 85 120 49 226 74 90 114 232
4280B32j41MJ1J1j5J59l2j51P2k8m2L8J7Q3o6j00J04n6L6m8MmQ0M0o8p3K4J01m8m1q8K60M9
$$ 232 91 95 106 117 102 261 229 78 150 122 80 118 135 218 152 52 156 100 136 88 92 88 168 208 140 67 91 192 144 103 15 275 324
3893C24k46J07J4j29M0k1Q0l7or8J1R9k7L1p6K2J4k4J5k7L1k3J51j06J65K4j13j54J86J18
$$ 324 78 185 199 70 110 89 169 132 126 28 39 138 111 142 66 88 102 78 93 66 97 74 225 119 284 308 195 41 227 345
3541C45j86k7l7J00P1j68K0k0K6j1K1ML3R4j39p4K3O4R2Oj32L1k9K3o1J05k2q5PJ08J3O1q0
$$ 345 159 132 95 195 266 98 118 98 124 113 134 138 171 265 126 52 75 139 231 237 105 136 107 130 69 174 152 67 74 182 195 256 176
3154A76j2o3k5l7J00L5j5m1jk0l6J35o4LJ41kk36K4K6J5OJ3Op0O8r5J11o9N4m2M3N6q0qJ71
$$ 176 164 101 76 39 139 174 159 118 117 97 61 196 132 135 276 274 38 62 88 103 109 122 128 58 126 31 142 73 127 85 128 184 104 96 267
2743B67K5j56o3j5Q9j32J28N9p6o3K28K6j82n8M9K1nL4J8j42l2N9J9K2q7J8K6M0p7Q5Qk0P0
$$ 267 292 136 73 58 147 15 143 202 126 63 291 317 135 77 126 147 142 176 194 52 20 79 98 120 33 51 77 117 40 125 133 113 183
2355A83o2K5Q7j07l3J4K3Oo9k9J06O2j10M0J18k42Q0K5Pn1J32Q1j55o1J78j5k8j5p3Q2j5m9
$$ 183 121 146 233 126 93 107 130 136 67 38 144 206 96 136 254 12 92 117 124 73 205 286 131 70 248 233 205 190 117 199 184 135
1980A35J67m1j34K6r5M2Q8p3m2R2J9m1l1M9r0l7L2J07J28m4mP8j97N8j36N2j1J9q0J14K6j27
$$ 135 302 261 127 153 58 100 188 115 73 165 184 143 112 161 71 34 66 173 301 257 253 331 134 192 56 108 97 116 36 150 176 49
1604D9Q9Lq9K6N9M4j5%j32J06kj4k0k4J00j28M3mJ47k5j52K21j71m2j7jK8K4k0rl0KJ65J05
$$ 49 138 141 52 78 137 181 166 166 34 140 138 124 104 80 180 52 95 91 238 213 61 282 111 69 52 51 79 103 83 74 44 46 211 316
1205C16j12r0m4m6R1m9J93n6j30J15j41L3J60p9p4m9P0R4n5n8J10j10J00K3j34J3QM8P4M7
$$ 316 204 114 70 24 115 66 259 203 73 188 47 80 240 161 87 38 108 202 147 89 199 89 189 212 78 91 99 147 221 268
853B68n4q6qJ21j18N9J21j39j32R1Q9L6j30rN5j53J20m3k9m7L0M0N7k2J25o6k3No6J57j31
$$ 268 214 128 120 241 123 182 303 164 32 123 212 248 118 109 164 11 131 88 59 12 42 82 139 117 242 176 153 158 92 249 118
489A18j1m6K1J39q5N5N6j79J59K7r6r1k2N2m4J37p1o1K14q6p5J8j1ON1m2J08o2j49O1j0L6
$$ 118 107 61 82 221 136 191 247 68 227 254 158 67 45 97 53 190 119 58 272 186 111 129 118 124 175 133 241 179 30 91 81 117
114A17M2mj0J63p5j17K7M0j8k3K5oj37J89K8j34J15o1r7O4o6P3NM3pK8
$$ 117 159 155 145 308 233 116 143 183 165 142 167 161 24 213 241 107 222 161 64 128 62 135 140 183 176 204
-192B04
##PAGE=	F1=-11443.5
##FIRST=	25164.767445380970457,	5806.2096540000038658,	0
##DATA TABLE=	(F2++(Y..Y)), PROFILE
5806A79j22P0r7J67K6p3p4m7J02r7J09or6L9j0k7M7J0M1j0j4%M8j5k7km5N1P9m0q0OL9k3N3
$$ 179 57 127 30 197 223 150 76 29 131 34 143 137 41 80 70 43 90 100 141 131 117 117 165 150 123 121 76 127 206 166 86 92 131 108 161
5395A61j6o1NK50p6j24N5q4l7J18j62J73q6N6R6j93K0Q3q2Jp5J39j7j3N6q2k3N7k5m7O0n2
$$ 161 145 84 89 339 263 139 194 110 73 191 29 202 116 172 268 75 95 178 96 97 22 161 144 131 187 105 82 139 114 67 127 75
5020G5k5K9K4O5l3o4NJ3PKo2K3nM3M1k3NL7l3R1j9j18J30Qj18L3N4l9p0k4K0j7P3P8k8q7J37
$$ 75 50 79 103 168 135 71 76 89 96 98 36 59 54 97 138 115 120 157 124 215 196 78 208 216 98 131 185 146 76 52 72 55 128 206 178 91 228
4586B28k03O1Q9mM0j02Q2j21J33q8M3m3k4K00n8j90J48pp5kl6J40j25J2O7J27j89m1L2M7j7
$$ 228 25 86 175 171 211 109 191 70 203 115 158 115 91 291 233 43 191 184 109 107 71 211 86 98 165 292 103 62 94 141 124
4222A24J57p9j57J40m6j00R5L1K9k0j33N7j2O8r0L7l9J05N1m9p7n9J45k0m2o7K01Rk23J58
$$ 124 281 202 45 185 139 39 134 165 194 174 41 98 86 154 64 101 62 167 218 169 92 33 178 158 116 49 250 259 36 194
3870A94J8j41qJ0J00l1J8j38K1Q5m4M5p4M7m9J0J9mOp3J17L5J22Op8j71J77J54j70p8J1R3
$$ 194 212 71 63 73 173 142 160 22 43 128 84 129 55 102 53 63 82 78 84 11 128 163 285 291 213 42 219 373 203 125 136 229
3494B29R0j88k8m0P9J9J9J3O2M2j51j05P8K4O5K8j72Q1q1O1j2Q5q8o3J8R5L6N2m8m5l1j4q1
$$ 229 319 131 103 63 142 161 180 193 255 297 146 41 119 143 208 236 64 145 64 125 113 198 110 47 65 160 196 248 200 155 124 110 29
3107B9R5O4k6o0J4k0pJ10q0qJ34J6j68n2%N4J8K9n1m9R4q6J14p1OoK2O8m9o3J63J4j37l5K9
$$ 29 124 188 162 102 116 96 89 199 119 111 245 261 93 41 41 95 113 142 91 42 136 50 164 93 99 93 115 183 134 71 234 248 111 76 105
2696A05O9j56J43M1m3o2J51J2j58j1L8l7L1J1J6r3l0Q0mJ5l9n4L1L9j0J02o7NN4k8J4N8o8
$$ 105 174 18 161 202 159 97 248 260 102 91 129 92 123 134 150 57 27 107 103 118 79 25 56 95 85 187 120 125 179 151 165 223 155
2308A55p3M3n5J5KpJ04N0j09J1J09k18O2N2lo1J28N7j64l9J54J6qk0o7P2k5o4J55m9j35O4
$$ 155 82 125 70 85 87 80 184 234 125 136 245 27 89 141 138 77 205 262 98 59 213 229 221 201 134 206 181 117 272 223 88 152
1933A52r8M7J19r0k7k7L8k4j3L2o6J3O1O7J02o8J8Q3j90N6j32K0L9n1K1J31q2j06R2K9j07
$$ 152 54 101 220 130 103 76 114 90 77 109 43 56 117 184 286 218 236 319 129 185 53 73 112 61 82 213 131 25 117 146 39
1569C9J3R5M2Mk3j34O5K4no5J3O7r1J5O9Q9K8j86K07p9j26K2K2k4J9m0Ol2lJ01K06o8j06p0
$$ 39 52 147 189 193 170 36 101 125 120 55 68 135 44 59 128 217 245 59 266 187 61 83 105 81 100 60 66 34 31 132 338 270 164 94
1170I4q2M4PK22m1j61K2p2K4K13p2p9K5K0Ql0n6J19j69J93n9r1k5P6K6Q2J8m3o4p0J66j23
$$ 94 12 56 63 285 244 83 105 33 57 270 198 119 144 164 172 142 86 205 36 229 170 79 54 130 156 238 256 213 149 79 245 122
794A22J5J00r5j14O5P5O2j08m0J01j69J19jm3n0kO7%OJ44o5n6K3r6J97j22o7o2P7J62q5lN7
$$ 122 137 237 142 28 93 168 230 122 82 183 14 133 132 89 39 37 104 104 110 254 189 133 156 60 257 135 68 6 83 245 160 157 214
407B14j84J98k1o9p9NM9p5R8Oq1K16r2o8O5q3J0M6j1J00l5j43M5j5J4M0l9L0J32m0q5j3L9
$$ 214 30 228 207 138 59 64 113 38 136 142 61 277 185 117 182 99 109 155 144 244 209 66 111 96 110 150 111 141 273 233 148 135 174
20A74rl8K5%j11K29oj20M2n2m7Q2j36J16n1K8L8M2
$$ 174 165 127 152 152 41 270 264 144 186 134 87 169 33 149 98 126 164 206
-192B06
##PAGE=	F1=-11545.8
##FIRST=	25164.767445380970457,	5806.2096540000038658,	0
##DATA TABLE=	(F2++(Y..Y)), PROFILE
5806A84j28N7j04J56L8q7l5n6O1m6J03m5m4N1n1j7P9m9K0MK4kM5rm7L7o0M4Q5o7p4LL9l5J21
$$ 184 56 113 9 165 203 116 81 25 86 40 143 98 54 105 54 37 116 67 87 91 115 113 158 149 102 139 79 123 208 141 67 70 109 74 195
5395A95p7m3K9K52o5j14K7q5q9J17j10J42j01R3P2j68M9N4j02J8n4J34l3m0P5o7L3L3n6p9
$$ 195 118 75 104 356 291 177 204 119 30 147 37 179 78 171 243 75 124 178 76 94 40 174 141 101 176 109 142 175 119 40
5043D0R3p0j4JM9M7l9j5n2L4J1K0Lm3j4N3P4k8n8O7L1m8J7o5J17k3j49P5L0p8J8m8L3J1N7
$$ 40 133 63 49 50 99 146 107 92 40 74 85 105 108 65 51 104 178 150 92 159 190 142 159 94 211 188 39 114 144 66 84 36 69 80 137
4632A37L9m9m0J31j77M2R0l0L7j01J09j18J90j41k9K7j9J62p3j24J12j7k8ll1R6r4QQ8J30
$$ 137 176 127 87 218 41 83 173 143 180 79 188 70 260 119 90 117 98 260 187 63 175 158 130 127 96 192 98 106 194 324
4280C24k22n7O4N2QJ17j33j33J88n1j36J05N9j8No5q1P1O7j11N8l3R4N5l3p2p6J19rk7n2J37
$$ 324 102 45 109 161 169 286 153 20 208 157 21 126 185 167 172 107 26 97 164 53 111 78 172 227 194 122 46 165 156 129 77 214
3905B14m7j43J76M5j34p6L7J01j9L0j46K5M6n6N8p1P3r7M5LJ5M8n0k3J11J09on7j63J50J78
$$ 214 167 24 200 245 111 35 72 173 154 184 38 63 109 53 111 40 113 16 61 64 79 127 77 54 165 274 268 211 48 198 376
3541C76j38j04K2R4R4j96p6m8J55L8KL4P8j2j63o7Q1m2N6M1j87J13j37J23L6N1j49m0K8P0
$$ 376 238 134 156 250 344 148 72 24 179 217 219 253 331 319 156 89 170 128 184 225 38 151 14 137 173 224 75 35 63 133
3189A33N3K6%q2LJ3j03R8L8j2q4Q2o8K2Q1q3l4J19M1r1q5k6N0K6L9r0L6L8q6J27o8m2J5J3
$$ 133 186 212 212 130 133 146 43 141 179 167 83 165 97 119 200 117 83 202 243 152 67 41 91 117 156 66 102 140 54 181 113 71 86 99
2790I9O7j1j09J33Lj00L7K8M4j72J42K4j0n9P0j0j11L7K6j00P4j4J4k6k5Q9m3L7%j17K1J9
$$ 99 166 155 46 179 182 82 119 147 191 19 161 185 175 116 186 176 65 102 128 28 102 88 102 76 51 140 97 134 134 17 38 57
2414E7O8Q9r1%L5J9j3L4j8j16P5q7LN7%Q6M2q4k6R0j71M1O6k7m7J13L5j42k5J57J2j3qp9O7
$$ 57 125 214 123 123 158 177 164 198 180 64 139 52 55 112 112 198 240 156 130 220 49 90 156 129 82 195 230 88 63 220 232 219 211 132 199
2003A99l0p7J39l4j48R5j03O4J25q3j1p4Rm4M3j5k4R5N2L5M5r7N9P4j82N3j06j7R0q8J07J23
$$ 199 169 92 231 197 49 144 41 105 230 147 136 62 71 27 70 55 31 126 178 213 258 161 220 294 112 165 59 42 132 44 151 274
1628B74j96m9N1O8j16JJ15M5L2m6j27k0N5N5j23M2K8k6N0M1M4P4k08J75K2j80L8J5o4L3q0
$$ 274 78 29 80 148 32 33 148 193 225 179 52 32 87 142 19 61 89 63 113 154 198 272 64 239 261 81 119 134 70 103 23
1264B3J4J0J1K1K54k0j31n7p1j0NK44l7j66p3Q0o9K40n1n4O4k1p6ql1R1j11J85j32n0k2J00
$$ 23 37 47 58 79 333 313 182 125 54 44 49 293 256 90 17 97 28 268 217 163 227 206 130 122 91 182 71 256 124 74 52 152
888A52mR1k1l4k6j02J81j08m1Q2m8o6JR6O0q3p4J42j78J20J4l3o2rQ7o8K1J52p0o2P1q2J46
$$ 152 148 239 218 184 158 56 237 129 88 170 122 56 57 153 213 130 56 198 20 140 154 121 59 50 137 69 90 242 172 110 181 99 245
501B45j11o0l0M1J69q4l5O9j92K02n6m8m4M4L0p4PR3r9K06j08o0J05q3l0PK5J04j9j32M6l3
$$ 245 134 74 44 85 254 170 135 204 12 214 158 110 66 110 140 66 73 166 67 273 165 105 210 127 97 104 129 233 214 82 128 95
125I5nL1l6N6Q9j3o4m0M3J4p8L8J2p2K20m6o5m7k4kR2j55J10r7MR0N2
$$ 95 90 121 85 141 230 217 153 113 156 170 92 130 142 70 290 244 179 132 108 106 198 43 153 56 60 150 202
-192B02
##PAGE=	F1=-11648.1
##FIRST=	25164.767445380970457,	5806.2096540000038658,	0
##DATA TABLE=	(F2++(Y..Y)), PROFILE
5806A83j14J8p2J25M0r4rm5lM3M3n8J4N4q6qJ01q8J4j2O3mN6j7p4O6n9K8R0q9n4K6K5o6J88
$$ 183 69 87 15 140 180 86 77 32 29 72 115 57 71 125 39 31 132 44 58 46 109 105 161 144 70 136 77 105 195 106 52 78 103 37 225
5395B25j36lK1K46m3q1j1j07r6Q2J2O5j03R9L2j21O9L3j08L8o5J31m8n7Q3n2R2pp0j11J18
$$ 225 89 86 107 353 310 229 218 111 15 97 109 174 71 170 202 81 150 183 75 113 48 179 131 74 157 105 197 190 120 9 127
5032A27o8%m8J03J6l9O5j19L4J0N5L1r6nM4Q4k6j01R5M8j32O5m8J14n6j25P4M0o4L1q2K8N9
$$ 127 59 59 11 114 130 91 156 37 71 81 136 167 71 66 110 194 168 67 162 210 78 143 95 209 153 28 102 142 78 109 27 55 114
4644A14L7j7l5j6J14j32j2J06m0M3p5J17r2J96j68j29J03KR1r6k3N0j4K6J7n1N8n9kQ3J22
$$ 114 151 134 99 83 197 65 53 159 119 162 87 204 112 308 140 11 114 116 207 111 88 138 124 150 167 116 174 115 113 196 318
4280C18k36m2Q6N3M8M6j88o8K00m8j32O1R5n3J5J1j21Q4L5j12N9J0O3M7k4o5n5O5j0pm5R1
$$ 318 82 40 126 179 227 273 85 17 217 169 37 98 193 140 155 166 45 129 164 52 111 121 184 231 207 142 87 152 142 135 90 181
3905A81j11J3J14Q4j13q8K0O7oL3j25K5nn8O3n2Q5n5oj9K9J10m2j03Q7J15kn7j33J14J90j03
$$ 181 70 83 197 281 168 80 100 167 161 194 69 94 89 31 94 42 127 72 66 47 76 186 144 41 128 243 241 184 51 165 355 252
3529B52j07PJ04Q4j97j15N5J38M1k9P0P8o4j69l7R3r3N7L9j84J20q7J31M8Oj97oL3L5N9rO2
$$ 252 145 152 256 340 143 28 83 221 262 233 303 381 317 148 111 204 111 168 207 23 143 56 187 235 241 44 38 71 106 165 156 218
3154B18j13L3L5r6J01j7lr3J51j19M4N7p2p1R9O7j6j09j2OM0M6q2Q4m2j00J47n5p5J7J1N5
$$ 218 105 138 173 77 178 161 158 65 216 97 141 198 126 55 154 221 205 96 84 90 130 176 94 178 136 36 183 128 53 70 81 136
2778A36K5j35Q4J2p2J12J1K2j73J25J2J3n9lj3n7N8K4p7L5l4M4Pj8P7p1Q1J5j57LlJ28N1q1
$$ 136 161 26 110 122 50 162 173 195 22 147 159 172 113 110 97 40 98 122 45 80 46 90 97 79 156 85 166 181 24 27 24 152 203 122
2379A22k0J7P2m5J9L1j50J07l8k1M6j3N9L4m1o5P0j17L2N6o4nR0K1r5k0J76k1l6J5r9O5l3
$$ 122 102 119 191 146 165 196 46 153 115 94 140 127 186 220 179 114 184 67 99 155 91 86 176 197 102 82 258 237 201 216 117 182 149
1992A49q2J18j5j51J11q7O1J16n4ln7m1j9P9o8j6J51M5J6k7j30J08N8j75N7q1l5J27l3J13
$$ 149 67 185 170 19 130 43 104 220 166 163 106 65 46 125 57 41 192 237 253 226 96 204 262 87 144 63 28 155 122 235
1639B35Q9k71J6l1J08j10J4R4L7P4o2j24j2qJ24r5qj2L5R8k4J7J09k04J14J12k08M8k1p8O4
$$ 235 324 53 69 38 146 36 50 144 181 255 193 69 57 49 173 78 70 58 93 191 167 184 293 89 203 315 107 155 134 56 120
1276A20p6KJ5L0jK07K8j55k9m8J0l5K30n5j37m2Q5j39K36k6k9P4m6j32MJ3L5mJ34j83j9K1
$$ 120 44 46 61 91 90 297 325 170 141 93 103 68 298 243 106 64 149 10 246 220 191 265 219 87 91 104 139 135 269 86 67 88
900H8P7m4J04p1k2K0j01J75p7o6M8k9jo3J18L3o0q3J55j68J18%no2lQ7j11J1J44p7m7J15l8
$$ 88 165 121 225 154 132 152 51 226 149 83 131 102 101 38 156 189 129 46 201 33 151 151 146 84 81 168 57 68 212 135 88 203 165
513A65M9j01k3j7J0J63p7l7Q9j79J52p9j9L3L7pm3m5J14j12J89j18n8J32n3o4m2L4J14j1j26
$$ 165 214 113 90 73 83 246 169 132 221 42 194 115 96 129 166 159 116 71 185 73 262 144 86 218 165 101 59 93 207 196 70
149G0O3n3k5K5L5K7M6om8l8L3N2j29O4J8n4J91q0J3j25LM4Q1j43Q2r0l0J13N1
$$ 70 133 80 55 80 115 142 188 182 134 96 129 181 52 116 134 80 271 191 204 79 82 126 207 64 146 56 26 139 190
-192A90
##PAGE=	F1=-11750.3
##FIRST=	25164.767445380970457,	5806.2096540000038658,	0
##DATA TABLE=	(F2++(Y..Y)), PROFILE
5806A80q5m3j2Q0L4p3j7k3rN5k2m3O7L9j05OJ07j05M1l2N6LP2l7j02Q1l7nQ8q3m0M9L0q5K15
$$ 180 95 52 40 120 154 81 64 41 32 87 65 22 89 128 23 29 136 31 72 40 96 99 171 134 32 113 76 71 159 76 36 85 115 30 245
5395B45j78L1KK32j8l2m0j53m3J1J30Kq7O9j8n4O4K6q4M6r7J15n9l9N8l7J48o1o6m8M6m4J2
$$ 245 67 98 100 332 314 282 242 89 46 57 187 189 102 171 153 99 163 189 105 151 54 169 110 71 129 92 240 179 113 65 111 67 79
5008G9n0J20ok3J00j73L3jR3K8j24J4K4O6j0j08R7J8j26J03o8J18r3l3K2N8j8or5j8J29K2
$$ 79 29 149 143 120 220 47 80 79 172 200 76 90 114 180 170 62 159 177 51 154 86 204 111 78 100 158 140 134 39 21 150 172
4632A72q4J7l6J01p6q7J25k6O4m9J05o6J82j79r1M4K3Nr2O8k8OP1K4n8K1k7j2N1J04k25rR5
$$ 172 88 105 69 170 94 7 132 106 170 121 226 160 342 163 72 116 139 144 52 120 92 98 169 193 135 156 129 117 168 272 47 38 133
4245A33P0P7l3k20M7J42m0j17J3J18p5K6P3j12N4Nj07L8Q8K1K1j7o1l5J9mMl6Q0j20P7N4J20
$$ 133 203 280 247 27 74 216 176 59 72 190 115 141 214 102 156 161 54 92 180 201 222 205 144 109 128 124 128 92 172 52 129 183 303
3858C03q3q0kJ4PL0q8K0m9l6M5oP2qp7k6M3J52m3j36J5J26K1p6p0N4J95q0r1k0J25O4j94r3
$$ 303 220 140 138 152 159 189 101 121 72 36 81 75 147 139 62 36 79 231 188 52 67 193 214 138 68 122 317 237 146 126 251 315 121 28
3459B8J27R9L0o9J17O2j10j62j6J11j00M3K8j75J07jJ41K8m6k17J1M6JN3l4J21j23N3L2o2
$$ 28 155 254 284 215 332 394 284 122 106 217 117 160 188 13 120 119 260 288 242 25 36 82 83 136 102 223 100 153 185 123
3107A23R2n0l8p8J96j51M9M5n3r8P4Q6M2j28Pl0O8N3o7R9j16j05J46k9p6JLL4M8j32K6P6j03
$$ 123 215 165 127 49 245 94 143 188 135 37 111 197 239 111 118 88 156 209 142 241 125 20 166 137 61 62 65 99 147 15 41 117 14
2719A4J73oJj59J02J2J2o6k7N7o3K8L4j6l4j9J00k8oL9p2J22J4j89LK8J14Kn2m6%J20o7OP1
$$ 14 187 181 182 23 125 137 149 83 56 113 50 78 112 96 62 43 143 115 109 148 76 198 212 23 26 54 168 170 118 72 72 192 125 131 202
2308B02j68J30Nj8J6m4L2J9J5r7N5o3L0J8j04O5N6J9m9oJ81o0o5M1j14O4l7p0Q2oj28J13n1
$$ 202 34 164 169 151 167 123 155 174 189 92 147 84 114 132 28 93 149 168 119 113 294 234 169 210 96 160 123 53 135 129 1 114 63
1921F3L4J00j1nm3o6K8Q7q5m5J87L9Kq7j65J52M3j64P1p5k5J42K5J14L9k72L8r0J05r7M1O6
$$ 63 97 197 186 181 138 72 100 187 102 57 244 283 285 198 33 185 228 64 135 60 35 177 202 316 355 83 121 31 136 39 80 146
1545A46jJ30o4j36O8o5J09n4m1m7P2J38q9J1J28j77K8J83k10N3p5n0Q9m5rj3M3K0Q9P3j63
$$ 146 145 275 211 75 143 78 187 133 92 45 117 255 166 177 305 128 156 339 129 182 107 57 146 101 92 79 122 142 231 304 141
1182A41mj6K6j3J84r9r3pN9j43J87rj8N5n3j45J5N0k6R0Q8j97j3O7M5q5J16j09j9N7p1J58
$$ 141 137 121 147 134 318 219 126 119 178 35 222 213 195 250 197 52 67 117 91 181 269 72 59 126 171 86 202 93 74 131 60 218
806B18m4m7Pn1O4q2R0mm1n3J27j31J06l9L7l4rP5j15j9J13p9k0J55nn0r7J8kpJ46o4k7J17
$$ 218 174 127 134 83 147 65 155 151 110 57 184 53 159 120 157 123 114 189 74 55 168 89 69 224 219 169 72 90 88 81 227 163 136 253
407B53j73R2q9L1J01Nn8Kk1N2j19J70j05p2J49j8p7k3k9R9oj20Q1o7m8M3J25l6Rj5l5Oj0R9
$$ 253 80 172 83 114 215 220 162 164 143 195 76 246 141 69 218 200 123 100 71 170 164 44 125 58 10 53 178 142 151 136 101 107 97 196
8A96j58Q4Nn5J46r7R1j21j8P8M2j28O8n0j8O8L2
$$ 196 38 122 127 72 218 121 212 91 73 151 193 65 133 83 65 133 165
-192A65
##PAGE=	F1=-11852.6
##FIRST=	25164.767445380970457,	5806.2096540000038658,	0
##DATA TABLE=	(F2++(Y..Y)), PROFILE
5806A81o0j07N4L4J9k9m8NL1%o1j2R8J1j15L2J01j14P0Jj5K4Q3n8j16P0jk6N4m3k8L4N2q0
$$ 181 121 14 68 102 121 92 44 49 80 80 19 7 105 116 1 33 134 20 90 91 76 100 183 125 9 79 78 52 106 63 35 69 121 41
5407D1K13j88L5j8K10OK2m4j96Lm8K07l9p2M0o6J5L4L2m4M9j19P6o9J1Jj4J89j28m4K5l4o
$$ 41 254 66 101 83 293 299 321 277 81 84 36 243 204 132 172 106 121 155 187 143 192 73 149 80 91 92 78 267 139 95 120 86 80
5020H0J8l8J27j2lQ9k13M9j3J14Mj25L2KL6J4r6P6m0LP4j08J29j26L9%N1J4k7p9l9J49Pj41
$$ 80 98 60 187 175 172 261 48 97 84 198 202 77 109 111 147 161 65 141 101 104 178 70 199 73 112 112 163 177 150 71 32 181 188 47
4621D7P3q0J01j8n7L3lQ9l3Q5m2J64j80l9j3K9p3M0L4j04M3R0Kl5j6pj4JP7j79J9J01R6Q1
$$ 47 120 40 141 123 66 99 96 185 152 237 195 359 179 140 127 156 83 123 157 53 96 186 188 153 137 130 116 117 194 15 34 135 231 312
4222C12r9j34O4P0l4q6jQ8q5N1J07j15K5kj09NJ89l2j7qo4j5k2J9JkR4q4L7J0J35m6o3k4l2
$$ 312 213 79 143 213 179 93 92 180 95 146 253 138 163 161 52 57 246 214 197 189 125 110 88 107 108 106 200 116 153 163 298 252 189 165 133
3811A33J8K3m4Mp6nJ9N0M4L2j45j0M4J62m7j52j6R5N8j02K7l6J98p9n4n2J49L8j87j8J33O0
$$ 133 151 174 130 134 58 53 72 122 166 198 53 43 87 249 202 50 34 129 187 85 112 76 274 195 141 89 238 276 89 71 204 264
3435B64J2j09J68K7j39j34%J23o6QJ7j52P1Q3J53Jj03j90qO2l1N2k2J40j07N7Pj0O8l6j27
$$ 264 276 167 335 362 223 89 89 212 146 154 171 19 90 173 326 327 224 34 26 88 57 109 87 227 120 177 184 174 242 206 79
3071G9m5K11j57L2M9l2j04N2Q7P6j24K0n9J04N5o9J05j67n3P2Km7ok9J5N3r9K5J13j20J53
$$ 79 34 245 88 120 169 137 33 85 172 248 124 144 85 189 244 175 280 113 60 132 134 87 81 52 67 120 21 46 159 39 192
2708A92j9j9j38Q7K3j4p0N4R1j19k4N4K4o6K2J39q9Rk0m3J41Qk10J5O8P9k3l5n1nJ20o5j4
$$ 192 173 154 16 103 126 112 42 96 187 68 44 98 122 56 78 217 128 137 117 74 215 223 13 28 96 175 152 117 66 61 181 116 102
2320A02R7j71J46J7Nj1q3K7j7P0j15N8j9K2l9l4N2J4K6k0J9J60r2q6O2j11N6m3l5L8k4n7Q9
$$ 102 199 28 174 191 196 185 102 129 112 182 67 125 106 128 89 55 107 121 147 127 146 306 214 128 190 79 135 92 57 95 71 14 103
1933A03k2J0Q9K2j3l6p8N7R2r0o5K07K9rj16j50J24M0j28P5q1%J32O9J15j7k44O4j11M7p9
$$ 103 81 91 180 202 189 153 75 132 224 134 69 276 305 296 180 30 154 194 66 141 60 60 192 261 376 359 115 179 68 115 36
1569C6O8N7o9J93n4j69J53p4L2jm9p8Q4J60j38K7J24j31p7K41j84M4j34J7R4k3j9k7M5N5n9
$$ 36 104 161 92 285 231 62 215 141 173 172 123 45 129 289 151 178 302 171 94 335 151 195 61 78 172 149 130 103 148 203 144
1205A44J08j38QJ4K7M5J42j54n9NL5j33J62pk3J2m6j05K8N4o2J44N8j74l1R6K0j06J21o0o1
$$ 144 252 114 122 136 163 208 350 196 137 142 177 44 206 199 176 188 142 37 65 119 57 201 259 85 54 150 170 64 185 125 64
841F4L8k6J35j9k1k4p6J09q4N1n0k0j1Q3p2P7q7Q6J2l4O7j03m6O9p0oJ85Kj01r1M9MqJ22n3
$$ 64 102 76 211 192 171 147 71 180 96 147 97 77 66 149 77 154 67 153 165 131 198 95 49 118 48 42 227 229 128 37 86 90 82 204 151
430A51k1J55j61K7r5R6J43l1j19O0Rj9j19J47o2j06J66J1q4Qo0L3Rp6M3p1ML3J63r1k2k9k4
$$ 151 130 285 124 151 56 152 295 264 145 205 214 195 76 223 161 55 221 232 148 156 96 129 138 62 105 34 38 71 234 143 121 92 68
43F8O9o9J46j55Q1k1n4Q3r4J48n0n1Q5k2j23Q6k5qL8k
$$ 68 137 68 214 59 140 119 65 148 54 202 152 101 186 164 41 127 102 94 132 130
-192A30
##PAGE=	F1=-11954.8
##FIRST=	25164.767445380970457,	5806.2096540000038658,	0
##DATA TABLE=	(F2++(Y..Y)), PROFILE
5806A91n2j19P6j3oK0p8M1M8l6Oo2J00j1o7LR7j10O7M8q7N1Q4o9q0NL4Nk1Mpl7Q0o5K07j68
$$ 191 139 20 96 83 77 97 19 60 108 72 78 16 116 105 38 41 138 28 95 143 56 107 191 122 42 47 81 86 65 69 62 25 105 40 247 79
5384G9J5l1J76K2P4k4k06J4p7K17n3o6L2j05P3j7N3pN3j10K2q9O6o3L1K02k02j3R5j05L1J9
$$ 79 94 63 239 261 335 311 105 119 42 259 206 140 172 67 140 123 176 169 222 112 134 45 111 48 79 281 79 66 161 56 87 106
5008A06k9J34j2J5N3k15O3j8J10k6j04L5mK1K2r4O0j02J57K6j45J36j28O5J1J4K8k4m0j6J00
$$ 106 77 211 199 214 267 52 115 97 207 181 77 112 108 129 151 57 117 15 172 198 53 189 61 126 137 151 179 155 115 99 199
4644A99j0j58R4j19J07L3k0m2qJ07j8O5k1J48j77Lm9K3j11J66k2j57P4Q8m4J6m2j5Jn6M5m5
$$ 199 189 31 125 6 113 146 126 84 76 183 165 230 209 357 180 183 134 157 46 212 190 33 107 195 151 167 125 110 111 55 100 55
4269E5k4J22J01N6j32m0P4ml2l2%K6r1Q9J18j30j1K0j20OK56r0o2Qp2Ro4N7j1P2R3q7qkJ14
$$ 55 31 153 254 310 178 138 212 208 176 144 144 170 79 168 286 156 145 165 45 51 307 217 155 163 91 100 36 93 82 154 247 160 152 150 264
3858B64j0l8m5n0K3PJk0r1K7%J12nN9j71J2J9J43n1j36K9j4R9r3R6j29K02r7Rq2J54Rj74M0
$$ 264 254 216 171 121 144 151 152 132 41 68 68 180 175 234 63 75 94 237 186 50 79 65 164 71 167 38 240 143 152 70 224 233 59 99
3459I9J16K9nj32K07k5j46o3J0J03j7k4J1j27K9J47J54k1j54j44kM4o9P1J7J16p2M4k0M1L6
$$ 99 215 244 239 107 314 289 143 80 90 193 176 152 163 36 65 212 366 345 191 47 45 89 20 91 108 224 152 196 176 217 253
3095B53J0k30oJ87j38%O3rr4L9P5P8p6J8q3J26N3q4J06j84%j7L3jpo8J2N6p1N3J04j06Q8k3
$$ 253 263 33 27 214 76 76 139 130 36 75 150 228 152 170 87 213 266 182 288 104 104 87 120 119 112 44 56 112 41 94 198 92 180 157
2696A57m3j11Q5M1m2k9Q9Q8j65m6N9L4n3M4J79j51K2q0mJ35Pk13K1J01N5j2m6k3kO5m3k8J01
$$ 157 114 3 88 129 87 58 147 235 70 24 83 117 64 108 287 136 158 78 74 209 216 3 24 125 180 168 122 99 97 162 119 91 192
2308A92j67J55JL3k8j18P1p1R4j15P2J5Kr8R6nl3L7j0M7J13j07r3O9p8L4m7J5K4r3L1O4j4
$$ 192 25 180 181 214 186 68 139 68 162 47 119 134 136 38 134 129 96 133 123 170 283 176 83 152 74 108 61 76 100 7 38 102 88
1921H8J0Q2K8k0l0q5O1Q5q1o7K15J7k5j12q6L8L8o4O2p7J7R9R3J11o1k07J09j34k1o0R1O5
$$ 88 98 180 208 188 158 73 134 219 138 71 286 303 278 166 80 118 156 92 154 77 94 193 286 397 336 129 238 104 83 23 114 179
1545A79j23K32l9k13K25o5n3N2l9r4O2J63j60N9J00p6j80K87j30J3j78R1P1ol1j5K8J03k17
$$ 179 56 288 249 36 261 196 143 195 156 62 124 287 127 186 286 210 30 317 187 200 22 113 184 178 147 132 160 263 46
1205D6J30p3KL1J7J15J11k00m7MRj18J67j0m0m9k4l4L7L7o2J42N1j27o7J04Pq1J15K1r7m2
$$ 46 176 103 105 136 153 268 379 179 132 136 145 27 194 184 144 95 71 37 74 111 49 191 242 115 48 152 159 78 193 214 117 75
829G5J2J09rOm9p2J17p4K2r2lJ6N4j2L2j21J31N8p4P0q7p1K8l0M2J47m2p1l3J6j3KR9m4k6
$$ 75 87 196 187 193 144 72 189 115 137 45 42 58 112 100 132 11 142 200 126 196 109 38 66 36 78 225 183 112 79 95 82 84 183 139 113
419A13J95j35l9j05J60J65o5j74J20L3p9j16J16Kj39J76L4j01K0n6k8M3k7l2o5O4J2J71j20
$$ 113 308 173 134 29 189 354 289 115 235 268 189 73 189 191 52 228 262 161 181 125 97 140 113 81 16 80 92 263 143
78A43n0l3j4J15j09J79j48P2m4k4qn5J49L0n9Q2q6j10J05k5jK3m7
$$ 143 93 60 46 161 52 231 83 155 111 87 79 24 173 203 144 226 140 30 135 110 109 132 85
-192H5
##PAGE=	F1=-12057.1
##FIRST=	25164.767445380970457,	5806.2096540000038658,	0
##DATA TABLE=	(F2++(Y..Y)), PROFILE
5806B06o1j00P6m5n0O6p8O4L5pL6j18J01jl8l9J09j02L3R5j31O9O8o0o2k0M4M4m8lRm8K3k0
$$ 206 145 45 121 76 26 92 14 78 113 106 142 24 125 124 86 47 156 54 87 182 51 120 188 128 66 46 90 134 86 83 92 44 67 47
5407D7J76j35ql3J28L0J15Rj95J0o6J47l5o4M3j28J10p4P6K6N3p6j2j34J07r9Q6J84k63J1
$$ 47 223 88 80 47 175 205 320 329 134 144 78 225 190 126 169 41 151 77 153 179 232 156 144 10 117 18 104 288 25 36
5055C6J45j56N9J7j9J30j2L3Mj55M6j7Q9m4p5J3K5M4j5j13P1mJ23k0j68J34q9L8M6l9K2JJ8
$$ 36 181 25 84 101 82 212 200 233 237 82 128 111 200 156 81 94 119 163 148 35 106 102 225 205 37 171 82 120 166 127 149 150 168
4668A68%K6j9j20O1o4L5P2Oo7n4J13JM6%J33j71K6o7J3p5K12o0j72P4P3j01Q3m0o2L1o6k0
$$ 168 168 194 175 55 116 52 87 159 165 98 44 157 158 204 204 337 166 192 125 138 63 275 215 43 117 190 89 172 132 70 101 35 15
4280A5Q1n1J49O1J7j26L2Q8p3k7M0j3l1r6J30J15j51n3O0j24O6K43j47j02L1p7L3p2O0pJ49
$$ 15 96 45 194 255 272 146 178 266 193 166 206 193 162 66 196 311 160 107 167 43 109 352 205 103 134 57 90 18 78 71 220
3916B20O8j09m6J7O0J5rn8l2J5j4M3m7j07O1oJ71o5O3j46K4k8J08n1q1M1q2J23k9R9j76J76
$$ 220 288 179 133 150 210 225 216 158 126 141 127 170 123 16 77 71 242 177 240 94 118 90 198 147 66 107 25 148 119 218 42 218
3541B18r9P8j04J16j9j44N8P7J5j6r6J96r0j30M8J5M1L0l3Oj08J1J61J37k9j90j02M4J0o1
$$ 218 119 197 93 209 190 46 104 181 196 180 84 280 190 60 108 123 164 194 161 167 59 70 231 368 339 149 47 91 101 40
3189D0M1L9Q6k1J6l0P4jO8k49k4J15r5j5N5J8q4L2O8N2J0jr7J19M3r8J07j69L0q5N3N2j2r4
$$ 40 81 120 206 185 201 171 245 244 312 63 39 154 59 44 99 117 33 65 133 185 195 194 97 216 259 161 268 99 129 44 97 149 137 43
2790D3M2P8r2N3R1p8J9k0o5l2M3O0l6MN7P0j88J5J1J1jM2K09j98K8r2JJ06J9j74j2J21M9J3
$$ 43 85 163 71 124 215 137 156 136 71 39 82 142 106 110 167 237 49 64 75 86 85 127 336 138 166 74 75 181 200 26 14 135 184 197
2391A97o9JKJ0j6j8P4j55J58l5N1l1j43J63q9L4r8P5M9j9r9J52l8q2M8j2O6N4j02q6O0j6q
$$ 197 128 129 131 141 125 107 181 26 184 149 200 169 26 189 100 134 36 111 160 141 42 194 156 74 122 110 176 230 128 42 102 86 78
2003G8l0N4M4q4QM8k9K6P6Qj7k1r2L5O8n6n6K15Rn3q5j8k3OMN0n4J5M8R9J01q3j67J64j48
$$ 78 48 102 146 62 70 118 89 115 191 199 182 161 69 104 172 116 60 275 284 231 146 128 105 111 115 165 111 126 174 273 374 291 124 288 140
1592A40r8l1R3P9q2J94l3k11K28m9j10P9j5r6J4J51j53R7O2k2j67K37o8l7j35Q4K0Ol6K1r
$$ 140 42 11 104 183 101 295 262 51 279 230 120 199 184 88 102 253 100 197 259 237 70 307 239 202 67 151 171 177 141 162 153
1229A53J62k62L3K8j5K6PJ68Q6k23n5Jj8p1J63j1o1o6J0j8L8K9n4J08O3o6j14Q8Nl2J24O8
$$ 153 315 53 86 114 99 125 132 300 386 163 108 109 91 20 183 172 111 45 55 37 75 104 50 158 221 155 41 129 134 102 226 294
853B94j25j02J4Q2j0L6p0l1Q4n1J2o4k3j3P1J5j7k7N9Q5j18Q7p7q2j0N0J21J11j69qJ9l1n1
$$ 294 169 67 81 163 153 189 119 88 172 121 133 69 46 33 104 119 102 75 134 219 101 188 111 29 19 69 190 301 132 124 143 112 61
466F1K1Q2l1l8K24j00r5j03K00J59q8k12J70M6j13j11P6O8j51J68N3j24Om2m0P4lj00l7R2
$$ 61 82 164 133 95 319 219 124 21 221 380 292 80 250 296 183 72 148 216 65 233 286 162 168 126 86 160 157 57 20 112
114A12k1J61j12p2k1mJ27j14J89j32N4o4K4j01K6P6R5m5Q6j19o1O6l6MJ3r2
$$ 112 91 252 140 68 47 43 170 56 245 113 167 103 127 26 52 128 223 178 264 145 84 150 114 118 131 39
-192C9
##PAGE=	F1=-12159.3
##FIRST=	25164.767445380970457,	5806.2096540000038658,	0
##DATA TABLE=	(F2++(Y..Y)), PROFILE
5806B20q0q3Q4m4o9N8n4P0rP6K0j52R9L7l2q9J24j05LJ27j37O9L7l8n4pL5O2m3k5J2Qq6M6
$$ 220 140 57 141 97 28 86 32 102 93 169 189 37 136 173 141 52 176 71 74 201 64 133 170 132 78 71 106 168 125 100 112 120 34 80
5407H0J03j00j7k2O5K8J45L8j73J0k4J5J3n7O1j32J24r7O0N8M3k7k3j46Q3n4Q2J56k18k6J29
$$ 80 183 83 66 44 109 137 282 320 147 157 133 148 161 104 165 33 157 60 120 178 221 194 171 25 108 54 136 292 74 48 177
5043A77j64N6J6qJ16j7N2m8n3Pj7O7l4n4l5Q4Q0p2j31J06N3P0n2j76J27m7mR3q7%K9Q4J1o6
$$ 177 13 69 85 77 193 176 228 180 127 134 117 184 150 96 61 145 225 153 22 128 181 251 199 23 150 103 99 192 105 105 134 218 229 163
4644A63mq0J8ok8R3J6n0r2Q2K0L2K0J19j66L2p1J1j5K08p1j54N3M1j45J45j7j30O1jj9N8m5
$$ 163 159 79 97 91 63 156 172 122 30 112 132 164 184 303 137 169 98 109 94 302 231 77 130 171 26 171 154 24 85 84 65 123 78
4257G8J61j1k3q7Q1R7j34qJ12m0o6j02J63J03j69r7J04j08J18K01j92j15M4m3J1k0kK8J99
$$ 78 239 228 205 118 199 296 162 154 266 226 160 58 221 324 155 58 162 54 172 373 181 66 110 67 78 58 56 84 283
3916B83K5j28p2N1oK2J8o1J3km0Q2o4r7O1jK19j22L7r0L2q9O9m3j5K1n6R3L7P5j85J34n4J14
$$ 283 308 180 108 159 153 175 193 132 145 143 103 185 121 24 85 84 303 181 218 128 160 71 140 97 82 103 47 140 177 252 67 201 147 261
3517B61j29O0m5q9L3K6J3j9J9J18j62n5J08K8l8O9k1%q7J7J24J01k2k06o8R7Pl1m3M1O8L4
$$ 261 132 192 147 58 91 117 130 111 130 248 86 31 139 167 129 198 177 177 90 107 231 332 310 104 36 133 140 109 66 107 175 209
3142B09k1j4P6l5J23k27m5Nl4M5k6N2p8J6P8NJ06k9r4P9K8r5J06j37L3q0K7R8k5r8R7J05j38
$$ 209 188 174 250 215 338 111 66 71 37 82 56 108 30 46 124 129 235 206 112 191 219 124 230 93 126 46 73 171 146 48 145 250 112
2754A12K1P7n0k9j9o7M0kO9qjJ5L3j85J04k1l4O4J7K21k25K5l6l1M6M6j24l9J04N9L3q1KJ2
$$ 112 133 210 160 131 112 45 85 83 152 144 143 158 191 6 110 89 55 119 136 357 132 157 121 90 136 182 58 19 123 182 215 134 136 148
2355A48k3jQL3j36J56p0M9k6j18K26r3m4o0L6Q7k4o1J34l7j33N8j8O9np1o2K8N5n4J5O6O6
$$ 148 125 124 132 165 29 185 115 164 138 20 246 153 109 49 85 172 148 87 221 184 51 109 91 160 155 84 22 50 105 51 66 132 198
1968A98q4rM4o0L9O6j9joj09j0M4pm8K14Qr3m9N8k6r2O6N1k2qpR4Q0p7j25K06j42j44NM1Q8
$$ 198 114 105 149 89 128 194 175 174 168 59 49 93 86 38 252 260 167 118 176 150 58 124 175 153 145 138 232 312 235 110 316 174 30 35 76 164
1545A64oJ50m3j55J57l0j18O4J5r4k5J20j13J18J9K5j12J78k1q7r3P1n4J8l0O9o1K21k06j31
$$ 164 158 308 265 110 267 237 119 183 198 104 79 199 86 204 223 248 136 314 293 206 113 184 130 148 118 187 126 347 141 10
1193A0J30k9oPJ82O8k21p1Nj6L4R2j7q3M4pq5K8M7p2P4Q4jj47K7J7K1J50P8j44j11l4N8j8
$$ 10 140 111 105 112 294 362 141 70 75 59 93 185 168 85 129 122 37 65 112 40 114 198 197 50 77 94 115 265 343 199 88 54 112 94
794I4O8q8L5K8j2J5k0m4n3J11Ll9M4j1Q6j52J14p1n8j4P2J92J39k60k3M0p4r7M9P8j2n4K30
$$ 94 162 74 109 137 125 140 120 76 23 134 137 98 142 131 217 65 179 108 50 36 108 300 439 179 156 196 122 25 74 152 140 86 316
407C16o4j30o2J83J28j00k21J94N0j06j13L7J10j43J49P0j44k8l1J0P5%j43lR9o5J29o5p2
$$ 316 252 122 60 243 371 271 50 244 294 188 75 112 222 79 228 298 154 126 95 105 180 180 37 34 133 68 197 132 60
67F0nQJ03r0J73r3K6q8O8j56O9MJ30j9R8j23k1J7m2J5kj17
$$ 60 55 63 166 76 249 156 182 94 162 6 75 79 209 190 288 165 144 161 119 134 132 15
-192A5
##PAGE=	F1=-12261.6
##FIRST=	25164.767445380970457,	5806.2096540000038658,	0
##DATA TABLE=	(F2++(Y..Y)), PROFILE
5806B26j03o3R6k5o3K2m7Q6p5J77k0j60R7P6l0j41J33j22jJ37j20O2mj4m5J2L5N0l1k9lP7
$$ 226 123 60 156 131 68 90 43 129 54 231 211 51 148 224 194 53 186 64 63 200 80 142 138 124 79 91 126 176 145 116 113 190
5431A90j21M8J4o8oj0JJ8J69M8j43K8K2j42P6k2O2j21J20o0k4R4K3J6k1j44L8MP3J28j56l8
$$ 190 69 117 131 63 57 47 48 66 235 283 140 168 190 48 124 102 164 43 163 103 79 173 196 212 191 47 85 89 162 290 134 96
5055I6N8j16J0J2MJ05l5O9r0N8l8k1N3om5q8J39J15j14j17J19O0J9o3j69J19k1m6J40j06r
$$ 96 154 38 48 60 64 169 134 203 113 171 133 112 165 159 114 26 165 280 166 49 168 228 247 184 15 134 113 67 207 101 92
4691I2J5J49J6j61N0p2j6L9p1R6Qnp1LK3K4L6J02j56K2m7K0J8J77n5j14L7oj00J18Mj33K0
$$ 92 107 256 272 111 161 89 73 112 41 137 145 140 69 72 95 119 155 257 101 123 76 96 114 291 236 122 159 153 53 171 175 42 62
4304F2O1j8K9j7J51r1m9l3J11R5j86K9J74q0p1j05J78Q3j80j21J27p9J42J53k11p2J0J5m7
$$ 62 123 105 134 117 268 177 128 95 206 301 115 144 318 238 167 62 240 323 143 22 149 70 212 365 154 82 92 107 60
3963F0K0n3O9K29k3j29q3P4m1oL8n0N8j2o7J15o5o4L2NK41j59j4k3L9j50M6l3L3j3qP3Q4L9
$$ 60 80 27 96 325 302 173 90 164 123 117 155 105 163 151 84 199 134 70 102 107 348 189 175 152 191 41 87 54 87 74 66 139 223 262
3564B62j80R4J3J31j52Mp0j8pj3jj8J37M0k14P6P1N1j11R4lkn7K6O6N2j4j96m2J34L8j5j30
$$ 262 82 176 189 320 168 172 102 84 77 64 63 45 182 222 8 84 155 206 95 189 186 184 127 153 219 271 257 61 19 153 191 176 46
3177D6L4N6Q2n9K1N1o1J69j95m0p9oJ13r7P7o5k6R3m0J81o0o7J0J2m6Q2j07K0ok8J17m8o7
$$ 46 80 136 218 159 180 231 170 339 144 104 25 19 132 35 112 47 21 114 74 255 195 128 138 150 104 186 79 99 93 65 182 134 67
2790F7J55J14j76l6O6l6m6j4m1Q1m6O0K0k1j0j9o5R5k6l6P3j6K01k26J2M6m9l9Q0o9n5N1P1
$$ 67 222 336 160 124 190 154 108 94 53 134 88 148 168 147 137 118 53 148 122 86 159 143 344 118 130 176 127 88 168 99 44 95 166
2402A66N0p9k0L6l0nK5kj04J50q3K2k2l8K26j04q9j5m7J29lm8R2kj69N7k4N5m8j6j8j2Q9q0
$$ 166 216 137 117 153 123 118 143 141 37 187 104 126 104 66 292 188 99 84 37 166 163 115 207 205 36 93 69 124 76 60 42 30 119 39
2003C9N6O5P7q8j0M9r9L8M8l3K8J4j40k3K1M2o6K12Rj33j2J28ok14J15O5J4m8n7Q7N6n1q1
$$ 39 95 160 237 149 139 188 89 127 175 142 170 184 44 21 42 84 18 230 239 106 94 222 216 2 117 182 196 148 91 178 234 183 102
1616A02K08j11j22j0k6Q7O5J28o6q7O4k0r4L0M7r7NM5n9J12k4O1n8J45Pj31o4O7j32K7j6J21
$$ 102 310 199 77 67 41 128 193 321 255 168 232 212 118 148 195 98 103 148 89 201 177 238 180 325 332 201 137 204 72 99 83 204
1240B04j20K68j42j24Q2l2n6J8J51N9j93p9J0O7O3L3l5j06J39k2j46J7P7j04N5R2O1j43p8
$$ 204 84 352 210 86 168 136 80 98 249 308 115 36 46 113 176 209 174 68 207 185 39 56 133 29 84 176 237 94 16
900A6L2O2J82O2j55p5q1OkP6j05J12k6L2K3j0m7l6J05pl2O5p8P8j62J37o8k2j4O2K11J64k77
$$ 16 48 110 292 354 199 124 43 49 47 123 18 130 104 136 159 149 102 66 171 164 132 197 119 197 35 172 104 82 68 130 341 505 228
513B28k2K2j12q7M2Q4Lo6K05l4j38k4J54P7j02j96J78N4o6j15PJ10j24J32Q4j48p1k1R9L9
$$ 228 206 228 116 29 71 155 158 92 297 263 125 101 255 332 230 34 212 266 200 85 92 202 78 210 294 146 75 54 153 192
160A92j0j63K6J03j07P1Kl9RJ0P3n9J32l5lj21J03j67P3m0J17QJ11j15J5k6l7L5k1r2
$$ 192 182 19 45 148 41 112 114 75 84 94 167 108 240 205 202 81 184 17 90 50 167 175 286 171 186 160 123 158 137 45
-192D5
##PAGE=	F1=-12363.9
##FIRST=	25164.767445380970457,	5806.2096540000038658,	0
##DATA TABLE=	(F2++(Y..Y)), PROFILE
5806B23j24l8J02po7J3n0J04j50K69p2j46R8J04k5j83J22j44K9J28r5N4n1Rk4K2L8J7j1k1
$$ 223 99 61 163 156 89 102 52 156 6 275 203 57 155 259 234 51 173 29 58 186 91 145 94 103 79 101 139 156 145 124
5454A24k8J45j19J7o0m1J9rk7j2J83L4j09O6N3j67K2M0L4j03J08j6j22J40nM1j6j35JM9O8
$$ 124 96 241 122 139 79 38 57 48 21 9 192 226 117 183 236 69 91 131 165 62 170 154 32 172 167 208 192 57 58 107 175
5090A75J03r8l3k8o2j5jOJ19p7P6r2J31p7k8M7J2l3j07J45J49j35r9J28L5k3n2j51J12j4q3
$$ 175 278 180 147 119 57 42 41 47 166 89 165 73 204 127 99 146 158 125 18 163 312 177 78 206 241 218 166 15 127 113 30
4726C0J78r6K5p2K05K0k30J21j03l2O2q6Q0NM3l9l0k5K6M0Q5j41J2L5J0qJ35j7p0L6n1n2Q3
$$ 30 208 112 137 65 270 290 60 181 78 46 108 22 102 107 150 111 81 56 82 122 207 66 78 113 123 115 250 233 163 199 148 96 179
4339A79Lj00n4J16k9J4K3J22j53n2PJ27P9k21Q3K09j23n2j02J74N6j82p5Q4m8J32J12j89k3
$$ 179 182 82 28 144 115 129 152 274 121 69 76 203 282 61 144 353 230 178 76 250 306 124 49 133 85 217 329 140 117
3999A17k8N3r4M4p0O7K46o2j06p4O7k7o5N1l2Q3nr2J34n7k9J2LK29j73o9L7M6j66N9m7L0k7
$$ 117 89 142 48 92 22 89 335 273 167 93 160 133 68 119 87 170 165 73 207 150 121 133 136 365 192 123 160 206 40 99 52 82 55
3611E5J2P3J12mj66N7P6J43j63m9r3O4l4Kp7RJ91j2j39O4L0Q3j59R3QMj4K8ROk3j60j7J36
$$ 55 67 140 252 248 82 139 215 358 195 146 53 117 83 85 8 17 208 196 57 121 151 234 75 168 176 180 166 194 203 209 186 26 9 145
3212A45Q6qj74J8L6J04q6O0Qo8J99j63ol1r1J34j02O9m8o7Q0m3J95q8j4p6KO1J4q8K1P1o3
$$ 145 231 223 49 67 103 207 121 181 189 121 320 157 151 120 29 163 61 130 82 15 95 52 247 159 145 69 71 132 146 58 79 150 87
2825H7R6q4%K03R9j93j05O2m4k6Ll5J13q1K7M6m6J8o5M3N3j2j7N1m1J51k05oJ28m3j22J04
$$ 87 183 99 99 302 401 208 103 165 121 95 98 63 176 95 122 168 122 140 75 118 171 159 142 193 152 303 98 92 220 177 55 159
2449A59j3p7j1P2P3o3m4O7k7k9K1j9n3J34p4Rl3J7K08j22q6J6q5J00M4o3L3N9j60K4l0M6n1
$$ 159 146 69 58 130 203 140 96 163 136 107 128 109 56 190 116 125 92 109 317 195 109 125 40 140 184 121 154 213 53 77 47 93 42
2062D2J5Oj0O9p4O8O1Q0r2LO1j47K5K6k8O1M0j65M8J9Lq8J97jj25oJ75Pk10M0Q2N0r3p9P5
$$ 42 57 63 53 122 48 116 177 257 165 168 229 82 107 133 105 166 206 41 89 108 111 23 220 219 94 88 263 270 60 100 182 232 139 60 135
1651A35M1k9k7J45o2p4l2n0N9R1J27r3k6k2j9o5MP6j04R7m4l0Q7o6Q7j5J28K2j63m5Q1j50
$$ 135 176 147 120 265 203 129 97 47 106 197 324 231 205 183 164 99 103 179 75 172 128 98 185 119 206 191 319 341 178 133 214 64
1276F4pj0J64j78K93p4j09M2k4j16L4R5N8j34m7j5J51O5qn8j28K04k8j93K2R0j06M5O4J12
$$ 64 57 47 211 33 326 252 143 185 161 45 79 174 232 98 51 36 187 252 244 186 58 262 234 41 63 153 47 92 156 268
923B68j06o2m1L3K04L6j64mp1n8O1j3m3J10n0N5L0l8k4j1R0Jl2O4j45P2j39J46o4Kk7L8J39
$$ 268 162 100 59 92 296 332 168 164 93 35 96 83 40 150 100 155 185 147 123 112 202 203 171 235 90 162 23 169 105 107 80 118 257
536B57J36j94P2l2j42j4J4P2No3J53j9j15JJ24J7r9j34J18O1qj09j4O7r7J23R6j32j14M3J46
$$ 257 393 199 271 239 97 83 97 169 174 111 264 245 130 131 255 272 173 39 157 218 210 101 87 154 57 180 276 144 30 73 219
172B19j8l6j32J5J14j16K1K1LK8NO4m1O8K8k4j54J28j60O4m1O4J7J13j05N2m7k8N9l7p5
$$ 219 201 165 33 48 162 46 67 88 91 119 124 188 147 215 243 219 65 193 33 97 56 120 137 250 145 197 150 122 181 144 69
-192F9
##PAGE=	F1=-12466.1
##FIRST=	25164.767445380970457,	5806.2096540000038658,	0
##DATA TABLE=	(F2++(Y..Y)), PROFILE
5806B09j39lR5jp2K5l6J07j35K46j28j16J02J12j3k07R2j05K6J09p5M9r2K7LJ9L7k0K8j9o2
$$ 209 70 67 162 161 89 114 78 185 50 296 168 52 154 266 253 46 138 33 59 168 93 142 50 77 80 99 136 116 144 125 63
5442F3K07j03l1p7k3L4k6PLJ02Op2J08O2j07p8R3kq1R0J8j64J45k9L7j3j13kN3O7Q0m5j9j11
$$ 63 270 167 136 59 36 70 44 51 54 156 162 90 198 260 153 75 168 166 85 175 193 29 174 145 182 169 56 54 107 174 254 209 190 79
5043G9j3%j2k7J69j19M7l3J30j01l4L8Qj3r3J09J80j36p9J35on2l0j31J04j1r2J78o5O6j82
$$ 79 66 66 54 27 196 77 124 91 221 120 86 124 132 119 26 135 315 179 100 235 229 177 147 16 120 109 17 195 130 196 14
4679A4K38K8k12J27j49k5O0n0L4N1M1j9k5q5L2K7P1j15M0J01k3o7R6L1l6M9q1l5P7k5o5q9
$$ 14 252 280 68 195 46 21 81 31 65 116 157 138 113 28 60 87 158 43 83 184 161 94 190 221 185 234 153 118 195 170 105 16
4304A6J39m6NO0Q4j76j9J1J21N0k17J29K12j62k5q9J54K9j73k5M0k2Q7R1j31rk4N0q8M5n3
$$ 16 155 109 114 174 258 82 63 74 195 245 28 157 369 207 182 93 247 276 103 78 118 96 183 274 143 134 110 160 72 117 64
3940F4mK56q5o9n1M0Rj19N2j3Q5J7j13J36m5PRj1J83j64j12Q2M9j18P6q6MNl3Q9J23m8j49
$$ 64 60 316 231 162 111 151 160 41 93 80 165 182 69 205 160 167 176 165 348 184 72 154 203 85 161 75 79 84 51 140 263 215 66
3553F6L0J19J47j57r3q8J29n3J3q6J8J58m6q4O7rJ17j67N6OJ9L5K2k6k5o2o4l1J01J30qj44
$$ 66 96 215 362 205 112 24 153 100 113 27 45 203 157 73 140 131 248 81 137 143 162 197 219 193 168 106 42 11 112 242 234 90
3177I0jnJ00j03Q6l5l8J93j35M8Lj49J14q1O7k7j01M1J4J33j09N6j15J8J15n9q8Q2R2q1N2
$$ 90 89 84 184 81 167 132 94 287 152 200 203 54 168 87 154 127 26 67 81 214 105 161 46 64 179 120 32 114 206 125 177
2813A77j30Q8K31O3j82j68O6o3J4K2o2J45r8k6P0n7Q2m9N2KJ3kK4n8Q7j68j2J87k4j74J01
$$ 177 47 135 366 429 247 79 145 82 96 118 56 201 103 77 147 90 172 123 175 177 190 188 212 154 241 73 61 248 224 50 151
2449A51L6j02n5M6J04l9k6P3l3o1jj5RJ06o9L4m5L3J71j42m9L1m7mR3r0l6J29j16k1l7Q3j7
$$ 151 187 85 30 76 180 141 115 188 155 94 93 78 87 193 124 158 113 146 317 175 126 157 110 106 199 109 73 202 86 65 28 111 94
2062I4j7kj6N1n1O8N1P6q4K2P1j98RkqR1P0j64Q2K3l5j01J94l6n2m2J98Jj83k1Q2Q0j23n0
$$ 94 77 75 59 110 59 127 178 254 170 192 263 65 74 72 64 155 225 61 143 166 131 30 224 188 136 94 292 293 110 89 171 251 128 78
1663G8M1M5l2K8L3j6on1l2L8M8J33j13J7q3k0l2mQ4q0J68j09l9O3j08J03J6J16L3j88k7J17
$$ 78 119 164 132 160 193 177 171 120 88 126 174 307 194 211 128 108 76 72 156 76 244 135 96 159 51 154 170 286 319 131 104 221
1287B21q6p2m0J84j90K55or5NLj61L2L6O0m2k1l2K01N2l3p6j39K39k4k24K8Q2p6M4J1J49m2
$$ 221 135 63 23 207 17 272 266 171 176 179 18 50 86 146 104 83 51 252 304 271 195 56 295 271 47 75 157 81 125 136 285 243
912B43m4q6m5K08J2j69P9m8o0O9j05L5P8n1O0L3r3L1MP9J5n4O5k01O5q8J35n8Rm7Pl6N5J20
$$ 243 199 113 68 276 288 119 198 150 90 159 54 89 167 116 176 209 116 147 151 230 245 191 256 55 120 32 167 109 118 71 78 42 97 217
513B17J23j04j51M7J4L2Mm7Q3k1o6RJ00l5r5n9M2P0M6q6m1%n2J09J07r9j46J33J56p8p7n7
$$ 217 340 236 85 132 146 178 182 135 218 197 131 140 240 205 110 51 93 163 209 123 82 82 30 139 246 147 1 134 290 212 135 78
137G8l8J37j11P5q4L5N6kP5l4j4Q5l8j63J35j33L3k7L0j1J00r7Q9m3j8Q2m8o7
$$ 78 40 177 66 141 57 92 148 146 221 187 173 258 220 57 192 59 92 65 95 84 184 87 176 133 115 197 149 82
-192H2
##PAGE=	F1=-12568.4
##FIRST=	25164.767445380970457,	5806.2096540000038658,	0
##DATA TABLE=	(F2++(Y..Y)), PROFILE
5806A86j46L5P8qo6M6JR1j22K03j77q0J03J02Kk01M9Rm2R4p1M9r9K5K2J0K1m8R5l4q9K41p7
$$ 186 40 75 153 145 79 125 126 217 95 298 121 41 144 246 248 47 96 105 63 157 86 135 36 61 83 93 114 66 161 127 38 279 202
5419B02r5j8k3K5n3L5J8L1j0l7J24N8n4j18J12l8n6P0M1j36R3m1J5rq1K6J2O6N5Rjj81K3L1
$$ 202 107 89 66 91 38 73 91 122 112 75 199 257 203 85 197 159 103 173 214 78 171 130 145 136 55 81 93 159 214 223 222 41 64 95
5020I5np9K28j31k1L3J02j07l4K2j8Qn8N0K09j29m9J35m7o9nj11Q0Pn7J24k2R1k00J62L6j29
$$ 95 90 11 239 108 87 120 222 115 81 103 85 93 35 85 294 165 116 251 204 135 130 19 99 106 49 173 151 242 42 204 240 111
4644A11P6j65kK1J7KJ19j8j5j7j10M3lO0q1Q7J26o8j30P6O9j6O8r9k9Q6o9k9m1J01o1j4Q7
$$ 111 187 22 20 41 58 60 179 161 146 129 19 62 59 119 38 125 251 183 53 129 198 182 250 151 122 208 139 110 69 170 109 95 182
4257A82M9j66J1K4Q2J2j36J22J82j83po6J24J1j53NJ2JJ3Q7n5k6K3J3m5N0n9o5K35r1l0k6
$$ 182 231 65 76 100 182 194 58 180 362 179 172 106 230 241 88 93 105 106 119 206 151 125 148 161 116 166 107 42 277 186 156 130
3881A30J4L8j42L5MP1M7j29J26l6M5J8l1J08j33j36J09M7n5Q9j29rL9r8J13J22q5j36K7J32
$$ 130 144 182 40 75 79 150 197 68 194 158 203 221 190 298 165 29 138 185 130 219 90 81 120 22 135 257 172 36 63 195
3529A95J34j37j20JJ08p2mo2J6J08o4m8Q9l7J35j43joM2P5J4l7l6j12M7p1N4J49j5o2k8l8
$$ 195 329 192 72 73 181 109 105 43 59 167 103 55 144 107 242 99 98 92 134 209 223 186 150 38 85 14 68 217 202 140 112 74
3154G4Q7j14R2o9M0J39j15J10J7j81P2n5Q2mj51L0O6M9j21J20n7J5Q6r5j02J57Q0q7Kj36J38
$$ 74 161 47 139 70 110 249 134 244 261 80 152 97 179 175 24 54 120 169 48 168 111 126 212 117 15 172 252 165 167 31 169
2790A69K35J5j48k07P1m4J9K4r2J58r0n3O5l0J14l2M1m9M5Opo7K6j24L5J74Kk01Q4P5j28n1
$$ 169 404 419 271 64 135 91 110 134 42 200 110 57 122 92 206 174 215 166 211 217 210 143 169 45 80 254 256 55 139 214 86 35
2414C5QJ05nK3N5n5q2rmN0P3p5P2m3K6J22j62LL4%r3J23j15o2J44n5n2l3J37k0k4m5l9N0k1
$$ 35 43 148 143 166 221 166 84 75 71 121 194 119 191 148 174 296 134 137 171 171 78 201 86 24 168 113 61 28 165 145 121 76 37 87 66
2003F6O4K9P4o0L9P2k37km0J1J14R9j47Q8J9n9j01K08r4M4r3K02j4j40n1N6R6j22o%N5l4O8
$$ 66 130 159 233 173 212 284 47 45 5 16 130 229 82 170 189 130 29 237 143 187 94 296 282 142 91 147 243 121 115 115 170 136 204
1616B04o0j5O7o7qL9k5J35j19L4j08LJ0j2N7j5J75j56o2N6p7L5L5J03M3k01j1J75l1j15p2
$$ 204 144 129 196 129 121 160 135 270 151 185 77 80 90 78 135 120 295 139 77 133 56 91 126 229 272 71 60 235 204 89 17
1252A7J74j33J43N2q3l3N5j12m8K0J8N8k6k7K21K6m3q2j35K47j2k29RO6l1M5l5J63L8m0j31
$$ 17 191 58 201 253 170 137 192 80 32 52 70 128 102 75 296 322 279 197 62 309 297 68 77 143 112 157 122 285 323 283 152
888A52j07J93mj30J13l2n4O8j58Q0N7n5O7L3j45R7OP6K0r0P3j87J0j7R6m7ln9L5J60Q9P8j9
$$ 152 45 238 234 104 217 185 131 199 41 121 178 123 190 223 78 175 181 257 277 187 260 73 83 66 162 115 112 53 88 248 337 415 396
501C96j63j35O9K8k3Lk0Ql0pKQ5n9q6qPM6Q0m4p7o6N5L4J14n7j33J73J55j27j21L2j07J72
$$ 396 233 98 167 195 172 175 155 163 133 126 128 213 154 68 60 67 113 193 149 72 6 61 95 209 152 19 192 347 220 99 131 24 196
114A96j23J36j66L3R1j0R0k7j02J28m5j17J04j05oj8L7o5P9q1R9j5rR6n9n3
$$ 196 73 209 43 76 167 157 247 220 118 246 201 84 188 83 77 59 96 31 110 29 128 113 104 200 141 88
-192H8
##PAGE=	F1=-12670.6
##FIRST=	25164.767445380970457,	5806.2096540000038658,	0
##DATA TABLE=	(F2++(Y..Y)), PROFILE
5806A57j41O4N7k0m4P0M3O2j22J66j91o1R1P5J3j53K1Q8j09R2q5N4p0PK1Nj3n0J63m6q0K16
$$ 157 16 80 137 117 73 143 186 248 126 292 101 40 131 206 219 66 87 175 66 158 73 127 57 64 85 90 77 27 190 144 64 280
5431B80n5j56N6k9J8p8M6K7k6K8k2Q9M9j6r7R8p0l1N4N4r8M1m1rNm7M4l8N4L0O6J3k35N1N7
$$ 280 225 69 125 96 114 36 82 109 83 111 89 178 227 211 114 212 142 111 165 219 121 162 121 112 117 70 114 76 130 160 226 239 4 55 112
5020A12J4r8K48j32q5P0Q3r5k8%n8K1K6l9K13j20kJ25p7q4K2q2L9L4l1P4K2R5j77M2M5l9K0
$$ 112 126 28 276 144 59 129 212 117 89 89 31 52 78 39 252 132 130 255 178 94 116 34 73 107 76 150 172 267 90 132 177 138 158
4632A58q8l0k7P3J1J46q5k2j3r7N8j4K8m8J14J33j17j44N5P4qQ6j10rQ5j13J0K0P2o9m9J00
$$ 158 70 40 13 86 97 243 158 136 123 26 84 70 98 50 164 297 180 36 91 165 157 243 133 124 209 96 106 126 198 129 80 180
4257A80K5j59L2O6K3l0m6J15J29j78pl7Q6J4j32J6pK3p0R4J1n8R5l4NO7q0n7J51r0JmMM8j35
$$ 180 205 46 78 144 167 137 91 206 335 157 150 113 199 213 81 97 90 113 43 137 148 90 185 151 156 223 143 86 237 147 148 144 148 196 61
3846F1MK0M3P4j34J07l1P9L7n2J9q1j30R9M2LR5j60j6N9j09R2J17j10j23N4J03R6j06j07Q3
$$ 61 65 85 128 202 68 175 144 223 260 208 227 146 16 115 157 160 255 95 79 138 29 121 238 128 5 59 162 258 152 45 128
3482A28O5q5m7rJ1M5o4k5J17m6J23j07m3k6O8R4Ok5m4n7N4j02J8J16l3N0o7m8Q4j28P6p1J13
$$ 128 193 108 61 52 63 108 44 19 136 90 213 106 63 37 105 199 205 180 136 79 133 31 49 165 132 182 115 67 151 23 99 28 141
3095A41P0r4J60J2j84J9l7J14J8j97N6P2j9r7J22J2KM8p7j14J88O0p7m5o0J06K09l3r5k11
$$ 141 211 117 277 289 105 124 87 201 219 22 78 150 131 34 156 168 170 218 141 27 215 275 198 153 93 199 408 375 280 69
2743F9O5KpMp7J14n8nNJ5R4k6L7r4Q4Rm0p5k0p9J13J07K8k07N9J06j51k6N6J4K9O9L3r1o7
$$ 69 134 136 129 133 56 170 112 107 112 127 221 195 232 138 222 231 191 116 96 17 130 237 265 58 117 223 72 46 102 116 145 214 247 156 89
2332H9K3j8N8M3r3J03k4J0O7j74M8L4M4j40J13j15L8PJ4o3k4J75l4oj09n3N5QN8lP1j9M5N9
$$ 89 112 94 152 195 102 205 181 191 258 84 132 166 210 70 183 68 106 113 127 64 40 215 181 175 66 13 68 76 134 131 202 183 228 287
1933B87k33%Mj2M0J24j25P8J9o1o5J96j64J39j37J71k2q3n2J2Q5q3K9m0N2qQ7o7p5J03p8J5
$$ 287 54 54 58 46 86 210 85 163 182 121 56 252 88 227 90 261 239 156 104 116 201 118 147 107 159 151 238 171 96 199 121 136
1557A36M1q0J20j06K3r6N6L2l3K2M9J43j84q0Q2Rq3L4Q3N0j68k1K25mj48r6J57p8L8R6p1p2
$$ 136 177 97 217 111 134 38 94 126 93 115 164 307 123 43 125 134 51 85 168 218 50 29 254 250 102 6 163 85 123 219 148 76
1182G6J35m9r0L9o7J06m6qK19j1l7p6j22K40Mk08m1N3J7M2n6J49J19n3j77j27J62qk9O0k9
$$ 76 211 162 72 111 44 150 104 96 315 304 267 191 69 309 313 105 64 117 134 176 120 269 388 335 158 31 193 185 156 216 187
818A87m0O2j67R0M9p5Q3L1j49J31kP7J0j24Q8j19p2N1L7k1l7m3J04L15J60o2j49j74j20O1
$$ 187 147 209 42 132 181 106 189 220 71 202 200 277 287 163 251 132 60 111 148 127 90 47 151 466 626 564 415 241 121 182
466A82L8o2nLm7l5M1mP5n1m4l1M2k5Q6J4j01J9J6n5J17k5j08J98J38j64j42J05j47J88j51
$$ 182 220 158 153 156 109 74 115 111 186 135 91 60 102 77 163 177 76 95 111 56 173 148 40 238 376 212 70 175 28 216 65
102F5J70j82OJ18k0R9j5j77J47m7k7M8r0l2j8M6o6O9Mk9K5pJ00o8k5
$$ 65 235 53 59 177 157 256 241 64 211 164 137 185 95 63 45 91 25 94 98 69 94 87 187 119 94
-192I4
##PAGE=	F1=-12772.9
##FIRST=	25164.767445380970457,	5806.2096540000038658,	0
##DATA TABLE=	(F2++(Y..Y)), PROFILE
5806A28j19O5M2k7j2J06O3K6j33J48j51q4P0L4K2q0K4J02j59J03j05O0n3lK7No5kJ81l8o6
$$ 128 9 74 116 89 77 183 246 272 139 287 136 52 122 156 178 98 122 224 65 168 63 123 70 67 94 99 34 32 213 175 109
5442A09J72m7j75R4l6Rq7M0L2n9J08l5J3M0Ql4O4j02pM4O3o5Om1j8L7l7M2o7J9OJ25J8k09
$$ 109 281 234 59 153 117 126 39 79 111 52 160 125 138 178 186 152 216 114 107 151 214 149 155 114 96 133 96 138 71 90 96 221 239 30
5043C0RP9L3r6K40j28j29Q1Q0o8k5k2o2J9J05p4J27j14O4R5q1j08M9l9J5L1j9M3N3Q1j48o7
$$ 30 39 118 151 55 295 167 38 119 199 131 106 84 22 41 146 72 199 85 149 244 163 55 104 65 80 111 92 135 188 269 121 54
4668E4M7M2rro8k0P3K4J46j37k3j0o8Q2rj3k6J13J25j57o1kL1JR4j07K6N7j45N5P3N5p7p9
$$ 54 101 143 134 125 57 37 110 134 280 143 120 110 42 124 115 102 76 189 314 157 96 94 125 126 220 113 139 196 51 106 179 234 157 78
4269G8J01J1j67O9R7l8o8L1J13O1j37k2j5M5M8j29J8k8M3p2L2N5q7J66o3L9R0j05k8P2q9J7
$$ 78 179 190 23 92 189 151 83 114 227 288 151 129 114 159 207 78 96 68 111 39 71 126 39 205 142 181 271 166 138 210 121 138
3893A38J5J0M1j13pK4qR5j29Q9l1J04N9o8o4j6r3M1M2L8R7j71l2P5o3K8J14j24m7K9N6L2p1
$$ 138 153 163 204 91 84 108 100 195 66 155 124 228 287 219 155 139 46 87 129 167 264 93 61 136 73 101 215 91 44 73 129 161 90
3506I0k3J09J3p3o9J1J3l5j4J4P7k6P0o5m3j5M8Q2J0kn3K9L2j20QL3n0J60j14l0Q7j37M2p
$$ 90 67 176 189 116 47 58 71 36 22 36 113 87 157 92 49 34 82 164 174 172 119 148 180 60 68 101 51 211 97 67 154 17 59 52
3107E2J06J5o2J82nj63l2l3J59L5k03N2O1m5m9N2P7j6J2j5j36J85L8m8q3J8P0J61p3l1j89
$$ 52 158 173 111 293 288 125 93 60 219 254 51 103 164 119 70 122 199 183 195 180 44 229 267 219 136 154 224 385 312 281 92
2743I2M0L7k7k3k5J9j1O0m1L9N5l0M0j24J29Op1q0n5j0J62J7N0j85K2J30j65rJ25p4N2R5J3
$$ 92 132 169 142 119 94 113 102 162 121 160 215 185 225 101 230 236 165 85 30 20 182 199 249 64 86 216 51 42 167 93 145 240 253
2355B53j28j6M7l5N2K5j12J12Qj1J6j72P0L7P4j48P6q4J07j21P7n7k2J93m1K2j72K5%J9N0
$$ 253 125 109 156 121 173 198 86 198 206 195 211 39 109 146 220 72 148 64 171 50 127 70 48 241 200 222 50 75 75 94 144
1992A44k5N9K5L5L5j87qK6J3q7J37j04O1L4k5j9J48k20K05j42P0pj1l2l6M3j1N1q2L4M2Q1
$$ 144 119 178 203 238 273 86 78 104 117 30 167 63 124 158 133 114 262 42 247 105 175 168 157 125 89 132 121 172 90 124 166 247
1616B47m3q9O3q1L6L3r6R1p7j5n1R6L1o0QQ6R0j71p4J13O5j14kM6M5q5m6K22nj48q2R5k1o0
$$ 247 204 115 178 97 133 166 70 161 84 69 18 114 145 85 93 179 269 98 24 137 202 88 86 132 177 92 46 268 263 115 33 128 107 47
1217D7J26n8r5K25kj22L4r1R6o6J3J98m8j4o2j12K28K1j71j07N3N2L2m9J14J83q3k17r7J25
$$ 47 173 115 20 245 243 121 155 64 160 94 107 305 257 243 181 69 297 318 147 40 93 145 177 128 242 425 342 125 28 153
865A53kO8k2m4j1N4j43O9N1j07J06K4j03J30j9P6j2j38J02m7j36R3k1L6r8j2J30K66Q4q0o6
$$ 153 151 219 197 153 142 196 53 122 173 66 172 196 93 223 204 280 268 130 232 185 49 142 121 157 59 47 177 443 527 447 381
501C81j17j41N7K5n4l4J3m2m0N5J0O3l8Or1Q7q6P6P2q7O2k8j14J07j3p0K08J06j88j05J14
$$ 381 264 123 180 205 151 117 130 88 48 103 113 176 138 144 53 140 54 130 202 115 177 149 35 142 129 59 267 373 185 80 194
137A94j34J67j71J59j58J0J15l4R7Lj78R7m7P8j4r2k3k0J4kQ4K7j43M9j5R6p2K0
$$ 194 60 227 56 215 57 67 182 148 245 248 70 167 120 198 184 92 69 49 63 61 145 172 29 78 63 159 87 107
-192A07
##PAGE=	F1=-12875.2
##FIRST=	25164.767445380970457,	5806.2096540000038658,	0
##DATA TABLE=	(F2++(Y..Y)), PROFILE
5806A05q4L5M0k7K3J54N1j0j51J46r4j26N5lK3mK2Q9j87J19j09O0n4j7O0Jj13M2J70j1n5J31
$$ 105 21 56 96 69 92 246 297 287 136 282 188 62 117 114 137 133 155 244 57 176 67 127 73 56 116 117 4 46 216 205 150 281
5431B81n6j39Q3m3pp2J7L4k0J45n9o8K6K4M3K4j32J3L7P5m7lm8j4P5m9K4o5k8j4J71J4j60
$$ 281 225 86 169 126 119 47 64 98 78 223 164 96 122 146 189 213 81 94 131 206 159 156 108 94 169 120 144 79 51 37 208 222 62
5043F2m1J06L1p5K06j21j36O6R1l1l8m3l6N5J24r1J0j10J45M7n9j21N8MK3j0j9L9N4O2j23
$$ 62 21 127 158 83 289 168 32 98 189 158 120 77 41 96 220 129 139 29 174 221 162 41 99 103 126 116 97 136 190 252 129
4679A29q8j0R7J9K1j02j6P7K5J31j69Njn0J05j4l5j1Q7J05j75K8m2k9K6P9p6M3J0j47R8J00
$$ 129 41 31 128 147 168 66 50 127 152 283 114 119 118 68 173 159 124 113 200 305 130 158 116 87 113 192 116 159 169 22 120 220
4304B20M7q8r5J06%j22O8Q5q6r3R1J07j5p3k9j0MJ07j50J9n0N0pp4P6o1J72n7M8J08j24nK5
$$ 220 267 179 84 190 190 68 136 221 135 42 133 240 225 152 123 113 117 224 74 93 43 93 86 12 88 27 199 142 190 298 174 169 194
3916A94q4J6L6K2K2q8QK2q1J06j12P6l1J16P8p8j20M3o4k2M7M3R5j55n1Q5ok6J04j31J6NK4
$$ 194 110 126 162 184 206 118 126 148 67 173 61 137 106 222 300 222 102 145 81 59 106 149 244 89 38 123 117 91 195 64 80 85 109
3529A09n3l9Q8J04l3k4m2m6K4m6J4L1j4J7j2k5JK1%L3L0L0n1Q9J7j31ol4J8J55j61RQ4j33
$$ 109 56 17 105 209 176 152 110 64 88 42 56 87 73 90 78 53 54 75 75 108 138 168 117 206 223 92 86 52 70 225 64 73 157 24
3130B4J9L5P6k0j2J71k4j32o9m2K02M1j78J5M8k4k9l4J32l1j3O8j65J54J6nj11R0M4J01r7
$$ 24 43 78 154 134 122 293 269 137 68 26 228 269 91 106 154 130 101 67 199 168 155 223 58 212 228 223 112 202 246 347 250
2766B50L8j68PM4l2k8J4q4M1J09n7M6J5l7M1j28J68lr3p8m1K7J72o9N8j28l9J57j63jJ71j24
$$ 250 288 120 127 171 139 111 125 41 82 191 134 180 195 158 199 71 239 236 143 65 24 51 223 154 212 84 45 202 39 38 209 85
2391H5N2J05mj62N0M7l9M8K8j19Q6M3l3k2j38M8M4Q3j35L5k7J34j48N9m8k4J88l3M5k16J08
$$ 85 137 242 238 76 126 173 134 182 210 91 177 220 187 165 27 75 119 202 67 102 75 209 61 120 72 48 236 203 248 32 140
2027A40m0J0M2j3L3N6J3Mj22l4L4O2j39O2r2M5P4L6J0Q0k18J96p8n3k3O9kp4k3Q1N2j14OR6
$$ 140 100 110 152 139 172 228 241 245 123 89 123 185 46 108 16 61 135 171 181 261 43 239 161 108 85 154 152 78 55 136 188 74 80 176
1628A76M0l5m3%q0O1J2q0O0l8o3J0R8J7q2J3R4K6r2k0Q2Q6j05j9J4K8l6o1K06k6r7o3J9M0
$$ 176 216 181 138 138 58 119 131 51 111 73 10 20 118 135 53 66 160 186 94 74 156 242 137 118 132 160 124 63 269 243 146 83 102 142
1229A42j00Q0m2j7K24J9j51Or4R1o7J3J62o5J7n0j07K14L7j26j51N0O5J0k2Q1K08j23k43j6
$$ 142 42 122 80 63 287 306 155 161 67 158 91 104 266 201 218 168 61 275 312 186 35 85 150 160 138 219 427 304 61 45
876D5P7J0J26r4p0L8L9j07L3O1j40J21J4n3J32m5P3m1j28J19Oj89J12n8J35j46LQ6n9K08j66
$$ 45 122 132 258 164 94 132 171 64 97 158 18 139 153 100 232 187 260 219 91 210 216 27 139 81 216 70 73 159 100 308 142
513A42J89j1k35P9k4J2q3QN0q4O0L5N2n6N7j48J21j21O1J12m1O9p9j32Q7k2k9K04O9j98k2
$$ 142 331 320 85 164 140 152 69 77 127 43 103 138 190 134 191 43 164 43 104 216 175 244 165 33 120 98 69 273 342 144 122
149A22N5q1J26j69J06j22N1R7n2Q5K3j08km7J69p3j06J5k5l7O6Q8L7j72K7l8Q5n4O0
$$ 122 177 96 222 53 159 37 88 185 133 218 241 133 131 84 253 180 74 89 64 27 93 181 218 46 73 35 120 66 126
-192A26
##PAGE=	F1=-12977.4
##FIRST=	25164.767445380970457,	5806.2096540000038658,	0
##DATA TABLE=	(F2++(Y..Y)), PROFILE
5806I6n2j2N7k3N7J98J3m4j64J49n1j63N4k3K2M6MO7j93J36q5N2n5n8J17rj08K7J44K0m2R6
$$ 96 44 32 89 66 123 321 334 290 126 275 224 61 115 92 114 160 164 231 38 174 89 141 86 28 145 136 28 55 199 219 177 273
5431B73p7q1O3n4l1l1k6M3N3J45q6j16JL6J04j1j48K3K3J01n3J4o3j1J11o9om2l1J1J20%r4
$$ 273 196 115 178 124 93 62 36 79 132 277 191 75 76 112 216 205 57 80 103 204 151 165 102 91 202 133 127 85 54 65 185 185 91
5043I1o3J33j5l6J49j12r5K5J03J0o9o2k7J24J28j05j01n2J78j3j6q4J1L9K6m9k7N8K4M9j10
$$ 91 28 161 146 110 259 147 52 77 180 190 121 59 32 156 284 179 78 26 204 191 175 91 102 141 167 118 91 149 173 222 112
4679A12k2m4O4Q0Nj30k2R1J3J08j77O6Pn6J20k9l4jN1P5j52P2o5p7P0M0k2K3l3r2J02R7M5
$$ 112 90 46 110 190 195 65 43 134 147 255 78 144 151 95 215 186 152 151 202 277 125 197 132 55 125 165 143 166 133 41 143 240 285
4292B85r6j00J24j0p5O3M2j12r0J18R6r3mj9j7k0J60j81J4o4L4M8n4L2lQ9j5L4J15j36NOo5
$$ 285 189 89 213 203 128 191 233 121 31 149 245 152 148 129 112 92 252 71 85 21 55 103 49 81 78 167 152 186 301 165 170 176 111
3905A11lO4K7%p0M1K7j61J07q6O5k8J14Q9p8j39Q4l8p5M0K0Q8j13k3M8M1l9P5j42N8j3K4m2
$$ 111 108 172 199 199 129 170 197 36 143 57 122 94 208 297 219 80 164 126 51 91 111 199 86 63 111 152 113 188 46 104 91 115 73
3517G3k3Q5R1n6L0l8p9K5Ll6O6j22P0p2rO0L7j7m8O4P3l9J05J3j41j4o5R4R4j94M3P7j25L0
$$ 73 50 135 226 170 200 162 83 108 111 75 141 19 89 17 8 68 105 88 40 104 177 138 243 256 115 101 36 130 224 30 73 150 25 55
3118E5L1N0l7L9J39l0j05q4k5J89L4j31l7L1K3k1j16J63l2lJ29j92J01pM3j24J50K8M8j03
$$ 55 86 136 99 138 277 247 142 58 33 222 256 125 88 119 142 121 5 168 136 133 262 70 171 164 207 83 233 261 309 206
2766B06J01j60l1K7k7J7Nq9L8J00l8M6k2m6L2q2J73j8r7q2J1J7J69j14K8n0j04J81j39J4J53
$$ 206 307 147 116 143 116 133 138 49 87 187 149 195 173 127 159 77 250 232 135 53 64 81 250 136 164 114 10 191 52 66 219
2402B19j43M6J05k0j80R9K9k5M8N2j11L3O9m8m8q2JN0O8j14J1L9J23r0j3n0k5J58j3N9k17
$$ 219 76 122 227 207 27 126 155 130 178 230 119 152 221 173 125 43 44 94 162 48 59 98 221 131 118 68 43 201 188 247 30
2038C0J62o8j1L5K2MP6j2l0n4o9L0J20j30n7kqQ4Q7L4Kj85J51N0J1j74N6K3r9rR6K9j26QJ10
$$ 30 192 124 113 148 170 174 250 238 208 154 85 115 235 105 48 46 38 122 209 243 245 60 211 261 272 98 154 177 78 69 165 194 68 76 186
1628A86l9Oj7n1p4R3k1n2M5oj1l6Q6qp3J6P5n0N7LL6Q1p4k7oK3k8p1J86n5qn1k7R2p5n5j6
$$ 186 147 153 136 85 11 104 83 31 76 70 59 23 109 101 28 44 119 69 126 129 165 246 172 145 139 162 134 63 249 194 186 135 108 200 125 70 54
1193E4M7K22J1j71l1q3J02m2k0J19m9M1m2j07J91N7q3j58K7O7k6J4P0J81j63j87L7K1J9J45
$$ 54 101 323 334 163 132 49 151 109 89 208 159 200 158 51 242 299 216 58 85 152 126 140 210 391 228 41 78 99 118 263
841B63j33r8J05Pp3PP2q7L5Lk9J56q1P4p1j00J46K3j92P0n5K57j46L6R5N92Q57n85p06j1m09
$$ 263 130 32 137 144 71 78 150 63 98 101 72 228 147 221 150 50 196 219 27 97 42 299 153 189 284 876 1733 1148 442 431 22
477B2J31r2Q8r3k8J59j34O4M3N0j03J16j83J43j30M0J24J9N5j35j20P2l9NJ76M7j91N9m3O
$$ 22 153 61 149 56 28 187 53 117 160 210 107 223 40 183 53 93 217 236 291 156 36 108 69 74 250 297 106 165 122 128
125A28O8j43L8p6Q3Q5p2O9M5k9q4m5K23j20j19N7m3j5P1N5N1j69K9p3O3lP0
$$ 128 196 53 91 15 98 183 111 180 225 196 112 67 290 170 51 108 65 50 121 176 227 58 87 14 77 74 144
-192A44
##PAGE=	F1=-13079.7
##FIRST=	25164.767445380970457,	5806.2096540000038658,	0
##DATA TABLE=	(F2++(Y..Y)), PROFILE
5806I7k0l9N9j7Q9K22l5p1j60J38l0j80O7k7K1N5k2M7j78J41m0M2l1j16J58j9j05L6R0L9k3
$$ 97 77 38 97 80 169 391 356 285 125 263 233 53 120 93 114 169 147 194 16 157 117 159 128 12 170 151 46 82 172 211 188
5442A88O4j06qM5o5m4J0p6O4J08J30j12j26rL2J32l6j41K2oJ45q1M2q0j2J44r4m0oJ9K3K3
$$ 188 252 146 138 183 118 74 84 8 72 180 310 198 72 63 95 227 191 50 72 66 211 130 172 92 80 224 130 90 84 103 126 149
5067A49k1j6m2J51j01J5P1r8k0l3J08N0j14n2l7J94J24j09j89L6J69p4L7m2l9N2J1o6l6Q3
$$ 149 128 112 70 221 120 135 206 108 88 55 163 213 99 47 10 204 328 219 30 66 235 161 198 156 117 169 180 114 78 161
4715A61k5N4j12L7l7K8J23k1j52l5J13j6Q7j58J27Ro7J23n2j6J3K1L4r6N8p0r3J06mK6j8n3
$$ 161 136 190 78 115 78 106 229 208 56 21 134 118 205 47 174 183 116 239 187 171 184 205 239 143 201 131 38 144 140 166 148 95
4339I5l2J01O8N2r3j07J53k1m2O2j7j08o9J23P8j55N0j0j7lJ70k08pl8j4P8J1M6k4kM8QJ07
$$ 95 63 164 232 284 191 84 237 216 174 236 219 111 42 165 243 88 138 128 111 108 278 70 63 25 11 89 100 146 122 120 168 176 283
3952B83j42KOl0l5R0K5j6o2Q3M2k00P2n2M1k3J05Q9o8j23J06j5r7kj2O4n2L6qO8k2L8j53P6
$$ 283 141 143 149 119 84 174 199 183 121 204 246 46 118 66 107 84 189 278 210 87 193 178 81 79 67 131 79 115 107 175 153 191 38 114
3553A14j8M7J8o2N2P5n3O4n7n5jM3q9J19j49L2L2l1J2K8qp5L5J26l8R6J5j50Nj06J32N3j95
$$ 114 96 143 161 99 151 226 173 237 180 125 124 167 78 197 48 80 112 81 93 121 113 38 73 199 161 257 272 122 127 21 153 206 11
3165A1N1P1j04L8J4L7l6O5J04j5r2p7KJ28J9p0n9k3P6j0n5L7pN9J33k18L9k9Q3j10J86J0K1
$$ 11 62 133 29 67 81 118 82 147 251 236 144 67 69 197 216 146 87 64 140 130 75 112 105 164 297 79 118 89 172 62 248 258 279
2778B79r5J42j58o4prR0m2k0K3J6J4M0n0o6J4kJ50l4p6j16O1J6J53q0n4K2q5J32j15L6Q7j47
$$ 279 184 326 168 104 97 88 178 136 116 139 155 169 209 159 93 107 105 255 221 145 29 90 106 259 179 125 147 62 194 79 115 202 55
2391E5M6J04l5j21N4OOM8Q7r8j8P6n3o2m1j1K9M0r0K4Q3Q6k6o1p5qR6K0O0j77J76q2m3L0N9
$$ 55 101 205 170 49 103 109 115 163 250 152 134 210 157 95 54 43 72 112 22 46 129 215 189 128 53 45 141 161 221 44 220 138 95 125 184
1980A84j5R0k6o5Rj04J4J71j14j11Q1oKJ14O1p5j43J37J94J24k95p1L3j11N5O2Jj22O1P5r7
$$ 184 169 259 233 168 177 73 87 258 144 33 114 108 110 224 285 210 67 204 398 522 227 156 189 78 133 195 196 74 135 210 113
1616A13K09j61j26JO2o2j5M4LM0q4P2k8Mk8O1m7J09Oj5N3k4k7l0L6k7q4J52q4R0m1l5J39n8
$$ 113 322 161 35 36 98 36 21 65 68 108 24 96 68 72 44 105 58 167 173 158 211 187 160 130 166 139 55 207 123 213 172 137 276 218
1217B18j96K4O6K28k5j78n7m2J13j6o8Q7j1N3l6j11J50P9m5j55KP6p6N8P6J10j94j4Kl8K0
$$ 218 22 46 112 340 315 137 80 38 151 135 67 154 143 196 160 49 199 278 233 78 80 156 80 138 214 324 130 116 118 80 100
853A00J43j38o8J21m0m3QP9l4m7Jp1J99j25R2r2k2J37nr0k2j8L29j28J08K30J542J663j234
$$ 100 243 105 37 158 118 75 83 162 128 81 82 11 210 85 177 85 63 200 195 105 83 65 394 266 374 604 2146 3809 2575
513B575j807j74m57L5j6j5j1m4J57j23J5K6O0j64J80j98J72j36K6J03Q1L3j91p8O0l9K4J01
$$ 2575 768 594 137 172 156 141 130 86 243 120 135 161 221 57 237 39 211 75 101 204 285 318 127 49 109 70 94 195
184A95N7j61J05j60J15Nj00oL2J4P8r3N3O7M1j35n0K43j52r4O2p3M5N4j1P9j60O1q3PN5O3
$$ 195 252 91 196 36 151 156 56 50 82 96 174 81 134 201 242 107 57 300 148 54 116 43 88 142 131 210 50 111 28 35 90 153
-192A53
##PAGE=	F1=-13181.9
##FIRST=	25164.767445380970457,	5806.2096540000038658,	0
##DATA TABLE=	(F2++(Y..Y)), PROFILE
5806I8J3l3L4rJ12K24p5r1j29J03l3j58Q5l7K1L2l9L6j20R5J3L0J4j27J26k3r1N9K1L2lM0
$$ 98 111 78 112 103 215 439 364 273 144 247 214 56 141 104 125 157 118 154 34 129 142 172 186 59 185 162 71 130 151 183 180 220
5431B20j33P6K1p0pKn3M0J12J05j25j24K4mJ36m8j21K5m5J89j18O6r3j0J69j17m8J3P4J9p2
$$ 220 87 163 184 114 107 109 56 96 208 313 188 64 88 84 220 172 51 76 31 220 102 168 75 65 234 117 69 82 156 175 103
5067A03m9O9LJ62j91N9j7p0N9j02J03Q8j65J9rJ68J20r8j96L0J70j22R4j0q1M3k4n3l1R0p1
$$ 103 54 123 126 288 97 156 139 69 128 26 129 217 52 71 62 230 350 252 56 86 256 134 228 218 137 180 156 103 72 162 91
4703I1P5j14N6l1M9J25m3j69k2J12n7P5j05J50Mp2J09p3J3L6Oj2m2Nn6p4J20m3N5o5m2J6R5
$$ 91 166 52 108 77 126 251 208 39 17 129 72 147 42 192 196 124 233 160 173 209 215 203 161 166 110 36 156 113 168 103 61 77 172
4316A72K1O9p4j18J79l2k1O7q1p4n2J26N7j47N0k9nM5J43k29m4J8L0rQ1R1p9p1J02j9Q1j45
$$ 172 193 262 188 70 249 217 196 263 182 108 56 182 239 92 142 113 108 153 296 67 23 41 71 62 143 234 155 84 186 167 248 103
3940A03nJ6J1p0J01K3j5o4J22O9k03K0k1Kk1R4Q5m7p8J07Jj06o2rnJ7R5n7Q0KRj56O8kP2M4
$$ 103 98 114 125 55 156 179 164 100 222 291 88 108 87 89 68 162 247 200 122 229 230 124 62 53 48 65 160 103 183 185 194 38 106 104 176 220
3517B20r9L0N9l5P4q5J1m4P1j30J73j33m8J31m4k2oJ6l9m4J64n1P6K4j56N1j47J12M4j48J5
$$ 220 121 151 210 175 249 164 175 131 202 72 245 112 64 195 151 129 123 139 100 56 220 169 245 269 113 164 17 129 173 25 40
3154D0P4n7J3jM7k2N0Q1J7r2o3J1N6Kkj5j00P9QJ1q6M4J29J00k41j4m1R7m6J69j7K2q0J53
$$ 40 114 57 70 69 116 94 144 225 242 150 87 98 154 156 154 139 39 118 126 137 51 95 224 324 83 69 28 125 79 248 231 253 173 326
2754C26j43q6k5K8J24r1K7M6r9Q6L0o9j03nP9J17l9l2j55Q7K1J27Kj20M3n6R1r8N1J3j47M9
$$ 326 183 97 72 100 224 133 160 206 107 193 223 154 51 46 125 242 203 171 16 103 124 251 253 133 176 120 211 113 164 177 30 79
2379G9J09n1m7k2rL8M7J14q4m7O6m8o8j6krJ2l2L5R5M3J7q0j01K1QO3M6j17J62q3p8K2Q6k5
$$ 79 188 137 90 68 59 97 144 258 174 127 193 145 77 61 59 50 62 30 65 160 203 220 140 39 60 68 131 177 60 222 139 61 83 169 144
1968A44J08j8j03O2j25j3J98r6j00J14kp5J13R4j47p3J86K87K23m09k15L3j07R5L8rj16J26
$$ 144 252 234 131 193 68 55 253 157 57 171 169 94 207 301 154 81 267 554 777 368 153 186 79 174 212 203 87 213
1639B13L6j1L68l37k17K5K6q2J5L5LP6j22O2l0O0n8R1J7K5Lo6J4M3j9o8O4j1j01R5j07J66
$$ 213 249 238 606 269 52 77 103 21 36 71 74 150 28 90 60 120 62 153 170 195 198 132 146 189 170 102 166 155 54 149 42 208
1264B08k6j4J80l8k63J1M7K25q0j72k7J8R3nj09R3qP4k1j27R0R7j0j51j6R0j26J03Q2J8k05
$$ 208 182 168 348 310 47 58 105 330 250 78 51 69 162 157 48 141 133 207 186 59 149 246 236 85 69 159 33 136 218 236 31
900C1J44k1q9J3J41j26l2J21r2pK0Q9mo7J5o2J10j72J30n2N5P1o3N2j9o9L70j03K08M12K598
$$ 31 175 154 65 78 219 93 61 182 90 83 103 192 188 121 136 74 184 12 142 90 145 216 153 205 186 117 487 384 592 1004 3602
536C602K550j991k982m04m89n7P7j55P5p6J34o9p2LO6j70J91j99K12j52K9O3J28J3k38j3M4
$$ 3602 6152 4161 1179 775 286 229 306 151 226 150 284 215 143 146 212 42 233 34 246 94 123 186 314 327 89 76 120
219A20k9M6k1J02j25J18j46J01m7m9lR2n4N1r9K8Q9R1j62n7K35j70j8J7q6Q2M3q2J22j60J07
$$ 120 91 137 116 218 93 211 65 166 119 70 67 159 105 156 57 85 174 265 103 46 281 111 93 110 24 106 149 67 189 29 136
-145A36r1m3Q9N4
$$ 136 45 2 91 145
-192A45
##PAGE=	F1=-13284.2
##FIRST=	25164.767445380970457,	5806.2096540000038658,	0
##DATA TABLE=	(F2++(Y..Y)), PROFILE
5806I5M1j4kJJ23K08r2j03p6N1o2r1J03o3J3pj2K8p0L0N8J5O4j32Q2j7o1P4l9mJ3L1j44J53
$$ 95 136 122 120 121 244 452 360 257 181 232 170 79 182 119 132 125 113 141 71 101 159 174 238 106 188 171 110 184 145 141 154 185 41 194
5407A94j3o2M5l3k4L0P2P2j13j21P9m9J22n0j03M7m7J75j45P7r8lJ79j26J1k7J13Lj52k4R9
$$ 194 181 119 164 131 107 137 209 281 168 47 126 77 199 149 46 93 46 221 76 153 55 52 231 105 116 89 202 205 53 29 128
5043A28O2J57k54Q3r7lQ9j45N3J24j69P9J0J14J23p7j71k5J78j51J56%j16K2o8j5J0M9q0R2
$$ 128 190 347 93 176 79 76 165 20 73 197 28 107 117 231 354 277 106 81 259 108 264 264 148 170 102 87 97 146 66 158
4691A58p5ol3J15R3n4j72J9P8j03P2l9J38qo8Q3q6M3P1On1j5p0k6k5J15p6O6q9k5M6Q0l8R8
$$ 158 83 77 44 159 252 198 26 45 123 20 92 53 191 183 115 198 112 155 226 232 181 166 96 70 45 160 84 150 61 36 82 162 124 222
4292B22l5j35J90m3kP5j41j4m9J32L0q0L1r3J2J05J00k45k9K4Q7q7J17J43j30j00J22m2L9
$$ 222 187 52 242 199 197 272 131 117 68 200 230 150 181 88 100 205 305 60 31 55 142 55 172 315 185 85 207 165 204
3952B04j51JK9M2j00Q8L1Jp0J55R6j95k5Kl9k6Q6P9j1k4Q3J0j06j19M9m9MJ40r2Q3J6pj42
$$ 204 53 54 83 125 25 113 144 145 75 230 326 131 106 108 69 43 129 208 197 173 256 266 160 41 90 41 45 185 93 176 192 185 43
3564D3M2L0Q6L5j21K3M6k5P7j08Q2q7R1j53K10j01j16J99n0l9m9M4j2p0J54p6N7L2j52J06
$$ 43 85 115 201 236 115 138 184 159 236 128 210 123 214 61 271 170 54 253 203 164 115 159 147 77 231 155 212 244 92 198
3212A98j25oN9r1j8R0mk6k0P5j3J0Q4M2r5n4Pj6J3M5N1j04k8L3P3j13L9J73O2k63l2OK5M4
$$ 198 73 67 126 35 17 107 103 77 57 132 119 129 213 255 160 106 113 97 110 155 206 102 74 107 180 67 106 279 341 78 46 52 77 121
2813A21J21o3M4o1J30r7r8NN6J01j10K2Q5j93J47K1p3j13j5R4Q4k8K3j27L2K3R4J01j45J0
$$ 121 242 179 223 162 292 195 97 102 158 259 149 171 256 63 210 231 158 45 30 124 208 180 203 76 108 131 225 326 181 191
2461A91j8O5q7N0l3j25J8J18o9Pm7MRM2J16o6m9M9l3p4Jkm3oM8J7J00J4K4p9q4K2n9R1J6n8
$$ 191 173 238 151 201 168 43 61 179 110 117 70 74 83 125 241 175 126 175 142 68 69 67 24 18 66 83 183 197 221 142 58 80 21 112 128 70
2038G0J29p1q3j5J02k7J27Rj37R8j23m4J93q2q4J46kj17P2J28k04L4K61L20K87n02l45M2q9
$$ 70 199 128 45 30 132 105 232 241 104 202 79 35 228 146 62 208 206 89 161 289 85 119 380 700 987 485 140 182 93
1698I3R4J8J9j23J92oJ25M82m76l18NMo8ML3J5R6j48N1l3R3o3J25L3m5kj07k7J18kj20R8J9
$$ 93 187 205 224 101 293 287 412 894 418 100 105 109 41 45 78 93 189 41 92 59 152 89 214 247 202 200 93 66 184 182 62 160 179
1311A79j17L5o2J31qK8K13j3k87k2J4J99j36j46R3NP2qj28J21n2J18Qj67L1R8K2j39j7R4j35
$$ 179 62 97 35 166 158 186 399 386 99 77 91 290 154 8 101 106 178 170 42 163 111 229 237 70 101 199 221 82 65 159 24
947B4J15P1p0q0J37k0j20J3J41j23l7J50j41L4K1J13Rn6L2n1lr9O4K5R0nj32K07Lj56M02p4
$$ 24 139 210 140 60 197 177 57 70 211 88 51 201 60 94 115 228 237 181 213 162 159 60 124 149 239 234 102 309 312 156 558 484
571D84L12N90L560L334k696m020o35n03j24J32k41J25j27J11jj64%M7p7J10j76K35j78N1K8
$$ 484 796 1386 4946 8280 5584 1564 929 426 302 434 193 318 191 302 301 137 137 184 107 217 41 276 98 149 177
278A77J39Ok65M7K9k9Q8j54J51j03J29o1J9n8k3pJ41q8pn3l2J02J14j67o1K05j80Q6n9mK6
$$ 177 316 322 57 104 133 104 192 38 189 86 215 154 173 115 92 85 226 138 131 78 46 148 262 95 34 239 59 145 86 82 108
-86A08K8p9J27j71J40r6k1L6M7
$$ 108 136 57 184 13 153 57 36 72 119
-192A19
##PAGE=	F1=-13386.4
##FIRST=	25164.767445380970457,	5806.2096540000038658,	0
##DATA TABLE=	(F2++(Y..Y)), PROFILE
5806H8N3J8m2NJ24J80q1j07j6lj06rJ26r0j0n1O6J7n6rP0rJ09j22L7mk4P6p6n9K2M3j00J63
$$ 88 141 159 117 122 246 426 345 238 222 219 113 104 230 140 130 79 145 162 106 97 167 158 267 145 182 178 154 230 154 95 117 160 60 223
5407B23n6l5P7o4NL0JL8p2j05J26p9Q0m7q8Q2l5J21j45P1r3J6J66j09P9q1J29k2j78P7J7J26
$$ 223 167 132 209 145 150 180 181 219 147 42 168 89 169 122 34 116 81 202 57 128 35 51 217 108 187 106 235 213 35 112 129 255
5032B55J34k86R1j09L7O9j16n8J40n8L1K6M8J47n6j48r4J84j50K17j6j47jq7J6P5k3l3P3k3
$$ 255 389 103 194 85 122 191 75 17 157 99 130 156 204 351 295 147 53 237 87 304 288 141 140 53 69 144 121 88 161 138
4679A38r4l5J84M4o3j25J8N0p8J0MJ19k6n9N7q7P1J08J2p3k1j47L4J9J03j04O7l5o6N6N1r7
$$ 138 44 9 193 237 174 49 67 117 39 49 53 172 146 87 144 57 128 236 248 175 154 7 41 60 163 59 126 91 25 81 132 35
4304C5J33K2j52J79n6K9P8j90N3n2J33KrK9j65J8J59N7k50L9k9J41j31J10J90j56j20J35o2
$$ 35 168 190 38 217 161 190 268 78 131 79 212 214 205 234 69 87 246 303 53 92 63 204 73 183 373 217 97 232 170
3963A70j2j54L1L3N0r9L1N6K6p3J71J19j79p4K2o7l1P2Q1L5J4M2Rr6j52J07or1J53j10P8J4
$$ 170 158 4 35 68 118 19 50 106 132 59 230 349 170 96 118 51 20 92 173 208 222 264 273 177 25 132 126 35 188 78 156 170
3588A70pj15RP1Q2jj19K2L8k8Q7j13J15j12J00j60K30n4j49K15n7m2p6O5%n0J03r8L7L7j23
$$ 170 163 48 57 128 210 209 90 112 150 122 209 96 211 99 199 39 269 215 66 281 224 182 106 171 171 121 224 126 163 200 77
3224G7J37q6j10N1k9l6J13L5n8m5J07j7k6J06M2r6m9Jp4Q6K6J00r2j28M3J17o6j1J96K5k68
$$ 77 214 128 18 69 40 4 117 152 94 49 156 139 113 219 261 165 116 117 43 129 155 255 163 35 78 195 129 118 314 339 71
2860G1j4K7m6J23P7j27P8m1P8j7j06M1P9N1r7k7J20k29J73K0n6o6j9ON6jP4r1k5J3O3J93j45
$$ 71 57 84 38 161 238 111 189 148 226 209 103 144 223 274 177 150 270 41 214 234 178 112 93 99 155 154 228 137 112 125 188 381 236
2473B36n0K3N3p7L3l7j12k0J27r2M6j1Lm7L1R3n1k5M1j1q4Rro7J3Q7j1J00J3j0o7k4lj7L0
$$ 236 186 209 262 185 218 181 69 49 176 84 130 119 122 75 106 199 148 123 164 153 69 78 69 2 15 102 91 191 204 194 127 103 100 83 113
2062A13k9j0Q9n7l1n4P6j7J27M2j46R9j01n5J51o2q8J72mj01j6J60k35J43L27L07L14n61m33
$$ 113 84 74 163 106 75 21 97 80 207 249 103 202 101 46 197 135 47 219 215 114 98 258 23 166 493 800 1114 553 120
1722A20Q0p5N9j0Q1j44K48n1K58N43n60m11j9nn9j8L4M3J11j58L4n6J20m4J37K0q6j3j34j2
$$ 120 200 125 184 174 255 111 359 308 566 1109 549 138 119 114 55 37 71 114 225 67 101 45 165 121 258 278 192 179 45 33
1369C3J46J9j78J27M1j18K4MnJ1Q4K27J8k85n2j7J47j51K2O2k9N7j1j24J28r4J65M3k18pO8
$$ 33 179 198 20 147 188 70 94 98 93 104 188 415 433 148 96 79 226 75 97 159 130 187 176 52 180 86 251 294 76 69 137
1006A37N2j14MP1j02R6M4j37Q0N0%j26K8J34j22p6J97j78O0J2J54J1m2M8m5r3k8%Q4J22p8
$$ 137 189 75 79 150 48 144 188 51 131 181 181 55 83 217 95 19 216 38 98 110 264 275 233 281 236 143 115 115 199 321 243
642B43j84L41Qk38M22n0M00P14M214L837l185m690q19m87j59J44k65J38j82R1N5k33L8j0K7
$$ 243 59 400 408 170 592 542 942 1656 5870 9707 6522 1832 1013 526 367 511 246 384 202 293 348 115 153 143 170
348A70K7j20K09j99Q2J9J07J0k49O4K1l8J40j51O8j00J54%l6l8l4j5J77q9p9K7p4P5J11j46
$$ 170 197 77 286 87 169 188 295 305 56 120 141 103 243 92 160 60 214 214 178 140 106 91 268 179 100 127 53 128 239 93
-4I3o2J52j80J94j53J07l7j3PQ5j78J42q9Kk4L4
$$ 93 31 183 3 197 44 151 114 101 108 193 15 157 68 70 46 80
-192H0
##PAGE=	F1=-13488.7
##FIRST=	25164.767445380970457,	5806.2096540000038658,	0
##DATA TABLE=	(F2++(Y..Y)), PROFILE
5806G9M4O3p9lJ17J44m7j08M6n0j48N8J57j08m7q5J48J1n7j0M6m5J35r0LPJ1O9r4j13L0P2
$$ 79 123 186 107 104 221 365 318 210 256 206 58 116 273 165 118 33 181 192 135 125 171 126 261 171 174 181 192 261 167 54 84 156
5431A56o5J49j01J0P7p8K9L6q5J0j3o4J40q2J9m3o8J11l8O2j05M3q0L7J37p1J23j26J33m9
$$ 156 91 240 139 149 226 148 177 213 128 138 125 61 201 119 138 95 27 138 100 162 57 100 20 57 194 123 246 120 253 204
5078B04j34J15n1J77R8l04J03p0K8L5o8n2K3O2l4L8j5J95m6j29j48J66j08K55n3j77j3rl5
$$ 204 70 185 134 311 409 105 208 138 166 201 133 81 104 166 132 170 155 350 304 175 27 193 85 340 287 110 97 88 53
4738E3J40q6J3M1K5j31J3J51pp5l9k0L0k5o4J7J15n0n8N6q0R2J25J8p6m7m9OnQ3j20P1L3j26
$$ 53 193 107 120 161 186 55 68 219 212 137 98 78 108 83 19 36 151 101 43 99 19 111 236 254 178 131 82 88 83 166 46 117 150 24
4339B4N3J2j3L5Q2j60J44p0P9P0k20J02m9J23k3M7M0k10LJ96K5k34R3q1J77j61R2K23j46j61
$$ 24 77 89 76 111 193 33 177 107 186 256 36 138 89 212 189 236 276 66 69 265 290 56 149 68 245 84 176 399 253 92
3987I2J64p8o2n1k1K1L7o3J4L5L7o7J65J31j54j27M1p0%J8R0P8K4plp4j34J28L0j41J19j10
$$ 92 256 178 116 65 44 65 102 39 53 88 125 58 223 354 200 73 114 44 44 62 152 230 254 247 244 170 36 164 194 53 172 62
3611F2O4LPq8mR9N7n4q5J7M1m7J16j02Q3j11J01j51K32Pj56J86o7l3p1O7lqL9j12K0L7o7J28
$$ 62 126 129 136 48 44 143 200 146 61 78 119 72 188 86 169 58 159 8 240 247 91 277 210 177 106 173 170 162 201 89 109 146 79 207
3212B07m2p1q4M2m5J27N8q0o5J36l4m0J25J8r4m1mo2J35l2J16o9j27k3J33pn8K04qk42OJ5
$$ 207 165 94 10 52 7 134 192 112 47 183 149 109 234 252 158 117 113 51 186 154 270 201 74 51 184 177 119 323 315 73 79 94
2837I4p3J62N9j95J15k7PQ2j14N8J00kp0r5J39k01J62L6k1l1m1q5M3L1J04n6n8j6M0K63j36
$$ 94 21 183 242 47 162 135 142 224 110 168 268 266 196 101 240 39 201 237 216 185 144 59 102 133 237 181 123 107 147 410 274
2473B74j16O2N1o5J0k1j16m0J36j26Q6L6j5q5J6O3n6J8N2J2j00J0j1n2J7R4m4J00L3o7n9N2
$$ 274 158 220 271 206 216 195 79 39 175 49 135 171 156 71 87 150 94 112 164 176 76 86 75 23 40 134 90 190 223 156 97 149
2097A49l1K4j4o9J1N6n4L3m9N0LP8O2j22O6o4l7Q3k1j23J75nm6r8J68j60J42L68K54L05n76
$$ 149 118 142 128 59 70 126 72 105 56 106 109 187 249 127 193 129 92 175 154 31 206 201 155 57 225 65 207 575 829 1134 558
1733E58m54J34p1K0o3J53j67K85r4L65N29n74m60m0ln3n8M1P9J27j47Po4J19j3J21j2r4k9
$$ 558 104 238 167 187 124 277 110 395 301 666 1195 621 161 121 118 65 7 48 127 254 107 114 50 169 156 277 265 171 142
1393A42j38R1P8M2j99J10M1r8O3Lj23L0J35K13N0k53p6m3P8k8O0K2o5N0qj11J03p4J65Q1k69
$$ 142 4 95 173 215 16 126 167 69 132 135 12 42 177 390 440 187 111 68 146 118 178 200 135 185 177 66 169 95 260 341 72
1029G2lNP4p9L0L3p2Q7J0j14J40m8L2j10M2J19r4n9J69j98M9PK03Nl6O5m7j41Jl8J21J49j35
$$ 72 69 74 148 69 99 132 60 147 157 43 183 135 167 57 99 218 124 65 234 36 85 92 295 300 264 329 282 141 142 104 225 374 239
642B39j95M16j3k90M22l4M51P51M404L942l337m838r18m36j60J19k42J26k18O6Q4k54R7q5
$$ 239 44 460 447 157 579 545 996 1747 6151 10093 6756 1918 1000 564 404 523 281 407 189 255 339 85 182 97
360I7J14l2n1J44k04J06L5M7K2j97L5K4m9J91j08m8r8J81K8n5j7o2pJ80p4j37J04r2L9R3j00
$$ 97 211 179 128 272 68 174 209 256 278 81 116 140 91 282 174 126 28 209 237 182 165 103 96 276 202 65 169 77 116 209 109
-4A09o6Q2n6J72k17J86o9q6Q6N4j89J38o3K0n6J
$$ 109 43 125 69 241 24 210 141 55 141 195 6 144 81 101 45 46
-192D6
##PAGE=	F1=-13591
##FIRST=	25164.767445380970457,	5806.2096540000038658,	0
##DATA TABLE=	(F2++(Y..Y)), PROFILE
5806G4J1J18j03k8J08J00%j07J03q5j38N8J84j05r2o6J65J0n1J1Qr6J39l9j1RL8N7r7j49M5
$$ 74 85 203 100 72 180 280 280 173 276 191 53 111 295 190 98 32 197 207 156 167 175 79 218 179 168 177 215 272 175 26 71
5442G1R8o7J35j42O9M8p0M6M3j61LK4j9J38p3l6l6l8J19n5Rk1po7N6R5k7J42j57J36o9q2J36
$$ 71 169 102 237 95 164 212 142 188 231 70 73 97 78 216 143 107 71 33 152 97 106 85 78 11 67 162 135 277 120 256 187 105 241
5055B41r4K04N6l18J24l1J1Lj7k9q7J45r4L8o4K65n2j13j13N9j7K47j03k00jQ5r4J78j08J5
$$ 241 147 351 407 89 213 182 193 196 179 150 63 208 114 152 88 353 301 188 75 134 117 364 261 61 60 145 51 229 121 136
4703A36J4O6j30K9J12m7q9O4o5PJ9j12RJ27o4o3R3o9Q2J05J8o2p1M6%m0N6j22Q1N9j53M5k2
$$ 136 150 216 86 115 227 180 91 155 90 97 116 4 13 140 76 13 106 37 119 224 242 180 109 155 155 115 171 49 130 189 36 81 59
4316E9J14j03J22j65J02q0J35N1k21J16k4R1m3Q4N1k23j1J97Qj94J25j22J92j90Q3K40j00
$$ 59 173 70 192 27 129 49 184 235 14 130 106 197 154 238 289 66 55 252 260 66 191 69 261 71 154 394 294
3999B94k32K14r6r3L4n7oK0k9P3l2L2m7J34J34j27j52L8n2K9k6R6J06Nm7l1m2q6J26N8j62
$$ 294 62 276 180 87 121 64 58 78 49 122 90 122 75 209 343 216 64 102 50 79 53 149 255 260 213 182 140 54 180 238 76
3635G6P1r7M2PK4q3K6R5K2j05k3oN7p9J53r0Ko5P1n2J49O9j50J31q0j8l3N5k1L8j6j17OL7
$$ 76 147 50 92 99 123 40 66 161 183 78 55 49 106 27 180 90 92 27 98 46 195 264 114 245 165 147 114 169 148 186 170 53 59 96
3236I6j0R2nk6r7L7n1J10O6r2o2J52n9k7J15j3q9k2j1qJ42r0J02l8q6r2J20M4r3K02l9j78
$$ 96 86 178 173 147 50 87 36 146 212 120 58 210 151 124 239 226 137 115 104 96 238 148 250 212 126 34 154 198 105 307 268 90
2860I0J1j6m5J40P4k12J12k6n2J59j20N6J13m7m6j52J31j32J36P1J2k0o6j41O0L4J01k8n1
$$ 90 101 85 40 180 254 42 154 128 76 235 115 171 284 237 191 39 170 38 174 245 257 237 171 30 90 124 225 197 146
2520A46o0L1K91j22j78R1N6m8j0Kj33m2J49j63J33O9m0j02KP5j21O9P8K7j18J1ln5L1R5p7
$$ 146 86 117 408 286 108 199 255 207 197 199 66 24 173 10 143 212 172 70 72 147 26 95 173 200 82 93 90 35 66 161 84
2156H4J08N4j07p8J22n0N8m5q4mM3p4Q7m5P5J5J8N9p9J7j2JOL2j55J32lJ8r6J11r5J17L77
$$ 84 192 246 139 61 183 133 191 146 62 58 101 27 114 69 144 159 177 236 157 174 162 163 169 201 46 178 175 193 97 208 113 230 607
1768F07J69K71n47l94J67o6pj31K08j82K92j21M22M43n16m50n1Qm1m4pR5J44j12k9k7P3J1
$$ 607 776 1047 500 106 273 207 200 69 277 95 387 266 688 1131 615 165 114 122 81 37 30 125 269 157 128 101 174 185
1440A85Q9n3o8n1o6J03K6N9j86O0J3m7R4j5o0j9R4J74P8j97r0o3NJ22M3j3r3M9lr4N3OJ14
$$ 185 274 221 153 102 36 139 165 224 38 98 111 64 158 143 83 64 158 332 410 213 123 60 65 187 230 217 124 173 170 76 129 135 249
1053B49J11l01L0j7L4m5N2qm2Q4k4k3J21j40O1q5M4J07l9l3J21k15NL0K43j0m1Q1n9j46rm7
$$ 249 360 59 89 72 106 61 113 105 63 147 123 100 221 81 142 57 101 208 169 136 257 42 47 77 320 310 269 350 291 145 136 89
677H9J37J60j62j72M29o5k93L95l0M62O88M084L625l111m435r12l52j35P2j89R3k17K8Q2k16
$$ 89 226 386 224 52 481 416 123 518 488 950 1638 5722 9347 6236 1801 889 537 402 474 285 378 161 189 271 55
383E5J45j47J73o0J2O1j79R9O5j3L0j31j6L4m9K24o6j41n2J51K9l9Kj00K2J43n6j63J52j00
$$ 55 200 53 226 166 178 239 60 159 224 211 241 110 94 128 79 303 237 96 44 195 224 185 187 87 109 252 196 33 185 85
31H5J9Q3m5p2PN4J41j90J62p1j47J20L3j53R0k5L0n5j6
$$ 85 104 187 142 70 77 131 272 82 244 173 26 146 179 26 116 91 121 66 50
-192E0
##PAGE=	F1=-13693.2
##FIRST=	25164.767445380970457,	5806.2096540000038658,	0
##DATA TABLE=	(F2++(Y..Y)), PROFILE
5806G4k8J66j06p4J19L8M4j05J45j01q2KJ97q0j33j8J27J8l2L9l2j51J15K5kJN3M4r0j55N7
$$ 74 46 212 106 32 151 189 233 128 273 172 90 92 289 209 76 58 185 203 171 210 178 27 142 167 165 166 219 263 173 18 75
5442G5J08r3J24j76J35jm3O2M0j63K7l4K1J25o4o5j6j6J12q5k8Q3n9o0O8M6J1J40j71J46p5
$$ 75 183 90 214 38 173 172 129 191 231 68 95 61 82 207 143 78 62 46 158 73 45 128 69 9 77 123 134 274 103 249 174
5078A74m4J48j10K01J1l22J43j%k1K7oj33J50j30K2r1L39p4r4m9o2Q5K11j57j83K2J23j15
$$ 174 130 278 168 369 380 58 201 200 200 179 206 200 67 217 87 109 18 357 283 189 140 78 163 374 217 34 56 179 64
4738F4J78r2j8lR5j21L4P7o7j01J63r3k2M1j12K0R9n1j9P4r8Q5O6J0l7o7R4J1o2K7j04Q1M5
$$ 64 242 150 132 129 224 103 137 214 147 46 209 116 94 135 23 43 142 91 72 146 48 133 199 209 172 105 199 210 148 175 71 152 197
4351A97j37L7j9J71j74J11j75P3p9J64L2j84R1K2L8n6J04O0k15LJ41Pj39J44j52J88k18Q8
$$ 197 60 97 78 249 75 186 11 84 5 169 201 17 108 130 168 112 216 276 61 64 205 212 73 217 65 253 35 123
4022A23K40k8l13K63j14r5Q7o7n3RqJ25q1L3j5R1J21j02j19ol4M8m9R9J17l1o4o4j4l7J19
$$ 123 363 335 22 285 171 76 163 96 43 52 44 169 88 121 106 197 318 216 97 91 57 105 56 155 272 241 177 113 99 62 181
3658A81P4j66L5p8K0M7K5j10P5Q0Kq4l3nO4q7J34p8p6O4n8P0N6J16j40O5q8jJ8L8m7P3m2j13
$$ 181 255 89 124 46 66 113 138 28 103 183 185 101 68 63 127 40 174 96 20 84 26 96 152 268 128 193 105 104 122 160 113 186 144 31
3259C1j0N4PN2J8J1o7M1n8O4O5r8k8J53q7nQ1l7q0J5k8M1J39j42P2om2j38J03P0j12J93o1
$$ 31 21 75 82 134 152 163 96 137 79 143 208 110 82 235 148 143 224 187 107 122 94 135 274 132 204 198 156 18 121 191 79 272 211
2872B11r5Kn0J5P5J08j98R8m1m2J48j14L7J13p7k9j20L5m2J07J08L2k7q5j16P3NO1j0nj06
$$ 211 116 118 68 83 158 266 68 166 125 83 231 117 154 267 190 161 41 76 34 141 249 281 254 169 53 126 131 192 182 177 71
2508G1M3K62j05k20J03N7k4j5K1j52k8J51j08J04P6n7j04NJ27j22jR9K8j31J4Po7O0R0j04
$$ 71 114 376 271 51 154 211 187 172 193 41 13 164 56 160 236 179 75 80 207 85 84 183 211 80 94 101 34 94 184 80
2156H0J28N8r8j25J53n1Q6o4p5m4M8o9Q0n1J18K4k5M0l6l2M9M4o0O7j79P9NO6o5O5p8R5L54
$$ 80 208 266 168 43 196 145 231 167 92 48 96 27 107 56 174 198 173 213 177 145 194 238 178 245 66 145 150 216 151 216 138 233 587
1768E87O6K19m73k78J57m4k8j83K26j78K64j23M21L01m01l81m7J6j3j8k9M6J56n5p0J8K5K2
$$ 587 653 872 399 121 278 234 206 23 249 71 335 212 633 934 533 152 105 121 108 90 61 107 263 208 138 156 181 203
1440B03N1q8j5p6k2J02nO8j68K1m2L7Q9k8K3k1J1J21R3j31r6n4l6J85K2l6j06N3kp6%Q7N3
$$ 203 254 166 151 75 53 155 150 218 50 71 29 66 155 127 150 129 140 261 354 223 127 73 37 222 244 208 102 155 153 77 77 164 217
1053B17J29l05O9J0m6k4O7m2%O9n1M9J07j87N3o3L1J18J5k0Q2k17m9O5K58l1n5R4p6j23m1
$$ 217 346 41 110 120 74 50 117 75 75 144 93 142 249 62 115 52 83 201 216 196 278 61 12 77 335 304 249 343 267 144 103
689A03k6J29J54j58j43M03j38k43L37l8M40N38L331K969k563l588q07k41j01K3j19L9j68k4
$$ 103 77 206 360 202 59 462 324 81 418 380 820 1358 4689 7658 5095 1507 700 459 358 381 262 301 133 109
407A09N2j17J54j82K02p0O7j1j30N1R6m9K1o1o8M5l7K31l3j83oQ6K1pL5j43N4P8m2j38J41
$$ 109 161 44 198 16 218 148 215 204 74 125 221 172 193 132 64 109 72 303 270 87 81 167 188 181 216 73 127 205 163 25 166
43A66r5J6J00rp3l8J12J05j48J10o0j30P5K5q6RJ4L1m7r
$$ 166 71 87 187 178 105 67 179 284 136 246 186 56 131 156 70 79 93 124 77 68
-192F8
##PAGE=	F1=-13795.5
##FIRST=	25164.767445380970457,	5806.2096540000038658,	0
##DATA TABLE=	(F2++(Y..Y)), PROFILE
5806G9k3J58r1j16J47m2O5r8J65r9k5m9J82l7j53PP7L5LO1p0j28KQ9K6j5N4L3p8j33M8J12
$$ 79 56 214 123 7 154 112 177 79 244 145 120 71 253 216 63 70 147 182 185 246 176 48 50 139 165 150 204 237 159 26 74 186
5431A86j23J14j42J41o0JP9J8r8K7j13M8R7o5m3MrJ03j25j7J51j00o2P7pL6J23j67J65o8k5
$$ 186 63 177 35 176 116 117 196 214 116 143 30 78 175 110 67 71 62 165 40 23 174 74 12 89 82 118 241 74 239 171 146
5067A46J50j04J71l5l08J53J6Jl5N2J7j27R7j29j3OK96j03o5J1j25J36J62k05q7rJ17j01J45
$$ 146 296 192 363 328 20 173 189 190 155 207 224 97 194 65 52 58 354 251 186 197 72 208 370 165 78 69 186 85 230
4726B30n3o4oJ06j12L1M7o0q2K11r5m5L3r2L6N9l0J3N3j37Q7L8rqk7Q5K7o4Jo6O8%r1L8mJ72
$$ 230 177 113 107 213 101 132 179 119 37 248 153 108 141 49 85 144 114 127 180 43 130 168 159 151 124 209 236 172 173 107 175 175 84 122 118 290
4304B90j83O4j59M2pQ7J9j22N9O1j7o3J13P4j92K7L9J3o9J55j74J72k00O0K28N3l18K29j34
$$ 290 107 171 12 54 47 134 153 31 90 151 134 71 184 258 66 93 132 145 76 231 57 229 29 89 317 370 52 281 147
3963A47p4J10n4r1%oJ45j06M6K4O2Q7r4n8n1l4O5o0J01J16p4n0n1k3j9J07Q6j65L1p1J0Q7
$$ 147 73 183 129 38 38 32 177 71 117 141 203 290 196 138 87 53 118 58 159 275 201 151 100 77 58 165 251 86 117 46 56 143
3588A43J9j18R9O4Nl7r2K3O4j03R2n2qN8j12R5j9J37j28%q1J5O0K0o9Q8l2q6l5P5k4K3K9K5
$$ 143 162 44 143 207 212 175 83 106 170 67 159 107 99 157 45 140 121 258 130 130 49 64 124 144 75 163 131 45 10 85 61 84 113 138
3189A38j4O0n8kN8r7K1J45j06J1L2m6o6P0o2Q5J24j84L6K5j0j32Q8M6j12J80o2k5j9n7P8j0
$$ 138 124 184 126 124 182 85 106 251 145 156 188 142 76 146 84 169 293 109 145 170 160 28 116 162 50 230 168 143 124 67 145 135
2813A35J33j89J08o3j5R8r0PJ01r2k0j3p1MP7J27L5m1q9o5Q9j7mjO1j34N9J86q3j73N0L6R
$$ 135 268 79 187 124 109 207 117 124 225 133 113 100 29 33 110 237 272 231 142 77 166 149 145 144 205 71 130 316 233 60 110 146 155
2426A55oL3j48J4R7l1P3N8n9j01L4J62j03p9Q7J4j32J9J1p4R8P4j12J46M7n9j53J17k5J04
$$ 155 149 182 34 48 145 114 187 245 186 85 119 281 178 99 186 200 68 87 98 24 122 196 84 230 277 218 65 182 157 261
2074B61o9n4p4M7k6J6p3J54L4m6J7po9J05P9j04P3j89M4J2R0l3M6r5Q1L02l3J58l65j49J11
$$ 261 192 138 64 111 85 101 28 182 216 170 187 180 111 216 295 191 264 75 119 131 221 188 234 139 220 522 489 647 282 133 244
1710B44ln1j87J96j47J96r5L64J37k57k71l0J0L4Jm3k1J58J6j08N1qJ8J7j04N3r3l2J03k5
$$ 244 241 190 3 199 52 248 153 517 654 397 126 96 106 140 141 98 77 235 251 143 194 186 204 221 117 170 77 45 148 123
1358A23P1j39JPK4L7j9Q5j2m6O9Q7p0r6k0k3J36Nm7j03O8qo1j6J12MJ30k64R5K4r3j3O4n9
$$ 123 194 55 56 63 87 124 105 190 178 132 201 288 218 122 102 79 215 220 173 70 138 130 69 53 165 169 299 35 130 154 61 48 112 53
959E3M6L8o7J00R8j82J3n8J1J61L6j8O1j85k2jK50n2p4J08r8q5p8J5J06J31j27j13L42k11
$$ 53 99 137 70 170 268 86 99 41 52 213 249 231 292 107 85 84 334 282 208 316 218 133 55 70 176 307 180 67 409 198
606A98j48K48n6M01L38K319K130j822k508o22j22p3rm8k7q3n4k3K1J20j64J82p6J10m1j00
$$ 198 50 298 242 643 981 3300 5430 3608 1100 478 356 283 274 226 199 116 62 39 60 180 16 198 122 232 191 91
301I1pJ11n3nMr1L4j2K09rj65jJ5K6J7R2j84P4Ol1q7Q1p7L6J33no5m1J11O6j03M5m8q7L1L4
$$ 91 84 195 142 137 141 50 84 72 281 272 107 106 121 147 164 256 72 146 152 121 34 115 38 74 207 202 137 96 207 273 170 215 167 80 111 145
-121A45k5o9L2K6l6J
$$ 145 120 51 83 109 73 74
-192G4
##PAGE=	F1=-13897.7
##FIRST=	25164.767445380970457,	5806.2096540000038658,	0
##DATA TABLE=	(F2++(Y..Y)), PROFILE
5806H4PJ22p0j02J36j07M6p8J55q2K3o3J21J6j38mL1N7M4P0j02o2m0M3N6l1M0K7o5r7K6J07
$$ 84 91 213 143 41 177 70 116 38 193 111 134 71 192 208 70 66 97 154 198 268 166 104 64 107 163 132 172 199 134 37 63 170
5431A70j35J02m1P6j13N1R9k2l8J1j20L2N8q2M3j3OJ01j56K9J52j27o5Q2m9M1R5j30J73n4
$$ 170 35 137 96 172 59 110 209 187 149 160 40 72 130 48 91 78 84 185 29 58 210 83 18 100 51 92 187 57 230 176
5078A76j9J38q1J18p8k24J02K2J7m1N8L6j05K8r1qO9K23j32j9M9j22J27J13k34j1m5J06p0
$$ 176 157 295 214 332 254 30 132 154 171 130 188 224 119 147 56 48 117 340 208 189 238 116 243 356 122 111 66 172 102
4738A02R8nj02J3Q6j02K0J8k5m5K03p7n4Pn7M2J6j7M6L0j69Q0L1k7LL6L9L7m9j8j1M7o4l2
$$ 102 200 195 93 106 192 90 110 128 103 58 261 184 130 137 80 122 138 121 167 197 28 108 139 112 115 151 190 227 178 160 149 196 132 100
4339A00M8LJ41j60J6j09QK8OJ6n0N2N8n7o1J25R9j72L1n5lJ7J61j86J46j19k4K06J25k95J70
$$ 100 148 151 292 132 148 39 47 75 81 97 47 99 157 100 39 164 263 91 122 67 64 81 242 56 202 83 59 265 390 95 265
3975B65j51n2J12k9q5j9MR7q3N1N6O4L8j06lp8l8P4n6R5J08j10k2J7n0n0Q7J00j64N9q1LJ07
$$ 265 114 62 174 145 60 41 45 142 59 110 166 230 268 162 159 81 43 117 61 156 264 154 132 149 99 49 136 236 72 131 50 53 160
3588A60J5r0R7M3J7j8j28N3O6j27N2j4L5O3j21O8p4J37j07o0l0OP8Jp5P7Kn9n4Q2o8J1M0N
$$ 160 175 85 182 225 242 224 96 149 215 88 140 126 161 224 103 171 97 234 127 67 37 43 121 122 47 124 126 67 13 95 27 38 78 83
3189H3M8Q1n1o8N3r4O6J31j03J2k1l7m9J29j07J29R8k12lO0Lo3N6j8q9J62l3Jm6j6J09o8J07
$$ 83 131 212 161 93 146 52 118 249 146 158 137 100 51 180 73 202 300 88 85 145 148 85 141 123 34 196 163 164 118 102 211 143 250
2801B50j66J24q4j7N7m9k4Q0r4j6Q4l5p6O3J06K3n1p3k1J09k6p1OJ22j48P2R1m9o6pl6M9M
$$ 250 84 208 124 107 164 115 91 171 77 61 145 110 34 97 203 226 175 102 81 190 164 93 99 221 73 145 236 187 121 114 78 127 131
2414A31L6j03L7J1N3N0K3l9j00P1J66p7j16L5j2j15J8Rn2J15N1j00J44M1j6j66M8K8J11o2
$$ 131 167 64 101 112 165 215 238 199 99 170 336 259 143 178 166 51 69 78 26 141 192 92 236 277 261 95 143 171 282 220
2062B20l5q4L7%k4p9J34M2m4%nq0J34J00j23N8j74K7J1R2pM6j25Q1K24j04R6k40m8M7M9q0
$$ 220 185 101 138 138 114 35 169 211 167 167 162 82 216 316 193 251 77 104 115 207 200 246 121 202 426 322 418 178 130 177 226 146
1686A46j41J33q6R3m3K72j5j15j49oj6R2J6o4o9J41Q8j31O0k0Oj1r8J16r9q7J16m6P1r8QQ5
$$ 146 5 138 52 145 102 374 359 244 95 89 73 165 181 117 48 189 277 146 206 186 192 181 83 199 100 13 129 83 154 56 64 149
1311A49k8l6J4J05Jo9L2O1l2r4K0k6P5on0q4R5j6n4K5N7k1J12j80R9Pp6j2L2m5O5Ko7J30R1
$$ 149 121 85 99 204 205 136 168 229 197 103 123 97 172 166 116 32 127 111 57 82 139 118 230 50 149 156 80 68 100 55 120 122 55 185 276
900B76j72j2o0J0J97K1k4O0j23j4q0K35o9r1J23j22m1p4K2Q6R7q9p7K57k48m6J40p0L51J34
$$ 276 104 92 32 42 239 260 236 296 173 159 79 314 245 154 277 155 114 40 62 148 245 156 79 336 88 42 182 112 463 597
548E97J272J285j050j440l84k7n8j5J8o5j4j4k8NP1j04J26r0J42k3j07l3Q3k9l1M4p4lK1J63
$$ 597 1869 3154 2104 664 280 253 195 180 198 133 119 105 77 82 153 49 175 85 227 204 97 64 147 118 87 131 57 54 75 238
196B38Mj07k4m8M7K7J65k32R9o2op1J2k4O3J51k6n2k5Q2K8o5j4m2l5J5N2J3j09PK1k0N
$$ 238 242 135 111 63 110 137 302 70 169 107 101 30 42 18 81 232 206 154 129 211 239 174 160 118 83 98 150 163 54 61 82 62 67
-192F7
##PAGE=	F1=-14000
##FIRST=	25164.767445380970457,	5806.2096540000038658,	0
##DATA TABLE=	(F2++(Y..Y)), PROFILE
5806H6K7R9n1r3J28j32rl5J11o3O5m4L1O5r6l9PP3P7O5j24KOo3O5m4J6K2m8n7J8P1r3O1M4
$$ 86 113 212 161 68 196 64 55 20 131 68 133 89 120 185 89 50 57 130 207 272 148 150 156 93 158 114 130 152 104 47 65 136 43 104 148
5395A48J5j54R9J16o7mj6p4KK4n6R3n1L7J07j60K0J50j41o7Q7n7J4O3n0J44m4j4J15n4N7j16
$$ 148 163 9 108 224 157 153 137 63 65 89 33 126 75 112 219 59 79 229 88 21 108 51 65 128 78 222 178 164 279 225 282 166
5020A66j06K6K4M1m1M6N5q0m0m3N8N2J51j45L9N4r4R9P3k26Op2J09m1N2M4j24M8M0q0Rk5J5
$$ 166 60 86 110 151 110 156 211 131 91 48 106 158 309 164 203 257 163 262 335 109 115 43 152 111 163 207 83 131 171 91 100 75 90
4632I0j8J74n5m6j8j8L8k4rP1J6j88P0M0%n3J01j7K8k2k7N3K9j35J7O9RQ6j20k5n5j2M1o5
$$ 90 72 246 191 145 127 109 147 123 114 185 201 13 83 123 123 70 171 154 182 160 133 186 215 80 97 166 175 261 141 116 61 49 90 25
4233B5K2RO5K0p1m6J43J27j77K3l6n2M4J62j81J02n1q3J69J70k66J20j51m6R5lm4n1M4nJ0
$$ 25 47 56 121 141 70 24 167 294 117 140 104 52 96 258 77 179 128 45 214 384 118 238 87 41 136 133 89 38 82 77 87
3870H7J6O8Q7oj22J9q4pN0l0O8R4j26nQ1n7q3N0J18j55R5j01pJ08Ml2Q8J1J5j6j20P7O4j38
$$ 87 103 171 258 252 130 149 65 58 108 78 146 240 114 109 190 133 50 100 218 63 158 57 50 158 162 130 218 229 244 228 108 185 249 111
3470A11K4PM3Q9j36N2j16J28p9j09L5nO7j4n5L8L9l9o5P5o9%M5l8R7Q5l5j05N1r7Q3J18p0
$$ 111 135 142 185 274 138 190 74 202 123 14 49 44 111 97 42 80 119 80 15 90 21 21 66 28 125 210 175 70 121 24 107 225 155
3083A55Lp6j0l2J75j57J74O3k01o6J04J1J0J6q1m4J37jjp8N3J14q9L2j11J24r2n3L1Km9N5
$$ 155 158 82 72 40 215 58 232 295 94 28 132 143 153 169 88 44 181 180 179 101 154 268 179 211 100 224 132 79 110 112 63 118
2708A18p7k1J54qj24P0L6J0n0m6J3J25l1j22K4J49j55Q3kOK1j7r9O1%K0l8O3r9J34L5k1Kr8
$$ 118 41 20 174 166 42 112 148 158 108 62 75 200 169 47 71 220 65 148 146 152 173 156 57 118 118 138 100 163 64 198 233 212 214 116
2308A16J02J40m1j18l6m2o7j1%RR3K2p1J14N8J3j64k5R4J06m9k1q6K7J3m2o0O9M5k6j1k5n6
$$ 116 218 358 317 199 163 121 54 43 43 52 145 167 96 210 268 281 117 92 186 292 243 222 136 163 176 134 74 143 188 162 151 126 70
1921G0J18J05j16L2j26J5%Q0QN3j46R2J32j31L8j21Oj4R9j11o5O4j9mJ1J70j27nl7J7l9J30
$$ 70 188 293 177 209 83 98 98 178 186 239 93 185 317 186 224 103 109 95 194 83 18 82 63 59 70 240 113 108 71 88 49 179
1545A79K7r3o6R5J35j31M8j2j3k7p9J62q6r8Q0q8P3n6L6J28n8q4M0Q7J0o7J1L3k2r0N0l8K1
$$ 179 206 113 47 142 277 146 194 182 169 142 63 225 139 41 121 33 106 50 86 214 156 72 112 199 209 142 153 186 164 74 124 86 107
1158A07kn3MP4k0m5M2Lj0N3q6J00l9lk6j5j0N6k9m8J37P8j68j3n0L4J85j2l1P7m8j9j64K19
$$ 107 105 52 56 130 110 65 107 110 100 153 67 167 128 125 99 84 74 130 101 53 190 268 100 87 37 71 256 244 213 290 242 223 59 278
759B78q0r8J37j47Qk2k1P3O2n9l9J63j49o5M6J8K10k5L94N81l96n90r9j4l2j4P2j7m1J6om6
$$ 278 198 100 237 90 98 76 55 128 190 131 92 255 106 41 87 105 315 290 684 1265 869 279 180 166 134 120 192 175 134 150 144 98
383I8K3l4P3j12J57J9j38kkK3k5K1l9m1N4J07Ql7n2n3K6M4K20k87J46j17L6j07K7J9M7J46
$$ 98 121 87 160 48 205 224 86 84 82 105 80 101 62 21 75 182 190 153 101 48 74 118 338 51 197 80 116 9 36 55 102 248
8B48o0m0JM1pl2m7m5J0L0N5L9j15m7K2NO
$$ 248 188 148 149 190 183 151 104 59 69 99 154 193 78 31 53 58 64
-192F4
##PAGE=	F1=-14102.2
##FIRST=	25164.767445380970457,	5806.2096540000038658,	0
##DATA TABLE=	(F2++(Y..Y)), PROFILE
5806H2L5R6m3q2J13j36o1J7O1n8R8j6k9O9m3p2L4N1R0N1j29N2M9j19M0n7kJ2l1j6M1nj9J4
$$ 82 117 213 170 88 201 65 4 21 82 24 122 106 77 146 103 31 65 116 206 257 128 180 229 110 150 93 91 103 72 56 97 92 73 87
5407H7R7l3j22P6J26r8om4ok6K8L5L3p8O9J19j66mJ38j39o6Q7m1j4L2K9R7l7nQ4l3Kj27j4
$$ 87 184 151 29 105 231 133 127 83 77 51 79 114 147 69 138 257 91 87 225 86 20 107 66 52 84 113 210 173 168 252 219 221 94 80
5008H0l3L4N9l7J9P9o1r9rJ24K2Q5j34R2L5n8O3M7j79k3p3J06k7J9Q4j32P8km3J0p9K3QJ29
$$ 80 47 81 140 103 122 201 140 41 32 156 178 263 129 221 256 198 261 308 129 106 33 139 112 131 215 83 161 159 116 126 47 70 78 207
4609B07m0j9l3J5K8n2JO9K4j93Q6L2O5j57J44o0pJ1k9J19J9j98M1J01J5K2p8n6ok6M7p1J1
$$ 207 167 148 115 130 158 106 107 176 200 7 93 125 190 33 177 117 110 121 92 211 230 32 73 174 189 211 133 77 71 45 92 21 32
4222C2K1Q0k2n4k1J39J48j96J7L7l2l3J59j59L8mr3J14J78k36Q9j10n6M1J6J6q7R7o5Q2l6
$$ 32 53 133 111 57 36 175 323 127 144 181 149 116 275 116 154 150 57 171 349 113 202 92 36 77 93 109 22 119 54 136 100
3858A00N3J10k9j13qp3O7j0J0K8P6j14j9J20m8q7KJ34j23J07j16j0R4k8L7Q8l5ok3o8R2N9
$$ 100 153 263 234 121 113 40 107 97 107 135 211 97 78 198 150 63 65 199 76 183 67 57 151 123 160 248 213 207 184 116 208 267
3482B67j30J0jL3J23j56N4j46J14m1r9J5J4M0j5k8pN7k7n0M2rj7K1NO6M5j5q6M4q2K9J11j0
$$ 267 137 147 146 179 302 146 200 54 168 127 28 43 57 97 82 54 47 104 77 27 69 60 43 64 69 135 180 165 79 123 41 70 181 171
3083A71kj27K0j9J97k05K17K4j40r9Q7K9O1l1j17oJ22Qlj09J25R7q9n7l2J09p8r6lN2o1L6
$$ 171 169 42 62 43 240 35 252 276 136 37 124 153 214 183 66 60 182 190 187 78 203 300 211 154 122 231 153 57 54 106 45 81
2708H1j2m5J63Mj31Q3n4L2m3n2N8J14m2j44O1J34j65R8p6P8O0j5r5K4pj3M2Q6k10J94K2o2
$$ 81 69 24 187 191 60 143 89 121 78 26 84 198 156 12 73 207 42 140 64 142 202 187 92 116 109 96 138 224 14 208 230 168
2332A68N4q9J22R1kr6j03n2j2m5k7P3N1j2l3O3J02K3j47p2J39R4l3k0q2K2J2m7l5OM2Jk3n8
$$ 168 222 133 255 346 344 248 145 93 81 36 9 82 133 121 88 151 253 276 129 57 196 290 257 237 155 177 189 142 107 113 155 156 133 75
1933G5LN2J04r3J2n8Jj8O0RO5j48J09M1j10ln1K4k2J08j45L7j1L2rmQ6r5j0K1M6rQ5K7j26
$$ 75 78 130 234 141 153 95 96 78 138 147 212 64 173 214 104 101 50 74 52 160 15 52 41 73 64 60 146 51 41 62 108 99 184 211 85
1522H5j5M8J32j07K4J2l7l0n8J87m7q7L3j15N6k8O1J36o9r2L3O3Rm8oJ9l8q0N9l9k4L8k0P6
$$ 85 70 118 250 143 167 179 142 112 54 241 194 107 140 25 81 53 114 250 181 89 122 185 194 146 140 159 121 41 100 61 37 75 55 131
1123A31J5k6j9RNK3n5qJ08j01R4n0o0K8L7m0k6J18N8j62nk3M6J51m3l4J03K3l0k36K06q5q7
$$ 131 146 120 101 110 115 138 83 75 183 82 176 126 66 94 131 91 65 183 241 79 74 51 97 248 205 171 274 297 267 31 237 152 65
736F5J39j66O7%m9O0L4m5pP7j0j29j1J68K6j03Q9j03K7r2J51r3N2n0J10M3j01J3Jo4j7M9K3
$$ 65 204 38 105 105 56 116 150 105 98 175 165 36 25 193 219 116 205 102 129 37 188 95 147 97 207 250 149 162 163 99 82 131 154
348A54j07J30N3j70N1q1R5lo3Jl2L6P2JJ7p1J9o3R8K22l38K01j54O7j06O9j2K9J31r0l6L2
$$ 154 47 177 230 60 111 30 125 122 59 60 28 64 136 137 154 83 102 39 137 359 21 222 68 135 29 98 86 115 246 156 120 152
-27A52kl8Lk3k2k7O8L3O0j03r8K8K8K1
$$ 152 150 112 115 92 70 43 111 144 204 101 3 31 59 80
-192H0
##PAGE=	F1=-14204.5
##FIRST=	25164.767445380970457,	5806.2096540000038658,	0
##DATA TABLE=	(F2++(Y..Y)), PROFILE
5806G5L5J04m7o3Q9j33j4l1O9n0P2Qlj4Lp5O7J5Q4L7j15P5Q7j38Po4%k6j1J6P5q8N0oJ14p0
$$ 75 110 214 167 104 193 60 46 15 84 34 106 114 111 97 100 25 92 107 191 228 113 188 275 137 144 80 80 54 43 59 134 46 96 90 204 134
5384A34q0M4J26j02l8m9M8m4N9P9l7n0O5J33j70l3J14j21o5P9j5k3J4P2N1l0NN2k8l1m8k2
$$ 134 54 98 224 122 84 35 83 39 98 177 140 90 155 288 118 85 199 78 13 92 77 54 68 140 191 161 166 218 190 159 111 89
5008H9n1N5N1k6k4J13n5j47MJ75oK4q8J20Mk4K6L4j16j8o4O6l5J0R8j36J01k9jJ6j02k2L7
$$ 89 38 93 144 118 94 207 152 5 9 184 178 202 114 234 238 214 240 274 158 140 76 142 107 117 215 79 180 151 150 166 64 42 79
4621G9P9m6L0m0L9J4n9K4K4N7j90J18J0J23k09J14p3n3L4l0J74J6k12J5J31K3k9n1p7L2l9
$$ 79 158 112 142 102 141 155 96 120 144 201 11 129 139 262 53 167 94 41 75 45 219 235 23 38 169 192 163 112 35 67 28
4257B8O1m9OjQ3m0Kj9R8J54k08K3J04Oj17J58j32l6K3o7O6J44k02P7l4m8l7J9N1p5J02qN0
$$ 28 89 40 46 45 128 88 90 71 169 323 115 138 242 248 131 289 157 121 144 77 143 287 85 162 128 80 43 62 113 38 140 132 182
3870A82p2MJ18k5o6o9l4J27p6M5oN4q1n1J25l0p0l5J36p7J00j14oP5q7R9R9p7n0l0NJ06M6
$$ 182 110 114 232 207 141 72 38 165 89 134 128 182 101 50 175 145 75 40 176 99 199 85 79 154 67 166 265 188 138 108 113 219 265
3482B65j07Mk6L2J40j82Q0j65R6Jq2l7O9kLj5l6M4j9j5rN4l3j2O8O1l0j2k7L8o4o6J16O1L
$$ 265 158 162 136 168 308 126 206 41 137 138 56 19 88 86 89 74 38 82 63 48 39 93 60 48 116 177 147 135 108 146 82 16 132 193 196
3071A96j50K0pJ90k43K45j1m6r6J3M9Q8o8j27J5J24rKj27J75O9q0j33M7Q8m6j01p1R2n5K8
$$ 196 46 66 59 249 6 251 240 194 98 111 160 248 180 53 68 192 183 185 58 233 302 222 89 136 224 178 77 6 98 43 71
2708G1N1p4J42Kj11R5j18J03o4p8R7P5o2j17P2J12j89J20p8J01N4j6p1j4Qm3J06R9k13J38
$$ 71 122 48 190 192 81 176 58 161 97 19 116 191 129 12 84 196 7 127 49 150 204 188 117 103 111 68 174 273 60 198
2355A98Mr5J09o7J25L6L0o1j47k6Mm3l4P2Qn6QOJ62J3j12n8J18Q1j6l2p2J9jm0j0l3K9L1m2
$$ 198 202 107 216 149 274 310 340 279 132 106 110 67 33 105 113 57 65 71 233 246 134 76 194 275 259 227 155 174 173 133 123 90 119 150 108
1945A08r3Q1l8J01o4MLql4L1JQ1j29J14k8o3Ll8LN6M8j02N3o6O1J6l3L5J3m5KP7K3J8Oj54
$$ 108 15 96 58 159 95 99 102 94 60 91 92 173 44 158 130 67 70 32 35 91 139 37 90 24 85 101 68 103 116 71 73 150 173 191 197 43
1522D3M5L6P5n8mM3o8k0m0J93J1q2Jj05L2j2N4J12o9q9J9N0kj8rJ3p4o6N5ml6P7J3R5m3m4
$$ 43 88 124 199 141 137 180 112 92 52 245 256 174 175 70 102 90 144 256 187 98 117 167 165 147 138 151 77 11 66 62 26 103 116 211 168 124
1099A24K3n2N2M7j61L8J26j37J58p4r2N9L2k0m1Q1K8j41QJM3J12o3k8J22Q3l8k63J75q0m4
$$ 124 147 95 147 194 33 71 197 60 218 144 52 111 143 123 82 163 191 50 58 59 102 214 151 123 245 328 290 27 202 122 78
736G8J06j41R4k5l7K9J4k9NPQ5j42k2K40r1p9L97O7k30j57K5j42J48j03J36O9j49j7Mo0m1
$$ 78 184 43 137 112 75 104 118 89 94 101 186 44 22 262 171 92 489 556 326 169 194 52 200 97 233 302 153 136 140 80 39
372C9J37j9p6P8N1j66P9m4R6pj55N3J2k5Q2kMo3P3j18J57J78l25J99j70O6o5O6l4J0J10r1
$$ 39 176 157 81 159 210 44 123 79 175 168 13 66 78 53 135 133 137 74 147 29 186 364 39 238 68 134 69 135 101 111 221 130
-4A30n1N7l9n8N9L4rj12J18oP3p7q3j7L3N3
$$ 130 79 136 97 39 98 132 123 11 129 123 196 119 36 19 52 105
-192A05
##PAGE=	F1=-14306.8
##FIRST=	25164.767445380970457,	5806.2096540000038658,	0
##DATA TABLE=	(F2++(Y..Y)), PROFILE
5806F9M0J05o3k8N3j21K1m9Q7m2J9K6M7j11K2l7O8j3O8K9q2O6J15j32j5n4J6r3J1L5R9j44
$$ 69 109 214 151 123 176 55 76 27 114 72 91 117 164 53 75 38 106 93 161 190 108 174 289 157 142 88 104 11 22 57 156 12
5431A2R2JJ03r9l9J8J15p4p5K2J1l8P1Q8j06L4K4J42j66n7Q3r4m9M3K1k2PQ2K1k5J4K3m2k8
$$ 12 104 105 208 109 70 88 203 129 54 76 87 49 120 208 102 136 160 302 136 79 162 68 19 62 83 61 68 150 171 146 160 183 141 113
5032A13O5q5l4O6L1j3o6J52o2j55NJ73k6l0j7J20k9%qL1m9L9r9M0o4K7Q1j45J20m0L8J6j02
$$ 113 178 93 59 125 156 143 77 229 167 12 17 190 164 134 117 237 208 208 200 231 182 221 122 162 98 125 206 61 181 141 179 195 93
4644I3n4M2N2r5J00n5O1om6N6m8J04j83J37nJ57k23N8n2j1j5l2J76K0j78%R9L1n0n0n7K8m4
$$ 93 39 81 133 38 138 83 144 138 92 148 100 204 21 158 153 310 87 145 93 82 67 35 211 231 53 53 152 183 133 83 26 54 10
4257A0Q0o3K2PO3k1M6k6K2J46j98M2J50N3j99J57j02j07L9l1M7P0j62P6M9l3l8Qoj7N6O7J7
$$ 10 90 27 49 56 119 98 144 118 140 286 88 130 280 333 134 291 189 82 121 90 137 207 45 121 170 137 99 107 101 84 140 207 224
3870B24q8p5J06Onj03JJ45j25O3j8K9n6o4R3j3m3m8J14l2R2r1j1O8j09P9J31q9j00k5M0J23
$$ 224 136 61 167 173 168 65 66 211 86 149 131 160 104 40 133 120 77 29 143 111 203 112 101 169 60 139 270 181 81 56 96 219
3494B19L3q6%m6O0J15k06J20j81Q7L8p2o0J13l4J2j4n0J4j5K3o1J07m9n5J24R1p3n7L9L8m7
$$ 219 252 166 166 120 180 295 89 209 28 115 153 81 21 134 100 112 98 48 62 47 70 9 116 67 12 136 227 154 97 136 174 127
3118A27o9N3J08Pj54JJ1J55k10J96l2N1q7p0N7J00p3j30L0J35l9Pj25J83M1o1j78R8O7nq5
$$ 127 58 111 219 226 72 73 84 239 29 225 193 244 157 87 144 244 171 41 71 206 167 174 49 232 273 212 34 132 199 194 109
2754A09p7N5l1L8Q4r9J08pq5J01j21J40j12l3Q6K4q0o9N7J21j77Q3k2O5K1j8m3m8N5k9J02
$$ 109 32 87 56 94 178 79 187 180 95 196 75 215 103 70 156 180 100 31 88 209 32 115 93 158 179 161 118 70 125 96 198
2391A98J03j80N8k6j07J46l6J20j5M7k6j58J8j6k0n1O0rr3K0PJ65po0l1O9P8ln7n3J4k5k2
$$ 198 301 121 179 153 46 192 156 276 261 308 282 124 142 126 106 55 115 106 13 33 40 205 198 138 107 176 254 251 194 141 155 130 108
2003A08J2m0J2N4o0l6O2n8L5l8RL5qm2jmJ00r5R0n6l6K8Qo7J04J8o9O0q4O5J1k2j6L5l0K0
$$ 108 120 80 92 146 86 50 112 54 89 51 60 95 87 45 44 40 140 45 135 79 43 71 79 12 116 134 65 125 41 106 117 95 79 114 84 104
1581A04R7L2k3m4j59Q4M5mJ7m1P4j04nk1J89P1q3k5j10M3J3K2O5o5q7J1N1j8K4J0Jj06l3M7
$$ 104 201 233 210 166 7 91 136 132 149 108 182 78 73 52 241 312 229 204 94 137 150 172 237 172 85 96 147 129 153 163 164 58 25 72
1182G2K3k4P1K0J17r6o9P6j11R3O8k31N3J48j07J37q8j09Q3N3Nq7L2or4K5KL3Q1p2j4J17J27
$$ 72 95 71 142 162 279 183 114 190 79 172 240 9 62 210 103 240 152 43 126 179 184 97 129 123 29 54 56 89 170 98 84 201 328
794C28l5k53J35o0mO8j02R8p2Kj4qJ4j1n1J35j03rK43j49l4L58J08k41j24o0q7J69j33J46
$$ 328 293 40 175 115 111 179 77 175 103 105 91 83 97 86 35 170 67 58 301 152 118 476 584 343 219 159 72 241 108 254
442B54P1j81n9J9n0j4J73n2m6M3Or6N2K0R2l5j67N7M7o2J02J4p8k6Q1j15J86J24k86J62j59
$$ 254 325 144 85 104 54 40 213 161 115 158 164 68 120 140 232 197 30 87 134 72 174 188 110 84 165 50 236 360 74 236 77
78G7L5j0M3m8lQ0m7p7N6o3j9Q9N9j6j26J15m2O8m1o4m6J1R4
$$ 77 112 102 145 97 94 174 127 50 106 43 24 113 172 156 30 145 103 171 130 66 20 31 125
-192A25
##PAGE=	F1=-14409
##FIRST=	25164.767445380970457,	5806.2096540000038658,	0
##DATA TABLE=	(F2++(Y..Y)), PROFILE
5806G2N1Q6p6K1Kj04L8k9P0l3j7M4P7j39l1J6N2l1N3L2m4K9J36j08k0l6L1j17lL5J01j23O3
$$ 72 123 209 133 154 156 52 90 61 131 98 81 125 202 63 32 48 100 69 122 154 110 139 275 167 147 111 142 25 22 57 158 35 98
5419I8K4Q2j27OmR4k6p8N1k7k8P0O3j53J37k8J41j58n9N9p3j7k9P4k8kP8J7k4J7ko8J3J37
$$ 98 122 204 77 83 79 173 147 69 120 93 65 135 198 45 182 154 295 137 78 137 64 47 18 92 64 62 140 157 133 150 148 80 93 230
5020B30j34rO6J6nr3J84p2j68K7J34l3n8M0J03n4Ql7L5J3J10j53L8r8N9M0j63J38m1P2Rq2
$$ 230 96 87 153 169 164 71 255 183 15 42 176 143 85 125 228 174 182 145 180 193 303 150 188 90 149 189 26 164 123 195 204 122
4644A22m7J0P4j12R2q4Q9l5k0Q2r9J34j68J29rJ64k15J0rM1m4k6J10L1j46L1K0L7l8p4J0k0
$$ 122 75 85 159 47 139 55 144 109 89 171 72 206 38 167 158 322 107 117 108 149 105 79 189 220 74 105 125 162 124 50 60 40
4269D0jO8p6J0M5L8PO0k6o9J23j55P1J63R4k66J53p5j39M9k4N8k4j19Q2J19j5l3K2j02N1j3
$$ 40 39 107 31 41 86 124 131 191 165 96 219 64 135 298 392 126 279 204 65 114 90 148 124 5 87 206 191 158 180 78 129 116
3893A16J41J1r1j47P0M4L8r8NJ42j45N7MMo2n1N1orm6P8kR6n7l5P6n3m9J80n4r3km5J44K8
$$ 116 257 268 177 30 100 144 182 84 89 231 86 143 147 151 89 38 89 83 74 28 106 104 200 143 108 184 131 82 262 208 115 113 68 212 240
3482B40p8nm6R5O7k10J44j97Q9P0o0n6J29m3kj4n8pk3N4p1J11n8k8Q2J33o5j29R0N1l5m8J6
$$ 240 162 157 111 206 273 63 207 10 99 169 109 53 182 139 137 123 65 58 35 89 18 129 71 43 125 258 193 64 154 205 170 122 138
3095A38J06%j53j0K9J02j48J12k9J21o5j51M5J02l1j40M4J48n8oj00J43K4l1j56P0M7M0o8
$$ 138 244 244 91 81 110 212 64 176 147 268 203 52 97 199 168 28 72 220 162 156 56 199 223 192 36 106 153 193 125
2754A25p0J6PN9R0j11O0j0p1J02j05J45j65O1N6j9p9l7L6J62j84L7J3M0k5j1k3p6J16JO1J03
$$ 125 55 71 78 137 227 116 176 166 95 197 92 237 72 133 189 170 91 54 90 252 68 105 118 158 133 122 99 23 139 140 201 304
2379C04j31j0o9k4P9LJ12m9L7Jj29N5n3J4p2M9J1n1o9R1O6k3Nk4K5Q6Jq7k1Mo2OK7k3JO4n1
$$ 304 173 163 94 70 149 152 264 215 252 253 124 179 126 140 68 117 128 77 8 99 165 142 147 123 148 234 235 148 127 131 69 75 102 79 80 144 93
1945I3K3NKq1k0MN2kl7j0L7O5o7L9l6k6K3O0r6P6K3o4Q8p3N3j3K0q9M8k4P9R7J5l1j04p7L1
$$ 93 116 121 123 42 22 26 78 76 39 29 66 131 64 103 67 41 64 124 28 104 127 63 151 78 131 118 138 49 97 73 152 249 264 233 129 52 83
1510H3N3p6J14r7J02j42J1jJ85J18q8m5j30P0N6k5J4o1q9J2N8k9P1L3j3j04k1O7%k7P0J3J36
$$ 83 136 60 174 77 179 37 48 47 232 350 262 217 87 157 213 188 202 141 52 64 122 93 164 197 184 80 59 126 126 99 169 182 318
1123C18j37q6J26j35R0Q6k53M4J69o2P8q8j17J04R1J8j36k8l5k0M6j8J6P0n9j2P3J61k2k45
$$ 318 181 95 221 86 176 262 9 53 222 160 238 150 33 137 228 246 110 82 47 27 73 55 71 141 82 70 143 304 282 37
771C7J09k8K0M4p6R6j16M8n0m0P3l7n6J10m0QK13j64J0J34L7j04l2r5MJ46j29J39O9k08q2
$$ 37 146 118 138 182 106 202 86 134 84 44 117 80 24 134 94 102 315 151 161 295 332 228 196 101 105 251 122 261 330 122 40
407D0N7l0J0J53p0j9K4o6PLP4R4p2j46N1Q0p0R2M1j59J1M5r1K09Q2k58J23j31rM5J7o0%L6
$$ 40 97 67 77 230 160 141 165 99 106 109 183 277 205 59 110 190 120 212 253 94 105 150 59 268 350 92 215 84 75 120 137 77 77 113
8A13L0q9J6m7L9O6O3l2p7P0n7L9nl6n8k7J25
$$ 113 143 54 70 23 62 128 191 159 82 152 95 134 129 93 35 8 133
-192A33
##PAGE=	F1=-14511.3
##FIRST=	25164.767445380970457,	5806.2096540000038658,	0
##DATA TABLE=	(F2++(Y..Y)), PROFILE
5806H5O7M9p2O7o3q2M0PK8j7l0O2Q1j13q2K2K7l6M3M5j5k3J49o9j4l1N4j27nK4P7p8J2N3O0
$$ 85 152 201 129 196 133 51 91 98 126 109 79 141 222 109 27 49 76 40 83 128 113 90 239 170 156 125 179 52 47 71 148 70 82 135 195
5395A95j49M7j8O4K6p2M3l7l1O8J3r1J52o7J25j55j5N3p8Rm8P4m2j8O6L8k8Rk1o5M0J65j53
$$ 195 46 93 75 139 165 93 136 99 68 136 149 58 210 143 268 113 98 151 73 82 34 108 66 48 114 152 124 133 112 47 87 252 99
5008I9J2N8Mnr7K02q1j75M6Q5k5k3L4P8p3Qo1L5O6J65j97N1j22Q6%j49J17l6R8km4m7j1J21
$$ 99 111 169 173 168 71 273 192 17 63 148 123 100 134 212 139 147 86 121 187 352 155 206 84 170 170 21 138 102 200 198 154 107 96 217
4609B17r8J3q6R7p1J1R1r1J21j44R6pJ45j84k1M0O4n1k2M1M6j28O6n4M9j2j11P1n8M6O1l9
$$ 217 119 132 46 143 72 83 174 83 204 60 156 149 294 110 89 129 193 142 120 161 207 79 145 91 140 128 17 88 30 76 137 98
4233I8o2P8L0K2M9k0j33Q2q1Q8J51J14l05J39n2j07N7p6R2j08l6M5J63Ml6M4j90J09q4K04
$$ 98 36 114 144 166 215 195 62 144 63 151 302 416 111 250 198 91 148 72 164 56 20 65 228 232 196 240 50 159 75 279
3881B79M3r8j46M5K5L0r0LJ24j34L8N2j2j05j0J5j4L6l5M5j3J17k5p9J00J5j92K37jp8Kj27
$$ 279 322 224 78 123 148 178 88 91 215 81 119 171 159 54 44 59 45 81 46 91 78 195 170 91 191 206 14 251 250 172 174 47
3506D7J54M1r3rj9R8K9j58J08j64N6R4m8n9J40m0j8j6n4j7n6R2p0R6n1J4rJ63k7j68J05P4
$$ 47 201 242 149 140 121 219 248 90 198 34 90 184 136 77 217 177 159 143 89 72 16 108 38 134 83 97 88 251 224 56 161 235
3130B35l3l5J0Q1j8j44j1M7M0q1K8%J38l0k10J5R2M5j52O2J47m8m1o1O4L0Qj23OK8Q7n6n5
$$ 235 202 167 177 258 240 96 85 132 172 91 119 119 257 227 17 32 124 169 17 79 226 178 137 76 140 170 178 55 61 89 176 120 65
2743F5j7N5Q4P3j13J0np3R9q6J24j74J53J5m8n3k8K4K02k12kK4L4p8L2k9l5J03K0J5J05p4
$$ 65 48 103 187 260 147 157 152 79 178 92 216 42 195 210 162 109 81 105 307 95 93 117 151 73 105 76 41 144 164 179 284 210
2367B10n8j09R4m4M0J10n6lJ3o7Q6j05N4p8L9M1m4r5J04j8k6P5m1MR5mj12K1rr1J7M2oQN5
$$ 210 152 43 137 93 133 243 187 184 197 130 216 111 165 87 126 167 123 28 132 114 88 163 122 126 221 217 105 126 117 26 43 85 79 87 142
1956A42jL8o2N5j24k6kN9j5pON8J6m8j7J0j1jP4j09K5M1n5J25m6K8l3O4j69R6n9J53P7k2j5
$$ 142 141 179 117 172 48 22 20 79 64 57 63 121 137 89 72 82 71 70 144 35 60 101 46 171 125 153 120 184 15 111 52 205 282 260 245
1545B45j47oj3M4j03J87j68J24j37mQJ96J37r6n7j66J13J02p3k4n6r5J7P0l7J10M0j9q1j1
$$ 245 98 92 79 123 20 207 39 163 26 22 30 226 363 267 210 44 157 259 186 162 106 11 28 98 61 171 211 192 111 100
1193A00Q1l6k7O6rJ46j63p2J52j24M8R4k38K5J90k7J4p6j23J18J26K5j61j04PlP0k1JO3k2
$$ 100 181 145 118 184 175 321 158 86 238 114 162 256 18 43 233 206 220 144 21 139 265 290 129 25 32 29 99 78 79 142 120
829A20m4LJ86%k23O9PL3L6o1Q1j35Q6o3o0R7n4kJ8K9K0J70j58L5j4j29J69p5n4L4J06r9J17
$$ 120 76 79 265 265 42 111 118 151 187 126 207 72 158 95 35 132 78 76 94 123 143 313 155 190 176 47 216 141 87 121 227 128 245
442B45Q3k36k6N0kj8J28o5jPj37J05l0J00R6j01j17M0J16o2M8P8j94K0k1o0K24O2k43R2j03
$$ 245 328 92 66 116 114 96 224 159 158 165 28 133 103 203 299 198 81 121 237 175 223 301 107 127 106 46 270 332 89 181 78
78G8m2Q2J0p9K6k1J01r1k4J7J4N2O1m3KJ5o4nK7Ko4j5R1
$$ 78 36 118 128 49 75 54 155 64 40 57 71 123 184 141 143 158 94 89 116 118 54 39 130
-192A30
##PAGE=	F1=-14613.5
##FIRST=	25164.767445380970457,	5806.2096540000038658,	0
##DATA TABLE=	(F2++(Y..Y)), PROFILE
5806A01Q8Nn4R6j27o3L5N0k6kj6P3O5p8o7m0jnK1O5j0p2J56j9nn0R0j41J6J8M8m1m1P4M2j34
$$ 101 189 194 140 236 109 46 81 131 105 103 87 160 225 147 80 40 39 34 55 120 110 38 194 175 170 120 210 69 85 103 151 110 69 143 185 51
5384E1M9k5L1O9p5K3j4m5O1m7N1Q1p7R3j62Q4N0j05K3l0L7n6l0M8O2k9j3k6Jj0J69j40K5N1
$$ 51 100 75 106 175 100 123 109 64 125 78 129 210 133 226 64 148 198 93 116 86 123 67 37 85 147 118 105 79 80 70 239 99 124 175
4985A75j3j1p9K03q2j66N2L4nM1pN3q9K0o5kJ05J85k02N7j19R0j9q4M0k6J12nqo6%J59j04
$$ 175 162 151 72 275 193 27 79 113 108 149 142 195 106 126 61 59 164 349 147 204 85 175 156 72 112 86 198 193 185 119 119 278 174
4597A74p1oM1j03M0P8n0R6j12N4nR8j32l9Q4O3n1rj6O0j27R4j03P0J4j22Q4q0Q5O0Qj25P8
$$ 174 103 97 138 35 75 153 103 199 87 141 136 234 102 63 147 210 159 150 134 194 67 161 58 128 142 20 104 24 109 169 177 52 130
4210A30L5L1J5j3j20K5k8R2J34J03l07J07k8n0O9j54J38j20l3L6J70K1m8P2k52J48j37K40
$$ 130 165 196 211 198 78 103 75 167 301 404 97 204 176 126 195 41 179 59 26 62 232 253 205 277 25 173 36 276
3881B76J08j19j33P6j9l2q6jR2r5J7J12j1j29K8l3l1Q5k3L9q0J50nj34J40P5j81J58L6q3M
$$ 276 384 265 132 208 189 157 71 70 162 67 84 196 185 56 84 51 20 105 82 121 41 191 186 52 192 267 86 244 280 197 201
3517B01j44J36O3j22j2K3O3J7r2M7j12K3J05m3o3J44l4j8k6m1k2p1J01o9Q1l0L5j04J69K1
$$ 201 57 193 256 134 122 145 208 225 133 180 68 91 196 153 90 234 200 182 156 115 93 22 123 54 135 105 140 36 205 226
3165B26j49Q2R8m2l5J9N6m3j30LO4k3k0j1K2R3J7j81K4j8J09j53Q3J26j6o9l1k0N7L3j19m4
$$ 226 77 159 257 215 180 199 255 212 82 85 149 126 106 95 117 210 227 46 70 52 161 8 91 217 201 132 101 81 138 171 52 8
2790HK1J25n7k8m9J05J06M0j06l4Kq1R4p0Q4m6J28k5o3k1k9L2K16k40k8J2M8j38J22n5J9M5
$$ 8 29 154 97 69 20 125 231 271 165 131 133 52 146 76 160 114 242 217 154 133 104 136 352 112 84 96 144 6 128 73 92 137
2414A37K6k8J13j8r0j05J56j51O3J16l7o5OJ6J10j58R0n5L2M4n5j10Q5n6k1J36o7J5Q9k0j20
$$ 137 163 135 248 230 140 35 191 40 103 219 182 117 123 139 249 91 181 126 158 202 147 37 122 66 45 181 114 129 218 198 78
2050G8N1j3m9k7N3j5K7L4O9K6j37R0q4n6L5L5n7K9J1O1k6k7l2K6Mj0L6r2lJ8kJ33j2lm7R4
$$ 78 129 116 67 40 93 78 105 139 208 234 97 187 103 47 82 117 60 89 100 161 135 108 76 102 106 96 132 40 37 55 53 186 174 171 124 218
1628B18k02J16j02K19M8p4J0j49L9k6Qm0J65k19J22n6l9k0K12J19j01n9j61J16J32j16l5m1
$$ 218 16 132 30 249 297 223 233 84 123 97 105 65 230 11 133 77 38 18 230 349 248 189 28 144 276 160 125 84
1299H4n0k7P2l3J18K2j4l9RP8o6j3M9m4J39j68rJ28r1jQ4k02MK08ll3o2j16J03J48L1j47j17
$$ 84 34 7 79 46 164 186 172 133 142 220 154 141 190 146 285 117 108 236 145 144 228 26 30 238 235 202 140 24 127 275 306 159 42
912D2M4o1R3jrM7J3q5o2K04K4j57rK9L6M2n2M6j15J04n0n3O3o0M8o0R4J5J34j44J4M0j01J52
$$ 42 86 25 118 117 108 155 168 83 21 225 249 92 83 112 148 190 138 184 69 173 123 70 133 73 121 61 155 170 304 160 174 214 113 265
513B65j78N3k0N3n3R4J11k61M4J6K8o6J12l5Nj5j06R4m2J01R7j07q7J4J52m4k2J16j79Nj00
$$ 265 87 140 120 173 120 214 325 64 108 124 152 86 198 163 168 153 47 141 99 200 297 190 103 117 269 225 203 319 140 145 45
149D5j4K08O3k17O3q9m6Q7K8j08N7l3J10r7rL4j9L6N8l1Q0l4p7n5N7M6p6jN4
$$ 45 31 239 302 85 148 59 13 100 128 20 77 44 154 57 48 82 63 99 157 126 206 172 95 40 97 143 67 66 120
-192A20
##PAGE=	F1=-14715.8
##FIRST=	25164.767445380970457,	5806.2096540000038658,	0
##DATA TABLE=	(F2++(Y..Y)), PROFILE
5806A12J15k9n2J12j72m6K8Q8o5nK0P0L6m3m7q5j5M5j2P4l5m9J07L2Or4J34j53N0J7M2l9p6
$$ 112 227 198 146 258 86 40 68 156 91 86 106 176 212 169 122 37 22 67 55 129 94 45 152 184 190 96 230 77 127 144 186 147 71
5419G1P6K7r4J7k0%R4q4QL0m4K9m6J23ln1M3j45J82L4j31K4j1ko0k6M0N2j9n0OL7p9J67r7
$$ 71 147 174 80 97 77 77 171 87 95 125 81 110 64 187 184 133 176 31 213 247 116 140 129 127 67 41 81 133 114 64 70 107 28 195 98
5008I8K3M8l7j7m3J91p8j48N3j0J8Q9l7K9j05P2l8p8R7J64j42K7q8O9qk8k6rJ10J7%j06M4
$$ 98 121 169 132 115 72 263 185 37 90 80 98 187 150 179 74 146 108 30 127 291 149 176 88 157 149 121 95 86 196 213 213 107 151
4621A51J72j15j58J12m2r1L5M5lQ2p2K3QJ0o8m7J16M3m7J4n3O5j40J12j07Q4L1j06N5r4J13
$$ 151 323 208 50 162 120 29 64 109 106 188 116 139 147 157 89 42 158 201 154 168 115 180 40 152 45 129 160 54 109 15 128
4257A28O7N3j71N5M3L7k8j2n5Pm3R4J22O0k71O1lNQ0k03J66q3q9N1J48L4o5J01k72J60j15
$$ 128 195 248 77 132 175 212 184 172 117 124 81 175 297 357 86 147 144 149 229 26 192 109 20 71 219 253 188 289 17 177 62
3893F2J96J83j55j11J06m0j18o7k5N1m0OJ66Nr5K3q5k4R6pL8j57J75Oj68J73J12j44Q4L7j00
$$ 62 258 441 286 175 281 241 123 56 31 82 42 48 214 219 124 147 62 38 134 127 165 8 183 189 21 194 306 162 246 283 183
3529A83J2j15J09Q1j50j2N9RK9m5qn8J1R9m9o1J37k5%l9l4k0m1O3o6O3mL1j28J09O4r8M0J17
$$ 183 195 80 189 270 120 108 167 176 205 160 152 94 105 204 155 94 231 206 206 167 133 113 72 135 69 132 128 159 31 140 204 106 146 263
3130B63o0m3L6L3o6j14L8P8q2K5K6j0J2P2j13N1o3M8j24R8Q4K1o1k9m1O3J6j32N1jO9q5J9
$$ 263 203 160 196 229 163 49 87 165 83 108 134 124 136 208 95 146 83 131 7 105 189 210 149 120 79 142 158 26 77 76 145 60 79
2743G9o8J29J18lq9o0Nq7R1n7L8J03O2n2o8Ql6N7K06k56l3k1P5q1J04o8L2JK2o8J23K6j12
$$ 79 11 140 258 255 166 106 111 24 115 58 96 199 261 209 141 149 113 170 376 120 87 66 141 60 164 96 128 129 151 83 206 232 120
2355A20o8J68j71J9J27jj13l3R7J21j84J07j3L0J9p7j17M5j5m5J80q5L9O7l8j10N0jj4l3N1
$$ 120 52 220 49 68 195 194 81 48 145 266 82 189 176 206 225 148 31 76 61 16 196 111 150 217 179 69 119 118 104 71 122
1992A22l5L7J6J34Kk11J04Lq8O7J3r5M6J7M9o8NlJJ9j3k8l7N1r7P7J09J9k8o4J01j91R7j17
$$ 122 87 124 140 274 276 65 169 172 84 151 164 69 115 132 181 113 118 115 116 135 122 94 57 108 11 88 197 216 188 124 225 34 131 14
1592A4K58K2j28L0j17O4j8l5J1J29j69L0M2o1LJ68O6r9m1n4K3J21j45k3lj7l0L0LP3k7MK0
$$ 14 272 294 166 196 79 143 125 90 101 230 61 91 133 72 75 243 309 210 169 115 138 259 114 91 88 71 41 71 74 147 120 124 144
1205A44K9O2p7RK0q0J14j45P1O8m6l4O0j72rK17J2m5n1j02N1J57M1r4r0Nr7J07L0k0K4M2j17
$$ 144 173 235 158 167 187 107 221 76 147 215 169 135 195 23 14 231 243 198 147 45 96 253 294 200 110 115 18 125 155 135 159 201 84
818H4n3J63M5q4o4J6K3O3n1lo3J07k6n3J7n9R2j14J44qJ15j28n1R0r8J35j87J42p5qj1R5J25
$$ 84 31 194 239 155 91 107 130 193 142 139 76 183 157 104 121 62 154 40 184 176 291 163 112 202 104 239 52 194 119 111 100 195 320
430C20k55O9k9N8j02J06Rnl9m0L5m2R5R6q0o9k5J81j6j09J48j29j7j33L3J18P9j45K5r5qL9
$$ 320 65 134 105 163 61 167 176 171 132 92 127 85 180 276 196 127 102 283 267 158 306 177 160 27 60 178 257 112 137 42 34 73
55G3N9j29O2J3O5j07M2J6k3OL8K1J22o1r0r8P5Q6j04J2L2
$$ 73 132 3 65 78 143 36 78 94 71 77 115 136 258 197 107 9 84 170 66 78 110
-192A10
##PAGE=	F1=-14818.1
##FIRST=	25164.767445380970457,	5806.2096540000038658,	0
##DATA TABLE=	(F2++(Y..Y)), PROFILE
5806A13J45m2q6J21j82l3K3J16o5m0O2N1%rl0q5%M8j6N6q6K7L6P0K2j33J53j60Q8K0N3o3r3
$$ 113 258 216 130 251 69 36 59 175 110 70 132 183 183 174 144 59 59 107 91 147 61 88 124 194 216 83 236 76 164 184 237 174 81
5419H1P1J1o1k1mk2R8q6MP1k1j0L1P4p8Nj2k3J67Qj48J4Ol6n6j1O1j0Qr0P0J1o4R2k6oN6o8
$$ 81 152 163 102 81 77 55 153 67 71 142 121 111 142 216 138 143 131 108 275 283 135 149 155 119 63 52 113 103 111 21 91 102 38 130 104 98 154 86
4973H6j5NJ70p8j26N6l4K3J13m3Nj21J50j9r2J3J02j4n2m0L0K6J6p2J4R6O2k8j52J02J58j18
$$ 86 71 76 246 168 42 98 64 87 200 157 162 41 191 172 80 93 195 181 129 89 119 145 161 89 103 199 261 233 81 183 341 223
4597B23j81J73j27l7%kL7Q5k9RM1r7j5m5J23J3m2M4o8N7j55J21o9P3M1q3J9r1J13P9Q8j93
$$ 223 42 215 88 51 51 49 86 171 142 151 192 95 80 35 158 171 129 173 105 162 7 128 59 132 173 90 109 18 131 210 298 105
4222A05J9N1K6n2k2J9J0p7Q9J18%k10J6K0M8P8j66J36n1j19M6J07M5q4J29k56J57o5J13K48
$$ 105 124 175 201 149 127 146 156 79 168 286 286 76 92 112 160 238 72 208 157 38 84 191 236 152 281 25 182 117 230 478
3870D78j98q2J18l9j95Ko4K1rkJ84L4m5Qj26k1R1J4K3j64J42J1j12J28J31j13L4J1j18K8p1
$$ 478 280 198 316 277 82 84 20 41 32 30 214 248 203 211 85 64 155 169 192 28 170 181 69 197 328 215 249 260 142 170 99
3506I9R4P7j57j3P4l4N0l1m6nK4P3o3m9J21mK5n8m5nkJ5n9M5J6Qo6M0N3m6qJ23q1m8N6Op5
$$ 99 193 270 113 100 174 140 190 159 113 108 132 205 142 93 214 210 235 177 132 127 125 140 81 126 142 150 84 124 177 131 123 246 165 117 173 179 104
3071A04r9J01Q0j29M3Q7o3p2J28l6N8o2o5m5Q6K8M7j7m9qM6l1j13J34j6J4j26Q2o3J00J18
$$ 104 5 106 186 57 100 187 124 52 180 144 202 140 75 30 116 144 191 174 125 117 163 132 19 153 137 151 25 107 44 144 262
2708B62m4o4n9pp4R6n9K5J80po5p1L5m2Q5J81k49k2n5R7k0O7o5J7%J2j06J22N3j25l8J62j33
$$ 262 218 154 95 88 14 110 51 76 256 249 184 113 148 106 191 372 123 101 46 143 123 190 125 142 142 154 48 170 223 98 60 222 89
2320H9n0J35M0j15o5J08J17j73J03L2K9k0r2j04k6Q5p0J81q0M7M2n5q8K0K1Rj9M5l4K1J9J76
$$ 89 39 174 214 99 34 142 259 86 189 221 250 230 138 34 8 93 23 204 124 171 213 158 70 90 111 120 101 146 112 133 152 328
1945C28k5k67R1J10j18R2j4j09L4L5K4j06M3L8l6L7j4r2K8J05j24N8Q3M4m1q5Q0j57O8r3K54
$$ 328 303 36 127 237 119 211 197 88 122 157 181 75 118 156 120 157 143 51 79 184 60 118 201 245 204 119 199 42 110 17 271
1581B71Qj73L8p1P5lo4M5P5r1n5J29q1O0Q9nq4KL5m8O1j53lM5Ll1rO2K4j29L3R6L9L6p1K9
$$ 271 279 106 144 73 148 145 81 126 201 110 55 184 103 163 252 247 163 165 200 152 213 60 57 102 105 74 65 127 151 22 55 151 190 226 155 184
1158A84qj04P4o6J04pJ2m8L8j54j4J99J9k4m2r9j4J52N9k0o5n9j04J03O3k9JN7j30k0J20N7
$$ 184 176 72 146 80 184 177 189 141 179 25 11 210 229 205 163 64 50 202 261 241 176 117 13 116 179 150 151 208 78 58 178 235
783B35k8r0j0oJ01o2n9J1J01oo4j9n7J27j28J56l8J14j09j08M3o7J06j03J83r8k3k5J35R3
$$ 235 207 117 107 101 202 140 81 92 193 187 123 104 47 174 46 202 164 278 169 61 104 37 143 40 223 125 102 77 212 305
430C05k06M9q6P9o5P2L6j7n6nj2m3R5R7l0p2n6J93K0j83J50n3l4j02K3JJ09m9qj07J6qQ2j26
$$ 305 99 148 62 141 76 148 184 167 111 106 94 51 146 243 213 141 85 278 298 115 265 212 178 76 99 100 209 160 152 45 61 53 135 9
31IK5O8L2r0O1j1J0j9k0R7J28o6r1p8L4J07j45K4K9
$$ 9 34 102 134 44 105 94 104 85 65 162 290 224 133 55 89 196 51 75 104
-192A04
##PAGE=	F1=-14920.3
##FIRST=	25164.767445380970457,	5806.2096540000038658,	0
##DATA TABLE=	(F2++(Y..Y)), PROFILE
5806A02J73l5j49J23j48k3J6J31m2p2Q1K3l9K8k3n4jN2%K3j37R0j3R2M1j29J16j59J20K8O6
$$ 102 275 240 91 214 66 43 59 190 148 76 157 180 141 169 146 92 91 143 143 166 29 119 106 198 239 110 226 67 187 215 281
5442B81r7j04Q2j1m2n4J5k9Q5n8OP3Pj9P7jj25P2n5Q6J32k5j51pK4o0m3%R5r4N0n0N4m6N3
$$ 281 184 80 162 151 109 55 70 41 126 68 74 147 154 135 212 211 86 158 103 189 321 296 145 138 162 102 59 59 154 60 110 60 114 68 121
5032A21m8N3o6P9j11J5M4J46q7j03O6l3mJ16k9k2j34K31pr9l3J6J23j33k0pO8M7j00M0P9J08
$$ 121 73 126 60 139 28 43 87 233 146 43 109 76 72 188 159 137 3 234 227 128 95 111 234 101 81 74 142 189 89 129 208 316
4656C16p0j80J39J21j06j06J27j95J8l1j8L8R4J2KQ7j52j9l0R8j9l7P5o6M0j14Q3k9N2M4m9
$$ 316 246 66 205 326 220 114 241 46 64 33 15 53 147 159 161 248 96 77 47 145 126 89 164 98 138 24 107 78 130 174 125
4292A25k3n4O8R5J08j85j6N4j7l0k8N9J5r2O9J16o1j38j2L4P9O0r7J01l6j24K3O4N1r3J46
$$ 125 102 48 116 211 319 134 118 172 155 125 97 156 171 79 148 264 203 65 53 87 166 226 129 230 194 70 93 157 208 115 261
3928B61k27J59k5K8K83k30n1J12k8k34Q0o4N9n7l1J58O5J3j2j52k5Q2L8j3j44J05K0n3P5J50
$$ 261 34 193 168 196 479 249 198 310 282 48 128 64 123 66 35 193 258 271 259 107 82 164 202 189 45 150 170 117 192 342
3576C42j03Ok2j29N5l8R2M8j41jN0m0N9m7o5N2N2K8p5l6J00L4M2p7p9K0L5k6m6K2L1k8J9N5
$$ 342 239 245 223 94 149 111 203 251 110 109 159 119 178 131 66 118 170 198 123 87 187 221 263 186 107 127 162 136 90 112 143 115 134 189
3177A89k1k3n5J17j02jL4k9o2oR8P3j51L0J34j11q8J28L4L7o1j61N4O1k8N5M0p9L1M1q1l4
$$ 189 168 145 90 207 105 104 138 109 47 41 139 212 61 91 225 114 26 154 188 225 164 3 57 118 90 145 185 106 137 178 97 63
2801F3J53m1j7j02R0o8O0J07p8l4l4k4n2J10p6M7J63n9o2p8N9m5J08J53k12k0o3R9L1K2m9
$$ 63 216 175 158 56 146 78 138 245 167 133 99 75 23 133 57 104 267 208 146 68 127 82 190 343 131 111 48 147 178 200 151
2438A51j7M0Oj27R2O7j32k2J39q8p5J25P8j02n8N1R6j36R2O6K9n6q9o5mN4n6J47n2L2J5o8
$$ 151 134 174 180 53 145 212 80 58 197 109 34 159 237 135 77 128 224 88 180 246 275 219 130 65 61 115 59 206 154 186 201 133
2062A33n6k8M6K3jL3j2j7N9J79m9k59K9K02j42J08m1r7nO8pj26P6O5p1O5j6j03L9J52j45K8
$$ 133 77 49 95 118 117 150 138 121 180 359 310 51 80 282 140 248 207 110 105 173 166 40 116 181 110 175 159 56 95 247 102 130
1686A30P1N5m2r8L0j06M8o3K23J1j98L3k8P5Rp0O8lJp3J52r6J38k3q1m7O0Q6q1k7j08j3Q0
$$ 130 201 256 214 116 146 40 88 25 248 259 61 94 66 141 150 80 148 145 146 73 225 129 267 244 163 116 176 262 181 154 46 33 113
1299A13K2k6n9J30K2j12o4J38L1Ln3L4k3j00K5M0Q2p7P8l7K4j25m1J49K3J1k8j06l8R9Q4N3
$$ 113 135 109 50 180 202 90 26 164 195 198 145 179 156 56 81 121 203 126 204 167 191 66 25 174 197 208 180 74 36 135 219 272
923B72l8j33r0Q2R0l1j8N2j20LJ06N5%j01k2m2J50q4j00Q1R8Jq4l7o0J44r5J23o4J23q1n3
$$ 272 234 101 11 93 183 152 134 186 66 69 175 230 230 129 107 65 215 131 31 112 210 211 127 90 30 174 79 202 138 261 180 127
548A27j04J47j35QJ81r8L8j01J92K0j38K4j36O9L2J3L3j8n4j6l3m0R1J06J7r1o3J84O0k05
$$ 127 23 170 35 43 224 126 164 63 255 275 137 161 25 94 126 139 172 154 100 84 51 11 102 208 225 134 71 255 315 110
196A10R5L8m3r9J8r7J63J9l0j20M6m2Q5j36J2R3L3n5L3m1M8k6q2J60J13n7p7o4NJ14j94M0
$$ 110 205 243 200 101 119 22 185 204 174 54 100 58 143 7 19 112 145 90 123 82 130 104 22 182 295 238 161 97 102 216 22 62
-180F2M4
$$ 62 106
-192A06
##PAGE=	F1=-15022.6
##FIRST=	25164.767445380970457,	5806.2096540000038658,	0
##DATA TABLE=	(F2++(Y..Y)), PROFILE
5806H1J90j2k00R8p6k2RJ34j7q6P4op8P2k6j3j5O7K1j5j14O3l8J04N8j05N4j47J30M7P3j27
$$ 81 271 259 59 157 81 59 68 202 185 99 173 167 89 161 135 122 107 174 195 180 66 129 91 195 253 148 202 55 185 232 305 178
5431A78j18J19m1l8n6Qj6N8Oj0M2L1kR2p9j14J11p3J51R3n3j43l8L9n9l1NJ22j69R5MOn7J44
$$ 178 60 179 138 100 44 52 36 94 100 90 132 163 161 253 174 60 171 98 249 342 289 146 108 147 88 57 62 184 15 110 114 120 63 207
5032B07j05N8j45J15r1K0M5J26j07p8Q9l5l4R2om9o3K19%j04k4J3J44j51o8k3J06N7j18O6
$$ 207 102 160 15 130 39 59 104 230 123 45 134 99 65 157 151 102 39 258 258 154 130 143 287 136 68 45 151 208 90 156
4679A56O1J41j07j65J29O3p7k8O1k04L4n4O1m8R3M6mJ32j51n7j6N7m6l5R8n4J8o3N9qL3M2
$$ 156 217 358 251 86 215 278 201 173 234 30 64 10 71 23 116 162 158 290 139 82 66 123 77 42 140 86 104 41 100 92 125 167
4304A67rp3L%J11J11j52l6N3j02M5%K4K5q0L2J09j01p0j1K5J05K4j6O9m0j20MK9M9p1J31j81
$$ 167 158 85 88 88 199 310 158 122 175 73 118 118 142 167 87 119 228 127 57 46 71 176 200 184 253 213 93 97 126 175 104 235 54
3916E4J49Pn4K82k38k6R3j4j87R6o2R6r4n8J09Q9P2l6j62k9P9M9o3r4P1L1j2L1J77j20rl5
$$ 54 203 210 156 438 200 174 267 253 66 162 100 196 102 44 153 242 314 278 116 87 166 215 152 58 129 160 148 179 356 236 227 192
3541A92j28Q7l2R8nj05K8j0oM9p1p3J15P4k8p6l3P7P8N2r9j26M6O6m8k8nM9o5J06Q1q4l0r1
$$ 192 64 151 119 217 212 107 135 125 119 168 97 24 139 213 185 109 76 153 231 283 184 58 104 170 122 94 89 138 73 179 260 176 146 55
3142E5J00j19J27n4p1j1M5R5P0j56RJ49j41j9O0Q4j1o4p3LK9o4N2P5j07O4N1j13L7J52o8l0
$$ 55 155 36 163 109 38 27 72 167 237 81 90 239 98 79 139 223 212 148 75 78 107 43 95 170 63 127 178 65 102 254 186 156
2766A56n0P5p0J7Q5j01knk7n5J34r3N5J06p7m0r4P5l0J09J31j53m1m7R1P2k4k4o4R4Oj42O6
$$ 156 106 181 111 128 213 112 110 105 78 23 157 64 119 225 148 108 14 89 59 168 299 146 105 58 149 221 197 173 109 203 209 67 133
2379A33P3j43j2J00m9n5J06J12r7o5NO2r2Q4Q0K8p7o0l6J7Jj1J04j0mj3p4j4o1M7K6QJ8J5
$$ 133 206 63 51 151 102 47 153 265 168 103 108 170 78 162 242 270 193 133 97 114 115 104 208 198 194 181 107 93 32 79 105 113 131 146
1980A46o1J30J47o5k19l0K45j54J18o3o3o5J15m1j06Q4O6r5J01j4q5MJ95j64JP3M8m1q1k5
$$ 146 85 215 362 297 78 48 293 139 257 194 131 66 181 140 34 118 184 89 190 176 91 95 290 126 127 200 248 207 126 101
1628A01p5M9m5J83K8j78MmO4J6n7Q7r7Q9m5J30r3K11j46j60J1J13J04q0j05j7l4O4M6j4j33
$$ 101 26 75 30 213 241 63 67 63 127 143 86 173 76 165 120 250 157 368 222 62 73 186 290 210 105 88 54 118 164 150 17
1264A7K01O3r0j04R8J4m0k4J2j9p1pJ08L9j29J49rPr1q4Q7K6M3j0j09K3k8J08J08j3j93n5
$$ 17 218 281 191 87 185 199 159 135 147 128 57 50 158 197 68 217 208 215 124 40 127 153 196 186 77 100 72 180 288 275 82 27
888B7L3J09k2l0K6r4J7J11M3lj01j7p3K01j10p9R4J06j3j05l9o6J38l6P3p9J30m5Oq3J25k05
$$ 27 60 169 147 117 143 49 66 177 220 217 116 99 26 227 117 38 132 238 225 120 81 15 153 117 190 111 241 196 202 119 244 39
513C9J4J47q8J18j65K28o1p1J7j16mJ08m7J4%l8n3kL2j6J20M2j16l0J49R5j80NJ33m8j30J4
$$ 39 53 200 112 230 65 293 232 161 178 62 58 166 119 133 133 95 42 40 72 56 176 218 102 72 221 316 136 141 274 226 96 110
137A10m6J41K8m6j32R8p2Q4j41L8M9O6l3j7o8P0k1n8J32R6m7n3m8k1J15k13L6O5
$$ 110 64 205 233 187 55 153 81 165 24 62 111 177 144 127 59 129 108 50 182 278 231 178 130 109 224 11 47 112
-192A12
##PAGE=	F1=-15124.8
##FIRST=	25164.767445380970457,	5806.2096540000038658,	0
##DATA TABLE=	(F2++(Y..Y)), PROFILE
5806E2J93J5j69K3j1k5NJ29Jr4N5l0j08J17l2K5m4R6L1m8o0lm5J11O9q5Lj17J04P7P1j42j41
$$ 52 245 260 91 114 103 78 83 212 213 119 174 144 36 153 121 146 102 198 229 181 121 118 73 184 253 168 171 54 158 235 306 164 23
5419B3J78p5m4qm9J5K3P6l5oM4L1Q5j44k7Q9p1J70N6o2j28p5M8l0k8PJ32j61P2M6m6L2J43
$$ 23 201 126 82 74 25 40 63 139 104 98 142 173 258 114 87 176 105 275 331 269 141 66 114 84 56 63 195 34 106 152 106 138 281
5032B81j04J4j58R9k9j5L3J15j31n3J23o1l2L6J3o3J7J70kj02J1O4R9j33j30j4J35L7j30Q7
$$ 281 177 191 33 132 103 88 121 236 105 52 175 114 82 118 131 68 85 255 253 151 162 226 325 192 62 48 183 220 90 177
4679A77M2J53j27j31R8nm2L7lj28j8l6R6r2O1P2j6J66j26q3j2J5n5l6R6k8j4j9N1J4K2L5K0
$$ 177 219 372 245 114 212 207 165 202 199 71 53 17 113 21 82 154 138 304 178 95 83 98 43 7 103 75 61 42 93 107 129 164 184
4292A84j31P9p3J17J00j05k8M8j53P9M6n7M5n2nQ7r8k3jOJ23j5N9M1o4j11nJ8K7j0Q0j18J22
$$ 184 53 132 59 176 276 171 143 191 38 117 163 106 151 99 94 181 83 60 59 65 188 173 232 273 209 98 93 111 138 128 208 90 212
3905B12K7j27K44k07j8P2mp3N2n5J13j17o2M9R4J26o1j61k9R9L1j13j6L5L9QLK10j58j8j8
$$ 212 239 112 356 149 131 203 199 126 178 123 236 119 57 106 200 326 265 104 75 174 205 92 76 111 150 158 161 371 213 195 177
3541A77j14J08m8J05p0o1P0p4M3K6o0o0J27Q5q7n9n0N6J11O2j20j57M3R3l9j6k4P7p1J45Q5
$$ 177 63 171 123 228 158 97 167 93 136 162 102 42 169 254 167 108 58 114 225 287 167 10 53 146 107 91 67 144 73 218 303
3177C03j25m5r9P9m5J79j52l0j3K9R5P5j44nJ29j50K1L3J07p3p1M2n7kk7N3K0j18R2O1j17
$$ 303 178 133 34 113 68 247 95 65 52 81 176 251 107 102 231 81 102 135 242 169 98 140 83 81 54 107 127 9 101 162 45
2813D5Q0J35q0k7pN2n5k2N7j15K6J3j1o3J38j00L6L8n7J3m3MK2N3J21r1p7j7Q1J00o6J0j20
$$ 45 125 260 180 153 146 198 143 121 178 63 89 102 91 28 166 66 102 140 83 96 53 57 79 132 253 162 85 68 149 249 183 193 73
2426G3J39Pj50O0Q1j65PM8k9j2R6J37r7q4k0K0n5P7P2K9p7j9k6K7m0M9O0L4m7m1o8K5m9J3
$$ 73 212 219 69 129 210 45 52 100 71 59 155 292 195 111 91 111 56 133 205 234 157 138 112 139 99 148 208 242 195 154 86 111 62 75
2027G5J6kOK9p3J96R1p2j76n3K33j53J19o9j7j06J34p1p0Q3M5r9J36j0p7l6K34j72j6Q2J7
$$ 75 91 89 95 124 51 247 338 266 90 37 270 117 236 167 150 44 178 107 37 120 165 66 202 192 115 79 313 141 125 207 224
1663B24m2l7j4j31O6l2J43N0j19l7%M3K2m1J03j80J48pR8o8K57k34j33m0J42J00n2j43L8l4
$$ 224 182 145 131 0 66 34 177 227 108 71 71 114 136 95 198 18 166 159 257 189 446 212 79 39 181 281 229 86 124 90
1311I0L2P0Nj62J96J28r9j35P7Qr4J7m2Jl2j0J25rj50K06L1k0n0j24J4L4N9Pq2P9j22J03J37
$$ 90 122 192 197 35 231 359 260 125 202 210 116 133 91 92 60 50 175 166 16 222 253 233 183 59 73 107 166 173 91 170 48 151 288
923B88Nk15k1k6J09%l4j4m7J3J15K3k4r1Ln7K01j23n0R2J24m3j19l5o7J04L5L1q6J26oL1q9
$$ 288 293 78 57 31 140 140 106 92 45 58 173 196 172 81 84 27 228 105 55 147 271 228 109 74 7 111 146 177 91 217 211 242 153
536A53O7j67J4R1o9J83k00K38j29j9L0r0j9R0j01KL4k3j7J0N8r6J11L8j40M5Q8J15j38o7K08
$$ 153 220 53 67 158 89 272 72 310 181 162 192 102 83 173 72 74 108 85 68 78 136 40 151 189 49 94 182 297 159 92 300
172C00n1j85QM3J31nn8j20J53j10Q9j39M1J0J09k4p2r4Q1j3MO4Q4m3k4l0l9J11j76j0Q2
$$ 300 249 64 72 115 246 241 183 63 216 106 195 56 97 107 216 192 120 26 107 94 98 162 246 203 179 149 110 221 45 35 117
-192A17
##PAGE=	F1=-15227.1
##FIRST=	25164.767445380970457,	5806.2096540000038658,	0
##DATA TABLE=	(F2++(Y..Y)), PROFILE
5806B1J79L9r6j8jl1J0J21Qj07L0m0r5J22k8M9q5J34K2o9jp6l4J15O5p7j9o4L8J13O2j32j20
$$ 21 200 239 143 125 124 93 103 224 232 125 155 115 20 142 114 163 78 212 234 165 164 88 54 169 234 157 138 74 112 225 287 155 35
5419C5J88j09m9N6o6kj6J35o0n7M4O6O6j80Q0L8n4J51K5m4j08j13M0J9l8J7J18j15K8P1q9
$$ 35 223 114 65 121 55 53 37 172 112 55 99 165 231 51 131 169 115 266 291 247 139 26 66 85 47 64 182 67 95 166 77
5055G7J47J06q5l3j40O6K1m9K6J10j47l8J58j04jk5J0j6M6R8j6r4O0J09N8j13j60pJ65lj41
$$ 77 224 330 245 212 72 138 159 110 136 246 99 61 219 115 114 89 99 83 129 227 211 117 177 286 344 231 71 64 229 226 85
4691H5R6K9J40j23r5P1p2j5P9m1m2o8NR2j20K7R1l3J82q1r0k3j5k6rRL4m8j0M2N9J6K4L1j80
$$ 85 181 210 350 227 132 203 131 116 195 154 112 44 49 141 21 48 139 106 288 207 117 94 79 53 44 53 87 39 29 71 130 146 170 201 21
4280B1J55j31R5R0o3QM5p1m0R3j47P8k2j8L7l9j4Nj3J29m9J21J6j06r8jL9k8P1K0n0R8K5j81
$$ 21 176 45 140 230 167 175 220 149 109 202 55 133 111 93 130 91 77 82 69 198 149 270 286 180 82 81 120 92 163 183 133 231 256 75
3881G5J71j42k0N6J2M3j7m3J03j31l4LO4J65q2j50j8J37k2j07L3JM0J3%K28j95l0J9j03J24
$$ 75 246 104 84 140 152 195 178 135 238 107 73 76 140 305 223 73 55 192 170 63 96 97 137 150 150 378 183 153 172 69 193
3517A93p3J11j34j2J07q5N7oj6o6J18R1j37k3q1K9J18P7j37m5o6R2qk1mR4o2J35O4j45n2p5
$$ 193 120 231 97 85 192 107 164 158 142 76 194 285 148 125 44 73 191 268 131 86 20 112 104 83 79 173 111 246 310 165 113 38
3142C8Q1L3J73k30L3n5j1R6Q7j04j6Q6j44L0M4J02j32p6J46j15k0N5P0j01MK8L5j02R4J03
$$ 38 119 152 325 95 128 73 62 158 245 141 125 211 67 97 141 243 111 35 181 66 46 101 171 70 74 102 137 35 129 232
2790B32n4rlK3j9m3K7j28N2J1J8n2R6r0kk2kQ2j4j3L7k9J20n2r7J3O3J12r3M6j77J62Pj39
$$ 232 178 169 166 189 170 127 154 26 78 89 107 55 151 61 59 37 35 117 103 90 127 98 218 166 69 82 145 257 164 210 33 195 202 63
2391F3O2R6j47%km2L7R3J51r6j06k9qm3O5M7L5o1J9l0L4n7R7K3P2q7o1m6M1l8Rqk6%J2M1J59
$$ 63 125 221 74 74 72 30 67 160 311 215 109 80 72 29 94 141 176 115 134 104 138 81 178 201 273 186 125 79 120 82 91 83 57 57 69 110 269
1956B69K5p1j42n5J92j35J09n6K4p5Q0r2k7P4J1q3J58ro8p5K65j59j8Q2l0m9J3M0j59J6j0
$$ 269 294 223 81 26 218 83 192 136 160 85 165 73 46 120 131 48 206 197 129 54 319 160 142 224 194 145 158 198 39 55 45
1592D5J02P1m7p4%OL4l5J15j62R7K8P0k7K57k26n3j63J23P9kj43M5k5J0R6K7j43J10K00j30
$$ 45 147 218 171 97 97 103 137 102 217 55 152 180 250 223 480 254 201 38 161 240 238 95 140 115 125 221 248 105 215 415 285
1229B85j53P3J6j41O2r2jJ5j6J23n5r1J93O7n2nj44n9M7N2K0j9J07j68P0J42J1j97jm9O5L2
$$ 285 132 205 221 80 142 50 49 64 48 171 116 25 218 285 233 228 84 25 72 124 144 125 232 64 134 276 287 90 89 40 105 137
853A37l3m3J2j9J02Mn3o9K8jJ49j01n6R7J48q2j14l6n9M3J06J3q8J10K2L1j19rr5N6K7k5J99
$$ 137 104 61 73 54 156 160 107 38 66 65 214 113 57 154 302 220 106 70 11 54 160 173 85 195 217 248 129 120 25 81 108 83 282
466B82k08K26j63KN4p2kK5j07j6O6k3P2k2O7j08N6J2j06R9J4J15r7q2K34n5k22mJ00J40m6
$$ 282 74 300 137 139 193 121 119 144 37 21 87 64 136 114 181 73 129 141 35 134 148 263 166 84 318 263 41 37 137 277 231
102B31o4p4J82j47Q9j28K6j3J45j8j23r3Q9k1N6j0Q5n1Nj3l9R6j35m8R1
$$ 231 167 93 275 128 217 89 115 102 247 229 106 13 102 81 137 127 212 161 166 153 114 210 75 27 118
-192A18
##PAGE=	F1=-15329.3
##FIRST=	25164.767445380970457,	5806.2096540000038658,	0
##DATA TABLE=	(F2++(Y..Y)), PROFILE
5806A2J32N4k6j1k1l7K2J16Nj32Jk4m2P6pO4j41J73pp3N0j37rJ14M5p7j1ol4J37M9j01o4J44
$$ 12 144 198 172 161 140 103 125 241 246 114 115 91 49 125 118 182 41 214 207 134 184 47 38 152 197 120 109 103 69 206 255 154 90 234
5407B34j32m4J16n0n0m0J60p5q0K1Q4L8j28J16k0k3J13j6J1q9r1m6Q2o5L9Q2o3j2Q6j04K40
$$ 234 102 58 174 124 74 34 194 119 39 60 144 182 54 170 150 127 240 224 235 146 55 9 91 26 65 147 84 72 158 54 294
5043B94N3n6p5j16M1N8p4K0J10j43m3J87j55M3o6j4P6K2J8l8q3J12J42K8j05j53MJ82m4j47
$$ 294 347 291 216 100 141 199 125 145 255 112 69 256 101 144 78 64 140 162 180 142 59 171 313 341 236 83 87 269 225 78
4691G8Q8K4J06r9n7N7j18j5R6l2J3r0L1P4j47J0J07n3J77j6q8n2j7kqo2J23m3p2J8J32RNK9
$$ 78 166 190 296 197 140 197 79 64 160 128 141 51 82 156 9 19 126 73 250 234 146 94 77 75 67 5 128 85 13 31 163 172 177 206
4292B06j39J45j62M2R7m6O5M5qj48J34j97Q8%%m1L4j1J2m2J30p5J65nj56q2J4Q0r5J39l0J2
$$ 206 67 212 50 92 189 143 208 253 245 97 231 34 122 122 122 81 115 104 116 74 204 129 294 289 133 51 65 145 50 189 159 171
3916A71R6mj86N3n4jK7N7J03r2l2O8j39K0%j1J80r3j35M1J45r6ook2L0J7J5K18k13m5O2r8
$$ 171 267 263 77 130 76 75 102 159 262 170 138 206 67 87 87 76 256 163 28 69 214 118 112 106 84 114 131 146 364 151 106 168 70
3529G0J35j00J18j65L5J10m9M0l9J5p4J05R8j69K9j07pR0R2j42P5n4J9jn4O0Q5p3J13K9j45
$$ 70 205 105 223 58 93 203 154 194 155 170 96 201 299 130 159 52 45 135 227 85 160 106 125 124 70 130 215 142 255 284 139
3165A39m8m8J19P0J54k89P7q3p0R3J03l6k4M2j41J0Q2P5j65OJ29j67NJ10Q3j60Q2Kl6q5Q6
$$ 139 91 43 162 232 386 97 174 91 21 114 217 181 157 199 58 68 150 225 60 66 195 28 33 143 226 66 148 150 114 29 115
2801A15O5J3J1m4oL9m8Lj35P0j2N2l1K1n9l1O2l3R3j5K1K3r5J14m4o9J6M2J01r3P5k10J50
$$ 115 180 193 204 160 154 193 145 148 13 83 71 123 92 113 54 23 85 52 145 130 151 174 79 193 149 80 96 138 239 146 221 11 161
2414A61Mj08N8J21r5l2j4m7K4Q6J55q8j21k9ql8J7J9M3l1L6l7M4l7J00lR8j13o2k3L8m0L9
$$ 161 165 57 115 236 141 109 95 48 72 158 313 225 104 75 67 29 46 65 108 77 113 76 120 83 183 180 278 165 103 80 118 78 117
2027A17l3m8oQJ72O6l8o6j19l1J28j00Q6k0M0k9J5r1M8K4k6n1J51j2m1j09K75j21j2O9p9n4
$$ 117 84 36 30 38 210 276 238 172 53 22 150 50 136 116 156 127 142 51 99 123 97 46 197 185 144 35 310 189 177 246 167 113
1651A13M4R1j61l4K0M9R0K7r5Jn2M8l5J16j39M8N2N5J5K11j33k2k44O8M9N6j28K4j4OJ29M2
$$ 113 157 248 87 53 73 122 212 239 144 145 93 141 106 222 83 131 183 238 253 464 331 309 65 133 182 238 110 134 120 126 255 297
1276B97j11j0K65j77j51P7L1j51P9m9q7N5l0J15r4j9J64Q8p7L4j40p1K3K1K5O2J11k09O3J21
$$ 297 186 176 441 264 113 190 221 70 149 100 13 68 38 153 59 40 204 292 215 249 109 38 61 82 107 169 280 71 134 255
923B55Lj56J1m5OO1k3n4N4m5N7rp7j8L6M1Q9k8q8Q6J65j19r1l8o2J5J32J6q4R1L0J8j50n0
$$ 255 258 102 113 68 74 135 112 58 112 67 124 115 38 20 56 97 186 158 70 156 321 202 111 73 11 26 158 174 90 181 211 229 79 29
524B9j3P6l5M6J64k00K03j54j5P3n6J2l5K9o2J9m6J54n8O3r1Lk0J4Q3n6R2n8n3K13o0j72O
$$ 29 16 92 57 103 267 67 270 116 101 174 118 130 95 124 62 81 35 189 131 194 103 106 86 100 183 127 219 161 108 321 261 89 95
137I5L4J54p6o3j5J90j73P4j05jk2J67j0j57l7R1m6O2p6R9p2L2jj3O7j00p0Q6
$$ 95 129 283 207 144 129 319 146 220 115 114 92 259 249 92 55 146 100 162 86 185 113 145 144 131 198 98 28 114
-192A14
##PAGE=	F1=-15431.6
##FIRST=	25164.767445380970457,	5806.2096540000038658,	0
##DATA TABLE=	(F2++(Y..Y)), PROFILE
5806D5M3N7K5J1l6l6L9J15qj51m0K5k6M2K4P7k00J95m4o3Q7j74K0J07Ro0QL9p1J22L7n8k1
$$ 45 88 145 170 181 145 109 148 263 255 104 64 89 63 105 129 206 6 201 157 94 181 7 27 134 143 83 91 130 59 181 218 160 139
5419A39R1j39k9J66k9j01l7J41p4o6j0P6mj7R4p7K6Q7r6R0p5n1n5N5q6M8K6nm5R1o5K68ok3
$$ 139 230 91 62 228 199 98 61 202 128 62 52 128 124 107 201 124 150 237 141 231 156 105 50 105 19 67 93 88 43 134 69 337 331 308
5020C08j00r3K1Q5q8J2J15j22o3J99j96Q1p9l2J51k2m5m1o6J29J62Lj13j21K8J69p1j37N8
$$ 308 208 115 136 221 133 145 260 138 75 274 78 159 80 48 199 177 132 91 25 154 316 319 206 85 113 282 211 74 132
4679A32K8O1o1oN1j26m1Q0J9J8q5M1M9j29jQ9p2J57N7q2r6Kmpj2J16l5j21J4J58Pk9K5p5J07
$$ 132 160 221 160 154 205 79 38 118 137 155 70 111 160 31 30 119 47 204 261 179 83 85 81 74 62 178 143 22 36 194 201 172 197 122 229
4269B29j76j1J32p3J31M7K8k19J65j71L9J1L0j21Q7MK1q5J38r3J90k1k00m5J7J22j02J28o9
$$ 229 53 42 174 101 232 279 307 88 253 82 121 132 162 41 128 132 153 68 206 113 303 282 82 37 54 176 74 202 133
3928A33N8J20m9j50m8J4M6k6J08J10j54l0J8j25O8J7p5J59r3p7J01J01j48Q2o2l1J5K7L2J81
$$ 133 191 311 262 112 64 78 124 98 206 316 162 132 150 25 93 110 35 194 101 24 125 226 78 160 98 67 82 109 141 322
3576C22k05n9J02q9J28j18J26j20M6O6oK1o7J7o1Q5J02j75Q6j20k3J3J03j28J74l2mk5j03
$$ 322 117 58 160 71 199 81 207 87 133 199 193 214 147 164 103 188 290 115 201 81 58 71 174 46 220 188 184 159 56
3236E6J36O2r9Q6mj26l7m0J72R2J30l26J01q9q2K2J15N1k7Rj38m0J32L5j52R8M8j49L6R7Q1
$$ 56 192 254 155 241 237 111 74 34 206 298 428 102 203 114 32 54 169 220 193 202 64 24 156 191 39 137 185 36 72 169 250
2872B50j27Q9lj11p2O2K9R1K7j02k5J03m4j1j35Q1m5Q0qp0j2K1J05r0Q1l5O9Rj31R5o1onK5
$$ 250 123 212 209 98 26 88 117 208 235 133 108 211 167 156 21 102 57 137 129 59 47 68 173 83 164 129 198 207 76 171 110 104 99 124
2473A24P2n9Q4j85J00qo5L2J55m5o4pl6k4P1J47p2j17l2jj9m1N0j0J9Qj0L0MN7j5J09j23l4
$$ 124 196 137 221 36 136 128 63 95 250 205 141 134 98 74 145 292 220 103 71 70 51 10 60 50 69 77 67 97 101 158 143 252 129 95
2074I5j7K7n3R7n8n7j6J05J87l8q9o1r3K3L5n1N2K3K7Ll2n0J16l3o2k9J22k1J2j25K47p0k
$$ 95 78 105 52 149 91 34 18 123 310 272 183 122 29 52 87 36 88 111 138 141 109 59 175 142 80 51 173 152 164 39 286 216 214
1686B14N1j12n4L8J24j24o7M3j8J11R3r5Jj24N5k8J08j33K9N8O1L8J32oj6k89K0J3J05j05
$$ 214 265 153 99 137 261 137 70 113 95 206 299 204 205 81 136 108 216 83 112 170 231 269 401 395 379 90 110 123 228 123
1334A23j5mK1J68M4p2j37L06k26j16O8M2j03M2K7j10J4m4J02j04LJ53Q7r0O3j15n5nmJ4J30
$$ 123 108 104 125 293 337 265 128 434 208 92 160 202 99 141 168 58 72 28 130 26 29 182 269 179 242 127 72 67 63 77 207
970B07J03k50R5P6j8j08J7l4l0P7pp3R0m6j1j4n0J2K6N9L5P4j17M0J70j45n6l8p1P3N7K0o4
$$ 207 310 60 155 231 213 105 122 88 58 135 128 55 145 99 88 74 24 36 62 121 156 230 113 153 323 178 122 84 13 86 143 163 99
583I9P4J6Rj64O0m4M1p7J06J21j91J82j15n3P0l1J2l1J39j29mn2J71q0M1n7l4l0J09P6j07
$$ 99 173 189 198 34 94 50 91 14 120 241 50 232 117 64 134 103 115 84 223 94 90 38 209 129 170 113 79 49 158 234 127
219A27M9k2j2J64o7r0K3o9J57q7m9K1J94j79M5p8k7k3J72kj64J2J09o2K9j18J16j00N4PL2
$$ 127 176 154 142 306 239 149 172 103 260 173 124 145 339 160 205 127 100 77 249 247 83 95 204 142 171 53 169 69 123 130 162
-145A62L2p8p2O4
$$ 162 194 116 44 108
-192A08
##PAGE=	F1=-15533.9
##FIRST=	25164.767445380970457,	5806.2096540000038658,	0
##DATA TABLE=	(F2++(Y..Y)), PROFILE
5806G8l3M6M6L5l4k2N2J15l1j23o3M7n6L7M7Q9j90J33o8m9J06j16k7R2l3J1LN3p4Q2K9j4N
$$ 78 45 91 137 172 138 116 168 283 252 129 66 113 57 94 141 230 40 173 105 56 162 46 19 111 78 89 92 145 71 153 182 168 173
5419A73L3j28rK12j5j46k2J03o0o3l1Q4n2O9P4j22Q2J02k15J58o5j6m2K5p2J6l5M5n4Q0kK42
$$ 173 206 78 69 281 266 120 98 201 141 78 47 131 79 148 222 100 182 284 69 227 162 146 104 129 57 73 38 83 29 109 107 349
5043C49o0Mr8p6RJ00r4JJ23q8q6J89k15R8p1j8J74p0p0K5m7O1J74l3j34p7O0J29p8j02J2L3
$$ 349 289 293 195 119 128 228 134 135 258 170 84 273 58 156 85 67 241 171 101 126 79 140 314 281 147 70 130 259 181 79 91 124
4668A24J8k1O7M0j33l6M7N7ro4L8K1q6OM8q2J26J23p5j45K5j8pM8J08l1j53N2J22K0p7K4j6
$$ 124 142 121 188 228 95 59 106 163 154 90 128 149 63 69 117 35 161 284 209 64 89 71 64 112 220 189 36 88 210 230 153 177 161
4280A61O1j77PJ36j36J86M9M1k40J81j48OJ3N4j68R7L5K7j39J61j06J98l3k27K7j0J42o7P0
$$ 161 222 45 52 188 52 238 287 328 88 269 121 127 140 194 26 123 158 185 46 207 101 299 266 39 66 56 198 131 201
3940B01j02Q5J58q9j11l2%P2p8J45J01j91m2k5k0K1K5o7R9p8pJ23L1j18P1q6l9oM8L9J27j78
$$ 201 99 184 342 253 142 110 110 182 104 249 350 159 117 92 72 93 118 51 150 72 65 188 219 101 172 86 47 41 89 128 255 77
3564G7n6J31p4R4j18J33n0M7LK2Oq5ok0N5J00j51J33j30l3n7J01p9K14rnn0j46J98L6j22M8
$$ 77 21 152 78 172 54 187 137 184 187 209 215 130 124 104 159 259 108 241 111 78 21 122 43 257 248 243 193 47 245 281 159 207
3189B07k6q6k7m4K10J09J11l38J06q2n5m5P3J37k8pj32n8J31oj19J64l2o7K0N7O4o6Q8pj62
$$ 207 181 95 68 24 234 343 454 116 222 140 85 40 113 250 222 215 83 25 156 150 31 195 163 96 116 173 237 171 259 252 90
2825I0p0M3oJ43M1j50%J31l8j5j44R9p1R4J2j58M3P0J15j27P2o8J10Mj43O8q5N8l6K4K7OP2
$$ 90 20 63 57 200 241 91 91 222 184 169 25 124 53 147 159 1 44 114 229 102 174 106 216 220 77 145 60 118 82 106 133 139 211
$$ [...]
-192A54
##END NTUPLES=	nD NMR SPECTRUM
##END=	
##END=	
