##TITLE=	Jan24-2022.92.ser
TM-VI-254, Na+unprotect. pyr. hsqc

##JCAMP-DX=	6.0	$$ MestReNova 14.3.0-30573
##DATA TYPE=	LINK
##BLOCK_ID=	1
##BLOCKS=	2    
##ORIGIN=	Mestrelab Research S.L.
##OWNER=	hrzepa
##$MNOVA/LINK_BLOCK_TYPE=	ITEM	$$ NMR Spectrum
##$MNOVA/ITEM/POLYGON=	(XY..XY)
5321,5835
8722,5835
8722,8208
5321,8208
5321,5835
##$MNOVA/ITEM/Z=	0
##$MNOVA/ITEM/ANGLE=	0
##TITLE=	Jan24-2022.92.ser
##JCAMP-DX=	6.0	$$ MestReNova 14.3.0-30573
##BLOCK_ID=	2
##DATA TYPE=	MNOVA NMR VIEW DATA
##DATA CLASS=	MNOVA VIEW DATA
##$MNOVA/2D/THRESHOLD=	4.7505002021789550781
##$MNOVA/ITEM/ZOOM/X=	-0.57569381887933257502,	10.597560000003785063
##$MNOVA/ITEM/ZOOM/Y=	-9.5463849045685140737,	230.0176000018207958
##END=	
##TITLE=	Jan24-2022.92.ser
##JCAMP-DX=	6.0	$$ MestReNova 14.3.0-30573
##BLOCK_ID=	3
##DATA TYPE=	nD NMR SPECTRUM
##DATA CLASS=	NTUPLES
##NUMDIM=	2
##ORIGIN=	Bruker BioSpin GmbH
##OWNER=	nmr
##.OBSERVE FREQUENCY=	400.20200099999999566
##.OBSERVE NUCLEUS=	^1H
##.SOLVENT NAME=	MeOD
##.PULSE SEQUENCE=	hsqcetgpsi2.ph
##LONGDATE=	2022/01/24 17:35:00.000
##.ACQUISITIONMODE=	SIMULTANEOUS (DQD)
##$ORIGINAL FORMAT=	Bruker XWIN-NMR
##$MNOVA/SCALES_VERSION=	9
##$PARAMETER FILE=	(acqu2s, ASCII, /private/var/folders/f6/rjf_tdyn2v98c5c0wvkgn4s80000gn/T/mK0DqQ$3QWe6Czj+dmD7cA/92/acqu2s, 0)
$$ ##TITLE= Parameter file, TOPSPIN		Version 3.2
$$ ##JCAMPDX= 5.0
$$ ##DATATYPE= Parameter Values
$$ ##NPOINTS= 241	$$ modification sequence number
$$ ##ORIGIN= Bruker BioSpin GmbH
$$ ##OWNER= nmr
$$ $$ 2022-01-24 17:44:29.220 +0000  nmr@CZC2439F63
$$ $$ /opt/topspin/data/agmb/nmr/Jan24-2022/92/acqu2s
$$ $$ process /opt/topspin3.2/prog/mod/go
$$ ##$ACQT0= 0
$$ ##$BF1= 100.63037
$$ ##$FnMODE= 6
$$ ##$NUC1= <13C>
$$ ##$NusJSP= 0
$$ ##$NusT2= 1
$$ ##$NusTD= 240
$$ ##$O1= 11069.4607123918
$$ ##$SFO1= 100.641439460712
$$ ##$SW= 240.006397974962
$$ ##$SW_h= 24154.5893719807
$$ ##$TD= 240
$$ ##END=
$$ 
##$PARAMETER FILE=	(acqus, ASCII, /private/var/folders/f6/rjf_tdyn2v98c5c0wvkgn4s80000gn/T/mK0DqQ$3QWe6Czj+dmD7cA/92/acqus, 0)
$$ ##TITLE= Parameter file, TOPSPIN		Version 3.2
$$ ##JCAMPDX= 5.0
$$ ##DATATYPE= Parameter Values
$$ ##NPOINTS= 12	$$ modification sequence number
$$ ##ORIGIN= Bruker BioSpin GmbH
$$ ##OWNER= nmr
$$ $$ 2022-01-24 17:44:32.700 +0000  nmr@CZC2439F63
$$ $$ /opt/topspin/data/agmb/nmr/Jan24-2022/92/acqus
$$ $$ process /opt/topspin3.2/prog/mod/shimcntl
$$ ##$ACQT0= 1000000
$$ ##$AMP= (0..31)
$$ 100 100 100 100 100 100 100 100 100 100 100 100 100 100 100 100 100 100
$$ 100 100 100 100 100 100 100 100 100 100 100 100 100 100
$$ ##$AMPCOIL= (0..19)
$$ 0 0 0 0 0 0 0 0 0 0 0 0 0 0 0 0 0 0 0 0
$$ ##$ANAVPT= -1
$$ ##$AQSEQ= 0
$$ ##$AQ_mod= 3
$$ ##$AUNM= <au_zg>
$$ ##$AUTOPOS= <54 >
$$ ##$BF1= 400.2
$$ ##$BF2= 100.63037
$$ ##$BF3= 400.2
$$ ##$BF4= 400.2
$$ ##$BF5= 400.2
$$ ##$BF6= 400.2
$$ ##$BF7= 400.2
$$ ##$BF8= 400.2
$$ ##$BYTORDA= 0
$$ ##$CAGPARS= (0..11)
$$ 0 0 0 0 0 0 0 0 0 0 0 0
$$ ##$CFDGTYP= 0
$$ ##$CFRGTYP= 9
$$ ##$CHEMSTR= <none>
$$ ##$CNST= (0..63)
$$ [...]
$$ 0 0 0 0
$$ ##$ShimPowMaxUC= (0..63)
$$ 130000 130000 130000 130000 130000 130000 130000 130000 130000 130000 130000
$$ 130000 130000 130000 130000 130000 130000 130000 130000 130000 0 0 0 0
$$ 0 0 0 0 0 0 0 0 0 0 0 0 0 0 0 0 0 0 0 0 0 0 0 0 0 0 0 0 0 0 0 0 0 0 0 0
$$ 0 0 0 0
$$ ##$ShimPowMaxUG= (0..63)
$$ 524287 524287 524287 524287 524287 524287 524287 524287 524287 524287 524287
$$ 524287 524287 524287 524287 524287 524287 524287 524287 524287 0 0 0 0
$$ 0 0 0 0 0 0 0 0 0 0 0 0 0 0 0 0 0 0 0 0 0 0 0 0 0 0 0 0 0 0 0 0 0 0 0 0
$$ 0 0 0 0
$$ ##$ShimPowRcbType= 3
$$ ##$ShimPowRes= (0..63)
$$ 1e-20 1e-20 1e-20 1e-20 1e-20 1e-20 1e-20 1e-20 1e-20 1e-20 1e-20 1e-20
$$ 1e-20 1e-20 1e-20 1e-20 1e-20 1e-20 1e-20 1e-20 0 0 0 0 0 0 0 0 0 0 0 0
$$ 0 0 0 0 0 0 0 0 0 0 0 0 0 0 0 0 0 0 0 0 0 0 0 0 0 0 0 0 0 0 0 0
$$ ##$ShimPowRng0= (0..63)
$$ 1 1 1 1 1 1 1 1 1 1 1 1 1 1 1 1 1 1 1 1 0 0 0 0 0 0 0 0 0 0 0 0 0 0 0 0
$$ 0 0 0 0 0 0 0 0 0 0 0 0 0 0 0 0 0 0 0 0 0 0 0 0 0 0 0 0
$$ ##$ShimPowRng1= (0..63)
$$ 1 1 1 1 1 1 1 1 1 1 1 1 1 1 1 1 1 1 1 1 0 0 0 0 0 0 0 0 0 0 0 0 0 0 0 0
$$ 0 0 0 0 0 0 0 0 0 0 0 0 0 0 0 0 0 0 0 0 0 0 0 0 0 0 0 0
$$ ##$ShimPowRng2= (0..63)
$$ 1 1 1 1 1 1 1 1 1 1 1 1 1 1 1 1 1 1 1 1 0 0 0 0 0 0 0 0 0 0 0 0 0 0 0 0
$$ 0 0 0 0 0 0 0 0 0 0 0 0 0 0 0 0 0 0 0 0 0 0 0 0 0 0 0 0
$$ ##$ShimPowRng3= (0..63)
$$ 1 1 1 1 1 1 1 1 1 1 1 1 1 1 1 1 1 1 1 1 0 0 0 0 0 0 0 0 0 0 0 0 0 0 0 0
$$ 0 0 0 0 0 0 0 0 0 0 0 0 0 0 0 0 0 0 0 0 0 0 0 0 0 0 0 0
$$ ##$ShimSysFunc= (0..63)
$$ 1 2 3 4 5 7 9 11 15 16 8 10 12 14 6 17 13 18 19 20 0 0 0 0 0 0 0 0 0 0
$$ 0 0 0 0 0 0 0 0 0 0 0 0 0 0 0 0 0 0 0 0 0 0 0 0 0 0 0 0 0 0 0 0 0 0
$$ ##$ShimSysMatrix= 0
$$ ##$ShimSysType= 1
$$ ##$TFXNUM= 0
$$ ##$TRIPLO2= 0
$$ ##$VTU= 2
$$ ##$VTUETH= <149.236.99.20>
$$ ##$VTUTY= <no>
$$ ##$WBREFAM= (0..15)
$$ 135.5 97.7 100 100 100 100 100 100 100 100 100 100 100 100 100 100
$$ ##$WBREFLM= (0..15)
$$ 0 0 0 0 0 0 0 0 0 0 0 0 0 0 0 0
$$ ##$WBREFPH= (0..15)
$$ 72.26 -67.22 0 0 0 0 0 0 0 0 0 0 0 0 0 0
$$ ##$WBSGU= (0..15)
$$ 0 0 0 0 0 0 0 0 0 0 0 0 0 0 0 0
$$ ##$XFAC= 2
$$ ##END=
$$ 
##$DECIM=	4464
##$DSPFVS=	20
##.ACQUISITIONSCHEME=	ECHO-ANTIECHO
##NTUPLES=	nD NMR SPECTRUM
##VAR_NAME=	FREQUENCY1,	FREQUENCY2,	SPECTRUM
##SYMBOL=	F1,	F2,	Y
##.NUCLEUS=	13C,	1H
##.OBSERVE FREQUENCY=	100.64143946071199309,	400.20200099999999566
##VAR_TYPE=	INDEPENDENT,	INDEPENDENT,	DEPENDENT
##VAR_FORM=	AFFN,	AFFN,	ASDF
##VAR_DIM=	512,	512,	262144
##UNITS=	HZ,	HZ,	ARBITRARY UNITS
##FIRST=	23146.756194512010552,	4241.1435120000014649,	-0.54403775930404663086
##LAST=	-960.65624510154020754,	-230.39266631542668051,	0.042398322373628616333
##MIN=	-960.65624510154020754,	-230.39266631542668051,	-1.5214278697967529297
##MAX=	23146.756194512010552,	4241.1435120000014649,	32.967441558837890625
##FACTOR=	1,	1,	0.0046279590940860914142
##PAGE=	F1=23146.8
##FIRST=	23146.756194512010552,	4241.1435120000014649,	-0.54403775930404663086
##DATA TABLE=	(F2++(Y..Y)), PROFILE
$$ [...]
##PAGE=	F1=-9310.97
##FIRST=	23146.756194512010552,	4241.1435120000014649,	0
##DATA TABLE=	(F2++(Y..Y)), PROFILE
3112a00J12NJ0j03J09PK1m0jj95K10j24L7lK0j39J48J7O9L8oj06r2M7k1J73n9N2j07M4RO3
2832I5p2K0j61J11Q2l4k9j27N9m9k7J60k4K2j22J65O3k22j5J85j25M3M5j02N5l5L9j14J12
2579bm9mJ51j66R3r2O7j8O7pk0r1R7p7L9k4J10n6l4o5N7k2L2O5ol1J5qN2o2n3P0p9OJ52j83
2264g6J03R0j41J0R5%L7j35j37K03jLJ19j58k3o4N4P1j93O3J18n2J10o3k9N8j07N6J43k1o0
1992G3j48J87q0P3j48N1k3m4K8N7q2n5P3J4N4l5k5N2N3p4k8N9p6O0L7j15j16K20j4k6N3J6
1712G1p1J72j48%j1m6P5m2k3m2R9j02%N7J6o2N9n8O7JN1l1J8Pm0j45K87j15q9P8mn9N8j48
1415a20J78l0n1Q8Kj57K9JP6n9K1M8R0j59j91J55nK9L1LPJ39k11L4L0Q2j11J48m7n2K6J7p6
1126c5n8J29MK3j48N7R6j9NJ0l7j53J78oj57Q7M2n8jJ8j15K78j29r8J39j1k8O3L0k22O8R2
$$ y = [-100, 12, 17, 27, -76, 33, 40, 61, 21, 20, -175, 35, -89, -52, -55, -35, -174, -26, -9, 60, 98, 92, -14, -106, -59, -80, 93, 34, 86, -21, 23, 32, 95, 23, 43, -118, -7, 75, 41, 12, -115, -56, -105, -132, 28, 4, 26, -96, 69, 132, -90, -105, 80, -45, -2, 43, -59, -4, -39, 0, -114, -2, -51, -55, 96, -70, 23, -69, -2, -20, 47, 40, 20, -71, 26, -51, -12, -36, 74, 18, -16, -81, -24, -46, -14, 51, 45, 14, 29, 21, 73, 11, -42, 28, -51, -45, 107, -76, 27, 117, -24, -14, 81, 81, 118, -17, -154, 49, 48, 51, 170, 12, -11, -75, -21, 50, -143, -80, 38, -14, 96, 33, 4, 62, -45, 11, 154, 133, 73, -75, 112, 32, 105, -43, 8, -15, -59, -31, 26, -56, -111, -38, -24, 30, -5, -30, 22, 75, 1, -27, 32, -44, 16, 53, -62, -178, 42, 28, 2, 55, 71, 0, 172, 24, 24, 13, -33, 42, 0, -23, -65, 34, -68, -68, -11, 5, -57, 2, -56, 11, 12, 63, 32, 50, 57, 17, -128, 159, 44, -45, 33, 29, -30, 28, -120, 58, 28, -23, 65, 67, -90, -61, -60, 16, -43, -22, 26, 116, -43, -234, -79, -84, -55, -24, -21, -14, 125, -86, -52, -22, 60, -51, 97, 50, -2, 24, 41, -35, -93, 36, 40, 63, -85, -28, 68, 49, 54, 64, 27, -126, 52, 46, -111, -24, 18, -40, -41, -23, -138, 140, 11, -87, 52, 41, 13, 76, 106, -116, -48, 44]
846D4j26L7M5LQ2m3j9j6p4O7L4n0n7l3L03k39L4k9R1J19m8n4j75J23K9lq1J33k31J88j7p6
566c9J21N2j69j13O2l9K07p8K7pJ04n8O3j45N5Nr4J37k03M2J69k8m6j12M2j07j6P5J33r1L8
295a3J1Q6n5j16M7n4J79j09J35j02kN1r3M6j35O6pJ7L8j9j54J52oq3P2p8J93p3o6O1NO7j35
6g4Q3o3J04L0j56J06j4pm5n9O9j12RQ9J1J04k7j20J01r1KLQ2j4KM2r2
$$ y = [44, -82, -45, 0, 3, 85, 42, 23, 7, -67, 0, 34, -16, -73, -106, 197, -42, -8, -37, 54, 173, 125, 71, -104, 19, 48, 45, -36, 97, -134, 54, 37, -39, 82, 134, -35, -148, -86, -125, 82, 4, 31, 24, 128, 70, 133, -12, 43, 48, -46, 91, -112, -70, 99, 71, 25, -87, -45, -152, -168, -93, 40, -51, -13, -2, 84, 29, -87, -40, -94, 85, -24, 111, 9, 7, 58, -35, 11, -124, -58, -65, -48, -10, -29, -183, -31, -37, -120, -48, -126, 67, -6, -72, -11, -6, 61, -74, 9, -54, 50, 80, -76, 30, 16, 9, -36, -95, -26, -138, -129, -40, -29, 75, 48, -72, 29, -62, -60, -57, 25, 11, 13, 55, -37]
-230c7
##PAGE=	F1=-9405.33
##FIRST=	23146.756194512010552,	4241.1435120000014649,	0
##DATA TABLE=	(F2++(Y..Y)), PROFILE
4241b2R7m3p0N8K1Pj0q1k2O8J01R8k47K5m8K8m9J74j20P6l6J07j40mj1J32Pj23j1j3Q8j2P3
3952I8p3O6p1M3o7Q8n6o5J8q1J52Q1k11o9J22J3J32k04J17q0K1OR3K0r1P6k10J03M6m7O1p3
3672d2N4jl2R0o5qj80K75l7K6r1L2j38P8P2j07J04k8N1K8q7J3J2m9o2r4M0P0O0O0j71J13Q
3384fk5R8Lj23j59R5J21K8ON8j49l8O7O9M7r9M3N5o1j50K2M8K40j29o9J28j05n5J7O3j25P5
3104a0j8L1l3R2l1J4j2j5k04J75j09J7N8Qj13R5P0N3K8n9m7r7N4k9J43o7R7j11J0N8M8q2J7
2815C1j52J37L3km7r3R0r2J0J36k1J6r9Q8J03k19o3K44q2n5Q0q6L4k3j7r8J87pj32K21j54
2544c2M1o7M0Q4Qm5kp5N5p5j9J03Nj3J5p5L7k1K4J01p7PJ4k3Rl5qJ9q7N0J43j55O6J42k03
2237d9M4J11o4L5j13r4J69jJ7P4j51jnj4P4j81M0J09l0J54q2m0N6j41N0K10p7p2j11J81n9
$$ y = [-22, 75, 32, -38, 20, 41, 48, 38, -43, -65, 3, 104, 202, -45, -20, -68, -40, -89, 85, -35, 41, 5, 112, -28, -32, -43, 89, 96, -27, -38, -51, 37, 25, 98, 25, 91, 20, 63, -4, 84, 28, -37, -19, -100, 52, 133, -78, -147, -25, -12, 120, -84, 33, -47, -26, -20, 73, 93, 2, 78, -132, -29, 17, -30, 31, -42, 12, 11, -21, 69, 4, -4, -184, 91, 54, 80, -11, 21, -117, -39, 33, -74, 30, 2, 53, 81, -6, 7, 19, -30, -92, -186, -146, -76, -16, 44, -127, -14, -6, -31, 67, 70, -53, -212, -117, 4, 32, 38, 96, -53, -91, -24, 45, 92, -7, 36, 91, 30, -120, -98, -50, 190, 61, -8, 120, 15, -40, -23, 40, -85, -10, -28, 3, -30, 62, 31, 45, 33, 18, -186, -11, -120, -103, -45, -37, -150, -55, 15, 68, 96, 37, -10, -107, -53, -82, 61, -6, 91, -20, -10, 48, 96, 14, 31, -121, 16, 49, 47, 0, -93, -3, -95, -85, 51, 30, 46, -53, 35, 138, -81, -144, 100, 18, -37, 43, -43, -9, -32, -49, -147, 40, 33, -99, 122, -32, 9, -58, -18, 66, 74, 29, 27, -48, 7, -68, -87, 16, 21, 8, 23, -52, -15, -36, -12, 89, 12, 19, 33, 10, 19, -16, -24, -5, -92, -42, 101, -54, 12, 154, -49, -5, 106, 42, 77, -36, -130, 39, 38, 55, 129, -22, -23, -28, -42, 32, -149, -109, 0, -30, 124, 42, 2, 58, -83, -33, 177, 100, 28, -83, 98, 39]
1966C9P3j85O7j9o4N5M4n6k9P9n8J23r6K5J0R2j13n2P9n7M4P3j56l7K05n8o0J12lo5J47j14
1686D5jl2m2N7o4K2n1O7j14M0L0m0M2P4j02J32n1Q5j9m8k3Pj58K85q6j20J46m8l3Lj03J96
1406I6o5J6Qj1j61Q0J6L1j02N4O4P9j51k21K05m4O1NmK2J66k32P2l2J10q6J82q3o0l2M3n5
1126b9n6R9O5m4j33M6Q0K2L5j0k9j84J77j6j33Q7J1mm8J5j19L11j06r3J13J2r6J12j1k09J30
855eM2q0KL7QN9k1l6nr0M1R8j25j4P1K21k36Po5J57J06l1o9j93J78m0j1l1R0j90J42J9n1J15
557A00M9j39j16O7o2K26n4o2K5O7o0J29j37l1N5j20J62k09M0J45On4j25M9r5J9P8M2n3j8J03
286B7O4q0p8J11j30J89j46J32j12J9Q6j51M3n8M3l1M0M9j2j80J22pk9L7m7J41l1r3N7RQ1j35
6g0P8o0J9R5j11M0NL1k4r5M9o4pR3J2N3K9j60O6m8j0JQ3L5RJ0r7
$$ y = [39, 112, -73, -6, -25, -89, -34, 10, -46, -75, 4, -54, 69, -27, -2, 8, 100, -13, -65, 14, -43, 1, 74, -82, -119, 86, 28, -32, 80, 77, 12, 159, 45, 44, 12, -30, 27, -37, -15, -66, 1, -113, -73, -43, -83, -41, 33, -69, 63, 12, 97, 78, 30, 7, 14, -144, 141, 55, -65, 81, 33, 0, 3, -100, 96, 31, 47, 55, 44, -117, -37, -21, 10, -92, -38, 26, 105, -46, -267, -62, -106, -45, -40, -44, -22, 144, -88, -16, -48, 62, -24, 158, 75, 15, -17, 26, -29, -85, 14, 79, 35, -98, -52, 28, 50, 85, 75, 46, -138, 39, 23, -110, -23, -12, -16, -64, -49, -168, 143, 37, -56, 57, 69, -27, 85, 74, -135, -5, 37, -43, -41, -4, 4, 63, 42, 6, 1, -89, -48, 50, -75, -89, -18, 203, -33, -26, -91, 66, 172, 141, 72, -121, 57, 17, 6, -25, 65, -125, 17, 36, -15, 100, 149, 10, -106, -39, -101, 125, 71, 9, 34, 101, 41, 170, 33, 2, 57, -63, 99, -110, -70, 75, 81, 27, -98, -49, -144, -125, -47, -5, -58, -76, 27, 91, 11, -67, 44, -86, 103, -43, 89, -23, -4, 82, -69, -26, -84, -41, -72, -32, 17, 5, -175, -53, -60, -89, -52, -99, 42, 11, -82, -25, -16, 65, -70, 8, -52, -33, 62, -49, -9, -4, 27, 3, -92, -43, -107, -114, -21, -9, 44, 73, -87, -21, -69, -79, -78, 5, 40, 49, 59, -38]
-230c8
##PAGE=	F1=-9499.68
##FIRST=	23146.756194512010552,	4241.1435120000014649,	0
##DATA TABLE=	(F2++(Y..Y)), PROFILE
4241b7R4m3n8N5L6m5K9%j03kJ55O0j96N3n1n1NJ75j08L4j3J22j56J0nJ11L1j37Ml5J00jP6
3952A19j14M6n7L4k6J02j16n0Km2J82K1j92r9J70M8L4j07J12j04K9K5Q7m6p1Q8j87J01Q3k9
3690D3l5j9N1j1n5P5p3L3j66K55q9K6j17J05j15N7P3j64J65l9P8K2j07Jmj3o0j07K1J04J4
3419e1J24j88Q6k6M7O7K1j15j19P6R3JM0M6j79qQ5R5M8j52rO8l1j48L0K0K81j25r5J38p1j21
3139g2L0N3q7P1m7K6O1L9n4%K1m0j56J09q4k1J19%p8J3J31K9K3q6oq9L1KJ07r1R2j02J4R6
2841E4J8p5M7j52J45%pl7o6R5o0PJ04k2j0n2J8J41k05r7K42qj32R0o7k2J5l6p5K25N1k55K49
2552A23j06rn8J9J57j4j06K3m2K0r7m0J99j08K2Q8j04M8l4LJ41j38L8rl2qk3L5k9o0M2J17
2272E8o7pJ84k61P7J20j04M3q4p4J26J5L3J3j39J0Q2p5N6j41J8J00l9K02j17j7N4j36rK39
$$ y = [-27, 67, 24, -34, 21, 57, 12, 41, 41, -62, -64, 91, 151, -45, 8, -43, -94, -89, 86, -22, 12, -1, 121, -35, -25, -30, 81, 112, -25, -21, -56, 44, 43, 119, 5, 51, -6, 28, 2, 104, -12, -62, -60, -102, 80, 101, -91, -190, -20, 28, 62, -45, 67, -37, -8, 17, 104, 58, -13, 75, -112, -11, 72, 43, 8, -11, 40, 29, -26, 49, -24, 9, -157, 98, 9, 35, -82, 23, -92, -35, 38, -126, 39, 0, 78, 100, -7, -6, -10, -23, -83, -190, -169, -65, -51, 73, -115, -29, -55, -8, 59, 80, -35, -154, -78, 15, 16, 56, 102, -77, -85, 0, 95, 143, -9, -18, 50, 19, -129, -99, -79, 202, 77, -18, 120, 49, -72, -42, 11, -76, -5, -52, -26, 35, 74, 20, 20, 41, 1, -155, -46, -130, -151, -32, -32, -110, -97, 34, 63, 86, 0, -6, -95, -64, -62, 45, -46, 46, -56, -42, 54, 72, -3, 44, -108, 37, 37, 30, -7, -73, 22, -38, -31, 73, 51, 41, -11, 7, 148, -57, -154, 88, 80, -52, 38, -29, -51, -36, -72, -147, 78, 129, -126, 123, 17, 8, -50, -31, 126, 112, 6, 29, -13, 7, -90, -130, 69, -39, -17, 71, -33, 15, -19, -16, 125, -13, 25, 16, -16, -24, -47, -12, -41, -101, -59, 58, -9, -16, 168, -93, -16, 104, 0, 43, -41, -115, 11, 26, 59, 72, -67, -57, 25, -50, 6, -135, -117, -17, -56, 146, 29, 12, 66, -70, -79, 160]
2010A60j10j01l4J41mL0j80R4l5n7O3K1l0OQ7j12J43j20O8j0J21j60q7J12k2j6J49j94L9J53
1747A15q3j02J70k5o5J36r8K1o9m4M4r5Q9l3J0j07P5Kr3J29O9j36J75r9J36jj01m3L5j26K21
1476A07p2j26K09q9Nm7l5J48j04R3m4k1j65J00Q0j4j18N6J06J7j49k01K25o0Q1k3j4K0J80
1222A45k32J06j01J24l9J76j00n7o9N6l0p9J00J24j23r3K3N1Q9N4o0rj55J36l7n9M9l1M7n0
960d4Kj25K95p6n6N3O2j95J34j7j50J69k9n3NK3J4K3%l5jp1J4J18j97N0J43J04j69l0q7J78
680E2J17m6n3j79K00j19JMM7j24Q3K7PR2%m4j14Q9j05K21m2j29L8L2o3J73j16p7Q6j39J75
408I4j94L7R7%j9p3Ro3M7L9%k7n8J41L4o4l5J30j60J70j51R1r3O1P0j73L8QK6m4O2M2lj77
111a38O1J2J7Mj5O4lq0M3J2R1j10N6o7n1J02l9J1mP9or2Mqm4Q8J2L0O3j86K5K4k3j2P2N9J3
$$ y = [160, 50, -51, -85, 56, 52, 82, -98, -4, -39, -96, -33, -12, -42, -36, 51, -61, 82, -38, 30, 20, 141, -19, -106, 6, -16, -32, 117, -77, -38, 115, 32, -70, 100, 75, 10, 146, 48, 69, 0, -44, 0, -95, -6, -39, -29, -136, -61, -59, -152, -23, 46, -90, 85, -14, 122, 121, 20, -23, 12, -114, 107, 35, -91, 118, 29, 34, -13, -48, 100, -4, 89, 45, 24, -141, -41, 39, 25, -93, -37, 69, 86, -63, -264, -39, -99, -18, -41, -55, -35, 145, -87, 19, -82, 42, 3, 179, 79, 22, -47, 9, -21, -100, 0, 124, 1, -92, -69, -18, 71, 125, 65, 56, -99, 37, 0, -59, -10, -41, 6, -44, -42, -167, 128, 52, -4, 49, 111, -84, 50, 33, -117, 52, 23, -30, -25, -2, 12, 35, 35, 0, -1, -72, -58, 60, -137, -87, 56, 160, -9, -39, -126, 52, 169, 123, 70, -109, 91, -28, -27, -23, 24, -100, -17, 10, 17, 109, 109, 65, -49, 40, -65, 156, 114, -15, 23, 55, -8, 165, 49, -28, 58, -81, 94, -100, -63, 34, 34, 15, -58, -49, -112, -65, -26, -26, -53, -111, 30, 64, 0, -35, 95, -65, 105, -46, 45, -48, 13, 83, -90, -52, -44, -18, -62, 0, 42, 39, -138, -77, -65, -48, -44, -59, 5, 2, -78, -35, -23, 68, -42, 14, -53, -104, -2, -41, -30, -34, 45, 39, -53, -49, -57, -101, -13, -1, 29, 92, -94, -69, -45, -68, -80, -8, 51, 64]
-213F4Kr4
$$ y = [64, 66, -28]
-230b8
##PAGE=	F1=-9594.03
##FIRST=	23146.756194512010552,	4241.1435120000014649,	0
##DATA TABLE=	(F2++(Y..Y)), PROFILE
4241b7Q4l8l9M4N3r4M9R4j55p2J70j8q6P2j7j38L9J30n9kj6J34j35MRP6L4r8K5q5Q1L0N3j22
3944b0L1o0M3J1P6j41K6m1k6K06o2j25j00J42J17o8qJ15j47M6N5N9j02o2R0j52Q8J32k0r9
3681DL7J1%p1N8q1L8q9J88j23L6j31J63q6K4N6j77J94o5P8L9j09Rm4K8n7j05lJ21oJ59j85
3401h9N0p3J07M3L8j01o4N1L9k3P9O0k05PP1J27O3j78p7Q1nj12N0oK51r2j43J45k3j48L1K9
3121a7o2R5o4%J44k1o3k1N2o5p0M0o2n8J41jm7o0J61K4J6o8Pp1j6M9Q4j22M7p6O1P9lm6R2
2815G9j77J36Pm1j4o8P4L6l3P4k8k9Qj7J57j96j00J79O6j61O6l8r1O9l0m1J96J12l20K24m0
2544E9m5o1J4J73Qj57L6lLj38j5K23j91L3J66j47J00o6k2J68j46L2l3l4J0l2N0m6j9jP8M4
2264D1q8J96k89R8J24j15O4n6r2R2K6N9l2j17%J53j12L3q7lR6q1K31j37K5L5r6p9K26j11j34
$$ y = [-27, 57, 19, -20, 24, 77, -17, 32, 126, -29, -101, 69, 51, -35, 37, 20, -118, -79, 51, -8, -10, -26, 108, -27, -23, -14, 62, 96, -2, 23, -62, 19, 49, 102, -20, 11, -49, -6, 5, 81, -60, -34, -75, -101, 105, 43, -82, -182, -40, 77, 9, 1, 116, -31, 15, 70, 129, 27, -35, 55, -97, -9, 123, 103, 4, 41, 52, 52, -19, 39, -42, -4, -93, 95, -28, 8, -123, 40, -46, -22, 34, -143, 51, -14, 64, 103, -6, 3, -41, -13, -70, -175, -178, -57, -63, 96, -89, -39, -112, -5, 38, 76, -25, -89, -38, 1, -22, 57, 117, -88, -81, -10, 117, 180, 2, -75, 6, 1, -111, -61, -67, 184, 92, -51, 94, 71, -77, -46, -17, -79, 16, -48, -48, 96, 75, 12, -9, 43, -22, -92, -52, -114, -172, -31, -32, -79, -139, 22, 46, 62, -6, 1, -70, -86, -37, 47, -75, -28, -104, -43, 36, 33, -13, 79, -98, 38, 45, 4, -10, -78, -4, 32, -1, 73, 45, 16, 24, 7, 164, -32, -132, 47, 113, -48, 18, -20, -111, -42, -72, -113, 83, 195, -125, 99, 59, 14, -47, -33, 140, 148, -9, 27, 24, 27, -111, -126, 97, -94, -61, 105, -42, 58, -8, -30, 138, -8, 24, -9, -43, -33, -65, -15, -61, -80, -81, -3, 41, -47, 149, -140, -42, 82, -33, 31, -25, -117, -25, 1, 60, 28, -89, -89, 64, -48, -15, -102, -105, -9, -90, 141, 4, 29, 64, -32, -111, 115, 4, -130]
1992a30M5P5O2j6j31J15p4k9N1Kj1K9R7j52J45j15R9nJ07j71j32J58J5j07K34k16R7P7q7j31
1730i9K15n9n8J34r7N2j16m3M7j32J47Rm1p1P2k7j11J73L4j50J92j20J73K2j20m8M0o9J29
1476G8p5j07K25q9J8o7K0P7j23J38n0k1j62P2J59m6j02L5J54o9j29j62J95l7O8l1k1%J81k07
1213g8J24j50J04J4J30q5m0o3N7k7j11J34J45j73n0jJ7J38P4r9rp8P5m7K3j3o7Q5l6rj16K40
933A08m9k1j8J15k72J27J5p7J75r6m6K3K4K8l4K4k1k2k1K0P9k35J09J64jo8p9q8J47J51r6
662F5j4j36J84j64J9J8L0p4K6NP0P2o7P3j01J04j35J88m2j56K5L3q9J74q2p7J19j63J84j71
400h2L4M6n6N9Qm8k4N9k4Jj7o2J24J1l0JJ07j41J35j21K0o3J14J1j53K2N7J2n5Q0M6rj41j8
102i7M3M9l8K4pkl3L4J0P2o2J8p1p8N0M0K3k7J12Oo3m3L7r6O7K6L1O8j83j6J05m8j3O1N1N
$$ y = [-130, -85, -10, 52, 36, -95, 20, -54, -83, -32, -30, -41, -12, 85, -67, 78, -37, 62, 57, 164, -7, -139, 19, 34, -73, 161, -55, 42, 119, 32, -99, 116, 57, -1, 133, 36, 88, -28, -71, -24, -156, -9, 0, -41, -112, -40, -67, -178, -5, 29, -121, 71, -49, 124, 146, 26, -22, 18, -51, 78, 3, -104, 121, 32, 50, -17, 3, 80, -43, 95, 45, 24, -138, -66, 93, 47, -55, -20, 134, 65, -64, -226, -31, -68, 0, -31, -52, -52, 129, -78, 46, -104, 0, 14, 144, 59, 19, -44, 13, -14, -125, 9, 154, -19, -69, -70, -53, 85, 159, 60, 51, -27, 48, 1, 24, 11, -56, 29, -7, -16, -132, 108, 59, 38, 20, 135, -137, -10, 5, -72, 103, 7, -39, -16, 8, 36, 2, 26, 5, -17, -38, -18, 61, -174, -65, 99, 98, 30, -49, -137, 10, 161, 65, 51, -85, 99, -65, -46, -28, 2, -72, -46, -41, 29, 101, 34, 107, 6, 110, -25, 163, 121, -35, -10, 23, -66, 108, 26, -51, 68, -95, 89, -82, -48, -2, -58, 1, 9, -39, -63, -4, -28, -27, -44, -106, 18, 29, -1, 0, 107, -34, 101, -20, 0, -63, 51, 62, -91, -69, -12, 0, -55, 25, 71, 62, -79, -97, -54, -5, -43, -19, -26, -28, -61, -27, -17, 55, -7, 11, -60, -138, -88, -48, -25, -52, 60, 66, 3, -40, -3, -99, -32, -6, 25, 93, -90, -106, -1, -49, -62, -1, 50, 55]
-213E5K1q1
$$ y = [55, 76, -5]
-230e
##PAGE=	F1=-9688.39
##FIRST=	23146.756194512010552,	4241.1435120000014649,	0
##DATA TABLE=	(F2++(Y..Y)), PROFILE
4241a3P5m0k4M0M7j06M0J51j60j02J52j04L5N3M4j88M6O2jk9l7J40r2j9L1M1K3m6N9j38L7
3970b3P5%r2K7q7O6M3K8j22J14q8k6K18j52m0o8O5J87j39M9J11j72P8N9J7j21n7Q2j17O6J68
3699A49k5j17Q5n6L5p5M1q5JL3J07j41M7j17J88o4k1L2j52J94r3N4P1j15N6r6P2o2j00j5J13
3427e6lJ59j61J7j01J25K7M6p9oK7l1l0J16Q9k26JM8J50P4j71j29R5J1o6O8k4J64m4j93J53
3156E0K5j37K9rm1J17o7j8J75n1o5m4O9p2J0j0m3p3J09Qk3j13J39N3Pk3J4n9n7P7Q1j50pl5
2859a34J30Kr%J26k13J13N0p5pr5L7J52q2M7l4j9O6k6J47j87p0Q4J08j48K4Mj43J17k4jJ00
2579D0J65l09J66J5n6o6J8J44N1j69J7M5%j86M2J77k19J4K19j82J63j04l7J58p7k1l5k9M2
2325a4m6K9k1J4n5M2J28j51J74k64R9J17j01Q3m4j20O8K3R9m2q4j8J59j23J6k5k4R2j33K23
$$ y = [-13, 62, 22, -2, 38, 85, -21, 19, 170, 10, -92, 60, -44, -9, 44, 88, -100, -54, 8, 7, -22, -59, 81, -11, -30, 1, 42, 65, 19, 78, -60, -23, 52, 52, -40, -13, -100, -34, 9, 37, -85, 29, -59, -85, 133, -19, -59, -127, -62, 125, -14, 35, 146, -26, 52, 111, 128, 7, -50, 32, -85, -19, 149, 124, 7, 92, 36, 71, -4, 37, -48, -47, -14, 93, -48, -1, -118, 70, 6, -15, 17, -135, 59, -34, 20, 91, -24, 32, -64, 8, -54, -154, -169, -56, -59, 100, -61, -44, -145, -20, 7, 53, -26, -32, -5, -36, -66, 50, 139, -87, -86, -38, 112, 186, 15, -114, -19, -8, -74, -6, -30, 134, 90, -103, 50, 75, -62, -33, -42, -83, 34, -33, -51, 124, 73, 8, -36, 33, -39, -29, -39, -82, -155, -46, -38, -61, -174, -35, 18, 25, 2, 16, -43, -100, -23, 58, -92, -99, -134, -4, -2, -11, -11, 115, -98, 15, 65, -10, -17, -112, -75, 77, -5, 42, 8, -11, 55, 29, 176, -11, -81, 3, 111, -37, -13, -9, -152, -35, -59, -60, 40, 205, -104, 62, 77, 21, -45, -27, 117, 168, -1, 16, 61, 61, -125, -83, 94, -125, -111, 108, -74, 89, -15, -52, 106, 29, 8, -27, -56, -14, -60, -31, -52, -38, -93, -51, 77, -74, 100, -164, -65, 52, -49, 34, -10, -130, -62, -39, 60, 18, -66, -84, 75, -48, -32, -57, -81, 11, -122, 101]
2062A01j19N4Ml3j32J90q5j48Q7nJ20l1o1J04j17LL5j2KL7J05j86J55j01J26mN1j16j78J99
1800D5M4j92K73k04J37pq0j16K28j00l8J26r9P0j48l1N3j53J68N8o4nJ6n2q9J65j2j45J94
1546D2j15J67N2j03m1L0j6M8p8p1J70m8Jn0L3L0j07J35j6k1j49K4J95n0o6QJ73j28p6j37J12
1275e2J5L1k1j4k1J66j57J09j65N4N4P5n5j1k1N0m5j32J78J23j81k4j1j3J38J07j10l8J4K4
1012F7m0O9n8r2J06l9Jr1J68l7%p4J38k76R4N7j2J56j46m9L9M5M2j04N1Ro8L6O3Kk34J45J36
723A04m6J7j42n8Q9J76j53K6p5J43j56L1J1M0o1j2k8J03O7j13J66q6Q7j24J37n0j48jP8j28
461a06J29m1n6J71j85J81j51K1K0j36J57P3r9QM9p8K7j7m0Q2LmJ3P3r9R7o6n1l7J46n6j00
181g2JQ9jr2R5Q3k7q9r7P3O9q7O9m9l4L0M2lK4j2j7o5n9k8J09M7m0J07K0l6p7N9j42L6M9M5
$$ y = [101, -18, 36, 40, 7, -125, 65, -20, -168, -81, -86, 34, 3, -58, 46, -71, -68, -33, -45, -43, -6, 99, -87, 68, -33, 93, 89, 140, 24, -154, 45, 89, -103, 170, -34, 103, 96, 16, -100, 128, 28, -10, 116, 17, 87, -61, -92, -39, -192, -24, 34, -30, -35, -19, -71, -160, 5, -7, -152, 42, -73, 94, 146, 43, 2, 32, 16, 64, -14, -85, 85, 37, 38, -12, 21, 51, -56, 79, 63, 42, -107, -83, 112, 62, -4, 4, 177, 49, -27, -164, -52, -37, -6, -27, -41, -62, 104, -53, 56, -109, -55, -1, 74, 19, 8, -13, 37, -8, -140, 38, 161, -20, -44, -55, -68, 70, 177, 67, 29, 43, 67, 27, 96, 38, -54, 52, 13, 14, -77, 91, 54, 54, -20, 118, -158, -64, -7, -19, 137, -9, -58, -19, 26, 68, -36, 15, 24, -44, -8, 55, 57, -177, -32, 104, 58, 75, -67, -125, -36, 140, -13, 13, -62, 81, -75, -44, -33, 7, -54, -66, -94, 9, 76, -37, 129, 43, 130, 6, 143, 93, -55, -56, 22, -106, 23, -18, -74, 97, -88, 93, -58, -37, -17, -153, 4, 77, -22, -14, 35, -43, -16, -33, -73, 9, 12, 8, 21, 94, -5, 92, 26, -25, -62, 84, 28, -72, -71, 18, 17, -75, 20, 103, 76, -13, -110, -37, 32, -55, 14, -35, -69, -39, 3, 0, 24, 12, -5, -70, -129, -157, -48, -1, -41, 66, 86, 50, -27, 32, -110, -74, -25, 20]
-134B0N8j56n0J71q4J6N0K5j5M7o1
$$ y = [20, 78, -78, -128, 43, -41, -25, 25, 50, 35, 82, 21]
-230B1
##PAGE=	F1=-9782.74
##FIRST=	23146.756194512010552,	4241.1435120000014649,	0
##DATA TABLE=	(F2++(Y..Y)), PROFILE
4241A8O5n2j7M5J6p4QJ43j29o8J18j59J07J0Q9j76M3ML8n9n9J41n0n0N9J6J0j9R6j64j3J22
3961E9o3m1K2j28J13N3qp8J62j17l5K24k32L3j5j4K26j68N6Q3j45J07K6l0r5m3O0q6M0J77
3699A43l7j03J24j20P5p2K4q5n6J53M3j37L1o2J74m9p3K0j08J70j02J8R9j36J29j31J08p6
3454c6r5j4Q9RJ20j19kq9R4K1L6n0M8Lj01pJ37J08k35j3L4J49O9j31j45J04J5k8O1k7N8jk14
3165a52J52O3j08L3n1j5J07n4j2J49m2o6n2O3n8M7l4k1n6M6J9lj52P7J02QK4K0o4o6P3R3j59
2876h9m8JJ88r4j7N9J29k23P9R2q6k2j20lK31j02J9l6J9J03l4J21j60k0oJ00j22nO0j56J32
2605a0k9K9k1K01k51J10L8m1o8J7J04Q6j38l1Q9J0k31J05J05j95k6K28j85J93j22l9J06M5
2360G9j02j0k1N4l6j9M1K3r4K5J48j79J32j83P5Q7p2Q0n5j15N3RJ40k1m7k7R5j12KL9m3Q3
$$ y = [18, 83, 31, 14, 59, 75, 1, 9, 152, 23, -45, 73, -86, 21, 31, 120, -56, -13, -9, 29, -30, -89, 52, 2, -48, 11, 27, 37, 18, 114, -50, -63, 59, -4, -45, -23, -151, -38, 15, 7, -71, 91, -26, -61, 163, -69, -36, -51, -65, 161, -7, 49, 132, -13, 94, 120, 90, -5, -48, 12, -74, -34, 143, 106, 3, 127, 7, 82, 10, 34, -51, -107, 46, 89, -48, -17, -79, 95, 46, -27, -7, -115, 55, -47, -29, 70, -66, 63, -68, 40, -36, -131, -145, -56, -47, 73, -46, -48, -137, -43, -22, 14, -36, 12, 15, -86, -93, 44, 152, -83, -96, -62, 87, 156, 25, -120, -16, -1, -29, 32, 5, 63, 62, -152, 0, 63, -45, -12, -63, -78, 29, -25, -37, 112, 70, 4, -48, 15, -43, 4, -30, -51, -107, -61, -42, -45, -197, -120, -18, -10, 14, 34, -30, -96, -23, 70, -89, -137, -136, 52, -42, -59, 0, 129, -94, -15, 77, -9, -31, -151, -154, 77, -25, -6, -42, -23, 80, 46, 167, 7, -13, -19, 81, -41, -46, 14, -142, -10, -39, -10, -31, 170, -81, 29, 67, 26, -42, -25, 79, 165, 27, -4, 85, 95, -136, -31, 74, -121, -147, 81, -104, 89, -33, -72, 34, 79, -23, -33, -54, 0, -36, -55, -14, 9, -85, -60, 88, -91, 41, -142, -67, 20, -52, 28, -27, -142, -89, -80, 60, 39, -8, -35, 60, -52, -50, -11, -54, 29]
2080B9j74J87p1M3oL4j57J39m7j26Q0p9J60j2qN6j37K3K9k6J8L7J05k04J63r0J54l0j8rk08
1808a45K13N1k25K32j57J62p6p0n0J98j34JR0q6N3j41jL6j32J47R1o7P7o7o5n0J14m4j20J89
1546B4r1J12Q1o6k7J6OMo1k6N1J0k3j0rL5o5J00L5k6j33%J52k3l0qJ39j26mj32%P1j3lJ5l1
1231e6J37q9N3j46pO6M7k7J9K3M3o4j28J92Q0j55l0Rl0R4J46j04p1Q3pk1N5m8j06J14o8L3
951C7o5J03m4J4r5J13j88M1O6M6J27j81m7M6P3M3j63P9N0j11O8J09o7k08J47Q1j4M8k10JL9
680f2J58j77N2rR0j14L9j0N9p6k6m4R5O9j16K15r1M3p3Q8n9j33j3J40j52O3j0m5K29j80J59
408A09j38j0L2j92K33Q9j29K0K7j08O3j8k3O1kQoN6p2P8pr0j8J29r8m0jJ07k1j61J09J36l5
120H8n3j50Q8R1j30J07n9q8R2O4l0l5J9l5m0j6r2J56N2l8O1M9l2r2O7j68J0O0O1N5j26o5K02
$$ y = [29, -145, 42, -29, 14, 8, 42, -115, 24, -23, -149, -69, -148, 12, 0, -8, 48, -89, -66, -37, -63, -45, -8, 97, -107, 56, -34, 120, 90, 72, 63, -145, 68, 119, -106, 126, -31, 131, 55, -15, -65, 133, -1, 0, 90, 4, 57, -84, -85, -49, -181, -34, 57, -10, 67, 0, -65, -115, -1, -45, -165, 24, -67, 45, 126, 60, 33, 49, 55, 59, -2, -28, 23, 33, 10, 0, -9, 26, -39, 61, 96, 70, -63, -63, 89, 66, 36, 28, 167, 41, 37, -95, -95, -24, -37, -40, -25, -56, 81, -8, 45, -101, -108, -42, 5, -22, -3, 20, 63, -1, -129, 63, 143, -12, -42, -33, -63, 31, 177, 73, 2, 85, 78, 57, 112, 64, -42, 72, 4, 37, -28, 75, 31, 45, -50, 63, -125, -84, -18, 28, 155, -26, -73, -27, 46, 89, -74, 5, 55, -56, 12, 121, 54, -154, -7, 74, 60, 108, -102, -101, -62, 96, -81, -29, -38, 52, -62, -23, -33, 26, -50, -76, -120, -25, 44, -72, 143, 52, 95, 22, 110, 51, -82, -95, 45, -107, -44, -54, -99, 130, -50, 109, -29, -39, -7, -199, 34, 123, -6, 14, 41, -67, -4, -22, -45, 16, 14, 22, 16, 72, 0, 78, 71, -19, -37, 92, -6, -46, -47, 60, 39, -122, -13, 123, 88, 35, -115, -27, 64, -66, 41, -18, -106, -14, 50, 20, -15, 4, -31, -71, -87, -179, -23, 29, -9, 52, 101, 69, -23, 44, -124, -114, -54, 7, 62, -64, -129, 73]
-169G3j20O6M8ql4N0l8
$$ y = [73, -47, 19, 67, 59, 25, 75, 37]
-230C7
##PAGE=	F1=-9877.1
##FIRST=	23146.756194512010552,	4241.1435120000014649,	0
##DATA TABLE=	(F2++(Y..Y)), PROFILE
4241E3N1o0j4M3k3j5l5P9p8J4P9j57J03k7R3j20N3l3N2j00o1J31k4p5Q4O%k9J20j41n3J56
3961G2j12NMj58J85K4rl6J43j20m4K32k80P4L2o4K24j50K6L8p6J12l4o5l9j4K9o9K4J57m5
3690F6p7J52j50J04p9Rq6j01K33lj04k4K9J30m3j13K8o0J30r2j8J13j58J93j37J32r3q5mO1
3427d7J1N2o4j2l7M0J0J8j7Q9j9j49L0J34J03k22j4K6J17M9o0j33J02O%J2mk7K5j94J29Q9
3147D3p9L6p2KO8k4PR5j8o6l1L7l6M1n1J5j6j2K4J1j80J7J39K2N6K3q6m0M6J01j36p2J5K11
2850I0j53l7J08J01j86M7J03q1l9j17l9K51q0j4l3O5J09o1R9j03K8p4N0j00JJ16j37J15m4
2596a5L5j05K02j86P8K6mp5J1Q4Q6p9q9J13L1k65J54N4j42p0J94j42J57j01l2L7J54j71L0
2342c0k0L4No8J06J5j03L7J01j68R3q2K9M5m7N0p9o0M6kJ54J2j4k0mq2k3R7n5O4j81J43k2
$$ y = [53, 104, 44, 30, 73, 50, 35, 0, 79, 1, 15, 94, -63, 40, 13, 106, -14, 39, 6, 58, -42, -103, 28, 4, -71, 13, 19, 19, -10, 110, -31, -84, 72, -40, -35, -31, -189, -4, 20, 11, -25, 118, -2, -46, 186, -94, -20, 12, -52, 172, 22, 48, 86, 10, 122, 88, 23, -16, -30, -1, -70, -46, 111, 66, -11, 141, -9, 95, 16, 25, -61, -162, 71, 68, -36, -60, -31, 99, 56, -57, -29, -89, 41, -51, -69, 44, -114, 79, -58, 74, -19, -104, -108, -47, -36, 16, -48, -60, -97, -57, -47, -29, -46, 43, 24, -125, -95, 39, 142, -80, -94, -68, 49, 98, 38, -95, 7, 13, 13, 25, 21, -6, 19, -175, -46, 43, -36, 0, -72, -70, -2, -26, -19, 76, 58, -8, -39, -2, -38, 3, -48, -33, -49, -61, -37, -26, -206, -189, -50, -28, 28, 51, -35, -75, -29, 72, -64, -136, -121, 90, -63, -100, 8, 109, -77, -30, 73, -8, -47, -164, -203, 48, -32, -46, -79, -14, 95, 34, 133, 30, 58, -16, 34, -66, -65, 51, -86, 29, -15, 20, -85, 117, -69, 9, 35, 31, -44, -33, 51, 137, 58, -31, 82, 113, -152, 2, 56, -86, -156, 38, -104, 53, -48, -80, -43, 111, -60, -30, -50, -16, -11, -79, 27, 42, -61, -24, 77, -91, 2, -80, -51, -6, -53, -3, -82, -142, -96, -98, 56, 68, 54, 34, 30, -52, -75, 22, -33, 31, -150, -7, -29]
2054b9nK4Q7j58P4qp6L7j25J81J3J0lj27K8L5l4L2M4R1j87J41q9J77p2p5J02k03J84M1j88
1782g8J27j03J83j14o7L7J33j40N1L5o0kq9M1j7n8J01R3p4J55j33p0k1M0l1q7J80o0L2R2k5
1511G1j7Pj6Oj0Mq1N1k4K7q7P6k1O6Q0l2j25J1O0K3j5j3O9p6O5j42q6R8n2J5N8k6R8k2k4r9
1196h3n4M6N6j1M1M2L7o9r7J54M5j22n6N4k9M0J64r9o9R8k5NnJ0r9J05j00O3m7O4o2L0p8N3
898Bm8j9K1J07R3j98l9N6Q8K1j78R2R1j22O8J07r0j72J18K8O9J5k62P6J9Q9j45O1M5K9o8N3
618Gm2P8r4l2k0N1P0q5K25j24Kj5N8o4j25pJ80j32POn6K55j39J22j22n8O9j91K56O0j38J0
338A2Mj10R6k2k9P8j3Pl1N6q2R3M4r3%O2j03OK5J16m2k49J19J74k5m5j53Q0J16j55J22n0j35
50a27J42P9p0p3K8l3NJ8j20J76L7n0QQ6m0r8P7j73%L9Q1O5j05n4J87j33J08M7l5l5J5j9
$$ y = [-29, -34, -10, 77, -81, -7, -15, -91, -54, -179, 2, 15, 25, 22, -105, -77, -42, -76, -44, 0, 91, -96, 45, -44, 133, 61, -14, 88, -115, 69, 110, -78, 49, -54, 129, 15, -52, -15, 118, -22, 29, 64, 4, 2, -87, -46, -63, -121, -20, 73, -1, 154, 21, -49, -70, -30, -61, -148, 32, -28, 4, 96, 71, 54, 61, 45, 51, 41, 45, -36, 15, -9, 18, -69, 7, -14, 52, 132, 100, -25, -14, 46, 69, 54, 41, 110, 34, 99, -43, -129, -31, -83, -68, -10, -36, 62, 40, 16, -83, -137, -91, -35, -46, -5, 37, 74, 5, -92, 62, 107, -15, -71, -17, -46, -6, 158, 59, -10, 88, 63, 68, 63, 73, -26, 79, -21, 42, -5, 59, -3, 27, -51, 2, -46, -65, -44, 63, 156, -42, -81, -25, 63, 84, -94, -2, 89, -33, 35, 142, 52, -120, -2, 26, 95, 110, -152, -76, -57, 32, -113, -52, -7, 22, -46, 7, -35, 43, -51, -83, -103, -52, 18, -67, 158, 34, 36, 21, 79, 15, -110, -117, 63, -69, -62, -56, -112, 143, 4, 126, 4, -54, 15, -176, 80, 140, 2, 12, 16, -94, 2, -20, -49, 29, 16, 23, -8, 48, -34, 59, 103, 10, 10, 72, -31, -25, 0, 116, 74, -175, -56, 118, 93, 48, -105, -25, 91, -64, 58, 8, -127, 15, 94, 24, -49, -21, -54, -49, -31, -151, 25, 62, 12, 20, 106, 66, -32, 45, -128, -128, -89, -8, 57, -48, -102, 85, -48, 60, 107, 72, 37, 52, 33]
-230C3
##PAGE=	F1=-9971.45
##FIRST=	23146.756194512010552,	4241.1435120000014649,	0
##DATA TABLE=	(F2++(Y..Y)), PROFILE
4241G3L4n3j2K8m9L7p2Lk2R9L4r8M2m0O2o2Q8n3M4j41m0J08k1q0J00Joo0J23p2p1J62j27K4
3944a7k5j63K62m1K5j1P6j06n4K44k77Q1M5p7J96r8j0qLP9j04o2J7J4Lo8K9J12m2n0J65j38
3664@J21j18Pq1j27K58m4l5j06J25P7m1j25N4k8Q8p5m9J16j59K21j24J37r7o7PL5%j7ol4L4
3384e3onKJ3R9k6j62N6J10P9j81J2PO1K7K9j23R3j2K0o6M2o3L6j53R1J00n3J9n7j3L4J8K1
3086dM6j2o2J9Mk6J5o6O2K4m4K3J0j86pJ41M4P4Qj09%J1R9r0q6RJ87j46o7J34O5j23L6P9q0
2780a8l7q0o6K20l0l7l2Q4R1j02Q6k6N6j12j7q3L1J58j07Q9o0K6j14J51j36O4qM5q2LQ7M8
2500I2k3j20R9N7k77J81M0q7r9J37o8O4m0l5rJ96j97O0k9oO4j01J44Qq0O3J8j17O7ol5K1m3
2211f1Kq6K4L8KJ19L6K3j5q3l4o3J38o7M0j47J16lo2P2J22j43%K2k6oj29J76K2ml1j08L2M3
$$ y = [73, 107, 54, 42, 70, 21, 58, -14, -11, -33, 66, 100, 2, 44, 4, 66, 4, 92, 39, 83, -58, -98, 10, -11, -91, 9, 10, 4, -56, 67, -5, -76, 86, -41, -17, -42, -205, 57, 16, 41, 30, 106, 0, -54, 190, -87, -6, 39, -38, 158, 60, 50, 42, 45, 124, 20, -42, -25, -11, -8, -76, -47, 65, 23, -27, 138, 0, 121, 3, 10, -71, -198, 60, 16, -19, -125, 0, 77, 36, -89, -35, -63, 25, -50, -99, 17, -142, 79, -45, 92, -5, -72, -65, -30, -30, -47, -53, -87, -53, -59, -64, -62, -49, 50, 24, -138, -82, 28, 107, -74, -62, -55, 6, 33, 62, -61, 32, 20, 40, -26, 16, -47, -11, -164, -73, 27, -26, -7, -64, -77, -43, -25, -4, 42, 30, -32, -13, -9, -35, -20, -86, -24, 0, -44, -21, -11, -197, -204, -63, -19, 55, 63, -46, -46, -35, 64, -26, -112, -103, 84, -62, -129, 5, 70, -53, -17, 62, -18, -55, -135, -201, 19, -11, -48, -80, 4, 95, -7, 79, 53, 109, -3, -20, -103, -72, 86, -21, 68, 8, 34, -80, 71, -65, -1, -9, 36, -46, -43, 44, 92, 69, -51, 48, 105, -172, 9, 49, -38, -137, 0, -68, -4, -44, -79, -88, 108, -89, -29, -58, -64, 0, -101, 43, 51, -29, 34, 52, -65, 2, -4, -39, -18, -61, -59, -145, -121, -83, -81, 38, 74, 97, 82, -1, -35, -98, 40, -27, 13, -134, -18, -21, -83, -11, 111, -32, -32, -10, -36, -42, -171, 5, 27, 23, -8, -116, -84, -41]
1913d1k6L5N4O5j26P8r1J75j03j04J67j54J12K8j03K3q4K01j09o9Q2O7j05Q3ml6p8j1P7q4
1651h1N3M8O6r7K03j47p5j5k3J7n4J67k9l6P7Pk8No4M7N5Jj67O8jM6j64J18mN5J04k3j35L2
1353B6j4N8k2j2Qk7J09j50j07Q6q7L4R7j7N8K9q4m2p2MQ0LN0K6L2n2n3P1K5r5p9R9pMJ45j05
1038A9k4O6l6K4o9P9o5P8j16O3k7M9p7M4l6rP7n9n8J62M9j88k8P3Q7k1j46Q2J16q6M8L5o3
750D3j26P3j1J51n3k75J44J0J0p9P0O8k9l6P3p6R5j00m6M0%N9m9K09j65j3J5O0o4j16mJ73
470E1o8k1J0p2K17p0Q7r7j13J16j49K27Pj20j4qj01J16l6m0J07l0nk0N3j27J35R0p7J2j9p4
190c3J6P2J16o3l13J21J73j0n5j00N3J33j62J11l4j52J69Q1j14q1K3k3O7K5j13J75Rr1j7J15
-73I8l5j02R3j66Oj7R9Q3q3k8J38j12J12M5n1j3m9r
$$ y = [-41, -67, -32, 22, 87, -39, 39, -52, 123, 20, -84, 83, -71, 41, 69, -34, -11, -95, 106, -3, -72, 10, 77, -28, 55, 51, 15, -63, -74, 3, -81, -28, 20, 86, -11, 192, 45, -30, -45, -68, -51, -105, 62, 33, -3, 74, 81, 53, 58, -6, 41, 96, 97, -70, -2, -3, 43, -121, -3, -7, 48, 152, 129, -6, 26, 12, 70, 48, 36, 44, 17, 126, -24, -131, -45, -132, -98, -1, -18, 40, 69, -15, -57, -129, -125, -45, -42, 8, 34, 66, 14, -39, 32, 57, -38, -117, -18, -25, -21, 124, 19, -5, 61, 25, 49, -20, 59, -6, 72, -44, 19, -8, 41, -36, 8, -28, -37, 40, -19, -77, 85, 134, -54, -82, -9, 78, 57, -89, -7, 109, 23, 71, 106, 43, -83, -10, -21, 130, 77, -198, -54, -44, -34, -113, -43, 25, -4, -40, 33, -43, 52, -48, -94, -54, -54, 5, -44, 165, 0, -13, 2, 62, -2, -118, -122, 51, -17, -38, -28, -100, 117, 47, 134, 37, -76, 40, -109, 118, 125, 5, -9, -17, -118, -2, -38, -78, 29, -1, -6, -26, 27, -100, 35, 125, 48, 60, 41, -33, -17, 55, 171, 108, -205, -84, 89, 79, 24, -76, -23, 110, -52, 59, 25, -127, 42, 123, 9, -72, -49, -72, -5, 20, -93, 82, 91, 0, -17, 98, 63, -39, 54, -112, -106, -123, -24, 59, -24, -52, 86, -26, 86, 131, 80, 67, 18, 9]
-230I
##PAGE=	F1=-10065.8
##FIRST=	23146.756194512010552,	4241.1435120000014649,	0
##DATA TABLE=	(F2++(Y..Y)), PROFILE
4241F5K3l4qJ1n8O0r8m0L1J33qok9l4K3l1J37p6K8j59qP8l4n8R2nrq7J06K1o0J28j12J5m9
3935e2j44L11j16P5Ljr0o3K50k29P1Pn5J62l7l0l1M8J8j66oM7K8mq6N7M8k5j6J47r4J30j81
3646b4K5p2j33K42r5N3j70J79L4m0j02Q9k9O3p1p3J17j29K05j12J29q1m6J9Pj5o1N2q2J01
3384b0l2k3KL3P1j2j48N7P8N6j15N6l7KJ8J10j33Q2l8L5j30Q5m5L7j17N6R6k6l0j1o4L7O5
3095eJ8J1k6n8P4k1l2np5J05M5n7K8k0j57K3R9O3Q3j7j18K4j8R1n3q6mJ30r1r3J40L9p2M9
2797A4M5r6j6l0p6J67J5k5m3O0O8j43P8M5O0j25o5o0M7J80q0P2o3J5o1N9r9M6m2R9q0qR9j6
2500D1J1j03M5P7k56J85M0m0r5P2Qm6M4o0rJ60j79O9m2l2J07j19J41J4l4Q6o1l3M8J0r6L4
2220a3o6k9o2R6J6K0M3L7O7k0j13K4j00J42q2K7q5J10j9r1R7J36j17o6L8oj6r8J37J3k7rj06
$$ y = [65, 88, 54, 46, 57, -1, 59, -39, -79, -48, 85, 77, 71, 42, 8, 31, 0, 137, 61, 89, -70, -78, 0, -34, -92, 0, -5, -14, -101, 5, 26, -34, 94, -18, -3, -52, -196, 115, -1, 74, 77, 76, -14, -77, 173, -56, 15, 22, -33, 129, 92, 62, 31, 79, 97, -69, -75, -28, 0, -4, -90, -33, 15, -10, -26, 121, 27, 157, -24, 1, -71, -204, 38, -57, -4, -174, 5, 39, -1, -103, -14, -43, 20, -51, -124, -7, -136, 69, -43, 86, 5, -41, -22, -15, -30, -91, -39, -121, -20, -52, -75, -73, -40, 31, 19, -129, -72, 6, 62, -53, 3, -34, -32, -14, 96, -37, 45, 7, 42, -88, -3, -48, -11, -128, -72, 24, -2, -32, -43, -107, -70, -5, 13, 24, -2, -60, 14, -7, -39, -44, -119, -14, 31, -26, 2, -18, -175, -152, -53, 10, 93, 76, -42, -18, -36, 55, 2, -84, -88, 42, -49, -142, -2, 37, -35, 14, 59, -37, -53, -83, -159, 8, 23, -2, -45, 15, 83, -60, 18, 63, 123, -2, -67, -127, -80, 100, 20, 92, 29, 44, -17, 42, -57, -11, -53, 46, -34, -42, 57, 41, 52, -51, -6, 71, -185, 0, 40, 0, -95, -23, -15, -61, -17, -77, -86, 74, -105, -36, -78, -110, -3, -122, 19, 33, -1, 85, 24, -9, 39, 49, -47, -13, -79, -108, -170, -74, -58, -38, 5, 42, 109, 89, -24, 0, -100, 42, -40, -13, -98, 12, -7, -98, -1, 135, 18, -48, -10, -16, -32, -130, 7, 20, -7, -16, -122]
1931a22N0M4kK2O0K4l7jq2J32r8j10J71p3K1K1j4k2j15J95o3p0N8K9m3P7Mk4j45O0Q4j27J65
1642F9JK5j25K08j22p3k3m8N9k9J51Kp3M6K6o7Rj06J05J01m4j63O1L0M6k02J29j9O5J08Jj55
1362gL4l0O3l7j1%j8J19j46o4M9j25O2J16k1K7M8r5J3o1m3R5J1N4rK3j7j1k5Op6p3J18L0o
1056gQ0r9L0K6m2J9r8J31j8L5j06J6J5L6p3M4Kl9J41o5j24J89mj48j8Q4Q5o4r3M7J16j0K9
767A17q5pp2L4m3J93j13k39J85j6l8j7Q5N4o6rQ4j03J13j01o7J07k4L7l2J63j72rPQ9n4r4
487i3k3J24J3l0J4o8J20mP4p2j47J50j04J73m4q2l2Lr6R9m8l1J16n0k3M7K3j72J74J37p6J6
207H8p3k3j0J10J14q9l20J23J28oo4j7K1J34j56Q0j3j28J49Q2j37p4J7k8J36J0q2J47qj51
-55d0JJ17oj00J12j62J7q3J05R6n0jP4o0P3L6m9J8j12o
$$ y = [-122, -72, -28, -30, -8, 52, 76, 39, 38, -44, 88, -10, -120, 51, -22, -1, 20, 6, -16, -131, 64, 1, -69, -11, 18, -25, 52, 56, 32, -113, -53, 31, -96, 69, 70, 95, -30, 178, 56, -17, -40, -88, -29, -58, 93, 95, 22, 68, 94, 27, 36, -70, 35, 136, 92, -71, -10, 20, 66, -136, -7, -26, 39, 147, 148, -7, 27, -3, 60, 23, 12, 12, -6, 113, -33, -97, -48, -173, -111, 5, -16, 11, 59, -36, -23, -84, -127, -32, -21, 33, 24, 47, 30, 19, -6, 0, -76, -149, -31, -1, -7, 73, -26, 4, 30, -12, 7, -91, 40, 22, 57, -49, -33, -18, 18, -55, -11, -9, -48, 93, 28, -96, 93, 89, -59, -77, 7, 92, 28, -65, -18, 98, 88, 117, 32, 25, -47, -13, -56, 137, 24, -215, -30, -46, -84, -101, -16, 38, -28, -37, 47, -56, 57, -44, -111, -4, -28, 9, -23, 140, -32, -41, -34, 55, 1, -93, -116, 8, 21, -9, 5, -63, 57, 53, 127, 55, -92, 58, -46, 127, 83, 1, -31, -28, -124, -25, -73, -104, 12, -38, -61, -14, 9, -163, 11, 148, 72, 88, 15, -8, -18, 92, 206, 117, -203, -80, 48, 42, -22, -39, -18, 116, -40, 40, 27, -101, 48, 130, -7, -81, -64, -92, 44, 54, -28, 119, 111, -40, -39, 78, 72, -28, 84, -78, -61, -144, -39, 57, 7, 6, 80, 20, 93, 129, 80, 98, -14, -20]
-230b0
##PAGE=	F1=-10160.2
##FIRST=	23146.756194512010552,	4241.1435120000014649,	0
##DATA TABLE=	(F2++(Y..Y)), PROFILE
4241C5K3k3KPn3N3j11l2O7R9l4Q1o9k5ok5J79j17J4j31J7M9m3k3N5j5pr3Q5R8k4O2q5j4m6
3935e0j20L01j56J22J3o1p7o3K34j61O4o6j4J34Jk5k3M5m4k07Q7M9K1J0j15Q9j9jL0J01n4
3664D5J40k34N5o2j24K04j46J23j74J73Nl8n1J16o8O9q8q1J16q3J61j11J17n4l7L8k6k1o7
3410a03J03j42J42m6l4J2M2K1K1j29L9N1N1l8R4j05m1L7J47j52O9n9M1j36Q6RL9r9M5P5nr5
3130f0L4j18P7J00Pk2l5o0J04l1l7j0p2J27M2o7N4q2j00R1K7P6P3k5j08K5m0Q7m6p7lN9l1
2841d1j04J40L7o0P3K9j20LPo7J10L3L8o7pO1j66P1Q1M8j16p3l4K3J85n6O7n1J9mk8p1J7n4
2544g7J39n8l1J02p6J6m7k9Q2j97J62K9%o0QN9j24J22j03L0Q4j41N9m9k5J03j20J08L4J5R0
2272A05r8O3J5k7j32P7j03k4j2J25k9M6l3J1J13k6r7O7j10J01j04L6j0J12n6p0O4J35q3j12
$$ y = [35, 58, 35, 37, 44, -9, 44, -67, -99, -32, 67, 33, 114, 45, 20, 14, -11, 168, 51, 65, -66, -49, 0, -43, -66, -11, -26, -33, -126, -41, 57, 33, 95, 10, -4, -50, -170, 131, -25, 97, 110, 49, -28, -91, 143, -18, 46, -20, -34, 100, 101, 76, 53, 98, 54, -153, -66, -17, 4, 14, -101, -12, -31, -32, -2, 99, 45, 185, -49, 6, -56, -180, 24, -122, 1, -173, 0, 5, -33, -84, 32, -36, 33, -55, -136, -20, -103, 58, -53, 64, 10, -27, 11, -15, -36, -103, 0, -142, 0, -46, -80, -68, -26, -5, 16, -113, -74, -23, 28, -10, 84, -21, -62, -25, 122, -30, 39, -20, 21, -115, -29, -20, 19, -80, -35, 40, 35, -60, -26, -144, -67, 33, 40, 18, -17, -77, 27, -4, -41, -51, -123, 4, 46, -21, 33, -49, -149, -58, -31, 45, 118, 93, -15, 10, -30, 57, 11, -66, -69, -10, -41, -145, -5, 32, -28, 45, 74, -46, -43, -36, -103, 7, 40, 78, 11, 4, 65, -101, -30, 51, 99, -17, -90, -124, -101, 84, 28, 95, 44, 63, 59, 31, -40, -23, -77, 62, 4, -27, 75, -1, 15, -32, -61, 21, -176, -14, 15, 15, -45, -37, 22, -102, 20, -83, -53, 31, -110, -51, -100, -125, -22, -142, -34, 0, 15, 105, 7, 70, 85, 58, -74, 3, -100, -124, -136, -11, -40, 6, -27, -16, 97, 71, -26, 41, -69, 32, -72, -36, -46, 66, 10, -60, 4, 139, 56, -56]
2010e6N3k8K0n9O9nl4M8j35Q9K9L0MM4k2N3o2n6N2o0j03J44Oo3K7M8lj70J43J7p5j2L4J2L3
1703A2N6j5j69Q8N0j21K45m5rj32J78r8n0k8l4O0k2J39K7p8J5L6j25K1j08J48R9j07q4L4N2
1432C5M4j92J11n7Q1R5K5j56NkM2m5j1N2m8J02j28mJ3j59R9J08l9RL3n3N0k6p2Q2NN3k9%L0
1126E3K2j01l5n1k9R3P4nj2o3N3J5l9j5p7J60K4k5q1n9Q1J2n0J6J8k0J33l1j45J71n1q9j3
837f6P5R3q6n9NR7O9K8j94M2j8J2p1J83j35j64J92p3l3J3R2J7o1K5O4j05J23j08q8J46lQk9
548iQ5j30Kk6J29k6o3p2O4P8m4L2m0PL5Q6o1j43J66r0J32q2l9k7L5j03M3n3J1R1o7k6J35l5
251ej81J84J72r9No9K8n5J18J11j25k61J23O1j6n9N7pJ15j37M9K1p9O5R8j22p2J5n4J93j4
-20F0l8R4mj87M6Q3K6p7J24j56J8j36R3J03j1J4J5PRK0k9L7j47m
$$ y = [-56, -3, -31, -11, -70, -1, -6, -40, 8, -127, -38, -9, 21, 25, 69, 47, 100, 38, -18, 34, -26, -129, 15, 21, -42, -15, 33, 30, -140, 3, 20, -55, -67, -33, -21, 12, 68, 53, -116, -28, 22, -99, 146, 101, 92, -40, 138, 40, -10, -38, -72, -12, -34, 105, 132, 54, 69, 105, -20, 1, -107, 41, 140, 33, -51, -17, 35, 79, -113, -2, -59, 22, 117, 142, -14, -9, -11, 31, -14, -25, 27, -21, 81, -47, -51, -38, -197, -98, 10, -29, -20, 13, -40, 10, -16, -88, -6, -1, 52, 23, 23, 53, 75, -26, -61, -112, -141, -48, 26, 21, 9, -54, -1, 14, -25, -40, -117, 43, 67, 42, -39, -98, -17, -5, -55, -39, -21, -41, 92, 61, -84, 87, 36, -53, -66, 9, 102, 16, -43, -38, 59, 128, 156, -38, 4, -14, -2, -73, 110, -25, -189, 3, -70, -103, -90, 2, 19, -42, -17, 47, -58, 65, -43, -131, 15, 12, 20, -9, 76, -54, -52, -78, 51, 25, -38, -110, -46, 32, -12, 20, -20, -13, 22, 108, 47, -96, 70, -20, 112, 30, -9, -36, -1, -104, -61, -114, -103, -12, -79, -105, 30, -5, -186, -2, 170, 71, 76, 7, 35, -20, 98, 209, 84, -177, -54, 7, -9, -68, -11, -18, 97, -40, 9, 30, -49, 16, 114, -8, -80, -65, -119, 74, 60, 22, 116, 112, -75, -29, 54, 80, 3, 127, -29, -11, -147, -54, 49, 38, 52, 67, 74, 83, 103, 74, 111, -36, -40]
-230d0
##PAGE=	F1=-10254.5
##FIRST=	23146.756194512010552,	4241.1435120000014649,	0
##DATA TABLE=	(F2++(Y..Y)), PROFILE
4241GK7l7J9K3l5K9j20J1P5K8l4J28o1k7k7k5J95j64Oo6K7L4l0Jnj9rp2P3J27K6j3o2n3j1
3935c4j12K41j38J55K1r9o1n2J83r8P0j34K1J19%%lRp5k13J68L4J2K5j32R4o6K7P2M6m2J47
3655A85k33P9o7r8J61j76J42j16J27j2l2NJ21j24R4j17n4R9m5J00j02J09l7n1O6n8j3n5J52
3401E0j86J48m9l8J2M5k5N9j15J2L6O0L4J03j65o5Q6J18j49M9o7L9p2K7N9O0r3N3L9jj36M4
3121b8j33J19J12mm8j4p5Q6k9j2po1J20K2p4R8j60l6J62n3Q6K7J5r0J6n4Q6o2o1OmPj03J51
2824EN1p9Q2M1j30LJ3m6N6K4J39q7r6P1j66O3P6L2r4l9j5l5J77l0O2k1K6J0n6n9j3k7J41j5
2526F4p4R2j10OJ5q8P3j24J24oL2rm8Q1j51J75j44P7J4j08M3m9J0N4j05O5N6N9O5q1J44m4
2246A08q2j21J13j32J5L8J04p9O8p0l7J47po9P6q2K6j33O9N7J04p9k4nJ22n4j36Q5p6Q6l9
$$ y = [7, 34, -3, 16, 39, 4, 33, -87, -76, -1, 27, -7, 121, 60, 33, 6, -19, 176, 12, 18, -48, -21, 13, -17, -16, -21, -40, -49, -121, -48, 79, 105, 92, 30, -23, -34, -146, 95, -43, 112, 133, 34, -27, -79, 104, 6, 76, -58, -37, 82, 82, 82, 79, 88, 13, -200, -32, 2, 14, 39, -93, 1, -65, -38, 34, 80, 38, 185, -48, 31, -36, -134, 27, -149, -7, -123, 4, -8, -40, -35, 86, -38, 56, -61, -115, -16, -61, 39, -63, 46, 9, -42, 24, -34, -47, -102, 50, -136, 12, -37, -75, -63, -18, -43, 16, -99, -87, -51, 9, 43, 146, -19, -84, 2, 120, -29, 20, -47, -8, -80, -53, 6, 66, -27, 26, 65, 64, -72, -28, -161, -42, 70, 66, 18, 4, -71, 15, -14, -26, -33, -94, 26, 48, -26, 72, -88, -124, 38, -15, 71, 98, 113, 23, 39, -15, 71, 9, -52, -46, -50, -43, -146, 5, 56, -23, 59, 100, -30, -27, -14, -60, -4, 20, 159, 72, -24, 47, -119, -56, 20, 52, -42, -81, -96, -131, 46, 16, 78, 57, 83, 93, 37, -22, -35, -62, 79, 64, -10, 82, -28, -22, -7, -95, -22, -146, -22, -28, 4, -5, -53, 28, -123, 52, -92, -15, -1, -109, -66, -115, -105, -51, -156, -91, -35, 24, 89, 8, 152, 108, 26, -95, 18, -114, -99, -61, 43, -36, 32, -38, -75, 72, 65, -4, 72, -10, 16, -117, -48, 9, 113, 34, 10, 5, 127, 73, -63, 22, -54, 32, -7]
1975glk6pR7j80J31%N9kJo1J15q2j5l9j8r4J24N6j20L9P7M3k02L7J11q4o2N5L5k3J18kj43
1677g2O8nq0K73q5k8r8J31j05Kk3lJ5k7J33L5p8OM6j83M5o6J50O0j55J4j1N9N9j49P9r5Q5
1388cP4L2j14m5K7J5m3oJ34p5O3r9K3mj75J35P6n9jMRO6J8o8M3k5M2pl7P2M8j27j06k2M3L0
1073f2J18rj00LK0N0k4p4j6J75L9q7n8j18J45l0j4k6LL7P7K4j23J19o5l7j5L7J05o8o1k9Q2
785A8J15L7k40O4J1Oq4J42j24o9J75j48NJ7P4k0j7O5J3p1J07j22r8J41N2k4k1rn6Pn6J49K0
496E9l4j28J5J04o3N3Jo9M4J03o7r8J68j13J20j05k0OP1j09l0n0N9N8q1MJ86j11j33J69J77
225A86j38k1qN7q7R3J00j64j61J13Ql1m3Q8k4Q3j02L4O8l4n9J18o9p7J2q4K11l7J7K7K2j71
-55g3Q7J7L4k6J20j36J2j69P2J08J1J8l1O7n1OKL4j42m
$$ y = [-7, -10, -36, -43, 54, -126, 5, 5, 64, 62, 63, 2, 117, 35, 20, -19, -37, -131, -7, 49, -71, -32, 45, 88, -114, -77, 34, -50, -112, -57, -22, -45, 73, 71, -72, -4, -9, -89, 184, 99, 71, -27, 104, -1, 1, -22, -25, -10, -37, 96, 131, 53, 59, 105, -78, -33, -99, 51, 111, -44, -30, -41, 18, 77, -72, 7, -88, -3, 71, 103, -11, -56, -29, -14, -57, -63, 71, -4, 59, -40, -17, -21, -196, -61, 15, -44, -45, -41, -32, 34, 52, -16, 27, 2, 44, 37, 0, 72, 120, -7, -113, -135, -92, -62, 56, 47, -53, -50, -30, 20, -4, -78, -94, 81, 120, 33, -25, -143, 2, -28, -42, -68, -65, -28, 49, 73, -50, 69, 4, -33, -48, -11, 94, 26, -35, -64, 18, 133, 170, -70, -6, 5, 11, -73, 69, -55, -124, 51, -97, -92, -75, -1, -21, -38, 27, 40, -31, 76, -46, -144, -3, 49, 25, 4, -5, -61, -54, -110, 39, 59, 25, -103, -88, 16, -47, 6, 7, -62, -18, 85, 18, -80, 88, -25, 95, -10, -30, -24, 47, -62, -92, -142, -83, -25, -106, -102, 84, -27, -160, 9, 186, 48, 27, 19, 76, -11, 82, 182, 18, -143, -30, -22, -53, -96, -8, -32, 51, -51, -17, 51, 17, -42, 76, 7, -70, -58, -142, 69, 32, 49, 76, 98, -73, 14, 31, 65, 39, 159, 23, 35, -134, -62, 46, 57, 75, 44, 111, 60, 66, 68, 102, -40, -44]
-230d4
##PAGE=	F1=-10348.9
##FIRST=	23146.756194512010552,	4241.1435120000014649,	0
##DATA TABLE=	(F2++(Y..Y)), PROFILE
4241@K7q3N3M1Jjj29N8N7k8rJ12k0l6m6j8J77j88jNK9K8J3Jo0k0k2k5P3J04N9o7m8q5L7j23
3926a34J70q3J71K8j27l9l3J06m7P4j53K4J22l0K6kk7n8j79J91K6J1J6j11O0p9M8R2Ln9J42
3655A49j67Q6r1n8J18j71J03k6Q7k7k1M6R1j59J12j38J0N8k6K6o1J11n0q1Q9p2Rn5J95j91
3392a04J17k7m2j1M7n2R5j05j3K8N8R4O9j73q3J54L5j08K0n9L2L5o6O9R5r0P5qk1j24J9j02
3112a46J32R4j1m7L4r1K5k6M4nn3R3kp2J49k26J4K00j23R8n4R9o9Nn3P1o4n2J1m5K0r7J81
2824C4N8j03P0O5j24mrl6J2QK36q5j79Q5j41O7L1K1p2Rqq4J53mM9K4J4k8lp7k5M3R1L4j33
2517a1Q1j04j7N7j05N4o6Q5l8M6K7q5Q5j39J96j56R9l2p5L2n7M8rp7L3O3J03J4k5J79j12j10
2237a6o9J10j37N7O4N2j01P5n8q9J57N2o0M9l9m8j62J11J05P7o9J5o9R9l9j44J38j20J52n2
$$ y = [0, 27, -56, -3, 38, 39, 38, -91, -33, 24, -4, -13, 99, 79, 43, -3, -21, 156, -32, -33, -28, 1, 29, 42, 43, -17, -37, -59, -84, -11, 93, 152, 85, 37, -48, -11, -134, 36, -47, 124, 152, 25, -14, -47, 59, 12, 86, -67, -43, 79, 49, 75, 73, 46, -12, -191, 0, 26, 37, 53, -58, 2, -77, -29, 63, 66, 7, 149, -18, 68, -23, -81, 37, -134, -31, -57, 30, 3, -18, 28, 119, -40, 72, -66, -56, 2, -24, 2, -59, 52, 2, -79, 10, -62, -53, -108, 87, -104, 13, -14, -56, -67, -20, -72, 23, -82, -95, -67, -9, 85, 154, -19, -102, 52, 87, -21, -1, -60, -28, 7, -59, 10, 105, 15, 90, 82, 61, -63, -44, -146, -14, 80, 69, 22, 56, -35, -10, -36, 8, 3, -50, 43, 41, -31, 118, -108, -94, 106, -17, 81, 27, 126, 57, 62, 9, 80, 16, -36, -25, -70, -50, -147, 34, 92, -11, 59, 124, 0, -4, -13, -49, -37, -29, 207, 122, -57, 28, -113, -46, -15, 6, -66, -57, -65, -149, 4, 0, 49, 73, 87, 59, 56, -21, -46, -3, 88, 122, -11, 70, -34, -51, 6, -99, -45, -111, -26, -64, -18, 9, -76, 9, -130, 66, -90, 9, -23, -98, -66, -123, -75, -84, -161, -128, -65, 38, 52, 27, 206, 94, -16, -85, 25, -112, -55, 9, 61, -40, 35, -23, -112, 45, 97, 37, 86, 47, -1, -163, -52, 53, 130, 61, 76, 7, 106, 67, -77, 61, -59, 93, 41]
1975D1m3n0M2J12k14J54l4P8Pn8p3J38p4L4j17Rq9J22O5j44O1P7O2j75q8J88q6n5O8J7o4J47
1695E8J1r1K4l7l8K54j09l7k9Q2j40P3rJ5m7l2J30J8q9J6O0k08O9jJ11J3j62P9p0N9R5j07
1415c9M7j08P2N3J6k8r1K5j0k9KK04o6J0o2Lqj60J48L7o6qj4N4O4N7l7op0J4N5p5R4O7r9j94
1100a48LJ22m5J50k7j49P4m6R9rj18M4J90K3j32m7j24J72p8K1o2k7J04RP4r2N8l0j0k0k6J11
820F4j0r1m3Q7J05L3k00N5JQo8J04j07J4J57k14M3K2K6m6M5J03n7rN9j20j04J01J05m5Oq9
540f5NNo2J37P0j0j72j5R2p1O2M0q3K7J08p6l3J58j50J22j07l4M7R2j06p8n3Q1N3j00O8J64
260A16j81m3J57J35j64n5P5N4q6N9P0j90n5P3kl5l2P3k4M5n5L7J15j4j63J07Np6Rj00J84o3
-20b4P9l1N9j17J04o7K0M1R0q6J1j89N5J11oK8n7R8r0jL8J4j06j3
$$ y = [41, -2, -52, -10, 102, -112, 42, 8, 86, 93, 35, -38, 100, 26, 60, -57, -48, -137, -15, 50, -94, -33, 44, 106, -69, -157, 31, -55, -110, -42, -25, -89, 58, 69, -22, 2, -35, -73, 181, 72, 35, 6, 88, -52, 21, 12, 27, -20, -52, 78, 96, 7, 23, 83, -125, -56, -57, 54, 67, -95, -16, -86, -27, 68, -39, 8, -100, -28, 25, 41, 13, -78, -53, -63, -92, -90, 114, 48, 58, -4, -1, -9, -169, -21, 16, -50, -58, -72, -18, 46, 103, 66, 60, -10, 4, 59, -16, 78, 145, 46, -148, -145, -23, -68, 82, 55, -94, -20, -66, 33, 24, -94, -50, 140, 163, 31, -16, -140, 32, -46, -25, -87, -114, -10, -1, 73, -19, 39, 9, -1, -21, -47, 64, 54, -37, -80, 7, 112, 145, -55, 0, 1, 9, -59, 45, -62, -48, 109, -105, -62, -40, -14, -60, -15, 88, 31, 22, 81, -39, -143, -42, 63, 18, 24, -65, -60, -55, -117, 20, 90, 80, -92, -107, -15, -86, -24, 16, -67, -40, 68, -8, -41, 117, -33, 89, -18, -52, -5, 87, -19, -97, -150, -69, -16, -116, -48, 116, -65, -108, 49, 184, 20, -35, 40, 94, 8, 67, 137, -53, -108, -35, -37, -72, -104, -31, -55, -10, -65, -28, 87, 73, -90, 17, 22, -54, -45, -145, 39, -24, 55, 24, 83, -34, 70, 3, 23, 64, 154, 68, 79, -110, -55, 56, 50, 78, 21, 119, 29, 28, 66, 80, -26, -39]
-230c9
##PAGE=	F1=-10443.2
##FIRST=	23146.756194512010552,	4241.1435120000014649,	0
##DATA TABLE=	(F2++(Y..Y)), PROFILE
4241A3J8j38J00M1M5k7j32Q2L5l9L0L3K8m5n8pJ29j63j6N4L3K0P8j8q4l4m2L5P3O3M8q7l1
3952C7r9O7j33J26m6J77L1j47j5j6K9qO5j12j4J44o1L4l5l6nj18J52K8K3k7m7Jo6O3P4j2q7
3664c3J25p8Q2j12j9P9j46L9M8P8k9j0O1K8j49J05j38Q4Qk5n1J5J18q8j03R3o2L2p6K20j60
3392f4N8L7n6n3N0n9J28r6l2K3K0J37J5j17j07K17o3m4qm3L3J31j45K4J33q1R4n9m8o4j3n6
3112a08J09N1k1KP1q2n2k5J05j2n5O9k5n2J83k57M8J86j68J04j40J90m4pk9J9j6o4Kn4K1q9
2832a40K13M7j16N6P9j13%m5m6j6KK85n2k33Q1q6Q4m2J7o3L9Mr9J18J0L0P4l1p1R0j17k0J46
2544H5%P1j87Q0p3m7P6p5K9n0N9l3L4K9r4Q3j15J93j38R0o3k2K2p8O0m5m2J2N4J47m4L1J61
2255B10j61r0mP1j13O3O4np4N7j9j16J36J35p2Lpj03j72J34J37L8k7J7r2O9l4j38J88j39J92
$$ y = [13, 31, -107, -7, 34, 79, 52, -80, 2, 37, -2, 28, 61, 89, 44, -14, -21, 108, -55, -71, -17, 16, 36, 114, 96, 12, -22, -64, -29, 44, 107, 155, 68, 37, -62, 5, -128, -2, -48, 129, 160, 13, -2, -18, 11, 3, 68, -44, -58, 86, 25, 59, 24, -12, -17, -135, 17, 45, 68, 41, -6, -5, -71, -8, 66, 54, -33, 92, 14, 96, -16, -35, 44, -102, -63, -15, 63, 34, 24, 85, 113, -36, 69, -69, 15, 23, -2, -53, -38, 80, -8, -111, -18, -80, -48, -124, 96, -64, -6, 31, -25, -78, -28, -87, 41, -55, -87, -64, -44, 93, 108, -9, -116, 101, 38, -6, -14, -57, -24, 107, -38, -14, 119, 38, 132, 73, 25, -39, -52, -108, 1, 52, 31, 33, 104, 22, -30, -55, 50, 38, -17, 52, 27, -25, 158, -99, -51, 135, -33, 71, -69, 121, 77, 70, 41, 60, 44, -20, -18, -72, -51, -140, 73, 120, 4, 60, 139, 26, 26, -19, -65, -81, -79, 206, 154, -79, 2, -84, 0, -42, -25, -88, -49, -45, -144, -26, -16, 14, 88, 57, -14, 76, -41, -61, 85, 85, 156, -31, 49, -24, -71, 5, -70, -41, -91, -32, -65, -31, -2, -96, -13, -128, 65, -73, 17, -46, -68, -46, -124, -64, -109, -151, -139, -85, 62, 18, 49, 210, 49, -41, -45, 26, -87, -24, 40, 35, -39, 18, -1, -117, 19, 154, 82, 85, 78, -25, -197, -63, 74, 112, 85, 102, 10, 79, 45, -93, 95, -44, 148]
1983A48q3l9p3Q8J00k19J41o2Q8K0j11n0J29o4Q2j68K1r7J26M7j36Q5N4M0r3j81K17o0j8O7
1721ak1p4J23Nm5lj9j8K07j11m1L8M2j69J28QJ2r9j5J15j5j04K9O6j79Q0N2N5j7j27R6j27
1441a29N5J41r1J5q6N4L2j0P4j18Kl2j5NK30j0n4k4l1j9j13J24Pn5j3PN4N3P4Pn4j05k4J28
1143G9j02Q9Q1m2k67J2J87r7J57n2j40J09j00J17oj12P5J97oj50m2o6J34j12M9p7m5J44m3
890b9J04q1J0L5%k9q8J00O2j18l5J07M7jj01L7m6Qj6Q6j07O0J56k51N8M6k3o6Q4J31j21O4
610H3mq8j19N4J20l9M3j29K4lm4J05J02J4j94k7N6m9M9O5m6nR9q0K3J43j74J06p1p3P2P9q6
321Fp4p4O5Q1j19J35R5k33N7J60O3j55r1J39L0n1M0J1j86K9lM2l2l6L9j0RqN3J31k1j85M0
32e3O3m8J2r5J29r2J31m7P9o6R6j42J0R4L5j6K6j96M7J01n1N4n8Q9j04%P1po0l8
$$ y = [148, 65, 26, -47, 41, 141, -78, 63, 1, 89, 109, -2, -52, 77, 13, 95, -73, -52, -149, -23, 24, -112, -27, 27, 67, -26, -207, 10, -50, -68, -1, -22, -96, 27, 32, -13, -16, -35, -53, 154, 43, 2, 40, 82, -87, 41, 49, 61, -38, -53, 62, 47, -57, -28, 38, -141, -61, -9, 46, 29, -98, -2, -129, -74, 67, -24, -9, -95, -41, -9, -19, 55, -63, -61, -93, -108, -103, 127, 117, 63, 39, 8, -11, -124, 0, 7, -48, -61, -54, 0, 53, 127, 134, 80, -25, -49, 79, -23, 66, 147, 105, -162, -150, 37, -60, 97, 45, -95, 14, -86, 31, 25, -87, -12, 185, 179, 29, -13, -79, 55, -57, -8, -85, -130, 14, -29, 75, -6, 4, 39, 39, 10, -78, 22, 84, -34, -69, 38, 85, 84, -17, 20, -26, -18, -34, 52, -55, 5, 161, -90, -32, 14, -9, -75, 9, 140, 19, 83, 79, -9, -128, -74, 46, 7, 50, -79, -55, -58, -102, 3, 105, 119, -75, -102, -46, -95, -46, 19, -27, -32, 67, -13, 10, 153, -21, 85, 14, -59, 13, 92, 6, -68, -142, -77, 4, -115, 20, 115, -118, -61, 99, 162, 7, -84, 55, 85, 34, 74, 85, -101, -72, -75, -33, -65, -101, -62, -72, -63, -71, -18, 113, 92, -93, -53, 10, -38, -26, -121, 8, -84, 47, 0, 79, 13, 109, -33, -23, 71, 106, 90, 116, -80, -33, 68, 17, 71, 13, 102, -2, -2, 69, 62, 2, -36]
-230c6
##PAGE=	F1=-10537.6
##FIRST=	23146.756194512010552,	4241.1435120000014649,	0
##DATA TABLE=	(F2++(Y..Y)), PROFILE
4241B8Lj67J48J4P4m7j14Q0L1j5P3q4N3m3n5lP0r4l8O9L9MJ45l5p1p6m9P9O5M2qq0kr2O3j16
3926a09J09n7J73L0j52Kqk1K2L7l9p3J76o6K0q7j9N7n9Q7L0L1p6L1n0n1Q0K8nj10J09k7Q2
3637I5r9nN1j21j6Q5Q8j4NN3m7j05P9j18J28k5l4j05R4J28j33j00P4l0L4r0K09j16j0J36q5
3366Fq7N2n8J57r7l3K3n3J55k3l6j18K46j33Mj6k7M0J76j78n1J62p9J10j01n4Lk6l5P7pl6
3086c7Q7O5l1j19k4J33k8n7P0m9j9J83k40P0J30j82R2j96K44ok8J1o7P6r1j3k8J3p3K21J8
2815A25j11O1P0j16K9p6o6k5PK69lk48N7qJ01j22J3o4L1M2q6P4RJ5J13r1p9J62j49j5K55r5
2535G9P9k14Q4l3p5P9j2ro4M1K0Oj0o4O7q9J73j08N9q2N6Qj09M1l5j6jL2J89q9N1J09j63l8
2237c8L7L2o8J9M2l3j7J0K0j00R0K00r0k6nj30j54J22J56JK9j5p5L2k5j14K06j35J98j04j2
$$ y = [28, 31, -136, 12, 26, 100, 53, -61, 19, 50, 35, 108, 24, 77, 34, -21, -24, 46, -48, -86, -17, 22, 26, 171, 136, 65, -11, -60, 19, 84, 126, 118, 38, 36, -56, 7, -109, 0, -57, 116, 146, -6, -4, -12, -33, -11, 26, -13, -86, 90, 24, 44, -43, -62, -5, -64, 23, 53, 84, 8, 39, -11, -62, 18, 46, 41, -69, 40, 13, 95, -4, -9, 42, -79, -95, -10, 78, 64, 69, 122, 75, -30, 49, -69, 59, 34, 0, -105, -11, 117, -16, -116, -42, -72, -38, -128, 81, -35, -45, 91, 6, -81, -29, -87, 70, -27, -60, -37, -90, 65, 42, 6, -112, 134, 1, 5, -11, -38, 2, 178, 0, -51, 111, 32, 142, 41, -13, -10, -36, -71, 6, -1, -37, 50, 115, 84, -35, -59, 74, 46, -11, 59, 10, -9, 174, -66, 4, 134, -48, 44, -152, 92, 86, 58, 69, 2, 78, -13, -26, -54, -41, -114, 107, 125, 14, 75, 145, 29, 58, -18, -84, -109, -102, 167, 164, -84, -27, -35, 66, -56, -43, -107, -76, -34, -120, -46, -37, -22, 91, 0, -79, 83, -66, -81, 174, 79, 158, -56, 28, -5, -80, -1, -13, -22, -86, -45, -25, -19, -29, -93, -26, -115, 58, -50, 9, -73, -17, -9, -118, -77, -112, -128, -129, -97, 92, 3, 54, 163, 0, -38, -1, 31, -37, -18, 24, -9, -26, -16, 4, -96, -6, 194, 104, 78, 73, -57, -211, -89, 67, 68, 97, 82, 7, 39, 14, -100, 106, -29, 169, 65, 53]
1966E3p7J08Q1j96R6p3R1J7j39PR3o3J22j95L6j20J12L2j02R4J6KMk01J85moO8n0o3O9j5j8
1677c6nL4j9J49j00l8O5K1j69J41J9lj17L5P3m2r9J7N7j04O4Q0Rk7o4Q2j57M5J70j05j9l5
1397g8L9Nk5J52j16rn7lj7K09P4j22Ql4n2m7O6kl6j6O6J3M5O4M6r1j09o2J72j07P4Q5lk92
1100a60PK27j05J25o8q6R8j21Q5k1m6O9J83k3j40l9L3M9j29O7o8l3J41o7J10r5j8Q7J5l3j32
828h8Q5J06j17j3J15j6o2kL4j10RN7Q3j32O9J75k56N1Q0m1r3Q1J49j64J19m6l9j41K6Q9jO6
548G3j23Mk0j4P9J01M1j96k6K1mK9O1J3m6Q4p8N1J32j74N9Mj04O0L9n7k3j14K9J16j29J68
268E6L7k60J36J55Kj14j14J56QoM9o7j52P6r8J25l3m9J2Nj0K0P5R7m1j18o2Q6NJ6p0P5j12
-20a15J48j1O4m8P2j86L2J11k9M8N1j78L1O9r2R5l4M7j04MJ01j7k1p8
$$ y = [53, -24, 84, 165, -31, 65, -8, 83, 100, -39, -32, 61, -2, 120, -75, -39, -159, -47, -15, -117, -23, -7, -5, -1, -202, -17, -21, -27, 41, -9, -72, -3, -18, -36, -41, -7, -26, 123, 23, -15, 50, 71, -98, 43, 62, 59, -58, -23, 50, 8, -91, -74, -17, -121, -57, 23, 32, 5, -59, 23, -134, -89, 81, -24, -43, -78, -39, -34, -59, 93, -23, -32, -89, -92, -109, 100, 174, 52, 60, 26, -26, -73, -7, -9, -45, -61, 5, 18, 63, 127, 173, 82, -27, -89, 83, -24, 50, 135, 132, -160, -153, 74, -31, 94, 26, -60, 38, -83, 2, -19, -65, 4, 187, 164, 24, -15, 18, 67, -62, 5, -63, -96, 45, -22, 88, -7, -25, 62, 77, 44, -88, -3, 103, -14, -27, 88, 72, 10, 8, 42, -68, -59, -2, 81, -51, 18, 193, -63, -12, 68, 27, -66, 15, 164, 0, 119, 73, 34, -107, -81, 8, 7, 73, -50, -46, -66, -80, -1, 100, 141, -55, -81, -60, -64, -35, 26, 39, -7, 77, -1, 50, 182, 8, 67, 71, -33, 27, 66, 9, -14, -128, -99, 17, -112, 56, 93, -167, -31, 124, 126, 12, -102, 54, 62, 56, 105, 38, -114, -38, -136, -11, -44, -93, -81, -76, -86, -66, 9, 106, 65, -53, -115, -29, -24, -8, -78, -3, -115, 33, 22, 86, 38, 110, -76, -44, 67, 38, 86, 137, -41, -10, 59, -33, 62, 28, 75, -29, -25, 76, 59, 38, -40]
-230d0
##PAGE=	F1=-10631.9
##FIRST=	23146.756194512010552,	4241.1435120000014649,	0
##DATA TABLE=	(F2++(Y..Y)), PROFILE
4241A6jj43J74k6O6n8p3O4M9J8J05j90L9k1m0j3K5j0o2O3L9j4J87l8l9j33k8Q5M6N3p7o3L6
3952C6p9L4o0R5r9J47L0j34J0j3k8L0RK0j11J97m6qj22RR7k7L8K0K6r6Q3o8o0J14k5J3j24
3664i2J02m7Q8l3j8L1j02n2J01Q1J5K3L2j05n6O3r1J11k4m5j08J29J40j67o4M7JLo9J60p6
3392b2n3K13j12r5N2n3J72j17qL4j26J33j5J4r5K23j48MMj1M3J66j76j13J80q8J25j28k6M0
3130A7k0m7N9o0n6J70J6N0j59k0J16n3n0J04p8K0J49j80Q2N2j60N4j99K38M7n5M6j54J69j17
2867a9k1K4Jn2J87j8q8R1M0j33N7p1p5k1NK11L4k21K2P8R6j87Oo8kJ06p5K9kPJ36j43l9J74
2570F9j43k0L25j54N9k02Q2kr0P4N9o3p6K0Q8j2n9qK7o3J41r3L0q1J35k0j21kJ1nj5OK21j11
2272GK9N1j20J5L2K7j7n0Rk0L2o3N8m8K8K08r0j6k4j44j03P5J68l0P4n3m4okp8J88j28J84
$$ y = [16, 15, -128, 46, 20, 86, 28, -45, 19, 68, 86, 191, 1, 40, 19, -21, -34, -9, -19, -81, -18, 21, 7, 194, 156, 117, -16, -44, 41, 87, 140, 63, 0, 36, -43, -9, -69, 26, -73, 74, 104, -30, -20, -33, -61, -31, -22, -2, -113, 84, 38, 30, -92, -83, 14, -13, 25, 45, 71, -25, 58, -10, -70, 44, 19, 32, -92, 10, -37, 51, 18, 0, 31, -71, -123, -22, 59, 74, 97, 129, 24, -32, 31, -60, 51, 27, -18, -126, 3, 143, -24, -88, -41, -40, -37, -106, 54, -22, -75, 138, 26, -69, -17, -70, 102, -15, -23, 11, -115, 18, 3, 17, -78, 145, -3, 1, 5, -6, 37, 203, 27, -86, 94, 6, 131, 3, -23, 17, -3, -50, 9, -51, -107, 63, 79, 129, -30, -50, 66, 13, -37, 67, -11, 9, 158, -22, 60, 112, -48, 6, -193, 45, 92, 37, 83, -71, 98, -19, -40, -16, -15, -67, 120, 102, 14, 105, 145, 12, 69, -2, -77, -98, -93, 118, 152, -69, -47, 31, 127, -60, -54, -122, -124, -18, -93, -64, -66, -59, 77, -66, -105, 69, -74, -94, 231, 77, 136, -66, 16, 14, -76, -2, 57, -6, -82, -62, 26, 14, -45, -53, -26, -89, 52, -41, -11, -92, 43, 23, -98, -100, -89, -94, -109, -103, 118, 7, 36, 87, -33, -18, 14, 41, 24, -26, -17, -37, -5, -68, -10, -58, -30, 178, 88, 72, 48, -96, -199, -124, 44, 14, 88, 35, -9, -15, -17, -95, 93, -35, 149]
1983A49r7mm3R6O7j56M1o6Q6mj40P1M2o2J48k05O8j49P9L3m4O5k3j7O5j46J06O4m6Q8o0m2
1703c6J4k1J8oO7k7R6r9k2M9K0j47J15J5j3j00J08Nm6n1l0K6j0K0R4k7j8NO7j56K8J63j29
1415b8m6J8L2l4j8J76q0Np8Ro9J56J57j87K3J2r2J3KOj8j6J35n4M7M0P3j14p9q9J60r1P4P5
1117A20j0k58oK38o7O1o8j6N3j16L0n2M9M3J45j7j16l0J32m7j29P2m6OJ09o9R4j18k9R6M7
846A01k3j48P1J06q7J2Q8m1j25M9M8j55J5J16Q0j65N2K03k35L2J00j2j29M0J60j80J36l7p
592F5j53K2L7M9P2r6l6l8K0O4P5O3j82j5NL9J9K5O9q7O6p9M9J35j50qQ9r6J3Jl7M5j61OJ13
286Cj15J45M1k64J78J18k1o2j15J26QK4P3j39j05R0j71K11n0n2kNkK0J04J9n6j7j43P2O7L
6gk3L4j02J15O2Nm8M0j88Q2Q9o9P2O8j20j8K6j01J34Lor6PJ18qkj15
$$ y = [149, 52, 48, 5, 101, 168, 12, 53, -13, 73, 69, -71, 0, 42, -20, 128, -77, -9, -158, -79, -46, -90, -25, -48, -65, 0, -146, -40, 24, -22, 66, 6, -36, -22, -43, -25, -31, 36, 9, 105, 6, -16, 33, 53, -94, 21, 36, 23, -77, 31, 36, -10, -61, -91, -65, -75, -55, 39, 12, -6, -1, 66, -90, -62, 101, -28, -74, -56, -24, -58, -76, 100, 20, 25, -53, -44, -113, 43, 200, 13, 36, 48, -44, -31, -29, -23, -41, -57, 78, 24, 71, 111, 184, 70, -9, -98, 62, -29, 45, 120, 110, -148, -154, 84, 17, 78, 10, -6, 47, -69, -39, -91, -42, 1, 146, 129, 13, -17, 115, 68, -61, 11, -35, -29, 80, 11, 105, -13, -42, 54, 101, 78, -70, 1, 107, 20, 32, 120, 79, -46, 3, 51, -104, -89, 27, 107, -58, -6, 197, -38, -6, 94, 82, -47, -7, 153, -27, 109, 72, 65, -88, -66, -29, 20, 92, -4, -40, -78, -58, 6, 81, 144, -38, -53, -48, -9, 10, 35, 104, 17, 83, 4, 53, 188, 38, 30, 119, 23, 36, 37, 0, 45, -116, -110, 3, -112, 33, 74, -190, -12, 106, 85, 23, -92, 34, 42, 66, 139, 0, -105, -15, -186, 25, -25, -77, -79, -74, -76, -56, 48, 67, 11, -6, -149, -77, -10, -7, -30, 4, -98, 17, 79, 84, 36, 76, -112, -30, 59, -10, 62, 130, 10, -8, 18, -83, 51, 54, 48, -48, -41, 77, 69, 67, -48]
-230d8
##PAGE=	F1=-10726.3
##FIRST=	23146.756194512010552,	4241.1435120000014649,	0
##DATA TABLE=	(F2++(Y..Y)), PROFILE
4241c3J8o8J55n5K9o2k3M6P4L4J26k43nK0l4k8J3M7q0O0K9l1J91k9j3j69J6M5K5P7j20m7P5
3952D0q2jK3P0j27R2K6r4J0k0lJ4j4N0j08J90j9l0j17K6J07l3K1mJ4p5R0n2r2J70o3K4j35
3664a02J04j20R4P0m3J2q0p5J17M3L7L8J4j25l1P8o5L9kn2n4J03J50j87j3K8K4n6j1Q0l4n0
3384f9K19j23p6N5m1J50j38K8O1j57O8L8ll0J52j18l5M8NK6J25j65j28J91j00J37j40K3L8
3130D1k4n7O0r7p1K09m2J25j74j6P7q1l6J61j10P0Q7r7P7k3j01nj65J86R6o5M9j99K17j21
2867b9j7P9j2l6J16m3m4J21J0j53M8j3n9j2k1J45M5j59mJ40N3k16Lo6k4J59q5rj6PJ47j68
2587a13J8J35r3l6L25j56J4j50O4J8q5O5J11j18o4j2J29jq5N0l6l0R9j01J1m3J74n7r5m8N9
2316e1%l8j5K33j08j6J1n6M0pN9K4j06k3K7M2j40R7J6m0J54o2K8m0j61l0J2J66m8R2p0k6l5
$$ y = [-33, -15, -83, 72, 17, 46, -16, -39, 7, 81, 115, 241, -2, -7, 13, -21, -49, -36, 11, -69, -9, 20, -11, 180, 151, 138, -31, -15, 30, 55, 132, 12, -35, 40, -42, -43, -20, 50, -77, 15, 41, -53, -43, -63, -66, -52, -66, -16, -124, 66, 47, 17, -100, -74, 33, 0, 21, 17, 31, -44, 46, -6, -98, 72, 9, 33, -102, 2, -118, -24, 46, 3, 15, -65, -140, -23, 20, 57, 95, 109, -16, -47, 31, -34, 5, 3, -49, -103, 0, 150, -37, -50, -22, 2, -54, -65, 15, -19, -69, 150, 27, -49, 6, -35, 115, -23, 5, 66, -91, -23, 15, 12, -18, 134, 16, -19, 29, 34, 60, 185, 20, -108, 83, -17, 120, -20, 3, 41, 17, -40, 20, -77, -148, 61, 19, 144, -30, -46, 31, -50, -86, 75, -35, 35, 122, 25, 102, 79, -22, -27, -192, -6, 90, 25, 74, -125, 92, -29, -46, 33, 21, -15, 101, 58, 14, 135, 145, -8, 40, 27, -32, -44, -65, 80, 125, -34, -38, 102, 155, -61, -58, -124, -148, 11, -74, -83, -99, -92, 55, -113, -95, 40, -53, -89, 236, 80, 94, -56, 8, 26, -59, 6, 117, -1, -65, -77, 52, 51, -34, 16, -20, -50, 49, -52, -41, -84, 90, 33, -62, -110, -51, -51, -89, -104, 129, 21, 5, 16, -40, 0, -7, 52, 76, -30, -53, -26, 16, -124, -27, -11, -51, 103, 41, 69, 29, -132, -162, -150, 16, -32, 60, -10, -36, -71]
2027g1K8m2J51j31J75p2l4K6O8N3j17On3P9l7j19J08j1m9J55j98J04j60M8M6K8rm6oO1n1J7
1747e3J18j19J20m5l2j4rO8j2N6l1M8j14QJ4L1j25Q0oj9n2J74o8l0L7j08nO1l3J05o1J0N5
1458D9O4j27NJ17j41n0M9K7p8PJ46k1L4q3K0j30R2K09k32K3Q0j09M1l1J5Jk1J72j26O0K2R3
1178A77j20l6r9J00o9J03N4n7j79j9K21nj2n3L7Lj06op8J10K6Q9J2r7j5J94j08j21O5k5N1
907C7P2o0O1j30k3O3Q6jj38O4O8m0K7K1j0j58L9N9j61K8J47O1j84K6K23j92RQ8M3j59j7J65
627A14j74J15K3j7j36K8qQ3P9p3q0n0O3N6M0O1j51JQN9K7l3J02j05L8p7K2J51j08o6J36m2
347H6m5om2J04k06J2N8p5Q4J04k53J79N7j0k2r4P2K6L1R1j76o8Q5j94K61p8k4j7k4L7jJ32
67H4n8o4M6j63N2J09l8M9Ko1M0J33p1l4Mj57J21N4o5N0O0k3j05%p6J46L4m8q4RJ20J3Kj31
$$ y = [-71, -43, -85, 66, -65, 110, 38, 4, 30, 98, 151, 34, 40, -13, 66, 29, -90, 18, 7, -42, 113, -85, 19, -141, -93, -47, -19, -28, -74, -80, -19, -70, -53, 65, -54, 66, 21, -11, -25, -34, 34, 22, 78, 47, 95, -19, -11, 3, 34, -91, -11, -17, -36, -88, 86, 18, -12, 25, -83, -88, -27, -60, 45, -16, -6, 49, 113, -14, -9, 108, -33, -83, -34, -7, -85, -78, 68, 47, 81, -2, 18, -112, -20, 189, -43, -20, 60, -49, -8, -39, -24, -23, -44, 128, 2, 62, 84, 177, 57, 21, -78, 22, -47, 56, 110, 53, -126, -145, 76, 71, 59, 6, 43, 46, -60, -66, -144, -34, -8, 81, 93, -4, -19, 175, 67, -54, 11, -14, 37, 109, 49, 110, -20, -43, 20, 106, 105, -33, 31, 99, 59, 86, 107, 97, -61, -22, 37, -124, -96, 51, 112, -72, -46, 177, -15, -6, 82, 125, -34, -51, 114, -60, 55, 78, 61, -75, -47, -55, 28, 107, 34, -46, -96, -33, 23, 63, 124, -27, -26, -18, 41, 68, 35, 137, 32, 70, -7, 15, 166, 58, -8, 128, 86, 41, 35, -7, 97, -109, -97, -39, -114, -30, 74, -179, 0, 57, 47, 25, -69, 3, 29, 60, 151, -25, -93, -8, -202, 59, -19, -43, -60, -84, -47, -48, 84, 26, -38, 8, -155, -103, 6, -32, 17, 19, -42, -2, 131, 60, 26, 30, -127, -6, 48, -17, 33, 93, 70, -35, -35, -111, 35, 69, 21, -63, -54, 66, 79, 81, -50]
-230e0
##PAGE=	F1=-10820.6
##FIRST=	23146.756194512010552,	4241.1435120000014649,	0
##DATA TABLE=	(F2++(Y..Y)), PROFILE
4241a06N8L0R5o8qn9J3L8P6L8J31k33m4O5m8m5L6O3q9O3K0n2J61k3%j51N2pLQ5j18k3R5j12
3944f4k1R4N2j13J9Rm6J2j8K5j5l0N4o5J50j0l3p9L2Q9n6Qk6K1l3O3k5j19K25p4J6j42J06
3655Fj93Q1J73n0j7n4q4J36j0L3M2J0j14l0J20m6m1Rn0K6M1J53k04K7K8N0j21M6lK1mJ47j14
3366A4n0P3k5Q2j28M6R3j24k8J05o1M5O5o7q5J01J9j8Q7j61r4J94j12J46j46P6J6o3k7O8j17
3095g6p6J94o7J55j71k3O0j08k8K08j23J27J9j9N4q8qo7j25J15J13l8J6j71K03j05oJ10k0
2841E5l3L2m6K1J19%j66oQ4k7Np3Q7M0p5j7J65k6k03J0n8qJ69j04l5l5RJ58j65N0Q7k8m9K50
2544A87j09m2p8M2K8o8O0J26j42l7m8J15L9o1P4j02MN2j17QK1J51q8l0p6P1J8p1k6K19r0n2
2264b2JpL7o0J11L4j14m3P2K7j99J38O0r7O4j0P8l9j85M3m0J48n8Q6o1j8n3N3k6J23j41J80
$$ y = [-106, -48, -18, 77, 9, 1, -58, -45, -7, 69, 107, 238, 5, -39, 26, -22, -67, -31, 32, -57, 6, 26, -26, 135, 112, 112, -39, 13, 6, 9, 94, -24, -47, 48, -64, -85, 9, 61, -52, -33, -24, -70, -58, -76, -51, -66, -96, -42, -107, 43, 33, 0, -79, -47, 42, -14, -6, -32, -11, -44, 19, -6, -125, 100, 26, 42, -100, 6, -187, -106, 67, 17, 0, -54, -138, -2, -12, 21, 63, 73, -41, -71, 49, 3, -38, -29, -79, -53, -12, 141, -63, -36, -8, 42, -79, -33, -36, -15, -19, 128, 14, -36, 37, 12, 94, -34, 12, 105, -19, -47, 58, -3, 42, 107, 40, -45, 56, 75, 57, 144, -17, -111, 83, -29, 117, -29, 47, 63, 0, -27, 41, -76, -152, 42, -25, 130, -41, -64, -4, -112, -140, 68, -55, 72, 91, 72, 126, 38, 30, -37, -162, -47, 66, 28, 44, -127, 76, -29, -35, 75, 55, 22, 54, 8, 29, 148, 148, -18, -24, 60, 33, 38, -35, 52, 92, 17, 0, 165, 139, -64, -54, -112, -120, 49, -55, -90, -125, -116, 42, -123, -73, 14, -14, -63, 187, 78, 36, -42, 0, 28, -40, 20, 146, 4, -33, -81, 34, 73, 12, 86, -16, -12, 40, -77, -69, -48, 103, 15, -15, -91, -20, -2, -73, -99, 120, 30, -22, -21, -28, 9, -51, 60, 94, -20, -63, 9, 36, -163, -25, 35, -62, 2, -8, 70, 31, -154, -111, -151, -3, -61, 25, -36, -54, -107, -54, -80, 43, -98, 82]
1983H2n1r0J03N0K1r0J1m6P8o1r2R5n3j8J45j77J23j35L7N7Q9j01m1J5pM5m3J37j69J38j3
1712C9m4j9k5J01QL7k6Pj36M7nM0j14N5l6k9J8J93j14rJ32j89j2Q5p6J16r7O0O4P5q8k2N0
1423H6j24k5M0K3j05L1Q4L8O0o7L1j72L6K05k32J2J29p9J7j4J5K3l4J59j88P6K1J16j08qr3
1152d7K9n5J45L0j08q7k0J69N0n2m4O8l5j04Kq6R7L1L5M7q6KJ99j09j15N5j4P8M7n6K3j25
872c6%K5J12K2j23N9L1nL3n9N0j38j7M8j30M5J49K7j64kK12j32j4N5Q3j65n9J58j60P6J00
601H1n7r0K7l0Q5J00o0j28m3J15M1J2L0j08J4K6N6L3q0R7q7jn4j2J62n8j00J18L6p9J7p0J37
312A30k30L1k4k2K5J79k34J50OJJ0p3K4M7K6Q5j66n4P6j69K52j04L9l9p3Q8k8J48q6p3M9j36
32a45N1J21r6J36m2pm2J67j22Nk8j23J24L4k3KL0P8k01J3l7J20M4p6o5J5J09L3jj21
$$ y = [82, 31, -59, 44, 94, 115, 25, 36, -10, 68, 7, -85, 10, -43, -61, 84, -93, 30, -105, -68, -11, 78, -23, -64, -49, -56, -11, -54, 83, -86, 52, 39, -5, -24, -49, 52, 60, 97, 71, 78, -58, -11, -16, 24, -90, -35, -71, -100, -82, 111, -3, -12, 120, -69, -81, 4, -72, 44, -53, 7, 71, 146, 58, 36, 86, -38, -63, -23, 0, -105, -74, 10, 48, 108, 41, 72, -100, -64, 141, -91, -79, 50, -29, -12, -26, -11, 12, -22, 137, -51, 25, 46, 162, 54, 46, -47, -18, -73, 72, 102, -6, -93, -113, 56, 106, 54, 10, 78, 43, -61, -59, -145, -48, -17, 18, 65, -21, -19, 180, 71, -44, 11, -3, 75, 122, 66, 89, -36, -36, -11, 101, 123, 0, 59, 90, 85, 118, 59, 109, -29, -46, 2, -128, -83, 66, 93, -71, -73, 139, 7, -7, 48, 131, -34, -93, 65, -95, -19, 81, 24, -66, -39, -69, 16, 116, 56, -72, -115, 0, 41, 53, 83, -25, -11, 15, 71, 104, 24, 121, 34, 33, -21, -33, 129, 71, -29, 89, 125, 46, 63, -7, 130, -100, -69, -93, -115, -90, 89, -145, 5, 11, 12, 22, -51, -27, 20, 46, 131, -35, -89, -13, -182, 70, -34, 5, -34, -107, -19, -47, 101, 15, -58, -9, -145, -94, 27, -69, 67, 25, 18, -24, 143, 21, 26, -2, -125, -1, 33, 10, 12, 42, 120, -81, -68, -105, 15, 59, -17, -82, -67, 42, 75, 74, -47]
-230d7
##PAGE=	F1=-10915
##FIRST=	23146.756194512010552,	4241.1435120000014649,	0
##DATA TABLE=	(F2++(Y..Y)), PROFILE
4241a74J06J05K2p3rn1J7M4M1M4J18j80m4Q8p5o1P6N1r1O0K6q1J15l0J2q4N7k9k6P0q5OR6
3952F1j59j9J23P1p8n0k3jJ7KK2k9n2N9j2Q7j6k1l5L5N3p3k5k6N4nL5oj07K40o3oj41J04k26
3646b10M6K33k3n2m0o8J43m7OK8K2q6m7J62l0q9ql7R1j4J46k25L4M0R7j58O3p0Q5N1M6r3l3
3357c7J07oj9o7K4J16n0j16J38j05Q8%k6j06J46J3o6O7j58l7J80j19J42j52J20lj25N1O3j25
3095f2p2J48m6J35j51n0Q1j27l4K21r9J75l9L1K6j39J03j15j06N1Q1J9k6q5J48q3OR8k0l5
2832C4l7l4R6P4J7j67p8J75OL0j28L3L5J6k5J61j15j69L6n4M5J25r5n0o4J1J67j40L9O6J3
2561B3n3J35m2r1j2L7K4n1N9J09j20k1o7O2Q8%M9j44K5Pj18J7Q6Q0j02N5q0L4N9j12k8J83
2281I1o3o7J9NK5r8J51J2q1l6Q3J4k18J56P5j23k3M5J03k0k05R1o1J09n4P1l8j4o0O5l2J16
$$ y = [-174, -68, 37, 59, -14, -23, -74, -57, -13, 28, 72, 190, 10, -34, 54, -21, -82, -6, 45, -46, 14, 40, -41, 74, 44, 56, -28, 29, 0, -26, 44, -41, -35, 61, -98, -117, 6, 77, -1, -51, -74, -75, -58, -56, -34, -63, -115, -56, -68, 19, 3, -18, -53, -18, 35, -38, -63, -89, -35, -40, -5, -11, -118, 122, 59, 53, -88, 16, -210, -164, 69, 46, -6, -46, -114, 29, -18, -12, 16, 38, -48, -95, 67, 37, -52, -60, -97, -6, -20, 126, -99, -65, -25, 72, -86, -23, -93, -8, 43, 89, -4, -37, 70, 64, 45, -22, 2, 118, 68, -48, 90, -15, 73, 73, 47, -59, 87, 100, 34, 101, -57, -94, 86, -33, 109, -43, 77, 74, -51, 0, 63, -62, -134, 14, -32, 103, -48, -98, -17, -144, -178, 43, -56, 119, 80, 111, 137, -2, 101, -14, -120, -69, 12, 31, 5, -80, 68, -15, -9, 89, 69, 34, -3, -37, 59, 133, 150, -17, -95, 80, 86, 116, -12, 21, 56, 72, 47, 208, 93, -76, -40, -94, -49, 76, -19, -69, -133, -122, 45, -95, -56, 10, 23, -30, 105, 63, -28, -40, -3, 21, -30, 29, 138, 18, -3, -70, -8, 80, 80, 129, -15, 10, 17, -101, -84, 2, 82, -20, 35, -45, -11, 48, -64, -92, 91, 28, -39, -20, -15, 10, -88, 63, 75, -6, -42, 41, 55, -163, -7, 68, -55, -78, -33, 70, 50, -155, -64, -125, -16, -70, 1, -37, -51, -111, -46, -78, 38]
2001C8j43J84n1j41J61N5k9q3N5n2R1p0o5M2p5K1J22j44J05p5M8N3J16j64j8J9j04J17n4J19
1738G8j63J20L5p7k2r5Q5O7N8j9k8j35Q0jL8r7L9o2n1Q9J54j16%J98k40J1O7r5J14j18J20
1467C4K4R2m6n4pq5J5lK2r2L7K4O6P6l6L4j72mJ42j79NJ35k0n2M0QN1n1J10k33Q3M3J36q1
1170F2j1p5j0o0J71J4j38j1NQ5P0l6n7Q9n8j08M0o6J6N9oO4o5J5J43n2j19O0j6P5K9o1oj02
872f0K9J7J11K8j20O2K1jL7j15Q3o5p5%p7N9J44j2j08l0J69p2l1K4Q0j44p0J39j49L9J56q6
592a7m0J3l7O9J22n4j66j7J63J8oj7o6K0O0L6J6r0N3l6l4jm4J49j2j10M4J07o6M4j06J41k16
303h0L3q8K2NK05k07J12ok2N7p5kN7K8N0j18o1P5j31J92j13J24o4j18J22m7J40m6r1J6j02
32a33P4J03j36K13j04L6r2J49j18M8n1j13R8M2K5m6KJ38k52O2j7O9L6j01l7K7R4L8kr3
$$ y = [38, -105, 79, 28, -113, 48, 103, 74, -9, 46, -6, 85, 15, -50, -8, -83, -62, 60, -84, 21, -54, -6, 47, 163, -1, -19, 0, -104, 13, -41, 78, -85, 35, 70, -7, -29, -124, -39, 28, 86, 67, 39, -96, -16, -17, 21, -76, -37, -99, -150, -61, 93, -23, -23, 175, -65, -54, 13, -82, 32, -86, 34, 58, 150, 104, 50, 43, -42, -27, -30, -8, -100, -63, -39, 27, 103, 67, 101, -71, -75, 67, -112, -107, 28, 8, -44, -4, 4, 55, 4, 114, -119, -36, 7, 143, 62, 51, -24, -34, -94, 77, 91, -47, -58, -53, 32, 102, 66, 9, 98, 40, -68, -28, -94, -78, -19, -25, 39, -26, -11, 132, 80, -39, 21, 5, 80, 109, 48, 42, -60, -31, -14, 97, 125, 5, 67, 88, 87, 124, 9, 92, 27, -48, -48, -125, -66, 78, 66, -42, -72, 97, 25, -6, 18, 98, -46, -116, 23, -126, -87, 69, -17, -57, -44, -81, -12, 110, 56, -110, -127, 36, 54, 48, 31, -35, -15, 45, 81, 97, 7, 60, 24, -10, -11, -55, 94, 82, -28, 16, 123, 57, 101, -5, 136, -80, -47, -135, -113, -108, 97, -110, 2, -4, -26, 31, -44, -46, 11, 39, 89, -29, -90, -15, -146, 46, -67, 57, -7, -125, -3, -50, 90, 44, -47, -31, -133, -59, 44, -92, 121, 17, 53, -39, 110, -8, 40, -11, -124, -26, 16, 41, -5, -3, 135, -117, -55, -72, -3, 33, -68, -105, -78, 16, 54, 52, -41]
-230d1
##PAGE=	F1=-11009.3
##FIRST=	23146.756194512010552,	4241.1435120000014649,	0
##DATA TABLE=	(F2++(Y..Y)), PROFILE
4241b10J40J32l2q7L7m4jO3k1O4Q0j22JQ0q8q5J09L9q7L3N6j09P2n5L6kK3J2p7N3m8K7Q7j94
3944a18LR6J31o1r2n8L2K4M2l1pq6P2L1J6j7j3kM3J1p3p7LR9j2J9Om6J92m2k6j27J01k14L
3637a78K36K4p8n4k4J21m8k9QL3m6p7J75j0r0l9k7J21l5J26k35JN4J65j46K6j07J34P7k0p9
3366b1k8J50J3j17J8k1J17J8j57J02q7P8k1j4q3J68j9q6O0j41RJ36j23J31j57J52qj82J47
3112C4M4j27o3J05OP3j06q7J21j38n1J95l8J85p5M9J1j69J96j35j10PJ4O4l0J2R2q0J6N5k3
2841D7k4p9j3J55PM8j52j20K04K8O0j55k3K9R4k7J47j83j44P4n8J05O2m3n8r7J4J54r3KP1
2570C2J5n5L0J9j19K8N3J4m6O0P4p0k7n5PJ22O6j2j51K7k9j04M2J24kj00J32o0l7J14j53k5
2290h6J29l0o8N5j5K5j12J60k4l8%M8L2j96J27O9j04q4Q8R2Kk10J07n0N6m0O3j6j1o0P0m8
$$ y = [-210, -70, 62, 30, -57, -20, -64, -65, -2, -23, 41, 121, -1, 0, 80, -8, -93, 16, 55, -32, 1, 57, -52, 20, -35, 1, -1, 22, 34, -43, 10, -38, -11, 76, -118, -115, -19, 112, 51, -41, -99, -67, -43, -1, -32, -39, -125, -53, -22, -6, -23, -36, -38, 5, 16, -57, -134, -131, -32, -44, -25, -19, -65, 127, 85, 59, -68, 33, -181, -178, 58, 82, 4, -50, -74, 47, -1, -30, -22, 11, -35, -112, 63, 53, -37, -76, -103, 18, -17, 109, -126, -125, -71, 94, -52, -26, -133, 1, 78, 58, -21, -49, 101, 114, -3, 15, -6, 111, 129, -28, 74, -13, 65, 44, 30, -53, 115, 96, 10, 70, -71, -62, 74, -49, 82, -75, 77, 69, -113, 34, 78, -49, -112, -7, -1, 72, -34, -121, 0, -138, -189, 6, -32, 153, 78, 127, 138, -31, 165, 30, -80, -73, -59, 5, -25, -13, 79, -1, 15, 70, 47, 23, -56, -69, 86, 93, 141, -11, -131, 73, 101, 161, 6, -17, 12, 106, 79, 226, 43, -101, -27, -85, 20, 82, 39, -19, -116, -102, 52, -41, -39, 32, 47, -8, 22, 41, -78, -50, 3, 17, -29, 31, 105, 35, 8, -47, -40, 82, 148, 136, -15, 12, -17, -121, -79, 45, 43, -57, 75, 15, -22, 92, -61, -86, 43, 13, -55, 0, -15, 10, -102, 58, 34, -4, -4, 44, 76, -120, 7, 76, -28, -112, -24, 68, 70, -140, -33, -83, -27, -67, -4, -20, -31, -91, -21, -69]
2010f9J26j27J57o5j61J86P4q3r1J18o6J15p1l7j7p7N4R7j18O8j3O5L4R5j59jjj79J52k5Q0
1738F1j10P0R5j15k6j21R3P5M4k2n8j03J03J1K4n5J7p5p9J39P5q1jK13k41M3K8q9R6j04J57
1467F4m5J10j0r7j7m7N0o4K8l6K0rN3Q5lK1j36k3M5r0J1J03K9j33Q7J8O1m9O0k59P1Q2J41
1178A21n0l9m8%q3J68Qj45L1O9k2N6K1r2J13p1j12P8k7q4R3l6N2j6K3M8L1j31Q8k6N3%p1j7
881a7o4M7M8Q4J0j35Q6L7l0M6j26N6L2j02p0j8O6J41m2m2n1J04l1l3QL5j02m9J11j50K4J61
601C4p3pj1l5N6J15m7j66K3J63Oj9n3m4J7J12J3l4n5j5K1l9P2o6J06J2j02m3J48j3M5j26J14
312A09j53Jr9L3K9J64j70Q5Rq4J40j06j2N5M9jn9p6P6j08J13j03K02p2j45J24m9J02L6j14
50b4pq4J00O8j32K46j71N8r0Q8n9O3o1j33P1P0N2q9KJ35k22J13l3K6K0j29jM2Q9J7No7
$$ y = [-69, 57, -70, 87, 22, -139, 47, 121, 38, -53, 65, -1, 114, 43, 6, -11, -88, -34, 63, -55, 13, 0, 65, 99, 194, 35, 34, 33, -146, 6, -19, 61, -49, 21, 116, 1, -25, -146, -53, 22, 66, 44, -14, -117, -14, -3, 21, -34, -17, -92, -171, -32, 43, -38, -39, 174, -67, -24, 4, -85, 11, -93, 64, 19, 129, 119, 22, 5, -42, 8, -56, -28, -64, -44, -53, 0, 85, 82, 103, -33, -56, -11, -101, -90, 13, 42, -91, -4, 14, 75, 26, 86, -173, -102, -20, 121, 71, 32, -16, -16, -99, 69, 77, -68, -37, 32, 10, 66, 87, -5, 108, 37, -75, 3, -24, -108, -15, -51, 1, -15, 8, 56, 87, -44, 44, 18, 71, 71, 0, -17, -81, -34, 14, 98, 108, -27, 59, 96, 66, 112, -14, 42, 74, -28, -98, -116, -50, 91, 49, 7, -44, 60, 29, -4, 4, 39, -63, -112, -1, -151, -127, 34, -39, -46, -57, -92, -36, 79, 32, -134, -111, 52, 58, 39, -14, -58, -41, 71, 84, 50, -5, -20, 1, -38, 34, -32, 74, 86, -16, -59, 89, 76, 121, -5, 109, -44, -43, -142, -109, -80, 84, -86, -1, 8, -76, 64, -42, -54, 1, 50, 49, -10, -86, -10, -118, -5, -108, 94, 22, -123, 1, -48, 54, 90, -24, -31, -115, -15, 53, -79, 167, -4, 54, -36, 52, -7, 56, -5, -138, -67, 3, 55, -34, -32, 103, -119, -6, -39, -13, 7, -122, -123, -81, 8, 25, 30, -37]
-230c7
##PAGE=	F1=-11103.7
##FIRST=	23146.756194512010552,	4241.1435120000014649,	0
##DATA TABLE=	(F2++(Y..Y)), PROFILE
4241b03J38J15m9j04J06m8j2Q8r4R3K5q9O9N3p0j16J18L8p0j4R0j13M2r1P5M6k7J06j44N2
3979A0k9K0R0j98L4K8K03p9j05p5N4K3R3j14M2j24Q2N7m9Qj8J6N1l0n5j20M8J27m3MK2M4R5
3690A12k1l4j03R7j71k4J90O1p8q7J8P5j6n7%L1Pj21J53J5o5n4l0J24k5R4k16n3O1K23r6l0
3410b0j15J48N4j9q4k5J82M5j87P6m7R3L3j25Nj5L7j5j9l3J57o0o3N1j13L0O5j19J16j46J64
3139E1ok02K24J0j20n3Q6N5j0k9j12J38j43o2J51K8J48r3M7J9j67K38j24j23j7n8O1L2O5N8
2876I2r9L2Nl2J5j05QJ73m7P2j18j05J50M4P6j34p4J1J38k3J40k02j51J04o0J38J7M0o2j22
2614g9J9J01k9j9P0qo3k2N6j10K6Q3On6N8M1m4l4j9j7J29J08p8j33J5n2q9P5J31n9r3J70j5
2325F9j06J53j77k1P0lo2R4m7M0j05J33l8j6M4j0P4j46N8N9n2j16J09N9J6k00J02k8J2k5O0
$$ y = [-203, -65, 50, 1, -103, 3, -45, -57, 31, -63, 30, 55, -34, 35, 88, 18, -98, 20, 58, -12, -26, 64, -49, -7, -98, -23, 23, -4, 102, -42, 10, -19, 1, 91, -107, -73, -45, 158, 79, -26, -101, -47, -24, 69, -45, -3, -127, -45, 12, -37, -29, -47, -31, 20, -10, -65, -185, -137, -10, -53, -49, -27, 17, 112, 91, 57, -46, 51, -120, -144, 46, 107, 29, -58, -40, 35, 19, -38, -38, -7, 0, -121, 32, 47, -18, -72, -102, 22, -3, 91, -125, -178, -117, 106, 10, -20, -135, 13, 67, 48, -36, -61, 121, 166, -21, 55, 8, 101, 134, 9, 14, -1, 36, 21, 2, -31, 126, 66, 3, 54, -59, -29, 36, -83, 33, -113, 51, 45, -157, 67, 77, -43, -96, -10, 45, 35, 6, -106, 32, -111, -173, -22, 6, 154, 61, 108, 127, -40, 198, 74, -49, -66, -124, -63, -31, 34, 92, -7, 25, 30, -2, 13, -92, -84, 89, 42, 114, -4, -109, 41, 85, 161, 27, -47, -36, 102, 79, 219, 17, -134, -30, -90, 48, 65, 105, 43, -79, -60, 41, 12, -7, 63, 55, -8, -30, 26, -84, -58, 25, 31, -25, 33, 74, 30, -4, -23, -40, 89, 197, 119, -14, 1, -51, -140, -65, 66, 7, -86, 84, 69, -37, 116, -61, -82, -12, -15, -77, 17, -30, 10, -95, 38, 0, -16, 28, 18, 92, -54, 4, 63, 11, -105, 4, 63, 79, -121, -19, -47, -35, -60, 0]
2054@%j0n4P2n3J37r5Q2o6j47J83Q1j14j02J63p7J38p6km5o8P2P7j13M3J1Q1KL4q2ql0j92
1765a58J44J7L2m5K0J46j24j1J33L09j66k04o2q6o1J28JJ0Kj0p8r5J50%l5jJ83j94N5j2o4
1493g6O6n3J44j03J24Jj41K6k7O8j15M2L7j7%J6Q1K4pq8k0m4j5L5N8L3j76Q2O2M1k1L3k60
1205a90L9J22J25k3p0k4M4j10J41J0j47M2J64j25K5P4j25J36p4j11R4Qj47J16n5J2N1L4n0
951a4R7j44J32l6L3m5p1k0j4M5R2M1k1j58J40M9o8N0r7j9J13q3j30K9O2J45o3Mn5M1j7j9K
662Ak4n5nP5j53K9J13k3Nl0k7N5O5m0j03P8O8J9k6o8m6J3J73%j04kq0O6j3J37q4N7Lp6j09
356a11J57N5J6j22N8n3n3n6J0O9P8j16P3K2j56K39j43k1N4P4m3j7q4O5j01M2p8K52n5j56J02
85Al8M6J11j25kp1J01L0q8K24k24P1n3J5K2M8o8j61O0J00N8j34K9Q2j17J25p2J9Jj49L5N6
$$ y = [0, 0, -10, -64, 8, -45, 92, -3, 79, 13, -134, 49, 130, 16, -86, 77, 0, 138, 62, 60, 15, -53, 19, 96, -17, 26, 37, 118, 120, 154, 72, 64, 34, -158, -14, 3, 35, -10, 10, 156, 32, 21, 154, 463, 297, 93, 31, -55, -116, 12, 13, 23, 25, 15, -63, -158, -8, -8, -43, -44, 139, -55, 0, -12, -76, -10, -63, 81, -22, 102, 103, -38, -12, -39, 29, -86, -44, -7, -24, -24, -8, 73, 97, 90, 2, -18, -62, -77, -42, 16, 49, -127, -45, 17, 58, 37, 70, -190, -151, -29, 96, 73, 3, -21, 23, -87, 54, 64, -83, -41, 123, -2, 23, 97, -28, 108, 34, -77, 17, 25, -122, -6, -61, -49, 2, 36, -14, 83, -61, 71, 35, 68, 23, -48, -68, -82, -37, 55, 96, 75, -83, 57, 106, 38, 88, -9, -28, 85, 2, -128, -99, -37, 108, 45, 49, -6, 35, 18, -1, 1, -23, -78, -83, -8, -161, -132, -19, -42, -37, -67, -94, -39, 26, -14, -117, -39, 29, 48, 22, -46, -92, -79, 94, 94, -10, -12, -92, -26, -39, 98, 14, 71, 74, -2, -111, 46, 101, 117, -5, 53, 0, -53, -109, -99, -30, 48, -68, 5, 27, -129, 110, -33, -54, 0, 74, 31, 14, -70, -5, -106, -64, -142, 110, 55, -101, 1, -37, 9, 120, -5, -7, -78, 23, 53, -35, 189, -35, 36, -17, -2, 20, 68, 0, -161, -101, -1, 57, -77, -48, 34, -83, 42, -30, -11, -10, -159, -124, -68]
-195f8R5k7K1n4
$$ y = [-68, 27, 0, 21, -33]
-230c3
##PAGE=	F1=-11198.1
##FIRST=	23146.756194512010552,	4241.1435120000014649,	0
##DATA TABLE=	(F2++(Y..Y)), PROFILE
4241a63R6Q5l9j10J65p0LJ12j59J18l4p6J06M1k9j45J01M2l4n6J00p3J7j23J09N0o6K03j97
3987b6N8k9rJ03j69O3m6K36j03j07o1O9J2J33j81R0j53P0P9r9N5l1K0M7n8k7j29R0J19o5l4
3716h3M8J31j1ml8p4R3j17k2J22O5n7r9J7K4L4p5J2OP3j67J06N0m5m3m4J18qO0j64r7O1K30
3427A02l3o7j05J29MK8j08k1J93J04k24O8k0N5k2k9j12O1Pj2j8J1J13p8j6L7r2L9j1j06J03
3156b0j08J40Mj85K56l1r5m0Q8P7j00P1j07J07j41n3J12N5Q9j04L9M4j31K21r7j23j9j15J7
2902a49J36N4M4j17M6k4l9P4j28J9J44o0P8p4m8M8O2O4q2r8k6J40j0J37j69j83J10m8J30R
2640D0J12o0j29K0K7L6mM1l2p7j8P9p5j5J09J5o9M6J5p7j5K1qJ12J26j22j08kn3r8J04J27
2360F8p8r7J55M8j37J54j71j8K1%m7J16n7N4q9Q4j6j5O9o5J17r3j3N4Qj35J16L0J0j81R1j6
$$ y = [-163, -67, 18, -21, -131, 34, -36, -33, 79, -80, 38, 4, -72, 34, 75, 46, -99, 2, 44, 10, -46, 54, -19, -2, -125, -16, 34, -32, 171, -26, 32, 3, -6, 97, -72, -9, -55, 181, 78, -29, -90, -21, -9, 124, -57, 33, -120, -50, 29, -70, -15, -46, -26, 21, -37, -64, -193, -103, 16, -49, -83, -35, 96, 85, 81, 43, -31, 62, -55, -77, 45, 110, 53, -46, -29, -5, 29, -46, -34, -28, 45, -122, -16, 34, -11, -54, -98, 20, 12, 72, -92, -189, -128, 102, 69, 2, -103, 26, 30, 58, -50, -71, 122, 226, 2, 70, 50, 105, 83, 54, -58, 3, 10, -2, -20, -9, 104, 26, 10, 47, -45, -6, -17, -123, -20, -128, 12, 16, -169, 87, 56, -39, -79, 9, 86, -14, 57, -50, 57, -84, -137, -25, 30, 119, 15, 54, 98, -33, 188, 91, -32, -51, -166, -149, -13, 41, 85, -32, 14, -10, -49, 25, -103, -84, 60, 0, 78, 4, -44, 4, 66, 130, 48, -50, -76, 64, 54, 191, 22, -161, -51, -99, 31, 40, 152, 92, -37, -17, 10, 46, 42, 83, 51, -26, -44, 35, -40, -55, 54, 69, 0, 46, 61, -16, -31, -10, -18, 94, 220, 98, -10, -12, -65, -163, -59, 68, -10, -107, 48, 96, -41, 113, -58, -76, -55, -55, -102, 14, -43, 11, -78, 6, -10, -25, 44, -21, 96, 3, -10, 44, 52, -83, 33, 63, 73, -108, -17, -33]
2080c3lj4N1Qj5m1P6m5J36n4k1m0j09J57O4j04j06J63q0J49r3M2k4o4P9O1j23M0j0R1l6l9
1800F3L0l6m3j45R8M8j6jJJ62q6O2Q28Q73p92q35j51j10m5J64m0LM7k7q1q4J18l8kJ3J27j28
1520b3M3m8k4L3J1Q2j15J27k2j70R2k8P5j31O2Q3o2M4qM6M3l8m3Jq9jO9J9kj51QJ42j0K8K5
1213F8k33JJ40R7j1p9j4Q6j22J12J2j53L2K51j95QP8j20J36o3j02Q7K8j59J17o3l4J05M7j11
951e4J14j42J65l4L0q7n9k9L6L0J15km5j66K01L5q3L8n6j03J57l4j53N6M3J47p1Nl1oj5km
662do6j1M0M4j58M7L6L1Ol5rN1nl5J4J48j20M8k2o1o9J4K23Mj67M0j15Q1K3J76r8K8l4l3j40
356a28J41J07j9r7j7N5j09J8l1Q6nm7P0Lj88L00j51m2O3Q7o1%q2L3q8lm8K62l0j57Q1k2j0
67b9J49j13J0l4O9pl5J69k52Q1ol8Q5K1p4j68N7J14P1j90N8K5J2Q2j04N0k7j42O2O6R7p4M3
$$ y = [-33, -36, -50, 1, 9, -6, -47, 29, -16, 120, 66, 45, 5, -104, 53, 117, 13, -93, 70, -10, 139, 46, 88, 64, 0, 79, 140, 17, 57, 47, 138, 102, 63, 93, 57, 14, -131, -33, 15, -1, -2, -1, 161, 75, 137, 965, 1838, 1046, 211, 60, -50, -95, 69, 29, 32, 79, 52, -29, -113, 5, -33, -35, -22, 105, -23, 20, -28, -52, -19, -8, 74, -41, 86, 64, -106, -14, -42, 33, -98, -36, 47, -15, 29, 21, 67, 110, 72, 29, 30, -59, -60, 9, 28, 26, -125, -117, 25, 15, 43, 68, -165, -164, -24, 73, 62, -17, -31, 55, -67, 45, 57, -96, -64, 187, -8, 0, 78, -42, 94, 31, -71, 16, 44, -115, 2, -61, -95, 10, 57, -54, 60, -82, 83, 49, 79, -8, -67, -96, -60, -30, 85, 83, 38, -128, 73, 108, 25, 63, 7, -96, 61, 27, -126, -70, -27, 120, 49, 54, 23, 17, 2, 0, -4, -70, -81, -41, 3, -155, -108, -72, -41, -35, -70, -79, -28, -33, -68, -54, 94, -26, 22, 0, -61, -130, -116, 107, 111, -56, -16, -131, -50, -27, 149, 51, 79, 45, 12, -128, 13, 120, 101, 4, -13, 42, -67, -49, -80, 6, 1, -46, 24, 27, -161, 139, -12, -54, 9, 96, 35, 35, -47, -14, -102, -105, -153, 109, 79, -78, 3, -19, -29, 120, 7, 17, -17, 52, 45, 10, 179, -73, 8, 2, -36, 49, 70, -4, -172, -115, -1, 70, -120, -62, -37, -25, 57, -47, 3, -24, -166, -104, -38, 59, -15, 28]
-222B8n2
$$ y = [28, -24]
-230b4
##PAGE=	F1=-11292.4
##FIRST=	23146.756194512010552,	4241.1435120000014649,	0
##DATA TABLE=	(F2++(Y..Y)), PROFILE
4241a08K6P8l6q6J81r7L9J26k08J34p8p1Q7O2J1j50O6L4J6o9P5Qj9j36J22K2p6K47j94M6l4
3970A8m3J13j20P3r2K12r8j23j6P8lJ35j82J04j55K4J06j21R2l5J1K5n7kj06J12Q9o1r4P7
3707c9J81q3J1n2m4Q7o4KN8L7l5o1m2pP9r2L8k8J31j90M9R8m6k4m8J09nK7r9r9N6J72J5o8
3410B4q3R2l5Q0j42j7J86J79k31jM3K8j21R2k03J02Ol3MK7N6n6J3K9q2M6o9p6Q0m5P9K5j47
3121a50K35o2o2j6J02O5j82J64p7M3j26k5Q9J9N6j18K2P6q0J73o7j03oj50k7K21lL4j02N2
2859el2k3J25j51RQ7k5O6l3Ll3Q1L0m1q3o4J11kJ34j07k08Q6k0R1K2J40m3j17J0k8O5N1j6
2570H0m6q4J7J01l6p6J20M3p6L0rj60M7K8J8Q5J36j38q5j3l2j36J15J26o8j10R5J13j16J17
2307H6j33j5kl0k3J14k7L9o7L2K7j1N1j00J39n1m9N8M4j50J17K5j6j60Q1k5K3j2L0Pk3k1P2
$$ y = [-108, -82, -4, -40, -126, 55, -42, -3, 123, -85, 49, -29, -100, -13, 49, 60, -90, -24, 10, 26, -43, 32, 40, 21, -115, 7, 29, -47, 200, 6, 52, 18, -25, 88, -32, 41, -51, 161, 63, -60, -76, 2, -1, 134, -48, 56, -99, -75, 31, -90, 2, -33, -22, 3, -54, -56, -162, -50, 39, -22, -116, -39, 142, 59, 70, 18, -26, 61, -3, -1, 57, 94, 59, -2, -44, -51, 28, -64, -26, -54, 77, -113, -64, 34, -12, -36, -84, 25, 20, 47, -52, -151, -95, 77, 92, 24, -59, 33, -2, 78, -64, -81, 105, 284, 53, 52, 95, 123, 2, 94, -109, -7, -1, -34, -30, -3, 53, -3, 10, 39, -43, 3, -66, -142, -62, -107, -28, -3, -150, 85, 23, -39, -55, 47, 112, -70, 94, 17, 60, -66, -91, -2, 17, 73, -45, -23, 53, -27, 146, 79, -24, -30, -180, -207, 14, 11, 45, -57, -5, -37, -60, 65, -86, -77, 10, -15, 51, 18, 21, -12, 69, 99, 58, -25, -89, 22, 20, 154, 47, -161, -75, -95, -4, 18, 158, 115, -2, 8, -20, 45, 96, 80, 34, -50, -33, 68, 32, -44, 76, 119, 43, 73, 64, -96, -49, -21, -3, 82, 218, 80, -5, -18, -50, -186, -71, 55, -13, -123, -28, 85, -31, 86, -47, -62, -64, -94, -117, -3, -30, 9, -58, -26, 1, -10, 41, -59, 80, 29, -20, 38, 82, -68, 49, 74, 58, -102, -21, -46, -23, -35, -5, 2, -21, -42, 30]
2019C0l0J12lj11Qo3J09L0n2j01J18q6J40j00Q4K1o1P8N1j30L3l6R5p6r3J28p0k7p4L6N2n6
1738d4J4J8J29j5J98J818J669j668j718k72j23p0K05r5%O1k3q7m2O1l7J4K4P4p2K1p7K2J1
1485dN1Lq0J17p4j62J32m9Q7r8Q2P5j10J03J1k5M8n7mM1r3m9R6om0p8r9K36p4P0J5j78k7J26
1187a4O4j0n5k5R5j03R5Lj53K0K80k13J5L4p5J04l4q6P1L1j40R7m9o4J07O1j10O9j12J71k4
916E0M9j08l7m8P1J0J11m1m7j49K38%o2J2l2j58J66Pj30O3NJ40n5l3J0l1oNk0p1K2O8L0j67
618a38P5m3N5J0k1QK9n3l0J40K23l43P8qm7j00K4K39K2j94N7j18O8N0J84j10L7p7J6j54J16
347eJ31m0n3r9J43j48P8n7N7m2J3O1l4j60K87j23o3Q2P4o1Op3j8m5k7k0K29j2j46P2j2n1J56
58A00p5jK6J8l8QJ04k53Q3L4n3R7Qq1j38N4J07J02k42O4JJ00lr2R5o1j08O7P6Q2j11P2m8
$$ y = [30, 0, 112, 109, -2, 6, -57, 52, 82, 30, -71, 47, -39, 101, 1, 85, 106, 45, 123, 174, 44, 77, 41, 136, 60, -33, 95, 25, -2, -76, -40, 12, -44, -30, -12, 117, 102, 300, 2118, 3787, 2119, 401, 129, 6, -64, 141, 46, 46, 107, 84, -3, -45, 16, -21, -7, 17, 91, 19, 40, -37, -15, -4, 47, 50, -30, 87, 13, -149, -17, -66, 21, -77, 5, 80, -30, 73, 84, 59, 107, 50, 46, 87, -6, -55, 41, 35, -5, -83, -182, 54, -20, 50, 65, -113, -140, -14, 50, 40, -15, -40, 55, -48, 47, 50, -103, -83, 197, -16, -1, 33, -42, 62, 28, -58, 13, 44, -96, 1, -48, -112, -5, 56, -54, 15, -97, 74, 50, 99, -9, -46, -94, -23, -13, 98, 57, 10, -139, 99, 99, 37, 49, 17, -141, 25, 32, -98, -35, -30, 110, 55, 22, 32, 1, -5, 0, -20, -91, -69, -1, 29, -138, -63, -106, -51, -41, -62, -54, -25, -78, -108, 32, 255, -88, -10, -18, -65, -165, -141, 98, 120, -74, -17, -135, -67, -17, 167, 57, 94, 17, 33, -121, -5, 126, 86, 33, -66, 77, -71, 7, -50, 7, -35, -22, 39, 5, -155, 132, 9, -54, 28, 102, 41, 47, -26, -44, -89, -116, -136, 93, 81, -65, 7, -5, -56, 100, 25, 24, 50, 68, 30, 38, 142, -111, -28, 6, -47, 50, 58, -23, -161, -107, 0, 102, -140, -76, -75, 25, 22, -70, 25, -36, -144, -77, -1, 81, -30, 42, -6]
-230f
##PAGE=	F1=-11386.8
##FIRST=	23146.756194512010552,	4241.1435120000014649,	0
##DATA TABLE=	(F2++(Y..Y)), PROFILE
4241e8m5R9m9m6J59j12P5J20k40J54j04n7J9J08L1j15K0J2N7m9L0J02p2j22J11rn8K08j12
3987E7Ll9n5R3o1N4j00J56n5j58L7Q1qQ5r9P0j20n0J35j12R1k4r%k9J5p7J19N1l7j46J01J77
3699A46j12L0q0j2Q3k5K4J5Ql6J3j19j1R9j04N2m6J50j65oJ50o0k8k4R6j8kn2n9M8Q2L7n0
3410B4n2N3l6J03j67j7J79K31k19q3J02K7k15J90k44Q9K9o0M5OJ3j0nM6p0M9r8l7M1J8LO2
3130cj05J70o8l7J9J08L8k33K10l9j7r3OP8o0Q0j47oJ02m0J27m0o7Rj67k6K31o3K0n1M6k8
2850d6K0J40j55l2L4L8M6pJ2n0R1Jm4m2p7P9j4J26n3j96M4J7L8L8J19qr3j4l5L8J15o6n5p6
2552f7M6J31j8j31J20P0o3J5l8k39J32j4M2O5J47j39n5j9jj80J05J23m1j18J7J49n3O3p3j7
2290d1Pq3PR1K8pl9qO7J2Lj22J28k4l7O0N4j59J15M3n5j35O7n3Q7j9nNk8%N2j7O8N0j49N7
$$ y = [-58, -103, -4, -53, -99, 60, -52, 23, 143, -97, 57, -47, -104, -85, 23, 54, -61, -41, -29, 28, -21, 9, 111, 39, -83, 28, 19, -39, 169, 57, 60, 21, -34, 59, -2, 52, -48, 108, 53, -105, -68, 13, 5, 90, -9, 61, -59, -109, 26, -86, 5, -19, -28, -28, -57, -42, -119, 0, 51, 14, -132, -31, 146, 34, 64, -16, -28, 55, 30, 54, 69, 77, 41, 54, -65, -76, 23, -81, -29, -75, 75, -90, -96, 54, -6, -34, -58, 38, 20, 18, -34, -93, -45, 37, 74, 24, -28, 25, -11, 92, -75, -92, 87, 318, 99, 16, 118, 145, -70, 120, -124, -35, -6, -66, -21, -15, -2, -12, -17, 29, -41, 8, -90, -127, -86, -68, -65, -3, -108, 62, -6, -43, -24, 84, 122, -111, 99, 60, 43, -50, -44, 34, -26, 54, -93, -99, 3, -37, 90, 50, -17, -8, -175, -201, 30, -33, -13, -64, -18, -46, -26, 114, -41, -73, -39, -1, 45, 38, 50, 0, 91, 92, 48, 6, -71, 8, -6, 120, 67, -129, -85, -68, -30, 8, 127, 119, 26, 12, -23, 15, 130, 64, 9, -67, -21, 110, 92, -39, 81, 151, 88, 103, 65, -174, -42, -56, -14, 51, 198, 59, 4, -15, -16, -196, -91, 32, -9, -127, -110, 39, -14, 49, -24, -41, -34, -117, -110, -19, 9, 2, -37, -45, 22, 34, 37, -85, 43, 19, -18, 42, 96, -63, 52, 95, 40, -95, -28, -81, 6, -13, -18, -13, -41, -41, 11, -6, 62, 112, -37, 20]
1975B0k8M4NK0r2M8j05J21p6J07N0n0P0N3j19pj6Q3j06j16J85r1jk0j3L6p9ON3N8N1L49K631
1686C071K312k385k426l74j12j13K22j32pN2kr8J8Nj8K3J4L8l6Nr5O3NN3n9l2J03j20j15J09
1423c1p7J09l0R4J9j54J54O4j02L1n7M0P8q2j08R7j6n4kj77L07j31Q4oj07l2Q3L1j1j1m6P0
1143B7o3R7k4j37K3K25j87M0k1k1O3Ko4N3L2j20N8po9N5P0n7j7n8J46qP1j00j4n9P9j5J02
855A02p7k8j09K21k3j9j3l9j72J58J0p3N3m2J17j2p5M1l6J3kl5m8L5P6M0j89J13r8M2K2kJ5
566c4j2n1k2K27K63m96R0J3l5j36L9K17M1j75N7j02L3O7J69j13P3j07M7j56Q3J36m1Jj63J85
303I8j61R0l9j2l0M5M5o7q3K13q5p0J03M7o2J9o5o6J8m1JJ64mj12O2j2p0J54k9l8Q6l0n7L1
6D3N3k34N7P2l6O1Qp3r1N7Q9J31k57M4J9J09j02k4J20q2p3M8Q9N1j29R9l3
$$ y = [20, -8, 36, 41, 61, -31, 17, -88, 33, -43, 64, 114, 64, 134, 187, 68, 61, 45, 128, 22, -94, 91, 0, -1, -21, -34, 2, -77, -71, -18, 40, 91, 440, 3071, 5383, 2998, 572, 198, 86, -27, 195, 63, 56, 108, 106, 8, 26, 31, 13, 36, 50, 88, 52, 57, -38, 25, 30, 83, 24, -8, 95, -25, -140, -31, -108, 1, -29, 65, 84, -70, 84, 148, 46, 77, 20, 60, 138, 56, -52, 45, 29, -25, -27, -204, 103, -28, 56, 50, -57, -89, -6, 25, 14, 3, -43, 27, -36, 61, 37, -100, -77, 148, -39, 1, -20, -41, 22, 24, -40, 13, 45, -75, -17, -24, -93, -38, 32, -25, -42, -100, 46, 38, 109, 9, -5, -64, 15, 0, 102, 25, -3, -112, 109, 86, 67, 54, 15, -157, 1, 11, -62, -9, -51, 66, 54, -21, 20, -16, -3, -5, -40, -88, -53, 23, 63, -126, -13, -111, -69, -47, -49, -34, -46, -97, -119, 108, 371, -125, -35, -22, -57, -193, -154, 63, 104, -71, -14, -116, -83, -16, 153, 40, 113, 6, 53, -103, -20, 116, 75, 76, -87, 98, -63, 27, -12, -24, -54, -9, 36, -31, -114, 99, 14, -56, 47, 94, 32, 51, -14, -80, -62, -103, -102, 62, 58, -54, 8, -4, -74, 80, 51, 13, 99, 69, 12, 43, 96, -138, -81, -9, -45, 16, 24, -49, -140, -83, 6, 137, -120, -76, -57, 52, -50, -74, 46, -36, -109, -61, 28, 79, -50, 49, 16]
-230A6
##PAGE=	F1=-11481.1
##FIRST=	23146.756194512010552,	4241.1435120000014649,	0
##DATA TABLE=	(F2++(Y..Y)), PROFILE
4241b5q7J23o9j6J20j02J04Q1k49J84j10l6n6J41L3m0l5k0P7j8lJ70j29q7Q7k2l0J03L0n2
3979F7n1l3L4MNp9J12nk00P5P1J5lL6Jn7j24J52q5N1mk5j2J1J8o6J28J4j2j58J15J22j10N3
3681F0j09K1Q7j3K4kMo2P5j54LQ6j00L7l1J20r6n8J94p4o5K1Q2l4k5l6j3M4J6L7m1j0J4rR1
3375H4j62j8J81K19j87j35J28M9k66K40k47M9M7o0Q6m1mL2o4R2m4M2j11Lj2N2n1J09o7Q1m5
3104b0k8N6R0K0k35J94j9l2n4K7O6j31J43j83m2J17k9J01k1k8J2j58J9J59q9OOL8k3O5J10
2832A37j20r3MJ04K0Qk3pP5Kr1No3P2n0J17l0j42LM8j0M3P0L4m9n4kl0J53q3o2n1M8J53k3
2526A13j58J10P9k9mo1k69K11r0N6N8J46j35nk5J4j93Q6R6pj09m0J32K1K8j8l1L5j19L1N5
2255b2P2o1pk5P7N4m3j39Q8j1MN5N6j56J06O7r0r7L6q4J63l5l3Nl1J1K4j2K2Q7j26Q2j3j6
$$ y = [-25, -112, 11, -58, -74, 46, -56, 48, 129, -120, 64, -46, -82, -138, 3, 36, -4, -39, -59, 18, 0, -3, 167, 38, -49, 38, 16, -14, 89, 119, 67, 16, -17, 17, 21, 26, -53, 59, 54, -146, -71, 0, 15, 12, 48, 49, -8, -132, 20, -65, -14, -18, -43, -55, -44, -26, -92, 36, 50, 38, -120, -5, 117, 7, 60, -49, -28, 59, 46, 70, 68, 72, 10, 85, -69, -66, 20, -80, -43, -74, 46, -50, -108, 86, 12, -53, -32, 50, 16, -9, -45, -58, -14, 2, 39, -2, -12, 2, -7, 84, -78, -96, 85, 304, 117, -18, 110, 159, -107, 133, -114, -65, -18, -78, 8, -33, -37, -5, -69, 23, -21, 21, -90, -87, -99, -47, -98, 11, -56, 25, -20, -48, 8, 98, 118, -117, 77, 58, 26, -28, -1, 65, -66, 77, -106, -148, -31, -60, 41, 20, -8, 4, -154, -135, 24, -65, -59, -53, -15, -38, 27, 137, 17, -76, -72, 32, 52, 60, 37, 30, 105, 107, 16, 21, -42, 30, -20, 97, 67, -75, -72, -24, -34, 9, 79, 113, 64, 10, 8, -22, 131, 48, -14, -65, -17, 136, 113, -45, 65, 144, 115, 111, 50, -219, -8, -98, -42, 16, 162, 27, 22, -3, 11, -182, -96, 0, -7, -116, -156, -24, -3, 25, 7, -24, 11, -108, -77, -22, 50, -11, -18, -43, 34, 88, 45, -94, -6, -17, -13, 42, 98, -58, 48, 115, 25, -72, -36, -120, 43, 8, -25, -20, -51, -40, -16, -28, -6, 81, -45, 37, 24, 8]
1957HPP5q1j2j44J06j5R5M0j7M9P3q7q1N8M8j14j13J99r6J8ol2K2q5j0P0nP1M40K798K408
1677E687k535k532m01p7j32J97j32k7N2J5j07P1l3mM0l0K4rqr4R9J2J6q2qR0j19n0K8j04J36
1406a7M0Q9m9j82J78J13j37j0l6Q3Q7p6j17O7j6m1K7j80L31j70P0k8m2j8L6jpK9n9K9l0J22
1126H5p0j10N2J03j41P0m6lM6K7l9L5M4j03nN8n6j9P2Rj07RJ03OP7p6Nm3O7n3J11j12lo1J54
820H6nJ8k0p4j59J54k8lK7p8P5N1r3M5l1L4j2l9k4K6P7O2k16J50j19J6M0KJ3n3rj8K54K36
522C85n07Q9K5k9j73N2J72M7j22M8p4j6R3J35j05J10j18M9j45M6J34m0N8j89J73j41M3K5q9
268f4J1L4L9q4JJ33p6n1J09L3q2M5n6r0O6m4QQ7J1o0L0j6p1J57Jp5J21n4o2L8J5j94KJ12j4
-38d0PLm2o1P8P2J32k20K6N2M5j81Q0J06o8o9J5J09J3j29J11m
$$ y = [8, 15, 90, 9, -3, -147, -41, -56, 39, 79, 62, 111, 184, 97, 16, 74, 122, 8, -105, 94, -2, 16, 10, -22, 0, -85, -95, -25, -30, 41, 481, 3279, 5687, 3152, 620, 219, 142, 10, 207, 75, 48, 100, 115, 8, 79, 46, 42, 82, 52, 76, 67, 59, -35, 64, 76, 92, 10, 2, 92, -27, -77, -49, -153, -17, 23, 112, 63, -119, 59, 172, 35, 25, -11, 72, 159, 83, -34, 33, 17, -24, 3, -177, 154, -16, 54, 26, -16, -34, 2, 1, -6, 23, -36, -7, -37, 85, 15, -95, -43, 60, -81, -11, -57, -60, -14, 13, -26, 9, 53, -50, -55, 3, -53, -72, 0, 9, -98, -89, 14, 20, 97, 21, 26, -17, 50, -3, 108, -4, -7, -68, 86, 81, 99, 79, 5, -154, 0, -28, -31, -4, -82, -7, 44, -49, -4, -35, -1, -13, -52, -76, -50, 27, 89, -127, 23, -96, -80, -40, -38, -25, -78, -87, -105, 149, 385, -122, -33, -8, -37, -210, -158, 14, 61, -61, -13, -87, -103, -10, 125, 20, 130, 12, 61, -84, -38, 96, 56, 114, -75, 98, -43, 0, 25, -64, -53, -19, 20, -64, -63, 70, -6, -57, 52, 85, 3, 48, -8, -98, -32, -76, -68, 19, 30, -30, 0, -16, -87, 70, 71, -4, 117, 63, 1, 39, 54, -140, -138, -26, -40, -33, -30, -72, -133, -55, 17, 149, -71, -45, 7, 52, -129, -49, 57, -11, -80, -65, 44, 57, -72, 39, 35]
-230C5
##PAGE=	F1=-11575.5
##FIRST=	23146.756194512010552,	4241.1435120000014649,	0
##DATA TABLE=	(F2++(Y..Y)), PROFILE
4241a1p9J13p7j3Q6p1J28Rk22K13j02j5j05J38L6M3r5m5P1loJ95j66m5O1j9lj6J76q3q0Rm0
3952a8O3n8m6R9J9k24Q5M4O1r0J66o8Lj66J52o8KMj7kM0Lp2J49k7%j17J18M0j00P8j20M5R7
3655G5k9JJL1r3Q1j11RM5o5jJ0O1j6r9K10p4j22O3P1l4m2l1nM1J3L0n5L8k3RN8j25pJ86J36
3340B37j38j42J30P0k61K40k32PN5k4J16r8kN1j25J44j3K6j19L3o0M8o6J47l0pml1R0L7K2
3069A01j87J33k8Ok5K3N8j47J93k11o7J10l3Q3j2jMj17O8N1p0MK0M3k4Q5M8m6j49MJ52j6L0
2780H3q1N9K7L2j46L8l4R3q8R6l6o3k6O0l8M4J6N8K7j03L9j01J45o3o0j4K4J39k5j57Q6P0
2500A01J2l6n5k41K56j57O0N1J26j29O5l9Kj62P7L4K6q8m9O0Q0L9Po3O6j09M1J0P0q1J8j8
2220b6N8R0n3j51L0j1M7M0O5j35Q9Q1j02n0j9j02K16m3m7J9l7Lkj0pR5o6P5k2m5L1R0p0m2
$$ y = [-11, -90, 23, -54, -67, 19, -52, 76, 85, -137, 76, -26, -41, -146, -8, 28, 71, -24, -69, 2, -1, -7, 188, 22, -23, 38, 19, 16, 0, 176, 93, 13, 22, -18, 45, -13, -59, 40, 59, -165, -80, -36, 25, -65, 101, 33, 36, -130, 22, -46, -44, -40, -57, -59, -19, -16, -88, 61, 34, 34, -83, 35, 75, -25, 53, -67, -22, 75, 46, 47, 48, 79, -14, 67, -44, -35, 10, -55, -56, -46, 15, -1, -100, 110, 36, -86, -23, 48, 14, -28, -59, -64, -23, -10, 20, -35, 3, -20, -11, 47, -78, -85, 101, 237, 99, -43, 87, 157, -104, 136, -96, -89, -34, -58, 58, -40, -42, 9, -116, 28, 15, 41, -78, -45, -105, -57, -123, 24, -6, -13, -17, -48, 42, 79, 101, -86, 47, 19, 25, 0, 23, 81, -66, 127, -84, -151, -41, -74, 9, -3, -4, 0, -117, -49, 2, -68, -64, -44, -1, -25, 60, 108, 62, -87, -83, 69, 53, 83, 2, 61, 88, 120, -26, 12, -22, 71, -17, 79, 43, -20, -46, 14, -24, 20, 36, 94, 121, 18, 57, -44, 101, 38, -22, -36, -12, 127, 102, -55, 31, 101, 113, 77, 22, -219, 37, -120, -60, -9, 117, -12, 53, 14, 16, -146, -69, -35, -9, -97, -146, -86, -6, 33, 40, -23, 43, -66, -25, -15, 55, -26, -8, -26, 32, 122, 69, -82, -52, -63, -16, 24, 89, -46, 43, 124, 22, -28, -47, -149, 67, 24, -23, -4, -41, -38, -40, -50, -57, 38, -28, 47, 25, -20, 11, 101, 31, -11]
1922a1j89J08N9M6KL5J9J00m2j44J28Rj03r6J85q6K1k7k5K1p4l0N3k9N4M15K220J877k020
1668B476j968l32k7j07J31r8n5P4K0j15R3m1pO4q6K8K3l7o9J28K3l7o5k2P3o1Po6j24J55P9
1397E7O1q7j82J70J17j08n0nJ07N2p9n2K6j8j7mj15L08j89N1m1JmK2l4%M2m8qj8J56j22r2
1108a03J05l6r9R1k1l8O4L3j4PO5o9q3J21l5p8P0N4j64O5N3K0N7n4L0j5N3j03J32j37K2k2
828b9O1N5L0pj17j32J50p8O3j4q8K4J13q3K7k1M3om2j3mP9P9k31J71j00nO0k4K4q2M4l0K34
531A51J43l78Q3K1k5k06N2J28L7o4L6l8o0J33Q8r1J25j19L4j12NJ31m8R6j65J13q6m4J18j44
268h6M3nN7q7M4J00j09j2R2N0j17O4l6q1O6k8jL2L6j1k8j8n9J59jq5J35n1n5L3j9j28p0J54
-29b2j8l1j5Rp0J08P3Q7j38L4O4m0k21J73O3k2r9j7J30j2j17J00K2
$$ y = [-11, -200, -92, -33, 13, 15, 50, 69, 169, 127, -17, 111, 120, 17, -79, 106, 20, 41, 14, -11, 10, -64, -94, -41, -70, -16, 399, 2619, 4496, 2476, 508, 176, 149, 42, 173, 75, 20, 94, 114, -1, 92, 51, 44, 108, 22, 50, 73, 36, -33, 95, 118, 81, 16, -6, 67, 6, 13, -53, -177, -22, 57, 118, 31, -151, 19, 136, 28, -22, -27, 80, 132, 53, 1, 27, 9, -8, -12, -127, 181, -8, 43, 2, 3, -1, 21, -13, -13, 29, -19, -27, -45, 111, -11, -103, 2, -34, -133, -42, -63, -101, -37, -4, -18, -11, 54, -15, -98, 23, -12, -90, -20, 34, -130, -65, -12, 8, 65, 11, 41, 26, 79, -24, 108, -29, -7, -29, 32, 87, 117, 110, -7, -139, 11, -67, -4, -18, -106, -82, 31, -52, -25, -46, -3, -9, -51, -64, -68, 11, 90, -141, 30, -70, -75, -15, -39, -15, -97, -53, -83, 151, 294, -84, -1, 20, -5, -211, -159, -31, 6, -58, -22, -60, -120, 13, 101, 10, 135, 16, 50, -62, -57, 74, 26, 122, -43, 70, -16, -60, 58, -86, -43, -48, 9, -78, -34, 66, -43, -55, 37, 87, -30, 34, -2, -83, -17, -45, -46, -14, 22, 11, -17, -35, -94, 65, 64, -21, 114, 63, 8, 41, 22, -106, -176, -22, -40, -71, -86, -77, -147, -39, 34, 121, -17, 17, 81, 41, -180, -7, 56, 34, -65, -82, 48, 36, -81, 19, 41]
-230D1
##PAGE=	F1=-11669.8
##FIRST=	23146.756194512010552,	4241.1435120000014649,	0
##DATA TABLE=	(F2++(Y..Y)), PROFILE
4241a3k1N6o1l8O5l6J56q7j47K10q0Mj19R7O2R1j50n6N2rJ0J83j69j2M1pJ8j04K72o8j31O0
3961F9j04J06j11rR5J2k16P5jJ14j44K43j05L1j62J49q3j4k1J7J8M8k6p6J81q3J0m7J10m0
3699C6r1J04j11M8J08n7k9MP4j00K9j5lqql6N1RL8j20J90o5j61P1O3nm9j3m9L8N7L1q1Q1n6
3392b5mK9p7J5J79J9q2j07J31O2k21K05k04k1O0K4J29j41KN4j51J63jK2j22M4q1K3o6J64M
3121B6o6L0k4J10m2L9j12P0o4Q0j7pN9j06J90k15n6P7l0N3k4J3lm7Q1l8k2J9l1O6k6N9j0L8
2824G0j68K2J73n9O2j25J02l6O7j76O1j4J21r8N1m8Qm0N8l9L6j9M8J27j44M9j30J00l2l6K0
2552A1rP7Nj42M5O4M5r1rj85K59j75N5K6J03j22J33n6l4r6P6m3N4p8rl9J14R9j6j02Q4n1M1
2264C4m7K4m7K9lK8R7k4j46k1k4P3K0P3r7O9Q1q6jr5r8K23l0n0M8m5k5oj7%O2kM5m2l5N6O4
$$ y = [-13, -34, 22, -39, -77, -12, -48, 108, 21, -126, 84, 4, 8, -111, -14, 48, 139, -11, -67, -15, -24, -14, 169, 0, -12, 29, 22, 40, -64, 208, 140, 9, 69, -35, 71, -40, -49, 46, 58, -158, -83, -84, 30, -114, 129, 24, 55, -107, 42, -41, -55, -76, -59, -41, 7, -19, -95, 86, 3, 13, -34, 76, 36, -55, 49, -62, -14, 94, 37, 8, 12, 86, -14, 15, 0, -3, -11, -19, -55, -4, 5, 43, -77, 113, 48, -113, -42, 21, 16, -33, -46, -95, -57, 0, 31, -50, 31, -25, -29, 0, -77, -62, 117, 136, 54, -53, 78, 140, -81, 124, -80, -101, -41, -17, 112, -29, -27, 27, -124, 39, 38, 60, -62, -18, -99, -76, -142, 22, 26, -40, -10, -34, 76, 34, 73, -39, 31, -33, 47, 30, 23, 82, -24, 166, -49, -105, -28, -58, -5, -29, -16, -19, -66, 15, -23, -45, -26, -57, 9, -17, 42, 32, 70, -98, -76, 97, 38, 100, -25, 77, 41, 108, -68, -7, -21, 100, 2, 53, 5, 13, -27, 31, -8, 28, 9, 57, 184, 40, 89, -41, 59, 27, -9, 11, 2, 79, 84, -58, -13, 51, 96, 5, -4, -189, 70, -105, -50, -24, 79, -43, 90, 34, 0, -96, -20, -63, -9, -87, -96, -135, -21, 78, 62, -40, 44, -7, 34, -13, 11, -36, -7, -10, 18, 115, 91, -55, -76, -100, -27, -7, 66, -31, 38, 119, 33, 32, -63, -161, 62, 32, -18, 30, -15, -40, -46, -63, -63, -1, -3, 42, 0, -35, 21, 85]
1940H5n6l5k23J25J04k3k8Q6mJ13Oj58J31lq1q8J65o4J8o5rL3n9n2J2nK7K85J258J031j142
1668A384j086k04K5n9N3m8q1J07J9j26P6k3k4Q7j16M0N8q6k8J48K6q3k4n9M8K9L8j25j35J61
1406hO5K5p6j48J31O9l5p0K9R7k2p1N9jl8Pp5k8K58j85M9m3J9j0M6n4MK1pl1k2J69j61r0J66
1100C9j43o6R9K6j03J02J5J7l7Q5pj50J48lj13P9O1j74R9pM4J7m6P6j1M2j37J38j35M2kk4
820b9J22K3J7j58r5J47j07J03o4o7j6J45n5%oL5K4n5j3m9Q6Q0k21J58m8j6Q0p0O0j02Q2n9
540f8J96K4j87Q2Pk8k14L1R5K7k9K2Mp7J68L4q0J17j17J6n8l3J25n7Q4q7J9oj25K00j66M6
260c5m4R3p7K6J14j52K6N9Q4j50O2km2RK0k0J4N7J0r3j7l2J43l5n2J43k8m5J4n0m7j28J84
-29In8l4k6N6j07J18R3J3m9P3L7q8k17K16J9K4j41l6J44k0r7P4K5
$$ y = [85, 29, -6, -229, -104, 0, -23, -51, 35, 31, 144, 150, -8, 123, 120, 39, -49, 116, 52, 70, 5, -4, 29, -30, -82, -70, -75, -48, 237, 1495, 2526, 1384, 298, 94, 119, 60, 113, 65, -16, 91, 110, -16, 60, 37, 13, 100, -16, 24, 82, -4, -32, 116, 142, 59, 35, -24, 24, 53, 91, -34, -169, -8, 57, 82, 6, -142, -11, 58, 23, -47, -18, 79, 57, -14, 45, 44, 6, 13, -62, -90, 168, -17, 32, -11, 8, -2, 44, -10, -6, 15, 8, -23, -45, 124, -37, -127, 39, -104, -170, -71, -45, -148, -46, -31, -14, -51, 34, 27, -123, 25, 22, -91, -12, 49, -125, -26, -33, 11, 28, -18, 58, 47, 89, -48, 90, -45, -3, -5, -29, 93, 116, 133, -25, -120, 27, -80, 23, -41, -108, -124, 21, -34, -34, -40, -5, 19, -36, -49, -98, -12, 68, -153, 5, -43, -59, 21, -49, 11, -91, -9, -68, 128, 152, -35, 47, 54, 26, -188, -157, -62, -35, -64, -42, -38, -115, 53, 87, 7, 124, 7, 23, -35, -68, 57, 0, 84, -3, 16, 10, -115, 85, -81, -35, -79, 14, -63, -37, 77, -75, -49, 10, 94, -56, 6, 4, -38, -29, -9, -29, -15, 42, 52, -41, -58, -90, 53, 18, -34, 109, 81, 36, 50, 0, -47, -175, 9, -49, -83, -109, -53, -160, -42, 51, 64, 15, 88, 125, 37, -180, 36, 55, 79, -62, -98, 46, 26, -71, 3, 28]
-230B8
##PAGE=	F1=-11764.2
##FIRST=	23146.756194512010552,	4241.1435120000014649,	0
##DATA TABLE=	(F2++(Y..Y)), PROFILE
4241b1N8j8l5p2M6j0J82j76k9J51m9K2j08M2J15P0j78n7L4j5J9J51j46QK4OL6j36K84j0j82
3970FR7j28J13j32L1O6kj75N7m7J44j58K53r8J5j18J57j20J2p5M9L3M7n6o4K00j36L1J3Q6
3707A01r4p8J39j06K1J19p7l9pJ03p0m3P4k9n7M7m1O5j2M8j13J45n4j63M7N2L9m7L3j20L6
3436h1J01M3j00J02p3l9K1n3L9J56q1l2m6J38K0j78J52j50m0P3M6J28j52kO4j40J28k3M6j07
3174d0L6o9Oq5J54L2q1L4J0J17j24N6m9L8j12J56j8o1P2m6J39j88lJ2JPn4J5%L2N3q2K8M4
2876C0j13R6l4Ll7R2j42M8J63q9Q0j31J15q7P7j67P1oJ27o5k2m4N4m1M8j5J1l0J4K19j71L3
2596H7j04M4j7PL6k7j9P4j29oP7N7j57O4j33K10j21L5j9J05j14J70p7o3k8O8r8P6j03O3j22
2325a64J23J89p9j32Q5J9N0j14k9K1K2RNP1K2j23m8l9P9oO2m5N4P4n0K9j73p2J86J6n6P9n1
$$ y = [-21, 37, 19, -16, -88, -42, -52, 130, -46, -75, 76, 27, 49, -59, -17, 98, 168, -10, -67, -33, -48, -29, 122, -24, -16, 8, 14, 50, -86, 198, 188, 6, 103, -25, 88, -44, -13, 53, 51, -124, -67, -114, 30, -128, 125, 27, 42, -76, 81, -39, -27, -102, -53, -20, 27, -29, -93, 107, -29, 2, 15, 101, 7, -71, 68, -38, -17, 102, 25, -14, -21, 82, 12, -31, 43, 14, -43, 4, -37, 28, 16, 64, -49, 96, 42, -121, -74, -22, 17, -30, 3, -117, -81, 20, 63, -37, 65, -8, -47, -26, -79, -40, 116, 35, 3, -43, 95, 115, -63, 89, -61, -101, -28, 18, 146, -6, -8, 56, -84, 44, 21, 67, -40, -4, -73, -67, -152, 2, 34, -47, -13, -3, 114, -10, 46, -3, 35, -77, 79, 61, 0, 72, 26, 165, -23, -26, -14, -13, -6, -60, -45, -45, -13, 40, -42, -14, 30, -83, 13, -21, -18, -55, 37, -105, -57, 106, 17, 97, -34, 81, -6, 71, -96, -25, -31, 96, 31, 9, -35, 19, -22, 26, 11, 22, -8, 6, 225, 54, 87, -17, 27, 10, 17, 53, 26, 7, 81, -48, -54, 23, 80, -77, -13, -146, 64, -57, -22, -41, 64, -50, 120, 43, -20, -48, 20, -78, -2, -105, -42, -164, -41, 148, 69, -63, 22, 41, 91, -23, -52, -31, -9, 0, 5, 76, 98, -25, -73, -112, -33, -39, 23, -22, 32, 106, 56, 85, -88, -160, 26, 42, -14, 65, 14]
2036A4n9Qk7L6lM5J1n7KN9J9l7ok27J44R9r3k4J15rJ01M6j18M5L8o3r8J55m2L1j05jM7m6p8
1730g8k0L7J9J17M21L26l51l75p7O5k5rMr7J30J5j31L2Nm5R8j05O1Q0j35NJ58J3j01K4r2J9
1450a2R3M5j28j31J52MJ0l3r6P4MK7n9N7N8r9m2J55Lq2L8j41J6K10j54O7n3K5m0R6n8Jj8N3
1152D2m4k0J31j68r1K07j88l9R8N1j55J25j2O1j01J01O6j80J29M3j41J05M1j46J04p1P9k4
907Cn5J53o5K9j23J10r6N7pq2J59K1L3j84n3J43r8J06j16k7j9J32k6k9J3J8P3q5mr8Q3P6j92
618a50J16J8k6R6j07J06j24J01r5J58o1k8Q9j4l8j86mP5K9l0J8L5n3J60j2p2R4j04Kkm9J09
338E1n7J6K8q4P2j54K34j65K4o1J20m8l7J32j52M3L1J00j66L9L9J0p3Q7l4K5N4mj30k7J7J00
58C0q2J2J50Kl6j6p0K3j56J95j16j4kQ0j42Q7J16o0K2J05j1o9j76J99mL0j56m0J42j8p0M6
$$ y = [14, -45, -37, -64, -28, -31, 14, 25, -32, -30, 29, 48, 11, 5, -222, -78, 21, -72, -96, 19, 10, 111, 157, 39, 84, 122, 59, -39, 116, 74, 105, 0, -1, 46, 0, -78, -98, -61, -42, 75, 496, 822, 471, 96, 19, 84, 59, 50, 54, -43, 87, 102, -29, 3, 8, -37, 61, -44, 17, 97, -38, -33, 125, 138, 37, 61, -31, -12, 81, 126, -2, -133, 19, 23, 33, 0, -96, -22, -18, 9, -50, 7, 65, -34, -76, 79, 82, 0, 38, -103, -87, 123, -31, 36, -17, 8, -32, 64, 6, 7, -11, 42, -2, -22, 109, -59, -150, 57, -131, -170, -72, -21, -176, -51, -63, -2, -103, -2, 64, -116, 13, 56, -85, 20, 61, -85, 19, -52, 27, 3, -52, 101, 36, 65, -58, 52, -44, 13, 6, -76, 83, 104, 137, -47, -100, 43, -55, 51, -65, -92, -111, 21, -5, -34, -21, -3, 70, -15, -19, -117, -34, 42, -150, -34, -16, -42, 54, -53, 53, -71, 30, -65, 93, 32, 4, 93, 79, 41, -145, -149, -74, -45, -75, -57, -22, -75, 85, 73, 1, 95, -9, -7, -9, -58, 51, -6, 10, 38, -46, 26, -128, 106, -59, -35, -96, 24, -24, -61, 71, -81, -38, -7, 93, -73, -34, 5, 15, -58, 29, -5, 20, 74, 70, -60, -87, -70, 30, -52, -40, 110, 112, 76, 60, -10, 13, -143, 52, -64, -78, -80, 0, -142, -55, 61, 1, 23, 128, 117, 48, -128, 71, 67, 97, -59, -99, 43, 25, -45, 1]
-222Aj
-230@
##PAGE=	F1=-11858.5
##FIRST=	23146.756194512010552,	4241.1435120000014649,	0
##DATA TABLE=	(F2++(Y..Y)), PROFILE
4241b9J27p5j3r9K1JJ95k33J09M3k0L6q6KJ80oj74n4K6lJ3J07j15RJ6J7N3j22K18O2j97J05
3961A14j13Q9j22P4jKj13M1p4J33j48K21o2k5p2J81j46N2j28M4L5N4p0m2J86j61O7M7L9j20
3699a8n2J84j23k2J23q2j5l0J05j4j01J12m3r4P0pM5pK6q6R8m3j36J5L1P0l7R7j74L8J00O2
3419I2j00J00p4o5L4o5M7J33j37PK0J35l0j58R6o9n0Q6K3J11j23lR2j22N2o3R2p2K1m3J2j31
3139a52J26M5n5PO6J10j86O7j6L9j58K06qj22Q9rO7j31P0p4N5m0q3RJ8Q5J4r5O3O9j71J13
2859A8n2n6j9R3r3P3J25q1N7r7J18j12N2j30O5mJ07j3r6k5P0k4L9K0m3j7j0K53j77K1n1Pk7
2570iN3J6j6j07J49j16m4R5N1k07J32r5J12j7Lo3J36j06J60r3o0J6L7j06Q9j52J41j69J18
2316e2K70j55j35O4O6P4j72m4P4%J8mK6N7r4m2m6P1l3K4J2M3O2oK7k21l7J29Q2o4Q6m2q5K5
$$ y = [-29, 98, 23, 10, -89, -68, -67, 128, -105, 4, 47, 27, 63, -23, -21, 159, 153, -21, -75, -49, -52, -39, 68, -47, -38, -22, -5, 48, -74, 144, 206, 9, 114, 1, 90, -32, 42, 41, 43, -70, -29, -103, 30, -118, 103, 41, 16, -56, 125, -21, 31, -97, -53, -18, 36, -34, -76, 110, -51, 16, 63, 102, -18, -70, 114, -9, -31, 92, 10, -5, -35, 70, 56, -45, 67, 24, -70, 0, -7, 38, 31, 57, -29, 69, 26, -110, -95, -64, 6, -31, 66, -108, -70, 30, 92, -8, 92, 18, -47, -13, -78, -31, 102, -35, -28, -8, 127, 97, -61, 35, -34, -84, 2, 25, 136, 13, 10, 102, -20, 32, -31, 61, -11, 10, -33, -21, -152, -26, 19, -36, -29, 37, 147, -39, 28, 12, 51, -107, 99, 91, -31, 58, 49, 116, -15, 55, -19, 36, -4, -87, -78, -60, 25, 39, -56, 7, 76, -95, 18, -34, -90, -109, -16, -109, -36, 89, 8, 65, -32, 86, -26, 26, -104, -39, -43, 64, 51, -45, -70, 0, -24, 15, 35, -8, -25, -35, 218, 41, 62, 11, 18, -9, 44, 60, 44, -63, 86, -30, -74, 21, 72, -135, -3, -98, 14, -3, 0, -63, 73, -33, 127, 34, -26, -10, 27, -79, 10, -142, -1, -170, -52, 218, 63, -72, -8, 58, 132, -40, -84, -10, -10, 8, 4, 30, 87, -7, -49, -95, -24, -57, -33, -21, 22, 84, 78, 105, -116, -153, -24, 58, -6, 80, 38, -47, -22]
2019b2l7P9o9P6k0n4M3L0j9j7L0k00J48N9j42MJ11QO6P2n8q0J08m2j27J54k7P2j41oN7l8j07
1730h9j9O5K8j2pJ5P8q4mR4k5m3M8r3J33kj19qK4o6R8o8R6O8j51J3J46nr1O0r8nR8L8r2j07
1415h6J27p2L6J3n4J4m1M9l7P3J9j46OJ90L2j36P7j65j0J84j03Q8p8K1o9J43n3on6J13n2J
1135B2M0j39p1K08j73j6R3K9j71J18l0J09j70J12J15j57Q4R4j81J49J1j00Q5j28J14m8p7K41
890A63j57qn5O9l3O3k9j07J40M7L5j90j5J40p1O9j50J9J9P6Mo8L7JJ22j12J5j34O2Q1j63O7
610f3P3m0R8j03J28j52J06j17J24q4N2J02m0n9j17l7O3M5n4K9L3NR6m8n5P1p1j7L6k2P9n1
330A0p1J41j74J22j25K20j61mm9J10Mj09J16r1L7K1P9j68J9O9N9j39J51l3L8J7l4j19n0Q0
67c4L9j22Q6J43J9k4m3o9N1j48J77j58MO4Q0j52L1J16j06O5R8n2Lj12J41Lj7j37k4J21j8m5
$$ y = [-22, -59, 20, -49, 27, 7, -47, -4, 26, 7, -10, 20, -180, -32, 27, -115, -111, 0, 8, 74, 146, 88, 8, 116, 74, -53, 101, 74, 146, 5, -1, 56, 18, -89, -108, -43, -15, -27, -34, -19, 59, -25, -29, 65, 40, -3, 45, -48, 85, 83, -36, -44, -20, -86, 12, -56, 40, 108, -43, -30, 116, 111, 20, 80, -18, -23, 75, 113, 21, -86, 41, -31, 5, 18, -36, -22, -63, -14, -51, 22, 41, -105, -99, 91, 123, -13, 64, -101, -111, 73, -30, 58, -20, 1, -68, 75, 22, 16, -40, 73, 21, 22, 62, -77, -148, 60, -113, -129, -36, -7, -178, -60, -90, 19, -151, -39, 76, -81, 3, 97, -84, 65, 76, -24, 61, -67, 47, -1, -78, 163, 6, -2, -57, 12, -21, 42, 13, -94, 46, 93, 128, -62, -77, 63, -8, 61, -89, -70, -51, 25, 29, -39, -2, -1, 121, 9, 24, -110, -48, 33, -130, -63, 10, -30, 68, -35, 93, -59, 47, -70, 54, -30, 22, 124, 84, 25, -92, -129, -66, -21, -75, -46, -13, -8, 88, 40, -15, 56, -15, -32, 4, -18, 61, 10, -61, 80, -94, 28, -97, 123, -38, -42, -91, 19, 23, -86, 30, -61, -24, -3, 76, -92, -73, -4, 55, -84, 67, 34, 72, 89, 55, -64, -114, -34, 5, -117, -31, 112, 131, 107, 64, -5, 46, -102, 75, -83, -79, -15, 65, -87, -56, 60, -46, 19, 117, 65, 68, -44, 97, 100, 83, -54, -78, 43, 25, -20]
-213b0K7m4
$$ y = [-20, 7, -37]
-230c7
##PAGE=	F1=-11952.9
##FIRST=	23146.756194512010552,	4241.1435120000014649,	0
##DATA TABLE=	(F2++(Y..Y)), PROFILE
4241c0J58r5jj12qLJ88k51K28p3kL8o0nK18q1j49n1L3L0pN3q9rK0K4O5q0J07J20j50O9p2M9
3944G8r6J16r4L6m5K0p0R0j32J84l0m9o3J98j27P4j55lK8P9o2k7J37j35R7N5j9j35j0K27j53
3672A4o4J17p8L2m4Q7L5j29R7k9j12M5N3QOnn6P5l5j09JJ5N3k4J55j83M3N5P7q2Q2o2o2N5
3375C1r6L0J28j59M3O1J13n4j59M5J7m0Q0l2P3o4J5J25j25j9r7J30l2K3l4L1j77R3M8j2l4
3104d8J20Q9k12P5qM9j91K18J7j62R3pQn6J26j62J12p1q4lM3R3kj01Q1P4j58J03p7r8L2M0
2824f7m6R7O4k6j3m6J38j10lq1L9%P6K3j41lO4J5L5M3j18J6NK07j67L9qj0l9P5l1J5j53J93
2526H2q9n5R1L9k16J53n6rR3l0p9J62r6J15r8k5K8ro8R1j93K02j81J04K97k04j07J8P8J07
2264A45j92j2P4l2L4Jk0P6p3k1l4N2n7l1P1K2M8K8Lk12j2Q0J41o8O5k7q4J9l7J06j08R5m4
$$ y = [-30, 128, 33, 32, -80, -88, -85, 103, -148, 80, 7, 5, 43, -17, -22, 196, 115, -34, -85, -52, -22, -29, 24, -65, -74, -54, -30, 35, -45, 62, 182, 32, 101, 29, 78, -18, 98, 4, 40, -5, 15, -55, 35, -97, 87, 57, 8, -55, 143, 16, 90, -65, -68, -40, 39, -23, -50, 87, -48, 49, 104, 85, -50, -60, 167, 14, -50, 67, -11, 21, -23, 64, 99, -30, 67, 38, -74, -29, 24, 32, 38, 33, -23, 52, 17, -92, -91, -76, -23, -47, 108, -75, -32, 23, 100, 18, 100, 38, -24, 31, -65, -35, 93, -66, -23, 38, 151, 97, -62, -17, 0, -40, 40, 8, 81, 17, 32, 157, 32, 13, -84, 46, 14, 37, 3, 34, -143, -50, -2, -14, -48, 72, 161, -51, 24, 16, 65, -126, 92, 109, -53, 40, 33, 41, -15, 111, -51, 61, -10, -94, -97, -54, 39, 37, -64, 17, 91, -67, 36, -41, -139, -107, -67, -113, -16, 48, 22, 9, -37, 101, -9, -12, -93, -54, -54, 22, 45, -96, -99, -35, -20, 15, 58, -60, -44, -39, 168, 1, 40, 32, 22, -17, 58, 27, 42, -111, 82, -7, -62, 29, 68, -148, 5, -51, -60, 33, 3, -76, 86, -10, 105, 7, -18, 10, 1, -67, 24, -169, 33, -148, -44, 253, 49, -58, -40, 38, 145, -47, -59, 15, -17, 17, 18, -2, 74, 1, -20, -54, -2, -59, -90, -19, 3, 51, 79, 82, -130, -142, -62, 79, 11, 76, 49, -35, -16, -53, 53, -55, 40, -4]
1975dl3O6j2m1kO3j54J29K5j66K6R4K2K8Q4k4j65J55pj63J53k7J27j60k1O7l3j34J7O4L5o5
1695e6r6L4J64j16J1J17m9n9Q6o9J26m2q6k4K3p6R2m3J39L2j17pR9po4O7p6j3N4K8m8o5P3
1406C2j20J01L6m4l4m4L5k5P3J3j51N0J63N6j62J05j36r1J86n0Q9j05Ko9J74o3op6J52n1K8
1135F8o5q3l1J64j18KQ6k4j64R0k7J42k23J30J12r8M8J26k26J98j7n5M8j47J26n9j02L08k29
881b0p6M0N3K7M8n1j01P0J03K3j67JJ41o1Oj45N5P6JM0j24O3j5J55j06K4j38K2J01j42L3R2
601B8m5P6n1J08j84J00j12R3n9O6J13o9q4k6n2O3N7q0N4%O2Mp8l0O2j6n0N0M5M2n3j22K10
312A22k31J29o8J81j54k7k4O6O1j57O7MJ9L1K8j62K8P1Q1j56J85j5K7l9n0o7p6J36k4j32J42
41dJ12J0nm9n0K8j16J35j65NJ48O3j35j3Q5j18R2M7p2Q4m6P7L1r6r2NQ3k0l1J3p2
$$ y = [-4, -37, 29, 17, -24, -26, 37, -117, 12, 37, -129, -103, -9, 13, 41, 125, 101, -64, 91, 84, -79, 74, 47, 174, 14, -7, 60, 27, -107, -90, -26, 9, -56, -152, -118, 46, -70, -59, 58, 9, -50, 36, -33, 93, 51, -35, -59, -36, -112, -20, -63, 76, 108, -9, -16, 83, 76, 12, 79, 3, -10, 44, 72, 24, -41, 32, -88, 13, 49, 5, -29, -73, -38, -63, 10, 23, -128, -78, 85, 141, -21, 84, -52, -143, 43, -7, 82, -23, -21, -90, 84, 21, 15, -61, 91, 40, 68, 3, -80, -111, 53, -65, -63, 23, -1, -165, -75, -102, 40, -183, -53, 59, -39, 9, 135, -91, 107, 90, 35, 83, -64, 62, 3, -99, 209, -20, -96, -56, -3, 24, 72, 21, -80, -10, 93, 116, -51, -50, 91, 30, 36, -109, -54, 22, 23, 63, -61, 2, -13, 142, 36, 60, -78, -56, 45, -97, -64, 28, -17, 59, 8, 116, -68, 32, -80, 13, -46, 20, 133, 64, -20, -46, -98, -35, 22, -58, -4, -4, 58, 62, -16, -46, 16, 0, -50, 0, 45, 87, 34, -88, 122, -109, 20, -48, 133, -21, -48, -72, -6, 55, -102, -35, -31, -12, 19, 47, -115, -87, -16, 65, -91, 94, 79, 106, 67, 17, -50, -126, 10, -14, -146, -4, 108, 118, 113, 64, 14, 42, -74, 61, -104, -99, 49, 112, -23, -36, 49, -69, 23, 70, -2, 82, 36, 113, 144, 48, -44, -39, 44, 24, -7, 6, -66]
-230f6
##PAGE=	F1=-12047.2
##FIRST=	23146.756194512010552,	4241.1435120000014649,	0
##DATA TABLE=	(F2++(Y..Y)), PROFILE
4241b1J44r3Qj11k6PJ62k45K96j43lK5l6K1K04j02j26m6N3O4k3qp2l5K7L5O1l2pJ46m7rk4
3952D4J6p0J38j68Q5J0qn0L9j13J71k7m0r7J75n1N7j40o4K2J12m1k4P5p4J03N2o8j49L7K39
3681A91j69q7J01p7Q0l2O2N6j31N7J0j05k6J15j8J6k3m9Q3l2j03NL1j8j4J86j52M6MP2m0N5
3401I4m6l7P0j17%J32j58P9O0O9l5j58lQ0mM7q1J6qN5J50j52m3j08J27j2N6n8M1j84P1M2K4
3112Io3J44N5k05R2rM7k03J95M2j64P6j6k9K3J32k23J47p6n4j6O9N5J9j13R0N1p9P8j03j24
2841a53R0l8j4J12jN5j00qJ84j03o8k5pJ6N2K1j40NN4O8K8L7j79N0O0J07j44Q2jj9l0O5p8
2552b2M0j41J84l9m7N0L3j79J18j4j09J75m8n7J36q4P1q9J3K3m6j0P9j90K29j71P7K47j92
2299C7o4m2O9J20j56M3K6p5O1J9n3R0o4prJ9n8q3J22j9L0M4j8j40j7N9J58m9K4j6n3k3k1J05
$$ y = [-21, 123, 30, 38, -73, -99, -92, 70, -175, 121, -22, -25, 0, -36, -15, 189, 87, -39, -85, -32, 32, 9, 1, -71, -106, -79, -44, 17, -15, -22, 124, 77, 68, 44, 60, -10, 128, -40, 45, 55, 47, -3, 36, -77, 94, 67, 27, -70, 105, 54, 111, -29, -93, -71, 41, 0, -24, 51, -23, 80, 132, 64, -85, -48, 191, 22, -65, 36, -41, 39, 7, 69, 125, -6, 51, 61, -44, -70, 45, 27, 43, 20, -29, 54, 22, -81, -76, -45, -63, -77, 109, -43, 3, 7, 79, 39, 94, 48, 11, 81, -36, -36, 96, -62, 17, 77, 146, 111, -47, -50, 30, 26, 73, -8, 8, 0, 55, 205, 53, 10, -98, 29, 17, 73, 15, 56, -128, -57, -15, 9, -54, 90, 145, -60, 32, 23, 70, -133, 62, 104, -60, 16, 0, -29, -6, 126, -97, 50, -26, -80, -96, -27, 28, 47, -66, 24, 75, -4, 74, -29, -153, -63, -101, -115, -3, -4, 51, -49, -57, 127, 24, -44, -69, -76, -60, -8, 13, -127, -122, -68, 0, 28, 65, -114, -64, -4, 103, -41, 41, 40, 21, -9, 56, -22, 18, -123, 61, 22, -25, 25, 58, -121, -3, -17, -126, 49, 1, -56, 80, -4, 67, -22, -9, 14, -32, -42, 37, -153, 76, -95, -18, 229, 37, -27, -69, 0, 120, -36, 7, 33, -42, 19, 38, -15, 75, 11, 4, -5, 14, -44, -127, -5, -24, 6, 50, 32, -108, -125, -66, 92, 43, 67, 51, -2, -25, -46, 59]
2001E9j10J06o6kP0m1n4LQ6j04Q9K8j70K1Q7J3MQ3k6j74J37N0j93J41l4J64j47m1P7k2j58
1730a24P2M4K7n8o8J46R4k16nJ29o7n9J12l8J23r4m6j7Pp0R0n0J68jm8m3J7K7m8M5l6j1J1
1441A3J2j5k1qj11J74L2o0o4j7K3l5N3M8j29P3J06N6j39J00p6j81K06k3O6j10l0k9J87r2J
1170A0p7J62m8M3j24k2OQ8m9J1P8p0j59O4lJ34k31J49O8m5M2J27k54K32l8j5kj11J01o7j15
898a15L13k25j51J09Q1O4Pn6p2k9J75Rj17j6J48q8n6r6P0J21o6P0j78R3l8J69o1lr5k0J10
627E7j16J8O7k2L3K3O4k14Q3q3O2j8N3J10r3j01N6m1P5N2r5Q3m3R3p4j03j0O4M2p8L7J30O
338A17o8j03K15k54J04k9J54j35l9qJ0R4j67J4Q3NM9k6j43O7M5O0j15J75Ljq9m2jq1J60p6
58b2j07J57O8k1J8l1j7k6p8P6j36pK09L5j06j7L8j01J05j0q2J37MK5O2j69l5M3L1j7l0mo6
$$ y = [59, -51, 55, -11, -13, 57, 16, -38, -35, 51, -53, 36, 64, -106, -85, 2, 15, 19, 102, 76, -98, 39, 89, -104, 37, 3, 167, 20, -21, 56, 34, -124, -52, -8, 19, -39, -107, 39, 133, -83, -88, 41, -26, -85, 27, -11, 112, 18, -28, -45, -38, -108, -18, -68, 100, 99, 51, 8, 25, 52, 4, 49, 13, 2, 13, 25, 10, -11, -19, -130, 44, 76, 16, -48, -65, -42, -77, -24, 24, -105, -32, 74, 130, -9, 91, 15, -166, 40, 17, 83, -27, -57, -86, 101, 9, 10, -67, 95, 47, 90, -34, -56, -50, 38, -11, 0, 78, 8, -151, -87, -90, 44, -187, -38, 30, -15, 27, 154, -100, 132, 94, 79, 77, -34, 67, 0, -115, 198, -27, -178, -69, 12, 76, 83, 27, -45, -74, 101, 110, -7, -23, 125, 37, -19, -115, -45, 76, 10, 80, -98, -5, -43, 126, 65, 62, -33, -53, 57, -59, -41, 26, 4, 37, 60, 124, -90, -7, -90, -28, -46, 7, 117, 24, -77, -21, -62, 13, 65, -30, 53, 10, 103, 29, -74, -84, -20, 22, -56, -19, 111, 117, 49, -54, 161, -93, 11, -18, 136, 1, -38, -46, -36, 58, -109, -95, -12, -7, 42, 16, -127, -60, -15, 45, -70, 105, 108, 107, 18, -24, -25, -106, 54, -22, -129, 28, 96, 75, 93, 62, 45, 19, -59, 17, -119, -126, 83, 118, 12, -5, 33, -68, 37, 27, -55, 82, 86, 111, 173, 4, -31, 12, 43, 26, -4, -8, -74]
-230g4
##PAGE=	F1=-12141.6
##FIRST=	23146.756194512010552,	4241.1435120000014649,	0
##DATA TABLE=	(F2++(Y..Y)), PROFILE
4241cR6r2K3r8k9K0J30k31K97j43j3mj8O7J39n2j25l2P6P9j7p1o2n3K4N8K5J5q9J40O5r6J5
3952D1kn0J27j91J32L6m0m0Pq5J86n6j0j47J08N3J2r6j01K4J31j6k7L2k4R1M7q8j58P3J93
3681A62j50q7P7p1R2J4M0M8j11J8N2p5j11J46j4K4k1p3J08l1j15PQ4j04k0J88j11M6j4M3J7
3410E8K2k7j0O7j08k5J23j37J11K1J4Rj35l6R3N8mr9m3J2J07J54j83pj01Q1k2J06r7K8j42
3139a12O2L8M7p5J26J3j78J28j7L8j92J43M8j27M7j5m1Q6R0k40J49o2j3k6R5j2N8j20R7MK1
2867F0N9j12j44J21j03J0J12m6J20j58jK34r9j33M1n7M1L3nj05mN6J19JJ3j98O4J22J4j15
2605f0J20k2l8KL6q8L7q9J34L0n0j1M0j16M1K5j45K11m6pL9o6N3o8K9J4o1N1M8j36K17j44
2325b0L3J30j14k8q9O0R0p2Q3l6j26Q9M2o1J13o0j5J4k1k5j23J62p8J7L8j1l9n1O2J24mj4
$$ y = [-3, 93, 1, 24, -74, -103, -83, 47, -184, 113, -30, -43, -47, -65, 2, 141, 89, -36, -68, 8, 87, 70, -1, -63, -116, -92, -34, -9, 6, -83, 57, 122, 26, 41, 39, -11, 116, -75, 57, 93, 53, 13, 20, -65, 121, 65, 55, -92, 16, 69, 81, -15, -116, -92, 39, 23, -4, 28, 4, 95, 142, 54, -104, -31, 162, 12, -75, 2, -69, 23, 37, 77, 125, 14, 32, 84, 9, -102, 44, 30, 54, 33, -40, 68, 37, -78, -71, 13, -91, -111, 77, -34, 12, -2, 41, 58, 80, 53, 43, 110, 2, -23, 100, -37, 74, 95, 109, 118, -17, -53, 40, 98, 94, -5, -48, -36, 71, 225, 42, 35, -66, 15, -7, 99, 2, 30, -112, -50, -12, 35, -40, 86, 99, -79, 49, 32, 70, -122, 21, 69, -58, -11, -26, -67, 19, 109, -131, 18, -44, -57, -83, 12, 0, 58, -62, 35, 39, 60, 119, 7, -137, -16, -119, -109, 3, -43, 77, -81, -82, 152, 53, -80, -39, -96, -55, -22, -27, -132, -136, -80, 39, 40, 53, -145, -81, 41, 55, -60, 60, 38, 0, 2, 38, -50, -13, -102, 32, 62, 12, 1, 41, -75, -34, -9, -154, 57, 11, 4, 43, -23, 30, -38, -9, 5, -56, -5, 43, -93, 124, -20, 13, 143, 29, 1, -88, -28, 62, -10, 73, 37, -89, 0, 42, -19, 94, 34, 19, 33, 12, -13, -136, 26, -52, -35, 3, -8, -47, -98, -36, 88, 84, 70]
2045G0k3lq3OP7q6J14r0K6N2l4n8j0J01o5K8P5j64LJ01k2j1Q4m8j20N3J10k11J20l0J57j02
1765A7n3P4Jj72J21J9J7l9o3J93J7k31j7J22o2l9J16j7J27j28k3rqm1R1p7J58kK7q3q1R2o2
1476a5J3Lj0Oljkr0m6K16J5p7p4J0L8m9J0J03r7O7N5L0p9O2j8k38K23k7K7q1n7L1J81j16J
1170A1o4J38n3N3j10K0J2MJ6J6O3p5j70N5L1P6j81J49J9l0N7J07k41K30n0J2m5l0M0r0r0K43
890A23j42j96J27J21Q0m7m0l3j21K33Ro1n9J57j40q9j9O1J24r5P4k04J24o2J72mp0qn0Q2p2
618b5J2J6L1j9P0M1k40O2l6K1J4M6Q4j00j03J07qR3K4r9J06o4Q9j13j10j9O8Q0p5PJ89j0q5
330E4l7J79k52O1k0J50r8m7rl1Q5j48j2J11JO4n6j02J08NQm3J26Pj2j23k2N4o0J46j08n9J28
41D8L6o2K9QJ8p3m6Qq2j8K09Jo8LRp0J00l3q8J39K5rP5k02K7P8k6qk5l1k7
$$ y = [70, 47, 44, -39, -33, 44, -42, 72, -18, 8, 60, 26, -32, -42, 59, -6, 22, 97, -67, -64, 37, 15, 4, 88, 40, -80, -27, 83, -128, -8, -38, 119, 17, -36, 38, 39, -133, -12, 7, 24, -15, -78, 115, 132, -99, -116, 6, -56, -95, 21, 4, 131, 3, -20, -29, -37, -78, 13, -64, 94, 92, 119, 36, -45, 47, -15, -2, 1, -9, -3, -6, -7, -9, -99, -145, 71, 86, 9, -65, -55, -17, -66, -56, 47, -50, 17, 72, 102, 23, 85, 67, -171, 52, 25, 52, -29, -86, -55, 126, 10, 11, -53, 85, 32, 85, -25, -5, 7, 11, 27, 43, 106, 31, -139, -84, -53, 23, -158, -9, 10, -20, 37, 144, -97, 133, 83, 95, 50, 20, 60, -30, -120, 123, -19, -215, -88, 33, 113, 66, 26, -7, -128, 105, 114, 53, -6, 151, 11, -78, -97, -36, 88, -7, 67, -137, -13, -75, 97, 93, 23, 15, -35, 47, -25, -13, 3, 34, 15, 85, 126, -114, -52, -88, -67, -53, -7, 77, -23, -126, -19, -27, 66, 90, -9, 97, 33, 122, 9, -101, -120, -52, 28, -47, -40, 149, 139, 54, 17, 196, -56, 5, -15, 135, 37, -10, -19, -50, 35, -113, -125, -14, -13, 51, -5, -107, 1, 6, 14, -29, 97, 104, 92, -31, -53, 1, -59, 87, -21, -80, 48, 84, 22, 51, 59, 77, 4, -42, -34, -116, -134, 75, 76, 8, 11, 20, -50, 50, 17, -71, 68, 93, 84, 159, -43, -16, 62, 36, 28, 3, -28, -55]
-230e5
##PAGE=	F1=-12235.9
##FIRST=	23146.756194512010552,	4241.1435120000014649,	0
##DATA TABLE=	(F2++(Y..Y)), PROFILE
4241A6L9r9M0p7j9L6R9k08K41q7k2l6j0J14N1L0j40rR3O8Oj22n6l8rR7m0N4j21J09J40j46
3961fK7ql4R2j55J49L1n8n8J2n4K14j01J0j66K1J42l9m9r7L1J19J0k6K7k8R0L9p6j55R2R6
3681I2j09p0N8m9N7O7K6L2p4pO5k5j75J27J9L4Jj26J39l3j23oJ44j47n2J68q3M3PJP9j5qM
3384F1N2p6l7Q2q6J24k2n0M6q0m8N6J24n0p6q7j4J57J36j96N9q4Rn0J52j15jp6N1M0O4p7P7
3095F5k4j42J77m1M1j69Q0K9p1J6Ol0J14K4k17J28l4Ol7J28q4Q7j12J06m8R8N3r1j61J05j27
2824a25L2J03n7J28j52k5K55r3j85J04r1P9Lk5o7k3P5J54n3pj68M6J53k3q0J14m5o1L4J2m8
2552c6nk3P8R0q5n2N7n9l6L5j01K01k7M9r1n0O4m0K0Lo5J09Jn8J80j05k0j7Rj1r4N2J9K6R2
2246A10p5j76R4O1l3J41n2m5K8o1M1j54J86j30RK5J5M4r4P2O0N8m2m4M9j25K7L7o5J31j23
$$ y = [16, 55, -44, -4, -81, -100, -64, 35, -173, 68, -19, -41, -77, -87, 27, 78, 108, -32, -41, 52, 120, 126, 4, -52, -90, -99, -2, -42, 12, -109, 0, 140, -6, 21, 13, -21, 71, -84, 65, 96, 38, -20, -8, -62, 152, 51, 61, -105, -84, 58, 19, -30, -127, -96, 23, 33, 7, 34, 6, 96, 135, 59, -96, -4, 92, -17, -87, -29, -78, -21, 46, 72, 104, 30, 23, 88, 63, -112, 15, 34, 68, 69, -57, 82, 49, -74, -80, 64, -83, -135, 33, -50, -7, 0, 1, 80, 65, 57, 61, 113, 37, 0, 82, -4, 120, 98, 48, 94, 14, -34, 22, 146, 96, 20, -67, -81, 76, 212, 16, 75, -9, 0, -50, 102, -13, -14, -90, -39, 1, 65, -12, 65, 41, -101, 76, 35, 76, -93, -13, 16, -55, -39, -33, -63, 51, 75, -142, -14, -48, -42, -79, 49, -35, 52, -60, 46, -2, 96, 149, 58, -103, 2, -125, -93, 10, -47, 81, -71, -96, 159, 66, -119, -15, -106, -27, -24, -49, -116, -139, -64, 90, 37, 30, -138, -92, 61, 38, -42, 72, 27, -34, 0, 12, -36, -41, -64, 14, 104, 19, -33, 24, -35, -71, -36, -137, 64, 37, 86, -5, -55, 9, -31, -11, -8, -73, 36, 37, -21, 159, 54, 34, 17, 26, 15, -79, -27, -8, 18, 110, 35, -141, -47, 14, -19, 122, 70, 25, 53, -8, 33, -121, 65, -65, -56, -31, -16, 28, -66, 6, 66, 124, 82, 38, 87, -38, -11, 26, -39, 92, -31]
1975c1M7J2J1n1l3J03m5m1J33j46mJ20n0l1R3o9m6n9J54k18R3PJ05m7m5M5L1j71J47lK1m6
1695a4o4J63k4j83nR0l5NR1j2J24j24l0j5j3J1Q9q9R6K9Q3j18j65J64j03pL4k9M9j0ok2j28
1406a68L2K12Oq1o4J7P5m1n7J47o4M5K7kj7J1J0k48K20m6j0l3n1P5J49j04j6m1Q2p8Q5m5K2
1117D9j1o0O7J6M2m2j86O0O2j0r0J12mn1O5R7j83J77n6K6o0N8l1j29k2J22l3j87J05J21R1
846A15q0k2jj69K49L4l1j00J59j77q5N4K4Q8p3M6j88J55p8J69K1j42R5o4J0j0Ll0R0n9O2N3
566A18k50N5J5l4L3L9M7q8q8J21L2J00j3r3J18n1O4j19q6o2O9Q4l0l3J91Jp8J5J39k26J1j8
286a7J44n0n2k2m1M4j25mQ7MP8n7l6J20l5m3K1O3j4J7j36nP9k9J20j28oO8L4r9J4N7N1r2k9
-20a9n2j4k4J45l1j6J0J2l8P1mq3R5J7l4O0j85R5R2p7JOo2K0
$$ y = [-31, 16, 28, 39, -12, -45, 58, 13, -28, 105, -41, -45, 75, 25, -6, 87, 18, -28, -87, 67, -151, -58, -51, 54, 7, -38, 7, 38, -133, 14, 11, 32, -14, -78, 85, 61, -122, -127, -37, -72, -67, 24, 12, 136, 12, -18, -33, -46, -35, 54, -35, 61, 90, 173, 55, -110, 54, -49, -56, -22, -51, -2, -12, -18, -40, -168, -136, 76, 82, 1, -63, -46, 29, -12, -69, 78, 14, 59, 86, 84, 67, 78, 88, -160, 60, 14, 4, -29, -80, -5, 144, 40, 24, -17, 65, -13, 72, 27, 49, 38, -22, 45, 61, 103, 61, -125, -65, -3, -13, -103, 9, 5, -46, 19, 116, -67, 110, 54, 80, 20, 78, 47, -82, -104, 18, -15, -202, -97, 24, 115, 35, 13, 12, -157, 92, 126, 95, -5, 154, -23, -108, -54, -30, 58, -15, 31, -157, -2, -80, 89, 110, -32, 63, -1, 9, -1, 2, -28, 62, 3, 65, 118, -132, -77, -62, -96, -63, -24, 23, -65, -153, -32, 0, 100, 87, -6, 112, 61, 125, 6, -80, -142, -73, 11, -19, -52, 139, 140, 62, 77, 216, -10, 1, -17, 127, 77, 25, 3, -38, 6, -119, -123, -36, -32, 46, -11, -47, 73, 38, -5, 16, 79, 65, 82, -54, -59, 20, -9, 111, -17, -23, 45, 79, -20, -6, 51, 102, 10, -19, -71, -85, -109, 36, 5, -11, -1, 11, -27, 44, 40, -43, 52, 69, 35, 95, -90, 5, 97, 20, 21, 27, -35, -15]
-230a5
##PAGE=	F1=-12330.3
##FIRST=	23146.756194512010552,	4241.1435120000014649,	0
##DATA TABLE=	(F2++(Y..Y)), PROFILE
4241C0rj10N4n0kL7P5j63J58j8k7n7j8J46k0R2j52J8R6L8L8j45o0J1o5J39j12P6j03O5J58
3970A20j31Npj9N0p7J15Pm5j01N1l2K31j38Qj41m2J86q0j1p4L8P0L8nL9q9J26K5l9j46R6n
3681B3q3m8N4oj2J00J3K9k2k3M1K6j85N7P0L9L3j89J67l8j04k8J60j10j02J35p5M1M5l8J27
3410I7m3LNL8m2m4K8j0J04l3j16M3Ll9pJ64p3k6j07o6J89J04j81J08o0n7o5J67q6k5k9K0M6
3121A0Q4q1K5n0r8K18q6O7j46K7jj4j7L3JR3k1j75R6Nj5m6J62j38Q9r4J20q4J36N0m7j65M5
2832a7j03M7R2l8P2q1o1K27p0k15J44r4J21m5j9n1l9J03J64j15mj11qJ38Pm2N2m4p2L7QK2
2552Eo0L3L8J15j42n5P7k6p3%qJ56kR5j88m5Q6j0Nj9p9J60n4RJ45n7o9j46J34j1m9L5o7J06
2255C9Q4q5k09P0N9L0J56m2q2L3q3J13j72J80j48PK2L1P5j12P8j2J19o6n7P8j14K1Lo4J58
$$ y = [30, 21, -89, -35, -85, -87, -50, 25, -138, 20, 2, -25, -82, -100, 46, 26, 118, -34, -16, 80, 118, 156, 11, -49, -38, -103, 36, -76, 0, -103, -38, 120, -11, -6, -13, -32, 18, -59, 56, 63, 18, -83, -32, -64, 167, 29, 37, -104, -146, 40, -40, -51, -125, -87, -17, 21, 16, 55, -34, 92, 117, 78, -68, 28, 23, -60, -108, -54, -60, -72, 28, 41, 70, 48, 25, 66, 92, -93, -36, 34, 73, 106, -83, 84, 46, -58, -86, 74, -36, -138, -3, -78, -37, 8, -30, 97, 54, 57, 62, 100, 58, 14, 42, 32, 136, 103, -13, 30, 33, -6, -13, 151, 78, 52, -55, -121, 68, 172, -9, 99, 39, -18, -83, 84, -2, -27, -56, -36, 10, 94, 13, 38, -12, -110, 108, 22, 89, -57, -30, -31, -45, -62, -29, -28, 65, 44, -131, -35, -30, -45, -91, 71, -67, 22, -72, 48, -36, 100, 150, 103, -62, -17, -120, -73, 19, -19, 53, -28, -89, 138, 68, -147, -3, -97, 24, -21, -40, -91, -130, -27, 137, 22, 18, -93, -101, 37, 44, 2, 54, 10, -62, -25, -17, 5, -55, -22, 16, 131, -11, -66, 11, -15, -88, -88, -96, 60, 58, 153, -35, -80, 6, -4, 1, -18, -97, 63, 9, 18, 163, 106, 37, -109, 25, 14, -35, 0, -67, 39, 123, 38, -171, -101, -42, -12, 144, 102, 20, 53, -30, 83, -89, 91, -57, -50, -28, 3, 78, -34, 44, 32, 151, 85, 28, 106, -8, 13, 16, -48, 110]
1983A10j56M9l5P3l0n0Q8m2j00J67j14RJ26m3o4J07q2J0j40J67k14O7P4L0j0j9LM9j50J44
1721B4k5M1q5j2J27m9j53J7M1NO1M5k2J03r1n4l3pO9P7n9JO6J14j46k05K07j42kN0o3J11K
1432A3l1p6r1P2J71J4p1l6lJ07mj36J64k0J7K2k8J4j5Pk26J92m7m1OMP2R6n4n0j1Nj20J54
1135G0K2j8l6q7J02J0J7jj82O2Q1r0J0M0J1p9M1J21j03Q0o2K6k9J04p8j69P4mL7j32Q4M9J10
846H1o9k0Qj55K19P6n2j08J47j74m9R2l1L6j6Rj38J73p3J59pj80J74o5p3M2nn2J26o9%P8k24
557a40O5O7j01N0J6K5p4o0J08N8Q5l9p3J16j4L4j18l4j16O8O6L3p0J34L6l9LJ24j78l7RJ02
277A06j0n1l0k7Jj15J8M3PR9m1L5R0o9n6M7J2n2P4j21oO8pJ16j47L2J7N0j25k9J05Q8r9k7
-20dq1N4l7N6n2M8j9M1j2K5N0n5K8nn3J7j20J53P6j08kO3q1M8
$$ y = [110, -46, 3, -32, 41, 11, -39, 49, 7, -93, 74, -40, -31, 95, 52, -12, 95, 13, 23, -117, 50, -164, -97, -23, 7, -3, -22, -19, 30, -120, 24, -1, 40, -45, -57, 70, 21, -132, -115, -74, -69, -8, 37, 15, 118, 27, -27, -60, -67, 2, 79, 20, 21, 87, 201, 55, -150, 57, -85, -87, -37, -100, 11, 13, -18, -94, -185, -113, 58, 72, 1, -35, -38, 69, 65, -71, 93, 73, 90, 112, 84, 98, 83, 90, -136, 56, 9, -32, -26, -22, 50, 146, 92, 42, 31, 36, -84, 70, 92, 74, 38, -49, 53, 63, 80, 79, -103, -41, 40, -50, -40, 0, 11, -68, -27, 94, -9, 71, 9, 35, 6, 110, 32, -137, -63, -67, -30, -162, -78, -29, 81, 12, -8, 0, -155, 64, 140, 88, -20, 127, -47, -96, -4, -35, 1, -15, -6, -144, 29, -44, 115, 108, -72, 102, 37, -36, 6, 1, -51, 75, 6, 6, 84, -140, -75, -8, -109, -59, -43, -18, -92, -152, -44, 14, 99, 60, -13, 103, 89, 123, 5, -29, -145, -77, -11, 22, -48, 86, 122, 83, 86, 210, 32, -5, 4, 106, 96, 45, 15, -12, -11, -126, -108, -65, -58, 41, 0, 35, 125, 56, 0, 47, 59, 7, 81, -40, -46, 22, 15, 131, -16, 16, 33, 83, -42, -71, 34, 122, 23, -4, -85, -31, -68, -12, -64, -16, -35, 6, -6, 19, 69, 14, 42, 37, -16, 1, -119, 34, 110, 2, 0, 63, -18, 30]
-230C0
##PAGE=	F1=-12424.7
##FIRST=	23146.756194512010552,	4241.1435120000014649,	0
##DATA TABLE=	(F2++(Y..Y)), PROFILE
4241B9k9j13N5k0K4kO3q8P5L2l2o8l1J48n4J14j43L9Q5MN7j32o8P3j22J65j62P5m4J7J36o6
3961A7m6knK5KK9j0jj40J00l2K24j49j0r3n1J75j05K2o0L8jO7L0L9j60J91%Nj42R6o1r8k5
3664a31O3M6q1J00kM1K9l0j3N8j32m3J24L7O0k38J88m9o3l2J06j1j43R6q4N5O0o7J50m5%n
3384D4M0j7n7oP0M1kj65mR5j1p2J62p5L0j03j11J92O9j51J13j8j04m9J50j5l7j5l1M5J01q3
3104B6j1o4m4K22j33J06j34Ql0L0n4N5L7L4k6j34O7M6n6n8J83j51O7q7J33q0J46K9rj40m0
2832f2m0L9R3j9j3L1r2J56k2k14J37o7J62j04Ko6l3J20J56j56K0n5q2R5O9mn2ln8QJ1Q6j00
2544e7O5K3R2j81l4Q5qn9o2Q0Q8K7J20k08n7R7K4jn4j14J92j01N0J30j8r8k18K16rJ5Kj19
2264i2J40P9p8k13L0K5J13J46l1j14L3p3J52j65J40j25MM1J4N1q2P5o9J56r1m5P5n3j3j3q5
$$ y = [29, 0, -113, -58, -78, -54, -56, 7, -81, -6, 26, -6, -74, -105, 43, -11, 103, -40, -1, 84, 88, 145, 13, -55, 18, -104, 61, -101, -26, -70, -53, 83, 17, -29, -31, -36, -11, -9, 20, 10, 9, -131, -31, -63, 161, 12, 2, -91, -142, 33, -72, -50, -110, -72, -73, -6, 24, 63, -97, 94, 94, 99, -43, 53, -8, -106, -131, -68, -22, -103, -3, -5, 36, 65, 35, 22, 80, -52, -95, 29, 66, 126, -112, 76, 27, -36, -68, 38, 27, -116, -20, -104, -49, 11, -56, 94, 49, 49, 44, 84, 67, 10, 4, 74, 115, 113, -52, -56, 39, 28, -44, 118, 43, 73, -30, -141, 51, 120, -31, 82, 64, -40, -89, 61, 46, 9, -6, -37, 8, 109, 26, 15, -49, -93, 129, -4, 102, -32, -24, -54, -24, -78, -23, 14, 48, 22, -112, -45, 1, -55, -113, 70, -81, -14, -101, 32, -48, 98, 127, 118, -22, -62, -102, -63, 30, 11, -2, 29, -63, 93, 71, -143, -6, -73, 89, -15, -13, -79, -112, 8, 164, 8, 28, -27, -109, -14, 55, 51, -1, -4, -62, -54, -43, 43, -57, 8, 31, 123, -58, -92, -7, -15, -74, -136, -56, 32, 59, 179, -29, -86, 11, 35, 34, -20, -134, 58, -43, 7, 137, 119, 21, -197, 19, 10, 25, 27, -92, 48, 127, 49, -164, -134, -109, 4, 150, 119, 5, 38, -35, 117, -48, 92, -33, -29, 12, 26, 77, -5, 70, 1, 157, 66, 21, 96, 43, 30, 17, -68]
1992f8J86j73K8p0J24Jm6N4m7j25J54o8K9J11pq8R7q8M6j68J61j95M2J38l3oJ5k3L6j12J19
1721B4m8O3j30Q5J26p2j66L1j0M7J08jl5N8o0o7m5JJ14N6J0r2P8J20j62j91K06j50J3O3j01
1450a27J57L3p8j29ON8J11L3o2Ql4J03M2k04J64L3j0L1m5J3o%j99J48j7p1K8Q4K1M4Mq6K4
1161G7p7j57K33N8p8l8p4J20ppK4j47M3R0j34P9m2N8q3j4J69l6k4p4J5M0R0q5j82J56q9L3
881f3n8R0p4J30j9l3j8q4J65J06j11o9J18j30%P9q7nM8qp6J71n7J40o9j64J98n3j35O8qm8
601e6J24m1q3P4j53Q2J12j63P0k6L6p5k7Q3N6N6m6l2R4K3Rj19J7j47P6M3P4q9M6P5J7o7J23
312A66j04q0P0PJ3l7k7%j9j22L7NPJ26j8Q9L0j00k0K7lr4J15p1k3L2mJ53j78N0OO0j41p9J35
6HJ32j24l2o2R8o1j4n1J05o8O5J1j2Q5ql1j9o8l8l2J85L6j15j3J19q4N5
$$ y = [-68, 118, -55, -27, -97, 27, 28, -18, 36, -11, -136, 18, -50, -21, 90, 83, -5, 92, 4, 50, -118, 43, -152, -110, 28, -5, -11, 4, -19, 17, -95, 24, -24, 39, -91, -6, 120, 48, -118, -87, -97, -50, 58, 57, 22, 80, 20, -47, -92, -91, 23, 79, 89, -3, 75, 195, 33, -158, 48, -102, -89, -26, -127, 30, 63, -15, -144, -138, -80, 31, 64, 2, 10, -24, 79, 121, -83, 81, 114, 104, 135, 90, 103, 97, 97, -102, 46, 29, -42, -14, 70, 91, 135, 139, 53, 77, 0, -157, 76, 134, 56, 18, -56, 64, 57, 50, 74, -73, -30, 60, -74, 5, -37, 21, -62, -76, 93, 57, 33, -41, -26, 14, 104, 19, -163, -7, -96, -63, -121, -31, -105, 25, 6, -27, -45, -129, 36, 142, 31, -38, 80, -50, -50, 29, -58, -63, -15, -23, -99, 72, 15, 155, 86, -78, 120, 67, -68, 0, -8, -56, 68, 27, -56, 18, -135, -53, 59, -104, -34, -60, -24, -99, -126, -43, 13, 69, 23, -9, 85, 108, 117, -2, 15, -132, -56, -13, 61, -28, 18, 93, 110, 43, 166, 62, -18, 52, 59, 72, 35, 8, 8, -11, -133, -96, -91, -84, 42, 24, 113, 143, 43, 23, 50, 47, -47, 68, -3, -26, 6, 2, 155, -23, 27, 33, 93, -48, -127, 8, 140, 16, -16, -78, 20, -41, -55, -106, -1, -69, -4, 7, -5, 80, 72, 41, 22, -46, -84, -116, 69, 105, -10, -23, 96, 12, 67]
-230F7
##PAGE=	F1=-12519
##FIRST=	23146.756194512010552,	4241.1435120000014649,	0
##DATA TABLE=	(F2++(Y..Y)), PROFILE
4241A5k1j10M7OO5q5O6LRN1m1p9l4J23n6J15j15M5O8k8N8r0o8J19j61J58j68N5L6k3R9J1j12
3952d2J0JK9N0q0jM9j47J29n1J90j20l3n9j3J24j09O1o9K1n9P9P1Rj82K48l3M2j55R3m9j49
3672a45KP1Q8j13O8j5N8O2k5p7N9l8j32J63L1P0k61K01o6k6mLJ01j51O1j05Q8L6q2J45j2j7
3392C8k7N5Jp6RJ11m8M7j61q4J79K2j11J17o8P1q2j27J57M4j16P7L7j22j6J17O9l9k4p9L2
3121CR4p4k4p0K0J75j62J44j32L3n6N3r5P7N7l8Kr6M4P4r0o4J75j18L4j00J38l9J48j4oq3
2841A0j18K9J8R7k0p8J44j08O3M0j76Q0k4J91j56J0r6NJ06J45j55M3j0j53N0J23K2j57O5k2
2579c2k9MJ10j06P4K4L5j59k7O3K1j5j12J21QO2J17j56q1R1O2%r1j50J86j25O4J39jr6k23
2307b22K25ON5l6j11J25Q1o0j90Ll5J82J13j5j31K5l1J35j24P8q1qP8l0Jj6P9j05J45j09l
$$ y = [15, -6, -116, -69, -63, 2, -83, -17, -14, -5, 46, 5, -74, -108, 15, -41, 74, -41, 4, 72, 44, 102, 12, -56, 63, -98, 60, -108, -53, -17, -40, 59, 70, -42, -32, -31, -2, 48, -32, -33, 16, -131, -2, -53, 137, 17, -16, -75, -88, 36, -73, -12, -81, -60, -119, -40, 31, 40, -142, 106, 73, 115, -40, 53, 4, -145, -143, -72, 16, -97, -29, -44, 14, 76, 51, -26, 33, -5, -137, 26, 57, 127, -134, 67, 1, -25, -29, -26, 75, -76, -15, -120, -32, 4, -78, 67, 55, 38, 11, 66, 67, -9, 0, 111, 63, 110, -51, -135, 44, 66, -45, 72, 4, 75, -7, -134, 23, 67, -49, 28, 65, -57, -73, 44, 113, 74, 50, -29, 3, 97, 23, -1, -71, -51, 124, -38, 106, -26, 7, -49, 4, -91, -14, 43, 5, 7, -89, -45, 29, -61, -125, 50, -68, -34, -134, 4, -35, 113, 99, 93, 10, -108, -79, -61, 36, 16, -62, 82, -26, 37, 77, -99, -19, -43, 148, -8, 2, -94, -89, 17, 162, 7, 50, 40, -113, -63, 60, 82, -75, -10, -32, -61, -57, 53, -53, 21, 45, 80, -79, -106, -43, -22, -37, -149, -28, -20, 42, 159, 3, -78, 13, 75, 75, -16, -166, 20, -105, -41, 98, 97, 1, -222, 3, 9, 64, 28, -83, 42, 123, 63, -127, -124, -159, 23, 136, 121, -10, 15, -16, 119, -5, 73, -8, -16, 62, 32, 33, 17, 96, -9, 136, 27, 24]
2036B4M7K0n5j6j15K01j58j4p0J40L0j8On1j02J01j7L6Q9K4q3M8q7P0j57J58j57J5J61p1r
1765a0L6rj4o4Q4p0P2j54J67J43p9j83J9m5Q2J32k7m4kn3n0m1PJ29L3Q6j52N6J06j57j39J72
1485C1j23J8P9j20J56O9j23j50J09J7M6N2o2N6n5O2N6k21J53P7l5M8o0PJ6J1j81J04L4j03
1222c2M6J48o2K6K8j00M4j26j73K72O7j26j0m7J27l7k2L2r6KR2j33J05j04J16n8p2K04rr0
960A2r2jJ19L4o8j47J84j11l4J6J20j88J28L8m3p0J1J20R3j67lQ8p7M6K4j27k1R1Mj3J46m9
680F3J13j30j01J59k1j55O3rl1R5K2j56L6o1Q1J44j98Q9p2P7r2lO7J6L3l2J5M9M8kj17M6j44
391a08R3K2P0p7k9R7N9j45J07j8r8J27j14J9j0j5L7j7j36M1qKJ47JJ16l3j25L5j5K0j27J06
111B4Km8Jj0K08k13M5N1M6j49j09J37J71j71l7j1J00p9l3l0J18j04O6M4k6P6L2n6rp4q5M2
$$ y = [24, 71, 91, 36, 20, -95, 106, -52, -66, -136, 4, 34, 16, 22, -29, -131, -30, -47, -11, 78, 102, 19, 67, -20, 50, -107, 51, -106, -91, 70, -1, -10, 26, 17, 3, -61, 23, -47, 25, -129, 38, 181, 102, -81, -62, -107, -25, 107, 80, 36, 34, -19, -69, -110, -103, 26, 59, 145, -7, 49, 155, -2, -141, 31, -92, -74, 5, -115, 41, 110, -13, -163, -54, -37, 9, 61, -1, 55, 0, 62, 118, -103, 50, 127, 92, 140, 80, 87, 103, 114, -67, 37, 71, -32, 14, 162, 100, 126, 154, 54, 98, -28, -201, 71, 138, 12, 2, -45, 82, 45, 23, 55, -41, -39, 53, -80, 25, -79, 37, -21, -93, 111, 102, 12, -80, -81, 38, 72, 4, -143, 41, -70, -104, -88, 32, -156, -28, 10, -33, -103, -92, 28, 121, -46, -49, 39, -38, 8, 32, -95, -116, -25, -21, -34, 112, 63, 176, 46, -55, 104, 83, -72, -9, -18, -49, 46, 68, -88, -52, -113, -32, 112, -86, 3, -69, 8, -84, -87, -20, -4, 29, -3, 12, 61, 109, 107, -10, 36, -108, -15, 7, 77, 0, -29, 68, 127, -18, 89, 71, -27, 100, -14, 5, -5, -20, 17, 0, -136, -95, -103, -101, 46, 47, 163, 130, 5, 40, 25, 45, -82, 24, 26, -22, -21, -31, 177, -36, 9, 60, 106, -43, -152, -15, 156, -15, -52, -63, 37, -42, -75, -105, 13, -91, -25, 19, -7, 69, 101, 45, 36, -38, -123, -81]
-169h1J84j7r5k3J43q0N4
$$ y = [-81, 103, 86, -9, -32, 111, 31, 85]
-230H5
##PAGE=	F1=-12613.4
##FIRST=	23146.756194512010552,	4241.1435120000014649,	0
##DATA TABLE=	(F2++(Y..Y)), PROFILE
4241fOj05L3K6J21j91P6Q8m1N2n0j07j5Q5m0J25p9L1M6n5M4k8n3J26j70J17j31L5J07n0O5
3970F2N7j64K4jN6N8j74L7P8j12J13p4J46o0n7n4M0O1r4J11r6rp3N6J06l8j33K58o8O1j73
3699e6Q3Nk00L2O4J11r5K0j4O1O8nj30L1N1j73J80K9N2k51J88p6j6M5r2J71j14M1j39J34j5
3427a0p9J13M7l8o1P4J6q9N7R7j37Q8q8j67K30L9r7M2n5P7m5j18Q6M1q9L3Q4j07PQ0J25l6
3147A20k1j00J1M6m3k6p1Q5Q3j55J70j27R2q7M9j31J05M8q6L6n7L0P1j05n3J39n3J0j25J20
2885b5J7J50o2m8lj64P1QQ5l4q6K11j10k2R5j09pJ8J94j88mj23P6N1J45j23N0L1k02K2J45
2614E9K5k20J34Ql6k1R1q9O4L3k6p1n8J4P7J6j13J10p1J00Q3p0j05P6R2Jj13j56J42j24N3
2342i5J54jo7j78J67L3M0n8n3Q5P1l3j44Lj02K02Q2J2j33NJ9Q3o6K8n4k5J11o1m1M3J07j21
$$ y = [-6, 0, -105, -72, -46, 75, -116, -40, 48, 7, 59, 9, -98, -113, -28, -68, 57, -22, 9, 55, 0, 44, 16, -37, 89, -81, 36, -95, -60, 47, -3, 62, 119, -45, -21, -22, 34, 92, -82, -45, 33, -79, 34, -40, 106, 46, -11, -65, -25, 36, -58, 53, -43, -52, -125, -69, 37, -1, -134, 124, 56, 117, -56, 27, 32, -168, -136, -72, 39, -56, -36, -50, 11, 79, 74, -56, -25, 26, -147, 33, 62, 114, -137, 51, -25, -41, 4, -88, 83, -31, 10, -129, 5, -10, -89, 24, 71, 33, -28, 46, 62, -27, 30, 127, -10, 78, -10, -177, 53, 92, -5, 37, -18, 59, 14, -104, -18, 23, -66, -33, 51, -56, -49, 31, 156, 120, 99, -1, 10, 56, 13, -13, -84, 1, 84, -71, 99, -28, 64, -23, 26, -105, 0, 48, -38, -2, -59, -29, 42, -63, -116, 23, -30, -20, -145, -25, -8, 142, 80, 32, 29, -135, -64, -56, 29, -5, -91, 120, 10, -12, 83, -26, -33, -15, 179, -9, -13, -136, -60, -9, 136, 13, 63, 94, -108, -86, 59, 84, -136, -2, 6, -30, -51, 40, -49, 15, 48, 22, -49, -107, -93, -16, 0, -113, -3, -74, 26, 109, 39, -66, 10, 102, 103, -10, -166, -24, -148, -95, 59, 58, -9, -187, -20, 13, 53, -5, -58, 27, 98, 65, -79, -76, -178, 24, 106, 118, -15, -10, 9, 92, 26, 54, 0, -25, 86, 25, -16, 27, 134, 13]
2062A3P9j06M9J1O0o7k6j36J96j13n5m5J30L8K2m2m5n1L8L1K1P6K1l6m1p8R6j38J61j00j7
1791e4J28p7LL4L7q2j3N1q7O6j44J88J45o6j62j4o5J12J27k4m6o2o5j2k6J3J11J5J34j66J4
1520A3P6j27p4J27p6jR5j07J09R2j37j35J60Jj5N7o4R7n7JK8j66J30P8m8O5o9J3K3L9j70P0
1240B8Q1j35Q2J60j48O0Rq3K2j15j59K39P0j35K3l3J34p5k4M2n3m8Q1q9R4j31J61k2j02K00
977A34k7r4j02k2J74k1n9o7J50p9j25P8J49k35Q8O9l9j18Q6J06K9j84N6P8m8Q2m9j41j4R9
715d6K6N1J13o8P7j53k2Q5K6j40M2qk7N9J01j94j1J8N1J51j92R6j05J25j04rP4m8L2j5N3j2
435B6O4J0j02M3j21J09ML0l3p1R8O8j83N7O5q8J38k12K0K0jP8nj42K9%jJ39J1J28p3j34O3
146C4m0O0j44M7O9p3Jj5K48k32K2J28J4j54r6J05J86k11l8M5M8n9qoP4j05M4R1k0L5L9m2J8
$$ y = [13, 92, -14, 35, 46, 106, 39, 13, -123, 73, -40, -95, -140, -10, 28, 50, 8, -37, -88, -50, -19, 2, 78, 99, 63, 22, -56, 40, -98, 63, -37, -54, 74, -3, 0, 34, 71, -11, -24, 27, -60, 6, -138, 50, 195, 129, -33, -47, -112, 0, 127, 103, 57, -5, -70, -82, -108, -95, 16, 31, 165, -1, 13, 89, -38, -112, 15, -61, -62, 33, -74, 35, 127, -10, -145, 15, 16, 1, 58, -6, 91, 34, 35, 63, -103, 27, 105, 57, 122, 53, 66, 89, 128, -42, 28, 109, -26, 56, 216, 68, 128, 137, 54, 76, -39, -198, 41, 111, -24, -1, -34, 100, 25, 1, 43, -10, -58, 23, -66, 28, -103, 58, 36, -66, 134, 107, 13, -89, -111, 63, 42, -17, -84, 66, -13, -138, -60, 89, -146, -58, 11, -28, -146, -60, 46, 75, -109, -53, 25, -23, 59, 10, -131, -145, -46, -20, 31, 144, 76, 153, 0, -22, 63, 89, -51, -9, -17, -44, 15, 116, -78, -89, -71, -20, 131, -61, 35, -70, 55, -49, -58, 16, -32, 0, -15, 38, 26, 90, 100, -2, 41, -80, 29, 33, 63, 30, -41, 57, 125, -58, -1, 64, -24, 114, -98, -78, -58, -59, 19, 14, -128, -99, -99, -100, 39, 50, 178, 105, -29, 34, -6, 54, -90, -43, 26, -47, -46, -61, 187, -45, -23, 105, 119, -35, -131, -26, 160, -51, -89, -44, 4, -55, -63, -69, 5, -100, -56, 35, 15, 50, 89, 47, 65]
-143F5o7j01O9J62p2n3k0J20p9N9
$$ y = [65, -2, -103, -34, 128, 56, 3, -17, 103, 24, 83]
-230H3
##PAGE=	F1=-12707.7
##FIRST=	23146.756194512010552,	4241.1435120000014649,	0
##DATA TABLE=	(F2++(Y..Y)), PROFILE
4241b8M2j02J4M1J66k67Q2J51q8N0n1j50K0M9rJ48n0ORp0L8L0l1J00j56N6p1L8J36o4L8O2
3961A39j84L4lQ7L7k17Q4O9m7N9r1J05J0p9o4P6J0p0J64j23m3m0jJ34p4m7K18r5N9j77O0N0
3681D0k15O3M0J08l1l5J4M3M9K3j57j4J02j58J75L7Ok21J45n8l5R0j35J78m7L9j78J75p1n1
3419g9O0J10n1j06R2K0p4J05L5j98J06K7k25K32L5l3l3l7M7Kj04NO0p8RJ09o9LM5J32k6Rq6
3130D4nl9Qk7p6J40k3j20J85j03J53j27K2j55J35J9r2N6j4K0M0j07k8R3J5Mj33P1N4J45q7
2859F8j11P8j67O6L6L6l8l7K11j03p9J25l6q8M4J65k02k7j23J59l8J61q8M4O8k12KJ42%k11
2596a55J67J4On4M7p0M2M0n9M2j21l1J48Kn8P0j35J26K7J1j16O4J03nj15j14Q3j07J9J52m
2325A9k0j11O5O1j8n3J6M9L9lq4J9j46J61P3M9j24k8N5L8k3J6n9m0J21m8n9M9J63j08l0p9
$$ y = [-28, 14, -88, -74, -33, 133, -134, -52, 99, 11, 61, 10, -140, -120, -71, -80, 68, 18, 24, 33, -37, 1, 31, 0, 100, -56, 0, -71, -33, 103, 39, 77, 139, -45, -11, -14, 73, 110, -107, -23, 46, -1, 58, -33, 72, 82, 3, -61, 15, 25, -45, 119, -4, -47, -87, -88, 46, -28, -75, 143, 48, 107, -70, -10, 40, -175, -112, -72, 36, 5, -30, -16, 27, 76, 99, -58, -72, 30, -128, 47, 84, 90, -131, 14, -44, -79, 11, -124, 54, 7, 46, -132, 43, -28, -79, -19, 91, 40, -66, 26, 46, -28, 77, 112, -86, 20, 47, -178, 54, 89, 56, 23, -14, 33, 35, -69, -64, -4, -82, -73, 36, -33, -30, 15, 147, 121, 130, 44, 39, 0, 8, -19, -95, 45, 22, -98, 87, -16, 137, 10, 32, -123, 12, 31, -61, -5, -19, 1, 41, -66, -94, -1, 14, 18, -115, -44, 10, 155, 68, -43, 35, -132, -66, -30, 6, -32, -69, 142, 39, -40, 85, 49, -39, 5, 170, -32, -59, -182, -23, -61, 100, 12, 56, 124, -88, -86, 56, 56, -155, 12, 26, 32, -22, 25, -45, -3, 37, -22, 20, -101, -132, 16, 18, -40, 30, -105, 21, 48, 59, -57, 7, 110, 105, -10, -124, -41, -148, -129, 23, 19, -1, -112, -47, 14, -4, -57, -41, 8, 47, 44, -40, -21, -167, -6, 67, 116, -8, -36, 19, 57, 34, 50, -9, -49, 72, 24, -35, 14, 177, 69, 39, -40]
2045d0Q3j7N4k9n8j39J81o3o9k0J08J9N5o5m1jLN5LP0nL3j36n8J24j38J58m3m5O2o0M0J2P1
1747A04j31L8K6r9N9j15J55J28m5j07n7o8J33J03ll9j12o9K0j1K1P1MJ36j48j4L4p5j8R2m2
1476b9k9R7o0L8Q6r9j15J49L5o6M4n8J21m7o5Mo2Q1L0l8P3o4K9jO4j51M7R4j45J28J26k05
1196A2J21k2m5n3l7j35J57P6j11M0m3J49j11k0P1l5q0N4k5O5j24J69J0r1J53o2o0q1n2J91
933H1n0p8K9P7k1j93J23J52j94K0O3l5j26J17J16o3j54P7Q9m3R9r6j43PP6L4J14R0j13L6j29
662c8M6J1P6j11L0j0n5K8J69j86l6N9MJ33j58Q3j13J49q1o1J10j02M9j3N2n5P7M4p5K0r1J02
382E7j7nJ4p1Q4M4j68j7J34o1R3k52J7M8J8J08nj29QJ8MR2QJ39p9j18N1l4Q7j44k6J00q7M0
85d9j8K41k11j0J93k1j57m0N5J60k00m0P5l5NK7Mjp8J4J45k1lJ7mL5m9p6M9J32j21krP3q6
$$ y = [-40, 43, 26, 80, 51, -7, -146, 35, -28, -97, -117, -9, 10, 65, 0, -41, -42, -39, 16, 19, 89, 84, 117, -19, -77, 47, -91, 67, 24, -21, 41, -19, 21, 33, 104, -27, 11, 37, -62, -3, -118, 37, 165, 120, 13, -44, -112, 21, 124, 121, 82, -30, -99, -79, -90, -69, 2, 6, 142, -6, -20, 14, -61, -79, 13, -29, -58, 39, -21, 17, 103, 4, -111, 38, 73, 7, 51, -7, 114, 67, 2, 6, -56, 25, 55, 17, 90, 26, 55, 54, 118, -33, 14, 108, -37, 91, 217, 12, 133, 111, 66, 13, -24, -159, -2, 74, -37, 3, -40, 109, -2, -22, 49, 14, -66, -12, -37, 28, -96, 73, 83, -8, 145, 83, 23, -58, -110, 81, 31, -47, -18, 59, 38, -155, -32, 120, -74, -54, 9, -26, -152, -35, 81, 18, -136, -59, 30, -13, 86, -10, -153, -146, -70, -36, 78, 168, 55, 91, -38, 8, 19, 95, -16, 14, 4, -51, -23, 146, -40, -76, -17, -13, 120, -38, 45, -68, 81, 0, -61, 49, -53, -4, -17, 35, -20, 57, 101, 26, 46, -45, 57, 40, 35, 49, -22, 62, 106, -62, -79, 55, -6, 87, -165, -148, -100, -82, 26, 21, -108, -100, -82, -78, 14, 22, 161, 82, -36, 15, -19, 68, -76, -102, -2, -89, -49, -67, 174, -37, -47, 146, 125, -32, -72, -17, 143, -57, -97, -22, -57, -52, -25, -21, -22, -100, -86, 59, 38, 35, 52, 48, 83, 34, -42, 7, 139, 18, 16, 7, 80, -6]
-222fP3
-230F7
##PAGE=	F1=-12802.1
##FIRST=	23146.756194512010552,	4241.1435120000014649,	0
##DATA TABLE=	(F2++(Y..Y)), PROFILE
4241d1P3j00j2N9J66k69P6J81j35N9m3j91N0L5L2J60l3j8n3o5O5O3k0N4j21qrO4J07o4K1M0
3961A23j79M7kR9J3k05J20K6K2qr7P6N5q0o8Q4j2n5J97j27o4Qp0J61q1J5J57j06L8j53L0N2
3681A6j84Q6LQ7N8q8N8J5PO0j55n7J03j08J54N3n7j87Q8Jo9J11j22J35K2N2k08J84j05Qj6
3410e5J60m9j42R6Rk9J24m4k02R7J32k52J92J6M8q1rkM8j01n2Q1p9J1J16l1j6QR5OM7n9mj31
3112e2O5k7r6J71r7p6J95o3J82j59j8j67J55j2n5N8K0J4kj13mO6O1J1j06lN9J17p3j62J45
2841C4j33J6J02m3j9L6J51q9r6J21K3j34M2J13k03l8q2K20j34J84p3M0R1j78l3J33l6j42J46
2587A9oQ6p7Jo1J4M4n8J27j88l6K04n4K0L2j75J22k0O7j11O0R1j4j01m8M5q7k9J23LL1n5l7
2299f8Q1q6k0N1L9pJ4k2K9j57Q5R8P4j07n9O0L1j8M3r3m1J15No0rK29p3j35m2P7l0K6L6j00
$$ y = [-41, 32, -68, -80, -21, 145, -124, -48, 133, -2, 57, 14, -177, -127, -92, -60, 100, 67, 49, -4, -69, -4, 59, 39, 93, -28, -36, -45, 19, 126, 62, 83, 123, -56, -9, -11, 88, 101, -104, 16, 42, 64, 56, -41, 35, 90, 10, -58, 26, 14, -41, 156, 29, -35, -27, -97, 64, -17, -2, 155, 49, 87, -66, -36, 16, -168, -82, -79, 8, 66, -22, 36, 51, 58, 118, -37, -94, 9, -99, 55, 108, 51, -136, -48, -47, -116, -5, -127, 8, 30, 82, -126, 58, -47, -39, -55, 105, 56, -86, 10, 19, -10, 114, 70, -132, -35, 97, -155, 37, 53, 101, 20, 11, 9, 57, -44, -96, -15, -94, -83, 33, 2, -14, -6, 89, 95, 142, 83, 79, -52, 13, -14, -110, 61, -36, -112, 83, 20, 202, 43, 25, -142, 13, 1, -54, 4, 24, 38, 36, -77, -81, -15, 46, 57, -49, -52, 7, 124, 51, -111, 34, -99, -83, 19, -24, -43, -7, 144, 55, -41, 80, 103, -31, 11, 124, -79, -117, -199, 21, -113, 71, -2, 38, 129, -49, -82, 51, 15, -127, 19, 13, 99, 22, 23, -38, -24, 20, -38, 89, -99, -135, 69, 15, 35, 67, -108, 14, -6, 61, -50, 10, 101, 87, -14, -62, -17, -104, -133, -10, -7, 24, -31, -68, 13, -73, -93, -42, -3, -10, 4, -18, 11, -146, -61, 37, 111, 4, -55, 5, 36, 18, 61, -32, -73, 42, 47, -13, -22, 207, 134, -1, -43, 34, 4, 30, 66, -34]
2001c4j14J65m2m2k3J00k5O8n4m4K0J5M6pO2j9R2j99k7J41j51J33qo3J0k8Q1k0N7j32Q2Oj03
1712e7N4q1J04J08l6m8r5n5J38O9K2j5j48n1K6J0J6L1mJ03j24j2pj4J8P8l1n2P9Jk7N9j9j28
1415h8J07R0q8J6m5J31n1j26M3L1J8m4MO4m5M0m7O8j12K8O5j19J55P7k12J63k1j0j60P0j09
1143a07O8Q4q1L6o4J72j36k4J14l3p7J2L6L3j00J32L4n3R1p8l1l0r1J81n2j12R5J2L0k09J31
872a7J31q8n0L4n0p9J07J27j40j09O3R4l7J01r5j43K7K9K8J65Q4j56j2p0R0l7J05q2M6j3j20
601f7lK04j39l8P2k5R9j20N2j05J34j1j52J57j04O2l2J1n5Q9Q1n0qn9N7k8mL0l8O4Kj13q3
312a20J80l7J5k30PO8N7J07l2r9mL0K1J2lJ52n9p1J5j3Q6j34p1R3q2Q7j7J83j44m2K06m5j55
23c9L7J2R1j21m7P3j17Q8M5rn9m3j5J92n1j9KL1J0k0k2K0R3j47L6LL3r9Q4
$$ y = [-34, -148, 17, -25, -67, -90, 10, -15, 53, -1, -45, -25, -10, 36, 29, 91, 72, 164, -35, -62, 79, -72, 61, 53, -10, 0, -28, 53, 33, 90, -42, 40, 46, -57, -3, -84, 20, 128, 92, 44, -51, -106, 32, 101, 123, 108, -40, -91, -65, -55, -39, -8, -12, 91, -33, -45, -52, -66, -48, 30, -1, -53, 26, 27, 0, 59, 40, -88, 19, 109, 21, 37, -8, 123, 72, -54, -11, 20, 38, -6, -2, 62, 17, 57, 10, 78, -34, -6, 59, -60, 95, 172, -40, 123, 102, 92, -68, 2, -107, -39, 45, -36, 0, -64, 108, -28, -52, 62, 29, -48, -36, 0, 33, -67, 65, 99, 46, 137, 59, 28, -2, -93, 88, 36, -76, 19, 31, 61, -148, -17, 114, 26, -24, 10, -40, -119, -12, 115, -25, -134, -71, 23, -14, 87, -8, -151, -124, -95, -67, 98, 182, 26, 14, -56, 34, -3, 102, 20, 66, 53, -67, -70, 134, -5, -43, 29, 4, 103, -17, 35, -70, 64, 53, -99, 58, -46, 16, -16, -5, -60, 29, 110, 60, 52, -7, 50, 22, 18, 48, 10, 74, 76, -37, -120, 60, 23, 38, -192, -185, -117, -60, 47, 15, -84, -88, -58, -37, -25, -28, 124, 65, -6, 9, -4, 82, -52, -123, -30, -112, -25, -42, 141, -3, -45, 161, 116, -39, -2, 10, 101, -20, -67, 6, -111, -23, 22, 13, -46, -89, -104, 88, 37, 18, 20, 51, 61, 41, 19, 39, 132, -15, 21, 24, 57, -42, 42]
-230D2
##PAGE=	F1=-12896.4
##FIRST=	23146.756194512010552,	4241.1435120000014649,	0
##DATA TABLE=	(F2++(Y..Y)), PROFILE
4241c8Q6r3m4Q6J03j85M9J82j71Q2k9k13N4M9P4J39l1k0j34m2J26O2k9%o7n9L7J02K3m9K3
3970G3Pj60P4%P5J0j65J35k9P2n7r8O0N4m9n0O7rn4J94r6o0K3j18K01p3J5J16j03Rj09NJ4
3681b6j26R2l7O0J41j27R8on6J06j31q3P8o4J27O6j10j63M6R4r9R9q3P1O7P0k05J41j11Q7
3419A6r9J87l4j49P6jK3J09j02j47O0J85k51J28KR2q5K6l7P3j03o8Q5q8K3J23j2k4l1L6O5
3147G8N9m6J3j90J08k2j30J73j15l4K00k8J64j61n3j70J55k8%N1L3Mk7j24jP8O6K1n0q1M4
2876a3O8l7j71J89q4n3J76j22J7Q1P2o7p4Q2N9j36J2N5j89k3j3K36j99J90q1N1Q6j14r3J28
2614C3n3n0P5l2J69p6m0n1j1M2l3J49k32OK13j10Q0Mj83Q9l4R7r7O9O6k8q4MM8o8p1P0K4O9
2316E4k6j01R4j37L0L1M9l7KK8K1j37J8J41O9r2o8M1N4m1Q1j26l1J09O1n4j00K71l1j88j5
$$ y = [-38, 48, -45, -89, -3, 100, -85, -36, 146, -25, 57, 28, -185, -131, -82, -8, 131, 100, 80, -54, -96, 30, 92, 63, 63, -4, -63, -26, 76, 99, 50, 73, 80, -80, -6, -6, 69, 79, -86, 49, 20, 92, 35, -63, -3, 51, 2, -48, 19, 10, -44, 150, 54, -6, 17, -101, 100, 27, 42, 158, 55, 64, -45, -40, -26, -152, -60, -97, -37, 104, -23, 75, 69, 13, 119, -12, -95, -17, -81, 46, 112, 2, -161, -115, -21, -120, -21, -104, -33, 34, 104, -101, 40, -71, 16, -83, 104, 70, -79, -3, -4, 19, 128, 26, -121, -61, 124, -127, 1, 3, 95, 10, 36, -1, 72, -31, -99, -14, -102, -79, 44, 32, 8, -23, 13, 78, 137, 91, 104, -86, 22, 0, -130, 43, -72, -106, 94, 66, 230, 69, 16, -154, 1, -27, -27, 24, 57, 61, 34, -90, -91, -13, 53, 74, 24, -57, -13, 55, 18, -153, 36, -48, -101, 75, -47, -30, 51, 123, 56, -18, 64, 123, -13, -1, 54, -135, -158, -171, 65, -134, 56, -25, 26, 112, -2, -95, 33, -20, -70, 5, -27, 142, 66, 26, -25, -36, 6, -27, 122, -110, -104, 109, -1, 79, 83, -100, -11, -45, 52, -45, 24, 90, 62, -22, -18, 30, -38, -109, -39, -15, 54, 28, -73, 21, -116, -86, -55, -6, -43, -41, -13, 8, -129, -111, 30, 99, 7, -61, -20, 34, -7, 74, -52, -83, 26, 87, 33, -67, 204, 173, -15, -30]
2045c0M0l0PP6j19n9J46o8K0n3J12p6N7k2n3J5O4J%L6NJ20k12J1J32j57R5k0o3J2OR6n0pq2
1738e0J11j4r2N0o1O2J08n0j6j19k4J20L4M0K6j65k1J5M1j7Rj2O5j12J9m6M2L7R5n1o3N2N2
1450F5o9L2O6j82Q3J09p4j1m3J41p1j72J29P6l7r5O3L7k7L7q4N4o1J0Kn4J32M6j73J63K8n
1170A15k49J56q5J1Q7o9J4o8J91j40n2J45k7l6k8O9%o8O5O0j7L5n1l2K7j34J64m4j24R7j0
898BM7j63Q5J06L5j01J2r2OP7J20j78q1L9O7pR5n1j43L2l0L1J89Q1j64o3kR8m8J06n5Q7j8
610A19j98l8J96p1m2Q8j9O3r6J6r2Q5Q7k47J92m4N3o2m9oR0R4m2l1k4j3j7M1nJ2L7l6m6j07
312a12J87j7o5j64j5Q0J25O2q2o8J1L1M3q8qJ62l2oj1j2P1j21p0P1n6R5pJ03o1n4J47n1j39
23e1J03r%Ko2N8j70J39M7l4o7k3l2K06j00j2J8M6o1J4L1K5L8j36N0OJ4j03P5
$$ y = [-30, 10, -20, -13, 63, -56, -115, 31, -37, -17, -70, 42, -34, 23, 1, -52, -37, 27, 28, 28, 64, 69, 189, -23, -12, 120, -37, 58, 38, -25, -13, -7, 89, 39, 32, -50, 61, 47, -45, 5, -56, 6, 114, 64, 48, -71, -95, 25, 59, 99, 125, -40, -61, -46, -5, -22, -13, -25, 40, -72, -53, -99, -57, -20, 75, 24, -39, 13, 65, -4, 28, 94, -88, -5, 104, 30, 19, -24, 117, 46, -126, 3, 79, 42, -53, 10, 47, 20, 57, -27, 27, -34, -24, -22, -76, 56, 102, -71, 92, 120, 115, -134, 22, -63, -52, 35, -34, -20, -88, 103, -37, -89, 56, 29, -7, -35, 34, 34, -34, 31, 91, 74, 109, 58, 26, 53, -81, 83, 39, -85, 12, 2, 49, -114, -29, 77, 112, 11, 23, -69, -63, 14, 134, -44, -125, -86, -19, -26, 69, 18, -125, -93, -123, -92, 97, 178, 14, -49, -51, 47, -1, 105, 50, 137, 119, -79, -117, 79, 8, -34, 54, 35, 98, 2, 18, -74, 11, 98, -149, 43, -1, 52, -10, -59, -65, 25, 119, 77, 46, 22, 9, -8, 33, 28, 40, 77, 41, -5, -112, 75, 58, -7, -171, -186, -106, 19, 81, -1, -69, -58, -27, 16, -72, -80, 82, 50, 44, 33, 21, 92, -29, -99, -28, -84, 11, 4, 107, 46, -8, 139, 88, -51, 52, 43, 43, 45, -17, 41, -129, 10, 57, 23, -44, -67, -99, 107, 7, -5, 13, 59, -2, 12, 43, 68, 106, -30, 20, 26, 40, -63, 12]
-230A2
##PAGE=	F1=-12990.8
##FIRST=	23146.756194512010552,	4241.1435120000014649,	0
##DATA TABLE=	(F2++(Y..Y)), PROFILE
4241a3P2p9p1J16jn7OJ57j65J03j6k12L6P6R7J02m1%k08k0K09K7m9n2lr4O7J21p1k5M3k6j37
3952a08J16oK1L0j21J30p6R0o9r6M7J8J4j8L8jn4J55l7l3j3j32K55o9l1J02r1j7o8ll0p0P3
3664e4p2L9J93j40J11oj28J63j01r4O0m9R0P0j26j43M3J78j15O3n1J1P7Q3j52M6r7J67j65
3410i9J85rj20K5PO4P1j18n6lJ83k36P1QO4n6N8l3P5j03n7P1r9K4J49k4lo1k4J32K6n6L9j94
3112i9J26pj70J46p3LJ90l2J19j17p5j63J44m3N0M4K5j2j9j29k2J23L6K1Qj43L4J9nj42K13
2841E0m7j10K17j64M9P1J8l4k9J2P6j02l9J7j50LM6K05k00J65r9P1N2m6j57J18l0J6j5l6K18
2570A46n7p5k1l2M0pJ18k43O2J71j21R4pj66M3nJ01q9R5M0m8p3J5R0m5r3RN4P7k0j09J01j61
2281a16Q1k7O0l5m0N8Lj02oJ76L3r1m4J7P4o1R0j23k5J15Q8n4j68K59oj60j6Mj7jN8q9J3J14
$$ y = [-13, 59, -20, -91, 25, 24, -33, -27, 130, -35, 68, 52, -160, -124, -48, 49, 151, 110, 110, -98, -118, 91, 118, 69, 17, 14, -80, -13, 108, 37, 12, 55, 29, -108, 8, 2, 23, 53, -68, 62, -14, 76, 7, -89, -42, -24, -10, -28, 10, 9, -45, 110, 73, 40, 27, -105, 150, 81, 50, 152, 61, 44, -24, -27, -57, -127, -54, -126, -87, 106, -34, 77, 71, -57, 106, 5, -89, -29, -78, 12, 82, -44, -187, -144, 34, -81, -18, -69, -58, 19, 102, -50, -4, -101, 66, -99, 86, 77, -43, -18, -11, 53, 124, 6, -50, -53, 130, -106, -35, -27, 37, -19, 39, 6, 81, -22, -79, -8, -107, -83, 66, 42, 39, -22, -46, 86, 112, 56, 95, -99, 27, 20, -150, -4, -77, -74, 116, 84, 203, 86, 11, -152, -8, -51, -1, 43, 68, 56, 37, -92, -114, 9, 45, 66, 74, -69, -35, -16, -21, -163, 50, 3, -107, 110, -54, -5, 66, 84, 50, 21, 33, 109, 7, -32, -15, -165, -162, -116, 89, -111, 54, -45, 26, 78, 32, -125, -7, -37, -21, -36, -72, 146, 89, 14, -7, -39, 1, -6, 112, -131, -69, 102, -19, 75, 68, -98, -55, -60, 41, -48, 47, 87, 39, -34, -19, 71, 26, -67, -58, -4, 73, 53, -56, 45, -116, -35, -62, -2, -37, -77, -19, -16, -118, -124, 52, 85, -6, -50, -33, 41, -20, 70, -53, -78, 37, 125, 71, -97, 162, 156, -4, -20, -16, -33, -34, 24, -65, -52, 62]
1983F2j20Q9q8J37j10K9Oo0OJ16o5K3j2N6J12j85N1R0j37O7p2m6O0L1P9o9q9qJ19m1n7M4o3
1695d5L8J29p8j7j30J9Q4kN3P2j61KOQ0p0Jj2M3j14O1q4P6M6J51r6p4M0P0q7K5J23k39Q8N6
1397E4k3k5o8J58o3j58J53P5q6q0J04Kl1K1p8L4j4Kp5K7O4L8j09J28R7l4k68J78n6oQ3p7j5
1108d8m0J83j18j04J43OJ8m5O4l5l7PQ2pKNm7N9j73J57m4r3L9J3K4o9rR8J25j22Qj35Q8M2
811C7R5j73q3K7J0M5Q8Lj27J1p6N5J76O7j29j06N0P4k8Q8l8J36k6k53o9J58j0o8J19QM7q2
531B6j7q1J9J79l00J98L9J8p0r6N6P6P3n1m9Rp5J3J09p6N9ln6K1p9J36J8j35p8m1Q6K11k0
242A19j40m4N4K3N4j81MJ60j3N4j5m6O8j12l5N5j7N4J7L1Mm6L8m0r8J32j4q7J32q4M8j83J31
-47B3M4n1l1k0l8J74j28mO3L7j47M9M4P8k7q5L7NQj00M9
$$ y = [62, -58, 31, -57, 80, -30, -1, 5, -55, -49, 67, 2, 25, 13, 69, 181, -4, 47, 137, 0, 67, -5, -51, 9, 40, 119, 50, -39, -47, 72, 31, -26, 18, -45, -7, 122, 44, 27, -103, -84, 0, -2, 51, 123, -38, -36, -30, 50, -20, -19, -31, 12, -102, -41, -125, -49, -3, 148, 52, -22, 18, 88, 1, 26, 149, -90, -2, 54, 31, 6, -62, 96, 33, -125, 28, 103, 17, -63, 41, 43, 12, 33, -45, -11, -25, -23, -98, -71, -7, 31, -78, 50, 147, 113, -155, 23, -33, -39, 44, -33, -48, -88, 95, -23, -127, 16, 22, 40, -5, 59, 24, -13, -6, 76, 69, 71, 76, 29, 88, -85, 72, 28, -65, -26, -13, 11, -58, -67, 31, 156, 34, 42, -93, -5, 37, 132, -41, -124, -97, -87, -42, 46, 49, -78, -67, -143, -88, 88, 155, 26, -80, -30, 44, 16, 104, 66, 202, 176, -77, -146, 12, 2, -66, 53, 61, 108, 26, 9, -72, -53, 126, -174, 24, 63, 81, 11, -85, -29, 47, 120, 69, 20, 29, -46, -33, 76, 0, 59, 56, 0, 21, -58, 78, 96, -39, -117, -158, -72, 139, 119, -21, -65, -11, 12, 66, -115, -111, 49, 36, 90, 75, 29, 97, -15, -50, 5, -12, 42, 59, 90, 94, 48, 86, 46, -52, 80, 66, -21, 111, 27, 75, -108, 23, 67, 16, -15, -35, -73, 101, -27, -31, 32, 69, -78, -29, 15, 93, 66, -19, 18, 23, 31, -69, -20]
-230b0
##PAGE=	F1=-13085.1
##FIRST=	23146.756194512010552,	4241.1435120000014649,	0
##DATA TABLE=	(F2++(Y..Y)), PROFILE
4241B7L1n0q5J36r5N1m1J07j00J06j1j92J8Q6R5P9n1K7k49j8K77j8o3q9M8j11Q0J07j27KO5
3970D2n6j11J60k4l9N8q7J18j12Q0m4r3L0k4Q4J8Rpl7R1K6Mp7j24L14p8q2J01p7m0l9Mm6l6
3672i4L3j00L8K01j29R8J3j88K20p4j01O6n7L1O4q9j11O7K11j17J4l4l3O4Q4n4q1o5K13j86
3410i6J57J4o7m6M6P9J9q5L0q2J60k14L1L1j5l1Q1J4O5r9m8M9j06J1J83n1L7p0p2J74l2p3
3130fO3j50J19J1j92R6JK9J64q5Q2l6q6j40J36p8Q0L9Qk9J2j14m4J69j0J0K8j69N2j9Lq7K21
2841G8l5j37K02j54O6RMJ5J8p5Q9n8r4Nq2K5N0J51j33J17j21Q8Plj92R0K7L7r2jK14l6r8K5
2544Fm6M4MO9k21Q1J00p2P0Jj36RM0Q2r3J32J9o8p9rJ45nr5m0Q1N1k6o5J04j63J16q9N8rq7
2237i1N9mo1NJ85j2j16OPO4n8O0p4l3J17Q9o6j78J99j0p5m2NLj4kk5P1P5j65J43j02J56j11
$$ y = [27, 58, 8, -77, 59, -36, 15, -26, 81, -19, 87, 76, -116, -98, -12, 83, 162, 111, 138, -111, -129, 148, 130, 67, -22, 26, -85, -5, 102, -25, -23, 42, -14, -125, 35, 11, -28, 30, -57, 61, -51, 29, -15, -108, -78, -102, -18, 0, 9, 2, -35, 56, 82, 86, 9, -115, 199, 121, 39, 140, 63, 23, -16, -12, -58, -94, -61, -161, -123, 78, -51, 47, 60, -128, 92, 18, -83, -17, -74, -43, 21, -68, -179, -112, 99, -18, -4, -38, -71, -7, 77, 23, -58, -123, 90, -96, 61, 75, 8, -38, 8, 87, 106, 21, 51, -31, 129, -85, -54, -23, -38, -69, 12, 26, 91, -8, -56, -7, -113, -102, 81, 30, 67, -3, -75, 99, 67, -6, 57, -93, 26, 37, -155, -59, -58, -29, 135, 50, 132, 96, 10, -130, 6, -72, 8, 47, 55, 26, 38, -76, -120, 49, 39, 49, 77, -92, -40, -59, -56, -143, 78, 43, -94, 108, -46, 20, 29, 33, 48, 66, -9, 80, 22, -72, -67, -149, -124, -74, 77, -56, 61, -60, 28, 35, 32, -160, -70, -43, -6, -98, -99, 115, 79, -19, 6, -40, 4, 8, 77, -144, -63, 37, -35, 35, 36, -100, -91, -51, 31, -62, 70, 89, 21, -58, -67, 78, 73, -22, -62, 19, 70, 44, -21, 83, -80, 36, -53, 5, -4, -91, -32, -36, -97, -92, 93, 81, -35, -29, -22, 42, -16, 44, -30, -63, 54, 143, 77, -101, 98, 88, 13, -29, -24, -21, -35, -37, -62, 9, 84, -81, 62, -40, 116, 5]
1940Ej4J3n6J4J36j18O1p1R4Q1j47R0K5r8P2j40j9J20L7M8p0j53O2J04p5nL8q2K4J64j04l6
1660@j32O0M4m5O7J04j30JJ3J05j07rlM4j15R3j22Q0N1K37j59r8O1N0r0M0J41k52J06n9N5
1388C1k5j12J79L4k8PO7j85lR7k2n9Lk2J2J3J9j40Q9k1M5n4R3J37p5k04J31j7kP7q2n2PJ43
1091H1p1j59J08N9N5l5L3o6rj8R2k8j0O2l7L9k01J64n3l3l8N2k1L3j07J08J53j15J7j52J32
820C5MO5j33r9K5l6Q7Q0L0p5l0q8Q2J35L9p4j19O5K8J2P5l8J64m4k51q4J11K5j01J51K0N7
540A18n9m0p9m2K32k81J75Q5l5k2j15Q8N0L6o5n7J8r6M5J73j48Q5n4n6Q0j2L0P9j90Kn7Q8
260b4K71j01j81k3R7K2L5k38K5J45jQ5mj02R1j08J1L5K6pM9j0K7k5p6j9k9J14j9j42K32j05
-20E1M7j65P2M9m3J0k4l5J01j05RR7J1j97P6KJ47p9k0J5Qjr3J4
$$ y = [5, -9, 4, -52, -38, 98, -20, 41, -30, 64, 145, -2, 88, 113, 15, 87, -53, -72, 48, 85, 133, 63, -90, -28, 76, 1, -4, 34, -48, -24, 140, 36, 0, -132, -72, -28, -73, -6, 98, -32, -31, -18, 87, -20, -29, -32, 12, -103, -10, -132, -52, -1, 236, 77, -21, 40, 90, 0, 40, 181, -71, 35, -24, 31, 6, -106, 73, 107, 79, 86, 153, -32, -35, 62, 40, -19, -16, -38, -26, -13, 6, -134, -45, -66, -21, -75, 18, 155, 80, -124, 7, -10, -12, 65, -17, -69, -62, 81, 10, -149, -41, 18, 73, 38, 71, 5, -4, -22, 70, 42, 32, 94, 57, 96, -105, 59, 6, -27, -65, -13, -34, -1, -108, 0, 153, 38, 55, -97, 35, 39, 104, -29, -128, -103, -139, -52, 28, 58, -17, -47, -135, -53, 82, 121, 47, -72, -7, 21, 33, 108, 70, 234, 190, -61, -145, -34, -9, -110, 41, 61, 118, 59, 19, -60, -102, 130, -151, 24, 109, 74, 52, -63, 25, 75, 111, 46, -11, 7, -89, -44, 129, -19, 66, 12, -44, 36, 24, 54, 133, -57, -55, -112, -24, 247, 146, -35, -58, 39, 61, 96, -142, -117, 28, 27, 112, 108, 6, 97, -11, 0, 35, 61, 54, 103, 93, 120, 95, 19, 0, -29, 85, 66, -76, 156, 51, 98, -67, 5, 54, 11, 21, -3, -38, 63, -42, -33, 64, 75, -122, -46, -44, 103, 24, 4, 19, 27, 26, -67, -53]
-230e3
##PAGE=	F1=-13179.5
##FIRST=	23146.756194512010552,	4241.1435120000014649,	0
##DATA TABLE=	(F2++(Y..Y)), PROFILE
4241F9k8mq2J28j38J05q1L6J5P5j0j57J0O8O9R7m2L2k46m5K99m4o6q9N7j11Q3O3j20K6O3p2
3961d0p9J75m5p7Q2o2J06j41N7kq5Pm2J26N0j0l4OK2O6K1j11j22L51p6j05Q4o1o4j6J4k9k3
3672e7j6j09N0J75j11P7M1k10K53o0j12R0o4m9N3j8n7Q3J80j10l0k5n3M9O7O4j91l1K05j54
3410g0J15J8rj11J02P1m0j8Q3j61J47j83MN5r1l7R8P5O5j01o1L6j14QJ98o5O1n0j04J62o6
3139A7q0Q2q8Q9K9j86L6P0M1J24j58P4N5r3j02J39j45R6L0ql0M8r2l4J80n0Jj5j55R9m8j0
2859h4j2K13n0j37J43j10Q0p3J3P6M8j54J00k5j30LLM4k0R9k8P1j41R5l4Lj75M9P8L0j38O5
2579i8J65k8r3O3o4O6KK7j70M6K9NL7L5j08j2O9M6r1J56jp1j08l6J81M4q5n9R2Ol0LR8j46
2281c0J17j19M8J4j15L4K5l3K4J64l9j60O2J0K9l9J2Jn2R9Q5q9j33J22l5J8p8N0K1m5n3K7
$$ y = [69, 41, 37, -45, 83, -55, 50, -31, 5, 20, 95, 85, -72, -62, 6, 75, 172, 130, 162, -84, -129, 170, 126, 60, -29, 28, -83, 0, 63, -57, -31, 32, -40, -119, 56, 11, -66, 16, -46, 60, -81, -24, -26, -111, -104, -146, -20, 30, 20, -14, -8, 14, 80, 101, -10, -132, 219, 143, 38, 122, 61, -3, -19, -5, -34, -57, -73, -182, -132, 43, -68, 9, 50, -160, 93, 33, -79, 11, -53, -102, -49, -67, -124, -41, 139, 29, -1, -26, -79, -30, 37, 101, -90, -121, 84, -70, 45, 63, 54, -57, 45, 116, 76, 58, 141, -20, 127, -56, -52, 3, -88, -125, -27, 48, 113, 12, -49, -13, -127, -119, 79, 14, 75, 25, -79, 83, 17, -63, 19, -69, 20, 49, -137, -101, -31, 10, 134, -24, 50, 105, 12, -90, 49, -96, 0, 30, 22, -8, 40, -52, -86, 94, 44, 45, 30, -125, -26, -74, -84, -96, 117, 67, -70, 73, -37, 43, -30, -17, 59, 107, -47, 53, 28, -102, -99, -96, -52, -72, 27, -1, 70, -71, 24, -10, -7, -182, -133, -55, -25, -163, -98, 67, 39, -54, 9, -55, 11, 13, 40, -130, -84, -55, -50, -13, 22, -86, -98, -29, 17, -74, 82, 81, 10, -98, -134, 47, 91, 6, -53, 39, 45, 15, 18, 116, -30, 87, -32, 16, 30, -85, -51, -26, -59, -35, 129, 90, -70, -8, 2, 31, -8, 4, 5, -47, 52, 137, 48, -85, 37, 2, 20, -58, -8, 13, -32, -85, -58]
2001e8Q5N1j79J74q8J62q7o3Lm6M2J09j29J10j28J00L9j14J10l5n8J01j84OJ50J7L7n0j82
1747a05J05P9j14M7L7j05J4J91j06n2j31R0J5r9Q1J06p5j6K7R6q5m7J6N6r5J00j52N3N4L23
1485C08k20j34J06Qr1O6J32j99J13j92J46k6j50J99K29K35k66O1m11R4M9k9q9j4P0k1J8O2
1240E4j73J10q9N1l1Q3J18r6q6M8K0LP6p1q8M3P7mj85N9J02N6qKp8MqP9o2oR3J6j9k17J79
933E2o5J3p3O6o1R5j54J21J26q8K2j30J31m5M2p4r9J3k8R2N9J8J2o9o3Q2Q3J4l3r1M0j9N6
645D5Q1n7J44o3j96p0O9L5j10J58oP8j5m7q9p2K28k00J36N9q9P6j05O8K5J6p3n5kp1O3K13
365A74j95Q2r9m0J15P1j03J54k24N3n5R1K71j47j84JJ13L1j3k40L4J19K1P5J0j44J21j09N6
111C9j6O7m0O7j7K0j7j42JM9O6l1j54K82j16N3j39NN1j4L2k7l0J4l4L3R1j6j89R4q4J92r3
$$ y = [-58, 27, 78, -101, 73, -15, 147, 60, -3, 0, -46, -4, 105, -24, 86, -42, 58, 97, -17, 93, 58, 0, 101, -83, -77, 73, 90, 127, 77, -105, 0, 79, -35, 12, 49, -56, -42, 149, 43, -9, -140, -50, -35, -134, -53, 53, -22, -38, -11, 85, 0, -47, -31, 25, -70, 30, -122, -69, -15, 308, 88, -46, 60, 68, -23, 43, 175, -24, 89, -103, 43, 17, -133, 66, 295, 530, 264, 325, -86, 8, 57, 28, -61, -75, -5, -26, -8, 54, -119, -9, -98, -47, -78, 5, 123, 27, -59, -11, 9, 12, 88, 17, -71, -28, 49, 45, -140, -81, 21, 77, 69, 71, -7, -3, -11, 68, 6, 0, 93, 109, 90, -127, 52, -13, 0, -73, -7, -68, 27, -127, -6, 120, 32, 54, -76, 55, 10, 52, -22, -121, -108, -136, -44, 15, 33, 45, -24, -87, -5, 78, 92, 59, -32, 8, -11, 45, 126, 69, 213, 150, -46, -116, -47, -12, -122, 36, 30, 108, 93, 46, -43, -115, 113, -87, 49, 108, 19, 95, -10, 58, 83, 99, 26, -29, -31, -102, -39, 174, -21, 61, -38, -78, 37, 108, 5, 159, -65, -12, -67, 24, 295, 148, -36, -35, 78, 109, 96, -144, -110, 9, 30, 105, 115, -29, 92, -17, 39, 23, 90, 50, 117, 100, 120, 103, -39, -38, 11, 77, 46, -108, 174, 58, 111, -28, -23, 28, 14, 46, 19, -11, 3, -31, 2, 93, 77, -112, -18, -102, 90, -3]
-178cK3%J8j8q4j3
$$ y = [-3, 20, 20, 38, 20, -64, -77]
-230g7
##PAGE=	F1=-13273.8
##FIRST=	23146.756194512010552,	4241.1435120000014649,	0
##DATA TABLE=	(F2++(Y..Y)), PROFILE
4241I2p7M8o6Q5j17J08j03m5J35J8j4j00ML6L2J42rNk03r1K65m1n9m3J7r1P0J3o4M4K5o4m9
3952i7J50n3p9R9n3R9j67L8M0p6j5k8J19Q0j6o5N9l6P2Jp7j48L41l1j01L9m1r4J8J7Lk1n6
3664g9r5O2J35j02O2O4j77K34n5j23J19n8j31M1M4J1O9J10r7n6j6m9N0L1J60k37mJ46q9P7
3401D7pL7j41J48M6q8N0R8k21J53j36k7O5j14p8J12J21P8j11r2L4j19L8J65n0M8oj15R0l4
3139io7R1m0L8M7j58j9J04L5P7j89Q6J17r0o1J40k27J11J4k3rP9q1J7J41p3J5j13j05J50q4
2867h6k9Q1J86p6j26P8o7J01j39J4J40N9j95J02j4j39kP2O6j27O3N8N2j51J03p0k4j12J3R0
2605g9K9j60J33R8k9n3O5r4J11j3Jr4j4k6N9J9R3q6l3O2Pn9J41l1l2j56m7J77Q3o3m4P5k9
2316A1k9O4Q0j11P3j00M5J9j22jQ6k6K9J22m0k06J05K0nk9k0P2p2O0Q6j11o3O2n8P2j01J07
$$ y = [92, 15, 63, -3, 82, -35, 73, -30, -75, 60, 78, 64, -36, -32, 4, 36, 178, 169, 174, -29, -120, 145, 104, 45, 2, 19, -72, -2, 11, -53, -9, 16, -48, -97, 53, 0, -79, 20, -33, 66, -101, -63, -23, -99, -114, -142, -23, 57, 41, -24, 35, -1, 71, 72, -5, -153, 188, 157, 56, 95, 54, -40, -22, -5, -2, -23, -79, -174, -112, 23, -79, -17, 47, -130, 104, 49, -74, 45, -13, -144, -103, -59, -48, 21, 131, 34, -22, -38, -87, -37, -6, 154, -83, -87, 59, -30, 47, 40, 77, -64, 84, 130, 42, 92, 190, -31, 122, -14, -41, 24, -90, -168, -56, 65, 143, 32, -60, -26, -145, -107, 58, 8, 56, 50, -65, 25, -9, -76, 15, -25, 13, 60, -98, -117, -13, 22, 99, -90, -4, 113, 23, -38, 102, -125, -14, 0, -23, -32, 47, -34, -17, 124, 51, 66, -47, -152, -2, -86, -115, -34, 152, 76, -50, 28, -39, 62, -77, -63, 77, 136, -59, 43, 29, -110, -112, -40, 26, -101, -38, 20, 72, -79, 24, -46, -70, -182, -169, -79, -50, -210, -77, 21, -8, -61, 4, -90, 21, 8, 9, -85, -99, -125, -66, -47, 46, -40, -73, -11, -4, -63, 78, 47, 15, -141, -188, -11, 72, 9, -35, 40, 11, -18, 46, 126, 15, 88, -12, 33, 52, -70, -71, 15, -11, 18, 140, 100, -106, -1, 19, 14, -15, -35, 37, -35, 25, 111, 0, -63, -1, -59, 13, -88, 19]
2036A9K7q4n0K6N0O3j72J91n6J51n7j06nm1P5M7q8J52j61P0Kq3R7o6l2J26j74J4J34j9N4j4
1756I0j80J18N4j43P2L9j08%J93p1n9j20J10Mj66Q5Q4j5l0L2N4Mj12L1O5m3Q1j62PN1L67k49
1476H3j69J45l3r1Q5J15j07R7k81K23m3j52K12M40N51m44J2p60J53kk5r6k1J50o5J5J05j66
1231f9Q7j17M9m3R6N0p8L0k6M3%P3m1j06M0J1O8j64K8R8K7J2j4n7mQO2r0MR2R3p7k19J87p3
925b0K0m1L8q0R5j31J19P9n0J3q4R5q7K2mp4k0L2N7K1j2J04q1k4M0L9J2l2k6on5R4J02q4P5
618A46p3j19k8L9L2q2J36o3Q2M3l6j07n3J59q9R2j6j28J81p8J1RL3p3m4l6k5O8K18k10O0j32
338h3kJ09J41k06K09k35O4l8R8K13j50j47K7R0M8o8j92J4Q4O7L4K7j46J23j09R5j02J02l1
85C6O0pJ0l3j33J4R8J7m6j21K78j17O7j31l0L6K3L3k4l8n1N1P0N0l7j37J03j65J84p2K5%K9
$$ y = [19, 46, -38, -88, -62, -12, 51, -121, 70, 14, 165, 108, 2, -3, -44, 31, 78, -10, 142, -19, 51, 53, -30, 67, 1, -31, 95, -79, -65, 69, 50, 104, 90, -90, 28, 82, -61, 11, 50, -58, -58, 135, 64, 5, -115, -5, -1, -167, -82, 2, -13, -43, -11, 43, 47, -65, -34, 31, -12, 69, -93, -86, -35, 332, 83, -86, 59, 26, -65, 20, 135, 28, 125, -156, 67, 24, -128, 84, 524, 1075, 631, 643, -117, 36, 34, 9, -87, -108, 42, -23, -8, 97, -69, 18, -99, -50, -93, 3, 53, -25, 5, -21, 22, 22, 95, 54, -52, -12, -1, 67, -97, -69, 29, 56, 68, 54, -3, -7, 1, 63, -27, -23, 69, 162, 85, -134, 53, -20, 0, -41, -3, -83, 12, -119, 0, 79, 29, 42, -42, 53, -34, -12, -16, -90, -110, -78, -21, 0, -12, 92, 11, -13, 27, 66, 78, 46, 20, 14, -41, 53, 155, 71, 146, 73, -46, -74, -35, -3, -85, 51, -12, 70, 113, 77, -30, -83, 76, -13, 79, 63, -65, 116, 38, 49, 58, 91, 18, -26, -62, -87, -19, 199, -11, 49, -83, -85, 24, 165, -41, 168, -67, -3, -41, 57, 270, 120, -27, 0, 90, 138, 70, -122, -108, -24, 43, 77, 104, -42, 81, -28, 67, -35, 67, 36, 96, 89, 99, 66, -67, -53, 45, 62, 16, -105, 173, 56, 123, -8, -38, -2, 21, 54, 30, -8, -59, -8, 62, 112, 75, -62, 41, -124, 60, -12, 13, 13, 42]
-204D2l2o8k6
$$ y = [42, 10, -58, -84]
-230h4
##PAGE=	F1=-13368.2
##FIRST=	23146.756194512010552,	4241.1435120000014649,	0
##DATA TABLE=	(F2++(Y..Y)), PROFILE
4241H5q7P9m4K4o7R9j00j27K13l8k1j7k3J6kJ78L2m0j39j31J87j2m1L2n6n4M2k1NN0l1l7k3
3952f9R8l9n6J06n7Q8j81L4O2o2l0kP1J12j6o9J00q6O2m9J1k00K76O1q5k4k1j11N9J2K5k3
3672cp1n8N7J02j04M3Q2j07J66n2j26J48n0j81L6N3O7L5M6q3n8j0k3O8k2K10j98lO9k9O0n0
3392A4O0j21J58J3j06Q1R3k46J60p3p2O2q0j27J22J38Q9j21j22K6j04J02Q2qjM8j07j4N9l7
3130c2Q4k0l0O9j28n9J01J9L7j38P8J29o3l8J27k85J28on1L8J02q9P6P4q0N7k34k6J77j35
2867a18m3J90J33r2j20M9n0J21j63j0J81O7j82Q3j5j31mR5Q7k02L7Q7N9j36J22j08n8m3mO6
2605a02M6j76J73M5k6J3K8j37J76l6k0j1m7n8N4J9J53o2o5K6k9J4P9o6M4j93n3J32R4k2nL1
2325A9l5k8R0N7n5j3l8M9J3j19j8J53n4L0P2l8k24J34K1j9l5k1J10q2K3Q2j11nK9o5Q3r6J27
$$ y = [85, -2, 77, 33, 57, -10, 89, -11, -138, 75, 37, 16, -1, -24, -8, -10, 168, 200, 160, 21, -110, 77, 65, 24, 56, 0, -54, -12, -33, -28, 22, -9, -46, -69, 29, -10, -66, 40, -17, 71, -110, -76, -14, -76, -106, -108, -37, 75, 59, -10, 90, 4, 66, 17, 28, -172, 104, 165, 80, 56, 35, -76, -17, -5, 20, -3, -74, -132, -75, 27, -77, -34, 48, -59, 107, 55, -71, 77, 27, -154, -118, -65, 2, 37, 83, 0, -58, -68, -91, -23, -45, 165, -33, -36, 33, 4, 64, 14, 74, -47, 111, 124, 18, 99, 192, -54, 106, 33, -39, 23, -57, -184, -62, 76, 165, 44, -78, -52, -156, -54, 28, 20, 19, 67, -40, -54, 5, -32, 52, 32, 2, 71, -57, -116, -15, 4, 41, -97, -19, 110, 47, 9, 136, -149, -21, -27, -78, -40, 62, -27, 49, 123, 43, 100, -134, -160, 17, -118, -161, 29, 162, 70, -50, -1, -51, 70, -93, -103, 78, 145, -37, 46, 31, -100, -104, -9, 78, -124, -87, 0, 59, -77, 45, -63, -121, -164, -168, -102, -56, -232, -59, -14, -40, -27, 1, -136, 40, 4, -16, -27, -74, -132, -78, -59, 94, 32, -33, -7, -36, -22, 57, -9, 35, -158, -211, -79, 15, -7, -12, 19, -16, -44, 46, 103, 48, 35, -3, 46, 59, -60, -78, 75, 21, 51, 123, 85, -139, -5, 16, -3, -38, -59, 51, -31, -8, 74, -37, -42, -13, -78, 5, -91, 36]
2036C6J5j01mk4pJ11j67J98j7J20l0j29lm4J00k6k1J70j64K3j4m2M7n7k0J24j16%Q9n7Q5K0
1756I5j64J11M1j48N6L5p2j8J67j1o5q7J22jk34P8N6K7l3K8MJ12j73L1O9K4M1j34m3M0L37
1485B91k17j90J47n4q0Q7R3k6P2k96K58p3j12K21N39P70l15j28j098J44k2j8p4j3J76r8J4
1248bJ12j28M8j09M2p4J11k8l3J02n6M2j8O5mr2ll5J31j06L3L4rJ1j4j0k8LO3r4J0O6J56q9
951I7k12J76p8lL4j2q0M6o7R6N2k0%l8M8j03lO6l7n9R4Pk8k5J58m7j7j5J5L4p0N4m8p5J19
645E9J21j05po9o3L0K4K8l9R9j16M7R6rj17JM8RN6r0j36K33l7n0%P3o3l3n6kQ0J83j99L7j48
338a15N7O0J78k45K21k20L5j8J08J40j28q9M2N1N4r7j23k6L8J31qM2j04Q0j05J28j88J28j1
85A6L6LJ0n5o6J9Q5kn3o2K27j08R0j52k0lN7K9k2o6p1J15R2J9m5q4J08j94J28l5lOL0l6l9
$$ y = [36, 51, -50, -54, -78, -85, 26, -141, 57, 40, 160, 130, 1, -2, -46, 54, 28, 7, 177, 13, 36, 22, -20, 27, -30, -50, 74, -42, -42, 47, -10, 75, 95, -69, 42, 83, -65, -9, 26, -46, -64, 103, 92, 27, -60, 62, 61, -173, -95, -39, -12, -45, -17, -13, 99, -74, -43, 26, 50, 91, -43, -86, -46, 291, 74, -116, 31, -23, -103, -16, 77, 51, 123, -173, 85, 12, -100, 121, 660, 1430, 1115, 987, -111, 33, 11, -7, -81, -94, 82, -16, -2, 110, -18, 30, -79, -37, -111, 0, -28, -61, 41, -15, 27, 9, 74, 70, -22, -25, -60, 71, -35, -2, 32, 23, 34, 20, 10, -18, -15, 48, -46, -36, 30, 186, 97, -115, 61, -17, -20, 14, 2, -78, -32, -99, -3, 49, 29, 29, -9, 39, -64, -67, -1, -38, -97, -3, 4, -24, -49, 109, 62, 45, 30, 45, 79, 9, 63, 15, -60, 59, 180, 75, 68, -1, -64, -34, -10, 18, -21, 78, -38, 9, 105, 96, -21, -20, 28, 37, 93, 3, -133, 100, 63, 13, 13, 86, 23, -10, -66, -68, 12, 195, -4, 33, -115, -58, 2, 180, -65, 156, -64, -29, -47, 61, 201, 73, -16, 26, 77, 131, 34, -89, -115, -77, 54, 46, 88, -16, 64, -41, 87, -101, 27, 16, 52, 55, 65, 10, -56, -37, 48, 46, -7, -69, 158, 50, 140, -12, -32, -35, 22, 51, 29, -37, -108, 7, 99, 118, 73, -11, 97, -97, 31, -4, -7, -1, 29, -7, -46]
-222d6k1
$$ y = [-46, -67]
-230f7
##PAGE=	F1=-13462.5
##FIRST=	23146.756194512010552,	4241.1435120000014649,	0
##DATA TABLE=	(F2++(Y..Y)), PROFILE
4241E2n2P3j7k8l4J07p7j90K20o5k8P2o8J2j8J76N0p5o2j52R5J6LR0j19rNl4N4M1p8j0QM4
3944Bj2k7J00o8O8j69M2N6m7k2OJ1J45k2l2J14j26N3r8R8k54J79J62o7q2j0r3Q6ML1l2n6j2
3655g2L5Q6j10OR9l1P3m3j19J76m8j86M6jQ8OK6p0m4j7J7Q2p7K15j01l2J9jN7q1O3o7J22j6
3357A00p9M3R4k31J50lj20N2k7j50J14J43O9j12j37Kn7J69k0N0o0R1r1j05J65JN7k1r7Q5j05
3086c0p8P1PJ8j3K1Q7j1l7R6k83J44l2q9R1J20j03R9J0p3J07l29O6J70j89n2K90N6q5j20O3
2815hn6J27j52m8J85Q8j29M6k0j19K1N9Q8j92J6M5P8r0J51j45p8kj2M9N8j94J76K2kO7k0j85
2535a76K41n7m5N5k5o8oK5J83k2j03k0n9J07pr4J31j90p8P0P6L7L6j8k6k3P6L8Rj12L5M7K2
2246E9j11jJ84j08M6K0n7j98J60Qk1m5KJ14q7J2N6p6K1J6n8P3o5Q3nq0L7p3m2J54j70J90J3
$$ y = [52, 0, 73, 56, 28, -6, 101, 24, -166, 54, -11, -39, 33, -35, -23, -41, 135, 185, 110, 48, -104, -9, 7, 10, 100, -19, -28, -23, -57, -3, 38, -40, -50, -42, 2, -10, -37, 63, -5, 63, -106, -64, -8, -55, -77, -71, -60, 85, 63, 31, 145, 19, 72, -26, 72, -182, -3, 159, 92, 10, 0, -93, -7, -3, 28, -4, -60, -72, -37, 49, -61, -55, 44, 13, 86, 43, -76, 100, 52, -134, -88, -89, -1, 5, 31, -39, -83, -100, -83, -1, -78, 137, 36, 4, 23, 22, 79, -2, 61, -6, 116, 100, 21, 64, 158, -73, 77, 74, -46, 6, -21, -171, -57, 86, 155, 43, -94, -92, -149, 20, 0, 50, -10, 81, -10, -115, 50, 51, 108, 87, -10, 75, -30, -108, -37, -30, -12, -25, -4, 83, 72, 35, 131, -152, -8, -40, -129, -38, 82, -21, 78, 88, 15, 122, -207, -141, 29, -160, -212, 78, 134, 49, -71, -8, -64, 63, -89, -137, 48, 136, 7, 53, 33, -86, -65, -6, 82, -110, -94, -49, 29, -61, 90, -55, -133, -135, -147, -98, -40, -234, -58, -36, -38, 29, 9, -176, 65, 8, -37, 18, -7, -75, -81, -56, 127, 105, 2, -18, -77, 30, 23, -71, 60, -130, -208, -138, -62, -25, 11, -7, -33, -56, 20, 58, 67, -45, -10, 37, 59, -52, -53, 131, 23, 69, 89, 32, -166, -6, 2, -19, -64, -62, 52, -35, -23, 33, -43, -22, -6, -64, 9, -56, 27, 22, -58, -21, -94, -136, 18, -152, 38, 51]
1957E1P4jj21Kn2J13r0L4J55j34k9ONk0k5nR4m0l1M5r1J07M1j50R2M7j22QJ5Ll1J24M6q3k6
1651A1J23j5k81N8L8M3k8K4l2J86j91PP5P9j3o8p9K2K46j28j91J08o2m8P7O0J3M6k36K30r5
1380b1m8K25M57P76J05l31j233P4nj9l5J5J36q6J0P3q9K1p3L5j06J11q5J9J10l6K7m6M5K7
1117E3m7o1n4J75m9O9n3l9j2oM2n6k9R4o5KK3J83m2j94J36q2k1J02n1q1rj7O3O0r%j2J3r1
811f5l2J27j4p8J09k6p5nJ54K0o1m8J8O7j29J23p0q0J22J28j12n4o3m5R0K1K4j6O9j33k5J21
531F2K5r7N0n7O8K9j17j01J92J5q2j8J09m3k7n6j8J16J06j71L0j52J25mJ74k22J95j93j4n
268h1J11J04j03m1L9K4L8q2o9n9j2J82k7M4l3J0r3J46k23J38k3J9MJ5n4OK4J0K0m9lJ55r5
-20D2J11j94K4m7P9L4k9j12m2J45O0L9m3n9J05j48N2ol0JK2l9NK
$$ y = [51, 125, 124, 3, 5, -47, 66, -24, 10, 165, 31, 2, 8, 13, -7, -32, -37, 57, 17, -14, 31, -60, 47, 88, -62, 30, 77, -45, -37, -22, -19, -50, 74, 120, 37, 11, 134, 119, -162, -104, -66, -23, -51, -27, -59, 127, -64, -57, 18, 97, 84, 16, -63, -41, 205, 77, -114, -6, -68, -116, -39, 21, 34, 80, -156, 74, -21, -69, 156, 613, 1389, 1494, 1163, -70, 4, -1, -20, -55, -40, 96, 10, 20, 93, 4, 25, -48, -13, -119, -8, -93, -74, 36, 0, 27, -19, 26, 53, 6, -55, -109, 66, 17, 86, 33, -6, -18, -24, 18, -38, -67, 27, -38, -36, -13, 170, 128, -66, 70, -12, -33, 69, 18, -63, -72, -89, -26, 34, 25, 25, 13, 26, -65, -97, 30, 16, -62, 47, 21, -54, -59, 95, 115, 54, 6, 24, 91, -38, 85, 15, -65, 57, 185, 73, 19, -44, -89, 1, 22, 46, 30, 99, -34, -59, 62, 87, -10, 40, -17, 51, 80, -37, -138, 54, 69, -13, -31, 78, 35, 8, -48, -66, 50, 156, -15, 15, -137, -12, -16, 158, -64, 131, -62, -76, -81, 30, 134, 31, -10, 29, 53, 91, 9, -60, -119, -131, 51, 24, 68, 35, 45, -48, 98, -125, 13, -10, 9, 13, 28, -26, -20, 4, 14, 34, -15, -18, 137, 42, 153, -41, -17, -64, 15, 49, 20, -92, -134, 11, 71, 110, 67, 8, 113, -35, 17, 11, -19, -18, 4, -35, -30, -28]
-230b8
##PAGE=	F1=-13556.9
##FIRST=	23146.756194512010552,	4241.1435120000014649,	0
##DATA TABLE=	(F2++(Y..Y)), PROFILE
4241A2OL7J5m7m7J28m1k17J65o0k8J39j10J2j4J35L0q1Rj44J2L3P8R3j44L0k4l5O9J6r3jN3
3952a4KJ0lO8o3M2j31N0K8l6J4j1l2J67m3L3J00j56N8j09J25k81R0K23m4j16j8k7P0KK6m7
3672b3j7K0J3Q0j08n2J14K8j5j4j19K06n8j54O9q4P1jN2o0l1l7N6P8j22J98Lq1K7j3N1p7N5
3384E5qM6k3j6n8J01j73J15N8j43L6Rj39Q4J46K0p5j43l5K1K07j03J07j06J11p8j45K15M2
3130A28K4l2j39Q8r2p3L2KL0J22p6K3M0n0O2k09J39n9j20J24J32j00O5k7n0J30l64J49J34
2876C3k15n2L33k7n5j14R3o4J12j20q3J52J23o6Kj8j16Q8j5N2j01ol4R4l5J75j70o8Jl5P9
2605e7L0k00J51K9M7P3m9k19K80n9p3Q1L3n4q1K1J64L1j20o1q8J84q3r3J83j32j38K5N0J05
2342b0N5n2k8j3M2L0O0j89Q6K7N8r0M8J55j72Q6k9r9j34J88j2l3l9K8J03r7K8J2j6J3J2n4
$$ y = [12, 18, 55, 70, 23, -24, 104, 63, -154, 11, -49, -77, 62, -48, -36, -50, 85, 115, 34, 43, -101, -89, -56, 22, 115, -29, 1, -23, -58, 11, 27, -66, -67, -14, -12, -2, -5, 63, 0, 42, -89, -39, -11, -47, -33, -44, -76, 91, 48, 81, 181, 25, 83, -26, 99, -182, -92, 131, 87, -29, -47, -74, -4, -2, 24, -23, -40, -20, -7, 73, -35, -87, 27, 55, 40, 26, -93, 113, 55, -99, -30, -114, -43, -44, 8, -52, -83, -120, -64, 14, -108, 90, 93, 12, 39, 26, 77, 0, 55, 47, 93, 70, 54, -4, 97, -76, 39, 97, -46, -10, -1, -140, -56, 90, 110, 35, -108, -143, -122, 85, -18, 89, -17, 94, 16, -129, 86, 128, 152, 120, -19, 69, -23, -96, -64, -62, -32, 90, 14, 37, 77, 27, 89, -120, 19, -40, -160, -36, 96, -4, 61, 34, -16, 114, -250, -101, 33, -182, -234, 99, 72, 17, -97, -4, -68, 44, -76, -159, -7, 116, 50, 52, 34, -82, 6, -9, 43, -58, -64, -98, -4, -39, 136, -34, -102, -101, -136, -57, -27, -227, -76, -47, 0, 73, 24, -195, 85, 26, -47, 34, 67, 13, -68, -47, 117, 148, 28, -33, -121, 63, -20, -113, 70, -62, -200, -175, -125, -20, 35, -17, -45, -58, -16, 14, 74, -115, -29, -2, 56, -34, 14, 169, -3, 83, 54, -45, -179, 9, -3, -36, -75, -47, 56, -41, -13, -1, -17, -4, 8, -46]
2062d6P5k7qj8l1L7p7l4J51j62J54K7K4L6q3Ko0J16j34M9J20q9p5O4M6q4J4J8N4J5n9K0j18
1773h3J03M8j44O8P3p4m3k6Q7j6P5P5j16N5R5l6k92L5L7M4k8K5m4J92j45l2Q5R7o2J5r9kJ41
1485A08j5j75N3o8kO9NJ9J7j36J50q9PK27K47N76N50m94j060j9K2k4JN7N7k0nKo1J7k7K8j24
1196a07J00j12N1O8J1J6o8QN1Kj01m8J90k1J12j14o5m2RO9p1o7J31lk0l2J79L8j64O8q1qJ21
907A00o0q2k9k2L3Q7j1J6Jj0o8o3J77j1o7P1l9j04L4J10R0j41l5L9R0j79J61o9p8J05J23j09
627F0m2o8n9J46K1J1k0M6j07j09J20N5m2N4j10Q0J2r7k8Q1O7p8m8J14j6j2n5o1J63J0j28M2
347Bj49J70l9J30j68J59j66o2MR4J19q8j7K1K5jl4m2o7n1J92j4J0N1n3p4J38j79J27p4K6m
67a4J2k7M1M1q7O6l9K4R8p8J05k29P5o8Q8N1n1j57J5J41k8J13l6n8P4l8rQl9k0J3n5M7L9
$$ y = [-46, 29, 2, -6, -24, -55, -18, -95, -129, 22, -140, 14, 41, 65, 101, 18, 20, -40, 76, -58, -9, 111, 22, -53, 11, 57, -27, -13, 5, 59, 74, 15, 35, -83, 20, 68, -76, -8, 65, -9, -52, -78, 9, -7, 68, 143, 27, 82, 177, 141, -151, -116, -79, -35, -63, -38, -82, 110, -35, -67, 18, 115, 53, 68, -31, -33, 108, 93, -82, -29, -97, -99, -30, -25, -6, 11, -125, 25, -64, -57, 170, 417, 993, 1543, 1049, -11, -30, -8, -32, -31, 26, 83, 63, 58, 60, -1, 16, -11, 17, -107, -7, -119, -68, 0, 11, 27, -41, -33, 18, 20, -81, -129, 61, 40, 152, 38, -27, -69, -60, 9, -62, -129, 2, -1, -21, -53, 126, 164, 0, 68, -13, -21, 100, 40, -42, -71, -93, -60, 27, 16, 32, 33, 23, -45, -108, 69, 58, -9, 62, 23, -81, -47, 63, 153, 12, -23, 16, 106, -73, 88, 19, -59, 46, 169, 60, 18, -50, -109, 37, 58, 69, 49, 95, -12, -121, -1, 54, 12, 66, -44, 36, 48, -49, -77, 4, 71, -7, -55, 59, 43, 31, -24, -85, 78, 88, -40, 2, -147, 23, -16, 114, -54, 105, -61, -123, -119, -25, 94, 6, -11, 10, 35, 34, 0, -42, -109, -160, 32, 18, 28, 79, 26, -48, 90, -89, 38, -36, -10, -14, -2, -29, 12, 53, -34, 32, -7, 17, 115, 37, 142, -87, -12, -80, 8, 59, 8, -149, -134, 7, -21, 92, 56, -2, 72, 34, 25, 33, -6, -26, -13, -68, -21, 18]
-230A8
##PAGE=	F1=-13651.3
##FIRST=	23146.756194512010552,	4241.1435120000014649,	0
##DATA TABLE=	(F2++(Y..Y)), PROFILE
4241a3M7KM3k4j00J37lj94Q2m2j2J52j12oKP6j9n3N6j13m4L2J76L9j34N4l8l4N7j4q5rJ16
3952B2m0J6J9Qk4J9p9M5nl9P4m4l8J67p1Q2P0j68O5o1P2k69M3K19qj22l8N8J1J2J8n7K7K2
3655FQP4r9j07J19O7q0L5j42K29o4j07Q8j48L8KJ04o0k7n7P7N9j46J72P2j23Q6n7L7l2L7L0
3375I1m6lN7j78J00q1O9Q5j19J0J9j13M4J47k7k9j47o9R6K08j44J58j30J03p1j25J71Q0Ll4
3112A25j41P5q7m6mjO5J99j65k8N7o2L8p9J00p7j26J19J33o9jm1j0J10l37J96R0j93l5K88
2850I3q9j7r4J04o2R2q6j02J02J61l0l2j1j19J77q7nJ4l2j05R8PJ71j63k9k1q9J55m4j76J25
2579i4M7R9K6m4k27K74k7j01P0R1l2j29J6J01P3r4r1j15K08j17n6J75m4k14K8L6J57L9n7o0
2316f2KJ9L3P7k19J00j2J14m5R9Q3k29J37p0j39n7K17l8o6rM1R7j10N2m0M4j5K1o8J01j1r3
$$ y = [-13, 34, 36, 79, 55, -45, 92, 89, -105, -23, -65, -77, 75, -37, -43, -41, 35, 16, -37, 19, -94, -138, -106, 70, 109, -25, 29, -9, -43, 14, 0, -85, -94, 22, -18, -2, 17, 25, 1, 20, -59, -14, -19, -58, 16, -28, -66, 101, 30, 112, 182, 14, 79, 18, 90, -179, -136, 83, 75, -47, -85, -27, -16, -4, 14, -43, -16, 6, 14, 88, -11, -118, 1, 68, -12, 23, -119, 110, 46, -61, 27, -121, -83, -81, 23, -37, -64, -121, -44, 15, -131, 41, 113, -10, 76, 19, 56, 24, 61, 91, 45, 42, 99, -79, 21, -60, 9, 94, -25, -15, 4, -109, -65, 82, 55, 26, -121, -190, -94, 114, -30, 128, -2, 101, 30, -95, 76, 156, 159, 125, -16, 59, -28, -74, -78, -79, -14, 185, 20, -8, 49, -13, 25, -54, 46, -31, -157, -38, 95, 26, 25, -16, -26, 84, -253, -57, 33, -160, -195, 93, 4, -13, -107, -3, -65, 27, -59, -161, -59, 102, 72, 40, 29, -90, 87, 0, -5, 9, -23, -128, -30, -23, 148, -15, -44, -65, -154, 1, -43, -219, -94, -47, 52, 78, 34, -193, 81, 54, -47, 23, 114, 82, -47, -31, 70, 143, 49, -42, -157, 51, -66, -122, 53, 9, -205, -177, -141, 16, 55, -2, -62, -60, -41, -8, 69, -150, -50, -62, 52, 7, 106, 189, -40, 97, 27, -112, -169, 48, 10, -56, -65, -24, 73, -37, 15, -25, 19, 4, 25, -43, 58, 47, -46]
2036d6j6J5Lk2mR1j19R2J8j1O9k0j2o1J05j50K2R2m6j11J41O1j19M1L9K3K8n8J3j46P8M9j42
1747a03M3J13k7o6p4J32L7K6P9j48J26L7m9k74J8N0M9m4L1m6J45n5o3Q5Q1r4Q7j07k6O4Q6
1476A13j54J6p5L6P4p1K9k3n1O3m9K5K24L9K99P29n23o60r7L8k7K2R8j2N8k7o1n0L8MK4j22
1196g3Q4j19N6JN8J5n9m3O6K1r7k6J72k4J39j20r5o1M3N4p0r4J47P2m7q1J57J01j15j1p1K3
916CJ01n3o4oq0J5R9oM2Nk3o2q8K08j3l6J7m2j09O1N8J35k11J2O0R2j92J57m9p2P2J10j02
$$ y = [-46, -62, -47, -44, -66, -70, 21, -98, -6, 12, 1, 70, 50, 38, -23, 82, -68, -46, 46, 0, -111, 30, 91, -28, 13, 52, 75, 103, 45, 58, -88, -10, 39, -103, -60, 53, 26, -40, -114, 18, 55, 81, 160, 12, 138, 175, 126, -148, -130, -80, -31, -75, -44, -90, 55, 0, -63, 22, 103, 9, 96, -11, -37, 27, 113, -41, -25, -100, -64, 10, -61, -32, -55, -106, -43, -92, -67, 157, 196, 495, 1224, 701, 41, -56, -18, -45, -23, 75, 63, 121, 94, 33, -17, 21, 25, 49, -73, 11, -108, -52, -51, 7, 22, -37, -80, -14, 7, -90, -116, 56, 32, 171, 51, -44, -105, -62, -8, -78, -172, -25, 47, 0, -81, 76, 177, 62, 51, -20, 3, 104, 51, -13, -19, -99, -84, 15, 9, 51, 56, 33, -29, -117, 91, 78, 42, 59, 17, -92, -31, 27, 162, -49, -37, 23, 115, -77, 80, 31, -41, 31, 141, 39]
$$ [...]
-230I
##END NTUPLES=	nD NMR SPECTRUM
##END=	
##END=	
