##TITLE=	Feb18-2022.32.fid
TM-VI-259, rpt2 13C

##JCAMP-DX=	6.0	$$ MestReNova 14.3.0-30573
##DATA TYPE=	LINK
##BLOCK_ID=	1
##BLOCKS=	2    
##ORIGIN=	Mestrelab Research S.L.
##OWNER=	hrzepa
##$MNOVA/LINK_BLOCK_TYPE=	ITEM	$$ NMR Spectrum
##$MNOVA/ITEM/POLYGON=	(XY..XY)
5321,5835
8722,5835
8722,8208
5321,8208
5321,5835
##$MNOVA/ITEM/Z=	0
##$MNOVA/ITEM/ANGLE=	0
##TITLE=	Feb18-2022.32.fid
##JCAMP-DX=	6.0	$$ MestReNova 14.3.0-30573
##BLOCK_ID=	2
##DATA TYPE=	MNOVA NMR VIEW DATA
##DATA CLASS=	MNOVA VIEW DATA
##$MNOVA/ITEM/ZOOM/X=	-20.698776542268014111,	240.66949999422217843
##$MNOVA/ITEM/ZOOM/Y=	-850.69693374633789063,	9171.9171142578125
##END=	
##TITLE=	Feb18-2022.32.fid
##JCAMP-DX=	6.0	$$ MestReNova 14.3.0-30573
##BLOCK_ID=	3
##DATA TYPE=	NMR SPECTRUM
##DATA CLASS=	XYDATA
##NUMDIM=	1
##ORIGIN=	Bruker BioSpin GmbH
##OWNER=	nmr
##.OBSERVE FREQUENCY=	100.69424847706599735
##.OBSERVE NUCLEUS=	^13C
##.SOLVENT NAME=	Acetone
##.PULSE SEQUENCE=	zgpg30
##LONGDATE=	2022/02/18 23:01:00.000
##.ACQUISITIONMODE=	SIMULTANEOUS (DQD)
##$ORIGINAL FORMAT=	Bruker XWIN-NMR
##$MNOVA/SCALES_VERSION=	9
##$PARAMETER FILE=	(acqus, ASCII, /private/var/folders/f6/rjf_tdyn2v98c5c0wvkgn4s80000gn/T/b0Q2J+Z1TPKHkMh0XyHULw/32/acqus, 0)
$$ ##TITLE= Parameter file, TOPSPIN		Version 3.2
$$ ##JCAMPDX= 5.0
$$ ##DATATYPE= Parameter Values
$$ ##NPOINTS= 11	$$ modification sequence number
$$ ##ORIGIN= Bruker BioSpin GmbH
$$ ##OWNER= nmr
$$ $$ 2022-02-18 23:01:23.640 +0000  nmr@CZC10666PP
$$ $$ /opt/topspin/data/agmb/nmr/Feb18-2022/32/acqus
$$ $$ process /opt/topspin3.2/prog/mod/shimcntl
$$ ##$ACQT0= -2.01680680282977
$$ ##$AMP= (0..31)
$$ 100 100 100 100 100 100 100 100 100 100 100 100 100 100 100 100 100 100
$$ 100 100 100 100 100 100 100 100 100 100 100 100 100 100
$$ ##$AMPCOIL= (0..19)
$$ 0 0 0 0 0 0 0 0 0 0 0 0 0 0 0 0 0 0 0 0
$$ ##$ANAVPT= -1
$$ ##$AQSEQ= 0
$$ ##$AQ_mod= 3
$$ ##$AUNM= <au_zgonly>
$$ ##$AUTOPOS= <3 >
$$ ##$BF1= 100.683175
$$ ##$BF2= 400.41
$$ ##$BF3= 100.683175
$$ ##$BF4= 100.683175
$$ ##$BF5= 100.683175
$$ ##$BF6= 100.683175
$$ ##$BF7= 100.683175
$$ ##$BF8= 100.683175
$$ ##$BYTORDA= 0
$$ ##$CAGPARS= (0..11)
$$ 0 0 0 0 0 0 0 0 0 0 0 0
$$ ##$CFDGTYP= 0
$$ ##$CFRGTYP= 9
$$ ##$CHEMSTR= <none>
$$ ##$CNST= (0..63)
$$ 1 1 145 1 1 1 1 1 1 1 1 1 1 1 1 1 1 1 1 1 1 1 1 1 1 1 1 1 1 1 1 1 1 1 1
$$ 1 1 1 1 1 1 1 1 1 1 1 1 1 1 1 1 1 1 1 1 1 1 1 1 1 1 1 1 1
$$ ##$CPDPRG= (0..8)
$$ <waltz16> <> <waltz16> <> <mlev> <mlev> <mlev> <mlev> <mlev>
$$ ##$D= (0..63)
$$ 0 1 0.00345 0 0 0 0 0 0 0.06 0 0.03 2e-05 3e-06 0 0 0.0002 0 0 0 0 0 0
$$ 0 0 0 0 0 0 0 0 0 0 0 0 0 0 0 0 0 0 0 0 0 0 0 0 0 0 0 0 0 0 0 0 0 0 0 0
$$ 0 0 0 0 0
$$ ##$DATE= 1645225282
$$ ##$DE= 6.5
$$ ##$DECBNUC= <off>
$$ ##$DECIM= 760
$$ ##$DECNUC= <off>
$$ ##$DECSTAT= 4
$$ ##$DIGMOD= 1
$$ ##$DIGTYP= 12
$$ ##$DQDMODE= 0
$$ ##$DR= 21
$$ ##$DS= 4
$$ ##$DSPFIRM= 0
$$ ##$DSPFVS= 20
$$ ##$DTYPA= 0
$$ ##$EXP= <c13>
$$ ##$F1LIST= <111111111111111>
$$ ##$F2LIST= <222222222222222>
$$ ##$F3LIST= <333333333333333>
$$ ##$FCUCHAN= (0..9)
$$ [...]
$$ 90 74 58 42 26 10 0 0
$$ ##$Sgu3PowerLevels= (0..7)
$$ 0 0 0 0 0 0 0 0
$$ ##$Sgu4PowerLevels= (0..7)
$$ 0 0 0 0 0 0 0 0
$$ ##$Sgu5PowerLevels= (0..7)
$$ 0 0 0 0 0 0 0 0
$$ ##$Sgu6PowerLevels= (0..7)
$$ 0 0 0 0 0 0 0 0
$$ ##$Sgu7PowerLevels= (0..7)
$$ 0 0 0 0 0 0 0 0
$$ ##$Sgu8PowerLevels= (0..7)
$$ 0 0 0 0 0 0 0 0
$$ ##$SguType= 3
$$ ##$ShimPowMaxUA= (0..63)
$$ 130000 130000 130000 130000 130000 130000 130000 130000 130000 130000 130000
$$ 130000 130000 130000 130000 130000 130000 130000 130000 130000 0 0 0 0
$$ 0 0 0 0 0 0 0 0 0 0 0 0 0 0 0 0 0 0 0 0 0 0 0 0 0 0 0 0 0 0 0 0 0 0 0 0
$$ 0 0 0 0
$$ ##$ShimPowMaxUC= (0..63)
$$ 130000 130000 130000 130000 130000 130000 130000 130000 130000 130000 130000
$$ 130000 130000 130000 130000 130000 130000 130000 130000 130000 0 0 0 0
$$ 0 0 0 0 0 0 0 0 0 0 0 0 0 0 0 0 0 0 0 0 0 0 0 0 0 0 0 0 0 0 0 0 0 0 0 0
$$ 0 0 0 0
$$ ##$ShimPowMaxUG= (0..63)
$$ 524287 524287 524287 524287 524287 524287 524287 524287 524287 524287 524287
$$ 524287 524287 524287 524287 524287 524287 524287 524287 524287 0 0 0 0
$$ 0 0 0 0 0 0 0 0 0 0 0 0 0 0 0 0 0 0 0 0 0 0 0 0 0 0 0 0 0 0 0 0 0 0 0 0
$$ 0 0 0 0
$$ ##$ShimPowRcbType= 3
$$ ##$ShimPowRes= (0..63)
$$ 1e-20 1e-20 1e-20 1e-20 1e-20 1e-20 1e-20 1e-20 1e-20 1e-20 1e-20 1e-20
$$ 1e-20 1e-20 1e-20 1e-20 1e-20 1e-20 1e-20 1e-20 0 0 0 0 0 0 0 0 0 0 0 0
$$ 0 0 0 0 0 0 0 0 0 0 0 0 0 0 0 0 0 0 0 0 0 0 0 0 0 0 0 0 0 0 0 0
$$ ##$ShimPowRng0= (0..63)
$$ 1 1 1 1 1 1 1 1 1 1 1 1 1 1 1 1 1 1 1 1 0 0 0 0 0 0 0 0 0 0 0 0 0 0 0 0
$$ 0 0 0 0 0 0 0 0 0 0 0 0 0 0 0 0 0 0 0 0 0 0 0 0 0 0 0 0
$$ ##$ShimPowRng1= (0..63)
$$ 1 1 1 1 1 1 1 1 1 1 1 1 1 1 1 1 1 1 1 1 0 0 0 0 0 0 0 0 0 0 0 0 0 0 0 0
$$ 0 0 0 0 0 0 0 0 0 0 0 0 0 0 0 0 0 0 0 0 0 0 0 0 0 0 0 0
$$ ##$ShimPowRng2= (0..63)
$$ 1 1 1 1 1 1 1 1 1 1 1 1 1 1 1 1 1 1 1 1 0 0 0 0 0 0 0 0 0 0 0 0 0 0 0 0
$$ 0 0 0 0 0 0 0 0 0 0 0 0 0 0 0 0 0 0 0 0 0 0 0 0 0 0 0 0
$$ ##$ShimPowRng3= (0..63)
$$ 1 1 1 1 1 1 1 1 1 1 1 1 1 1 1 1 1 1 1 1 0 0 0 0 0 0 0 0 0 0 0 0 0 0 0 0
$$ 0 0 0 0 0 0 0 0 0 0 0 0 0 0 0 0 0 0 0 0 0 0 0 0 0 0 0 0
$$ ##$ShimSysFunc= (0..63)
$$ 1 2 3 4 5 7 9 11 15 16 8 10 12 14 6 17 13 18 19 20 0 0 0 0 0 0 0 0 0 0
$$ 0 0 0 0 0 0 0 0 0 0 0 0 0 0 0 0 0 0 0 0 0 0 0 0 0 0 0 0 0 0 0 0 0 0
$$ ##$ShimSysMatrix= 0
$$ ##$ShimSysType= 1
$$ ##$TFXNUM= 0
$$ ##$TRIPLO2= 0
$$ ##$VTU= 2
$$ ##$VTUETH= <149.236.99.20>
$$ ##$VTUTY= <no>
$$ ##$WBREFAM= (0..15)
$$ 135 116 100 100 100 100 100 100 100 100 100 100 100 100 100 100
$$ ##$WBREFLM= (0..15)
$$ 0 0 0 0 0 0 0 0 0 0 0 0 0 0 0 0
$$ ##$WBREFPH= (0..15)
$$ 71.66 -68.25 0 0 0 0 0 0 0 0 0 0 0 0 0 0
$$ ##$WBSGU= (0..15)
$$ 0 0 0 0 0 0 0 0 0 0 0 0 0 0 0 0
$$ ##$XFAC= 2
$$ ##END=
$$ 
##$DECIM=	760
##$DSPFVS=	20
##XUNITS=	HZ
##YUNITS=	ARBITRARY UNITS
##FIRSTX=	24231.369385662510467
##LASTX=	-2084.0185409410978536
##DELTAX=	-0.40154708059210514337
##XFACTOR=	1
##YFACTOR=	0.073843982597505117282
##FIRSTY=	11.231092453002929688
##MINY=	-16.886264801025390625
##MAXY=	8338.1064453125
##NPOINTS=	65536
##XYDATA=	(X++(Y..Y))
24231 152 164 180 196 202 192 171 149 136 131 131 134 137 135 124 108 93 87 93 107 124 142 161 180 196 205 207 203 196 191 192 200 209 214 213 213 219 230 240 241 232 214 198 189 185 181 175 171 173
24212 173 179 187 197 204 207 207 212 222 230 224 206 183 166 155 148 143 137 132 133 148 179 216 248 269 279 279 273 266 259 249 236 218 201 186 174 167 165 164 166 168 167 163 158 157 160 163 167 170 174 173
24192 173 164 152 142 135 128 119 109 94 77 67 70 84 103 124 149 175 195 204 202 198 197 201 206 206 201 194 194 200 209 217 222 227 229 226 220 212 203 192 175 153 130 110 98 95 100 108 117 125 129 131
24172 131 129 122 115 111 114 119 120 119 120 126 133 137 140 148 161 178 189 189 175 155 139 133 133 133 128 121 114 110 109 107 102 93 82 73 66 62 64 75 94 113 125 132 140 150 156 160 163 166 168 171 176 182 183 174 160
24150 160 141 118 93 77 83 111 148 178 194 196 188 173 154 131 107 90 82 81 81 78 73 70 68 67 65 60 57 59 65 69 68 67 75 97 129 162 190 212 226 231 228 223 217 212 204 191 178
24131 178 173 174 175 167 154 143 141 146 155 167 176 177 171 168 172 177 175 163 150 144 146 156 168 172 164 153 148 153 157 153 145 139 139 147 158 169 174 172 165 157 148 134 113 90 75 72 77 81 80 76 74 74 78 91
24109 91 114 139 156 166 178 194 205 202 187 168 153 146 148 153 155 156 161 172 185 194 200 207 214 213 206 201 201 205 208 208 203 189 169 150 137 128 120 115 118 132 155 177 187 182 171 165 166 168
24090 168 170 175 183 189 190 188 186 178 164 152 152 160 167 164 155 146 139 131 122 113 108 113 128 144 149 140 123 105 91 88 99 120 137 142 135 121 101 79 63 59 65 71 73 72 69 60 47 36 33 35 38 40
24069 40 40 36 29 28 41 66 93 107 109 106 106 107 106 105 107 116 127 135 138 138 138 143 153 166 174 175 170 166 165 162 156 153 155 160 162 163 166 175 187 195 197 189 172 153 142 139 141 142 146 159 177 187 184 168
24047 168 143 118 101 96 97 93 81 70 68 72 75 76 78 83 89 92 96 104 113 121 122 114 104 98 104 119 134 140 137 131 122 116 113 116 124 130 134 136 138 136 124 99 68 43 30 26 22 13 -3 -25 -44 -50
24027 -50 -36 -10 10 17 12 4 -3 -11 -19 -25 -27 -28 -33 -44 -53 -53 -41 -20 2 21 37 48 54 53 46 38 35 41 54 73 93 112 128 138 140 133 118 97 77 61 50 42 30 13 -2
24009 -2 -6 5 30 60 88 108 116 110 95 79 63 45 28 18 22 33 42 41 36 33 34 38 48 66 90 110 126 137 144 143 135 125 119 117 116 117 124 139 154 159 151 140 131 125 114 99
23990 99 87 89 102 115 119 115 105 91 74 57 44 34 24 20 25 38 50 58 67 87 121 163 200 226 241 248 249 238 216 188 160 138 124 117 118 118 113 102 91 80 68
23974 68 58 59 73 94 108 111 104 93 80 72 68 63 51 32 16 5 -4 -21 -44 -66 -78 -75 -55 -20 18 45 51 40 28 25 27 24 16 12 16 23 25 24 19 10 -5 -18 -19 -10 0 8
23955 8 18 30 35 24 3 -10 -9 1 8 0 -17 -36 -48 -48 -38 -24 -7 9 28 52 79 108 134 154 163 157 139 116 98 86 76 65 55 50 53 63 77 91 95 89 78
23939 78 68 68 78 96 112 117 111 104 102 100 95 91 95 111 132 149 160 165 171 179 187 182 151 94 26 -30 -65 -76 -69 -53 -42 -42 -50 -53 -41 -15 13 37 54 67 80 93 106 116
23921 116 124 135 154 180 204 216 214 201 183 163 141 123 110 97 76 45 9 -19 -36 -36 -26 -13 -4 0 7 27 55 81 102 121 139 156 166 167 159 144 124 100
23906 100 76 51 25 0 -16 -16 4 38 70 91 101 103 102 98 93 87 80 68 55 43 36 31 23 9 -8 -26 -38 -41 -38 -31 -24 -18 -16 -17 -19 -20 -17 -10 2 19 37 53 70 93 123
23888 123 152 169 166 148 124 102 82 68 63 69 83 97 105 106 98 84 71 67 72 78 82 81 69 44 9 -23 -44 -56 -63 -63 -52 -29 0 32 63 84 89 87 91 108 130 140
23871 140 131 105 68 31 5 2 18 45 74 100 117 119 104 83 68 60 50 30 4 -21 -40 -49 -44 -27 -6 9 18 25 30 29 18 1 -10 -9 1 16 32 43 50 55 62
23854 62 72 88 109 134 158 171 165 141 110 89 91 113 139 150 144 130 119 111 101 86 69 56 51 54 64 81 105 135 163 184 197 208 222 238 248 245 229 205
23839 205 180 158 137 119 108 107 110 108 94 67 26 -22 -66 -95 -104 -102 -100 -97 -87 -69 -46 -22 -3 6 8 5 4 4 7 17 36 64 98 132 162 180 179 161 137 118 107
23823 107 99 88 71 54 45 48 55 58 52 42 34 30 30 37 47 55 56 48 35 21 2 -26 -65 -103 -131 -145 -147 -142 -132 -115 -90 -60 -29 -7 4 13 25 41 52 53 45 31 13
23805 13 -8 -31 -51 -61 -58 -48 -40 -37 -36 -26 -3 23 40 46 49 60 79 99 109 105 92 79 72 72 72 70 65 55 42 30 22 14 0 -19 -33 -31 -9 25 61 87 98 94 83
23788 83 70 57 50 54 67 78 76 61 42 27 12 -5 -21 -27 -19 -1 19 35 48 58 62 54 37 22 22 34 54 74 92 105 110 107 100 90 73 50 27 10 1 0 5 19
23771 19 32 35 25 12 6 10 23 37 53 71 89 97 90 71 54 45 41 33 16 -2 -16 -22 -21 -16 -7 10 35 56 69 73 76 81 84 80 72 69 83 112 151 186 206 203 179 143 110
23753 110 87 69 52 39 35 35 33 25 17 16 23 30 36 39 38 35 34 37 41 35 20 5 -2 -6 -13 -26 -40 -49 -52 -50 -46 -45 -47 -52 -56 -59 -63 -70 -79 -88 -96 -97 -91 -80 -68 -58 -46 -28 -6 15 33 56
23732 56 89 126 150 148 128 101 76 51 31 24 32 48 60 68 76 92 114 135 146 142 129 113 98 84 69 57 47 38 28 22 15 0 -26 -56 -79 -90 -91 -88 -80 -68 -55
23716 -55 -42 -26 -6 16 40 62 77 82 76 65 57 58 65 72 68 51 32 21 22 34 50 68 83 93 99 107 117 121 112 92 72 61 60 64 70 72 71 72 80 90 94 89 81 78 81 80 69
23697 69 47 24 7 4 14 34 57 77 90 94 91 86 82 79 77 75 75 83 94 102 98 84 69 60 61 73 91 106 111 108 106 108 111 114 115 111 94 66 39 24 24 31 36 32 17 -3 -20 -30
23678 -30 -34 -39 -39 -28 -4 22 45 59 64 57 45 36 40 53 66 69 63 56 56 64 80 97 106 104 91 75 65 62 61 51 30 2 -23 -39 -42 -35 -17 5 28 38 29 2 -27 -48
23660 -48 -53 -47 -34 -12 21 66 110 141 152 150 144 138 129 116 102 94 99 118 147 181 210 221 207 171 126 82 44 14 -10 -26 -32 -30 -27 -30 -44 -69 -99 -127 -142 -141 -129
23644 -129 -109 -86 -62 -42 -31 -30 -32 -32 -22 -5 15 34 49 64 84 108 132 151 161 159 144 117 89 74 77 89 98 93 77 57 39 27 25 33 47 60 68 69 67 65 63
23627 63 67 85 119 156 180 186 184 182 181 180 181 181 173 154 134 125 129 135 134 127 120 116 114 114 114 106 89 72 70 82 98 109 113 116 115 108 98 92 92 95 100 106 115 120 115 98 79 70 73 77 72 54 30
23606 30 9 -10 -33 -56 -67 -64 -56 -53 -53 -52 -45 -33 -19 -5 5 10 10 8 5 4 4 6 9 9 6 3 2 -3 -16 -33 -45 -51 -55 -62 -73 -86 -101 -115 -126 -132 -128 -112 -83 -46 0 54 115
23587 115 161 177 165 146 140 147 159 170 181 189 191 188 188 194 195 182 153 115 76 44 23 16 22 37 60 86 111 129 138 133 119 101 87 79 76 81 98 122 140 140 121 96
23570 96 74 59 48 44 45 49 53 50 39 22 6 -4 -7 -6 0 7 11 8 4 5 14 22 24 22 21 27 40 55 68 72 69 67 69 74 75 73 68 63 60 61 69 87 109 125 126 115 101 91 86 79 67 55
23549 55 49 50 55 59 58 48 30 8 -8 -18 -26 -37 -49 -50 -32 0 32 52 56 54 52 51 48 43 35 29 28 35 40 34 16 -2 -7 3 21 37 50 62 72 79 81 76 68 65 72 84 89 81 66
23529 66 55 54 63 79 95 109 114 108 87 54 19 -10 -32 -49 -62 -68 -58 -38 -17 0 12 23 28 20 0 -22 -41 -54 -63 -72 -78 -78 -71 -58 -45 -35 -36 -45 -52 -43 -18 7 19
23512 19 12 1 -1 6 18 23 20 14 14 19 27 33 39 44 46 42 36 32 31 28 21 15 19 35 58 77 83 73 57 48 53 67 81 89 94 100 109 118 125 137 156 178 189 180 155 130 112 99 87 75
23492 75 65 57 51 44 40 48 70 102 134 154 164 170 174 171 157 131 103 78 58 40 22 6 0 9 29 52 70 81 81 72 57 48 45 43 36 27 25 32 40 42 39 35 29 20 10 5 7 16 30
23472 30 43 52 56 57 55 45 30 16 12 17 29 48 75 105 129 139 137 126 111 94 75 55 37 28 34 53 76 94 103 104 98 90 85 83 74 52 24 12 26 63 108 147 175
23455 175 192 200 203 199 185 162 138 117 93 65 42 33 43 63 84 103 118 126 127 122 111 95 76 61 49 39 31 35 56 84 102 103 88 63 30 -6 -35 -49 -49 -45
23439 -45 -41 -35 -26 -19 -23 -41 -65 -78 -75 -62 -48 -38 -32 -35 -50 -71 -82 -78 -66 -57 -49 -36 -18 -3 1 2 4 5 2 -6 -17 -29 -42 -55 -60 -53 -37 -20 -13 -14 -14 -3 18 47 73 89
23421 89 92 86 78 73 66 49 22 -4 -17 -15 -3 6 13 18 26 36 47 56 60 55 41 23 7 -6 -21 -33 -32 -16 10 41 64 72 62 39 16 4 6 16 32 52 72 86 91
23403 91 89 86 85 84 81 81 90 112 144 179 202 210 204 188 165 136 108 86 67 47 24 7 2 5 8 2 -7 -12 -4 13 32 46 58 70 84 96 109 124 137 143 139 126 111 99
23386 99 90 85 83 86 95 106 108 100 92 98 115 129 130 122 113 99 79 55 38 31 33 38 44 45 39 28 21 22 32 45 59 71 79 84 88 95 102 104 98 88 82 83 91 98 101 97 89 80 69 54 38 25
23365 25 19 21 27 30 26 13 -1 -12 -14 -7 4 19 37 57 74 83 84 80 77 75 72 65 54 45 39 37 38 40 38 31 21 13 9 4 -5 -20 -34 -38 -33 -26 -23 -21 -18 -15 -15 -16 -13 -4 7 19 26 28 27 26 31
23343 31 41 51 59 65 69 70 67 62 59 63 73 85 95 105 115 118 105 76 42 18 11 16 26 30 20 -2 -21 -22 -1 23 39 48 60 78 100 121 138 143 131 110 94 92 101
23325 101 112 119 120 117 112 109 102 85 57 25 0 -13 -20 -22 -19 -13 -6 0 5 7 4 2 7 17 21 16 8 8 16 26 29 22 5 -14 -32 -45 -56 -68 -77 -80 -77 -76 -81 -88 -89 -84 -76 -69 -63 -58 -51 -41 -22
23304 -22 5 34 52 52 40 31 32 42 51 52 48 41 33 25 15 7 3 4 7 14 28 49 68 81 87 89 91 93 92 86 73 51 27 8 0 1 11 24 37 50 61 68 66 52 33 17 8
23285 8 3 -1 -4 -1 7 16 24 32 35 32 25 21 26 37 45 46 44 41 40 43 54 71 84 86 74 58 43 34 32 38 48 59 67 73 81 90 100 113 128 138 140 133 125 124 131 137 135 120 101 86 79 75 69 63
23264 63 55 45 29 13 7 16 38 60 77 88 94 95 93 92 95 97 91 72 47 25 10 4 6 13 18 13 -7 -39 -73 -98 -108 -103 -88 -73 -62 -59 -61 -66 -70 -72 -71 -67 -60 -50 -47 -56 -73 -85
23244 -85 -86 -83 -94 -122 -159 -195 -220 -228 -216 -190 -162 -136 -110 -82 -61 -52 -46 -32 -6 22 46 59 58 41 13 -12 -30 -38 -41 -36 -28 -22 -23 -27 -25 -9 16 46 72 91 103 107
23228 107 106 104 111 134 168 199 213 207 190 169 150 132 110 84 59 44 46 56 63 57 39 18 1 -7 -9 -6 0 9 19 23 24 30 51 81 106 116 112 105 97 89 78 63 48 38
23210 38 39 54 74 88 91 83 72 66 68 79 92 96 89 74 61 54 50 49 47 47 48 50 53 59 68 81 91 93 84 68 48 28 12 0 -8 -23 -50 -78 -93 -82 -51 -13 20 48 68
23192 68 79 80 73 60 41 21 5 0 0 6 16 34 57 75 82 82 84 92 98 97 92 93 102 115 129 142 151 154 148 137 125 111 93 73 58 49 45 46 54 67 78 81 80 81 86 88 79 60
23172 60 39 24 14 4 -10 -29 -49 -69 -86 -103 -118 -133 -145 -150 -143 -123 -92 -56 -24 -1 14 25 34 38 35 21 5 -8 -18 -25 -29 -23 -6 17 36 48 56 62 65 60 45
23156 45 24 6 -6 -13 -13 -8 -1 5 14 23 30 29 21 15 17 29 44 60 75 86 88 86 90 107 132 152 161 158 147 131 116 105 104 111 124 140 158 177 196 210 217 214 203 186 166
23138 166 148 135 131 136 148 166 182 192 195 197 200 202 195 179 158 136 117 107 110 124 135 133 119 99 81 73 76 89 104 121 140 160 175 179 174 169 169 167 156 132 95 48
23121 48 -1 -38 -55 -57 -49 -35 -17 -2 6 12 22 37 54 67 77 84 89 95 104 116 128 137 142 146 149 152 153 145 123 91 60 44 43 51 65 86 110 128 132 130 132 139 142 139 136 138 144 146
23102 146 134 107 69 32 3 -15 -26 -30 -27 -18 -5 5 12 12 5 -8 -29 -53 -72 -79 -71 -50 -25 -4 9 15 15 10 6 12 31 56 81 99 109 105 82 40 -9 -55 -87
23085 -87 -105 -112 -113 -112 -107 -94 -69 -37 -10 1 -4 -22 -39 -49 -52 -52 -49 -45 -44 -50 -61 -71 -78 -84 -89 -90 -84 -75 -73 -81 -91 -93 -83 -63 -37 -11 11 26 27 9 -22 -53 -72 -81 -86 -90 -88
23066 -88 -79 -70 -63 -54 -37 -21 -12 -10 -11 -14 -22 -32 -34 -20 2 27 44 49 38 11 -23 -56 -81 -92 -89 -78 -64 -51 -43 -39 -37 -32 -20 -2 16 31 44 53 57 53 40 18 -13 -49
23049 -49 -75 -83 -78 -67 -56 -45 -33 -15 10 45 77 96 95 82 69 67 80 103 122 126 118 107 98 89 79 71 72 80 89 91 83 66 41 13 -12 -30 -38 -33 -24 -19 -23 -32 -37 -36 -31 -22 -11
23030 -11 2 17 29 36 38 34 28 22 20 25 37 51 62 67 67 63 61 64 68 60 35 2 -23 -31 -29 -26 -24 -20 -6 21 60 99 124 131 128 121 113 103 94 85 73 58 41 26 15 4 -2 -5
23011 -5 -4 -6 -13 -22 -29 -32 -32 -29 -27 -29 -30 -20 0 21 31 32 33 42 56 74 95 114 126 128 125 130 145 161 166 158 143 125 102 76 47 20 -2 -14 -12 2 21 34 41 45 44 32 8
22992 8 -11 -16 -5 13 36 59 78 86 74 43 2 -32 -55 -68 -80 -89 -92 -87 -82 -83 -89 -93 -90 -80 -65 -42 -13 17 41 54 58 60 63 66 64 55 42 31 23 20 24 37 56 74 90
22974 90 104 121 138 151 159 161 155 140 121 106 100 98 90 72 52 35 23 11 -5 -23 -28 -11 24 61 80 77 61 43 28 12 2 5 24 49 72 91 108 120 121 106
22958 106 78 48 24 2 -23 -55 -79 -78 -54 -20 7 31 56 85 110 123 120 104 81 62 56 59 63 58 43 24 9 -1 -6 -5 -1 -1 -10 -23 -32 -29 -20 -13 -8 0 14 28 37
22940 37 41 44 48 53 61 68 68 57 44 39 43 49 49 45 39 34 28 22 13 3 -7 -18 -27 -34 -37 -29 -9 15 38 60 83 106 121 124 118 109 97 79 58 43 40 47 53 53 48 44 41 42 44 47 49 49 52
22919 52 65 85 101 103 88 62 41 34 40 50 56 59 64 67 62 44 18 -7 -26 -34 -26 -1 37 79 115 141 159 169 174 174 168 162 158 162 168 174 174 169 164 159 155 146 126 96 65 40 26
22900 26 21 24 35 53 72 85 90 89 86 79 66 44 18 -5 -21 -29 -24 -6 20 44 56 61 67 81 98 105 94 62 16 -31 -75 -112 -143 -164 -170 -163 -145 -116 -80 -41 -9
22884 -9 12 27 39 50 61 71 83 97 117 144 172 195 210 221 228 228 218 198 173 147 127 117 114 110 100 85 70 61 63 77 95 108 112 110 107 107 108 111 115 114 105 89 75
22867 75 68 67 71 73 66 43 10 -18 -31 -26 -13 -3 -5 -14 -19 -16 -11 -10 -12 -6 14 41 64 81 97 112 123 128 130 132 131 125 116 109 106 101 87 63 38 25 31 54 84 105 107 90 61
22848 61 30 6 -7 -11 -5 4 16 26 27 15 -9 -35 -48 -39 -15 10 28 39 46 53 61 73 91 109 113 93 58 24 9 15 38 69 96 105 88 48 2 -26 -30 -9 26
22831 26 63 97 121 130 124 107 90 75 60 39 18 3 -2 -4 -6 -3 9 31 59 85 103 109 105 98 96 98 102 108 113 109 92 66 43 31 26 22 18 15 13 10 5 0 -2 -4 -2 7 24 43
22812 43 59 71 80 85 83 72 55 36 18 4 0 6 27 53 72 74 55 20 -16 -41 -49 -42 -28 -11 12 38 57 56 37 12 -9 -32 -57 -72 -65 -36 1 35 62 84
22796 84 97 96 77 45 10 -19 -36 -44 -50 -58 -65 -63 -48 -21 6 31 51 70 86 94 90 75 59 51 52 58 69 84 97 97 81 57 40 32 29 27 30 41 56 61 54 43 39 40 42
22778 42 39 36 39 46 55 61 63 65 70 77 76 60 35 16 9 7 0 -12 -22 -29 -35 -37 -30 -9 19 48 71 82 79 69 60 55 50 43 32 16 -5 -30 -51 -62 -69 -75 -78 -73 -61 -49 -40 -32 -25 -17
22758 -17 -5 10 24 27 18 6 3 15 40 68 88 99 101 99 90 77 65 57 46 22 -15 -52 -73 -75 -71 -72 -80 -86 -78 -55 -21 19 62 98 119 126 128 130 132 134 139 147 150 141 120 94
22739 94 74 62 60 65 74 82 88 92 92 85 74 67 64 61 58 59 69 86 107 131 156 180 200 215 227 236 240 234 216 181 135 92 63 47 38 32 29 29 29 31 37 42 45 48 54 62 68 71 78 87 91
22719 91 85 73 58 42 27 20 23 34 51 68 83 88 82 74 71 77 83 83 75 60 47 42 46 53 57 54 47 39 37 47 69 96 118 136 156 171 169 143 98 49 6 -24 -47 -64 -75
22701 -75 -76 -61 -32 -1 16 19 12 7 7 9 10 12 22 41 60 71 73 71 69 69 73 80 89 98 105 106 95 72 47 31 26 20 11 5 8 17 26 34 47 68 93 117 129 125 108 93 89 94 99 100
22681 100 106 120 136 148 150 141 124 106 97 106 128 149 161 164 159 148 133 116 99 84 70 58 46 33 17 5 1 4 8 9 11 18 34 54 73 82 77 62 44 31 27 27 28
22663 28 27 24 19 17 20 26 31 37 44 56 71 89 107 116 102 65 23 3 12 36 58 70 77 81 79 70 61 60 72 92 115 137 154 163 161 151 135 111 73 24 -23 -53 -62 -59 -50 -37
22645 -37 -23 -12 -5 0 5 13 20 27 34 37 31 14 -5 -21 -29 -28 -22 -15 -11 -12 -13 -7 12 48 89 128 164 197 222 231 216 181 138 94 54 24 8 5 12 26 44 58 63 61 60 64 67
22626 67 60 41 18 2 3 22 51 78 94 105 119 139 153 148 121 83 51 32 21 10 -4 -20 -33 -42 -51 -59 -58 -41 -9 28 63 90 110 121 125 125 126 131 138 140 137 129
22609 129 117 101 80 59 39 24 13 7 3 3 1 -5 -17 -25 -20 2 35 68 95 116 129 129 120 108 96 80 54 25 5 2 13 29 40 49 62 81 97 101 89 65
22593 65 39 22 23 45 73 88 82 67 59 67 89 116 139 152 154 149 142 137 135 138 141 139 124 102 85 79 82 86 85 77 66 56 53 54 55 52 49 49 46 37 25 16 10 7 0 -17 -41 -62 -65 -45
22573 -45 -14 12 32 49 61 67 64 61 63 67 64 50 33 21 18 19 14 0 -14 -20 -16 -9 -4 3 17 38 57 63 54 38 24 21 26 37 49 61 68 68 64 63 64 60 49 36 28 28 35 46
22554 46 57 65 69 68 64 54 40 30 30 38 43 40 34 37 51 73 95 110 115 105 84 58 33 13 4 9 27 46 57 56 45 32 19 8 0 -6 -5 6 28 48 51 39 25 21
22536 21 24 29 36 49 63 69 67 63 64 68 68 61 44 21 -2 -17 -17 -4 10 16 8 -7 -22 -22 -5 23 54 79 97 110 120 132 149 168 180 181 170 153 131 110 96 91 97
22519 97 110 122 131 135 138 140 144 147 149 147 141 129 113 92 67 39 12 -14 -39 -58 -66 -60 -43 -24 -5 10 18 18 11 3 -3 -6 -1 16 41 63 71 68 62 56 50 42 36 32 29 27 27 29 32 33 28
22498 28 17 5 -1 0 3 6 9 17 32 49 63 73 75 70 62 61 70 83 90 87 71 46 15 -13 -37 -52 -61 -66 -70 -68 -54 -26 6 33 48 53 55 57 61 67 76 86 93 90 75 52 25
22479 25 0 -19 -35 -47 -53 -51 -48 -44 -36 -15 17 47 62 65 68 79 96 113 126 135 142 146 150 149 142 130 123 123 123 116 99 75 52 35 29 31 28 12 -12 -33 -43 -47 -48 -43 -28 -2
22461 -2 32 72 111 142 160 164 156 139 119 101 85 67 44 20 4 -5 -9 -2 22 63 103 126 129 117 96 72 51 39 35 38 47 62 80 95 100 91 73 57 48 43 36 27 22
22444 22 28 41 53 60 62 60 55 46 32 14 -1 -4 7 27 41 44 38 26 11 1 -1 2 3 0 -2 1 9 15 19 24 32 38 35 26 16 9 7 8 8 8 10 16 24 29 31 34 40 48 53 54 53 57 71 93 117
22422 117 134 144 151 156 159 156 149 141 135 132 132 135 132 115 86 59 46 47 56 69 85 97 99 88 71 55 42 37 45 64 84 91 81 62 43 32 32 43 57 68 77 95 126 164
22404 164 201 229 247 255 253 241 222 198 178 168 167 169 164 153 141 130 121 115 114 116 116 110 98 85 83 95 117 137 149 152 149 140 121 96 71 55 50 56 70 85 97 103 103 100
22386 100 97 96 97 101 112 132 156 175 181 175 157 129 94 60 34 13 -9 -39 -69 -91 -100 -97 -85 -63 -33 2 40 75 103 124 139 152 164 172 175 170 158 140 117 91
22370 91 67 50 43 43 45 39 26 9 -3 -12 -20 -28 -33 -29 -15 6 31 50 55 45 30 23 28 40 54 71 89 101 99 85 67 54 47 42 38 35 36 49 78 113 139 150 151 151 150
22352 150 143 128 107 86 70 61 58 61 69 87 112 134 147 155 161 166 167 166 167 166 154 136 123 121 118 100 70 42 29 33 48 67 82 90 94 101 118 136 143 135 117 99 87 83 88
22334 88 99 110 114 111 106 102 96 80 56 36 33 50 76 99 112 116 115 111 109 109 112 119 129 135 130 109 81 59 50 52 56 62 76 102 133 157 167 162 151 139 124 104 83 71 71
22316 71 84 99 111 116 117 113 106 101 102 113 136 163 184 194 190 177 157 130 98 68 45 31 25 24 29 42 63 88 107 113 110 105 105 106 102 91 76 67 67 75 89 103 113 116 117
22298 117 118 116 103 78 52 40 51 77 106 123 123 104 71 30 -6 -27 -25 -10 6 24 46 76 108 132 144 146 140 129 113 97 86 82 82 81 77 71 70 82 104 128
22282 128 142 143 137 135 144 162 180 190 192 191 185 169 144 123 114 119 129 138 145 151 155 156 154 147 137 129 129 139 156 179 200 214 217 213 206 195 176 148 119 93 69 45 28 26 37
22264 37 54 67 75 74 62 37 9 -9 -12 0 23 47 65 70 60 37 9 -14 -29 -35 -36 -36 -39 -40 -30 -9 14 26 23 11 -1 -16 -30 -36 -25 -3 18 28 26 16 7
22247 7 4 12 29 46 52 45 34 29 33 42 52 62 76 94 114 132 143 148 150 156 163 162 148 128 110 97 79 52 24 3 -6 -8 2 26 50 60 53 40 31 23 9 -9 -25 -34
22230 -34 -36 -35 -29 -19 -17 -31 -58 -83 -89 -72 -45 -22 -14 -23 -44 -67 -82 -85 -80 -73 -69 -63 -53 -38 -19 1 21 37 47 54 61 72 86 100 109 110 106 101 98 100 110 128 149 164 176
22212 176 191 215 242 264 277 279 268 248 226 207 188 162 134 112 97 87 83 87 97 107 111 112 112 109 105 98 88 73 56 46 48 55 57 52 45 39 36 33 33 38 52 75 99 111
22194 111 108 93 72 50 30 18 18 26 37 46 50 49 46 46 50 55 52 37 18 5 2 3 -3 -17 -26 -17 5 29 43 49 54 61 67 67 54 27 -2 -23 -27 -23 -23 -31 -38 -37 -24 -4 18 37
22175 37 46 39 19 -9 -40 -66 -84 -90 -85 -69 -46 -20 5 28 51 71 76 60 25 -15 -45 -59 -63 -66 -69 -69 -62 -53 -50 -56 -63 -59 -41 -14 9 22 20 1 -30 -64 -82 -74 -41
22157 -41 1 41 69 77 66 44 22 7 2 7 21 36 48 61 79 100 122 147 180 216 236 236 228 231 246 258 251 224 185 138 88 42 8 -7 -10 -8 -5 -1 7 26 53
22141 53 85 113 136 152 158 152 138 120 104 88 72 59 53 53 54 53 50 48 48 51 64 91 125 153 165 160 143 118 92 74 70 72 71 65 59 55 49 39 25 12 4 6 14 24 29 29
22122 29 31 36 41 43 39 29 15 5 1 1 -3 -15 -26 -28 -24 -27 -42 -64 -83 -98 -111 -117 -105 -70 -20 21 39 33 14 -1 -8 -4 9 28 46 62 83 112 142 156 150 133 123
22105 123 124 127 124 116 107 98 92 87 80 69 55 40 23 1 -24 -50 -63 -61 -46 -25 -1 23 43 53 50 41 33 26 22 21 30 49 73 93 107 116 122 122 118 119 131 156 184 204 210 199
22087 199 175 147 127 125 142 170 198 218 225 219 201 176 147 120 95 70 46 28 20 22 25 23 18 16 19 26 34 42 50 58 72 92 115 135 147 153 150 138 118 95 72 49 27
22069 27 13 16 31 50 61 59 44 25 11 5 -1 -15 -28 -29 -17 -4 2 2 2 8 21 40 58 70 77 87 104 121 129 131 130 128 120 108 100 100 103 98 86 73 62 50 35 25
22052 25 29 45 64 78 88 98 108 117 125 132 131 116 90 69 67 78 85 77 60 48 46 45 35 14 -8 -26 -35 -38 -34 -25 -15 -7 -2 -1 -6 -20 -39 -54 -55 -40 -16 9 25 26 17
22034 17 8 8 16 26 36 44 50 51 46 36 31 37 55 80 101 112 109 95 70 36 1 -20 -22 -4 26 63 97 117 114 99 86 84 87 86 80 72 60 39 13 -11 -31 -45 -50 -41
22016 -41 -20 0 12 15 16 15 10 3 2 14 38 66 86 90 76 56 47 52 66 77 75 61 38 17 6 8 19 32 40 37 24 9 0 1 8 17 26 35 47 66 92 118 135 145
21998 145 151 155 149 130 103 76 59 54 59 61 55 43 38 46 63 78 86 84 75 61 49 45 50 58 65 68 66 61 56 61 80 106 126 131 120 102 89 83 80 75 71 73 81 91 101 110 115 114 106 99 96
21978 96 91 76 54 39 41 54 69 80 86 91 98 109 127 146 157 157 152 150 150 150 144 136 128 122 119 122 129 133 123 98 66 38 22 16 14 14 16 20 23 23 18 12 11 18 31 48 62 73 83
21958 83 99 124 150 168 177 180 181 180 177 174 170 163 151 141 138 138 136 128 118 108 97 87 85 97 118 141 153 154 147 136 125 114 102 93 87 84 85 91 101 114 129 146 162 169 158
21940 158 136 114 102 100 109 127 150 169 179 184 185 178 155 121 92 74 68 70 80 95 105 107 105 101 93 74 53 45 55 77 97 110 115 116 118 118 111 90 60 33 18 16 22 28
21922 28 33 35 36 38 41 41 39 42 52 63 67 61 52 42 30 13 -6 -23 -32 -28 -13 6 30 56 76 79 62 38 24 24 28 26 10 -17 -45 -60 -54 -33 -14 -6 -5 -4 3 18 44 72
21904 72 92 98 92 83 75 66 57 49 41 37 39 47 56 59 57 57 62 75 92 108 119 122 123 120 107 75 31 -9 -40 -59 -65 -54 -31 -11 -4 -7 -8 -1 11 25 37 45 50 54 59 63 62 56 50 47 48 51
21883 51 55 57 57 58 61 69 81 95 107 119 128 132 128 114 93 70 51 40 39 45 52 58 66 77 88 88 77 61 55 68 91 109 112 102 83 60 31 -3 -37 -63 -77 -80 -77 -69 -62
21865 -62 -57 -52 -41 -24 -4 13 24 29 26 16 1 -13 -22 -25 -21 -13 -4 5 19 38 58 71 71 58 39 17 -3 -21 -30 -34 -38 -51 -71 -88 -95 -88 -65 -24 27 78 115 133 136
21848 136 129 121 115 113 113 115 122 133 139 132 112 90 74 67 61 55 51 48 47 43 34 26 28 42 58 60 42 12 -10 -17 -10 -2 -4 -13 -14 3 36 70 95 110 116 111 95 72 52 40 40 52 74
21828 74 98 117 124 118 108 100 96 90 82 74 69 66 64 62 59 50 30 6 -13 -30 -48 -64 -71 -65 -54 -45 -41 -42 -47 -50 -43 -22 0 11 12 7 0 -9 -16 -14 -4 6 17 35 58 78 88 91 96
21808 96 103 111 121 142 168 182 167 127 86 62 54 53 51 51 55 58 52 38 24 14 3 -11 -27 -40 -49 -57 -62 -56 -38 -11 16 43 70 96 113 112 94 71 52 42 40 41 42
21791 42 45 49 48 43 37 37 49 72 96 114 125 129 128 118 99 82 75 80 91 99 102 106 111 115 117 120 125 132 131 118 94 68 49 44 45 44 37 35 47 66 81 90 95 96 82 53 26 15 20
21771 20 22 11 -10 -32 -47 -55 -57 -54 -49 -40 -29 -16 -9 -11 -18 -24 -22 -7 18 47 71 86 97 114 139 166 179 169 137 93 50 16 -1 6 37 80 116 134 134 122 109
21755 109 101 102 105 105 110 130 167 204 222 214 189 156 124 95 71 50 34 25 22 18 11 3 0 0 -9 -26 -42 -48 -43 -30 -5 33 78 112 123 116 109 114 124 131 130 129 130 127 113 90
21737 90 66 47 35 27 24 28 38 47 51 54 64 83 100 107 106 101 95 81 55 24 -1 -15 -17 -12 -12 -23 -44 -66 -80 -86 -85 -80 -74 -71 -68 -58 -44 -35 -36 -39 -34 -23 -17 -17 -21 -28 -42 -63
21717 -63 -84 -98 -105 -108 -107 -102 -92 -81 -73 -70 -67 -57 -38 -20 -11 -11 -10 -7 -4 -6 -9 -10 -6 7 36 73 102 114 111 100 81 55 29 10 0 -6 -11 -19 -31 -38 -34 -16 11 44 82 118
21699 118 143 151 151 151 154 159 165 168 159 135 108 90 82 76 70 74 88 99 101 92 80 65 50 42 47 63 84 100 105 95 74 53 41 39 45 55 65 72 81 98 123 148 164 170 169 159
21680 159 142 123 110 108 116 130 140 141 132 122 121 128 133 132 126 117 106 99 102 112 121 119 108 95 84 78 74 68 55 34 15 5 7 17 32 53 78 96 97 78 44 8 -22 -47
21663 -47 -66 -77 -80 -78 -74 -66 -52 -32 -15 -9 -13 -16 -6 14 35 41 31 11 -6 -14 -11 0 16 26 24 10 -7 -21 -33 -42 -47 -39 -18 5 24 34 39 45 49 51 53 56 61 69 85 108
21644 108 130 143 143 132 119 110 106 111 125 147 169 179 174 158 139 122 108 100 98 98 92 78 61 54 61 77 93 100 94 77 52 25 7 3 10 17 17 12 7 7 16 31 45 51 54 63
21626 63 78 89 81 57 32 14 7 11 25 43 57 65 73 90 114 137 154 163 162 150 130 103 72 42 19 8 4 5 17 47 93 137 163 161 137 101 66 42 30 30
21610 30 38 51 67 83 95 104 109 110 108 99 85 66 45 29 20 18 23 29 29 22 13 4 -8 -26 -41 -42 -27 -5 13 28 35 31 13 -8 -21 -18 -1 22 48 69 82 89 97 113 140
21592 140 170 195 208 212 209 201 188 169 149 131 118 109 101 87 65 35 7 -11 -13 0 20 43 60 69 73 75 79 88 101 118 135 150 165 177 186 189 186 177 163 146 131 119
21575 119 110 104 101 103 108 114 119 122 117 104 91 89 96 100 92 77 61 50 43 38 36 37 41 53 73 100 129 156 182 204 217 219 216 215 214 211 205 202 203 204 199 186 165 141 117 95 75 52
21555 52 28 9 0 -4 -10 -19 -29 -36 -41 -44 -41 -32 -20 -11 -8 -10 -15 -19 -16 -1 20 41 50 46 32 20 16 14 4 -15 -33 -40 -39 -45 -68 -98 -115 -107 -75 -31 7 28 32 28 30 41 58 72
21536 72 83 91 98 102 103 108 121 137 145 140 128 116 108 100 93 89 85 82 82 90 102 111 112 112 118 125 124 114 102 99 107 121 138 150 156 156 154 150 137 115 89 69 58 50 39 25 15 15 23 30
21516 30 31 32 44 68 95 116 130 145 164 183 199 216 235 247 244 226 202 179 158 134 112 99 99 109 119 126 128 129 129 124 110 86 54 22 -3 -16 -12 1 18 29
21500 29 33 33 26 9 -11 -27 -24 -2 27 49 55 43 25 11 5 6 8 9 11 20 33 44 45 35 23 17 22 36 54 71 83 92 100 111 121 127 134 150 174 199 214 216 208 194 178
21482 178 158 132 99 63 29 5 -6 -6 0 5 11 20 37 56 69 76 80 81 76 69 68 78 88 90 84 75 70 65 57 43 26 10 1 3 11 21 32 47 63 78 94 115 139 160
21464 160 178 196 211 215 201 175 153 143 146 154 156 145 124 100 79 59 37 20 18 33 54 66 69 73 88 112 137 152 155 142 115 79 46 22 9 1 -1 -3 -7 -15 -26
21448 -26 -32 -31 -23 -10 3 15 24 32 47 70 97 122 138 139 121 91 63 44 29 14 7 20 51 86 116 143 168 178 170 152 136 125 114 98 84 80 86 94 92 72 44
21431 44 26 24 30 30 27 36 61 94 121 140 153 161 154 123 66 -3 -64 -96 -96 -73 -43 -12 19 50 74 85 89 94 108 123 129 120 104 89 76 59 41 29 32 49 70
21415 70 87 92 84 68 53 48 50 52 44 27 13 9 16 26 33 42 54 65 64 46 19 -3 -16 -20 -18 -11 1 19 44 75 110 143 170 185 187 182 181 192 206 210 196 171 145 122
21397 122 101 85 80 82 80 67 49 42 51 67 74 62 34 5 -16 -28 -27 -13 12 42 63 71 69 63 57 49 43 44 59 87 119 145 156 149 128 97 66 47 50 72 98 114
21380 114 119 119 117 106 84 64 55 61 72 78 77 67 47 24 8 4 6 2 -7 -15 -17 -18 -26 -35 -40 -37 -31 -21 -10 0 2 -2 -6 -7 -4 0 8 22 39 56 69 76 78 73 69 69 71 70 67 65 71 89
21360 89 117 148 169 166 140 103 74 64 66 69 59 36 13 3 8 14 13 12 16 27 37 41 41 35 19 -3 -25 -43 -60 -79 -95 -103 -103 -101 -97 -93 -91 -96 -102 -105 -101 -94 -89 -86 -80 -67 -46
21341 -46 -27 -20 -30 -46 -58 -63 -65 -63 -53 -31 -5 13 22 21 15 15 23 31 28 10 -9 -18 -18 -12 -4 6 15 19 22 34 52 66 73 82 98 117 129 126 114 102 98 104 112 113 109 104 103 102 100 100
21321 100 106 120 140 165 191 214 234 251 261 256 236 212 197 189 183 171 149 118 85 65 65 80 94 100 100 98 98 102 107 110 106 102 101 104 104 100 97 95 96 99 103 98 72 27 -15 -39
21302 -39 -44 -42 -37 -24 0 26 44 50 48 46 50 58 62 60 56 59 68 82 94 99 91 71 48 37 44 65 88 105 110 107 103 106 113 112 97 69 41 25 24 36 53 67 72 72 72 78 89 98 100
21282 100 97 91 86 83 82 80 74 58 33 3 -22 -37 -33 -12 12 29 37 41 46 49 53 60 69 72 68 67 77 92 98 92 77 60 38 15 1 1 12 21 22 10 -9 -24 -24 -8 10 20
21264 20 23 28 38 51 67 85 102 108 102 87 75 73 85 110 138 159 168 171 175 181 187 188 185 181 179 177 172 160 140 118 100 90 86 85 84 84 83 84 89 100 117 131 138 139 136 130 120 108
21245 108 97 88 80 75 75 86 106 129 141 135 114 91 79 80 86 89 87 83 78 71 64 59 52 46 43 48 56 62 60 52 38 23 13 14 24 36 50 67 87 102 103 96 89 89 97 106 113 114 106 92
21225 92 77 62 45 27 9 0 4 20 38 45 38 23 7 -5 -17 -19 -6 21 48 61 61 60 66 79 93 104 109 100 76 44 18 9 14 23 29 40 62 93 122 136 136 131 129
21207 129 127 119 104 88 78 76 74 69 61 55 56 65 78 89 99 112 133 153 157 141 114 90 77 68 58 53 56 69 84 97 109 123 140 154 155 138 108 79 62 58 62 68 71
21190 71 66 50 24 0 -13 -7 14 43 67 78 76 70 70 80 89 85 64 37 20 21 32 42 47 50 51 46 37 34 45 67 83 84 72 58 52 58 70 82 87 84 82 89 109 132 148
21172 148 153 150 152 165 183 194 191 176 162 161 175 196 212 217 212 205 200 194 186 179 176 179 188 203 225 247 262 264 257 243 226 206 185 163 141 118 97 84 81 86 91 89 75 51 21
21154 21 -1 -9 -4 0 -9 -31 -50 -49 -28 2 31 51 62 68 73 80 88 99 114 128 136 128 108 87 73 66 61 57 56 58 59 55 48 43 42 47 63 94 136 176 200 205 199 190 180 169 157
21135 157 148 143 140 135 124 110 101 106 125 151 168 167 155 146 145 149 147 140 136 144 159 167 159 139 121 111 101 83 59 38 25 14 2 -7 -9 -1 15 36 58 74 80 79 76 79 83 82 65
21116 65 35 5 -8 -3 8 17 21 28 42 60 82 111 145 178 206 230 245 247 230 199 164 132 107 92 87 90 96 101 101 95 81 69 65 73 90 106 117 120 117 116 122 135 146
21099 146 149 141 127 110 94 81 76 79 80 73 62 59 73 95 108 102 86 78 82 89 90 87 90 98 104 106 109 114 115 105 86 64 45 30 22 21 24 26 28 35 53 79 105 125 135 139 145 157
21080 157 171 176 162 131 96 72 66 70 74 67 52 40 44 66 94 117 127 128 126 123 119 117 125 145 173 200 219 230 234 235 231 223 215 210 207 202 197 194 195 197 193 183 168 154 147 148 153 160 172
21060 172 194 223 245 248 237 230 240 259 273 271 254 229 208 200 206 211 205 189 175 169 170 178 190 200 196 179 158 144 139 139 145 160 182 204 215 215 204 185 162 138 119 107
21043 107 99 90 80 73 73 79 86 90 89 82 73 66 63 66 70 74 83 99 123 151 179 200 206 197 179 159 140 122 110 110 124 147 170 187 191 180 157 125 91 64 56 70 98 124 139
21025 139 147 157 170 181 188 190 193 202 217 227 216 182 138 101 78 67 64 65 66 66 68 74 78 73 65 63 72 83 89 89 95 113 141 175 212 251 282 294 281 247 209 178 154 132
21007 132 108 85 65 54 59 86 128 170 198 211 213 208 198 185 171 161 155 158 172 189 194 177 141 103 82 85 102 114 107 86 64 49 47 56 76 101 121 124 111 88
20991 88 63 42 25 8 -12 -31 -40 -32 -13 3 13 23 38 57 75 93 115 139 155 154 139 119 102 88 80 77 77 76 74 73 81 98 114 116 97 66 36 19 11 6 7 22
20974 22 49 76 92 100 102 98 83 58 31 10 0 0 9 22 30 36 47 64 86 105 123 137 146 151 162 182 207 220 216 201 186 172 157 139 125 118 118 123 134 147 152 142
20958 142 123 109 105 109 111 112 113 117 121 129 144 161 168 158 136 113 97 91 96 114 136 152 156 151 142 131 121 114 112 118 130 146 158 160 153 139 123 102 78 55 36 16 -10 -38
20940 -38 -57 -62 -59 -51 -38 -17 10 37 61 82 103 120 130 127 114 101 99 116 145 176 199 211 212 206 205 218 240 257 257 243 221 199 181 171 174 188 204 215 217 212 201
20923 201 186 169 156 150 149 148 145 146 151 155 153 149 149 159 176 196 214 228 228 210 180 147 125 116 119 127 136 144 145 138 126 119 124 141 161 183 206 228 239 235 219 201 188 183 186 196
20905 196 203 206 206 209 214 214 207 195 179 163 151 148 152 156 157 157 164 176 185 178 155 126 109 109 121 133 139 145 153 163 173 178 175 162 140 114 87 57 26 7 10 37 81 128 163
20887 163 175 165 151 148 158 171 178 177 170 160 152 151 158 165 166 161 158 166 183 204 218 220 211 198 187 179 164 140 112 90 84 93 106 115 118 120 127 141 158 174 187 201 220 245 269
20869 269 286 293 293 287 279 270 263 260 260 259 253 238 215 191 177 180 196 215 229 235 234 229 223 217 206 184 150 111 72 40 17 7 5 9 16 30 55 84 108 119 118 109 94 73 49
20851 49 32 32 52 81 107 119 120 119 127 138 138 118 87 59 48 52 60 65 69 74 84 93 94 85 69 52 35 22 18 30 55 86 114 137 157 173 182 183 173 157 138 120 106
20833 106 93 79 69 67 75 86 92 93 93 95 97 94 86 81 84 94 102 104 98 85 68 50 44 54 77 106 138 168 191 203 210 214 216 211 200 185 167 147 132 123 114 97 74 62 66
20815 66 84 104 121 132 137 138 141 146 152 154 151 148 147 149 153 158 156 145 131 123 121 118 103 80 59 51 61 82 106 123 136 146 154 156 150 140 131 130 143 169 194 204 194 174 152 132
20797 132 118 118 133 161 189 212 231 243 248 246 240 231 221 208 196 184 171 156 142 130 120 112 105 101 98 99 107 124 148 174 194 203 199 183 159 132 107 87 77 80 94
20780 94 109 118 124 135 155 174 180 170 155 146 142 140 134 124 112 105 104 109 115 121 126 128 126 123 122 129 146 168 193 215 233 245 249 246 242 246 260 277 290 296 298 300 304 311 322 339 356 363 354
20761 354 334 315 307 312 320 326 325 320 313 304 298 294 289 277 260 246 242 247 255 260 263 265 269 277 287 294 295 292 286 278 264 247 229 212 200 199 212 231 247 253 249 242 234 227 225 235 258 293 332 364
20741 364 385 398 406 409 402 386 370 362 365 374 385 397 406 410 410 405 390 361 324 292 272 261 257 259 269 287 308 326 334 329 316 299 284 272 263 259 264 278 298 321 346 372 403
20723 403 445 497 546 585 610 626 636 641 644 649 656 657 650 640 636 637 638 643 658 686 719 742 746 735 724 723 736 762 797 839 884 924 952 970 983 1001 1032 1081 1147 1228
20707 1228 1317 1416 1522 1633 1750 1873 2007 2149 2290 2416 2525 2620 2700 2764 2809 2840 2867 2891 2911 2918 2911 2897 2892 2906 2945 3004 3075 3160 3265 3395
20695 3395 3545 3712 3897 4111 4360 4648 4978 5358 5799 6311 6899 7577 8374 9333 10504 11939 13696 15844 18476 21703 25647
20687 25647 30429 36148 42856 50533 59065 68229 77680 86967 95559 102907 108500 111926 112915 111384 107457 101451 93818
20680 93818 85087 75801 66472 57531 49298 41965 35610 30221 25727 22017 18964 16440 14335 12562 11066 9806 8748
20673 8748 7856 7091 6432 5868 5389 4978 4614 4285 3990 3729 3490 3265 3059 2885 2749 2644 2561 2495 2447 2413 2387 2370 2362 2362 2371 2389 2410
20662 2410 2422 2407 2363 2292 2199 2086 1957 1824 1698 1580 1468 1361 1265 1181 1110 1051 1002 960 918 873 827 785 747 715 687 658 629 597 566 535
20650 535 508 495 502 526 552 564 559 542 524 509 499 495 492 487 476 459 438 412 383 355 327 296 264 239 224 216 206 198 200 214 229 233 229 228 235 245 248 241 230 223 228 240
20634 240 247 243 230 217 204 193 191 202 217 222 214 203 199 200 198 192 186 182 180 177 173 165 151 139 139 156 182 207 223 226 218 202 185 170 161 160 164 165 156 138 121 113 115 121 130 141 154 164
20614 164 166 156 136 117 105 105 112 123 133 136 131 120 109 101 101 107 113 113 105 98 100 107 113 117 121 127 130 130 130 132 129 119 104 93 87 81 74 69 72 84 100 116 130 135 125 102 79 70 75 84
20594 84 90 94 99 103 99 88 76 67 56 40 24 15 16 23 39 64 93 120 141 152 149 129 98 68 50 46 55 74 105 144 176 186 170 140 113 94 83 78 82 100 125 146
20577 146 158 166 174 185 198 213 228 239 241 232 213 185 151 117 90 78 81 94 112 130 146 159 165 158 140 117 97 86 86 91 91 81 69 70 84 102 111 107 96 82 67
20561 67 55 53 60 71 75 71 64 60 65 77 90 96 92 81 64 45 24 5 -6 -7 5 26 48 63 65 55 41 33 36 46 56 63 71 83 94 98 93 85 80 80 88 102 113 109 85 48
20542 48 12 -10 -19 -16 -6 6 15 18 19 25 39 55 66 67 60 48 34 23 25 41 64 83 90 88 84 86 94 103 106 100 91 88 91 89 76 56 38 23 4 -19 -38 -43 -37 -29 -22 -12 3
20523 3 20 33 39 41 38 31 24 21 26 36 46 49 37 13 -9 -22 -26 -32 -42 -47 -40 -22 -1 16 33 49 66 87 115 141 154 144 117 87 66 54 50 54 63 70 66 49 23 2
20506 2 -6 -1 12 31 52 78 107 136 164 186 200 204 197 180 160 140 122 106 91 80 70 59 42 21 2 -9 -12 -11 -11 -16 -29 -45 -58 -66 -66 -57 -33 3 45 86 120
20489 120 146 159 156 140 122 115 117 123 124 118 109 102 97 93 92 95 102 107 105 97 90 84 74 56 38 32 42 64 89 112 132 143 143 134 120 106 98 100 113 132 157 184 208 216 205 181
20471 181 160 150 152 163 180 199 219 237 252 259 259 251 239 224 205 185 169 161 161 162 161 155 144 129 115 100 83 63 47 38 40 49 57 59 57 58 66 73 72 67 74 102 146 189 220
20453 220 234 234 227 217 208 200 194 192 192 184 159 117 68 21 -12 -22 -7 19 38 33 10 -15 -34 -44 -48 -51 -57 -70 -86 -98 -103 -103 -100 -92 -75 -52 -27 -7 4 14 24 35
20436 35 41 35 16 -13 -49 -84 -113 -133 -143 -140 -125 -100 -72 -48 -28 -8 17 51 89 123 141 140 128 121 130 148 162 163 158 159 170 181 182 170 153 141 132 122 109 100 100
20419 100 101 97 82 58 32 12 2 0 -8 -31 -60 -80 -84 -78 -74 -71 -58 -31 4 39 65 79 82 76 63 45 29 19 17 18 16 13 12 12 10 5 0 1 8 18 29 36 35 24 10 0
20401 0 -1 1 -1 -16 -41 -63 -73 -73 -71 -69 -57 -28 13 53 83 106 119 119 102 77 57 52 61 79 100 112 104 72 25 -19 -46 -46 -22 12 44 66 80 90 95 101 115 143
20384 143 175 192 186 165 142 121 101 81 67 56 45 34 30 37 49 55 53 49 53 63 78 94 110 124 131 129 117 102 87 73 56 39 30 33 45 56 63 73 94 121
20368 121 144 153 148 137 131 136 149 162 166 162 156 152 153 151 144 131 118 114 125 146 165 171 159 132 99 67 41 25 20 26 38 57 80 103 120 131 142 154 157 146 128 114
20351 114 112 119 126 128 126 120 113 108 107 108 110 112 115 120 127 132 133 131 125 116 106 101 103 114 123 123 117 114 117 120 114 95 67 35 2 -23 -33 -27 -14 -5 -2 0 12 34 55 63 55 37 18 1 -10 -13
20330 -13 -5 10 32 58 83 99 100 87 69 56 54 63 78 100 128 162 191 202 195 179 165 154 139 117 88 57 32 20 26 48 76 101 117 124 124 126 135 148 155 147 124
20314 124 91 62 52 62 84 103 118 135 155 172 183 189 190 182 166 149 132 110 80 53 33 14 -8 -29 -31 -9 22 51 72 82 75 53 25 1 -15 -23 -16 8
20299 8 43 75 100 117 127 122 106 88 79 77 73 62 46 33 29 37 50 62 67 68 69 69 68 69 73 78 73 55 33 14 4 0 -1 -4 -7 -11 -9 0 17 43 74 104 122 126 122 116 115 117 121
20279 121 126 125 114 94 72 55 49 53 65 82 103 124 143 154 157 158 158 154 143 132 131 143 159 168 169 172 185 203 216 215 202 186 174 168 167 168 164 150 127 107 100 101 102 100 98
20261 98 99 101 102 102 105 112 124 142 158 166 164 158 152 139 115 85 61 47 38 30 29 40 62 87 101 96 77 60 59 71 86 94 98 101 104 107 107 99 79 53 29 17 14 16 24 38 57
20242 57 77 94 108 118 127 130 125 113 102 95 90 83 75 73 83 103 128 152 170 181 182 172 146 107 64 31 15 11 13 15 16 14 11 12 20 27 24 12 -1 -8 -6 0 9 25 49 73
20224 73 81 68 48 38 40 40 31 18 12 18 31 44 57 67 74 79 85 88 86 80 74 72 72 72 68 62 59 62 74 89 102 112 116 112 101 89 82 82 93 116 150 182 204 210 204 187 162 132
20204 132 100 71 46 29 27 41 67 94 111 111 101 93 94 103 112 117 121 124 131 144 162 175 177 172 170 172 175 177 180 183 181 172 163 156 151 141 126 111 94 73 51 30 19 22 40 71
20186 71 106 135 154 163 168 173 178 178 169 158 152 153 153 149 145 147 150 138 105 65 37 28 27 23 21 28 43 55 57 58 71 95 116 120 108 90 77 73 75 83 95 109 125 136 138 131 123 116 107
20166 107 93 77 65 55 50 54 70 88 93 80 63 53 54 58 57 51 43 41 49 60 64 56 43 32 28 27 26 23 18 12 8 9 14 25 43 70 103 137 168 192 206 211 212 209 203 193 180
20147 180 166 151 134 118 111 111 112 111 108 106 104 106 116 136 161 176 175 162 144 127 113 103 95 85 72 65 71 91 116 138 155 168 176 179 177 172 166 157 148 143 140 131 116 105 108 125
20129 125 144 157 157 148 133 122 120 126 131 131 130 133 140 149 160 172 181 180 167 145 118 88 64 61 85 123 152 163 161 159 159 154 135 106 79 62 55 51 52 58 69 77 77 70 59 49
20110 49 38 29 18 5 -7 -10 3 31 66 103 139 165 173 162 143 130 127 129 132 133 131 129 128 130 127 116 100 87 78 68 57 49 52 66 86 105 118 122 116 97 70 40 18
20093 18 13 25 51 81 112 139 152 146 122 87 54 29 13 1 -5 -8 -9 -12 -20 -31 -37 -38 -32 -22 -7 8 14 6 -9 -19 -11 14 49 80 100 109 113 119 128 136 141 141 138 132 125 119 115
20074 115 111 108 104 97 89 84 86 97 114 135 164 201 241 277 302 314 313 303 291 282 272 259 243 226 207 183 158 143 143 151 154 146 132 118 108 98 89 78 67 59 64 85
20057 85 116 142 150 144 134 122 105 82 60 49 51 55 50 33 11 -7 -20 -29 -37 -39 -30 -9 15 31 29 10 -11 -24 -25 -24 -30 -42 -51 -50 -36 -12 13 35 45 47 51 63 79
20040 79 92 100 105 108 103 91 83 86 97 106 110 116 130 147 159 165 173 192 217 235 234 215 183 145 107 73 50 41 37 30 21 23 38 56 65 63 55 49 44 41 39 35 26 14 7 7 13 22 31 38 44
20020 44 50 59 73 87 101 115 128 139 144 143 139 133 126 116 103 84 60 39 27 26 31 35 37 42 55 77 106 142 181 209 214 197 170 149 141 137 131 125 127 138 147 146 134 120 108
20001 108 98 90 82 78 76 73 68 68 78 93 102 97 82 68 63 69 79 86 89 93 112 145 179 194 184 161 139 128 126 126 122 110 92 77 67 62 60 66 79 89 87 72 50 27 2
19983 2 -24 -50 -69 -74 -61 -28 16 56 75 73 56 35 14 0 -9 -17 -27 -35 -29 -3 36 76 103 117 123 129 139 154 165 164 150 129 108 96 97 109 130 154 171 178 175
19967 175 164 145 122 99 82 70 58 42 22 2 -17 -33 -42 -37 -24 -10 1 12 24 31 33 36 48 69 93 115 134 145 142 126 108 95 85 77 70 67 66 61 53 49 55
19950 55 71 92 109 118 119 117 121 136 158 182 198 209 218 229 237 236 229 224 224 219 201 176 157 148 143 139 140 145 149 145 137 130 126 124 122 122 125 133 140 139 128 110 91 71 49 28 20 30 53
19931 53 79 107 130 145 145 136 124 113 100 89 88 102 126 152 172 186 195 203 207 197 166 123 85 66 69 87 117 156 199 236 258 260 243 220 201 191 188 191 200 216
19915 216 233 244 248 249 245 233 209 176 143 116 94 80 76 86 112 145 176 196 206 210 207 200 194 191 192 193 190 186 181 178 178 181 189 200 210 210 191 156 119 95 83 71 54 39
19897 39 36 47 69 99 135 171 197 208 200 179 152 135 135 150 167 170 156 135 118 110 109 113 122 136 150 154 148 137 128 117 105 94 90 92 94 94 92 92 92 91 92 100 116 136 156
19879 156 175 186 182 165 149 152 176 203 214 200 175 151 135 125 120 119 122 129 141 160 182 198 202 195 180 157 133 115 111 116 123 125 123 120 119 121 123 118 103 82 65 55 52 48
19861 48 43 34 22 8 -8 -23 -30 -24 1 45 95 140 172 190 197 199 205 222 245 267 283 292 291 273 242 207 182 167 156 146 140 136 128 110 90 78 77 81 87 98 116 138
19844 138 159 176 193 210 221 222 207 183 157 136 123 117 120 128 140 153 169 192 215 225 218 201 188 185 187 194 207 228 246 255 256 253 244 222 187 150 123 107 100 102 109 117
19828 117 120 117 116 123 134 140 138 135 134 135 133 125 109 88 62 38 25 25 37 61 93 123 136 133 126 127 133 135 131 124 117 109 101 99 105 115 127 137 143 141 135 135 144 158 162 151 135 124 123 128
19808 128 141 162 188 207 211 204 192 183 173 158 139 120 106 100 95 84 59 27 -1 -21 -33 -39 -41 -37 -32 -26 -15 1 20 36 46 53 59 60 58 57 60 62 59 53 51 54 58 60 65 77
19789 77 97 117 131 136 131 119 102 81 60 41 26 18 17 22 29 35 42 54 72 90 101 98 85 69 53 39 26 19 18 20 20 21 25 32 38 44 62 95 135 165 174 170 162 156 147 133
19771 133 114 94 76 60 43 28 18 11 2 -9 -14 -8 0 5 10 27 55 82 97 99 94 82 68 56 50 43 34 29 28 24 12 -2 -10 -8 0 11 27 39 37 26 21 27 37 38 30 22
19752 22 19 18 18 19 21 27 43 71 108 148 184 207 216 215 211 210 213 217 216 207 190 170 157 151 150 152 155 154 144 123 101 90 91 95 100 110 131 160 184 193 182 160 144 145 163 189 210
19733 210 220 217 208 203 204 206 204 194 171 134 89 51 33 34 40 42 40 36 29 21 16 19 29 42 58 78 100 117 120 107 83 60 49 53 68 87 102 114 123 129 132 131 128 127 125 124 125
19714 125 127 131 132 128 118 104 93 93 107 130 152 165 168 165 162 168 184 203 211 206 195 193 201 211 217 218 215 205 186 162 137 115 100 101 123 160 198 225 239 242 236 221 207 202
19697 202 209 219 226 229 232 235 236 234 231 225 213 198 183 170 156 141 127 113 99 87 84 92 101 99 85 63 38 13 -7 -17 -20 -20 -19 -13 0 17 33 42 44 40 36 40 59 91 130
19679 130 169 198 215 223 232 244 254 259 262 265 262 248 224 196 166 133 97 65 44 32 27 23 19 20 30 51 78 102 117 119 115 112 113 114 109 103 109 125 138 132 109 81 63 56
19661 56 59 69 81 90 90 85 80 82 93 110 124 127 114 90 59 28 4 -6 0 22 55 90 120 138 141 135 125 114 105 97 92 91 88 83 77 72 73 76 79 82 90 102 113 113 98 75 52
19642 52 33 21 19 27 40 53 63 73 87 106 131 161 187 199 188 157 123 102 97 98 95 89 89 95 102 108 116 127 133 128 112 90 65 39 13 -12 -33 -48 -51 -45 -31 -11
19625 -11 16 49 74 81 69 53 46 48 51 49 41 34 33 44 62 80 89 85 73 56 37 21 12 16 34 56 75 88 99 107 109 104 93 76 55 37 33 45 64 80 89 94 94 86 73
19607 73 64 68 81 96 110 126 147 171 194 209 213 210 202 192 178 160 146 140 138 128 109 89 70 52 36 32 44 61 71 75 80 95 115 130 134 130 122 118 122 129 134 131 123 119 124
19589 124 138 154 162 160 154 154 160 167 173 178 177 166 146 126 109 92 72 50 34 28 32 45 65 89 109 120 119 113 111 123 143 155 150 129 103 78 60 55 66 89 113 130
19572 130 137 138 135 133 134 134 129 121 116 120 124 123 115 110 112 122 132 136 129 112 90 67 47 39 43 52 54 49 40 34 26 15 7 9 19 29 37 46 60 74 85 91 94 99 103 103 95 79 62 54 57 63 65 60
19551 60 53 51 58 74 94 114 128 132 124 111 109 123 146 163 162 143 115 87 67 55 46 37 33 37 54 81 116 152 182 198 200 195 188 178 166 154 144 133 119 103 89 81
19534 81 79 84 93 98 94 81 69 65 68 76 83 89 91 90 91 97 110 126 139 150 162 174 180 174 155 126 92 58 33 26 38 64 91 110 119 117 108 99 101 117 143 167 185 195 204 213 222
19515 222 230 239 247 247 237 220 201 185 174 169 172 177 179 170 152 132 115 101 88 78 74 78 88 101 115 128 136 135 123 99 68 38 20 22 41 66 84 89 79 56 28 7
19498 7 -2 -4 1 14 34 61 87 111 130 145 152 149 137 123 113 116 129 143 148 141 128 111 97 90 94 106 115 116 114 113 117 120 119 112 106 107 115 119 107 81 54 38 31 24 15 10 17 34 57
19478 57 76 89 93 91 87 85 90 100 112 120 123 122 119 117 117 121 128 132 126 112 96 82 74 73 81 95 109 117 124 138 160 178 180 162 138 122 115 111 100 84 66 47 33 31 45 65 77
19459 77 75 66 58 52 45 39 33 28 24 25 29 31 31 31 34 39 41 44 51 63 77 90 96 93 79 58 35 13 -5 -18 -25 -25 -17 -2 13 22 26 34 56 88 117 134 137 133 124 116 114 122 135 145 143 131
19439 131 116 109 113 127 143 160 176 191 202 204 201 193 178 151 112 75 54 52 57 56 45 35 34 42 55 63 64 58 48 33 16 0 -13 -21 -22 -23 -28 -42 -59 -69 -68 -60 -50 -37
19421 -37 -14 22 65 106 143 178 212 239 250 241 214 173 130 100 94 107 131 155 180 202 221 236 246 247 236 216 195 179 168 161 158 157 155 153 156 166 177 181 178 172 164
19404 164 151 138 133 137 141 133 109 76 46 32 41 65 82 78 56 27 2 -15 -24 -20 -6 11 32 59 90 116 127 123 116 108 94 72 47 32 31 39 48 56 66 84 111 137
19388 137 150 145 130 115 109 109 114 122 129 132 129 129 139 155 167 166 157 145 136 130 131 141 155 162 162 161 162 164 164 163 164 164 156 134 105 81 71 77 94 113 125 124 113 102 102 115 134 152
19368 152 163 167 164 157 149 148 156 169 182 192 198 202 203 203 206 215 224 227 222 215 208 197 175 143 113 95 93 104 124 150 175 191 193 182 161 139 122 113 108 107 114 134 162 183 191 191 192
19349 192 197 201 195 182 168 160 151 131 98 62 39 31 30 30 30 30 32 38 49 65 78 80 70 53 33 13 -3 -14 -19 -17 -6 6 15 15 9 6 10 19 29 39 46 47 44 40 40 40 35 19
19330 19 -9 -44 -75 -92 -91 -74 -48 -19 6 31 59 91 123 144 153 153 153 155 160 165 167 164 158 152 142 122 94 71 62 65 69 69 65 64 71 89 112 130 140 147 159 179 199 211
19312 211 210 198 176 149 122 102 91 88 91 98 111 128 147 162 169 168 164 158 151 139 121 102 87 78 65 44 22 13 22 36 38 30 23 23 28 34 42 49 53 53 58 75 100 121 133 139
19294 139 148 163 177 186 193 202 218 234 234 209 162 108 63 40 41 61 88 105 106 94 75 58 52 60 80 102 115 120 119 115 108 102 101 106 112 118 127 139 148 145 127 102 81 70 67
19276 67 71 78 79 69 53 43 45 53 59 60 62 73 92 114 135 153 163 159 140 115 95 83 78 74 71 68 66 63 63 69 79 89 94 90 84 83 92 111 132 152 169 188 208 226 240 250
19257 250 259 269 272 261 233 198 166 140 118 102 101 120 155 189 208 205 183 149 118 97 88 87 88 90 92 95 101 111 124 138 156 182 214 247 274 291 293 277 247 214
19241 214 189 176 170 164 156 145 137 137 144 150 149 141 132 123 115 110 110 115 124 135 146 154 162 174 193 213 224 225 220 211 200 188 179 174 169 159 148 141 141 147 150 146 131 111 91 77 76 85 99 115
19221 115 134 159 186 199 192 174 162 161 163 159 149 140 132 124 114 107 101 96 92 92 99 115 138 160 171 165 151 141 136 128 115 104 101 103 102 97 92 93 100 112 123 129 131 129 130 131 133 133 136 141
19201 141 147 153 158 160 152 136 118 112 122 143 166 187 201 207 205 199 192 184 173 160 149 140 134 128 122 115 114 123 137 147 146 138 131 126 117 103 90 83 82 84 91 107 129 146 156 166 183 204
19182 204 217 216 204 188 171 156 142 131 123 116 111 109 112 125 146 167 181 185 186 190 195 197 198 205 220 231 230 216 195 168 134 93 55 29 16 14 19 27 36 41 43 45 52 66 83
19164 83 101 119 136 156 178 205 238 272 291 286 261 233 214 206 200 193 183 165 143 124 119 128 142 151 155 159 167 179 193 201 198 184 164 145 132 124 122 124 131 145 161 174 180
19147 180 183 185 188 190 189 184 172 154 134 119 112 112 116 123 133 140 139 131 119 106 99 103 119 143 163 175 178 171 157 139 126 125 136 154 176 197 212 217 209 196 189 193 205 213 213 202
19128 202 180 151 126 117 124 134 135 126 115 107 100 97 101 109 119 134 157 186 207 214 213 209 205 197 185 169 149 129 115 115 133 158 180 190 188 177 165 159 154 146 135 134 150 179
19110 179 208 227 236 241 245 243 233 216 194 172 155 150 157 169 180 189 197 208 220 227 224 206 180 155 140 136 136 137 133 126 120 122 134 149 157 154 142 126 111 100 96 100 106 113 122 131 135
19092 135 140 154 178 199 202 188 168 144 115 86 66 62 70 77 79 76 71 72 80 88 90 79 63 48 38 33 34 37 42 54 70 81 79 67 60 62 63 49 20 -7 -20 -11 9 30 42
19073 42 49 55 57 49 37 36 54 82 106 124 143 160 167 160 143 118 91 70 64 65 62 54 50 54 62 69 78 91 103 105 101 97 97 99 101 104 109 121 141 166 187 196 197 196 197 204 220 239 254
19054 254 262 264 261 253 237 223 216 215 213 206 195 184 176 177 189 206 214 203 177 145 116 94 77 62 50 50 59 67 60 37 6 -19 -35 -38 -28 -10 5 20 35 45 44 34 27
19037 27 35 59 90 119 137 138 126 108 93 82 72 60 50 49 60 76 86 86 79 67 45 11 -26 -57 -75 -83 -86 -86 -80 -69 -55 -40 -28 -22 -18 -7 11 33 53 70
19020 70 78 75 68 67 72 74 70 76 106 151 189 211 223 228 221 201 175 151 134 121 108 96 86 80 79 83 88 94 101 106 106 98 88 85 94 117 145 164 172 180 200 227 245 245 233 215 198
19002 198 183 172 162 151 139 133 136 144 151 157 164 167 163 155 151 151 155 157 157 157 157 157 161 169 177 185 193 205 223 240 248 241 226 210 202 204 211 222 231 235 231 218 197 180 175 182 188 181 160 135 118
18981 118 112 121 137 152 155 148 142 142 143 140 131 119 106 98 104 129 165 201 228 242 245 239 226 206 181 154 131 116 107 103 103 100 89 74 65 67 72 68 57 48 46 49 60 82 112 143
18963 143 168 186 195 196 195 202 220 239 257 275 297 311 303 270 225 186 165 159 161 162 163 164 163 153 133 113 106 118 141 166 187 200 204 195 178 164 160 165 171 176 182 188 196 202 205 204
18944 204 190 162 129 106 104 117 135 147 144 128 111 105 118 142 167 184 190 182 158 125 98 84 81 79 71 60 51 45 38 28 24 38 70 107 136 150 149 139 132 137 152 163
18927 163 156 139 121 111 107 107 111 117 119 115 108 98 87 75 65 57 52 50 48 45 41 44 58 82 110 139 169 196 215 221 221 216 204 184 165 160 171 192 210 221 229 236 243 246 242 235 235
18908 235 248 265 273 270 268 274 280 274 253 228 210 204 210 227 245 256 257 251 238 215 185 158 146 152 168 185 192 178 144 104 74 60 54 48 41 36 34 37 45 59 80 105 127 138
18891 138 135 123 111 106 103 104 109 119 132 143 155 171 193 223 253 276 282 273 258 248 239 227 207 186 168 152 138 127 125 137 164 201 236 261 273 273 263 245 225
18875 225 208 194 184 175 168 165 171 189 218 246 261 260 249 237 231 233 236 232 211 177 143 117 101 93 94 106 128 150 164 169 166 162 162 166 173 177 176 169 156 138 120 107 103 105 108 107
18857 107 102 94 86 81 79 79 77 72 65 59 52 39 20 4 1 8 14 13 12 14 16 12 0 -14 -25 -27 -15 6 30 55 83 115 144 163 177 189 199 202 197 189 179 166 154 149 151 158 168
18838 168 178 181 175 160 144 132 123 123 132 149 165 175 182 185 180 167 151 135 121 108 101 101 109 122 139 157 174 187 198 204 202 194 188 187 186 177 164 152 141 128 114 105 107 119
18820 119 139 161 176 183 186 191 198 201 199 194 190 184 172 158 147 142 136 127 117 111 108 104 98 93 95 101 106 108 113 121 125 117 102 89 84 84 88 96 102 104 104 108 118 127 131 131 136 144 147 139 121 100 81 69
18798 69 66 74 85 94 99 100 100 100 102 109 118 123 124 132 152 181 207 224 235 245 246 235 213 190 169 152 142 139 141 139 133 129 138 154 168 169 156 134 112 95 87 82 74 62 48 35 28
18780 28 28 38 56 72 82 89 102 121 142 159 169 168 159 148 139 131 118 102 93 99 114 121 113 90 57 19 -15 -34 -38 -39 -48 -62 -68 -62 -50 -39 -30 -20 -8 3 14 17 13 10
18762 10 14 21 21 14 8 11 19 26 36 54 80 104 118 124 125 125 127 135 149 165 175 176 172 163 151 136 121 108 101 101 111 131 160 191 215 230 238 239 225 195 155 117 88 74 74
18744 74 88 110 132 147 153 152 147 147 158 176 192 200 205 215 225 225 214 200 193 191 183 162 133 109 97 97 102 107 110 111 110 105 95 84 73 70 79 101 126 142 145 136 127 125 133 147 158
18725 158 162 160 161 171 189 212 236 259 280 297 304 300 283 254 215 173 140 126 134 155 180 203 223 240 256 270 282 289 282 262 235 208 187 172 157 142 130 127 134
18709 134 145 154 158 156 146 130 111 97 90 90 95 106 120 138 155 171 180 176 164 154 156 172 194 212 216 201 173 148 138 140 145 149 160 184 213 233 241 244 247 246 231 201 167
18692 167 147 142 139 130 123 132 153 165 154 126 97 80 78 92 117 139 145 140 137 143 151 154 155 160 169 175 174 168 158 151 150 154 162 171 183 197 204 195 168 136 110 96 86 70 43 14 0
18673 0 7 32 62 92 120 142 154 151 138 122 106 95 92 94 94 88 80 81 93 111 129 148 170 192 207 211 203 183 153 122 100 90 82 67 48 32 23 19 17 18 26 44 67
18656 67 92 110 120 126 133 140 143 142 142 145 150 155 161 176 199 227 252 270 278 279 272 260 246 237 237 238 229 214 208 221 242 247 230 200 170 144 118 92 67 45 30 27 40 61 82
18638 82 94 98 99 96 90 80 72 74 89 111 129 136 132 116 89 57 27 8 -1 -2 5 26 55 84 105 114 113 105 96 89 88 94 109 129 145 151 155 164 179 186 179 163 146 132 124 124 138
18619 138 160 178 187 187 185 188 194 199 201 201 201 204 206 205 193 172 148 133 133 143 153 162 171 183 187 179 165 161 171 190 208 223 238 249 254 252 249 247 244 240 240 245 251 248 236 221 207 194
18600 194 183 176 179 190 205 216 218 212 205 201 202 203 201 204 214 229 235 231 222 213 201 187 176 174 177 179 181 183 181 167 141 116 104 104 109 108 100 90 91 109 138 162 172 169 161 151 139 128
18580 128 121 116 113 110 111 116 121 119 110 97 84 74 70 69 65 50 29 12 12 26 42 48 42 32 26 28 34 37 29 14 5 13 36 64 92 122 153 177 186 179 163 151 153 166 181 192 200
18562 200 208 212 204 182 159 150 155 155 144 129 126 133 137 131 116 103 92 83 75 68 63 61 67 82 104 124 134 126 97 57 26 21 41 67 78 68 49 33 27 29 33 33 29 27 39 71
18543 71 112 144 154 142 119 102 102 123 155 183 195 193 186 183 186 193 200 208 217 224 224 215 198 180 174 186 207 220 222 218 214 208 199 194 201 222 245 261 268 267 261 251 240 233 227 220 213 210 214
18523 214 223 230 231 224 212 202 198 201 206 210 211 210 202 183 149 111 81 72 83 103 121 129 124 111 97 89 84 80 79 86 99 110 117 127 142 160 176 191 205 216 222 225 226 223 213 200
18505 200 189 185 181 169 146 117 97 96 114 131 135 124 109 95 79 61 46 40 41 47 57 67 74 74 73 79 92 109 125 141 158 174 188 195 194 185 172 159 150 151 163 183
18488 183 202 216 227 238 244 242 237 237 244 249 240 214 174 129 90 60 38 20 7 0 -3 -5 -6 -5 0 6 17 32 52 76 98 114 125 138 160 187 210 218 213 207 207 213 216 209 189
18470 189 160 131 113 113 129 148 161 164 158 152 149 152 157 163 173 188 204 217 221 216 203 190 183 182 181 175 164 156 154 158 164 168 173 177 178 176 172 169 170 174 176 170 161 150 140 129 118 113 116 124 131
18449 131 140 158 186 217 242 257 261 258 249 236 223 216 218 225 227 220 204 186 170 159 161 177 199 206 191 160 131 113 106 104 100 95 91 99 117 135 144 148 156 175 202 231 254 261 248
18431 248 221 198 192 199 209 211 202 185 168 159 162 169 171 163 152 148 155 169 182 188 188 191 197 205 206 200 187 174 166 163 164 164 163 161 159 156 152 150 150 151 153 160 169 176 180 187 201 218 234 250 274 304
18411 304 326 327 307 277 249 227 211 201 192 182 165 144 123 111 114 130 151 168 174 170 160 153 157 168 181 191 198 201 200 196 193 191 186 177 170 169 174 172 154 122 94 83 89 103
18393 103 121 144 171 196 212 218 218 217 217 224 233 234 217 189 169 164 165 163 158 156 157 154 146 139 135 135 132 122 105 87 76 76 82 86 89 100 123 153 178 187 180 162 139 118 104 102 111 121
18374 121 125 122 115 108 100 91 88 94 110 132 154 175 191 202 207 206 202 194 183 170 159 156 161 171 178 178 172 165 157 151 152 157 160 159 158 162 169 173 174 177 182 187 192 200 211 220 223 219 211 201 189 175 160
18352 160 145 131 119 107 94 81 77 82 90 96 98 101 106 111 115 124 144 172 195 204 201 195 187 176 165 160 171 201 243 286 314 314 287 250 217 188 157 125 99 83 76 76 83 96
18335 96 111 125 135 139 139 138 139 138 128 116 117 137 163 177 176 174 180 200 228 255 274 282 281 276 273 274 279 284 286 279 263 240 213 188 167 151 137 127 123 130 144 164 184 197 195
18317 195 179 163 158 167 181 190 191 187 184 190 205 222 230 228 224 225 228 228 226 223 223 227 228 217 192 166 150 144 133 109 78 54 40 27 12 2 2 4 -2 -19 -33 -32 -18 -3 5 18
18298 18 39 65 85 98 113 132 148 155 155 154 157 162 162 149 117 69 24 0 -1 14 37 67 99 124 131 122 109 105 110 118 125 136 152 171 191 211 227 226 202 162 124 96
18281 96 77 65 61 65 75 83 86 80 68 56 54 62 75 85 90 95 103 110 113 111 106 100 92 84 77 76 87 103 110 100 79 60 50 51 65 87 104 106 92 71 52 39 39 51 69 82
18263 82 89 97 111 126 139 150 162 172 175 169 160 150 139 130 128 134 140 140 135 130 124 113 101 98 111 132 147 151 152 160 176 197 219 243 264 274 273 267 264 263 257 243 226 211 200 195
18244 195 194 197 198 191 177 160 146 137 134 133 128 117 100 86 86 99 112 110 89 58 31 17 15 16 17 20 30 45 56 58 51 45 45 54 74 100 124 137 138 133 124 109 88 65 49
18226 49 41 41 47 56 66 79 98 126 153 169 174 174 177 179 175 164 146 124 102 87 86 96 108 118 129 147 174 203 226 239 245 252 261 269 270 259 246 241 244 251 253 250 241 227 207
18208 207 190 185 191 200 204 204 205 209 214 217 213 203 191 182 176 168 157 147 141 141 146 152 154 152 148 151 163 173 167 143 114 93 81 76 77 86 100 117 135 156 172 177 166 149 140 144 161 184
18189 184 206 222 234 242 251 258 260 252 231 199 163 134 117 111 114 124 140 156 163 158 141 121 104 99 105 114 121 124 127 131 135 135 138 145 157 169 180 189 195 196 194 190 184 173 159 143 126
18170 126 106 88 78 80 88 95 98 100 105 112 119 126 132 137 139 139 138 136 132 126 120 117 114 110 110 121 144 173 197 211 214 204 186 168 156 153 156 165 182 205 224 234 233 221 198 170 146 134
18151 134 129 117 98 79 72 76 84 88 86 80 75 74 81 93 106 111 102 81 56 37 26 20 17 18 23 30 38 46 57 69 83 103 128 152 167 173 176 184 196 208 216 218 216 213 210 211 214 219 223 226
18131 226 225 220 215 210 207 206 206 202 193 180 167 159 153 143 127 110 99 98 104 115 128 143 156 164 166 164 158 152 146 141 134 132 140 159 187 221 254 279 288 283 275 267 254 234 216 208 210 213 212 211
18111 211 211 210 203 190 171 147 120 97 80 67 62 69 89 121 160 201 236 260 270 269 262 255 252 256 265 272 273 265 249 228 208 197 197 201 199 186 165 143 124 110 99 91 87 93
18093 93 110 134 158 182 206 228 241 239 229 223 229 238 241 235 230 234 250 271 294 312 319 311 291 267 240 206 163 120 90 81 90 112 137 158 173 185 194 197 192 181 168 154
18076 154 137 117 100 90 90 97 104 111 120 137 163 194 224 251 270 278 273 264 258 255 247 234 219 201 181 167 166 173 169 151 135 135 150 170 193 221 254 283 299 299 284 263
18059 263 246 240 240 238 230 216 199 181 167 163 167 171 163 140 109 81 68 69 78 92 106 120 130 138 147 162 180 194 201 206 213 225 234 236 224 200 167 130 97 72 56 49 52 62
18042 62 68 64 49 33 27 34 55 85 118 146 162 165 162 155 142 124 109 104 107 108 100 85 67 51 45 51 58 58 53 57 81 120 163 201 228 241 244 243 246 255 263 269 272 271 260 235 201
18023 201 170 151 143 141 138 132 121 106 88 73 65 67 81 104 124 129 122 115 120 133 142 142 133 123 115 116 131 157 184 204 220 236 248 250 242 230 222 213 202 186 169 153 141 132
18005 132 127 123 119 114 112 118 133 153 171 181 188 192 191 185 181 183 186 180 165 149 141 142 150 160 164 157 144 137 146 166 184 195 198 196 192 192 200 214 225 227 220 211 202 194 184 175 170 175 191 215 237
17985 237 249 249 239 229 225 224 220 208 191 177 167 159 151 146 143 146 161 186 213 229 224 205 186 175 172 171 168 162 159 160 165 166 160 156 164 189 225 257 273 269 244 203 157 121 109
17966 109 123 150 170 177 175 173 173 168 153 131 109 94 87 85 85 86 89 93 96 100 107 120 133 141 143 143 142 139 137 139 139 130 114 104 109 125 140 154 170 188 201 201 194 190 190 193 198 204 202 182
17946 182 147 112 93 94 111 131 143 140 126 116 121 136 149 152 146 140 136 134 132 132 136 140 140 135 128 122 116 108 102 104 118 140 164 182 192 194 190 182 171 155 133 109 88 77 75 80 84
17927 84 82 72 62 56 59 75 104 141 174 196 208 215 213 202 184 172 168 172 179 190 207 225 234 225 201 170 144 132 131 136 141 144 146 144 129 103 72 49 39 44 61 85 106
17910 106 119 123 122 118 109 95 83 77 78 80 78 76 82 98 123 152 181 205 217 215 203 192 188 185 176 161 144 127 115 110 110 113 115 118 122 129 135 139 146 153 159 163 169 180 194 208 217 218 203
17891 203 169 120 70 32 11 2 -1 -5 -7 -2 15 47 88 128 156 164 158 150 150 159 173 187 201 216 234 246 243 223 193 170 158 150 137 115 91 77 76 87 103 119 129
17874 129 130 128 128 130 135 136 134 131 131 130 126 119 111 99 79 50 21 0 -13 -19 -15 -7 -1 0 2 17 42 64 77 82 89 103 126 156 183 197 198 199 207 223 237 243 241 230 210 188 169
17855 169 161 162 168 178 190 199 199 187 170 156 148 140 125 107 100 108 128 150 163 164 152 136 130 140 159 167 159 145 140 142 140 131 126 137 156 167 162 151 146 152 156 152 141 129 117 107
17837 107 98 89 82 81 89 99 103 99 90 77 55 22 -11 -33 -37 -25 -4 21 48 67 73 70 67 69 77 86 91 94 99 109 122 136 156 181 207 224 230 228 217 195 167 142 126 113
17819 113 98 83 74 73 76 77 76 71 69 72 85 106 128 143 145 133 112 88 69 60 69 99 146 196 233 248 239 212 173 134 107 97 97 98 97 93 88 80 68 59 57 64 75 89 104
17801 104 112 109 94 81 82 94 108 114 112 107 103 101 99 91 75 59 52 63 90 124 153 166 161 147 132 124 122 128 144 168 194 215 232 246 259 271 284 295 299 291 271 248 233
17784 233 227 225 216 197 171 148 137 140 154 170 180 179 171 167 174 186 195 196 188 176 162 152 150 152 155 158 161 162 162 161 160 154 141 124 110 102 102 114 140 176 209 229 235 226 209 192 180
17765 180 172 162 152 147 151 163 176 192 211 230 244 255 265 276 283 286 284 278 267 255 245 237 226 208 185 163 146 136 132 130 128 128 134 148 170 196 219 235 243 248 255 259 254
17748 254 239 223 217 220 222 215 201 189 186 190 193 191 188 190 198 206 211 215 217 216 210 207 217 238 261 275 278 277 275 275 274 270 260 247 232 216 196 172 151 139 137 136 131 127 127 132 138 137 132 127 132 147
17727 147 164 171 160 141 124 113 103 89 78 76 84 95 101 96 86 80 82 86 82 67 50 43 48 61 75 87 95 95 88 72 48 25 14 20 35 45 48 51 59 74 90 103 109 109
17709 109 107 107 109 110 111 118 133 148 154 147 134 118 106 103 112 130 145 154 158 167 182 199 210 216 221 228 224 202 165 131 114 110 108 103 93 76 49 19 0 -1 9 21 32 48 70
17691 70 96 118 131 132 125 118 115 115 115 115 115 113 106 99 100 116 141 165 177 179 179 185 196 205 205 202 204 212 220 221 218 217 218 218 214 205 193 179 166 158 158 167 183 204 224 238 246 254 269 289 307
17670 307 315 307 288 264 243 230 221 213 205 201 205 217 230 234 228 214 202 202 213 231 249 261 266 261 248 226 197 166 146 145 158 174 178 170 156 145 136 128 122 126 144 172 198 214
17653 214 220 220 216 207 198 194 195 197 200 208 222 232 232 223 213 203 188 165 138 108 77 50 34 35 45 56 67 82 99 109 111 112 115 119 128 151 192 238 273 285 274 249 217
17636 217 190 175 174 183 196 209 214 207 191 171 148 116 77 39 12 1 8 30 63 99 130 151 159 155 148 146 148 144 125 95 69 58 62 80 111 151 192 225 244 248 239
17619 239 223 208 195 179 158 142 139 149 161 169 172 174 175 170 161 151 149 157 170 185 197 207 215 220 218 208 190 168 150 143 140 134 124 120 127 140 147 145 141 140 139 133 123 112 97 73
17601 73 45 18 -6 -33 -64 -88 -96 -86 -64 -40 -17 4 25 48 70 86 95 98 97 93 87 80 79 81 82 78 70 62 55 52 60 83 116 147 167 180 190 198 198 189 179 174 169 152 121
17583 121 89 72 74 89 106 123 140 156 172 189 203 207 199 185 176 178 187 197 204 205 194 172 148 136 144 168 200 233 259 271 267 252 229 202 175 155 146 147 153 156 155 156
17566 156 163 178 194 203 208 216 234 255 268 269 258 237 209 183 173 186 213 237 250 250 243 229 213 200 199 212 234 255 269 276 282 292 313 341 365 370 349 313 276 244
17550 244 215 190 173 164 155 139 120 112 116 127 135 139 139 134 124 113 111 117 126 128 116 97 82 79 88 101 113 127 149 176 198 206 204 201 202 207 209 209 204 198 192 189 195 204 211 209 200 185 168
17530 168 146 117 86 61 45 37 32 27 25 30 44 62 79 90 95 93 82 64 42 21 6 2 14 45 87 133 176 210 234 249 260 269 275 273 265 254 238 217 192 168
17514 168 151 137 123 109 103 109 125 145 168 193 215 231 239 245 251 257 257 249 235 219 197 168 129 89 61 54 68 91 115 136 156 174 183 174 148 122 113 125 144 152 147
17497 147 135 120 101 78 56 47 55 80 118 167 219 263 285 281 261 238 224 221 229 242 254 259 256 253 257 270 283 287 283 277 273 266 253 235 222 215 213 209 200 190 186 187 187 179 164
17479 164 152 149 155 167 179 186 185 179 173 170 167 162 158 158 157 153 147 146 153 167 181 187 184 177 179 197 227 253 264 259 244 222 200 188 190 201 213 221 225 227 229 234 245 252 248 229 204 180 160
17460 160 143 129 117 109 107 110 119 130 139 141 135 128 129 145 170 192 208 220 230 238 246 257 270 281 289 303 326 351 369 376 379 379 373 353 315 258 192 135 102 93 95 100 111 134
17442 134 165 192 211 222 229 232 231 234 249 278 307 320 310 281 245 212 187 176 178 187 194 196 192 185 177 173 177 185 192 195 197 197 195 188 183 181 183 186 191 202 217 232 246 262 279 298 313
17423 313 318 303 268 228 198 184 179 171 156 135 106 70 33 9 1 3 5 6 9 19 28 29 21 11 10 21 39 57 72 81 87 93 105 124 146 168 188 206 216 218 212 202 187
17406 187 167 149 146 163 188 205 209 210 215 222 226 223 219 223 238 256 269 277 288 305 318 318 307 294 284 273 257 246 251 275 304 326 333 320 283 230 176 135 110 95 86
17389 86 80 81 91 112 141 168 184 183 172 157 140 127 126 142 169 192 201 200 198 202 212 222 229 234 237 239 236 227 215 206 201 196 184 169 159 158 164 177 199 224 243 247 237 220 201
17371 201 182 162 145 131 117 104 97 98 105 113 119 121 120 115 107 101 98 101 110 123 136 147 156 165 174 181 191 206 223 233 236 236 240 247 253 257 264 274 280 275 258 231 199 166 138 119 111 110
17352 110 108 106 105 112 126 138 138 124 108 105 114 122 118 104 90 83 83 87 96 108 120 130 140 149 158 171 190 214 235 244 240 227 215 204 190 169 147 137 151 180 204 211 206 200
17334 200 196 194 191 189 190 194 198 199 193 184 179 181 189 197 206 214 218 217 216 218 219 207 182 155 139 140 152 164 166 156 140 130 130 138 146 144 128 102 79 70 78 94 115 143 175 197 203 204 211 222
17314 222 226 214 188 158 135 128 139 153 161 162 163 163 157 146 135 126 115 99 87 84 85 88 96 117 145 162 162 150 139 138 142 142 136 126 118 114 111 109 113 124 132 129 122 122 135 152 163
17295 163 172 184 201 219 231 237 236 225 211 205 216 243 274 297 306 301 285 267 254 244 228 206 182 163 152 148 156 179 210 236 245 237 227 227 236 243 236 219 203 198 202 208 208
17278 208 195 172 141 116 107 116 134 153 164 168 167 165 165 164 160 149 132 108 83 69 73 94 118 138 154 167 168 149 115 81 59 44 32 20 15 18 26 36 46 59 77
17262 77 96 108 111 114 128 162 213 266 305 321 315 298 280 265 251 236 218 199 182 167 158 157 167 188 209 219 216 211 211 210 197 169 135 111 104 110 120 125 120 106 90
17245 90 74 62 55 55 60 68 83 109 139 162 171 169 159 141 126 130 157 189 207 210 212 222 230 227 211 192 175 164 163 174 193 214 226 226 218 207 195 183 178 186 205 223 235
17228 235 244 256 270 281 287 286 274 250 222 202 195 195 198 203 209 209 195 168 140 119 112 121 140 159 172 178 185 202 231 266 293 302 289 261 228 197 167 139 117 100 87
17212 87 76 67 61 62 72 95 130 161 178 178 169 158 147 137 134 140 149 154 156 164 182 201 214 221 218 205 186 175 180 199 227 258 285 294 278 245 210 179 154 141 146 160 166
17194 166 154 132 113 103 101 101 99 89 68 44 30 37 59 83 100 108 116 126 140 155 167 172 171 167 171 188 214 239 259 279 296 300 284 256 231 215 202 191 186 191 199
17178 199 200 191 177 171 177 190 201 204 200 196 196 203 217 235 248 250 244 237 234 231 224 216 211 212 218 224 226 226 224 218 205 187 172 166 172 184 198 205 197 171 137 109 94 92 99 116 145 181 212
17158 212 231 236 229 210 175 129 87 63 61 71 82 91 100 109 114 110 94 69 40 21 21 38 62 84 103 118 133 149 168 189 207 215 208 190 169 157 156 158 155 146 133 118
17141 118 109 112 135 169 202 226 238 238 229 215 204 194 182 173 169 167 157 142 132 135 146 154 152 140 116 85 58 46 49 63 82 108 133 150 154 152 152 159 172 185 190 188 182
17124 182 178 178 180 179 176 173 176 190 212 236 261 288 318 346 365 373 369 351 322 292 272 261 252 239 225 210 189 169 158 164 187 216 244 265 276 279 279 278 278 280 284 286 278 258
17106 258 232 210 196 187 183 183 183 183 184 188 193 197 196 188 170 145 119 99 85 75 72 81 106 145 187 216 221 209 197 196 198 192 178 169 169 172 167 154 144 148 166 190 212 230 248
17088 248 266 281 288 283 266 245 232 233 244 255 256 245 222 191 161 143 140 147 153 156 154 148 141 141 154 179 207 232 250 258 259 257 261 267 263 239 203 172 159 166 187 215 244 271
17071 271 291 306 316 327 339 347 349 347 340 326 302 273 248 236 235 243 256 273 287 297 301 304 310 324 347 370 387 398 406 411 410 406 405 411 420 424 423 416 403 383 365 358 366 388 419
17053 419 449 469 475 475 479 486 488 485 484 491 505 524 555 602 659 712 755 795 841 893 940 972 988 995 1002 1015 1035 1054 1064 1064 1064 1073 1096 1124 1143 1142 1122 1096 1078 1076 1085 1091 1084
17035 1084 1059 1020 979 946 925 910 894 877 859 842 823 800 771 741 717 705 702 698 690 678 665 650 636 625 618 608 587 556 523 497 479 469 468 471 471 466 457 444
17020 444 420 388 360 350 354 362 365 362 351 329 297 265 246 242 253 274 295 306 302 291 287 294 309 323 335 345 356 363 361 346 324 304 289 277 267 259 253 246 237 228 222 220 219
17003 219 217 208 191 173 166 177 200 223 238 243 241 240 245 253 257 252 240 232 232 239 244 241 232 226 235 256 279 292 295 303 322 344 350 336 315 306 309 315 315 312 317 331 348 361 365 361 352 343 338 335 332
16982 332 334 344 359 368 365 356 349 347 348 351 355 354 343 322 298 276 259 247 233 217 201 193 194 197 196 189 178 164 147 134 128 134 146 159 168 171 170 173 188 210 229 237 236 231 226 218 210 205
16963 205 198 188 176 171 174 180 184 183 180 170 153 134 124 129 146 166 186 203 218 231 242 255 270 285 299 307 306 294 271 245 225 216 214 215 215 214 213 215 219 223 223 217 207 196 186
16945 186 184 192 207 221 225 213 185 148 112 91 89 97 104 107 108 109 111 115 123 134 141 140 135 133 134 135 134 135 141 155 177 204 230 251 264 265 253 228 196 169 156 156 168 189 214 238
16926 238 251 249 238 224 214 204 191 178 170 169 172 173 172 169 165 161 153 137 116 99 92 94 96 94 93 102 119 137 154 171 188 197 191 176 162 157 165 185 212 239 252 246 224 195 165
16908 165 140 126 128 151 189 231 262 276 278 276 273 272 276 288 303 309 302 285 263 236 205 169 133 105 92 100 125 152 174 190 202 209 213 215 214 203 174 134 100 86 94
16892 94 117 143 161 165 159 156 162 173 178 172 159 145 139 146 165 189 206 208 193 167 138 116 101 89 74 54 28 -2 -30 -48 -53 -53 -49 -37 -14 10 29 48 74 108 138
16875 138 158 170 176 174 165 153 136 109 72 36 14 7 12 28 56 88 115 131 139 145 150 153 155 155 152 152 160 177 196 210 216 211 200 192 200 230 269 297 307 305 298 287 270 248
16858 248 227 213 205 197 186 174 165 154 136 110 88 83 102 136 172 201 219 225 221 206 186 170 163 164 166 159 148 142 151 175 212 255 293 316 326 327 322 305 277 250 241 250
16841 250 260 258 243 224 210 202 197 188 175 162 153 147 142 138 142 155 166 169 168 170 176 177 164 143 121 106 97 98 109 130 154 174 189 200 209 215 220 221 215 195 164 129 101 85 82
16823 82 89 103 116 125 132 141 150 159 172 193 217 232 231 223 222 236 258 270 262 238 210 190 178 166 148 130 125 136 161 190 211 218 218 219 226 233 233 223 208 187 157 126 105
16806 105 98 99 99 100 108 118 123 117 110 109 117 128 136 142 152 170 197 226 248 258 263 270 276 273 260 240 220 197 170 143 118 97 86 92 117 151 179 197 205 206 198 182 166 153
16788 153 140 125 114 114 125 140 151 154 152 145 135 129 131 143 159 178 197 213 223 224 220 216 217 219 216 207 196 187 174 156 137 129 131 134 128 118 115 124 136 141 139 144 168 207 248 270
16769 270 263 228 181 143 126 128 133 128 113 97 86 79 74 76 91 118 147 166 177 186 193 191 176 155 136 126 124 121 111 95 79 69 63 59 61 71 87 102 110 112 116 128 147
16752 147 165 176 179 179 181 189 198 201 193 178 165 158 157 159 159 158 156 151 143 139 145 160 175 181 180 179 185 194 195 181 153 121 96 80 70 62 56 56 62 69 73 73 72 71 70 68 65 63 64 69 75 76 65 34
16730 34 -10 -56 -89 -101 -97 -83 -58 -23 17 55 84 104 114 115 111 113 125 145 167 185 192 185 164 137 113 91 71 56 55 68 82 88 85 81 77 73 67 61 58 63 76 89 90
16713 90 78 66 71 98 138 179 212 235 247 249 246 237 219 193 166 145 131 120 112 111 114 115 104 87 73 68 70 80 104 142 182 209 216 214 208 195 165 126 91 73 66 61
16696 61 56 54 57 64 73 87 106 130 154 175 195 209 214 205 189 181 193 221 251 270 278 274 260 235 204 171 142 119 105 101 103 104 101 102 113 129 144 158 179 207 231 239 231
16679 231 220 216 215 209 193 169 140 107 77 61 64 85 117 149 170 172 160 145 137 138 144 151 153 152 154 169 203 247 284 303 301 283 258 235 217 202 188 177 170 166 164 165 172
16662 172 183 191 188 179 176 185 202 216 222 221 220 219 214 201 188 181 182 186 189 186 178 164 148 129 105 73 46 36 48 75 106 135 160 181 193 192 176 152 131 125 131 138 135 121 99
16644 99 77 63 67 87 112 129 142 161 188 215 233 244 252 261 274 291 308 319 320 314 307 304 305 308 308 301 287 269 249 231 221 221 231 247 261 269 270 267 260 252 246 243 238 227 213
16626 213 205 204 201 190 172 161 162 177 204 240 277 302 308 296 278 261 249 242 241 248 265 294 332 365 383 386 383 380 380 378 375 368 357 340 318 291 265 243 227 219 218 226 237
16608 237 243 239 227 216 213 219 230 244 254 258 260 262 266 267 264 262 265 277 298 321 335 335 326 314 300 280 255 233 221 220 224 230 232 227 218 212 214 220 225 229 235 243 252 265 285 308 321 318 299
16589 299 268 235 210 201 214 244 278 299 298 279 252 229 210 193 176 161 154 158 172 190 206 215 215 207 191 172 157 149 149 158 178 208 233 241 232 214 195 175 155 139
16573 139 130 128 131 137 145 156 171 194 222 251 277 300 317 323 314 298 282 273 270 272 283 302 323 338 345 349 352 352 340 320 301 291 288 283 269 247 220 193 172 166 176 193 204
16555 204 202 194 191 198 215 239 271 312 353 381 388 376 359 343 332 323 320 325 338 353 366 375 378 373 360 345 331 324 325 331 337 338 332 325 323 331 347 359 357 345 336 337 340 332 309 282 265
16537 265 257 248 237 234 242 250 244 227 211 200 184 153 116 91 91 111 139 163 180 193 211 238 269 292 299 289 268 239 202 161 124 98 85 83 91 111 142 175 200
16521 200 214 222 231 248 269 293 318 343 366 385 398 399 381 344 305 285 289 304 313 313 312 312 307 294 277 268 270 272 268 257 249 251 263 282 300 310 305 287 267 254 253 259 269
16504 269 277 282 287 293 300 298 285 263 238 214 196 187 186 187 187 185 186 193 206 226 250 272 282 274 252 223 202 200 217 243 270 296 319 332 322 288 247 214 198 197 208 226
16487 226 243 253 260 265 266 261 253 250 252 254 254 256 267 289 316 339 355 360 352 337 321 311 310 313 319 329 342 352 352 342 328 310 286 257 234 227 233 240 239 236 238 239 230 209 185 173
16468 173 180 201 229 253 267 269 264 254 245 235 223 209 199 195 197 201 206 211 218 226 236 244 248 253 264 284 304 316 318 314 307 298 294 299 307 305 291 274 264 258 251 245 253 277 307 329 338 334
16449 334 323 313 310 315 325 340 357 374 387 393 393 388 383 380 376 366 346 317 291 277 276 282 289 293 294 296 298 297 292 284 279 277 279 285 296 309 325 341 352 353 342 321 295 270 251 241
16431 241 240 244 246 246 246 244 241 242 253 274 298 312 312 304 295 291 295 305 316 324 327 326 323 322 327 339 352 358 353 339 323 311 301 287 271 258 253 253 253 254 257 265 274 282 290 302 312 313 303 283
16410 283 260 239 222 209 200 197 199 208 220 233 243 250 253 255 263 278 296 309 317 324 333 345 354 359 362 367 381 404 425 438 443 447 450 450 444 437 432 428 424 423 430 444 458 466 471 476 482 487 491 495 495
16390 495 487 468 444 422 407 392 369 334 295 260 236 222 217 217 218 218 215 214 219 234 254 274 289 297 300 300 303 317 343 376 405 425 435 442 448 457 470 483 488 483 471 458 447
16373 447 432 412 390 377 377 385 392 388 372 348 326 312 310 318 334 351 361 360 349 332 311 287 263 243 227 204 170 132 108 106 122 146 174 202 231 257 281 300
16357 300 313 316 308 295 283 274 268 263 258 249 231 203 165 128 101 86 79 78 81 90 106 124 135 139 141 151 169 186 192 191 190 194 197 198 199 201 202 200 200 208 226 251 276 297 311 321 329
16339 329 334 332 324 320 331 354 376 383 370 343 312 290 286 300 322 334 326 298 266 243 234 230 223 210 192 177 173 186 214 242 259 262 252 231 203 178 162 155 149 139 128
16322 128 119 116 121 133 148 159 168 180 197 208 205 193 184 186 201 224 252 277 296 306 306 297 280 261 242 222 203 187 179 174 167 157 146 135 119 99 78 58 40 30
16306 30 39 71 110 137 144 141 141 145 148 146 145 152 170 195 220 234 228 205 173 142 119 106 107 122 144 160 164 157 149 145 147 149 146 137 132 139 154 164 164 164 178 198 208 198 177 156
16288 156 145 143 152 169 188 199 196 184 173 171 180 194 204 208 211 210 206 200 201 215 236 252 256 250 239 227 220 220 229 241 248 248 244 243 247 248 242 228 212 202 201 204 207 204 193 177 156 135
16268 135 118 108 106 113 127 147 170 191 212 236 263 285 299 302 297 288 273 257 241 228 219 217 223 228 220 193 155 121 100 88 79 66 50 32 15 4 6 21 49 89
16252 89 138 188 227 247 249 242 235 231 232 233 229 216 199 191 198 213 224 229 233 235 234 231 238 258 274 271 250 232 233 252 274 282 272 254 241 235 229 220 213 213 218 219 213 205 202 204 206 207 209 214 216 207
16231 207 188 167 151 143 141 148 167 194 218 231 230 220 211 211 223 242 255 252 235 210 187 169 157 152 156 174 202 229 243 239 225 211 207 222 259 305 344 358 347 321
16215 321 288 252 213 174 136 101 73 60 63 75 87 93 95 97 98 97 92 89 92 98 106 118 135 156 171 182 199 231 267 289 291 282 272 262 247 227 204 184 170 163 162 163
16198 163 163 162 162 160 157 151 145 141 145 155 168 181 193 203 213 227 244 256 255 244 232 228 225 217 204 194 188 185 184 185 185 180 168 156 146 139 139 146 156 162 158 145 125 101 80 69
16180 69 75 94 112 123 127 125 118 106 88 68 52 46 49 61 84 118 154 178 187 187 183 177 169 165 166 172 181 196 223 254 282 303 322 340 348 341 317 285 256 235 225 224 230 237 241
16162 241 237 228 220 216 213 209 204 207 221 242 258 264 262 255 247 236 224 212 200 189 175 155 130 105 88 84 92 110 129 139 140 138 139 140 137 129 119 106 94 88 91 103 114 120 125 134 145
16143 145 154 159 166 179 195 205 204 190 165 132 99 77 69 71 74 78 83 87 88 90 100 119 141 161 173 178 177 175 174 172 167 159 153 151 148 135 112 82 59 55 75 109 145 176 207 241
16125 241 271 289 297 304 318 339 358 370 368 355 337 317 297 274 252 238 231 229 230 232 235 240 245 246 236 218 201 191 185 172 154 141 140 149 154 151 140 129 123 129 146 163 168 158
16107 158 142 129 119 107 90 78 79 92 107 114 113 105 97 95 101 109 113 112 113 121 133 144 156 173 192 210 224 237 244 240 223 197 167 140 121 115 123 141 167 199 230 251
16090 251 258 253 245 240 242 250 257 255 240 218 197 182 179 186 199 210 214 212 208 210 216 226 237 249 267 289 306 309 299 285 275 268 265 273 290 306 311 309 309 313 312 304 296 292 289 283 276 273 277 286 294
16070 294 297 291 278 266 265 276 296 315 326 327 319 305 284 260 240 229 228 224 205 172 138 120 118 125 131 136 146 168 194 211 211 199 183 169 159 153 150 153 162 172 177 174 166 160
16052 160 158 154 145 136 134 140 148 150 148 146 144 142 140 144 158 184 213 240 256 261 255 240 220 200 191 196 209 221 229 235 242 252 259 262 258 252 248 248 248 245 238 236 245 259 270 271 262 251 247 251 260 263 251
16031 251 222 186 161 152 159 171 182 190 199 213 233 258 284 305 317 323 328 334 340 337 320 295 273 266 277 299 317 325 326 327 331 337 339 329 304 269 235 211 195 184 182 195 222
16013 222 255 284 302 312 319 324 322 311 295 282 274 272 277 293 319 347 370 389 404 413 416 417 426 442 458 469 476 477 471 458 448 445 448 452 458 472 494 521 547 568 582 590 601
15996 601 629 681 754 840 935 1040 1165 1320 1508 1736 2005 2319 2671 3044 3405 3717 3939 4044 4019 3872 3627 3322 2999 2687 2399
15986 2399 2140 1916 1728 1566 1414 1269 1144 1047 972 909 854 812 781 754 723 685 641 600 571 563 567 571 565 551 533 512 485 450 413 377 348 326
15973 326 308 293 279 267 254 245 245 256 273 282 280 275 281 298 317 326 325 320 316 314 313 313 317 329 341 347 342 328 314 305 303 308 317 327 337 347 355 355 345 328 313 309 313 316 310 296 280
15954 280 265 251 241 241 250 257 253 241 233 237 249 262 268 265 253 233 216 210 218 231 238 233 221 215 220 228 224 204 173 140 114 103 108 123 135 138 138 141 145 146 145 143 141 138 132 120 106 96
15935 96 99 115 140 161 175 180 178 169 162 158 157 149 132 115 105 101 101 103 115 139 168 190 198 197 197 201 204 199 189 180 172 159 143 128 117 111 112 123 143 162 174 180 184 188 192 197 210 232
15916 232 256 268 263 248 242 259 294 331 351 350 333 315 303 302 309 321 336 350 357 356 349 341 331 316 293 267 247 233 225 215 205 198 198 201 201 198 201 212 228 240 251 265
15899 265 276 274 251 217 186 171 173 187 199 195 176 151 130 112 97 88 92 109 134 163 193 220 236 241 235 219 193 161 132 108 91 84 91 106 120 126 126 119 109 100 97
15882 97 100 105 109 114 120 122 122 125 132 137 130 113 97 90 90 88 76 58 41 30 30 38 50 58 59 55 51 57 73 97 120 136 141 140 140 150 168 186 196 194 187 178 168 154 136 121 116 127 148
15863 148 171 190 204 218 237 263 291 306 300 279 259 246 235 221 209 211 225 239 247 251 258 271 281 282 272 262 258 259 258 249 241 241 250 258 262 264 263 256 243 227 216 213 216 225 238
15845 238 251 260 268 275 281 285 284 278 268 255 246 247 259 271 276 268 249 223 197 177 166 163 163 168 182 207 230 240 231 212 192 178 178 194 224 255 273 276 274 274 277 281 282 277 268 259 253
15826 253 249 244 240 237 227 200 164 141 145 174 211 242 263 275 276 268 256 244 234 230 231 235 236 230 216 194 168 149 150 174 205 230 240 241 237 228 214 193 168 143 122 108
15809 108 102 110 131 162 190 208 218 225 228 225 216 207 201 193 180 165 156 157 168 186 205 222 228 222 206 187 170 156 148 145 141 135 129 126 126 129 133 140 147 147 137 120 104 93 88 88 89 90 97
15789 97 115 145 179 207 226 241 253 261 260 250 231 207 192 196 221 251 269 267 248 219 189 165 156 165 188 216 243 264 278 288 296 300 298 289 280 276 280 288 301 321 348 373
15772 373 384 374 350 326 312 312 316 313 295 259 213 173 155 160 178 197 212 221 224 218 212 212 214 211 197 180 167 162 163 168 178 188 192 187 176 165 163 173 188 199 203 204 209 221
15755 221 237 258 286 319 354 385 409 427 439 445 446 438 416 379 333 287 252 235 239 256 277 293 299 297 289 280 273 270 268 265 261 252 241 230 226 229 239 253 267 277 283 285 281 268
15737 268 243 212 186 175 178 187 194 199 208 222 236 240 234 226 228 243 261 266 253 226 197 172 155 147 148 154 160 163 165 170 185 206 224 230 219 195 169 148 138 135 142 156 178 202
15719 202 220 225 218 206 196 187 177 169 166 176 198 224 241 241 225 205 188 181 179 179 178 175 174 178 187 196 199 194 188 188 192 195 192 186 182 182 182 178 167 154 142 132 123 117 110 104 103 110 122 135 147
15699 147 162 184 208 226 238 248 262 275 282 274 254 232 220 220 227 229 226 217 203 182 158 138 130 134 144 157 170 181 191 204 222 238 243 239 230 217 197 172 152 150 167
15682 167 192 212 216 204 183 160 142 131 129 142 167 199 228 247 255 255 251 248 245 242 238 225 203 179 163 159 163 164 164 163 163 160 157 163 181 203 217 220 217 214 211 205 193 177 160 147
15664 147 143 147 156 168 175 177 174 174 186 213 252 293 324 334 321 297 275 257 243 236 241 256 273 284 289 289 282 270 262 269 286 300 300 284 262 243 231 225 221 220 225 240 261 281
15646 281 297 310 318 317 308 297 289 282 267 242 213 191 182 187 200 216 235 255 270 278 284 292 296 288 270 257 256 261 258 246 231 222 224 238 260 280 287 279 264 248 235 227 226 226 216
15628 216 196 174 162 166 185 216 251 286 317 342 358 361 354 341 325 308 294 286 284 281 272 260 250 241 226 211 210 225 249 268 286 308 333 348 344 327 310 298 295 298
15612 298 303 303 295 283 276 275 276 277 279 278 270 255 242 235 233 229 220 211 205 202 198 193 188 185 181 175 168 164 169 183 201 221 242 262 275 279 286 297 306 304 292 285 287 292 294 297 308 326 340 340 324 298
15591 298 277 269 273 276 271 261 251 245 240 237 238 238 233 219 204 193 188 194 207 222 232 237 242 247 245 233 219 207 197 190 186 187 189 192 202 226 257 284 301 311 317 316 304 288 277 281
15573 281 296 313 325 329 330 329 327 321 314 307 296 270 224 170 124 95 82 79 85 99 114 124 133 147 169 193 214 230 247 263 275 284 299 320 342 360 374 384 388 381 365
15556 365 340 308 277 258 255 260 259 243 216 190 176 178 187 190 178 154 131 121 126 138 142 133 118 111 114 119 122 129 149 174 187 180 161 146 142 146 154 164 176 188 198 201 197 191 190
15538 190 195 205 221 248 282 314 334 339 332 318 306 303 306 307 302 296 290 284 274 263 257 253 247 237 226 217 208 199 193 186 176 162 148 139 133 132 140 158 179 194 203 208 209 206 201 198 201 210 225
15519 225 249 278 306 323 325 314 296 275 257 244 238 235 231 224 217 213 214 217 218 216 210 197 177 149 116 81 47 18 -3 -17 -25 -28 -27 -26 -24 -19 -8 9 31 52 66 71 68 62 56
15501 56 54 60 73 89 100 106 112 121 136 155 174 185 182 166 148 132 119 108 103 105 110 117 128 147 168 184 188 181 168 153 140 125 105 81 62 56 64 82 108 139 164 174
15484 174 173 171 173 178 182 188 197 211 228 248 265 273 267 250 226 197 166 141 130 130 135 140 148 156 159 154 145 139 136 130 116 93 68 50 44 50 60 69 76 83 92 102 106 103 96 90 88 86 85 91 108
15463 108 131 153 175 201 233 263 281 285 279 265 248 229 208 187 168 156 154 155 151 140 133 139 157 179 194 196 188 177 173 181 192 198 194 185 178 176 182 193 206 214 214 203 183 158
15446 158 135 125 135 159 185 203 212 216 213 201 184 167 154 147 148 161 184 212 241 266 278 276 269 269 280 294 302 302 297 287 275 271 280 296 309 313 312 312 313 309 298 286 278 271
15428 271 260 247 242 253 271 282 280 270 265 269 280 299 325 349 361 358 349 339 326 304 276 251 234 223 211 199 192 191 191 184 170 159 157 164 176 190 207 224 238 245 249
15411 249 255 261 261 252 235 217 203 195 192 190 190 197 216 245 272 285 282 271 259 248 236 223 212 205 204 205 207 205 198 187 174 161 146 131 121 123 136 153 163 164 160 160 168 180 191
15393 191 197 197 188 169 147 132 129 133 139 145 158 179 203 226 240 244 235 218 203 193 187 178 164 142 115 91 80 86 104 121 133 142 157 177 202 226 249 266 275 272 259 246
15376 246 239 240 244 247 251 263 283 301 306 293 271 253 243 234 216 185 150 120 102 95 97 107 122 132 133 128 125 128 134 137 136 141 156 181 208 229 241 241 232 223 225 235 244 243 233 223
15358 223 215 206 191 171 154 147 151 163 176 191 211 238 265 286 296 299 301 301 300 296 291 286 283 287 301 322 343 363 381 394 395 382 359 333 309 290 274 263 260 266 279 292
15341 292 294 283 265 252 252 265 284 296 293 281 269 265 266 265 260 254 252 254 256 257 258 262 270 281 289 286 270 245 217 191 173 167 171 176 176 173 174 180 187 192 196 200 202 200 194 181 160 137 125 131
15321 131 151 172 189 198 193 177 161 157 162 166 159 146 133 125 126 139 159 175 179 173 162 154 151 156 168 184 204 226 241 238 213 180 153 139 141 160 190 216 225 219 215 221 235 245
15303 245 242 222 188 152 128 120 117 116 121 139 165 187 203 216 228 237 241 243 246 254 271 294 316 327 329 323 308 285 260 244 242 245 240 218 183 144 116 103 102 106 116 133 153
15286 153 171 189 205 217 220 220 228 244 259 263 257 247 240 240 249 264 268 252 221 189 167 155 151 152 155 157 156 152 143 131 118 107 94 80 73 82 105 126 137 145 157 174 190 205
15268 205 220 233 241 245 245 237 219 193 164 138 117 103 96 90 82 73 65 60 57 54 50 44 38 39 50 67 86 108 136 164 177 177 175 184 200 214 223 226 221 208 192 185 189 201 216 228
15250 228 231 221 202 183 174 172 176 183 192 203 211 218 225 231 234 233 225 209 190 174 171 180 193 198 192 180 165 149 134 126 133 149 163 165 157 147 140 133 124 112 103 102 115 143 182 224 254
15231 254 269 274 277 280 281 278 272 268 265 263 259 253 245 234 217 196 175 163 159 156 147 131 120 121 128 136 139 137 130 122 117 124 142 161 167 160 145 134 129 127 121 108 92 85 98 131 169 194 200 191
15211 191 175 155 134 119 114 118 130 145 162 175 180 185 202 240 292 344 380 388 364 318 271 240 227 225 227 235 250 266 274 269 258 246 235 228 227 235 249 263 272 276 279 283 289
15194 289 300 316 335 352 364 370 362 331 282 233 204 202 213 223 223 215 201 186 177 174 175 176 175 173 170 171 179 194 209 215 213 211 214 225 240 259 278 295 308 319 331 344 356
15176 356 362 359 350 342 334 323 309 298 299 306 308 304 300 301 300 288 265 239 219 208 206 212 218 217 214 215 222 226 219 209 204 205 206 201 190 179 174 176 183 190 196 203 206 197 177 161 161 177 199 222 246
15156 246 266 272 263 250 243 240 237 237 242 245 238 223 214 216 223 233 247 262 269 264 256 255 266 278 285 285 281 278 277 270 254 234 223 228 239 243 241 242 250 258 262 268 277 286 288 286 279 266 243 213 184 160
15135 160 140 125 117 116 117 121 125 131 138 144 149 150 144 135 128 125 131 145 163 179 188 193 197 199 194 183 177 181 194 211 231 251 265 268 257 235 206 179 157 147 146 154 166 180 194 212 237
15116 237 264 287 299 306 312 316 315 309 303 297 284 262 237 218 211 217 233 251 263 267 267 271 277 285 289 286 279 271 271 282 298 314 329 339 339 327 306 284 266 253 241 228 217 212 219
15098 219 237 254 257 245 227 213 202 188 175 169 174 179 173 155 128 100 76 66 75 99 126 145 156 168 185 199 204 203 206 219 238 254 254 234 199 166 148 151 162 171
15082 171 176 182 195 210 224 234 244 256 270 282 289 293 297 299 293 277 255 236 219 201 183 171 170 175 178 175 169 169 176 190 207 223 231 227 214 199 189 181 168 150 135 132 142
15065 142 162 188 213 226 226 218 213 210 202 189 173 156 139 128 130 144 159 168 172 178 182 180 174 171 170 170 171 175 180 178 169 162 161 166 173 182 198 223 252 273 277 264 249 244 245 241 230 221 220 226
15045 226 230 233 234 231 225 222 226 232 232 224 215 205 198 196 205 217 218 202 179 162 156 159 168 182 202 229 261 291 314 328 336 338 329 309 282 258 243 233 221 206 191 181 179 180 185 197
15026 197 213 227 230 229 227 222 207 183 157 141 140 156 184 215 235 239 231 213 185 151 123 104 93 91 101 125 153 176 191 203 213 221 229 239 251 264 281 299 311
15011 311 308 292 273 259 247 239 236 233 229 226 228 232 228 217 210 212 214 207 189 166 146 140 154 184 212 222 213 194 173 153 136 123 115 113 121 143 177 211 234 242 235 218 197 176
14993 176 158 147 144 147 155 167 185 204 215 211 197 182 173 171 175 179 174 155 132 117 113 113 111 110 115 130 149 165 169 160 150 151 159 164 159 152 155 169 190 211 224 225 213 194 176 163
14975 163 159 168 188 211 226 228 216 196 178 171 175 182 184 179 170 162 161 168 183 198 209 213 212 205 196 191 200 223 247 257 252 240 234 239 250 260 268 272 273 269 261 258 267 290 318 339 341 322 296
14955 296 279 282 293 295 283 266 251 236 213 185 159 138 118 98 84 82 92 106 117 122 121 118 113 108 107 114 130 146 152 147 139 134 130 126 123 128 137 142 136 120 99 77 56 37 25
14937 25 24 35 56 77 91 99 110 132 163 196 221 230 219 197 176 170 180 195 205 211 222 241 262 272 264 244 223 207 193 174 153 141 147 166 181 181 168 159 168 194
14921 194 226 251 266 273 279 282 281 272 255 230 193 147 108 90 95 107 111 110 119 147 187 224 253 277 298 316 330 340 344 340 334 333 340 347 341 319 285 249 221 207 205 212 229
14903 229 256 286 309 317 312 297 276 249 217 186 164 154 159 175 194 210 218 223 230 241 252 262 271 282 293 300 306 316 335 355 361 349 326 302 283 268 256 243 228
14888 228 211 196 183 172 160 149 143 144 148 151 151 151 154 161 167 168 161 151 141 131 123 120 128 144 162 178 190 196 195 189 187 196 212 227 232 228 218 208 199 188 175 166 169 187 217 255
14869 255 299 340 370 386 386 373 351 324 299 277 259 249 248 254 261 266 272 276 271 256 238 222 210 202 202 209 217 218 218 226 240 248 246 241 242 248 251 246 230 210 192 188 199 218 240 261
14851 261 284 308 334 363 396 429 454 463 459 446 429 409 389 374 367 363 356 342 322 297 270 240 214 197 185 171 152 130 110 96 85 78 73 69 65 62 63 67 75 87 103
14834 103 127 160 200 236 251 239 207 169 139 125 129 151 180 203 211 210 209 209 207 202 198 193 187 181 184 200 223 241 248 246 244 246 250 252 253 255 260 267 271 269 252 221 185 160 149 145 139
14815 139 135 140 151 159 157 150 144 143 150 168 193 212 215 198 167 127 82 38 6 -8 -6 12 42 76 102 117 123 126 129 137 150 162 168 168 165 161 161 167 181 195 201 199 195 193 188 175 162
14797 162 161 173 191 204 208 206 202 194 183 168 154 148 154 169 191 211 219 212 198 190 194 204 210 214 222 237 257 281 304 316 309 284 250 215 181 150 131 125 124 119 110 104 105 107 100 83
14778 83 62 52 60 86 119 149 170 187 204 217 221 220 221 230 243 252 258 266 272 270 258 244 237 236 233 225 211 196 187 188 205 230 251 258 249 227 197 171 157 160 175 193 208 218
14760 218 226 233 236 233 231 234 240 243 238 235 245 260 264 250 225 202 188 181 178 174 174 184 212 248 275 282 275 265 257 248 240 233 229 225 228 241 259 272 271 256 233 209 192 179 164 143 121
14742 121 107 102 106 118 135 147 139 113 85 69 65 62 56 47 38 29 26 32 50 74 99 121 142 164 184 196 201 200 195 184 171 165 168 172 168 156 143 137 144 163 188 205 205 193 183
14724 183 183 189 202 221 242 256 256 246 232 211 186 169 170 185 201 210 214 217 221 223 221 214 205 201 205 219 239 261 277 285 283 277 269 254 232 215 210 213 208 188 159 130 107 96 98
14705 98 111 127 137 140 137 130 127 130 143 162 185 208 225 234 239 252 275 301 319 322 308 281 252 232 226 230 233 230 223 216 213 223 244 273 300 323 338 344 343 337 331 325 323 330 346 364
14687 364 370 358 333 305 287 281 283 286 284 279 270 256 242 239 251 269 281 287 292 297 293 276 248 214 176 142 120 115 122 135 150 166 180 190 197 199 197 192 188 187 188 186 184 184 188 191 193 200
14668 200 216 245 280 311 325 316 291 261 235 217 205 192 173 152 137 132 140 158 188 224 254 264 258 251 252 258 262 265 271 280 279 263 237 211 186 158 127 98 77 67
14652 67 67 75 90 111 138 168 194 212 217 206 178 139 100 78 80 97 115 127 135 140 142 140 137 127 110 89 72 62 56 51 50 57 66 72 79 94 115 134 139 134 125 119 120 130 148
14634 148 170 190 209 228 248 267 282 294 303 307 309 311 312 312 303 283 252 220 193 174 161 153 151 156 165 175 189 204 212 208 197 192 195 200 199 195 196 208 228 244 242 219 188 163
14616 163 151 148 143 133 123 119 121 127 134 142 155 170 183 184 171 146 121 102 92 87 85 84 86 90 95 95 94 97 107 118 125 126 128 132 141 156 173 186 189 187 190 197 198 186 167 156 159 173
14597 173 183 178 159 136 120 113 115 123 135 150 169 198 241 291 327 338 326 305 282 261 250 253 270 291 304 307 307 312 328 351 370 375 362 332 292 254 229 224 235
14581 235 254 275 291 296 288 268 248 236 231 231 230 230 234 246 264 280 285 275 256 235 219 213 217 223 221 205 182 168 168 171 165 145 123 106 94 85 81 90 113 142 163 176 184 197
14563 197 217 239 258 269 274 277 281 287 295 309 325 334 324 297 270 255 254 262 273 284 298 316 334 341 329 300 268 245 227 210 195 186 182 175 159 138 117 101 95 106 129
14547 129 160 194 232 271 299 312 315 317 322 325 317 299 276 258 251 253 255 258 268 290 314 321 305 276 246 222 204 189 172 151 128 109 100 96 93 89 91 102 116 126 129 132 137
14530 137 142 143 148 165 194 223 238 235 223 207 186 162 143 140 149 160 161 150 137 130 132 139 145 149 151 153 152 146 135 125 119 124 138 164 196 225 242 243 237 237 246 256 258 253 246 242 237 225
14510 225 209 196 193 204 228 259 290 310 312 296 274 257 254 259 262 255 240 229 228 234 235 233 236 251 271 285 286 280 271 258 243 231 229 238 249 257 264 275 288 297 293 276 254 239
14493 239 235 240 249 259 268 269 263 263 279 308 335 349 350 348 346 346 346 342 333 315 292 264 233 202 182 175 174 174 181 203 236 262 273 273 270 265 256 246 240 239 240 244 252 262 268 269 264 255 240 219
14473 219 194 170 153 146 152 166 185 210 237 261 271 268 261 260 267 274 274 265 254 250 253 257 257 255 257 270 287 302 311 314 312 302 284 264 250 241 231 212 192 181 184 197 212 225
14455 225 237 244 247 249 253 261 270 275 271 254 228 204 190 186 184 181 176 165 150 143 154 184 221 251 266 260 237 207 186 181 185 188 185 178 167 154 141 134 132 134 137 144 151 157 164 179 205 240
14436 240 277 309 332 348 357 362 358 348 334 319 301 278 255 241 241 249 255 252 239 220 197 174 157 153 163 181 197 209 227 256 292 323 340 341 329 312 297 293 297 302
14420 302 305 309 311 305 292 275 257 237 217 207 210 215 210 192 173 167 178 201 226 242 244 240 238 241 242 238 230 217 198 175 160 156 158 159 157 155 149 137 122 112 115 130 155 186 218
14401 218 240 238 212 174 142 126 125 128 131 133 136 140 144 150 155 159 158 150 140 135 142 161 187 213 235 248 250 241 230 219 208 197 191 195 210 228 240 247 252 254 250 243 235 224 206 180 150
14383 150 128 119 127 148 172 190 199 200 198 194 190 191 199 215 234 251 257 248 226 201 180 164 150 138 131 129 129 132 144 167 194 221 245 266 278 275 251 210 163 117 82 61
14366 61 53 59 78 106 137 164 186 207 227 240 240 226 208 195 192 197 206 217 225 229 230 229 224 216 209 214 235 267 295 312 325 344 370 394 407 409 401 386 366 348 341 346 357 368
14348 368 378 387 388 383 376 372 369 360 343 326 314 307 300 294 291 291 296 305 319 342 372 404 426 424 397 354 314 287 280 291 313 338 360 376 386 389 382 362 333 301 273 252 243 244
14330 244 248 251 252 256 259 256 242 222 207 207 224 253 280 297 299 289 272 253 234 221 217 221 228 233 234 233 233 237 250 268 284 291 287 274 258 241 224 210 202 199 202 209 217 224 230 235 242 247
14311 247 246 235 214 189 162 137 114 94 79 70 70 78 93 114 139 165 188 200 200 197 200 212 229 245 258 268 274 279 282 277 261 237 221 221 233 250 264 271 269 263 260 262 268
14294 268 274 280 283 275 252 228 215 209 202 192 189 198 210 222 237 256 272 277 275 271 261 243 224 214 215 224 233 243 247 238 213 181 157 149 154 156 148 137 140 165 199 227 247 264 281
14276 281 296 307 316 320 315 303 296 300 314 331 348 358 352 334 318 315 316 313 304 296 291 285 277 273 280 295 315 340 365 383 387 374 350 322 296 280 278 291 310 325 328 324 322 327 338
14258 338 348 358 366 366 352 327 301 281 265 251 239 231 224 218 212 207 204 200 189 172 150 132 126 136 157 182 203 219 230 237 239 239 238 237 234 226 215 207 210 226 247 266 281 292
14240 292 300 304 304 302 304 308 316 329 345 358 367 373 380 388 389 382 374 371 372 372 368 358 337 304 264 227 198 178 168 174 199 232 266 293 312 318 311 298 291 289 283 271 258 248 237 224
14222 224 213 210 210 209 207 207 208 207 206 202 192 178 169 172 182 189 178 147 102 53 13 -11 -22 -22 -9 14 43 68 89 112 139 162 171 161 143 130 133 150 172 191 205 216
14205 216 224 230 240 254 270 279 275 254 224 198 184 182 185 187 185 185 190 201 215 228 237 243 246 245 239 233 233 238 241 237 233 236 248 258 255 237 213 191 177 174 178 188 202 215 222 224 222 220 218
14185 218 216 215 215 214 210 205 202 199 191 181 181 203 247 299 338 349 334 307 289 289 303 324 343 356 362 364 365 368 377 393 413 427 423 398 358 318 290 282 291 307 320 328 335 343 343 334
14167 334 318 301 282 257 225 194 170 158 157 164 177 198 226 256 279 290 294 297 301 304 306 303 290 270 250 240 239 237 233 233 245 270 300 326 335 326 310 299 296 294 290 289 293 299
14149 299 299 296 293 287 274 257 242 234 231 229 227 223 221 226 240 255 261 254 243 238 244 258 278 301 320 327 321 307 298 302 314 319 306 280 250 226 208 195 185 176 164 149 133 120 115
14131 115 122 141 166 188 204 212 216 215 211 204 195 183 168 151 135 118 102 91 91 106 129 155 181 205 225 238 246 257 270 279 274 259 240 218 193 168 154 160 183 207
14115 207 221 218 198 169 139 116 103 96 89 76 58 41 39 56 83 102 107 104 106 119 144 171 192 197 191 182 182 192 205 218 230 243 255 261 264 266 274 291 314 334 340 327
14098 327 302 281 267 255 235 209 186 174 174 183 201 222 245 263 274 276 269 256 237 216 197 187 189 199 213 233 262 295 321 328 319 301 278 254 232 216 203 194
14083 194 191 196 205 212 216 220 226 232 236 237 232 218 200 191 201 226 251 269 283 296 308 308 296 278 260 237 206 173 154 159 179 197 206 208 206 201 193 182 170 160 154 155 156 153 151 162
14064 162 184 206 217 217 216 219 225 232 237 241 240 234 222 214 218 235 256 266 259 245 237 238 244 253 262 269 276 281 288 294 296 297 299 303 307 305 301 298 299 299 288 261 225 193 181 190 213 234 240 227 205
14044 205 191 195 217 247 274 289 289 280 272 271 271 262 245 229 224 230 244 258 265 262 247 225 199 174 154 143 145 156 166 166 159 153 151 147 132 109 87 76 76 88 108 132 149
14026 149 155 155 156 159 162 158 148 133 126 140 175 218 251 269 282 294 301 299 287 273 268 276 296 311 305 272 223 181 160 158 167 182 202 223 239 247 251 257 264 270 277 289 302 309 312
14008 312 317 326 333 326 307 288 270 254 237 226 226 234 248 266 281 287 281 269 264 271 288 304 311 306 298 296 299 300 299 303 320 346 368 373 361 339 314 291 270 258 259 273 289 292 284
13990 284 280 284 291 291 282 271 264 265 277 291 295 285 267 252 240 229 221 212 196 169 140 126 126 132 141 157 183 207 220 225 230 241 258 278 295 300 290 269 243 214 183 153
13973 153 127 108 101 109 134 169 207 241 265 278 282 285 288 289 292 304 322 335 335 325 314 304 287 264 240 222 210 204 207 221 244 269 290 300 296 280 258 237 221 216
13957 216 217 216 205 189 182 192 213 233 250 265 276 286 298 313 325 327 321 318 320 322 323 330 348 374 395 400 385 357 331 318 322 337 346 339 321 303 296 299 305 308 300 280 250 217
13940 217 192 177 168 160 153 151 155 165 181 200 217 229 234 236 238 242 246 250 254 260 273 290 304 305 288 262 240 230 231 239 253 272 296 322 351 383 417 452 480 491 477 440
13923 440 393 352 323 302 285 274 274 283 294 304 315 329 340 343 342 338 330 315 294 274 259 251 248 246 239 223 201 177 154 133 115 107 107 110 116 127 145 168 189 204 211 214
13906 214 215 211 202 189 176 164 154 148 146 153 169 198 233 268 290 296 293 288 284 278 269 262 260 261 262 270 288 314 338 354 367 383 400 414 421 420 417 412 406 399 394 393 397 403 409 416 423 431 437 438 431
13886 431 423 421 427 435 434 425 415 409 407 407 416 437 460 474 476 472 468 464 461 460 461 459 452 438 420 397 373 358 355 364 380 398 413 422 426 431 442 457 468 471 466 458 455 463 486 518 552 585 614
13866 614 633 633 616 597 596 617 652 686 710 721 732 752 790 841 897 947 988 1024 1057 1087 1107 1115 1119 1130 1155 1193 1242 1303 1370 1439 1509 1577 1642 1698 1744 1789
13851 1789 1839 1898 1959 2015 2066 2122 2192 2281 2377 2467 2540 2597 2642 2676 2703 2727 2753 2777 2792 2791 2774 2745 2712 2677 2638 2589 2534 2480 2432 2390 2349 2305 2260 2211
13838 2211 2153 2085 2006 1924 1845 1772 1700 1621 1536 1450 1368 1294 1228 1177 1136 1099 1059 1022 995 980 971 957 937 909 877 847 822 800 777 755 739 731 728 728 728 729 724
13823 724 714 700 687 670 641 604 567 540 524 512 502 495 491 487 479 472 469 469 465 455 439 420 398 378 370 380 399 408 399 381 365 359 363 378 398 417 429 433 428 416 401 392
13806 392 396 407 419 428 433 432 426 425 431 433 416 377 332 296 278 278 296 325 358 384 398 394 371 333 295 271 271 287 308 323 334 346 358 369 381 405 441 474 489 483
13790 483 466 447 425 401 377 359 357 377 417 465 501 516 515 504 490 479 478 485 491 487 476 463 446 419 387 358 340 334 337 340 336 319 299 291 300 313 316 302 281 261 244
13773 244 230 222 225 241 270 302 323 327 315 286 245 201 168 158 169 189 205 212 211 208 211 222 234 238 236 235 247 274 308 335 347 345 331 310 285 258 231 207 189 180
13757 180 182 192 206 219 228 232 229 221 212 207 205 203 204 209 219 233 248 265 283 298 303 300 292 282 273 267 261 254 244 233 220 210 205 207 210 207 196 185 182 189 198 205 210 217 228 244 264 280
13738 280 286 280 269 255 243 233 228 231 238 240 231 212 196 190 196 207 219 229 240 253 268 281 290 293 293 297 305 310 304 285 266 253 247 239 228 217 212 219 231 239 239 230 216 192 159 119
13720 119 85 67 67 81 101 116 123 129 136 141 142 144 155 176 195 206 213 220 224 217 199 179 166 161 160 164 171 180 191 204 214 219 221 229 248 277 305 323 330 335 344 357 368 371 365 348
13701 348 323 292 258 227 205 200 211 233 253 267 275 284 294 298 292 276 257 240 230 225 223 227 243 272 300 319 328 337 347 356 358 351 337 317 296 276 259 242 224 208 195
13685 195 187 187 196 206 210 204 193 182 175 175 182 194 204 208 210 215 220 220 215 208 202 194 187 186 192 203 215 230 251 276 298 306 297 278 261 250 244 240 237 237 236 232 226 222 222 226 234 243 250 251 248 241 229
13663 229 212 194 179 171 170 175 188 207 225 232 227 223 234 263 300 333 357 371 374 362 338 313 290 264 232 199 176 162 151 141 137 146 163 178 187 194 210 235 259 268
13647 268 261 245 226 204 180 160 149 148 155 171 193 212 222 230 238 240 224 197 176 172 177 184 191 195 189 170 149 139 142 150 155 159 166 178 197 226 258 283 296 298 294 283 268 251
13630 251 237 227 223 224 230 234 231 218 200 186 183 192 208 221 225 216 195 168 141 124 124 140 163 179 182 178 175 171 167 165 166 170 176 189 216 250 277 290 296 305 319 330 333 331 323 309
13611 309 286 256 229 213 209 206 198 192 198 213 226 231 235 244 258 277 297 312 311 294 273 260 259 263 270 280 285 285 283 291 304 311 305 293 281 276 275 274 265 249 234 233 242 248 243 233 225 220
13592 220 215 211 208 206 199 194 196 206 216 220 222 222 216 203 189 188 212 255 302 338 362 377 389 399 406 407 398 383 368 361 363 366 361 339 305 267 233 205 179 154 136 130 135 145 155
13574 155 163 172 181 193 205 212 210 199 183 168 157 153 159 171 189 217 252 285 300 294 274 251 235 231 236 242 236 217 196 186 187 190 190 187 189 200 214 223 225 226 231 239 241 237 236 242 253
13555 253 261 260 247 226 207 198 200 206 209 208 204 202 207 223 242 252 245 231 221 220 225 235 248 260 264 257 241 221 204 197 205 224 246 269 288 296 289 279 278 286 289 280 266 255 243 223
13537 223 196 172 151 129 103 79 61 51 53 73 110 156 200 233 251 255 248 235 220 203 187 175 171 172 171 161 144 130 125 126 123 111 89 64 43 35 46 75 121
13521 121 176 232 280 312 327 326 315 298 279 265 252 237 218 199 185 178 180 188 200 213 219 213 200 186 177 169 155 136 123 124 137 147 145 138 138 153 177 198 210 216 220
13504 220 226 236 249 267 286 301 307 309 310 307 298 291 300 323 346 354 346 332 315 297 276 251 220 188 163 152 155 169 191 214 229 231 227 228 236 245 246 240 228 217 209 208 212 215 215 214
13486 214 215 219 230 250 273 293 304 308 308 304 298 288 276 264 254 251 255 263 270 270 260 244 231 233 254 291 331 360 369 356 336 327 336 351 357 352 343 340 344 348 344 330 310 292 277
13468 277 263 250 240 236 233 221 199 172 153 151 169 196 217 225 228 234 242 248 253 255 252 240 220 198 179 159 140 124 114 107 100 91 78 65 61 69 84 97 103 107 111 112 107 103 108 125
13449 125 144 159 171 181 188 190 187 183 180 178 177 178 185 202 226 249 263 269 270 268 260 247 235 231 230 226 216 206 203 204 202 197 196 205 223 247 270 290 301 297 282 265 255 251 245 234 223
13431 223 219 224 231 235 239 250 268 285 289 279 265 258 258 258 251 236 221 215 220 232 242 243 236 229 223 214 195 165 136 120 120 124 121 110 98 95 106 128 158 189 213 225 222 206 186
13412 186 169 156 142 125 107 93 90 98 113 129 137 140 146 163 185 199 200 193 186 179 169 162 166 180 192 195 186 170 156 155 174 202 223 225 212 196 183 175 171 174 187 205 223
13395 223 229 215 185 152 137 147 172 195 206 206 198 188 179 171 160 147 138 146 167 184 182 166 159 175 202 222 229 232 238 243 240 232 227 225 224 218 209 195 177 159 142 125 108 96
13378 96 94 105 128 159 193 224 240 240 230 221 220 226 238 254 270 277 272 255 228 198 174 165 171 186 200 207 211 216 226 238 252 267 284 301 316 331 344 349 341 326 313 306
13361 306 299 293 289 291 289 274 250 232 230 235 234 222 205 188 176 169 170 175 177 176 181 199 226 246 248 237 225 216 206 194 187 195 214 231 239 242 246 253 264 280 300 312 310 301 295 292 281
13342 281 255 224 203 194 193 197 203 211 217 228 248 273 294 303 304 300 287 266 249 250 265 283 296 311 330 348 353 342 318 288 259 235 221 218 226 234 235 222 205 194 195 199 199
13325 199 196 198 208 219 229 240 258 278 291 290 277 262 251 246 241 231 215 203 201 209 218 217 204 192 191 200 215 232 252 268 268 250 227 213 209 204 194 187 191 203 214 220 226
13307 226 239 258 276 284 276 256 233 214 208 216 237 261 277 280 277 276 282 287 283 263 230 196 175 173 185 205 233 270 312 346 368 372 358 328 291 261 240 224 210 196
13291 196 182 169 162 168 190 220 247 264 264 247 219 196 184 179 173 161 145 132 123 124 135 152 168 178 187 205 232 259 269 258 237 223 229 250 271 280 276 268 258 245
13275 245 225 198 170 146 128 118 116 122 133 145 152 152 148 149 159 171 179 184 192 207 227 243 250 249 245 246 254 265 270 272 275 284 294 302 312 326 340 344 339 331 324 315 306 302 307 311 306 292 280
13255 280 276 279 284 286 282 276 274 279 286 290 293 300 315 335 354 366 371 368 359 349 341 338 335 325 305 279 254 235 223 218 220 224 222 217 217 226 240 254 265 278 290 300 305 307 307 305 301 298 300 306 315
13235 315 320 317 308 296 281 263 247 239 241 246 244 235 224 216 213 217 229 244 256 261 259 255 253 256 262 267 265 263 270 290 315 332 335 330 326 326 328 329 330 331 332 329 324 323 336 360 382 390 387 382 385 395 407
13214 407 415 412 392 352 303 264 252 268 302 339 368 387 395 398 403 412 427 445 465 481 484 470 444 413 383 359 345 344 352 358 357 351 345 344 347 349 347 338 330 327 331 333 332 332 341 359 378
13195 378 391 398 396 387 376 367 362 357 352 354 371 406 451 490 513 519 517 509 499 493 497 515 534 545 543 532 517 503 495 498 507 511 503 488 477 478 490 508 529 547 555 549 534 521 521 533
13176 533 551 568 580 587 593 604 628 663 697 720 733 750 783 827 869 899 919 933 950 976 1012 1059 1112 1170 1233 1297 1354 1393 1418 1437 1464 1502 1548 1600 1655
13162 1655 1711 1765 1816 1866 1914 1956 1982 1989 1981 1966 1951 1939 1926 1912 1890 1859 1815 1763 1712 1668 1627 1576 1506 1420 1331 1249 1179 1117 1061 1009 966 932 907 887 867
13148 867 850 838 832 829 824 812 797 785 779 774 761 732 693 653 620 596 580 570 562 551 534 510 483 458 442 436 434 427 416 404 394 391 401 429 472 516 545 555 555 556
13132 556 562 569 569 556 536 515 498 486 478 478 486 497 502 498 485 468 456 455 465 483 500 509 503 478 439 395 350 303 258 227 222 237 260 285 312 341 363 373 373 366 355
13116 355 345 342 351 362 361 338 303 275 267 282 311 341 360 365 355 332 304 282 273 279 299 324 343 347 334 313 297 297 310 328 346 363 382 404 429 451 465 469 468 464
13100 464 456 441 416 387 364 354 353 350 336 318 307 308 318 331 342 344 340 337 346 368 392 408 416 417 414 409 403 399 398 404 427 471 523 561 569 554 530 511 499 490 478 465 459 462
13082 462 469 473 473 478 492 510 528 547 571 598 624 643 651 644 623 594 560 522 485 456 439 430 420 404 389 380 382 396 422 454 484 507 519 527 539 563 596 626 639
13066 639 635 619 600 581 560 536 506 476 451 437 435 443 456 470 485 501 517 530 538 540 538 536 535 537 540 541 539 538 540 541 538 534 534 541 553 567 584 604 623 641 661 685 709 728
13049 728 740 751 761 772 792 821 852 867 861 844 827 817 814 818 828 840 850 855 857 857 859 865 873 882 892 910 934 956 970 980 992 1005 1016 1026 1039 1057 1076 1095 1116
13033 1116 1141 1170 1204 1241 1278 1307 1324 1332 1339 1355 1385 1426 1464 1494 1516 1536 1555 1571 1585 1608 1644 1691 1741 1794 1853 1921 1993 2059 2113 2151 2182 2211 2242 2277 2319
13019 2319 2370 2429 2489 2550 2615 2682 2746 2802 2856 2918 2989 3066 3143 3223 3305 3385 3456 3512 3552 3579 3598 3618 3642 3669 3694 3718 3739 3756 3765 3767 3769 3780 3805 3831 3841
13005 3841 3828 3805 3786 3771 3749 3715 3677 3640 3601 3551 3493 3433 3371 3295 3201 3095 2994 2904 2824 2750 2677 2603 2525 2442 2357 2275 2202 2143 2099 2062 2024 1985 1947
12992 1947 1912 1871 1821 1767 1714 1659 1595 1525 1462 1416 1383 1356 1328 1300 1277 1257 1235 1211 1187 1176 1180 1194 1202 1196 1173 1138 1099 1064 1038 1023 1010 993 968 938 913
12978 913 905 918 942 957 949 919 879 844 829 838 865 890 899 888 865 841 818 799 788 783 780 773 764 758 759 764 770 772 771 770 768 761 742 711 681 668 671 677 675 664 650 638 625 616 621
12960 621 641 667 683 683 671 649 617 581 547 522 506 496 493 496 502 503 496 485 477 477 484 494 502 505 504 500 492 478 459 440 427 425 431 432 422 403 380 355 327 300 280 270 263
12942 263 259 260 266 269 258 238 220 215 226 246 271 291 302 303 304 314 337 362 375 368 342 304 262 225 200 191 194 202 209 217 231 251 276 301 323 331 319 289 256 234 235 258
12925 258 290 318 338 356 381 408 428 437 441 444 444 440 428 409 383 358 338 322 307 296 296 307 324 340 352 359 360 353 341 333 334 344 357 366 368 362 350 336 324 321 328 343
12909 343 363 385 404 411 403 385 366 352 339 328 324 326 329 327 328 339 361 380 383 369 347 327 310 295 280 272 278 296 315 324 325 328 334 342 345 345 347 353 362 372 376 372 362 350 343 338
12890 338 329 311 284 257 240 236 239 239 234 229 232 246 264 281 296 312 328 340 347 348 346 340 336 340 357 383 408 420 415 400 384 373 368 366 362 352 338 320 300 278 261 256 267
12873 267 291 324 359 389 411 424 432 440 447 454 461 471 485 499 510 518 521 518 504 483 466 458 454 445 427 402 372 339 311 296 299 312 322 328 332 337 336 324 301 279 264 254
12856 254 241 222 204 195 195 191 180 162 146 135 132 139 152 164 170 172 176 184 194 206 219 228 235 246 266 286 292 280 262 253 260 278 295 300 288 262 234 213 205 210 226 245 262
12839 262 272 280 287 290 287 276 259 240 224 217 216 216 209 195 179 168 168 176 188 203 226 262 307 348 373 379 369 348 323 300 282 267 251 236 224 213 201 191 189 196 203
12822 203 197 179 155 135 128 143 178 219 248 258 257 258 267 279 289 295 294 288 280 274 267 260 254 253 255 257 262 274 292 304 305 300 301 307 311 311 309 305 300 293 285 278 274 277 292 306 307 293 271 247
12802 247 223 206 205 222 246 262 268 265 258 250 248 256 267 273 276 281 286 285 276 268 263 259 250 233 216 209 217 239 264 282 295 306 313 309 290 260 227 199 180 173 169 161 147 135 137 152 172
12783 172 189 199 203 204 204 204 206 210 217 223 223 209 183 159 150 162 187 213 237 256 261 246 214 179 153 137 129 132 145 162 171 171 170 176 191 216 247 274 291 296 299 302 300 286 265
12765 265 245 239 251 275 298 311 312 311 311 314 321 332 342 349 353 358 362 360 344 317 285 252 226 212 211 213 210 205 206 216 228 239 245 250 253 256 259 264 273 288 304 311 307 297 288 281 275 271 275
12746 275 291 316 341 356 356 343 328 318 316 318 322 328 330 325 314 303 294 289 285 282 276 262 239 215 196 183 171 157 146 147 162 184 199 205 213 232 267 309 347 369 369 351
12729 351 322 286 249 216 197 193 196 199 203 210 216 215 206 194 185 177 168 157 148 143 147 157 169 182 201 225 245 251 241 226 219 231 262 304 345 372 388 402 416 424 423 418 416 422 432
12711 432 439 434 417 396 378 365 348 326 302 281 264 250 240 235 234 236 241 241 227 199 167 143 132 133 147 171 203 235 264 292 318 340 360 374 378 366 342 318 300
12695 300 292 288 284 276 267 264 270 287 309 332 350 357 352 338 319 299 280 263 253 248 244 237 228 221 221 230 247 265 282 297 309 316 317 315 315 315 311 301 290 283 280 277 276 275 267 250 232 229 249
12675 249 285 319 339 346 344 341 338 335 331 326 319 307 286 256 221 189 165 149 138 129 122 120 129 149 171 185 190 193 200 210 218 220 218 214 208 196 177 152 126 108 107 119 133 139 137 139
12657 139 152 176 208 241 270 292 307 318 326 338 356 379 398 403 391 365 333 298 268 252 253 261 264 255 245 246 263 289 316 339 355 357 341 315 286 257 225 197
12642 197 182 182 186 186 185 186 189 186 180 175 171 173 187 218 259 295 318 334 347 354 349 334 318 310 313 324 338 351 364 378 391 398 396 388 374 354 336 326 325 325 318 307 293 274 249
12623 249 224 207 203 210 224 243 263 285 310 335 349 346 329 306 286 275 279 294 309 308 289 260 234 221 228 253 289 324 352 375 394 404 399 387 377 377 381 379 366
12608 366 344 317 293 281 284 299 317 328 331 326 317 304 283 253 218 186 165 162 176 201 230 256 276 289 298 307 314 313 302 288 282 289 304 319 327 324 316 315 328 351 372 383
12591 383 385 382 372 354 329 300 270 243 223 211 204 201 200 206 218 233 249 262 267 265 260 255 248 238 226 217 213 219 234 256 278 295 305 306 295 278 268 271 282 293 306 321
12574 321 329 317 283 242 211 197 198 214 243 277 302 310 298 273 246 226 214 203 188 170 157 152 154 163 179 197 207 205 194 173 144 119 113 135 169 191 191 178 163
12558 163 149 134 122 125 143 173 206 234 248 243 226 213 210 212 210 209 215 225 229 227 228 235 241 238 229 222 215 202 184 165 153 151 155 162 164 163 165 180 211 248 283 313 340 363 378
12540 378 380 367 347 324 301 278 259 247 244 249 259 273 287 290 275 247 219 203 205 220 242 264 287 309 327 339 343 341 333 319 305 297 299 307 314 311 302 291 287 293 306 322
12523 322 335 343 344 334 320 310 310 311 302 287 274 276 291 317 348 378 399 408 407 401 393 378 358 337 325 326 339 356 370 372 359 333 301 274 255 244 238 237 243 254 271 294
12507 294 323 351 371 381 386 389 384 364 332 299 271 247 224 202 187 187 200 215 220 217 216 225 241 253 256 255 249 240 229 223 219 212 198 188 190 206 231 263 298 331 354 361 354
12489 354 338 320 305 295 287 274 254 231 215 209 212 219 229 237 243 246 248 248 251 260 276 295 310 316 315 312 308 302 288 270 255 252 261 280 297 306 305 294 278 263 249 239 227 210
12472 210 188 168 160 170 194 224 247 258 256 245 234 225 216 206 196 188 180 168 154 143 139 138 137 137 138 136 129 123 126 144 170 200 229 251 254 237 213 200 204 216 225 232 240 253
12454 253 273 297 324 350 368 376 372 357 333 305 275 249 229 213 199 183 165 151 147 156 172 188 197 201 206 217 236 259 286 310 322 317 307 307 319 333 338 336 334 334 332
12438 332 327 322 318 309 293 275 263 265 281 309 338 362 376 379 367 343 313 289 276 269 261 254 250 252 253 251 250 252 255 256 254 257 269 291 317 340 355 363 366 365 362 357 354 349 343 333 323 316
12418 316 316 323 337 355 376 394 405 400 375 335 288 241 204 186 189 205 223 233 231 221 205 186 169 160 160 170 187 207 226 241 254 265 272 273 269 263 258 258 264 276 294
12402 294 312 323 324 318 309 298 287 275 262 248 229 210 200 202 210 218 224 231 239 244 241 230 214 198 189 186 189 195 205 214 222 229 239 254 271 283 289 294 298 299 297 291 285 282 281 277 268 251 229
12382 229 212 206 212 226 240 249 252 256 265 279 295 309 319 317 303 282 262 249 240 232 231 238 251 263 270 274 278 281 278 268 254 242 237 236 236 235 235 235 232 226 218 210 206 208 213 219 216 203 189 181
12362 181 179 177 175 178 189 205 217 216 196 160 124 107 117 143 169 180 175 160 147 144 150 158 163 167 177 194 215 231 238 238 234 227 217 203 189 177 172 174 184 204 235 271 309
12345 309 341 361 366 357 339 314 285 256 233 222 224 238 256 269 273 271 274 286 302 315 319 320 322 325 324 317 313 323 349 383 412 430 439 438 425 403 382 370 366 361 350 334 317
12328 317 305 303 310 322 334 341 342 338 337 344 358 371 374 371 364 353 331 301 269 243 227 220 220 225 227 220 205 188 175 168 163 158 156 165 187 214 228 218 185 148 130 142 176 212
12310 212 237 246 245 236 219 196 172 156 153 160 165 157 139 126 130 146 161 168 169 166 161 157 163 183 212 235 242 230 210 198 206 231 263 291 308 315 315 310 309 319 340 363 379 384 382
12292 382 378 369 355 333 304 271 241 224 223 226 218 193 162 136 120 114 116 125 140 159 185 214 240 256 263 268 274 281 288 293 297 298 296 288 266 226 180 138 107 86 79 88 107 125
12274 125 140 168 219 283 341 376 388 378 351 314 278 254 243 241 245 252 266 284 302 316 327 339 354 367 372 367 358 351 350 357 364 363 348 318 282 247 220 203 197 199 207
12258 207 217 226 231 233 240 253 269 280 280 268 249 231 221 217 212 201 185 172 166 169 180 195 208 215 217 219 219 219 222 235 255 272 278 280 282 286 289 288 286 283 283 284 287 290 292 291 288 282 278 277 277
12237 277 276 272 263 247 228 215 215 222 226 227 232 248 269 287 299 303 298 284 265 247 231 217 201 184 170 165 170 185 201 209 208 203 203 206 209 207 208 218 240 263 278 284 289 298 306 308 305
12218 305 304 316 341 373 401 414 409 389 365 341 316 290 270 266 277 287 281 264 252 254 267 280 292 301 306 304 303 307 312 308 295 285 282 279 269 252 238 232 237 251 266 278
12201 278 286 294 303 304 291 263 233 212 206 212 223 233 242 248 245 228 199 169 150 149 166 196 224 242 249 253 258 261 263 271 287 306 319 328 344 365 383 383 365 336 306 289 286 291
12184 291 295 297 300 305 302 288 270 260 264 283 305 321 322 308 293 287 289 291 287 275 263 254 249 245 239 227 210 188 163 139 118 106 110 138 185 232 260 262 248 232 220 212 203 190
12166 190 175 163 157 154 150 144 138 138 143 152 168 191 214 230 240 247 248 240 221 201 182 168 157 154 162 179 198 213 221 222 219 216 207 188 157 125 104 98 102 108 115 118 119 118 118 113 102 88
12147 88 80 81 82 81 83 96 113 121 119 118 132 158 188 219 249 271 278 272 261 253 244 234 223 218 221 228 231 225 211 192 173 158 153 157 165 169 169 172 180 184 176 159 144 141 145 155 170 187 198
12127 198 195 179 155 127 102 83 74 73 81 97 114 123 127 138 162 194 216 222 218 213 214 220 225 224 219 217 222 230 233 229 221 210 201 203 222 253 281 295 300 302 305 303 295 282 271 267 269 269 261 245
12107 245 229 221 219 221 224 224 221 214 207 202 199 194 188 182 183 194 214 234 247 254 263 271 271 256 231 206 190 184 190 201 212 220 232 257 295 333 359 370 371 367 359 344 326 311 304 303 305 311
12088 311 320 326 317 290 254 219 196 185 182 179 169 154 144 143 147 147 146 150 161 173 188 206 223 231 229 227 232 247 267 286 299 301 289 266 247 241 249 265 282 297 309 319 326
12071 326 331 332 328 321 312 305 299 290 279 266 254 243 237 242 258 279 298 312 322 325 320 310 301 300 306 315 323 330 335 343 356 374 386 383 361 329 298 282 283 297 315 333 345 355 364 377
12052 377 392 399 391 368 343 322 305 291 284 287 297 311 328 348 367 384 402 420 428 418 393 367 346 334 329 330 334 338 347 365 381 378 350 315 296 296 305 314 319 317 307 291
12035 291 274 263 258 256 252 245 239 238 242 249 255 259 261 259 258 261 271 286 299 307 309 306 300 296 292 283 265 245 227 213 204 202 208 218 220 209 190 170 150 136 134 146 165 182 195 204 208 203 197
12016 197 194 197 200 199 199 204 217 230 239 244 241 233 225 228 243 260 264 255 246 255 284 322 353 368 367 354 333 306 279 257 239 225 214 210 216 226 231 220 196 169 147 136 135 143 157
11997 157 169 174 177 182 190 197 202 207 221 248 285 323 352 364 359 342 323 307 295 283 269 256 250 251 254 252 245 235 227 222 220 220 218 215 212 213 215 214 205 191 180 177 181 188 197 212 238 270
11978 270 301 322 334 338 339 340 342 339 329 318 315 322 329 325 313 300 294 290 285 277 271 269 269 271 272 269 257 239 217 195 178 172 179 194 213 232 251 273 296 318 332 333 320 304 299 307
11960 307 320 328 332 341 355 365 359 338 318 304 293 273 242 209 185 173 175 189 210 227 232 227 221 225 240 262 280 286 281 277 282 295 305 310 314 319 318 306 281 248 213 185 172
11942 172 180 205 240 273 292 293 278 260 250 248 255 269 292 319 341 353 358 360 362 360 353 341 333 333 340 349 350 343 331 318 304 292 288 295 309 324 334 336 328 312 295 290 301 322
11925 322 347 371 394 411 416 407 388 368 350 336 326 319 318 322 332 342 347 343 333 320 312 308 304 298 291 286 285 283 275 256 228 195 165 144 133 130 135 148 171 200 230 256 274
11907 274 282 279 266 251 238 229 222 218 220 229 238 241 234 223 213 204 195 185 175 167 161 163 177 206 241 272 293 304 302 289 272 261 258 261 266 272 279 280 273 256 230 199 169 149 140 132 120
11889 120 112 117 132 144 145 145 153 173 199 221 230 225 215 210 213 215 215 215 224 238 253 266 279 292 305 322 339 350 348 333 316 302 295 298 308 319 323 320 315 314 313 311 309 310 312 310 303 294
11869 294 284 270 253 238 230 224 215 205 203 213 227 237 241 243 243 234 214 190 177 176 181 184 181 176 170 166 164 165 169 179 198 227 259 283 292 279 248 211 185 177 184 195 204 212 217 213 196
11850 196 174 154 138 127 125 135 154 173 184 186 183 178 173 161 140 111 89 87 108 134 150 153 151 145 135 123 119 129 148 165 173 172 159 135 105 84 79 81 80 73 67 69 81
11833 81 99 123 154 192 234 276 314 346 369 379 374 355 333 316 305 299 295 288 277 259 239 226 226 238 255 269 273 266 252 239 232 226 218 212 215 228 248 264 272 266 249 226
11816 226 202 181 166 156 154 155 158 165 181 204 225 239 247 254 260 267 274 279 274 255 229 211 210 221 236 252 269 288 305 317 319 312 301 291 286 282 281 287 303 322 335 341 340 331 312
11798 312 287 262 242 230 225 225 225 221 214 204 191 174 159 152 151 150 152 162 181 204 225 243 252 247 229 208 193 186 190 209 238 266 278 275 267 264 268 274 277 275 267 260 261 266 267 261 250
11779 250 240 232 229 233 246 264 281 286 274 249 227 222 233 246 252 253 258 270 282 285 275 260 252 258 278 302 324 339 345 344 336 321 299 269 237 214 207 217 233 244 242 227
11763 227 206 188 177 173 176 184 194 206 224 245 266 279 279 262 227 182 149 143 160 184 202 216 232 248 254 246 227 201 175 159 155 156 156 155 159 167 177 188 199 204 203 203
11746 203 209 220 228 231 229 222 210 193 176 163 161 175 204 240 267 279 277 267 254 245 246 256 270 285 298 310 321 328 331 324 309 293 286 290 297 302 308 320 337 353 361 358 345 326
11728 326 308 297 290 283 275 273 281 295 304 300 284 263 248 239 230 213 188 160 137 120 106 92 77 68 71 84 103 122 141 166 198 231 267 303 336 360 372 376 376 370 361 349
11711 349 339 330 323 318 319 325 333 339 340 334 327 324 321 314 299 284 276 276 278 276 273 270 270 271 271 272 274 280 287 293 302 312 319 317 308 298 287 268 243 222 214 213 211 210 212 217 217 207 192 174 155 144 148 172
11689 172 208 256 313 372 418 442 445 438 426 411 399 387 371 349 321 292 261 226 190 162 146 141 148 167 199 235 263 278 279 271 264 265 271 278 281 280 281 286 294 301 306 310 317 326
11672 326 330 329 323 312 293 269 252 250 254 248 221 180 138 104 85 81 87 90 82 65 50 45 47 54 66 79 91 99 105 115 132 155 174 182 177 168 163 166 175 181 179 167 154 151 164 188
11653 188 214 237 254 262 261 254 244 234 220 204 191 183 179 179 186 204 233 262 280 283 271 250 220 183 146 120 110 115 128 142 158 175 188 188 175 160 152 153 154 150 144 141
11636 141 145 158 177 197 215 226 232 240 253 266 274 275 272 264 254 242 231 220 206 193 192 206 227 236 231 223 224 226 214 182 142 107 83 67 59 61 73 96 128 164 197 222
11620 222 240 253 261 266 271 278 284 287 289 295 298 294 281 268 260 250 237 222 213 209 205 204 210 218 219 212 207 215 236 265 293 310 309 290 264 246 237 228 210 190 176 175 181 186 186 182 180 188 209 238
11600 238 262 271 265 253 248 256 279 309 331 332 312 282 254 227 197 169 152 152 167 192 219 243 266 291 318 336 333 308 274 247 235 236 246 260 270 273 271 273 286 306
11583 306 326 338 339 333 326 321 318 315 314 314 317 320 325 330 334 335 329 321 312 303 295 287 281 276 270 263 258 259 262 256 237 215 202 201 200 194 183 175 175 186 209 232 243 241 238 242 251 260 266 273 273 262 242 222 202
11561 202 179 148 116 91 75 68 71 84 100 113 121 127 137 154 175 195 210 217 222 226 231 239 251 268 283 290 285 271 251 232 218 211 204 194 185 179 182 195 217 247 275 296
11544 296 307 313 320 329 336 337 328 312 299 293 294 298 306 314 317 315 314 325 350 385 423 458 478 473 446 410 378 357 342 334 329 329 336 350 372 394 410 417 413 401 387 380 378 372 359 344
11526 344 336 335 338 341 344 348 350 350 350 350 350 347 341 331 317 304 295 295 307 329 356 378 386 378 359 345 341 343 338 323 304 294 295 305 313 313 302 285 264 242 219 198 188 193 211 235
11508 235 261 291 319 339 347 346 340 330 320 313 312 315 319 323 322 313 298 285 285 299 320 334 330 314 299 296 305 316 322 321 316 304 281 249 217 193 183 189 209 234 253 260 256 246
11490 246 231 213 198 187 185 193 211 234 262 297 342 389 424 442 444 436 422 397 363 323 288 267 264 271 283 297 321 359 408 457 494 514 517 506 490 479 475 473 467
11474 467 460 454 452 449 446 445 451 461 469 469 459 440 418 399 388 385 385 385 382 377 364 340 309 276 249 235 234 241 247 245 238 236 244 260 281 307 335 359 377 390 401 405 399 388 376 367
11456 367 360 355 353 353 356 364 381 404 429 448 460 466 465 453 435 419 410 408 410 418 437 467 501 533 561 586 606 615 615 609 597 584 574 574 584 600 615 625 628 625 625 637 661 685
11438 685 699 703 705 716 742 778 810 830 842 859 889 919 938 943 941 940 947 969 1013 1075 1147 1225 1310 1398 1485 1574 1674 1794 1936 2100 2288 2502 2744 3029
11424 3029 3370 3779 4264 4842 5537 6372 7370 8561 9976 11633 13515 15542 17523 19144 20053 20023 19084 17495 15600 13677
11416 13677 11888 10304 8943 7789 6816 5997 5315 4754 4293 3904 3565 3261 2986 2731 2489 2262 2057 1878 1723 1585 1465
11408 1465 1367 1290 1226 1167 1105 1043 984 938 905 876 841 797 755 724 707 700 695 688 674 656 639 628 621 613 602 585 564 545 540 552 575 597 609 602 571 522 466
11393 466 417 388 382 394 411 425 439 456 472 475 463 440 418 406 410 431 463 493 512 515 506 489 470 455 448 448 457 470 483 484 470 448 424 397 365 330 305 301 321
11377 321 357 391 410 412 406 399 389 373 358 354 365 383 394 396 394 389 384 376 365 351 336 326 326 334 341 338 330 323 316 302 275 242 218 207 206 212 231 265 306 341 364 373 364 333
11360 333 287 242 210 194 189 195 212 233 247 251 255 271 299 325 340 343 339 330 318 301 286 280 282 292 304 317 331 345 351 345 329 316 317 332 349 358 355 346 335 326 319 315 310 307
11342 307 314 337 369 393 397 386 370 359 349 338 322 298 266 235 215 215 232 256 274 282 283 278 271 258 242 225 213 212 224 252 289 323 344 351 346 334 321 308 295
11326 295 280 262 244 234 237 250 265 272 267 253 238 222 206 194 191 200 213 218 213 205 202 204 207 211 217 227 243 265 286 299 300 290 278 269 264 260 255 251 251 252 248 235 218 206 204 205
11308 205 204 202 201 202 202 203 205 207 207 204 202 207 215 218 215 214 221 233 245 254 264 273 275 271 266 268 272 268 255 236 218 205 200 207 223 246 266 279 281 272 258 247 249 264 281 287 279 265 256 253 251 248
11287 248 244 244 247 252 262 276 289 289 276 255 239 229 221 213 204 198 198 209 227 244 255 260 263 267 271 271 267 262 258 258 258 256 253 246 238 228 223 227 235 245 254 267 279 283 271 247 216 182 155
11267 155 149 172 210 242 255 257 265 282 300 312 314 313 318 336 363 390 407 411 411 411 409 404 396 382 363 339 315 296 282 275 278 290 304 307 291 259 223 200 195 206 224 239
11251 239 251 262 274 286 293 292 283 267 252 248 258 280 300 309 305 293 275 257 244 242 252 266 278 282 274 253 226 200 187 191 207 223 222 200 164 134 123 133 156 181
11234 181 202 217 229 241 256 270 280 283 284 289 299 309 313 308 299 291 283 269 240 200 157 121 96 82 79 92 118 155 194 227 248 252 241 224 209 197 189 182 171 157
11218 157 143 143 166 203 235 246 237 220 203 184 165 150 144 149 161 180 204 231 259 285 299 295 273 249 236 237 242 240 233 228 233 249 268 280 277 261 246 240 240 241 242 244 243
11201 243 237 223 203 183 163 149 142 144 151 163 181 203 226 248 266 280 284 278 266 256 255 260 268 274 279 279 272 252 222 192 176 179 195 213 226 230 224 208 192 189 196 207 215 227
11183 227 241 249 241 224 214 218 232 251 273 294 304 299 283 270 264 260 249 234 222 218 218 211 195 180 180 203 245 290 324 344 360 376 387 386 376 366 361 358 354 348 342 335 325
11166 325 312 294 268 239 216 206 204 205 212 231 259 287 305 314 319 325 333 338 340 337 332 320 298 263 225 198 188 189 196 204 208 204 192 176 161 149 144 148 151 146 132 120 115 117 121 132
11148 132 150 172 193 214 233 242 237 223 212 203 192 180 174 177 183 186 189 196 206 218 233 251 262 258 243 226 215 209 202 195 192 196 207 215 220 225 237 254 269 277 279 275 266 259 260 274
11129 274 289 293 283 269 257 248 237 223 210 202 196 193 194 201 206 200 182 156 132 110 92 82 87 104 123 136 141 145 150 156 161 171 192 226 260 283 288 282 277 276 276 276 281 293 307
11111 307 317 318 309 295 284 280 283 283 273 256 241 239 250 271 290 298 290 271 246 219 197 185 186 195 204 208 207 208 214 232 258 287 305 309 307 305 302 292 277 265 263 269 278 285 287 284 275
11092 275 264 252 239 224 212 215 233 257 273 279 277 267 245 218 201 204 225 250 268 279 289 300 312 326 342 355 359 355 349 349 353 356 356 353 347 334 310 282 261 248 240
11076 240 235 235 240 240 236 232 237 246 255 263 272 278 273 257 241 232 229 229 233 245 262 283 306 328 340 339 324 302 277 251 226 205 187 173 159 145 135 132 136 145 156 169 183 200 217
11058 217 234 249 258 261 265 272 280 280 268 245 219 197 183 181 187 196 199 197 195 196 197 196 198 207 222 234 239 237 233 230 229 231 232 224 206 182 162 153 154 163 181 202 216 210 188 165 156 160 167 169 165
11037 165 159 152 149 153 169 197 236 281 323 351 355 338 313 293 282 276 268 256 240 220 204 195 194 197 201 203 203 201 200 203 210 216 217 218 220 225 230 236 246 259 273 286 296 296 277 248 227
11018 227 222 223 214 197 183 179 182 184 184 185 186 185 179 168 159 160 172 189 206 226 251 272 277 264 244 228 217 205 191 177 168 167 174 183 191 200 217 241 264 277 282 283 288 300 321 343
11000 343 354 354 348 340 322 297 277 271 273 271 263 258 263 273 285 296 305 307 305 303 309 319 331 339 341 336 326 313 295 266 229 199 188 200 223 243 246 230 202 179 166 163 166 176
10982 176 193 210 223 239 261 283 294 295 291 285 274 262 260 270 278 269 252 248 268 295 309 308 302 300 295 281 263 253 255 262 264 261 256 247 234 217 201 190 178 165 155 157 174
10965 174 199 224 243 257 269 280 287 284 270 248 229 216 206 199 196 193 185 170 160 170 203 247 288 319 338 343 334 315 291 262 228 194 164 140 117 100 97 113 137
10949 137 159 173 183 186 178 157 130 101 76 58 52 58 68 74 74 72 72 74 72 62 52 52 70 104 148 196 242 279 296 294 282 271 267 268 266 256 243 233 234 240 238 222 199
10932 199 178 163 153 150 157 174 194 213 227 234 233 225 215 209 210 218 236 266 304 341 365 371 364 350 328 297 263 236 225 221 216 210 206 206 207 204 202 201 202 209 230 266 300 310 289
10914 289 250 216 197 188 180 170 159 154 156 170 194 222 242 245 233 223 229 249 274 296 313 325 332 338 346 352 344 314 272 229 192 162 143 144 160 177 188 196 209 225 234
10898 234 230 216 205 204 213 221 220 211 204 204 209 212 213 210 201 184 165 158 167 184 203 219 227 220 199 177 163 157 153 149 149 153 152 146 138 138 148 162 178 192 203 209 214 219 226 231 229 216 194 167
10878 167 143 125 117 122 136 150 163 176 193 210 222 230 240 256 273 288 298 309 323 337 348 350 344 336 332 333 333 327 317 308 300 294 291 293 298 300 294 283 270 259 252 254 260 262 258 253
10859 253 257 273 295 313 322 325 327 331 333 326 309 286 261 232 203 184 183 197 213 221 221 214 202 193 196 218 252 285 309 329 348 364 372 370 365 361 357 353 351 355 364 372 374 368 354 336 322
10840 322 315 314 310 295 270 241 213 193 186 190 200 207 209 205 195 182 169 161 159 163 174 192 213 231 244 255 273 300 334 366 387 394 387 373 356 339 323 308 291 276 272
10824 272 282 300 317 330 334 327 307 280 254 236 225 215 203 189 174 162 158 162 170 178 186 198 213 228 233 226 210 198 198 208 219 226 231 237 242 246 254 265 273 271 257 240 226
10806 226 217 210 200 185 166 147 132 122 115 107 99 100 117 150 189 224 251 267 269 259 245 243 261 295 333 368 394 406 402 383 353 321 301 301 313 319 309 287 267 258
10790 258 254 251 244 231 211 187 169 162 168 184 209 235 260 283 305 319 322 317 315 321 329 338 346 353 357 356 355 349 332 304 280 276 288 299 297 289 290 307 331 348 348 335 320 307 290
10772 290 263 233 215 216 226 236 246 259 274 287 293 288 273 251 231 220 213 203 191 184 185 191 191 186 179 175 170 161 150 146 148 147 138 126 119 126 145 172 198 215 220 222 233 255 280
10754 280 302 320 332 339 342 344 347 347 344 340 337 335 328 316 304 290 276 263 257 260 269 278 282 277 261 239 216 198 193 206 235 267 288 292 279 250 208 169 152 163 189 217 240
10737 240 261 282 298 310 317 321 320 313 300 281 258 240 231 224 213 201 194 198 210 228 249 265 272 273 280 298 319 332 332 321 305 292 290 298 313 329 344 355 354 337 309 281
10720 281 260 250 248 252 261 273 284 293 294 290 287 290 298 309 319 325 323 317 317 328 340 336 313 283 262 254 256 262 268 264 249 227 205 181 156 135 130 140 156 165 165 158 148 136 123 112
10702 112 112 129 163 200 224 230 228 227 226 218 205 195 197 208 222 233 240 245 248 253 261 273 286 296 298 295 288 280 272 266 267 274 281 283 279 276 279 289 300 306 306 298 284 265 242 216 191 173
10682 173 161 153 145 142 150 169 192 207 208 200 189 182 187 207 236 264 281 286 283 279 280 284 288 287 278 262 245 234 231 233 235 233 228 220 208 197 193 202 226 257 287 310 322 325 323 323 326 328 328
10663 328 327 329 339 353 363 361 344 318 290 263 239 219 207 200 191 178 171 180 203 228 242 245 239 232 228 227 232 244 256 260 252 239 231 237 255 282 312 339 355 355 344 330 312
10645 312 289 267 256 260 272 284 292 296 296 289 275 258 248 252 271 298 322 335 334 319 295 273 257 246 237 228 217 203 189 180 182 190 197 197 194 196 206 219 224 216 199 188 187 192
10628 192 193 192 198 209 215 205 184 158 135 120 118 131 155 181 210 247 289 328 357 372 371 360 350 354 371 393 408 409 395 369 341 324 322 330 339 347 356 363 368 369 368 373 388
10610 388 411 431 432 410 374 343 328 324 323 321 321 328 344 363 379 387 386 381 377 372 364 348 327 302 280 265 261 262 261 254 248 253 270 293 312 324 326 317 304 298 298 296 291 291 304 323 339
10592 339 348 351 350 346 344 350 355 349 327 300 277 262 256 264 284 309 324 323 304 268 228 199 194 212 245 283 317 340 350 352 355 362 369 373 372 365 350 326 293 252 208 167 142 140
10574 140 155 177 193 199 197 191 183 178 181 197 223 245 255 256 253 250 248 254 267 280 278 261 240 230 239 266 304 338 347 320 272 229 211 218 240 262 273 271 260 242 217 184
10557 184 145 112 94 93 102 116 128 137 142 145 151 165 186 214 241 263 275 282 287 290 285 267 239 214 205 212 226 238 242 244 245 247 250 254 258 260 259 256 252 245 237 228 225 229 238 246 253 260 273 294
10537 294 317 337 349 355 353 339 318 305 311 335 364 388 401 405 399 386 369 349 321 284 246 215 193 180 172 175 190 214 238 255 260 255 247 242 247 259 278 299 310 301 272
10521 272 236 205 185 173 165 164 170 181 197 216 234 244 246 246 251 266 288 313 331 336 328 316 305 296 281 258 232 206 185 165 149 139 138 148 162 176 187 191 182 161
10504 161 133 107 93 92 106 134 172 212 247 273 287 289 282 272 265 260 259 263 275 291 300 295 281 268 258 243 217 185 160 149 149 159 176 198 215 219 210 194 176 158
10488 158 141 130 128 141 167 198 221 227 224 224 228 227 211 185 157 138 135 154 190 227 251 259 260 259 254 241 220 200 184 177 176 177 169 147 114 83 63 54 52 51 52 62 83 108
10471 108 132 156 185 215 233 233 224 221 228 243 259 273 282 278 263 246 237 236 235 230 228 236 255 275 287 288 282 271 253 229 199 169 143 128 132 159 203 251 291 317 330 339
10454 339 351 363 368 361 347 337 333 328 321 314 315 324 332 331 318 292 262 237 225 226 235 243 245 242 242 252 269 283 286 276 260 244 232 224 221 219 215 205 188 168 150 140 142 160 189
10436 189 221 249 264 264 254 241 236 244 262 287 311 329 340 343 343 344 351 362 369 366 358 352 349 344 333 320 314 313 313 309 305 297 282 261 246 246 259 275 284 285 281 269 249 229 218 215
10417 215 215 216 218 217 206 186 167 159 161 163 166 176 197 219 235 242 247 254 267 289 318 347 368 382 392 397 394 386 379 378 377 373 362 348 334 325 324 328 332 329 320 309 298 291 296 312 329
10398 329 339 344 352 363 374 381 383 375 356 331 311 298 284 264 246 243 259 284 307 324 337 349 355 352 336 311 280 239 191 144 113 101 102 108 120 140 162 181 190 185
10382 185 171 158 157 170 187 195 193 191 194 196 189 179 177 191 217 240 251 249 241 233 226 224 232 248 267 282 291 298 297 283 255 223 202 201 214 228 237 243 253 269 280 283 290 313 350
10364 350 380 385 366 339 321 321 334 351 359 350 328 303 284 270 258 249 246 251 257 256 247 234 228 233 252 277 301 316 322 320 316 312 310 312 317 318 312 301 288 274 259 249 246 246 241 233 228
10345 228 231 236 241 247 256 268 281 289 289 280 258 230 206 196 204 224 247 262 265 260 254 255 261 268 266 257 246 238 232 225 218 220 228 231 220 203 195 201 214 228 242 256 264 261 250 241 244 255 268
10326 268 276 278 277 275 272 269 268 270 275 280 280 272 259 246 237 230 225 221 228 251 288 328 359 372 368 355 343 334 325 312 296 287 285 285 280 270 262 262 277 308 346 374 380 364 335 301 272 254
10307 254 254 273 301 325 337 338 335 332 327 319 310 313 333 359 374 369 349 323 296 276 270 280 299 313 318 315 309 302 294 287 279 271 259 247 238 237 244 260 280 296 301 298 292 288 287 288 287 279 262
10287 262 242 227 222 220 211 198 189 189 196 205 218 238 262 282 292 293 289 283 276 267 252 228 198 170 149 139 142 155 173 188 201 216 238 262 278 281 275 267 262 257 252 247 243 244 250 262
10268 262 274 281 281 276 268 258 247 239 234 235 241 251 259 260 253 243 237 237 244 256 267 276 284 294 309 322 324 313 293 273 260 255 257 265 276 286 293 290 270 237 202 179 173 180 186 184 176 170
10249 170 170 172 172 170 170 173 175 173 173 186 210 231 235 226 218 222 235 250 264 277 291 301 299 287 273 265 267 273 275 275 277 281 282 275 263 248 229 206 186 182 198 221 237 241 239 239 247 260
10230 260 275 288 296 298 298 300 305 316 331 345 353 361 371 383 389 389 386 381 366 337 302 272 256 248 238 223 205 186 168 147 128 119 130 158 190 215 231 242 251 255 253 242
10213 242 223 198 175 164 167 181 204 233 261 277 273 253 226 209 213 240 281 315 327 313 282 242 203 172 155 153 165 191 224 257 284 307 329 345 347 337 326
10198 326 323 327 332 334 337 343 352 362 370 375 373 362 347 333 324 320 318 318 318 321 323 316 295 262 231 211 203 201 197 191 188 189 193 197 201 205 210 212 206 191 177 174 184 197 203 200 199 208 228 253 275 287
10177 287 289 284 277 272 268 263 258 253 255 264 278 292 306 323 345 366 380 380 368 350 331 318 314 320 331 342 347 343 328 306 281 256 237 231 237 244 241 225 209 206 217 235 254 273
10160 273 288 294 292 284 280 282 294 311 325 328 319 308 301 301 306 314 325 337 343 343 340 339 342 345 346 345 341 332 318 305 296 291 286 276 265 257 255 262 278 303 334 362 382 388 379 356 324 287 249
10140 249 214 186 169 165 174 193 217 240 261 279 293 302 307 312 319 327 327 317 307 307 322 342 356 358 357 357 356 348 333 313 290 266 244 230 225 223 219 210 200 192 186 180 174 172 177 190
10121 190 205 211 208 198 190 183 179 186 208 238 264 277 280 282 285 286 282 270 247 222 204 200 208 222 239 254 264 273 284 304 325 340 344 340 333 324 312 296 280 274 283 300 315 317 304
10103 304 284 268 267 284 313 341 354 348 328 306 293 291 292 285 269 254 249 252 256 255 250 246 250 261 269 267 260 260 271 283 285 286 297 321 337 328 297 262 244 245 258 270 275 277 277 274
10085 274 263 242 213 179 149 133 138 158 184 210 234 249 249 238 227 228 236 244 254 272 296 314 317 305 288 271 254 239 230 233 245 256 255 246 239 246 264 285 303 318
10069 318 330 332 319 293 267 249 243 241 241 240 239 238 237 235 236 241 248 251 246 241 247 270 300 322 325 315 299 281 264 250 242 234 224 212 205 206 215 229 243 252 251 241 224 205 186 174
10050 174 175 187 200 209 215 221 227 233 242 256 275 295 314 332 341 340 331 322 310 291 261 226 196 179 173 175 182 190 199 207 211 214 221 232 241 242 235 223 213 214 228 248 263 270 277 291 308
10031 308 314 303 284 265 256 262 284 309 325 327 327 334 347 357 357 346 323 292 263 242 233 231 234 237 237 234 236 243 249 247 234 214 193 174 166 177 202 230 245 243 224 195 167 153
10014 153 160 181 206 223 232 236 240 243 247 253 256 253 239 217 194 179 172 166 158 149 141 132 122 110 95 69 31 -11 -44 -56 -46 -14 32 86 132 164 181 189 194 198 204 215 227 229
9996 229 220 209 205 209 212 212 207 200 189 182 186 207 238 266 286 301 320 343 368 388 395 389 371 347 320 298 285 279 277 275 278 290 314 350 387 412 413 393 369 354 351 352 353 350 346
9978 346 345 348 350 342 321 298 284 279 277 275 276 278 285 300 317 326 319 303 292 286 277 264 256 257 257 252 248 252 260 262 253 238 225 219 225 245 274 305 334 362 386 404 415 420 420 410 389 361
9959 361 339 333 336 340 340 340 344 344 335 319 305 297 289 277 261 248 243 243 248 254 261 270 280 289 289 278 261 252 258 275 298 321 333 328 308 282 257 237 220 203 186 172 172 189 217 245
9940 245 264 280 295 306 306 297 289 285 278 263 243 226 218 223 242 271 300 320 326 322 312 294 270 246 228 220 220 229 246 267 284 291 288 283 277 265 247 226 208 201 205 215 223 226 225
9922 225 228 238 252 265 276 289 306 318 316 298 271 245 219 196 182 185 204 230 254 271 278 275 264 253 247 246 249 252 251 241 221 201 192 192 195 200 205 212 212 206 197 197 212 238 270
9904 270 300 325 345 356 353 335 310 290 280 276 272 267 259 250 247 255 271 281 277 263 254 255 262 268 273 281 294 310 325 334 339 339 332 314 288 264 253 259 272 279 275 266 262 264 267 262 246 225
9885 225 208 203 208 214 213 209 208 217 233 248 259 265 268 268 267 267 265 260 254 254 257 261 260 261 267 275 283 288 287 279 265 250 237 228 223 225 236 250 259 260 251 236 222 220 228 239 243 242 243 252 265 278 292 306
9863 306 316 320 315 299 275 253 244 251 269 286 299 304 297 276 244 216 205 215 239 263 280 292 300 299 283 258 235 222 218 217 219 225 233 244 260 274 281 278 272 265 258 248 240 241 251
9845 251 264 274 276 271 262 257 258 263 267 272 281 295 312 330 346 359 366 365 357 342 324 302 278 254 235 225 224 230 240 253 265 274 273 262 246 237 239 252 265 268 258 242 228 220 215
9827 215 210 206 205 206 205 195 176 157 150 159 180 205 228 245 253 256 258 264 271 279 286 294 303 314 324 331 335 341 351 364 368 356 332 308 296 293 290 280 261 242 229 222 215 202 192 190 191 187
9808 187 180 180 190 200 204 207 217 233 249 263 277 286 280 254 221 203 209 232 259 280 296 304 306 306 308 312 310 295 272 253 243 239 234 230 231 239 250 262 274 286 298 309 322 337
9790 337 355 369 373 365 347 324 299 280 270 264 252 234 222 225 240 254 256 250 245 247 253 260 262 255 239 221 207 201 201 204 209 216 222 222 213 197 181 169 160 152 147 144 143 142 145 158 183 213
9771 213 238 252 254 248 241 238 240 244 243 234 223 222 234 257 281 296 304 310 314 319 324 331 336 334 329 330 338 348 352 355 362 368 364 346 322 298 273 241 207 180 169 173 186 199 206 201 187 168 150
9751 150 139 135 139 150 170 198 229 255 272 282 287 285 279 276 276 275 266 251 236 227 223 225 232 244 253 253 243 226 208 192 177 163 150 143 146 159 178 198 217 232 239 236 231 234 248
9733 248 268 288 304 314 317 308 287 259 228 197 172 160 166 178 186 183 175 169 171 181 198 212 212 194 170 156 158 172 192 213 227 227 213 197 185 172 149 119 92 71
9717 71 55 45 46 59 82 110 140 166 178 175 167 166 167 165 160 157 154 142 121 103 101 116 139 156 160 150 135 127 126 130 134 145 166 193 217 239 261 280 283 270 250 238 239 250
9699 250 265 280 290 296 301 307 310 301 278 247 219 201 192 185 173 158 154 166 185 199 203 207 215 222 220 207 191 181 179 179 177 169 155 136 114 90 67 49 39 39 51 74 103 132
9682 132 155 176 199 219 230 229 225 226 230 228 214 195 184 188 204 227 252 275 293 307 319 335 350 357 354 349 348 348 336 312 292 290 305 317 313 293 268 246 231 225 231 248
9665 248 273 297 316 327 335 345 357 368 374 372 363 346 323 302 292 294 297 291 271 243 215 191 169 154 147 146 145 136 124 123 140 176 221 266 304 330 339 331 311 285 256 226
9648 226 199 176 163 164 177 194 205 206 204 204 201 196 194 201 216 226 230 235 249 265 273 270 266 266 271 277 282 287 296 309 327 345 355 353 346 343 349 361 371 378 383 388 392 393 388 376 362 354 353 353 349
9628 349 344 342 342 335 321 309 306 310 315 320 330 341 349 354 356 360 365 367 360 341 318 305 307 322 339 356 374 393 406 410 403 391 377 363 348 327 298 267 243 237 247 266 283 296
9610 296 307 320 334 340 331 311 290 280 279 286 298 315 328 328 309 272 229 187 152 122 100 90 89 93 97 106 122 139 147 141 127 113 100 90 87 99 127 162 194 219 237
9593 237 256 273 282 279 271 268 274 289 305 315 315 303 287 273 264 259 263 281 312 343 365 377 384 384 373 356 342 333 326 322 329 348 369 379 374 358 343 336 338 339 332 319 306 299 297 299
9575 299 309 325 341 349 345 331 306 276 251 235 226 216 202 189 182 179 179 183 194 209 222 225 218 204 188 175 162 152 150 163 190 221 247 264 276 290 306 320 326 316
9559 316 289 249 206 174 158 155 153 143 127 116 115 119 121 116 110 108 109 114 126 144 161 168 162 146 130 125 135 153 170 179 179 173 163 153 149 153 166 182 201 221 239 251 260 272
9541 272 290 305 311 308 305 308 317 334 360 388 408 412 402 385 368 349 327 300 275 257 249 246 241 228 211 197 186 180 183 201 233 268 292 299 297 293 288 280 268 259 258 263 266 265 258 246
9523 246 228 206 188 184 195 215 233 238 234 231 237 248 255 253 248 246 249 256 269 285 297 297 283 260 236 218 213 226 251 274 288 295 302 315 332 348 362 372 383 397 412 420 416
9505 416 405 393 378 361 345 337 337 339 337 332 328 322 311 299 294 300 312 321 321 314 304 290 275 258 242 227 214 209 221 252 288 313 321 318 319 328 342 348 337 316 299 296 304 314 322
9487 322 335 357 383 404 415 414 406 397 392 390 389 385 376 357 329 297 273 268 283 308 329 336 334 333 344 361 368 351 311 260 219 198 199 214 231 240 245 247 249 249 252 261 277 293 309
9469 309 326 340 341 327 303 283 272 272 279 290 299 303 303 306 312 322 332 340 346 349 353 355 351 338 318 294 262 225 194 185 200 231 274 325 375 408 417 406 385 353 314 280 260
9452 260 253 248 239 230 222 213 203 199 209 231 258 274 269 240 201 167 147 141 149 173 205 232 246 253 260 268 277 285 290 289 282 275 276 284 294 302 310 321 334 348 357 353 334 302 270 246 234
9433 234 234 240 247 256 273 299 325 338 335 323 309 295 286 282 281 275 263 254 253 258 267 278 295 315 333 350 368 387 405 417 419 413 399 380 354 323 293 270 258 258 266 279 291
9416 291 296 293 287 289 303 327 355 380 396 401 396 387 380 379 383 388 394 403 418 433 436 425 402 377 349 321 298 287 291 306 330 355 370 366 342 311 287 273 261 246 229 219 218
9399 218 221 223 221 214 204 193 185 188 206 234 263 286 303 319 335 348 351 343 330 321 323 335 352 360 350 318 273 232 205 189 179 177 188 214 248 279 295 291 269 237 206
9382 206 186 174 166 154 139 128 131 151 180 210 237 262 283 293 290 279 267 261 267 284 301 306 294 276 263 259 262 271 285 304 322 332 332 320 304 290 283 283 286 286 279 267
9365 267 258 259 270 287 303 316 320 312 295 276 258 241 230 231 248 271 284 282 273 271 280 299 324 348 363 362 346 323 305 295 286 275 259 245 237 233 230 225 219 213 211 216 231 250
9348 250 268 278 283 288 299 314 328 333 325 309 295 289 294 305 314 319 323 336 357 375 380 373 361 345 322 292 267 256 259 269 287 314 346 373 384 384 386 400 425 445 448 437
9331 437 426 420 414 401 385 372 368 370 377 384 389 394 404 422 446 467 485 502 521 541 554 553 535 510 492 493 510 537 567 592 606 604 594 582 573 562 550 539 531 528 533 553
9314 553 585 623 658 687 706 712 703 684 669 666 678 707 747 783 803 801 785 758 726 695 675 672 679 690 703 717 734 751 768 782 785 773 750 727 715 716 731 752 773
9298 773 784 785 780 773 762 741 709 670 632 608 602 610 620 622 614 601 586 574 568 572 586 606 631 659 685 701 699 679 651 628 618 619 626 634 638 639 638 638 641 645 643 632 609 579 553
9280 553 538 533 533 529 514 492 469 450 442 443 452 469 492 512 521 520 517 520 530 545 562 580 590 585 568 550 540 534 526 517 509 505 505 507 503 486 456 427 412 414 426 439 455 475 493
9262 493 498 486 466 453 455 466 471 459 438 421 418 424 431 431 422 404 383 365 351 341 336 337 341 340 332 323 322 332 346 359 362 355 342 330 327 328 327 323 320 324 336 353 372 389 399 403 405
9243 405 412 426 441 451 454 443 418 383 346 319 306 308 321 338 356 372 387 398 403 394 367 327 286 254 232 215 206 215 245 287 323 342 342 327 305 285 275 273 270 260
9227 260 250 253 267 280 282 273 262 253 249 252 266 288 315 343 372 400 422 431 420 392 357 329 315 308 296 270 238 211 197 197 210 239 274 303 319 322 317 302 278 253
9211 253 237 235 240 246 250 254 253 244 224 198 174 160 157 160 161 154 143 136 138 150 168 189 211 225 227 220 217 224 238 254 271 294 322 347 363 372 376 374 367 357 349 339 324 303 285 274
9193 274 269 265 260 252 245 245 256 273 287 295 299 306 317 330 341 348 350 348 342 335 329 320 305 287 273 270 283 304 331 362 393 413 411 391 368 354 349 346 340 333 328 325 324 324 321 315 304 294 286
9173 286 283 285 288 292 297 308 323 338 345 341 332 323 317 308 299 297 307 326 346 364 377 387 392 395 402 417 436 450 457 457 451 437 418 398 377 356 339 334 340 349 355 359 362 367 375 387 401 408 406
9153 406 395 376 347 313 283 269 268 271 270 268 267 266 268 282 309 337 353 354 350 343 333 320 311 312 322 333 342 353 365 372 368 352 331 310 285 251 211 178 160 154 154 157 165 181
9136 181 208 244 284 319 340 344 331 307 282 263 257 259 265 272 283 296 305 306 301 294 286 277 269 266 266 266 259 249 239 230 220 210 202 201 202 200 192 184 181 187 199 213 227 244 264 288 310
9117 310 322 324 317 309 300 287 265 242 227 225 234 248 264 281 295 306 317 333 352 368 375 372 363 354 347 346 347 343 332 321 317 319 321 314 300 288 284 290 308 331 352 363 363 358 358 366 378
9098 378 386 383 365 331 287 238 190 148 116 97 89 90 97 108 121 130 131 125 116 112 122 147 183 219 248 271 293 313 329 339 346 351 351 339 314 284 260 245 237 229 219 211 208
9081 208 212 215 214 213 219 236 254 263 264 261 259 261 266 274 285 295 300 300 299 299 298 293 281 260 239 225 226 238 250 251 241 229 225 228 227 220 211 208 212 220 227 233 239 243 244 245 251 266 283 291 288 281 275 269 258
9059 258 245 235 237 248 267 289 311 325 326 317 309 309 316 325 337 349 362 370 369 358 348 345 354 365 369 362 356 361 377 394 403 404 398 382 352 311 270 237 215 201 191 179 164 153
9041 153 159 186 217 235 239 237 235 228 215 205 208 221 241 264 287 305 314 320 330 346 362 373 378 378 374 364 349 330 311 293 274 249 214 175 150 152 181 227 275 311 324
9024 324 320 313 316 327 335 333 321 303 284 269 262 255 244 225 205 195 195 206 225 251 279 304 324 337 343 339 325 304 279 254 231 214 202 194 188 184 185 188 190 186 177 163 148 135
9007 135 130 134 147 167 192 221 254 287 317 341 358 365 363 355 346 337 326 309 288 268 255 245 235 222 208 195 180 165 156 155 161 163 156 143 129 118 114 122 145 176 204 217
8990 217 213 202 197 202 211 215 209 195 175 154 135 123 117 118 125 138 158 179 198 213 223 231 239 250 260 265 265 264 270 287 309 328 336 329 311 293 288 301 319 325 307 275 247 230
8972 230 215 195 173 158 151 145 140 144 162 185 208 228 247 259 261 260 267 286 309 327 336 340 342 343 344 344 344 345 346 344 337 328 323 323 331 350 377 398 402 390 376 370 371 370 364 353 338 322
8953 322 309 301 297 299 308 320 326 319 303 290 284 278 266 250 234 220 204 183 162 147 138 134 132 132 136 142 142 132 113 93 84 93 120 158 196 227 247 260 267 274 282 289 295 302 305 300 284
8934 284 270 265 269 268 260 258 271 296 318 329 330 325 318 311 307 301 290 273 255 241 231 224 219 219 225 237 255 271 276 267 254 244 239 234 228 226 233 243 244 233 217 206 203 205 207 213 229 255
8915 255 282 301 308 308 308 314 320 314 289 252 221 211 222 246 276 305 326 332 324 309 296 282 268 259 266 288 309 318 310 291 264 236 213 200 192 188 191 203 215 216 210 211 228 252
8897 252 268 268 254 232 206 182 164 158 162 172 183 188 186 181 179 182 190 202 223 256 303 356 403 433 443 444 443 442 433 417 402 391 381 373 371 377 386 387 382 372 361 346 329 312
8879 312 298 288 283 286 296 310 317 310 287 253 223 209 213 225 233 237 240 244 250 256 261 262 259 257 261 267 269 265 262 265 267 263 259 262 268 262 239 208 186 179 188 206 223 231 230 232 245 267 282 282 265
8859 265 239 213 192 177 163 154 156 169 185 197 208 229 263 303 340 373 396 407 403 393 381 364 338 302 268 244 233 227 218 203 191 194 215 245 269 282 292 304
$$ [...]
-2084B99
##END=	
##END=	
