##TITLE=	Feb18-2022.31.fid
TM-VI-259, rpt2 long proton
##JCAMP-DX=	6.0	$$ MestReNova 14.3.0-30573
##DATA TYPE=	LINK
##BLOCK_ID=	1
##BLOCKS=	3    
##ORIGIN=	Mestrelab Research S.L.
##OWNER=	hrzepa
##$MNOVA/LINK_BLOCK_TYPE=	ITEM	$$ NMR Spectrum
##$MNOVA/ITEM/POLYGON=	(XY..XY)
5321,5853.84
8722,5853.84
8722,8226.84
5321,8226.84
5321,5853.84
##$MNOVA/ITEM/Z=	0
##$MNOVA/ITEM/ANGLE=	0
##TITLE=	Feb18-2022.31.fid
##JCAMP-DX=	6.0	$$ MestReNova 14.3.0-30573
##BLOCK_ID=	2
##DATA TYPE=	MNOVA NMR VIEW DATA
##DATA CLASS=	MNOVA VIEW DATA
##$MNOVA/ITEM/ZOOM/X=	-1.0914766237411601679,	11.167242409646036094
##$MNOVA/ITEM/ZOOM/Y=	-5240.6379251966473021,	58063.472423461906146
##END=	
##TITLE=	Feb18-2022.31.fid
##JCAMP-DX=	6.0	$$ MestReNova 14.3.0-30573
##BLOCK_ID=	3
##DATA TYPE=	NMR SPECTRUM
##DATA CLASS=	XYDATA
##NUMDIM=	1
##ORIGIN=	Bruker BioSpin GmbH
##OWNER=	nmr
##.OBSERVE FREQUENCY=	400.4124024600000098
##.OBSERVE NUCLEUS=	^1H
##.SOLVENT NAME=	Acetone
##.PULSE SEQUENCE=	zg30
##LONGDATE=	2022/02/18 12:33:00.000
##.ACQUISITIONMODE=	SIMULTANEOUS (DQD)
##$ORIGINAL FORMAT=	Bruker XWIN-NMR
##$MNOVA/SCALES_VERSION=	9
##$PARAMETER FILE=	(acqus, ASCII, //ch-nmrserv3.ch.ic.ac.uk/Av400A/agmb/nmr/Feb18-2022/31/acqus, 0)
$$ ##TITLE= Parameter file, TOPSPIN		Version 3.2
$$ ##JCAMPDX= 5.0
$$ ##DATATYPE= Parameter Values
$$ ##NPOINTS= 11	$$ modification sequence number
$$ ##ORIGIN= Bruker BioSpin GmbH
$$ ##OWNER= nmr
$$ $$ 2022-02-18 12:33:34.580 +0000  nmr@CZC10666PP
$$ $$ /opt/topspin/data/agmb/nmr/Feb18-2022/31/acqus
$$ $$ process /opt/topspin3.2/prog/mod/shimcntl
$$ ##$ACQT0= -2.36344537815126
$$ ##$AMP= (0..31)
$$ 100 100 100 100 100 100 100 100 100 100 100 100 100 100 100 100 100 100
$$ 100 100 100 100 100 100 100 100 100 100 100 100 100 100
$$ ##$AMPCOIL= (0..19)
$$ 0 0 0 0 0 0 0 0 0 0 0 0 0 0 0 0 0 0 0 0
$$ ##$ANAVPT= -1
$$ ##$AQSEQ= 0
$$ ##$AQ_mod= 3
$$ ##$AUNM= <au_zg>
$$ ##$AUTOPOS= <3 >
$$ ##$BF1= 400.41
$$ ##$BF2= 400.41
$$ ##$BF3= 400.41
$$ ##$BF4= 400.41
$$ ##$BF5= 400.41
$$ ##$BF6= 400.41
$$ ##$BF7= 400.41
$$ ##$BF8= 400.41
$$ ##$BYTORDA= 0
$$ ##$CAGPARS= (0..11)
$$ 0 0 0 0 0 0 0 0 0 0 0 0
$$ ##$CFDGTYP= 0
$$ ##$CFRGTYP= 9
$$ ##$CHEMSTR= <none>
$$ ##$CNST= (0..63)
$$ 1 1 145 1 1 1 1 1 1 1 1 1 1 1 1 1 1 1 1 1 1 1 1 1 1 1 1 1 1 1 1 1 1 1 1
$$ 1 1 1 1 1 1 1 1 1 1 1 1 1 1 1 1 1 1 1 1 1 1 1 1 1 1 1 1 1
$$ ##$CPDPRG= (0..8)
$$ <> <> <> <> <mlev> <mlev> <mlev> <mlev> <mlev>
$$ ##$D= (0..63)
$$ 0 1 0 0 0 0 0 0 0 0.06 0 0 0 0 0 0 0.0002 0 0 0 0 0 0 0 0 0 0 0 0 0 0 0
$$ 0 0 0 0 0 0 0 0 0 0 0 0 0 0 0 0 0 0 0 0 0 0 0 0 0 0 0 0 0 0 0 0
$$ ##$DATE= 1645187613
$$ ##$DE= 6.5
$$ ##$DECBNUC= <off>
$$ ##$DECIM= 2496
$$ ##$DECNUC= <off>
$$ ##$DECSTAT= 4
$$ ##$DIGMOD= 1
$$ ##$DIGTYP= 12
$$ ##$DQDMODE= 0
$$ ##$DR= 22
$$ ##$DS= 2
$$ ##$DSPFIRM= 0
$$ ##$DSPFVS= 20
$$ ##$DTYPA= 0
$$ ##$EXP= <proton128>
$$ ##$F1LIST= <111111111111111>
$$ ##$F2LIST= <222222222222222>
$$ ##$F3LIST= <333333333333333>
$$ ##$FCUCHAN= (0..9)
$$ 0 2 0 0 0 0 0 0 0 0
$$ ##$FL1= 90
$$ ##$FL2= 90
$$ ##$FL3= 90
$$ [...]
$$ 90 74 58 42 26 10 0 0
$$ ##$Sgu3PowerLevels= (0..7)
$$ 0 0 0 0 0 0 0 0
$$ ##$Sgu4PowerLevels= (0..7)
$$ 0 0 0 0 0 0 0 0
$$ ##$Sgu5PowerLevels= (0..7)
$$ 0 0 0 0 0 0 0 0
$$ ##$Sgu6PowerLevels= (0..7)
$$ 0 0 0 0 0 0 0 0
$$ ##$Sgu7PowerLevels= (0..7)
$$ 0 0 0 0 0 0 0 0
$$ ##$Sgu8PowerLevels= (0..7)
$$ 0 0 0 0 0 0 0 0
$$ ##$SguType= 3
$$ ##$ShimPowMaxUA= (0..63)
$$ 130000 130000 130000 130000 130000 130000 130000 130000 130000 130000 130000
$$ 130000 130000 130000 130000 130000 130000 130000 130000 130000 0 0 0 0
$$ 0 0 0 0 0 0 0 0 0 0 0 0 0 0 0 0 0 0 0 0 0 0 0 0 0 0 0 0 0 0 0 0 0 0 0 0
$$ 0 0 0 0
$$ ##$ShimPowMaxUC= (0..63)
$$ 130000 130000 130000 130000 130000 130000 130000 130000 130000 130000 130000
$$ 130000 130000 130000 130000 130000 130000 130000 130000 130000 0 0 0 0
$$ 0 0 0 0 0 0 0 0 0 0 0 0 0 0 0 0 0 0 0 0 0 0 0 0 0 0 0 0 0 0 0 0 0 0 0 0
$$ 0 0 0 0
$$ ##$ShimPowMaxUG= (0..63)
$$ 524287 524287 524287 524287 524287 524287 524287 524287 524287 524287 524287
$$ 524287 524287 524287 524287 524287 524287 524287 524287 524287 0 0 0 0
$$ 0 0 0 0 0 0 0 0 0 0 0 0 0 0 0 0 0 0 0 0 0 0 0 0 0 0 0 0 0 0 0 0 0 0 0 0
$$ 0 0 0 0
$$ ##$ShimPowRcbType= 3
$$ ##$ShimPowRes= (0..63)
$$ 1e-20 1e-20 1e-20 1e-20 1e-20 1e-20 1e-20 1e-20 1e-20 1e-20 1e-20 1e-20
$$ 1e-20 1e-20 1e-20 1e-20 1e-20 1e-20 1e-20 1e-20 0 0 0 0 0 0 0 0 0 0 0 0
$$ 0 0 0 0 0 0 0 0 0 0 0 0 0 0 0 0 0 0 0 0 0 0 0 0 0 0 0 0 0 0 0 0
$$ ##$ShimPowRng0= (0..63)
$$ 1 1 1 1 1 1 1 1 1 1 1 1 1 1 1 1 1 1 1 1 0 0 0 0 0 0 0 0 0 0 0 0 0 0 0 0
$$ 0 0 0 0 0 0 0 0 0 0 0 0 0 0 0 0 0 0 0 0 0 0 0 0 0 0 0 0
$$ ##$ShimPowRng1= (0..63)
$$ 1 1 1 1 1 1 1 1 1 1 1 1 1 1 1 1 1 1 1 1 0 0 0 0 0 0 0 0 0 0 0 0 0 0 0 0
$$ 0 0 0 0 0 0 0 0 0 0 0 0 0 0 0 0 0 0 0 0 0 0 0 0 0 0 0 0
$$ ##$ShimPowRng2= (0..63)
$$ 1 1 1 1 1 1 1 1 1 1 1 1 1 1 1 1 1 1 1 1 0 0 0 0 0 0 0 0 0 0 0 0 0 0 0 0
$$ 0 0 0 0 0 0 0 0 0 0 0 0 0 0 0 0 0 0 0 0 0 0 0 0 0 0 0 0
$$ ##$ShimPowRng3= (0..63)
$$ 1 1 1 1 1 1 1 1 1 1 1 1 1 1 1 1 1 1 1 1 0 0 0 0 0 0 0 0 0 0 0 0 0 0 0 0
$$ 0 0 0 0 0 0 0 0 0 0 0 0 0 0 0 0 0 0 0 0 0 0 0 0 0 0 0 0
$$ ##$ShimSysFunc= (0..63)
$$ 1 2 3 4 5 7 9 11 15 16 8 10 12 14 6 17 13 18 19 20 0 0 0 0 0 0 0 0 0 0
$$ 0 0 0 0 0 0 0 0 0 0 0 0 0 0 0 0 0 0 0 0 0 0 0 0 0 0 0 0 0 0 0 0 0 0
$$ ##$ShimSysMatrix= 0
$$ ##$ShimSysType= 1
$$ ##$TFXNUM= 0
$$ ##$TRIPLO2= 0
$$ ##$VTU= 2
$$ ##$VTUETH= <149.236.99.20>
$$ ##$VTUTY= <no>
$$ ##$WBREFAM= (0..15)
$$ 135 116 100 100 100 100 100 100 100 100 100 100 100 100 100 100
$$ ##$WBREFLM= (0..15)
$$ 0 0 0 0 0 0 0 0 0 0 0 0 0 0 0 0
$$ ##$WBREFPH= (0..15)
$$ 71.66 -68.25 0 0 0 0 0 0 0 0 0 0 0 0 0 0
$$ ##$WBSGU= (0..15)
$$ 0 0 0 0 0 0 0 0 0 0 0 0 0 0 0 0
$$ ##$XFAC= 2
$$ ##END=
$$ 
##$DECIM=	2496
##$DSPFVS=	20
##XUNITS=	HZ
##YUNITS=	ARBITRARY UNITS
##FIRSTX=	6400.5417454684875338
##LASTX=	-1612.1565014140219319
##DELTAX=	-0.12226593800080125252
##XFACTOR=	1
##YFACTOR=	0.023591421303834941153
##FIRSTY=	51.6819000244140625
##MINY=	33.364780426025390625
##MAXY=	46475.82421875
##NPOINTS=	65536
##XYDATA=	(X++(Y..Y))
$$ [...]
2627A1205m4k7k8k7k7k7k6k7k6l6l7n1o3o7m9k2k2k8k8k8k8k9k9n1n2m3m3m3m3l3l3j0j1j6
2622A0051j6l8l9l0l1l0l0n4n4l1l1k5k6k5k5k2k3k1k1j6MJ5J5J6J5J5J4mk3l4l5m0m1k7r
2618I344%J1OOQQRQRRRJ0qqqpJ7J8J7J7J2J2J2J2OOOOK1K0klONK8K9J3J4J4J4%%%%J4J3L5
2612I768L6N2N2K6OOONNooL2L1K4K3%Jnnnoj9k0k0k0QRQQQQQQj4j5j4j5nonnNMNMNMNMopp
2606I963pppopK0K1K1K1K0K1K1K1J2J3J3J3J3J3J3J3J3J4J3J4K5K6L5J7j8k9k5k4j9j9j9j9
2601A0183m0l9l9l9n1n1n1n1l6l6j5j5l7n6p6q8r8q7o4n2o2p3o6o6n6n6n6n5l9l9l9l9l8l7
2597H441l2m4n3o5p4m7j3j3j2j2l0m2k9m0m1l0m4l2j0j0j0rk5l5l5k3j7onj7m3n4m9m9m4m3
2593G304m4m4m8m8n4m3k5k5k5k5n0o0o0n0l1l2l1l1k3k3j7k8m7n9n3n4n8n9n9n9n3n2n9m8
$$ y = [11205, 11161, 11134, 11106, 11079, 11052, 11025, 10999, 10972, 10946, 10910, 10873, 10822, 10759, 10692, 10643, 10621, 10599, 10571, 10543, 10515, 10487, 10458, 10429, 10378, 10326, 10283, 10240, 10197, 10154, 10121, 10088, 10078, 10067, 10051, 10035, 9997, 9958, 9928, 9897, 9867, 9837, 9783, 9729, 9698, 9667, 9642, 9616, 9591, 9566, 9544, 9521, 9500, 9479, 9463, 9467, 9482, 9497, 9513, 9528, 9543, 9557, 9553, 9530, 9496, 9461, 9421, 9380, 9353, 9344, 9344, 9355, 9361, 9367, 9375, 9383, 9392, 9400, 9409, 9418, 9427, 9437, 9429, 9421, 9413, 9406, 9423, 9441, 9458, 9475, 9487, 9499, 9511, 9523, 9529, 9535, 9541, 9547, 9568, 9588, 9586, 9583, 9589, 9594, 9622, 9651, 9664, 9678, 9692, 9706, 9706, 9706, 9706, 9706, 9720, 9733, 9768, 9804, 9856, 9908, 9934, 9940, 9946, 9952, 9957, 9962, 9956, 9950, 9982, 10013, 10037, 10060, 10060, 10061, 10056, 10051, 10046, 10040, 10021, 10001, 9981, 9961, 9969, 9978, 9986, 9994, 10002, 10010, 10018, 10026, 10012, 9997, 9983, 9968, 9963, 9957, 9952, 9947, 9952, 9956, 9961, 9965, 9970, 9974, 9979, 9983, 9977, 9970, 9963, 9956, 9949, 9942, 9936, 9929, 9949, 9970, 9991, 10012, 10032, 10053, 10074, 10095, 10107, 10120, 10133, 10146, 10159, 10172, 10185, 10198, 10211, 10225, 10238, 10252, 10277, 10303, 10338, 10355, 10337, 10308, 10283, 10259, 10240, 10221, 10202, 10183, 10143, 10104, 10065, 10026, 9975, 9924, 9873, 9822, 9786, 9750, 9735, 9720, 9683, 9627, 9551, 9463, 9365, 9278, 9214, 9162, 9100, 9027, 8961, 8895, 8839, 8783, 8727, 8672, 8633, 8594, 8555, 8516, 8478, 8441, 8409, 8365, 8312, 8247, 8173, 8126, 8113, 8100, 8088, 8076, 8046, 8004, 7975, 7935, 7894, 7864, 7820, 7788, 7778, 7768, 7758, 7749, 7724, 7689, 7654, 7631, 7614, 7608, 7603, 7586, 7543, 7489, 7440, 7391, 7347, 7304, 7260, 7216, 7168, 7120, 7066, 7023, 6998, 6973, 6948, 6923, 6873, 6813, 6753, 6703, 6672, 6640, 6609, 6578, 6555, 6532, 6515, 6487, 6440, 6381, 6328, 6274, 6216, 6157, 6098, 6039, 5986, 5934, 5875, 5827]
2589E827l6l7l5l6k1rj7j6k5k5k5k6k5k5k6k5l0l0k9k9mJ5LMj3k5j8j8j8j9j9j9j7j7j8j7
2584E100j2j2j1j1qLMpKJ4OPpj7j1j1l8l8l6l7m4k6oNjj4j7j7j8j7ooJ5J5J5J5j3j4j3j4k6
2579D693k7k6k7NONNj1j2j1j2kjkkLMJ4J3Qj1k3k3k6k7j5j5rrrqJ5K7Qj1k6k7j6j6%Jj1j1
2574D381k1k1JJJJj0j0k0j9LLJJKJmlk6k6l2l1j8%K5L7L0J2oj8k3k4j6j6POONooqrqqNMMN
2568D153l3l2l8k6JJ9L1L1J8kj3j4ook8k7l3j3J3J3J%JJK3K3J8Okk0l3l2j2j1j2j2j7j8NN
2563C922K4K4J7j0j7pllJ%%%JJJJk6k7k6k7j8j8NNOOJ8J7J9J9QQpopoJJJ2J3qpjK5K1JqrJ6
2557C952J6Mj5k3l4l8l9j6J0J8J8ppMML2L1K0Jj4j3mlqrqrj3j3j4j3k0k0j9k0onJ7J7J7J8
2552C789nnj0j0NJ6J0qj9k0j9k0k9j0J7K9J8OJj0k6k6j6KJ5J4LLqqkkQRJ3Poj6j3kJ1J6QL
$$ y = [5827, 5791, 5754, 5719, 5683, 5662, 5653, 5636, 5620, 5595, 5570, 5545, 5519, 5494, 5469, 5443, 5418, 5388, 5358, 5329, 5300, 5296, 5311, 5314, 5318, 5305, 5280, 5262, 5244, 5226, 5207, 5188, 5169, 5152, 5135, 5117, 5100, 5088, 5076, 5065, 5054, 5046, 5049, 5053, 5046, 5048, 5062, 5068, 5075, 5068, 5051, 5040, 5029, 4991, 4953, 4917, 4880, 4836, 4810, 4804, 4809, 4808, 4794, 4777, 4760, 4742, 4725, 4719, 4713, 4728, 4743, 4758, 4773, 4760, 4746, 4733, 4719, 4693, 4666, 4640, 4613, 4618, 4624, 4629, 4634, 4623, 4611, 4600, 4588, 4586, 4585, 4583, 4581, 4584, 4588, 4602, 4615, 4623, 4612, 4589, 4566, 4540, 4513, 4498, 4483, 4474, 4465, 4456, 4448, 4463, 4490, 4498, 4487, 4461, 4434, 4418, 4402, 4402, 4403, 4392, 4381, 4360, 4339, 4340, 4341, 4342, 4343, 4333, 4323, 4303, 4284, 4287, 4290, 4291, 4292, 4294, 4295, 4291, 4288, 4262, 4236, 4204, 4173, 4155, 4155, 4180, 4217, 4247, 4259, 4253, 4235, 4212, 4188, 4172, 4156, 4163, 4169, 4175, 4180, 4174, 4168, 4160, 4151, 4143, 4135, 4140, 4144, 4148, 4153, 4120, 4088, 4050, 4024, 4025, 4044, 4075, 4106, 4124, 4122, 4109, 4095, 4089, 4083, 4055, 4028, 3995, 3982, 3995, 4008, 4009, 4009, 4010, 4011, 4034, 4057, 4075, 4081, 4079, 4059, 4026, 3994, 3982, 3971, 3959, 3947, 3930, 3912, 3917, 3922, 3946, 3970, 3987, 3977, 3960, 3953, 3950, 3947, 3948, 3948, 3948, 3948, 3949, 3950, 3951, 3952, 3926, 3899, 3873, 3846, 3828, 3810, 3815, 3820, 3826, 3832, 3850, 3867, 3886, 3905, 3913, 3921, 3914, 3908, 3901, 3895, 3896, 3897, 3909, 3922, 3914, 3907, 3906, 3931, 3952, 3953, 3945, 3936, 3952, 3968, 3972, 3957, 3934, 3900, 3862, 3823, 3807, 3817, 3835, 3853, 3846, 3839, 3843, 3847, 3879, 3910, 3930, 3931, 3917, 3904, 3900, 3897, 3889, 3880, 3872, 3863, 3850, 3837, 3823, 3810, 3790, 3770, 3751, 3731, 3725, 3720, 3737, 3754, 3771, 3789, 3784, 3779, 3769, 3759, 3764, 3780, 3790, 3782, 3763, 3743, 3724, 3704, 3675, 3665, 3682, 3711, 3729, 3735, 3736, 3726, 3700, 3674, 3658, 3660, 3675, 3689, 3692, 3695, 3687, 3679, 3677, 3675, 3683, 3692, 3705, 3712, 3706, 3690, 3677, 3675, 3686, 3702, 3710, 3713]
2547C713OOJKJKqqqq%j%%KJJJj1j2NJ6J2J2JKkkj3j2pNJ7K3K5J3Lqj6k2k5j4pjlkoNK1K1J2
2541C733Jj1j7j3pj5k6l5k4nJ3J8PqrMMML%nqLJ2J8K1Rj7k8k1k2j2%mrj5j4j5j4nPPnj5j5
2535C470%J2J7J7J6J6J7lj4j4lllljjJ4K5K1LrrRJ0RJ0ppopj7j7j7j6j%j1j1j8j8NNnonnq
2529C431qJ5J5K5K5J4J4KJKKqpMMj5j4PPj2l1k1jNpj0j1kkRRJ8J7PO%%%%J3J2j0j0j9j8qq
2524C442JJJJKKj0rk5k4LK1K2K2JJqrqqJJJJonoJ4K6J4%%PPPOrj0rj0MLMMJ1J1J8OLLQlj5
2517C506j5j6j6j0j0rj0pLkl%jJ%rKJ8J9KKKKonJ6J6Kj0j0JMLMNJ3J4J3J3pj7j1j0nP%JML
2511C487LLj4l3l2j3J4K4K0J9PPOPmj5rqj0rrrrqqrRRQRJ8J8K4J3LKJJlj5j4mPOQPj0j0j1
2505C474j0j8j8j7j8KJ4K8K9L0J9LLLLLLnonoK7K7J5mj2j2J0RK6K6J3nk3k4k4k5jjjjj3j3
$$ y = [3713, 3719, 3725, 3726, 3728, 3729, 3731, 3723, 3715, 3707, 3699, 3699, 3698, 3698, 3698, 3700, 3701, 3702, 3703, 3692, 3680, 3685, 3701, 3713, 3725, 3726, 3728, 3726, 3724, 3711, 3699, 3692, 3697, 3714, 3737, 3762, 3775, 3778, 3770, 3754, 3732, 3707, 3693, 3686, 3685, 3682, 3680, 3674, 3679, 3700, 3721, 3733, 3734, 3723, 3706, 3693, 3686, 3671, 3645, 3610, 3586, 3581, 3594, 3612, 3619, 3611, 3602, 3606, 3610, 3614, 3617, 3617, 3612, 3604, 3607, 3619, 3637, 3658, 3667, 3650, 3622, 3601, 3579, 3567, 3567, 3563, 3554, 3539, 3525, 3510, 3496, 3491, 3498, 3505, 3500, 3485, 3470, 3470, 3482, 3499, 3516, 3532, 3548, 3565, 3562, 3548, 3534, 3531, 3528, 3525, 3522, 3521, 3520, 3534, 3559, 3580, 3583, 3574, 3565, 3574, 3584, 3593, 3603, 3596, 3589, 3583, 3576, 3559, 3542, 3525, 3509, 3508, 3508, 3497, 3486, 3468, 3450, 3455, 3460, 3455, 3449, 3444, 3439, 3431, 3423, 3438, 3453, 3478, 3503, 3517, 3531, 3533, 3534, 3536, 3538, 3530, 3523, 3527, 3531, 3516, 3502, 3509, 3516, 3504, 3473, 3452, 3451, 3456, 3449, 3439, 3428, 3426, 3424, 3433, 3442, 3460, 3477, 3484, 3490, 3490, 3490, 3490, 3490, 3503, 3515, 3505, 3495, 3476, 3458, 3450, 3442, 3443, 3444, 3445, 3446, 3448, 3450, 3440, 3431, 3406, 3382, 3385, 3406, 3428, 3450, 3451, 3452, 3444, 3435, 3427, 3419, 3420, 3421, 3422, 3423, 3417, 3412, 3406, 3420, 3446, 3460, 3460, 3460, 3467, 3474, 3481, 3487, 3478, 3468, 3459, 3449, 3453, 3456, 3460, 3464, 3475, 3486, 3504, 3510, 3513, 3516, 3524, 3521, 3506, 3491, 3475, 3459, 3449, 3439, 3430, 3420, 3413, 3416, 3414, 3411, 3411, 3410, 3411, 3411, 3402, 3404, 3422, 3441, 3443, 3445, 3447, 3449, 3443, 3438, 3454, 3470, 3472, 3462, 3452, 3453, 3457, 3460, 3464, 3469, 3482, 3496, 3509, 3522, 3515, 3498, 3487, 3477, 3472, 3479, 3479, 3480, 3484, 3487, 3490, 3493, 3479, 3446, 3414, 3401, 3415, 3439, 3459, 3478, 3485, 3492, 3498, 3505, 3501, 3486, 3477, 3469, 3459, 3450, 3441, 3432, 3423, 3415, 3407, 3398, 3407, 3416, 3424, 3433, 3451, 3469, 3493, 3506, 3509, 3511, 3512, 3513, 3510, 3495, 3481, 3477, 3484, 3490, 3498, 3505, 3495, 3485, 3474, 3464, 3446, 3428, 3411, 3393, 3395, 3409, 3437, 3466, 3496, 3515, 3518, 3521, 3524, 3527, 3530, 3533, 3528, 3522, 3517, 3511, 3538, 3565, 3580, 3576, 3564, 3552, 3562, 3571, 3597, 3623, 3636, 3631, 3608, 3584, 3560, 3535, 3534, 3533, 3532, 3531, 3518, 3505]
2500C505k4nK1K1K2K3J1J2j1j0k1k0KKNNNNppppOPOOjjjjrqOJ8J5mj5j4j1j0J2J2J8J8Oj2
2494C563k7j6jjLLLLjjjjrrrrJ1J2J1J2J1J2J1J2K3K3J1prqj0j0qqpqJ4J4j1l0l0j0QK0J8
2489C557J7K3J2j2l1k0j9KK2J7OONNOj3j2J4J4J0J0rrpqpqj3j4KK1K5K4J4J4J0Rkjj7j6KJ4
2484C643J3oj4j3nnnnLLLMJ0J0J0J0JJJKpoNNJ5J5mmJ4J4J3J4KLKKQQmmk9m1l1mJ6J5kjqp
2478C660MML0L0J9qk5k5k7k6lkpj7j7KJ6J7J3J4J3J4K1K0K1K1qqqqkklkMMMNj3j3j3j3LKj
2472C690MKrk1k0nOJ2K3L6L6K8RJj0qljkkkJ0RNJ1RlLLkj3poqpqpMNNMJ7J7J6J5Ooj9j8rj0
2466C780qrJJ2Nj3k2j0%JJ1J1J1J2nmnnJ0RJ0RRQJ5Mkjp%mj4qpllrKJ6J5J3J8K0J0llONON
2460C889J4J0pj9j3lJ0K1K5J9Mpj5mQQkjkkRRRRj%jjrj0j0j0MNMMJ4J4J4J4jjjjjjjjonoo
$$ y = [3505, 3481, 3476, 3497, 3518, 3540, 3563, 3574, 3586, 3575, 3565, 3544, 3524, 3526, 3528, 3533, 3538, 3543, 3548, 3541, 3534, 3527, 3520, 3526, 3533, 3539, 3545, 3544, 3543, 3542, 3541, 3532, 3524, 3530, 3548, 3563, 3559, 3544, 3530, 3519, 3509, 3521, 3533, 3551, 3569, 3575, 3563, 3536, 3520, 3519, 3518, 3521, 3524, 3527, 3530, 3529, 3528, 3527, 3526, 3517, 3508, 3499, 3490, 3501, 3513, 3524, 3536, 3547, 3559, 3570, 3582, 3605, 3628, 3639, 3632, 3623, 3615, 3605, 3595, 3587, 3579, 3572, 3564, 3578, 3592, 3581, 3551, 3521, 3511, 3519, 3539, 3557, 3574, 3597, 3609, 3597, 3566, 3546, 3527, 3529, 3551, 3568, 3574, 3580, 3585, 3590, 3596, 3583, 3571, 3585, 3599, 3609, 3619, 3610, 3601, 3594, 3586, 3579, 3571, 3558, 3544, 3546, 3567, 3592, 3616, 3630, 3644, 3654, 3663, 3661, 3660, 3643, 3627, 3629, 3643, 3656, 3650, 3636, 3623, 3618, 3613, 3608, 3603, 3606, 3609, 3612, 3616, 3626, 3636, 3646, 3656, 3657, 3658, 3659, 3661, 3654, 3648, 3653, 3658, 3673, 3688, 3684, 3680, 3694, 3708, 3721, 3735, 3737, 3740, 3742, 3744, 3752, 3760, 3756, 3752, 3723, 3682, 3651, 3647, 3663, 3678, 3676, 3675, 3667, 3660, 3664, 3668, 3698, 3728, 3747, 3739, 3714, 3689, 3662, 3636, 3633, 3631, 3624, 3607, 3590, 3592, 3608, 3625, 3638, 3652, 3665, 3679, 3700, 3720, 3741, 3762, 3754, 3746, 3738, 3730, 3728, 3726, 3723, 3721, 3725, 3729, 3733, 3738, 3725, 3712, 3699, 3686, 3689, 3691, 3690, 3694, 3696, 3687, 3666, 3646, 3641, 3647, 3659, 3682, 3718, 3754, 3782, 3791, 3792, 3782, 3774, 3771, 3770, 3768, 3766, 3764, 3774, 3783, 3788, 3799, 3808, 3805, 3808, 3811, 3809, 3796, 3789, 3783, 3775, 3768, 3760, 3753, 3757, 3762, 3767, 3771, 3788, 3805, 3821, 3836, 3842, 3836, 3817, 3799, 3790, 3780, 3772, 3763, 3764, 3776, 3781, 3768, 3746, 3736, 3736, 3737, 3748, 3759, 3770, 3782, 3777, 3773, 3768, 3763, 3773, 3782, 3792, 3801, 3810, 3818, 3833, 3837, 3835, 3834, 3827, 3827, 3823, 3809, 3801, 3794, 3791, 3788, 3779, 3781, 3797, 3812, 3825, 3843, 3863, 3873, 3870, 3867, 3873, 3878, 3884, 3889, 3903, 3913, 3906, 3887, 3874, 3871, 3881, 3902, 3927, 3946, 3950, 3943, 3928, 3924, 3932, 3940, 3938, 3937, 3935, 3933, 3942, 3951, 3960, 3969, 3968, 3968, 3967, 3966, 3957, 3947, 3937, 3927, 3931, 3936, 3940, 3944, 3958, 3972, 3986, 4000, 3999, 3998, 3997, 3996, 3995, 3994, 3993, 3992, 3986, 3981, 3975, 3969]
2453C969QPQPnnnnpoopK3K3%%PQPPj3j2j3j3MMMMJ0J1J0J0j0j0j1j0mmmnrj0K8K7K0K0llO
2447D052Ork0k0jK6K5RQj3j4rqJ4J4JJk0k0mK2L0L0J3J4KKJ1J0J0rk9k9j7%J0RJ0J1onnnp
2442D090qppJ3J2J3J3j1j0k2k2k4k5KK1L1J9lj5nNK1K1J7J7nnJ3J3rrj7j6NOJ2J3J2J2non
2437D145ononok2k3k1k1j6LLMmmJ9J9J3J3KKJ4J4J4J4J3J3Kj6j4MJ6J5MLqqnmnnQQQPLLLL
2431D188k2k1k2k1OOOOOPPPPQJ8J8J6kk9k8qJ0K3K2RRQRJ4J4J3J4j0j1k2k1onJ5J6Mj4j1J
2425D234J3J2J3J3%j%%rqrqOPPPJ6J6opj4j5j4j4KKKKmmlmmlmmJ7J7J7J7J5J4J4J5RQRRj3
2419D365j2j3j3j9k0LLNONOk0k0j9k0QRL0L1J1%J6L6K9Kj0JK0K0jknnonnnnnj2j1jJ9K0Qo
2414D413pj3j3j3j3OOOOmmmlJ6L4M5M5K4Mppqpk9k9k7rJ1K2J7jj3j2nmnnQPPPj5j5j5j5K0
$$ y = [3969, 3977, 3984, 3992, 3999, 3994, 3989, 3984, 3979, 3972, 3966, 3960, 3953, 3976, 3999, 3999, 3999, 4006, 4014, 4021, 4028, 4015, 4003, 3990, 3977, 3981, 3985, 3989, 3993, 4003, 4014, 4024, 4034, 4024, 4014, 4003, 3993, 3989, 3985, 3981, 3976, 3967, 3957, 3985, 4012, 4032, 4052, 4049, 4046, 4052, 4058, 4049, 4029, 4009, 4008, 4034, 4059, 4068, 4076, 4063, 4049, 4040, 4032, 4046, 4060, 4061, 4062, 4042, 4022, 4018, 4040, 4070, 4100, 4113, 4127, 4129, 4131, 4142, 4152, 4162, 4153, 4124, 4095, 4078, 4078, 4088, 4097, 4107, 4118, 4112, 4107, 4102, 4097, 4090, 4082, 4075, 4068, 4081, 4093, 4106, 4119, 4108, 4098, 4076, 4054, 4030, 4005, 4007, 4028, 4059, 4078, 4075, 4060, 4055, 4060, 4081, 4102, 4119, 4136, 4131, 4126, 4139, 4152, 4143, 4134, 4117, 4101, 4106, 4112, 4124, 4137, 4149, 4161, 4156, 4150, 4145, 4139, 4134, 4128, 4123, 4117, 4095, 4072, 4051, 4030, 4014, 4017, 4020, 4024, 4020, 4016, 4035, 4054, 4067, 4080, 4082, 4084, 4098, 4112, 4126, 4140, 4153, 4166, 4168, 4152, 4138, 4142, 4158, 4173, 4177, 4180, 4172, 4164, 4159, 4155, 4150, 4145, 4153, 4161, 4169, 4176, 4179, 4182, 4185, 4188, 4166, 4145, 4123, 4102, 4108, 4114, 4120, 4126, 4132, 4139, 4146, 4153, 4160, 4168, 4186, 4204, 4220, 4218, 4189, 4161, 4153, 4163, 4186, 4208, 4217, 4226, 4234, 4243, 4257, 4271, 4284, 4298, 4288, 4277, 4255, 4234, 4228, 4223, 4238, 4254, 4258, 4244, 4233, 4234, 4247, 4259, 4272, 4285, 4285, 4284, 4284, 4284, 4275, 4267, 4258, 4250, 4256, 4263, 4270, 4277, 4293, 4309, 4303, 4296, 4282, 4267, 4253, 4239, 4241, 4243, 4245, 4247, 4243, 4239, 4236, 4232, 4228, 4225, 4221, 4217, 4234, 4251, 4268, 4285, 4300, 4314, 4328, 4343, 4352, 4360, 4369, 4378, 4365, 4353, 4340, 4327, 4308, 4288, 4291, 4294, 4299, 4305, 4310, 4316, 4296, 4276, 4257, 4237, 4245, 4254, 4284, 4315, 4326, 4326, 4342, 4378, 4407, 4409, 4399, 4400, 4420, 4440, 4439, 4437, 4432, 4427, 4421, 4416, 4411, 4406, 4401, 4396, 4384, 4373, 4372, 4391, 4411, 4419, 4413, 4406, 4393, 4380, 4367, 4354, 4360, 4366, 4372, 4378, 4374, 4370, 4366, 4363, 4379, 4413, 4458, 4503, 4527, 4531, 4524, 4517, 4509, 4502, 4473, 4444, 4417, 4408, 4419, 4441, 4458, 4457, 4444, 4432, 4427, 4423, 4418, 4413, 4421, 4428, 4435, 4442, 4427, 4412, 4397, 4382, 4402]
2408D402J9J9K0J9J9mlRRRRJ1J0J1J0qpJ4J5lmllkkkkJ0J0J0J1j1j0j1j1QPQPK0J9J9J9J4
2403D681J4qrj9j9LLJ3J4Jj8l0l0qrKKKKOOK9K8L2L2RRJ%k2k2nmmmKLK5K5J1J1J1J1lmlmk7
2397D736l8k5KK1K1K3K2NNLMPj2k9j9LJ4QQK0J9J9J9KKk0k1j5j5mlJ2J2JKrqL0K9K4K3J2J2
2392D902nmj5j6j0j0JJMLMLRRRRK2K2K2K3nnnnj1j0j1j0RRRQK0J9RQJJj4k6j3NJ6J5kk2j6
2386D957nkRK0L1L1L0L0J1j1k1k6qOJ8J2J2%jjjj2k4l2oJ3J2J5J4L7L7K4ORQQPjjjjj5j4j4
2381E160j4QRQQL7L6K4NPPonk3k3j0j1j0KJ7J7J5Mj2j1LJ4QQJ5J6jj1nOK2K2QRQR%%J%%Jj
2375E371%Jj1mmnmnnPPPQJ8J9J8J8Rrk0k1lRQlj0j0j1j0PJ9J2J2J8J9J3KmnJ7J7Onj0j0LK
2369E478MLK7L7L0L1J7NJ1J2%j0nm%%oOL4M6L2OppJ4J3Np%%MNj1k2k3j1MMJ1J2J0J1jj3op
$$ y = [4402, 4421, 4440, 4460, 4479, 4498, 4494, 4491, 4500, 4509, 4518, 4527, 4538, 4548, 4559, 4569, 4561, 4554, 4568, 4583, 4580, 4576, 4573, 4570, 4568, 4566, 4564, 4562, 4572, 4582, 4592, 4603, 4592, 4582, 4571, 4560, 4568, 4575, 4583, 4590, 4610, 4629, 4648, 4667, 4681, 4695, 4687, 4678, 4659, 4640, 4643, 4646, 4659, 4673, 4674, 4656, 4626, 4596, 4588, 4579, 4581, 4583, 4585, 4587, 4593, 4599, 4628, 4656, 4688, 4720, 4729, 4738, 4739, 4739, 4717, 4695, 4690, 4686, 4682, 4678, 4680, 4683, 4708, 4733, 4744, 4755, 4766, 4777, 4774, 4770, 4767, 4763, 4736, 4698, 4673, 4675, 4696, 4717, 4740, 4762, 4767, 4772, 4775, 4779, 4786, 4774, 4745, 4726, 4729, 4743, 4751, 4759, 4779, 4798, 4817, 4836, 4838, 4840, 4820, 4799, 4784, 4769, 4765, 4762, 4774, 4786, 4787, 4789, 4780, 4772, 4802, 4831, 4855, 4878, 4890, 4902, 4897, 4893, 4878, 4862, 4852, 4842, 4843, 4844, 4848, 4851, 4855, 4858, 4867, 4876, 4885, 4894, 4916, 4938, 4960, 4983, 4978, 4973, 4968, 4963, 4952, 4942, 4931, 4921, 4930, 4939, 4948, 4956, 4976, 4995, 5004, 5012, 5013, 5014, 5000, 4974, 4961, 4966, 4982, 4997, 4995, 4973, 4957, 4952, 4950, 4959, 4979, 5010, 5041, 5071, 5101, 5112, 5101, 5080, 5054, 5046, 5052, 5070, 5082, 5094, 5094, 5093, 5092, 5091, 5079, 5055, 5023, 5017, 5030, 5042, 5057, 5071, 5108, 5145, 5169, 5175, 5184, 5192, 5200, 5207, 5206, 5205, 5204, 5203, 5188, 5174, 5160, 5146, 5154, 5163, 5171, 5179, 5216, 5252, 5276, 5281, 5288, 5295, 5289, 5284, 5261, 5238, 5228, 5217, 5207, 5209, 5226, 5243, 5258, 5262, 5250, 5239, 5242, 5256, 5264, 5272, 5287, 5303, 5302, 5291, 5286, 5292, 5314, 5336, 5344, 5353, 5361, 5370, 5370, 5370, 5371, 5371, 5371, 5372, 5371, 5371, 5372, 5361, 5357, 5353, 5348, 5344, 5339, 5334, 5341, 5348, 5355, 5363, 5381, 5400, 5418, 5436, 5445, 5436, 5416, 5395, 5392, 5401, 5409, 5406, 5396, 5386, 5375, 5365, 5372, 5391, 5403, 5415, 5433, 5452, 5465, 5467, 5463, 5458, 5475, 5492, 5498, 5493, 5483, 5473, 5476, 5478, 5482, 5485, 5512, 5549, 5579, 5610, 5627, 5632, 5643, 5655, 5655, 5645, 5640, 5636, 5636, 5636, 5630, 5636, 5670, 5716, 5748, 5754, 5747, 5740, 5754, 5767, 5772, 5765, 5765, 5765, 5769, 5774, 5763, 5741, 5718, 5707, 5711, 5715, 5726, 5738, 5748, 5759, 5758, 5745, 5739, 5732]
2363E732jjkjKKKKLKKKJ3J3J2J3qpppkJ7J2Jnj7j8oJ1J1J1J1K0J9klj4j4RRMMMMK0J9J9J9
2357E909J9J9mmj1j1j2j1j3j2j3j3%%%jMMNMK9K9PPLLKLRRRRRJ0RRnmnmNNMNONJ6lk2k2jj
2351E994KKKKQRRRQQQQRQQQOOONJ9J8klNK3J9Pqk6k3j2QQRRJ3J3rrj0j0J2J3L1K0%j8k3mO
2345F201Pooooj7j8ONRJ0QRpj8k3lJ1J1kj3j0RK0K0K8K8K8K8jjjj%jK2K3PPQPLLLLnonok3
2339F339k2%%NNK7K8K5K6j2j2mnJ8J8MMj7j7nK2L0L0kkkkj%K2K3J9J9J9J9nmnmJJKJpppoq
2333F551pl0k9MNMNmmmml1l0j2K2L6L7K3J1J1J1J0J1LLLLkjMpk1k1j1RJ9J8J9J9Rkj7j8kJ6
2327F609K8K7QlLLqqpp%J1MMpj8j0j1PJ8J1J1QlkQPPPPLqkkllklnmmnmlj1KJ7J7J8J8J6J7
2321F753J6J7J5J5jj2j4j3j9rJJ3J7jj7j8J2K3K5J4kkrrQJ8J9J9J9J9J3LQRkklkj3k4k2j2
$$ y = [5732, 5731, 5730, 5728, 5727, 5729, 5731, 5733, 5735, 5738, 5740, 5742, 5744, 5757, 5770, 5782, 5795, 5787, 5780, 5773, 5766, 5764, 5781, 5793, 5794, 5789, 5772, 5754, 5748, 5759, 5770, 5781, 5792, 5812, 5831, 5829, 5826, 5812, 5798, 5807, 5816, 5820, 5824, 5828, 5832, 5852, 5871, 5890, 5909, 5928, 5947, 5943, 5939, 5928, 5917, 5905, 5894, 5881, 5869, 5856, 5843, 5843, 5843, 5843, 5842, 5846, 5850, 5855, 5859, 5888, 5917, 5924, 5931, 5934, 5937, 5939, 5942, 5951, 5960, 5969, 5978, 5987, 5997, 6006, 6015, 6010, 6006, 6001, 5997, 6002, 6007, 6011, 6016, 6022, 6027, 6043, 6040, 6018, 5996, 5995, 5994, 5996, 5998, 6000, 6002, 6010, 6019, 6028, 6037, 6045, 6053, 6061, 6069, 6078, 6086, 6094, 6102, 6108, 6114, 6120, 6125, 6144, 6162, 6160, 6157, 6162, 6185, 6204, 6211, 6203, 6177, 6154, 6142, 6150, 6158, 6167, 6176, 6189, 6202, 6193, 6184, 6174, 6164, 6176, 6189, 6220, 6240, 6240, 6222, 6199, 6195, 6201, 6208, 6202, 6196, 6190, 6184, 6167, 6149, 6155, 6160, 6169, 6179, 6187, 6196, 6189, 6171, 6148, 6145, 6156, 6167, 6165, 6152, 6142, 6151, 6171, 6191, 6219, 6247, 6275, 6303, 6302, 6301, 6300, 6299, 6299, 6298, 6320, 6343, 6350, 6357, 6365, 6372, 6375, 6378, 6381, 6384, 6379, 6373, 6368, 6362, 6339, 6317, 6317, 6317, 6322, 6327, 6354, 6382, 6407, 6433, 6421, 6409, 6405, 6400, 6418, 6436, 6440, 6444, 6427, 6410, 6405, 6427, 6457, 6487, 6485, 6483, 6481, 6479, 6478, 6478, 6500, 6523, 6542, 6561, 6580, 6599, 6594, 6590, 6585, 6581, 6582, 6583, 6585, 6586, 6579, 6572, 6565, 6559, 6551, 6544, 6514, 6485, 6489, 6494, 6498, 6503, 6499, 6495, 6491, 6487, 6456, 6426, 6414, 6436, 6472, 6509, 6532, 6543, 6554, 6565, 6575, 6586, 6589, 6592, 6595, 6598, 6596, 6595, 6599, 6592, 6571, 6550, 6539, 6548, 6567, 6585, 6604, 6623, 6632, 6630, 6613, 6595, 6593, 6609, 6637, 6664, 6672, 6669, 6672, 6675, 6667, 6659, 6652, 6645, 6645, 6656, 6660, 6664, 6657, 6639, 6629, 6618, 6625, 6643, 6654, 6665, 6673, 6670, 6668, 6676, 6683, 6690, 6697, 6704, 6707, 6699, 6697, 6695, 6692, 6689, 6687, 6684, 6679, 6675, 6671, 6666, 6662, 6659, 6648, 6650, 6667, 6684, 6702, 6720, 6736, 6753, 6769, 6786, 6801, 6816, 6815, 6803, 6789, 6776, 6757, 6748, 6749, 6762, 6779, 6778, 6761, 6743, 6755, 6778, 6803, 6817, 6815, 6813, 6804, 6795, 6803, 6821, 6840, 6859, 6878, 6897, 6910, 6913, 6921, 6930, 6928, 6926, 6923, 6921, 6908, 6884, 6862, 6850]
2316F850J5L3L0J9%%%%K4K4J2oj7j6j8j8j6j7J4K5K6QmlJ6J6J6J6J5J5J4J5MMMMRJ0RJ0ON
2311G153OONNj7j8j1j2j1j2mnnnMNj8j8j3j3%J8L6L6J5J5PQPPJ9K0llRQRQJ0Rj2j3j3j3J0
2305G216RJ2J1J2J1J3J3J3J3opooLMLLMMMMJ9J8J9J9L1L2Rj7k4j3JJ%jjjnnonQQRQJ3J4J4
2299G472J3POOOOOOOOOONj0j0j0j0j3j3ONJJJ%J1J1J1J1JKJKJ6J6J7J6j%%%RK1K4Oj7k7k3
2294G612k2onnoK7K7K6K7J5J4J5J5NONNklklPPPOJ3J3J2J3j%j%MNMNONJ8J7J7J7kj3j7KJ6
2288G905J7QRklmmllPJ8K3MnopoQQPQLKKKPOOOK3K3K3K3QQRQQQQQJ8J8J8J8oopoj9j9j9j9
2281H141RRJ0RmmmmOONOQQQQJ3J2J3J2J2J2ppONJ7J7J1J0qqj2j2j0j1OL1M9L8J6NJ1J1OPO
2275H468Pj1j0kJ7K0J9KrPK7K4Pk5l5l0j0kRK2K3J4J5LLjjjkj0j0QQK5K5J3J4qqqqJ2J2J2
$$ y = [6850, 6865, 6898, 6928, 6947, 6947, 6947, 6947, 6947, 6971, 6995, 7007, 7001, 6984, 6968, 6950, 6932, 6916, 6899, 6913, 6938, 6964, 6972, 6968, 6965, 6981, 6997, 7013, 7029, 7044, 7059, 7073, 7088, 7092, 7096, 7100, 7104, 7113, 7123, 7132, 7142, 7148, 7153, 7159, 7165, 7170, 7175, 7158, 7140, 7129, 7117, 7106, 7094, 7090, 7085, 7080, 7075, 7079, 7084, 7066, 7048, 7035, 7022, 7022, 7040, 7076, 7112, 7127, 7142, 7149, 7157, 7164, 7171, 7190, 7210, 7207, 7204, 7213, 7221, 7230, 7238, 7248, 7257, 7245, 7232, 7219, 7206, 7216, 7225, 7237, 7248, 7260, 7271, 7284, 7297, 7310, 7323, 7317, 7310, 7304, 7298, 7301, 7305, 7308, 7311, 7315, 7319, 7323, 7327, 7346, 7364, 7383, 7402, 7433, 7465, 7474, 7457, 7433, 7420, 7421, 7422, 7422, 7421, 7420, 7419, 7414, 7409, 7403, 7398, 7406, 7414, 7423, 7431, 7444, 7458, 7472, 7485, 7492, 7498, 7504, 7510, 7516, 7522, 7528, 7534, 7540, 7546, 7552, 7557, 7547, 7537, 7527, 7517, 7504, 7491, 7497, 7502, 7503, 7504, 7505, 7505, 7516, 7527, 7538, 7549, 7550, 7552, 7553, 7555, 7571, 7587, 7604, 7620, 7619, 7619, 7619, 7619, 7628, 7649, 7673, 7679, 7662, 7635, 7612, 7590, 7584, 7579, 7574, 7568, 7595, 7622, 7648, 7675, 7690, 7704, 7719, 7734, 7739, 7745, 7750, 7755, 7753, 7750, 7748, 7745, 7752, 7759, 7766, 7772, 7785, 7798, 7810, 7823, 7822, 7822, 7821, 7821, 7825, 7830, 7834, 7839, 7845, 7850, 7868, 7885, 7902, 7919, 7917, 7904, 7887, 7889, 7905, 7922, 7930, 7939, 7937, 7934, 7930, 7926, 7923, 7920, 7927, 7945, 7968, 7972, 7967, 7961, 7954, 7948, 7956, 7964, 7971, 7979, 7982, 7984, 7986, 7988, 7995, 8001, 8007, 8013, 8036, 8059, 8082, 8105, 8113, 8121, 8130, 8138, 8146, 8154, 8162, 8170, 8188, 8206, 8224, 8242, 8236, 8230, 8223, 8217, 8198, 8179, 8160, 8141, 8150, 8159, 8169, 8178, 8174, 8170, 8166, 8162, 8168, 8174, 8179, 8185, 8193, 8201, 8209, 8217, 8230, 8242, 8255, 8267, 8279, 8291, 8284, 8277, 8283, 8288, 8305, 8322, 8333, 8343, 8335, 8327, 8315, 8303, 8293, 8282, 8288, 8319, 8368, 8406, 8422, 8427, 8438, 8449, 8455, 8462, 8468, 8475, 8464, 8454, 8452, 8469, 8489, 8508, 8510, 8501, 8508, 8535, 8559, 8566, 8541, 8506, 8476, 8466, 8464, 8473, 8495, 8518, 8532, 8547, 8550, 8553, 8552, 8551, 8550, 8548, 8538, 8528, 8536, 8544, 8569, 8594, 8607, 8621, 8613, 8605, 8597, 8589, 8601, 8613, 8625]
2270H625J2OOONJ0J0RJ0K8K8J2pk0k0NORJ0K2K1J6J7J6J7j%%%kjkjQQrrKK2L0L0J0J1j5j6
2265H924k1k0NOJ8J8PPJ0RRJ0QQQQnnnnJ9K0J9K0J0J0J0J0mmnmRQJ9J9Mj5k2k3NNJ7J6RRR
2259I164J0poJK0K4J3KKMNNMrj0kJ8L1L1K2K1kjRJ0J7J8OORRrj0lmlmnnJ0K9K5J3nnJ2J3J3
2253I486J3J7J7J6J7J7J7J6J7MNMMj0j0nOK0K0RljjjkkjkkmlQQ%%QK7L6L0J4MQQQQJ1J2J1
2247I859J1J0jrj5j3prj0MJ4J2OKJJKJ8J8J7J8NplKLKMLJ3J4Jrj2%MMJ0J5Qlj2QK1J0joj0
2241I993JRQJ0J0LLMMJ8L0K3K3K6K6K8K3%j1nnrj0j2oJ2K3J8J7J7J7J8J7MMMMJ4J3J4J4mm
2236A0386PPmnPK6K2J1J1K3K5J4jkklklJ1J0J1J1poooLMMMJ%J2J2J9J8j9j9j4j4K3K3L0K9
2231A0651PORRQRJJJJJ0J0J1J0K0K0K0K0J4J5J4J4POPOJJJJjj%jK0K0K0K1J2K3L2Oj8j8k4
$$ y = [8625, 8637, 8643, 8649, 8655, 8660, 8670, 8680, 8689, 8699, 8727, 8755, 8767, 8760, 8740, 8720, 8725, 8731, 8740, 8750, 8772, 8793, 8809, 8826, 8842, 8859, 8858, 8858, 8858, 8858, 8856, 8855, 8853, 8852, 8860, 8868, 8859, 8850, 8852, 8874, 8904, 8934, 8944, 8955, 8940, 8924, 8903, 8883, 8888, 8894, 8912, 8930, 8937, 8944, 8954, 8963, 8972, 8982, 8990, 8998, 9006, 9014, 9009, 9004, 8999, 8994, 9013, 9033, 9052, 9072, 9082, 9092, 9102, 9112, 9108, 9104, 9099, 9095, 9104, 9112, 9131, 9150, 9154, 9139, 9117, 9094, 9099, 9104, 9121, 9137, 9146, 9155, 9164, 9174, 9167, 9161, 9162, 9182, 9206, 9219, 9221, 9223, 9227, 9232, 9237, 9241, 9232, 9222, 9220, 9238, 9269, 9300, 9322, 9343, 9341, 9340, 9349, 9359, 9376, 9394, 9400, 9406, 9415, 9424, 9415, 9405, 9402, 9398, 9395, 9391, 9386, 9381, 9391, 9420, 9445, 9458, 9453, 9448, 9460, 9473, 9486, 9499, 9516, 9533, 9549, 9566, 9583, 9600, 9616, 9633, 9637, 9642, 9646, 9650, 9640, 9630, 9625, 9631, 9651, 9671, 9680, 9677, 9676, 9675, 9674, 9672, 9670, 9669, 9667, 9665, 9661, 9658, 9666, 9674, 9674, 9674, 9682, 9709, 9745, 9775, 9789, 9793, 9801, 9809, 9817, 9825, 9836, 9848, 9859, 9870, 9880, 9879, 9870, 9855, 9842, 9835, 9826, 9816, 9820, 9834, 9846, 9852, 9854, 9855, 9856, 9858, 9876, 9894, 9911, 9929, 9934, 9927, 9924, 9926, 9929, 9931, 9935, 9938, 9951, 9965, 9966, 9957, 9945, 9945, 9949, 9953, 9963, 9978, 9986, 9983, 9971, 9979, 10000, 10010, 10009, 10003, 9993, 9994, 10003, 10011, 10021, 10031, 10034, 10037, 10041, 10045, 10063, 10093, 10116, 10139, 10165, 10191, 10219, 10242, 10242, 10231, 10226, 10221, 10212, 10202, 10190, 10184, 10196, 10219, 10237, 10254, 10271, 10288, 10306, 10323, 10327, 10331, 10335, 10339, 10353, 10366, 10380, 10394, 10390, 10386, 10393, 10400, 10396, 10391, 10398, 10424, 10446, 10457, 10468, 10491, 10516, 10530, 10529, 10527, 10525, 10522, 10520, 10517, 10528, 10538, 10549, 10560, 10553, 10547, 10541, 10535, 10538, 10542, 10546, 10550, 10551, 10551, 10563, 10575, 10594, 10612, 10593, 10574, 10560, 10546, 10569, 10592, 10622, 10651, 10658, 10664, 10673, 10682, 10690, 10699, 10700, 10701, 10702, 10703, 10713, 10723, 10734, 10744, 10764, 10784, 10804, 10824, 10838, 10853, 10867, 10881, 10888, 10894, 10901, 10907, 10908, 10909, 10910, 10911, 10910, 10909, 10909, 10908, 10928, 10948, 10968, 10989, 11001, 11024, 11056, 11062, 11044, 11026, 11002]
2225A1002j4J0K9K5J4RQQPJ4J3J3J4j1j1j1j1J0J1J1J1OOK9K9J9J8mmJ1J0J0J0J2J2J1J2q
2220A1330qJ5J4QRj5j4jjJ0J1ONOOnnonJ6J6L7L7Qj1j0RK7L9M3K4kj2qpj3j2j3j3QQQQK6K6
2215A1599K6K6K4K4K2K3K1Kk3k4rRK1K1RJ0RJ0lj4j8JJ8J8J9K0K3K4%JNMJ6J5KLKKJ9J9J9
2210A1995J9OONOJ6J5J5J5J6J5J5J6J2J3J2J3NNJ7L5M6L4J9J9J5J6MLK1K1L2L3K4K4JJK2K2
2205A2629J0J0J5J6Lj6j5j6mJ4K7K7J7kpNJ9K0J2J2JJj8j8j8j8k2k1j4J2K4K5LLj4j4j5j4
2200A2659JJJJPOPOK5K4K5K4MMMMQQQRkjjjJ5J4J5J4K4K3K3K3J0J0J0j0k1k2j1QK6K5J5J5
2195A3037%%%%OOK9K8J2J1J2J2QRL1L1K2K2J1J1J2J2J2J2J7J7J7J8K4K4K5K4MMLMK7K6K6K6
2190A3632K2J1PK6L7L7J6J6J0J1J0J0J0J1j3j2mlmmj2j1J1J1J4J4qqpqLMonNOlmj5j4rqqq
$$ y = [11002, 10988, 10998, 11027, 11052, 11066, 11075, 11083, 11091, 11098, 11112, 11125, 11138, 11152, 11141, 11130, 11119, 11108, 11118, 11129, 11140, 11151, 11157, 11163, 11192, 11221, 11240, 11258, 11254, 11250, 11261, 11271, 11281, 11291, 11303, 11315, 11326, 11338, 11330, 11322, 11337, 11351, 11359, 11368, 11353, 11339, 11338, 11337, 11347, 11358, 11364, 11369, 11375, 11381, 11376, 11371, 11365, 11360, 11376, 11392, 11429, 11466, 11474, 11463, 11453, 11462, 11489, 11528, 11571, 11595, 11593, 11581, 11573, 11566, 11553, 11541, 11528, 11515, 11523, 11531, 11539, 11547, 11573, 11599, 11625, 11651, 11675, 11699, 11721, 11744, 11765, 11767, 11744, 11720, 11711, 11720, 11741, 11762, 11771, 11781, 11790, 11800, 11797, 11783, 11765, 11766, 11784, 11802, 11821, 11841, 11864, 11888, 11888, 11889, 11894, 11898, 11914, 11929, 11931, 11934, 11936, 11938, 11957, 11976, 11995, 12014, 12020, 12026, 12031, 12037, 12053, 12068, 12083, 12098, 12114, 12129, 12144, 12160, 12172, 12185, 12197, 12210, 12215, 12220, 12237, 12272, 12318, 12352, 12371, 12390, 12405, 12421, 12425, 12428, 12449, 12470, 12502, 12535, 12559, 12583, 12584, 12585, 12607, 12629, 12639, 12649, 12664, 12680, 12683, 12667, 12652, 12636, 12632, 12646, 12673, 12700, 12717, 12715, 12708, 12713, 12732, 12752, 12764, 12776, 12777, 12778, 12760, 12742, 12724, 12706, 12684, 12663, 12649, 12661, 12685, 12710, 12713, 12716, 12702, 12688, 12673, 12659, 12660, 12661, 12662, 12663, 12670, 12676, 12683, 12689, 12714, 12738, 12763, 12787, 12791, 12795, 12799, 12803, 12811, 12819, 12827, 12836, 12834, 12833, 12832, 12831, 12846, 12860, 12875, 12889, 12913, 12936, 12959, 12982, 12992, 13002, 13012, 13002, 12981, 12959, 12948, 12956, 12982, 13007, 13022, 13037, 13037, 13037, 13037, 13037, 13043, 13049, 13078, 13106, 13118, 13129, 13141, 13153, 13161, 13170, 13201, 13232, 13254, 13276, 13287, 13298, 13310, 13322, 13334, 13346, 13363, 13380, 13397, 13415, 13439, 13463, 13488, 13512, 13516, 13520, 13523, 13527, 13554, 13580, 13606, 13632, 13654, 13665, 13672, 13698, 13735, 13772, 13788, 13804, 13814, 13825, 13835, 13845, 13855, 13866, 13853, 13841, 13837, 13834, 13830, 13826, 13814, 13803, 13814, 13825, 13839, 13853, 13845, 13837, 13830, 13822, 13825, 13829, 13823, 13818, 13823, 13829, 13826, 13822, 13807, 13793, 13784, 13776, 13768, 13760]
2185A3760OJ7J1qk0qPPLLjj2mJ5K2J1mPL2M3L0L0L0L1%%%%OOOOKLKLQQQQMMMMJ3J4J3J3ML
2179A4150MMnmmnJ5J5L8L8K5K6J4J5kjkjKKK4K4QkpJ2K0J9J9J9lk2k1lJ7K2K0K0K5J9Om%J2
2173A4548NNJ8J8Lrj5lJ3J2J5J5J5J4RRK1L9M1L0J4J4%j2nmo%J3K3J9Qj0nJ7L6L2K0RllRK0
2168A4989K1K1K1RQQQPPPPJ2J2NJ7L0K9J4Lpj2j3oOJ8J5RK0K5K1K1K0RRK0K0Rj4k6rJ0K1K1
2163A5422J5J5J4J5J7J1jj2j9qJ6K8L3L3J7PJJJ6K8L4L5J8OLrrJJ2J8K6Oj1j1MJ5J5J4J5J5
2158A5846JJJKlLJ6K8L3L4J9PMNMMQRQQNMNMMNK0L1K5J4KmMJ5J2PJ5K6K0K0K0K1Npj6j1JJ3
2152A6298J3J3J4J4J7J8J6J6KrkkRK1J5J4K5K5K4K5J4J5J4J4NNK4K9K2J2J0K3K3J2J6K1K1
2148A6846K1K1K1J6J6J5J6J3J4J3J4J7J8KrkJ6L0K5RLOONMONjJ0L6M6K9K9L0L0J5J5J5J5J7
$$ y = [13760, 13766, 13783, 13794, 13786, 13766, 13758, 13765, 13772, 13775, 13778, 13777, 13765, 13761, 13776, 13798, 13809, 13805, 13812, 13844, 13887, 13917, 13947, 13977, 14008, 14008, 14008, 14008, 14008, 14014, 14020, 14026, 14032, 14034, 14037, 14039, 14042, 14050, 14058, 14066, 14074, 14078, 14082, 14086, 14090, 14103, 14117, 14130, 14143, 14147, 14150, 14154, 14158, 14153, 14149, 14145, 14140, 14155, 14170, 14208, 14246, 14271, 14297, 14311, 14326, 14324, 14323, 14321, 14320, 14322, 14324, 14348, 14372, 14380, 14378, 14371, 14383, 14403, 14422, 14441, 14460, 14457, 14435, 14414, 14411, 14428, 14450, 14470, 14490, 14515, 14534, 14540, 14536, 14536, 14548, 14553, 14558, 14576, 14594, 14597, 14588, 14573, 14570, 14583, 14595, 14610, 14625, 14640, 14654, 14663, 14672, 14693, 14732, 14773, 14803, 14817, 14831, 14831, 14819, 14814, 14810, 14804, 14804, 14817, 14840, 14859, 14867, 14857, 14852, 14869, 14905, 14937, 14957, 14966, 14963, 14960, 14969, 14989, 15010, 15031, 15052, 15061, 15069, 15077, 15085, 15092, 15099, 15106, 15113, 15125, 15137, 15142, 15159, 15189, 15218, 15232, 15235, 15228, 15216, 15203, 15197, 15203, 15221, 15236, 15245, 15265, 15290, 15311, 15332, 15352, 15361, 15370, 15390, 15410, 15419, 15405, 15379, 15370, 15380, 15401, 15422, 15437, 15452, 15466, 15481, 15498, 15509, 15508, 15496, 15477, 15469, 15485, 15513, 15546, 15579, 15596, 15603, 15604, 15605, 15621, 15649, 15683, 15718, 15736, 15742, 15745, 15736, 15727, 15728, 15740, 15758, 15784, 15790, 15779, 15768, 15772, 15787, 15802, 15816, 15831, 15846, 15847, 15848, 15849, 15851, 15848, 15851, 15867, 15895, 15928, 15962, 15981, 15988, 15992, 15997, 16001, 16005, 16013, 16022, 16030, 16038, 16043, 16047, 16052, 16056, 16060, 16065, 16085, 16116, 16141, 16155, 16157, 16153, 16157, 16172, 16184, 16191, 16206, 16232, 16252, 16272, 16292, 16313, 16318, 16311, 16295, 16284, 16285, 16298, 16311, 16324, 16338, 16352, 16369, 16387, 16403, 16419, 16421, 16412, 16410, 16408, 16417, 16438, 16453, 16467, 16492, 16517, 16541, 16566, 16580, 16595, 16609, 16623, 16628, 16633, 16657, 16686, 16708, 16720, 16730, 16753, 16776, 16788, 16804, 16825, 16846, 16867, 16888, 16909, 16925, 16941, 16956, 16972, 16985, 16999, 17012, 17026, 17043, 17061, 17063, 17054, 17052, 17068, 17098, 17123, 17132, 17135, 17141, 17147, 17152, 17156, 17162, 17167, 17166, 17176, 17212, 17258, 17287, 17316, 17346, 17376, 17391, 17406, 17421, 17436, 17453]
2143A7453J7J7J6K9K8J6lj2j2j4j3NOK8K8L9L9J2pqqqqmJ6K6K7Pj2j2j2nnnnJ5J6J5J5J5J5
2138A7747J5J5K2K3j%J6J5J6J6J0J0J0J0onJ7J7K0K0J9J9Rrk7j6QJ9J3J3nmnnKKRkjJ7K9K9
2132A8101%%%JJ1J1J1J1kkklL5L5L4L5K8K9K9K9%%j%J8J7J7J8OOJ8J8J9J9mlj5j4rKJ1K2K8
2127A8564K7K2K2J0J1J8J7J8J7K1K0K1K0MLMMMMNOJ5K6K3J7J1jNNjjjjQQRRK3K8L1K1KQJ5
2122A9101J5J2J6K9M0K9J1J5K5J7OJ2J3QPQRJ5K6L0L0J6Mrj5j7j7jJ0J9J9RRLMJ8L0L3K1O
2117A9616OJ5J5pq%jlKK4L4K9K9L0L0L6K6K0K0K3J6Mpk0k6k3j3QK7L0L0L0L0K1J0J3J9K7K7
2112B0139J5lj0rJ1J2K4K4K5K4J7J8J7J8POK8K8J0rmPK1L3K7K8K7K8K1L1L2J4PJ8L0L0opL
2107B0732MK5K6K7K6J6J5lllmJ0RRJ0J4J5J5J5K0K0K1K0J0J0J0J0K7K7K7K7K9K8K9K8L4L4
$$ y = [17453, 17470, 17487, 17503, 17532, 17560, 17576, 17573, 17561, 17549, 17535, 17522, 17527, 17533, 17561, 17589, 17628, 17667, 17679, 17672, 17664, 17656, 17648, 17640, 17636, 17652, 17678, 17705, 17712, 17700, 17688, 17676, 17671, 17666, 17661, 17656, 17671, 17687, 17702, 17717, 17732, 17747, 17762, 17777, 17799, 17822, 17821, 17821, 17837, 17852, 17868, 17884, 17894, 17904, 17914, 17924, 17918, 17913, 17930, 17947, 17967, 17987, 18006, 18025, 18034, 18025, 17998, 17982, 17990, 18009, 18022, 18035, 18030, 18026, 18021, 18016, 18018, 18020, 18029, 18027, 18026, 18043, 18072, 18101, 18101, 18101, 18101, 18102, 18113, 18124, 18135, 18146, 18144, 18142, 18140, 18137, 18172, 18207, 18241, 18276, 18304, 18333, 18362, 18391, 18391, 18391, 18390, 18390, 18408, 18425, 18442, 18460, 18466, 18472, 18490, 18508, 18527, 18546, 18542, 18539, 18524, 18510, 18501, 18503, 18514, 18536, 18564, 18591, 18613, 18635, 18645, 18656, 18674, 18691, 18709, 18726, 18747, 18767, 18788, 18808, 18812, 18815, 18819, 18823, 18827, 18831, 18836, 18842, 18857, 18883, 18906, 18923, 18934, 18933, 18938, 18943, 18942, 18941, 18940, 18939, 18947, 18955, 18964, 18973, 18996, 19024, 19055, 19076, 19078, 19086, 19101, 19116, 19128, 19144, 19173, 19213, 19242, 19253, 19268, 19293, 19310, 19316, 19328, 19341, 19349, 19356, 19364, 19373, 19388, 19414, 19444, 19474, 19490, 19494, 19485, 19470, 19453, 19436, 19435, 19445, 19464, 19483, 19492, 19501, 19504, 19508, 19526, 19556, 19589, 19610, 19616, 19622, 19637, 19652, 19645, 19637, 19637, 19636, 19633, 19635, 19659, 19693, 19722, 19751, 19781, 19811, 19847, 19873, 19893, 19913, 19936, 19952, 19956, 19949, 19929, 19903, 19880, 19867, 19875, 19902, 19932, 19962, 19992, 20022, 20043, 20053, 20066, 20085, 20112, 20139, 20154, 20151, 20141, 20132, 20143, 20155, 20179, 20203, 20228, 20252, 20269, 20287, 20304, 20322, 20329, 20335, 20363, 20391, 20401, 20392, 20388, 20395, 20416, 20449, 20476, 20504, 20531, 20559, 20580, 20611, 20643, 20657, 20664, 20682, 20712, 20742, 20736, 20729, 20732, 20736, 20761, 20787, 20814, 20840, 20856, 20871, 20868, 20865, 20862, 20858, 20868, 20877, 20886, 20896, 20910, 20925, 20940, 20955, 20975, 20995, 21016, 21036, 21046, 21056, 21066, 21076, 21103, 21130, 21157, 21184, 21213, 21241, 21270, 21298, 21332, 21366]
2103B1366L4L4POQQLK3L4L4J8J8mnj6j6OOK2K2K2K3J0J1jjMMK7K6K9K8K9K9J5J5qqKJK3K4
2098B1912K2K3J2J1J9J9J9K0J3J4J3J4K1K2J0J0J5J5L8L8J1J1J1J1L0K9L0K9J7J6J6J7NNO
2093B2524NJ1J1J1J1RRRRJ4J5J4J5J4J3J4J4j1j1J2J2J2J3L5L5M9M8L6J7Jj0j1%RRJ1L0N2
2089B3060N3M2K3J8J8J3KJ1L0M0K1pj9j2PJ5K5M4M3L9L9J7J6POPOJ2J2L4L4L8L9J6J6J4J5
2084B3794J5J4LKK5K5J8J8J7J8L1L0L0L0LMLMj%K2K2J9J9J8J8J2ojJ0K7L9L9K8K7K7K6K6L1
2080B4486L2L2L1K1K0K0K1K9L0L0L0J7J7J7J8K2K3L4L4L0L1QQONK0L2K9RjjK8K7J7J7J6J5
2075B5260K8K7J7J7ONL0L1L0L0K9K9J8%oOK2K1J7J7M0L9M5M5PPJ4J4K6K5J0J1J0J1K3K2K3
2070B6006K3L0L0J5MJ9L7M3L3J7J6J7J6K2K3L3L4L7L7K6O%jK1K1M7M6K4K3J1J1K2K3L6L6L6
$$ y = [21366, 21400, 21434, 21441, 21447, 21455, 21463, 21466, 21489, 21523, 21557, 21575, 21593, 21589, 21584, 21568, 21552, 21558, 21564, 21586, 21608, 21630, 21653, 21663, 21674, 21673, 21672, 21676, 21680, 21707, 21733, 21762, 21790, 21819, 21848, 21863, 21878, 21870, 21862, 21864, 21865, 21888, 21912, 21934, 21957, 21969, 21980, 21999, 22018, 22037, 22057, 22070, 22084, 22097, 22111, 22132, 22154, 22164, 22174, 22189, 22204, 22242, 22280, 22291, 22302, 22313, 22324, 22354, 22383, 22413, 22442, 22459, 22475, 22491, 22508, 22513, 22518, 22524, 22529, 22540, 22551, 22562, 22573, 22582, 22591, 22600, 22609, 22623, 22638, 22652, 22667, 22681, 22694, 22708, 22722, 22711, 22700, 22712, 22724, 22736, 22749, 22784, 22819, 22868, 22916, 22952, 22969, 22970, 22960, 22949, 22949, 22958, 22967, 22978, 23008, 23060, 23113, 23155, 23178, 23196, 23214, 23227, 23229, 23240, 23270, 23310, 23331, 23324, 23305, 23293, 23300, 23315, 23340, 23384, 23427, 23466, 23505, 23522, 23538, 23545, 23551, 23558, 23564, 23576, 23588, 23622, 23656, 23694, 23733, 23749, 23765, 23779, 23794, 23809, 23823, 23826, 23828, 23853, 23878, 23896, 23914, 23931, 23949, 23980, 24010, 24040, 24070, 24073, 24077, 24080, 24084, 24083, 24083, 24105, 24127, 24146, 24165, 24183, 24201, 24213, 24207, 24206, 24216, 24243, 24282, 24321, 24349, 24376, 24403, 24429, 24455, 24486, 24518, 24550, 24581, 24602, 24622, 24642, 24663, 24692, 24722, 24752, 24782, 24799, 24816, 24833, 24851, 24873, 24896, 24930, 24964, 24994, 25025, 25033, 25041, 25047, 25052, 25072, 25104, 25133, 25142, 25141, 25140, 25168, 25195, 25212, 25229, 25245, 25260, 25288, 25315, 25332, 25349, 25355, 25360, 25390, 25421, 25451, 25481, 25510, 25539, 25557, 25557, 25551, 25557, 25579, 25600, 25617, 25634, 25674, 25713, 25758, 25803, 25810, 25817, 25831, 25845, 25871, 25896, 25906, 25917, 25927, 25938, 25961, 25983, 26006, 26029, 26059, 26089, 26104, 26108, 26127, 26164, 26207, 26240, 26257, 26273, 26290, 26306, 26328, 26351, 26384, 26418, 26455, 26492, 26518, 26524, 26524, 26523, 26544, 26565, 26612, 26658, 26682, 26705, 26716, 26727, 26749, 26772, 26808, 26844, 26880]
2066B6880L7K7K8K7K8K2K2K2K2K4K4L5L5J9K0kjJ5M2O5O4M2M2M0M1K7RJJ3K1K0%JJ9M6O0M8
2062B7885J9QJ3J3J3J2JJlmK0J9L8L8N0M9M1M1L0L0L1L1L2L1L8L8L8L8L3L3M4M5L9L9J6J7
2057B8857K4K4K5K4K9L0K9L0L6L7L6L7K5K4M8M7K9K9K9K9L7L6L7L6J2J3J2J2J8J8J8J8L8L9
2053B9822L9L8K6K6K5K6L1L2L1L1L4L4L4L3K5K4J4J3K8K8N0M9M0K1J1J0K9M8O0N9L8L7L8L7
2049C0921M9M9M9M9L9M0L8L8J4nJJ2K8M7N9O0M4M4M4M4N0N1N1N1N5N5N5N4N5N5N4N4N9M8M5
2045C2456O3Q1R2R2Q1N4M2M7M8O8O7O8O8Q2Q3Q3Q2Q9Q8Q8Q9R9J00J00J00Q6Q7Q7Q6Q9Q9Q8
2041C5022Q9R4R4R4R4J08J08J08J08J20J20J20J19J29J29J18R9Q9J08J42J53J48J48J50J50
2038C7961J63J82J94J94J86J85J98K16K31K41K55K65K83L09L37L56L69L79M03M21M48M66M86
$$ y = [26880, 26917, 26944, 26972, 26999, 27027, 27049, 27071, 27093, 27115, 27139, 27163, 27198, 27233, 27252, 27272, 27270, 27269, 27284, 27326, 27391, 27455, 27497, 27539, 27579, 27620, 27647, 27656, 27657, 27670, 27691, 27711, 27711, 27712, 27731, 27777, 27837, 27885, 27904, 27912, 27925, 27938, 27951, 27963, 27964, 27965, 27962, 27958, 27978, 27997, 28035, 28073, 28123, 28172, 28213, 28254, 28284, 28314, 28345, 28376, 28408, 28439, 28477, 28515, 28553, 28591, 28624, 28657, 28701, 28746, 28785, 28824, 28840, 28857, 28881, 28905, 28930, 28954, 28983, 29013, 29042, 29072, 29108, 29145, 29181, 29218, 29243, 29267, 29315, 29362, 29391, 29420, 29449, 29478, 29515, 29551, 29588, 29624, 29636, 29649, 29661, 29673, 29691, 29709, 29727, 29745, 29783, 29822, 29861, 29899, 29925, 29951, 29976, 30002, 30033, 30065, 30096, 30127, 30161, 30195, 30229, 30262, 30287, 30311, 30325, 30338, 30366, 30394, 30444, 30493, 30533, 30554, 30565, 30575, 30604, 30652, 30712, 30771, 30809, 30846, 30884, 30921, 30970, 31019, 31068, 31117, 31156, 31196, 31234, 31272, 31286, 31281, 31282, 31294, 31322, 31369, 31428, 31488, 31532, 31576, 31620, 31664, 31714, 31765, 31816, 31867, 31922, 31977, 32032, 32086, 32141, 32196, 32250, 32304, 32363, 32411, 32456, 32519, 32600, 32692, 32784, 32865, 32919, 32961, 33008, 33056, 33124, 33191, 33259, 33327, 33409, 33492, 33575, 33657, 33746, 33834, 33922, 34011, 34110, 34210, 34310, 34410, 34496, 34583, 34670, 34756, 34845, 34934, 35022, 35111, 35205, 35299, 35393, 35487, 35595, 35703, 35811, 35919, 36039, 36159, 36279, 36398, 36527, 36656, 36774, 36873, 36962, 37070, 37212, 37365, 37513, 37661, 37811, 37961, 38124, 38306, 38500, 38694, 38880, 39065, 39263, 39479, 39710, 39951, 40206, 40471, 40754, 41063, 41400, 41756, 42125, 42504, 42907, 43328, 43776, 44242, 44728]
2035D4728N05N25N51N80N99O07O08O07O07O06N84N62N25M86M49M10L58K71K03J42P6j5r7j77
2032E4300k46l11l63m10m32m59m81n17n54n73n73n53n52n26n26m95m57m28m28m36m14l67l30
2029D3869l08k86k74k52k40k41k38k37k07j68j48j47j45j44j39j38j16j16p4p5p4p4o2o3o2
2026C9841o3n7n6n7n7l1l1l1l1mmnmk0k0m2m3k3k2k3k3l5l6j3j3J3J2J2J3J2J1j1j1qrK9K9
2021C9189K2K1j5j6%JK3K3L4L4L3L4M2M3J9K0K2K2K2K1K1K0K1K0L2L1L2L2M1M2J9J8K7K7K7
2017D0004K7L1L1L1L1K0K0K8J6J2L1N6N7K4K4K4K4M1M1M1M1L4L4klj2jK0L9M5M5L1K0K8M6
2013D0979N8N7N6N5N6N5N2N1N1N2M8M9M9M8K1K1K0K1K5K5K5K5M1M0M1M1N9N9L6L7L1L1N4N3
2009D2422L4L3L4L3L8L8O0O0N7N6L4L4L9L8O0O1M6M6M6M6M5M5J9%%J2L5M6N1N2M4N6O4M6K0
$$ y = [44728, 45233, 45758, 46309, 46889, 47488, 48095, 48703, 49310, 49917, 50523, 51107, 51669, 52194, 52680, 53129, 53539, 53897, 54168, 54371, 54513, 54589, 54574, 54477, 54300, 54054, 53743, 53380, 52970, 52538, 52079, 51598, 51081, 50527, 49954, 49381, 48828, 48276, 47750, 47224, 46729, 46272, 45844, 45416, 44980, 44566, 44199, 43869, 43561, 43275, 43001, 42749, 42509, 42268, 42030, 41793, 41586, 41418, 41270, 41123, 40978, 40834, 40695, 40557, 40441, 40325, 40251, 40176, 40102, 40028, 39966, 39903, 39841, 39778, 39721, 39665, 39608, 39551, 39520, 39489, 39458, 39427, 39423, 39419, 39414, 39410, 39390, 39370, 39328, 39285, 39262, 39240, 39217, 39194, 39159, 39123, 39110, 39097, 39110, 39122, 39134, 39147, 39159, 39170, 39159, 39148, 39140, 39131, 39160, 39189, 39211, 39232, 39217, 39201, 39201, 39202, 39225, 39248, 39282, 39316, 39349, 39383, 39425, 39468, 39487, 39507, 39529, 39551, 39573, 39594, 39615, 39635, 39656, 39676, 39708, 39739, 39771, 39803, 39844, 39886, 39905, 39923, 39950, 39977, 40004, 40031, 40062, 40093, 40124, 40155, 40175, 40195, 40223, 40239, 40251, 40282, 40338, 40395, 40419, 40443, 40467, 40491, 40532, 40573, 40614, 40655, 40689, 40723, 40721, 40718, 40706, 40705, 40725, 40764, 40809, 40854, 40885, 40905, 40933, 40979, 41037, 41094, 41150, 41205, 41261, 41316, 41368, 41419, 41470, 41522, 41570, 41619, 41668, 41716, 41737, 41758, 41778, 41799, 41824, 41849, 41874, 41899, 41940, 41980, 42021, 42062, 42121, 42180, 42216, 42253, 42284, 42315, 42369, 42422, 42456, 42489, 42523, 42556, 42594, 42632, 42692, 42752, 42809, 42865, 42899, 42933, 42972, 43010, 43070, 43131, 43177, 43223, 43269, 43315, 43360, 43405, 43424, 43424, 43424, 43436, 43471, 43517, 43568, 43620, 43664, 43720, 43784, 43830, 43850]
2004D3850K0N4P2O8N7M6M5M5M5M5M4L5J5J9M6N8M7L5L5L5L5K6K6K6K6L0L0M2O1P5P5O5M6M7
2000D5326N8N7M6L5L6L5L4N6N5N5N6N2N3N2N3K3K3M5M6L5L5L6L5K9L0N2N2N8N8N7N8M6M6M6
1996D6869M6N3N4N3N3M6M6M7M6J7J7M4O3O3O3M2M1L2L1O1P2M9L1L6M8O1Q0P5O3M7K7L7L7M9
1992D8499M8M9M8N8N8N8N7L8L7L8L7K1K0L3N1P0P0P1P0N0L0J9J9M3M3O6O5N7N7N7N8M7M8M8
1988E0138M8N7N7N8N7M7M6M7M7M7M6M7M7O0N9O0O0L9L9L9L9L5L5L5L5M2M2L2N0O1O2O2O2M2
1984E1779M2M2M2M3M3M4M3L8L8L8L7N8N8N8N7M9M8M8M9M5M4M5M5N0N1N0N1M5M5M5M5N8N9N8
1980E3390N8M7M7M7M7L7L8L7L8O9P0O9P0M8M9M9M9K7K7K7K7M8M8M8M8M6M6M6M7O3P5P9N9M3
1975E5063L2L1M2N1N1N1N1N4N5L9K8L3N2O4O3M4M4M5M4N8N9O8O9N3L5K3K2K2K2K1K2M2M2M2
$$ y = [43850, 43870, 43924, 43996, 44064, 44121, 44167, 44212, 44257, 44302, 44347, 44391, 44426, 44441, 44460, 44506, 44564, 44611, 44646, 44681, 44716, 44751, 44777, 44803, 44829, 44855, 44885, 44915, 44957, 45018, 45093, 45168, 45233, 45279, 45326, 45384, 45441, 45487, 45522, 45558, 45593, 45627, 45683, 45738, 45793, 45849, 45901, 45954, 46006, 46059, 46082, 46105, 46150, 46196, 46231, 46266, 46302, 46337, 46366, 46396, 46448, 46500, 46558, 46616, 46673, 46731, 46777, 46823, 46869, 46915, 46968, 47022, 47075, 47128, 47174, 47220, 47267, 47313, 47330, 47347, 47391, 47454, 47517, 47580, 47622, 47663, 47695, 47726, 47787, 47859, 47908, 47939, 47975, 48023, 48084, 48164, 48239, 48302, 48349, 48376, 48413, 48450, 48499, 48547, 48596, 48644, 48702, 48760, 48818, 48875, 48913, 48950, 48988, 49025, 49046, 49066, 49099, 49150, 49220, 49290, 49361, 49431, 49481, 49511, 49530, 49549, 49592, 49635, 49701, 49766, 49823, 49880, 49937, 49995, 50042, 50090, 50138, 50186, 50243, 50300, 50358, 50415, 50462, 50508, 50555, 50602, 50649, 50695, 50742, 50789, 50849, 50908, 50968, 51028, 51067, 51106, 51145, 51184, 51219, 51254, 51289, 51324, 51366, 51408, 51440, 51490, 51551, 51613, 51675, 51737, 51779, 51821, 51863, 51905, 51948, 51991, 52035, 52078, 52116, 52154, 52192, 52229, 52287, 52345, 52403, 52460, 52509, 52557, 52605, 52654, 52699, 52743, 52788, 52833, 52883, 52934, 52984, 53035, 53080, 53125, 53170, 53215, 53273, 53332, 53390, 53448, 53495, 53542, 53589, 53636, 53673, 53711, 53748, 53786, 53855, 53925, 53994, 54064, 54112, 54161, 54210, 54259, 54286, 54313, 54340, 54367, 54415, 54463, 54511, 54559, 54605, 54651, 54697, 54744, 54807, 54882, 54961, 55020, 55063, 55095, 55126, 55168, 55219, 55270, 55321, 55372, 55426, 55481, 55520, 55548, 55581, 55633, 55697, 55760, 55804, 55848, 55893, 55937, 55995, 56054, 56122, 56191, 56244, 56279, 56302, 56324, 56346, 56368, 56389, 56411, 56453, 56495, 56537]
1971E6537M2M8M7M8M7L1L1L1L1L4M0N2O4O3N2K5K1L3N3N9M8L4L3L7M9M6M0M1M7N4O0N6N7N1
1967E8042L9K4K4M3N4M4L2L6M8M4L8L5M1N7O1N6M5L6K4K9M1M5M4M4M3M3M3M4L9L2N1P2P8O0
1963E9531M8M0L5K6K6L3L4M5M5M4M5M4M5M2M8O0P2O5N5L9L8L2L2L1L2M2M3M2M3L7L7L6L7K5
1959F0929K5K5K5J3J3J4J4J5K7M1M2K9J8Qlj4qNJ6K7L3L0L0M3M2L5R%JkjK1K1K1K1QQQQJ6
1954F1613J6J6J7K9K9L0K9K2K1K1K2K8K9J7kmmJ7J8K7K8K8K8K0K0K1K0K6K6LMopL2L1L7L7
1949F2339L7L7J9K0J9K0jjjjJ0J1RJ0qk0k4nK3K2J2oqqrrj5j4j5j4j5j4j4j4jJ1J5mk2k2j
1944F2348%jjjjOOOOl1l0l0l1k0j9k0j9j2j2J1J0J1J1j2j2j2j3j2j3mnmnJ1J0J0J0llklk5
1939F2100k5k5k4qqqqj0j0j0j0l8l8l8l8j8j8j8j8k5k5lkk5k4k5k4jjk4k4k3k3k2k3m7m6k4
$$ y = [56537, 56579, 56627, 56674, 56722, 56769, 56800, 56831, 56862, 56893, 56927, 56967, 57019, 57083, 57146, 57198, 57223, 57244, 57277, 57330, 57389, 57437, 57471, 57504, 57541, 57590, 57636, 57676, 57717, 57764, 57818, 57878, 57934, 57991, 58042, 58081, 58105, 58129, 58172, 58226, 58270, 58302, 58338, 58386, 58430, 58468, 58503, 58544, 58601, 58662, 58718, 58763, 58799, 58823, 58852, 58893, 58938, 58982, 59026, 59069, 59112, 59155, 59199, 59238, 59270, 59321, 59393, 59471, 59531, 59579, 59619, 59654, 59680, 59706, 59739, 59773, 59818, 59863, 59907, 59952, 59996, 60041, 60083, 60131, 60191, 60263, 60328, 60383, 60422, 60460, 60492, 60524, 60555, 60587, 60629, 60672, 60714, 60757, 60794, 60831, 60867, 60904, 60929, 60954, 60979, 61004, 61017, 61030, 61044, 61058, 61073, 61100, 61141, 61183, 61212, 61230, 61238, 61235, 61221, 61213, 61218, 61234, 61261, 61294, 61324, 61354, 61397, 61439, 61474, 61483, 61483, 61484, 61482, 61481, 61502, 61523, 61544, 61565, 61573, 61581, 61589, 61597, 61613, 61629, 61645, 61662, 61691, 61720, 61750, 61779, 61801, 61822, 61843, 61865, 61893, 61922, 61939, 61937, 61933, 61929, 61946, 61964, 61991, 62019, 62047, 62075, 62095, 62115, 62136, 62156, 62182, 62208, 62211, 62215, 62209, 62202, 62234, 62265, 62302, 62339, 62376, 62413, 62432, 62452, 62471, 62491, 62490, 62489, 62488, 62487, 62497, 62508, 62517, 62527, 62519, 62499, 62475, 62470, 62493, 62515, 62527, 62521, 62513, 62505, 62496, 62487, 62472, 62458, 62443, 62429, 62414, 62400, 62386, 62372, 62371, 62382, 62397, 62393, 62371, 62349, 62348, 62348, 62347, 62346, 62345, 62344, 62350, 62356, 62362, 62368, 62337, 62307, 62277, 62246, 62226, 62207, 62187, 62168, 62156, 62144, 62155, 62165, 62176, 62187, 62175, 62163, 62151, 62138, 62126, 62113, 62109, 62104, 62100, 62095, 62106, 62116, 62126, 62136, 62133, 62130, 62128, 62125, 62100, 62075, 62050, 62026, 62018, 62010, 62002, 61994, 61984, 61974, 61964, 61954, 61916, 61878, 61840, 61802, 61784, 61766, 61748, 61730, 61705, 61680, 61677, 61675, 61650, 61626, 61601, 61577, 61576, 61575, 61551, 61527, 61504, 61481, 61459, 61436, 61389, 61343, 61319]
1935F1319k4J%JJj3j3j2j3j1j2l5l4j6j6j6j6pqppk6k7k6k6n2n1k9k9l1l1l0l1k5k5lkj5j5
1930F0588j7j6l7n7n2m0k9k9k9k8k9k8n2n1m0m0m0m0n1n1p2p2m2j5rj0j5l5n0p0p5p5n3n3
1926E9186k7k7l4k3k2m2o0p1p3n4l4k3l0l1l0l0k3k3k3k4m7m8m7m8m1m1m1m0n5n5l4l4m8p4
1921E7829q1q2p5p6o4o5m9m9m9m9m3m2m3m3n3n2n3n3m5m6k4k4l7n6n6n7m5m5o8o7p1p1m9m8
1917E5999l4l3l4l4l2l2k9j7j5l4o0o0n7n8n7n7m2m2n2n3n2n3o7p8p1n2m1m1n0n1o1o2o0n9
1913E4369o0o0o8o8o8o8o8o8o8o8o6o5o5o6o5o6o5o5n8n7n7n8n7n8n7n7o5o4o4o5o8o8r0r1
1909E2148r8r8q6q7o2n1n6p8q0q0o0n9m7m6p0o9p1p2p1p2p3p3p3p3o2o2o2o2o2o2o2o3o5o6
1905D9815o6o6r0r0r0r0n4n5n4n4n5n5n5n5o9p0q0q1r0r0o4m3m2m3o4o3n4n5n4n4p0o9p0p0
$$ y = [61319, 61295, 61296, 61296, 61297, 61298, 61285, 61272, 61260, 61247, 61236, 61224, 61189, 61155, 61139, 61123, 61107, 61091, 61084, 61076, 61069, 61062, 61036, 61009, 60983, 60957, 60905, 60854, 60825, 60796, 60765, 60734, 60704, 60673, 60648, 60623, 60620, 60618, 60603, 60588, 60571, 60555, 60518, 60461, 60409, 60369, 60340, 60311, 60282, 60254, 60225, 60197, 60145, 60094, 60054, 60014, 59974, 59934, 59883, 59832, 59760, 59688, 59646, 59631, 59622, 59612, 59597, 59562, 59512, 59442, 59367, 59292, 59239, 59186, 59159, 59132, 59098, 59075, 59053, 59011, 58951, 58880, 58807, 58753, 58719, 58696, 58666, 58635, 58605, 58575, 58552, 58529, 58506, 58482, 58435, 58387, 58340, 58292, 58251, 58210, 58169, 58129, 58074, 58019, 57985, 57951, 57903, 57829, 57748, 57666, 57591, 57515, 57451, 57386, 57337, 57288, 57239, 57190, 57147, 57105, 57062, 57019, 56966, 56914, 56861, 56808, 56763, 56717, 56693, 56669, 56632, 56576, 56520, 56463, 56418, 56373, 56305, 56238, 56167, 56096, 56047, 55999, 55965, 55932, 55898, 55864, 55832, 55800, 55771, 55754, 55739, 55705, 55645, 55585, 55528, 55470, 55413, 55356, 55314, 55272, 55220, 55167, 55115, 55062, 54995, 54917, 54846, 54794, 54753, 54712, 54662, 54611, 54550, 54488, 54428, 54369, 54309, 54249, 54181, 54113, 54045, 53977, 53909, 53841, 53773, 53705, 53639, 53574, 53509, 53443, 53378, 53312, 53247, 53182, 53124, 53067, 53010, 52952, 52895, 52837, 52780, 52723, 52658, 52594, 52530, 52465, 52397, 52329, 52239, 52148, 52050, 51952, 51866, 51779, 51717, 51666, 51610, 51532, 51452, 51372, 51312, 51253, 51206, 51160, 51090, 51021, 50950, 50878, 50807, 50735, 50662, 50589, 50516, 50443, 50381, 50319, 50257, 50195, 50133, 50071, 50009, 49946, 49881, 49815, 49749, 49683, 49593, 49503, 49413, 49323, 49269, 49214, 49160, 49106, 49051, 48996, 48941, 48886, 48817, 48747, 48667, 48586, 48496, 48406, 48342, 48299, 48257, 48214, 48150, 48087, 48033, 47978, 47924, 47870, 47800, 47731, 47661, 47591]
1901D7591n6n7n6n7p2p2p2p2o6o7o6o7p1p1p1p1o6o5o6o5o6o5o6o5m5m5m5m5n4n4n4n4m7m8
1897D5512o9p0p8p9p9p8n7n8p2q3q1n9m3n5o6o7o7o7p0p1p0p0n7n7n7n7p4p3p3p3p3p3n0n0
1892D3236n0n1n0n0n1n0n0n1m9m8p2p1o3o3o2o3q4q4p6n0l4l5p0p0p4p4n2n2n3n2p6p5p6p6
1888D1179n3n4o7o8o8o7n9n9o0n9n7n8n8n8n8n8l6l6m3m3m3m3m9m8m9m8n9n9q0q1o7m9l6l7
1884C9312n9n9n9n8o7o7o6o7k7k7k7k7n8n8n7n8n2n2n2n2n9o0n9n9q1q1n9n9m7m8m8m7n2n2
1880C7452n2n2l9m0m0m1m5o5p6p6o2o1o2o2n6n6n6n6n5n5l4l3l5m7n1l3k5m3o1p3o9n1m0l9
1876C5711m8m7m7m8n7n6n7n7o8o9l8k7m4o4n8m7k7k6m9m8o6o6o7o6o7o8m5m5l4l5l4l5k8k9
1872C4044n1n1m8m7m8m8k7k8k7k8m4m5m4m5n0n0n0n0k9l0k9l0m0m0m0m1l0l1l1l1m1m1m1m1
$$ y = [47591, 47535, 47478, 47422, 47365, 47293, 47221, 47149, 47077, 47011, 46944, 46878, 46811, 46740, 46669, 46598, 46527, 46461, 46396, 46330, 46265, 46199, 46134, 46068, 46003, 45958, 45913, 45868, 45823, 45769, 45715, 45661, 45607, 45560, 45512, 45443, 45373, 45295, 45216, 45137, 45059, 45002, 44944, 44872, 44789, 44708, 44649, 44606, 44551, 44485, 44418, 44351, 44284, 44214, 44143, 44073, 44003, 43946, 43889, 43832, 43775, 43701, 43628, 43555, 43482, 43409, 43336, 43286, 43236, 43186, 43135, 43085, 43035, 42984, 42934, 42884, 42833, 42784, 42736, 42664, 42593, 42530, 42467, 42405, 42342, 42258, 42174, 42098, 42048, 42014, 41979, 41909, 41839, 41765, 41691, 41639, 41587, 41534, 41482, 41406, 41331, 41255, 41179, 41126, 41072, 41005, 40937, 40869, 40802, 40743, 40684, 40624, 40565, 40508, 40450, 40392, 40334, 40276, 40218, 40182, 40146, 40103, 40060, 40017, 39974, 39925, 39877, 39828, 39780, 39721, 39662, 39582, 39501, 39434, 39385, 39349, 39312, 39253, 39194, 39135, 39077, 39010, 38943, 38877, 38810, 38783, 38756, 38729, 38702, 38644, 38586, 38529, 38471, 38419, 38367, 38315, 38263, 38204, 38144, 38085, 38026, 37945, 37864, 37805, 37746, 37699, 37651, 37603, 37556, 37504, 37452, 37400, 37348, 37309, 37269, 37229, 37188, 37143, 37078, 37002, 36926, 36864, 36803, 36741, 36679, 36623, 36567, 36511, 36455, 36400, 36345, 36311, 36278, 36243, 36196, 36145, 36112, 36087, 36044, 35983, 35910, 35841, 35790, 35750, 35711, 35663, 35616, 35569, 35521, 35464, 35408, 35351, 35294, 35226, 35157, 35119, 35092, 35048, 34984, 34926, 34879, 34852, 34826, 34777, 34729, 34663, 34597, 34530, 34464, 34397, 34329, 34284, 34239, 34205, 34170, 34136, 34101, 34073, 34044, 33993, 33942, 33894, 33847, 33799, 33751, 33724, 33696, 33669, 33641, 33597, 33552, 33508, 33463, 33413, 33363, 33313, 33263, 33234, 33204, 33175, 33145, 33105, 33065, 33025, 32984, 32954, 32923, 32892, 32861, 32820, 32779, 32738, 32697]
1867C2697n0n1n0n0l5l5l5l5o3o3o2o1m9l1l5m6n3o5n9n9m4m4m4m4o1o1o1o1p7p7p8p7m5m6
1863C0890m5m6l3l4l4l4m3m3m3m3m9n0m8m8n9l9k8k7l4l4l4l4o8o8m1k2j9j9m4o3o4n4l4j7
1859B9495l0m9m4l2m2m1m1m2m1m1j9k0k2m2n3n3k0k1k1k0m7m6m7m6m8m8m7m7l4j5mmk2k2k2
1855B8302k2k8k7n0m9n2n1k8k9j7j7l9l9m7m6m6m7n7n7n7n7m2m1m2m1m2m1m3m2m6n6o2m2l4
1851B6866l5l3l3l4l4n7n6n7n6k6j5l1m9n9n9l9k0l1l1l4l4l5l5l6n5o7o7n0n0n0n0k7k7k8
1847B5466k7l6m8m0m1m2m1m1m1l8k7l3l3j9j9l4m6n2m0k6k5l8l8l0m3m9l8k9j8k4l5l4k3k8
1842B4290k8k8k7j9k9m6m5m2m3m1m2l8k6j0j0k4k4j8k9m1m1m1m1l0k9pqj4k6m1m2m0m1l9m0
1838B3200k2j2pk6m4m5l0j8k1k0k0k0k1k1k1k1m2m1m2m2j9j9k0k0j7l0k2k3l1l1j0rk4l6l5
$$ y = [32697, 32647, 32596, 32546, 32496, 32461, 32426, 32391, 32356, 32293, 32230, 32168, 32107, 32058, 32027, 31992, 31946, 31893, 31828, 31769, 31710, 31666, 31622, 31578, 31534, 31473, 31412, 31351, 31290, 31213, 31136, 31058, 30981, 30936, 30890, 30845, 30799, 30766, 30732, 30698, 30664, 30621, 30578, 30535, 30492, 30443, 30393, 30345, 30297, 30238, 30199, 30171, 30144, 30110, 30076, 30042, 30008, 29940, 29872, 29831, 29809, 29790, 29771, 29727, 29664, 29600, 29546, 29512, 29495, 29465, 29416, 29372, 29340, 29298, 29257, 29216, 29174, 29133, 29092, 29073, 29053, 29031, 28989, 28936, 28883, 28863, 28842, 28821, 28801, 28754, 28708, 28661, 28615, 28567, 28519, 28472, 28425, 28391, 28376, 28372, 28368, 28346, 28324, 28302, 28280, 28252, 28225, 28175, 28126, 28074, 28023, 27995, 27966, 27949, 27932, 27893, 27854, 27807, 27761, 27715, 27668, 27611, 27554, 27497, 27440, 27398, 27357, 27315, 27274, 27232, 27191, 27148, 27106, 27060, 27004, 26942, 26900, 26866, 26831, 26798, 26765, 26731, 26697, 26640, 26584, 26527, 26471, 26445, 26430, 26399, 26350, 26291, 26232, 26193, 26173, 26142, 26111, 26077, 26043, 26008, 25973, 25937, 25882, 25815, 25748, 25698, 25648, 25598, 25548, 25521, 25494, 25466, 25439, 25403, 25355, 25315, 25274, 25232, 25191, 25150, 25109, 25071, 25044, 25011, 24978, 24959, 24940, 24906, 24860, 24808, 24768, 24742, 24717, 24679, 24641, 24611, 24568, 24519, 24481, 24452, 24434, 24410, 24375, 24341, 24318, 24290, 24262, 24234, 24207, 24188, 24159, 24113, 24068, 24026, 23983, 23942, 23900, 23862, 23836, 23826, 23816, 23792, 23768, 23750, 23721, 23680, 23639, 23598, 23557, 23527, 23498, 23491, 23483, 23469, 23443, 23402, 23360, 23320, 23279, 23240, 23200, 23178, 23166, 23159, 23133, 23089, 23044, 23014, 22996, 22975, 22955, 22935, 22915, 22894, 22873, 22852, 22831, 22789, 22748, 22706, 22664, 22645, 22626, 22606, 22586, 22569, 22539, 22517, 22494, 22463, 22432, 22422, 22413, 22389, 22353, 22318]
1834B2318k4j5nmj5k6l6m2k3j0j0rj0j9l0m6m6k7k7k7k7l3l4k7l8n1n1l6k4j5j6mmqj9k9m0
1829B1411l7l7l7l6k6j4JJLrk5k5k2k2k2k2k6k5j5j5qj9l6l5l1l2l7k6j6omj6l0k9l0l1k4
1825B0591k5k5k5l4l4l4l4j8j8j8j8l1l1l2l1k2k2k2k1l2l1l2l1k6k6k7k7k0l2m1n2m7l6k0
1821A9616k1j7j7k4j3j4k6k9k9mQj1k9m0m0k5j4k3k2k2k2noj8l6m3m2k7j6j0j0j0rj6j5l1
1816A8888m2n0l9k3k4k0k0k0k0j5j5j5j5j5j5j5j6qqrqk6k5k5k5k2k1k1k1m0l9j7j7k1k1k1
1812A8114k1popoj1j2j1j1l7l7k6k6l9m9l1j3pqopk2k3k2k2rKmk3m0l9j8j9j8j8j9j8j2j1
1807A7401j2j1l3l2l2l2k5k5k5k5m7m6l5j6%jj0j1j5j5k6k6l1l1jJ0kk2k6l7m7m6k5JJ9Qj6
1802A6655k7k5k4k6k5j5j5j5j4l1l1l1l2j1j1j1j1mmmk3m6m6l6j6j7j8j6j6j2j3k4k4k1k2
$$ y = [22318, 22294, 22279, 22274, 22270, 22255, 22229, 22193, 22151, 22128, 22118, 22108, 22099, 22089, 22070, 22040, 21994, 21948, 21921, 21894, 21867, 21840, 21807, 21773, 21746, 21708, 21657, 21606, 21570, 21546, 21531, 21515, 21511, 21507, 21499, 21480, 21451, 21411, 21374, 21337, 21300, 21264, 21238, 21224, 21225, 21226, 21229, 21220, 21195, 21170, 21148, 21126, 21104, 21082, 21056, 21031, 21016, 21001, 20993, 20974, 20938, 20903, 20872, 20840, 20803, 20777, 20761, 20755, 20751, 20735, 20705, 20676, 20646, 20615, 20591, 20566, 20541, 20516, 20482, 20448, 20414, 20380, 20362, 20344, 20326, 20308, 20277, 20246, 20214, 20183, 20161, 20139, 20117, 20096, 20064, 20033, 20001, 19970, 19944, 19918, 19891, 19864, 19844, 19812, 19771, 19719, 19672, 19636, 19616, 19595, 19578, 19561, 19537, 19524, 19510, 19484, 19455, 19426, 19422, 19430, 19419, 19390, 19350, 19310, 19285, 19271, 19248, 19226, 19204, 19182, 19177, 19171, 19153, 19117, 19074, 19032, 19005, 18989, 18979, 18969, 18959, 18950, 18934, 18919, 18888, 18846, 18796, 18757, 18734, 18710, 18690, 18670, 18650, 18630, 18615, 18600, 18585, 18570, 18555, 18540, 18525, 18509, 18501, 18493, 18484, 18476, 18450, 18425, 18400, 18375, 18353, 18332, 18311, 18290, 18250, 18211, 18194, 18177, 18156, 18135, 18114, 18093, 18086, 18080, 18073, 18067, 18056, 18044, 18033, 18022, 17985, 17948, 17922, 17896, 17857, 17808, 17777, 17764, 17757, 17749, 17743, 17736, 17714, 17691, 17669, 17647, 17638, 17640, 17636, 17613, 17573, 17534, 17516, 17497, 17479, 17461, 17442, 17424, 17412, 17401, 17389, 17378, 17345, 17313, 17281, 17249, 17224, 17199, 17174, 17149, 17102, 17056, 17021, 17005, 17005, 17004, 16994, 16983, 16968, 16953, 16927, 16901, 16870, 16839, 16838, 16848, 16846, 16824, 16798, 16761, 16714, 16668, 16643, 16644, 16663, 16671, 16655, 16628, 16603, 16579, 16553, 16528, 16513, 16498, 16483, 16469, 16438, 16407, 16376, 16344, 16333, 16322, 16311, 16300, 16296, 16292, 16288, 16265, 16219, 16173, 16137, 16121, 16104, 16086, 16070, 16054, 16042, 16029, 16005, 15981, 15960, 15938]
1798A5938%Jk0k0k0j9RRj4j3k2k1j0j1qql0l1j5j6j6j6k3k3j2PJ1%k3l4k6j4j1j0l0m1m4k5
1794A5349oOj1k9l3l2j1j1k0k0l1l1j2j1k3k2j3j2j2j2k6k6j5NMok2k1k2k2k2k2j5j5j8l0
1789A4730l3j4J2J1pk5k6k5j0QQRrrk0k0k8k7nnQQmk3l9l8m5l4k4oK1K1Mj5k7k7k4k3k4k3
1784A4201k9k8no%j%%j%%jJJk2k1k2k2JJj2j3j2j3nonnj0j0j0j0l1l0m0m0k1OJ3J3nnk8k7
1779A3741l5l5k3mPPQQj2j2j2j1kjj3j2OPmk3j9JJ1J2jjkkk5l6l0j1j3k5l8l9l6k5j9%QRj2
1774A3292j3j1j0J%mnmnmmlmj6j5j5j6rj0j0j0J%%%j5j5j5j5k1k1KKkjjkrj0rrj0rj0rrqr
1768A2921rqrrqPQPQj%j%j1j1J1J1j8j8j8j9j3j4j3j3j4j3j4j3%%%%MMMNook9k8j6j6j5j6
1762A2611J4J3J4J3NMMMrj0rj0jkjkJ4J4Ok0k6k5k6k6l2k0RL6K2mk5k5llklnnnnJ5J6K0J0
$$ y = [15938, 15938, 15939, 15919, 15899, 15879, 15860, 15869, 15878, 15864, 15851, 15829, 15808, 15798, 15787, 15779, 15771, 15741, 15710, 15695, 15679, 15663, 15647, 15624, 15601, 15589, 15596, 15607, 15607, 15584, 15550, 15524, 15510, 15499, 15489, 15459, 15418, 15374, 15349, 15343, 15349, 15338, 15309, 15276, 15244, 15233, 15222, 15202, 15182, 15151, 15120, 15108, 15097, 15074, 15052, 15039, 15027, 15015, 15003, 14977, 14951, 14936, 14941, 14945, 14939, 14917, 14896, 14874, 14852, 14830, 14808, 14793, 14778, 14760, 14730, 14697, 14683, 14695, 14706, 14699, 14674, 14648, 14623, 14613, 14621, 14629, 14638, 14629, 14620, 14600, 14580, 14552, 14525, 14520, 14515, 14523, 14531, 14527, 14504, 14465, 14427, 14382, 14348, 14324, 14318, 14339, 14360, 14364, 14349, 14322, 14295, 14271, 14248, 14224, 14201, 14172, 14144, 14139, 14133, 14133, 14132, 14132, 14132, 14131, 14131, 14131, 14130, 14131, 14132, 14110, 14089, 14067, 14045, 14046, 14047, 14035, 14022, 14010, 13997, 13992, 13986, 13981, 13976, 13966, 13956, 13946, 13936, 13905, 13875, 13835, 13795, 13774, 13780, 13793, 13806, 13801, 13796, 13768, 13741, 13706, 13671, 13648, 13644, 13651, 13658, 13666, 13674, 13662, 13650, 13638, 13627, 13625, 13624, 13611, 13599, 13605, 13612, 13608, 13585, 13566, 13567, 13578, 13590, 13589, 13588, 13586, 13584, 13559, 13523, 13493, 13482, 13469, 13444, 13406, 13367, 13331, 13306, 13287, 13287, 13295, 13304, 13292, 13279, 13268, 13258, 13259, 13259, 13255, 13250, 13246, 13241, 13237, 13233, 13230, 13226, 13210, 13195, 13180, 13164, 13155, 13145, 13135, 13125, 13126, 13126, 13126, 13126, 13111, 13096, 13081, 13066, 13045, 13024, 13026, 13028, 13026, 13025, 13024, 13022, 13013, 13003, 12994, 12985, 12975, 12966, 12956, 12947, 12938, 12930, 12921, 12912, 12904, 12895, 12886, 12878, 12885, 12893, 12900, 12908, 12907, 12907, 12906, 12906, 12895, 12884, 12895, 12906, 12888, 12870, 12852, 12833, 12820, 12806, 12793, 12780, 12766, 12753, 12739, 12726, 12726, 12726, 12726, 12726, 12730, 12734, 12738, 12743, 12737, 12731, 12702, 12674, 12658, 12642, 12627, 12611, 12625, 12638, 12652, 12665, 12670, 12674, 12678, 12682, 12673, 12663, 12654, 12644, 12643, 12641, 12640, 12638, 12652, 12666, 12672, 12652, 12626, 12601, 12575, 12549, 12517, 12497, 12506, 12542, 12564, 12560, 12535, 12510, 12507, 12504, 12502, 12499, 12494, 12489, 12484, 12479, 12494, 12510, 12530, 12540]
1757A2540Jj8l0k9j5LJ6J5K8K9ONk4k4k4k4OPOPJ1J2J1J2J2J1J2J1MLLKJ1jk0l9l7j9QPjk
1752A2492kkmmmnj3j4j4j3k1k1k1k1MLMLj0rj0rnnLr%J9J7jj3k4k6j4j0rJ4J3RQj4j5j4j5
1746A2218j4j5RQRQnonok5k4k5k5qrJ4J4J5J5J4J5K0K0J9K0j2j2j2j2k1k1k1k1POj6j6k2k1
1741A2057KJJ%J%mlmlJ7J7J7J7NNNNLMMLJ4J4Kj6j4j4j6j5kkjkJ1J1J2J1LMLMLLMLnonol0
1735A2118l0j8%NNOORRRRmmJ7J7Jk5m7m7j1J6J1qj1j1J1J1QQRQK0K1K0K1K6K5mj5j7KJ3J3
1730A2202J3J3J2J1Lj6j6LK2K3JJJ%J%qqqqJ8J7nmOPPPnmmmJ3J3J3J4j8j7j8j7j3j2J0J0J1
1724A2267J0J1J0J4J3J4J4K2K3K3K3oopoJKKJK5K4KKooOK4L8L8L9L9J0J0j1j1J0K9K5J3LK
1719A2730KKJKJJj4j5oj8k2lJ6K7J3KQQj9l0l5j6NNOOK8K8K7K8J1J1J1J1KKKKOPK8K9J3J2
$$ y = [12540, 12541, 12523, 12493, 12464, 12449, 12452, 12468, 12483, 12511, 12540, 12546, 12551, 12527, 12503, 12479, 12455, 12461, 12468, 12474, 12481, 12492, 12504, 12515, 12527, 12539, 12550, 12562, 12573, 12577, 12580, 12583, 12585, 12596, 12595, 12575, 12536, 12499, 12480, 12488, 12495, 12494, 12492, 12490, 12488, 12484, 12480, 12476, 12471, 12458, 12444, 12430, 12417, 12396, 12375, 12354, 12333, 12337, 12340, 12344, 12347, 12337, 12328, 12318, 12309, 12304, 12299, 12302, 12293, 12293, 12312, 12329, 12328, 12315, 12291, 12265, 12251, 12241, 12232, 12246, 12259, 12268, 12276, 12262, 12247, 12233, 12218, 12204, 12189, 12198, 12206, 12215, 12223, 12218, 12212, 12207, 12201, 12176, 12152, 12127, 12102, 12094, 12085, 12099, 12113, 12128, 12143, 12157, 12172, 12192, 12212, 12231, 12251, 12239, 12227, 12215, 12203, 12182, 12161, 12140, 12119, 12126, 12132, 12116, 12100, 12078, 12057, 12059, 12060, 12061, 12061, 12062, 12062, 12058, 12055, 12051, 12048, 12065, 12082, 12099, 12116, 12121, 12126, 12131, 12136, 12139, 12143, 12147, 12150, 12164, 12178, 12180, 12164, 12150, 12136, 12120, 12105, 12103, 12101, 12100, 12098, 12109, 12120, 12132, 12143, 12146, 12150, 12153, 12157, 12160, 12163, 12167, 12170, 12165, 12159, 12154, 12148, 12118, 12088, 12070, 12070, 12075, 12080, 12086, 12092, 12101, 12110, 12119, 12128, 12124, 12120, 12137, 12154, 12155, 12130, 12083, 12036, 12025, 12041, 12052, 12044, 12033, 12022, 12033, 12044, 12052, 12060, 12069, 12077, 12097, 12118, 12138, 12159, 12185, 12210, 12206, 12191, 12174, 12176, 12189, 12202, 12215, 12228, 12240, 12251, 12254, 12238, 12222, 12225, 12247, 12270, 12271, 12272, 12273, 12273, 12274, 12274, 12266, 12258, 12250, 12242, 12260, 12277, 12272, 12268, 12274, 12281, 12288, 12295, 12290, 12286, 12282, 12278, 12291, 12304, 12317, 12331, 12313, 12296, 12278, 12261, 12248, 12236, 12246, 12256, 12267, 12277, 12288, 12298, 12312, 12325, 12339, 12353, 12375, 12398, 12421, 12444, 12438, 12432, 12425, 12419, 12420, 12422, 12424, 12425, 12450, 12474, 12476, 12478, 12472, 12466, 12472, 12496, 12534, 12572, 12611, 12650, 12660, 12670, 12659, 12648, 12658, 12687, 12712, 12725, 12728, 12730, 12732, 12734, 12735, 12737, 12738, 12739, 12725, 12710, 12704, 12686, 12664, 12661, 12677, 12704, 12717, 12719, 12727, 12735, 12716, 12686, 12651, 12635, 12640, 12645, 12651, 12657, 12685, 12713, 12740, 12768, 12779, 12790, 12801, 12812, 12814, 12816, 12818, 12820, 12826, 12833, 12861, 12890, 12903, 12915]
1714A2915J3J3J5J6J5J6PPJ8L7L8J8ppJ3J3L6L6K4K4KJlmlmK0J9K0J9J9J9K0J9K0J9M1M1K8
1709A3553RJ9J9J4J4J4J4K5K6K5K6J2J2J2J3opooK9L0K9L0K2K2K2K2J8J8J8J8LLK6K6J9K0
1705A4157K5L6M4M4L4L4L4L4K3K3K0K0K7J5QRKJ4L8N6N2M2L5L6L5L5K4K4K4K4NOK1L2L6K4
1700A5152K0K0J0J1J0J0J8J9J2K3K7K8J6J7L1L1J6NJ6M3M9M9K7J6K2K3K3K2K3K3K6K6K6K7
1696A5917L7M8M2M2L6L7L6L7L6L7L6L7L2L2L9K7J0J0J3K4L4K2PQK0L2L7L7L8L7L8L8K5K4K0
1692A6982RnmJ0K2K7K7K7K8L2L2L2L2M1M0M0M0N7N6M8K5J4K5M1M0M1M1M1M1K4K4M7M6M5M4
1688A8112M4M4N8N7L6L5L9M0K9K8J9K0M2M1M3M3K0K0K0K0L1L1MLK6K6K7K7K7K7K9K9K9K8J5
1683A9169MRL2L4L4J3J3%jJ1J1K4K4K3K4N1N0K8K8K0K0K2K2L5N8N1M1L6L6L5L6K1K2M3M4N2
$$ y = [12915, 12928, 12941, 12956, 12972, 12987, 13003, 13010, 13017, 13035, 13072, 13110, 13128, 13121, 13114, 13127, 13140, 13176, 13212, 13236, 13260, 13262, 13263, 13260, 13256, 13253, 13249, 13269, 13288, 13308, 13327, 13346, 13365, 13385, 13404, 13424, 13443, 13484, 13525, 13553, 13562, 13581, 13600, 13614, 13628, 13642, 13656, 13681, 13707, 13732, 13758, 13770, 13782, 13794, 13807, 13801, 13794, 13788, 13782, 13811, 13841, 13870, 13900, 13922, 13944, 13966, 13988, 14006, 14024, 14042, 14060, 14063, 14066, 14092, 14118, 14137, 14157, 14182, 14218, 14262, 14306, 14340, 14374, 14408, 14442, 14465, 14488, 14508, 14528, 14555, 14570, 14578, 14587, 14589, 14603, 14641, 14697, 14749, 14791, 14826, 14862, 14897, 14932, 14956, 14980, 15004, 15028, 15033, 15039, 15060, 15092, 15128, 15152, 15172, 15192, 15202, 15213, 15223, 15233, 15251, 15270, 15282, 15305, 15332, 15360, 15376, 15393, 15424, 15455, 15471, 15476, 15492, 15535, 15584, 15633, 15660, 15676, 15698, 15721, 15744, 15766, 15789, 15812, 15838, 15864, 15890, 15917, 15954, 16002, 16044, 16086, 16122, 16159, 16195, 16232, 16268, 16305, 16341, 16378, 16410, 16442, 16481, 16508, 16518, 16528, 16541, 16565, 16599, 16621, 16628, 16636, 16656, 16688, 16725, 16762, 16800, 16837, 16875, 16913, 16938, 16962, 16982, 16991, 16986, 16982, 16992, 17014, 17041, 17068, 17095, 17123, 17155, 17187, 17219, 17251, 17292, 17332, 17372, 17412, 17469, 17525, 17573, 17598, 17612, 17637, 17678, 17718, 17759, 17800, 17841, 17882, 17906, 17930, 17977, 18023, 18068, 18112, 18156, 18200, 18258, 18315, 18351, 18386, 18425, 18465, 18494, 18522, 18541, 18561, 18603, 18644, 18687, 18730, 18750, 18770, 18790, 18810, 18841, 18872, 18876, 18879, 18905, 18931, 18958, 18985, 19012, 19039, 19068, 19097, 19126, 19154, 19169, 19173, 19182, 19214, 19248, 19282, 19295, 19308, 19308, 19307, 19318, 19329, 19353, 19377, 19400, 19424, 19475, 19525, 19553, 19581, 19601, 19621, 19643, 19665, 19700, 19758, 19809, 19850, 19886, 19922, 19957, 19993, 20014, 20036, 20079, 20123, 20175]
1679B0175N1K8K9J6J5K7K7L7L6L6L6L6L7L7L7N2N2N1N2L5L5J4J4K4M6O5P6O6O5O7O6O0O0O0
1675B1620O0O7O7M4M4L4L4L4L4O6O7O7O6R1R0O8O8Q1Q0Q1Q1O4O3O4O4P6P6Q7O8O4P5O7O7P4
1671B3853P3P4P3Q0P9Q0P9O2O3O2O3M8M8M8M8M4M4Q2Q1O7O8O7O7N7N6N7N6P9P8P9P8R6R5R6
1667B6180R5Q2Q1Q1Q2O0O0P3R1R5R4Q9J00R9Q1P1P1Q9J07J34J33J14R4J06J05J04J04J03J04
1663B8882J04J04J04J04J03J03J03J03J17J16J17J18J33J52J48J37J30J30J52J52J51J52J28
1660C1743J29J24J25J47J47J48J48J48J48J65J65J64J64J66J48J36J36J58J58J58J58J74J73
1657C5230J95J94J87J60J53J54J69J87K00K00K11K11K12K11K29K30K29K30K16K16K16K17K22
1655C9879K21K22K22K35K34K12K12K30K30K30K30K53K53K54K53K49K49K49K50K62K61K40K39
$$ y = [20175, 20226, 20254, 20283, 20299, 20314, 20341, 20368, 20405, 20441, 20477, 20513, 20549, 20586, 20623, 20660, 20712, 20764, 20815, 20867, 20902, 20937, 20951, 20965, 20989, 21035, 21100, 21176, 21242, 21307, 21374, 21440, 21500, 21560, 21620, 21680, 21747, 21814, 21858, 21902, 21936, 21970, 22004, 22038, 22104, 22171, 22238, 22304, 22395, 22485, 22553, 22621, 22702, 22782, 22863, 22944, 23008, 23071, 23135, 23199, 23275, 23351, 23438, 23506, 23570, 23645, 23712, 23779, 23853, 23926, 24000, 24073, 24153, 24232, 24312, 24391, 24453, 24516, 24578, 24641, 24689, 24737, 24785, 24833, 24877, 24921, 25003, 25084, 25151, 25219, 25286, 25353, 25410, 25466, 25523, 25579, 25658, 25736, 25815, 25893, 25989, 26084, 26180, 26275, 26357, 26438, 26519, 26601, 26661, 26721, 26794, 26885, 26980, 27074, 27163, 27263, 27362, 27443, 27514, 27585, 27674, 27781, 27915, 28048, 28162, 28256, 28362, 28467, 28571, 28675, 28778, 28882, 28986, 29090, 29194, 29298, 29401, 29504, 29607, 29710, 29827, 29943, 30060, 30178, 30311, 30463, 30611, 30748, 30878, 31008, 31160, 31312, 31463, 31615, 31743, 31872, 31996, 32121, 32268, 32415, 32563, 32711, 32859, 33007, 33172, 33337, 33501, 33665, 33831, 33979, 34115, 34251, 34409, 34567, 34725, 34883, 35057, 35230, 35425, 35619, 35806, 35966, 36119, 36273, 36442, 36629, 36829, 37029, 37240, 37451, 37663, 37874, 38103, 38333, 38562, 38792, 39008, 39224, 39440, 39657, 39879, 40100, 40322, 40544, 40779, 41013, 41225, 41437, 41667, 41897, 42127, 42357, 42610, 42863, 43117, 43370, 43619, 43868, 44117, 44367, 44629, 44890, 45130, 45369]
1652D5369K56K55K55K56K54K54K54K54K60K60K60K61K77K77K77K77L19L20L19L19L24L25L25
1649E1807L24L63L62L63L62L68L68L68L68L67L66L67L67L76L76L76L76L68L68L68L69L68L68
1646F0233L68L68L70L70L70L69L58L58L36L35L46L46L46L46L69L68L69L69L77L77L77L76L98
1643F8599L97L98L97M12M11M13M13M30M53M63M63M63M62M62M63M78M78M80M79N04N26N36N37
1640G9117N32N33N43N65N74N73N52N53N52N52N75N75N73N73N51N50N42N42N80N80N92N91N71
1638I2041N71N84O06N95N95O05O28O37O38O27O27O52O74O67O66O68O68O61O61O78O90P07P29
1635A06875P55P56P42P43P53P75P94Q04Q00P99Q11Q11Q12Q12Q28Q51Q78R00R04R05R05R06
1632A24919R10R10R32R32R44R44R67R67R75R76R99R98J013J012J013J013J010J010J028J039
$$ y = [45369, 45625, 45880, 46135, 46391, 46645, 46899, 47153, 47407, 47667, 47927, 48187, 48448, 48725, 49002, 49279, 49556, 49875, 50195, 50514, 50833, 51157, 51482, 51807, 52131, 52494, 52856, 53219, 53581, 53949, 54317, 54685, 55053, 55420, 55786, 56153, 56520, 56896, 57272, 57648, 58024, 58392, 58760, 59128, 59497, 59865, 60233, 60601, 60969, 61339, 61709, 62079, 62448, 62806, 63164, 63500, 63835, 64181, 64527, 64873, 65219, 65588, 65956, 66325, 66694, 67071, 67448, 67825, 68201, 68599, 68996, 69394, 69791, 70203, 70614, 71027, 71440, 71870, 72323, 72786, 73249, 73712, 74174, 74636, 75099, 75577, 76055, 76535, 77014, 77518, 78044, 78580, 79117, 79649, 80182, 80725, 81290, 81864, 82437, 82989, 83542, 84094, 84646, 85221, 85796, 86369, 86942, 87493, 88043, 88585, 89127, 89707, 90287, 90879, 91470, 92041, 92612, 93196, 93802, 94397, 94992, 95597, 96225, 96862, 97500, 98127, 98754, 99406, 100080, 100747, 101413, 102081, 102749, 103410, 104071, 104749, 105439, 106146, 106875, 107630, 108386, 109128, 109871, 110624, 111399, 112193, 112997, 113797, 114596, 115407, 116218, 117030, 117842, 118670, 119521, 120399, 121299, 122203, 123108, 124013, 124919, 125829, 126739, 127671, 128603, 129547, 130491, 131458, 132425, 133400, 134376, 135375, 136373, 137386, 138398, 139411, 140424, 141434, 142444, 143472, 144511]
1630A44511J057J080J092J115J116J116J117J117J136J136J113J114J105J115J141J178J186
1628A63545J185J187J188J192J193J193J194J203J226J251J250J266J266J266J266J255J256
1626A84382J278J278J286J287J286J286J319J320J319J320J322J322J322J321J294J294J294
1623B06530J294J320J320J320J320J337J337J337J337J313J313J313J313J297J296J296J297
1621B28890J280J280J280J280J274J274J265J242J240J240J237J238J213J201J195J218J230
1619B50077J230J200J163J139J139J136J136J107J107J089J078J063J041J021J010J006J006
1617B68748R88R76R58R34R23R22R21Q99Q70Q48Q26Q03P90P67P53P52P40P18O88O66O60O49
1615B86799O22O00N71N48N33N10M96M73M57M34M20L97L89L66L36L13K85K61K48K25J99J89
$$ y = [144511, 145568, 146648, 147740, 148855, 149971, 151087, 152204, 153321, 154457, 155593, 156706, 157820, 158925, 160040, 161181, 162359, 163545, 164730, 165917, 167105, 168297, 169490, 170683, 171877, 173080, 174306, 175557, 176807, 178073, 179339, 180605, 181871, 183126, 184382, 185660, 186938, 188224, 189511, 190797, 192083, 193402, 194722, 196041, 197361, 198683, 200005, 201327, 202648, 203942, 205236, 206530, 207824, 209144, 210464, 211784, 213104, 214441, 215778, 217115, 218452, 219765, 221078, 222391, 223704, 225001, 226297, 227593, 228890, 230170, 231450, 232730, 234010, 235284, 236558, 237823, 239065, 240305, 241545, 242782, 244020, 245233, 246434, 247629, 248847, 250077, 251307, 252507, 253670, 254809, 255948, 257084, 258220, 259327, 260434, 261523, 262601, 263664, 264705, 265726, 266736, 267742, 268748, 269736, 270712, 271670, 272604, 273527, 274449, 275370, 276269, 277139, 277987, 278813, 279616, 280406, 281173, 281926, 282678, 283418, 284136, 284824, 285490, 286150, 286799, 287421, 288021, 288592, 289140, 289673, 290183, 290679, 291152, 291609, 292043, 292463, 292860, 293249, 293615, 293951, 294264, 294549, 294810, 295058, 295283, 295482, 295671]
1612B95671J82J59J28J06R0O8L1Pj3k5l2n4o8r0j12j34j63j87k19k42k71k94l31l43l40l39
1609B93185l51l88m23m46m60m71m84m95n08n31n66o03o35o46o37o49o86p09p15p26p43p81
1606B80532q07q18q31q31q33q33q59q82r08r08r18r40r66r67r68r90j010j021j024j035j053
1603B61130j054j064j087j112j112j097j098j097j098j132j131j156j156j168j192j194j207
1601B41975j206j207j208j207j216j217j216j217j234j235j235j234j224j224j234j256j260
1599B21145j261j239j239j251j251j251j251j255j255j255j255j246j246j246j246j251j252
1597A99895j251j252j214j215j214j214j236j235j211j188j180j180j202j201j187j186j186
1595A79343j187j155j155j155j156j158j159j135j136j124j123j133j115j090j079j085j084
$$ y = [295671, 295853, 296012, 296140, 296246, 296336, 296404, 296435, 296442, 296429, 296404, 296372, 296318, 296250, 296160, 296048, 295914, 295751, 295564, 295345, 295103, 294832, 294538, 294207, 293864, 293524, 293185, 292834, 292446, 292023, 291577, 291117, 290646, 290162, 289667, 289159, 288628, 288062, 287459, 286824, 286178, 285541, 284892, 284206, 283497, 282782, 282056, 281313, 280532, 279725, 278907, 278076, 277245, 276412, 275579, 274720, 273838, 272930, 272022, 271104, 270164, 269198, 268231, 267263, 266273, 265263, 264242, 263218, 262183, 261130, 260076, 259012, 257925, 256813, 255701, 254604, 253506, 252409, 251311, 250179, 249048, 247892, 246736, 245568, 244376, 243182, 241975, 240769, 239562, 238354, 237147, 235931, 234714, 233498, 232281, 231047, 229812, 228577, 227343, 226119, 224895, 223661, 222405, 221145, 219884, 218645, 217406, 216155, 214904, 213653, 212402, 211147, 209892, 208637, 207382, 206136, 204890, 203644, 202398, 201147, 199895, 198644, 197392, 196178, 194963, 193749, 192535, 191299, 190064, 188853, 187665, 186485, 185305, 184103, 182902, 181715, 180529, 179343, 178156, 177001, 175846, 174691, 173535, 172377, 171218, 170083, 168947, 167823, 166700, 165567, 164452, 163362, 162283, 161198, 160114]
1593A60114j074j073j073j074j040j040j040j040j034j035j012j012r86r87r86r85r88r69
1591A41666r48r37r43r43r48r36r21r02q80q70q73q74q72q73q70q71q47q48q30q31q35q24
1588A22190p96p78p65p65p74p74p74p74p71p72p44p26p10p11p09p10o86o87o86o87o79o78
1585A06034o79o78o79o79o57o30o19o19o17o17o07o07o06o07n99n98n61n62n66n78n63n37
1583I2569n31n31n30n29n11n10n10n11n09n09n09n09n07n06m95m76m63m63m63m62m61m62m62
1580H1150m61m49m48m49m48m40m39m40m39m08m07m09m08m02m13m17l98l80l69l68l80l87l87
1577G1604l88l87l64l63l64l63l57l57l56l56l37l18l27l27l17k98k86k86l02l01l02l01k94
1574F3953k95k71k72k74k75k96k97k94k76k49k49k37k38k37k37k59k60k48k29k29k30k30k29
$$ y = [160114, 159040, 157967, 156894, 155820, 154780, 153740, 152700, 151660, 150626, 149591, 148579, 147567, 146581, 145594, 144608, 143623, 142635, 141666, 140718, 139781, 138838, 137895, 136947, 136011, 135090, 134188, 133308, 132438, 131565, 130691, 129819, 128946, 128076, 127205, 126358, 125510, 124680, 123849, 123014, 122190, 121394, 120616, 119851, 119086, 118312, 117538, 116764, 115990, 115219, 114447, 113703, 112977, 112267, 111556, 110847, 110137, 109451, 108764, 108078, 107391, 106712, 106034, 105355, 104677, 103998, 103319, 102662, 102032, 101413, 100794, 100177, 99560, 98953, 98346, 97740, 97133, 96534, 95936, 95375, 94813, 94247, 93669, 93106, 92569, 92038, 91507, 90977, 90448, 89937, 89427, 88917, 88406, 87897, 87388, 86879, 86370, 85863, 85357, 84862, 84386, 83923, 83460, 82997, 82535, 82074, 81612, 81150, 80689, 80240, 79792, 79343, 78895, 78455, 78016, 77576, 77137, 76729, 76322, 75913, 75505, 75103, 74690, 74273, 73875, 73495, 73126, 72758, 72378, 71991, 71604, 71216, 70829, 70465, 70102, 69738, 69375, 69018, 68661, 68305, 67949, 67612, 67294, 66967, 66640, 66323, 66025, 65739, 65453, 65151, 64850, 64548, 64247, 63953, 63658, 63387, 63115, 62841, 62566, 62270, 61973, 61679, 61403, 61154, 60905, 60668, 60430, 60193, 59956, 59697, 59437, 59189, 58960, 58731, 58501, 58271, 58042]
1572E8042k38k64k70k70k51k32k20k20k27k28k27k28k12k11k12k11j94j93j71j70j62j61j62
1569E3108j61j57j57j45j26j20j19j11j21j23r7p6p6r2j18j41j40j20j20j19j20j44j44j22
1566E0139j22j14j14j14j14j20j20r7r8r2r2r2r2r0r1q9q9p4n2o3o3n5l2j4kQJ8J3J3K0J9
1562D8135RL1N9Q2J08J07R4R4R4R4J02J03J02J03P4P4P2P3O7M6J0k6n2o2n4o4j00j23j53j75
1558D8924j96k33k67k66k62k63k72k95l01l00l03l02l24l23l24l24l30l31l29l30l14k91k73
1556D2171k63k68k80k72k72k45k22k36k35k21k20j98j99j98j98j88j65j65j65j63j62j40j18
1553C7378j31j30j37j38j37j37j36j37j14j14j08j09j30j31j11j10j11j10j11j10j09j10j05
1550C4602q3p5p5r8j22j31j31j23j24j01j01q9q8q9q8q7q6j08j09r5r6q4q4q4q4o9n7o2q1
$$ y = [58042, 57804, 57540, 57270, 57000, 56749, 56517, 56297, 56077, 55850, 55622, 55395, 55167, 54955, 54744, 54532, 54321, 54127, 53934, 53763, 53593, 53431, 53270, 53108, 52947, 52790, 52633, 52488, 52362, 52242, 52123, 52012, 51891, 51768, 51671, 51595, 51519, 51427, 51309, 51168, 51028, 50908, 50788, 50669, 50549, 50405, 50261, 50139, 50017, 49903, 49789, 49675, 49561, 49441, 49321, 49224, 49126, 49034, 48942, 48850, 48758, 48668, 48577, 48488, 48399, 48325, 48273, 48210, 48147, 48092, 48060, 48046, 48044, 48052, 48070, 48083, 48096, 48116, 48135, 48144, 48175, 48234, 48316, 48424, 48531, 48625, 48719, 48813, 48907, 49009, 49112, 49214, 49317, 49391, 49465, 49537, 49610, 49677, 49723, 49733, 49707, 49655, 49593, 49539, 49475, 49375, 49252, 49099, 48924, 48728, 48495, 48228, 47962, 47700, 47437, 47165, 46870, 46569, 46269, 45966, 45664, 45340, 45017, 44693, 44369, 44039, 43708, 43379, 43049, 42735, 42444, 42171, 41908, 41640, 41360, 41088, 40816, 40571, 40349, 40113, 39878, 39657, 39437, 39239, 39040, 38842, 38644, 38456, 38291, 38126, 37961, 37798, 37636, 37496, 37378, 37247, 37117, 36980, 36842, 36705, 36568, 36432, 36295, 36181, 36067, 35959, 35850, 35720, 35589, 35478, 35368, 35257, 35147, 35036, 34926, 34817, 34707, 34602, 34519, 34444, 34369, 34271, 34149, 34018, 33887, 33764, 33640, 33539, 33438, 33349, 33261, 33172, 33084, 32997, 32911, 32803, 32694, 32599, 32503, 32419, 32335, 32251, 32167, 32098, 32041, 31979, 31898]
1546C1898r2r2p4p3p4p3q1q0q1q0o1o1o1o1n4n3o4o5o0o1l8l8n1n1n2n2o8q0q2o4l7k6m2o2
1542B9754p2p2o2m3k3k4l4n3n8n9m8m8n5n5n4n5n0n0k8k7l2l3m4m3l1l1qqj4j4k9m0l9j9r
1538B8390rk7k7k7k8k5k6k5k6k7k7k7k7nnk7k8k2k2l3l3l1k0k6m6n5m3k9k9j2j2J1J0LKk0
1534B7590k0k3k3k3k3k4k4j3j2j8j8MNJ7J8Oj3j9j9rrj3j2jJ8L8L8K8RMMKLj7j8J0K9K5K5
1529B7522J5J5J1J1L3L3L3L3J0J0RQRRpoJ6M3N9N8O1O0M0M0M0M0O6O6Q9Q9R1R1Q0Q0N3N3M1
1524B9004M1O2O1P3P2O6O5O6O6O0N9O0O0N9N8M7M7N8N7Q0Q0Q2Q2Q2Q1R3R2R3R2J19J19J18
1520C1354J19J13J12J25J43J49J48J49J49J44J44J44J43J53J53J90J90J93J93K05K04K11K11
1517C5039J88J89K06K07K29K29K55K54K67K67K74K97L06L06L03L03L14L36L48L59L72L83M00
$$ y = [31898, 31806, 31714, 31640, 31567, 31493, 31420, 31339, 31259, 31178, 31098, 31037, 30976, 30915, 30854, 30800, 30747, 30683, 30618, 30558, 30497, 30459, 30421, 30370, 30319, 30267, 30215, 30147, 30067, 29985, 29921, 29884, 29858, 29816, 29754, 29682, 29610, 29548, 29505, 29482, 29458, 29424, 29371, 29313, 29254, 29206, 29158, 29103, 29048, 28994, 28939, 28889, 28839, 28811, 28784, 28752, 28719, 28675, 28632, 28601, 28570, 28562, 28554, 28540, 28526, 28497, 28457, 28418, 28399, 28390, 28381, 28354, 28327, 28300, 28272, 28247, 28221, 28196, 28170, 28143, 28116, 28089, 28062, 28057, 28052, 28025, 27997, 27975, 27953, 27920, 27887, 27856, 27836, 27810, 27764, 27709, 27666, 27637, 27608, 27596, 27584, 27595, 27605, 27608, 27610, 27590, 27570, 27547, 27524, 27501, 27478, 27454, 27430, 27417, 27405, 27387, 27369, 27373, 27378, 27395, 27413, 27419, 27406, 27387, 27368, 27359, 27350, 27337, 27325, 27324, 27342, 27380, 27418, 27446, 27455, 27459, 27463, 27465, 27468, 27451, 27433, 27443, 27472, 27497, 27522, 27537, 27552, 27563, 27574, 27607, 27640, 27673, 27706, 27716, 27726, 27735, 27743, 27752, 27761, 27754, 27748, 27764, 27807, 27866, 27924, 27985, 28045, 28085, 28125, 28165, 28205, 28271, 28337, 28426, 28515, 28606, 28697, 28777, 28857, 28910, 28963, 29004, 29045, 29107, 29168, 29241, 29313, 29379, 29444, 29510, 29576, 29636, 29695, 29755, 29815, 29874, 29932, 29979, 30026, 30084, 30141, 30221, 30301, 30383, 30465, 30547, 30628, 30721, 30813, 30906, 30998, 31117, 31236, 31354, 31473, 31586, 31698, 31823, 31966, 32115, 32263, 32412, 32561, 32705, 32849, 32993, 33136, 33289, 33442, 33632, 33822, 34015, 34208, 34413, 34617, 34828, 35039, 35227, 35416, 35622, 35829, 36058, 36287, 36542, 36796, 37063, 37330, 37604, 37901, 38207, 38513, 38816, 39119, 39433, 39769, 40117, 40476, 40848, 41231, 41631]
1515D1631M23M51M73M96M96N09N32N56N79O15O53O94P16P40P78Q36Q88R47R99J058J111J186
1512E7367J269J355J453J571J698J821J933K023K106K187K255K308K319K280K198K095J952
1510I0190J791J587J366J132R14O66M06J43j09l41n63p66r27j040j123j161j174j137j064
1508H8790r66q37o94n77m64l61k48j36l9L3J16J92K74L58M41N21N89O35O73P04P72Q47R15
1505I1538R54R77J008J061J117J170J222J258J285J308J360J428J485J522J558J595J646J700
1503A15192J742J780J817J871J918J956J988K026K073K126K186K237K292K345K405K458K498
1500A50910K565K647K729K806K889L000L098L189L270L370L467L570L668L774L871L970M067
1498B06860M181M293M416M543M670M812M948N091N250N408N579N766N954O157O373O591O810
$$ y = [41631, 42054, 42505, 42978, 43474, 43970, 44479, 45011, 45567, 46146, 46761, 47414, 48108, 48824, 49564, 50342, 51178, 52066, 53013, 54012, 55070, 56181, 57367, 58636, 59991, 61444, 63015, 64713, 66534, 68467, 70490, 72596, 74783, 77038, 79346, 81665, 83945, 86143, 88238, 90190, 91981, 93568, 94934, 96066, 96980, 97646, 98052, 98195, 98086, 97745, 97182, 96416, 95489, 94449, 93326, 92165, 90991, 89854, 88790, 87824, 86987, 86293, 85716, 85252, 84891, 84643, 84507, 84468, 84501, 84617, 84809, 85083, 85441, 85882, 86403, 86992, 87627, 88300, 89004, 89776, 90623, 91538, 92492, 93469, 94477, 95538, 96655, 97825, 99047, 100305, 101590, 102898, 104258, 105686, 107171, 108693, 110251, 111846, 113492, 115192, 116934, 118714, 120531, 122402, 124320, 126276, 128264, 130290, 132363, 134489, 136675, 138912, 141204, 143549, 145954, 148412, 150910, 153475, 156122, 158851, 161657, 164546, 167546, 170644, 173833, 177103, 180473, 183940, 187510, 191178, 194952, 198823, 202793, 206860, 211041, 215334, 219750, 224293, 228963, 233775, 238723, 243814, 249064, 254472, 260051, 265817, 271771, 277928, 284301, 290892, 297702]
1496B97702P042P287P550P804Q097Q396Q703R014R337R709J0092J0489J0887J1325J1769J2242
1494D47445J2730J3251J3800J4379J4972J5609J6291J7003J7762J8554J9373K0232K1140K2090
1493F84631K3090K4140K5229K6359K7524K8740K9994L1293L2623L3947L5291L6638L7982L9293
1491A116774M0548M1729M2818M3788M4621M5268M5712M5907M5840M5481M4797M3775M2417
1489A689475M0691L8595L6131L3300L0131K6653K2927J8954J4813J0525O129J706k689o993
1488A960348j1154j5142j8931k2468k5705k8626l1193l3423l5290l6799l7999l8893l9503
1486A585222l9825l9899l9756l9425l8922l8276l7532l6701l5807l4868l3883l2860l1830
1484A105638l0784k9739k8730k7731k6747k5793k4870k3960k3078k2214k1396k0607j9865
$$ y = [297702, 304744, 312031, 319581, 327385, 335482, 343878, 352581, 361595, 370932, 380641, 390733, 401222, 412109, 423434, 435203, 447445, 460175, 473426, 487226, 501605, 516577, 532186, 548477, 565480, 583242, 601796, 621169, 641401, 662541, 684631, 707721, 731861, 757090, 783449, 810973, 839713, 869707, 901000, 933623, 967570, 1002861, 1039499, 1077481, 1116774, 1157322, 1199051, 1241869, 1285657, 1330278, 1375546, 1421258, 1467165, 1513005, 1558486, 1603283, 1647058, 1689475, 1730166, 1768761, 1804892, 1838192, 1868323, 1894976, 1917903, 1936857, 1951670, 1962195, 1968324, 1970030, 1967341, 1960348, 1949194, 1934052, 1915121, 1892653, 1866948, 1838322, 1807129, 1773706, 1738416, 1701617, 1663618, 1624725, 1585222, 1545397, 1505498, 1465742, 1426317, 1387395, 1349119, 1311587, 1274886, 1239079, 1204211, 1170328, 1137468, 1105638, 1074854, 1045115, 1016385, 988654, 961907, 936114, 911244, 887284, 864206, 841992, 820596, 799989, 780124]
1483G80124j9137j8424j7741j7102j6494j5892j5315j4783j4279j3803j3345j2892j2463j2059
1481E66395j1660j1287j0933j0602j0280r980r702r423r159q889q640q408q174p948p731p526
1479D16053p354p197p023o852o694o559o416o289o161o021n909n803n689n570n457n374n306
1477C10379n240n158n063m965m886m820m741m674m588m505m418m335m251m184m117m034l960
1475B32440l892l808l726l640l558l488l422l351l270l196l113l034k966k897k845k792k726
1473A76716k645k563k503k451k389k337k283k230k186k132k089k037j991j939j886j833j796
1471A39426j759j718j680j659j606j551j513j489j466j437j399j356j319j300j277j261j238
1469A14398j214j177j157j157j118j080j046j046j033r96r64r64r50r50r24r01q92q69q40
$$ y = [780124, 760987, 742563, 724822, 707720, 691226, 675334, 660019, 645236, 630957, 617154, 603809, 590917, 578454, 566395, 554735, 543448, 532515, 521913, 511633, 501653, 491951, 482528, 473369, 464480, 455840, 447432, 439258, 431310, 423579, 416053, 408699, 401502, 394479, 387627, 380933, 374374, 367958, 361669, 355508, 349487, 343578, 337775, 332086, 326516, 321059, 315685, 310379, 305139, 299981, 294918, 289953, 285067, 280247, 275506, 270832, 266244, 261739, 257321, 252986, 248735, 244551, 240434, 236400, 232440, 228548, 224740, 221014, 217374, 213816, 210328, 206906, 203555, 200285, 197089, 193976, 190942, 187976, 185079, 182234, 179442, 176716, 174071, 171508, 169005, 166554, 164165, 161828, 159545, 157315, 155129, 152997, 150908, 148871, 146880, 144941, 143055, 141222, 139426, 137667, 135949, 134269, 132610, 131004, 129453, 127940, 126451, 124985, 123548, 122149, 120793, 119474, 118174, 116897, 115636, 114398, 113184, 112007, 110850, 109693, 108575, 107495, 106449, 105403, 104370, 103374, 102410, 101446, 100496, 99546, 98622, 97721, 96829, 95960, 95120]
1466I5120q18q01q01p76p75p72p50p35p14o99o77o36o36o50o50o26o02n94n93n91n92n65n66
1464G9501n54n54n34n35n11n11m94m71m58m37m42m43m41m42m15m16m15m16l92l93l70l70l55
1461F9132l56l56l55l53l52l29l28l03k80k70k70k87k86k75k75k74k73k73k73k56k56k56k55
1458F2341k70k70k69k70k84k83k62k61k75k75k98k97k89k88k78k77k66k66k44k43k53k54k52
1455E6117k52k22k03j86j68j63j63j62j61j89j89j88j88j75j64j57j83k23k42k32k33k54k55
1452E1565k54k55k34k34k35k34k34k34k35k34k38k38k37k38k17k06k00j81j58j58j68j88j91
1450D6564j92j67j49j40j67j95k07j93j74j69j57j42j31j36j36j28j29j28j29j31j31j32j31
1447D3070j07j07j07j07j18j18j18j18j18j18r5r5p6p6p5p6o9o9o9o8p3p2p2p3o6o7o7o6n2
$$ y = [95120, 94302, 93501, 92700, 91924, 91149, 90377, 89627, 88892, 88178, 87479, 86802, 86166, 85530, 84880, 84230, 83604, 83002, 82408, 81815, 81224, 80632, 80067, 79501, 78947, 78393, 77859, 77324, 76813, 76302, 75808, 75337, 74879, 74442, 74000, 73557, 73116, 72674, 72259, 71843, 71428, 71012, 70620, 70227, 69857, 69487, 69132, 68776, 68420, 68065, 67712, 67360, 67031, 66703, 66400, 66120, 65850, 65580, 65293, 65007, 64732, 64457, 64183, 63910, 63637, 63364, 63108, 62852, 62596, 62341, 62071, 61801, 61532, 61262, 60978, 60695, 60433, 60172, 59897, 59622, 59324, 59027, 58738, 58450, 58172, 57895, 57629, 57363, 57119, 56876, 56623, 56369, 56117, 55865, 55643, 55440, 55254, 55086, 54923, 54760, 54598, 54437, 54248, 54059, 53871, 53683, 53508, 53344, 53187, 53004, 52781, 52539, 52307, 52074, 51820, 51565, 51311, 51056, 50822, 50588, 50353, 50119, 49885, 49651, 49416, 49182, 48944, 48706, 48469, 48231, 48014, 47808, 47608, 47427, 47269, 47111, 46943, 46755, 46564, 46372, 46205, 46056, 45916, 45749, 45554, 45347, 45154, 44980, 44811, 44654, 44512, 44381, 44245, 44109, 43981, 43852, 43724, 43595, 43464, 43333, 43201, 43070, 42963, 42856, 42749, 42642, 42524, 42406, 42288, 42170, 42052, 41934, 41839, 41744, 41668, 41592, 41517, 41441, 41372, 41303, 41234, 41166, 41093, 41021, 40949, 40876, 40810, 40743, 40676, 40610, 40558]
1443D0558n1n1n1n0m9l8j9JJKJlj4jK6N6N5M6K6K1K0J9J8jk0m0n1o5o4p8r5j21j20j21j21
1439C9626j39j38j46j73j97j98j88j68j55j56j31j32j19j20j19j20j09j08j09j09j05j05j05
1436C6477j06j04j03j04j04j10j09q7q7o7o8o8o7q5q4q4q4q8q8p5n7m6m6n6p5q0q1o9n1l4
1433C4110l4n5n6m7m6m7m7n0m9m9n0o1o1o1o1m8m9k6k6j8j8j8j8l7l6l6l7l1l0n4n3m6m6j5
1428C2694nj4l3k8j7ook1l1k9rRK1Nj4l0j9LJ4QQ%j%jrj0j0j0K1K0K1K0MMLMNONONNONK1K1
1423C2641K1K1J1J2J1J2M0L9N3L0K7K7O3O3P7P6P7P7R2R2R3R2R5R4R5R5J07J06J17J39J71
1419C4766J72J63J41J55J55J76J76K05K05K05K04J94J93K17K16K23K24K22K22J93J71J45J46
1416C9089J32J33J14P7M3K0PPk8n0p1j08j28j51j63j63j60j61j83j83k11k11k11k11k19k19
$$ y = [40558, 40507, 40456, 40405, 40355, 40306, 40268, 40249, 40250, 40251, 40253, 40254, 40251, 40237, 40236, 40262, 40318, 40373, 40419, 40445, 40466, 40486, 40505, 40523, 40522, 40502, 40462, 40411, 40346, 40282, 40204, 40109, 39988, 39868, 39747, 39626, 39487, 39349, 39203, 39030, 38833, 38635, 38447, 38279, 38124, 37968, 37837, 37705, 37586, 37466, 37347, 37227, 37118, 37010, 36901, 36792, 36687, 36582, 36477, 36371, 36267, 36164, 36060, 35956, 35846, 35737, 35650, 35563, 35496, 35428, 35360, 35293, 35208, 35124, 35040, 34956, 34868, 34780, 34705, 34648, 34602, 34556, 34500, 34425, 34345, 34264, 34195, 34144, 34110, 34076, 34021, 33965, 33918, 33872, 33825, 33778, 33728, 33679, 33630, 33580, 33519, 33458, 33397, 33336, 33288, 33239, 33213, 33187, 33169, 33151, 33133, 33115, 33078, 33042, 33006, 32969, 32938, 32908, 32854, 32801, 32755, 32709, 32694, 32689, 32675, 32642, 32614, 32597, 32591, 32585, 32564, 32533, 32504, 32495, 32504, 32525, 32530, 32516, 32486, 32467, 32470, 32484, 32492, 32500, 32500, 32499, 32499, 32498, 32489, 32479, 32469, 32459, 32480, 32500, 32521, 32541, 32545, 32549, 32552, 32556, 32561, 32567, 32572, 32578, 32583, 32588, 32594, 32599, 32620, 32641, 32662, 32683, 32694, 32706, 32717, 32729, 32769, 32808, 32861, 32891, 32918, 32945, 33008, 33071, 33148, 33224, 33301, 33378, 33470, 33562, 33655, 33747, 33842, 33936, 34031, 34126, 34233, 34339, 34456, 34595, 34766, 34938, 35101, 35242, 35397, 35552, 35728, 35904, 36109, 36314, 36519, 36723, 36917, 37110, 37327, 37543, 37766, 37990, 38212, 38434, 38627, 38798, 38943, 39089, 39221, 39354, 39468, 39545, 39588, 39608, 39615, 39622, 39594, 39544, 39473, 39365, 39237, 39086, 38923, 38760, 38600, 38439, 38256, 38073, 37862, 37651, 37440, 37229, 37010, 36791]
1413C6791k20k19j91j91j91j91j66j65j66j65j73j72j73j73j65j65j40j18j04j05j03j03j04
1410C3128j04j05j04q4q3q4q3r1r0r1r0q7q8m9n0n5n5n6n5p5p6o4m5k6l7n2n2n6n6n6n5l9
1406C0935l8l9l8l7l8l7l7m4m4k2k2k4k5k5k5k7k8k7k7k7k7k7k8k5k5k5k6k4k3k4k4k1k1K
1402B9986Kmlk7k6k9k8k9k9k4k5k4k5k2k2k1k2nnnnj2j2j2j3j4j5%J2mk2j7oQQJ4Kk1m0l6
1397B9428k5j0Jnnjjjjoppoj6j7j6j6%JJ%K2K2K2K1NNNNNMNNJ0J1J0J0nj6j6nRRJ0RJ1J1J7
1391B9492OLLKKJ4J4OJ8J3JQQKKKKj1j1j1j0pNpMK7L8L9K8J1J2J0J1NNNNJ1J1NJ6J9J9Rj1
1386B9825k8j7J2L9L2K1K8K9J5J5K1J0PPPOJ4J5J4J5NNNOJ5J5J5J5Jj0j0JK0K0K1K1K1K1K1
1381C0295K1J8J8J8J8K3K4K4K3J7J6J6J6J6J5K2J0LKnPK4K4L1K0ONNNkklkJ2J2N0M9L4L4L4
$$ y = [36791, 36571, 36352, 36161, 35970, 35779, 35588, 35422, 35257, 35091, 34926, 34753, 34581, 34408, 34235, 34070, 33905, 33765, 33647, 33543, 33438, 33335, 33232, 33128, 33024, 32919, 32815, 32731, 32648, 32564, 32481, 32390, 32300, 32209, 32119, 32032, 31944, 31895, 31845, 31790, 31735, 31679, 31624, 31549, 31473, 31409, 31364, 31338, 31301, 31249, 31197, 31141, 31085, 31029, 30974, 30935, 30897, 30858, 30820, 30783, 30745, 30708, 30671, 30627, 30583, 30561, 30539, 30515, 30490, 30465, 30440, 30413, 30385, 30358, 30331, 30304, 30277, 30250, 30222, 30197, 30172, 30147, 30121, 30097, 30074, 30050, 30026, 30005, 29984, 29986, 29988, 29984, 29981, 29954, 29928, 29899, 29871, 29842, 29813, 29789, 29764, 29740, 29715, 29693, 29671, 29650, 29628, 29623, 29618, 29613, 29608, 29596, 29584, 29572, 29559, 29545, 29530, 29530, 29542, 29538, 29516, 29499, 29493, 29501, 29509, 29523, 29525, 29504, 29464, 29428, 29403, 29393, 29394, 29389, 29384, 29383, 29382, 29381, 29380, 29374, 29367, 29360, 29354, 29338, 29321, 29305, 29289, 29289, 29290, 29291, 29291, 29313, 29335, 29357, 29378, 29383, 29388, 29393, 29398, 29403, 29407, 29412, 29417, 29427, 29438, 29448, 29458, 29453, 29437, 29421, 29416, 29425, 29434, 29444, 29453, 29464, 29475, 29492, 29498, 29501, 29504, 29506, 29508, 29522, 29536, 29542, 29560, 29573, 29574, 29582, 29590, 29592, 29594, 29596, 29598, 29587, 29576, 29565, 29555, 29548, 29553, 29546, 29550, 29577, 29615, 29654, 29682, 29693, 29705, 29715, 29726, 29731, 29736, 29741, 29746, 29757, 29768, 29773, 29789, 29808, 29827, 29836, 29825, 29797, 29780, 29792, 29831, 29863, 29884, 29912, 29941, 29956, 29971, 29992, 30002, 30009, 30016, 30023, 30029, 30043, 30058, 30072, 30087, 30092, 30097, 30102, 30108, 30123, 30138, 30153, 30168, 30169, 30159, 30149, 30150, 30170, 30190, 30211, 30232, 30253, 30274, 30295, 30316, 30334, 30352, 30370, 30388, 30411, 30435, 30459, 30482, 30499, 30515, 30531, 30547, 30563, 30578, 30600, 30610, 30613, 30615, 30610, 30617, 30641, 30665, 30696, 30716, 30722, 30727, 30732, 30737, 30735, 30733, 30730, 30728, 30740, 30752, 30802, 30851, 30885, 30919, 30953]
1376C0953L4J6J6J6J5ooooj4kJ8L7M7N9N2N1K4MJ5J5J4J3J4J4K7K8K7K7L8K7Oj2k1j0NNLK
1371C1539K5K5M3M4M3M3J3J3J3J3K6K6K7K6K3K4K3K3qqJ4M0N5M4K9L0K1K1K2K1L6L7L7L7K0
1367C2460K1K1K1K7K6M8M8M1K2mnJ6J7J7J6K2K3L3J5LJ5PPMLJ5L4L8K7OoKL0M2L1J1J0L2L2
1362C3228L6L7J4J5RJ0J0J0JJK9M6N8N7M7M7L9L9L9M0K0K0K0K0K0K0NokJ7M4M3K4K4K4K4K7
1358C4156K7MMqpLMJ4J5L7L6M3M3L1L2J8J9J9J8L2L2L1L2M1M1M1M1K8K7K7K8K7K7K8K7M0M0
1353C5098M0M0K7K7K7K7L0L0L1L0L1L0L0L1J8J8J8J8K1K1M3M3M6M5K3K3L2L3L3L3J0J0L2L3
1349C6082L6L6OnLK1L2L3M7M7M7M7N5N5N6N5K3K3L5L4L0L0PPK4K3M6M6N3N3M1K2J5J4L5L6
1345C7250L7L8M8M9M9M8L7L6L5J7OOK9N4O2O3M3M4L2L2M6M5M6M5L5L5L4L5M3M2M3M3K9L0Q
$$ y = [30953, 30987, 31003, 31019, 31035, 31050, 31044, 31038, 31032, 31026, 31012, 31010, 31028, 31065, 31112, 31171, 31223, 31274, 31298, 31302, 31317, 31332, 31346, 31359, 31373, 31387, 31414, 31442, 31469, 31496, 31534, 31561, 31567, 31555, 31534, 31524, 31529, 31534, 31537, 31539, 31564, 31589, 31632, 31676, 31719, 31762, 31775, 31788, 31801, 31814, 31840, 31866, 31893, 31919, 31942, 31966, 31989, 32012, 32004, 31996, 32010, 32050, 32105, 32149, 32178, 32208, 32229, 32250, 32272, 32293, 32329, 32366, 32403, 32440, 32460, 32481, 32502, 32523, 32550, 32576, 32624, 32672, 32713, 32735, 32731, 32726, 32742, 32759, 32776, 32792, 32814, 32837, 32870, 32885, 32888, 32903, 32910, 32917, 32921, 32924, 32939, 32973, 33011, 33038, 33044, 33038, 33040, 33070, 33112, 33143, 33154, 33164, 33196, 33228, 33264, 33301, 33315, 33330, 33339, 33349, 33359, 33369, 33370, 33371, 33400, 33446, 33504, 33561, 33608, 33655, 33694, 33733, 33772, 33812, 33832, 33852, 33872, 33892, 33912, 33932, 33937, 33931, 33929, 33946, 33990, 34033, 34057, 34081, 34105, 34129, 34156, 34183, 34187, 34191, 34183, 34176, 34179, 34183, 34197, 34212, 34249, 34285, 34328, 34371, 34402, 34434, 34452, 34471, 34490, 34508, 34540, 34572, 34603, 34635, 34676, 34717, 34758, 34799, 34827, 34854, 34881, 34909, 34936, 34963, 34991, 35018, 35058, 35098, 35138, 35178, 35205, 35232, 35259, 35286, 35316, 35346, 35377, 35407, 35438, 35468, 35498, 35529, 35547, 35565, 35583, 35601, 35622, 35643, 35686, 35729, 35775, 35820, 35843, 35866, 35898, 35931, 35964, 35997, 36007, 36017, 36049, 36082, 36118, 36154, 36160, 36155, 36158, 36179, 36211, 36244, 36291, 36338, 36385, 36432, 36487, 36542, 36598, 36653, 36676, 36699, 36734, 36768, 36798, 36828, 36835, 36842, 36866, 36889, 36935, 36981, 37034, 37087, 37128, 37150, 37165, 37179, 37214, 37250, 37287, 37325, 37373, 37422, 37471, 37519, 37556, 37592, 37627, 37644, 37650, 37656, 37685, 37739, 37801, 37864, 37907, 37951, 37983, 38015, 38061, 38106, 38152, 38197, 38232, 38267, 38301, 38336, 38379, 38421, 38464, 38507, 38536, 38566, 38574]
1340C8574QJ5L3M6M5N4N4N3N4K7K8K7K7M0M1M0M1L2L3L2L3N2N3P4P5O0N9L7L7K7K8N0N0N5
1336C9994N6L3L3K0K1M3M3K9K9K9K9N2N2N2N3L5L6L5L5N1N0N0N0L7L7L8L7M4M5M5M4M5M5M5
1332D1372M4M9M9M9M9N2N1M0M0K6K6M9M8N6N7M5M4L4L3N6N6N9O0N9N9L9L9L8L9L9L8L9L8O3
1328D2934O2O2O2N9N8L5L6L7L8L7L8O3O2O3O3Q0Q1O8N0L2L1N4N3O3O3O3O4M2M3O4O4O4N3M8
1324D4789O7R0P8N0N0O5Q3P9O7N5M3M9M9O0O1O0O1N1N1N1N1P1P1P0P1M2M3M2M3M3M4M4M3N4
1320D6741N3N3N3M6M5M6M6K9K8N2N1L2L2M8N8N1L2L6M7N8M6L1L1M3M2M3M3M6M7M7M6M2M3M2
1315D8229M3M5M6O8O9P6P7O4M6L7L7L6L6M6M7O9O8O3O3O3O2N5N5N5N4M9M8M8M8N8N8N7N8N9
1311E0092O0N9O0L7L7M9O7O8N6M2M1O1O0O0O1O2O2O2O2O5O6M3M2O7O6O7O6N6N6N5N6O9P0O9
$$ y = [38574, 38582, 38597, 38630, 38676, 38721, 38775, 38829, 38882, 38936, 38963, 38991, 39018, 39045, 39085, 39126, 39166, 39207, 39239, 39272, 39304, 39337, 39389, 39442, 39516, 39591, 39651, 39710, 39747, 39784, 39811, 39839, 39889, 39939, 39994, 40050, 40083, 40116, 40136, 40157, 40200, 40243, 40272, 40301, 40330, 40359, 40411, 40463, 40515, 40568, 40603, 40639, 40674, 40709, 40760, 40810, 40860, 40910, 40947, 40984, 41022, 41059, 41103, 41148, 41193, 41237, 41282, 41327, 41372, 41416, 41465, 41514, 41563, 41612, 41664, 41715, 41755, 41795, 41821, 41847, 41896, 41944, 42000, 42057, 42102, 42146, 42180, 42213, 42269, 42325, 42384, 42444, 42503, 42562, 42601, 42640, 42678, 42717, 42756, 42794, 42833, 42871, 42934, 42996, 43058, 43120, 43179, 43237, 43272, 43308, 43345, 43383, 43420, 43458, 43521, 43583, 43646, 43709, 43789, 43870, 43938, 43988, 44020, 44051, 44105, 44158, 44221, 44284, 44347, 44411, 44453, 44496, 44560, 44624, 44688, 44741, 44789, 44856, 44946, 45024, 45074, 45124, 45189, 45272, 45351, 45418, 45473, 45516, 45565, 45614, 45674, 45735, 45795, 45856, 45907, 45958, 46009, 46060, 46131, 46202, 46272, 46343, 46385, 46428, 46470, 46513, 46556, 46600, 46644, 46687, 46741, 46794, 46847, 46900, 46946, 46991, 47037, 47083, 47112, 47140, 47192, 47243, 47275, 47307, 47355, 47413, 47464, 47496, 47532, 47579, 47637, 47683, 47714, 47745, 47788, 47830, 47873, 47916, 47962, 48009, 48056, 48102, 48144, 48187, 48229, 48272, 48317, 48363, 48431, 48500, 48576, 48653, 48717, 48763, 48800, 48837, 48873, 48909, 48955, 49002, 49071, 49139, 49202, 49265, 49328, 49390, 49445, 49500, 49555, 49609, 49658, 49706, 49754, 49802, 49860, 49918, 49975, 50033, 50092, 50152, 50211, 50271, 50308, 50345, 50394, 50461, 50529, 50585, 50627, 50668, 50729, 50789, 50849, 50910, 50972, 51034, 51096, 51158, 51223, 51289, 51332, 51374, 51441, 51507, 51574, 51640, 51696, 51752, 51807, 51863, 51932, 52002, 52071]
1307E2071O9N3N2L1L1M1N9P8R0Q9P0N2M0M1N9P7O6M1M1N2P1P4P3P5P4N4N4N3N4N8N8L5L6L0
1303E4002L1M3O2P6P7P7P8N8N9N8N9N6N6N6N6O9P0O9O9O2O1O2O1N6N6N6N5N9N8N8N8O8O7O8
1299E6086O8M6M6M6M6M0M0O2Q8J02Q3M8L8N2N2N2N2O8O8M6M6M1M2M1M2P7P7P8P7N7N7N6N7
1295E7977N4N4N4N3O7O7O7O7O2O2O1O2N2N2L0L1K6L7N8P7Q2Q1O0O0P2P2P2P2O1O1L9L9M2N3
1291E9936P3R1J00Q7O5N3N1N2N1N1L6L5M8O6P5P5N3N3N8N8N8N9O0O1O0O1L2L3L2L3M3M4M4
1287F1787M4M3M4M4M4N7N8N7N8N3M3L8N6P2O0M5M5M3M3O6O6N6N6L5L5O4Q3P1P2P6O6M5K6L9
1282F3590M9M2M1L7L7L7L7N4N3N4N4O0O0O0O0M6M7M7M6N4N3N3N4O0O1M9L1K3L4M9M9M9M9O0
1278F5239M1K5K5M6M7M7M6M7M7M0M1M0M1N0N0N0M9L6L6L5L6M3M4M3M4N3N4L0L1L4L5L4L4M0
$$ y = [52071, 52140, 52193, 52245, 52276, 52307, 52348, 52407, 52485, 52575, 52664, 52734, 52786, 52826, 52867, 52926, 53003, 53069, 53110, 53151, 53203, 53274, 53348, 53421, 53496, 53570, 53624, 53678, 53731, 53785, 53843, 53901, 53936, 53972, 54002, 54033, 54076, 54138, 54214, 54291, 54368, 54446, 54504, 54563, 54621, 54680, 54736, 54792, 54848, 54904, 54973, 55043, 55112, 55181, 55243, 55304, 55366, 55427, 55483, 55539, 55595, 55650, 55709, 55767, 55825, 55883, 55951, 56018, 56086, 56154, 56200, 56246, 56292, 56338, 56378, 56418, 56480, 56568, 56670, 56753, 56801, 56839, 56891, 56943, 56995, 57047, 57115, 57183, 57229, 57275, 57316, 57358, 57399, 57441, 57518, 57595, 57673, 57750, 57807, 57864, 57920, 57977, 58031, 58085, 58139, 58192, 58259, 58326, 58393, 58460, 58522, 58584, 58645, 58707, 58759, 58811, 58841, 58872, 58898, 58935, 58993, 59070, 59152, 59233, 59293, 59353, 59425, 59497, 59569, 59641, 59702, 59763, 59802, 59841, 59883, 59936, 60009, 60100, 60200, 60287, 60352, 60405, 60456, 60508, 60559, 60610, 60646, 60681, 60729, 60795, 60870, 60945, 60998, 61051, 61109, 61167, 61225, 61284, 61344, 61405, 61465, 61526, 61558, 61591, 61623, 61656, 61699, 61743, 61787, 61831, 61874, 61918, 61962, 62006, 62063, 62121, 62178, 62236, 62289, 62332, 62370, 62426, 62498, 62558, 62603, 62648, 62691, 62734, 62800, 62866, 62922, 62978, 63013, 63048, 63112, 63195, 63266, 63338, 63414, 63480, 63525, 63551, 63590, 63639, 63681, 63722, 63759, 63796, 63833, 63870, 63924, 63977, 64031, 64085, 64145, 64205, 64265, 64325, 64371, 64418, 64465, 64511, 64565, 64618, 64671, 64725, 64785, 64846, 64895, 64926, 64949, 64983, 65032, 65081, 65130, 65179, 65239, 65280, 65305, 65330, 65376, 65423, 65470, 65516, 65563, 65610, 65650, 65691, 65731, 65772, 65822, 65872, 65922, 65971, 66007, 66043, 66078, 66114, 66157, 66201, 66244, 66288, 66341, 66395, 66425, 66456, 66490, 66525, 66559, 66593, 66633]
1274F6633M1M1M0L5L5L5L5L3L3L3L3L3L3L3L3L1L1L1L1J8J9M8N9M8K2RK0M1N2N3M2L1L1L0
1270F7806L0M0M0L9M0L2L2L2L2K7K6K7K6K9K9K9K9K9K9K9K9J8J7J7J7J8J9J8J9QQL0L1L1L1
1266F8743L1L1L0L0L0L0OPK9K9L6L6K1J0J5L3K9J7jjK0K0Nj3j2OK7L9L9K9J1J1J0J0J7J7J6
1261F9443J7QPPQK4K4K5K4kjkjK3K3J1qj7j6oJ2J3J3J4J3OOOOOOPOkkK0K1J5J5qpj5j4j4j4
1256F9700onononnokkkkj2j1j2j1k5k5k5k4k1k1KKJ4J3J4J3%J%%jjk4k3j2j2J0R%j9l1l2k3
1250F9361k4k4k4k0k1k1k0NNMMQj2l2m4l8l8l9l8l1l0l0l1j7j7j8j7j8j8j9j8k8k8l8k0jj
1246F8612j2l1l2l2l3l3j5j5j4j5l3l3l3l3l0l0n2n3l4l4l4l4k1k1k1k1l8l8l8l8k7k8k8k8
1241F7600k0j9m2m2n6n6l5l4l4m6n0l1nj6m0n0l5k3l7o3o5m5l5l6n2n2n2n1n4l5k3k4m8m7
$$ y = [66633, 66674, 66715, 66755, 66790, 66825, 66860, 66895, 66928, 66961, 66994, 67027, 67060, 67093, 67126, 67159, 67190, 67221, 67252, 67283, 67301, 67320, 67368, 67427, 67475, 67497, 67506, 67526, 67567, 67619, 67672, 67714, 67745, 67776, 67806, 67836, 67876, 67916, 67955, 67995, 68027, 68059, 68091, 68123, 68150, 68176, 68203, 68229, 68258, 68287, 68316, 68345, 68374, 68403, 68432, 68461, 68479, 68496, 68513, 68530, 68548, 68567, 68585, 68604, 68612, 68620, 68650, 68681, 68712, 68743, 68774, 68805, 68835, 68865, 68895, 68925, 68931, 68938, 68967, 68996, 69032, 69068, 69089, 69099, 69114, 69147, 69176, 69193, 69192, 69191, 69211, 69231, 69236, 69223, 69211, 69217, 69244, 69283, 69322, 69351, 69362, 69373, 69383, 69393, 69410, 69427, 69443, 69460, 69468, 69475, 69482, 69490, 69514, 69538, 69563, 69587, 69585, 69584, 69582, 69581, 69604, 69627, 69638, 69630, 69613, 69597, 69591, 69603, 69616, 69629, 69643, 69656, 69662, 69668, 69674, 69680, 69686, 69692, 69699, 69705, 69703, 69701, 69721, 69742, 69757, 69772, 69764, 69757, 69742, 69728, 69714, 69700, 69694, 69689, 69683, 69678, 69672, 69667, 69662, 69656, 69654, 69652, 69650, 69648, 69636, 69625, 69613, 69602, 69577, 69552, 69527, 69503, 69482, 69461, 69463, 69465, 69479, 69492, 69506, 69519, 69519, 69520, 69520, 69520, 69519, 69518, 69494, 69471, 69459, 69447, 69457, 69466, 69466, 69447, 69416, 69384, 69361, 69337, 69313, 69289, 69269, 69248, 69227, 69207, 69212, 69217, 69221, 69225, 69233, 69221, 69189, 69145, 69107, 69069, 69030, 68992, 68961, 68931, 68901, 68870, 68853, 68836, 68818, 68801, 68783, 68765, 68746, 68728, 68700, 68672, 68634, 68614, 68613, 68612, 68600, 68569, 68537, 68505, 68472, 68439, 68424, 68409, 68395, 68380, 68347, 68314, 68281, 68248, 68218, 68188, 68136, 68083, 68049, 68015, 67981, 67947, 67926, 67905, 67884, 67863, 67825, 67787, 67749, 67711, 67684, 67656, 67628, 67600, 67580, 67561, 67519, 67477, 67421, 67365, 67330, 67296, 67262, 67216, 67166, 67135, 67130, 67114, 67074, 67024, 66989, 66966, 66929, 66866, 66801, 66756, 66721, 66685, 66633, 66581, 66529, 66478, 66424, 66389, 66366, 66342, 66294, 66247]
1237F6247m8m8m1m1m0m1l5l5n7n8o0o0k3k3k7k7m9n0p1p1p1p2o4o5m2m2m5m4m4m4l6k6k1m0
1233F4686m9m9n0n0o7o7o7o7n4n4n5n4m3m4m3m4m6m7k5k5n5p5o3o4n3n3n2n3o2o3o2o2l1l2
1229F2906l1l1o7o7o7o7o4o3o4o3n4n5n4n4n4n4n5n4n4n5n4n4n0n1n0n0o4o3o3o4p3p4p3p4
1225F0922p3p4p3p4l7l7l8l8l6n4o7o6o6o6o6o6q4q5q2q3n9l2m1n2n4n3p7p7q1q2n1m0m6o4
1221E8848p6p6o7o7o6o7n9n9n9n9o9p0p0p0o4o4o4o4o7o6o7o7o6p8q2o3l6l7m7o5o7o7o8o8
1216E6647q3q2q3q2q1q1q1q1n7n7l5l4m8m7p1p0o0o0m9o8r2r3p1p1o4o4o4o4o3o3o2o3o9o8
1212E4366o8o8o9o8o8o9p4p4p4p4p8p8p8p8n6n6l5l5n1p7r9r9o8m9n9n9p8p7p8p7o7o7o7o8
1208E2026o1o2o1o2o1o1o2o1p1p1p1p1o6o6o6o6p2p2p2p1n3n2n3n2p1p0r3r3r2r3p0o9o4o3
$$ y = [66247, 66199, 66151, 66110, 66069, 66029, 65988, 65953, 65918, 65861, 65803, 65743, 65683, 65660, 65637, 65610, 65583, 65534, 65484, 65413, 65342, 65271, 65199, 65135, 65070, 65028, 64986, 64941, 64897, 64853, 64809, 64773, 64747, 64726, 64686, 64637, 64588, 64538, 64488, 64421, 64354, 64287, 64220, 64166, 64112, 64057, 64003, 63960, 63916, 63873, 63829, 63783, 63736, 63711, 63686, 63631, 63556, 63493, 63429, 63376, 63323, 63271, 63218, 63156, 63093, 63031, 62969, 62938, 62906, 62875, 62844, 62777, 62710, 62643, 62576, 62512, 62449, 62385, 62322, 62268, 62213, 62159, 62105, 62051, 61997, 61942, 61888, 61834, 61779, 61725, 61671, 61621, 61570, 61520, 61470, 61406, 61343, 61280, 61216, 61143, 61069, 60996, 60922, 60849, 60775, 60702, 60628, 60591, 60554, 60516, 60478, 60442, 60388, 60321, 60255, 60189, 60123, 60057, 59991, 59907, 59822, 59740, 59657, 59598, 59566, 59525, 59473, 59419, 59366, 59289, 59212, 59131, 59049, 58998, 58958, 58912, 58848, 58772, 58696, 58629, 58562, 58496, 58429, 58370, 58311, 58252, 58193, 58124, 58054, 57984, 57914, 57850, 57786, 57722, 57658, 57591, 57525, 57458, 57391, 57325, 57247, 57165, 57102, 57066, 57029, 56982, 56917, 56850, 56783, 56715, 56647, 56564, 56482, 56399, 56317, 56236, 56155, 56074, 55993, 55936, 55879, 55844, 55810, 55762, 55715, 55644, 55574, 55514, 55454, 55405, 55337, 55245, 55152, 55081, 55010, 54946, 54882, 54818, 54754, 54691, 54628, 54566, 54503, 54434, 54366, 54298, 54230, 54161, 54093, 54025, 53956, 53882, 53808, 53734, 53660, 53582, 53504, 53426, 53348, 53292, 53236, 53201, 53166, 53115, 53038, 52939, 52840, 52772, 52723, 52664, 52605, 52527, 52450, 52372, 52295, 52228, 52161, 52094, 52026, 51965, 51903, 51842, 51780, 51719, 51658, 51596, 51535, 51464, 51393, 51322, 51251, 51185, 51119, 51053, 50987, 50915, 50843, 50771, 50700, 50647, 50595, 50542, 50490, 50419, 50349, 50256, 50163, 50071, 49978, 49908, 49839, 49775, 49712]
1204D9712o3o3n3n2n3n2m7m7m7m7p4p4o4q2j04j04q2q2p2p2m9m9o1o0o1o0o8o8o8o8o2o3o2
1200D7579o2o4o3o3o4o9o9o9o9q6q6q6q6p4p4n2n1n8n8n8n7p9p9o7m9l9n0o6o5n2n2o7p8p1
1196D5347n2m0m1m6m5l2n8r4j05j07r6p6p6o4m6m0n2o7o6o1o0o1o0n9n8q1q1m4m4m4m3n7n6
1192D3335n6n7o5o6o6o6o4o5o5o4p9q0p8p8p0n1k4k4m7m6p0o9p4p5n1n2n4n4n4n4o8o8l9k7
1188D1315l7o3p0p0p1p1p2p1n6n6n6n6n0n1n0n1n6n6p9p8r2r1o5m6l9n1o5o5m8l0l6m6p0q8
1183C9263r9j00q1o3m1l1m1m2m0m1m7m7m7m7q0p9p9p9m5m6m6m5n5n5n5n6m9n0n0n0m9n0n0
1179C7428n0p4p4p4p5n2n2n2n3n9o0l7l7m1m0m0m1m8m9m9m8o8o7o6o6m0k8m6o5o5n4l9l9n9
1175C5621o0n9n9m8m9m8m9n0n0n0n1k8k8n1n1o2o3o3o2l0l0l0l0m0m1o3o2p4p3p2p2n4l1j6
$$ y = [49712, 49649, 49586, 49533, 49481, 49428, 49376, 49329, 49282, 49235, 49188, 49114, 49040, 48976, 48894, 48790, 48686, 48604, 48522, 48450, 48378, 48329, 48280, 48219, 48159, 48098, 48038, 47970, 47902, 47834, 47766, 47704, 47641, 47579, 47517, 47453, 47390, 47327, 47263, 47194, 47125, 47056, 46987, 46901, 46815, 46729, 46643, 46569, 46495, 46443, 46392, 46334, 46276, 46218, 46161, 46082, 46003, 45936, 45887, 45848, 45798, 45732, 45667, 45615, 45563, 45496, 45418, 45347, 45295, 45255, 45214, 45168, 45123, 45091, 45033, 44939, 44834, 44727, 44631, 44555, 44479, 44415, 44369, 44329, 44277, 44210, 44144, 44083, 44023, 43962, 43902, 43843, 43785, 43704, 43623, 43579, 43535, 43491, 43448, 43391, 43335, 43279, 43222, 43157, 43091, 43025, 42959, 42895, 42830, 42765, 42701, 42622, 42542, 42464, 42386, 42316, 42265, 42241, 42217, 42170, 42124, 42054, 41985, 41911, 41836, 41785, 41733, 41679, 41625, 41571, 41517, 41449, 41381, 41342, 41315, 41278, 41215, 41145, 41075, 41004, 40933, 40861, 40790, 40734, 40678, 40622, 40566, 40516, 40465, 40415, 40364, 40308, 40252, 40173, 40095, 40003, 39912, 39847, 39801, 39762, 39711, 39646, 39581, 39533, 39503, 39467, 39421, 39351, 39263, 39164, 39064, 38983, 38920, 38879, 38848, 38807, 38765, 38725, 38684, 38637, 38590, 38543, 38496, 38416, 38337, 38258, 38179, 38134, 38088, 38042, 37997, 37942, 37887, 37832, 37776, 37727, 37677, 37627, 37577, 37528, 37478, 37428, 37378, 37304, 37230, 37156, 37081, 37029, 36977, 36925, 36872, 36813, 36753, 36716, 36679, 36638, 36598, 36558, 36517, 36469, 36420, 36371, 36323, 36255, 36188, 36122, 36056, 36016, 35988, 35942, 35877, 35812, 35758, 35719, 35680, 35621, 35561, 35502, 35443, 35395, 35346, 35298, 35249, 35199, 35149, 35099, 35048, 35020, 34992, 34941, 34890, 34828, 34765, 34702, 34640, 34610, 34580, 34550, 34520, 34480, 34439, 34376, 34314, 34240, 34167, 34095, 34023, 33969, 33938, 33922]
1171C3922k7m5n7n8m6k6k7k5k6k2k2m5m4p9p8q4p2n0k7l3m5m2m2m3m3o0o0o0o0m2m1m1m2l3
1167C2375l4l5l4n8q0q7q8o9l1j5j5k7k6m8m9n9n9q0q0o7m4l5l4m2m1m2m1m0l9m0l9o5o6m2
1163C0724m3m4m5m4m4m3m3m3m2l4l4l4l4m9m9m9n0n2n2l0l0l3l3l3l3m5m4m5m4n7n8l4l5m0
1159B9302m0l9m0l3l3l3l3m3m4m4m4m3m3k1k1m0m0m0m0l9l9l8l9k9k8k8k9n5n5n4n4n0l2k0
1154B7999j9j1j0k2m1n8n9n9n9o0n9n8n9m4k5j3j3k5k4k5k5n7n7n6n7p6o4k9j1j4k6m0m1l5
1150B6668l4l5l5j7j7j8j7l2l1n4n4n6n5l3l2k5k4o2o2n4n4l1l2k2k2k2k2k5k6k5k5k2k2m5
1146B5526m4m8m7m8m7k9k8k7k8k8j6j3l2n2o4n8n8l8l8j6j5rrrrj7j8k8m8o4n3l0j9l5n4n0
1142B4300l7l4l4l3l3k4k4k4k4l2l3l3l3l2l3k1k2k1k2mll3n2n3l3k7l7m8l6k7k6m4m5m8m7
$$ y = [33922, 33895, 33850, 33793, 33735, 33689, 33663, 33636, 33611, 33585, 33563, 33541, 33496, 33452, 33373, 33295, 33211, 33139, 33089, 33062, 33029, 32984, 32942, 32900, 32857, 32814, 32754, 32694, 32634, 32574, 32532, 32491, 32450, 32408, 32375, 32341, 32306, 32272, 32214, 32134, 32047, 31959, 31890, 31859, 31844, 31829, 31802, 31776, 31728, 31679, 31620, 31561, 31481, 31401, 31334, 31290, 31255, 31221, 31179, 31138, 31096, 31055, 31015, 30976, 30936, 30897, 30832, 30766, 30724, 30681, 30637, 30592, 30548, 30504, 30461, 30418, 30375, 30333, 30299, 30265, 30231, 30197, 30148, 30099, 30050, 30000, 29948, 29896, 29866, 29836, 29803, 29770, 29737, 29704, 29659, 29615, 29570, 29526, 29469, 29411, 29377, 29342, 29302, 29262, 29223, 29183, 29150, 29117, 29084, 29051, 29008, 28964, 28920, 28876, 28833, 28790, 28769, 28748, 28708, 28668, 28628, 28588, 28549, 28510, 28472, 28433, 28404, 28376, 28348, 28319, 28264, 28209, 28155, 28101, 28051, 28019, 27999, 27980, 27969, 27959, 27937, 27896, 27838, 27779, 27720, 27661, 27601, 27542, 27484, 27425, 27381, 27356, 27343, 27330, 27305, 27281, 27256, 27231, 27174, 27117, 27061, 27004, 26928, 26864, 26835, 26824, 26810, 26784, 26744, 26703, 26668, 26634, 26599, 26564, 26547, 26530, 26512, 26495, 26463, 26432, 26378, 26324, 26268, 26213, 26180, 26148, 26123, 26099, 26037, 25975, 25921, 25867, 25836, 25804, 25782, 25760, 25738, 25716, 25691, 25665, 25640, 25615, 25593, 25571, 25526, 25482, 25434, 25387, 25339, 25292, 25263, 25235, 25208, 25180, 25152, 25136, 25123, 25091, 25039, 24975, 24917, 24859, 24821, 24783, 24767, 24752, 24743, 24734, 24725, 24716, 24699, 24681, 24653, 24605, 24541, 24488, 24458, 24439, 24404, 24350, 24300, 24263, 24229, 24195, 24162, 24129, 24105, 24081, 24057, 24033, 24001, 23968, 23935, 23902, 23870, 23837, 23816, 23794, 23773, 23751, 23747, 23744, 23711, 23659, 23606, 23573, 23546, 23509, 23461, 23425, 23398, 23372, 23328, 23283, 23235, 23188]
1137B3188m8m8m0m0l9l9n1m0k9j1KJ3Lk2m7n8m2l1k2l4m5m4k7p%Jj8j8j8j9k6k6k7k6l6l6
1133B2193l6l6l7l7j8j9j5j4j7j6k8m6m4l2l8n0n2l4j6nmj5k7k7k8k8l7l7l8l7l6l6l6l6k6
1129B1155k7j5j6%jk0j9k5k6k6k6l9n0n5l6j9j9j8j8lllll5l5l4l5l8l9l6l7j7Llj3l2m4m4
1124B0249l2k7k7k5k6j3j2j3j2l7l7l7l7l0k9l0l0k0k1k0k0l0l1l0l0m2m2k4k3j9k0l8l9k4
1120A9322k4l6l6l3l4ppj6j5k7k7k3k3j2j2mlllk3k3m1m2l6l6j0j0j4j5j4j4l0k9m9m8k6k7
1115A8490j5j5j6j6k8k7j5j4j4j5j1j1oj8l3n1o0n9m3k5j6j6k8k7k8k7j4j4j4j4l0k9m1m1
1111A7659k0k1jknnnnmmmmk1k2k1k2k1k1k2k1l3l4l3l3m1m1m1m1j3j2QRj5l3l0j9j7k8m4m3
1106A6874l2l2l1l2j3j3j3j3lmmlj3j3j3j3j3j2l4l5k8k9oonmnmnok7k7j6n%k0k5k5k7k6j4
$$ y = [23188, 23140, 23092, 23052, 23012, 22973, 22934, 22883, 22843, 22814, 22803, 22805, 22818, 22821, 22799, 22752, 22694, 22652, 22621, 22599, 22565, 22520, 22476, 22449, 22442, 22442, 22443, 22425, 22407, 22389, 22370, 22344, 22318, 22291, 22265, 22229, 22193, 22157, 22121, 22084, 22047, 22029, 22010, 21995, 21981, 21964, 21948, 21920, 21874, 21830, 21798, 21760, 21710, 21658, 21624, 21608, 21603, 21599, 21584, 21557, 21530, 21502, 21474, 21437, 21400, 21362, 21325, 21289, 21253, 21217, 21181, 21155, 21128, 21113, 21097, 21097, 21096, 21076, 21057, 21032, 21006, 20980, 20954, 20915, 20865, 20810, 20774, 20755, 20736, 20718, 20700, 20697, 20694, 20691, 20688, 20653, 20618, 20584, 20549, 20511, 20472, 20436, 20399, 20382, 20385, 20382, 20369, 20337, 20293, 20249, 20217, 20190, 20163, 20138, 20112, 20099, 20087, 20074, 20062, 20025, 19988, 19951, 19914, 19884, 19855, 19825, 19795, 19775, 19754, 19734, 19714, 19684, 19653, 19623, 19593, 19551, 19509, 19485, 19462, 19443, 19423, 19385, 19346, 19322, 19298, 19262, 19226, 19193, 19159, 19152, 19145, 19129, 19114, 19087, 19060, 19037, 19014, 19002, 18990, 18986, 18983, 18980, 18977, 18954, 18931, 18890, 18848, 18812, 18776, 18766, 18756, 18742, 18727, 18713, 18699, 18669, 18640, 18591, 18543, 18517, 18490, 18475, 18460, 18444, 18428, 18400, 18373, 18358, 18344, 18330, 18315, 18304, 18293, 18287, 18269, 18236, 18185, 18125, 18066, 18023, 17998, 17982, 17966, 17938, 17911, 17883, 17856, 17842, 17828, 17814, 17800, 17770, 17741, 17700, 17659, 17639, 17618, 17617, 17615, 17610, 17605, 17600, 17595, 17591, 17587, 17583, 17579, 17558, 17536, 17515, 17493, 17472, 17451, 17429, 17408, 17375, 17341, 17308, 17275, 17234, 17193, 17152, 17111, 17098, 17086, 17094, 17103, 17088, 17055, 17025, 17006, 16989, 16961, 16917, 16874, 16842, 16810, 16779, 16747, 16734, 16721, 16708, 16695, 16692, 16688, 16684, 16681, 16668, 16655, 16642, 16629, 16616, 16604, 16570, 16535, 16507, 16478, 16472, 16466, 16461, 16457, 16452, 16448, 16443, 16437, 16410, 16383, 16367, 16362, 16362, 16342, 16317, 16292, 16265, 16239, 16225]
1101A6225j3j3j4k2k3k3k3k7k7k7k7l0l0qppppprrj0rl4l4l3l4j7j6j7j7j6j7j6j7k6k6k6
1097A5500k6k6k6k5k5oJ3Rlnmonl5l6l5l6k6k6mlKKl5l5j2j3j3j2l2l2l2l2l2l1rrj2j1j2
1092A4804j1l2l2pJ2Oj3l1m3m7l5k0k0rrrrONNOj9j9j8j9j3j3j3j4j3j4j3j4k3k3k3k3noo
1087A4226nk6k6k7k6k6k7k6k6j7j7j8j7PPOPpoj7l7l3k1k8k8k4nPPjkkjooooj5j5j5j5k1k1
1082A3645k1k0l2l2m2k4oonnl0k9l0l0ononpoook3k3k3k3k6k6k6k6j2j2J0J1J0J1j2j2j1j1
1077A3062j1j1rj0rrj4j4j3j4j5j6OOj3l2k1k2k4k4k3k4oonok0k0KKk3k4k3k4j7j7j7j7j8
1072A2507j7j7j7opoppqqqQRmk3k3k4k5k5rrrrlllmk2k2k3k2k1k1k1k1k0k1KKLLJ3nk8k8p
1066A1984oJ0J1kk0k7k7noj4j4j4j3j5j4j5j4k4k4k3k4OONOj1j1j1j1j0j0j0j0j0rj0j0qq
$$ y = [16225, 16212, 16199, 16185, 16163, 16140, 16117, 16094, 16067, 16040, 16013, 15986, 15956, 15926, 15918, 15911, 15904, 15897, 15890, 15883, 15874, 15865, 15855, 15846, 15812, 15778, 15745, 15711, 15694, 15678, 15661, 15644, 15628, 15611, 15595, 15578, 15552, 15526, 15500, 15474, 15448, 15422, 15397, 15372, 15366, 15379, 15388, 15385, 15380, 15376, 15370, 15365, 15330, 15294, 15259, 15223, 15197, 15171, 15167, 15164, 15166, 15168, 15133, 15098, 15086, 15073, 15060, 15048, 15016, 14984, 14952, 14920, 14888, 14857, 14848, 14839, 14827, 14816, 14804, 14793, 14761, 14729, 14722, 14734, 14740, 14727, 14696, 14653, 14606, 14571, 14551, 14531, 14522, 14513, 14504, 14495, 14501, 14506, 14511, 14517, 14498, 14479, 14461, 14442, 14429, 14416, 14403, 14389, 14376, 14362, 14349, 14335, 14312, 14289, 14266, 14243, 14238, 14232, 14226, 14221, 14195, 14169, 14142, 14116, 14090, 14063, 14037, 14011, 13994, 13977, 13959, 13942, 13949, 13956, 13962, 13969, 13962, 13956, 13939, 13902, 13869, 13848, 13820, 13792, 13768, 13763, 13770, 13777, 13776, 13774, 13772, 13771, 13765, 13759, 13753, 13747, 13732, 13717, 13702, 13687, 13666, 13645, 13624, 13604, 13572, 13540, 13498, 13474, 13468, 13462, 13457, 13452, 13422, 13393, 13363, 13333, 13327, 13322, 13316, 13311, 13304, 13298, 13292, 13286, 13263, 13240, 13217, 13194, 13168, 13142, 13116, 13090, 13078, 13066, 13076, 13087, 13097, 13108, 13096, 13084, 13073, 13062, 13051, 13040, 13031, 13021, 13012, 13003, 12989, 12975, 12962, 12948, 12933, 12917, 12923, 12929, 12916, 12884, 12863, 12841, 12817, 12793, 12770, 12746, 12740, 12734, 12729, 12723, 12703, 12683, 12685, 12687, 12664, 12640, 12617, 12593, 12576, 12559, 12542, 12525, 12507, 12490, 12473, 12456, 12450, 12443, 12437, 12430, 12423, 12415, 12407, 12399, 12407, 12416, 12412, 12389, 12366, 12342, 12317, 12292, 12283, 12274, 12265, 12256, 12253, 12250, 12247, 12243, 12221, 12199, 12176, 12154, 12133, 12112, 12091, 12070, 12050, 12029, 12031, 12033, 12036, 12039, 12052, 12047, 12019, 11991, 11984, 11978, 11988, 11999, 11997, 11977, 11950, 11923, 11918, 11912, 11898, 11884, 11870, 11857, 11842, 11828, 11813, 11799, 11775, 11751, 11728, 11704, 11710, 11716, 11721, 11727, 11716, 11705, 11694, 11683, 11673, 11663, 11653, 11643, 11633, 11624, 11614, 11604, 11596, 11588]
1062A1588qqONpk5l5k4j0rj2j2j1j2k4k4j2PJ3J4qrj6j7j7j6j8j8j8j9k6k7k6k7ONNOopop
1057A1134j5k6l1j1NOk0l8l5k4rrlllmppqpQQQQklk5k5l3l3j0j1J1J0J5Mj7m4l6k4j6j5j5
1051A0648j5RJ0RJ0mlnnl0m9m3l2j6LJ5J6PQJ7kk8l9k3lmmk6k5k8k7j6j6oonoQPQQj1j1j1
1046A0284j1j1j1j1j1k4k4k4k4k0j9LKLLJKKj7k8k8mJ5J0jrj0KJrqOJ8Nj3k4k5j5j6j5j5L
1041I933LLLqpj9j9j2j3LJ3Nj4k5k6llQQJ7J8nok2k2k3k2j6j6PPPQj6j5mmPPMLMLPOj6j6j7
1035I715j6POpqppj6j5j5j5j7j6j6j6j0j1j0j1j1j1j1j1j5j6j5j5l3l4j1j0j8j8j8j8nnnn
1030I230MNMMNNNMnnonk1k0l3l2j8j9MNj1j1k1k1MK3J8Pnnonj6j5j5j5j7j7j7j7k3k2k3k3
1025H858%%kjj5l3l0j7lkkjkjkkQPQPnonoj0j0j0rRRJ0Rjjk4k4l9l9j2OK0Rk1k1mlmmoopo
$$ y = [11588, 11580, 11572, 11578, 11583, 11576, 11551, 11516, 11492, 11482, 11473, 11461, 11449, 11438, 11426, 11402, 11378, 11366, 11373, 11386, 11400, 11392, 11383, 11367, 11350, 11333, 11317, 11299, 11281, 11263, 11244, 11218, 11191, 11165, 11138, 11144, 11149, 11154, 11160, 11154, 11147, 11141, 11134, 11119, 11093, 11062, 11051, 11056, 11062, 11042, 11004, 10969, 10945, 10936, 10927, 10924, 10921, 10918, 10914, 10907, 10900, 10892, 10885, 10893, 10901, 10909, 10917, 10915, 10912, 10887, 10862, 10829, 10796, 10786, 10775, 10786, 10796, 10811, 10815, 10798, 10754, 10718, 10694, 10678, 10663, 10648, 10633, 10642, 10652, 10661, 10671, 10667, 10664, 10659, 10654, 10624, 10575, 10532, 10500, 10484, 10487, 10502, 10518, 10525, 10533, 10550, 10548, 10520, 10481, 10458, 10455, 10451, 10447, 10421, 10396, 10368, 10341, 10325, 10309, 10303, 10297, 10292, 10286, 10294, 10301, 10309, 10317, 10306, 10295, 10284, 10273, 10262, 10251, 10240, 10229, 10205, 10181, 10157, 10133, 10113, 10094, 10097, 10099, 10102, 10105, 10106, 10108, 10110, 10093, 10065, 10037, 10033, 10048, 10058, 10057, 10048, 10038, 10040, 10041, 10032, 10024, 10030, 10048, 10053, 10040, 10016, 9991, 9976, 9960, 9945, 9930, 9933, 9936, 9939, 9942, 9934, 9927, 9908, 9889, 9877, 9864, 9867, 9880, 9885, 9871, 9846, 9820, 9817, 9814, 9822, 9830, 9847, 9865, 9860, 9854, 9832, 9810, 9787, 9765, 9749, 9733, 9740, 9747, 9754, 9762, 9746, 9731, 9727, 9723, 9730, 9737, 9741, 9744, 9748, 9751, 9758, 9764, 9748, 9732, 9715, 9699, 9706, 9712, 9705, 9697, 9690, 9683, 9667, 9652, 9637, 9622, 9605, 9589, 9573, 9557, 9547, 9536, 9526, 9515, 9504, 9493, 9482, 9471, 9456, 9440, 9425, 9410, 9377, 9343, 9332, 9322, 9304, 9286, 9268, 9250, 9245, 9240, 9235, 9230, 9234, 9239, 9243, 9247, 9252, 9257, 9262, 9266, 9261, 9256, 9250, 9245, 9224, 9204, 9171, 9139, 9121, 9102, 9106, 9111, 9100, 9089, 9068, 9047, 9051, 9074, 9092, 9099, 9094, 9089, 9083, 9078, 9062, 9047, 9032, 9017, 9000, 8983, 8966, 8949, 8926, 8904, 8881, 8858, 8858, 8858, 8856, 8855, 8840, 8807, 8777, 8760, 8757, 8755, 8753, 8752, 8750, 8749, 8747, 8745, 8753, 8760, 8768, 8775, 8770, 8764, 8759, 8753, 8743, 8733, 8723, 8714, 8723, 8732, 8742, 8751, 8750, 8749, 8725, 8701, 8662, 8623, 8611, 8617, 8637, 8646, 8625, 8604, 8600, 8597, 8593, 8589, 8583, 8577, 8570, 8564]
1018H564j5j5j4j5onNOPQl0l0rrrrj3j3kkK1K0Rj0j4j4j6j5j6j5j5j5KK1K0Jk3l5k9k9k9k9
1013H184k2NK9K9J7jj7k8k3k3k0k1l0j1OJ8K2Lj2k3k4j3J0J0J1J1mnk7k8rrJ3J2J5lk4l4k6
1008G958j4KJ%jRJ0Pj3l0k0MMj1k2j4MJ6J6onnnj0rrj0j7j7j6j6qJ0K2K2Jj7j8j8kkkkjkk
1003G762kppm4m4k7qMMqrqrooJ6J6J1J1j0j0mJ4K2J0k3k4kkRJ0jjppj7j8k7k7mmlmk4k5j7
997G443KK0Qrk0j4j4jj%jopooJ4J4J5J4j4j4j4j3kjlkqk6l8l9j4j4j5j4onon%JJ2J2POk4l5
991G171k0kNpj5j6mnJ8J8Oj2j8j8qpj6j5PPJ1J1J0J1ONj7j7j9k0j9j8j6MJ5J5LMMLj2j2j2
986G009j2opopqrrrrrrqj1j0j1j0KLLKoopoopopk7k7k7k7k1j0nJ4L0K9RQj3j3k5k4k3k3j%
980F642nnonNOooj8j8MNQQQQkkk3k3k0kjjqrLLPOOPj3j2k4k4jjk4k3k5k4kkJ5J4J4J5rqrr
$$ y = [8564, 8549, 8534, 8520, 8505, 8499, 8494, 8499, 8505, 8512, 8520, 8490, 8460, 8451, 8442, 8433, 8424, 8411, 8398, 8396, 8394, 8415, 8435, 8444, 8434, 8420, 8406, 8390, 8375, 8359, 8344, 8329, 8314, 8316, 8337, 8357, 8358, 8335, 8300, 8271, 8242, 8213, 8184, 8162, 8167, 8196, 8225, 8242, 8241, 8224, 8196, 8173, 8150, 8130, 8109, 8079, 8068, 8074, 8092, 8114, 8117, 8105, 8082, 8058, 8045, 8055, 8065, 8076, 8087, 8083, 8078, 8051, 8023, 8014, 8005, 8018, 8030, 8045, 8042, 8018, 7984, 7958, 7944, 7946, 7947, 7947, 7946, 7955, 7965, 7972, 7959, 7929, 7909, 7913, 7917, 7906, 7884, 7870, 7874, 7890, 7906, 7900, 7895, 7890, 7885, 7875, 7866, 7857, 7847, 7830, 7813, 7797, 7781, 7773, 7783, 7805, 7827, 7828, 7811, 7793, 7775, 7773, 7771, 7769, 7767, 7766, 7764, 7762, 7760, 7753, 7746, 7702, 7658, 7631, 7623, 7627, 7631, 7623, 7614, 7606, 7597, 7591, 7585, 7601, 7617, 7628, 7639, 7629, 7619, 7615, 7629, 7651, 7661, 7638, 7614, 7612, 7610, 7619, 7629, 7628, 7627, 7620, 7613, 7596, 7578, 7551, 7524, 7520, 7516, 7513, 7509, 7485, 7460, 7443, 7445, 7465, 7473, 7464, 7444, 7430, 7416, 7415, 7414, 7414, 7413, 7407, 7400, 7394, 7388, 7402, 7416, 7431, 7445, 7431, 7417, 7403, 7390, 7388, 7387, 7384, 7382, 7374, 7348, 7310, 7271, 7257, 7243, 7228, 7214, 7208, 7203, 7197, 7192, 7192, 7193, 7205, 7217, 7224, 7230, 7206, 7171, 7151, 7149, 7154, 7147, 7132, 7116, 7112, 7107, 7125, 7143, 7149, 7137, 7119, 7101, 7093, 7086, 7070, 7055, 7062, 7069, 7080, 7091, 7101, 7112, 7118, 7123, 7106, 7089, 7070, 7050, 7031, 7013, 6997, 7001, 7016, 7031, 7034, 7038, 7042, 7045, 7033, 7021, 7009, 6997, 6991, 6984, 6978, 6971, 6963, 6954, 6945, 6936, 6927, 6918, 6909, 6901, 6890, 6880, 6869, 6859, 6861, 6864, 6867, 6869, 6863, 6857, 6850, 6844, 6838, 6831, 6825, 6818, 6791, 6764, 6737, 6710, 6689, 6679, 6674, 6688, 6718, 6747, 6756, 6764, 6751, 6738, 6713, 6689, 6666, 6643, 6642, 6642, 6637, 6632, 6626, 6621, 6626, 6632, 6626, 6620, 6602, 6584, 6588, 6593, 6601, 6609, 6617, 6625, 6623, 6621, 6598, 6575, 6555, 6553, 6552, 6551, 6543, 6534, 6537, 6540, 6547, 6553, 6559, 6566, 6553, 6541, 6517, 6493, 6492, 6491, 6467, 6444, 6419, 6395, 6393, 6391, 6406, 6420, 6434, 6449, 6440, 6432, 6423, 6414]
974F414kjkkkjkkmnmmj4j3j4j4RQRRJ6J6j1l0k9k9j8j9NMNMkkjkj5j5j5j5onnnj3j4j3j3k3
968F113k3j%MMJ5J6K6K5J5J4J4J4Kj7k6k7j6LPnk0j9k7k7k7k7j1j1k2k2ppJ5J6J4J4LL%j%
963E994%k0j9k0j9j8j9J9J9J5J5qqJ3J3Jj8j9j9k0k0j3j2LJ4J1qj4kJ7J7nnopJ5J6MMj9j9
958E853j0j0j1j0mmmmononj%k3k3k3k4j1QJ8J8llj3j2jkJ%%JrqqrMNJ4mk9k8nJ5K1Kk4k3j1
952E584j1j1j0pppoJ0J0J0J0opopjjjjj7j7j7j7mmmmj2j2j1j2J2J3J2J3MMLLj4l2l2j3jRJ1
946E396jj4j4j5j5NNMNqrqrnoonMLMMNMNNj0j0OJ6J9%k6k6j1j0j0j1jkkjPQQQkjkjKKk1k1
940E242k2k2k3k2QQQPj5k7l1j2NNOOpqppqpppPQOPkj4j8%J7J7J8J8J2J3j1j0ook1l3k9j0K
934E028JJ1J1J2J1J6J5opj8j8j7j7j2OL1L1J9ql1l0j1j0j0j0J2J2Jj9k1j1MNNNK6K7K0Jj8
$$ y = [6414, 6412, 6411, 6409, 6407, 6405, 6404, 6402, 6400, 6396, 6391, 6387, 6383, 6369, 6356, 6342, 6328, 6337, 6345, 6354, 6363, 6379, 6395, 6384, 6354, 6325, 6296, 6278, 6259, 6264, 6268, 6273, 6277, 6275, 6273, 6272, 6270, 6255, 6240, 6225, 6210, 6204, 6199, 6194, 6189, 6176, 6162, 6149, 6136, 6113, 6090, 6089, 6089, 6093, 6097, 6112, 6128, 6154, 6179, 6194, 6208, 6222, 6236, 6238, 6221, 6195, 6168, 6152, 6155, 6162, 6157, 6137, 6118, 6091, 6064, 6037, 6010, 5999, 5988, 5966, 5944, 5937, 5930, 5945, 5961, 5975, 5989, 5992, 5995, 5995, 5994, 5994, 5994, 5974, 5955, 5935, 5916, 5898, 5879, 5898, 5917, 5932, 5947, 5939, 5931, 5944, 5957, 5958, 5940, 5921, 5902, 5882, 5862, 5849, 5837, 5840, 5854, 5865, 5857, 5843, 5841, 5858, 5875, 5870, 5865, 5859, 5852, 5867, 5883, 5887, 5891, 5872, 5853, 5843, 5833, 5822, 5812, 5808, 5804, 5800, 5796, 5790, 5785, 5779, 5774, 5773, 5773, 5750, 5727, 5704, 5680, 5669, 5677, 5695, 5713, 5710, 5707, 5694, 5682, 5681, 5679, 5680, 5680, 5680, 5681, 5672, 5664, 5656, 5647, 5651, 5656, 5670, 5666, 5637, 5609, 5604, 5619, 5640, 5642, 5618, 5595, 5584, 5573, 5562, 5552, 5545, 5538, 5531, 5525, 5535, 5545, 5555, 5565, 5559, 5552, 5546, 5539, 5538, 5537, 5536, 5535, 5518, 5501, 5484, 5467, 5463, 5459, 5455, 5451, 5439, 5427, 5416, 5404, 5416, 5429, 5441, 5454, 5458, 5462, 5465, 5468, 5454, 5422, 5390, 5377, 5376, 5385, 5396, 5395, 5381, 5367, 5352, 5337, 5342, 5347, 5351, 5356, 5348, 5339, 5331, 5322, 5317, 5311, 5305, 5300, 5304, 5307, 5311, 5315, 5320, 5324, 5329, 5334, 5324, 5314, 5320, 5336, 5355, 5355, 5329, 5303, 5292, 5282, 5272, 5261, 5260, 5258, 5256, 5255, 5262, 5270, 5278, 5286, 5284, 5283, 5281, 5280, 5282, 5284, 5263, 5242, 5220, 5198, 5175, 5153, 5161, 5169, 5177, 5184, 5169, 5142, 5111, 5099, 5104, 5109, 5115, 5121, 5114, 5106, 5099, 5092, 5084, 5077, 5070, 5063, 5070, 5078, 5084, 5091, 5089, 5075, 5057, 5057, 5074, 5091, 5109, 5127, 5139, 5152, 5141, 5131, 5125, 5119, 5098, 5065, 5036, 5026, 5028, 5029, 5040, 5051, 5063, 5074, 5090, 5105, 5099, 5092, 5074, 5056, 5039, 5022, 5010, 5016, 5047, 5078, 5097, 5089, 5058, 5028, 5017, 5007, 4997, 4987, 4999, 5011, 5012, 4993, 4972, 4961, 4965, 4970, 4975, 4980, 5006, 5033, 5053, 5054, 5036]
929E036l0m2l1oM%%J%K3K3K3K3PQj5j5nmnnk6k7k7k6j0rj0rK8K9K8K9J9K0llonj6l5m1k2j2
924D856j1lmlmmmmnnonoLLj2k4qJ0OnqLJ7J7Lk3l7k5j6mJ3J3rrKK1K5J2ok6l3l2k2mONPPj
918D661kjjppopjjjjKKKLKKKK%%%JQQQQonk8k9KJKJqqrqqqrqj1j0j0j1j0j1j0j0jj%jJ3J3
911D488J2J3mmmmj0j0l1l1k2lJ6K8K0Qqpj3j2j2j3RQj2j3J5M0M1J5j7j8j8j9k1k0k0k0pqp
906D325pRQRRQRQRrqqrppopk8k7mnJ0J0K0Jj8j8j9j9j4j4j3j4pqooj2OL3L2J4ol3l2k6k5J1
900D109J2KJKJqqqqrj0J3J3J3J4j0rk2k1k1k2MLLLK3K4Jk5l1k1j2jJ4J5J5J6qqpqk0k1k0k1
894C942QQPQmlmlmlmlLLLLQPL0L0LMLMK4K4M7M6M5M5M3M4K2MppJ5L4M5M6L0L1K9L0L3K3Kj6
888D678k5j3nPQQJ0J0L2N1M5L5J8PJ3J3J2J3L5L5K3K3K3K3J2J1J2J1M3M3M3M4J8J9J9J8J3
$$ y = [5036, 5006, 4964, 4933, 4927, 4931, 4931, 4931, 4932, 4932, 4955, 4978, 5001, 5024, 5031, 5039, 5024, 5009, 5004, 5000, 4995, 4990, 4964, 4937, 4910, 4884, 4874, 4865, 4855, 4846, 4874, 4903, 4931, 4960, 4979, 4999, 4996, 4993, 4987, 4982, 4966, 4931, 4890, 4868, 4856, 4845, 4842, 4838, 4835, 4831, 4827, 4823, 4819, 4814, 4809, 4803, 4798, 4792, 4795, 4798, 4786, 4762, 4754, 4764, 4770, 4765, 4757, 4760, 4777, 4794, 4797, 4774, 4737, 4712, 4696, 4692, 4705, 4718, 4709, 4700, 4702, 4723, 4748, 4760, 4754, 4728, 4695, 4663, 4641, 4637, 4643, 4648, 4655, 4662, 4661, 4659, 4658, 4657, 4650, 4643, 4637, 4630, 4629, 4628, 4627, 4626, 4628, 4630, 4632, 4635, 4637, 4639, 4641, 4643, 4643, 4643, 4643, 4644, 4652, 4660, 4668, 4676, 4670, 4665, 4637, 4608, 4610, 4611, 4613, 4614, 4606, 4598, 4589, 4581, 4573, 4565, 4556, 4548, 4537, 4527, 4517, 4506, 4496, 4485, 4475, 4465, 4464, 4463, 4463, 4462, 4475, 4488, 4500, 4513, 4509, 4505, 4501, 4497, 4487, 4477, 4446, 4415, 4393, 4390, 4406, 4434, 4454, 4462, 4454, 4447, 4434, 4422, 4410, 4397, 4406, 4414, 4402, 4389, 4404, 4444, 4485, 4500, 4483, 4465, 4447, 4428, 4407, 4387, 4367, 4347, 4340, 4332, 4325, 4318, 4327, 4335, 4344, 4353, 4361, 4370, 4378, 4387, 4378, 4370, 4362, 4353, 4346, 4339, 4333, 4326, 4298, 4271, 4267, 4262, 4272, 4282, 4302, 4303, 4285, 4267, 4248, 4229, 4215, 4201, 4188, 4174, 4167, 4159, 4153, 4147, 4135, 4141, 4174, 4206, 4220, 4214, 4181, 4149, 4123, 4098, 4109, 4121, 4123, 4124, 4126, 4127, 4119, 4111, 4103, 4095, 4086, 4076, 4089, 4102, 4115, 4129, 4119, 4110, 4088, 4067, 4046, 4024, 4028, 4031, 4034, 4037, 4060, 4084, 4085, 4060, 4029, 4008, 3996, 3995, 4009, 4024, 4039, 4055, 4047, 4039, 4032, 4024, 4004, 3983, 3963, 3942, 3950, 3958, 3965, 3973, 3969, 3966, 3962, 3959, 3955, 3952, 3948, 3945, 3948, 3951, 3954, 3957, 3965, 3972, 4002, 4032, 4035, 4039, 4042, 4046, 4070, 4094, 4141, 4187, 4232, 4277, 4320, 4364, 4386, 4390, 4383, 4376, 4391, 4425, 4470, 4516, 4546, 4577, 4606, 4636, 4669, 4692, 4694, 4678, 4653, 4640, 4635, 4642, 4650, 4658, 4668, 4678, 4710, 4761, 4806, 4841, 4859, 4866, 4879, 4892, 4904, 4917, 4952, 4987, 5010, 5033, 5056, 5079, 5091, 5102, 5114, 5125, 5168, 5211, 5254, 5298, 5316, 5335, 5354, 5372, 5385]
884E385J2J3J2J8J8Rj7l7m9n4l5k0k0j9j9m9m9m9m9k5k4k5k5k7k7k7k7m3m3o5o5n3n3n3n3
880D366m8m7l6j8mj6l5n3n8n7n7n7m0k1k5l7k8k7k9k8n5n5m2k3j4kppj1j1j1j1k4k4j3OJj8
875C324k8k8j6j5j5j6j7j7j7j6onmnK1L2J8qj2j2j3j4popoqqqqLLk0j9l7l6l6l5k6j3NK4K1
870B907oj7oRK1J5J5j1j2j1j1rrl1l1rrrrjj%jjjj5k7k5pNNNNONRQRRk3k3k3k3OOPOJ1J0j5
863B703l5l8k7j8pQK0J2J2%k5l4l3j6j6NOLj6k8k8j4j5j4j5oNJ3j2l0k9l1l1lkllJ0J0j3j2
858B253j0j0rj0kjkjj8j8j8j8j5j6j5j6j3j4J7K8Nj4kknmmmj0j0j0j0J0RRRj9l0l4j5RK1J6
853B007J5J0RRRMMqk7k8k7ooJ5J4rq%%%%j3j4j4j3j4j4j3j4mlmmMLj9j9jkjjK6K6K5K6j4j4
847A892j4j4j5j5j5j6mlj9l1k8rJ6J7J4J4L6L7LLLLppJ6J5K0K0K0K0K4K4K4K4K0K0K0J9J2
$$ y = [5385, 5397, 5410, 5422, 5440, 5458, 5467, 5450, 5413, 5364, 5310, 5275, 5255, 5235, 5216, 5197, 5148, 5099, 5050, 5001, 4976, 4952, 4927, 4902, 4875, 4848, 4821, 4794, 4751, 4708, 4643, 4578, 4525, 4472, 4419, 4366, 4318, 4271, 4235, 4217, 4213, 4197, 4162, 4109, 4051, 3994, 3937, 3880, 3840, 3819, 3794, 3757, 3729, 3702, 3673, 3645, 3590, 3535, 3493, 3470, 3456, 3454, 3447, 3440, 3429, 3418, 3407, 3396, 3372, 3348, 3335, 3341, 3342, 3324, 3296, 3268, 3252, 3237, 3222, 3206, 3189, 3172, 3155, 3139, 3133, 3128, 3124, 3119, 3140, 3172, 3190, 3182, 3170, 3158, 3145, 3131, 3124, 3118, 3111, 3105, 3097, 3089, 3081, 3073, 3076, 3079, 3059, 3040, 3003, 2967, 2931, 2896, 2870, 2857, 2862, 2886, 2907, 2901, 2884, 2878, 2887, 2908, 2923, 2938, 2927, 2915, 2904, 2893, 2884, 2875, 2844, 2813, 2804, 2795, 2786, 2777, 2776, 2775, 2775, 2774, 2773, 2772, 2757, 2730, 2705, 2698, 2703, 2708, 2713, 2718, 2724, 2729, 2738, 2746, 2755, 2764, 2741, 2718, 2695, 2672, 2678, 2684, 2691, 2697, 2708, 2718, 2703, 2668, 2630, 2603, 2585, 2578, 2586, 2606, 2618, 2630, 2630, 2605, 2571, 2538, 2522, 2506, 2511, 2517, 2520, 2504, 2476, 2448, 2434, 2419, 2405, 2390, 2384, 2389, 2402, 2390, 2360, 2331, 2300, 2269, 2266, 2264, 2261, 2258, 2268, 2278, 2265, 2253, 2243, 2233, 2224, 2214, 2212, 2211, 2209, 2208, 2190, 2172, 2154, 2136, 2121, 2105, 2090, 2074, 2061, 2047, 2064, 2092, 2097, 2083, 2081, 2079, 2074, 2070, 2066, 2062, 2052, 2042, 2032, 2022, 2032, 2041, 2050, 2059, 2040, 2010, 1976, 1961, 1970, 1991, 2007, 2022, 2032, 2041, 2050, 2059, 2063, 2067, 2059, 2032, 2004, 1977, 1971, 1965, 1980, 1994, 1985, 1977, 1977, 1977, 1977, 1977, 1964, 1950, 1936, 1923, 1909, 1895, 1882, 1868, 1864, 1861, 1857, 1853, 1857, 1860, 1841, 1822, 1821, 1819, 1818, 1817, 1843, 1869, 1894, 1920, 1906, 1892, 1878, 1864, 1849, 1834, 1819, 1803, 1799, 1796, 1777, 1746, 1718, 1709, 1725, 1742, 1756, 1770, 1806, 1843, 1846, 1849, 1852, 1855, 1848, 1841, 1857, 1872, 1892, 1912, 1932, 1952, 1976, 2000, 2024, 2048, 2068, 2088, 2108, 2127, 2139]
843B139J2L4L4L8L8L9L8N2N1N2N2N9N8L7L6L1L0L1L1O1O1O1O1P1P0P0P0R8R9R8R8J07J07J09
839D133J08J19J41J71J93K09K47K85L06L53L90M32M70M89N01N07M85M49M27L97L74L49L27
836A1862L02K65K13J44P2Mo2j30j63j63j52j41j29r2n7l5l1rM3R6J25J48J81K19K40K63K87
832A3300L10L47L85M16M52M98N36N79O16O38O61O76O87O99P10P14P14P16P15P02P12P33P55
830B7271P76P98Q45Q97R77J052J135J211J294J400J532J696J902K157K469K874L343L900M494
827F2023N110N736O291O720O975P028O984O838O584O265N919N606N471N496N660N901O126
825A66733O268O432O672P047P397P562P515P350P102O817O446O072N820N776N916O202O449
823B79576O555O415O221O168O334O578O623O411O037N598N073M473L857L291K884K565K250
$$ y = [2139, 2151, 2185, 2219, 2257, 2295, 2334, 2372, 2424, 2475, 2527, 2579, 2638, 2696, 2733, 2769, 2800, 2830, 2861, 2892, 2953, 3014, 3075, 3136, 3207, 3277, 3347, 3417, 3515, 3614, 3712, 3810, 3917, 4024, 4133, 4241, 4360, 4501, 4672, 4865, 5074, 5321, 5606, 5912, 6265, 6655, 7087, 7557, 8046, 8547, 9054, 9539, 9988, 10415, 10812, 11186, 11535, 11862, 12164, 12429, 12642, 12786, 12858, 12862, 12800, 12670, 12507, 12344, 12192, 12051, 11922, 11830, 11773, 11738, 11707, 11698, 11741, 11837, 11962, 12110, 12291, 12510, 12750, 13013, 13300, 13610, 13957, 14342, 14758, 15210, 15708, 16244, 16823, 17439, 18077, 18738, 19414, 20101, 20800, 21510, 22224, 22938, 23654, 24369, 25071, 25783, 26516, 27271, 28047, 28845, 29690, 30587, 31564, 32616, 33751, 34962, 36256, 37656, 39188, 40884, 42786, 44943, 47412, 50286, 53629, 57529, 62023, 67133, 72869, 79160, 85880, 92855, 99883, 106867, 113705, 120289, 126554, 132473, 138079, 143550, 149046, 154706, 160607, 166733, 173001, 179433, 186105, 193152, 200549, 208111, 215626, 222976, 230078, 236895, 243341, 249413, 255233, 261009, 266925, 273127, 279576, 286131, 292546, 298767, 304935, 311269, 317847, 324470, 330881, 336918, 342516, 347589, 352062, 355919, 359210, 362094, 364659, 366909]
821C66909J673O36q27k465l826m682n119n403n633n769n699n444n111m764m385l950l555l300
819B99286l341l776m643n680o609p195p462p566p600p555p340o995o593o158n718n313m986
817A94756m791m823n108n668o314o907p313p518p564p475p250o942o507n989n434m871m345
815H9937l878l472l156k870k633k436k247k081j941j805j729j660j584j516j464j426j387
813E2652j335j286j233j175j122j099j077j059j007r61r07q58q20q12q13q00p76p40p18o89
810C3365o66o48o47o43o44o24n88n53n31n00n00m99m98m73m73m46m24m02l80l69l68l57l56
807B1776l55l55l31l09k97k74k70k69k69k68k36k36k36k36k33k33k10k10k00k00j77j78j75
805A6019j75j75j76j62j62j39j40j16j16j15j16j19j19j18j19j16j16r4r4q3q3q3q4p8p9j01
$$ y = [366909, 368582, 369218, 368391, 365926, 362100, 357418, 352299, 346896, 341263, 335494, 329795, 324351, 319240, 314476, 310091, 306141, 302586, 299286, 295945, 292169, 287526, 281846, 275237, 268042, 260580, 253014, 245414, 237859, 230519, 223524, 216931, 210773, 205055, 199742, 194756, 189965, 185142, 180034, 174366, 168052, 161145, 153832, 146314, 138750, 131275, 124025, 117083, 110576, 104587, 99153, 94282, 89937, 86059, 82587, 79431, 76561, 73928, 71492, 69245, 67164, 65223, 63418, 61689, 60029, 58445, 56929, 55465, 54039, 52652, 51317, 50031, 48798, 47623, 46501, 45402, 44325, 43266, 42259, 41298, 40391, 39533, 38713, 37901, 37088, 36288, 35512, 34772, 34054, 33365, 32699, 32051, 31404, 30761, 30117, 29493, 28905, 28352, 27821, 27321, 26821, 26322, 25824, 25351, 24878, 24432, 24008, 23606, 23226, 22857, 22489, 22132, 21776, 21421, 21066, 20735, 20426, 20129, 19855, 19585, 19316, 19047, 18779, 18543, 18307, 18071, 17835, 17602, 17369, 17159, 16949, 16749, 16549, 16372, 16194, 16019, 15844, 15669, 15493, 15331, 15169, 15030, 14890, 14774, 14658, 14543, 14427, 14308, 14189, 14071, 13952, 13836, 13720, 13626, 13532, 13449, 13366, 13283, 13199, 13121, 13042, 12941]
801A2941j01q9q8q9q8q0p9q0q0p4p4p4p4o8o8o7o7n3l2m3m4m7m7p0r2r3p0m7m7k3k2k3k3m1
797A0784m1m1m2l2l3l3l2n0m9o1o1n3n3l4l4m5m5m6m5m0m0m0m0k7k7k7k6m5m5m4m5l5l5l5
793I403l5l3l2l2l1l0j0J0kl0n8n7l1j0JKj0k6m5n3m2j4j5l2l3l2l3k1k2l1l1l4m6m2k2pp
789H427nnJ3J3nk5k4k5l2l1l2l2j8j8j9j8j8j9j8j9k9l0l0l0qqqqj7j7%Jj3k4k9rj%k6k5l4
784G745l3k5pMMNMpppprqqrqqrqk3k2k3k2llk1k2ooooj6j7j6j7LLLMk6k6k6k5j%j2j1k2k1
778G216llqrrql8l9l0j1qqj8j8j3j2kjpqk6k6k5k4k5k4j0j1j0j0NOk1k0l2l1j3j3PPPPj8j9
772F644j8j8nnnn%%j%k5l7m0k2KKKKj5l3k9j7pNkj%jj%mmnmk1k1k1k1NONOmmlmLLKLK2K1J0
766F340j0k0j9JJLKk0k0k2k3J6J6J7J7J8J7K5K5K6K5K5K5K5K5M5M5M5M5L2L2L1L2K5K5K4K5
$$ y = [12941, 12840, 12751, 12663, 12574, 12486, 12406, 12327, 12247, 12167, 12093, 12019, 11945, 11871, 11803, 11735, 11668, 11601, 11548, 11516, 11473, 11429, 11382, 11335, 11265, 11173, 11080, 11010, 10963, 10916, 10893, 10871, 10848, 10825, 10784, 10743, 10702, 10660, 10628, 10595, 10562, 10530, 10480, 10431, 10370, 10309, 10256, 10203, 10169, 10135, 10090, 10045, 9999, 9954, 9914, 9874, 9834, 9794, 9767, 9740, 9713, 9687, 9642, 9597, 9553, 9508, 9473, 9438, 9403, 9368, 9335, 9303, 9271, 9240, 9210, 9200, 9210, 9208, 9178, 9120, 9063, 9032, 9022, 9023, 9025, 9015, 8989, 8944, 8891, 8849, 8835, 8820, 8788, 8755, 8723, 8690, 8669, 8647, 8616, 8585, 8551, 8505, 8463, 8441, 8434, 8427, 8422, 8417, 8430, 8443, 8438, 8413, 8389, 8364, 8332, 8301, 8269, 8237, 8219, 8201, 8182, 8164, 8146, 8127, 8109, 8090, 8061, 8031, 8001, 7971, 7963, 7955, 7947, 7939, 7922, 7905, 7905, 7906, 7893, 7869, 7840, 7831, 7830, 7830, 7804, 7779, 7745, 7712, 7687, 7680, 7684, 7688, 7693, 7697, 7690, 7683, 7676, 7669, 7660, 7652, 7644, 7635, 7627, 7619, 7610, 7602, 7579, 7557, 7534, 7512, 7509, 7506, 7485, 7463, 7457, 7451, 7445, 7439, 7423, 7406, 7390, 7373, 7376, 7379, 7382, 7386, 7360, 7334, 7308, 7283, 7282, 7282, 7270, 7259, 7237, 7216, 7213, 7210, 7202, 7193, 7184, 7176, 7138, 7099, 7069, 7058, 7050, 7042, 7024, 7006, 6993, 6981, 6979, 6978, 6971, 6963, 6937, 6911, 6886, 6862, 6837, 6813, 6803, 6792, 6782, 6772, 6777, 6783, 6762, 6742, 6710, 6679, 6666, 6653, 6660, 6667, 6674, 6681, 6663, 6644, 6626, 6608, 6603, 6598, 6593, 6588, 6588, 6588, 6587, 6587, 6562, 6525, 6485, 6463, 6465, 6467, 6469, 6471, 6456, 6423, 6394, 6377, 6370, 6375, 6373, 6372, 6372, 6371, 6370, 6370, 6366, 6362, 6357, 6353, 6332, 6311, 6290, 6269, 6274, 6280, 6285, 6291, 6287, 6283, 6280, 6276, 6279, 6282, 6284, 6287, 6309, 6330, 6340, 6330, 6310, 6291, 6292, 6293, 6296, 6298, 6278, 6258, 6236, 6213, 6229, 6245, 6262, 6279, 6297, 6314, 6339, 6364, 6390, 6415, 6440, 6465, 6490, 6515, 6560, 6605, 6650, 6695, 6727, 6759, 6790, 6822, 6847, 6872, 6896, 6921]
761F921K5K5K4K5K2K3K2K2K8K8K8M7N7M6J6J5L7L6K6K5L7M7K9J1KJK4K3K9K8Ok0j8j8rqj3
757G649j3k4k5n2n3n3n3l7l7l6l6j6J0Oj4l9n0m5m5m8m8o9p0p9o8n1k6rj0k0k0m0m1o3o3m5
752F267m5l7m8m9k2rk0l7l8j5j6l4l4l4l4j7j8j8j8j5j5OPmk2m0k9rKpj9j3kJ3J4J1J2%%q
747E606rrrqqrqJKJJk0k1k0k0jjJ0J0RRk1l3j8JJ2J2rqrqOOOO%JJ%qqqqj6j7nnKLJ7K9J5m
741E438l0k9j6j5nmMMpqj3j3J0RQPPPLLqqj2j2J0J0MLLMj1j1%%KJk1k1oNJ0j0k0k0k2k1RQ
735E226RRnnJ1K1J3nj7j7mmmm%%%%RJ0RRJ5J4J4J5j7j7OOPOj6j6j5j5QQMLLMRRRRJ4J4rrj0
729E314rj0rJ2J2J2J1J7J6Nj3l0j8OJ7J2J2rj0k4k5kjJ2J2J2J2ppppRQQRMNj8j8j9j8j9j8
723E239J1J0J1J0J1J0J1J0KJKKJJJ2L1L3K2Kj7k5k5k6k5l4k2kJ7K7J5J%qrPJ9K3K2K3K3%j1
$$ y = [6921, 6946, 6971, 6995, 7020, 7042, 7065, 7087, 7109, 7137, 7165, 7193, 7240, 7297, 7343, 7359, 7374, 7411, 7447, 7473, 7498, 7535, 7582, 7611, 7622, 7624, 7625, 7649, 7672, 7701, 7729, 7735, 7715, 7697, 7679, 7670, 7662, 7649, 7636, 7612, 7587, 7535, 7482, 7429, 7376, 7339, 7302, 7266, 7230, 7214, 7224, 7230, 7216, 7177, 7127, 7082, 7037, 6989, 6941, 6872, 6802, 6723, 6655, 6604, 6578, 6569, 6559, 6539, 6519, 6479, 6438, 6375, 6312, 6267, 6222, 6185, 6137, 6088, 6066, 6057, 6037, 6000, 5962, 5947, 5931, 5897, 5863, 5829, 5795, 5778, 5760, 5742, 5724, 5709, 5694, 5700, 5707, 5703, 5681, 5641, 5612, 5603, 5605, 5598, 5579, 5566, 5564, 5577, 5591, 5602, 5614, 5614, 5614, 5606, 5597, 5588, 5579, 5571, 5563, 5554, 5546, 5547, 5549, 5550, 5551, 5531, 5510, 5490, 5470, 5469, 5468, 5478, 5488, 5497, 5506, 5485, 5452, 5434, 5435, 5447, 5459, 5450, 5442, 5433, 5425, 5431, 5437, 5443, 5449, 5449, 5450, 5451, 5451, 5443, 5435, 5427, 5419, 5403, 5386, 5381, 5376, 5378, 5381, 5398, 5427, 5442, 5438, 5408, 5379, 5363, 5348, 5343, 5339, 5343, 5347, 5340, 5332, 5319, 5306, 5316, 5325, 5333, 5340, 5347, 5354, 5357, 5360, 5352, 5344, 5332, 5320, 5330, 5340, 5344, 5347, 5350, 5354, 5343, 5332, 5332, 5332, 5334, 5335, 5314, 5293, 5287, 5292, 5302, 5292, 5272, 5252, 5230, 5209, 5218, 5226, 5235, 5244, 5239, 5234, 5245, 5266, 5279, 5274, 5257, 5240, 5236, 5232, 5228, 5224, 5224, 5224, 5224, 5224, 5233, 5243, 5252, 5261, 5276, 5290, 5304, 5319, 5302, 5285, 5291, 5297, 5304, 5310, 5294, 5278, 5263, 5248, 5256, 5264, 5268, 5271, 5274, 5278, 5287, 5296, 5305, 5314, 5328, 5342, 5333, 5324, 5314, 5305, 5295, 5286, 5298, 5310, 5322, 5333, 5350, 5366, 5371, 5358, 5328, 5310, 5316, 5333, 5345, 5357, 5348, 5338, 5314, 5289, 5287, 5286, 5298, 5310, 5322, 5334, 5327, 5320, 5313, 5306, 5315, 5323, 5331, 5340, 5344, 5349, 5331, 5313, 5294, 5276, 5257, 5239, 5250, 5260, 5271, 5281, 5292, 5302, 5313, 5323, 5325, 5326, 5328, 5330, 5331, 5332, 5344, 5375, 5408, 5430, 5432, 5415, 5390, 5365, 5339, 5314, 5280, 5258, 5256, 5273, 5300, 5315, 5316, 5316, 5308, 5299, 5306, 5325, 5348, 5370, 5393, 5416, 5416, 5405]
718E405pkNJ5J6Mlrooooj3jJ5J5J5J5J3Kj5j4NNLRJ7K9K8J8Jno%PJj1k2k3j7nOLKlQJ9J8l
712E516lkMPlj6nJ1J1RQQRLkoOJ6Rj6k8l1j9NJ7J5J5J7J6J1J5J9QopooKJ3J4KMMjN%j1j0%
706E621PJ3J3Q%JkLK1L3K9K3J1qjNKJRkj2j2J7K9J3onJ3K0K0K1K1j3j4j3j3mmJ8J9J8J9mm
701E911J1J1J1J1K8K8NOK4K5K4K4J6J6J6J6RRj3j2kJ7J3%%j1j6LK2K2J2pk3j2J1K3J2JlJ6
696F254K2J2j8j8kJ6OONMNMmnnnrrqrj6j6mJ4K8K9OPJ5J6J5J5j%jjjj%jJ2J2J3J2j5j4j5j4
690F336j4j5RQJ3J2J3J2lmlmj7j7j6j7kkjkpqppononK1K2K1K1K7K8MNJ2J1J1J2j3k3k7qJ8
685F377K9J2ooNMpjkkkRRRRJ2J3j0j1j1j2j2j1OOK9K9KKKKLMLMmmlmJ3J4J3J3ONNOmmmmj6
678F515j5j6j6j0j0j0j0OPOOopppj0j0j0rk7k7k6k6j1QQj1k1k2%%kkkkj%jjQPQPk2k2k2k2
$$ y = [5405, 5398, 5396, 5401, 5416, 5432, 5436, 5433, 5424, 5418, 5412, 5406, 5400, 5387, 5386, 5401, 5416, 5431, 5446, 5459, 5461, 5446, 5432, 5437, 5442, 5445, 5454, 5471, 5500, 5528, 5546, 5547, 5542, 5536, 5536, 5543, 5544, 5533, 5511, 5488, 5471, 5466, 5472, 5475, 5477, 5474, 5482, 5501, 5519, 5516, 5513, 5511, 5515, 5522, 5519, 5503, 5498, 5509, 5520, 5529, 5537, 5545, 5554, 5557, 5555, 5549, 5555, 5571, 5580, 5564, 5536, 5505, 5486, 5491, 5508, 5523, 5538, 5555, 5571, 5582, 5597, 5616, 5624, 5618, 5611, 5605, 5599, 5601, 5614, 5628, 5630, 5634, 5638, 5637, 5642, 5642, 5631, 5621, 5621, 5628, 5641, 5654, 5662, 5662, 5663, 5661, 5664, 5685, 5718, 5747, 5770, 5781, 5773, 5772, 5777, 5779, 5780, 5789, 5787, 5775, 5763, 5780, 5809, 5822, 5816, 5811, 5824, 5844, 5864, 5885, 5906, 5893, 5879, 5866, 5853, 5849, 5845, 5863, 5882, 5900, 5919, 5915, 5911, 5922, 5933, 5944, 5955, 5983, 6011, 6016, 6022, 6046, 6071, 6095, 6119, 6135, 6151, 6167, 6183, 6192, 6201, 6188, 6176, 6174, 6191, 6204, 6204, 6204, 6193, 6177, 6180, 6202, 6224, 6236, 6229, 6206, 6194, 6205, 6228, 6240, 6241, 6238, 6254, 6276, 6288, 6270, 6252, 6250, 6266, 6272, 6278, 6283, 6287, 6292, 6296, 6292, 6287, 6282, 6277, 6268, 6259, 6251, 6242, 6226, 6210, 6206, 6220, 6248, 6277, 6283, 6290, 6305, 6321, 6336, 6351, 6350, 6350, 6349, 6348, 6347, 6346, 6346, 6345, 6357, 6369, 6382, 6394, 6379, 6365, 6350, 6336, 6322, 6307, 6316, 6324, 6337, 6349, 6362, 6374, 6371, 6367, 6364, 6360, 6343, 6326, 6310, 6293, 6291, 6289, 6288, 6286, 6279, 6271, 6264, 6257, 6251, 6246, 6240, 6235, 6256, 6278, 6299, 6320, 6347, 6375, 6379, 6384, 6396, 6407, 6418, 6430, 6417, 6394, 6367, 6359, 6377, 6406, 6418, 6412, 6406, 6411, 6415, 6408, 6407, 6405, 6403, 6401, 6410, 6419, 6428, 6437, 6449, 6462, 6452, 6441, 6430, 6418, 6406, 6395, 6401, 6407, 6436, 6465, 6467, 6469, 6471, 6473, 6476, 6480, 6483, 6487, 6483, 6479, 6476, 6472, 6485, 6499, 6512, 6525, 6531, 6536, 6541, 6547, 6543, 6539, 6535, 6531, 6515, 6500, 6484, 6468, 6458, 6448, 6438, 6428, 6434, 6441, 6447, 6453, 6447, 6440, 6433, 6426, 6416, 6406, 6396, 6387, 6360, 6333, 6307, 6281, 6270, 6278, 6286, 6275, 6254, 6232, 6232, 6232, 6230, 6228, 6226, 6224, 6223, 6223, 6222, 6221, 6229, 6236, 6244, 6251, 6229, 6207, 6185, 6163]
673F163NOj6j6nJ7K8K7OOj7j6qqqqNNNNNNNNRRQRjkL5L4K2%j8k9j3QKrppppJ7J7J8J7PPPO
666F328PPPPj3j2j3j3j3j2j3j3MNMMk4k3k4k4onnonnJ8J7J2J1J1J1J4J4qqj8j8m0m0k0k0k0
661F060j9k0j9j9k0j5j5QPonoomnmnKJJJJ0J1J0J1J5J5J5J5j3j3j3j3qqqqlklkJ0J0RJ0j8
655E941j9j8j8OOOOppppnmnmJ2J3J1J2OmrJ0K0J9nk4k1j0NN%%%JMMNMJ4J3J4J4kklkJ9J8J9
649F024J8ooooj%%jRRJ0RJ8J9J8J9kjjkj4j4RQmlmmJ2J1L3L3L0J0jkKKKKkklkJ7J6J7J7K7
643F314K6J5nj1j2j2j3rrJ4J3K1K0L1J2j3j3j5j4J8J7J8J7JKJJnmnmJ1J2J1J2rj0rrK0K1K0
638F467K0J3J2K4K4K2K2j%NMNNopJ6J6K2K1jjj6j6j6j7j7j7NONNNNOPOPNNNONNNNJ2J2J2J1
632F728LKLKJ8J8J8J8j0j0j0j0k1k1k1k1mmmmj1j1j2j1J8J8mmMMNOJJ3J8kk0k1k6j6J0K8K9
$$ y = [6163, 6168, 6174, 6158, 6142, 6137, 6154, 6182, 6209, 6215, 6221, 6204, 6188, 6180, 6172, 6164, 6156, 6161, 6166, 6171, 6176, 6181, 6186, 6191, 6196, 6205, 6214, 6222, 6231, 6230, 6228, 6263, 6297, 6319, 6319, 6301, 6272, 6259, 6267, 6269, 6260, 6253, 6246, 6239, 6232, 6249, 6266, 6284, 6301, 6308, 6315, 6322, 6328, 6335, 6342, 6349, 6356, 6343, 6331, 6318, 6305, 6292, 6280, 6267, 6254, 6258, 6263, 6267, 6271, 6247, 6224, 6200, 6176, 6170, 6165, 6160, 6154, 6149, 6144, 6162, 6179, 6191, 6202, 6213, 6224, 6238, 6252, 6244, 6236, 6218, 6200, 6160, 6120, 6100, 6080, 6060, 6041, 6021, 6002, 5983, 5963, 5948, 5933, 5941, 5948, 5942, 5937, 5931, 5925, 5921, 5916, 5912, 5907, 5909, 5910, 5911, 5912, 5922, 5933, 5943, 5954, 5969, 5984, 5999, 6014, 6001, 5988, 5975, 5962, 5954, 5946, 5938, 5930, 5927, 5925, 5922, 5920, 5930, 5940, 5949, 5959, 5941, 5922, 5904, 5886, 5892, 5898, 5904, 5910, 5903, 5896, 5889, 5882, 5877, 5873, 5868, 5864, 5876, 5889, 5900, 5912, 5918, 5914, 5905, 5915, 5935, 5954, 5949, 5925, 5904, 5894, 5899, 5904, 5904, 5904, 5904, 5905, 5909, 5913, 5918, 5922, 5936, 5949, 5963, 5977, 5975, 5973, 5970, 5968, 5987, 6005, 6024, 6042, 6036, 6030, 6024, 6018, 6017, 6017, 6017, 6016, 6025, 6034, 6044, 6053, 6071, 6090, 6108, 6127, 6125, 6124, 6123, 6121, 6107, 6093, 6102, 6110, 6106, 6103, 6099, 6095, 6107, 6118, 6151, 6184, 6214, 6224, 6223, 6221, 6223, 6225, 6227, 6229, 6227, 6225, 6222, 6220, 6237, 6253, 6270, 6287, 6314, 6340, 6355, 6350, 6339, 6327, 6315, 6302, 6293, 6284, 6298, 6311, 6332, 6352, 6383, 6395, 6382, 6369, 6354, 6340, 6358, 6375, 6393, 6410, 6411, 6413, 6414, 6415, 6410, 6406, 6401, 6397, 6408, 6420, 6431, 6443, 6434, 6424, 6415, 6406, 6426, 6447, 6467, 6487, 6500, 6512, 6536, 6560, 6582, 6604, 6603, 6603, 6608, 6612, 6617, 6622, 6616, 6609, 6625, 6641, 6663, 6684, 6683, 6682, 6666, 6650, 6634, 6617, 6600, 6583, 6588, 6594, 6599, 6604, 6609, 6614, 6620, 6627, 6633, 6640, 6645, 6650, 6655, 6661, 6666, 6671, 6676, 6681, 6693, 6705, 6717, 6728, 6731, 6733, 6736, 6738, 6756, 6774, 6792, 6810, 6800, 6790, 6780, 6770, 6749, 6728, 6707, 6686, 6682, 6678, 6674, 6670, 6659, 6648, 6636, 6625, 6643, 6661, 6657, 6653, 6657, 6661, 6666, 6672, 6673, 6686, 6704, 6702, 6682, 6661, 6635, 6619, 6629, 6657, 6686]
627F686J1popqoppoJJJ3J2OOj7j7OONOJ0J0J0J0nnnnnnnnk3k3k2k3j2j2j1j0JK4L3L2Mj8k9
621F582k8j9j9qpj6j5j6j5J3J4J3J4J3J3J4J3%jj%j5j5mlLMK5K6M0K9Rj3k9m1l3k1k5m7m6
616F388k4OOj5j5rj0J3J4J5J6J5J6j1j0j1j0onOOJ8J8nnj3j3j4j3MLMLKKK4K5kjkjj7j7j7
611F358j7lmmmj4j4j4j4j9j8j8j9j6j7OOONnnrqLLKJKKj8j7j7j8%J%%J8J8K8K9K9J0j7j6J
605F203%JJjkkjLKLKj0j1l2l2m4l2j2PK0K0ok5l2l2k2k2KKKKK6K6L6L6J8jj1j2oJ3K0Rqqr
599F081rk4k3k3k4j7j8j8j7MMMMKKJ2J2kk2l2l2j9%J2J2kkkkRRRRj3j2j2j2JJ%JJ5J5J5J5
594E911noj7j6j6j5PPJ7J7ONpoppqpqpj6j6j5j6J6J6J7J6J2J3J2J3NNONOOj7j7ppJ5J5J3J3
588E931J3J3J0J1j2j1NOJ7J6MLML%%%JK0K1K1K0nnnnk9k8l8k0J3K4J9J8J8J8POnnJ7J7J8J8
$$ y = [6686, 6697, 6690, 6684, 6677, 6669, 6663, 6656, 6649, 6643, 6644, 6645, 6658, 6670, 6676, 6682, 6665, 6648, 6654, 6660, 6665, 6671, 6681, 6691, 6701, 6711, 6706, 6701, 6696, 6691, 6686, 6681, 6676, 6671, 6648, 6625, 6603, 6580, 6568, 6556, 6545, 6535, 6536, 6560, 6593, 6625, 6629, 6611, 6582, 6554, 6535, 6516, 6508, 6501, 6485, 6470, 6454, 6439, 6452, 6466, 6479, 6493, 6506, 6519, 6533, 6546, 6546, 6545, 6544, 6544, 6529, 6514, 6510, 6507, 6510, 6514, 6539, 6565, 6605, 6634, 6643, 6630, 6601, 6560, 6527, 6506, 6481, 6434, 6388, 6364, 6370, 6376, 6361, 6346, 6337, 6327, 6340, 6354, 6369, 6385, 6400, 6416, 6405, 6395, 6384, 6374, 6368, 6363, 6369, 6375, 6393, 6411, 6406, 6401, 6388, 6375, 6361, 6348, 6352, 6355, 6359, 6362, 6364, 6366, 6390, 6415, 6413, 6412, 6410, 6409, 6392, 6375, 6358, 6341, 6338, 6334, 6330, 6326, 6312, 6298, 6284, 6270, 6251, 6233, 6215, 6196, 6180, 6163, 6169, 6175, 6181, 6186, 6181, 6176, 6167, 6159, 6162, 6165, 6167, 6168, 6170, 6172, 6154, 6137, 6120, 6102, 6102, 6103, 6103, 6103, 6121, 6139, 6167, 6196, 6225, 6235, 6218, 6202, 6203, 6203, 6204, 6205, 6204, 6202, 6200, 6199, 6202, 6204, 6207, 6209, 6199, 6188, 6156, 6124, 6080, 6048, 6036, 6043, 6063, 6083, 6077, 6052, 6020, 5988, 5966, 5944, 5946, 5948, 5950, 5952, 5978, 6004, 6040, 6076, 6094, 6093, 6082, 6070, 6064, 6077, 6097, 6106, 6098, 6090, 6081, 6072, 6048, 6025, 6002, 5978, 5961, 5943, 5925, 5908, 5912, 5916, 5920, 5924, 5926, 5928, 5940, 5952, 5950, 5928, 5896, 5864, 5845, 5845, 5857, 5869, 5867, 5865, 5863, 5861, 5870, 5879, 5888, 5897, 5884, 5872, 5860, 5848, 5849, 5850, 5850, 5851, 5866, 5881, 5896, 5911, 5906, 5900, 5883, 5867, 5851, 5836, 5843, 5850, 5867, 5884, 5890, 5895, 5888, 5882, 5875, 5868, 5860, 5853, 5845, 5838, 5822, 5806, 5791, 5775, 5791, 5807, 5824, 5840, 5852, 5865, 5877, 5890, 5895, 5900, 5906, 5911, 5917, 5923, 5906, 5889, 5882, 5875, 5890, 5905, 5918, 5931, 5944, 5957, 5967, 5978, 5966, 5955, 5960, 5966, 5983, 5999, 6003, 6006, 6010, 6013, 6013, 6013, 6013, 6014, 6034, 6055, 6076, 6096, 6091, 6086, 6081, 6076, 6047, 6019, 5981, 5961, 5974, 5998, 6017, 6035, 6053, 6071, 6078, 6084, 6079, 6074, 6091, 6108, 6126, 6144]
583F144nmj2j1J2J1J1J0J%J3L1M1M2K8JnnNJ7J0qj5j5PPMMNMONOOK8K8K8K8j5j5j5j5K1K1
578F445K1K1K1K1K1K1OOOOlmllkkjkMMMMQQQQK1K1K2K1K0K1K1K1J9K0J9J9QPj4j3pJ6M0M1
572F946L6L6L8L8N1P4R9R9J02J01P9P9O8O8O6O7N3L0K0K1L6L6K5Kj1l4m5m5l3l3l2l3j7j7
568G970J0L2L4N7Q6J09J26J49J76K00K14K15K36K36K18J80J45J23Q4O2M8M9L2no3r9j26j49
564A0349j64j87j98k20k29k29j86j48j14r2p8p7p6p7l3l4l4l4k6k7m8m8m3k4LMk1k0k0k0j7
561G832j6j7j6k1k1KKPQj6j5k5k4k5k5ononLLLLLLLLJ2J2J2J2J2J2J2J2QQPQj2j3j3j2QQQ
555G733Qj6j7mJ4J8J8J9J9J5J5J5J5PPPQNOOOPPj5j6kkK0K0M5M5M3M4M3K5J5J4M0N9M8M8M7
550H439M7N7L8OojjLLKLL1L0QQJ4J5J5J5K1K0K1K1qqpqLLLLK3K3K3K2Qj0oOK3L5L4K3J8OO
$$ y = [6144, 6139, 6135, 6123, 6112, 6124, 6135, 6146, 6156, 6157, 6157, 6170, 6201, 6242, 6284, 6312, 6313, 6308, 6303, 6308, 6325, 6335, 6327, 6312, 6297, 6304, 6311, 6315, 6319, 6324, 6328, 6334, 6339, 6345, 6351, 6379, 6407, 6435, 6463, 6448, 6433, 6418, 6403, 6424, 6445, 6466, 6487, 6508, 6529, 6550, 6571, 6577, 6583, 6589, 6595, 6592, 6588, 6585, 6582, 6580, 6578, 6577, 6575, 6579, 6583, 6587, 6591, 6599, 6607, 6615, 6623, 6644, 6665, 6687, 6708, 6728, 6749, 6770, 6791, 6810, 6830, 6849, 6868, 6876, 6883, 6869, 6856, 6849, 6865, 6905, 6946, 6982, 7018, 7056, 7094, 7145, 7219, 7318, 7417, 7519, 7620, 7699, 7778, 7846, 7914, 7980, 8047, 8100, 8130, 8150, 8171, 8207, 8243, 8268, 8270, 8259, 8225, 8180, 8135, 8102, 8069, 8037, 8004, 7987, 7970, 7980, 8012, 8046, 8103, 8189, 8298, 8424, 8573, 8749, 8949, 9163, 9378, 9614, 9850, 10068, 10248, 10393, 10516, 10600, 10662, 10710, 10759, 10791, 10786, 10723, 10624, 10498, 10349, 10185, 9998, 9800, 9580, 9351, 9122, 8936, 8788, 8674, 8582, 8504, 8427, 8351, 8274, 8241, 8207, 8173, 8139, 8113, 8086, 8038, 7990, 7947, 7923, 7926, 7930, 7909, 7889, 7869, 7849, 7832, 7816, 7799, 7783, 7762, 7741, 7743, 7745, 7752, 7760, 7744, 7729, 7704, 7680, 7655, 7630, 7624, 7619, 7613, 7608, 7611, 7614, 7617, 7620, 7623, 7626, 7629, 7632, 7644, 7656, 7668, 7680, 7692, 7704, 7716, 7728, 7736, 7744, 7751, 7759, 7747, 7734, 7721, 7709, 7717, 7725, 7733, 7741, 7725, 7708, 7704, 7718, 7736, 7754, 7773, 7792, 7807, 7822, 7837, 7852, 7859, 7866, 7873, 7881, 7886, 7892, 7898, 7904, 7911, 7918, 7903, 7887, 7885, 7883, 7903, 7923, 7968, 8013, 8056, 8100, 8143, 8168, 8183, 8197, 8237, 8296, 8344, 8392, 8439, 8486, 8543, 8581, 8587, 8581, 8580, 8579, 8582, 8585, 8587, 8590, 8621, 8651, 8659, 8667, 8681, 8696, 8711, 8726, 8747, 8767, 8788, 8809, 8801, 8793, 8786, 8778, 8781, 8784, 8787, 8790, 8813, 8836, 8859, 8881, 8889, 8879, 8873, 8879, 8902, 8937, 8971, 8994, 9012, 9018, 9024]
544I024J7L2L2L2L3K5K5M8M8L5L5L5L5L8L8L8L7M4M3M4M3L3L3L2L3N0N0M9N0O1O2O1O2O2O2
540A0481M0M0M1M2O4O3O8O9O8O8N8N9Q1Q1O3O3O3O3N4N3N4N4O7O6O7O7J07J08J07J08R2R2
536A2671R2R2P8P8J00J01R9R8J37J36J36J36J36J36J36J37J37J37J48J48J35J17J02R1R0J01
533A5705J23J22J11R3Q0Q0P9P8Q3Q3Q3Q2Q3Q3Q2Q3Q5Q5Q6Q5J13J13J14J13J22J21J22J22J47
529A8561J48J48J47J70J71J93J92J91J91K29K28K42K41K43K42K49K68K94K95K74K74K73K72
526B3736K60K34K11K11K24K23K24K23J86J85J85J85J73J62J59J78K01K20K34K33K42K43K37
524B8569K49K58K77L06L32L41L53L67M00M25M25M29M29M47M80N00N00N11N29N58N85O04O31
521C8505O50O61O75P01P25P52P68P79P87Q06Q16Q27Q44Q44Q43Q32Q09P90P72P46P11O70O16
$$ y = [9024, 9041, 9073, 9105, 9137, 9170, 9195, 9220, 9268, 9316, 9351, 9386, 9421, 9456, 9494, 9532, 9570, 9607, 9651, 9694, 9738, 9781, 9814, 9847, 9879, 9912, 9962, 10012, 10061, 10111, 10172, 10234, 10295, 10357, 10419, 10481, 10521, 10561, 10602, 10644, 10708, 10771, 10839, 10908, 10976, 11044, 11102, 11161, 11242, 11323, 11386, 11449, 11512, 11575, 11629, 11682, 11736, 11790, 11857, 11923, 11990, 12057, 12164, 12272, 12379, 12487, 12579, 12671, 12763, 12855, 12933, 13011, 13111, 13212, 13311, 13409, 13546, 13682, 13818, 13954, 14090, 14226, 14362, 14499, 14636, 14773, 14921, 15069, 15204, 15321, 15423, 15514, 15604, 15705, 15828, 15950, 16061, 16154, 16234, 16314, 16393, 16471, 16554, 16637, 16720, 16802, 16885, 16968, 17050, 17133, 17218, 17303, 17389, 17474, 17587, 17700, 17814, 17927, 18049, 18170, 18292, 18414, 18561, 18709, 18857, 19004, 19174, 19345, 19538, 19730, 19921, 20112, 20341, 20569, 20811, 21052, 21295, 21537, 21786, 22054, 22348, 22643, 22917, 23191, 23464, 23736, 23996, 24230, 24441, 24652, 24876, 25099, 25323, 25546, 25732, 25917, 26102, 26287, 26460, 26622, 26781, 26959, 27160, 27380, 27614, 27847, 28089, 28332, 28569, 28818, 29076, 29353, 29659, 29991, 30332, 30685, 31052, 31452, 31877, 32302, 32731, 33160, 33607, 34087, 34587, 35087, 35598, 36127, 36685, 37270, 37874, 38505, 39155, 39816, 40491, 41192, 41917, 42669, 43437, 44216, 45003, 45809, 46625, 47452, 48296, 49140, 49983, 50815, 51624, 52414, 53186, 53932, 54643, 55313, 55929]
518E5929N52M78M06L44K73J89J10K9o5j61k47l25l95m61n17n68o21o79p32p65p88q01q00q11
515D9574q11p99p98p90p68p49p11o88o87o75o51o09n86n84n84n73n35n03n03m85m63m35m12
512C5175l98l98l85l84l62l61l37l14l11l10l21l21l08l09k98k98k96k96k97k96l21l22k96
509B7636k73k65k64k64k63k52k52k52k52k54k55k66k65k55k54k32k32k21k20k10k10j97j97
507B2031j86j86j73j73j83j83j72j50j39j39j28j27j05j05j08j09j18j18r3p0o0o1q9q9q9
504A8878q9q7q7q7q7p0p0p1p0p9p9p9q0o6o6o6o6m9m9m9m9n4n4n5n4m6m6m6m6m6m6m6m6l2
499A6766l2l1l2l9l9l9l8m8l6j6LPPklk4k3j2j2NONNmlmmk4k5k4k4%JJJJJJ%RRQRllmlj4j5
493A6265QQJ4J3LLjJ1L0M9L6J8K2L4M1L0J5J4K0J9L1L1L7L8K6K6J6J7NNONK9K8M1M2M1M2K8
$$ y = [55929, 56481, 56959, 57365, 57709, 57982, 58171, 58281, 58310, 58245, 58084, 57837, 57512, 57117, 56656, 56139, 55571, 54950, 54271, 53539, 52774, 51986, 51185, 50385, 49574, 48763, 47964, 47166, 46376, 45608, 44859, 44148, 43460, 42773, 42098, 41447, 40838, 40252, 39668, 39084, 38511, 37976, 37473, 36970, 36485, 36022, 35587, 35175, 34777, 34379, 33994, 33610, 33248, 32887, 32550, 32236, 31925, 31615, 31294, 30973, 30665, 30356, 30058, 29760, 29464, 29168, 28871, 28575, 28254, 27932, 27636, 27363, 27098, 26834, 26570, 26307, 26055, 25803, 25551, 25299, 25045, 24790, 24524, 24259, 24004, 23750, 23518, 23286, 23065, 22845, 22635, 22425, 22228, 22031, 21845, 21659, 21486, 21313, 21130, 20947, 20775, 20625, 20486, 20347, 20219, 20092, 19987, 19882, 19774, 19665, 19547, 19429, 19336, 19266, 19206, 19145, 19056, 18967, 18878, 18789, 18702, 18615, 18528, 18441, 18371, 18301, 18230, 18160, 18081, 18002, 17923, 17843, 17777, 17711, 17645, 17579, 17530, 17481, 17432, 17383, 17329, 17275, 17220, 17166, 17120, 17074, 17028, 16982, 16936, 16890, 16844, 16798, 16766, 16734, 16703, 16671, 16632, 16593, 16554, 16516, 16468, 16432, 16416, 16419, 16426, 16433, 16431, 16428, 16404, 16381, 16369, 16357, 16362, 16368, 16373, 16378, 16374, 16371, 16367, 16363, 16339, 16314, 16290, 16266, 16266, 16267, 16268, 16269, 16270, 16271, 16272, 16272, 16281, 16290, 16298, 16307, 16304, 16301, 16297, 16294, 16280, 16265, 16273, 16281, 16295, 16308, 16311, 16314, 16313, 16324, 16354, 16403, 16439, 16457, 16479, 16513, 16554, 16584, 16599, 16613, 16633, 16652, 16683, 16714, 16751, 16789, 16815, 16841, 16857, 16874, 16879, 16884, 16890, 16895, 16924, 16952, 16993, 17035, 17076, 17118, 17146]
489A7146K9OOJ0RJ0RJ0J0J0J0L6L7L7L6K8K8NNJ9K0M2M1N4M2K2LmmnnqppqK1K1K0K1M1M0M1
483A7877M0K7K8K7K7L4L5L4L4K4K5K5K4L7L7L7L6L2L1L1L1L6L5L6L5L6L5L6L5M4M3M3M4M2
479A9033M3M3M3M2M2L0L1K5K4M7M7N7N8N7N8M6M6M5M6N5N4N5N5L7L7K2J1J3L2N2O4P8P7P8
475B0583N9M7M7O8O8O5O5P6P7N9N8N9N9O4O3Q7Q6Q9R0Q9R0P8P8O6O7O7O6Q9Q9Q5Q5Q6Q5J00
471B3089J00J00J01Q7Q7R9J18J15J03Q9Q9Q5Q5Q6Q5J12J12J12J13J12J12J12J12J18J17J18
468B5768J17J46J45J46J45J53J52J52J53J36J36J31J42J72J91J81J81J82J82J81J82J86J76
465B9436J71J91K22K22K23K23K52K51K52K51K69K68K68K69L04L03L04L04L09L10L09L10L49
462C5570L49L49L50L59L60L54L65L94M13M10L98L83L84L93L74L46L34L32L44L63L51L35L35
$$ y = [17146, 17175, 17181, 17187, 17197, 17206, 17216, 17225, 17235, 17245, 17255, 17265, 17301, 17338, 17375, 17411, 17439, 17467, 17472, 17477, 17496, 17516, 17558, 17599, 17653, 17695, 17717, 17720, 17716, 17712, 17707, 17702, 17694, 17687, 17680, 17672, 17693, 17714, 17734, 17755, 17796, 17836, 17877, 17917, 17944, 17972, 17999, 18026, 18060, 18095, 18129, 18163, 18187, 18212, 18237, 18261, 18298, 18335, 18372, 18408, 18440, 18471, 18502, 18533, 18569, 18604, 18640, 18675, 18711, 18746, 18782, 18817, 18861, 18904, 18947, 18991, 19033, 19076, 19119, 19162, 19204, 19246, 19276, 19307, 19332, 19356, 19403, 19450, 19507, 19565, 19622, 19680, 19726, 19772, 19817, 19863, 19918, 19972, 20027, 20082, 20119, 20156, 20178, 20189, 20202, 20234, 20286, 20350, 20428, 20505, 20583, 20642, 20689, 20736, 20804, 20872, 20937, 21002, 21078, 21155, 21214, 21272, 21331, 21390, 21454, 21517, 21604, 21690, 21779, 21869, 21958, 22048, 22126, 22204, 22270, 22337, 22404, 22470, 22559, 22648, 22733, 22818, 22904, 22989, 23089, 23189, 23289, 23390, 23477, 23564, 23663, 23781, 23896, 23999, 24088, 24177, 24262, 24347, 24433, 24518, 24630, 24742, 24854, 24967, 25079, 25191, 25303, 25415, 25533, 25650, 25768, 25885, 26031, 26176, 26322, 26467, 26620, 26772, 26924, 27077, 27213, 27349, 27480, 27622, 27794, 27985, 28166, 28347, 28529, 28711, 28892, 29074, 29260, 29436, 29607, 29798, 30020, 30242, 30465, 30688, 30940, 31191, 31443, 31694, 31963, 32231, 32499, 32768, 33072, 33375, 33679, 33983, 34292, 34602, 34911, 35221, 35570, 35919, 36268, 36618, 36977, 37337, 37691, 38056, 38450, 38863, 39273, 39671, 40054, 40438, 40831, 41205, 41551, 41885, 42217, 42561, 42924, 43275, 43610, 43945]
459D3945L40L28L08K89K89K89K77K58K53K64K84L02L07L19L25L25L37L48L65L91M10M21M30
457E1404M47M64M76M83N03N32N59N73N92O15O33O42O54O75P02P26P52P74P74P76P76P93P94
454F6119P93P94P96P97P71P49P42P42P31P08O70O71O59O36O08O07N84N83N56N56N55N56N44
451H1527N44N68N92O02O01N93O16O41O78P01P23P50P87Q23Q45Q50Q50Q86R24R82J034J064
448I8181J086J109J132J148J171J193J232J266J289J315J315J343J366J404J441J461J483
446A19935J501J500J524J525J553J554J577J578J593J616J628J651J665J664J678J700J729
444A47171J752J768J791J823J860J889J927J966K004K043K094K144K212K256K293K319K356
442A81668K403K440K482K549K621K689K755K807K854K905K957L009L055L108L170L239L290
$$ y = [43945, 44285, 44613, 44921, 45210, 45499, 45788, 46065, 46323, 46576, 46840, 47124, 47426, 47733, 48052, 48377, 48702, 49039, 49387, 49752, 50143, 50553, 50974, 51404, 51851, 52315, 52791, 53274, 53777, 54309, 54868, 55441, 56033, 56648, 57281, 57923, 58577, 59252, 59954, 60680, 61432, 62206, 62980, 63756, 64532, 65325, 66119, 66912, 67706, 68502, 69299, 70070, 70819, 71561, 72303, 73034, 73742, 74412, 75083, 75742, 76378, 76986, 77593, 78177, 78760, 79316, 79872, 80427, 80983, 81527, 82071, 82639, 83231, 83833, 84434, 85027, 85643, 86284, 86962, 87663, 88386, 89136, 89923, 90746, 91591, 92441, 93291, 94177, 95101, 96083, 97117, 98181, 99267, 100376, 101508, 102656, 103827, 105020, 106252, 107518, 108807, 110122, 111437, 112780, 114146, 115550, 116991, 118452, 119935, 121436, 122936, 124460, 125985, 127538, 129092, 130669, 132247, 133840, 135456, 137084, 138735, 140400, 142064, 143742, 145442, 147171, 148923, 150691, 152482, 154305, 156165, 158054, 159981, 161947, 163951, 165994, 168088, 170232, 172444, 174700, 176993, 179312, 181668, 184071, 186511, 188993, 191542, 194163, 196852, 199607, 202414, 205268, 208173, 211130, 214139, 217194, 220302, 223472, 226711, 230001]
440B30001L344L379L448L521L588L654L707L774L842L912L964M005M042M099M167M233M285
438B94965M329M381M447M514M572M609M649M672M699M737M772M825M865M903M942M964M991
436C74836N028N065N087N110N133N147N169N174N175N176N177N160N160N160N161N142N142
434D62202N129N107N076N037N017M993M980M957M926M904M866M829M785M748M719M696M672
432E45643M635M606M568M538M501M461M423M393M356M313M276M246M208M180M143M119M096
430F19705M073M036L999L947L902L865L816L779L723L655L581L515L459L392L293L210L126
427F82076L029K938K841K732K618K499K386K262K133J977J834J695J552J395J237J080R38
425G17222P95O36M64L06J42j7j88l46m89o32p72r15j063j205j332j444j572j700j803j901
$$ y = [230001, 233345, 236724, 240172, 243693, 247281, 250935, 254642, 258416, 262258, 266170, 270134, 274139, 278181, 282280, 286447, 290680, 294965, 299294, 303675, 308122, 312636, 317208, 321817, 326466, 331138, 335837, 340574, 345346, 350171, 355036, 359939, 364881, 369845, 374836, 379864, 384929, 390016, 395126, 400259, 405406, 410575, 415749, 420924, 426100, 431277, 436437, 441597, 446757, 451918, 457060, 462202, 467331, 472438, 477514, 482551, 487568, 492561, 497541, 502498, 507424, 512328, 517194, 522023, 526808, 531556, 536275, 540971, 545643, 550278, 554884, 559452, 563990, 568491, 572952, 577375, 581768, 586124, 590437, 594713, 598959, 603167, 607347, 611490, 615609, 619705, 623778, 627814, 631813, 635760, 639662, 643527, 647343, 651122, 654845, 658500, 662081, 665596, 669055, 672447, 675740, 678950, 682076, 685105, 688043, 690884, 693616, 696234, 698733, 701119, 703381, 705514, 707491, 709325, 711020, 712572, 713967, 715204, 716284, 717222, 718017, 718653, 719117, 719423, 719565, 719548, 719360, 719014, 718525, 717893, 717121, 716206, 715143, 713938, 712606, 711162, 709590, 707890, 706087, 704186]
423G04186j988k070k174k287k368k435k508k576k650k717k778k830k891k943k977l030l088
421F59876l142l189l226l266l317l384l436l475l512l564l617l661l713l758l811l865l902
419F00038l943l995m038m091m141m178m232m284m339m393m429m468m504m541m570m608m644
417E26640m666m697m719m748m770m784m806m809m810m810m811m816m817m817m817m847m846
415D45250m814m776m742m719m697m660m630m608m576m553m516m479m436m398m368m347m300
413C67631m248m195m142m098m045l987l935l882l844l793l742l683l631l595l557l511l474
410C02269l435l397l344l292l246l192l148l096l040l002k970k932k883k830k779k742k703
408B50238k680k641k604k578k540k503k451k408k369k326k288k268k257k241k204k159k106
$$ y = [704186, 702198, 700128, 697954, 695667, 693299, 690864, 688356, 685780, 683130, 680413, 677635, 674805, 671914, 668971, 665994, 662964, 659876, 656734, 653545, 650319, 647053, 643736, 640352, 636916, 633441, 629929, 626365, 622748, 619087, 615374, 611616, 607805, 603940, 600038, 596095, 592100, 588062, 583971, 579830, 575652, 571420, 567136, 562797, 558404, 553975, 549507, 545003, 540462, 535892, 531284, 526640, 521974, 517277, 512558, 507810, 503040, 498256, 493450, 488641, 483831, 479021, 474210, 469394, 464577, 459760, 454943, 450096, 445250, 440436, 435660, 430918, 426199, 421502, 416842, 412212, 407604, 403028, 398475, 393959, 389480, 385044, 380646, 376278, 371931, 367631, 363383, 359188, 355046, 350948, 346903, 342916, 338981, 335099, 331255, 327462, 323720, 320037, 316406, 312811, 309254, 305743, 302269, 298834, 295437, 292093, 288801, 285555, 282363, 279215, 276119, 273079, 270077, 267107, 264175, 261292, 258462, 255683, 252941, 250238, 247558, 244917, 242313, 239735, 237195, 234692, 232241, 229833, 227464, 225138, 222850, 220582, 218325, 216084, 213880, 211721, 209615]
406B09615k061k038k010j972j943j907j879j856j827j828j802j764j725j686j679j678j637
404A78323j636j603j581j562j524j497j497j482j460j428j390j371j347j323j323j321j322
402A53656j300j300j233j233j188j189j166j166j135j135j097j098j065j064j027j027j014
400A34219j014r91r92r46r46r23r24r03r03q80q80q37q36q14q14q23q23q01q00p84p85p61
$$ y = [209615, 207554, 205516, 203506, 201534, 199591, 197684, 195805, 193949, 192122, 190294, 188492, 186728, 185003, 183317, 181638, 179960, 178323, 176687, 175084, 173503, 171941, 170417, 168920, 167423, 165941, 164481, 163053, 161663, 160292, 158945, 157622, 156299, 154978, 153656, 152356, 151056, 149823, 148590, 147402, 146213, 145047, 143881, 142746, 141611, 140514, 139416, 138351, 137287, 136260, 135233, 134219, 133205, 132214, 131222, 130276, 129330, 128407, 127483, 126580, 125677, 124797, 123917, 123080, 122244, 121430, 120616, 119793, 118970, 118169, 117369, 116585, 115800, 115039]
$$ [...]
##$OBSERVED MULTIPLETS=	(I, X, Y, Hs, Vs, An, H, C, N, (J))
$$ I: Multiplet Index
$$ X: Strt Coordinate
$$ Y: End Coordinate
$$ Hs: Horizontal Chemical Shift
$$ Vs: Vertical Chemical Shift
$$ An: Normalised Integral Area
$$ H: Hydrogens
$$ C: Category
$$ N: Name
$$ (J): Coupling Constants
(1, 7.3695859813947244277, 7.4145399026894001082, 7.3919927440604755731, 1, 1, s, A)
(2, 7.042301640466678947, 7.2759311534755299888, 7.1557745264056444867, 2.08078427711076408, 2, s, B)
(3, 6.5922212551113945622, 6.7777505742654806653, 6.7074998772191758434, 2.0504075497504303804, 2, d, C, 8.09814)
(4, 4.6166775789336185198, 5.0495793236264852055, 4.8589941724850023164, 2.5134979719692580602, 3, s, D)
(5, 3.9364034087019650343, 4.111625543458604426, 4.022965215538389927, 2.1401993034352084777, 2, s, E)
(6, 3.6409307893084204011, 3.7886670990051927177, 3.7156266319838557877, 3.0926130151613628883, 3, s, F)
(7, 0.96449857410409212122, 1.167206533920594369, 1.0602079311111709536, 3.3250926793604107523, 3, s, G)
(8, 2.8885063282946221719, 3.3488938980473554885, 3.1375899606760091487, 2.2373081485679136016, 2, s, H)
##$OBSERVED MULTIPLETS AREAS=	
(1, 1453837.7452387830708)
(2, 3025122.7217630241066)
(3, 2980959.888949743472)
(4, 3654218.2242300398648)
(5, 3111502.5296678575687)
(6, 4496157.5328583102673)
(7, 4834145.2436713231727)
(8, 3252683.0341183319688)
##$OBSERVED MULTIPLETS PEAKS=	(I, X, Y)
$$ I: Multiplet Peak Index
$$ X: Peak x Position
$$ Y: Peak Intensity
(1, 7.3919927440604755731, 6975.2389242514354919)
(2, 7.1557745264056444867, 6803.499435358964547)
(3, 6.7176122779596108003, 11891.442289788512426)
(3, 6.6973874764787399982, 10165.407783490691145)
(4, 4.8589941724850023164, 1402.8419442686774801)
(5, 4.022965215538389927, 6830.2331008289711463)
(6, 3.76911185103675761, 1011.6319255476895478)
(6, 3.7156266319838557877, 46104.474881075759185)
(7, 1.0602079311111709536, 16889.321548471794813)
(8, 3.1375899606760091487, 1557.3261985008152806)
##END=	
##TITLE=	Feb18-2022.31.fid
##JCAMP-DX=	6.0	$$ MestReNova 14.3.0-30573
##BLOCK_ID=	4
##DATA TYPE=	NMR PEAK TABLE
##DATA CLASS=	PEAK TABLE
##CROSS REFERENCE=	NMR SPECTRUM: BLOCK_ID=3                                     
##.OBSERVE FREQUENCY=	400.4124024600000098
##.OBSERVE NUCLEUS=	^1H
##NPOINTS=	11
##FIRSTX=	1.0602079311111709536
##LASTX=	7.3919927440604755731
##XFACTOR=	1
##YFACTOR=	1
##FIRSTY=	16889.321548471794813
##XUNITS=	PPM
##YUNITS=	ARBITRARY UNITS
##PEAK TABLE=	(XYW..XYW)
1.0602079311111709536,16889.321548471794813,0.05950570372170466138
3.1375899606760091487,1557.3261985008152806,0.40613177819264240087
3.7156266319838557877,46104.474881075759185,0.018524640402063592692
3.76911185103675761,1011.6319255476895478,0.010517119839757392216
4.022965215538389927,6830.2331008289711463,0.093004419841225136056
4.8589941724850023164,1402.8419442686774801,0.4606492254091108518
5.0754199017967778218,473.77897553152627097,0.01465571407108420994
6.6973874764787399982,10165.407783490691145,0.026650506284790473344
6.7176122779596108003,11891.442289788512426,0.025822155918965399718
7.1557745264056444867,6803.499435358964547,0.088470908932546027392
7.3919927440604755731,6975.2389242514354919,0.039816174240001410423
##$MNOVA/PEAK_DATA_TABLE=	(T,F,A,ST,SP,APT,APC)
$$ Complementary to PEAK TABLE
$$ T: Type
$$ F: Flags
$$ A: Annotation
$$ ST: Shape Type
$$ SP: Shape Parameter
$$ APT: Attached Peaks Type
$$ APC: Attached Peaks Count
Compound,None,,1,0.48487787724048420079,0,0
Compound,None,,1,0.002133171671848843598,0,0
Compound,None,,1,-0.084878894490250933469,0,0
Compound,None,,1,0.2797366446621800673,0,0
Compound,None,,1,0.35705325028228634965,0,0
Compound,None,,1,-0.74080452674805130631,0,0
Compound,None,,1,-0.25668027417533606505,0,0
Compound,None,,1,0.0070799072456431046824,0,0
Compound,None,,1,-0.042754116656812689301,0,0
Compound,None,,1,0.1717368947904577281,0,0
Compound,None,,1,-0.13138407006246288766,0,0
##END=	
##END=	
