##TITLE=	Oct20-2021.51.fid
TM-VI-104 Mg+Ph-pyrraz. 13C

##JCAMP-DX=	6.0	$$ MestReNova 14.3.0-30573
##DATA TYPE=	LINK
##BLOCK_ID=	1
##BLOCKS=	2    
##ORIGIN=	Mestrelab Research S.L.
##OWNER=	hrzepa
##$MNOVA/LINK_BLOCK_TYPE=	ITEM	$$ NMR Spectrum
##$MNOVA/ITEM/POLYGON=	(XY..XY)
5321,5835
8722,5835
8722,8208
5321,8208
5321,5835
##$MNOVA/ITEM/Z=	0
##$MNOVA/ITEM/ANGLE=	0
##TITLE=	Oct20-2021.51.fid
##JCAMP-DX=	6.0	$$ MestReNova 14.3.0-30573
##BLOCK_ID=	2
##DATA TYPE=	MNOVA NMR VIEW DATA
##DATA CLASS=	MNOVA VIEW DATA
##$MNOVA/ITEM/ZOOM/X=	-20.698776542268014111,	240.66949999422217843
##$MNOVA/ITEM/ZOOM/Y=	-857.78270387649536133,	9366.5966796875
##END=	
##TITLE=	Oct20-2021.51.fid
##JCAMP-DX=	6.0	$$ MestReNova 14.3.0-30573
##BLOCK_ID=	3
##DATA TYPE=	NMR SPECTRUM
##DATA CLASS=	XYDATA
##NUMDIM=	1
##ORIGIN=	Bruker BioSpin GmbH
##OWNER=	nmr
##.OBSERVE FREQUENCY=	100.69424847706599735
##.OBSERVE NUCLEUS=	^13C
##.SOLVENT NAME=	Acetone
##.PULSE SEQUENCE=	zgpg30
##LONGDATE=	2021/10/20 21:11:00.000
##.ACQUISITIONMODE=	SIMULTANEOUS (DQD)
##$ORIGINAL FORMAT=	Bruker XWIN-NMR
##$MNOVA/SCALES_VERSION=	9
##$PARAMETER FILE=	(acqus, ASCII, /private/var/folders/f6/rjf_tdyn2v98c5c0wvkgn4s80000gn/T/vd0ctaWqR1m1rkI9Ztu8MA/51/acqus, 0)
$$ ##TITLE= Parameter file, TOPSPIN		Version 3.2
$$ ##JCAMPDX= 5.0
$$ ##DATATYPE= Parameter Values
$$ ##NPOINTS= 11	$$ modification sequence number
$$ ##ORIGIN= Bruker BioSpin GmbH
$$ ##OWNER= nmr
$$ $$ 2021-10-20 21:11:40.254 +0100  nmr@CZC10666PP
$$ $$ /opt/topspin/data/agmb/nmr/Oct20-2021/51/acqus
$$ $$ process /opt/topspin3.2/prog/mod/shimcntl
$$ ##$ACQT0= -2.01680680282977
$$ ##$AMP= (0..31)
$$ 100 100 100 100 100 100 100 100 100 100 100 100 100 100 100 100 100 100
$$ 100 100 100 100 100 100 100 100 100 100 100 100 100 100
$$ ##$AMPCOIL= (0..19)
$$ 0 0 0 0 0 0 0 0 0 0 0 0 0 0 0 0 0 0 0 0
$$ ##$ANAVPT= -1
$$ ##$AQSEQ= 0
$$ ##$AQ_mod= 3
$$ ##$AUNM= <au_zgonly>
$$ ##$AUTOPOS= <52 >
$$ ##$BF1= 100.683175
$$ ##$BF2= 400.41
$$ ##$BF3= 100.683175
$$ ##$BF4= 100.683175
$$ ##$BF5= 100.683175
$$ ##$BF6= 100.683175
$$ ##$BF7= 100.683175
$$ ##$BF8= 100.683175
$$ ##$BYTORDA= 0
$$ ##$CAGPARS= (0..11)
$$ 0 0 0 0 0 0 0 0 0 0 0 0
$$ ##$CFDGTYP= 0
$$ ##$CFRGTYP= 9
$$ ##$CHEMSTR= <none>
$$ ##$CNST= (0..63)
$$ 1 1 145 1 1 1 1 1 1 1 1 1 1 1 1 1 1 1 1 1 1 1 1 1 1 1 1 1 1 1 1 1 1 1 1
$$ 1 1 1 1 1 1 1 1 1 1 1 1 1 1 1 1 1 1 1 1 1 1 1 1 1 1 1 1 1
$$ ##$CPDPRG= (0..8)
$$ <waltz16> <> <waltz16> <> <mlev> <mlev> <mlev> <mlev> <mlev>
$$ ##$D= (0..63)
$$ 0 1 0.00345 0 0 0 0 0 0 0.06 0 0.03 2e-05 3e-06 0 0 0.0002 0 0 0 0 0 0
$$ 0 0 0 0 0 0 0 0 0 0 0 0 0 0 0 0 0 0 0 0 0 0 0 0 0 0 0 0 0 0 0 0 0 0 0 0
$$ 0 0 0 0 0
$$ ##$DATE= 1634760699
$$ ##$DE= 6.5
$$ ##$DECBNUC= <off>
$$ ##$DECIM= 760
$$ ##$DECNUC= <off>
$$ ##$DECSTAT= 4
$$ ##$DIGMOD= 1
$$ ##$DIGTYP= 12
$$ ##$DQDMODE= 0
$$ ##$DR= 21
$$ ##$DS= 4
$$ ##$DSPFIRM= 0
$$ ##$DSPFVS= 20
$$ ##$DTYPA= 0
$$ ##$EXP= <c13>
$$ ##$F1LIST= <111111111111111>
$$ ##$F2LIST= <222222222222222>
$$ ##$F3LIST= <333333333333333>
$$ [...]
$$ 90 74 58 42 26 10 0 0
$$ ##$Sgu3PowerLevels= (0..7)
$$ 0 0 0 0 0 0 0 0
$$ ##$Sgu4PowerLevels= (0..7)
$$ 0 0 0 0 0 0 0 0
$$ ##$Sgu5PowerLevels= (0..7)
$$ 0 0 0 0 0 0 0 0
$$ ##$Sgu6PowerLevels= (0..7)
$$ 0 0 0 0 0 0 0 0
$$ ##$Sgu7PowerLevels= (0..7)
$$ 0 0 0 0 0 0 0 0
$$ ##$Sgu8PowerLevels= (0..7)
$$ 0 0 0 0 0 0 0 0
$$ ##$SguType= 3
$$ ##$ShimPowMaxUA= (0..63)
$$ 130000 130000 130000 130000 130000 130000 130000 130000 130000 130000 130000
$$ 130000 130000 130000 130000 130000 130000 130000 130000 130000 0 0 0 0
$$ 0 0 0 0 0 0 0 0 0 0 0 0 0 0 0 0 0 0 0 0 0 0 0 0 0 0 0 0 0 0 0 0 0 0 0 0
$$ 0 0 0 0
$$ ##$ShimPowMaxUC= (0..63)
$$ 130000 130000 130000 130000 130000 130000 130000 130000 130000 130000 130000
$$ 130000 130000 130000 130000 130000 130000 130000 130000 130000 0 0 0 0
$$ 0 0 0 0 0 0 0 0 0 0 0 0 0 0 0 0 0 0 0 0 0 0 0 0 0 0 0 0 0 0 0 0 0 0 0 0
$$ 0 0 0 0
$$ ##$ShimPowMaxUG= (0..63)
$$ 524287 524287 524287 524287 524287 524287 524287 524287 524287 524287 524287
$$ 524287 524287 524287 524287 524287 524287 524287 524287 524287 0 0 0 0
$$ 0 0 0 0 0 0 0 0 0 0 0 0 0 0 0 0 0 0 0 0 0 0 0 0 0 0 0 0 0 0 0 0 0 0 0 0
$$ 0 0 0 0
$$ ##$ShimPowRcbType= 3
$$ ##$ShimPowRes= (0..63)
$$ 1e-20 1e-20 1e-20 1e-20 1e-20 1e-20 1e-20 1e-20 1e-20 1e-20 1e-20 1e-20
$$ 1e-20 1e-20 1e-20 1e-20 1e-20 1e-20 1e-20 1e-20 0 0 0 0 0 0 0 0 0 0 0 0
$$ 0 0 0 0 0 0 0 0 0 0 0 0 0 0 0 0 0 0 0 0 0 0 0 0 0 0 0 0 0 0 0 0
$$ ##$ShimPowRng0= (0..63)
$$ 1 1 1 1 1 1 1 1 1 1 1 1 1 1 1 1 1 1 1 1 0 0 0 0 0 0 0 0 0 0 0 0 0 0 0 0
$$ 0 0 0 0 0 0 0 0 0 0 0 0 0 0 0 0 0 0 0 0 0 0 0 0 0 0 0 0
$$ ##$ShimPowRng1= (0..63)
$$ 1 1 1 1 1 1 1 1 1 1 1 1 1 1 1 1 1 1 1 1 0 0 0 0 0 0 0 0 0 0 0 0 0 0 0 0
$$ 0 0 0 0 0 0 0 0 0 0 0 0 0 0 0 0 0 0 0 0 0 0 0 0 0 0 0 0
$$ ##$ShimPowRng2= (0..63)
$$ 1 1 1 1 1 1 1 1 1 1 1 1 1 1 1 1 1 1 1 1 0 0 0 0 0 0 0 0 0 0 0 0 0 0 0 0
$$ 0 0 0 0 0 0 0 0 0 0 0 0 0 0 0 0 0 0 0 0 0 0 0 0 0 0 0 0
$$ ##$ShimPowRng3= (0..63)
$$ 1 1 1 1 1 1 1 1 1 1 1 1 1 1 1 1 1 1 1 1 0 0 0 0 0 0 0 0 0 0 0 0 0 0 0 0
$$ 0 0 0 0 0 0 0 0 0 0 0 0 0 0 0 0 0 0 0 0 0 0 0 0 0 0 0 0
$$ ##$ShimSysFunc= (0..63)
$$ 1 2 3 4 5 7 9 11 15 16 8 10 12 14 6 17 13 18 19 20 0 0 0 0 0 0 0 0 0 0
$$ 0 0 0 0 0 0 0 0 0 0 0 0 0 0 0 0 0 0 0 0 0 0 0 0 0 0 0 0 0 0 0 0 0 0
$$ ##$ShimSysMatrix= 0
$$ ##$ShimSysType= 1
$$ ##$TFXNUM= 0
$$ ##$TRIPLO2= 0
$$ ##$VTU= 2
$$ ##$VTUETH= <149.236.99.20>
$$ ##$VTUTY= <no>
$$ ##$WBREFAM= (0..15)
$$ 135 116 100 100 100 100 100 100 100 100 100 100 100 100 100 100
$$ ##$WBREFLM= (0..15)
$$ 0 0 0 0 0 0 0 0 0 0 0 0 0 0 0 0
$$ ##$WBREFPH= (0..15)
$$ 71.66 -68.25 0 0 0 0 0 0 0 0 0 0 0 0 0 0
$$ ##$WBSGU= (0..15)
$$ 0 0 0 0 0 0 0 0 0 0 0 0 0 0 0 0
$$ ##$XFAC= 2
$$ ##END=
$$ 
##$DECIM=	760
##$DSPFVS=	20
##XUNITS=	HZ
##YUNITS=	ARBITRARY UNITS
##FIRSTX=	24231.369385662510467
##LASTX=	-2084.0185409410978536
##DELTAX=	-0.40154708059210514337
##XFACTOR=	1
##YFACTOR=	0.068633273364646932291
##FIRSTY=	30.5120697021484375
##MINY=	-6.2739148139953613281
##MAXY=	8515.087890625
##NPOINTS=	65536
##XYDATA=	(X++(Y..Y))
24231D44MNNkj1j1lMNkj1j6j7j5j4j4j2rmJJkl%QJ2J2QONM%mlKMJpj3j3j1pl%KKjkJOQNmj0
24210C31p%Ljpj0qljnj3k3k6k1rMJ4K2K9K6J8J2J3J4Rkj1j4j0lLQLqj8j9j6j3j1pJJ0J8K1
24192B93J9J5J4J3J1MkjMRJ0J1J2Pkj3j6j5j4j4j1mLQOkj2j8k0k1k0j6mJ0J6J2OPJ3J6J4P
24175C35jom%mj2k2k2j3JRJ3Plrpkkrj6j7j1%QJ1J1PPQRQOPONPJ6K4K7K1R%klmoj0j5j6j1
24155C35kLLjlOJ5J5Kj3k1k3k0j9j8j2nMJ1J3J1J3J8K2J6jj6k0j3jOMkpnKOONNOJoj4j8k1
24137B67k2j6nJ0J9K2K1K1K3K5J7Lrj2rjMJ1J3Poj8k2j6qjJjmnJRJ7K0J7Poj5j7j2pj%%jm
24118C17onmjjJLOQRLoj8k4k0qLPMlj0j2rkL%rj0mOJ2J0RPQPNPJ0J2J5K0K3J8Lj0j4j0prj0
24098C24rj0j2j3j3j2rnKMNLKJnj4k5l3l6k7j0QJ7J7J7J6J0JljRJ4J6J2RQJ1J4J4J3J5J7J1
$$ plain form
24231 444 448 453 458 456 445 434 431 435 440 438 427 411 394 379 365 351 339 330 326 327 328 326 323 323 331 343 355 363 369 374 378 378 374 371 373 377 378 371 358 345 334 327 324 324 326 328 327 325 326 332 340 345 341 331
24210 331 324 324 327 326 319 309 301 298 297 292 279 256 230 209 200 204 218 240 269 295 313 325 338 352 361 359 348 334 324 321 324 332 335 327 309 290 274 261 250 243 244 254 272 293
24192 293 312 327 341 354 365 369 367 366 370 379 389 400 412 419 417 404 388 373 359 345 334 330 333 341 347 345 333 315 295 274 254 238 234 244 260 272 278 285 298 314 328 335
24175 335 334 328 324 324 320 308 286 264 251 252 261 274 281 278 269 262 260 258 249 233 216 205 205 213 224 235 242 249 257 266 274 280 287 293 298 305 321 345 372 393 402 402 400 397 393 387 377 362 346 335
24155 335 333 336 339 338 335 341 356 371 373 360 339 316 296 277 259 247 242 246 257 270 281 294 312 334 350 349 333 313 300 299 305 309 307 300 295 297 303 309 314 319 325 326 320 306 288 267
24137 267 245 229 224 234 253 275 296 317 340 365 382 385 376 364 355 354 358 369 382 389 383 365 343 327 319 318 319 318 314 309 310 319 336 356 373 380 374 359 342 330 323 322 322 322 321 317
24118 317 311 306 302 301 300 301 304 310 318 327 330 324 306 282 262 254 257 264 268 265 255 243 234 232 235 235 226 216 212 218 230 240 249 256 264 271 276 283 293 305 320 340 363 381 384 374 360 350 343 334 324
24098 324 315 305 293 280 267 255 246 241 243 247 252 255 257 258 253 239 214 181 145 118 108 116 133 150 167 183 193 194 191 190 199 213 229 241 250 258 269 283 297 310 325 342 353
24080C53mj5j6j3j1j3j4pLJ0Nnj7k2j7j2plOJ7K3J9J0LKNJ3J9J8Qoj3j2pk%LNRJ5J9J9Pj1
24063C64k0j8nJ0K3L5L7K6Lk1m0m7m2k5mLok4l4k5qPJ2J0J3J7K1J9J5J1NJJOQNlpqj2k1k7
24046B55k1j0%L%nrj1j2j2qkRJ4J1%qpKJ1J5J5J2J0QPPLjlnmpj2j6j7j6j3p%NRJ2J9K5K4R
24027B79j0j7j2nmppnlmJJ2K8L6L1J7PMQRP%rk1l7n2n3l8j4NJ2RLKPJ4J7RjnNK0L0K8J5Kl
24008C10jKK%mmmnlKQJ1PJmrj3j4j2qlQJ7J6Npj2j3j3pKPmj9k6k0pJRJ6J6RJnrj2rKJ2J6J7
23988B50J7J4Kqj1rqj0pPK1K5J7Mpj4j8k1j8j0%Njj5k6k6j4KJ6K6L5M1L9K6Q%KRRLlj3k5l6
23970B78l7k6j0LJ2J9K2J8Qmj2j6j1omrj8k6k2j0NJ1QOJ1J5J4J6K7L8L9K4RNQPlj5k1k4j9
23953C10rJLkmjONkj1j3qkKLPJ3J6J5Qjj2j8j6rkj%%JPJ2J9K1J8J0Jpj5k5l3l6k7j0RJ8J3
$$ plain form
24080 353 349 334 318 305 294 281 267 260 263 273 278 273 256 234 217 205 198 195 201 218 241 260 270 273 275 280 293 312 330 338 332 319 307 300 298 298 301 306 315 330 349 368 375 364
24063 364 344 326 321 331 354 389 426 452 455 434 394 347 305 280 276 279 273 249 215 190 182 189 201 211 224 241 262 281 296 307 312 313 314 320 328 333 330 323 315 303 282 255
24046 255 234 224 224 227 227 222 213 202 190 178 170 168 177 191 202 202 194 187 189 200 215 230 242 252 260 267 274 277 276 273 268 264 257 245 229 212 196 183 176 176 181 190 202 221 246 270 279
24027 279 269 252 240 235 231 224 217 212 209 205 206 218 246 282 313 330 337 341 349 358 365 365 356 335 298 246 193 155 141 146 158 167 170 172 179 193 210 219 218 213 218 238 268 296 311 313 310
24008 310 309 311 313 313 309 305 301 296 293 295 303 314 321 322 318 309 296 282 270 262 259 267 284 300 305 298 286 273 260 253 255 262 258 239 213 193 186 187 196 212 228 237 238 233 224 212 203 205 217 233 250
23988 250 267 281 283 275 264 255 247 237 230 237 258 283 300 304 297 283 265 244 226 216 216 221 220 205 179 153 139 141 157 183 218 259 298 324 332 332 334 343 352 355 352 339 314 278
23970 278 241 215 205 208 220 239 261 279 287 283 271 255 244 238 234 225 207 181 159 149 154 165 173 179 190 205 219 235 262 300 339 363 372 377 385 392 389 374 353 329 310
23953 310 301 302 305 303 299 298 304 309 307 296 283 275 273 275 278 285 298 314 329 337 336 324 306 290 281 279 278 278 278 279 286 298 317 338 356 366 367 360 345 320 287 251 224 214 223 241 254
23935B54kj5j6rJLkonmj%jqj6j7j3njPK0L3L5K7J8K1L0L2K5RmnKKj2l3m3l6j9nJKlj3k2k6
23916A80k3j6oLJ3K0J8J1KJLMJjkkkkj%jnqj4k2k4j2J0K9L0J5nj8k5k4k3k0j4jJ4K9L5L7L3
23898B17K6J6J0J1J3J1PJoj6k2j5KJ3J5RMmj5k3k0qLQNkj1k2k9k7j6pnplRK2K6K0OkkOPJp
23880A99rpnl%LMOJ8L7N0M8L5J9Kj6l1l3k6j6j0ponkJMMPJ4K2K3J7Okj1k1k3k1j8j8k0j7n
23862A87QJ7K1K2K2K3J5jj8k4k2j7j0KJ4J4Jj1mK1M1M3L3K4J4kj9k6k4k6l5m0l3j3KKpj7j6
23847A61kK5M6M9L1J1NONnj6j5nLjj5k7k9k0j4j4k1k1j1OK4L6M0L6K8J4j1l6n1m8l2j7lQJ4
23831A34QjnKJ2J6J7J7J2OPJ7K4J6kk1l1l0j2J1K7K9K2K0K1J3lj8j9j6j2j6k3l2l5k9j6oO
23815A10J8K7K2Mj2j5pLQJ3J2Lrj5qMJ0Kj4k6k8k0qNJ9L2L8L8L2K6K3K2J9J4P%orn%Jnj8k9
$$ plain form
23935 254 252 237 221 212 213 216 214 208 203 199 198 198 197 189 173 156 143 138 137 144 164 197 232 259 277 298 328 360 385 394 390 385 387 389 377 344 301 265 246 241 242 244 241 228 206 180
23916 180 157 141 135 138 151 171 189 200 202 203 206 210 211 210 208 206 204 202 201 201 200 195 187 173 151 127 115 125 154 184 199 194 176 151 127 104 84 70 69 83 112 147 184 217
23898 217 243 259 269 280 293 304 311 312 306 290 268 253 255 268 283 292 296 292 277 254 234 226 229 237 242 240 229 207 178 151 135 128 123 116 113 122 144 170 190 196 194 192 198 205 206 199
23880 199 190 183 178 175 175 178 182 188 206 243 293 341 376 395 397 381 350 317 291 275 265 258 252 247 245 246 250 254 261 275 297 320 337 343 341 330 309 286 265 247 229 209 192 187
23862 187 195 212 233 255 277 300 315 314 296 272 250 233 223 225 239 253 254 243 239 260 301 344 377 401 415 413 394 368 344 318 283 243 210 197 199 201 194 177 161
23847 161 159 184 230 279 310 321 326 332 337 332 316 301 296 299 298 283 256 227 207 193 179 158 137 126 132 156 192 232 268 296 310 299 263 212 164 132 115 112 120 134
23831 134 142 141 136 138 150 166 183 200 212 218 225 242 266 282 280 259 228 198 186 197 224 253 275 295 316 329 326 308 289 273 261 245 222 190 155 126 110 104 110
23815 110 128 155 177 181 169 154 147 150 158 171 183 186 177 162 154 158 168 170 156 130 102 82 74 79 98 130 168 206 238 264 287 309 328 342 349 349 343 334 329 329 330 325 307 278
23797B78l4l1k4k0j8j6qJONjjLOMmj2qJQLj2k3j7MK2K7K2K0K3K3J9J1Lpj3j3pljLJ0J1Mj0
23779B34k2k4j8j2n%MNPPJ0J0Qkj5k1j4jRJ2J0J3J5Oj6l2k8nJ5K2J9J9K0J5Nknoqj0pKJ4K3
23762B51K3J4Koj1j4j4j2qojRJ9J6Jj4j7oMOjj2j9j2LJ8J9Qkol%%nj2j1oMPJ0J4J5R%lLMj
23742B57mNJ4J1mj5j3n%KPJ1RKj0j8j9j1%OMLLLmj1j3nNJ5K1K3J7RNJ0J8J9J1Jj0j9k7k9l1
23724B43l6l8l1j5JJ4K8M6N2L9J1j0j9k1k6l0l1k7k0j1m%jMJ6K9K9J3knMJ3J0%onkpj4j7j3
23708A61jJ0K0K2J9J5J7J9J0j1k7l2k5j7j5j4j5j5j6j1kMPRJ0PjqjJ3K6L2L2L4L4K5Roj4j4
23692B90j2j4j7k4k9l4l2k6j8qk%jkJOQMOJ8L6M6M0K4Mj3k2k0rLJ0Mmn%NRRJ2J3RNMPPMmj3
23672B75k3l0l3l1k2rOJ6J2kj3j4nKMLKMJ0J4J1MkOJ8K2J4Knqj3j4nJ0K1K2J1lj1j0JJ6K2
$$ plain form
23797 278 244 213 189 169 151 135 127 128 134 139 138 137 140 146 150 146 134 126 127 135 138 126 103 86 90 112 139 161 181 204 227 246 257 260 253 240 227 220 217 216 219 229 240 244 234
23779 234 212 188 170 158 153 153 157 162 169 176 186 196 204 202 187 166 152 151 160 172 182 195 210 216 200 168 140 135 150 172 191 210 230 245 250 248 243 237 229 219 212 214 228 251
23762 251 274 288 290 284 273 259 245 233 225 219 218 227 246 262 263 249 232 226 230 236 235 223 204 192 195 213 232 240 238 232 229 229 229 224 212 201 195 199 206 216 230 245 254 254 251 254 258 257
23742 257 253 258 272 283 279 264 251 246 246 248 255 266 275 277 267 249 230 219 219 225 229 232 235 238 234 223 210 205 210 225 246 269 286 295 300 310 328 347 358 359 349 330 303 274 243
23724 243 207 169 138 123 124 138 166 212 264 303 314 304 285 264 238 208 177 150 130 119 115 115 114 118 134 163 192 205 203 198 202 215 225 225 219 214 212 205 191 174 161
23708 161 160 170 190 212 231 246 263 282 292 281 254 222 197 180 165 151 136 121 105 94 92 96 103 112 122 129 128 120 119 132 158 190 222 256 290 315 324 318 304 290
23692 290 278 264 247 223 194 160 128 102 84 76 74 74 73 71 72 78 86 90 96 114 150 196 236 260 264 251 229 209 200 203 213 217 213 208 208 213 222 231 243 256 265 270 274 281 288 292 288 275
23672 275 252 222 189 158 136 127 133 149 161 159 146 132 127 129 133 136 138 142 152 166 177 181 179 185 203 225 239 241 236 228 215 201 196 206 227 249 260 257 246 236 237 253 275
23655B75K1J6J6J8J7Rok1k7k4j8j3j1j3j2pKJ1J7J5R%JJ2K8L7L1J7Pjj1k7m3n0m7l8k7j4K
23639A51J7K1J1mj3rLJ4J9J7J1KLJ0J5J4Pknmjjqj7j4JK2L0K1Lj4k2k1j5j0j0j4j6j8k2k6
23623A26k5j4mjllOK1L5M7N1M5L1J1qk4k8k6k3j6lJ5K2J3jLK1L4K6Kk2l2k9k4j7j2nJPOLM
23606B10J4K7K9J7%rqKONLONmj7k0j0Jlj2j5rnprpqj3j4pJlj3j6pNRJ2J6J9J1oj7j3JQJj0
23587A46j2kJ0J6J7K2L0L3K0jj3j1JJ0J1Pmj7k8l1k0LK8M1M0K8J7Orl0m7m6l1j3JQJ3J5Qj
23571B15plNRJ1J0QKklkkljMJ3K2K3J8Onj1j0kJ0K4L0K5J2lj3j7j3olrk0k5j6KJ3J2PK%pj7
23552B83k1k1j4nMJ0J2PJllprj3j7k0j6lJ3J9J2MLJ1J4J0Lpj8k7k8j8mNRJ2J5J5J8K0J7Q%
23535B71JNMmj1j0kMOLlonmrj9k3j8rpj2j9k1j4%J5K0J3%qpoj0j1j0mjkj0j8j9pJ1K9L5L6
$$ plain form
23655 275 296 312 328 346 363 372 366 345 318 294 276 263 252 239 227 220 222 233 250 265 274 274 275 287 315 352 383 400 407 406 395 368 325 275 228 190 163 149 151
23639 151 168 189 200 196 183 174 177 191 210 227 238 240 243 253 268 282 289 287 282 278 277 276 268 251 237 238 260 290 311 314 300 278 257 242 232 222 208 192 174 152 126
23623 126 101 87 83 82 79 76 82 103 138 185 236 281 312 323 315 291 263 237 214 198 195 210 232 245 244 247 268 302 328 330 308 276 247 223 206 194 189 190 197 203 206 210
23606 210 224 251 280 297 297 288 280 282 288 293 296 302 307 303 286 266 256 257 254 242 227 218 213 206 197 190 182 169 155 148 149 146 133 117 110 115 124 136 152 171 182 176 159 146 147 155 156 146
23587 146 134 132 142 158 175 197 227 260 280 279 266 255 256 266 277 284 280 263 235 204 184 187 215 256 296 324 341 347 338 308 261 215 184 171 172 180 193 208 216 215
23571 215 208 205 210 219 230 240 248 250 248 245 243 241 238 237 241 254 276 299 317 323 318 307 297 295 305 329 359 384 396 393 380 363 350 344 341 332 312 287 271 273 286 298 305 307 307 300 283
23552 283 262 241 227 222 226 236 248 255 256 253 250 243 234 221 204 184 168 165 178 197 209 213 216 227 241 251 254 247 229 202 174 156 152 157 166 178 193 208 226 246 263 271 271
23535 271 272 277 281 277 266 256 254 258 264 267 264 258 253 249 240 221 198 180 171 164 152 133 112 98 98 113 133 146 146 138 131 125 115 104 94 90 89 87 77 59 40 33 44 73 108 144
23516A44L9L9K6Kk0k3qMLj2k1k0j1lMJ0J3J3J4J3Pmj5j9j8j3pLJ6K6L1L0K4J7J3J0Kj1k4l0
23500B44k5k0j6j4j3j5j7j5mPJ2J1QJ0J8L0L8L6K4J5J0Olj3j6j2lPJ1J0QNLmj3j4j1j4k2k7
23484B22k0j3j6k4k1mJ3K5K8K5K0J7K1K6K2Poj1j6k2k7k2rNJ3J2Mqj8k2k3k2j6%J4J9J4Ok
23468A91onklj1k0k1j2jJ3K8L9L8K7J6J1RPQROJmrj4k1k1j4jQJ0QLnj5k3k4j9qNJ3J3Pkpk
23450B00J2K7L4L0J8kk6m7n2l6j0J3K6L1K9J3qk3k3j4nLQJ3J6J5PlqlKjqj2onj1k0k1j1%J2
23433A54K1K9K5Qpj2mJ2K4K9K2Mj6k9k7j6kKJlmmkLRJ5J5J5J5J3QMLNJoj4k0k1k1j8j0oop
23415A82lQJ8J6QlrqkPPmj5j7j1j0j4j2JJ8K9K9K2Qj1k4k0mJ4K0J9J4J0Mkmj2k6m2m9m1k3
23398F8lJ3K1K3K3K2J9J4Njmqj1j1nkJNJ1J4Opj3pNJ1QPJ2J9K2J9J1jj6l3l6k0KJ4Noj0kN
$$ plain form
23516 144 183 222 248 250 230 207 199 203 206 194 173 153 142 139 143 153 166 179 193 206 213 209 194 175 157 144 137 140 156 182 213 243 267 284 297 307 309 298 274 244
23500 244 219 199 183 169 156 141 124 109 105 112 124 135 143 153 171 201 239 275 299 314 324 330 327 314 298 286 283 290 301 311 319 324 327 323 310 296 285 271 249 222
23484 222 202 189 173 149 128 124 137 162 190 215 235 252 273 299 321 328 322 311 295 273 246 224 215 220 233 245 249 241 223 201 178 156 140 140 154 173 187 193 191
23468 191 185 180 178 175 164 144 123 111 110 123 151 190 228 255 271 282 291 298 306 315 321 322 318 309 295 274 253 239 238 246 256 264 267 262 247 224 200 181 173 178 191 204 211 209 202 200
23450 200 212 239 273 303 321 319 293 246 194 158 148 161 187 218 247 260 252 229 206 192 187 190 198 211 227 242 249 246 238 235 237 236 228 216 210 205 194 174 153 142 142 154
23433 154 175 204 229 237 230 218 214 226 250 279 301 305 289 260 233 217 215 217 218 215 211 207 205 208 217 232 247 262 277 290 298 302 305 310 311 305 291 271 250 229 211 201 195 189 182
23415 182 179 187 205 221 229 226 217 209 207 214 221 217 202 185 174 164 150 138 139 157 186 215 237 245 234 210 190 186 200 220 239 253 263 267 265 261 249 223 181 132 91 68
23398 68 65 78 99 122 145 167 186 200 205 204 200 192 181 170 165 163 164 169 180 194 200 193 180 173 178 189 197 204 216 235 257 276 287 286 270 237 201 181 183 197 202 196 186 184 189
23380A89J1J7J9J4Krj4j7j9k1j5mOJ2J2PJLJ1J9J7NpnNJ6K2K3J9Plj0j4k1l4l8k5NL1L7K6
23364B80PqqLJ5J5mk6l7k9j7qmJJ1J4Rkj1pPK5L3K8J4NMKrk5l6l5k3j1m%NJ2J4J2Jj0j8k0
23346A65k2k2k2j6oQJ9K5K9L5M1M0L2K6K4K3J6Mrj4j6j8j7j0ljj0k2k9k5j7j0lOJ5K0J8J1
23331B65jj3k2k4j9pOJ4J5QJkkknpm%LOJ1J4J2J0J0J7K3K0J0lj3j5j4j4j4rMK0K4J6jj9k9
23313B70k9j9lRJ2PL%jNQRMKNOjrj5j9k5k9k7j7oLJ3J7J2Kk%%pj3rnpj2j0nJOJ3J8J3PJ0K2
23294B07L3L2K2RJlLRRjj8l6n0n7n4m4l2j9nJ0K2K6K6K2J4PQJ2J3NmlQK1L2L7L1J3qk0k3k0
23277B35j4nRK0K3K0J4PLLNKnj2j8k3k7k7j9j1kJ0K0K5K6K4K0J1nj9k2j8j3qjKjj1j6j0jN
23260A96Mmj4k1j3MK2K7K0J0J%JJlj1j7k0j8j1jJ0J5Rmj9k5j8lQQKkNJ9L0L4L3L2K8J9jk2
$$ plain form
23380 189 200 217 236 250 252 243 229 212 193 172 157 153 159 171 183 190 191 194 205 224 241 246 239 234 239 255 277 300 319 326 323 313 299 278 244 206 181 186 217 254 280
23364 280 287 279 271 274 289 304 300 274 237 208 191 183 179 180 191 205 214 212 201 194 201 226 259 287 301 306 310 312 303 278 242 207 184 173 169 169 174 186 200 212 213 203 185 165
23346 165 143 121 99 83 77 85 104 129 158 193 234 274 306 332 356 379 395 399 390 376 360 342 325 315 312 311 301 279 250 225 208 198 195 201 216 236 254 265
23331 265 264 251 229 205 186 179 185 199 214 222 223 221 219 217 212 205 201 201 204 210 221 235 247 257 267 284 307 327 337 334 321 306 292 278 264 255 259 279 303 319 318 299 270
23313 270 241 222 219 228 240 247 250 250 249 254 262 271 275 277 282 288 287 278 263 244 219 190 163 146 140 143 156 173 185 187 185 185 185 178 165 156 151 144 132 122 117 118 124 137 155 168 175 185 207
23294 207 240 272 294 303 304 301 304 313 322 321 303 267 217 160 106 62 30 11 6 16 38 64 90 112 126 133 141 153 166 171 167 164 172 193 225 262 293 306 298 278 255 235
23277 235 221 216 225 245 268 288 302 309 312 315 320 322 317 305 287 264 237 210 191 180 178 188 208 233 259 283 303 314 309 290 268 250 237 229 228 230 229 218 202 192 191 196
23260 196 200 196 182 161 148 152 174 201 221 231 232 232 233 234 231 220 203 183 165 154 153 163 178 187 183 164 139 121 118 126 134 136 134 139 158 188 222 255 287 315 334 333 311
23243C11l5l6k6j4lQJ7J9J5RJ0J6K0J6J1J2K0K9K7J1oj8k0j3mLPNL%mj2k0k3j8j2j1j4j1o
23227B63jnpmKJ0J5J7J6J4J1RLnj4j5j0mjLNNKjkoj5k3k1j5rnJQNrk4k7k2j4qjOJ0J1J5K6
23208A89L7L7L1K5K2J8Qkpj2k0k8k9k1j1qj2j2oJMJkqj9l4l8k9j6rmNJ8K6K0PjLRRMljQJ5
23190A65J6J4J5K1J9Rknnprj0okkkKPJ1J3J4J5J5J8J6Oj3k8k4oJ4K4K5J9Qkj1j8k3l0l2l0
23173A99k2j2mJKLRJ8J9J0oj2qKJ4K3K5J5jpMJ6J5Mqj2j9l2m0l2j2LOLJ0K4L8M5M5M2L2J8
23156D18Moj1j2oKPLqj7k1k2j6kJ8L0K7J2%pj2j7k1j9j0%PQJpj1j0rj0j3j2j1rnjLlj7k8k7
23138A60j3NJ5J6J5J2Nrk0j9rJMPJ1J6J2NJjJJLQQONJ1K0K0J0jnkjlrj6k6l5l5k6j5qlPK0
23119A49K9K8J8Jj4k3k3j3NK2L0K2NplQJ5J3Jpqmjnj3j9j8j3j5j5j1jO%j1j4nOJ2J3J3J1M
$$ plain form
23243 311 276 240 214 200 197 205 222 241 256 265 275 291 311 327 338 350 370 399 426 437 431 413 393 380 376 379 386 391 394 394 390 378 358 335 317 305 294 280 269 263
23227 263 262 257 250 246 248 258 273 290 306 320 331 340 343 338 324 309 299 295 294 297 302 307 309 308 306 300 285 262 241 226 217 212 213 221 226 217 193 166 144 130 122 121 127 137 148 163 189
23208 189 226 263 294 319 341 359 367 365 358 346 326 298 269 248 237 229 217 205 199 200 204 205 203 195 176 142 104 75 59 50 46 51 69 95 115 122 121 124 133 142 146 143 142 150 165
23190 165 181 195 210 231 250 259 257 252 247 240 231 221 215 213 211 209 211 218 229 242 256 271 286 304 320 326 313 285 261 255 269 293 318 337 345 343 332 314 291 261 229 199
23173 199 177 165 161 162 164 167 176 194 213 223 217 205 197 199 213 236 261 276 275 268 272 288 303 307 299 287 268 236 196 164 152 155 161 164 174 198 236 281 326 368 400 418
23156 418 422 416 405 393 387 389 396 399 391 374 353 331 315 313 331 361 388 400 400 393 381 364 343 324 314 314 321 329 330 323 312 302 293 283 270 258 247 238 233 232 235 232 215 187 160
23138 160 147 152 167 183 198 210 215 206 186 167 158 159 163 170 181 197 209 214 215 214 215 216 219 227 235 241 246 257 277 297 307 306 301 299 298 295 286 270 244 209 174 148 133 125 122 129 149
23119 149 178 206 224 225 211 188 165 152 157 179 209 231 236 229 226 234 249 262 263 256 248 244 243 238 225 206 188 175 160 145 134 133 139 139 128 114 109 115 127 140 153 164 168
23102A68oj5j5j0JJ5K9L9L9L2K1J3J1J1PMkrj7k1k0j5rkQJ6J0pk8l7l3k5j5mJlj0j0OK4L0
23085A72K1Onj1j8k0j5mQJ5J6J6J7J8J9J5Plo%J3K1J7QjnpqoJNM%jQJ7J4lk2l4l8l9l6k2%
23067A34K2K7J8Mrj9k5k4j4ojRK7M3M3K4kk2k5j3OK0J9Qoj6k0j5p%LJ4K7L2K6J2Lkj2k3k2
23051B38j3mkJNOkj1j2mMJ0J4K2K8K5J2ok0k1j0%%npmMRQ%j0j3nOJ2RKnj4j9k5k6k8k6k1j7
23032H5j0JJ3K2K2J8J7K0J9J2Jqj2j3j7k0j6mJ1J5J0Jorj0p%QJ4J8J8J1JojPRNKlj2k2k5j8
23015A41j2j1j2j2rnNJ9K8K8K6K3J7Lj2j7j0noqnMJ1J0jj0rkQJ1NlrqKK1L6M2L6K5J3L%KJ
22997C54oj8k1j5qj1j9k7k5k1j7j4rmnjJ6L6L9J8pj5qlpj4j6j0kQJ9L0L4L8L8L4K7J5%j7l2
22980C54l5k5j6j7k4k1j2nk%LNNJ0J7J3Kqrnpj3j8j7j4j0KJ8K9K5Oj3k0j2JJ1J7K6L0K8K1
$$ plain form
23102 168 162 147 132 122 123 138 167 206 245 277 298 311 322 333 340 344 342 333 316 295 275 260 251 249 257 273 283 276 248 211 178 153 138 134 135 132 122 112 118 142 172
23085 172 193 199 194 183 165 145 130 126 134 149 165 181 198 216 235 250 257 254 248 248 261 282 299 307 306 301 294 286 280 281 286 290 290 289 297 314 328 325 303 269 231 192 156 134 134
23067 134 156 183 201 205 196 177 152 128 114 108 107 116 143 186 229 253 251 229 204 191 197 217 236 244 238 222 202 187 180 180 183 197 224 256 282 294 297 295 283 260 238
23051 238 225 221 219 220 225 231 229 218 206 202 206 216 230 252 280 305 317 311 291 270 260 260 260 255 248 244 248 257 265 265 255 242 237 243 255 264 266 261 247 228 203 177 149 123 102 85
23032 85 75 76 89 111 133 151 168 188 207 219 220 212 200 187 170 150 134 130 141 156 166 167 161 152 142 135 135 143 157 175 193 204 205 199 198 205 214 219 221 218 206 184 159 141
23015 141 129 118 106 94 85 80 85 104 132 160 186 209 226 229 217 200 190 185 179 171 166 170 181 191 190 180 171 169 177 188 193 190 181 173 175 196 232 274 310 335 348 351 351 353 354
22997 354 348 330 309 294 286 275 256 229 204 183 166 152 143 139 134 133 149 185 224 242 235 220 212 209 202 188 172 162 160 168 187 217 251 289 327 361 388 403 403 386 354
22980 354 319 294 278 261 237 216 204 199 197 197 200 205 210 220 237 250 252 244 235 230 223 210 192 175 161 151 153 171 200 225 231 218 198 186 187 198 215 241 271 299 320
22964C20J3Nmrj1j0j2j3j2j1j2j2nNNnj3j0kJjJNOLjpj7k6k8j7mRJ3J5J2J1J3J2RJkMJ1J3
22946B43J3J6K1K0Mj5k5k2j8j6j6j0KPOmj3j6qJ1L0L6K5Qoj3j7j5rnj3k0k1j1mk%KJpj3qM
22928A22J4K0K2K4J9P%QK4K9J3j6l5l0j1OQjj1j2mOJ3J7K1K4K4K2K5K8J7pl5m7m2k5j4j2j5
22913A96j6j0OK0K2J4PKnj3j3pJLNRJ3J1jj2j5q%MJ1J6K3K3J7QKJ%mj3k6l4k8nJ7K9K3J2M
22895B89%J%joj3j6j2onpj2j5j7j6nRJ8J8J4RPKmj1j5j5r%PNnj7j9j0JONmj7k7k4oJ3K1J8
22877A29J6J9J8J1NRK0K2Rj3k7l0k6j9j1MK5M2M3K6Mqj0qpj1j6k3k8k3rNJ1J1PNMNJ%NJ7K5
22859B29K1Rlonm%PJ0Jj0j7j5j2rpJJ0K2L4L5K5RJNJ2R%j1j7k1k5k8k6j8lRJ7J4J0J2J6K3
22842C04K7K2Oj3k4k0j3j6k7k8j7mMPJ1J5J3J1J2J3J0NKmj2j7r%Jj1k1j5JJ1J2PKj%NJ2J5
$$ plain form
22964 320 333 338 334 325 314 304 292 279 267 256 244 232 227 232 237 232 219 209 207 208 207 208 213 219 222 221 214 197 171 143 126 122 131 144 159 171 182 195 207 216 217 215 219 230 243
22946 243 256 272 293 313 317 302 277 255 237 221 205 195 197 204 210 206 193 177 169 180 210 246 271 279 273 260 243 228 219 214 201 181 160 149 145 143 143 145 146 139 126 118 122
22928 122 136 156 178 202 221 228 228 236 260 289 302 286 251 221 210 216 224 223 212 200 196 202 215 232 253 277 301 323 348 376 393 386 351 304 262 237 223 211 196
22913 196 180 170 176 196 218 232 239 241 236 223 210 203 204 207 212 221 234 245 244 232 217 209 209 213 224 240 263 286 303 311 313 314 314 310 297 271 237 209 204 221 250 273 285 289
22895 289 289 290 290 289 283 270 254 242 236 231 224 212 197 180 164 159 168 186 204 218 227 234 236 232 221 206 191 182 182 189 194 189 172 153 143 144 150 155 151 134 107 83 77 90 111 129
22877 129 145 164 182 193 198 207 227 249 258 245 218 188 162 143 132 136 161 203 246 272 276 268 258 250 243 232 216 193 165 142 133 138 149 160 167 172 176 181 182 182 187 204 229
22859 229 250 259 256 250 245 241 241 248 258 259 249 232 217 205 196 189 190 200 222 256 291 316 325 326 331 343 352 352 341 324 303 278 250 224 206 203 212 229 243 253 265 281 304
22842 304 331 353 359 346 322 302 289 273 246 218 201 197 201 208 219 234 247 258 270 283 293 298 300 296 284 267 258 258 259 248 227 212 213 224 236 243 245 244 244 249 261 276
22825B76J3R%j1k0k4k3j8j7j7j7j5rojLJ1J7J6J2RQRRJ2J5J2MJ%%lljkj0j9j8pQJ9K0J3Jp
22807B49rj1j8k5k2mJ6K7K8K7K5K1J6J1J0Plj8l3l9l2j7JJ4K1K2J9K0J9J7Q%jmj1k5l6l8l2
22791B00k1nRJ4J0NLMOQJ2K1L2L9L3J1j8l3l1j6mKOMLOJ8L1L2K3J0jj6l0l0j2J7M0M3L0Rq
22775D56j4j1pqqnjjnj2j7j9j6nNOjj0j5j5j3j3oRK9L7K9J4%nrj8k9l2k8j9rKJ0Pkj2j2nL
22756B25Njpj3j2qmkJNJ2K0K3J8Qlj2j4ropj3j1kJ0K1K4J9Mj8l5l8k8j5pJML%KRJ5J8K0K1
22738B23J8J4J2J1QOPJ4Rj6m7o1n0k5qjjMJ6L0L3K0%j4j6j7k1k4j8oPJ3J3J0J0J4K5L6M1L2
22722C01J7kj4j8j3j3j9k9l3k7j4JJ1J9K3K5K5J6%k0k8k0kJ7K7L0K9K2J1Kpj3j8k3k6k7k7
22707A83k4k0j2oprkJ4K8K7J1oj3mJ1K2K3J7J0QJ2K0K2J7Mrj3j1j3k1l3l6k8j1NJ8K0K2K8
$$ plain form
22825 276 289 298 298 287 267 243 220 202 185 168 151 136 127 121 120 123 134 151 167 179 188 196 205 214 226 241 253 257 258 258 258 255 252 251 249 239 220 202 195 203 222 242 255 256 249
22807 249 240 229 211 186 164 160 176 203 231 258 283 304 320 331 341 348 345 327 294 255 223 206 207 221 242 264 283 303 322 339 347 347 346 342 331 306 270 232 200
22791 200 179 174 183 197 207 212 215 219 225 233 245 266 298 337 370 381 363 330 299 283 279 281 287 291 294 300 318 349 381 404 414 413 397 367 337 325 342 382 425 455 464 456
22775 456 442 431 424 416 408 403 402 401 396 384 367 348 332 327 332 338 337 327 312 297 284 271 265 274 303 340 369 383 383 378 369 351 322 290 262 243 234 236 246 253 251 239 227 222 225
22756 225 230 229 222 209 197 189 185 183 184 189 201 221 244 262 270 267 255 241 232 226 219 206 195 193 203 224 248 267 271 253 218 180 152 137 130 131 135 138 138 140 149 164 182 202 223
22738 223 241 255 267 278 286 292 299 313 322 306 259 198 148 123 115 114 113 117 133 163 196 216 216 202 186 169 148 124 106 100 107 120 133 143 153 167 192 228 269 301
22722 301 318 316 302 284 271 258 239 210 177 150 136 137 148 167 190 215 240 256 256 236 208 188 186 203 230 260 289 311 322 324 317 304 286 263 237 210 183
22707 183 159 139 127 121 114 105 103 117 145 172 183 177 164 160 171 193 216 233 243 251 263 283 305 322 326 317 304 293 280 259 226 190 162 151 156 174 194 216 244
22692B44L6L6K1PQK3L6L0Rj6k7k2pMNpj7j3LJ3J3Nkj%Jnj4k5k9k5j2JKknKJ2J5Pqj8j5lRJ8
22673B87J9J5RMoj6k2j8j1oomRK4K7J7%pJJ3J7J0%pm%jj3k9m1l8k4qoj1j7j3JJ3K0J8J4J0
22656B20QJ1K0K5K1%k6m2m0k3mQP%j0j5j2pjOJ2J2Lj2j8j5njj%KNJ1J7J9J1jqnLJ0J3RKnj0
22638A94rlNJ2J5RKmplOJ2Rnj6j6mJ1K1K9L4K6Pj3k0j2JJ0J1PNPJ4K0K0J6Ork7m3m6m0l2k7
22620A73j9mJ4L3M5M4K9J2NRJ5J4J2J2J1Kj2k0k5l0l6l3j8jJ0J5J6J5J0KkjJnj5k6k2mJ5J9
22604B60Qnp%Lnj2j5j0nkKNOKjmnjRJ5J1Llmoj2j3lMkj5k2rQJ7J0%moqj3j5qQK2K4J5QMkj3
22583B14k3j9kJ4J6Qmj2qMJ8K5J9J0PJ1J7J9J9J8J4PJjjoj3k0k1j8j0kMOLmrj5k2k7k3j0J1
22566A95K6L0K3J5RRJ2J4J2Mk%RJ0Kj1k2k7l0k7j9qjpj6k2j5JJ5K0J5J3J4J3OLPJ0Kj3k1p
$$ plain form
22692 244 280 316 337 344 352 375 411 441 450 434 407 385 378 382 387 380 363 350 353 366 379 384 382 381 381 382 377 363 338 309 284 272 273 275 273 268 270 282 297 304 296 278 263 260 269 287
22673 287 306 321 330 334 328 312 290 272 261 255 249 245 254 278 305 322 322 315 316 329 346 356 356 349 345 345 344 331 302 261 223 199 191 185 174 157 144 145 158 178 196 210 220
22656 220 228 239 259 284 305 305 279 237 197 174 170 178 185 185 175 160 148 141 140 146 158 170 173 161 143 128 123 122 121 121 123 128 139 156 175 186 185 177 172 175 185 198 207 209 204 194
22638 194 185 182 187 199 214 223 225 221 214 211 217 229 238 233 217 201 197 208 229 258 292 318 325 312 292 280 281 291 302 309 314 321 335 355 375 391 397 388 361 318 272 232 200 173
22620 173 154 150 164 197 242 286 315 327 332 341 356 370 382 394 405 407 395 375 350 320 284 251 233 232 242 257 273 288 298 300 298 297 298 293 278 252 230 226 241 260
22604 260 268 263 256 256 259 254 242 227 217 212 210 212 217 223 225 224 220 215 214 223 238 249 252 249 245 239 227 214 211 215 213 198 176 167 175 192 202 202 198 192 184 171 156 148 156 178 202 217 225 229 227 214
22583 214 191 172 170 184 200 208 204 192 184 188 206 231 250 260 267 278 295 314 333 351 365 372 373 372 371 365 352 332 311 293 283 281 285 291 294 290 281 266 244 217 194 184 195
22566 195 221 251 274 289 298 307 319 333 345 349 347 347 356 366 368 357 335 308 278 251 232 224 223 216 200 178 163 164 179 199 214 227 241 254 260 263 270 280 282 269 248 241
22549B41K5N2O0M5J4j7l2l4k6j3jMKlpj2j9k9k7j6nLJ0J9K5K3J5Pjqj2oLOkj1j7j4qkknj0
22532B15j4j7j6j0%QOjpnjMRJ1Nrk3k6k2j3mLLnj0lJ8M2N3M7K6Lj5k1k3j9j7j1kPJ3J3RJl
22514A99qoLJ6K3Qk0m0m2k6nJ2K2K0Qlj1rJJ5K8L0J7mj8k2j9j0lJLJ2K9M3L9K0MLQMoj7j6
22496B83j2j2k3l3k9kK9M5M0K3Qmj3j9k1k2j9j0NJ9K8K9K4J3Joqrk0l2l4k0kJ0J3J2RNJPK0
22480B74L2L4K5Nj5k8k9k1j1lMJ3K1K3K0J6J1jj5k8l4l4l3k7j6ppj2j0kNLkJJ2K1K4K0J1%
22464B40j0j8k6l3l2j3J7M1M4K9J1KJoj8k6j9lRJ3J3J5J6J3PL%%KLJ%%J%nplKjqj4j7j7j0
22446A97KJ1J5J2RPKjJMN%moj1j3j1kMKnqj0j5j7j5j0pmJJ2K3L2L5L4L2K8K1Prk1k4j7j0%
22428B76J2K1K1Pj4l5m6m6l8k6k0j9j5qLJ5K3K5K0J0Lknoo%QJ4J7J6J4J0JmnopoKJ7L1L5K8
$$ plain form
22549 241 266 318 378 423 437 420 388 354 328 315 314 318 320 317 310 298 279 250 223 207 202 205 215 234 259 282 297 304 303 295 283 277 280 286 284 273 256 242 234 232 230 225 215
22532 215 201 184 168 158 158 166 172 171 164 159 158 162 171 182 187 178 155 129 107 94 90 93 96 91 81 78 96 138 191 238 264 267 252 231 208 189 172 161 159 166 179 192 201 202 199
22514 199 191 185 188 204 227 235 215 175 133 107 102 114 136 156 164 161 150 141 142 157 185 215 232 228 210 188 169 159 156 157 160 172 201 244 283 303 307 310 318 322 316 299 283
22496 283 271 259 236 203 174 172 201 246 286 309 317 313 300 281 260 238 219 209 214 233 261 290 314 327 328 322 314 305 285 253 219 199 197 207 220 232 241 246 247 254 274
22480 274 306 340 365 370 355 327 298 277 266 263 267 280 301 324 344 360 371 370 355 327 293 259 226 199 183 176 169 157 147 145 150 153 151 152 164 185 209 229 240 240
22464 240 230 212 186 153 121 108 125 166 210 239 250 252 253 247 229 203 184 181 190 203 216 231 247 260 267 270 270 270 272 275 276 276 276 277 277 272 265 262 264 263 255 241 224 207 197
22446 197 199 210 225 237 246 253 255 254 255 259 264 264 260 254 243 230 219 217 221 223 218 210 200 185 168 153 143 136 132 133 145 168 200 235 269 301 329 350 357 348 327 303 286 276 276
22428 276 288 309 330 337 323 288 242 196 158 132 112 93 78 70 73 88 111 136 156 166 169 167 162 156 150 150 158 172 189 205 219 229 230 226 221 215 208 202 204 221 252 287 315
22410C15J7PJlpj2j9k4k1j0mrj8j9rOJ3J5J9K5K7K0Qkj3k3l1l3k9k0j1%J1K0J8Mj1j8j4nM
22394A65RJ2Nmj4j4q%KJLJ1J5J1LNK0L1K5PnplLJ1J7J7QJNJ3J7J0mk0l2l1k2j5j5j6rjKPJ9
22375B35L5M0K8J0jrj5j8j1l%orrnnj0j0lQJ4Q%lMJ2J2PJqj6k0j7rl%JJlrpMJ5J5QKjnj0n
22355B30J0K8L4K7J2JonKMmj6k4k2j9k0k1j6rnnjKJrj6j4pKJ1J8K0Rpj8j6lQJ0O%noon%PJ2
22336A69J1NKLJ2J8J5kk0k8j9nKjmkNJ0O%ml%%op%J1J7J5J0M%pj3j6j2nk%jlnj2k0j8pNRM
22316A11Jmj1j9j4KJ4J2LKRJ4J2J5K5L4L6L0K6J8Nj2k6l2k9j8mQJ2J1J2J0kk6m2m0j8MJ5J7
22300A61J9K2K5K1J1kj3j7j5oMJ5K1J8Nj1k2k3j3jJ3K1K3J7QJknqnLJ1J2PLJmj1j3lJ0J5Q
22283C01ok0k9k9k0roqoOJ7J9J1%nmKLlj2j3lQQJm%NPOKqk0k4j0J1K0J1lj3j7k4l0k6j2MJ0
$$ plain form
22410 315 332 339 340 337 330 318 299 275 254 244 240 231 213 194 185 191 204 219 238 263 290 310 318 316 303 280 249 216 187 167 156 156 167 187 205 209 198 180 166 161 165
22394 165 174 186 191 187 173 159 151 151 153 154 157 168 183 194 197 202 222 253 278 285 280 273 270 273 284 301 318 326 327 332 345 362 372 368 348 316 285 263 248 233 217 208 207 209 216 235
22375 235 270 310 338 348 347 338 323 305 294 291 291 285 276 267 262 257 247 237 234 242 256 264 264 261 265 277 289 296 297 289 273 253 236 227 224 224 225 226 223 214 207 211 226 241 249 251 250 245 235 230
22355 230 240 268 302 329 341 342 336 331 333 337 333 317 293 271 252 232 211 195 186 181 176 175 177 178 169 153 139 132 134 145 163 183 192 185 167 151 148 156 166 172 172 167 161 155 150 150 157 169
22336 169 180 185 187 190 202 220 235 233 213 185 166 161 163 162 158 156 161 171 177 177 173 170 170 170 164 157 157 168 185 200 210 214 214 207 194 178 166 161 159 159 158 155 150 138 118 100 93 98 107 111
22316 111 112 108 97 78 64 66 80 92 95 97 106 120 132 147 172 206 242 272 298 316 321 309 283 251 222 204 200 208 220 231 243 253 251 225 183 143 125 129 144 161
22300 161 180 202 227 248 259 257 244 227 212 206 210 225 246 264 269 258 236 213 200 199 212 233 256 273 281 282 280 275 267 262 265 276 288 295 298 299 295 284 271 268 278 293 301
22283 301 295 275 246 217 197 188 182 174 168 174 191 210 221 221 216 212 214 217 214 202 189 186 194 202 203 199 199 204 211 217 219 211 191 167 157 168 188 199 196 183 166 142 112 86 74 78 88
22264H8RJ0J8K6K9K2J3J0J5K1J3pl0l9l4k1oJ1K6L0J9jj6k2j9j6j1qm%PJ2J2J0OPPOMMQQK
22247B19lmMJ3J7J2LppkMNOPPLnj0ql%%MJ2J7J5Qlrj0pnjMJ0J2OjmkLOONKjjJORQJj5l0l5
22224B62k0kMpk1k2j2JOKpj5k1j5mOKj1k2j8mJ1J7K1K6L1K8J7KqoKQMpj6j4p%knopj1j2qL
22206A43J3J8J4Jj0j4j0KJ3J9J8J0%rj0n%lj6k1j1RJ9Pj0k0j9j2qkMNlroKRJ3J2P%%NJ0J2
22187A67RO%rj6j3kJ1K2L4M3M0K8J7RLpj8k4k3j2JJ3J6Rkrj5k0k0j1ooj3j8j8j6j1kQJ2Ql
22170A62j1j1mNQNKMQP%pj0j0j0j2j4j2plklljkoj0qmKORJ0Loj0lRJ3J2J2J7K7L0K7K2J8J4
22151B63Olj1j6k2k6k4j7rnJJ5K5K6J6J2J3J5Mqj3pJMlj1j7j5qJRJ1J1NkonlmlKQJ4J9J9J8
22132B80J4J5J1Lrj7j2qj1j7k1k6k9l2k3j0nj1j7j4jJ4K7K7J7OJ0K3L0K3J3QQKj0j9j8rOJ9
$$ plain form
22264 88 97 107 125 151 180 202 215 225 240 261 274 267 237 198 164 143 137 148 174 204 223 222 206 184 165 149 138 130 126 126 133 145 157 167 173 180 187 193 197 201 209 217 219
22247 219 216 212 216 229 246 258 261 254 247 245 249 254 260 267 274 277 272 262 254 251 251 251 255 267 284 299 307 304 295 285 278 273 272 276 286 298 304 303 299 297 300 306 312 317 319 318 317 318 324 333 341 342 327 297 262
22224 262 242 240 244 237 216 194 182 183 189 191 184 169 148 133 129 135 137 126 104 86 82 93 110 131 157 188 216 233 235 227 221 223 231 235 228 212 198 191 191 189 184 178 171 160 148 140 143
22206 143 156 174 188 189 179 165 155 157 170 189 207 217 217 208 198 193 193 190 174 153 142 151 170 177 167 147 128 116 108 106 110 115 112 103 97 99 108 121 133 140 140 140 145 155 167
22187 167 176 182 182 173 157 144 142 153 175 209 252 292 320 337 346 349 342 324 300 277 265 266 279 295 304 302 293 278 258 238 227 221 215 202 184 166 150 139 137 145 157 165 162
22170 162 151 140 136 141 149 154 156 160 168 175 175 168 158 148 138 126 112 100 93 90 88 85 82 81 79 73 63 55 51 53 59 68 78 81 75 65 62 71 84 96 108 125 152 182 209 231 249 263
22151 263 269 266 255 239 217 191 167 150 141 136 137 152 177 203 219 231 244 259 263 255 242 235 236 240 237 226 209 194 186 187 196 207 218 223 221 215 210 207 203 200 202 210 224 243 262 280
22132 280 294 309 320 323 314 297 285 277 266 249 228 202 173 141 118 108 103 92 75 61 60 74 101 128 145 151 161 184 214 237 250 258 266 268 258 239 221 212 218 237
22116B37K6K4J9J6K0K0J3jj7k7k6j6jJ3K3K4Rj4k8k5j0%%pj1j1j0mLPPKpoNK3K7Rj7k9k4j6
22100B20j2j0jJ0J3PJ%jk%MNPRJ3J3RPJ2K2K8K7K2J3Kj5k9l3l0l0l2l5l3k3j0QK9M0L5J9K
22083B81j0j8k4j9kK3M2L9J8j1l0l4k7k2k3k7k5j4kOOMJ1K3L2K3Lj0oRK0J8J0Ljqj7k7k9k1
22067A64oRK0K8K9K2Orj1jRPlk0l0l4k7j6oqj5k1k0rNJ9L1L6L3K8K6K5J8Kj3j9j5rqrmOJ6
22049B26J9Rpj6j1kLOJ4K6L0K0P%koj8k6k4j1QK4L5L0J7Lklmqj3j5j9k8l8m1l3j9kJ2K1K2
22032A84J4OLJ1J9J7PnrkJ3K3K4J8J1PLnj4j3rpj3k0k2k0j6j1lKNNRJ6K0J4POJ4K5K8J6ok7
22015C25l9l2j2J0J7J0lj0rmmrj5j5pOJ4J4J0RJ3J8J6J1kj4k2k2j6rjMQJ1J7K0J8Prk0k5j9
21998B40lJ2J9J4MMJ0J7J7J3Moj4j5j4j7k1k1j7j5j1KJ7K5J7Lqj5j9j4n%lnjMjj3j7oPPnj5
$$ plain form
22116 237 263 287 306 322 342 362 375 374 357 330 304 288 287 300 323 347 356 342 314 289 279 279 279 272 261 250 240 236 239 246 253 255 248 242 247 270 297 306 289 260 236 220
22100 220 208 198 197 207 220 227 228 228 227 225 225 229 234 241 250 263 276 285 292 304 326 354 381 403 416 418 403 374 341 311 281 249 214 181 158 148 156 185 225 260 279 281
22083 281 271 253 229 210 208 231 273 312 330 319 289 255 228 206 183 156 131 117 115 121 127 131 142 165 197 220 223 213 207 216 236 254 264 267 266 258 241 214 185 164
22067 164 158 167 187 215 244 266 272 263 252 251 260 267 264 244 214 180 153 137 131 123 108 87 67 58 63 82 113 149 182 210 236 261 279 281 268 249 234 225 217 208 204 210 226
22049 226 245 254 247 231 220 218 221 227 241 267 297 317 324 324 322 316 298 272 248 237 245 269 304 334 351 354 352 349 345 337 324 309 290 262 224 183 150 131 129 141 162 184
22032 184 198 204 207 218 237 254 261 256 247 245 258 281 305 323 334 341 344 339 325 312 303 296 283 263 241 221 205 194 191 193 198 203 212 228 248 262 269 275 289 314 342 358 352 325
22015 325 286 254 242 252 269 279 276 266 257 253 249 240 225 210 203 209 223 237 247 256 269 287 303 314 312 298 276 254 238 229 228 232 240 251 268 288 306 313 304 284 259 240
21998 240 237 249 268 282 286 290 300 317 334 347 351 345 331 316 302 285 264 243 226 211 200 202 219 244 261 264 256 241 222 208 203 203 200 195 194 198 197 184 167 161 168 175 170 155
21980A55j5qqk0l2l4k5j2%PJ3J8K3L1L8L9L3K5K1J8J1%oqnlpj2j4rKJ2J3J1NKJJLKKMQJ2Q
21962C00kj7l3m0l4j4J0K7L3L0J8%j7k3k0j1KJ3K0J9J4Pjqj0rnlkklorj0rqmJKjkNJ2Lj0j5
21944A88lJ0J4J6K4L7M1L1J1j0j9j6lJ0J4J1Kpj2j1lMLkj1j8k3k4j9pMJ4J8J2Jnokj%KLKK
21926B72OJ2J6J2MkponJMMmj2pOJ4Lj9l6l4k5j2mkj3k6k6nK1L2K7K2K0J8J1OOJ0J4J1Lpj4
21908B89j6j4j0onnnlJKnj3j5j3rjQJ7J5MjPK0K3J2kj0j1j0j2j3j0jPJ0LklLJ1J4RKkj%%l
21889B56kJjnojJ0J9K3J6kk5l4k2lJ3K3K8K6J2rk8l5l2k4j1KJ3J4J2J0J3J6J4Nqj5rNJ5J5
21873B89QjnjRJ7J8Rlj3j9k2k3k4k2j4lRJ1Npj5k0j5oj%kjPJ9L0L5L3K4J6RKoj4k5l5m1l2
21855A80j1J1J6Mj4k6l3l5k4mJ5K7L0L2L1K3J1kj3k5k9k0KJ9K0RLJ0K0J8OjMJ1J3Pjqj3j3
$$ plain form
21980 155 140 132 124 104 72 38 13 1 1 8 21 39 62 93 131 170 203 228 249 267 278 278 272 264 259 256 249 237 223 214 216 228 241 252 257 259 260 261 264 266 268 272 280 292 300
21962 300 298 281 248 208 174 160 170 197 230 260 278 278 261 238 218 207 209 222 242 261 275 282 281 273 263 254 249 246 244 242 239 233 224 214 205 197 193 194 196 195 193 198 210 213 203 188
21944 188 185 195 209 225 249 286 327 358 369 359 340 324 321 331 345 356 358 351 339 328 325 329 332 330 319 301 278 254 235 228 232 246 264 276 277 272 266 264 263 263 265 268 270 272
21926 272 278 290 306 318 322 320 313 307 302 303 307 311 307 295 288 294 308 311 292 256 222 197 185 181 179 166 140 114 109 130 162 189 211 231 249 260 266 272 282 296 307 310 303 289
21908 289 273 259 249 243 238 233 228 225 226 228 223 210 195 182 173 172 180 197 212 216 215 222 242 265 277 275 265 254 244 232 219 209 208 215 225 228 226 223 226 237 251 260 262 260 259 259 259 256
21889 256 254 255 254 249 243 242 252 271 294 310 308 283 249 227 224 237 260 288 314 326 317 289 254 222 198 187 189 202 216 228 238 251 267 281 286 278 263 254 259 274 289
21873 289 297 296 291 290 299 316 334 343 340 327 308 286 263 239 217 203 200 209 220 225 218 203 183 168 162 161 161 159 158 165 184 214 249 282 306 322 331 333 327 313 288 253 212 180
21855 180 169 180 196 200 186 160 127 92 68 64 79 106 136 168 199 222 233 231 218 193 164 144 146 165 185 194 197 207 227 245 251 250 254 265 278 285 284 276 263 250
21839B50nQJ9J9Pj4l0l4k5j1kNJ2J9J4Kj1j2pKJ0J7K3K9L5L8K9Rj3k1j7j2j6k2k4j8j1ppp
21823B21nKPQQQKj0j9j9qjlj2k1k4j8kJ1J5J1RJ6K5K6J6kj7k4j8mPJ0OLMRJ5K3K7K7K5J9Q
21805C61rk1k1j3prj3j2nLOMjprpLJ2J4J1RJ1J2RLJMKoj2j3j0j0qjJ1J9K4K4J6%j4k0j2jO
21787C24Jj4l2m1l6k0jJ9L6M2K6Jk0k5k1k0k0j7j1lNJ0J0QQJ2J4J3J0J1J6J9K0J7Pj3l1l5
21771B69l0k2j3kJ3J9J5RPJ2Rjj4j9j1JOLmpkJrk5l9m4l9k4%K7M6M5K6Lj2j9k0k0j7j1KJ3
21755A22J9K1J9K0K5L1L2K8K1J6J1NJjllk%%j%PJ1Ppj7j9j2pqj5j8j3%RJ1POLLNJ1J4RJno
21736C38j1j8k3j9j1lJKJklnmjMPOMK%pj7j5mQPnj5j8j2nKQRPNOJ1J3R%j3j9j8j5j9k5k5j2
21716A06QK6L5L4K5RkokQJ1RJmkJmj2j4pMRPMLNRJ5K1K3J8Oqj8j7nJ0J8J6Jj9m0m9m2k3oK
$$ plain form
21839 250 245 253 272 291 298 284 254 220 195 184 182 187 199 218 232 234 223 211 204 206 216 233 256 285 320 358 387 396 383 362 345 333 317 295 271 253 242 235 228 221
21823 221 216 218 225 233 241 249 251 241 222 203 195 194 191 179 158 134 116 114 125 140 151 160 176 201 227 243 241 224 200 182 178 185 195 201 204 208 217 232 255 282 309 334 353 361
21805 361 352 331 310 297 290 281 268 256 251 254 260 264 263 256 247 240 243 255 269 280 289 300 312 321 324 325 329 331 325 313 300 290 280 272 271 282 301 325 349 365 365 351 331 319 318 324
21787 324 325 311 279 238 202 182 181 200 236 278 304 305 285 260 239 219 199 182 171 168 173 183 193 201 209 221 235 248 258 269 285 304 324 341 348 335 304 269
21771 269 239 217 204 202 215 234 249 258 265 277 286 285 271 252 241 242 248 251 247 240 238 239 230 205 166 122 83 59 59 86 132 177 203 206 194 175 155 135 118 107 109 122
21755 122 141 162 181 201 226 257 289 317 338 354 365 370 371 370 367 364 362 362 362 361 361 368 379 386 379 362 343 331 324 316 301 283 270 270 279 290 297 303 306 309 314 325 339 348 349 344 338
21736 338 327 309 286 267 256 253 254 256 257 255 252 247 243 242 246 253 259 263 265 265 258 241 226 222 230 237 232 217 199 187 182 184 192 201 208 213 219 230 243 252 252 239 220 202 187 168 143 118 106
21716 106 114 140 175 209 234 243 241 235 233 241 252 261 262 258 256 257 253 241 227 220 224 233 240 244 247 252 261 276 297 320 338 344 336 318 301 296 306 324 340 341 322 282 233 191 168 162 164
21697A64JlkOJ9L2L9L9L4K2Mk0l9m4k9pJ0J4P%jJkj1k0k1j6qjjmpnLRPjqqkLPPJ1J8K6K9K1
21678B73Lj0j0kNPM%rk0k2j4MJ8K0J2%rqLJ6K4K1J7J8K2K0Rkj1j4j6j5j5j4j4j1mPJ4J6J8
21661C31J8J6Qnj2rjLjqj1j1plloj0rjOP%lMJ4J5Mj1j7j3rj0j2j1qjMJ2J7J5Nj0j6j2JRJ4
21642B73K1L3L7K6NrqmmmKJ1J2RMJlmJJ0J0%j5k7l2l0k0nJ2K1J8Mj9l2k7oJ3J9J2Mj%JNRJ3
21624C36J3Omj0j0onpqnjMJ1J6J1kj4j2%J0J1J2J7J5Kj4k2j6rpj2j5j1KJ7K5J8Kj6k7l0k8
21607B37k4j9j6j8j7qRJ9J7J2J7L0L7K7J1KMQNok0k7j9%K1L0K3Rknm%jllnrj6j6kJ4K3K1J2
21589C48Kqj2kJ2K1J9J1Jqj5j4j4k3l3l5k5j3rnKJ0J2QKnqnPJ6J6PjomLJ2J8J4QMJ0K1L0L2
21571D01J9jk0l2l8m5m4l0pJ5K9L3K7J2nj2qmpj4j5pNJ0O%kkqk1k7j9nLNOJ4K1K3J9J0%qq
$$ plain form
21697 164 165 162 160 166 185 217 256 295 329 351 355 335 296 252 223 216 226 240 247 247 246 247 245 234 214 193 177 169 168 167 163 156 151 154 163 170 169 161 153 151 154 161 168 179 197 223 252 273
21678 273 276 266 256 254 259 266 270 270 261 241 219 205 209 227 247 259 259 250 242 245 261 285 306 323 341 363 383 392 390 379 365 349 334 319 305 291 280 276 283 297 313 331
21661 331 349 365 373 368 356 347 346 349 348 340 329 318 311 308 305 299 289 280 279 285 292 292 289 293 307 322 326 315 298 285 276 266 254 243 235 234 238 250 267 282 287 277 261 249 250 259 273
21642 273 294 327 364 390 395 386 378 374 370 366 368 379 391 400 404 405 402 398 399 409 419 419 404 377 345 315 295 290 302 323 341 345 326 294 267 261 274 293 305 309 308 308 309 314 323 336
21624 336 349 355 351 341 331 325 320 313 305 300 299 303 314 330 341 339 325 313 313 323 334 346 363 378 380 366 344 328 319 312 300 285 274 276 293 318 336 338 322 295 265 237
21607 237 213 194 178 160 143 135 144 163 180 192 209 239 276 303 314 316 320 328 333 327 307 280 261 261 282 312 335 344 342 337 333 333 332 329 326 321 312 296 280 278 292 315 336 348
21589 348 350 342 330 328 340 361 380 391 392 384 369 355 341 318 285 250 225 212 203 198 200 210 222 230 232 227 219 214 221 237 253 260 259 253 249 252 264 282 296 304 308 318 339 369 401
21571 401 420 419 399 367 329 284 240 210 203 218 247 280 307 319 314 302 294 290 283 269 254 247 252 262 268 268 266 264 256 235 208 189 184 187 192 198 212 233 256 275 285 285 277 269
21553B69pnkQJ3Pj1k3k0j3j6k5l1k6j5nknppplQK4L6L7L0K4J7Oqj5j0nj0k6m2m9m5l2rRJ9
21536B6K0J6J1QOJ5K7L4K7J2%jORQOQJ0Lj2k6l1k5j2JROjnLJ7K4K3K2K2K1Rrk6k9j9kJ0J6
21519B37J4Kj5l1l7k9j0PJ8K3K5L0L5L8L4K7J6J0QPN%no%N%olJ1K4J7ok8l4k3pKlj6k4j5K
21501B99J6J9J3QNJ1J9K1J3kj5k6l7m3m0k9k0j7j3JK0L9N0M9L9K3Nj0k4l8l9k3LK1J9QJOJ5
21486C47K3K1R%mnj3k9l6k7pRJ3J5K0K9L2K4J0nj3j8j8j9j7j0lJkorrj1qjOJ0PLklpqm%lr
21467B73j3j1qqj2j7k0k4k1j3jORQPOQJ0J1J3J8K2J7Jk1l2l2k4j4kJ0J5J0%n%J4K6K9K1J0
21450B66OJ1J7J4N%%%lnNK5M2L9J6j0k5k9l0l3l5l5k8j8oNRPQJ3K1K4K3J5jk1l5l7k7rOJ8
21433B08K2J8J4J7J7J1oj7k3k1j7j4j1j5k1k3j5lPJ4J5J4QLOJ5J7Rpj8k3j9pJ0K3K7K0J0M
$$ plain form
21553 269 262 257 255 263 276 283 272 249 229 216 200 175 144 118 103 98 96 91 84 77 70 67 75 99 135 172 202 226 243 249 241 226 216 211 201 175 133 84 39 7 -2 7 26
21536 26 46 62 73 81 87 102 129 163 190 202 202 201 207 216 224 230 238 248 251 239 213 182 157 145 146 155 161 160 155 158 175 199 222 244 266 287 296 287 261 232 213 211 221 237
21519 237 251 253 238 207 170 141 131 138 156 179 204 234 269 307 341 368 384 394 402 409 414 414 409 403 403 408 408 402 399 410 434 451 445 417 383 360 353 355 352 336 312 297 299
21501 299 315 334 347 355 360 371 390 411 424 422 407 381 344 301 261 232 212 195 182 183 203 242 292 341 380 403 408 398 374 336 297 274 277 298 317 325 326 332 347
21486 347 370 391 400 400 396 391 378 349 313 286 279 288 301 316 336 365 397 421 431 426 413 395 377 358 341 331 328 329 327 321 312 303 292 284 283 289 299 306 309 307 304 297 289 285 285 282 273
21467 273 260 249 241 233 221 204 184 160 139 126 125 131 140 148 155 161 169 179 190 203 221 243 260 261 240 208 176 152 138 136 146 161 171 171 166 166 180 206 235 256 266
21450 266 272 283 300 314 319 319 319 319 316 311 316 341 383 422 438 428 403 374 344 311 276 241 213 195 189 194 203 210 218 231 252 276 299 314 313 292 257 220 193 184 190 208
21433 208 230 248 262 279 296 307 301 284 261 240 223 209 198 183 162 139 124 121 128 142 157 171 179 182 188 203 220 229 222 204 181 162 155 165 188 215 235 245 249
21418B49K%lrqmKJqj3j0JJ2J8J9K1K2K1Rj3l4m3l6j4J2K7K7J3jnlknnKLnj5j5oOQLkolKRJ1
21398B32J0QOOJ1K1K8K4J0nj3j7k0k6k9l0k5j2MJ7K1J8J6J6J4RM%lj1j7k0j6j3j3j1nLLjo
21382A88kLJrj4rMJ2J1QNQQPRJ1J4J4J3J2J0MmqqjPJ6K1J5jk1l2l1k1rmmrj2rjPJ7K6K8K3
21363B93J2jj2k2k3j4kLjolLRK0L2L8K8J0koml%Mlj3j8j0KMnj9k9l3l0k2j3nmjOJ5J8J1lj0
21344A91q%OMJlnnkKPPMkqrlKMlj0j0oKJ0K1K7K0Mj1j5j1prj3j6j5pRK4K9J8KojRJ4RJj0j8
21324B14k2j8nJ3K4K0J0J%PJ6K3K2J7J2J3J7J9J2Kqj6j8k1k1k3k3k1j7j1opnJJ5K6L1K8J8
21308C19Mj1k0k4k7l2l2k4nJ0J7J5QLLOJ0O%%QJ4J4RQJ1J2OjjMOJqj0pmrj9l1l6l0j3RK8L0
21290B17K3K0K4K4J4jj1j3roJRJ2Lj1k4l0k8j6KJ7K0J0pk5m2m5l2oK0L6L9L5K7K1J7J2Omj2
$$ plain form
21418 249 251 251 248 239 231 227 229 230 222 209 199 200 212 230 249 270 292 313 322 309 275 232 196 182 194 221 248 261 260 255 252 250 245 240 242 245 240 225 210 204 210 218 221 219 213 210 212 221 232
21398 232 242 250 256 262 273 294 322 346 356 351 338 321 301 275 246 216 191 179 183 200 221 239 255 271 285 294 298 298 295 284 267 247 231 218 205 194 189 192 195 194 188
21382 188 186 189 190 181 167 158 162 174 185 193 198 206 214 221 230 241 255 269 282 294 304 308 304 296 288 287 294 310 331 346 345 324 292 261 240 231 227 223 214 202 193 192 199 216 242 270 293
21363 293 305 304 292 270 247 233 231 234 233 227 224 227 236 256 288 326 354 364 362 356 352 349 349 353 350 337 319 309 311 315 310 291 262 229 199 177 164 159 155 154 160 175 193 204 201 191
21344 191 183 183 189 193 194 191 186 181 179 181 188 195 199 197 189 180 177 179 183 180 170 160 154 156 166 187 214 234 238 227 212 201 194 185 172 156 141 134 143 167 196 214 216 210 209 218 232 241 242 232 214
21324 214 192 174 169 182 206 226 236 237 237 244 260 283 305 322 334 347 364 383 395 397 389 373 355 334 313 290 267 246 229 218 212 205 200 201 216 242 273 301 319
21308 319 323 312 292 268 241 209 177 153 148 158 175 190 198 201 204 210 220 226 226 226 234 248 262 271 279 290 302 308 307 306 310 316 317 309 299 292 288 279 260 229 193 163 150 159 187 217
21290 217 240 260 284 308 322 321 310 297 288 282 283 292 304 307 296 272 242 214 198 200 217 237 247 240 215 173 128 96 90 110 146 185 220 247 268 285 297 303 299 287
21274B87j0JJ9L0K4Qnmjj0l0m1l1nJ4J6Lj0j6j1n%OJ7K3J5oj9j4kKjnlJKmj6k5k7j5JMnj5
21256A37j1lKMRJ6K0J6J4J6K2K4K0J5RLpj3j3kQJ0%j2k1k5k4k0j7j1lPJ5J6J3Nqk5l6l2j6
21239A02KJ2J8K2K3K1J7J7J8K0J6J1NLPJ6K0J5jj7k4k0j3j0j4k2k4j8qkOJ8L2L7K6J0%%jk
21223C18mmoomKJpk0k6j9qLQJ6K8M0M2L1J4mj5k0k4k8l3l0j9j0pj1j3j1pjPJ3J1%j0j0kRJ6
21205B00K4K5J6MjKKkomJMMQJ4J4Lj3k5l1l0k2j1KJ0QMLPJ9K8K9J2j3l3l4k3rKNLlpnNJ6K3
21186B25K0J2KjlooLJ4J7RjMJ2J3Mmmoj4k1j3QK1K3J5Lj0k0k5k4k0j7j7j6j2lRJ7J9K0K7L1
21169B85K0nk8l3k6j6pKQJ2RKqj2mJ3K6K6J3L%MLmj8k6k5rOJ0NKRK0K5K7L2L5L2J9J1RPmk0
21151D30l2l4k9j9j2j4j8j4KJ9K4J4%j5l0l8l6k3j2omljLNKormQJ0MJJ4L0L8L0J6Mlm%NKl
$$ plain form
21274 287 277 278 297 327 351 359 354 350 349 339 309 268 237 232 246 262 265 255 239 228 223 223 229 246 269 284 278 259 245 243 245 244 239 236 237 239 235 219 194 167 152 153 157 152 137
21256 137 126 123 125 129 138 154 174 190 204 220 242 266 286 301 310 313 306 293 280 278 286 296 296 284 263 238 214 194 177 166 163 170 185 201 214 219 211 186 150 118 102
21239 102 104 116 134 156 179 200 217 234 252 272 288 299 304 307 314 330 350 365 364 347 323 303 290 280 266 244 220 202 194 192 198 216 248 285 311 321 321 321 320 318
21223 318 314 310 304 298 294 296 297 290 270 244 225 217 220 228 244 272 312 354 385 399 395 380 360 336 308 275 245 226 216 209 198 185 174 167 166 173 186 197 197 187 177 175 184 200
21205 200 224 249 265 269 268 270 272 270 264 260 261 265 269 277 291 305 308 295 270 239 209 187 176 178 188 196 200 203 210 229 257 286 298 285 252 218 195 186 188 193 196 193 186 181 186 202 225
21186 225 245 257 259 258 255 249 243 246 260 277 286 285 289 301 314 318 314 310 304 290 269 256 264 285 308 323 326 316 296 271 247 227 210 193 177 165 162 171 188 207 227 254 285
21169 285 305 300 272 239 213 197 190 192 200 212 221 223 215 203 199 212 238 264 277 280 280 284 287 283 265 239 214 205 211 221 226 228 237 257 282 309 341 376 408 427 438 447 454 450 430
21151 430 398 364 335 316 304 290 272 258 260 279 303 317 317 302 272 234 198 175 163 157 153 150 149 152 157 159 153 144 140 148 158 162 163 177 207 245 275 291 295 292 288 288 293 295 292
21133B92lQK1K4J9Rjqj4j8k2k4k3j7qljnj3j3qKMkrj6k0j7mJ9L6M3L7K3Mj0j6j1lJKMJ0J5
21115B84J1Jno%Lmj4j4%J5J7NprlLOjj0j4nJ4L3M0L1Pk1m1m0k2JJ8J8Mj7l2l2j8jQRJ0J0J1
21097B43J3K2K7K2Oj0j8j6j4qkMLJJMMLJKlj0j0lKlpjJ3J8Pqj1%J0J1LmkMJ1J5J9K0Rqj7j0
21078C33LJ2J2J0Nmj6k2j6o%%mrj1rkLNNNok2l4k8j2LJ1J5J2QKOQJj5k2j0J2K3J9J2OJlol
21059B72PJ1MoqLJ6K1J8J4J0Mmpnk%klnpolmj1j8j7r%KJnqmQK0J8Kj2j5j0j0j2j1mMOPJ4K5
21039B79L1K5J2KkKOQLqj8k2k2j6j0mkrk0k1j2KJ2J6J5J2Mmqqpm%KNJ2K1K4K3J6RKloooj0
21020C15j5j3mPJ8J7QmoNJ6J6J0QJ6K5K9K5J6QL%oj4j9j7j6k3l2k9j1PJ1PJok1l7m5m1k7j1
21003A71KJ0J5J8K4K8K4J1mj4j3lNOpk1k8k1rnrj8k3k0j6j3oRK3K9K2J4J4J6J4J1J4J8J6O
$$ plain form
21133 292 289 297 318 342 361 370 369 361 347 329 307 283 260 243 235 232 231 226 213 200 192 194 198 196 187 171 151 134 130 149 185 228 265 288 292 282 266 255 252 253 255 259 269 284
21115 284 295 296 291 285 285 288 284 270 256 256 271 288 293 286 277 274 277 283 282 272 258 253 267 300 340 371 378 357 316 276 254 255 273 291 295 278 246 214 196 195 203 212 222 232 243
21097 243 256 278 305 327 333 323 305 289 275 267 265 269 272 273 274 278 282 285 286 288 285 275 265 262 264 261 254 253 266 284 291 283 272 272 282 293 296 292 290 294 305 320 339 359 368 360 343 333
21078 333 336 348 360 370 375 371 355 333 317 311 311 311 307 298 287 278 276 279 284 289 294 288 266 232 204 192 195 206 221 233 241 243 249 257 258 243 221 211 223 246 265 277 283 284 281 275 272
21059 272 279 290 294 288 280 283 299 320 338 352 362 366 362 355 350 348 348 346 343 338 331 325 322 318 307 289 272 263 263 265 266 261 253 249 257 277 295 297 285 270 260 250 238 227 223 227 233 240 254 279
21039 279 310 335 347 349 347 349 355 363 366 358 340 318 296 280 270 266 264 255 235 214 202 204 216 232 247 259 263 259 251 243 236 232 232 234 239 251 272 296 319 335 344 346 343 337 331 325 315
21020 315 300 287 283 290 308 325 333 329 323 328 344 360 370 378 394 419 448 473 489 497 500 500 494 480 461 444 428 405 373 344 333 340 351 358 359 353 332 295 250 209 182 171
21003 171 173 183 198 216 240 268 292 303 299 285 272 269 274 280 273 252 224 203 194 189 180 162 139 119 103 90 84 93 116 145 167 181 195 211 225 236 250 268 284 290
20987B90j1k6l5l0j5PJ7J7RN%lok%mp%J0J2KpoJ1K8L6K8J5Lnj0j4j1mJok1k9k0jJ3J8J3Kj0
20969B54j5oQJ6Rqk3k9l0k7k1j2jNJ0J6K5L1K6J1%MK1L5L6K1jj7k4k5k5k9l3l1k5j5mJ1K9
20954A67M3M9M6L1Nk5m9n1l5j4jJkorj0rplNJ7K9L8M0L6K9J6Kpj1rrj2j5j1m%lrqkRJ8K4K4
20935C08J6J1J3J6J1K%J2K3J8jj6j6j3j4j5j4rj0j2j2j0oJJ0J3Lj3k1k4k6k8j9JK3L6L8L3
20920C09K2J0KJjqj6j4nKNPNkqmJ3K5J9Lj0j4j3j2j4k0k6k9k5j6j1oJJ5K1J5jj4k0j7j3q%
20903A48RJ9K2K0J9J8J7Roj9k2j2JJ0J5J7K3K5K4J6Onj7k4k1rQJ3Mj1k1k4k0j4kJ0J9K1J4
20887B80kk1k9k6j3kjpj9k2j4LK1L2L3K7K1J4Noj2j1nkj0j9j7KK3L6L8L8L7K8J6Lk%kj3l4
20871C68m8m6k9rjlnKJ6K4J7Kj4k2k2k0j7j3rqo%J5K7K4QnpLJ2J6J7J7K1K4K0Mj9l5l5k1r
$$ plain form
20987 290 279 253 218 188 173 180 197 214 223 228 228 225 219 217 217 213 206 206 216 228 230 223 217 228 256 292 320 335 338 333 323 309 298 294 295 289 268 239 219 218 231 249 262 264 254
20969 254 239 233 241 257 266 258 235 206 176 149 128 116 115 120 130 146 171 202 228 239 239 243 264 299 335 356 355 338 314 289 264 235 202 171 146 131 127 138 167
20954 167 210 259 305 336 341 316 267 216 181 167 166 167 165 159 150 140 131 124 121 126 143 172 210 250 286 315 331 333 326 315 306 297 285 270 259 255 255 252 243 235 233 242 260 284 308
20935 308 324 335 348 364 375 377 377 389 412 430 429 413 397 384 370 355 341 332 322 310 298 288 282 283 293 306 309 296 275 251 225 197 178 179 202 238 276 309
20920 309 331 341 343 344 343 335 319 305 300 302 307 314 319 317 309 305 318 343 362 365 355 341 328 316 302 282 256 227 202 186 175 169 170 185 206 221 220 206 186 169 156 148 148
20903 148 157 176 198 218 237 255 272 281 275 256 234 222 223 233 248 265 288 313 337 353 359 354 337 313 292 283 291 304 308 297 276 252 232 218 216 226 245 266 280
20887 280 278 257 228 202 189 187 186 179 160 138 124 127 148 180 213 240 261 275 280 274 262 251 246 244 234 215 198 200 223 259 297 335 372 400 416 419 417 417 415 402 368
20871 368 320 274 245 236 235 232 227 229 245 269 286 288 274 252 230 210 193 180 171 163 157 157 172 199 223 231 226 219 222 234 250 267 284 305 329 349 353 334 299 264 243 234
20854B34rj7j9j1NJ6J7PkojJ1K2K4J7Qjqj3j6j5j3j4j1nQK2L5M2M2L2J8OKjJOOpk8l4k8k1
20837C01k5l2k4j2opnJL%%NJ4K0K5K6J5mj8j6ooj8k9l1l0k8k1qOJ2J2J2J5J6J4OjpmJ2L3M4
20819B54L9K3Nkm%%oj2j0lLK%%nk1l8l9k2lQJ0PKpj2rnproNJ6K3K3J6Jj4k0j7oOJ2J0%pkR
20800A88K0K5K4J7Lj6k8l0k3j6j1lLPJ1Oqk2k4qJ4K8M0N0N4M1J7qk7l9m4l0jK5L3K2Lj6k5
20784B52k6j5lPJ5K5L3L5L1K4J7J0Jknrj4j9k5k6k2j4kPJ3J4J6J6J6K1K2J7Orj5j4nNJ3J6
20768D07J0Koj2j4j3j3j4j6j5j2j0ojNJ0J0PMNPOkj0j5j4qjOJ4J8J7J5J7K2J3pk4k2rKLjJ
20750C56LJlmkPJ8K5K2Oj8l3l2j8JJ3J3QORJ0Pkrj2qkKJnplMOPMMLOQLlrp%J1K2L0K3Mj9l1
20729D16l1k0nRJ5Qpj8j9j2%J2J8J9K0J7J1lj8k2j8qKJ0J8J8J4Qlj5k4k1pMLoj0lPJ6K1K2
$$ plain form
20854 234 225 208 189 178 183 199 216 223 221 215 214 225 247 271 288 296 295 287 274 258 243 230 216 205 200 208 230 265 307 349 381 399 405 407 406 407 413 419 412 384 350 322 301
20837 301 276 244 220 208 202 195 190 191 194 194 194 199 213 233 258 284 299 295 277 261 255 249 231 202 171 141 113 92 84 90 102 114 126 141 157 171 177 176 169 165 177 210 254
20819 254 293 316 321 319 315 315 315 309 297 287 284 287 289 289 289 284 263 225 186 164 161 169 179 186 188 181 169 160 155 148 139 133 138 154 177 200 216 217 203 183 166 160 166 178 188 188 181 179 188
20800 188 208 233 257 274 277 261 233 203 180 164 153 150 153 160 171 177 169 147 123 115 129 157 197 247 301 342 359 351 324 285 241 211 210 235 268 290 293 277 252
20784 252 226 211 208 215 230 255 288 323 354 378 395 405 406 404 399 390 376 357 332 306 284 270 268 275 288 302 318 334 350 371 393 410 416 407 392 378 373 378 391 407
20768 407 417 419 413 401 387 374 361 347 331 316 304 294 288 287 292 302 312 319 323 328 335 341 339 329 314 300 292 291 297 311 329 346 361 378 400 413 406 382 360 351 353 356 355 356
20750 356 359 360 357 353 351 358 376 401 423 429 411 378 346 328 329 342 355 363 369 378 388 395 393 384 372 364 362 364 365 360 353 350 354 360 367 371 375 378 384 392 395 392 383 376 376 387 409 439 462 466 447 416
20729 416 385 365 360 369 384 392 385 367 348 336 336 348 366 385 405 422 433 430 412 390 372 364 366 376 394 412 426 434 431 416 392 371 364 368 371 365 355 352 359 375 396 418
20713D18J9J1Kqj3j3j2j5j6j4qnj0j1pJMMJ4L1N1O2O3N4M3L5L7M1L6J7lj2j2j1j5k0j8j1%
20697G09RJ7K4K8L2L5L5L4L5M3N8P6R6J18J35J40J35J28J33J40J39J19Q7N1K1lk4m2n5n7m8
20685B348l7k6j2RL5N6P0Q6J07J30J53J75K00K32K70L13L56L97M48N23O30P70R48J177J467
20674A0825J839K320K941L727M687N812P067Q361R565J0545J1153J1235J0652R342P350M797
20668A22218J848j273m284o904q933j0282j0935j0927j0366r412q244p004n802m724l817l083
20662A8076k497k032j668j386j171j001q64p48o46n59m82m13l49k98k59k28j99j77j66j58
20654B775j42j14q4n7l3j6jJ4K8L7M2M8N5N0K5j7o0r9j28j50j58j53j45j35j23j08r4q3p1
20642A103n4l7k6l0m1n1n0m0k5j4rrrj0j2j4j8j9j4nKJjLQJ1Plj4k6k9k4j6j0j0j0j1j4j8
$$ plain form
20713 418 437 448 450 442 429 416 404 389 373 359 351 346 336 325 318 319 323 327 341 372 423 485 548 602 645 680 717 758 794 811 808 796 784 773 758 738 720 709 709
20697 709 718 735 759 787 819 854 889 923 958 1001 1059 1135 1231 1349 1484 1624 1759 1887 2020 2160 2299 2418 2505 2556 2577 2574 2550 2508 2453 2396 2348
20685 2348 2311 2285 2273 2282 2317 2373 2443 2529 2636 2766 2919 3094 3294 3526 3796 4109 4465 4862 5310 5833 6463 7233 8181 9358 10825
20674 10825 12664 14984 17925 21652 26339 32151 39218 47579 57144 67689 78842 90077 100729 110071 117421 122218
20668 122218 124066 122793 118509 111605 102672 92390 81455 70528 60162 50750 42506 35502 29700 24976 21159 18076
20662 18076 15579 13547 11879 10493 9322 8321 7457 6709 6063 5504 5022 4609 4260 3962 3703 3475 3276 3099 2933 2775
20654 2775 2633 2519 2435 2378 2345 2329 2328 2342 2370 2407 2449 2497 2552 2602 2627 2610 2550 2451 2323 2173 2015 1862 1717 1582 1459 1351 1257 1174 1103
20642 1103 1049 1012 986 956 915 864 814 774 749 735 726 717 708 698 686 672 654 635 621 616 618 619 618 621 629 640 647 644 630 604 575 551 535 525 515 505 494 480 462
20626D62j6pJ%qj9k8l5l8l4k6j5qmkNJ7K9L2L1K8K5K1K1K5L2K8J1pj5j2lOJ0Kj4k7k9k5j7
20610C97pNJ2Nj2k1k0j5pMJ8K7K9K9K5J4j1l8n4m7k5%J2J3QJ0J7K1K1J5J0MJ%PJ5J6QjjLL
20593D90lrj1rj2j6j6j3j6k7l5l0j4%OJpj4j2mL%qj1qjLQK0K8L0K0Oj0k3l1l0j7%J8K5J8%
20576B89j5j6pNRO%knqj3k1k8k7j6kMK%NJ4J6J1QJ2K0K6K4J7RPJ1J9K1J8J3Pjj0j5oKLoj3
20558C67j0lJKMJ1J6J3Kj4k7l1k7k1j6j5j0n%J%LRJ1Nnj3pQK4L0K6J6QM%oj2j5j3mNJ2Rjp
20540C25%PNj0j9j6qmmmmj2k0j7KK3L1K7J9J2Nkqj6k3k2j6j3j3j6j5j1j1q%J2K2K6K1Oj1k2
20523B18j5LJ7K1J8J7J7J6J4J5J4Rkj6k7k8k0j1kNJ0RJmLJ5K2K0J8J7J3OJOJ5K0K0J4Pjpj5
20506D53k8m3m7l1qPJ2J3J5J4Qkj4k5l3l0k3j7j2mOOoj4qJ0K4K5K0J8J6J8K2K5J9Omj0j2j2
$$ plain form
20626 462 446 439 440 440 432 413 385 350 312 278 252 237 229 225 223 228 245 274 306 337 365 390 411 432 457 489 517 528 521 506 494 491 497 507 509 495 468 439 414 397
20610 397 390 395 407 412 400 379 359 344 337 341 359 386 415 444 469 483 472 434 380 333 308 308 320 333 341 351 368 389 410 425 435 439 440 440 447 462 478 486 485 484 487 490
20593 490 487 478 467 458 446 430 414 401 385 358 323 293 279 279 285 286 279 265 253 249 252 252 244 233 225 224 227 235 255 283 313 333 339 329 306 275 245 228 228 246 271 289 289
20576 289 274 258 251 256 265 271 271 269 264 256 243 222 194 167 151 149 153 155 155 160 174 190 201 209 221 241 267 291 308 317 324 335 354 375 393 406 413 412 402 387 381 383 386 380 367
20558 367 357 354 355 357 361 372 388 401 403 389 362 331 304 283 267 252 242 237 237 238 238 241 250 261 266 261 248 241 249 273 303 329 345 353 357 357 351 339 324 311 307 312 324 333 332 325
20540 325 325 332 337 327 308 292 284 280 276 272 268 256 236 219 221 244 275 302 321 333 338 336 328 312 289 267 251 238 225 209 194 183 172 164 164 176 198 224 245 251 240 218
20523 218 203 206 223 244 262 279 296 312 326 341 355 364 362 346 319 291 271 260 258 263 273 282 283 279 282 297 319 339 357 374 387 393 394 400 415 435 455 469 476 475 468 453
20506 453 425 382 335 304 296 303 315 328 343 357 365 363 349 324 291 261 238 221 209 205 211 217 211 197 189 199 223 248 268 286 302 320 342 367 386 392 388 378 366 354
20490C54j4j5j6j6j9k5l1k9j7njmkPJ7K3K9L6L4J9ql1l7k8oJ7L4L7K9J9J2Kj2k1k0oJ0K0J8
20474C54J1NMRJ2J1Omj0j2j3j6k2k5k4j3%J4J9J5PNRJ0Okqj3k0k2j3LRJj1j4pLJ3J6J4Kj0
20457B99j3lJ5K6K7J8J1Lqj9k9l4l9m0l3j5RK2K4K1J9J8J2QJ3K4L4L1J9Kj3k4k7k6j7nLOL
20441C22JlmJJ1K3K5J8Olj0j2rjLMNJ1J5J2Mjlj0k1k6k4k0j5j0j%pj2j3j0j0j6j8j5qOK2L3
20423B40K7Qj2j9j5jJ0J5J5J5J5J5J4Rjj3k2k3j8j5j8j9qRK6L1L1K7K1J1%rj3rkKKkpj0j3
20407B94j6k1k2j6lPO%rj0lOJ0Jj4k0j7nLQJ0J1RJ3J9K1J0jJJ5K1J0oj0oqk2l8m0k8mK1L2
20390B09K3Qkmkoj1j1mQJ7J5jj5j4kOK%OJ3J5J1RPJpj4j5j5j7j4j2o%J3K1K3J6J0QROQJ8K9
20371C39K5Oj6k8k6j8pKJ0J4J1Mqj5j8j6j3j1qKJ7K7K6J7OMRJ2Pmj9k9l2k7j8oLRJ2J2Pkq
$$ plain form
20490 354 340 325 309 293 274 249 218 189 172 167 166 162 160 167 184 207 236 272 306 325 317 286 249 221 215 232 266 303 332 351 363 365 353 332 312 306 316 336 354
20474 354 365 370 374 383 395 406 412 408 398 386 373 357 335 310 286 273 273 287 306 321 328 333 342 352 358 356 348 335 315 293 280 283 292 293 282 268 261 264 277 293 307 309 299
20457 299 286 283 298 324 351 369 380 383 375 356 327 293 254 214 181 166 175 197 221 242 261 279 291 299 312 336 370 401 420 422 409 385 358 332 315 310 313 319 322
20441 322 323 320 316 317 328 351 376 394 400 397 387 375 366 365 368 372 377 388 403 415 419 418 415 405 384 358 334 314 299 289 288 288 281 269 256 246 236 220 202 187 179 185 207 240
20423 240 267 275 263 244 229 228 238 253 268 283 298 313 327 336 335 322 300 277 259 244 226 207 199 208 234 265 296 323 344 355 355 346 333 324 322 324 326 324 317 307 294
20407 294 278 257 235 219 216 223 229 229 220 210 207 213 223 224 210 190 173 168 171 179 189 200 209 222 241 262 272 271 272 287 308 318 312 302 296 288 266 228 188 160 156 177 209
20390 209 232 240 238 234 232 226 215 204 200 208 225 240 239 224 210 208 214 216 216 222 235 250 261 270 277 278 271 257 242 227 210 196 184 178 178 191 212 235 251 261 269 278 284 292 310 339
20371 339 364 370 354 326 300 282 275 277 287 301 312 316 308 293 275 259 246 235 227 229 246 273 299 316 322 326 335 347 354 350 331 302 270 243 225 219 222 231 243 255 262 260 252
20354B52rpqrmNJ5J4NlokJNONJmppolmrk3l1k7j0MJ0RJ2J7K2K3K3K1J7NmnKRJ4J4J5J4J4J6
20334C82J4%k0l3l0j9pnj4k5k8j9kJ2R%n%RJ2Rjj1j6j1kNJ2K1K9L2K7J8RLKORPLJMKqk0k8
20316C33k9k7k3j2NK1K7K3J1jnkPJ5K2K4K1J4Kj1k6l9m1k9j5rj2j5j0MJ5J9J8J9K6L3K9J5
20301C97KnkKKoj5k3k6k4j8j1lMPJ0J5K3K3J3mj9k1j5mPROmj3k0k3j7pLJ1J9K8K8J1j3l1l1
20283B65k1j3mMJ2J7K1K2J5NjJL%nmQJ6J8J5RLlorj4j8j8j4prj6k4k6k2j9k2k6k4rMJ1RQJ4
20265A46K0K6L3L8L7K8K1J9J5Lj2k1k2j8j0LJ2J0KPK1K7J2j0j9j4nJJlj3k5k9j9kJ2K2K4K2
20250C40K1K6L3K9J5lj3j4j2j1j1j9l2l8l3j5JQN%mj2k8l7l3j2MMj3k6k8k0j1JJ6L0L7L6L0
20234B11K2J2RRJ1J0J4K3K9K4J3QQNlrqj0j7j7kJ6J9RKNQKpoLQNjJPJ0Mrk4k9k8k3j6rjJm
$$ plain form
20354 252 243 236 228 219 215 220 235 249 254 251 245 243 244 249 255 260 261 257 250 243 237 234 230 221 198 167 140 130 134 144 153 165 182 204 227 250 271 288 293 289 284 286 295 309 323 338 352 366 382
20334 382 396 396 376 343 313 294 287 282 268 243 215 196 194 206 215 215 210 210 219 231 240 239 228 212 201 199 204 216 237 266 298 325 343 352 355 357 363 372 379 382 383 387 389 381 361 333
20316 333 304 277 254 242 247 268 295 318 329 328 323 321 328 343 365 389 410 424 426 415 389 350 309 280 265 256 244 229 219 223 238 257 275 294 320 353 382 397
20301 397 399 394 392 394 396 390 375 352 326 302 284 273 270 274 281 291 306 329 352 365 361 342 321 306 302 309 318 324 320 307 287 264 247 240 243 254 273 301 329 340 327 296 265
20283 265 244 231 227 231 243 260 281 303 318 323 322 323 326 326 321 317 325 341 359 374 383 386 383 377 368 354 336 318 304 297 288 272 248 222 200 181 159 133 109 100 104 115 124 132 146
20265 146 166 192 225 263 300 328 349 368 383 386 374 353 331 313 303 306 318 328 330 337 358 385 397 387 368 354 349 350 351 348 335 310 281 262 260 272 294 318 340
20250 340 361 387 420 449 464 461 448 434 422 411 400 381 349 311 278 263 264 272 277 277 273 261 233 196 163 151 155 159 146 120 92 72 61 62 78 108 145 181 211
20234 211 233 245 254 263 274 284 298 321 350 374 387 395 403 408 405 396 388 378 361 344 342 358 377 386 388 393 401 403 396 390 393 401 406 405 406 413 423 427 418 394 365 337 314 298 289 288 289 285
20215B85j1j4pj%noonlMJ3J3NmlJ0K0K3K2J7J0KljLOMPJ5K0J4kk0l1l5l3l0k6j6jJ7K6K3J7
20197C13J4J7J4lk0k3j2JPPRQlj5k1j9j6j1kJ1J7J3Mloj2j5j1kQJ8K8K8J5oj9j5kOP%pj2j6
20179B74j5pJNLMJ6K9K7J0qrLJ6J7Qrk4l5l7l5l2k7j8lJ2K8L7L7K3Nqj7k2k3j3LJ5J9J9K0
20162B89J7Lj5k7k8k1j5j0qj0mQJ8K0J7J7K2K8K5K0J3Mj1k4l0k7k0j2lNJ0QLJMJ0J0Mmnrj8
20146B55l2l7k7j1kll%NJ0J3K0K4K3J6Opk1k8j8%QKplJ1J7J1J%LMJLOJ1J8K9M2M9M8L7J9p
20128D86l5n3n3l9k3j4j1qlPJ8K3K7K8K8K6J9J2N%noqj0j8k7k9k2j4j1roKOJ0J4J8J5QPJ1
20111C66J0lj8k1j7j2j2qkkqqJJ4J5J0OPOJlnqrolkpj4j8j8j5j6j9j6nJ0K0J8RJJNJ2J3J0
20093B60MLQJ0MkJRJ5J4Qjj1k2k9k5j8j1j0roKJ1K2L0L7M0L5K5J1LKM%j0k2l2l8l9k8rJ2K2
$$ plain form
20215 285 274 260 253 252 252 247 241 235 230 227 231 244 257 262 258 255 265 285 308 330 347 357 359 356 355 358 364 368 375 390 410 424 422 402 371 336 303 273 247 231 230 247 273 296 313
20197 313 327 344 358 355 335 312 300 301 308 315 324 332 329 314 293 274 258 247 245 256 273 286 290 287 281 269 254 243 241 249 267 295 323 338 332 313 298 296 302 309 309 302 290 274
20179 274 259 252 253 258 261 265 281 310 337 347 339 330 333 349 366 374 365 341 306 269 234 202 175 157 154 166 194 231 268 291 296 288 271 249 226 213 216 231 250 269 289
20162 289 306 309 294 267 239 218 203 193 185 175 171 179 197 217 234 251 273 301 326 346 359 363 352 328 298 271 251 239 236 241 251 259 262 263 267 277 287 291 287 282 273 255
20146 255 223 186 159 148 146 143 140 140 145 155 168 188 212 235 251 257 250 229 201 183 183 191 193 186 183 194 211 222 223 223 226 230 231 234 240 251 269 298 340 389 437 474 493 486
20128 486 451 398 345 306 283 269 258 250 247 254 272 295 322 350 378 404 423 435 440 440 435 429 421 411 393 366 337 315 301 290 281 275 277 283 293 307 325 340 348 355 366
20111 366 376 373 355 334 317 305 293 285 283 281 273 265 266 280 295 305 311 318 324 325 322 317 309 300 294 291 289 282 268 250 232 217 201 182 166 161 171 191 209 218 219 220 225 237 250 260
20093 260 264 267 275 285 289 287 288 297 312 326 334 333 322 300 271 246 228 217 207 198 192 194 205 227 257 294 334 369 394 405 408 410 414 414 404 382 350 312 273 245 236 248 270
20076B70J8Jj7k3j5nkrj8k0j1QK3K9K7J8Pmrpmqj1qOJ5J3Jj3j8j1JJ3J8J6J0QRJ4J8J3%j0
20058C33j3omrj8k1j9j3KJ9K5Nk4l8l0j0NJ7L0L9L4J8%qo%Kpk0k8k7j8j0jRJ0jj4j5lPQJ0
20041B10J5J7RJNJ7K5K2J4OkplOJ3R%qj4j9k2j3OK6L4K6Oj3j8pJ0J6Rlj4k1k8l1k9k0oPK0
20024B51L1L9M1K9Mk0l2k7j7j3j3j4j1kJ0J2jk4l9l8k6j4nPK0K7K5J8J1Lll%LMNRJ5J8K0J6
20007C16Mrj5qPJ8J9J6J4J9K3J7%j4j5lMMmj0j1lRK0K2Rj3l6m7m5k7pLkrj5j4j3rjMNLKKj
19989B09k%LOOJ1J7K3K7L0L0K6J2j0l2m4m2k7qJ0K2L0L0K5J8J4J0mj8k6k0j1qj2j3oMJ3J8
19973C11J9J7J4J2J1J3J6J4QkrrlNJ0Rjj4k8l8l9l4k3pNQjj7k6k4j1JOPJ6L0L7L1K0J4J5R
19956C72lj1qMPK%LN%mlJjj0j7j0NJ5Rkj0nOJ2QLPJ8K3J3oj9k2j7j0kKJmj4j9j7oJ2K5L1K6
$$ plain form
20076 270 288 289 272 249 234 229 227 218 200 180 169 177 200 229 256 274 281 277 268 261 257 249 238 230 236 251 264 265 252 234 223 224 237 255 271 281 289 298 312 330 343 343 333
20058 333 320 314 310 301 283 262 243 230 232 251 276 281 257 219 189 179 184 201 231 270 304 322 322 314 308 308 310 303 283 255 228 210 200 199 208 218 217 203 188 185 192 200 210
20041 210 225 242 251 252 257 274 299 321 335 341 339 332 329 335 348 357 357 349 335 316 294 281 287 313 347 373 379 366 348 341 351 367 376 373 359 338 310 279 250 230 224 231 251
20024 251 282 321 362 391 395 375 343 316 299 286 273 259 248 246 256 268 267 243 204 166 140 126 121 128 148 175 200 218 229 232 229 226 226 229 233 238 247 262 280 300 316
20007 316 320 311 296 288 295 313 332 348 362 381 404 421 421 407 392 389 393 397 393 383 372 369 378 398 420 429 416 380 333 288 261 254 257 255 246 231 217 204 195 194 198 203 206 208 210 209
19989 209 207 207 210 216 222 233 250 273 300 330 360 386 398 388 356 312 270 243 235 245 267 297 327 352 370 384 394 390 372 346 326 315 307 295 282 276 280 293 311
19973 311 330 347 361 373 384 397 413 427 435 433 424 415 412 417 427 436 435 421 393 355 316 282 259 252 257 265 264 247 221 197 186 187 193 200 216 246 283 314 334 348 363 372
19956 372 369 358 350 354 361 363 363 366 371 371 367 364 365 364 354 337 327 332 347 356 354 344 339 345 357 365 368 375 393 416 429 423 404 382 365 355 353 355 356 352 338 319 302 296 308 333 364 390
19937C90J9J5Ppk7m4m8m0k6j6j0qrj2j9k2j4JJ0RKKRJ4J3QNLkrj2rljmrj2j0mKPJ7K7L2K7
19919B42J5OMNOMMMKKLRJ3J0jj6k6k8k0rlJOJ3J5J3RMjmlQJ6J2%oNK0K2Qqj7j4rnj%ljMJ0
19899C20J0jj0j0mKLLNNOOQMkl%OOKkqj9l0k6oJ8L0K5J4%qj0lQJ4Nj4k8k9j8lNPRQKqj4j3
19879B62qmpj1k0k3j8qJ%kjNPKkJJ0J4J1%j2k1k0j6j5j8j1J1L1L7K6J6J6K3K3J8J5J6J6J1
19862C55Lkkkloj3k1k6k2oJ3K6L3L3K4QkkMJj2k6l0k1qKNNkrj6j5nJ4L3M1L2J5kj1j5j5j5
19844C38j9k4k3j8j0ppmMJ2J3J2J4J6Nj7l8m3k8pJ2K3K7K8L0K6J5MLJ0J6J4J0ONMJ2K5K9K0
19828D88MkJkj4k7l3l3l1k3oQQmj8k1j2KJ0Onj1mMPMPJ3J3Kj1k4k9k9k5k0k1k4j7%J5J5Pk
19811A66j1j4j0%P%k0l1k5rNJ4K2K7K8K6K6L0K8J9QLQJ4J3Jj5k2k2j7j8j6oJ0K2J8Poj1j6
$$ plain form
19937 390 409 424 431 424 397 353 305 265 239 223 213 205 196 184 165 143 129 130 140 149 151 153 162 176 189 197 202 205 203 194 182 173 170 169 165 156 144 134 130 132 139 156 183 215 242
19919 242 257 263 267 272 278 282 286 290 292 294 297 306 319 329 328 312 286 258 238 229 226 227 233 246 261 274 283 287 286 282 279 287 303 315 315 309 314 334 356 364 356 339 325 316 311 310 310 307 306 310 320
19899 320 330 329 319 309 305 307 310 313 318 323 329 335 343 347 345 342 342 348 354 356 354 346 327 297 271 265 283 313 338 352 352 344 334 331 339 353 358 344 316 287 269 266 271 278 287 295 297 289 275 262
19879 262 254 250 243 232 212 189 171 163 164 164 162 161 166 173 175 173 174 184 198 209 209 197 176 156 140 125 107 96 107 138 175 201 217 233 256 279 297 312 328 344 355
19862 355 358 356 354 352 349 343 330 309 283 261 255 268 294 327 360 384 392 390 388 392 393 381 355 325 304 296 298 303 308 306 297 281 266 261 275 308 349 381 396 394 383 368 353 338
19844 338 319 295 272 254 244 237 230 226 230 242 255 267 281 297 302 285 247 204 176 169 181 204 231 259 289 315 330 334 337 347 363 377 387 393 398 402 414 439 468 488
19828 488 492 490 491 489 475 448 415 382 351 328 322 330 338 334 316 295 283 285 295 301 296 285 281 285 292 296 303 316 329 331 320 296 267 238 213 193 172 148 131 131 146 161 168 166
19811 166 155 141 131 131 138 138 118 87 62 53 58 72 94 121 149 175 201 231 259 278 286 289 297 311 324 325 310 288 266 249 231 215 209 219 241 259 266 260 249 233
19795B33j8j4n%ok0k1oJ5L0L2K3Rkj1j4j4rKJ4J8Prj8j8j0jJ0J9K7K6K1J1L%NJ4J8J0lj3j8
19778C17j7j4j0m%KJLPJ3J6Rnj2qLOmj9l0l4l5l0j9qkjMRJ2J5K0K7K6J3kj3j5j0mjoj5k2k2
19760A41j5lJ1J9J9J9K2L0K8J9RJ2J8K0J4RLnj5k1j8j3rmjkkQK3L4K8J4Kjlmop%RJ7J3MLJ5
19742D34K5J8nk4l0k5j6rkJ%oj6k0oK0L9L6J7kj4l1m8m6j9J6L2K6J3%j5k7k6j2KQJ1J6J8J5
19726C48Krj5j4j3j7k3k3j7kJ2J6J4J1J5K5L0J9nk6l5l3k6j5JJ1J2O%mlJRJ5J2M%LPPOLLM
19708C16J0J5J1Lljok0l5l7l0k0j1jNQOLkj2j7j2%PRJ2K0L0L1J9lk2k5j3MQOLPRQPPJqj8j9
19689B50j1KJ7K7L0K2RkpokkkKJ0K2K9K9K2J5Mj0k8l5k6qQJ1Kj0k0k3j3KJ8K1J5Lj1k0k1j3
19672C00qj0k1k6k2j1pj0j1nLJrj9k4k3k4k7k5j3%RJ4K0L0L2K1OKNMmqjJ5K9L6L5L0K6K2J2
$$ plain form
19795 233 215 201 196 196 190 170 149 143 158 188 220 243 252 250 239 225 211 202 204 218 236 243 234 216 198 188 187 197 216 243 269 290 301 304 304 309 323 341 351 348 335 317
19778 317 300 286 276 272 272 274 275 278 285 298 314 323 318 306 298 301 307 303 284 254 220 185 155 136 128 126 125 129 138 150 165 185 212 238 251 249 236 221 211 207 206 200 185 163 141
19760 141 126 123 134 153 172 191 213 243 271 290 299 311 329 349 363 372 375 370 355 334 316 303 294 290 289 287 285 293 316 350 378 392 394 393 390 386 380 373 373 382 399 412 416 419 434
19742 434 459 477 472 448 418 393 377 368 366 367 367 361 345 325 319 339 378 414 431 429 415 384 336 290 271 287 319 345 358 358 343 316 290 278 280 288 299 315 333 348
19726 348 350 341 326 312 299 282 259 236 219 217 229 245 259 270 285 310 340 359 354 328 293 260 234 219 220 231 243 249 249 245 242 243 252 267 279 283 283 286 293 300 306 309 312 316
19708 316 326 341 352 355 352 351 345 325 290 253 223 203 192 191 196 204 210 213 211 199 182 170 170 177 186 198 218 248 279 298 295 273 248 235 239 247 253 256 263 272 280 287 294 295 287 269 250
19689 250 239 241 258 285 315 337 346 344 337 331 329 327 325 327 337 359 388 417 439 454 458 448 420 385 359 351 359 370 372 362 342 319 306 308 326 347 362 365 354 334 313 300
19672 300 292 282 261 235 213 202 195 185 174 169 172 173 164 145 121 98 74 47 22 9 9 18 32 52 82 114 135 141 143 148 152 148 140 139 154 183 219 254 284 310 332 344
19655C44j1l3l8k0%Ooj9k4j7mRJ8J5Lj1j9j7j0l%JQK0L2L8L7L0J4j4l6m3l4j9j2rlMQJ0PM
19638B06KKNJ2J6J9J9K3K8K8J4mj4rjnj7k5k2j2rj0rnjjlKJ7K8K8J6%olNJ0RL%JOJ2J3Poj6
19620C53j9j3%MJnlRK2K6J9Lj6k5k2nJ6L1L0J5lj5j7j5j0%QJ1Lnqj0j4j9j0OJ4Pqj9k7l0k5
19602B35rPJ7J5J5J3J0OKlj2k6l1k4rJMOJ4K2K4J6QKlj0j4rJRNlrj1j0pJMKlooqj3j4j0%J0
19583A99J8K2J6PLOJ0Plj5k4k0nJ4K7K6J7R%j1j7j5qkmpj1j2oNJ8K1J6OL%ok0k9k3jK3L2K5
19565B91J2PJ1J5Qj0k9l8l3k5j9j2kPMoj3mJ2K2J9Mrj4j3r%J0K0K0Prj3JJ7K2J4OLLMNLK%
19547B91mj2k4l7m0l1j6mMJ0J8K4K7K6K3J8Mj6l5l7k5pNRJ1J9K9L4K7J1nj3qKJ2J7J4J2J1
19532C44J2J3J1J1J1J0Lj0k0k2k0j7j4pJRJ5J8J2kk0k9k8j6lPJ1J1RRNkqj2j4k1k9l3k7j5
$$ plain form
19655 344 333 300 262 242 242 248 242 223 199 182 178 187 205 220 223 212 193 176 166 163 163 164 172 192 224 262 299 329 343 329 293 250 216 197 185 176 173 177 185 195 202 206
19638 206 208 210 215 227 243 262 281 304 332 360 374 370 356 347 346 341 324 299 277 265 256 246 237 232 231 230 227 229 246 274 302 318 318 312 309 314 324 333 336 336 337 343 355 368 375 369 353
19620 353 334 321 321 325 326 321 318 327 349 375 394 397 381 356 334 329 345 376 406 421 418 403 386 371 361 361 369 380 383 378 370 360 346 327 317 323 337 344 336 317 290 260 235
19602 235 226 233 250 265 280 293 303 309 311 308 296 270 239 215 206 207 211 217 231 253 277 293 301 303 300 290 276 267 268 277 282 279 270 259 249 242 243 247 249 246 240 234 226 213 199 189 189 199
19583 199 217 239 255 262 265 271 281 288 285 270 246 226 221 235 262 288 305 314 314 303 286 271 263 261 257 250 239 227 221 226 244 265 281 287 290 290 284 264 235 212 211 234 266 291
19565 291 303 310 321 336 344 334 305 267 234 209 190 178 176 183 187 181 168 164 176 198 217 221 212 198 185 176 176 186 206 226 233 224 211 212 229 251 265 271 274 277 281 286 289 291 291
19547 291 287 275 251 214 174 143 127 123 127 137 155 179 206 232 255 273 277 261 226 189 164 157 162 171 182 201 230 264 291 302 297 284 276 278 290 307 321 333 344
19532 344 356 369 380 391 402 412 415 405 385 363 343 326 312 305 306 315 330 348 360 358 338 309 281 265 262 269 280 291 300 309 314 312 304 292 278 257 228 195 168 153
19516A53MJ9K6K1Onj0p%OJ1J2J0J3J7J5RK%JNJ1K1K7K5J6Q%nj3j8k0j7pRK4L0K5J7P%prrq
19498D15omloj4k5l5m0m0l5k7j9j3p%QJ6K4K6K0J4J2Rql2n1m8l3k2j7j5o%JLNJ1J5K0K4K9
19481A46L3K9K3J6RNM%rk1l2l2j9jJ2J4J7K4L3L5K5J0J%LLMPJ0Opk2l0k1JK0K4J3jqj0pqp
19463B92kOJ6K2K0J5J3J6J2Jj4j9j7j6k0k3j4JJ1J0PQJ5K2K5K3J6J4J7K3K0J0%loj4k0j7n
19448D45NMqk3k9k1mJ0J6J6J1Okj3k3k2j3npj5j8j0MJ0Lqj5j9k0j8j3rj0j1j3j3qNK2L1K7
19431B45J6MmpoLJ5K1K4K2J7Orj8j3mNJ2J4Pj1l3m6m2k8j6oKRJ0Loj5j6j2mPK1L4L7L1J9P
19414B95nj5j6oNNpk2k3j0J2L1L9L6L3K8J6ok9l8l1j5%J2J8J2mk0k8k3j7j1lNJ4J7J4QMJ0
19398B85J9K6J9Jj7k9l3l2k3pPJ7K2K4K3K2J7J0MJLNKqk5l2k5lJ4J8J0MOOmj5j6plnponqq
$$ plain form
19516 153 157 176 202 223 229 224 214 207 207 213 224 236 246 259 276 291 300 302 302 303 308 319 340 367 392 408 416 416 411 398 380 360 343 336 345 369 399 424 441 448 448 441 432 423 415
19498 415 409 405 402 396 382 357 322 282 242 207 180 161 148 141 141 149 165 189 215 235 249 261 270 262 230 179 131 98 76 59 44 38 38 39 42 47 58 73 93 117 146
19481 146 179 208 231 247 256 261 265 265 256 235 203 171 152 151 163 177 194 218 251 286 311 321 322 322 325 328 332 339 349 355 348 326 296 275 276 296 320 333 332 324 314 307 299 292
19463 292 290 296 312 334 354 369 382 398 410 411 397 378 361 345 325 302 288 289 300 310 317 325 340 362 387 410 426 440 457 480 500 510 510 507 501 487 467 450 445
19448 445 450 454 446 423 394 373 369 379 395 411 422 428 426 413 390 368 355 350 343 328 310 300 304 314 317 309 294 275 255 237 224 215 205 194 181 168 160 165 187 218 245
19431 245 261 265 261 254 248 251 266 287 311 333 350 356 347 329 316 312 317 329 343 350 339 306 260 218 190 174 168 170 179 189 192 186 171 155 143 139 146 167 201 238 269 288 295
19414 295 290 275 259 253 258 263 256 234 211 201 213 244 283 319 352 380 396 390 361 323 292 277 277 289 307 319 315 295 267 244 227 216 213 218 232 249 263 271 275 285
19398 285 304 330 349 350 333 304 271 239 216 209 216 233 255 279 302 324 341 351 355 356 359 364 366 358 333 301 276 273 287 305 315 319 325 331 327 312 296 289 286 281 274 268 263 255 247
19380B47lKJkmknj0j2pLJ3K4L3L7L2J8jj7k5k3j9j9k2j5kJ4J4Mj2j9j9j2mKLJkkKPJ5K1K2
19362B57J6N%MROqk5l1k2lJ6K5K2J5RNKlmmpj2qOK5L2K5J2jj3k3k4j5kKJkjJjlpplKPJ0QP
19342C00QJ0J2ROOPRQMmj3k3j6NK8L2J7%nrk4m1m4l0oJ3K2K3J8J0Njj0k0k5k3j8j0mJkmQL2
19324B61M7M6L3K7K3J6MnrqplMNlk0l7m3l9k6j1KJ8L2L6K9J2mj5k6k9k1lJ3K0J4kj8k7k1j0
19308B55lmpJJ4K2K1J7J2Jj0k0k3j9j6j5j4rjPJ0QOKlolMRJ4J8J9J5QJjoj8k6k2lJ2J6J2Q
19290B83MMJ0J7J9J3NK%mojLLmj0j0rrj1j1j0nJRJ4J5J3RPKpj6k0j7oJJpj0qk%kkklnmkpj4
19269B11j6qOJ4J3J1J7K7L2K7J2ok0k9l4l1k1pOJ3Opj8j8qJNLjmmMJ8K9K7J3JJJ1K0J7Omo
19251C09nqj9l1l3k5j3kMONQJ5J9K0J8J8J7J3NJjkj0j5j1lkj3l0l6k8j2KQQJnqmNJ3J7J4O
$$ plain form
19380 247 244 246 247 245 241 239 234 224 212 205 208 221 245 278 315 347 365 364 347 322 299 280 261 239 224 222 236 250 254 242 223 204 192 188 190 193 194 192 190 192 199 214 235 257
19362 257 273 278 278 282 291 297 289 264 233 211 208 224 249 271 286 295 300 302 299 295 291 284 272 264 270 295 327 352 364 363 350 327 303 288 286 288 289 287 286 287 286 283 276 269 266 268 275 285 293 300
19342 300 308 318 330 339 345 351 358 367 375 379 375 362 339 323 328 356 388 405 405 400 391 367 326 282 252 246 259 281 304 322 332 337 336 326 306 281 258 240 230 226 227 225 221 229 261
19324 261 308 354 387 414 437 453 457 452 443 435 428 425 429 434 431 411 374 331 292 266 255 257 275 307 343 372 384 380 365 339 310 289 286 299 319 333 331 313 286 265 255
19308 255 252 248 241 242 256 278 299 316 328 329 319 299 276 257 241 226 212 203 202 209 219 227 233 235 232 226 223 227 236 250 268 287 302 310 311 310 304 286 260 238 235 247 263 275 283
19290 283 287 291 301 318 337 350 355 357 357 353 347 346 349 352 348 338 328 319 310 299 288 278 273 274 283 297 312 325 334 341 343 336 320 300 283 277 278 279 272 262 254 252 252 250 248 246 243 238 234 232 225 211
19269 211 195 187 193 207 220 231 248 275 307 334 346 340 320 291 257 226 205 198 204 217 223 216 198 180 172 173 178 181 180 176 172 176 194 223 250 263 264 265 276 296 313 319 315 309
19251 309 304 296 277 246 213 188 175 173 177 183 188 196 211 230 250 268 286 303 316 321 322 321 319 309 294 283 280 278 265 235 199 171 159 161 169 177 178 173 165 161 166 179 196 210 216
19233B16lrpLJ2J1nk5l6l1j8rmLJ1J7J7J1PPRJ1J8K6K7J8NLOQKLJ1K2K0Qlrrpnnrj0omj4l0
19214B54l7k7j0KQJ2J3J3J1J2J1Kj2k1k1j3lRK3L0K6J1JKQJ3J7J8J5OoqLJ7J9Nj3k0j6qoj1
19197C29j9k2j8qKRJ2J2J3J0Lj4l0l6l0k0j3p%NMkpqokKOQMKOJ1J0J2J9K6K6J7J0J2J5Pj1
19179C39l0l7l0j3KJ3J7J9K0J6Nqj4j2kNRJ4K1K7K0Lj6k3j6pkrk1k7k2pPRLlnnmkLPNKJNR
19160B66Lj1k4k1mJ3J8J3NKKKJjjmqrrmlnqrmQK0K9L4K8J2%kNRPJJOJ0QNkj1k2k7k0j3j0j7
19140B59k4k5j9j2oKJ5K7L2K8K3J5Mj0k3k4j4%J0J1PL%loj1j0KJ9L1K4PnmJmj5k3j6lNOOR
19122B89RKoqmkknplMPMjprj0mLJ3K0K2J4%j0j0lKkj4k4k7k6k3j7j2qnnk%NRJ2J5J8K3K3J6
19103B54Mj0j7j6nJ0J7J3Koppj4j8j5jRJ1Mk%J1J9J4kj5j4nJjlJPOnj9k8k5j2LJ9L2M1M1K6
$$ plain form
19233 216 213 204 197 200 212 223 218 193 157 126 108 99 95 98 109 126 143 154 161 168 177 188 206 232 259 277 282 285 291 299 301 304 315 337 357 365 362 353 344 337 332 327 318 308 302 298 284 254
19214 254 217 190 180 182 190 202 215 228 239 251 262 264 252 231 210 197 194 203 226 256 282 293 294 296 304 317 334 352 367 373 367 359 362 379 398 403 390 370 354 346 340 329
19197 329 310 288 270 262 264 273 285 297 310 320 323 309 279 243 213 193 180 173 173 178 182 180 173 165 159 157 159 165 173 177 179 185 196 206 218 237 263 289 306 316 328 343 350 339
19179 339 309 272 242 229 231 244 261 280 300 316 321 313 299 287 285 290 299 313 334 361 381 384 368 345 329 322 320 311 290 263 241 234 241 250 253 250 245 240 236 234 237 244 249 251 252 257 266
19160 266 269 258 234 213 209 222 240 253 258 260 262 264 265 264 263 259 251 242 233 229 226 221 213 204 200 208 228 257 291 319 331 331 329 334 343 350 351 352 358 368 376 381 379 368 346 319 299 286 276 259
19140 259 235 210 191 179 173 175 190 217 249 277 300 315 319 309 286 262 248 248 258 269 276 279 279 276 270 259 249 251 270 301 325 332 327 323 324 320 305 282 266 263 268 274 280 289
19122 289 298 300 294 286 282 280 278 273 266 263 267 274 278 277 270 261 251 247 250 263 283 305 319 319 309 299 296 298 296 282 258 231 205 182 165 153 145 140 135 133 133 138 147 159 174 192 215 238 254
19103 254 258 248 231 215 210 220 237 250 252 246 239 232 218 200 185 184 193 204 208 206 206 217 236 250 248 233 219 214 215 214 211 212 219 225 220 201 173 148 136 139 158 190 231 272 298
19085B98Mj5k1j6nKMJJNJ0J1RQJ1J4J5J4J5J5Nj0k2j7nMLnrnKPJ3K5L9M1K8%k4l5l3k2j4r
19067C37onorq%J3K3K3J4%j4k1k1j1%NLnj0j0pnrj3j1jRJ5J7J7J9J9J8J3LllPJ8K2J6Jj5k5
19049C94k6j8j2n%OPQQQQMLNJ0J2Olj0rkQJ3Qok0k9l1l0k4j3jNLmnlLOPPJ1K0K4J5qk7l0k0
19029B73j0j1j7j8j1%RJ5J7J4QKopJJ9L2K9J6MJMOLJljPJ6J4%j6k7l4l9l9k3jJ4J6J2Mmrj1
19011B50j0j0pNK1K7J5lj2pK%nj2j3j0rpnm%MJ2K3K9K3OooOJ7K1J8J1Lqj3j4rppp%PJ4J3L
18992C39qj9k2j7rjMRJ6K4K8K5J7J0PQJ1J0Kqj7j6nQJ5J7J5J7J3Jj5k3k5k3j9j0JMpk2k9k4
18976B82rOJ4Mk0l5k5JK2K7K3J7Omrqrj8k3j5jLJ%MNJlkMRRQJj2k1k1nJ2J9J4OLRJ7K0J4J
18956C22j3k0j6jJ4K0K0J2Nlqj3j8j8rOK0K5K4K1J5Pkj1k2l0k7j5onqlJ0J5J1krrpmpj1j1
$$ plain form
19085 298 302 287 266 250 245 247 251 252 253 258 268 279 288 296 307 321 336 350 365 380 385 375 353 336 331 335 338 333 324 319 321 328 341 366 405 446 474 474 450 415 382 360 346 337
19067 337 331 326 320 311 303 303 316 339 362 376 376 362 341 320 309 309 314 317 312 302 292 285 280 271 258 247 246 255 270 287 304 323 342 360 373 376 373 370 377 395 417 433 434 419 394
19049 394 368 350 338 333 333 339 346 354 362 370 378 382 385 390 400 412 418 415 405 396 394 402 415 423 417 397 368 337 307 283 270 269 274 277 273 268 265 268 274 281 288 299 319 343 358 350 323 293 273
19029 273 263 252 235 217 206 206 215 230 247 261 269 271 265 258 259 278 310 339 355 359 360 364 370 373 374 371 370 377 393 407 407 391 364 330 291 252 229 228 242 258 270 274 270 261 250
19011 250 240 230 223 228 249 276 291 288 276 269 271 271 266 254 241 231 222 215 210 206 206 210 222 245 274 297 303 297 291 297 314 335 353 364 367 359 346 332 323 316 309 302 302 309 323 336 339
18992 339 331 312 290 273 264 263 267 276 292 316 344 369 386 396 403 411 422 432 434 426 409 393 388 396 411 428 443 460 473 474 459 436 411 388 369 359 360 364 357 335 306 282
18976 282 273 279 293 297 277 242 217 218 240 267 290 307 313 309 300 292 283 265 242 227 226 229 230 230 234 239 240 237 235 239 248 257 265 266 254 233 212 207 219 238 252 258 261 270 287 307 321 322
18956 322 309 289 273 272 286 306 326 338 343 340 332 319 301 283 274 280 300 325 349 370 385 392 390 379 357 327 300 285 279 274 266 263 273 288 299 297 288 279 272 268 261 250 239
18939B39nPJ6J7RjkRJ7J0pj2%J8J9Rkj0k1l3l1j6LROMJ0K1K8K8K4K0J5Jk1m0m2k8j3jPJ7J6
18922B94Ork2k9k9j6RK9L0J4nj9k4k1j5j1qnLJ0J3J9L1L9L3J6NNPLoj5k4l3l2j3J5L9M6L8
18906C68K5J0JmlLPJj7l0k4pQPjqpmNJ1J3J0MkmlLJ2J7J3Loj3j7k0k1k1j6kJ6K6J9Mppmoj0
18886C22j5k0k3j8nJ1K2K2J2LmjJKjLQROOJ6K4K1Pnqqj2j8k1k2k1k0k2k1j7j0jKJkjKNJ0J3
18868B32J2J0J5K3L1L0K2J4Pnk0l4l7l2k0q%jj1k1k1rPJ4J2ONQJ0ROLLOJ6K3K0Mj9l2l1k7
18851B20k1j5mjqk0j8KK8L9L7L0K5K4K1J5J0OJj1k7l7l7l3l2l2k5pJ5L2L8L3K1Noj3j3j0k
18835B30%nj2j1jMmj8k5j8KK8N3O4N4L3J4RJ0RLoj6k8l5l1j3J4L1K3mk9l3j5J1K8L4K2%j9
18819C53k3j2%ORRKj2k0j5mJKmj2k2k7k6k0j2%J9L5L1J8J3K4L9L4J4pj9j7j0m%j%KOPOKlp
$$ plain form
18939 239 234 241 257 274 283 282 280 289 306 316 309 297 297 315 334 343 341 331 310 277 246 230 233 242 248 252 262 283 311 339 363 383 398 399 378 338 296 268 255 254 261 278 294
18922 294 300 291 269 240 211 195 204 233 263 277 272 253 229 208 193 182 174 169 172 182 195 214 245 284 317 333 338 343 350 353 347 332 308 275 243 230 245 284 330 368
18906 368 393 403 404 400 397 400 407 408 391 361 337 330 338 345 344 336 329 325 330 341 354 364 368 366 362 359 362 374 391 404 407 401 388 371 351 330 309 293 291 307 333 352 356 349 342 338 332 322
18886 322 307 287 264 246 241 252 274 296 308 311 307 306 307 309 308 311 319 328 334 340 356 380 401 408 403 395 387 375 357 336 314 293 273 251 230 213 203 202 204 205 203 202 204 209 219 232
18868 232 244 254 269 292 323 353 375 389 396 391 371 337 300 268 248 240 240 239 228 207 186 177 184 198 210 216 221 229 239 248 254 257 260 266 282 305 325 329 310 278 247 220
18851 220 199 184 180 179 171 151 133 135 163 202 239 269 294 318 339 354 364 370 371 360 333 296 259 226 194 162 137 130 145 177 215 248 269 274 268 255 242 232 230
18835 230 230 225 213 202 201 205 201 183 158 140 142 170 223 287 341 374 388 397 407 416 419 413 397 369 334 303 290 304 335 358 354 325 292 277 288 316 350 372 372 353
18819 353 330 318 318 324 333 342 344 332 312 297 293 294 296 292 280 258 231 205 185 173 173 192 227 258 276 289 313 352 386 400 393 374 357 347 343 343 342 342 344 350 357 363 365 362 355
18801C55j5k3k5j8lJ0RjrmQJ5J0jppmjJKlj5k5k8j9oNJ0J1J4K3L2L7L2K0QKMJ2J9K3J8Qkm
18783D68mlorplLLkpnKJ0J4J1Kj3k8l3k3j2j0k1l0k9j7lOJ0QLMJ2K1K1J5J1J0Mpj3rmljNQ
18764C49jj5k4j9j1j0j5j3oj%JOJ3J5J0Korqpnopj3j9k1j5kJ4K4K6K3J6RLJmj5k7k5j1J0K3
18747B30J9jk5m1m0k5qjmojJ0K3L1L7L9L9L5K8J8QJpj7k2k1qPJ6J5RORJ3J1Mmj4k2k7l1l5
18730B48l6k8j1JLJRK3L1K1Krj1oLJ8K8K4Qoj2j6k0j4PK8L0J6NRJ9J9QkmkkjNJ6K2J3jj0q
18712D18lnj4k1j3NJ9K4J9J4J2Rmj8l0l5l0j4PJ9J0j1k5k4j7j2qkRJ8J9J0lj0qJNQJ7K4K2
18695C82Mj6k5k5k4k4k0pOJ2Ooj6j6olqj3pMPMPJ6K5K1J4J2J3Omj3j4j3j4j3j0%J1J5J1QJ0
18678B97Rjj7k2j1LRRJ3K3L0L3L0K6J7Pjrk4l8m8m6l6k4qRK2K2J5OJlnjQJ7K4K2J1lrpJNL
$$ plain form
18801 355 340 317 292 274 271 281 290 289 280 276 284 299 309 308 301 294 290 289 290 292 289 274 249 221 202 196 201 211 222 236 259 291 328 360 380 388 390 394 406 425 448 466 474 472 468
18783 468 464 461 455 446 439 436 439 442 440 433 428 430 440 454 465 467 454 426 393 370 358 348 327 297 268 251 248 254 264 272 275 279 291 312 333 348 359 369 373 366 353 344 340 337 336 341 349
18764 349 348 333 309 290 279 269 254 241 235 234 234 235 241 254 269 279 281 275 266 258 251 246 240 233 220 201 180 165 163 177 201 227 250 266 275 278 279 275 260 233 208 197 207 230
18747 230 249 248 223 182 142 117 109 108 104 98 97 107 130 161 198 237 276 311 339 357 365 366 359 342 320 299 291 298 314 329 338 344 353 366 377 381 377 363 341 314 283 248
18730 248 212 184 173 174 177 178 187 210 241 262 264 255 244 238 241 259 287 311 319 313 301 285 265 251 258 286 316 332 337 346 365 384 392 390 386 384 382 381 386 402 424 437 436 426 418
18712 418 415 410 396 375 362 367 386 410 429 443 455 464 460 442 412 377 347 333 340 359 369 358 333 309 292 280 272 270 279 297 316 326 323 313 305 306 311 319 336 360 382
18695 382 386 370 345 320 296 272 252 245 251 263 269 263 247 231 225 222 214 201 194 198 205 209 216 232 257 278 292 304 317 323 319 306 292 279 265 252 242 242 253 268 279 287 297
18678 297 306 305 288 266 255 258 267 276 289 312 342 375 405 431 448 455 454 445 421 383 335 289 253 229 221 230 252 274 289 295 296 293 288 287 295 312 336 358 369 366 357 350 351 356 359
18660C59nppqj6k8l9m1l2j8j1j2j6j1QK7L3K5J6J7K6L8M4M0L0K1J7J6Jk1l6k9pJ4K6K5J0j2
18645D37k7k5pJ0K2K2J0rk5k8j7qrj5k1k3j8%J8K7K5K2K2J8Mk1m1m9m4l1j4%J2K6L7L8K9K0
18629C67J8J5Lj6l3m5m6l7k1qnmloj2j9j1PK2L0K8K5J9J8K1K5K0Lj3j9j6j2qm%jrj7j8rNJ5
18613B49K0K1J4Lqj2j0j2j9k3j7ojljNJ1J6J7Pj3l1k6KK8L3J6lj5k0k2j7j0KJ1J6J1%nKJ6
18596B26K7L1L3L1K2NpnOJ7J9J4P%npmJKpk0k3j6okoj2k3l6m4m1k6j0JRK1L4L8L4J7%rrmp
18578B66j5j6rLJ0J1J0J1J2J0QQOKknnlkqj6j7nJ1K1J7Opj1j0kOJ0J0Nkqj0p%Kkj4k4k8k1
18560A96qJOJ4K2K4J6Kooqj1j4j4j0mLJ0J4J3QQJ1J4J5Rlj5k2j8j3j2j7j8j0JO%j0k1k5k0
18543A08mK0L8M4L4J8POJ1J0Jj5k4j5NK0K0RMJ1J9J8RLOQJj1j6lJ6K5J7Lrj4k1l1l1j5QK3
$$ plain form
18660 359 354 347 340 332 316 288 249 208 176 158 147 135 119 108 116 143 176 201 217 234 260 298 342 382 412 433 450 466 467 446 410 381 374 388 414 439 449 437
18645 437 410 385 378 388 410 432 442 433 408 380 363 355 346 331 310 287 269 269 287 314 339 361 383 401 405 384 343 294 250 219 205 205 217 243 280 318 347 367
18629 367 385 400 403 387 354 309 263 226 205 197 192 188 185 179 167 148 137 144 166 196 224 249 268 286 307 332 352 355 342 323 307 295 287 283 283 282 273 256 238 229 234 249
18613 249 269 290 304 307 299 287 277 265 246 223 206 200 199 196 195 200 211 227 244 251 238 207 181 183 211 244 260 257 242 222 200 183 173 175 186 202 213 213 208 210 226
18596 226 253 284 317 348 370 375 368 363 369 386 405 419 426 426 421 414 410 411 413 406 386 363 347 341 339 333 321 298 262 218 177 151 141 142 151 172 206 244 278 295 295 286 277 273 266
18578 266 251 235 226 229 239 250 260 271 283 293 301 309 315 317 315 310 305 302 300 292 276 259 254 265 286 303 309 302 291 281 279 285 295 305 310 308 300 290 283 283 285 283 269 245 217 196
18560 196 188 189 195 209 231 255 271 273 267 261 253 242 228 214 204 200 203 213 227 240 248 256 267 281 296 305 302 287 265 247 234 222 205 187 177 178 184 184 174 153 128 108
18543 108 104 124 162 206 240 258 265 271 282 292 293 278 254 239 244 264 284 293 297 308 327 345 354 357 363 371 372 361 345 342 358 383 400 403 394 380 359 328 297 282 290 313
18526C13K2Roj0lQJ6J1Koqj0j2rmlqj5j4pMJ3J5J1%plPJ0MmolOJ6K8L0K1Orj8k1k5k9l0k5
18507B57j3LJ7K2J8QkomJJlnkKjj2k3k7k1r%NOMPJ1J5J3NkkLOJ1K0L2L7L2K2J5RNlj1k3l4
18488C84l6k6rLRJ8K5K0ll4m6l7j8kOQJ5K1K4J8Nmj0j1q%J0J4Okn%%lolK%pj5j5rk%nj3j8
18470B41j9j7j4j0j2k0k5k0j2mJQJ8K0J6J6K6L8L8K5J0Jnj1j3qNJ5K4L1L7L3J5rk7l3k6j6
18454C17mQJ6J1kj6k0j5j2j3j7k0j5nNRRJ2J9K1J5Kj1j9k4k2j3%RJ0NjoqmNJ3K0K0J5%j7k8
18437B49k8k2j7j2n%MOJ2K3L0L1K2J2Jk%MJnp%RJ5J8J8J5PKjmj1k1k6k4j5kOQMLNJ1Pnk1l3
18418B62l3k4qPJ3J2J2J9K2J4kj4j2%RJ1O%moopj1j3j1lMLmrq%OKj0j7j4JJ8K9L3L2K4Roj3
18400C13qjjpj3j2nKJ0J8K7K8K1Qjoj0j2j4j1oLPOLJMOJoj3j5rjPRM%%%krj2j2oklnlNJ4J2
$$ plain form
18526 313 335 344 338 328 325 333 349 360 362 356 348 338 326 317 313 310 302 287 273 266 270 283 298 309 309 302 299 306 316 320 316 310 307 313 329 357 387 408 414 405 387 366 341 312 282 257
18507 257 244 247 264 286 304 312 310 304 300 301 302 299 294 292 294 293 281 258 231 210 201 201 206 212 216 223 234 249 262 267 265 263 266 272 283 303 335 372 404 426 441 450 455 452 441 418 384
18488 384 348 322 313 316 325 343 368 388 385 351 305 268 250 248 254 262 277 298 322 340 345 341 331 320 312 312 322 336 342 340 335 335 335 332 326 323 325 325 318 303 288 279 277 277 272 259 241
18470 241 222 205 191 181 169 149 124 104 92 88 89 97 115 135 151 167 193 231 269 294 304 305 300 289 276 268 273 288 312 343 380 413 428 419 392 359 333 317
18454 317 313 321 337 348 346 330 310 295 283 270 253 233 218 213 218 227 236 248 267 288 303 305 294 275 251 229 216 216 225 235 240 239 233 225 221 226 239 259 279 294 294 277 249
18437 249 221 199 182 170 165 165 169 175 187 210 240 271 293 305 306 304 304 308 309 304 297 297 306 321 339 357 372 379 381 380 376 365 344 318 294 279 277 283 291 295 298 303 314 321 316 295 262
18418 262 229 205 197 204 217 229 241 260 282 296 294 280 268 268 277 288 294 294 290 284 278 271 260 247 236 233 237 240 236 227 219 219 225 227 217 200 186 187 205 234 267 299 323 332 326 313
18400 313 305 304 303 296 283 271 266 268 278 296 323 351 372 380 379 373 363 351 337 326 320 323 330 336 339 340 344 350 351 345 332 317 308 307 314 323 327 327 327 327 325 316 304 292 286 284 281 276 273 278 292 304
18379C04jj2qLQM%KPRRPKnqm%JLJ3K8L8L6L0K2J5QJoj1j5j5j5j9k4k7k7k4j6mQOpk1j9oMK
18360B76lppomjQJ4J8J6J1Mmrj1rkQJ6J8J6J3J1MonRJ9Ll1n2m4j8llmRK5K8J8KkLJ1J1jj8
18341C21l1l3k6qJ2K2J4j0k9l4k4j0KQPJqj0kJ4K9L6L2K4K0K1K8L3K9J4pk1k1j7j6k2k6k5
18325B87j8j2rmMRJ5J8J9J8J6J8J9J2mk5l4l1j8lJ5K7K9J6qk3k2qNQNJ%%%kkllljRJ8J9Qj0
18307C52k5l1k1KK7L8L3K0J2Qjj3j7j0LJ1Omj2qLJ5J6J1NL%rk3l5l7l1k3j6oJ0K6K9J8LjJ0
18290C38J9J5Pkqj4j6j3poj1j8j7j1JQO%%kpj7j9j2jNJ3K4L5L6K7J7Pnj4j7j3qnlmj1j9j7
18272B61oNMjJJ2K1K4K0J2MlqpmklnkQJ9J9Rjmkoj4j8j8j5j2j0j2j5j5j5j2j1oKJ2J7K0K2
18254B65K3J9J8J9K3K1J1jj6k8l8m0l8l3k6pJ5L1L5K7J7Onj2pNJ3J0KKRJ7J7J0PJ1J6J1kj6
$$ plain form
18379 304 303 291 283 286 294 298 298 300 307 316 325 332 334 329 321 317 317 318 321 334 362 400 436 466 488 503 511 512 506 495 480 465 450 431 407 380 353 329 313 309 317 323 316 295 276 270 274 276
18360 276 273 266 259 253 249 248 256 270 288 304 315 319 315 306 295 286 284 292 308 326 342 355 366 370 364 359 368 387 390 359 307 263 245 242 239 235 244 269 297 315 317 315 318 329 340 339 321
18341 321 290 257 231 223 235 257 271 261 232 198 174 164 166 174 181 182 174 164 162 176 205 241 273 297 317 338 366 399 428 442 435 414 393 376 360 338 312 287
18325 287 269 257 248 244 248 257 272 290 309 327 343 361 380 392 388 363 329 298 280 277 292 319 348 364 356 333 311 303 308 316 321 322 322 322 322 320 318 315 312 309 308 317 335 354 362 352
18307 352 327 296 275 277 304 342 375 395 407 415 414 401 384 374 377 388 394 390 378 370 373 388 404 415 420 423 423 414 391 356 319 288 265 249 243 253 279 308 326 329 328 338
18290 338 357 372 379 377 369 355 339 326 319 313 302 284 267 256 257 265 271 271 271 269 262 245 226 214 213 218 231 255 290 326 353 370 377 372 358 341 328 320 315 312 308 297 278 261
18272 261 255 260 264 263 264 276 297 321 341 353 357 354 346 339 335 333 330 325 323 331 350 369 378 377 373 371 365 351 333 315 300 288 278 266 251 236 221 209 198 192 194 206 223 243 265
18254 265 288 307 325 344 367 388 399 398 382 354 316 276 238 205 179 172 187 218 253 280 297 303 298 286 279 284 297 307 309 311 320 337 354 364 371 382 398 409 407 391
18238C91k0j6rj2j7k1j6j1j0j4j9j9j4nRK2K5K1J7J6J5R%prporj6j7mK1M7N4M3J9mk2l0k7
18222C48j3mlrj5j4qlKNLKKJjj1j9j8mJ2K0K1K1K0J3Jj3j6j3j2j9k4k4j7q%KJkjNJ5K2L2L8
18204C15M0L5K2Pqj9k1j6j2j5j9j4%J6K4K1J0JkLOLpj1pJORQJj4l1l5k3mROmrqlmoolLQJ0
18185B63Kpj2nMQNOJ0Prk6k9k0j0mOJ9K3J8J0NN%lnoj2j4pPJ3J4J4K0K6K4J5Mpj8k1j8j1l
18167B81QK3L1L1K9K8K7K1J1PN%j1k0k0j4qqj0j3j6j9k4k6j7jJ4J4Mnqpj1j9k4k0pRJ7J2%
18150B64j0j7k3k3j2J0K4K6J9J6J4QJjNOlj3j6j3j1j2j0lJL%%OJ3K0K2K0J6J1J0RJ0QJoj0
18133C60q%PQkj7l0l5k7j2NJ4J2OMORN%lqj4j9j4mNQLoj3j3mPJ3J3J3J4J3J0RJ0ROPJ1J4O
18115C78rk4l1l3k9k4k3k3j9oRJ8J7J5J5J4J2RJ1J6K1K4K2J8J0MjmnlNJ3J6J0lj0rlkj3k5
$$ plain form
18238 391 371 355 346 334 317 296 280 269 259 245 226 207 193 188 197 219 244 265 282 298 313 322 322 315 306 299 293 284 268 251 247 268 315 369 412 431 427 405 375 348
18222 348 335 331 328 319 304 290 282 279 281 286 289 291 293 294 293 282 263 245 241 253 273 294 315 335 348 349 336 320 307 295 276 252 228 211 203 203 205 206 204 203 208 223 245 277 315
18204 315 355 390 412 419 411 392 371 355 343 328 309 295 295 311 335 356 366 367 365 368 374 377 370 359 352 353 359 368 376 377 363 332 297 274 270 279 285 281 272 264 261 257 251 245 242 245 253 263
18185 263 265 258 246 241 245 253 258 264 274 281 272 246 217 197 187 183 189 208 231 249 259 264 269 269 266 261 255 243 229 222 229 242 256 270 290 316 340 355 359 352 334 313 295 284 281
18167 281 289 312 343 374 403 431 458 479 490 497 502 502 491 471 451 437 429 421 411 398 382 363 339 313 296 295 309 323 327 322 314 307 296 277 253 233 226 235 252 264 264
18150 264 254 237 214 191 179 189 213 239 258 274 288 296 297 296 301 307 304 291 275 262 251 239 229 226 227 230 230 230 236 249 269 291 311 327 338 348 357 367 375 376 370 360
18133 360 352 352 359 367 365 348 318 283 256 244 249 263 275 281 285 291 300 305 305 302 294 280 261 247 243 248 256 259 253 240 227 223 230 243 256 269 283 296 306 315 325 334 340 347 358 372 378
18115 378 369 345 314 281 252 228 205 182 163 157 166 184 201 216 231 245 257 266 277 293 314 338 360 378 388 392 391 387 382 379 384 397 413 423 420 410 401 398 396 383 358
18098C58l0k6j4%J1J5J1Jnojkpj1mQJ7J7RJmnmkNJ4K0J9RjnmjJkj1k2l5m1l9l1j8nOJ1J3J2
18079B22J3J5K2K9K9J5nk1k4k5k3j8lJ5K1J2kj2j6j7j6j2mMJ2K1K7K7K3J1pk5k7j8j0rp%J1
18064B28J2QQJ5K0J9J1N%jjjoj3j5pkqk1k8k4j4mLRJ6K8M0M4L9K9K3K3J9Pj2k5k9k9l3l4k6
18047B73j0KKrj8j9j5j0mNJ4J9J8J2Noj6k6k8j9%K0K7J7KolKNQJ3J6J1Kqj6k2k4k0j2lLRJ5
18029B06K2K4K2J3LknlkKRJ3J4J5J3ROJ5L1M5M1K6Oj3k5k9k4j9k2l3l5k7j9j6k0j8qNJ7K4
18013B61K7K6K5K5K3J5PLLLmj3j7j9j5j0prj3j1kJ1J8J7Qpk1l1l1k3j0%Kj%QK1K6J6Kl%NL
17995C08oj3j5j0LK0L5M2L7K6J4Jqj3j5j7k1k3j7qklml%KJKJ4K7L1K0Jj6k8l3k9j5JJ3J3J1
17978C23PM%lk%jnrj1p%NNlj0j3j1qkKKjmjPJ5J6J2OK%nrnJ3L3M1K9Kk3m2n0m6l0j0MJ0RM
$$ plain form
18098 358 328 302 288 288 299 314 325 326 321 315 314 312 305 294 290 298 315 332 341 342 338 333 329 327 332 346 366 385 394 393 388 384 383 384 382 371 349 314 273 234 203 185 180 186 197 210 222
18079 222 235 250 272 301 330 345 340 319 295 270 247 229 226 241 262 274 272 260 244 227 211 199 195 199 211 232 259 286 309 320 313 288 261 243 233 224 217 217 228
18064 228 240 248 256 271 291 310 321 326 326 325 324 323 317 304 289 282 280 272 251 223 199 185 181 184 193 209 237 277 321 360 389 412 435 454 461 449 424 395 366 333 299 273
18047 273 263 265 267 258 240 221 206 196 192 197 211 230 248 260 265 259 243 217 189 170 170 190 217 234 236 230 227 229 234 242 255 271 282 284 276 260 238 214 194 182 179 182 191 206
18029 206 228 252 274 287 290 288 283 280 278 280 289 302 316 331 344 353 359 374 405 450 491 517 523 510 485 456 432 413 391 358 323 296 277 261 241 223 215 220 237 261
18013 261 288 314 339 364 387 402 409 412 415 418 414 401 384 365 350 340 333 324 311 300 298 309 327 344 352 345 324 293 262 239 229 229 231 230 230 238 259 285 301 303 300 300 305 308
17995 308 302 289 274 264 267 287 322 364 401 427 441 442 434 421 406 389 368 345 328 320 318 315 311 308 308 310 311 313 327 354 385 405 406 390 362 329 300 285 286 299 312 323
17978 323 330 334 334 331 329 329 328 323 314 303 296 296 301 306 303 293 280 269 261 259 261 263 262 258 257 264 279 295 307 313 315 315 310 301 296 309 342 383 412 414 391 349 299 253 223 213 217 227 236 240
17958B40nj2j4qMJ8K8K8J7jroLJ2J5J3RLK%qk0k3j6n%j%jkpoKJ4K2K6K0Q%jKNM%oj3j7j2K
17939C04J1Qkj0mQJ2Jk0l2k8j1Jlj4j8oJ5K8K4J6J5K1K2Rj0k4k8k0oJ2K9L4L0K0J2J0J2J5
17923D33J0Koj1j8k7l2l1k9k6k0qmj0k0j8oRK1L4L8K5jj8k0j5j5j4oOOmrkJ0J9K3J9J1MKj
17906C01qj5j6qj%JPJ2J5J1J3J6J8J5RNKkprrrj2j1kJ7L0L1J9Mqj6j9k1k3k8l2k5rLPQQO%
17888B68ookOOJrj7j5pmrj2lJ0J6J3RJ2J5J2LlmmprnLNKllNRJ1J1J1OknkNMjlkjqj3oJ1K6
17866C09L1K7K2J7J1%j1j7j6j0kLOPNPQQLlpj4k3l1k9j6lKkqj2j4j4j1ooj0j3pRK1K6K7K7
17849B91K5J8J0ORJ3J2QjpoKJ1J2Kj3k3k6k1pMPkj5k4k9l2l4k9k2j2%J8L2L5K6J0jj0j3rj
17832B14J0J9K0J5Oklklpj1j3j1mMPjj0mJ6L0K5J2MRJ6K0J9J2%j3j5rlKQRKj3k3k0j0kOJ0
$$ plain form
17958 240 235 223 209 201 205 223 251 279 296 295 286 280 283 295 310 323 332 335 337 337 329 309 286 270 265 265 264 264 263 261 254 248 250 264 286 312 332 340 340 339 341 346 350 350 344 331 314 302 304
17939 304 315 323 321 311 307 315 327 328 308 276 248 237 238 235 221 203 197 212 240 264 280 295 316 338 347 337 313 285 265 259 271 300 334 364 384 396 406 418 433
17923 433 443 445 439 428 410 383 351 320 291 265 245 237 233 223 203 185 179 188 209 243 281 306 305 287 267 252 237 223 217 223 229 225 216 214 224 243 266 285 296 300 302 301
17906 301 293 278 262 254 253 253 254 261 273 288 299 312 328 346 361 370 375 377 375 368 359 350 341 329 318 316 333 363 394 413 417 409 393 374 353 330 302 270 245 236 239 246 254 262 268 268
17888 268 262 256 254 260 266 267 258 241 226 219 215 206 194 191 201 217 230 239 251 266 278 281 278 274 270 263 254 249 252 257 259 256 253 258 267 278 289 300 306 304 299 297 302 306 305 302 300 299 291 278 272 283 309
17866 309 340 367 389 406 417 417 406 389 373 363 361 364 370 377 382 389 397 405 408 405 398 384 361 330 301 285 282 284 282 274 262 248 234 223 217 211 201 188 181 190 211 237 264 291
17849 291 316 334 344 350 359 372 384 392 391 384 378 380 391 403 405 392 369 343 322 315 319 326 324 309 285 256 224 190 161 139 127 127 145 177 212 238 248 247 237 224 215 214
17832 214 224 243 263 278 284 282 279 277 274 267 256 243 232 228 232 239 238 228 224 240 270 295 307 311 320 336 356 375 387 387 374 359 350 347 349 357 366 368 355 332 312 302 300 306 316
17814C16Pkj1j4j1j0j3j1pmml%JjlNJ8K9K8J6jj0j3j2j6k1k0rOJ5J8K2K3K0J2MKMNLkoj2j9
17796C19k3k4k1j7rPK5L5L5L3L5L4K4%k0k2j5j5l0m5m4k7j0po%J3J9J8J6J7J3Nnpmmrj4j6
17780B54j1pmoj1j4j1mjoqkQJ5J3Noj4j4jJ5K7L0K9K9K6J8J0OPQL%%koj0q%ORRQNkj0j6k0
17760C46k4k4j9qLJ3K2K5K5J9RJk%NJ1J6Qj0l2m1l2j9j2j2j1oJOJ3J5J6J4J4K0L0L3K7J7Q
17744D65Koj4k3k7k4j8j0nkmojJ1J8J6QNLjorj1j0qlL%qj4j0k%lnm%jlljLJkoj0j7k1j6JJ8
17724B40K2J7J3J5J9J4Jj0qNK5L7L4J5nj4j6j9l4m7m8m1l0j8jJ6K2J2mrMJ8J9Orj5j0JRJ0
17708B36jj8k4j0RJ5MnlJ0J8J7Mj3k2j4PK6L1K7K5K3J9J4J2J5J2Okrj3j7j4jJ3J8J3Mlqqr
17691C84j1j4j3nK%pj0jJ3K2K0J0kj3j8j6j0lKMPOJj1k6k9j6J1L0L2J6Llk%K%qj7k1j4pnp
$$ plain form
17814 316 323 321 310 296 285 275 262 251 244 240 236 233 233 234 233 230 235 253 282 310 326 325 315 302 290 274 253 233 224 230 245 263 285 308 328 340 344 346 350 355 358 356 350 338 319
17796 319 296 272 251 234 225 232 257 292 327 360 395 429 453 453 433 411 396 381 351 306 262 235 225 218 212 212 225 244 262 278 295 308 313 308 301 297 293 284 270 254
17780 254 243 236 232 226 215 201 190 186 185 179 171 169 177 192 205 210 204 190 176 175 190 217 247 276 305 331 349 359 365 372 380 383 383 383 381 375 365 357 357 363 372 381 389 394 392 382 366 346
17760 346 322 298 279 271 274 287 309 334 359 378 387 388 386 386 391 402 418 426 416 384 343 311 292 280 268 257 251 252 258 271 286 302 316 330 350 380 413 440 457 465
17744 465 467 461 447 424 397 373 355 345 340 338 334 328 327 338 356 372 380 385 388 387 381 372 361 351 343 340 343 343 335 321 311 309 309 306 301 297 297 296 293 290 289 292 293 291 285 275 258 237 221 222 240
17724 240 262 279 292 307 326 340 341 331 323 328 353 390 424 439 434 420 404 385 351 304 256 215 185 167 166 182 204 216 212 203 207 225 244 250 241 226 216 217 226 236
17708 236 235 217 193 183 192 207 211 206 203 213 231 248 252 239 217 203 210 236 267 294 319 342 361 375 387 402 414 420 418 409 396 379 365 364 377 395 408 412 409 401 393 384
17691 384 373 359 346 341 343 343 336 326 325 338 360 380 390 388 375 357 341 331 328 330 334 341 347 348 337 311 282 266 277 307 339 355 358 355 353 353 355 355 347 330 309 295 288 283 276
17673B76pmjjKKJlmJNPRJ6K1K4K1J1nj6j9j3rmNJ9K7K0R%pj8k5k5j7qJPOjomLQRJ2J9K2J5
17653C81J0PKrk6l6l2j3RK2J5kj9k1j5j0rqmMJ5K3L0L2K8J8Oknqj7k5k2rJJm%OQNKLNOJ0J4
17634C67J2MlnnmlJQJ1J4J5J2Lqj5j4rlMJ3K1K2J5Mpj7k5k5k0j1olkjmrj0%QKj2j8pOPlj2
17615B88j1n%JKLPJ5K7L6L3K0QMJ1J9K1J4Jj7k8l1k6j8j2j0j1j3j4j1lKLKkmkPJ7J7Omplj
17597C31mmJ%j0k3k4j2NRjj2j7j5j2rokoj4j7nRJ3QOJ0J0mj4j1KJ2J1RPMkj0j4j0%J3K3K7
17579B52K5K1J2%opqj3k1j8jK2L7L8K6J1%llnj0j7j9k2k3k4k0j5nOJ7K2K0J7J8J6Prk2k3j3
17562B60qj2k0j7lJ1J6J1MknkNJ1Pmr%QPlj0j2j1nLQJj2k2k1j4oKPJ0QMKlkRK1K1Lj1rMJ2
17543B32QKnj2j6j5rjLQJ4K0K1K0J9J8K1L0L7L7K4RJoj6k3j4KJ0lk1k7k4k6l4m1l5j9JJ9L5
$$ plain form
17673 276 269 265 264 263 265 267 268 265 261 262 267 274 283 299 320 344 365 376 371 355 336 323 314 310 315 334 361 381 390 390 383 365 340 315 298 290 291 298 304 303 297 293 296 304 313 325 344 366 381
17653 381 391 398 400 391 365 329 297 284 293 315 330 328 309 288 273 263 254 246 242 246 261 284 314 346 374 392 398 396 391 383 366 341 319 310 311 312 308 308 314 322 327 329 332 337 343 353 367
17634 367 379 383 380 375 370 366 363 364 372 383 397 412 424 427 419 404 390 381 378 382 395 416 438 453 457 450 433 408 383 363 352 346 343 341 340 336 327 317 317 325 327 315 297 290 296 303 300 288
17615 288 277 272 272 273 275 278 285 300 327 363 396 416 424 428 439 458 479 493 494 477 449 418 392 374 362 352 341 328 314 303 300 302 305 307 305 301 299 306 323 340 346 342 335 332 331
17597 331 327 323 324 324 314 291 267 255 260 269 268 256 239 224 212 203 197 195 189 175 158 153 162 175 183 189 199 209 205 191 180 182 194 205 214 221 225 223 213 199 189 189 202 225 252
17579 252 277 298 310 310 304 297 289 276 255 237 236 258 295 333 359 370 370 367 364 359 349 332 313 291 268 244 224 209 204 210 227 249 269 286 304 320 327 318 296 273 260
17562 260 252 240 220 203 200 211 227 238 242 240 235 233 238 249 256 252 243 243 251 258 255 245 233 222 217 220 228 229 217 195 174 160 154 156 163 173 181 185 187 184 182 191 212 233 236 225 216 220 232
17543 232 240 242 237 225 209 194 185 184 187 195 209 229 250 270 289 307 328 358 395 432 456 465 466 460 444 421 407 409 419 416 395 368 344 318 284 243 208 189 190 209 244
17526B44M0K9J4%opmMJ4K6L1K0ol2m0l2k0j3rLJ5J4Nj%NPJ2K3K9K2Ppj4k5l7m4l9k2JJ6J9
17509B42RJJQPkj1j0JJ3K0K0J6J2J0RNnj6k2k2j8j3nMJ1J4J5J5Qok1k2rJ1K2J7PlqplJMMM
17491C08MMjljQJ4J8K4L9N0M5J8j2k9l0k4j6nNJ1Pmj4k0j9j5j3j8j9j2mjpp%OPNJ0J5J1lj5
17473C17k1k2j9j2%PJ2J4J7J6R%jkmlKJ3J7J4RJ1J5J6J5J1Loj3j2nKPNkj0j1qpokK%pj1jJ4
17454C63J2mk0j7jJ6K2K1J6J1QKrj9k0j4okmj0j8k6k6j4jN%j0k0k5k6j5JJ3J6J7J5J5J4J5
17438B75J9K1K1K2K5K6K0J2RN%rj8k2k5k6k8k6k2k1k1k0j4oNJ7K8L2K3Kk0l1k7j4%J1J5J1
17423B49Lrj4j4pQL2N0N3L8J8kj7k8k9k3j1m%Jjk%J1K1K5J6Kj0j5j3mKKklk%LJ0K0K5K0R%
17405D08kJOPJj1k4l0l0k2j4nKPJ0RKpj4j4rnmmJRJ3J1PLkprojJjKJ3K3K0Mj8l4m0l3j7jM
$$ plain form
17526 244 284 313 327 327 321 314 310 314 328 354 385 405 399 367 327 295 275 262 253 256 271 285 290 289 289 294 301 313 336 365 387 394 387 373 348 311 267 228 206 207 223 242
17509 242 251 252 253 261 268 266 255 245 246 259 279 299 315 327 337 346 351 346 330 308 286 268 255 250 254 265 279 294 309 317 311 290 268 259 270 292 309 316 313 305 298 295 296 300 304 308
17491 308 312 316 315 312 311 319 333 351 375 414 464 509 527 515 486 456 432 416 411 416 427 434 430 416 396 377 362 349 331 312 300 296 295 288 281 281 287 294 299 309 324 335 332 317
17473 317 296 274 255 243 243 250 262 276 293 309 318 318 317 315 311 308 310 323 340 354 363 374 389 405 420 431 434 428 415 403 398 400 407 412 410 400 389 381 374 368 366 368 368 361 350 349 363
17454 363 375 371 351 334 333 349 371 392 408 419 427 429 420 401 381 367 361 359 355 345 327 301 275 261 260 265 265 255 235 210 184 169 170 183 199 216 231 246 260 275
17438 275 294 315 336 358 383 409 429 441 450 455 455 446 428 406 381 355 327 301 279 258 237 217 203 197 202 219 247 279 302 304 284 253 226 212 212 223 238 249
17423 249 252 243 229 215 208 216 248 298 351 389 407 405 388 360 331 308 297 293 293 294 293 291 291 302 323 348 364 366 356 341 328 324 326 328 326 323 321 321 324 334 354 379 399 408 408
17405 408 406 407 413 420 421 410 386 356 326 304 290 285 287 294 304 313 315 308 294 280 271 266 262 258 259 268 281 292 299 302 300 293 284 278 277 278 277 279 292 315 335 339 321 287 247 214 197 196 200
17385B00nj7k0nK0L9L9K2%oKJ5K5K5K2J6Lj2k2k2j0LJ1J0PMkj0j3pJJlmLJ0Nj3k8k9j1RJ9
17368B72J0nj3j1okMJ2J5Qlj0j3j5j7j0%O%j0j3j1qlLOOMJ0K5L9M1L0J8RJrj8k3k5k9k9k1
17351B15pMJrj6pQK4L3L0K0J1OMjqj5j7j8k0k0j2LK0L0K6Rj1k6k2qRJ9K2K2J9J0kj6k3k5j5
17334B47LK0L2L6L9L4K2Nrj4j4j3j1pjJjnj0j9k2j4KJ2RK%%KNQOKjKMkj2j5qNJ3J5RJjNJ3
17315C75J6J5J4J3R%j1j6k1k2j5oJ%pj2j9k3k7k8k6j9oKLmrpkMJ2K3K5K1J2J2K0K9K9J9Jj0
17298C65j2o%NJ1J5J0mj3j3j0j3j5j4j2j2j1nKjlLJ5K5K7K8K6J3oj6j4ojjmrqKJ4J6Pnj4k1
17280C35k6j9lPJj0j5j2qmNJ0Pmj0j2j5j7j1JJ2J7J6J1kj8k6k2j2kPJ4J6J4J6K1K2Qrj2mj
17263B66rj7rQK1K3J7J1%j1k0j4JJ6K2K0J5J5J7J7J3KnkPJ1Lj2j9j9j6j6j9j9j3%J4J7Qj0
$$ plain form
17385 200 195 178 158 153 173 212 251 273 273 267 269 284 309 334 356 372 375 363 341 319 309 312 323 333 340 344 342 332 319 312 313 314 311 307 310 320 325 312 284 255 244 253 272
17368 272 282 277 264 253 247 245 249 261 276 284 281 271 258 243 226 216 216 222 222 212 199 188 180 177 180 186 192 196 206 231 270 311 341 359 368 369 360 342 319 294 265 236 215
17351 215 208 212 213 204 188 181 189 213 246 276 296 307 313 317 316 308 293 276 258 238 218 206 209 229 259 285 294 283 257 235 227 236 255 277 299 318 328 326 310 287 262 247
17334 247 250 270 302 338 377 411 433 438 429 415 401 388 377 370 369 370 369 364 354 335 313 299 301 313 322 324 324 324 326 331 339 345 347 346 348 352 350 338 323 315 320 333 348 357 358 357 362 375
17315 375 391 406 420 433 442 442 431 415 394 372 357 351 352 352 345 333 314 291 264 236 210 191 185 187 190 186 177 170 168 172 184 207 232 253 265 277 297 326 355 374 375 365
17298 365 353 347 347 352 363 378 388 384 371 358 348 335 320 306 294 282 271 266 268 267 264 267 282 307 334 362 388 401 395 379 365 359 358 357 353 344 336 338 352 368 375 370 356 335
17280 335 309 290 287 294 295 285 270 258 250 246 251 261 268 264 254 242 227 210 199 200 212 229 245 256 254 236 210 188 176 174 181 195 211 225 241 262 284 292 283 271 267 266
17263 266 257 240 231 239 260 283 300 311 311 300 280 266 267 283 305 325 340 355 372 389 402 404 399 397 404 415 418 406 387 368 352 336 317 298 285 285 299 316 324 314
17247C14j9j8qKNMKNJ4K6K7K0QLkj4k8l8l1j5NJ7K3K3K4K5K0J1Kk%LMJmrj7k3k7k4j4%ROn
17229C05rq%J3K8M1L5J6lqnpj6k5k6k0j4qnoj0j3qMJ7K3K3J5Nmj3j7j5rJJ2K1K7K1Mj5j8o
17212C23RPnj7j8j5j0nJMJ0J9K7K6J5ORJ7J5Jj4j6oMJ2J9J8J1LkKOMkpj0j2j6k3l0l4l5k6
17195B65j0QK0K4J9R%nkQJ6J7J0jj2j5j4qmljLNmj8l0l2k5j2NJ6J9J6J5J7J4Jj2j8rPJ9K1
17177C19J0lqnnj1j9j7j0lMJ3K0J4jj3j2KJ4K0K0J8J4RJrj4j5j7j6qJ0K3J7pl2m2l8k7j8n
17161A73J2K6L1K6J4POJ2J7J9K1K4K8L1K9K0Lj1j8j6j4j3j4j8k2k7k8k0rkjoj1j3j3nQJ9K1
17145B86J5RJ2J9K1J3JoqpnLOjj4j9qNJ2RM%j0k2k6k2j7j3oOJ1Pmj0p%OJ1J4J3NknJJ2J9J5
17126C23Nj0k6l7l8k7j0OJ7K5K4J3%n%J1J7K1K0J8J6J4J4J0%j1j5j8k3l0k8j5NJ7J5OJLJr
$$ plain form
17247 314 295 277 269 271 276 280 282 287 301 327 354 374 382 385 383 369 341 303 272 257 262 279 302 325 349 374 394 405 407 405 405 408 412 413 409 400 383 360 333 309 295 295 304 310 305
17229 305 296 288 288 301 329 370 405 421 418 410 405 398 382 357 331 311 297 289 284 278 268 255 247 251 268 291 314 329 334 330 317 300 285 276 277 289 310 337 358 362 347 329 323
17212 323 332 339 334 317 299 284 274 269 270 274 284 303 330 356 371 377 386 403 418 419 405 389 383 387 399 418 436 447 450 448 450 456 460 458 451 441 429 413 390 360 326 291 265
17195 265 255 263 283 307 326 335 335 330 328 336 352 369 379 378 366 351 337 329 325 322 321 324 329 325 307 277 245 220 208 213 229 248 264 279 296 310 311 299 281 272 279 298 319
17177 319 329 326 318 313 308 297 278 261 251 248 252 265 285 299 298 285 273 275 289 309 329 347 361 370 371 362 348 333 316 300 292 302 325 342 335 303 261 223 196 178 173
17161 173 185 211 242 268 282 289 295 307 324 343 364 388 416 447 476 496 499 488 470 454 440 427 413 395 373 346 318 298 289 287 286 280 269 256 243 238 246 265 286
17145 286 301 310 322 341 362 375 376 370 362 355 350 353 359 358 344 325 317 322 334 343 347 347 337 315 289 267 250 237 231 237 248 255 251 241 234 234 240 251 265 278 283 281 276 277 289 308 323
17126 323 328 318 292 255 217 190 180 186 203 228 252 265 265 260 260 271 288 309 329 347 363 377 391 401 401 390 375 357 334 304 276 261 266 283 298 304 305 308 309 300
17110C00j9k0j4j1j6j9j4lPJ6K3K2J3KNJ5J5Mnpm%J0K7L8K8Nj1j4j4j9k4k0j0lkmkPJ9L0L2
17093C63K0lk5l4k8j4kOJ1J2J0Okj3k3k8k5j9j3pKJ5K4K7K8K8K9K7K0J2OkpoLJ3J1ml0m8m8
17077B92l5j5jPJ2J0MnmOJ1Jj7k5k1j4j0lJ1K1K2J5J6K3K6J9Qlj6k9l4k3lRJ5J6J1LkMJ1R
17060C22lrm%lj3k0k5k3j2OK2K9K9K4J7PJJMJ%MLqk0k0qOJ1J2J0MjkLOKmnnpj7l2l9l0pJ7
17041B24L1L0K6K0Qj2k7l1k7j9pRK0J7Qkoj0j2j3j5k1k3j5jJ2J5J1M%JMNJoqpom%RJ7J7J0
17023B27Jm%QJ2QjooJQJ8K3K4K2K5L1K6Qj1j6pMNjj0j7j5rklqql%kmkPJ7K0J7Mrj4qllrrl
17003C23MOPJ1K0K8K9K5K0J6J6J5J3J8L0M8N5M1J0k0m0m4l9l2k6k0j7k0l0l9m0k6nQRLjPJ8
16987C81K3J3ok1j9nLkqnQK0J9Pqj5j1JRPjj1j5j6j4lJ4K7L1K6J8J3RKoj4k6l7m1l7k4j0l
$$ plain form
17110 300 281 261 247 236 220 201 187 184 191 207 230 252 265 267 272 287 302 306 301 294 290 290 300 327 365 393 398 387 373 359 340 316 296 286 283 281 277 275 282 301 331 363
17093 363 383 380 355 321 293 279 277 283 294 306 316 322 320 307 284 256 231 212 199 192 194 209 233 260 288 316 345 372 392 404 410 408 401 395 398 411 422 418 388 340 292
17077 292 257 242 241 248 260 270 274 269 265 271 282 283 266 241 220 206 196 193 204 225 247 262 278 301 327 346 354 351 335 306 272 249 246 255 270 286 297 300 298 302 313 322
17060 322 319 310 306 306 303 290 270 245 222 210 216 238 267 296 320 337 344 345 346 350 351 351 355 358 350 330 310 302 308 319 331 341 345 344 342 345 351 353 349 344 339 332 315 283 244 214 207 224
17041 224 255 285 311 331 339 327 300 269 242 223 216 225 245 262 270 268 262 252 240 227 212 191 168 153 152 164 179 190 194 194 195 199 204 205 199 191 184 178 174 174 183 200 217 227
17023 227 228 224 224 232 244 252 251 245 239 240 248 266 289 313 335 360 391 417 425 414 398 391 395 400 399 389 372 357 348 346 343 335 327 324 324 322 318 316 323 340 360 377 381 372 358 350 347 344 335 326 323
17003 323 327 333 340 351 371 399 428 453 473 489 505 520 533 551 581 629 684 725 735 715 675 631 592 560 534 514 497 477 447 408 368 342 337 345 354 357 356 363 381
16987 381 404 417 411 390 371 366 369 367 359 354 362 382 401 408 400 385 374 375 384 391 390 379 364 348 334 331 345 372 403 429 447 460 469 471 465 451 425 388 347 310 286 276 273
16970B73jJJjrj5j3JJ9K8K9K5J8J1pk8m3l7j3OOj1k7l2k4j0PK4M0M2L6K5J8J5J1RJ1J4J6J3
16954D28Noj9l0k9k0j2j5j8j6qJJ0J8J7Lj6k2j3nj1k2k1mK0L5M2M2L6K5J4NNPRPQJ4J9Nk3
16937D65n0n2l7k3j8j1LJ2J1jj2k0j9pQK0K2J7J2Kj1j9j4nmj1j3nJjj1j3lJ6K7K3Qmj2j7k6
16921B28k9k2rMJ1J6J7J4QOJ2J7J6J2RPO%rj8k0j2%PPRJ6K5K5J9Pqj8j8j1kmj2j7j7j4j1m
16904B43PK0K9K8K0Qmj0j2rqj0j3pQJ8J1mqLJ7K0J9J9K1K0J4OLLPPok9m8m5k5kJ5K4K9K8K2
16886D29J2Lpj5k1k1j4qkj%NJ2J9J6QKLPJ1J8K0J1ok1k6k2j9j3jJ6K5K1RLjpj6k1j2OK1K2
16869D45J1kojKlj5k1j1LPpk5l8l7k5oJ1J8J2%qq%QJ6J6J0Kjmrj3rkkj2j9j4kRJ2J1PMKPJ4
16850C27J8J9J3Kj4k9l7l3k0mMOPJ1J8K2J8Ppk3l2k9j4kMNRJ2J0PJ2J9J9NorkMMJqj6k3k2
$$ plain form
16970 273 272 273 274 273 264 249 236 237 256 284 313 338 356 367 360 332 289 252 239 245 251 240 213 181 157 147 154 178 218 260 296 321 339 354 365 374 385 399 415 428
16954 428 433 427 408 378 349 329 317 302 284 268 260 261 271 289 306 309 293 271 258 253 242 220 199 195 215 250 292 334 370 395 409 414 419 426 435 442 450 464 483 488 465
16937 465 415 363 326 303 285 274 277 289 300 299 287 267 248 241 249 269 291 308 320 322 311 292 278 273 269 258 245 240 241 240 229 216 213 229 256 279 287 283 271 254 228
16921 228 199 177 168 172 183 199 216 230 238 244 256 273 289 301 310 317 323 323 314 296 276 264 264 271 278 287 303 328 353 372 379 371 353 335 324 322 318 306 289 272 258 247 243
16904 243 250 270 299 327 347 355 351 341 329 320 312 302 289 282 290 308 319 315 307 310 327 347 366 385 406 426 440 446 449 452 459 466 460 431 383 338 313 311 326 350 379 407 429
16886 429 441 444 437 422 401 380 366 358 356 355 355 360 372 391 407 415 417 420 427 438 456 476 487 481 460 434 412 393 380 379 395 420 441 450 453 452 445 429 408 396 402 423 445
16869 445 456 454 448 447 449 446 431 410 399 402 409 402 377 339 302 277 271 282 300 312 312 304 296 296 304 320 336 346 348 347 343 334 321 312 310 308 296 277 263 261 270 282 293 300 304 306 313 327
16850 327 345 364 377 379 365 336 299 266 246 242 246 252 259 270 288 310 328 335 328 305 273 244 230 228 232 237 246 258 268 275 287 306 325 330 324 315 313 317 321 322 314 298 275 253
16832B53j3mOJ3J7J6J2RPNQJ9L5M3L5J3oj6j8k0j9j0JOMknrj6j9j2l%rj9k0j6j1qok%MNNO
16814B59QJ4J6J7K0K3J6Jj2j1jJ0J3PJrj7k2j5mNOORJ1RPQJ1J5J2Kqj7j9j9j7j2oklnKJ6L0
16796C55L5K9J6PNJ0J8K7L2L4K5J1mj5j8j6j4j8k6l5m3m5l8k7j4olnrj2rlOJ5K1K4K2J3Nk
16779C48npolOJ4J8J3OK%lj2k1k2j0LJ4J6J3OjnlKLLMJ1J7J9J4Nkj0j5j9j9j3nNJ4J6Rmj2
16761C84j0mKJ0K0K8K8K2J3Kj3k7l6l3k8k3j8j1kLJ1J6J6J1MNJ1J2J0J2J5J5RJoj5k1k3k1
16745C69j5rKJ3J7J3Lpk2l6m0k8pNLnj3j5j0%RJ2J2J2J0MLQJ4J4QMORROLkqrmJ%opmkoj5j5
16725B84pQJ7J7J1OKKPJ5J8J2KJJ5L2L8L1K1J0lj2j1JRLrj1opk1m0m3k6oKmrrrrronj3k0k0
16706B49mJ9L9M2L0J1jnoj4k3k2j6j0qqoookOJ6K0K0J3%j1j1PK8M0L9L0J5jj9l1l6l3k3j2
$$ plain form
16832 253 240 236 242 255 272 288 300 309 316 321 329 348 383 426 461 474 468 452 434 414 395 385 386 392 396 394 389 380 364 345 333 330 330 321 302 282 266 255 247 241 239 239 243 248 253 259
16814 259 267 281 297 314 334 357 373 374 362 351 350 360 373 380 381 372 355 333 318 314 319 325 331 340 351 360 367 375 386 401 413 415 407 390 371 352 335 323 317 315 312 307 309 325 355
16796 355 390 419 435 442 447 457 475 502 534 568 593 604 600 585 567 551 537 519 493 458 415 370 332 305 291 285 282 277 268 256 247 244 250 265 286 310 332 345 350 348
16779 348 343 336 330 327 333 347 365 378 384 386 386 383 371 350 328 318 321 335 351 364 370 369 364 361 363 366 369 373 384 401 420 434 439 437 427 412 393 374 361 356 361 375 391 400 396 384
16761 384 374 370 372 382 402 430 458 480 493 495 482 455 419 386 358 335 317 306 304 307 318 334 350 361 365 370 381 393 403 415 430 445 454 455 449 434 413 390 369
16745 369 354 345 347 360 377 390 393 386 364 328 288 260 253 258 261 256 243 228 218 218 227 239 251 263 273 277 280 288 302 316 324 328 334 343 352 358 361 359 351 342 338 339 339 333 326 322 320 314 299 284
16725 284 277 285 302 319 330 336 338 340 347 362 380 392 394 395 410 442 480 511 532 542 539 527 516 517 526 529 520 509 503 496 475 435 392 366 360 362 358 349 340 331 322 313 307 302 289 269 249
16706 249 245 264 303 345 375 386 385 380 374 360 337 315 299 289 281 273 267 261 255 253 259 275 295 315 328 328 317 306 313 341 381 420 450 465 464 445 414 378 345 322 310
16690C10j0j7k2j6KJ4J5Ooj6j6rlkolRK2K8K6K0J8J7J8J4Lj5l3m0l9l5l1k5j0NJ3J0NJKNO
16673B15QJ0J2Mj1k3k2pNNJMJ5K5K8K1J3Njqj0j4j6j5qMJ8L2L8M0L5L3L0K3J0pj9k3k5k6k7
16657C72k6k3k1j9j7j6j4pKPPKoj3j6j6j0%J0K0K8L1K5J7J2J0J0RPONJpj6k3k7k5j8rnrj6
16640B22j7j1qpqmOJ4J9K3K4J5lj4j2mJNJ6K6K7J6Ojqj3qRK2J5mj8j5jJ7K5K0Lj8k7k0oNJ1
16622C20Qlj5j9j1JNM%jLQJ0J1J1RMqk0k5k1j4oQK7L9L4J5mj1j3j1plJLRJ3J0Kopl%%mmlk
16602C34nj6k2j5MJ6J8J3Omk2l4l1j4lmj3j7j6q%PJ0J2J6K4K6J9Nj0j8j8mJ6L2L5K5J5QPR
16586C83J1J3RKoj2j0onookMJpj3j0kMRJ5J5Kj6k0lK0L1K7K0J2Njmqk0l0k9j8j2j8k0j2JP
16568B95Kmj0j2j5j1mMJ4K7L6L3K0QLNPJ1J3Pnj7j8rkjk%LQJ2J5J0LLQJ0kk1l2k6j2lnpLJ9
$$ plain form
16690 310 300 283 261 245 247 261 276 282 276 260 244 235 232 230 224 221 230 252 280 306 326 344 361 379 393 396 381 348 308 269 234 203 178 168 173 186 196 201 202 204 209 215
16673 215 223 233 245 249 238 215 193 186 191 196 197 201 216 241 269 290 303 308 307 299 289 275 259 244 236 240 258 290 328 368 403 436 466 489 499 492 473 450 425 399 372
16657 372 346 323 302 283 266 250 236 229 231 238 245 247 241 228 212 196 186 186 196 216 244 275 300 317 329 339 349 358 365 371 376 377 370 354 331 304 279 261 252 247 238 222
16640 222 205 194 186 179 171 167 173 187 206 229 253 268 265 251 239 235 236 241 257 283 310 326 332 331 323 310 302 311 333 348 344 326 311 310 327 352 372 375 357 330 310 304 309 320
16622 320 328 325 310 291 280 281 286 290 290 289 292 300 310 321 332 341 345 337 317 292 271 257 251 259 286 325 359 374 370 359 346 335 328 325 326 329 338 351 361 363 357 350 347 347 347 343 339 336 334
16602 334 329 313 291 276 280 296 314 327 333 329 307 273 242 228 225 221 208 191 175 167 167 174 184 196 212 236 262 281 286 276 258 240 236 252 284 319 344 359 367 374 383
16586 383 394 407 416 418 412 400 390 384 379 373 367 365 369 370 363 350 340 338 342 351 366 381 383 367 347 344 364 395 422 442 454 459 458 454 446 426 396 367 349 337 319 299 287 288 295
16568 295 297 293 283 271 256 245 241 245 259 286 322 355 375 383 386 391 398 409 422 429 424 407 389 380 378 377 375 375 378 386 398 413 423 426 429 437 447 445 424 392 366 354 351 346 339 342 361
16549C61L0L0K2J3PKlj1k3l4l8l4k6j7oOJ2Rjj0j2j3j1qnJJ3K7L3K1lk1k5j0OJ7J9J2L%NR
16532C47RM%kpj2j9k3k9l0k3j0MJ0Nj1l2m5l9j9MJ7K2L0M0M4L7K7J8Pj2l2m4m2l4k7j6KK2
16516A41L2L4L1K7J7JrnOJ1J2J8K8L1K1Nnj0j1j4j0LJ8K0J0klJKpj5j3oMQJ0NlqpJPQRMmj2
16498C81j0KJ2J3Lpj4j8j7j2lOOJjLPNoj4j4j0nm%JJjKJ1J5J4J5J6J5J1J2J6J8Oj4k2j8ol
16480C93qk1l1l4j9MJ9J6Mnqj0j1oPJ8J8J0MNRJ1J0Omj2j6j0lJkl%OOJmokjjoj1j3j3j3j0
16461B65nLPJ0J0J4J7J6Ppj6j4lORPPQJ0RONNOMlj0rmJKNJ1J3Kj6k3j7j1j1j6j7j4j3j3j3
16442B30rlNRPlj3j3rolLJ0J3Nj0k1j8jK2M0M0K9J2Jqj7k5k6j8oQK3L5L7K4Kj3j3rj1k1k8
16425B51k5j6plmprj2j3j9k4k1qMRPNQJ2K1L3M0L8K6J7J7J9J6Pjpj0okmj7l2l8l0j0J2K8L2
$$ plain form
16549 361 391 421 443 456 463 465 462 451 428 394 356 322 296 279 273 279 291 300 299 289 277 264 253 245 240 241 254 281 314 335 332 311 286 276 282 299 318 330 333 333 338 347
16532 347 356 360 360 358 351 339 320 297 268 238 215 205 209 219 224 213 181 136 97 78 82 99 121 151 191 235 272 299 317 324 312 280 236 194 160 133 117 119 141
16516 141 173 207 238 265 282 283 274 269 275 286 298 316 344 375 396 401 396 386 375 361 351 354 372 392 402 400 397 398 400 393 378 365 359 363 371 381 386 383 375 368 369 376 384 393 397 393 381
16498 381 371 373 385 398 401 394 380 362 345 333 330 336 342 343 342 345 352 357 351 337 323 313 308 304 304 305 306 305 307 318 333 347 362 378 393 404 416 432 450 456 442 420 402 396 393
16480 393 385 364 333 299 280 284 303 319 323 318 310 300 289 283 290 308 326 336 340 345 354 365 375 381 377 365 349 339 336 337 335 332 332 338 344 345 341 335 333 332 331 325 314 301 288 275 265
16461 265 260 263 270 280 290 304 321 337 344 337 321 307 304 310 319 326 333 341 351 360 366 371 376 382 386 383 373 364 360 361 363 368 379 392 394 378 355 338 327 316 300 283 269 256 243 230
16442 230 221 218 223 232 239 236 223 210 201 195 192 195 205 218 223 213 192 174 173 195 235 275 304 316 317 309 292 267 241 223 217 225 248 283 320 344 346 333 320 311 300 279 251
16425 251 226 210 203 200 196 189 180 168 155 136 112 91 83 87 96 103 108 116 128 149 182 222 260 286 303 320 339 355 362 361 354 344 338 336 332 315 283 245 215 205 217 245 277
16408B77K1QKJ%nj0j0n%OJ1J1Omj1j6j6j4rLJ4K0J7RORQmk1l0k2rkoj5j7rKPKmjJ1K2K3J6
16389B72RPQNJKQJ1QOQJ7K2J5Lmnmj1k2k9k8k5l0l7l6k2mRJ5K1K2J6M%J0K3L0K4J2%j0k3l4
16371B64l7k5kK1L3L5L2K8J4kj3q%mj4j9j6j1j1j4pJ2L0L8L5K9K3J9J1Jj1j6j4pjlj1j7k0
16355C42j9k3l4m4m3k5LK6L0J2j3k7k0mJ0J6K1K7K8J7KpojKJlpn%QJ2J1Nmj7l1m7n6n2l4r
16339D2J4K8L1K6J8J3J8K6K8K5J9J7J8K1K1J9J4Qmj4j9j7qllnonkJLKjlnrj7k2j7nJ0J3Nq
16321B67j7j6nOJ0Kpj1okLPJ1RJ1J8K5J9lk0j7jQMoqlJJNQRNJMRJ1Pjj2k5l4l5k6j8j0lPJ2
16301A94Qnj8k2k0oJ3K7K9J9J0J0J3J0KlJLmj8k6k0mJ1K1K5K6J9Kj8k9k6j2LJ2J5J6J0ok1
16285B41k6j4KJ0ROMQJ2J7J7J6J3J3J2J0NLKLMOJ0J3J0Mnj5k7k9k0jJ5K2J9J7J9J9J2lj6j7
$$ plain form
16408 277 298 306 308 309 309 304 294 284 279 279 285 296 307 313 309 298 282 266 252 243 246 260 280 297 306 312 321 329 325 304 274 252 243 241 235 220 203 194 196 203 205 201 200 211 233 256 272
16389 272 281 288 296 301 302 304 312 323 331 337 345 362 384 399 402 398 393 389 378 356 327 299 274 244 207 171 149 145 154 169 190 212 228 232 232 242 265 295 319 331 331 321 298 264
16371 264 227 202 200 221 254 289 321 349 363 361 348 340 340 336 322 303 287 276 265 251 244 256 286 324 359 388 411 430 441 442 431 415 401 394 393 390 379 362 342
16355 342 323 300 266 222 179 154 157 183 213 225 212 185 165 161 171 187 208 235 263 280 282 275 269 268 270 271 268 261 256 256 264 276 287 292 288 271 240 193 137 85 51 42
16339 42 56 84 115 141 159 172 190 216 244 269 288 305 323 344 365 384 398 406 402 388 369 352 344 341 338 333 327 322 320 321 324 326 325 322 317 308 291 269 252 247 257 270 275 267
16321 267 250 234 229 235 245 247 240 229 223 221 224 231 242 251 262 280 305 324 321 301 284 283 291 295 289 281 278 279 280 285 293 302 307 308 312 321 332 339 338 326 301 267 232 206 188 178 175 182 194
16301 194 202 197 179 157 137 131 144 171 200 219 229 239 252 262 264 261 262 265 261 243 217 197 193 204 225 250 276 295 297 279 250 224 212 215 227 242 258 268 262 241
16285 241 215 201 203 213 222 228 232 240 252 269 286 302 315 328 340 350 355 358 360 363 367 373 383 396 406 410 405 390 363 334 314 313 328 350 369 386 405 424 436 433 417 400
16268D00j2pqj2j0pj2k2l3m0m0l2j7KJ1QjrpjOJ4J8K1J9Qoj2j0mlmmLJ4K2K4K0J1%prnLJ4
16250B84J9J3jj5k0j6oNJ3J8K0K1J9J4QQJ3J5J4J3J6K1K0J2mk4m2m9m7l7k4rNJ0QNPQMLQJ3
16233C43Nj2k6k7k0j4j1pjJ%MJ4J9J7PjorrmPJ2PlnKRQLMQJ1Pkqj4k2k9l0k0jJ8L0L2K4Rr
16214C11k0k0j4j0qjRR%j3j4oJJLPJ3J6J4J1ORJ8K9K8Qj9l3k5mJ8L2L4K4J6J2J3QJnkmj7l7
16196C99m2k6nJ1J7J7J1lj4j2jLpj7j5ooj5k0j7j0qrmQK7M7N9N3L0Mj3j2lKkj3k2k0nJ3K7
16180D01L0K3Oj6l4m0l7k7j3MK4L3K6J1jl%LOPOOJ3K0J8Mj2j5q%JKNPMknmJL%pj1o%lj7k4
16160C79j7jMqk1k6k0qNJ6K4K1PnlJ0K2J8jk4l7l4k1j0lJQJ7K4K4J3JmJNKoj5j5q%Lmj6k4
16142B74k2j4rlLJ3K3K8K7K6K9K8J6kj7k5k7l3l6k8j0OJ1RJ0J6K1K3J7Pmp%ORPOKrj9k3j9
$$ plain form
16268 400 388 381 373 361 351 344 332 310 277 237 197 165 148 150 161 169 168 159 152 151 157 171 189 210 229 237 231 219 209 205 202 198 194 197 211 233 257 277 288 288 281 272 267 270 284
16250 284 303 316 315 300 280 264 258 263 276 294 314 335 354 368 376 384 397 412 426 439 455 476 496 508 504 480 438 389 342 305 281 272 277 287 295 300 307 315 319 322 330 343
16233 343 348 336 310 283 263 249 238 231 230 231 231 235 249 268 285 292 291 285 276 267 263 270 282 289 286 281 283 292 300 303 307 315 326 333 331 323 309 287 258 228 208 207 225 255 287 311 320 311
16214 311 291 271 257 247 239 238 247 256 256 243 229 223 224 225 228 235 248 264 278 289 295 304 322 351 379 387 368 335 310 306 324 356 390 414 430 442 455 463 464 459 457 453 436 399
16196 399 357 331 326 337 354 371 382 379 365 353 352 355 348 331 316 310 304 289 269 252 242 234 225 221 229 256 303 362 415 445 449 436 424 421 423 421 408 386 366 361 374 401
16180 401 431 454 460 444 410 370 333 306 293 297 321 354 380 391 390 387 387 390 396 403 409 415 428 448 466 470 458 443 435 435 436 438 443 450 454 452 447 443 444 447 447 440 429 423 423 420 403 379
16160 379 362 361 365 357 336 310 290 282 287 303 327 348 355 350 347 357 379 397 396 372 335 301 280 270 267 268 276 293 317 341 354 355 351 352 357 359 353 338 323 315 315 318 314 298 274
16142 274 252 238 229 226 229 242 265 293 320 346 375 403 419 417 400 375 348 315 279 251 241 247 258 267 277 293 314 337 354 361 357 350 350 356 365 372 378 380 371 352 329 310
16125C10j5rjORJ0J1J1NlpjNMoj8k4k1j7j8k2j9qKNLPK0K7K0OjKQOlj4j9k1k1k2j7JK3L8L5
16107B67K4J9K2K2J9J1Krj7j9j4j4k2l1k8j0PJ2LolJ3K6L2L1K6K0J1MjKQJ5J5J0jj0j6j5j0
16091C95%J0J3Onj2j7j9j7j0%RRNnj6k5k3j2jNJ0J7K3J8Plorj4j6rJRJ1Ojqj1j1j3j6j2ok
16073B55kkPJ9K4K5K7L2L3K5Rnj8k5k5j6nJMMLqk4l2k4j0kj%MQNMQJ2QmpLJ5J5%j8l0l4k8
16054B30j6mKKJJ3L1M6M0J7j4l4l1j2J0K1K3K0J6Nj2k6k9k5j9j7j4lJ1K5L3L1K2J2Njj1k5
16039C23l7l8k9j8nJ1K8M0L8K4J2J0RLqj0lKjpoKPNjKJ0J6J3Kj1j6rMJ5K2J8Pqk0k5k5k6k4
16021B96j9j3qlMJ2J6J3QOQJ4J9K2K1J5Nmj2rJJ8L7M5L9K0lj5k1k0k1k6l4m4m8l9j8KJ0Q%
16005B82pj2j3j1qrj0j0oMJ4K5K9K7K1J4Pkj2k3l2m0m0k6JK5L2K6J7J5J6J6J4J3J0QLLOJ4
$$ plain form
16125 310 295 286 285 291 300 310 321 332 337 334 327 326 331 335 329 311 287 266 249 231 209 190 182 184 189 192 199 219 246 266 272 271 273 281 287 284 270 251 230 209 187 170 171 194 232 267
16107 267 291 310 332 354 373 384 386 377 360 341 327 313 291 260 232 222 229 241 244 238 235 248 274 306 337 363 383 394 398 397 399 407 422 437 447 446 436 420 405 395
16091 395 395 405 418 424 419 407 390 371 354 344 344 353 362 367 362 346 321 298 286 285 290 300 317 340 358 365 362 356 347 333 317 308 309 318 329 335 334 326 315 304 291 275 263 257 255
16073 255 253 251 258 277 301 326 353 385 418 443 452 447 429 404 379 363 358 359 363 367 370 362 338 306 282 272 270 269 269 273 281 286 290 298 310 318 314 307 310 325 340 340 322 292 258 230
16054 230 214 210 212 214 215 228 259 305 345 362 348 314 283 271 281 302 325 345 361 366 354 328 299 274 255 238 224 221 232 257 290 321 343 355 360 359 348 323
16039 323 286 248 219 201 196 207 235 275 313 337 349 359 368 371 363 353 350 352 351 344 338 340 347 352 351 353 363 379 392 394 383 367 358 362 377 399 417 424 416 396 371 346 320 296
16021 296 277 264 256 253 257 269 285 298 306 312 320 334 353 375 396 411 416 412 400 391 392 410 447 492 531 551 548 533 512 492 471 445 411 367 319 280 262 264 274 282 282
16005 282 275 263 250 239 231 222 212 202 196 200 214 239 268 295 316 330 337 335 323 300 268 228 188 162 163 188 220 246 263 278 294 310 324 337 347 355 358 361 367 381
15989C81K0K4K3J5jj3j6q%Jkrj6k1k0j4j1j4j9j5lNNjmk%kpj0mQK2K3J6POJ4J8J6J1RJ2J6
15971D40J4Rjj1k3l7m6m7m2l8k8lK8M7M2K5J1RQLpj6j9j9j3kQJ5J7J2NKNJ0OkmJMmj5j8j5
15954C11j6j9j6%K3M0M5L2Rj1j7rJOJ1Qmk0k1pJ0J3Nmqj0j0pkMQNmj8k6k3j4rj1j1mNJ1J1
15936B57RNKLOQLnj1oQK8M1M1K9J5OJmj2k0k8l3l1j8NL1M9N5M8L3J5ok6l8l8k7j0%OQQPLn
15918D12j7k8l2k1nOMkl%kj0j7j4pKQJ3J6J1Krj8k5k2rJ0K4K7K2J6Pmj4j5qqj4j9j2MK0K6
15901B95K5J8J0K%KMJlj0j5j0MJ8J8NppMJ0Rjj0j5j2mjnqkOPKkKRJ4J1QKmj5k3k5k2j5j0r
15882B51rj0j3j6j0KQOJNJ6K6K9K7J9PmmPJ0mk2k7j6lkqj2j1roJJ1J6Poj1mJ0J9J8J3J1QO
15864C27PJ5J8J1nj7j3LJ4J6RLlrj7k6k7k0nRJ6J7J4J4J2Oj2l0l9l5k5j8j5j2pLJ2J8J8J2
$$ plain form
15989 381 401 425 448 463 462 449 433 425 425 426 424 415 399 378 358 344 333 319 300 285 282 287 292 291 287 285 285 283 276 266 262 270 292 315 331 338 344 358 376 392 403 412 424 440
15971 440 454 463 462 451 428 391 345 298 256 218 190 187 215 262 304 329 340 349 357 360 353 337 318 299 286 284 292 307 324 336 341 343 348 358 364 362 358 359 363 359 344 326 311
15954 311 295 276 260 260 283 323 368 400 409 398 381 372 373 379 390 398 394 374 353 346 356 369 374 370 362 352 342 335 333 337 345 350 346 328 302 279 265 256 245 234 230 235 246 257
15936 257 266 271 273 276 282 290 293 288 277 271 279 307 348 389 418 433 439 440 436 424 404 376 343 312 294 299 330 379 434 482 515 530 524 498 460 422 395 385 385 391 399 407 414 417 412
15918 412 395 367 335 314 309 315 319 317 314 314 312 302 285 271 264 266 274 287 303 314 316 307 289 264 242 233 243 267 294 316 332 339 335 321 306 298 290 276 257 245 249 269 295
15901 295 320 338 348 350 350 352 356 357 354 344 329 319 323 341 359 364 357 350 354 364 373 372 362 347 335 331 330 325 317 315 321 328 330 328 330 339 353 364 372 374 370 355 332 307 285 270 260 251
15882 251 242 232 219 203 193 195 203 209 210 215 231 257 286 313 332 339 335 331 338 348 344 322 295 279 276 274 266 254 243 234 228 229 240 256 263 257 246 242 252 271 289 302 313 321 327
15864 327 334 349 367 378 373 356 343 346 360 376 385 388 385 376 359 333 306 286 281 290 306 323 337 351 363 369 357 327 288 253 228 210 195 183 176 179 191 209 227 239
15847B39LmmOJ7J8J0JMJ5K3K5K6K9K6Rj5k9l1k4j0OJ8K0J0mj5k7l5l6k9k0j4lJ5K7K6J5RJ0
15831C07J2Nnj1qJJ0J7J5RLJ%j%MMjnojJjnrp%J1K4K9L0K6K2J5Mnj6k3l0l1k9k7j6%J7K0R
15813C59oj0oKORPmk3l8l9k3%J4J3MkMJ1J3PMNJ2J9K9L1J9ql2l6k0m%kkLJ0J3J3RONOOM%p
15793C81j5j8j3kKqk1k0qLJqqJJ5K4K4J7Kj2j8j2%ONKPJ7J8Mj4k3j5jRJ1Plj9l6m0k4LK5L3
15775B79L3L1K5J7Pmj1j1lPJ1PJlnj1j3j2rrrnNJ2J5J9K3K1Rmj4j6j6j9k4k9k8k1pLOKkoj2
15757B30j7j7qOJ4J9K1J9J0%lKJ3K0K1J4kj9k7k2j4j0pJROpk0k2j4pkKJ0K3L5L9K9J1nj5k2
15740B94k8l5k9j7njLJ3K1J9Nj4k1j2J4L8M6L4J7RJ1J4J3RPMjrj0ojkpoKRNmj2j3j0omloj1
15722C14j1mNPLJknokJ0J8J7J0jj1j7j4jJ4K1K0J4J0J1J2J0M%%%oj6k5k9k6k5k3j9j0JJ0J2
$$ plain form
15847 239 242 238 234 240 257 275 285 286 290 305 328 353 379 408 434 443 428 399 368 344 334 340 358 378 388 384 369 342 307 271 242 222 208 205 220 247 273 288 297 307
15831 307 319 324 319 308 300 301 311 328 343 352 355 356 356 355 355 359 363 362 357 351 350 351 350 345 336 329 329 340 364 393 423 449 471 486 490 485 469 446 416 385 356 329 313 313 330 350 359
15813 359 353 343 337 339 345 354 361 357 334 296 257 234 234 248 261 265 263 267 278 291 298 302 307 319 338 367 398 417 409 377 341 321 317 317 315 313 316 326 339 352 361 367 372 378 384 388 388 381
15793 381 366 348 335 333 335 327 306 286 278 281 282 274 266 267 282 306 330 347 349 337 319 307 307 313 318 320 327 344 362 366 352 329 314 313 322 333 340 337 318 282 242 218 221 246 279
15775 279 312 343 368 385 392 388 377 366 363 370 381 388 389 386 381 370 357 345 336 327 318 313 318 330 345 364 387 408 417 413 399 383 367 348 324 295 267 246 239 242 248 250 248 242 230
15757 230 213 196 188 194 208 227 248 267 277 277 274 276 289 309 330 344 342 323 296 274 260 250 243 244 253 259 252 232 210 196 189 187 189 199 222 257 296 325 336 331 316 294
15740 294 266 231 202 185 180 179 182 195 216 235 240 226 205 193 207 245 291 325 342 351 362 376 389 398 405 409 408 399 389 383 382 380 373 367 369 378 383 379 367 354 344 338 334 331 325 314
15722 314 303 299 304 311 314 315 313 308 302 300 310 328 345 355 354 343 326 312 311 325 346 366 380 390 401 413 423 427 427 427 427 421 405 380 351 325 300 277 258 248 249 259 271
15705B71J0MMRJ2J3J4K0K6K6J9J2Pkj1j5rjjj1j7k0k0k1j8j2jOJ0Plj6k3k0j1onomLJ0J7K2
15687B69K1J4%j6k9l3l3k6j3JJ6K3K8K7K1J0lj0q%L%mpj0j2j0jPRNNRJ1J3J5J8J7J0PJ1J5
15670C70J3PQJ6K0J6QKjrj7k1j8k1k3k3j3mk%PJ7J9Opj3j3j5j9j8j0%KJMJ9L7M4L1J1jj%j
15653D08JPQ%j7k9l3l4l1k3rNJ0J2J2J3J2J3J8K0K1K3L0L1K0mk5l1k9k7k5j9mJ4K2K1J4P%
15637D02j0j8j5mRJ6K0K1J6%j8k7k7k3k0j5qkMJ1K1K5J6lk1k7k4j5mJ0K0K7K9K6J5LnkQJ9
15621D30K2J5lk5l6k4jJ1nk9l5j7NJ4J3QJ0J6K2K1Rj4l2l3j9kNJ0J6K0J8J0jj0j5j8k0k2k8
15605B86l0k7j7ronnllopkJ2K9M3M1K7Rqk0k6k3qJ4L6M0K3jj9j6mRJ4J5J1%j4k5l0k9k5j7
15588B24j2j2rKJ5K2J8J1PJ4K6M1N2N2M1K8J8Qok1k9k7k1j7j7j7k1k5k4j5kOJ0J3J2RML%r
$$ plain form
15705 271 281 285 289 298 310 323 337 357 383 409 428 440 447 445 434 419 410 409 408 397 380 360 340 319 301 289 288 294 304 311 308 292 269 249 238 232 227 221 217 220 230 247 269
15687 269 290 304 304 288 259 226 193 167 154 155 171 194 222 249 270 280 277 267 259 259 262 262 258 251 241 229 219 218 225 234 239 244 253 264 277 292 310 327 337 344 355 370
15670 370 383 390 398 414 434 450 458 460 459 450 433 412 394 373 350 327 314 310 308 308 315 332 351 357 350 337 324 309 290 272 262 262 264 265 269 288 325 369 400 411 410 409 409 408
15653 408 409 416 424 424 407 378 345 311 280 257 248 253 263 275 287 300 312 325 343 363 384 407 437 468 488 484 459 428 399 372 347 328 324 338 360 381 395 402 402
15637 402 392 374 359 355 364 380 400 421 437 437 419 392 365 342 322 307 299 297 301 312 333 358 374 371 350 323 299 284 280 290 310 337 366 392 407 410 405 403 411 430
15621 430 452 467 464 439 403 379 378 389 384 355 320 303 308 322 335 343 353 369 391 412 421 407 375 342 323 321 326 336 352 372 390 400 399 389 374 356 336 314 286
15605 286 256 229 212 203 197 192 187 184 181 175 168 166 178 207 250 291 318 327 319 299 273 250 242 256 292 332 355 354 335 319 315 324 338 353 364 364 350 325 295 266 241 224
15588 224 212 200 191 193 208 230 248 259 266 280 306 347 399 451 492 520 538 546 540 519 490 463 442 425 408 391 370 345 321 306 304 310 320 333 345 354 358 361 361 352
15572C52k0k4j9j2j1j4j4j0mknqlRK1K7K3J6J3J2J2J0J3K0K8L0J9mk7l8l8k9k0j1prj5j5o
15557B40PJ7J9J8K1K1J8PklLPLrj7j9j3kQJ4Rkj2j5j1pjMO%j0j5j4rppqLK0M0M8L9K2Pjlk
15538D12%nj7k4k2j4pJJ3K4K0Jj9k5j6pOK1L5L6K0kk0k4k0j7j9k5k2qPJ3J2J9L2L5J9oj7r
15522C81NPmj6k1j9k0k3k5k4j9j1mLOQJ1J9K7L2K5J2mj5j3pkjLQJ0QPPKqj1mOPjpj0j7k7k7
15503B54j2PK0K0J8J2Kpj0nQJ5J1kqnMLnj1j1j1j4j4pMJ0Olrj2j1nLJ3K3L2L5K9J5Jqj2qk
15485C53QJ6J8J0pk0k2j1%Lnj6k0j9j5rnJRJ7K3K0J6J1J0RPL%mj1j8j5kJ0J1mj8k1j2jJ1K2
15468C33L0K7J5%rj1j1j0pmlmnppnk%lmlJK%oj6k8k9k1qlomQK3L5L5K2Nnn%mj5k7l4l4k8j6
15448A52lPJ3K0K6K7K2J5O%kMJ4K0K5K8L0K8J7Mj0j7k1j8j3pJJ0J3MonPJ5J2Lkoj1j3j3j4
$$ plain form
15572 352 332 308 289 277 266 252 238 228 224 222 217 209 206 215 236 263 286 302 315 327 339 349 362 382 410 440 459 455 428 390 352 323 303 292 285 276 261 246 240
15557 240 247 264 283 301 322 343 361 368 366 363 366 373 376 367 350 331 318 316 324 338 347 345 333 318 307 300 299 303 309 309 299 284 270 261 254 247 239 242 262 302 350 389 411 418 417 414 412
15538 412 412 407 390 366 344 330 323 324 337 361 381 382 363 338 322 315 321 342 377 413 433 431 411 387 367 350 331 306 284 276 283 296 308 327 359 394 413 407 390 381
15522 381 386 393 389 373 352 333 313 290 265 241 222 211 207 210 216 224 235 254 281 313 338 350 346 331 318 311 309 308 311 319 329 337 344 351 353 345 334 330 336 343 342 335 325 308 281 254
15503 254 242 249 269 289 307 319 321 314 304 299 307 322 333 331 323 318 322 325 320 309 298 287 273 259 252 256 266 272 269 260 248 237 232 235 248 271 303 338 367 382 383 375 363 355 353
15485 353 361 377 395 405 398 378 356 345 345 348 343 327 307 288 273 264 259 260 269 286 309 329 345 356 366 375 382 385 385 381 370 352 337 335 345 356 352 334 313 301 300 311 333
15468 333 363 390 405 405 396 385 374 364 357 353 350 346 341 334 327 322 320 320 317 313 310 311 313 313 307 291 263 234 213 205 202 196 192 200 223 258 293 315 320 315 310 310 306 291 264 230 196 168 152
15448 152 149 156 169 189 215 242 264 279 285 285 283 287 301 321 346 374 404 432 449 453 443 426 405 387 374 367 368 378 391 395 389 384 391 406 418 421 419 413 402 389 376 362
15431C62k0k4k2j0LJ2J5Rjqrrj2j1JJ5J9J2MMRJ6J9J9J8J2Lqj6j4pPJ7K7L3L2K0%j6j9j3J
15415D70J3J6J1Jpj4k5l4l5k8k1j7j4j7k5l6l8k7rPJ7J9J7J5J8K4K5J7OJjlqj5j9j5mK%nj
15398B61J3J8Rk%RRjqnQJ4J3RLok1l7m1k9j0jmnPK2K5J1oj5j5j3j0jJ1K3K8K0Plnnoj0j3j0
15380B38mKMLMJ1K4L7M4M2L2J4nj7j5nLMjon%QJ2Nqk0k5k1j2ppj2j2oJ%npkJKJLOPRRJ0Nj
15359C38nlLNJkLJ6K4J8LpqjNJ0J1QJkJPJ0PMKKJ%%NPkj9k8k4j3j1j4j9j8j6rKJ4J6RMKmj4
15339C20k0j1PJ7J7J4J2J0Mnj1j1qqj6k4k5j6ok%LKlj1j1%RJ3J3J2J2Pmj1kJ8L6L7J9jj0j5
15321C51j7j8rKJ1J4J8J8J1ok1k6j8pJKkqj0mPJ3J3QNKJKQJ1Qjj0j0lPJ5K0J6Lj6k5k4k0k2
15303B90k5k4j9j2JK0L2K6Pqj2j0j0okJKJ2K5L2K4J1N%mj1j5j5j4j1qqj3j3kJ4J7Nqj0mMJ2
$$ plain form
15431 362 342 318 296 286 289 301 316 325 324 316 307 298 286 275 276 291 310 322 326 330 339 355 374 393 411 423 426 418 402 388 381 388 405 432 465 497 517 517 501 482 469 470
15415 470 483 499 510 511 504 490 465 431 396 368 347 330 316 299 274 238 200 173 164 171 188 207 224 239 257 281 306 323 329 330 329 326 318 303 284 269 265 267 267 262 261
15398 261 274 292 301 299 299 308 317 316 308 303 311 325 338 347 350 344 323 286 245 216 206 205 201 196 203 225 250 261 255 240 225 212 202 201 212 235 263 283 290 287 282 277 271 261 248 238
15380 238 234 236 240 243 247 258 282 319 363 405 437 451 446 429 414 409 412 416 415 409 404 404 412 424 429 421 401 376 355 343 336 329 317 305 299 300 300 295 288 286 287 289 290 293 299 306 315 324 334 339 338
15359 338 333 330 333 338 339 337 340 356 380 398 401 394 386 385 390 400 411 419 420 418 419 426 436 443 447 449 451 452 452 452 457 464 462 443 415 391 378 367 353 334 316 300 291 293 307 323 332 336 338 334 320
15339 320 300 289 296 313 330 344 356 366 370 365 354 343 335 327 311 287 262 246 240 238 238 241 243 240 229 218 218 227 240 253 265 277 284 280 269 267 285 321 358 377 376 366 351
15321 351 334 316 307 309 320 334 352 370 381 375 354 328 310 303 304 306 304 296 286 282 289 302 315 323 328 330 331 333 341 352 360 359 349 339 336 343 358 378 394 397 381 356 332 312 290
15303 290 265 241 222 210 211 231 263 289 296 288 276 266 256 250 248 249 251 263 288 320 344 355 360 360 356 345 330 315 301 290 282 274 261 248 246 260 277 282 274 264 260 264 276
15286B76J7K2K3K3J6Ork0k1j7j3j1oOK3L4L8L4K5J1mk1k7k5j9j7j5pLJ1J0RJ1J3Pmj0oLPK
15270C78oj4j7j7j5r%RJ6J8J3%j6k5k2pJ1K4J9%k1l0k3j3j0qppj1j3oQK0K4K4J9J2%rj8k6
15253B45k9k0nONMJ3K7L7L5K9J7NoqmjKJ0K0K2J2mq%J3J7J3NlqpLK0L2L3K0Kj0j6j6j4rnj
15235D73mj0j5j6j2j0nk%lrj7j9j6mJ6L3L6K3Kj4j8j3poj2j8j5roj1j9k5k6j9mJ6L0K6Qqj3
15218B78pNJ8K8L3L2L0K7J8J0POMnj2k0k8m0m7m5l7k9j6KJ8K4J8QMRK0K4J8Nrj6j7j8j6j4
15202B70rlOJ1J2J2J8K7K8J7Nmrj5j9j2%MjqojNJ4K5K8J7%rnKLMOJ2J0lj9k5k2j5j6j8j7r
15184B91LQOkpkOROjmnj0j6k0j9j4nJJ0J7K5K9K6J7J1J0Lrj8j1KJj3k0j1JNjmkKNOM%jKML
15164C18ll%%JRK2L4L9L5K4J1nj5j9j4pj0k1l7m4l6k4j6j4j4j1mOJ0J2J4J9K1J5Mmpj3j6j4
$$ plain form
15286 276 293 315 338 361 377 383 374 354 333 316 303 292 286 292 315 349 387 421 446 457 453 432 405 380 361 344 329 322 325 336 346 355 366 379 386 382 372 366 369 376 378
15270 378 372 358 341 324 309 300 300 309 325 343 356 356 340 315 293 286 297 321 340 340 319 289 266 253 243 235 228 221 210 197 191 199 219 243 267 286 298 298 289 271 245
15253 245 216 196 191 197 202 206 219 246 283 318 347 364 369 363 355 351 350 352 362 382 404 416 412 404 404 417 434 447 452 449 441 434 437 457 489 522 542 544 534 518 502 488 479 474 473
15235 473 469 459 444 428 416 406 401 399 399 396 387 370 351 335 331 347 380 416 439 441 427 409 396 389 383 371 353 338 329 323 312 293 268 242 223 219 235 265 291 299 291 278
15218 278 271 276 294 322 355 387 417 444 462 472 479 485 489 484 472 452 424 384 337 292 255 226 210 212 230 254 272 280 284 293 313 337 355 360 351 335 318 300 284 270
15202 270 261 258 264 275 287 299 317 344 372 389 394 390 381 366 347 335 335 339 338 330 324 323 328 342 367 395 412 412 403 398 400 403 407 413 425 435 432 413 388 366 351 335 317 300 291
15184 291 294 302 308 306 299 297 303 312 318 317 313 308 298 282 262 243 229 224 225 235 252 277 306 332 349 360 370 373 364 346 335 337 338 325 305 294 295 300 299 295 293 295 300 306 310 310 309 311 315 318
15164 318 315 312 312 312 313 322 344 378 417 452 476 487 482 467 448 434 427 417 396 359 315 279 255 239 225 211 200 196 202 212 224 238 257 278 293 297 293 286 273 257 243
15148B43%RJ1QJ1J4J0Kk%OPQOJqj4j4j0kNNlpmOJ0KooMJ2J6J6J5RKopjRJ4J3NkonkJMLjqj3
15126C60j2kPQkj3j3kQOjqj0plJKjoj0j6k1k2j4m%nj0j0lKOJ2J8K2J7PKjlpj1mRK2K9K9K0
15107C66J2QJ1J5J2%pojJkrj7j8j1LRMlOK5L7L3J7Nkj3k0j9j0lj2k6l1k1mMkj5k6k8k5j8j2
15089B07rj2j7j8qRJ9J9J5J7K5K9K3Qmqm%LMNOOMPJ2Pj0k6l2k7j8j0jJ3J8J4J3J8K5K0Lrj0
15071C26nKRJ2J1RPOLkjNKj1k6l0k2j0MJ6K1J4KnlMOKpj9k7k8k5k1j4jJ1J5OlplNJ2J6J9J6
15052B91J2Mlrj0njNJ2J7K0J6RMKMOQOKjnpqollpj3j6j3rkMOKj1k2k2j3kNKlj0j5j1MK2L3
15032B66K9J1nj3j3j0qqmNJ3J7J5J2RNLLMLmrqpj2k0j7%K1L2L2K7K5K3J6Kj2j4j1j1j9k6k2
15015C20rNJ2K2L2L6K9J6MjjLLkqj0j1j7k4k2j0%K%%LJj0j6j2KJ9L1L6L7L6K7J0j1k7l6m2
$$ plain form
15148 243 243 252 263 271 282 296 306 308 306 306 312 319 327 333 334 326 312 298 288 286 291 296 293 286 282 288 298 300 294 288 292 304 320 336 351 360 362 356 349 348 357 371 384 389 387 381 376 374 375 379 382 381 373 360
15126 360 348 346 353 361 359 346 333 331 339 345 344 336 326 319 316 317 319 318 312 302 286 265 243 229 225 225 220 210 200 197 199 205 217 235 257 274 281 283 282 279 272 261 257 266 288 317 346 366
15107 366 378 386 397 412 424 424 417 411 410 411 409 400 383 365 354 357 366 370 367 373 398 435 468 485 490 488 475 455 436 426 423 411 385 354 333 329 333 331 316 290 262 237 219 207
15089 207 198 186 169 151 143 152 171 190 205 222 247 276 299 307 303 295 291 291 294 298 303 309 315 319 326 338 345 335 309 277 250 232 222 221 234 252 266 279 297 322 342 345 336 326
15071 326 321 323 332 344 355 364 371 377 380 378 377 382 384 373 347 317 295 285 289 305 326 340 342 337 334 338 344 346 339 320 293 265 240 219 205 204 215 230 236 233 226 223 228 240 256 275 291
15052 291 303 307 304 295 285 280 279 284 296 313 333 349 358 362 364 368 374 382 388 390 389 384 377 369 363 360 357 350 337 321 308 299 297 301 307 309 298 276 254 241 239 244 246 243 233 218 207 211 233 266
15032 266 295 306 301 288 275 265 257 249 245 250 263 280 295 307 316 321 324 327 331 334 330 321 313 306 294 274 257 257 278 310 342 369 394 417 433 435 423 409 398 387 368 342 320
15015 320 311 316 328 350 382 418 447 463 467 466 465 468 471 469 461 451 440 423 399 377 367 367 369 369 369 372 373 363 347 335 337 356 387 423 460 496 523 533 522 495 459 417
14998D17m7m6l3j7lRJ6J7Mj3k6k7j7kJ4K1K0J5J1Nmj0%J9L0K4Qoj3j6j8j6j4j3j1nKQJ4J8
14982C15J9J6J1J0PKjLJ0J4QjpppnjRJ7J7J0NOOjj0j3j0lJL%oj3j4r%QJ2J2J0Lmj1k1k9k9
14963C32k0mMLqk0k3k1j5rJJ7L1L7L1J7P%JOJ0Pmj4j8j3%J3K2K0Prj7j3kJ0J5Qkj0rmklmq
14945C47qokJllj%nj2j1jJ2J6Qqk1j7KJ9K1J1Ljlj1j9k1j5mQJ5J3PJjkmlllprnNJ4J9J4Mn
14925C26j1j9k9m1m0k4%K0L2L1K0Pkpj1j7j6oRJ6J8J5J6J8K0K2K2K3K7K8K2Nj8l5m0l2j9r
14909C21pj1j4j5j5k0k5k1rLM%KJ2J6PnqJROnj0j0nJJ2K3L1K8K0J3PNPQJj0j7j3npj8k4j7
14891B46qlnojkqj7j8j0LJ7K4K1Q%LJ7K9L2L0K3J3%qj2j1j5j9j7oLN%nolnj2j8j4MK7M2L9
14873C57K2Ooj3j9k7k9k4j1JOM%%MJ2J6J1mj2j0KQMnj5j8j7pNK0L1L4K7J1lnMJ4J6J1OMMQ
$$ plain form
14998 417 370 324 291 274 271 280 296 313 317 304 278 251 234 232 246 267 287 302 313 318 314 304 304 323 353 377 385 379 366 350 332 316 302 289 278 273 275 283 297 315
14982 315 334 350 361 371 378 380 379 382 392 406 414 413 406 399 392 387 386 395 412 429 439 444 450 456 455 445 432 422 419 420 423 423 417 404 390 381 381 389 401 413 423 426 422 411 390 361 332
14963 332 312 308 312 315 307 287 264 243 228 219 220 237 268 305 336 353 360 360 361 367 377 384 380 366 348 335 335 348 370 390 397 388 371 358 356 366 381 389 387 377 368 364 362 359 355 347
14945 347 339 333 331 332 329 326 325 325 320 308 297 296 308 324 332 324 303 286 288 307 328 339 342 341 338 327 308 287 272 268 276 291 304 311 312 311 309 305 302 299 296 289 280 275 280 294 313 327 331 326
14925 326 315 296 267 226 186 162 162 182 214 245 265 272 270 263 252 235 219 213 222 238 256 271 287 305 325 347 369 392 419 447 469 474 456 421 381 349 330 321
14909 321 314 303 289 274 259 239 214 193 184 187 191 191 193 205 221 228 223 215 216 225 231 226 216 206 201 202 214 237 268 296 316 329 336 341 348 356 357 347 330 317 312 305 287 263 246
14891 246 238 235 230 224 223 221 213 196 178 168 171 188 212 233 241 241 244 261 290 322 352 375 388 388 380 368 357 342 323 306 300 303 308 308 303 297 294 289 277 259 245 249 276 318 357
14873 357 379 385 379 366 347 320 291 267 256 257 263 267 267 267 271 283 299 310 306 294 284 286 294 298 293 278 260 243 236 241 261 292 326 353 364 361 356 360 374 390 401 407 411 415 423
14855D23J1J0Lrj9k5k5j9j0rj6k1j3JJ2J1NLKJoj3j5j1onnnnj0j5k0k5l0l0j9MK0K0QjPK4
14838A78M0M6L6J6rk4k0mJ0Rmj7j9j1ooqmNJ1J5K2K9K7J8Mmj0j1j5j6j4oPJ7J5Nnq%PJ0PM
14820C17MORJ0J4K5L2K8J3%qj1j2j2j2j3j1lJ0J3Norrj1rkJ1J7J1MJNJ3J9J7J2PPROJmnoj2
14802D71k5l8m5l3oK4L8K8Lj8j8lJ4K2K1J7J1Lmonj0k1k4j6ppj2j1kRJ5J6J1jj1j5rqj7l0
14785C01l4k4pQJ5J6J7K1L1L8L8K1lk3l1k6k0j4pKKqj1MK5L2K0%qnjjkrj6k0j5rj2j5j6qk
14768B44KMNNNJ1K0K4K0J5J4J6J4Ojlll%PJ1Qjj2j8k1k2k8l2k8j1QJ8J0lj3j2nMJ5K5K5J8
14751C38J1RQN%oj5k7l2j8JJ6J6J3J1Opj5j4qrj4j4p%LPROjooj%JJKKLQJ1J1RJ3J8K0J0pk4
14731C37l3l1k3j3mJ0K5L2K3Jj9k0oQJ1LmJJ6K7K3J0qk4l9m4l3j5MJ9K8K9J9%j3j4mJ3K9L5
$$ plain form
14855 423 434 444 447 438 419 394 369 350 340 331 315 294 281 282 294 305 310 313 315 316 310 297 282 271 265 260 255 250 245 235 220 200 175 145 115 96 100 120 140 148 147 154 178
14838 178 218 264 300 316 307 283 263 259 269 278 274 257 238 227 221 215 207 203 208 219 234 256 285 312 330 334 330 320 309 294 278 264 258 265 282 297 302 297 289 289 296 306 313 317
14820 317 321 327 336 346 360 385 417 445 458 458 450 439 427 415 403 390 379 376 386 399 404 398 389 380 369 360 358 369 386 397 401 402 407 420 439 456 468 475 482 491 497 498 494 489 483 471
14802 471 446 408 363 330 324 348 386 414 417 399 381 378 392 414 435 452 463 466 462 456 451 441 420 396 380 373 366 354 343 341 350 365 381 392 391 380 365 356 348 331 301
14785 301 267 243 236 244 259 275 292 313 344 382 420 441 438 415 384 358 338 324 317 319 321 313 302 306 331 363 383 383 375 370 369 368 366 357 341 321 306 297 285 270 254 246 244
14768 244 246 250 255 260 265 276 296 320 340 355 369 385 399 405 404 401 398 395 395 402 413 421 420 408 390 369 347 319 287 259 248 256 274 284 281 268 256 251 255 270 295 320 338
14751 338 349 358 366 371 371 365 350 323 291 273 274 290 306 319 330 336 329 314 300 292 283 269 255 248 248 251 258 267 273 272 266 260 259 259 260 261 263 265 268 276 287 298 307 320 338 358 368 361 337
14731 337 304 273 250 237 233 243 268 300 323 324 305 285 279 287 298 301 297 298 314 341 364 374 366 342 303 259 226 211 215 234 262 291 310 310 297 283 279 292 321 356
14715C56K6Qmonj2k1k2j3kQJ7K0J2LLJ2J7J3Llqj4j4nNJ2J4J5J4QNJ0J2Jk0l1k9k4k0j5jJ0
14698C35PmjJ7L7M3L5K6J7Moqoj2k8m9n8n6m5k9j3%J1J5J2N%jNJ1J8J9J7QJmopnjPQkj5k0
14680B82j6j2j4j6j1jQJ0J1J2RJlljmpkJ1K1K3J7Opk6l7k8pJ4K2K2J8J1MKNJ1ROMKJkllj1
14661C28k1k9l2k9k2j3jQJ2J2O%kNJ4K0K1J7J4Pmj3j8j9k0j8pQK2L0K9K2Rjk%K%llmprqok
14643B93PJ4J1kj8k5k1j8j6rKPKn%J4K2K3J8J5Mj5k9k4qMMKNPMmj1j3j4r%J2K2K0J3Nj%Jm
14624B85j2j9j5lJ1K0K1J7Pmj3j3mQJ9K4K3K0J9J6J2OOQQJopqqppj1k0k5j9nRK0K7K5J7Ll
14607D23lnj6l2m3m0l0k1j7j4j2j0j2pQL0L6K5RNQJ0OJLOJ4J6J0qk6l1k3j0lNJ5K5K8K1J1
14590C52Jj0j9k7l0k8j8nLLLMNNOJ5K9L6L0J0j3k7l1k6j5lQJ0NkljPJ0J0KnpLJ4K2K4K4K0
$$ plain form
14715 356 382 390 386 380 375 363 342 320 307 305 313 330 350 362 365 368 380 397 410 413 410 402 388 374 369 374 386 400 415 429 437 442 452 464 465 445 414 385 361 341 326 325 335
14698 335 342 338 337 354 391 434 469 495 512 516 510 502 496 484 456 407 349 293 248 219 206 206 217 232 244 249 249 248 253 264 282 301 318 326 327 323 317 310 305 304 311 319 317 302 282
14680 282 266 254 240 224 213 212 220 230 241 253 262 263 260 257 256 252 245 243 254 275 298 315 321 314 288 251 223 216 230 252 274 292 303 307 309 314 325 334 340 344 346 347 345 342 339 328
14661 328 307 278 246 217 195 182 181 189 201 213 219 219 217 222 236 256 277 294 308 315 311 298 280 261 241 223 216 224 246 276 305 327 336 335 333 333 335 335 332 329 325 318 309 301 295 293
14643 293 300 314 325 323 305 280 259 241 225 216 218 225 227 222 222 236 258 281 299 314 318 303 274 250 242 246 250 252 257 264 268 264 253 240 226 217 217 229 251 271 284 289 288 288 289 285
14624 285 273 254 239 236 247 267 288 305 312 308 295 282 278 286 305 329 352 372 391 407 419 425 431 439 447 448 442 435 427 419 412 405 394 374 349 330 325 334 354 381 406 423 426 423
14607 423 420 415 399 367 324 284 254 233 216 202 190 180 168 161 169 199 235 260 269 274 282 292 298 299 302 308 322 338 348 340 314 283 260 250 247 252 267 292 320 341 352
14590 352 353 343 324 297 267 239 221 216 219 222 225 229 234 239 245 260 289 325 355 365 352 325 294 268 253 250 258 268 273 271 268 267 274 284 294 296 291 284 287 301 323 347 371 391
14573C91QkmJKnj4j8j9j9j0NK0K4J5Kj0k1k8k7j8rjOJ1J3J4J3J0M%%LMNQJ5J2kk6m4m8l8k8
14555A95k2k0j2RL3N2N9O0N5M0J4j0k1j7roonkmrrmkj1k6k9j1PR%okNPQJ1J2Lpj0nNJ1J4J5
14536C59J5J0Llnqpj0j3j7j8j5j2rj1j0q%J1K0K8K4J4JrrjJ2K4L0K6Rj0k3k8k8k3j2%RJ0Q
14520C24RJ2J4J2Q%noonopoookNRQKk%RJ7J8Ppj6j5j2roJMMjoj0j1oLRP%pj4j5oJ0K3K3J5
14499C55J0J4J8J8J4J3J2J0OlrnPJ4Pj4l0l5k9k0pLPMMRJ3OmpJRJ0PKmrj4j8k1k1j0MJ2Rk
14480C36qpjMOM%k%NRJ1J0ROMjqj9k7k9k1j2j1j6j8j4o%JMRJ1ROKJKRJ7K2J8K2L6M9M3J8p
14461D76j6j3p%NJj1k5k8k4k4k8k6j5l%JJMK%LQJ2J3J1PjqoNJ8K2J9J0lk3l7l6j9KRLn%J2
14442B86K0J9J4J6K4K9K3J0j0k5l5l3k4j1JMKjKJ4K6K9K8K0J0kpjJ1J5Nrj5j9k2k6k6k0j7
$$ plain form
14573 391 399 397 393 394 396 391 377 359 340 321 311 316 336 360 375 377 367 346 318 291 273 264 263 269 280 293 307 320 330 334 334 334 337 341 346 354 369 381 379 353 309 261 223 195
14555 195 173 153 141 150 183 235 294 354 409 449 463 453 432 415 406 400 394 389 387 383 374 365 361 359 348 322 293 282 289 298 298 292 290 295 302 310 321 333 336 329 319 314 319 330 344 359
14536 359 374 384 387 384 379 371 364 354 341 324 306 291 279 270 259 249 241 241 252 272 300 324 338 339 330 321 320 332 356 386 412 421 411 388 360 332 309 297 297 306 316 324
14520 324 333 345 359 371 379 379 374 368 362 357 351 344 338 332 326 324 329 338 346 348 346 346 355 372 390 397 390 374 359 347 338 332 333 337 341 340 334 324 313 307 310 319 326 326 319 305 290 284 294 317 340 355
14499 355 365 379 397 415 429 442 454 464 470 467 458 453 460 474 481 467 437 402 373 353 346 349 356 360 364 373 386 392 388 381 382 391 401 408 410 406 397 383 365 344 323 313 317 329 338 336
14480 336 328 321 320 324 330 334 334 332 332 337 346 357 367 376 382 386 385 377 358 331 302 281 269 258 242 224 210 204 204 205 209 218 229 238 244 246 247 249 258 275 297 315 337 373 422 465 483 476
14461 476 460 447 440 440 445 446 435 410 382 358 334 306 280 265 262 262 263 264 268 270 270 273 281 293 306 317 324 323 315 309 314 332 354 373 383 380 357 320 284 265 267 276 279 274 274 286
14442 286 306 325 339 355 379 408 431 441 431 406 371 338 314 303 304 308 310 309 311 325 351 380 408 428 438 436 429 428 439 454 459 450 435 416 394 368 342 322 305
14427C05j9j8j4nLMkookJjJNJ2J2J1J2K1K9K8J5lj8k6k4j3kK%oj2j9k3j8jJ9L3L6K9J7Jj8
14410C40l0k8j9ql%%LMJ0J3J1Ll%PJ4J4J1Mmrrqj2j4nJ2K4K5J8J4J3J3Oj0l1m8n1m1k0JJ8
14392B25K4J6%j4j5pPJ6J9J5J0OMMNOPQQJ0Pjj1rLJ1J3PNNRJ6K0K1J4QMkj2k4l0k5j5lJ0K1
14374C96K6K4J9Roj8k3j7qopnk%JJKjlmrj4j5qJOKjj%JKRK2L7M6L8J5j4l6l9l0k0j3rlJmj6
14354C26k4j6%J2J4J4J5J7J4Mnj2j4j0nJNKkrj0pk%lrj1qlLJ3J9K1J4OJlk%MM%jJQJ3J0Kn
14334C82nlklmmnponJOJ1J2Mj3k9l2k3pMJ0RMkpj1j5j8j4nMPNMMMMLMMLL%mrpJJ7K9L1J8l
14313C45j5j4roj0j2p%Jnj1j5j1o%%lokOJ5J9J8J7K0K3K1J2ok0k6k5k1j6j0kNJ3K2L0K9J9
14296C57LlLJ5J6J0%mqj3j6j4rrj1j1qomLJ2J7J1JoqrpKJ2J4J0J3K4L5L4K2J4J1PJnjPJ2R
$$ plain form
14427 305 286 268 254 249 252 256 254 248 242 240 241 240 241 246 258 270 281 293 314 343 371 386 383 365 339 315 302 300 302 302 296 284 265 242 224 223 242 275 311 340 357 358 340
14410 340 310 282 263 255 252 252 252 255 259 269 282 293 296 293 293 300 314 328 339 343 339 330 321 313 301 287 282 294 318 343 361 375 388 401 407 397 366 318 267 226 206 207 225
14392 225 249 265 265 251 236 229 236 252 271 286 296 302 306 310 315 321 328 336 344 354 361 360 349 340 343 354 367 374 379 384 393 409 429 450 464 472 476 474 462 438 408 383 368 365 375 396
14374 396 422 446 465 474 468 450 427 410 402 396 389 384 382 382 383 384 386 385 382 378 369 355 340 332 333 339 341 340 339 339 340 342 351 373 410 456 494 509 495 459 420 390 370 357 348 345 346 342 326
14354 326 302 286 286 298 312 326 341 358 372 376 371 359 345 335 330 331 336 338 336 327 317 310 308 308 305 296 285 277 274 277 290 309 330 344 350 351 348 346 346 350 354 354 353 354 362 375 385 387 382
14334 382 377 374 372 369 365 361 356 349 343 338 339 345 356 368 372 359 330 298 275 268 272 282 291 295 293 286 275 260 242 228 223 227 234 239 243 247 251 255 258 262 266 269 272 272 268 259 252 253 270 299 330 348 345
14313 345 330 316 307 301 291 279 272 272 273 268 257 242 231 225 225 225 222 216 214 220 235 254 272 289 309 332 353 365 359 339 313 288 267 251 241 239 244 257 279 309 338 357
14296 357 360 357 360 375 391 401 401 397 389 376 360 346 337 328 317 306 298 292 288 291 303 320 331 332 326 318 309 302 304 316 330 340 353 377 412 446 468 482 493 500 501 496 495 502 514 523
14278E23jj2j7j4prj9l0l2k2j1qj0qppj2k1k4k3j6nQJ9K5K2J8J5J4RMMJ0K0K9L6M0L2J7%m
14261E26J%j4l7n1n0l5j5NJ6J6PJOJ8K6K7K4K1J3Nlpj3k2k9k4j3mKJ1K0K1J2Jpp%RJ3Rjm%
14244D74NNORJ1Omj9l2l7l2j7lLOPQKpj0j0j2j6j4j1j1j6j5lJ1J7J5RKkMK1M2M9L7J1j3k5
14226D51k3j1MJ0RM%kpj2j2qkLMMJmooljkoj0j2j0okJJ%nqp%LJkLJ0Pkrrqj3j6j7k3l2l6k7
14205A57j0klm%LMMNLlqlJ0K3L1K9K0Mqj0kPJ0MkjQJ6J5J0M%lmlok0l4l2j6KJ2J3J8K0J8J0
14186B86NMLKKMKnj3j6j0OK0K1J1JMQNnj5j9j7j0KJ0Kj2j9j3mjjJLPJ2K0K4K3J7J3Opk0k1
14167C16pJ7L3L4J8JkQJ9K3K0K5L8N1N4M5K7Lk9n9p0n7l1oRJ2J0Jj1j9j7j3j5k0j6JJ6J6K
14152D27j1j6j4rlMOPKnj5k4k3j1OK1K7K2J2jj1j2oLRRQMJnrqKJ4K3K2J4jj4k3k3j6qj%mn
$$ plain form
14278 523 522 510 493 479 472 463 444 414 382 360 349 341 331 323 316 309 297 276 252 229 213 208 216 235 260 282 300 315 329 338 342 346 356 376 405 441 481 513 530 530 526
14261 526 527 527 513 476 425 375 340 325 330 346 362 369 370 376 394 420 447 471 492 505 510 507 500 487 465 436 412 399 395 397 408 428 449 461 462 455 448 448 457 470 479 478 474 474
14244 474 479 484 490 499 510 516 512 493 461 424 392 375 372 375 381 388 396 398 391 381 371 359 343 329 318 307 291 276 273 284 301 316 325 327 325 329 350 392 441 478 489 476 451
14226 451 428 417 421 431 440 444 444 442 435 423 411 403 401 404 408 412 413 409 403 397 394 393 391 385 375 363 353 347 345 346 347 347 342 334 327 327 330 331 329 332 342 349 347 338 329 321 308 292 275 252 220 184 157
14205 157 147 145 142 138 138 141 145 149 154 157 154 146 143 153 176 207 236 256 260 252 242 240 247 257 261 259 258 266 282 297 307 311 311 308 304 301 295 275 241 209 193 195 207 220 238 258 276 286
14186 286 291 295 298 300 302 306 308 303 290 274 264 270 290 311 322 323 327 335 340 335 320 301 284 274 276 286 288 276 257 244 240 239 238 239 242 249 261 281 305 328 345 358 364 357 337 316
14167 316 309 326 359 393 411 412 410 418 437 460 480 505 543 594 648 693 720 723 694 635 565 508 477 471 480 492 502 503 492 473 456 443 428 408 392 393 409 425 427
14152 427 416 400 386 377 374 378 384 391 393 388 373 349 326 315 321 342 369 391 403 402 391 379 373 376 385 394 402 406 407 402 393 385 387 401 424 446 460 459 445 422 399 383 375 374 374 370 365
14133C65mMJ1J4J5J9K4K4J5Lnqj1j5j7j6rJJ0J3RLkjKRK1K8K3Roj2j0nloj6k2k0j2mkpj4k0
14115C75k1j5%J4J9J1nk2l8m2l3j4MJ3J1%j2j6j1JOjj0j2rmkOJ5J9J3MlmNK0L8M2L1J1mj3
14098C67k1k6k1j2lNJ4L0M3M0K1kj8j9pOJ4J3%j4j9j2%JloKJ1J4RKnj4k6l6l8l4k0JK3L2K6
14081C18J0J%LMJkKRJ3RKloqj3j5j4q%LJoj2j2rlQK0K2J1pj7j9j9j9j2NK6L8L9L3K0Kj9l6
14063C41m0l3j9j0rj0nOJ4J3NmojKKnj0j1q%NRRJ0J9K9K8J2lnMPLKOPJ%J1J8J3%oolmmloj7
14042C48l0l6l1j9qkMJ6L5M6L5J4j%LMjnqj4k0j9qJ3L2L4J6pk1k1j2jNPQJ3K1K3J4lj6k0j7
14025C71qNJ5J2kj8k1j0OJ9K1J3Jrj6k7l9l8j9PK0J8J0OMNNJ1J9K1J6NmojMOPOLj1l0m4l4
14007B99rJ6J8Lj1j0MJ6J9J3Ooj5j6qjnj7k3j7mOMjoolmpj3j4j2poojRJ9J6NmonmlMJ6K4K3
$$ plain form
14133 365 361 365 376 390 405 424 448 472 487 490 485 477 466 451 434 418 409 410 420 433 442 445 443 442 444 453 474 502 525 534 528 516 506 501 498 492 476 454 434 422 418 416 409 395 375
14115 375 354 339 339 353 372 383 378 356 318 276 243 229 233 246 257 257 245 229 218 219 225 224 214 202 193 189 187 193 208 227 240 244 241 237 242 262 300 342 373 384 380 367
14098 367 346 320 299 287 284 289 303 333 376 416 437 435 417 398 391 397 411 424 424 410 391 379 379 380 377 371 373 384 398 407 409 404 390 364 328 290 256 236 237 260 292 318
14081 318 328 329 329 332 336 337 335 337 346 359 368 370 367 361 353 340 325 311 303 303 306 307 301 289 277 268 265 273 293 315 326 319 302 283 264 245 233 238 264 302 341 374 394 396 377 341
14063 341 301 268 249 239 230 220 215 221 235 248 253 249 243 242 244 246 241 231 220 212 212 217 226 235 245 264 293 321 333 330 325 329 336 339 341 347 354 355 355 366 384 397 397 391 385 382 378 374 371 365 348
14042 348 318 282 251 232 224 222 226 242 277 323 358 372 371 371 374 378 377 372 364 350 330 311 303 316 348 382 398 391 370 349 337 336 341 348 356 369 390 413 427 424 408 388 371
14025 371 363 368 383 395 393 375 354 344 350 369 390 403 404 395 379 352 313 275 256 263 283 301 311 317 321 326 331 342 361 382 398 403 399 393 392 396 402 409 415 418 407 377 333 299
14007 299 290 306 324 327 316 306 310 326 345 358 364 358 343 327 319 318 313 296 273 256 252 258 262 261 255 249 246 242 235 222 208 196 189 183 177 176 185 204 220 225 221 215 210 206 203 207 223 247 270
13988B70K0J7J7J3PKkk%NJ3J5Pj1k9l6k4lJ1Pqj7qJ4L8M8M1K5QnoJJ0J0lj5j7rjLJ3K4L2K9
13970E04K0J3POJ5L3N3P1R4J31J70K00K27K63K77K18O7j18k50k89k63k20j81j38r2n5l6l2
13959F95l6m2m7m3k7r%%ljLLjpj6k4k5j0LMj0k4k4j7j1rrqmNJ1J5J7J9J4Mj3k5k5k1j3jJ3
13941C01K3K3J7J2J1J1J3J7J5Lj0j4j0j0j5j7rLNmj5j8j6j3qm%Kkpj3j6qQK4L0K7K3K0J2n
13925C86k3k7j5QK5K5J2j0k2j4J0L5M6L5J2j3k9k8k0j5j8k1j6roqj1rmJQJ3J4J2J0J2Pqk3
$$ plain form
13988 270 290 307 324 337 344 346 344 342 342 347 360 375 382 371 342 306 282 279 290 297 289 272 264 278 316 364 405 430 438 433 427 428 438 448 445 430 413 404 403 406 419 443 475 504
13970 504 524 537 544 550 565 598 651 722 816 947 1117 1317 1544 1807 2084 2302 2369 2251 2001 1712 1449 1229 1048 910 818 763 727 695
13959 695 659 617 570 527 500 491 491 491 488 487 490 493 492 485 469 445 420 410 413 417 407 383 359 342 331 322 313 305 301 306 317 332 349 368 382 386 373 348 323 302 289 288 301
13941 301 324 347 364 376 387 398 411 428 443 446 436 422 412 402 387 370 361 364 369 365 350 332 316 303 295 291 291 293 291 284 271 255 247 255 279 309 336 359 379 391 386
13925 386 363 336 321 329 354 379 391 381 359 345 355 390 436 471 483 470 441 413 393 378 360 339 323 314 308 300 289 280 276 277 285 298 312 324 334 346 353 345 322
$$ [...]
-2084B20
##END=	
##END=	
