##TITLE=	Oct20-2021.50.fid
TM-VI-104 Mg+Ph-pyrraz.

##JCAMP-DX=	6.0	$$ MestReNova 14.3.0-30573
##DATA TYPE=	LINK
##BLOCK_ID=	1
##BLOCKS=	2    
##ORIGIN=	Mestrelab Research S.L.
##OWNER=	hrzepa
##$MNOVA/LINK_BLOCK_TYPE=	ITEM	$$ NMR Spectrum
##$MNOVA/ITEM/POLYGON=	(XY..XY)
5321,5835
8722,5835
8722,8208
5321,8208
5321,5835
##$MNOVA/ITEM/Z=	0
##$MNOVA/ITEM/ANGLE=	0
##TITLE=	Oct20-2021.50.fid
##JCAMP-DX=	6.0	$$ MestReNova 14.3.0-30573
##BLOCK_ID=	2
##DATA TYPE=	MNOVA NMR VIEW DATA
##DATA CLASS=	MNOVA VIEW DATA
##$MNOVA/ITEM/ZOOM/X=	-4.005464102252559222,	16.005770000004368114
##$MNOVA/ITEM/ZOOM/Y=	-357.01105117797851563,	3963.619598388671875
##END=	
##TITLE=	Oct20-2021.50.fid
##JCAMP-DX=	6.0	$$ MestReNova 14.3.0-30573
##BLOCK_ID=	3
##DATA TYPE=	NMR SPECTRUM
##DATA CLASS=	XYDATA
##NUMDIM=	1
##ORIGIN=	Bruker BioSpin GmbH
##OWNER=	nmr
##.OBSERVE FREQUENCY=	400.4124024600000098
##.OBSERVE NUCLEUS=	^1H
##.SOLVENT NAME=	Acetone
##.PULSE SEQUENCE=	zg30
##LONGDATE=	2021/10/20 15:08:00.000
##.ACQUISITIONMODE=	SIMULTANEOUS (DQD)
##$ORIGINAL FORMAT=	Bruker XWIN-NMR
##$MNOVA/SCALES_VERSION=	9
##$PARAMETER FILE=	(acqus, ASCII, /private/var/folders/f6/rjf_tdyn2v98c5c0wvkgn4s80000gn/T/7CtTvQhUT5ufckYGnYJwtQ/50/acqus, 0)
$$ ##TITLE= Parameter file, TOPSPIN		Version 3.2
$$ ##JCAMPDX= 5.0
$$ ##DATATYPE= Parameter Values
$$ ##NPOINTS= 11	$$ modification sequence number
$$ ##ORIGIN= Bruker BioSpin GmbH
$$ ##OWNER= nmr
$$ $$ 2021-10-20 15:08:16.603 +0100  nmr@CZC10666PP
$$ $$ /opt/topspin/data/agmb/nmr/Oct20-2021/50/acqus
$$ $$ process /opt/topspin3.2/prog/mod/shimcntl
$$ ##$ACQT0= -2.36344537815126
$$ ##$AMP= (0..31)
$$ 100 100 100 100 100 100 100 100 100 100 100 100 100 100 100 100 100 100
$$ 100 100 100 100 100 100 100 100 100 100 100 100 100 100
$$ ##$AMPCOIL= (0..19)
$$ 0 0 0 0 0 0 0 0 0 0 0 0 0 0 0 0 0 0 0 0
$$ ##$ANAVPT= -1
$$ ##$AQSEQ= 0
$$ ##$AQ_mod= 3
$$ ##$AUNM= <au_zg>
$$ ##$AUTOPOS= <52 >
$$ ##$BF1= 400.41
$$ ##$BF2= 400.41
$$ ##$BF3= 400.41
$$ ##$BF4= 400.41
$$ ##$BF5= 400.41
$$ ##$BF6= 400.41
$$ ##$BF7= 400.41
$$ ##$BF8= 400.41
$$ ##$BYTORDA= 0
$$ ##$CAGPARS= (0..11)
$$ 0 0 0 0 0 0 0 0 0 0 0 0
$$ ##$CFDGTYP= 0
$$ ##$CFRGTYP= 9
$$ ##$CHEMSTR= <none>
$$ ##$CNST= (0..63)
$$ 1 1 145 1 1 1 1 1 1 1 1 1 1 1 1 1 1 1 1 1 1 1 1 1 1 1 1 1 1 1 1 1 1 1 1
$$ 1 1 1 1 1 1 1 1 1 1 1 1 1 1 1 1 1 1 1 1 1 1 1 1 1 1 1 1 1
$$ ##$CPDPRG= (0..8)
$$ <> <> <> <> <mlev> <mlev> <mlev> <mlev> <mlev>
$$ ##$D= (0..63)
$$ 0 1 0 0 0 0 0 0 0 0.06 0 0 0 0 0 0 0.0002 0 0 0 0 0 0 0 0 0 0 0 0 0 0 0
$$ 0 0 0 0 0 0 0 0 0 0 0 0 0 0 0 0 0 0 0 0 0 0 0 0 0 0 0 0 0 0 0 0
$$ ##$DATE= 1634738895
$$ ##$DE= 6.5
$$ ##$DECBNUC= <off>
$$ ##$DECIM= 2496
$$ ##$DECNUC= <off>
$$ ##$DECSTAT= 4
$$ ##$DIGMOD= 1
$$ ##$DIGTYP= 12
$$ ##$DQDMODE= 0
$$ ##$DR= 22
$$ ##$DS= 2
$$ ##$DSPFIRM= 0
$$ ##$DSPFVS= 20
$$ ##$DTYPA= 0
$$ ##$EXP= <proton>
$$ ##$F1LIST= <111111111111111>
$$ ##$F2LIST= <222222222222222>
$$ ##$F3LIST= <333333333333333>
$$ ##$FCUCHAN= (0..9)
$$ 0 2 0 0 0 0 0 0 0 0
$$ ##$FL1= 90
$$ ##$FL2= 90
$$ [...]
$$ 90 74 58 42 26 10 0 0
$$ ##$Sgu3PowerLevels= (0..7)
$$ 0 0 0 0 0 0 0 0
$$ ##$Sgu4PowerLevels= (0..7)
$$ 0 0 0 0 0 0 0 0
$$ ##$Sgu5PowerLevels= (0..7)
$$ 0 0 0 0 0 0 0 0
$$ ##$Sgu6PowerLevels= (0..7)
$$ 0 0 0 0 0 0 0 0
$$ ##$Sgu7PowerLevels= (0..7)
$$ 0 0 0 0 0 0 0 0
$$ ##$Sgu8PowerLevels= (0..7)
$$ 0 0 0 0 0 0 0 0
$$ ##$SguType= 3
$$ ##$ShimPowMaxUA= (0..63)
$$ 130000 130000 130000 130000 130000 130000 130000 130000 130000 130000 130000
$$ 130000 130000 130000 130000 130000 130000 130000 130000 130000 0 0 0 0
$$ 0 0 0 0 0 0 0 0 0 0 0 0 0 0 0 0 0 0 0 0 0 0 0 0 0 0 0 0 0 0 0 0 0 0 0 0
$$ 0 0 0 0
$$ ##$ShimPowMaxUC= (0..63)
$$ 130000 130000 130000 130000 130000 130000 130000 130000 130000 130000 130000
$$ 130000 130000 130000 130000 130000 130000 130000 130000 130000 0 0 0 0
$$ 0 0 0 0 0 0 0 0 0 0 0 0 0 0 0 0 0 0 0 0 0 0 0 0 0 0 0 0 0 0 0 0 0 0 0 0
$$ 0 0 0 0
$$ ##$ShimPowMaxUG= (0..63)
$$ 524287 524287 524287 524287 524287 524287 524287 524287 524287 524287 524287
$$ 524287 524287 524287 524287 524287 524287 524287 524287 524287 0 0 0 0
$$ 0 0 0 0 0 0 0 0 0 0 0 0 0 0 0 0 0 0 0 0 0 0 0 0 0 0 0 0 0 0 0 0 0 0 0 0
$$ 0 0 0 0
$$ ##$ShimPowRcbType= 3
$$ ##$ShimPowRes= (0..63)
$$ 1e-20 1e-20 1e-20 1e-20 1e-20 1e-20 1e-20 1e-20 1e-20 1e-20 1e-20 1e-20
$$ 1e-20 1e-20 1e-20 1e-20 1e-20 1e-20 1e-20 1e-20 0 0 0 0 0 0 0 0 0 0 0 0
$$ 0 0 0 0 0 0 0 0 0 0 0 0 0 0 0 0 0 0 0 0 0 0 0 0 0 0 0 0 0 0 0 0
$$ ##$ShimPowRng0= (0..63)
$$ 1 1 1 1 1 1 1 1 1 1 1 1 1 1 1 1 1 1 1 1 0 0 0 0 0 0 0 0 0 0 0 0 0 0 0 0
$$ 0 0 0 0 0 0 0 0 0 0 0 0 0 0 0 0 0 0 0 0 0 0 0 0 0 0 0 0
$$ ##$ShimPowRng1= (0..63)
$$ 1 1 1 1 1 1 1 1 1 1 1 1 1 1 1 1 1 1 1 1 0 0 0 0 0 0 0 0 0 0 0 0 0 0 0 0
$$ 0 0 0 0 0 0 0 0 0 0 0 0 0 0 0 0 0 0 0 0 0 0 0 0 0 0 0 0
$$ ##$ShimPowRng2= (0..63)
$$ 1 1 1 1 1 1 1 1 1 1 1 1 1 1 1 1 1 1 1 1 0 0 0 0 0 0 0 0 0 0 0 0 0 0 0 0
$$ 0 0 0 0 0 0 0 0 0 0 0 0 0 0 0 0 0 0 0 0 0 0 0 0 0 0 0 0
$$ ##$ShimPowRng3= (0..63)
$$ 1 1 1 1 1 1 1 1 1 1 1 1 1 1 1 1 1 1 1 1 0 0 0 0 0 0 0 0 0 0 0 0 0 0 0 0
$$ 0 0 0 0 0 0 0 0 0 0 0 0 0 0 0 0 0 0 0 0 0 0 0 0 0 0 0 0
$$ ##$ShimSysFunc= (0..63)
$$ 1 2 3 4 5 7 9 11 15 16 8 10 12 14 6 17 13 18 19 20 0 0 0 0 0 0 0 0 0 0
$$ 0 0 0 0 0 0 0 0 0 0 0 0 0 0 0 0 0 0 0 0 0 0 0 0 0 0 0 0 0 0 0 0 0 0
$$ ##$ShimSysMatrix= 0
$$ ##$ShimSysType= 1
$$ ##$TFXNUM= 0
$$ ##$TRIPLO2= 0
$$ ##$VTU= 2
$$ ##$VTUETH= <149.236.99.20>
$$ ##$VTUTY= <no>
$$ ##$WBREFAM= (0..15)
$$ 135 116 100 100 100 100 100 100 100 100 100 100 100 100 100 100
$$ ##$WBREFLM= (0..15)
$$ 0 0 0 0 0 0 0 0 0 0 0 0 0 0 0 0
$$ ##$WBREFPH= (0..15)
$$ 71.66 -68.25 0 0 0 0 0 0 0 0 0 0 0 0 0 0
$$ ##$WBSGU= (0..15)
$$ 0 0 0 0 0 0 0 0 0 0 0 0 0 0 0 0
$$ ##$XFAC= 2
$$ ##END=
$$ 
##$DECIM=	2496
##$DSPFVS=	20
##XUNITS=	HZ
##YUNITS=	ARBITRARY UNITS
##FIRSTX=	6408.8703656999996383
##LASTX=	-1603.8278811825093726
##DELTAX=	-0.12226593800080123864
##XFACTOR=	1
##YFACTOR=	0.013806658807404370223
##FIRSTY=	10.022157669067382813
##MINY=	3.318019866943359375
##MAXY=	3603.29052734375
##NPOINTS=	65536
##XYDATA=	(X++(Y..Y))
$$ [...]
2219H40J2j2k3k4k2k3j6lNOjn%J2K2K2J7J0Kqj0lJ1J5PJLJ2K4L2L3K2kk7m2m3l3j1J3L0L0
2214H73J9J0Mlj1j1kPKj4k4j5LJ5Oj5k3j5%QOJoj0nRK1K6K0Rmj0oOJ2QMJ2K0Ml1n7m8j7OJ2
2208G96J6L0M3L7J2j6j9kJ1ll0m2k7qJMJ2K6L1K3J6J9K7K3Oj0j3mjnoNJ8J3ok0k2k4l4l9k5
2203H13LK4K9K0Lj7l2k6lJ6K1J8K0K3J7Krq%Nol2m9l4J3N4N3J5k0k4pJ3K3L1L3K5Pkkkrk1
2198I78k6k6k0j1JRJ1J1J5J8J3POQMJJpl4o4n4oL4K4j8m0k6lMnj3j1mJ1K7L3K1mk6l4k5qP
2193G79P%%QJ5J7J9J7Rkj4k2k4k3j2jjrnJ3K6K5J2ONRJ1Nj2l4l2oJ9J3j2k6j4OK5L9M0K0k1
2187H75n4n9l6pJ3J5MlRK7L2K4J2Kpj5j7j8k3k5j4NJ3M%QJ3QKMlk9m6l1PL4L5K9K3J3qk3j4
2182G79J0K7K0kj8j7qj0j8j3J4L9M4K6J2RJ3J8K1J4rk8k5nNlj4j5j8j8oK1M2L9J8Knj4l1m6
$$ plain form
2219 840 852 840 817 793 771 748 732 729 734 740 739 734 734 746 768 790 807 817 819 811 801 798 809 824 831 832 835 847 871 903 936 958 956 929 887 844 811 800 813 843 873
2214 873 892 902 906 903 892 881 879 886 888 874 850 835 838 853 859 844 821 806 806 814 820 821 815 805 800 809 830 856 876 885 881 871 865 871 883 891 895 907 927 931 900 843 795 778 784 796
2208 796 812 842 885 922 934 918 899 897 908 905 875 833 806 798 799 803 815 841 872 895 911 930 957 980 986 976 963 959 958 953 947 952 970 983 977 957 935 911 877 838 813
2203 813 816 840 869 889 892 875 843 817 814 830 851 869 889 912 929 931 922 914 914 919 913 881 832 798 811 865 918 933 913 889 882 895 918 949 982 1007 1014 1012 1010 1008 999 978
2198 978 952 926 906 895 896 905 916 927 942 960 973 980 986 994 998 999 1000 993 959 895 841 835 869 893 875 835 809 806 810 805 792 781 777 788 815 848 869 865 839 805 780 772 779
2193 779 786 786 786 794 809 826 845 862 871 869 855 833 809 786 774 773 772 763 758 771 797 822 834 840 845 854 865 870 858 824 792 786 805 818 806 780 766 772 797 836 876 896 875
2187 875 821 762 726 719 732 747 751 748 757 784 816 840 852 854 847 832 815 797 774 749 735 740 753 757 757 765 778 786 788 792 789 760 714 683 690 724 759 788 811 824 816 793 779
2182 779 789 816 836 834 816 799 791 781 763 750 764 803 847 873 885 894 907 925 946 960 951 923 898 893 898 895 881 866 848 830 824 845 887 926 944 946 941 927 896 850
2177H50m6k3K1N6O0L3RLLj4l5l7j4RJ5J1P%j5l5m2l1j0J2K6L0K4Rj0k1qK2L4J5j6k3jJ7Pj3
2172H79k2j6j1j1pMJ2J6K0L2L4J3j9l5k3lLoj0KJ3Rj1k7k7j5nmj0j8k7l8m0k4QL8M6L1J6J4
2167G81K1K6K7L1L0J2j2k6k1j1j1j9j9j3j2j4j4mJ0J7J7J8K3K2J1MJ1K6K9J6LLJ0Rmj5k2k0
2163I20j4nqk3l3j9J2K4%l3l4lK5K4Pkklj1j4qJOONMQJ5J9J6Jrj0npj6j9j1lj%QJ5J2LKJ5
2157H55L0L2K1RRK1K3Kl1l8qK7L1Nk2k8k0j3mLKnq%RNoj1rrqkLok0k2qMJj1j7j0OK3L3L2K7
2151H97K2J8J1Jk%%pj6k6l8n1m9k6J2L7M2L1J4jj0j6k0k3j9nOkj8k3qJ4K3J5KolLOOKjjjm
2146G86plJ4L1L5K0jj2j3j4j6oJ8L6K5ok6k0prk0k2j3jRK2L8L7J6j4l1k7qJ1K0J6Mrk2l1l5
2141G65k8j0OQKLJ4K1J4KKJ1K0J4JomNJ4J8J7Poj1n%qk3k3jK1K0Jj2qLKj0k6l9m1l0pJ0J7
$$ plain form
2177 850 804 781 802 858 918 951 960 963 966 952 917 880 866 875 890 901 908 908 893 858 816 785 775 787 813 843 867 876 866 845 837 859 893 908 892 869 868 885 892 879
2172 879 857 841 830 819 812 816 828 844 864 896 930 943 924 889 866 863 866 860 850 852 865 874 863 836 809 794 789 785 775 757 730 692 652 628 636 674 720 751 767 781
2167 781 802 828 855 886 916 928 916 890 869 858 847 828 809 796 784 770 756 752 762 779 796 814 837 859 870 874 885 911 940 956 959 962 972 981 977 962 940 920
2163 920 906 901 893 870 837 818 830 854 854 821 787 784 809 833 840 838 836 833 822 808 800 801 807 813 818 822 830 845 864 880 881 872 862 857 850 834 815 804 801 800 800 808 823 835 838 840 855
2157 855 885 917 938 947 956 977 1000 1002 971 933 925 952 983 988 966 938 918 905 901 904 906 901 893 893 902 907 901 890 881 872 864 862 865 859 839 817 809 813 814 803 786 776 782 805 838 870 897
2151 897 919 937 948 949 947 947 947 940 924 898 860 809 760 734 746 783 825 856 870 869 859 843 823 800 781 776 782 780 762 739 731 745 768 783 785 779 776 779 785 791 793 792 791 790 786
2146 786 779 776 790 821 856 876 875 863 850 836 820 814 832 868 893 887 861 841 834 825 805 783 770 769 778 800 838 875 891 877 846 819 811 822 842 858 862 853 831 800 765
2141 765 737 727 733 741 743 746 760 781 795 797 799 810 830 844 845 839 835 840 854 872 889 896 890 879 874 874 866 843 820 819 840 860 861 849 841 844 846 836 810 771 730 700 693 703 720
2135G20J5J5J4J0RJ6K3J7kj3qLJ4J5Rnj2rlqj8j3J1L3L1J5OLqk5l2j9kJ3K4L0K0j0l7m0k7
2130G75j0RL1M4L3MpOJ8Mk2l1j4J1K7K7J8jk0l2l1k1pQJ7J6J1J3K1K5J4lj6j7j1LJ5J7Qnr
2125I18kONJKPJ0NkjMOjj2j2jJ2J3MKJ2K2J2j8n0o3n0k3nnj6k0j2%%j2k0j3JPM%MJ3K5L6M3
2119H36L8J6qk5l2l1k0lQMmLJ6J9J3J5K8L1J5j4l8n7o2m9k2%J0K0L8M3K1onK2L5J6j6l2k3
2115H00NL4M8L5Nj9k5k6k9l2k2nJ0J6J4QKJ0K3K7J5jmLNJjJ0K8M2L5Rj7k7j6jN%kkmqpjOJ1
2109I58J5J3J0Njj4l2l4k0ork1j6%Qql0l3j5PJ0rl1l4j3PPmoPK0K7L5M9N4M5K8J1mj7k5k4
2104I10k1j5j1rj8l1l2qJ9L0K4J6RJnKK0L1K7J9J6J4Ork4k5j4LPj0l5m5k0J7L4J2k9n3m6j4
2099G43J3K9L1K8K1J1kj1j3rKJ8K9K3Lj5j9j5j9k9k5JK5K0ok6k1jJ3J3Nqj9j4KJ7J7J2J8L4
$$ plain form
2135 720 735 750 764 774 783 799 822 839 837 824 816 819 833 848 857 852 840 831 828 820 802 789 800 833 864 879 885 888 880 855 823 804 802 815 839 869 889 879 842 802 775
2130 775 765 774 805 849 882 886 879 885 903 907 885 854 840 851 878 905 923 922 902 870 839 818 811 819 836 852 863 876 897 922 936 933 917 900 889 892 907 924 932 927 918
2125 918 916 922 927 928 930 937 947 952 950 949 953 959 958 946 934 933 945 958 962 964 976 998 1010 992 942 879 829 806 801 796 780 760 748 748 748 736 716 703 704 711 715 715 719 732 757 793 836
2119 836 874 890 882 857 825 794 774 771 779 783 779 782 798 817 830 845 873 904 919 905 867 810 748 699 677 677 687 707 745 788 809 803 798 820 855 871 855 823 800
2115 800 805 839 887 922 927 908 883 857 828 796 774 769 779 795 809 817 819 829 852 879 894 893 889 892 897 898 897 907 935 977 1012 1021 1004 977 961 960 965 965 963 961 957 949 942 941 947 958
2109 958 973 986 996 1001 1000 986 954 920 900 894 885 864 848 848 856 848 818 785 770 777 787 778 747 713 700 707 714 710 704 711 731 758 793 842 896 941 969 980 976 959 934 910
2104 910 889 874 863 854 836 805 773 765 784 814 838 854 863 864 859 861 881 912 939 958 974 988 994 985 961 936 922 925 932 922 887 842 822 839 873 885 856 803 757 743
2099 743 756 785 816 844 865 876 874 863 850 841 843 861 890 913 916 901 882 867 848 819 794 795 820 840 834 808 787 786 799 812 817 809 790 776 778 795 812 824 842 876
2094H76L8K3%j5j6rJ0L4N2M7J5l0o4o7l8JK1K1J8J3Jj6k1oJ0J5QPPmk5l5k1JJ1NkNK2L0J7
2089I39lj7k0k7l4l0nJ7J6ok7l1j8NL1M2K5kj1%Lj8l9k9NL2L7K2JrmJ2J9Mj5j6MK6L1J9QK
2084I39KjkkLOnk0k3oJ5J7QJJ0J8J7J0Jj3l2m2l1j4j1k5l4k1kJqj1LJ9K5K5K3J9PnoKN%oj5
2078H41k5l0j5RK0J0kRL4M6L6J5Jlnpprj5k3k7k1qNQRJ9L3L4Qk2l5k9k5l5m7m4k4LL0M3L1
2073G86Lk0j7KJ7J5%j1lK6N0N1K6%j4k1k2j6nJkn%Lnj1nNLlJJ4J6RPJ8K3RpmPNj3k5j7LJ5
2067H89Nj7k6j4LROOJ1Qj1k2j2J1J7Lj5k3j8j3rlJNK%LJ3K4K3RmjJ1J2Jpooj5k5k3j1nj2k1
2062G53j7nJJNJ5J8Pk%QPKPJ6J5%pJJ0QLRJ0kj7j1PJ7J5J7K7K8J5nk0l2l4k1%J5J6J5Rnj6
2056H83j1J0K4J7Jj1k2l3l0j2JkpOK6L0J6LkLJ1K3K1kk7k7j1kj1k3k8k8k0KK9M2K6jj9j7K
$$ plain form
2094 876 914 937 937 922 906 897 907 941 993 1040 1055 1025 961 894 856 857 878 899 917 930 931 915 894 888 898 913 921 928 935 931 906 871 850 851 862 867 865 870 892 922 939
2089 939 936 919 899 872 838 808 803 820 836 830 803 772 754 759 790 832 857 855 844 844 847 829 790 761 766 798 835 857 858 849 845 857 876 880 865 849 853 879 910 929 937 939
2084 939 941 940 938 936 939 945 940 920 897 891 906 923 931 932 942 960 977 987 988 975 943 901 870 856 845 820 786 765 763 764 756 745 748 767 792 817 840 859 866 861 855 857 862 862 856 841
2078 841 816 786 771 780 800 810 808 817 851 897 933 948 949 946 941 934 927 918 903 880 853 832 824 829 837 846 865 898 932 940 918 883 854 829 794 747 703 679 682 712 755 786
2073 786 789 769 752 754 771 786 786 775 772 798 848 899 925 925 911 890 868 852 847 848 846 841 841 844 839 828 823 828 831 828 829 843 859 868 875 893 916 925 918 914 921 926 913 888 871 874 889
2067 889 894 877 851 837 840 849 855 861 872 880 869 847 835 846 863 866 851 828 810 797 788 785 786 791 793 793 796 809 833 856 865 861 860 871 883 884 877 871 865 850 825 802 791 786 774 753
2062 753 736 731 732 733 738 753 771 778 776 776 784 791 793 800 816 831 831 824 825 835 843 846 855 865 863 846 835 842 859 874 891 918 946 961 956 936 904 870 849 849 864 880 895 904 899 883
2056 883 872 882 906 923 924 913 891 858 828 816 817 815 808 814 840 870 886 889 887 890 901 924 945 943 916 889 878 876 865 842 814 786 766 768 797 839 865 864 845 828 830
2051H30K2K7J2mnJ0J7J3J2Oj7m7m6j1K0Qk2k4MK8K7J0jnlLJ3J6J5J7K4K7J7kj9k5k2j3j1j6
2046H85k2j8kJ7K7K0lk6l1j6KNQK6M5M1J2j8k9k3j0JM%jJ6L7L4%l2l4j8j2k3k6j3MJ0O%oq
2041H29nLQQJ2K6M0M4L3J0j4k4j5LLj4k3lL0M2K4mk7m5n8m8j1L1M6L1RJLPOlj4k3k3j1NK0
2036I09K3J3qk6k8j8j0j0qlMJ0J5J3ml0l9k3LJ6J3Mlj2k0k0j7j3oJ0K5K7J6PJ1K0K0J0pk2
2031H42k6rJ9M1L6J3rj7j6j3j0pJJ1J6J2PMLMPJ0Jj6l0k4pJjLJ5J9Oml%pj1oLJljNnk4l2j6
2025G83jnj7j5RL1K6%k4k4mRKj4j8oPJ1J0NLjqj5k7l3k3MK6K7J3MJ4L6N2M8K5%j2pMJ1J3J7
2020I36K0J1jojjj6l3l4j8KJ2J3Ooj2q%PJ0J8K6K6K1J8K4K1Nj7k8l1l6l9l3j4%KnpkJ2K9L7
2015I08K7J2Lkj7l4l3j0J0Nj9k9j2K0M5M8L2Qqj2rqrj0qmMNj1m0n5l8LM2O1N7K6j6m9n0l2
$$ plain form
2051 830 852 879 891 887 882 892 909 922 934 940 923 876 830 819 839 847 825 801 805 833 860 870 869 864 861 864 877 893 908 925 949 976 993 991 972 947 925 912 901 885
2046 885 863 845 843 860 887 907 904 878 847 831 833 838 846 872 917 958 970 952 923 900 890 891 895 895 894 910 947 981 981 949 915 897 885 862 836 823 827 837 843 843 837 829
2041 829 824 827 835 843 855 881 921 965 998 1008 994 970 955 958 961 947 924 921 951 993 1017 1013 986 941 883 835 824 855 901 932 941 942 945 952 958 955 941 918 895 884 889 909
2036 909 932 945 937 911 883 865 855 845 837 834 838 848 863 876 872 842 803 780 783 799 812 816 813 801 781 761 744 731 725 735 760 787 803 810 821 841 861 871 864 842
2031 842 816 807 826 867 903 916 907 890 874 861 851 844 845 856 872 884 891 895 898 902 909 919 920 904 874 850 843 844 843 846 861 880 886 882 879 879 872 861 855 858 859 856 855 860 855 831 799 783
2025 783 782 777 760 745 754 785 811 811 787 763 759 768 770 756 738 732 739 750 760 765 768 767 759 744 717 684 661 665 691 718 731 735 749 785 837 885 910 910 898 891 895 906 919 936
2020 936 956 967 966 960 959 958 942 909 875 857 859 871 884 890 884 872 864 864 871 881 899 925 951 972 990 1014 1035 1040 1023 995 964 928 889 856 842 842 844 839 832 830 842 871 908
2015 908 935 947 950 948 931 897 864 854 864 869 850 821 809 829 874 922 954 962 954 942 933 925 916 906 898 894 898 903 892 852 797 759 762 804 865 922 948 932 883 833 801
2010H01k0j5nJ0J6NpoJ3L3M3L7J6nj6j7j8k0j0J5L9M4L3J2rk4k3jK0J8nk7k9j3NJ5J6J1Q%
2005I40j9n0o6n0j0J9J8QJ2L3L6J2j8k8k0j0jJ7L5L2Mk3k1lNkkRJ8J2jolmj0j5j2KJ9K6J9
2000I02J0PRNnj5k3l1l1j2J5K8J7j%K0M0M7L5Rk0l0j8jlk1k7j0J3K2Qj1k3j6JJ6J6J0PJ2J0
1995I61j1l7m8l5rJ2K2J8Kj6k4j6MJ9J5LqqLJ8K5J6lj3mRJ0NPQnk8l5j5J0J9J4QMlqj1k2l6
1989H17l9j5J1K3K1K6L3J6j7l2j3J9K6PqoMkk2l0j4J0J7NkRK2J4rk4j7mjpj1qKJ2J4QMRJ2
1984H60NqrJJ3J5PlnMK0L2K8J9Prk8m0l1j5rj7k2j6mQJ3Oj0j9nJ9L2K7J9Pj4k6j4J1J4j0k5
1979H28j0J6K5J9Oj7n1o8n2k1lMK0L8L7J6mmNJ5K7L4K5Jj7j9p%pk1k9j9KJ9J9J2QQPOKkj1
1974H37j6j7j0JJ8L0K1ok7k7j1KJ4L0L4J7qk1j8oJ5L2L3Ok2k4rLMQJ1lj7nK6L9J7omO%j3j5
$$ plain form
2010 801 781 766 761 771 787 792 785 779 792 825 868 905 921 916 900 883 865 845 835 850 889 933 966 978 969 945 922 921 941 959 954 927 898 885 890 905 921 932 940 940
2005 940 921 871 805 755 745 764 782 790 802 835 871 883 865 837 817 807 806 823 858 890 894 871 850 847 852 850 848 857 875 887 886 880 877 873 863 848 836 838 857 883 902
2000 902 912 919 928 933 928 913 890 859 828 816 831 859 876 875 875 895 935 982 1017 1026 1006 976 958 957 954 933 906 896 909 931 939 928 905 889 890 906 922 932 939 951 961
1995 961 950 913 865 830 821 833 855 873 875 859 835 819 823 842 857 860 852 844 847 865 890 906 903 890 886 895 905 910 917 925 920 892 857 842 852 871 885 893 897 894 886 875 853 817
1989 817 778 763 774 797 818 844 877 893 876 844 831 850 876 883 875 869 873 871 849 819 805 815 832 837 835 844 866 880 871 847 830 826 825 818 807 799 801 813 827 835 839 848 860
1984 860 865 857 848 849 862 877 884 881 876 880 900 932 960 979 986 977 949 909 878 863 854 837 815 799 795 803 816 822 812 793 788 807 839 866 885 892 878 852 838 849 863 853 828
1979 828 818 834 859 878 884 867 816 748 696 675 672 676 696 734 771 787 783 779 784 799 826 860 885 886 869 850 843 843 836 815 786 767 769 788 807 819 827 835 842 848 850 848 837
1974 837 821 804 794 795 813 843 864 858 831 804 793 795 809 839 873 890 882 861 843 837 852 884 917 923 901 877 868 871 875 883 894 891 874 869 895 934 951 945 941 947 947 934 919
1968I19j0j4k3j8pMJ1K4L6K9J0oppj6l6n4m9j7K1L2Ok4k6%K8L4K7J7J1J5J7J3%mNJ1nk7l8
1963H82l2k6k1rJ0J9J4J1J3J4Mj3k9l6l2k2oPJ8K5K2J0KOJ1Jj5k4k4k7l0j5J3K6J0j1nJ8K8
1959G87J8M%%LJ7L4L8K3Ko%NKrk5l9m0k3LK1K2J6QKpj2r%%qj7j0MPmj4qJ3L0L3K5J2lj7j8
1953H60pKjoJK1L4L1J7Lj2k6k7pJ6J9Kj4j5j4k3k6nL4N7N1K6Jj6k3k7k2j2JJ1J2RPJrk1k5
1948H78j8j4j4rQK2J6jrmK%JJ0J8J4QNLqk2k5j9j1omjMK0L7M3K8NomJmj5k3j3PK1J1rj3NJ8
1942I33Qj2j9j0oj0qJ1L4M5L1jl8n6m2rJ3J2MMJ3J1Jj1j4j1njjnmRK3K5J5MOJ6K0J0nj0mN
1937I71QJllmj5k6k1mJ3K1K1J7Nrj7pJ1J6Kk0l4l2j9mQJ3J1RQOLKK%JLJ1J2jk1k4nJ8K3Pj3
1931I41j8j1jNQJ2J4J5Pmj1lRJ4NkJOjj6k5k3j6pLRJj6k4qK0M0M0K1nk7l1j7mpj9j9lJ1J0
$$ plain form
1968 919 909 895 872 854 847 851 862 886 922 951 961 955 948 941 925 889 835 786 769 790 822 828 804 778 778 806 840 867 884 895 910 927 940 940 936 941 952 947 920 882
1963 882 850 824 803 794 804 823 837 848 861 875 879 866 837 801 769 747 741 748 766 791 813 823 825 831 842 843 828 804 780 753 723 708 721 747 757 746 741 759 787
1959 787 805 809 809 809 812 829 863 901 924 926 920 920 925 927 918 893 854 814 791 794 815 837 853 861 863 856 844 835 835 835 827 810 800 804 811 807 793 785 798 828 861 886 898 895 878 860
1953 860 853 855 854 848 849 870 904 935 952 955 943 917 890 883 899 918 920 906 891 877 854 828 823 857 914 965 991 992 976 953 926 904 892 893 904 916 925 932 933 924 903 878
1948 878 860 846 832 823 831 853 869 868 859 855 857 857 858 868 886 900 908 913 916 908 886 861 842 831 825 821 820 824 844 881 924 952 957 951 947 948 944 929 906 893 900 921 932 923 910 915 933
1942 933 941 929 910 900 894 884 876 887 921 966 997 996 958 902 860 851 864 876 880 884 897 908 909 898 884 873 868 867 866 861 857 866 889 914 929 933 939 955 975 985 980 970 966 971
1937 971 979 980 977 974 970 955 929 908 904 917 938 959 976 981 972 955 948 959 975 977 957 923 891 872 868 876 889 900 909 917 923 926 928 930 930 931 934 945 957 956 935 911 906 924 947 954 941
1931 941 923 912 911 916 924 936 950 965 972 968 957 954 963 977 982 980 981 987 986 970 945 922 906 899 902 911 912 896 872 864 884 924 964 985 980 953 922 905 901 894 875 856 853 864 874
1926H74jj1j5j3nJ4L1L2J5j2l5m2k9j0kpj1mRJ7K2L2L2Mm0o4m5oJ9K0J5J5K1K2J4KqqlKKm
1920H39rpoj2k5k9pL4O0N3K4Mknj1j5j5j6j7mJ6K3NpPL2L2Qj2j1KPMqk1k6j6QK2J6Jrj4j5
1915H78j2NK3L0K4J6J1jk0l0k1JJ5J0lo%%j3k5j7NK7K9J6JqqkORNLQK1K4Pj9l3k4lJ0J2QQ
1909I67J2J8K2J8Lk1l9m1k9j1JNJJJ1K9L7K6Pqj8l4m7l8j0J0Kj8j7MK3J7nj6qQJ5Oqj6j4p
1904H38jMRJ0kk3l4k7oJ6K5J9QMJ7L5L3J2oLK6L0Ok8m3m1k9k1k6m2n1k7J3L4J7nJ0M3N8M6
1899I04L4K9J0k0k8LK6Ml7n0k4MJ0RJ7K4K1J4J4Rnj4rrk0l2k4pLJJNNknLJ0Nrk0j9j1jJ1J5
1894H45Oj1k1j4OJ9K0J5J3Rkj0pPJ3J2J1J3R%nmok4m3l8rJ3J0qqJ4L3J8j8l5j1K8M3L2K1J8
1889I54J3JnJOMLOjj7k3lK3K3Jk0k2j3lKnj8j4J8N1M9Rk7k4NK3Qk5m8m0j0J9K7J8PNNQRll1
$$ plain form
1926 874 873 862 847 834 829 843 874 906 921 909 874 832 803 793 791 784 773 769 778 795 817 849 881 885 845 781 736 730 749 769 784 799 820 842 856 858 850 842 839 841 843 839
1920 839 830 823 817 805 780 751 744 778 838 891 915 919 917 912 901 886 871 855 838 834 850 873 878 871 878 910 942 950 938 927 929 936 940 932 911 885 869 877 899 915 916 907 893 878
1915 878 866 871 894 924 948 964 975 974 954 924 903 904 919 929 926 920 920 920 907 882 865 870 897 926 942 943 935 927 925 931 940 945 948 956 977 1001 1008 989 956 932 929 939 951 959 967
1909 967 979 997 1019 1037 1040 1019 980 939 910 899 900 905 906 907 918 947 984 1010 1017 1009 991 957 910 872 862 872 874 856 839 843 866 883 878 862 854 862 877 883 875 859 845 838
1904 838 837 841 850 860 858 835 801 774 768 784 809 828 836 840 857 892 925 937 931 934 960 990 996 968 925 884 855 834 808 766 715 688 701 735 752 747 757 800 858 904
1899 904 938 967 977 957 929 932 958 962 925 875 851 855 865 874 891 915 936 950 964 973 968 954 945 936 916 884 860 853 856 857 858 863 868 866 861 864 874 879 870 850 831 820 819 830 845
1894 845 851 840 819 805 811 830 850 865 878 887 885 875 868 875 888 900 911 924 933 933 928 924 918 894 851 813 804 817 827 819 811 825 858 876 858 823 812 840 883 915 936 954
1889 954 967 968 963 964 970 974 977 983 982 965 942 939 962 985 986 966 944 931 928 930 925 907 893 911 962 1011 1020 993 969 974 997 1005 980 932 892 882 901 928 946 953 958 963 971 980 977 946
1883I46n2m3j5RJ7K4L1K4kk9m3l8k1J2M3N4M0J8Moj6j5qrk0j9kPnj5JK8L2J6RK0K6J5kj8l0
1878I68l0j4Jmk5k6JK8L0J7RJ0Pjj1j7k0rJ1K4K1J6J9K1Qj9l8m3l4j5QK1Rj1j6KK3K5Rrk0
1873I26k8l3l4k1jJ8K2J2JLJ1J1J0J4K2K4J6J1J0%l0o2o7l8OL5L3J6PRNj5l7l1LL5L5Pk0k7
1868H58j5KJ4J6J2J3J8J9J2OMjj4l0l3j6QK4K6J3j2k9k2KJ6J3MQK3K8J2j5l7m2l2j0J1K5K6
1864I05J6ol0l9k9qQJ2RJrj8j7rLJ3J7J7J6K1K2J2rj9rPQnqJJ1J3J1J0Kj6l1m1m2l6j4J6L4
1858G90K6Kj3j2kQJ4J6J4J5J8K0J9J8J2Kj1j3kQOKlj4l3m9m2j8MJ5J5J0JJJ4K7K8K4K4K4J3
1853I78jJJ9K9J5j0k7l1k0%J7J7RJ3K7K5Kj3LL0L1Ok1k9l0l2l1j8kOONRJ3QjomMQLj1l2m8
1848I17l7lK5J8j2k8j4QJ7J6J6Qrk2j0J2J8Pookk%ORQQJ5K1J5Jj2k3k7k1nJ5K6K3J6Pkj6k7
$$ plain form
1883 946 894 851 836 845 862 886 917 941 939 910 867 829 808 820 863 917 957 975 979 973 957 942 934 925 905 886 884 891 886 871 872 900 932 948 957 977 1003 1018 1016 998 968
1878 968 938 924 925 921 896 870 871 899 929 946 955 965 972 971 960 943 923 914 925 949 970 986 1005 1026 1034 1015 977 934 900 885 893 914 923 912 896 898 921 946 955 946 926
1873 926 898 865 831 810 809 827 849 861 862 865 876 887 897 911 933 957 973 984 994 994 964 902 835 797 803 838 871 887 894 903 908 893 856 825 828 863 898 905 885 858
1868 858 843 845 859 875 887 900 918 937 949 955 959 958 944 914 881 865 873 897 923 936 924 895 873 875 891 904 908 916 939 967 979 964 927 885 853 843 854 879 905
1864 905 921 915 885 846 817 809 817 829 838 839 830 812 795 786 789 802 819 836 852 873 895 907 898 879 870 877 885 880 872 873 884 897 908 918 920 904 873 832 790 754 740 756 790
1858 790 816 818 805 793 791 799 813 829 843 858 876 896 915 933 945 947 936 923 921 929 935 937 934 920 887 838 796 778 782 797 812 822 823 824 838 865 893 917 941 965 978
1853 978 977 978 997 1026 1041 1031 1004 973 953 953 970 987 996 1009 1036 1061 1063 1050 1053 1083 1114 1120 1099 1070 1040 1008 977 959 957 963 969 974 983 996 1004 1003 997 993 997 1005 1008 997 965 917
1848 917 880 877 902 920 908 880 866 874 891 907 923 931 922 900 890 902 920 927 921 915 913 911 911 917 926 934 942 957 978 993 994 982 959 932 911 906 921 947 970 986 993 991 975 948
1842I48j9PK5J9joOJ3Lrpjqk3k9k0jJ7L0L2J4j2k4j7jRNlrj0mNJ3J9K0J3jj4j6pMJ0J1NKO
1837I94J6K3J9J2J0Pj3l4l6j7MJ1QJrj6j6j5k5l3k0RK5Rj0kK6M0L1J3pk3l0j6RK5K3Oj3l4
1832I52m8m2j9JM%NK2L3K7J3J1J9J5rk8j5J6K2j1m4m1rJ1NpoQJ4Nj4k7k5j0LOLNJ2J7J7J9
1827I10K1J9J0Jpj2j6j6j8k4l0l2k3j1kjnlJ1K8L4K3J4J3J7J5RPRNMRJ1MJJ4K7J8nj6lJ0M
1822A024njLqk4k8j8oRL0M4L1ml1l5k2pJOOPPNpk4l4k6pJ4J8%k6l6j8J0K7L0L2L6K9J0rj4
1816I89j2j0pKJ0Nj0k2j9oKNQP%olJ4K2J1j0j7%J8J9Nqj0JK1L7L0ml4l1kJ8J2jlkrj6rL%k3
1811I65m1l8k2j3j4j3jROpj7j9j1%J4K8L0K1J4K1L7L2Jl3m1j8OJ2JlQK4K7J4%nj0k2l7l3l
1806H69L0L8J7j6m0m6k9%K5L0J3j1k7k9j5RJ8QplK4L8K5lj7j4qKJ4J9J3%kQJ3J1J1J3Jk7n1
$$ plain form
1842 948 929 936 961 980 979 973 979 992 995 986 979 978 970 947 918 898 897 914 944 976 990 978 954 937 936 945 950 947 938 928 924 929 942 961 981 994 993 979 963 956 960 970 981 986 988 994
1837 994 1010 1033 1052 1064 1074 1081 1068 1034 998 981 985 996 1004 1005 996 980 964 949 924 891 871 880 905 914 904 902 928 968 999 1012 1005 982 952 936 945 970 993 999 986 952
1832 952 904 862 843 844 848 848 853 875 908 935 948 959 978 993 984 956 941 957 979 968 924 883 874 885 890 883 877 885 899 904 890 863 838 828 831 837 840 845 857 874 891 910
1827 910 931 950 960 961 954 942 926 910 892 868 838 806 783 772 770 769 764 761 772 800 834 857 871 884 901 916 925 932 941 946 950 959 970 974 975 989 1016 1034 1029 1013 1010 1020 1024
1822 1024 1019 1018 1021 1013 989 961 943 937 946 976 1020 1051 1047 1016 981 959 952 953 959 965 972 979 984 977 953 919 893 886 900 918 918 892 856 838 848 875 905 937 973 1002 1012 1003 989
1816 989 977 967 960 962 972 977 967 945 926 920 922 927 935 942 942 936 933 947 969 980 970 953 953 971 990 995 987 977 978 999 1036 1066 1062 1028 997 995 1013 1025 1024 1021 1019 1010 994 985 988 988 965
1811 965 924 886 864 851 837 824 823 832 838 831 814 795 784 784 798 826 856 877 891 912 949 981 982 949 908 890 896 908 909 906 914 938 965 979 979 974 964 942 905 872 869
1806 869 899 937 954 938 898 852 823 823 848 878 891 880 853 824 809 818 836 844 837 834 858 896 921 918 901 887 879 881 895 914 927 927 925 933 946 957 968 981 982 955 904
1801I04m9k5jJ5K6K5J4LPK0K5J5Jj5k9k8mK4K3%rJ3L5K7jj1jKj3l0l5k6kL1O0N7K3j4l1l5
1796I91l9l5j1K0L4K5Mrr%OLorJRMokJ2K2J7Noj4j8j4lJ4K5L1K7J5LklppLJ3Qj2k8k6j5nN
1790A011J9K4J5LPK0J6j7o3q1o0j5J7J8Jj2j3q%J2K6K7J4RK3L2J6j5k6j4mnnJ6M7O4N9L8J9
1785A215J3J9K9L1K0Qlk0l5l8k6k1k7l2j1K5M4L0ql9m3k1OJ5Npnlj2k5k5oJ2J5Rkj3k1k1j5
1780A017j2j5j4nLNMJ1K3L5M0M1M0L4K2J1RJ6K6K7K3J4Qlj9l2l4l2l2k9j4PJ4%k1k3oJ7K8
1775A184J9rm2n5m6k4pJMNkj2j9j6kJ7L5M9M9L6J1j2k3k3j8j8k3l0l1k5j2MJ9K1J6J0J4K2
1771A067K5J8J4J2J1Jj6k9k4pOQQJ4J3%j4j9k0l0m2k6J3L8K5lj3pkmkJpj6j6prk2k4oJ5K5
1766I49K7L0L2K1Jk1l7l6j6J2K3J4jmJNPRRPMNjj4k2j4%KqpPJ9J6PLNLpj7k1j1J4M5N7L7%
$$ plain form
1801 904 855 830 829 844 870 895 909 912 919 939 964 979 980 965 936 908 904 928 951 951 942 955 990 1017 1016 1005 1004 1006 993 963 928 902 900 931 991 1048 1071 1057 1026 991
1796 991 952 917 906 926 960 985 989 980 971 971 977 980 974 965 966 975 979 973 971 983 1005 1022 1027 1021 1007 989 975 972 986 1011 1042 1069 1084 1087 1085 1082 1075 1068 1071 1084 1092 1080 1052 1026 1011 1006 1011
1790 1011 1030 1054 1069 1072 1079 1099 1115 1098 1035 954 894 879 896 914 915 903 890 882 882 894 920 947 961 970 993 1025 1041 1026 1000 986 982 977 972 988 1035 1099 1158 1196 1215
1785 1215 1228 1247 1276 1307 1327 1335 1332 1312 1277 1239 1213 1192 1165 1133 1122 1147 1191 1221 1213 1174 1131 1110 1116 1131 1136 1129 1124 1121 1109 1084 1059 1053 1065 1080 1089 1087 1074 1053 1032 1017
1780 1017 1005 990 976 971 974 979 983 994 1017 1052 1092 1133 1173 1207 1229 1240 1249 1265 1291 1318 1341 1355 1363 1360 1341 1309 1275 1243 1211 1182 1168 1175 1189 1189 1168 1145 1139 1156 1184
1775 1184 1203 1194 1152 1097 1051 1027 1020 1021 1025 1030 1028 1016 997 981 979 996 1031 1080 1129 1165 1176 1164 1141 1118 1100 1082 1059 1029 998 973 961 965 984 1005 1021 1031 1045 1067
1771 1067 1092 1110 1124 1136 1147 1148 1132 1103 1079 1072 1078 1086 1094 1108 1121 1121 1107 1088 1068 1038 996 970 983 1021 1046 1043 1030 1023 1021 1017 1015 1016 1009 993 977 970 961 939 915 909 924 949
1766 949 976 1006 1038 1059 1060 1039 1002 966 950 962 985 999 998 994 995 1000 1007 1016 1025 1032 1036 1041 1040 1026 1004 990 990 992 984 977 984 1003 1019 1026 1029 1034 1037 1030 1013 992 981 995 1040 1097 1134 1134
1760A134k7l7l5k1RL5L7J6onLM%MRMrj1jMlj0j0j2k8m2l5j4%J3L3N2M9K4J0J7K1J0JJ0K6J9
1755A238ol0l7l4k4qKKojJ2J4lj9j5m%kNK3L1J4j1k2j7j5j6mL0O5O0J8k6l5j0J8K3Rqj5rL
1750A190P%j8l2l9l4k1jJ5K1J2%rj2lJ4L2L8L1J8%j8k3j4lnj0jJ9K3Mj4oJ5J7pl6m2k6%K8
1745A110M2M0K1OJMlj9l0k1PL4L5J3j2k2j6prk0l3l3j7NJ3P%PK0J9PlRL0M1K5ol0k6NL6M9
1740A279M2K6J3JorokKNNmj8k4j4MJ7K0J4OJNJ8K5J7pk1j2PJ4NnmMNJKRJ4J2RJ3J5QnoLNr
1734A474l0m3l6j3J6L6M0L3K6K8L7L7K9J8J1OMNNlk1l4k9j4LJ5J9J8J5J6J8J1jjK0M8N8M7
1729A868L6L6M1L6K7J8Oj2k4j5QL0M4M8M1L4L5N1O8O1L5RmJJ7L9N9P3Q2Q8Q6P2O2P1Q6Q3O2
1724C358N0O2P7Q2Q8J09J33J46J50J56J52J26R0Q4J17J60J89J99K03K07K21K50K88L16L25
$$ plain form
1760 1134 1107 1070 1035 1014 1023 1058 1095 1111 1105 1100 1103 1107 1107 1111 1120 1124 1115 1104 1103 1107 1104 1094 1084 1072 1044 1002 967 953 953 966 999 1051 1100 1124 1134 1151 1172 1182 1183 1193 1219 1238
1755 1238 1232 1202 1165 1131 1107 1099 1101 1103 1097 1096 1108 1122 1119 1100 1085 1081 1081 1079 1084 1107 1138 1152 1141 1119 1102 1087 1071 1067 1097 1162 1222 1240 1214 1179 1169 1187 1210 1219 1211 1196 1187 1190
1750 1190 1197 1197 1179 1147 1108 1074 1053 1052 1067 1088 1100 1100 1091 1079 1076 1090 1122 1160 1191 1209 1209 1191 1168 1154 1151 1146 1136 1135 1154 1177 1181 1167 1161 1176 1193 1186 1150 1108 1082 1082 1110
1745 1110 1152 1192 1213 1219 1220 1224 1221 1202 1172 1151 1158 1192 1227 1240 1228 1206 1190 1183 1174 1154 1121 1088 1071 1076 1089 1096 1096 1103 1123 1142 1149 1146 1155 1185 1226 1251 1245 1215 1189 1194 1230 1279
1740 1279 1321 1347 1360 1361 1355 1346 1340 1338 1340 1345 1350 1346 1328 1304 1290 1294 1311 1331 1345 1351 1352 1357 1375 1400 1417 1410 1389 1377 1384 1398 1403 1398 1394 1398 1403 1404 1406 1415 1429 1441 1450 1463 1478 1486 1481 1475 1478 1483 1474
1734 1474 1444 1401 1365 1352 1368 1404 1444 1477 1503 1531 1568 1605 1634 1652 1663 1669 1673 1678 1683 1680 1659 1625 1596 1582 1585 1600 1619 1637 1652 1668 1686 1697 1696 1695 1715 1763 1821 1868
1729 1868 1904 1940 1981 2017 2044 2062 2068 2056 2032 2017 2025 2055 2099 2147 2188 2222 2257 2308 2376 2437 2472 2481 2477 2478 2495 2534 2593 2666 2748 2836 2922 2994 3056 3127 3213 3296 3358
1724 3358 3408 3470 3547 3629 3717 3826 3959 4105 4255 4411 4563 4689 4779 4863 4980 5140 5329 5528 5731 5938 6159 6409 6697 7013 7338
1721G338L31L50L85M29M73N08N31N53N87O34O78P08P23P26P17O92O57O11N45M61L66K69J64
1719A9436N6m6j33k14k92l52l74l68l56l51l49l39l13k65k05j57j34j22q7k4L7O9P8R5J39
1716A5429K05K73L28L73M20M76N38N96O57P32Q23R14R97J076J175J295J419J530J629J732
1713C2617J841J936K000K025K005J933J814J650J443J169Q28M50Q8k38n34q05j048j256j434
1711D6484j571j647j658j640j620j595j531j424j304j192j085r76q70p78o92o00n05m14l30
1708B5052k54j78j06l6L0R6J71K58L47M28N06N99P16Q46R74J097J219J340J455J559J655J743
1706C9517J820J862J849J771J637J467J257R95O81L32l3l99p41j029j259j444j598j715j794
1703D3176j846j877j865j806j720j642j566j467j351j247j167j084r88q96q29p75p08o30n56
$$ plain form
1721 7338 7669 8019 8404 8833 9306 9814 10345 10898 11485 12119 12797 13505 14228 14954 15671 16363 17020 17631 18176 18637 19003 19272 19436
1719 19436 19492 19446 19313 19099 18807 18455 18081 17713 17357 17006 16657 16318 16005 15740 15535 15378 15244 15122 15035 15011 15048 15117 15195 15290 15429
1716 15429 15634 15907 16235 16608 17028 17504 18042 18638 19295 20027 20850 21764 22761 23837 25012 26307 27726 29256 30885 32617
1713 32617 34458 36394 38394 40419 42424 44357 46171 47821 49264 50433 51261 51711 51799 51561 51027 50222 49174 47918 46484
1711 46484 44913 43266 41608 39968 38348 36753 35222 33798 32494 31302 30217 29241 28371 27593 26901 26301 25796 25382 25052
1708 25052 24798 24620 24514 24478 24508 24604 24775 25033 25380 25808 26314 26913 27629 28475 29449 30546 31765 33105 34560 36119 37774 39517
1706 39517 41337 43199 45048 46819 48456 49923 51180 52175 52856 53188 53155 52756 52015 50986 49727 48283 46685 44970 43176
1703 43176 41330 39453 37588 35782 34062 32420 30854 29387 28036 26789 25622 24538 23550 22654 21825 21050 20342 19712 19156
1701A9156m95m41l87l35k85k38j95j56j13n8jM9R5J43J97K47K90L27L62L95M26M53M64M51
1698B0351M21L79L21K30J05k8j51k59l55m39n08n70o28o78p11p26p30p27p15o92o58o18n73
1695A2041n32m98m70m45m13l74l25k88k73k84k92k74k33j95j82j91k03j94j67j41j40j60j70
1693E597j60j40j29j25j11r3q5q7r2r4j01j08j03q2o5o3o9o5n9n5n1m2l3l3m2m9n2n3n3n5
1689C248n6n7n1l7k7k5k6k5k5l7m9n3m6k9qJ5K1Nk3m0m3m3m1l2j4nmkKol6o7o8m4k2j6j4%
1684B220K2L2K4R%KLok1l3m0m3m4l9l3l2l6l2j4J4L8M4K9Mj3j7k0l1m3l9k1j2j7j9lJ6K0J6
1680A885K0L3L4J4j2k9l3l2k7j1PJ6Mk3m6n0l4j1J1K7L5L7L2K3J3NLQJ5Oj6l3k9j5j6k6k8
1675A757j9j7l6n4n0k7q%J0K3L1K7J2MORMnj1n%Jlnqk0m0n2l7%L2L5Qk4l7k7pNROKjLJ6L1
$$ plain form
1701 19156 18661 18220 17833 17498 17213 16975 16780 16624 16511 16453 16452 16501 16596 16739 16936 17183 17473 17800 18162 18557 18983 19436 19900 20351
1698 20351 20772 21151 21472 21702 21807 21779 21628 21369 21014 20575 20067 19497 18869 18191 17480 16754 16024 15297 14582 13890 13232 12614 12041
1695 12041 11509 11011 10541 10096 9683 9309 8984 8696 8423 8139 7847 7573 7340 7145 6963 6772 6569 6375 6208 6067 5927 5767 5597
1693 5597 5437 5297 5168 5043 4932 4839 4754 4667 4575 4481 4380 4272 4169 4087 4022 3959 3890 3825 3766 3711 3660 3618 3585 3552 3510 3461 3409 3356 3303 3248
1689 3248 3192 3135 3084 3047 3020 2995 2969 2944 2919 2882 2833 2780 2734 2705 2697 2712 2733 2738 2715 2675 2632 2589 2548 2516 2502 2497 2493 2491 2493 2487 2451 2384 2316 2272 2250 2234 2220 2220
1684 2220 2242 2274 2298 2307 2307 2309 2312 2306 2285 2252 2212 2169 2125 2086 2053 2021 1985 1953 1939 1953 1991 2035 2064 2068 2055 2038 2018 1987 1944 1905 1884 1872 1855 1836 1833 1849 1869 1885
1680 1885 1905 1938 1972 1986 1974 1945 1912 1880 1853 1842 1849 1865 1869 1846 1800 1750 1716 1705 1716 1743 1778 1815 1847 1870 1883 1888 1891 1899 1914 1920 1904 1871 1842 1827 1811 1785 1757
1675 1757 1738 1721 1685 1631 1581 1554 1546 1546 1556 1579 1610 1637 1649 1653 1659 1668 1672 1667 1656 1651 1651 1652 1649 1644 1636 1616 1576 1524 1487 1487 1519 1554 1562 1538 1501 1474 1467 1472 1481 1487 1489 1488 1491 1507 1538
1670A538L5K8J5Onj7k0j5qj6k9l0j0K1L2Rl4o2n3k1PJ5J7K8L8K9Mj2mJ5K4J0j8m4n5l9lL0
1665A406L8K2kj2kJ5K6K0Lrj1ononlrj4j0MRnk9m7m5l2j5MK0K6K1Oj1k7l3k5oN%j5k3k5k6
1660A167k3j6rmLJ2J8J5J3J9K3J5koNJ2Krj0oqj2rNJ4J0kj2qOJ8J2j1l0l2k3k3k7j7J0L3K8
1655A141Oj5j8j2onn%NRQNJ0J4Nj5k9k6lL0M9M3Qk8k9%K3J1j8k6qRMj9l8m6l6oK7L5J6%J2
1649A082L9N3M4L3J6j6m7m7j6J1PrrjlrlPKj3k0qNJ4L1N4N9L6Lj8k1j8j2kKlj0qJMMNLlj1
1644A208j3j4j4qNJ2Mj0j5mLjj2k3k1lK5L9K7%j7k1k0j6KK4K3Jj8j6j0j2j5lJ6K6K7K8K3Q
1639A215np%J%LQPLOJ4J8J4J0Nrl2m1k4%Qmj2lJ4K2K0J2Lj1j9j7lNj0l4m1j9J3K7J5pk2k1
1634A102j1qj5j9qJ5L5L6K4J2%j4k4k1pJ0K3L1L8M2M1L1J3%m%pk4l1j4J3K4J1oj4j1qqj4k4
$$ plain form
1670 1538 1573 1601 1616 1622 1617 1600 1580 1565 1557 1541 1512 1482 1472 1493 1525 1534 1500 1438 1385 1364 1371 1386 1403 1431 1469 1498 1502 1490 1486 1501 1525 1535 1517 1473 1418 1379 1376 1406
1665 1406 1444 1466 1464 1452 1450 1465 1491 1511 1514 1505 1494 1488 1483 1477 1472 1469 1460 1446 1436 1440 1449 1444 1415 1368 1323 1291 1276 1280 1300 1326 1347 1353 1342 1315 1282 1257 1251 1256 1256 1241 1218 1193 1167
1660 1167 1144 1128 1119 1115 1118 1130 1148 1163 1176 1195 1218 1233 1231 1225 1230 1242 1244 1235 1225 1219 1211 1199 1190 1195 1209 1219 1217 1205 1197 1203 1221 1233 1222 1192 1160 1137 1114 1087 1070 1080 1113 1141
1655 1141 1147 1132 1114 1102 1096 1091 1086 1086 1091 1100 1108 1113 1123 1137 1142 1127 1098 1072 1069 1099 1148 1191 1199 1171 1142 1142 1165 1176 1158 1132 1124 1133 1137 1118 1080 1034 998 992 1019 1054 1070 1070 1082
1649 1082 1121 1174 1218 1251 1267 1251 1204 1157 1141 1152 1159 1150 1141 1140 1137 1128 1125 1132 1134 1121 1101 1093 1098 1112 1143 1197 1256 1292 1295 1277 1256 1238 1226 1224 1226 1223 1213 1205 1206 1210 1214 1219 1222 1219 1208
1644 1208 1195 1181 1167 1159 1164 1176 1180 1170 1155 1151 1154 1153 1141 1118 1097 1094 1119 1158 1185 1185 1168 1147 1127 1111 1113 1137 1160 1161 1143 1127 1117 1105 1090 1087 1103 1129 1156 1184 1207 1215
1639 1215 1210 1203 1203 1204 1204 1207 1215 1222 1225 1231 1245 1263 1277 1287 1292 1283 1251 1210 1186 1186 1194 1190 1178 1175 1189 1211 1231 1243 1246 1235 1216 1199 1196 1201 1191 1157 1116 1097 1110 1137 1152 1145 1123 1102
1634 1102 1091 1083 1068 1049 1041 1056 1091 1127 1151 1163 1163 1149 1125 1104 1097 1107 1130 1161 1199 1241 1282 1313 1326 1326 1322 1322 1315 1291 1260 1246 1259 1283 1294 1288 1274 1263 1255 1247 1233 1209
1629A209k6j6rj6k8k3kJ2J3J4K7L2J5j1k8l4l6l3k0okmmoj9k8j3J7L3K5J5J8J8nl6m3k0J4
1624I94L3L3J8lj6j4%J4K4K5J6LmJJ3J6Nj2k0j7j4j8k3j8mQLj9l5l1oJ9L1K8J6Jj2k0k8l5
1619I52l0qK5M6M2K3QPJj7l7l9k0mlj1pJ0L0L4K4Kj5k3j9j6k3l1l4k0MK8M6M8K7mk3j6OJ7
1614I80J2jj5k8l9m2k8qQJ3J1LnpPL0M4L7J7ONJ0J3J4Rj1l3l9j8PJ2JrmJj2l1m0k4NK3J9K
1609H95mPK3K2Oqqqj4k0j0J0K4K1J7K1K8K6J3mj8k7k6j8rn%NJ1J5J8K7L8L0Kl1m2k7lJ0J0
1604I97NLKKjkLJ3J7Lk0l2k2jJ5J3%j1j1JROoj1lJnj0QM0N7M4J9Koj5k9l0j9nmj1j6k0k5k8
1598I17k1LK4K7J4OJ4K6K4Mj8k6j6OK3K0mk5j9MJ1oj8lK1K5Opqj2k4k3mJ1OplJ0J5RMjk1m1
1593I23l5mJ9Rj6k2%K7M0L6J8rl4m3l7k4rJ2L1L6K7J7K0K0Mk0k8j2Jkj1p%oj7j2J3L2K5Lj3
$$ plain form
1629 1209 1183 1167 1158 1142 1114 1091 1089 1101 1114 1128 1155 1187 1202 1191 1163 1129 1093 1060 1040 1034 1032 1028 1024 1018 999 971 958 975 1008 1033 1048 1066 1084 1079 1043 1000 980 994
1624 994 1027 1060 1078 1075 1059 1045 1045 1059 1083 1108 1124 1127 1123 1124 1137 1153 1158 1146 1126 1109 1095 1077 1054 1036 1032 1040 1043 1024 989 958 952 971 1002 1030 1046 1047 1035 1015 987 952
1619 952 922 914 939 985 1027 1050 1058 1065 1066 1049 1012 973 953 949 946 935 928 938 968 1002 1026 1028 1013 990 971 955 932 901 867 847 851 879 925 973 1000 996 973 957 963 980
1614 980 992 991 976 948 909 867 839 831 839 852 863 866 861 854 861 891 935 972 989 995 1000 1010 1023 1037 1046 1035 1002 963 945 952 964 965 956 952 953 941 910 870 846 851 874 893 895
1609 895 891 898 921 943 949 941 933 925 911 891 881 891 915 936 953 974 1002 1028 1041 1037 1019 992 966 948 939 934 934 939 950 965 983 1010 1048 1078 1080 1049 1007 980 977 987 997
1604 997 1002 1005 1007 1009 1008 1006 1009 1022 1039 1042 1022 990 968 967 982 995 995 984 973 974 983 989 983 972 969 970 965 955 963 1003 1060 1104 1123 1125 1119 1104 1075 1045 1026 1021 1017 1006 990 970 945 917
1598 917 896 899 923 950 964 970 984 1010 1034 1038 1020 994 978 984 1007 1027 1023 998 979 983 994 988 970 967 988 1013 1019 1012 1004 992 968 945 941 952 958 951 948 958 973 982 986 985 964 923
1593 923 888 884 903 912 896 874 874 901 941 977 995 986 952 909 872 848 839 851 882 918 945 962 982 1002 1006 986 958 946 947 945 934 927 927 921 904 892 905 937 962 965 952
1588I52j7k1k0j4m%OJ9L1K8Oj5k6k8k1JK8L6J9JMJ6J2j1k6j9jJ1J7J6J0MPJ0Kj9k7j2ONqj2
1583I46nmj3k0j2%PMknkPK0K7K0Lj1j4jK0L1K2lk6l1j8k%j4l1l5j8J0L5N0N3M1J7lo%%rj6
1577A012j0mnrnLLrk2k3j6nKLKjoj3j5rMJ2J6J3J1QKjJMJoj1j1qjQJ2OLJ0K2K0%j6j3LJ5R
1571I86pk1j9oOKp%K0K9J2j2j8pjopKJ3J8J6J4J1J3J7J5Ommkpj2mJ1Rj0j0J3K7Pj9j5OKl4
1566A023n9m9k3j5k0j8kK2M1M3K4mk0j4mj1k5k6oJ1J6J2J2J9K8L0J9Kqp%Ljrj3j1JJ7L1K9
1561A038J7Nkj0k6m5n5m2pL0M2K2j0k1pJ3K0K0K2L1L6K3Kj3r%mk7m8m3k0%NJlpnRK5K2lk9
1556I47k5jJ8J7Nlpj0qJjj7l3k8j7j8k7j6K4O2O5M1J9J6J6J3J6L0M1L4J6jj6l1l5k5nNkj6
1551A044k6k5qJ7L0J9pj9j0PJ6J7J3Jj9l4l8k4kJ8K4J1qj3nKnj7k2j9j3kJ6L0L4L2K9K0Mm
$$ plain form
1588 952 935 914 894 880 876 876 882 901 932 960 966 951 925 897 876 877 905 941 960 961 965 981 993 982 956 937 936 947 964 980 990 994 1001 1011 1013 994 967 955 961 966 958 946
1583 946 941 937 924 904 892 892 899 903 901 896 894 901 921 948 968 971 960 946 945 965 996 1018 1015 989 958 940 938 938 924 893 858 840 850 885 935 988 1029 1046 1043 1037 1037 1037 1028 1012
1577 1012 1002 998 993 984 979 982 985 976 954 931 915 910 912 915 917 916 910 897 882 873 877 889 905 918 929 937 939 938 939 943 944 938 927 916 908 907 915 927 933 936 946 968 988 988 972 959 962 977 986
1571 986 979 958 939 933 939 941 934 934 954 983 995 983 965 958 957 951 944 946 959 977 993 1007 1018 1031 1048 1063 1069 1065 1061 1059 1052 1040 1036 1047 1056 1046 1036 1049 1076 1083 1064 1049 1055 1057 1023
1566 1023 964 915 892 877 857 839 837 859 900 943 967 963 943 929 925 914 889 863 857 868 884 896 908 927 955 985 1004 1006 998 991 991 994 993 984 971 960 961 978 1009 1038
1561 1038 1055 1060 1058 1048 1022 977 922 880 873 903 945 967 957 936 929 942 962 982 1004 1035 1071 1094 1096 1083 1074 1074 1070 1043 995 952 932 932 937 938 935 928 923 932 957 979 976 947
1556 947 922 921 939 956 961 958 951 941 933 934 933 916 883 855 838 820 793 777 801 863 928 969 988 1004 1020 1033 1049 1079 1120 1154 1170 1169 1153 1122 1087 1062 1057 1062 1060 1044
1551 1044 1018 993 985 1002 1032 1051 1044 1025 1015 1022 1038 1055 1068 1069 1050 1016 978 954 952 970 994 1005 997 984 979 981 976 959 937 918 905 903 919 949 983 1015 1044 1064 1068 1064
1546A064lpk6m7m0qK6L9K9Qj0j1kM%%J8L4K5jj5rqk4m1m5m0k9qK6M5L5J1jjorNL0M4L3J1p
1541A089j5j9j9j2%J0RkrjJ4J5lk0j4MJ3OlmmpoLQJq%J8K7J4j1k8k6j6pmmnmnnpj1j8k0k0
1535H94j7pJ8M8N9M3J5JPJ9K7K4Qj6l1l1k6k8k5j2J0K1K6L6M3L4Pj3j6j3j5j8pJ2K0J4lj1
1530A097j0lmj8k8k1pnj3j3jPOKNJrj4j4j9k7j4J8L4J6rmJ6J6qk0j3npjJ7K5J4JLJ2J5Ojp
1525A016pkOLlMK6L8K6%j7k3k4j3QK5J8nk2j9j0lmpj3j5j1jQJ4J7J6J3J3Rnk1j8JJ3Kj8k2
1520I93qOJ0J2J4Oj1j6kK0K8K2RJ%MNN%oj4k1k4k6k8k9j9NK7L2K8K6K1Jj8j1J4K7J8OJ1J6
1515A134Jj7k2k2l1m0k7JJ4NLJ8L3K7J4J2J7J5PJ0K6L5K6Nj4j6nPJ7K1K3J8%k8m7n0n0n4n1
1510A015k7J1L1K0mj6j1kLNQJ0J4J8J8J0mj4j3pjlpj1mPJ4J4J3J2Mj9l9l2%L4M9N2M8L3Kk5
$$ plain form
1546 1064 1061 1054 1028 981 941 933 959 998 1027 1035 1025 1014 1012 1016 1016 1016 1034 1068 1093 1092 1077 1068 1060 1036 995 950 910 881 873 899 944 979 990 989 988 982 973 978 1008 1052 1085 1096 1089
1541 1089 1074 1055 1036 1024 1024 1034 1043 1041 1032 1031 1045 1060 1057 1037 1023 1027 1040 1046 1043 1039 1035 1028 1022 1025 1033 1034 1026 1026 1044 1071 1085 1074 1046 1020 1004 997 993 989 984 980 975 970 963 952 934 914 894
1535 894 877 870 888 936 995 1038 1053 1054 1061 1080 1107 1131 1139 1123 1092 1061 1035 1007 982 970 980 1001 1027 1063 1106 1140 1147 1134 1118 1105 1090 1072 1065 1077 1097 1111 1108 1097
1530 1097 1087 1084 1080 1062 1034 1013 1006 1001 988 975 974 981 987 989 994 995 986 972 958 939 912 898 916 950 966 957 953 969 985 977 957 944 939 932 931 948 973 987 988 991 1003 1018 1024 1023 1016
1525 1016 1009 1007 1013 1016 1013 1017 1043 1081 1107 1107 1090 1067 1043 1030 1038 1063 1081 1076 1054 1035 1025 1022 1018 1011 998 983 972 971 979 993 1010 1026 1039 1052 1061 1056 1035 1017 1018 1031 1033 1015 993
1520 993 985 991 1001 1013 1027 1033 1022 1006 1004 1024 1052 1074 1083 1084 1084 1088 1093 1098 1098 1092 1078 1057 1033 1007 979 950 931 936 963 995 1023 1049 1070 1071 1053 1042 1056 1083 1101 1107 1118 1134
1515 1134 1135 1118 1096 1074 1043 1003 976 977 991 996 999 1017 1050 1077 1091 1103 1120 1135 1142 1152 1178 1213 1239 1244 1230 1214 1209 1216 1233 1254 1277 1295 1295 1267 1220 1170 1120 1066 1015
1510 1015 988 999 1030 1050 1046 1030 1019 1017 1020 1025 1033 1043 1057 1075 1093 1103 1099 1085 1072 1065 1064 1061 1054 1043 1039 1046 1060 1074 1087 1099 1103 1084 1045 1013 1013 1047 1096 1148 1196 1229 1231 1206
1505A206l0k3j9j8oJ6L4L6L4L0J7nk2k4k1k5k9j9mjrj9j9k0k2j5JJ8K2J2nk0k7j4J0L2L4K3
1500A109J4J0ml1m9m5k2JJ1J1QLkJJ3K0J4%onmpqkNNjjOJ2J4J3Qkj6k6l1k8j8lJ8L1L5K3%
1495A074k0k1kJ8K4J7J2J2Lk0l7l3j3KJmm%mj6k9l4k6pJ2J3ok4j5K1M7M6L2L0L8K5j0l7k6
1490A039J0K7J4j1k5k7k8k4j4kNLlj2j7j5pKMRJ7J7QkKJ4K4K4J4Kj1j2%Qjj8k2nJ6K6J9Op
1484A047pMJ0Lj1j5j1j3k7l6l2j5QL5N2N0K9J2QKj6l0k6j3j0j3j0nmML0N5M6Pk1j2J1K0Rl
1480A112j1j6j8j2qokOQK%J1K2J0j9l4k5j1rj2mJ3K4J7mk1k6j8mNNNPJ4K0K1J5KmQK6L7L3
1474A159K9L1L2K5Mk5n5p3o0k5KOKRJ7Kk9m6l1oRJ2J3Qlj6j9j0%OJ2J5J2J4J8K1J9J6J6J6
1469A127J0RK2K9Pl1n0l5j1nj0oQJ6J1PJ0J5J7J4J4J4J5J2LonKLqj6j2JKorJJ1J2NKjnpJJ3
$$ plain form
1505 1206 1176 1153 1134 1116 1110 1126 1160 1196 1230 1260 1277 1272 1250 1226 1205 1180 1151 1132 1128 1127 1118 1099 1080 1060 1038 1023 1024 1042 1064 1076 1071 1051 1024 1010 1020 1052 1086 1109
1500 1109 1123 1133 1129 1098 1049 1004 982 983 994 1005 1013 1016 1014 1015 1028 1048 1062 1062 1056 1051 1047 1040 1032 1030 1035 1040 1039 1038 1044 1056 1070 1083 1091 1089 1073 1047 1016 988 970 967 985 1016 1051 1074 1074
1495 1074 1054 1033 1031 1049 1073 1090 1102 1114 1117 1097 1060 1027 1014 1016 1017 1013 1009 1009 1005 989 960 926 900 893 905 918 912 888 873 894 941 987 1019 1049 1087 1112 1102 1065 1039
1490 1039 1049 1076 1090 1079 1054 1027 999 975 961 959 964 967 964 952 935 920 913 915 919 928 945 962 970 968 970 984 1008 1032 1046 1048 1037 1025 1025 1033 1032 1014 992 987 1003 1029 1048 1054 1047
1484 1047 1040 1044 1054 1057 1046 1031 1020 1007 980 944 912 897 905 940 992 1042 1071 1083 1091 1093 1077 1047 1021 1008 998 985 975 970 966 970 1000 1055 1101 1108 1087 1075 1086 1106 1115 1112
1480 1112 1101 1085 1067 1055 1047 1041 1039 1045 1053 1055 1055 1066 1088 1098 1079 1045 1020 1009 1000 988 984 997 1021 1038 1034 1013 987 969 965 970 975 980 987 1001 1021 1042 1057 1059 1055 1063 1089 1126 1159
1474 1159 1188 1219 1251 1276 1280 1255 1200 1127 1067 1042 1044 1050 1052 1061 1078 1080 1051 1005 974 968 977 989 1002 1010 1007 991 972 962 962 968 980 995 1007 1021 1039 1060 1079 1095 1111 1127
1469 1127 1137 1146 1168 1197 1204 1173 1123 1088 1077 1072 1062 1056 1064 1080 1091 1098 1108 1123 1140 1154 1168 1182 1197 1209 1212 1206 1201 1203 1206 1198 1182 1170 1171 1173 1167 1158 1159 1170 1182 1187 1189 1188 1183 1176 1177 1190
1464A190J4nk8l5k0LJ6K2L0L2J7qqK3M9L3ok1PM2N2L7K1J1Jj1j2KK0K5Rj1k2j2J1L5N4N7M3
1459A657J9J1K7M3M1L5N0P6Q1O2N6Q3J17J23J11J11J36J79K24K56K71K82L16L67L86L41K61
1456E722J91J30M8n5j42j85j97j96j88j72j60j49j35j23j23j17p7j8J3PLL2P3R8J12J38J64
1452D694J66J54J66K16K78L29L79M42N20O00O71P39Q16R01R72R86R31Q39P71P52P72Q10Q65
1450A8769R30R96J044J040R47P58N06K42j6k93n92q65j050j137j165j178j182j155j083r76
1447A4540q63p56o45n20l93k93k24j70j10m4K0Q3J45K02K63L38M36N43O49P69R20J104J307
1444A7301J514J721J940K169K367K453K351K080J756J499J351J276J228J190J157J130J084
1442D5567R69P18L27j15m97q05j121j501j891k184k334k372k348k279k171k032j874j706j534
$$ plain form
1464 1190 1204 1199 1171 1136 1116 1119 1135 1157 1187 1219 1236 1228 1220 1243 1292 1325 1319 1298 1305 1347 1399 1436 1457 1468 1469 1458 1446 1448 1468 1493 1502 1491 1469 1457 1468 1503 1557 1614 1657
1459 1657 1676 1687 1714 1757 1798 1833 1883 1959 2040 2102 2158 2241 2358 2481 2592 2703 2839 3018 3242 3498 3769 4051 4367 4734 5120 5461 5722
1456 5722 5913 6043 6091 6036 5894 5709 5512 5316 5128 4956 4796 4647 4512 4389 4266 4149 4072 4054 4067 4074 4077 4109 4182 4280 4392 4530 4694
1452 4694 4860 5014 5180 5396 5674 6003 6382 6824 7344 7944 8615 9354 10170 11071 12043 13029 13960 14799 15570 16322 17094 17904 18769
1450 18769 19699 20695 21739 22779 23726 24484 24990 25232 25216 24923 24331 23466 22416 21279 20114 18936 17754 16599 15516 14540
1447 14540 13677 12921 12276 11756 11363 11070 10846 10676 10566 10522 10542 10625 10770 10972 11235 11573 12009 12552 13201 13970 14890 15994 17301
1444 17301 18815 20536 22476 24645 27012 29465 31816 33896 35652 37151 38502 39778 41006 42196 43353 44483 45567
1442 45567 46536 47254 47581 47466 46969 46164 45043 43542 41651 39467 37133 34761 32413 30134 27963 25931 24057 22351 20817
1440B0817j364j203j051r05p54n94m39l18k41j81j15m0L8J35K70M21N56O75Q15R93J189J385
1437B0089J596J822K017K119K094J957J738J478J226J027Q81P66O65N77M96L94K41K3k49n41
1435D0416q06j014j188j384j622j852k001k040k000j926j841j745j628j495j356j219j092
1433A4207r65q33o98n77m90m40m04l53k78k02j47j03m4K5Q1J18J58K18K93L72M56N36N83N74
1430A2087N22M61M02L39K65J99J50J22J06R3O9K9k4q5j51k23k94l55m21m97n69o10o20o27
1427A0368o46o54o29n79n31n00m73m30l75l23k88k65k42k11j76j43j17j03j08j20j11p1l5
1424C238l5o0p1n2l3l4m0l0j5j5k3k1j1mnlLRJ5K3K7K0J0J1J2MrnJ8L8L8K6K0K6M6O9Q4Q5
1419C356Q1P7P2O3N7O4Q1R1Q9R4J12J37J61J76J80J76J83K15K68L18L52L87M35M92N49N99
$$ plain form
1440 20817 19453 18250 17199 16294 15540 14946 14507 14189 13948 13767 13652 13612 13650 13785 14055 14476 15032 15707 16522 17515 18704 20089
1437 20089 21685 23507 25524 27643 29737 31694 33432 34910 36136 37163 38044 38810 39475 40052 40548 40942 41183 41206 40957 40416
1435 40416 39610 38596 37408 36024 34402 32550 30549 28509 26509 24583 22742 20997 19369 17874 16518 15299 14207
1433 14207 13242 12409 11711 11134 10644 10204 9800 9447 9169 8967 8820 8717 8673 8698 8779 8897 9055 9273 9566 9938 10394 10930 11513 12087
1430 12087 12609 13070 13472 13811 14076 14275 14425 14547 14653 14746 14815 14844 14820 14735 14584 14361 14067 13712 13291 12794 12225 11615 10995 10368
1427 10368 9722 9068 8439 7860 7329 6829 6356 5926 5551 5228 4940 4675 4433 4222 4046 3903 3786 3683 3575 3455 3344 3273 3238
1424 3238 3203 3143 3072 3020 2987 2953 2913 2883 2868 2853 2830 2809 2798 2794 2789 2786 2789 2798 2813 2836 2863 2883 2893 2904 2916 2920 2911 2906 2924 2962 3000 3026 3046 3072 3118 3187 3271 3356
1419 3356 3437 3514 3586 3649 3706 3770 3851 3942 4031 4125 4237 4374 4535 4711 4891 5067 5250 5465 5733 6051 6403 6790 7225 7717 8266 8865
1416H865O41O69O72O43N75M56K90J07o0j97l02l73m20m48m58m48m18l84l57l30l03k77k54
1413G889k15j55r5n7l9j4K3O7J07J51K04K66L37M17M95N53N96O32O69O88O70O05M99L69K38
1410A4900J29L9m9j41k35l31m22n02n56n82n91n91n83n67n49n30n04m61m06l47k96k62k49
1408F314k41k22j86j47j14q0l7RM6O8Q5J15J64K23K69K90K86K64K19J41M2n4j32j96k47k74
1404F605k75k68k69k73k67k58k48k38k23k13k10j99j75j50j46j53j48j34j22j13r1o2n0o0
1401B260o9n8m0l4l7l6k9k3j9j6k1l8n6n7m6l6l2k6k1j8j6lJ4K6K9K2Lk4l9l2j0%qj4j0ll
1397A480kPJ1kk0k8k1j5j2rqj6k3k0omj9k5j0J4J7jj6j8j4j2nJ1K6K3Orj0mnj6k5j7RL2L3
1392A277Pk8m4l0kJ2Jj7j8jJ4J2lj0mMOJnmMJ6J7Jl0n2m4j0J9J7rk6j4J7L4L0J7J6K2J8kk2
$$ plain form
1416 8865 9506 10175 10847 11490 12065 12521 12811 12918 12858 12661 12359 11986 11566 11118 10660 10212 9794 9410 9053 8723 8420 8143 7889
1413 7889 7674 7519 7424 7367 7328 7314 7337 7404 7511 7662 7866 8132 8469 8886 9381 9934 10530 11162 11831 12519 13189 13794 14293 14662 14900
1410 14900 15029 15068 15019 14878 14643 14312 13890 13388 12832 12250 11659 11068 10485 9918 9369 8839 8335 7874 7468 7121 6825 6563 6314
1408 6314 6073 5851 5665 5518 5404 5324 5287 5296 5342 5410 5495 5610 5774 5997 6266 6556 6842 7106 7325 7466 7508 7454 7322 7126 6879 6605
1404 6605 6330 6062 5793 5520 5253 4995 4747 4509 4286 4073 3863 3664 3489 3339 3193 3040 2892 2758 2636 2523 2432 2370 2320 2260
1401 2260 2191 2133 2093 2059 2022 1986 1957 1934 1915 1899 1878 1840 1784 1727 1681 1645 1613 1587 1566 1548 1532 1529 1543 1569 1598 1620 1623 1599 1560 1528 1518 1518 1510 1496 1486 1483 1480
1397 1480 1478 1485 1496 1494 1474 1446 1425 1410 1398 1389 1381 1365 1342 1322 1316 1312 1293 1268 1258 1272 1289 1288 1272 1254 1240 1228 1223 1234 1260 1283 1289 1280 1270 1266 1261 1245 1220 1203 1212 1244 1277
1392 1277 1284 1256 1212 1182 1180 1192 1193 1176 1158 1157 1171 1183 1180 1170 1166 1170 1176 1177 1172 1168 1172 1188 1205 1206 1176 1124 1080 1070 1089 1106 1097 1071 1057 1074 1108 1138 1155 1171 1193 1211 1209 1187
1387A187l3k8j4LJ7K2J4OMLnj3pJ3K5J4j0l1l3k2j0prnPJ8K1J2OKJ%JMLpk0k2j2JJ3K6L2K6
1381A193Mj1rNQlj6j2%RNkn%QJ0PjJJ6L5M1L3K2K1K2J4mj7k2k1j8qNJ4J0jokJrk6l5k4pJn
1376A221j0rpj2j7j4kJ2K6M1L9J4k1l3j7Kjj8k1r%kpnLJ4K4L1L4L4L2K4Mj3j6mQJ0Moj8j5
1371A300PL3K7ql5k7nol2m5l2qkqmJ5L0K5Kk2k9k3j0NK8M7M3Ol6n7m6k5mJ1K4L0K4J3PJ5L0
1366A258M2L9K2OMRJ1Jj1k1k6k6j7m%rk3l0l1k7j9j2j1j3oPJ2J3K3M8O2M4Jl7m9m2k7nJ8K8
1361A202K4J4Mlj2j4jRJk2l5k7nJ1J8K3K5J2rk0j4KJ1J4J5J1PLJ%KPJ3J5J1J0Rqm0n5l3QK6
1355A210J6QJ2J6Rknj3k7k9rJ2J2%pj5l3m1j9J0Pj9k6LL2K6Kj0pmkMQOQK1K8J8Jonpj4j3m
1350A152%pj6j9j6pPJ4Mj1j0J5L8L6J6jnJPJ4J6Pj2l0l3k8k3k1j9qLJ0J0J3J6J9K1K6L0K5
$$ plain form
1387 1187 1154 1126 1112 1115 1132 1154 1168 1174 1178 1181 1176 1163 1156 1169 1194 1208 1198 1167 1134 1112 1102 1095 1086 1081 1088 1106 1127 1139 1145 1147 1148 1148 1149 1153 1156 1149 1129 1107 1095 1096 1109 1135 1167 1193
1381 1193 1197 1186 1177 1182 1190 1187 1171 1159 1159 1168 1173 1171 1166 1166 1174 1184 1191 1190 1191 1207 1242 1283 1316 1338 1359 1381 1395 1391 1374 1352 1331 1313 1305 1310 1324 1334 1333 1327 1325 1326 1317 1291 1256 1232 1225 1226 1221
1376 1221 1211 1202 1195 1183 1166 1152 1150 1162 1188 1229 1268 1282 1261 1228 1211 1213 1212 1194 1173 1164 1164 1162 1155 1150 1153 1167 1191 1222 1256 1290 1322 1346 1350 1337 1321 1317 1325 1335 1339 1333 1315 1300
1371 1300 1307 1340 1367 1359 1324 1297 1292 1286 1254 1209 1177 1169 1167 1159 1155 1170 1200 1225 1227 1205 1176 1153 1143 1148 1176 1223 1266 1272 1236 1179 1133 1108 1104 1115 1139 1169 1193 1206 1213 1228 1258
1366 1258 1300 1339 1361 1367 1371 1380 1391 1392 1381 1360 1334 1308 1291 1287 1287 1278 1255 1225 1194 1167 1148 1136 1125 1112 1106 1113 1125 1138 1161 1209 1271 1315 1316 1279 1230 1188 1161 1156 1174 1202
1361 1202 1226 1240 1244 1241 1229 1215 1214 1223 1224 1202 1167 1140 1135 1146 1164 1187 1212 1224 1215 1195 1181 1183 1194 1208 1223 1234 1241 1244 1245 1245 1247 1254 1267 1282 1293 1303 1312 1304 1264 1209 1176 1184 1210
1355 1210 1226 1234 1246 1262 1271 1269 1264 1251 1224 1195 1186 1198 1210 1210 1203 1188 1155 1114 1095 1105 1112 1093 1067 1070 1102 1128 1130 1120 1113 1109 1107 1111 1119 1125 1133 1154 1182 1200 1201 1195 1190 1183 1169 1156 1152
1350 1152 1152 1145 1129 1110 1094 1087 1094 1108 1112 1101 1091 1106 1144 1180 1196 1195 1190 1191 1198 1212 1228 1235 1223 1193 1160 1132 1109 1088 1069 1061 1064 1074 1084 1097 1113 1132 1153 1179 1209 1234
1345A234J6J9L1K8Lk7l1j3mj3k1j0J0J8Nj8m0m4k6%K1K7L5M7N4M2J8Jnj0j3rMJ5J6J4J4Rl
1340A394j3qOJ1OKPQJnKJ1Nj3k3j4nj0k0j1K0N0O0M4J3j2j5PK9K9J1jLJ0R%mj0k0k8j8MJ7
1335A529J0klJ3L0M1M3L7K5J1MOP%j1j6j1qj2j3plj1k8m2n3n8n0k4NK3L0L4L3J6pj6pmj3j6
1330A482lJ1PJJ0L0L7K2MJQJ1Onk0l0l3l1k8j4J6M4M4K0klMLKNJ4J7J9K5K5J6MMJ3J1Jnkl
1325A738j2k1j8qJ0K7L7K2j3l3j4K5L9J3j5j8KJ8K1J9Rmj4pOLj1j4KJ8K1K4L9M9L5J0KJ7K6
1320B030K3J9K7L9L2J0qrJMoj4pJ9M1M1L1K8L6M1L8L9M2L8L0K8L3L0J3JJ2L0L3K6K8L7L5K2
1315B893J9L4M8N0M9N7N9N0M1M1M8M7M2L8L0J9J5K8M8N8N4N4O1O4O4P0P8P3N6N2P2R9J02Q5
1311D698O9O8P6Q6J01J15J21J20J24J37J53J62J60J56J50J43J35J25J13J08J17J38J50J41
$$ plain form
1345 1234 1250 1269 1300 1328 1331 1304 1273 1260 1256 1243 1222 1212 1222 1240 1245 1227 1187 1143 1117 1117 1138 1165 1200 1247 1301 1343 1361 1362 1357 1347 1334 1325 1329 1344 1360 1374 1388 1397 1394
1340 1394 1381 1373 1379 1390 1396 1398 1405 1413 1414 1409 1411 1422 1427 1414 1391 1377 1372 1362 1342 1331 1351 1401 1461 1505 1518 1506 1491 1498 1527 1556 1567 1566 1569 1579 1588 1588 1584 1574 1554 1526 1508 1512 1529
1335 1529 1539 1537 1534 1547 1577 1618 1661 1698 1723 1734 1738 1744 1751 1751 1740 1724 1713 1705 1693 1680 1673 1670 1659 1631 1589 1536 1478 1428 1404 1409 1432 1462 1496 1529 1545 1538 1522 1515 1511 1498 1482
1330 1482 1479 1490 1497 1498 1508 1538 1575 1597 1601 1602 1610 1621 1627 1622 1602 1572 1539 1508 1480 1466 1482 1526 1570 1590 1588 1585 1589 1592 1594 1599 1613 1630 1649 1674 1699 1715 1719 1723 1736 1747 1748 1743 1741 1738
1325 1738 1726 1705 1687 1679 1689 1716 1753 1775 1762 1729 1715 1740 1779 1792 1777 1759 1761 1779 1800 1819 1828 1824 1810 1803 1809 1812 1801 1787 1789 1807 1828 1852 1891 1940 1975 1985 1987 2004 2030
1320 2030 2053 2072 2099 2138 2170 2180 2172 2163 2164 2168 2162 2148 2141 2160 2201 2242 2273 2301 2337 2378 2416 2455 2497 2535 2565 2593 2626 2656 2669 2670 2682 2712 2745 2771 2799 2836 2871 2893
1315 2893 2912 2946 2994 3044 3093 3150 3209 3259 3300 3341 3389 3436 3478 3516 3546 3565 3580 3608 3656 3714 3768 3822 3883 3947 4011 4081 4159 4232 4288 4340 4412 4511 4613 4698
1311 4698 4767 4835 4911 4997 5098 5213 5334 5454 5578 5715 5868 6030 6190 6346 6496 6639 6774 6899 7012 7120 7237 7375 7525 7666
1308G666J19J11J26J57J81J93J99K05K11K06J85J56J37J41J58J77J93K07K21K31K33K34K43
1305A1890K58K70K73K66K56K49K47K53K76L12L47L64L62L60L72L94M09M10M05M10M27M53M76
1302A9739M87M89M88M94N07N26N39N38N24N08N00M83M51M14M00M06L92L31K49J90J67J53J18
1300B9093P0K3j6n9j09j64k15k52k72k90l11l35l44l50l67l98m16l93l42l00k86k93k97k84
1297B3093k57k32k19k09j88j64j51j50j32q7l7j4lK1O1Q8Q7P7Q1R3R7R9J11J36J61J78J84
1293B2724J79J61J37J20J20J33J41J25R0N5L1J9Qjj6m5r8j60k08k31k43k61k80k98l18l45
1290B1539l73l95m14m37m63m82m84m72m58m53m51m45m29m08l96l96m01m07m05l95l75l61l60
1287A1879l69l65l44l17k93k69k50k42k50k60k55k37k14k01j96j99j98j87j69j54j49j42j30
$$ plain form
1308 7666 7785 7896 8022 8179 8360 8553 8752 8957 9168 9374 9559 9715 9852 9993 10151 10328 10521 10728 10949 11180 11413 11647 11890
1305 11890 12148 12418 12691 12957 13213 13462 13709 13962 14238 14550 14897 15261 15623 15983 16355 16749 17158 17568 17973 18383 18810 19263 19739
1302 19739 20226 20715 21203 21697 22204 22730 23269 23807 24331 24839 25339 25822 26273 26687 27087 27493 27885 28216 28465 28655 28822 28975 29093
1300 29093 29163 29186 29170 29111 29002 28838 28623 28371 28099 27809 27498 27163 26819 26469 26102 25704 25288 24895 24553 24253 23967 23674 23377 23093
1297 23093 22836 22604 22385 22176 21988 21824 21673 21523 21391 21304 21267 21253 21250 21271 21332 21420 21507 21584 21665 21758 21855 21954 22065 22201 22362 22540 22724
1293 22724 22903 23064 23201 23321 23441 23574 23715 23840 23930 23985 24016 24035 24043 24042 24026 23981 23883 23723 23515 23284 23041 22780 22500 22202 21884 21539
1290 21539 21166 20771 20357 19920 19457 18975 18491 18019 17561 17108 16657 16212 15783 15375 14979 14583 14182 13775 13370 12975 12600 12239 11879
1287 11879 11510 11145 10801 10484 10191 9922 9672 9430 9180 8920 8665 8428 8214 8013 7817 7618 7420 7233 7064 6910 6761 6619 6489
1285F489j22j26j39j47j46j38j26j17j10j04r0o6m8m8o8r2j05j07j02r1q5p7o2m3l3l9m9m9
1281C960m7n4o6o3n0m8o2o9n7m0l5l1k0j0j8m0n1m6l8l9m1m3m3m1m0l7l9l7l1k6k6k3oJ3J8
1277B674Nnoj1l5n6n6l9l4m3m7l0qjonjqk8m0l0oPkj9k5k0j2rlQJ0pl7n6m6j5J0J8J2Lj1l2
1272A958n1n5m1k4j2mKKJ%KN%nj0j5j8j6kJ6J9jk7l7k7j4j2j3oMJ2J0J2J7J2j1l9n5n7m9l3
1267A438qJ8K7J9NjJKPO%rj0LJ4J3Nnj6k4k0pmj8l8l6j6KNlj1k0k7k4j5nKJ2K4L2L8M6M7K5
1261A474j0k8k2j4k2l1k3kP%ommo%J5K4K2J7J6J7Pj2l1l9l6k6j7j1lJ4L1L1J5j0k6l2l1k0
1256A224lOKpr%QMmmPK2K9K3Rlj3k2k5j7jOkj6k5k8k4qJ7K9J6j1k3pK4M1L0ll5m4k1LOqj4
1251A129oMNPJ1Jk4m0j8K5M6L2J3J1J6Mk1l3k5qJMRJ1OnrkJ0J2Omj6k8k8j1PJ3ONJ6K4J5%
$$ plain form
1285 6489 6367 6241 6102 5955 5809 5671 5545 5428 5318 5214 5124 5058 5010 4962 4894 4802 4697 4590 4488 4397 4312 4235 4173 4130 4097 4058 4009 3960
1281 3960 3913 3859 3793 3730 3680 3632 3570 3501 3444 3404 3369 3338 3318 3308 3290 3250 3199 3153 3115 3076 3035 2992 2949 2908 2868 2831 2792 2755 2724 2698 2672 2649 2643 2656 2674
1277 2674 2679 2674 2668 2657 2622 2566 2510 2471 2437 2394 2347 2317 2309 2308 2302 2297 2296 2288 2260 2220 2190 2184 2191 2189 2170 2145 2125 2113 2104 2101 2109 2119 2112 2075 2019 1973 1958 1968 1986 1998 2001 1990 1958
1272 1958 1907 1852 1811 1787 1775 1771 1773 1775 1776 1776 1778 1783 1783 1778 1768 1753 1735 1719 1717 1733 1752 1751 1724 1687 1660 1646 1634 1621 1615 1619 1631 1641 1653 1670 1682 1671 1632 1577 1520 1471 1438
1267 1438 1430 1448 1475 1494 1499 1498 1499 1501 1508 1514 1514 1505 1495 1498 1512 1525 1530 1525 1509 1485 1465 1458 1454 1436 1398 1362 1346 1348 1353 1350 1339 1319 1292 1268 1253 1248 1250 1262 1286 1318 1356 1402 1449 1474
1261 1474 1464 1436 1414 1400 1378 1347 1324 1322 1329 1329 1323 1319 1315 1309 1309 1324 1348 1370 1387 1403 1420 1427 1415 1384 1345 1309 1283 1266 1255 1252 1266 1297 1328 1343 1333 1307 1275 1244 1224
1256 1224 1221 1227 1229 1222 1213 1213 1221 1225 1221 1217 1224 1246 1275 1298 1307 1304 1291 1269 1244 1227 1226 1232 1230 1214 1189 1161 1137 1129 1146 1175 1191 1180 1157 1150 1174 1215 1245 1242 1207 1163 1142 1145 1151 1143 1129
1251 1129 1123 1127 1132 1139 1150 1151 1127 1087 1069 1094 1140 1172 1185 1196 1212 1216 1195 1162 1137 1129 1130 1134 1143 1154 1160 1155 1146 1144 1154 1166 1172 1168 1152 1124 1096 1085 1092 1105 1111 1116 1132 1156 1171 1171
1246A171j0j1j2j0jQPNQJ4J0NJ0K5K6RoMK8L9J7k2n6o6m6j7%nj5j3%J1J8K7L2K0rl5m0l0j8
1241A072j2lNNjjJ1K8L7K8Pj2j6j2nlk%%pj9k2j3NJ7J6KppOJ7J9J6J2J1%j8k4rROj4j8PL6
1235A147L6J4%QJ7J4Mj0k8m4m4k2jKjNNj2l8m4k5jJ0Ork3k3%L1M3K9J0KMQJ2Rj0l5m5k9nN
1230I72LRL0M8M4J6j2l0k5pK1M4N1K9ql5l2j3oj2j0JJk1m7m2j0K3L2K2Okmoj3k0j7lJ0J4P
1225A008LOJ1J3J0OLjqj8k4j4KLj5k5qK0L0J8PJ1J5Lj3j6nM%oqjMKmoJJ5K1J3jqj0j4k2k7
1219I75k2qPJ7K4K6J4j3m1m9l0kJ6K2K9L5L4K7J4kk0l2k8j3mmpjM%lLJ3J3jrjJ9K5J1rj9j8
1214I92j2rlPJ1RNRJ4J1OJ1J8Pk1l8k4OK7L0K7J6%j6j9qJKknj3k6l3l2k2j2%J3K0J7J0jj1
1209I62k1j8LK6K8Oj2rQJ8J0lkJ1K1Rk0m0l6j3KKmlKJlkjnqNL0M0K7Pl%LNPOJljOJ0J3J2M
$$ plain form
1246 1171 1161 1150 1138 1128 1127 1135 1142 1147 1155 1169 1179 1184 1194 1219 1245 1254 1248 1252 1280 1319 1336 1314 1258 1192 1146 1129 1129 1124 1109 1096 1096 1107 1125 1152 1184 1204 1195 1160 1120 1090 1072
1241 1072 1060 1057 1062 1067 1066 1065 1076 1104 1141 1169 1176 1164 1148 1136 1131 1128 1126 1126 1126 1119 1100 1078 1065 1070 1087 1103 1105 1098 1091 1097 1114 1133 1149 1161 1172 1172 1154 1130 1121 1130 1136 1122 1104 1111 1147
1235 1147 1183 1197 1197 1205 1222 1236 1240 1230 1202 1158 1114 1092 1091 1093 1092 1097 1102 1090 1052 1008 983 982 992 998 989 966 943 943 974 1017 1046 1056 1058 1062 1070 1082 1091 1081 1046 1001 972 967 972
1230 972 975 984 1014 1062 1106 1122 1110 1080 1055 1048 1069 1113 1164 1193 1185 1150 1118 1105 1099 1087 1077 1078 1079 1058 1011 969 959 982 1014 1036 1042 1040 1036 1030 1017 997 980 977 987 1001 1008
1225 1008 1011 1017 1028 1041 1051 1057 1060 1059 1051 1033 1009 995 997 1000 985 960 952 972 1002 1020 1027 1038 1053 1056 1043 1027 1022 1026 1026 1020 1012 1011 1015 1017 1013 1007 1008 1023 1044 1057 1056 1048 1038 1024 1002 975
1219 975 953 945 952 969 993 1019 1033 1020 979 930 900 898 914 936 965 1000 1034 1061 1075 1073 1053 1021 993 980 976 972 965 964 968 968 965 968 981 994 993 984 983 1002 1027 1038 1029 1010 992
1214 992 980 971 968 975 986 995 1000 1009 1023 1034 1040 1051 1069 1076 1055 1017 993 999 1026 1056 1083 1099 1099 1083 1064 1056 1057 1059 1057 1052 1039 1013 980 948 926 914 914 927 947 964 974 973 962
1209 962 941 923 926 952 980 986 974 965 973 991 1001 998 996 1007 1028 1037 1017 977 941 928 930 932 928 925 927 928 925 923 922 917 909 914 944 984 1011 1018 1015 1015 1018 1023 1030 1036 1037 1034 1033 1039 1049 1062 1074 1078
1203A078j1j5o%j4l1k7nRMKRJ9J8K2L4M0K5mj9j9j8j9j7j4j5k7l9l9k5lJ8L4M6O0N9K9k0m1
1198A078k4Jjj8j9OK4K5J5Oj1l1l8k1NK7L5L0Mk9m2k6mLlpmll%K%NK2L7L5J8N%kjKkj7l1k7
1192A021j4j3k5k5JL0M1K6Oqj4j8k6k7j4J1K8K2Kj2pMQkj4j5jK0L2K9K0J6J3Jj7k4j4kqk8
1187A003m2l2j2Jpj6j0J2K8K6J8K4K9J3k4m6l4JK9L8M1M5M9M0J9ok1k4k4k5k4j0ONj2k5j7
1183A016JPkj2k2l1l0j3QJ6J0J0J6J3jrjJ1J1OJ2K0J7J0J3K6K1j1l9l9j9rk0k9j9LK2L2L1
1178A026K5J3NORKj4l0l3k4nJ5K6K0OjJ0K5K7J7J2J2Rrk6l2k2j0mpk0l2k6oQNoqlj2k6k7o
1173H89J5J6P%mj2j6JK8M7M4L0J6LqpNJ7J8J3J0Nrk0j5JPqk8l2k1j5j7j6JK2K4Qpqml%J5L8
1167A030M8L1%k7l5k9k1j4j1m%lj9k6j4LMomJ5L0K1MMJ9L0K5J0rk4k5j3oj3k2j7lM%KJ0J3
$$ plain form
1203 1078 1067 1052 1046 1046 1032 1001 974 969 978 982 984 993 1012 1030 1052 1086 1126 1151 1147 1128 1109 1091 1072 1055 1041 1026 999 960 921 896 893 911 945 991 1051 1110 1139 1119 1078
1198 1078 1054 1055 1054 1036 1017 1023 1047 1072 1087 1093 1082 1051 1013 992 997 1024 1059 1089 1093 1064 1022 996 992 995 992 985 981 978 975 975 977 977 982 1004 1041 1076 1094 1099 1099 1097 1096 1098 1096 1079 1048 1021
1192 1021 1007 994 969 944 945 975 1016 1042 1048 1040 1026 1008 982 955 941 952 980 1002 1004 992 985 989 997 995 981 966 965 985 1017 1046 1066 1082 1095 1096 1079 1055 1041 1039 1031 1003
1187 1003 961 929 917 918 911 895 885 897 925 951 969 993 1022 1035 1011 965 931 932 961 999 1040 1085 1134 1174 1193 1187 1166 1142 1118 1093 1069 1059 1065 1070 1058 1033 1016
1183 1016 1017 1024 1022 1010 988 957 927 914 922 938 948 958 974 987 986 977 976 987 998 1004 1016 1036 1053 1063 1076 1102 1123 1112 1073 1034 1015 1006 986 957 938 941 963 995 1026
1178 1026 1051 1064 1069 1075 1084 1086 1072 1042 1009 985 980 995 1021 1041 1047 1046 1056 1081 1108 1125 1137 1149 1158 1149 1123 1091 1069 1059 1055 1048 1028 996 970 964 972 977 971 963 960 948 922 895 889
1173 889 904 920 927 927 923 911 895 896 924 971 1015 1045 1061 1064 1056 1049 1054 1071 1089 1102 1112 1117 1108 1088 1073 1074 1081 1073 1045 1013 992 977 960 944 945 967 991 999 992 984 980 977 977 992 1030
1167 1030 1078 1109 1109 1082 1047 1018 997 983 972 968 968 965 946 920 906 909 913 907 903 918 948 969 973 977 996 1026 1051 1061 1052 1028 1003 990 984 971 949 932 929 933 933 935 945 958
1162I58PLNLmj3j8k1k1rJ2K8K8K4K4K2Rj0k5l5l5k3%J9K0J3J1J6J4Jj5k0k1k4k9l1k5j1NK1
1157H53L0L2K8J6Lmqo%J4K8K2%k1k2qMJqj7j4mJ5K9L5L0J8O%QK3K4Nk0k8j4PJ2Kj6l0m1m6
1152I38m3k6KK3K6J5NLkrqNQpj7%K7L4J5mj0nNJ7K9K3PlLJ0OjJJ0J4R%j5k7k9j6JQLqk1l2
1146I64l4k1kJ3J8J6J0PRJ0jk0l4k9j2PK0K5K3J5RNjnJJ4J4mk1j9lJ6L1M0L7J4j2k2j7rro
1141A037jK%jJjlmJPNkj3j9j6nOPJjlj4k6k3kJ9K6K5J9J2KoojLKjmrj2j2nLJ0J1Kqj1LK4L3
1135A052J7qj4MK1J4j0j9nJ0Jj8j9kJ6K2K3J7lk8l3j5MQNQNj4m1n0l5pJ6K4J2j1k0oJ0Pj2
1130I26j9KL5N4M7J3k7n3m9k2MJ3Jj2j5kK1L1K4J0KLMkrj7j8j2oj1l1l8j4K8N2M1J3kPK3L1
1125A026K3Prk4l4l7k6mRMpnLlj9k4rJ0K0K4K8K4Oj2k1j3lQJ2Poj3lJ9L9M1L1J7Rjj9m4n7
$$ plain form
1162 958 965 968 973 976 972 959 941 920 899 890 902 930 958 982 1006 1028 1037 1027 1002 967 932 909 909 928 948 961 972 988 1002 1003 988 968 947 923 894 863 838 827 832 853
1157 853 883 915 943 959 962 958 950 944 944 958 986 1008 1008 987 965 957 961 962 954 937 923 919 934 963 998 1028 1046 1052 1052 1060 1083 1107 1112 1092 1064 1050 1057 1069 1071 1055 1025 984 938
1152 938 895 869 871 894 920 935 940 943 941 932 924 929 937 930 913 913 940 974 989 985 975 970 975 992 1021 1044 1051 1048 1051 1061 1067 1066 1067 1077 1091 1100 1100 1085 1058 1029 1013 1014 1022 1025 1017 996 964
1146 964 930 909 907 920 938 954 964 971 980 990 989 969 935 906 894 901 921 946 969 984 993 998 997 992 993 1007 1021 1017 996 977 974 990 1021 1061 1098 1112 1100 1078 1061 1052 1043 1037
1141 1037 1036 1038 1038 1037 1038 1037 1034 1030 1031 1038 1043 1041 1028 1009 993 988 994 1001 1002 1001 998 984 958 935 933 952 978 1003 1022 1034 1036 1030 1024 1023 1026 1028 1027 1023 1014 1002 990 985 988 998 1009 1011 1003 992 995 1019 1052
1135 1052 1069 1061 1047 1051 1072 1086 1076 1057 1052 1062 1063 1045 1026 1024 1040 1062 1085 1102 1099 1071 1038 1023 1027 1035 1040 1048 1053 1039 998 948 913 906 922 946 958 947 927 921 931 938 926
1130 926 907 909 944 998 1045 1058 1031 978 929 907 911 924 925 913 898 896 917 948 972 982 984 987 991 989 980 963 945 933 927 916 885 847 833 861 913 954 967 965 972 995 1026
1125 1026 1049 1056 1047 1023 989 952 926 922 931 935 928 923 926 923 904 880 871 881 901 925 953 977 983 971 950 937 934 942 954 961 955 942 939 958 997 1038 1069 1086 1095 1094 1075 1031 974
1120I74m4j7%%j0j6j1jJ3K4K8K0%k3l2k0QK2J1j1j4JJ4J1MJoj7j8qjqj3kJ8K3J8J3J8K2K3
1115I94K2J7Lrj0nqj3oQPqk0j9k0k6k1LL2M1L3K3J2jp%R%k3l8k9pJ0J4ROQJ5J7J1J0J7K3J7
1109A091jj0plpj2qNJ4J5Qkj0j8k4k0rMNj3l2l4j5MJ5J9K3K1J0%jQJ4R%oj1j4j8j9j3KJ9K6
1104A005J9QRK0K6J2j7m1m7l3j1NRNRK0L1K6Rnqoqj2j6k4l5l4j2K3M5M5L2J7N%OJ5Oj8l8l7
1099A005k3j6j6j0KJ0QOJ1J9K1J5J0NjoppqoljnrmMQ%qj1oNJ8K4K3J1pk0j6RL6L5Qj1kJ6J1
1093A117rj9j1lno%Mjppj4l5m9l2%J5J4J6L5M3K3ok1k5l8n6o1m5j7PK8M5M5K3oj9j1RK2J6
1088I59Kopqk1l4l4j3J0J2lj6qK0M3M1J5rpRJ8QmjJ4K2J4M%kqj3rLJ2Prk1j7NL0L8K3Kj0j0
1082A041mkpj3j9j4JJ3J2K%J4K9L1J8Nnj4k5k7k2j4rj2j8k3j5LK2K8J8J0ROoj7j3LJ8K3K5
$$ plain form
1120 974 930 913 913 913 903 887 876 875 888 912 940 960 960 937 905 885 893 915 926 915 901 902 916 927 931 932 926 909 891 883 882 874 861 859 877 900 918 931 949 971 994
1115 994 1016 1033 1036 1027 1017 1012 1004 991 985 993 1000 992 972 953 933 907 886 889 921 962 995 1018 1030 1029 1022 1022 1031 1031 1008 970 941 934 944 958 967 973 981 996 1013 1024 1034 1051 1074 1091
1109 1091 1090 1080 1073 1070 1063 1051 1043 1048 1062 1077 1085 1083 1073 1055 1031 1011 1002 1006 1011 998 966 932 917 921 936 955 978 999 1009 1009 1008 1016 1030 1039 1039 1033 1022 1008 990 971 958 960 979 1005
1104 1005 1024 1032 1041 1061 1087 1099 1082 1041 994 961 950 955 964 969 978 998 1029 1055 1064 1059 1051 1045 1037 1025 1009 985 950 916 904 927 972 1017 1049 1066 1071 1071 1077 1092 1098 1080 1042 1005
1099 1005 982 966 950 940 942 952 960 966 977 996 1017 1032 1042 1047 1046 1040 1033 1026 1018 1012 1009 1008 1003 994 990 994 1002 1002 994 983 977 982 1000 1024 1047 1058 1051 1031 1015 1024 1060 1095 1103 1092 1090 1106 1117
1093 1117 1108 1089 1078 1075 1070 1064 1064 1068 1067 1060 1053 1039 1004 955 923 923 938 952 968 1003 1046 1069 1063 1042 1017 979 923 862 817 800 807 835 880 925 948 942 923 912 921 943 959
1088 959 961 955 948 940 919 885 851 838 848 860 857 841 833 853 896 937 952 943 936 945 963 971 967 966 980 1002 1016 1020 1020 1018 1010 997 988 991 1003 1010 1001 980 963 968 998 1036 1059 1061 1051 1041
1082 1041 1037 1035 1028 1015 996 982 983 996 1008 1010 1010 1024 1053 1084 1102 1107 1102 1088 1063 1036 1014 1000 991 979 961 938 923 926 948 976 994 1004 1013 1019 1013 996 983 986 1004 1027 1052
1077A052K6K3J0mj4k0k7l2k7j0J3K2J0k1m6m2j4J4K5K5K2J5ONK2L4J5l3o3m7mK2J9J1J3J3
1073A013Kj0jK4L9K1j6l9l1KK5J9nj8pJ1J3kj4j1lLN%j3l0l3j8ljnjMkrlJ7K8K1RNLnj0pj
1067I66klNJ4K1K7L6L8K6J3J1Nk1n1n5k6jKolNLj1k8l9l7j9NK2K7K7K7J9NkKKopJ1L3L1Rj1
1062A064j1oljmj4k6k5j0J1K5K9K3Pj2k0j8j5j3KJ9K2Lj6j9j8k7l4k6rKMLPJ1J6K3K9K6J7
1057A016J1J2J6J5Qj0l1m5m3l3k9k8k1p%%OJ8K5J3KPK9M4L6Pk0k3ML7M6L0J4J3J7J4NNJ0N
1052A175j5l7m0k0NJ3Jj3j2%RLnj4k5l1k4kJ6J4NJ0K3K9J3oj3oMKj4l0l0j7qj2j5NL4L9J9
1047A030oj3nNJ3K6L5L0Qj6k7j7lmk2l9l4j2KNPJ8K4J6mk6l9l5j0K6M2L4J9Rlk4l9k5QK8K6
1042A008J7J1NnpLJ6J3ok7l4k4nRJ0MllLJ1J0lj6j5RL4L4J0j5k4j9j3qqj2j5rJKqj6pJ3K6
$$ plain form
1077 1052 1078 1101 1111 1107 1093 1073 1046 1014 987 977 990 1012 1022 1001 955 913 899 913 938 963 985 1000 1006 1011 1033 1067 1082 1049 986 939 935 957 976 987 1000 1013
1073 1013 1015 1005 1004 1028 1067 1088 1072 1033 1002 1004 1029 1048 1043 1025 1018 1029 1042 1040 1026 1015 1012 1015 1020 1020 1007 977 944 926 923 922 917 916 920 918 909 906 923 951 972 981 986 989 984 974 967 966
1067 966 964 961 966 980 1001 1028 1064 1102 1128 1141 1152 1157 1136 1085 1030 1004 1003 1005 999 996 1001 1004 993 965 926 889 870 875 897 924 951 978 997 1002 1000 1002 1004 998 991 1002 1035 1066 1075 1064
1062 1064 1053 1047 1044 1043 1039 1025 999 974 964 975 1000 1029 1052 1059 1047 1027 1009 994 981 983 1002 1024 1027 1011 992 974 947 913 887 878 880 884 887 894 905 921 944 973 999 1016
1057 1016 1027 1039 1055 1070 1078 1068 1037 992 949 916 887 859 838 831 831 831 837 855 880 893 895 902 931 975 1011 1018 998 975 979 1016 1062 1092 1106 1119 1136 1150 1155 1160 1170 1175
1052 1175 1160 1123 1083 1063 1068 1081 1082 1069 1057 1057 1066 1069 1064 1050 1025 994 970 968 984 998 1003 1013 1036 1065 1078 1072 1059 1053 1057 1059 1045 1015 985 968 960 948 933 938 972 1011 1030
1047 1030 1024 1011 1006 1011 1024 1050 1085 1115 1123 1107 1080 1063 1060 1056 1034 995 961 949 951 956 963 981 1005 1021 1017 991 952 917 907 933 975 1009 1028 1037 1034 1010 971 946 954 982 1008
1042 1008 1025 1036 1041 1036 1029 1032 1048 1061 1055 1028 994 970 965 974 984 988 985 982 985 996 1006 1003 987 972 981 1015 1049 1059 1044 1020 1001 988 980 972 960 945 936 937 939 931 915 908 921 947
1037I47K9K5K3K3K1J3jqnORJrj6j5mJ7L0J6j0k5j5nrj8j4omnOJ9K3J2L%lrj0prj8k1j5mMO
1031I68LjjOQlj6j6kOLJJ2K5L0K4J8J4J3J1J1Omj6k1j4%J4J7J0J%MPNRJ5J6J1Nkj1k3l2l8
1026A073m6n3m6j9J1K7L4M1M6L8J5oqJMok1k9k5j8j7k1j7nJ0J9K2K0J0%mjnj4j5lJ1Rnj2r
1020I86kQK1L0K6J4Jpj0oLRPNJ5K6J9kk6l8m0l0j6j3k7l2j0K6L7J7m%J1J0KQK0K2Oqj3pjk
1015A035j2j9j0J1J7Kj5j3KOlokjmJJ5K7K6K3K3J7ol4m1k1RK8K4Oj1j0%Nkj3k6l3l6k9pK5
1010I48M6M6K9Qk%%oqKJ5J6Kj1j8k2k9l8l8k8j5lJLRJ6J6QPK0L1J6j8l9l2j6j3k0j7lJ0J6
1005H89K0K3J9J4RMkrqlMQJ3J1PPJ5J5kk1k2pOOM%j0k4j9%J4RNJ7L2K2ok5j9lONjj5k6k0O
999I48L1L7K1Mrj3j2mJ1K3K5J3rl2l7k5q%%OK1K7J7krlLPQNkj2qQJ8Qj3k1j0KNQK0L2L0J2
$$ plain form
1037 947 976 1001 1024 1047 1068 1081 1080 1072 1067 1073 1082 1083 1074 1058 1043 1039 1056 1086 1102 1092 1067 1052 1047 1038 1020 1006 1000 996 991 997 1016 1039 1051 1054 1054 1051 1042 1032 1025 1016 998 977 962 958 962 968
1031 968 971 970 969 975 983 980 964 948 946 952 955 956 968 993 1023 1047 1065 1079 1092 1103 1114 1120 1116 1100 1079 1065 1065 1079 1096 1106 1107 1107 1111 1118 1123 1132 1147 1163 1174 1179 1177 1166 1143 1111 1073
1026 1073 1027 974 928 909 920 947 981 1022 1068 1106 1121 1115 1107 1108 1112 1106 1085 1056 1031 1013 996 975 958 953 963 982 1004 1024 1034 1034 1030 1029 1024 1010 995 992 1003 1012 1007 995 986
1020 986 984 992 1013 1043 1069 1083 1084 1077 1067 1061 1064 1073 1080 1085 1100 1126 1145 1143 1117 1079 1039 1009 993 980 953 921 911 937 974 991 987 987 998 1008 1010 1018 1038 1060 1066 1058 1045 1038 1037 1035
1015 1035 1023 1004 994 1005 1022 1024 1009 996 998 1004 1001 995 993 992 988 989 1004 1031 1057 1080 1103 1120 1114 1080 1039 1018 1027 1055 1079 1085 1074 1064 1064 1069 1067 1054 1028 995 959 930 923 948
1010 948 994 1040 1069 1077 1075 1075 1075 1069 1061 1063 1078 1094 1096 1085 1067 1045 1016 978 940 912 897 894 895 898 907 923 939 947 954 974 1005 1021 1003 964 932 916 903 883 866 863 873 889
1005 889 909 932 951 965 974 978 976 967 959 956 960 968 981 992 999 1006 1021 1036 1034 1013 991 984 990 996 1000 1000 990 966 947 947 961 970 975 992 1024 1046 1040 1015 996 993 999 1004 1003 988 962 942 948
999 948 979 1016 1037 1041 1032 1019 1007 1003 1014 1037 1062 1075 1066 1034 997 972 964 964 964 970 991 1018 1035 1033 1024 1021 1024 1031 1039 1044 1042 1030 1022 1030 1048 1056 1043 1022 1012 1014 1019 1027 1047 1079 1109 1121
993A121rk2k4j5JLj3l7m6l4j3NJ9K7K4PpnOLk0m0l9k0JJ6K2K4K2J8J9J8J0lj4j8j4oOJ8K1
988A012J3K%LOJkjM%rj3oK%j2j4%J6J6Jrn%mroLMnj1JK0L2L1K3K3K8K7Mk7m3l2pMJJMLoj3
982A051nLLOJ6K5J6j0l1l6k9k4j4%Mrk8k9pK5M4M0K0ok3k9k2rMJ5J3ok9l6j9QJ5lj7pK4M3
977I47L7J4rj9k2j8j2mmqq%J2J8K3K2J9Opj3kK1L7L3jm7o7m7rRLmMRkj0OL9N2L2Onpj4k6l3
971I51k8j4RL0L4J4j0j3kKqj6rMJ4J9K0J3kk0l4m2l0lK3K3LoQK6K3RRK4L3K6J2Kqj7k0j0n
966A034j4l3l9k6nRO%KJ4K0Rj1k3j7nLPJ2J4J0Mnj5k9m1l4j1J5K7K5J8J2Lrj3JK9M8M5J7j7
961A037l7l4j1QJ1JlOK2K7K6K3J5jj2j0LQ%nJJ4J9J2pk3k5rNlk5l7k4jK0L7M4K4k3o5o4k8
956I16PK2J9Pj4l2l2j2NMkMJ9K7K6K3K5L3M2M1K3pk4j6LKk3m6m3j6J0J9J2LRK2K6J0j2k0j6
$$ plain form
993 1121 1112 1090 1066 1051 1052 1055 1042 1005 959 925 912 917 936 963 987 994 987 982 988 991 971 931 892 872 873 889 911 935 957 975 994 1012 1022 1019 1005 987 973 967 973 991 1012
988 1012 1025 1027 1027 1030 1036 1037 1035 1034 1038 1038 1029 1016 1010 1012 1012 1000 986 986 1002 1018 1019 1010 1005 1005 1001 992 986 989 993 988 977 978 998 1030 1061 1084 1107 1135 1162 1166 1139 1096 1064 1057 1061 1062 1063 1067 1070 1064 1051
982 1051 1046 1049 1052 1058 1074 1099 1115 1105 1074 1038 1009 985 971 971 975 966 938 909 902 927 971 1011 1031 1025 1002 973 951 942 946 961 974 968 939 903 884 892 907 904 887 880 904 947
977 947 984 998 989 970 948 930 918 914 910 902 894 894 906 924 947 969 988 994 987 974 972 993 1030 1063 1062 1015 948 901 892 901 904 900 904 913 911 901 907 946 998 1030 1036 1031 1024 1010 984 951
971 951 923 909 918 948 982 996 986 973 971 973 965 949 940 944 958 977 997 1010 1008 988 954 912 882 879 902 925 928 922 930 956 979 988 997 1021 1054 1080 1092 1094 1086 1069 1049 1039 1034
966 1034 1020 987 948 922 917 926 932 932 934 948 968 977 966 943 926 921 924 931 943 957 967 971 966 951 922 881 847 836 851 878 903 921 933 936 927 914 915 944 992 1037 1054 1037
961 1037 1000 966 955 963 974 975 972 978 1000 1027 1053 1076 1091 1090 1078 1068 1071 1079 1079 1074 1075 1089 1108 1120 1113 1090 1065 1056 1061 1058 1033 996 972 971 991 1028 1072 1096 1073 1008 944 916
956 916 923 945 964 971 957 925 893 881 886 890 888 892 911 938 964 987 1012 1045 1087 1128 1151 1144 1120 1104 1107 1109 1086 1040 997 981 991 1010 1022 1025 1034 1056 1082 1092 1080 1060 1044
951A044j3j6j5qKJ0J7K5K8K2J4Mmj3j5j3j3j7qJ3K7J1k1m4m6l5j9NK8K9Jk8l1pJ5K1J3RJ4
946I86J6Qrk4k9k2qPK2K2J0mjJ8K9K5J5J0Nj1k3k2qJMJ5L1L7K5Nnj1j6k2k0qJ5L4L5J0k1k6
941A095nJ1%j5j0Jnk4k4OL9M8L4J5kk2m0m7k9OL4L5Rj7j7LJ8J2qk1k1j0MJ2OloljmlLJ0J2
936A076J0J2J7J8J4Jj8k9k0NK0J5ok7l6l0j1J2K7K5J5RQMok5m7n0k4J4L5K8J7K1K9J7j0k2
931A088j4lpj8k0j6j4k0k1lK5M0K9NjJ2K1Lk1k5j5j5k2j8%RKpooj3rJ3K9J7rj3%Onj7qJ0K5
926I88L1L0K4J5J3J9K3Qj4k1kK3K4ol8l9oK7L2J6lj0qlJnk1l3k6j4j0j3pJ4K9K2Kj7k5j9m
921I97RMj2j3PK4J3rj3JOj2l0k8j7j0qNK6L5K2%j2pRK6K8J8Pjrk4l7l0pJ1J6J7K9M6M8K3n
915A143k2k5k8l1l0k0j1mMJ2J5J1J3K8M3M0K0OPJ3J4J1RKj6l3l6k1o%%jpk1l3l6k9j8JK2M2
$$ plain form
951 1044 1031 1015 1000 992 994 1004 1021 1046 1074 1096 1110 1114 1110 1097 1082 1069 1056 1039 1031 1044 1071 1082 1061 1017 971 936 917 922 950 979 980 952 921 914 929 950 963 972 986
946 986 1002 1010 1001 977 948 926 918 925 947 969 979 975 974 992 1021 1046 1061 1071 1076 1065 1042 1020 1012 1013 1017 1032 1063 1100 1125 1130 1125 1114 1098 1076 1056 1048 1063 1097 1132 1142 1121 1095
941 1095 1090 1101 1101 1086 1076 1077 1072 1048 1024 1030 1069 1117 1151 1166 1164 1142 1102 1055 1026 1032 1066 1101 1110 1093 1076 1079 1097 1109 1101 1080 1059 1049 1053 1065 1071 1068 1062 1059 1058 1054 1051 1054 1064 1076
936 1076 1086 1098 1115 1133 1147 1148 1130 1101 1081 1086 1106 1121 1115 1088 1052 1022 1011 1023 1050 1075 1090 1099 1107 1111 1105 1080 1033 983 959 973 1008 1036 1053 1074 1103 1120 1110 1088
931 1088 1074 1071 1064 1046 1026 1010 996 976 955 952 977 1017 1046 1051 1050 1062 1083 1086 1065 1040 1025 1010 988 970 970 979 981 974 968 962 949 940 953 982 999 990 977 977 983 978 961 953 963 988
926 988 1019 1049 1073 1088 1101 1120 1143 1151 1137 1116 1114 1137 1161 1155 1117 1078 1072 1099 1131 1147 1144 1134 1126 1123 1124 1119 1098 1065 1039 1025 1015 1002 995 1009 1038 1060 1062 1045 1020 1001 997
921 997 1006 1010 998 985 992 1016 1029 1020 1007 1008 1014 1002 972 944 927 917 909 914 940 975 997 997 985 978 987 1013 1041 1059 1066 1065 1056 1032 995 965 958 969 985 1002 1031 1077 1125 1148 1143
915 1143 1121 1096 1068 1037 1007 987 976 972 976 988 1003 1014 1027 1055 1098 1138 1158 1164 1171 1184 1198 1209 1218 1220 1204 1171 1135 1114 1108 1108 1108 1107 1100 1079 1046 1010 981 963 964 986 1028
910A028N1M4K6QmmMJ3J4Opj5j0PJ9Rj6k9k1mONJ1K3J9pl1k8kK2J7j0l2l5j7NJ2Kj5k2j1PJ6
905A054J3Nnj2j7j3lORJ1J8K5K6J7QQJ2J2jk7m6l7mK6L0J5J1J6J0j3k2%K6K0j6m4l5qJ5K3
900A113J7OJJ2L1L7K4RMRK3L5L8K5MkQJ6J3QJ1J9K6L8N7P0O4M7K3ql6m4k5njnJJ5K5L0L6M2
895A811L9L9N0O4O2M9L8L3J8mj9k4l5n2n4k9QM5P7R9R5O8M6L7K0j6m6n0l5k8l2m0m5m6l2j
891B110K2K2J1J0J1j0m6o0m4k3k4m4o7p9p3n3k3lPJ3J3ol4m7l4j4j2j9j5LRpl1m7m4l2j8j3
886A309k0l4m4m7l7j8lKK%qk3k8j1J4K3Qj0rjOJ2J8J1j2l3l2j2LJ2K0K3QrlK0L3J8%jOOKM
881A165QNKJ3K2Pl1n4n1l1j8j0KJ3J5J1J0J8K5K2J1jm%LjJJ4K9K6Lj2pJlj6j6oJqj2nJ1J9
875A171J6OknlJpk0k4rJ2K3K0J6J6J7J1JmMJ9K1Mj8k3pJ1Rj3l6m0k8rOJ1Qkqj0njjlLJ3J8
$$ plain form
910 1028 1079 1123 1149 1157 1153 1149 1153 1166 1180 1186 1179 1164 1154 1161 1180 1189 1173 1144 1123 1119 1125 1130 1141 1164 1183 1176 1145 1117 1115 1137 1154 1144 1112 1077 1060 1065 1077 1079 1064 1042 1031 1038 1054
905 1054 1067 1072 1067 1055 1038 1025 1022 1028 1037 1048 1066 1091 1117 1134 1142 1150 1162 1174 1173 1146 1100 1063 1059 1085 1115 1130 1141 1157 1167 1154 1132 1132 1158 1178 1162 1118 1083 1075 1090 1113
900 1113 1130 1136 1137 1149 1180 1217 1241 1250 1254 1263 1286 1321 1359 1384 1388 1386 1394 1410 1423 1431 1442 1461 1487 1525 1582 1652 1716 1763 1786 1778 1742 1698 1673 1668 1667 1662 1663 1678 1703 1733 1769 1811
895 1811 1850 1889 1939 2003 2065 2114 2152 2185 2203 2199 2180 2156 2121 2069 2015 1986 1994 2039 2116 2215 2310 2378 2424 2461 2481 2465 2419 2369 2334 2306 2274 2234 2189 2143 2111 2110
891 2110 2132 2154 2165 2175 2186 2176 2130 2070 2026 2003 1979 1935 1868 1789 1716 1663 1640 1637 1644 1657 1670 1664 1630 1583 1549 1535 1523 1504 1489 1492 1501 1494 1463 1416 1372 1340 1322 1309
886 1309 1289 1255 1211 1164 1127 1109 1106 1108 1110 1110 1102 1079 1051 1040 1054 1077 1085 1075 1066 1065 1071 1083 1101 1112 1100 1067 1035 1023 1026 1038 1058 1081 1089 1080 1077 1097 1130 1148 1148 1147 1153 1159 1161 1165
881 1165 1173 1178 1180 1193 1215 1222 1191 1137 1086 1055 1037 1027 1029 1042 1057 1068 1078 1096 1121 1143 1154 1153 1149 1149 1152 1151 1152 1166 1195 1221 1224 1212 1205 1206 1203 1187 1171 1165 1166 1158 1146 1141 1152 1171
875 1171 1187 1193 1191 1186 1183 1184 1177 1157 1133 1124 1136 1159 1179 1195 1211 1228 1239 1240 1236 1240 1259 1280 1284 1266 1243 1236 1247 1256 1243 1207 1167 1139 1130 1136 1147 1155 1153 1145 1135 1130 1129 1128 1125 1128 1141 1159
870A159Prj0MJ2Kj7k5k3j6lK1M0L8K3J2J0Oj1k4k3j7j3j1jJ4K8L4K9Qj7k8k0rj1k5l4k7oK0
865A087L7L5K3J6J4Jk2l3k0KQmj7j6pNJ3J6J3J3J7J7J1PQOoj5rLKnKK6L9L3K4K5K1Kj7k1j5
859A319j4j5nJ3J7NrrkJmqlNQKopjMknLJ5J7J5J9K5J6nj6kK6M0L6K6J6%k1l3k3KK4K5Nj6k0
854A458jJ8J9QMJ1J8J5RPJomJ6L4K8RmkNOJ2K2K8K0Omj1j5j2qqj4j2PK7K8Qj4k1k0j7oRJ6
848A670PolK3M9N6M5K9J9J0ok0j1K0M9N2L5J6LjLK2M6N5M9L9M4N6O5O6N8M6L6L9N6P5Q6Q5
844B962P0M0J0JJ9M7O0N7N1N4O1P1Q2R6J10J20J25J27J25J24J27J44J71J97K17K28K49K89
840F034L44L90M24M49M75M95N15N47N88O14N89N14M20L51L30L56M11M75N35N92O47O93P40
837A7528Q05Q99J007J099J163J200J224J261J355J539J817K170K574L019L500M030M630N291
$$ plain form
870 1159 1166 1157 1147 1151 1163 1165 1148 1123 1100 1084 1081 1102 1142 1180 1203 1215 1225 1231 1220 1196 1173 1156 1143 1132 1131 1145 1173 1207 1236 1244 1227 1199 1179 1170 1159 1134 1100 1073 1067 1087
865 1087 1124 1159 1182 1198 1212 1213 1191 1158 1138 1140 1148 1144 1127 1111 1104 1109 1122 1138 1151 1164 1181 1198 1209 1216 1224 1230 1224 1209 1200 1203 1205 1200 1202 1228 1267 1300 1324 1349 1370 1372 1355 1334 1319
859 1319 1305 1290 1285 1298 1315 1320 1311 1302 1300 1301 1297 1289 1286 1291 1299 1301 1295 1288 1287 1291 1289 1284 1287 1302 1319 1334 1353 1378 1394 1389 1373 1371 1397 1437 1473 1499 1515 1515 1494 1461 1438 1440 1464 1489 1494 1478 1458
854 1458 1457 1475 1494 1502 1506 1517 1535 1550 1559 1566 1567 1561 1557 1573 1607 1635 1644 1640 1638 1643 1649 1661 1683 1711 1731 1737 1733 1722 1707 1695 1687 1679 1665 1653 1660 1687 1715 1723 1709 1688 1668 1651 1645 1654 1670
848 1670 1677 1671 1668 1691 1740 1796 1841 1870 1889 1899 1893 1873 1862 1882 1931 1983 2018 2034 2037 2036 2039 2061 2107 2162 2211 2250 2294 2350 2415 2481 2539 2585 2621 2660 2716 2791 2877 2962
844 2962 3032 3072 3082 3083 3102 3149 3209 3266 3317 3371 3432 3503 3585 3681 3791 3911 4036 4163 4288 4412 4539 4683 4854 5051 5268 5496 5745 6034
840 6034 6378 6768 7192 7641 8116 8611 9126 9673 10261 10875 11464 11978 12398 12749 13079 13435 13846 14321 14856 15448 16095 16788 17528
837 17528 18333 19232 20239 21338 22501 23701 24925 26186 27541 29080 30897 33067 35641 38660 42160 46190 50820 56111
835E6111N973O651P302P780P745O833N051K921J178K57P6K74N87R96J620K557L805N267O825
833A29809Q419J0002J1281J1578J0154O944K928m26k222k643k465k211j842j073K69K154M419
831A85075O849R288J1635J3526J4022J2012P305J270l934o958q064q406q781r141r030q177
829A98491o642m686k562m03J757L694M743M093J549k005n135o922p516p668p892q147q130
827A46619p661o788n661m420l145j868p06K7o9j112k695m120m930n196n292n483n748n927
824G5825n912n709n383m988m563m118l655l184k737k355k043j785j561j374j240j151j087
822B2980j024r62r15q80q42p88p27o74o40o26o16n92n48m96m60m44m36m14l81l53l40l32l14
820I176k80k52k46k59k63k45k16k03k09k06j85j62j52j49j38j21j11j15j22j23j13j01r7j05
$$ plain form
835 56111 62084 68735 76037 83817 91562 98395 103446 106367 107545 107802 107878 108152 108739 109735 111355 113912 117717 122984 129809
833 129809 138228 148230 159511 171089 181243 188187 191115 190689 188467 185824 183359 181148 179306 178233 178502 180656 185075
831 185075 191924 201212 212847 226373 240395 252407 259712 260982 257048 250090 242026 233620 224839 215698 206668 198491
829 198491 191849 187163 184601 184198 185955 189649 194392 198485 200034 198029 192894 185972 178456 170788 162896 154749 146619
827 146619 138958 132170 126509 122089 118944 117076 116370 116397 116328 115216 112521 108401 103471 98275 92983 87500 81752 75825
824 75825 69913 64204 58821 53833 49270 45152 41497 38313 35576 33221 31178 29393 27832 26458 25218 24067 22980
822 22980 21956 20994 20079 19199 18357 17569 16842 16168 15528 14902 14286 13694 13146 12650 12190 11746 11310 10896 10515 10162 9822 9490 9176
820 9176 8896 8644 8398 8139 7876 7631 7415 7212 7003 6797 6612 6450 6298 6149 6011 5890 5779 5664 5542 5419 5306 5205 5108 5003
817E003j19j22j13j02r9r6q3o3n1m9m7l8l0k7k4j5j4l4o6q3p4m9l9m8o5o9n5k7lMlj6k2j7
813C245j7k3l2l3l1l6m7m5k3OJ9Nk1m0m4m1m1m7m8l8k3j6k0k3k0j7j8k2k2j9j9k7l2l6l5l6
808B283l8m2m3l8l1l3l8l2qJ1Lj6j1J3K3Qj0j1rj9k7j8jlk4l0j1J5K7K7K7K5J7%j8l4m1l4
803A859k3k3l5m2k8oNQQOkj3j5rrj8k3j6j3j9k7k2pKlrrnjMRPJn%J4K6K9K0Nrj6j6j1j4k6
798A529m1m6m0k9j8j2j2k1l0l5l0j7kJ1J7J6J5J9K3J9Nrj0%J3J8K1K1K5L2L2J5j2l7l9k4l
793A364OJj1j8j3kNJoj0j0j9k6j9LJ9J4Koj3k7l9l4nK9M1K6N%J4K3J4j4l5m0l6k7j2MJ0Lk
788A160RK0Rj1j6%J5Nj8l1l2l1l1k8j5OK7L5K9J9J9K4K2Mj7k1j0J1K8K9J1j5k8j7LJ1RLqk6
783A153m2m0k0kOJ1K2K9K0lk7m2n1n2m4l2k1j0JJ1J5J7K2K9L3K6J0nnNJ0ol2m3k5J4M8O2M9
$$ plain form
817 5003 4884 4762 4649 4547 4448 4352 4269 4206 4155 4106 4059 4021 3991 3964 3940 3925 3911 3877 3811 3728 3654 3605 3566 3518 3453 3384 3329 3302 3299 3303 3300 3284 3262 3245
813 3245 3228 3205 3173 3140 3109 3073 3026 2981 2958 2964 2983 2988 2967 2927 2883 2842 2801 2754 2706 2668 2645 2629 2609 2586 2566 2549 2531 2509 2487 2468 2449 2422 2390 2354 2319 2283
808 2283 2245 2203 2160 2122 2091 2058 2020 1988 1980 1991 1994 1978 1967 1980 2003 2011 2001 1990 1981 1962 1935 1917 1916 1913 1889 1859 1848 1863 1890 1917 1944 1969 1986 1986 1968 1934 1893 1859
803 1859 1836 1813 1778 1736 1708 1702 1707 1715 1723 1729 1727 1714 1699 1690 1681 1663 1640 1624 1611 1592 1565 1543 1536 1538 1535 1526 1517 1512 1511 1515 1524 1531 1532 1527 1527 1541 1567 1596 1616 1621 1612 1596 1580 1569 1555 1529
798 1529 1488 1442 1402 1373 1355 1343 1331 1310 1280 1245 1215 1198 1196 1207 1224 1240 1255 1274 1297 1316 1321 1312 1302 1302 1315 1333 1354 1375 1400 1432 1464 1479 1467 1430 1391 1367 1364
793 1364 1370 1371 1360 1342 1329 1327 1332 1333 1327 1317 1307 1288 1262 1243 1246 1265 1279 1281 1275 1262 1235 1196 1162 1157 1186 1227 1253 1258 1258 1272 1295 1309 1295 1260 1220 1184 1157 1145 1149 1159 1162 1160
788 1160 1169 1189 1198 1187 1171 1171 1186 1191 1173 1142 1110 1079 1048 1020 1005 1011 1038 1073 1102 1121 1140 1164 1186 1190 1173 1152 1142 1153 1181 1210 1221 1206 1178 1161 1164 1175 1184 1187 1179 1153
783 1153 1111 1071 1051 1049 1055 1066 1088 1117 1137 1134 1107 1065 1014 962 918 886 865 855 856 867 882 899 921 950 983 1009 1019 1014 1009 1014 1024 1018 986 943 918 932 980 1042 1091
779A091K4Jonlrk0k8k5j4k%mqqmmjMJ5K8M0M3L2J1rj6j8j6qJ5L4L4J3kKJ1Lj2k1j3kQJ7K4
773A192K3RnoOK3L5M2L8K7RlmJNJ6L7N7N9L3%j8j6j3j3nJ2K3K3K0K3L2L4L3L7N0O1O3M8K1
768B009koMNj1k3j4J3L7N2O4P2O7N0L3J7kk8n0n7m8l5k8l0l9m8m3k8qRK4L8M1L6K2Jk5n0o2
763A957n7m7m5m9n5n7m7k9j1%PJ3Rj2l3l4j9j3k8m3l5j9j6k7l9m2l8l3k2oQJ8J5kk5l9l7k9
759A039k8k3nK0K1%k1k2j7j7j9mJ8K5QplJ5J8jj6pJ0Rj0k1j2MPNNMmmJ0K9K4jj9j3jkj4k0
753I60j3opj1j1njmj3j7rJ0K3K1ROJ8L1L1J0j1j9j1m%MJ3K2J6Nnk0l8m3k2PQj7l0pK3K7Pp
748I20pmm%J5K9L1K3Qj0k1k1j4j1j3qPJ5QjjRJ3QkrrjJ0J4Rkj1j5qQK7L1J9jj3j5pQK0K4K1
742A069K2L2L3J0k2l0j0J3J4jj1j4j7j7pJ3K6K1Pmmlrk0l3l4k1lKj0k0j4lok0l3l2k1j0mk
$$ plain form
779 1091 1115 1116 1110 1105 1102 1093 1073 1045 1020 1006 1004 1004 1000 992 984 980 976 975 979 994 1022 1062 1105 1137 1148 1139 1123 1105 1089 1081 1096 1130 1164 1177 1175 1177 1188 1191 1179 1158 1145 1143 1151 1168 1192
773 1192 1215 1224 1219 1213 1219 1242 1277 1319 1357 1384 1393 1390 1386 1387 1392 1408 1445 1502 1561 1594 1594 1576 1560 1547 1534 1529 1541 1564 1587 1607 1630 1662 1696 1729 1766 1816 1877 1940 1988 2009
768 2009 2007 2001 2005 2010 1999 1976 1962 1975 2012 2064 2128 2200 2267 2317 2350 2367 2365 2337 2287 2230 2182 2147 2119 2089 2050 2002 1959 1931 1923 1932 1956 1994 2035 2071 2093 2094 2069 2019 1957
763 1957 1900 1853 1808 1759 1704 1647 1600 1571 1560 1560 1567 1580 1589 1577 1544 1510 1491 1478 1450 1407 1372 1353 1337 1310 1271 1229 1191 1158 1136 1130 1138 1156 1171 1169 1144 1105 1068 1039
759 1039 1011 988 983 1003 1024 1024 1003 981 964 947 928 924 942 967 975 968 965 980 998 997 981 974 984 993 983 962 950 954 961 966 971 975 971 967 977 1006 1030 1029 1010 997 996 994 980 960
753 960 947 941 934 923 912 907 906 902 889 872 863 873 896 917 926 932 950 981 1012 1022 1011 992 981 977 977 981 994 1016 1032 1037 1032 1012 974 931 909 916 924 907 877 870 893 920 927 920
748 920 913 909 905 905 920 949 980 1003 1011 1001 980 959 945 934 921 913 920 935 943 942 941 950 963 971 969 960 951 950 960 974 983 981 970 955 947 955 982 1013 1032 1031 1018 1003 996 1004 1024 1048 1069
742 1069 1091 1123 1156 1166 1144 1114 1104 1117 1131 1130 1119 1105 1088 1071 1064 1077 1103 1124 1131 1127 1123 1120 1111 1091 1058 1024 1003 1000 1002 992 972 958 955 949 929 896 864 843 833 829 827
737H27JJ3K6K8J2or%QONJ0K3L1K5Pj2j6KJ9J8%j0kOJrj0orrmJj0k5k2%J5Plmjmj0j0nnnjO
731H90LlkK%rj4j0pkRK3K5Nj4j2J2L5L6K5J2MmokPJ0J2J4J9J3ol3m6l9k2pLJ1K0K3J5P%%%
725I97nj2j2jJ5K5J7LjJ0J5Ono%LKQJ5Jl4n5m1j3mj6k3j6omjORLLJ4J9Oj1j1LJ1LqqJPPOK
719I24j%KM%oj4j7j4j2j4j9j9j2j0j4j4KK4K7Qj3j8j2j1j2nOPlj1jK3M1M0J8j2l0k2LK9L8
714H80L1J6PPJ3K3K9K2Q%%ok6n0n3k9KK4L3K6Mk0k3kJ8J4JOK8L5Ql4n3m0rJ3J6RRJ8K0PkJ0
709I90K9K7%k5k8j5prj0pjNQQQJ1J6J0mj3j4j4j3oNOkjJ1J9J0PJ7K1lk6j6J1J6oj7jJ8K0J6
703A051J7J3lj5j1klmjlj3j7oPPLOMj7m6n4m1k8k1rJ9M7N6N0L3J3pk0k3k1j7oMkj8k5qJ3K1
698I23K2L3M7M3J8lmMkj8k7k0j8k8l3j6J0K5K1J3Opk2k4j4qj1j5pLM%OK3L9M8M1J7j0k4k1
$$ plain form
737 827 828 841 867 895 907 901 892 892 900 906 911 921 944 975 1000 1007 995 979 981 1000 1018 1018 1008 1006 1012 1013 1004 994 988 979 970 966 967 957 932 910 910 925 932 929 925 924 920 910 900 895 890 885 884 890
731 890 893 890 888 890 890 881 867 857 850 848 857 880 905 910 896 884 896 931 967 992 1004 1008 1004 998 996 1003 1013 1025 1039 1058 1071 1065 1032 986 947 925 918 921 932 952 975 990 997 997 997 997
725 997 992 980 968 967 982 1007 1024 1027 1026 1036 1051 1057 1052 1046 1046 1049 1051 1059 1074 1075 1041 986 945 932 928 912 889 873 867 863 862 868 877 880 883 897 916 922 911 900 903 914 917 909 901 902 909 916 922 924
719 924 923 923 925 929 929 923 909 892 878 866 852 833 814 802 792 778 764 766 790 817 825 812 794 782 771 759 754 760 767 764 753 752 775 816 856 874 862 832 810 813 842 880
714 880 911 927 934 941 954 977 1006 1028 1036 1036 1036 1030 1004 954 901 872 874 898 931 957 961 941 918 916 934 948 949 955 983 1018 1026 992 939 899 890 903 919 928 937 955 975 982 980 990
709 990 1019 1046 1046 1021 993 978 971 962 952 945 944 949 957 965 973 984 1000 1010 1006 993 979 965 952 946 951 957 955 954 965 984 994 1001 1018 1039 1036 1010 994 1005 1021 1015 998 997 1015 1035 1051
703 1051 1068 1081 1078 1063 1052 1050 1047 1043 1042 1039 1026 1009 1003 1010 1017 1020 1026 1030 1013 967 913 872 844 823 814 833 880 936 986 1019 1032 1025 1005 982 961 944 938 942 940 922 897 889 902 923
698 923 945 978 1025 1068 1086 1083 1079 1083 1081 1063 1036 1016 998 970 937 921 931 956 977 990 996 989 967 943 929 921 910 895 888 891 895 895 901 924 963 1011 1052 1069 1059 1035 1014
693A014j6k0j6RL1J8k3n4n8m9l4rJ8K3Jj2J0M7N7M0K2K0K0Pj6k9k1oLKNK0L8L5Rj7k4j8j5
688A012j7j4mOJ8K8L3K5PorkRJ1nl4n1m5k1qonLJ1J0LKORRLrk0j4JJ1LrmJ5L0K4Oj3k5k7j9
682I28j1plMJ2J1lj9k3j7oMJ5K8L6L6L1K1Qmj2j7k2l0l5k7j1NJ2J6K0K0Pj1k0pJ8L4L5J9n
677A030k9m4n0m5l1j8mJ3L4M6L9J4pqLNj1k6k4nJ0RJKJ5K4J5ok2j8mJ0J5J7J4RNjj0k2l2k9
672H84j2RK9L7L2K2J1PMOJ1J4Pj4l5m3l6j8OK4K6J6J4K4L1K0%j0j1k0l0j7J2K4Jl4m8l9k4
668H80pJ1K3K0J6K4L8L6J2j5k9k7j7lPJ1QOPJ0J8K8L0J7kj2j0rj4k6l8m5l7j4J3K5K0J1J0
663I76J8K5K1Oj0rJ1K8K2Jj1nlj6k8k0LJ3Kj8k9k9k7k7k6j5LJ3OlMK3L0J7KJJ1J2Jj4k7l7
658H95l7k1kOKKJ2K0J8Lrj7j8j8j3MK2K8Qj3j2J3L0K7J2Kmj9k8j9k%j1j3KJ6J6J1J2Qrk5j9
$$ plain form
693 1014 998 978 962 971 1002 1020 997 943 885 836 802 793 811 834 835 823 833 880 937 977 999 1019 1039 1046 1030 1001 980 974 977 979 984 1004 1042 1077 1086 1069 1045 1027 1012
688 1012 995 981 977 983 1001 1029 1062 1087 1094 1088 1079 1077 1086 1097 1092 1058 1007 962 941 933 927 922 925 936 946 949 951 957 966 975 978 969 949 935 936 947 950 941 937 952 982 1006 1012 999 974 947 928
682 928 917 910 907 911 923 934 931 912 889 872 866 870 885 913 949 985 1016 1037 1045 1041 1029 1012 990 960 925 898 887 892 904 920 940 960 967 956 936 929 947 981 1016 1035 1030
677 1030 1001 957 907 862 831 813 809 822 856 902 941 955 948 940 943 948 937 911 887 882 892 901 902 904 919 943 958 952 930 912 908 918 933 950 964 973 978 977 967 945 913 884
672 884 872 881 910 947 979 1001 1012 1019 1023 1029 1040 1054 1061 1047 1012 969 933 915 921 945 971 987 1001 1025 1056 1076 1076 1066 1055 1035 1005 988 1000 1024 1025 991 943 904 880
668 880 873 884 907 927 943 967 1005 1041 1053 1038 1009 982 965 962 969 980 988 994 1001 1011 1029 1057 1087 1104 1102 1090 1080 1071 1057 1031 993 948 911 897 910 935 955 966 976
663 976 994 1019 1040 1046 1036 1027 1038 1066 1088 1089 1078 1073 1070 1054 1026 1006 1009 1022 1024 1006 977 948 921 894 868 853 856 869 875 872 876 899 929 946 948 949 960 972 973 959 932 895
658 895 858 837 835 841 843 845 857 877 895 898 889 872 854 836 823 827 849 877 885 872 860 873 903 930 942 944 940 921 893 874 872 872 861 848 850 866 882 893 905 913 904 879 860
652H60jOrk1pK1L3K0MKQOj%RJ1lj7j2PJ5PkkKNRJ6J3mk3k3qkrj5lJ5J9PkQK7L5K5J4J3J8J8
646A089Nj5l5m6m3k7j0orkJ6L2K8J2mroj%mj1k1l2l4k3%K6L9M0L2K8K4K3K5K0Pj1k5l2l8l4
641I68j7NJ8J6Mj0j9j7%K2L2K4J4Rok8l9k9j1olJ2L4L7J9Llpj8k7k7k1j9j3oLNQJ2J8K0J9
636I76J2Jj0k0k4k2j7j5j8k4j3J8M6M7K6J1J5K2J7Lrj9k5j8%J4Rlj2j8k4k3oJ6L0L2L2L5K9
631A071J5mj9k2j5KRjk1l1j9jJ3J4J4J6J8J6Mrj2kPPLLLkqnJok2k7j4KQJ1J3Rkj2j6k4m0m5
626H80k5J0L1L1K4K7L0K3Pqk1k7k6j5NK4L5L4L0K5J6ol3m1k7lJ3K3L1L0Pk3l6k6j5j0mJ1K4
621A025K0Moo%Kpk7n0n2l0jJ8L0L9L2Kl1l1KL3L8K4J3RJ0J5J4pl6l9jM4M6Rk5l3k6j8nQNk1
616I90m3l6j1QQJ%MQJ3J6K1K2K0J7J6J4Lk0k9rK4L1jl1l1j3j0k0j7MJ8J3MJ0K4K9J8Nkoj2
$$ plain form
652 860 859 865 856 835 828 849 882 902 906 908 916 922 921 921 930 941 938 921 909 916 931 938 936 934 936 941 950 966 979 975 952 929 921 919 910 895 892 907 926 933 931 939 966 1001 1026 1040 1053 1071 1089
646 1089 1094 1079 1044 998 955 928 918 912 903 901 917 949 977 989 985 976 970 969 969 965 954 933 901 867 844 844 870 909 949 981 1009 1033 1056 1081 1101 1108 1097 1072 1040 1002 968
641 968 951 956 974 990 994 984 965 948 948 970 1002 1026 1040 1049 1043 1015 976 947 936 930 927 939 973 1010 1029 1032 1029 1022 1004 977 950 929 910 897 891 894 899 907 919 937 957 976
636 976 988 989 979 959 935 913 896 881 863 839 826 844 890 937 963 974 989 1011 1028 1031 1022 1003 978 960 960 974 983 980 968 950 926 903 897 913 943 975 1007 1042 1071
631 1071 1086 1082 1063 1041 1026 1028 1037 1036 1015 984 965 964 977 991 1005 1021 1039 1055 1059 1050 1038 1036 1043 1050 1053 1056 1059 1057 1049 1044 1045 1039 1017 990 976 978 986 997 1010 1019 1017 1005 989 965 925 880
626 880 855 865 896 927 951 978 1008 1031 1038 1030 1009 982 956 941 946 970 1005 1039 1069 1094 1110 1104 1071 1030 1003 1000 1013 1036 1067 1097 1104 1081 1045 1019 1004 994 990 1001 1025
621 1025 1045 1049 1043 1037 1037 1039 1032 1005 955 903 873 872 890 920 959 991 993 962 931 933 966 1004 1028 1041 1050 1060 1075 1089 1082 1046 1007 1006 1050 1096 1105 1080 1047 1021 1003 998 1006 1011 990
616 990 947 911 900 908 916 917 917 921 929 942 958 979 1001 1021 1038 1054 1068 1071 1051 1022 1013 1037 1068 1067 1036 1005 992 982 962 945 949 967 980 984 994 1018 1047 1065 1070 1068 1062 1050
611A050j7j4%J6K7K7K3J8Mj9l2k2rj8m2m7k0OPkKJ2Qpj1JJ0J1Nlj5k3j6JJ1OkjNPMOJ1J7K1
605I96K4J9PppQJ9Ok4m5l1KJ9QnlOM%J0K5K0nk3j6ljkNK2L0K7J3pk9l4k0mKLJ1J2j0m1m7k0
600I14J0J9K0K8L7L0Nk1l2k3kJ9J7rm1m3pL7N2K7qk3j4j%lKJ1J1M%KKLPJ5J2lj3LL0L7J9o
594A124j5oK%j1k0k4j9j1nMJ5K3K6K3K5L4M3M1K7J1nj7k4j7LK5L5L2K9L3L3K2Nrj4k1l1l2
589A334k4j5j2rnok0l4l1oK7M7M5K9Lk5m5m9m4l6l7m2m2k5LK6L5L6M2M8M4L0K2J9Rj5l3k2
585A222QK3J3oj6j1JK3N2P2O7M9L7M6O3O1L9J4JjJ%jpj6k7k9k3j9k8m5n5n5m6l5k6k0j5pl
580A301lj1j0OJ8Ok2m0k9pRJ3J5K0J6Pk%RK0K5K2Qpj4j1nlJJ1K5L4L2J8mk2k3pJ1J4Mprrj6
574A384k9l6l2j9qkMNLlm%NMk%J2K7K8J2j0k4k5k4l0m0m1k6nRQ%pokoj0lJ6L2L3K4K1K0J3
$$ plain form
611 1050 1033 1019 1019 1035 1062 1089 1112 1130 1134 1115 1083 1061 1052 1034 992 945 925 931 938 936 938 950 958 951 940 941 951 962 967 964 949 926 910 911 922 928 926 925 930 937 941 947 958 975 996
605 996 1020 1039 1046 1039 1032 1040 1059 1065 1041 996 965 967 986 994 989 986 992 996 996 1006 1031 1051 1046 1023 1007 1004 1003 1001 1006 1028 1058 1085 1098 1091 1062 1028 1008 1004 1006 1009 1020 1032 1022 981 934 914
600 914 924 943 963 991 1028 1058 1063 1042 1010 987 985 1004 1021 1012 971 928 921 958 1010 1037 1029 1006 992 991 991 988 990 1001 1012 1016 1016 1018 1020 1023 1030 1045 1057 1054 1041 1044 1074 1111 1130 1124
594 1124 1109 1103 1105 1105 1094 1074 1050 1031 1020 1015 1019 1034 1057 1083 1106 1131 1165 1208 1249 1276 1287 1282 1265 1241 1224 1227 1252 1287 1319 1348 1381 1414 1436 1441 1432 1418 1397 1366 1334
589 1334 1310 1295 1283 1274 1269 1263 1243 1209 1178 1172 1199 1246 1291 1320 1323 1298 1253 1204 1160 1124 1087 1045 1003 978 981 1007 1042 1078 1120 1168 1212 1242 1264 1283 1292 1277 1244 1222
585 1222 1230 1253 1266 1260 1244 1233 1234 1257 1309 1381 1448 1497 1534 1580 1643 1704 1743 1757 1758 1757 1758 1758 1757 1750 1734 1707 1678 1655 1636 1608 1563 1508 1453 1407 1372 1346 1326 1311 1304 1301
580 1301 1298 1287 1277 1283 1301 1307 1285 1245 1216 1209 1218 1231 1246 1266 1282 1289 1287 1287 1296 1316 1341 1363 1371 1364 1350 1339 1334 1331 1332 1343 1368 1402 1434 1452 1448 1426 1403 1396 1407 1421 1425 1418 1409 1400 1384
574 1384 1355 1319 1287 1268 1260 1258 1262 1267 1270 1267 1263 1263 1268 1272 1270 1270 1282 1309 1337 1349 1339 1315 1290 1266 1236 1196 1155 1129 1124 1133 1141 1141 1134 1128 1126 1120 1110 1107 1123 1155 1188 1212 1233 1253 1266
569A266jj4j9j9k1k5k9k9j7QK9K9J2oj2j9k3qK4M5K8nk2j5prj7j8j4kJ5K0Lk0k0JJ2kk3k5
564A051lK1L3K8Mk1k3%K1J8KmKJ1K1L4L8K7Noork3l5l0rJ5K8J5j3l3l2k1k2l5l9k5KK9M8M9
559A113L5J8J3J2Oknoj8l3k5JK0J3J%NMJ0K6L7K7PJJ4K6K7J3j0l3l5j6kqj5PL7M0J0j2jJ6
554A318Rj5l0l2l6m5m1k0J0L6N3O2N3K9MnJQMrj5oRJ5RkokKKmj0oJ0K1Ok3l7j7J4K7J8Krj4
548A338rJ3L4K7nk9k1OK0J7J4J5J3kj5j3okKJ9L7M0K0%nLJ1J2RKmlJ4L5M2K4mk7l3k4mJ7K4
543A602J0j3k5j6QL0L8K8J2J1K8M1K5j0k4JM0N8M5K0JokPJ8K3K4K4L0L2K7J7QOLqk9m3m0k0
538A981PK9M6N7N5M5L4L9N0N4N0M4M0L7L9M7N6N3M6N1O4O0L1J2K7O0P4O3O2Q1J01J03R9J12
534C809J31J39J30J15J06J05J19J48J83K09K21K23K20K22K39K67K88K89K80K82K96L10L17
$$ plain form
569 1266 1265 1251 1232 1213 1192 1167 1138 1109 1092 1100 1129 1158 1170 1164 1152 1133 1110 1102 1126 1171 1199 1194 1172 1157 1150 1141 1124 1106 1092 1090 1105 1125 1128 1108 1088 1089 1101 1099 1076 1051
564 1051 1048 1069 1102 1130 1134 1113 1090 1090 1111 1129 1131 1127 1129 1140 1161 1195 1233 1260 1265 1259 1253 1244 1221 1186 1156 1147 1162 1190 1205 1192 1159 1127 1106 1084 1049 1010 985 987 1016 1064 1113
559 1113 1148 1166 1179 1191 1197 1195 1190 1184 1166 1133 1108 1109 1129 1142 1143 1143 1148 1152 1162 1188 1225 1252 1259 1260 1274 1300 1327 1340 1330 1297 1262 1246 1244 1236 1221 1228 1265 1305 1315 1303 1302 1318
554 1318 1327 1312 1282 1250 1214 1169 1128 1108 1118 1154 1207 1269 1322 1351 1355 1350 1351 1359 1363 1354 1339 1333 1342 1357 1366 1364 1358 1356 1358 1360 1356 1346 1340 1350 1371 1377 1354 1317 1300 1314 1341 1359 1361 1352 1338
548 1338 1329 1342 1376 1403 1398 1369 1348 1354 1374 1391 1405 1420 1433 1431 1416 1403 1397 1395 1397 1416 1453 1493 1513 1513 1508 1511 1522 1534 1543 1545 1541 1538 1552 1587 1629 1653 1649 1622 1589 1565 1561 1578 1602
543 1602 1612 1599 1574 1558 1566 1596 1634 1662 1674 1685 1713 1754 1779 1769 1745 1746 1786 1844 1889 1909 1910 1904 1902 1909 1927 1950 1974 1998 2028 2060 2087 2104 2112 2118 2121 2113 2084 2041 2001 1981
538 1981 1988 2017 2063 2120 2175 2220 2254 2293 2343 2397 2447 2491 2531 2568 2607 2654 2710 2763 2809 2860 2924 2984 3015 3027 3054 3114 3188 3251 3313 3394 3495 3598 3697 3809
534 3809 3940 4079 4209 4324 4430 4535 4654 4802 4985 5194 5415 5638 5858 6080 6319 6586 6874 7163 7443 7725 8021 8331 8648
531H648L35L74M21M58M76M81M91N17N59O09O66P36Q25R18J005J091J204J352J528J720J937
529B6351K174K418K657K900L151L389L573L667L650L496L170K658J991J242M91k11q41j388
526F4538j842k195k453k624k704k689k592k440k260k065j851j629j412j217j046q84p20n60
524C1355m24l23k35j28kJ21K21L13M19N40O66P96R43J114J308J517J743J998K297K647L042
522D9928L466L918M408M930N462N968O421O788P020P043O774O130N083L698K118N13r89k321
519A26358l452m378n109n653n997o139o111n961n711n363m941m491m050l627l225k865k549
517D6736k259j979j728j534j391j261j123r79q46p28o14m94l62k35j21j5J03K43L89N32O87
515C3021Q68J078J309J556J813K065K301K530K754K944L061L067K944K656K178J531P86K6
$$ plain form
531 8648 8983 9357 9778 10236 10712 11193 11684 12201 12760 13369 14035 14771 15596 16514 17519 18610 19814 21166 22694 24414 26351
529 26351 28525 30943 33600 36500 39651 43040 46613 50280 53930 57426 60596 63254 65245 66487 66978 66767 65926 64538
526 64538 62696 60501 58048 55424 52720 50031 47439 44999 42739 40674 38823 37194 35782 34565 33519 32635 31915 31355
524 31355 30931 30608 30373 30245 30243 30364 30585 30898 31317 31857 32523 33319 34262 35376 36684 38201 39944 41942 44239 46886 49928
522 49928 53394 57312 61720 66650 72112 78080 84501 91289 98309 105352 112126 118256 123339 127037 129155 129668 128679 126358
519 126358 122906 118528 113419 107766 101769 95630 89519 83558 77847 72484 67543 63052 59002 55375 52150 49285 46736
517 46736 44477 42498 40770 39236 37845 36584 35461 34482 33636 32908 32294 31800 31438 31203 31082 31067 31170 31413 31802 32334 33021
515 33021 33889 34967 36276 37832 39645 41710 44011 46541 49295 52239 55300 58367 61311 63967 66145 67676 68462 68488
513F8488o96j346j900k349k697k956l122l193l180l100k968k801k618k429k231k021j815j636
510B5430j485j352j231j125j029r36q54p95p54p03o34n71n39n26n00m61m33m30m29m00l46
508I897k97k66k51k46k48k50k37k02j63j43j48j61j71j74j78j82j84j78j63j42j16r8r4j07
505E498j28j39j33j14r3q2q6r1q8q1p8q3r0q2o4m8l9l7l5m1n9p6q0p3o7n7l9j6qk1l9m5m6
501C240m6m1k6j0j0j5j0LKj5k8j7NQj9n4p2o3l8j6j5l6n9o5m8k4j5k5l6l3j4NJ2J1J0J1J0
496B467J1J1Jj4k8k6j4qj2k4l7m8n7n1l6j9lJ4L0L4K0jj1j1j0j3j8k3l2l8l4k3j4j1j1j2j7
492A932k7k8j5LJ3Rkj1j1j1j0j3j8k8l6l1j3QJ4PJNJ0Nqj3oMQN%kkmnj2j9k7l3l5l4k3oJ3
486A554K1J6J1J4J5Mj7k5pJ6K2RlmkkMJ5J4j0l9n1l4qJ4K7K7K1J4J4J6J5J0Mqk4l4k9j1LJ0
$$ plain form
513 68488 67792 66446 64546 62197 59500 56544 53422 50229 47049 43949 40981 38180 35562 33133 30902 28881 27066 25430
510 25430 23945 22593 21362 20237 19208 18272 17418 16623 15869 15166 14532 13961 13422 12896 12396 11935 11502 11072 10643 10243 9897
508 9897 9600 9334 9083 8837 8589 8339 8102 7900 7737 7594 7446 7285 7114 6940 6762 6580 6396 6218 6055 5913 5797 5699 5605 5498
505 5498 5370 5231 5098 4984 4891 4809 4723 4632 4544 4463 4385 4302 4212 4130 4066 4018 3979 3942 3907 3866 3807 3731 3651 3578 3511 3454 3415 3399 3391 3370 3331 3286 3240
501 3240 3194 3153 3127 3117 3107 3092 3082 3085 3087 3072 3044 3027 3032 3040 3021 2967 2895 2832 2794 2778 2763 2727 2668 2603 2555 2531 2516 2491 2455 2422 2408 2413 2425 2436 2446 2457 2467
496 2467 2478 2489 2490 2476 2448 2422 2408 2400 2388 2364 2327 2279 2222 2171 2135 2116 2113 2127 2157 2191 2211 2210 2199 2188 2178 2165 2147 2124 2092 2054 2020 1997 1983 1972 1961 1949 1932
492 1932 1905 1877 1862 1865 1878 1887 1885 1874 1863 1852 1842 1829 1811 1783 1747 1716 1703 1711 1725 1732 1733 1738 1748 1753 1745 1732 1726 1730 1738 1743 1743 1741 1739 1735 1730 1718 1699 1672 1639 1604 1570 1547 1541 1554
486 1554 1575 1591 1602 1616 1631 1635 1618 1593 1586 1602 1624 1633 1630 1626 1624 1622 1626 1641 1655 1645 1606 1555 1521 1513 1527 1554 1581 1602 1616 1630 1646 1661 1671 1675 1667 1643 1609 1580 1569 1572 1582
481A582J2J5J8K0K1J0j3m0m7k9kJ3J3NnqLK5L6J8j5l4k5LK4K6J3nj7j9j7j4j1qpqlJ3L3M1
477A617K9Nj2j4lRJ5J3kk4l6k5QM2N4L5ml6l8rK1K6J0PK8N1M4K0kj4l1m2k4J8N1N5M9N3O1
472B005N2L5K9L7M5M9N6O9P0N5L7L7O1J03J42J58J49J34J43J75K03K04J79J54J45J60J86K04
468E076K03J92J91K00K10K16K32K66K99L16L22L38L74M24M76N35O07O94P95R20J081J274J492
466A6733J740K036K396K817L271L733M171M496M549M194L495K756K289K064J682P53o64k074
463F0437k987l328l367l382l430l426l292l035k708k370k073j821j576j310j038p94n95m41
461A9464l30k46j73r9k9L9J17K06K88L62M50N68O92Q04R24J098J340J638J978K364K805L320
458C7580L928M636N424O276P168Q000Q500Q327P348N867M534L864L727L309J773r18l853n930
$$ plain form
481 1582 1594 1609 1627 1647 1668 1678 1665 1625 1578 1549 1547 1560 1573 1578 1573 1565 1568 1593 1629 1647 1632 1598 1573 1576 1600 1626 1639 1634 1617 1598 1581 1567 1556 1548 1541 1533 1530 1543 1576 1617
477 1617 1646 1651 1639 1625 1622 1631 1646 1659 1657 1633 1597 1572 1580 1622 1676 1711 1707 1671 1633 1624 1645 1671 1681 1688 1716 1767 1811 1831 1829 1815 1784 1742 1718 1736 1787 1842 1891 1944 2005
472 2005 2057 2092 2121 2158 2203 2252 2308 2377 2447 2502 2539 2576 2637 2740 2882 3040 3189 3323 3466 3641 3844 4048 4227 4381 4526 4686 4872 5076
468 5076 5279 5471 5662 5862 6072 6288 6520 6786 7085 7401 7723 8061 8435 8859 9335 9870 10477 11171 11966 12886 13967 15241 16733
466 16733 18473 20509 22905 25722 28993 32726 36897 41393 45942 50136 53631 56387 58676 60740 62422 63175 62511 60437
463 60437 57450 54122 50755 47373 43943 40517 37225 34190 31482 29112 27039 25218 23642 22332 21294 20500 19905 19464
461 19464 19134 18888 18715 18616 18587 18626 18743 18949 19237 19599 20049 20617 21309 22113 23037 24135 25475 27113 29091 31455 34260 37580
458 37580 41508 46144 51568 57844 65012 73012 81512 89839 97187 103054 107588 111452 115179 118488 120261 119343 115490 109560
456A09560o774o866o876p030p122o933o472n878n275m715m193l670l126k597k144j787j503
454B6599j276j101r66q50p51o68n90n04m21l55k87j90q2PQ9J95L38M99O80Q94J135J392J681
451B5468K030K430K841L259L676L974L932L443K672J974J614J552J457R29j73j566k737l353
449E3422l500l499l549l609l562l375l093k778k485k241k025j788j522j268j068r09p73o65
447A1713o00n66n26m68m13l82l75l77l68l49l30l20l01k54j96j66j68j70j49j26j31j50j55
444D673j40j27j23j13r5q3r1r9q9o6m9n2o6p5p2o2n6n7o2o0n0m6n5p0p7o5m6m0n3p1o9m4j6
440B334qk5m4m5k6%J3Qpk0k7k8k5k0j8k1k0j1oj4k8k7rQJ0j%J4K8K5%l0m8m0j6Kkj3qJ8M1
435A914M3L1K2K5K9J5j9n4o5m9k8j9j7j3l%kjOKj8l3k9j5prj4j9k7l9m3l1rJ0J2mk0j8nKj0
$$ plain form
456 109560 102786 95920 89044 82014 74892 67959 61487 55609 50334 45619 41426 37756 34630 32033 29889 28102 26599
454 26599 25323 24222 23256 22406 21655 20987 20397 19893 19472 19117 18830 18640 18558 18565 18654 18849 19187 19686 20366 21260 22395 23787 25468
451 25468 27498 29928 32769 36028 39704 43678 47610 51053 53725 55699 57313 58865 60322 61251 61078 59512 56775 53422
449 53422 49922 46423 42874 39265 35703 32328 29235 26457 23972 21731 19706 17918 16396 15128 14060 13151 12378 11713
447 11713 11113 10547 10021 9553 9140 8758 8383 8006 7638 7289 6959 6639 6338 6084 5888 5722 5554 5384 5235 5109 4978 4828 4673
444 4673 4533 4406 4283 4170 4075 3992 3901 3802 3713 3647 3598 3546 3480 3405 3333 3271 3215 3158 3096 3036 2986 2940 2885 2815 2738 2673 2627 2587 2534 2463 2394 2350 2334
440 2334 2326 2301 2257 2212 2186 2186 2199 2207 2200 2180 2153 2125 2100 2080 2062 2041 2021 2010 2004 1990 1962 1935 1926 1934 1944 1943 1943 1957 1985 2010 2010 1980 1932 1892 1876 1878 1876 1863 1855 1873 1914
435 1914 1957 1988 2010 2035 2064 2079 2060 2006 1941 1892 1864 1845 1828 1815 1812 1812 1810 1809 1815 1817 1799 1766 1737 1722 1715 1706 1692 1673 1646 1607 1564 1533 1524 1534 1546 1542 1522 1504 1499 1501 1491
430A491k2j9j2k0m1m3j1L2N1L9J8Lj0l1n4o2n0k3MK1K0RkkLMpk2k8j8KJ3Qj0k3k5k1k2k7k2
425A091oONjOK3L0J8mk0l2m2m1k3MJ8J4QJ2J8J5J1J1J2Jj4j8r%PJ3J7J3LjOJ2J0Lmrj7k3k2
420A101j5j0j2j2qJRJ6K0K3K3J7Nmm%qk9m0l0qKKJ3L2M2K6Kqork9m8n1l5j4jjnnPK5L2J5j7
414A004m0l9j3QOj2j9oJ3K5K6K3J7Pmj2j9k8l4k7j5plNK1L4K5Kj5j1RK2J8Nj%J%lJRJ3Ooj1
409I75mRRmk3l4l5l0j5J4M4N0K8Jj1nK%rk5l4k5LL4N0M4K5Lj1j2jJ1J7J6J1lk4l6k9j0KOJ1
404I85J4QmqkMLKJ0J7J7J8K0K3J4PPJ1J4K0L5M7M2J8j0k1j2JOKlrk0m0n4n4m3l4k9j1J4K7
398A032J3prKOkokPJ5J9J8RJLJ3J6J1Lkrj1lJ0J2JjK0N1P2Q1Q2P3M6J4%PK4L5L2K0Mpk0l6
393A637n8p3p6p3p0o3m8l1j9j1qrj2qNJ4R%knj7k7k1kOkj0oKOJ7L4L3%l2k6J1M3M5L5L2L0
$$ plain form
430 1491 1469 1450 1438 1418 1377 1334 1323 1355 1406 1445 1463 1466 1456 1425 1371 1309 1259 1236 1240 1261 1281 1290 1288 1286 1289 1293 1286 1264 1236 1218 1220 1233 1241 1231 1208 1183 1162 1140 1113 1091
425 1091 1085 1091 1096 1095 1101 1124 1154 1172 1168 1148 1116 1074 1033 1010 1014 1032 1046 1054 1066 1084 1099 1110 1121 1133 1134 1120 1102 1093 1093 1100 1113 1130 1143 1146 1145 1151 1163 1173 1176 1172 1163 1146 1123 1101
420 1101 1086 1076 1064 1052 1044 1045 1054 1070 1090 1113 1136 1153 1158 1154 1150 1150 1142 1113 1073 1043 1035 1037 1039 1052 1084 1126 1152 1154 1146 1140 1131 1102 1054 1003 968 954 953 952 947 942 949 974 1006 1021 1004
414 1004 964 925 912 920 926 914 895 889 902 927 953 976 993 1000 996 984 965 937 903 876 861 854 851 856 877 911 936 938 923 912 921 943 961 966 965 965 966 966 963 964 973 986 992 986 975
409 975 971 980 989 985 962 928 893 863 848 862 906 956 984 985 974 969 971 971 962 937 903 878 881 915 965 1009 1034 1037 1026 1014 1013 1024 1041 1057 1068 1065 1041 1005 976 966 968 974 985
404 985 999 1007 1003 995 993 997 1000 1002 1012 1029 1046 1064 1084 1107 1121 1128 1135 1146 1160 1180 1215 1262 1304 1322 1312 1291 1279 1280 1286 1288 1285 1276 1256 1216 1162 1108 1065 1031 1002 991 1005 1032
398 1032 1045 1038 1029 1031 1037 1035 1029 1027 1034 1049 1068 1086 1095 1096 1099 1112 1128 1139 1142 1140 1131 1120 1117 1127 1139 1140 1139 1159 1210 1282 1363 1445 1518 1564 1578 1578 1585 1609 1644 1676 1696 1700 1693 1673 1637
393 1637 1579 1506 1430 1357 1287 1224 1176 1145 1126 1115 1107 1098 1086 1078 1083 1097 1106 1106 1104 1099 1082 1055 1034 1032 1038 1036 1026 1020 1022 1028 1045 1079 1112 1112 1080 1054 1065 1108 1153 1188 1220 1250
388A250K7K5L0L1J8Kmlqj6j4oj2l4n0m1j8KJ1Rlk1l4l4j9mNMlj5k3k4k0j9j7qmooJ2L7M3K0
383A060oj8j9j8j2KRLqnQK0L0L9M0K3kj4pkrj7k1k1k1j6pj0k4l0j7%MMRJ2Kj2oJ1J2pk4k1
377I14j2rnJ2L0L4J8%j3j7j6j3j7k1j9mOkj6j0J6M1M3K7J5J6J9Ok1m3l4jK7L5K9K0J6J0Kk
372A061oj1r%Nqk3j5J6L9L2J0JOPqk7l3k0KJ1%j8k0JK1K4J1Jloo%J2J6J0lj3k0k1j3opmJ5
367A001L9M4J4k6m6l4oJ6K3J7MkMJ3Orj7j0KRO%l%J5L2L4J4pj5j0opjQPqj9j3jkj4j4MK4K5
361A091J6PJoqOL2M8M1K0jj5j4lOjk0k4lK0K1Jj5j8k0k6k0PL8N0L2jl2m8m3k2lmj5k1j6on
356A027prj0j0lJ6L6L6J7mq%ONMKok4l5l1j2NJ7K4L0K7J4Jn%%j6l7m4l4j5mMJ2K2J7jk3l2
350I52k8j5%J0J8K7L5K7j0n4o5l7NL0M0N0N2K6j8m1k3QK1J4Llpj1pnj2k4k7j3QJ7Oj0j6ro
$$ plain form
388 1250 1277 1302 1332 1363 1381 1383 1379 1376 1368 1352 1338 1332 1320 1286 1236 1195 1177 1179 1190 1199 1196 1175 1141 1107 1088 1084 1089 1093 1090 1075 1052 1028 1008 989 972 964 960 954 948 960 997 1040 1060
383 1060 1054 1036 1017 999 987 989 998 1001 993 988 996 1016 1046 1085 1125 1148 1146 1132 1125 1123 1114 1097 1076 1055 1034 1018 1011 1001 977 947 930 930 934 938 947 959 961 949 943 954 966 959 935 914
377 914 902 893 888 900 930 964 982 982 969 952 936 923 906 885 866 862 868 866 850 840 856 897 940 967 982 998 1017 1023 1002 959 925 924 951 986 1015 1035 1051 1061 1063 1061
372 1061 1055 1044 1035 1035 1040 1032 1009 994 1010 1049 1081 1091 1092 1098 1105 1097 1070 1037 1017 1019 1030 1030 1012 992 993 1014 1038 1049 1050 1047 1041 1035 1035 1047 1063 1073 1070 1057 1037 1016 1003 997 990 986 1001
367 1001 1040 1084 1098 1072 1026 992 986 1002 1025 1042 1046 1044 1048 1061 1067 1058 1041 1031 1033 1042 1048 1048 1045 1045 1060 1092 1126 1140 1133 1118 1108 1102 1095 1094 1102 1109 1101 1082 1069 1068 1066 1052 1038 1042 1066 1091
361 1091 1107 1114 1115 1109 1101 1107 1139 1187 1228 1248 1247 1232 1218 1215 1221 1220 1200 1176 1173 1193 1214 1215 1200 1182 1162 1136 1116 1123 1161 1211 1243 1242 1210 1162 1119 1097 1094 1090 1075 1054 1038 1032 1027
356 1027 1020 1011 1001 991 988 1004 1040 1076 1093 1089 1081 1081 1087 1092 1096 1098 1092 1068 1033 1002 990 995 1012 1036 1066 1093 1107 1108 1103 1103 1103 1087 1050 1006 972 957 953 957 969 991 1008 1007 984 952
350 952 924 909 909 919 937 964 999 1026 1016 962 897 860 865 895 935 985 1037 1063 1045 1004 981 989 1010 1024 1027 1024 1017 1006 999 994 982 958 931 918 926 943 949 939 923 914 908
345I08j0j3LL2M9M5K8J0jrj0j2k2l6l5j2J8L4L0J1j0k9l5k2jQJrj5j4j3qLJ5K6L2K7J3MNO
340I92pl1m5l8j6OJ8K3K5L1L3K0rl7l6j4OQPJ5K4K3Rrk0l1l7l9l8l1j5OK4K7J5Jppnpj5k2
335G97j5OK5L1K7K5K2J8J1OMJj%KMOJ2J1nj9j9oMLjKQJ0J2J3Oj0k2k0qJLlj2j4rlnj3j2MK2
329H99K8K0J3RRNPJ3J9Qj9m4m5k1%QMQJ3J0lnRJ9J2%qj3k2k8j3J1K2J1moklrrlJLMPPK%LP
323I34KlLK2L7K9Pqj7l5o2p1m1J3N2O2N2L3Ok2l3k1ppj7j8j0pj3j9mK9N8O1L5lk7l3k5j0N
318I27J1%k0l0j8MJ7J7J5J5Oj2k4j7NK1K2J6J6J7J3Mlj0k3m4n5m0j3RJ3QPRJ4J9K4J8kk1l0
313H85k4pRK0J7Kj6k9l1j9LK7L6K6ROJ9L2K8Nk3l5j9QJ9Mj5j2J0K5J8lj8k1k4k8k2rjpj8j5
308H12KJ9K4J9J5J3Nqj5pJ0K2J9Nn%J2J9J4jj9l4l9l0nK2K8Pk0k9j4QJ8J0oj0MK0K0Nrqnj1
$$ plain form
345 908 898 885 888 920 969 1014 1042 1052 1051 1042 1032 1020 998 962 927 915 933 967 997 1008 998 969 934 912 911 919 920 911 896 882 869 861 864 879 905 937 964 977 981 986 992
340 992 985 954 909 871 855 861 879 902 927 958 991 1011 1002 965 929 915 921 929 936 951 975 998 1007 998 978 947 910 871 833 802 787 793 817 844 859 860 853 846 841 834 819 797
335 797 782 788 813 844 871 896 918 936 947 953 957 958 957 957 959 963 969 981 992 987 968 949 943 947 950 949 951 959 969 981 994 1000 990 968 948 940 941 944 941 929 915 906 903 898 885 873 877 899
329 899 927 947 960 969 978 983 990 1003 1022 1030 1011 967 922 901 901 909 913 921 934 944 941 936 945 964 976 976 968 955 933 905 892 903 925 936 932 926 924 921 912 903 900 901 904 908 915 922 924 924 927 934
323 934 936 933 936 958 995 1024 1031 1023 1006 971 909 838 797 810 862 924 976 1009 1015 993 960 939 932 925 908 890 880 873 860 841 837 866 924 985 1020 1017 990 957 932 922 927
318 927 938 938 918 888 870 874 891 908 923 938 944 932 908 891 896 917 939 955 971 988 1001 1005 1002 992 969 925 870 830 817 826 839 847 854 863 877 896 920 938 936 915 885
313 885 861 854 863 883 900 902 886 857 826 807 810 837 873 899 908 914 933 965 993 998 975 940 921 929 948 952 937 925 935 960 978 975 957 936 912 884 862 853 852 845 827 812
308 812 814 833 857 876 891 904 909 901 886 879 889 911 930 935 930 930 942 961 975 974 955 921 882 852 847 869 897 904 884 855 841 849 867 877 871 861 865 885 905 910 901 893 888 877
303H77j8j7pnj3j7rNJ3J4RNMLjj1j4lJ3J4NlJMjqpKJ0J5J8J6J1J2K0K2J4PPPpk9m1m1l3k0
297H23mQROJ8L9L9J2k3l0j2OKj2k2k0j3lQK0K3J8J2J6K7L2K6J7Rjj4j8qKnk1k9k1j1j0rKJ7
292I05K1J4Knonoj1j8j9j5j1mQJ4Nj0j1OK2K4J6QO%j0k0l2m0l1pJ7K8K9L0K9J7mk1k9k9k5
287H32j7j2qlJjrj1kJ2K2L1L3K2kj9j3MQK%JkoKK1L0K1J1QPJjMNkkJ0J2ok2j7jjj4j7kJ2P
281I29j3l2l6j7J3K7J4rj7rJlroQJ8J8Lj9l2k6pJ1K3K5J1j3k6j6LOj4l1k7j1%OJ0Pnj4nK0
276G56L8L9L0J9Pmj4j6oJ4L5M6M7L3J3j2k9l1k4k4k4j5LJ2Jj4j0RJ6Kj4qJ2K7K5J2Kmqqkj
270I30j1k5k8j6morLJ8J8jj2nNMoj2j4j5qMJ1lj9j1J4L2K4OKRJ3Nj2k5k2lQmk3j6J8L8K3n
265H70j3mmj2j4nlj0qLOllJ2K8K1NNK3L8M0L2J3qk4k2j7j9k1lK8L4Ll0l2j1Llj4j0LJ9K4J6
$$ plain form
303 877 859 842 835 830 817 800 791 796 809 823 832 837 841 844 843 832 818 815 828 842 847 844 845 849 848 840 833 835 845 860 878 894 905 917 937 959 973 980 987 994 987 958 917 876 843 823
297 823 819 827 836 842 860 899 938 950 927 897 885 891 893 881 859 839 826 823 831 851 874 892 904 920 947 979 1005 1022 1031 1030 1016 998 990 992 987 966 937 916 905 895 886 888 905
292 905 926 940 942 937 931 926 920 909 891 872 857 846 842 850 864 869 859 848 854 876 900 916 924 930 930 920 900 868 828 797 790 807 835 864 894 923 940 936 915 886 857 832
287 832 815 803 795 792 793 792 783 772 770 782 804 835 868 890 888 869 856 860 868 870 870 871 869 863 865 886 916 937 948 956 963 964 963 967 972 970 968 978 990 984 962 945 944 943 929 912 910 922 929
281 929 916 884 848 831 844 871 885 876 859 850 851 848 839 833 841 859 877 880 861 829 803 796 807 830 855 866 853 827 811 814 820 806 775 748 737 737 743 753 760 755 741 736 756
276 756 794 833 863 882 889 885 871 855 849 863 898 944 991 1024 1037 1025 996 965 941 917 893 878 881 893 894 880 870 879 895 897 883 875 887 914 939 951 953 949 941 933 931 930
270 930 919 894 866 850 846 840 831 834 852 870 869 857 852 857 861 855 843 829 814 806 810 821 818 799 788 802 834 858 864 866 875 888 893 881 856 834 831 839 835 812 796 814 852 875 870
265 870 857 853 849 837 823 818 815 805 797 800 806 803 800 812 840 861 866 871 894 932 972 1004 1017 1009 985 963 946 927 906 903 931 965 968 938 906 895 898 895 881 871 874 893 917 933
260I33pk8l6k9j7j0l%jqrjRJ5J8J8J5J4K1L3L2J2j3j9lJ9L0K1ml5n7n5l6k1j5nJ6L5L5J9P
254H90RJ6J2mj5j5JJ7K1J0JQK4K8Rj4k3k2k0k0j4j%j0j9j5kJ0J6J3Mj0j2JJ9J9QJPJ5J2lj7
249I35k2k2j5roJJ6L1L0J6Kpj6k4k7j3OJ7J5MmkQJ6QmnKJj1j3MJ2ol0l2j9j6k6k9j3OJ0PQ
244G84J0J2K0K5J5j4l2j7J7L1J4j4j9jK3K9K4K0K4K5J1j5l3l2k0nJ0K6L1K5Nk0m1n2l4NM0
239H77M3J5k2m1l6j1J5K7K3J6Qmj9k2j0MMj2k6k7j6NK4K9J6KLJ5K7L4L7L2Nl2n3m6k7j2kO
234H49NjnLJ4J5PNPNlrlRJ6J8J7J2jj5k4j7kJ3J6J2J0RRjj9k6j2J5K6Nk7l5j3NJj7k3k2k0
229H08j7mJ4J7ROJ4K3K6L1L1J6rk0kK4L0J3onJ2K5J6j2l5k7jJ2%j2mJ4J5Kmkkoj0j4k2k8j7
224H99LRJnMJ5J9J1Knj1j4j2mPJ8K4J5nk5k9j6NK0K3J4kj6k8l0k0KK2L1K8J3j1l6m5k4J1K6
$$ plain form
260 933 926 898 862 833 816 806 803 803 802 794 785 784 793 808 826 844 859 873 894 927 959 971 958 939 936 955 985 1006 1002 967 910 855 819 798 783 778 794 829 864 883 890
254 890 899 915 927 923 908 893 894 911 932 942 943 951 975 1003 1012 998 975 953 933 913 899 898 898 888 869 854 852 862 878 891 895 885 873 874 893 912 920 921 928 943 955 952 935
249 935 913 891 876 867 861 862 878 909 939 955 957 950 934 910 883 870 876 893 908 912 908 906 914 930 938 934 929 931 932 921 908 912 924 918 888 856 837 821 795 766 753 759 769 776 784
244 784 794 806 826 851 866 852 820 803 820 851 865 851 832 831 854 883 907 927 951 976 987 972 939 907 887 882 892 918 949 974 979 959 918 866 832 837 877
239 877 920 935 913 872 836 825 840 867 890 906 914 910 891 869 859 863 867 855 829 802 786 791 815 844 860 862 865 880 907 941 978 1010 1015 983 930 884 857 845 843 849
234 849 854 853 848 851 865 880 887 892 899 904 901 892 889 898 914 932 949 961 960 945 921 904 902 915 931 943 953 962 971 970 951 925 913 928 954 959 932 897 884 889 890 873 850 828 808
229 808 791 787 801 818 827 833 847 870 896 927 958 974 965 945 943 967 997 1010 1004 999 1011 1036 1052 1040 1005 978 977 989 989 977 973 987 1002 1004 1000 998 996 990 980 966 944 916 899
224 899 902 911 912 907 911 926 945 956 958 953 942 928 916 912 919 937 961 976 971 946 917 901 906 926 949 963 961 945 917 887 867 869 891 922 950 963 952 916 871 847 858 884
218H84J0j4j7kJ0OkKRQkoLJ2Lj4k1rOQPJ3J8Pj3k5j7qrj2j2j4k4l1j6J1L5M3L8K8J5Mllml
213H99llnmJRJ4Rok1j7MK3K0jj8k0qQK4L0K0KlKnk9m4l0mRQJ1J4Pj4l7n3n3l3LL2L1J6J5K9
207H29L2K0J3J9K3K1K0K6J6j8n1n5l4j1%ONj1l1l0jK5K5Kj7j4LJ8K7K6J2j5l5l3pK0K6J9J6
202H86J6J2%ooqj2nJ6K9J3j5k7j8njpj5k2j9mJ5K1J4Jqj7k4k2nJ8L9M8L5Mk6k7rNJmLJ1Np
197H73pRK5L3L8M2L2J0j2j8rnrk0k3k1j5j2j9l3l9k5NL3L9K2KjJ4K3J4qj9j2K%j8l3k9pJ5
192H37K4J7OKNJ4K0K6K7J8Mrj2j1j5k7l1k1jQOLJ3K6K5Mk0l0k0NK6L0J6mj1lPJ0QJj0j7j4
187I32JR%j2oJ6K8J7qk1j8j6k0k8k5pJ6L3L1J4mj5j9j8j0lnj8k5j3J1J9J4J0J8K1J1LQK1K2
182I64J4OLoj8j7mPlj7k2j8j4pOJ9J1j0k4k1ojmj1j5rMJ2OjKJ5J5JqJ0L2K9kk6l0k1k0k0j0
$$ plain form
218 884 894 880 863 861 871 877 875 877 886 894 892 886 889 901 904 890 869 860 866 874 881 894 912 919 906 881 864 856 847 835 823 809 785 754 738 749 784 827 865 893 908 912 909 906 902 899
213 899 896 893 888 884 885 894 908 917 911 890 873 877 900 920 919 901 881 873 881 905 935 955 957 954 956 951 922 878 848 844 853 861 872 886 893 879 842 789 736 703 706 738 769 785 800 829
207 829 861 881 894 913 936 957 977 1003 1019 1001 950 895 861 850 850 856 861 850 819 789 788 813 838 840 823 809 812 830 857 883 895 880 845 812 805 825 851 870 886
202 886 902 914 914 908 902 894 882 877 893 922 935 920 893 875 870 869 862 847 825 806 802 817 838 852 853 845 828 804 782 777 795 834 882 917 921 895 868 859 864 865 861 864 875 880 873
197 873 866 875 900 933 971 1013 1045 1055 1043 1025 1016 1011 1002 982 959 938 923 911 892 859 820 795 800 833 872 894 896 895 909 932 946 938 919 907 909 909 891 858 829 822 837
192 837 861 878 884 886 891 905 925 951 978 996 1000 991 979 968 953 926 895 874 873 881 887 890 903 929 954 958 938 908 888 893 919 949 965 961 950 947 954 964 972 973 963 946 932
187 932 933 942 942 930 924 940 968 985 977 956 938 922 902 874 849 842 858 891 922 936 932 917 898 880 870 867 862 844 819 806 817 836 850 860 878 899 910 913 921 942 964
182 964 978 984 987 981 963 946 942 949 946 929 907 889 875 868 874 893 904 894 870 849 843 842 838 827 812 803 807 819 825 824 826 841 856 857 849 859 891 920 918 892 862 841 821 801 791
176G91OJ9K4K5K1J0llJ7M0M3J7j6l2l4l4l9l7j9%Jj2j6oOJ7K6L4K6Mj3k3l2m8m7j5L0N1M4
171H23K8J3nj9j7JJ3P%LNnrNK3J4j6l7k9j0MOJ1J3J0MKPQLJMJ4K5L1L4K8J8O%oj6l0m0m0l3
166H52k4j2QK8K6Kk0k1pNM%lkJJnj3j0MJ2O%J0K6K1pk4j1J2J6OJRJ5J0LJkpj4j8k1k1j8qP
160H18K0K5J8Nqj8k2j7nJ1K2K6K9L1K2Nqqoj8l7l9k0JRRQPok1k5rJ1J6MnkJ3K1J7Ok%J0J6
154I04J5Kj1k0k1j8j1lKJ%NJ4J2kj1kJ6K0Rkj1j3j4j0npj1pKMllNQkj0JK6M4M0J6j0k7k8k0
149H64j3j3j3oQK0K5K3J4NKJ1K2J8ol3l5rK0K6PpnkplJ6K5%m0m6j4J4J4ORJ4Mj2oJ3K4J7K
143I53j4k9l2j2J9L7K6OmKJ2J0lj5qJ3K4J5qk3l4m4m5k6mjj2pJ8L4K2%j9l3m6m0nL3M4L3L3
138H70N1N8K8k2n7n8l5j0J4L2M3L6K1ROKoj0o%mj2j0mjjOJ3J3L%Kkj2j7j0kkknj3k6k7j5r
$$ plain form
176 791 797 816 840 865 886 896 893 890 907 947 990 1007 991 959 925 891 852 815 796 796 797 785 769 763 769 786 812 846 872 876 863 840 808 760 713 698 728 779 823
171 823 851 864 859 840 823 824 837 844 844 847 852 847 838 843 866 880 864 827 798 788 792 798 809 822 832 836 838 845 853 856 857 861 875 900 931 965 993 1011 1017 1017 1011 995 965 925 885 852
166 852 828 816 824 852 878 880 860 839 832 837 841 841 838 836 837 838 833 820 810 814 826 832 832 842 868 889 882 858 847 859 875 881 882 891 906 916 919 920 918 911 897 879 858 837 819 811 818
160 818 838 863 881 886 878 860 838 821 816 827 849 875 904 935 957 962 954 946 940 922 885 846 826 827 836 845 853 860 854 833 808 799 810 826 830 825 823 836 857 874 880 878 878 888 904
154 904 919 921 910 890 869 851 840 837 839 840 840 845 859 871 869 858 856 872 892 901 899 888 875 861 851 846 839 828 821 823 827 824 821 826 834 832 822 823 849 893 933 949 939 912 884 864
149 864 851 838 825 819 827 847 872 895 909 914 916 927 949 967 961 928 893 884 904 930 937 930 925 923 916 913 929 954 954 914 868 854 868 882 888 897 911 915 903 897 910 934 951 953
143 953 939 910 878 866 885 922 948 954 950 952 964 974 971 956 948 961 985 1000 992 969 935 891 846 820 816 815 803 796 814 848 870 870 851 818 772 732 727 760 804 837 870
138 870 921 979 1007 985 928 870 835 825 839 871 914 950 971 980 986 988 982 972 966 966 962 950 940 936 935 934 940 953 966 969 969 971 969 957 940 930 928 926 924 919 906 880 853 838 829
133H29j4j2PK3J3j6k8qK3L7K9OpJK4L3J2k2l7l0j7j2mLQNOJ3J8K0J5OopRK7K3Lq%Oqk7l3k7
127H76k4l1k8rJ8L2K3kk4k2JK6L5K5J2MK%qk0k2j3jMNJ0J6J4POJ3J5NmkKlj3j3nkj2k8l5k9
122H01j7nKJ0J9K5K2J3Pjj2j5JK1J9qk9k1mnj6j7pok0k6qK1L2K5J1L%jkmmno%J2K5L3L8L8
116I39K9J2j0k2k1j5pOJ9J3pk2j6ljoLJ6J6%j0pLQJ2J4Qoj4j3j1j4j0JJk0m0l5lK3K5Kk3l4
111G80k1LK0K4K1K0K4K3J5Nnj2j4r%Kj3l6m8l3KL5M0K3kj2rJJ0Qok1j7PL0L1J5Lkj0j6qJ2
106H60K8K4Oj1j4pQK0J8%k0k8k2j7j2kJ3K1J2lj1j2k0l0k9j2NQKKJ2K2K7K0Nj0j4kJ4J4J1
101H76K3M0L9J0j6j9oKKLQKj4k3j6JJ5J6Q%JJok4l0j6%lk1k6mK4L2K0Mnj0q%PMok0k5k1j4
95H05kQJ8K3K3J6QLJkjQK5L8L5J6nj3mRQj4l5l6j6%%j1j7j9j9j6nLJlKJ7L0K8K0Qrk2k0NK9
$$ plain form
133 829 815 803 810 833 846 830 802 794 817 854 883 889 882 883 907 940 952 930 893 863 846 834 830 833 841 846 852 865 883 903 918 924 918 911 920 947 970 973 965 965 971 963 936 903 876
127 876 852 821 793 784 802 834 857 855 831 809 810 836 871 896 908 912 914 914 906 886 864 851 850 854 859 869 885 899 906 912 925 940 945 941 939 941 938 925 912 907 905 893 865 830 801
122 801 784 779 781 791 810 835 857 870 877 876 864 849 850 871 890 882 853 832 828 823 807 790 783 777 757 731 723 744 776 801 812 815 815 814 812 808 804 799 793 793 805 830 863 901 939
116 939 968 980 970 948 927 912 905 911 930 943 936 914 898 895 894 888 891 907 923 923 913 906 909 917 929 943 951 945 931 918 907 893 883 884 885 865 825 790 787 810 835 837 814 780
111 780 759 762 782 806 827 847 871 894 909 914 909 897 883 874 874 876 863 827 779 746 748 783 823 846 844 832 823 824 834 842 836 815 798 805 835 866 881 884 882 872 856 848 860
106 860 888 912 918 907 893 886 894 914 932 932 912 884 862 845 833 831 844 865 877 874 863 851 831 801 772 760 765 773 775 777 789 811 838 858 863 853 839 837 851 865 876
101 876 899 939 978 988 972 953 947 949 951 954 962 964 950 927 911 912 927 943 951 951 952 953 947 923 893 877 877 874 853 827 823 847 879 899 903 898 888 880 880 887 891 885 865 840 819 805
95 805 803 811 829 852 875 891 899 902 903 901 900 908 933 971 1006 1022 1017 1004 1000 1009 1017 1003 968 932 916 916 916 905 888 869 850 834 829 832 833 830 832 849 879 907 927 935 926 904 884 889 918
89I18K9Jk3j8PJ9Nj8k1oKpk4k9j4QK9M4N0N6N5L8%m0n3l8k3k8m0l9k1jJ8L7N2L9Nk3k3nKq
84I12j7k0k1k6k3jJ9K0Nqqnj2j6pPQjkRJ5J1RK5L7J9j5l3k1%J0J1J4J2Jj6k3k0j3qkJmo%J5
79H32J8RmmNRlj9j9ML1M0K5Mj0k6m7n0k0J8K8Rj2pNjj9k9k0lJ1J4J3J2J7K5K9K4J5Pkqrmm
73H84rnQJ7J1MJ4K5Rk8n1l9j4KMQJ5K3K6K2Pj0rNRpj5OL4K9mk9k5rl%RJ8K5K7K6J5jrmjj0
67A000j8j2kjj2k0k1j2MK1K6J9J0OLoj1qmqj3q%J%NJ2QOK2M1L6Kl0l5k8k3k0rOJ2Mj1k5k5
62H82j1NMj2j9oJ2J8J7J9K0J3MRK1K6J8J2J1Lj0j9j4oJKpk3l5l1k6l2m1k9KJ8jk3j0K9N9N8
57I08L7Qk1l6k5NK8K0qk6k2kJ3J2kj6k3j6%J7J7JrRM1N2K6j2l0l1k9k6j3RK3K7K3Qk2n1n7
52H07m1k9k2oJ7K6J5RK7N3N4L5K0J4Okqj2k2k8k0kPOPJ1J2Lpj0j2j3j1oqj7j8j2j0j8k4j8
$$ plain form
89 918 947 948 925 907 914 933 938 920 899 893 895 888 864 835 821 829 858 902 952 1008 1063 1101 1101 1061 1008 970 947 919 879 840 819 818 836 873 925 964 969 946 923 918 920 912
84 912 895 875 854 828 805 804 823 843 848 840 832 827 815 799 792 799 807 806 804 813 828 839 848 873 910 929 914 881 860 860 870 881 895 907 908 892 869 849 836 828 826 827 823 817 817 832
79 832 850 859 855 851 856 865 862 843 824 828 859 899 924 928 918 892 845 795 775 793 821 830 818 811 816 815 796 767 747 744 755 769 782 794 811 836 865 889 904 911 909 901 892 888 884
73 884 875 870 878 895 906 910 924 949 958 930 879 840 826 828 832 840 855 878 904 926 933 923 914 919 928 921 906 912 946 975 971 942 917 908 905 905 914 932 957 984 1010 1025 1024 1015 1011 1010 1000
67 1000 982 970 968 967 955 935 914 902 906 927 953 972 982 988 991 985 974 966 962 954 941 933 933 934 934 939 951 959 965 987 1028 1064 1066 1036 1001 973 950 930 921 927 939 943 932 907 882
62 882 871 876 880 868 849 843 855 873 890 909 929 942 946 955 976 1002 1020 1032 1043 1046 1036 1017 1003 997 998 1000 993 970 935 904 878 846 805 776 778 796 795 772 762 791 850 908
57 908 945 953 932 896 871 876 904 924 916 890 868 866 879 891 889 873 850 834 834 851 868 869 860 869 910 962 988 976 946 915 886 860 847 856 879 906 929 937 915 864 807
52 807 766 737 715 709 726 752 767 776 803 856 910 945 965 979 985 983 975 963 941 913 893 891 898 904 911 922 934 937 930 920 908 895 884 878 870 853 835 823 813 795 771 753
47G53JK0K9K4Jk5l1j0J4J9ROPlk0j7J4M4M6K1nj6j2lMRPKKPJ0Onj6k2k2k4k8k6j3NJ1PKJ0
41G92K0K3J6RK%nj5k2k3rJ2K7K4J3OJ0J7J1pk7l0j1J4K0OpMK6L7K2MMJ6J6nk8l0j0POqj9j5
36H93kMJnrj4j7k1j9oJ4L5M0J4k6n0l4NK6J3rj5mJ0J8K3K1Pj1j3JJ1Ooj2j7j8oJ6K6Qk2k7
31H29oJ6K2J3jj9l1k6qOPMKnj4j0RL0K9J2jk%%jLRQKpqJQlk5l3j6MJj7j9LK9L9L5K5Rrj9j5
24H60oLMkj0j6qQJ8J5QJmj0j3oKQJ4J9J0j3l5l2oK2L0K1J3QJj6l3m0k9pNPLlpmJ0L3M2K9J1
19I05PJ2J0%jOPmj5qRJ5PLQJ2Nrj7j9k1k8k3lJ4J5jj1j0nkQK6L9M0K9J4kj2j0jnk2l3k3j0
13H96j5k8j9J4L9L0Kk0k5j4QL5M4K8lk5k6j8j1j1q%RJ8K0J6Nrk3k8k0mQJ4J9K5K8K3Pj4l2
8I35l4k1ojlJPKoKK7M0K5%j4k1l4m2k5RL1K9K4L1L7K3mk6l3k5j4rk1l9m5l0nRJ7L0M4M1J7
$$ plain form
47 753 754 774 803 827 828 803 772 762 776 795 804 810 817 814 794 777 791 835 881 902 897 881 869 866 870 879 886 888 890 897 907 913 908 892 870 848 824 796 770 757 762 773 780 782 792
41 792 812 835 851 860 862 862 857 842 820 797 788 800 827 851 864 870 880 897 908 901 874 844 833 847 867 873 866 870 896 933 955 959 963 979 995 990 962 932 922 929 935 927 908 893
36 893 891 895 896 891 882 868 851 830 811 805 819 854 894 908 882 832 798 803 829 842 833 818 814 824 842 865 886 893 882 869 870 881 887 881 869 852 834 828 844 870 878 856 829
31 829 823 839 861 874 873 854 823 797 789 795 802 806 808 803 789 779 788 818 847 859 858 856 856 856 855 858 867 875 877 870 862 863 871 868 843 810 794 798 799 782 763 766 795 834 869 894 903 894 875 860
24 860 854 857 861 859 849 833 825 833 851 866 874 875 871 861 848 842 844 852 866 885 895 882 847 815 809 831 861 882 895 903 904 888 855 815 786 779 784 791 794 791 784 780 790 823 865 894 905
19 905 912 924 934 934 933 939 946 942 927 919 928 943 950 953 961 973 978 969 952 933 912 884 861 858 872 887 886 875 865 860 858 866 892 931 971 1000 1014 1012 1000 990 989 984 962 929 906 896
13 896 881 853 834 848 887 917 919 899 874 860 868 903 947 975 972 947 921 903 892 881 873 873 882 900 920 936 941 932 909 881 861 857 865 879 898 923 951 974 981 967 935
8 935 901 880 874 873 870 871 878 880 874 876 903 943 968 968 954 933 899 857 832 841 872 901 925 956 993 1016 1012 986 953 928 914 905 884 845 800 770 765 774 791 821 865 906 923
3I23j1j6LJ9J2j9m3l7rJ0Nj2k2k1j6j4qKJ4K4L1L2K7J8R%j1j6rjj0k7k9j1NMJJ6L9M6L6K8
-2I62L0K3lk9l3j5PJ8J6OLQK2K3Rj2k1k0j8j8j6j1j0j5j8k0k6l2k3nJ1J6K0K9L1J6rk1k0j0
-7H45nlpj2j4mJ0J7Prj3nQJ1OklJOJ0J6J8J4Mj0j9k3j7j1rj5qJ7M4M2Qk1k1lKj0k3k0lJ4K0
-13H30J3%mMJ4J6J6J7J6J3J4J9K0NroJrl3m0k1%NkjJjnKPjqML2M3K7Krpj1j7j6nKlj6k4j8
-19H57jK2L4L2J4mj6j8j5qMK1K3Oj5k4j8j3j0pjmj1j2KJ3J2J2K6M3M4K7Mj2j9j7pMRJ1J2M
-24A004j5l6m3k9j0MJ4K1K1J4MJlnj2k2l6m2l6k5k5k9j8RL4L4J5jnJJ1J7J5J1J1J4J5J4J9
-29I11K7K3%j9j6JR%j0nRJ6Rnj6k2j8rKJ2J1LljKj1l2l8k1JJ1RJ1J0Nklnj1j4kJ7K3J4NKn
-34H75j4rRK3J0j1j6lJ2J8J7J2Njjmj3k3k2j5j0jJ6L1K7J3OJ0J1jj2pOOj1l0l1j5NJ3KrlK4
$$ plain form
3 923 912 896 899 918 930 911 868 831 822 832 837 825 803 782 766 752 744 746 760 784 815 847 874 892 901 901 890 874 865 864 854 827 798 787 792 796 797 813 852 898 934 962
-2 962 992 1015 1012 983 950 935 942 960 976 982 985 993 1015 1038 1047 1035 1014 994 976 958 942 931 921 906 888 868 842 810 787 782 793 809 829 858 889 905 896 875 855 845
-7 845 840 837 830 818 804 800 810 827 834 825 812 807 815 826 832 830 827 828 834 844 860 878 892 896 886 867 844 827 816 807 792 784 801 845 887 895 874 853 850 852 842 819 799 796 810 830
-13 830 843 843 839 843 857 873 889 906 922 935 949 968 988 993 984 978 979 970 937 897 876 876 881 879 878 879 878 873 875 882 881 873 877 909 952 979 981 972 965 954 937 921 916 918 915 899 875 857
-19 857 856 878 912 944 958 954 938 920 905 897 901 922 945 951 936 912 894 881 871 864 863 859 848 836 838 851 863 875 901 944 988 1015 1019 1007 988 971 964 968 977 988 1000 1004
-24 1004 989 953 910 881 871 875 889 910 931 945 949 950 947 942 930 908 872 830 794 769 744 715 697 706 740 774 789 788 783 784 795 812 827 838 849 863 878 892 911
-29 911 938 961 961 942 926 927 936 936 926 921 930 946 955 950 934 912 894 885 887 899 910 913 910 909 911 900 868 830 809 810 821 830 841 851 856 854 851 846 835 821 819 836 859 873 878 880 875
-34 875 861 852 861 884 894 883 867 864 876 894 911 923 928 927 926 922 909 886 864 849 839 838 854 885 912 925 931 941 952 951 939 932 938 944 933 903 872 857 862 875 877 868 865 889
-40H89M2L3J1kkqk4l5l0j3NJ9K8K3Mj2j2kjqj3j5j5j4kPMj0j6j0JLkopnOK1J8MmQJ9Rj0j1
-45H65LJ1PJN%j7l0k1%J7J6RNM%j5k6j8NJ9J1pj3ooj4j1KJ0PMQOoj2NK3K2RLQOj3l4l6j9l
-51G84kj8k5nK8M8M2L4L6L4Ol2l9j2J8K3QklKRJ4Opj1JJ2Mj7l4l7k8qJ7L6L8K7J0mj3j7j6
-56I07j2oJPJ0J1QONLmj7k2j1RJ4lk5j9OK5K1Nmj0j1jJ7K6J8Mpj5k3k3j4j1j8k1nJ1Qj0j9
-62H11j5j1j3j1mmj3j6oRJ5J0M%LJ5K4J9NKJ8L6L3J0j7l0l6l9l9l0qJ4K9L3L5M0L8K2kj3j0
-67I08%Lkj2k7m1l6j3RJ3OKKpk5l3j9NK1K0RkoolnmkMRJ0Olj1j6j5rjNKj5k9k4PL8M4K0qj1
-73G58J3L7M2K5R%ok5m8n8m1oL1M9M0J3mOL1M0K3jmJ1J8Oj6l4m2l3j6JJ4J8J0ok1k1qJjlR
-78H11K3K1Oqj6j8j4NK5L1K0J3J0Kj9l9m9m4k7%K6K7Mj8j7jJ0J6K5L4L3K1J3Qmk0l4l9l6k8
$$ plain form
-40 889 931 964 975 973 971 963 939 904 874 861 866 885 913 936 940 928 916 914 913 905 892 877 862 848 846 853 857 847 831 821 822 825 823 817 810 805 811 832 850 854 850 858 877 886 876 865
-45 865 868 879 886 887 892 892 875 845 824 824 841 857 866 871 875 875 860 834 816 821 840 851 844 831 825 819 805 794 796 806 813 817 825 831 825 813 818 841 863 872 875 883 889 876 842 806 787 784
-51 784 782 764 739 734 762 810 852 886 922 956 962 930 891 879 897 920 928 926 923 925 934 948 954 947 936 937 949 953 936 902 865 837 829 846 882 920 947 957 953 940 923 907
-56 907 895 889 890 897 907 918 926 932 937 940 936 919 897 886 895 909 906 881 862 868 893 914 919 915 905 894 893 910 936 954 958 951 936 913 890 876 865 847 826 821 832 840 830 811
-62 811 796 785 772 761 757 753 740 724 718 727 742 752 756 756 759 774 798 817 822 824 842 878 911 921 904 874 838 799 760 730 722 736 765 798 833 873 911 933 931 918 908
-67 908 908 911 909 897 870 829 793 780 789 802 808 810 812 805 780 747 728 733 754 774 783 781 775 769 766 761 757 755 759 768 778 784 781 770 754 739 730 729 734 736 721 692 668 675 713 757 777 769 758
-73 758 771 808 850 875 884 884 878 853 805 747 706 700 731 780 820 833 829 835 866 906 929 928 924 935 953 959 943 909 867 834 818 819 833 851 861 855 834 813 805 806 805 802 811
-78 811 834 855 861 853 837 819 805 810 835 866 886 899 909 911 892 853 804 760 733 733 759 786 790 772 755 754 764 780 805 839 872 893 906 914 910 890 856 817 781 753
-83G53qJ9L0K0jj4j3nRK2K1Oq%J7K0MqkPMKJ3L1K9Kk9m4m2l3j6NJ8J1qk1k3j7lJ2J8NplJ2
-88G85J8J6J9L1K8Mj5j3kJjJ2K7K0pk0oJ0Mj4k2j3orj5j1kRJ3J3RJrj9k1j3KJ6K4K5K3J5N
-94I12JNJ1J4J1jj6k7k2pjj1k2j6OK5L0K4J6QKlpqollpj0qrj9l0l0j7ljMJ7L5L7K1mj8j8m
-99H48J2J7Lj9k6j3JLlmoj3j7JL1M2K1j2l6m9m4j5K8M2Rl6l9LM1M1K0ONMPK0K8J8nk3k4j3
-104H54kKpj5pJ6K6J4%NJ8J4jj1j2j7k6k6j3mjRK0J6nj9j3j1k2k7qK3L3K8K4K4Oj9k8j4OJ4
-110H44K0K5J5qj7%K7L4K2Qjj5l0l5k2KJ9K4Qj8l4k1JMj4k6j8%QJ0J4J4jj7k1j3kJ1K5K9J9
-115H70OPJ9J4pk3j8rrrJJ2J1jnkJ%MJ2J7J4Lqj8j3J2L8M1K0mj2pLJ1J3jk2l0k0qj2j8nK3
-120H91L9L5K2Nk2n1n9l2jLj5k2oJ0Prj7j6j0JJ7K4J8Mloj4k2j6NK6L3L1L0J9ml1l7k1%J4
$$ plain form
-83 753 745 764 794 814 813 799 786 781 790 812 833 839 831 831 848 868 872 864 862 869 873 875 888 919 948 950 921 877 835 802 786 791 809 820 812 791 768 751 748 760 778 783 776 773 785
-88 785 803 819 838 869 897 901 886 873 871 872 871 883 910 930 923 903 897 907 911 897 875 862 856 847 832 821 819 828 841 854 863 864 855 836 815 802 804 820 844 869 892 907 912
-94 912 913 918 929 943 954 953 937 910 888 881 880 869 847 831 837 862 892 916 932 940 942 939 932 924 918 915 912 905 895 887 878 859 829 799 782 779 778 782 799 834 871 892 888 870 852 848
-99 848 860 877 880 861 835 822 823 826 823 819 813 800 783 784 815 857 878 866 830 781 737 722 750 792 801 765 726 729 770 811 831 837 842 846 853 873 901 919 914 891 867 854
-104 854 852 854 847 832 825 841 867 881 881 886 904 918 917 906 894 877 851 825 812 808 807 816 836 852 847 828 815 804 782 755 747 770 803 831 855 879 885 866 838 824 830 844
-110 844 864 889 904 896 879 879 906 940 962 970 969 954 924 889 867 869 888 912 920 902 868 847 848 852 838 812 794 794 802 812 826 840 839 822 801 788 786 797 822 851 870
-115 870 876 883 902 916 909 886 868 859 850 841 842 854 865 864 859 857 858 858 862 874 891 905 908 900 882 869 881 919 960 980 976 964 957 960 971 984 983 961 931 911 903 891 873 868 891
-120 891 930 965 987 992 970 919 860 828 827 830 815 793 787 797 804 795 778 762 752 753 770 794 812 816 813 807 793 771 755 760 786 819 850 880 899 895 864 827 806 806 820
-125H20J9K2J9Nj4k3j1J3J7nk8j8J5K7ll4k8OK8K6J9J6J0%NK5L8K0j2l8m3l0qJ0RklJ3K5J6
-130I23kj7l0l6k6%K2K0RKok5l4j5K4M8M4K6Mk1l7l0j3nj1lK1K9Rj8k1oKoj4j5lJ7L8M1J5
-135I00j6k4oJ3K0J6J2Jj7l0l3k3j2lKOJ6K8L6L2J9Kj4k6l0k2qNJ0RNlj0j8k0pJ9L8L1Lj5
-140H86rOJk3m0l4j3KORRNklLJ4K2K5K2J6J0PNjj6l3m1l9l2k4j4NK6M2M2K8Rjmj2k5l0j1J9
-145H12K9Pk0k1jOlj4j0kKJ0K2K9K2Pkrj2pQJ8Oj9l4k9j5JRJ0QJ0J3J0NOJ2Orj1RK8J2k3l7
-151H39k2%Lmpqj8k7j9PL0L2J7%nQK0K1J3Nkj2k1j8kJ1J4J2J1Lj2k0j1jqk3l0k2qMJ8K8K7
-156H23J5LJNRPLMJ0J3PllNPrk5k4pJ2K0J5lk2k7j2PJ4J0Mlj6k7k3pLkj0oMJ6K1K0J0lj4l0
-162G92m8n5l1J7N7N6K1j0j6plojJ9L4K8J0MJ1J3kj5qJ4K5K2J1Nmj3k0k2k6l2l1k3j4rkPR
$$ plain form
-125 820 839 861 880 885 871 848 837 850 867 862 834 816 831 858 855 821 793 799 827 853 872 888 898 898 903 928 966 986 974 936 893 863 855 865 874 872 869 882 907 923
-130 923 921 904 874 838 812 812 834 854 863 865 859 834 800 785 809 857 901 927 931 910 873 843 830 825 814 811 832 861 870 852 831 825 827 821 807 792 789 806 844 885 900
-135 900 884 860 854 867 887 903 915 916 899 869 836 813 801 798 800 806 822 850 886 918 937 939 925 899 869 847 839 844 854 863 868 865 855 837 817 810 829 867 898 901 886
-140 886 877 883 884 861 821 787 774 776 782 791 800 805 803 800 803 817 839 864 886 902 912 919 924 923 907 874 833 794 762 738 724 729 755 797 839 867 876 875 871 859 834 804 793 812
-145 812 841 848 828 807 806 812 809 795 785 783 785 795 817 846 868 875 873 864 852 845 853 871 877 858 824 795 780 781 790 800 808 818 831 841 846 852 864 870 861 850 859 887 899 876 839
-151 839 817 817 820 816 809 801 783 756 737 744 774 806 823 823 818 826 846 867 880 885 883 871 850 832 830 841 855 867 878 881 869 849 838 837 829 806 776 754 746 750 768 796 823
-156 823 838 841 842 847 856 863 866 870 880 893 900 897 894 899 906 897 872 848 841 853 873 888 885 863 836 824 831 845 855 859 856 840 813 790 783 786 784 774 768 772 788 809 829 839 836 822 792
-162 792 744 689 658 675 732 788 809 799 783 776 773 767 766 785 819 847 857 861 872 885 883 868 860 874 899 921 932 937 933 920 900 878 852 820 789 766 752 743 741 748 757
-167G57PPJ6K6K3J3Llprj1j8l0l7k5jK5M3M5L4Pj9l3k4OL4M5L6J5rk6l3k2%J2Jk1k7j1MOM
-172H03RJ8K0J5QKpj6j9k3k4k2j0LJ4K3K7K7K5K8L9M0K2j4m7o0m7k1JJj6l0k5mJ0PklRK4K6
-177H11Rj2j7mMmj1JK8M4L8J8mj4j4nJ%pj0rj1j1oKONLjj0k2k5j5ol%J1K4K4Qrj4mJ0J5J3
-183H27J1J3J6J5J5K2K3Pj9l5l2j7%QQjj2j2rj3k5l2l0k2j2PK3K5Prj3rmQK9M0L2J2%rk0k9
-188G84k2%J8K6K8K5J0rj3jP%j2qMJ1J3J5J4jk5m0l6j5OJ5Rqk8l9l3k1nQJ5J3Loj1j1rlNJ0
-193F83J0OLmrmJ7M1M2J7nJK4L3J4oqjlj5k3k2k0j9j1OJ8J6RPNoj4nJ1Rj2l0k2JJ7J8J5J3
-199G97J1J1J5J7Mk0l8l8k0JK0L4L7K1ok4k0kRNpnJ3K6J4j2k9k5j0lKJ1K0J7Q%kmqoKJ1J4
-204H41J2%j5j5RL7L7J0j3j2l%nmoj7l0k5pQP%j%mj0j2lJ1J9J3nj8j2LJ1OOJ9L3L2J4%lJm
$$ plain form
-167 757 764 771 787 813 836 849 852 849 842 833 822 804 774 737 712 711 736 779 824 858 865 846 813 789 795 829 874 910 925 916 890 857 835 835 847 848 827 800 789 793 799 803
-172 803 812 830 850 865 873 875 868 852 833 810 786 764 754 757 771 794 821 848 873 901 940 980 1002 988 941 881 834 813 814 815 799 769 744 740 750 757 755 752 761 785 811
-177 811 820 808 791 787 791 787 776 777 805 849 887 905 901 887 873 868 869 869 862 852 843 832 821 815 817 823 828 831 830 820 798 773 758 752 749 749 760 784 808 816 807 793 789 799 814 827
-183 827 838 851 867 882 897 919 942 949 930 895 863 846 846 854 862 861 849 837 828 815 790 758 728 706 694 701 724 749 756 747 734 725 721 729 758 798 830 842 842 833 813 784
-188 784 762 762 780 806 834 859 869 860 847 846 853 853 841 833 837 848 861 876 890 889 864 824 788 773 779 794 803 795 767 728 695 674 669 677 692 705 708 702 691 680 671 668 673 683
-193 683 693 699 702 698 689 685 702 743 785 802 797 798 822 855 869 863 855 854 851 836 813 791 771 752 741 747 765 781 790 797 802 796 782 777 788 797 785 755 733 734 751 769 784 797
-199 797 808 819 834 851 855 835 797 759 739 740 760 794 831 852 846 822 802 800 809 814 807 802 815 841 855 843 814 789 779 776 778 789 809 826 834 834 832 828 820 814 816 827 841
-204 841 853 853 838 823 832 869 906 916 903 891 888 888 883 879 873 856 826 801 794 802 809 809 808 808 804 794 782 779 790 809 822 817 799 787 790 801 807 813 832 865 897 911 911 908 909 905
-210I05j7k3j5kjj6k8k3j2m%NNKkJMlpJ1L7M3K2RJ6K7J8%mOJ2Pkj3k6l2k3qkj1j8j2%J5K8
-215H69L7K9RoJK1L0K2jk1l4l3k6j9j2jJ1J9J8J3J0Kj7m4n6m5k0OK0K3J6QRJ8K2Qj3j6MK3
-220H84J9lk0k1j5j3j6j2oj0k0k9k3pJ3K8L2L0K6J8Lk5m1k7J2L5K8OkKnj8k4j5j0j5j4NK8
-225G78L7K8J8J0kj7k1j0J2L1L2J3j8l7l2j6npj5j8k2k7k8k0lK0M2M3J9mkK5M5M1K1Nj0k0
-229H86j5NJ7Lj9k4j8j7k1j6kOMOJ5K0J4QQOlrrqj6k2j5jRPnj5qJ1K6J4j6l9m0k8j4KJ4K3
-235G24K7L5M2L6J6lnqj7k8k4j5j2j1%J4J8K1K9L5K0mj2lMmpOJ4Oj3k0k0j7j1mJ%OK1L0J4
-240H81j2k7k8l1l6l3j4OJ1NkkmmkNJ1J6J5Rmj2j1jPJ0KomJ1K9L0Rj9k5lK3K6Oj9l1k9j9r
-245G25lnj2j1MK1K7K2J7J4J2OLMKpj8j9j2kOJ0J2QRJ4K2J6nl0m3l4j6kLPJ1J6J8J6J2Jqm
$$ plain form
-210 905 888 865 850 848 847 831 803 780 768 764 764 769 774 776 774 775 779 776 769 780 817 860 882 891 907 934 952 952 948 954 966 973 971 958 932 900 877 869 867 856 838 826 826 841 869
-215 869 906 935 944 938 939 960 990 1012 1011 990 956 923 897 878 866 865 876 895 913 926 936 938 921 877 821 776 756 762 782 805 821 829 838 856 878 886 873 857 861 884
-220 884 903 900 880 859 844 831 815 803 797 787 767 738 715 708 721 749 781 811 837 855 858 833 792 765 777 812 840 846 844 846 841 823 799 784 774 759 745 750 778
-225 778 815 843 861 871 869 852 831 821 833 864 896 909 891 854 822 806 801 794 779 761 739 712 684 664 661 681 723 766 785 781 779 804 849 890 911 916 906 886
-229 886 871 876 893 896 877 853 835 818 797 781 779 785 789 795 810 830 844 852 860 866 863 854 845 837 821 799 784 783 792 799 794 779 771 782 808 822 806 767 727 699 685 687 701 724
-235 724 751 786 828 864 880 877 872 864 847 819 795 780 768 757 757 771 789 810 839 874 894 890 878 875 879 875 868 874 888 894 881 861 841 824 813 809 810 810 816 837 867 881
-240 881 869 842 814 783 747 714 700 706 717 722 720 718 714 710 708 713 724 740 755 764 760 748 737 736 743 753 755 749 745 756 785 815 824 805 780 777 800 826 832 813 782 753 734 725
-245 725 722 717 705 694 698 719 746 768 785 799 811 817 820 824 826 819 801 782 770 768 774 784 796 804 813 827 849 865 860 830 787 753 737 735 738 745 756 772 790 806 818 819 811 807
-251H07J9L9L4Nk6l6k5lJ3J7RMPRQMLlj8l1k7qPJ0J2K0J7ml2m3l1oJ7K4J2rk3k6k5k9k8j5
-256F49LJ6K6L4L3J2j0rK0M5M4K3kj6k2k4j8j0l%OJ3K0J6Krj0rj7k5j9LJ7J0j0k2k1j3NK3
-261G51K9J5%lNJ1K1K7K1mk9l6l1l2l1j4J0J7J0RJ8J4lrLJ5RMRJ6J1QJ0Pj1k7k3j3j4j9%K5
-266G76K4j0m0m2k1%J8L6M3M1L4K9J9%k1k7k0rKPOlj3j2pljPJ8J9nl7n2m2k1pLJ1J6PmmPJ8
-271G40K1K1K0J1kpkNJ0J9K7J4j4k5j3nk1m0k5PJ7JpRK1J0qqKOOQJ1Kj5k2j0OJ1jj4j2LJ0
-277G67pk7k5MK4J8mj6j1JPPK%MJ0J0K%%mj0nK1M3L9J1j4k3l0l7l5j2J9L6K5ok9l0j3KPMj
-282G24j1k0j0J0K2J7J3K1K6Nk4l1j3MQPPJj2j6oNJnjPNlnkmj5j7qQJ8J9J6RNMKpj8j7nQJ4
-288G36J7J6J3Njnj0j9k8k2oJ1J7QnqRL2M0K0j0k1j3oj6k4j2J1K5K4J6Lj5k9k4n%rrJ2L8M6
$$ plain form
-251 807 826 865 899 904 878 842 817 814 827 844 853 857 864 873 881 885 888 885 867 836 809 801 808 818 830 850 867 863 831 788 757 751 768 792 804 795 772 746 721 692 664 649
-256 649 652 668 694 728 761 773 763 754 774 819 863 886 884 868 846 822 804 794 791 791 797 810 830 846 848 839 829 820 803 778 759 762 779 789 779 757 736 723 728 751
-261 751 780 795 795 792 797 808 829 856 877 873 844 808 777 745 714 700 710 727 737 746 764 778 775 766 769 784 793 797 806 822 833 841 851 858 847 820 797 784 770 751 751 776
-266 776 800 790 750 708 687 687 705 741 784 825 859 888 907 907 886 859 839 830 832 839 845 842 829 817 810 807 806 813 831 850 845 808 756 714 693 686 689 700 716 723 719 715 722 740
-271 740 761 782 802 813 811 804 802 807 817 836 863 877 863 838 825 820 799 759 734 741 758 759 752 761 782 792 784 776 778 784 790 798 809 811 796 774 764 770 781 780 766 754 757 767
-277 767 760 733 708 712 736 754 750 734 723 724 731 738 740 740 744 754 764 766 766 766 762 752 747 768 811 850 861 847 824 794 757 722 710 729 765 790 784 755 725 712 714 721 725 724
-282 724 713 693 683 693 715 732 745 766 792 797 773 742 729 733 741 748 755 756 744 728 722 727 728 723 722 729 734 731 726 724 720 705 688 680 688 706 725 741 750 755 759 761 754 736 719 714 722 736
-288 736 753 769 782 787 786 781 771 752 724 702 696 707 724 732 727 719 728 760 800 820 810 789 776 770 754 730 718 729 754 778 794 797 782 753 729 724 724 715 706 718 756 802
-293H02L6J9jk6l9k5MK7L3L7L4J6j7m1m2k8qMNrk6k5j3rj7k1j0OJ3K0K7L0K0QJoj2JK7L6J0
-298H41j9j6RK2J1JRJ5J1MJok1k8j8opj2rNJ4J7J3QOQQol4n0l5%K5K1lk5k3%L0L9K1JKJ5K1
-303H60J5J0Ook6l8l5k3j2%J1Qrj8pJ1K4K5K7K4J3pk1k1j1LJ5J7Prj7j1jJpj5rRK5K3J0NQ
-309H54RKopj1k1k6j6lJjLJ2J2Korj3j5JL0M0K0j1k2j7j5k4l0k1qNJ3J7J2QJ1K3K8J6ok1k2
-314G88j6rnkOJ6K4K1Oj1j8j1RK5K4Kk9m6m0k1j1j5k2j4OJ8K0J6J3Oj3k2j1J4K0jk8l5k5j1
-319F18kOJ7K3K2J4Jrj5j4rnopnMJ7K8K1LpKJ3Qj0j3JJ4Rrj9j5jK1L6L7K1%roQK9M5L7Qk1
-324H81k5j0%%LJ0Qoj6j3oj0j7nK0L3J8qj6NK6K5ml1l7k5qOJ9K4J7JnLJ4Mk0l4k8j3pj1j4
-330G48nJ5L3L6K4Lj2j9k0k2k1j1kkqrnrj4qJ1K1Pj1rJlj4j0J5L1K5J4J4K0Ok1m1l9k2mJ2
$$ plain form
-293 802 838 857 856 830 791 766 770 797 830 867 901 917 900 859 817 789 781 785 790 781 755 730 717 708 691 670 660 666 679 699 726 756 776 784 785 779 767 768 795 831 841
-298 841 822 806 815 837 848 849 858 873 884 888 889 883 862 834 816 810 803 791 782 787 801 818 831 839 845 853 861 855 821 771 736 736 761 782 779 754 731 731 761 800 821 822 824 839 860
-303 860 875 885 891 885 859 821 786 763 751 751 762 770 761 743 736 747 771 796 823 847 860 853 832 811 800 803 818 835 842 833 816 805 804 805 798 783 774 783 808 831 841 846 854
-309 854 863 865 859 852 841 820 794 778 775 776 775 778 790 802 804 798 789 776 761 762 792 832 852 841 819 802 787 763 733 712 704 709 722 739 751 759 770 793 821 837 831 810 788
-314 788 772 763 758 756 762 778 802 823 829 818 800 789 798 823 847 849 820 774 734 713 702 687 665 651 657 675 695 711 724 730 717 695 684 698 718 717 689 654 629 618
-319 618 616 622 639 662 684 698 699 690 675 661 652 647 641 634 629 633 650 678 699 702 695 697 710 718 708 695 696 710 719 710 691 676 675 696 732 769 790 790 781 775 783 812 857 894 902 881
-324 881 856 846 846 846 849 859 867 861 845 832 826 816 799 794 814 847 865 857 841 846 872 897 893 862 825 800 792 798 817 841 858 859 854 857 871 875 855 821 793 780 773 762 748
-330 748 743 758 791 827 851 854 842 823 803 781 760 749 747 745 737 728 723 714 700 692 703 724 731 720 711 712 709 695 685 700 731 756 770 784 804 810 789 748 709 687 683 695
-335F95J7K0K4L0K1ok4j2J7K9J4oj1qj1j7j6j8k4k5j1J2L3M2L8K5J2NLKJLMqk6l5k4pnj3j6
-340G24oPJ6J8J5Pkj2k0l1l7k7nK3L7L3J4KRK7L5K4Qmj4k6k9j0J7K7J4krj3k0k1j1KNLMJj0
-345G63j9rJ3K5J7OPK0K4J3lj1qj0k4m0m2k5lOKKJ4K4J9lk4k7j1QJ1mk1j4J1L0J9pj6%K2L2
-350G67L1L1K9J9Lj0k0k5k5j0NPj4l6m2l7k8j3J5L9L8J4n%K3L3K2%k0l5m4m5l7k0KK4L3K4
-355F93jj6j4mjkLJ5K0J2JljMJ0J6K1K0J4%j9k9k2nPQJ3K5L3K1Mmlqj9j9jJ3J1krn%QJ4Qj2
-361G95k8k3lRJqnNOJNJ6K1Pj2k3j7j2j4j9j2PK0K0J5J6J7Rj2l0l2j5OK0J9J0LJjopJQPkq
-366G56pllolPK0K5K3J5QL%oomkmmmoj4j5jJ9K4J1kkMJj2k0k3j9oPJ0ok3j8QK5J5j0k4k2r
-372F97RK4K5Nk2l2k1jNMMQJ1J3J7J8Roj3q%K%LNKkjjlrj1rqj3k1k5k0JK9M6L4Nj9k2rLNM
$$ plain form
-335 695 712 732 756 786 807 801 777 765 782 811 825 819 808 800 789 772 756 738 714 689 678 690 723 765 803 828 840 845 848 850 851 854 858 850 824 789 765 758 753 740 724
-340 724 718 725 741 759 774 781 779 767 747 716 679 652 647 670 707 740 754 756 765 792 827 851 859 855 841 815 786 776 793 820 834 832 823 810 790 769 758 760 765 768 772 773 763
-345 763 744 735 748 773 790 796 803 823 847 860 857 846 838 828 804 764 722 697 694 700 702 704 718 742 761 758 734 707 696 704 715 711 690 676 687 717 736 729 713 713 735 767
-350 767 798 829 858 877 880 870 850 825 800 790 795 802 788 752 710 673 645 632 647 686 724 738 733 733 756 789 811 811 791 756 712 667 630 610 612 636 669 693
-355 693 692 676 662 658 657 655 658 673 693 705 706 703 702 706 716 732 753 773 787 787 768 739 717 712 719 727 740 765 798 819 823 819 816 808 789 770 769 782 793 791 782 777 777 785 799 807 795
-361 795 767 744 741 750 751 743 738 743 749 750 755 771 792 799 787 764 747 735 721 702 690 697 717 737 752 768 785 794 782 752 720 705 711 731 750 760 763 764 763 757 750 751 759 766 764 756
-366 756 749 746 743 737 734 741 761 786 809 824 832 835 835 829 823 819 817 813 809 805 799 785 770 769 788 812 823 821 819 823 824 812 792 769 750 744 751 761 755 732 714 722 747 762 752 728 706 697
-372 697 706 730 755 760 738 706 685 684 689 693 697 705 716 729 746 764 773 767 754 746 746 748 748 751 756 758 756 755 754 751 742 731 722 714 701 680 655 635 636 665 711 745 750 731 709 700 703 708 712
-378G12NNKqj1%K3L3J7j4l9m2k8mJ9K2Nj2oJ7K3J0lJNlj1pLKmlkj0j9pK4M4L9K2Ork2k5rJ2
-384G53K5K6K1J0mj8k2j3QK6K4Kk2k2pkj4k7k9k9l3k8%L4N3N0M1L1J2j3k8k5mJ6K7J9j4n7
-388G67p7n3qJ9J5jq%J4K9M2M3K8J1J0K0J7ql2l5k0mRJ3Lk4m7m5k4pjOK4L9L9L3K2Nj6k3j4
-393G61nj0j4jJ3J1j0j8oJ3K5K7K3J2jj2k0k8l3k0%J2QMLpk6l6k2MJ5J4J8K6K1lj4JK3K0n
-398G63k0pJ4J6Lqqj1j5pJ7L9L5Pj9k5j5mJmj8l6m5l8k0JJ5K1J9J2PJ2J9K1J8J1jj5k1j1L
-403G06%j5k2lL1N4M7K0rk2j5LK1K5K1J5J3Npj6j3jOKpmPJ1%j8k4j9r%J7L2K8ml9n3m0j8k
-409G04J2J4kk5k9j1PQKjLJmpj2j8j5jJ3J0JLJ8K5J1j3l0k8j0J9M3M8K7ol3m5l9j6J0K4K6
-414F84L0L9M0K2lj4j0ljoj6k7l2k4qQK3L4L7K6Qj4l2l7k2NJ9J2LMPnj9j8nqk4l0k2j5k4k5
$$ plain form
-378 712 717 722 724 716 705 705 728 761 778 764 725 683 655 651 670 692 697 685 679 696 719 729 726 727 732 729 718 711 714 716 712 709 707 697 678 671 695 739 778 800 806 797 775 750 741 753
-384 753 778 804 825 835 831 813 791 778 786 812 836 838 816 794 787 785 771 744 715 686 653 625 625 659 712 762 803 834 846 833 805 780 776 792 819 838 824 767
-388 767 690 637 629 648 663 662 654 654 668 697 739 782 810 821 831 851 868 860 828 793 773 769 778 791 794 770 723 678 654 647 646 652 676 715 754 787 809 814 798 775 761
-393 761 756 746 732 731 744 755 745 727 721 734 759 786 809 821 820 808 788 760 727 707 707 719 727 731 734 727 701 665 643 647 662 676 694 720 741 738 724 725 748 768 763
-398 763 743 736 750 766 769 761 753 742 727 720 737 776 811 818 799 774 759 755 756 752 734 698 653 615 595 596 611 632 651 663 670 682 701 722 740 751 750 735 714 703 706
-403 706 706 691 669 666 697 751 798 818 809 787 772 775 796 821 842 857 870 875 868 852 839 838 844 846 839 835 842 853 853 835 811 792 783 783 800 832 860 856 817 764 724 706 704
-409 704 716 730 728 703 674 663 670 678 680 679 682 683 679 672 660 642 627 626 639 649 650 653 671 696 707 694 664 636 626 645 688 736 763 757 724 679 640 624 634 658 684
-414 684 714 753 793 815 812 798 788 785 784 778 762 735 703 679 671 679 702 736 773 799 807 793 761 724 702 707 726 738 741 745 752 747 728 710 705 697 673 643 621 606 582 557
-419E57%M2O4M9J6mKJ9K0Kj8k1j6j3mJ2K2Pj2nL3O0M8J3j0rJRJ0jj6k8k7k4k3j8lPmk5l2j6
-424F64LPlj2j3mPJ0PMLJnmJ1K4K3Oj5k9l2j7J1L8M5L2J5OK%LPLqj7j9j7j4ojqk3k4oJ5J6
-430F86KlOJ4Pj1k6k4pJ3K1J5KonKJ0J5J6J7J9K5K6J5pk0j6mkj3j4J0L8L9J4nlPPJORjj7k2
-435H36j8j6j6qMpl8n7m1j1Llqnmqj2pNJ2J3J1J2J2NpnJ7L7K9%k7l5l2k2JL6N2L9J5J0K0K6
-440H08J9Nrk2k9k3qPJ4J4Mqj5j7j1lNOqk5j9J0L2K3lj4oKJQK5L1J5j0k1j9j4j2nPJ3Rkj2
-446G43j4j3nRJ8J3ok3k0jQkj5j1OJ5J2OMjj0j9j8pQJ8J6MlJ0K7K3OlQJ5J2PJ0Rkj5j3qj5
-451G83k6k3qLKLQJ2Nln%NJj1k1k0oOOqj9j5MK6L2J4j6l0j8MJ3Lmmok1l3k8qQK0L0L6K5Kq
-457G10KJ5J0mnRJ5Lj2j2ljj0j8j9k0k1j2PK3K8K4J6Lj2j9j3oqj5j6pJjlLJ9L1K4Nj1pOJ2
$$ plain form
-419 557 557 599 663 712 728 724 726 745 765 767 749 728 712 699 695 707 729 736 724 719 752 812 860 873 863 854 855 864 874 873 857 829 802 778 755 737 734 741 737 712 680 664
-424 664 667 674 671 659 646 642 649 659 666 670 673 674 669 665 676 700 723 729 714 685 653 636 647 685 730 762 777 783 785 785 788 795 798 790 773 754 737 723 717 716 708 685 661 655 670 686
-430 686 688 685 691 705 712 701 675 651 644 657 678 693 695 689 684 686 696 711 727 744 763 788 814 829 822 802 786 782 780 767 753 763 801 840 854 849 846 853 860 861 867 876 875 858 836
-435 836 818 802 786 778 782 775 737 680 639 628 631 628 620 615 611 603 591 584 589 601 614 625 637 649 654 647 642 659 696 725 725 698 663 631 609 610 646 698 737 752 762 782 808
-440 808 827 832 823 801 772 749 741 748 762 776 780 772 757 740 729 726 731 737 729 704 685 695 727 750 747 733 727 729 730 738 763 794 809 799 778 759 745 733 728 735 748 757 755 743
-446 743 729 716 711 720 738 751 745 722 702 701 709 707 692 681 687 702 714 720 724 723 713 694 676 669 677 695 711 715 712 722 749 772 778 775 783 798 810 817 827 836 834 819 806 798 783
-451 783 757 734 726 729 731 734 742 754 759 756 751 751 756 757 746 725 705 699 705 711 703 684 669 673 699 731 745 729 699 681 685 698 701 697 693 687 666 633 605 597 605 625 655 691 716 718 710
-457 710 712 727 737 733 728 737 752 755 743 731 728 727 717 699 680 660 639 627 634 657 685 709 725 728 716 697 684 678 670 655 639 632 633 632 629 632 651 682 706 711 700 693 699 711
-462G11Jj8l2l5k5mJ6K3J6J0J0J0J1J2J2jj9k1oJ0Mj0j2jQQRJ2Lj2k5k6k0qJ1K7L0K8K9L1
-467G67J6j5l2k1JRNNNmk3l1k1kRJ5J4QKOJ9K4J2qj8j1JPMlj0j0ojNO%rj2mRJ9K0K1K1J4l
-473H00k4l2k5j0LOkj6k9l0k0j2j6k2k2qJ1L2M9M9K7mj8nJ4J1oj4j1nj0k0k2j3MJ9K2Rrj2
-478F39LJ9K3J4KkKMmk3l6l1k1j4j0MJ9J6pk2j1J6K9K1J0J1J9K4J6%j3j0%QJ1J5K1J7jj7k0
-483G21j2qomJLLLjqpJNoj9j8mNNNJ6K6K7K6L1L8L6J5j2k4j9oJLOPmk0k9k8l4m6m0qK7L5J7
-489G00Jl%NJ3J6Qpj5k3l9n3m1j3MLJ1L0L7K1MLPKmOJ2jk1j9MJ9J5PMMLJ0K1K4J4Koj1k1k5
-494G08j8nJ1K4K6J8PMLoj8k0j1j0k0k3j1JJpoPJ8K1J2nk4k7j2Lkj1oJ5L0K5Pj%jmjJ7L2L1
-500G72Nk4l6k2JJ4J7J2Moj7k2k1j6j5j6j7j0RL6N5M9K5NLRLrj3nLkj0j3j1j1j5j1LJ3J3M
$$ plain form
-462 711 712 694 662 627 602 598 614 637 653 663 673 683 694 706 718 717 698 677 671 681 685 675 663 662 670 678 687 699 702 690 665 639 619 611 622 649 679 707 736 767
-467 767 783 768 736 715 716 725 730 735 740 736 713 682 661 659 668 683 697 705 707 713 732 756 768 760 742 731 732 739 743 740 730 720 714 713 718 724 724 715 703 699 708 727 747 768 789 803 800
-473 800 776 744 719 709 712 718 716 700 671 641 621 609 593 571 549 541 552 584 633 682 709 705 687 682 696 707 701 687 676 671 661 641 619 606 610 629 651 660 651 639
-478 639 642 661 684 698 700 698 700 704 700 677 641 610 589 575 565 569 588 604 597 575 564 580 609 630 640 651 670 694 710 710 697 687 687 695 706 721 742 759 758 741 721
-483 721 709 701 695 691 692 695 698 701 700 692 685 686 691 685 666 648 644 649 654 659 675 701 728 754 785 823 859 874 862 838 819 813 814 817 823 830 826 806 777 749 715 669 629 621 648 683 700
-489 700 701 698 698 703 716 732 740 733 718 695 656 603 562 549 553 556 567 597 634 655 659 662 669 671 667 673 685 684 663 644 648 667 682 689 693 697 700 710 731 755 769 771 765 754 733 708
-494 708 690 685 696 720 746 764 771 775 778 772 754 734 723 713 693 670 659 660 661 654 648 655 673 694 706 701 677 650 638 641 639 628 622 637 667 692 699 698 698 697 693 692 709 741 772
-500 772 777 753 717 695 696 710 727 739 743 737 720 698 677 661 646 630 613 603 612 648 703 752 777 782 785 794 797 788 775 770 773 771 761 748 737 726 711 700 703 716 729 733
-505G33mj0j0lJ2J8QnlJ5K1PrqQJ3jj8j8mKqk9l6j9J6M7N3L2Kj7k2k2k8m1m4l7k4j3kJ3K8
-510E93L1J9Loonmmj1k4k8j3J4L2K7PppKJ0J2PORJ3RKLJ6K1Jk9m1k7mNJon%LNPJ8L3M3L7J6
-516G78ok0l0l9m2k6JK0K6K5K5K7J9Oqj5j3opj9l2k6qJmj0pMPOQJ8K7K9K4J1j3l1l3j8jRO
-521F63nj7k1kK9M7L8J6knmmnnkJkpnQK5K9J3pj7j2mnj0j5j7j4oJ2L2M2M0L5L7L2Lm0o2m7
-527G60k1j3j8j2kmk6m0l0rmj3j6kJ3J3mj7oK1L8L0J2J1K6L8L4J9Nqj3j1oj4k5k3jJ7J5OJ0
-532G30J7J2oj9j9j1LK2K7Rk0l1j2J5K7J9NmJJ4K2J3mj2mOPL%qk7l9l5j3Jmk2k9j8JJ4J6J8
-537F65K1J8Qlnk%LJ4K2J6J%K2M3M3J9j4m3n7n2l2j9j7j8oJ6L1L5K6J0qj3nKjrqLJ2J8K3K7
-542G86J4j5m6n2l1kOnj2nJ1J6J1RNnk1k0lJ4J3Joj0j7j7nJ0J4PMJ2J5QmrjRRj3m4n3l0LJ9
$$ plain form
-505 733 729 719 709 706 718 736 744 739 736 751 772 779 770 762 770 783 782 764 746 742 744 736 707 671 652 668 715 768 800 802 785 763 741 713 672 628 591 567 554 552 565 593
-510 593 624 643 646 640 634 629 625 621 610 586 558 545 559 591 618 625 618 611 613 623 635 642 648 657 670 679 681 684 700 721 722 693 652 625 621 626 627 621 616 616 619 624 631 649 682 725 762 778
-516 778 772 752 722 683 641 615 616 636 662 687 712 739 758 764 756 741 728 722 715 696 664 638 630 631 627 617 610 614 621 627 635 653 680 709 733 744 731 700 667 649 648 657 663
-521 663 658 641 620 618 647 694 732 748 746 741 737 733 728 723 721 722 720 713 708 716 741 770 783 776 759 747 743 738 728 713 696 682 676 688 720 762 802 837 874 906 909 869 807 760
-527 760 739 726 708 696 694 690 664 624 594 585 581 568 552 550 563 576 572 555 549 570 608 638 650 661 687 725 759 778 783 775 762 751 745 731 706 683 682 699 714 720 730
-532 730 747 759 753 734 715 704 707 729 756 765 745 714 702 717 744 763 768 764 765 779 801 814 810 798 794 800 807 810 810 802 775 736 701 688 689 685 663 634 616 617 631 647 665
-537 665 686 704 712 709 704 702 702 705 719 741 757 758 758 780 823 866 885 871 828 771 719 687 668 651 633 627 643 674 709 735 745 737 724 719 721 720 711 703 706 718 736 759 786
-542 786 800 785 739 687 656 654 660 655 643 638 649 665 676 685 690 685 664 644 641 655 668 669 663 653 636 619 614 624 638 645 649 661 676 684 680 671 670 679 688 675 631 578 548 551 570
-548E70J5J6L1M5M4L2J6Mpqrk3m4m9k7RL2L5L0K9K4Rj1k3j6jLj4k8k2nL%KJ3K0J0kj0j0j3
-553F70j7j8k3k8k5jK3L4K7K3K8L1K1nk4k0NL0L2J1nolpj5j7j4j3j4qLJ1J2J0jj6k6k9k9k5
-557E82j0J8L6K8Kj1kNnk0j6RL5M8L5Ok0k7j9j0j0oQK4K3Oj2k0j6rlKMPJ0Omj2j2roooJRJ3
-563F46J0%j2j7j6rjNRJ0Nmj4j9j3RL7N7N4L0Nj1k1l0l8l2j3%mj8j3J5M0L2jk6k4o%rj9rJ7
-568F02M3M7L4K1K3K2Kk5l2j0J4J4j0l0l2k6k8l4l6k3kJ4J8K0K5L3L2K5K3L1L6K5Lj9l2m1
-573G27l5j8%PJ0K1L5L0%k6k6pOQPROkjL%j5k8k1pjMJ8M1M4K1mpKMoj4rpj7l2l4k0lRJ4J3
-579F99RJ1J5J4PPJ8J9ml8n1l9k4k3j9KK1K1PLJ0J2KlJ0K7L2K2Pok3l6l6k3jJ7J9%k6l8k1
-584F00RJ8Kj0jJ4J0j2k8k3qPJ4J7QmoPK2K3J3KpqLK3L4K2mj1JJ2Qnj4k0k6k4pJ5K1J3Mnk2
$$ plain form
-548 570 585 601 632 677 721 753 769 773 766 758 749 726 682 633 606 615 647 682 712 741 765 774 763 740 724 723 726 712 684 662 657 660 660 662 675 695 705 703 693 683 670
-553 670 653 635 612 584 559 558 581 615 642 665 693 724 745 740 716 696 701 731 763 774 769 763 760 753 738 721 707 694 680 672 675 686 698 708 707 691 665 636 607 582
-557 582 572 590 626 654 656 645 643 648 643 623 607 616 651 699 734 740 720 693 674 664 654 648 656 680 703 709 697 677 661 652 649 651 655 662 672 678 674 662 650 641 635 629 623 624 633 646
-563 646 656 656 644 627 611 602 601 606 615 625 630 626 612 593 580 589 626 683 737 767 772 761 740 710 672 640 627 627 623 605 592 607 647 679 678 652 628 622 622 613 594 585 602
-568 602 645 692 726 747 770 792 794 769 737 727 741 755 745 715 683 657 629 595 559 536 534 548 566 586 611 644 676 701 724 755 791 816 819 800 768 727
-573 727 692 674 674 681 691 712 747 777 777 751 725 718 724 732 739 748 754 752 751 754 754 739 711 690 683 682 686 704 745 789 810 806 799 801 805 799 785 776 769 752 720 686 666 663 672 686 699
-579 699 708 719 734 748 755 762 780 799 795 757 706 667 643 620 601 603 624 645 652 655 665 677 679 676 686 713 745 767 774 768 745 709 673 650 649 666 685 685 659 621 600
-584 600 609 627 629 619 618 632 642 630 602 579 571 578 592 609 617 613 607 614 636 659 672 674 667 659 662 685 719 741 737 726 727 739 747 742 728 708 682 658 651 666 687 700 704 699 677
-589F77m0m3j6K2M2L1PplQPpk4k3pOPNJ4L3L8K1nj7j5j2j0o%%opKJ4J5J1J1J4Jk7n1n1l2j1
-594E66KJ2J6J3LomJNJ2K4L1K3Kj5k4l0l3k6rJ0K2L0L3K4Oj0j3rqoKRRQJ5K3J7lj6j6j5k1
-600F54k6j9omrkJ5K9K8J1mlJ4L0K8J0lnLRJ1J1Moj5j5j7j8j2QK6K3Mj5k9m0m5l5j7JK0L5
-605F29L4Pj6rK5M6M2K2Nj6k9j8QRk2m6k8QJ6rk8j7KPKQK5L7L0Nk3l5l2l2l7l5rK5M2L7K7
-610F57K3K0J4Mlj3k2k1j0MJ1J3Qlj1pKOLNJ0J0ok3k7k4k5k7j8NL2M2L1J1jJNNJ0K4L5K7O
-615G83j0j3qrrqmMJ5K7K7J5Jj4k8l7k8lJ7J6ok9m3m4l1qJ1J7J4J1J0RNJmoLJ9K6J7jj3j7
-620F75j4pPJ5Pj1j9j0NJ1RKlkLRJ3RRJ6K8K8J2j1k2j8rj2k2k0oNKpj3j6j5mJ8K9J6rk3j8
-626F37j2qKJ8K9K5J6Q%qj0rj3k4k8j8mnj3qJ3L0K4%j7j4NK2K3J2mj4j7rRK2J5j0k4rK3M3
$$ plain form
-589 677 637 594 578 600 642 673 680 673 670 678 685 678 654 631 624 630 637 642 656 689 727 748 743 726 711 699 689 683 683 683 677 670 672 686 701 712 723 737 738 711 660 609 577 566
-594 566 568 580 596 609 612 606 602 603 608 620 644 675 698 700 685 661 631 598 572 563 573 595 625 658 682 688 678 665 656 648 642 644 653 662 670 685 708 725 722 706 690 675 654
-600 654 628 609 603 599 590 588 603 632 660 671 667 664 678 708 736 746 743 738 741 750 761 772 776 770 755 740 723 705 693 701 727 750 754 739 710 670 625 590 573 574 594 629
-605 629 663 670 654 645 670 716 758 780 785 769 740 722 730 739 717 671 643 651 667 658 630 613 615 622 624 632 657 694 724 729 706 671 639 607 570 535 526 551 593 630 657
-610 657 680 700 714 718 715 702 680 659 649 653 664 677 685 682 671 664 666 672 675 680 690 700 694 671 644 620 595 568 550 555 587 629 660 671 670 671 676 681 691 715 750 777 783
-615 783 773 760 752 743 734 726 722 726 741 768 795 810 811 797 769 732 704 701 718 734 728 699 656 612 581 573 584 601 615 626 636 645 650 651 647 641 644 663 689 706 705 692 675
-620 675 661 654 661 676 683 672 653 643 648 659 668 670 667 665 668 677 690 699 708 724 752 780 792 781 759 741 732 720 698 678 672 677 679 672 659 643 628 624 642 671 687 678 655 637
-626 637 625 617 619 637 666 691 707 715 715 707 697 688 675 651 623 605 601 596 583 575 588 618 642 642 625 611 616 638 661 673 669 655 638 629 638 660 675 665 641 632 655 698
$$ [...]
-1604F10
##END=	
##END=	
