##TITLE=	1tp8CbC1TuuDQ8GvmNgBDQ.52.ser
TM-VI-104 Mg+Ph-pyrraz. hmbc

##JCAMP-DX=	6.0	$$ MestReNova 14.3.0-30573
##DATA TYPE=	LINK
##BLOCK_ID=	1
##BLOCKS=	2    
##ORIGIN=	Mestrelab Research S.L.
##OWNER=	hrzepa
##$MNOVA/LINK_BLOCK_TYPE=	ITEM	$$ NMR Spectrum
##$MNOVA/ITEM/POLYGON=	(XY..XY)
5321,5835
8722,5835
8722,8208
5321,8208
5321,5835
##$MNOVA/ITEM/Z=	0
##$MNOVA/ITEM/ANGLE=	0
##TITLE=	1tp8CbC1TuuDQ8GvmNgBDQ.52.ser
##JCAMP-DX=	6.0	$$ MestReNova 14.3.0-30573
##BLOCK_ID=	2
##DATA TYPE=	MNOVA NMR VIEW DATA
##DATA CLASS=	MNOVA VIEW DATA
##$MNOVA/2D/THRESHOLD=	2.0273535251617431641
##$MNOVA/ITEM/ZOOM/X=	-0.47501081208716700033,	14.504330000039219684
##$MNOVA/ITEM/ZOOM/Y=	-9.5107036222489718114,	249.98529999918474687
##END=	
##TITLE=	1tp8CbC1TuuDQ8GvmNgBDQ.52.ser
##JCAMP-DX=	6.0	$$ MestReNova 14.3.0-30573
##BLOCK_ID=	3
##DATA TYPE=	nD NMR SPECTRUM
##DATA CLASS=	NTUPLES
##NUMDIM=	2
##ORIGIN=	Bruker BioSpin GmbH
##OWNER=	nmr
##.OBSERVE FREQUENCY=	400.41280287000000726
##.OBSERVE NUCLEUS=	^1H
##.SOLVENT NAME=	Acetone
##.PULSE SEQUENCE=	hmbcgplpndqf
##LONGDATE=	2021/10/20 21:12:18.000
##.ACQUISITIONMODE=	SIMULTANEOUS (DQD)
##$ORIGINAL FORMAT=	Bruker XWIN-NMR
##$MNOVA/SCALES_VERSION=	9
##$PARAMETER FILE=	(acqu2s, ASCII, /private/var/folders/f6/rjf_tdyn2v98c5c0wvkgn4s80000gn/T/1tp8CbC1TuuDQ8GvmNgBDQ/52/acqu2s, 0)
$$ ##TITLE= Parameter file, TOPSPIN		Version 3.2
$$ ##JCAMPDX= 5.0
$$ ##DATATYPE= Parameter Values
$$ ##NPOINTS= 129	$$ modification sequence number
$$ ##ORIGIN= Bruker BioSpin GmbH
$$ ##OWNER= nmr
$$ $$ 2021-10-20 21:31:54.414 +0100  nmr@CZC10666PP
$$ $$ /opt/topspin/data/agmb/nmr/Oct20-2021/52/acqu2s
$$ $$ process /opt/topspin3.2/prog/mod/go
$$ ##$ACQT0= 0
$$ ##$BF1= 100.683175
$$ ##$FnMODE= 1
$$ ##$NUC1= <13C>
$$ ##$NusJSP= 0
$$ ##$NusT2= 1
$$ ##$NusTD= 128
$$ ##$O1= 12080.308799824
$$ ##$SFO1= 100.6952553088
$$ ##$SW= 259.972631192251
$$ ##$SW_h= 26178.0104712042
$$ ##$TD= 128
$$ ##END=
$$ 
##$PARAMETER FILE=	(acqus, ASCII, /private/var/folders/f6/rjf_tdyn2v98c5c0wvkgn4s80000gn/T/1tp8CbC1TuuDQ8GvmNgBDQ/52/acqus, 0)
$$ ##TITLE= Parameter file, TOPSPIN		Version 3.2
$$ ##JCAMPDX= 5.0
$$ ##DATATYPE= Parameter Values
$$ ##NPOINTS= 12	$$ modification sequence number
$$ ##ORIGIN= Bruker BioSpin GmbH
$$ ##OWNER= nmr
$$ $$ 2021-10-20 21:31:58.897 +0100  nmr@CZC10666PP
$$ $$ /opt/topspin/data/agmb/nmr/Oct20-2021/52/acqus
$$ $$ process /opt/topspin3.2/prog/mod/shimcntl
$$ ##$ACQT0= 1000000
$$ ##$AMP= (0..31)
$$ 100 100 100 100 100 100 100 100 100 100 100 100 100 100 100 100 100 100
$$ 100 100 100 100 100 100 100 100 100 100 100 100 100 100
$$ ##$AMPCOIL= (0..19)
$$ 0 0 0 0 0 0 0 0 0 0 0 0 0 0 0 0 0 0 0 0
$$ ##$ANAVPT= -1
$$ ##$AQSEQ= 0
$$ ##$AQ_mod= 3
$$ ##$AUNM= <au_zg>
$$ ##$AUTOPOS= <52 >
$$ ##$BF1= 400.41
$$ ##$BF2= 100.683175
$$ ##$BF3= 400.41
$$ ##$BF4= 400.41
$$ ##$BF5= 400.41
$$ ##$BF6= 400.41
$$ ##$BF7= 400.41
$$ ##$BF8= 400.41
$$ ##$BYTORDA= 0
$$ ##$CAGPARS= (0..11)
$$ 0 0 0 0 0 0 0 0 0 0 0 0
$$ ##$CFDGTYP= 0
$$ ##$CFRGTYP= 9
$$ [...]
$$ 0 0 0 0
$$ ##$ShimPowMaxUC= (0..63)
$$ 130000 130000 130000 130000 130000 130000 130000 130000 130000 130000 130000
$$ 130000 130000 130000 130000 130000 130000 130000 130000 130000 0 0 0 0
$$ 0 0 0 0 0 0 0 0 0 0 0 0 0 0 0 0 0 0 0 0 0 0 0 0 0 0 0 0 0 0 0 0 0 0 0 0
$$ 0 0 0 0
$$ ##$ShimPowMaxUG= (0..63)
$$ 524287 524287 524287 524287 524287 524287 524287 524287 524287 524287 524287
$$ 524287 524287 524287 524287 524287 524287 524287 524287 524287 0 0 0 0
$$ 0 0 0 0 0 0 0 0 0 0 0 0 0 0 0 0 0 0 0 0 0 0 0 0 0 0 0 0 0 0 0 0 0 0 0 0
$$ 0 0 0 0
$$ ##$ShimPowRcbType= 3
$$ ##$ShimPowRes= (0..63)
$$ 1e-20 1e-20 1e-20 1e-20 1e-20 1e-20 1e-20 1e-20 1e-20 1e-20 1e-20 1e-20
$$ 1e-20 1e-20 1e-20 1e-20 1e-20 1e-20 1e-20 1e-20 0 0 0 0 0 0 0 0 0 0 0 0
$$ 0 0 0 0 0 0 0 0 0 0 0 0 0 0 0 0 0 0 0 0 0 0 0 0 0 0 0 0 0 0 0 0
$$ ##$ShimPowRng0= (0..63)
$$ 1 1 1 1 1 1 1 1 1 1 1 1 1 1 1 1 1 1 1 1 0 0 0 0 0 0 0 0 0 0 0 0 0 0 0 0
$$ 0 0 0 0 0 0 0 0 0 0 0 0 0 0 0 0 0 0 0 0 0 0 0 0 0 0 0 0
$$ ##$ShimPowRng1= (0..63)
$$ 1 1 1 1 1 1 1 1 1 1 1 1 1 1 1 1 1 1 1 1 0 0 0 0 0 0 0 0 0 0 0 0 0 0 0 0
$$ 0 0 0 0 0 0 0 0 0 0 0 0 0 0 0 0 0 0 0 0 0 0 0 0 0 0 0 0
$$ ##$ShimPowRng2= (0..63)
$$ 1 1 1 1 1 1 1 1 1 1 1 1 1 1 1 1 1 1 1 1 0 0 0 0 0 0 0 0 0 0 0 0 0 0 0 0
$$ 0 0 0 0 0 0 0 0 0 0 0 0 0 0 0 0 0 0 0 0 0 0 0 0 0 0 0 0
$$ ##$ShimPowRng3= (0..63)
$$ 1 1 1 1 1 1 1 1 1 1 1 1 1 1 1 1 1 1 1 1 0 0 0 0 0 0 0 0 0 0 0 0 0 0 0 0
$$ 0 0 0 0 0 0 0 0 0 0 0 0 0 0 0 0 0 0 0 0 0 0 0 0 0 0 0 0
$$ ##$ShimSysFunc= (0..63)
$$ 1 2 3 4 5 7 9 11 15 16 8 10 12 14 6 17 13 18 19 20 0 0 0 0 0 0 0 0 0 0
$$ 0 0 0 0 0 0 0 0 0 0 0 0 0 0 0 0 0 0 0 0 0 0 0 0 0 0 0 0 0 0 0 0 0 0
$$ ##$ShimSysMatrix= 0
$$ ##$ShimSysType= 1
$$ ##$TFXNUM= 0
$$ ##$TRIPLO2= 0
$$ ##$VTU= 2
$$ ##$VTUETH= <149.236.99.20>
$$ ##$VTUTY= <no>
$$ ##$WBREFAM= (0..15)
$$ 135 116 100 100 100 100 100 100 100 100 100 100 100 100 100 100
$$ ##$WBREFLM= (0..15)
$$ 0 0 0 0 0 0 0 0 0 0 0 0 0 0 0 0
$$ ##$WBREFPH= (0..15)
$$ 71.66 -68.25 0 0 0 0 0 0 0 0 0 0 0 0 0 0
$$ ##$WBSGU= (0..15)
$$ 0 0 0 0 0 0 0 0 0 0 0 0 0 0 0 0
$$ ##$XFAC= 2
$$ ##END=
$$ 
##$DECIM=	3328
##$DSPFVS=	20
##.ACQUISITIONSCHEME=	NOT PHASESENSITIVE
##NTUPLES=	nD NMR SPECTRUM
##VAR_NAME=	FREQUENCY1,	FREQUENCY2,	SPECTRUM
##SYMBOL=	F1,	F2,	Y
##.NUCLEUS=	13C,	1H
##.OBSERVE FREQUENCY=	100.69525530880000019,	400.41280287000000726
##VAR_TYPE=	INDEPENDENT,	INDEPENDENT,	DEPENDENT
##VAR_FORM=	AFFN,	AFFN,	ASDF
##VAR_DIM=	512,	512,	262144
##UNITS=	HZ,	HZ,	ARBITRARY UNITS
##FIRST=	25169.313707327481097,	5807.6787752999953227,	0.30323582887649536133
##LAST=	-957.56783717514929322,	-190.19907926730809322,	0.073332548141479492188
##MIN=	-957.56783717514929322,	-190.19907926730809322,	0.00096008024411275982857
##MAX=	25169.313707327481097,	5807.6787752999953227,	13.121949195861816406
##FACTOR=	1,	1,	0.0029732304937827775705
##PAGE=	F1=25169.3
##FIRST=	25169.313707327481097,	5807.6787752999953227,	0.30323582887649536133
##DATA TABLE=	(F2++(Y..Y)), PROFILE
$$ [...]
##PAGE=	F1=19749.6
##FIRST=	25169.313707327481097,	5807.6787752999953227,	0.064379699528217315674
##DATA TABLE=	(F2++(Y..Y)), PROFILE
1277 141 59 152 232 94 181 244 238 102 129 392 314 212 176 130 56 54 79 89 106 86 17 13 57 175 154 89 164 311 145 283 331 83
901 83 123 231 130 118 298 335 32 131 82 36 144 49 207 197 40 232 137 199 176 160 41 157 224 166 38 239 184 186 166 191
549 191 81 56 191 213 53 44 94 114 19 51 229 116 58 187 157 31 36 73 144 176 34 71 126 81 80 110 73 127 127 43 86 267 86
162 86 203 62 135 53 104 49 159 150 54 139 209 140 140 192 147 145 157 178 235 433 365 166 338 55 141 138 168 101 49 106
-190A06
##PAGE=	F1=19647.4
##FIRST=	25169.313707327481097,	5807.6787752999953227,	0.17834372818470001221
##DATA TABLE=	(F2++(Y..Y)), PROFILE
5808 156 111 161 159 22 78 160 164 78 225 179 95 47 48 162 232 153 57 66 112 144 204 61 122 168 205 107 147 342 292 222 275 206 59 68
5409 68 96 106 152 133 112 162 202 98 89 99 118 202 112 171 107 163 52 80 12 70 61 59 55 57 97 107 26 101 95 33 119 200 176 188 89 160 234
4974 234 204 163 99 219 129 122 126 199 165 32 70 51 160 123 150 123 86 166 91 89 115 62 46 145 141 12 46 121 35 122 97 52 116 253
4575 253 159 78 98 83 165 59 80 42 164 57 107 88 167 329 169 169 239 113 291 120 111 57 51 123 50 204 87 171 181 99 231
4211 231 76 62 83 185 222 162 159 244 205 321 123 140 213 97 190 20 115 74 78 154 296 300 49 149 195 86 126 165 286 142
3859 142 112 189 174 84 253 272 111 283 220 210 103 104 142 50 155 310 148 33 154 163 66 26 119 210 133 65 99 79 32 129 216
3495 216 86 158 124 175 173 41 8 99 87 144 17 116 148 297 217 152 209 97 105 120 203 195 180 138 202 167 128 217 169 87 100 125 167 236
3096 236 181 16 136 97 196 197 121 89 149 261 311 341 237 43 136 194 38 91 159 138 130 150 129 263 213 163 87 132 133 115 93 86 102
2709 102 256 212 166 169 136 58 63 55 191 162 150 98 110 112 145 145 111 133 226 217 144 176 216 11 53 51 94 86 88 136 344 261 42 202 53 42
2286 42 223 157 165 192 10 155 192 176 42 126 218 176 158 216 156 35 53 118 60 193 121 265 239 222 111 244 99 112 126 88 262
1923 262 9 214 380 261 223 182 82 45 163 83 115 123 75 111 63 52 102 83 70 98 72 107 142 244 182 183 186 152 160 246 141 90 94
1535 94 152 142 141 118 196 66 255 268 323 228 152 212 75 181 94 126 51 112 166 128 68 119 74 119 221 165 120 220 247 84 109 368
1160 368 288 190 205 149 60 25 74 109 103 119 23 64 18 151 159 139 133 270 164 238 335 65 89 245 172 135 300 345 69 115 87 84 125
772 125 22 228 215 69 268 160 216 219 157 51 190 187 140 14 227 195 159 105 161 50 67 196 205 46 38 133 145 52 48 222 67
408 67 84 186 148 22 17 68 132 165 32 69 81 76 112 117 90 148 127 55 96 300 82 217 53 115 34 158 86 124 121 56 170 201 116
21 116 95 163 141 130 147 167 249 402 332 139 343 87 135 119 163 88 85 142
-190A42
##PAGE=	F1=19545.1
##FIRST=	25169.313707327481097,	5807.6787752999953227,	0.21969684958457946777
##DATA TABLE=	(F2++(Y..Y)), PROFILE
5808 128 140 149 150 45 102 151 164 81 199 157 80 54 81 109 258 149 38 28 106 130 208 40 142 197 192 138 125 350 295 210 274 254
5432 254 84 76 89 98 132 119 95 128 164 99 129 135 116 159 51 149 130 122 34 102 44 102 57 55 32 77 98 92 24 102 89 66 149 204 138 170 61
4998 61 187 201 182 155 87 184 114 148 105 194 163 56 70 96 193 132 96 117 91 162 126 117 106 31 42 148 131 8 56 124 96 183 120 11
4599 11 48 196 138 119 107 42 111 28 53 85 183 44 86 70 166 293 126 152 213 121 259 96 130 72 103 243 95 200 75 212
4247 212 184 133 202 39 105 124 209 268 187 208 285 208 358 66 127 183 96 199 49 91 62 43 180 329 345 68 156 159 91 97 132 261
3871 261 179 86 150 196 107 217 242 100 279 175 220 91 111 134 35 150 305 155 25 139 131 33 85 129 177 110 120 59 85 55
3519 55 129 188 100 160 103 232 174 43 42 121 133 140 12 96 143 250 141 131 207 129 133 73 217 196 172 143 230 194 103 215 132 76 95
3132 95 79 122 219 175 51 164 90 215 211 43 87 124 262 338 335 225 36 135 225 33 74 192 162 124 118 108 276 232 211 71 144
2768 144 125 116 115 103 127 238 241 128 163 115 62 67 43 193 141 87 77 93 121 200 196 121 132 199 211 186 124 218 76 88 61 144 118 57 133
2357 133 330 255 48 177 84 59 206 122 141 226 39 138 132 147 46 157 226 132 119 197 181 91 47 139 56 164 129 290 251 238 134
1993 134 272 117 90 132 52 277 36 226 360 231 245 214 85 38 143 69 113 126 75 139 47 55 129 134 108 81 94 141 184 237 142
1629 142 215 221 147 153 284 184 70 49 104 103 116 120 191 63 211 220 253 167 156 244 104 188 100 132 46 52 125 109 55 85 97 71 199 192 69
1218 69 185 224 70 81 323 268 166 201 142 66 34 91 125 111 142 43 128 108 141 157 175 103 227 176 175 314 65 50 252 210 133 285
843 285 327 92 93 68 110 111 70 240 238 105 306 169 230 244 156 83 210 132 101 8 199 198 121 59 109 32 70 183 175 31 51 177 149
455 149 91 46 205 65 162 160 116 45 14 62 113 126 48 67 33 97 140 120 124 176 131 68 104 324 77 228 67 111 63 184 109 90 76
68 76 36 192 186 104 80 125 146 119 121 145 239 325 280 105 327 121 127 87 146 94 123 171
-190A71
##PAGE=	F1=19442.9
##FIRST=	25169.313707327481097,	5807.6787752999953227,	0.14072084426879882813
##DATA TABLE=	(F2++(Y..Y)), PROFILE
5808 89 169 152 120 76 122 117 133 81 159 123 72 66 109 79 273 185 35 23 119 145 231 41 167 210 169 162 123 328 278 191 269 296 118 84
5409 84 80 101 100 98 84 89 128 94 159 158 109 99 35 111 134 66 18 144 78 111 49 55 38 96 95 77 36 114 79 99 151 178 93 136 48 204 163 169
4963 169 146 69 138 119 158 73 180 153 87 75 127 202 139 35 109 77 136 143 142 87 14 25 171 134 9 91 144 165 227 144 9 23 130
4575 130 103 164 114 5 108 101 49 140 225 39 60 47 153 237 85 142 182 127 211 54 159 95 147 335 167 175 65 245 174 146
4223 146 178 43 132 155 227 300 216 242 325 190 375 15 121 136 85 188 80 62 33 88 233 344 354 82 168 99 89 70 109 226
3871 226 192 86 103 214 123 180 210 77 239 124 206 61 121 127 50 154 276 147 46 140 126 10 127 165 146 111 174 51 112
3531 112 74 139 148 117 163 71 264 155 24 82 144 152 138 30 55 129 193 85 107 186 151 150 24 209 186 148 130 246 212 84 192
3167 192 111 61 84 54 90 202 156 100 182 79 233 229 72 94 102 245 345 313 222 35 112 246 35 65 215 188 117 66 54 269
2815 269 241 240 54 148 109 115 122 112 141 213 251 82 147 76 61 72 66 188 103 36 69 59 130 252 248 129 124 167 177 218 84 219 140 113
2416 113 69 197 175 87 129 316 245 75 140 102 58 148 105 116 230 75 129 96 119 59 178 216 85 93 153 180 148 61 156 82 138 143
2040 143 311 263 236 151 282 141 83 159 54 252 67 220 331 199 240 225 106 111 129 59 107 154 115 168 34 40 127 166 157 52
1688 52 113 180 217 219 115 236 234 166 137 304 221 49 3 46 72 101 118 172 61 153 155 160 79 131 249 132 161 86 120 65 24 69 89 33
1289 33 68 128 33 159 172 62 162 178 65 51 262 254 149 161 109 76 79 132 140 126 148 62 171 197 156 149 190 86 193 182 134 279
913 279 89 56 250 240 111 252 283 97 74 38 104 110 111 235 262 130 343 161 238 244 155 122 211 76 82 24 165 186 94 98 49 67
538 67 69 151 128 10 68 199 130 108 39 181 76 212 123 65 75 36 49 88 68 81 81 15 124 157 119 158 196 137 86 124 341 74 229
150 229 95 110 108 184 109 68 41 18 205 170 108 114 81 141 124 109 147 211 216 214 67 292 150 122 47 119 122 156 184
-190A84
##PAGE=	F1=19340.6
##FIRST=	25169.313707327481097,	5807.6787752999953227,	0.19720117747783660889
##DATA TABLE=	(F2++(Y..Y)), PROFILE
5808 45 194 172 72 115 132 62 88 82 114 86 78 78 121 99 271 248 77 76 124 172 269 71 185 199 140 164 128 280 243 171 262 331 150
5420 150 71 74 116 78 93 83 54 102 90 177 169 95 76 92 81 127 56 75 185 97 91 36 54 63 111 91 64 42 130 78 130 142 124 59 96 58
4998 58 204 123 161 136 51 91 136 152 47 158 138 111 103 148 181 134 49 108 43 91 137 152 60 27 11 206 143 5 130 173 205 247 156
4610 156 15 88 65 68 200 131 36 140 149 60 178 268 65 33 58 133 171 54 147 150 133 153 23 199 106 179 377 200 146 78 248
4247 248 146 138 186 95 133 168 235 315 245 252 354 155 370 80 131 84 63 158 107 32 22 152 284 338 329 83 191 37 87 57 91
3883 91 190 180 90 62 228 123 158 178 35 169 82 174 43 139 125 57 161 229 125 41 143 144 23 149 215 146 126 220 88 159
3531 159 84 152 107 138 170 28 271 118 26 104 159 146 143 73 16 117 146 59 75 153 156 150 15 175 172 116 102 241 216 73 152 113 79
3143 79 78 97 92 189 131 128 187 63 254 257 159 106 83 210 335 284 228 45 72 246 40 77 232 213 111 59 41 243 241 243 72 162 99
2756 99 108 114 117 145 184 241 39 147 34 60 74 104 173 48 53 74 16 134 286 300 138 103 136 123 234 92 204 178 124 67 246 217
2380 217 128 134 304 228 90 98 98 48 59 125 109 197 86 138 115 98 73 183 188 46 98 101 168 198 98 167 115 131 153 323 277 219 161 270
1981 270 158 93 177 85 190 101 196 299 169 211 214 131 164 125 55 94 186 172 187 10 72 106 172 194 41 129 214 235 189 143 242 220
1606 220 194 111 296 244 29 55 10 70 110 110 138 62 92 90 62 25 97 225 155 102 48 86 94 99 13 74 15 89 157 56 102 120 103 167 128
1195 128 66 33 196 247 158 97 56 85 115 174 154 139 135 77 186 269 186 138 181 83 173 192 166 246 131 111 236 260 77 206 218 83
819 83 63 58 67 123 124 212 283 142 373 147 236 219 143 156 200 68 112 43 137 158 105 155 37 123 72 105 78 26 83 199 95 100 28 161
420 161 64 218 98 17 112 73 30 60 5 118 115 62 151 158 106 185 202 137 113 166 350 78 219 124 97 140 167 90 67 56 33 213 155
33 155 115 157 44 128 155 137 183 181 101 144 49 241 168 119 13 82 147 178 179
-190A79
##PAGE=	F1=19238.4
##FIRST=	25169.313707327481097,	5807.6787752999953227,	0.12021742761135101318
##DATA TABLE=	(F2++(Y..Y)), PROFILE
5808 20 209 196 23 156 131 20 78 84 85 54 92 84 117 130 252 302 126 122 109 190 308 128 186 171 115 145 125 215 197 154 258 356 168
5420 168 41 90 131 89 102 91 28 93 85 182 173 75 116 137 81 119 124 138 213 102 45 56 47 92 125 89 54 44 150 94 158 149 63 56 59 58 183
4986 183 82 150 127 36 54 153 132 57 135 121 119 141 162 136 118 113 119 8 46 112 144 27 28 67 242 154 8 159 201 217 243 160 17
4599 17 146 31 48 216 159 85 165 170 69 197 297 98 35 98 117 111 26 156 125 138 90 79 239 99 198 365 179 135 104 212
4247 212 100 118 217 145 109 159 231 312 266 232 358 115 343 136 142 47 37 113 126 4 50 194 306 308 277 71 219 65 87 75
3894 75 72 166 147 81 36 234 110 163 152 28 84 68 133 85 160 136 44 163 172 99 28 145 171 39 156 259 172 138 251 112 210
3531 210 87 154 74 161 181 32 261 69 91 102 166 125 159 121 43 116 136 66 36 118 149 135 42 121 160 99 72 215 203 76 103 126
3155 126 123 90 156 105 171 108 125 180 44 274 291 228 114 65 160 311 254 236 58 30 222 43 101 251 234 101 122 125 212 236 221
2791 221 112 192 99 93 94 117 141 155 211 78 173 12 64 76 142 154 19 87 85 22 142 298 341 151 71 114 70 236 127 167 180 124
2416 124 50 281 233 156 149 293 198 85 59 73 68 52 153 117 135 68 165 155 89 89 171 150 32 124 79 163 231 149 170 139 139 155 322 289
2016 289 189 162 239 162 106 172 111 104 134 153 269 140 170 187 143 186 122 56 83 208 224 190 28 147 101 150 205 72 140 237 235 148
1641 148 202 232 182 212 80 260 251 39 98 53 98 136 99 93 66 49 57 23 124 126 181 167 39 68 34 124 164 40 72 21 117 175 86 34
1242 34 91 148 184 90 68 49 134 241 184 33 21 86 131 203 161 145 103 86 177 312 212 132 151 80 161 215 238 232 181 170 210 271 49
854 49 154 144 66 63 116 15 136 108 185 292 143 391 143 222 178 115 186 200 118 157 60 122 116 143 189 86 185 85 52 45 58 93 183
467 183 56 70 18 155 31 182 99 58 155 123 28 51 54 156 159 108 177 143 74 203 195 122 146 223 350 91 193 149 66 150 145 63 76
80 76 82 38 219 139 110 186 62 133 203 180 223 170 80 81 75 179 166 114 30 41 152 186 157
-190A57
##PAGE=	F1=19136.1
##FIRST=	25169.313707327481097,	5807.6787752999953227,	0.20460212230682373047
##DATA TABLE=	(F2++(Y..Y)), PROFILE
5808 53 214 209 63 196 123 69 117 84 90 33 107 77 103 143 221 325 164 154 80 191 339 204 166 144 104 116 106 146 146 141 256 367
5432 367 164 18 128 138 119 107 105 33 101 80 178 174 52 154 159 92 123 194 187 223 96 37 109 32 120 142 91 44 48 178 119 180 176 68
5033 68 71 37 34 146 38 129 117 27 41 160 102 88 123 100 111 167 167 100 98 169 140 55 60 77 120 24 31 136 268 161 28 171 214 205 218
4622 218 158 35 194 60 46 207 188 137 171 172 72 197 303 121 63 139 122 72 21 157 111 141 37 144 269 75 209 304
4294 304 111 143 125 143 36 103 240 179 67 128 218 293 276 181 333 89 296 162 139 58 34 61 134 17 68 202 285 256 213 55
3941 55 242 123 88 113 49 160 105 56 30 230 86 187 132 96 57 75 98 146 178 160 24 154 118 87 76 150 198 55 156 284
3589 284 198 139 265 104 250 88 140 54 182 189 89 247 36 164 81 167 100 180 164 66 122 164 86 19 90 144 117 57 60 149 122
3225 122 69 176 171 92 57 133 163 117 205 111 144 94 92 167 24 286 323 270 117 58 108 279 226 237 67 48 175 37 123 281 247
2862 247 81 174 200 194 233 188 149 227 106 74 76 111 129 131 169 146 199 18 77 81 171 138 84 108 93 50 165 294 367 169 37 103 75
2474 75 221 152 111 145 116 20 294 221 164 164 277 158 62 40 46 118 151 164 119 61 28 195 182 88 109 141 122 53 152 106 170 239 198 167
2075 167 146 142 148 303 289 153 151 195 153 116 148 124 27 158 101 243 115 130 149 136 177 112 59 105 212 259 173 67 218 136 105 182
1700 182 106 144 246 219 100 254 206 124 217 76 199 238 76 131 76 132 166 92 72 75 63 74 82 203 211 131 163 84 150 32 153 208
1324 208 67 80 28 131 174 94 36 139 181 193 68 68 72 80 229 201 30 85 71 121 214 154 143 57 93 156 325 228 137 103 62 151 245
937 245 301 234 229 222 172 271 45 111 72 68 72 169 67 140 67 170 285 136 392 154 192 131 71 224 230 168 192 65 115 76 176 194 122
549 122 241 109 17 50 88 99 163 29 39 10 159 31 119 110 104 196 179 50 79 107 196 203 148 205 116 23 216 181 86 181 283 341 114
162 114 152 173 26 138 129 37 80 93 17 223 124 88 195 112 166 248 207 241 182 158 39 103 116 142 100 38 6 131 181 125
-190A25
##PAGE=	F1=19033.8
##FIRST=	25169.313707327481097,	5807.6787752999953227,	0.45098614692687988281
##DATA TABLE=	(F2++(Y..Y)), PROFILE
5808 87 212 203 115 229 113 108 154 82 109 22 118 52 85 134 184 314 188 172 52 174 353 285 129 142 108 88 75 84 93 127 254 358
5432 358 139 41 172 138 154 96 120 72 125 76 168 175 33 164 161 90 135 244 210 212 83 106 167 15 143 166 102 32 57 215 139 193
5056 193 199 123 86 32 15 102 16 97 105 23 60 157 67 116 136 68 86 173 162 127 95 206 164 98 95 48 85 62 65 205 275 167 50 161
4657 161 207 182 181 152 67 233 89 50 175 206 182 160 167 71 185 288 129 86 169 149 56 71 138 109 139 41 200 278 53 217 216 30
4282 30 159 141 83 40 105 233 194 30 85 203 265 272 107 283 86 232 152 115 88 68 9 130 32 70 185 225 190 155 57 249
3930 249 162 82 150 45 171 65 36 53 215 56 216 118 163 124 80 84 200 189 186 55 134 77 98 147 160 216 75 157 285 207 127
3566 127 267 68 266 98 112 52 198 192 141 240 68 230 51 166 82 200 193 73 127 200 100 46 82 157 113 63 2 134 175
3225 175 101 144 119 109 29 133 185 142 233 107 115 89 39 154 14 284 344 286 116 78 69 241 201 228 70 89 119 22 134 320 251
2862 251 49 193 249 196 237 166 179 250 117 67 71 93 110 119 123 200 202 14 96 91 190 135 136 114 88 69 207 291 374 188 15 100 119 193
2462 193 157 53 81 99 27 285 188 154 168 253 115 34 52 72 167 228 153 105 33 44 215 186 95 133 100 130 75 173 137 176 217 230 162
2075 162 138 131 132 267 269 110 130 146 137 117 122 129 80 167 64 216 104 107 110 115 144 98 68 159 206 268 132 94 259 177 51 130 126 143 242 192
1653 192 64 279 168 56 214 125 126 208 114 151 76 159 194 104 117 91 95 94 111 252 291 87 143 149 226 85 178 224 66 93 29 127
1277 127 155 78 103 199 193 189 51 70 89 42 208 193 66 151 39 90 209 135 137 7 99 135 312 232 153 44 35 146 264 329 234 260
901 260 256 128 258 51 88 22 89 87 204 130 134 32 168 261 119 374 168 149 86 50 271 283 197 211 57 109 65 191 181 135 285
538 285 135 51 66 116 104 148 34 71 9 164 74 55 113 135 225 227 68 116 147 237 237 177 233 84 43 227 173 32 208 332 323 146
162 146 101 200 54 114 119 18 73 94 27 219 110 55 185 155 204 273 201 231 202 219 35 109 60 99 71 21 35 91 168 90
-190I0
##PAGE=	F1=18931.6
##FIRST=	25169.313707327481097,	5807.6787752999953227,	0.39160868525505065918
##DATA TABLE=	(F2++(Y..Y)), PROFILE
5808 111 204 179 148 254 106 124 169 77 118 24 125 10 70 115 150 275 196 179 51 136 350 353 94 166 121 68 44 43 43 114 247 329
5432 329 101 59 208 140 190 72 131 116 163 80 152 172 21 145 150 70 144 265 202 181 72 172 212 32 156 194 123 30 71 251
5080 251 145 196 204 160 98 36 74 75 77 59 89 20 90 144 29 135 170 22 47 161 159 187 112 223 187 124 104 45 48 101 107 263 262 172 71
4669 71 125 179 161 143 144 107 263 104 56 129 206 210 140 163 72 171 256 122 99 188 186 51 123 96 115 139 71 239 264 67 227 126 113
4282 113 177 155 120 120 118 197 195 69 68 198 235 256 56 233 94 159 114 73 110 109 40 114 46 82 174 153 121 132 78 236 175 67 171
3894 171 73 189 38 62 99 188 26 238 108 216 181 76 88 236 196 202 103 113 54 120 213 169 219 95 165 263 196 107 269 53
3542 53 252 114 78 60 205 188 176 240 108 274 27 166 70 213 204 90 124 224 100 61 97 181 123 60 43 120 234 141 143 52
3190 52 115 25 132 185 154 236 106 103 87 26 143 31 263 346 282 113 113 57 204 181 211 67 116 81 13 129 355 245 45 172
2838 172 260 204 247 173 201 256 131 84 79 65 88 126 81 227 171 33 116 103 202 143 166 105 69 88 254 302 360 201 10 97 150 152 140
2451 140 44 17 70 68 253 143 129 153 223 79 42 72 129 201 268 126 73 76 99 216 164 109 156 54 159 83 189 154 167 166 233 158
2075 158 120 107 111 217 225 61 108 101 119 107 108 130 136 160 81 186 117 111 74 93 108 87 86 213 200 250 69 100 252 192 40 63 132 136 227
1664 227 166 65 273 127 19 217 190 63 166 139 156 58 172 217 142 181 115 117 102 116 267 338 51 118 187 271 123 195 212 39
1312 39 102 28 108 124 43 162 229 179 176 37 76 96 36 173 162 94 205 13 48 193 109 133 44 106 125 286 227 169 18 48 159
948 159 260 312 214 263 266 86 233 48 82 42 105 100 215 173 124 71 165 226 88 339 167 101 58 99 318 328 202 217 40 106 79
584 79 184 168 125 310 158 84 77 139 112 143 52 128 19 164 105 45 103 151 232 254 70 147 168 272 255 195 258 55 108 238 177 36
209 36 219 360 294 182 50 229 108 96 108 17 56 94 76 204 98 21 160 181 225 267 160 197 216 248 47 89 23 50 27 18 60
-155 60 48 156 65
-190F5
##PAGE=	F1=18829.3
##FIRST=	25169.313707327481097,	5807.6787752999953227,	0.36226350069046020508
##DATA TABLE=	(F2++(Y..Y)), PROFILE
5808 123 194 149 155 269 103 116 160 71 109 46 128 54 53 105 124 227 196 180 75 79 331 395 83 194 133 57 39 43 16 105 232 282 61
5420 61 63 228 154 225 41 132 154 199 87 132 161 17 107 137 39 138 256 171 137 71 220 235 65 156 219 147 53 89 279 135 188
5056 188 192 165 107 55 129 90 140 26 72 18 122 127 13 141 213 48 14 148 181 238 132 220 204 129 75 61 27 131 138 300 231 175
4681 175 88 67 140 152 111 139 145 279 106 61 79 190 212 116 160 75 166 216 106 102 196 219 54 158 45 123 150 86 256 231 101
4317 101 232 64 208 203 170 185 191 129 156 190 124 110 212 212 234 123 211 99 102 89 24 122 146 85 87 67 127 200 121 61 147 95 205 164
3918 164 46 171 108 201 29 108 153 154 6 247 100 251 213 64 89 252 202 198 140 100 41 139 254 174 208 108 180 229 174 88
3566 88 279 112 210 124 51 65 202 180 188 240 131 292 15 161 64 216 204 140 116 227 88 66 133 201 129 48 74 116 286 178
3214 178 167 20 105 20 140 175 144 216 110 116 81 73 131 45 222 326 270 110 146 63 179 167 192 68 125 83 41 106 372 233 107
2850 107 123 234 201 261 195 216 244 144 111 84 41 73 147 50 221 110 69 128 115 213 152 170 81 54 114 291 318 325 201 12 89 156
2474 156 105 108 82 66 29 101 207 97 97 119 188 55 75 83 180 211 270 98 33 100 146 203 122 125 172 13 180 70 201 162 141 91 203
2087 203 159 105 77 86 164 164 6 99 68 110 85 102 129 164 145 118 149 147 140 46 91 90 87 107 246 198 212 12 95 194 167 77 28 128 124 206
1664 206 149 85 241 91 65 228 244 62 119 141 143 29 168 238 191 232 144 124 103 111 257 342 25 115 196 277 143 200 177 31 99
1300 99 36 80 95 4 209 217 137 162 43 84 93 59 129 128 129 244 71 26 172 83 130 83 115 119 259 219 178 73 99 192 232 251 169 234
901 234 247 54 198 39 75 65 104 107 205 189 122 121 150 191 41 293 147 66 62 156 343 344 187 214 31 108 85 157 177 95 316 174
526 174 103 88 158 120 147 68 174 31 160 114 65 85 155 217 250 59 179 167 294 253 201 276 49 160 249 192 97 209 357 256
174 256 212 39 255 154 97 93 32 36 95 114 177 89 17 127 185 220 230 95 159 221 251 51 46 25 34 23 72 75 32 149 57
-190E7
##PAGE=	F1=18727.1
##FIRST=	25169.313707327481097,	5807.6787752999953227,	0.76460820436477661133
##DATA TABLE=	(F2++(Y..Y)), PROFILE
5808 127 180 136 137 271 100 93 137 62 83 79 126 122 46 110 114 188 194 176 111 44 298 405 99 214 139 52 59 58 61 102 208 225 29 69 227
5397 227 178 257 12 124 174 221 84 117 142 37 66 138 9 111 219 132 95 83 250 234 92 147 228 164 86 109 291 114 171
5056 171 178 140 115 91 164 125 191 16 58 24 149 115 55 132 258 123 57 150 229 264 143 200 211 116 21 84 39 148 149 309 188 173
4681 173 103 44 118 158 90 137 168 278 102 63 39 171 186 92 154 76 170 172 83 98 195 238 76 161 63 129 175 84 251 187 126 227
4305 227 49 272 234 179 217 242 135 156 186 169 172 240 200 209 206 216 93 117 132 43 121 176 127 51 96 185 243 149 22 166 94 159 136
3918 136 26 150 138 197 35 154 202 122 27 243 92 268 225 51 78 247 209 170 154 103 29 148 259 174 196 110 196 204 157 77
3566 77 292 176 148 115 40 64 191 170 183 232 139 286 13 147 69 211 204 203 113 207 74 85 179 206 120 29 91 119 318 208 189
3202 189 89 94 5 156 176 112 182 116 135 68 96 115 46 166 286 259 106 164 67 181 159 184 76 121 93 76 64 362 217 185 76
2838 76 181 179 272 214 218 220 153 136 75 46 69 173 39 189 37 101 126 129 227 153 154 54 68 138 300 320 270 186 38 76 140 56 71 108
2439 108 110 33 121 153 59 66 69 153 39 105 81 211 198 237 84 23 108 189 198 69 137 184 16 181 39 209 171 103 16 149 161 107
2063 107 47 59 118 100 51 112 55 120 59 82 130 169 130 137 109 176 183 24 117 105 100 124 243 192 169 92 116 103 105 100 73 123 102 185 143 93
1641 93 191 65 92 233 267 96 82 118 109 2 147 254 239 258 175 121 105 112 237 310 51 136 181 247 147 191 126 89 80 63 55 85 55
1254 55 242 165 75 152 60 93 84 87 83 132 169 264 133 52 150 62 119 108 129 111 241 215 178 113 151 229 188 157 110 175 204 48 160 32
854 32 58 69 84 110 184 180 132 154 126 171 36 244 110 73 84 190 333 326 162 209 44 117 69 124 210 53 305 184 109 103 175 120
479 120 151 79 195 37 157 97 59 61 154 184 217 68 220 145 294 229 199 285 75 190 254 205 140 178 322 210 227 69 273 185
127 185 105 76 44 20 86 127 140 82 28 101 169 188 168 43 146 223 239 44 9 36 67 71 124 80 51 148 59
-190E9
##PAGE=	F1=18624.8
##FIRST=	25169.313707327481097,	5807.6787752999953227,	0.92473596334457397461
##DATA TABLE=	(F2++(Y..Y)), PROFILE
5808 125 162 152 100 259 90 59 110 47 42 114 120 187 71 115 120 170 196 171 149 123 252 385 120 226 135 47 73 62 109 112 180 174 6
5420 6 100 204 196 280 22 112 173 219 66 126 120 75 42 154 17 67 166 107 70 110 267 215 112 141 213 166 115 131 284 96 150 170
5045 170 91 119 129 171 156 218 30 53 39 163 120 103 107 296 199 106 171 282 265 141 172 203 92 78 114 56 147 137 289 140 160
4681 160 118 130 139 176 87 130 164 257 98 63 20 165 137 74 144 68 174 129 56 90 189 238 105 122 119 131 203 71 225 141 133 209 48
4294 48 296 258 172 202 262 140 194 177 200 226 264 202 185 264 213 77 185 202 95 105 195 168 21 125 231 268 176 17 167 74
3941 74 108 110 12 115 164 174 50 190 236 110 48 227 87 271 226 40 60 225 218 121 140 115 36 144 226 172 203 104 206 208 150
3578 150 73 295 217 81 82 46 69 179 157 170 217 138 267 41 118 85 198 211 253 117 164 67 130 225 191 98 10 92 116 318 225
3214 225 193 140 107 32 171 204 65 145 117 142 47 89 99 34 102 233 251 105 162 63 201 156 192 88 111 85 111 10 322 202
2862 202 260 95 115 144 275 222 201 186 154 153 55 62 69 197 46 144 51 120 110 145 241 144 130 57 89 142 275 295 204 159 75 59 113 20
2462 20 42 112 122 82 128 100 38 53 30 120 30 130 64 214 165 183 83 57 126 239 223 20 143 196 28 161 28 212 182 62
2110 62 85 94 159 130 28 31 89 61 98 131 71 143 65 39 142 159 117 128 71 194 225 11 154 141 121 128 205 171 138 158 173 99 25 98
1711 98 99 127 71 179 136 86 137 49 93 218 249 120 74 75 64 25 113 261 276 257 202 113 112 121 218 262 97 155 155 199 142 169 69 150 55
1300 55 109 66 93 105 259 85 22 141 72 104 71 112 45 176 202 264 192 77 127 46 93 118 141 97 233 220 178 133 191 252 146 50
925 50 71 99 147 60 131 40 31 55 52 110 167 155 152 164 107 173 100 204 75 105 105 190 282 277 147 205 58 124 34 108 251 11 286 191 105
514 105 120 194 106 146 82 187 36 158 59 33 34 152 144 164 118 269 111 272 189 191 284 111 194 249 205 153 136 263 164 220 91 278
138 278 202 102 62 46 17 61 110 108 72 25 97 135 136 100 84 164 231 222 29 59 39 93 102 160 79 74 157 59
-190E9
##PAGE=	F1=18522.6
##FIRST=	25169.313707327481097,	5807.6787752999953227,	0.74063825607299804688
##DATA TABLE=	(F2++(Y..Y)), PROFILE
5808 117 138 175 54 232 67 32 88 28 28 146 107 240 115 105 134 171 203 165 180 214 198 347 141 231 118 41 71 51 151 132
5456 132 155 145 13 142 163 197 286 49 113 152 193 45 161 100 114 40 178 28 24 110 105 64 147 278 188 135 147 172 149 131 151 262
5080 262 99 135 165 32 116 155 150 177 215 56 60 56 165 140 160 61 320 261 147 192 317 247 127 143 181 76 164 149 70 125 106 244
4704 244 93 133 133 225 180 201 114 115 132 214 99 65 37 181 79 73 133 49 164 87 25 84 182 215 127 52 157 126 219 60 184 102
4329 102 126 177 35 286 264 144 143 248 148 225 152 218 264 271 213 164 288 184 52 250 259 142 75 203 207 56 145 251 254 171 16
3965 16 145 40 60 111 1 74 187 141 63 212 248 126 67 205 83 268 221 40 57 193 222 61 101 124 67 130 163 171 235 103
3613 103 205 238 145 70 278 228 53 28 62 88 170 141 165 198 142 248 82 72 102 177 221 271 120 102 59 183 259 161 74 24 80
3249 80 93 280 220 177 166 143 70 178 251 43 120 112 131 29 55 101 23 41 179 247 115 138 53 219 151 211 94 105 59 145 49 260
2873 260 189 319 147 51 105 265 220 164 148 147 164 46 66 61 214 65 109 105 125 80 164 245 126 115 86 87 119 215 242 146 132 113 45
2486 45 94 33 39 100 102 122 127 52 33 61 71 90 38 155 37 189 122 125 79 90 166 302 273 37 143 213 27 132 72 209 188 27
2110 27 151 92 145 159 37 10 80 76 125 144 104 165 106 25 170 146 103 94 47 197 250 35 185 182 143 112 146 130 122 196 236 217 91 75
1711 75 95 141 44 199 116 84 92 38 72 181 191 127 90 23 52 40 69 254 297 233 219 104 124 132 202 219 133 152 122 157 134 140 30 197
1312 197 53 164 114 101 148 260 19 85 127 82 117 55 130 34 226 218 250 239 94 104 35 53 117 145 80 228 240 193 135 216 254 119
937 119 58 101 37 97 74 122 68 7 50 51 103 163 134 179 154 109 193 157 180 74 137 113 151 197 213 152 201 63 122 18 122 285 42
549 42 268 202 94 137 218 83 128 79 156 40 158 9 47 31 151 111 106 181 313 78 234 138 180 271 143 177 229 190 134 93 201
185 201 128 190 96 268 206 85 56 36 29 41 74 98 55 27 112 88 74 60 133 191 248 204 15 96 37 105 107 170 75 107 171 56
-190E6
##PAGE=	F1=18420.3
##FIRST=	25169.313707327481097,	5807.6787752999953227,	0.50306928157806396484
##DATA TABLE=	(F2++(Y..Y)), PROFILE
5808 105 106 182 19 191 34 61 76 33 83 173 89 275 156 75 140 184 213 163 192 281 140 306 162 229 91 42 49 40 181 155 147 152
5432 152 32 176 110 177 269 74 133 122 151 56 197 89 144 37 203 36 52 70 111 60 187 289 167 176 162 121 123 128 166 227 123
5068 123 137 150 26 106 160 112 184 182 98 78 69 158 167 220 23 328 301 174 200 322 216 106 117 143 79 234 179 81 85 71 186 55
4693 55 92 147 304 208 225 162 102 80 156 102 75 72 205 36 91 122 20 136 46 29 93 178 174 134 69 165 112 214 67 134 73 109 136
4305 136 17 255 247 100 65 204 153 220 108 226 283 253 230 148 276 141 27 293 289 180 38 200 238 103 150 238 201 131 14
3965 14 105 18 29 132 17 40 206 123 67 214 238 158 86 180 82 265 218 68 81 156 213 45 44 121 100 113 85 172 275 116 194
3601 194 271 129 75 243 209 95 33 77 112 163 120 174 182 159 240 126 16 109 148 223 252 112 33 43 227 274 122 72 54 64 58 208
3225 208 188 144 165 180 109 177 299 85 110 104 105 40 34 127 46 36 136 236 134 94 37 218 144 227 92 102 31 173 102 184 178 354
2850 354 186 13 77 241 211 109 112 142 175 75 61 49 222 91 107 132 127 44 178 232 105 117 103 53 71 130 168 126 124 142 42
2486 42 99 55 52 84 62 143 123 17 33 72 124 70 56 181 40 143 77 80 62 122 214 364 323 67 139 232 26 111 114 198 183 15 188
2099 188 131 118 182 63 40 87 105 127 147 136 171 150 100 209 136 93 50 57 187 251 78 201 216 153 78 87 78 111 196 281 327 182 46
1711 46 70 165 77 242 80 118 78 30 59 151 108 126 103 24 96 50 23 229 299 194 224 97 141 139 183 191 146 129 78 133 126 114 58 217
1312 217 76 215 170 97 182 246 100 154 108 105 135 35 138 46 265 216 230 271 107 81 36 21 113 131 67 219 269 226 129 229 232
948 232 103 133 146 58 95 88 131 108 35 93 103 86 169 133 213 129 124 222 191 172 96 161 108 80 95 152 176 193 60 111 57 146 299 81
549 81 258 221 81 151 248 91 96 73 116 71 156 44 99 56 151 95 62 238 339 64 188 86 167 247 161 150 195 165 88 64 165
185 165 113 140 87 245 200 59 54 16 50 76 40 106 31 59 131 36 45 77 157 212 268 187 16 111 36 106 85 152 70 154 186 52
-190E2
##PAGE=	F1=18318
##FIRST=	25169.313707327481097,	5807.6787752999953227,	0.36866018176078796387
##DATA TABLE=	(F2++(Y..Y)), PROFILE
5808 87 70 162 41 141 39 114 72 71 146 193 74 290 181 32 129 192 215 171 180 308 85 270 173 214 58 55 14 68 193 174 159
5444 159 177 45 186 56 144 228 93 165 99 106 86 216 84 155 31 223 48 92 62 111 50 221 300 161 235 175 106 117 108 172
5092 172 185 153 154 121 76 90 142 72 178 125 147 103 75 149 190 276 92 323 313 184 192 296 180 81 93 97 90 269 193 93 37 76 142
4704 142 43 41 155 349 208 241 215 113 50 91 101 96 117 223 46 114 111 12 92 34 65 123 180 129 123 162 146 90 185 83 85 54 92 95
4305 95 3 221 211 72 76 137 149 174 50 226 283 211 251 145 239 122 35 307 291 207 42 187 254 142 141 200 122 67 30 61 42
3941 42 36 149 36 36 210 138 66 195 212 188 106 160 81 267 225 113 108 117 186 105 26 103 124 107 29 173 300 135 178 289 99 107
3566 107 205 170 137 86 80 123 152 95 192 170 185 246 167 57 107 115 210 210 89 38 29 248 267 83 100 94 62 48 117 129 101 139 198 145 172
3155 172 334 130 105 94 72 67 84 162 80 74 118 209 150 41 18 196 133 229 81 95 40 194 141 105 171 364 199 31 67 206 194
2791 194 49 98 151 188 117 73 47 222 121 123 132 141 11 180 199 88 128 92 14 39 36 90 140 141 159 50 119 66 58 80 39 144 119 26
2392 26 39 73 162 71 74 204 84 89 39 67 39 154 252 407 352 81 131 241 38 109 141 179 169 30 197 161 86 194 96 77 99
2028 99 127 108 142 154 154 178 173 245 133 95 45 85 170 223 135 194 232 144 32 50 66 91 165 293 397 251 42 64 193 144 292 52
1653 52 179 98 37 99 171 50 123 103 55 135 61 23 185 282 150 216 92 168 145 158 168 137 115 20 117 119 103 95 207 91 247 219
1277 219 81 200 222 170 209 85 142 158 17 134 59 285 201 210 286 123 58 48 62 113 96 59 199 293 266 140 236 189 82 169
925 169 170 83 128 103 142 151 58 152 160 57 177 151 250 94 135 250 195 172 118 175 94 14 37 108 205 178 54 92 83 162 290 110 257
538 257 248 71 158 276 144 56 66 90 115 148 95 143 77 156 94 54 277 343 69 144 40 157 214 164 128 153 140 31 53 168 113
174 113 82 74 211 185 35 49 7 71 131 44 112 26 100 142 40 87 94 151 227 284 168 20 104 41 103 45 114 67 206 193 54
-190E4
##PAGE=	F1=18215.8
##FIRST=	25169.313707327481097,	5807.6787752999953227,	0.21588566899299621582
##DATA TABLE=	(F2++(Y..Y)), PROFILE
5808 63 30 116 66 92 89 166 71 120 206 208 81 287 184 39 97 182 201 189 149 291 64 239 164 184 28 72 36 121 183 184 178 199 42
5420 42 166 50 110 170 107 197 91 68 102 212 81 145 51 233 61 118 68 107 40 243 304 168 292 178 150 151 82 166 143 182
5068 182 171 81 114 82 107 48 162 60 192 127 77 144 204 316 172 307 296 176 172 248 140 52 66 58 95 264 183 105 28 130 134
4704 134 64 27 156 347 175 244 256 146 85 31 92 125 168 231 60 127 101 42 45 61 94 160 182 111 102 234 112 64 138 95 51 38
4329 38 81 66 10 198 164 113 159 63 130 97 42 223 268 158 277 164 196 140 62 289 271 221 91 166 246 166 129 155 59 7 46 28
3953 28 57 49 149 50 65 191 165 67 159 184 208 129 145 82 273 249 160 122 77 147 166 78 71 132 120 65 172 298 144 162 281 66
3578 66 158 181 123 158 118 64 110 130 78 215 162 214 263 204 122 106 86 185 170 68 86 44 242 239 57 143 136 76 84 59 56 59 99 192 177 167
3155 167 351 156 92 85 39 98 142 189 105 99 135 166 152 28 10 161 119 214 68 79 60 205 162 39 169 350 191 43 68 169
2803 169 165 33 116 173 194 154 109 63 216 153 134 121 163 16 166 154 78 135 55 84 86 51 46 149 164 165 65 135 65 55 93 69 131 112
2404 112 63 62 61 181 95 84 217 130 59 18 70 51 182 271 418 352 77 120 234 53 119 150 153 147 44 185 166 80 198 131 114 105
2028 105 148 86 136 151 112 184 232 267 137 103 74 114 151 174 200 162 225 117 24 36 117 60 129 272 416 290 61 96 215 217 333
1664 333 78 241 133 74 165 228 99 121 87 70 147 80 62 127 247 106 198 94 205 149 125 137 122 144 51 96 112 112 122 169 85
1300 85 252 253 61 196 191 213 245 54 178 187 36 120 68 286 183 197 284 136 39 59 111 118 57 56 164 299 295 179 243 137 50 165
925 165 164 76 159 121 147 185 67 194 197 24 189 173 280 58 137 269 172 171 141 176 83 107 114 84 229 157 53 66 89 164 262 128
549 128 257 276 69 154 290 207 22 56 85 159 135 139 166 79 163 96 73 295 326 83 109 13 151 176 153 122 116 123 30 54 182 115 51
162 51 72 172 159 24 44 24 85 174 56 106 52 136 141 97 132 87 123 239 288 148 14 80 49 102 40 72 73 249 185 63
-190F3
##PAGE=	F1=18113.5
##FIRST=	25169.313707327481097,	5807.6787752999953227,	0.11261077970266342163
##DATA TABLE=	(F2++(Y..Y)), PROFILE
5808 49 12 55 78 69 139 209 70 169 256 217 103 267 167 89 50 147 171 212 117 242 104 207 125 140 14 81 81 175 148 186 191 208 23
5420 23 122 97 88 114 122 221 90 42 93 190 81 123 90 231 69 128 72 107 34 253 296 177 329 171 205 199 83 148 112 209 176 37
5045 37 139 96 67 45 144 33 221 143 77 145 205 326 234 283 254 151 145 190 98 23 36 58 97 222 149 118 65 193 152 95 78 147
4669 147 296 114 231 273 180 119 16 75 158 219 230 50 124 95 63 31 83 105 189 181 137 79 268 85 42 84 99 45 22 77 67 27
4294 27 188 118 180 226 6 97 9 96 218 243 110 306 201 168 157 84 244 237 219 140 139 212 172 124 126 93 81 50 24 54 51 133 54 102
3894 102 140 175 78 120 169 214 148 136 83 277 281 198 117 34 117 211 112 49 129 146 95 167 263 134 146 245 55 211 176 81 152 123 31
3507 31 69 96 81 240 152 237 283 235 176 120 80 158 167 86 108 60 213 197 56 186 168 85 116 104 30 27 56 161 205 165 348 162 68
3120 68 76 12 128 184 203 115 107 175 126 135 71 23 125 104 188 54 54 68 203 166 46 167 319 168 52 69 141 125 71 143 197 187 176
2732 176 148 77 207 182 126 128 178 35 140 112 75 136 62 151 127 113 81 134 178 164 89 141 57 44 111 101 113 99 111 99 38 183 126
2345 126 85 215 164 77 30 68 93 199 271 393 325 58 108 206 63 124 142 127 125 56 169 147 111 204 164 152 99 170 86 127 125 55 168
1958 168 269 269 144 102 86 139 128 114 262 116 199 89 62 34 170 27 136 233 386 299 75 121 223 281 357 120 288 167
1629 167 129 229 280 146 120 58 86 127 102 91 64 195 72 174 112 245 153 89 102 126 192 118 65 105 131 137 110 63 225 267 60
1265 60 171 162 223 262 13 202 222 76 103 69 269 170 187 265 142 24 62 158 129 70 56 120 276 303 230 250 86 11 126 133 40
901 40 177 143 140 201 56 203 201 5 207 191 292 24 131 269 132 162 174 166 88 191 178 73 241 135 57 36 76 160 232 136
549 136 251 298 75 136 277 251 29 44 84 189 120 173 163 62 165 92 94 290 295 98 86 31 146 138 135 130 99 112 64 69 175 112 96
162 96 87 136 123 28 43 29 85 193 46 96 77 155 127 152 159 55 82 245 279 127 12 52 58 105 83 39 90 276 162 76
-190G6
##PAGE=	F1=18011.3
##FIRST=	25169.313707327481097,	5807.6787752999953227,	0.13310596346855163574
##DATA TABLE=	(F2++(Y..Y)), PROFILE
5808 73 55 14 77 84 174 239 68 212 290 219 122 233 138 130 41 95 131 230 107 194 163 174 57 95 21 79 118 213 93 191 188 198 29
5420 29 81 143 85 93 142 235 84 36 63 163 89 108 126 216 66 128 81 117 32 252 271 176 333 155 241 236 123 127 114 233 163 5
5045 5 150 120 36 50 130 74 228 146 76 148 195 302 264 251 197 117 118 136 53 27 11 85 106 154 98 130 87 245 167 126 124 126 204 37 206
4634 206 258 198 128 35 57 192 266 227 17 109 98 76 52 87 95 196 172 178 63 261 77 38 38 98 50 7 83 90 47 182 81 237
4258 237 263 57 57 72 132 212 214 95 329 241 158 146 99 182 198 206 176 109 158 165 127 118 145 150 57 32 36 45 116 45 142 64 159 87 100 173 205
3824 205 160 129 83 274 305 217 91 9 127 232 118 77 129 173 96 158 200 107 121 184 80 249 178 51 118 105 10 12 64 103 259
3460 259 134 245 293 257 210 149 92 143 194 130 99 60 171 149 64 213 176 76 127 151 86 21 25 116 223 163 328 156 38 73 22
3096 22 157 202 203 110 98 222 139 104 102 35 101 88 170 39 31 63 188 160 85 155 279 143 65 69 132 83 93 159 207 159 184 176 78 200
2697 200 204 97 162 171 51 111 102 75 132 138 193 134 143 123 99 179 159 116 134 44 37 126 112 100 83 163 135 8 178 154 77 199 183 96 49
2286 49 61 133 201 260 340 283 30 100 163 71 116 119 116 113 67 157 113 145 214 192 189 80 190 97 111 83 13 138 279 252 149 86 78 158 94
1876 94 53 312 87 169 84 84 59 202 17 180 198 320 285 77 111 209 326 360 143 310 195 185 278 304 155 118 19 122 79
1535 79 119 108 12 135 60 148 147 278 154 52 92 154 221 169 33 103 152 146 45 46 175 257 87 142 144 204 263 38 207 258 121 91
1160 91 57 237 167 178 228 137 21 57 201 142 120 60 77 225 285 275 251 52 35 66 91 12 181 166 123 195 30 180 176 18 228
796 228 202 277 4 127 245 91 143 213 149 103 249 212 72 236 119 62 17 60 156 220 135 234 304 85 108 232 264 52 46 72
444 72 198 102 196 139 46 158 80 104 269 260 111 76 48 137 109 120 142 102 98 71 94 141 113 156 110 112 79 48 45 25 73 185 23 93 85
33 85 152 103 197 164 32 54 239 255 110 36 37 61 117 118 25 114 280 129 88
-190H8
##PAGE=	F1=17909
##FIRST=	25169.313707327481097,	5807.6787752999953227,	0.2419713437557220459
##DATA TABLE=	(F2++(Y..Y)), PROFILE
5808 115 97 62 70 108 190 256 72 245 303 209 126 191 110 152 92 37 105 237 120 179 218 150 33 78 22 62 138 225 29 204 169 172
5432 172 77 104 173 106 110 166 239 72 64 40 147 105 112 145 184 58 128 103 128 38 241 229 160 302 133 249 253 173 114 143 248 132
5056 132 36 147 140 27 64 125 106 212 139 75 149 178 244 252 207 138 89 91 94 18 66 26 105 130 81 57 136 89 271 172 153 156 93 93 48 174
4634 174 213 197 122 33 59 222 306 227 31 98 110 93 64 73 66 179 158 203 59 224 82 48 30 99 46 8 102 118 64 172 54 270
4258 270 268 87 42 129 139 207 188 114 338 267 150 107 108 116 162 188 193 77 113 154 129 116 169 215 109 46 15 44 117 33 182 50 119
3871 119 85 115 185 182 158 117 85 261 306 212 49 55 162 225 95 125 144 193 75 143 120 71 78 107 111 262 174 35 64 83 39 70 76 126
3472 126 263 101 235 282 262 219 176 99 150 218 167 70 54 129 104 63 213 155 51 119 166 120 32 27 71 224 158 296 151 34 78
3108 78 43 178 195 197 102 78 260 196 78 113 51 95 67 174 33 28 51 165 149 107 124 236 123 78 70 141 62 93 154 197 124 182 194
2721 194 70 192 213 54 206 140 70 92 125 80 124 212 202 104 143 147 65 171 151 134 115 35 50 136 101 98 70 211 156 20 170 171
2345 171 61 172 186 93 69 57 160 191 241 272 240 22 108 115 80 97 85 132 124 77 147 73 155 220 211 223 57 200 91 92 41 59 102
1958 102 264 217 151 76 78 170 45 23 341 110 148 99 83 96 208 34 215 184 245 257 76 68 179 342 345 137 304 210 228 303
1606 303 296 128 116 26 175 23 125 109 27 78 71 125 187 297 149 16 121 181 218 193 8 112 172 155 26 61 122 222 120
1265 120 144 147 162 249 93 191 288 165 92 28 190 173 168 176 130 41 54 242 159 156 63 62 156 245 303 239 43 70 10 64 57 174 187 96 168
854 168 14 142 150 21 240 203 230 28 132 199 70 115 240 133 113 274 214 81 212 107 60 46 70 154 226 127 207 291 94
514 94 75 158 242 79 81 63 184 84 206 101 69 136 76 98 237 226 122 76 57 121 93 114 150 108 82 46 114 86 134 206 131 104 34
127 34 79 45 48 72 153 43 103 72 127 76 227 152 72 79 217 217 98 61 45 58 135 133 18 137 264 96 94
-190I4
##PAGE=	F1=17806.7
##FIRST=	25169.313707327481097,	5807.6787752999953227,	0.36072018742561340332
##DATA TABLE=	(F2++(Y..Y)), PROFILE
5808 155 132 93 71 120 188 258 86 263 294 182 116 158 89 154 136 19 110 230 137 192 256 148 125 106 19 41 141 209 49 224
5456 224 141 136 133 171 180 148 129 185 229 63 102 51 141 119 127 140 136 59 135 132 130 62 222 174 131 246 105 232 251 213 118 175 249 89 66
5045 66 130 145 51 90 126 118 174 128 76 148 161 165 201 155 102 92 67 72 61 107 41 112 160 56 81 129 75 269 173 172 173 56 47 115 143 147 184
4610 184 137 20 85 248 337 233 81 110 125 125 72 49 33 139 140 201 62 181 89 56 50 111 35 16 130 144 74 154 38 271 245
4247 245 97 80 157 115 204 170 139 328 272 131 56 114 61 141 175 190 47 117 156 118 111 164 277 206 75 12 58 131 33 215 139 65
3871 65 87 148 191 146 142 96 92 240 282 185 36 99 188 191 52 168 171 204 43 120 43 53 14 29 132 244 166 32 15 76 47 135 121
3484 121 139 246 52 205 245 246 204 188 88 168 225 183 55 78 100 71 47 182 119 35 98 152 127 40 38 46 204 147 254 152 66 91
3108 91 61 185 166 191 108 51 278 249 77 107 76 109 42 192 65 40 41 138 140 109 80 194 113 85 74 155 70 74 129 168 115 179 216 81
2709 81 180 206 47 245 91 91 85 155 88 116 257 177 55 121 154 70 167 138 129 84 44 81 142 75 108 68 240 156 43 163 174 39
2333 39 142 181 63 88 65 176 175 211 203 209 67 136 81 92 71 45 170 159 85 135 33 129 213 218 243 43 196 57 96 42 90 71 229
1946 229 168 149 100 113 177 18 59 346 150 135 108 62 122 190 43 222 182 191 218 77 72 150 324 318 104 274 209 248 301 264 80
1582 80 116 75 225 56 117 95 38 42 82 109 220 293 133 17 158 187 183 192 7 128 185 165 70 85 107 164 148 189 171 107 227 143
1207 143 161 305 199 100 26 133 180 156 117 141 72 60 274 177 159 61 75 85 195 307 210 48 92 63 77 83 157 199 61 129 44
843 44 106 162 49 233 194 156 49 150 146 84 80 241 124 111 267 188 94 172 91 47 82 100 143 231 115 173 261 94 47 69 194 117
467 117 134 91 155 66 200 62 103 101 99 88 198 198 132 84 60 104 85 122 152 110 80 21 121 26 177 242 149 108 8 112 42 99 109
80 109 105 89 116 39 97 69 241 127 120 127 182 165 89 75 62 51 152 127 24 154 234 74 91
-190I1
##PAGE=	F1=17704.5
##FIRST=	25169.313707327481097,	5807.6787752999953227,	0.3979880213737487793
##DATA TABLE=	(F2++(Y..Y)), PROFILE
5808 182 152 100 88 116 174 245 104 268 264 139 107 149 76 138 159 46 135 210 149 199 268 167 211 147 21 53 128 172 107 241 121
5444 121 97 186 234 160 193 138 192 207 66 131 59 132 125 138 120 81 76 148 153 110 104 192 120 103 184 69 196 240 234 131 196 235 45 94 102
5033 102 136 101 123 124 118 121 121 81 145 147 80 123 106 110 121 50 69 115 139 43 106 184 102 129 108 61 245 175 179 177 47 115 161 121 73 168 185 28
4587 28 116 266 360 243 124 132 138 169 94 45 41 87 119 167 70 151 94 61 62 133 42 14 160 167 81 129 32 241 201 97 123 160 71 206
4188 206 164 160 299 254 102 26 119 48 154 176 168 28 155 172 93 105 138 331 323 117 26 80 138 47 233 210 15 125 178 184 104 116
3812 116 68 106 220 240 149 92 136 189 139 28 198 192 207 15 89 51 81 67 56 137 204 157 42 70 78 33 177 164 140 209 7 164
3437 164 191 205 172 180 57 181 214 172 76 126 90 50 30 127 114 62 74 119 112 50 39 52 165 130 205 149 94 104 73 172 123 183 126 27
3038 27 273 273 94 86 107 136 32 205 115 44 38 114 135 95 68 156 111 89 83 167 78 46 91 130 152 176 251 125 155 180 108 274 42 112
2639 112 77 174 103 112 260 130 62 93 150 99 175 120 95 42 67 123 148 50 124 74 244 137 60 151 162 13 116 174 31 107 77 188
2263 188 162 170 145 198 123 181 93 105 41 4 214 203 88 128 4 69 191 209 241 39 186 4 137 69 99 53 181 108 140 138 159
1899 159 179 90 96 324 172 120 99 31 124 155 41 202 174 174 169 82 167 148 273 286 55 229 188 241 275 221 54 117 120 258 107 95
1523 95 70 33 45 78 100 239 267 105 46 182 169 129 173 23 136 186 173 101 99 138 94 168 241 204 54 201 180 124 303 219 104
1160 104 84 71 180 134 79 178 101 73 292 193 126 54 83 44 156 292 168 52 97 108 102 80 132 197 25 85 75 70 196 102 207
796 207 177 73 67 178 118 116 45 211 122 109 233 141 106 127 72 26 114 128 116 215 100 139 218 77 37 19 134 161 189 146 124 47 177
408 177 37 121 64 142 104 155 177 149 94 60 103 74 143 150 109 107 87 108 49 228 261 161 114 28 135 43 159 164 51 131 130 9 94 101
9 101 238 94 152 174 143 101 78 73 83 49 160 105 48 161 198 63 80
-190H0
##PAGE=	F1=17602.2
##FIRST=	25169.313707327481097,	5807.6787752999953227,	0.28418001532554626465
##DATA TABLE=	(F2++(Y..Y)), PROFILE
5808 190 153 86 114 97 152 215 116 264 222 93 108 155 73 112 162 70 168 179 157 187 253 187 278 185 33 98 104 130 148 244 124 65 231
5420 231 280 116 222 143 187 181 79 145 39 108 119 140 113 70 96 161 156 66 154 152 84 92 144 41 162 228 228 135 198 211 37 122 77 118
5021 118 164 153 114 116 66 125 93 141 136 29 45 74 141 146 40 74 160 155 39 97 195 148 165 75 59 212 176 175 170 81 149 184 122 29 153
4610 153 241 47 142 280 371 252 152 142 144 211 133 70 77 51 93 111 89 142 93 68 66 159 76 11 186 186 90 95 33 188 146 102 154 148 41
4200 41 210 163 174 260 220 75 35 122 74 193 186 127 30 185 193 56 107 106 369 437 164 44 98 128 61 229 243 45 195 196 160 64
3824 64 88 42 124 208 195 121 146 160 166 77 68 213 195 203 15 53 98 132 155 112 125 159 147 61 120 73 37 185 187 127 163 69 121 140 145 135
3401 135 154 21 179 192 139 100 168 97 35 42 76 154 99 54 84 86 63 28 59 113 109 154 131 105 113 78 142 76 164 138 26 249 263 106
3002 106 56 131 165 64 202 163 35 40 98 132 73 116 122 114 98 96 170 71 23 56 96 197 169 290 183 115 137 176 291 47 134 60 181
2615 181 122 122 219 73 115 79 142 120 192 107 43 23 92 172 156 49 140 80 218 120 75 132 140 13 100 167 69 122 85 197 152 129 100
2228 100 213 186 231 135 118 15 37 252 239 88 137 29 17 157 184 213 51 178 75 188 82 87 49 131 45 122 160 189 175 161
1876 161 124 281 167 99 77 29 101 113 31 169 152 174 110 86 266 170 195 255 12 180 150 210 234 176 76 119 155 268 136 65
1523 65 41 48 60 57 98 244 226 64 68 186 135 79 153 50 126 172 175 116 99 171 49 179 268 234 60 176 201 90 283 221 105 150
1148 150 11 166 99 104 220 117 84 292 206 69 48 71 55 153 267 121 58 87 134 114 46 102 177 25 44 111 40 212 157 179
796 179 159 63 81 208 140 149 18 157 122 130 186 86 114 99 75 40 139 143 70 181 90 110 175 39 47 89 87 204 235 206 113 20 141 34
397 34 110 58 184 147 111 167 174 101 62 120 54 171 150 108 150 166 81 99 272 265 165 115 32 141 60 217 217 17 164 143 51 124 151
9 151 220 57 161 211 118 35 67 63 105 65 159 74 73 157 165 51 63
-190F3
##PAGE=	F1=17500
##FIRST=	25169.313707327481097,	5807.6787752999953227,	0.10690393298864364624
##DATA TABLE=	(F2++(Y..Y)), PROFILE
5808 178 135 60 139 68 129 172 116 257 177 71 116 151 87 89 153 111 215 142 161 158 212 192 319 214 48 149 79 112 164 232 148 46
5432 46 266 303 63 225 150 177 171 92 151 47 74 102 134 140 125 106 165 137 16 203 106 76 104 149 79 157 215 195 126 182 190 74 148
5045 148 77 97 225 176 99 121 47 137 113 139 122 64 66 65 168 152 30 79 183 149 47 99 189 176 181 36 61 187 173 162 152 115 136
4657 136 190 146 69 138 280 54 157 286 363 255 160 131 142 242 176 94 107 77 61 77 120 148 82 81 66 180 115 32 207 202 95
4294 95 53 30 126 96 116 166 135 62 211 157 184 218 183 63 32 126 98 237 195 73 40 191 205 28 118 91 384 524 207 65
3941 65 103 99 76 201 230 94 268 200 120 39 69 48 142 209 159 115 177 166 136 31 104 218 173 197 32 30 124 190 235 145 97 137 127
3554 127 89 146 63 85 157 188 104 121 121 83 126 78 107 119 55 156 168 101 111 189 118 19 72 76 195 131 41 53 58 78 16 52 60 85 106 95
3132 95 95 112 76 108 39 127 128 49 216 226 106 27 138 184 109 183 195 16 43 88 126 54 166 93 117 114 111 165 58 30 51 73 220 151
2732 151 315 234 63 87 229 296 83 159 38 178 145 151 148 32 148 82 138 133 210 108 82 81 114 221 166 72 156 81 169 126 93 105
2357 105 111 36 93 153 123 132 84 198 138 129 69 244 245 275 179 133 24 73 275 259 83 160 54 108 120 145 174 92 177 143 224 76 65
1970 65 51 95 62 90 153 190 165 219 140 222 141 82 56 58 69 73 18 142 122 162 46 89 333 194 102 224 29 135 100 169 187 134 94
1582 94 120 170 252 143 32 17 86 81 31 103 239 183 14 84 168 104 64 145 89 108 143 170 123 88 185 89 184 255 253 123 156 210 74
1195 74 251 206 106 211 38 139 59 149 247 114 90 276 212 59 54 39 77 177 247 90 69 67 140 107 14 84 141 52 17 155 87
831 87 198 197 178 147 134 87 227 179 175 7 95 121 175 141 78 120 115 110 86 155 145 27 147 87 92 155 34 63 131 84 235 262 257 126 23
420 23 109 46 75 85 214 185 71 168 199 99 67 138 32 196 153 111 189 237 53 134 300 257 160 110 18 124 86 265 256 71 186
56 186 155 80 155 199 190 23 151 231 113 63 72 69 120 89 157 39 89 140 138 32 43
-190D3
##PAGE=	F1=17397.7
##FIRST=	25169.313707327481097,	5807.6787752999953227,	0.15389022231101989746
##DATA TABLE=	(F2++(Y..Y)), PROFILE
5808 151 101 34 160 36 103 122 101 252 140 83 118 121 115 83 149 164 273 104 160 125 155 174 332 230 61 192 67 127 156 207
5456 207 178 42 290 301 59 200 154 166 184 98 166 126 52 77 117 176 184 100 159 96 79 241 61 76 127 179 148 198 197 146 111 155 180
5068 180 114 171 104 79 270 195 84 130 87 149 138 138 104 88 121 64 185 134 42 83 174 123 71 119 168 186 177 7 59 178 163 147 121
4681 121 133 86 194 181 104 113 288 44 165 280 330 244 151 99 131 257 213 101 124 122 25 126 161 172 61 96 63 193 146 65 222
4317 222 214 86 16 20 82 83 129 157 126 85 201 140 189 182 153 66 25 129 112 267 193 10 46 176 202 56 128 100 371 566 236 79
3941 79 92 57 103 156 189 149 322 191 80 37 68 71 152 223 137 115 173 153 132 60 124 214 133 194 68 60 126 242 293 154 59 146 89
3554 89 123 146 75 132 102 167 81 90 155 47 142 24 92 85 104 115 147 90 117 185 145 7 96 101 207 155 33 30 28 91 46 32 21 61 69 54
3132 54 67 96 67 88 30 69 93 78 190 182 96 26 124 185 153 153 200 23 39 82 113 43 189 66 117 131 124 159 62 47 73 51 209 118
2732 118 311 268 18 50 261 293 108 184 26 172 165 194 80 58 146 88 136 146 226 122 169 146 125 262 171 101 174 78 106 145 107
2369 107 79 83 49 85 123 158 138 75 184 121 183 50 275 290 301 211 152 42 104 278 260 77 179 74 189 90 99 152 154 176 189 233
1993 233 52 47 52 90 143 61 118 162 151 255 145 157 115 86 52 83 58 42 3 132 94 129 16 88 352 206 15 194 44 104 57
1629 57 133 149 94 89 119 159 220 132 10 16 121 111 28 111 232 161 51 99 133 98 81 155 135 116 106 161 131 68 174 136 184 204 257 189
1230 189 134 217 91 220 180 112 258 72 116 71 174 249 94 93 250 215 121 67 29 112 198 243 95 83 46 125 81 76 98 102 72 28
854 28 188 133 163 207 212 142 190 84 225 204 184 21 43 119 225 117 142 125 151 148 131 165 142 65 143 88 97 176 113 84 139 115 251 263
455 263 295 145 71 113 68 44 106 230 195 38 176 211 83 67 140 36 209 161 121 214 286 45 154 308 238 145 100 16 86 112
103 112 301 277 131 203 162 86 167 236 154 37 131 234 113 141 100 99 120 109 160 13 93 113 116 24 29
-190B9
##PAGE=	F1=17295.5
##FIRST=	25169.313707327481097,	5807.6787752999953227,	0.18206860125064849854
##DATA TABLE=	(F2++(Y..Y)), PROFILE
5808 116 61 31 173 12 75 75 75 250 115 95 117 70 145 96 160 210 329 73 156 102 91 134 319 229 71 216 83 150 131 176 204
5444 204 55 303 275 108 162 149 151 208 96 195 214 63 55 85 193 224 75 151 43 149 260 44 67 153 208 221 258 172 111 114 127
5080 127 179 151 194 132 71 290 214 73 137 128 157 164 134 81 94 153 58 189 98 91 87 133 81 95 143 136 182 155 44 68 180 149 132 79 135
4669 135 46 203 210 118 75 264 28 163 256 270 215 125 60 121 260 241 89 128 158 26 199 202 209 57 102 59 191 164 101 229 219
4305 219 53 58 3 84 106 133 127 122 86 176 112 191 156 132 83 47 130 116 275 180 59 50 144 187 102 136 121 332 554 240 77 68 12 142
3906 142 107 160 207 340 170 74 51 78 86 150 241 131 96 132 121 163 105 132 205 100 197 124 105 112 277 321 145 27 160 39 157
3542 157 125 110 157 34 135 78 62 169 9 148 39 83 61 142 66 133 115 141 163 165 21 107 104 186 172 26 25 7 100 90 14 27
3167 27 48 48 51 30 64 50 86 40 4 67 107 186 153 81 54 96 169 188 118 176 59 26 77 96 51 180 49 113 139 134 161 81 59 94 30
2756 30 166 72 274 278 51 62 270 283 117 205 28 169 179 235 74 94 112 85 130 163 239 131 238 201 122 285 162 129 201 72
2404 72 45 150 107 63 61 49 67 76 165 138 62 152 116 246 50 283 310 302 226 170 49 130 265 249 69 182 88 241 70 60 165
2040 165 218 169 209 213 18 48 50 108 229 94 70 118 137 264 141 102 113 106 60 98 77 26 12 135 80 79 65 76 319 210 62 163
1664 163 58 95 61 115 127 59 70 119 123 182 113 25 20 139 142 43 115 225 166 111 119 89 113 102 180 182 165 73 151 149 49 145 162 176 128 250
1242 250 245 103 232 125 198 146 116 285 93 117 131 170 228 75 99 224 215 171 77 83 167 195 243 118 98 40 93 48 135 129 92 79 47
854 47 187 120 125 182 251 135 217 73 195 208 173 63 17 118 260 116 221 128 173 168 162 174 142 113 160 84 125 223 203 109 121 153 254
467 254 235 316 159 120 150 93 63 104 236 169 18 186 205 56 62 115 64 202 170 145 222 305 52 161 293 211 121 87 52 33 134
103 134 324 279 181 212 157 69 155 254 120 70 113 219 101 214 138 130 102 115 168 34 89 79 97 45 30
-190C0
##PAGE=	F1=17193.2
##FIRST=	25169.313707327481097,	5807.6787752999953227,	0.2477995753288269043
##DATA TABLE=	(F2++(Y..Y)), PROFILE
5808 84 28 47 179 23 44 39 45 247 109 86 125 48 163 116 180 229 365 54 154 103 30 97 285 203 78 216 113 162 102 146
5456 146 219 81 310 230 147 136 139 129 220 86 222 287 78 65 37 185 237 36 162 15 198 256 70 49 177 228 284 309 146
5115 146 132 147 113 171 183 216 153 78 283 239 70 138 156 156 185 126 69 111 161 48 181 57 152 85 64 38 107 160 97 173 119 83 108
4728 108 189 133 114 43 129 84 216 224 117 36 218 38 156 210 188 165 87 60 120 258 262 62 123 182 60 255 237 244 88 93 55 173
4352 173 165 135 223 212 24 106 19 100 128 123 86 118 64 135 80 187 143 119 116 75 127 109 259 158 125 59 107 171 147 140 140 277 492 216
3953 216 56 52 30 187 67 184 260 319 143 103 77 91 88 132 251 146 52 63 78 197 138 141 193 107 205 187 151 89 287 315 126
3589 126 33 162 31 186 97 145 153 49 109 104 47 170 62 131 63 73 55 164 58 128 146 183 138 171 33 105 83 141 179 38 44
3225 44 45 104 130 33 46 61 32 87 32 19 43 86 58 84 116 134 203 149 68 82 79 146 207 82 139 96 31 72 84 91 147 61 104 134 139 170 91
2791 91 68 106 59 106 23 212 263 88 90 262 275 115 216 21 168 182 265 104 116 59 70 119 177 249 126 269 237 101 285 134
2439 134 148 233 62 19 127 84 63 48 36 39 27 147 130 48 114 130 287 72 253 298 281 223 181 51 150 251 237 59 168 90
2087 90 258 61 53 185 268 151 203 173 21 61 44 130 307 168 49 78 122 246 137 82 131 133 79 102 91 21 24 147 82 38 96
1723 96 52 248 215 107 135 97 106 92 117 126 36 69 125 67 155 107 39 17 134 163 45 109 217 184 164 144 49 128 126 212 221 220 63 143 177
1312 177 54 105 164 158 54 238 282 63 257 158 183 104 110 289 107 135 186 139 200 81 105 207 216 187 80 142 231 166 230 134 109
948 109 53 58 69 176 156 126 76 58 136 30 106 124 267 121 219 67 142 194 147 125 29 116 268 120 287 130 167 162 173 183 149 142
573 142 166 72 160 268 287 134 90 187 247 182 318 164 154 186 111 91 75 239 115 26 193 184 38 71 66 91 174 179 185 211 289 45 154
185 154 259 177 92 77 88 37 153 336 267 211 212 142 52 127 251 97 89 105 190 72 268 171 148 71 107 169 60 86 44 82 64 42
-190D2
##PAGE=	F1=17090.9
##FIRST=	25169.313707327481097,	5807.6787752999953227,	0.38621097803115844727
##DATA TABLE=	(F2++(Y..Y)), PROFILE
5808 65 32 64 179 32 35 23 23 237 132 54 145 105 163 135 197 212 364 40 154 129 29 115 237 151 85 189 141 159 85 121 216
5444 216 118 316 175 161 142 135 105 213 70 230 324 76 105 37 171 227 18 201 67 213 232 103 30 195 235 328 334 127 187
5103 187 190 119 149 208 239 166 96 251 272 75 133 170 143 194 111 86 157 156 42 165 33 204 70 32 34 104 162 52 165 75 117 163
4728 163 199 117 92 65 131 122 226 218 107 55 167 63 147 147 95 99 49 97 135 259 280 44 111 193 88 281 256 263 125 70 52 141 151
4340 151 161 204 193 91 135 39 101 130 102 60 111 28 86 55 177 141 122 156 90 125 98 221 132 179 76 71 165 189 144 154 219 397 170
3953 170 45 78 62 231 35 232 298 265 116 130 105 107 80 101 245 176 40 70 32 211 155 154 174 137 214 242 195 72 269 284 106
3589 106 50 149 75 202 83 164 122 115 103 136 80 165 131 111 69 61 67 176 107 131 164 225 128 157 36 94 73 97 176 79 63 84 104 155
3190 155 58 66 92 10 114 68 41 86 86 83 156 191 149 222 156 65 108 105 127 206 59 126 127 74 68 86 150 111 94 95 115 136 176 81 76 111 112 60
2744 60 29 139 232 113 108 248 271 106 213 1 164 170 276 117 119 27 47 103 181 255 109 252 246 68 264 86 148 259 49
2404 49 50 82 40 78 46 33 35 66 117 112 39 95 153 292 104 183 256 246 207 184 70 160 258 235 43 139 77 239 64 70 185 293 126
2016 126 183 124 55 76 36 151 368 241 78 73 104 210 139 95 140 165 114 96 86 18 30 167 96 68 114 40 163 225 119 112 152 128
1641 128 113 131 140 37 101 140 4 151 135 43 21 111 168 30 89 202 192 200 166 42 132 155 241 244 252 77 140 207 81 66 148 128 38
1254 38 228 295 53 288 183 160 55 86 269 126 143 214 94 178 103 104 200 217 164 74 190 288 123 188 132 112 70 64 139 194 167
890 167 168 69 59 49 116 122 45 248 103 210 85 91 174 122 196 54 111 245 113 326 136 130 130 166 194 161 148 147 51 189 298 349 151
502 151 65 210 232 114 300 164 161 204 114 94 48 242 56 43 190 157 67 108 8 108 127 187 232 186 238 15 133 208 138 70
150 70 71 115 104 176 340 246 209 194 123 69 99 224 91 90 99 154 32 296 191 145 49 85 151 79 88 30 72 65 51
-190E1
##PAGE=	F1=16988.7
##FIRST=	25169.313707327481097,	5807.6787752999953227,	0.35362389683723449707
##DATA TABLE=	(F2++(Y..Y)), PROFILE
5808 61 49 82 179 39 73 31 35 216 183 14 162 162 147 149 202 160 324 20 151 162 73 170 187 75 95 140 161 143 81 100 193 157 322
5420 322 128 149 157 139 88 189 52 212 317 60 150 107 178 200 62 252 111 193 194 132 27 203 229 346 328 121 236 226 132
5080 132 112 225 259 175 109 203 307 94 120 170 120 186 96 119 218 153 48 154 33 230 41 112 60 88 147 6 159 32 140
4740 140 212 201 114 73 111 150 132 229 196 95 105 131 78 152 75 23 56 57 131 157 269 298 74 98 194 107 275 257 261 147 43 52 97
4352 97 127 177 175 169 168 138 55 80 109 75 92 102 16 47 46 160 144 148 191 92 130 93 170 109 215 95 58 175 225 151 164 177 291 124 85
3941 85 125 87 269 15 262 311 200 106 136 124 127 72 67 213 204 120 164 39 199 153 167 149 151 220 274 233 88 233 237 88 53 132 102
3554 102 201 89 163 73 167 107 154 129 154 196 132 67 53 93 192 156 139 166 247 136 133 30 83 114 87 165 134 73 118 100 159 79 92 126
3155 126 27 120 97 98 159 115 109 208 252 146 223 157 76 132 151 117 185 85 166 146 126 66 94 209 101 125 88 87 123 168 59 86 111 158
2756 158 69 65 72 198 130 119 231 272 94 198 35 147 140 268 121 104 67 31 86 171 252 104 194 226 55 228 36 126 264 34
2404 34 72 49 42 102 50 64 81 124 97 86 34 110 167 262 136 80 196 213 184 183 116 154 288 243 21 105 48 200 80 85 156 292 101
2016 101 165 83 81 96 41 167 402 294 107 91 81 169 149 108 125 203 158 81 66 15 29 189 116 119 128 72 89 233 105 97 204 150 116
1629 116 146 159 57 142 161 59 164 189 37 39 80 160 10 56 179 184 215 178 69 125 182 255 244 247 95 143 232 110 38 126 90 60
1254 60 218 286 106 319 199 121 6 43 229 150 127 207 56 167 116 90 196 214 112 65 218 324 108 119 112 102 84 109 218
913 218 192 156 190 66 50 72 234 134 37 193 99 208 126 104 161 120 258 84 103 193 91 332 153 68 81 151 203 171 134 115
561 115 26 205 305 379 156 56 222 207 49 264 161 137 198 103 66 103 250 50 58 175 136 114 157 68 110 75 191 275 153
221 153 163 44 110 149 101 72 69 129 168 205 335 225 167 153 108 92 83 176 90 70 88 119 35 290 196 126 49 63 111 90 95 49 72 45 51
-190E1
##PAGE=	F1=16886.4
##FIRST=	25169.313707327481097,	5807.6787752999953227,	0.18699419498443603516
##DATA TABLE=	(F2++(Y..Y)), PROFILE
5808 62 58 98 184 64 123 50 56 187 247 43 162 195 118 154 191 89 252 45 145 182 105 213 148 15 113 83 168 120 72 82 154
5444 154 187 318 107 120 157 138 79 158 36 176 270 50 190 179 210 167 97 291 144 142 152 159 36 203 207 334 291 118 263 246
5092 246 136 65 231 269 182 106 145 337 135 100 163 91 158 87 144 269 160 64 154 28 218 40 179 74 66 122 40 147 37
4751 37 139 243 189 139 82 146 176 115 225 170 86 148 117 72 173 8 82 109 106 146 172 285 315 119 91 189 120 240 239 241 147 55 59
4364 59 47 100 179 142 152 232 110 67 50 75 53 146 100 48 46 42 136 144 181 206 96 145 106 114 92 229 109 83 193 251 162 169 168 196 110 136
3941 136 168 108 302 71 256 298 167 131 121 124 148 77 77 158 220 203 248 90 164 130 170 118 131 218 277 263 134 192 190 69 43 126 103
3554 103 183 97 141 26 198 104 148 164 136 242 184 68 56 124 216 185 150 155 242 157 118 20 81 170 108 148 187 69 143 89 145 99 122
3167 122 155 63 105 113 151 240 175 125 232 283 117 197 142 92 153 193 106 148 138 226 148 174 65 95 253 117 140 86 55 100 144 56 98
2779 98 104 182 92 87 26 175 147 131 208 271 80 176 71 117 94 248 139 80 100 43 74 145 237 131 112 185 93 187 66 91 238 19
2404 19 86 75 110 129 54 105 133 165 97 62 29 137 169 208 157 32 143 194 161 180 172 131 317 247 7 73 12 161 110 97 105 270 79
2016 79 157 77 93 124 69 175 400 316 117 104 55 147 164 106 81 248 198 59 41 21 16 201 130 159 147 111 51 235 77 92 240
1653 240 167 103 153 174 82 176 179 109 184 250 36 58 55 144 30 24 147 166 212 177 96 112 201 246 226 203 107 150 243 134 26 109 52 66
1254 66 203 262 168 344 206 69 54 12 175 172 89 168 44 155 109 61 190 199 48 58 223 334 146 50 79 80 101 155 290 178
901 178 125 180 76 33 135 217 80 100 113 116 218 177 155 162 143 295 112 92 124 56 308 180 17 33 143 204 177 112 101 17 206
538 206 292 370 145 50 224 174 49 213 153 88 173 94 16 184 265 82 62 147 117 158 199 120 99 54 192 305 120 80 116 112 104 72
162 72 95 67 131 222 239 317 209 89 85 97 92 77 114 79 41 74 96 83 251 187 99 49 58 53 98 103 69 73 8 41
-190D1
##PAGE=	F1=16784.2
##FIRST=	25169.313707327481097,	5807.6787752999953227,	0.28400498628616333008
##DATA TABLE=	(F2++(Y..Y)), PROFILE
5808 60 59 111 192 105 167 68 70 155 304 80 138 198 87 151 164 39 164 106 145 181 119 224 124 101 140 49 165 95 50 70 116 199
5432 199 295 106 83 133 118 64 128 27 141 199 64 221 244 238 132 114 304 166 75 111 186 40 197 171 294 235 108 265 248
5092 248 120 31 225 260 183 85 88 355 189 72 152 70 119 99 151 294 171 80 159 21 170 90 220 75 44 96 81 126 79 107
4740 107 250 168 182 123 161 200 92 216 159 77 174 113 46 199 41 139 177 154 139 167 299 328 152 87 180 133 189 207 213 127 99 74
4364 74 2 77 162 110 151 268 58 79 45 55 69 195 114 71 67 34 110 135 202 198 115 168 132 60 85 225 115 128 210 264 177 165 188 126
3965 126 128 171 199 133 329 146 219 261 198 180 94 103 168 102 140 87 227 271 300 143 122 88 158 91 78 212 253 285 187 157 151 44 30
3578 30 134 81 154 96 103 29 201 84 117 170 115 260 228 76 65 153 242 189 161 138 208 183 132 22 89 209 128 129 222 55 158 66
3202 66 118 122 150 172 93 73 123 191 314 238 125 226 278 60 143 108 102 170 225 89 101 189 275 132 209 70 85 268 136 132 84 30
2826 30 71 108 87 110 92 176 93 93 5 166 168 156 177 260 68 150 100 80 41 228 170 68 116 68 64 104 209 176 61 133 140 153 123 85
2427 85 180 20 96 103 171 151 56 139 177 183 105 66 27 159 164 150 160 129 123 189 141 177 221 95 322 234 34 54 42 150 152 112 49 240
2028 240 58 164 105 91 158 110 170 360 304 112 103 38 152 174 89 17 294 226 32 21 34 22 193 132 183 168 134 51 233 54
1676 54 99 252 179 82 143 180 105 197 186 144 196 299 70 72 47 130 51 40 116 157 197 164 116 97 208 216 202 129 109 155 240 152 28 105
1277 105 36 85 184 236 218 361 211 44 103 71 120 183 43 113 47 137 83 25 179 168 35 52 207 319 192 84 45 54 122 188
925 188 343 162 80 135 88 39 147 79 149 126 46 140 228 227 184 174 172 297 137 79 51 43 268 206 78 48 145 195 182 92 122 37 195
538 195 263 328 123 36 226 138 96 151 140 30 141 115 41 252 281 105 52 114 92 190 220 146 75 90 190 315 101 53 191 151
185 151 106 61 122 61 125 259 269 283 196 14 9 85 61 70 51 51 35 69 89 128 185 165 78 41 67 15 106 107 82 70 41 24
-190B4
##PAGE=	F1=16681.9
##FIRST=	25169.313707327481097,	5807.6787752999953227,	0.29273274540901184082
##DATA TABLE=	(F2++(Y..Y)), PROFILE
5808 52 54 120 199 145 194 79 76 129 336 100 98 176 60 139 129 77 80 169 166 161 114 207 109 167 173 71 154 76 39 69 111 188 246 97 50 88
5385 88 79 40 94 36 127 142 80 243 296 244 95 111 283 176 28 72 205 40 190 123 235 171 87 244 233 85 53 202 226 176
5033 176 56 51 354 245 57 139 74 95 137 135 284 175 87 153 46 98 135 232 73 29 80 114 102 117 47 237 149 226 178 157 217
4669 217 91 209 173 66 182 106 31 209 66 175 223 188 111 140 303 327 164 87 171 151 133 171 183 98 143 94 44 63 129 78
4317 78 158 268 18 93 76 76 116 230 141 85 83 33 83 118 201 172 149 194 158 21 85 213 122 178 219 268 192 147 212 81 143 181 213
3930 213 162 348 220 165 209 256 235 68 73 181 144 216 30 236 313 313 187 100 35 133 89 2 206 216 295 230 127 128 28 26 151
3566 151 54 127 89 59 51 175 50 69 147 107 251 242 85 81 172 256 167 172 124 153 211 163 42 99 219 137 108 232 35 166 36 87
3190 87 145 176 175 108 34 136 217 366 282 108 191 242 20 82 58 101 183 245 64 51 220 298 100 227 80 73 247 147 105 81 26
2826 26 40 67 115 117 76 141 71 86 15 161 193 195 141 238 72 124 121 52 47 218 189 81 118 94 53 53 171 214 96 88 170 135 160 122 101
2416 101 40 104 103 206 164 56 159 204 178 113 101 39 172 157 115 142 187 121 184 127 170 251 63 290 195 56 61 83 175 203 129 16
2040 16 213 33 183 141 75 184 152 147 285 262 100 91 41 169 173 63 54 334 236 11 16 50 66 158 122 191 184 131 71 231 54 113
1664 113 238 183 69 113 176 120 202 179 167 191 326 126 79 59 122 63 72 106 177 183 146 130 85 203 170 188 49 102 152 224 167 40
1289 40 113 51 129 171 215 246 368 221 88 138 121 89 180 44 84 47 129 50 37 162 118 75 48 176 286 217 153 46 47 148 206
925 206 369 151 47 67 88 88 257 623 514 111 101 157 225 270 170 188 199 265 168 61 24 83 239 218 127 92 147 175 187 84
573 84 144 58 176 229 265 105 19 230 112 133 85 120 39 114 154 90 289 289 126 33 87 54 203 214 137 44 132 186 308 102 105 254
197 254 201 138 64 143 49 117 277 285 232 176 123 110 78 44 66 52 13 61 78 92 160 109 133 73 65 67 69 116 106 90 60 88 3
-190C
##PAGE=	F1=16579.7
##FIRST=	25169.313707327481097,	5807.6787752999953227,	0.094066046178340911865
##DATA TABLE=	(F2++(Y..Y)), PROFILE
5808 39 47 123 195 169 194 80 74 115 335 100 53 140 40 119 105 118 26 215 204 141 89 181 109 198 200 101 140 66 84 76 144 162 179 67
5409 67 26 38 61 52 52 50 129 155 85 254 329 226 58 95 234 172 64 43 211 61 182 80 174 115 55 206 207 36 90 165 173 160
5033 160 65 65 332 290 83 124 96 119 194 106 239 162 80 128 78 26 154 218 76 34 80 135 94 149 37 214 142 258 235 144 225
4669 225 107 205 203 57 174 97 79 193 68 191 232 199 70 96 291 304 155 90 162 172 86 143 155 74 176 114 75 58 85 53
4317 53 162 237 78 110 107 106 170 255 169 95 97 51 60 104 180 143 188 221 172 39 91 210 148 223 217 266 203 111 220 48 140 167 211 193 354
3906 354 272 111 151 305 281 60 53 183 194 284 75 262 329 290 213 112 32 99 115 91 206 186 293 252 96 129 56 29 169 60
3554 60 118 93 30 61 124 28 53 119 124 224 221 90 102 180 248 129 183 116 93 233 191 69 107 199 130 85 218 25 169 69 52 165
3178 165 201 167 106 3 158 228 384 293 82 136 190 110 89 35 95 187 255 42 7 227 295 58 227 94 65 196 152 82 81 34
2826 34 20 25 121 112 62 84 36 68 39 156 218 240 117 206 99 98 139 48 99 216 181 103 116 117 45 11 128 233 129 61 173 127 168
2439 168 159 18 68 119 76 210 169 54 159 210 159 133 141 64 176 145 113 101 199 102 170 117 155 255 67 227 134 68 91 108 219
2075 219 257 141 30 195 23 212 166 49 190 182 107 183 203 93 71 49 174 154 41 122 361 230 22 18 65 125 101 108 185 189
1723 189 104 102 226 78 128 202 181 79 67 164 121 187 158 185 161 324 189 84 90 123 79 98 133 223 181 130 140 76 191 122 188 63
1347 63 85 137 204 182 56 124 67 166 175 205 253 365 237 135 153 152 104 165 78 110 52 147 49 75 145 51 95 43 142 244 212 200 79
960 79 67 172 213 365 150 76 66 68 154 569 1464 1039 82 176 167 207 299 112 198 223 214 203 37 59 131 234 209 148 128 143 144 192 90
573 90 142 79 155 199 201 108 32 235 113 159 27 92 71 93 186 117 284 275 155 43 78 25 191 180 98 27 165 182 289 119 144 294
197 294 238 162 71 156 31 114 274 280 172 145 216 212 92 111 74 107 51 84 88 91 178 40 94 79 118 45 106 123 100 96 46 124 16
-190A6
##PAGE=	F1=16477.4
##FIRST=	25169.313707327481097,	5807.6787752999953227,	0.14651019871234893799
##DATA TABLE=	(F2++(Y..Y)), PROFILE
5808 24 39 120 175 169 166 76 70 109 300 88 30 101 22 92 116 136 35 228 236 139 56 182 134 188 212 122 128 60 143 80 185 142 116 36 29
5397 29 34 112 101 13 61 128 213 85 252 340 201 47 76 166 153 98 68 200 107 173 68 140 81 25 158 171 30 120 114 138 144 113 90
5010 90 292 316 121 109 118 167 258 90 170 128 60 89 97 42 137 186 81 65 97 144 112 176 125 189 136 273 288 137 225 120 204 231 59
4622 59 157 87 135 154 61 192 206 187 27 62 264 255 135 100 149 189 55 126 141 71 194 132 90 54 57 57 157 184 129 126 126 131 215 276 194
4211 194 106 112 69 41 102 149 127 225 244 172 71 99 224 193 255 204 259 206 61 204 42 126 136 191 219 343 288 70 98 329 310
3848 310 72 50 166 239 328 130 298 327 245 212 132 84 65 140 175 215 173 278 247 67 149 97 30 185 99 128 111 55 61 78 64 108
3472 108 125 145 201 172 89 130 180 216 90 191 117 73 241 205 97 110 156 107 67 190 40 167 146 14 179 228 156 91 21 180
3120 180 226 360 266 57 72 142 196 162 85 93 181 255 44 31 208 273 19 214 109 49 128 152 105 91 39 39 24 104 94 60 20 20 50
2732 50 65 150 245 280 119 168 142 75 159 52 137 209 145 116 121 139 50 49 87 230 128 61 153 121 148 166 59 101 154 47 185 169 52
2345 52 141 197 135 171 174 94 166 126 126 53 185 53 147 111 134 233 94 150 60 67 133 115 266 305 141 37 187 56 246 172 24 167
1970 167 191 67 73 143 99 52 49 158 118 57 173 367 212 35 29 79 186 43 107 170 182 60 129 209 121 141 153 172 103 28 151
1606 151 104 152 133 206 104 293 244 93 135 138 112 123 180 276 192 125 145 70 175 82 184 124 62 108 187 200 64 130 76 173 189 199
1230 199 246 352 256 165 144 159 136 142 99 139 63 181 89 104 133 33 93 46 117 199 180 222 113 83 185 213 334 160 123 153 40
866 40 222 991 2459 1648 138 229 181 182 310 24 201 244 176 233 4 69 165 247 185 142 151 132 107 195 109 110 100 137 182 155 131 56
491 56 233 134 174 55 69 76 71 197 119 238 232 184 82 86 64 157 119 42 56 187 178 268 136 153 303 248 162 79 162 19 116 254 255 126
92 126 116 277 296 122 188 87 153 102 98 89 82 182 15 54 85 168 23 118 122 96 105 29 143 30
-190C0
##PAGE=	F1=16375.1
##FIRST=	25169.313707327481097,	5807.6787752999953227,	0.26527050137519836426
##DATA TABLE=	(F2++(Y..Y)), PROFILE
5808 10 31 112 136 145 114 82 67 106 241 72 44 69 7 61 144 128 41 199 248 154 38 214 178 141 204 136 127 52 198 73 218 140
5432 140 100 74 60 65 172 143 53 64 114 264 101 237 324 186 81 57 97 127 111 124 184 161 162 91 149 71 42 105 129 72 144 64 171
5045 171 133 161 101 241 319 144 97 134 204 313 105 96 75 34 54 95 76 82 142 82 104 120 144 136 200 203 164 112 271 334 146 217 123 201
4646 201 251 76 140 78 180 112 65 180 150 154 20 90 230 185 128 112 131 195 42 113 153 94 195 150 88 47 74 86 146 126 160 140
4270 140 131 154 241 301 217 121 127 73 25 109 120 125 258 259 157 99 108 245 236 264 184 248 198 13 168 76 114 96 151 232 313 260 49 57 324
3859 324 318 92 51 127 265 338 170 329 314 197 182 141 121 36 146 237 228 166 252 217 60 172 132 31 198 147 137 134 82 62 101
3495 101 103 170 158 145 200 117 83 162 175 169 76 199 124 108 229 203 126 104 108 66 70 161 57 159 226 57 192 257 148 72 22 189 209
3108 209 297 208 47 40 127 263 232 131 97 165 245 65 59 174 242 36 192 117 9 76 143 154 112 47 73 68 69 64 74 50 48 49 81 147
2709 147 272 303 129 131 187 63 178 45 151 187 92 117 135 154 66 78 57 206 92 86 128 111 111 138 104 140 209 69 144 166 54
2345 54 103 169 116 215 194 123 145 108 138 70 196 30 125 111 113 193 113 85 15 56 181 105 299 333 125 53 183 96 272 157 26
1981 26 113 173 63 41 104 117 56 40 119 68 104 203 345 189 41 49 87 236 75 124 152 168 16 139 177 178 148 107 157 128 63 143
1606 143 78 107 117 233 25 242 282 107 181 168 155 154 227 320 207 135 144 68 163 57 162 161 43 71 185 223 60 132 79 139 195
1242 195 186 233 330 272 176 116 143 158 116 106 144 69 207 131 122 133 107 81 64 108 158 132 225 142 83 177 210 285 180 156 235 59 278 1424
843 1424 3415 2225 255 253 206 164 298 83 200 262 178 244 36 50 177 259 155 121 163 119 69 189 131 56 121 128 173 138 155
502 155 74 225 161 179 107 84 54 45 187 101 166 164 199 120 91 111 120 46 49 94 200 171 254 145 140 280 229 137 89 162 36 121 221 215 125
92 125 126 294 350 148 244 89 184 137 109 79 68 176 31 24 85 192 76 111 114 107 122 14 142 39
-190C9
##PAGE=	F1=16272.9
##FIRST=	25169.313707327481097,	5807.6787752999953227,	0.24496418237686157227
##DATA TABLE=	(F2++(Y..Y)), PROFILE
5808 23 22 96 83 111 52 103 70 104 173 64 59 47 28 37 165 101 28 134 233 167 55 246 217 70 173 148 134 41 238 53 236 143
5432 143 119 132 98 79 209 159 90 59 89 287 132 211 286 188 130 33 43 112 108 176 180 208 147 114 173 70 74 52 83 95 160 60 241
5045 241 124 195 96 185 298 139 99 145 215 342 130 61 30 36 52 74 102 20 93 76 136 136 139 149 220 254 128 64 258 366 166 200
4669 200 124 188 264 103 127 68 205 100 80 159 86 111 36 136 199 113 141 119 107 188 49 93 189 133 185 166 70 43 107 111 133 82 171
4282 171 153 123 181 242 329 240 138 138 65 12 112 98 125 283 260 134 123 115 254 256 248 160 230 179 58 120 113 109 53 97 227 268 194 47
3883 47 34 293 305 116 69 68 265 312 194 339 294 166 131 137 136 18 129 273 243 148 219 171 71 182 155 38 212 198 133 147
3531 147 91 71 156 125 217 178 118 214 95 73 188 173 119 96 206 131 142 195 187 152 86 98 19 94 134 64 142 286 119 206 285 141
3155 141 63 21 174 179 207 134 53 87 150 299 278 153 99 142 224 88 82 137 214 64 169 119 59 85 125 193 137 59 108 109 33 47 101
2768 101 105 69 64 79 146 296 304 128 102 224 81 184 27 141 152 47 107 156 160 82 85 46 169 35 125 129 97 74 84 112 183 271 108
2380 108 104 162 66 48 131 105 250 199 144 120 115 144 141 258 112 117 114 98 145 115 71 71 45 227 99 305 329 97 91 178 128 279 127 40
1981 40 40 128 91 104 93 145 88 26 64 23 158 212 296 163 44 70 85 260 145 149 137 155 33 125 132 234 149 92 134 143 108 142 68 72
1582 72 122 264 65 182 296 120 216 199 192 188 260 343 221 159 134 74 159 45 116 168 48 31 207 247 49 134 74 72 180 158 220
1218 220 298 278 172 77 113 165 92 117 124 62 214 162 133 146 172 74 92 113 122 85 221 166 72 142 206 230 205 166 291 104 309 1762
843 1762 4122 2645 370 249 233 154 265 174 198 274 206 231 82 35 165 271 135 98 168 107 40 171 149 27 140 132 159 134
514 134 169 82 213 187 173 145 132 25 37 166 76 102 100 192 146 83 146 127 56 106 124 205 162 249 142 124 233 184 105 102 156 62 123 183
115 183 173 157 170 268 370 157 267 76 201 148 121 62 67 168 42 25 83 181 139 96 101 138 144 12 127 46
-190D6
##PAGE=	F1=16170.6
##FIRST=	25169.313707327481097,	5807.6787752999953227,	0.15014733374118804932
##DATA TABLE=	(F2++(Y..Y)), PROFILE
5808 53 22 74 22 94 34 131 79 104 117 67 73 32 54 53 167 60 26 48 194 171 73 251 231 13 124 153 142 36 264 28 234
5444 234 128 126 174 133 74 214 141 102 52 65 278 158 180 234 191 184 18 31 123 104 212 191 237 126 127 187 67 99 19 35 92 165
5068 165 101 296 104 208 82 127 259 107 125 154 199 337 144 93 73 66 66 54 149 107 61 71 147 133 133 143 231 269 75 27 241
4704 241 378 186 178 128 159 275 131 122 63 209 117 88 132 57 84 34 159 173 78 157 120 81 169 69 64 228 182 170 180 38 52 132
4329 132 119 123 73 174 169 107 205 219 351 262 154 140 73 8 103 80 132 291 248 111 144 123 242 246 213 139 204 157 102 78 137 104 46
3941 46 59 203 219 103 57 29 240 276 143 120 31 239 257 203 323 268 160 71 127 125 11 94 280 258 124 184 119 78 172 163 42
3578 42 230 251 117 143 80 91 196 123 243 166 90 222 121 57 200 177 77 126 213 132 151 140 160 175 57 130 49 123 105 57 115
3214 115 311 169 220 306 130 62 57 137 136 112 66 62 135 185 300 294 146 93 116 191 108 107 112 192 79 147 119 142 120 100 206 156 72 138
2815 138 135 14 79 133 148 82 75 61 144 312 277 110 88 242 122 166 30 118 119 55 93 175 155 90 72 60 127 30 167 156 78 61 27
2427 27 85 224 323 134 78 159 84 22 89 104 269 189 157 104 143 143 211 334 185 124 114 91 100 103 91 109 44 263 124 272 290 69
2052 69 137 167 147 259 100 41 49 64 111 126 102 181 134 17 23 51 206 206 224 133 51 87 76 252 203 170 129 149 59 95 93 273 147 119
1653 119 106 144 138 145 97 77 141 295 153 126 283 122 229 216 210 215 270 340 228 193 116 89 164 41 57 150 73 22 249 266 54 138
1277 138 65 33 147 119 203 256 273 161 52 87 156 72 149 98 47 197 172 141 167 218 77 124 120 98 50 213 188 79 83 203 179 224
901 224 151 315 131 308 1922 4413 2808 455 221 245 145 214 232 195 276 224 201 126 87 134 288 130 90 174 98 40 136 156
573 156 82 153 146 129 126 169 82 202 207 162 165 181 29 63 156 60 112 122 168 160 62 166 175 130 146 140 203 150 246 126 125 175 124 102 120 141 84
138 84 118 149 143 186 213 212 364 150 255 55 210 132 132 48 95 164 82 36 94 140 184 83 92 178 167 23 107 57
-190E7
##PAGE=	F1=16068.4
##FIRST=	25169.313707327481097,	5807.6787752999953227,	0.041435293853282928467
##DATA TABLE=	(F2++(Y..Y)), PROFILE
5808 91 41 45 38 107 75 155 92 112 83 81 87 26 74 96 156 13 55 50 142 166 78 220 214 68 69 144 144 47 274 28 206 91 112 190 157 67
5385 67 188 91 86 51 51 244 159 154 182 183 240 80 58 151 107 222 199 243 93 129 183 59 115 51 9 66 154 137 309 69 200 75
5010 75 70 206 77 168 160 163 295 139 127 124 96 73 65 217 203 78 77 129 101 126 118 225 245 25 91 224 366 200 157 134 112 286 156
4622 156 123 69 194 121 84 102 80 103 35 149 146 97 159 124 58 146 89 39 252 233 160 189 10 74 148 110 122 104 181 190 88 215 181
4235 181 358 275 163 132 115 23 82 65 156 279 229 95 161 130 207 216 174 126 172 143 128 56 145 93 100 99 167 177 15 72 39 172 239
3848 239 172 183 85 195 185 194 285 238 169 18 125 98 8 61 266 275 119 154 72 78 150 158 36 250 294 103 123 52 116 211 97 245
3472 245 122 115 209 152 38 190 190 52 155 218 125 131 76 127 190 20 161 97 146 79 40 91 293 196 227 314 113 61 108 95 82 55
3096 55 46 67 164 210 271 281 116 85 94 152 125 136 106 174 79 128 125 219 144 73 188 160 80 157 141 16 131 166 177 90 75 35 147 314
2697 314 227 82 83 237 166 128 55 103 111 82 80 188 139 86 52 87 92 87 198 183 53 64 45 37 254 354 147 63 157 100 92 53 109 268
2298 268 167 159 96 166 137 265 384 228 138 102 87 63 85 107 129 54 281 181 202 219 59 178 152 149 209 101 23 117 21 112 98
1934 98 136 224 183 20 74 86 240 191 141 96 58 98 68 213 243 186 128 154 72 61 77 282 143 159 75 130 150 150 138 102 162 316 221
1547 221 85 245 106 215 205 208 224 256 311 226 230 92 110 172 42 31 118 100 53 296 272 80 148 68 116 109 99 183 204 251 149 71
1171 71 89 137 59 195 93 51 160 158 141 188 244 81 153 121 95 39 203 212 120 37 203 140 230 122 311 126 276 1865 4219
831 4219 2674 490 177 228 130 157 246 192 266 217 172 163 161 92 315 143 101 181 96 54 85 152 131 154 157 80 113 160 80 189 220 152
455 152 163 215 44 92 165 65 169 205 150 164 32 172 219 184 155 133 193 137 234 102 143 122 65 139 145 115 97 104 123 131 194 235 144 345
56 345 137 218 42 211 96 131 42 135 162 139 36 124 96 197 68 93 214 184 33 94 74
-190G4
##PAGE=	F1=15966.1
##FIRST=	25169.313707327481097,	5807.6787752999953227,	0.13664025068283081055
##DATA TABLE=	(F2++(Y..Y)), PROFILE
5808 131 63 15 88 125 103 170 106 129 64 102 102 35 82 141 147 35 84 118 90 159 69 159 169 103 37 118 138 65 271 57 151 80 113 180
5409 180 168 93 146 20 48 60 53 196 132 133 145 164 293 162 98 173 115 204 186 228 53 130 168 50 123 76 48 51 125 150 273 32
5033 32 175 84 36 146 111 216 161 131 224 121 138 151 118 72 92 281 282 115 94 84 44 124 86 199 189 93 157 208 326 203 144
4669 144 140 57 292 174 126 81 163 98 80 72 91 144 69 105 104 111 150 142 44 127 97 50 250 272 160 189 45 99 155 95 137 162 195 213 68
4258 68 202 141 346 275 160 115 166 37 53 57 194 245 216 92 173 135 160 190 150 119 142 148 135 49 138 82 161 159 129 147 83 88 63 97
3859 97 201 196 236 135 141 115 166 239 208 179 17 137 86 22 56 237 289 145 136 37 83 136 144 17 266 317 104 91 19 137 212 55
3484 55 222 68 175 171 168 34 159 208 39 182 218 110 88 45 100 196 19 169 125 155 85 20 93 238 191 218 306 100 56 154
3132 154 88 26 81 75 71 166 211 222 245 77 86 78 118 140 165 110 155 67 114 135 265 154 52 146 146 83 160 136 33 178 197 194 99 70 22
2721 22 156 294 161 66 78 210 197 88 73 111 126 96 75 193 118 73 60 117 72 130 213 194 25 67 76 30 264 356 155 48 154
2357 154 108 158 59 110 247 138 153 85 168 130 295 395 233 147 75 79 36 69 116 145 61 275 250 120 130 72 211 139 137 136 128 14
1981 14 156 84 99 43 200 267 227 21 127 102 255 176 68 55 62 102 73 152 260 198 133 170 76 40 72 257 143 195 44 103 145
1617 145 150 169 115 172 321 259 59 192 75 172 162 188 214 217 264 218 260 73 126 178 46 67 84 123 78 334 263 109 165 97 193 88
1242 88 132 172 147 209 140 104 116 114 51 235 107 81 108 120 128 203 252 83 174 111 113 57 191 236 172 113 207 114 221 97 285 93 225
854 225 1608 3588 2275 469 122 180 110 116 217 186 244 187 160 190 234 54 338 171 127 182 105 59 25 140 161 143 159 29
526 29 114 144 82 170 221 152 142 227 55 114 180 100 216 284 161 168 11 165 230 204 132 102 175 124 210 75 159 98 45 183 177 78 98
138 98 80 107 133 182 229 93 325 131 172 40 200 49 111 37 172 154 188 28 162 102 174 41 102 234 187 34 94 95
-190I5
##PAGE=	F1=15863.8
##FIRST=	25169.313707327481097,	5807.6787752999953227,	0.21616315841674804688
##DATA TABLE=	(F2++(Y..Y)), PROFILE
5808 165 79 10 124 129 116 173 117 151 46 122 114 50 76 178 153 75 101 152 50 153 56 88 116 112 64 78 127 79 254 81 87 150 157 153
5409 153 168 142 113 54 14 75 69 151 81 109 128 138 336 244 143 180 121 163 148 198 55 137 148 44 127 79 75 89 90 138 191 69 138 100
5010 100 85 84 177 258 156 132 136 97 126 144 126 76 110 321 335 141 111 30 41 131 75 157 119 177 201 188 263 192 137 149 44 287 182
4622 182 126 93 121 56 91 48 70 178 111 44 46 100 152 169 40 120 89 82 218 289 165 178 81 118 152 95 169 234 210 230 49 166 108
4235 108 315 260 140 88 200 43 23 58 223 193 215 101 175 137 118 183 144 121 122 166 128 41 126 87 209 200 97 119 142 104 102 32
3859 32 171 210 262 156 85 64 122 207 186 179 26 165 120 51 63 200 289 175 134 25 94 147 125 36 269 312 118 54 23 147 211
3495 211 24 178 61 221 115 164 65 123 225 31 205 212 97 38 87 92 192 54 151 126 148 117 17 119 162 158 193 281 98
3155 98 53 181 120 25 103 104 85 140 183 168 196 47 98 69 101 153 189 117 133 50 105 140 261 153 41 101 119 84 151 145 72 209 221
2768 221 203 110 77 40 165 250 92 75 68 168 211 90 74 128 140 95 83 192 95 61 98 143 62 156 216 188 15 82 94 77 252 329
2392 329 162 33 144 103 206 99 100 206 109 140 68 145 124 297 370 201 147 37 66 17 66 117 171 60 240 315 116 59 86
2052 86 235 140 121 55 163 65 157 137 81 87 277 300 258 18 162 99 251 167 70 39 59 99 89 89 256 204 140 194 76 36 63 203
1676 203 150 222 16 68 128 141 180 108 169 307 265 34 133 45 107 90 162 191 161 206 212 277 77 131 179 57 92 61 138 93 352 247
1300 247 131 187 141 248 92 183 179 98 146 134 128 146 97 54 258 115 114 51 65 107 207 246 86 183 94 142 93 184 252 213 205 211 104
913 104 199 108 250 62 172 1222 2673 1705 401 67 120 96 109 155 179 210 143 159 207 296 46 343 205 155 167 119 55 34
584 34 127 170 125 149 61 143 127 87 145 211 158 108 219 91 131 191 161 242 340 193 174 18 143 201 185 81 51 152 107 175 50 162
209 162 102 77 215 204 46 89 49 101 141 155 201 87 305 134 134 26 170 20 79 24 197 133 213 22 191 142 130 25 113 232
-143 232 173 28 100 119
-190A19
##PAGE=	F1=15761.6
##FIRST=	25169.313707327481097,	5807.6787752999953227,	0.27426362037658691406
##DATA TABLE=	(F2++(Y..Y)), PROFILE
5808 182 81 28 140 118 130 166 123 172 45 134 123 61 59 196 167 103 101 144 36 148 47 50 100 106 95 46 114 89 225 96 102 241
5432 241 215 127 162 190 111 119 52 90 93 123 29 77 125 110 356 309 180 170 120 112 93 164 103 158 122 46 128 59 89 140 82 109 83 127 93
5021 93 113 151 25 232 283 144 161 49 79 99 106 123 88 112 324 361 151 123 70 115 148 102 106 82 246 215 157 185 167 123 162 91 265
4634 265 175 121 109 71 61 113 29 23 195 138 59 46 85 181 188 37 117 65 109 159 277 168 153 105 129 138 118 208 306 219 231 30 127 93
4235 93 275 234 108 60 203 37 6 59 225 130 221 116 165 133 104 182 142 132 112 181 116 26 120 101 236 209 81 80 169 127 151 54
3859 54 152 207 258 144 32 39 93 212 177 163 24 199 172 84 54 160 266 186 147 26 95 169 104 90 257 279 127 19 46 144
3507 144 212 52 119 98 235 48 146 106 132 237 30 222 202 98 34 124 104 178 82 119 101 122 142 27 146 90 108 156 244 99
3155 99 62 177 147 60 95 131 114 94 125 123 146 48 106 57 103 159 200 119 113 36 101 130 203 145 39 96 94 95 137 182 118 215 236 207 118 101
2732 101 58 165 188 40 89 55 122 205 129 56 132 137 92 105 188 75 69 143 159 51 166 212 173 39 122 129 106 219 278 164 31 123
2357 123 84 227 133 75 149 87 122 66 108 114 274 326 148 136 45 58 14 77 108 203 53 182 365 195 87 92 250 156 109 41 195
1993 195 123 123 171 69 175 345 315 270 34 174 88 232 168 113 71 52 92 99 56 234 204 145 219 73 53 81 134 157 239 14 30
1629 30 107 122 171 83 149 275 248 12 83 56 35 4 140 165 103 150 226 276 101 124 175 80 110 61 143 96 343 233 142 208 184 276
1254 276 101 214 198 100 76 133 136 172 89 72 256 108 139 26 6 116 198 231 94 180 86 175 135 187 252 231 281 216 111 172 154
890 154 216 80 136 802 1680 1094 304 50 113 94 120 79 171 166 98 152 218 342 72 320 231 172 135 128 52 82 119 164 112 129 116 184
514 184 116 93 121 199 161 71 197 148 147 199 239 251 366 223 177 19 106 138 135 25 18 129 86 134 36 149 113 107 228 215 69 80 17
127 17 101 150 121 163 105 282 136 117 9 117 57 73 14 210 104 210 35 204 168 110 78 122 206 143 28 105 138
-190A38
##PAGE=	F1=15659.3
##FIRST=	25169.313707327481097,	5807.6787752999953227,	0.31580531597137451172
##DATA TABLE=	(F2++(Y..Y)), PROFILE
5808 177 64 36 140 104 156 153 123 181 70 132 129 65 37 189 174 114 82 101 42 145 44 83 131 105 115 63 106 93 187 98 188 318
5432 318 252 107 153 221 126 161 85 98 115 122 55 39 126 82 351 343 195 148 111 71 45 133 146 186 87 57 129 36 88 177 113 88 38 168
5033 168 44 120 207 36 258 286 124 189 29 72 80 57 114 102 102 294 364 152 129 132 172 168 136 58 121 287 198 116 108 135 97 170 132
4646 132 226 151 111 136 45 116 126 15 66 195 138 126 123 106 222 188 29 110 33 129 81 238 167 117 113 128 114 153 248 366 220 212 35
4258 35 120 96 239 204 77 61 169 20 23 59 191 67 225 126 144 123 114 161 134 154 107 186 107 8 126 110 245 188 93 26 170
3894 170 165 203 94 145 186 228 106 15 26 124 248 183 130 35 227 213 115 44 123 215 174 165 16 75 180 84 152 231 224 122 17 60
3519 60 133 206 78 55 121 218 17 118 143 192 239 31 231 190 111 62 131 114 155 106 94 61 83 141 29 155 53 60 118 198 90
3155 90 79 141 150 75 66 160 150 53 46 95 104 60 100 32 114 152 193 113 102 36 101 113 114 137 40 138 85 117 122 224 159 192 239 211 119 126 68 149
2709 149 115 42 92 54 84 185 160 30 117 119 105 134 183 58 97 188 162 34 163 205 157 58 175 192 113 172 211 152 37 92 52 220
2333 220 144 37 86 80 99 94 89 89 232 278 101 117 98 74 29 99 93 230 45 114 390 261 140 95 254 173 103 95 217 177 70 187
1958 187 65 242 381 304 262 76 168 91 203 174 135 103 48 82 92 61 195 196 139 237 66 89 139 81 153 245 39 10 89 100 147
1594 147 49 115 229 230 54 50 89 61 85 132 142 72 106 259 259 125 111 167 117 149 81 137 90 308 224 146 219 212 278 102 210 211 145 83
1195 83 139 131 191 87 106 229 92 148 77 45 178 183 211 105 168 103 205 170 194 227 220 329 219 128 149 212 190 107 122 449 809 561
819 561 200 94 184 106 122 25 164 119 65 132 227 366 104 271 237 169 102 134 58 107 119 152 115 101 155 217 124 94 111 196 158 43
444 43 168 200 159 215 318 248 365 235 166 16 55 58 77 76 82 112 71 92 39 124 111 126 225 204 124 93 33 101 153 79 132 113 252 131
45 131 131 65 47 105 127 44 214 92 185 55 198 165 141 134 127 162 108 49 105 143
-190A43
##PAGE=	F1=15557.1
##FIRST=	25169.313707327481097,	5807.6787752999953227,	0.24062347412109375
##DATA TABLE=	(F2++(Y..Y)), PROFILE
5808 149 31 47 126 104 194 137 115 174 98 116 134 61 17 155 160 108 47 38 52 145 45 116 159 108 127 105 107 91 148 91 265 367 254
5420 254 85 137 225 132 177 98 95 128 145 102 22 126 56 324 341 182 120 94 61 42 111 167 205 47 75 137 67 76 190 142 105 131 179
5033 179 4 121 245 81 250 265 98 200 77 71 93 73 111 114 93 244 351 155 132 174 199 180 157 35 167 293 157 65
4704 65 65 110 65 164 154 169 110 98 176 91 160 121 7 146 188 109 177 195 147 253 172 16 93 13 142 27 183 167 74 103 113 94
4329 94 193 285 403 216 173 70 152 108 217 180 81 98 107 30 39 69 125 42 217 124 114 109 125 115 116 182 96 179 108 7 134 103 244
3941 244 148 127 38 152 220 251 106 144 155 184 55 50 36 183 291 202 85 52 235 229 134 76 97 142 144 175 15 38 172 77 210
3578 210 194 155 101 43 65 122 192 83 2 116 185 72 86 167 259 234 32 231 176 123 71 105 107 127 130 89 53 60 126 28 142 72 43
3190 43 90 151 69 96 81 127 72 43 189 179 80 49 89 72 69 77 11 130 128 166 99 101 52 108 126 119 138 41 183 89 143 100 240 185 141 233
2768 233 215 109 144 73 122 48 62 78 74 61 160 169 48 86 99 141 168 174 47 130 228 152 23 149 194 145 67 222 258 101 116 135 125
2380 125 34 69 14 197 124 13 49 87 73 124 127 61 182 239 98 93 142 105 50 122 97 245 42 80 385 284 173 104 245 177 94
2016 94 123 223 214 33 193 63 273 372 267 236 133 155 120 173 171 126 113 56 69 63 62 147 175 119 237 53 131 203 96 130 240 60
1641 60 47 79 93 119 30 75 180 230 104 30 114 123 154 139 121 90 83 296 229 135 108 157 161 214 111 116 76 252 210 143 212 221 257 92 168
1230 168 204 191 169 156 120 206 86 147 186 86 139 126 81 260 171 185 115 153 126 224 190 199 173 179 343 224 143 135 265 173 106 110 234
843 234 219 190 119 145 263 128 113 73 163 77 56 105 233 370 134 209 219 142 106 145 67 103 128 146 131 69 172 229 150 87 116 213
467 213 154 36 137 226 159 244 380 233 342 228 131 36 16 40 64 145 139 101 79 58 47 97 96 136 210 174 180 135 72 97 146 34 122
80 122 107 221 119 166 125 31 153 200 84 214 116 156 74 178 135 173 172 126 107 85 77 104 128
-190A28
##PAGE=	F1=15454.8
##FIRST=	25169.313707327481097,	5807.6787752999953227,	0.045565348118543624878
##DATA TABLE=	(F2++(Y..Y)), PROFILE
5808 103 26 77 104 118 228 119 96 149 117 92 140 52 11 96 126 90 13 34 59 144 57 131 156 100 143 142 120 85 113 82 308 385 219
5420 219 45 112 202 117 167 92 79 130 183 141 43 127 38 294 308 147 89 71 64 59 101 162 202 18 99 157 116 58 177 146 138 195 156 50
5021 50 119 261 115 216 224 69 192 101 67 122 130 114 127 97 196 329 163 138 191 192 180 158 43 188 263 107 19 84 113 61 142 156
4646 156 101 58 87 222 150 175 100 16 218 183 63 201 244 170 261 159 10 69 35 150 101 137 169 32 85 83 101 240 319 413 211
4282 211 123 113 187 115 211 165 119 141 70 74 55 94 42 87 194 108 85 90 126 68 93 207 78 163 116 26 132 80 242 112 164 95 128
3894 128 284 286 90 146 127 137 11 69 78 231 324 227 42 55 215 213 136 127 89 60 110 164 71 59 146 90 249 147 82 72 67 66 115 183
3495 183 85 30 88 157 108 56 172 307 229 38 224 162 122 74 53 83 98 157 93 93 96 133 39 111 109 79 78 116 49 106 17 88 63 61 209
3085 209 193 135 136 98 52 78 49 70 157 93 124 80 105 74 116 183 239 156 46 210 91 162 70 215 191 69 222 219 90 159 73 103
2709 103 28 80 49 102 54 134 154 94 66 95 193 203 156 37 159 257 133 33 126 177 134 69 250 305 77 59 63 90 29 85 28 178
2333 178 82 50 66 103 48 138 193 87 136 209 126 69 161 133 78 138 132 244 48 120 351 261 189 122 218 159 73 118 207 228 47 195
1958 195 62 268 318 208 201 194 160 162 150 151 101 99 81 56 17 47 103 142 86 216 36 163 247 138 89 224 70 84 76 105 98 54 56 139
1559 139 244 145 41 134 162 189 159 102 123 76 315 190 127 123 145 202 282 141 80 61 181 184 129 184 209 216 77 103 172 215 254 183 109
1171 109 219 86 189 140 95 108 163 98 336 178 152 118 139 135 229 189 202 93 114 328 229 149 131 301 158 73 88 149 188 41
819 41 88 182 316 152 118 122 168 60 67 85 233 353 161 156 186 96 147 164 73 72 144 153 142 37 171 219 179 74 123 246 160 36 102
432 102 214 140 279 409 205 307 213 72 64 72 96 100 200 181 101 105 41 52 78 71 138 191 149 224 191 113 88 128 55 132 92 198 104 207
33 207 172 97 197 265 123 210 152 142 88 150 93 171 180 120 55 81 97 101 88
-190H8
##PAGE=	F1=15352.6
##FIRST=	25169.313707327481097,	5807.6787752999953227,	0.18457695841789245605
##DATA TABLE=	(F2++(Y..Y)), PROFILE
5808 60 80 122 81 132 248 102 62 113 132 69 145 39 13 27 85 63 41 81 59 139 82 136 121 82 171 167 137 77 85 82 310 378 159 18
5409 18 76 157 84 140 73 49 120 224 176 57 131 42 279 257 112 60 59 56 81 97 137 167 32 124 185 149 40 142 120 152 222 105
5033 105 89 112 255 136 166 172 44 170 106 61 144 167 113 146 117 169 302 170 150 185 162 173 142 53 178 205 78 39 114 137 98
4669 98 116 142 32 26 82 264 194 157 85 37 270 186 48 200 260 161 246 177 32 49 55 152 169 134 169 27 83 37 127 289 346 398
4294 398 202 83 153 202 108 209 165 161 171 135 125 68 120 52 138 159 81 67 70 116 85 70 219 56 143 127 50 110 48 236 105 191
3918 191 134 102 341 302 54 147 117 96 19 71 125 256 335 248 31 39 162 166 117 165 93 24 85 127 148 127 119 109 259 90 39 51 87
3531 87 67 111 189 114 36 45 142 121 41 159 324 227 57 213 147 106 104 43 58 77 186 97 132 150 181 56 78 154 128 77 108 59 109
3143 109 65 44 64 87 219 185 177 207 113 44 98 34 136 193 69 76 70 109 95 118 248 349 186 58 217 82 168 49 147 178 11
2779 11 209 219 74 179 69 112 54 116 27 124 56 105 124 138 92 113 249 241 128 28 180 270 111 43 96 155 124 68 254 319 57
2416 57 26 47 55 44 122 63 182 79 77 87 124 37 132 260 156 107 187 148 51 145 145 113 140 178 233 56 169 296 204 199 138 172 121 45
2016 45 89 169 213 56 199 61 238 229 134 167 248 192 202 145 119 103 85 125 43 42 31 98 102 60 176 17 179 257 165 48 195 64
1641 64 120 78 123 97 83 85 116 253 167 91 157 174 185 184 95 149 70 304 148 105 145 131 230 329 161 36 57 105 148 103 143 180 168 66
1242 66 82 120 214 316 211 105 231 90 227 113 107 59 184 99 388 205 107 113 128 120 217 167 203 14 37 290 236 145 134 311
890 311 137 54 54 89 232 58 93 199 335 167 159 162 177 78 84 78 221 318 180 131 156 57 184 186 85 35 161 173 140 29 160 189
514 189 199 56 122 281 177 34 59 164 105 307 399 161 265 207 38 83 126 128 130 238 204 115 130 44 60 76 48 137 176 156 251
150 251 248 154 72 106 125 146 76 187 86 243 191 143 224 307 155 202 177 147 95 121 66 126 158 112 26 78 105 91 29
-190B9
##PAGE=	F1=15250.3
##FIRST=	25169.313707327481097,	5807.6787752999953227,	0.27639126777648925781
##DATA TABLE=	(F2++(Y..Y)), PROFILE
5808 67 136 168 69 136 251 88 18 85 151 62 148 30 12 64 82 34 71 99 50 129 115 139 74 111 208 177 146 72 60 95 274 355 97
5420 97 92 32 104 43 106 47 14 103 255 210 55 138 58 279 206 102 56 87 37 125 100 106 108 40 147 209 154 31 96 76 134 221 37
5033 37 117 103 234 144 119 119 34 140 98 68 147 171 96 175 151 166 270 178 172 168 130 168 116 58 153 129 97 72 131 160 137 120 116 45 68 86
4610 86 296 215 113 105 59 300 199 88 182 244 123 214 223 61 48 69 148 211 165 161 55 118 19 153 332 360 362 186 75 184 192
4247 192 84 202 179 195 178 219 172 74 129 120 180 116 53 59 60 98 131 59 211 51 119 133 77 68 39 217 119 203 146 78 374 299 36
3859 36 148 122 73 19 66 163 253 323 254 58 36 87 93 79 177 97 70 79 77 237 190 122 119 232 25 97 54 104 79 106 202 168 38 11
3460 11 125 112 48 132 308 226 88 200 135 79 158 113 70 70 208 102 153 190 239 73 69 196 168 80 126 85 106 118 19 77 104 219
3085 219 160 199 250 120 43 132 34 193 231 84 33 84 107 111 105 289 416 214 81 208 70 158 84 53 150 84 193 220 90 209
2732 209 60 140 64 175 60 134 59 75 95 173 141 134 301 277 96 20 191 264 93 42 62 133 114 71 235 301 69 79 94 32 72
2369 72 151 83 203 138 88 101 146 48 119 311 222 99 171 155 49 96 139 151 129 213 219 62 190 233 136 210 139 112 69 30 58 114 174
1981 174 65 209 53 197 132 54 141 285 235 233 156 103 153 121 179 30 95 42 140 73 78 128 6 179 229 168 63 155 49 154
1629 154 79 128 118 101 127 114 240 165 153 192 160 144 201 98 167 52 264 106 76 158 115 238 338 167 58 71 36 110 68 111
1277 111 142 128 67 153 65 193 347 231 110 241 101 257 119 114 5 187 91 409 243 47 97 122 85 194 130 205 112 62
948 62 240 241 131 136 291 106 103 16 42 132 50 97 195 321 166 219 198 185 107 104 76 195 268 187 128 135 75 197 199 119 75 175 193 124
549 124 57 148 150 202 38 114 309 193 35 12 89 83 320 350 102 222 220 119 89 165 131 150 265 210 140 143 55 83 87 43 134 170 190
162 190 255 293 192 56 92 196 154 68 184 66 266 175 166 223 316 174 189 186 156 95 93 75 50 124 105 32 61 98 74 44
-190D4
##PAGE=	F1=15148
##FIRST=	25169.313707327481097,	5807.6787752999953227,	0.2048676908016204834
##DATA TABLE=	(F2++(Y..Y)), PROFILE
5808 102 183 202 76 128 235 78 47 96 175 70 145 27 15 136 124 10 93 83 39 112 142 146 87 198 246 169 140 69 37 114 210
5444 210 325 76 162 17 67 39 80 34 30 81 264 236 46 147 72 275 166 117 96 141 39 189 109 83 46 32 163 221 129 32
5092 32 50 63 83 207 44 129 95 205 143 92 77 48 110 84 94 132 140 75 211 195 171 233 199 204 150 115 176 91 69 137 52 132 95 135
4693 135 170 161 170 95 95 109 101 315 207 56 148 79 313 222 121 157 200 75 176 270 94 56 85 140 220 191 140 78 170 78 171 360
4317 360 353 313 161 83 198 159 53 184 207 216 158 280 207 76 114 164 210 75 44 49 73 75 155 69 180 66 89 129 102 35 69 180
3941 180 127 203 132 67 372 281 67 150 134 84 7 72 181 229 292 243 93 81 65 15 28 160 99 87 98 73 325 233 158 111 168 63
3566 63 171 69 115 105 106 202 222 80 55 89 92 64 97 264 218 120 185 126 54 211 177 102 78 218 110 152 204 279 91 94 220 186
3190 186 74 153 101 101 151 53 90 114 213 128 200 262 111 41 174 33 226 257 112 7 111 97 116 73 287 430 232 108 190
2850 190 66 134 134 85 115 135 176 233 138 242 45 165 62 240 107 125 52 56 83 198 187 144 343 306 68 20 192 243 83 31
2498 31 29 114 106 81 204 261 112 134 127 19 98 161 83 222 193 91 129 164 61 120 335 265 109 165 147 66 38 120 187 111 226 207
2122 207 64 175 181 84 216 119 69 22 45 67 53 117 116 234 38 152 85 21 123 300 270 250 173 131 210 187 230 14 136 60 188
1758 188 86 118 97 19 174 173 146 106 105 54 181 78 117 153 106 161 122 201 140 210 235 130 81 204 99 186 19 207 70 56 154
1394 154 95 225 308 171 128 94 50 78 35 107 105 104 81 232 56 165 345 234 124 246 116 278 142 117 55 170 81 400 276
1054 276 25 72 123 46 169 90 201 207 144 186 239 114 128 244 72 154 27 95 47 109 88 173 285 144 271 228 186 135 129 68 154
690 154 208 180 122 115 112 181 195 171 145 178 204 102 92 143 116 186 24 103 324 200 52 64 30 121 314 273 46 186 246 207 87 184
315 184 114 167 286 200 159 140 74 114 98 54 131 177 219 236 317 223 49 90 252 153 72 180 59 272 126 174 190 286 177 173 181 159
-61 159 87 73 95 45 117 101 30 29 83 62 112
-190A12
##PAGE=	F1=15045.8
##FIRST=	25169.313707327481097,	5807.6787752999953227,	0.078184008598327636719
##DATA TABLE=	(F2++(Y..Y)), PROFILE
5808 126 214 215 101 110 205 76 103 132 197 81 133 27 35 191 168 5 118 52 50 86 157 159 151 296 276 145 115 62 19 126 134 291 105
5420 105 211 55 71 87 74 58 65 56 244 246 41 156 80 248 146 136 148 200 75 254 120 77 62 40 171 214 82 40 28 108
5068 108 17 192 105 127 98 176 139 103 63 79 85 65 122 107 87 88 247 242 169 190 239 243 143 123 197 73 89 148 13 155 117 131 164 167
4669 167 233 107 126 132 127 319 173 7 187 93 318 252 130 130 140 66 139 297 128 60 111 138 198 198 108 94 221 131 185 366 323
4305 323 260 127 81 189 113 42 155 244 223 114 305 223 87 74 183 227 49 51 27 102 52 148 82 134 76 51 115 121 86 100 129 120
3930 120 200 101 78 333 253 93 152 148 113 39 92 174 194 247 215 138 132 159 99 27 120 97 71 136 136 396 251 195 92 77 142 235 79
3542 79 121 136 119 184 253 143 97 32 88 80 59 202 199 146 167 118 61 243 218 121 88 213 114 137 188 289 118 127 216 168 53 176 100
3155 100 95 167 96 98 124 205 108 186 243 84 47 213 56 225 266 123 16 136 79 109 31 241 396 238 135 173 75 110 165 185
2803 185 84 154 168 270 194 263 31 174 60 292 147 99 40 76 92 217 223 140 371 319 59 23 183 213 86 18 28 99 95 97
2451 97 174 215 159 171 132 22 114 147 62 229 213 98 175 172 69 137 327 276 132 170 135 94 94 103 214 100 215 195 61 127 166 78
2075 78 208 79 107 46 61 110 28 57 193 272 29 103 128 86 110 295 287 250 182 174 245 242 262 5 158 65 218 125 151 95 32 177
1700 177 111 108 133 51 91 195 75 90 189 98 177 127 143 113 252 275 99 47 193 95 214 45 151 43 49 132 71 191 247 190 199
1336 199 114 107 55 39 121 76 91 99 287 96 142 313 219 143 244 130 290 164 124 91 138 76 367 292 96 46 133 44 152 62 186
972 186 279 214 134 226 95 105 179 53 177 59 136 150 158 76 144 240 107 302 245 179 159 157 52 102 146 166 106 81 130 144 171 225 204
584 204 170 200 93 126 150 94 155 11 93 322 192 79 135 79 184 291 190 71 164 267 275 85 182 94 182 301 174 156 125
244 125 99 137 103 62 125 193 227 201 317 243 61 93 286 145 82 173 88 263 59 183 133 222 162 159 171 156 73 74 107 123 150 103 12
-143 12 29 75 86 163
-190A63
##PAGE=	F1=14943.5
##FIRST=	25169.313707327481097,	5807.6787752999953227,	0.071781568229198455811
##DATA TABLE=	(F2++(Y..Y)), PROFILE
5808 130 223 200 131 91 164 79 146 166 207 90 115 25 71 223 192 9 158 86 85 53 158 171 202 369 287 111 78 46 18 125 63
5444 63 255 135 230 84 90 138 89 93 91 41 197 232 47 164 84 193 153 157 191 251 117 305 126 86 108 70 170 193 31 56 50 158
5068 158 91 181 150 114 112 153 135 137 87 125 68 42 136 90 59 136 273 282 156 142 281 282 153 141 225 59 112 171 56 159 146 122 147
4681 147 155 288 155 145 136 162 307 123 43 210 100 317 283 115 106 76 89 108 299 157 69 146 149 154 183 73 109 263 166 201 350
4317 350 273 208 87 62 155 65 66 122 284 216 56 290 213 115 34 184 230 45 58 26 134 36 115 90 87 70 11 99 137 155 119 77
3941 77 98 196 77 95 262 223 98 157 161 132 70 109 138 156 197 175 186 169 258 185 74 72 90 39 178 197 439 243 208 88 29 211
3566 211 278 80 121 158 146 166 251 200 127 46 121 97 18 130 165 158 144 103 89 244 229 113 95 196 109 118 146 267 156 157 189 116 20
3178 20 192 86 93 175 140 102 135 198 111 161 200 41 70 240 110 194 255 110 40 149 51 87 59 168 330 239 161 166 100 110 165 255
2803 255 75 138 183 322 240 261 35 166 68 315 170 74 58 115 110 231 246 121 384 310 68 21 169 181 100 13 60 88 82 112
2451 112 152 175 195 177 112 48 119 116 53 224 195 116 219 165 75 152 289 259 160 184 131 128 178 95 230 102 185 182 56 62 191 98 180
2063 180 32 173 78 72 160 66 17 267 312 49 48 174 132 101 279 287 236 174 200 246 262 262 29 160 59 217 164 175 103 44 192
1700 192 86 60 136 0 128 191 68 62 214 80 173 122 81 115 274 306 84 96 179 99 251 109 109 31 45 101 44 143 175 227 256
1336 256 126 156 65 71 131 60 74 116 308 130 124 258 186 160 233 138 292 181 139 100 98 81 319 285 154 36 145 67 148 63 158
972 158 319 263 84 199 74 65 112 60 166 81 135 201 169 68 121 204 63 301 241 161 180 186 37 58 106 153 85 37 119 109 128 266
596 266 240 152 178 110 160 168 85 121 10 80 303 174 106 200 121 237 260 138 128 157 273 309 89 163 83 186 304 135 125 108 126
232 126 140 101 62 117 211 216 163 293 250 84 95 295 132 88 156 135 243 28 202 83 137 132 148 163 148 57 96 111 174 188 111 39
-143 39 74 87 136 189
-190A89
##PAGE=	F1=14841.3
##FIRST=	25169.313707327481097,	5807.6787752999953227,	0.036444269120693206787
##DATA TABLE=	(F2++(Y..Y)), PROFILE
5808 117 209 160 161 80 121 83 161 182 201 94 99 34 117 230 188 10 207 166 123 48 147 179 220 393 276 80 41 22 38 107 46 217
5432 217 153 219 103 100 182 115 122 107 53 131 196 55 167 87 121 188 187 210 284 155 333 120 102 130 94 164 166 61 78 82 200 178 169 173
5033 173 99 130 133 137 176 129 176 63 19 123 110 113 181 279 304 136 94 304 313 177 156 254 42 126 183 72 148 178 111 128 131 322 217
4646 217 165 122 198 279 82 66 214 102 311 305 91 87 21 93 81 277 170 95 181 171 102 156 46 130 289 179 219 318 212 164
4294 164 42 42 99 28 90 92 320 197 50 242 179 153 68 179 221 47 60 71 161 31 82 105 62 49 34 91 155 214 122 50 67 182
3918 182 79 100 180 198 84 163 164 132 87 111 80 121 149 133 226 182 331 248 106 36 80 65 209 234 446 212 188 118 112 254 294 74
3542 74 115 161 178 176 217 236 140 116 170 117 23 57 122 152 115 78 115 213 211 80 100 173 99 115 94 219 199 182 151 58 56 206 77 95 182
3132 182 178 109 143 195 126 131 143 28 92 245 174 146 229 86 78 147 25 57 117 123 257 242 187 174 141 138 129 278 92 96 222 371 266
2744 266 230 62 143 78 300 171 88 113 152 125 243 258 92 386 282 82 15 152 154 121 10 95 84 75 117 135 150 209 148 89 80
2380 80 114 77 112 214 158 133 238 142 88 151 234 222 187 199 148 160 241 92 232 112 147 166 53 49 227 120 135 51 220 94 88
2016 88 205 93 38 315 342 79 17 195 156 99 260 275 210 144 198 213 235 223 54 148 51 182 192 193 103 53 207 110 16 119 42
1653 42 147 167 56 66 220 65 148 105 47 146 278 326 103 143 178 118 287 172 77 40 39 83 23 90 114 265 289 123 193 114 107
1289 107 129 54 53 126 295 149 102 191 141 167 211 142 285 195 162 80 61 99 265 252 184 42 151 81 151 81 124 325 286 38 160
925 160 46 14 58 70 134 94 105 195 156 66 116 188 30 270 211 135 200 210 33 66 108 152 79 53 81 110 74 288 244 127 142 136 192
538 192 198 76 103 30 60 270 154 127 251 132 265 225 146 168 154 258 300 92 133 79 170 291 92 73 102 147 120 96 69 103 223
174 223 202 139 251 243 108 99 279 117 86 131 180 211 80 223 100 66 92 140 160 141 37 127 119 189 206 122 94 113 110 183 184
-190A84
##PAGE=	F1=14739
##FIRST=	25169.313707327481097,	5807.6787752999953227,	0.085497841238975524902
##DATA TABLE=	(F2++(Y..Y)), PROFILE
5808 96 177 106 184 82 85 86 144 179 183 96 96 58 163 219 158 30 249 245 152 94 129 178 199 361 241 76 17 3 68 73 89 180 163 188 116
5397 116 96 215 148 140 113 73 72 151 57 160 90 53 236 221 197 294 188 336 97 118 128 97 157 151 119 98 116 239 247 152 179 91 139
5010 139 114 144 207 173 220 63 30 83 161 186 205 259 302 120 58 294 329 198 160 276 38 126 180 63 127 202 101 115 98 331
4657 331 274 194 97 227 234 101 75 200 102 297 310 75 74 21 67 60 238 164 133 208 189 57 128 40 158 300 170 235 277 148 128
4294 128 3 48 44 28 102 72 346 177 113 186 128 183 120 174 203 40 65 121 179 32 97 142 57 38 66 92 174 248 108 68 34 150
3918 150 99 89 121 180 63 167 149 110 86 94 52 89 119 97 245 172 364 273 116 32 67 125 220 238 419 163 133 157 167 264 282 65
3542 65 108 146 205 211 161 245 139 175 217 142 64 11 88 138 79 44 128 158 170 31 103 153 98 130 62 153 236 209 125 95 121 217 84 104
3143 104 189 207 123 140 189 140 100 84 82 95 229 227 110 196 90 120 129 36 50 160 157 201 245 210 195 194 177 69 254 112 62 268 395
2756 395 266 174 98 119 84 250 149 137 174 177 137 253 260 60 377 242 98 11 136 135 143 5 126 88 81 105 109 144 197 92 116 109
2380 109 101 53 194 204 159 137 220 102 104 132 180 181 205 207 177 181 266 86 222 128 107 148 59 100 250 137 81 96 232 97 107 235 104
1993 104 52 329 354 106 66 194 157 107 240 258 179 95 173 158 164 151 77 128 52 118 204 208 90 60 213 137 29 90 70 142 126 43
1617 43 102 204 74 104 74 70 176 269 334 151 162 192 135 308 221 41 63 48 95 50 51 78 281 293 104 215 174 139 123 56 45 127
1242 127 256 152 71 123 92 159 179 142 266 208 188 61 50 123 211 194 179 40 143 93 157 97 91 301 282 2 112 16 43 27 73
878 73 107 99 74 172 148 66 130 197 38 212 159 100 217 227 37 111 127 158 93 105 25 145 33 290 214 99 108 155 220 235 63 112
502 112 57 27 225 143 138 276 115 263 193 178 185 142 226 251 94 97 71 136 264 60 54 115 155 89 92 98 83 218 199 134 205 226 131 108
103 108 247 104 71 103 213 171 115 235 152 90 49 133 158 135 17 153 140 170 196 130 153 137 131 214 153
-190A53
##PAGE=	F1=14636.8
##FIRST=	25169.313707327481097,	5807.6787752999953227,	0.091486565768718719482
##DATA TABLE=	(F2++(Y..Y)), PROFILE
5808 77 135 51 198 88 74 86 96 158 161 98 102 88 197 198 112 62 271 302 166 147 109 166 152 277 193 106 13 21 101 33 129 148 172 150
5409 150 123 83 236 184 148 114 86 82 119 55 139 87 36 280 241 158 278 215 318 60 120 113 74 152 165 164 108 151 279 287 128 175 93
5021 93 135 100 154 220 206 244 62 59 27 220 249 204 211 274 116 47 248 321 205 148 287 72 108 166 38 102 207 95 114 60 315
4657 315 313 221 65 240 177 161 84 173 105 276 294 76 71 51 30 54 195 134 171 218 192 31 107 60 192 298 148 242 239 91 95 41
4282 41 65 66 45 104 58 359 169 168 177 100 191 152 174 180 26 76 166 190 33 146 185 45 53 81 91 184 254 82 100 5 98 118 64 118
3883 118 167 49 165 115 84 80 63 115 64 124 81 235 143 350 258 107 40 58 177 208 212 366 111 61 180 179 240 244 58 108 127 218
3507 218 240 109 234 134 212 252 166 100 71 84 137 39 19 127 90 117 31 104 139 109 147 78 80 260 242 118 164 182 226 101 118 193
3132 193 223 148 120 176 147 70 35 131 68 196 254 108 165 134 151 99 68 84 174 205 172 240 230 224 249 214 40 201 121 92 302 381 238
2744 238 102 139 105 84 181 110 187 226 189 143 259 250 36 361 201 112 18 121 129 164 25 150 100 98 75 72 153 166 27 180 130 83
2369 83 72 268 197 212 121 165 52 112 102 145 146 213 200 200 185 248 86 198 147 73 131 69 130 243 143 32 124 203 92 115 240 104
1993 104 52 310 346 125 104 182 137 118 215 243 147 41 145 95 65 62 94 110 61 41 201 212 74 63 202 147 57 63 85 113 83 31
1617 31 136 171 112 46 34 100 187 253 331 213 154 207 137 303 248 37 91 71 125 97 80 55 263 266 73 218 225 160 117 61 59 118 206
1230 206 147 57 67 47 138 148 140 238 217 211 95 66 147 162 123 149 25 126 118 160 101 70 258 255 31 61 48 92 18 72 108 100 53 168
831 168 153 60 152 224 65 143 100 62 228 233 40 152 133 160 112 141 39 183 62 273 154 67 105 158 238 268 46 136 85 16 172
467 172 148 135 271 88 232 162 199 180 115 181 171 101 61 62 102 230 62 106 132 150 93 89 144 60 191 208 136 169 200 152 119 206 97
80 97 44 99 231 125 126 232 186 143 25 126 153 131 23 167 169 131 164 131 207 144 140 223 108
-190A08
##PAGE=	F1=14534.5
##FIRST=	25169.313707327481097,	5807.6787752999953227,	0.06453914940357208252
##DATA TABLE=	(F2++(Y..Y)), PROFILE
5808 60 92 23 201 93 93 87 30 128 141 103 104 113 207 181 67 97 267 326 163 187 84 147 111 163 156 147 12 25 127 37 156 122 181 121
5409 121 123 67 243 217 150 117 88 134 117 56 101 77 51 305 233 106 239 230 286 18 99 95 33 151 199 186 106 179 315 298 96 166
5033 166 98 117 114 163 210 217 240 56 84 60 269 292 190 145 225 120 47 173 286 191 122 282 122 77 150 18 79 192 98 121 36
4669 36 279 328 229 31 232 115 223 104 139 112 252 262 76 77 72 61 66 160 88 199 206 178 38 105 95 224 285 123 238 215 54
4305 54 62 69 70 117 59 101 41 356 188 201 244 146 172 156 179 157 25 88 198 190 35 189 211 26 67 73 80 175 233 53 129 24 42 130
3906 130 40 140 158 42 157 76 86 98 42 181 55 150 87 195 110 295 209 85 50 52 209 181 164 300 91 43 176 149 192
3566 192 190 56 117 132 214 243 100 217 138 223 270 185 129 123 100 160 13 46 115 20 60 77 98 122 115 152 100 14 264 278 120 203 224
3178 224 226 117 134 190 226 176 82 147 147 49 19 165 20 155 251 118 142 185 158 61 95 123 153 216 155 222 240 255 296 245 97 161 130
2791 130 140 309 325 186 47 180 104 82 133 65 223 255 188 141 261 226 44 337 169 122 25 106 138 179 50 164 120 116 31 35
2439 35 164 136 46 240 138 63 113 311 187 268 103 84 10 101 72 129 127 214 173 202 169 194 107 163 167 51 116 82 123 206 134 19
2063 19 128 139 86 99 210 100 50 270 319 135 128 173 105 127 183 237 116 37 137 39 39 33 104 99 70 60 183 194 63 63 179 139 74
1676 74 50 100 80 66 25 151 129 160 20 20 118 180 242 314 273 125 213 134 270 250 93 121 87 153 149 146 39 214 214 37 203 252 160
1289 160 107 66 72 105 162 144 86 39 16 117 133 135 199 218 226 156 84 166 120 67 116 40 117 158 158 89 67 210 209 49 23 98 125 26 77 129
866 129 104 48 195 161 47 178 260 93 96 61 29 227 229 40 179 117 149 123 150 95 207 95 241 81 29 140 150 246 287 29
514 29 157 110 69 120 162 120 233 77 181 131 202 165 74 131 81 120 32 63 98 195 87 153 138 132 139 83 193 39 141 216 137 159 167
127 167 168 128 165 101 27 131 236 88 123 218 192 170 46 119 136 129 52 165 190 88 123 126 247 136 137 212 66
-190F6
##PAGE=	F1=14432.2
##FIRST=	25169.313707327481097,	5807.6787752999953227,	0.23289316892623901367
##DATA TABLE=	(F2++(Y..Y)), PROFILE
5808 40 58 34 191 93 123 98 52 97 126 114 95 126 188 175 60 130 239 312 144 206 54 127 118 67 157 184 33 14 139 77 171 101
5432 101 186 106 115 54 235 243 156 136 90 176 134 69 50 73 42 301 197 77 180 229 247 50 55 79 15 153 232 179 100 193 334 286
5056 286 61 152 97 91 159 169 174 198 208 46 101 126 294 310 178 80 164 116 44 89 225 161 94 263 170 48 136 39 59 162 105 137
4681 137 64 229 317 210 8 200 76 273 133 102 117 230 218 66 83 86 104 74 145 36 216 174 155 76 122 136 246 265 107
4340 107 224 210 59 49 84 61 148 69 101 17 342 229 209 336 222 124 135 197 138 45 96 213 180 39 212 205 78 87 41 57 141
3977 141 199 50 148 47 48 132 44 147 150 35 142 72 116 141 64 220 64 166 101 132 88 213 153 63 67 49 218 158 109 234 120
3613 120 101 145 89 135 128 57 127 161 197 222 125 204 151 211 271 195 156 167 112 190 46 77 98 44 8 108 82 100 107 139 104 63 247 309
3214 309 122 196 241 219 129 146 180 215 199 27 103 144 47 32 176 87 121 221 111 136 219 135 33 110 148 99 177 130 188 238 281 328
2838 328 267 148 180 153 170 285 234 117 90 218 103 77 149 34 240 256 175 130 254 186 73 306 147 126 30 90 157 187 72
2498 72 164 145 130 19 58 169 139 88 273 135 47 153 308 167 295 118 8 56 65 49 118 127 218 127 176 142 129 141 117 181 44
2134 44 102 98 80 150 111 38 109 54 79 56 149 90 54 224 274 138 146 172 81 129 155 247 84 75 156 20 119 92 109 98 77 125 151 152 64
1723 64 64 152 123 83 53 128 85 86 30 138 90 203 76 63 124 166 247 284 314 89 205 145 221 231 153 146 85 172 200 214 72 148 148 38
1324 38 170 254 139 83 66 76 98 140 150 127 42 17 110 148 126 154 212 226 212 93 181 84 83 114 86 133 195 147 62 81 172 155 58 37
925 37 140 137 41 86 154 120 92 242 167 29 201 288 114 115 64 22 209 216 53 190 98 125 123 130 134 216 98 198 60 18 180 138 241
538 241 284 11 167 129 121 90 176 97 167 91 118 104 192 154 28 82 72 143 12 74 120 166 117 170 124 106 186 71 231 38 75 213
162 213 146 171 131 176 132 129 119 69 174 233 85 115 201 172 165 67 109 105 126 84 147 190 57 95 115 264 121 124 194 56
-190E6
##PAGE=	F1=14330
##FIRST=	25169.313707327481097,	5807.6787752999953227,	0.36250722408294677734
##DATA TABLE=	(F2++(Y..Y)), PROFILE
5808 21 34 31 168 92 149 123 118 74 117 128 77 123 146 177 85 156 192 264 114 204 20 110 154 102 190 206 65 26 133 109 176 81 185
5420 185 105 103 46 217 262 168 176 103 190 143 90 12 106 38 268 147 88 111 209 210 106 50 75 54 157 247 143 113 189 327 259 31
5045 31 133 83 67 217 171 117 148 157 39 108 173 290 298 177 74 119 95 47 51 146 134 84 232 206 48 120 67 45 127 115 156 106 178
4657 178 287 173 30 150 101 304 161 64 115 204 173 48 82 93 117 62 157 18 224 131 137 126 150 170 251 238 108 206 219 95
4305 95 88 93 47 152 76 108 23 317 277 196 415 287 58 107 226 123 68 97 207 160 49 214 167 168 143 13 36 91 179 82 150
3941 150 67 89 125 65 132 144 27 125 101 142 183 96 222 73 152 112 60 99 132 144 52 88 46 205 163 62 180 154 139 96 24 93
3566 93 69 62 128 188 173 196 149 196 162 183 258 196 186 198 113 205 76 98 88 101 41 120 59 77 92 113 91 114 209 321 129 144 233 207
3167 207 141 151 169 195 208 36 46 140 67 37 163 185 99 178 85 145 227 83 51 109 152 27 96 89 143 221 294 341 280 173 228 195 172
2779 172 232 130 51 153 246 88 70 192 36 237 235 157 110 232 137 104 269 127 125 36 73 179 184 83 155 170 145 60 102 164 176
2416 176 109 269 117 42 183 257 129 286 169 89 97 14 28 104 144 227 68 126 122 103 171 65 183 46 87 123 29 114 93 46 87
2052 87 31 68 23 74 72 62 186 223 140 166 174 97 126 153 273 56 99 187 40 158 115 119 105 80 165 108 96 78 70 134 110 87 65 168
1653 168 130 108 48 97 68 230 121 101 122 156 269 241 326 60 186 171 179 200 203 164 61 182 241 270 130 96 79 73 128 231 105
1289 105 42 60 70 112 143 167 157 56 22 116 182 113 106 201 209 252 96 191 58 128 133 130 163 217 128 23 106 153 99 75 55 165 130 53
890 53 94 185 152 162 293 178 20 212 295 120 159 73 33 174 194 78 187 114 97 111 93 149 212 66 153 123 64 204 130 225 251
526 251 12 161 140 165 105 187 76 85 108 54 90 179 152 36 43 152 164 7 87 142 145 147 158 90 79 213 50 251 59 10 195 170
150 170 189 98 170 128 101 149 126 206 228 105 106 186 139 136 74 91 58 127 110 114 164 47 92 101 253 106 110 186 77
-190G7
##PAGE=	F1=14227.7
##FIRST=	25169.313707327481097,	5807.6787752999953227,	0.44966217875480651855
##DATA TABLE=	(F2++(Y..Y)), PROFILE
5808 34 17 18 134 92 167 162 167 67 123 144 55 106 106 179 105 171 136 192 78 186 11 97 178 161 224 208 91 60 112 123 173 61 177
5420 177 116 97 40 195 279 185 225 122 175 133 106 62 167 87 208 115 99 50 170 184 160 122 103 77 160 236 84 144 166 293 226
5056 226 39 109 55 46 267 174 48 69 104 47 108 192 258 256 178 119 124 57 74 99 68 135 86 197 220 62 99 100 48 98 124 166 137 140 248
4646 248 135 46 94 151 315 178 28 104 170 138 36 72 100 89 40 189 52 225 92 134 172 174 185 232 207 120 188 233 137 144 108
4282 108 39 135 83 119 51 286 316 176 462 323 45 110 256 108 88 93 185 132 60 205 107 270 230 84 44 63 196 118 129 84
3930 84 111 117 84 100 140 27 113 118 148 208 118 187 75 106 123 9 135 98 192 50 102 43 175 189 53 139 166 149 40 51 84 42
3554 42 69 113 199 154 196 165 182 162 149 236 194 218 213 113 197 92 109 94 151 80 120 41 74 96 96 73 144 153 305 145 61 205 198 150 143
3143 143 174 182 203 95 14 139 99 37 133 275 86 142 56 162 210 11 86 92 138 62 48 35 93 190 292 338 280 173 258 238 150 159
2768 159 103 72 201 261 61 62 216 46 220 202 139 84 190 99 132 231 107 124 43 56 194 165 80 146 184 165 84 132 152 216 124
2404 124 224 84 49 196 167 76 259 224 148 121 63 31 91 168 238 14 76 123 136 185 15 173 49 70 154 90 139 105 55 98 93
2040 93 61 87 74 46 72 160 186 146 188 170 141 123 179 302 45 106 219 54 148 97 143 121 81 172 61 63 107 85 138 108 91 77 207
1653 207 179 117 74 39 62 236 147 127 120 150 294 187 303 47 158 184 161 169 241 172 32 182 265 300 178 94 30 102 90 191 87
1289 87 12 47 62 147 166 195 172 78 17 120 212 100 69 189 180 271 97 197 51 158 141 158 183 218 104 19 132 154 48 108 57
925 57 166 109 54 99 216 194 227 327 189 42 205 270 108 187 70 37 122 166 102 169 160 77 92 64 138 199 5 125 181 106 201
561 201 125 199 190 41 139 141 194 146 194 75 30 119 22 92 170 159 83 44 227 186 12 93 152 131 169 131 41 66 216 19 248 89
185 89 68 163 196 198 81 151 114 84 179 180 215 223 121 93 177 114 95 68 61 0 137 123 74 116 62 105 88 212 97 101 192 101
-190A01
##PAGE=	F1=14125.5
##FIRST=	25169.313707327481097,	5807.6787752999953227,	0.45120841264724731445
##DATA TABLE=	(F2++(Y..Y)), PROFILE
5808 59 23 46 94 94 177 210 195 84 148 160 37 86 112 178 110 176 80 117 49 157 33 84 175 183 240 189 105 95 90 118 165 45 165 129
5409 129 104 35 175 294 203 267 131 133 102 109 103 230 147 130 125 87 57 123 174 211 196 153 78 156 201 21 170 129 242 191 68 87 27
5021 27 21 298 184 41 27 78 63 103 186 206 190 167 153 168 23 114 143 68 156 75 171 211 64 76 147 79 83 129 159 150 122 203 115 50
4622 50 70 190 303 178 17 87 126 125 41 57 116 32 91 229 84 217 74 145 205 181 175 190 175 138 173 240 176 188 133 42 114 98
4247 98 131 68 249 330 162 466 326 120 152 270 87 104 89 154 106 70 197 45 369 319 163 73 105 235 145 91 98 113 130 98
3894 98 60 141 29 107 108 133 208 123 127 73 38 137 53 177 118 242 51 106 35 133 211 74 108 148 141 12 89 91 72 78 85 196 147 225 184
3484 184 163 150 119 212 194 241 208 128 168 93 109 107 196 116 112 42 89 125 110 74 153 85 259 160 48 167 196 150 122 203 196 187 140 68 143
3073 143 143 38 100 338 78 128 65 181 178 67 114 61 113 135 143 31 49 150 274 324 268 153 250 266 116 91 189 138 227 262 49
2709 49 60 209 53 199 173 131 72 132 103 152 199 84 129 43 44 192 131 67 148 185 185 85 140 137 243 150 148 37 58 188 60 69 246
2322 246 261 178 125 129 82 86 187 244 67 93 134 170 178 30 155 52 56 185 169 188 136 83 144 119 67 147 148 40 92 152 181 161 208 158
1923 158 188 130 209 321 52 99 245 64 97 51 179 151 82 149 39 86 149 111 160 115 99 80 232 217 113 102 35 55 219 154
1570 154 139 129 135 306 128 254 49 123 167 160 144 273 172 60 173 267 296 200 116 55 118 71 138 101 63 29 63 189 202 233 173
1207 173 101 14 109 224 98 67 173 146 271 101 198 71 170 127 163 178 197 84 52 151 169 8 151 48 143 80 46 102 239
866 239 236 269 331 190 69 177 213 91 191 90 56 59 133 112 138 200 69 69 73 109 182 77 124 213 136 170 115 166 105 73 104 131 203
479 203 188 200 93 91 125 79 95 168 170 122 76 284 219 27 89 151 124 176 108 13 81 202 20 226 116 125 121 204 188 86 117 89 75
92 75 200 220 198 215 120 72 169 115 55 50 24 64 154 116 43 58 96 122 75 147 91 97 206 118
-190A18
##PAGE=	F1=14023.2
##FIRST=	25169.313707327481097,	5807.6787752999953227,	0.33451873064041137695
##DATA TABLE=	(F2++(Y..Y)), PROFILE
5808 74 43 91 56 94 181 260 207 115 187 176 24 74 152 173 103 170 27 88 37 123 39 72 146 168 234 155 102 124 94 97 152 35 148 133
5409 133 122 30 162 304 213 282 120 72 58 94 130 279 193 44 145 51 100 82 186 255 250 202 64 145 148 49 173 90 194 156 97
5045 97 75 49 14 309 203 113 125 91 74 97 167 151 108 140 160 211 65 155 165 125 176 45 166 182 51 63 210 130 81 126 130 143
4669 143 113 152 108 44 98 207 272 158 47 72 79 135 47 46 145 71 185 268 128 197 78 162 218 167 139 135 144 155 156 234 205 210 158 54
4270 54 116 124 141 66 207 311 159 429 302 193 203 255 59 118 94 129 96 72 189 18 446 382 242 102 163 272 158 70 112
3930 112 106 172 108 23 148 29 107 75 105 184 113 58 74 53 149 69 208 138 263 55 101 14 88 208 90 89 105 133 47 101 90 110
3554 110 84 67 194 147 263 209 154 139 96 191 200 246 186 156 131 80 101 116 236 153 98 52 103 155 136 88 142 20 190 164 140 131 202
3167 202 139 96 246 236 172 160 105 151 197 47 91 363 77 129 100 197 151 136 131 21 87 188 234 84 52 111 238 304 243 121 205
2803 205 271 90 96 275 190 234 252 94 71 174 66 179 158 137 93 79 141 155 180 60 145 32 37 168 87 49 164 175 198 63
2451 63 125 121 248 180 62 32 68 158 40 138 265 267 179 112 178 148 90 192 241 122 150 131 175 155 65 141 58 49 208 229 221 164 126 196
2052 196 105 82 183 210 74 122 165 194 178 221 140 227 151 228 320 57 81 255 75 25 35 216 192 86 117 71 117 198 145 184 122
1688 122 111 77 239 240 103 122 80 34 184 143 138 152 108 296 67 199 56 84 121 154 132 301 171 108 155 243 259 190 127 94 118
1324 118 75 78 120 104 16 73 226 247 277 164 116 26 81 210 113 87 148 117 251 105 190 105 171 98 147 143 159 70 69 158 191 22 189
937 189 51 99 50 36 100 241 266 281 303 173 94 129 130 102 183 150 105 16 97 99 95 212 67 45 99 76 167 159 134 219 146 115 93 132 12
526 12 104 65 111 195 224 209 110 144 133 140 84 172 183 144 104 321 261 47 78 145 125 164 96 63 114 182 60 192 133 165 72 182 158 103
127 103 78 55 69 201 234 159 202 110 50 158 134 39 28 12 126 167 87 44 15 138 144 69 80 82 92 218 126
-190A26
##PAGE=	F1=13920.9
##FIRST=	25169.313707327481097,	5807.6787752999953227,	0.20964501798152923584
##DATA TABLE=	(F2++(Y..Y)), PROFILE
5808 73 60 131 41 90 183 299 208 145 228 191 18 73 184 167 91 158 20 133 41 96 29 71 103 132 209 120 89 148 133 80 134 31
5432 31 128 122 149 39 152 299 211 261 89 46 44 64 143 301 217 42 149 16 127 66 215 288 275 233 55 123 91 86 144 58 171
5068 171 126 125 70 89 59 303 227 179 211 121 74 90 150 115 30 102 140 234 113 189 175 165 181 21 181 141 35 69 282 188 84 114
4693 114 91 119 96 99 92 37 126 200 225 117 77 73 46 157 46 51 174 154 278 298 189 170 95 178 216 142 86 79 122 170 135 212 219 205 171
4282 171 83 144 153 151 47 159 258 160 360 264 253 241 211 50 130 110 126 104 65 176 45 485 403 310 123 204 292 156 101 132 107
3918 107 226 111 4 165 43 103 64 89 143 97 6 79 115 147 55 215 140 248 66 98 25 51 174 88 95 48 133 66 93 81 137
3554 137 85 82 208 145 290 238 166 145 77 176 212 228 156 183 98 57 94 113 268 190 77 61 107 170 148 96 119 55 114 153 212 103 216
3167 216 122 84 280 281 165 155 123 162 255 72 118 347 93 130 130 205 142 185 137 20 64 210 288 124 100 92 189 280 207 85 139 257
2791 257 89 155 329 218 228 236 160 93 123 83 166 152 153 132 86 186 138 174 36 169 33 34 127 54 35 184 168 195 26 95 109 231
2416 231 194 60 99 85 116 113 207 297 240 160 91 200 211 94 180 230 162 198 103 147 124 93 141 69 46 217 262 228 176 169 234 59 96
2028 96 192 242 109 152 194 192 187 226 124 253 177 231 296 59 46 242 83 47 79 242 234 92 122 109 132 246 186 200 125 129 97 229
1653 229 246 94 128 96 3 143 121 129 175 83 265 13 169 65 46 81 139 133 324 170 143 129 198 200 154 119 125 107 86 16 130 126 28
1265 28 87 251 293 319 145 115 38 42 168 138 104 107 105 213 106 173 141 172 72 119 83 113 64 73 158 215 35 214 77 43 24 32 93
878 93 219 277 272 254 139 115 71 42 145 180 221 172 80 68 63 52 187 81 34 114 62 159 224 134 205 137 59 62 109 78 127 48 81 176 249
467 249 218 114 168 144 197 50 179 196 144 117 338 302 71 65 139 132 138 76 103 149 168 97 157 130 182 29 130 112 115 51 21 58 177
80 177 219 102 181 108 51 141 151 58 12 41 182 169 40 61 42 179 176 79 93 62 85 224 126
-190A26
##PAGE=	F1=13818.7
##FIRST=	25169.313707327481097,	5807.6787752999953227,	0.16783490777015686035
##DATA TABLE=	(F2++(Y..Y)), PROFILE
5808 59 70 160 61 79 183 317 200 168 262 204 14 74 192 162 80 140 65 192 46 92 6 83 65 93 171 96 76 169 186 106 116 42
5432 42 107 103 184 66 140 273 194 200 60 105 92 30 145 292 220 120 131 55 128 70 251 306 270 241 75 91 43 93 91 42 177 106
5056 106 150 63 114 107 288 247 231 271 156 71 84 141 108 65 67 100 233 146 216 187 176 175 61 205 102 40 80 347 246 82 97 89
4681 89 88 63 85 61 40 131 172 169 59 101 92 39 185 67 65 193 214 346 314 255 150 119 190 202 126 28 35 110 182 111 173 217 181 164 124
4270 124 175 178 167 38 111 180 157 275 233 297 260 150 92 139 130 138 119 48 159 76 475 380 358 132 224 291 139 142 165 120 268 106
3894 106 18 187 72 93 116 107 93 85 44 81 146 124 24 193 126 200 78 110 80 37 114 66 126 26 136 66 91 75 153 79 112 234
3519 234 140 302 264 190 168 69 166 228 190 129 199 79 29 100 97 286 221 50 65 112 165 137 87 94 104 64 130 250 84 232 112 106
3143 106 286 310 165 135 125 174 309 109 158 298 122 125 147 205 140 207 133 57 38 200 299 148 150 96 128 248 161 60 82 234
2791 234 107 207 343 221 215 220 227 118 73 88 159 144 174 170 128 228 105 176 12 193 67 29 88 69 32 200 172 170 43 77 109
2427 109 192 173 121 166 118 84 151 248 311 187 136 84 193 257 94 151 219 183 222 53 95 106 125 158 83 38 210 267 213 169 198 252
2052 252 24 106 184 249 130 168 228 164 178 226 113 265 201 223 249 85 10 206 85 91 104 246 266 104 181 135 131 286 228 201 126
1688 126 149 160 216 237 92 121 79 54 107 95 119 186 95 217 54 176 71 16 101 133 144 335 174 154 102 136 139 116 95 148 89 94
1312 94 42 141 131 47 99 257 329 347 114 103 45 26 104 160 111 52 112 159 99 154 173 175 60 86 26 72 70 81 162 234 32 222 106
925 106 28 34 32 84 175 266 256 196 98 137 12 69 188 192 279 241 141 60 10 48 130 123 57 114 78 161 261 124 177 113 61 39 108 147 137
514 137 70 45 155 261 223 100 161 153 248 4 187 206 118 112 335 328 98 58 134 144 116 37 129 178 158 124 124 104 177 46 57 66 115 62
115 62 34 43 131 176 41 155 127 70 121 155 83 10 62 230 168 48 75 57 207 210 104 170 31 81 223 118
-190A18
##PAGE=	F1=13716.4
##FIRST=	25169.313707327481097,	5807.6787752999953227,	0.09001426398754119873
##DATA TABLE=	(F2++(Y..Y)), PROFILE
5808 47 73 180 86 60 179 306 181 180 282 212 11 70 177 158 75 118 105 237 54 111 27 97 66 66 131 87 74 182 234 163 98
5444 98 67 83 94 224 102 125 226 163 110 86 165 143 28 138 256 214 183 102 90 106 76 280 303 242 227 106 52 22 69 51 35
5080 35 200 99 169 56 113 147 273 251 266 296 190 86 78 127 114 130 58 53 209 159 234 209 159 165 94 224 78 52 85 390 293 69
4704 69 86 132 56 27 141 27 49 108 131 111 23 119 116 46 218 121 78 196 233 369 315 312 153 149 195 176 129 20 9 106 195 97 125
4317 125 201 156 138 166 194 197 189 67 74 99 144 194 220 324 259 115 150 142 145 148 128 28 157 118 418 332 379 123 224 271 110 164 206
3930 206 138 288 92 19 205 98 76 184 145 48 79 60 75 134 87 43 143 101 134 81 134 142 37 54 26 164 69 135 50 123 83
3566 83 155 67 131 263 143 299 280 207 198 95 161 244 142 109 199 73 29 127 70 287 236 34 67 126 146 113 61 77 137 78 103 254
3190 254 65 240 114 147 256 315 163 122 127 183 349 153 193 227 153 115 152 195 130 205 125 83 17 160 267 158 186 99 65 208
2838 208 114 69 81 213 127 237 320 201 201 207 288 140 62 76 155 128 198 198 154 263 70 184 9 203 108 21 75 104 40 212 179
2474 179 123 96 101 118 135 114 149 222 161 95 168 252 291 121 121 107 167 277 95 113 216 184 224 8 33 118 164 187 96 22 189 251 187
2087 187 144 206 245 83 113 174 239 135 162 256 126 149 220 108 261 216 209 182 141 66 153 77 97 97 222 280 132 257 144 123 309
1723 309 264 184 130 169 243 215 214 92 113 68 109 87 71 114 174 132 160 110 194 73 7 139 150 165 329 178 139 93 68 98 112 62 167
1336 167 70 98 94 164 128 61 106 244 346 349 79 97 49 65 33 174 113 10 127 98 83 142 192 169 61 54 82 62 86 113 172 242 31
948 31 217 121 90 71 38 80 117 235 244 142 82 168 40 131 209 207 309 301 193 80 50 87 55 184 100 107 99 165 265 122 145 79 108
561 108 51 129 184 133 96 31 140 258 215 70 129 154 288 71 191 213 77 95 312 331 127 65 125 153 115 21 145 197 149 135
209 135 96 56 159 91 43 65 101 88 62 53 66 117 51 128 156 85 102 142 102 29 91 266 182 117 92 53 218 238 129 237 17 83 213
-178 213 105
-190A05
##PAGE=	F1=13614.2
##FIRST=	25169.313707327481097,	5807.6787752999953227,	0.17507193982601165771
##DATA TABLE=	(F2++(Y..Y)), PROFILE
5808 54 73 194 104 42 168 266 145 183 282 212 16 67 145 155 76 95 138 261 75 133 59 107 95 49 102 80 82 181 267 223 83 98
5432 98 59 107 258 138 110 159 121 32 142 206 181 59 125 200 210 227 76 105 69 80 290 277 201 198 129 11 20 27 94 24 231 111
5056 111 176 73 86 171 258 235 283 283 219 121 71 95 122 182 78 23 169 156 246 240 128 160 103 230 77 48 90 401 318 44 96 174
4681 174 32 49 211 36 54 63 95 63 87 127 139 61 249 185 85 185 207 340 303 345 172 178 199 136 131 51 18 100 211 106 79
4317 79 173 146 103 199 189 213 209 101 75 79 126 136 223 336 240 139 200 138 151 141 126 30 181 161 326 285 368 95 208 241 74 156
3941 156 244 152 280 69 12 209 108 60 241 180 35 74 63 64 87 87 86 79 72 67 70 157 198 29 76 26 195 98 130 38 178 97 143 50
3542 50 132 290 164 283 280 207 222 144 159 250 99 86 184 76 65 168 39 273 226 57 70 142 127 102 37 69 157 108 84 230 41
3178 41 235 118 186 192 297 153 137 144 186 368 194 217 149 178 102 147 178 117 191 119 96 53 100 207 161 196 84 37 162 76 100 114
2803 114 199 143 242 270 169 192 196 333 157 104 49 153 102 224 212 155 281 63 195 28 192 139 25 83 130 53 226 174 56
2462 56 144 141 119 67 35 130 259 200 133 184 224 238 69 121 141 137 269 100 75 223 167 210 65 25 147 207 219 101 21 160 226 159
2087 159 106 191 217 137 121 166 229 130 133 271 121 109 206 111 243 217 189 102 203 124 97 61 69 67 172 269 179 320 136 108 314 290
1711 290 152 136 184 320 227 184 93 126 126 153 85 57 119 142 161 108 165 196 72 10 150 171 194 307 178 102 109 9 80 139 33 186
1336 186 53 100 137 193 128 67 107 214 338 317 77 118 62 104 50 182 115 71 139 44 60 144 197 146 78 33 150 85 106 157 176 240
960 240 63 208 116 145 107 57 77 61 191 238 103 131 208 77 160 202 207 304 339 232 112 100 121 33 246 148 102 108 163 242 137 110
584 110 45 144 78 156 187 117 109 65 134 239 186 28 87 145 315 139 188 221 66 83 269 314 155 85 114 155 123 89 156 200 139 130 83
197 83 15 145 130 116 105 75 105 81 96 12 75 112 111 177 83 94 110 112 68 144 289 217 184 119 54 211 249 143 276 61 88 190 87
-190H7
##PAGE=	F1=13511.9
##FIRST=	25169.313707327481097,	5807.6787752999953227,	0.29506790637969970703
##DATA TABLE=	(F2++(Y..Y)), PROFILE
5808 66 74 209 113 45 146 201 94 183 258 199 30 76 105 151 82 73 157 266 109 144 87 112 119 40 93 66 96 163 279 266 76 125 34
5420 34 127 274 164 100 83 69 112 189 222 200 88 112 136 213 248 63 97 46 92 272 228 157 166 133 27 12 37 150 12 267 137
5056 137 171 122 38 177 237 199 284 236 234 153 58 46 135 221 108 43 124 149 250 265 104 161 89 224 97 27 120 373 315 18 119
4693 119 189 38 92 263 60 55 26 90 47 144 124 159 91 268 243 89 169 151 265 282 349 188 198 212 91 112 69 63 89 225 130
4329 130 63 134 143 81 216 164 229 218 122 107 128 108 114 236 332 206 175 230 125 149 116 111 53 216 193 221 257 322 58 178 205 42
3953 42 126 269 161 249 43 17 190 95 56 279 203 64 61 83 51 65 145 112 47 55 29 46 167 234 19 130 76 209 107 121 73
3589 73 236 106 114 30 121 318 196 252 262 191 233 190 162 243 77 57 153 80 102 213 19 249 190 85 69 144 120 119 47 63 173
3225 173 124 87 193 12 217 108 215 112 266 137 170 174 181 364 222 227 82 194 98 136 160 130 183 119 92 102 31 138 165 175
2873 175 47 79 118 57 131 136 188 157 231 208 144 187 180 357 167 156 16 148 68 249 213 141 273 83 209 40 157 149 42 81
2521 81 142 68 245 151 23 176 165 98 31 91 67 272 223 166 210 188 165 75 128 168 121 238 111 46 235 136 191 104 67 170 246
2157 246 246 97 53 128 205 136 64 164 172 171 129 150 226 132 88 268 155 77 184 131 213 204 163 22 253 163 49 44 37 45 101 233 233 356
1758 356 114 85 302 303 113 138 189 368 240 154 90 158 203 175 100 57 135 103 168 108 216 177 70 36 138 177 225 272 167 55
1406 55 137 53 61 161 47 202 43 102 174 210 133 66 101 175 302 251 123 153 89 136 104 187 122 120 141 21 35 150 186 103 116 53
1031 53 199 112 123 197 160 229 109 200 91 178 134 86 66 55 145 232 95 209 249 99 150 175 187 271 352 257 146 129 138 92 294 195
655 195 102 101 150 206 157 76 17 162 103 184 159 93 116 101 133 204 135 20 57 124 327 198 178 235 116 90 212 281 176 108 101 149 118
268 118 155 165 189 135 110 107 68 153 160 178 140 41 110 90 151 89 89 164 113 179 67 94 64 114 120 208 296 256 235 155 83 189 242 138 277
-143 277 104 86 152 68
-190F8
##PAGE=	F1=13409.7
##FIRST=	25169.313707327481097,	5807.6787752999953227,	0.25970098376274108887
##DATA TABLE=	(F2++(Y..Y)), PROFILE
5808 63 78 226 116 68 115 126 35 185 214 172 43 94 64 145 91 56 162 259 147 140 110 114 129 44 97 44 116 135 266 285 78 140
5432 140 16 134 261 172 96 19 15 194 213 215 202 110 106 76 216 247 60 76 70 111 223 166 117 141 114 50 29 83 182 23 307 169
5056 169 161 185 30 167 209 151 270 167 231 164 43 59 156 247 142 58 85 146 243 271 113 162 60 209 131 34 177 313 283 43
4704 43 133 177 66 122 287 71 58 71 118 68 181 108 172 122 266 278 95 155 111 165 262 328 186 203 235 93 65 89 122 73 227
4340 227 148 85 82 127 88 218 127 241 211 126 139 171 97 119 253 310 161 182 239 108 140 79 86 76 237 204 128 232 249 44 134 167
3965 167 42 92 277 161 203 42 35 151 60 65 295 212 99 47 133 46 139 210 112 89 78 39 12 159 237 30 165 115 199 97
3613 97 109 131 281 108 70 13 109 341 223 205 222 162 228 212 179 224 79 54 109 74 132 250 23 228 136 98 62 120 120 139 69 56
3237 56 193 128 115 155 24 199 82 228 70 231 117 197 205 168 337 231 223 53 201 107 124 146 176 190 126 74 144 43 96 174
2885 174 127 21 120 99 57 155 139 179 175 214 153 140 185 155 356 170 201 12 142 37 269 205 130 233 102 225 45 106 141 56
2533 56 59 145 85 262 110 104 188 163 54 86 187 33 257 223 185 231 172 107 112 136 181 118 189 119 32 242 92 172 120 85 178 270 261
2146 261 84 92 98 189 114 47 143 118 186 137 117 228 149 39 242 179 82 155 167 179 179 132 61 279 176 12 43 72 65 24 178 275 354
1758 354 81 60 282 301 88 130 179 375 239 127 80 187 257 167 126 63 158 82 154 167 259 142 68 83 137 164 252 228 143 10
1406 10 159 92 24 164 84 215 47 100 205 201 136 62 89 133 245 158 175 179 122 165 137 190 128 150 137 30 17 149 164 53 159
1042 159 89 226 130 131 220 115 211 148 194 56 182 145 118 63 108 108 225 114 285 281 108 113 148 152 220 337 268 178 129 137 125 317 231
655 231 101 82 126 174 160 53 7 163 127 207 110 69 131 124 130 157 65 70 59 94 323 238 163 257 171 102 148 234 181 126 90 140 93 208
256 208 172 173 145 86 157 112 170 181 217 159 10 107 98 202 165 123 193 129 161 44 92 30 110 172 265 285 281 260 189 121 160 218 111 243
-143 243 135 73 106 50
-190E0
##PAGE=	F1=13307.4
##FIRST=	25169.313707327481097,	5807.6787752999953227,	0.16167853772640228271
##DATA TABLE=	(F2++(Y..Y)), PROFILE
5808 40 82 243 118 87 82 66 20 190 163 134 51 114 47 137 105 42 152 254 182 122 128 117 126 60 100 21 146 117 233 277 87 137 25
5420 25 118 218 160 92 69 65 247 210 194 190 125 112 38 208 227 60 53 104 130 151 120 84 131 76 56 62 114 186 43 340 196 153 245 87
5021 87 148 176 103 246 95 211 143 51 134 177 258 176 55 60 148 225 252 140 158 32 192 170 81 241 237 228 87 127 149 95 136 282
4646 282 71 78 122 154 95 194 84 171 139 238 282 107 142 142 64 247 290 168 192 255 159 41 121 179 57 209 150 112 43 90 107 209
4270 209 97 242 188 118 159 192 96 134 266 269 106 154 236 92 128 52 59 90 232 200 85 191 167 71 79 128 69 84 267 153 153 78
3894 78 50 98 12 71 287 206 131 50 195 59 224 253 87 129 115 35 32 134 201 47 174 135 164 75 105 189 302 107 13 16 103
3531 103 345 233 149 164 124 207 200 213 197 90 102 61 52 149 272 27 221 85 89 49 74 114 139 77 54 221 130 152 124 52 202 60
3155 60 224 114 202 97 211 230 149 295 217 205 72 198 124 115 135 226 207 136 44 172 100 104 188 71 76 147 118 71 170 128 174 198
2779 198 202 117 155 186 116 328 166 229 19 140 54 278 192 119 159 118 238 43 63 134 61 24 148 99 269 57 175 179 132 35
2427 35 133 260 140 218 200 186 232 184 110 141 144 180 116 128 114 37 241 44 154 116 80 175 275 254 68 130 75 172 88 67 141 62
2052 62 185 143 84 231 169 6 189 165 103 126 205 149 145 105 118 277 171 21 61 118 90 61 111 289 315 40 53 262 283 96
1700 96 115 151 339 220 105 63 194 266 131 151 69 180 92 131 233 289 101 67 142 174 142 268 179 103 28 168 113 37 156 112
1347 112 217 62 98 225 166 136 62 70 96 177 55 211 182 153 196 150 188 126 162 133 34 14 136 140 45 188 113 232 140 131 225 48
972 48 191 167 186 31 156 135 152 107 166 83 214 140 341 297 112 78 143 114 167 300 270 203 100 123 121 312 250 98 58 99 160
608 160 137 48 18 150 151 224 49 53 160 129 122 106 21 114 69 59 305 258 145 282 207 100 88 170 164 134 84 133 57 248 176 171 168 72
209 72 207 134 177 198 228 163 39 99 108 239 231 145 193 147 124 35 84 79 102 207 293 254 282 256 210 154 135 184 63 180 148 53 59 45
-190D5
##PAGE=	F1=13205.1
##FIRST=	25169.313707327481097,	5807.6787752999953227,	0.1325686722993850708
##DATA TABLE=	(F2++(Y..Y)), PROFILE
5808 22 88 255 122 94 63 62 58 197 138 95 50 130 85 136 125 29 134 264 209 96 142 126 118 71 93 23 183 128 189 248 96 117 46
5420 46 82 150 128 82 120 134 266 181 168 169 129 126 44 185 195 64 42 123 142 72 135 64 132 36 47 91 122 163 61 356 207 149 288
5033 288 132 128 151 70 212 58 177 92 98 203 182 251 207 36 56 145 194 208 160 146 17 175 204 124 290 166 162 133 99 134 115
4669 115 138 256 70 112 157 184 116 186 64 152 128 187 255 122 131 197 34 238 243 143 168 253 232 111 159 220 51 171 134 129 88
4305 88 50 115 195 92 226 156 101 167 196 104 151 265 206 44 107 229 84 112 67 45 94 203 192 107 133 125 93 53 88 96 107 243
3930 243 136 110 119 63 48 41 65 255 189 155 66 247 89 285 262 44 145 142 13 78 100 129 55 166 133 107 51 128 234 295 106
3566 106 50 29 96 319 222 91 96 84 172 152 252 170 102 158 47 24 155 273 21 223 83 61 30 55 100 109 69 74 250 134 179
3202 179 90 70 229 81 203 159 183 79 212 245 132 246 181 173 96 188 136 109 124 255 220 146 10 182 139 126 205 59 131 166
2850 166 155 103 180 109 177 228 201 103 173 185 62 276 154 240 7 154 103 270 178 94 61 140 244 35 80 161 54 18 157 108
2498 108 257 3 224 155 87 89 153 295 241 162 161 172 208 198 148 161 150 169 114 62 90 59 230 50 139 111 58 178 260 222 65 165
2122 165 61 146 52 90 149 28 176 148 114 233 181 27 112 115 113 103 228 126 110 100 150 253 171 58 82 144 97 123 52 268 247
1758 247 11 70 246 253 120 101 104 270 189 86 47 171 227 78 164 72 194 102 118 275 301 67 65 201 221 128 263 127 57 55
1406 55 167 116 97 155 125 204 80 101 228 121 141 71 45 67 113 55 220 159 173 229 158 177 112 161 138 46 18 116 126 82 190 111
1031 111 222 143 125 215 42 179 156 170 50 121 111 185 182 213 66 200 164 367 299 120 93 158 85 124 250 266 217 50 110 85
678 85 283 250 102 55 83 165 92 52 29 126 171 231 14 52 195 115 110 64 93 148 65 28 273 259 131 302 221 83 48 90 126 126 83
291 83 132 53 276 175 194 193 71 239 134 168 215 212 162 75 91 123 256 278 159 161 157 77 53 71 138 89 214 284 207 258 225 214 180 119
-108 119 152 7 104 140 44 26 64
-190F4
##PAGE=	F1=13102.9
##FIRST=	25169.313707327481097,	5807.6787752999953227,	0.026760973036289215088
##DATA TABLE=	(F2++(Y..Y)), PROFILE
5808 68 95 258 129 88 77 86 69 197 154 81 40 138 145 150 150 25 125 287 224 68 154 146 111 70 76 41 222 158 147 206 99 90 73 55
5409 55 69 81 67 151 195 253 137 148 147 118 143 65 150 162 76 39 121 150 59 193 72 129 35 37 108 113 125 77 344 196 142 306 159
5021 159 115 145 53 171 77 139 20 161 248 163 226 229 16 69 131 155 148 162 125 16 163 229 150 307 121 101 176 56 141 118 134
4657 134 219 80 150 172 202 130 166 64 112 88 123 203 133 119 230 79 228 194 133 140 223 285 184 187 237 59 119 106 133 153 77 107
4282 107 183 99 192 119 77 164 196 117 170 241 124 17 78 222 89 91 97 54 88 160 193 146 87 162 93 106 52 115 136 209 110 80 150 75
3883 75 31 81 52 202 162 166 79 276 125 314 236 37 141 151 50 125 70 30 72 154 113 53 38 171 259 260 101 112 36 74 255
3519 255 196 41 43 60 132 75 282 146 114 197 84 34 157 254 8 225 126 39 13 121 98 57 51 110 274 137 184 45 74 259
3167 259 124 165 174 170 68 206 252 125 200 129 136 111 170 135 107 109 248 218 150 23 176 158 131 223 91 170 187 199 146 186 90 188 262
2779 262 203 104 182 181 2 207 130 233 21 186 150 245 166 52 52 171 237 27 126 217 43 42 168 114 229 40 244 132 63
2439 63 135 142 291 317 103 120 147 167 198 174 173 155 158 120 50 49 93 215 117 129 127 48 203 228 167 90 198 57 108 22 105 147 57 163
2040 163 153 182 237 177 34 41 92 106 88 229 107 81 119 159 216 194 94 97 146 89 162 54 215 164 50 86 225 214 137 100 45 188
1664 188 161 72 42 120 148 27 159 72 196 92 121 278 291 50 66 250 247 127 237 76 59 87 163 104 148 172 123 172 94 118
1312 118 216 100 156 86 13 46 72 131 201 114 179 259 175 162 87 152 152 66 20 100 129 103 164 81 204 147 113 195 114 178 117 145 84 134
913 134 91 218 255 242 54 180 187 364 293 136 135 176 72 93 198 261 218 27 118 32 241 232 128 89 87 176 45 58 41 94 179 224
538 224 74 64 220 86 97 43 149 167 45 38 231 246 126 315 218 60 38 15 76 104 84 135 86 292 171 227 209 72 247
197 247 124 159 234 178 169 108 80 138 254 300 174 99 156 50 76 65 183 73 188 238 146 216 171 198 203 110 138 76 32 117 70 29 94
-190I4
##PAGE=	F1=13000.6
##FIRST=	25169.313707327481097,	5807.6787752999953227,	0.1010316014289855957
##DATA TABLE=	(F2++(Y..Y)), PROFILE
5808 119 100 252 136 73 105 95 51 187 181 101 35 139 206 178 173 39 141 311 226 44 162 170 111 59 61 53 256 183 115 162 92 70
5432 70 108 98 30 33 52 162 236 214 92 142 129 90 158 88 109 141 93 38 102 156 120 253 109 116 50 46 110 95 89 92 304 165 127 296
5033 296 166 107 156 42 126 91 101 54 224 263 125 194 237 40 86 107 113 85 142 97 30 162 243 152 283 103 68 212 45 148
4681 148 106 131 180 96 180 167 206 136 145 74 57 27 56 140 136 109 229 94 208 146 154 129 175 308 234 199 229 79 66 77 125 201 136 82
4282 82 175 107 145 75 48 160 202 132 185 191 33 70 97 213 104 67 116 64 76 116 204 181 94 216 70 167 47 123 163 168 77 63 165
3894 165 88 41 100 65 134 128 161 84 270 157 309 184 97 131 141 100 169 55 79 118 146 87 80 42 213 260 203 90 162 36 37 162
3519 162 163 15 66 74 93 21 288 131 131 210 117 56 159 218 13 216 163 72 18 196 126 17 36 148 286 135 161 12 65 272
3167 272 158 112 155 160 62 193 247 130 166 69 109 121 142 123 111 88 209 200 147 48 159 160 116 234 105 191 217 242 188 190 78 204
2791 204 294 201 121 177 174 58 130 92 210 54 225 183 205 152 60 159 199 214 32 163 277 43 50 174 122 191 64 236 125 83
2439 83 153 103 254 356 71 92 117 127 183 174 179 155 154 131 114 33 130 205 191 126 157 84 248 186 100 132 227 60 76 82 119 126 88 153 154 239
2016 239 245 158 39 108 162 96 81 207 90 65 145 151 177 224 119 102 132 74 178 85 143 84 85 91 190 172 138 114 23 115 147 69 48 56 52
1606 52 31 131 70 186 57 128 239 260 51 73 278 243 126 193 36 117 134 162 79 177 201 116 123 101 147 196 127 179 105 28 35 66
1230 66 175 161 58 170 276 202 153 60 142 168 78 22 98 143 98 125 50 187 158 95 171 163 185 58 115 118 201 108 243 304 249 50
854 50 156 214 339 283 160 173 189 80 70 155 255 206 80 152 57 196 204 171 142 108 183 77 80 57 74 171 206 131 85 225 52 87
479 87 37 176 172 29 66 182 223 136 319 208 54 33 95 58 73 80 139 109 292 164 247 209 64 231 112 166 257 164 192 136 75
115 75 152 240 293 196 20 142 85 96 73 203 61 133 171 80 167 106 168 228 102 160 149 50 98 110 40 123
-190A23
##PAGE=	F1=12898.4
##FIRST=	25169.313707327481097,	5807.6787752999953227,	0.058691911399364471436
##DATA TABLE=	(F2++(Y..Y)), PROFILE
5808 151 97 237 135 57 127 84 40 170 194 130 46 134 259 209 187 56 174 319 213 30 163 190 115 44 75 55 278 195 88
5467 88 122 76 70 148 173 98 35 42 163 254 156 61 158 116 54 165 113 71 143 112 48 77 165 167 299 157 109 39 61 104 86 73 106 246
5068 246 127 105 265 159 105 169 51 81 75 69 116 273 246 87 176 230 76 98 85 82 34 104 66 52 172 250 134 223 103 77 234
4704 234 85 136 84 132 143 109 196 144 197 135 130 82 32 48 3 82 129 103 199 82 174 97 193 146 139 303 257 193 204 104 42 62 106 216
4305 216 182 49 174 123 98 30 42 161 215 150 192 123 51 107 121 196 124 48 120 60 59 86 221 204 117 243 31 205 75 120 190
3941 190 125 43 59 166 98 32 95 115 72 91 138 85 229 175 279 123 160 131 121 135 205 52 183 182 143 83 140 54 237 243 137 78
3566 78 192 32 34 67 133 48 111 96 64 111 266 144 153 193 131 58 163 174 29 194 180 118 27 251 169 64 33 178 282 129
3214 129 112 75 47 259 172 48 111 149 59 172 229 142 149 24 115 127 106 107 119 61 147 169 136 59 139 152 92 234 87 198 246 277
2838 277 218 190 73 223 317 187 155 160 167 103 54 42 175 80 260 195 159 134 125 249 212 173 48 184 319 53 42 169 132 158 66
2474 66 208 139 99 139 51 199 359 91 80 88 107 161 155 179 150 159 132 173 88 160 208 255 131 182 136 296 143 41 176 254 65 81
2099 81 166 143 98 106 148 148 262 252 130 66 196 244 109 78 172 74 54 167 140 141 241 127 98 109 63 174 95 67 20 105 93 135 136
1711 136 130 132 78 72 150 80 51 41 49 44 93 69 167 9 126 169 210 61 90 279 219 115 148 37 177 192 162 48 180 223 113 61
1336 61 103 182 184 167 199 125 74 27 68 181 112 9 151 276 225 157 44 134 182 73 25 109 155 73 109 84 175 175 70 144 178 188 40
948 40 92 149 271 152 253 318 235 64 140 242 306 269 183 207 207 106 56 126 246 184 127 197 118 154 173 214 201 138 183 144 120 78 85
561 85 151 182 177 108 208 31 82 34 172 166 55 88 130 196 161 312 202 67 18 169 101 49 65 142 111 271 152 236 194 43 199
197 199 102 182 280 210 227 159 87 163 222 260 214 66 118 140 116 82 197 61 67 107 15 122 40 135 254 97 217 212 97 110 146 47
-178 47 145
-190A45
##PAGE=	F1=12796.1
##FIRST=	25169.313707327481097,	5807.6787752999953227,	0.22538125514984130859
##DATA TABLE=	(F2++(Y..Y)), PROFILE
5808 155 81 214 125 45 136 59 96 163 187 147 62 129 294 229 185 63 199 301 186 26 152 195 122 33 115 47 282 192 58 93
5456 93 55 85 188 249 151 71 41 165 249 87 51 193 104 43 162 135 49 175 132 73 73 175 188 323 202 137 5 62 104 89 79
5092 79 117 191 118 82 221 144 109 175 92 41 34 50 153 297 205 85 188 208 109 102 78 82 23 59 39 69 184 252 114 144 124 104 237
4704 237 118 100 58 137 108 110 193 107 177 128 118 90 84 111 54 38 112 102 152 62 128 48 235 179 144 277 261 177 175 134 57 62 79 196 204
4294 204 28 179 154 73 47 82 170 227 167 189 49 115 121 119 178 137 39 115 36 44 72 237 214 118 231 27 208 102 105 216 84 40
3918 40 62 164 101 3 70 171 82 55 102 88 160 180 235 70 210 142 95 145 226 51 265 243 140 113 185 67 235 214 75 84 199
3554 199 30 78 89 112 88 145 99 59 184 220 190 178 152 126 43 163 129 43 164 175 152 25 274 205 97 32 191 257 121 59
3202 59 130 36 226 166 28 56 131 56 143 200 154 144 60 141 130 64 96 127 29 84 129 118 54 120 148 73 216 41 201 257 293 231 182
2815 182 71 242 326 160 200 136 161 127 16 31 130 89 282 182 124 106 178 312 204 118 63 193 334 60 29 151 142 142 48 179
2462 179 161 90 100 48 143 331 122 73 64 114 142 128 175 136 168 110 208 144 178 221 297 139 186 181 333 108 56 215 276 67 113 250
2087 250 174 94 120 152 136 245 253 97 106 255 291 145 75 142 62 36 182 137 108 233 118 91 80 60 161 77 29 21 114 101 68 110
1711 110 122 148 122 56 156 106 60 90 113 36 77 71 147 53 111 87 148 77 113 250 190 96 127 58 221 244 155 15 163 228 114 6
1336 6 105 214 187 196 211 143 120 16 61 156 73 28 129 257 232 170 52 128 194 56 30 124 154 53 142 139 172 189 38 117 162 182 102
948 102 92 173 316 193 241 299 206 87 144 267 278 243 196 244 235 132 53 109 234 154 155 240 163 116 147 243 262 173 179 201 168 104 110 128
549 128 163 206 125 171 36 88 57 141 157 91 96 84 167 194 292 198 84 37 217 149 56 36 142 98 230 136 194 168 22 167 86 186
174 186 300 293 264 172 112 173 208 213 218 140 89 192 142 87 171 70 32 78 39 97 35 109 273 105 289 254 125 152 170 56 158
-190A58
##PAGE=	F1=12693.9
##FIRST=	25169.313707327481097,	5807.6787752999953227,	0.45170649886131286621
##DATA TABLE=	(F2++(Y..Y)), PROFILE
5808 131 61 186 108 42 128 32 165 180 173 147 69 127 308 231 164 54 197 254 149 21 126 185 133 29 157 35 264 179 49
5467 49 82 50 109 221 313 180 95 47 175 227 18 44 234 88 72 145 144 48 231 154 104 99 176 184 324 231 196 74 44 115 92 84 119
5080 119 168 143 64 179 128 120 171 137 15 43 64 161 290 150 109 214 173 132 106 86 109 31 20 21 75 184 254 115 81 159 129 216
4704 216 130 65 29 138 81 97 173 60 149 116 107 114 128 151 95 14 89 102 100 62 88 3 264 205 167 241 260 161 156 162 66 67 53 148 203 46
4282 46 190 192 98 102 128 178 229 179 175 16 144 110 94 171 131 30 112 5 47 63 247 212 94 185 65 175 116 85 241 56 78
3918 78 71 172 93 40 48 213 138 29 58 93 78 179 185 40 235 152 65 124 227 48 316 282 136 152 202 80 209 181 49 118
3566 118 187 37 111 165 102 121 164 76 76 227 162 246 200 95 115 62 159 94 56 131 154 168 18 263 221 107 42 181 213 115 79 167
3190 167 53 185 145 92 40 103 70 120 170 164 145 102 162 129 26 87 129 8 52 84 93 41 104 151 68 183 19 200 238 278 227 168
2815 168 68 253 315 125 248 121 158 130 74 96 83 81 283 148 118 70 196 343 182 56 71 192 321 59 34 123 141 144 28
2474 28 166 179 69 48 98 109 283 137 57 51 134 134 110 168 117 171 63 213 185 183 230 306 142 168 209 348 89 93 242 289 66 134
2099 134 322 198 128 148 163 121 198 246 68 145 273 286 181 73 127 59 17 191 144 75 202 97 86 47 72 144 54 74 47 120
1746 120 109 20 87 122 158 153 54 158 141 91 123 141 50 113 74 130 102 90 19 81 103 138 196 165 88 145 73 244 277 132 31 145 213
1359 213 107 71 111 236 195 207 213 155 159 7 48 119 59 39 113 226 220 181 74 130 207 55 40 137 136 71 191 174 176 193 10 94 137
972 137 171 158 111 185 326 215 205 261 172 106 163 281 259 200 194 285 263 144 48 103 216 123 166 272 183 78 124 251 319 212 173
608 173 236 208 132 123 112 155 210 128 125 45 106 100 96 155 121 90 52 137 221 254 186 103 79 236 178 89 28 139 100 180 116 126 136 42 150 67
185 67 163 313 372 294 172 131 180 202 166 207 189 59 232 180 99 144 76 67 81 78 111 83 96 276 129 358 269 134 196 177 74 163
-190A63
##PAGE=	F1=12591.6
##FIRST=	25169.313707327481097,	5807.6787752999953227,	0.40954354405403137207
##DATA TABLE=	(F2++(Y..Y)), PROFILE
5808 101 71 160 101 48 104 10 219 212 169 132 67 130 299 215 129 30 155 186 117 10 87 163 151 44 190 37 222 156 94 97 85 144
5432 144 244 360 182 107 57 184 193 44 39 268 64 95 116 134 59 296 176 132 132 162 159 296 240 258 154 14 125 85 81 111 170
5068 170 166 56 145 114 135 157 167 16 113 104 145 251 94 119 227 129 140 124 102 145 26 26 9 74 164 253 135 82 184 144 176 119
4693 119 73 9 127 73 79 142 9 121 100 94 153 148 162 127 37 62 97 55 86 98 46 273 214 173 207 265 152 151 183 55 75 43 90 184
4294 184 67 204 222 150 151 156 178 216 180 152 60 135 81 67 177 104 5 117 53 70 54 245 203 58 117 91 115 115 77 262 56 123
3918 123 84 195 74 83 69 228 180 22 43 94 17 183 136 32 230 151 33 78 208 42 332 287 128 184 192 93 170 150 70 158
3566 158 170 51 123 208 96 137 166 31 100 233 110 289 214 45 114 116 153 75 70 101 126 168 42 223 213 107 72 145 159 114 145
3202 145 182 83 152 120 149 88 69 112 129 161 176 146 130 165 124 40 75 120 38 63 38 63 40 89 157 63 140 74 189 184 226 207 149 64 247
2791 247 283 102 288 125 157 116 123 162 51 62 265 98 133 37 175 340 154 29 68 188 287 53 50 92 127 160 49 173 187
2451 187 81 8 139 110 228 132 31 49 156 137 107 163 97 163 3 192 204 176 227 279 135 130 216 334 86 110 255 290 65
2110 65 131 366 207 168 189 177 105 145 236 45 170 249 231 201 74 118 61 43 192 150 46 161 73 90 29 92 128 89 109 60 140
1746 140 105 71 57 125 163 175 77 153 177 139 129 133 110 160 80 117 132 76 49 18 139 158 125 140 104 180 83 242 281 93 74 147 181 85
1347 85 123 120 248 198 202 207 155 184 35 53 109 75 33 106 188 190 182 98 147 219 81 53 143 107 99 228 173 184 182 23 85 145 164 191 124 180
925 180 302 213 152 222 141 113 180 277 242 143 173 319 275 131 42 105 196 97 162 289 178 49 100 232 366 250 167 243 233 160 115
561 115 100 150 184 116 80 46 125 140 57 163 140 72 40 107 232 195 157 130 118 228 182 139 83 133 139 145 93 49 107 76 152 67 118 317
162 317 420 312 161 129 183 203 134 185 209 36 256 227 132 140 75 89 82 100 148 121 90 256 160 410 258 127 226 164 95 166
-190A66
##PAGE=	F1=12489.3
##FIRST=	25169.313707327481097,	5807.6787752999953227,	0.23028145730495452881
##DATA TABLE=	(F2++(Y..Y)), PROFILE
5808 121 122 144 120 61 75 3 243 237 182 110 62 133 273 190 89 26 76 124 113 20 42 138 173 81 204 59 163 130 147 119 133 190 257
5420 257 384 162 113 63 178 149 87 57 285 32 95 78 109 73 353 193 154 153 130 123 240 224 301 229 32 121 64 80 93 164 157 67
5045 67 118 107 150 134 168 16 178 157 117 188 55 102 215 85 128 160 131 181 13 45 9 84 128 251 153 102 179 145 123 93 105 50
4669 50 105 78 78 107 40 98 83 82 194 144 148 147 76 35 85 31 116 151 89 254 199 155 187 269 155 157 189 29 87 54 54 157 74 216 233
4258 233 205 183 158 164 187 168 122 82 98 44 79 184 71 42 126 101 99 49 226 194 29 44 98 50 104 93 275 74 163 100 223 51
3883 51 113 116 213 195 17 86 87 62 192 93 19 194 138 28 32 171 37 321 257 115 197 162 106 132 124 94 187 162 69 117 208 88 132
3495 132 149 24 124 205 76 302 219 58 126 167 147 69 83 76 103 157 84 167 185 123 109 90 107 117 202 180 111 137 100 190 137 61 173
3108 173 168 184 194 142 146 149 113 73 70 99 60 67 8 30 65 74 152 43 104 112 159 100 142 178 132 59 221 233 117 314 138 157 96 162 218 50
2685 50 46 231 40 143 47 132 312 131 72 61 183 242 50 66 73 114 185 81 190 187 121 41 162 133 176 112 3 55 167 147 107
2322 107 156 84 145 64 155 202 161 204 220 120 88 203 290 90 108 254 274 72 103 374 195 191 229 186 87 131 231 28 177 193
1970 193 146 202 76 103 66 81 180 150 32 120 57 94 64 108 119 155 120 60 177 87 118 31 124 164 190 114 139 200 191 113 104 181 193 89
1570 89 100 138 79 78 36 182 169 55 103 129 213 100 217 253 46 124 173 137 49 157 129 248 198 187 198 141 193 71 82 141 109 44
1195 44 111 148 151 168 121 181 229 103 64 138 82 107 242 139 187 166 37 87 196 165 192 114 159 253 189 93 196 116 106 183 257 217 84
807 84 135 332 261 92 64 121 178 85 148 288 155 60 71 189 398 280 160 224 239 184 85 82 138 133 100 56 45 133 162 57 173 148
432 148 58 43 80 216 120 109 161 143 205 169 205 144 125 189 138 68 33 84 101 160 94 73 312 428 315 144 99 182 211 121 156 201 33
45 33 259 274 180 163 75 88 75 105 184 146 79 213 185 432 232 106 234 134 115 173
-190A73
##PAGE=	F1=12387.1
##FIRST=	25169.313707327481097,	5807.6787752999953227,	0.2869109809398651123
##DATA TABLE=	(F2++(Y..Y)), PROFILE
5808 189 184 143 156 75 54 16 230 244 200 105 74 131 239 171 52 60 51 129 132 44 18 119 192 124 198 83 113 110 182 133 177 236 260 383
5409 383 127 120 58 149 95 112 82 279 34 69 35 82 94 384 201 170 157 92 85 159 189 316 284 67 100 37 95 69 130 109 101 99 114
5021 114 166 104 136 25 226 213 91 113 59 61 183 65 94 203 176 213 33 56 38 108 83 246 157 96 135 132 66 71 121 95 84 77 104
4634 104 75 84 84 66 73 218 119 127 153 114 15 65 46 140 209 123 206 157 125 180 256 167 165 175 8 100 68 64 131 65 223 222 249 197 130 133 147
4200 147 140 86 85 63 20 121 186 92 104 127 138 121 52 189 186 26 22 90 58 90 113 271 99 194 119 246 32 122 161 179 181 10 136
3812 136 72 91 194 60 7 135 118 65 54 124 51 294 203 96 186 128 115 106 104 106 195 167 92 109 167 72 109 113 77 142 153 69 283 216
3413 216 98 135 194 141 65 92 52 93 139 127 123 143 153 139 45 75 124 237 171 128 138 92 213 178 107 236 211 220 217 133 153 118 99 93 90
$$ [...]
-190B4
##END NTUPLES=	nD NMR SPECTRUM
##END=	
##END=	
