##TITLE=	Oct20-2021.53.ser
TM-VI-104 Mg+Ph-pyrraz. hsqc

##JCAMP-DX=	6.0	$$ MestReNova 14.3.0-30573
##DATA TYPE=	LINK
##BLOCK_ID=	1
##BLOCKS=	2    
##ORIGIN=	Mestrelab Research S.L.
##OWNER=	hrzepa
##$MNOVA/LINK_BLOCK_TYPE=	ITEM	$$ NMR Spectrum
##$MNOVA/ITEM/POLYGON=	(XY..XY)
5321,5835
8722,5835
8722,8208
5321,8208
5321,5835
##$MNOVA/ITEM/Z=	0
##$MNOVA/ITEM/ANGLE=	0
##TITLE=	Oct20-2021.53.ser
##JCAMP-DX=	6.0	$$ MestReNova 14.3.0-30573
##BLOCK_ID=	2
##DATA TYPE=	MNOVA NMR VIEW DATA
##DATA CLASS=	MNOVA VIEW DATA
##$MNOVA/2D/THRESHOLD=	5.1901068687438964844
##$MNOVA/ITEM/ZOOM/X=	-0.97334353289575425983,	15.004620000063303209
##$MNOVA/ITEM/ZOOM/Y=	-9.4973415065619892772,	229.94100000033026276
##END=	
##TITLE=	Oct20-2021.53.ser
##JCAMP-DX=	6.0	$$ MestReNova 14.3.0-30573
##BLOCK_ID=	3
##DATA TYPE=	nD NMR SPECTRUM
##DATA CLASS=	NTUPLES
##NUMDIM=	2
##ORIGIN=	Bruker BioSpin GmbH
##OWNER=	nmr
##.OBSERVE FREQUENCY=	400.41280287000000726
##.OBSERVE NUCLEUS=	^1H
##.SOLVENT NAME=	Acetone
##.PULSE SEQUENCE=	hsqcedetgpsisp2.3
##LONGDATE=	2021/10/20 21:34:00.000
##.ACQUISITIONMODE=	SIMULTANEOUS (DQD)
##$ORIGINAL FORMAT=	Bruker XWIN-NMR
##$MNOVA/SCALES_VERSION=	9
##$PARAMETER FILE=	(acqu2s, ASCII, /private/var/folders/f6/rjf_tdyn2v98c5c0wvkgn4s80000gn/T/HzzMdmD6Ry2hqxW6Pa+xOg/53/acqu2s, 0)
$$ ##TITLE= Parameter file, TOPSPIN		Version 3.2
$$ ##JCAMPDX= 5.0
$$ ##DATATYPE= Parameter Values
$$ ##NPOINTS= 221	$$ modification sequence number
$$ ##ORIGIN= Bruker BioSpin GmbH
$$ ##OWNER= nmr
$$ $$ 2021-10-20 22:21:03.765 +0100  nmr@CZC10666PP
$$ $$ /opt/topspin/data/agmb/nmr/Oct20-2021/53/acqu2s
$$ $$ process /opt/topspin3.2/prog/mod/go
$$ ##$ACQT0= 0
$$ ##$BF1= 100.683175
$$ ##$FnMODE= 6
$$ ##$NUC1= <13C>
$$ ##$NusJSP= 0
$$ ##$NusT2= 1
$$ ##$NusTD= 220
$$ ##$O1= 11073.8951120055
$$ ##$SFO1= 100.694248895112
$$ ##$SW= 239.880525819715
$$ ##$SW_h= 24154.5893719807
$$ ##$TD= 220
$$ ##END=
$$ 
##$PARAMETER FILE=	(acqus, ASCII, /private/var/folders/f6/rjf_tdyn2v98c5c0wvkgn4s80000gn/T/HzzMdmD6Ry2hqxW6Pa+xOg/53/acqus, 0)
$$ ##TITLE= Parameter file, TOPSPIN		Version 3.2
$$ ##JCAMPDX= 5.0
$$ ##DATATYPE= Parameter Values
$$ ##NPOINTS= 12	$$ modification sequence number
$$ ##ORIGIN= Bruker BioSpin GmbH
$$ ##OWNER= nmr
$$ $$ 2021-10-20 22:21:08.313 +0100  nmr@CZC10666PP
$$ $$ /opt/topspin/data/agmb/nmr/Oct20-2021/53/acqus
$$ $$ process /opt/topspin3.2/prog/mod/shimcntl
$$ ##$ACQT0= 0
$$ ##$AMP= (0..31)
$$ 100 100 100 100 100 100 100 100 100 100 100 100 100 100 100 100 100 100
$$ 100 100 100 100 100 100 100 100 100 100 100 100 100 100
$$ ##$AMPCOIL= (0..19)
$$ 0 0 0 0 0 0 0 0 0 0 0 0 0 0 0 0 0 0 0 0
$$ ##$ANAVPT= -1
$$ ##$AQSEQ= 0
$$ ##$AQ_mod= 3
$$ ##$AUNM= <au_zg>
$$ ##$AUTOPOS= <52 >
$$ ##$BF1= 400.41
$$ ##$BF2= 100.683175
$$ ##$BF3= 400.41
$$ ##$BF4= 400.41
$$ ##$BF5= 400.41
$$ ##$BF6= 400.41
$$ ##$BF7= 400.41
$$ ##$BF8= 400.41
$$ ##$BYTORDA= 0
$$ ##$CAGPARS= (0..11)
$$ 0 0 0 0 0 0 0 0 0 0 0 0
$$ ##$CFDGTYP= 0
$$ ##$CFRGTYP= 9
$$ ##$CHEMSTR= <none>
$$ ##$CNST= (0..63)
$$ [...]
$$ 0 0 0 0
$$ ##$ShimPowMaxUC= (0..63)
$$ 130000 130000 130000 130000 130000 130000 130000 130000 130000 130000 130000
$$ 130000 130000 130000 130000 130000 130000 130000 130000 130000 0 0 0 0
$$ 0 0 0 0 0 0 0 0 0 0 0 0 0 0 0 0 0 0 0 0 0 0 0 0 0 0 0 0 0 0 0 0 0 0 0 0
$$ 0 0 0 0
$$ ##$ShimPowMaxUG= (0..63)
$$ 524287 524287 524287 524287 524287 524287 524287 524287 524287 524287 524287
$$ 524287 524287 524287 524287 524287 524287 524287 524287 524287 0 0 0 0
$$ 0 0 0 0 0 0 0 0 0 0 0 0 0 0 0 0 0 0 0 0 0 0 0 0 0 0 0 0 0 0 0 0 0 0 0 0
$$ 0 0 0 0
$$ ##$ShimPowRcbType= 3
$$ ##$ShimPowRes= (0..63)
$$ 1e-20 1e-20 1e-20 1e-20 1e-20 1e-20 1e-20 1e-20 1e-20 1e-20 1e-20 1e-20
$$ 1e-20 1e-20 1e-20 1e-20 1e-20 1e-20 1e-20 1e-20 0 0 0 0 0 0 0 0 0 0 0 0
$$ 0 0 0 0 0 0 0 0 0 0 0 0 0 0 0 0 0 0 0 0 0 0 0 0 0 0 0 0 0 0 0 0
$$ ##$ShimPowRng0= (0..63)
$$ 1 1 1 1 1 1 1 1 1 1 1 1 1 1 1 1 1 1 1 1 0 0 0 0 0 0 0 0 0 0 0 0 0 0 0 0
$$ 0 0 0 0 0 0 0 0 0 0 0 0 0 0 0 0 0 0 0 0 0 0 0 0 0 0 0 0
$$ ##$ShimPowRng1= (0..63)
$$ 1 1 1 1 1 1 1 1 1 1 1 1 1 1 1 1 1 1 1 1 0 0 0 0 0 0 0 0 0 0 0 0 0 0 0 0
$$ 0 0 0 0 0 0 0 0 0 0 0 0 0 0 0 0 0 0 0 0 0 0 0 0 0 0 0 0
$$ ##$ShimPowRng2= (0..63)
$$ 1 1 1 1 1 1 1 1 1 1 1 1 1 1 1 1 1 1 1 1 0 0 0 0 0 0 0 0 0 0 0 0 0 0 0 0
$$ 0 0 0 0 0 0 0 0 0 0 0 0 0 0 0 0 0 0 0 0 0 0 0 0 0 0 0 0
$$ ##$ShimPowRng3= (0..63)
$$ 1 1 1 1 1 1 1 1 1 1 1 1 1 1 1 1 1 1 1 1 0 0 0 0 0 0 0 0 0 0 0 0 0 0 0 0
$$ 0 0 0 0 0 0 0 0 0 0 0 0 0 0 0 0 0 0 0 0 0 0 0 0 0 0 0 0
$$ ##$ShimSysFunc= (0..63)
$$ 1 2 3 4 5 7 9 11 15 16 8 10 12 14 6 17 13 18 19 20 0 0 0 0 0 0 0 0 0 0
$$ 0 0 0 0 0 0 0 0 0 0 0 0 0 0 0 0 0 0 0 0 0 0 0 0 0 0 0 0 0 0 0 0 0 0
$$ ##$ShimSysMatrix= 0
$$ ##$ShimSysType= 1
$$ ##$TFXNUM= 0
$$ ##$TRIPLO2= 0
$$ ##$VTU= 2
$$ ##$VTUETH= <149.236.99.20>
$$ ##$VTUTY= <no>
$$ ##$WBREFAM= (0..15)
$$ 135 116 100 100 100 100 100 100 100 100 100 100 100 100 100 100
$$ ##$WBREFLM= (0..15)
$$ 0 0 0 0 0 0 0 0 0 0 0 0 0 0 0 0
$$ ##$WBREFPH= (0..15)
$$ 71.66 -68.25 0 0 0 0 0 0 0 0 0 0 0 0 0 0
$$ ##$WBSGU= (0..15)
$$ 0 0 0 0 0 0 0 0 0 0 0 0 0 0 0 0
$$ ##$XFAC= 2
$$ ##END=
$$ 
##$DECIM=	3120
##$DSPFVS=	20
##.ACQUISITIONSCHEME=	ECHO-ANTIECHO
##NTUPLES=	nD NMR SPECTRUM
##VAR_NAME=	FREQUENCY1,	FREQUENCY2,	SPECTRUM
##SYMBOL=	F1,	F2,	Y
##.NUCLEUS=	13C,	1H
##.OBSERVE FREQUENCY=	100.69424889511199694,	400.41280287000000726
##VAR_TYPE=	INDEPENDENT,	INDEPENDENT,	DEPENDENT
##VAR_FORM=	AFFN,	AFFN,	ASDF
##VAR_DIM=	512,	512,	262144
##UNITS=	HZ,	HZ,	ARBITRARY UNITS
##FIRST=	23151.189942674980557,	6007.9998942000029274,	-0.057890526950359344482
##LAST=	-956.22249693857020247,	-389.73648400514491641,	-0.16706675291061401367
##MIN=	-956.22249693857020247,	-389.73648400514491641,	-16.552267074584960938
##MAX=	23151.189942674980557,	6007.9998942000029274,	54.10158538818359375
##FACTOR=	1,	1,	0.0051389038015703146847
##PAGE=	F1=23151.2
##FIRST=	23151.189942674980557,	6007.9998942000029274,	-0.057890526950359344482
##DATA TABLE=	(F2++(Y..Y)), PROFILE
$$ [...]
##PAGE=	F1=-18175.8
##FIRST=	23151.189942674980557,	6007.9998942000029274,	0
##DATA TABLE=	(F2++(Y..Y)), PROFILE
4781i9j0J89q0j02J34K6j14l5J39q5o5J05j7r6J29o9P9n4O8k9J1J8j17J48p4o0P3j13Q4N9
4405D3m3o7J50k7j81J18j3L5M4j5n0o3LP1N2m9K8q0N4r7J58O1j70n8j08J30Q0O1p5p4L8j8
4005f2N8lPk3o0J30N0j77J50j2K7l0j87N6Q8j00K11p2o5k7J38k16K24j06q0N0no5L3qlo0J28
3592a1N6k8m7K7L6o9n3J21j0J19r6J07j18K9j41m9K25j15O7o9M3p0K08j82m0J14j16O1O8r6
3216b9N5M5m7m5q6J38N8k8K9j00O7l1j38j8R4J20j36L7n7l6K04L6j66P4j52N8Q%P1p5Oo0K02
2803I8N8n1k3Q6o3m8p0J5o7J01R3j2j44J41p3o7p1P0k5Q2j9K3m1M%j1K6K3j3M6N8K8r2K7j51
2365f2j18J05N8j4l5J4K6K6r7L3J22Q8k54N3R7p4O3j29O4J09r6p5R2P3m3O8r5j35N5Q3o5J1
1964e2M0J45j36pO6m9J7O5j14n8J31o1P5j58jJ39q8N6r1m5J73m4N1j54M2K25q7J1r2%n3J46
$$ plain form
4781 -99 -109 80 0 -102 32 58 -56 -91 48 -37 -102 3 -14 -110 19 -50 29 -25 43 14 25 43 -74 74 0 -60 13 -100 -16 43
4405 43 0 -67 83 56 -125 -7 -20 15 59 44 -6 -69 -66 5 57 8 36 -44 10 -87 71 132 -38 -96 -204 -74 6 67 -8 -82 -44 -62
4005 -62 -4 -7 0 -23 -83 47 97 -80 70 58 85 55 -132 -76 12 -88 123 51 -14 -41 97 -119 105 -1 -81 -31 -36 -101 -68 -76 -79 -139 -11
3592 -11 45 17 -30 -3 33 -36 -89 32 22 141 45 152 34 63 -78 -127 98 -17 50 -19 24 -46 162 -20 -60 54 -62 -1 67 -29
3216 -29 26 71 24 -21 -107 31 89 61 90 -10 57 26 -112 -130 -36 84 -52 -15 -72 -108 96 132 -34 40 -112 -54 -46 -46 25 -50 -44 -104 98
2803 98 156 105 82 168 105 57 -13 2 -65 36 129 117 -27 114 41 -26 -97 -27 -52 30 11 34 -7 -3 -3 -14 12 35 22 68 126 154 62 89 -62
2365 -62 -180 -75 -17 -31 -66 -52 -26 0 -97 -64 58 146 -108 -55 42 -32 31 -98 -34 75 -21 -96 -4 69 26 94 -1 -136 -81 2 -63 -52
1964 -52 -12 133 -3 -10 56 7 24 89 -25 -83 48 -13 62 -96 -97 42 -46 10 -81 -126 47 3 54 -100 -58 167 80 91 -1 -1 -54 92
1563I2Oq3pJ5j1j0Q3nj62Q5qkJ07j4N5j25m0L8n7K4PJ5J06j35J7rM0J48r8m4n3K0k3R7j04
1125c5j18J95j10K2P7j39J29K7l3n7l9R8J9j20J02m3L3r8J08J6l8K7P9M7k7rRk67K9P0O8L4
725E6J4N2j26J9l0nm7J17p6J1J1J2Qj14J04m3L5m3l9J75k1o1R9m4j04M0J69m6q6L1k1L6q1
311Bn6o2P3m4J54J2lK5q4mN5j28L7P4M4j70J09mk4Q7j13K5K0j75J50k5Q6n5K1o8Q4J0p3mP4
-127E0L8j80k3M4j6k8L6M2L4o5J02l2J09r0j3L8q4j5j2J9O2
$$ plain form
1563 92 98 15 8 23 12 2 85 80 -82 3 -5 -7 100 86 141 16 -24 14 -43 -19 -12 3 109 -26 -9 -18 22 170 72 28 -25 -5 -28 69 -35
1125 -35 -153 42 -68 -46 31 -108 21 48 15 -42 -81 17 36 -84 18 -25 8 -90 18 34 -4 23 102 149 122 113 122 -145 -116 -46 22 56
725 56 70 122 -4 15 -15 -20 -67 50 -26 -15 -4 8 16 -98 6 -37 -2 -45 -84 91 70 9 108 64 -40 0 169 123 37 68 47 83 2
311 2 -54 -116 -43 -87 67 79 76 101 17 13 68 -60 -23 51 95 -75 34 30 6 93 -20 5 25 -150 0 -25 61 6 27 -41 43 53 -20 -24 50
-127 50 88 -92 -115 -71 -87 -115 -79 -37 -3 -68 34 2 111 21 8 46 -38 -53 -65 -46 16
-390A6
##PAGE=	F1=-18270.2
##FIRST=	23151.189942674980557,	6007.9998942000029274,	0
##DATA TABLE=	(F2++(Y..Y)), PROFILE
6008b3J2m2pL7n2K5L4K9M8o9l3P1j3Mq7k1J08J44j92J2p5L9L2k7J08q6KL0K4j76J07lN5O3
5582G8%q5n7K01M3j09j19R5J30o9k11k1J03KP8q7K2O6j26LJ33q1RN5o9O3P0o8O8k17J02J82
5182A84m8j37n3L4l4n9J04J5j57L3J61Mk32J42Np6J38p7m3J02O8m9P5p9j31J18Q3Kj91P3q6
4794a11M1m9J63n1o9J04%j11mJ47o1j00Q3Oj16J61j14P9j7M3J4K8k1j10J31o6m2Q8j83J03
4418c4Q4r4j3P5O1k21J25LM0Nk2Ok2l6M0O4o1N7o4M8j09J41K8j31n0q9P4J39P4j29p1L5kN1
3992Bo5M3M1r6J25M0k01J64K7J4o1j59J05Mk6J63m4q4k0J07j42J38j02j9qK5n9O0l5l1j9R9
3592a4O4n3l4K5K0l6J7L6l8J35o9R9r7qq8l2J94j25P8j24M7j3K08k39RP1o4O2Q1j72L5R8l4
3178C9l8j12J30K4k3R8r2L5m4q5n8J11P2j05M1n4l5J82K1j57Q3j12N4k5n0J02j12N9m1J60
$$ plain form
6008 -23 -11 -53 -60 -23 -75 -50 -16 13 61 -8 -41 30 17 21 -66 -87 21 165 -27 -15 -90 -51 -19 -46 62 -24 -22 8 32 -144 -37 -40 15 78
5582 78 78 -7 -64 137 180 71 -48 47 177 108 -103 -124 -21 -19 59 -28 -6 60 -66 -63 70 -11 -2 53 -16 47 117 49 117 -100 2 184
5182 184 136 -1 -54 -20 -54 -113 -9 6 -151 -118 43 47 -185 -43 -38 -114 24 -53 -96 6 74 25 100 21 -110 8 91 93 -98 -25 -111
4794 -111 -70 -119 44 -7 -76 28 28 -83 -87 60 -1 -101 -18 -12 -128 33 -81 -2 -19 24 38 66 45 -65 66 0 -42 46 -137 -34
4418 -34 50 -44 -57 18 79 -142 -17 -14 26 31 9 15 -7 -43 -3 61 0 57 -7 41 -68 73 101 -30 -80 -169 -95 44 118 -11 -82 -47 -49 2
3992 2 -63 -20 21 -75 50 90 -111 53 80 94 33 -126 -21 -17 -43 120 76 -8 -28 79 -63 75 -27 -46 -54 -29 -88 -28 -63 -94 -113 -14
3592 -14 50 -3 -37 -12 8 -28 -11 25 -13 122 53 152 55 47 -41 -73 121 -4 74 -50 -3 -16 192 -47 -38 33 -31 31 112 -60 -25 73 39
3178 39 1 -111 19 43 20 118 26 61 17 -68 -126 -15 57 -48 -7 -61 -96 86 107 -50 33 -79 -25 -50 -100 2 -110 -51 -92 68
2803F8R2o5j9P6q3k9p1K2l2J26LM6j46J11o6q7m4O0o8J36Lm0KJ1k4jk7M1P0jO0O6j00J6j69
2365f3j47J04Q6m2J2J5J7ol4ON4J14j97L6J28p4L9j41P6Q1q5r3P6J12o4N2m8j40K1R6j1l9
1964e9L9J42j35j2N4j6LQ6j32n1J36n3M7j33j8J57p9ll0p5J91r4J07j38NJ79o4M8m5k8k9R8
1563I8L1j92R3rK6k6R2m6j56Q0J4l0R2L7M9r1o6J1l9O9j6KJ18j52RML6J15q9m8l2j5j8J43
1138I4j63o5J71j18j2J22j04Q5M9No1o8N6N0j04N6m6M2r6J24K1p3P3P8mLn7N1k69Q3J6O0M2
725D1L0M7p2j6n3J9o7Q3j2J0L7m8L6j29R4j1K4p7jJ47l2l1J01m0j15L5J43k8j04M4p9O9j00
311e5j4m2N0J9J08k0KJ4nl9M0j42M7R4J7j29R6k3k2Q4p4K4nj07R3j6P5q8Ol4J03j4o2QM4M8
-139H1k12nQ0j6n1M3O9P6j45J10m6J46j10m6M3r9N3l5K9K5
$$ plain form
2803 68 160 95 76 152 69 40 -31 -9 -41 85 88 134 -12 99 33 -54 -98 -38 -106 30 33 -7 -5 6 -18 -19 -46 -5 65 64 124 190 90 106 -63
2365 -63 -210 -106 -20 -62 -50 -35 -18 -24 -58 -52 2 116 -81 -45 83 9 48 -93 -17 64 -21 -114 -38 74 10 62 14 -126 -105 -9 -20 -59
1964 -59 -20 122 -13 -25 29 13 16 102 -30 -81 55 2 49 -84 -102 55 -24 -27 -57 -132 59 -35 72 -66 -61 118 54 102 57 29 0 98
1563 98 129 -63 30 21 47 21 113 67 -89 -9 5 -25 67 104 153 62 -4 7 -32 37 21 23 141 -11 -2 2 38 153 64 16 -16 -31 -49 94
1138 94 -69 -134 37 -81 -93 29 -75 10 59 64 3 -65 -9 41 -63 -7 -53 -11 -107 17 38 -35 38 116 112 115 58 109 -160 -77 -61 -1 41
725 41 71 118 46 30 -23 -4 -71 12 0 10 47 -1 35 -94 0 -11 13 -64 -65 82 50 19 120 80 -35 0 143 115 11 55 -24 45 -55
311 -55 -69 -111 -61 -42 66 46 48 62 57 18 58 -84 -37 57 74 -55 41 18 -4 80 6 30 25 -82 11 -5 70 -18 -12 -46 57 43 -19 -11 33 81
-139 81 -131 -136 -56 -72 -123 -80 -11 65 -80 30 -16 130 20 -26 17 -82 -29 -64 -35 -10
-390a0
##PAGE=	F1=-18364.5
##FIRST=	23151.189942674980557,	6007.9998942000029274,	0
##DATA TABLE=	(F2++(Y..Y)), PROFILE
6008a8L4n2k0K8j2MM4l0N3n8J2P6k9j6p6k5J09J67k10N1q0L7K3k7P3p4QJ0N3j67M1P7PM4L2
5570H9o8j03K67k8p6j10Q9J24n5k12oJ3J7J02q7P0M3j15j0J22q7N1J0l1LO6o5O4j97J24J70
5182A74n2j51k9O3o4p6J09M8j64M0J50pk55J43M6j32J43n1NO1Q4l6J1k8j04P4O8J9k14J19
4806fj21J00o5J06j3m4N4k9q3K3J51k1j15L5Jj07J75j46O4L7K3K9N5n5r2R8m9j5Q2k16Q1J25
4405F2j42K6J0J55k35R6L4J6j4rL8K6r1L2N1p8R3n4N9j24J18j1r5k8n4K9J83N4j41p9L1LL5
3992dr9O8R7r3Q9lj70J45O1j4o7j29J43o0N0Q0j1q8rP1n3M6j05M2l4O6r0O6m5l2L3M4M2n7
3567b0j4K8%k0R1m2o3J20KO3p3m1j7l1J45j05R2j78N2J5J84k43N0K2k0O0P2k03J1J34j3m0
3166A8j18J13k2PJ39j09J5l8rr9J07J8n4K4n9jJ32Oj25Q2q1N7p2n6J05j28P9rJ21J12p8j8
$$ plain form
6008 -18 16 -36 -56 -28 -40 -36 8 -22 31 -27 -15 61 32 16 -60 -85 24 191 -19 32 -48 -11 12 -15 58 -16 -8 2 55 -112 -71 6 13 57 89
5570 89 21 -82 185 157 81 -29 60 184 129 -83 -89 -76 -59 43 -44 26 69 -46 -56 66 -21 30 40 9 12 78 13 77 -120 4 174
5182 174 122 -29 -58 5 -59 -135 -26 22 -142 -102 48 41 -214 -71 -25 -157 -14 -65 -60 1 85 49 60 32 -72 2 70 89 -125 -6
4806 -6 -127 -27 -92 14 1 -43 11 -18 -101 -78 73 52 -63 -28 -27 -134 41 -105 -41 -4 19 48 103 48 -44 54 5 -10 72 -144 -63 62
4405 62 -80 -54 -44 111 -124 -28 6 22 8 -1 37 63 -28 4 55 -23 70 16 75 -49 69 58 -37 -65 -119 -90 93 147 6 -73 -42 -39 -4
3992 -4 -103 -35 62 -31 58 55 -115 30 91 77 10 -119 24 -36 14 94 83 -5 -14 57 4 50 -55 -13 -47 19 -71 -5 -50 -82 -49 -5 37 -20
3567 -20 -34 -6 -6 -26 65 23 -40 80 82 145 72 31 14 -17 128 23 115 -63 -11 4 188 -55 -5 17 -3 57 129 -74 -63 71 58 18
3166 18 -100 13 -9 -2 137 28 43 5 -4 -103 4 22 -32 -8 -67 -68 64 70 -55 27 -54 3 -69 -125 -20 -148 -69 -78 43 155 77 59
2765E9M9r0Qq3M2j7J25n2R3j44P7l3j19kK9q2J62K1p5K8J5l6J4q3P0J48q0N6J00j11J8j74
2365f7j21P4P5l6M0K7qj6K9n1KJ34j33L3J37n8j2j18Q1L0o3j05O2J40p9K5mj28j0J21K8q9
1964f0O0R9j59K0N5j4NQ7j21l6J26o1K8q6k8J47n7m1K9j01J60j27J51r5l2J09j9O4l3l3LO4
1563A04L5k81J66j5N7l5J06r3j45P1M2o0N0J07M0o2q7Jl0R7j6j5J07j28k2K0M4O6q0l5qn2
1163e1rJ58j91MJ29j24m5J56p2PR7N1n9r6NQ6r6J5k8M5p4J05M9j05Q2J00o2Oq3Q3k19J19l5
750e2M2K0O4M6k5n1p2O2r9L4N6RN6r0L2j12Q1K4j8p5J3R5j9mJ01l6j18M3Q7Kr9K4j12R3j05
311a03K5j5J9P3M7m6J6K1M1o5K4j45O6R7j1p6N9rm1Q1l6J7k2j8JJ0M8j06OJ3R2m8k6J4J1N6
-139G0k15mJ08j8o4N0Q7R8j80R2n9J71j17q0M6q8R3n0N2j4
$$ plain form
2765 59 108 18 26 -57 -15 -32 93 41 134 -10 67 34 -85 -87 -58 -140 22 43 -32 -4 11 -25 -11 -94 -24 124 44 100 200 89 107 -67
2365 -67 -188 -114 -39 -75 -35 -8 -16 -32 -3 -54 -52 82 -51 -18 119 61 49 -69 12 42 -21 -126 -64 76 -3 22 18 -110 -120 1 29 -60
1964 -60 0 99 -60 -40 15 1 6 93 -28 -64 62 1 29 -57 -85 62 5 -36 -7 -108 52 -75 76 -19 -51 58 39 103 70 37 40 104
1563 104 139 -142 24 9 66 31 137 44 -101 -30 12 -48 2 109 149 87 0 1 -29 68 52 37 144 16 -6 14 58 124 44 9 1 -51
1163 -51 -60 98 -93 -89 40 -84 -129 27 -45 -38 59 110 51 -45 -40 46 -50 -35 -63 -18 -92 13 62 -43 39 139 77 83 0 83 -136 -17 -52
750 -52 -10 10 74 120 95 44 -28 34 -65 -31 25 34 90 0 32 -80 1 25 7 -68 -55 40 21 17 118 82 -36 7 94 96 -3 21 -91 2 -103
311 -103 -78 -93 -74 -1 46 0 16 37 78 13 37 -108 -42 55 44 -32 27 18 -23 58 22 39 17 -1 0 10 58 -48 -42 -29 63 15 -11 3 14 70
-139 70 -145 -149 -41 -59 -123 -73 14 112 -68 24 -35 136 19 -61 -15 -103 -10 -60 -8 -22
-390b2
##PAGE=	F1=-18458.9
##FIRST=	23151.189942674980557,	6007.9998942000029274,	0
##DATA TABLE=	(F2++(Y..Y)), PROFILE
6008hN8p2j7PJ4k7Q6r5L7j3N3N6k5n3m8j5R7J56k01Q1q3M3LOjm6K2l6R0j29k6J31m2J6O0l9
5557D0j14K72r4j4j07P2J03j7j88Pp9M1R4o3J09Pr1j2P1n5P4j6po6N5j6L3j71J33J45o1j37
5157e2pQ2q7o5J06M1j24K4J16pk31J12O4j35J15k8O8J5P8k2m2K0q2O0M7J1k36J72j19J28n1
4769b9M1J5l7pm2m9M1J52K4j17k0k0q3J72j57M3R3J8MO3n0p6O1k2MP1k21M2J71j79M3k4K19
4355A44k28M4P8k6j9K2M1N7j39M2K7r6J16l6Q2j38R3l8q8PkoK00Qr8r6J7mK8r8N7J33n0L3
3930F7o1r2Q8Q0m9m1j12J67q9J09k2K1p5JM3K8j7j24Q7k6J08j44O1m6MO2j3Om8JM5k7k0J40
3504A12r2p3Q2R2Pn3o1N1l9R4p6J15k09N6QJ36j96O8opO7M0j87j3J54Nn4r7Q6o1M0J59j46
3091BOj2O0j30Q3k0Jj9o6N9Q2j7p3O4o2O6j24j2Q1j16O2K8Q6J09q1k2J5q6O2r7N4j7R7o0J21
$$ plain form
6008 -8 50 -22 -39 -32 -18 -45 41 -54 -17 -30 23 79 54 1 -47 -62 35 191 -10 71 -12 31 34 40 39 -7 15 -21 69 -60 -86 45 3 19 79 40
5557 40 -74 198 104 90 -17 55 158 141 -47 -40 -119 -78 16 -47 62 69 -22 -34 37 -18 56 40 33 -33 22 6 39 -132 1 146 85 -52
5157 -52 -59 23 -64 -129 -23 18 -106 -82 34 27 -204 -92 -28 -163 -48 -76 -8 7 85 63 21 41 -41 19 66 77 -159 13 -106 22 -29
4769 -29 12 27 -10 -17 -59 -108 -67 85 109 -8 -28 -48 -131 41 -116 -73 20 38 42 105 55 -21 40 18 22 93 -128 -86 85 -94 -51 -75 144
4355 144 -84 -40 38 12 -7 15 56 113 -26 16 43 -53 63 27 109 -29 64 26 -62 -55 -57 -63 137 145 47 -49 -32 -36 -8 -106 -49 84 34 67
3930 67 6 -86 2 82 33 -8 -120 47 -42 67 45 66 -9 -8 35 63 46 -78 9 -17 91 -53 8 -38 -34 28 15 21 -27 -26 19 -8 -28 112
3504 112 20 -53 29 121 128 75 14 65 26 120 44 159 -50 6 14 150 -46 22 16 9 76 116 -71 -84 70 75 21 -76 10 -51 -11 148 2
3091 2 8 -4 56 -74 9 -11 -10 -29 -95 -36 46 29 -44 20 -42 24 -100 -112 -31 -147 -85 -57 29 138 57 35 50 -36 26 -71 -17 -34 63 3 124
2653A24j28K8K4j37J3j5n7J60L4p0K0J0l2K8j14J02J86j61N0J17j20K4j57n4L6K2J0L2L9l0
2277a6j1P0j05k7J39p6M7J21m1o1p0O5k3l1r9N0J44r0j4L1q9m2J53M6j23R5L4k03P8O3l2R
1876hP3r1j7J02p1K0j9l2R9j8n2O1j03Q4j31J63l4o4L9M1O2o6j6K6N5L0l22J89lP1m4J32j36
1463B0j27N2N7o7kJ65K2l4r6Ok8R1Ql5P6o1o2K7N4J8o9j7K2p4j1J48j86P1P8j11p7J60m5q7
1038a14J64R1n9j13k9J10j07%j1N4l9N8Q8j16M5J19j10No3R7j60J30o6K3j7J01L7J5p5q9J08
649G7j37j9J05K0N9r0Kp0N3M7n4n1pM8J4%J11m0j06N0L2K6p9j2j10J06j08M8J9pR1om6K9L0
211B5M4o0Rj49R7Q8l8l5L2K0p5P1j%k4N4p6M2J4j10K1N1M5o6J5K3j2M6j89lJ12k0o5M9Q5R7
-239A17j56M9o0J83j12j06N1o7J01o2Q6m0
$$ plain form
2653 124 -4 24 48 -89 -76 -91 -148 12 46 -24 -4 6 -26 2 -112 -10 176 15 65 182 62 86 -71 -125 -89 -67 -57 -25 14 -16
2277 -16 -27 43 -62 -89 50 -26 21 142 101 40 -30 35 12 -19 -118 -68 76 -14 -28 3 -86 -128 25 71 -52 43 77 -126 -48 15 -17 -8
1876 -8 65 -26 -43 59 -12 8 -11 -43 56 38 -14 47 -56 28 -103 60 26 -38 1 42 104 38 22 48 103 133 -189 0 -3 68 24 156 20
1463 20 -107 -55 2 -65 -67 98 120 86 -10 -4 -32 59 67 32 108 47 -15 12 66 84 15 -2 20 -54 -65 83 -103 -32 46 -65 -142 18 -27 -114
1038 -114 50 141 82 -31 -60 50 -57 -57 -68 -14 -53 5 93 -23 22 141 31 36 -27 70 -90 40 -26 -3 -20 81 118 133 58 -31 77
649 77 -60 -79 26 46 105 15 17 -53 0 47 -7 -58 -65 -17 -3 -3 108 68 -38 12 44 70 -9 -21 -131 -25 -133 -85 -66 -73 18 12 -34 -5 25
211 25 69 9 18 -131 -34 54 16 -19 13 33 -42 29 28 28 4 58 -18 24 38 -72 -51 0 45 -21 -6 17 5 51 -138 -141 -29 -49 -114 -65 20 117
-239 117 -39 10 -50 133 21 -85 -34 -101 0 -62 24 -16
-390a6
##PAGE=	F1=-18553.2
##FIRST=	23151.189942674980557,	6007.9998942000029274,	0
##DATA TABLE=	(F2++(Y..Y)), PROFILE
6008@Q7r9j1j7K5o3J46j43LN6Q3J3%r7k2J6Q4J23j79Q4q2M7j9O5q9j3M0r4J25p8o6J39q4l
5582b3Q2k5p9K24j53O1j07N3P9K7j52J2j37O4N7j5J12k5n2rQk1P8j1j2j12M5O0j1j62J29J29
5182A14p0r7OP2r5k7Q9J0n3qN9J3j77N7P4j04P2j2J12qM7j2o0N1o9Q1J3k1k44K15j00J42k2
4769D8rJ5l8o3l0k9N2J42O2j15n7l4o9J60j48K9J37K3n1L9Kp3M1pJ5O9k15K5J88j99M7k0K24
4355A61k02j5J27o6k0O1J9N5j56N6Qj03J04jJ06j43O8m5j07N1M7l3J85m6j3j13j1j0M1p4P
3967f2J46J4k7j10JJ5Q0p5Mj14J83r2J45j21M3m6J0K0Q3l7j53J09PJ30j86N4m6O7M6m9k6m5
3567c2RP6o0k6J49j06o0M2J61n4l5o9R3l3N4p4J54k12O0j6O4j15O3pk2Q6oj41k9J55K0q3n2
3153d6M9p7O1J64j78pK7R2j35M9m0M7o4p7J28M7m3j9K8m9P6j59M8M0p1K1N5N8P6o4k4j5q0
$$ plain form
6008 0 87 -12 -23 -40 -15 -78 68 -75 -72 -16 67 80 80 -17 -39 -23 61 184 5 89 7 54 35 100 11 -2 38 -56 69 -9 -75 64 -20 -23
5582 -23 59 34 -45 179 26 87 -20 33 112 139 -13 -1 -138 -74 -17 -32 80 55 3 -6 2 -19 59 48 36 -76 -31 29 18 -144 -15 114
5182 114 44 -53 -47 25 -70 -97 -8 2 -51 -59 0 13 -164 -107 -33 -137 -65 -77 35 27 74 62 2 53 -16 65 78 57 -187 28 -72 70 48
4769 48 39 54 16 -47 -77 -106 -54 88 150 35 -22 -56 -125 35 -113 -84 53 76 25 64 66 -7 34 27 42 111 -104 -79 109 -90 -43 -63 161
4355 161 -41 -56 71 5 -15 46 65 120 -36 20 28 -75 29 28 134 -9 59 14 -93 -42 5 -28 157 111 98 -15 -26 -36 5 -69 -62
3967 -62 84 98 71 -39 -38 -23 57 -18 -14 -128 55 -37 108 -13 30 -16 -6 14 97 60 -93 16 23 153 -33 21 -25 42 88 39 13 -32
3567 -32 -23 53 -7 -33 116 10 -50 -8 153 99 64 -5 88 55 109 35 189 -23 37 21 85 -30 33 26 4 90 84 -57 -86 69 89 6 -46
3153 -46 3 -74 -13 151 -27 -34 -7 85 -50 -1 -41 6 -58 -135 -7 40 -3 -22 6 -43 33 -126 -78 -38 -109 -88 -33 25 101 37 13 -2 -82
2740h2J23j04M0j2M9l0J23q6m1R3j29j9n0j3J44M4m0j9Mj8K9j06J31J65k12M8J10j14J6j18
2365g4K3J0m5O9%L9l5qQ0j19l5J21l5P3Q5l7q3j6J9n1Np2M2J15r0o6O2l3p3J70N5j32J22k5
1939F1k40J35O4n4RN1n3nP5p4K9M9l1K1K6l9O1p9oj13J43K5r1mR5N3j21J3K9O0K7l07J62J8
1513a1P1n4J61j61r8J6N7m4n5J99qrr3K4k8N4M4n8L0L1q9L0L7j3m9LM2o9k6J20j49J17K9q0
1088b9r3J27k1j71K20J18o3j15k9J06j32J9j5O7JJJ23r8k3J17j23PKQ3j27J20p5J2m7J24J8
700A04N3q8j01J37j63o5J21M6M3n8k1k3JM9n4k7m7K3N9k2J28m9q0M5jL7o1l7q8J03j08N6M9
286c9k2O9k4k0L3J7K4k1mj59J25Q1o1j4K9L5j02N3L0k4j2Q5j01O5j9j05M3O4k4n8M9L1j7J5
-139B2j37QQ6j9n7L5O2Q0r1ol7J82r8j18N7n8Q6o9J23n6
$$ plain form
2740 -82 41 -63 -23 -35 14 -16 107 21 -20 73 -56 -75 -125 -138 6 50 10 -9 -5 -23 6 -100 31 196 -16 32 142 28 44 -74
2365 -74 -51 -41 -86 -17 -17 22 -13 -21 59 -60 -95 26 -9 64 149 112 29 13 32 -19 -14 -86 -44 71 -19 -85 -23 -56 -129 41 96 -36 86 61
1939 61 -179 -44 20 -34 -25 26 -27 -32 43 -31 -2 47 16 37 63 24 85 6 0 -113 30 55 -36 -40 55 108 -13 0 29 89 116 -191 -29 -11
1513 -11 60 6 167 6 -92 -76 -19 -63 -118 81 73 64 -29 -5 -33 21 65 7 37 68 -21 9 46 33 -16 -13 29 -40 -66 54 -95 22 51 -29
1088 -29 -122 5 -16 -187 33 151 88 -27 -56 50 -82 -63 -78 -11 -10 -9 114 16 -7 110 -13 -6 -4 79 -48 72 -3 9 -38 86 104
700 104 157 69 -32 105 -58 -123 -2 44 87 29 8 -15 -14 35 -19 -46 -93 -70 -11 -33 95 46 -34 11 10 47 -14 -51 -139 -36 -144 -88 -39
286 -39 -61 8 -16 -36 -3 14 38 17 13 -146 -21 60 -1 -15 14 49 -53 0 30 6 -6 79 -22 43 24 -81 -38 26 2 -56 -7 24 7 22
-139 22 -115 -107 -21 -40 -97 -62 0 80 -11 -17 -54 128 30 -88 -31 -89 -3 -72 51 -5
-390e
##PAGE=	F1=-18647.6
##FIRST=	23151.189942674980557,	6007.9998942000029274,	0
##DATA TABLE=	(F2++(Y..Y)), PROFILE
6008AJ16j17j9l5L1r7J97j57l6J24J02m1L0j32j0N5Q8Q0j50O2q2M0k9J19j58J8N0j39J41l3
5632A9o3J04j11mR8m1j4J55j99J18j02M5N9N9j23Pj35P3RM6O8l9%j2l8rO5Rl8j18M1J37m6
5219B0j70J07J33p2m4J0K5q7L0N0j0K3n1pM6j05j1Q9p5M1j0J23j0Qom3O0n9J20l4n9k26K27
4806C3q1J51Nl1ql4r7ml2N5J17Q4j10o1l1p2J45j30L1J54K9j05j1P7q3M9j6J5Q3k08N1J52
4405A17j94M8J0J68j60o4J67r1k1Q8qK3j32O3Nr3N2M3J13j25M8l8j38J02P1n4J41q4Q0j25
4030A2l9j2P7n0n6J40O5p8j23O4m3P3q3M8j21J89q9J62j99N2oJ6mJ07k5j74J11M7J15j92N1
3642C5m6J31j0n1m2o2J0J12r0k4J20r0l0K2J80j07j4o4R6oL7j20J97j82N9k4k5l5M9Nm7J18
3241A02n6q9k8J35L5j17kMo3O7J55j86l1O7P9j11K4m5P3q4r9J87L0p1K9k3l3P7j55P9kLj9
$$ plain form
6008 1 117 0 -19 -54 -23 -120 77 -80 -116 8 110 69 99 -33 -43 12 100 180 30 92 10 50 21 140 -18 0 50 -89 52 19
5632 19 -44 60 -51 -55 43 2 -12 143 -56 62 -40 5 64 123 0 7 -128 -55 -46 0 68 29 29 17 -21 -30 35 44 6 -112 -71 66 20
5219 20 -150 -43 90 18 -26 -16 9 -78 -48 2 -8 15 -36 -43 3 -102 -113 -24 -99 -58 -68 55 45 53 47 4 64 5 125 91 32 -194 33
4806 33 -48 103 108 77 69 35 -62 -66 -98 -43 74 158 48 -13 -44 -116 29 -101 -70 84 113 8 -3 74 -9 40 24 39 122 -86 -35 117
4405 117 -77 -29 -19 149 -11 -75 92 1 -20 68 60 83 -49 14 19 -74 -22 21 134 9 57 19 -119 -17 54 0 141 57 137 12
4030 12 -27 -39 38 -12 -68 72 137 59 -64 0 -43 30 -53 -5 -126 63 -26 136 -63 -11 -17 -1 -5 102 77 -97 14 61 176 -16 35
3642 35 -11 120 110 59 17 -45 -35 77 -13 -37 83 -7 -37 -15 165 58 44 -20 76 70 107 -13 184 2 61 37 12 -23 26 31 -16 102
3241 102 46 -43 -71 64 99 -18 -20 -16 -79 -12 143 -43 -74 -7 72 -39 -15 -60 13 -71 -170 17 47 -24 5 -18 -51 26 -129 -50 -52 -49 -68
2828f8N5L7K0k8j4m3o5J64r3nJ1jJ4R8j4j28J51r7q1n6K2J21N2kp5PJOo0J58Q9k12M7Q3q6
2390Hj9o6Q6Kr1J05l5K1j4k2O1p1l5Q5k1J00N0n0p2K9n1m3L3k8L9N7p3j14Q3K4j01J55P1j19
1964a6J27o3k43J68M8o2KK8j8mN2o3M6J04k8o2N6j3L6l9p9q5J09N5j10qJ24M9j67M9J1O2K6
1551I2k48J11L7O3o1J72j57o1l9N5lr2K04m8J0q5N4k5OO8q1j3J12r2M1k2j6k2K5L3l9l8P8
1138A9q7J30j3m1q5P5lk22K38J37p6j01MO7j53O5n1Q2L2n2J45n4r8J05r2nQ0N2j25R4p2J9
737A4m8J24j2Q5q6j11J47j62j04J02Q2J1j6j5J1o8L3j6j5p9K4J03n3J31n5m9K8oL4n2l9o2
336a19Q0r3M4P1l4K0NK4K5k8J0L3j6j62J21R3p8kL7J6r8L5N0m1%P2o5O9n0r4O1M9p7l6O8K8
-114A8ok0p6L1L8j4m7OL3N6j9n9K1J66q7j04M9n9O0o5J38o6
$$ plain form
2828 -68 -13 24 44 16 2 -41 -106 58 -35 -40 -29 -30 -16 82 68 -60 91 -6 -87 -143 -121 0 52 50 -25 -18 -17 -11 -71 87 176 -36 11 94 8
2390 8 -11 -77 9 11 -80 25 -10 11 -3 -25 36 -35 -70 15 -6 94 144 94 22 51 0 -43 -10 -38 1 58 -15 -129 -46 -22 -123 32 103 -16
1964 -16 111 48 -195 -27 21 -41 -39 -11 -29 -33 19 -44 2 106 78 16 72 59 95 56 -23 -108 1 56 -54 -62 62 111 -56 -7 4 66 92
1551 92 -156 -45 -8 55 -6 166 9 -52 -91 -36 -39 -131 73 25 35 -50 4 -21 -15 53 -28 -41 71 -21 20 -2 -18 -40 -15 18 -21 -59 19
1138 19 -68 62 49 8 -77 -2 -5 -227 11 148 72 -29 -25 42 -111 -46 -97 -15 17 -35 110 56 -42 63 -29 -34 46 98 -27 67 -5 14
737 14 -34 90 78 163 77 -34 113 -49 -153 -51 31 42 26 11 22 -46 -13 -29 -44 -123 -99 4 -49 82 27 -22 6 0 34 -18 -57 -119
336 -119 -39 -132 -88 -17 -51 -31 -26 -2 23 -5 5 38 22 -140 -19 74 -4 -6 31 47 -51 -16 34 -7 -7 65 0 69 19 -75 -14 35 -42 -78 -10 18
-114 18 12 -8 -84 -53 -15 -29 -76 -70 -37 19 0 -59 -38 128 41 -63 -14 -73 -13 -78 60 -6
-390f
##PAGE=	F1=-18741.9
##FIRST=	23151.189942674980557,	6007.9998942000029274,	0
##DATA TABLE=	(F2++(Y..Y)), PROFILE
6008eJ28j06m5l8L3j20K16j30o5J67J10q8M2j40j4P9J16L8j18L0r2L1k2J37j87N2M0j57J26
5645A8mk4N0j14RR9p6N2R9k28J37r0O1L6O9r9j4p8O9k6R4ol8N3j4o2j9L5K2o0q9M9J86o0j78
5207a41P1J44o3J0J0m9o6Q4%mQ1r7n8P7l0p5J06p1L9k7J08qk0%j2O0m3J47q4q2j78K00p1J58
4781A16Mk4k5k0j02J4n3N3Q2Q4j01m0pq1J24j09M8J37K7j27o6J39j03Q9m8QR9j90J04O5j64
4393f7N2M7Q0j11q9J80j01k0R3k6k1p5O5J5o5l3Q7Q8p9M0l4j60J56N7o3Q0r3J44j24o0j0J20
3992G3m2r4J22Q3j11r0O0n3P1p7O8j08J74r0J66k42M5L8J6l7J16mj71R9P7O5j63M8l9J71p5
3604I6k1n3r0RJ36j05oP1o7RL6J36j37Rm5O1L6M3k04K24j21N0kj11J2M3J0o5J51r3n1oR9M7
3178A01j35K7m5k1O0J35j66n4Q6L8o6J8m2P0o1j24K20J8q9O8q8lN6j03O2m5R3l7K3K8m1J1
$$ plain form
6008 -5 123 17 -28 -66 -33 -153 63 -67 -132 35 145 57 99 -41 -55 24 140 178 60 90 -2 29 7 144 -43 9 49 -108 18
5645 18 14 -10 40 -74 -65 34 -42 10 109 -119 18 -72 -11 25 94 -5 -19 -97 -28 -54 40 34 -4 49 35 -27 -46 -11 11 -49 -138 -89 97 37 -141
5207 -141 -70 74 11 21 31 -18 -84 0 0 -4 77 -20 -78 -1 -31 -106 0 -71 -32 -59 49 41 21 21 9 69 26 173 89 7 -171 29 -42 116
4781 116 120 96 71 51 -51 -37 -90 -37 45 129 28 -12 -19 -100 24 -85 -37 100 127 0 -66 73 -30 59 11 19 118 -72 32 97 -67
4393 -67 -15 32 112 1 -88 92 -9 -29 64 38 17 -58 7 22 -43 -76 11 99 20 60 26 -134 22 79 16 96 3 147 23 -37 -47 73
3992 73 31 -63 59 142 31 -59 1 -52 19 -58 10 -98 76 -14 152 -90 -45 -7 9 -28 88 84 -87 12 89 154 -9 39 0 171 96
3604 96 75 22 -68 -59 77 -28 -34 37 -30 -21 15 151 14 23 -22 39 75 118 -86 138 17 67 65 -46 -34 9 19 -46 105 12 -39 -45 54 101
3178 101 -34 -7 -52 -73 -13 122 -44 -98 -12 26 -40 -22 -64 6 -55 -179 41 59 -30 38 -50 -53 3 -100 -38 -83 10 -27 -4 24 -17 -6
2778fRo9m0J64o1o2M8m2N9N1O7k02J72o0j31l1K7R5N5K8j25K6J6l8OJ85k1j56M0M6l8q0j1
2365g9J28Mr0Q9n2j1K1m7L1J4l3M8l8J19K5o9m3N6j19mL8K5L4rm2j33Q1O3j17J03J03r8J09
1952A07p0k05J67J2m3j0NQj3L8m2P2J22k2j24N9J8Jqj06o0Q5M3j19K1J18N6j78P8k2N0K2j67
1538a07O5M6N5n9J53j27j6j09O4L4j11J93q8K2q5Q8j6k8O6r4m6J56p8P1j12J0MN1j3Jl0L1
1138ij9J10m5mn6K6Lk29K10J50r4p2M6Rj56J14j06J03M3r3J50j0j45J01m1k8J34J9j40O3p0
750c6M8k1J02l8R8o8j23J42j28j35O6J13l1J3J4K6j25nL7kq5M4J15o5J08m9k4J1RK3n1j7n0
336h4M0n1J2P8m9l1P2O3J1r8L2O4k4j45P6J25q6J4L1l1n7J7O1m1OL2jN8p7q0P1J9r2k4P9J0
-114@J1m4j8N2j3nm2k7J8K8L2r5J02J30q9n8J8n3L2m6J16p3
$$ plain form
2778 -6 3 -66 -106 58 -3 -65 -17 -59 0 51 118 -84 88 28 -103 -134 -107 -12 43 71 -54 -28 -12 -50 -44 141 120 -36 4 50 12 -68 -79
2365 -79 49 53 -37 52 0 -11 10 -37 -6 8 -25 23 -15 104 129 60 17 73 -46 -50 -12 13 47 38 -4 -137 -56 7 -110 -7 96 -2 107
1952 107 37 -168 -1 11 -32 -42 -37 -29 -42 -4 -46 26 148 126 2 61 79 80 72 -34 -94 -9 34 -85 -64 54 110 -68 10 -12 38 60 -107
1538 -107 -42 4 59 0 153 26 10 -99 -35 -1 -112 81 -7 15 -70 18 2 -26 40 -54 -100 56 -22 49 -63 -53 -49 2 -11 -10 -40 -9
1138 -9 -28 82 37 33 -23 3 6 -223 -13 137 43 -29 17 26 -130 -16 -122 -19 24 -69 81 71 -74 27 -14 -42 92 111 -29 34 -36
750 -36 12 -9 93 55 153 85 -38 104 -24 -159 -93 20 -11 2 16 42 -83 -88 -51 -53 -138 -94 21 -44 64 15 -9 2 11 34 -17 -34 -84
336 -84 -44 -95 -83 -5 -54 -85 -13 50 61 -37 -5 59 35 -110 -34 91 5 19 50 19 -38 -21 40 -1 5 37 36 94 17 -63 8 27 -65 -89 -10 0
-114 0 11 -33 -51 1 -12 -17 -59 -86 -68 -40 -8 -103 -1 129 40 -18 0 -53 -21 -67 49 -24
-390b4
##PAGE=	F1=-18836.3
##FIRST=	23151.189942674980557,	6007.9998942000029274,	0
##DATA TABLE=	(F2++(Y..Y)), PROFILE
6008a8J20o2q0k6K3j21J94p2p4J71J10j12K3j20j9P0J58Kq1Oj19L1MJ08j77Q5J6j48Q5RK9
5620A5lr2K5Q2j09J04O6k30J10p1R1J1O0p9m8QO0l8J17q0l7R9j2o6l7rJ3o2m0O3J96n1j69
5207a13L3J33l9N9J2j32l6J19n0K5J12j42o8Q3L9j16J07q6O0n9Q7k2k4NRO5j6J41j18p8j11
4819a21J35n5J50l0%o%r0Pp5N1M8N7q0j4J9o7R5r2O4R5J8j06r9J57j21J41p9mJ01j56J51l6
4405E8j24O0P8j0o1q4J56j08j1Q4l1n8mO7K3k7j17J15K6qM4m6j61K06J3n8K1p8J58j10o0j7
4005f4J59n9q6J06O7j26k8nj3Q0o8O0o7J31r4J60k47L2O8J2p3J23J1j47Q7Q3Jj25M6k2J79
3617A81j11J7o9j05RJ26q8K2J9m9M5P2M5j34K1j2J2P1O0k89K18l7L5L6j68J3N1lo1J69j11
3229a5l0K8O1M8j20J8q1L2L5J18j36n3O8Ok5K3k8M2j0j37K19Nr0J02j50L4J1k2J5q8J76l2
$$ plain form
6008 -18 102 40 -40 -66 -43 -164 30 -42 -116 55 165 53 76 -44 -63 7 165 167 86 92 -27 4 8 116 -61 24 40 -108 -23 -14 15
5620 15 12 -80 -55 27 -82 22 88 -142 -32 -103 -12 -1 59 -20 -68 -60 0 -38 79 -1 -38 61 49 -17 -54 -63 -50 -112 -152 -89 107 56 -113
5207 -113 -80 53 14 73 85 -47 -83 36 -14 11 123 -19 -87 -4 35 -81 26 -60 0 -59 28 6 -18 -13 -4 61 45 186 68 -10 -121
4819 -121 14 -41 109 79 79 73 73 -17 -10 -85 -34 14 71 -9 -23 -4 -71 24 -68 -4 91 109 3 -96 61 -60 81 2 -2 99 -57 94 58
4405 58 -66 -6 72 62 1 -83 73 -35 -46 38 7 -51 -55 12 35 8 -109 6 32 24 68 22 -139 67 80 22 43 -35 123 13 -47 -64
4005 -64 95 36 -50 56 123 -3 -31 -36 -49 31 -37 23 -44 87 -7 153 -94 -62 6 18 -55 68 79 -68 19 102 103 -22 24 2 181
3617 181 70 87 18 -87 -78 48 -40 -18 1 -48 -3 69 114 -20 1 -11 1 72 132 -157 61 24 59 95 -73 -60 -9 -12 -73 96 -15
3229 -15 -45 -17 44 92 -28 -10 -91 -59 -24 94 -42 -95 -27 -21 -46 -23 -51 -9 -19 -156 63 68 -22 80 -70 -36 -25 -47 -32 -120 56 24
2828B4k8L2r6M0L6r3lJ20j6j04P5n7R5mJ29k33J47k9j50RPO5M8M1j46N5K3p7N7K15j33o2J9
2415FRJ6j44M0J49Nm8K1m1m9N6o2LR4l3K5p5J20J5q3j5O8j59M1J9P6J2n1nj13N1P9j20L2J37
1977G6q1Q1m7j43J37l2Pl2j2K4k7L3k5J00J01j2j48L1N0k6pq3m4Q2jj13N8Q9O8j51R4o3K7
1563A1J1q9M6M7M1m6J06p6L1j89R1M8j10J75j18L2j01J13%k8L7q9o2J50o5J18j94N8J5P3q6
1175e0M1kj3L4P0o3K1j9Lqj96J41J62j13k8P1m4j37J39j62J46K8j20J36J5j46J01ml8J43N
787A13j59L6p0R1K2O8n1P8l3j40J31o8j52K5J23p0K1M4K4j45n6P6L0o9O8O2l8Q1l2j2ML1R
374D2m3J1n7kJ4l7O7o2o5J40Q7oj58P9N1k2j05QJ65q6M2rq1MPO1k0Kj1N2L5r2o4P6np4m1R0
-102gj0J7m4J6O3m5Nn1m5K4JN2j02J72P9j11J6k6k4Lj9N8p5
$$ plain form
2828 24 -4 28 -68 -28 8 -85 -88 32 16 -88 -13 -70 25 21 150 -83 64 35 -115 -106 -99 -34 14 55 -91 -36 -13 -90 -33 182 49 -13 6
2415 6 15 31 -113 -73 76 81 33 54 13 -36 20 -42 -39 55 22 47 -28 92 107 24 9 77 -82 -41 -22 54 66 15 10 -103 -52 27 -93 -61 76
1977 76 -5 76 29 -114 23 -9 -2 -34 -46 -22 -49 -16 -41 59 160 148 0 31 81 55 48 -35 -79 3 2 -111 -53 36 104 -47 47 -16 11
1563 11 22 -67 -21 26 67 21 127 51 82 -107 -16 32 -78 97 -21 11 -90 23 23 -5 32 -57 -119 31 -34 84 -110 -52 -37 36 -50
1175 -50 -9 -11 -24 10 80 17 38 19 22 14 -182 -41 121 8 -20 51 7 -130 9 -153 -7 21 -99 37 52 -94 7 3 -35 108 113
787 113 -46 -10 -80 11 33 101 50 128 95 -45 86 18 -134 -109 14 -56 -35 9 33 -112 -168 -92 -62 -131 -63 -1 -39 42 10 -2 2 33 42
374 42 -1 10 -47 -49 -35 -72 -5 -67 -132 8 95 89 -69 10 61 39 -66 -58 107 21 63 54 -27 -23 -16 45 25 27 16 68 103 11 -53 23 18 -56 -97 -7
-102 -7 -17 0 -44 -28 35 -10 -5 -56 -101 -77 -76 -24 -126 46 125 14 30 4 -20 -17 -36 22 -53
-390e3
##PAGE=	F1=-18930.6
##FIRST=	23151.189942674980557,	6007.9998942000029274,	0
##DATA TABLE=	(F2++(Y..Y)), PROFILE
6008b8Q9Kj06pnj02J48rn8J35J09j09k1q3j0K7J94k9l9jj50L6M4M3j43J10j0j21L3J2P5m0
5607a4n6L5M7j16J33M8j98M6m5J19j8M2n1q1P8N5l3J14j28m4J31Ko6m5n6j4l7JP3J77l4j41
5207g6RQ4nJ02J4j99mJ35r0N6J17j79k9N7R1j22O9r2Q6r6Q1n7qlJ1Q6K1R7j17n6m2N0j6J17
4781I2q9K7N8J9r0k1p4N5K0J0n0LK5j6N3p2N7N0J5o1r6J31j29J74q1k5Q5j04J56j04r0O4R9
4368I1q0j9m8J04j25J1O9k2p8N5P5J7J4j71J21n3P0M9p6j44K41l4m0k7n3J29q4m5l0J82r2
3980Gm1R6L7j24K6r1N3R6o8L5oP2j04J45k17J4P7Lr5J34J7j14Q6O0m8j01M4jJ63j02L9q8q8
3567h4PP9l5M0j6m2O9J05o0j01J2L1k3Q4O9l32J73N8J5O1j75k7O8k7l9J64j10k0O2L4K9p1
3166bk2q9P6rJ15j15j5J1OmJ9MjL8j22J88j1p0J34j88O3n2N5k3j29K29j5p4M1j32N1M6j03
$$ plain form
6008 -28 61 63 -43 -50 -55 -157 -9 -18 -76 59 168 59 38 -45 -55 -28 166 137 98 97 -53 -17 27 70 -73 37 27 -94 -61 -49 26 -14
5607 -14 -70 -35 12 -104 29 77 -121 -75 -120 -1 -19 23 -28 -109 -31 24 -9 105 -23 -67 64 66 0 -45 -101 -115 -152 -151 -78 99 65 -76
5207 -76 -67 17 12 114 128 -71 -75 60 -30 26 143 -36 -65 -8 83 -39 30 -62 24 -72 9 -48 -56 -59 -48 38 59 156 39 -17 -59 -9 -25 92
4781 92 3 30 88 107 17 -4 -78 -23 -3 7 -43 -40 -15 -31 22 -50 7 57 72 11 -85 46 -83 91 10 -15 70 -34 122 18 -72 -8 91
4368 91 11 -8 -56 48 -77 -66 3 -19 -97 -42 33 50 64 -107 14 -39 31 80 4 -140 101 67 27 0 -53 76 -8 -53 -83 99 7
3980 7 -34 62 99 -25 1 -90 -37 59 -9 26 20 92 -12 133 -84 -70 7 10 -85 49 66 -48 38 98 50 -51 -7 -8 155 53 92 4 -84
3567 -84 -77 2 -33 7 -9 -51 18 123 63 -38 -26 5 -18 66 135 -197 -24 34 49 110 -65 -92 -24 -51 -90 74 -36 -56 6 40 69 -2
3166 -2 -24 -113 -37 -46 69 -46 -61 -50 -44 -48 -29 -25 -26 12 -110 78 67 -3 131 -57 6 -46 9 -14 -143 86 71 -3 38 -94 -43 3 -100
2753a00L9M7K6j13P9m5J17n2J58k07Q6j2j41M3k1M3K1L8j26P9J7q2O9K40k15L7j7j4M7j78
2377a37Q5J54JOp1j1q2P5m7j2J29l7K4j10J00J3q3KO2j52O8j8J18k7n5L2o9nP9j07k7J48p4
1964b8N8lq5J00p7Q6o8k4K6l1L3k5J27N3Kj45nP5l0l9l1l4R9n9r0P8N5P3j00R2r5Lml2M9M6
1513E0K3l1N4k3P0k63J26M6j03J57j32M8j30J22QJ1mo5o7J03n9J64k28J13NP9j56P7K4m5N5
1125B9K8o1L1J3Nl4j39O1J63j22K6N9o5j12J29j97K11mj28J06J1j04R2Kj9J14J7j81J5n6J32
737B2N7K9m0K4J8j65J17lj43j1J11r3RN2J7j28j03Q6Q9n2Q4o7K7Q5j1j8J3N1pk2L3q0k9P5
311B7q0L4o0p7J78Q9k0j80J28j2No3m2J88q5Q4p2j17O2KN5J3mm1O5Pq5m8Q1qm9q3J05j4J0
-127gl5K3N5m3J4p3l7M2j9N2q3J98J9j37R7p0L1k4kj2o6
$$ plain form
2753 -100 -61 -14 12 -101 -22 -67 50 -2 156 -51 35 23 -118 -75 -96 -53 -32 6 -120 -41 -24 -106 -37 203 -12 25 8 -6 41 -137
2377 -137 -52 102 103 109 38 27 -55 20 -27 -39 90 53 77 -33 67 80 -3 -1 61 -91 -23 -41 77 50 -5 27 -42 -47 32 -75 -102 46 -28
1964 -28 30 27 -58 42 -35 51 -17 -41 -15 -46 -13 -38 89 142 144 -1 -6 69 39 0 -31 -65 34 -25 -115 -37 18 91 -9 83 -12 -9 -13 -45 4 50
1513 50 73 42 96 73 143 -120 6 52 -51 106 -26 22 -108 14 22 33 29 -36 -103 0 -59 105 -123 -10 -5 74 -82 -5 19 -26 29
1125 29 57 -4 27 40 45 11 -128 -67 96 -26 0 59 -6 -118 11 -186 25 21 -107 -1 10 -94 -2 0 -19 95 112 -69 -54 -110 22
737 22 79 108 68 92 110 -55 62 59 -84 -95 16 -77 -68 -16 1 -127 -230 -144 -55 -107 -23 -90 -63 22 11 -7 6 57 50 28 61 -19 -48 27
311 27 -53 -19 -79 -156 22 111 91 -89 39 27 32 -31 -73 115 30 114 42 -75 -13 -11 44 57 53 12 77 84 -1 -49 32 24 -25 -108 -3 -17 -7
-127 -7 -42 -19 36 -7 7 -66 -103 -61 -80 -28 -111 87 106 -31 66 -4 27 3 1 -11 -77
-390g7
##PAGE=	F1=-19025
##FIRST=	23151.189942674980557,	6007.9998942000029274,	0
##DATA TABLE=	(F2++(Y..Y)), PROFILE
6008c1N0O2j14J0n5o3R8L7k3P3J11q6o8m3J4l2K03n2lPj63K9R3l2j01J13k4q8mJ2R0n1k0L1
5582b0Mr2J38L8j43k7j9J27m0L0j8r8J02N5k3R8j44n7J49K2o3m4q3m4LJ3P2J45k4j10J3OL4
5169@J35J1k32K0J42j19O9J11k05M6PJ18r3qo9J03j22R5j11K3k9pJ23N8L1q0l0J3l5M7O3j50
4769g5M1J48L4j17n4l7O6j0l6j8NON3Om4K6J9K5k4o1Q4j24J67m2n4N7m7J16j15p4O0J07j22
4355c4QJ2M0j43L9N3op7Q4Q2kM9j74J06j21J34L7j08j19K58o7j8n5l2P7n9j6l5J79j18NR2
3955G1J1j03M0j45J05J01p7K2N0J2j19J27j69mO6or4J41K1r1J01K2p2r4M5J6J35o1L9j02m0
3567e2MPL9L4k9l8P6J10j41m8k4P8l1P9N7l13R6J48mN3j34q5Q2m3j6J40r5oP9J7qro3o4R5
3128io6J30j07L8n7L9pj1N0l4N3p8J40k5l3J56j84P0j12R5l4j45K33mr8N0j49N4K5q4O8k3
$$ plain form
6008 -31 19 81 -33 -23 -78 -141 -43 -6 -29 44 155 69 1 -42 -28 -60 143 91 88 95 -68 -39 54 22 -79 34 10 -78 -82 -70 20 -31 -51 -20
5582 -20 -16 -108 30 68 -75 -102 -121 6 -34 -4 -22 -120 -18 37 14 112 -32 -89 60 82 19 -25 -108 -152 -149 -136 -64 81 57 -53 -40 -34 0
5169 0 135 146 -86 -66 76 -43 26 137 -68 -22 -15 103 10 2 -67 36 -86 9 -102 -79 -108 -115 8 66 97 17 -13 0 -35 12 75 -75
4769 -75 -34 114 148 31 -23 -60 6 -4 -40 -58 -53 -47 6 12 -32 -6 13 38 14 -47 37 -87 80 38 -16 41 -6 110 -5 -79 -19 88 -34
4355 -34 -26 -14 26 -117 -78 -25 -31 -108 -24 58 56 105 -69 37 -84 50 87 -21 -140 118 51 33 -22 -54 23 -36 -52 -87 92 -26 -21 71
3955 71 82 -21 19 -126 -21 80 3 25 75 87 -32 95 -74 -78 -12 -18 -112 29 50 -41 60 82 10 -84 -39 -23 112 51 90 -12 -52
3567 -52 -48 -41 -2 32 3 -35 41 151 10 -38 -62 16 -15 64 121 -192 -96 52 48 101 -33 -118 -36 -79 -95 45 -50 -56 23 40 32 23 -40 -104 -9
3128 -9 -75 55 -52 -14 -71 -32 -39 -50 0 -34 19 -59 81 56 23 179 -5 65 -47 48 14 -131 102 98 0 50 -99 -45 -20 -104 -36 -59
2728e9N2r3O1j2J19q2J56j42J8kj31O2l3L2k5K6p0Q3lm6M2K50k53J12o4j4M1j63J20J40%M0
2327A62j43J8j05P8nj6J18n0M3j25O0J6p2J0M3j04O6n9J45p0l1O5l1o6P3q0m9J23q1N4M6n4
1926b1P2j05J72j20l1J7k2L9m8J51JK1j35k8Q4pr0K7l2J19j07m7O6L0O6m7P3r8j8j8kO0M1
1513F3Ok5J9K5Q2l07J54L9r5J33j25P3j63J15mP6l3l5p3M2n6J90k04J59k0O2j94J12K5o3M1
1125A9jm1L4L0J7n7q3oJ45j11Q1Rm6r6R0j93K75l2j15N9ln0P2j7J6P8M5k10kj6J47P4nj4l9
687E4P2j94J02M2j02l9Q6r5qL7Rr6j25P3J54m2Q4k09Q2J27Ol7K4P3k9RM1j04l6J07r2j6l2
274g4p8J69P8k8j54J45r5N6m3l9J73q7J27j20j40R4PM0M7kn8M5k0o0l2Q9J1n1j17J18J1j4
-127bl1QL6j4K3j02oN7k7M8n1J68l7j45J55j01J01m1j0o7m9
$$ plain form
2728 -59 -7 -100 -39 -51 68 -14 142 0 18 16 -115 -53 -86 -54 -79 -53 -123 -40 -43 -89 -47 203 -50 62 -2 -16 25 -138 -18 122 122 162
2327 162 19 37 -68 10 5 -11 107 57 100 -25 35 51 -21 -11 32 -72 -6 -65 80 10 -21 44 13 -53 20 -60 -109 14 -67 -13 33 -21
1926 -21 51 -54 118 -2 -33 -16 -38 1 -47 104 105 126 -9 -37 47 40 -50 -23 -55 64 -43 -90 -24 6 72 25 98 0 -18 -36 -38 22 63
1513 63 69 44 63 88 170 -137 17 56 -39 94 -31 42 -121 -6 -10 66 33 -2 -75 -33 -89 101 -103 56 36 98 -96 16 41 -22 19
1125 19 18 -23 11 41 58 1 -82 -88 57 -54 27 36 -10 -106 -16 -209 66 34 -81 -22 -25 -75 -3 -20 -4 74 119 -91 -93 -109 38 112 107 93 54
687 54 126 -68 34 76 -26 -65 21 -74 -82 -45 -36 -132 -257 -184 -30 -72 12 -197 -115 12 18 -19 5 78 49 58 99 -5 -41 66 -26 -42 -74
274 -74 -152 17 95 67 -87 58 -37 19 -24 -63 110 23 150 30 -110 -16 -9 31 78 76 18 63 43 -17 -49 40 51 0 -117 1 12 -2
-127 -2 -33 -25 11 -3 20 -82 -88 -31 -58 -10 -61 107 70 -75 80 -21 80 39 29 -38 -87
-390h7
##PAGE=	F1=-19119.3
##FIRST=	23151.189942674980557,	6007.9998942000029274,	0
##DATA TABLE=	(F2++(Y..Y)), PROFILE
6008b9K5R6j07J5j13j2O4N4J7NJ18n5j00j4M2p3J72o1J0K5j43%J34q8o5R5k4n7j1J0O9l2k
5595c5J6l5m6J22L1q6q2LJ12m8K9J4r4Q2M9j1Q0j38p0J61L3n4l9p2o7L8pO3J11k8r7M6p0P5
5169a4J57qk23K9J44j34O1R7k18J32m6J15l7j00k1J04j21J20j68N4p1l3J69P5k4k7j4M4r2
4806e0J15Mj96L3K32L9j62o7K6P7n0n7Rkk9J03l9%j9OM7j1j4M7j15J21L0r2L4kO0r0p0N2R7
4368F7j35J7P4rj51P0K9Qn7P8Q1k7P5j32Q2j52J62%j26r1K55q1Jo4j8K5m9J7j0J44j16K4Q1
3955G2%o3Rj38J15Q4q5L5P7l0j39J14j17k8M6po7J26L2q5J25rp8r4M9K5R9j2K0j00K0Ko1J05
3529D2%j0l8O6Q4j74Mp3J17j8O8K4k35NK09j7J5o9j30Q9l5j2J06p2K1O9Jn1M5q0j7Q5j18J56
3103E7j06P1j07Q7k0o6R4m1L3k3R3l1J5J50j38N1j48Q7j7j24J88or9M8j42O0k5l4P7o5N3o1
$$ plain form
6008 -29 -4 92 -15 0 -113 -125 -61 -7 10 15 133 78 -22 -36 6 -67 105 44 54 79 -64 -64 70 -18 -83 12 -12 -69 -80 -70 -1 -33 -35
5595 -35 -19 -54 -100 22 53 -33 -115 -112 0 -48 -19 -5 -99 -17 32 21 101 -37 -107 54 87 33 -6 -78 -145 -107 -114 -51 60 32 -65 -19 -89 -14
5169 -14 143 135 -88 -59 85 -49 12 109 -109 23 -23 92 55 -45 -66 38 -83 37 -131 -77 -148 -181 -12 63 39 12 -2 42 -50
4806 -50 65 69 -127 -94 138 177 15 -52 -26 51 1 -56 -47 -49 -78 25 -14 -14 -33 -27 20 9 -5 42 -73 48 78 -14 20 18 78 -12 -82 -30 67
4368 67 -68 -51 23 14 -137 -67 -38 -30 -87 -9 72 45 120 -12 70 -82 80 80 -46 -137 118 37 38 -26 -44 -19 -68 -51 -61 83 -33 -9 72
3955 72 72 9 18 -120 -5 79 -6 29 106 76 -63 51 -66 -94 -48 -55 -122 4 36 -49 76 67 -11 -105 -56 -31 68 56 76 -24 -4 -2 -63 42
3529 42 42 32 -6 60 144 -30 -26 -99 18 0 68 92 -143 -138 71 54 69 0 -130 -41 -76 -88 18 -54 -33 36 37 -14 31 -49 -66 19 -99 57
3103 57 -49 22 -85 2 -18 -84 10 -31 2 -21 72 41 56 206 68 119 -29 58 41 -83 105 99 0 48 -94 -34 -59 -93 -16 -81 -28 -89
2703h9M0K7R9r4J34o9k9Qj39P1k2L0p2RPN5k5OlK35k42J40j04J3%j05J34J09J0L8j60L1j25
2290h2Q1M0j6Q1o6O4j13J7K4o3J4J6l8M3r3J52q9nR0j7j12P2n1l2P3r6O8Q0m9N9j11K36j69
1876Hm1NlM7q8J70l1M4j37k5O4L8j29O8l8J22j25OK4J8N2mM2o6k9k8JN9L2Ll2RN4O2l01J62
1426A3L9r1J02j03J00j81R7l9J39l4j7q3j0m2J89j48J87m4K2j86J49j1p2J7k5nL3M0K0o5m9
1038e8m1J10p5J15n7kr2L8j47L01l7q0jnj1N1m4M2N4O8k35k1M8J21P6k8J6q4J12k12Q4N7m3
624B0n8O3p9k2K0Jp9j21N5K05l4Q0k35N5J37J7n7K6R9n7L5L8j09l6R7n2p6J3p6J25O6k4r6
211e9J15j58J12n8K5J15r0J53j23j57R7J8J6P2Ro6J6m0k9j9J03M0q8j14J20N3m5m1rJ3J5L4
-189C0j19K7O2k6M7k1J03p8j11J65j22J59l9m4q0m1
$$ plain form
2703 -89 -49 -22 77 -17 117 48 19 27 -112 -41 -63 -33 -105 -96 -89 -34 -59 -53 -56 179 -63 77 -27 -14 -14 -119 15 124 134 172 12 43 -82
2290 -82 -1 39 23 104 38 102 -11 6 30 -33 -19 -3 -41 2 -91 61 -28 -33 57 40 -72 0 -51 -83 -10 -106 -38 42 -7 52 -59 177 8
1876 8 -33 -28 -31 16 -72 98 67 111 -26 -51 13 51 -78 -10 -48 74 -51 -45 -21 -3 49 45 87 21 -8 -36 -35 24 56 59 27 36 90 152 -149 13
1426 13 52 -39 63 -40 60 -121 -24 -63 76 42 25 -58 -68 -110 79 -69 118 74 96 -90 59 48 -24 -7 -32 -37 -4 36 56 -9 -58
1038 -58 -99 11 -64 51 -6 -8 -100 -62 -209 92 55 -25 -26 -31 -42 9 -35 7 61 129 -106 -127 -79 42 118 90 106 22 134 -78 6 63 20
624 20 -38 25 -54 -76 -56 -55 -134 -255 -200 5 -29 51 -184 -129 8 25 -32 -6 93 36 71 109 0 -36 61 9 -67 -54 -130 -5 61 37 -59
211 -59 56 -102 10 -48 -23 92 2 155 32 -125 -28 -10 6 78 87 21 37 -3 -32 -51 52 92 4 -110 10 63 18 -23 -32 -19 -4 30
-189 30 -89 -62 0 -26 21 0 103 25 -86 79 -43 116 77 33 -47 -88
-390h8
##PAGE=	F1=-19213.7
##FIRST=	23151.189942674980557,	6007.9998942000029274,	0
##DATA TABLE=	(F2++(Y..Y)), PROFILE
6008b9J9J05r7Qj57L9M8N0N2n3J22k3j13kO3p8J10n2mM5r4n0J58j16m1P4k6k2PJK3J2mlo2
5570i0NQ5L4n3j02K1P8l5M3K6p4M6K8kO9j29o9J68K5l4l9k4q5O2m4N5P2m2j03Q5j11J10J70
5157A46l9j82J8J41j35M9P2k17J99p9Q4K7j70K9R4r1J43k16P6j10n4K00O3m2J9k0N8j07J62
4794A18m3k15LK83L3k00n1Q6P7r1m1K8j2n8R8p2N7n3%O8j7K4L6j07N9J06j36L2J9K3o8o3M0
4380c7P5j13JJ11k5j34R0JQk8N2O1m2R0p4O2j37J45n4j19o4K40q3J2n6qk4n4N1M7Q3q1PN6
3955E9Qrm9q0P6N0q7P8O7n0j52J08p4n7L0Kk7Q6M6r1J46j4q7q8N4L1N8K1kq2N9J0r6J34m7
3517C1L6m6M6M0j61M3j10J36JO1k1j21q3K29j7l6j1j49R1Ol9P1m5O4L1k9q3Q2o5L2N9j49J83
3103G7j07N6j22J32k5j21J11k3jJ6O0k7O5J02o1J2j47M6Lo2J10j2r8L9j11O8p8L2O5o9M2m3
$$ plain form
6008 -29 -10 95 -2 6 -151 -112 -64 -14 38 -15 107 84 -29 -31 32 -46 64 12 8 53 -41 -91 67 -49 -90 -16 -42 -64 -57 -56 -33 -21 -25 -28 -90
5570 -90 -85 0 34 -19 -121 -100 -22 -57 -14 12 -62 -16 12 10 79 -50 -119 49 74 40 1 -23 -108 -46 -90 -35 37 -5 -108 -23 -134 -24 146
5157 146 107 -75 -57 84 -51 -2 70 -147 52 -27 57 84 -86 -57 37 -54 89 -127 -51 -161 -215 -15 48 6 25 5 63 -44 118
4794 118 75 -140 -137 146 179 -21 -72 14 91 0 -41 -13 -25 -83 15 -57 0 -53 -53 15 -2 22 58 -49 10 116 -20 12 31 54 -14 -77 -37
4380 -37 38 -75 -74 37 12 -122 -32 -31 -23 -51 1 62 20 110 36 98 -39 106 52 -67 -131 109 26 38 -18 -26 -50 -104 -53 -6 77 -4 3 59
3955 59 67 58 9 -71 5 55 -32 46 113 63 -89 19 -55 -112 -82 -80 -107 -21 25 -66 80 66 -21 -109 -55 -24 34 55 53 -29 30 40 -56 78 31
3517 31 67 21 67 107 -54 -11 -121 15 16 77 56 -65 -148 81 64 28 17 -132 -41 -35 -74 -3 -48 16 47 18 -65 17 -48 -16 43 -106 77
3103 77 -30 26 -96 36 11 -110 1 -22 -23 -7 53 26 91 193 132 144 -3 43 46 -16 94 82 -16 23 -88 -20 -98 -66 -1 -70 -28 -71
2703g1L1N6O7r8J03j3n2L1j66Q1PJ9r4mP4%l1L5m0J95j92J19j17N8n4l3J27O4K5J2j22K6j38
2290i5R1O3j9M5p5P0q4j0L8o2RlJ9J3j16J38o5jJ06l0j29P6l0J2K0j12R8Q1n7N4r7K55j86
1876A7o3%J8N1j28J78k9N9j50JJ6Q6j34Q8n5R7j04N7l9K1M1K0J2j0k9l6j3L4K3K4m4J1N4K2
1451I6k36J40M7q5O5p5J16j76P7p7J69ok0r6l5j5J68r6J84m8k6j42J77n8q2Nn5L8K9N2J0n7
1050a2m2l8O3j8J14j21M6r2mp0K60j2l3o5J9lM8o8M5L6P4k38l7J08N8P9m0L9r9J31k09P1M0
637C0J0o3N0n7k9K3or4j07M6K39k2R3k0j03PL0o4QJ32q9M7K6q2m8N8L3j35N6p0O7O4rl3N4
199D2j74J46r5J13L1q3J48p9j67P1L7j8Q3K7o3kn1j1rJ26N9j44o3J03Q6p4m7j8nJ4N0j11L9
-214c9O1j9M5pM0r3l9J25j44J93j8r0n1n8
$$ plain form
2703 -71 -40 16 83 -15 88 75 23 54 -112 -31 -24 -5 -99 -103 -29 -29 -60 -25 -65 130 -62 57 -60 -2 -56 -89 38 102 127 139 17 43 -95
2290 -95 -4 59 40 85 10 80 -4 -14 24 -38 -29 -32 -13 0 -116 22 -43 -44 62 32 -97 -21 -51 -39 -19 -131 -33 48 -9 45 -52 203 17
1876 17 -46 -46 -28 23 -105 73 44 103 -47 -46 -30 56 -78 10 -45 52 -52 5 -34 -13 28 48 60 50 21 -15 -28 6 29 53 9 20 74 96
1451 96 -140 0 47 -38 27 -48 68 -108 -31 -108 61 55 35 -61 -96 -111 57 -39 145 97 71 -71 106 48 -34 -29 -84 -46 -17 35 45 -12
1050 -12 -54 -92 -29 -47 67 -54 -8 -100 -104 -174 86 74 41 -24 -5 -8 40 -28 17 53 127 -111 -148 -40 18 97 57 96 -3 128 -81 -10 30
637 30 40 -23 27 -30 -59 -36 -42 -136 -243 -197 42 20 113 93 -10 -3 27 -37 -29 103 14 61 87 5 -43 15 48 -87 -31 -101 -34 30 21 -12 42
199 42 -132 14 -81 32 63 -20 128 49 -118 -47 -10 -28 55 82 19 17 -34 -45 -54 72 131 -13 -76 27 113 39 -8 -26 -31 -17 33 -78 -39
-214 -39 22 3 48 41 81 -12 -51 74 -70 123 105 15 -36 -94
-390i4
##PAGE=	F1=-19308
##FIRST=	23151.189942674980557,	6007.9998942000029274,	0
##DATA TABLE=	(F2++(Y..Y)), PROFILE
6008c6K6J02r3j2j67P8M6L9P5r0J15Pj14oP2n0L6k7l2N8m0r9J64j24l1P0l8J2L9j6k8O7j9
5595a6k3p5M9M2L7n3r4M5L7rP1J3n5K9qOO7j34n6J72nol8L1r2O7o9N6J5n1j10R8j01J35J74
5157A49p0j23j0J23j16M8K8k01K24p7L4Q3j89O1P1m3J54k44Q4j28n8K03J8j3L6m3O1p6J66
4794A52o9j98m7K96J5k05j8J19N8j17PM1k4o5M1r2J12n7rO9k4M5M4j00J1J56j82N5J4K5p4
4405b1l7J9M9n2l7J01rq9Q8k0j5LL2J9l8Q9k5M8q6R5j04r2m3K15o8J2l6Jp1o8Q5J14Rl1k6
3967A1K6L2M2j03j4J3J9p8J25L4n7j49J04m2p8J8J5J4K7N8r1J41Rj04p8N8M0J8L1j6n6O3L4
3554F6r2J14q3R4o0K2kj20O1j12J28OO1n7nj56K13lq2J8j42R7O8r3M2j9J20l2o8r7J05l3O3
3141B2L3j47K04j14oj05J66qj52R1lk2K7M8j7J06K1J3l0j08MLJ7K4nj17L7o4O7j05Q9M3n0
$$ plain form
6008 -36 -10 92 -1 -13 -180 -102 -56 -17 58 -32 83 90 -24 -30 42 -8 28 1 -31 27 -13 -112 52 -72 -103 -33 -71 -59 -20 -36 -64 3 -16
5595 -16 -39 -114 -65 -23 14 -39 -133 -88 -51 -60 11 24 -31 -2 -10 -4 63 -71 -127 45 40 34 -4 27 -65 2 -67 -11 4 -47 -157 -59 -160 -25 149
5157 149 79 -44 -54 69 -47 1 29 -172 52 -25 9 92 -97 -36 35 -8 146 -98 -14 -142 -200 3 21 8 44 1 62 -14 152
4794 152 83 -115 -162 134 149 -56 -74 45 103 -14 -7 34 10 -55 -14 -106 6 -51 -60 9 -15 30 74 -26 -15 141 -41 14 28 53 -21
4405 -21 -58 -39 10 -42 -79 22 13 -76 12 -8 -23 -20 12 31 -7 82 57 105 19 114 10 -82 -125 90 22 34 -2 -1 -72 -140 -55 59 68 37 11
3967 11 37 69 111 8 -6 7 26 -52 73 107 50 -99 5 -37 -115 -97 -82 -68 -41 17 -74 67 76 -28 -106 -48 -8 10 41 25 -31 32 66
3554 66 -26 88 5 99 39 61 59 -61 0 -112 16 22 83 26 21 -135 78 75 -7 11 -131 -34 34 -59 -17 -36 84 52 -16 -113 -8 -41 22
3141 22 55 -92 112 -2 -8 -113 53 45 -107 -16 -19 -41 -14 34 17 123 144 157 127 19 23 26 43 67 62 -55 -18 -82 -15 -120 -31 12 -38
2728c8L5m7L6P0L1j00P2J3o1O8j89Q9M1j7p1j4J09n6j6K3n3J34j20O9r7J05r3J7J05J5L5j7
2327G8n2J1j30J01N2k9K1o5N5n3j2N8p0r%N0qj33J09rj8J06m6j22Q6k6N7j4j26J38M4n5L9
1914B8p4K30j54r6J0L3M0j54J73LN8j58L1m2J13r7R7q3M6n3R5j10M0L6K7jL6j0n3l4JJ6O4
1501E8m8NK4j1j25R3M7p5L4m7J12j51O0r9J54M0m5j01l0J3J37o7J45k5o5q3J82q3q9J3r8P6
1100d9K2O7j1l4n7qK0M7P9j71P7p6k7J1J62L2J0j21O1j5O3q6K9J0O4k00m4J32j4Q6m0N4j00
687b7J27j75O3J2L5m7M1l8l1M5nj34r3M1K56jJ38M51l78l21N9m8k2J60j18M5Mj6q4J5J30j82
286i8P9n2J6O8J5J1oj37J41j38J87n4n7J05j4j55K1N8n3P8M6m2pm8k1jJ52O0j90J7O7Q5q9
-127D4k8j2k1k4P1p6J7O7j3L5j6J1q8N2N3j72K00J1j21lr9
$$ plain form
2728 -38 -3 -50 -14 56 87 -13 59 72 11 79 -110 -21 20 3 -68 -82 27 -29 -45 -22 -75 59 -61 8 -89 16 -77 -60 45 60 95 78
2327 78 26 37 -93 8 60 31 52 -13 42 -11 -23 35 -35 -44 -44 6 -2 -135 -26 -35 -53 53 7 -115 -29 -55 2 -12 -138 0 44 -11 28
1914 28 -46 184 30 -66 -56 -23 17 -137 36 39 97 -61 -30 -72 41 -56 41 -42 4 -49 46 -64 -24 12 39 38 74 64 11 -23 -22 -6 58
1501 58 10 15 39 28 -97 -4 43 -32 2 -45 67 -84 -24 -123 31 71 26 -75 -105 -92 45 -22 123 98 33 -50 132 49 -40 -27 -125 -49
1100 -49 -27 40 29 -5 -62 -70 -50 -3 76 -95 -18 -94 -121 -110 52 84 94 -27 34 19 82 -4 25 35 99 -101 -145 -13 -27 59 19 73 -27
687 -27 100 -75 -12 0 35 -12 29 -9 -40 5 0 -134 -227 -186 70 69 207 658 280 -41 18 -30 -52 108 -10 35 39 23 -61 -46 84 -98
286 -98 -19 -71 -55 13 28 39 33 -104 37 -101 86 32 -25 80 66 -89 -68 -10 -63 15 61 19 12 -36 -57 -58 94 154 -36 -19 48 133 44
-127 44 16 4 -17 -41 30 -46 -29 38 25 60 44 55 -33 19 72 -100 100 111 -10 -13 -112
-390a12
##PAGE=	F1=-19402.4
##FIRST=	23151.189942674980557,	6007.9998942000029274,	0
##DATA TABLE=	(F2++(Y..Y)), PROFILE
6008d9K8J00r2m5j31J00M7K8R2j03Q4L9j17j4P3rl0On6O0j1j20J62j25l5R1o4M4O3l2o9J15
5607C0k7m6p5P8ML6p6p6Q4lJ9J05k8m2M6m6RO9j57l5J69m2J8l0O4q8O0o3O3o0m0r9O3n1J44
5169b3J69q4o2m0Q1p8O8l7j67J97m3j8J21j57O6L9mJ57k50P4j10l9J75m6M0L0p1N7j9J31p9
4781G8j42j09K84j2j68QJ11L0j10N6O0m2m9l6r9J37k7k2N1k3M9N5q7j0J63k16Q7qN6j04J5
4393b4j6L0L7q7M8K3k5O2k5n7K9L3l5j7P2LL6k1K9j24o2l1J81k9Kj9J1j14p4J15J58n7J0n5
3967GJ0O7P5j31J1m1J4o4J54lo2j25R0j7p5KK3M6k5N7p8J04M1j18o8N8N6j3K0j6l2L7P0o4
3542A0O1r1J42p9Kk4p6O5q3R6rO7p1Q1k03J79K0j15K0j23J11J27j57K7lJ77j00j09r7J29q
3153c4P2K3j24K16j31q8p4J88K9j46L9Lj9J6N1qJ37o9O1o6m1j9k1Q0n1L0j60M5j0M1q7J17
$$ plain form
6008 -49 -21 79 -13 -58 -189 -89 -42 -14 78 -25 59 98 -19 -33 40 31 1 7 -49 11 0 -120 42 -83 -118 -27 -91 -47 16 -16 -85 30
5607 30 3 -43 -118 -40 -36 0 -76 -152 -68 -71 -52 53 25 -17 29 -17 -8 61 -96 -131 38 -4 14 -16 48 -40 20 -43 20 -40 -80 -179 -116 -167 -23
5169 -23 146 62 0 -40 41 -37 31 -6 -173 24 -19 -37 84 -73 -7 32 28 185 -65 9 -101 -140 35 -11 29 59 -12 45 26 157 78
4781 78 -64 -173 111 99 -69 -61 50 80 -30 26 86 44 -5 -41 -140 -3 -30 -52 -1 -24 25 80 -7 -17 146 -70 17 9 65 -39 -24
4393 -24 -40 -10 27 -60 -12 11 -14 48 23 -34 -5 28 -7 -24 48 51 87 66 95 -29 -91 -122 59 30 32 13 24 -90 -164 -49 109 52 62 7
3967 7 17 84 159 28 39 -2 12 -52 102 99 37 -88 2 -15 -90 -88 -65 -19 -44 13 -65 39 80 -38 -106 -48 8 -5 15 -1 -33 4 74 10
3542 10 71 -20 122 43 45 21 -55 10 -73 23 14 81 10 91 -112 67 87 -28 -8 -131 -20 107 -50 -23 -26 151 51 -58 -155 -26 -34
3153 -34 38 61 -63 153 22 -66 -140 48 77 -69 -30 -27 -46 -30 21 13 150 81 142 76 35 16 -5 75 24 54 -106 -61 -71 -30 -117 0
2753@K8l5L9n8M2O4Lr8M8J7p3J08j84Q9O7p4k0j6J05r0J7k2m1O6m9J8n5J42j01K4Q2k7L3l4
2327A5Rlq6R9J4m3Ol9L5l1MP3p9l6K7N6k1j43P5M7l6Q6m4r9J00m0Q6l1j34J75j4l5Pn3J80
1889A27p8j29L2M0J1j56J47N4L6j43M4q2J00l2J04j08k4J3J08j67P4L0K0J1N1K1p6n4k5K0
1513c1J04l6k1k0j8%L2K3n7K1k7Q8j16M7r2J05Q3p6r2nL0J01n7P3J9p8l6J58o9q5K8j42J07
1100c9PP9l5pp4K8pR3L1j95Q4l7l2P0M6P8L0j59J04l0Q1j00J1l2N1j28k8J05o6R1l1O7j09
687e3J04j18O7j3L1j4K7k9k6O9Nj71o9K5K49J6K13J024o67p74J04j6m6J70j38M0k4O6j30j2
311i0K03k11P9j9j7P0L2L4l8p6J10j70K11j11j1L4L4j08m3P4p0N5O0Mj3l4n7OJ75M3k02R1
-89D5J6N1r3L6ll6q2Q9l1k7Q0mK0m3J2o7J30k7j93J92L2j25L5j44
$$ plain form
2753 0 28 -7 32 -26 16 80 83 -15 33 50 -23 85 -99 -10 57 -17 -37 -53 52 -38 -21 -43 -84 -18 -67 -49 -104 38 -63 -39 43 16 49 15
2327 15 24 21 -65 34 48 5 11 -28 7 -24 -20 53 -26 -62 -35 21 0 -143 -68 -21 -57 29 -15 -114 -14 -54 32 1 -133 42 28 -7 0 -53 127
1889 127 49 -80 -48 -8 3 -153 -6 48 84 -59 -15 -97 3 -29 75 -33 -57 -44 64 -103 -29 1 21 32 83 104 28 -26 -51 -31
1513 -31 73 37 16 -4 -22 -22 10 33 -24 -3 -30 58 -58 -11 -103 2 85 9 -83 -88 -58 43 -14 59 78 0 -36 122 53 -32 -4 -146 -39
1100 -39 -32 47 12 5 -69 -41 -48 45 76 -119 -35 -72 -104 -34 12 90 120 -39 65 35 116 16 27 -5 46 -82 -110 -5 -71 20 -11 56 -53
687 -53 51 -67 0 -13 18 4 31 2 -24 45 50 -121 -190 -165 84 100 313 1337 670 -104 0 -16 -62 108 -30 10 -14 52 -78 -90
311 -90 113 -98 -19 -38 -55 15 47 81 43 -33 77 -93 118 7 -4 30 64 -44 -87 -13 -83 -28 32 36 23 -11 -68 -62 113 156 -46 45
-89 45 61 112 19 55 52 16 -66 23 -8 -35 45 41 61 18 30 -37 93 66 -127 65 97 -28 7 -137
-390a37
##PAGE=	F1=-19496.8
##FIRST=	23151.189942674980557,	6007.9998942000029274,	0
##DATA TABLE=	(F2++(Y..Y)), PROFILE
6008f0QJ08q3q5o2J02N3J1J08j01L9O3j23j5P7K1p8L1n3M6j3j04J61j30m3J20r4O3P2l8r2
5620i1J40mq0p1Q9j5K6j01o3J36l4L6J31q0l3Q7p2LP2j91j7J55o9K8rN1n7M4k7O8j45jo4j0
5194a68QJ34J50o6ro4K5l5R8j05j20J33No2J47j02N5jJ6J52k33M3o1KJ24j02Q2J8r4M9L9P3
4794A31q1n5j68K62l7j09J6P2Rp2Q1Q1o6k0q5j04J10K4k3K5j4M0N6o3pJ30k30J12l3Q8j30
4405f0P9o8K7J28j27k7N2L8K2j0r9M0N6r1J8L9K0J5L6k9j09m4l1J44L9k1j3J6j44n7J34J57
4005A30r9K5o3J8J04P6j26k0o7L8m5J53k8p5q5N8Pm4j8J7O1m5L6n4M8O0j11o5N3P9l3jkj7
3579c5jJ08l5Op8J60q9pk3m4N9m3M7k9P5o1J18k16J48L4j31Qr6J24J53k05L6rK24j57j29r8
3178a86J59%O6K8r7K17j52j51n3J98P0j12j9j6MMN5qJ59j36P4r4L5j5n5J00r9Q5k05N8L2j4
$$ plain form
6008 -60 -52 56 -27 -112 -174 -72 -19 -8 100 -1 38 101 -22 -37 40 61 -17 14 -39 7 -6 -110 51 -79 -122 -2 -96 -33 39 1 -91
5620 -91 49 45 -35 -106 -17 -32 -6 -107 -170 -34 -68 -32 99 19 -14 73 1 4 76 -115 -132 23 -46 -18 -27 24 -33 11 -16 52 -93 -94 -158 -168
5194 -168 -160 -26 124 58 49 -15 10 -25 73 -32 -152 -19 -14 -76 71 -31 24 23 39 191 -42 1 -60 -58 66 -36 46 64 -30 19 58 131
4794 131 50 -5 -173 89 52 -57 -41 31 40 -32 49 130 64 44 -41 -145 -35 -11 -34 -9 -23 17 73 10 3 133 -97 15 -18 70 -60
4405 -60 19 -49 -22 106 -21 -48 4 42 64 54 -45 -5 51 -40 -22 17 37 52 88 59 -50 -94 -125 19 58 37 24 40 -104 -161 -27 130
4005 130 31 56 -7 11 115 191 65 45 -22 16 -29 124 96 21 -64 -6 1 -43 -61 -44 17 -28 8 -46 2 62 -49 -114 -61 18 -15 -16 -18 -35
3579 -35 -36 72 37 43 -35 125 36 29 6 -38 21 -22 25 -4 71 10 128 -88 60 94 -37 -29 -125 -1 152 -53 -17 -26 198 41 -88 -186
3178 -186 -27 -27 39 67 -30 187 35 -116 -169 29 99 -13 -32 -48 -44 -40 15 7 166 30 104 10 45 30 -25 75 -24 61 -144 -86 -54 -68
2778f8k6J17J9m4N9n7L3M6j8q1M0Or7J38j43O9P7j29L7j5P4q8M9o6k0LJ1j6j3J59q0mO7m9
2352a0K1m2L9j4nP0k6n3rj0L4j8J4O8p3n8N9N1k2j47M6O4k8M7k1p2J15n8Q7m2j32J95o7ml2
1914c3m2J27J4j48O3L8l1j30R8J07%j08L8q5N2L2J15j21r6P2R0j91J14K0NM1L4M9j03o2l1
1526g2L9J17oo3n8MJ00j5l3l3K7j6N7q6M0o7M9J13r6p4K5K7N9m6j4O8p1mJ11k4o5K7j64J30
1100a4j5Q0o0K1q1N1j1J00kj92P3J9k7Q7l9J08K3j75J30l9R2j04lq2M5m9J4M2p6P4k0Q3j31
687g8O9n7P6k3K0K6lk5j6P1K0j82k1mK09J5K90J448q40j166J61J0n2J52j37L3n1J37j58k1
311i7K24k14O7K0l7O6L4L6l0k8Q2j87J81j25M3m2M7l4j06P6n3J2P1O5l2j8q9QJ82J4j76J36
-89I6l9%q7J27Jm6j27R4ko8R4RJ6q0J3l2J65q6j86J79K9r8M6j69
$$ plain form
2778 -68 -94 23 42 -2 57 0 33 79 61 -20 20 26 -71 67 -76 -7 70 -59 -22 -37 37 -51 -2 -68 -88 -85 -74 -90 -103 56 -24 -28 39 -10
2352 -10 11 -31 8 -6 -11 59 33 -20 -29 -39 -5 -23 -9 59 -14 -72 -13 38 16 -131 -85 -21 -49 -2 -23 -95 20 -38 49 7 -125 70 3 -1 -33
1914 -33 -75 52 66 -82 -19 19 -12 -142 -44 63 63 -45 -7 -92 -40 -8 107 -14 -110 -38 52 -139 -25 -5 0 41 75 124 21 -41 -72
1526 -72 -33 84 78 15 -43 -39 61 46 13 -20 7 -9 48 -38 2 -65 -16 97 1 -73 -48 -21 38 -8 -22 46 -25 -29 82 58 -7 20 -144 -14
1100 -14 -29 51 -9 12 -69 -18 -29 71 69 -123 -50 -31 -58 29 -10 98 121 -54 76 37 129 25 22 -60 -15 -64 -50 -8 -84 -10 -30 53 -78
687 -78 -9 -66 10 -13 7 33 30 5 -11 60 80 -102 -123 -127 82 97 387 1835 995 -171 -10 0 -52 100 -37 -4 -55 82 -76 -97
311 -97 127 -87 -20 0 -37 29 63 99 69 41 123 -64 117 -8 35 -7 40 6 -100 -24 -77 -65 6 71 39 21 -68 -60 122 136 -40 96
-89 96 57 57 -30 97 98 52 -75 19 17 -51 43 52 68 -12 1 -31 134 48 -138 41 70 -28 18 -151
-390a51
##PAGE=	F1=-19591.1
##FIRST=	23151.189942674980557,	6007.9998942000029274,	0
##DATA TABLE=	(F2++(Y..Y)), PROFILE
6008e8l7J23o2j23J3R5N8k1J32r5nP3j30MQ5K6j07L8k3K5m0n8J63j30m6J23j09O2O7k8r9J36
5607E2N5j24o7Q1j7J6j13n4J78m6L7J36j23k1J30p6j1O2k15j2J33p0J0K5jKK7J8O1k12N2j5
5207a02r1N2J08J03j4L0p0k9mJ17j44p4N3M9q0J59n9N1m3PJ45k01oLN5P1j29Q5J7j01L7P0
4806F5J7p5L5k05K40n4n3J3K3Mk5P6R7r2J6r4j06L4P1nJ8j1K4M5k5kP5k12J08m3R3j28J40
4393F4j26L4J80j30r2P0Q0j7J1j14L4Q1j37N9%M2k2O5o2o6m5l8J08J22n4k7J5j42j8J28J18
4005A21j09K1n8M4J29M8r6q5o4P2k2J35m1r4m0MM5pl1pO3k9Ml5JN3p9o3M2J02m1l2K6rl2J32
3554F8k4k1n6J37q1npk1M4j6pm1R0l4R8j86J29K1j24%o6J22J29k18P3l9K49j88j15j12J86
3166a5mO2L2p8K00j61j69n2J94R7p7n5n1L4PM9k0J78j62O1j14R6Kp5P8j23J44k28N9N2p6N0
$$ plain form
6008 -58 -95 28 -34 -157 -144 -49 9 -12 120 25 20 93 -37 -33 52 78 -29 9 -14 11 -29 -87 76 -54 -100 23 -86 -24 43 15 -84 52
5607 52 107 -17 -84 -3 -20 -4 -117 -171 7 -39 -2 134 11 -10 120 44 33 95 -120 -132 1 -69 -59 -34 -35 -33 -6 12 73 -139 -87 -102
5207 -102 -193 -141 -33 70 56 86 16 -13 -17 100 -44 -118 -65 -16 -96 63 4 55 12 19 164 -37 -43 -40 15 86 -43 42 59 -42 -5 65
4806 65 82 7 42 -163 77 23 -30 -17 6 10 -15 61 158 66 82 -12 -118 -84 -13 -18 0 -11 13 58 33 31 106 -106 2 -41 52 -76 64
4393 64 -62 -28 152 22 -70 0 80 63 74 -40 -6 75 -62 -3 -3 39 17 82 20 -46 -91 -129 -21 101 47 20 35 -107 -125 3 121
4005 121 12 33 -25 19 148 196 100 15 -49 23 1 136 95 1 -39 -35 10 3 -28 -35 28 -1 3 -32 -31 22 -57 -120 -78 24 -17 -49 -23 -32 -64 68
3554 68 44 23 -33 104 23 18 11 -10 34 18 11 -30 60 26 124 -62 67 88 -36 -36 -102 20 149 -69 4 -35 214 26 -89 -201 -15
3166 -15 -19 43 75 -3 197 36 -133 -185 9 106 29 -26 -77 -43 -36 13 -7 171 9 70 -44 52 54 -21 57 -66 78 -150 -91 -39 -115 -65
2765f5J02J1p7Q6l6JK9l7m1N1j1j21J39p7L5O8j54P1j1L4n8O5q2km8N5k6J0J56m9m2O1n3J1
2340em7L6k3Q4J6m2n2k3ON8mkM0m8n9P3M8j4j40L1K5J4JQm3J23o3O0n8j16J81q7K1o4l4Q7
1889a2Q3j48R8K7o8p6K7J47l6p2K0m8j3P1J27j12j54J04M9j70J42Qj6P5RN9j29m7k5O4R4L2
1488A10j02p1L5J49l1j05rN8l0L8p0M1m6PJ30r1o0M6J4Ok1q5J00n6J8N5K6l1Lj53J45l6P0
1075E4q9N1p6M7J0O1lj64N8P2k0O9p5J15%j72J34n3R7r4j3j16M1J0P3k6n0K3oJ01j54K9j4
662h0Q4j1J7N4m4k4KM5K6j67J8j7J62pL34J524q11j309K01K2m4J02j05K1o5J74j50k2J93j88
286f5N7N2n3N3K1L0Jk0Q1j85J11j01R3j00L0L6j37N5pl5P6J19o4pq3pJ65j8j22J47q5m4q4
-127i0K12mm1j40Q2np9R4K5L6j17j1J6J49j10j44J65Jm9K7j59
$$ plain form
2765 -65 37 48 -29 57 21 22 51 14 -27 24 13 -108 31 -46 -11 57 -97 -26 -37 -3 -61 4 -78 -80 -128 -73 -99 -89 67 18 -24 37 -16 -5
2340 -5 -52 -16 -39 45 61 19 -33 -56 -50 8 4 2 42 -6 -65 8 56 42 -98 -67 -42 -28 -27 -19 -62 61 -2 58 0 -116 65 -22 -1 -65 -99 -12
1889 -12 71 -77 21 48 -20 -96 -69 78 42 -30 -10 -58 -71 0 127 15 -139 -35 14 -156 -14 -6 -22 53 62 121 -8 -55 -80 -16 78 110
1488 110 8 -63 -28 121 90 -15 -24 34 4 42 -28 13 -33 -26 104 13 -47 -1 13 19 -2 -87 13 -43 -25 30 56 25 28 -125 20 -16 54
1075 54 -35 16 -60 -13 -3 58 55 -109 -51 21 1 70 -5 110 110 -62 72 19 116 22 9 -107 -66 -56 17 -9 -59 -36 -42 59 -95 -66 -80
662 -80 4 -7 10 64 20 -4 -2 43 69 -98 -80 -97 65 58 392 1916 1105 -204 -3 19 -25 77 -28 -7 -72 102 -48 -70 123 -65
286 -65 -8 44 -9 44 65 95 96 76 157 -28 83 -18 75 -25 5 41 -96 -41 -48 -83 -7 112 48 41 -42 -49 116 98 -24 123 38 -6 -90
-127 -90 122 118 77 -63 19 14 -65 29 54 90 -27 -38 -22 127 17 -127 38 39 -10 17 -142
-390a42
##PAGE=	F1=-19685.5
##FIRST=	23151.189942674980557,	6007.9998942000029274,	0
##DATA TABLE=	(F2++(Y..Y)), PROFILE
6008d2r3J40l4j46O5Q9N9o5J59r5l0O4j33L6R7J0j13K2J7Po5pJ62j17m0Q8j01M1N9j0r0J07
5607D1J33j71o6O0j3J7j04l7J78l2K4J20j40oJ58p1k7L5k10j6J07m5l5N8n8P5J4M5M5k43R9
5219f5K9j46P1P3K8N7N1n4p0NJ13j35m1j4P2o7J60m9N8p3k0J36j63o4O1J09K8j19M7L5j00
4831d7K3P0j9n3Q9k03K18o3k2J7j3J0KN7R9j09M9p2j04o4R1L2M3k2ML7J0j6L1j70P6k8O5r3
4405g5J78j71L0J76p9j26P7Q2l4K1q7J0Q5j62R7l0P5p1O0o6j5o1l9Q0J84q7n3Pr9K8R4O6r0
3992EJ2m6N7J32Om8j44m9Q8QJ17m9j13Jn7R7Rk6m3N5J2k2l5j4K6l3n7K5J16m2o4O5j4m5J36
3554F6l3j3l6P7n2kJ7OJ4j2n4l5J13nL8j20J17k4r3J1l7R8O3k02J39r0K48j89o9j36J92qP1
3141F0J9o8J62j38j44o6J70R8n5o2q1O3K8K3m4K04j58M0j27J31J8p1L9j28J79k11L1N6j18
$$ plain form
6008 -42 -135 5 -29 -175 -110 -21 38 -27 132 37 7 71 -62 -26 71 81 -32 -10 7 14 -51 -58 104 -13 -53 35 -66 -25 34 24 -66 41
5607 41 174 3 -63 -3 -16 1 -103 -140 38 6 30 150 10 4 162 91 64 99 -111 -127 -20 -65 -100 -42 -100 -25 -11 34 79 -164 -65
5219 -65 -36 -182 -111 -38 -10 47 98 44 -26 -21 92 -43 -84 -98 -26 -93 67 18 76 3 -17 119 -44 -108 -47 62 90 -29 18 53 -47
4831 -47 -24 46 27 -26 63 -140 78 15 -7 10 -3 7 9 66 165 56 105 33 -71 -135 -44 -12 31 9 13 50 60 44 75 -95 -19 -47 18 -75
4405 -75 103 -68 -38 138 59 -67 10 92 58 79 -8 2 87 -75 22 -8 67 -4 56 -10 -25 -86 -125 -45 139 52 -1 6 -93 -65 29 95 5
3992 5 17 -29 28 160 166 118 -26 -75 13 21 138 89 -24 -23 -80 17 26 0 -43 12 24 2 -33 -47 -21 -54 -111 -86 30 -12 -76 -11 -25 -70 66
3554 66 33 20 -16 61 9 7 24 30 44 32 -22 -57 56 51 89 -31 86 62 -31 -20 -57 41 104 -98 41 -49 199 10 -59 -195 -3 -11 60
3141 60 79 11 173 35 -109 -175 -5 93 38 -24 -105 -42 -14 9 -35 169 11 51 -76 55 73 2 41 -87 92 -119 -88 -32 -150
2778a50J09Q7rj16J17rm5K3n3J0Q1l5j26J07j4MM8j39P8j1Jk3O7p2J0q2Q5k1RJ35k1o6M9l1
2352cjm4J6l3J36l7k7l2l8JR8J5m2oj3l1N8N1Jj21L4n6P7l4J9j1J11m4J2p0q9J32o6L1q3k0
1901a09N9J12j37J28Pp6nm8J57n3o3PJ0o0O5J38q4j86J02mj10J45Ql8Q5OM9j49pk7Q1M8O9
1488A20j23n7N2J42j1j67J6J06p1L5p0M7m5oJ37n9o3M8Qm6J0j13R6n0M6OO2Kl6j09J42m9N8
1075E8j18Q0o7K1N2j0K2j20M8J08j7L4p1R7j8j58J21p7R6o6j9j19L1L2J35p5j3n5J6J11j56
687i7JqQ2K1K5N8q0k8K7KJ3j47l6K7J77k8L17J241o01j148K08K0m3K9m0Ko0J74j08k9J26j29
286c2N1O3o9M3JK0K8n5J10j62L3n9J24j18kP0j18J3N0p3P5J40r2j1j9m2J25m6o0J35j12o1
-114e0q7K54j5j6j24N8m3m4P6L7P7j46o4P4R4j00p7J45m0J1pj21
$$ plain form
2778 -150 -41 46 37 -79 38 29 -16 7 -46 -36 45 10 -116 -9 -23 -19 29 -110 -32 -43 -42 -65 2 -70 -60 -142 -57 -78 -69 66 45 -21 28 -3
2352 -3 -4 -48 -32 -65 71 34 7 -25 -63 -62 36 51 9 3 -10 -41 17 68 69 -52 -18 -74 3 -31 -12 -23 88 44 56 -14 -103 29 -37 -6 -89 -109
1901 -109 -50 62 -75 53 60 -16 -21 -69 88 35 -28 -21 -11 -71 -6 132 48 -138 -36 -40 -150 -5 3 -35 50 56 105 -44 -51 -78 3 51 120
1488 120 -3 -60 -8 134 123 -44 -28 78 7 42 -28 19 -26 -32 105 46 -17 31 39 -7 3 -110 -14 -64 -18 -12 50 52 16 -93 49 0 58
1075 58 -60 20 -47 -26 26 16 38 -82 -34 74 57 91 20 117 99 -59 62 -15 81 15 -4 -123 -92 -60 75 0 -13 -68 -52 59 -97
687 -97 -96 -104 -22 -1 24 82 2 -26 1 3 16 -131 -167 -140 37 9 326 1567 966 -182 26 46 3 32 -8 -6 -66 108 0 -29 97 -32
286 -32 19 82 13 56 57 77 105 50 160 -2 31 -28 96 -22 -24 46 -72 -59 -9 -82 -7 133 41 30 11 -31 94 48 -12 123 11 -50
-114 -50 -137 117 102 86 -38 20 -23 -67 9 46 123 -23 -87 -13 81 -19 -96 49 9 20 13 -108
-390a08
##PAGE=	F1=-19779.8
##FIRST=	23151.189942674980557,	6007.9998942000029274,	0
##DATA TABLE=	(F2++(Y..Y)), PROFILE
6008a9j36J50qj48P6Q8N7j04J77j02l2M0j28O1J11j2r7rM9ko7K2J52q6l3K7o9NO8po6O7J95
5595B20j97p4M6j9L3q1oJ22MQR2j23%J69o9m4kj70k7Q6or3P5q5J34OM1L4k33J15O0j64P5M1
5169c2o4J22N6k1r4oQ6p9k4n5P3k4J40o6P1q6n0J27j25j16R8J51Kq3qO0j00PN3k8j2P9j60
4756a08J93o8j7M2l3J9nM4Q4j07P0m3r4j42P5P2Q6l6j7M5K4n4K0j20K8RK6n0J88j81kJ25J5
4343H8j28Q4L9k6J8l1j9N0j62J28m1J10j21K8m8K6p7k0N7J95j07p4nk4O0L8K2n1J4l5L8J08
3942A34k8%j62m3Q2L6J14n9j25M2j18J58j3Mp8L9N2k1n6NrQm6QJ11l5q9J04l2m3J21m4Oj9
3517DLj1qM2M6k8k9q6j0J39J3l4l3R8q0n1M0j4N0nj78K13j41K25j69qj59J68kR2j6n5J02p9
3091C9r4q4J26P1m9m3q9Q6N8k5o8K43j49K1j26J35K4m8J2j24J75j54l2O0j17J22Q4m3j43J50
$$ plain form
6008 -19 -155 -5 -13 -161 -85 3 60 -44 133 31 -1 39 -89 -28 83 71 -26 -35 14 12 -55 -33 119 33 0 27 -42 -37 31 24 -42 25 220
5595 220 23 -51 -5 -24 9 -72 -78 44 48 56 148 25 25 194 125 81 79 -91 -118 -32 -38 -131 -56 -141 -7 -1 40 74 -159 -44 16 -148 -73 -32
5169 -32 -96 26 82 61 -33 -39 47 -32 -56 -111 -38 -62 78 12 83 -3 -53 74 -51 -167 -69 82 84 1 -7 53 -47 -40 13 -15 -27 52 -108
4756 -108 85 17 0 42 9 28 23 67 151 44 114 71 -23 -165 -90 -18 68 32 15 60 84 30 50 -70 -42 -33 -7 -57 131 -50 -52 73 88
4343 88 -40 44 83 57 75 44 25 75 -87 41 0 110 -11 17 -31 -5 -82 -102 -45 150 43 -31 -36 -60 0 38 60 9 23 -12 26 134
3942 134 106 106 -56 -99 -17 19 133 74 -51 -9 -127 31 18 22 -56 -17 35 14 -42 -37 -46 -38 -84 -76 35 0 -89 15 -17 -60 61 17 23 4
3517 4 7 -4 -12 30 76 48 19 -67 -77 62 75 41 8 106 26 -25 15 1 51 46 -132 81 -60 165 -4 -12 -171 -3 -5 87 71 16 118 39
3091 39 -55 -139 -13 58 9 -34 -123 -37 21 -4 -72 171 22 43 -83 52 76 28 40 -84 91 -63 -95 -35 -152 -30 54 11 -132 18
2715A8Mr1L2o2N4J16o0j02M6K4JK6j03P3j5j6qO1n1J9r9J01j5jJ01oo5K2J9k4k3pl6J14o1
2277a4J0On5j5J21L5p8m6J0J1K1N9K4r4M7j38J30m4OJ6P9nm4o8n2O3j7K2r0JM4J01j26J38
1851E8j8l8O4j09J38m8q8PO5p5K3J46n5j82P0m8l6J21L1n9O1L0L2j57M7m9P9LR6j24k3L8J01
1438A01L2j99M3J60j36M7p8M9o2JJ39j3q3L2J9q2L7q9N0n7P9k7Q7J9o9n4J12m8N4j38J01o3
1038c6j1J05q3M6p5M9J20k5J6n5N3rj38R8j14R3k2k8q8RL0J71r6Rj28N2J01j37Ol4O4O6K9
624C8M0r7l6N5l9j5j38k25J32K95k9K45P73l22p91J80J6n7n5M0j6m2J52m8n6M8m7M9N4q3L7
236E8j0J2L1j16J49j20k3k6J38r5m5O0m7l2Q7r0O8J21j00k9R0r2P0o0j1J15j14m8r4K37k6
-152E8K5j03L6r7K6N1L5J20j58j22J29K2o8j0J16p8P6m4p9
$$ plain form
2715 18 22 -69 -37 -99 -45 71 11 -91 -45 -21 -20 6 -97 -24 -39 -55 -63 -2 -53 -34 -133 -32 -47 -48 53 47 -18 4 23 -1 -24 -31 -67 47 -14
2277 -14 -4 2 -53 -68 53 88 10 -36 -26 -15 6 65 89 -5 42 -96 34 -10 -4 12 91 86 42 -26 -78 -15 -32 -10 -100 -99 -55 46 -80 58
1851 58 40 2 66 -43 95 47 -41 -34 31 -44 -21 125 70 -112 -42 -90 -126 -5 26 -33 28 58 90 -67 -20 -69 10 13 109 -15 -38 0 101
1438 101 133 -66 -23 137 1 48 -30 19 -43 -42 97 84 1 33 52 -30 7 -82 -32 -89 -10 -37 50 69 0 -54 58 10 64 -74 27 -36
1038 -36 -47 58 -25 21 -54 -5 115 90 106 51 104 95 -43 55 -59 34 12 -16 -104 -95 -65 106 10 19 -109 -57 44 -93 -87 -121 -57 9 38
624 38 78 -19 -55 0 -39 -54 -192 -417 -285 10 -19 226 999 677 -114 66 82 25 -30 10 -6 -48 104 56 0 48 1 50 104 21 58
236 58 48 60 91 -25 124 4 -19 -45 93 -2 -47 13 -34 -66 21 -69 -1 120 20 -9 81 -11 59 -1 -12 103 -11 -59 -153 84 58
-152 58 83 -20 16 -81 -55 -4 31 151 -7 -129 0 22 -46 -56 60 -18 58 14 -65
-390f5
##PAGE=	F1=-19874.2
##FIRST=	23151.189942674980557,	6007.9998942000029274,	0
##DATA TABLE=	(F2++(Y..Y)), PROFILE
6008bj48J45J3j29M7R0N6j21J73j09k8J8j12N5J27k5o4l1N1ll6J6J28l9l3l6k1l7J09l5l4
5620a5K8K15j86r0M9l0M4n0L6K2M6KO9p9j7J72q1o5l1j04m1P5K9j43O6o5J59lJ8L9j97R3P9
5207D4j52P0K4j41J56M7K0j08k4M9qqp3N9L4R7q6P0q1p0J18q5j45J02J76j4l5n8Q3j08j1M5
4806a3j8L9Qq6J60p3k9Q4l7J8l5M1O1p7O7k4p8j66L3R4J14l6l5P8Or9L9p7k0N2Pk7J79j52
4380bo7O4J18j09R3l7pJ8K2m0j2j37J37k6J33j56k2j4M9q8K1L7J45j03p0j9N8O4k0onK8k9
3967A8nO1l4K7j29o0O9N0J27p0j22P6j66K16o1M1r8J3P5J2q3M2m2K6l5KQ5j7r5J30o5l7J00
3554E1m2PLo0K6k9O1R4o6n4r6K7J52J1q5N2O4j21j4Q1qj0l7j68K69j69J87j43M4j65J25QJ14
3141A09o1l4L2%m5r2P9J9m6j4o8J01Q1r2p1K83j55J0j12J23J6k3J5j19J36p6j12P9q1Q5J00
$$ plain form
6008 -2 -150 -5 8 -121 -74 16 72 -49 124 15 -13 5 -107 -52 75 50 -14 -45 6 3 -33 -17 111 72 39 3 -18 -55 54 19 -15
5620 -15 13 228 42 -48 1 -29 15 -35 1 23 69 71 140 61 44 216 135 70 39 -65 -106 -31 -2 -145 -79 -144 15 12 30 69 -128 -35 44
5207 44 -108 -38 -14 -155 1 48 68 -40 -64 -15 -23 -31 -104 -45 -11 86 0 70 -11 -81 37 -48 -193 -91 85 71 36 -22 61 -47 -58 -13
4806 -13 -31 8 16 -70 90 17 -12 72 35 53 18 59 120 43 110 86 8 -158 -125 -31 83 47 12 90 96 -3 36 -41 -61 -9 -2 -29 150 -2
4380 -2 -69 -5 113 4 97 60 53 71 93 53 41 -96 41 15 148 -8 -30 -44 5 -83 -62 -25 120 17 -53 -72 -14 50 30 24 19 47 18
3967 18 13 74 40 67 -62 -122 -53 -3 124 54 -68 8 -158 58 -3 38 -60 -47 28 40 -43 -1 -43 -17 -52 -50 35 18 -77 53 -12 -49 51
3554 51 9 16 19 -41 -15 -44 17 111 45 -9 -105 -78 74 85 0 52 116 -5 -19 62 54 44 7 -161 108 -61 126 -17 27 -138 -13 -5 109
3141 109 48 14 46 46 1 -91 -12 7 -39 -53 -121 -20 61 -31 -102 181 26 36 -76 47 63 40 55 -64 72 -4 -116 -37 -118 -33 67
2753F7q6j45J78oj25M5m8O7J44q1n3k6L0L4Rp5P5k3k4j6N9l8K7j00J01j7kN5Km2k1R1o7K2
2327A1k3l3K9m2M9N2q3k3R8N1p5o0kM7j6O4N0o1O1j91J51k5k3L4L0L9q7n0j4%L2Qr8K1M7O6
1876C4j20J14l6M0J09j40R8l2j28K4R6o7k7J52m4j49K8p1K1Q1P5p7J2O7K8j54R2q3N7j7J07
1488I0j09R%N8P1j93P1K02k04O2q4L8q5J5J37L4j11LM1q4N2l2j7p6J10m2J08J3p5j3N8l6N8
1075F9j41J10p0k9J49j26M3l7N7J11m2K8n1pL3j12O8j49Q6K6l5m5j8K8J61r5Lj69J03P1j13
687i3N5p4L0J14J6J1q8m5P5o9l3j23m01J94M22jJ48L50j01m24J33K2q4j31J14k3k7J27Pr8
311Ck0M3M4L6r5L9jMLj68J72o7m7j8J47n1r5K7M3n4Q8q9N4P8q5n0J97j38J5n2J4R1r3j0r2
-127a27J68l6P0r6K6j36J01K6K3J38j47j57J70m5l0L2Q1j03J37p2n1
$$ plain form
2753 67 -19 -164 14 8 -117 -72 -120 -53 91 10 -43 -69 -39 -5 4 -71 4 -19 -43 -59 0 -38 -11 -111 -10 -27 -29 26 28 -14 -35 56 -11 11
2327 11 -12 -45 -16 -58 -9 43 -40 -63 35 86 11 -49 -51 -4 -20 44 94 33 94 -97 54 29 6 40 70 109 22 -28 -42 -42 -10 -2 -100 -79 -32 34
1876 34 -86 28 -8 32 141 1 99 67 -61 -37 59 -8 -35 117 73 -76 -48 -119 -98 -17 58 -19 -7 60 88 -66 26 -57 0 -17 90
1488 90 -19 -10 -10 48 119 -74 -3 199 -5 57 -27 11 -74 -59 78 112 1 4 45 -39 13 -19 -36 -112 -2 -44 64 77 2 -11 47 11 69
1075 69 -72 38 -32 -61 88 -38 5 -32 25 136 94 122 71 64 97 -15 53 -96 -10 16 -19 -64 -82 -54 107 12 15 -154 -51 20 -93
687 -93 -38 -112 -82 32 48 59 -29 -74 1 -68 -101 -224 -625 -431 -9 -10 138 488 387 -37 96 118 34 -97 17 -6 -33 94 101 3
311 3 -17 26 70 106 11 50 49 53 56 -112 60 -7 -54 -72 75 24 -71 -44 -1 -55 33 -56 -2 76 -9 -59 138 0 15 -37 -23 68 -25 -35 -127
-127 -127 41 5 75 -21 5 -131 -30 -4 19 157 10 -147 23 -22 -52 -20 61 -42 95 23 -28
-390b8
##PAGE=	F1=-19968.5
##FIRST=	23151.189942674980557,	6007.9998942000029274,	0
##DATA TABLE=	(F2++(Y..Y)), PROFILE
6008Aj22J24K6j01lQ6O8j14J39j01l2Nr0J7J46k5k5l0K5nJ6j7R5Ql9p3K2p4J77q6r%J90j39
5582F0j07O8l5K8j3P7q7P5MO8k8n8J69r6r2l7m0n4P7M7j64L1j1J51k2mO0j51L9R0j23O3J7
5169Bj70J52L3N4j25l2J5M7K1q3M2Q6M2q3L6o3p1J04l8j45P6J83l1J3q7R6j22l4N7J1P5q5
4769b4nJ10p3m3J23l2Ro0L4L7k0L7j6n5j42oQ6J02j1m8J27l3j31O7n4m9P3L2l7J67j01j44
4368h0K1J90q1J00j18KM2L8m7o8r5J22LJ33j63p6K9N6r4P3QO7p6l5l6J16M2n9k7M2M1k3m5
3955BLoJ2n9r2O9L9J40p3r6R3j94K53j10P0r8j7P1O3r1O5o7K3l0QM5J6p5J26r7l5Q1k2k7K9
3517A9r1N3o0P0J30q6p7p3O0J36j0r2J10K3j29lJ20k1o1j8j77K84j57J46j22O8j48Q0J6J24
3141A14r5rl1P3j4q8M4m3l6J1k2J00Q8j57m3L01j73Mr0J09%qM3j23Q3lj78J16l8J7J38j25
$$ plain form
6008 1 -121 3 29 -72 -75 11 79 -35 104 3 -29 -24 -114 -97 49 24 -1 -31 -6 -11 5 -12 83 91 52 -21 1 -73 104 18 9 9 199 60
5582 60 -47 21 -14 14 1 78 -9 66 70 138 110 52 221 125 33 -4 -44 -98 -21 26 -138 -107 -118 33 11 7 67 -84 -45 45 -78 -15 2
5169 2 -168 -16 17 71 -54 -86 -71 -24 -3 -86 -44 42 84 1 37 -26 -97 7 -31 -176 -100 83 52 65 -22 74 -48 -82 -25 -14 61 -24
4769 -24 -29 81 8 -35 88 56 65 5 39 76 56 93 77 22 -120 -126 -40 62 51 3 130 97 -34 33 -21 -70 3 35 -2 165 64 -80
4368 -80 -59 131 50 150 32 34 76 114 67 -1 -96 26 29 162 -1 -77 -48 8 -86 -13 -5 62 -14 -49 -85 31 73 14 -13 29 70 47 2
3955 2 5 -1 11 -48 -140 -71 -32 108 35 -61 32 -162 91 -19 51 -47 -64 7 70 -21 44 -23 0 -30 -22 23 39 -36 90 -7 -42 39 17 -10 19
3517 19 -72 -19 -79 -9 121 35 -42 -115 -55 81 71 -21 89 112 -17 -20 100 79 18 0 -177 107 -50 96 -26 42 -106 -26 -10 114
3141 114 19 10 -21 52 38 -50 -6 -49 -85 -74 -96 4 92 -65 -108 193 20 24 -66 43 43 35 78 -45 38 35 -143 -27 -65 -48 90 -35
2740c5j25J84k4j39M6j1M5J55q8Jq5J3Q9%p0R0l6k9l4O2m0K9q2P7k0J1QOro7J68j25Q2l4k2
2302ip6J2P0Q5j18j4L2N7j8m3n3O0m2P0P1k4O1j99J36J7n4L2j7P3j00l1J8l1N3Jj07K4P2K8
1876C6j16N7m3J32J17j34N1k3j48M9R1n7l7J42o4j03mo5M1M1J23r1l6Q9M4j40J11j05K5j1
1501b8J06q9K3m5L9R0j64R9K06k43P2q0J4j05K6J31O7j36k8O5n0N0K8p4r1J18l8J31j6m9J
1113C0Jk6O6j24J02q8k1J66j27Rj0O8R1o2O3o7o8R4p7L5j67P1O7m0j6l4M7R9q1k2j64J52L0
700cr9J35j01j4J50rj7n5n2P9q2k1m9k30M3L02M4O3J12Kj93R6L2j04j79J55rk5J05M0j42n9
299h5J21L5J8j00L8L2nm2j82J62k0m2m0J66j1j50JJ15l9N5p9L8L9o2n7K50j60k8k1J1O4n2
-102c0L5o8P4n0J09j08L0j46J52RJ3J13j08j58J81q5lM3N1j14J84q9m4
$$ plain form
2740 -35 -160 24 0 -139 -93 -104 -59 96 8 9 -76 -63 26 26 -44 46 10 -19 -53 9 -31 -2 -84 -7 -27 -16 -8 -2 -11 -78 90 -35 47 13 -9
2302 -9 -85 -73 -3 82 -36 -50 -18 39 21 -22 -75 -15 -57 13 84 60 121 -78 58 75 21 53 36 109 9 -22 -4 -35 18 19 -88 -64 8 36
1876 36 -80 -23 -66 66 183 49 100 77 -71 -22 69 12 -25 117 53 -50 -54 -119 -78 -37 86 -5 -41 48 92 -48 63 -42 -17 -28
1501 -28 78 -11 12 -33 6 96 -68 31 237 -6 66 -14 0 -105 -79 52 119 -17 -45 20 -30 20 48 -26 -117 1 -37 94 78 29 30
1113 30 31 5 71 -53 49 -39 -60 106 -21 -12 -22 46 137 75 138 71 3 97 20 55 -112 -41 26 -14 -30 -64 -17 82 1 -21 -185 -33 -3
700 -3 -102 33 -68 -82 68 59 42 -13 -65 14 -68 -89 -138 -368 -325 -23 21 84 196 198 5 101 133 29 -150 5 -4 -29 76 116 -26 -85
299 -85 36 71 89 -11 27 59 54 12 -170 -8 -28 -70 -110 56 45 -105 -104 11 -28 27 -52 -14 25 -37 -94 156 -4 -32 -53 -42 22 -30
-102 -30 5 -63 11 -39 70 -38 -8 -154 -2 7 20 133 25 -133 48 -37 -40 3 54 -60 124 35 -9
-390i
##PAGE=	F1=-20062.9
##FIRST=	23151.189942674980557,	6007.9998942000029274,	0
##DATA TABLE=	(F2++(Y..Y)), PROFILE
6008go9R0L3p9m5P2R5r8Q1p2m9ko7k7J60j2Oj0j5j9Q2o1N4M5m0q2N3j01K47j34oj1J40p6j18
5570d2Q3j6j6K3J02j62Q0NQ6J2j09J60j00j19j7mo3Q7M8j47k1M5J28n4rQ8j09k5Q8p9N4Qj44
5157a39J22K6O9j55k0j1O6O6q6K2J23nn4l4l6n7Q4J8j23K4J81n3N5r8R4j30n4Q0M8Q2j51N3
4756GM5o4m2J42k7kn9J2J5M7pj4k9r5j9N2M8L9o1J78p9j30P6m4n7O1R5p4J63n7j98PK02n0
4330H1R6j72qR2Pm6q3m5Q2K9J15j42j21O9N6r7J12k8Pm4K6n7J35ln9n2Q8M6k3n1n8M5m2J8
3905b7j18Q6QJ37n9n4P6j82K51j35P5q1m0N1J02p0O1q9J2k7K1PN7l9R1j11l6O7Kq1M7q5P1
3491a2q6N8J40q0r3k0Q4Q7m3n7J31pj14k1J43m4q9L3j84K51j10J15j12O1j11M9J9J16j10J1
3116Ep4J22j2p3L3r7j5K3L7Q1P3j97J0K70j78Mp2J05k3%P7j42M3M4k06J61j9m9J91j45r7J55
$$ plain form
6008 -7 -76 14 47 -32 -77 -5 90 -8 73 1 -48 -50 -117 -144 16 4 10 0 -15 -34 48 -13 41 86 46 -36 17 -84 163 29 23 12 152 76 -42
5570 -42 41 25 9 32 134 -28 52 57 143 155 46 206 106 -13 -30 -34 -97 -10 38 -109 -130 -85 43 -11 -20 68 -41 -66 22 -57 -3 5 -139
5157 -139 -17 9 78 -77 -97 -108 -42 24 -62 -40 83 78 24 -10 -46 -103 -19 -1 -124 -100 81 28 83 -15 79 -51 -105 -25 23 105 -46 7
4756 7 52 -12 -54 88 61 59 0 12 27 74 67 53 24 -71 -90 -38 10 49 -12 166 87 -43 33 -11 -68 -7 88 14 177 120 -78 -71 131 81
4330 81 177 5 -3 89 96 50 -33 -78 4 33 148 6 -115 -46 10 -87 25 -3 4 -40 -14 -71 64 61 2 -50 38 84 61 10 -48 -3 -45 -27
3905 -27 -145 -59 -51 86 27 -27 49 -133 118 -17 58 -23 -63 -12 90 20 81 -8 4 -23 -2 5 62 23 114 3 -33 34 36 -45 2 -83 -12
3491 -12 -98 -40 100 20 -73 -93 -9 78 35 -22 109 102 -12 -33 110 66 -23 10 -174 77 -33 82 -30 31 -80 -31 -12 104 -6 5
3116 5 -69 53 41 -32 1 -96 -111 -88 -51 30 103 -94 -84 186 8 12 -60 45 22 22 99 -43 0 44 -162 -1 -20 -69 122 -23 -120 35
2715C5l1j29K5L6LJ43p4M5j19mJ38qq6J11m6m2m2O5n0J6m2L2j6L0l1J2J8r7K18j71J32l7j6
2302A8j40P2O5Q7j46Qn0O1O4lj25N0n1P6P6J5M2j74J03O2p2J0m5R4q5k9M2k2L4Qj12RJ08J
1876E1j07j4l6J98R4j03J1k6j30P6M7n8K6R9j17n3k0l4K7J1J52r4n7Q0O5j18J01r5kJ0R2p0
1476FJ8q0M9Q7j34J24J56k30P5o7j1j18L1J24Q1j50n3Q0LL1P1r4r6J02k3J45o2Kol4k3O9r5
1063b2Q1j16J6J42r6m1J5P3O8p2R1q9j13J47k8Oj67N4Q8l7j5l0Q5J1o9n3j17J74kr3K08j01
662bn8J71l2l7j1n2O7q0K8J26O01m41l21Q1J4N2Oj17Q4L0r9j87J52J9l1Q6M0j68n5J73K4n
261E8r5K8P9j9p9j48J18J0l0p4J95Lj93LJ46OJ1p6K4K7n8l8K32j53n3K8j7L8kP3k8j5o5J33
-164F9j21L4j29J67JJ4M9m9j33J64q8%L6L6j15K03r2n7
$$ plain form
2715 35 4 -125 -100 -64 -61 82 8 53 -66 -70 68 60 -26 85 39 -3 -45 20 -30 -14 -56 -24 -40 -10 -41 -29 -11 -108 110 -61 71 34 18
2302 18 -122 -50 15 102 -44 -36 -86 -25 39 36 -89 -39 -90 -14 62 77 119 -55 48 110 38 48 3 97 12 -17 25 3 37 45 -67 -58 50 51
1876 51 -56 -70 -106 92 186 83 94 68 -62 14 61 3 29 128 11 -42 -62 -96 -69 -58 94 0 -57 23 88 -30 71 -24 -26 -16 76 6
1476 6 24 -56 -7 80 -54 70 226 -4 71 4 -7 -125 -94 30 111 -39 -92 -12 -9 22 93 -1 -97 5 -18 127 65 67 61 27 4 73 -22
1063 -22 59 -57 -41 101 5 -36 -21 52 120 48 139 50 -63 84 56 62 -105 -51 37 0 -15 -45 40 51 -18 -71 -188 -14 -16 -109 99 -2
662 -2 -60 111 79 42 31 -21 46 -34 -6 120 721 280 -41 40 54 106 112 -5 79 109 10 -177 -25 -6 -37 49 89 -79 -134 39 63 58
261 58 -37 -9 70 51 -28 -176 -58 -48 -78 -152 43 46 -147 -144 2 8 19 -57 -33 -6 -64 -102 130 -23 -76 -48 -65 -27 -29 44 16 1 -64 69
-164 69 -52 -18 -147 20 21 35 84 35 -98 66 -22 -22 14 50 -65 138 46 -11
-390a1
##PAGE=	F1=-20157.2
##FIRST=	23151.189942674980557,	6007.9998942000029274,	0
##DATA TABLE=	(F2++(Y..Y)), PROFILE
6008b1kM8L4o9n4M5J28r6K0k9o9j0n3m0J55J5J6Ll9m3J40r2QO5k5o8O0j11K85j51k9nR4l0
5582H0j10P6K6p0N2J09j81O3rJ13L0j51J40q0j41K4no3R8L6r8q2P9J09r3LJ13p7p6O9k0L9
5182Cj7p6Q8K9O4j94Qk7N1J11p5%J34k1j4j21%l9N6P0r1l6J77p7Q4r5P2j21o1R1R1N8j56O8
4756C4k7m7j5J36l1ll6j9oR9m1j7no0MJ0k4J03q2K09j12r7N7m0m5K0J61j07J61m2k06J8J56
4343A06j7P2j77l6J53m8n2m2lL4L4Q8r9j48Q9O0r3J18o3jk2Q4q0J15n2j9q0J28M1l3k0j12
3942g5J07j18P5j13J00k6J09l1pL0j26K04j30N8n7n0L7J05l0L5j08J3k1K2j2R1kL9r5l3N3
3554D4Qj16M3n5P9q8K3J20n9r7N4Q9J9p4lJ18qr8n8J41n8q9Q4j69J81n0J05j14L0o2L2K9Q8
3141H9j10K2q9J41l7n3M2j27J0K3Q9M9M1j97O4J85j45Qo3J07m4J2J02j77K2N8j86J98l6q0
$$ plain form
6008 -21 -23 25 59 -10 -64 -19 109 13 33 4 -65 -75 -128 -168 -13 2 18 21 -18 -61 79 -13 -5 60 35 -33 27 -84 201 50 21 16 110 80
5582 80 -30 46 72 2 54 163 -18 45 36 149 179 28 168 88 -53 -29 -34 -97 1 37 -61 -143 -64 45 -48 -45 68 -9 -85 -16 -36 3
5182 3 -14 -90 -2 27 91 -103 -95 -122 -71 40 -35 -35 99 78 64 -57 -57 -96 -40 30 -61 -97 80 3 87 -8 64 -57 -118 -27 64 122 -34 34
4756 34 7 -40 -55 81 50 47 11 -8 -14 85 44 27 22 -38 -34 -24 -48 55 -27 182 70 -27 30 -10 -55 -35 126 19 180 138 -68 -50 106
4343 106 89 161 -16 -52 101 53 1 -41 -44 -10 24 112 13 -135 -46 14 -79 39 -24 -25 -47 37 -43 72 20 1 -79 49 90 57 37 -75
3942 -75 32 -86 -11 -124 -24 -50 59 28 21 51 -75 129 -1 57 0 -50 -13 92 62 97 -11 2 -19 3 -9 82 80 119 24 -9 44
3554 44 52 -64 -21 -76 3 -85 -62 58 -1 -98 -44 45 64 -10 -13 105 97 -1 -59 82 24 -65 19 -150 31 -19 86 -28 2 -60 -28 1 89
3141 89 -21 1 -88 53 16 -37 5 -122 -112 -89 0 49 90 -107 -43 142 -3 5 -58 49 5 17 119 -58 -36 22 -164 34 -2 -82
2765h2K36j38p4R4j4j00j8P7l8J11m4P0j18rJ56j9j09J29m9o7k9O1n6j3J6k3%L9m6J7K8j01
2365a13K14j76J48k7k1j37J05M7N6j54L3j10O4J30M2j91L2m8Q0N6N3Rj32P4R1p9k3m7J12o0
1989B8m3N8J3j7J9j00qJ28qr3o5k2K09O0o7j6l1q3J04k6p0J59Nj75j0k1R%qJ51q4m0L6O8q7
1551b7P9n6j3K3P2n5%r2O7Q6j17J35O1j69P5n0k5j24L2J20P8j48o7Q3M6jR3p9q5P0jJ38j16
1138C3N8k3l1k2O8p0N0j44P1Q0n0q3M1O5N1o8R2j04j35J76K5j2j53M6Q1k4l2j2J30o9o6p6
737a07m8J49j5o9K28p9q8J77m0m9L4m4M2o3R8L90K058j185j459Q5J2P1k7j31J04mo0j59J15
374f4M4l2O6Oj59oJ95Pl9p7LJ26l1r6p7N7J6k8j02K21rk01L0J35O0k7q0J0M4q4PJ60j26n2
-52a03O7n1K1M5R0J1p4p4J39j19K6j05J59mK6l2J0r3J26n5j8K4M1j08J83q0p6
$$ plain form
2765 -82 154 16 -58 36 22 -78 -96 -19 -57 54 10 80 -38 -47 109 90 -19 110 61 -6 -35 26 -30 -43 -27 -50 -50 -11 -57 -40 -12 -113
2365 -113 101 -75 73 46 25 -112 -7 40 96 -58 -25 -135 -71 59 101 -90 -58 -106 -26 30 83 92 -40 34 125 46 23 -24 88 28
1989 28 -15 43 56 39 58 -42 -50 78 70 -23 -88 -110 99 159 92 76 45 -38 66 40 -30 129 134 -41 -51 -72 -63 -63 -71 80 -4 -44 -8 60 -27
1551 -27 52 -4 -17 6 78 23 23 -69 -2 84 -33 102 163 -6 69 19 -6 -130 -98 22 100 -48 -115 -32 14 13 106 27 -58 12 11 149 33
1138 33 91 68 37 15 83 13 63 -81 -10 70 20 -63 -22 43 94 26 118 14 -121 55 80 68 -85 -39 42 18 -14 -26 104 35 -31 -107
737 -107 -155 -6 -21 -90 138 59 -29 148 108 59 93 49 91 28 126 516 2574 1389 -70 15 27 98 71 -60 44 40 -20 -179 -64
374 -64 -20 -52 14 20 -139 -145 50 57 18 -59 -56 70 39 -57 -134 -77 -61 -89 -191 30 21 -180 -150 -15 45 18 -62 -52 -8 -92 -85 75 -51 -103
-52 -103 -36 -87 -66 -21 69 80 6 -68 71 -48 -22 -127 32 28 54 22 32 -61 65 10 -8 16 57 -51 132 52 -24
-390b4
##PAGE=	F1=-20251.6
##FIRST=	23151.189942674980557,	6007.9998942000029274,	0
##DATA TABLE=	(F2++(Y..Y)), PROFILE
6008b8N8MK9p3k0J4J43j04k7Np7k0o1jJ24N1Oj3k7o8J75r7m1O7Rl8M1j00K70j29o7J1O4j6
5582F4p8M4O6r6O2J10j56L9m5J30L2j67J10m0j51P2l4m9J05J6l9j38Q8R6j27K4J24n3j00K9
5207f2N4K4o1KO0L8M6k26M4l9K2J31l9k4J25lJ1j86L8l0K6J04o4q4J73r3Q8p9K5r1m8Q4J21
4794H7K5j03L5q0l3L7J12m7J0j1m5k5J13m0k8J0m9M1j5q3J66j11K06j26m8K4l5k4k0J87j11
4405A9J51n9j67M2P8J7L0j39o4J99r9p0L4K7j6K5O0n1j54P8P4p4Q4q1L9j7J16j01O9q4M7j10
4005i7J58L2n4K7j51J66j83J00o9Q1l8N8MK9k5l6J25j10K4k6m6M1O8MJ4j28L2kKj8J14J5n
3592A06n5j4L4j5j03J4k2P6o1l0Q2m1q9J28Q0m9r0M3Q2K9j03r8J21n2o5J02j19R9nJ19j28
3204b4lj8K5N4M3j07K2p6J40p3l6N2j15K8K0J11J4jj58R3O6o6J3o3J07n2K6J18k16J4M1j26
$$ plain form
6008 -28 30 34 63 -10 -30 -16 127 23 -4 1 -76 -96 -157 -158 -34 17 23 10 -17 -85 90 -7 -48 19 28 -10 31 -69 201 72 5 16 80 64
5582 64 -14 30 96 0 62 172 16 55 10 140 172 5 115 75 -76 -4 -38 -87 18 34 -5 -143 -55 41 -86 -62 62 9 -91 -62
5207 -62 -8 16 -45 -43 17 55 101 -125 -81 -120 -98 33 -6 -30 95 92 103 -83 -45 -75 -49 55 -9 -93 80 -13 75 -4 21 -70 -118 -34 87
4794 87 112 9 44 -36 -69 -32 80 33 43 32 -13 -38 75 35 7 17 -32 9 -6 -89 77 -34 172 46 -2 22 -13 -37 -57 130 19
4405 19 170 111 -56 -14 64 81 111 -28 -92 107 8 -62 -28 -1 -17 8 68 17 -137 -59 15 -59 25 -56 -17 -34 82 -19 50 -34 13 -97
4005 -97 61 93 39 66 -85 81 -102 -2 -71 10 -28 30 34 63 38 2 127 17 41 15 -31 10 78 82 96 -32 0 -2 0 -18 96 111 106
3592 106 51 37 71 56 -47 -33 -55 21 -40 -70 12 -29 -118 10 90 41 -49 -6 76 105 2 -96 25 -27 -92 10 -109 -10 -15 104 -24
3204 -24 -27 -45 -20 34 77 -30 -8 -84 56 -17 -53 -1 -116 -88 -68 43 57 56 -102 -9 57 -9 4 -59 48 -4 22 140 -76 -62 -21 -147
2803a47K13p7o5K45j00o9K6J7n9o3R4o2O8oP7r2%J36l1j32J45m8r5nN4n5m6P8o7K0L1l3J9
2390b9J7q4J57j32J24lm2p9J00L2Pj34N0j26O7J46P5k27K0l2P5RQ6k9q4N9R4p9n6k8J34m7
1989D1n3O4N1p6K1o6j4J13Lq5o9qJ63L5m5k9k0m2J29j01p9L10j29k12L4j9N3j9j6J24p0Mk9
1576c6M6m6O0oj4K2M5m0j7q4P5J01j15J29n3q3P5l4k1j21K8J18O5j26p1P6O4m6J01m6o3M1
1175B4K2J02j66J05m6Rj6P0n9Rj59J24Qrj01O5M3M3n8P2j05j36J72O9j7j29N5M1Mn4J0J62
775A54j06p7r0K3Q0lj6J81n1r7J71l5n9O8k2J1l1J57O51L652j910k759N7M4Q5n3j50J38o3
412e0j0j07P0M4j2M5m9j14O8J92j9q1n4k4J58m1q5KpRm0j07K22l1j66O0J05R2m0r1kP2j33
-2a24O5Q1r7k6P2p1K2P0Q6K5r0o7J27r6Mr8J46jL5j04M8m6Q3lm7K1N4r1J31n2r4
$$ plain form
2803 -147 66 -11 -76 169 69 0 26 43 -16 -79 15 -47 21 15 92 0 0 136 105 -27 118 70 -25 -30 24 -31 -77 1 -66 -46 -15 -48 -29
2390 -29 -12 -96 61 -71 53 50 8 -71 29 61 68 -66 -16 -142 -75 71 146 -81 -61 -93 -18 -9 77 48 -36 23 117 38 -18 -46 88 41
1989 41 -12 52 103 27 48 -18 -32 81 84 -1 -70 -78 85 120 75 46 26 -16 113 12 -67 243 114 -98 -64 -83 -30 -49 -65 59 -11 -7 -36
1576 -36 10 -36 24 18 4 26 71 31 14 -70 5 106 -9 120 67 -16 59 25 4 -117 -89 29 94 -32 -103 -27 37 -9 92 46 -17 24
1175 24 46 148 -18 87 41 50 34 104 45 54 -105 19 27 18 -83 -18 25 68 10 82 -23 -159 13 82 65 -64 -9 32 36 -18 -8 154
775 154 48 -29 -119 -96 -16 -19 -35 146 95 -2 169 134 75 143 121 132 101 258 909 4561 2651 -108 -51 -7 78 25 -125 13 -50
412 -50 -60 -167 -97 -53 -65 -20 -69 -183 -115 77 58 -23 -77 -101 57 16 -69 -67 -74 -65 -105 -212 10 -21 -187 -127 -22 70 30 -61 -63 9 -124
-2 -124 -59 22 -75 -101 -29 -100 -78 -8 78 103 13 -54 73 -23 -19 -117 29 28 63 -41 7 -39 44 41 -6 15 69 -22 109 57 -37
-390c7
##PAGE=	F1=-20345.9
##FIRST=	23151.189942674980557,	6007.9998942000029274,	0
##DATA TABLE=	(F2++(Y..Y)), PROFILE
6008b2R7l9J8q0M2pJ20j05n2J6o9k6q9P6P5Q5j7o4K7p9J73p7p9N0M6Nko4K09q4r9K9M2l3k3
5570@OP6p8N3J13j11J5r2J24L4j50O8J0j53J14o4k5J01mQj75Q6P5j42M0J24l3r9k1J25Oj01
5169g0O2L9M0K4k31P7m6lJ11J5l7J01L1Qj95O9m3PJ03m1j09J67r4O2n0l6n3j9P1J24Qk1l7
4756C4r6k5R6Q2o8L0nm7l6Q0jm4Nn2O7j3j11K14j40J66j21nKl2Ll3J52p9J18q6j08P6NM2k0
4318E0p9q0K18j28r8J07M7n9J7L2j1j39L6R9m3K5p2R4k6J13j18J9q5J17j36J67K6p7N9j62
3942h7K02k12R6KL0k2mL5M4n9N5L9q4k5J1l4O8MRK5j49O0K7l8j4J22Lj8j2K3Rn5m6k6nN6j3
3479A7q3M3l8o9J83N8r2q8N4M1Q9j17j31R8l3k6Q3m7L0LJ48j43k9J5J9R2j5r6Rm4J34j07k6
3066f8N3o1K9K1R0qm8r4Q6m6M3Po4R7m2L1J36k40lPm3J98j13j7K04m5p4k1M1j7q8Q9p2K6K8
$$ plain form
6008 -22 75 36 54 -26 16 9 129 24 -28 -12 -81 -107 -196 -120 -45 40 23 -41 -14 -93 80 3 -76 -26 20 25 23 -41 168 84 -15 14 56 23 0
5570 0 6 82 4 57 170 59 74 -18 106 140 -10 58 68 -85 29 -35 -60 41 37 45 -130 -44 31 -111 -71 53 20 -79 -100 25 31 -70
5169 -70 -8 31 71 95 -136 -59 -105 -108 3 18 -19 82 113 121 -74 -5 -48 -41 62 21 -88 79 -15 47 -3 -39 -92 -111 -40 84 92 71 34
4756 34 -62 -87 9 91 23 53 48 1 -35 45 44 0 5 -47 20 7 -104 110 -30 136 15 10 12 -20 -17 -50 102 23 141 55 -53 23 28 70 50
4318 50 -29 -109 109 -19 -117 -10 37 -22 -5 27 16 -123 -87 12 -31 -6 -78 16 -10 103 -15 4 -81 36 -100 67 93 16 75 -87
3942 -87 115 -97 -1 1 31 9 5 40 84 25 80 119 35 10 21 -13 55 59 68 93 -56 4 31 -7 -21 101 104 86 74 97 106 51 5 -21 -26 30 17
3479 17 -66 -23 -61 -130 53 111 19 -69 -15 26 115 -2 -133 -35 -68 -94 -11 -58 -28 -25 123 -20 -49 -34 -15 77 62 -34 -25 -69 65 -42 -68
3066 -68 -15 -76 -47 -26 64 56 8 -86 0 -46 -3 4 -60 37 -5 26 162 -78 -81 -74 -117 81 -32 -49 155 110 36 15 56 39 -49 40 -32 -6 22
2628B2P0n1KR6m0j53J66m6j18J0N8n1o7J32q9K9QMK0qn9P0o2P2L4p1nO5L3l7r9O5j06O7J04
2189F5R6k30K2mN3n3J08o1l1N1P4p7p8OJ46n2l2N6O6j12Mk2kO8K5r1k3jQ5K4l8l2J8m1J53
1751A40j49p3L99k62k05Q1j7Q4k4j0Q3n7N3j00J1LN2L4k1PJ6j8k2p0P0J28j21J07j41qP4k5
1351A9lj07K1J08N1q6o3O4M9r1J06k6l3K6L5N4j98J29o5N8%Q1o5l3j46J54m5J9r6Q0J5L7n6
937gN7j02j17J45R0j8q9P0j8L2o0K3J69r2r8r6P9JK2N4Q8l3q5J53l1p0Q9J7k3NJ86P90M667
524E798k279l661J2Q7P6o3j38J66j25K8n1L8J7K2K8r7n3J42J61m8j14m4l4J69m1n9N8n8mm9
149a16r1J87m2j02O9Q6Q6l3r5j0R3j88J13L6o8RL3n8L6N7P3Lo3m2R9o2k3j13J40J5K7j46N1
-265c9NM4M4o2K5O0o6O4j3j01
$$ plain form
2628 22 92 41 43 139 99 -54 112 66 -52 -42 16 -35 -102 30 -59 -30 -22 -18 2 -6 -65 5 -57 15 49 -22 -27 38 71 34 -65 0 -106 -39 65
2189 65 161 -69 -47 -51 2 -51 57 -4 -35 16 90 13 -65 -59 87 35 3 59 125 13 17 -5 -7 61 86 -5 -28 -29 56 80 42 10 28 -13 140
1751 140 -9 -82 317 55 -150 -69 -86 -2 -26 -36 47 -10 43 -57 -46 -43 9 43 22 29 45 27 5 -65 5 133 12 119 -22 -30 44 19
1351 19 16 -91 -70 38 89 3 -60 4 53 -38 68 42 9 35 70 124 -74 55 -10 48 48 129 64 31 -115 39 -6 13 -83 -3 12 49 -7
937 -7 50 -52 -169 -24 66 48 -41 29 11 43 -17 6 175 83 -15 -111 -32 -31 -9 45 133 100 15 168 137 67 156 173 150 155 341 1131 5798
524 5798 3519 -142 -130 -43 33 -30 -168 -2 -127 -99 -150 -112 -95 -73 -45 -142 -195 -53 108 60 -54 -98 -132 37 -4 -63 -5 -63 -67 -116
149 -116 -207 -20 -62 -164 -95 -9 77 44 -51 -61 32 -156 -43 -7 -75 -66 -33 -91 -55 2 75 78 15 -27 72 10 -13 -126 14 29 56 -90 -39
-265 -39 -34 10 54 -8 17 77 11 75 62 -39
-390c9
##PAGE=	F1=-20440.3
##FIRST=	23151.189942674980557,	6007.9998942000029274,	0
##DATA TABLE=	(F2++(Y..Y)), PROFILE
6008eJ10p6Lq0J04qO0p9n9%m7k6j22J50K4J03l2j34J04o6J33m5r0J3P1N7o2qJ34m9j06M0J8
5595C0o3M7k2M5k9L3J23p8Kj35R7M8j06K0N2j55J45p3LQ3l0L9j84Q8L2j34M8J14j2q2n8J69
5194E7k3j12R6J2K9Nj95R7m8j4O3O7l6P3N4j7j41Q1p6RP0j7j12J52p6J1j3r8j6OQ2R0J2N5
4769A27j12p6k5J38N2q2N3k3k4m0J5N7n4k4n1O6J5j12K38j55J00r8J6jl2K9nO6l0O4q7o1J15
4355E9l7M7o4k3q5K18j42j13J34O4r0K2RJ2j06k1J27j1l6m1J29l8Q3j28j6n1J62j57J55J8
3980H0q6O0j42K08j99P1P4l1J5n6M8M1n3J07k5n4q4N2k8J02n5j7P5j68P2O6r1qJ27l8J0QO6
3567A47j1r2K6o1qK1L8j10Nm7l9K04L3j04p2K8J0J42j19j52Q9j5J8L0L1ml2J76j51m0K7J9
3166a3J24p6o9j6j1J33j21k6M8K0LL6L1j4r4l0N4j15J51j5n9P6j5J2J64k37l8k5L8J56j16
$$ plain form
6008 -5 105 29 32 -48 56 48 108 29 -30 -30 -77 -103 -225 -75 -51 52 20 -114 -10 -76 57 12 -78 -65 6 63 1 -7 127 78 -28 12 30
5595 30 -33 14 -8 37 8 41 164 86 88 -47 50 98 -8 12 64 -91 54 -19 -16 67 37 76 -108 -20 12 -122 -74 40 28 -54 -112 57
5194 57 34 -78 18 30 59 64 -131 -34 -82 -96 -33 34 -2 71 125 108 -33 48 -28 -19 51 34 -78 74 -2 9 -4 -102 -118 -112 -30 60 72 127
4769 127 15 -61 -86 52 104 22 75 52 28 -12 3 60 6 -18 -69 -3 12 -100 138 -17 83 -15 1 0 -32 -3 -8 58 28 92 5 -56 59
4355 59 22 69 5 -18 -103 115 -27 -140 -6 58 -32 -10 -1 11 -95 -116 11 0 -36 -77 52 14 97 -31 -47 -98 64 -93 62 80
3980 80 -6 54 -88 120 -79 -8 66 35 50 -6 42 83 30 137 112 58 -26 26 -2 100 45 28 103 -65 7 73 -18 -26 101 63 73 81 147
3567 147 136 44 70 9 1 22 60 -50 -45 -92 -131 73 106 2 -70 -42 -32 110 -9 -161 -72 -87 -69 -39 -8 -12 -44 132 -19 -59 -32 -13
3166 -13 111 35 -34 -50 -61 72 -49 -75 -27 -7 -4 32 63 49 -45 -75 -21 -136 15 0 -59 17 2 14 178 -59 -97 -122 -84 72 -44
2778d4K7J34Pq1l2M7J3q6P6q0kN2N6j1k0O2m6j67J92m8j27%Q6n1o8J70r4K1j3M3K5l4l7kj2
2340d4J5P3r9N5J7N2o4o3Q5p0N5L1J13k17L1L5J6j06J11q6K8M3M2p0q2M3J27o4K7L0N3j06
1939A1k9J3RK3M4j03N0qJ5J7l7k4P1q3J63j44n4L76l43j54J23j2R8k3J1L9n3R5j63j6N0M8
1538A0N9m2j9nJ1po9O2J45j21P9j82L7P1j8Np4J0P9M4l4m7N3J6j25J08l0%K1L2J5j96J22p8
1113f8R4K0R4p8o6j01J49n9L2p9Q2oK6p4P5j06q3J09R0l2k9P9q1M8n3L1J50m5j22r8J13m4
712c2M0J13kl2o5J24l5q3R8P1o1L3J77P43M629k121l758j9J11P6q1r7J72j61L1mK6j8M9K0
336e6j09kJ83J04o7j20n6k2J72m0l2P7q8j7l8o9J28k8m3N3Q7M7j8q0j4R7k24J35K8k8L0l1
-64d1j9N7NO3m1j2j0O1k8l8j39J36M3jj53K3N5J5O6m8K9M7k9lL0r6
$$ plain form
2778 -44 -17 117 124 43 11 58 71 -15 61 -19 -21 31 87 76 56 118 72 -95 97 49 -78 -78 8 -43 -111 59 -35 -14 -27 16 41 7 -30 -32 -44
2340 -44 -29 44 -55 0 17 69 5 -58 27 -43 12 43 156 -61 -30 5 21 -85 26 -60 -32 11 53 -17 -99 -56 71 7 34 64 117 11
1939 11 -18 -5 4 27 71 -32 18 10 25 42 5 -19 52 -31 132 -12 -66 310 -33 -187 -64 -76 22 -1 10 49 -4 91 -72 -88 -38 10
1538 10 69 27 8 3 14 7 -62 0 145 24 103 -79 -42 29 11 16 -58 -48 31 75 41 -6 47 63 -62 46 16 16 37 69 84 -112 10 -68
1113 -68 26 46 140 62 -4 -105 44 -15 17 -62 20 14 40 -34 41 -65 -148 -39 51 19 -10 69 -12 36 -17 14 164 119 -3 -101 12 -32
712 -32 8 121 119 87 22 146 111 28 126 197 136 169 346 1089 5718 3597 -161 -180 -69 7 -74 -171 1 -160 -129 -133 -107 -125 -76 -56
336 -56 -165 -167 16 120 53 -67 -123 -145 27 -13 -45 32 -56 -73 -111 -180 -52 -80 -123 -70 17 64 46 -34 -48 49 -175 -40 -12 -40 -10 -41
-64 -41 -60 -3 2 65 24 12 2 63 35 -3 -142 -6 37 36 -117 -94 -39 -24 42 -6 23 70 41 38 68 -28
-390b8
##PAGE=	F1=-20534.6
##FIRST=	23151.189942674980557,	6007.9998942000029274,	0
##DATA TABLE=	(F2++(Y..Y)), PROFILE
6008A3J00j02qo8J32J3j4k3o0k1k2k7j37J86j6R4k8j86J69l0O2j7o4l1P6R8j20N4P6m1q1M0
5607A7j5r0J15l4pK0J2J36o4lj61O4P3m5k7P2j60J53m9K5N2o2N7j56Q9k6j03M4R5J3o0o8J74
5194H1p4p7J11k5J1j5j23R9m7rJ6Q7k2N2M8m6n1P9j21K6K7J0j03J25m1m4J5j38J8LJ28L4K2
4781E6J01j55m0k6J43K5p9P1n1J1m0n1J06m9o7m0M2M7r4K30j46K8n9J4Ol1M9N1l4PNm1m5J47
4355I1m2K8q6Qq3K13j56j01J09P5j06M7j4K3o3p0J49Mp6oJ25l6L7j29k7J3J63j66J20Np2L3
3955A0r3J78j56L5J18o4N6q9M9L4k2J00m6k2j42R0l6J29r0n5J41j73M8J06j38lJ33q8O1nR5
3567A61j5j03O8p3k1j7O9r1l6n7oJ94J1r2n1k1nJ62r0j60J00j4O2m1R7%j00J91j41m2K1L0
3166a0J28j25k0m6MJ37j13l3N0R9n3P2m1rj36K0K0j29K29n7l9M4K3l3J95k08q4l5R5R9q4L9
$$ plain form
6008 13 113 11 3 -65 67 80 66 43 -17 -38 -60 -87 -224 -38 -54 40 12 -174 -5 -35 27 10 -54 -85 -9 89 -31 23 99 58 -23 17
5607 17 2 -88 27 -7 -14 6 18 154 90 87 -74 -10 63 18 -9 63 -97 56 7 32 84 22 79 -77 12 -14 -117 -73 22 35 -25 -93 81
5194 81 7 -70 41 16 27 12 -111 -12 -59 -68 -52 35 13 65 113 67 16 95 -26 0 27 37 -66 59 18 -26 -11 -149 -131 -128 0 34 56
4781 56 157 2 -38 -64 79 104 25 96 45 56 16 -35 71 22 -45 -85 -43 4 -90 140 -6 22 -37 -23 -17 -48 1 52 18 25 30 -11 -56 91
4355 91 49 77 -9 -1 -84 129 -27 -128 -19 56 -50 -3 -17 6 -57 -127 22 26 -50 -56 69 33 70 -59 -86 -73 90 -76 44 49 -23 10
3955 10 -83 95 -61 -26 92 28 84 -5 44 78 56 156 110 88 -54 36 0 129 39 -16 125 -48 0 106 -32 -35 98 10 71 66 161
3567 161 146 43 111 38 17 0 69 -22 -58 -115 -121 73 84 -8 -59 -80 -85 77 -13 -173 -73 -87 -25 -66 31 31 -69 122 -19 -61 -40 -10
3166 -10 118 -7 -27 -73 -69 68 -45 -78 -28 71 18 90 49 40 -96 -76 -56 -185 44 -13 -52 -8 15 -18 177 -31 -115 -150 -55 44 -40 -1
2765aP8L2p4k3M1J9n9P1j00qN7M9J6p0N5n6j62K12n2j19l8J37n8n0J88r6Jj7O3L3m5j7l3j3
2340c9l3J02j14R3l0P8p3l4J07l7L6m1J32k04L6P6l2j22R7j11Q5L4J4n9o4P3O0n8J00j4K6
1952H4o0o9L0KOM4r7J13l3j7Jk8j0J21j42J43q3l5K51l39q6J53kR0k4M7qn3J21j97k2P7L8
1538A6P3o9n3j0M5K3q8O3J30j10O1j75M8P1j2j3k9jL3M4J5k5M2qj45J03m3K5J8J1lj55Q6p3
1113a05J00L4R3q3p8l7J14l8K8n7Q0j8Oj09J28j23l4P4P9o3L7P3j26M6m5L8J14Jj37r2J24
725B4l4M2J34n2l9n3R0m3r5J00J26j04M4J43N40L627j544l066k0J00J03j09n0J59j65nL5K8
374h4m1M5K5o9J7J76K6o2r2q9NJ79l9j9O2r4k9kn5P2Kj3K1J05j4rm1j0Q7k30J27M2K8J4q3
-64d2K5P5p0O1p7L9J1K4j0k5j55J18P5l6j35pQ6mN4%K4J6J2n2O6p9
$$ plain form
2765 -1 77 109 35 12 53 72 13 84 -16 -24 33 82 98 28 83 27 -135 77 25 -94 -132 5 -53 -103 85 -11 -10 -27 36 69 24 7 -26 -39
2340 -39 -72 30 -84 9 -21 57 -16 -50 57 20 56 15 147 -57 -21 55 23 -99 -2 -113 -28 6 20 -39 -103 -30 30 -28 72 58 84
1952 84 24 -45 -15 -13 -7 37 -60 53 20 3 4 -24 -34 87 -55 88 5 -30 221 -118 -204 -51 -53 37 13 60 52 -1 120 -77 -99 -22 16
1538 16 89 20 -33 -43 2 25 -63 0 130 20 81 -94 -46 25 13 0 -29 -30 3 47 62 37 79 71 -74 29 -14 11 29 40 37 -118 -32 -105
1113 -105 -5 29 122 39 -39 -76 38 0 28 -29 51 33 39 -70 58 -65 -99 -25 54 -9 28 101 -25 21 -24 14 128 129 -8 -100 24
725 24 -10 32 166 114 75 22 112 69 -26 74 200 96 140 283 823 4450 2906 -160 -180 -80 23 -86 -136 23 -142 -147 -112 -84
374 -84 -125 -80 -55 -124 -107 69 95 33 -59 -148 -143 36 -3 -22 40 -54 -83 -85 -140 -68 -66 -79 -58 47 33 24 -17 -27 60 -170 -43 -1 27 41 -42
-64 -42 -17 58 -12 49 -28 11 22 46 36 11 -144 -26 49 13 -122 -129 -43 -47 7 7 31 47 59 7 73 -6
-390f
##PAGE=	F1=-20629
##FIRST=	23151.189942674980557,	6007.9998942000029274,	0
##DATA TABLE=	(F2++(Y..Y)), PROFILE
6008B3P7j09j0m9J12L8o0L7o0k5Km2j20J69m4O5lj95J93J6k1Mro7O2J10j56J07M1n3l3L0m9
5595a9j10J72m1n0M5lJ40n8jj69L5J05J8o9O9j61J28%L7J8r7O9j00Q2q1n9L2O8L8l7n2J42
5194I1j43oJ19o5kl7l8Q3m8J1mO7pL5K3o8L7O7j56M6lL5r3R0Lq4K6j47N1l4J93j7J9J09j47
4756Fk0j4J08Mo1Q2o8L7l9r7J32l3j00k8J8O2p0J92j19k6qnMj9N9J02j05J3l4M1n5J54k5m
4330H4q5J1p7K14j78n7N4O6r8Q0m0L3k2r3J53Kq9J3Q9j7j0j17j4P7J31j61P0j9k8j2l1J25
3930E4j01nJ15m5Q2r5M1L2J5M8l0Mj75J08m8J34r8q4J95j49k2J43j69PJ34j16J02m5J02jq9
3542D4O1o6k8m0P7k7q3o1K1J67op5l0o4pJ39l6j53J23l5J01j16J52K6j79J88j09l9KN2R6j50
3141e5M1p1qJ44q9n0O9J51j20J15r3jj65M7jr9K55j01l%N8q3K11j62j21j6J17L6k9J0P0J8
$$ plain form
6008 23 100 -9 -19 -68 44 82 22 59 -1 -26 -24 -66 -186 -17 -61 4 1 -194 -1 15 -6 -2 -11 -78 -16 94 -62 45 86 33 0 30 -19
5595 -19 -129 43 2 -48 -3 -6 134 76 75 -94 -59 46 64 -5 64 -97 31 31 68 86 -11 58 -42 40 -41 -100 -68 0 38 1 -51 91
5194 91 -52 -58 61 -4 -6 -43 -81 2 -46 -35 -39 28 21 56 79 11 48 115 -41 5 2 37 -56 34 37 -47 -21 -168 -117 -151 42 25 44 153 6
4756 6 -14 -28 80 84 23 105 37 74 35 -62 70 37 -63 -91 -73 -11 -81 111 -8 -34 -42 -47 -43 -62 -3 99 -6 7 -27 14 -41 113 88 84
4330 84 -1 10 -67 147 -31 -88 -34 32 -66 14 -26 7 -15 -108 45 47 -42 -29 60 43 33 -84 -98 -21 110 -51 19 0 -28 -40 -71 54
3930 54 -47 -52 63 18 100 5 46 78 93 141 111 115 -60 48 0 134 36 -48 147 -2 -24 119 -50 -43 91 -25 77 32 134 133 44
3542 44 105 39 11 -29 48 21 -62 -123 -102 65 59 -16 -46 -110 -117 22 -14 -167 -44 -79 22 -94 58 84 -95 93 -16 -55 -53 -1 95 -55
3141 -55 -14 -85 -93 51 -38 -88 -19 132 12 127 34 33 -132 -85 -86 -185 70 -31 -34 -34 24 -59 152 -10 -131 -147 -30 6 -23 -13 57 75
2740G5m0k4L4Nk6Q3j33OM3N8K4j27P0p7j25K13n5r8r3K00p1k3J81j04j4jN2L6l0J0k5o1o8
2327a05J13j12J14o8R9p6rJ21j0J3q4J49j97L2R9p7q7O7j37J23L6jm6k6Q8n0k4J58o9LJ0j01
1926e4K4k6K1K6n9J45p8mk6j2J1J44j80Q5J6l3R4k59l4J67J0O1k5Q1n9n0J37j92qO5K6Q0p7
1513A7r9KQ0N2j15P5P7q9O3j45M2P8j3n2J2kj7M5M7jK5jj55Q9m0L1J0k4Kr1L2l8P3L9O6o8
1063Go7J8P3ljk7P8j9j3j52J89j45L1M1O7j00Q8N2j35L0m7M3P2K0j29p9J17J6K2J23n1m5o0
649A4O2m3r9R8J64j54M1J01K95K223q54j991ON7J43j35oJ33j50o2P1K8l5JM2QQJ26n5l4m5
261d2j21K5K01m7j8L0q1l6M0m9M4K8j5qJ18p4j5J7lP4k04R3N2R2l5r5M1R3j40N9p9P0OLrJ6
-189C1j52Q4R4n7j12j4Q3j2K3O5Nk1M7p8Q5n7
$$ plain form
2740 75 35 11 45 50 24 107 -26 -20 23 81 105 -22 48 -29 -154 59 4 -94 -187 13 -58 -81 100 -4 -18 -19 33 69 39 49 24 -37 -105
2327 -105 8 -104 10 -58 41 -35 -44 77 67 80 -4 145 -52 -20 79 2 -85 -18 -155 -32 4 3 -43 -69 19 -31 -55 103 34 37 47 -54
1926 -54 -30 -56 -35 -9 -68 77 -1 -5 -31 -43 -32 112 -68 17 33 0 94 -165 -199 -32 -22 39 14 95 36 -14 123 -69 -77 -12 14 94 17
1513 17 -82 -80 0 52 -63 12 89 0 63 -82 -40 38 25 -27 -15 -17 -34 11 58 57 82 81 -74 15 -25 6 16 -8 -6 -97 -65 -103 -30 9 75 7
1063 7 -60 -42 31 28 27 0 78 59 46 -106 83 -62 -31 10 77 -23 65 117 -18 12 -35 8 80 100 -29 -108 9 25 47 170 119 74 14
649 14 76 33 -66 32 196 42 83 184 479 2702 1848 -143 -137 -80 63 -72 -78 55 -95 -157 -86 -58 -93 -92 -50 -42 -34 92 37 3 -42
261 -42 -163 -138 63 16 -2 28 -53 -89 -49 -98 -54 -26 -41 -49 69 -5 -20 -3 -6 68 -136 -43 9 101 66 -29 12 105 -35 24 -55 15 21 24 15 31
-189 31 -121 -37 57 0 -112 -126 -43 -55 -32 33 38 17 64 -14 71 14
-390A4
##PAGE=	F1=-20723.4
##FIRST=	23151.189942674980557,	6007.9998942000029274,	0
##DATA TABLE=	(F2++(Y..Y)), PROFILE
6008A9N0r2ll0O0M6n6P1o2KK2p2p7J12o7M0L0j63J70N6r5J9N3q0M1Q3j51J33J4o1J8J8p8j24
5582a54K12n1n8L9j3J30m9Qj67J9J30O5q9M3j46P0M9M3rj22P6l6N5j02j9K1L1N2qk7R0k12
5182a29P8J24r1qn0K8N4n3L8JK7oK7Kp9P9O2j66N0nN1q1N0M8j02K1j34Q7q4K36l8kQ5r6k9
4743eJ3N5j0m2Q4o4N1m2j12J28j7r5k9OM8m2J37r8m7M7k6j5NN4J29j29lm3J31p8J24%l6o6
4318A3po4K14k02RLK7o4J06p0M8Lq2J34rq0QM6J3n4q8J0J15R0j37J6n1L3o4K9O9m9m1P0J2
3880FQ6q0L0L9M1j6PJ1j67R5m9J14q5r4K12q9j20J77j87K4J22j01J03q7Q7K4o6J6m5k0l8O6
3479A6N8j28n5K8J42k2o2j3p8j0R1J9j33J40o8J34j79J93N2k40J67o3k9k1O9M7j41P9p4m5
3103a26J52n8q1J00J62j69J51j07Rj71N1rn2K29j33M7n0Q1j10J93j18j22J7J04j3K3l8J06
$$ plain form
6008 19 69 -23 -26 -56 4 50 -6 65 3 5 27 -45 -122 -10 -77 -37 -7 -170 0 56 -39 -20 33 -47 -6 77 -74 59 73 12 30 48 -30 -154
5582 -154 58 7 -51 -12 -25 105 56 64 -103 -84 46 111 22 65 -81 -11 38 81 72 -50 26 -10 45 -57 -76 -55 -24 28 20 -7 83 -129
5182 -129 -51 73 -18 -26 -76 -48 6 -47 -9 -8 19 13 40 42 -37 42 104 -62 -12 -17 34 -47 3 51 -51 -30 -164 -77 -161 75 37 35 120 24 -5
4743 -5 8 63 53 11 95 31 82 40 -72 56 39 -56 -85 -79 -31 -73 64 -34 -81 -34 -60 -75 -70 -16 113 -16 -19 -62 69 -9 115 115 79 13
4318 13 6 -58 156 -46 -37 -34 -7 -71 35 -35 13 16 -66 68 59 -21 -13 33 46 -8 -96 -86 29 119 -18 -2 -53 -20 -84 -55 14 -35 -76 -6 6
3880 6 92 12 42 81 122 106 113 124 -43 52 3 117 32 -62 150 61 -59 118 -69 -45 77 -24 79 -8 79 103 37 53 8 -12 -50 16
3479 16 74 -54 -109 -81 61 39 -23 -36 -114 -124 -33 -14 -147 -7 -75 59 -120 73 125 -115 52 -11 -40 -61 8 55 -86 -7 -81 -126
3103 -126 26 -32 -113 -13 149 -20 131 24 33 -138 -87 -96 -148 81 -52 -5 -55 26 -84 109 -9 -131 -114 -10 -23 0 -38 68
2753F8k6J5n7L8j6oJ05j68L1J5Q6J2j61Q9j07n6J84n6o7j43K55q4JJ47j14j3K7J1K8PM9Kj21
2340b5r5J05r1J19r2J01p3J4J15J0Kr7J53j89K4R1j08rL1j66J33N5ll2K4Q0j72L2J77j24K
1952hQ0j20Kn6N0jOJ42j33L3n0LL1J37j73oJ14m3k0j46j3J66J3K1k3R7j07m1J44j47J3K1J4
1538@Q1m4j57L0R9O6j32Q7J0o3P8j19L5R8l0r0L5Mm5M6M7J7LL4j59P3rJ0Lo3J5k8j5K2K3L7
1088aJ8l6m3M6M4K8n4J4P7j4k1j87K21j58J04ON7j22J03L5j05J1n7L8L2Pr9o2J00O8rJ03k2
674A22m3q1M9k8q5Q9J63j97L3O9J16J046l34j032L4QJ59j38L3J06j38j14J05J7mp3P3Q7j6
311B6N9j10Jpj28K1K29n8k2ko0l8P4m3M0L2k6j8J14j18l8P5MO0j49M3N3J32r1n9J3J07j70
-102e4N4n5P7k2Jj9O6j29M4R5n3j04J3M2kj5J23k1m6O4p8Q1l6
$$ plain form
2753 68 42 57 0 38 22 16 121 -47 -16 -1 85 97 -64 25 -82 -138 46 -10 -77 -220 35 -49 -48 99 -15 -28 -1 10 38 45 94 96 -25
2340 -25 -120 -15 -106 13 -79 22 -51 -37 78 88 90 -7 146 -43 -19 72 -36 -45 -14 -180 -47 8 5 -27 -3 77 -95 -63 114 -10 -8
1952 -8 72 -48 -46 -102 -52 -53 -47 95 -38 -5 -55 -52 -21 116 -57 -63 51 8 -12 -158 -171 -5 8 29 6 103 -4 -45 99 -48 -35 -14 0
1538 0 81 37 -120 -90 9 75 -57 30 40 -23 55 -64 -29 69 39 -51 -16 -12 -57 -11 36 53 56 90 -69 4 -5 5 8 -55 -40 -68 -83 -61 -38 -1
1088 -1 17 -19 -62 -16 28 56 2 16 93 79 58 -129 92 -66 38 44 101 -21 82 117 12 23 -34 4 36 43 -56 -118 -18 50 41 144 122
674 122 79 -2 47 19 -66 23 186 -11 22 91 207 1253 919 -113 -79 -71 88 -50 -17 89 -49 -163 -58 -41 -45 -118 -45 42 26
311 26 85 -25 -24 -31 -159 -138 91 33 11 9 -51 -89 -15 -58 -18 14 -12 -30 84 -34 -72 3 7 67 -82 -39 14 146 55 -4 9 116 -54
-102 -54 0 -55 22 0 1 -18 48 -81 -37 58 5 -99 -86 -44 -46 -61 62 41 -5 59 -19 62 26
-390B6
##PAGE=	F1=-20817.7
##FIRST=	23151.189942674980557,	6007.9998942000029274,	0
##DATA TABLE=	(F2++(Y..Y)), PROFILE
6008@K6n1Qj6LK8j0O7o2N2L6j04l5M6r1L8N2j01J16P0j36K9J00p0K0L4j11J28k2m5N7Mr8j31
5582a69K36p2k5K3k3J04l3J6j62J6J46Q4p9Kj12oP6M9j8j24P2J1J6q5PJ7j0M5K8j2L7k44J46
5169d3J20r7j2m1N6J7o2O7R%j6K5Jq7O9O6j50K9J8N3o1J9P7j01J4j12J19j20K25k0k8M3m0
4756C7n6N6Nk1l0P8m2N4m1j08R8j2l9m2%J7j4P8r4l4Q3l7m0L8L1J24j06k0k3J85r6O4K4n6
4330F1m5l3m0K06k14P7k2m0j3J10r5O8Jm5R4oo3j8J4M3q9m3K8J11P2j03k3r3R3j08P2L3j1
3917b1o7NP5P2n9K2M4O3o4L9nj14N0k5P7o6r2J93ok14K08j96M0R4m2O0j11O3M7n2l7j4rj2
3491e4M8J26j50l9OJ24l8n7Qo3k6M2O3j05J32r9J61k11K12O2k67J32j2j0l8O3Qj03P0n3q4
3103a52J55k6j26J25J40j72J65r1K5j49L8k1qJ67j44R8r3R4j05J42q7q1L5P7m0N8o9J41p0
$$ plain form
6008 0 26 -25 -17 -33 -30 -2 -12 55 -7 45 81 -23 -58 -12 -103 -65 -13 -114 2 72 -64 -35 65 -5 15 49 -62 66 44 -1 56 60 -38 -169
5582 -169 67 -5 -30 -7 -30 74 41 57 -105 -89 57 141 62 64 -48 -54 22 71 53 -71 1 12 28 -57 -50 -33 -43 2 30 18 55 -189 -43
5169 -43 77 -20 -32 -73 -17 0 -62 5 14 14 -2 23 24 -63 6 72 -78 -49 -31 22 -39 -20 57 -44 -30 -142 -23 -143 82 62 34 77 37
4756 37 -19 37 42 21 -9 69 27 81 40 -68 30 18 -21 -63 -63 -46 -60 18 -76 -110 -27 -64 -104 -66 -35 89 -17 -37 -60 125 29 93 117 61
4330 61 16 -17 -57 149 -65 12 -10 -50 -63 47 -48 20 21 -24 70 64 1 -17 -3 40 -49 -92 -64 47 119 16 -7 -100 -7 -115 -43 -10 -21
3917 -21 -88 -83 -8 64 5 27 71 134 70 109 104 -10 40 15 92 26 -66 127 121 -93 115 -81 -41 53 11 71 -40 23 70 18 -19 -33 -42 -54
3491 -54 -6 120 -30 -69 -63 61 23 -34 -26 -89 -115 -73 -10 -115 17 -82 79 -132 80 142 -125 7 -5 -15 -53 10 18 -85 -15 -68 -152
3103 -152 3 -23 -149 -24 116 -56 109 18 43 -106 -68 -89 -97 70 -74 24 -69 25 -80 62 -25 -106 -71 6 -34 24 -45 96 26
2740B6O8j18N1k3mJ20j82N0j9J29k4j50R4j32K9J23n7k9j64K85r7J8Q9j12JN2m0OM9Q9J9j43
2340Dj18Q3n5J10j03Q1o1L7Q3K5J0q5J27j70K5N6j25Q2nj84J21P8Lj9P4N0k59P7J61j68K2
1952d3J28j24k5o1O9j7O5J22j79O3o0QM5J03j20j05J78m3o3n3j3J55Jj6j8Q8j43k8J41q1K8
1563Bk2OP3K8k18O2R0O5j28Q2l2m1R0j09L8J22p0r8L4Ql0M2J5K0j8P8j53O5M1l6Mr1K6Rl8
1125h4R2l7L0k7pk3N2K9N2j19O4O9qrk06J99j48J71l3M8j17Q1L4m2no4J4%k2n2m8P7Q7l6R1
687A03J0l4r8N0pn2P3J21k20L0N6M8M03r2m63M0k0J34j15O6Q5j44j38J29pL9j52J13J36l7
311E7Pj28K6%r9kK41o7j5k8l6m3R6k5L7J2k4qR1j32o3J11jL9p6qN3J22j16km4J14j45M6l2
-127d2P1n6Rl4J07j00J5Q2k0j17N3j9K7m4J50m3n5O7n9N5k4
$$ plain form
2740 26 94 -24 27 4 0 120 -62 -12 -31 98 74 -76 18 -114 -85 38 -19 -48 -212 73 -24 -6 83 -29 -28 24 -16 -10 39 128 147 4
2340 4 -114 -31 -86 24 -79 2 -59 -22 61 86 96 11 138 -32 -7 49 -76 6 1 -183 -62 16 19 0 74 124 -135 -58 103 -65 -43
1952 -43 85 -39 -64 -125 -56 -73 -8 114 -65 -2 -62 -54 -9 94 -26 -131 47 4 -59 -112 -125 30 31 15 -3 85 -58 -86 55 -26 2
1563 2 -20 -14 59 87 -131 -69 21 86 -42 40 8 -33 57 -52 -14 108 38 -60 -26 -18 -48 -6 9 29 11 89 -64 1 42 6 10 -81 -55 -46 -84
1125 -84 8 -29 1 -26 -33 -56 -4 25 77 -42 22 91 83 74 -132 67 -81 90 57 105 -12 69 103 61 56 -8 6 6 -16 -68 -116 -39 48 12 103
687 103 113 79 -19 31 24 -28 45 166 -54 -24 32 80 483 391 -72 -32 -52 82 -33 33 118 -26 -164 -35 -42 -3 -155 -42 94 57
311 57 64 -64 -38 -38 -137 -139 102 35 20 -8 -44 -87 9 -16 21 33 9 1 92 -40 -103 8 7 46 -30 -38 15 137 21 19 -25 89 -56 -10 -42
-127 -42 29 -27 -18 -52 55 -45 -30 52 32 -85 -32 -51 -24 -68 82 39 -16 51 -8 47 23
-390B3
##PAGE=	F1=-20912.1
##FIRST=	23151.189942674980557,	6007.9998942000029274,	0
##DATA TABLE=	(F2++(Y..Y)), PROFILE
6008b5LKK1pm0kM8L6o5J06L8j11k4mj06O6N0l4N6N4j32K8J14m2Lj3n6J04o7j2Q1j3j07j29
5582a79K45j00L7J4l6O7k0J8j45J0J57P5m7l9o4p4O8O3j2r6N3K8k0m4J0K7m4J5N8nj0k13J79
5169b4J05q6l0mM3j6o9Q9oLj7K9J3q7K4O7j20oM3M9k7kQ5r8K2r1J31j20J58K9m7Mj7p6J06
4731E7k6l5l1P1rM9k6j01M6j8N4n5j6kJL3j09jQ4l6m9O9lR7o0j4NJ81j03kM9o4l6n0j0J90
4280A30k10J29k3j08L4Q8j00Q5l5J0M0K2m5n1nO6j08JL1P0R1o9l1j40J28j34R2K6Pp8m2J04
3880b5N2m6K0L1R7q9N5l5l4j5K7L2n2q8J51P3k71K32j97M8N3M1pj07M3N9n4p6K7%J4K9J48
3466A36j32j4l7J04m8n5K9k8n9J5R3p7R5j26J87k00J97N5k55R1K9J9m1J9jn1J6k0j03J50Q
3078dj74J25J03j20J47o6N3j05J5m7K1J00j42J36j17J01p8P4o8j3J7O2m2O3n9J31p9R0j75
$$ plain form
6008 -25 -22 -20 1 -6 -46 -48 0 36 -29 77 115 4 -20 -24 -130 -64 -14 -48 8 62 -70 -42 72 30 33 20 -36 68 1 -11 70 57 -50 -179
5582 -179 66 -34 3 17 -19 48 28 46 -99 -89 68 143 96 57 -7 -81 -13 50 38 -58 -5 23 3 -41 -31 -4 -48 -33 25 20 10 -203 -24
5169 -24 81 -5 -35 -39 4 -12 -81 8 2 5 -12 17 30 -57 -33 34 -86 -92 -49 0 -27 -29 56 -42 -20 -111 20 -100 58 87 40 44 27 -49 57
4731 57 31 -4 -35 36 27 76 50 -51 -5 -23 31 -24 -40 -42 -41 -8 -117 -118 -34 -70 -119 -50 -53 44 -16 -30 -25 156 53 51 100 36 0 -50 -60 130
4280 130 -80 49 26 -82 -48 40 -60 25 -10 0 40 62 17 -34 -39 27 -81 -80 -49 21 112 43 12 -128 0 -134 -42 -16 -9 -87 -129 -25
3880 -25 27 -19 1 32 129 40 95 60 26 11 38 70 18 -70 81 154 -117 115 -82 -34 19 60 53 -54 -11 48 -6 -82 -55 -55 -41 -12 136
3466 136 4 -10 -47 57 9 -46 -17 -45 -104 -89 4 -73 22 -104 83 -117 80 135 -120 -29 0 19 -22 -3 -4 -55 -39 -59 -162 -12 -4
3078 -4 -178 -53 50 -70 77 11 64 -41 -26 -73 -52 48 -94 42 -75 26 -52 22 -46 -59 -42 20 -22 41 -18 113 34 124 -51
2715e1O0nj9J17j59N2m5J69p9r4P5j33J03M3o6J5j42K74j04K8K4r0J3O4q4k0Q0J09J2r9j37
2327h9N6j3Q4j00N0m4N4M0L2L3n3O3j30L3J4j25J48l4j82J02Q4J0j1J10J1k77Q5J28j94N0
1952f5J38j10m9l1P1qQ0J04j91O0m9%M8N9m7j69J83j0n7j1j4J36k4l4j9N7j49k3J28k3M0k9
1551hj2O7J07k68R2N1N3j01N4k6k7Q3j07M6J32j19p2K5nK6L2l7J2l4J02j28P1Q6q8Pr5L3J1
1138c7l1J51r0K2n5Nk4N9J0Q0j76J12M8JJ4k05J28j19K17o6L0p5L8L8M0j8o2j8k5n3Pm6N6
725d4O4m5Q3L2k0r5N2Nj0N1N7k08K7O1O0K08n1k50J4qP6p6Q1P6j65j33J35l3P6k11J53J38
324A00m8oj10L1k4m2l0K21p3Rm4j6o4J24JJ2k4JJ3O2j14p1J04j7N%m4O2O1q9L8j00J09p7N3
-114A3m4O7q3J5m5J25p5LO9L2j43Q0p8P1o1J36n4m4N7k7J5k3
$$ plain form
2715 -51 9 4 -15 102 -57 -5 -50 119 40 -54 21 -112 -9 34 -32 -17 -159 115 11 39 63 -27 -14 50 -34 -54 26 135 147 48 -89
2327 -89 -33 -46 38 -62 -12 -56 -2 38 70 103 50 113 -17 16 30 -95 53 19 -163 -61 23 33 22 132 143 -134 -49 79 -115 -65
1952 -65 73 -37 -86 -117 -46 -54 26 130 -61 -1 -50 -50 -2 57 10 -159 24 14 -43 -54 -68 68 44 10 -9 48 -101 -124 4 -19 21 -8
1551 -8 -20 47 154 -114 -22 29 82 -19 35 9 -18 65 -42 4 136 17 -55 -30 -35 -9 23 -14 -2 -36 66 -62 9 95 7 14 -81 -48 -37
1138 -37 -68 83 -7 15 -40 -35 -59 0 10 90 -86 26 74 75 89 -116 12 -107 110 44 74 -1 37 75 115 97 35 17 -8 -61 -54 -100 -44
725 -44 20 -25 58 90 70 -25 27 32 22 73 130 -78 -51 10 70 278 227 -23 -9 -17 59 -17 64 140 -25 -158 -23 -56 20 -191 -38 100
324 100 52 46 -64 -33 -57 -99 -129 92 19 28 -16 -32 -96 28 29 41 17 18 31 93 -21 -92 12 -5 0 0 -44 18 79 -10 28 -72 37 -40 13
-114 13 -31 36 -47 -32 -77 48 -27 -24 45 77 -66 14 -64 7 -54 82 28 -16 41 14 29 6
-390F
##PAGE=	F1=-21006.4
##FIRST=	23151.189942674980557,	6007.9998942000029274,	0
##DATA TABLE=	(F2++(Y..Y)), PROFILE
6008e1j7N0L7Jo4k0Q0Mo8J39K4p5n8k5r9J07K3K7KK1q9OR8oom0j6Q2j04J7R4m2j02j10K38
5570E8j29J07J7n0K8k7J5j05j2J70N0j2o4k1j08L2Q8ln0J9K4l7onM3o3l1P7jm1j28J73Q5p5
5144A8o5M7J6l8p7R9m3K8QL6J8p0k6N5r7l3N0M7J3j2P1r6M5o4J11q9O4Q6n3j5m1p3J51m2n6
4706b7l4O4L3L6jr8k1k4J62o6m9J1pRj19K7M8l2k6R3m6O6j2J3J9J29r7n0Q0p1l9m8J5J74j92
4268h0J47j5j50O1M9p2R1j00O9qN6k7p8pP1j01K6J6K0J35n2Oj85J24j37R3L9Lp2m7Q4L7n2
3855e6L0nJ44r7N3o1N0p8Q8rm9q4J02J16k81K50j88N4NJ06n3q6L1O1o9q8P8qK8J3J18p4Rq4
3429c4P5m1n5M4Rr9QJ20m9L6j53K20j54J50L7k16M6N7N5l5m5J0jm8nq5J31M4k01R6O8l7J05
3016E3m9Q7n4j5p8L5N0j34J38j10J07n2J7n3M8l6P0k3M6j3O6l8O3j94N5L0l5R1r5K8n2J89
$$ plain form
6008 -51 -68 -18 19 20 -44 -64 16 20 -48 91 115 40 -18 -43 -142 -35 -12 15 17 38 -51 -45 53 47 41 1 -15 67 -37 -20 74 32 -70 -180 58
5570 58 -71 36 53 3 31 4 19 -86 -98 72 122 110 46 25 -83 -51 37 34 -16 3 27 -10 -16 -21 22 -41 -72 5 4 -37 -165 8 93 18
5144 18 -47 0 16 -22 -99 0 -43 -15 -7 29 47 -23 -49 6 -91 -124 -74 -27 -14 -26 45 -51 -6 -70 41 -48 16 102 49 34 -7 -80 71 29 -27
4706 -27 -61 3 36 72 71 -27 -48 -72 90 24 -25 -14 -21 -12 -131 -104 -56 -88 -114 -21 -67 -1 -13 0 19 148 51 1 81 10 -29 -77 -62 112 -80
4268 -80 67 52 -98 -37 12 -60 31 -69 0 -8 48 21 -57 -64 7 -94 -68 -52 -32 103 51 57 -128 -4 -141 -48 -9 -6 -78 -125 -41 -4 -56
3855 -56 -26 -31 113 16 69 8 58 -20 68 59 10 -74 28 144 -137 113 -75 -21 -16 90 37 -49 -18 43 -26 -114 -36 -44 -16 -3 115 41 50 -34
3429 -34 41 0 -55 -11 -2 -101 -93 27 -22 14 -139 81 -73 77 114 -102 -56 1 56 21 -24 -14 -15 -63 -68 -153 -22 22 -179 -83 -15 -52 53
3016 53 4 91 37 22 -56 -21 29 -105 33 -77 30 -22 -5 -58 -10 -46 24 1 47 34 100 62 125 -69 -14 16 -19 72 -23 5 -47 142
2615A42j37k1M0j01J48l9q7N9q1K23j00L5k8n6J1N7j00m2Q9R5j1nj48L9J6N1q8K3k8O4kK9
2214D7O6j2k7p5M5j8j09J66n6j54R1N8J1qJ24j4k26N2R7j97O2J12p7o4J9O8J8M2J00j66K1
1826dk3rL8J6K0j75J37N9n2j2lJ01n0k8l3K3j21l3J14OM4J7m1O7J54l00J21mM2o3PK5k2N8
1401G6r9N1J09j49l4K9m2R8K0r6Kl8R3q4R0J06j21Kp3L9j7mJ83j16Ro0rm6Q7k5J17k08J41
987C1K2J9K7j87L4q8K39p9jrKK3J21l2n5l9m1p3O8n7M1J8l4O5M4lo3L7KK1L2jj64K1P4R0J91
524B96p5k00k6L1J6m0O9Q4j84j14J23n2R9k38J80J03n6K5p8K4o2K0m2J69p5M2n6Lj09J70K2
136F9m0n6L8K8M2o8m8N3l7l9O1o0P9j8k2L4j16Q3NQ2r7P5r7J2n2J20o1LO5Q5j59Q1j22J18
-290D1p1R3o0j5M5Lk8k4
$$ plain form
2615 142 5 -16 24 -77 71 32 -55 4 -77 146 46 81 53 -3 8 65 -35 -77 12 107 96 91 -57 -18 -2 49 -39 -16 -44 20 18 47
2214 47 113 101 74 -1 44 26 -83 83 27 -127 -36 22 33 25 149 135 -91 -39 58 -139 -77 35 -42 -106 -87 -19 -1 41 141 -25 -4
1826 -4 -27 -36 2 18 38 -137 0 59 7 -5 -8 93 43 15 -18 5 -116 -149 -35 -29 15 32 -9 58 212 -88 33 29 71 8 15 40 18 76
1401 76 -23 28 137 -12 -46 -17 -59 39 59 -37 -35 -73 20 -64 26 132 11 13 -60 -21 -38 -42 141 25 34 -26 -35 -81 6 -19 98 -110 31
987 31 53 72 99 -88 -54 -142 97 18 17 8 10 33 154 122 67 28 -13 -86 -18 -75 -34 -16 -50 15 59 56 -7 30 32 53 85 84 -80 -59 15 105 296
524 296 221 21 -5 26 42 2 71 155 -29 -143 -20 -72 27 -211 -31 72 16 41 -37 -13 -75 -55 -97 72 -3 39 -17 -14 -123 47 69
136 69 29 -27 11 39 81 13 -35 18 -19 -58 3 -57 22 4 -18 16 -100 -17 -12 70 -27 48 -49 -37 -89 31 -30 -27 38 123 -36 45 -77 41
-290 41 -30 63 3 -12 33 36 8 -16
-390a6
##PAGE=	F1=-21100.8
##FIRST=	23151.189942674980557,	6007.9998942000029274,	0
##DATA TABLE=	(F2++(Y..Y)), PROFILE
6008f8l3P7N3J9q8qO9op4J45jj0j23j4o5J29j2P6m4ml1l9P0K4jm6rP4j12J9J09q4q0p3K08
5570D7j54J66K4o1kn5J3m1n4J86K0J1o6Rj04j1J16mok0J6m0J7k7N7o7p0P5Qn1k3J34O9o8j09
5132f5Q5km9q4R5p8M8O1M0%k7n2K7r6l3K8N7L8j2M0q9P0k5O2m7j8J35n3rr9m5J76n0p8l7O1
4681b5Q2J5J4r3p8k4K50p5r2N8m0Oj03L3km4K8J08q8L6K4M5J0O7q1p3J09q2m4k2K1J66j69
4268f3J28j5j52O9Ok0Q6j69J20m2P5rr2PN5o8K2pj0J72n3P6k11Q2j17P5N5j8n8lL3K3p0M8
3842d5n5J88r4M3p4J19j17J34l5o4p4N5J17k59K59j61O6m6J23m3p1K9N2p8q4J26k4K0%O3J
3454G1J7j07L0j0o0M6L4j23LJ45j0l2j84K59j00R3J2j64RP4Q1k1r7J2L1p3l2l3R8P8j90N1
3053i2M5L2O2m4J08om8r9L7K7j24J00p5J08l9j2l5P1r8R3OK0M7k3L4jj61L1P0m8N4rj8m0J84
$$ plain form
6008 -68 -101 -24 29 48 -40 -48 21 15 -59 86 85 75 -48 -62 -127 2 -10 66 22 18 -13 -52 18 42 41 -5 -14 60 -52 -33 76 -8 -88 -161 47
5570 47 -107 59 83 22 20 -35 -22 -63 -117 69 89 100 34 43 -61 -72 44 40 34 14 30 -10 7 -20 37 -30 -100 -25 -17 -68 -91 43 112 44 -65
5132 -65 20 18 -31 -115 -20 -98 -50 11 51 51 24 -28 -1 -97 -130 -102 -45 -7 -19 21 -68 2 -23 39 -8 -26 109 56 47 -52 -97 79 29 -49 -86 -25
4681 -25 57 72 86 -7 -85 -109 141 66 -26 32 -8 -2 -105 -72 -74 -118 -90 18 -70 -34 -10 35 45 112 31 -42 67 -15 -59 -81 -60 106 -63
4268 -63 65 50 -102 -33 -27 -47 39 -130 -10 -52 23 14 -78 -71 -16 -84 -62 -69 -79 93 40 116 -95 -13 -130 -55 0 -18 -76 -79 -46 -23 -93 -45
3842 -45 -100 88 -6 37 -37 82 -35 99 64 0 -74 -19 98 -161 98 -63 3 -43 80 37 -34 -5 47 -31 -115 11 -13 7 7 70 71
3454 71 88 -19 11 1 -59 -13 21 -102 -99 46 36 4 -180 79 -21 72 84 -80 -71 3 84 63 -34 -22 9 -64 -96 -129 -31 47 -143 -92
3053 -92 -47 -15 47 3 111 105 57 -42 -5 22 -102 -2 -77 31 -8 -20 -55 16 -82 11 17 37 84 61 95 94 -67 -36 34 -14 40 31 13 -27 157
2615A57j73L3Mm2J58j04j18R6nJ42q1L9m8k7kL3q4n5P7N0l3R7j43L9J6K4p4K1k8P0l3J7R5
2202A18L1j16j5M1k4q0J37p2j06R0J2%j2J21j4j36kP9j78M8O0k5p4O2P3M0k4J09j14m0J1j5
1801a5K6k3O3j23O3J43p7k9J6M5o1nn5ko7n4J06J1L4R7q3Q0J42l12J62n3K6j9m6Q9j8L0p9
1388A2M3N3j40qN5r5J54Nj43Mk8N3l2J07J03j21j8l9M9n5J8J89r7j8n0l9p6J34p5J58k15J48
987C6KM8J5j53n7p2K42o2l8O4k2k3J81m9n5k5m5q6J21o9K9k7kK6N1QlJj1K6K4l5j01QQ2R6
537A25J60p4j64n8P7k8j0L0J05j84j02J01n3J01k31J86M9o2P6m8J4q8O9l3R7p2O8o3J7j65
161a60K29K0r5p3O8L2L8qpj9m3q7R4n9R6p4M8j2q0L5P2J26j66R3j04Ro0J03o1J0O7J21j52
-252AO3j45J45p6M6p2K7M0J7o0k5
$$ plain form
2615 157 -16 17 21 -21 137 33 -85 11 6 148 67 106 58 31 29 62 -22 -77 0 50 17 114 -29 10 26 50 -24 -3 -31 39 6 23 118
2202 118 149 33 18 59 35 -45 92 20 -86 4 16 16 4 125 111 -25 -27 52 -126 -78 -18 -43 -117 -55 18 58 34 143 29 -11 0 -15
1801 -15 11 -12 51 -72 -9 134 57 28 44 89 28 23 -32 -34 -101 -155 -49 -38 -4 93 10 90 232 -80 82 29 55 36 -10 79 61 91 12
1388 12 55 108 -32 -40 15 -80 74 79 -64 -60 -88 -35 -67 40 143 22 4 -35 14 -41 -23 166 69 51 1 -38 -114 20 -55 103 -112 36
987 36 38 86 101 -52 -109 -181 61 -1 -39 25 3 -20 161 112 57 32 -13 -99 22 -47 -18 -45 -47 -21 30 38 35 36 25 51 75 40 -61 -53 29 125
537 125 285 211 47 -11 66 38 28 58 163 -21 -123 -22 -75 26 -205 -19 30 -32 44 -4 10 -78 -9 -42 55 -17 51 -12 5 -160
161 -160 69 89 -6 -79 -11 21 59 51 44 25 -18 -105 -11 -70 26 -48 0 -12 -92 -57 15 141 -25 68 -36 -27 -87 16 -45 -35 32 153 1
-252 1 64 -81 64 -12 34 -38 -11 29 46 -14 -39
-390c9
##PAGE=	F1=-21195.1
##FIRST=	23151.189942674980557,	6007.9998942000029274,	0
##DATA TABLE=	(F2++(Y..Y)), PROFILE
6008g4l7P6O4M6j20K4K8Np2J30k7N5j85J6j5J16m3J08q1MQr7N5L7K5m7l2Q3q6j4J32j35m0
5595i3k6J55j69J95K9o2k0r2K0L1j07K01oK3n7L1p8l4J30j8J6n2K2n0L9m8N8o1q3N1J8l1N5
5182a3P6O1o3j39Q9Ln8q0P6q3M5J19L2l8L7m5j0j09jk1Q1L4pOo9Q2K0Mk2o2J71n7J2j57qJ69
4731G5n0r3l9N3J41j2Kp9r8k2L00r4j22J20r2K0n5J3l8p5Q9J18j26J4M1O2j7L3n4q4J28r7
4330c8l5J2QJ65j44Q5l1j23O8l0L2Q1k18J45m5N8Qr1L9J8j8ol0KJ68o0J53k09K2q8M7N8m5
3917d2m3O8k2J4q9O5j01K09q6L8q1J59j05J44m6q8n5RQ9k31K58j14R4r8Q7K3p6L3L3o7p4J56
3517F1m5LoJ5O6nq9j9L7p6L1M5j16j5J58M9r4k13K98p2N7j8j13j6Q0R3j5r7j8M0m4r7L5N4
3091d6J08j42J2L4N0M0l9R8K8q1q7K9K2j12L3k6J00l4pj3M5j42J12K5QR3q5R5p4q7LQ8n3J7
$$ plain form
6008 -74 -111 -35 29 75 -45 -21 7 12 -60 70 43 98 -87 -71 -86 30 -13 95 14 18 26 -71 -16 21 46 -1 -33 50 -36 -50 82 -53 -93
5595 -93 -119 36 -133 62 91 29 9 -83 -63 -32 -139 62 56 79 22 53 -25 -59 71 53 69 17 39 -11 28 -20 38 -23 -106 -55 -37 -68 -13
5182 -13 63 124 61 -78 11 14 -44 -124 -48 -131 -86 33 65 27 64 19 9 -100 -101 -122 -41 -7 -14 -8 -77 5 25 29 7 -55 116 59 71 -86 -94 75
4731 75 25 -68 -107 -54 87 75 77 -2 -100 -122 178 84 -38 82 -10 10 -45 -32 -70 -145 -56 62 -64 -50 -9 53 36 69 15 -69 59 -38
4330 -38 -73 -61 -53 112 -32 53 22 -101 -33 -63 -31 50 -168 -23 -68 -10 -2 -93 -54 -36 -54 -60 -90 -88 80 20 173 -36 -14 -102 -55 3 -42
3917 -42 -85 -17 -39 -25 -114 -49 -150 59 -27 11 -70 89 -16 128 82 -6 -61 -52 37 -194 64 -50 44 -54 33 56 -20 13 46 -21 -95 61
3517 61 16 19 13 28 94 89 0 -19 18 -58 -27 18 -98 -113 45 94 0 -213 85 13 70 52 -61 -77 3 96 81 -16 -34 6 -38 -135 -100 -46
3091 -46 62 -80 -68 -34 16 56 17 115 143 62 -25 4 26 -86 -53 -79 21 -13 -20 -33 12 -130 -18 7 15 108 23 118 44 -43 -40 48 -5 12
2665A2P4p9j5J59j64M7k2K3J40j33j50J13O3N2n1L9l8j3j6%m4o0N7om2J65j22N7j7Qo0M7m6
2252b2P5n1kJ14O3j76L9J2qm6R1q4n7R0k6k6j8J10J1n5m6P8j44J6mL7p9P9P9M2q2J26n7j02
1826b3N1k0J7n3Q3n3qK07j17l2L2k7n5K3p7j4np3J15OKJ69j22R9P9l05K10p1mK7r5J33qJ9
1401A10m9K1k0q6j4J01j46J68j3j67K8j3JRJ12Q9r6l8j7O3q5J4J81l8n5l1p0r9J75j14J88
1013A09k14J38kR1k5j11j24p8K30j8p0J22l4r4K09o1p3L1l3j03J61p4K0n5L4k6N9OP4m9j7
624B3QK7m6l7rP5P5R0m2j20o1J03n2J8j4J26j62j04P7l4Q4j96J69np0J18k4Oq8R5j2K8n7P2
199F1p1K5j96K71j4j19o6P4K6M6M5K8q3k3j18R0n0J01q6Q6o8qk1J08J52k07J10j13J9p2Q5
-189A2p4K6O1J26j22M6j44J31p1J7j01Q0M6Mp5j9
$$ plain form
2665 12 86 7 -8 151 -13 34 12 35 175 42 -108 5 68 120 69 108 70 57 41 41 -3 -63 -6 -12 -54 111 -11 46 29 37 -23 24 -22
2252 -22 53 2 0 114 177 1 40 52 44 -2 89 5 -52 38 12 -14 -32 78 89 34 -12 66 -78 -62 -66 -29 -108 -29 50 92 10 136 79 -23
1826 -23 28 8 25 -28 55 2 -6 201 84 52 84 57 2 25 -52 -66 -71 -144 -29 -23 -21 148 26 125 204 -101 109 38 34 61 -34 99 91 110
1401 110 61 82 62 -24 -38 63 -83 85 72 -95 -67 -80 -79 -70 42 131 35 -3 -20 43 -42 -28 153 115 60 29 -41 -140 35 -79 109
1013 109 -105 33 31 122 97 -14 -138 -216 14 -4 -74 48 14 -80 129 68 -5 26 -7 -110 51 -23 -3 -58 -24 -50 9 15 89 40 23
624 23 31 58 12 -25 -34 41 116 206 164 44 -17 86 34 52 38 164 2 -102 -25 -59 25 -171 -2 -7 -77 41 17 23 -65 30 18 46 -11 61
199 61 -10 15 -181 90 76 -43 -109 -35 -9 37 82 110 27 4 -114 -24 -74 27 -59 27 -41 -49 -70 38 190 -17 93 -20 -1 -73 12
-189 12 -62 -36 25 151 29 75 -69 62 -9 8 -93 -13 33 37 -38 -57
-390e7
##PAGE=	F1=-21289.5
##FIRST=	23151.189942674980557,	6007.9998942000029274,	0
##DATA TABLE=	(F2++(Y..Y)), PROFILE
6008f8k6N4O3P0j52M8j1K3n6J07m2R0k13N1K5P4n6J08j01N4Oj42N8L2O7n4o4R7m2p0J59j78
5607h9OJ3R5j66J83L4n4k5j15L7P8j49K12l4L9n2N4n4l0J23l8J5p1L5p7P9o7N2n6o1J3J5J9
5194c6P6J9N8n0j45N8K8p6n3M2m4K2J50Np1R4j2l2j24M5p5J07MKk4l7P2N8l1k8o2J86o1K4
4769H9j88K6J26l3r2m4K9J99l4m2n5o7k2L03j20j25J67j46M1Rj9m1j13J28J20j51LM3N6m7
4393@L9j8r2J23j05j0L3j2J59j14L8n5q6O9m9N0Q9k28J41k5J0K2q1Q5k8K7l4n1N4J16o0K05
3992B12j82k7o6K4L9p1l1J34n6Pr0O2j23J98o8L5r3J66l2J13m7j06l5l5O1k15K47n7J29j42
3617d9K3J13r5M1Jl8o4J53n5j4nJJ00n2l7o1P8j02J3M2p2m9J47J20j39k20L19q2N6n1p0k6
3216g4P7Q9k3m4p5K7J9j62R4J0J32q4oK5K2M3k7N9M4j06m2J1K3r5l8K1Q5k4J7Kj5j48J04L4
$$ plain form
6008 -68 -94 -40 23 93 -59 -11 -22 1 -55 52 10 100 -113 -62 -37 37 -19 89 -12 42 48 -94 -36 -4 63 9 -55 42 0 -70 89 -89
5607 -89 -83 -70 25 -141 42 76 22 -3 -118 -81 -3 -152 60 26 65 13 67 13 -17 106 68 83 12 47 -30 49 -18 34 -22 -83 -70 -55 -36
5194 -36 40 59 117 67 -78 -20 8 -68 -121 -79 -123 -101 49 54 -17 77 65 33 -91 -46 -121 -14 -10 -8 -32 -69 3 61 30 2 -60 126 65 89
4769 89 -99 -73 53 20 -72 -116 -87 112 78 36 -19 -86 -108 195 75 -50 117 -29 12 21 2 -39 -152 -24 96 -55 -52 -9 47 0
4393 0 39 21 -71 52 -53 -63 -30 -42 117 3 41 -14 -100 -31 -80 -30 59 -169 -28 -53 -43 -21 -102 -17 -45 -18 -52 -103 -49 67 7 212
3992 212 30 3 -63 -39 0 -71 -102 32 -24 -17 -107 -45 -168 30 -38 -3 -96 70 38 151 104 -2 -37 -72 -11 -226 21 -36 93 -49
3617 -49 -26 87 -8 33 34 -4 -68 85 30 16 11 12 112 60 23 -38 40 -62 -49 -7 -79 -128 19 139 0 -220 99 17 73 22 -48 -74
3216 -74 3 92 69 25 -50 -23 -4 -166 -72 -62 70 -14 -20 5 27 70 43 102 146 40 -2 9 32 -63 -101 -80 5 -19 -2 0 -15 -163 -59 -25
2790b5J8J17r8J05j20mj3P3m7j4J24j29PJ28j11J9k9P8J00j21j71J06J03k3j5L1k0ok0l2j
2402A0n8M0n0l7J81r0Q3o4om2R1p5Q1o5k2J19P6j87P4l3J7j7O0r6k3Q3l1o8k0J01M5j6o0R4
1977I5j03j9n8Q4p9P5O6K0r8J34j1j45R6k9Oo8R1lo2K28j40j5M0r0l4M2q9k2M9p9J34J0n1
1563b5J98j45J14mk74K46n3n4P7j30J37J2L6k6kq9j2m0J47j71J36l7j63P1jm5K8J05O4o0l7
1175Ck5P3r4j7J70M0r4oq6j07J84j17J89k13J22JJ47q0p4j56r5K00M4q2J35l8j53K00o3j02
800i4J05mj25J76o5J3o6N8p3P4j7J46r0pj1L7n5J7k2N1M5L9oj12l5J02o9M8l7J33j18j17N5
387b4kN1j47J41n1p1J24Lno4J04Qk8k6M9p6K1j73K77q2q7m1N3J7N9P5K5j07K0j22N9m8R2o2
-39c8Q2r6N9o7J13J36j94J11j13M0q0O7r7N9L7R8r1N1j17P1n4K1j40J26N8k5p1j1
$$ plain form
2790 -25 -7 110 12 117 -3 -7 -20 53 6 -8 116 -13 -6 122 11 30 1 79 179 58 -113 -7 96 73 58 89 69 63 43 11 10
2402 10 -48 -8 -58 -95 86 -4 79 15 9 -33 58 -17 64 -1 -23 96 172 -15 59 26 43 26 86 -10 -33 50 19 -49 -69 32 77 61 1 95
1977 95 -8 -27 -85 -1 -80 -5 61 81 -17 117 106 -39 57 28 34 -34 57 54 -8 220 80 65 105 15 -19 23 -66 -88 -39 -118 16 26 -25
1563 -25 173 28 142 138 -136 110 57 3 80 -50 87 99 135 109 107 18 6 -34 113 -58 78 41 -122 -51 -52 -97 -69 36 100 40 3
1175 3 -22 51 -43 -60 110 150 56 50 -36 -143 41 -76 113 -100 22 23 170 90 16 -140 -235 -35 9 -73 62 24 -129 71 8 -94
800 -94 11 7 -118 58 -7 6 -60 -2 -75 -1 -18 128 38 31 20 57 2 19 -3 48 93 132 126 14 -21 81 12 60 23 156 38 -79 -24
387 -24 -26 25 -122 19 -32 -103 21 24 19 -45 59 67 39 13 62 -14 7 -166 111 29 -58 -99 -46 -29 30 105 130 23 43 -79 -20 -68 24 -38
-39 -38 44 -52 7 -60 53 189 -5 106 -7 33 -47 20 -77 -18 19 117 26 77 -40 31 -23 -2 -142 -16 42 17 -54 -65
-390f5
##PAGE=	F1=-21383.8
##FIRST=	23151.189942674980557,	6007.9998942000029274,	0
##DATA TABLE=	(F2++(Y..Y)), PROFILE
6008e6kK3M6P6j61M8l2L5k4Q7m3Q1j86P4L1K6m8P1r6J30l1j57P2NJ15o2q5J00Kj29J78k00
5607a12L9L5N0j39J30M3l2k7j04N2P6j62K16o7O9n9Q5m7pQ9m9Kp2L4j19J48q7N2n2j7l2qQ1
5194IM9k1N1k2j35J5N4r8jmK4kJ33l2q1J14K8k9j21Q0j11J20k8J7m6j0M9P0k7n4l1J76n8J4
4769I2j85N3O0Mp7n1j9K44m3r5l5Ll3K69j38j01J77j87O2O8m9j7j32J27J08j57OM1L6o7O3
4380B7K3r5Q9r4J6K3k2J41p5Jp1o2O8m2K3J06j95J16Lm3K5o4J27o0M7m4p3J23M0m7K11j45
3980G7m2o1K1Nr8j5J65o5Mo3K6j11J69n0L2j14J40R4M5m6r9k8o5M8k10K25nJ49j65l1J83j10
3579EM5l7jm8J21o2k3%K4J04j06L1r2Q8j23LK6jr2J21J75j58j93L11j16P7p7l8k6O3P8m7L6
3166F8j28nP1j84J29k3J50m9jJ4k3O1j1J2M0j14J8j5K7q3q3N5O8mL9Qq6j21P4L5M4J28p6N3
$$ plain form
6008 -56 -58 -35 11 87 -74 -26 -58 -23 -47 40 -3 78 -108 -34 -3 23 -25 46 -50 80 49 -108 -36 -31 84 22 -63 37 39 -90 88 -112
5607 -112 -73 -38 12 -127 3 46 14 -13 -117 -65 11 -151 65 -2 67 8 93 46 39 128 79 81 9 43 -76 72 -15 37 -15 -32 -64 -72 9
5194 9 58 37 88 66 -69 -54 0 -98 -99 -103 -79 -81 52 20 -61 53 81 52 -69 11 -100 20 -8 9 -37 -47 2 72 45 -9 -40 136 78 92
4769 92 -93 -40 20 24 -53 -104 -123 121 78 -17 -52 -49 -82 187 49 -52 125 -62 0 68 19 2 -130 -3 105 -52 -46 -5 31 -36 27
4380 27 50 -45 44 -50 -34 -11 -33 108 33 34 -37 -99 -31 -73 -50 56 -139 -23 -20 -63 -38 -102 25 -35 12 -32 -105 18 58 11 222 77
3980 77 35 -26 -5 0 -98 -113 52 -13 -9 -72 -46 -157 12 -38 -6 -120 20 114 159 113 14 -14 -79 -31 -241 -16 -21 128 -37 -68 115 5
3579 5 50 13 12 -36 85 23 0 0 24 128 22 53 -39 49 -74 -71 -45 -46 -138 -17 158 0 -193 118 2 79 2 -36 -62 1 79 32 68
3166 68 -60 -65 6 -178 -49 -72 78 29 28 42 19 80 69 81 121 7 25 10 37 -46 -129 -74 -6 -10 29 37 -49 -170 -96 -61 -17 111 35 88
2740H8j19N3kK7k6m3J33j53K0J01l7l0k1J10N0p7j75P9J16o4J5PpRj6n5K7m8L7p1k6J52n4
2327@J01r5k7k0J28r9Q6q2l8J16O3j50Q9p2L4JN6j13pO8jj17nR3O3k4l4J13o5m0r2R6o8O5
1901B3K0j6o8J24K0j58J39m9qo5R9Jr4K07j23PM8j21j0N3r1l6Q6p1J52K3j09J78j49J24p1
1513F5k19K43rj12J24j47J09L5P3k5pj37M6o3J74j59P4o3j38J16Ko9K2R6K0k4No8P2q4n7J64
1113E9J03j28L2q4j03J53q0J63k11J01kK09j29n5j51j01J46J09o9Q6l3j63J58n0j25J61M1
775C7j54J59m3J3o7N2r7R8o0J94j08K0j5N6p9O2m0K3K1L8K0j53LP8q7P4k2J20o7j22K9K5J5
361B3r7J15q2o2Q7M0k1l2R8K3p0K4%p2Rr2K44j66pj0J1J0P1P5k0q6O9r9J7n8P6l1N0p3R1r0
-89c5R5P7j35Q9q8N5p2M4j21J07kN5q1P5o4j7l2N2j67J46O9n5m7j1
$$ plain form
2740 88 -31 22 20 47 21 -22 111 -42 -22 79 42 12 -9 101 151 74 -101 -22 94 30 45 52 45 54 38 -17 10 -38 -1 -72 -98 54 0
2327 0 101 6 -21 -41 87 -12 74 -8 -46 70 133 -17 72 0 34 35 91 -22 -29 39 38 -79 -84 9 72 48 14 127 62 22 -70 26 -42 23
1901 23 43 27 -41 83 103 -55 84 35 27 -38 61 62 -32 175 52 59 107 -14 -24 29 -62 -98 -12 -83 69 92 -17 161 12 136 65
1513 65 -154 89 80 -32 92 -55 54 89 162 137 130 -7 39 -24 150 -9 65 2 -136 -20 -18 -87 -65 31 51 27 32 -36 36 -48 -105 59
1113 59 162 34 66 -18 -121 32 -48 115 -96 5 3 212 83 28 -123 -224 -78 31 -38 48 15 -148 10 -40 -165 -4 37
775 37 -117 42 -1 12 -55 -3 -100 -2 -62 132 24 44 29 85 6 68 28 51 72 110 130 -23 -20 58 -29 45 23 143 76 -46 -17 8 23
361 23 -74 41 -41 -103 -16 24 3 -29 69 92 22 46 46 -26 -17 -109 135 -31 -38 -48 -37 -27 44 119 99 13 82 -17 0 -58 18 -13 37 -36 55 -35
-89 -35 60 137 2 91 3 58 -14 30 -91 16 14 69 -12 63 -1 -18 -50 2 -165 -19 50 -5 -52 -63
-390f3
##PAGE=	F1=-21478.2
##FIRST=	23151.189942674980557,	6007.9998942000029274,	0
##DATA TABLE=	(F2++(Y..Y)), PROFILE
6008d7K7nJ9N4j33L3l7L1K6O8m0M4j15P8klk0jo1J94p2j35P9l8J50o1q8R1L1j68J71j95M6
5595g9M1L6r1N2N1Ok7o6N0L4j48K11j00J09o7J14n9K0L8m7%o1Jj50K24j10P0m7K9p7m4J34
5194D7Kl6L8J5j25j8O7j13O4n3Q8mP6o2o7Q1N6or1Q3j12J12m2M2o2nK5N3J2q2J0J50m7j6j59
4756g9P9rN2o0n0q6K67l9j28l1P2m8K10j25o6J54k10P6J01o6J6j16R2Q0j45J8M9J5p1P1N8
4368H1q1L4n9K0j5j4J17l3k2o3o1O1j7l1J20j32Q9J5p2J8m5J45o1L7k8j02J84k9k9J75j14
3980H8k3o5M3l7j27J4J48n8Qj3l7p0J37m2K9j38R4K32l7n2n2m3p4N6k03J87K8J36j60m5K05
3592A29j01L2o6K8k1P9p1k9kP0Q8j38R0j16O3j27J1JO6j24R7J90j47j39K76j49R6q6j4l0M4
3204@O2p3Q8j35m6P6j42J34l3J66n9K1qm1P3kj2J0r9O8m7M4q7q4P1N2J9M7jj36q3M3M8O2J34
$$ plain form
6008 -47 -20 -25 -6 48 -85 -52 -89 -58 -32 36 -4 40 -75 3 1 -2 -22 -23 -84 110 38 -97 -18 -56 94 33 -55 36 67 -101 70 -125 -79
5595 -79 -38 -2 -93 -41 10 16 -11 -77 -27 7 -141 70 -30 79 12 126 67 87 125 78 78 17 18 -132 92 -18 52 5 34 -43 -87 47
5194 47 49 13 51 66 -59 -77 -10 -123 -59 -112 -24 -28 48 -14 -81 0 56 50 -41 42 -70 42 0 42 -20 -25 0 53 65 -17 -7 143 96 80 -79
4756 -79 0 -9 43 -17 -67 -153 114 75 -53 -84 -12 -60 150 25 -41 113 -97 -21 80 14 30 -86 6 86 -59 -41 8 23 -48 23 81
4368 81 0 34 -25 -5 -20 -34 83 50 28 -35 -96 -35 -52 -83 37 -95 -6 9 -63 -45 -90 55 -6 31 3 -99 85 56 27 202 88
3980 88 65 0 43 6 -121 -107 41 -17 -9 -22 -59 -129 8 -34 -5 -143 -49 183 146 94 42 -1 -75 -19 -222 -35 -7 129 -31 -76 129
3592 129 28 60 -6 22 1 80 9 -20 -22 48 136 -2 88 -28 35 -92 -81 -80 -14 -138 -41 149 2 -137 139 -10 86 0 -14 -44 0
3204 0 62 -11 77 -58 -104 -28 -170 -36 -69 97 38 59 51 10 83 81 69 79 -20 48 1 45 -42 -126 -55 -3 16 63 62 -74 -157 -114 -66 -4 130
2765A30n5l6p4P2K8l7Oo9J11j42K3Q1J8p0mJ16Ok8j58M9J12p4L3l2nM2j7o3L4k6M5p5j7J03
2340B7k3J05r0n9OJ28j02Q9j04m2J13K3q2Q9q6L3NP5j34pN3M5j60L3P3N6n4K1J13l2m5j03
1939c6O9m2O8n5m9j1R0M6j41J59o7l3m6J10k8j16J68p1J5O1j06PO2r3n5J03n7J59L0j50J32
1551A23j40J31r7j47J87L9j56J55j44P0M9J12m4Qj58O2o0J74j27J3q3j00J43no6MR6n6J2Q0
1175G5j33O6o6q1J61J33j56P7o2r9J01k6J17j90P4j7K58j55o1j15q0P2J57l1j7j8j10R8l4
812f2j23J72Q9j76J13k2J9n5J2r5J31j05K03j01N2nQ4j15R4o0nJ4O0L9k09L9L9j03Q7K4R1
424A26j2j13mL3j6n5R9q8n1K6P7l0j1P2M0r6P6n8n1mJ0J96k47R0J4m2QP6N8q6l6J03o2j8p3
-14d9O0j8J6j0P9q2O5jo0L9k2L8m1J6j36J60m7K5j02J02Kr7j9R9j70J28P0p0kk6
$$ plain form
2765 130 75 39 -35 37 65 28 34 -35 76 -66 -43 38 56 -14 -18 98 104 76 -82 -33 79 5 38 6 1 43 26 -37 -3 -29 16 -59 -76 27
2340 27 4 109 19 -40 -34 94 -8 81 -23 -65 48 71 -11 78 -8 25 30 105 -29 -36 17 62 -98 -65 8 64 10 31 144 112 67 -36
1939 -36 33 -9 59 4 -45 -56 34 80 -61 98 31 -2 -48 62 34 -82 86 15 30 91 -15 -8 54 -39 -94 9 -48 111 141 -9 123
1551 123 -17 114 17 -130 57 96 -60 95 -49 21 70 182 138 146 -12 50 -10 164 37 50 -33 -133 10 5 -61 -57 39 -17 -5 75
1175 75 -58 8 -58 -139 22 155 -1 76 14 -85 16 -10 107 -83 -9 -26 232 77 16 -99 -179 -107 50 19 2 -16 -126 -28 -62
812 -62 -185 -13 76 -100 13 -9 10 -45 -33 -128 3 -102 101 0 52 47 131 16 110 50 45 59 119 158 -51 -12 27 -76 11 35 126
424 126 114 1 -3 30 14 -41 58 -30 -81 -55 22 -8 -19 53 93 -3 73 15 -36 -40 -30 166 -81 9 23 -19 -11 65 123 37 1 104 42 24 -49
-14 -49 11 -7 9 -1 78 -4 61 60 0 39 17 55 14 30 -106 54 7 32 -70 32 34 -63 -82 17 -153 -25 45 -25 -27 -53
-390e3
##PAGE=	F1=-21572.5
##FIRST=	23151.189942674980557,	6007.9998942000029274,	0
##DATA TABLE=	(F2++(Y..Y)), PROFILE
6008d7M7j7qOp0K4m5K1Q4M6m1kk7O8o0j0K8r4jK13q0r1O6q8J62m5p9P5M5j71J34j79K9M5M1
5570b1l1k0M6N1j7k4K8j8j18J89j20J42n9J25q4M1j6k8J9m7n9j55K78j34J04l2N4j15p4J59
5194F4l5k8K3M3j23l3O6j07J09q0J18K0Ko2n1QO5K6m4N4q2Q2l2P8p4k4PK1N9q6M1J20l8m6
4769F1j22J02o1R2n5l1j52K64k4j20n1J08o2J41q0l2J17k12P3J07o7L6p0N2L8j21K4Q1qn6
4393b8M4P3l9k7qj0o1J0J00Km3k7p4M4J3p8J15n8P2Mo9Jk3J24k4NJ1j41K16o1k3J24r9Pn8
3955A4Q0p3j62O3Q9n2K0M0j02j4J09n0L1j55M4L35j10o2K2o8n6P3j85J35L6R5j37j6J82p2
3579E4Jp2M1K0M5q6m1j5J14O8j35J31j37J5j06K6k3J02j31Q9J57j11q0K26j60R5p1%m2K4M4
3191D2q6P8p8q7K9m5J13j8J74j02M9m5qO6j2Ll8p1R5p7P3j02m6O8L7L7L4j9j53n1L3Q2N2J35
$$ plain form
6008 -47 0 -17 -25 -19 -89 -65 -110 -89 -5 41 0 -2 -29 39 -21 -31 -3 -97 -98 115 35 -56 10 -78 84 39 -40 35 80 -91 43 -136 -107 -62 -21
5570 -21 -52 -72 -26 25 8 -16 12 -6 -124 65 -55 87 28 153 69 110 94 66 85 38 -21 -176 102 -32 72 40 94 -21 -95 64
5194 64 29 1 24 67 -56 -89 -23 -130 -21 -101 17 37 39 -23 -74 -66 -1 25 -19 35 -47 35 3 81 7 -17 -10 11 70 -16 25 145 107 61
4769 61 -61 41 -20 72 17 -14 -166 98 74 -46 -97 11 -51 90 10 -22 95 -117 -44 63 -4 32 -38 14 52 -69 -45 36 28 -28
4393 -28 16 89 50 23 15 5 -56 -46 54 56 13 -14 -88 -44 -31 -109 6 -52 20 24 -45 -44 -67 57 33 38 49 -92 124 63 40 164 65 72 14
3955 14 94 21 -141 -78 11 -41 -21 19 -83 -97 12 -38 -7 -162 -118 217 107 45 67 -1 -57 16 -169 -34 2 97 -40 -56 126 54
3579 54 55 -17 24 44 89 3 -38 -53 61 129 -6 125 -12 3 -103 -77 -100 2 -129 -40 117 6 -74 152 -8 87 16 16 -26 -2 42
3191 42 -44 34 -44 -131 -102 -147 -34 -52 122 20 69 24 16 82 70 73 35 -36 59 -18 55 -47 -93 -25 12 49 83 64 -89 -140 -107 -25 27 162
2765A62n9j18oO0N9j05M5q5P4j03K1P1K7q4J7R8k0Qj29L1R8o8L9p7kQ5l3m9K2ON5p2j3N5K
2327A2Q9m6q3J9Q4q4Q7j18l2J17l8rQ3p1J4%R6j50k4N0P7j77Q9L2K5o6Q2Q0rm2r3J8lR0j34
1889c5p1N2M0O7j06J46p2o9j2J14o1j31J36qlP9n8J3P5j04p2J05n1J55J6j54Q2j26J44q4p6
1501f9R3P7j64J55j25L5M7J39p1L3j53L3l2J55r8k6q9n9J40j7l5j9J12j62N8J56j93O2n7p3
1125a47J59J30j79J14k2j01M9J9O0j33L2l7K79j49q8o2l3JJ73J5j38Mj8L8k2r9J41J27j80
762f7N1j5L3k9m9p2J59j28J73p9P2kJ22j42J05p9l0K5P6N2k32O0lj06Q4O9N9M2q4n0J6l1k5
349b5R1o6m3l2R0k2nK9O7j12J11j06j1nP6J66k98J58K2r2MP7M2j39J5J10k8l6p9M1k0%N1M6
-77G7n1L1o5kk7P4j6Kj2j30J91p7K9j42J15N6j33l4J46j44P3O4o9N6n0
$$ plain form
2765 162 103 -15 -21 39 98 -7 38 -47 27 -76 -55 16 43 -41 -24 74 54 62 -67 -36 62 -6 33 -44 -46 39 6 -43 -21 -15 40 -32 -45 10 12
2327 12 101 55 -28 -9 75 -9 78 -40 -72 45 7 -2 81 10 24 24 120 -30 -54 -4 73 -104 -15 17 42 -24 58 138 129 87 -6 12 9 99 -35
1889 -35 -106 -54 -14 53 -53 93 21 -48 -60 54 -7 -138 -2 -10 -13 66 8 21 96 -8 -80 25 -26 129 145 -9 73 -53 91 7 -69
1501 -69 24 101 -63 92 -33 2 49 188 117 150 -3 30 -2 153 55 29 -60 -119 21 4 -31 -50 62 -100 -42 114 -79 -17 -74 -147
1125 -147 12 142 -37 77 55 -46 3 22 82 -51 -19 -56 223 74 -14 -76 -109 -108 65 80 -58 -54 -72 -34 -56 -155 -14 113 -67
762 -67 -16 -31 2 -27 -76 -148 11 -117 56 -23 49 47 169 27 132 53 23 48 124 176 -56 4 1 -105 -21 48 107 149 65 15 31 0 -25
349 -25 66 0 -43 -75 15 -7 -12 17 84 -28 83 -23 -34 -39 37 203 -95 63 85 -7 -3 74 116 -23 -8 102 74 38 -41 0 -20 -20 31 77
-77 77 26 57 -8 -10 -37 37 21 23 11 -119 72 -5 24 -118 -3 53 -80 -114 32 -112 -39 25 -44 12 -38
-390c8
##PAGE=	F1=-21666.9
##FIRST=	23151.189942674980557,	6007.9998942000029274,	0
##DATA TABLE=	(F2++(Y..Y)), PROFILE
6008e6N6j8j7n7%M0o8K1J30J9n1m0M9N4j14mQ1j78O4J78l4n3L9j35J49j8o8O0N3j35P5j69
5607a47%O2M2K4n8J2R5RkKn2q6J37j14J57l0J09j08N4n7%N3l9j21j29K84j50J34mN0j36q0
5207h9J52n2pPN4j22m0O0p4J07o5J04N8p0k0n6p3O1N7nJ2l3M1j6J19p4o3lnQ4n7M8J02l7n4
4769E1q6J13q3J01n8mj91K39mp9q0J00p1P5k2oR0j94N5Q6n7L9j7L8rr6J0J33m0k8kO3J4o9
4343A1M2n7r6L6J06J4o8K4r0K8K9q8Q4J0O2k7m2j8LP0L3k6N4j86K16m5m3Q6r3K4k8J01r0j90
3917a54J22J3n8L8O8j37L6Q2o4L5j52J3L63j52p0R3q2j8Q4j57P6K9M4j20M2J35m5l4n2M0O2
3529H0L4j04o1l7J38N6j06J56j53l3o5L5m4J04j09R6Q9o0m5J78j49P7l6Qo2J1J6p3PK7j19
3141a44l8O5P6J8J65j46P0r2O4M8m0M5r2l8R5r8J03j15J5M2K4M4Nl3j42l1M8J28J7J24q6j58
$$ plain form
6008 -56 0 -18 -35 -92 -92 -52 -120 -99 31 50 -1 -41 8 62 -52 -56 25 -153 -89 89 55 2 41 -94 55 37 -31 29 82 -53 22 -147
5607 -147 -147 -85 -43 -19 -77 -65 30 39 37 39 -13 -99 38 -76 81 51 160 52 106 49 49 102 63 -58 -187 97 -53 81 77 127 -9 -89
5207 -89 63 11 4 11 65 -57 -97 -37 -111 -4 -69 35 93 23 3 -53 -126 -65 -8 -13 -1 -34 7 -9 110 36 -27 -30 -35 49 -8 40 142 105 51
4769 51 -35 78 -5 96 38 34 -157 82 78 -1 -81 19 -52 23 1 -5 85 -109 -54 32 -25 14 -3 35 26 -70 -60 73 33 5 3 66 80 11
4343 11 53 -4 -100 -64 42 56 -12 12 -78 -50 -21 -109 -25 -15 47 20 -22 -40 -37 33 66 40 94 -92 124 79 36 122 29 53 25 126 36 -154
3917 -154 -32 -19 -77 -39 29 -108 -72 10 -54 -19 -171 -158 205 53 -17 76 -6 -24 60 -97 -21 8 52 -68 -26 109 64 30 -22 18 80
3529 80 114 10 -51 -88 50 106 0 156 3 -30 -95 -60 -104 0 -109 -13 76 16 -29 149 0 77 41 49 -13 -2 14 -59 -52 -25 -144
3141 -144 -182 -117 -41 -23 142 -4 66 -26 38 86 46 91 -1 -39 56 -42 61 -54 -39 3 27 71 76 43 -99 -130 -82 46 63 187 101 -57
2740e7N6L8P2j69Q1p8L9n8J9P6pp2L9O0k1K0r8L0P4o4M1j11J1J18n6j6JL8N6o9qK0J8N3K3
2302I9q1LJ3m9P8j15rJ27j08M4Q2m1j1qJ03j53n1N1R0j64J49k9j6l8J30J4Mm0o5l1L4J19j91
1889f0p1J01j0P4o6J05o0j04K6J03p5j34J16M1l8R2%RQ6j25p4R5n5J47j8j20L6j07J57m7k6
1501bKR9j38J19r3RK8J46q7M9j25j3JJ27r4k9p8k4J05k4J8m4J33k61J10J98k27O6o5l6J55
1113B5J09j95J22L6j07J2M2km8j6m9K61j16j25nK2m0J51M9k28K3P2j2j9o6R8J41j61j5k0N3
725hOj05l4J54j11J27n7O9k6J66j42Q1q1n3N2Q0N5k15O4l4r1O9Q2L8R2m7r5k4k9KQ2k5m4n8
299f0O0Qj0k6J07j20J10j26M6RP0J62k95J70Qj18rO8M3j50L8J00j4l3o4Nj3JP4J8r%r7L3j01
-139a15J71q1L2k9j04J83q7P5j78J05P9j14p4J73j00MN4n6J10p2
$$ plain form
2740 -57 -1 37 109 -60 21 -57 -18 -76 -57 19 12 -60 -21 39 18 38 -60 -30 44 -20 21 -90 -79 39 -17 -33 -32 6 62 -7 -15 5 23 76 99
2302 99 18 21 34 -15 63 -52 -61 66 -42 2 84 43 32 24 127 -26 -77 -26 64 -100 49 20 4 -34 96 110 114 74 9 -22 12 131 -60
1889 -60 -131 -30 -40 34 -32 73 13 -91 -65 38 -37 -171 -55 -14 -52 40 40 49 135 10 -64 31 -24 123 105 -15 21 -86 71 24 -2
1501 -2 0 99 -39 80 -13 -4 24 170 83 132 7 -6 -5 122 28 -1 -79 -103 2 -22 -4 -48 85 -176 -66 132 -95 -29 -94 -130 25
1113 25 134 -61 61 97 -10 2 44 42 -6 -22 -71 190 74 -51 -56 -34 -74 77 126 -102 -79 -7 -19 -38 -104 -6 135 -26 -41 -61 -8
725 -8 -2 -107 -141 13 -98 29 -28 41 15 181 39 120 39 -14 38 118 173 -42 22 -12 -103 -34 48 86 178 131 36 12 -17 -15 67 42 -2 -60
299 -60 0 8 -2 -28 79 -41 69 -57 -11 -2 68 230 -65 105 113 -5 -14 54 97 -53 -15 85 71 38 -26 -21 -34 -33 41 59 50 50 -47 -14 -115
-139 -115 56 -25 7 -22 -126 57 -30 45 -133 -28 51 -63 -137 36 -64 -60 -6 -62 48 -24
-390b4
##PAGE=	F1=-21761.2
##FIRST=	23151.189942674980557,	6007.9998942000029274,	0
##DATA TABLE=	(F2++(Y..Y)), PROFILE
6008f6N3j5Lj17N1O9j02M1J52j0o5o1R1M3j41MJ20k27J12J11M7l9J3j68J18Pn8M8O8p4J6j79
5607a55k3R7J4O6n6m3J17N1mj4n3o0N6q2J58%P3j26O8p5L6P8m0j59q9K50j54J35K9K5j28o2
5207g0J24n1J0oM6j06n2N9k8N7lN2Q8j21N3r0j25N7Q1Mk1J5Rk2J55n4j06rj7P6qL6R7m2l1
4769E7n4J03q0P8o0J4j88J98J9l5r4O5p1J7J7J7Q9j66K6N0l8L2J1O8m9p5l4J91r0J3m0L4M6
4355G1p1P1r4j07N8J29%r1O0r7K8J9n8L6N9N0o0j2l2L3LQ1l5Q2k24J96%q1P7q4RK8Q0q0j99
3917a55J77n4p4N9M6j23O3N3o6L6j30RL13j50p2J35p4K4P8j30K7K1Rj34J05Q8m4n0j5L2Q9
3529I3M2j10q5n9J38N9p6J71j53p5rK3n5Q5o4R7J5j0m0J41j29N6MJ4q2J1k3l7r2J44j39q5
3128b30J44L4O5J29j54P6j43J44L3p4Q6j29j6Q8j10J09j03O3PPN1l1l5j15k5P8J57k1J01j12
$$ plain form
6008 -66 -13 -28 -25 -142 -91 -22 -124 -83 69 59 -6 -67 24 67 -74 -70 50 -177 -65 46 93 54 67 -101 17 24 -34 14 82 8 24 -155
5607 -155 -178 -81 -67 -1 -57 -100 17 68 64 50 -3 -63 -7 -89 69 69 142 16 84 9 45 123 83 -76 -165 85 -69 66 95 120 -8 -70
5207 -70 54 3 13 7 53 -53 -105 -46 -74 -17 -20 32 120 -1 52 -38 -163 -106 -25 -21 -42 -27 -18 -40 115 61 -45 -54 -71 5 -3 33 130 88 57
4769 57 3 106 26 104 44 58 -130 68 87 52 -42 23 -48 -31 -14 3 92 -74 -48 2 -36 -4 7 75 26 -49 -83 108 18 31 -9 25 71
4355 71 0 71 -23 -130 -72 57 57 -34 26 -71 -43 -24 -82 -46 13 63 3 -9 -41 -8 -5 76 41 123 -101 95 95 14 91 7 16 44 124 44 -155
3917 -155 22 -32 -106 -47 -1 -124 -61 -8 -74 -38 -168 -159 154 4 -68 67 -7 17 95 -35 -8 13 22 -112 -7 81 37 -13 -28 4 93
3529 93 135 25 -60 -119 19 78 2 173 20 -55 -64 -41 -96 -11 -75 22 37 27 -13 128 -1 55 59 73 -9 2 -21 -58 -150 -6 -145 -230
3128 -230 -86 -52 13 142 -12 64 -79 65 98 24 110 -19 -35 53 -57 52 -51 12 19 26 77 46 11 -104 -129 -51 106 85 186 74
2753G4j44Q4K8N7k18J00m4Rj6J3R6n5m6N6J3oK1q2M5L7o6M2j17L3J21p2L0j7N6M0o4OkK3M
2315C9Q9m5m3n2rO2r3K3J26j68P0Q2j4k7j5R6j34r0M7R2j24J91r5n0K5J49n7Jm1k0o1N8J34
1901A46k08n4J31m2N2l6O4m3j21N9P5p1j12R8O6p2Q6M3MQ4j42o2P8o3J38n0o1j1q4J57mln6
1488a4J09j04O2n3j6J2J28q2N0q3m3J7J00j11j0n2mN3k3P6o3J44l09J52J86k23P2q7J4J48
1113D6Q7k00R2J06j09rM8o6M0m8n4K07o1j58M6O0l5R7N8k52K3J25m4k1m4P1J30j22p1k8P5
725a1L4j29QJ00n7R5m4M2p3J97j12K3n0p7Q7Q9M0j83M9l7o8N5N2L4J29qj31o6k4L4O8J0m5
311C1m3j0N1j5p6J47j26P8j10J02L0mJ72k31J32k2j16l2N0O5j19K4Q6j8j3l2n2K2RM4J3K6
-89F3k5r4N4j67K36j26L4l0o7J32p1J37j89Q3O3o2j15J70n3n5M5l6J38q0
$$ plain form
2753 74 -70 14 42 99 -119 -19 -63 -54 -70 -57 39 -16 -62 -6 7 1 22 -60 -15 22 -44 -2 -119 -86 35 -37 -7 -24 32 72 8 14 12 35 39
2315 39 128 83 40 -12 -21 41 -52 -29 97 -71 -1 81 67 40 25 121 -13 -103 -56 36 -88 103 8 -42 -17 132 75 76 35 15 -46 12 146
1901 146 -62 -116 15 -27 25 -11 53 10 -111 -52 23 -48 -160 -62 4 -68 18 61 65 149 7 -55 23 -40 98 48 -13 -24 -108 49 45 42 -14
1488 -14 95 -9 53 0 -16 -4 124 42 92 9 -34 -17 83 -28 -38 -90 -94 -41 -64 12 -51 93 -216 -64 122 -101 -29 -116 -102 46
1113 46 133 -67 25 131 22 13 61 -5 35 -13 -67 140 79 -79 -33 27 -8 89 147 -105 -82 43 -1 -22 -66 5 135 13 -58 -86 -11
725 -11 23 -106 -98 2 -55 40 -4 38 -35 162 50 73 23 -54 33 122 162 -21 28 -9 -77 -22 30 64 193 185 54 -12 -36 -2 66 76 31
311 31 -12 -22 29 14 -62 85 -41 37 -73 29 59 55 227 -4 128 106 -10 -42 8 73 -46 -22 64 46 33 1 -51 -29 -20 24 37 63
-89 63 38 -56 -2 -169 67 -59 -25 -55 -122 10 -61 76 -113 -30 33 -29 -144 26 -27 -82 -37 -73 65 -15
-390a5
##PAGE=	F1=-21855.6
##FIRST=	23151.189942674980557,	6007.9998942000029274,	0
##DATA TABLE=	(F2++(Y..Y)), PROFILE
6008f6M8k1M4j53O7Q7j29P9J40l3p1o7R5L1j26J3J19k25J29M7J20n5Qj79Q2J4m3L8R2rk4j99
5607a47l8J38l9R2l4r0J05R6k2ol2m1m2l1J55LL4j28Q8o7O8P6m4j62n4J98j47R7O2nr0l6Q9
5194D6m4K0k1K7p2o9O7J4j5Q2j7R4j51J30j34j29O3J03k6l4N2om9J64rj42j7j2L8L6J9R6l9
4781F5Rk1O8o5L9m6Lj46J43M6j1p9K8o5k7K1M4J06j38nJ1j7L0PJ26p2n6j03K32j47N0m6PK9
4355B0k7P4r6j01P2J53l4r6N6q8M8j2qj1Q4K2p7Ql8O5n2R6j0P8k42J73M5j17Q9o5k5Q7J9m7
3930D3j80K07q4j00Q1k7o7O0K6m8L0r6K8K13j09o5J37m9O1M4j05MJ8pj76J51N4p7k9K1K9Q8
3529G6N7r4j05p2J23P0o5J78j29j07N0j2n3O6rP8m5K6n2J12j17N1L5K1r3K2p2J2j73K30j42
3141a33r4J70mJ16O4j15O2j80J91M1r8R8j32qQ4j14Q1o5P5k5pO8p0k2p9l4J01J46l5P4j16
$$ plain form
6008 -66 -18 -39 5 -148 -81 6 -123 -44 96 63 -8 -75 20 51 -75 -62 57 -168 -39 8 128 73 81 -98 -16 -2 -45 -7 85 76 52 -147
5607 -147 -185 -47 -86 6 -28 -118 -13 83 61 55 23 -18 -60 -91 64 67 101 -27 61 -6 62 138 94 -68 -122 76 -71 26 88 83 -7 -43 46
5194 46 2 22 1 28 -44 -113 -46 -32 -47 35 18 112 -39 91 -43 -172 -109 -6 -32 -66 -14 -20 -69 95 86 -56 -73 -85 -47 -11 8 104 65
4781 65 74 53 121 56 95 49 52 -94 49 95 84 5 33 -32 -59 -38 6 112 -26 -31 -20 -37 -7 0 126 54 -2 -105 127 -20 30 -16 -9 20
4355 20 -7 67 -29 -130 -58 95 61 -35 21 -67 -19 -31 -39 -50 34 56 -21 -13 -51 14 -38 58 48 126 -116 57 102 -15 74 9 -16 71 90 43
3930 43 -137 70 -14 -114 -33 -60 -127 -67 -41 -89 -59 -155 -127 86 -23 -88 49 0 61 105 0 4 22 15 -161 -10 44 -33 -62 -41 -12 76
3529 76 133 39 -66 -138 -15 55 -10 168 39 -68 -18 -30 -83 -17 -26 52 7 33 -19 93 -24 27 62 83 -10 12 -60 -48 -221 9 -133
3141 -133 -227 -57 -61 55 119 4 66 -114 77 118 20 118 -14 -22 62 -52 29 -36 39 14 7 75 5 -17 -96 -130 -29 117 82 156 40
2753D0r1O6L8K6k51J03Oj5K2pJ26q4k3O5l3J1K5q4O4qo7L7q9N3R5o7O5k5N5K0n3K7j9J7m9
2315dJ38Nj01q1K9M2o2N0R5j94O9Q0kk5k1Q6r3j33K9R3p4J99j41o8R7J31r5j6m1L6o9O3J18
1901A40j85k6J43n0nk2N1l6j11Q2L7o2o8P1P8r8O1O2QO1j45m2O0o9J27n7%o2o0J35L6Lp5J08
1476I0r0Pom5RQ9n6L8l8l2JQ2j27J2k4nJj0J16o6J31k81J68J27j85O7j03N0J34P3j90M3J68
1063A48r4k5N1j25J03m6o4J36Nj80Q5P7jK8M8k20NJ35o5k1l6P0J06p6j15k1R4M0j18M9OJ3
662hQ9l7jj19J98o7m7J3r3J15J01J6j63J7Jn8M3JM4J42K5j44r7k4O7N4K1m2kr0R0j4r9J66
236I8j35L7p0J42N0j13J74j19P5n8r2n9K6R6o5j6Q0l4J6Rj24Q2Oj4L0L5l6p0P7k08K42j25
-164f3J2j7m1O0l7J82j76O6K8j6j30J37j4q0L4j0J23o9
$$ plain form
2753 40 -51 15 53 79 -172 -69 -63 -78 -56 -63 63 -21 -44 21 -12 -1 24 -60 4 -4 -71 -34 -123 -70 25 -42 23 -2 53 73 20 47 28 45 -4
2315 -4 134 139 38 -43 -14 28 -34 16 111 -83 -14 66 64 39 18 104 11 -122 -93 0 -74 125 -16 -84 13 144 49 33 -8 28 -41 22 140
1901 140 -45 -71 72 22 17 -5 46 10 -101 -19 18 -44 -112 -41 37 -61 0 62 70 131 -14 -56 4 -65 62 5 5 -57 -117 18 54 57 -18 90
1476 90 0 7 1 -44 -35 54 -2 36 -2 -34 -33 49 -78 -66 -90 -95 -94 -104 12 -54 77 -204 -36 91 -94 -27 -130 -80 54 127 -63 -20 148
1063 148 54 29 80 -45 58 12 -52 84 89 -91 -6 71 70 98 146 -74 -69 66 1 -20 -56 14 120 44 -71 -92 2 42 -76 -27 -21 -8
662 -8 81 44 43 -76 122 55 8 21 -72 43 144 160 -3 14 15 -43 0 1 45 187 212 68 -29 -53 14 68 89 47 45 -45 45 31 -68 98
236 98 -37 0 -70 72 122 9 183 64 139 81 -11 -70 -44 52 -13 -29 51 17 33 42 -82 0 6 -8 22 57 21 -49 28 -180 62 -63
-164 -63 -51 -68 -109 -49 -86 96 -80 -14 14 -2 -132 5 -9 -89 -55 -65 58 -11
-390a1
##PAGE=	F1=-21950
##FIRST=	23151.189942674980557,	6007.9998942000029274,	0
##DATA TABLE=	(F2++(Y..Y)), PROFILE
6008d9M9m8R1j55N8P7j41J23J02m9o5o2P4J2p4L0P1j79J21NJ51r4L4j69M8kj6K5J18L6l2k02
5607a12m8J64r3J05k3r7N4J30m0K5pl6j23K2J53l5Lj10J15m1R0M1m2j39l4J51j32M1Q3k8l5
5219Bj8N7l1J9m2J3l3q3Q5L2p1J52p6O9j56J79j65r1P9J22q5k9Q1mq3J38N2j64k7kj3O0J4
4806a9P9j9N0J0J9n1J1j7l7q6Q4P1j8l5Km8n3mP2J25j24l0j5JL6j8J83p7l3j74K38j93P6k8
4380b2%l2M1O2o0q4P6J55p1p5J0o6Q1n0L5l7Q4k1p4J9l8J00q9P9L5M2k26J52O2j29J05l8n2
3967b6J29o2oj39K09p2j29J01j22lL7J2k0K0o8O2J01m7n2J10k5Q6j3p7J9J0j2k22J71K7j27
3579a28K8M2K9O5P3o1j14p6J03Q1p6J75q3j31J00n5m0O1L5M3p7L4n2Q0j17O2N0L7r8L4j18
3191i4O0k08K62j26p5J49k8J54j2m2K6j81J79P1j02Q3j08qQ5j08K9j7L7l5rR7j14Jl6n0J02
$$ plain form
6008 -49 0 -48 43 -112 -54 23 -118 5 107 58 -7 -69 5 17 -57 -27 44 -135 -14 -9 142 48 82 -87 -39 -41 -57 -32 86 122 90 -112
5607 -112 -160 4 -89 16 -7 -104 -50 80 40 65 58 22 -101 -79 74 39 42 -68 47 6 96 137 95 -44 -78 73 -59 -18 65 37 2
5219 2 -16 41 10 29 -13 0 -33 -116 -31 1 -70 82 6 75 -81 98 -67 -158 -79 43 -42 -71 10 6 -77 61 113 -51 -78 -80 -93 -33 -19
4806 -19 60 41 91 101 120 69 80 63 26 -60 24 95 77 42 44 -4 -57 -61 11 136 12 -18 -33 -32 4 -14 169 92 59 -115 123 -70 6 -22
4380 -22 -22 -54 -13 49 -11 -95 -19 136 65 -10 0 -66 15 -35 0 -37 47 26 -48 -29 -67 33 -56 23 58 100 -126 26 88 -41 64 26 -26
3967 -26 103 41 35 -104 105 33 -96 5 -117 -120 -83 -71 -91 -71 -139 -77 24 -23 -75 35 10 96 83 6 25 35 23 -199 -28 -1 -128
3579 -128 -100 -58 -29 36 109 48 -66 -142 -39 42 -34 141 58 -73 27 -28 -68 -7 28 71 -6 28 -24 56 -61 1 51 88 -10 24 -94
3191 -94 -34 -242 20 -106 -181 -32 -60 94 82 40 66 -115 64 135 33 116 8 0 85 -23 6 -11 26 -9 -18 79 -35 -34 -70 -120 -18
2803a8Q5j2N0r2k3QN8Jk59R3M9k9O1m8J56q0qN9o7J7L7r7Q3n3n2K1l8N6N3m0P4k8M5J3m1M6
2352H0l0mr0J63L8j42o3N7K7m2O4K7j66N3O3%nk9Q0l6j73NR3l0J67j50o7J47Q5q2l8m3R6o7
1926a2O1N9j26MJ36l9q3k3P7m6p9R4Lo2j5L7Q1j11K3O9K3J8j26k1M9p9J09k7M3j11m0J01O3
1513E0Oo6Q8j05k5M3p5K7L6k8K8nJ9l7O9j08J6j2k8l0RJ20m2R2j88J55M8j29L9r6N5J12P0
1100A08j71LK03o0m1N5j66J28kr4P0O6j90J13P7L7l5L5j69j7J16p8j5l6P6Q7l8j43KJ09K6
712E6q6P4r0P0J03k8m6j38J62k2j02Q5r3J26J04oj62k0P0p5K9l7N9J26M7j31j02m0R3M4Ol5
311D1M4j42J09qq4J46j39Qk6J53O3k08J48J0L2r0o9p5JJ24j3o1Q5m9M2M4j87J42j4n9N1J3
-89C2l2l7J03k18J93q7k%m1j0OJ93j57O1Qj2j01Q2J4o6J5K4O9m4
$$ plain form
2803 -18 67 55 105 13 -10 -2 56 57 -202 -109 -60 -89 -28 -76 80 0 -8 51 -16 1 38 -59 24 -29 -81 -60 -98 -42 11 -29 45 17 62 75 34 80
2352 80 50 46 -44 119 157 15 -48 9 36 -6 58 85 -81 -28 35 35 30 1 81 45 -128 -123 -30 -60 107 -43 -110 37 122 40 2 -41 55 -12
1926 -12 49 108 -18 -14 122 83 0 -23 54 8 -71 23 26 -36 -51 -14 67 -44 -21 48 71 89 -37 -58 -9 -88 21 -6 37 -74 -114 -13 50
1513 50 56 -10 78 -27 -52 -9 -84 -57 -21 -49 -21 -26 -7 -44 25 -83 -67 -79 -107 -137 -128 -8 -50 42 -146 9 57 -72 -33 -129 -74 38 108
1100 108 -63 -60 143 83 42 97 -69 59 57 -37 33 99 -91 22 99 136 101 136 -33 -50 66 -12 -27 -63 13 100 62 -81 -79 30 56
712 56 -30 44 -46 24 127 99 53 -85 77 55 -47 38 -55 71 175 169 7 -13 57 -18 11 -26 33 159 206 75 -27 -67 26 70 76 41
311 41 85 -57 52 44 -40 106 -33 -25 -51 102 165 -43 105 115 147 57 -12 -87 -86 38 25 -36 49 0 42 86 -101 41 27 -32 19 32
-89 32 0 -37 66 -152 41 -46 -48 -48 -89 -99 -93 100 -57 4 12 0 -101 -19 -5 -71 -56 -32 37 -7
-390g
##PAGE=	F1=-22044.3
##FIRST=	23151.189942674980557,	6007.9998942000029274,	0
##DATA TABLE=	(F2++(Y..Y)), PROFILE
6008a9N5q6J16j21M8M5j45J54N9o1n1m9M4j6nO0mj15J03j8J33j33P5j40K3l9K1J2J30N3j6
5620A13j64o0J63j24J04l3n2k4J43n4O8J3n1j54O0J45j00j9o9J43oQ1j1k5j07k9J15j12JR1
5244D6m1J5j7L5rPo6J2j6p9J14K5r5J76j04K1j37J91j71l5Q8J37j45k2J12Mj01Q2J08j65l7
4856f7No3O0K5M2J4P7L9k7m8J1J5q3l3L0Q9m5J7k3j3n4l6R5J24j25m2j5OM4l8K08p0%k31K06
4418I4k01Q0oJ5j06J06M9on9O7J24r5m7l7m6J18q2N5l8O5o5n6K3k6J21j06N5O9j1j77J29M4
4017E0j08J08rm6J32j30K8q8J84k2j58J12j98M1QJ4jK1o0R3J3Pl3P0k0J04p5m1O3j0k5k35
3617b11J62Jj67J00M4K8M3Q0k0j13p7Q3Q2r6J59k4j43J32r2j6O1N6Rq3J8k5L6j17P8N3N2r6
3216cL5j46R5j97K41r4n0J06l1J66p6L0j7j37J08J09r0N9p3oP8r1j4J3m0j5JJ34j58K4J3o8
$$ plain form
6008 -19 36 -50 66 -55 -7 38 -107 47 106 45 -6 -55 -11 -27 -32 28 24 -91 12 -6 127 -6 69 -71 -48 -87 -66 -54 76 129 113
5620 113 -51 -111 52 -72 32 -1 -53 -77 66 12 80 93 42 -112 -52 93 -7 -26 -95 48 42 123 112 87 -20 -49 66 -46 -45 46
5244 46 5 20 3 38 29 36 -30 -18 -34 -113 1 26 -69 107 3 24 -113 78 -93 -128 -40 97 -48 -70 42 46 -55 27 135 -30 -67
4856 -67 -62 -125 -65 -40 2 16 93 132 105 57 68 83 0 -33 -3 86 41 58 35 22 -32 -68 27 151 26 -16 -31 -25 19 -19 189 119 119 -112 94
4418 94 -107 -27 -33 -18 -124 -18 31 25 -34 33 157 62 15 -22 -68 50 -32 23 -15 50 -15 -71 -48 -74 47 -59 -4 65 54 -123 6 50
4017 50 -58 50 41 -5 127 -3 25 -63 121 99 -59 53 -145 -104 -96 -82 -83 -62 -122 -29 -16 -9 -42 28 8 112 37 -4 59 49 24 -211
3617 -211 -49 -48 -215 -115 -71 -43 0 80 60 -53 -130 -47 35 -61 98 74 -69 63 -29 -45 16 72 81 -2 16 -9 27 -90 -12 41 93 -3
3216 -3 32 -114 -19 -216 25 -69 -119 -13 -44 122 46 76 59 -78 30 139 49 108 35 29 107 16 2 15 -25 -40 -39 95 -63 -39 -26 -94
2815i4Q0kL1L2n3M3p1P2%k37P9O6l3J00j01J72n0jL3p7J4M7j04R5p9k2j0J4L8J6nN4l0L9K8
2377H4l1N1l7l0j06J68K8j44j1P0K1m5N9n8q9M1K5MJ8l5P8J9j96pO9NJ10j17n9J56L2l0m7
1964dn2J46p0O7l2m4K2J11k0j50l3J25o4m0R9k2p0K1J3Q1j16j4P9L7k4r2lM5r7Q3K3N9j42
1551g8k6P6P6J5n6M7j45j8Q3r0O1j9j6K1J6Q1p2N3m1qj9o9l0K7Q8J3L2p2J32k6p7ko8K5R1
1113EP6j59qK00ro4O6j84J24O5j36K1J05j85J26P2N0p0L5j40k0R0r1nl2P0Q1j9j51K9J20P
712F9o0Q1j45R2J11j5p5j22J01J7j21J31p2J16Q9j9j67m7J43j14Nm4P8Q0N5r7p4p4J01M3k3
324D3k5O8j36J02ll7Q3j24PmJ37O7k62J01J16K2j14o2o6j9J36J8q7R2n7O1O2k15J66n0n3N7
-77B4k9j6oJ24j98J06l8K3J0o6n7M9J69j53O3L2n0m2J8L4l1j1O2Mk1
$$ plain form
2815 -94 -14 -16 15 47 -6 37 -34 38 38 -199 -120 -54 -87 13 -88 84 34 33 66 -11 3 50 -54 41 -38 -60 -70 -56 -18 -2 -7 47 17 56 84
2377 84 53 104 67 37 -69 99 127 -17 -28 42 63 18 77 19 -70 -29 -4 0 18 -17 61 80 -116 -123 -54 -49 61 -56 -115 41 73 43 -4
1964 -4 -56 90 20 87 55 11 33 144 124 -26 -59 66 2 -38 61 39 -31 -10 3 84 -32 -46 33 70 46 -46 -49 -4 -101 -18 5 64 -78
1551 -78 -104 -28 48 63 7 54 -91 -109 -26 -116 -55 -74 -90 -69 -53 28 -44 9 -32 -40 -59 -128 -158 -131 -43 -30 2 -70 62 36 -41 -43 -111 -86 5
1113 5 81 -78 -86 114 105 41 107 -77 47 112 -24 -3 102 -83 43 115 165 95 130 -10 -30 60 -31 -36 -68 2 83 64 -87 -58 62 69
712 69 9 90 -55 37 148 133 58 -64 37 54 -67 64 -8 108 197 178 11 -36 107 -7 -2 -46 32 112 167 70 -4 -78 23 66 43
324 43 18 86 -50 52 49 12 95 -29 -22 -26 111 178 -84 17 133 155 41 -21 -87 -106 30 48 -39 53 -4 57 119 -96 70 20 -33 24
-77 24 -5 -21 -27 97 -101 5 -33 -10 0 -66 -123 -74 95 -58 5 37 -13 -55 -37 -3 -34 -45 17 21 0
-390@
##PAGE=	F1=-22138.7
##FIRST=	23151.189942674980557,	6007.9998942000029274,	0
##DATA TABLE=	(F2++(Y..Y)), PROFILE
6008A1O2j16J02o2N3J7j53J53L6p7l6l4K0m6N8R9p2o7R5l8R1j55J03r3Pq4N7kJ18N5Oq2p8
5595e2J31j20Q5m4J7j04J35o3J12K6q9j24P7J16j55m6oJ65K2L5n7Qp6l2P7q5QQ3n0M3k3J9
5194C3K6j5q6K1k9n7J55jr2J43q8k7j08J79j61J6P4J41j77k5J45Nr0J9J35j36m3Kj04N0M4
4806e1oM7Q5O0n6n3L2L4j02nrR6o9M8n8M6l9n5J09R4j29l8RpM5l6J91n9L6k60J50j64N8JM2
4368a3j47J38M5M3k6L9O5r8l7m0m1J49j02N2j9L8r8l5K7lJ17j05L9P0n2j06R7mo0R3J4lR7
3955A34j69N2m3J48M0j81J08k25N6j7K1OM8q5J16m1L4j4L4l5J16j11mJ13m0n5j94J29j9j86
3579b64J61K6K1M8P6J6j10q3O8O9j07J31L4j36J36j07J5M9N0op1rJ7j4j08Q7N2N8r0J9j48
3191a20J08j51J84n2l8O8j4J48j10P3m9o2NJ39q1N5n2NN1n4k9J0j28L0J5J67j94L6O3p2L8
$$ plain form
6008 11 73 -43 59 -3 50 67 -86 67 103 26 -10 -44 -24 -70 -12 87 15 -52 43 5 96 -59 44 -49 -42 -126 -69 -71 47 102 108 26 -52
5595 -52 79 -41 44 0 17 -87 48 -15 97 123 34 -90 -13 103 -52 -98 -104 61 83 118 61 69 -7 -39 38 -47 -39 44 -6 37 14 33
5194 33 59 44 -42 -21 -50 -107 48 47 -45 98 10 -17 -125 54 -107 -91 -17 124 -53 -78 67 72 -18 1 136 0 -43 -41 -145 -95 -51
4806 -51 -57 -10 75 135 79 26 58 92 -10 -15 -24 72 3 51 -7 39 0 -55 54 148 19 -19 -10 -17 28 -8 183 124 160 -100 50 -114 -56 -55 -13
4368 -13 -160 -22 23 66 40 79 144 46 9 -31 -72 77 -25 27 8 46 -52 -87 -60 -63 54 -51 -12 58 6 -100 -3 -7 -67 26 40 37 134
3955 134 -35 17 -26 122 162 -19 89 -136 -80 -97 -76 -70 -22 -107 9 -32 2 -12 22 -13 103 -8 -12 101 61 6 -188 -59 -78 -264
3579 -264 -103 -77 -56 -8 68 84 -26 -109 -41 28 -79 52 86 -50 86 -21 -6 43 93 87 16 7 24 10 -98 -11 41 99 9 28 -120
3191 -120 -12 -163 21 -31 -69 -1 -15 133 23 96 47 -15 -10 129 48 103 51 56 107 53 24 34 -94 -64 -49 118 -76 -40 23 -49 -11
2803a1q3P2J7k4J06j42O1K7j90O4O1l2J31j47J67j9J2j8o1RN1r1R8q2Qm9N1OoK3K1l4M1O0
2377I7k7L3l2n0r4J55k5j07N0P2K2o9L4j24J6L7k2J4L0l8P9N5j97PJ1L3N6o3m9J20oL0m0o5
1952e7J75q0Q0j26M2K5P4nj84l8J59o8j2R8l3q0L1J0P2j15l4R6L4m4n7J4M7j26N4P0M2j40
1551g6j6P7P1K8n1j1j85K0J01q4J04n9l0RK9J26q4K7N2m5l9j15kL7M6P1k8K0J12p1m7l6l6
1138h5k4Q1Q7j67J3J66M2r3Q7j84J16J17j61j4J10j62J18P1L5o9N0j46MP0j03Kk1M8Q4k2j34
750h4L9J26On2O2j37P8R5Kq1q8L8N4j02J30m1R0O3k0j68m6J85j53k6k5R0K4M7n2k6j09Q1N0
336E0m2j5N7p7P5mK2op9K7j1J08O2k68N0J71L8j31p4k5l1J25K3p7R3o1P0O6k02J33p9MM1p7
-89d4J0K0J26j59PmQ6J5j03p0Q2J31j71O0R8j10K0l1M0Kl6R4m5r
$$ plain form
2803 -11 -94 -22 -5 -29 77 -65 -4 23 -167 -103 -42 -74 57 -90 77 58 70 52 -9 0 51 -40 58 -24 -16 -65 -14 -8 -14 9 30 -4 37 97
2377 97 70 103 71 21 -73 82 57 -50 0 72 94 25 59 -65 -49 -12 -34 -20 10 -28 51 106 -91 -84 -73 -40 16 -47 -96 24 18 48 8 -57
1952 -57 118 38 118 -8 34 59 133 128 -56 -94 65 -3 -15 83 50 -30 1 11 83 -32 -66 30 64 20 -37 -23 24 -102 -48 22 64 -76
1551 -76 -92 -15 56 84 33 22 -163 -143 -42 -126 -22 -81 -111 -102 -73 53 -31 -4 48 3 -36 -151 -153 -116 -70 1 -27 -7 105 34 -13 -49 -85
1138 -85 -109 -28 59 -108 -95 71 113 20 107 -77 39 156 -5 -19 91 -71 47 118 153 84 134 -12 -8 62 -41 -39 -60 -12 72 50 -84
750 -84 -45 81 87 35 97 -40 38 133 135 54 -34 4 58 -44 86 45 135 198 178 10 -36 149 -4 -30 -55 35 59 106 54 28 -81 0 50
336 50 8 -7 50 -27 48 44 66 60 -19 8 -3 105 167 -101 -51 120 158 27 -47 -72 -103 22 45 -32 61 0 70 136 -66 67 -12 -8 33 -44
-89 -44 -34 -14 112 -47 -40 -44 42 57 -46 -116 -34 97 -74 -14 84 -26 -6 -37 3 5 -31 63 18 9
-390I
##PAGE=	F1=-22233
##FIRST=	23151.189942674980557,	6007.9998942000029274,	0
##DATA TABLE=	(F2++(Y..Y)), PROFILE
6008C4N6j17N8mP7J1j72J22L9j01k5k0J6p2R1J31r8n7J03o0O0j49R2l3lj26Q1j4Q0O7J0K2
5607I9r9Q3r3N0l6P6j57J07p3J50L8j39n5P6O7j68q2N6J82K9m4p5N0n2l4L3n8O7O3o4M3k4
5207A6QP1m4r9L2o3j9J98l2p7O7l8n4q1J65j53M8L4J35j72l9J72po1k0J15p6m1j0j32M8N2
4806e7m2O1Q1O8o5n3N0L1q0Ok6Q9q0M3j05J23j9n7J16L9j19j8L8k8L2j6J53n2N6k53Q8j03
4405i9K4jN7j36J36M5O7J8olq6o2K7n6J71j16L9PJ4j16k1L8K5Q1q3L6K9n2l2M6o0oP2K5N9
3967H1L4j74O9j3J15R1j91Q7k00N0l5K2NJ03j37J27o1K7KPo4J25j01K3J40o1r7j07Q2k6j87
3579b64J92pJ2Q4N6M9j11r8N7M9j02R5Q8j13J12j02N2RK9Km6l3N1o1q3Q3N2M5p6j6j18R4r1
3166a10J18qm5N0J7J02j11Q4n9J2r0J53q5P1n4K3Rmk0j4j88P8J7J88k03L0J05o2pj29Q6kj3
$$ plain form
6008 34 90 -27 31 27 104 115 -57 65 104 3 -22 -42 -26 -98 -7 124 26 -31 72 12 72 -77 15 -18 -21 -147 -66 -80 0 67 77 99
5607 99 0 83 -10 40 4 80 -77 30 -43 107 145 6 -49 27 94 -74 -156 -100 82 111 67 -8 42 -10 -44 -11 -69 -2 61 -3 40 16
5207 16 24 95 51 -48 -16 -79 -98 100 68 -9 58 20 -34 -115 50 -103 -55 -21 114 -58 -97 75 68 7 -13 102 26 -15 -25 -157 -109 -57
4806 -57 -99 -38 43 111 46 -7 43 74 -6 0 -26 63 -17 26 -79 44 25 -32 84 123 4 -14 24 -4 28 12 165 113 169 -84 4 -99
4405 -99 -75 -76 -19 -155 -19 26 93 111 105 102 16 -46 -19 -75 96 -20 19 26 40 -76 -97 -59 -34 47 -36 0 29 -23 -55 -9 -69 -75 -3 22 81
3967 81 115 -59 10 -3 112 203 12 99 -101 -51 -86 -64 -59 44 -93 34 -27 0 2 9 -55 70 -31 -8 132 71 -26 -133 -51 -77 -264
3579 -264 -72 -79 -67 17 73 122 11 -87 -30 19 -83 12 100 -13 99 -3 49 58 87 89 43 10 61 0 -83 0 52 97 21 5 -113 -19 -110
3166 -110 8 0 -45 5 22 124 13 97 38 50 -40 113 28 99 45 68 77 73 53 39 -149 -71 -54 134 -69 -39 66 4 -3 -132 -46 -48 -61
2753f1J65j84K2P3j29M3N3m1J41j65J43mL4p9k6J1N1n8Q7p2K4p9O3k8j0L8km1M1Q8k3kj4n4
2327Eo2J29r9n3J01O9J6r6%j44J11L9n7K4K3l2Q2O1j80M5p4O4K9j7m2N7j7O7j9q0J74q3Q2
1914A23j88J10J6M0jj80l0J56m9KR4l8q6K7K1N1j05l1J06J2l7l5L7N4j59L4Q7lj02pJ00N0
1513F9L6m4o7k05O9R0n9J46p8o4j2M1J35o0j7J35p6n5j56M1L6K6J06p5O1J03q3m3l9k9o3Q7
1113d4R7j93M7J19P6j24J24j76J20J24j43l8P2j15R0O4J0l4O7j66L9N7j07LrJ8Q4l9q9J7J29
725H0K6n7K5q2M4O4Po2o2lQ8o4R1j2M8M6j1j63j3J83j76m1j2Q7k1L2j3K9j33M2N6l7nJ9%M2
274D2j0O6q9rN0l5Q0N1k45J5J71N5j38r0L3l2R4J3m0Q6o8P9N8j60N5q6P9J5j13L6L7J11j16
-139eq0J0J52K6j36n3R9J01j96M0J78j58N3n3M0J1n0J09o2r
$$ plain form
2753 -61 104 -80 -58 15 -114 -71 -18 -59 82 -83 60 56 90 11 -15 -4 47 -11 76 4 28 -51 12 -16 -26 12 10 -31 10 98 75 73 59 5
2327 5 -57 72 -27 -80 21 90 106 10 10 -134 -23 16 -41 -17 6 -26 56 117 -63 -18 -92 -28 1 -16 -58 -1 -18 49 30 -50 124 41 123
1914 123 -65 45 61 101 100 -80 -110 46 -3 -1 93 55 -31 -4 17 68 -37 -68 38 50 13 -22 15 69 -90 -56 31 28 -74 -81 19 69
1513 69 105 61 -6 -211 -142 -52 -111 35 -43 -107 -119 -78 57 -3 -20 115 39 -16 -172 -131 -95 -69 37 -38 23 126 43 0 -39 -68 -131 -44
1113 -44 53 -140 -93 26 102 -22 102 -74 46 170 27 -11 61 -54 36 100 110 76 143 -23 16 73 -34 -31 -40 -22 62 23 -66 -49 80
725 80 106 49 74 -8 36 100 107 45 -17 -20 68 4 95 83 131 177 166 3 -10 173 -3 -44 -56 31 10 42 29 58 -75 -33 23 -14 -19 0 0 42
274 42 32 98 9 0 50 15 95 146 -99 -84 87 142 4 -86 -53 -85 9 22 -18 68 0 79 137 -23 32 -54 25 40 -73 -37 0 111 -5
-139 -5 -85 -75 77 103 -33 -86 13 114 -82 -42 136 -22 31 -22 18 29 -21 88 26 17
-390A7
##PAGE=	F1=-22327.4
##FIRST=	23151.189942674980557,	6007.9998942000029274,	0
##DATA TABLE=	(F2++(Y..Y)), PROFILE
6008D9L2q1NL3R9L0j92P8N6j28j9oL3q9Q5J40p7p9J14p4O1j19M5K5j2j50Q5k3K7J04j5J10
5607A47j14L5o4QQR5j68O0p5J76M0j72J3O8Nj31j16R7J90J1j26o7R8l6l8j2m1J58L4q3K7j4
5207A3JJ09p5r9L6q9J8K27n1o2k9K5m7p0J65j59O3k1J23j34o2J82k8l5j8N5Kk9k6j42N5M4
4806e8n4N4O5O0n5m4M8J5k9J2k3P0p6J3j48J92j4m4J18k3q1RM6m2J0OJ22m8M7k16M2n5kMM6
4368c3q8J24K9O5O1m7n9o9j17J41p8J77j24K4K8oj14j8N8M4K1l0K6l4mL0k0j00K9N8K2J07
3967A03k9j57R0jQ5J17j78N2j42M1n6J4J0J66j95J28n3qJ3qr5J27m4K8J27n6j38rL7j0j86
3579b27J94m7QJ33K2Q3j19j15M6M0q7M9J35q4P0q5R1n2J5J7k7l7N8r5m2O6N4J9n7n9o3M8k6
3166g4O9K8o2N1M9M0r0P4m1M8j47J55j02R5p4M1l1M4j2l3j97J13pJ92j73J3J22m5l8j33P4
$$ plain form
6008 49 81 0 5 38 137 167 -25 53 109 -19 -38 -44 -11 -100 -15 125 48 -31 83 9 70 -49 -4 21 9 -141 -56 -79 -52 52 37 147
5607 147 33 68 4 12 20 115 -53 7 -68 108 148 -24 -11 57 62 -69 -185 -88 102 113 -13 -80 18 -18 -56 -68 -109 49 83 0 27 13
5207 13 14 123 48 -51 -15 -104 -86 141 90 28 -1 24 -23 -93 72 -87 -24 -45 78 -56 -118 64 36 1 -17 38 40 11 -15 -157 -102 -58
4806 -58 -112 -58 7 67 12 -32 16 31 2 14 -9 61 -15 -2 -150 42 28 -16 102 79 -2 7 53 11 21 27 149 101 148 -68 -26 -81 -83 -79 -33
4368 -33 -121 3 32 97 158 111 52 -17 -134 7 -71 106 -18 6 34 28 -86 -104 -46 -2 19 -11 15 -19 -23 7 -13 -113 -84 -26 -4 103
3967 103 74 -83 7 6 91 208 30 82 -60 -19 -75 -61 -51 115 -80 48 -5 -13 0 -8 -103 24 -20 8 135 79 -59 -68 -31 -41 -227
3579 -227 -33 -80 -72 61 83 166 47 -68 -22 18 -69 -20 115 31 101 16 107 55 70 87 60 23 81 -14 -56 10 64 83 26 -33 -96 -48 -74
3166 -74 -5 23 -39 12 61 101 11 85 44 92 -55 100 -2 93 19 60 29 73 61 28 -169 -56 -63 129 -44 -31 91 46 8 -125 -51
2778e1k4j7K03j81l1J16o8J3N8p1J29j47J05mN9j30J4K5N2j6O1o5J6q0M9n1NM0lm5K4R0j2
2365F3l8Nk8l6R5j58pJ31P4j5j09l1j11J68L7o5K4Lk1R3L7j52Q5j51R6L6%l6j2lP4lq7J50
1939A08o7N4j98J46NK3j0j59mJ19j0NQ7m2q9K2L1K4q5rR7k0j3k9O7N2j74L2O7o0m1LJ17J8
1513F7L9k3r8k00J05N3l2J90q9r7l7N4J10j0o6J70q3n1j82P3L1L9J01r0N0R4o9n2j2n6o7J02
1113c6R6k20P6P7Q0j50J74j67J34Q4p9n4Ln5N7M2kJ9O8j71O3M0r1KqjO7o2j8l4J33N0n7k2
687C8j6J4M0rl2n5j6J09k0L9NnM5Rj61M2J49j76k5k4O3l9K2PO9j29nN7j2Ok8O0J3j5P8j36
236c8N9N6m5N8L3k10PJ23N9j28r4Q2j8M7LKP5q0R8M0j16l1o4J33qj26M5N6Q0p8j34PJ79N3
-189A25j52k4J06Q3k06J2K28j74M6m3L4om7R9m7j7
$$ plain form
2778 -51 -75 -92 111 -70 -101 15 -53 -40 18 -53 76 -71 34 30 89 -41 -27 -2 50 34 95 30 46 -34 15 -36 -31 9 6 -39 -15 75 63
2365 63 25 30 2 -34 61 -97 -104 27 101 86 -23 -54 -165 3 40 -25 -1 2 -19 74 111 -41 44 -107 -11 25 25 -11 -23 -26 48 45 -42 108
1939 108 41 95 -103 43 48 71 61 -98 -102 17 7 12 99 57 -32 -10 21 45 -40 -49 48 28 15 -14 53 105 -69 -37 30 -30 -71 -68 49 67
1513 67 106 83 -15 -215 -110 -57 -89 101 12 -85 -122 -68 42 32 -34 136 53 2 -180 -107 -76 -37 64 -26 24 118 49 -3 -15 -71 -138 -36
1113 -36 60 -160 -84 -7 73 -77 97 -70 64 148 69 15 18 -37 20 62 60 79 147 -24 39 79 -12 -10 -18 -19 48 -14 -32 -66 67 117 60 38
687 38 22 36 76 67 35 -20 -36 73 53 92 97 92 137 146 -15 27 176 0 -25 -49 14 -25 -3 4 73 -56 -61 -4 -16 -10 -38 22 35 20 98 -38
236 -38 21 77 32 90 123 -87 -80 43 102 -26 -120 -38 -56 -9 -6 -4 71 -9 89 129 13 -18 -82 51 43 -83 -38 18 98 20 -114 -107 72 125
-189 125 -27 -51 55 138 -68 -56 172 -2 44 1 35 29 -18 81 34 17
-390A7
##PAGE=	F1=-22421.7
##FIRST=	23151.189942674980557,	6007.9998942000029274,	0
##DATA TABLE=	(F2++(Y..Y)), PROFILE
6008F1kk9k6L9R7O0k00M3O6j49j1J3N9r2M0J20k2j15J18p1Q8p8j8P0k3j53P3k6j5J51n7J53
5607A64j19km3k7O8P8j36ko5J78K9j70M7O4m9o2j25R7J87k5j82m3J48l0m3m3m4K44Nj06J4
5219GLmJ23j00q7K7p9M2K19m2m4j20P2j4p3J77j78O9o6J07q0q3J65m3k9K2k2O7mm4j28O6K3
4806e1m3L0M6L2k8k5J9NJ7K5pM0o0k6j58K24l7k3J18p5k1M0J4l3j4J3J18l8Mj56J8m1j0K3
4380f0K1m3J31j6M5Q7o0q6o0j67K36q4J61j27J5L7k7q6k9Q6L6l2M7j0q6P2P2q5j15L1O6LJ21
3967I4p0j30J14%N0J15j38K0q3L9q3jK6K06k27J19k6n4J8j2j15J24K4K4P6k4j68O7MK9j89
3579a71J75q2J4J52oJ18j32j21K8N5p0j3J76o0K8o6J22j12K4K5l0k0L8j12RM1N4ml6r8Nk6
3178i5L9M6N1p1N1P3j8o7O5j0L0j53J51j15J05r6N4n2P1k3l0j53J22m9J75j09jJ07m3l3j06
$$ plain form
6008 61 59 30 4 43 140 200 0 43 109 -40 -51 -38 21 -71 -31 89 67 -48 70 -1 87 9 -9 61 38 -115 -42 -68 -83 68 11 164
5607 164 45 43 0 -27 41 119 -17 -19 -84 94 123 -47 0 64 15 -47 -172 -75 112 87 -95 -138 10 -20 -63 -106 -150 94 99 -7 7
5219 7 10 6 129 29 -58 -31 -110 -68 151 109 65 -55 17 3 -70 107 -71 -2 -68 39 -41 -124 41 -2 -31 -9 -31 36 32 -12 -140 -74 -51
4806 -51 -94 -64 -18 14 -14 -39 -20 -15 2 27 20 60 0 -26 -184 40 3 -20 98 23 2 42 56 23 9 22 140 102 106 -50 -32 -73 -83 -60
4380 -60 -39 -82 49 33 78 165 105 19 -41 -208 28 -56 105 -22 -7 30 3 -83 -112 -26 10 -22 25 15 -71 1 73 -12 -127 -96 -30 -27 94
3967 94 24 -106 8 8 58 173 35 55 -28 11 -72 -73 -47 159 -68 51 25 -29 -11 -23 -138 -14 10 34 110 86 -82 -15 -11 18 -171
3579 -171 4 -78 -64 88 82 200 68 -53 -25 30 -40 -53 123 63 91 25 147 35 59 84 54 34 72 -40 -31 10 64 60 24 -74 -69 -95
3178 -95 -56 -10 41 -30 21 94 76 9 74 64 94 -59 92 -23 82 -14 40 -12 59 36 6 -147 -25 -74 101 -8 -9 98 55 22 -84
2790h4M8m8k0J99j33p4J36k2j6P5j20J03j09O1%P6j54M5N0N3K0K0o7qm5J3n3L6L2J3m4j8O9
2377C4Mn9J2K3k9O1j76J6J34R0p4j02m6m6J82J9m3J0j5j3J13Jj30J05j75J17N7rk7o7K3O1
1977E1nq2J10j8j2j58J47JL3l9j42L3P0L9PP1m4r4K7K8kn7J8N8l8J0l1R8L3j54M5K3j13K9
1551e8J4R5j1M0J7r0j79J10Qk7K31j01j15m7O6O2M6r9J47o6j9j90O7L7O6O9o6PP4m4o2K6r8
1138i0k9J06Q0k23Q8M3N9j59K17j58J42K7Ln8p3%L3J4jP0N0j44N1K0n2Lk1pL7q0O0r2J39N9
712A14l4p2K9kM4m8on9pR9J7PJ4o2N3L9j70R7J10j62K0n5J8k5K6MP9r2m6M5K5J6o5P9mj2O2
249G6j41J09L0k3L7J5j83K8N0M9j02q2R7J7rJ0K0O9r7J31Rq2q8k4J42j5j11K6P5M3m2j46p
-164a19J49R4j49nJ07P3j84oK12j53QpL1l6l5P0j7k3
$$ plain form
2790 -84 -36 -84 -104 95 -38 -112 24 2 -14 61 -59 44 -65 -4 -4 72 -82 -37 13 66 86 106 39 31 -14 -1 -54 -18 14 27 -17 -35 34
2377 34 38 -21 -9 14 -15 46 -130 -114 20 110 36 -66 -112 -158 24 43 0 10 -5 -18 95 96 -34 71 -104 13 70 61 34 -33 -10 51
1977 51 46 -36 74 56 44 -114 33 34 67 28 -114 -81 -11 28 35 106 62 -32 -5 23 21 -36 -18 40 2 12 -19 79 112 -42 3 26 -87 -58
1551 -58 -44 51 40 80 97 7 -172 -62 -54 -81 150 49 -66 -113 -47 15 61 -38 109 43 24 -166 -99 -62 4 73 7 14 88 44 -18 8 -90
1138 -90 -119 -13 67 -156 -68 -25 34 -125 92 -66 76 103 106 48 -25 -25 8 22 21 91 141 -3 48 68 16 19 -2 -9 28 -52 8 -84 55 114
712 114 80 8 37 35 79 31 25 -34 -41 58 75 82 96 34 87 126 -44 53 163 1 21 -34 -16 -41 -15 -11 68 -24 -70 -25 0 16 -49 30 26 14 76
249 76 -65 44 74 51 88 103 -80 -52 -2 47 -55 -137 -40 -23 -32 -22 -2 67 -30 101 110 28 -60 -84 58 43 -68 -42 33 76 34 -112 -119
-164 -119 30 124 -25 -30 77 150 -34 -40 172 19 27 20 51 15 -20 50 33 10
-390A0
##PAGE=	F1=-22516.1
##FIRST=	23151.189942674980557,	6007.9998942000029274,	0
##DATA TABLE=	(F2++(Y..Y)), PROFILE
6008G4l1J1k6K4N9Q5j87L7N4j51kM0P5q4k0P8L4j37J07n5J19l4o8Q4l5j32N0j4l1J79r1J43
5607A55j12k4l8m0J17N1q4p2l8J50Lj25L9O1p8J1j01N9J69n8j87k5J90l1n0m7p2K93j2j30
5232b6K4J2mJ03j12o6Qk7M8J61kk1j76P9K7q0J86j97P3q5Q7k2j00J26m4m5P8q3R7K9n9r2O6
4819c7Nk4JK9nJKk7J4K9M0K1kl1n1j24J97p5lJ07r9M3O7n2kl0lJ39j3o1q8K0o2mM5J1l9J65
4343A04q5K2R3l6q3n3j91K52n5J19j18J2L3n6l3m4J15mn5J31p2j07J40R3j25j12NR5k3R7p3
3955a4j02J32j1MR1p0Pm7M7j16j3M7K02k07R8Pr6K0%j22J12O7K4J5J4j81R8j3R0j96J46r7
3554f4K6J14oJ45j43j09lR3n8q5K02m6Jm7J35j48N8J7o2OJ5j14N7J4N1j3j4j26O5j08J00M7
3153@O3o3L5P9n6n8P1K0l4j20J44j01Q9j13P0n4O8n0oq2J07q8J36l0lO5o8J3o3K0o9pJ39n3
$$ plain form
6008 74 43 54 28 52 111 196 9 46 100 -51 -53 -13 62 -22 -42 36 70 -67 40 -15 104 70 2 86 51 -81 -31 -45 -76 103 12 155
5607 155 43 19 -19 -59 58 109 25 -47 -85 65 68 -57 -18 43 -35 -24 -125 -66 103 45 -142 -167 23 -8 -58 -105 -177 116 104 -26
5232 -26 -2 10 6 109 -3 -69 -61 -88 -40 121 119 98 -78 1 28 -52 134 -63 10 -75 12 -10 -110 16 -28 -73 5 -78 19 48 -11 -103 -37
4819 -37 -32 -56 -55 -26 -31 -30 -28 -55 -41 -12 28 49 47 16 -35 -159 38 -37 -40 67 -32 11 78 26 24 -6 -9 130 117 56 -32 -12 -74 -78 -33 -22 -61 104
4343 104 19 41 134 98 15 -38 -229 23 -32 87 -31 -19 14 -42 -75 -119 -4 -8 -63 68 -4 -111 29 122 -3 -115 -110 -15 -38 59 -14
3955 -14 -116 16 5 9 100 30 37 -10 37 -79 -92 -45 157 -50 48 55 -41 -21 -21 -143 -31 36 60 75 89 -92 6 -7 83 -113 33 -64
3554 -64 -38 76 70 215 72 -37 -40 53 -5 -90 112 66 67 20 155 7 65 82 20 26 41 -73 -16 -2 49 36 22 -104 -39 -147 -47 0
3153 0 63 0 35 114 58 0 71 91 57 -63 81 -20 69 -44 26 -28 40 -10 -16 -98 9 -79 57 27 24 89 21 34 -29 -9 -78 -85 54 1
2728Ar0J29Ll6R0j65P1p5J8K3Q1j45N8Q3L9M2k6p6k7Ql8k4P1J8K9l9o9M3J6o2j0R5m7M0j50
2290a21J9J10J16j49p9m9K7J65j4nj2k5rJ31k8j19R4j29J17O2k5qr6M0M7j9p4O3N4r2r6J30
1889B6PO0q4j44P2K9Q8PM5l8r5L0J7k0l0L2Mk4J8k8J16pr8O8k5j46Q5K9K8k4M5O4n1j54Q6
1451a2k6o0K62j19j10k8O9J0Q3r6Q4l6L2j79J3O0Q3L4rm8M5k3o3N4j26L4P6N7j85Q3J1K7j43
1038a46K30j48J32j2O6n0j28L2K8mNR8K0r2OlRJ2n2nOq4J24j32J41M9Oj15M6rP6j02Rn7J3
599c1M8M8NJ8j05O3P0j89J25Q5j34O3q3l2J1M2k2O8l3p0K0N5K8q4N9mjK8j09J31k4K2J0J1
174H9j70O0k6M1o6o1P2O5n8L6kP5j09J65l2o5r3J1J18rp3k3R6Qj0j17k2P7J37j34j5J12N6
-239A33j29kJ28j00m0L6L5n8k9L3J7k4
$$ plain form
2728 1 -89 40 43 7 97 -68 3 -72 -54 -31 50 -95 -37 46 85 127 101 25 -2 6 -32 -56 15 33 62 23 -46 -3 13 -49 -59 36 -11 29 -121
2290 -121 -102 8 124 -25 -104 -153 -126 39 25 20 8 -17 -26 105 77 -42 52 -77 40 102 77 69 -27 13 60 41 -33 30 84 -8 -104 26
1889 26 33 93 9 -135 -63 -34 54 61 106 68 -27 3 20 0 -30 2 6 -18 0 -28 88 81 -17 51 26 -120 -35 -6 22 -2 43 107 56 -98 -12
1451 -12 -38 -98 164 45 -65 -93 -24 -14 69 -27 57 21 53 -126 -113 -53 30 64 55 7 52 29 -34 20 -106 -72 4 61 -124 -41 -30 -3 -146
1038 -146 84 -64 68 56 122 72 -56 -24 4 0 5 103 123 31 37 34 43 55 3 -2 4 -80 44 -88 53 102 108 -7 39 30 106 4 13 -44 -31
599 -31 17 65 70 88 -17 46 116 -73 52 137 3 66 -17 -49 -38 4 -18 50 17 -53 -33 22 50 -34 25 21 20 48 -61 70 46 68 78 89
174 89 -81 -21 -47 -6 -72 -133 -61 4 -54 -18 -20 55 -54 111 79 14 -79 -68 50 41 -32 -55 41 49 39 -78 -100 -23 114 -20 -35 77 133
-239 133 4 2 130 30 -10 26 61 3 -26 7 24 0
-390@
##PAGE=	F1=-22610.4
##FIRST=	23151.189942674980557,	6007.9998942000029274,	0
##DATA TABLE=	(F2++(Y..Y)), PROFILE
6008H5m3J6JNnR6j55N6K9j28KP1O0n8p0K5P4j34Q8m2J32Kq5O3m6r3K9J2k4J69r3R1q7l8m0
5570c5l3J41L1l7j32rR8k1n8lN8p9P3o0NJ30o6j41k9K14l2n1k9j14K90j0j47N0J3lN9j15l6
5157g8j5M9L6O9N6lj74M5N2p4J77k01P5p7O3K3j05P8k3p8J23r9Q4N8o5m9M6Mqk9K8m3K5K5
4731ep1M1nM9N6n3J0n1n3J14j03J3P7r1Q8Q7j25L4l8l0J68K2j21l3L6q4kM5M2q0K06j55J0
4318bQ8J1o1m0j82J71NN8q8NK5q9L1n1J32o5l3J89j35r8J67J00j27j03l3J31m6N6l7q6J36
$$ plain form
6008 85 42 58 59 64 59 155 0 56 85 -43 -41 30 90 32 -38 -13 61 -73 15 -27 105 107 22 85 39 -54 -25 -13 -37 132 39 130 43 5 -35
5570 -35 -68 73 104 67 -65 -74 24 3 -55 -58 0 -79 -6 -66 -61 69 3 -138 -167 47 15 -36 -65 -179 111 101 -46 4 17 14 73 -42 -78
5157 -78 -93 -44 -8 61 117 114 -60 -15 37 -37 140 -61 14 -63 0 23 -82 -4 -27 -105 18 -81 3 61 -4 -53 -7 -3 -11 -40 -12 -55 -30 -5
4731 -5 -76 -35 -40 9 65 12 22 -29 -82 32 -71 -58 19 -72 16 103 -22 12 -26 -56 112 134 13 -20 16 -68 -70 -25 17 -63 143 -12 -2
4318 -2 86 97 36 -4 -186 -15 -10 48 -40 -35 -10 -99 -68 -119 13 -52 -85 104 -31 -129 38 138 11 -92 -125 6 -40 16 -21 -107 29
$$ [...]
-390c2
##END NTUPLES=	nD NMR SPECTRUM
##END=	
##END=	
