##TITLE=	Nov18-2021.50.fid
TM-VI-169 acetone-d6 Mg+Bz-pyr.

##JCAMP-DX=	6.0	$$ MestReNova 14.3.0-30573
##DATA TYPE=	LINK
##BLOCK_ID=	1
##BLOCKS=	2    
##ORIGIN=	Mestrelab Research S.L.
##OWNER=	hrzepa
##$MNOVA/LINK_BLOCK_TYPE=	ITEM	$$ NMR Spectrum
##$MNOVA/ITEM/POLYGON=	(XY..XY)
5321,5835
8722,5835
8722,8208
5321,8208
5321,5835
##$MNOVA/ITEM/Z=	0
##$MNOVA/ITEM/ANGLE=	0
##TITLE=	Nov18-2021.50.fid
##JCAMP-DX=	6.0	$$ MestReNova 14.3.0-30573
##BLOCK_ID=	2
##DATA TYPE=	MNOVA NMR VIEW DATA
##DATA CLASS=	MNOVA VIEW DATA
##$MNOVA/ITEM/ZOOM/X=	-4.0107147498308073352,	16.011019999997905927
##$MNOVA/ITEM/ZOOM/Y=	-339.77237033843994141,	3709.395233154296875
##END=	
##TITLE=	Nov18-2021.50.fid
##JCAMP-DX=	6.0	$$ MestReNova 14.3.0-30573
##BLOCK_ID=	3
##DATA TYPE=	NMR SPECTRUM
##DATA CLASS=	XYDATA
##NUMDIM=	1
##ORIGIN=	Bruker BioSpin GmbH
##OWNER=	nmr
##.OBSERVE FREQUENCY=	400.20240119999999706
##.OBSERVE NUCLEUS=	^1H
##.SOLVENT NAME=	Acetone
##.PULSE SEQUENCE=	zg30
##LONGDATE=	2021/11/18 13:19:00.000
##.ACQUISITIONMODE=	SIMULTANEOUS (DQD)
##$ORIGINAL FORMAT=	Bruker XWIN-NMR
##$MNOVA/SCALES_VERSION=	9
##$PARAMETER FILE=	(acqus, ASCII, /private/var/folders/f6/rjf_tdyn2v98c5c0wvkgn4s80000gn/T/eT+$IcHqQhydX2hNaapZ8g/50/acqus, 0)
$$ ##TITLE= Parameter file, TOPSPIN		Version 3.2
$$ ##JCAMPDX= 5.0
$$ ##DATATYPE= Parameter Values
$$ ##NPOINTS= 11	$$ modification sequence number
$$ ##ORIGIN= Bruker BioSpin GmbH
$$ ##OWNER= nmr
$$ $$ 2021-11-18 13:19:34.019 +0000  nmr@CZC2439F63
$$ $$ /opt/topspin/data/agmb/nmr/Nov18-2021/50/acqus
$$ $$ process /opt/topspin3.2/prog/mod/shimcntl
$$ ##$ACQT0= -2.10084033613445
$$ ##$AMP= (0..31)
$$ 100 100 100 100 100 100 100 100 100 100 100 100 100 100 100 100 100 100
$$ 100 100 100 100 100 100 100 100 100 100 100 100 100 100
$$ ##$AMPCOIL= (0..19)
$$ 0 0 0 0 0 0 0 0 0 0 0 0 0 0 0 0 0 0 0 0
$$ ##$ANAVPT= -1
$$ ##$AQSEQ= 0
$$ ##$AQ_mod= 3
$$ ##$AUNM= <au_zg>
$$ ##$AUTOPOS= <47 >
$$ ##$BF1= 400.2
$$ ##$BF2= 400.2
$$ ##$BF3= 400.2
$$ ##$BF4= 400.2
$$ ##$BF5= 400.2
$$ ##$BF6= 400.2
$$ ##$BF7= 400.2
$$ ##$BF8= 400.2
$$ ##$BYTORDA= 0
$$ ##$CAGPARS= (0..11)
$$ 0 0 0 0 0 0 0 0 0 0 0 0
$$ ##$CFDGTYP= 0
$$ ##$CFRGTYP= 9
$$ ##$CHEMSTR= <none>
$$ ##$CNST= (0..63)
$$ 1 1 145 1 1 1 1 1 1 1 1 1 1 1 1 1 1 1 1 1 1 1 1 1 1 1 1 1 1 1 1 1 1 1 1
$$ 1 1 1 1 1 1 1 1 1 1 1 1 1 1 1 1 1 1 1 1 1 1 1 1 1 1 1 1 1
$$ ##$CPDPRG= (0..8)
$$ <> <> <> <> <mlev> <mlev> <mlev> <mlev> <mlev>
$$ ##$D= (0..63)
$$ 0 1 0 0 0 0 0 0 0 0.06 0 0 0 0 0 0 0.0002 0 0 0 0 0 0 0 0 0 0 0 0 0 0 0
$$ 0 0 0 0 0 0 0 0 0 0 0 0 0 0 0 0 0 0 0 0 0 0 0 0 0 0 0 0 0 0 0 0
$$ ##$DATE= 1637241573
$$ ##$DE= 6.5
$$ ##$DECBNUC= <off>
$$ ##$DECIM= 2496
$$ ##$DECNUC= <off>
$$ ##$DECSTAT= 4
$$ ##$DIGMOD= 1
$$ ##$DIGTYP= 12
$$ ##$DQDMODE= 0
$$ ##$DR= 22
$$ ##$DS= 2
$$ ##$DSPFIRM= 0
$$ ##$DSPFVS= 20
$$ ##$DTYPA= 0
$$ ##$EXP= <proton>
$$ ##$F1LIST= <111111111111111>
$$ ##$F2LIST= <222222222222222>
$$ ##$F3LIST= <333333333333333>
$$ ##$FCUCHAN= (0..9)
$$ 0 2 0 0 0 0 0 0 0 0
$$ ##$FL1= 90
$$ ##$FL2= 90
$$ [...]
$$ ##$Sgu3PowerLevels= (0..7)
$$ 0 0 0 0 0 0 0 0
$$ ##$Sgu4PowerLevels= (0..7)
$$ 0 0 0 0 0 0 0 0
$$ ##$Sgu5PowerLevels= (0..7)
$$ 0 0 0 0 0 0 0 0
$$ ##$Sgu6PowerLevels= (0..7)
$$ 0 0 0 0 0 0 0 0
$$ ##$Sgu7PowerLevels= (0..7)
$$ 0 0 0 0 0 0 0 0
$$ ##$Sgu8PowerLevels= (0..7)
$$ 0 0 0 0 0 0 0 0
$$ ##$SguType= 3
$$ ##$ShimPowMaxUA= (0..63)
$$ 130000 130000 130000 130000 130000 130000 130000 130000 130000 130000 130000
$$ 130000 130000 130000 130000 130000 130000 130000 130000 130000 0 0 0 0
$$ 0 0 0 0 0 0 0 0 0 0 0 0 0 0 0 0 0 0 0 0 0 0 0 0 0 0 0 0 0 0 0 0 0 0 0 0
$$ 0 0 0 0
$$ ##$ShimPowMaxUC= (0..63)
$$ 130000 130000 130000 130000 130000 130000 130000 130000 130000 130000 130000
$$ 130000 130000 130000 130000 130000 130000 130000 130000 130000 0 0 0 0
$$ 0 0 0 0 0 0 0 0 0 0 0 0 0 0 0 0 0 0 0 0 0 0 0 0 0 0 0 0 0 0 0 0 0 0 0 0
$$ 0 0 0 0
$$ ##$ShimPowMaxUG= (0..63)
$$ 524287 524287 524287 524287 524287 524287 524287 524287 524287 524287 524287
$$ 524287 524287 524287 524287 524287 524287 524287 524287 524287 0 0 0 0
$$ 0 0 0 0 0 0 0 0 0 0 0 0 0 0 0 0 0 0 0 0 0 0 0 0 0 0 0 0 0 0 0 0 0 0 0 0
$$ 0 0 0 0
$$ ##$ShimPowRcbType= 3
$$ ##$ShimPowRes= (0..63)
$$ 1e-20 1e-20 1e-20 1e-20 1e-20 1e-20 1e-20 1e-20 1e-20 1e-20 1e-20 1e-20
$$ 1e-20 1e-20 1e-20 1e-20 1e-20 1e-20 1e-20 1e-20 0 0 0 0 0 0 0 0 0 0 0 0
$$ 0 0 0 0 0 0 0 0 0 0 0 0 0 0 0 0 0 0 0 0 0 0 0 0 0 0 0 0 0 0 0 0
$$ ##$ShimPowRng0= (0..63)
$$ 1 1 1 1 1 1 1 1 1 1 1 1 1 1 1 1 1 1 1 1 0 0 0 0 0 0 0 0 0 0 0 0 0 0 0 0
$$ 0 0 0 0 0 0 0 0 0 0 0 0 0 0 0 0 0 0 0 0 0 0 0 0 0 0 0 0
$$ ##$ShimPowRng1= (0..63)
$$ 1 1 1 1 1 1 1 1 1 1 1 1 1 1 1 1 1 1 1 1 0 0 0 0 0 0 0 0 0 0 0 0 0 0 0 0
$$ 0 0 0 0 0 0 0 0 0 0 0 0 0 0 0 0 0 0 0 0 0 0 0 0 0 0 0 0
$$ ##$ShimPowRng2= (0..63)
$$ 1 1 1 1 1 1 1 1 1 1 1 1 1 1 1 1 1 1 1 1 0 0 0 0 0 0 0 0 0 0 0 0 0 0 0 0
$$ 0 0 0 0 0 0 0 0 0 0 0 0 0 0 0 0 0 0 0 0 0 0 0 0 0 0 0 0
$$ ##$ShimPowRng3= (0..63)
$$ 1 1 1 1 1 1 1 1 1 1 1 1 1 1 1 1 1 1 1 1 0 0 0 0 0 0 0 0 0 0 0 0 0 0 0 0
$$ 0 0 0 0 0 0 0 0 0 0 0 0 0 0 0 0 0 0 0 0 0 0 0 0 0 0 0 0
$$ ##$ShimSysFunc= (0..63)
$$ 1 2 3 4 5 7 9 11 15 16 8 10 12 14 6 17 13 18 19 20 0 0 0 0 0 0 0 0 0 0
$$ 0 0 0 0 0 0 0 0 0 0 0 0 0 0 0 0 0 0 0 0 0 0 0 0 0 0 0 0 0 0 0 0 0 0
$$ ##$ShimSysMatrix= 0
$$ ##$ShimSysType= 1
$$ ##$TFXNUM= 0
$$ ##$TRIPLO2= 0
$$ ##$VTU= 2
$$ ##$VTUETH= <149.236.99.20>
$$ ##$VTUTY= <no>
$$ ##$WBREFAM= (0..15)
$$ 135.5 97.7 100 100 100 100 100 100 100 100 100 100 100 100 100 100
$$ ##$WBREFLM= (0..15)
$$ 0 0 0 0 0 0 0 0 0 0 0 0 0 0 0 0
$$ ##$WBREFPH= (0..15)
$$ 72.26 -67.22 0 0 0 0 0 0 0 0 0 0 0 0 0 0
$$ ##$WBSGU= (0..15)
$$ 0 0 0 0 0 0 0 0 0 0 0 0 0 0 0 0
$$ ##$XFAC= 2
$$ ##END=
$$ 
##$DECIM=	2496
##$DSPFVS=	20
##XUNITS=	HZ
##YUNITS=	ARBITRARY UNITS
##FIRSTX=	6407.6102040000005218
##LASTX=	-1605.0880428824991668
##DELTAX=	-0.12226593800080109986
##XFACTOR=	1
##YFACTOR=	0.022980581175671824234
##FIRSTY=	6.8510541915893554688
##MINY=	-2.5546274185180664063
##MAXY=	3372.177490234375
##NPOINTS=	65536
##XYDATA=	(X++(Y..Y))
$$ [...]
2256C86J4k1m5k0K1K9Kj3LK5J8j9m8l9jK5K2J1QJ6J2MPK1K5kn1p8n7MN3N4J9nrj3k2j7QJ8
$$ 386 400 379 334 314 335 364 366 353 356 381 399 380 332 293 292 317 339 350 358 374 386 390 397 418 443 441 390 312 255 259 312 366 385 380 371 358 336 319 327 345
2251C45jj6LL1K7MkJ2Oj9k3MK1pm3l9nJ7Oj1j0OJ9K2J9J1Jqj3j8k0j5%J4J1jlJ2J7ll1k8Q
$$ 345 344 328 331 362 389 393 391 403 409 390 367 371 392 385 342 303 298 315 321 310 300 306 325 347 366 377 378 370 357 339 319 304 304 318 329 328 325 337 354 351 320 292 300
2246C00L7K9pl6l5pK1K5KqJ9M9J8n9r3l6M5N2ml0J0M8L6%j0LMnj2j0KK1L3Pm0n1oL9L5ROJ1
$$ 300 337 366 359 323 288 281 302 327 329 321 340 389 407 348 255 219 264 316 312 282 292 340 376 376 366 369 373 368 356 346 348 369 402 409 369 318 312 351 386 395 401 412
2241D12k4p3o7JN2M5J7J0km0n4nO7P7K3k1k2rj5k5j6JPJ0K2L4L0Pk1m5n4l5oJ3J8L1M3J9l2
$$ 412 388 315 248 249 301 346 363 373 371 331 277 272 339 416 439 418 396 387 372 347 331 332 339 349 371 405 435 442 421 376 322 287 281 294 312 343 386 405 373
2236C73m5RO1M2j3k2K0L8Nk6j7lj8l6k1PQpoOOJJ3L3L3J2rj8k2j5NK5K9J8Kk2n4o5m2mJ4J1
$$ 373 328 337 398 440 427 405 425 463 468 442 425 422 404 368 347 354 362 355 349 355 361 362 375 408 441 453 444 426 404 389 394 419 448 466 468 446 392 327 285 281 295 306
2231C06J2J4PnlJ0K5M1N7N0Rk9k6qk0n4n2kM8N7L8J3j6l6k5Jll7m6nK5Ll2j7K7M4K0KJ3L0
$$ 306 318 332 339 334 331 341 366 407 464 514 523 494 468 460 440 386 334 332 380 437 475 488 472 436 411 412 409 372 326 321 346 349 317 300 327 371 391 393 406 436
2226D36K7Ok3m6n0k7mJm%J0J9L5N5M5j2p0o3jM3L2MJJ5J6RJ2K6L3K3Oj3k5k9k3j8k1l0l2j2
$$ 436 463 469 446 400 350 323 319 320 316 316 326 345 380 435 480 468 398 335 334 377 409 413 414 429 445 454 466 492 525 548 554 541 516 487 464 446 425 395 363 351
2221C51K4N0M0Oj2olk0l4k1NOoJK8L9J8oj0kpj9k6k3j8j5rOL1M6L9Ml0m0k6rMJ1J3Mqj1kM
$$ 351 375 425 465 471 459 453 450 430 396 375 380 386 380 381 409 448 466 460 450 448 441 422 396 373 355 340 331 337 368 414 453 457 427 387 361 352 356 367 380 384 376 365 363 367
2216C67QJ4K1J6kj5j6mJ3K8K8Mk4k9j6lRK9M2K3k1m5k9LJ2jj0mLNRJ7K2J2j9n0m2JL0J1k5
$$ 367 375 389 410 426 424 409 393 389 402 430 458 462 438 409 393 390 399 428 470 493 472 427 398 401 413 412 402 398 401 406 415 432 454 466 447 397 355 356 386 397 372
2211C72k0J6K0j6l3ON0L6j9m4k0RJ1LRK7L6J9qk2j1QOj8k9pK6L4J4moLJ4K2J6pl4l7k2qjJ4
$$ 372 352 368 388 372 339 345 395 431 412 368 348 357 368 371 380 407 443 462 454 432 421 429 435 417 388 381 407 441 455 451 445 448 462 484 500 493 459 422 400 392 391 405
2206D05L7L9Rk8l5j5POmqrj9k9j5K3N2L7lk9k1j2j5j1J3L2J9j2k3JK2J7lj0KJ8J3rl0k7kK0
$$ 405 442 481 490 462 427 412 419 425 421 413 404 385 356 341 364 416 453 450 421 400 388 373 362 375 407 426 414 391 392 414 431 428 418 420 438 451 442 412 385 383 403
2201D03K5J5jj2j2NK2J9%j2j6l6o5n8JN6M8kk9j1J6K0J4J1RMQJ6J3KOK7L2Kl4m4l2k6l1k7
$$ 403 428 443 442 430 418 423 445 464 464 452 436 400 335 277 278 334 382 380 351 340 356 376 390 401 410 414 422 438 451 453 459 486 518 520 486 442 410 384 353 326
2196C26%L6N3L7kl5l2NL5K7j2l6j6K5M0J3k2k0OK0Kj6j0L%j8l0l0k6j4J1L5L4J1j6k9k1RM9
$$ 326 326 362 415 452 450 415 383 388 423 450 438 402 386 411 451 464 442 422 428 448 450 434 424 427 427 409 379 349 323 309 320 355 389 400 384 355 334 343 392
2191C92O4L4j1l3k5j7j7j3ojJ1L9N1J6k8k2K2L0qj9K6N5J7l3j6L8N0Rk0j7j7l4l6k0j7l3l0
$$ 392 456 490 479 446 421 404 387 374 368 367 378 417 468 484 456 434 456 486 478 459 485 540 557 524 508 546 596 605 585 568 551 517 481 461 444 411 381
2187C81J2M8M0Mk7m3m1j7J7K3pk6oK7K1rj5J1M1M8L4Qk3l8j2L4M4Lm5n3k8j3rJ0M3N8M1J6
$$ 381 393 441 481 485 458 415 374 357 374 397 390 364 358 385 406 397 382 393 434 482 516 524 501 463 451 485 529 532 487 434 406 393 384 394 437 495 536 552
2182E52ROj1l0l3l2m0l6%M6M6Rj2RK3Jj6J6N8M5j0l3lJ7j2m7l4J2L5J9mj0nomQK3K2jk3k2
$$ 552 561 567 556 526 493 461 421 385 385 431 477 486 474 483 506 507 491 507 565 610 600 567 564 581 569 522 488 500 535 554 550 540 535 529 525 533 556 578 577 554 532
2177E32pKj1k5j6RK2J0qj6rjmj7k6rK9N0J9l3n1j6K5L8L4K6Km1o6m1J0L3J9kj4k2k5j1J0R
$$ 532 525 527 516 491 475 484 506 516 508 492 483 482 478 461 435 426 455 505 524 491 440 424 449 487 521 547 549 508 442 401 411 444 463 461 447 425 400 389 399 408
2172D08rpK4M0J4j9j1K7M8K7j2m3m6j9K4N3M3Pj6j5nkjQK0K0Lj9k6lL7N6L1j2l2k6k8m9n4
$$ 408 399 392 416 456 470 451 440 467 515 542 530 487 441 422 446 499 542 549 533 518 513 511 510 518 538 558 561 542 516 513 550 606 637 625 593 567 539 490 436
2167D36j7L2M2J5q%K0J6ok5k1mOO%LPlj7rK8N5L9%j0J1J1k7n8l5J8L5%m0l1J7M8L7Mj1j1k0
$$ 436 419 451 493 508 500 500 520 536 530 505 484 480 486 492 492 495 502 499 482 473 501 556 595 595 585 596 607 580 522 487 505 540 540 500 469 486 534 571 575 564 553 533
2162E33m4n0mN7P6L6j1k0mmk0k0OK4Pk8l8nL5L9kl8l3LK7J8Koj1j6nJ6K4QJK0K6j2n9n1lJ8
$$ 533 489 439 435 492 568 604 593 573 569 565 545 525 531 555 562 534 496 491 526 565 563 525 492 495 522 540 542 536 525 509 504 520 544 552 553 573 599 587 528 477 474 492
2157D92mk1jJ5lk8j8J9M3N0N1M2Rl0l4JK6Rl1m0pL0L0NnJ6L4J7k1l6j4Qpm0m4mL4L3J0MK2
$$ 492 488 467 466 481 478 450 432 451 494 544 595 637 646 616 582 583 609 618 587 547 540 570 600 605 600 616 650 667 646 610 596 604 597 557 513 509 543 576 586 590 612
2152F12K7lm5n7l4oNOQJ0KnjJ0J0lj3pQJ2Kj4k1j5rmJ4L7L3k0p8p4oN7N7K0LJ1J4J0J7L2L5
$$ 612 639 636 591 534 500 494 499 505 513 523 525 520 519 529 539 536 523 516 524 536 538 524 503 488 479 475 489 526 559 539 461 387 381 438 495 515 518 529 543 553 570 602 637
2147F37K6J6Lj9l0qJ9J1k2l1pKj3k1j1qk4k1QK4Nj3lJ5QonjjJ1L4L4Nj0QJ5j6l5NN0L1k2k6
$$ 637 663 679 682 663 633 625 644 655 633 602 595 597 584 563 552 544 520 499 507 531 536 523 520 535 543 537 532 531 530 541 575 609 614 604 612 627 611 576 581 631 662 640 614
2141F14J7L8J4ojnk1j4J1Ml8n6j7K6K3%nPK4L6L4nn3n1lK3jj2L5Q1M9l4p7n1qOqk5k1J7O2
$$ 614 631 669 683 677 676 671 650 636 647 651 613 557 540 566 589 589 584 591 615 651 685 680 627 576 573 596 595 583 618 699 748 714 637 586 578 584 576 551 530 547 609
2136F09O2Pm1l3%Kj7j2J1Kl3m2qK5L2L0L0J7lJL3N2L3nk7l1k3KK9K9Jk5k9k0j7j6j8j7%L7
$$ 609 671 678 637 604 604 606 589 577 588 590 557 515 507 532 564 594 624 641 638 639 672 724 757 752 725 694 671 673 702 731 732 707 678 658 641 625 607 590 590 627
2131F27N4J6m2m8NM7L5PJkj9k5KK7J2j8k4j6k3l0qK2K1LRK3mn4m9K0P8O2Rj3%J1OlnJJ6K7
$$ 627 681 697 655 607 612 659 694 701 702 700 681 656 658 685 697 679 655 639 616 586 578 600 621 624 633 656 652 598 549 569 647 709 718 705 705 716 722 719 714 715 731 758
2126G58J6j1k0NK3nn2n9j3L4L7Qj5j2%kj4j0J9M1K0l1n8l9ojj4j2RK8L4M1N0M3J2k1l0j7q
$$ 758 774 763 743 748 771 766 714 655 642 676 713 721 706 694 694 692 678 668 687 728 748 717 659 620 614 613 599 587 596 624 658 699 749 792 804 783 753 736 728
2122G28j1j6j1QK2J7jj7j8j0PK9M5L4Mj8j9j9k7k3PL0J1l3m6j6J2Pj1pJ1J6MonmoKK4M3L5
$$ 728 717 701 690 698 720 737 736 719 701 691 698 727 772 806 810 792 773 754 727 704 711 741 752 719 673 657 669 676 665 658 669 685 689 683 678 674 668 670 694 737 772
2117G72%k9k7%J5ol2k6J2M6M1Nl5n0l7pK2L4L1K3J6J3J2J1Jj0nJ2K1RlKRnk0rJ7J2j9m2k8
$$ 772 772 743 716 716 731 725 693 667 679 725 766 771 736 686 649 642 664 698 729 752 768 781 793 804 805 795 790 802 823 832 829 831 840 835 815 806 823 835 816 774 746
2112G46PM2O3M7om9k6K8L2k3m7LN9N5J6LMj6l2kM1L5j1l6k4j2kK0L3ro6n1L5P8K7m2m1%J2
$$ 746 753 795 858 905 899 850 824 852 884 861 814 817 876 931 947 950 954 938 906 904 945 980 969 933 909 897 895 915 948 939 873 822 857 935 962 920 879 879 891
2107H91pj6pj4l0k2J0L1K5J4J2J5J2J2K0K8J3k5o1n2MM9M1lk4j0LlnNjl1m7k5J4M1M9L9Ok3
$$ 891 884 868 861 847 817 795 805 836 861 875 887 902 914 926 946 974 987 962 901 849 853 902 943 940 916 906 909 906 901 906 905 874 827 802 816 857 906 945 951 928
2102I28j7RNl3l2K5O9M2pmK7K0j8l0j2j5l0j0M5O1J1n0o5l7KL2M9M6K6Rnk0k7j3RK1K3L2K8
$$ 928 911 920 925 892 860 885 954 996 989 985 1012 1032 1014 984 972 957 927 917 962 1023 1034 984 919 882 884 916 965 1011 1037 1046 1041 1021 994 981 990 1011 1034 1066 1094
2097A094jl5l4j7k1l6k0K6N4M3K8K8K2jj8k0j8j4RL5L1lk0qjnJ2M1L1k1m9k5kk3m5j9K7L6
$$ 1094 1093 1058 1024 1007 986 950 930 956 1010 1053 1081 1109 1131 1130 1112 1092 1074 1060 1069 1104 1135 1132 1112 1104 1103 1098 1110 1151 1182 1161 1112 1087 1085 1062 1017 998 1025 1061
2092A061J9J1J5J0OK1K6ol3j3K8K6j6l6j4J3J1KLJ0J0P%j3j6JK2J9lj5mJ7L3M0K8Jk1k0pK
$$ 1061 1080 1091 1106 1116 1122 1143 1169 1163 1130 1117 1145 1171 1155 1119 1105 1118 1129 1131 1134 1144 1154 1161 1161 1148 1132 1133 1155 1174 1171 1156 1152 1169 1202 1242 1270 1271 1250 1230 1223 1225
2088A225J3J9Km2n8j3M8N8J8j4k0k7m2m2k8k3j7K0O9P4K3k3k4mJ2K9M2J9l9o6k2M2N5K2%J0
$$ 1225 1238 1257 1259 1217 1159 1146 1194 1252 1270 1256 1236 1209 1167 1125 1097 1074 1057 1077 1146 1220 1243 1220 1196 1192 1204 1233 1275 1294 1255 1189 1167 1209 1264 1286 1286 1296
2083A296J1j3k9qL1M2J7j6k6j2JQJ5J7mm1n1j4L7N8M7L0Ol2n3j5N0P1L2njQj1l2k6qppJ1K2
$$ 1296 1307 1294 1265 1257 1288 1330 1347 1331 1305 1293 1294 1302 1317 1334 1330 1289 1238 1224 1261 1319 1366 1396 1402 1370 1317 1302 1352 1423 1455 1450 1449 1457 1446 1414 1388 1380 1373 1366 1377 1399
2078A399Kk2j2K5M4M2L6K2rl6j9K8N2L1%j1j6l3m1k3LJ0JPL3M5K6qk6k5k5k4jL9N9L5pk1j5
$$ 1399 1401 1379 1367 1392 1436 1478 1514 1536 1527 1491 1472 1500 1552 1583 1583 1572 1556 1523 1482 1459 1462 1472 1473 1480 1513 1558 1584 1576 1550 1525 1500 1476 1475 1514 1573 1608 1601 1580 1565
2074A565j5k5j7PK0J5J7K9K4j2l4j6K4M3L5J9Kj1lK1K8J0jJ8L4J3k6m0k2OL8O9O3J2l8l5k
$$ 1565 1550 1525 1508 1515 1535 1550 1567 1596 1620 1608 1574 1558 1582 1625 1660 1679 1681 1670 1667 1688 1716 1726 1725 1743 1777 1790 1764 1724 1702 1708 1746 1815 1878 1890 1852 1817 1815
2069A815kl2l6jJ7j1m0k0L4P2O8L2j0l2k3JJ1J4K9L9J6k9l0K6P3M8j2l9k0llkJ2J6%j8k0j3
$$ 1815 1813 1781 1745 1744 1761 1750 1710 1690 1724 1796 1864 1896 1886 1854 1831 1832 1843 1857 1886 1925 1941 1912 1882 1908 1981 2029 2017 1978 1958 1955 1952 1950 1962 1978 1978 1960 1940 1927
2064A927mPJ4Nj4j2J5L4K6J7L3N2M0Jk6k8l0m5m1lM1M8L0K2K6J4j0oL2O0M0jk6l2l1pL8N7
$$ 1927 1923 1930 1944 1949 1935 1923 1938 1972 1998 2015 2048 2100 2140 2141 2115 2087 2057 2012 1971 1968 2009 2057 2087 2109 2135 2149 2139 2133 2165 2225 2265 2264 2238 2206 2175 2168 2206 2263
2060B263K0k2kO1P4Ro1o7k6KRJ6K8K9J8J9L0L2K2Nj0j8j8jK4M2L9K6K0K6J7k1n8m2K0N9K3
$$ 2263 2283 2261 2259 2320 2394 2403 2342 2275 2249 2251 2260 2276 2304 2333 2351 2370 2400 2432 2454 2459 2449 2431 2413 2412 2436 2478 2517 2543 2563 2589 2606 2585 2527 2485 2505 2564 2587
2055B587l2k7L0N3J3k7j4J8K1JlNPJ3L8N2K9LJ5L8K0k9l9%K5Kj2J8N4L8ok0JMj9j8K4O6O2
$$ 2587 2555 2528 2558 2611 2624 2597 2583 2601 2622 2623 2620 2625 2632 2645 2683 2735 2764 2767 2782 2820 2840 2811 2772 2772 2797 2799 2787 2805 2859 2897 2891 2871 2872 2876 2857 2839 2863 2929 2991
2050B991K5jj0j1nPJ3nl7m4j6K9O0N6J9k7l6J2O6O0jm0j1L2K8kkK7L0Jj0K1N0L0pj6NJ1ok2
$$ 2991 3016 3015 3005 2994 2989 2996 3009 3004 2967 2923 2907 2936 2996 3052 3071 3044 3008 3020 3086 3146 3145 3105 3094 3126 3154 3152 3150 3177 3207 3208 3198 3219 3269 3299 3292 3276 3281 3292 3286 3264
2046C264rK4M9N0K8%j4nJ1K1K0J5Mj1k1pK5N4N3K6LMJ0%j9j1L2O1M2OpjjML6O4M7lj9RK6Q
$$ 3264 3255 3279 3328 3378 3406 3406 3392 3387 3398 3419 3439 3454 3458 3447 3426 3419 3444 3498 3551 3577 3580 3584 3594 3594 3575 3564 3596 3657 3699 3705 3698 3697 3696 3700 3736 3800 3847 3844 3825 3834 3860 3868
2040C868mJ6L8L5K0J5J0OK3N0M3%k4mJ1rj7J8M5J8j6J0N8N4J1LL7M9K0noprJ2L9L0qoL8N7
$$ 3868 3864 3880 3918 3953 3973 3988 3998 4004 4027 4077 4120 4120 4096 4092 4103 4094 4077 4095 4140 4158 4142 4152 4210 4264 4275 4278 4315 4364 4384 4379 4373 4366 4357 4369 4408 4438 4430 4424 4462 4519
2036D519K1j3oJ2Kj6j3PK9N6P7O1Rk6j5J5K6L2M1L1Kj1OK0NpJ7N0M8K5J5K1J9J1J0J1POJ2
$$ 4519 4540 4527 4521 4533 4535 4519 4506 4513 4542 4598 4675 4736 4745 4719 4704 4719 4745 4777 4818 4849 4851 4840 4846 4866 4871 4864 4881 4931 4979 5004 5019 5040 5059 5070 5080 5091 5098 5104 5116
2031E116J9K0L8O7O5J8k8k3QK3K0K4L0J1j9k6nK0M3O1O8N4K8PmPL9O0M0MJ3N8N5k2p6l7L9
$$ 5116 5135 5155 5193 5260 5325 5343 5315 5292 5300 5323 5343 5367 5397 5408 5389 5363 5358 5378 5421 5482 5550 5604 5632 5639 5635 5642 5681 5741 5781 5785 5798 5856 5911 5889 5813 5776 5815
2026E815N5K6K4L8J1l7k9K1L4%pL5N4K8J9N6P4K6l4l3J2M3M6L9K8J1RK3K6J3J5M5N9L4J1K4
$$ 5815 5870 5896 5920 5958 5969 5932 5903 5924 5958 5958 5951 5986 6040 6068 6087 6143 6217 6243 6209 6176 6188 6231 6277 6316 6344 6355 6364 6387 6413 6426 6441 6486 6545 6579 6590 6614
2022F614M8L9J1JLoj6oJ5K7M4P7R1N5%j6PK6K5J8J5Kj2rQJ3J6L2N0L6ql1mM5P0O5M9L5J8j
$$ 6614 6662 6701 6712 6713 6716 6710 6694 6688 6703 6730 6774 6851 6942 6997 6997 6981 6988 7014 7039 7057 7072 7074 7062 7053 7061 7074 7090 7122 7172 7208 7200 7169 7165 7210 7280 7345 7394 7429 7447 7446
2017G446j3JL2M7K6qj1J8L8K6J0QRQK6O0N6mm5oO5P4K5nJ1K1RJ6N1O7M1K4L8M1Rk1qJ7J0n
$$ 7446 7433 7434 7466 7513 7539 7531 7520 7538 7576 7602 7612 7620 7629 7637 7663 7723 7779 7775 7730 7724 7789 7863 7888 7883 7894 7915 7924 7940 7991 8058 8099 8123 8161 8202 8211 8190 8182 8199 8209 8204
2012H204J7O1P4M9K6J9J1oj7qJ2L3M6M4K1JNJ6Nk0j5K7O5O1K9Mmj3j9pK1L7L3K8L5L8Rk9k4
$$ 8204 8221 8282 8356 8405 8431 8450 8461 8455 8438 8430 8442 8475 8521 8565 8586 8587 8592 8608 8613 8593 8578 8605 8670 8731 8760 8764 8760 8747 8728 8721 8742 8779 8812 8840 8875 8913 8922 8893 8869
2007H869L2P0M0j9k1L1O0K8rRM9N0Pj8%K1J7%jMNJ0L2N0L9J0KK6N2L9Jk4j0J4K3K2L5M9K5
$$ 8869 8901 8971 9011 8992 8971 9002 9062 9090 9081 9090 9139 9189 9196 9178 9178 9199 9216 9216 9215 9219 9224 9234 9266 9316 9355 9365 9367 9393 9445 9484 9485 9461 9451 9465 9488 9510 9545 9594 9619
2002I619l1n8k0M2O6L7Kj2j4oJ0K8K3%rJ1L8M4L2K0J5J2J5K2K1J2J5K5K1mj7J0M1K0m4p7l5
$$ 9619 9588 9530 9510 9552 9618 9655 9657 9645 9631 9625 9635 9663 9686 9686 9677 9688 9726 9770 9802 9822 9837 9849 9864 9886 9907 9919 9934 9959 9980 9976 9959 9969 10010 10030 9986 9909 9874
1998I874M7R3P6K2k8m0j6K0K8Mj4NL7M2Rk0j6QJ6OKK2M7M9J4l5o4o0l2LL2M7L4%k6k4mRNO
$$ 9874 9921 10014 10090 10112 10084 10044 10028 10048 10076 10080 10066 10071 10108 10150 10159 10139 10123 10131 10147 10153 10155 10177 10224 10273 10287 10252 10188 10128 10096 10099 10131 10178 10212 10212 10186 10162 10158 10167 10172 10178
1993A0178J3Rj5l7l0kJ1ol0k1K4O7O1J0l9m4j6Lj0l3m4l7j7OJ2pl2k4J0L1J1k1k9j9j6k6l2
$$ 10178 10191 10200 10185 10148 10118 10116 10127 10121 10091 10070 10094 10161 10222 10232 10193 10149 10133 10136 10126 10093 10049 10012 9995 10001 10013 10006 9974 9950 9960 9991 10002 9981 9952 9933 9917 9891 9859
1989I859l6l9l4j1J2Qj5k9k4j0OJ2ll5m5k0kl6q7q4k7Rj7n5n3k4qmMNj0k2j8j6l5n5m7k9k4
$$ 9859 9823 9784 9750 9739 9751 9759 9744 9715 9691 9681 9687 9699 9696 9661 9616 9596 9594 9558 9471 9387 9360 9369 9352 9297 9244 9220 9212 9208 9212 9217 9207 9185 9167 9151 9116 9061 9014 8985 8961
1984H961k8k7k7m3m8k7pj8m4m4l0l5n3m9l4m8p2n6jK1j9o2n9l5l6n5o0n1m2k5mj7o8j05p8
$$ 8961 8933 8906 8879 8836 8788 8761 8754 8736 8692 8648 8618 8583 8530 8481 8447 8399 8327 8271 8270 8291 8272 8210 8151 8116 8080 8025 7965 7914 7872 7847 7843 7826 7758 7653 7575
1980G575j4J2j2m4n6n3m4k6j3l1n9n5k0kk0m2l3j8k5m3m4k7k0l1m6n4n7n8n0l3j4nj1k6m7
$$ 7575 7561 7573 7561 7517 7461 7408 7364 7338 7325 7294 7235 7180 7160 7158 7138 7096 7063 7045 7020 6977 6933 6906 6886 6855 6809 6755 6698 6640 6590 6557 6543 6538 6527 6501 6454
1975F454n6n2m4m6n4n4l7j9j7l2m6m9m0l0k9l6m1l3j9k3n6q6o8rK3j5p3p6k8Nj4l8k6JMj7
$$ 6454 6398 6346 6302 6256 6202 6148 6111 6092 6075 6043 5997 5948 5908 5878 5849 5813 5772 5739 5720 5697 5641 5555 5487 5478 5501 5486 5413 5337 5309 5314 5300 5262 5236 5237 5241 5224
1971E224l5n5p8p9m1LQj4j9rk2n0m8j9j7o1r9p8l0lmnlj2j9pNj0m1n0l4k5l4l5k1j2j8j8j
$$ 5224 5189 5134 5056 4977 4936 4939 4947 4933 4914 4905 4883 4833 4785 4766 4749 4688 4589 4511 4481 4478 4474 4469 4466 4454 4435 4428 4433 4423 4382 4332 4298 4273 4239 4204 4183 4171 4153 4135 4134
1966D134Rj2m7o9o1m1k1qlnm%pk6m0l0qrl7o0n1l4m1o0m6JK4pm5l2J3L2J5JKj4n9q0m0K4M7
$$ 4134 4143 4131 4084 4015 3954 3913 3892 3884 3881 3876 3872 3872 3865 3839 3799 3769 3761 3752 3715 3655 3604 3570 3529 3469 3423 3424 3448 3441 3396 3364 3377 3409 3424 3425 3427 3413 3354 3274 3234 3258 3305
1961C305K0j0j6j1j3k9n2p4p3m5j5j1l2m6l9j5J6M4L8nm9n0j9jmkJ4J1j6k6rKk1l5rJ8nm9
$$ 3305 3325 3315 3299 3288 3275 3246 3194 3120 3047 3002 2987 2976 2944 2898 2859 2844 2860 2904 2942 2937 2888 2838 2819 2818 2814 2812 2826 2837 2821 2795 2786 2788 2767 2732 2723 2741 2736 2687
1956B687m3J4L9qo7o8j5L1M6M1K9Nk1k6j5j3l7o0n9l4j1pj8k8k1KK0Pl5p0o4k4Klj2MK5J7
$$ 2687 2644 2658 2697 2689 2622 2554 2539 2570 2616 2657 2686 2691 2670 2644 2629 2616 2579 2519 2460 2426 2415 2408 2390 2362 2341 2343 2363 2370 2335 2265 2201 2177 2179 2176 2164 2168 2193 2210
1952B210j2k2%K2J3j2j8j2j4k5k5pJ7K5K0Nj7l8m3l0qMLqj2%J7K1kl4m6k5MRj3l5k8JK0J0
$$ 2210 2198 2176 2176 2198 2211 2199 2181 2169 2155 2130 2105 2098 2115 2140 2160 2165 2148 2110 2067 2037 2029 2033 2036 2028 2016 2016 2033 2054 2052 2018 1972 1947 1951 1960 1947 1912 1884 1885 1905 1915
1947A915j1j8lOql3m7m1j8J5L2J9j0j6J1L5L3J3j1l4n3m1kJ7j6n6l8K4M9J1k9j5K7M3J6k2
$$ 1915 1904 1886 1883 1889 1881 1848 1801 1760 1742 1757 1789 1808 1798 1782 1793 1828 1861 1874 1863 1829 1776 1735 1733 1750 1734 1678 1640 1664 1713 1724 1695 1680 1707 1750 1766 1744
1942A744m6l8pJ5j2o2n9J5Q1O8J2oJ6J8j4l2j5j2m9p7m9RL1J1j3j0LKjJ0K4J5j6l5j1L4M2
$$ 1744 1698 1660 1653 1668 1656 1594 1535 1550 1631 1699 1711 1705 1721 1739 1725 1693 1678 1666 1617 1540 1491 1500 1531 1542 1529 1519 1522 1524 1523 1533 1557 1572 1556 1521 1510 1544 1586
1938A586%m7m2jJ9%j6mJ0kk1j5LMj2j5NK5K0pk7k6oRRNRJ2ol8m1KM5L3j7m7k6J0J3j1k1KL1
$$ 1586 1586 1539 1497 1496 1515 1515 1499 1495 1505 1503 1482 1467 1470 1474 1462 1447 1452 1477 1497 1490 1463 1437 1431 1440 1449 1454 1463 1475 1469 1431 1390 1392 1437 1470 1453 1406 1380 1390 1403 1392 1371 1373 1404
1933A404K9ql9l1MK2Kk6k2NJ5j0m1m3k1NK0K2J1nj5j2mj%jknmLNmj7k2rJ4L4K9%l5n3m8l1
$$ 1404 1433 1425 1386 1355 1359 1381 1383 1357 1335 1340 1355 1345 1304 1261 1240 1245 1265 1287 1298 1293 1278 1266 1262 1261 1261 1260 1258 1253 1249 1252 1257 1253 1236 1214 1205 1219 1253 1282 1282 1247 1194 1146 1115
1927A115j6kJ1K0K2Qj8m2l6KL7L2PJOj4m8m3J4N8M4J0PK4J8mQM5N0Ol6l8j3nk0l8m2k3MJ1
$$ 1115 1099 1097 1108 1128 1150 1158 1140 1098 1062 1064 1101 1133 1140 1141 1147 1133 1085 1042 1056 1114 1158 1168 1175 1199 1217 1213 1221 1266 1316 1322 1286 1248 1235 1230 1210 1172 1130 1107 1111 1122
1923A122j1l3j4K3K8MNL4M1lm2l3kQJ8N0P0L4k8m4oK1J0plJ3K0K4J8rl6k9QK9Rk3l9l8k2P
$$ 1122 1111 1078 1064 1087 1115 1119 1124 1158 1199 1196 1154 1121 1119 1127 1145 1195 1265 1299 1271 1227 1221 1242 1252 1245 1242 1255 1275 1299 1317 1308 1272 1243 1251 1280 1289 1266 1227 1189 1167 1174
1918A174J9rn2n3rJ8Kj4KJ5ok0J3M7L3j4l5l1l6m4j8J4mn9o9j1M6M5J3%jj2j4J4M6M4J8OJ1
$$ 1174 1193 1184 1132 1079 1070 1088 1090 1076 1078 1093 1087 1067 1080 1127 1160 1146 1111 1080 1044 1000 982 996 992 933 864 853 899 944 957 957 956 944 930 944 990 1034 1052 1058 1069
1913A069mm4o3l5J3L8K8Jk2l9l9j2K8M6K3j8k6JK1kl9m6k0LKrj3rol%jPL2M9K8k0n3m3j0J1
$$ 1069 1065 1021 958 923 936 974 1002 1003 981 942 903 891 919 965 988 970 944 945 966 964 925 879 859 862 864 855 842 833 827 824 824 823 830 862 911 939 919 866 823 813 824
1908H24J6K0K5K5J4mj5kL1M3Qm3m4MM0K5qj4qk2m6m6k2QL1M8M6J8pnNnk0j3kk3o0o4k1J5J5
$$ 824 840 860 885 910 924 920 905 903 934 977 985 942 898 902 942 967 959 945 937 915 869 823 801 809 840 888 934 952 945 940 945 940 920 907 905 882 822 758 737 752 767
1903G67ORJ5J0J3K9L2Qk3l5k8k2k2k7l2k4J3N7N8J2l1k3L%k7l8k1kLLMkpKJ6J4PK1M8M9J4
$$ 767 773 782 797 807 820 849 881 889 866 831 803 781 759 732 700 676 689 746 804 816 785 762 765 765 738 700 679 677 680 683 687 685 678 680 696 710 717 738 786 835 849
1898H49k7l8k2qj2l1m5k7K1O3N7J7jJ0Jn5j02p7lM1L1J3J9K3Lj4JK5J8j1j4PJ3oj0J5K7j2
$$ 849 822 784 762 754 742 711 666 639 660 723 780 797 796 806 807 752 650 573 570 611 642 655 674 697 700 686 687 712 730 719 705 712 725 719 709 724 751 739
1893G39n6m2J2L3Kj7J8N5L0l9o9l3K4M6L4Qj9l5j6K6M2Qm5n5j6K3K6NkJ5L6L8J3k0m0m3l5
$$ 739 683 641 653 686 688 671 689 744 774 735 666 633 657 703 737 745 726 691 675 701 743 751 706 651 635 658 684 689 687 702 738 776 789 769 729 686 651
1889F51k4oJ4J9Lj3oJ5K2Kk4l2j9RL3M0K0lpM%k3l7k5lJ0K5M9N0Nn0o0k2J0J1J0K5L4J3j1
$$ 651 627 621 635 654 657 644 638 653 675 677 653 621 602 611 644 684 704 701 694 698 698 675 638 613 610 620 645 694 744 749 699 639 617 627 638 648 673 707 720 709
1884G09qJ2J9QJ3L4M3J2l2m8k6MJ2Knmkrj9k6k5j4OK0Mk8l2J2N7N3J3j4j6k0l6l0LJ9lk5j3
$$ 709 701 713 732 740 753 787 830 842 810 762 736 740 752 754 749 745 743 734 715 689 664 650 656 676 680 652 620 632 689 742 755 741 725 705 669 639 642 661 658 633 620
1879F20J4J3orOJ1%oKPkj0pJ0K6L1J9Jj2j3j4j0MJ9Nl3m4j4J1j4n4m7NM1L4J0j0k3k2LK5J4
$$ 620 634 647 641 632 638 649 649 643 645 652 650 640 633 643 669 700 719 720 708 695 681 671 675 694 699 666 622 608 619 605 551 504 509 550 584 594 584 561 539 542 567 581
1874E81qNL9L8JoL9P2L4m3q5o8k0J8K4kk9k3NJ4PK2N7O0J4j9o%m1q5o1PM1J6j3j4PK8L9K4
$$ 581 573 578 617 655 656 650 689 761 795 752 667 599 579 597 621 619 590 567 572 586 593 615 672 732 746 727 721 721 680 595 534 541 582 598 585 571 578 606 645 669
1869F69j3l7k8j5k7l6lL5K6rj1J8J6k1l5mJ5jj4PK9K4J0J2J4J1J8L8L3j3n2m4j6j2k2j5NJ0
$$ 669 656 619 591 576 549 513 510 545 571 562 551 569 585 564 529 525 540 539 525 532 561 585 595 607 621 632 650 688 721 708 656 612 596 584 562 547 552 562
1864E62KJ2K7K3%mK1M4L3ol3k5jQpk1j3LLrJK8L5Nl7n3l9j0J0Ok4m4k2K4M3L1K8L7J9l1n6
$$ 562 564 576 603 626 626 622 643 687 720 714 681 656 655 663 656 635 622 625 628 619 620 648 683 688 651 598 559 549 559 565 541 497 475 499 542 573 601 638 657 626 570
1859E70k0K8K8j3m2m0k0J0L4L4PoQJ3j4l3qK6J8rj4kk0m7k7K6M1Nk4pK1J8kj1rpMK1K6J1k
$$ 570 550 578 606 593 551 511 491 501 535 569 576 570 578 591 577 544 536 562 580 571 557 555 535 488 461 487 528 533 509 502 523 541 539 528 519 512 516 537 563 574 572
1854E72OJ9K0J0lk0l0j4J6K6Qj4j9j0MK4L2Om5p5o0k5JK1L9L9J4j3j6PL0L4J2j7k8j3oj8k0
$$ 572 578 597 617 627 624 604 574 560 576 602 610 596 577 567 571 595 627 633 588 513 453 428 429 450 489 528 542 529 513 520 550 584 596 579 551 538 532 514 494
1849D94J6N4M0qj6J8K9mk2LJ7k5o8n2pLnJ1L4J2l4k9K5M9J2k2mK8J9j7k0J5M6L8Lk2k6j8j3
$$ 494 510 564 604 596 580 598 627 623 601 604 621 596 528 476 469 472 467 478 512 524 490 461 486 535 547 525 521 549 568 551 531 546 592 630 633 611 585 567 554
1845E54j2JK6K7j2o0o0j7J7Oj8pL8O8M3j9o0m5PL4J8nmLj9m9l7J8N8M6J5J5L5L6Pk2k9k0j0
$$ 554 542 543 569 596 584 524 464 447 464 470 452 445 483 551 594 575 515 470 477 511 529 524 520 523 504 455 418 436 494 540 555 570 605 641 648 626 597 577 567
1840E67kJ3K6J8j7m7m2pNk7n7l0M1P4L6k5m5k2nqj3kJ4K1K2K1J3ok0j7orj8pK8M5J5l2l7R
$$ 567 565 578 604 622 605 558 516 509 514 487 430 400 441 515 551 526 481 459 454 446 433 431 445 466 488 509 522 516 496 479 473 464 446 439 467 512 527 495 458 467
1835D67M6K7k5n7m9k1J0L6M5L1J0lj6l2k8J2M7K4l8n9j2L4K2j5j4K2L7J2j8j8npk2k7j2OJ3
$$ 467 513 540 515 458 409 388 398 434 479 510 520 517 501 469 441 453 500 524 486 427 415 449 471 456 442 464 501 513 495 477 472 465 443 416 404 410 423
1830D23ROJ2Rj2l1j3L9P3N5J2pnj8m9n2qL9M2J4kQJ0j1l0j8MQk1n1n2k2J8M0L0%k1k1j2kK1
$$ 423 432 438 450 459 447 416 403 442 515 570 582 575 570 552 503 451 443 482 524 538 536 544 554 543 513 495 499 507 486 435 383 361 379 419 449 449 428 407 395 393 414
1825D14O0P5L2l4n0jL2nn5l4L8O9K1l8n0k8j9k0pJ5K1J2%ljPJ2ol9n0k4J4K8K0J1QMmj0qK
$$ 414 474 549 581 547 497 496 528 523 468 434 472 541 562 524 474 446 427 407 400 415 436 448 448 445 444 451 463 457 418 368 344 358 386 406 417 425 429 425 415 407 409
1820D09J8K5Ml0k9J1M0J9j1MM2M4QlJ8K1j6m0j6Rj0m4m6k0j0j7j0RJ3koQJ5RJ4L1K6j0m0k9
$$ 409 427 452 456 426 397 408 448 467 456 460 502 546 554 551 569 590 574 534 518 527 517 473 427 407 397 380 370 379 392 390 384 392 407 416 430 461 487 477 437 408
1815D08LK3K3J4pl0k8RM0K7j0j9JKk4k9J0M1J8k9l5PM1L4Oj0j3oPK0K3J3Lmomjrk7l1oK2J7
$$ 408 411 434 457 471 464 434 406 415 455 482 472 453 454 456 432 403 413 454 472 443 408 415 456 490 496 486 473 467 474 494 517 530 533 529 523 519 518 509 482 451 445 467 484
1810D84rj7J%l1n5l8mJ2J8L0L8J9j1k3k0j5oJ2K8K0J0K0L0J3rLL1J4m6p1k4M2O0L8J2j2m3
$$ 484 475 458 459 459 428 373 335 331 343 361 391 429 448 437 414 394 379 373 385 413 433 443 463 493 506 497 500 531 545 499 428 404 446 506 544 556 544 501
1806E01o1l8%J2MQK1J2j8j7K4N8L8rk3nKj5k1ML1K3kj1kql1l6oK4J6rnL1M8K3qpJ2Pl3o4n1
$$ 501 440 402 402 414 418 426 447 459 441 424 448 506 544 535 512 507 509 494 473 477 508 531 529 518 516 508 477 441 435 459 475 466 461 492 540 563 555 548 560 567 534 470 419
1800D19nL0L3J0nJJ8K5J0k0m5m6j9J5K8J0j8l3k6lJ6J7mk3oM3P5N5Ok2k1k0k3mL2M5J2l4m4
$$ 419 414 444 477 487 482 483 501 526 536 516 471 425 406 421 449 459 441 408 382 379 395 412 408 385 379 422 497 552 558 536 515 495 472 468 500 545 557 523 479
1795D79j9OJ0KlnkJKmj0j3j0LK7M8M4Qk9m7m7m8m0j5K1M2L1Nj8k2rMNj%OKroK1M8M7J9pj1
$$ 479 460 466 476 478 475 470 468 469 471 467 457 444 434 437 464 512 556 564 535 488 441 393 353 338 359 401 432 437 419 397 388 392 397 396 396 402 404 395 389 410 458 505 524 517 506
1790E06JJ1Qrk1k0j2k2m3m5j2J7Ok7k8J0M1L2Jj1LJ2NpkJ6J4j4m1l4nQmrJ1L1K8J7J5J0j3
$$ 506 507 518 526 517 496 476 464 442 399 354 342 359 365 338 310 320 361 393 394 383 386 398 403 396 394 410 424 410 369 335 330 338 334 325 336 367 395 412 427 437 424
1785D24k2RM7L4k0m4lN0N1Ol1k7OL3L4Rj9k9j5JMj1k7l0nL1L9Kl8k6K9N7K0m6p4m5QL4J5k7
$$ 424 402 411 458 492 472 428 425 475 526 532 501 474 480 513 547 556 537 508 493 494 498 487 460 430 425 456 495 497 459 433 462 519 539 493 419 374 382 416 431 404
1780D04m1rL7M4J4oOK0J0j0j9k1j7OM0M0%l7k7MJ0nj4j8k5k2OK6Ll2k5J5L3J5OK1J6k4n8m1
$$ 404 363 354 391 435 449 443 449 469 479 469 450 429 412 418 458 498 498 461 434 438 448 443 429 411 386 364 370 396 399 367 342 357 390 405 411 432 448 424 366 325
1775C25QM0L7J1j7k6nJ9J2j8k5JJ8PkJ6L3J6j5k3oK%LJ2J6J5J3%k8m5k4J9M0K8Kk4m5m6j5
$$ 325 333 373 410 421 404 378 373 392 404 386 361 362 380 387 385 401 434 450 435 412 406 408 408 411 423 439 454 467 467 439 394 370 389 429 457 459 435 390 344 329
1770C29K0K2MMK6L2Rrmjj7k1QM1L9Nk3k4oJ0J1j3m6n2k0J5K2J0J0K4K3Nonrj9j3PNl0n4k0
$$ 329 349 371 375 379 405 437 446 437 433 432 415 394 402 443 482 487 464 440 434 444 455 442 396 344 324 339 361 371 381 405 428 433 427 422 413 394 381 388 393 363 309 289
1765B89M0N7J6j9MN2M3k5p0l4L0M3Kk0MK5Qj8j2kk5n8l7L0P6O0J2j2p%qk0k3j6pqk0k0MK9
$$ 289 329 386 402 383 387 439 482 457 387 353 383 426 428 408 412 437 445 427 415 413 388 330 293 323 399 459 471 459 452 452 444 424 401 385 378 370 350 330 334 363
1760C63L2K4L3M3K2l3o4m9j7jNJ2Qj0j2J9M2J9j4pK6K6j4l1jL3K7ok6k2pJ0J1j7m9m5KL3J3
$$ 363 395 419 452 495 517 484 420 371 354 353 358 370 378 368 356 375 417 436 422 415 441 467 453 422 421 454 481 475 449 427 420 430 441 424 375 330 332 365 378
1756C78j5MM6M6nm5k7J5J8j7l9j9J4K2Kj3nPkk4l1j5J1K7L1J9j0m2m0%M2M6J7qj3pkNJ2J1
$$ 378 363 367 413 459 454 409 382 397 415 398 359 340 354 376 378 365 360 367 365 341 310 295 306 333 364 383 373 331 291 291 333 379 396 388 375 368 366 371 383 394
1751C94MJ1L1L8J8j0k0j2rj7j9MK7J3m5r7q5j4N3O5L4J3K5L8K8Qkmj5l6m5k9JJ6Oj7k4nK5
$$ 394 398 409 440 478 496 486 466 454 445 428 409 413 440 453 408 311 226 212 265 330 364 377 402 440 468 476 474 470 455 419 374 345 346 362 368 351 327 322 347
1746C47M5M8M3L5J5k2n5n9k7RK2J4J0K5L7K4kj9j7j5k4k7rJ8K2RNJ9K3jl5m3k8qNK3M3M1J3
$$ 347 392 440 483 518 533 511 456 397 370 379 401 415 425 450 487 511 509 490 473 458 434 407 398 416 438 447 452 471 494 493 458 415 387 379 384 407 450 491 504
1741E04pML0K8Jj1J1L2Mn2p4l3K8M7J6j1jK4J9rk1OL7L0rm3m8l9k8k2j6j2rmJJJ2L3L6mn9
$$ 504 497 501 531 559 560 549 560 592 596 544 470 437 465 512 528 517 516 540 559 550 529 535 572 602 593 550 502 463 435 413 397 385 376 372 373 374 386 419 455 451 392
1736C92n9mK8Jk9LO5P4K8prk0m9n3rL1K8Jk1m0n5l5K0N7L6qk4j9j6nL0M7J2l6l5PL0K0RNj1
$$ 392 333 329 357 358 329 332 397 471 499 492 483 463 414 361 352 383 411 412 391 351 296 261 281 338 374 366 342 323 307 302 332 379 391 355 320 327 357 377 386 391 380
1731C80l3k4J5K6ql8k6J3L4K0ql5l9j8RJ9J9L0M1K0j0lL6M6Km0l3p%%K2M4L2%j3jMjllj3k2
$$ 380 347 323 338 364 356 318 292 305 339 359 351 316 277 259 268 287 306 336 377 397 387 384 420 466 468 428 395 388 388 388 410 454 486 486 473 472 476 475 472 469 456 434
1726D34rJ8K3ll5l9j4J2J0k5n0k6L2N7K4pJ1N3O0K8lk2l9n1l5KK3J9J0jj9l2k1lj2k8kN9Q6
$$ 434 425 443 466 463 428 389 375 387 397 372 322 296 328 385 409 402 413 466 526 554 551 529 490 439 404 406 429 448 458 457 438 406 385 382 370 342 340 399 485
1721D85M0k8n9m9l2j8KK4L2K2Kj7k5qJ7K5J0m%NjkRJ2jrJ0K8Om2o0k8J2J4j4l0j8%NPJ9K9
$$ 485 525 497 438 389 357 339 341 365 397 419 421 404 379 371 388 413 423 419 419 424 423 421 430 442 441 432 442 470 476 434 374 346 358 372 358 328 310 310 315 322 341 370
1716C70J9rj9mPqk2oK7K7KnK7M7J7k8l3LK9K3Jj4k6l3l1k0qLK2L9L6J5jLJ2Mj5k0j0nj0j1
$$ 370 389 380 361 357 364 356 334 328 355 382 384 379 406 453 470 442 409 412 441 464 465 451 425 392 361 341 333 336 358 397 433 448 447 450 462 466 451 431 421 416 406 395
1711C95J1L9M3J5k4m8n2m3k0J0K9K6J0J0K6L6K0qk2j5LPnk5l1j4NLj0oK0M0L3Rqj2j0nLKq
$$ 395 406 445 488 503 479 431 379 336 316 326 355 381 391 401 427 463 483 475 453 438 441 448 443 418 387 373 378 381 371 365 385 425 458 467 459 447 437 432 435 437 429
1706D29j5j2rj3j5lJ2J3%pKQKlLJ4Ok3m4l2PM1M9L5J4j0k2j5J0K4J2j4k6k9l4l7j8QJ9J0L
$$ 429 414 402 393 380 365 362 374 387 387 380 382 390 392 389 392 406 412 389 345 313 320 361 410 445 459 449 427 412 422 446 458 444 418 389 355 318 300 308 327 337 340
1701C40Jqj2J3M7M6Rj2MJ6j2m5m1k0j7k1JK6J7j3rL2N1K9%%J0Ooj3j9k8k0PK5Qj9j6K0M1K0
$$ 340 341 333 321 334 381 427 436 424 428 444 432 387 346 326 309 288 289 315 332 319 310 342 393 422 422 422 432 438 432 419 400 372 352 359 384 392 373 357 377 418 438
1696D38j8k8rml0m5qN3P1K7k1k9j3okJ5K1pl2j5J6J0l0m3j0K3J9LJPPNJ6L0L1J5j1l1k3J2
$$ 438 420 392 383 379 349 304 296 349 420 447 426 397 384 378 376 391 412 405 373 358 374 384 354 311 301 324 343 346 347 354 361 366 382 412 443 458 447 416 393 405
1691D05L8K2qoJ4J1j2rJ2Km2m8LL7Om0l9j4onJ4K7%k5JM4L9jqK1L1Kj7pmk1k7jK3K1J0Mj3
$$ 405 443 465 457 451 465 476 464 455 467 469 427 379 382 419 425 385 346 332 326 321 335 362 362 337 338 382 421 420 412 433 464 466 449 442 438 417 390 389 412 433 443 447 434
1686D34l8m9l5j2J1L8M9K5j1j4RPl3n7l4MK2K3J6j0l3qN6Q2L0k8k8jj1l7k4K0L5J1ooj2j8
$$ 434 396 347 312 300 311 349 398 423 412 398 407 414 381 324 290 294 316 339 355 345 312 304 360 442 472 444 416 415 404 367 343 363 398 409 403 397 385 367
1681C67OL7J7m6p3k5L8M8J2k0k8j7J2M5N3K7jJJ6J1j7l9l3nK4L2J4pj2klj6j7kPlj4nJ4K5
$$ 367 373 410 427 381 308 283 321 369 381 361 333 316 328 373 426 453 452 453 469 480 463 424 391 386 410 442 456 449 437 435 432 416 399 397 404 401 387 382 396 421
1676D21K4J0k2n2l4L2P4M1k7m6j1J1j0l2j8Opm0m2kM0M3J8pj1nnj5j9mJ2Rqj0NJ3JpQL1L2
$$ 421 445 455 433 381 347 379 453 494 467 421 410 421 411 379 361 367 360 320 278 276 316 359 377 370 359 354 349 334 315 311 323 332 324 314 319 332 333 326 334 365 397
1671C97Pj5j8qKJ7L2L1Pj6k0j1j1j7qJ4K4Lk7l1j3lj5k5j3J7L4K7J4RJ2Nj9m4l9jL2K3j2k1
$$ 397 404 389 371 363 365 382 414 445 452 436 416 405 394 377 369 383 407 410 383 352 339 336 321 296 283 300 334 361 375 384 396 401 382 338 299 298 330 353 341 320
1666C20PL1J9omJ6J8JrkNOJ0J2%j0QL4K1k7n0k3Pnk3lL3L9J6NMj4m0l4m%k8l4J3O1O2K6%m
$$ 320 327 358 377 371 367 383 401 402 393 391 396 402 412 424 424 414 422 456 477 450 400 377 384 379 356 353 386 425 441 446 450 436 396 362 358 358 330 296 309 370 432 458 458 454
1661D54j6l9m9k7OK0J3QK0L3K0j1k8j4Mlj7j1NNlJ4N2O9N1K3Oj8n0o4m5j9rkJ3J7KqOL0L0
$$ 454 438 399 350 323 329 349 362 370 390 423 443 432 404 390 394 391 374 363 368 373 370 384 436 505 556 579 585 567 517 453 408 389 380 378 391 408 410 402 408 438 468
1656D68Pj8l7m7l1%J7J0QK5K9lk8j4J8K2J0Oon0q3n0K2N0K1KJ7K3lj7%J1j3k4J0M5L5PJ4K8
$$ 468 475 457 420 373 342 342 359 369 377 402 431 428 400 386 404 426 436 442 436 386 303 253 275 325 346 348 365 388 385 368 368 379 366 342 352 397 432 439 453 481
1651D81lm9l3L6O4J7l4k7QOj5JN0O2J6l0k5J0J2k3m5k3J1J0j5k3lJ5Nj0KL6M9K6%J0L9L1k3
$$ 481 478 429 396 432 496 513 479 452 460 466 451 452 502 564 580 550 525 535 547 524 479 456 467 477 462 439 436 451 456 446 448 484 533 559 559 569 608 639 616
1646F16o7m8J4N5N0K2ll0m7k8K7O0L2j8l0pNMJ5K9J2l3n8l8oPRJ3QmkJ4K4J3QJ7J6KKK9M3
$$ 616 549 501 515 570 620 642 639 609 562 534 561 621 653 635 605 598 603 607 622 651 663 630 572 534 528 535 544 557 565 561 559 573 597 610 618 635 651 653 655 684 727
1641G27J8k0k8j4jNJ1J2KPL4M5J8j1nJ4%k8k0J3J4k0k5J0L3Ml5k6J0K5QpjJ6K9K3ml5m1j5
$$ 727 745 725 697 683 682 687 698 710 712 719 753 798 816 805 800 814 814 786 766 779 793 773 748 758 791 795 760 734 744 769 777 770 769 785 814 837 833 798 757 742
1636G42J8K2%k0j2J4L3K8Oj1j3j5j7pK2L9K4pj2PJ0j6l9k6NK1Qj1qJ8M5M5J9nj5k0j8J1O4
$$ 742 760 782 782 762 750 764 797 825 831 820 807 792 775 768 790 829 853 846 834 841 851 835 796 770 775 796 804 793 785 803 848 893 912 907 892 872 854 865 929
1632I29P5Pq0r2l5Lk4o0m2RM3M5K8Kk6l1rQlj6lK4M1M4M0K4kj2PK3J5OJ1Ml6o8m3J9M4J2k5
$$ 929 1004 1011 931 839 804 807 783 723 681 690 733 778 806 808 782 751 742 750 747 731 728 752 793 837 877 901 899 887 894 917 932 938 949 953 917 849 806 825 869 881 856
1627H56k5NK5J7j1l1j8K5M7J8l0m2qL4M9M3J7k5n4m3pNj3k6k0j2pJ8N4M7j7p7p0j6J3kj7l
$$ 856 831 836 861 878 867 836 818 843 890 908 878 836 828 862 911 954 971 946 892 849 842 847 834 808 788 776 769 787 841 888 871 794 724 708 721 719 702 699
1622F99K2J9pk7j9J0L0K4kk5l2k9k4k1j5kJ7K3Ok0k4JK5J8KRL0K3j1k5kK2K0J0J2J0k1n6n4
$$ 699 721 740 733 706 687 697 727 751 749 724 692 663 639 618 603 601 618 641 647 627 603 604 629 647 649 658 688 711 700 675 673 695 715 725 737 747 726 670 616
1617F16k5j0j9k5kK4K6OrqJRJ0PJmj1j7j6mK4N2N6K3l5p1n0NL2mn3m6J7O3L9k1m3j3J3qm1
$$ 616 591 581 562 537 535 559 585 591 582 574 575 584 594 601 602 598 587 570 554 550 574 626 682 705 670 599 549 554 586 582 529 483 500 563 602 581 538 525 538 530 489
1612D89k8J8L1ol8j2L6M5J8OJ7Pk8l5OL8J8k0j7J0Qk2l0MK8J3j4j6j0k0k8qJ8Rl0m4j2L0L4
$$ 489 461 479 510 504 466 454 490 535 553 559 576 583 555 520 526 564 582 562 545 555 563 541 511 515 543 556 542 526 516 496 468 460 478 487 457 413 401 431 465
1607D65QrMK2J7mqJ2K6Nl3m8k2K1M0K7pl4l4jL9N5L3jj8k3l1k9nJ9J1k3l7nL7M5K2jj5k5k3
$$ 465 473 464 468 490 507 503 495 507 533 538 505 457 435 456 496 523 516 482 448 447 486 541 574 573 555 532 501 472 467 486 497 474 437 432 469 514 536 535 520 495 472
1602D72ML6L9J5kkok2k3jJ2lj9oJ5Pj9k0OJ3oj7QL6K9mk2lK4K8Lk0j8NJ8RmNK1J6j2l2k4r
$$ 472 476 512 551 566 564 562 556 534 511 510 522 519 500 494 509 516 497 477 483 496 490 473 481 517 546 542 520 517 541 569 572 552 534 539 557 566 562 567 588 604 592 560 536 527
1597E27njJ6M3N3L2%j3mLj3m0m3k2j7m2n0qM3M5Oj3lqm0m6%N1N0Rk6k7%L6N4K2m0o2k3J9J5
$$ 527 522 521 537 580 633 665 665 652 648 651 638 598 555 533 516 474 424 416 459 504 510 497 494 486 446 400 400 451 501 510 484 457 457 493 547 569 529 467 444 463 478
1592D78oJ3N4O3M2K0pn6r3o1K3O6L4k1m1l8k3PN0O0K5j2k2k3l6l2OL7J6k6k6J6M8L7J0oj5
$$ 478 472 485 539 602 644 664 657 601 508 447 470 536 570 549 508 470 447 454 504 564 589 577 555 532 496 464 470 507 523 497 471 487 535 572 582 576 561
1587E61k0j8j7l6o8o6j0O2Q3L7k6m4j3K4K7jk3j6J5L9M2K1qk1j7j8l3m7l2%K1K0J5J5Oj6k3
$$ 561 541 523 506 470 402 336 326 388 471 508 482 438 425 449 476 475 452 436 451 490 532 553 545 524 507 489 456 409 377 377 398 418 433 448 454 438 415
1583D15kK4L1K4K2J8Mj4j1%jj8l1k3mJ0J1%j4j2OK0J2j4l1k3jK1K4Nk3l7k7oNPJ4L2M1K9M
$$ 415 413 437 468 492 514 532 536 522 511 511 510 492 461 438 434 444 455 455 441 429 435 455 467 453 422 399 398 419 443 448 425 388 361 355 360 367 381 413 454 483 487
1578D87j6j9j8k4k7pL0M3Rl3k7J8M6K6mkJ2J0jok3n7o2qN7M8j9n2j2K7J3j6KM1L4j0k8%K5
$$ 487 471 452 434 410 383 376 406 449 458 425 398 416 462 488 484 482 494 504 503 497 474 417 355 347 404 452 433 381 369 396 409 393 395 436 470 460 432 432 457
1573D57J7J2L5M7Pm8n4j8jj9k7KL6K8jpJ1K2J5RRkk0k3rKJ2L3N0L4ok7j4j1l5m9k4Mkj7nR
$$ 457 474 486 521 568 575 527 473 455 454 435 408 410 446 474 473 466 477 499 514 523 532 530 510 487 478 480 492 525 575 609 603 576 562 551 516 467 443 447 445 428 423 432
1568D32j2n4n8j7L0M9M9L5Oj4pJ4J8RPKj4j4K7O6M6j2l0KJ9nk9l2l5m8k7K8N6K8kMJ3nrJ4
$$ 432 420 366 308 291 321 370 419 454 460 446 439 453 471 480 487 489 475 461 488 554 600 588 558 560 579 574 545 513 478 430 403 431 487 515 513 517 530 525 516 530
1563E30J0m7p8j4P4P4Pk1K0N0J8l1m8l8j1L3N9K9l2m8j1J4lj3OJ8j0l4j7J5K1J3J7K2QkJ0
$$ 530 540 493 415 401 475 549 556 535 555 605 623 592 544 506 495 528 587 616 584 536 525 539 536 523 529 547 537 503 486 501 522 535 552 574 582 580 590
1559E90J3j2l6k9rrj5NL1K2qj8mKrj0KKmKJ9J5mqOJ3jpMJ7J9K2K2Nk7l5j7jJJ9N7O6J4n0m7
$$ 590 603 591 555 526 517 508 493 498 529 551 543 525 521 523 514 504 506 508 504 506 525 540 536 528 534 547 546 539 543 560 579 601 623 628 601 566 549 548 549 568 625 691 705 655 608
1553F08J8P1O2J2k7l0j2M%j8k6j2NNmNK4L2K4K1L1L3J9J0J8K8K2RJ0K6M8O2O0L7Lj2kRKKK8
$$ 608 626 697 759 771 744 714 702 706 706 688 662 650 655 660 656 661 685 717 741 762 793 826 845 855 873 901 923 932 942 968 1016 1078 1138 1175 1178 1166 1164 1173 1175 1177 1205
1548A205N0K2l7n6j7K1J4oMK1mn2n9j3J9Lk8l1j9k3m0m9m8l6qL4M7J0m0m6j4Plj3mJ1J3J2
$$ 1205 1255 1277 1240 1184 1167 1188 1202 1196 1200 1221 1217 1165 1106 1093 1112 1115 1087 1056 1037 1014 974 925 877 841 833 867 914 924 884 838 824 831 828 815 811 822 835 847
1543H47J6J4pl2n0n2l6qJ4J1kMK8K7nl4l0k3l9n1k3K0K8PML3M7K0j8l4l0j9LK8L3Oj9j8rj8
$$ 847 863 877 870 838 788 736 700 692 706 717 715 719 747 774 769 735 705 682 643 592 569 589 617 624 628 661 708 728 710 676 646 627 630 658 691 697 678 660 651 633
1538F33l2j6J7L2K4K4L8L7km9n9k8J9N0N2K2k2n0m2rK4L7K7Jk5l2j3J3K0NoJJ4kl9n7l1J3
$$ 633 601 585 602 634 658 682 720 757 755 706 647 619 638 688 740 762 740 690 648 639 663 700 727 728 703 671 658 671 691 696 690 691 705 703 664 607 576 589
1534E89L0J9J1J6Ml3n0nO5P7J2n6o2j8Qkj9j6kNNQJ0Nrj3LK9M5L8J4nj1oPK1K5Qk0l2k1pJ
$$ 589 619 638 649 665 669 636 586 581 646 723 735 679 617 599 607 605 586 570 568 573 578 586 596 601 592 579 582 611 656 694 708 703 692 686 693 714 739 747 727 695 674 667 668
1529F68J4L5M5K8NJJ0Nj0j4rj5l2l5k1j1j3oJ6L3K8K1J9Ok2l3pJ9J0j6oL8O0L5mj3JJ0Kj2
$$ 668 682 717 762 790 795 796 806 811 801 787 778 763 731 696 675 664 651 645 661 694 722 743 762 768 746 713 706 725 735 719 713 751 811 846 842 829 830 840 842 830
1524H30k6l3k3%J7J9Rmj8k4j0K2M0L1J3J3K1J3j9m2l9j3QJ0%MK5M8M4J6j7k9k3j1JPOJ0K1
$$ 830 804 771 748 748 765 784 793 789 771 747 737 759 799 830 843 856 877 890 871 829 790 777 785 795 795 799 824 872 916 932 915 886 863 852 853 860 866 876 897
1519H97K9J6rj5OJ6ol3k5OK4K1J2kk3k9LL9K6k4m3lM0L0qj9MK3K0QRK0L4M6M4K4OJ0L1N2O0
$$ 897 926 942 933 918 924 940 934 901 876 882 906 927 939 937 914 885 888 927 953 929 886 883 923 953 945 926 930 953 973 981 990 1010 1044 1090 1134 1158 1164 1174 1205 1257 1317
1514A317N3L5J4QK8N7P2O3L5Kj1RL7K5k3n6m0j7k6m4l1pj6m1l2Jkm6o3k3K0J6j3k3j0QL3N5
$$ 1317 1370 1405 1419 1427 1455 1512 1584 1647 1682 1684 1673 1682 1719 1744 1721 1665 1625 1608 1582 1538 1507 1500 1484 1443 1411 1412 1410 1364 1301 1278 1298 1314 1301 1278 1268 1276 1309 1364
1509A364M6%l1qL8N4L6J6mk9m2j2L3L7%k5nL2M3K7Kj9l1k2%K6M4N4N8M3Ol7o1n0qL0L3J5J2
$$ 1364 1410 1410 1379 1371 1409 1463 1499 1515 1511 1482 1440 1428 1461 1498 1498 1473 1468 1500 1543 1570 1572 1553 1522 1500 1500 1526 1570 1624 1682 1725 1731 1694 1633 1583 1575 1605 1638 1653 1665
1505A665K5J4l8o8k8M5P3M5Rj2l0l7j2K7L1LJL9O2K9j2rJ9L0K2K7L8L4K1K4L3K2OJ5L8M4L3
$$ 1665 1690 1704 1666 1598 1570 1615 1688 1733 1742 1730 1700 1663 1651 1678 1709 1712 1713 1752 1814 1843 1831 1822 1841 1871 1893 1920 1958 1992 2013 2037 2070 2092 2098 2113 2151 2195 2228
1500B228K6K6J8J2L7P2O6J4k4j1J6J0qNM2N4K6j0k5k4j9%L6N6L1j4k4OL3L3L8P0R1N8OKM5
$$ 2228 2254 2280 2298 2310 2347 2419 2485 2499 2475 2464 2480 2490 2482 2487 2529 2583 2609 2599 2574 2550 2531 2531 2567 2623 2654 2640 2616 2622 2655 2688 2726 2796 2887 2945 2951 2953 2998
1495B998O7M8L7N8P2M2J3K5N0M7L7O2R8R1M8L6O6Q7O6L2K0J9K2M2Q1J11J09Q7O3L9K7M6Q3
$$ 2998 3065 3113 3150 3208 3280 3322 3335 3360 3410 3457 3494 3556 3654 3745 3793 3829 3895 3982 4048 4080 4100 4119 4141 4183 4264 4375 4484 4571 4634 4673 4700 4746 4829
1491D829R8Q3P4R1J05R8R4J03J05Q5Q2J12J40J22R1R8J28J33J12J15J48J66J41J14J16J38
$$ 4829 4927 5010 5084 5175 5280 5378 5472 5575 5680 5765 5847 5959 6099 6221 6312 6410 6538 6671 6783 6898 7046 7212 7353 7467 7583 7721
1488G721J45J40J39J51J63J69J65J59J63J81K02K10K05K03K06K11K22K49K79K89K77K69K85
$$ 7721 7866 8006 8145 8296 8459 8628 8793 8952 9115 9296 9498 9708 9913 10116 10322 10533 10755 11004 11283 11572 11849 12118 12403
1485A2403L12L30L34L31L36L56L84L94L80L75M10M71N12N19N20N41N69N90O17O56O95P21P47
$$ 12403 12715 13045 13379 13710 14046 14402 14786 15180 15560 15935 16345 16816 17328 17847 18367 18908 19477 20067 20684 21340 22035 22756 23503
1483B3503P87Q39Q88R30R72J014J061J116J181J243J302J363J426J493J572J662J748J831
$$ 23503 24290 25129 26017 26947 27919 28933 29994 31110 32291 33534 34836 36199 37625 39118 40690 42352 44100 45931
1480D5931J931K069K203K279K315K396K546K685K751K787K867K981L059L085L096L095L063
$$ 45931 47862 49931 52134 54413 56728 59124 61670 64355 67106 69893 72760 75741 78800 81885 84981 88076 91139
1478I1139L010K970K924K810K631K457K317K149J912J646J405J167Q85N78K88Pl04o41r58
$$ 91139 94149 97119 100043 102853 105484 107941 110258 112407 114319 115965 117370 118537 119422 120000 120288 120295 119991 119350 118392
1476A18392j240j499j736j939k127k326k508k624k688k761k850k892k865k826k829k840k799
$$ 118392 117152 115653 113917 111978 109851 107525 105017 102393 99705 96944 94094 91202 88337 85511 82682 79842 77043
1474G7043k711k629k576k525k453k361k258k153k065j997j917j804j687j614j581j532j452
$$ 77043 74332 71703 69127 66602 64149 61788 59530 57377 55312 53315 51398 49594 47907 46293 44712 43180 41728
1472D1728j378j338j294j217j127j078j064j042r88r30q92q68q30p83p41p18p03o74o30n89
$$ 41728 40350 39012 37718 36501 35374 34296 33232 32190 31202 30272 29380 28512 27682 26899 26158 25440 24737 24063 23433 22844
1469B2844n68n62n44n08m82m87m96m68m14l85m03m24m12l82l67l50l00k50k63l36l79l36k61
$$ 22844 22276 21714 21170 20662 20180 19693 19197 18729 18315 17930 17527 17103 16691 16309 15942 15592 15292 15042 14779 14443 14064 13728 13467
1467A3467k36k62k77k52k18k07k08k03k08k33k54k41j95j54j45j69j97j99j72j40j28j26j22
$$ 13467 13231 12969 12692 12440 12222 12015 11807 11604 11396 11163 10909 10668 10473 10319 10174 10005 9808 9609 9437 9297 9169 9043 8921
1464H921j18j27j32j09o8n3q1j16j27j18j06q4n2m3p1j00r4o5n0n3n8o6r0j16j09p5m5l2k0
$$ 8921 8803 8676 8544 8435 8367 8314 8233 8117 7990 7872 7766 7682 7630 7587 7516 7416 7322 7257 7207 7154 7096 7030 6940 6824 6715 6640 6595 6563 6543
1460F543j2k2m2m5k9k4l8n9p7r6j02p5l1j2l2n6o6o8o7n5m1m9o9n8j7jl2o3m8j2nj8k4k7m4
$$ 6543 6531 6509 6467 6422 6393 6369 6331 6272 6195 6099 5997 5922 5891 5879 5847 5791 5725 5657 5590 5535 5494 5445 5376 5318 5301 5300 5268 5205 5157 5145 5140 5122 5098 5071 5027
1456E027o0n1l7m0m3j4K6K3k3n5m2nJ7J8Rj0k1nL8P9Q9P3N0M7O4Q7R3R7J29J83K15J99J83
$$ 5027 4967 4916 4879 4839 4796 4782 4808 4831 4808 4753 4711 4706 4723 4741 4750 4740 4719 4714 4752 4831 4920 4993 5043 5090 5154 5241 5334 5431 5560 5743 5958 6157 6340
1452F340K03K33K25J92J84J95J90J79K00K36K24J59J12J15J15O3QJ3N0M9Mk9k3j8m8q9q9l5
$$ 6340 6543 6776 7001 7193 7377 7572 7762 7941 8141 8377 8601 8760 8872 8987 9102 9165 9173 9186 9236 9285 9289 9260 9237 9219 9171 9082 8993 8958
1449H958L0N8M0K1L2O5Q7J12J66K44L10L59M24N08N73N97O17O63P18P54P85Q25Q65Q78Q76
$$ 8958 8988 9046 9086 9107 9139 9204 9291 9403 9569 9813 10123 10482 10906 11414 11987 12584 13201 13864 14582 15336 16121 16946 17811 18689 19565
1445A9565Q84Q97R01Q92Q82Q57Q11P47O74N82M78L87L10K08P1n4j29j96l01m04m41m30m55
$$ 19565 20449 21346 22247 23139 24021 24878 25689 26436 27110 27692 28170 28557 28867 29075 29146 29092 28963 28767 28466 28062 27621 27191 26736
1443B6736n30n80n63n37n66o14o02n21m37l98l81l34k27p9P0J96L01M04N15O35P75R34J100
$$ 26736 26206 25626 25063 24526 23960 23346 22744 22223 21786 21388 21007 20673 20446 20367 20437 20633 20934 21338 21853 22488 23263 24197 25297
1440B5297J254J396J526J631J710J782J862J922J928J890J848J809J742J633J510J377J203
$$ 25297 26551 27947 29473 31104 32814 34596 36458 38380 40308 42198 44046 45855 47597 49230 50740 52117 53320
1438E3320R77P37N28L29R3j77m30o31q13j024j264j472j603j668j709j744j765j767j772j775
$$ 53320 54297 55034 55562 55891 55984 55807 55377 54746 53933 52909 51645 50173 48570 46902 45193 43449 41684 39917 38145 36370
1435C6370j738j639j508j392j287j163j012q58p11n76m69l87k77r6J16K84M10N59P55R39J068
$$ 36370 34632 32993 31485 30093 28806 27643 26631 25773 25062 24486 24017 23630 23353 23257 23373 23657 24067 24626 25381 26320 27388
1433B7388J169J276J369J435J498J568J618J621J602J578J519J406J277J150R80P36M74K75
$$ 27388 28557 29833 31202 32637 34135 35703 37321 38942 40544 42122 43641 45047 46324 47474 48454 49190 49664 49939
1431D9939J16r2l65o25q22j006j230j456j619j708j778j872j968k014j983j904j823j749j658
$$ 49939 50055 49963 49598 48973 48151 47145 45915 44459 42840 41132 39354 37482 35514 33500 31517 29613 27790 26041 24383
1428B4383j547j442j366j292j184j045r03p67o43n44m79m18l22k05j12m8J3Q0J35J72K15K67
$$ 24383 22836 21394 20028 18736 17552 16507 15604 14837 14194 13650 13171 12753 12431 12226 12114 12066 12079 12159 12294 12466 12681 12948
1426A2948L09L36L59L88M09M28M49M50M00L24K72K54K26J61Q9L0m5j58k70l40l77m21m74n21
$$ 12948 13257 13593 13952 14340 14749 15177 15626 16076 16476 16800 17072 17326 17552 17713 17802 17832 17787 17629 17359 17019 16642 16221 15747 15226
1423A5226n74o47p10p19o89o77o97o98o48n74n30n22n26n11m66l99l38k98k72k42k09j94j92
$$ 15226 14652 14005 13295 12576 11887 11210 10513 9815 9167 8593 8063 7541 7015 6504 6038 5639 5301 5003 4731 4489 4280 4086 3894
1420C894j71j27r3j00j27j38j30j22j09o9j9Kk3n4n5l2j2qj3k3m2o2p0p0o8n5j8K1K8Kk0j7
$$ 3894 3723 3596 3503 3403 3276 3138 3008 2886 2777 2708 2689 2691 2668 2614 2559 2527 2515 2507 2494 2471 2429 2367 2297 2227 2159 2104 2086 2107 2135 2137 2117 2100
1416B100jJ3L0M0J7k6m5j4K0Ll8m5j1J3NnJ0K6J6nj2PL8N6L4k4p4o4jM1J8l5n3k2J9L5K5Q
$$ 2100 2099 2112 2142 2182 2199 2173 2128 2114 2134 2137 2099 2054 2043 2056 2061 2056 2066 2092 2108 2103 2091 2098 2136 2192 2226 2202 2128 2064 2063 2104 2122 2087 2034 2012 2031 2066 2091 2099
1411B099%NJ1OJJ9N1N7K1k2l2j2QJ9K4J7MML2N6M5J1jJ8M3M6M1L8L1J2MJ9M5N8M5K3PPK2M2
$$ 2099 2099 2104 2115 2121 2122 2141 2192 2249 2270 2248 2216 2204 2212 2231 2255 2272 2276 2280 2312 2368 2413 2424 2423 2441 2484 2530 2571 2609 2640 2652 2656 2675 2720 2778 2823 2846 2853 2860 2882 2924
1406B924N1L6J1LL5Q7J09P0Nk4kL1L5K6M1P0P5N0L2L6L6J6LK1N1M9J3j0NK9K7QOK6L7K6J8
$$ 2924 2975 3011 3022 3025 3060 3147 3256 3326 3331 3307 3305 3336 3371 3397 3438 3508 3583 3633 3665 3701 3737 3753 3756 3777 3828 3877 3890 3880 3885 3914 3941 3949 3955 3981 4018 4044 4062
1402D062L5N8N9M7M1M3K6LPM0O5O6O4P5P4M8K8M0N1L1J4M8J09J25P4K2K4O7J03J08R0O5M7
$$ 4062 4097 4155 4214 4261 4302 4345 4371 4374 4381 4421 4486 4552 4616 4691 4765 4813 4841 4881 4932 4963 4977 5025 5134 5259 5333 5355 5379 5446 5549 5657 5747 5812 5859
1398E859M2M7N4O8Q7R2O4K7K3N0O9O5O3P4P6P2Q8J18J14N9J4L3Q0R0N7L6N6Q2Q8P1N2L6L4
$$ 5859 5901 5948 6002 6070 6157 6249 6313 6340 6363 6413 6482 6547 6610 6684 6760 6832 6920 7038 7152 7211 7225 7258 7338 7428 7485 7521 7577 7659 7747 7818 7870 7906 7940
1394G940M2M4L7M1P0R4Q3N2M5O3P1N2L7L4K3KNM2O7M6J6K1M9N2K1NK1L8K1j0k2qRJ2J6K5K4
$$ 7940 7982 8026 8063 8104 8174 8268 8351 8403 8448 8511 8582 8634 8671 8705 8728 8730 8735 8777 8844 8890 8906 8927 8976 9028 9049 9054 9075 9113 9134 9124 9102 9094 9103 9115 9131 9156 9180
1389I180km2n7l4MK1Rj0k0k4l4m6m6l4k3k7m6o4p3p5q2r0r4r0p5n2k6j5k9n5n6l3j9m1p6q2
$$ 9180 9178 9136 9079 9045 9049 9070 9079 9069 9049 9025 8991 8945 8899 8865 8842 8815 8769 8705 8632 8557 8475 8385 8291 8201 8126 8074 8048 8033 8004 7949 7893 7860 7841 7800 7724 7642
1385G642o4n6p2q5q3q0r0r9r7r3r5q2m5j7k6o1q0p2o0o8q3r7j12j18j04o7l9m3o6q3q2p2n7
$$ 7642 7578 7522 7450 7365 7282 7202 7112 7013 6916 6823 6728 6646 6601 6584 6558 6497 6417 6345 6285 6217 6134 6037 5925 5807 5703 5636 5597 5554 5488 5405 5323 5251 5194
1381E194m8m9n9o4n0l0k8m4o4o8o2o4q1j01r6o1k4k6o9j02q0k8nl7q3q8n5l0m0o5o8m4qJ4
$$ 5194 5146 5097 5038 4974 4924 4894 4866 4822 4758 4690 4628 4564 4483 4382 4286 4225 4201 4175 4106 4004 3924 3896 3891 3854 3771 3683 3628 3598 3558 3493 3425 3381 3373 3387
1377C387J2j9n9r1r5p5m9k9j8j2j2k6n4p3o1k9j0j8l0j3K4L5qo8q6m4NJ4qj0R%n1q5m9K2M8
$$ 3387 3399 3380 3321 3230 3135 3060 3011 2982 2964 2952 2940 2914 2860 2787 2726 2697 2687 2669 2639 2626 2650 2685 2677 2609 2523 2479 2484 2498 2490 2480 2489 2489 2438 2353 2304 2326 2374
1372B374J4k3k5k1m2o4n6m1m7n4k5K8N0L2Kj7l0l6k5pj2l8m8k3NQjj%qk2k3j7oRK6L0J3ln
$$ 2374 2388 2365 2340 2319 2277 2213 2157 2116 2069 2015 1990 2018 2068 2100 2102 2085 2055 2019 1994 1987 1975 1937 1889 1866 1871 1879 1878 1877 1877 1869 1847 1824 1807 1801 1810 1836 1866 1879 1876 1871
1367A871Jmj6k5l4l8j7K8N4K9j6l0j0Jj9m9o0n2k9jJ6J1lpoj4k8l0k2j9j8qmk9o4o7l1NKk3
$$ 1871 1872 1868 1852 1827 1793 1755 1738 1766 1820 1849 1833 1803 1793 1794 1775 1726 1666 1614 1585 1584 1600 1611 1608 1601 1595 1581 1553 1523 1501 1482 1464 1456 1452 1423 1359 1292 1261 1266 1268 1245
1362A245l7k5RN2P8N9J1k1k4j9k5k1KJ4rk7nL5M8K7QKqj9pK0K1j0l8l0j5k3m0l1m%k6m8l0
$$ 1245 1208 1183 1192 1244 1322 1381 1392 1371 1347 1328 1303 1282 1284 1298 1289 1262 1257 1292 1340 1367 1375 1377 1369 1350 1343 1363 1384 1374 1336 1306 1291 1268 1228 1197 1193 1193 1167 1119 1089
1358A089J1L5K0qk7k7k0j0RL1K8qn4o0k3J9K3mk7k6j1kNJ6K6J8lk3l3l6k1J4N4N8J4k9j9J8
$$ 1089 1100 1135 1155 1147 1120 1093 1073 1063 1072 1103 1131 1123 1069 1009 986 1005 1028 1024 997 971 960 958 963 979 1005 1023 1020 997 964 928 907 921 975 1033 1047 1018 999 1017
1353A017K1k0l7RO5N6qn9n6k7rKJ1Kk7m7k4J6K9RpNK4J1k2m4l2pPJ2J7J6%j7nK8M1J1l1m1
$$ 1017 1038 1018 981 990 1055 1111 1103 1044 988 961 952 954 965 967 940 893 869 885 914 923 916 921 945 956 934 890 858 851 858 870 887 903 903 886 881 909 950 961 930 889
1348H89j7Lok8l7l2j8jJ4J8PKJ0J8RppQJ4%oJ7M1K4l1n9k9J1Jm0l6J7M6Rl4j1M5M7pl9j7R
$$ 889 872 875 869 841 804 772 754 753 767 785 792 794 804 822 831 824 817 825 839 839 833 850 891 915 884 825 796 807 808 768 732 749 795 804 770 759 804 851 844 805 788 797
1343G97mk0rKk4o0n3pK4J5nlJ4K6L3L6K4jk9m2l6j6LRKNK4L4J7p%L8N7K1m5p7n1QM8M5J4j6
$$ 797 793 773 764 766 742 682 629 622 646 661 656 653 667 693 726 762 786 785 756 714 678 662 665 674 676 681 705 739 756 749 749 787 844 865 820 743 692 700 748 793 807 791
1338G91k8l3l0lM3P5N3pn2n0j8J4L1L1Rk4l7j6J3K0J3J4K2K2J2Npl0n4o2m5j8J4M6O1M0P%
$$ 791 763 730 700 697 740 815 868 861 809 759 741 755 786 817 826 802 765 749 762 782 795 809 831 853 865 870 863 833 779 717 672 654 668 714 775 815 822 822
1333H22J8J8j6m0k1J6K1KML8N8K7l1o2m7j2J3K3K3J3ok2j5J6M0K8j0l2j5K5M3K4j2k9j3J7
$$ 822 840 858 842 802 781 797 818 820 824 862 920 947 916 854 807 795 808 831 854 867 861 839 824 840 880 908 898 866 851 876 919 943 931 902 889 906
1329I06K1j8o5o6j6L1K8qk6j5JMOQkj7pK6L5nn5n7j0K7K1rk7j8jOmj1PL3K9j4n2l3J9L5Jl2
$$ 906 927 909 844 778 762 793 821 813 787 772 773 777 783 791 789 772 765 791 826 821 766 709 699 726 747 738 711 693 692 698 694 683 690 723 752 738 686 653 672 707 708 676
1324F76j6K4L6J5j3k3j1K0M6L1k1n1j8L9M2j7n9l2J7K5knK0J9k0m7j9K5K9kj8lPok0rJ4L4
$$ 676 660 684 720 735 722 699 688 708 754 785 764 713 695 734 776 759 700 668 685 710 708 703 723 742 722 675 656 681 710 708 690 687 694 688 668 659 673 707
1319G07M2L2nm6m3RM8K7k5l8j4kk2l2pJ9J2j4k6k3k7l2j8RK8K5J3OJ1K2K2MrJ1M9N6Pm9n6
$$ 707 749 781 776 730 687 696 744 771 746 708 694 692 670 638 631 650 662 648 622 599 572 540 522 531 559 584 597 603 614 636 658 662 653 664 713 769 776 727 671
1314F71k2OJ0NM%j2j3oKJ0L2M9L2k1n1k7K7N0L0mj4KJ5Pk2m6l4LL1L1J6RJ1OJMJ4J0j6l6k2
$$ 671 649 655 665 670 674 674 662 649 643 645 655 687 736 768 747 696 669 696 746 776 772 758 760 775 782 760 714 680 683 714 745 761 770 781 787 788 792 806 816 800 764 742
1309G42J6L3Pl6m0QN7N4Ll9l6pRKj3j5rMJ6K5K8J2k6o4o3j2M5N6K1qKK2J4j5k1KK0Ll5o0m7
$$ 742 758 791 798 762 722 730 787 841 844 805 769 762 771 773 760 745 736 740 756 781 809 821 795 731 668 656 701 757 778 770 772 794 808 793 772 774 794 797 762 702 655
1304F55j0K3L1K0J7K3K4Mk3k8mK6L5J6kMK3K7Jk7k8j2rk9l2mK7L1J5RJ0%j6j5jkj7rL0O4N1
$$ 655 645 668 699 719 736 759 783 787 764 736 732 758 793 809 807 811 834 861 862 835 807 795 786 757 725 721 748 779 794 803 813 813 797 782 781 779 762 753 783 847 898
1299H98J6LJ9K0j7n9o1k7LOJPJ2kk1k2oOJKJ4J9jj7kK7L3K0K3L6K0l4o9m2J6M1K6RMnk3k4
$$ 898 914 917 936 956 939 880 819 792 795 801 802 809 821 819 798 776 770 776 777 779 793 812 811 794 792 819 852 872 895 931 951 917 848 806 822 863 889 898 902 897 874 850
1294H50KK2Qj7j5MLk8m3j5K0J8j1k3nOrk2pJ8J2k5m7k8RK6J5OK3M9N1J8k3k7OL2Rl1l5ML2
$$ 850 852 874 882 865 850 854 857 829 786 771 791 809 798 775 770 776 767 745 738 756 768 743 696 668 677 703 718 724 747 796 847 865 842 815 821 853 862 831 796 800 832
1289H32J7nMJ5j6o7o6KO3N1nl3j0K2L3K4J2mj6j4%J4J9J8J3NJ0L6N8K9m4r5p8k7PJ8K9K7j1
$$ 832 849 844 848 863 847 780 714 716 779 830 825 792 782 804 837 861 873 869 853 839 839 853 872 890 903 908 918 954 1012 1041 997 902 824 797 804 822 851 878 867
1284H67n7m7J7N4J9l4l4J0L0J0j4qJ3K5L0K7J4rk2j1J0K4K8K3J5RORJ1J7J8Pj4l2l2j8jK8
$$ 867 810 763 780 834 853 819 785 795 825 835 821 813 826 851 881 908 922 913 891 880 890 914 942 965 980 989 995 1004 1015 1032 1050 1057 1043 1011 979 961 960 988
1279I88O5P5L0m3p7m5NJ6qk4j0J6L1K7Lk4l2j1J7K4Lj5qK4N7N8K3l0o3o1l5j5qpokRK9M8M7
$$ 988 1053 1128 1158 1115 1038 993 998 1014 1006 982 972 988 1019 1046 1049 1025 993 982 999 1023 1026 1011 1003 1027 1084 1142 1165 1135 1072 1011 976 961 953 946 940 938 947 976 1024 1071
1275A071K2qk1j3KJj2k2j4QL1M4M2K3pk5j4J9L5J3k8m0j3K7L3Jl1k3K0M5J9k8m2k2JJ3K6L7
$$ 1071 1093 1085 1064 1051 1053 1054 1042 1020 1006 1014 1045 1089 1131 1154 1147 1122 1108 1127 1162 1175 1147 1107 1094 1121 1154 1155 1124 1101 1121 1166 1185 1157 1115 1093 1094 1107 1133 1170
1270A170K4pk1%J7Kj7j0J0Qnqql0m8j3N3P1J7l8l0J0J3j9k5J1L8K7OJ3L5K6j8n5n7l7j8kJ5
$$ 1170 1194 1187 1166 1166 1183 1185 1168 1158 1168 1176 1171 1163 1155 1125 1077 1064 1117 1188 1205 1167 1137 1147 1160 1141 1116 1127 1165 1192 1198 1211 1246 1272 1254 1199 1142 1105 1087 1085 1100
1265A100K0Po%K1L0K0J4K2K2Pj1j0nj1j5jK1K7J6RQOJjJjjPJ5Rmppj7l2k8KL5M4K5pk6rK9
$$ 1100 1120 1127 1121 1121 1142 1172 1192 1206 1228 1250 1257 1246 1236 1231 1220 1205 1204 1225 1252 1268 1277 1285 1291 1292 1291 1292 1291 1290 1297 1312 1321 1317 1310 1303 1286 1254 1226 1228 1263 1307 1332 1325 1299 1290 1319
1260A319M3J8nPK6Ok7k4KJk1pL5L9JnN0P8K6l6k4J8Ql1j3N1P5L2rj4j9m7n2j8J0KlK3L3rn9
$$ 1319 1362 1380 1375 1382 1408 1414 1387 1363 1365 1366 1345 1338 1373 1412 1413 1408 1458 1536 1562 1526 1502 1520 1528 1497 1484 1535 1610 1642 1633 1619 1600 1553 1501 1483 1493 1495 1492 1515 1548 1539 1480
1255A480n3rK0K7M5O7N3Qj9nJ0j0m6n6k7J3L2K0pk3k0mK0N0P2O8L2rj9kJ1jk1k2mPKq%J8K0
$$ 1480 1427 1418 1438 1465 1510 1577 1630 1638 1619 1614 1624 1614 1568 1512 1485 1498 1530 1550 1543 1520 1500 1496 1516 1566 1638 1706 1738 1729 1710 1708 1719 1718 1697 1675 1671 1678 1680 1672 1672 1690 1710
1250A710LkK5N0L6%j0RJ4ljK8M6J6k7l9k3pJ0L5L7kl9j6L8M9Jl7k1J9K9J2%%KLql0m3j3M5
$$ 1710 1713 1711 1736 1786 1822 1822 1812 1821 1835 1832 1831 1859 1905 1921 1894 1855 1832 1825 1835 1870 1907 1905 1866 1850 1888 1937 1938 1901 1880 1899 1928 1940 1940 1940 1942 1945 1937 1907 1864 1851 1896
1245A896O4J0n2m9PM5L6K1L4N9O0L4kk8l3j8MJ6J1lj6j8NM2N5J9l4m2J0N7M2j5n0l4JK8M1
$$ 1896 1960 1970 1918 1869 1876 1921 1957 1978 2012 2071 2131 2165 2163 2135 2102 2084 2088 2104 2115 2112 2096 2078 2083 2125 2180 2199 2165 2123 2133 2190 2232 2217 2167 2133 2134 2162 2203
1240B203N2M8K1j3k3JM1O0M2ll0k2J0L0L1K4K2J5%qPK7L0J8N%%%MROjm%J%QK6L4J2k2l9k1
$$ 2203 2255 2303 2324 2311 2288 2289 2330 2390 2432 2429 2399 2377 2387 2417 2448 2472 2494 2509 2509 2501 2508 2535 2565 2583 2588 2588 2588 2588 2592 2601 2607 2606 2602 2602 2603 2603 2611 2637 2671 2683 2661 2622 2601
1235B601J4M3M8K7ok5j6J8M9N3L1PKJ3Qj5j9J7N8M7j1m6k0K3L1J6K5N2N2J6j1KK8K6NqKK3
$$ 2601 2615 2658 2706 2733 2727 2702 2686 2704 2753 2806 2837 2844 2846 2859 2867 2852 2833 2850 2908 2955 2944 2898 2878 2901 2932 2948 2973 3025 3077 3093 3082 3084 3112 3138 3143 3135 3137 3160
1230C160L6L6K0ok3j8LK1K7L2L3K5Mj9k1%K5L3K2QMPJ0J0J5J8J6J0J1J7K5K7J6rl3k6J2N0
$$ 3160 3196 3232 3252 3246 3223 3205 3208 3229 3256 3288 3321 3346 3350 3331 3310 3310 3335 3368 3390 3398 3402 3409 3419 3429 3444 3462 3478 3488 3499 3516 3541 3568 3584 3575 3542 3516 3528 3578
1225C578M9J8j0j4mQK1K7K3J6J8K0PlJ0L4L0kk6k2j3j4lK4M1L3L0M9N5K6QM1P5L8l7n7nL6
$$ 3578 3627 3645 3635 3621 3617 3625 3646 3673 3696 3712 3730 3750 3757 3754 3764 3798 3828 3826 3800 3778 3765 3751 3748 3772 3813 3846 3876 3925 3980 4006 4014 4055 4130 4168 4131 4074 4069 4105
1221D105J3k4qM5P2N5K4LrlK0M2L1mk7k4rkJJ3K7K8jm1o1l6J3M5M2K3J0KpoJ4L9M0J7ljJ3
$$ 4105 4118 4094 4086 4131 4203 4258 4282 4285 4276 4273 4293 4335 4366 4362 4335 4311 4302 4300 4301 4314 4341 4369 4368 4327 4266 4230 4243 4288 4330 4353 4363 4365 4358 4352 4366 4405 4445 4462 4459 4458 4471
1216D471J7J2RJ2J5R%%J3K3J4llJ3K4J4koLQPMklJ0L3L9J0l5m9k7MK2L0L7K8Kk1j6OJ4mk2
$$ 4471 4488 4500 4509 4521 4536 4545 4545 4545 4558 4581 4595 4592 4589 4602 4626 4640 4638 4632 4635 4643 4650 4654 4652 4649 4659 4692 4731 4741 4706 4657 4630 4634 4656 4686 4723 4751 4753 4732 4716 4722 4736 4732 4710
1211D710j2J9M5M0J2k3l7k5ook5l3j1K2K9Qnlmj7k0ojk2l6j3K3L2J7J1J9J0j4j4J1K0%j7r
$$ 4710 4698 4717 4762 4802 4814 4791 4754 4729 4723 4717 4692 4659 4648 4670 4699 4707 4702 4699 4695 4678 4658 4652 4651 4629 4593 4580 4603 4635 4652 4663 4682 4692 4678 4664 4675 4695 4695 4678 4669
1206D669pl0m1qK9K6mj2pk3m4k9J0J4k5m4j3J4qm6m6qK5M2M6L3Mj5JK5J4k9o0n2k3JJ3J4%
$$ 4669 4662 4632 4591 4583 4612 4638 4634 4622 4615 4592 4548 4519 4529 4543 4518 4474 4461 4475 4467 4421 4375 4367 4392 4434 4480 4513 4517 4502 4503 4528 4542 4513 4453 4401 4378 4379 4392 4406 4406
1201D406k0k7k0rrqKJ2Pj6m4m7k0J6J9j8m8k9J3K0j5l9k0J3K2J5J9K0pm4m6qJ6Pj3j6k1m1
$$ 4406 4386 4359 4339 4330 4321 4313 4315 4327 4334 4318 4274 4227 4207 4223 4242 4224 4176 4147 4160 4180 4165 4126 4106 4119 4141 4156 4175 4195 4188 4144 4098 4090 4106 4113 4100 4084 4063 4022
1196D022m7j9J2Nl0m2j6QPMK1L7K1j3l6l6l6m8o3o4m6j3J5K7J6rl2l8j8QJm5q3n9MK8om5l5
$$ 4022 3975 3956 3968 3973 3943 3901 3885 3893 3900 3904 3925 3962 3983 3970 3934 3898 3862 3814 3751 3687 3641 3628 3643 3670 3686 3677 3645 3607 3589 3597 3598 3553 3470 3411 3415 3443 3437 3392 3357
1192C357KK1K1K5K4Nk1k4j9k3k8j2%k0m3j8M1O1K4j6j7j0k2m1l7k5k2k1j9k0k5j6%rl8m2k
$$ 3357 3359 3380 3401 3426 3450 3455 3434 3410 3391 3368 3340 3328 3328 3308 3265 3247 3288 3349 3373 3357 3340 3330 3308 3267 3230 3205 3183 3162 3143 3123 3098 3082 3082 3073 3035 2993 2991
1187B991L9K8j4m0k9jK2K2ok9j8J0ln4o9k6Nk4n4j7M0M0lj1Kk7p8p0QN7L5kqj4m2m5pJ2l1
$$ 2991 3030 3058 3044 3004 2975 2974 2996 3018 3012 2983 2965 2975 2972 2918 2849 2823 2828 2804 2750 2733 2773 2813 2810 2799 2801 2774 2696 2626 2634 2691 2726 2724 2716 2702 2660 2615 2608 2620 2589
1182B589p5n3RM1L4K2Kl7n9k5K6L4LrJ1J9%k0k2k7l9l9k0k%JJ0J3Lj2l3o0o6l4MJl1k7K1M9
$$ 2589 2514 2461 2470 2511 2545 2567 2569 2532 2473 2448 2474 2508 2511 2502 2513 2532 2532 2512 2490 2463 2424 2385 2365 2363 2363 2364 2374 2387 2390 2378 2345 2285 2219 2185 2189 2190 2159 2132 2153 2202
1177B202K2j0KK0lm6n5k7rrJK2K4OKJ3Jm1o7m8j9k4m1j9L3O2L6j4m6m4j5K3M2J5l4n0j7J6
$$ 2202 2224 2214 2216 2236 2233 2187 2132 2105 2096 2087 2088 2110 2134 2140 2142 2155 2156 2115 2048 2000 1981 1957 1916 1897 1930 1992 2028 2014 1968 1924 1909 1932 1974 1989 1955 1905 1888 1904
1173A904Qj8j3K7M7K3qj4j2l1n5m3JK2ml4j6L4N2J6k3k1MNk2m3m3l6k6kK2K0jjJ9J0m2p1k8
$$ 1904 1912 1894 1881 1908 1955 1978 1970 1956 1944 1913 1858 1815 1816 1838 1834 1800 1784 1818 1870 1886 1863 1842 1846 1851 1829 1786 1743 1707 1681 1679 1701 1721 1720 1719 1738 1748 1706 1635 1607
1168A607L9N2J7pmj5m5m5oJ3j6m0j3K8J9k3l5j1NjLK3J7k3n4l8KJ1j2k9j2J6J7j0l0rL3M6
$$ 1607 1646 1698 1715 1708 1704 1689 1644 1599 1593 1606 1590 1550 1537 1565 1584 1561 1526 1515 1520 1519 1522 1545 1562 1539 1485 1447 1449 1460 1448 1419 1407 1423 1440 1430 1400 1391 1424 1470
1163A470On3p7n5j6J2K7L1L0K7K1kl8o0m1LL1K6J1J0J3ml0m1k2%Mpj5j7j8j4J0M2N4L0LJQ
$$ 1470 1476 1423 1346 1291 1275 1287 1314 1345 1375 1402 1423 1421 1383 1323 1282 1285 1316 1342 1353 1363 1376 1372 1342 1301 1279 1279 1283 1276 1261 1244 1226 1212 1222 1264 1318 1348 1351 1352 1360
1159A360%j7j1Kj6n1m3J5N5K8k1l2j3mnJ1K9K3NMJ1ql4l2j2j6l8l1MK3J8J7K5Ll7m4j0Pj7
$$ 1360 1360 1343 1332 1334 1318 1267 1224 1239 1294 1322 1301 1269 1256 1252 1247 1258 1287 1310 1315 1319 1330 1322 1288 1256 1244 1228 1190 1159 1163 1186 1204 1221 1246 1249 1212 1168 1158 1165 1148
1154A148l2qRk1m7oP0R0L6l0n0k3J9M1K7j5m5l7j4mmMJ1MjOJ0j3l6k5PJ4nj7opl0m3j5L1N0
$$ 1148 1116 1108 1117 1096 1049 1043 1113 1203 1239 1209 1159 1136 1155 1196 1223 1208 1163 1126 1112 1108 1104 1108 1119 1123 1122 1128 1138 1125 1089 1064 1071 1085 1080 1063 1057 1050 1020 977 962 993 1043
1149A043K6rj9j0j1k3j9K0N5L7k0n3l8j9k5l0qJ9J7MOPqj5QK3j1n8m7J3M2K0kJ0K5Ok2k7j6
$$ 1043 1069 1060 1041 1031 1020 997 978 998 1053 1090 1070 1017 979 960 935 905 897 916 933 937 943 950 942 927 935 958 947 889 842 855 897 917 915 925 950 956 934 907 891
1144H91j0nJ2K7K4Rrl2m8m0j1J3J6J4J5J8J9K5L3K0j2l5l5k2j1llj7k6j2J2J2j1k0%K1K3K2
$$ 891 881 876 888 915 939 948 939 907 859 819 808 821 837 851 866 884 903 928 961 981 969 934 899 877 866 863 860 843 817 805 817 829 818 798 798 819 842 864
1139H64K5J7nk1j8j5j8mL0M4J3k8l7j1J5J6nl0l3qJ6lm0l0L2P1L5k7m8l4k7k4jL5M7K9Nj3
$$ 864 889 906 901 880 862 847 829 825 855 899 912 884 847 836 851 867 862 832 799 791 807 804 764 734 766 837 872 845 797 763 736 712 711 746 793 822 827 814
1135H14k5j5J6L8J4l2n3m3l0j5J2L9L6J2onllQJ7Pj4k5l0l4k4J5M3J6l8m4RN6M7Kl1l1lL1
$$ 814 789 774 790 828 842 810 757 714 684 669 681 720 756 768 762 757 754 751 759 776 783 769 744 714 680 656 671 714 730 692 648 657 713 760 762 731 700 697 728
1130G28L8Jl3j7K2J2m4n9lN0L3j5k0J0K4Nj1JK3L1J2k6m9k5K0L0%j1K7N1J7k7j9Nj4n0l2K4
$$ 728 766 767 734 717 739 751 707 648 645 695 728 713 693 703 727 732 721 722 745 776 788 762 713 688 708 738 738 727 754 805 822 795 776 781 767 717 685 709
1125G09L3j1k8J1K7k0n7k0L7K2m1o0k1QJ%K8M4K3kNK0J2mPL6L4ql9j9K2L0j8q1r5l6N3R7O4
$$ 709 742 731 703 714 741 721 664 644 681 703 662 602 581 589 590 590 618 662 685 683 688 708 720 716 723 759 793 785 746 727 749 779 761 680 585 549 602 699 763
1121G63jl4k4rj3j4MK0J7QPOj1k9k3MK1J7lk2l0j2J8K5lk6oK2Om5n2ON3L1k7m1rJ4Kj5rJ0
$$ 763 762 728 704 695 682 668 672 692 709 717 724 730 719 690 667 671 692 709 706 684 654 642 660 685 682 656 650 672 678 633 581 587 640 671 644 603 594 608 610 595 586 596
1115E96K2K3J9Kk8m5l2JJ5pl6l0J4N0M2Nj0NK8L3K5Lk4l6j3K4K2j7l5nK5Ol8m2pK2K0Ooj8
$$ 596 618 641 660 662 634 589 557 558 573 566 530 500 514 564 606 611 601 606 634 667 692 695 671 635 622 646 668 651 616 611 636 642 604 562 555 577 597 603 597 579
1111E79k0jK3J6j4l0j7%J2K8M5M0Pj9k2j1plONj4k1jJ7Oj2kK6K5j0l6k6rj6k1KL5K7k1m7j2
$$ 579 559 558 581 597 583 553 536 536 548 576 621 661 668 649 627 616 609 606 612 617 603 582 581 598 604 592 590 616 641 631 595 569 560 544 523 525 560 587 566 519 507
1106E07L8M1Jk4qJ6J7QJ0Lk2m1k1J2J3j0j3J6L3J1j8j3QOk2m1k8kK3M0M5L2Oj0j0j2l1m8k7
$$ 507 545 586 587 563 555 571 588 596 606 609 587 546 525 537 550 540 527 543 576 587 569 556 564 570 548 507 479 477 500 540 585 617 623 613 603 591 560 512 485
1101D85K0M3J4k3qM2M6j4o6m4J3K3j1j9K3M9K2qRL7J5m4o2j6L2K4j6l4j5QJ2%j1j4j3lJ0J7
$$ 485 505 548 562 539 531 573 619 605 539 495 508 531 520 501 524 573 595 587 596 633 648 604 542 526 558 582 566 532 517 525 537 537 526 512 499 496 506 523
1096E23PoKK6L2Ml0l0kJ6J2OJk0m8m4JL6J7k1k4J3M2M3L3J7mk0pJ7J8j2k9k1j9m0m5nL9K9
$$ 523 530 524 526 552 584 588 558 528 526 542 554 560 561 541 493 449 450 486 503 482 458 471 513 556 589 606 602 582 575 592 610 598 569 548 529 489 444 439 478 507
1091E07k2m2oL5L8J1j1k5l8m1k5%J4K3L5K6j2m3j9L6M6kl6oM5M4Jk5j7j0j5j5%Jj6l0k4qJ0
$$ 507 485 443 437 472 510 521 510 485 447 406 381 381 395 418 453 479 467 424 405 441 487 485 449 443 488 532 533 508 491 481 466 451 451 452 436 406 382 374 384
1086C84L1M5K7j0k5qPnk0j6kNNMj3m3n0j3L2M7L9L5L5K1OMLk1m4k4K8N4K4l1o2n0j7OMj4k2
$$ 384 415 460 487 477 452 444 451 446 426 410 408 413 418 422 409 366 316 303 335 382 421 456 491 512 518 522 525 504 460 436 464 518 542 511 449 399 382 388 392 378 356
1081C56oJ2J5J6K5L3K1PJ1J7Kj9j8%Jj4j8pmKK5L7Ol8k7K8M0j1m0JM3J1n2m8J7N5K8j9l9k9
$$ 356 350 362 377 393 418 451 472 479 490 507 509 490 472 472 473 459 441 434 430 432 457 494 500 462 435 463 503 492 452 453 496 507 455 407 424 479 507 488 449 420
1077D20lK3K9Lk0mK8K6j0k4lOj5k9j5%pj5kJ2MmJ3L2J6j8k0Kon7q1l1M6O9L0j0j4nnOL5N0
$$ 420 417 440 469 472 452 448 476 502 492 468 465 471 456 427 412 412 405 390 388 400 404 400 413 445 461 443 423 425 419 362 281 250 296 365 395 385 371 366 361 367 402 452
1071D52K4j1j0J6Ql2m2KM4K3l4n6k5J4K5K0J9K3K3K3L0K5on2p7n5%M6M5kl9k6K5O2N4J0l5
$$ 452 476 465 455 471 479 447 405 407 451 474 440 384 359 373 398 418 437 460 483 506 536 561 555 503 426 371 371 417 462 460 421 395 420 482 536 546 511
1067E11n7m7j6J5K3J2%qj6j9rJ5L6M1K3ok4j5J2K5Jk8k0J1J7j4l4j0K4J9j8l7k2NJ6J1nk1
$$ 511 454 407 391 406 429 441 441 433 417 398 389 404 440 481 504 498 474 459 471 496 497 469 449 460 477 463 429 419 443 462 444 407 385 390 406 417 412 391
1062C91k8j3J7L4K9J7J7J6kl1m4k8kRJ0K3M0K8k1n3k5L8O1K3j4%L1K2k5m7k7jjkJ5L0J5j5
$$ 391 363 350 367 401 430 447 464 480 478 447 403 375 373 382 392 415 455 483 462 409 384 422 483 506 492 492 523 545 520 473 446 445 444 442 457 487 502 487
1058D87k7j7pmLJ3Kk0j9J4L8J4l8o2m0lJ3RJ4K3K0j1m2m2qL4N4N2L0j2o2q3m5K4O2M6J4nj0
$$ 487 460 443 436 432 435 448 450 430 411 425 463 477 439 377 337 334 347 356 370 393 413 402 360 318 310 344 398 450 480 468 406 323 278 302 364 410 424 419 409
1053D09j3oJ0J0j3j6K7O1K0n8p7j5M0K8pnK1J5j5k6nJ5J4Jj5k8j2L2N6J6n9q9n0J6N8O6M7
$$ 409 396 390 400 410 397 381 408 469 489 431 354 339 379 407 400 395 416 431 416 390 385 400 414 415 400 372 360 392 448 464 405 316 266 282 340 406 453
1048D53J0j8j4OMj4j8jnk8k8OL0J8MJ6L0J9PNj6o9j00n9NJ6j0%N4Q2M8kj8oJ1K4K2j4o6p1
$$ 453 463 445 431 437 441 427 409 408 403 375 347 353 383 401 405 421 451 470 477 482 466 397 297 238 243 259 249 249 303 385 433 431 413 407 418 442 464 450 384 313
1043C13nO1N7RpL0N8K8l3o5m9j1J8M0N1M0Jl2k6QK2ll0k9j6k6m9m4KN0O1L1ok6k2pjj0j2J1
$$ 313 308 369 426 435 428 458 516 544 511 446 397 386 404 444 495 535 536 504 478 486 508 505 475 446 430 404 355 311 313 363 424 455 449 423 401 394 393 383 371 382
1039C82M1M8L3J7J3Mj3k3k1k0l1l6j7RK0K1K3J9pm9o2k0M5P4M1j5l7k1kmnL%l0m4kO6P5J2
$$ 382 423 471 504 521 534 538 525 502 481 461 430 394 377 386 406 427 450 469 462 413 351 331 376 450 491 476 439 418 416 412 407 410 410 380 336 334 400 475 487
1034D87n1m9mK4J4j0k5k8j0K3L5J0k8l2NL5K9MqjMj2k6j2K1L1Nk0j0J7J9LJQj3n1m2J7M7Q
$$ 487 436 387 383 407 421 411 386 358 348 371 406 416 388 356 361 396 425 429 421 420 424 412 386 374 395 426 431 411 401 418 437 440 441 449 436 385 343 360 407 415
1029D15l0pL0Jn5m0L1N0j5n8j1N2L7k2k5L5P3L8k0m2k2MJ5J4QMKjJOMj6m6n6k6K2N0M3J5j1
$$ 415 385 378 408 409 354 314 345 395 380 322 311 363 400 378 353 388 461 499 479 437 415 419 434 448 456 460 462 461 462 468 472 456 410 354 328 350 400 443 458 447
1024D47k9l4k9k5l0l3j6J8M2L0pl3k1J2K6Kk5j3K4M4L4L0L8J9m4r0n4K7N8J4l2j8K7M0J8K
$$ 447 418 384 355 330 300 267 251 269 311 341 334 301 280 292 318 320 295 282 306 350 384 414 452 471 427 337 283 310 368 382 350 332 359 399 417 419
1020D19Llk4l1qJ5Qj3qK7N0L2pk7j1J5J5j1l2j5K6M9K3k3m0k0pk7m5k1K6L6Jk4KL8L2mk0J
$$ 419 422 419 395 364 356 371 379 366 358 385 435 467 460 433 422 437 452 441 409 394 420 469 492 469 429 409 402 375 330 309 335 371 372 348 350 388 420 416 396 397
1015C97J3qm2n0k6LK0K1J0qk4k0OL7M7K2j4k9k2j1j3j4RL5L6Nk2j2K4N2M5Rl1m5l2r%j2k6
$$ 397 410 402 360 310 284 287 307 328 338 330 306 286 292 329 376 398 384 355 333 322 309 295 304 339 375 380 358 346 370 422 467 476 445 400 368 359 359 347 321
1010C21k9j9jJ2J6PKJ3M1N8M4Nk6l3k8k8l1j0K7L7qo1m9K8Q6O0ql7j6J0J0Jpk1l3j5L0N2K1
$$ 321 292 273 272 284 300 307 309 322 363 421 465 470 444 411 383 355 324 314 341 378 370 309 260 288 374 434 426 389 373 383 393 394 387 366 333 318 348 400 421
1005D21l7p4o4k3K4M5J9j9k2J5L9J7j0kJ7Lk3j1L0M8K2%PJ4nk8k4%J5RkpojNNjj1k4l3k2J5
$$ 421 384 310 246 223 247 292 311 292 270 285 324 341 331 329 346 349 326 315 345 393 415 415 422 436 431 403 379 379 394 403 401 394 388 387 392 397 396 385 361 328 306 321
1000C21M5K9k1m9k2K4L9J7kPK7L0Rk2l8k6qj0k4j3K4M0Rk8k4LKk7l7j5N%j1rpj4mL2N7L6m
$$ 321 366 395 374 325 303 327 366 383 381 388 415 445 454 432 394 368 360 350 326 313 337 377 386 358 334 337 339 312 275 260 265 265 254 245 238 224 220 252 309 345 341
995C41j0J8L5K1NMRJoKRql5m6l0oJ8L6M3K7nk3j7jLKJ2J8Kj9j9KJ2koJ6L8K7lj7j2j9m0l8
$$ 341 331 349 384 405 410 414 423 424 418 420 429 421 386 340 310 304 322 358 401 428 423 400 383 382 385 387 399 417 419 400 381 383 395 393 387 403 441 468 465 448 436 417 377 339
990C39jL2K3j4k6mJ9J5kpkJNJ8K4Qk1l7k6lJ7K4J3qj4OJ9kl4j8L8N3mo1m3K0K8k4n9l7lmj0
$$ 339 338 370 393 379 353 349 368 383 381 374 372 373 378 396 420 428 407 370 344 341 358 382 395 387 373 379 398 396 362 344 382 435 431 370 327 347 375 351 292 255 252 248 238
984B38QL0K5J4K6L4Lm0m7k1mKK0M2L2nj9MK3Qj5k1j9k4k6rK0M0N4N3K6k3n8n5l2j9j6kK0L6
$$ 238 246 276 301 315 341 375 378 338 291 270 266 268 288 330 362 357 338 342 365 373 358 337 318 294 268 259 279 319 373 426 452 429 371 316 284 265 249 247 267 303
979C03L3J2j4l3k6nLj1j8jK2K6K2K1J0j3j8J8N1K8k3l7r%l0m3oK9J2j9KN3N8Ol7k9KJ2PKj0
$$ 303 336 348 334 301 275 270 273 262 244 243 265 291 313 334 344 331 313 331 382 410 387 350 341 341 311 268 262 291 303 284 286 339 397 403 366 337 339 351 358 360 350
974C50l2l7pK4J4j5j2K5L7ll7j7L3N1L5K7L8L0j1m8m5k3j9k7j7PK2J2knpj9l6l6j9LK2L3L3
$$ 350 318 281 274 298 312 297 285 310 347 344 307 290 323 374 409 436 474 504 493 445 400 377 358 331 314 321 343 355 353 348 341 322 286 250 231 234 256 289 322
970C22J5j2k8j2J8K7%l7m9l3oJ1J1j0l2l0ML4L1J1J2J5pl6j7M1N8J1k8KN6N8Nl7m7m4l2ML8
$$ 322 337 325 297 285 303 330 330 293 244 211 205 216 227 217 185 155 159 193 224 235 247 262 255 219 202 243 301 312 284 286 342 400 405 368 321 277 245 249 287
965B87L0qk4rlj6j5ONk5l2J3N6M0j1l4j2J8K3J2jnLJ8K4J9J5J7J5nk9m1l4j4J7M6M9K3jl%
$$ 287 317 309 285 276 273 257 242 248 253 228 196 209 265 305 294 260 248 266 289 301 300 295 298 316 340 359 374 391 406 401 372 331 297 283 300 346 395 418 417 414 414
960D14pj1JRrl1j8J6K8QlJ6L8K9Kj6k3l6m9l6KK3nm2l2J8M1J0k0%L6K9rk1LJ7Kj7k4l5m3j6
$$ 414 407 396 397 406 397 366 348 364 392 400 397 413 451 480 482 466 443 407 358 322 324 347 342 300 268 286 327 337 317 317 353 382 373 352 355 372 374 357 333 298 255 239
955B39L7M4j2n7k5M2N7J4k4k4nJ4K2J1k0m2l2j3rmJ9L5J4k1k1KRKJ5L5K8NLJ0rl3rL8L0l0
$$ 239 276 320 308 251 226 268 325 339 315 291 286 300 322 333 313 271 239 226 217 213 232 267 281 260 239 241 250 252 267 302 330 335 338 348 339 306 297 335 365 335
950C35n1JM0Rk8kM3L5j5l4j1Mpj9j8k0j5J5N3N5K1qmQLj1j8qLLqj7j2nmoMJ8Lk7k9J3M0J7
$$ 335 284 285 325 334 306 304 347 382 367 333 322 326 319 300 282 262 247 262 315 370 391 383 379 387 390 379 361 353 356 359 351 334 322 317 313 307 311 329 332 305 276 289 329 346
945C46j8mM3M9Jm3l8nMj6k2J0N3N3Ol4k7PJ6KLJ6Ok8k8J5M0J0k2nK4Rk2j7PJl1l7j1J0J8K9
$$ 346 328 324 367 416 417 374 336 331 335 319 297 307 360 413 419 385 358 365 381 383 386 402 408 380 352 367 407 417 395 390 414 423 401 384 391 392 361 324 313 323 341 370
939C70K2k3o4m1K3M2PrK3M0Ol0k3kmj5jJ2ll2l9k6oK0M3M2K1J1K3J8j9l9j4J2pm0l1J3K7n
$$ 370 392 369 305 264 287 329 336 327 350 390 396 366 343 341 337 322 321 333 330 298 259 233 227 247 290 332 353 364 387 405 386 347 333 345 338 298 267 280 307 302
934C02l2j5L0N7L8j4n7n2rJ6mk5nL4L7Qj2lMjKK1K6Kk5k4JK4K6J0j0k0j6o%LQJ1J0PKoj4j1
$$ 302 270 255 285 342 380 366 309 257 248 264 260 235 230 264 301 309 297 294 298 297 299 320 346 348 323 299 300 324 350 360 350 330 314 308 308 311 319 330 340 347 349 343 329 318
929C18qj7l1j4L3O5N4K1P%k1m0l3oLlNL2M2J8rj8j6j7j6nJ1J5J0kk2m4m9k3K3N8N5J5k3k9
$$ 318 310 293 262 248 281 346 400 421 428 428 407 367 334 328 331 328 333 365 407 425 416 398 382 365 349 344 355 370 380 378 356 312 263 240 263 321 376 391 368 339
924C39oJ0OJOJ1Jj0j1oMJ9K7Nk6j9K6M4po0m4J4L2mk4jK1Pk4m1l3KM8O4L1j3j6kk5o4m5K8
$$ 339 333 343 349 350 356 367 368 358 347 341 345 364 391 396 370 351 377 421 414 354 310 324 356 352 328 327 348 355 331 290 257 259 307 371 402 389 373 371 346 282 237 265
919B65N7J0l2lL8K2k1j8K2L4Nj3jJ7J9J1jj4j3NJ6Kj3j1qk2k5PL9L0mj9j5k0k8qK5J7k9n2
$$ 265 322 332 300 297 335 357 336 318 340 374 379 366 365 382 401 412 411 397 384 389 405 407 394 383 375 353 328 335 374 404 400 381 366 346 318 310 335 352 323 271
914B71j9L5O1N1J6k4m5k9JJ5J5K6L6J1k8k6K0L9km7l4J1K2j2m0k7KJ5Kj1oPQnoJ9L7J9j9l4
$$ 271 252 287 348 399 415 391 346 317 318 333 348 374 410 421 393 367 387 426 424 377 343 354 376 364 324 297 299 314 316 305 299 306 314 309 303 322 359 378 359 325
909C25k4k4l7k4J7M1K5QJ9L2J3mJ2L9K8j3l4k8k4k4kM0O0M2J1jqk2l4k4nMNJ1K0K0Kj8k5j9
$$ 325 301 277 240 216 233 274 299 307 326 358 371 367 379 418 446 433 399 371 347 323 321 361 421 463 474 473 465 443 409 385 380 384 389 400 420 440 442 424 399 380
904C80lOMj2k9l0rJ6J9nk4j4J2J8lj8j3oj7k7qK7M1J9j3k2lK0K7J7Kpj0k0k2JL4L4j3o1n6
$$ 380 377 383 387 375 346 316 307 323 342 337 313 299 311 329 326 308 295 289 272 245 237 264 305 324 311 289 286 306 333 350 352 345 335 315 293 294 328 362 349 288 232
899B32rK3K3J2J1J2J2K1L2K7OlN%k2j6L1O0J9m6l7L5O8J1n8n2PL7J4%K2M5L6J8K4L9L3J3N
$$ 232 223 246 269 281 292 304 316 337 369 396 402 399 404 404 382 366 397 457 476 430 393 428 496 507 449 397 404 441 455 455 477 522 558 576 600 639 672 685 690
895F90Nnk5k5kK9N2O0M3%m2l8OL4J5j1mK1K0ljL5N7L7PLK1L2L2L3K9J4qj6j3rnLJ4J7J6K2
$$ 690 695 690 665 640 638 667 719 779 822 822 780 742 748 782 797 786 782 803 823 820 819 854 911 948 955 958 979 1011 1043 1076 1105 1119 1111 1095 1082 1073 1068 1071 1085 1102 1118 1140
890A140K4Jl6l9QN7M7k4r2r8m8LJ7mk3j7MJ0rk7k0KNj9m1l8k5k1k5k1rllnj7l5m0j4J8J5k8
$$ 1140 1164 1165 1129 1090 1098 1155 1202 1178 1086 988 940 943 960 956 933 916 920 930 921 894 874 876 881 862 821 783 758 737 712 691 682 679 676 671 654 619 579 565 583 598 570
884E70o4n9k7JJ6K3J0k0m0l0mOpj4LK8M0L2Ok6m3l4j2jJQJ9J5oj3PK6J1k2l3j6ok1k8rQk0
$$ 570 506 447 420 421 437 460 470 450 410 380 376 382 375 361 364 392 432 464 470 444 401 367 355 354 355 363 382 397 391 378 385 411 422 400 367 351 345 324 296 287 295 275
879B75o2n4J0N8M4PMK9L3J2kkj6l1j0M4O3J9l1l6j5j6k6pK6L0Nj3j4j2qJ4L0Rl5m5qK2J7L
$$ 275 213 159 169 227 271 278 282 311 344 356 354 352 336 305 295 339 402 421 390 354 339 323 297 290 316 346 351 338 324 312 304 318 348 357 322 277 269 291 308 311
874C11J4K4Jl3l8j1J3K3K5K3PpmOjk0j8J7N2M8J5rkQj6o0p3l1J6J6j3oM6P9M4k2m5k0RJ5J3
$$ 311 325 349 350 317 279 268 281 304 329 352 359 352 348 354 353 333 315 332 384 432 447 438 436 444 428 368 295 264 280 296 283 277 323 402 446 424 379 359 368 383 396
869C96K2K6RoKK6L2Jm5o3m4j2J0K6L7K1k9o7m3J9L9Lk3JK5%l4j6L1L4loM1O2J0n5o1j7Pkk
$$ 396 418 444 453 447 449 475 507 508 463 400 356 344 354 380 417 438 409 342 299 318 357 360 337 338 363 363 329 313 344 378 375 369 410 472 482 427 366 349 356 354 352
864C52K0K7Kk0%M2N9L6ml9n6n4l3pNjjJ0J3jj5rMMppJ%jJ9M7N1K2oj8k2k2JL3K6k4n2j6L0
$$ 352 372 399 401 381 381 423 482 518 514 475 419 365 332 325 330 329 328 338 351 350 335 326 330 334 327 320 321 321 320 339 386 437 459 453 435 413 391 392 425 451 427 375 359 389
859C89K2j7k4%Nj4j2J6J9j3l2oK6K4Kj0qpookJ9O1R2O7%l7k0jk3n7n0j4J1J7K2K6J6Jmoj7
$$ 389 411 394 370 370 375 361 349 365 384 371 339 333 359 383 385 375 367 360 354 348 346 365 426 518 585 585 548 528 527 504 447 397 383 394 411 433 459 475 476 472 466 449
854D49k1KL1K8lk2j7kMRJ4J6J2Moj2NL7M8J3l0m1k4j3pK1N2M4%k1J1M3K0l7n4j4L8M9J8j4
$$ 449 428 430 461 489 486 464 447 445 449 458 472 488 500 504 498 486 491 528 576 589 559 518 494 481 474 495 547 591 591 570 581 624 644 607 553 539 577 626 644 630
849F30k5k1j2%PKj0qK1N0M6J7PK1J6k3m9j8L4M6K3J1J8J1j6k5oJ3J4J7K4J6%J0M7N8K2j3n
$$ 630 605 584 572 572 579 581 571 563 584 634 680 697 704 725 741 718 669 651 685 731 754 765 783 794 778 753 747 760 774 791 815 831 831 841 888 946 968 955 950
844I50K0K5J9L5N0K7j7k3J4M2L2J4K0L7L8K2jk1k5%M0N7K9j3k7lK7L6K6J0MJ1K6M0L2RlJ9
$$ 950 970 995 1014 1049 1099 1126 1109 1086 1100 1142 1174 1188 1208 1245 1283 1305 1304 1283 1258 1258 1298 1355 1384 1371 1344 1341 1368 1404 1430 1440 1444 1455 1481 1521 1553 1562 1559 1578
840A578N5P0M9K3K9N9Q5R2R3J05J26J46J71K00K15J90J36R6J05J51J81J73J54J61J87J97J92
$$ 1578 1633 1703 1752 1775 1804 1863 1948 2040 2133 2238 2364 2510 2681 2881 3096 3286 3422 3518 3623 3774 3955 4128 4282 4443 4630 4827 5019
836E019K10K58K76K27J66J77K44K86K85L17M21N37O06O71Q19J063J337J616J943K331K715
$$ 5019 5229 5487 5763 5990 6156 6333 6577 6863 7148 7465 7886 8423 9029 9700 10519 11582 12919 14535 16478 18809 21524
834B1524K997L121L087K929K718K521K369K248K163K138K205K366K600K886L206L546L877
$$ 21524 24521 27642 30729 33658 36376 38897 41266 43514 45677 47815 50020 52386 54986 57872 61078 64624 68501
832F8501M140M224M029L564K961K364J841J404J104J029J223J618K108K636L193L760M288
$$ 68501 72641 76865 80894 84458 87419 89783 91624 93028 94132 95161 96384 98002 100110 102746 105939 109699 113987
830A13987M715M963M916M467L635K598J569O51j38p21r52p64k66L32Q83J306J545J559J340
$$ 113987 118702 123665 128581 133048 136683 139281 140850 141501 141363 140642 139690 138926 138660 138992 139875 141181 142726 144285 145625
827A45625Q98K17p02j758k784l677m432n042n398n337m808l935k951k068j399r73p91q48j111
$$ 145625 146523 146740 146038 144280 141496 137819 133387 128345 122947 117610 112802 108867 105916 103848 102449 101476 100685 99837 98726
825I8726j518k021k596l198l741m154m425m552m466m105l522k887k355j968j732j677j822
$$ 98726 97208 95187 92591 89393 85652 81498 77073 72521 68055 63950 60428 57541 55186 53218 51486 49809 47987
823D7987k099k384k619k812k982l100l141l119l046k904k641k262j848j495j232j015q11o53
$$ 47987 45888 43504 40885 38073 35091 31991 28850 25731 22685 19781 17140 14878 13030 11535 10303 9288 8477 7824
821G824n68n17m36l27k62k67k80k48j93j70j79j78j64j68j85j77j32q6q7j28j54j30p6m2n5
$$ 7824 7256 6739 6303 5976 5714 5447 5167 4919 4726 4556 4377 4199 4035 3867 3682 3505 3373 3287 3200 3072 2918 2788 2712 2670 2615
818B615r0j12j15j15j03o2j3j2o9j13r3m0k2m1m9l8l7n2n3l1k5m2m5j5Pj1m9o3m8k5nQNj5
$$ 2615 2525 2413 2298 2183 2080 2018 2005 1993 1924 1811 1718 1678 1656 1615 1566 1528 1491 1439 1386 1355 1330 1288 1243 1228 1235 1224 1175 1112 1064 1039 1034 1042 1047 1032
813A032j6J5L3ln8n7pJ9j6n0k9QKl0k8OJ4k3m3j4J8km8n8k1K5M7M7J7l6p0m5J3L2Jk5nJ9L
$$ 1032 1016 1031 1064 1061 1003 946 939 958 942 892 863 871 873 843 815 821 835 812 769 755 773 771 723 665 644 669 716 763 780 744 674 629 642 674 675 650 645 664 667
809F67l3l9pK0J2k0m1l1PL9L9J5mj3l0m1j5L5N2J3l0k4MJk4k7nPJNRnk2qK0J3j9k3K1N2L0
$$ 667 634 595 588 608 620 600 559 528 535 574 613 628 624 611 581 540 525 560 612 625 595 571 575 576 552 525 520 527 528 533 542 537 515 507 527 540 521 498 519 571 601
804F01j1k5pJ4K9L3J5j9l7l1j4jJ5K5%n1o5j6M0N0K8K2K8Ql1m6k3QJ3j4o0r2p2kO4P4M7L2
$$ 601 590 565 558 572 601 634 649 630 593 562 548 547 562 587 587 536 471 455 495 545 573 595 623 631 600 554 531 539 552 538 478 386 314 312 376 450 497 529
799E29K7Kl2l3lLl6o8m2K0N9N1J9kqj0j1oQK3K1Kj9k0j0rj6j1LQMMRJk0k6rPkk7l8k2KJ4Q
$$ 529 556 558 526 493 490 493 457 389 347 367 426 477 496 494 486 476 465 459 467 490 511 513 494 474 464 455 439 428 431 439 443 447 456 457 437 411 402 409 407 380 342 320 322 336 344
794C44jRK7L0Mk8l9k7j4jJ5K5J6QK5M5K6k2l9j0Pj4l3pK4Ql0k5J6K7rl6rL6N2L8K1%k8m6k7
$$ 344 343 352 379 409 413 385 346 319 305 304 319 344 360 368 393 438 464 442 403 393 400 386 353 346 370 378 348 323 339 366 357 321 312 348 400 438 459 459 431 385 358
789C58J3L8L7K5J1pj9oK0K3kl3l5j7LJ6K0J0j3l6m3l8k6j0J6L8L5Pk3k6mK5L9K3j0l5l1j2
$$ 358 371 409 446 471 482 475 456 450 470 493 491 458 423 406 409 425 445 455 442 406 363 325 299 289 305 343 378 385 362 336 332 357 396 419 409 374 343 331
784C31JRK3L4K5JmROk5m3j9Qnl4j9L2N7K1k3k2J0K4J2MJ9L4K0j6m7n2l1qkpj0KK7M4L2rm8
$$ 331 332 341 364 398 423 424 420 429 435 410 367 348 356 351 317 298 330 387 408 385 363 373 397 409 413 432 466 486 470 423 371 340 332 330 323 313 315 342 386 418 409 361
779C61n2j5K9N0N8N4K4l7q1o6j3J5PQL3M5K1nnJj2k1lK5K9Qj5m0o3n8rM6N1J3j2jJ7K4L0L6
$$ 361 309 294 323 373 431 485 509 472 391 325 312 327 334 342 375 420 441 436 431 432 420 399 396 421 450 458 443 403 340 282 273 319 370 383 371 370 387 411 441 477
774D77K2j3l3j9LJj9k6j7rj1j7j9qJ8M6N0J8j6j6J0K5Pk1l1k2rQK9L7J4k4l2ON1O7N1L3K0
$$ 477 499 486 453 434 437 438 419 393 376 367 356 339 320 312 330 376 426 444 428 412 422 447 454 433 402 380 371 379 408 445 459 435 403 409 460 527 578 611 631
769F31OpkJ4J6OJ0K7K6JnK8O3N7K6J2Nk1m7l6KK1J0J2M6O9M5OlJ1J5QJ5L1K7JrJ7M9M4J3o
$$ 631 637 630 628 642 658 664 674 701 727 728 723 751 814 871 897 909 914 893 846 810 812 833 843 855 901 970 1015 1021 1018 1029 1044 1052 1067 1098 1125 1126 1117 1134 1183 1227 1240 1234
764A234KLj5k8oK9L1j1n4o6n1l5k3j9k9m4l1J2M3K7j0k1kPj2l9m7m0l2l3l8l0jK5J2k7l2J4
$$ 1234 1236 1239 1224 1196 1190 1219 1250 1239 1185 1119 1068 1033 1010 991 962 918 887 899 942 969 959 938 936 943 931 892 845 805 773 740 702 672 671 696 708 681 649 663
759F63L6j9r4j00m5j5k9k5QJ6j8k0K9N6J3l6j7L1K6j1j3J8J5k9m9k2ROroNJ2R%j7k3pJ3J3
$$ 663 699 680 586 486 441 426 397 372 380 396 378 358 387 443 456 420 403 434 460 449 436 454 469 440 391 369 378 384 375 369 374 386 395 395 378 355 348 361 374
755C74OJ1J3j2l7k1J1Ll9m0K2P2N3Kj6ook1j5PJ5MkLJj4k4k0j2qpn%RK2L3L0J7kj6k1j6lR
$$ 374 380 391 404 392 355 334 345 348 309 269 291 363 416 418 402 396 390 369 354 361 376 380 378 381 382 368 344 324 312 304 297 292 292 301 323 356 386 403 401 385 364 348 345 354
749C54Oj5l9m2j5J7K9K7L8O5O7J5m9o7l4LRlj2j7j8p%j2k8j4K9M4J1k5j6J9K9J4J2K5K0rk5
$$ 354 360 345 306 264 249 266 295 322 360 425 492 507 458 391 357 360 369 366 354 337 319 312 312 300 272 258 287 331 342 317 301 320 349 363 375 400 420 411 386
744C86pJ7Pl6o7n0KM6M6K0JJJj0j5j0j0j7rJ8K7jk5qK4J9j5j9J7M6K7j4l2k7j5LK0K2Kj8j8
$$ 386 379 396 403 367 300 250 252 298 344 364 365 366 367 357 342 332 322 305 296 314 341 340 315 307 331 350 335 316 333 379 406 392 360 333 318 321 341 363 365 347 329
739C29j4j7j4J4M1K3k4m1mL3J9k3l2ML1Om0m7rL4M5K7kk7l3j7PJ7J7K3L1J4j8k6JK1%l5l5
$$ 329 315 298 284 298 339 362 338 297 293 326 345 322 290 294 325 331 291 244 235 269 314 341 339 312 279 262 269 286 303 326 357 371 353 327 328 349 349 314 279
735B79kJ9J4QK2L9L3Mk3l3k7j6qJ0M0O7O2K3j9l9m2l8k3JJ8J9J9K7J9j4l9k4Kjj4mJ8J0j7
$$ 279 277 296 310 318 340 379 412 416 393 360 333 317 309 319 359 426 488 511 492 453 411 373 350 351 369 388 407 434 453 439 400 376 378 377 363 359 377 387 370
730C70j7RPl0m7j6J3Q%J7L4J2k6l5j2J7L4L8J5k7n0k7PJ8J9L3L3ml4oM1L8j8m5j7J5Jk3k0
$$ 370 353 362 369 339 292 276 289 297 297 314 348 360 334 299 287 304 338 376 391 364 314 287 294 312 331 364 397 393 359 353 394 432 414 369 352 367 368 345 325
725C25LJ0lk1l3l7j5K1K9jk6rL2N1L5Pj6l2l7l1k6k6k2QM5N9M0J3pk0l0k2RL7L3Oj8k4k4k6
$$ 325 328 338 335 314 281 244 229 250 279 278 252 243 275 326 361 368 352 320 283 252 226 200 178 186 231 290 330 343 336 316 286 264 273 310 343 349 331 307 283 257
720B57j8J4M2L9J0nJ0K3J3kRK6K1pk2k0j7j1J3L9L3lk0%J5qm2l9j2mk0k2JK5K7K3K4J7j4n3
$$ 257 239 253 295 334 344 339 349 372 385 383 392 418 439 432 410 390 373 362 375 414 447 444 424 424 439 431 389 350 338 334 314 292 293 318 345 368 392 409 395 342
715C42o3j8N0P5K6n0p0k3K5K6J3L1N5L6j3k2K1M9J7l7n9m0j4JJ0J0mk0k8k2oRJ1j5n5o8l2
$$ 342 279 261 311 386 412 362 292 269 294 320 333 364 419 455 442 420 441 490 507 470 411 371 357 358 368 378 374 354 326 304 298 307 318 303 248 180 148
711A48K8O9P7N7J9k0l6k5j1j2j2KJ4%j4QM9N4Ol9m0j1QJ6L4L9J1l3m2nK5J6qpJ2K0Qjlj4l4
$$ 148 176 245 322 379 398 378 342 317 306 294 282 284 298 298 284 292 341 395 401 362 322 311 319 335 369 408 419 386 344 339 364 380 372 365 377 397 405 404 401 387 353
706C53l8j6PNmLJ5Oj7k5pLj5l2j9J7L8L0J2QJ2J1kj8k5j6J0L7M5K1k3n1m2mK5K1NMJ7K0J2
$$ 353 315 299 306 311 307 310 325 331 314 289 282 285 270 238 219 236 274 304 316 324 336 347 345 327 302 286 296 333 378 399 376 325 283 279 304 325 330 334 351 371 383
701C83K0L8L0j3m9l3MJ0j2k4j2LJ1K6L4J2l0m0j5ml2n7l5J2L1K3K3K9J9jkJ2J2oj3nj0l8m3
$$ 383 403 441 471 458 409 376 380 390 378 354 342 345 356 382 416 428 398 358 343 339 307 250 215 227 258 281 304 333 352 351 349 361 373 367 354 349 339 301 258
696B58MN3M2j9n8l4J2K4%k0j7nMJ4J9Mj9j7K2N5L7j1l6k7k3k9j8K0M1K6J0K0K7lm0l4QL6L9
$$ 258 262 315 357 338 280 246 258 282 282 262 245 240 244 258 277 281 262 245 267 322 359 348 312 285 262 233 215 235 276 302 312 332 359 356 316 282 290 326 365
691C65K9J1k8n9l9J5L1j0m9l2J2L3K8K4K4J5kj1j3qjJrk3j4J2J8nk2j5jpj2MK0J0kJ5M2L2
$$ 365 394 405 377 318 279 294 325 315 266 234 246 279 307 331 355 370 368 357 344 336 335 336 327 304 290 302 320 315 293 278 277 270 258 262 282 292 290 305 347 379
686C79ql4l5l5l8k0J7L3Qk1j4K1M1K5j8n7n9k0K6L9K7K5L8L4Nj1KJ4kk1rJ9K9K1J4J2%j9k0
$$ 379 371 337 302 267 229 209 226 259 267 246 232 253 294 319 301 244 185 165 191 230 257 282 320 354 359 348 350 364 362 341 332 351 380 401 415 427 427 408 388
682C88rknk%j1k7k2KOk1m0j6K4K8mk2KM6O0L8Jj9k0qjmj9l0j8J3L0J7j0j8jK3L4K8Rj7l6l6
$$ 388 379 377 372 370 370 359 332 310 312 318 297 257 241 265 293 289 267 269 315 375 413 414 395 375 367 366 362 343 313 295 308 338 355 345 327 326 349 383 411 420 403 367 331
676C31k3j9l1l9k4PL4N4O1N0J9j0j1NJ0j1l6l2oJ4Rj5l1k4MK8K6Mj4j3moj5j6lMnj4oJ1J1
$$ 331 308 289 258 219 195 202 236 290 351 401 420 410 399 404 414 403 367 335 329 343 352 337 306 282 286 314 340 344 330 317 313 307 292 276 273 277 272 258 252 263 274
671B74lj0ljj3k5j4J1K3J3lnJ7M6N6K3k6l7NM0J2m9o5j6L4L8J7PPOPPj2n4p3l5K8N3L4Lj9
$$ 274 271 261 258 257 244 219 205 216 239 252 249 244 261 307 363 386 360 323 328 368 380 331 266 250 284 322 339 346 353 359 366 373 361 307 234 199 227 280 314 317 298
666B98l9m5k0J9L2J1pnKJPK0J7%JK2K1k0m7j7L2K8j7l2PL8K1j2pK1K2oj6LJ9MrkPj1l6l6j2
$$ 298 259 214 194 213 245 256 249 244 246 247 254 274 291 291 292 314 335 315 268 251 283 311 294 262 269 307 328 316 309 330 352 346 330 333 352 356 347 345 352 341 305 269 257
661B57LLOJ5RJK2O7P0J0n3o0l6l8n7l4K5N1K3j4j5jm%L6P9P3J7l6n5m7l8k7nK4M1K8pl1k0
$$ 257 260 263 269 284 293 294 316 383 453 463 410 350 314 276 219 185 210 261 284 270 255 254 250 250 286 365 438 455 419 364 317 279 252 247 271 312 340 333 302 282
656B82J6M0K9Mj4k2k1j4rj9l1j3L9P2M9NrQNl0n4l2J3M0L3Ok2l3j4J7K3j0m4l6ML3K2mj0O
$$ 282 298 338 367 371 357 335 314 300 291 272 241 228 267 339 388 393 384 392 397 367 313 281 294 334 367 373 351 318 304 321 344 334 290 254 258 291 313 309 299 305
651C05K0J5MJ0K3J7rk7j1J9K5Oj0j5k4l8k9J4M8K9k1m6k4LKqKK5K3Lq%%k2l6pM1N8L6J6K9
$$ 305 325 340 344 354 377 394 385 358 347 366 391 397 387 372 348 310 281 295 343 372 351 305 281 284 286 278 280 305 328 331 323 323 323 301 265 258 299 357 393 409 438
646D38L7Ln7p4l2J6Rk1qN2Q2L8k8l8%J1k8n5k8J0Jl5l0J4L5Qj5J0N3N7J4l3m3j7J2K0Prk1
$$ 438 475 478 421 347 315 331 340 319 311 363 445 483 455 417 417 428 400 345 317 327 328 293 263 277 312 320 305 315 368 425 439 406 363 346 358 378 385 376 355
641C55k6k0LK8J8k2m3j8J2om1k5L4N4J1k4JL7K2k2l7k0%K3N4O1J6l1j3M7O2Qm8n6l7l0l4k4
$$ 355 329 309 312 340 358 336 293 275 287 281 240 215 249 303 314 290 291 328 350 328 291 271 271 294 348 409 425 394 381 428 490 498 450 394 357 327 293 269
637B69p%koKL4P8Q6K9m6n8%N0M1Oqj5l8n4l5jPqj1QK0J3%jMRPjplMol4n5m1lK8L5L0K2J4j
$$ 269 262 262 260 254 256 290 368 454 483 437 379 379 429 470 476 468 453 415 361 326 325 332 324 313 321 341 354 354 353 357 366 373 372 365 362 366 360 326 271 230 227 255 290 320 342 356 355
631C55j6k4j4J1K6J3qj0QJ7jk2l0k6k7k6k0oJ7M9O2L3j8m0j8QJ3J9L2K4j3l7j7J0jl4l5lK4
$$ 355 339 315 301 312 338 351 343 333 341 358 357 335 305 279 252 226 206 200 217 266 328 361 343 303 285 293 306 325 357 381 368 331 314 324 323 289 254 251 275
626B75K5jm4q2o2K4J03R1J8j6J8N2K8k2m1k6pkk%%qk7m0k0K8N3K1j8oL2L3ok2OK0qk7ON6N8
$$ 275 300 299 255 173 111 135 238 329 347 331 349 401 429 407 366 340 333 331 329 329 329 321 294 254 234 262 315 336 318 312 344 377 371 349 355 375 367 340 346 402 460
621D60J0l7m8k5J3L4J2m1p1m7oJ7K4L9M7K7j1k9j9JJ8L1L6K1j3m6n4k6K7N4K7l0m9j4K2J1
$$ 460 470 433 385 360 373 407 419 378 307 260 254 271 295 334 381 408 397 368 349 350 368 399 435 456 443 397 343 317 344 398 425 395 346 332 354 365
617C65j5j2J5K6J3kqj6k4k8k5j7%K3K6MrLJ0j7m6k1M3O7J9m7n3%M7K9l7p1k7N0P0J8k8j2K5
$$ 365 350 338 353 379 392 390 382 366 342 314 289 272 272 295 321 325 316 319 329 312 266 245 288 355 374 327 274 274 321 350 313 242 215 265 335 353 325 313 338
612C38K4JJ2M4L7j7n9n2k1nj%oj4j7j5j5rJ4L3K6OkRJ0JjLMQK6L6Ql2l7j8k1m0k6K5N2L6K8
$$ 338 362 363 375 419 456 439 380 328 307 302 301 301 295 281 264 249 234 225 239 272 298 304 302 311 321 322 321 324 328 336 362 398 406 374 337 319 298 258 232 257 309 345 373
607C73M4L1k8o6k9J9Lm2l3J7L3%j5J8M6K0k7l9j2J6J6LjMkk8m9l5J2M5L4ll2l6k0J1L5K7k
$$ 373 417 448 420 354 325 344 347 305 272 289 322 322 307 325 371 391 364 325 313 329 345 348 347 351 349 321 272 237 249 294 328 325 293 257 237 248 283 310 308
602C08j0J5M1L7K2K0J3rk3mJ4NKL3N3Lp7r1l0J4rl8pN3P0K8l1o5n7pN4P5L9j4l5k9j6lJ7L9
$$ 308 298 313 354 391 413 433 446 437 414 410 424 429 431 464 517 520 443 352 322 336 327 289 282 335 405 433 402 337 280 273 327 402 441 427 392 363 347 344 361 400
597D00M7L6J2j5k7j1J5K1P%Nol7n4l1LJ9J9J2j2m6m9pL3K2j6k3PK8J3j8l5k8jK9L8J1k7l9
$$ 400 447 483 495 480 453 442 457 478 485 485 490 484 447 393 362 365 384 403 415 403 357 308 301 334 356 340 317 324 352 365 347 312 284 283 312 350 361 334 295
592B95j7PJ9K0J8J0LJpj9j8OK3Lk9k4J1K8J1%RRj4k1QL4J5k4k8JJ8Rqj9k9l3j2J8J7k0l7%
$$ 295 278 285 304 324 342 352 355 356 349 330 312 318 341 344 315 291 302 330 341 341 350 359 345 324 332 366 381 357 329 330 348 357 349 330 301 268 256 274 291 271 234 234
587B34M7M2kk7pJ7Rp%K5L0J2kNJ3J3J1J3Kk4l5j3J2Kl1l6kK5J7qk1k5l4l4pK0J8koJ0J9J5
$$ 234 281 323 321 294 287 304 313 306 306 331 361 373 371 376 389 402 413 426 428 404 369 356 368 370 339 303 301 326 343 335 314 289 255 221 214 234 252 250 244 254 273 288
582B88J8L4L6J3qmJ7K2Oj4k4k1nJ6K1ml3l8j7%JnlKLkj4l5m9l5OL3K4lj0QK7K8J8J3J3Qmj1
$$ 288 306 340 376 389 381 377 394 416 422 408 384 363 358 374 395 391 358 320 303 303 304 299 296 298 301 299 285 250 201 166 172 205 229 226 216 224 251 279 297 310 323 331 327 316
577C16KK5K6j1n5m9OM8L3oj3PJ5mj0J0K5Rj8k7j8j3oQK3K1Lj7k4k4j4mNQJ4J6Kj9j9J1L9M0
$$ 316 318 343 369 358 303 254 260 308 341 335 322 329 344 340 330 340 365 374 356 329 311 298 292 300 323 344 347 330 306 282 268 264 269 277 291 307 309 290 271 282 321 361
572C61K8K7L2J5k0l7j9J4L0J7j0k7k3pok3k8oJ7J4jkLj0k5j1J8K1mqK4M5K2rqJ8L4L2J9rn0
$$ 361 389 416 448 463 443 406 387 401 431 448 438 411 388 381 375 352 324 318 335 349 348 346 349 339 314 303 321 342 338 330 354 399 421 412 404 422 456 488 507 498 448
567D48p3n1qJ7J5PPPQJ9J7j5n6n4jN2N1Rk4k2nmk1k0J3M7L6rk8jL2K7LOL2M2J9oj6j8j8%L0
$$ 448 375 324 316 333 348 355 362 369 377 396 413 398 342 288 287 339 390 399 375 353 348 344 323 303 316 363 399 390 362 361 393 420 423 429 461 503 522 516 500 482 464 464 494
561D94M0Nm8p2m9kK3Ol2m5j1M4O9N0J1j5k3k1k2k9l2j4K5M9K6l3o7m3J9N8M7jm1l8oJ8J7Q
$$ 494 534 539 491 419 370 368 391 397 365 320 309 353 422 472 483 468 445 424 402 373 341 327 352 401 427 394 327 284 303 361 408 407 366 328 322 340 357 365
557C65RNj6k5%K5Km6m5J3N8M8K2K7L7J7qnQJj4pJj5l1nM2M8Ok6k1rk0l3l1k0mK1L6J3k7l1
$$ 365 374 379 363 338 338 363 365 319 274 287 345 393 415 442 479 496 488 483 491 492 478 471 472 457 426 421 463 511 517 491 470 461 441 408 377 357 353 374 410 423 396 365
552C65RL4Pl4l1J4N4O4N1J6l0n9m5nK4K7J5Jrj1j5l1n1l8J5O2N7J4j9j7nNJ5J5j5n2m8JM1
$$ 365 374 408 415 381 350 364 418 482 533 549 519 460 415 410 434 461 476 477 468 457 442 411 360 322 337 399 456 470 451 434 429 434 449 464 449 397 349 350 391
547C91K9rj7J3L8K8jj6pJmk3l0j1K0L5J7k0l8k1J7L2J2k0k9rJ7L2L9M8M4J3l8p6p3l0K1M0
$$ 391 420 411 394 407 445 473 472 456 449 450 446 423 393 382 402 437 454 434 396 375 392 424 436 416 387 378 395 427 466 514 558 571 533 457 384 354 375 415
542D15K1qj5mONRJ6J0j1j8LK3J0k3m2l0J1N8P8L9l4o8k5L5K9k8n9l0K1M1K9%l3m7k1J9K1q
$$ 415 436 428 413 409 415 420 429 445 455 444 426 429 452 462 439 397 367 378 436 514 553 519 451 426 461 490 462 403 373 394 435 464 464 431 384 363 382 403 395
537C95j2J9L4Lk6j7NNNL4N3K6k1l2j1qj7lK4K3kmK1K3j3m3l8k2j1J4N2O1K3j9k5j7k8l9k0
$$ 395 383 402 436 439 413 396 401 406 411 445 498 524 503 471 460 452 435 432 456 479 477 473 494 517 504 461 423 401 390 404 456 517 540 521 496 479 451 412 392
533C92J7L8M9O1N1%m9m6pPqj4MQm%K5L1Lj4J4N0M9J7qk0l2l2MM1L0k0l4J5P2O0on0k3L1N0
$$ 392 409 447 496 557 608 608 559 513 506 513 505 491 495 503 499 499 524 555 558 544 558 608 657 674 666 646 614 582 586 627 657 637 603 618 690 750 744 694 671 702 752
528G52K2j1oK3M1L7K8K5J7pk5j3J6L1K5K4L9M1Rk2j0L7N9L4lqJ2L0L7L8K8J3J5M6P2O0K5J7
$$ 752 774 763 757 780 821 858 886 911 928 921 896 883 899 930 955 979 1018 1059 1068 1046 1036 1073 1132 1166 1163 1155 1167 1197 1234 1272 1300 1313 1328 1374 1446 1506 1531 1548
523A548L9M1qn8n6j3J2kk6l1k9m1n8n7l7k5l5n0m5l1l6n8o3l4kkk4k9k3l1m6l0J0K5KrK0M8
$$ 1548 1587 1628 1620 1562 1506 1493 1505 1503 1477 1446 1417 1376 1318 1261 1224 1199 1164 1114 1069 1038 1002 944 881 847 845 843 819 790 767 736 690 660 670 695 697 688 708 756
518G56K6j8l0j0J0J7K7K1rk6MN7O9M4L0M3N2N0N7N8J9l0j8M6O6J1l3LM6J3n8p4l5k4n6p4n9
$$ 756 782 764 734 724 734 751 778 799 790 764 768 825 894 938 968 1011 1063 1113 1170 1228 1247 1217 1199 1245 1311 1322 1289 1292 1338 1351 1293 1219 1184 1160 1104 1030 971
514I71m7n6m7j4kk9n4n0l8l5k8JK9L0J5jj6l8m7k4QK3J6NOJ6K2J3kJK3K7nl0JN8O7J9j9j4
$$ 971 924 868 821 807 805 776 722 672 634 599 571 572 601 631 646 645 629 591 544 520 528 551 567 572 578 594 616 629 627 628 651 678 673 643 644 702 769 788 769 755
509G55lq%L7M9%n0l2K1K7j7l9j0J0j6m4l1KPk6n7o6n4l5j8j8k9k8lK6K7RLJ8L7L4J4j5l9m8
$$ 755 752 744 744 781 830 830 780 748 769 796 779 740 730 740 724 680 649 651 658 632 575 509 455 420 402 384 355 327 324 350 377 386 389 407 444 478 492 477 438 390
504C90k8J9N9N5J0k9l0j0nk3l2j8OJ9J4J%J2K0Lk7l4KL7K9knJ6J1k2l3jK9K1lj3j8k9k0J7
$$ 390 362 381 440 495 505 476 446 436 431 408 376 358 364 383 397 398 398 410 430 433 406 372 374 411 440 438 433 449 460 438 405 404 433 454 451 438 420 391 371 388
499C88L8J1k0pK4J4k3k8J2M2K6j3l9m4j9K8N2J7m3n1mL5L4L4M8L2k6n6j4L8J8n0p5l2K5M9
$$ 388 426 437 417 410 434 448 425 397 409 451 477 464 425 381 362 390 442 459 416 365 361 396 430 464 512 544 518 462 448 486 504 454 379 347 372 421
495D21L8Pl0m3j1M0O3N0L0J8%l1m8l5jK8L4Pl4n7m1pPpk1k4j0J1K8J2k8m1JM9L5k0l6KK7%
$$ 421 459 466 436 393 382 422 485 535 565 583 583 552 504 469 468 496 530 537 503 446 405 398 405 398 377 353 343 354 382 394 366 325 326 375 410 390 354 356 383 383
490C83k5ON6N9J7j7j9j2j4j3JK0L4L8K3nj8LK6J0l6n7l1QJ6Krj2pJ2M9P8O3J0m5o9o3l2LK1
$$ 383 358 364 420 479 496 479 460 448 434 421 422 442 476 514 537 532 514 517 543 553 517 460 429 437 453 455 446 434 427 439 488 566 629 639 594 525 462 430 433 454
485D54J2KJ7M1K5l5p2l6K8N0K3NJ9L2J7ooPJ2lk7l9k0K3N2L4lrJ3Pl7n9j8K5Rl6l1J9M2J6
$$ 454 466 468 485 526 551 516 444 408 436 486 509 514 533 565 582 576 570 577 589 586 559 520 500 523 575 609 606 597 610 617 580 521 503 528 537 501 470 489 531 547
480E47j3kJ9J5pk8l4j4L0O1M2ql1j5mj3mL5N4K4j3pK1L3K8K6J0m2r1p3MO3O8L8J1qj9j1J4
$$ 547 534 532 551 566 559 531 497 483 513 574 616 608 577 562 558 545 541 576 630 654 641 634 655 688 716 742 752 710 619 546 550 613 681 719 730 722 703 692 706
475G06K5J3pk0k0qJ9M6M9K0j4k9j9QM0N7M6J5olJ0J3NljJ5J9j1n4n2RO6M6k8o2k5K2K1MK1
$$ 706 731 744 737 717 697 689 708 754 803 823 809 780 761 769 809 866 912 927 921 918 928 941 946 943 942 957 976 965 911 859 868 934 980 952 890 865 887 908 912 933
470I33O2O8K0l5n0j7L0N3L5ONL8O4N1J7JJ3L0M0M7N0M4L7M1M3L6L0M5O2M7J1NM6Q8Q4O8R1
$$ 933 995 1063 1083 1048 998 981 1011 1064 1099 1105 1110 1148 1212 1263 1280 1281 1294 1324 1364 1411 1461 1505 1542 1583 1626 1662 1692 1737 1799 1846 1857 1862 1908 1996 2080 2148 2239
466B239J43J56J11P0Q7J33J48J27J33J91K54K70K54K64L27M18M98N50O04O98Q50J034J212
$$ 2239 2382 2538 2649 2719 2806 2939 3087 3214 3347 3538 3792 4062 4316 4580 4907 5325 5823 6373 6977 7675 8525 9559 10771
463A0771J400J657K006K410K827L266L750M221M553M664M570M336M011L620L196K774K380
$$ 10771 12171 13828 15834 18244 21071 24337 28087 32308 36861 41525 46095 50431 54442 58062 61258 64032 66412
461F6412K030J721J422J061O00N7n34j166j849k534l141l626m015m333m545m592m468m221
$$ 66412 68442 70163 71585 72646 73246 73303 72769 71603 69754 67220 64079 60453 56438 52105 47560 42968 38500 34279
459C4279l890l463k942k394j913j536j223r31o76m76k99j10P3K00K95M39O79R65J228J469
$$ 34279 30389 26926 23984 21590 19677 18141 16918 15987 15311 14835 14536 14426 14499 14699 14994 15433 16112 17077 18305 19774
456A9774J737K063K468K980L629M416N313O293P280Q142Q733Q972Q860Q446P804P040O252
$$ 19774 21511 23574 26042 29022 32651 37067 42380 48673 55953 64095 72828 81800 90660 99106 106910 113950 120202
454A20202N476M709L965L273K611J902J074R2j057k366l768n139o360p383q194q777r126r249
$$ 120202 125678 130387 134352 137625 140236 142138 143212 143304 142247 139881 136113 130974 124614 117231 109037 100260 91134 81885
452H1885r131q722q022p137o208n302m425l610k934k419j997j598j238r74q04o60m90l11j53
$$ 81885 72754 64032 56010 48873 42665 37363 32938 29328 26394 23975 21978 20380 19142 18168 17364 16704 16214 15903 15750
450A5750j0J38K98M70O70R22J219J546J909K337K833L346L792M108M268M262M098L812L452
$$ 15750 15740 15878 16176 16646 17316 18238 19457 21003 22912 25249 28082 31428 35220 39328 43596 47858 51956 55768 59220
447E9220L062K658K249J850J487J173Q79N31N9n43j200j843k451l046l619m100m425m591m638
$$ 59220 62282 64940 67189 69039 70526 71699 72578 73109 73168 72625 71425 69582 67131 64085 60466 56366 51941 47350 42712
445D2712m593m440m142l709l216k756k359j998j651j355j142r79q10o38n24m81m53m02l58
$$ 42712 38119 33679 29537 25828 22612 19856 17497 15499 13848 12493 11351 10372 9562 8924 8400 7919 7466 7064 6706
443F706l54l56l16k51k03j74j31q9r9j45j60j18o9p0r2r0o2m3m2n2p4j00r9n9j6j1l6n9p2
$$ 6706 6352 5996 5680 5429 5226 5052 4921 4832 4733 4588 4428 4310 4241 4171 4079 3989 3927 3884 3842 3790 3716 3616 3517 3458 3442 3431 3395 3336 3264
439C264r7j10p8j7J6ml7n9p3p5m8j2j4n4o7k0K9J4l8o4o5q2j05r3m6k0k7k6NL1K2nl2n2n7
$$ 3264 3167 3057 2979 2962 2978 2974 2937 2878 2805 2730 2682 2670 2656 2602 2535 2515 2544 2558 2520 2456 2391 2309 2204 2111 2065 2045 2018 1992 1997 2028 2050 2045 2013 1961 1904
435A904k9J6M3M2M4N1M1RnJj0m3n6k8lroL4N4Lo5o3kK5rm4m6m3n8o6m7k2j4j7k6l8m4l3k1
$$ 1904 1875 1891 1934 1976 2020 2071 2112 2121 2116 2117 2107 2064 2008 1980 1977 1968 1962 1996 2050 2053 1988 1925 1923 1948 1939 1895 1849 1806 1748 1682 1635 1613 1599 1582 1556 1518 1474 1441 1420
430A420l4n3l9rk0o8q0j7N7P2L1j2k8k1JJ4om3n5k5J1L3M5M5Rm5o4l8k5n0n1NN5K5l2k8K3
$$ 1420 1386 1333 1294 1285 1265 1197 1117 1100 1157 1229 1260 1248 1220 1199 1200 1214 1208 1165 1110 1085 1096 1129 1174 1219 1228 1183 1119 1081 1056 1006 955 960 1015 1040 1008 980 1003
426A003L4pk3MJ5k3n7m5j5oj3j6k0k5j6nk3n5n1mK3kl4k6pj7l4j0L4M5K5K1M3M9K1j0k0k1
$$ 1003 1037 1030 1007 1011 1026 1003 946 901 886 880 867 851 831 806 790 785 762 707 656 652 675 673 639 613 606 589 555 545 579 624 649 670 713 762 783 773 753 732
421G32k3k5k2k3j7OK4J3j2kL8M5pn7l8K0L3j7n2k4K1K4KOK7Rm8p2k5L2K9ppL0L6rn1l7J0M0
$$ 732 709 684 662 639 622 628 652 665 653 651 689 734 727 670 632 652 685 668 616 592 613 637 639 645 672 681 633 561 536 568 597 590 583 613 649 640 589 552 562 602
416F02L5J9Qlj3j3%J7K0pn6q4n6J0N7N1K8K1K7J4j4k9k3oJ4L0K7%k8k4LJ1j4l5k6%Oj9m3m0
$$ 602 637 656 664 661 648 635 635 652 672 665 609 525 469 479 536 587 615 636 663 677 663 634 611 605 619 649 676 676 648 624 627 638 624 589 563 563 569 550 507 467
411D67rJ8J9J1J6K7K1ok0pR%j4oJ2Kl2m5k2PJ0JJNNJ0K3K5Nj4RN7O4Oo7q8m7jJ1OJ5K9K0j2
$$ 467 458 476 495 506 522 549 570 564 544 537 546 546 532 526 538 540 508 463 441 448 458 459 460 465 470 480 503 528 533 519 528 585 649 655 588 500 453 452 463 469 484 513 533 521
406E21l8l5j2J5L9N1L9km7o0k9K0M2J3l8n5j0N0O4K6mNJ4mj9mPk7p6o5JL8Nm1l4J7M8M1K4
$$ 521 483 448 436 451 490 541 580 578 531 471 442 462 504 517 479 424 414 464 528 554 550 555 569 565 546 542 549 522 446 381 382 420 425 384 350 367 415 456 480
401D80K1J9J2Krj9j9mK2L8L8K7J4jj2j9j8j2%K3N2O8M9J3rOL5L3%j6OK9J1k3k0J3K5j4n0l9
$$ 480 501 520 532 534 525 506 487 483 505 543 581 608 622 621 609 590 572 560 560 583 635 703 752 765 756 762 797 830 830 814 820 849 860 837 817 830 855 841 791 752
396G52mNj7l9m3m4n5o5n6j7L4O1M2pl3k0lqj6KK6J7q%L7M1j5o8m6L0Q0O0J9J9N7Q6P3M3M1
$$ 752 748 753 736 697 654 610 555 490 434 417 451 512 554 547 514 494 491 483 467 469 495 512 504 504 541 582 567 499 453 483 563 623 642 661 718 804 877 920 961
391I61O9Q9O5J1l1l3kL5M9L2mk8k5o%j4l3m4m5m6n3o6q2q9o9l1mqk7k8pPrl8m4qM1O1M3Rj3
$$ 961 1030 1119 1184 1195 1164 1131 1129 1164 1213 1245 1241 1213 1188 1182 1182 1168 1135 1091 1046 1000 947 881 799 710 641 610 606 598 571 543 536 543 534 496 452 444 485 546 589 598 585
386E85k8m5m7j7K3K8j0m0j6L6O1M4K4L4M6L3OOL2M7L5J6J7K1J1rk0k4k8k0MK0nn4q1o2l0k0
$$ 585 557 512 465 448 471 499 489 449 433 469 530 574 598 632 678 711 717 723 755 802 837 853 870 891 902 893 873 849 821 801 805 825 820 766 685 623 593 573
382E73k6l7n5p4o4rN0O0L6K4K8Rl3m2J1O1L8k9n6j4K6J2l0m0qK0K0J2J8L3K8mm6o6m3J1N2
$$ 573 547 510 455 381 317 308 358 418 454 478 506 515 482 440 451 512 550 521 465 451 477 489 459 419 411 431 451 463 481 514 542 538 492 426 383 394 446
377D46M5Nk6k6j5j2j0KJ2Kj2jJ7J0k8n1l1J1M2N0L8J0k7l6nL1L1KnK7N3L4k2o0m3J1M7K9j3
$$ 446 491 496 470 444 429 417 407 409 421 423 411 410 427 437 409 358 327 338 380 430 468 478 451 415 410 441 472 474 469 496 549 583 561 501 458 469 516 545 532
372E32l4k5k7m9m7LN8N5Nk8j7NOJPJ4Nj0j5j6j5jL4N8M8K0J0J1nm3o0l2J0K7J4%KOMPK7M6
$$ 532 498 473 446 397 350 353 411 466 471 443 426 431 437 438 445 459 464 454 439 423 408 407 441 499 547 567 577 588 583 540 480 448 458 485 499 499 501 507 511 518 545 591
367E91L2pl1k6j8k6k8kK3J0k7l5jL0K1kp%mj8j7mLMJ6L1L1J8J3J7Qk1l6rL1L4Jl2l1j8j8k2
$$ 591 623 616 585 559 541 515 487 485 508 518 491 456 455 485 506 504 497 497 493 475 458 454 457 461 477 508 539 557 570 587 595 574 538 529 560 594 595 563 532 514 496 474
362D74nK0K5Kj8rJ3K6K6K1Ro%L1N6L6rk7lJ2j1m2m2k2j0pQK7K2pl4l6k2nJ1J7J1kLL1N3L6
$$ 474 469 489 514 516 498 489 502 528 554 575 584 578 578 609 665 701 692 665 662 674 663 621 579 557 547 540 548 575 597 590 556 520 498 493 504 521 532 530 533 564 617 653
357F53j0m5l0J6L7J0l1l2%J3j0l6l0j1qj1OL1K5j8n2l8J6O0N7J2l2l0J3M7L6Jj1MJ3jj4j0
$$ 653 643 598 568 584 621 631 600 568 568 581 571 535 505 494 486 475 481 512 537 519 467 429 445 505 562 574 542 512 525 572 608 609 598 602 615 614 600 590
352E90%ok6l3k1MK5K8J6Llpj7k4j9j1rq%Lqj9qJ9K2ol1k2J5M4M5K8Qj4l6n1m5j2J8J2k0l4
$$ 590 590 584 558 525 504 508 533 561 577 580 577 570 553 529 510 499 490 482 482 485 477 458 450 469 491 485 454 432 447 491 536 564 572 558 522 471 426 414 432 444 424 390
347C90nK6J9nkJ8Mm0m7QO6O4K1%J0Rj9m5l2JJ7Jj6qJ7K0kj5J1L9K4k1l5lK6J5j5l5m7m4jO1
$$ 390 385 411 430 425 423 441 445 405 358 366 432 496 517 517 527 536 517 472 440 441 458 459 443 435 452 472 470 455 466 505 529 508 473 470 496 511 496 461 414 370 369 430
342D30P4J1n4m9J1M5K8mk2k3qK0L0on1n4k1mpJK1J3j6j9J8L6Jl9l2MK3J7J7K2J1rj8j4pKJ8
$$ 430 504 515 461 412 423 468 496 492 470 447 439 459 489 483 432 378 357 353 346 347 368 381 365 346 364 400 401 362 330 334 357 374 391 413 424 415 397 383 376 378 396
337C96K7Ql0n1l7oJ7J3j4l0mN0P0L1j7j9J2J4k0m7l4oJ0J5K3K2Qj0j8k1j3J3N3P2M7kl7l7
$$ 396 423 431 401 350 313 307 324 337 323 293 289 339 409 440 423 404 416 430 410 363 329 323 333 348 371 393 401 391 373 352 339 352 405 477 524 522 485 448
332D48j5Kkk2l6k8j0oj4j0Onm1m9QP6P3Ol5j1J8jl4k9J2L4K5J5J7J6Jj4j5mJ0K5L4K6Kk5m5
$$ 448 433 435 433 411 375 347 337 331 317 307 313 308 267 218 226 302 375 381 346 335 353 352 318 289 301 335 360 375 392 408 409 395 380 376 386 411 445 471 473 448 403
327D03n4m8k9j9k2j2L5Q0O4mm1j2K9J3l7n3j8K2L4J7rk7j9PJ9jj9%L2K8rk9j7moKK4L1RJL1
$$ 403 349 301 272 253 231 219 254 334 398 394 353 341 370 383 346 293 275 297 331 348 339 312 293 300 319 318 299 299 331 359 350 321 304 300 294 296 320 351 360 361 392
322C92N8L5k2n2l0J3L5K9Mj8j8%Poj9rJ1J2jp%kj5j8kJ6J7Ooj6k6l0k4rOPj0k8j9J8N3M8J2
$$ 392 450 485 463 411 381 394 429 458 462 444 426 426 433 427 408 399 410 422 421 414 414 412 397 379 377 393 410 416 410 394 368 338 314 305 311 318 308 280 261 279 332 380 392
317C92j5oJ8J8j6m8m5oL8M6J7j5k3pPNnoRL4L8Ol6m8k2jj3l2j3K7M3K6J1Rrm7o2j9M2N5J3
$$ 392 377 371 389 407 391 343 298 292 330 376 393 378 355 348 355 360 355 349 358 392 430 436 400 352 330 329 316 284 271 298 341 367 378 387 378 331 269 250 292 347 360
312C60k8k6NK8L0K2Mk9n7n2qL1L0RJ2L5L5%k5j0J8J2qkK0J0m3q6p6k8K5O0O9M7J0nK%k4l1
$$ 360 332 306 311 339 369 391 395 366 309 257 249 280 310 319 331 366 401 401 376 366 384 396 388 386 406 416 373 287 211 183 208 268 337 384 394 389 391 391 367 336
307C36KM4M7J2k4m0m2k5NK2Qj1ML8L6ql9j9K5L5Qj5j2pj9l5k9mK3L1K3J1K%KMpk9l7j4K3L1
$$ 336 338 382 429 441 417 377 335 310 315 337 345 334 338 376 412 404 365 346 371 406 414 399 387 380 361 326 297 293 316 347 370 381 383 383 385 389 382 353 316 302 325 356
302C56Nk1j4J4K9J0k3l8k4KPrk1nJ9J7rk6j5kqj2LK2K2J4J6K5K1J1Jj2l7m3j0K4J7k1k3K1
$$ 356 361 340 326 340 369 379 356 318 294 296 303 294 273 268 287 304 295 269 254 252 244 232 235 257 279 293 309 334 355 366 367 355 318 275 265 289 306 285 262 283
297B83N7L7j0l2k8j3RL7M9K6nmK0K2j2m3l6kJ1j6n2m8%M0L0pj5J1K9J5kOJ4nk8k3mloJ6N2
$$ 283 340 377 367 335 307 294 303 340 389 415 410 406 426 448 436 393 357 355 366 350 298 250 250 290 320 313 298 309 338 353 351 357 371 366 338 315 311 308 302 318 370
292C70M5nm0k9j0j3j0J9L7J1l0k7J3L4J2k0k9k7l1k8j0J1J5J3K4L7L2J7Pkk9n6n2j2K2J3k0
$$ 370 415 410 370 341 331 318 308 327 364 375 345 318 331 365 377 357 328 301 270 242 232 243 258 271 295 332 364 381 388 386 357 301 249 237 259 272 252
288B52l7k2KJ8K8K8J4qk0rQJ5J2ONRJ3J2NlKJ4J4Krj0j0j6pJ8K7jl8l1J9N4M1Jk8l8l7j6K2
$$ 252 215 193 195 213 241 269 283 275 255 246 254 269 281 287 292 301 314 326 331 328 330 344 358 360 351 341 331 315 308 326 353 352 314 283 302 356 397 398 370 332 295 279 301
282C01M3K1l0o0m0RM7N2K6pk1oJ6Rl0n8l7J3M4K8nj2J1L9M8M1K6jl1m1j8J3K3J0oj9m0n2l6
$$ 301 344 365 335 275 235 244 291 343 369 362 341 335 351 360 330 272 235 248 292 320 315 303 314 353 401 442 468 467 436 395 377 390 413 423 417 398 358 306 270
278B70nKj3jN3Q9N9ol1j8k0m9n0KN1L6k2n2l0QK5K6K6K4Rj5l4l2j9j0pLK7M5L5Kj8mK0K2%
$$ 270 265 267 254 253 306 395 454 448 417 399 379 330 280 282 333 369 347 295 265 273 298 324 350 374 383 368 334 302 283 273 266 269 296 341 376 378 360 356 376 398 398
273C98j9j6KK0K1nm3n7k6K1L4Pk0k0jP%rj2pOK1K0ol5l2RM7M6J1k2k8j2NJ6J6Kk0k9qK2K7
$$ 398 379 363 365 385 406 401 358 301 275 296 330 337 317 297 296 303 303 294 282 275 281 302 322 316 281 249 258 305 351 362 340 312 300 305 321 337 339 319 290 282 304 331
268C31J0%J4K0ll1k9nNoj2kkj7j5J6L5jn5n0J4O6M7%j5LJ0mrKom2o2k8L3N8L0oj5qjRK3K1
$$ 331 341 341 355 375 372 341 312 307 312 306 294 292 290 273 258 274 309 308 253 203 217 283 330 330 315 318 328 324 315 317 311 269 207 179 212 270 300 294 279 271 270 279 302 323
262C23kj9rJ9L1J9mk6l9l1mJ6Nj1KL7N1K4nj2jJJPOj1l3l6j8KJ8K8L3K5J3Jpj7k7l0k6j5J
$$ 323 321 302 293 312 343 362 358 332 293 262 258 274 279 268 270 307 358 382 377 365 364 365 366 373 379 368 335 299 281 283 301 329 362 387 400 401 394 377 350 320 294 279 280
257B80J6K5K8K5J8Nllpk2l7k8qpk5k0J1K5Jk2kK8K7Kolj5k8j5J2Qj7j3K2L4Nj7lJ6Mj3j3j4
$$ 280 296 321 349 374 392 397 394 391 384 362 325 297 289 282 257 237 248 273 274 252 250 278 305 307 301 298 283 255 240 252 260 243 230 252 286 291 274 271 287 291 278 265 251
252B51l0k7J4N2M4OqkjkJ1K2ll6k8J2K3klL3N2J9k4k9j4k5m1k4J4K6NlJ7L2J6qqLJjJ5L6L2
$$ 251 221 194 208 260 304 310 302 300 299 297 308 330 327 291 263 275 298 296 293 326 378 397 373 344 330 305 264 240 254 280 285 282 299 331 347 339 331 334 335 334 349 385 417
246D17Mk1l0m4o5n4LO1N4mm7m3k0qOL5M8J4m0n2j0M2O2M1Ok0k1%J7J5OOOj5m3m6j9NJ0J6K7
$$ 417 421 400 370 326 261 207 210 271 325 321 274 231 211 203 209 244 292 306 266 214 204 246 308 349 355 335 314 314 331 346 352 358 364 349 306 260 241 246 256 272 299
241B99J7j2k0OK9J3j4qJ4J2j7k7oQj0l4l0nJ9L0L2K8K2J8J0pk4k5qLok0k1j3qmPK3L3L0K2
$$ 299 316 304 284 290 319 332 318 310 324 336 319 292 286 294 284 250 220 215 234 264 296 324 346 364 374 367 343 318 310 313 307 287 266 253 245 241 248 271 304 334 356
236C56J0mj4j3lRJ2jj5j7jJ6J5jj4j8k8l9l8j0K4L4K3J2J4K3K5J2j0k7l1j9lPPjj4k5k1kJ5
$$ 356 366 362 348 335 332 341 353 352 337 320 319 335 350 349 335 317 289 250 212 202 226 260 283 295 309 332 357 369 359 332 301 282 279 286 293 292 278 253 232 230 245
231B45K2L1M2L7Pk5l1j6okPJ2jk1j5PQk0l5j6P%j1KK2K4K1L1L4Jl7k5K6M9J3l2l8k0mMPmk9
$$ 245 267 298 340 377 384 359 328 312 306 304 311 323 322 301 286 293 301 281 246 230 237 237 226 228 250 274 295 326 360 361 324 299 325 374 387 355 317 297 293 297 304 300 271
226B71l9j4J2Oj5j0K0L9L4K5J7Lj7k4oJ9K7J9OJMKpj7j4J%j8k4mJ3kl1l1j2qk2k1NK2J1KK4
$$ 271 232 218 230 236 221 211 231 270 304 329 346 349 332 308 302 321 348 367 373 374 378 380 373 356 342 343 343 325 301 297 310 308 277 246 234 226 204 183 188 210 221 223 247
221B47N5N8L1kj9j9oPJ4J3J6J1j6n2o0l0LLj7k3nK4M7N1L3OkJ5J9j3n2m6%L1K7J1Lnk5l5k1
$$ 247 302 360 391 389 370 351 345 352 366 379 395 406 390 338 278 248 251 254 237 214 209 233 280 331 364 370 368 383 402 389 337 291 291 322 349 360 363 358 333 298 277
216B77MJ4J1OQPOQJ7J8Pj0j7pLoj9qJ7K2nk5j1J3mm0l9J1M7K9j4k6nJ8K3Rrj9j4mj1l1l1Q
$$ 277 281 295 306 312 320 327 333 341 358 376 383 373 356 349 352 346 327 319 336 358 353 328 317 330 326 286 247 258 305 334 320 294 289 307 330 339 330 311 297 293 282 251 220 228
210B28N0N4K0k2m4m6l6j9lJ0J8K6K6K3K4K8J6j6l5k2knk0j4J3K2Oj1j0mppRL0L5K3MkPJ5J2
$$ 228 278 332 352 330 286 240 204 185 182 192 210 236 262 285 309 337 353 337 302 280 278 273 253 239 252 274 280 269 259 255 248 241 250 280 315 338 342 340 347 362 374
205C74lqKQj4n3p2n8k6J0M0M3J1l5m1nJ9Jk4qL3M0Jl0j1L2M9K9kk2l0l3k5jK9M8N0M2L0Rj8
$$ 374 371 363 365 373 359 306 234 176 150 160 200 243 254 219 178 173 192 193 169 161 194 234 235 205 194 226 275 304 302 280 250 217 192 191 220 268 318 360 390 399 381
200C81l3k6j4rkK0M0J9l1m8oM0K9k1l3JJ8j9o3m9J6O3N2J2j2j5j2oJ1L8M5K0k2l9k9j5j8k2
$$ 381 348 322 308 299 297 317 357 376 345 297 291 331 360 339 306 307 325 306 243 194 210 273 325 337 325 310 298 292 303 341 386 406 384 345 316 301 283 261
196B61pJ1Jk9l5MM0L0oj8LJ3mj6OL2J1m3n7MO9O3mm6k0J6Mk6j5K4K4k9n7j5M7O3L4Nj2l8n6
$$ 261 254 265 266 237 202 206 246 276 270 252 255 268 264 248 254 286 297 254 197 201 270 333 329 283 263 279 283 257 242 266 290 261 204 189 236 299 333 338 326 288 232
191B32l5J4M0K7RJj4l0j2K9L4j8o6n2nJ8J3K7N2N0J0k9l9k8oL0O0N4K4RJ4jm0n8l4oj4k4N
$$ 232 197 211 251 278 287 288 274 244 232 261 295 277 211 159 154 172 185 212 264 314 324 295 256 228 222 252 312 366 390 399 413 412 372 314 280 274 260 236 241
186B41M8M8Ok5j9pj4k7k6j6j2rKK5M7N8M5J5q%J8J3j1j6NJ8%j9%L0K3k1n0l7qLjkNJ2K0K4
$$ 241 289 337 343 318 299 292 278 251 225 209 197 188 190 215 262 320 365 380 372 372 390 403 392 376 381 399 399 380 380 410 433 412 362 325 317 320 319 317 322 334 354 378
181C78J3j2l3k9j4rj6k0j8k0k4j7JJ1NmnKMPJ5K6L4L2J5j1k4nK6K7kj7jJ1j7n0l6J3M3L5J6
$$ 378 391 379 346 317 303 294 278 258 240 220 196 179 180 191 196 192 187 189 193 200 215 241 275 307 322 311 287 282 308 335 333 316 315 326 309 259 223 236 279 314 330
176C30RJj1j4j0k2l9k5J9M1K4%Jkk8m7k1J8K5%j6j4j0kK3M6L2mj5NK1J7J4J4kl1l8k2qoRL6
$$ 330 339 340 329 315 305 283 244 219 238 279 303 303 304 302 274 227 206 224 249 249 233 219 209 207 230 276 308 304 289 294 315 332 346 360 358 327 289 267 259 253 262 298
171B98L2rl1%L7K3k2l6j5Jnj1jJ2J0%j2k1k0qLMLRJ3kj6oJ6J7JlJ7K2pm2l7J1M7L4j2l1MN6
$$ 298 330 321 290 290 327 350 328 292 277 278 273 262 261 273 283 283 271 250 230 222 225 229 232 241 254 252 236 230 246 263 264 261 278 300 293 251 214 225 272 306 294 263 267 323
165C23N7jn9n8j7Qjj1%J3QmKJ9K9J2j1j5J1L4J4m7q8o9j2K5L0K9L6K5rl4k8pJ0K8L8J6l5n9
$$ 323 380 379 320 262 245 253 252 241 241 254 262 258 260 279 308 320 309 294 305 339 353 306 218 149 137 162 192 221 257 282 273 239 211 204 214 242 280 296 261 202
160B02k1M3O2K1k7m0j4K2M3L3Jj3QL5K4j7m0k6okJJ8K3kl0k5J2M2M1K0jj7j9kJ6J5joOLl3
$$ 202 181 224 286 307 280 240 226 248 291 324 325 312 320 355 379 362 322 296 290 288 289 307 330 328 298 273 285 327 368 388 387 370 351 349 365 380 379 373 379 382 349
155C49p0o3j5K4K4NkPK2K8K2Mj4k4k4j7%L3N6L6j9n3l5%Pqj1KQPK5M7L5rl8k8j5l1m7k2K3
$$ 349 279 216 201 225 249 254 252 259 281 309 331 335 321 297 273 256 256 289 345 381 362 309 274 274 281 273 262 264 272 279 304 351 386 377 339 311 296 265 218 196 219
150B19L4%k4pL1M8L2Lj8j9qKKJQJ9K2Rj8l8k6K3O6M6k7p1l0L8N1Oj4J8M8K8j8m5m3l1qJ7K6
$$ 219 253 253 229 222 253 301 333 336 318 299 291 293 295 296 304 323 345 354 336 298 272 295 361 407 380 309 279 317 368 374 360 378 426 454 436 391 348 317 309 326 352
145C52J3PK4K8pm6m5j9j1k0qJ7Rk9l1K8Q0M4m7r8o6jL9M4L8K2%j9j6kONOJ2Qqk3j5J2M0N4
$$ 352 365 372 396 424 417 371 326 307 296 276 268 285 294 265 234 262 342 386 339 241 175 174 213 257 295 317 317 298 282 280 286 291 297 309 317 309 286 271 283 323 377
140C77N1K8j5o4r0o0ON2M1jk2pJ0mk8k5RM4M8K0pj3%Npk2j3J3K1%k4j9MQrj9jK0J9jk0k4k1
$$ 377 428 456 441 377 287 227 233 285 326 325 303 296 306 302 274 249 258 302 350 370 363 350 350 355 348 326 313 326 347 347 323 304 308 316 307 288 287 307 326 325 305 281 260
135B60pJ6K9J6j4k4JL1L1Nj3j3j3k1j2K5N6L9j2m0k6j0k2l4rL8O0M1J0j5k9l3j6QJ1j6m2m3
$$ 260 253 269 298 314 300 276 277 308 339 344 331 318 305 284 272 297 353 392 380 340 314 304 282 248 239 277 337 378 388 373 344 311 295 303 314 298 256 213
130B13j9J3L7L7J3rjK3K3pk1%K9K6Mj0k0l6l5NN1N2Qk9l0j4ponj0j3KK6K8Kk2j6LNpj4j1K
$$ 213 194 207 244 281 294 285 284 307 330 323 302 302 331 357 361 351 331 295 260 265 316 368 376 347 317 303 296 290 285 275 262 264 290 318 320 298 282 285 290 283 269 258 260
125B60J9L7M2K2oj7qPJ4Q%nj0j2j4qLMj0k2j9j3k1k6nK8L2Pj3rqj9rK8N1K3k2l2qRNjMMmj1
$$ 260 279 316 358 380 374 357 349 356 370 378 378 373 363 351 337 329 332 336 326 304 285 272 251 225 220 248 280 287 274 265 257 238 229 257 308 331 309 277 269 278 283 282 286 290 286 275
120B75j8k6k3ML0L1J7K0L3K3rk9k2j0lJ8M5M2pm7l3OJ2j5k2MK5Ol3m3j4K0K5%k7l1rJ8M0N1
$$ 275 257 231 208 212 242 273 290 310 343 366 357 328 306 296 293 311 356 398 391 344 311 317 329 314 292 296 321 327 294 251 237 257 282 282 255 224 215 233 273 324
115C24M4Mn4q4n4RM4J8k9l7NN6O5L1jqlpj6j7j2j4k8k5JL5M9M1K6%l1n6n3k5jjj5j2J6M0L2
$$ 324 368 372 318 234 180 189 233 251 222 185 190 246 311 342 341 333 330 323 307 290 278 264 236 211 212 247 296 337 363 363 332 276 223 198 197 196 181 169 185 225 257
110B57jj9RN5O5J5n5q6n5jL4L3J0j4k1j1J2L4L2km2m5mL9M3K0%oj8k9j7J4K4kl6l6qJ8L6M9
$$ 257 256 237 246 301 366 381 326 240 185 184 218 251 261 247 226 215 227 261 293 291 249 204 200 239 282 302 302 296 278 249 232 246 270 268 232 196 188 206 242 291
105B91M4Pl9m5j0K5J5j8k8nJ4Lj6pK4M1K3KMJ8J6nk4l0l2l2j4J4L1K1OLNkj0rjLKjrj3nJ0
$$ 291 335 342 303 258 248 273 288 270 242 237 251 254 238 231 255 296 319 321 325 343 359 354 330 300 268 236 222 236 267 288 294 297 302 300 290 281 280 283 285 284 275 262 257 267
99B67J0lrJ0K1Jl7n3k9J3N6P2L8k5n8k1L5L7j1m1j9RJ0jNJ3Oqj3k0k6j6J0K4J1LJ3J4j0j7
$$ 267 277 274 265 275 296 297 260 207 178 191 247 319 357 332 274 253 288 325 314 273 254 263 273 272 277 290 296 288 275 255 229 213 223 247 258 261 274 288 278 261
95B61K8P2N5j3n8n6m7m5k2L2O5M4%j9j2lJRJ6J1lroJNLoj5pQNk2l5LN4O0J0l6k9J0K6J0j0
$$ 261 289 361 416 403 345 289 242 197 175 207 272 316 316 297 285 282 283 292 308 319 316 307 301 302 307 310 304 289 282 290 295 273 238 241 295 355 365 329 300 310 336 346 336
89C36j7k3l5l6rK9M8L5Rj5k9k5lK2K6J9K0K9J7k8o3m0J6M1J2k6l2j0J7M0N5L7j7o0m2J0K4
$$ 336 319 296 261 225 216 245 293 328 337 322 293 268 265 287 313 332 352 381 398 370 307 267 283 324 336 310 278 268 285 325 380 417 400 340 298 308 332
85C32k4p1n8kK7Qj3NM4N7L0j1l0k1JJ7J2klK1K9po3o8kO7O9J5k2j1RQjJJj2k3j3J0K4K3J4
$$ 332 308 237 179 177 204 212 199 204 248 305 335 324 294 273 274 291 303 301 298 319 348 341 278 210 208 275 344 359 337 326 335 343 342 343 344 332 309 296 306 330 353 367
80C67kk3k9rJ3J0pmK1L6K3MJMj1k8k3LJ3lk9l3j5OK3L5L8K8Oj4l0m1l8j8J0J6lk2k2j6k6l8
$$ 367 365 342 313 304 317 327 320 316 337 373 396 400 401 405 394 366 343 346 359 356 327 294 279 285 308 343 381 409 415 401 371 330 292 274 284 300 297 275 253 237 211 173
74A73j3M5Q3O0mm4l3kJ1lk0k9l2l0j1K2M4K7j7l3QO1O0Ol8k8JNrnJ4Rk2l8k0KNJPJ3MlJ6M7
$$ 173 160 205 288 348 344 300 267 265 276 273 253 224 192 162 151 173 217 244 227 194 202 263 323 329 291 263 264 269 260 255 269 278 256 218 198 200 205 206 213 226 230 227 243 290
69B90N1J9k1l8l2rK1L6K1j7l6j7J3J2j0j8jJ1MJK3L6Jn6o5rM3L3j7l7nL4L9J7KQJ9J4mj4l
$$ 290 341 360 339 301 269 260 281 317 338 321 285 268 281 293 283 265 264 275 279 280 303 339 340 284 219 210 253 286 269 232 227 261 300 317 319 327 346 360 356 342 339
64C39J2%l0l0QL0j2o7n8QL9%l8j6K8L4J3J6M0L0j4l9k6j2k5l7j3K9N9O0L5qn0n5k7lj0k4j5
$$ 339 351 351 321 291 299 329 317 250 192 200 239 239 201 185 213 247 260 276 316 346 332 293 267 255 230 193 180 209 268 328 363 355 305 250 223 220 210 186 171
59A71OJ2RJ8L5L8K6J6Lk9o0n0JL9K8noK6M6L1lk5l2k5j0J1K3J5nj2kJ1Mk2m6m4j2K1K6Lk5
$$ 171 177 189 198 216 251 289 315 331 334 305 245 195 196 235 263 258 252 278 324 355 352 327 295 270 260 271 294 309 304 292 290 301 305 283 237 193 181 202 228 231 206
54B06l3k0nNJ2J9J7LplJ2K0J9J8K0J5lj9j7MK3K1Kj4q%nj9j3J1J7kj1J4L9J6l5n2j8J1PJK0
$$ 206 173 153 148 153 165 184 201 204 197 194 206 226 245 263 283 298 295 276 259 263 286 307 309 295 287 287 282 263 250 261 278 276 265 279 318 334 299 247 229 240 247 248 268
49B68L5K0ooJ0Qj3k2j8j8k6k1mOlj3j0NK5M0L4J0jJ9L7J8j9k6j4l4p8o9J0P7O3J3MJ8rp3q8
$$ 268 303 323 317 311 321 329 316 294 276 258 232 211 207 213 210 197 187 192 217 257 291 301 300 319 356 374 355 329 315 281 203 134 144 221 284 297 301 319 310 237 149
44A49j8N9N9rn8l6L0O7M3JlL6N5J9l6n1k4Kkj8k3j2MRLkJ8N3N4Ql0j6J8J5k0k4lj2n6o4qM7
$$ 149 131 190 249 240 182 146 176 243 286 287 284 320 375 394 358 307 283 285 283 265 242 230 234 243 246 244 262 315 369 377 347 331 349 364 344 320 317 305 249 185 177 224
39B24M0Jj8k3m4n5j8L6N0K0MK0L8M0L8L7J5k3m1k3kkj4k3k4k2j0RJ8J5QJj6l4k8lJ2J1J7L3
$$ 224 264 265 247 224 180 125 107 143 193 213 217 237 275 315 353 390 405 382 341 318 316 314 300 277 253 231 221 230 248 263 271 272 256 222 194 191 203 214 231 264
34B64K6j6m3j1N1P4L7j4l3j8QK2J1j2k6j8qj5k7j6J5K8Rj7j6NK6L6L8K6kl7n4l9oJ9J7lj8
$$ 264 290 274 231 220 271 345 382 368 335 317 325 347 358 346 320 302 294 279 252 236 251 279 288 271 255 260 286 322 360 386 384 347 293 254 248 267 284 281 263
29B63qJ8L7L4Rk0l5k5MK3J4j3k2ML1J8k4m7k5QJ1j4j7J6L6J2k4k4J3L7K6Qlj3k6j5K0L8J6
$$ 263 255 273 310 344 353 333 298 273 277 300 314 301 279 283 314 332 308 261 236 244 255 241 224 240 276 288 264 240 253 290 316 324 321 308 282 267 287 325 341
24C41oMJ1k8p2n3J8N1J3j8RM7K2l7m9rK2J2kLKk5m0qL7M1Nk2nK6L8K3Kj6k5k7j8j3j5j1MJ4
$$ 341 335 339 350 322 250 197 215 266 279 261 270 317 339 302 253 244 266 278 276 279 281 256 216 208 245 286 291 269 264 290 328 351 353 337 312 285 267 254 239 228 232 246
19B46Jk8m1k0J4L4L0J4NNJ0%l1n9m4QM5K7j8m3k9mJ2J6J4LjRK3K0PPJ6J4NJ2K3J3rlK2J8k6
$$ 246 247 219 178 158 172 206 236 250 255 260 270 270 239 180 136 144 189 216 198 155 126 122 134 150 164 167 166 175 198 218 225 232 248 262 267 279 302 315 306 303 325 343 317
14C17n2k8OPMK9M8J8k5j9K1K8lk1j1j5l5k1K7M6Ml9k9NPj4k0j1j6j9%K3J0k8m4k1J4L1L5L0
$$ 317 265 237 243 250 254 283 331 349 324 305 326 354 351 330 319 304 269 248 275 321 325 286 257 262 269 255 235 224 208 189 189 212 222 194 150 129 143 174 209 239
9B39J7%JJ3J8PJPQnj6jK9M7L4Pj1j5k0l0k7lK1J7rj9rj0k5k8mJ0j4m5l8ML8M0K3ONK7M8K3
$$ 239 256 256 257 270 288 295 296 303 311 306 290 289 318 365 399 406 395 380 360 330 303 300 321 338 329 310 301 291 266 238 234 244 230 185 147 151 189 229 252 258 263 290 338 361
4C61m3p5k9L5L0k1k7K6N7K6j1jJ8nm2l8NL8L8J4j9m4l2J2M0K7PJ3J3l0p2n2J7M9J4l2l2nQ
$$ 361 318 243 214 249 279 258 231 257 314 340 329 328 346 341 299 261 266 304 342 356 337 293 261 273 313 340 347 360 373 343 271 219 236 285 299 267 235 230 238
-1B38OPJ1Mj2j7oJ3L7N2M1%m2m6qL3M0Rk3k7j6j6j8KM4N4Rm4m5pRj5l0mL0L0lk9l0j4NK0K4
$$ 238 244 251 262 266 254 237 231 244 281 333 374 374 332 286 278 311 351 360 337 310 294 278 260 262 306 360 369 325 280 273 282 267 237 233 263 293 290 261 231 217 222 242 266
-6B66J4LkJQK3L4K2rk6j7lj1l5m5l1lJ5J7RQK0L7M4L5J7ml3n3l6J3M7L1pj9nKj1j6OK9K3j1
$$ 266 280 283 281 282 290 313 347 369 360 334 317 314 303 268 223 192 189 204 221 230 238 258 295 339 374 391 387 354 301 265 278 325 356 349 330 325 327 316 300 306 335 358 347
-11C47m3m8l4j3%J0K2K6J2nlJ9K8km1m6j3K1K5J1lj4k2j4J4L5L1J1oj5k3j9JK0Rj8j3K9O1
$$ 347 304 256 222 209 209 219 241 267 279 274 271 290 318 316 275 229 216 237 262 273 270 256 234 220 234 269 300 311 305 290 267 248 249 269 278 260 247 276 337
-16C37L6k0m3k1M%k3l3k1KJ8J6j3m7m8qK6K4%jJ7J5orK4N5M4Nj8j8k4m0l6ON2N1Ml9k6K5N3
$$ 337 373 353 310 289 293 293 270 237 216 218 236 252 239 192 144 136 162 186 186 185 202 217 211 202 226 281 325 330 312 294 270 230 194 200 252 303 307 268 242 267 320
-21C20L2kjJ8Rk7m2j3J3j0n3n8j5K8L5J9NJ0K6L3K0mrJ2K5Ll4m2j8lk3n4o0l1J7N2N1J4j6
$$ 320 352 350 349 367 376 349 307 294 307 297 244 186 171 199 234 253 258 268 294 327 347 343 334 346 371 374 340 298 280 277 254 200 140 109 126 178 229 243 227
-26B27mL0L6Ok6k9j6JJ7K1%l7m4rK5K6Lj8k7k1J3N7O2J2l8l5qnj9qK0K0npK0K5j2m4k7K1M8
$$ 227 223 253 289 295 269 240 224 225 242 263 263 226 182 173 198 224 227 209 182 161 174 231 293 305 267 232 224 219 200 192 212 232 227 220 240 265 253 209 182 203 251
-31B51M6L5L3L8M0K4k4p7q5l5K0K3qk1lQok3j9kLkJK4N0N1J7j3j1J3Rl5p3o3j6K4L8L7K9J5
$$ 251 297 332 365 403 443 467 443 366 281 246 266 289 281 260 257 265 259 236 217 215 218 216 217 241 291 342 359 346 335 348 357 322 249 186 170 194 232 269 298 313
-36C13Jkqk5l8k3PJ8Mj5j6j4j9k7k1KK7L5J8lnJ0J3j0l0k2rj4j5J2M2L2oj0J8K5qk8KK9J0
$$ 313 314 312 304 279 241 218 225 243 247 232 216 202 183 156 135 137 164 199 217 214 209 219 232 222 192 170 161 147 132 144 186 218 212 202 220 245 237 209 211 240 250
-41B50k2j4K1K8PjQKk2k9j0JnLK8L4Ml3l6nK3L2K6J1oj4j3jJ5K8K1kj9j9j8l4m8k6J8L6J4
$$ 250 228 214 235 263 270 269 277 279 257 228 218 219 214 217 245 279 283 250 214 209 232 264 290 301 295 281 268 267 282 310 331 329 310 291 273 239 191 165 183 219 233
-46B33j5j5KK3L8L8Mm4n9k9QK1K8L9L1%j5QK3j1n4m4QL3J7lJNlJJ9K2%j1NJ9Qj7k7j6%J7J9
$$ 233 218 203 205 228 266 304 308 264 205 176 184 205 233 272 303 303 288 296 319 308 254 210 218 251 268 265 266 271 268 269 288 310 310 299 304 323 331 314 287 271 271 288 307
-51C07pm3m7j0K5K5Kploj1lJ4K3J7J5J4Kk1l7l1rJ4K7K2kl4m8l6oK5M6N1L6Ml1m9l5JL1L5
$$ 307 300 257 210 200 225 250 252 245 242 236 225 222 236 259 276 291 305 307 286 249 218 209 223 250 272 270 236 188 152 146 171 217 268 304 308 277 228 193 194 225 260
-56B60J8MKNJ4K3J4k0n5n8l3k0j8JM0N4K1rPL9K4k1l4JL2K6J6J9J2k4n1l3KNj9k4OL3L1J5
$$ 260 278 282 284 289 303 326 340 320 265 207 174 154 136 137 177 231 252 243 250 289 313 292 258 259 291 317 333 352 364 340 289 256 258 263 244 220 226 259 290 305
-61C05Mj2l7m5k2%rl0j2L5N1J7j0PL4K1j4j5J4J9oj7JMk5l6%M6M9K5J2Lk5m4j4L9M1rm3k8
$$ 305 309 297 260 215 193 193 184 154 142 177 228 245 235 242 276 297 283 268 282 301 295 278 279 283 258 222 222 268 317 342 354 357 332 288 274 313 354 345 302 274
-66B74morK6O4N0j7p7p5j8L9M5Nk9j8J2J6j1k1%J8Kj9j2OLj6k3j7j6j9j0J4L6L8K8J0j1k1
$$ 274 270 264 255 281 345 395 378 301 226 208 247 292 297 268 250 262 278 267 246 246 264 266 247 235 241 244 228 205 188 172 153 143 157 193 231 259 269 258 237
-71B37oJ7K5J4Kqk3l4k2J3L7K5lj3LK0J2j6l0j3K2K6j3m5k5K9M6Ok9pL1K0k8m0JK9Pk5j7P
$$ 237 231 248 273 287 289 281 258 224 202 215 252 277 274 261 264 284 296 280 250 237 259 285 272 227 202 231 277 283 254 247 278 298 270 230 231 260 267 242 225 232
-76B32ROL5O5L7k7m5lJ8k6o3k9L2L6qk3QL0J3kJ6L4J8j7l5k4qmj4k8l8l5k2pJ3L6M4K6RJ4
$$ 232 241 247 282 347 384 357 312 309 327 301 238 209 241 277 269 246 254 284 297 295 311 345 363 346 311 287 279 275 261 233 195 160 138 131 144 180 224 250 259 273
-81B73K4Rk3k5NK6J8J0J7K2Qrj9l0l5j5J7J8j5l5k7k0l0j4L8O9L7mOL9L4Kj0ql1o6o4k7%Q
$$ 273 297 306 283 258 263 289 307 317 334 356 364 355 336 306 271 256 273 291 276 241 214 194 164 150 188 257 294 290 296 335 369 371 361 353 322 256 192 165 165 173
-85A73K7M0J3k7j4M4O0Mn4m9j4LPK1K8Mk2j1K2L0J2qj4j2JJ7J1l1o8m6K5P1M3j9m9k1K3M3
$$ 173 200 240 253 226 212 256 316 320 266 217 203 206 213 234 262 266 244 233 255 285 297 289 275 263 264 281 292 261 193 147 172 243 286 267 218 197 220 263
-90B63L4J7lk2k7oJ6Ll8m8oL9L6QRK8J4k8m6k2KLPJ8J3j6k7j3j5m4l9K3P3L7l8o1k0J2KlK8
$$ 263 297 314 311 289 262 256 272 275 237 189 183 222 258 266 275 303 317 289 243 221 223 226 233 251 264 248 221 208 193 149 110 133 206 243 205 144 124 136 138 135 163
-95A63N7M0lk6oK9M6L2Lj3j1lmnj%qrKPoj4PL6K7rk2LL2K2j4m1m8l9k3KL3N0L9Jk8k0J7L6
$$ 163 220 260 257 231 225 254 300 332 335 322 311 308 304 299 298 298 290 281 283 290 284 270 277 313 340 331 309 312 344 366 352 311 263 224 201 203 236 286 325 326 298 278 295 331
-100C31J5k3l7k2KJ7J8Lj6j4PK0Nj5rJ5K6Rj3k3k0j2rj3j4%K1K4J1JQJ8K5L3K9j1o4o6JN4
$$ 331 346 323 286 264 266 283 301 304 288 274 281 301 306 291 282 297 323 332 319 296 276 264 255 242 228 228 249 273 284 285 293 311 336 369 398 387 323 257 258 312
-105C12L1k6l3J0L2Pk7l8k6LL5K9k5o5l1K8K2n0r2o5j8J3N3R6Q3Ko6n9j1K7N3P9P7K8l4o0
$$ 312 343 317 284 294 326 333 306 268 242 245 280 309 284 219 188 216 238 188 96 31 13 26 79 175 258 260 194 135 124 151 204 283 360 388 354 294
-110B94n8m5j2L6M8J0k8k5j1k6m1rM2O1M0J6kk5l6j5J4J2JJ4L2J5k5m2k4ML0M9M2qn6n1pK2
$$ 294 236 191 179 215 263 273 245 220 209 183 142 133 175 236 276 292 290 265 229 214 228 240 241 255 287 302 277 235 211 215 245 294 336 328 272 221 214 236
-114B36K4J7%l4m8j2L6L2rk0QJ8JkJ7J4j3rK6K0l6n9qM4K9j1j0Rpk7%M1K2l6m4J5O1M1nk9
$$ 236 260 277 277 243 195 183 219 251 242 222 230 248 249 247 264 278 265 256 282 302 266 207 199 243 272 261 251 260 253 226 226 267 289 253 209 224 285 326 321 292
-119B92l6l9k5PK2Mj8rJ1J4JKJ6J7ql1k7KK6K5Lj7k3j9j3o%OJ0J7J6Lj7k6j8mJ3L6M9K8j7
$$ 292 256 217 192 199 221 225 207 198 209 223 224 226 242 259 251 220 193 195 221 246 249 232 209 190 177 171 171 177 187 204 220 223 206 180 162 158 171 207 256 284 267
-124B67l3NM1J7l6l6K1M8Mm4k1L8L6k7n8j7K5Lm0k8L2N8K8ojJ1Lj0oJqrK0M8L1j3l8l3k2q
$$ 267 234 239 280 297 261 225 246 294 298 254 233 271 307 280 222 205 230 233 193 165 197 255 283 277 276 287 290 280 274 275 267 258 278 326 357 344 306 273 251 243
-129B43J7L7K5jMK7J7l3n5j9L2L4jk7k4nK2L5J9k2l9j5J2Kk8l0NL8M1J4k2l2jM0L5j2m3k4
$$ 243 260 297 322 321 325 352 369 336 281 262 294 328 327 300 276 271 293 328 347 325 286 271 283 285 257 227 232 270 311 325 303 271 270 310 345 333 290 266
-134B66Lj1k7KM1K2l6n4kN2N1J6j2k4k4j1J7L3K3pl4m1j5L2N4J6m0m9lK7Ll5l6pQPJ2K3K3
$$ 266 269 258 231 233 274 296 260 206 204 256 307 323 311 287 263 252 269 302 325 318 284 243 228 260 314 330 290 241 238 265 268 233 197 190 198 205 217 240 263
-139B63Oj8k6rK7N8N0J5j4k3l2n1n2k4PJ7K4M5M2lm7l6J0J9j5l0J3P3Q9N2ro5q5o0j8JpLL9
$$ 263 269 251 225 216 243 301 351 366 352 329 297 246 194 170 177 194 218 263 305 302 255 219 229 248 233 203 216 289 378 430 421 356 271 211 193 194 187 190 229
-143B29N8K2k6l2MK5J2%J0K6J8j2m2n5l6MK3j3o6n4L8J12P5k9p7l1K3J6k3k2J4L1Qj8j7KJ7
$$ 229 287 309 283 251 255 280 292 292 302 328 346 334 292 237 201 205 228 215 149 95 133 245 320 291 214 183 206 222 199 177 191 222 230 212 195 197 214
-148B14K1J6PLlj3j7JK9K7rl4j6J2NoJ6M2J6m9o7j6L0K0j1j3NJ0PJ0Oj5k5kK1QoK0N8M6j2
$$ 214 235 251 258 261 258 245 228 229 258 285 276 242 226 238 243 237 253 295 311 262 195 179 209 229 218 205 210 220 227 237 243 228 203 201 222 230 224 244 302 348 336
-153C36n0m0k1j6kL4N1K2j6k1qj6m1m9l1j5kK1N3N3J0l0k5J1J9pk1JK2Mj9KL8K5k5l3K1O0
$$ 336 286 246 225 209 207 241 292 314 298 277 269 253 212 163 132 117 115 136 189 242 252 222 197 208 227 220 199 200 222 226 207 209 247 272 247 214 235 295
-158B95K7k6l1qj2l0j5K1J0m2n3NO0M2opL8O8M6lm6o5m6MM5L1k5n8l4J4L2J7PJ4J6ql6l3J
$$ 295 322 296 265 257 245 215 200 221 231 189 136 141 201 243 237 230 268 336 382 379 333 268 222 226 271 302 277 219 185 199 231 248 255 269 285 277 241 208 209
-162B09L5M2K4Jj4j6mjk1m7m4qK1J9QK3M9M7Pl5n5m8j7K0L5J8%J3L9L1lk4j8ooj0k7n2n0K
$$ 209 244 286 310 311 297 281 277 276 255 208 164 156 177 196 204 227 276 323 330 295 240 192 175 195 230 248 248 261 300 331 328 304 286 280 274 264 237 185 135 137
-167A37N8M8j5m0MM3K4qoKj8l4mL4K0k2j6L4N4K0k4m5m1j7L1O4L8k1l5PL2%m1m0j9j0pK%q
$$ 137 195 243 228 188 192 235 259 251 245 247 229 195 191 225 245 223 207 241 295 315 291 246 205 188 219 283 321 300 265 272 304 304 263 223 204 194 187 189 189 181
-172A81PM4N2Km9m0LK3J5J0Pj4l3j0L0L0mj6J6N2M7J5j1k0j0Kml3n2k7J9L3J0KK2K8nl5k6
$$ 181 188 232 284 286 237 197 200 223 238 248 255 241 208 198 228 258 254 238 254 306 353 368 357 337 327 329 325 292 240 213 232 265 275 277 299 327 322 287 261
-177B61kkj3kK1K2kj9k1j7j4j3j1j1JK5K6nk5J3P2O8qp3o9k4KMNjk1l4pM1N4J7k4k6OK9K5
$$ 261 259 257 244 242 263 285 283 264 243 226 212 199 188 177 178 203 229 224 199 212 284 352 344 271 202 178 180 184 189 188 167 133 126 167 221 238 214 188 194 223 248
-182B48NoJJ1Oj4k5k2j3rKK3L2Qk0j1K3K5j9n4l8NK1QKJ6K4J3KRK6K4Lk3l2k1kQKmjLoj8j4
$$ 248 253 247 248 259 265 251 226 204 191 182 184 207 239 247 227 216 239 264 245 191 153 158 179 187 189 205 229 242 244 253 279 303 306 283 251 230 228 236 238 234 233 236 230 212 198
-187A98NJ2MMK4L6J3j7k3rrk0lL3L4j4m9k5J0om0k0M0M4j6m6J5Q3N4l8p0j6M0L1oj7%J0Mk
$$ 198 203 215 219 223 247 283 296 279 256 247 238 218 215 248 282 268 219 194 204 198 158 138 178 222 206 160 175 258 312 274 204 188 228 259 253 236 236 246 250 248
-192B48JQJ5J5Lronl3o3m6K4P0M7lk1qmj6rK1L4J8qk2k4j8LJ9J3j3k9k2nPJ1J1J0J3J6J1j
$$ 248 249 257 272 287 290 281 275 270 237 174 128 152 222 269 266 245 237 233 217 208 229 263 281 273 251 227 209 212 231 244 231 202 180 175 182 193 204 214 227 243 254 253
-197B53mKml0m3k1NLoK3O3N3pl6LM9M1kl2m2n4n5k6J4L0J8kj8l0k4JK8L8M5N2L5j7n4l9mp
$$ 253 249 251 247 217 174 153 158 161 155 178 241 294 287 251 254 303 344 342 310 268 214 159 133 147 177 195 193 175 145 121 122 150 188 233 285 320 303 249 210 206 199
-202A99l1j3M4O8L4jJ1M3M9K2j8o6r8o9K1Q9O1l0q2n9lL2L5K6J3OO%k0m3m0j6lp%K5M7M4K3
$$ 199 168 155 199 267 301 300 311 354 403 425 407 341 243 174 195 284 345 315 233 174 171 203 238 264 277 283 289 289 269 226 186 170 167 160 160 185 232 276 299
-207B99ll6p0o6j1M8N8K3%PJ2j4m2m4k2kJ3K9L8K6Jj3kJ8L1K6Mk3m1l0nPpj8oJ6K5J5MOJ6
$$ 299 296 260 190 124 113 161 219 242 242 249 261 247 205 161 139 137 150 179 217 243 244 231 229 247 278 304 308 285 244 214 209 216 209 191 185 201 226 241 245 251 267
-212B67J7J1NKKKklkok0l8m0k5oJ4L6M7K2k4m5rM1M3Oj2J1K9J1j7k0j0j4k9k3nJrqJ2K1Qm
$$ 267 284 295 300 302 304 306 304 301 299 293 273 235 195 170 164 178 214 261 283 259 214 205 246 289 295 283 294 323 334 317 297 287 273 244 221 216 217 208 200 212 233 241 237
-217B37J2L8L1ql9l2jJ7lm0o1l9J4N6N4J9qlK1L3J6j5l2k3NJ9ll9m8j1K8K5j3l2j1K4L8K5
$$ 237 249 287 318 310 271 239 238 255 252 212 151 112 126 182 236 255 247 244 265 298 314 299 267 244 249 268 265 226 178 167 195 220 207 175 164 188 226 251
-222B51Jj8j6QL5L7J9J2K0J3k7n8m4kK3K3L0M2L3Jk0k2k3k8k1%Oj0j0K2M6K5j6k6nJk6m5k6
$$ 251 252 234 218 226 261 298 317 329 349 362 335 277 233 231 254 277 307 349 382 383 363 341 318 290 269 269 275 265 255 277 323 348 332 306 301 302 276 231 205
-227B05J0K2jl0l2mK4J9npK9O3N4J8qj3k8n8p1m5mJ7J3jrlJ4K9K7J6J5J3ol6m2j3J4J3J0L2
$$ 205 215 237 236 206 174 170 194 213 208 201 230 293 347 365 357 344 316 258 187 142 138 155 168 167 158 155 169 198 225 241 256 269 263 227 185 172 186 199 209 241
-232B41M9J9m0n9k4J5J2mNK1Ol0l6mK5K2J0J5J7ol6l0MK3Qj1pQPmKJ6J2j7l7k8mKjQK8L5J2
$$ 241 290 309 269 210 186 201 213 209 214 235 241 211 175 171 196 218 228 243 260 254 218 188 192 215 223 212 205 213 220 216 218 234 246 229 192 164 160 162 161 169 197 232 244
-237B44j3j2LQmj1lOLLK0M7N7L6j0n3o9n4k6pOL0N4L8k5p3m7J6L3mk9KL9L2MKJ3om4n8l9j7
$$ 244 231 219 222 230 226 215 212 218 221 224 244 291 348 384 374 321 252 198 172 165 171 201 255 293 268 195 148 164 197 193 164 166 205 237 241 243 256 250 206 148 109 92
-242I2mJ5L4K1j4j9J6M3K8%lONmlkj2j6kJ5J2KQJ6MqJJ0rl6k5J8M3K9%k4n1n1%O7O5rn8k4
$$ 92 88 103 137 158 144 125 141 184 212 212 209 215 220 216 213 211 199 183 181 196 208 210 218 234 238 230 231 241 232 196 171 189 232 261 261 237 186 135 135 202 267 258 200 176
-248A76L1L0jKL0K4qj7mj0l3k2K1L9J3mJ6L7K6Olk0n3o6m0pLOK2K1j4l9j3L4M4J9kj7m8o6
$$ 176 207 237 236 238 268 292 284 267 263 253 220 198 219 258 271 267 283 320 346 352 349 329 276 210 170 163 166 172 194 215 201 162 149 183 227 246 244 227 179 113
-252A13l6J6K7qk7j3MJ2L5N9L6k1m0JL7K7K3M4L6l6q9m8K7L0k7m2LK4j5m2mN0N3J3j6j3nj1
$$ 113 77 93 120 112 85 72 76 88 123 182 218 197 157 158 195 222 245 289 325 289 200 152 179 209 182 140 143 167 152 110 106 156 209 222 206 193 188 177
-257A77k8l0%M6N6J3l8l5QK8J2RL3L4j1n2m0lJ2MPJ7RqqPJ7J6RKj3k3k1j6j5pJ4K1Jj2J7O5
$$ 177 149 119 119 165 221 234 196 161 169 197 209 218 251 285 274 222 182 179 191 195 202 219 228 220 212 219 236 252 261 263 250 227 206 190 175 168 182 203 204 192 209 274
-262B74O4Pm2m0oQj1l5m8m4k4RM3N2L1ql7l4pJ7K7K9J9ol2k2K4O0M8Pj8k0k1l3l4j2J4L0K9
$$ 274 338 345 303 263 257 265 254 219 171 127 103 112 155 207 238 230 193 159 152 169 196 225 244 238 206 184 208 268 316 323 305 285 264 231 197 185 199 229 258
-267B58Qk4m3k4J5L5K1JMK5L0J0j6j9njk2l9k0K1K8ol0nK7K2KJ5L9J8l6n1j1J3j2k4K2O9L3
$$ 258 266 242 199 175 190 225 246 247 251 276 306 316 300 281 276 275 253 214 194 215 243 237 207 202 229 251 253 268 307 325 289 238 227 240 228 204 226 295 328
-272C28o0j07o0J4L9J6okJ2K1K6K3Kk7l7j7J4K2QkJLkNK2K4RQL1J7n8j18p4L5Q5M1j4j6j0
$$ 328 268 161 101 115 154 170 164 162 174 195 221 244 246 219 182 165 179 201 209 207 208 211 209 214 236 260 269 277 308 325 267 149 75 110 195 236 222 206 196
-277A96m2o2j5O2P8K9j9k3jJ8K6J8pj6PL4K8mk3k3k2k5j1K1M3L2pn6p7m4K1M4mn7l6L0M9O
$$ 196 154 92 77 139 217 246 227 204 203 221 247 265 258 242 249 283 311 307 284 261 239 214 203 224 267 299 292 236 159 115 136 180 176 119 83 113 162 168
-281A68k2KK2ll4j1M8P3M5Jk0j3MQpk3j5Jqm5n9k4K1K4KkK0L2J6mqMRkk4l0oK5K6j2m4l4R
$$ 168 146 148 170 167 133 122 170 243 288 289 269 256 260 268 261 238 223 224 216 171 112 88 109 133 135 133 153 185 201 197 189 193 202 200 176 146 140 165 191 179 135 101 110
-286A10M2M4L3K5J6ll4n0l1J7N5M6Oj7qOjk0k7k6k6j8JPqj4J3M3K6k7n2k7J5L2K9K6K0Rnj0
$$ 110 152 196 229 254 270 267 233 183 152 169 224 270 276 259 251 257 256 236 209 183 157 139 140 147 139 125 138 181 207 180 128 101 116 148 177 203 223 232 227 217
-291B17j3j3JL1M7K8j4l9k8JJ9K2K6L3L0Qj0qLKrj6j2j2k0k7l2m7n3j6N1P5K8l0k2K7L4mk2
$$ 217 204 191 192 223 270 298 284 245 217 218 237 259 285 318 348 356 346 338 341 343 334 318 306 294 274 247 215 168 115 99 150 225 253 223 201 228 262 258 236
-296B36MJ5j5l2MM6K8k7m8k1NNKJ3K2K0J0jj7l2k1OJ8ml3l6j5%Kk%%lPL6O0M8Ll1k7lMjMJ5
$$ 236 240 255 240 208 212 258 286 259 211 190 195 200 202 215 237 257 267 266 249 217 196 202 220 216 183 147 132 132 134 132 132 132 129 136 172 232 280 283 252 225 222 226 225 229 244
-302B44Oj9j9J9L9Lm4l4J8L8on5n6j8J6L4M2L2Jk1j2J4K2Mj7k2j5KJ8K1Lj7j4J0K9K5Qrk7
$$ 244 250 231 212 231 270 273 229 195 213 251 245 190 134 116 132 166 208 240 241 220 208 222 244 248 231 209 194 196 214 235 238 221 207 217 246 271 279 270 243
-306B43l9l0LL2K4j4l8k2J2K2kk3lL9N1J2k7k3J2K0ok8k2rj4k3j8mMJ3L1M2L1J1NJ0Lj3k1
$$ 243 204 174 177 209 233 219 181 159 171 193 191 168 165 204 255 267 240 217 229 249 243 215 193 184 170 147 129 125 129 142 173 215 246 257 262 272 275 262 241
-311B41j6oJ0K8K9jl4k5J8L5Nk9k2MJ0lpmj1k1j1J0J1pj0QK3J2poPRLRK8M4L0kk7l1k1k1l4
$$ 241 225 219 229 257 286 285 251 226 244 279 284 255 233 237 247 244 237 233 222 201 190 200 211 204 194 202 225 237 230 224 231 240 243 252 280 324 354 352 325 294 273 252 218
-316B18l6j9JKj1j3j%j5k2OM7N9K6j3k5k5l6m7k3L2O1L1j5j2L6O4L7jpQlm4p0o0k3J1L0K7
$$ 218 182 163 164 166 155 142 141 141 126 104 110 157 216 242 229 204 179 143 96 73 105 166 197 182 170 206 270 307 306 299 307 304 260 190 130 107 118 148 175
-321A75J5MLJmmMLj2j9kJ7Qk0k6qJ5L2N1N2J3l8m0PL5Ol6m4l3l0k3J1L8J2l6l5K1O5N3Rj9
$$ 175 190 194 197 198 194 190 194 197 185 166 164 181 189 169 143 135 150 182 233 285 298 260 220 227 262 268 232 188 155 125 102 113 151 163 127 92 113 178 231 240 221
-326B21k8l8m1j7K2M1K2j2k6j2J7M2N5N0K3j4l3j6J0J0j0j6oj2m5n3oN2N4Ll6k5J0K9K8J3
$$ 221 193 155 114 97 119 160 182 170 144 132 149 191 246 296 319 305 272 256 266 276 266 250 244 232 187 134 128 180 234 237 201 176 186 215 243 256
-331B56j7m7m9j1M1O7N4K4kj5k3l0l0j2J6K1j3m9n1j5J7K9K7K3J3lqmpj2oJ1J1j1k5rJ5J9
$$ 256 239 192 143 132 173 240 294 318 316 301 278 248 218 206 222 243 230 181 130 115 132 161 188 211 224 221 213 209 202 190 184 195 206 195 170 161 176 195
-335A95Lj5k3j4J7M7L4k2o2l1L5N5Om7m3pNj0j1J7M0K2j7l2pL0M2K4jj1prj8j9%K5K0j8m9
$$ 195 198 183 160 146 163 210 244 222 160 129 164 219 225 178 135 128 133 123 112 129 169 191 174 142 135 165 207 231 230 219 212 203 185 166 166 191 211 193 144
-340A44l5OK8K1RJ1J6J2J0J3om0m7pL8L4ql3k8k2k5j8%PKJ7M4M1jl9k8J8N1N1K6j1l0rL7O3
$$ 144 109 115 143 164 173 184 200 212 222 235 229 189 142 135 173 207 199 166 138 116 91 73 73 80 82 99 143 184 183 144 116 134 185 236 262 251 221 212 249 312
-345C12N0J7j4m3n6l3J0J9j1k0K2N3J3n3o4k2Mrj6NJ8PKJ8K3ll1k7%K2K3Rj3l0k5pjrnK4N2
$$ 312 362 379 365 322 266 233 243 262 251 231 253 306 319 266 202 180 184 175 159 164 182 189 191 209 232 229 198 171 171 193 216 225 212 182 157 150 149 140 135 159 211
-350B11N1K8Roj8k3j7j5k3k5j0J0K0J9J5J4Mj8m1m6k6LK2K1J7K0J2j5l8k4J4K8J1mMR%pmr
$$ 211 262 290 299 293 275 252 235 220 197 172 162 172 192 211 226 240 244 226 185 139 113 116 138 159 176 196 208 193 155 131 145 173 184 180 184 193 193 186 182 173
-355A73k6j7L6Q5P8L0j3l6n8o8m8%L9M7L9K9J0j2k5k2j8j6j1JJ4J3%j3j2RL5L8J5qj2pj9m1
$$ 173 147 130 166 251 329 359 346 310 252 184 136 136 175 222 261 290 300 288 263 241 223 207 196 197 211 224 224 211 199 208 243 281 296 288 276 269 250 209
-359B09n4m8l2qJ9L5K5LnPK4K8J9mk9l5qL4N7M4J5j0k6k8k0j8l5n2k8K9O2L9jqJ1Pk8n4l9
$$ 209 155 107 75 67 86 121 146 149 144 151 175 203 222 218 189 154 146 180 237 281 296 286 260 232 212 194 159 107 79 108 170 209 208 200 211 218 190 136 97
-364I7JK7K8K3K6K7J6nj8j7oNJ4K2K5J9Kk2m1l5lL4L8J2qNK1Rj8k0MJ5j3m5m4qK4K6Nj2oK5
$$ 97 98 125 153 176 202 229 245 240 222 205 199 204 218 240 265 284 286 264 223 188 185 219 257 269 261 266 287 296 278 258 262 277 264 219 175 167 191 217 222 210 204 229
-369B29N2M7Mm5o5m9j1K3L8L5K3QkoJPJj7k5j4nk1m6m7k2QK6L1K4Mj6k7l1l9k9J4N3L9pj2
$$ 229 281 328 332 287 222 173 162 185 223 258 281 289 287 281 282 289 290 273 248 234 229 208 162 115 93 101 127 158 182 186 170 143 112 73 44 58 111 150 143 131
-374A31L3N6J5l2j9K2K4pj3QJ7%j3j8l7n7l3K8O3L7ok2k3k5j4K7O3O0L2Oj8m9n6j2M6N1Oj9
$$ 131 164 220 235 203 184 206 230 223 210 218 235 235 222 204 167 110 77 105 168 205 199 177 154 129 115 142 205 265 297 303 285 236 180 168 214 265 271 252
-379B52NK6Ml2k8OK2kl2l1mK4L5K4nl4m4k7JJ1pl7l8jM7O2L9Rqk0k9k4LK3Pk5k9J1M7L3k3
$$ 252 257 283 287 255 227 233 255 253 221 190 186 210 245 269 264 230 186 159 160 171 164 127 89 88 135 197 236 245 237 217 188 164 167 190 197 172 143 154 201 234 211
-384B11n9m0MK8K2J3J7J4nk2pK4L8J6j1k4j9rPJ8J3kjK2L2Jm4o1l7qK%oj2mK5N5M8Nj9NM1
$$ 211 152 112 116 144 166 179 196 210 205 183 176 200 238 254 243 219 200 191 198 216 229 227 226 248 280 281 237 176 139 131 133 133 127 115 111 136 191 239 244 225 230 271
-389B71K9j9m5j5L5M9Pn4q5o3j1K9K9Lj4j2MJ8K2J6JqnKmj6j3J0L3L6J7qj6r%nrmLpl0m1l0
$$ 271 300 281 236 221 256 305 312 258 173 110 99 128 157 160 146 134 138 156 178 194 195 187 182 184 180 164 151 161 194 230 247 239 223 214 214 209 200 196 199 192 162 121 91
-394I1j5nJ2L7M5K2j1k1j5lJ3L3L1nl1j1K8K3j9l7qK0J2pkJ2Po%J9K4Oj1j7j5j6j8j2J1M3
$$ 91 76 71 83 120 165 187 176 155 140 137 150 183 214 209 178 167 195 218 199 162 154 174 186 179 177 189 196 190 190 209 233 239 228 211 196 180 162 150 161 204
-399B04N8L5jj3knl0m2j9OPKJ6K8J2j0j0lj6l5k9mQLJ1K7K6J0QK2K2lk3j6noj1lPLj0k3l1
$$ 204 262 297 296 283 281 276 246 204 185 191 198 200 216 244 256 246 236 233 217 182 153 149 157 160 171 198 224 234 242 264 286 283 260 244 239 233 222 219 226 229 219 196 165
-404A65l1k2j4jK4N7N8J7k4k1OLj9oM0M5j3n8l2J7J8j2qK3K4j6l7j0K6K4Ko%nk0k2nJ3J6K
$$ 165 134 112 98 97 121 178 236 253 229 208 214 217 198 192 232 277 264 206 174 191 209 197 189 212 236 220 183 173 199 223 225 219 219 214 194 172 167 180 196 198
-409A98k2l9l3kL6N5N2M1L3K4Qqk3l2l3j3K2L9J0l4l7LK9Mk6j2J7Nl4l7NK6rm2j8K3K0j1j4
$$ 198 176 137 104 102 138 193 245 286 319 343 351 343 320 288 255 242 264 303 313 279 242 245 274 278 252 240 257 262 228 191 196 222 213 171 153 176 196 185 171
-414A71J8K5ql4j3K5L8K6J2Npk3l1k2kJ7K2Rj3k4k3k2l4m6l5jL5M5L0K0L0M2L2Mj9k4j4KJ7
$$ 171 189 214 206 172 159 184 222 248 260 265 258 235 204 182 180 197 219 228 215 191 168 146 112 66 31 30 65 110 140 160 190 232 264 268 249 225 211 213 230
-419B30J5rk8j5J5J9j2l5k0PJ1nj0jjpkJ4J8Lj0KL5N4L6j3n9p3n3k4J0M4O3M1ql0qJ7PqJ0
$$ 230 245 236 208 193 208 227 215 180 160 167 178 173 163 162 161 154 152 166 184 187 177 179 214 268 304 291 232 159 106 82 92 136 199 240 232 202 194 211 218 210 220
-424B20L9L2qk7nK4L0J0k6o1o5k1K6L0lj7OK3J7RK0K5Mj7j9j3j5j8mK1M0M7L4j1o1p5m2jJ2
$$ 220 259 291 283 256 251 275 305 315 289 228 163 142 168 198 195 178 184 207 224 233 253 278 282 265 246 233 218 200 196 217 257 304 338 327 266 191 149 148 160
-429A60J1J2RJPL3L6rn6n3j9ok0j1L8P3N7Qk4k6j5rqmQJ8K0J2ONkj6k2j6j3k5k6jK6K2rk3
$$ 160 171 183 192 193 200 233 269 260 204 151 132 126 106 95 133 206 263 271 247 221 206 197 189 185 193 211 231 243 249 254 252 236 214 198 185 160 134 133 159 181 172 149
-434A49j1NPMOJ3J4J1lj8rK7N2K3l0m4mL0J9qj4k1m9n9pP2Q6K1m7n2j0J7RnlJ7L3L3J5nj2
$$ 149 138 143 150 154 160 173 187 198 195 177 168 195 247 270 240 196 192 222 241 233 219 198 149 90 83 155 241 262 215 163 153 170 179 174 171 188 221 254 269 264 252
-439B52njj4k6k6j5pnmnlQK1J7ql1k8rmjK2N2M6Jk9k2rj6j0L2N9K2l8m2jKn2p2j1N3L5k8m1
$$ 252 247 246 232 206 180 165 158 153 149 144 141 149 170 187 179 148 120 111 107 106 128 180 226 227 198 176 167 151 141 173 232 254 216 174 173 175 123 51 40 93 128 100 59
-444E9J4O1N9M0L2K3mk7k9j3MJ7J3k4p3p7j9M1M6Nk4qJ9J6j0k6lL4M5J5k4l1lK5K7J5QRKj5
$$ 59 73 134 193 233 265 288 284 257 228 215 219 236 249 225 152 75 56 97 143 148 124 116 135 151 141 115 112 146 191 206 182 151 148 173 200 215 223 232 234 219
-449B19j6jPql3m4l5k1JL8P1O6J6k7k8mM%J2L3K3j3k8jK7J8qj6j2j6k2rJ0Ok1m1k0L6Q4P7
$$ 219 203 202 209 201 168 124 89 68 69 107 178 244 260 233 205 201 205 205 217 250 273 260 232 231 258 276 268 252 240 224 202 193 203 209 188 147 127 163 247 324
-454C24J1n5n9j3Rj8m2j6K2K2rk4j6qNL3M3J6j1%Rl3q2m9M7Q6K6l8k5K2K1j3j5J1K0PQL0M1
$$ 324 335 280 221 208 217 199 157 141 163 185 176 152 136 128 133 166 209 225 214 214 223 190 108 59 106 192 218 180 155 177 198 185 170 181 201 208 216 246 287
-459B87K0qk4k7k4k6l3l2oL2L9Ok9k0J2K3PjJ0K3K3J3Oql8o6o2j7M0O2L2mj0N%j7pK7L5Nj8
$$ 287 307 299 275 248 224 198 165 133 127 159 198 204 175 155 167 190 197 196 206 229 252 265 271 263 225 159 97 80 120 182 214 210 200 205 205 188 181 208 243 248 230
-464B30%L1L0Oj9l5m1k8lKk1l1rJ1NmQJ7mj4J7N8M4j3n7o5n0j5L5O2L5j2k0%Oo%J2ll1k2J3
$$ 230 230 261 291 297 278 243 202 174 171 173 152 121 112 123 128 124 132 149 145 131 148 206 250 237 180 115 65 50 85 147 182 170 150 150 156 150 150 162 159 128 106 119
-469A19J5j2j0L8O2K5k2l1j7k0k5j0J4K5K7K6Qk8m5k1J9L9L5J7j6m3l0J3L6J9%Kmk6l0OL4
$$ 119 134 122 112 150 212 237 215 184 167 147 122 112 126 151 178 204 212 184 139 118 137 176 211 228 212 169 139 152 188 207 207 209 205 179 149 155 189
-473A89J4j9j2J6J2j6j7J1J7j6l8j0L5N0K6KJ0L5L9Lm0m2pPk6o5n9j0L3M5L2kl9n7l9rJ0J4
$$ 189 203 184 172 188 200 184 167 178 195 179 141 131 166 216 242 244 254 289 328 331 291 249 242 249 223 158 99 89 122 167 199 197 158 101 62 53 63 77
-478G7J2Jj1JL1L8Qj5LJ8j5n8m0L0O5L7kpkj2j2J9M9M3J2LJ7J9pl3l3j9j9l6l4KM0L3j2l7
$$ 77 89 90 79 80 111 149 157 142 145 163 148 90 50 80 145 182 180 173 171 159 147 166 215 258 270 273 290 309 302 269 236 217 198 162 128 130 170 203 191 154
-483A54rL4L9J9OMqk2j4LNmQL3K9j2l8j8J5Rl0o1n0mM3N2Rm2m0NL4J1j6KL5J9m2p8n2%J7K
$$ 154 145 179 218 237 243 247 239 217 203 206 211 207 215 248 277 265 227 209 224 233 203 142 92 88 131 183 192 150 110 115 149 160 144 146 181 200 158 80 28 28 45 47
-488D7lJ6K9J2nJ5N8O8L0j1j0Nql7l7KL0J3k1l2j0J4J7jk1j7J1K3qn4n7nM4M6K1J1J1jk4k6
$$ 47 44 60 89 101 96 111 169 237 267 256 246 251 243 206 169 171 201 214 193 161 151 165 182 181 160 143 154 177 169 115 58 53 97 143 164 175 186 185 161 135
-493A35JK6K6Mj8k9k4lJ8L2L6K6jk9l4j1J9K7J8J0Kj7m2m8k0K0L6J6j1pJ5J4j7l4pL4L4%k1
$$ 135 136 162 188 192 174 145 121 118 136 168 204 230 229 200 166 155 174 201 219 229 231 214 172 124 104 124 160 176 165 158 173 187 170 136 129 163 197 197 176
-498A76rNKJJ6L0K7K1J2j7o1p3l1J8K4kj0QJ1rk3j4J%plJ1K3K6K8L1K8J2j3k9k4j0j3k9k7
$$ 176 167 172 174 175 191 221 248 269 281 264 203 130 99 117 141 139 129 137 148 139 116 102 103 103 96 93 104 127 153 181 212 240 252 239 210 186 176 163 134 107
-502A07%J7kk9k0K7N8M1pm8n6l7lK9M9N0K4j3k9qK3J3l4o1k6L4O0M1J9J1O%KJ9K7J6j0l8n3
$$ 107 107 124 122 93 73 100 158 199 192 144 88 51 48 77 126 176 200 187 158 150 173 186 152 91 65 99 159 200 219 230 236 236 238 257 284 300 290 252 199
-507A99l8PM5L7ql7k6mjj1qQJ9K1J4%j5k2j5j4k9m4l3%K0OnJ9O3O6J8k4j3J6Rl1l9oJ3j1l3
$$ 199 161 168 213 250 242 205 179 175 174 163 155 163 182 203 217 217 202 180 165 151 122 78 45 45 65 71 66 85 148 214 232 208 195 211 220 189 150 144 157 146 113
-512A13rK6K1jQM1M0Oj1RK3Jk3j8KLj1k1k0j2MK6L6J6k1m1k9LK7K5kj8lK2J7k0m2j2M2O5M0
$$ 113 104 130 151 150 158 199 239 245 234 243 266 267 244 226 228 231 220 199 179 167 171 197 233 249 228 187 158 161 188 213 211 193 190 212 229 209 167 155 197 262 302
-517C02jk5l2l8m3l4nJ8J6MQK3J8j0k6qJ4Nj6j4PJ1JRK9K0j1j8J4L3Lm2n0k8j5k2k1oJ2K2
$$ 302 301 276 244 206 163 129 124 142 158 162 170 193 211 201 175 167 181 186 170 156 163 174 175 184 213 233 222 204 218 251 254 212 162 134 119 97 76 70 82 104
-522A04K3J1j1l0k7lK7N6O8N1J2j8j8j0j0j2lPOMJ2J9Lk6m5m8l9j5J8L5K0%J1L7L3lk8k0n
$$ 104 127 138 127 97 70 67 94 150 218 269 281 263 245 235 225 213 210 217 223 227 239 258 261 235 190 142 103 88 106 141 161 161 172 209 242 239 211 191 186
-527A86rj6j2rk1k9jM7O1K6k0k8nPj1k5j1J3Rj2j7NK5J2j6k1NL5L5lm7n3j2L0L4Kj7j3oj7
$$ 186 177 161 149 140 119 90 89 136 197 223 203 175 170 177 166 141 130 143 152 140 123 128 153 165 149 128 133 168 203 200 153 100 88 118 152 154 137 124 118 101
-532A01k8k2mJ1J1j1m5n0qM8N3J4nK1L7J1rJ7M7J8m0m6J0O1N6J9qj0LJ4Nk3l9k5ppj1J1L9
$$ 101 73 51 47 58 69 58 13 -37 -45 3 56 70 65 86 123 134 125 142 189 207 167 121 131 192 248 267 259 249 252 266 271 248 209 184 177 170 159 170 209
-537B09M1J6nk2l6l1LK5jl4j3L1K2l4m5RL7rn4j7N8O8J0k7oK6J6j9l5j3J8K5Lj9j5jok0j3
$$ 209 250 266 261 239 203 172 175 200 199 165 152 183 205 171 126 135 172 163 109 92 150 218 228 201 195 221 237 218 183 170 188 213 216 197 182 181 175 155 142
-541A42J9L1Pj3pKqj7LK6J5j5k2j0j1k4k0J0L1K2oj9JL9N8K9j8l0OL4J3k2k3JOjQK5J3k3l5
$$ 142 161 192 199 186 179 181 173 156 159 185 200 185 163 153 142 118 98 108 139 161 155 136 137 176 234 263 245 215 221 255 268 246 223 224 230 229 237 262 275 252 217
-546B17pK3K0PRJ1j7n4n7j8L1M3J0l2m0pK7J4k9m2mL4K2k7n1k7J2L0K3J2RJ3J8J8Qj4l0l0
$$ 217 210 233 253 260 269 280 263 209 152 134 165 208 218 186 146 139 166 180 151 109 105 139 161 134 83 56 68 98 121 133 142 155 173 191 199 185 155 125
-551A25k4k3j7RL8L8J2J0M4O0K2l1l5j1k4o5o0J1O5L8k6m4j3K0L4L7J9k4n2k9J8K4nrL3O5
$$ 125 101 78 61 70 108 146 158 168 212 272 294 263 228 217 193 128 68 79 144 182 156 112 99 119 153 190 209 185 133 104 122 146 141 132 165 230
-555B30M1nj6J2K9J0k2k7JK2jn2p1k8K8L9J1lJ3K4Qj4k3k4k7j6QK6J1j7k3jK2K0LjJ1J6lk4
$$ 230 271 266 250 262 291 301 279 252 253 275 274 222 151 123 151 190 201 198 211 235 243 229 206 182 155 139 147 173 184 167 144 143 165 185 188 187 198 214 211 187
-560A87j3K3L3kl2j2K4J3l6o0k8J6L0K1J4J4J6J4RlmK0M5L5j0m5m7k7lJ6J7rl4k5NQj5k1N
$$ 187 174 197 230 228 196 184 208 221 185 125 97 113 143 164 178 192 208 222 231 228 224 244 289 324 314 269 222 195 192 208 225 216 182 157 162 170 155 134 139
-565A39J6kj2QJ3k2n3k3K7L3ok0J3M8M1Lk9l3qK3L3J8Llpj8j3J8L5Om4o0l1QK2J8J2QJ2K3
$$ 139 155 153 141 149 162 140 87 64 91 124 118 98 111 159 200 203 174 141 133 156 189 207 210 207 200 182 169 187 222 228 184 124 93 101 123 141 153 161 173 196
-570A96K3Kj7j3KMpj1ojLJ2J4Jj3j3j2k3l0j1Qok8j0M3O7L5j0j6RK4Rj4k5j4MJ4J1J3K2K3
$$ 196 219 221 204 191 193 197 190 179 173 172 175 187 201 202 189 176 164 141 111 100 108 102 74 64 107 174 209 199 183 192 216 225 211 186 172 176 190 201 214 236 259
-575B59Nj2qol3o0m7ML7K7MnlKOlk6l2J1O5O5Rk8j5kk7m0JN5N3Nl1l4l2k8nK6K8QNK0J5k5
$$ 259 264 252 244 238 205 145 98 102 139 166 170 165 162 164 170 167 141 109 120 185 250 259 231 216 214 187 147 148 203 256 261 230 196 164 136 131 157 185 193 198 218 233 208
-580B08n7m9j8MJ4K5K7J7QO%k3l7nN5P8L2m1n4NP1P2J5l2l7k1j9j9NM0M9J5k7m1l2k7l4l6
$$ 208 151 102 84 88 102 127 154 171 179 185 185 162 125 120 175 253 285 244 190 195 266 338 353 321 284 263 244 225 230 270 319 334 307 266 234 207 173 137
-585A37j2K9N0L4lk2j0J1J3rl3m0k1J1K6Rj9k0J0L3K0j0j8KJ9J3jjJ1J6kl0m2k4OJ6LlJ2L1
$$ 137 125 154 204 238 235 213 203 214 227 218 185 145 124 135 161 170 151 131 141 174 194 184 166 168 187 200 199 198 209 225 223 193 151 127 133 149 152 149 161 192
-590A92K6Nj4k0j7mP%k3l3j3Opl2j9K4M5J3l6m5j2K2L1J7KjJ5L4L9K6J0lqrnjnj4j3kjroJ3
$$ 192 218 223 209 189 172 168 175 175 152 119 106 112 105 73 54 78 123 136 100 55 43 65 96 113 115 114 129 163 202 228 238 235 227 218 213 212 207 193 180 178 177 168 162 175
-595A75K1ll9m1qK3K2%j3j5j6j9k0j7qJ2L8M9L4J5K2L6J7l2n9k7K1K9rl5k6KK2L1L2J4k0m0
$$ 175 196 193 154 113 105 128 150 150 137 122 106 87 67 50 42 54 92 141 175 190 212 248 265 233 174 147 168 197 188 153 127 129 151 182 214 228 208 168
-600A68k9kJ2Nj0j6oJ6L1K3ol0l8k8oK4L8J4k6l8j4mk9m1%N2M3rk5J7O0M6Qrlmj5j5KJ5J1
$$ 168 139 137 149 154 144 128 122 138 169 192 186 156 118 90 84 108 146 160 134 96 82 78 49 8 8 60 103 94 69 86 146 192 200 191 188 184 169 154 156 171 182
-605A82jlORol2l6nL5L9J3pqj0k1k5j1L%j3j5oKNLmqJK0L5L6L4K6mm9o9l7K0N4N2L0Lk0l1
$$ 182 181 178 184 193 187 155 119 114 149 188 201 194 186 176 155 130 119 122 122 109 94 88 90 95 98 94 86 87 107 142 178 212 238 234 185 116 79 99 153 205 235 238 218 187
-610A87k7j2MK1K3lm4n2j1L9M8K0qk3l5l7j6K1M2L8K7J6lk7l0j1lk0k9nK9L1J0kPRj3l7l4
$$ 187 160 148 152 173 196 193 149 97 86 125 173 193 185 162 127 90 74 95 137 175 202 218 215 188 158 147 144 124 95 90 119 150 160 158 165 174 161 124 90
-615I0jL1L8J7j9m0l4rOKmPL1L7J5j8l5l3j8jJ1J2PJ5M3N6K6k2l2ML8K4j5l5l1k6k2pJ9L1
$$ 90 89 120 158 175 156 116 82 73 79 81 77 84 115 152 167 149 114 81 63 62 73 85 92 107 150 206 232 210 178 182 220 244 229 194 163 137 115 108 127 158
-620A58K6K4K8J9nk5k5j5rrj2j8k2oK8M7K9j2m0l8j9jJ2K5L7M2L2J2jJjk2m9m7j4J6J7Nlq
$$ 158 184 208 236 255 250 225 200 185 176 167 155 137 115 109 137 184 213 201 161 123 104 103 115 140 177 219 251 263 262 263 262 240 191 144 130 146 163 168 165 157
-625A57k0k2jK5K2lj3jJ7J7NkmjOJ4J1KkMJ4J4Kj9m5n1k6J4K9J4MK2L7J2l4m7j3L2L8Ll9n3
$$ 157 137 115 114 139 161 158 145 144 161 178 183 181 177 176 182 196 207 209 207 211 225 239 241 222 177 126 100 114 143 157 161 183 220 232 198 151 138 170 208 211 172 119
-630A19l3JJ4kj2J6O0O5J6l3l9j1Kj2k7j8NJ6J2MLRJ4J1Q%j6l3k6J9O3N2om2j4L6M4J4j0k1
$$ 119 86 87 101 99 87 103 163 228 244 211 172 161 163 151 124 106 111 127 139 143 146 155 169 180 188 188 172 139 113 132 195 247 241 199 185 221 265 279 269 248
-635B48m4o5m7ML0Oj8j0lk3l5%M8N4K3OJ6J4j9m8m9k9lK4L8K4KJ2M3L7k1o4l4L4O3L1j4l2
$$ 248 204 139 92 96 126 132 114 104 101 78 43 43 91 145 168 174 190 204 185 137 88 59 56 80 118 142 144 156 199 236 215 151 117 151 214 245 231 199
-639A99l1k4jL7N9L5j7n5m8j3J6K0NnNK6L4J4k1l9k9pPJ0J0QjrmJ0Ol0n7m4oJ1JLL2N1L1L
$$ 199 168 144 143 180 239 274 257 202 154 141 157 177 182 177 182 208 242 256 235 196 167 160 167 177 187 195 194 185 181 191 197 167 110 66 60 71 72 75 107 158 189 192
-645A92JJ6J3noJ2K2J1joj6m1m9j9K7M0J1k2k6jK2K0Jj2qJmk6m3l0PL1K2jmJ0J1rk2oJ7J0
$$ 192 193 209 222 217 211 223 245 256 255 249 233 192 143 124 151 191 202 180 154 153 175 195 196 184 176 177 173 147 104 74 81 112 134 133 129 139 150 141 119 113 130 140
-650A40j3j6OJ1pj4J5L6Ql7l0K5N7K7k1l0j0LNJ4K1Ll0l8j1K0K6J8J3jk8m1j3L0L6kk5NM9
$$ 140 127 111 117 128 121 107 122 158 166 129 99 124 181 208 187 157 147 150 155 169 190 193 163 125 114 134 160 178 191 190 162 121 108 138 174 172 147 152 201
-654B01N2J5j3j4j4l3m7k9LJ6RNK2M0L1ml8m5l0j7j8j9jK8M2K8%j8j5J0L3K7j1l8k1J8K2j7
$$ 201 253 268 255 241 227 194 147 118 121 137 146 151 173 213 244 240 202 157 127 110 92 73 72 100 142 170 170 152 137 147 180 207 196 158 137 155 177 160
-659A60l7lM3L8ol6k9j5oPK4K0qk6j6loj4j2jjnLK4L7K9J1pj4nJ2J7QNJ9L4K5LKK0K9Ol3n3
$$ 160 123 120 163 201 195 159 130 115 109 116 140 160 152 126 110 107 101 87 75 74 73 68 71 95 132 161 172 165 151 146 158 175 183 188 207 241 266 269 271 291 320 326 293 240
$$ [...]
-1605B50
##END=	
##END=	
