##TITLE=	Pq3uDxwZSpaH1BEM9GPsXg.54.ser
TM-VI-169 acetone-d6 Mg+Bz-pyr. hmbc

##JCAMP-DX=	6.0	$$ MestReNova 14.3.0-30573
##DATA TYPE=	LINK
##BLOCK_ID=	1
##BLOCKS=	2    
##ORIGIN=	Mestrelab Research S.L.
##OWNER=	hrzepa
##$MNOVA/LINK_BLOCK_TYPE=	ITEM	$$ NMR Spectrum
##$MNOVA/ITEM/POLYGON=	(XY..XY)
5321,5835
8722,5835
8722,8208
5321,8208
5321,5835
##$MNOVA/ITEM/Z=	0
##$MNOVA/ITEM/ANGLE=	0
##TITLE=	Pq3uDxwZSpaH1BEM9GPsXg.54.ser
##JCAMP-DX=	6.0	$$ MestReNova 14.3.0-30573
##BLOCK_ID=	2
##DATA TYPE=	MNOVA NMR VIEW DATA
##DATA CLASS=	MNOVA VIEW DATA
##$MNOVA/2D/THRESHOLD=	2.2195596694946289063
##$MNOVA/ITEM/ZOOM/X=	-0.47893103590269503478,	14.508270000071124883
##$MNOVA/ITEM/ZOOM/Y=	-9.5608721214139968936,	250.07129999451962021
##END=	
##TITLE=	Pq3uDxwZSpaH1BEM9GPsXg.54.ser
##JCAMP-DX=	6.0	$$ MestReNova 14.3.0-30573
##BLOCK_ID=	3
##DATA TYPE=	nD NMR SPECTRUM
##DATA CLASS=	NTUPLES
##NUMDIM=	2
##ORIGIN=	Bruker BioSpin GmbH
##OWNER=	nmr
##.OBSERVE FREQUENCY=	400.20280139999999847
##.OBSERVE NUCLEUS=	^1H
##.SOLVENT NAME=	Acetone
##.PULSE SEQUENCE=	hmbcgplpndqf
##LONGDATE=	2021/11/18 22:34:17.000
##.ACQUISITIONMODE=	SIMULTANEOUS (DQD)
##$ORIGINAL FORMAT=	Bruker XWIN-NMR
##$MNOVA/SCALES_VERSION=	9
##$PARAMETER FILE=	(acqu2s, ASCII, /private/var/folders/f6/rjf_tdyn2v98c5c0wvkgn4s80000gn/T/Pq3uDxwZSpaH1BEM9GPsXg/54/acqu2s, 0)
$$ ##TITLE= Parameter file, TOPSPIN		Version 3.2
$$ ##JCAMPDX= 5.0
$$ ##DATATYPE= Parameter Values
$$ ##NPOINTS= 129	$$ modification sequence number
$$ ##ORIGIN= Bruker BioSpin GmbH
$$ ##OWNER= nmr
$$ $$ 2021-11-18 22:53:53.959 +0000  nmr@CZC2439F63
$$ $$ /opt/topspin/data/agmb/nmr/Nov18-2021/54/acqu2s
$$ $$ process /opt/topspin3.2/prog/mod/go
$$ ##$ACQT0= 0
$$ ##$BF1= 100.63037
$$ ##$FnMODE= 1
$$ ##$NUC1= <13C>
$$ ##$NusJSP= 0
$$ ##$NusT2= 1
$$ ##$NusTD= 128
$$ ##$O1= 12075.7644147886
$$ ##$SFO1= 100.642445764415
$$ ##$SW= 260.109045168497
$$ ##$SW_h= 26178.0104712042
$$ ##$TD= 128
$$ ##END=
$$ 
##$PARAMETER FILE=	(acqus, ASCII, /private/var/folders/f6/rjf_tdyn2v98c5c0wvkgn4s80000gn/T/Pq3uDxwZSpaH1BEM9GPsXg/54/acqus, 0)
$$ ##TITLE= Parameter file, TOPSPIN		Version 3.2
$$ ##JCAMPDX= 5.0
$$ ##DATATYPE= Parameter Values
$$ ##NPOINTS= 12	$$ modification sequence number
$$ ##ORIGIN= Bruker BioSpin GmbH
$$ ##OWNER= nmr
$$ $$ 2021-11-18 22:53:57.400 +0000  nmr@CZC2439F63
$$ $$ /opt/topspin/data/agmb/nmr/Nov18-2021/54/acqus
$$ $$ process /opt/topspin3.2/prog/mod/shimcntl
$$ ##$ACQT0= 1000000
$$ ##$AMP= (0..31)
$$ 100 100 100 100 100 100 100 100 100 100 100 100 100 100 100 100 100 100
$$ 100 100 100 100 100 100 100 100 100 100 100 100 100 100
$$ ##$AMPCOIL= (0..19)
$$ 0 0 0 0 0 0 0 0 0 0 0 0 0 0 0 0 0 0 0 0
$$ ##$ANAVPT= -1
$$ ##$AQSEQ= 0
$$ ##$AQ_mod= 3
$$ ##$AUNM= <au_zg>
$$ ##$AUTOPOS= <47 >
$$ ##$BF1= 400.2
$$ ##$BF2= 100.63037
$$ ##$BF3= 400.2
$$ ##$BF4= 400.2
$$ ##$BF5= 400.2
$$ ##$BF6= 400.2
$$ ##$BF7= 400.2
$$ ##$BF8= 400.2
$$ ##$BYTORDA= 0
$$ ##$CAGPARS= (0..11)
$$ 0 0 0 0 0 0 0 0 0 0 0 0
$$ ##$CFDGTYP= 0
$$ ##$CFRGTYP= 9
$$ [...]
$$ 0 0 0 0
$$ ##$ShimPowMaxUC= (0..63)
$$ 130000 130000 130000 130000 130000 130000 130000 130000 130000 130000 130000
$$ 130000 130000 130000 130000 130000 130000 130000 130000 130000 0 0 0 0
$$ 0 0 0 0 0 0 0 0 0 0 0 0 0 0 0 0 0 0 0 0 0 0 0 0 0 0 0 0 0 0 0 0 0 0 0 0
$$ 0 0 0 0
$$ ##$ShimPowMaxUG= (0..63)
$$ 524287 524287 524287 524287 524287 524287 524287 524287 524287 524287 524287
$$ 524287 524287 524287 524287 524287 524287 524287 524287 524287 0 0 0 0
$$ 0 0 0 0 0 0 0 0 0 0 0 0 0 0 0 0 0 0 0 0 0 0 0 0 0 0 0 0 0 0 0 0 0 0 0 0
$$ 0 0 0 0
$$ ##$ShimPowRcbType= 3
$$ ##$ShimPowRes= (0..63)
$$ 1e-20 1e-20 1e-20 1e-20 1e-20 1e-20 1e-20 1e-20 1e-20 1e-20 1e-20 1e-20
$$ 1e-20 1e-20 1e-20 1e-20 1e-20 1e-20 1e-20 1e-20 0 0 0 0 0 0 0 0 0 0 0 0
$$ 0 0 0 0 0 0 0 0 0 0 0 0 0 0 0 0 0 0 0 0 0 0 0 0 0 0 0 0 0 0 0 0
$$ ##$ShimPowRng0= (0..63)
$$ 1 1 1 1 1 1 1 1 1 1 1 1 1 1 1 1 1 1 1 1 0 0 0 0 0 0 0 0 0 0 0 0 0 0 0 0
$$ 0 0 0 0 0 0 0 0 0 0 0 0 0 0 0 0 0 0 0 0 0 0 0 0 0 0 0 0
$$ ##$ShimPowRng1= (0..63)
$$ 1 1 1 1 1 1 1 1 1 1 1 1 1 1 1 1 1 1 1 1 0 0 0 0 0 0 0 0 0 0 0 0 0 0 0 0
$$ 0 0 0 0 0 0 0 0 0 0 0 0 0 0 0 0 0 0 0 0 0 0 0 0 0 0 0 0
$$ ##$ShimPowRng2= (0..63)
$$ 1 1 1 1 1 1 1 1 1 1 1 1 1 1 1 1 1 1 1 1 0 0 0 0 0 0 0 0 0 0 0 0 0 0 0 0
$$ 0 0 0 0 0 0 0 0 0 0 0 0 0 0 0 0 0 0 0 0 0 0 0 0 0 0 0 0
$$ ##$ShimPowRng3= (0..63)
$$ 1 1 1 1 1 1 1 1 1 1 1 1 1 1 1 1 1 1 1 1 0 0 0 0 0 0 0 0 0 0 0 0 0 0 0 0
$$ 0 0 0 0 0 0 0 0 0 0 0 0 0 0 0 0 0 0 0 0 0 0 0 0 0 0 0 0
$$ ##$ShimSysFunc= (0..63)
$$ 1 2 3 4 5 7 9 11 15 16 8 10 12 14 6 17 13 18 19 20 0 0 0 0 0 0 0 0 0 0
$$ 0 0 0 0 0 0 0 0 0 0 0 0 0 0 0 0 0 0 0 0 0 0 0 0 0 0 0 0 0 0 0 0 0 0
$$ ##$ShimSysMatrix= 0
$$ ##$ShimSysType= 1
$$ ##$TFXNUM= 0
$$ ##$TRIPLO2= 0
$$ ##$VTU= 2
$$ ##$VTUETH= <149.236.99.20>
$$ ##$VTUTY= <no>
$$ ##$WBREFAM= (0..15)
$$ 135.5 97.7 100 100 100 100 100 100 100 100 100 100 100 100 100 100
$$ ##$WBREFLM= (0..15)
$$ 0 0 0 0 0 0 0 0 0 0 0 0 0 0 0 0
$$ ##$WBREFPH= (0..15)
$$ 72.26 -67.22 0 0 0 0 0 0 0 0 0 0 0 0 0 0
$$ ##$WBSGU= (0..15)
$$ 0 0 0 0 0 0 0 0 0 0 0 0 0 0 0 0
$$ ##$XFAC= 2
$$ ##END=
$$ 
##$DECIM=	3328
##$DSPFVS=	20
##.ACQUISITIONSCHEME=	NOT PHASESENSITIVE
##NTUPLES=	nD NMR SPECTRUM
##VAR_NAME=	FREQUENCY1,	FREQUENCY2,	SPECTRUM
##SYMBOL=	F1,	F2,	Y
##.NUCLEUS=	13C,	1H
##.OBSERVE FREQUENCY=	100.64244576441500101,	400.20280139999999847
##VAR_TYPE=	INDEPENDENT,	INDEPENDENT,	DEPENDENT
##VAR_FORM=	AFFN,	AFFN,	ASDF
##VAR_DIM=	512,	512,	262144
##UNITS=	HZ,	HZ,	ARBITRARY UNITS
##FIRST=	25164.767445380970457,	5806.2096540000038658,	0.26033675670623779297
##LAST=	-962.11409912165936476,	-191.66820056731904742,	0.18069373071193695068
##MIN=	-962.11409912165936476,	-191.66820056731904742,	0.00084926810814067721367
##MAX=	25164.767445380970457,	5806.2096540000038658,	13.070103645324707031
##FACTOR=	1,	1,	0.0032274360278786063012
##PAGE=	F1=25164.8
##FIRST=	25164.767445380970457,	5806.2096540000038658,	0.26033675670623779297
##DATA TABLE=	(F2++(Y..Y)), PROFILE
$$ [...]
##PAGE=	F1=-1933.56
##FIRST=	25164.767445380970457,	5806.2096540000038658,	0
##DATA TABLE=	(F2++(Y..Y)), PROFILE
466A10Q9o9M9o5QP6k6k4r2O5J4j21L8J04r8P7j1K8j5q5K3j8P1j6j7N4O4q2p6j2P0O0l1J7J48
55C07j75p3L1P2r6l6R5j6J25n3j25J96o1O5n7r1M2p3L0L1j06
$$ y = [110, 199, 130, 179, 114, 122, 198, 172, 148, 56, 121, 135, 14, 52, 156, 58, 135, 124, 152, 137, 52, 75, 57, 128, 112, 95, 149, 213, 131, 55, 43, 113, 173, 142, 159, 307, 132, 59, 90, 162, 66, 30, 125, 109, 234, 181, 56, 252, 191, 256, 199, 108, 150, 77, 107, 138, 32]
-192C2
##PAGE=	F1=-2035.82
##FIRST=	25164.767445380970457,	5806.2096540000038658,	0
##DATA TABLE=	(F2++(Y..Y)), PROFILE
5806I8n3K0M1j5J25n1o0N7r3J03j28Q4K3J5M5j8o5n5O6R7p1n7o5M5J75l9J9q1r9O5r7K02L4
5419B67k53J0N5M6M8K5N6k3j58P1m1j9n1MM5O1M7m6j9J23j01q0J02J27o7n7p3K0k7O8j00o
5043E4l8QR3J14qp9J01o3p2j0L3j4K1Lr8P3o2K06r4p3Q2k0n5J23j81J99j49K0n3J23j7k4m5
4656I8J04m8n8m5O8l0J17K0k08K18o9P3rr6r6O1J65n9N2p6j18M7K5N7P7j68K7R0j37L4L3p0
4280G9j5J54N4j59k9RR2J4J6j35J29K6n1j17K9L1J3J0J05o0r6n0J55K1j1k2q7J74Mk35Nk8
3905B5P1J51J7k11%K2J12L3q1J8O1n0J30Q5l40J24n9L7q3J63n8o9l1O3j07J37q4M1l4J1J52
3541B46m2j43lM9N2K3k4p0J31j12j4l1Q7r4J1JL4K5jM1p5J6J8O1j10K7m8J2R1M6j30Q5Kj05
3142E6N6l2Q2pj15O1P5j4l1np3J05j1r6R1n3J4Q5j8l8R3j14O5o3p8P0Q2L2r5o0RJ0J13r7L8
$$ y = [98, 45, 65, 106, 91, 216, 165, 105, 162, 69, 172, 44, 128, 151, 166, 211, 193, 128, 73, 139, 236, 165, 108, 43, 88, 263, 224, 243, 162, 63, 128, 31, 233, 267, 14, 24, 79, 125, 173, 198, 254, 231, 73, 144, 103, 84, 33, 37, 82, 143, 190, 144, 125, 248, 147, 67, 169, 296, 229, 172, 99, 119, 92, 160, 60, 54, 16, 24, 117, 231, 223, 144, 245, 182, 110, 100, 133, 119, 140, 143, 45, 118, 56, 262, 168, 95, 177, 157, 102, 225, 44, 243, 94, 114, 61, 184, 167, 143, 98, 202, 154, 96, 51, 119, 89, 206, 226, 18, 236, 167, 240, 231, 135, 39, 100, 265, 206, 258, 182, 64, 111, 136, 193, 270, 102, 129, 219, 82, 116, 149, 79, 64, 218, 272, 113, 84, 93, 185, 199, 215, 80, 209, 235, 184, 67, 96, 127, 140, 150, 255, 195, 99, 49, 204, 225, 214, 192, 105, 279, 283, 48, 53, 25, 96, 247, 264, 53, 53, 75, 187, 220, 139, 157, 218, 168, 298, 383, 43, 167, 108, 145, 62, 225, 167, 98, 67, 130, 23, 160, 76, 117, 83, 94, 246, 204, 61, 58, 107, 159, 182, 158, 88, 219, 107, 93, 62, 149, 55, 66, 67, 101, 126, 125, 166, 91, 107, 125, 186, 76, 103, 55, 67, 158, 204, 74, 159, 161, 56, 112, 80, 162, 155, 40, 101, 176, 162, 131, 126, 53, 158, 147, 51, 142, 89, 103, 188, 170, 132, 225, 111, 176, 113, 35, 105, 187, 219, 124, 64, 73, 83, 196, 99, 137]
2731A37L4N6M4Jj29L2J23j2j87Q2r9J28kj6p7J79p7p7j3K17r5k17M4j8N4L10k28J6j30OK1
2367A07O4%q2N5M3j37J00j08P8%J74o6n1Q2J40l70K04k28P6J46N8k07Q7l7lo0%K8K1J05n1
2003A68O0M9j12l4r6pJ47J2K4j18M3R0L3q3P7%m3K08Ll31K1l3N9L6r0J50j10O6l3k2n0KQJ38
1604B32M6J4j93n7kl7J77j8m4L2k3Ql7J73q3j22J8J51j00o6n3J53p7j4R7P8o6np5J25n5p2
1229A05P9j45K65qj21o0J05N3j65M5m8p3J49j2j30J17k4k3K2l4N0K6o9Q3o0n4m3J96j62P8
876A42jj02J41n5Kn3J18Rk5K3l7m9q1R5J9pK22k10J1kr8mO2J21j6j44%ONJ23r5K0J25M6k24
466H7Q0m5M8q9J0J20q2k3k2P9l9r3L8J07q5K5KK7m3r5L9K3N8j09J08RP1o9k8p9M8N3l1K0J18
55B38j43m3K1Q0o0nO4l7J13p7o2J74p5Q7j13m3J9m2L3j0r7
$$ y = [137, 171, 227, 271, 272, 143, 175, 298, 286, 99, 181, 82, 210, 208, 192, 115, 294, 217, 140, 127, 344, 249, 32, 76, 58, 112, 422, 194, 210, 80, 86, 107, 171, 171, 89, 144, 187, 50, 150, 42, 120, 120, 294, 228, 177, 259, 399, 29, 233, 5, 81, 227, 285, 78, 165, 128, 125, 65, 65, 93, 114, 219, 168, 228, 277, 165, 131, 35, 28, 175, 187, 211, 93, 136, 226, 259, 176, 253, 253, 210, 418, 421, 90, 111, 78, 137, 173, 83, 233, 123, 189, 156, 134, 84, 86, 94, 232, 278, 292, 99, 42, 40, 3, 180, 162, 118, 150, 127, 135, 98, 271, 188, 66, 84, 235, 135, 69, 16, 169, 92, 78, 175, 253, 187, 182, 107, 232, 177, 105, 184, 39, 304, 296, 175, 115, 220, 273, 108, 153, 105, 32, 181, 169, 39, 156, 132, 109, 131, 97, 147, 173, 104, 187, 127, 73, 30, 226, 64, 142, 141, 39, 180, 125, 127, 74, 192, 201, 176, 199, 162, 113, 32, 127, 146, 139, 361, 151, 162, 160, 62, 58, 120, 241, 225, 81, 81, 87, 92, 215, 120, 140, 265, 311, 87, 167, 122, 170, 81, 91, 211, 129, 106, 84, 163, 124, 31, 69, 176, 91, 116, 118, 145, 102, 7, 46, 69, 127, 18, 126, 135, 206, 137, 109, 30, 78, 131, 100, 120, 238, 95, 52, 73, 153, 93, 88, 152, 115, 228, 151, 89, 263, 188, 275, 162, 119, 138, 96, 129, 119, 22]
-192B2
##PAGE=	F1=-2138.08
##FIRST=	25164.767445380970457,	5806.2096540000038658,	0
##DATA TABLE=	(F2++(Y..Y)), PROFILE
5806I1m9L1O3r0J50j9n8Q2j63Q5p3J15JJ8N0p9nq3P2J19j05m5o3J01J05l7N4p5r9K7p8J90
5431B33Nk16M3M5N4j7JR1M3j28n1K9l9o0mM0N1P6j7m0J18j86M0N1J62j16q8l6N1ML5j10K3
5043H7M1k4L6P9l5m1J37j47OK6K0l1j9Kn7K9k5J70m6j63J11ro3J34j82K24j91J01j63J88k1
4679A74k1l9J09o1j8l2O0o2P9L8j76J72j7L3J7j49r6N2J47j3K7q8p7P3LO3N7j24LJ03j93J11
4304A55J3j25J6J77N2j47k8ML4O8nj53J64J8n1r9KN5j2l9J11k8m7j19J92R8n6p7q5K01k9j88
3928G2l2pR4J19pj92k5PJ44L4q2O2R9r4P7Q1k92J10n6K7r5K19o7j22k4P4p6J34j07K4k2k8
3553D9J27j6r5kJ6P3L1m7j4R4j84J02p3R6r7QQJ2LM2M5q6NK1M3j33L4k3K2Q7J12k16Q2J9r9
3142D6P2l5L9K1p0N8K7Lr2L5r0J78m3j21Q0j0K5Q4j1n6Q3p2M2o2j16N8P9J9m6p6j3J04O4j30
$$ y = [91, 42, 73, 136, 46, 196, 177, 119, 201, 38, 123, 50, 165, 166, 184, 234, 155, 150, 67, 139, 258, 153, 108, 45, 146, 251, 214, 268, 193, 94, 121, 43, 233, 238, 22, 65, 110, 164, 147, 148, 239, 282, 154, 103, 132, 93, 33, 29, 69, 120, 196, 179, 139, 257, 71, 111, 162, 324, 208, 120, 84, 135, 139, 174, 64, 87, 128, 104, 140, 219, 184, 143, 280, 133, 139, 165, 185, 154, 135, 137, 80, 109, 84, 254, 208, 45, 156, 147, 84, 218, 36, 260, 69, 170, 7, 195, 174, 153, 114, 223, 162, 144, 112, 172, 110, 189, 227, 51, 223, 206, 239, 256, 107, 11, 63, 210, 197, 224, 136, 59, 132, 135, 198, 255, 131, 134, 237, 44, 155, 168, 43, 59, 236, 288, 141, 113, 117, 151, 219, 214, 61, 225, 243, 192, 93, 95, 150, 138, 99, 210, 182, 135, 16, 208, 306, 250, 173, 88, 289, 260, 72, 40, 33, 127, 246, 239, 47, 22, 29, 173, 207, 125, 187, 286, 192, 269, 350, 58, 168, 112, 139, 44, 263, 196, 74, 50, 124, 48, 182, 75, 99, 77, 49, 176, 160, 65, 63, 79, 152, 183, 136, 122, 216, 32, 134, 61, 157, 60, 68, 76, 88, 91, 133, 178, 92, 97, 118, 161, 28, 62, 39, 61, 148, 260, 44, 126, 145, 46, 118, 83, 122, 143, 73, 131, 158, 161, 69, 104, 14, 192, 149, 28, 108, 98, 123, 207, 196, 140, 223, 151, 193, 131, 15, 73, 152, 171, 125, 49, 36, 140, 204, 74]
2743G4J14kL7K3Pj52L1J58k7j29L1j13J93o1%q1K01o9o0qK06p7j98j0m3R2K86k01q6r2R2l
2367A33J8n7L2m2J05o9M6q9K9J3J05n7N2Q4N1k66J85k31R6P8Q5k07N4k4J3q8M7J8j1J39k6
2003B16j5N6r5j0q6k4J42L6L0k37L2J66K7n5J22m6o4J71J3k94LL2M0lm7J12q5L1p2Q4r6k6
1628E8K3J70Q0n6j52k8n7J8P8J8p3J02l7k5OJ87j09j41K8J04q6r8L6J15q4MJ34O4j36K6p2
1264I7P3k4p4Q9j04K50K2j47o0P1J3n9o0Ql2J01o4q3J00NK7m3lL1O3r0R0k7j08rJ33j00L9
876A25j1p9J51p7N0o4O6OK3J2q5m3m5J06L6l0K28k12P1k5j71lJ33N0j6j04Pl3J00Q1j57QJ61
489B59P2k09kJ6J1j01RJ42j01n2P8Q3q9n5L2Q7m9n5L2L0q1j6K5L5K4m7P3j3M1k2nj20J9Q0
90A31n6k6J03r0j9K5P8l6K5L0n1J00o6m7J55r0J20j62ok1nM3k8l9
$$ y = [74, 188, 186, 223, 246, 253, 101, 132, 290, 263, 134, 165, 52, 245, 184, 184, 103, 304, 235, 175, 167, 373, 296, 98, 88, 45, 137, 423, 222, 136, 44, 136, 133, 151, 94, 126, 84, 189, 120, 166, 77, 106, 119, 224, 167, 219, 303, 354, 88, 273, 42, 138, 216, 301, 94, 148, 124, 137, 49, 96, 114, 103, 242, 216, 201, 257, 162, 152, 66, 42, 184, 220, 250, 13, 45, 211, 238, 183, 305, 259, 195, 366, 379, 85, 88, 120, 160, 157, 110, 222, 137, 168, 96, 180, 84, 58, 81, 251, 331, 275, 123, 95, 38, 56, 134, 152, 79, 181, 144, 119, 125, 312, 203, 62, 90, 194, 108, 10, 46, 161, 77, 81, 215, 279, 143, 169, 97, 170, 146, 72, 161, 57, 307, 329, 182, 122, 193, 206, 147, 87, 95, 63, 164, 100, 17, 117, 122, 149, 106, 103, 134, 197, 107, 197, 170, 62, 53, 186, 86, 125, 114, 35, 186, 109, 159, 95, 161, 167, 190, 202, 117, 74, 29, 135, 171, 141, 369, 157, 228, 203, 32, 29, 162, 212, 196, 92, 99, 66, 166, 247, 90, 98, 259, 331, 122, 120, 136, 147, 46, 55, 197, 96, 44, 122, 205, 116, 61, 93, 180, 131, 76, 108, 138, 57, 41, 66, 101, 125, 78, 151, 138, 179, 157, 152, 32, 51, 131, 75, 49, 152, 62, 43, 68, 146, 110, 135, 165, 114, 214, 148, 101, 256, 166, 286, 124, 118, 97, 92, 135, 107, 68]
-192F8
##PAGE=	F1=-2240.34
##FIRST=	25164.767445380970457,	5806.2096540000038658,	0
##DATA TABLE=	(F2++(Y..Y)), PROFILE
5806G9m2K7Q7j26J40K2n9J00j56Lk9J44j7J8N7j37Q5j25O6J17j24k5k9J16L2l0Q8o6j01Ql7
5442H6J52j7j83O2J8O6k5o1J14J15q4j82Q5l2p2qJ8L3J13Qo7J08k16J66m4J84j55j26K4O8
5090A48M5k7p0J5J10l7l7L0k6KJ57k13P5L6K0n3n9Qk4J5j3J47Qk14P5K0q0J43j39J93j78J16
4715A93j54J70l6l0j8R5o8N2l3L5n6pN2j23J22K7K4M0k21k1L4L9L5J3o6m7R0pO5K3o1k3J02
4327B40j57J20qj37KJ81N9j42m3ROR9l1j39J74Ro1l5l0K5j5p8J12Nj1r4J39J63q9j13l0J38
3952B68o2j07o6N9P6N1k5j67M4pP5L3p5Q5J20j10M1O3k30Q5k2J3j27K62n9j51j9R3n2J04j07
3588H6L1m9k4M5K4m2j4oR7L7q4L9N5j42J09o5P3n0l0K3l2lP3K1q7PK3J7j20K8lK6Q1J59k07
3177I6L4j8L8j9m5L3K9j4J5OMj45P5p1J90n1j43O2N3L4M4oo8P5qK1q8j09M9M0%no1OJ35Oj27
$$ y = [79, 37, 64, 151, 25, 165, 187, 128, 228, 72, 75, 46, 190, 173, 191, 248, 111, 196, 71, 137, 254, 130, 105, 76, 192, 224, 194, 282, 216, 115, 123, 86, 238, 221, 38, 100, 118, 184, 159, 98, 212, 327, 243, 61, 146, 114, 42, 34, 52, 85, 198, 206, 139, 247, 31, 197, 153, 337, 182, 56, 80, 148, 193, 166, 96, 111, 221, 184, 147, 177, 151, 153, 310, 97, 172, 208, 228, 175, 116, 124, 100, 115, 102, 249, 257, 43, 118, 138, 58, 201, 62, 255, 77, 193, 39, 209, 173, 143, 125, 220, 152, 204, 171, 206, 150, 143, 195, 72, 194, 221, 245, 285, 64, 43, 77, 116, 151, 164, 98, 51, 141, 134, 199, 222, 161, 138, 240, 83, 203, 195, 58, 60, 241, 300, 158, 115, 124, 130, 229, 198, 59, 233, 242, 181, 146, 116, 141, 126, 48, 160, 165, 154, 60, 199, 362, 273, 160, 130, 268, 206, 99, 33, 92, 168, 219, 194, 27, 71, 64, 139, 172, 97, 182, 302, 192, 233, 296, 66, 151, 129, 142, 15, 277, 218, 67, 48, 141, 89, 193, 86, 117, 68, 44, 89, 113, 71, 57, 51, 148, 185, 101, 140, 195, 53, 162, 97, 170, 120, 90, 113, 81, 78, 151, 172, 85, 92, 115, 132, 12, 40, 37, 63, 144, 303, 96, 130, 112, 150, 131, 86, 119, 148, 134, 149, 155, 159, 14, 89, 18, 208, 157, 14, 76, 129, 163, 207, 201, 133, 208, 200, 221, 133, 24, 73, 113, 113, 108, 47, 53, 188, 194, 67]
2743F7J52l3J1J1Oj47N4J71m8r0j1p9K13j14Op2K03n1n2qJ82m4j36p0q1J39K43j78j34m0J08
2379A78j9Nj32J32j21J36Kk4m5mJ2J6m6J38J21m6j70J51k00J14lR8j86OR%q3P1L1n4J55Pq9
1992A60O3p2Mo9oJ18M2L7j98k9J28L9l1J47p7p9J17Kk23j7Q7L1l4mO1n1Jj17J98j34m0JJ98
1604B53J12j24o1j3j17O4m8N3p6J62m7o4M1J90j25j29K0O0l5k7j0O2q3J3J61N5j92M0n1PK1
1240A12q8J08l7K01N6j68p6L1QK4j30N5rM3q3L1K0j5O6q5M8J3O9q5O3K7j34L2N1o6J5k2j4
853F1J31r8Q9n9oNR1k5j21k4L4O5L2m3K18j93J20n4j80O1R6j8k2n0%o6J78M7k05J2J77P9j52
466A80q9P7n7r3LJ42r2mR1Q1j21k8RP1k0j24P1M6j02K4L6M6l2RL2qoL8oj18pJ16p8n3L1k3
43D2jL3O1k5N6pn4Q4l6o0J30r4J49j92K4o6L2M9k0P
$$ y = [67, 219, 186, 197, 208, 214, 67, 121, 292, 244, 154, 143, 64, 277, 163, 169, 97, 300, 249, 197, 189, 371, 327, 191, 121, 40, 179, 422, 244, 110, 70, 178, 159, 164, 32, 164, 43, 179, 181, 157, 112, 108, 120, 136, 90, 228, 349, 303, 133, 284, 84, 198, 195, 293, 107, 113, 122, 122, 39, 110, 141, 87, 242, 249, 160, 223, 151, 155, 86, 80, 198, 240, 277, 79, 50, 178, 217, 186, 333, 256, 177, 294, 296, 73, 56, 143, 174, 140, 136, 197, 146, 147, 30, 228, 94, 54, 55, 253, 365, 241, 180, 167, 50, 114, 66, 119, 43, 205, 158, 94, 135, 325, 200, 71, 91, 151, 116, 89, 79, 141, 58, 71, 232, 287, 95, 135, 84, 91, 112, 24, 132, 95, 296, 352, 184, 108, 139, 147, 171, 41, 96, 87, 130, 47, 78, 98, 83, 149, 64, 112, 125, 194, 109, 172, 199, 65, 97, 148, 82, 97, 75, 61, 192, 94, 183, 124, 118, 123, 214, 189, 68, 44, 78, 143, 175, 132, 350, 157, 277, 223, 43, 104, 200, 182, 160, 110, 110, 44, 222, 269, 64, 76, 253, 332, 180, 91, 168, 111, 18, 21, 163, 71, 67, 158, 239, 118, 90, 99, 170, 150, 26, 97, 143, 41, 65, 101, 147, 115, 124, 156, 148, 142, 180, 174, 56, 49, 165, 87, 34, 65, 42, 41, 74, 135, 110, 166, 159, 105, 189, 153, 93, 223, 129, 278, 86, 110, 44, 76, 125, 105, 112]
-192A12
##PAGE=	F1=-2342.6
##FIRST=	25164.767445380970457,	5806.2096540000038658,	0
##DATA TABLE=	(F2++(Y..Y)), PROFILE
5806E9k5K0R4p0N2N4n3J02j06k3m9J46k8K0N9j76J71j67N1R9j17nL5P2l0j8J10m8r8qlJ26
5431B46k6j68P1%L7K0j15J10J79l5k47Q0j4q0k0J0QJ46K2j00R7j30J71j16J86j68j50J00O0
5090A74P6j09Rl8J68m1j04j7K0L2J66k55J06L3L7p7r2J5rK6qJ24N5j66n5O2j01J49j04J55
4738B31j08N4j22J72n8n6K5O2o6J24l8j2k7j07P2n5P0M9M4N0k78Q7M1j25M7PPn3R2j2Q0j3
4362A84ml3P3r1J18k1j35l0J70O7j39o5J2K4R0n2q7J50Jq0O7p6m0No2O7L3On9Q8J98j03j26
3975A50M4L5r1j5j09J50M0l1l8j15J00j3j4L0n9Q8J18j00L4K4j65P1K1mj24K35m2j42k0J07
3623A65m9O8p4M2q9J5o9P0ok4j7J17M6j30P7J1k2M3l0L6%n3K4p2lR9j6q3K9L3k8r2L4J2J9
3212H3P1J71j82Ln7J64j05n8N1MM5l6J5k1p9K3n4J80l4j29K5P5M2j7Lo9O9O8Rj36q5P1l5J8
$$ y = [59, 34, 54, 148, 78, 130, 184, 131, 233, 127, 104, 55, 201, 173, 193, 252, 76, 247, 80, 131, 230, 113, 108, 143, 215, 185, 167, 277, 229, 131, 123, 120, 246, 220, 52, 123, 123, 160, 180, 65, 175, 354, 319, 72, 152, 138, 58, 38, 48, 56, 202, 224, 124, 221, 91, 262, 146, 332, 164, 14, 114, 174, 250, 141, 150, 112, 280, 239, 135, 118, 138, 170, 336, 81, 187, 220, 257, 180, 88, 103, 94, 120, 112, 236, 291, 125, 70, 132, 31, 180, 76, 231, 123, 177, 55, 227, 169, 113, 138, 200, 134, 258, 220, 208, 181, 74, 146, 91, 161, 210, 254, 304, 26, 113, 154, 29, 76, 83, 90, 37, 129, 117, 197, 184, 180, 147, 220, 129, 247, 226, 91, 61, 231, 298, 159, 94, 106, 130, 220, 168, 81, 231, 232, 152, 219, 143, 103, 108, 46, 113, 146, 152, 93, 181, 379, 276, 150, 194, 229, 138, 123, 14, 164, 204, 173, 135, 20, 120, 107, 93, 123, 64, 152, 270, 170, 204, 228, 63, 134, 155, 151, 27, 262, 220, 78, 58, 165, 116, 184, 110, 152, 63, 78, 9, 79, 73, 49, 32, 149, 195, 65, 142, 153, 131, 174, 144, 180, 180, 127, 151, 79, 76, 175, 159, 76, 105, 138, 110, 18, 52, 64, 83, 154, 325, 143, 146, 89, 253, 148, 90, 141, 145, 190, 154, 169, 148, 69, 92, 38, 218, 184, 55, 80, 155, 197, 180, 183, 114, 183, 251, 260, 124, 39, 110, 75, 93]
2813I3npL0J14n8p3J43o2k0P%j16J14J50p3q6m1k3K02j49J1n8J93k5o5%J46lq6j10r5J83J86
2426D17j63j21m4J12l4J4r8J02j08Q2O1j03M1l1%n9j9J55J77j18j09J13j45J16o9R1j44n2
2097F4N4k9m7O0O4q6J47L0j39O6o1J3m7RJ07L9M3j37n1L1O3j2J52r1q6N9k6j19l9J09L9n0
1722A29K4J5j5j8r1K17j59o0K0J77J32j75M9lj58Q0r4J3k7J60m9j03O0J80j28r4J2J4K8L9
1369A75o7Np3J6J73N2k27L1j2l6O5o3Q0PJ45R2j85j02mP5K6j48J01k7j5L0K5m2p0Q6q0Q0j
982A12N6n8PR0j32O1k6n5QJK0J09j12J13m6p6J0J43o5j14J6N4L0J2m7J96j50J45r1j18Q9M3
606B25p5k9J2k0q1K19K3k24L7J62P0r3r9Q3j42n1pJ18p0R0L7P7j37jl1O2j1j01M5P4p8j9P0
219A35O1j00L6J1Ml7Q6k0r8k2J39q2kr5K0J3L7K9k1Q6m4m5N9%o0Q4q5J58j92N2o0L2L1lM0
$$ y = [93, 88, 81, 111, 225, 167, 94, 237, 175, 155, 162, 162, 46, 160, 310, 237, 151, 110, 87, 289, 140, 151, 93, 286, 261, 196, 196, 342, 339, 253, 143, 48, 231, 417, 254, 133, 89, 201, 167, 181, 83, 185, 77, 159, 220, 117, 158, 127, 127, 68, 49, 204, 381, 263, 154, 267, 122, 238, 169, 260, 116, 64, 118, 89, 42, 102, 166, 80, 227, 257, 118, 184, 123, 136, 89, 98, 205, 244, 287, 150, 99, 130, 193, 181, 333, 242, 156, 215, 189, 70, 31, 140, 179, 129, 153, 168, 153, 135, 44, 261, 102, 42, 62, 239, 371, 196, 245, 242, 84, 164, 70, 83, 56, 216, 167, 64, 124, 304, 176, 82, 94, 108, 136, 175, 108, 113, 40, 56, 229, 281, 54, 85, 73, 37, 102, 39, 119, 126, 271, 363, 178, 76, 72, 147, 173, 25, 126, 99, 84, 114, 139, 97, 27, 113, 33, 113, 112, 168, 110, 117, 207, 75, 136, 110, 55, 63, 64, 84, 193, 81, 194, 148, 72, 82, 225, 160, 46, 62, 116, 146, 158, 111, 307, 157, 302, 211, 93, 182, 225, 150, 121, 133, 113, 32, 251, 274, 50, 87, 249, 319, 226, 127, 210, 68, 17, 10, 128, 58, 148, 185, 262, 125, 124, 93, 155, 144, 43, 88, 162, 84, 65, 135, 196, 96, 132, 143, 147, 110, 196, 176, 78, 56, 195, 113, 111, 16, 36, 49, 86, 115, 94, 180, 136, 91, 150, 150, 90, 174, 89, 247, 55, 107, 47, 79, 110, 107, 147]
-192A47
##PAGE=	F1=-2444.85
##FIRST=	25164.767445380970457,	5806.2096540000038658,	0
##DATA TABLE=	(F2++(Y..Y)), PROFILE
5806C1RK2O8kk6O4m2Q8m4Kr5J26l2K7M7j67K09j92L2P1p9J0R9j1p5mJ13j8q0l6K6J06k8j59
5407F0O9K1n1R0j18O3K21J4k41L3%q6l6L8MJ40J9j41Q1l3J46j45J62j48j15J15N5Q1j86R3
5055B05j12K07l3j56n2Q2N5J59k79R8K7O6r7j11J5oM2OR7R3j04j70R9r9J33r7J27j3n2p5J87
4691B42p7q6Q0J4m6J64m0p0J5j84R6NK6L5Q2N0k53J33M4j14r8jR9o9M7k1J14k8K4k6J6j5J19
4304B77k4j31o7J58O7j29q9PO7N1n3k2J05jj05J89j31r7J4kJM0Pk7M6K04j05j05J03m7j01
3940A00M3j23K19j4j03n0kQ5l2p4K6k6O6R0p1N3k8j09R1M1k5r0J50j5r3m3J16n3K9j7L9j16
3564F4L6l4Qnk5k1J38N6j57P8l3R6k6QnM8n9Qj01j2J36n3p6O2N4p8q2N0J7K0O9J38j51j9m2
3154A07K29j77o3O4l8J05q3M3o3jj1o5J83oj32L5L5M7p9J4n4O4J39J3j94m7Q3r4R1o4M9L6
$$ y = [31, 40, 62, 130, 128, 102, 166, 124, 212, 168, 170, 75, 201, 169, 196, 243, 76, 285, 93, 125, 196, 117, 127, 226, 215, 140, 136, 249, 231, 151, 115, 141, 247, 219, 60, 129, 150, 99, 189, 71, 134, 355, 369, 128, 161, 161, 75, 39, 77, 81, 221, 240, 99, 180, 147, 293, 148, 310, 162, 47, 162, 217, 298, 112, 205, 93, 300, 267, 111, 59, 141, 196, 355, 76, 174, 201, 267, 170, 59, 74, 68, 110, 116, 213, 306, 202, 32, 131, 32, 165, 68, 195, 182, 130, 55, 242, 165, 79, 159, 173, 127, 291, 251, 181, 196, 12, 108, 113, 139, 174, 256, 306, 53, 186, 230, 116, 18, 17, 116, 47, 94, 73, 187, 159, 183, 157, 173, 158, 277, 253, 122, 55, 213, 280, 151, 62, 69, 136, 187, 134, 112, 217, 216, 111, 300, 169, 72, 86, 84, 85, 125, 132, 105, 151, 355, 250, 145, 248, 201, 100, 143, 20, 239, 225, 122, 72, 70, 155, 123, 49, 75, 49, 115, 205, 134, 187, 159, 50, 141, 182, 157, 67, 217, 202, 109, 66, 182, 129, 158, 141, 180, 64, 100, 66, 74, 69, 44, 23, 161, 217, 60, 138, 105, 201, 175, 183, 178, 226, 167, 175, 74, 62, 198, 145, 69, 131, 185, 107, 25, 75, 92, 112, 181, 319, 168, 149, 107, 336, 159, 96, 160, 122, 227, 144, 187, 124, 123, 112, 47, 230, 224, 92, 127, 162, 209, 130, 144, 90, 154, 293, 306, 112, 65, 148, 54, 145, 81, 130, 166]
2778A66Q8j28K0J07r5n6J3j0m4J55J25r8j16m8K0J75j65K2m1J71Mr3J9J07L0n1j22q6K08J25
2426D02j51r7p1J16m9K3l9N1p3K6R5j63J50o7j2m0PM7K32j42r5Q3q7J03j02O1r2j03R9o2N
2062E5K0J05p7J12K2j53N9o6K6k5L0R0L3M8q3p9m1Q6J0J35r3q0Po3Qn2Q9N5n2K9rJ3j2l9J62
1651B70j67q2P7J21J27j94J42J1j75P2n4n2kJ13m4j26N3J60j13n2K3l9O8J03j13m9m3J2J60
1311B07N5k33QK4QM5k9M2K2Q8J24j91j19KJ41l6j27J43p1m4J57k5j00n9M1JK5lM6l3n7J40
935A92j10Q0q2n8QO6qR5j06J15l8r5lJ56q6n6K9L8Oj9m3J63q7J46j32k4J03k2j12l3P1m0o7
548D7K00Pj98N3J35M9n0n6O1k22K7j3Q1m3J39j9P4j42K9n8M0j8k8rJ01n4q6J15P1j60L9J2
172A24jk4J05l5q5k6J43p3L5r8NlK9mj7J02p1l2L2L5k1J5p7J39j45N9j3J0MkN8
$$ y = [166, 254, 126, 146, 253, 158, 102, 115, 105, 61, 216, 341, 243, 127, 79, 99, 274, 109, 131, 90, 261, 265, 172, 191, 298, 328, 277, 155, 69, 277, 402, 251, 154, 83, 199, 150, 173, 134, 185, 112, 138, 233, 70, 220, 153, 141, 101, 108, 155, 387, 245, 150, 233, 146, 249, 147, 208, 116, 13, 112, 50, 55, 75, 180, 103, 215, 237, 84, 143, 77, 103, 78, 108, 198, 231, 279, 196, 117, 76, 162, 172, 307, 214, 134, 141, 78, 86, 34, 123, 178, 126, 155, 146, 159, 147, 108, 270, 103, 21, 98, 219, 346, 152, 294, 305, 130, 202, 148, 96, 94, 207, 163, 37, 90, 250, 137, 85, 108, 69, 137, 240, 127, 78, 35, 47, 207, 262, 29, 37, 61, 69, 114, 85, 127, 149, 237, 361, 170, 51, 53, 194, 158, 31, 174, 103, 59, 216, 191, 91, 32, 73, 74, 99, 96, 142, 109, 52, 192, 82, 162, 80, 22, 30, 96, 88, 183, 77, 192, 154, 59, 56, 212, 126, 70, 99, 137, 143, 124, 81, 244, 157, 303, 171, 147, 250, 228, 116, 83, 154, 114, 47, 247, 254, 56, 109, 244, 293, 243, 187, 248, 26, 53, 40, 121, 78, 217, 198, 272, 130, 159, 101, 141, 123, 95, 86, 187, 133, 47, 162, 233, 73, 112, 124, 123, 99, 204, 169, 84, 58, 201, 128, 163, 65, 70, 67, 96, 92, 75, 177, 106, 74, 106, 141, 120, 135, 58, 197, 52, 111, 98, 108, 112, 110, 168]
-192A68
##PAGE=	F1=-2547.11
##FIRST=	25164.767445380970457,	5806.2096540000038658,	0
##DATA TABLE=	(F2++(Y..Y)), PROFILE
5806FN4J7K8O2o9L8l0N7K5L3j36J14l7M1J9j16J90j88K0L3k2J9J46r5j14OR5K3m2p7M8R1l9
5419B00j31M9P6j66J53q8LK32O2k11j1J3r2m8Q2J6J18Oj86N1N7J06j26J08j01j10J37O5O6
5078C30k42J59j80K15qj86o9J25Q5J30k82N2K9J04j15j05JL8PK9P4J15n1k00P9p2J00j00R5
4738A57Q6j57k5J87q2q7J05l1j3J55l6j15N4j03J9K5lj4J24M3j98J57L4q5r3lN4p3l8l1J47
4374A60mJ2pn2O2J17k1j19j09J53N6j00j12pJ06kqJ3N8lj22L00j82p4n7N8k6J3mkJ4J87j03
3987A95m6J30p7o7K8j16K56p6j41n6R6M7o4p3L9jON0l1Q2p6p4J38L0m4n4N9Pj1q0J10m9nL7
3588A69J9j23L6%j5k7k1mJ49O6j63N2m5J64q2L1m5R0m8k5j08l9J80q6n6Q7P7j13p6N0J5K5
3212A34Q2P2j15l6PK42k28n5O4q3J53j16P8j10P3k3q7J90J3j43O8l0M6j20J1k2O8J88L0k46
$$ y = [6, 60, 77, 105, 167, 98, 136, 106, 163, 188, 221, 85, 199, 162, 203, 222, 106, 296, 108, 128, 161, 139, 158, 304, 209, 95, 101, 196, 219, 177, 100, 148, 239, 200, 69, 118, 194, 28, 181, 93, 96, 328, 390, 179, 168, 181, 89, 41, 123, 139, 257, 263, 77, 128, 185, 291, 165, 273, 172, 62, 199, 264, 330, 88, 247, 67, 282, 274, 88, 19, 144, 229, 359, 77, 129, 158, 262, 147, 42, 43, 81, 88, 117, 191, 306, 255, 55, 134, 62, 162, 62, 157, 243, 86, 61, 248, 166, 79, 184, 153, 140, 295, 259, 144, 198, 95, 114, 139, 136, 122, 246, 289, 91, 248, 282, 197, 104, 101, 155, 82, 44, 13, 160, 156, 168, 161, 109, 171, 288, 267, 148, 39, 192, 248, 148, 36, 29, 135, 133, 125, 138, 196, 193, 71, 371, 189, 115, 58, 116, 90, 103, 99, 97, 111, 298, 195, 149, 279, 202, 135, 163, 47, 303, 227, 86, 30, 126, 173, 109, 36, 75, 74, 80, 130, 99, 181, 105, 31, 169, 199, 155, 101, 160, 167, 156, 76, 186, 137, 132, 169, 188, 65, 101, 101, 86, 59, 38, 34, 183, 249, 86, 138, 93, 257, 175, 206, 161, 251, 203, 178, 70, 31, 211, 125, 69, 156, 233, 120, 44, 94, 109, 134, 216, 288, 173, 137, 144, 386, 158, 103, 167, 84, 237, 121, 199, 89, 162, 139, 52, 242, 255, 112, 180, 150, 196, 76, 87, 65, 133, 321, 351, 105]
2860A05k0Q1r2J37j33R6L2P1k00J29O4j29r6L4j4K8J69J10j19j68rJ7J40j58L2k3J41L3j24
2520A34M6P1M8l4j01o5K04P0j38q1r6J16o4K1K6Pm1MR4j33K01j15j6KJ0p3K66j21j13O6m0
2156A55P8r3J2m6n5N5q9N7l9J40l2P4k3j33M3p8N2j8O2N2L3N2m3j05p7R3L5J01r0n7l4m9P5
1768A08o3O5O5n1J7nK6K0j7Q4j58m3P5Q0R5j78J97K5j66M8j7o0j4M0l2j16J7J30p7pM8q4N9
1381A11J59j36r8OK3J05O5k07J7lN4K8rK2K7L8J44j84r4L7J32j01q6J70j14qK12q1j56KK0
1017I5L8n8J4N3l6n5J05p3R1j01m7oJ04n9R3o7Q9n1l4l8J19p6pL0J8jn5l5J20rJ20j66P7J07
618B99r1j31k0J13m7n2J44qj31N8J02J8k6PL6k44P8l5P0k0J38o1P2j42N6m7nrJ8n2J20l6j40
231C2J42P4j92K8M4n2L4R5l9r6j1J25n7N4p7K6l8Oj8%Q3o0m2J7N5L3k7r6R7o7M4J7NJl0O4
$$ y = [105, 85, 166, 74, 211, 78, 174, 206, 277, 77, 206, 270, 141, 45, 79, 65, 93, 262, 372, 253, 85, 76, 93, 233, 75, 107, 84, 225, 258, 134, 180, 251, 299, 265, 164, 99, 303, 373, 235, 154, 58, 174, 110, 131, 157, 164, 123, 127, 221, 88, 289, 174, 158, 160, 170, 97, 363, 242, 129, 195, 155, 233, 140, 152, 106, 51, 106, 17, 74, 35, 175, 143, 217, 194, 61, 104, 26, 78, 60, 122, 174, 207, 259, 216, 111, 34, 127, 162, 263, 173, 116, 82, 33, 108, 45, 110, 175, 124, 141, 136, 162, 182, 165, 249, 91, 48, 123, 203, 298, 120, 317, 342, 176, 224, 207, 147, 133, 173, 141, 25, 42, 172, 95, 88, 136, 52, 111, 270, 134, 36, 42, 65, 170, 235, 28, 45, 42, 96, 124, 115, 137, 164, 202, 346, 162, 68, 105, 237, 136, 50, 220, 106, 98, 310, 229, 73, 75, 95, 133, 75, 89, 142, 106, 51, 156, 83, 174, 73, 26, 20, 124, 65, 158, 91, 180, 129, 95, 57, 176, 100, 93, 123, 141, 140, 85, 50, 170, 161, 281, 115, 192, 299, 208, 77, 57, 170, 123, 71, 215, 207, 76, 134, 236, 254, 228, 235, 271, 27, 105, 70, 140, 120, 258, 197, 269, 127, 183, 136, 131, 122, 140, 88, 208, 172, 32, 174, 248, 56, 84, 128, 76, 110, 205, 166, 70, 59, 184, 127, 181, 104, 130, 92, 98, 80, 80, 163, 103, 61, 78, 133, 166, 139, 43, 140, 73, 117, 134, 139, 140, 110, 174]
-192A74
##PAGE=	F1=-2649.37
##FIRST=	25164.767445380970457,	5806.2096540000038658,	0
##DATA TABLE=	(F2++(Y..Y)), PROFILE
5806D8L5LoJ16p8j1k6J3R3N6j68J31n3O0k0o0J39j55K7j7L2K6J76j42j49rO1P1Rj20N9Q3o3
5419A61p3NJ35j70J00n5l7K11J02j72m2K6r4m5J10L1J09j1k19kJ37O0p3L2l6j30J55Q8M0k67
5067G6J88k06J78L2j87o3J22J19Q3k54k2M0J38j25q2j2J28o4K4O7J12j5j87M5m1P8p7L1J71
4726B97j88k0J53p0o1R3o0K1J06k8j20O8k6j1Oj9p6J56L8j42J71Rn7o4kJ9q4p1L5M0M2j4Q
4339A49j09J33J07k0q8j56J55M0n4j32j2J11n4Q9rK5pj10L56k09k1j61J16k1l2k3J4QJ46j16
3987A15M5J16o0j5j4j22K75j27j39j5J16lj03mO9j9o7J6J2J06r8o4J76%n6j6NpQ4j06P8k7
3611A51k9O0mj14K1J5jm3l7N2J33P7j71L5j1J56j06K5p6J22k8o7q1o6J92j12j3R4Q8j20q1
3247F1M5OK8J11j1p4n1N5K26k49l9N7j17J65j26J13j54J39j7j07J80J4j44J07q9L6j11k7J5
$$ y = [48, 83, 86, 80, 196, 118, 107, 81, 94, 187, 243, 75, 206, 153, 213, 193, 133, 272, 117, 144, 127, 159, 185, 361, 219, 70, 61, 122, 193, 202, 82, 141, 224, 161, 88, 93, 228, 58, 158, 103, 66, 277, 379, 207, 165, 191, 97, 52, 162, 193, 302, 291, 72, 70, 207, 267, 194, 226, 190, 60, 215, 303, 343, 76, 264, 58, 236, 268, 81, 18, 140, 259, 342, 88, 66, 106, 244, 119, 37, 25, 153, 89, 113, 180, 292, 277, 90, 135, 94, 172, 95, 126, 297, 109, 89, 242, 172, 111, 204, 144, 165, 271, 243, 123, 191, 165, 154, 160, 141, 65, 221, 259, 117, 288, 297, 240, 176, 174, 193, 109, 38, 73, 113, 155, 141, 149, 40, 173, 280, 260, 172, 16, 171, 211, 157, 25, 13, 124, 70, 159, 150, 175, 168, 58, 414, 205, 184, 23, 139, 118, 86, 63, 77, 85, 231, 115, 160, 276, 216, 201, 187, 65, 340, 213, 74, 59, 175, 172, 69, 65, 134, 115, 48, 64, 76, 182, 84, 20, 196, 196, 140, 124, 129, 122, 206, 100, 178, 151, 122, 182, 178, 64, 85, 100, 99, 56, 19, 71, 204, 281, 110, 145, 134, 290, 184, 209, 133, 255, 227, 160, 79, 13, 205, 93, 80, 174, 262, 142, 61, 106, 112, 140, 251, 240, 166, 115, 170, 396, 147, 108, 165, 48, 213, 87, 200, 46, 185, 168, 61, 241, 255, 111, 218, 129, 165, 54, 27, 42]
2907D2Q7K02N4k78k4P0m6J52k01J41K4O9k68K34K0j49j19O1JM4J70J00j29k07N1k7J01j18
2578E7K0kJ06O1j45O9N0M1k9n6l5J69K2j20p2j11J10p4J5P8k5j3K1N8m9K00j60j4J8K1j47
2215F4K45p0j31O6k5N5n0m0k8QOq6Q0q4J36L2M8q8q4J6j0L1m7R6mM2N6j9j14o6N7O2N7r0j2
1804A09o0M2L0p5P7M8n2pK5K4O8k0nj39K9L6O8M0j34K01M1j34J6jl7k1n5j7o6j1O7j5M0O0
1405A72q5k3J93j24j12K8N7K5P2j64M1n9P4K5JJ2L8KJ49j63o6N3J09j41l4J73j46M0K31j31
1053B47j98M3N7L6j21L6O5o3mJ1k5Q8p4o1%R1j13J05pN8r9O1o4O2m4J2K5RJ3q9j7N9O9P3j80
642F1J64J03j59j19NJ19l3n1P5k8l6O4N9k1j6P3J3k26J14o0N6kJ13q0O6j37O9j2n6M4J4q6
266I0J30j8j54J18O8j81K8Q7j51J10P7l4j29K4Q8l9N7l6N2p3k7JK0L2jr0M2L2P7l1j21M4J
$$ y = [42, 129, 331, 385, 107, 83, 153, 107, 259, 58, 199, 223, 292, 24, 258, 278, 129, 10, 71, 72, 116, 286, 386, 257, 50, 101, 74, 175, 57, 77, 75, 181, 242, 97, 166, 216, 257, 228, 172, 137, 306, 328, 208, 136, 25, 135, 61, 76, 154, 129, 116, 137, 195, 146, 346, 186, 172, 190, 211, 64, 309, 239, 108, 174, 149, 204, 154, 114, 86, 94, 100, 14, 94, 10, 146, 178, 226, 138, 54, 70, 60, 91, 44, 140, 136, 178, 234, 215, 101, 35, 92, 154, 211, 121, 109, 49, 91, 121, 46, 123, 171, 119, 112, 137, 161, 229, 209, 204, 65, 94, 130, 198, 238, 104, 305, 346, 212, 228, 227, 190, 169, 114, 97, 31, 20, 87, 72, 112, 172, 87, 64, 257, 133, 21, 49, 106, 131, 203, 39, 80, 21, 95, 120, 121, 133, 171, 173, 322, 159, 93, 146, 255, 114, 80, 253, 107, 147, 378, 247, 49, 92, 149, 185, 64, 100, 165, 102, 98, 109, 84, 172, 98, 37, 37, 128, 15, 120, 113, 171, 72, 133, 69, 131, 87, 99, 124, 133, 146, 57, 40, 99, 168, 241, 61, 225, 328, 169, 50, 55, 174, 141, 90, 165, 137, 101, 165, 224, 203, 187, 260, 273, 47, 161, 101, 157, 155, 268, 188, 254, 117, 186, 174, 118, 162, 176, 90, 220, 202, 48, 166, 234, 53, 81, 168, 17, 127, 204, 170, 41, 65, 153, 114, 171, 135, 187, 114, 87, 88, 108, 140, 139, 49, 91, 123, 200, 169, 48, 92, 93]
-121I3K2K9J0K2o8N8
$$ y = [93, 115, 144, 154, 176, 108, 166]
-192A66
##PAGE=	F1=-2751.63
##FIRST=	25164.767445380970457,	5806.2096540000038658,	0
##DATA TABLE=	(F2++(Y..Y)), PROFILE
5806I2Qj3k8J54o2n0l7k0J29O2j78J69q4P5n3k3P4j04N7p1O8L4J86j30j64p0J4J19O1j51N7
5442A21R2j06J1o0J77j35K9l4m3J63J28j34o9M5r0k9J17M2J15k8k34m6J82K0nn6L5j40J39
5102B07J18J6k54J67j91J14P8j59q4J20J40K8j93n2L4J28j22o4KJ95r8k2P1Q9%j58J8qO8m9
4750A39k5K20j69l7J03n4l7O9p5M9M4k3p8N0L3j3k7l0j18J67L2q8J68k8k7k2nKj06k7O0r3
4374E4Q1k6Qr8J49R0k7l7j85J37K9pj50qJ00q4J80o7K5j4o8L30j93J5k08J34j1p2m0J9M9Q8
3999A93j52J27P0k3M5m1j51K77j55j16J6J16n1j23O4J10n1j44%O2J13r3m7J61l4n5J2K2p7
3658G5J69j04K0Rl9M5j7q6j0PM1m4m6J05Q3Q9j72K7K3J20r1or0J33pj06k3m6J25j36N1Q2Q1
3271B62r8r7M7rK3J49q2m0n9P7J97k39k4N7j26J18j15J52j65J67%j23J46jj26J39j21J5n6
$$ y = [92, 100, 87, 59, 213, 151, 101, 64, 44, 173, 235, 57, 226, 142, 217, 164, 141, 215, 111, 168, 97, 165, 199, 385, 255, 91, 21, 35, 154, 215, 64, 121, 213, 107, 118, 58, 235, 100, 129, 95, 52, 215, 343, 209, 140, 185, 95, 66, 183, 225, 340, 312, 78, 32, 214, 234, 229, 173, 208, 68, 207, 325, 341, 87, 254, 63, 177, 255, 96, 12, 132, 272, 300, 107, 55, 89, 217, 95, 31, 33, 228, 130, 108, 179, 268, 268, 110, 128, 120, 188, 139, 114, 334, 165, 128, 231, 177, 140, 209, 134, 183, 227, 204, 126, 176, 209, 196, 169, 139, 21, 188, 220, 132, 300, 272, 245, 223, 218, 220, 114, 87, 147, 54, 135, 109, 117, 19, 168, 258, 231, 194, 9, 146, 175, 168, 18, 10, 110, 26, 206, 139, 164, 150, 82, 412, 219, 234, 26, 160, 149, 77, 37, 56, 105, 193, 41, 168, 238, 215, 260, 219, 68, 345, 190, 74, 90, 206, 155, 32, 96, 206, 155, 11, 11, 73, 186, 93, 46, 207, 173, 118, 130, 152, 75, 244, 140, 160, 169, 130, 175, 158, 72, 62, 69, 110, 66, 20, 125, 208, 297, 125, 152, 175, 295, 204, 198, 108, 241, 234, 128, 105, 59, 184, 48, 99, 181, 262, 164, 67, 114, 105, 128, 277, 195, 155, 96, 173, 370, 131, 107, 164, 38, 156, 41, 193, 28, 195, 195, 72, 218, 217, 91, 230, 109, 124, 68]
2931F8j1k1J01J87Q0k90o0N1K6J52k62J74J9Q0k68K66k4j42p1L6J4J3J61R3j22j74M6o0N1
2590A13l6l6K3P2Q7j47P8N1Pl0rOJ09k0r9o3j00Q8n5N1M9m9J7N5JK2J92j90j1NM5j43J51l
2191B31j23P0m2M9%p3m9N7k3o0P8o0M1R6L2j43j6j3P0Or4J14n9O0N9kj01n4J3Q6Oq5M0p6Q7
1780A22oo6J04J4n8l8P3QJ19l4r5r5Q5NO7k4r0J73N8q9k2qKkj57PpK4j9L4P5M4o2r0J54p9
1358A27n3k4J06l8N2j22N4p8N3K9JMN5j5J41j30o4O1Q5j55K7J48j60P1K33j61k17M9J02M1
1006B22j33L3O6r0K4n8M0N8k9j05K3N3n3K2O1M6j66J48q6K9l0J8RJ5M1r5npJ27J1j47K03R0
618C35k14n5mJ06qn8K1o5O5P2J0o1j2J31qk07J62q0K3J5Q1p5N6j26O0L1j02J28j9j11J29O
243B26j55P0N0j29M3J22j83R4O3k8j64P4L7j9M9J2O0r5o5L6L4k2P9j44P7j8J04j5j18jL2p
$$ y = [68, 57, 36, 137, 324, 404, 114, 54, 105, 131, 283, 21, 195, 214, 294, 26, 292, 268, 126, 55, 91, 105, 118, 279, 372, 250, 76, 122, 62, 113, 77, 41, 64, 136, 223, 76, 154, 205, 212, 182, 173, 179, 288, 268, 169, 106, 6, 94, 39, 90, 139, 90, 107, 162, 163, 185, 377, 187, 176, 181, 226, 83, 234, 231, 108, 178, 136, 185, 185, 112, 63, 120, 97, 37, 115, 55, 96, 192, 224, 81, 65, 52, 122, 128, 34, 148, 89, 149, 208, 206, 105, 51, 64, 150, 156, 71, 111, 35, 122, 116, 50, 154, 168, 110, 72, 145, 153, 272, 238, 143, 48, 133, 138, 205, 181, 91, 264, 322, 233, 211, 203, 205, 203, 46, 53, 46, 70, 51, 85, 160, 204, 142, 52, 206, 127, 74, 50, 156, 118, 170, 48, 102, 24, 77, 106, 107, 111, 166, 151, 292, 162, 98, 159, 244, 89, 116, 264, 104, 175, 408, 247, 30, 79, 181, 222, 89, 122, 188, 98, 122, 64, 104, 162, 133, 28, 51, 104, 51, 73, 134, 180, 14, 162, 76, 105, 75, 93, 102, 117, 158, 63, 58, 51, 178, 189, 42, 245, 335, 121, 66, 62, 168, 160, 102, 123, 58, 123, 195, 205, 144, 132, 263, 255, 48, 210, 130, 153, 168, 249, 174, 230, 104, 164, 195, 93, 221, 202, 91, 220, 226, 71, 141, 191, 62, 105, 227, 44, 138, 201, 173, 9, 83, 120, 101, 150, 162, 222, 127, 62, 98, 132, 110, 189, 45, 122, 104, 208, 193, 75, 74, 106, 99]
-133I9K9K0N1r4M4
$$ y = [99, 128, 148, 199, 105, 149]
-192A49
##PAGE=	F1=-2853.88
##FIRST=	25164.767445380970457,	5806.2096540000038658,	0
##DATA TABLE=	(F2++(Y..Y)), PROFILE
5806A33k8j4m5J68k7o2m8K2N5N1j26J72j21P8o8j5Rm5J02j11P0M9J75p7j60j03K4M7J05j58
5454E2L9J17j39Q0j13J71j00%l6j1R3J35r6r7O5p8oJ03M7J33m1k43pJ42rO0j41J06j21P6J48
5090C29J0k23J04j62O2J22j15j11J13J32k5j07nPN3j03o3K1K35j00o7O8O2%j27JK4N9l3l7
4738A24K20j40m4O7m7k8M1q5P5rk2k4K5O8Mo2m0q9J17K5l4J42p0PK0j5Pj42L3P8j62N0nj9
4339F6j0R8P5m5K9j79Q3K6K0j25j8Q4n0J84j34O4j6m2K49j28J9j76J10j1r7l0%R2O8j13P3
3975A66MJ8J12m5j98K58j42r7K5J11q8m8M4J54q8j54MN2J04q4k8J18o1l4J7P4j60K26p6n0
3623A34M1m3J7j0l4n8k2R7m4j1J24lR8j53K8K8Q2n1m3o7J11%j31M5l8O2j43R8O5N2m7j12N4
3236A26k9NJ85j05l9n4O6J64j94k0O3j26L3n7J66j15J27K4j42R8k6r1J55j22oj2M8o3Q4J58
$$ y = [133, 105, 91, 46, 214, 187, 125, 77, 99, 154, 205, 79, 251, 130, 208, 140, 125, 134, 89, 191, 80, 150, 199, 374, 297, 137, 34, 58, 105, 210, 52, 91, 208, 69, 149, 36, 207, 107, 107, 71, 60, 153, 288, 192, 95, 160, 82, 76, 179, 226, 359, 318, 75, 68, 210, 201, 261, 120, 226, 105, 181, 329, 339, 116, 220, 58, 120, 242, 127, 16, 129, 261, 236, 129, 124, 131, 184, 81, 18, 39, 274, 174, 107, 175, 237, 237, 110, 111, 135, 194, 161, 124, 344, 204, 160, 227, 180, 152, 193, 108, 183, 174, 152, 128, 153, 221, 225, 163, 123, 34, 151, 176, 142, 284, 214, 221, 241, 226, 233, 91, 124, 202, 40, 90, 85, 66, 56, 154, 229, 184, 213, 34, 117, 143, 163, 38, 20, 104, 54, 238, 104, 168, 152, 110, 359, 231, 250, 74, 184, 173, 76, 46, 46, 138, 206, 93, 166, 170, 188, 300, 255, 57, 315, 173, 76, 101, 212, 124, 76, 120, 274, 186, 32, 36, 88, 192, 108, 80, 198, 137, 103, 120, 194, 34, 260, 184, 134, 175, 132, 149, 139, 105, 47, 25, 122, 78, 67, 191, 188, 286, 133, 161, 189, 271, 220, 177, 110, 221, 221, 90, 135, 97, 159, 16, 114, 179, 231, 184, 72, 126, 97, 102, 287, 182, 143, 89, 155, 319, 125, 105, 168, 42, 75, 18, 184, 69, 196, 220, 78, 176, 150, 59, 214, 92, 86, 74, 122, 59, 143, 301]
2884C01J03k80n9k6J05J50k33R7K2R9k13K34o3j13l6L3J5l3J36Q7r3j01mm5k3M6o7J4M9J03
2531B05j41R0O0m0l6K2N8L9o2p7m6m6L9jQ9k8o2M6P8n6N6J86j94j0l3P8j02M0O8r3P0o8O6
2144A95K6r0q6Q3k1m9P4l6n3J36K2j63N1k9J14j1j38J15r9Q4N3K0p5n7j8J01m4m7N2q3J00
1780A27l2j5J13k6o8p2J25j5J61m7j71NQ2%N2p4p6J35P8m6n7l3M2L9j61J5j2M0j1J2J02Rk6
1393A95p7J2j1Oq0J57o1jr3O0o6L2K3j6mP1j5J28r0r3O6O6j49Q7J05j61Q1K23j64k14K7J33
1017A77O1j12J8N1r7J7q0J06OJ1j38L7NO1r2J18N9j00P2r9L2n8L8k9K9P3p4j8oJ22n4q1J99
630B54O9k44J4l5J02K3p1Ro1Q0P0l1r9kJ67k1k01K19r2k0K1N8m8L6j05K9O9j33K14n4j24J18
254B11L5j67L9J2n5O3J48j93M7N5k3j38Q0j7mN1L7L9r0j07P3L8o1J63j63P1n5J04Kp6k6J7
$$ y = [301, 404, 124, 65, 39, 144, 294, 61, 158, 180, 279, 66, 300, 237, 124, 88, 121, 136, 103, 239, 326, 233, 132, 128, 83, 60, 106, 39, 53, 102, 205, 64, 154, 214, 174, 138, 160, 218, 257, 195, 118, 72, 26, 65, 64, 153, 125, 63, 109, 187, 131, 187, 373, 179, 169, 136, 214, 112, 152, 220, 127, 197, 129, 195, 221, 131, 45, 128, 107, 58, 132, 96, 43, 179, 201, 38, 89, 60, 174, 163, 25, 140, 41, 125, 178, 198, 123, 66, 48, 149, 105, 58, 110, 27, 127, 95, 80, 193, 167, 99, 27, 152, 137, 298, 251, 80, 85, 167, 167, 219, 145, 69, 204, 282, 236, 179, 146, 188, 227, 66, 81, 69, 109, 98, 110, 212, 221, 195, 118, 130, 119, 125, 45, 202, 141, 140, 47, 107, 41, 73, 96, 80, 76, 147, 132, 260, 170, 77, 143, 209, 60, 147, 252, 91, 172, 395, 231, 17, 44, 177, 238, 126, 144, 195, 98, 115, 35, 141, 147, 158, 20, 57, 62, 123, 31, 149, 208, 108, 180, 81, 113, 55, 93, 64, 93, 166, 92, 74, 68, 190, 136, 55, 254, 323, 79, 93, 58, 160, 183, 112, 121, 60, 140, 210, 179, 80, 78, 245, 224, 23, 242, 150, 130, 151, 209, 161, 197, 92, 121, 190, 57, 271, 217, 93, 211, 246, 79, 118, 130, 75, 138, 286, 93, 140, 195, 172, 34, 114, 97, 93, 144, 181, 220, 130, 23, 96, 134, 73, 236, 73, 144, 89, 193, 195, 119, 93, 110]
-121A10l5J5L3P8r8L2
$$ y = [110, 75, 90, 123, 201, 103, 135]
-192A35
##PAGE=	F1=-2956.14
##FIRST=	25164.767445380970457,	5806.2096540000038658,	0
##DATA TABLE=	(F2++(Y..Y)), PROFILE
5806A66p2J3o1J50K6n3n9N2k6K8l6J42j57O7n9j9n8J6J46j08J5P9J44rj45j02O2r1J35j36
5454E0MJ46j14Q2j02Q8n9J1o7M3J8J25n1j24P4o5J8P1M4J57m0k53N0R2l1J16k07J64q8mJ69
5090C17K9j99K2j37M5J51o5j20Q8R6p0j1M1nl4p3o8K8K40p8p9M2M3j1j01lM9M1l1kJ75j09
4715B11l6N9n6k9J0q7R3l2k7LJ4P7L4r0m6n1O8J0K8R2j08M6N1l8L5j89R4R2j22n6K8o2N0O1
4316A27P5p4R6j70L2K5K3n6mL4l1J63j84J31j0n1J36k0j2j09Q5k1j03Kk5R5Q8p7j2n0L6J75
3940C14l1k47K27q8q3LR9j00L9OJ87j20j30J4K4Q3p7rO5o1Kk2J25j83K18l4j24O1m2oJ8K5
3564A53j06%Q6n3L5J44j11R2j04L7%M8kp0pO7k0j33R8l8L6j03O7N4NK1j01N2m8l0K13q0p4
3177A28l7L0J37j21l0P1j32kL5J01o5P9M9j66N3m0n7J45j09rNJ11q7N1J26J20k48J6r4R6J53
$$ y = [166, 94, 107, 46, 196, 222, 169, 110, 162, 136, 164, 128, 270, 113, 180, 121, 102, 44, 60, 206, 98, 113, 192, 336, 327, 182, 80, 142, 51, 186, 50, 54, 200, 86, 168, 66, 154, 95, 106, 39, 82, 100, 225, 174, 50, 124, 59, 77, 148, 192, 349, 309, 56, 106, 198, 167, 283, 76, 240, 152, 148, 317, 346, 147, 169, 32, 77, 228, 163, 43, 131, 227, 157, 146, 187, 182, 148, 75, 7, 35, 275, 197, 118, 160, 203, 192, 91, 88, 137, 178, 147, 145, 320, 211, 175, 234, 178, 149, 159, 72, 165, 133, 106, 109, 123, 200, 234, 144, 98, 47, 115, 125, 153, 245, 137, 183, 234, 196, 231, 42, 136, 228, 106, 50, 78, 16, 66, 127, 202, 128, 224, 54, 86, 111, 134, 78, 74, 108, 77, 240, 56, 187, 177, 126, 262, 242, 230, 121, 206, 185, 82, 84, 59, 154, 242, 165, 153, 103, 139, 314, 283, 36, 263, 175, 92, 95, 194, 94, 133, 139, 326, 206, 76, 90, 114, 197, 120, 111, 176, 115, 117, 95, 220, 37, 255, 221, 97, 158, 116, 110, 128, 153, 47, 47, 133, 80, 115, 259, 148, 240, 136, 173, 173, 221, 219, 149, 142, 209, 189, 56, 154, 116, 152, 49, 116, 170, 175, 196, 95, 147, 99, 69, 282, 202, 128, 91, 121, 258, 137, 107, 178, 46, 44, 79, 180, 115, 194, 243, 77, 130, 90, 33, 178, 69, 60, 65, 176, 89, 140, 266, 386, 138, 154, 60, 156, 309]
2813C09j74m4L5J20j53J92q1q8nM0Rp4Q7Q5m0l5o3Jp5P7l5m4N9Q6j41J20N8p7m1L1J08k8j05
2426A14n8j2kJ0K6J13p9n6O2Q1r9N3J83j70j3p7J06n7k9J17o5O7p4R2K3j09j05Q6Qo3O7j3
2050A27p5Q7K0j30Q8m0J31k4j69J08j17J07L0N0n5m7m8J14r0J9J1m9P2n6O9J02o1q0p5J31
1698A50l3J84n4k20J17N6J0K0q8r6J05R0j9q5n3O2R0r9Lm3L3OrJ26l9K1m7j37O0N2j27J94
1322B30n7o0q1P1n7N6On2JN4oJ28m8j48O8N4j10J15N5j43O6K02j40j91j1J35R4p3JK5p9k4
947H1m8J46m7L2j15Qk3J49j59J32Q3m3kj04M2r1O9o8K1R8m1m0L7Q7j09l4J95L9k35M0n9J26
571A67M7r1L0k7K5M5m4j22PJ77k3j63K34j00o6J4N0oQp9j3Q9j18K62q9j12R7O0j90M8m3J5
196H9Q8J58k10J3N3k1j09R7o6pP5K8rm6j01M4L2o9K35j53K8m0O2Nmm1k0m8k1M2R5p5L7
$$ y = [309, 135, 91, 126, 246, 93, 285, 204, 116, 111, 151, 160, 86, 173, 258, 218, 183, 120, 121, 46, 123, 88, 44, 103, 189, 48, 168, 226, 149, 108, 139, 247, 219, 114, 56, 44, 42, 52, 78, 191, 112, 56, 118, 199, 100, 153, 336, 166, 153, 76, 182, 125, 96, 213, 148, 215, 141, 233, 256, 147, 42, 128, 136, 73, 140, 127, 52, 139, 159, 29, 117, 77, 208, 184, 15, 123, 6, 113, 143, 193, 138, 91, 43, 157, 67, 86, 97, 48, 120, 64, 133, 235, 174, 94, 19, 150, 117, 301, 247, 27, 144, 200, 210, 230, 142, 46, 151, 241, 222, 137, 84, 146, 236, 137, 140, 97, 130, 136, 127, 253, 214, 235, 188, 51, 111, 163, 36, 230, 173, 113, 32, 103, 46, 102, 108, 56, 57, 111, 105, 233, 185, 37, 105, 159, 49, 164, 219, 76, 142, 344, 204, 13, 2, 137, 231, 158, 159, 184, 105, 81, 33, 179, 132, 164, 49, 57, 34, 183, 24, 156, 239, 196, 194, 90, 132, 41, 110, 42, 63, 161, 120, 80, 117, 204, 95, 61, 256, 295, 60, 100, 41, 167, 214, 123, 153, 126, 151, 196, 152, 30, 37, 214, 191, 28, 262, 162, 96, 110, 160, 154, 162, 83, 70, 159, 41, 303, 214, 102, 199, 259, 69, 117, 74, 89, 177, 335, 125, 138, 191, 170, 61, 158, 92, 85, 160, 188, 179, 133, 32, 76, 108, 39, 274, 121, 149, 109, 171, 176, 172, 131, 111, 63, 42, 84, 179, 104, 141]
-192A41
##PAGE=	F1=-3058.4
##FIRST=	25164.767445380970457,	5806.2096540000038658,	0
##DATA TABLE=	(F2++(Y..Y)), PROFILE
5806A90j20O1o7R6R5l3p5N4q0NM0J08j84M5l2K0o3j7J67o2r3J31J00M3j15q9Q5j89J33r8l1
5442B5J51n5M6n5j7J1J9j10R0m4J05%r9L4o7L2L4L3J80j4k52P4N7m6J59k32J92n5p6J75O7
5078C62j93n7j00M0J58j9j27P2M4j06P9P1j4r8m6n0J2K03m6n1JL8k8q8J7N0J2m1O6J03p5j9
4703A70P9p3l6k6k6O2k7l0k0K4N8O5j05m6l1M5j8J06K1j20O9P1p8Q4j92R8R9n3p8pj7j2K9
4316H5J03j13J48j52rK1OK8K2j9m0J31j64J65jq5J6J06o6j9O0l7r3M5m2N6J14n8p4l5j7K17
3940B99ok68J80j1o8m5Q1p0Q3k0J99j41j02L4pO2p3OJ9k2J7q4J58j46J61Qj91O8l6kL6Q1j36
3553F4L2M6p5Q5J64j98M3k8N3m1J1L9q1O7L1o8j11J22m2N5r6L1N2n0R1o8M7o2p7K28l4j25
3177A05j6qJ21m3l8P1j25O3QM5k9L9O9j87L2mp8J13j00J2LJ61r9J5R1J28j89J02j38N9J51
$$ y = [190, 70, 131, 64, 160, 255, 222, 147, 201, 121, 126, 166, 274, 90, 135, 103, 123, 60, 43, 210, 148, 55, 186, 286, 329, 214, 125, 210, 21, 154, 56, 25, 176, 121, 167, 112, 95, 106, 125, 15, 105, 61, 166, 166, 67, 101, 34, 66, 100, 133, 313, 299, 47, 121, 178, 132, 291, 59, 251, 196, 120, 295, 362, 169, 112, 12, 52, 210, 191, 64, 136, 180, 74, 153, 224, 210, 112, 66, 16, 28, 231, 185, 134, 135, 173, 145, 57, 74, 124, 136, 95, 161, 264, 189, 170, 249, 176, 140, 114, 88, 150, 123, 93, 73, 97, 155, 220, 115, 69, 38, 83, 65, 171, 192, 72, 141, 212, 134, 218, 26, 124, 223, 170, 92, 85, 68, 56, 85, 188, 75, 223, 71, 62, 83, 89, 117, 139, 120, 80, 211, 47, 212, 211, 126, 142, 248, 182, 163, 223, 186, 93, 138, 96, 152, 266, 208, 134, 99, 82, 299, 293, 25, 205, 194, 126, 81, 162, 92, 175, 155, 354, 213, 111, 145, 138, 200, 127, 133, 152, 130, 147, 63, 221, 75, 236, 244, 53, 121, 85, 83, 119, 200, 64, 96, 142, 67, 152, 316, 118, 161, 133, 186, 145, 156, 195, 114, 181, 212, 144, 33, 155, 113, 168, 72, 103, 155, 105, 196, 128, 175, 113, 36, 264, 230, 105, 89, 81, 202, 159, 121, 192, 67, 130, 138, 183, 154, 193, 262, 75, 107, 103, 25, 138, 38, 50, 53, 214, 115, 130, 221, 349, 160, 262, 124, 183, 334]
2813C34j32j94N5J34r6J54n5q8J8M4Jq7RQ4L1Qj17N0o5L4J9j07J08L5j53J59M2q8l4K2J33
2449B58q3j39%J8J3nQJ10q8l5O2P4j20K0J81j24pn8N4k1rJ06n2O1n3J13Kj35r4P6M6j00N9
2062A38Nn3j0L0p2J02n4J37l7j67R2q4Q5j0Q0m0j9q0J34j02L4l7K8J7q0J51Q6q1r3l6P1l8
1686I7J84n1k08J76L7J2j7p0j05P5Q1j3j03j7J6J31l8no0J0J4j3J39q9P1j5j93N2Q5j53K01
1322B31m2r4q0Q8o2J02nq5L7k9JJ60j6j53J0M5k9Q5Lq7K1J65r0j33lL0J31k4j4nl7q8OJ62
923B01q1K6o6k6J5J52j87J23R8Nn7r8M0q1P4o4m1J06%o0R1M6j37k5J98Nj99J9k2J42N4j22
548A29N2qj0j3j3q9l0J56pp2J87j15r4jL9M8j9o1l8P0k0K25j24o9O7O9k13Q1n9L3J19J48k24
160A44nN3k2r2J30j08k9J10Jp4M3o0m5J6lK41j34k9J1K1k2P5n2n9k8o9K7R7k9N9
$$ y = [334, 202, 8, 63, 197, 101, 255, 200, 112, 130, 174, 175, 88, 97, 181, 212, 220, 103, 153, 88, 122, 141, 34, 142, 177, 24, 183, 225, 137, 103, 125, 258, 175, 36, 36, 54, 67, 62, 70, 180, 92, 57, 119, 193, 73, 93, 274, 150, 143, 85, 139, 118, 109, 215, 163, 224, 171, 284, 286, 151, 57, 133, 179, 79, 138, 143, 90, 80, 110, 38, 140, 86, 223, 186, 19, 111, 27, 112, 102, 182, 142, 123, 43, 177, 75, 109, 72, 100, 117, 37, 188, 274, 193, 100, 64, 135, 97, 281, 230, 22, 198, 235, 247, 230, 160, 55, 130, 211, 198, 95, 78, 94, 225, 187, 182, 122, 132, 146, 133, 272, 183, 254, 239, 46, 98, 183, 30, 231, 189, 95, 15, 103, 41, 143, 138, 53, 90, 61, 62, 222, 206, 53, 63, 108, 79, 164, 167, 80, 101, 266, 176, 43, 40, 70, 201, 177, 163, 158, 121, 33, 39, 201, 120, 146, 80, 54, 69, 221, 34, 157, 255, 260, 203, 105, 145, 64, 138, 74, 33, 139, 139, 79, 170, 216, 79, 54, 252, 257, 58, 77, 55, 197, 251, 129, 181, 173, 163, 150, 137, 48, 18, 174, 167, 95, 282, 167, 73, 72, 111, 159, 140, 79, 41, 111, 91, 316, 192, 123, 190, 259, 46, 127, 68, 101, 220, 368, 144, 139, 192, 170, 78, 208, 100, 71, 181, 182, 108, 151, 91, 46, 62, 59, 300, 166, 137, 148, 169, 147, 222, 170, 111, 83, 14, 41, 138, 109, 168]
-192A68
##PAGE=	F1=-3160.66
##FIRST=	25164.767445380970457,	5806.2096540000038658,	0
##DATA TABLE=	(F2++(Y..Y)), PROFILE
5806B04j63J12o0J9J69lr6K9r9qP0Q9j97J6RJ00n1r3J56Lj71J46N8O1p5n9R0j92O6o5k6R6
5431A35OMOq6Q9kj30R8p8P9M1n2Oq0J4jJ5J96M9k19J9M3n7J90k10J83k9j27J67J07j99j08
5055F9pk3J44J8j31O7oj29J47Q1k9j28k6k7NJ32j7Kl3M2m5r1O8J3k4n6J51J8l2JJ07q6m8n6
4656G1R8Kl5l1p0N2J0Q5j02l1k8L2j9J60n9o3K9Q4j32J47j13J9Q8K6o9n6L0p3rJ54j57J69
4280B09j25l3L3j2P3N2o5o7R6p3J47Pj31p6K07j22P6L7n7o6R5n4J3J05n5r9K9r0K04K4k25
3916E7J04N6n8r1O5jO5k6J86j44q4N9m0N2p0RJK5Qj23J47q4J05L1k15O1j6L2pJ28j39M0J4
3529A47r5J17J78k10q1P0O4n2m7O0q1J46Oj20q0J13m7J04j11KN3j00J44k9M7o5j12K15J0j73
3177G3Pl8J14K0l8O5j00J00k1J0pRQ3j98L6L5j30Q8q4K7NJ72r9rN5J24j07J69j99O0J32j10
$$ y = [204, 41, 153, 93, 112, 281, 278, 182, 211, 112, 104, 174, 263, 66, 82, 91, 191, 140, 47, 203, 206, 35, 181, 239, 300, 225, 166, 256, 64, 130, 65, 39, 135, 141, 145, 151, 65, 154, 152, 22, 120, 42, 121, 162, 110, 116, 36, 50, 49, 64, 260, 309, 90, 109, 152, 95, 285, 75, 258, 229, 102, 269, 376, 177, 69, 62, 39, 183, 201, 70, 137, 131, 2, 149, 230, 201, 73, 47, 20, 25, 157, 140, 142, 109, 151, 106, 15, 83, 96, 72, 16, 167, 185, 153, 154, 261, 175, 127, 71, 169, 171, 136, 105, 35, 87, 97, 182, 80, 49, 21, 53, 34, 194, 135, 72, 101, 185, 53, 200, 87, 106, 194, 220, 151, 95, 125, 52, 43, 197, 40, 209, 84, 51, 84, 72, 145, 197, 132, 65, 161, 88, 235, 242, 111, 35, 242, 120, 196, 233, 176, 110, 205, 151, 164, 269, 214, 115, 144, 54, 258, 282, 57, 161, 217, 159, 68, 133, 132, 197, 171, 357, 213, 129, 188, 148, 200, 130, 139, 140, 165, 173, 50, 197, 113, 218, 249, 34, 95, 79, 111, 104, 232, 93, 133, 147, 52, 169, 347, 137, 56, 126, 190, 138, 91, 151, 70, 216, 222, 102, 22, 135, 88, 192, 81, 83, 136, 36, 180, 151, 198, 133, 21, 236, 246, 73, 80, 42, 156, 176, 138, 203, 103, 203, 182, 192, 185, 194, 277, 79, 115, 150, 20, 108, 24, 51, 56, 228, 129, 120, 175, 299, 192, 361, 162, 222, 354, 244]
2801B44j63m1R9m7J28Or0J9L6op9o6P3J00L0j52P4k3l0P1j59J66k1j59J78J7p0j2OJ21j30
2438A20o7M3j0J6om3O6m7k0N5O2r7l4J61o7K3Po2nN3P7n4N0j5J22k6j54o9P6P0j49N7Nl3p1
2027C4M0l2J07o8J39m9j29O6p8Q0m8R7k6K0j07J58r2jo7J16l3j02K06P1q1j02j4Kk4J67m6
1663B04j47J76L2Mn5l9q9M6O2k6j05N4n8J34J3j2n8j3OjJ38j33J12J7j65j8J10j45J60k4r0
1299I0l5N5o8J42j0j06P6j09j0K07lj11n7J2M7K7m0Ok5R0k2q1j1n2J43K6k4l2J7j27K9J56
923B00q4j1nm6N5J22k02J25R4M1q1r0L7n7O9m6j04Q7L9o3J35Lj32l4J92k6j66k3Q5J22M6j61
548A21O8Jj3r6O1o4m0R4K3J0J45j35r4J4k6J05l3n8k3jR8J59j61KL2N0k07Q8k0RJ46J28k19
160A64j9N3l3o8J57j43o4J43k1j39J51l2j01j9Q6J98j25p7N7K2o3J32n9q8Ko5j6N5K4R0
$$ y = [244, 81, 40, 139, 92, 220, 226, 136, 155, 191, 185, 106, 40, 113, 213, 243, 91, 165, 142, 112, 183, 24, 190, 169, 10, 188, 205, 135, 123, 129, 250, 120, 53, 96, 86, 102, 96, 53, 119, 72, 52, 107, 169, 72, 38, 199, 132, 155, 162, 100, 95, 148, 225, 171, 221, 206, 328, 302, 148, 79, 155, 225, 76, 133, 138, 105, 34, 74, 42, 149, 81, 220, 171, 42, 108, 30, 110, 62, 159, 133, 153, 46, 204, 112, 111, 44, 160, 127, 25, 231, 302, 221, 119, 105, 107, 83, 250, 204, 57, 233, 265, 269, 214, 175, 86, 132, 194, 168, 63, 117, 59, 193, 206, 194, 136, 123, 129, 128, 266, 133, 245, 262, 97, 79, 189, 44, 204, 180, 90, 55, 110, 42, 184, 174, 68, 144, 35, 25, 232, 229, 118, 61, 73, 120, 147, 107, 113, 88, 178, 156, 75, 64, 12, 155, 181, 157, 125, 142, 15, 44, 200, 116, 105, 100, 54, 109, 231, 29, 154, 248, 289, 208, 118, 155, 98, 167, 121, 17, 104, 143, 80, 215, 218, 86, 52, 244, 218, 52, 29, 114, 236, 282, 121, 189, 190, 177, 81, 142, 78, 38, 132, 155, 165, 310, 175, 81, 95, 69, 174, 141, 83, 60, 59, 157, 316, 155, 157, 189, 239, 32, 120, 100, 109, 255, 383, 164, 145, 198, 165, 97, 254, 111, 47, 190, 169, 30, 181, 149, 48, 29, 115, 313, 188, 111, 168, 190, 127, 259, 200, 112, 114, 49, 33, 88, 112, 202]
-192B02
##PAGE=	F1=-3262.92
##FIRST=	25164.767445380970457,	5806.2096540000038658,	0
##DATA TABLE=	(F2++(Y..Y)), PROFILE
5806B07j90J51m5n8K31K5j08j3q5rM3R3j69l9O3J64n9j48J34O2j39N7K8M8k8j8P7j66K5o7
5454F7%J8N4k9O3r9J28k6j38Q0p0N1N3k0J7r0j1j6j1J91J33j93p5M7n8K04j73J63rj56J48
5090B43J34k03j03L6p8J15M1j24P3m6k6P2P9o1j10qpj2P4j9O1m4N2n0m8O4m9l7N3Q8o0K4K1
4703A45J19q6o9n2K01l7p7m0o1N2m4P1p9QMk8O8J23j32J8l0R3j39J57m7k5M1R7o5q9O9q7j0
4316F9J53j76J35q9m3P4mM2P5r6r8O1J2J31J7j75%J36j67J63J9p8k8J42o8JM8o7r2P0q0J12
3940A99N2j51L5R5n3j15O7O1Qj5J53j30p8P9p0N8o4kJ8M8j6j02P9j1O3L0j50L7lN4q9J55j19
3553A23K7%p9R2J77j59j21O6N3j5j22N2o9K17j5j36o8Q2n7J63j17k0M1p7J09KN6n3j05J59
3200B06L7k08M8n0P8O3k6O0p3J12m5MKqQ4j98M2M7j58P7l0nMJ55r1qK4R7qK04k74R4R2r4j00
$$ y = [207, 17, 168, 123, 65, 296, 321, 213, 200, 115, 106, 149, 242, 73, 34, 97, 261, 202, 54, 188, 250, 111, 168, 196, 244, 216, 198, 275, 109, 134, 67, 67, 85, 139, 110, 173, 74, 202, 176, 38, 118, 48, 99, 152, 132, 149, 59, 48, 32, 21, 212, 345, 152, 77, 124, 66, 270, 97, 260, 251, 95, 243, 377, 174, 71, 107, 29, 144, 185, 61, 134, 88, 62, 134, 213, 152, 42, 34, 27, 15, 89, 70, 131, 87, 139, 89, 41, 105, 56, 19, 72, 160, 100, 124, 145, 264, 178, 109, 57, 258, 221, 144, 104, 43, 95, 51, 122, 43, 51, 55, 27, 95, 218, 86, 104, 74, 167, 28, 185, 138, 113, 154, 251, 186, 97, 166, 79, 69, 222, 46, 181, 92, 49, 123, 119, 161, 236, 140, 42, 103, 115, 246, 263, 88, 88, 224, 57, 220, 239, 161, 133, 275, 207, 208, 256, 189, 97, 167, 87, 199, 251, 100, 135, 230, 177, 62, 129, 190, 198, 183, 336, 206, 128, 207, 137, 195, 131, 129, 147, 195, 179, 77, 156, 145, 208, 238, 88, 125, 122, 176, 87, 242, 123, 150, 150, 71, 163, 340, 181, 60, 126, 179, 164, 42, 94, 25, 242, 227, 91, 23, 105, 48, 211, 94, 74, 115, 38, 147, 149, 205, 152, 47, 206, 243, 35, 83, 33, 111, 174, 148, 208, 135, 247, 202, 206, 208, 200, 284, 86, 128, 175, 17, 94, 64, 59, 63, 218, 127, 119, 143, 240, 232, 436, 162, 256, 348, 254, 154]
2790A54o9nj1J17O2o5KJ4jp2q2K6J43L9j52N3L6q2J00j90K05n9j38J49ok7J0rQ1j68N7L9m0
2402A11K6Np4m7O8m3L5N4l0k3M3pO8M6j49j4J07N9o6M0K7J15n3j50m5Q5P8j96O5k3j4k3qk5
2003D2R9p7J46o5p5L7r2Q1n6Q5j4O1j18J69q1m9n5J73o7j24K29O1o7r9mo9QJ49n0q5J54L5
1628B82pr1j1o6J9N8m4r2R4q2Q7M6j9l7k0k1J6J30j64J30M8j25p3J34j13P8j0m7QJ1n6J57
1252B20j1j24J09j05j6J83oo9p9l3Q3l3o4R9l6j5N0n7k5J0K1P1l3m5P0j08jJ24o3o6N6m4P3
865A36Q2k02J28P3O7o9r3M9n3P2k5j46M4O8m9J58l4j08j6J47m5j45kJ42R0K7j96P6MJ1j45
501D6J11o3k4K0O5P2J10j45q9M2j05J52l9o3rm8J89Q7j96Q3jNj45L4M4j9J54J12j84m8N3n3
125A48j8J57j70j00J65k4r5J44j1j16j3J08J31j33r6P1O4p6J38o4r7K3o3Ok0M6J20
$$ y = [154, 85, 80, 69, 186, 248, 183, 185, 199, 198, 126, 44, 70, 213, 252, 100, 153, 189, 107, 207, 17, 222, 163, 25, 174, 168, 141, 151, 142, 223, 55, 112, 151, 111, 137, 142, 68, 21, 89, 46, 81, 135, 105, 82, 125, 118, 186, 232, 83, 69, 176, 235, 169, 209, 236, 351, 298, 148, 103, 188, 266, 70, 135, 112, 98, 75, 67, 42, 141, 64, 210, 145, 70, 107, 15, 96, 40, 125, 111, 172, 54, 223, 142, 93, 38, 211, 144, 20, 249, 310, 243, 144, 140, 71, 79, 228, 178, 93, 247, 282, 275, 184, 173, 107, 126, 184, 140, 48, 142, 60, 147, 193, 174, 137, 117, 96, 112, 242, 78, 208, 256, 131, 58, 192, 79, 157, 147, 100, 108, 119, 63, 220, 209, 85, 194, 89, 73, 256, 250, 181, 102, 69, 152, 119, 55, 154, 118, 103, 153, 96, 71, 81, 102, 173, 140, 95, 165, 57, 56, 180, 117, 51, 107, 63, 136, 218, 16, 144, 217, 284, 215, 122, 171, 118, 190, 165, 19, 63, 131, 82, 240, 206, 98, 82, 229, 184, 39, 37, 179, 269, 296, 100, 176, 180, 191, 46, 157, 94, 70, 90, 155, 227, 337, 192, 103, 145, 40, 192, 153, 90, 81, 33, 222, 309, 113, 196, 195, 200, 55, 89, 133, 114, 268, 380, 196, 148, 201, 148, 130, 287, 117, 17, 182, 158, 63, 207, 196, 80, 67, 175, 306, 173, 77, 148, 212, 136, 274, 210, 113, 136, 73, 79, 59, 105, 225]
-192B25
##PAGE=	F1=-3365.17
##FIRST=	25164.767445380970457,	5806.2096540000038658,	0
##DATA TABLE=	(F2++(Y..Y)), PROFILE
5806B02j95J68k5j12K56M3j01n3n2nk3J17j05q3Q1J91o4j86J20R4q5m4RK7J9K6M9j23J8j02
5454F2K9m8P5l3Q8r1J41l2j17K3l5L8L6j3M8r3pj1j1J45J92j81j55M8m5J97j34J37J0j67J23
5090B19J42j86o9L0j15P6N1j02P9o1L9J1P6r8roj9n0Q4p3P9k3N9l9mL8j16P0O7kr4N8L8J08
4691B58p3j01qK53o0j39n8NL5n2ql0N3L4q2J31Q0j83O3l4Q3p0Q5j3k0k0J33q1r5J01p1J3J16
4304B45j78P9n2m1J21Oj2Q1j11j15K9O0J28L0k03P8M9j71K11Rr7J1J79q8Pj8r0o7P1j5lP3
3928B06o4l0J10m8j11R1R5o3MJ08j09q0Q5r0P9n5k2O1M2m6m8j1O2L5J5o7L0qP6j50J33q5J
3541A46Ql9K5J56q6m6k6J4M1j75K4kK18l8j03q3N6p9K11r2m7J0qJ9J7P2l0q4J00M4k03J02
3165A22n3nQ4nN6n0J10o6L6Jj9P1j95M0L7j08M5Mk9j5J23q0K0J6M1R0K08l47J35L8p4l3p5
$$ y = [202, 7, 175, 150, 38, 294, 337, 236, 183, 131, 126, 103, 220, 115, 32, 113, 304, 240, 54, 174, 268, 183, 139, 148, 175, 194, 220, 269, 146, 164, 62, 91, 43, 118, 85, 173, 82, 223, 191, 74, 97, 62, 100, 136, 123, 171, 78, 71, 60, 49, 194, 386, 205, 50, 98, 53, 250, 116, 253, 263, 96, 219, 361, 175, 106, 136, 21, 97, 148, 46, 125, 64, 103, 114, 190, 92, 83, 77, 58, 8, 92, 19, 98, 75, 134, 95, 91, 129, 13, 83, 150, 148, 54, 112, 150, 258, 185, 84, 76, 329, 269, 130, 72, 77, 112, 60, 52, 22, 75, 109, 27, 158, 238, 55, 118, 84, 167, 97, 182, 169, 149, 129, 262, 181, 86, 187, 116, 129, 245, 67, 146, 94, 53, 174, 180, 168, 249, 138, 23, 52, 112, 240, 270, 67, 145, 194, 23, 234, 243, 146, 157, 336, 248, 255, 237, 147, 80, 151, 136, 133, 206, 142, 112, 222, 174, 63, 154, 249, 186, 190, 298, 189, 109, 194, 104, 183, 128, 106, 167, 209, 163, 115, 104, 166, 201, 216, 149, 179, 171, 247, 97, 230, 145, 146, 154, 115, 140, 296, 210, 164, 138, 152, 193, 18, 42, 40, 258, 220, 117, 34, 90, 11, 222, 130, 83, 93, 85, 104, 121, 193, 163, 79, 179, 223, 20, 122, 69, 64, 148, 143, 199, 149, 259, 193, 229, 230, 211, 282, 87, 127, 164, 56, 101, 105, 76, 61, 184, 104, 124, 140, 181, 271, 479, 132, 267, 305, 231, 198, 123]
2778A23q9J4J05Q8j6j4j1J9p4j00J4J52L6j17j1R9j05R5j91K04o7j26J13k1L1J8k0L3j45J15
2426A52L7o9L9K2p1j6M4q4nO3L3Lp4M3R8O1j87l6J31N4q4L8O3Q7p7j12k9R7P4k26Q1p6K1L3
2027A28n5l1Q1p5J52q1k4J6p1K5j4M4j2R6j09J51p2r0mJ83p5j49K24N4m5q5Nj20L2J48o6l4
1651A27J17L5rj16ll7j2P3m9p4R1p4L7N4k7rjo3K6J20j65J06P8p7r9J58q1j3j2J4M8m0k9J57
1252B51j2j35J26q1k1J48j2l2r1o4R5p8n4J47l4n4O9o9k5N9q0J04m1l6J06j01qP4l1p4O4l1
876G9O8M5j46P8N6Q2l2j14P3p2R0nj90L3O7l3J54n1p3K4P5n4j21O2J35N6Rj98N0KN0r5O2p0
477I6Lm3J02J11Q1j34r8O1j47J68m5o1lk9K16K1k14J44k7n6o1j1R4n5J36J16j28r6N4q0N7
114A72J28j86r2J44rl5R1Pj15KJ19M8j56o9L9J31n3R5o2q7L3o3M8m3nJ46
$$ y = [123, 34, 48, 153, 241, 225, 211, 200, 219, 145, 45, 59, 211, 247, 130, 119, 218, 113, 208, 17, 221, 154, 28, 141, 120, 151, 169, 149, 182, 37, 152, 189, 120, 159, 181, 110, 94, 138, 54, 49, 112, 145, 148, 74, 117, 215, 276, 89, 53, 184, 238, 154, 192, 255, 342, 265, 153, 124, 221, 295, 69, 150, 74, 95, 128, 73, 42, 123, 48, 200, 119, 95, 111, 40, 65, 51, 95, 83, 179, 70, 221, 149, 59, 55, 238, 163, 14, 238, 292, 247, 162, 167, 47, 79, 227, 161, 127, 244, 279, 270, 154, 151, 114, 102, 175, 126, 52, 143, 69, 106, 160, 133, 124, 123, 60, 86, 206, 41, 147, 225, 148, 49, 207, 126, 113, 101, 115, 163, 123, 94, 251, 239, 104, 230, 149, 128, 276, 264, 232, 141, 77, 172, 94, 40, 187, 153, 99, 168, 99, 74, 133, 53, 157, 116, 80, 186, 85, 77, 151, 120, 46, 110, 79, 147, 192, 46, 124, 180, 262, 230, 116, 189, 117, 207, 202, 12, 45, 112, 79, 233, 182, 109, 133, 208, 154, 33, 95, 230, 286, 295, 97, 147, 149, 199, 104, 166, 96, 99, 56, 158, 269, 350, 216, 118, 179, 32, 200, 155, 94, 91, 62, 278, 299, 85, 229, 202, 146, 85, 74, 168, 113, 249, 365, 237, 141, 195, 115, 172, 300, 114, 22, 166, 157, 122, 213, 220, 105, 107, 226, 274, 118, 49, 88, 219, 166, 261, 199, 112, 145, 82, 130, 87, 82, 228]
-192B28
##PAGE=	F1=-3467.43
##FIRST=	25164.767445380970457,	5806.2096540000038658,	0
##DATA TABLE=	(F2++(Y..Y)), PROFILE
5806A96j81J64qj31K31M4o8p3k3%q0J33m8j01O5J85n6j94J14Q2k4j31nL2M8O2Oo5K3j39N7
5442A15q2N2RN9p8J33j1o5p1J0M7Ol6Q4q9J4j4k7J56J98j76j67J5j9J68r5R7L2j61R4J30j43
5067A85m5Lj13L5L7o3P5l0M1k1Q0p5N7j9m7n4Q8m1l2RO4k0K2J5j04R4O1n8n7J4N5Q5n0j38
4668E3M3K71p1k06p8R8K0l9l7J7M1M9j01J38M9k07P2J8N1m2N4j3J1n3J14j13q0J29m3L4O9
4304B48j66K8k1k6J59Qn7O7j16r9KN5J37M4k03J02mj14J90J3j15M9J94j11Rn1j16l4K9Q0r0
3940I1O7J7r9J19m4q1J19J10j31J9O5r1q2P2q4R6m2m4J13J6p5J3r6J26J6%QJ8j8J08j68O0
3564A98m4l4M0mm6J18k1L2r0l1Q3j77J7M3J81o4m9j07P2n9J66m5p9k3L6n2J3R2kn7N6L0j29
3177F4J16o9o1N2K0N0l2J09q8J03ql0M8j95L4J1j6K4Ol5m6P5o8O7K5k2J65J92m03J56j3m6
$$ y = [196, 15, 179, 171, 40, 271, 315, 247, 174, 151, 151, 71, 204, 156, 55, 120, 305, 249, 55, 169, 251, 227, 96, 91, 123, 171, 233, 239, 174, 197, 58, 115, 33, 85, 94, 153, 75, 208, 197, 132, 61, 71, 118, 124, 88, 172, 83, 97, 83, 56, 212, 410, 234, 67, 82, 63, 231, 136, 233, 265, 104, 198, 328, 185, 140, 143, 30, 65, 102, 39, 114, 84, 125, 104, 184, 109, 166, 147, 100, 46, 134, 93, 61, 70, 134, 114, 136, 151, 47, 141, 202, 144, 87, 101, 156, 241, 191, 53, 96, 367, 296, 90, 12, 110, 130, 91, 54, 71, 112, 161, 60, 198, 247, 40, 112, 130, 181, 139, 193, 180, 191, 138, 252, 139, 59, 188, 145, 179, 248, 82, 110, 89, 63, 222, 230, 173, 240, 124, 25, 27, 82, 219, 263, 60, 162, 158, 44, 234, 247, 132, 181, 375, 264, 273, 222, 106, 72, 101, 181, 91, 158, 175, 76, 195, 151, 70, 189, 299, 168, 187, 252, 161, 79, 151, 67, 163, 121, 77, 190, 206, 131, 144, 48, 174, 190, 190, 198, 216, 198, 306, 138, 198, 154, 120, 160, 156, 110, 228, 207, 239, 149, 118, 201, 24, 41, 84, 265, 201, 152, 45, 117, 58, 224, 179, 100, 77, 113, 61, 74, 166, 164, 107, 163, 193, 64, 180, 111, 50, 102, 122, 172, 140, 249, 161, 264, 256, 226, 274, 79, 113, 124, 108, 132, 138, 103, 57, 132, 64, 131, 156, 134, 299, 491, 88, 244, 231, 185]
2801A85K3p0q7MP1P3M5j9l1N3q5j49O8J35J4o2q9J40r9O7j72J68m7j21Q1k4R0Ok5qk1N8L2
2414B04r2N0L9n4M8j5r8n5Q8O0K4j18N0R5N9j88n1J33N4j01M2Q8M0r6m6k0J06O0k25Q9j26
2050D4Q5L6r4k5N6n2J50r1JK1l9m6L1K3l9J19q7R9o5j06N0J63n9j37J60M9k1o0J8j22J6J58
1675B36p8lP2L2Kj19k0j0l7Q9k8o4O0o4L1K8l9K1K4j02K0J17j15K3J01k1r1J69n4p7n0P4Q5
1287B12r1jJ52j1j27J12n5k7J10q%j01r3J09r4l5J48k6j8L5r9qP4j40J19m8j5J22r4kL0pk0
900A03K1k8M8K1p1kP6P4Lj43R6j01J17J0k17O8L5m7J27l3l8P1j3n9p9R1J22L5Nj53k7mQ8m3
501A53J2p5K7o4J02J32N0r6j20O5j44J47m9m1KlK23l2k01J56m2j12J8J5Q4j01R8J38p0j53
149A19O0j07J39P9j86n1J07KmL9K0j09K3J30m4j85K0KJ50lK3n2o2L2n7R0m0r4J71
$$ y = [185, 208, 138, 51, 55, 126, 199, 244, 225, 194, 247, 162, 13, 81, 216, 230, 168, 79, 219, 120, 187, 15, 183, 136, 15, 96, 72, 162, 168, 143, 135, 114, 172, 204, 112, 162, 201, 147, 195, 180, 82, 27, 115, 175, 199, 81, 131, 226, 285, 97, 46, 179, 233, 132, 174, 262, 302, 206, 160, 140, 246, 306, 81, 170, 44, 129, 165, 71, 46, 102, 50, 200, 109, 110, 131, 92, 46, 77, 100, 61, 180, 93, 192, 127, 21, 71, 234, 175, 38, 198, 247, 226, 166, 184, 62, 78, 236, 158, 155, 227, 259, 261, 142, 122, 112, 75, 164, 136, 72, 132, 68, 99, 127, 88, 109, 133, 31, 51, 168, 53, 76, 177, 156, 65, 234, 180, 103, 53, 127, 212, 121, 120, 272, 261, 134, 246, 191, 164, 274, 266, 266, 165, 72, 181, 87, 52, 200, 174, 156, 191, 92, 84, 158, 18, 137, 89, 74, 196, 102, 100, 130, 123, 103, 124, 96, 144, 165, 94, 92, 168, 242, 245, 102, 198, 97, 214, 224, 7, 75, 110, 63, 190, 157, 119, 190, 177, 118, 39, 130, 252, 287, 292, 139, 112, 108, 196, 153, 165, 90, 117, 53, 155, 287, 337, 241, 121, 186, 42, 189, 140, 99, 101, 98, 321, 289, 88, 244, 202, 90, 108, 123, 207, 106, 204, 342, 272, 119, 179, 72, 211, 290, 104, 53, 160, 162, 158, 197, 217, 108, 131, 261, 217, 32, 52, 54, 204, 201, 224, 172, 110, 142, 85, 175, 135, 41, 212]
-192B12
##PAGE=	F1=-3569.69
##FIRST=	25164.767445380970457,	5806.2096540000038658,	0
##DATA TABLE=	(F2++(Y..Y)), PROFILE
5806A94j52J40Jj40J85K5ro7j5J0o7R1k4j04L6J61l9j66J12K7L2j69k1Q1L6Q4m9JK4j47O9
5442A40j01J0O5On1R2L7kj54L9O2k1p2J00p5L9j8n5K03J61j71j34j7J1J25n0L0O1j44O2J05
5078B83q5l7l4p0L0k3k5O5L4kk1Q4j1O4l7p4n3O9Jq8jO9lL6Mq0P5N0o5l3m4O7O6j7j70Q0K65
4644C69p3k60M1O3J0l5QJ4J6M7r6R9M1k11P3Q1J1m9O0l5M6m8N2j51m0J42j9N3J6j35qKnJ79
4245B58Rq4L2j17n8J1j2J51N2j76Q5k8o8J59K8j18P5J87j29j2l9j29J4n3J79j03J9O3j67J29
3893A58m1l8J42J10j84K8L0p6q6N0rN6k7n9J58j9r0N5j49J61Mj2O5rk4J52j62k8lp6Q6J6r1
3506H8Q2KR7j25n4R2j25K0M5J41q9Lj27J14n5J05Rj10l5M4p4j6R9K4k8L2Jn4J27q6m5n1M2
3118I3L6j6J18j12J88k1m5K4j94K3k0Q4K0k1k0p1Ok0Q7L1n8J94J71m26J40l9j7N4n8l7j0K7
$$ y = [194, 42, 182, 183, 43, 228, 253, 244, 177, 162, 172, 105, 196, 172, 68, 104, 265, 226, 60, 172, 199, 231, 62, 41, 122, 158, 242, 193, 194, 218, 71, 140, 39, 49, 114, 120, 69, 161, 198, 196, 42, 81, 143, 122, 50, 150, 75, 114, 96, 41, 244, 405, 234, 100, 83, 94, 219, 169, 199, 260, 116, 178, 283, 198, 161, 127, 57, 87, 64, 39, 104, 138, 136, 115, 199, 188, 252, 215, 141, 88, 157, 158, 70, 69, 138, 135, 171, 175, 95, 170, 220, 155, 122, 78, 145, 211, 194, 24, 104, 369, 296, 36, 77, 140, 150, 115, 123, 137, 153, 200, 104, 203, 244, 33, 106, 187, 198, 149, 209, 174, 220, 172, 224, 73, 33, 175, 156, 209, 225, 90, 82, 84, 79, 258, 267, 183, 215, 98, 40, 51, 39, 190, 242, 66, 151, 123, 55, 214, 242, 124, 199, 386, 257, 245, 206, 77, 91, 38, 217, 114, 133, 196, 29, 158, 117, 79, 221, 331, 147, 175, 205, 129, 43, 93, 84, 140, 113, 54, 212, 193, 103, 158, 9, 170, 174, 162, 227, 218, 194, 346, 184, 156, 153, 77, 163, 179, 88, 170, 172, 269, 144, 90, 182, 57, 77, 122, 263, 174, 177, 50, 164, 109, 214, 223, 113, 78, 122, 48, 32, 131, 155, 127, 159, 160, 106, 233, 147, 102, 51, 93, 129, 113, 231, 119, 307, 286, 241, 265, 71, 94, 74, 158, 178, 157, 137, 66, 72, 52, 139, 170, 112, 306, 477, 51, 191, 152, 135, 189, 131, 94, 84, 111]
2743A11K5R5ql7Q5j00j25P8J11l5jj33J28p9L3j47J15lq7L2k4J34j9k2l7J03j4J7j02N2N0
2379A96k9R3o5p8p8R4N3M6j14L6O0M8j64o4J29O1j03L9R9k1j07L2j8J15L4j97Q6j31J31Lj27
2015E9mL3k6J48q5j7N6k0n5J2L6p2J18o3J8o0m6N5J14k7r9N9M6Kk9L8j04j8J62o8J0K7K8K1
1616B49r4m2Nm0Q1J3o9K4o9O9j8m7N0K2j22NJ18m8j5N4L8p1J70l2j07j02J09J22j36J6J48
1252B81nj05O9l4l4P2J1K4j07j23J30q6m1J40j2L4kj22QN3j31R6n2LJ22p7LRRK1Kn0J9J5K
841A42q9J43L6Rj53J02j17J35J4j89Q0K2q6O9K6j3J09j02o1l7R3J08L2K1j03j09j7J17j4j2
489A56p1L4l4N1J47J7m0j39M8j05R5m7NRJK19p0j55J13m4j40O9O4N8j49N9J61k4k00P0j26
125C2J99K8j71pR2nOj0K7r6M3J37j34o9PO1L4N3n6l5k7K5l5J11l5j57J74
$$ y = [111, 136, 231, 223, 186, 271, 171, 46, 124, 235, 200, 199, 66, 194, 115, 148, 1, 116, 113, 26, 58, 34, 168, 149, 127, 90, 193, 179, 196, 94, 146, 196, 167, 260, 195, 117, 39, 133, 186, 232, 118, 154, 214, 262, 98, 34, 163, 224, 121, 160, 259, 238, 131, 163, 145, 260, 294, 97, 183, 52, 183, 186, 59, 55, 88, 62, 210, 125, 108, 164, 144, 89, 101, 137, 65, 183, 120, 138, 78, 32, 87, 201, 174, 75, 134, 180, 182, 153, 191, 87, 69, 231, 163, 173, 200, 228, 249, 155, 113, 118, 78, 159, 172, 103, 127, 58, 127, 109, 62, 112, 134, 12, 17, 135, 87, 72, 126, 164, 93, 263, 231, 124, 22, 131, 253, 117, 133, 281, 276, 171, 240, 206, 172, 244, 255, 279, 172, 49, 179, 93, 52, 192, 180, 214, 212, 90, 98, 151, 20, 116, 64, 67, 189, 112, 115, 124, 133, 154, 156, 106, 125, 140, 142, 53, 196, 232, 241, 88, 190, 73, 208, 222, 33, 113, 135, 49, 118, 144, 131, 240, 138, 77, 40, 133, 241, 273, 294, 191, 82, 65, 182, 168, 156, 85, 119, 85, 136, 283, 300, 260, 121, 169, 64, 159, 112, 117, 126, 127, 346, 276, 121, 234, 190, 50, 119, 183, 241, 92, 151, 312, 288, 88, 158, 32, 231, 259, 88, 81, 173, 168, 174, 164, 191, 95, 138, 275, 141, 72, 79, 140, 174, 227, 171, 136, 109, 134, 99, 210, 175, 18, 192]
-192A92
##PAGE=	F1=-3671.95
##FIRST=	25164.767445380970457,	5806.2096540000038658,	0
##DATA TABLE=	(F2++(Y..Y)), PROFILE
5806B04j21J03Jj47J30j0O7m2k4J8j2L6m9p6j3J27j5j11J08n6P3j07j4Q6KR1j09O9Rj15O1
5442A64j28j4R5l1jPJ01N4j67K3N9m3o3N7n6O1j3n5K22R5j62q3k4L6Q2jo2R6j20L0P2l0l5
5055A66p4lM0q4j0O1J03n1mP4L1O8n5r3m7L2M9q6n2Q1OM1J2o6K9L7l3l9p9O4N0K0j68P9K42
4644C41o6k31J19LJ0m3M6K6j6L2o8J6O2j97Q7J18l3p5Q5o2P7k3k4j42K7Q8qO5l4r0k3K3J2
4257A02J74J4r4j1j26pL1n2J37M2j38N9l4n6J27N4r6Q2J57j24n8mj20O6q0J94p2j5M9j72J05
3893A34n4JJ57R8k16L5Qn0j02N4P8k0j4o2J84n5p4N5r1R0J0l1R7m6k0J96j47j02M4j14J12
3529A55K1r4P8l7J22j29l7O6m1LM6J02j09M6j39J56n2L0O3j28k6J7m0l1N5M3lL2l6JJ27r3
3154A68rr5KJ1QJ32j35K62l4o0Pj77Km0J51K8o0Op8o6Q8M3J4n3J68J62m03P7j0pN1m5K8k5
$$ y = [204, 83, 186, 187, 40, 170, 160, 227, 185, 161, 179, 167, 203, 154, 78, 65, 192, 177, 66, 174, 118, 191, 84, 70, 156, 158, 249, 140, 209, 218, 103, 164, 36, 22, 117, 86, 85, 92, 193, 247, 80, 103, 162, 119, 56, 113, 57, 118, 105, 50, 272, 367, 205, 122, 98, 134, 216, 215, 153, 249, 129, 159, 231, 201, 166, 92, 89, 129, 45, 35, 96, 199, 148, 144, 218, 249, 317, 262, 169, 122, 154, 203, 117, 65, 146, 152, 193, 205, 139, 168, 205, 172, 133, 54, 118, 168, 188, 20, 99, 341, 275, 44, 163, 166, 176, 133, 179, 205, 189, 221, 153, 169, 231, 34, 121, 239, 206, 131, 216, 154, 231, 208, 184, 42, 69, 157, 149, 214, 180, 90, 67, 90, 102, 276, 290, 196, 185, 59, 52, 83, 31, 168, 210, 72, 131, 97, 41, 168, 222, 126, 208, 365, 241, 183, 179, 59, 125, 45, 239, 167, 152, 201, 29, 134, 80, 81, 238, 336, 120, 155, 163, 113, 11, 65, 143, 123, 109, 47, 231, 176, 102, 157, 66, 156, 166, 135, 232, 186, 166, 362, 215, 113, 157, 43, 155, 176, 82, 160, 123, 245, 116, 79, 145, 104, 107, 153, 255, 146, 192, 53, 209, 157, 187, 250, 122, 96, 113, 73, 42, 97, 140, 137, 169, 133, 134, 261, 168, 159, 64, 66, 77, 85, 217, 82, 344, 310, 250, 257, 80, 82, 42, 193, 221, 161, 167, 89, 23, 111, 154, 168, 115, 283, 445, 42, 119, 109, 102, 153, 108, 136, 111]
2754A11kk8J11J6l2J07j20m5N7R2j06N1j14N6o1Op1J5N7l6%l8J44n4rn3K08p2k4r0L9N3jJ11
2355B78j03j9r9Q8L3O9r6K4PL0j21o6J16P7q0J2R5p8j07J02k2J23kj53P6j12J58l8j52K9J9
1992H8k2J57o2p1J04j0l9l2O1r1J08m4p6m6M2M1M6Lm7n3M3K6jO2r0m9J50l0J3j6L1M4n9m5
1592A36pk7O4N2q2Jr2J09m7m8Q1k4r8L3N9K1J3o2R1n0J56j2j20j13R6J56j67J0J45J0q0Oj9
1205A91l5K8M4M7j11j48J53p4m8J23NP6k3j27%J6p8N7m7RJ04m1kJ2K4L3Rr5j3K6O6j36J93
818B38k0j7j23Q9q9J07Nj35Q2L0r6l5J08JJ27j67l4m4P9R9M1M5p3j54m2J37j0lo3K5J3k2J66
430B65j5K0j29Km3K0l1O5Rj5J99q7r0L2l7j16P0R9L8j83N0J46Pk17Q3j27K09j2j38L0R5l1
55A68Qm9L1o9M5J33k10J14o6J21q7R8j20k0QK2QR4l3j23J20
$$ y = [111, 109, 81, 192, 208, 176, 283, 163, 118, 175, 267, 161, 212, 98, 154, 93, 99, 28, 43, 100, 64, 64, 26, 170, 116, 107, 54, 262, 190, 166, 76, 115, 168, 167, 278, 175, 156, 57, 145, 178, 247, 151, 175, 182, 212, 91, 25, 141, 218, 138, 150, 245, 167, 60, 162, 140, 263, 261, 108, 184, 72, 230, 192, 40, 69, 88, 66, 223, 161, 90, 194, 184, 145, 113, 174, 83, 191, 147, 71, 25, 67, 108, 154, 157, 110, 57, 100, 126, 125, 187, 97, 48, 198, 168, 181, 165, 196, 240, 181, 136, 129, 102, 166, 218, 136, 137, 45, 154, 107, 59, 140, 116, 18, 51, 110, 131, 144, 82, 173, 123, 279, 267, 147, 34, 130, 286, 119, 129, 274, 284, 204, 210, 191, 156, 184, 228, 275, 164, 16, 169, 95, 47, 170, 175, 251, 228, 101, 101, 117, 39, 96, 49, 58, 162, 121, 119, 131, 155, 188, 197, 102, 89, 115, 181, 45, 238, 218, 201, 78, 167, 78, 185, 190, 55, 137, 167, 71, 36, 144, 145, 272, 105, 71, 27, 106, 205, 246, 291, 218, 64, 22, 159, 149, 146, 83, 108, 121, 99, 265, 250, 270, 141, 143, 100, 120, 89, 154, 163, 148, 347, 260, 170, 202, 165, 49, 119, 218, 256, 73, 123, 269, 276, 59, 142, 15, 224, 212, 74, 104, 199, 168, 176, 127, 158, 89, 134, 267, 57, 171, 105, 226, 139, 237, 117, 97, 105, 127, 135, 229, 196, 73, 193]
-192A93
##PAGE=	F1=-3774.21
##FIRST=	25164.767445380970457,	5806.2096540000038658,	0
##DATA TABLE=	(F2++(Y..Y)), PROFILE
5806B25r7O1mj49P1n0J43j1m1J9O4oj16j3p9Q8Pm2R2j39J04Qj5O1j9R6j68J34k8o1M0j46o
5419B3P2k4M5r9J64R0j45J0L2o5j9j0l9P9Kj9J98Pj45l1j4N6N3M3j63J35r3%L2J0l1j02O5
5032A17M3j24mO3J54q7J6M7M5P6p2r5m2kR3p4r9J03KL9M0o8l6L0J6n6m4J8J9N4j41N6K11n0
4632B48j54J36m7K9o0N7N5n2Qk0r3J08j67J00J26p2j07J07q4J10J0r4m4L1Rj4P3p3m1k5N3
4269A13J7J42K4q8n0j38L5N2m9J06Nr8M7l3q1R3Q3m6P1J13q4r9Mr6J07n7J51l2j4qj22P8r8
3881D8K1J68P1k23M6Kj9r5R1R0q2no6J98q0m3K0k2J6M2p3J11q4KK20j33j43R9r9N4J7o5R9
3494A83o9N9j03J8J9M4k2N0O6j23P6j28J70l8n7J09j29pk2J2l3pN7J2M9o5K3J09q8L1p7o5
3118E4l0N2J30j42K97m4o9Kj47j7l2J53L6r1L2o9q9J55mk6k5J06J68l30j3N0j2K0l2R1m6j6
$$ y = [225, 128, 189, 185, 36, 107, 57, 200, 189, 148, 167, 231, 225, 109, 96, 17, 105, 112, 70, 162, 23, 127, 135, 120, 181, 162, 258, 90, 224, 196, 135, 175, 29, 23, 95, 71, 116, 17, 181, 271, 126, 136, 168, 103, 84, 74, 35, 114, 116, 97, 295, 302, 157, 126, 112, 168, 221, 264, 101, 236, 143, 143, 175, 185, 154, 52, 117, 160, 36, 32, 95, 249, 162, 178, 225, 270, 346, 274, 179, 137, 135, 228, 154, 55, 158, 160, 199, 239, 171, 135, 165, 181, 125, 81, 99, 118, 172, 31, 87, 298, 248, 94, 230, 183, 212, 152, 209, 264, 212, 220, 200, 107, 215, 48, 148, 274, 202, 95, 202, 118, 228, 238, 144, 100, 131, 140, 126, 199, 126, 85, 60, 113, 130, 272, 296, 208, 158, 20, 55, 107, 58, 164, 169, 71, 118, 85, 4, 97, 180, 134, 205, 318, 234, 135, 139, 43, 150, 93, 244, 212, 198, 190, 68, 146, 48, 69, 237, 308, 85, 131, 133, 114, 19, 110, 200, 118, 113, 47, 245, 165, 122, 142, 120, 136, 178, 105, 216, 132, 134, 354, 221, 78, 177, 78, 132, 149, 84, 183, 114, 173, 70, 88, 107, 151, 129, 179, 245, 122, 198, 70, 240, 202, 145, 254, 125, 118, 96, 108, 75, 68, 125, 137, 186, 121, 144, 253, 165, 196, 119, 54, 24, 76, 206, 64, 361, 317, 248, 250, 103, 86, 54, 207, 243, 152, 184, 115, 26, 181, 177, 151, 126, 232, 400, 70, 57, 107, 95, 115, 83, 174, 128, 112]
2743A12l3O0M4j3J10j48N4L1Q4j85Q7o4j7o6qK1lL2Lln0J19q8J2n8K81j03r1n2J0N1K1J02
2355B52j27O9j23P0J4R0p3J6m8Oo8j5N0J03m7k8P9j11o9J24l8J29m4j04O4r4J79p0j65O9J2
1992A02m4J75k4j33J32lk1p7R0j02J08l7j48N9J8L4pkJ2j13MO3QP9r0n3J06L2J5o1M9O8l0
1604B09m5l3j6P3P3j00oj22J29n3n5J24r9l3N9qR1K4j51J18l1J28Lj21j08P6J81j76k3J45
1252B53L2o6n9j2j9k5Q3O8j09j00J09p2j6Q2J1J03k8j22k7k0qJ8k8K4M4J1j3L7L2J8L2j56
876G7l6M3J20j16J79q5n0n2O7k7K8j4o6P2M5p1o0Q8J8J21j65J0j13O3Q6M7N9o7j42k6R6k6
501A03M0n6QM9r7J92l6O9q4n9J9o0LJ11lm0J64q5j6n9l2p0M8J07K6j92Q9P1K6j84R0j31J77
114A88l1r3N8R7o1J4p3M8l1PJ17k09K17j30J57j65J20j51k6M3L2N1N3m0p1R8
$$ y = [112, 79, 139, 183, 170, 280, 132, 186, 217, 301, 116, 203, 139, 122, 56, 48, 69, 66, 98, 101, 98, 48, 167, 79, 91, 33, 314, 211, 120, 68, 78, 129, 150, 252, 125, 194, 71, 141, 155, 245, 172, 188, 140, 146, 78, 63, 113, 216, 169, 141, 220, 109, 40, 164, 126, 255, 211, 107, 171, 77, 256, 186, 21, 90, 102, 58, 233, 209, 76, 208, 205, 184, 107, 197, 95, 203, 166, 18, 77, 95, 129, 122, 120, 132, 19, 23, 86, 94, 173, 83, 30, 136, 168, 183, 122, 171, 239, 209, 164, 131, 115, 188, 261, 161, 155, 33, 162, 109, 54, 178, 79, 46, 105, 97, 188, 212, 61, 179, 148, 276, 279, 158, 50, 126, 307, 131, 108, 253, 285, 219, 160, 148, 129, 104, 187, 255, 146, 46, 155, 83, 67, 149, 160, 263, 235, 113, 86, 66, 58, 76, 48, 72, 116, 127, 114, 151, 183, 201, 233, 77, 41, 84, 204, 88, 267, 182, 132, 80, 147, 120, 148, 134, 68, 140, 185, 114, 54, 142, 160, 281, 116, 126, 13, 76, 162, 209, 268, 201, 59, 33, 129, 103, 143, 87, 95, 144, 47, 239, 203, 272, 188, 129, 148, 88, 91, 202, 199, 159, 323, 238, 222, 163, 131, 61, 109, 216, 242, 50, 139, 210, 236, 52, 142, 11, 188, 157, 64, 122, 219, 158, 172, 99, 147, 116, 123, 240, 31, 248, 118, 275, 110, 230, 79, 53, 96, 128, 179, 232, 192, 121, 219]
-192B19
##PAGE=	F1=-3876.46
##FIRST=	25164.767445380970457,	5806.2096540000038658,	0
##DATA TABLE=	(F2++(Y..Y)), PROFILE
5806B46p7K2j3j43K3J3R8J6n8RJ54l6j78M3o8k6J7L1O0o1M1O7l1L5k2J02k07J84q4JQj40K3
5419D9J3K0O5r4J02J05j01Rj2p2J1m6k9R5J6PJ76r0j21J7j0O9N1P3k54J74o6k4j1K8k3p7Q8
5032A38L0j27LN3J79j01L6LL4P9q2p0m7j7J19o1j24J26j9L9Q1q2j09L2O1o8K6qm6O9j15M3
4656G5J82l2j06J44p4O4q1L7R7r0j7L6k04J70j34R5J21r7j28J00q8J45M1j33K3M3o1l2P5q8
4304H3nk1Q5J4R3K9o8o8q3rO1m3J02m6n9M7k3m1m0J06K1N6O2j6o8p1o1J11k4J13lOp5p8R1
3893A78j57K3J70L5j96N7Nkp5J22P9j17Kp7K01q4k2k3M8m9Q7j33J14j03M1K01j27j39J48o9
3541A38l9Ok4J11k1j07m3Q2j7R9m5O3L2j28R4r5J49j5j36J34j12Pm7O0l2o3O5J6P0p7J8O4
3165B07p5P1l9j05k6N7J04j23K75m6o4kj09j6l5J25L6j03M8m4j01K00l4p8PK9J88k17p2L1
$$ y = [246, 169, 191, 178, 35, 58, 71, 169, 185, 127, 136, 290, 254, 76, 119, 51, 25, 42, 73, 133, 72, 113, 180, 149, 184, 162, 264, 57, 241, 157, 158, 166, 26, 49, 62, 82, 147, 53, 155, 260, 159, 168, 156, 84, 95, 49, 20, 115, 131, 138, 314, 224, 103, 120, 110, 179, 230, 303, 49, 223, 157, 133, 122, 150, 127, 50, 138, 168, 41, 44, 97, 276, 175, 211, 214, 248, 327, 245, 175, 128, 111, 230, 169, 45, 171, 152, 191, 272, 190, 81, 113, 174, 106, 132, 124, 78, 147, 32, 75, 257, 225, 119, 263, 189, 253, 172, 209, 306, 216, 199, 235, 31, 201, 67, 162, 283, 186, 58, 158, 70, 215, 256, 123, 146, 189, 128, 96, 171, 83, 78, 57, 142, 156, 249, 278, 210, 142, 59, 50, 111, 68, 170, 124, 65, 112, 89, 48, 8, 114, 135, 191, 253, 237, 169, 98, 37, 148, 124, 237, 234, 240, 165, 87, 178, 21, 44, 214, 249, 53, 110, 115, 113, 38, 160, 239, 122, 124, 47, 248, 164, 142, 119, 167, 118, 205, 72, 186, 83, 124, 325, 198, 59, 207, 138, 99, 105, 81, 192, 171, 64, 21, 103, 86, 185, 140, 203, 235, 107, 201, 106, 255, 240, 104, 238, 126, 133, 86, 146, 114, 51, 116, 132, 202, 125, 143, 207, 132, 203, 164, 59, 33, 90, 194, 71, 346, 300, 236, 234, 125, 109, 74, 199, 235, 132, 180, 136, 35, 235, 201, 123, 130, 159, 347, 130, 58, 89]
2813H9J5j3k4J37o9k3j3j2O8J5R4j79J55JQ4k54J02%m7j10J4Q4Pk8L1Km9Q4j12L3n0L13j05
2426B40j76J2k9M6L4O7j28J61j42L6MJ06n3J1q7k0k2N3l3J30k0o6N6r6k2J10o3J29p7p2N9
2062A48p9J94r0j65J08J7r1J93K0j45R1Rj3j17J21j07J21m2j16R1l5K9j4n8O2m9j9K7j7P6
1710A50j05J0J2R5K1j06Q3Q8ro7o0jJ04P2j15Mj39J08l0q1J72j71M0Q1n7J49Rj88J08j4Q9
1346B52J3j05j02O3J93j60p8J51M8o6j10j2K5q0J03Q8r7l5N1q3M0M0kJ15j9j17o3k5N2k2n
982E3O7o1O5j4P2K5j5N8k16j1K4J62p5J40j54Ok7N1J7n8k8qN0N4k7m1J5M9R0j01K9j56N1N3
583A39L0M8p9p2J8J3m6R7m5pN1j20J82m1J00k4j05O3j21L2J31k2o4J16o4N2j15n2k3J7R0K1
207B00j75J43l2M3j03Q1j38J12k6l9P1Q7q9L0q3Q2jo2R8j10K01j73J60j88J16j38n2O9N1Q2
$$ y = [89, 104, 91, 67, 204, 135, 112, 99, 87, 155, 170, 264, 85, 240, 241, 325, 71, 173, 173, 126, 16, 30, 114, 121, 93, 124, 126, 77, 161, 49, 82, 32, 345, 240, 64, 76, 47, 93, 127, 194, 66, 227, 85, 121, 125, 231, 178, 189, 102, 82, 60, 113, 80, 210, 190, 124, 180, 84, 62, 172, 109, 238, 161, 89, 148, 69, 263, 173, 8, 116, 133, 42, 235, 255, 110, 201, 210, 197, 80, 201, 94, 215, 173, 57, 148, 113, 142, 128, 70, 132, 83, 64, 91, 74, 150, 45, 55, 67, 162, 183, 77, 160, 248, 239, 172, 112, 111, 215, 287, 172, 176, 37, 145, 115, 34, 206, 35, 75, 156, 99, 248, 257, 69, 177, 163, 252, 265, 160, 58, 121, 314, 154, 76, 227, 275, 209, 99, 87, 112, 32, 135, 223, 126, 91, 142, 59, 99, 139, 137, 252, 233, 116, 53, 28, 80, 58, 53, 120, 59, 124, 110, 182, 207, 192, 250, 34, 23, 47, 209, 134, 274, 120, 126, 99, 150, 167, 109, 81, 73, 123, 177, 150, 109, 124, 173, 263, 162, 191, 35, 86, 139, 169, 217, 138, 66, 84, 97, 51, 148, 103, 96, 147, 27, 209, 168, 268, 244, 139, 202, 81, 113, 244, 222, 158, 274, 210, 262, 147, 95, 72, 89, 179, 200, 25, 168, 136, 179, 76, 157, 19, 131, 105, 66, 137, 224, 135, 165, 82, 164, 163, 101, 199, 89, 290, 117, 277, 89, 205, 67, 15, 84, 135, 217]
-145B17Kn6j4J02
$$ y = [217, 219, 163, 149, 251]
-192B51
##PAGE=	F1=-3978.72
##FIRST=	25164.767445380970457,	5806.2096540000038658,	0
##DATA TABLE=	(F2++(Y..Y)), PROFILE
5806B58o1pk3j36J6J05rL1o9j8K48o2j69L5m4m5k6N3J7O1L1K5n8J3rJ08k14K07j47N4l3j10
5431B2O8j5K3P3o6PJ04m0J2n5m1ol0l2J06K2MJ73j80r5N7k3P3O9Q9l18K13l9m4n1K3j1JN6
5032A49Mq2j0L3J77q8N4m8MP2q0k0o5j3J23n1j02J24n2M5J21j02j61M0P9o1Q3kr7M1r2M7J60
4644B30j9j00J43o9J03j02lJ40j25l4Q3k09J51r9O2J09r6j26M8l3J43O5j31L2O8j08n6P1o9
4304F9Kj7J07J0L8K4m0n5k0o4L8l1J13r9kM0rJj2o4R0N0J3N4mj37n0O8L0P6QL3j29n1J23k02
3881AL7J37%j06L5kqm4J38O7j32Rp2J74o5k1n4J06r1J22j85J07q2O5J42j26q7J69m3j09j6
3517F6KJ01P3j79l8Q8l3J19o1Q3Lj20J03n4J04J4j77J11q2J3m7R7k2j00M8J4Q6p2Ppo7J06
3142A79J0j07j0L2P7q1J98l7m3j3o2Nn8Q6K5r6M7mj16K33m8j25K8l2K03q7j19m8R3l7l2J58
$$ y = [258, 197, 190, 167, 31, 47, 152, 143, 174, 105, 87, 335, 273, 104, 139, 95, 50, 24, 77, 94, 155, 186, 211, 153, 166, 157, 265, 51, 258, 111, 165, 132, 22, 90, 75, 98, 171, 105, 112, 216, 176, 188, 133, 92, 86, 56, 24, 130, 152, 156, 329, 149, 54, 111, 88, 161, 230, 319, 1, 214, 175, 131, 80, 103, 92, 93, 149, 153, 71, 61, 94, 271, 183, 237, 189, 193, 265, 185, 165, 100, 87, 210, 159, 57, 181, 129, 174, 295, 193, 32, 72, 151, 90, 173, 171, 74, 115, 23, 70, 230, 211, 111, 254, 185, 288, 186, 183, 323, 198, 164, 247, 38, 189, 90, 152, 261, 165, 39, 87, 54, 197, 262, 131, 163, 231, 123, 67, 138, 69, 71, 54, 161, 171, 209, 233, 193, 138, 118, 54, 92, 61, 174, 75, 73, 113, 104, 105, 93, 29, 119, 169, 182, 236, 232, 95, 45, 113, 143, 219, 227, 260, 131, 80, 203, 1, 38, 175, 175, 69, 104, 102, 94, 50, 188, 255, 123, 132, 60, 234, 169, 148, 94, 200, 109, 231, 46, 153, 71, 136, 278, 152, 65, 234, 191, 82, 66, 68, 169, 242, 63, 25, 113, 80, 199, 138, 221, 224, 104, 207, 153, 257, 271, 94, 205, 123, 136, 89, 186, 164, 64, 112, 126, 212, 140, 147, 140, 73, 179, 189, 82, 72, 104, 181, 100, 298, 261, 218, 205, 143, 148, 90, 176, 201, 105, 152, 148, 32, 265, 217, 92, 120, 88, 291, 204, 85, 37, 130, 93, 61, 219]
2766B19q4k1j2m8Q1M1O3j76K15l4Q7k79Q1O2m2j00J5Q4lp7N7J0k9M3j21N2m7L15r1k29O8n8
2391D2K8L6J8n7J81j41j7NJ13l7Mr4ql5J13j03J43kr6L6m2k2J13q8J22q0p8O3n0J87j00j45
2015IJ34L0j48K02O2j12JK6k3j45J54j06J38n4o7J05q8K2J4j35Q7J8jom5M7r8P7k8Q1K8j34
1639D5J14J00J2j15q7L6J29N6j23K8j17L0K5j32K14j64M4J02q2J84k4j88P9mN0J6o8r7N1J91
1287C05j20j39J60M7q1j19k8R0l9jJ10p6J6Qr7Q2J6k8J21lj07j06N4L6o2K5J15j46P6NJ01
923B15Mn4P4j96L6o8J86l0R3k19J98j08M2L2j22jmJ6N2J8l3l2Q4M2j7L0j77N3K9qJ0j05M4
536H4N2p3l8J34l5nQm1R2l7J16K8j27R4j64N1J30m9p7O6l2J00j14r6K4l2O0K0j36J91j06K9
160A17jO3j23QLJ6O4O6j13N2q3J17K3j40Q2k9J74j92J33j66R7j08JJ2O8R5m2q0L6J18
$$ y = [219, 135, 114, 102, 54, 135, 176, 239, 63, 278, 244, 331, 52, 133, 195, 153, 53, 68, 152, 149, 72, 129, 139, 110, 153, 32, 84, 37, 352, 261, 32, 100, 42, 70, 106, 124, 67, 248, 107, 90, 95, 208, 171, 175, 81, 73, 38, 151, 48, 191, 189, 93, 129, 87, 65, 178, 90, 212, 132, 54, 117, 67, 254, 154, 9, 143, 173, 25, 227, 289, 177, 178, 204, 181, 36, 190, 84, 222, 168, 101, 206, 118, 140, 154, 19, 106, 124, 123, 117, 72, 119, 21, 98, 70, 151, 179, 45, 159, 259, 271, 156, 69, 105, 234, 290, 167, 195, 78, 108, 133, 1, 215, 51, 95, 197, 115, 299, 275, 87, 166, 162, 212, 228, 160, 63, 114, 305, 185, 46, 206, 253, 172, 53, 25, 115, 76, 75, 185, 109, 125, 133, 36, 118, 134, 106, 227, 224, 117, 11, 65, 101, 39, 64, 179, 33, 109, 114, 215, 219, 165, 239, 43, 79, 11, 197, 167, 260, 41, 239, 131, 173, 205, 83, 82, 78, 94, 146, 164, 131, 99, 183, 225, 208, 238, 61, 114, 143, 135, 145, 40, 84, 136, 63, 25, 159, 124, 119, 127, 86, 178, 141, 257, 285, 158, 252, 88, 139, 269, 220, 143, 209, 177, 277, 163, 67, 91, 59, 119, 139, 3, 194, 88, 117, 116, 179, 56, 64, 67, 83, 147, 213, 100, 152, 69, 186, 209, 69, 151, 122, 296, 104, 237, 71, 168, 60, 61, 73, 141, 236, 194, 114, 150, 268]
-192B68
##PAGE=	F1=-4080.98
##FIRST=	25164.767445380970457,	5806.2096540000038658,	0
##DATA TABLE=	(F2++(Y..Y)), PROFILE
5806B51m1k4l3j31L8J45p4K5o9n8L27q9j24Nk9k7j4Mj2J51M0l7q9MRJ08j98K13k02Q7p4o8
5431A4J22ok4Q1m8p1Q6K9Oq3J8n5Nm4J26J8k9J90k25q7Q6n4O0J00R1k54J58j2o1q1OJ0O0J7
5032A49k5k3l8J5J56m7O4r3l4N0m3L1r7QR7l8l9Q8q2N4J47j20j09ML8k4J02J3j10j6o7N7J47
4644B15j5j27J35l4J26j16m3J71j51l7J05j51R5n7KR4n7j12mP9O0P2r9kR9j25p0N4l4pj3J07
4269A60MjJqqK1r0k2JJ08j40P8K0jK8L2j15J3O2k6J00N2j30q3j0J14L4kO0j59m1J55j92N4
3870F9N6k0J3%j9k1j8J26O2j31J4m1J08k6l1o4J35r9J27j93Q2n0O6O9j20nJ55j6j11m1l2P4
3494A18J81j20j38P1m0J17o2J02j9r5J01j6N2L8j73N0n1Pk9J29qj21J7J4Q8n6J2o6o7R8O2
3130A96p7k0OO2k4P9mj6l8oL4q6L9Lp0L1M3r1K08m8j51K7k1J60L5j84rR8n2o7J60q5km4k4
$$ y = [251, 210, 186, 153, 22, 60, 205, 131, 156, 87, 29, 356, 267, 143, 148, 119, 92, 78, 82, 70, 221, 261, 224, 135, 139, 148, 256, 58, 271, 69, 156, 82, 14, 136, 130, 106, 187, 139, 68, 154, 183, 189, 106, 124, 69, 74, 30, 156, 174, 145, 335, 110, 23, 109, 55, 115, 215, 306, 52, 210, 198, 137, 56, 62, 72, 132, 149, 124, 101, 63, 78, 234, 187, 251, 158, 124, 174, 131, 162, 65, 73, 170, 132, 93, 181, 99, 153, 300, 180, 71, 75, 113, 89, 191, 204, 94, 78, 11, 68, 215, 200, 73, 208, 174, 300, 184, 141, 312, 161, 124, 229, 78, 173, 116, 118, 212, 155, 43, 39, 118, 178, 250, 151, 149, 248, 123, 53, 107, 73, 66, 53, 160, 164, 163, 164, 156, 148, 169, 79, 57, 58, 166, 26, 104, 124, 123, 151, 183, 68, 81, 143, 117, 217, 269, 139, 56, 46, 160, 194, 192, 252, 93, 52, 207, 15, 69, 125, 105, 118, 118, 99, 78, 60, 186, 248, 117, 131, 90, 198, 172, 141, 77, 212, 113, 240, 47, 129, 79, 145, 214, 94, 89, 244, 228, 117, 76, 44, 118, 299, 179, 41, 112, 72, 189, 127, 229, 210, 115, 216, 200, 252, 290, 117, 167, 116, 123, 94, 223, 215, 94, 111, 125, 213, 157, 169, 103, 36, 134, 196, 119, 99, 105, 167, 143, 222, 218, 202, 164, 158, 192, 106, 145, 148, 78, 109, 152, 61, 269, 221, 70, 97, 76, 236, 271, 87, 78, 176, 124, 57, 217, 132, 130, 86, 62]
2719F2P5M9K4j06J99p1Q4k36J9J04l0o4oP1k0q5M8K4Nmj16O9o2K98p1j90O0n6j1L5l7N8J31
2332B50j18p1J6J05k9oo6M1r4J39j33J24Nj13M8km6J19j03J16m2j32P5QJ50j08j24J57M1j81
1980B6J82R6o1r5M7m9j27J50j01J51o5rR6j32J4N0j18KQ0K4l3n2P%N3qRL2j23J15R9M1j67
1592A34j12R1J20L8j22N9p0o4Q7j26J68r9kJ21p7J83n9j68M8pK4J6k0q2K9J68o0j81J59J9
1240B15r8m8k0Q1Kj05J16m5M2pr7P5Om4J24J5q1r0O0K0j04O7J48j48mM1J15j9r2P3q6J8j11
853A9J54J0N3j87L17k01L0L1j49L2k2j7L0M8k9k9R9j1N3K8j84M4L1l4n0ML5P6j55J3J31k8
477A42J0o4N6Jk9J22N9j27J17j98P1J07p5p5K1NJ17p8j32P4q8K2J3m4J91q4o4R0L8j00p0K5
102E3N6M4L4j31P3p3J35M8j84M7K4J43j77Q1j24Q2q2O7m6O6R3o5j07O9J35
$$ y = [62, 137, 186, 210, 104, 303, 232, 316, 80, 99, 203, 173, 109, 103, 174, 154, 69, 117, 141, 146, 142, 26, 95, 33, 331, 260, 70, 130, 74, 63, 98, 61, 119, 250, 132, 61, 77, 182, 153, 147, 81, 122, 28, 167, 34, 158, 163, 50, 98, 96, 50, 169, 66, 182, 140, 8, 83, 91, 241, 133, 9, 166, 207, 26, 208, 304, 243, 148, 195, 146, 19, 169, 68, 219, 154, 145, 241, 109, 123, 173, 55, 57, 137, 161, 128, 76, 83, 83, 136, 128, 137, 169, 46, 161, 260, 301, 134, 22, 113, 233, 271, 149, 208, 138, 74, 161, 35, 203, 104, 102, 223, 146, 329, 270, 102, 150, 143, 167, 183, 163, 81, 110, 278, 218, 37, 196, 215, 117, 69, 49, 130, 132, 27, 143, 98, 140, 133, 36, 111, 117, 73, 197, 212, 131, 41, 101, 121, 17, 84, 232, 84, 80, 121, 236, 217, 125, 198, 112, 130, 19, 173, 183, 236, 49, 366, 165, 195, 226, 77, 109, 87, 70, 100, 148, 119, 90, 189, 178, 231, 259, 75, 119, 150, 116, 66, 70, 105, 181, 26, 39, 170, 142, 152, 88, 144, 145, 116, 238, 297, 170, 287, 89, 160, 267, 192, 117, 138, 143, 260, 182, 50, 124, 36, 58, 71, 27, 218, 134, 70, 160, 198, 98, 28, 53, 109, 153, 187, 56, 129, 56, 191, 239, 55, 102, 126, 269, 92, 173, 49, 131, 49, 116, 70, 136, 229, 164, 57, 126, 261]
-192B61
##PAGE=	F1=-4183.24
##FIRST=	25164.767445380970457,	5806.2096540000038658,	0
##DATA TABLE=	(F2++(Y..Y)), PROFILE
5806B23j5k9m3j22N6J55q7pn6m2L10j09q3mk5j1J1k6j8J88L0p8j09RK1J01j74K10k33R3r1
5442D5k2J51Kp6R4l4q0J2R7j4r1O5p9J8n9J52J1q1K15j93r0P3n4mJ23Q3j52J00Rp4j00ML8
5055H9O4j3m3J4o6JJ38QN4j17o9J9N9K9j21L4L2j6L9L4r3N9J50j34k1k3l5L2P7K8r5o7k5M5
4656F7J37j8j59J12J8J22j14o9J79j60k3Q7r8O5oo4P4J9j15O5P3l8O5n6m9J23j17o6K5nqj3
4280E3Q0%qm4L4M9L8r1p3L8O6j19J17PrL7P2r2j21Q7n3J15Q1p7j18k3J31j7k1P9j57m1J67
3893A87j57O9k6kQ7j1l3ml9Q4O7j17J2J2J5K3m1n3J26o8R4j46M6n6O5Np5N9J11J5p6o0r1L9
3494F1K72o6k31O0m6J05l6R9k8n7Q9J3J3M7j49%l9j2j0J61Qj39pK3P2l9K8m7l2k9J04k5n3
3107A10k0O3L3n3O0ko7M9N3j11kk1l5J5P3k9J42m5j39nM8O6J26k49J27N0o4j11J36p1L5r3
$$ y = [223, 208, 179, 136, 14, 70, 225, 138, 131, 75, 33, 343, 234, 151, 147, 122, 111, 122, 96, 78, 266, 296, 218, 109, 118, 139, 240, 66, 276, 43, 136, 45, 23, 174, 176, 100, 194, 160, 80, 92, 189, 175, 84, 149, 70, 88, 29, 181, 192, 111, 326, 133, 43, 116, 62, 58, 181, 264, 112, 212, 221, 147, 47, 51, 89, 153, 140, 97, 111, 45, 46, 184, 192, 246, 129, 60, 79, 138, 167, 46, 80, 112, 96, 135, 169, 76, 135, 285, 151, 130, 107, 72, 104, 181, 209, 114, 47, 22, 67, 204, 186, 27, 139, 157, 279, 165, 96, 275, 115, 92, 179, 81, 146, 140, 76, 150, 169, 54, 119, 192, 154, 219, 163, 114, 237, 120, 54, 79, 74, 66, 53, 133, 133, 125, 81, 115, 164, 202, 111, 38, 76, 142, 23, 140, 147, 138, 175, 247, 155, 34, 121, 68, 183, 264, 187, 69, 46, 177, 160, 139, 218, 61, 20, 187, 30, 99, 73, 71, 158, 147, 114, 110, 71, 155, 222, 105, 117, 129, 144, 167, 126, 73, 199, 131, 225, 79, 125, 69, 134, 139, 64, 123, 234, 249, 173, 113, 22, 61, 333, 267, 36, 96, 50, 155, 119, 218, 190, 133, 222, 235, 248, 295, 146, 146, 107, 95, 85, 246, 254, 115, 108, 131, 203, 164, 192, 145, 113, 84, 188, 163, 110, 90, 153, 186, 133, 193, 191, 124, 173, 226, 115, 113, 92, 57, 72, 145, 116, 258, 213, 74, 69, 117, 183, 309, 60, 187, 237, 173, 62, 198, 127, 162, 69]
2731F9K0O7M0j9j9J63r9O6j67l3J10k7ql9M9k1k5k3M2L5n7j04R2r6K68n1j23M7l3n3L1p7J36
2344A61P0p7j08K7Q4k8k3j7Q0j14J01r9O2Nj01J12l1p2J04r8J17J1j11J4N5J05j15j07J69
2003A76N0j78J34J14nj70O4q2m2Q4r5J53o8O2N0j65J6P7o8q6J07M8o0m4k1R5J4Om6L0q5R5
1628A60Q4P6j74q5O6Q2K3j06Q1oj09R6j23J10k8m9J33m4J46q2j40K8j8NK4K0m7mJ18Qk02J51
1252A94l2q6L1j9N9J3r3L4j1N1J2j06K9Ol7J19M1m8p5L2K6j33J04J57j35r3P8J16l5j20N9
888A38M1j2j31J09M0L0r9L40k65J1K8j51K8j3k4mL9k2L0Q0n2Q4K9j80J5M8k2j11J64m7Q7j76
513C2J6J23k3L5j42J52p3k2J10O5r8J27k26R6O6r8n1j4L5J02l4j34J20q8k8l1L9J86l5j55
160E2J41Oo8o4nP5J9kj47Q8m5J31O9j49l0L4J16j26L2r2P4m9R9q5M4P9o4j00N4J45
$$ y = [69, 89, 156, 196, 177, 158, 321, 222, 288, 121, 88, 198, 171, 163, 124, 173, 152, 127, 104, 146, 181, 124, 20, 112, 16, 284, 233, 110, 157, 124, 71, 102, 25, 161, 231, 154, 46, 73, 157, 129, 106, 89, 169, 55, 156, 57, 119, 124, 23, 135, 104, 32, 136, 38, 155, 166, 55, 69, 124, 229, 114, 7, 176, 226, 48, 182, 296, 291, 121, 185, 103, 61, 145, 50, 203, 135, 197, 247, 82, 98, 175, 107, 21, 128, 176, 116, 72, 51, 146, 160, 166, 120, 150, 65, 160, 244, 320, 146, 61, 127, 209, 232, 126, 207, 201, 92, 188, 65, 175, 147, 98, 231, 187, 333, 251, 111, 139, 121, 126, 150, 170, 123, 119, 237, 245, 43, 194, 162, 76, 107, 88, 147, 160, 67, 101, 90, 141, 153, 47, 76, 82, 45, 164, 205, 157, 82, 114, 140, 7, 111, 268, 133, 40, 118, 234, 199, 79, 138, 179, 167, 36, 145, 185, 215, 116, 456, 191, 202, 230, 79, 107, 94, 70, 66, 105, 83, 113, 193, 141, 225, 254, 74, 89, 137, 115, 4, 168, 121, 208, 32, 48, 171, 148, 183, 41, 193, 120, 98, 208, 273, 175, 302, 76, 172, 238, 140, 89, 75, 110, 212, 178, 44, 164, 76, 48, 17, 56, 242, 207, 52, 193, 199, 131, 67, 62, 137, 156, 154, 7, 95, 50, 181, 250, 101, 71, 105, 221, 95, 127, 35, 109, 60, 159, 74, 118, 197, 133, 33, 87, 232]
-192B32
##PAGE=	F1=-4285.49
##FIRST=	25164.767445380970457,	5806.2096540000038658,	0
##DATA TABLE=	(F2++(Y..Y)), PROFILE
5806A77J8k6n6q8N2J39n5n6l8J6K11j12o1K2k5pM8l5l2K00j2r0j01K7J7Q8j45K01k40P8l5
5442H0l2J46Jj10J08j9l7r2J51l5r3Q3n5Op8J74Lj35K35j21r0L7k0p5J04O9l2M4K0q1j19K6
5067F3N1L5k5l0jn7qJ46K6J8j15p8J1J47rj22N4o3J4J12j9p7M5J32j40O7m2q8P7K7L6n8q6
4679D3JJ9J26j6j16J5O2Q9r3o7J55j44KK9n6N6M3q0M0R4j31J28M7j21M3j1q8J31r3n0lJ5j
4292F8j3K8jL4r7R6O5K9p9p5M1Ol7R8Mk6K8J09n9j79O8o9J04Q0nj25M4N3p3l3Q2j22KJ02j00
3881D8O3q1N4Q8Ol8K7q3J9Q0r2KP2q3P1m5k5P7lL0o3J7r6N7l9L8N4M8N1l4q2r1nL04l4k82
3459C0M0n2Q6K8N4k8rO8L1nM5j15po0m8jJ92J6j50j5M3M4l1M0Oj2j42J24K8r5l3O3P8j67J40
3048A86qp4P9N9j34j6m5kL8M5M1P8m6r8l6Q0j2J71k93K74Rp1j37P7m5Q1j36M4O1K9n6O0J30
$$ y = [177, 195, 169, 113, 25, 77, 216, 161, 105, 67, 83, 294, 182, 121, 143, 118, 111, 159, 124, 92, 292, 280, 190, 89, 116, 133, 221, 76, 277, 37, 115, 80, 48, 194, 195, 85, 193, 174, 137, 45, 196, 161, 68, 151, 96, 102, 24, 198, 201, 66, 301, 180, 90, 127, 107, 32, 136, 205, 173, 217, 237, 156, 37, 63, 114, 149, 124, 94, 93, 36, 28, 174, 200, 218, 103, 25, 36, 183, 174, 52, 106, 43, 57, 169, 150, 73, 118, 250, 110, 177, 135, 47, 124, 151, 187, 129, 43, 44, 63, 189, 173, 57, 72, 134, 223, 130, 63, 218, 74, 76, 105, 49, 105, 148, 68, 108, 202, 71, 199, 246, 125, 168, 157, 69, 200, 107, 57, 54, 69, 68, 55, 83, 82, 116, 19, 115, 180, 209, 130, 55, 96, 102, 65, 163, 167, 141, 169, 278, 219, 40, 108, 39, 143, 223, 218, 93, 137, 190, 117, 84, 166, 44, 46, 148, 48, 111, 30, 84, 172, 178, 140, 167, 84, 103, 183, 91, 93, 165, 82, 153, 108, 83, 160, 157, 187, 124, 141, 45, 102, 63, 101, 155, 203, 254, 220, 138, 47, 42, 346, 312, 30, 70, 18, 104, 132, 186, 158, 149, 217, 248, 243, 288, 173, 166, 106, 58, 57, 249, 265, 115, 100, 143, 187, 156, 196, 202, 190, 48, 172, 200, 105, 72, 135, 213, 46, 186, 178, 104, 183, 242, 108, 92, 47, 45, 83, 128, 169, 247, 201, 103, 67, 147, 135, 306, 13, 287, 296, 225, 88, 165, 120, 201, 65, 109, 170, 199, 143, 203, 333]
2661C33j05K7j04n7Q9l9O5p6J5J4M7q6N0M0j15o9J02j15K00l5m6M0%q0J8o6J34J6l3j18M1
2297H7N0l0n0M1J02j12L9l6nMk2J36r3q0M8l8J04M1o9j0L7P6j15q6J49N2j46P8J16M0k04O5
1921A69r8J4L7r3J45o1J35k8j82M1Q6j4o1K4N8r2k2j4J48k5Op3K1l0O1N9J08j19q5J4L7J8
1545A84p7P8O6j07N9j19N5K9p7J30J1P9q5j13K6j4k3L8L7Ll1M1P1k22J58r6J3J6k8O2ql3o1
1158F2K1N6N7j45j9OlR9P6k6p2j2N2j22J06J45j12j51P9J06l6j25M3J42m0j39P0N7L4m9L27
794D87k87pL0j36k4K5ool0mR7N5o2O4L3j69l3P2K5p9J85j07Q7j29j6R2j6O3j66J92j16j0O3
407A67N3m0J12k40J18J7j13Kl1L6O2Kj02J58n1n9l6L2J70jk03J45k1l0n2qP3%m0q2J9OJ08
20A71O9p4p8j6R8n9L8r0N6j1P7j01QO2m5m3j5J43
$$ y = [333, 228, 255, 151, 94, 183, 144, 209, 133, 148, 162, 209, 123, 173, 213, 98, 29, 131, 16, 216, 181, 135, 175, 175, 95, 113, 47, 181, 197, 164, 46, 87, 137, 107, 57, 98, 200, 88, 127, 91, 86, 90, 68, 204, 111, 31, 79, 41, 145, 186, 117, 107, 144, 220, 105, 19, 168, 220, 74, 152, 268, 308, 104, 169, 71, 85, 122, 29, 174, 113, 248, 220, 38, 79, 165, 151, 90, 114, 172, 80, 58, 44, 192, 167, 173, 100, 121, 91, 152, 211, 319, 200, 115, 129, 166, 184, 107, 185, 251, 144, 203, 84, 139, 168, 91, 221, 232, 311, 226, 113, 139, 125, 102, 140, 177, 180, 149, 190, 261, 39, 197, 101, 114, 130, 102, 164, 156, 123, 62, 83, 139, 196, 51, 32, 38, 35, 134, 210, 184, 112, 100, 152, 30, 136, 281, 169, 18, 97, 203, 167, 42, 85, 227, 187, 48, 118, 175, 209, 160, 487, 200, 193, 223, 87, 63, 88, 82, 76, 46, 42, 139, 194, 132, 196, 229, 60, 27, 99, 124, 45, 230, 123, 210, 81, 65, 157, 141, 204, 38, 230, 114, 104, 167, 220, 180, 292, 52, 170, 187, 74, 76, 45, 81, 143, 145, 43, 201, 150, 91, 55, 87, 257, 256, 53, 198, 177, 147, 95, 87, 160, 160, 120, 38, 57, 63, 171, 240, 166, 88, 72, 170, 111, 149, 59, 115, 104, 181, 80, 88, 150, 105, 62, 47, 190]
-192A90
##PAGE=	F1=-4387.75
##FIRST=	25164.767445380970457,	5806.2096540000038658,	0
##DATA TABLE=	(F2++(Y..Y)), PROFILE
5806A25N2k2p0l8M1R9Lj00l3O0J00q7o9Q3k0j8Q0k9o1K05q2p8n5M0OQ3j22J86k31N2K8n4J15
5419A89qj04J07KKj72J85m1j06P4Lmr5J76j0j65K28m2p7pOq1L2M9Q3jJ4p6j37L9N9Jj6J1o8
5008E0L0lJ52k3l9q3l6K3J42l7j17Q1j12qJ66m6o0J9J01j38J46o0q0P3l1M0np3kj0J08lo8
4621I7n1N9L4n0m4J08q4Ln0RK6P2l8L1J18j44J52K0j80J5L0j03J15o2k1l1L3Mol5J7R4n7Q3
4222A64K2jo1o2M2m8M1O5Rm2OJ40k6j71K9p7P8O2N6j00Q7j7j24k0N9o7M0J5k5K9p5R3L6M0
3823A97m0N3j18n1R6n3j4J24j47Q2l7J2oQ9m8L8qj03pm4J35K6j9Q7Jj03n8k1K79l1k59j1k1
3435B0M0J05l2j7L4M3M2jM0p0J6r4j10nK23J0j54jO8J0l7L7O7Ok09J17P2j36rL6J03j92J53
3048A75k1m6P2N5j53J6p8K2P9j9J03M1n3o1k7N2o8J75j98K90j4p7j37Pk3J25j66L4O3K4q1
$$ y = [125, 177, 155, 85, 47, 88, 187, 190, 90, 57, 117, 217, 130, 61, 144, 124, 106, 186, 157, 96, 301, 219, 141, 86, 126, 132, 215, 93, 279, 48, 100, 128, 74, 189, 181, 77, 184, 186, 188, 16, 201, 160, 54, 128, 131, 127, 32, 208, 198, 33, 261, 219, 142, 135, 141, 60, 92, 141, 224, 223, 237, 161, 24, 63, 122, 123, 107, 118, 50, 80, 77, 229, 206, 167, 84, 48, 71, 213, 176, 59, 140, 28, 20, 186, 140, 80, 99, 200, 62, 208, 148, 68, 141, 110, 150, 145, 72, 70, 60, 168, 165, 97, 46, 105, 139, 89, 45, 153, 69, 72, 22, 31, 57, 129, 91, 122, 240, 96, 248, 268, 88, 103, 133, 30, 145, 83, 62, 31, 64, 68, 62, 27, 44, 138, 81, 164, 186, 185, 124, 62, 104, 56, 97, 162, 171, 129, 135, 275, 249, 78, 107, 30, 108, 170, 226, 126, 213, 196, 72, 52, 111, 44, 84, 99, 74, 103, 28, 121, 157, 197, 157, 210, 92, 41, 137, 84, 70, 194, 47, 129, 92, 104, 98, 187, 139, 177, 169, 66, 59, 15, 150, 176, 157, 244, 245, 142, 84, 63, 342, 311, 52, 41, 20, 60, 165, 133, 116, 150, 193, 235, 234, 274, 204, 220, 126, 16, 11, 234, 244, 90, 89, 157, 167, 130, 167, 234, 240, 31, 148, 220, 84, 75, 111, 214, 22, 175, 154, 108, 180, 235, 82, 98, 20, 42, 121, 102, 205, 246, 193, 132, 105, 157, 89, 264, 66, 356, 342, 265, 128, 135, 112, 237, 71, 105, 168, 192, 111]
2684A11J25J01q6k1p0o1P2p1J42j01l3P6J01j11N1J4j73rR1r1Q3k5L4L0L7r4%l3R6k7Kj08
2308E2O2Ok0o8P2J11j02j6K6n5J3L0J51j37p7lM8O4L5k0Ol7P3j04o5R9M8r6K4J03O9j98N1
1921A45p6K1J1q8J25n1J97j22j20L0Q0L0k3m2M3j30RK9J43n2op2ML9K4K2J17k9j03m5JK7l9
1534I9M2J37q8J1j14J5O0o9J06P4jo7r7L4K1n4L1L7O4m3m4J13k48J92j52J32m9m8R0n5M0j40
1158B9M5P2J04k04J2k2J6P7J00k8p1p0R2j11J07J23p9j31JQ7k6r4N8J60n7j24K9O7N8m3K76
794D53k62k0M4j02q8M9J4J6p8J0J07N1n2J4M0j55J6j8R2o7J81j38P7n6l0K7lQ5j26J72j18
430A35kj4M4K7P2k38J31k5r8N2k4lPK3l8J86mj05k8K2J30J8k20J20l9J3m4K4N3j2p0k0k5N2
31A00Q6K8Rq8r0R8j4Q4j13L9J3K4r7k4M4j5nm8J13
$$ y = [111, 236, 337, 251, 230, 160, 99, 171, 100, 242, 141, 108, 184, 285, 174, 225, 239, 66, 57, 148, 57, 140, 115, 149, 179, 216, 122, 122, 89, 185, 158, 160, 52, 114, 120, 100, 32, 104, 215, 113, 97, 123, 68, 81, 111, 262, 125, 48, 45, 93, 157, 192, 172, 178, 141, 214, 110, 45, 144, 192, 96, 120, 223, 292, 94, 145, 69, 90, 101, 13, 138, 87, 284, 162, 42, 72, 152, 182, 159, 117, 160, 30, 39, 68, 211, 159, 153, 81, 85, 124, 148, 170, 287, 258, 155, 110, 111, 138, 99, 141, 278, 190, 201, 87, 102, 162, 93, 199, 273, 272, 205, 108, 142, 163, 109, 140, 177, 241, 198, 154, 267, 19, 211, 59, 191, 142, 94, 184, 129, 169, 29, 74, 146, 250, 46, 58, 36, 52, 129, 229, 201, 130, 60, 152, 41, 148, 271, 192, 61, 62, 149, 123, 29, 87, 247, 190, 66, 95, 162, 220, 177, 453, 191, 171, 215, 113, 25, 74, 88, 104, 26, 36, 143, 194, 142, 156, 196, 41, 57, 39, 131, 64, 245, 107, 184, 128, 98, 125, 122, 207, 81, 253, 135, 133, 119, 163, 190, 262, 24, 155, 130, 32, 84, 60, 57, 64, 87, 49, 235, 231, 126, 98, 120, 250, 268, 48, 168, 129, 142, 98, 122, 175, 163, 93, 73, 48, 100, 186, 214, 223, 135, 45, 143, 129, 213, 100, 139, 152, 176, 79, 55, 99, 84, 79, 31, 144]
-192A44
##PAGE=	F1=-4490.01
##FIRST=	25164.767445380970457,	5806.2096540000038658,	0
##DATA TABLE=	(F2++(Y..Y)), PROFILE
5806H3P7k4q5K4K5M6O9j13o4R0Jk8q7J39nm1R0j6q6J94j53o2L0L3JR2j11J66k21L1O6o5O7
5419A63k0m6P5J9K4k03J81j9j26L9P7Rj11J49k8j47J74L0n0n6J3p3oJ8J63k4pn7j24NO3j8
5043H7J4M9j34J18nJ74j01j02j8lLJ29m4j03J06q5n6J52l5o0rO5j30K08p6l2M3p7M5L8n6l
4668A02l6P3K3n1l7%k5J4k9P4rl6lL5l4J6K2O0J12j49J29Jk04j2O1o8N6j3Lo3N0nK5j9K4Q4
4245A71m0Q4m0m1l5n4N6l9N5J8K0n3j5J65qj47K2p7L9O2P1n7J04o6j42J5Rk5O0n6N1k5k4J19
3846A77n4P3m6P4j33o7O5kk8J54j30J8k2N0j01J87j06J19l1p2p5J6J14lp4J20K2j17j4m1K58
3482C31o2j92n0L1K2J20j24oO2J5M8K0M3j6M1j22j36K0J73k0j52L1R1k1n5J6J23K1k20R1R4
3118B17j68N7k2J05j26P7k7mN5M5j57Q5j20K7J03p4J41L6n3n5RNj06J47n1K40j9q4j15l8k9
$$ y = [83, 160, 136, 51, 75, 100, 146, 215, 102, 38, 128, 129, 101, 14, 153, 148, 107, 197, 181, 95, 289, 136, 74, 104, 137, 138, 230, 119, 285, 64, 95, 161, 96, 163, 143, 97, 172, 191, 215, 12, 193, 174, 48, 87, 164, 173, 62, 211, 183, 36, 210, 240, 190, 134, 147, 74, 68, 86, 249, 225, 218, 161, 37, 42, 105, 87, 101, 150, 16, 134, 129, 303, 202, 100, 82, 79, 82, 211, 167, 64, 170, 85, 29, 181, 146, 86, 77, 142, 12, 220, 144, 112, 155, 78, 123, 161, 105, 102, 66, 139, 162, 111, 74, 74, 49, 63, 34, 108, 99, 63, 60, 95, 61, 77, 99, 159, 271, 122, 251, 252, 48, 36, 97, 29, 85, 72, 75, 12, 62, 57, 82, 63, 87, 171, 131, 215, 175, 134, 99, 45, 101, 62, 117, 135, 155, 102, 87, 252, 244, 97, 119, 42, 81, 143, 214, 157, 261, 195, 53, 68, 77, 52, 112, 56, 107, 82, 58, 177, 123, 196, 150, 224, 91, 24, 89, 87, 59, 213, 83, 101, 79, 129, 28, 215, 109, 228, 197, 125, 50, 66, 180, 177, 103, 223, 245, 128, 114, 73, 331, 269, 77, 27, 58, 80, 200, 76, 70, 132, 147, 195, 215, 258, 242, 283, 161, 25, 45, 218, 198, 46, 77, 168, 147, 92, 108, 231, 252, 32, 123, 217, 49, 106, 84, 189, 63, 140, 113, 109, 164, 209, 52, 137, 17, 44, 147, 73, 214, 250, 197, 142, 151, 156, 50, 197, 146, 386, 367, 283, 168, 130, 101]
2754A01J64j86kP6K7r4J70P1n2n6p5n0Q0j12J95j02q6J31J41j05N4l3k26N8P2o0k2k7J10J3
2402A75O0r5j5J7M1n4J6q0Q1m3Rl5L2J12j01l0N9r0K9M7J56j46o2L5L3K4QK8M4j41R4p6n4
2015G8L1L8l9j9P8Q0j58K6k1npm8P0m3K34k13L8m8P0N7J1p3J6r7k2O5J02o6j5m5k8J11Lk9
1616A32R1P0j16j03j6M7j1qJ90o5l0j04j1O3k4O5J31p3m1q8M0O7o3j1L5J25m0j00J18k58K33
1252B45j56J75j11p0J23j12J04j75L9R6J37k56O8m1K1Q1R5n3p6j24J26j06J12J03l8j06p6
935B5N9j2m5Q9J21o1q2j3P8Q1n9J87j96k7O8n6l6m9PM5m0k9O3P4m6k6M5j36J17j07Q6n5J44
548B14j36N7K6l1m8J4Q9o6J41q8Jj00P3N9J1k11J26l5k8K8k2l9ojL2K07M0j63j4K1O4K7k07
160C5P2m1N3l9Q3J8j9q3J2j3P8P2n2Q3p9j40J13j4J36j35K7K2m5p4m0L1J1kl0O2
$$ y = [101, 265, 79, 77, 153, 180, 86, 256, 327, 275, 219, 144, 94, 174, 62, 257, 155, 69, 200, 341, 236, 290, 257, 31, 89, 161, 101, 79, 52, 162, 175, 235, 140, 125, 142, 183, 129, 145, 65, 146, 103, 112, 77, 109, 221, 120, 90, 149, 59, 88, 135, 291, 145, 83, 118, 151, 175, 183, 211, 255, 114, 208, 132, 78, 109, 147, 108, 89, 167, 247, 89, 115, 94, 89, 82, 34, 104, 61, 295, 82, 120, 72, 142, 199, 210, 137, 153, 56, 34, 99, 201, 135, 120, 75, 47, 158, 161, 132, 223, 293, 177, 74, 58, 105, 94, 86, 276, 211, 181, 77, 66, 129, 105, 170, 301, 228, 187, 99, 139, 206, 143, 132, 167, 292, 252, 152, 270, 12, 245, 89, 264, 153, 83, 206, 94, 198, 23, 62, 158, 295, 39, 107, 66, 87, 168, 263, 210, 134, 10, 136, 30, 142, 245, 207, 101, 25, 84, 72, 27, 116, 237, 176, 94, 81, 159, 240, 181, 368, 172, 145, 213, 157, 121, 72, 79, 124, 84, 55, 118, 192, 146, 120, 165, 29, 146, 39, 125, 70, 214, 78, 135, 161, 130, 82, 96, 185, 119, 260, 172, 173, 73, 146, 205, 216, 5, 131, 96, 68, 96, 74, 35, 29, 28, 60, 267, 307, 144, 130, 151, 215, 242, 35, 107, 66, 119, 80, 163, 181, 162, 79, 91, 78, 156, 228, 176, 259, 180, 40, 153, 139, 275, 140, 167, 189, 144, 70, 30, 61, 72, 70, 40, 102]
-192A02
##PAGE=	F1=-4592.27
##FIRST=	25164.767445380970457,	5806.2096540000038658,	0
##DATA TABLE=	(F2++(Y..Y)), PROFILE
5806G3O9l1r6Q7Mj1J38r4j20R8n7L9j5P9J3n5P0jq3J49j78o3J21MOJ10j05J36k08J7Q0o2J5
5419A29j9K7K5J8L4j65J18K3j23k2J45M3j29J10m8j15J01R1k1j03On9Ll1J99k0l6j8q1p4N7
5055F5MM7N9j05J02oJ93j71j59P5Om9J21l2o7J09p1n3Q3Op1k6K3m9J80r2L7J1q3M1M7m2Om3
4656I6J0N5o1J0n2LJ2m3Q8J5q9P5L9l1j11O2J07J05j45O2kj89K0K8j%M2mp8L8k6Q3LK0N9m3
4233A57Q7r9p1Rm4O4K4kl5K9n1j5J69oj21M4p7KJ02K5j6J01r1j08J3Jk7N8r3J14p8J7J61j41
3834A02P1o1R5j27rk7N4m0J61r5n1lQ1r5J82j25J52m9l4r5J4Q0k9r7J37L2j13J6l8K29j13
3470B05j16m9N3L5R3j40j7L1j1N0N1N6L6O1j44j33M0J25q0j19M3J01m4o5k8J65K9j67M6Q8
3118A95j84J28p5P8o8K1k8K5N4L5j21J24j50J8J01j06J48M9k8q9O0k3j32R5R8J58j3r4p7m3
$$ y = [73, 142, 111, 15, 102, 106, 95, 233, 139, 19, 117, 60, 99, 84, 163, 176, 121, 191, 190, 107, 256, 78, 15, 136, 140, 146, 256, 151, 287, 79, 96, 176, 114, 129, 110, 137, 162, 180, 214, 49, 167, 190, 67, 45, 190, 233, 104, 214, 166, 51, 152, 243, 222, 119, 125, 66, 69, 38, 237, 217, 181, 163, 82, 8, 65, 69, 116, 175, 70, 172, 166, 359, 188, 29, 104, 110, 61, 182, 150, 83, 192, 121, 68, 151, 157, 86, 60, 83, 34, 214, 122, 159, 170, 87, 128, 175, 133, 139, 96, 106, 161, 100, 110, 58, 61, 73, 30, 118, 133, 44, 119, 158, 127, 16, 78, 185, 290, 145, 207, 205, 16, 36, 64, 63, 63, 105, 101, 23, 61, 35, 118, 121, 141, 200, 157, 244, 145, 74, 83, 39, 103, 127, 125, 90, 119, 68, 53, 222, 216, 95, 139, 62, 64, 166, 191, 175, 276, 185, 77, 90, 91, 64, 122, 29, 143, 65, 82, 243, 102, 173, 112, 207, 80, 71, 44, 98, 58, 219, 124, 73, 70, 151, 56, 238, 113, 265, 216, 182, 87, 101, 181, 152, 55, 192, 224, 111, 127, 89, 318, 205, 89, 40, 93, 128, 221, 81, 64, 95, 84, 134, 185, 241, 277, 338, 194, 61, 101, 226, 146, 27, 70, 171, 127, 62, 34, 199, 228, 61, 107, 195, 11, 139, 64, 142, 74, 95, 67, 92, 146, 181, 60, 184, 34, 52, 153, 47, 195, 244, 216, 127, 187, 164, 32, 127, 225, 383, 370, 276, 199, 156]
2766A56o5J91j90m3J04K1r7J88L3j4p0j08k0J05j22J87q6j20J52J66p8O2q8k50J00N4k7p2
2438F9o0J74j3N5q6k0P6j3o1Ll5Q3q5M1Mj7J10j18lO0j09M0M1J52j22l3P5nj8k4O8R4k43J15
2038A95k6n2l6J5Om3M5Q0r7lM3k1m0pK8k8K23k53J78j34O5O3L2q1Ql8n5O1M0o9j3Ln8J52Q
1628A91q5K5J61j09j40k6P8j2l1J93m6m8q9k8M0M6K0J68j17k1q0L4J05m3p4L3J82k8j15R6
1276B80k33K51j56J78j49p8J31j42J25j71J7J13J49k80J01o3N3J00Q0r2q7o5M7j00J08R4O
959B17r0j04L1l3mJ08P8n0k9l8R5Q2p7O7r5l7R5rJ1j19m2Q5j0p2RJ17n5l7M8j07J90j09j2
571A04k7P4j03K2J00k3r9K0P3RJ04l9Lj78J42L5n3j38Q2np%k9m1P5l7J1K19P0k20NK9k4L1
172A85j54K7l0N7l2J44k0k5p6J4J6J17N6j45J32n6j62J31l3J71j46J8J8j16l3l9L0K1l2LK2
$$ y = [156, 91, 282, 92, 49, 153, 174, 77, 265, 298, 284, 214, 106, 86, 191, 69, 256, 170, 50, 202, 368, 290, 352, 264, 14, 114, 168, 141, 69, 9, 183, 170, 225, 139, 119, 195, 182, 121, 124, 89, 172, 87, 128, 132, 115, 225, 107, 104, 164, 55, 95, 136, 288, 166, 133, 208, 203, 185, 161, 229, 323, 80, 195, 169, 117, 81, 96, 102, 59, 104, 184, 87, 84, 127, 106, 66, 59, 87, 59, 282, 29, 207, 73, 138, 201, 233, 152, 160, 122, 67, 128, 168, 99, 86, 89, 31, 183, 191, 106, 131, 292, 183, 43, 17, 95, 83, 52, 245, 199, 151, 62, 34, 74, 120, 140, 308, 191, 170, 90, 124, 229, 186, 112, 145, 327, 299, 184, 280, 47, 298, 142, 320, 171, 93, 224, 82, 207, 36, 53, 166, 315, 35, 136, 73, 126, 226, 306, 214, 127, 62, 109, 9, 117, 211, 217, 127, 23, 54, 21, 17, 125, 203, 153, 124, 86, 181, 263, 186, 253, 158, 121, 216, 207, 218, 99, 57, 142, 132, 60, 69, 186, 131, 94, 142, 35, 225, 116, 104, 77, 151, 48, 70, 170, 147, 48, 68, 141, 150, 254, 215, 218, 40, 182, 217, 164, 26, 108, 103, 96, 96, 67, 26, 101, 64, 75, 294, 364, 144, 149, 178, 154, 185, 31, 58, 28, 85, 53, 197, 177, 152, 76, 90, 106, 223, 279, 134, 266, 210, 48, 179, 146, 317, 171, 189, 207, 91, 58, 19, 49, 70, 38, 41, 63]
-192F3
##PAGE=	F1=-4694.53
##FIRST=	25164.767445380970457,	5806.2096540000038658,	0
##DATA TABLE=	(F2++(Y..Y)), PROFILE
5806H4L7m0m6R0j9p0K05n5j38M1j2L7K4K8K8n4L1J3n1O9r5k3Q8m1K5J21r4R2j90J1Q0m5l0
5419A01J8N4j3j1L8r7L5O7r3o7J74R2j46P1n7r7K5J37Jj42Jl8J9n6J71Qo1M2l6q3l0O5N3M4
5020A89p7P1kK07k09j31Q5Kj14J25k0j1Q2o8k7KN0p5k1k9M4J18j04J20j9o1L0K7l2K8l8o9
4644G3Q3o6O3q2N6l3m9J11%j34J28M8Lr3p7J66J01j33l9J6j20M7oM1nN7k7q3Rk9J37lJ7L8
4245B15n2Q0j46k2L6k6L9P1o6q7L0k6J3J34qj03P2p6nJ38m8RR0j01n0j3L3m6L0j05J67j09
3870F8K8K01j73Rq3J17j07M0q0R3n9J57o4r7J9R2m8J38j22J52n9mr5j0L9m7o8J18L6q1J1J9
3494A40J66j63n8k4O0L6O0o4m0o2k6M2Q0P3P8P6j65j16N2J14j45m2kR1n3m6j6J10K2p4J3M8
3118A65j39J29r3K2k4M9m6LP8L5q6J28j57NO7j03J21O2K7j38J01k1j44L9K13O8qj06k7k7j13
$$ y = [84, 121, 81, 35, 125, 106, 36, 241, 186, 48, 89, 77, 114, 138, 166, 194, 140, 171, 184, 133, 202, 107, 84, 172, 131, 156, 277, 183, 275, 85, 96, 176, 131, 101, 119, 173, 160, 149, 187, 90, 125, 192, 99, 32, 206, 298, 152, 223, 166, 69, 94, 231, 232, 90, 91, 53, 72, 16, 187, 195, 134, 176, 140, 57, 27, 92, 145, 189, 112, 183, 181, 388, 179, 48, 133, 135, 21, 146, 126, 115, 197, 129, 102, 104, 154, 79, 58, 29, 73, 191, 87, 207, 188, 127, 157, 184, 152, 180, 142, 73, 156, 90, 153, 71, 127, 94, 45, 156, 156, 22, 150, 198, 201, 108, 31, 197, 298, 165, 126, 142, 22, 69, 63, 104, 99, 156, 129, 46, 55, 26, 163, 160, 177, 215, 163, 243, 97, 75, 111, 85, 124, 195, 129, 42, 72, 46, 59, 193, 185, 82, 154, 78, 73, 211, 163, 172, 262, 161, 111, 98, 131, 85, 115, 10, 177, 68, 96, 297, 124, 133, 50, 167, 60, 100, 20, 113, 54, 211, 147, 50, 69, 161, 113, 251, 129, 281, 222, 218, 123, 113, 152, 105, 37, 155, 191, 110, 121, 140, 306, 143, 85, 61, 121, 157, 217, 153, 113, 51, 25, 67, 147, 220, 298, 374, 209, 93, 145, 259, 114, 72, 70, 161, 108, 62, 46, 156, 178, 104, 117, 165, 26, 155, 62, 84, 60, 109, 63, 66, 144, 179, 93, 221, 64, 69, 136, 33, 154, 216, 243, 105, 206, 185, 41, 80, 293, 361, 353, 247, 220, 193, 80]
2754H0K04j74k3J03%r4J62rJ7o3j36K4J15j15J51o8j26J45J72l9P1j39k25R1M3Lq3p3K03m4
2402A73J5p0j6J36n8m7l0J6O5j04N7M2n5J04j50L6N3r9M0RJ42q0LJ06m7o3m7R0J49k88R0M4
2027B16o1q0k1K7n1J5P2l4k2J00j8p8J3J7kJ66j52J80k03M9N5L8p8K7No2L5k6o9oO0n9J41
1639A94K9j30o6K29p9j29k2P5m0J8J16l9l3p4j8J8Q4k2J80j24j8o4J8J21kj27K1K23j0j01
1287B28P1k18K71j71J69j59p4J16j31R5j56J9J03J41k70J05r6J19J09P6j29j06J0l8j8J3R9
970A78M8q9r4N7p8NP8N3l1J9l4J11O1q5o1K5o0J19K9M0j57q3J24j0j12l1J54p4l0N3p8K36
595B83r6j15J7lm3l3J41qq7jL0R3O3J0J2k21J83nj05p2N2K1k5j3l5NJ23n7k4K19Q2k61K5M0
196A95j09K9n2N1m0k3rJ75n4l7n0KM3J65L4k25J49k5j65J43m1J76j47J9Nj81K3m6O4J0n7Q
$$ y = [80, 284, 110, 87, 190, 190, 96, 258, 249, 266, 203, 67, 91, 206, 91, 242, 174, 48, 193, 365, 326, 397, 258, 33, 124, 167, 170, 87, 14, 217, 173, 188, 118, 102, 238, 180, 133, 103, 119, 184, 80, 137, 179, 124, 228, 78, 114, 167, 68, 108, 117, 259, 179, 182, 288, 241, 178, 131, 221, 370, 82, 172, 216, 155, 75, 54, 81, 30, 45, 117, 83, 61, 161, 143, 65, 78, 95, 93, 259, 107, 287, 84, 133, 188, 226, 148, 175, 180, 118, 153, 127, 58, 52, 112, 53, 194, 223, 93, 27, 256, 177, 48, 26, 101, 61, 79, 195, 156, 123, 49, 31, 49, 133, 111, 291, 167, 149, 85, 103, 224, 222, 95, 116, 339, 329, 228, 299, 81, 352, 181, 350, 191, 117, 233, 102, 197, 41, 60, 163, 304, 34, 139, 43, 162, 271, 347, 218, 112, 122, 84, 66, 79, 178, 226, 137, 43, 100, 22, 27, 105, 158, 127, 146, 112, 223, 284, 199, 138, 163, 103, 222, 251, 291, 134, 51, 175, 165, 53, 22, 176, 102, 72, 125, 47, 283, 187, 72, 89, 86, 43, 10, 151, 143, 56, 55, 85, 178, 241, 251, 263, 42, 225, 220, 115, 43, 95, 116, 91, 78, 43, 48, 171, 114, 90, 309, 391, 130, 155, 195, 86, 115, 63, 114, 74, 51, 42, 217, 163, 126, 76, 78, 121, 286, 320, 95, 244, 219, 54, 197, 156, 332, 185, 204, 209, 28, 51, 5, 69, 79, 22, 30]
-180C0k
-192B8
##PAGE=	F1=-4796.78
##FIRST=	25164.767445380970457,	5806.2096540000038658,	0
##DATA TABLE=	(F2++(Y..Y)), PROFILE
5806I0Rm6K6O2l4p7K09j1j33m2P0K2K8j3L6m4nK5j7j4R%N1q9N2J15p8L9j60J0P6j5o4O5L7
5395A89k4o7M5k1l2Q3m4q0J59J45j50M1m7r7m5J58Qj69K4k5K2OL9L9p1J14kp7o0O2M9J9o0
5008A31L5K0K11k06q6M5jj20R3k1M2L4o6J3o4O8o8On0Q7N2r9J96m5l8K3jl3O3l3j43J03l1
4621A17Q6j05O9o4l4J13k0j29J17O0N5n5j69J64R3j13j59N8o0M3J8N8kN7m8q1k8K5J38k9J4
4257A89K5n9O0j71R7J8k7K3R4j10j09j0L8NR8Or3P7o9K2J41j09J7Q1j17K2n1Q4n2k7p6J84
3881B01j21K2K17j65o0o8R1q0O8n2P0q1J46m0j11M2P6j0J01j17J45o0J5q5m2nm7pP3M0l5k3
3506I8J10Q7j82m0PO0J5L4L8o2j30K4j1O3Q3J05Q7j85p7M5J28j78j3l3O5n0k1L5K2mK1J2j0
3118A43r4J00p5m6MJ48p9k4Q0N2r2J16j33nQp0P3O0R9j49R0Lj56J3K76rj2j14K3pj54J97j45
$$ y = [90, 99, 53, 79, 141, 107, 30, 239, 228, 95, 53, 123, 145, 173, 160, 196, 152, 147, 172, 155, 141, 150, 150, 201, 112, 164, 279, 201, 240, 80, 90, 166, 151, 87, 152, 189, 165, 98, 143, 122, 90, 173, 129, 49, 208, 353, 203, 244, 197, 100, 55, 213, 221, 52, 76, 51, 73, 79, 118, 157, 86, 200, 198, 121, 61, 123, 172, 191, 131, 166, 186, 397, 191, 105, 150, 149, 29, 122, 101, 143, 177, 111, 124, 60, 128, 60, 66, 16, 103, 155, 56, 252, 207, 169, 192, 191, 158, 221, 188, 45, 148, 117, 203, 98, 167, 103, 69, 182, 162, 33, 150, 210, 265, 210, 41, 205, 298, 185, 26, 84, 24, 67, 85, 143, 141, 198, 150, 69, 41, 66, 204, 175, 189, 214, 155, 215, 44, 141, 159, 132, 155, 249, 139, 30, 20, 58, 63, 161, 167, 74, 151, 82, 104, 245, 136, 153, 234, 117, 139, 88, 172, 120, 93, 17, 201, 80, 102, 319, 154, 94, 26, 117, 37, 105, 53, 123, 42, 188, 148, 37, 79, 155, 145, 246, 129, 274, 214, 229, 144, 102, 97, 50, 43, 116, 156, 121, 98, 208, 295, 113, 73, 80, 140, 155, 189, 227, 165, 35, 59, 48, 111, 194, 299, 386, 201, 124, 169, 297, 119, 106, 73, 138, 88, 67, 102, 124, 120, 141, 153, 143, 49, 149, 74, 28, 32, 180, 101, 77, 157, 209, 117, 233, 100, 95, 103, 33, 106, 166, 265, 116, 206, 209, 53, 66, 342, 333, 321, 207, 230, 223, 69, 266, 121]
2731A21K7R8j9q9R8n1L5m1j04M1Q6j09J28n7j15J34J50NP8j74j99P1M1L0r8n7K31p8m9n2n
2367G7J85r0j1p4N9L1r6N4P6p4Q7j67N0N5o1L0m2J23l8L9J37q6j08n5R1J95k69K7J18p7j05
2003H1m6J8l7K1K7J4k7J47j2j04MK8K2J06o4J71k38J3M0K6o8O3L4m7Jo7n3m1J19n7J14N1j52
1616H7MJ01k9r6j3N7p9Q2K8n4K2o2J7N1K7o2J69r8l0l7jJ10M8j34k1K40J0p7N9k09K82j96
1240A96J55j53o4R3j01M8j44N8O2J19k24Q6j10J63R9R1j50j30P3q3N3q6J00Q1j02p6R7r7O
900F0NN0j2N5j2J22L0r1j60J40j05J43N4M7j66p0J39m6j36J1J08p6l7N5n2K58p4j86M5j9j6
536F4pN0K6n0j0j5J49K3M4K7k38J85l2j40k0L2J8n4qj1M7J47q7l5K00P5k68L9M8j45PM9P8
149A88p7q8L5J60q1n0j4kN7K03Rk74J34Qj55J43k2J44j37K8qj59J6l2R2j5l5m8q
$$ y = [121, 148, 246, 227, 138, 236, 185, 220, 179, 75, 116, 202, 93, 221, 164, 49, 183, 333, 338, 416, 242, 43, 114, 155, 185, 87, 30, 261, 183, 134, 82, 77, 262, 172, 161, 87, 146, 177, 81, 135, 211, 137, 224, 57, 107, 162, 101, 131, 89, 212, 174, 213, 350, 264, 156, 101, 192, 387, 118, 145, 263, 186, 81, 35, 53, 16, 37, 64, 78, 51, 198, 186, 82, 86, 114, 136, 242, 178, 349, 111, 124, 164, 190, 122, 185, 219, 172, 173, 106, 53, 12, 131, 74, 188, 239, 87, 91, 192, 163, 67, 54, 111, 32, 114, 142, 88, 110, 48, 65, 116, 143, 81, 250, 152, 122, 85, 84, 194, 242, 108, 87, 327, 337, 260, 319, 110, 392, 196, 351, 198, 134, 227, 126, 174, 30, 88, 150, 269, 45, 131, 21, 184, 283, 374, 224, 94, 167, 84, 137, 51, 151, 232, 130, 54, 151, 54, 60, 65, 115, 103, 158, 146, 268, 298, 207, 47, 187, 82, 225, 279, 326, 160, 90, 229, 183, 47, 58, 166, 90, 53, 108, 56, 314, 240, 54, 99, 80, 64, 57, 107, 133, 83, 73, 58, 207, 230, 274, 301, 63, 248, 216, 76, 56, 88, 106, 52, 44, 33, 80, 227, 140, 105, 305, 380, 112, 151, 199, 54, 61, 110, 188, 111, 23, 58, 218, 137, 87, 73, 71, 128, 331, 340, 66, 200, 208, 53, 196, 174, 318, 181, 209, 201, 42, 58, 26, 118, 103, 68, 20, 12]
-192A2
##PAGE=	F1=-4899.04
##FIRST=	25164.767445380970457,	5806.2096540000038658,	0
##DATA TABLE=	(F2++(Y..Y)), PROFILE
5806H2kl7Q1K6l2k1J29L0j14j20J32L2Om8L8l5j8L8po1O7K8K4j33Q3R4o4j3j19QP5K6r2R0
5407A73Pqj29N6L7l3L1J6q9J36J93j38K6l1j13o9J31%j64O0m0K5O9n5J9n8J67K5o1p7L6M9
5032A91j0n2kP2K00j76p7L%q8N3l6P3k1m6M6n7J3n9M2j3O7pm3K14o9k0K5k7m3R9l1j93J13
4632A41J6Q9j24N8q4j0R9l5q9O5O8J17j5j96J19P4q8j27k7l4J3P2O7mN3n7p2o7R1J17o2J2
4257A80J7n9L4j27J61nm2K0J03j22j07j7L7l2P9M1q6M9n1O1J18j46K0P7j50J08r9J38l5r6
3905F9j1J48j24K4J95j39q2J5k9m9P5JL2r0J17j8r4N8L6J5P1j11J39n2J7o4p5m8J5mM7M0L
3517A27o5K05J4j63n7L2N6k5K4J35q6j47N0j3NP3J15R1j96j6J4J45j82j7m8L2l5k1R3j0n6
3154G4Q5M1o1q5O7l6o2OK17j19OL4Q0j22R0q3po5k1K4L8J65j08L6L4j64MK97o0k5j19P2Jj80
$$ y = [82, 80, 43, 124, 150, 118, 97, 226, 256, 142, 22, 154, 186, 192, 144, 182, 147, 129, 167, 160, 99, 166, 194, 218, 85, 168, 262, 198, 185, 66, 74, 149, 175, 83, 173, 180, 172, 43, 99, 136, 103, 134, 150, 61, 197, 390, 252, 278, 247, 134, 65, 196, 196, 32, 92, 52, 77, 146, 91, 110, 52, 219, 244, 183, 106, 142, 191, 181, 129, 127, 199, 399, 223, 146, 149, 149, 61, 114, 78, 151, 130, 84, 130, 73, 86, 27, 69, 56, 123, 116, 73, 287, 218, 198, 223, 196, 153, 252, 221, 28, 141, 157, 246, 122, 180, 96, 86, 185, 150, 61, 126, 194, 311, 296, 100, 219, 293, 205, 78, 51, 17, 30, 102, 169, 165, 218, 161, 89, 22, 113, 230, 168, 180, 197, 138, 172, 45, 206, 201, 159, 179, 282, 160, 53, 36, 73, 41, 120, 161, 75, 124, 73, 134, 252, 106, 126, 203, 53, 161, 62, 200, 165, 69, 58, 206, 82, 106, 301, 162, 80, 95, 66, 17, 92, 93, 125, 35, 152, 134, 40, 98, 134, 149, 220, 109, 248, 196, 213, 149, 74, 26, 41, 37, 84, 124, 127, 62, 267, 281, 118, 61, 93, 149, 124, 148, 283, 197, 50, 100, 87, 92, 165, 280, 371, 175, 159, 173, 318, 136, 119, 71, 103, 68, 47, 140, 130, 74, 159, 200, 139, 54, 121, 85, 23, 29, 246, 127, 133, 167, 247, 125, 215, 132, 125, 60, 39, 63, 101, 266, 158, 194, 228, 64, 68, 365, 305, 280, 161, 233, 234, 54]
2754E4J68j05P8R8k3q0Rp8L0qk7L0K6j07J36n3p9J14R4N0P9j88j83N5M0N5j22J0K37j16j16
2391G8l7OK17j05L9j16Q1lq1M7R7p2N3j21%P6k4K1r3R6rP0J72j19j44n1P2K27k33oJ60r3j27
2003G8l5qKM1l0K9k9J93j2j26k0M3M3O9j3J64k41l8K4Jn0R7N1j5l3o9k2n7J00n8R2N9j50J01
1604A81p0K9o3RL5r1J01j3j08R8m6L6R3m1j02J43n5m1j0qP4R1r7p7K27K8n3N7j94K72k17J32
1229C20j36m5O7o4Mj37J20OR4j53O2k9Q1O4J19j40j58J16q9J01j40P1R8j21m9J24j11J4o3
888B6N6NP2J3J25Mj03j66J78j55J67O2L4j49k6J47j02j33M2O2m0o8L3k4K52m7k00L8K0m1J6
524I8m9R2l2koJ32qN1M7k39J62l6j58J4J1rn6qO5L8J55j22k4J64N2k34M7M4j02j4Q5Q5j15
137A28j23P2J23j01m6J5J2O0K08j3k92J03L8j39J33J7Q4j20M4rj00k3mJ22m2l4q4j
$$ y = [54, 222, 117, 195, 293, 270, 190, 199, 121, 151, 143, 116, 146, 172, 65, 201, 148, 69, 183, 277, 327, 406, 218, 35, 90, 130, 185, 63, 73, 310, 194, 78, 41, 47, 264, 159, 198, 82, 163, 160, 79, 126, 223, 151, 204, 83, 83, 159, 135, 156, 63, 159, 150, 220, 392, 273, 129, 78, 150, 377, 144, 138, 298, 205, 78, 43, 35, 37, 78, 48, 77, 48, 241, 229, 103, 83, 126, 169, 238, 225, 389, 148, 110, 134, 135, 85, 182, 233, 218, 185, 116, 94, 37, 137, 79, 171, 230, 80, 181, 111, 140, 77, 86, 121, 30, 131, 118, 10, 108, 62, 98, 191, 150, 48, 191, 136, 95, 85, 77, 151, 242, 145, 68, 295, 323, 270, 327, 133, 405, 188, 320, 184, 139, 206, 142, 146, 9, 129, 135, 229, 76, 138, 109, 190, 254, 373, 233, 75, 191, 102, 203, 63, 134, 232, 111, 62, 186, 75, 89, 26, 82, 87, 159, 172, 297, 301, 198, 32, 210, 55, 222, 284, 318, 169, 143, 290, 188, 55, 97, 159, 119, 51, 84, 60, 312, 265, 65, 103, 123, 82, 98, 49, 141, 109, 107, 101, 233, 225, 276, 323, 84, 246, 210, 52, 66, 77, 68, 12, 4, 69, 107, 262, 140, 116, 280, 332, 98, 145, 189, 87, 73, 158, 243, 128, 5, 77, 200, 99, 53, 68, 80, 140, 348, 335, 43, 146, 184, 45, 178, 195, 279, 159, 203, 194, 94, 71, 67, 189, 147, 113, 29, 28]
-192B8
##PAGE=	F1=-5001.3
##FIRST=	25164.767445380970457,	5806.2096540000038658,	0
##DATA TABLE=	(F2++(Y..Y)), PROFILE
5806F1J1j4J09j0j6J7M4O4q7j58J45N4k5p1L3l4%N1l0l8N1N3Qj58J06P5o9n1p1kQ5O8j16Q2
5407A67k5L1j30M4M0K0o5P5q7J06K27j09K4k3j38o6R0j0j01L9o6M8J10o2p6k3J79M6l2j01
5055A32J0N5l2n0l3J37J74j38q3m1Mo5L7m9P5p2K5L3Jn8m8M9K8M2n0L6J83r1nM0m7n6J24l5
4656B32k04J13L4R1j29L7r2J0P8m8l8OP1J73K0k12R4M7o3o3j17QKN3O8nN0n4n8q7J35Q0q8
4269A44J3Om6J0l6J62k1p1K7J04j07j16J7j5n6O3P6p8Jj3Q8P1j55L5P7j39J37j39J70Lj38
3905G4K6Q7j23M6J39j10m7N3j20j2O5N3j4o9O3%o3P2j5K6M1r1J30m1Ql6j05J2L2m6L8K5J9
3517A17q9K69l9j35p1M4N1o0M4J82j16j46O1jj1L9J06R0j79M1l6J55j68l5n3Oj8k1J41Lj13
3154E8R8Q9j00r8L8Ll4MK22j58O9l0J09j42M4j9%j32K5rJK03n5rO3j65kK88q7m4j19J22qj89
$$ y = [61, 72, 58, 167, 157, 141, 158, 202, 266, 179, 21, 166, 220, 195, 124, 157, 123, 123, 174, 144, 106, 157, 210, 218, 60, 166, 241, 172, 121, 50, 48, 133, 201, 85, 167, 142, 173, 43, 87, 127, 147, 82, 157, 70, 176, 403, 294, 318, 295, 157, 91, 181, 171, 70, 109, 43, 91, 201, 139, 63, 40, 219, 265, 233, 132, 142, 197, 165, 115, 82, 219, 393, 255, 172, 131, 135, 70, 107, 58, 133, 61, 86, 119, 120, 62, 14, 63, 91, 133, 83, 119, 302, 211, 206, 246, 199, 143, 267, 232, 28, 141, 175, 266, 137, 174, 82, 92, 170, 122, 84, 90, 161, 334, 354, 142, 236, 283, 220, 157, 40, 48, 50, 103, 171, 166, 216, 162, 104, 17, 152, 232, 144, 157, 163, 117, 127, 91, 253, 232, 161, 188, 292, 185, 69, 86, 71, 15, 78, 154, 76, 77, 64, 152, 223, 68, 103, 180, 41, 178, 39, 209, 212, 74, 100, 187, 64, 110, 249, 139, 92, 145, 25, 13, 78, 131, 117, 48, 111, 111, 48, 120, 105, 131, 172, 81, 211, 170, 178, 142, 37, 49, 81, 35, 73, 98, 117, 28, 297, 258, 123, 52, 96, 147, 87, 131, 313, 197, 51, 112, 111, 100, 139, 245, 335, 156, 197, 161, 316, 148, 113, 60, 66, 48, 27, 168, 171, 58, 156, 245, 145, 47, 85, 88, 54, 58, 280, 122, 191, 161, 270, 128, 172, 153, 153, 21, 46, 37, 38, 241, 186, 177, 240, 75, 73, 361, 274, 230, 111, 233, 225, 36]
2754C6J17n6J20R9j5o2q3n6k1K1M3K3m6j03J68l2m3P9J7R2P2j80j74N6K1P9j48J02K27j55
2402A98j48m4K2K22j00Q2j49Q8j8q3M7R8n5Pl6q1J13oRj19N7QR7K03j42j61m4M4K44k09J9
2038A63J48j02j36kl6K9M3m6L0m4K38j6j54m7N4O5N0J0J57k20q6Ql5k2J13O1K1n9m9nm3M2
1663A30n5P7M2j17J63k08P6k4L8Qo5O3J5p3L8k2L2J30r2j35J07j1l3oML4J09m8j18J87M5l9
1287B52O0j60K37k23R5j08j5L7j3m0q3J38m7Q7r7M3M0k2J0J45r1j86J35p2J29j62L4R6j34
947H5j5J30j08J0p9L4J9P6K9J18nj25j19J67j79J69N5J0j11K4J52j56j15N2M4oq2k1PK19k5
583B54j79K6N4o4K9j07J59l0kJ1J05l0K8P1k25J26j7j68L2j3m9P5m6O2J3J54j51NJ15J7j68
219H7N5K3n2mQ8Q1j44j27Q1P9j14J8oK5O7J78l3k79P2N9j27J23O0J6r9N6Po2n1L0J61n8o6
$$ y = [36, 153, 97, 217, 316, 301, 239, 156, 100, 79, 100, 143, 166, 120, 17, 185, 153, 110, 189, 206, 298, 370, 190, 16, 72, 93, 172, 24, 126, 353, 198, 50, 6, 28, 250, 150, 232, 83, 171, 153, 70, 117, 215, 160, 167, 131, 50, 163, 157, 166, 47, 104, 112, 209, 412, 270, 109, 65, 109, 353, 144, 163, 311, 209, 73, 71, 35, 64, 107, 61, 91, 47, 285, 269, 115, 68, 122, 187, 237, 247, 404, 184, 98, 106, 71, 49, 162, 223, 244, 185, 136, 131, 88, 130, 75, 152, 194, 77, 240, 32, 108, 84, 122, 130, 65, 128, 143, 70, 108, 86, 118, 248, 156, 21, 128, 117, 84, 78, 82, 116, 225, 177, 59, 246, 291, 252, 312, 152, 389, 166, 261, 153, 138, 175, 162, 122, 39, 177, 130, 217, 120, 163, 203, 181, 191, 336, 245, 59, 194, 122, 251, 89, 123, 219, 85, 70, 200, 92, 102, 23, 57, 76, 152, 181, 299, 294, 169, 50, 217, 38, 207, 262, 272, 161, 185, 337, 181, 66, 118, 162, 156, 74, 53, 60, 279, 254, 75, 101, 155, 91, 120, 13, 172, 142, 140, 151, 256, 226, 254, 325, 100, 226, 209, 41, 73, 60, 11, 86, 40, 102, 115, 269, 118, 123, 238, 255, 87, 142, 165, 113, 109, 197, 278, 134, 7, 88, 167, 53, 71, 65, 90, 157, 335, 302, 23, 95, 154, 27, 150, 210, 226, 127, 183, 190, 128, 77, 107, 268, 210, 144]
-168A44j05l
$$ y = [144, 39, 36]
-192C6
##PAGE=	F1=-5103.56
##FIRST=	25164.767445380970457,	5806.2096540000038658,	0
##DATA TABLE=	(F2++(Y..Y)), PROFILE
5806C7M2%J26m2NL7l8R6n8j74J33O6m7p8K4l6L6N9p8K6JO2Mj55J10P6r9o0l2rR6R1j27M5n4
5395H5Q4q7L6j6Q0j47J15o5O8K38p1K7k3j69n4O6nm3j0q0P7J23m7j49NJ55O2J0j28j0O7m6
5020A48m8n3J79J40r6q1q6On5L9n1M9l8O7k2N9o6l7lO9J5p2R6J32j09J0O8n8o9J27m0j76J08
4632A52OR5j11K0p7MO7p1J4m2O2K11M9k19P9L0m4k6j71O8L1m0N6JN4l3n3o9J33L2r6J3pk7
4233I1QK8J51j7j15L6R9p9j24M8o8J7j4Q0o8m3M9P5Rj24N0P8l7O3j31J33N4j41K2J7j19Q0
3858A08P4p5NN6j24k5O5P9o3l3NJ9l8Q9o7L3jm3J10l9nPr2P0lm3J1jJ1n9K60o6j14m5K3M7
3435A36m7Q0J46j52j38P2J0J7mQ0Q5j19O7r2J57j46m5p0k%O2J08K3j51O5J36j33r5L0OrPJ94
3048B78j91J46r3J27j30k0M3J3j26Ml1J0J64j8j2P6j54oK52r2o8j19J78l4j80N6LJ41R8ll9
$$ y = [37, 79, 79, 205, 163, 168, 205, 167, 263, 205, 31, 164, 230, 183, 105, 129, 93, 129, 188, 110, 136, 137, 199, 203, 48, 158, 234, 135, 75, 43, 34, 130, 221, 94, 139, 85, 169, 82, 118, 102, 182, 35, 150, 85, 153, 391, 320, 347, 324, 155, 101, 167, 162, 119, 109, 29, 106, 229, 182, 33, 38, 193, 255, 265, 137, 127, 194, 148, 100, 47, 226, 366, 270, 189, 103, 109, 54, 93, 42, 91, 53, 120, 98, 157, 91, 54, 51, 120, 135, 63, 159, 291, 182, 192, 260, 202, 133, 260, 220, 44, 152, 158, 253, 142, 162, 85, 89, 156, 85, 99, 57, 119, 330, 379, 160, 239, 269, 225, 199, 28, 96, 127, 87, 143, 144, 198, 165, 112, 43, 176, 208, 112, 125, 118, 91, 99, 127, 278, 261, 146, 182, 281, 202, 78, 126, 58, 75, 61, 141, 73, 30, 79, 154, 163, 39, 89, 167, 130, 193, 62, 195, 249, 108, 130, 147, 28, 108, 182, 107, 112, 168, 44, 19, 84, 163, 100, 67, 72, 91, 53, 142, 75, 108, 107, 64, 174, 135, 130, 137, 45, 115, 112, 69, 80, 79, 90, 31, 291, 225, 111, 66, 89, 136, 89, 169, 315, 163, 25, 97, 107, 124, 120, 200, 285, 166, 233, 141, 298, 152, 107, 37, 35, 35, 97, 205, 228, 77, 142, 278, 145, 50, 80, 86, 77, 84, 278, 87, 233, 140, 267, 137, 117, 160, 173, 47, 51, 20, 30, 194, 176, 164, 240, 86, 80, 332, 240, 172, 53, 231, 197, 17, 73, 76, 217, 315, 312, 273]
2684B73j60K7p3pQ3K7j06qJ19J2l5L7o0J31N3j57j26N7k5Q5j29J51K10j88j26l5K3J84q4R9
2332B52j67Q5Jr9M3P5l1m3N6j36J39j5j0j15J3K3J31K08j51j54m4K2K49k16Q3J01j00r9J4
1992A15q9N8L3m4M9o7K65j5j97o8O1Q7M1K2J50j88j15j3p0J0J03O8M6o4k9qj3qk9M9jn8J79
1604B60j80qK8N9j9m0J5P5n7l2J3NJ56j11j25N5Ork8L2J1R4j3j33J33O0m0O4j04J86j99K9
1229A83n8J8MN4q9l0J44q4J01p9K0J00j17n9J54ok05J35m6J32j68PP9j38K3J20q7pp6J0L1
865F6P2L1J02Rj52q0J48j23J11L2k0n7O6J52j89j02O5M6mp4o9L1J58j4j42L1O8o9L3p1J47
501B02k2j4K0Q7m5j5R2j97R4Rj78M2l5J1J02q0M1j8J50j57L4P0k7q7O5j6j2J4R2P9j55j32
125A4P9L8j12R9n4K2P8J35n6k01J8O4j08J14Q5m2o6M6L2m4o8O3K02n4j22j21j0
$$ y = [273, 113, 140, 67, 60, 143, 170, 64, 56, 175, 187, 152, 189, 129, 260, 313, 156, 30, 87, 62, 147, 18, 169, 379, 191, 65, 30, 53, 237, 153, 252, 85, 170, 171, 72, 115, 190, 159, 116, 172, 36, 175, 160, 150, 35, 48, 71, 202, 410, 259, 105, 61, 83, 332, 116, 199, 300, 200, 101, 115, 26, 84, 117, 73, 122, 55, 320, 305, 108, 40, 101, 188, 229, 251, 401, 213, 98, 85, 15, 25, 128, 196, 242, 178, 149, 141, 128, 120, 91, 140, 139, 81, 260, 80, 72, 100, 159, 140, 100, 115, 190, 133, 101, 114, 119, 275, 164, 39, 94, 100, 91, 63, 95, 106, 200, 187, 54, 187, 247, 207, 271, 167, 353, 154, 183, 125, 143, 147, 201, 112, 82, 226, 142, 243, 164, 184, 284, 167, 108, 262, 256, 51, 186, 140, 272, 104, 111, 190, 52, 75, 195, 108, 101, 25, 35, 66, 138, 169, 271, 280, 128, 48, 196, 73, 184, 216, 196, 139, 205, 357, 168, 66, 131, 177, 173, 99, 30, 61, 219, 205, 63, 94, 162, 93, 126, 55, 202, 180, 166, 186, 273, 228, 213, 305, 108, 202, 211, 33, 75, 40, 51, 153, 73, 114, 96, 246, 89, 123, 193, 166, 79, 144, 128, 116, 130, 222, 301, 146, 14, 93, 131, 19, 118, 64, 86, 164, 299, 243, 42, 60, 124, 16, 130, 215, 173, 107, 153, 185, 141, 73, 136, 338, 284, 162, 41, 31]
-192C1
##PAGE=	F1=-5205.82
##FIRST=	25164.767445380970457,	5806.2096540000038658,	0
##DATA TABLE=	(F2++(Y..Y)), PROFILE
5806C5N8JJ39o7K6L7j00J33m2j90J18O1n6n9J6j3N2N2j37R4k6M1Mj24R1J03j26m9k5L6O9P5
5431B27j23Lq7J44o0N1p6J12j40P9j6K5K17l2K6l1j95l5O3J9np1o6Q2J12l5j62LJ17P0N9j56
5055A19j5Q1n0m2o1J65J05l9n8j30Km8M3m8K7Q5J5p2R5n1m4l7R7j2p9J32P2j16K6J00n7p4
4679A31R9l6j26J00n6R5o9K3m1l4P9j12N4o7L9K23P3k11N6L3l3j9j75J13N1j32K9J6P4jo4
4316A12m1J10j7p9Kk1nL3M9J41J4j61K8Q9n1j16O5p7O1o6N4n4j6O0L2o3qMQ7N6j1j06N5J07
3916B67j20nk1p9N3L6mJ7J8p5n6Q0P1j05Kl4L3j8J07j20O0o8L7P6o3rO6m5O2k6k4k8k1nlJ95
3494B51o9r6L0l6M0kJ11O5j90q2M6K2O3m6M4P9l7O4j32J52j21l1j23K0J8J44O5L7j60J2J55
3130B93j61n2M4l8J0J1J45k20K21j38J22q9q3Q9K7r2l7m8N1R2k5L2P2j39lK00q2r4r1K12p3
$$ y = [35, 93, 94, 233, 166, 192, 229, 129, 262, 220, 30, 148, 209, 153, 94, 110, 97, 149, 201, 64, 158, 132, 173, 177, 53, 144, 247, 121, 72, 47, 83, 152, 227, 104, 107, 20, 164, 104, 155, 79, 191, 51, 130, 114, 139, 356, 324, 350, 319, 124, 89, 152, 171, 166, 95, 29, 111, 223, 188, 26, 29, 146, 216, 275, 119, 104, 185, 135, 93, 32, 197, 302, 263, 205, 75, 77, 29, 72, 24, 51, 136, 151, 79, 174, 123, 79, 42, 139, 127, 48, 180, 252, 136, 162, 262, 205, 131, 230, 194, 68, 168, 112, 207, 138, 161, 120, 86, 165, 53, 107, 40, 79, 302, 375, 164, 220, 253, 220, 201, 26, 139, 190, 58, 87, 103, 177, 176, 112, 71, 181, 164, 85, 87, 66, 61, 94, 143, 284, 298, 137, 165, 254, 203, 87, 152, 75, 136, 70, 124, 70, 54, 114, 146, 83, 75, 79, 166, 222, 211, 105, 160, 267, 147, 142, 121, 42, 95, 131, 127, 144, 162, 87, 31, 111, 182, 77, 79, 45, 78, 60, 167, 47, 107, 39, 76, 152, 89, 80, 146, 101, 163, 137, 113, 85, 64, 59, 56, 251, 182, 86, 116, 80, 120, 118, 229, 294, 104, 22, 68, 90, 153, 107, 151, 230, 193, 257, 125, 277, 156, 125, 2, 22, 40, 184, 249, 286, 126, 138, 293, 132, 80, 124, 86, 96, 107, 252, 32, 253, 115, 237, 148, 65, 154, 181, 89, 52, 4, 55, 147, 122, 154, 226, 87, 84, 284, 202, 108, 17, 229, 156]
2766A56j40M7J5J23R3Nj5k13J24p7p9Q3M1j05O1M6O3n0kj15J62K4j34m7N3m4L9o3J38J90k01
2402A78r6l0M3J45p7Q6j64P5L7j00K7L7j8q3J35j31J24m1l8r2pM9J58J69j44j33m3J0K43k50
2050F9J55M3p5l4Oj59R1J2l1P9q5K63qk43p8O5J03L7L7J38j54j23l4l2k5P1P3N2m1j4m0K8
1675A46k2J6%o1J4J53p8j04O5O2m0k3k1J25n9q3M8l8J72r8r8M2j7Jm9N3RN9oj06O6P2n3O0
1276B07l2J35j40p3L1L0j6J19j41jJ47r7J13q3j7J55j78j35J38J00k06J24j8J03j62j1N2j30
947A4O3R8n7k3r1J1M1O2K3P4M3j59m4R1k0L5mn2MQ5J49j87j04J09L9l9n2n9J2Q0j7p7L2O7
548A47n3K9m4J29%k8K6Q1o3o3J07j62Q2K1j84M6k7N9R1j03Rm5J48j33N1L5o4kN9o1J5K8R9
160B30Q6j54j42P5Om4J02j03MQ6J06q5q3l5N1m3Q0P1p9koN9l1p8P2K40k7j82j41r
$$ y = [156, 16, 63, 78, 201, 294, 299, 284, 71, 195, 118, 39, 122, 163, 58, 119, 165, 228, 178, 176, 61, 223, 247, 113, 66, 119, 75, 114, 51, 189, 379, 178, 82, 52, 95, 240, 163, 249, 85, 160, 197, 97, 124, 161, 143, 60, 195, 64, 188, 147, 109, 17, 10, 59, 217, 386, 242, 109, 66, 76, 319, 69, 224, 267, 192, 158, 164, 5, 96, 108, 77, 156, 71, 334, 326, 83, 5, 70, 173, 210, 247, 385, 231, 108, 74, 42, 17, 88, 161, 213, 172, 158, 118, 146, 124, 140, 140, 79, 93, 246, 168, 64, 129, 191, 151, 128, 107, 232, 173, 90, 138, 100, 272, 174, 76, 118, 101, 102, 53, 106, 115, 174, 168, 62, 128, 200, 147, 207, 175, 310, 170, 97, 128, 158, 142, 261, 120, 119, 266, 169, 282, 199, 182, 337, 159, 24, 162, 262, 56, 180, 162, 265, 103, 92, 144, 14, 77, 175, 118, 95, 4, 15, 56, 118, 141, 215, 258, 99, 55, 146, 126, 161, 157, 105, 109, 194, 343, 156, 52, 161, 200, 161, 109, 50, 62, 142, 125, 48, 80, 147, 94, 123, 79, 208, 208, 180, 206, 287, 224, 161, 268, 106, 188, 209, 25, 71, 44, 103, 194, 91, 100, 55, 203, 70, 121, 156, 92, 90, 149, 88, 103, 131, 230, 316, 162, 20, 95, 101, 57, 159, 56, 60, 146, 252, 167, 84, 49, 100, 57, 137, 208, 129, 127, 121, 180, 149, 71, 143, 383, 356, 174, 33, 24]
-192B4
##PAGE=	F1=-5308.07
##FIRST=	25164.767445380970457,	5806.2096540000038658,	0
##DATA TABLE=	(F2++(Y..Y)), PROFILE
5806F1M3lJ48q5M6J9j30J69m2k09J05L9m8j8J5L9K9L5j94J50j7jmq5O8J35j17o8j7R1L7K0
5431B11j05on3J17n9P1q5P7q0J3N7k1J66%J2l9k05qP4M8J9j22m5O7Q0k3j33j4Q0O4J10j85
5055H3MQ6m5k9n7Q0Q2L3j6j65pJ1ql8P1J25m3q5Q9m0m8m1R9l5q1J50J5j01M0J25m5p0M5k1
4656A63p0Q9r6N2j3N6j1p9J06j51O4p6J2K10R2j75LO1k8m2j18J16N2j98RK5J10K9r1rP4n5
4280A11l6k5k7J0P2L2J43O0j92jO8l2r1P2l6M7j04L5m0K3O1j0j13J06o6J15J21o7r6k4J45
3916B61q4l4K3o2k3L5Q1ln7j5o6Q1M9j35L8n1L1J0J19j69R9r1P0N5j23J2J18pK4j0l5o4k6
3529E1oL3J13n2o5J08j00K1K3J50j6k06K4k9N2Q0q6J1P3K9N4j42J42r6%j23l0M6J98K5N3j42
3154A93l7J30j78J3N9q4J9J5R2j77K13j56Q5m0j19J15L2n2p8qK2Q0r3R8M7j17JJ49n9j24N5
$$ y = [61, 104, 101, 249, 164, 210, 229, 99, 268, 226, 17, 122, 161, 113, 95, 110, 149, 178, 213, 19, 169, 152, 151, 147, 62, 130, 265, 148, 80, 63, 154, 191, 211, 106, 100, 47, 164, 105, 176, 91, 168, 88, 101, 158, 137, 303, 303, 315, 276, 71, 63, 137, 185, 204, 82, 37, 104, 184, 161, 28, 14, 94, 158, 268, 83, 87, 173, 128, 99, 42, 122, 204, 237, 221, 56, 49, 60, 52, 14, 85, 210, 167, 82, 171, 131, 83, 42, 141, 106, 25, 175, 190, 89, 129, 254, 209, 139, 184, 163, 93, 182, 86, 138, 125, 181, 170, 91, 197, 46, 110, 34, 46, 256, 348, 173, 176, 237, 209, 167, 49, 165, 217, 19, 28, 53, 163, 192, 101, 92, 166, 111, 75, 50, 23, 33, 105, 137, 280, 340, 148, 147, 215, 183, 92, 164, 128, 175, 71, 106, 66, 89, 150, 140, 27, 133, 67, 182, 303, 236, 140, 116, 261, 177, 143, 166, 104, 81, 116, 197, 194, 137, 122, 56, 137, 186, 51, 89, 38, 69, 79, 198, 29, 128, 37, 107, 162, 39, 51, 169, 162, 186, 176, 141, 77, 51, 45, 78, 191, 139, 74, 182, 82, 103, 126, 276, 260, 54, 78, 49, 101, 181, 95, 106, 179, 208, 262, 120, 262, 166, 166, 43, 13, 59, 257, 282, 335, 193, 156, 286, 108, 121, 180, 96, 115, 130, 222, 45, 258, 102, 187, 147, 28, 143, 175, 123, 45, 37, 59, 139, 46, 144, 191, 74, 75, 224, 165, 41, 96]
2790I6J29j13p5R6l1P4Q7LLk43K15q1j07M4N7o1P2j4J03o9l4j22J60j2j18M0M2k3l5j4J09
2426A78J73j83q1k0O8J19r0N9j43N9O7q3K2ll3p2J58r7R5o5m2p8O3J3J62R7j16j11l8JK23
2062C02k84K14j1k3J8j1j44M4k0qJ03r2K29Ok75Jj0J08L6O6J14j27j21l7Lm2J4P6L4J0Jj06
1686F8P0J0N4m8j25P8J03L7j42N5N4n2j8k0J36p4j09P9q6J77n6p6M7l8k4k6L3J7L3k9l1k1
1311G6P9n9L5M1J04p6j79J38J6rJ61j81mJ47q8J06q8o3J99j95j09RK00j91J20jM8j49k5K6
959H8m8M9N6l2j2o8l3M8M9J3L3Q3j21k0mR0j1n0r8P2P3J42j44j05J61J2r6k8j6k3KMK5k7N3
548A17j7J6k5R4K5l0L9Q2q9j05J15j26R4Nj72L8J2N9O7j09k0rR8q8M9Qm6M3L1q8K6K8J04Q5
149C11j42j44P0qJ1R1j48k3Q2J07j22L8p5L8K2O1K6r8P8p7Q2nq3L5K65K0k21j75K0
$$ y = [96, 225, 112, 37, 133, 102, 176, 263, 266, 269, 26, 241, 160, 53, 97, 154, 93, 165, 151, 254, 185, 151, 29, 189, 177, 59, 99, 141, 118, 83, 69, 178, 351, 168, 87, 67, 135, 254, 164, 223, 80, 139, 206, 123, 145, 142, 109, 37, 195, 98, 193, 128, 86, 8, 71, 84, 246, 343, 227, 116, 78, 79, 302, 18, 232, 221, 198, 216, 205, 61, 105, 85, 77, 180, 88, 317, 323, 48, 49, 39, 147, 183, 249, 363, 236, 115, 78, 81, 39, 53, 129, 163, 173, 174, 68, 138, 148, 202, 154, 29, 107, 210, 247, 105, 160, 214, 162, 144, 124, 260, 186, 77, 156, 70, 247, 191, 115, 162, 124, 100, 74, 107, 124, 157, 128, 97, 76, 155, 96, 131, 172, 276, 200, 21, 159, 175, 166, 327, 146, 142, 289, 201, 307, 219, 156, 355, 160, 51, 60, 260, 69, 189, 188, 236, 87, 62, 88, 40, 89, 145, 113, 101, 33, 0, 48, 97, 110, 143, 226, 105, 85, 81, 171, 160, 110, 12, 84, 157, 299, 155, 50, 211, 223, 127, 99, 83, 60, 62, 66, 91, 64, 117, 100, 116, 91, 185, 210, 180, 219, 301, 212, 107, 222, 96, 190, 195, 23, 61, 73, 132, 199, 90, 70, 61, 159, 71, 120, 128, 82, 125, 156, 68, 94, 122, 226, 311, 169, 25, 95, 87, 98, 189, 41, 18, 100, 207, 85, 123, 48, 86, 108, 169, 195, 97, 175, 98, 180, 175, 92, 127, 392, 412, 191, 16, 36]
-192C6
##PAGE=	F1=-5410.33
##FIRST=	25164.767445380970457,	5806.2096540000038658,	0
##DATA TABLE=	(F2++(Y..Y)), PROFILE
5806H6K4nJ46r1N6j0j19J91n7k15Q7Mj8K6K5P9nJ9k05J58J0l6l1n4N5J51q6j15K6J31%n1p7
5419I9J5k3Q3p6Q0m3j7lm3J39o6R4J9j9m3j52J1O7O8M1j50m5M9L8J0q1m3N8L0J54k16M6Q2
5032A63l6j0m2n5Q7R7L1j88JO8o5oJ07J04q6o1M3l6m9rO5n0o2J40l4m0L4J29k8o2j0mk4P0
4632A82n0o0L5J12%j08J22j71M4p0j0J73J07j08q2J07k4q4m4J03K3j74N4o9J46N2j25K0L3
4292A34p2K0n6J6%Q1j0J61J02k05l8L4k0o0Q3J2Kj29L6l7M8P4l4n9R7j26J55J56j02j04q0
3928G9J56l9l9R3q6o9K8J43j7j43L5n0O2K0j42P5n3ON4J21j92J08o6N8N6j45K4J17K2l1M4
3564B29q8q4k2J8M9K4j9j3J45j40j4J2J94o2j38L8p6R3N4j19j0P0O0M4j21J31o9K6j20q2P1
3200H1K15j1Q1j08p7P9j79P6P0j16K1K1N8j11J60j53K3lj17J21K7rj20M3k6J25r1N0Nq8J5
$$ y = [86, 110, 105, 251, 160, 216, 206, 87, 278, 221, 6, 93, 97, 79, 105, 130, 209, 204, 223, 18, 176, 186, 150, 119, 65, 120, 271, 185, 70, 96, 227, 227, 176, 99, 114, 91, 174, 98, 178, 135, 118, 115, 72, 211, 145, 239, 258, 239, 196, 44, 55, 122, 190, 231, 81, 36, 85, 123, 133, 52, 9, 67, 97, 251, 35, 81, 163, 127, 117, 75, 20, 107, 204, 235, 47, 48, 116, 51, 45, 152, 256, 170, 109, 152, 116, 67, 58, 123, 73, 11, 151, 117, 77, 111, 240, 212, 150, 140, 136, 112, 182, 132, 72, 107, 219, 219, 111, 233, 62, 106, 36, 26, 199, 306, 198, 116, 223, 199, 115, 71, 174, 197, 23, 77, 8, 154, 206, 81, 101, 134, 62, 82, 26, 42, 42, 123, 113, 274, 376, 171, 133, 167, 147, 87, 170, 182, 184, 55, 91, 54, 102, 176, 142, 83, 180, 54, 209, 365, 263, 159, 79, 235, 196, 157, 250, 164, 95, 123, 266, 249, 106, 141, 91, 153, 173, 31, 106, 53, 59, 113, 234, 42, 150, 84, 142, 198, 53, 77, 194, 216, 185, 229, 141, 57, 35, 53, 102, 126, 107, 94, 239, 99, 85, 97, 291, 229, 91, 129, 53, 146, 200, 81, 71, 141, 201, 245, 124, 255, 186, 212, 92, 10, 81, 296, 285, 366, 258, 181, 260, 81, 157, 227, 111, 132, 153, 211, 100, 260, 107, 130, 127, 10, 131, 158, 149, 29, 72, 46, 171, 80, 130, 135, 47, 62]
2837F2J01k2j07J38M5j42j9J26n8K0Q7qPj99K41r5j00RO7m0P2n8J26p4o1p1J08m6q7J01K0
2473A43J1q5OO7J56j27r0mQ6R6j16L5j05L5Q1o3N1l5p9RJ04n3O5o9K5j07R6k0J54K0p1r0l8
2085H8PJ71k42K00n0N0K8k8q9j3o5K1J01q2J74K2k66P0p3R1L7J09P7j07j20pQl8l6P0kP8J3
1698A97j58O9O7P8p7j72J17N6J28j47K9L8n8j8J7J07r8j14J04j20J70Ko4M0l8p0L4k1K9K5
1346A52n5N1j09P9k4k8R6R1l4j67J43oJ1J80j97l7J41o2P7q0r7K13j73n9l2J82j76J29Lj6
994A96j37j9mO0K6ok5K5l9o0K8M4J1l4J10m9ql8J15j1o7m4J3J7J38p4p4J73k6j51j7L5n4l7
595A7J31Rj03L2K7nlL5L9j7P3P9j25j25J10q2J09l4j30OO3L1K9r2k4Q7Oo6M8k3J8M3ko6J0
184A05J3R4O3j20j30O4ML5Q2j70j2J0J37j49J21j00L6P1N3k3j17J55j24Q7M2q6m6K68P8k22
$$ y = [62, 163, 141, 34, 172, 217, 75, 56, 182, 124, 144, 231, 223, 230, 31, 272, 177, 77, 86, 153, 113, 185, 127, 253, 179, 118, 47, 155, 109, 22, 123, 143, 154, 69, 75, 142, 298, 171, 81, 77, 163, 259, 143, 178, 73, 108, 189, 126, 177, 142, 63, 72, 176, 123, 188, 119, 144, 37, 133, 113, 267, 287, 216, 126, 88, 95, 266, 24, 224, 174, 224, 252, 224, 135, 122, 57, 78, 179, 97, 271, 293, 27, 97, 24, 115, 152, 261, 338, 231, 111, 104, 112, 74, 38, 108, 106, 184, 197, 39, 108, 175, 253, 176, 4, 121, 177, 305, 158, 187, 225, 167, 149, 166, 273, 175, 61, 165, 45, 215, 217, 153, 193, 155, 85, 119, 98, 127, 152, 97, 148, 39, 118, 94, 66, 162, 253, 219, 52, 195, 189, 200, 380, 183, 146, 287, 225, 302, 222, 125, 338, 165, 106, 74, 256, 80, 209, 212, 196, 59, 40, 36, 96, 122, 116, 91, 116, 77, 17, 45, 89, 100, 66, 176, 127, 119, 81, 196, 185, 118, 74, 87, 104, 242, 168, 94, 267, 241, 90, 73, 108, 54, 17, 148, 157, 54, 86, 113, 108, 105, 140, 179, 162, 235, 314, 189, 64, 174, 92, 201, 167, 37, 43, 106, 137, 166, 74, 50, 137, 143, 77, 125, 102, 120, 163, 161, 95, 105, 118, 212, 275, 155, 25, 89, 93, 128, 210, 40, 28, 38, 175, 26, 147, 47, 83, 154, 207, 184, 67, 222, 98, 185, 227, 141, 95, 363, 441, 219]
-168B19k10M7
$$ y = [219, 9, 56]
-192E6
##PAGE=	F1=-5512.59
##FIRST=	25164.767445380970457,	5806.2096540000038658,	0
##DATA TABLE=	(F2++(Y..Y)), PROFILE
5806A00J1lJ34p9M5m4o9J82p4j67M4m7L6N2L8R0l1J2j93J52L1n4o8l8N2J44n2j66J02J47m5
5442B42j10l4K1pP8q9O3K0j28P4p3K04j09J7K6o0m0J0j5J3P7O0j51m6J6mR8n6p0N3l6J88j91
5055D1M3P0k7J2k0jQM8O8k01L5Q7q7J2J19O1r3l3j8k5n4M4mn9K9O7p5N7J1J11j2n7l3j0QM0
4632A62K0j17K5J76j1j10J15j76J0l2l7J15J13k9j66J56k0j21J8Q7m2p4P5j04J14O3j53M6
4304A03rn9N5n7L5RO7o9J94J29k08o3j0jm2J10L5n7j27M5l8N4R4l6k7P5j48J75J70j13j25
3940A61r5J30J1j9J34j15o7j3J84k5k00N5j2L0j2j17R6m9k6J01J13j93Q6m7O3O3j24J2Q0M9
3588B54r2J18j67n0m8M2P3n7J9K7J48j47m8k9K25o1o0J7j10J34J4j38j4P1N2L5p4J24m1L4
3236B51j13j00O3J89l7J20o7j07K5j63J21P4j36K2K6N1q1J29j38m8J0p0R4K1L0j41P4o8J72
$$ y = [100, 111, 108, 242, 163, 208, 164, 95, 277, 203, 36, 80, 33, 69, 121, 159, 249, 218, 230, 37, 189, 220, 166, 98, 60, 112, 256, 204, 38, 140, 287, 242, 132, 98, 119, 112, 190, 101, 164, 184, 56, 130, 57, 261, 152, 169, 195, 135, 95, 105, 90, 103, 180, 240, 89, 43, 59, 55, 153, 97, 27, 80, 44, 232, 41, 84, 154, 127, 139, 119, 118, 126, 174, 242, 41, 76, 163, 76, 88, 207, 268, 175, 142, 124, 99, 45, 89, 85, 26, 55, 122, 47, 104, 115, 226, 214, 157, 124, 114, 122, 162, 182, 65, 90, 266, 255, 145, 260, 84, 94, 62, 25, 140, 253, 224, 58, 214, 194, 73, 91, 178, 136, 62, 137, 33, 147, 210, 57, 103, 94, 35, 90, 33, 68, 77, 144, 75, 269, 398, 190, 127, 117, 116, 74, 184, 219, 162, 35, 80, 42, 96, 190, 154, 127, 202, 54, 229, 399, 286, 161, 66, 196, 207, 188, 322, 207, 140, 127, 311, 286, 86, 141, 129, 159, 147, 30, 126, 77, 51, 152, 265, 72, 158, 111, 174, 237, 113, 125, 205, 254, 162, 280, 113, 63, 15, 57, 130, 73, 92, 119, 267, 120, 72, 43, 268, 207, 147, 164, 54, 188, 202, 64, 50, 121, 173, 208, 134, 258, 217, 251, 138, 38, 101, 290, 253, 373, 306, 199, 224, 61, 182, 256, 120, 142, 168, 219, 138, 267, 129, 81, 91, 21, 115, 136, 166, 25, 99, 31, 203]
2895B03m4m2m9n1N6M0L4n8J43l2j47J4J24n7l1J00k4jp8J86j18o9j7P8n3P1q3J32m8r6k2N6
2520A17p1K9O0j3N2j00mK2J37m2j19K0Q5O7j41K9o3NQ6n9J15o1j26P8M1qM0m7J02j68J25n7
2144A31J37l8k1p2m7M2P6j66J65p5J23kl9kn4j17M4N9m6J11L3k08J01r5O0K0J57L3r3j23M9
1780A43jl7o3N7l4J30K3j20k9J14R3p3j79J12L7J57j31KJ8n3k0P0N7j30j01J29j19J43N6o4
1428A87J7k3j15J02p2K5L4l8Q0j57N4L2n0Q0P9k2j19J28k2K8J77j84q6J21k7L5n3r2J76j25
1076A70l0J1J03j71J44lo7j26N1l8J09Ro2m0O6pp1MN0J7j10J01L2jJ9L5K3n4k1l2n9J42ll2
677A59J52o2j76l4Q6p9J0J97m3j41kO6l2K4k9K4OJ27O9j63j13Q9k9J04q4o5m0J12rk3n1J5
301F5J52n7q6O3o1Q2L1k5k4j5J1N7J2q9r3N3L4L3Q3j49j1kR1q2Q1j08L5J04N3n7j43K10j34
$$ y = [203, 159, 117, 68, 17, 73, 113, 147, 89, 232, 200, 53, 67, 191, 134, 103, 203, 179, 178, 100, 286, 168, 99, 82, 160, 107, 178, 95, 227, 179, 83, 61, 117, 46, 75, 135, 122, 174, 74, 70, 92, 229, 187, 68, 88, 173, 240, 99, 128, 65, 70, 156, 97, 212, 151, 25, 103, 144, 136, 176, 129, 231, 63, 188, 131, 268, 230, 209, 137, 90, 132, 208, 42, 207, 132, 255, 253, 214, 212, 158, 41, 85, 144, 98, 209, 242, 34, 135, 40, 100, 120, 277, 310, 217, 94, 143, 142, 105, 42, 99, 65, 195, 218, 98, 69, 183, 276, 203, 24, 136, 173, 330, 199, 201, 219, 166, 146, 216, 273, 143, 42, 171, 52, 195, 251, 187, 204, 181, 66, 168, 96, 121, 155, 117, 197, 40, 94, 126, 76, 156, 235, 213, 94, 222, 200, 228, 405, 221, 135, 256, 229, 264, 211, 119, 295, 170, 140, 151, 254, 83, 227, 224, 157, 31, 82, 44, 153, 162, 100, 60, 126, 119, 48, 52, 102, 119, 9, 110, 142, 141, 160, 195, 218, 164, 143, 111, 52, 194, 191, 159, 311, 249, 73, 39, 125, 46, 56, 253, 210, 69, 67, 133, 101, 125, 96, 120, 126, 253, 322, 159, 46, 135, 106, 210, 126, 61, 21, 133, 124, 101, 50, 65, 217, 160, 74, 137, 76, 158, 189, 164, 140, 125, 136, 193, 205, 116, 23, 76, 110, 143, 226, 77, 66, 64, 155, 73, 154, 46, 81, 185, 238, 181, 38, 248, 114]
-86A14P4J01q3j32K28J34j83k19L5
$$ y = [114, 188, 289, 206, 74, 302, 436, 253, 34, 69]
-192F9
##PAGE=	F1=-5614.85
##FIRST=	25164.767445380970457,	5806.2096540000038658,	0
##DATA TABLE=	(F2++(Y..Y)), PROFILE
5806A01PRJ07n4J9q0%J48q7r7K4p7N2O3M8P3m0J7j92J73L2o9r1l1N4J17k9j93J81J35r5j19
5431A06J4k1J0R6q8L3P2j79R7p6K26j44m5K5n5j0J10l9n4P6P4j32j7l7l2J95o2j01N9r3K06
5067B14j15j1N8k1L0KP1j9n4P9k00P4Q2q0K4J07J2o7j8p5J3o0Q5q9j1O8J8j12J21LQ2Kn8k1
4668A34l9L0pP7r4j3K19l5q6Q6j66k9K7p1O1R9L9k08J84j3j12M1O8j24K4P9j24R1O3j55O3
4304A09l9l7N7m3K6L5N6j30K28J37j99p7n2M7n4J48K1j11q4K9qK8J06j8l8N5j22J56J77j10
3952B93j45p1P6N8OJ41j35l8o1J99l5k01L9L8lm0q1R5l7m6J35R2j84N2l3P9O7r7QK2P4j43
3576A24J83k31M0j08L9J13j13L9L8J30j17o5LJ33j6qnj40J59j8j32%O7K2K4j1J24k0K2j03
3224A73j05M7J27m9J62l2j20j2j39J41P5j52K4K5O4p5J23j13r7j0j2M3L1N6j27O2q1J84mr4
$$ y = [101, 108, 117, 224, 170, 189, 109, 109, 257, 170, 73, 97, 20, 72, 135, 183, 256, 216, 233, 41, 214, 246, 177, 86, 55, 109, 226, 197, 4, 185, 320, 225, 106, 120, 99, 109, 205, 117, 150, 222, 43, 140, 64, 290, 146, 101, 126, 71, 61, 171, 132, 78, 154, 228, 96, 79, 42, 10, 205, 143, 42, 101, 8, 214, 99, 88, 146, 125, 155, 157, 228, 209, 155, 234, 34, 108, 190, 110, 134, 241, 253, 186, 168, 93, 106, 46, 131, 42, 31, 99, 117, 5, 126, 129, 211, 213, 155, 134, 95, 125, 118, 195, 101, 88, 307, 272, 186, 272, 106, 77, 104, 33, 94, 193, 232, 24, 208, 195, 83, 124, 192, 68, 92, 171, 47, 138, 201, 46, 109, 70, 33, 90, 47, 73, 108, 164, 34, 262, 399, 200, 123, 71, 118, 64, 212, 233, 122, 38, 67, 59, 87, 193, 175, 137, 192, 70, 226, 403, 293, 148, 77, 153, 211, 217, 358, 223, 185, 124, 323, 288, 87, 126, 164, 161, 121, 40, 135, 98, 52, 187, 279, 95, 147, 114, 193, 260, 163, 171, 193, 267, 124, 307, 76, 116, 8, 47, 160, 47, 86, 124, 254, 137, 72, 75, 208, 192, 184, 179, 39, 198, 180, 48, 48, 115, 137, 161, 150, 274, 254, 276, 173, 68, 115, 242, 193, 355, 323, 203, 191, 52, 193, 268, 116, 140, 165, 229, 154, 277, 164, 67, 57, 45, 88, 119, 175, 48, 110, 29, 213, 209, 115]
2872A15r1J3P1k0R5n7J36q7j32K3R1k5o7J17l8j0M3J02j36k8n1J13q6N8q6J30Nj52K3Oo7J21
2496A29Qm6R3j04j5j0J00N2j56N3N8L0j53N5l8k6J08r8K01q2j09O2KK3K2j6J63k25J47r8J20
2132B50o8K0o0o4J05k6j22J54r1J72n7l8J00p1j45M4k3K2M7M2j60J23p7M9m0J98rp7j17J01
1780A82j1n4p4N4k8J30K4o9j17J26J03m0j75J04L9J26j02j9kl9j9J22Pj70o6J46j02J14R5
1440B85p6j7Jj28J50r2j6N0NO7j54K1N5k0L8N0m0o6J21k4L0J60j50j29P6Rj0pn8J04o1j8N0
1053B06N4j78J50j3r1q2J07p2J20rr0n0P2L2o3l0O0K1q9j7J02PQ8o2O8l1j9o5q5J39L6RJ05
665C30q4j78m8J15q7K1K66j03j31l6R1o1M5m4k1kJ95N3j92p7N9J7Q2j28Ko1J27m1q9OO1J89
290B76r1j25R3q0J18J0l5J5m3K9jn4n2k6K4O9J3R6j07m7N1Rj5K5j03J9J29N6o2j59K09j12
$$ y = [115, 24, 37, 108, 88, 183, 126, 262, 175, 43, 66, 157, 132, 65, 182, 144, 134, 177, 279, 143, 115, 64, 177, 91, 149, 63, 193, 198, 46, 69, 75, 8, 129, 137, 91, 184, 80, 65, 55, 155, 207, 51, 104, 162, 192, 39, 94, 56, 30, 138, 40, 241, 159, 50, 112, 114, 137, 159, 143, 306, 81, 228, 130, 250, 182, 202, 142, 78, 183, 157, 35, 189, 98, 270, 213, 175, 275, 204, 59, 103, 80, 102, 149, 191, 31, 154, 77, 126, 86, 284, 275, 198, 81, 182, 171, 117, 43, 97, 69, 199, 223, 154, 37, 163, 266, 226, 51, 155, 194, 320, 218, 199, 197, 158, 139, 261, 268, 98, 32, 178, 76, 190, 285, 209, 192, 193, 65, 215, 123, 107, 157, 162, 229, 75, 96, 151, 131, 169, 219, 179, 113, 234, 210, 240, 400, 250, 121, 197, 206, 196, 189, 131, 235, 174, 156, 206, 260, 82, 232, 219, 128, 46, 153, 81, 201, 192, 102, 52, 124, 156, 93, 63, 123, 144, 55, 38, 140, 147, 235, 173, 241, 210, 191, 126, 41, 180, 216, 225, 330, 246, 68, 20, 135, 48, 69, 335, 232, 101, 65, 156, 95, 140, 96, 75, 73, 268, 321, 129, 52, 111, 128, 210, 82, 84, 23, 150, 109, 20, 26, 87, 276, 185, 60, 153, 73, 191, 201, 166, 181, 138, 167, 166, 112, 60, 34, 58, 127, 140, 236, 129, 82, 133, 142, 127, 152, 49, 68, 197, 253, 191, 32, 241, 129]
-86A29M9J63o8j74J23J76j12k23M
$$ y = [129, 178, 341, 273, 99, 222, 398, 286, 63, 67]
-192F7
##PAGE=	F1=-5717.1
##FIRST=	25164.767445380970457,	5806.2096540000038658,	0
##DATA TABLE=	(F2++(Y..Y)), PROFILE
5806H9J3L0O8l0pj13P4R0q9j3J3o5NQ4M4L2j8K3j81J96J4q7q8j1M5P3k1j22J70J02j47n2L7
5419A58j03L6J24q8K6Q9j54N4o3K06j62p5J9R2j1P0n8j14P3P4r6K7o8mJ96p3j22O6n9J31m2
5055A49o2N1k0M3J3J22l6j19O7j86J12N7m8L2P5k7l0j3j13O1o6J14j07K4L9J2j12R3J9N2J2
4691B08o0qo1M9p5J09l9j7K24o7m3M4j38o4P9j01M8M1Q7j86J76qp6N5L8j23J6O3j26Q8M6j22
4316E7P1l9n6N2k0rP0M7j72K40J36j78q1q3J14q3J84j5j36n8%M4QR6J1q4L5n7J02J79r7j57
3940A21j7OJ00QJ28j37Lr4J86o0j44JR1l2n1o3P3j7m6J53O0j66J5k2R7O6o5J7n7R6j75K23
3564B98k17J02j53%J56j31K1K8R5n3n8P2l8N5K4k8j55J50l5r5K0N0%QN5J31j3%r8j04L4M5
3189A66l2J84j4j06j9j31J43P7j68K5J6Q8p2J20o8j20l7J2j8P2N2j01L4p4J70K5r5o3jP6n5
$$ y = [89, 102, 132, 200, 170, 163, 50, 124, 214, 125, 112, 125, 60, 65, 149, 193, 225, 207, 230, 49, 245, 259, 172, 84, 73, 118, 191, 170, 48, 218, 320, 173, 121, 158, 55, 91, 215, 127, 153, 242, 88, 142, 79, 285, 123, 48, 67, 159, 148, 218, 160, 46, 119, 193, 97, 124, 56, 52, 248, 175, 53, 119, 60, 191, 149, 87, 138, 118, 161, 174, 296, 260, 141, 208, 22, 134, 191, 143, 175, 250, 223, 193, 180, 67, 128, 62, 176, 69, 93, 132, 144, 32, 125, 144, 196, 208, 148, 140, 79, 128, 53, 162, 123, 106, 330, 263, 220, 264, 126, 62, 141, 40, 88, 129, 216, 30, 206, 198, 122, 177, 215, 92, 108, 171, 45, 133, 179, 57, 128, 89, 33, 85, 65, 56, 126, 173, 1, 241, 377, 199, 118, 35, 149, 66, 250, 235, 99, 41, 41, 85, 93, 189, 200, 116, 151, 94, 196, 375, 278, 121, 104, 110, 210, 218, 346, 209, 212, 118, 304, 244, 100, 101, 192, 160, 109, 46, 119, 102, 56, 209, 269, 103, 118, 96, 193, 259, 194, 211, 154, 250, 75, 298, 81, 183, 30, 30, 186, 55, 76, 104, 199, 146, 88, 160, 122, 177, 201, 173, 18, 168, 133, 38, 58, 108, 108, 116, 171, 302, 289, 289, 191, 87, 121, 166, 134, 318, 304, 198, 179, 48, 191, 268, 100, 125, 141, 229, 157, 277, 209, 89, 52, 64, 46, 118, 170, 69, 103, 29, 199, 224, 129, 66, 65, 141, 86]
2825H6J36q8J24j15j07K0L8L1o6J10m7KJ25jj35J6q9J65j05Nm8J29M5k16O8l9LJ16l0n8J20
2461A95j18lj1K2J34j87R5Qop8N2n6k5J38j15K14r7q5K0RK7RPK05k63J52j35J15p0L6m8q2
2085E9J79o1j58J53r8J81j18k5J97o5j45K6o4N4OM2j46J33k9N0j18K18l7n5q6J15j2r4o4N7
1733I5NR7J2k6j63R1J19J1j53Q9M2O0o8l2k0j5qJ53k8k15MJ33q7R4J22r8n4L2j05J67p9q5
1358I0O1M4L7j12OL3J9K1Qq1j6J20j9K6J32j07j40kL8m5M9l5M2Qk7Q6L9j94J44k7q2l0J39
970B25j21J31l2q8l3L6P7m9p1O3K3p3n4R4J4J36j40J11rk7r6n2J28M6M0M4r0j84j6J08p7j3
595E1L27j63p8p0J12q5M5rj8j01K60L7j90n4M2M1N2j50N3m8J05n1m9m4Q3K08j09j57J31p0
243A01J20j2l2L3p5N4n7r4lK8k4R5j2J10n5j05J09n8M3qr8k0J51O1m5j41J35p1J8K20l8j87
$$ y = [86, 222, 134, 258, 143, 36, 56, 94, 125, 59, 169, 122, 124, 249, 248, 113, 129, 40, 205, 100, 105, 57, 186, 231, 15, 83, 44, 47, 163, 133, 75, 195, 77, 74, 63, 85, 219, 32, 127, 135, 129, 51, 103, 47, 22, 160, 45, 259, 162, 77, 97, 106, 133, 142, 149, 354, 91, 243, 108, 223, 153, 189, 141, 59, 238, 177, 19, 172, 74, 255, 137, 112, 309, 244, 99, 125, 61, 115, 121, 163, 17, 150, 121, 171, 53, 271, 234, 179, 93, 208, 196, 102, 38, 95, 100, 197, 209, 183, 20, 111, 230, 241, 88, 177, 219, 279, 211, 179, 159, 144, 136, 289, 261, 46, 50, 183, 96, 190, 312, 214, 160, 192, 87, 254, 175, 90, 151, 195, 232, 120, 126, 159, 178, 199, 207, 126, 110, 230, 211, 237, 369, 262, 122, 120, 158, 113, 162, 127, 169, 177, 150, 236, 275, 81, 225, 198, 116, 86, 225, 104, 235, 203, 115, 82, 118, 195, 146, 75, 138, 161, 88, 34, 128, 142, 278, 138, 249, 240, 213, 117, 65, 193, 239, 279, 323, 233, 49, 33, 141, 64, 51, 378, 215, 137, 67, 179, 94, 139, 130, 112, 11, 271, 308, 118, 64, 106, 147, 199, 49, 102, 54, 159, 108, 59, 15, 98, 306, 197, 40, 171, 101, 221, 209, 177, 210, 135, 189, 132, 38, 35, 63, 39, 134, 122, 232, 177, 72, 181, 123, 166, 158, 60, 40, 191, 252, 207, 66, 201, 130, 148, 368, 330, 143]
-133A43JJ93k9k18m1
$$ y = [143, 144, 337, 308, 90, 49]
-192D9
##PAGE=	F1=-5819.36
##FIRST=	25164.767445380970457,	5806.2096540000038658,	0
##DATA TABLE=	(F2++(Y..Y)), PROFILE
5806G5K3N8K1k8pj31J31J9q1O8pn5m0J22J5j9M2J5j42J89j4j05n9K3L6J4k6n3J46N6j92O1
5431A55L8j79N8J48j00N6O7j26J4m0J48j53l8RJ95l6K2p0j38N2N7m9O7p0oJ81p8j21P6rK7
5067A57J9r3M3j9M8J1J39m5j32L9j57J43J3LL6L5n2orj24Q8o8J45q5K1lL2j40P0N3J7J9m9
4679A49k2n9O9r7P1J8LJ92r3kMr3q3J03j12P3n4J16j44J66ml7P5rp7m6L5q2P6J1p3P8k8q9
4280C5N1J3o3Q9M0j41J81J26j40q1r7J63j07K22m9j24r7J5N7J9O5N1j52J7K2L2J75q3j58O4
3928A45p9J35k0J08j19M0r6J49j04m1m4J33n4l9o6L0Nl0J59K0j35j7j0J05O1l3L8j51J14j85
3576A9K31j26J16j88k1J70j19k3J0N4K4l8J20j88J21M8n9j17O9l7l5M2J9OrJ05J37j8k4j00
3224A89r9K7k7L7J39j4o1Oj51J38P9j82J7JJ18o0J04j1j27n8Kl6J05J3p5On3J41N0o4n6k3
$$ y = [75, 98, 156, 177, 149, 142, 11, 142, 161, 80, 148, 141, 86, 46, 168, 183, 164, 206, 221, 79, 268, 254, 149, 90, 113, 149, 163, 137, 84, 230, 286, 94, 155, 193, 14, 72, 220, 120, 176, 243, 117, 131, 91, 239, 86, 48, 57, 252, 216, 238, 168, 30, 82, 139, 90, 157, 87, 81, 262, 184, 63, 139, 130, 157, 176, 83, 126, 107, 155, 166, 305, 260, 128, 167, 10, 153, 166, 169, 205, 240, 188, 182, 173, 49, 137, 69, 214, 129, 150, 147, 179, 39, 109, 162, 179, 198, 149, 127, 68, 137, 40, 111, 129, 132, 324, 231, 229, 233, 140, 57, 160, 48, 121, 67, 183, 39, 205, 201, 164, 239, 230, 153, 107, 142, 60, 136, 147, 74, 152, 124, 35, 86, 99, 36, 125, 165, 24, 205, 331, 191, 110, 13, 176, 69, 291, 242, 118, 21, 36, 93, 112, 177, 228, 76, 93, 115, 147, 322, 239, 81, 145, 66, 201, 181, 289, 170, 210, 114, 263, 159, 118, 74, 207, 153, 114, 48, 78, 83, 53, 212, 232, 97, 80, 70, 175, 236, 203, 241, 90, 204, 19, 250, 124, 240, 52, 31, 201, 82, 59, 69, 123, 147, 109, 229, 41, 162, 210, 151, 34, 103, 66, 31, 73, 92, 98, 89, 194, 331, 313, 289, 189, 90, 117, 90, 127, 266, 252, 191, 197, 46, 184, 263, 81, 98, 99, 217, 157, 261, 250, 123, 65, 67, 31, 136, 149, 74, 80, 27, 168, 218, 154, 98, 75]
2848G5Q0o7J53j28J13j20p3K0J6M9l2P2n1L7J56j05j00M7o8J61r2q3K1J42M4k17N4l5jJ00
2496A68m1k9J17j53M3j5n8J87k02J35m7k5L5K1r8QJ50q0J43r8q1j9O8J%J2K27k72J29j60J30
2132A96n2K3l1q0K29k8k04J04r4J41j61kK66m2j20k%rLL0j16P7L1M4j60J96m7l2l2Q4jj46
1757F5k3N0M5N7j4Lj80L2J61M7j24P3L9j4l3l9l5K1RJ56m3k47O7J09p1P3J38j21q5O3o5J66
1381B80n1j50N4O9Lm3Nj8O0J9k2j31J3J17rL0R6p0j11p0K5k8O2m2K4O6n5J24M9k13J25m4m4
994A20KJ64j74J41o1o1j9QJ16m2j12N8K7n8l0L2K5J45j75J41Pm2j33MJ26M5N5j8p8k01K4J12
618A48o2n9L57k19Oj10J35r3K0L4J4j23K12K1j53n7M6L6J8j20O3l0Q0m5%j03P8K10j12j68
266B4J61n5J16k1k7K4j07P4r2JlNo9R3k8J10Rj75J58j06R3qj00n6J56N7j2j11L6k9j6K63L
$$ y = [75, 155, 88, 241, 113, 226, 106, 33, 53, 69, 118, 86, 158, 107, 144, 300, 195, 95, 142, 74, 235, 143, 60, 81, 223, 267, 50, 104, 69, 68, 168, 127, 98, 215, 62, 105, 90, 32, 219, 17, 152, 105, 80, 115, 136, 38, 46, 196, 116, 259, 161, 80, 61, 129, 130, 130, 142, 369, 97, 226, 66, 196, 144, 167, 136, 56, 285, 257, 53, 157, 63, 204, 43, 41, 307, 265, 145, 143, 143, 134, 137, 167, 51, 128, 159, 203, 43, 239, 192, 160, 128, 212, 211, 65, 42, 92, 137, 194, 180, 183, 3, 35, 196, 243, 119, 192, 231, 217, 184, 145, 110, 131, 140, 296, 253, 6, 73, 182, 111, 184, 322, 201, 116, 179, 114, 280, 229, 79, 133, 202, 205, 162, 167, 149, 209, 228, 206, 75, 88, 205, 196, 226, 322, 252, 141, 71, 96, 68, 130, 88, 112, 178, 123, 247, 296, 83, 208, 164, 120, 122, 286, 112, 253, 192, 131, 112, 120, 236, 194, 82, 140, 167, 109, 79, 111, 136, 281, 106, 247, 254, 212, 79, 83, 209, 254, 309, 291, 213, 12, 36, 148, 86, 27, 384, 165, 171, 61, 196, 103, 123, 157, 171, 48, 260, 281, 128, 71, 117, 153, 171, 51, 114, 84, 164, 119, 119, 16, 94, 304, 192, 24, 185, 130, 246, 225, 198, 222, 115, 189, 97, 98, 95, 100, 31, 124, 96, 206, 215, 40, 198, 92, 185, 177, 77, 21, 177, 234, 222, 111, 147, 118, 102, 365, 368]
-121C68j91q4J75M7k06r1
$$ y = [368, 177, 93, 268, 315, 109, 18]
-192A8
##PAGE=	F1=-5921.62
##FIRST=	25164.767445380970457,	5806.2096540000038658,	0
##DATA TABLE=	(F2++(Y..Y)), PROFILE
5806F9L1Q5j1p2L1p2J02m9n4J20m4l7o0J52l8o1J29k2q2J47l1j14j7N8L7m5l9nJ14Pk12J64
5431A81L5j46JJ48j29J12K5j04j8pN7r7K1OK24o6j6p3r7kK2PQ0m4k1J47p5q5Q1L9r6N9r1L4
5032A12j6M5kJ17m1j03Mq6J36m3N9L5%o7nJj04Q2n9J74n8J2n4O5j51N7P9k3J8j8o2m7R4k6
4632A25J3oK3J35j10K5k6l5q5R2q7R4j45J35q6J44nKQ6o9m1q8J5OL2l7k3P9j7r4M8M1p9M7
4233A09K7j04J29J03q9p5r5J75j14K61o5j18j14P4l5O7K3R7k06J2O8j6J40p6j30J43j53J45
3905A83p1R2q7O3p2J06j66R0q7J56p4j0o9plj1J61j8q4n1K0Q5N3pO9k42J18r8J37j7J12j95
3529G6k3J50q9o8QN0L4j5J41j73O1P1j05n9k0jk2O8j6M4j9J20J40l5m0j09r1K5m4J06M4l5
3154A74RN9j82J16Q8j84j9mJ40l9P4M3j19q6j8L5P7n3n2j2kQ6Q5l8p5m3R1o4J40j52J11j21
$$ y = [69, 100, 185, 174, 102, 133, 61, 163, 114, 60, 180, 136, 99, 39, 191, 153, 92, 221, 199, 117, 264, 233, 119, 102, 160, 197, 152, 113, 108, 222, 229, 17, 181, 216, 70, 71, 219, 90, 202, 227, 123, 105, 98, 155, 58, 79, 85, 309, 243, 227, 154, 57, 55, 77, 84, 164, 120, 99, 246, 171, 86, 167, 206, 110, 169, 78, 112, 96, 141, 139, 256, 215, 112, 116, 30, 166, 123, 182, 217, 217, 150, 145, 146, 42, 124, 65, 239, 181, 193, 139, 204, 53, 110, 189, 166, 184, 166, 104, 57, 151, 125, 138, 132, 155, 290, 180, 205, 179, 144, 59, 151, 64, 158, 13, 148, 62, 206, 201, 203, 289, 220, 179, 91, 106, 112, 144, 107, 84, 163, 146, 52, 100, 141, 62, 109, 136, 32, 161, 264, 175, 100, 5, 180, 66, 327, 262, 144, 30, 104, 69, 136, 159, 256, 50, 62, 130, 114, 254, 178, 48, 191, 38, 183, 112, 204, 117, 180, 108, 214, 48, 138, 51, 207, 133, 123, 54, 47, 44, 33, 194, 176, 92, 41, 61, 146, 199, 192, 261, 19, 137, 39, 176, 159, 271, 76, 53, 203, 114, 46, 54, 104, 138, 123, 264, 91, 152, 223, 118, 59, 39, 38, 16, 84, 68, 112, 93, 213, 353, 318, 278, 169, 78, 103, 59, 165, 209, 174, 183, 242, 60, 176, 264, 80, 61, 57, 197, 158, 232, 275, 156, 70, 52, 87, 164, 111, 59, 47, 45, 131, 216, 178, 103, 60, 151, 87, 227, 75, 186, 65]
2778F5j4K3O5k2nL2n3P3J53j96k5O1k0J17o5j47O2J77J7j99K9pn4P6k4J7R6j91J04l7p7J72
2402B03j79J47q3oQ1Jj35L0J57m6P2q6r8l6J43l0j0JK30k50P6j70J70l4j6Pn5K32K2k38M9
2038A49q0N2n1m8K45qp1m3P7p9L0Np7lQ2K5j38J31l5k2K0L1J9j47MK2Q7K0m9K4j45K3J50L5
1639B35j06O3L3p7lm6l9N9K8J32m1j86L2R3m8M4J40j42j07R4k1J53k1j80J9P4k8L9Np3R6J5
1264B36k7j41j5J06%N5N7m8o1l8r0J03m3p1O9Q2j01J69P1k31J06o4NJ8J80k18J49r0j6k9Q
900A31J40m6j43N0L6m5k6jM1J10j55J47J2o0j63O6J19M2N4o6n2j45k9J43m9m1K91k55Q8j49
548D5J61q7qN2M5j15J44Nj04o6O6J0k3m8M3j5N9l5K3j37O2K00j03j44J67n4J17j3k2oj39Q0
172A60p3P7qk0q8M7lO4P8k19J70j38J37J2j00k5R4L7K7o8k7l3m2K76M6j90j07J23R7j89r6
$$ y = [65, 51, 74, 139, 117, 112, 144, 91, 164, 317, 121, 96, 157, 137, 254, 189, 42, 104, 281, 298, 99, 128, 121, 67, 143, 119, 136, 232, 41, 145, 108, 31, 203, 24, 171, 88, 82, 163, 164, 29, 59, 216, 170, 242, 156, 58, 22, 165, 135, 125, 126, 356, 106, 182, 12, 182, 148, 132, 139, 84, 316, 338, 100, 149, 69, 121, 70, 22, 267, 259, 188, 145, 222, 143, 173, 178, 101, 98, 180, 205, 67, 198, 163, 141, 161, 192, 211, 64, 68, 90, 177, 197, 148, 172, 27, 50, 200, 235, 129, 192, 225, 148, 145, 99, 60, 119, 147, 279, 238, 52, 84, 177, 129, 173, 313, 171, 64, 158, 137, 290, 269, 89, 108, 182, 154, 193, 198, 125, 221, 236, 209, 68, 53, 159, 159, 214, 271, 223, 162, 124, 34, 137, 94, 23, 92, 174, 73, 242, 313, 82, 188, 124, 129, 147, 327, 109, 258, 168, 152, 123, 131, 271, 225, 82, 132, 168, 123, 97, 96, 137, 247, 92, 239, 251, 191, 28, 94, 213, 255, 309, 243, 191, 46, 17, 160, 111, 70, 361, 106, 194, 45, 206, 119, 111, 163, 208, 93, 237, 242, 138, 72, 138, 148, 125, 77, 120, 105, 164, 129, 152, 15, 77, 277, 174, 30, 197, 143, 260, 247, 225, 219, 80, 160, 87, 164, 156, 136, 48, 95, 92, 156, 234, 15, 185, 47, 184, 196, 96, 71, 165, 202, 229, 161, 134, 101, 59, 335, 381, 191, 84, 207, 304, 115, 19]
-192A9
##PAGE=	F1=-6023.88
##FIRST=	25164.767445380970457,	5806.2096540000038658,	0
##DATA TABLE=	(F2++(Y..Y)), PROFILE
5806G1L8J06j3j67R4k3P8q7qJ14r7om5J58j07k1J57p8k1P9k1j01J5Q5M5q9n1J9P7l5o5Q6L4
5419B21j00l2J26j71J73j5r3k6J9n3K9K0J0K15r5l9o3m1m0j7O6M8Nl8R9n9k3P4P7k21P1n3
5043G4K3pL4rM9j8n2k9kJ08q3R4K6k2q4j3J3o2N7l3J80l2Nj06J02j26O4P3o3RK3r0o2J23M0
4632B04K8r0K6O6j12K5l7K9q2N9k8R6j58J02k5J05j0L9P6j32j8r6L3P8k9p7J2O7j0o4L7O2
4257A76o6k6Po3J04N5l3o4q7J50q2K80p0j34n4R6j65J40l5J52k06K5L9lN3q5j9J45j61R0j21
3893C8P6m7O3l4P2j03R6j26J54q9K8o2L8n7l6J45m0or2O4L0M5J4R8j89j3K7J3O4R7j68k6J18
3506A92m7r7L7R7o7J3J32r8j5Q8j51j4K3K0j02P6m3J01k4J03J36n7m5j22o9J8j0J20l6p8Q3
3142A64J30j97P4J02j68q7K7J27j7M5P7r6j16j8R4M7j22l0KL6K3J28l2j08o1J17n2R3j26J07
$$ y = [71, 109, 215, 202, 35, 129, 106, 184, 97, 89, 203, 106, 100, 55, 213, 106, 85, 242, 164, 143, 222, 201, 100, 115, 200, 245, 156, 105, 124, 201, 166, 101, 187, 221, 121, 89, 215, 44, 217, 202, 109, 83, 102, 49, 78, 98, 108, 323, 228, 189, 126, 85, 45, 28, 94, 142, 147, 109, 208, 149, 126, 200, 277, 56, 127, 74, 97, 90, 124, 115, 164, 146, 94, 65, 63, 171, 88, 182, 208, 186, 102, 89, 102, 40, 97, 64, 244, 212, 217, 111, 213, 87, 151, 224, 161, 170, 193, 103, 41, 164, 204, 232, 142, 168, 234, 122, 147, 110, 139, 57, 116, 88, 184, 26, 128, 103, 208, 198, 237, 313, 181, 163, 67, 100, 178, 149, 72, 84, 151, 141, 77, 114, 176, 110, 84, 91, 28, 132, 187, 154, 90, 3, 153, 71, 351, 281, 147, 93, 189, 24, 164, 129, 281, 75, 100, 139, 136, 189, 104, 85, 230, 69, 159, 38, 114, 67, 130, 96, 168, 65, 161, 35, 189, 100, 128, 66, 104, 47, 11, 156, 116, 110, 18, 82, 112, 157, 171, 269, 80, 67, 94, 107, 171, 268, 100, 74, 192, 145, 48, 85, 182, 115, 128, 260, 162, 147, 235, 84, 70, 93, 113, 11, 87, 44, 145, 121, 224, 360, 303, 258, 136, 67, 85, 75, 195, 159, 81, 164, 294, 97, 171, 273, 105, 18, 45, 172, 155, 200, 277, 181, 65, 47, 141, 188, 66, 36, 38, 74, 97, 225, 193, 85, 24, 141, 89, 182, 56, 163]
2790A63j38N8K1J08r2Pkn5R4J28k58P6O1J7O1k9j43L4K20j1j79J1K3j17L6J5O2O5k09J48o5
2426A10n8J25j34J36r2J3Q3qj58M2J51j5J6o7j31M7J37m8k1j8K16j97Rp9J23k9p2P3l4K07
2074C27O4k56J5m7q2J35r1J40K1qq8J37j33P3k8l9o3J01op8O5ml5O1l0M2o2k8j5J26rp5M5
1686A75j05N6J12k0j10N9L3j16K4n7l6R1M8R1l3j26pR3k3J9J18j53j18J18K0J28Lj68l0N9
1334A45m1J01Lj20J28jj1j03r0Q4J6R9J1m1j1K7j80K10j72QM6N0j44K06R8k39Q9q1M7K6J83
970C43k39J46j09L6o1K0J53n7j62M6N1l8l8pN9N2r6J27Qp8q7L5J00L4M0q6k6p4p0J59m5lJ90
583C23k21J03j81J81p5qK8O8j01R1j4o3o2Q8k0p2M5J7j6M6k5K3j36K8J88q0j02J56p2J22l
219B56qm3j61O5J2Q5km4q2k1P3m5J49j79R4j13J34L0r2K1L3JO1j1k2r7l4K26P8j80r3P6J09
$$ y = [163, 25, 83, 104, 212, 120, 127, 125, 70, 164, 292, 34, 110, 171, 188, 249, 220, 77, 111, 331, 320, 141, 152, 175, 58, 94, 109, 171, 236, 27, 175, 110, 52, 177, 43, 179, 87, 100, 183, 175, 17, 59, 210, 195, 211, 144, 13, 60, 197, 149, 128, 110, 326, 129, 138, 59, 182, 153, 81, 154, 120, 327, 391, 135, 150, 103, 21, 156, 65, 205, 226, 218, 130, 267, 134, 207, 179, 140, 77, 178, 172, 94, 159, 155, 120, 181, 151, 193, 131, 103, 88, 214, 205, 130, 175, 70, 126, 238, 218, 108, 167, 200, 84, 108, 51, 15, 106, 154, 245, 212, 86, 79, 172, 149, 168, 286, 133, 15, 133, 153, 281, 284, 116, 86, 145, 104, 205, 208, 88, 216, 215, 204, 101, 11, 95, 111, 210, 221, 180, 169, 196, 16, 226, 54, 62, 108, 158, 14, 220, 318, 79, 168, 87, 134, 160, 343, 104, 250, 141, 177, 116, 136, 289, 232, 70, 116, 167, 129, 91, 84, 143, 195, 99, 226, 234, 156, 69, 104, 204, 238, 278, 192, 166, 92, 22, 181, 136, 133, 323, 102, 205, 24, 205, 130, 122, 150, 218, 117, 208, 194, 131, 69, 157, 137, 65, 110, 127, 111, 157, 132, 155, 19, 47, 235, 155, 53, 209, 137, 259, 256, 248, 205, 44, 109, 121, 206, 204, 160, 78, 57, 130, 85, 234, 55, 149, 36, 170, 200, 108, 129, 162, 163, 224, 213, 191, 94, 60, 286, 364, 184, 91, 167, 276]
-168B76j68n2
$$ y = [276, 108, 56]
-192E6
##PAGE=	F1=-6126.14
##FIRST=	25164.767445380970457,	5806.2096540000038658,	0
##DATA TABLE=	(F2++(Y..Y)), PROFILE
5806G2M4J22J0k07Q0K1O3j04L5Q2j62L2j6J49j72J05J05j43L7j0K2n8J8J02N4j18o0L1M9o2
5454A21O1rL8n6m1R5j80J83l5r0K0km1N4j8J6J84j18m9l6kn1MP7k2O2n5N2k0L7N5R6l05L1
5055E6J8J7JJ2K3p1K4mn1O8P4o3O6Rl0j09j3K3j8M8qJ54j0Nj53J41q3Q0N3r7nN6q0j12J49
4644A70R1N4j59J3Lr8NqO2q0J7M6P4j39P8J7O4j8O8M5j87po0P4J12r4o9KL5kj0J5P6l9q4k4
4222D3j7J03j7K0n0o2Q2mK58p7j65M6J05k04J34j09K15j90L2KL4l6j13J20R9j33J1o0k4JK6
3858G0QN7K6K5j66J32r8P7n4R8o7n2M7l5P6j16Q1l2L7L9J15j16j19J09k5M7O5j10l1Q3Kj14
3482E9N8J50j85M4R9k1o6R7j64kQ9K5j32L1n3J53k6P3J24q3m2j27k6mNJ20o1j04R8K08j89
3118A48J8J21j38j17K5Q5%L2Q1o5j32K3R3K3j70K8L2Ok7J63l7j38j5J05m5J6l5Q1j48J02Q
$$ y = [72, 116, 238, 248, 41, 121, 142, 205, 101, 136, 218, 56, 88, 72, 221, 49, 154, 259, 116, 153, 143, 165, 107, 125, 227, 281, 163, 103, 134, 183, 121, 182, 173, 211, 155, 114, 209, 29, 212, 177, 87, 107, 105, 64, 118, 100, 116, 300, 182, 133, 97, 95, 44, 48, 125, 103, 165, 110, 162, 142, 179, 234, 330, 25, 56, 74, 91, 92, 104, 127, 56, 80, 76, 25, 93, 167, 104, 170, 179, 149, 40, 27, 50, 32, 80, 72, 226, 216, 221, 68, 209, 126, 206, 259, 162, 157, 213, 133, 21, 170, 261, 315, 156, 169, 172, 74, 79, 71, 133, 53, 70, 116, 190, 51, 129, 146, 210, 192, 260, 305, 118, 111, 51, 125, 237, 143, 74, 76, 111, 109, 99, 114, 190, 151, 67, 43, 26, 129, 112, 132, 82, 20, 102, 98, 356, 279, 114, 160, 265, 61, 195, 86, 301, 111, 143, 145, 179, 143, 30, 150, 249, 116, 127, 67, 43, 44, 70, 78, 135, 161, 186, 20, 152, 54, 131, 77, 175, 108, 56, 103, 68, 144, 28, 109, 77, 114, 153, 268, 152, 33, 142, 117, 164, 229, 119, 88, 171, 173, 59, 117, 267, 82, 126, 225, 204, 138, 235, 71, 69, 158, 183, 51, 82, 29, 182, 156, 229, 353, 270, 228, 101, 75, 71, 76, 196, 135, 31, 129, 337, 148, 166, 287, 149, 32, 57, 142, 142, 174, 255, 190, 58, 81, 174, 197, 27, 55, 87, 93, 66, 229, 192, 54, 39, 144, 99, 115, 80, 161, 13, 115, 123]
2754A23J34j33Qk8n8R2R0j70O8N2L2NJ4j08k1K59k5j63MM8j47l2N2J08J9j79J38q6m0R2q8
2391F0J13q3J0P4j1j57M4J33Rk4m4q1P3J01n2k7l8J90j24k0k8P4m2j34J60k4J63R2k55Rjp6
2015H4J29j34O3L2N3j28J72j64J24o1j5q3Q9n1mK1L8o9Q4q3O7M1p1m7J56l3p4O8q7O1R2p2
1639A98j40O1M2j28N5p3OP0P3M7l5p2m3J11pRP2j51n8P0N3R0K1j27o7K6mR4nj44J56l2J3n1
1240A30r4nO9J16m1l9K1R0k03K53k75J08oRo3J07J28k10O0r2O4L9J68k30J27j13Q6j09L4J54
888B83p1j66N3P1m5n2jO9J7l2P6Mq8J8k0O8J7K0o6j9k2m0J33m8K9R1j22M7j86J77o9K1k2Q5
489B10q9N7k9m8l6R6l1o4Q6j3l4L4j0Pj02k6J83m3o4J38j06J31rJ8p2j30kJ16O1Rp1n8p0J51
90A90j73K02j32J8j1P4J5p2O8j4l9Q0N6jj59j3J41Q9j48o6N0P8j37j2
$$ y = [123, 257, 124, 132, 104, 46, 138, 228, 58, 126, 178, 210, 215, 229, 121, 100, 359, 334, 171, 175, 223, 76, 44, 96, 204, 223, 44, 182, 96, 56, 148, 60, 173, 90, 100, 174, 163, 6, 50, 183, 192, 168, 124, 43, 116, 217, 165, 138, 100, 290, 166, 146, 118, 192, 150, 16, 176, 152, 315, 407, 152, 161, 160, 84, 213, 79, 142, 174, 227, 99, 271, 107, 231, 170, 155, 72, 161, 110, 106, 127, 165, 96, 180, 97, 164, 205, 134, 87, 243, 210, 136, 204, 117, 178, 270, 198, 58, 119, 161, 33, 88, 15, 21, 91, 164, 211, 176, 104, 61, 172, 165, 174, 246, 95, 37, 107, 160, 250, 271, 144, 77, 103, 99, 193, 188, 44, 200, 168, 181, 130, 36, 31, 100, 216, 175, 136, 157, 247, 44, 297, 22, 130, 124, 133, 70, 177, 305, 95, 155, 63, 127, 166, 334, 104, 231, 118, 204, 95, 129, 283, 212, 46, 99, 170, 125, 73, 72, 141, 158, 126, 202, 206, 118, 136, 116, 184, 201, 221, 155, 136, 114, 74, 207, 159, 188, 279, 157, 204, 18, 195, 126, 147, 125, 210, 121, 178, 149, 101, 65, 161, 130, 66, 152, 139, 105, 139, 129, 136, 34, 8, 191, 148, 84, 222, 116, 247, 238, 256, 184, 54, 52, 168, 229, 238, 167, 109, 39, 190, 17, 219, 87, 105, 94, 168, 183, 111, 179, 165, 126, 206, 262, 261, 102, 89, 230, 319, 171, 105, 155, 233, 96, 84]
-192H4
##PAGE=	F1=-6228.39
##FIRST=	25164.767445380970457,	5806.2096540000038658,	0
##DATA TABLE=	(F2++(Y..Y)), PROFILE
5806F5N3J27M0j78%O4N2j24Q5M0k18O1J1J29j90K04M1j90Q1r5P4qLJ11N8j37o4M2L8o5J29
5442B39r4M9k5l3O5j10R7l2q6R1n1M4rn7K0J48j35m6KOm0K7Q9o9Q0o8J8M3O9L3R4k96k9M6
5043H0J9Kj7Q2j21LJ3l7R2M0%rj5k3p5J0pk7O8mJ12RJ7j93J79m6R2M5j26j9P0m9j53J60J12
4632B84P3j98Ll1p0K3L7Ro9OP3L6j08P6L8K9k5Q4kk23kJ4Q5J31j49j3m7j1%O2k4Q8mj05m4
4222B6OR7o7N3l4l7qR8K01q8k00J68R6j87R8j83K72j76L0j9N7q0q3J64L9r1p0K8q6K7l9M2
3846E4O0J06j3k01R4q3J24o0J45o2n2o4j0J32j31Q7q6M1P1J06o1j39J18J0l7J4l7l3N3M9j29
3482F6O3J95k56N6N6L2r1R3j24k6J24M3j35k6m3J79k0M2J07j09l6j19K5k6k0J17k3k3m3K82
3130C60j61l8J47j04j26k2N5J5L3N7l8j23O4N8Qj72Q6M9n4n9J77m0j49P8N8n1o3N5N9j19R9
$$ y = [65, 118, 245, 285, 107, 107, 171, 223, 99, 184, 224, 6, 67, 78, 207, 17, 221, 262, 72, 153, 58, 132, 124, 127, 238, 296, 159, 95, 137, 175, 110, 239, 145, 194, 169, 136, 201, 91, 188, 156, 70, 161, 110, 154, 145, 88, 108, 256, 121, 75, 77, 83, 43, 70, 159, 90, 170, 102, 120, 163, 232, 265, 359, 63, 34, 80, 99, 101, 84, 166, 45, 48, 61, 24, 116, 156, 156, 147, 132, 109, 34, 44, 37, 10, 78, 74, 186, 195, 212, 19, 198, 152, 244, 289, 163, 144, 214, 165, 12, 172, 284, 357, 159, 162, 131, 61, 84, 121, 130, 61, 67, 140, 176, 68, 144, 182, 211, 186, 270, 268, 45, 43, 57, 142, 273, 124, 111, 64, 53, 53, 115, 91, 179, 175, 70, 26, 32, 129, 62, 115, 81, 44, 36, 134, 335, 247, 47, 215, 311, 124, 222, 39, 311, 135, 165, 146, 203, 123, 40, 204, 243, 152, 82, 110, 24, 51, 12, 54, 114, 220, 207, 6, 100, 17, 141, 81, 226, 164, 112, 48, 38, 170, 39, 126, 40, 81, 152, 258, 197, 58, 176, 186, 149, 163, 126, 93, 146, 195, 66, 129, 324, 68, 124, 180, 212, 121, 214, 90, 64, 188, 231, 96, 70, 27, 206, 186, 228, 335, 226, 190, 71, 96, 70, 50, 167, 144, 121, 78, 360, 199, 161, 308, 204, 78, 56, 111, 126, 159, 216, 178, 55, 119, 177, 185, 13, 99, 148, 94, 35, 212, 172, 23, 101, 159, 108, 45, 100, 159, 40, 139]
2766A39j8J47j44Rm7o2O6M9%JL1K9m3O1o2q0K82j7j54RO0j33m5JJ57l1j33R1r5k7Q6n7Q4o6
2367H8nO2j5r9J7R8K2m7k2KN9N9l8l0n0J59n3pm1M0o1q0J37j9J05J03k32K5M9n6O7j72M6K
1968A13R8j49J77j69J68p7j9o1O0j07O4nQ2j06R1j18R4J28j11o9J75n8m4Q1q1M0P6r7j64M2
1616E4O0r5P0l9mL3R8K5n7m0o4J32mJ9J1j24JJ3O5M7L4p2q0j1O3K3k0j04J50p1K9Lo8j3Q7
1205A51Q2r8k4J5J39k14K86k84J14l6j4J9k3J62j37K0j01M6O6J38j92Q6j00J21j51M5J40q7
876A69j53O8R1o5n2mO7M4RrLq1R9n7K7q%kl3j0K3J04n7N2Qk0j5j72J51p5O1o1R7q5L8k3o4
442F5JP4pJ9N2m8o6K6J2k0n2jJ04ql5J21j41J38m4N7q3o1n2J52L5K1j05k0p5J88j69J19r9
55I8k6P3M7m2m3J05m6o4P6J21Oj90j0P5P1p8m0M0Mp8j
$$ y = [139, 121, 268, 124, 133, 86, 24, 90, 139, 139, 140, 171, 200, 157, 218, 156, 76, 358, 341, 187, 196, 256, 123, 78, 79, 236, 205, 72, 163, 68, 41, 127, 70, 154, 88, 83, 145, 130, 31, 48, 146, 168, 121, 99, 101, 160, 219, 181, 151, 101, 260, 207, 200, 159, 199, 138, 58, 195, 176, 281, 384, 152, 177, 226, 170, 237, 65, 111, 113, 211, 62, 239, 70, 238, 161, 142, 81, 141, 34, 98, 93, 175, 69, 160, 42, 136, 264, 153, 84, 259, 201, 157, 238, 157, 197, 273, 176, 12, 54, 114, 19, 89, 50, 46, 79, 177, 202, 145, 105, 41, 173, 169, 188, 199, 75, 76, 89, 154, 201, 235, 163, 83, 72, 135, 158, 138, 34, 184, 113, 142, 145, 77, 64, 151, 233, 135, 111, 126, 265, 51, 337, 53, 167, 131, 117, 136, 113, 275, 138, 158, 57, 103, 169, 307, 115, 201, 101, 222, 71, 116, 256, 169, 16, 84, 175, 110, 58, 54, 121, 165, 174, 165, 168, 87, 186, 129, 156, 148, 148, 146, 113, 103, 126, 230, 173, 225, 233, 213, 198, 26, 177, 102, 163, 102, 199, 114, 152, 129, 65, 66, 140, 133, 152, 204, 156, 90, 116, 128, 108, 56, 55, 159, 151, 116, 237, 96, 234, 190, 247, 164, 103, 51, 203, 238, 259, 154, 134, 59, 247, 78, 197, 98, 72, 145, 192, 150, 107, 212, 166, 102, 178, 299, 305, 115, 105, 180, 251, 173, 133, 173, 177, 99, 98]
-192I8
##PAGE=	F1=-6330.65
##FIRST=	25164.767445380970457,	5806.2096540000038658,	0
##DATA TABLE=	(F2++(Y..Y)), PROFILE
5806E2N8J21O2j41o0J02M3j54J47rj50k4K8R9j04J95j8j72Q8o7NL1j1J12N4j50o2N3M2n0J44
5442B64j48O4j7j3M2l2qj4p2J42r3R5o0p5J1J23j46k0K5j7qK2J16m2K5p4jJ08P4J3Q2k67K0
5055A19k7K3lm9J40r5n7%qQ4J8O2q8m2KL2l0km6L6qP1K2M5j67J54l4R9N6j49k8O5j6j44J39
4644A74R7P6k01Lj5n8P0L7n0m3J9M6j0m8Q1L0Mk5Q6o0j73k2N4O1J45j87N7r6onQ7q4J07K8
4245A79r7m1oP0l7M3j7k0m2J28J32j06j42K08O3j51P6j76K47j68J8k2N6q2l0J51k2l9j52Q9
3893A10q0K6j7rP1J36j8j87MJ3J08q2J67m7l4j22j3J47j24Q0j11O9Q2P3l3j45J32N5j10n7
3541H4L5k9L9Q5j44N0K25k33J6K3M5j03Q3n9n3J12P1j15p3qJ53pK9Q2j29l3r6O8l3o1R0N5
3165A69L4j50L03j14q3J77p7j43p5N0L3K7K0k8r3Q9J1%j27J15O5j28o2J60l6j35J56J0n8q8
$$ y = [52, 110, 231, 293, 152, 92, 194, 237, 83, 230, 221, 71, 47, 75, 174, 70, 265, 247, 75, 163, 96, 101, 132, 121, 233, 287, 137, 75, 128, 170, 120, 264, 116, 180, 163, 150, 192, 160, 152, 138, 66, 208, 115, 210, 150, 75, 86, 209, 63, 43, 68, 51, 43, 65, 181, 139, 164, 90, 89, 197, 271, 284, 366, 99, 119, 92, 115, 112, 63, 203, 108, 51, 51, 43, 127, 145, 207, 119, 77, 79, 111, 81, 79, 33, 69, 61, 132, 154, 199, 32, 186, 152, 251, 307, 158, 130, 195, 179, 35, 174, 271, 347, 146, 149, 134, 76, 146, 183, 133, 90, 109, 155, 145, 97, 178, 208, 212, 187, 273, 213, 40, 18, 72, 133, 278, 91, 148, 52, 46, 41, 128, 44, 151, 179, 82, 41, 35, 105, 68, 111, 94, 74, 32, 160, 292, 186, 44, 252, 315, 164, 240, 64, 311, 143, 161, 139, 195, 113, 83, 234, 212, 173, 21, 110, 30, 56, 39, 30, 101, 237, 219, 32, 36, 49, 157, 75, 242, 195, 161, 39, 26, 173, 49, 129, 18, 87, 169, 242, 209, 64, 196, 251, 141, 84, 119, 90, 129, 214, 70, 120, 345, 112, 128, 151, 196, 93, 176, 117, 64, 176, 247, 132, 59, 51, 204, 197, 226, 308, 179, 146, 50, 118, 85, 24, 114, 169, 203, 53, 356, 242, 159, 336, 259, 116, 41, 91, 124, 151, 171, 143, 50, 139, 150, 150, 23, 138, 203, 75, 13, 173, 137, 2, 158, 168, 110, 22]
2813B2P1M6q4R1n0J56j34J8n8o4K1K8J38m9nK3q2J05k1j19K78Rj50K4O0j00k5q8K03o6j01
2449I7K3q2J1P3n1N2m1k1M8k3k0nN3K2o3J0O7L4K2j5k9n2J28MNo9J6p4J2P3j4L9R8j87M8R6
2027B85n9Oj94P6n7J19j39J53j56J93o7n1j1K6q5L2k7J28j31Q8j24J26J67j45p4J80q3LP6
1686B55p3LO1r3o7m4K6k7N8mk9J4J11L5q1n1n8J34j6M4n0o6K1j7M5OM8j9p3l3J02n7l6RR9
1276A77q5OM5m1K0Q7M4j44Nk8J66k02K90k42P2j6k4N5j42J94m2k1j21RJ14R3j32K6p7J39j64
912F1N3J09j05p5L0J10r2k8m0N8J16M1j09nn2J41p3j7l6j2Q9l8o4J05O9o5O9n6O2m8j73J30
536A55q6R3o9R8q2K1J4o3rK0N2J02J4q6r7J9L8n0kL1L6JrJ08j56J41j13J02p1%n2J14K5L2
137B71j45K4p6K16j49L4q4k8J04N5j06j5J23n8o8M6J72pj86k1L6L7K6l1L8r0Jk2
$$ y = [22, 93, 139, 55, 146, 96, 252, 118, 136, 78, 14, 35, 63, 201, 152, 147, 170, 88, 193, 172, 53, 331, 340, 190, 214, 274, 174, 149, 61, 264, 198, 97, 120, 38, 49, 122, 71, 123, 82, 61, 109, 86, 66, 61, 114, 136, 73, 83, 150, 184, 206, 191, 162, 110, 238, 242, 247, 178, 194, 120, 132, 205, 191, 230, 328, 141, 189, 285, 226, 232, 38, 114, 57, 176, 37, 190, 34, 227, 160, 109, 98, 124, 39, 71, 44, 172, 41, 129, 5, 131, 298, 153, 79, 259, 176, 179, 255, 182, 185, 246, 153, 86, 42, 68, 41, 99, 95, 66, 80, 191, 226, 145, 94, 36, 170, 154, 198, 148, 82, 103, 86, 131, 137, 185, 166, 93, 60, 162, 105, 69, 78, 177, 92, 98, 143, 102, 122, 209, 253, 109, 114, 86, 252, 50, 340, 98, 170, 154, 130, 185, 43, 237, 195, 174, 53, 62, 176, 269, 137, 163, 86, 225, 61, 114, 223, 118, 43, 73, 183, 91, 63, 23, 81, 197, 238, 129, 124, 72, 213, 140, 123, 87, 75, 164, 126, 62, 167, 236, 171, 240, 184, 246, 198, 25, 155, 69, 162, 93, 191, 109, 130, 144, 81, 72, 92, 144, 246, 260, 174, 77, 96, 134, 84, 82, 113, 149, 150, 141, 249, 93, 234, 121, 223, 152, 152, 100, 214, 239, 271, 126, 150, 74, 290, 141, 175, 91, 63, 167, 222, 116, 101, 224, 166, 98, 144, 316, 309, 123, 102, 138, 175, 201, 170, 208, 118, 119, 97]
-192I7
##PAGE=	F1=-6432.91
##FIRST=	25164.767445380970457,	5806.2096540000038658,	0
##DATA TABLE=	(F2++(Y..Y)), PROFILE
5806C8O1R6O7r4p9J27K7j79K04n8q2q3K7O2j9J64o5r7P0k0j01N7j7J11M0j60n1O1M8k3J28
5442B60j51O8l7PL4M3j04jm5J56j11J06r3n7j7J10j51L7K0p0M9j7J48K4n6o6j5J52O5mO7k29
5067A22O1q0K2lq5J87r1q6MJ8N9J6J01j40n2L8Q5q7J9j6m4qM8J5Q6j16J01n1J01Q7j66k8N0
4679A67J0j07J10M3P0j70J2K1o5R4L5p8j5J6J2m8L5Q6Jj3j7P8j14o1m6K9J1J55k02J20j28
4316D1O5J0K9j20R4M7q2m4rK3M6J9%j2k1Q0O8j25L5J23J1j10Q1j19J70j61lj3L9n8jJ30p0
3928A63J5j12Jk3QK7o5P3J28Kj47l3M6R1j11J61k9jj21k1R7q7O1p4Q6O0K9l6j49J60R2j43
3553A48j39R2k5N3J02j54J7K38j55m1J4K6j15P7%o4N2J05q5q7L6P3J2M8M9j41l4o6J00k3n2
3189F1rJ36P9j60K23o0j02J97o3j65q8M2N0Rk0l9m8Q7k9lm2J06P8j87k3R7k2q3J76m1n3m5
$$ y = [38, 99, 195, 262, 168, 89, 216, 243, 64, 268, 210, 128, 45, 72, 134, 115, 279, 214, 117, 187, 167, 66, 123, 106, 217, 257, 97, 46, 107, 155, 132, 260, 109, 177, 140, 147, 181, 224, 120, 119, 74, 230, 119, 225, 132, 75, 58, 168, 17, 54, 74, 4, 53, 36, 184, 208, 152, 86, 71, 223, 288, 284, 351, 122, 183, 103, 125, 122, 37, 224, 133, 47, 51, 69, 128, 144, 245, 105, 53, 91, 176, 89, 108, 92, 48, 40, 88, 103, 189, 73, 174, 123, 224, 311, 145, 117, 167, 177, 70, 180, 223, 293, 123, 135, 156, 91, 185, 220, 142, 127, 143, 155, 107, 142, 228, 229, 216, 199, 277, 163, 102, 56, 85, 96, 251, 49, 169, 41, 106, 116, 145, 25, 119, 166, 84, 40, 31, 54, 100, 119, 119, 107, 86, 166, 234, 109, 144, 267, 278, 168, 249, 130, 300, 139, 136, 123, 162, 104, 103, 233, 163, 178, 66, 67, 44, 52, 79, 14, 87, 215, 217, 70, 37, 83, 174, 63, 224, 195, 194, 73, 52, 149, 62, 123, 49, 135, 195, 224, 188, 39, 199, 291, 148, 9, 101, 76, 129, 231, 77, 94, 332, 177, 136, 150, 176, 61, 138, 138, 74, 126, 231, 146, 59, 95, 168, 180, 228, 277, 136, 102, 36, 136, 113, 61, 52, 188, 267, 107, 330, 270, 168, 365, 302, 137, 49, 91, 141, 150, 130, 91, 43, 130, 101, 98, 56, 162, 240, 53, 30, 127, 105, 22, 198, 157, 104, 59]
2813E9J7K5m5P5p9J69j13L5o2o2L1M3J41p3n0L6j21J37jj16K37M7j40L7N0o3%j66K28p7r0
2449A09l9j1N5J5o3J5nk5K7j1L7k4J4J1p6O5R0JjPk5m3J01L3Mq3qo2Q3J1nl0Q0j15O1J29p4
2015B48l9j69P8r5J12r0J06j20J72l5q3L5j8rm9k5J32j18O1n4J19J45j70o5J78j11N7N6o0
1675A89l2N2q2K2m2p0K0N3L0n3LJ07O4q4r5l7J19l9P1j00LJ9k5jk5O4K2n6l9J06j17j5Q6N9
1276A77o1m4N5k3N7Q2K7j69K9p3J59j48K37j72K6N5n2M7j43J37M1n7j46rJ56M0o1m1n3J38
923B11j45O7O5j15Ok3J25j08Op1K2J81Q4j80m5pJ50p8n6n9J9J40k0j19J38L0p0Q6j02J22m6
560B08j84J07m9O9m9P4o6kN8k9n1o4J38J65j7j22j13J5N8p2L4N5rk0J8J01j47J42j80J21m3
196A46M4m6N5L4M5j87O5q5K39j27k7q4qQ4P7j28NJ15n3o2OJ98l1j51l4J2J2J24l9M6j82P4
$$ y = [59, 76, 101, 56, 131, 52, 221, 108, 143, 81, 19, 50, 93, 234, 161, 111, 147, 26, 163, 162, 46, 283, 330, 190, 227, 277, 214, 214, 48, 276, 199, 109, 70, 59, 114, 129, 66, 81, 76, 51, 78, 67, 104, 80, 94, 105, 29, 94, 184, 185, 184, 191, 166, 123, 224, 257, 261, 178, 170, 108, 191, 202, 197, 167, 247, 132, 193, 322, 248, 209, 40, 118, 23, 135, 45, 151, 31, 203, 168, 85, 120, 102, 93, 44, 19, 151, 33, 94, 40, 159, 304, 134, 69, 247, 136, 193, 249, 189, 157, 209, 127, 149, 107, 37, 57, 110, 140, 87, 90, 197, 261, 177, 82, 45, 164, 125, 196, 96, 99, 118, 93, 92, 67, 131, 153, 97, 58, 164, 47, 32, 118, 177, 116, 72, 127, 104, 161, 243, 270, 101, 130, 57, 216, 68, 305, 133, 159, 214, 162, 209, 66, 203, 244, 187, 41, 32, 188, 228, 167, 126, 73, 211, 66, 133, 198, 83, 89, 66, 191, 83, 89, 18, 40, 221, 305, 125, 80, 73, 223, 145, 89, 30, 49, 189, 169, 50, 188, 218, 148, 234, 132, 254, 208, 24, 131, 82, 151, 102, 176, 110, 108, 166, 137, 86, 22, 160, 325, 308, 186, 73, 88, 146, 74, 108, 163, 154, 134, 152, 253, 106, 248, 68, 189, 146, 190, 144, 199, 233, 278, 91, 156, 71, 310, 183, 156, 72, 64, 148, 225, 97, 102, 217, 164, 102, 108, 306, 275, 124, 90, 102, 114, 238, 199, 245, 63, 137]
-180A37n2
$$ y = [137, 85]
-192H5
##PAGE=	F1=-6535.17
##FIRST=	25164.767445380970457,	5806.2096540000038658,	0
##DATA TABLE=	(F2++(Y..Y)), PROFILE
5806C2N6N3N5m1n8J38Nj76K25r8k1j08J4K9L7J19r6j2N8j9j61P1j8J08J9j67k4N6M7J9R1j02
5431A31N1p6K1M6J05j69rj3J37j06Q6j08j2n3J09j18M7L0n2K6o2J58J01j25n1l1J67M7j5N6
5078C18j80P6j06J4Mj24K22r0j03L3L9J8L5J12j36l7M1Q0j49M5M3r3j0M3l6J21p8O2r5J05
4726A74J33j85j4M1K2n6P1l5O5j01RL7n8Q2L8p1Opro9J17R5l4k7mO4j42Oq4L4o0J60j89J62
4327A71j37J19L5k0p2J0L4o6n0J2J2Q0MJ5pj8L0K2j37J97K9n1p6J12o3R3j51k8jK5j6mJ02
3940B05j01P0j7j27N3m1O5r2N6R4L1q3j1kQ4j32J27j2L6j09OJ0l9O1n0J10K8j1o2j27J67J19
3564C06j36j24L6k1Q6R9j49l6K34o0r6K5Pj39R3K3n5m2J34n5n4O8l7K4J04J3j47l7m1J31k
3200A52n1r5J87J17j38J17pr8K03o4j89n2J9N8on2n7OM7m0j5O7O7P6j96j2M9J0n2J66q0k9
$$ y = [32, 88, 141, 196, 155, 97, 235, 240, 64, 289, 191, 170, 62, 76, 105, 142, 261, 165, 153, 211, 192, 31, 102, 84, 192, 211, 44, 20, 76, 123, 142, 233, 131, 182, 106, 127, 173, 278, 109, 100, 87, 224, 118, 204, 96, 84, 31, 140, 22, 69, 99, 47, 73, 11, 169, 270, 145, 94, 63, 230, 277, 262, 318, 138, 214, 108, 122, 126, 2, 224, 134, 31, 64, 103, 121, 156, 268, 132, 95, 136, 216, 67, 112, 155, 62, 52, 95, 59, 180, 102, 164, 69, 174, 307, 122, 108, 149, 171, 115, 186, 151, 216, 115, 124, 161, 103, 185, 223, 152, 158, 151, 142, 73, 190, 285, 251, 224, 220, 284, 142, 148, 64, 98, 38, 198, 9, 171, 34, 153, 188, 168, 96, 106, 140, 74, 24, 36, 48, 128, 132, 147, 140, 122, 152, 174, 37, 234, 263, 212, 136, 248, 185, 278, 127, 99, 98, 123, 107, 103, 205, 104, 174, 157, 30, 83, 42, 107, 15, 71, 165, 196, 113, 102, 100, 184, 52, 179, 167, 203, 94, 100, 110, 71, 132, 82, 192, 220, 209, 147, 20, 187, 306, 170, 46, 82, 61, 147, 246, 97, 61, 295, 235, 139, 164, 171, 32, 125, 148, 93, 51, 185, 130, 76, 144, 107, 131, 235, 248, 101, 64, 23, 154, 152, 101, 6, 193, 310, 172, 289, 282, 184, 387, 323, 134, 82, 101, 159, 153, 101, 44, 50, 97, 57, 42, 109, 176, 252, 56, 44, 93, 103, 51, 217, 137, 108]
2825A08k6K3l5k4M6o1J62r3N1n9p0Q0M5R2p3q9P6j36J17qp6J74Q4j21N1L6l9K7k13K16p4q7
2449A04n8P1Q3n9p2k8L4j9jM7L8m5j0no6J16O9l3%J5k0k3P4L6j0o5m7j7J18m0Kq6N2l0O4J38
2027C27r0n6j16M2q5Q4m4Q2q7J20Nq2M3p6N7o6L1K4m9%kJ36Q7j82n1J73j35J04K8l9m8O3r1
1639A07P9k5j24L1N1O3p3j4R1R1o9j32l0J19p5R1j31O2Nk0m9m0P3M6l6l5Q4r2N0M3L1l5o0
1252G7K6k4R9O3L2j75M1o3J01p3J38r0J7J22j03K1p8N2R1q9j58M6J31j4Mr5l6J19j05Q5K4
888A86j06N0o5J36j12L6o4%J66J32k01j21M4J44p9q6l5P2J09Kr3P3j3o8J04j25J56j8j79N9
536A04M3qj7K6m1k2Q7J3p2n5J20J97l9j50j08MP6p8N0O8m0n4M1J02j24J41j66N3j0O9l4j2
160A64N9O2k26J03j01K47j03o5q7MM0Q9r8J8R1l6n7k9J94n6r4l3j5L0J63n6N9k41J12o5
$$ y = [108, 82, 105, 70, 46, 92, 31, 193, 100, 151, 92, 22, 102, 147, 239, 166, 77, 153, 17, 134, 126, 50, 224, 308, 187, 238, 274, 235, 262, 49, 265, 191, 104, 46, 117, 200, 141, 69, 41, 75, 56, 55, 102, 140, 95, 85, 80, 14, 130, 199, 166, 166, 181, 161, 138, 212, 248, 238, 173, 126, 109, 227, 187, 189, 103, 155, 125, 189, 327, 237, 181, 65, 107, 22, 106, 62, 144, 57, 177, 182, 100, 143, 67, 124, 58, 89, 113, 64, 64, 62, 198, 285, 103, 52, 225, 90, 194, 222, 183, 135, 198, 107, 186, 161, 37, 68, 119, 182, 109, 95, 186, 277, 208, 76, 46, 165, 90, 181, 50, 112, 117, 97, 48, 8, 81, 127, 91, 56, 140, 48, 98, 141, 172, 137, 77, 103, 79, 178, 241, 273, 98, 139, 76, 177, 104, 242, 152, 169, 291, 188, 209, 131, 183, 274, 185, 27, 73, 204, 190, 194, 99, 63, 182, 77, 162, 186, 80, 130, 65, 201, 89, 125, 61, 61, 227, 359, 158, 37, 81, 225, 146, 60, 25, 97, 206, 208, 115, 188, 175, 107, 211, 86, 242, 224, 45, 104, 147, 139, 122, 148, 107, 85, 172, 185, 113, 58, 178, 375, 336, 186, 78, 82, 158, 80, 130, 198, 158, 104, 145, 247, 123, 264, 98, 151, 141, 210, 176, 164, 223, 285, 59, 162, 61, 308, 205, 140, 53, 57, 97, 186, 88, 106, 197, 161, 104, 75, 269, 213, 119, 86, 71, 101, 264, 208, 267, 26, 138, 73]
-192G3
##PAGE=	F1=-6637.42
##FIRST=	25164.767445380970457,	5806.2096540000038658,	0
##DATA TABLE=	(F2++(Y..Y)), PROFILE
5806C6M7LK3J4j6J44k2j49K09j26L3j11PqO2O8r8M8N3n5j01K0k7J10oj50K0K1K7P0M8k8K2
5419A88j20K4P8J41j94l4J4J00q7N4j12L2o8J05p8L7N3m1Kl6R0J66j59n5m0J57K3k0M8j07
5067A61M7j05jJ7p6J60n8j32O9N6k8O1J06q9m5M1M2k02O5J20r1k8M1p6J13n1L4j37J10J76
4715C00k08J8L7K6j1J9j11Q2j5j7J8k1L4M5l6J5m6j2o6J73J08n8l3OM1j29J7j32P2r3J09p7
4339E5J04j18J32O9m8l2m7j3m6k5L1O6J4nL0%k8j3jq2K57o0j01o0J57k0L5j36m8QK5L0l2N9
3940A57j08J20P4j42J9q7Q9j12M5M9N6oMn7Q7j36P9nO4r4M9m1l7J08p1J37jm1q6l4Q2J33r3
3553B01j25%j5J10Q7j31r5K18K4j44M9%j68J32Rl5q2Q2k9J4Q1j27jJ89k0j45k9l7J59K1p1
3189A22p2J33J52j15K4L6q4J91p2k12NmO3j3p0k5K6l5L2m1J22K5N1j67k8L0N7m2J23o6j3l0
$$ y = [36, 83, 86, 109, 123, 107, 251, 229, 80, 289, 163, 196, 85, 92, 84, 146, 214, 116, 164, 217, 162, 61, 81, 54, 164, 158, 8, 28, 49, 76, 146, 194, 166, 188, 68, 92, 170, 311, 117, 83, 97, 197, 110, 164, 52, 84, 16, 121, 43, 80, 133, 92, 94, 58, 148, 314, 155, 100, 60, 217, 240, 220, 268, 161, 208, 103, 102, 119, 43, 203, 145, 13, 82, 138, 110, 171, 277, 188, 143, 184, 226, 24, 89, 209, 118, 90, 131, 55, 168, 117, 151, 14, 124, 300, 92, 110, 147, 173, 162, 181, 70, 152, 137, 120, 138, 117, 151, 196, 160, 175, 129, 117, 51, 224, 332, 274, 241, 247, 288, 159, 176, 44, 116, 23, 132, 55, 159, 41, 173, 242, 194, 162, 115, 102, 56, 31, 62, 128, 142, 137, 167, 167, 139, 126, 125, 43, 300, 240, 139, 79, 236, 216, 251, 115, 67, 75, 100, 130, 98, 157, 49, 169, 243, 101, 120, 33, 122, 10, 55, 104, 160, 154, 158, 101, 188, 52, 131, 126, 190, 96, 145, 104, 67, 175, 104, 241, 240, 199, 113, 79, 161, 294, 201, 76, 76, 61, 171, 258, 127, 32, 250, 274, 130, 179, 179, 11, 143, 152, 117, 35, 117, 88, 102, 183, 56, 55, 244, 224, 79, 50, 13, 172, 193, 122, 50, 183, 335, 220, 244, 280, 196, 387, 315, 103, 108, 104, 167, 154, 84, 59, 85, 50, 82, 41, 163, 188, 239, 72, 44, 74, 131, 89, 212, 146, 133, 103]
$$ [...]
-192E5
##END NTUPLES=	nD NMR SPECTRUM
##END=	
##END=	
