##TITLE=	Nov18-2021.52.ser
TM-VI-169 acetone-d6 Mg+Bz-pyr. hsqc

##JCAMP-DX=	6.0	$$ MestReNova 14.3.0-30573
##DATA TYPE=	LINK
##BLOCK_ID=	1
##BLOCKS=	2    
##ORIGIN=	Mestrelab Research S.L.
##OWNER=	hrzepa
##$MNOVA/LINK_BLOCK_TYPE=	ITEM	$$ NMR Spectrum
##$MNOVA/ITEM/POLYGON=	(XY..XY)
5321,5835
8722,5835
8722,8208
5321,8208
5321,5835
##$MNOVA/ITEM/Z=	0
##$MNOVA/ITEM/ANGLE=	0
##TITLE=	Nov18-2021.52.ser
##JCAMP-DX=	6.0	$$ MestReNova 14.3.0-30573
##BLOCK_ID=	2
##DATA TYPE=	MNOVA NMR VIEW DATA
##DATA CLASS=	MNOVA VIEW DATA
##$MNOVA/2D/THRESHOLD=	3.3496253490447998047
##$MNOVA/ITEM/ZOOM/X=	-0.57569381887933257502,	10.597560000003785063
##$MNOVA/ITEM/ZOOM/Y=	-9.5463849045685140737,	230.0176000018207958
##END=	
##TITLE=	Nov18-2021.52.ser
##JCAMP-DX=	6.0	$$ MestReNova 14.3.0-30573
##BLOCK_ID=	3
##DATA TYPE=	nD NMR SPECTRUM
##DATA CLASS=	NTUPLES
##NUMDIM=	2
##ORIGIN=	Bruker BioSpin GmbH
##OWNER=	nmr
##.OBSERVE FREQUENCY=	400.20200099999999566
##.OBSERVE NUCLEUS=	^1H
##.SOLVENT NAME=	Acetone
##.PULSE SEQUENCE=	hsqcetgpsi2.ph
##LONGDATE=	2021/11/18 14:08:00.000
##.ACQUISITIONMODE=	SIMULTANEOUS (DQD)
##$ORIGINAL FORMAT=	Bruker XWIN-NMR
##$MNOVA/SCALES_VERSION=	9
##$PARAMETER FILE=	(acqu2s, ASCII, /private/var/folders/f6/rjf_tdyn2v98c5c0wvkgn4s80000gn/T/nWRdu5YXSEW1ECQlVLFQsg/52/acqu2s, 0)
$$ ##TITLE= Parameter file, TOPSPIN		Version 3.2
$$ ##JCAMPDX= 5.0
$$ ##DATATYPE= Parameter Values
$$ ##NPOINTS= 241	$$ modification sequence number
$$ ##ORIGIN= Bruker BioSpin GmbH
$$ ##OWNER= nmr
$$ $$ 2021-11-18 14:17:32.997 +0000  nmr@CZC2439F63
$$ $$ /opt/topspin/data/agmb/nmr/Nov18-2021/52/acqu2s
$$ $$ process /opt/topspin3.2/prog/mod/go
$$ ##$ACQT0= 0
$$ ##$BF1= 100.63037
$$ ##$FnMODE= 6
$$ ##$NUC1= <13C>
$$ ##$NusJSP= 0
$$ ##$NusT2= 1
$$ ##$NusTD= 240
$$ ##$O1= 11069.4607123918
$$ ##$SFO1= 100.641439460712
$$ ##$SW= 240.006397974962
$$ ##$SW_h= 24154.5893719807
$$ ##$TD= 240
$$ ##END=
$$ 
##$PARAMETER FILE=	(acqus, ASCII, /private/var/folders/f6/rjf_tdyn2v98c5c0wvkgn4s80000gn/T/nWRdu5YXSEW1ECQlVLFQsg/52/acqus, 0)
$$ ##TITLE= Parameter file, TOPSPIN		Version 3.2
$$ ##JCAMPDX= 5.0
$$ ##DATATYPE= Parameter Values
$$ ##NPOINTS= 12	$$ modification sequence number
$$ ##ORIGIN= Bruker BioSpin GmbH
$$ ##OWNER= nmr
$$ $$ 2021-11-18 14:17:36.276 +0000  nmr@CZC2439F63
$$ $$ /opt/topspin/data/agmb/nmr/Nov18-2021/52/acqus
$$ $$ process /opt/topspin3.2/prog/mod/shimcntl
$$ ##$ACQT0= 1000000
$$ ##$AMP= (0..31)
$$ 100 100 100 100 100 100 100 100 100 100 100 100 100 100 100 100 100 100
$$ 100 100 100 100 100 100 100 100 100 100 100 100 100 100
$$ ##$AMPCOIL= (0..19)
$$ 0 0 0 0 0 0 0 0 0 0 0 0 0 0 0 0 0 0 0 0
$$ ##$ANAVPT= -1
$$ ##$AQSEQ= 0
$$ ##$AQ_mod= 3
$$ ##$AUNM= <au_zg>
$$ ##$AUTOPOS= <47 >
$$ ##$BF1= 400.2
$$ ##$BF2= 100.63037
$$ ##$BF3= 400.2
$$ ##$BF4= 400.2
$$ ##$BF5= 400.2
$$ ##$BF6= 400.2
$$ ##$BF7= 400.2
$$ ##$BF8= 400.2
$$ ##$BYTORDA= 0
$$ ##$CAGPARS= (0..11)
$$ 0 0 0 0 0 0 0 0 0 0 0 0
$$ ##$CFDGTYP= 0
$$ ##$CFRGTYP= 9
$$ ##$CHEMSTR= <none>
$$ ##$CNST= (0..63)
$$ [...]
$$ 0 0 0 0
$$ ##$ShimPowMaxUC= (0..63)
$$ 130000 130000 130000 130000 130000 130000 130000 130000 130000 130000 130000
$$ 130000 130000 130000 130000 130000 130000 130000 130000 130000 0 0 0 0
$$ 0 0 0 0 0 0 0 0 0 0 0 0 0 0 0 0 0 0 0 0 0 0 0 0 0 0 0 0 0 0 0 0 0 0 0 0
$$ 0 0 0 0
$$ ##$ShimPowMaxUG= (0..63)
$$ 524287 524287 524287 524287 524287 524287 524287 524287 524287 524287 524287
$$ 524287 524287 524287 524287 524287 524287 524287 524287 524287 0 0 0 0
$$ 0 0 0 0 0 0 0 0 0 0 0 0 0 0 0 0 0 0 0 0 0 0 0 0 0 0 0 0 0 0 0 0 0 0 0 0
$$ 0 0 0 0
$$ ##$ShimPowRcbType= 3
$$ ##$ShimPowRes= (0..63)
$$ 1e-20 1e-20 1e-20 1e-20 1e-20 1e-20 1e-20 1e-20 1e-20 1e-20 1e-20 1e-20
$$ 1e-20 1e-20 1e-20 1e-20 1e-20 1e-20 1e-20 1e-20 0 0 0 0 0 0 0 0 0 0 0 0
$$ 0 0 0 0 0 0 0 0 0 0 0 0 0 0 0 0 0 0 0 0 0 0 0 0 0 0 0 0 0 0 0 0
$$ ##$ShimPowRng0= (0..63)
$$ 1 1 1 1 1 1 1 1 1 1 1 1 1 1 1 1 1 1 1 1 0 0 0 0 0 0 0 0 0 0 0 0 0 0 0 0
$$ 0 0 0 0 0 0 0 0 0 0 0 0 0 0 0 0 0 0 0 0 0 0 0 0 0 0 0 0
$$ ##$ShimPowRng1= (0..63)
$$ 1 1 1 1 1 1 1 1 1 1 1 1 1 1 1 1 1 1 1 1 0 0 0 0 0 0 0 0 0 0 0 0 0 0 0 0
$$ 0 0 0 0 0 0 0 0 0 0 0 0 0 0 0 0 0 0 0 0 0 0 0 0 0 0 0 0
$$ ##$ShimPowRng2= (0..63)
$$ 1 1 1 1 1 1 1 1 1 1 1 1 1 1 1 1 1 1 1 1 0 0 0 0 0 0 0 0 0 0 0 0 0 0 0 0
$$ 0 0 0 0 0 0 0 0 0 0 0 0 0 0 0 0 0 0 0 0 0 0 0 0 0 0 0 0
$$ ##$ShimPowRng3= (0..63)
$$ 1 1 1 1 1 1 1 1 1 1 1 1 1 1 1 1 1 1 1 1 0 0 0 0 0 0 0 0 0 0 0 0 0 0 0 0
$$ 0 0 0 0 0 0 0 0 0 0 0 0 0 0 0 0 0 0 0 0 0 0 0 0 0 0 0 0
$$ ##$ShimSysFunc= (0..63)
$$ 1 2 3 4 5 7 9 11 15 16 8 10 12 14 6 17 13 18 19 20 0 0 0 0 0 0 0 0 0 0
$$ 0 0 0 0 0 0 0 0 0 0 0 0 0 0 0 0 0 0 0 0 0 0 0 0 0 0 0 0 0 0 0 0 0 0
$$ ##$ShimSysMatrix= 0
$$ ##$ShimSysType= 1
$$ ##$TFXNUM= 0
$$ ##$TRIPLO2= 0
$$ ##$VTU= 2
$$ ##$VTUETH= <149.236.99.20>
$$ ##$VTUTY= <no>
$$ ##$WBREFAM= (0..15)
$$ 135.5 97.7 100 100 100 100 100 100 100 100 100 100 100 100 100 100
$$ ##$WBREFLM= (0..15)
$$ 0 0 0 0 0 0 0 0 0 0 0 0 0 0 0 0
$$ ##$WBREFPH= (0..15)
$$ 72.26 -67.22 0 0 0 0 0 0 0 0 0 0 0 0 0 0
$$ ##$WBSGU= (0..15)
$$ 0 0 0 0 0 0 0 0 0 0 0 0 0 0 0 0
$$ ##$XFAC= 2
$$ ##END=
$$ 
##$DECIM=	4464
##$DSPFVS=	20
##.ACQUISITIONSCHEME=	ECHO-ANTIECHO
##NTUPLES=	nD NMR SPECTRUM
##VAR_NAME=	FREQUENCY1,	FREQUENCY2,	SPECTRUM
##SYMBOL=	F1,	F2,	Y
##.NUCLEUS=	13C,	1H
##.OBSERVE FREQUENCY=	100.64143946071199309,	400.20200099999999566
##VAR_TYPE=	INDEPENDENT,	INDEPENDENT,	DEPENDENT
##VAR_FORM=	AFFN,	AFFN,	ASDF
##VAR_DIM=	512,	512,	262144
##UNITS=	HZ,	HZ,	ARBITRARY UNITS
##FIRST=	23146.756194512010552,	4241.1435120000014649,	-0.040270820260047912598
##LAST=	-960.65624510154020754,	-230.39266631542668051,	-0.21607023477554321289
##MIN=	-960.65624510154020754,	-230.39266631542668051,	-1.7246241569519042969
##MAX=	23146.756194512010552,	4241.1435120000014649,	14.240336418151855469
##FACTOR=	1,	1,	0.0049644132943151668413
##PAGE=	F1=23146.8
##FIRST=	23146.756194512010552,	4241.1435120000014649,	-0.040270820260047912598
##DATA TABLE=	(F2++(Y..Y)), PROFILE
$$ [...]
##PAGE=	F1=5030.81
##FIRST=	23146.756194512010552,	4241.1435120000014649,	-0.088309079408645629883
##DATA TABLE=	(F2++(Y..Y)), PROFILE
4241c5lj2P4J9q0r8J57N3m1J6j20N5mR2m5m2K4K0N7k03K1K2Q7J12p2j23P9j59J08L5L7m3j04
3952a16R5n3K0O8r5R8JL6j02L5O9q4O2m2L5J3J5L7J7k82J03j02J52k6P1J9q0Q4j23J73j46
3681d8J81r0q1l8J02nq5N9l9RMJ30r4K3P8po8j00J60o5P4o7j49J58jj24K04m0J4j22l8N6K6
3392A7m6n0j8Q5l6J75nKj4j23Q8n2j16R1R0q8N1j0j05J15P3O3k12J33r2R4r1j19J17qj21J70
3112E8m2k8M2p6K06o1j98K72j31Q9mO81N51j020k49kO3j53L2j7o1J02j12Q0L4n1k2k5M0j1
2850a3lJ09j39nP0M5l1k5p4L4Q4K6p0J5k30J54O2O2q1l2K1l6j9J7K11j23l9k7jJ9l0N2j26
2561a23J46j6L0k2Mk4Mk8pQ3k2R2j47j5k6J17j27O5O5m1p4J16K3j01l1O6K4P1j5p8p3P5L4
2272D5j01J95k39O1K6J72j10q0l6J1N5J02j57P4o3o9J18l3m2J35j41R6MK7M3j20r4J68o1L1
$$ plain form
4241 -35 -38 -50 24 43 -37 -135 22 75 34 50 -70 -15 -19 73 28 -14 10 30 87 -116 -95 -73 14 126 54 -69 10 -149 -41 -6 31 -12 -116
3952 -116 -21 -74 -54 14 -81 17 18 54 -48 -13 56 -28 34 -8 27 40 55 92 109 -173 -70 -172 -20 -46 25 44 -36 48 -75 98 -48
3681 -48 133 43 -38 -76 26 21 -64 -5 -44 -35 -31 99 5 28 106 99 31 -69 91 26 100 33 -116 42 41 -83 121 81 95 -27 -65 -9 17
3392 17 -29 -79 -97 -12 -48 127 122 124 110 -13 75 23 -93 -2 88 0 51 41 -64 51 124 187 -25 108 16 110 19 -100 17 9 -112 58
3112 58 16 -12 30 -46 160 99 -99 173 42 131 127 808 1359 339 90 88 151 -2 30 13 -48 54 -58 22 56 5 -17 -42 -2 -13
2850 -13 -16 93 -46 -51 19 64 33 8 -66 -32 52 78 8 23 -207 -53 9 71 -10 -42 -21 -57 -76 -59 152 29 -10 -37 -38 -19 -49 3 -123
2561 -123 23 7 37 15 19 -5 -1 -29 -36 47 25 117 -30 -45 -71 46 -81 -16 49 8 -66 50 73 -28 -59 7 31 102 87 9 -64 11 45
2272 45 -56 139 -100 -39 -13 159 49 -31 -67 -56 -1 101 -56 18 -45 -114 4 -29 -71 64 -77 19 23 50 93 -27 -121 47 -14 17
2010A7p7mR0L6K8n6k9J0p2Q1m5p5J01k03J38J13%j25J07j28P2L6j14L8J23j21P4M6j13K9K2
1738ak00J17J8N5L2pm1N6o6J04j72N5Q0n8No0m0R6m9N1L3K9J7o1r1O7J12mM5p9j8j1O5j74
1441i5J07j2M0q1k5k4J1O2J9n4J57n8n1mj3K2P5j4k5j8o8O2mj32R5pk9J95m1K6j78J08no8
1143b7K2L9p9oM6N5%n5r5J90nr2PK2n7R5M7j63N4q5K3M7l2L9N3r1k4P2O0l8p9J06J9j09J57
837A16Po2j31O3J32m9j18L7K6P2j91N1mQ0J2oq4N1q9l7k8K77j18k6j3j2l3p7J31M2m0l2O0
548Gj7n0NJ45q0j69K58K5O0j31j3j8o3J20n5PK4q9J6O7j5mn1l6P1J6P2m1l6K5l2k1k30K26
251gj56Q9%n3Q5M0N3k1qN0r5q3j0J83l6r7K14j75J3M8l3l0J50j41n3QM2m9l8J69j08J15n5
-38A1r1j26Q6J83L4L5j2j95P1Q1J5L9r8l2Q0mp2J3k5m6N0j6
$$ plain form
2010 17 -60 -64 26 62 90 34 5 15 -57 24 -21 -96 5 -198 -60 53 53 -72 35 -93 -21 15 -99 -61 62 -59 15 61 -52 -23 -1
1738 -1 -201 -84 -66 -11 21 14 -27 29 -37 67 -105 -50 30 -28 -23 -83 -123 -27 -76 -25 8 37 54 -7 -98 -31 81 77 122 43 25 14 79 -95
1441 -95 12 0 40 -41 -66 -90 -79 -17 2 -52 105 47 -4 -8 -21 1 76 62 37 19 -49 13 9 -123 -28 -35 -64 131 90 116 -62 46 41 -27
1143 -27 -5 34 -45 -51 -5 50 50 -5 -100 90 85 -7 0 22 -35 60 107 -56 -2 -87 -64 -17 -49 -10 43 -48 -72 0 60 22 -57 49 68 -41 116
837 116 123 61 -70 -7 125 76 -42 -5 21 93 -98 -47 -51 29 41 35 -49 2 -87 -124 -152 125 7 -19 -32 -44 -77 -154 -23 19 -21 -53 7
548 7 -10 -60 -55 90 10 -159 99 124 184 53 40 22 -41 79 24 31 55 -34 -18 49 34 30 -21 -57 14 30 102 61 25 50 18 -3 -233 -7
251 -7 -163 -74 -74 -127 -42 -2 51 30 22 72 -23 -106 -116 67 31 -66 148 -27 -14 34 1 -29 121 -20 -73 -65 -23 -72 -110 59 -49 66 11
-38 11 -80 -206 -120 63 97 132 120 -75 -4 77 92 131 33 1 81 77 5 18 -7 -53 -3 -19
-230a9
##PAGE=	F1=4936.46
##FIRST=	23146.756194512010552,	4241.1435120000014649,	0.041024163365364074707
##DATA TABLE=	(F2++(Y..Y)), PROFILE
4241e5K5oP0J2n4j17J23N1n0N9j13K5J9P7q1pN0lM8k03j6Q1R9O8l0j44Q7j42P3M6M1m6q7N5
3944d5l6M2O5j07J20j4R2j44K2P2j14J02m9N6k4LM5k7k44J03j19J96%J6N2o6J3m6J19q4J20
3672A19k2j31n1J17J6j32J15j15Q8nJ07j05L0R1n5n3m5J56p5L5l6j96K08k8r3K24n3n6p0o
3410b1O8m0n2m4J6O4l3J66j7K5j7j12P7kj64P2P1j8k5Nj06J55Q3kj47J59j30P0r2q5O8P0j50
3121h8J17no6M8p0K08l6k35K44n3QK9M72M29p94j43L1L1j06j2oo7J35j26R8L1m3k2r2M3P3
2850C3n5J18j58NP6M7q0j8k1M2j8J05n6Qk10J54K0Q2r3J1k6K7p5K2J82q4r5J4j2P3o3R3j15
2561f7Q8m7O6m2N0n8N7n6o4J40n7N9p5q1M1R6p2K7N7j9r7N7L2l2q9L2L1J22Oj38k1O2J7r1
2264f6K01k03M2j4J78j58l4NJ2j4J20q1K3o9k1R8n5n4J33j10J15n1L4Np3r7J68m4Pp3k4J53
$$ plain form
4241 -55 -30 -36 34 46 -8 -125 -2 49 -1 58 -55 -30 -11 66 -15 -22 28 25 73 -130 -146 -65 34 102 72 -72 15 -127 -54 -8 33 -13 -100 -45
3944 -45 -81 -39 26 -81 39 25 117 -27 -5 67 -47 55 6 62 38 41 86 59 -185 -82 -201 -5 -5 11 63 -3 10 -36 83 -1 119
3672 119 97 -34 -85 32 48 -84 31 -84 4 -1 106 1 31 122 67 14 -31 125 50 85 49 -147 61 33 -60 164 111 55 -15 -21
3410 -21 47 7 -45 -89 -73 -9 -42 124 107 132 115 3 80 78 -86 -14 57 39 14 19 -87 68 151 149 2 161 31 101 9 -76 -8 62 -88
3121 -88 29 24 -42 6 -64 144 108 -127 117 64 72 101 573 1002 208 65 96 127 21 9 3 -64 71 -55 43 74 31 9 -83 -40 33
2850 33 -22 96 -62 -57 19 66 -14 -32 -53 -11 -29 76 20 28 -182 -28 -8 74 -19 -8 -34 -7 -82 -60 122 38 -57 -43 -55 18 -45 48 -67
2561 -67 21 -26 40 -2 48 -10 47 -9 -73 67 10 69 -6 -87 -46 50 -22 5 62 43 -54 3 35 3 -86 -54 -23 99 105 -33 -54 8 25 -66
2264 -66 135 -68 -26 -40 138 -20 -54 -49 -37 -51 69 -12 11 -58 -79 19 -36 -90 43 -67 48 -3 31 36 -37 -134 34 -10 -3 -76 -100 53
1983E3mM1q5J5K6o1L8k0r9J12k27J64R7L0j63J01j01K7N5j27L5J62j20M9M3q7m0P2j48Q6P
1712f9Q0J9n3K1oK5M8j80J03J4o6M7l7r4J00J5l0R3l1O5o5n5M2P5NK8l0l0l0Q7k26J37m0L7
1415aLl8l0kL9K9j10J88n5m7N3l6L9N5o8K5j8o3O1J9j46J20n4j1J75J1pj62J6K0l1O0J0o7
1117b3j5J4R7Qm7j26J68j4n1NK2m2O6O6j83O6j00K5L6Jk0N9mk6j7J40m1o4K4Om2J48j1n9j18
811e2M2J31n2j32Q3K7M1j63N0j1N8L4Oq4M3r0m9qK72p9j06J9J4m0j04J39M9n3LK7jro0R9j6
505B8j43J77K6M3o6j9k3o2J79j10j8P2j06k3Q6J6l6m9LQ8q0O7K8l3L6n0o2j68J73j04Q9l8
225g9n7R6L9O5m5rO3p5m5j5J08l9r7J82q4K9K1k6o1J17r2n9l6M5Jo9K05j39J55n7j03j27P6
-64a12J61O0N9m7k24J13M1P1J8q4j04J15J7j00M2j4n7M2m7
$$ plain form
1983 53 49 90 5 20 46 -15 23 3 -96 16 -211 -47 50 80 -83 18 -83 -56 -1 -128 -93 69 -51 -2 41 -46 -86 -14 -162 -76 -69
1712 -69 11 30 -23 -2 -8 17 65 -115 -12 2 -64 -17 -54 -148 -48 -33 -63 30 -1 64 -1 -56 -14 61 66 94 64 34 4 91 -135 2 -38 -1
1415 -1 2 -36 -66 -68 -29 0 -110 78 23 -24 29 -7 32 87 19 44 26 -37 24 43 -103 17 -37 -48 127 138 131 -31 -15 5 -26 34 44 -23
1117 -23 -38 -24 73 81 34 -92 76 62 11 16 38 -4 62 128 -55 11 -89 -64 -28 -27 -47 12 8 -18 -35 105 64 0 24 30 -12 136 125 66 -52
811 -52 -10 121 69 -63 20 47 88 -75 -25 -36 22 56 62 -22 21 -69 -118 -126 146 67 -39 -20 -6 -46 -150 -11 38 -15 -12 15 14 5 -55 44 28
505 28 -115 62 88 131 65 46 23 -39 140 30 12 84 -22 -45 41 57 21 -28 -25 63 -17 50 78 45 81 31 -31 -199 -26 -130 -41 -79
225 -79 -136 -40 -1 64 19 10 73 -2 -47 -62 46 7 -90 92 8 37 58 32 -29 88 -4 -63 -99 -54 -53 -122 83 -56 99 42 -61 -188 -112
-64 -112 49 109 168 121 -103 10 51 122 140 56 -48 67 84 -16 26 12 -45 -3 -50
-230e0
##PAGE=	F1=4842.11
##FIRST=	23146.756194512010552,	4241.1435120000014649,	0.0669193267822265625
##DATA TABLE=	(F2++(Y..Y)), PROFILE
4241f6L4J6L9L2m3j15Q8L1m7Q5r3jK9N2j03L4O4qK3j58n3J14Q0LM2j59R7j06L9N6No0l5L7
3944d7k5N2N6j17R0RJ52j63j6P4r9R3m5R1q4rK0k3j58O1j27K01M4m6Q5n2m6M5M0j0M7M3j63
3655b7o1J28J1j46J75j97J61k3P3q1MR8r3l0J7J03m9j4K3k24K17n0l8K17r3q9j2L5N1q1o7
3384f2k5M3J6oJ70o6N0j0p6M2K3j64M0L7N3p3Rp9J47O2m7n3J48j02Qq1m3MJ29j49N5J9j03
3095h4P9m1J46qj95J58K1o3M7K35K43m92J1L9pn9l0lo4J46j35J02K0m8J3j28L1J18p7J06j63
2824h2K1P0K7r6lK0L7o7J42l6%j90J45J6O2j12M9l9O8j38P1J08l5j08K4J4P1o3J00q9K9o7
2544e1J03p2Q3q5R7o3j21J80r0M0j5j18P7Q4l5j4O3j8r0QM1K2j20k7O7J32L6k05M8K5J5r1
2264i4J84j39L7l9J52j98J0L5J1m1J36k8j6o2K5O9q9n2J18m2R3r1L7l2pq5J13j8j6n9l4J91
$$ plain form
4241 -66 -32 -16 23 55 12 -103 -15 16 -31 54 -39 -40 -11 41 -62 -28 36 28 51 -107 -160 -46 34 37 79 -80 17 -89 -50 6 11 -49 -84 -47
3944 -47 -72 -20 36 -81 9 18 170 7 -9 65 -34 59 14 105 21 12 32 9 -149 -88 -215 -14 30 -16 69 17 -29 16 56 46 93 136 -27
3655 -27 -88 40 51 -95 80 -117 44 21 94 13 17 115 22 -8 9 112 63 49 72 -152 65 15 -23 194 101 12 0 35 86 5 -62
3384 -62 -87 -44 -28 -34 136 70 120 110 34 76 99 -65 -25 12 65 -8 1 -78 69 131 84 31 179 77 85 4 -39 -35 94 -55 0 19 -84
3095 -84 -5 -46 100 92 -103 55 76 13 60 295 538 46 57 96 89 30 0 -3 -67 79 -56 46 66 18 31 -97 -66 52 -25 81 -82
2824 -82 -61 9 36 -60 -63 -43 -6 -73 69 33 33 -157 -12 4 66 -46 3 -36 32 -106 -35 73 38 -70 -46 -32 39 -24 76 -13 16 -51
2544 -51 52 -20 63 -22 75 12 -109 71 -19 21 6 -112 -35 49 14 0 63 45 -45 -37 4 26 -94 -121 -54 78 114 -91 -43 -18 -3 -94
2264 -94 90 -49 -12 -51 101 -97 -87 -52 -41 -82 54 26 10 -52 -27 42 -47 -99 19 -23 70 -21 16 -16 -23 -108 5 -13 -29 -88 -122 69
1983F9n4P6j03M1L8m1kJ6j28R9j96J68N4M6j73P1o8LP5j14M5J62j10ML5k5j31J04p0O3j3R1
1703C2J4j01Q8q4J23Mj68R3j8p5R1j0j29Q8N8o8J23j03R2o6LoN0K5Pj2m2k4J08k26J22n2J7
1415d6P8m0l2j6K4N8j71J94n4k9J03n2K7M4j15Q1j1n7O9J6j31J12p2k5J30O9l9j39l6K9j2
1143d3J07j5l1l6j3J04Pk3j20J17l6j4K0K7l4L8N9j58N5q2K3oRl5O5O8k9q2J73l1l9l8J4L1
846E2N3Jj5j12J0J05k4j65J15M2J0j26M0%RO9K5q4Om1n2l5K69l3j59L3K9k7j28J55L1m6J7
557B4oJ4K1r3L6K5q1R9RM0k8j4l1o0K17j25n3J02j11n8R0L0o6oQ1P2j76O1N8l4P5j05n4j18
260a65J30l0P1p9m1J14QM5n7j1M7j8%l2M3j0j06J02L6L1Jj3r5O5j6o5o7J6P3p5K16j60J41
-29I9n2r2r8O5Q5P6Q6p5k22J64LR4j2m7j57J35K9j24P1j8l6K3p5
$$ plain form
1983 69 15 91 -12 29 67 26 24 40 -88 11 -185 -17 37 83 -90 -19 -87 -84 -9 -123 -78 84 -26 -22 13 -12 -143 -39 -109 -46 -59 32
1703 32 46 -55 33 -51 72 76 -92 1 -17 -92 -1 -11 -140 -52 6 -62 61 -42 50 -16 -13 -19 31 56 63 51 9 -15 93 -133 -11 -63 -46
1415 -46 32 -8 -40 -56 -32 26 -145 49 -5 -34 69 17 44 88 -27 54 43 -14 55 71 -60 52 -20 -45 85 154 115 -24 -60 -31 -43
1143 -43 64 49 18 -18 -31 73 80 57 -63 54 18 4 24 51 17 55 114 -44 11 -71 -48 -54 -45 -80 -15 53 24 -58 115 84 45 7 21 52
846 52 105 106 91 -21 -11 94 70 -95 20 62 72 -54 -14 -14 -5 64 89 5 11 -30 -82 -117 152 119 -40 -7 22 -5 -133 22 53 7 24
557 24 18 32 53 -40 -4 21 -60 39 48 88 60 46 15 -45 172 47 -6 96 -15 -73 17 47 -19 -25 56 128 -48 13 71 37 112 7 -47 -165
260 -165 -35 -65 6 -73 -114 0 8 53 -4 -15 32 14 14 -18 25 15 -91 11 47 78 79 66 -29 36 20 -45 -112 -96 -23 -98 118 -42 99
-29 99 47 -45 -143 -78 7 83 169 94 -128 36 39 133 121 74 -83 52 81 -43 28 10 -26 -3 -78
-230g8
##PAGE=	F1=4747.75
##FIRST=	23146.756194512010552,	4241.1435120000014649,	-0.14899271726608276367
##DATA TABLE=	(F2++(Y..Y)), PROFILE
4241f1J7L6nO3m2q8O2Rn1R4o5k1M0K1j03O8P1k9%p5o3J02L4n1R8j46J07q4L5O4o6p1K1N1k3
3935e1M9M0j22L0N8J96j72m3Q0o1L6k4J30j38k1l3K7p3kj27J77R1p7P9l1p0J17l5L3J4P3j80
3655c0n1J17mj22K14k58K08m8M2k9n6J14j20kO2L4j1m7P8k09J71n3RJ93j46p3L5Q3oq1q5R
3375f2K9k6K4J94j29N5J7l3j1J9j12OJ0Q8q4Ql5R1L4o2M0J04l3o0o3k4m2J57j15mK6j19J06
3086fj1N5K1r7L8P5j11O6P0Q2k51J41J6k3k7l8kn2J25j43Q9J9p3O0j17K1J19n6O5j49L1M9
2806a4Kp2K2L6J1n8J14j1j4j62J29M6J7j12O1k7Q4j70J18K6kp8J2N2L4m4O6o6J1p2J25r8Q5
2517E1r9J19m4j59J94r6L2J1j14P3Q4k3o6R0l0o5k4N7L7j10p8J03J15O7k72J11k1K8r7J48
2255B2p3L3qR0k19L6O5%l5J52j2m5l0M0L1j04m3J00L2M9j07L7n4M3o7L6J5k3o9j6J94j00J27
$$ plain form
4241 -61 -44 -8 -13 50 8 -80 -18 -9 -60 34 -31 -52 -12 9 -94 -26 45 16 16 -59 -122 -20 14 -37 61 -85 22 -62 -27 37 -29 -100 -79 -28 -51
3935 -51 -2 38 -84 -54 4 200 28 -15 65 4 40 16 146 8 -13 -46 -19 -92 -94 -221 -44 47 -30 49 18 -52 65 30 63 77 150 -30
3655 -30 -81 36 32 -90 124 -134 74 26 68 39 -17 97 -23 -25 37 71 60 13 91 -118 53 0 9 202 56 -17 18 101 95 14 -71 -62
3375 -62 -33 -59 -35 159 30 85 102 69 58 77 -35 -29 -19 69 -15 -7 -42 49 83 21 61 165 132 72 9 -15 -57 100 -15 -19 7 -112 -6
3086 -6 -17 38 59 -38 0 75 -36 30 100 182 -69 72 88 65 38 0 -2 -54 71 -72 17 36 -37 23 -94 -73 46 -10 55 -94 -63 -14
2806 -14 -12 -84 -62 -26 -15 -73 41 30 16 -146 -17 29 46 -66 -5 -32 52 -118 0 26 24 -54 -42 10 44 0 66 0 11 -61 64 -34 51
2517 51 -48 71 27 -132 62 -34 -2 9 -105 -32 52 29 -37 53 23 -42 -66 -9 28 -82 -160 -57 58 125 -147 -36 -57 -29 -126 22
2255 22 -51 -18 -26 64 -155 -119 -54 -54 -89 63 51 6 -24 16 47 -57 -100 0 32 81 -26 11 -43 0 -67 -31 -16 -39 -108 -124 70 -30 97
1966I7j17L6N9k8lM1j46M6j21J45J6L6j47K8l0qR7q8N5J36r1m5L4L8j97Q7MO5m8Q1J7j35J45
1677E9j44J87rj52M7k9o1J23J0j40N9P3m8J05j47J02p5N8p3N2M2j5lo4OJ05j65O9k9j4J10
1406C9k0k7l2J8Q6k08J85n8j3J25m6l1O1j52J36j4m2Q5jj15P8m3n8O9J10n8j01m1J1j8J48
1135G3k6Jn2k8R0j1J0p4O0o8LM9M0n2L4Oq4L4n1J1n4lmP0J01k0j05J41Kk7p5M1R6j05M2O0
820A25j15l5Q5J9k04J11Q2k2q8K4K0n2R4N8p9n0M0m5q8K66rj67K7L1pj35J74Mk1nl0K8L3r2
522b3qK3j9O7k7M3k1Jl3n2K14j08o4Q2q1o5N3L7r2N2J67L2k27N6L8k3R4j63qq6J08K9N6j18
225f6pJ35l2kn3k8K8M6K5m4J0L2j18K2J35J8Oqj25J8N0p5q6j6J41n8K27j98R2m8n3m6N3j3
-73c8O6J06q2j88K02k1P6l3nj69J28K2j32R1l6J1Pj00
$$ plain form
1966 97 -20 16 75 47 44 85 -61 -15 -136 9 25 61 -86 -58 -88 -96 1 -87 -32 104 13 -32 2 40 -157 -70 -66 -1 -49 32 49 -86 59
1677 59 -85 102 93 -59 -12 -41 -102 21 31 -109 -50 23 -25 80 -67 35 -40 18 -55 -3 39 24 21 -43 -37 68 -97 -28 -57 -71 39
1406 39 19 -8 -40 -22 64 -144 41 -17 -30 95 49 18 79 -73 63 49 7 92 91 -24 54 11 -47 22 132 74 -27 -68 -57 -75 73
1135 73 47 48 -4 -32 58 47 57 -17 43 -25 -22 27 67 15 49 55 -29 5 -46 -35 -89 -92 -96 -26 75 55 -50 91 93 66 -9 32 128 23 65 125
820 125 10 -25 60 79 -125 -14 68 46 -42 -18 2 -50 44 102 23 -27 13 -32 -120 146 137 -30 -3 28 21 -114 60 64 43 38 8 36 69 -23
522 -23 -31 -8 -27 40 13 56 35 36 3 -49 165 57 -7 75 -6 -71 -18 19 -73 -21 146 178 -49 7 45 22 116 -47 -55 -141 -33 -4 52 -66
225 -66 -73 62 30 28 -25 -53 -25 21 46 2 12 44 -74 -52 83 101 107 99 -26 -8 42 -33 -119 -135 6 -52 175 -23 69 21 -32 -78 -25 -38
-73 -38 28 134 52 -136 66 45 121 88 83 -86 42 64 -68 23 -13 -2 5 -95
-230i5
##PAGE=	F1=4653.4
##FIRST=	23146.756194512010552,	4241.1435120000014649,	-0.073825068771839141846
##DATA TABLE=	(F2++(Y..Y)), PROFILE
4241c3j9L1m4R4m6m6M3%o5Q9l6l6O3rq7R7O3p8rJ7m4O0k3p0J06j02J12r0O2O9j41o0N0Q4j8
3935a6J6K8j18k3J10K07j81k8Q0l0m5MJ62j54k7r4P7k9m7j10J49J18o1K1%n8J47q5K7L5O5
3664A40j95j7Q6qq2K21k70K21q7K6L6j32J36j37L1Q1j6J0m9J04j51R0m0K6J59j84k7O0J33
3410A65r4l8r4M7k6l6L1K21j73L1N5J2p1pk4l0OQ2p0LkK9K9o1J05N1K9j10k6m7o1J63o7m6
3112b4J9j12J06J1j8M6Lo8R7j40J02Joj22K04k3j3j1n4J4m2P9j48P1L1j09R4p1K3Q7oRj14
2824h4K4J4oj8M9K1k5k7N0J4l9j06J00P1k4p8M2qQ8j54J26l1mj9jP4ql6J1m7L7o3J24r5M7
2517A9j00J26j1j63J70n6J3Pq0M8Q6k3j16J16k9l7m9P6Nn7r5R9R7Q4l05J44n6M4j07J15k4
2246e9J0O9Rk06L5J07j8l1J54j6n6J0K9j6q0l9Q9Q1Qj01K7m9N2n4j9M3jj15K0J72j18J71j27
$$ plain form
4241 -33 -52 -21 -65 29 -17 -63 -20 -20 -85 4 -32 -68 -5 -14 -101 -4 59 -19 -28 -11 -55 5 -18 -88 18 -84 28 -62 0 69 -72 -132 -82 2 -16
3935 -16 0 28 -90 -113 -3 204 23 -5 75 45 0 4 166 12 -15 -109 -32 -61 -108 -218 -69 49 -12 9 9 -49 98 13 40 75 140
3664 140 -55 -72 14 6 -76 145 -125 96 9 35 71 -61 75 -62 -31 50 34 44 -5 99 -52 38 -2 24 183 -1 -28 32 165
3410 165 71 33 -61 -14 -40 -76 -45 176 3 34 89 101 30 23 -1 -31 -25 57 -13 -10 -12 17 46 -15 90 141 170 60 34 -13 -74 89 22 -24
3112 -24 -5 -117 -11 0 -18 28 31 -37 60 -80 22 23 17 -105 99 76 63 52 -2 12 -30 49 -99 -28 3 -106 -12 -83 -60 27 21 30 -84
2824 -84 -60 -46 -52 -70 -21 0 -25 -52 -2 12 -27 -133 -33 38 14 -64 -22 -30 58 -96 30 -1 -5 -24 -25 49 41 5 16 -31 6 -57 67 -28 19
2517 19 -81 45 34 -129 41 -15 -2 5 -75 -27 59 36 -80 36 7 -30 -79 -3 2 -55 -150 -51 46 130 -175 -31 -87 -43 -150 -35 -59
2246 -59 -49 20 29 -177 -142 -35 -53 -84 70 54 -2 8 37 21 -59 -98 -9 72 80 -21 6 -43 9 -45 -64 -21 -22 -137 -117 55 -63 108 -19
1957a9OQ8k9M1K8j33m0m1J09J4kr5mPj3J08p1N6J10o6r0N5P2k05K5L4R6q8N5J7j48J86j63
1668a00J95Kj35jl3j9J37K1j39K8N3NM7j33J10q8R1j49P1N5m3K7j01M5P5o8QK3n0R2K0j6m8
1380a8PR7j94J62n2j9J12j7j14R1j62J76l4j3J00j0j26L9K2q7LJ11n1m0k1l0l4J62j6Nn8k3
1100c2P5m8N3j6J7r5oQ6N7j00O2p6RK7m4nq0j6M1P2Q6J4q9O5M5l0j12Q1J37k58R3J37j17q2
802d9P8N8k29Q0J24n1n1QL8j13J03R9o9j01J24m2j24K54j7j44K0K2Nj21J83k0J4n4m4M9K5
531E5o4rk8J6R5p5L2k6J2j2l8J65p8k7J3j7n0k0M7j03R6K15j0k08N0j6PN5j79N1p0J02M9N3
233H3j48L7J43n9n0l3o5K8Q6J5k7jN8j14k7J78kL4j1j46j1Q2q4q6l4J81l8K49k51M5n0MML5
-64B5r0L6J01n8j37K03k4K5l0K9j40R2Lj13Q3n6O7Nj11
$$ plain form
1957 -19 -13 75 46 87 115 -18 -58 -99 10 24 22 -73 -77 -70 -83 25 -46 10 120 54 -36 19 91 -114 -89 -55 41 -47 8 25 -123 63 -100
1668 -100 95 97 -38 -39 -72 -91 46 67 -72 -44 9 14 61 -72 38 -50 41 -108 -37 18 -25 2 -99 -54 21 -47 -39 -16 -66 26 46 30 -18
1380 -18 -11 86 -108 54 2 -17 95 78 -36 55 -107 69 35 22 122 112 -14 25 47 -40 -37 74 23 -17 -38 -68 -102 60 44 49 -9 -32
1100 -32 43 -5 48 32 49 -46 -52 34 91 -9 53 -23 -14 13 -31 -36 -116 -132 -91 -19 67 81 -8 57 102 72 -40 41 178 -80 13 150 33 -49
802 -49 29 87 -142 -62 62 11 -40 -32 6 -107 -4 95 26 -75 49 7 -117 137 120 -24 -4 18 23 -98 85 65 79 25 -19 30 55
531 55 -9 -18 -46 -30 65 -10 22 -4 8 -4 -42 123 45 18 31 14 -36 -56 -9 -112 -16 199 189 -19 31 15 22 77 -102 -51 -121 -19 30 83
233 83 -65 -28 115 56 6 -27 -92 -64 22 37 10 9 67 -47 -74 104 102 136 125 -21 -32 50 -34 -120 -154 27 -11 238 -13 32 -18 -14 -10 25
-64 25 -65 -29 72 14 -123 80 56 81 51 80 -60 32 35 -78 5 -51 16 21 -90
-230i0
##PAGE=	F1=4559.04
##FIRST=	23146.756194512010552,	4241.1435120000014649,	0.12551975250244140625
##DATA TABLE=	(F2++(Y..Y)), PROFILE
4241A4n9Jp2J21m4pK0Np3O7qm6Q9l0o3J19L8j38lQ9j3J4p4m3O9m4J02j12R2P3j83k9N2J03
3944B7km2J9j00l7J35J91j88K6N9k0j19K0J77j11k1j39Q1l6n0o9J27J17j8n8L5l2J31r9j0
3681fQ4L0k01J9N3Rm9K04k29K03j37K1R2j85J37j31N9Q0l5Mk8R8o6Qk5PJ25j89K9N4J80j87
3401B8L4q7P3r3j1MK23j76j0Q5N3j23l7P1p2K4N1m7mlNN1o1J30J8M6j35L8r6o8J57k7n5Nr6
3095a05Q0K3m6O3N9j20Q1j57J46j4k9o8K00n3Okp5N2m2K3j38N5M6j30R6j5L4L9M0l1o7Jk5
2806g3J2M4O1j1n6j7LL1p6k2O3N4l3k9K1LQ7j09R2n1m0N0KO3l4n7k9k5P7m0R1m2k1r1J22J4
2491C4j27J01K5l1kl9L1O7j6j37J08Ok1p7R9n7J8p7L7Q6Q6k74J29o6N2j15J01Ql7J45o7j52
2211a62K0J41k8n3J25j0m1L1J0o2k6l4P5R3j0q2Ok6L1n6k8M9M6j63L8J44r3J83j20l8J14m2
$$ plain form
4241 14 -45 -44 -116 5 -39 -46 -26 -21 -94 -27 -35 -81 8 -22 -85 34 72 -66 -69 20 7 21 -53 -96 -27 -71 31 -81 11 84 -99 -128 -76 27
3944 27 25 -17 2 -98 -135 0 191 3 29 88 68 -51 -31 146 35 14 -125 -44 -80 -130 -199 -72 45 27 -31 4 -28 103 4 -6
3681 -6 78 108 -93 -74 -21 -12 -61 143 -86 117 -20 1 93 -92 45 -86 -27 53 18 22 -6 92 26 34 9 16 141 -48 -19 35 215 28
3401 28 62 -25 48 -45 -56 -52 171 -5 -15 70 123 0 -37 34 -38 -14 37 -10 -14 -17 -12 39 -22 108 126 172 37 75 -21 -89 68 41 -14 -9 -105
3095 -105 -25 -2 -48 15 74 -46 35 -122 24 10 -19 -87 113 60 66 64 -11 41 -1 22 -116 -61 -15 -145 -49 -64 -30 9 49 18 -49 -48 -73
2806 -73 -61 -17 44 33 -23 -40 -37 -6 -82 -104 -41 13 -20 -49 -28 -25 62 -47 45 -6 -46 4 6 69 35 -22 -51 -76 1 -39 52 10 -11 -102 20 34
2491 34 -93 8 33 2 0 -39 -8 59 43 -94 14 20 -1 -78 21 -36 -18 -95 -58 28 114 -160 -31 -97 -45 -160 -59 -51 -88 57 -10 -162
2211 -162 -142 -1 -29 -82 43 33 -8 23 33 -29 -55 -89 -14 79 69 -13 -7 -33 -2 -58 -86 -37 9 -154 -116 28 -65 118 -2 -40 74 32
1931C2J02k3r0j25J0P5N4m9l8j6L9j6R0p3N1R8m7j23J00P1j62n3J6J43j15K7Jj43K10j43J53
1660E6J9j06k4l7L4J20K8j34OJ6M2k4o3J22r1R0k09Q7P5p9Q0j39O8M2J4k9Q1r2N4N6jn6k1
1371a5Q9j22J15k7n1P9K8j91J09j36K00o7J3J13%j63J2Q7q9o0P5k1L4Lp9l7J38J6k3n8JP0
1091D3j00J05K2j0j00l0J19O9j58J03j51Q6M7q3qo7k1O6O9L1P0m9j6P5k9j66J15J45l39J39
828b3J75j05j16P2Q1k29N5J27o6j8kM7j60R9J40o0j21J71m8j18K32m4j19L0J1jr5J71l7N2
566A01j04n4Q7Qk3Pj02K6J55j20lk4QM0k5Q9n6N5o8N5m3r0N0q7J12K05l7j36M1o7L2k9j29
277a26R6o2R3L1O0j61P5J28n9p5j5j06N9P8j5K4nN2q6l9J55k2O6j3j54k5Q3q3o2k7J70l2K70
-12B73k90K9n7N4L7Nj14LO2j1q6J58j6k6oN2q8M3k0p0M0o1J17Oq9
$$ plain form
1931 32 134 111 21 -104 -94 -19 35 -14 -52 -68 -29 -45 45 -28 23 121 74 -49 51 122 -40 -93 -77 66 -49 -22 -21 -164 46 -97 56
1660 56 75 -31 -55 -92 -58 62 90 -44 -38 -22 20 -4 -67 55 -36 54 -155 -68 7 -72 8 -131 -63 -21 -7 -36 45 -47 7 63 62 6 -15
1371 -15 74 -48 67 40 -11 68 96 -95 14 -122 78 11 24 137 137 -26 -14 73 -16 -76 -1 -22 12 15 -64 -101 37 53 30 -28 -27 43
1091 43 -57 48 70 60 -40 -70 49 118 -40 63 -88 -2 45 -38 -46 -113 -134 -68 1 32 102 53 37 112 83 -83 32 177 -162 -23
828 -23 152 47 -69 3 84 -145 -90 37 -29 -47 -49 -2 -162 -63 77 17 -104 67 19 -99 133 89 -30 0 11 10 -85 86 49 101
566 101 -3 -57 30 38 15 22 -80 -54 101 -19 -22 -46 -38 2 -23 66 10 65 -3 52 9 -81 -31 -118 -6 199 162 26 67 0 32 3 -126
277 -126 -30 -92 1 32 92 -69 6 134 75 0 -15 -121 -62 16 1 25 20 72 -14 -53 102 80 146 133 -21 -46 37 -46 -108 -135 35 3 273
-12 273 -17 12 -45 9 46 51 -63 -60 2 -9 -95 63 47 21 15 67 -21 22 2 -68 -28 -89 28 34 -55
-230e5
##PAGE=	F1=4464.69
##FIRST=	23146.756194512010552,	4241.1435120000014649,	-0.051886983215808868408
##DATA TABLE=	(F2++(Y..Y)), PROFILE
4241G3q9l8r6J48l2J4j3J2n8K9J2m0R7m0l9J31Nj70JJ32Lk3r4MK6kP5j29J01P1j75OM8Q4K0
3935E4j07K4p7j3J31J56j79Q5K0k8j56NJ74j8oj52K0p1j1oR5J03J3j13O6pP5q3m6J21nj84
3655a20L6L3K4k1J82j65J73j94J5J39j96R0q5P1P8l9k0lP3K1n2j4k6R4j69P7K1K18k49J02
3392I4o7Q4j41L9n2J90j53l6R0Q8j62n0J48j23L9L1l0j4l0K7P3n3J20J1J5j36J16j39q1J40
3130C8j2k5Kr0M6K9l7P0O8j18M0j65J73k5k3m1J64n5J5J0q4R6n1k5j06M1M9j17O8L3L6nN7
2841E6l7k4k0o0M0R4N5m5o1m0MJ6j05O9K2jpQK1JP7o6N0l5j02J10K0K4l9q9l3PQ8j0L6M8r5
2517b3o9J10Qo3J3J12q7oqL3K3Kj11N9O2k5r0J18j21R1n8m5O6Q7j84O6m8M4j15J06K8q0J67
2229F2j11p3RJ36k2r2P4J2kJ3Nr3L7k6N8P1no0k3Ojp2oM2R3j77K2J16k6J50q5p9J23n6J36
$$ plain form
4241 73 -16 -54 -150 -2 -34 -20 -33 -21 -79 -50 -38 -78 19 -21 -60 71 76 -94 -93 39 42 19 -75 -71 -45 -47 28 -101 0 71 -104 -98 -50 34 54
3935 54 -53 -29 -106 -119 12 168 -11 74 94 66 -90 -85 89 71 65 -87 -67 -138 -149 -155 -60 43 56 -57 9 2 77 -6 -52 69 64 -120
3655 -120 -84 -51 -27 -48 134 -31 142 -52 -37 102 -94 -4 -89 -18 60 21 1 -2 71 92 40 26 0 94 -75 2 23 241 -8 94
3392 94 27 111 -30 9 -43 147 -6 -42 48 136 -26 -76 72 -51 -12 19 -11 -25 -55 -28 45 -8 112 123 138 2 118 -21 -102 38
3130 38 26 1 3 -87 -41 -12 -49 21 89 -29 11 -154 19 -6 -29 -70 94 39 54 64 -20 76 25 0 -106 -65 -16 -133 -65 -32 4 -1 56
2841 56 19 -5 -25 -85 -45 49 104 59 -2 -42 -38 -22 -127 -58 -36 -37 -44 -36 -15 -14 63 -3 47 12 -90 20 40 64 25 -64 -97 -90 -2 -12 24 72 -23
2517 -23 -92 18 26 -37 -24 88 1 -5 -13 20 43 45 -66 -7 55 30 -60 58 -63 28 -30 -75 -9 78 -106 -40 -88 -44 -159 -53 -25 -105 62
2229 62 -49 -122 -113 23 1 -91 -17 -5 -7 6 11 -82 -45 -71 -13 58 53 -7 -30 -24 -25 -97 -103 -61 32 -145 -123 -7 -33 117 32 -47 76 20 156
1922A56q2l3j75J9N3J05p5Mj5P0j8L7r1N7R0l8j44J57N2j05j14j9J79j08%l7j14K07j00R0
1660HK8n8l1k3O4P3M1j35nj1L2p5K6J32p5N7k24Q1J11j12J28j52N3L3L7k9J26j37L6O0Pl9
1380B7o3P2k6M3Qp9M4P5k31R4p5K04r5J9J22K0k06OJ20n5j09K5MJ08J4j14k1Q5N7n4o5L0P8
1091F2j48J44K7k2p6o1J46O6j93J21j75J12Q1j51K1l1j1N3P1m8J21Ko9O5jk29J36J21l17J61
828b2J58p6j21L8Q8k03N3Q8o6NmM6j78Q6J72o2j01J64o3p0K09q0r9M7J1k1p0J41n7Q8j34o1
548i4J39kJ3Nj69L1K06j48m7j0j3J11k2J9m6J36j18J11o3j23L6n4J11J49m1n1K2q2K4j02l6
277a08J12m9O8j3P1j52R7R0l6p0j0j30J02L6m1R1j4K0m5l0R0m3Q1pj43l0O7o8j1JJ08l8K53
-12B49k78M7o7P9M9l6q5j3J1L0m7Q3j5m8K6N9l2Om4j6k7m2J47ql0
$$ plain form
1922 156 74 41 -134 -115 -62 43 -32 -28 -43 27 9 46 -45 12 102 64 -80 77 129 24 -90 -109 70 -38 -38 -75 -189 18 -82 8
1660 8 36 -22 -53 -76 -12 61 102 -33 -38 -49 -17 -92 -66 66 -9 48 -176 -95 16 -96 32 -120 -67 -34 3 -26 100 -37 -1 59 66 27
1380 27 -36 36 10 53 61 -18 26 101 -130 -36 -111 93 -2 17 139 159 -47 -41 79 24 -85 -60 -56 52 66 -48 -69 16 73 19 -46 -16 62
1091 62 -86 58 85 63 -13 -74 72 138 -55 66 -109 3 84 -67 -46 -77 -88 -35 36 -12 109 111 42 107 106 -123 13 134 -183 -22
828 -22 136 60 -61 -23 65 -138 -85 3 -63 -58 -62 -16 -194 -108 64 2 -99 65 2 -68 141 61 -38 9 20 -1 -71 70 13 101 -33 -94
548 -94 45 43 56 61 -108 -77 129 -19 -66 -76 -89 22 0 19 -27 109 -9 102 39 -84 -48 -102 9 158 117 66 88 6 30 -72 -108
277 -108 4 -45 23 10 81 -71 26 116 80 10 0 -130 -28 8 -33 58 44 64 19 -11 79 36 117 110 -33 -63 4 -64 -75 -74 34 -4 249
-12 249 -29 18 -49 30 79 43 -42 -55 -44 -14 -61 22 7 -41 -15 44 12 18 -26 -42 -69 -111 36 28 -2
-230b
##PAGE=	F1=4370.34
##FIRST=	23146.756194512010552,	4241.1435120000014649,	-0.31215143203735351563
##DATA TABLE=	(F2++(Y..Y)), PROFILE
4241A25j01o5j18J65nJ3m2Pk6j5K3j8P2l6k1J24j1j57rJ53j2m5p7L9J9KL7j24P8N7j20J9O2
3952gK7L8j44L3n6K1J13J15j48J08ln0j42l7J47R5Jj28p8r8M8N1L9Q9J7j15Q2J6on1o3J26
3672D0k1j32K4L6kL1J59j19J47k38oJ83j73%jO3Q3m1m8RM8Q8q7j2l5O9j52J10k1K40k61J32
3392A13l4Q1j59J00j21J42j36k4O9J15j92l4J90j70L0L4k7j7n5O7N9j6R3Ol7j15J78j47r5
3139a02J03k3L6K1r4J1K9j7O5O7r8%j58J60n5j3j5J23j8LL0o6J07n6n4n0J3M7p6K0P1J7l0
2850bM6k1Jk7p3M6J30L0o0m3o9L7l5j11J37j8o2M7J4M0mM7m6M0Kj71J48M0k8l1r2oL9M9J7
2544A1j5J28j43l9J04l3Mn3J61j25j7J4N2l5K2m9pJ05m5o7J21j56J49q3q3K2R6p8k4j1L5j09
2264a48J01M7q0J20j15jK1P8jj24K8L0M1k6Rr9Q5mL7L0J1m7m3L0k4r2J8M0J09j46j2Q5M8R3
$$ plain form
4241 125 24 -41 -159 6 1 14 -28 -21 -47 -62 -39 -57 15 -21 -42 82 71 -86 -95 58 46 1 -76 -37 -18 -16 21 -103 -25 32 -88 -69 -7
3952 -7 20 58 -86 -53 -109 -88 25 140 -8 100 97 47 -95 -132 15 110 111 -17 -95 -193 -145 -94 -55 34 51 -64 18 34 28 -23 -86 40
3672 40 19 -113 -89 -53 -55 -24 135 16 163 -75 -81 102 -71 -71 -72 -9 74 33 -15 -6 42 130 43 31 -4 65 -87 23 2 242 -19 113
3392 113 79 160 1 101 -20 122 -14 -38 31 146 -46 -80 110 -60 -30 4 -23 -40 -95 -28 31 15 108 114 77 -38 140 -7 -102
3139 -102 1 -22 14 35 -59 -48 -19 -36 29 96 -2 -2 -160 0 -55 -68 -83 40 22 25 55 -11 96 40 -14 -64 -51 -4 -80 -60 11 28 -2
2850 -2 44 23 24 -3 -76 -30 100 130 70 27 -42 -5 -40 -151 -14 -32 -94 -47 -33 7 3 50 4 44 46 -125 23 63 35 4 -88 -94 -55 -6 11
2544 11 -4 124 -19 -58 46 13 17 -36 125 0 -17 -3 49 14 36 -13 -20 85 40 -27 94 -62 87 4 -79 -57 39 -39 -63 -74 -39 -148
2264 -148 -47 0 -80 40 -75 -76 -55 23 22 -102 -74 -44 -3 -29 -20 -119 -34 -38 -1 29 40 -7 -50 -20 -44 -136 -118 -78 31 -115 -127 -42 6 99
1966I9k2j19J17n3J17j14J7j83J1M3J12m4J7k3J12k3l2j10P7O6l1j51K01M3p5j45k1J80o9
1712ck6r0o4J70n3M1K7Km7J9N5J5O0j40j5ok0q5R1J26m8Oj82N0J55j24J43j33J1N3kj4J57
1423A29j73M4L2Rpr0N7M8m9M1p6K7J05k30N0PJ85j05LJ26L3k30J6J18mj38%mJ55J4j20lL0
1135@Q4m2q9M9Q6j70J42J2j5l9q6J66M2j80R3j41Q8J00k01Q0nJ4OR0j35J39N5p7QN0k65J46
855EP3k20J59J02m1r7l4Q9j69O6N0o4J0OL9j58O1J89q1n4J16p2oJ89j19p9O0K5m6n7J05q2
575c5J16j40n3J80OJ3j9k05N1K11j36p7Ll8J60k3rn1J69j12J30r5j17J0k1J13P4k9J1j2m5
303C0k4j26N3J00k6L3n5P3j27R9N2rl8k7j25J26nm4J34j4j7j3k4K0o6P5Kj11l6N6m1M1L4K8
6B8m6J83k06Q4q4P7M8p1l5mk4M2k6J5l2l5M8N3J7%p6L4r0qJ53m5M5
$$ plain form
1966 99 77 -42 75 22 139 25 42 -141 -130 -87 25 -19 -2 -25 87 64 32 -78 -1 65 34 -117 84 127 52 -93 -114 66 -3
1712 -3 -29 -119 -183 -13 -66 -25 2 4 -43 -24 31 46 106 -34 -49 -55 -75 -160 -69 57 9 15 -167 -117 38 -86 57 -76 -65 -12 -14 -28 129
1423 129 -44 0 32 41 34 -56 1 49 0 41 -35 -8 97 -133 -83 -76 109 4 7 133 166 -64 -48 70 66 -72 -72 -76 79 93 -27 -30 0
1135 0 84 42 -47 2 88 -82 60 72 57 18 -68 98 140 -40 53 -88 0 100 -101 -21 -26 -12 -6 84 -51 88 143 66 74 124 -141 5
855 5 78 -142 17 119 78 -19 -53 36 -133 -67 -17 -81 -71 -65 -26 -184 -123 66 -15 -69 47 -25 -31 158 39 -40 20 45 -1 -58 47 -35
575 -35 81 -59 -112 68 74 87 68 -137 -86 125 -11 -88 -85 -123 37 14 5 -46 123 11 141 46 -71 -61 -82 31 105 76 87 75 30
303 30 6 -120 -67 33 7 40 -15 58 -69 30 82 73 35 8 -117 9 4 -40 94 80 63 50 26 46 -20 55 57 -54 -90 -34 -75 -34 0 28
6 28 -18 165 -41 43 -41 36 84 13 -22 -26 -50 -8 -34 -19 -51 -86 -38 15 32 32 -44 -10 -100 -108 45 0 45
-230D5
##PAGE=	F1=4275.98
##FIRST=	23146.756194512010552,	4241.1435120000014649,	-0.088756531476974487305
##DATA TABLE=	(F2++(Y..Y)), PROFILE
4241A57r8p3j27J63K2jm9j0Kn2L5RK3l0pR1Pj05l5J60n3n1m3M5N6k8Nr4L7K3l7JQ8l7N1j35
3926i0L6m6L4J02P8j01P8J1q0q0q3R3J93j6p6j69r4J02O5k7P9Lo8P9M5r2k0p2J15j7n6LN0
3637b1q0J19J32j16J27k45l9K25j37j03R2M2R1m0o9%M0J16j07j3lN1j49J13m3K36k29J16N
3384A11P0j48J49j79J11j48J7M2J30k19J0J94j93lM9l5rn2Q6J1M0P1k8p5p2J96j20q2N0n4
3121h0J05N2r1l5L0j2N5Q6r7j9j24J03r2pJ0Q8N1k5M8k1N9m5o0Qk9N3k3k8J03l4j7K3j5Nk0
2815En7J2J56om7j2p6O1j09q3J68n7r1J05rO7j0nl8O4M7k23J60M4p9j1m5J7O4j9K5l9J55j50
2517a6rJ13r2M5n4J44j20m8L2O4p3K4J8m3J01p0mJ04j48J79j54l9l7J05pj08K8L9j04O5O7
2246Bk2L7r4L4N3oK3j28J5K1O3n4Oq5J13K9J1jJ5n2l8M2l8r5K5N7Q2j03k9N5Q2N3L6j56J03
$$ plain form
4241 157 59 -14 -141 22 44 43 -6 -16 -14 -66 -31 -22 1 -29 -36 55 62 -43 -78 82 29 -22 -65 -20 36 8 13 -81 -44 -21 -58 -57 31 -6 45 -90
3926 -90 -54 -100 -66 36 114 13 91 102 22 -58 -141 -48 145 129 53 -116 -210 -108 -43 -70 9 12 -56 23 68 -24 -44 -116 -1 -18 -74 -71 -21
3637 -21 -101 18 150 34 161 -84 -123 102 -35 -138 -46 -4 87 47 -22 -22 18 134 27 14 11 62 -87 26 -17 219 -10 106 111
3384 111 181 33 182 3 114 -34 -17 25 155 -64 -54 140 -53 -56 -7 -42 -51 -103 -17 -6 34 105 77 2 -70 126 6 -76 -26 -80
3121 -80 25 77 -14 -49 -19 -31 24 110 13 -6 -130 -27 -119 -126 -116 -28 23 -2 46 25 84 39 -21 -13 -42 11 -12 -40 63 29 12 35 20 25 5
2815 5 -52 -40 116 110 63 51 -25 36 -73 -156 12 -45 -136 -31 -40 27 17 12 -26 38 85 -138 22 66 -13 -24 -69 -52 12 -7 18 -21 134 -16
2517 -16 -25 88 -4 41 -13 131 11 -37 -5 59 -14 10 28 -15 86 16 12 116 -32 147 -7 -46 -83 22 15 -93 -65 -26 -130 -65 2
2246 2 -20 17 -77 -43 10 4 27 -101 -86 -65 -2 -56 -50 -135 -22 7 18 17 32 -20 -58 -16 -54 -149 -124 -67 15 -88 -117 -62 20 73 109 -47 56
1940E6j7N4j05N4j67J4M4M8L8On8J70l7q1j11Q6K4j7j37K13N1q2j43K8J36k2n1j43jJ03j1
1668e8K1L1N0q1P3J6k9Q6j47k3J5p0o5J14J01l2l3j06J1J85j19J23q6l5Q5p4j2J85j84O1q
1397eJ1J1p3M9O6j25N2l8M0J01k03LQ4J43q9k4J17L4k25K7J04L2j44K5n5J63J0j01kkP7L4
1117I7j26N0Q9j60Q9JJ4j3r4J74kj19K2o5L5Q5j98J41pM8n2J26k06J11R6m5p2R8k46J54J3
846C8j15J46M5j9n8j16Q8j43O7O6p6qL2K5j03J8J93j19MO4o9M2J60j44o0O4N2p3n4P8j02J31
566E4j35k1J83K8l8l6j99P6J66p4q0jn2J58j4J1o2J32n7J11j05j03nlJ17J6j5L3n3J9q1r5
286a25Q7O9J5Np3O0j10R3L6MLn6j00J15pk2J16Ml4pl5k3r2O3Ro3m5N2pO0N6l1m2Q2j06J10
-29F1r8O5M0q1j1L0k6K1k3j4o6JN3L1N6K1j08O2j21K9J31r1J04
$$ plain form
1940 56 39 93 -12 42 -125 -111 -67 -19 19 25 -33 137 100 19 -92 -6 18 1 -136 77 128 46 -97 -69 67 45 -6 -149 -150 -47 -58
1668 -58 -37 -6 44 -37 36 52 23 109 -38 -61 -46 -116 -181 -67 34 2 -31 -137 -126 59 -60 63 -23 -58 27 -47 -59 126 -58 3 -5
1397 -5 6 17 -56 -7 59 -66 -14 -52 -12 89 -114 -111 -27 116 27 3 120 154 -71 -44 60 92 -52 -27 -82 81 91 -10 -12 -14 63 97
1117 97 -29 21 110 -50 39 40 54 41 -53 121 119 0 22 -43 -8 77 -121 20 13 61 9 135 -71 40 136 91 19 117 -129 25 38
846 38 -77 69 114 95 37 -79 9 -134 -67 -1 -77 -85 -53 -28 -131 -113 80 -39 -35 29 -40 2 162 18 -42 22 74 1 -53 25 -77 54
566 54 -81 -102 81 109 71 35 -164 -88 78 4 -76 -77 -129 29 15 26 -36 96 39 150 45 -58 -63 -66 51 67 52 85 32 51 -30 -125
286 -125 -38 31 46 51 -22 38 -72 21 57 61 64 8 -92 23 16 -6 110 114 80 73 38 15 -77 -14 -5 -68 -113 -61 -68 -8 48 17 -25 57 -49 61
-29 61 -37 28 68 -13 -24 6 -20 1 -22 -36 -102 -101 -48 -17 39 60 -48 14 -107 -78 53 -38 66
-230F6
##PAGE=	F1=4181.63
##FIRST=	23146.756194512010552,	4241.1435120000014649,	0.37811771035194396973
##DATA TABLE=	(F2++(Y..Y)), PROFILE
4241A61q8o4j10J34L3k2j9k9J1p2N7K3k5l4J0L3N8m5o2J55j05l4k9L5J10o9j3m2jk9N0l6J06
3952D8p9P0r4L0n8K2J04N5n4J9N0j13Qj12K2K52o2rk18n7J24J7n9O0kpO6P6j61Lq8J07mJ7
3655b7mO2j80K24Q9j43J10k18o4K53j01j83J59J8R1l0p4k5N1J05j18j3O5L1j53P9l3K02j82
3401iP9M6M8j13J68k00J04j78N5K4J35k36O2J69j81m5N4l9Pk1O3l5Q1O5r5p5k1J59o2l3lq1
3121a08J45P4p1r2L2k9N1J18j16j0o8K4j14KK6N2J34n6N2L6l8j6n2M4o7P6K1n6J27j08L3k
2841D4l4qlk5m9J74n0qJ3n1N1j72k8J71r5p9J40l9Q3k0n8k4R9Q4k39J46K5j20K4K8J7P8p9
2552dLk3J14j19J2J37j43M4J2P4o5r8M4N4p0kO8l3N8q4N9P1j03J80k38P2p9R6Qj57M9O1j04
2264a06RP7O0k4p1K5Q7n9L7j15L7j4N1n0np1J14P0j6pnp3j1N6n3o2RQ2L4q9rL5M8N6O0j83
$$ plain form
4241 161 73 9 -101 33 66 44 25 -4 7 -65 -8 15 -10 -44 -34 -1 57 12 -50 105 0 -34 -63 -28 82 13 0 -42 -43 -72 -22 -58 48
3952 48 -31 39 -55 -25 -83 -61 43 98 44 63 113 0 8 -104 -82 170 108 99 -119 -176 -52 -35 -94 -34 -36 -43 23 99 -62 -59 -147 -40 -44 -27
3655 -27 -31 31 -149 75 164 21 131 -87 -151 102 1 -182 -23 -5 86 56 -18 -43 8 113 -5 -18 47 78 -75 4 -29 173 -9
3401 -9 70 116 164 51 219 19 123 -55 0 24 159 -77 -15 154 -27 -72 -18 -57 -50 -71 -8 -43 38 103 8 -67 -88 71 9 -24 -27 -108
3121 -108 37 111 40 -52 -20 -49 2 120 4 -6 -74 -50 -164 -162 -136 -84 50 -6 46 82 44 28 -24 20 -47 29 50 -6 121 13 46 44
2841 44 10 2 -1 -26 -75 99 49 41 54 3 54 -118 -146 25 -70 -149 -9 -48 35 15 -43 -67 32 116 -123 23 48 -72 -48 -20 -3 75 -4
2552 -4 -1 -24 90 -29 -17 120 -23 21 33 107 42 -56 -12 42 -28 -30 38 5 63 -21 38 109 6 186 -52 20 -59 37 45 -112 -63 -2 -106
2264 -106 -97 -20 40 16 -55 -30 57 -2 35 -80 -43 -57 -6 -56 -61 -132 -18 52 36 29 24 -49 -60 -4 -57 -119 -110 -28 6 -83 -92 -57 -9 47 107 -76
1948g6R1N0k1p7Q9j49L7N6p0J40j7j19K32o4p6r1N8j3jj05J91O5j03j14J05N3J3o9j82N3L5
1677g9J9K8M6O3j19J08k6m0J11j46k2J8p9m0J05O9m4m2l2j5J78j10Q7k8n7J03j31m0K19j60
1415e6N1k7J8poM7L9j69L1J5Q1N9j72k0J31R2o3l1Q3L8k00L3R8K8j30R2j26J32J2p7j6qL9
1126A1J47j57K8R2j24PLO0k1p2J57n3l0o7K2j5L3j37J75l7Q6r6J58k45N7J14J0j36J12j77
863i5J59m1o2J34K9k3k7j63Q5j31L8J45j02m4P0Ql6l2J78j58N6L9n3M6J13j33n6P0P8r8n2
592e8O4r8J28j35L3J36N0j22k0j55Q4R5K0o1k5n0J10J4N3o5M4J8O0o7j02PoJ10j1pK3q7O9
303D9j06m0N3L9O1On9K5j13R1M4JL5q2p3P4M4J2L1L7k2k2p0l0j00M9J6j4n3N7K9J6N7m2k3
-3b3lk3J00r1N7K9o7k9Q2j7ol8Nr2K4M4NQ6M6j31O7j10N0Q9j16J24
$$ plain form
1948 -76 15 65 44 -33 56 -93 -56 0 -70 70 53 -66 166 102 26 -65 -7 -20 -21 -126 65 130 27 -87 18 71 84 15 -167 -114 -79
1677 -79 -60 -32 14 77 -42 66 40 0 111 -35 -57 -39 -118 -158 -53 16 -28 -70 -102 -117 61 -49 38 10 -47 56 -75 -115 104 -56
1415 -56 -5 -32 -14 -21 -27 20 59 -110 -79 -64 17 76 -96 -116 15 107 44 13 96 134 -66 -33 65 93 -37 55 -71 61 73 -4 -20 -28 11
1126 11 158 1 29 121 -3 4 7 67 46 -26 131 78 48 -19 3 -12 21 -116 59 22 108 12 170 -75 -18 96 106 -30 82 -95
863 -95 64 23 -39 95 124 101 74 -89 -4 -135 -97 48 -54 -98 -28 -20 -56 -88 90 -68 -12 27 -26 20 133 0 -56 14 92 -6 -58
592 -58 6 -92 36 -99 -66 70 120 -2 -22 -177 -93 2 22 -39 -64 -114 -4 10 63 -2 42 60 120 53 -49 -42 -48 62 51 44 67 -20 49
303 49 -57 -97 -44 -5 56 62 3 28 -85 6 50 51 86 4 -69 5 49 61 92 129 107 85 15 -15 -115 -66 -50 -64 -117 -60 -31 -15 42 0 -23
-3 -23 -26 -49 51 -40 17 46 -21 -50 32 15 9 -29 -24 -116 -92 -48 -43 43 89 -42 25 -85 -35 54 -62 62
-230F2
##PAGE=	F1=4087.28
##FIRST=	23146.756194512010552,	4241.1435120000014649,	0.48136192560195922852
##DATA TABLE=	(F2++(Y..Y)), PROFILE
4241A41p3m3p2Q4J8m7M0m5J6p4Q9J0n2n4M2l8J12Np9J29j47J1n5K9J44r9j6K7k9p7J11p2R5
3952C1p1R9n7J9q2%J07M7k1k7P6j42R0j09m2K65j28N4k18LR9o8l3K2J6M0N2R5j94J9j11J03
3672f6J3N1QP6k48K88L5j65R2j79n9K46n9k25J83jP5qo2n7P9O1j09j9J44nj37J6LJ42j53N6
3392A6Q4J1n8J53j74J06k00O2K5J30k32R5J28j41p7M5k3J4J1K1m1O8O5j59m6L0P3J8K8l2q2
3121h2J30P1m3j44M3o0O5J28j30J3ql9j17L0K3J6J95p3L5Q5j32J6m8M5p5J02M7m5J30j81R4
2850I1k9n8k5LNj01J82r6M6J8j1Rj89L4J59j21m8J39n8Q4l8r0RJ08J13k17J06pj40O6P6kQ7
2561A05j05l9J7L6o5J7J54j58RJ02pJ3j37L6K0k1n2J01MRp9P2L9l6J49k84J95q5O0j8j54L9
2281f3Q6r9l2O1J16l1o2qJ05m6L5j06O5m6J5j9j5o5P8J09l9J5m9r2K1Q4p2Mk0R0Lj16L6L0
$$ plain form
4241 141 68 25 -47 37 55 8 48 3 19 -55 34 44 -8 -62 -20 -58 54 59 -20 109 -38 -27 -82 -53 91 -8 -24 3 -26 -103 8 -64 31
3952 31 -40 59 2 21 -61 -61 46 93 72 45 121 -21 69 -40 -82 183 55 109 -109 -106 -7 -75 -108 -86 -70 -30 22 117 -77 -58 -169 -66
3672 -66 -53 -2 6 82 -166 122 157 -8 84 -95 -154 92 33 -192 -9 -10 65 57 -5 -62 17 78 -31 -50 94 89 -48 -32 -29 113 -40 16
3392 16 100 111 53 206 32 138 -62 0 25 155 -77 18 146 5 -72 -27 -50 -36 -25 -4 -45 23 88 -71 -117 -87 -14 4 32 0 -82
3121 -82 48 119 76 -68 -25 -85 -20 108 -22 -9 -17 -56 -173 -143 -120 -104 91 18 53 138 6 22 -26 19 -56 46 93 48 178 -3 91
2850 91 62 4 -21 -18 -13 -114 68 -28 18 36 25 34 -155 -121 38 -83 -131 8 -50 34 -4 -94 -85 23 136 -81 25 18 -122 -56 20 18 105
2561 105 0 -39 -22 14 -51 -34 120 -38 -29 73 66 79 -58 -22 -2 -23 -75 26 30 39 -40 32 71 35 184 -100 95 10 70 52 -102 -63
2281 -63 23 -76 -108 -47 69 38 -24 -32 73 27 62 -44 21 -25 -10 -29 -44 -109 -31 78 39 54 5 -87 -66 18 -54 -50 -70 20 23 -93 -57 -27
1983b7m8J03L8j84P8J25p3n9J24j28N5Q6j82K07m1j82K71r3j5o3qj4lo6J54O3j00o8J62n1
1721F1L0o5j95P7qL5M5O7M5j40R1l9k7J26j31kj3m6l0R2M3q0k0Qj5J34j12N4L3o1R5j38q4
1432a70K51j15J2j5J4l9Q1N7lj81j6N2J32pj42j4J33N3m4kJ9O4j67L2R9j2r2J57j79P7J7o2
1152a0l0Rj5K39j65qJ00q2n5LJ03n6k0J07q3M9j41R4m3l5n4J68p5J24j17J66k41RJ05N5j51
881e0R0r0J46p4p1J23O4m1l7j41Q1j23qK34j21r0J08nK0p4J41j73R1N0m1JN7o6q9Q8Q2j14
601c2k9N8o2R9j36Q5N7N8j92J7q9O2K9J07l2n6l7M5N4P3l7m6P9rLj05L9k7Q3oj1jj01Q2q4
295f2Kk0K4R7L3k5j9j31R3O0qM1r0n6K8J20M9q8O8Mm0j18j4p0L1L4K1o1N8O9p7L8j4Nl9K0
-20c7N0m9N4K1m8p5J38k4j8o0M7q7J3L0j2J05N7j41N4o4N0L8r6J02
$$ plain form
1983 -27 -75 28 66 -118 -40 85 12 -47 77 -51 4 90 -92 115 74 -108 163 70 55 -8 -16 -30 -33 -99 55 118 18 -50 112 61
1721 61 91 26 -169 -92 -100 -65 -20 47 92 -48 43 4 -23 103 -28 -30 -43 -89 -119 -27 16 -64 -84 -76 -91 43 -69 -15 18 -43 52 -86 -170
1432 -170 81 -34 -22 -37 -23 -62 19 76 73 -108 -124 -72 60 53 -89 -103 30 83 39 37 56 120 -47 -15 84 72 -20 137 -42 35 52 -10
1152 -10 -40 -31 -46 193 28 20 120 38 -17 -14 89 33 13 120 37 86 -55 39 -4 -39 -93 75 0 124 7 173 -68 -59 46 101 -50
881 -50 40 -50 96 22 -49 74 138 97 60 -81 0 -123 -131 103 -18 -108 0 -5 15 -59 82 -91 0 50 9 10 67 1 -88 0 82 -32
601 -32 -61 -3 -65 34 -102 -17 40 98 -94 -77 -166 -104 -75 32 0 -56 -93 -48 6 79 42 -4 75 66 69 -36 3 -24 59 53 42 41 -60 22 -62
295 -62 -60 -80 -56 41 74 49 30 -101 -8 52 44 85 -5 -61 -33 87 136 48 116 120 80 -38 -52 -122 -91 -57 -36 -97 -39 30 -47 -9 -23 -18 -57 -37
-20 -37 13 -36 18 39 -9 -84 54 30 12 -48 -1 -88 -75 -45 -57 48 105 -36 18 -46 4 42 -54 48
-230D8
##PAGE=	F1=3992.92
##FIRST=	23146.756194512010552,	4241.1435120000014649,	0.2648353278636932373
##DATA TABLE=	(F2++(Y..Y)), PROFILE
4241A12n8j7k8K8j7o3R2o0M0o4J20k7n1q2Q5j02J39M2q8Q7j71P3j09L9J44j04oR1n4r5J28
3970B4r3N4qJ21m9J8j05j1Q7N3nl0N6j50J34p8p7K40j89R5j79O7K6j35L1k4N1N0M8Q5j78L0
3690d1j21Q6K9M0K8R4k49K71j0j63P9j52k4J96j1k29J79j3M4J2l7q4J10Qp1l0J96n2r6m6M0
3419a7P2j56O0J13l0QJ12j13R9j95M0L5J15j94R7P0q8j01M2J8j1K5lKlN0j77qP3l8J12O2l4
3130C7n3O4M5k6j57O0r5R6J05j26L5L2o5j01Q0kj4K03n8nJ16j65K2n4J8m2J07M6%J04k15J32
2850A24n9n1m3lJ3j09J70j32R6NJ3l3j53P8J35j19k1J07o5P5o3p9M4Q1J36j74M5k8j31R5P0
2579B4j6Q9r6p4N1l3pJ0J36j28k5J47n7P9j37Kl1N9j04J29K3qn8J7K4L3R0k68K77o1Rm9j06
2290e9lR8p9l0K1J05J4o9k8R7K8Pj06O7n7j8J6j1n9MJ36m0M0r9r2L5J28q7P4n7Q0Lj49O8L5
$$ plain form
4241 112 54 37 9 37 20 -43 49 -11 29 -35 85 58 7 -75 10 -92 47 89 1 88 -83 -10 -119 -80 64 -40 -46 45 -9 -104 24
3970 24 -69 -15 -23 98 49 67 -38 -49 38 91 86 56 112 -38 96 18 -59 181 -8 87 -92 -25 1 -134 -103 -127 -76 -26 22 107 -71 -41
3690 -41 -162 -76 -47 -7 21 115 -134 137 127 -36 43 -109 -133 63 52 -177 2 -11 33 45 8 -76 34 42 -29 -59 137 85 -11 -57 -17
3419 -17 55 -101 -41 72 42 50 162 49 148 -47 -7 28 143 -51 46 116 28 -73 -31 -13 -24 1 -2 0 -3 47 -130 -138 -65 -103 9 71 37
3130 37 -16 48 93 67 -90 -30 -125 -29 76 -50 -15 17 -48 -149 -69 -71 -85 118 60 55 171 6 28 -26 -8 -50 57 103 103 207 -8 124
2850 124 65 14 -29 -32 -19 -128 42 -90 6 11 24 -9 -162 -84 51 -68 -89 18 -47 28 -35 -114 -70 11 147 -27 18 -10 -141 -46 24
2579 24 8 97 1 -73 -22 -55 -62 -52 84 -44 -69 78 21 100 -37 -35 -66 -7 -111 18 41 33 -25 -8 16 49 139 -129 148 87 96 47 -59
2290 -59 -62 36 -43 -73 -52 53 67 -2 -30 67 95 102 -4 63 6 -12 4 -7 -66 -62 74 34 74 -25 -117 -82 46 -41 33 -24 56 59 -90 -22 13
1983A3j53J57j4j53O0J76q7o0J41q1L9J26k34K14o7k17K70j09P5n0p9L0l4m2J24L2n3k3J73
1730A74j53M7m6j70O8j2L2N5P5J7j33K9j5j8J24j03K9n1jl5Q4K6j08NJ7%P3j18L0Q9o2O3r3
1441h1j12K63p4l3Rrm4J44P5k4j85o8N5J73o7j13QR1M4m0N3n9J15j40L1Q4n4l5J79j86J9J0
1161B9n3k6M0p1K61j43l7J11o0o7qJ22r2M8L9q1R1j74J32m8j00J3J36j05J59j14J40j98nP3
898A2O2j10M7j4J03q1j10J08J24m7r7o3Q5j08n1K67j06j35J24LN0r3Q1j41R9P7m5o6J9L8j61
627a29J10N7j03J8M6lN2j30J08k3N5k01L6k9K3j1J45Kp8k4jQ1M6M2j08J13p3N8r0O5n8L9J9
338E4k3j9r0O4l6J9r1L6J06O5Ln0j47R1O7rJ6p9m3qJ78P9j82P8J8m5j55PoNP2L1o9M2J20j79
23h0PL4K9k8K9k0J3N1K2m8j13J80n9op7P7m7k8J5rJ14M9j41M2qK5nl5N8
$$ plain form
1983 13 -140 17 3 -150 -90 86 -1 -61 80 -1 38 164 -70 144 77 -140 130 21 96 46 -33 -3 -37 -79 45 77 24 1 174
1730 174 21 68 22 -148 -80 -92 -60 -5 70 87 -46 -17 -32 -50 74 -29 0 -51 -52 -87 -3 23 -85 -80 -63 -63 10 -108 -78 11 -51 12 -81
1441 -81 -193 70 -4 -37 -28 -37 -81 63 138 114 -71 -139 -84 89 22 -91 -83 8 52 12 65 6 121 -19 12 96 42 7 186 0 19 29
1161 29 -24 -50 -10 -81 180 37 0 111 51 -16 -24 98 6 54 93 12 103 -71 61 13 -87 -74 62 -43 116 2 142 -56 -61 12
898 12 74 -36 11 -3 100 19 -91 17 141 94 -3 -66 19 -89 -140 127 21 -114 10 13 63 -30 51 -90 9 86 41 -25 -6 32 -129
627 -129 -19 38 -65 -47 -1 -4 48 -82 26 3 58 -143 -107 -136 -113 -124 21 23 -55 -79 -80 1 47 89 -19 94 21 79 -11 54 -4 35 54
338 54 31 12 -78 -14 -50 -31 -122 -86 20 85 88 38 -109 -18 49 40 56 -23 -66 -74 104 183 1 79 97 52 -103 -96 -102 -97 -25 6 -63 -21 99 -80
23 -80 -73 -39 -10 -38 -9 -29 -16 35 57 9 -104 76 17 11 -66 11 -36 -64 -49 -58 56 105 -36 6 -2 23 18 -17 41
-230D1
##PAGE=	F1=3898.57
##FIRST=	23146.756194512010552,	4241.1435120000014649,	0.14240939915180206299
##DATA TABLE=	(F2++(Y..Y)), PROFILE
4241H4l7MNk3n1n7J08q8R4m9J36p4k6r9J20j39J23P6r8M1j77J27j48N7J21q3J0J21q7o6R4
3970A9r1mR2J06o2L2r9j4M1N8JMJj27J20k3q1J88k24J06j20J14o2j44Q2n3Q2K1N4N0j17L1
3690a9j01M2M5LM1J14j91J82l3j38P4j40K1J18L3k02J68j7LK1pj03J28l2nm1J99r6m0p4N0
3419CJ1j68O1J31n1O3P0n1P7j66PM8R7j32P5jm2j20N9P4p0K1KO8r6J2j33J9J08j41K00M5j8
3130F2j4k7J6k6j10P2j32J29P2j05M2M3n9p6J38m0k9J47j0n2J27j18j1o2j8K0P4J6M8N6j81
2859hJ33q5nn7j3Jp7J42j33J13j6Pm5r2R6R2q6qO2o5O2p9l5N5M1J57j37k3k4q9Q6K3oQ2q1
2552a2p1N6o5M5%P3o2k2J06o4J05r2m6q1J29j23J58MLl9p2L6Q9K2k11K99l9k3o4l8o8R7m2
2264a2J0k3L7P2q3rP3J07m2j01K9m4l1M0Pl8r0J50rL4j33o9K5J69q7J14j00P4K3j45N5M4k15
$$ plain form
4241 84 47 51 56 33 -18 -75 33 -55 39 -10 126 52 26 -73 47 -92 31 107 9 50 -127 0 -148 -91 30 -53 -43 78 -9 -75 19
3970 19 -72 -76 16 122 60 92 -7 -21 20 78 79 83 84 -43 77 54 -27 161 -63 43 -77 37 -25 -169 -87 -140 -58 -37 17 67 -50 -19
3690 -19 -120 -78 -33 -30 11 125 -66 116 83 -55 19 -121 -100 18 51 -151 17 0 3 24 17 -86 42 10 5 -36 163 67 27 -47 3
3419 3 14 -154 -93 38 -13 50 120 69 146 -20 -13 35 132 0 75 74 32 -88 -29 45 -25 -4 -2 66 -30 -18 -151 -132 -24 -165 35 80 62
3130 62 48 21 37 11 -99 -27 -159 -30 42 -63 -21 22 -37 -113 25 -15 -44 103 93 41 168 50 39 -23 -41 -21 53 69 117 173 -8
2859 -8 125 40 35 -22 -35 -34 -111 31 -102 11 -5 2 -43 -135 -39 53 -33 -41 21 -44 18 -61 -96 -41 0 157 20 -3 -27 -116 -30 -7 -13 69 -12
2552 -12 -83 -27 -92 -47 -47 26 -36 -58 48 -16 89 -3 -49 -130 -1 -124 34 38 41 2 -70 -34 55 77 -134 165 126 103 39 1 -67 30 -12
2264 -12 -2 -25 12 84 1 -8 65 172 130 29 58 14 -17 23 30 -8 -98 52 43 77 -56 -125 -100 69 -18 96 -4 70 93 -52 3 47 -168
1975a68J84p6r8M4J79q1n4J21%k5J66k09J69r6k06K32r8J46o0j16R1p8m7J17k2K0NJ40k17
1721c7P7l7j02M3MRN1N5J2j08m2K6l0J06p5N6o0J9l9P8J5r9NJ4PK8j07QJ31p6K6k6j07K48
1423G3n5n5J4m4%J56R8j9j97j02L7J81r3q7K5L3O1m2J02j26J71j31M6L8o9L1J38j35l5j9l0
1152c5j0Q6j20K05j08l2J12q0k6k6J08j01J04j8n1Q8j55J28m4j40M4J09j28J83r8R8j34J7
907b4K7K9m0QM1L5p3j25P6J70k3j90K9J07q4p4K16n2j68J09L5N4q3Ro6P6Q6n6j09J3J28k36
627a55J17J4n8P7J6N1J0j14R5q2N1j42K0%j3j4J16L6q0j7j8P3nJ53j34J19j04N4m4N6p8oM8
338D2l0k8o2L9NK2j29O4Q7P8Rm7j49P8N5Pl0o1j4l4J82R5k08O9%l1j61K1N8j4J10K9q6QJ76
32A50k33l1Q0M1kK0p3N5M7L9p0j22J92r5Rp9Q1mo0mPJ13L8j39M5K9j7k1K9J9
$$ plain form
1975 -168 16 -60 -158 -114 65 -16 -70 51 51 26 192 -17 152 56 -150 82 -16 130 70 -46 45 -33 -80 37 15 35 40 180 -37
1721 -37 40 3 -99 -56 -52 -43 8 63 75 -33 -75 -49 -79 27 -48 8 -52 -33 -72 6 21 -78 -73 -59 -52 -24 -131 -123 8 -68 -42 -68 -175 73
1423 73 18 -37 -23 -67 -67 89 187 168 -29 -131 -94 87 -6 -93 -68 -35 26 -16 86 -40 131 0 46 84 15 46 184 49 14 -5 -35
1152 -35 -45 41 -79 126 18 -14 98 18 -8 -34 74 -27 77 59 8 96 -59 69 25 -115 -71 38 -90 93 -5 93 -41 -24
907 -24 3 32 -8 0 41 76 3 -122 -46 124 101 -89 -60 47 -37 -111 105 53 -115 -6 29 83 0 9 -57 19 105 49 -60 -47 81 -155
627 -155 -38 -24 -82 -5 11 62 72 -42 53 -29 22 -120 -100 -100 -113 -127 -11 25 -55 -72 -90 -17 -22 131 -3 116 12 66 22 78 0 -6 42
338 42 12 -16 -78 -39 -34 -12 -141 -77 10 88 97 50 -99 -21 34 41 11 -50 -64 -98 84 179 -29 40 40 9 -152 -131 -73 -87 23 52 -34 -26 150
32 150 -83 -114 -34 7 5 25 -48 7 54 93 23 -99 93 -2 7 -72 9 5 -55 -59 -52 61 99 -40 5 34 17 -4 25 44
-230D4
##PAGE=	F1=3804.21
##FIRST=	23146.756194512010552,	4241.1435120000014649,	0.073331139981746673584
##DATA TABLE=	(F2++(Y..Y)), PROFILE
4241F3j2J1K0n9p0j4P8j30J56l2J29j12Rq8J26j45P9J13j22J7j76J58j42O7R6m3K7R6j29n
3979c4L4o7o4J98L8o8N7o2j8j2N1jM8m7q3O1M1p2J24k18Q5n4J25j33q9Q8m4Q8l3O2J1l4J3
3690im9j7N2k5M9J17j17P6l8j09P5j27N6L3N8j45J56j9l3K1J4j11J23m6O8m5J52j16J2o0L1
3419B7l0j51K3J30l5Q8N1l0N4j27j3N5Q7p1M9p1j4j33Q8J27j47OK8J29j63m4n3K7J36k00K55
3147G8rrJ0j04Nk9k3O7j73J36O8p6L6L3m3m9J77p7k9M5N2q6J31k6o5o1l8P5J6l0O4J1q8J02
2850I1r6N6o6j2j4l9J10q5P8l2j5j8m7Q8L3l8%K3o1M5o7J7K7J5J75j14q8Ql0M0k7J9O9r3j4
2544f2L4o1P8nrRK6km3Q6l2p8j16J54q9J76l5J9l9j34O0J27l0j56K81m7j9o1K5j40R5kN4m4
2246B0l9R4q2M1M7J42j00p6l0l0k2N4L1Jj68J57M9k5j29m2lJ86o9J02j36R2L9r3JN1k03J69
$$ plain form
4241 63 51 62 82 23 -47 -61 17 -113 43 11 140 28 37 -51 75 -70 9 122 0 17 -159 -1 -143 -76 20 -23 4 100 -29 -34
3979 -34 0 -67 -131 67 105 37 94 32 14 2 53 52 100 53 -30 31 72 0 124 -94 -9 -63 62 -71 -160 -72 -116 -28 -61 1 12 -22 -9
3690 -9 -58 -75 -23 -48 1 118 1 77 39 -70 5 -122 -66 -33 25 -120 36 17 -16 5 19 -92 31 -15 53 8 160 44 56 -4 27
3419 27 -3 -154 -131 -1 -36 52 103 73 127 0 -13 42 129 58 107 36 22 -111 -23 104 -43 -37 -9 120 -43 -87 -140 -113 23 -177 78
3147 78 69 60 70 -34 -29 -58 -81 -14 -187 -51 17 -59 -23 10 -33 -82 95 18 -11 34 86 0 131 105 40 -21 -59 16 32 2 66 77 -11 91
2850 91 -5 51 -15 -27 -41 -80 30 -55 23 -9 -24 -42 -89 -1 32 -6 -6 17 -44 1 -66 -49 -22 -7 168 54 -34 -26 -56 -16 -43 -24 45 -48 -62
2544 -62 -28 -89 -11 -16 -25 -16 10 8 -35 51 19 -59 -175 -21 -110 66 31 50 11 -123 -63 64 34 -122 159 112 93 32 57 -83 12 10 64 20
2246 20 -19 75 -7 34 81 223 123 47 17 -13 -35 19 50 51 -117 40 89 64 -65 -107 -110 76 7 109 -27 65 104 11 12 63 -140 29
1966B9j35l7L6J35p1k6P0R5j14J91j38J04j20j57J84o9J69q3j05J25j08p3J36p3P9PQ6k21
1721h4J16n8kJ6J2k2M2J4L1q2q1O0o8R1o6O4k6Ll0O6Nn0k0J4j1J5o5j1J43r7KK7q1K11m1o2
1406b5j1n9O5J18J18lk08j02K2J49q6o6K7j1Q2m1J26j61K06j43P4j9n5Q5N3m6p7p0K3OJ36
1135A07j58J11q2J3Q8j37M1l6P4p6J29m2j9O2r8Q8n0j40M7J06j53J86q3O9p0N5k0k5K0j3Q5
863G9l4p3q0K2J75K4k70R1J34n4p9J17J8j83P3P0M4m9n4K5K8O0n3r2K0J55k68J04k8J4J20
592E6k3P2j0r3N8j19O3n5j2ll7J6L8O3o5j2k0L1m0K49j38J13q8j6K0Ro5m7P1j7l8l0K7J9K7
286Dj31Q7N7O7lj3j40N5K9L3p2n0M2o1J31R3j65M9m1jj31K2Q6j4J32K7j18k2K13k10p7J19
6cM0ROq6M7M8O4r9j07J77j02Qo8O9J1m8k8J5J06L1j25N8L1n8j0O1J
$$ plain form
1966 29 -106 -143 -107 28 -43 -69 1 96 -18 173 35 139 19 -138 46 -23 146 63 -42 83 -25 -98 38 -35 44 51 137 -84
1721 -84 32 -26 -28 -12 0 -22 20 34 65 -17 -98 -38 -106 -15 -81 -17 -43 -40 -70 -4 1 -49 -69 -55 -66 -51 -116 -127 16 -81 -79 -52 -133 78 37 -25
1406 -25 -36 -95 -30 88 206 203 -5 -107 -85 64 -22 -88 -61 -72 10 -31 95 -66 140 -3 71 52 -3 82 135 89 12 -58 -35 -29 107
1135 107 -51 60 -22 -9 79 -58 -17 -53 21 -55 74 32 13 75 -23 65 15 -125 -78 28 -125 61 -22 47 -23 32 12 -13 7 -6 79
863 79 45 -28 -108 -86 89 113 -157 -66 68 14 -65 52 70 -113 -40 30 74 25 -29 -4 24 84 31 -61 -41 114 -154 -50 -78 -64 56
592 56 33 105 95 2 60 -59 4 -51 -63 -66 -103 -87 -49 14 -51 -63 -83 -52 -92 157 19 132 44 28 48 57 -8 -55 16 -1 -39 -69 -42 -23 4
286 4 -127 -40 17 84 81 68 -72 -17 12 45 -27 -77 -35 -96 35 128 -37 12 -29 -30 -161 -139 -53 -67 65 92 -26 -48 165 -45 -122 -3
6 -3 37 46 52 -34 13 61 125 26 -81 96 -6 2 -66 3 14 -34 -62 -47 59 90 -35 23 54 -4 -14 47 48
-230D8
##PAGE=	F1=3709.86
##FIRST=	23146.756194512010552,	4241.1435120000014649,	-0.23295348882675170898
##DATA TABLE=	(F2++(Y..Y)), PROFILE
4241D8J3KK1q0o7N6J7j64J93j5J01j29M0m8R6j26L3J41j53L4j81J60r2O0Q4LL9K7j67N4j8
3970a8k7j20K77o2m6Q2j3l2m1K4rQ1n9l9j6J03p0O3j75M8jR9j61oN8lO3q3O6j6L7k6K2o3L7
3664b6k5O1R6o5nl9p8O8r9O8l4O3p3J39k2n5K2K6j09R5m7J26l5P8j06M5k4ln4p9m9R7J2P5
3366D4O4o2N0r5j9N5J02n2M5j15pj28J05J55k12rM1J76j74r7J9K2J45j96K57n7k3Mj44J5j3
3095a04O4M3k16J04J09m7L2J4k3pJ63j07l1o1Q9r2J41N3j00n1k6R1l8o6N1j4J8N3r0Q7o4J3
2815a2k1k5Q9pkl8k2L3m9P1k0jJ4%n9K7k5N9k8RJ78r9j27M1K9k2n0M2N0j35Q3Mm8Q7lp1N4
2491FR2j10j1K3J4o6j30J16kJ60n8J4o0j28O6J55m7j33K49q6J6n5O5j96J01K6P0l1p9O0n8
2220a7J00K0J23j47l5o9m2JO2N3M5k00J61J13j23q2k9m5J74m5M8j50J28M2j6o4N7j33J20j69
$$ plain form
4241 48 61 63 84 4 -63 -7 10 -154 39 24 125 -4 36 -12 84 -42 -9 132 -21 13 -168 -8 -100 -40 44 47 86 113 -54 0 -18
3970 -18 -45 -165 112 50 4 86 73 41 0 24 15 96 37 -2 -18 85 15 78 -97 -49 -50 49 -112 -118 -60 -63 0 -83 -17 -33 4 -22 0 -63 -26
3664 -26 -51 10 106 41 36 -3 -81 -13 -112 -44 -78 -15 -88 51 29 -26 -4 22 -87 8 -39 87 52 130 24 69 45 42 -12 -91 -140 -43 -31 44
3366 44 108 46 96 1 -18 37 139 87 132 17 10 -118 -13 142 -70 -79 -38 138 -36 -133 -114 -92 53 -143 114 57 34 38 -106 -91 -104
3095 -104 -40 3 -213 -109 0 -47 -15 -1 -24 -31 132 25 -6 -67 22 -70 71 124 24 -27 -53 38 0 -66 -15 -29 -11 42 -48 39 -25 -12
2815 -12 -33 -58 31 24 22 -16 -38 -5 -54 17 -3 -4 10 10 -49 -22 -47 12 -16 -7 171 72 -55 -14 15 -7 -57 -15 35 -100 -17 -13 -61 26 23 -48 6
2491 6 98 -12 -23 0 14 -52 -182 -66 -68 92 34 48 -12 -140 -74 81 34 -99 150 64 80 25 90 -106 -5 21 91 60 -19 41 -17
2220 -17 83 103 226 79 44 -25 -67 -66 -4 49 94 -106 55 168 45 -37 -66 -111 63 18 66 -84 44 86 70 6 63 -70 50 -119
1957a19LL6O6n7J8J2J64j87J92o6M9j25j02J53l4J34q9o5J03j07r1J68j01R0mK7j57J37r9
1703e1R3mJm4L4k2N9p1p5O8j12R5p9N1K3k8j5M8MJ1m4J4n0L8j0k2J21j11NM1o0J64qp4n2l0
1388i2R2N8J33Qj97p8L3Q4o3o0K6k4Q3l1J23j64K08j68J08n7l7J14m2N0j03j24R4J6J59j74
1126b5L9q0Q6L4k12J10k9M1k5J15m2jM1l3L9q0r3L9J27j88J56p0O6k4R1n7p5N2j8J25q3r6
846g0K4m3J36O5k91J08J42k1q1K9P0j75M0P5L0Kr5R4k6J1k1k0QJ08k29Q4m9Q1J32o0N3po2
557D2J6j44Q6J0k9j1o0O4m3P4m8pj7k0l5K73j29J10m1j10P0m7k0p8Q6J4n7kK5RL5j05R2L1
260C4M8j3K2j27K5MN2q8m5J11r4N4P7q9K9q2M0q9K1O4RJ25L2j60j9K06j31j24J44L6Jj1o7
-29eoO2P9j13q6J50o9j8m5N4j5J6n1jR5L4r3O4Mq4K4L7J4
$$ plain form
1957 -119 -116 -80 -14 -71 -53 -41 123 -64 128 62 111 -14 -116 37 3 137 48 -17 86 -21 -112 56 -45 45 41 68 -89 48 -51
1703 -51 42 38 39 -5 29 7 66 -5 -80 -12 -124 -29 -108 -57 -34 -62 -77 -29 -25 -14 -58 -44 -94 -56 -66 -88 33 -78 -73 -32 -92 72 64 -10 -62 -92
1388 -92 0 58 191 199 2 -76 -43 41 -22 -82 -56 -80 3 -28 95 -69 139 -29 79 22 -15 99 57 107 4 -120 -26 -10 149 -25
1126 -25 14 -66 20 54 -158 -48 -77 -36 -61 54 12 11 52 19 58 -22 -115 -76 51 -137 19 -51 15 -9 82 25 -50 2 -16 109 26 -70
846 -70 -46 -89 47 112 -179 -71 71 50 -31 -2 68 -107 -67 8 38 40 -55 39 13 24 3 -17 -9 99 -130 -46 -95 -14 118 58 111 104 42
557 42 58 -86 0 10 -19 -30 -90 -26 -69 5 -43 -50 -67 -87 -122 151 22 132 91 -19 51 4 -16 -94 -8 6 -51 -53 -28 -19 16 -89 3 34
260 34 82 69 91 -36 -11 -7 45 -43 -88 23 -71 -17 60 -29 0 -82 -42 -131 -110 -46 -37 88 120 -40 -59 147 16 -108 36 72 73 62 -5
-29 -5 -11 51 130 17 -69 81 12 -6 -51 3 -12 4 -47 -48 47 81 -12 52 56 -28 -4 33 47
-230D7
##PAGE=	F1=3615.51
##FIRST=	23146.756194512010552,	4241.1435120000014649,	-0.3059069514274597168
##DATA TABLE=	(F2++(Y..Y)), PROFILE
4241C4L5k2J8p9n2J17m0j67J85%N9j20O2lN6j03RJ39j71Q7j95J50m4M5Q6M5L7m8j85P6l2J4
3961gj67L11j52NR2J5m3m0pk4J00l4k3q1J52q3K3j18K3J9N2j46O0K9M0K5j01N4k9P9p4Q6p0
3672c4nJP5O0m8m2n2l4M1o8O6p1O1oJ13l6n2K8L3r4O1o2J59k2J6q0N9Ml6p0L7j13L0O2L1J04
3357A16j19O1o7k8N7J36q5O0j10k6r0R5J54k48k4K7K13j33j28N1J5J21j42K17o9n5j6j46L2
3104a31K9J09J8k56N3J63j7L6kK0R1Q4j75m4j32Q5q6J61Q5r3m1QO0o0p2L3j5R2kp4O8m6O0
2815Ik4m0Q2N9r1l5NQ0q8N7m8J4L7ro4J2L2R0q2%J60p8j31M9P7p4m6M7L3j83J84j6n0P6Pq6
2500c5N5J34j59J9o6M1j4j24L3J11J03n2j1q8o1L3J85l5j43K23j40O0n0Q2k21J00L9N0Oo4
2237A1j1j9J34rP7j61mn9p5J5O5P3P0j76J55J53k09pl5r1J34k0k3j25J40M3M9j01O2n5O5j61
$$ plain form
4241 34 69 47 65 -14 -66 51 11 -156 29 29 88 -32 30 27 83 -20 -11 128 -43 44 -151 -1 -45 0 86 131 168 120 -65 11 -21 -7
3961 -7 -174 137 -15 -10 82 97 54 14 7 -17 83 49 26 -55 97 14 37 -81 -58 -39 13 -133 -73 -44 -4 21 -80 -26 -55 24 -50 36 -34
3672 -34 -39 -38 37 97 49 7 -45 -79 -38 -106 -40 -111 -50 -56 57 21 -31 -3 30 -64 -3 -65 94 72 88 8 67 71 35 -35 2 -111 -81 -19 12 116
3357 116 -3 58 -9 -37 20 156 71 131 21 -5 -95 0 154 -94 -118 -91 122 -11 -139 -88 -73 48 -94 123 54 -1 -17 -163 -131
3104 -131 -102 7 25 -231 -178 -15 -32 4 2 22 113 197 22 -22 -154 -69 -155 6 91 -2 -43 -35 25 -35 -107 -74 -89 3 1 -73 -5 -51 9
2815 9 -15 -55 27 86 -5 -40 -35 45 -43 14 -34 -20 17 8 -56 -44 -12 78 -4 -4 156 78 -53 -4 73 -1 -47 0 33 -150 34 18 -32 44 51 -35
2500 -35 20 154 -5 14 -52 -11 -25 -149 -116 -5 98 46 35 -53 -114 -81 104 69 -74 149 9 69 19 101 -120 -20 19 69 75 11
2237 11 0 -19 115 106 183 22 18 -41 -116 -101 -36 37 107 -69 86 239 30 23 -12 -103 31 11 -12 -137 3 46 95 -6 56 1 66 -95
1957i5J3L4mk0M3k2J79k12J65k4J8j02o8J45qO4o4k5M1r0p3J89r0M6j1k2n2J20j21J37j8k2
1677E1m4K6k4O8p7l8M9j33J15j08L4M2l9j1L6J2N5m2Nq8P5K6j8Q2j09K5K1n8J20N5j11q0L5
1388d8O0nJ44Qj48n5P4km5o8M7k8O6j4J04j48J84j82J25n1m0J13j10J19j08j61J50K4J30j52
1126a7K2r6J59m0k72J64j4K2L8P2m5PL4J5Kj28jK8J56k34J00n9Q4nJ16p1j12O2j5J57j04j39
846a14J53j00P1P4k39R2J19Qq6j3R2j59L7L4J5N2j01J14o3k8K1P1m3K4j38P5l7J12J18p7N
575H9Jj6j4j62J04L6l3Oq4J06r4O5l8pnm9qK07j06J17Mj71Q9q3L3r2R2N0q6K1J7j4L7o3R3
268D2J0M1j0K7j14mj0N1o6m5J73j31rN0j7Lq9Q0o5K8J4L5J04K7j91K7J54m5j60J48L5pl7l6
-29A3o7Q9O7j02p6J34k1n7j1M5p0J08o9l3Q2L8m9M5k3q6O2k7M5
$$ plain form
1957 -95 -82 -48 -52 -72 -29 -51 128 -84 81 57 75 -27 -95 50 42 106 42 17 58 -32 -105 84 -6 40 29 7 -45 75 -46 91 73 51
1677 51 7 33 9 77 0 -38 11 -122 -7 -115 -81 -39 -78 -89 -53 -41 14 -28 -23 -111 -36 -10 -28 54 -55 -30 -9 -67 53 108 -3 -83 -48
1388 -48 12 7 151 159 11 -44 30 28 -17 -85 -38 -66 0 -14 90 -58 126 -56 69 18 -22 91 -19 100 -8 -169 -19 5 135 -17
1126 -17 5 -91 68 28 -244 -80 -94 -72 -34 38 -7 0 34 49 51 -77 -78 -50 106 -128 -28 -87 -3 -8 108 37 -75 -13 -28 129 25 -114
846 -114 39 -61 10 84 -155 -63 56 64 -22 -35 57 -102 -65 -31 -16 36 -65 49 -14 -42 -21 50 7 31 -107 -32 -69 43 161 84 89
575 89 90 74 60 -102 2 38 5 11 -73 33 -61 4 -34 -41 -46 -95 -103 104 -2 115 119 -52 37 -46 -13 -105 -13 37 -49 -28 -11 -25 12 -51 42
268 42 52 93 83 110 -4 -8 -18 33 -33 -78 95 -36 -45 5 -12 -9 -98 -18 -83 -55 -41 -6 98 125 -66 -39 115 70 -90 58 93 86 49 13
-29 13 -54 35 102 0 -76 58 37 -20 -31 14 -56 52 -17 -50 32 70 21 66 43 -43 19 -8 37
-230C7
##PAGE=	F1=3521.15
##FIRST=	23146.756194512010552,	4241.1435120000014649,	0.31925633549690246582
##DATA TABLE=	(F2++(Y..Y)), PROFILE
4241A6M8m4Rn1l6J36o9j33J42J2J9q9O9J6L5q1OJ00j58J49k08J37l6K8J02P7J8r6j72O1j0
3970cL3j95L06k02O0Q9Ml4j8l0m8J14Nm4j17J80r8Oo2K4%J0j06Q5K4N4lp4J6l1R3j17J36m9
3672Hn6K6Q3L7n8m4p7K6Ln9N3p0O5L7Q2o1k8L3M2o4K4r7J78k3qn8N6Qn5q4J57j31n0Q7k7J54
3357A09j57P5m7m0O6J63j41P1o1p2k4P1J33k52m0lK33o5j31M9J0O2p3J63m1r7j9j18L9P3J10
3086D6J0k78J8J83J0M3j3J12K84m5l30o8j40N5j03J74P2n4l8M3jm1n6J2mJ29l7o8J5oJ11l5
2806@n7P4P7j49k7O5R5j29N1m1J3N7j0q0MP2J20j05l6J24m9j00K6J10r8m0L9J8j95K49k5p2
2526a9N5K0n6K2J26j34M4j54O6M3j08m9K01K9l1l4j09K6l5K25j7j64K02j86R5m5R0k14P9M2
2264A0NM2mp8J2J27m2M3j33klj11J3N7Q6O3j13J30J47k25P2n7j25Q1%q7o2R9N5Q3r4N2oK5
$$ plain form
4241 16 64 20 29 -22 -58 78 9 -124 18 30 49 -40 29 45 80 -1 5 105 -53 96 -112 25 -11 17 119 196 214 118 -54 7 -3
3970 -3 30 -165 141 -61 -1 88 92 58 40 10 -38 76 81 37 -80 100 2 8 -54 -30 -30 -20 -126 -41 -17 37 34 -40 -24 -55 38 -79 57 8
3672 8 -48 -22 61 98 40 -4 -81 -55 -52 -111 -58 -128 -63 -26 56 -5 -33 0 42 -22 2 -95 83 60 52 -6 50 58 3 -81 76 -55 -105 -18 -45 109
3357 109 -48 27 -20 -60 6 169 28 99 38 -34 -58 13 146 -106 -146 -149 84 19 -112 -63 -53 9 -64 99 58 -39 -58 -176 -137 -64 46
3086 46 56 -222 -204 -21 -11 32 19 131 415 370 40 -28 -168 -113 -216 -42 30 -24 -62 -19 -20 -61 -117 -105 -109 20 -17 -85 -70 -76 35 0
2806 0 -57 17 94 -55 -82 -17 78 -51 0 -41 -28 29 19 -61 -57 15 135 30 -6 118 69 -31 -5 105 7 -33 6 24 -171 78 53 -19
2526 -19 36 56 0 22 148 14 58 -96 -30 13 -95 -144 57 86 55 21 -88 -62 -97 128 111 -53 149 -37 58 13 103 -111 -32 10
2264 10 15 57 53 -25 -13 114 72 115 -18 -20 -23 -134 -121 -64 22 85 -28 102 249 24 96 39 -86 -5 -5 -92 -154 -55 0 83 -11 41 35 60
1966F0j07PJ9n4M8K2k2J46j86J10qQo0o1J40Oj2j4Pk5q0j5J74m3k9mn3N2P3r4J05l5l0k1K
1660B6J6N1r4NJ7j19J35j36K4J9j9k3L5K5P4k3j2j00J03K0nN8r7L7qn8Q3J21j60q6J05nn5
1371d6J56lp9n4J34q8m0q2R9n2M8PQ4j34J57j68J10qo3R0j32J41r4j71J56M3N3r1N5j10J93
1100A11j02k91J92KJ4R3K1p7J9L1L7qj71J11J3J74k76L7m5J00j1J31n8j42P2j2J70j04j82
846a51K63j33RM4j43O5P6L0r3j2R2j45N7k7lQ5p4Q9q1l0M5J36j11m5m5P6MJ05R5o6n0j0M8
557A00k6j72J02L5m1N4j00J21j04L9l3j7K2m8J5Q5p0J26K4j63P1r1O3p8R2O5j03L6pm3L4k2
277c4J05lM2J1mj03k7j0L4j5n1K05j52l9K0K7l0n4J12q3M8k6M7Q6mj90R4Q7qj65J26L8Np6
-20A3jr9J12L1p5p5J34J0q8L0M0j24J79q1n5O7M2j4Ok4p4Q4r1P2
$$ plain form
1966 60 -47 -40 -21 -75 -27 -5 -27 119 -67 43 35 43 -17 -78 62 68 56 42 49 24 -56 -71 103 60 31 27 -26 26 99 5 110 75 45 24 26
1660 26 42 93 -1 4 21 -98 37 -99 -75 -56 -75 -98 -63 -38 36 13 1 -99 4 24 19 77 -20 17 9 -49 34 155 -5 -91 14 9 -46
1371 -46 110 107 28 -26 108 20 -20 -102 -3 -55 -7 0 84 -50 107 -61 49 41 -22 68 -64 77 -17 -188 -32 11 64 -27 28 -82 111
1100 111 9 -282 -90 -88 -74 19 40 -37 -18 13 50 42 -129 -18 -5 169 -107 -70 -115 -15 -26 105 47 -95 -23 -35 135 31 -151
846 -151 112 -21 -12 32 -111 -46 30 60 -33 -45 47 -98 -41 -68 -71 14 -60 29 -52 -82 -37 99 -12 -57 -102 -26 -22 83 178 112 62 52 100
557 100 74 -98 4 39 -2 52 -48 73 -31 8 -25 -42 -20 -68 -53 32 -38 88 112 -51 20 -71 -8 -86 6 71 -32 4 -3 -46 -12 -34
277 -34 71 68 110 121 117 14 -13 -23 11 -4 -55 150 -2 -41 -21 6 -24 -78 34 -49 -1 -27 20 106 102 -88 6 93 85 -80 46 84 89 13
-20 13 12 -87 25 56 -19 -94 40 50 -38 -8 32 -92 87 6 -49 18 60 46 52 28 -46 38 -53 19
-230A9
##PAGE=	F1=3426.8
##FIRST=	23146.756194512010552,	4241.1435120000014649,	0.63947010040283203125
##DATA TABLE=	(F2++(Y..Y)), PROFILE
4241fN0n0j3jj6R6n9q3Q6K2ln0O5j0M7n7J3L7j14J86k06J27p8K0J17R5nj08j34L4K5K1j94
3952a46K72k06R7P3k7nKl1p4J23L5q9j20J82j00JlK9l6rn5P1K9L8qk0m8j6Q7j43J64k0r0L0
3655a3Q0M1q4j6j04Q8l6p8L1l2O9N1N7q9MK9M7j8j3j37J92l9Nn7M3Lo0j00K37j03j11Q6r2
3366a19K12j51P0l3m1P8J51j69N0Kj31M6N9J06k29n2l0K20%j10L5kLl5J24Mj32J1p0K9Q7Q4
3086F7K5k80K6J48K5M6k5K55N50j82n67q5r2L7j66J54N0j7l8N7o6Mm3l2OJ48k4p6l3M2J49
2815F3o0m7N1M3j56k0J29O1j23M9j2MO6j2r8LP6J56r0j00Q5k1n3lJ23r4n7L6Jj46K45k6r7
2526b4L6L2j0j7P6o2M6j99J00O8r2q8K29k5j8l9j14Q8j08K73j8j75J70k07J16k9J01j89L7
2272d2M6m6N6O6j00J5R2p1L4p6l2P0j21mL3Q0L4l6Q1R7j47J26q1j31K5K1j28RJ7P2R7n6J9
$$ plain form
4241 -6 44 -6 -19 -20 -36 60 1 -82 4 26 23 -27 38 28 75 18 31 68 -46 140 -66 61 -17 3 120 215 210 102 -32 2 27 48 -146
3952 -146 126 -80 17 90 63 58 60 29 -45 78 113 24 -96 86 -14 -13 -16 13 -23 -32 -87 -16 13 51 43 23 -25 -41 46 -97 67 47 -43 -13
3655 -13 67 108 24 8 -96 -8 -44 -122 -91 -123 -54 -3 54 -35 -31 -2 45 27 14 -123 69 30 35 -22 21 24 -36 -136 101 -2 -113 -27 -119
3366 -119 93 -58 12 -21 -62 16 167 -2 48 50 -81 -35 24 130 -99 -151 -181 39 39 -71 -36 -38 -35 -70 54 58 -74 -63 -133 -104 -17 67
3086 67 92 -188 -162 -14 11 57 32 287 837 655 88 3 -89 -52 -218 -64 -14 -31 -69 -12 -78 -74 -117 -149 -143 5 -19 -95 -128 -86 63
2815 63 3 -44 7 50 -106 -126 3 64 -59 -10 -22 -18 48 36 -62 -59 17 173 83 -17 68 47 -6 -9 114 20 -37 -1 0 -146 99 73 -24
2526 -24 12 44 34 17 93 31 77 -122 -22 46 -46 -134 95 70 52 13 -101 -13 -121 152 134 -41 129 -78 38 9 110 -79 -42
2272 -42 4 -42 14 80 -20 -5 87 16 50 -26 -58 12 -109 -113 -80 0 34 -2 79 176 29 155 74 -57 -32 -11 -139 -130 -113 -41 56 0 19
1983A9kRk5Kmp1J25l6j0J02j29L4%Qj9o4J17J3o9K9M0o8p8N5J18L1j05Ln9J30J8k6J7n4qL
1668D6m2P5K1j06M1j7p7J33j44J7j4J2m0L6L5Q4k0j4q3J06k0RO4q8K2k2l5N2J52j97p6J53
1388F3n3r7J75k7k4p1J89j51l5r6J62r7M1L3O1j21J37j24O4M8r0N1r7J15p0j58J05O7l2oR9
1117F1j06J78j30k64J85J7J0J23j9j26L6J8M0Mj85K06qJ70k97ol2J02l8J34k0j64R2j4J59
863A26r3k08L22j35k9ln6M2L4M4r4RQ0j33P3n6k2P7j8M4r4J0L2J51j55p3RP3N3P5Q6l6q6m7
566BJ16k3j66P8K7o7J05q8J07r1J0k1l9N5k9J8k1l8J21K4r8L5q6N1l1Q3M8q6M3m6p4L7JJ32
268H9j3L9M6n3q5m9jK2L9o7K04j51l7j1N6p0LJ27j36Q1m0M7P4n5j49J43L8l8j32Q4M0M4j31
-20d2M7r4J08rm2p2J37J2r9O4M8j65J99q6n0N5M5j0k7Mo5Q1j21P8
$$ plain form
1983 19 17 26 1 3 -1 -72 53 17 7 109 -20 14 14 22 3 -61 56 69 0 29 69 1 -77 -22 96 127 22 25 -34 96 114 88 105 51 43 46
1668 46 4 79 100 -6 35 18 -59 74 -70 -53 -67 -55 -95 -59 -24 60 40 26 -57 49 29 38 102 14 36 14 -21 31 183 -14 -90 63
1388 63 10 -87 88 61 37 -34 155 4 -31 -127 35 -62 -21 12 73 -48 89 -35 29 77 -13 38 -59 56 -14 -172 -67 0 -32 -38 61
1117 61 -45 133 3 -261 -76 -59 -49 74 55 -71 -35 -17 23 27 -158 48 40 210 -87 -93 -125 -23 -61 73 53 -111 -19 -33 126
863 126 33 -175 147 12 -17 -20 -76 -34 0 44 -50 -41 39 -94 -21 -77 -99 -22 -40 4 -90 -80 -48 103 -52 -125 -116 -43 10 85 171 135 49 2
566 2 118 95 -71 7 34 -33 72 -16 91 0 10 -11 -50 5 -24 -6 -27 -65 56 80 -18 17 -69 -18 -49 34 82 -4 39 -7 -81 -44 -43 89
268 89 76 115 161 108 23 -26 -27 -5 34 -33 171 20 -17 -28 28 -42 -39 88 -48 33 -7 40 114 59 -90 53 91 53 -79 5 45 89 -42
-20 -42 5 -89 19 10 -32 -104 33 45 -54 10 58 -107 92 6 -44 11 56 46 19 23 -42 39 -82 -4
-230d
##PAGE=	F1=3332.44
##FIRST=	23146.756194512010552,	4241.1435120000014649,	0.132238045334815979
##DATA TABLE=	(F2++(Y..Y)), PROFILE
4241c3M2l4n2O2J3K0k0n4L9K9Mj8N6p5Q4k3Nj2o2J79j79J18j39J7J20R3rj03q5K7N1k4j60
3952a23K22j86J18M5m0K1Nrr1J10N5j32r3J58r0j0P5Qn9jnL6J9J6%K9j26K5P2j50J67lq7J0
3655a4P5O1j14L9j29J23o2j00jK6N9M9M0r5J7PM9M1o5j53K04n5K7p1L1J6o2j16K57p1j21P6
3375c2j48K68j16L9k9j0Q0R1j38KL9j80R3P0Q7j90n0m0J60M1o9K3k7k2m5J13L5j45N7nPN8
3095A7N1M8k72O0Q7K8M0l6M01P77k72p82q1l2M6k46R6M4Jk9M4j04M7l6q1J6J27L1r2n4P4J74
2815I2r8kJ3j5j22k3J71j4o0N5J1j1O8k9j05J2N6J86o1j56N5kj2pJ11o8j03M7j4n1J64k2r7
2526c1J8M1K7m3J0J9J5j79J33N2q8o8J83l2j6k2j13J08j54L13m2j64J11j94J23mJ20j62qN2
2264Er4N1J14o4j8N9q2L8k2o4J19r9k2nM5J2L0K2K1mJ38j01j01j8M6j44N4n3O8J02nl6k4J3
$$ plain form
4241 -33 9 -25 -77 -15 -2 18 -2 -56 -17 12 16 -2 54 -21 63 40 45 33 -29 150 -29 89 -50 -33 87 180 171 68 -17 10 61 37 -123
3952 -123 99 -87 31 76 36 57 62 53 -38 72 127 -5 -98 60 -30 -40 35 43 -16 -17 -22 14 33 49 49 78 -48 -23 49 -101 66 63 -24 -14
3655 -14 61 122 8 47 -82 41 -21 -121 -122 -96 -37 12 52 -43 -26 -19 30 71 6 -147 57 2 29 -42 -11 5 -57 -173 84 13 -108 -32
3375 -32 -180 88 -28 11 -18 -28 52 143 5 7 46 -134 -41 29 116 -74 -124 -164 -4 37 -32 -9 -36 -58 -103 10 45 -100 -43 -48 -41 17
3095 17 68 116 -156 -96 -9 19 59 23 424 1201 929 147 66 34 80 -166 -70 -26 -25 -54 -10 -114 -67 -103 -184 -168 -41 -10 -102 -156 -82 92
2815 92 -6 -8 5 -10 -132 -155 16 2 -58 -3 8 -3 65 36 -69 -57 -1 185 124 -32 23 21 9 2 113 45 -58 -11 -25 -76 88 66 -31
2526 -31 -13 28 55 12 22 41 56 -123 10 62 -26 -94 89 57 41 19 -94 14 -140 173 131 -33 78 -116 7 3 123 -39 -47 5
2264 5 -89 -38 76 12 -6 53 -29 9 -13 -77 42 -57 -79 -84 -39 -27 3 25 46 42 180 79 -22 -40 6 -138 -84 -137 -69 33 28 -8 -32 -19
1966a9M7Ql0m4J69r7mP7p5l9J2NLm6O5J6r7M8P5q3o2R4M3J06j56qm0J70k1M5p3p1M2Mr5J15
1651H4lr5P2m6l5J10j24Ok2J9l8K8K8J05n4J6n5Q0o4J8Q6p1k8rJ5K7J27k04o1J73n6j32J94
1362I1o6oq3K14j73j2j14K03j36N4N0L5j06J21o6PR1r9Jk0O5n3j25K4P2p7P6J19r1J30j17
1091Ik07J40M0KJ15k8j65M2kL7K0j57K61l4J33k80j6k6R5p9J15L3j65J13k7J34p9k01L13j08
828B8k8m9j9K8J1M7q1L1O2j14N5k1l9K4N5J8j27O9jJ18j49o1J3N3Q6M8Q9lr2r1J59j1j42M7
531A3J5r1J17m4Q2p3oon6P0j6J9o9k2Q8K7k0Jq9J1L6N7J3k6L3p7j11O4j2J57j7K7Q1q3o3o8
216c8RK7P7r6J77j30j7l4P5j08N6J18j90J16m0M3O7q9q9J42K5j10p3M4L2R5j95J22q0P2l2
-55b4oo1J22Kr3P9P4j91J64q1k4M6M7l2k9M2p0N4j10N8
$$ plain form
1966 -19 28 36 6 -38 131 34 30 107 32 -7 5 10 13 -33 32 48 -49 -1 74 -9 -71 23 66 172 16 8 -32 138 117 162 89 18 60 64 -31 84
1651 84 81 -14 58 12 -23 87 -37 -31 -53 -34 -72 -44 -16 89 35 51 -4 76 12 30 116 45 17 8 23 50 177 -27 -88 85 29 -103 91
1362 91 25 19 -64 150 -23 -35 -149 54 -82 -28 22 57 -49 72 6 13 104 5 6 -14 51 -2 -127 -103 -31 -108 -32 87 -4 126 9
1091 9 -198 -58 -18 -16 99 71 -94 -52 -54 -17 3 -154 107 73 206 -74 -90 -116 -21 -100 15 48 -117 -4 -31 103 24 -177 136 28
828 28 0 -49 -68 -40 -29 18 -63 -32 30 -84 -29 -50 -89 -65 -10 8 -119 -50 -51 67 -82 -143 -130 -77 9 57 146 143 51 -40 119 108 -34 13
531 13 28 -63 54 10 92 19 13 7 -49 21 5 24 -45 -67 21 48 28 29 -60 -49 -13 44 57 31 64 -13 -124 -60 -72 85 68 95 176 93 30 -38
216 -38 -29 -2 75 -21 156 26 9 -25 50 -58 -2 116 -74 42 2 45 112 23 -66 76 101 -9 -82 -38 -6 89 -106 16 -64 8 -24
-55 -24 -30 -91 31 33 -60 19 93 -98 66 -15 -39 7 54 22 -7 35 -35 19 -91 -33
-230c3
##PAGE=	F1=3238.09
##FIRST=	23146.756194512010552,	4241.1435120000014649,	-0.063989557325839996338
##DATA TABLE=	(F2++(Y..Y)), PROFILE
4241f1L4pr7J13N4m8J8n5MK9M0j0N3j52J24J9k2k4k9J37j32J10j73OJ05O6J3r4m1N1N9q4j05
3952i9J62j61J35Qj6J5JK9r1O4O5j44m6J14p8l6J79o7m2K7K8Mk3K0kN0j89Q7M5j39J47Jm9
3664ak0P7Q0j41R9j39J19p8r7l2P8L0M0L2o2ok3M4R7j26j37K05m7K6q7L4N8o8j23K25p3p8
3384i4P1j77L08r0jl7M9N9Pn1m9L4j95J04R2P7j44l5l6P1M6j4J1o4Mq8J29L2j30Q9O6j8J0
3095C6J9N3k51Q8L2K5L1m5M81Q27k85q36n6oN7k79K8N8KkK2j02P2KqK8m3O9j09m8O1J94j38
2806b3O0k7n7o8m9J78r9L0P6J7m3P1o6r0L4L8J92m5j69L5RQK2P4k0j69P0j9M8L6j3o3qN1L8
2500E9n1m5Q7m5j02J39J9r5j2R4Mk2Mj10R8j61L26q0j29L0j51J12K6J40j41l9N4j29L9J27
2237D6Lp0N6p5M0lo6J24o1l1l8k1J9P6k8m6J31J17j19n4l5P6j35N4o2K8R3L7q7m3J9Q8J3n1
$$ plain form
4241 -61 -27 -34 -131 -18 36 -12 6 -49 -45 -16 24 14 67 -85 39 58 36 12 -17 120 -12 98 -75 -69 36 102 115 21 -20 31 90 6 -99
3952 -99 63 -98 37 45 29 44 45 74 -17 47 112 -32 -78 36 -42 -78 101 34 -8 19 47 51 28 48 46 96 -93 -6 39 -100 47 48 -1
3664 -1 -21 56 136 -5 94 -45 74 -4 -101 -133 -55 -25 15 47 -15 -21 -44 0 97 -29 -166 39 -8 18 -69 -35 23 -45 -168 57 -16 -94
3384 -94 -23 -200 108 18 17 -20 29 88 95 44 -5 29 -166 -62 30 107 -37 -72 -108 -37 9 -5 6 -58 -54 -142 -13 19 -111 -22 44 26 36
3095 36 55 108 -143 -55 -23 2 33 -12 469 1296 1011 175 119 113 170 -109 -81 -23 -21 -23 -1 -103 -31 -29 -37 -9 -52 17 -92 -140 -79 115 -23
2806 -23 37 10 -47 -115 -164 14 -85 -55 21 38 -5 66 0 -90 -56 -18 174 129 -40 -5 4 12 34 108 88 -81 -11 -30 18 54 41 -22 -30 21 59
2500 59 8 -37 50 5 -97 42 61 -34 -46 48 52 30 34 -76 22 -139 187 107 -22 8 -143 -31 -5 135 -6 -45 9 -120 -81 46
2237 46 49 -21 35 -40 0 -3 -69 55 -6 -37 -75 -96 -77 -1 -29 -75 56 173 54 0 -35 41 -94 -40 -102 -74 19 56 -31 -74 -55 33 46 -5
1940eJ7J53j25j2Q4m5q9L0mlLNJ0q8L8R9r2j1Q5j8J55j71m3rJ77l8Q6j17p2Q8k2j36J19j2
1642C7n3R7o5j9P8p5j7J0j5j2J6pJ39j03O4l6L5q2J5J00l2r3K2O4J2O5j82m6J78l7j52K00
1362A06j10k0p1J95j55L2j40K02j28P4L7J5q0R4rl2J04q6n8O9K6n8p5m1L9p0J29J15q6P9q2
1091A5j36O8O9nP1rj65K3rK8K5r0K58m9O5k26pk3R5j30P2Q8j31J16n0J06o2j57K43o5Qq1l2
802g7K4JM4n8M2M6p8nN7m7n1J19L2j76J10k3O2j08l1pK1Q0M4Q8K2p7j16J62Mj12K8j4p9Q0
505GQO7o4LOn5N8k5L3n9k4L1M6K8j0j09k5Q9J8j2N3Pp9j52J08m9J56j6K0R9p6m2p3OM0R8j30
181a9J34j03J6m4Q3j40R2Q4k05J33l6L1O0o9m5R8L1j76oK1J5J35k48K07q9K9m2L9m2Q1Kp8
-99e1O3J21k06R6o4ML4N1n7lO7p9J6q5L3
$$ plain form
1940 -5 12 165 40 28 112 67 -22 8 4 1 4 9 19 -69 -31 68 -24 -35 50 32 187 16 -27 -36 141 103 189 72 0 88 66 -70 49 37
1642 37 -16 81 16 -3 75 0 -17 -7 -22 -34 -18 -25 114 11 75 39 74 -8 7 107 75 -18 4 68 80 145 -37 -83 95 58 -94 106
1362 106 -4 -24 -95 100 -55 -23 -163 39 -89 -15 22 37 -43 51 42 10 114 28 -30 39 65 7 -68 -109 -70 -140 -11 104 18 97 15
1091 15 -121 -53 16 11 82 73 -92 -69 -78 -50 -25 -115 143 94 159 -67 -74 -97 -2 -132 -60 28 -103 13 -37 69 7 -150 93 28 36 -45 -77
802 -77 -53 -52 -8 -66 -24 22 -56 -61 -4 -51 -102 17 49 -127 -17 -40 22 -86 -117 -124 -103 -23 21 109 131 54 -62 100 104 -8 20 6 -73 7
505 7 15 82 18 21 27 -28 30 5 38 -21 -45 -14 32 60 50 -59 -84 5 23 11 64 71 -8 -160 -52 -101 55 39 59 158 82 40 -33 -27 13 111 -19
181 -19 115 12 28 -16 67 -73 19 103 -102 31 -5 26 86 17 -28 70 101 -75 -81 -60 -45 90 -158 49 -40 -11 -53 -14 -56 25 27 -51
-99 -51 12 133 -73 23 -41 -37 -3 48 -9 -12 55 -24 -8 -93 -60
-230f0
##PAGE=	F1=3143.74
##FIRST=	23146.756194512010552,	4241.1435120000014649,	0.090494282543659210205
##DATA TABLE=	(F2++(Y..Y)), PROFILE
4241h0K3K5j36J41R6q0L7p5j7J1R5k7N7k17J56N2n3mk5Q3p3J00j53k5P9J6M9p8qQ0O0j39m8
3952g8J01j39J62l5L3l1MP4p5kO1j15%O2p1o9K81j73J0O6K6j1q5O2l5M9k07J42Nj12J06J3
3672A9kl9P6R1j48J26j35Q9q8o2m9J10qK2L4Jn7m3K8J35j73j05J87j4mq8N9J08q0j14J65j14
3392g3MO8j66L04q8k4n6J07K0o4M8p2Jj67Q8J04P4j11j3k8j0J8L7kj01O5j31J58%j00R7J26
3112A13m1j9pL7j90J02j2LJ4n5M51O52k24o71k4j1L9k33k7P1PL2Qn8P6J28L40M4m77Rj19m8
2832i0OK08j67J12n2o5j5r3J57j63R2J26Jq6P5j11o3P2M8J64o7j23J9J9NO0L0M6k37Q9%J08
2552A05r0Nj0m7O2K6m9p7J39j10qJ05Kj04M2J4N0l1K3j04Q4j44K98j10p3m8r6P3N4J57j28
2281A0m9M5j41L9J00O3j16R1o2L1k3k5R4l7k7n0r4N5R0n6p0J94Q6j35k0l0J11j03K6j1m2O4
$$ plain form
4241 -80 -57 -32 -168 -27 69 -11 26 -49 -66 -55 40 13 70 -147 9 61 8 4 -21 62 -11 89 -64 -89 -10 6 55 -23 -31 49 109 -30 -78
3952 -78 23 -116 46 11 44 13 17 91 16 14 75 -40 -40 22 -49 -118 163 -10 0 66 92 81 -4 58 23 72 -135 7 12 -100 6 19
3672 19 17 -22 54 145 -3 123 -12 77 -11 -73 -122 -12 -20 2 36 37 -20 -63 -35 100 -73 -178 9 -5 -9 -97 -38 70 -10 -124 41 -73
3392 -73 -69 -1 -167 137 49 25 -31 76 96 32 80 8 9 -158 -70 34 108 -3 -16 -44 -54 -36 1 -1 -102 -37 -168 -10 -10 -110 -13 113
3112 113 72 53 46 83 -107 -5 -17 -14 0 -55 396 1048 824 153 129 118 157 -76 -103 -32 -25 7 15 -43 33 161 501 545 68 77 -42 -90
2832 -90 -84 124 -43 69 17 -48 -63 -156 1 -162 -70 56 57 -29 46 -65 -128 -56 -8 156 89 -34 -15 4 9 69 99 145 -92 -3 -3 105
2552 105 15 20 10 -37 25 51 2 -75 64 -46 -54 51 53 -51 -9 5 55 24 47 -57 27 -117 181 71 -2 -50 -146 -73 -19 138 10
2281 10 -39 6 -135 -96 4 67 -49 42 -20 11 -12 -37 57 20 -7 -57 -151 -96 -6 -62 -132 62 148 13 -7 -37 74 -29 -3 -14 -56 8
2001HO2j09m4J7J05rp2R3R1j11j8R6m6r3M7j8k9P7m4j1m6K2R1j13O6M1m1J57j46r4K8J53m0
1712G0Q9j00n5J01n3j43R1j2NJ18p3m1N1mm7N7p2K2J5o0J63j22R6l3j9o2jQ8L6j51N9P3QQ
1415A02j41k5J72k8j51J79j34m3l3J35j12Q4j74J65o5R2j7Rm7N4L3l5Q3n9j06J37J4q4j7o5
1152g7k2l5J43J04j01M8n4o1pR0jJ7J2j28oJ0J6JjK02m0k3j46j1oJ07j77J1J35p3J01q1Q7
863C4m4q4J39k3N8r9o1L2j0L7l2L2M5k7r1J19m0j03J45P4k08J07j0Op0%j9kL0O5P2L0o1j04
566f3J37J0r0L0n9l1K2L8P5o8K9Ol0L8n6N2k8k1m0P8K5K0j36l9J07k2pJ06k5m6j88J39p5J24
268A2k3L9Q4l5k9n0j9M3J09j54Q5q0N6l7P2j63J12K9j58J22l7%O1Kl5M3K7j96N1J5LJ41k62
-20a72K60j26Nm3Q5k1K9J9o1K0J68k03K3k9MJ6O0p1L7P2p5k1p7K6
$$ plain form
2001 8 70 -39 -83 -66 39 30 -42 51 142 31 13 109 63 -30 17 -1 -30 47 3 -8 -54 -32 59 -54 12 53 12 169 23 -71 -43 110 70
1712 70 159 59 4 105 52 -91 0 -12 -7 111 38 -3 48 44 -3 54 -18 4 19 -41 122 0 96 63 44 -18 -19 69 105 -46 13 86 94 102
1415 102 -39 -64 108 80 -71 108 -26 -69 -102 33 -79 5 -169 -4 -69 23 6 15 -32 22 55 20 103 44 -62 75 89 5 -12 -77
1152 -77 -99 -134 9 113 12 60 6 -55 -62 28 27 44 56 -72 -78 -68 -52 -51 -52 150 110 87 -59 -70 -76 31 -146 -135 0 -73 28 -53 34
863 34 -10 -94 45 22 80 -19 -80 -48 -58 -21 -53 -21 24 -3 -94 25 -15 -118 27 101 -107 0 -10 -4 -74 -74 -93 -95 -65 0 72 102 41 -63
566 -63 74 84 -6 24 -35 -66 -44 -6 69 1 30 36 6 44 -12 40 12 -9 -49 29 54 74 -62 -101 6 -16 -23 83 58 12 -176 -37 -112 12
268 12 -11 28 112 77 48 -2 -21 22 131 -23 62 -18 38 1 73 -90 22 51 -107 15 -22 -22 39 41 6 49 76 -120 -69 -54 -51 90 -172
-20 -172 88 -38 -33 -76 9 -12 17 36 -25 -5 163 -40 -17 -46 -42 -26 34 -37 0 72 -3 -24 -101 -75
-230g5
##PAGE=	F1=3049.38
##FIRST=	23146.756194512010552,	4241.1435120000014649,	-0.11529991030693054199
##DATA TABLE=	(F2++(Y..Y)), PROFILE
4241h2J0N0j54J40J22o7K5q8k0l1J44m9O7k60J78O3o1J6m3L8qP2q9o3N0k9O9n3J5Q3O9j76
3961f2qN7j19J97p5P1q8J9J16n7n1K8o2L4J6p0q7L37k59P0J06k4jj41J23r4N2j67J54l8p3
3690i6N4M1L7m5N4R8j14P8j13O3r5k1m5J22l0j3N0O2j08m3MJ47j79r1J55L7n4p1R3J33r0q5
3410f5R3j54R0N6j18K38r8oq1J28j3j02J15n5l2j09O1R0P5j00Mj9n6k6O6k2j06J22j45J73
3147Dl9o4R0J51o4J1j6K5m0J25q0p5l0p4L30L46j23l78J3L1J2j65r6N6K1N8QMP4L38R68O1
2867A482j137j75j27o9o0J99j74J36o1m7K7j27J25j90Q9J96k8j14O6j39m4J17Q9J09j23l8
2640a8J0J5lP1MJ15k83Q4N2J06j63K9L2q7O8Lm3p9J62j48N6N1J5j09P0k0Q4n5K4q9Q6j30K37
2351A47j23rq7n2J6P8J63j14n1J9j31O8M4Q9j34J45n9J6n7L6O2m7j9l1j48R8P1n7l9J61O9
$$ plain form
4241 -82 -72 -22 -176 -36 86 19 44 -44 -64 -95 49 0 67 -193 -15 48 -13 3 -40 -2 -10 62 -27 -90 -40 -69 0 -53 -38 45 114 -62
3961 -62 -70 -13 -132 65 -10 61 -27 -8 108 51 0 28 -34 0 16 -54 -141 196 -63 7 113 89 88 -53 70 -24 28 -139 15 -23 -96
3690 -96 -42 -1 36 -9 45 143 29 107 -6 57 -38 -59 -104 18 -12 -25 25 87 -21 -64 -60 87 -92 -183 -28 9 -45 -116 -23 110 20 -65
3410 -65 28 -126 -36 20 -98 140 42 36 -45 83 70 -32 83 28 -4 -113 -52 38 113 13 17 -2 -58 -84 -18 -40 -146 -24 -169 4
3147 4 -35 -99 -9 142 78 89 73 98 58 183 103 28 -2 -76 254 600 477 99 112 143 155 -10 -106 -50 -29 29 37 41 115 453 1421 1482
2867 1482 345 170 43 -26 -86 113 -61 75 14 -33 -6 -133 -8 -198 -109 87 59 -55 11 -128 -172 -55 34 143 20 -18
2640 -18 -8 7 4 75 79 194 -89 -5 47 153 -10 19 51 -36 32 35 -8 -87 75 -73 -17 34 49 -60 10 -10 74 19 43 -46 40 -90 147
2351 147 24 15 -72 -124 -108 -30 133 19 -32 -13 -144 -76 -32 57 -77 68 9 25 -32 4 66 19 0 -31 -179 -81 -10 -67 -106 55 124
2080A24j52j1k0J41n1%N4j12K7O0r3k8NJ17o0r3J45K8p3oQ3o8n6O1k6o5J47o0m6J1J8N8j49
1791i0J30lk8J07q4j38O5J04l6P2m9j9O1o0j12N5k2N5J39p0q4K3P0o7Q1j13L6M4j13J47q0
1520B1R0m2o4j4l3N9J13j89R2K8J1j0r6J2J43l7j24J21j17n2J0O5p4J25k16J24K4J01r5J9
1257ej4JO3pL7l4j19J59K4j12L1n8p9kJ21J07j30M9n7J5o6R0J6j5J0q3oM6%n0Q3J06Oj13n9
951d5m6L6J23k08m1J62k2P2j06Q9l8mM2%R9j12o3M9k2K6j0lO6K2j68J23k6j00J18J16j90O0
671aK9l1o0K8j3ll9R6L9K3o1o1J11Jq4M5r6K1k0M2Q6p5N0MQM1j03N0nOr9J00j8Q6j53l7R2
347am7K2J07n4J9k17J30n4P5n0Q6L5J5j7mo5L1J18j58M6p5R9j4M4j86J21k4o0Q3l7n5P9P8
58G0m7PJj67Q6K0OJ10k30K51j68K1m8J20pj0M3m9l2J86j66l4J1k7qQ0p4P5O3n3n1r9M7
$$ plain form
2080 124 -28 -39 -59 82 31 31 85 -27 0 60 -33 -61 -56 61 1 -92 53 81 8 2 85 17 -39 22 -4 -69 78 18 -28 -17 1 59 -90
1791 -90 40 37 9 116 32 -106 -41 63 27 99 50 31 92 32 -80 -25 -47 8 147 77 -7 16 86 19 100 -13 23 67 -46 101 21
1520 21 111 69 5 -9 -42 17 130 -59 33 61 72 62 -34 -22 121 84 -40 81 -36 -88 -78 -13 -87 38 -178 -54 -30 71 -24 -5
1257 -5 -19 -18 45 38 75 41 -78 81 105 -7 24 -34 -113 -115 6 113 -17 32 -25 -10 -76 14 30 15 25 -58 -64 -18 -18 -68 15 121 127 14 -45
951 -45 -91 -55 68 -140 -181 -19 -41 31 -75 14 -24 -28 14 14 113 1 -62 -13 -35 -9 -19 -22 44 66 -102 21 -5 -105 13 129 -61 -1
671 -1 28 -3 -63 -35 -48 -51 -90 6 45 68 7 -54 57 58 -26 19 -77 -56 -76 -34 52 -23 27 31 39 80 -23 27 22 28 -71 29 11 97 -56 -93 -1
347 -1 -48 -26 81 27 46 -171 -41 -95 -20 -70 16 51 66 49 45 -20 11 129 -29 17 -58 41 27 71 -115 6 -18 -78 5 -32 -87 -8 70
58 70 23 30 31 -136 -50 -30 -24 86 -144 107 -61 -40 -88 32 25 15 58 9 -23 163 -3 -37 -26 -53 -61 19 -55 20 83 30 -21 -120 -73
-230g3
##PAGE=	F1=2955.03
##FIRST=	23146.756194512010552,	4241.1435120000014649,	-0.19655746221542358398
##DATA TABLE=	(F2++(Y..Y)), PROFILE
4241f7j0O8j44J16J20k5j0q5Or6J74n1O9k82J88N2l3J0o2NN8J7j8q2K9m6N8k5K9M7R1j80L
3952g6M0r5K24j11Q1j24L6J49n3n2l2j7M9j1o3p8L13k70J02J37j08L2j75J67j47P8q3J01o1
3699d7l2LP4N9m0KJ07l8m1q3O0r0jl2J37l4n7P0Q6j20k9k6J33j31j03J16Q7r4n1J08J22q8
3419B7n1K5j62J56L9o2J20r2M9j06J02j2j16J33j6m4m8M2N4P0j05K0j2p0n8N7l9o4J49j31
3156a45J57n9l3Q1J35q2R6RM5K14J93k10k29j19j10J81Q7k6j29P4K21N0k00k47LK6O4PO1O9
2894A84N43J631P2j770l98j26j17r5J54j45J21n3l1N1j15R3j87L3K59o5r8L3j24n0J50J40
2666I0M6j85M5J7j9JL8QJ60k82N0J27N1j68N1M3j02N7j4l3n0J39j33O1J2M1j05P1j2J07r9
2395A3Oo6J02j27J56j11M3o7l6l8J01J53j03m9k5j04J25l2Q9j23J88o2ro5P6N8r1pLj62J20
$$ plain form
4241 -67 -77 -9 -153 -37 83 58 48 -37 -31 -127 47 -4 65 -217 -29 23 -10 0 -62 -57 1 18 0 -82 -53 -99 -41 -66 -37 10 101 -79 -76
3952 -76 -36 -131 93 -18 63 -61 -25 124 71 19 -13 -30 19 8 -55 -133 180 -90 12 149 41 73 -102 65 -82 -4 -87 14 -47
3699 -47 -79 -76 -2 57 17 19 126 88 47 -36 24 -66 -67 -99 38 4 -53 17 103 -17 -46 -72 61 -70 -173 -57 30 -64 -115 -7 115 27
3419 27 -24 1 -161 -5 34 -28 92 0 49 -57 45 33 -83 50 34 -10 -58 -16 38 108 3 23 11 -59 -117 -60 -99 -163 -14 -145
3156 -145 12 -47 -80 1 136 54 150 159 204 418 611 401 172 53 -57 124 211 185 56 130 351 401 201 -46 -43 -17 47 54 115 184
2894 184 727 2358 2430 660 262 136 19 -76 78 -67 54 1 -30 21 -94 -1 -188 -155 104 39 -59 -26 -150 -200 -50 90
2666 90 136 -49 -4 13 -6 -5 33 41 201 -81 -31 96 147 -21 30 73 -29 28 14 -19 -69 70 -63 -2 10 51 -54 17 5 112 13
2395 13 19 -47 55 -72 84 -27 16 -51 -87 -125 -24 129 26 -23 -48 -152 -27 -59 30 -93 95 33 24 -41 35 93 2 -5 -2 -164 -44
2124d4K6m1L3O6O9j71qk6J57J4lP6j55ML6n9j2jJ29j14j06J51ql0K7K6r1jQ0k3r7J81m1q1
1826c7N4L2K1j84J49k2%K8%j62R8M2l0N1NK0j6k7o2L2n1Q2J51n3j21j4J25o5N7j04J3R3j28
1537b3Q2NN1n0r3L9o6L2J62k05J15m3J1J0n5O4P4m2p8L6o0l6L2K0o0J40k55J08Q7J03j60L4
1257b1J1n6Q7K9j2k0q4J37L3j27N9n6r6J1Q2J24j52P6r3Q2j01P4L0lj9p0N2P4j7j06J37j1
977E4P9j78K3j02R5J16k02o0J55lM4j14J11m8M9qpJ16j20k7O0k5K1nn2J01N6k07P4j8m2M7
697a7J31j21mP4m8o7M5%J6r1J13Olo9k0J06j6r1N9j00M5l3M3P8q1M8J4L4Q5j49J0KN7j28R8
391B6p6J62j48m1P4m6M9N8p2R0k28Q6RK6r2J37k4M8LM7j24K4J23j47L1q6J28J6J3k06J19n3
111g4M8L2l3j07R9J11n5%l5j20J03K7J5O6j64J77j76O5n9J32ok5O4m6p8J61r8n1L6p5l0J09
$$ plain form
2124 -44 -18 -59 -26 40 109 -62 -70 -96 61 75 72 148 -7 -3 33 -26 -38 -39 90 -24 -130 21 13 -17 10 36 -55 -56 24 1 -96 85 44 -37
1826 -37 17 49 70 -114 35 13 13 41 41 -121 -23 19 -11 40 45 65 49 22 -40 -8 -59 23 174 121 0 -14 111 46 103 -1 12 105 -23
1537 -23 59 64 115 65 -28 11 -55 -23 139 -66 49 6 17 27 -28 36 110 68 -10 26 -34 -70 -38 -18 -78 62 -193 -85 2 105 -55 -21
1257 -21 -10 -66 21 50 38 18 -66 71 104 -23 36 -20 -116 -105 -23 101 -51 25 -68 14 -87 -13 17 14 -5 -75 -23 51 34 -72 65 54
977 54 133 -45 -22 -124 -29 87 -115 -175 -20 -23 21 -93 18 -30 19 11 4 120 0 -27 33 8 29 24 -28 73 129 -78 -4 -22 -64 -17
697 -17 114 -7 -11 63 15 -52 -7 -7 9 -82 31 37 34 -35 -55 51 35 -56 3 -97 -52 -85 -42 36 -45 3 17 51 136 -13 -3 -1 56 -72 26
391 26 -50 112 -36 -77 -3 -49 0 58 -14 76 -152 -66 -57 -31 -123 14 -10 38 41 88 -36 -12 111 -36 -5 -91 37 53 66 -140 -21 -74
111 -74 -26 6 -27 -134 -35 76 21 21 -14 -134 -31 -4 11 77 -87 90 -86 -21 -80 52 46 21 85 39 -39 122 24 -27 9 -66 -96 13
-169A3p5J03N0k3p2j36Q6
$$ plain form
-169 13 -62 41 91 68 -4 -140 -54
-230e4
##PAGE=	F1=2860.68
##FIRST=	23146.756194512010552,	4241.1435120000014649,	0.078696839511394500732
##DATA TABLE=	(F2++(Y..Y)), PROFILE
4241d4l6P7j03P2J01J5m4p4N7j65J75j9N3k81J79L3J7k2o1k4J15n6K3n7J2k6K6j7L3lJ16j49
3961g7j1M3o4K27j46P7j21M2J64p0Jj03oN5j1n2m7K19j96R1J57j94O6j79J75j59J10ROn3J
3690d6l2Q8O8l1o2J04N9j85n2P3o6ll2J68k8q0O4P0p9k2m9R4m8j22Q0J22j01m8Q5J00p7l1
3410a9k3j36J91K6k7mo7J14j21O0K4j27J04K9l2mK7J3M8j06M2%p7n8K3n6K2J36j05J08n3l
3130e1O9R0q6K02O2J06M94L04l83m24k38j54P6j1M2m3J69N81K03m06n07q0JN5j0R0O1O19J964
2876B795P3k041n24j11j63q2Q3q4O7k5m1N7m4O4j66l9K84r9m0j8o5p6J52J71kk20R3M7q7J7
2614b4j8K6J65k26jJ96j9j25N7K8p4K2j3j8jP0o9J7ON7r1N0J3J32j54k2m0J09j25Q3q0O3N
2325am8o7J26J23j02l8q0p6J92j08Q4r3K00o2m9k2O4Q5j36jK8j34J06j9j7J04l1O7j77Lm9
$$ plain form
4241 -44 -80 -3 -106 -34 67 82 38 -36 21 -144 31 12 65 -216 -37 -4 13 -9 -70 -94 21 -35 -12 -69 -57 -83 -57 -74 -41 -44 72 -77
3961 -77 -88 -45 -109 118 -28 49 -72 -30 134 64 65 -38 -44 11 0 -52 -99 120 -76 15 172 -22 44 -135 40 -119 -9 0 6 -47 -46
3690 -46 -78 10 78 47 -15 89 148 -37 -89 -16 -82 -85 -117 51 23 -57 7 77 -2 -24 -73 21 -27 -149 -69 53 -48 -96 -11 89 12 -19
3410 -19 -42 -178 13 39 12 8 -59 55 -66 -6 18 -109 -5 24 -8 -12 15 28 76 -30 12 12 -65 -123 -100 -156 -134 2 -103 5 -48 -51
3130 -51 18 108 22 224 286 392 886 1190 807 383 145 -9 67 56 98 55 224 805 1008 602 95 15 16 71 61 151 212 831 2795
2876 2795 2868 827 303 192 29 -53 30 -54 13 -12 -53 4 -40 24 -142 -181 103 4 -36 -54 -119 -195 -43 128 126 -94 -1 46 -41 -24
2614 -24 -42 -16 149 -77 -78 118 99 -26 31 59 -15 7 -6 -24 -25 45 -24 -7 -1 56 -35 15 28 160 6 -16 -56 53 -72 11 -69 -6 -1
2325 -1 -49 -116 10 133 31 -7 -87 -163 29 -79 5 -88 112 50 1 -21 43 128 -8 -9 19 -115 -9 -28 -45 59 28 95 -82 -79 -128
2054a28J52P7OM3j57J1Ml5pNJ24j33r7J14j7jP4n7j03M6J11j0j19J62nr5O3M9Ok00J26j9K8
1765A8m2P4j64J13nl4M0M2L8q9L6k1K9r1Q7J44k3j32n7J48m5ln2l1J35r2qQ2J2n7j00P8q0
1476e0J5J65k06J21r4RL4k5J24k7k8k4n3Q%K1K7p9J31k75J12J01J06j82M3K5j13J06N4m4j4
1205a2j9R9K0j23O6p6o7JM6J40j45J12j42J23j14N7K5L6n5r5J52Q1l9j28J41j14J44k04R6
951Fj44J37P6j58m0J23j8K2j04J43o7M7J0m4J15j33L3N3pK5j8r5J28O9j91Qk1K6k5J14m0n2
671b2J13n6o0M5jM5j08J02j9l9o6nJ19k9j02O2p3M3l5O3M7p7K4L1M4J42j78n4JJ10j11O0j20
382a04K18j24o4Q0k3N7j3q2J43k18M0P2j2j25J59o1O1L2O6j75M8J18j33M0r8J24M2qk10R8
120e2m1J20j4l1j15J04Q2m7K1o5q8J11K9J6L5r6P6j28J01p3J20k0j8P6n3j01R9j6k6L7j21
$$ plain form
2054 -128 24 101 107 150 -7 4 8 -27 -34 -29 95 -38 -135 -21 -38 -39 35 -22 -125 -79 32 22 -97 65 60 -35 28 77 83 -117 9 -10 18
1765 18 -24 50 -114 -1 -6 -40 0 42 80 -9 27 6 35 -56 31 175 152 20 -37 111 66 63 11 -20 115 23 15 97 109 52 -48 30 -50
1476 -50 -35 130 -76 45 -49 -40 -6 -31 93 66 38 14 -39 -31 -31 -10 17 -62 69 -206 -94 7 113 -69 -26 -1 -114 -8 46 2 -12
1205 -12 -31 68 88 -35 31 -45 -112 -111 -65 75 -70 42 -100 23 -91 -34 -9 27 -28 -123 29 110 71 -57 84 -30 114 -90 6
951 6 -138 -1 75 -83 -123 0 -18 4 -100 43 -24 23 33 -11 104 -29 4 57 50 75 57 -38 90 159 -32 -24 -45 -19 -44 70 30 -22
671 -22 91 35 -25 20 19 64 -44 58 39 0 -66 -71 48 19 -83 -21 -94 -51 -86 -23 24 -53 -29 2 46 188 10 -44 -43 67 -44 16 -104
382 -104 114 -10 -74 6 -17 40 27 -55 88 -130 -90 -18 -30 -155 4 -57 4 36 102 -73 -25 93 -40 0 -98 26 68 60 -150 -52
120 -52 -93 27 13 -18 -133 -29 53 6 27 -38 -126 -15 14 30 65 -31 45 -83 18 -55 65 45 27 103 50 -51 48 32 6 43 -78
-152g8l8J34p3J17L5%q4j61J21
$$ plain form
-152 -78 -116 18 -55 62 97 97 13 -148 -27
-230b7
##PAGE=	F1=2766.32
##FIRST=	23146.756194512010552,	4241.1435120000014649,	0.35555225610733032227
##DATA TABLE=	(F2++(Y..Y)), PROFILE
4241b5o4P7m1J9Q5L1n6p0J17k11J41M7J1k51J48J5N9n0l9n5J45j16K2J7j5J3lm3L0l0J23r0
3961e9l1M4k8K06j84Q1q8L3J54r5P2j45l4O1Ol1j9R7p3N1J65k53Q1j55J53j26J25P5r3j5J9
3690fm0P1O7k1j12P5J42k97k2Q1k4pn2K03k7o1K2L1nl5n4M0L3j20N4J30o8p5L1J07o9l5m1
3401h4r6J95K3k2q2m0J50j20L9P0j41M3P1rK5J3k4J3j00P0J6q5k1oq5J20R6q6M8k9K9L9L8
3112F8o8K78J18J71O66M10n26n63l36j82M2L2Q1r7K68R89M25p14p90j62n3M3m2Q4N2N07J765
2876B466O0j790m72p6j88l5K1j0j2K7q2M3O4M2j39q5K56j18K3o0J5j02J13J70k0k02Q8P8j54
2622g9L3o6L3J34j26n5K29o1p3L8J0j1k2jpN0j1J2l9J2N9p1J6K3J67j98m0j1P5j10M8m6M7
2334d1R2o8o7J49P3j07k0j23n8K37j59Q2n2J82m6j05N0RJ23j53lK5p7N8l3OJ38q4M6j59K2
$$ plain form
4241 -25 -89 -12 -53 -34 51 82 26 -44 73 -138 3 50 61 -190 -42 -27 32 -18 -57 -112 33 -83 -61 -44 -59 -46 -49 -92 -62 -92 31 -59
3961 -59 -90 -46 -74 132 -52 29 -59 -26 128 33 105 -40 -74 -13 -7 -38 -57 40 -33 18 183 -70 11 -144 9 -117 8 83 -10 -25 -6
3690 -6 -46 25 92 71 -41 34 176 -121 -143 -62 -86 -93 -145 58 31 -30 -8 23 18 -17 -71 -31 2 -118 -64 66 -2 -77 -46 61 -8 -43 -84
3401 -84 -180 15 38 16 -66 -106 44 -76 -37 33 -108 -65 6 -3 22 35 11 24 -76 -6 10 -75 -96 -102 -187 -67 29 -57 -9 -38 -9 30 68
3112 68 0 278 396 567 1233 1643 1117 554 218 36 78 110 191 94 362 1351 1776 1062 272 110 57 100 58 142 194 701 2466
2876 2466 2526 736 264 188 0 -35 -14 -24 -36 -9 -91 -48 16 58 -81 -166 90 -28 -5 -65 -50 -152 -39 131 111 -91 -3 75 -79
2622 -79 -46 -112 -79 55 -71 -126 103 42 -31 7 17 6 -16 -17 -24 26 15 27 -12 0 59 -12 4 27 194 -4 -44 -55 20 -90 -42 -88 -41
2334 -41 51 -17 -84 65 138 31 11 -112 -170 67 -92 -10 -62 120 74 -31 19 28 151 -2 -5 20 -57 1 -32 -26 112 28 74 -85 -63
2062f3p6J35J17Pj8j26L9j3l2j7J7Q9r1p8N5j5J7J16j32r6P7J40Kj24R8K0p4M0N7J3j83Q6
1782a3j4M7p7J15j49R5j6n2L4P2J9j18J00kL6j27Q1J11J4j23p7J32j4p0J2o8J45k2p6J02j
1511I6o5r3R2n7MJ30j83R4r3KL6rJ72j21oL2j24N7M3k0Q4j20J16k72J16P4J16j64M5K7j71
1240a62J25O9n0j5M6O7j0j15P1j06j4l0K4J44j11J41j72J20j05M8jO2o3j39K49O7p3q7J00
986H0j77J63j86J58j51J34Rr2OQ4m3J4q8J57q1nQ1r0J04j51R5J8K4L9m3j06J26O8j39k1l7
715e0N1n5Q6Mo7J48p2k0K4j4O2r3O9l6p4l0k5J32l3j11N9m5M0m3R3J5n4qM6M1J69j78j07n
417h1J37m9oj33K30r4r8J15J0M4o8r2J67j89J9Q9l2j32J45n8O5N8L5k02J05J03j27N9r4Q3
155IO1j8j90O6%J33m3l6o8Q2K2k7N3p7r2J27K7qL4n3kl2R6r5R3m0nP9n6j01K9M6K9K1j46l0
$$ plain form
2062 -63 -139 -4 113 120 102 -24 15 2 -30 -47 -30 59 -32 -110 -55 -70 -53 63 -69 -165 -88 52 54 -70 28 48 -26 14 71 84 -99 -13
1782 -13 -27 20 -57 58 -91 4 -12 -64 -30 42 61 -57 43 41 77 -50 31 142 156 33 -44 88 74 4 16 -52 93 71 -5 97 96
1511 96 31 -62 30 -27 -23 107 -76 18 -75 -73 -37 -46 126 5 -1 31 -93 -36 7 -13 71 -49 67 -205 -89 -15 101 -63 -18 9 -162
1240 -162 -37 32 -18 -33 13 80 70 -45 26 -80 -94 -124 -100 44 -67 74 -98 22 -83 -35 -36 26 -37 -176 73 140 67 -20 80
986 80 -97 66 -120 38 -113 21 30 -62 -56 28 -15 -1 -89 68 -13 -18 63 -27 77 -74 21 39 63 102 59 -47 79 147 8 -13 -50
715 -50 1 -54 32 36 -31 117 45 25 49 35 97 4 73 37 -37 -67 -92 40 7 -104 -45 -90 -50 -93 0 15 -39 -47 -1 40 209 31 -76 -81
417 -81 56 7 1 -132 98 4 -94 21 31 75 7 -85 82 -107 -88 1 -31 -163 -18 -76 -11 47 82 -120 -15 88 -39 20 -74 9
155 9 70 52 -138 -72 -72 61 18 -18 -86 -4 18 -9 44 -33 -125 2 29 21 55 2 0 -32 64 -31 62 22 17 96 40 -61 -32 14 43 64 -82 -112
-160a12J36n7J13J6Oq0j59J34
$$ plain form
-160 -112 24 -33 80 96 102 22 -137 -3
-230c
##PAGE=	F1=2671.97
##FIRST=	23146.756194512010552,	4241.1435120000014649,	0.42782244086265563965
##DATA TABLE=	(F2++(Y..Y)), PROFILE
4241a8q1O7K3l3R1J5m6o7J53k12P9J16m3j93J06JO6m1pq7J36j27%J00n6L6qr4K7j3R7l0l1
3952g4K5J1J70k25J06m3J3J20j03J11j28q7P0K5Mk2KM1MJ60k64O4j04J19p7J12R9j63K9K7
3690B2k2L7O2j4j28K4J78l45J2P2J7Nq3K16l3nm4kO4o6l2k3Q4q6L8J09j5j13k5J56q2m4l4
3401a00o9J77K3l7q7k9J35j01N8R5j56k5J13RN1pn4j2j04Q8L4q1L3kj27J79M9p6PkN3j0kk5
3104bK87J41J95O25M56n55n67l58j71N9J01J06j78L16J235N88r38r47k02j09M1p5N4M5K68
2885D15J163L5j167k82k7j89J8oM9r6J06j43K0J58L2j06r5J94j20N0o0P3j08M9J46j6j24L5
2640DQ1j82M0q1J2Q9j8j01K16n1l6j0J4N3n5J0pQ5o0P4q0J2M4m4k7J4J93k21k0K1oq1O1j8
2342g5RJ59q4n8J61J9j02oj31n2K30j65P5kJ54k1j71J14n4J47j37j0pj2JlK1J18q1Nj13L1
$$ plain form
4241 -18 -99 -32 -9 -42 49 64 18 -49 104 -108 -29 87 44 -149 -43 -42 24 -17 -24 -111 25 -102 -102 -2 -58 -22 -30 -124 -97 -110 -13 -43 -74
3952 -74 -49 -38 132 -93 13 -30 -17 103 0 111 -17 -104 -34 -9 -5 -27 -25 16 20 180 -84 -20 -124 -5 -82 30 129 -34 -5 22
3690 22 0 37 99 85 -43 -19 159 -186 -174 -102 -85 -80 -163 53 20 15 -29 -31 33 -33 -65 -88 -4 -90 -52 57 42 -71 -96 60 -22 -66 -100
3401 -100 -169 8 31 -6 -93 -122 13 -88 -30 65 -91 -116 -3 6 57 50 -4 -16 -120 -32 2 -79 -46 -48 -175 4 53 -23 -16 -18 35 25 23 -2
3104 -2 285 426 621 1246 1702 1147 580 222 51 110 211 317 139 455 1690 2278 1340 393 191 82 123 48 102 147 415
2885 415 1578 1613 446 164 137 -52 -34 -40 9 -87 19 -124 -104 54 86 -20 -115 79 -41 9 -51 22 -86 -37 109 93 -31 4
2640 4 85 -97 -57 -138 -126 -37 -55 -156 60 9 -27 -37 -23 30 -25 -15 -22 63 3 77 -3 9 53 9 -18 -4 189 -32 -52 -31 -37 -118 -57 -75
2342 -75 -66 93 9 -49 112 131 29 23 -108 -160 70 -95 -20 -22 132 111 -60 54 0 147 10 0 -7 -19 -18 -21 0 118 37 42 -71 -40
2062d0q5J11J25j3o0p5N9nl7l8K1L7qp2jlK5J34j64p2R8J48kj11J7J6k1QM9K7j34N3k0N2p4
1756e5J15j19M4J3r0L4J10l8r5J35JM4j43P5N3M4j12m6Q5K4j21N2p3J25L7r2O1J6p9q0P9J
1476Ej5R2j27L1n0mJ4j0J88j64qR0j59P1P4p3J57j60J12k43R7L3J32j31M7J6k21J44Q8m4k1
1205c9R4M8m2j16R1j14K9q3J1J44o9J50j66Q1p1L4k3L8l0j65K90M8j19J0M1j91J22j34J97
951F6j26R1o2l0M8O3n2K0p7J33q8o4J60j12Q2j70J40k5M3N4o3q5J02O0q2mn2J4l3P8qn8J82
662A45j05M9j3l2O0o5L1m9r9M2o2J26l0j15N3m0N8n6J03Jj2k7L9M7J43j57j17k7J41L2q0j23
382a39J99o2j27J53M7K7q8j07J65j43J9N6l7j10J00k0P4O8k6k03J58Q8j27P3o6K0P2k8j45
128a09L6M4R4n3l3pM3k0j5Q7p9j16J54J6l9L8l5k1P3M2j31O1m7kP8l8q9k0O5Q0J0j44j0J07
$$ plain form
2062 -40 -125 -14 111 98 38 -37 22 17 -20 -58 -37 0 -8 -80 -81 -84 -59 75 -89 -161 -63 85 83 -28 -11 5 -16 -8 41 68 -66 -13 -33 19 -55
1756 -55 60 -59 -15 -2 -92 -58 52 14 -81 54 55 99 -44 31 84 128 16 -30 55 79 -42 10 -63 62 99 7 68 84 5 -75 4 5
1476 5 -10 82 -45 -14 -64 -68 -54 -64 124 -40 -48 42 -117 -46 28 -45 112 -48 64 -179 -82 -49 83 -48 -1 15 -206 -62 26 -18 -39
1205 -39 55 103 61 -55 36 -78 -49 -132 -121 23 -46 104 -62 19 -52 -18 -41 -3 -33 -198 92 140 21 31 72 -119 3 -131 66
951 66 -60 31 -31 -61 -13 50 -2 18 -59 74 -14 -78 82 -30 52 -118 22 -3 40 94 31 -54 48 108 26 22 -30 -16 -49 29 21 -37 145
662 145 40 89 76 44 104 39 70 21 -78 -36 -98 28 -2 -117 -64 -104 -46 -102 1 2 -10 -37 2 49 192 35 -82 -109 32 64 -16 -139
382 -139 60 -2 -129 24 71 98 10 -97 68 -75 -56 0 -37 -147 -47 -67 7 75 49 -154 4 92 -35 38 -28 -8 64 36 -109
128 -109 -73 -29 65 12 -21 -28 15 -5 -20 67 -12 -128 26 42 3 41 6 -15 58 100 -31 30 -17 -19 59 21 -68 -88 -23 57 67 -77 -87 20
-169B0k4R4j1Mo2j29J21
$$ plain form
-169 20 -4 90 79 83 21 -108 13
-230A3
##PAGE=	F1=2577.61
##FIRST=	23146.756194512010552,	4241.1435120000014649,	0.29042887687683105469
##DATA TABLE=	(F2++(Y..Y)), PROFILE
4241a4q5N2O3o7J13k0k9m6J40j68jJ65q2j26O9j3L7J0J3j03R6q3j4J35r8L1Rj40K8L3M1PN
3952d2j4M1J35k56J34MqP3r0J04o1j33P2K9N8o5l8J10l2J36k27K6l3Q7n7Q6Q6j84N4L0J5O
3672D6O3j8j19k2J59l31N4N5K9L4j12J95l7N7r5k2R3r1J3p8Q7l1L1O4K5j30n4K27j21k7l1
3401h7n8J49J1n5l3l2P8o5R2R1j61p8J49K0P3k5q4jj34P7N4m9P5L7j65J67Oo0jK0N1n5k6K7
3104HK33J16J56L93M22m47m36k89j25Q5J00J30j88K70J179N84r21q74j82j41N0q7J2M8L5N02
2876F33J3n16p6K2j74M9MP1j52J88j99NJ94L7p0q2J33j09K5j0Q4q5j8J16oj0l7L4j52M1o8
2605a15k1M8O1j37J72Mj4q0M4Q2n8J0j9R4n1Q9r1nJ9pp5%J84k19L6O6j08n8J10lk3J79q5o3
2307c4J52j5o9j5r2n2J65j23N0N3J37kk27J37q8J42j05k6m7M1m5O8K1O2n1k4n9K0o9Q6J01
$$ plain form
4241 -14 -99 -47 16 -51 62 42 13 -33 107 -61 -62 103 21 -105 -36 -49 -12 -2 11 -92 4 -79 -93 42 -56 -25 -16 -156 -128 -95 -54 -47 -42
3952 -42 -56 -15 120 -136 -2 2 -6 67 -23 81 20 -113 -41 -12 46 -19 -57 53 21 157 -70 -44 -77 10 -47 39 125 -59 -5 25 40 46
3672 46 109 91 -28 -50 109 -222 -168 -113 -84 -50 -162 33 -4 53 -42 -64 29 -62 -49 -127 -40 -71 -40 24 49 -81 -135 92 -29 -56 -87
3401 -87 -145 4 15 -40 -73 -105 -27 -92 0 91 -70 -148 1 21 94 69 -15 -16 -150 -73 -19 -68 7 44 -121 46 52 -8 -9 11 62 7 -19 8
3104 8 241 357 513 906 1328 881 445 156 31 116 216 346 158 428 1607 2191 1270 396 214 73 123 36 48 96 131 633
2876 633 646 130 54 76 -98 -49 -45 26 -126 62 -137 -132 62 99 29 -53 80 -29 -4 -14 70 -15 -33 83 77 67 30 64 -88 -47 -115
2605 -115 -136 -88 -27 -164 8 12 -2 -82 -38 44 -14 -4 -23 71 20 109 18 13 32 25 -50 -50 134 -85 -49 17 -91 -149 -39 -42 -65 114 29 -34
2307 -34 118 103 34 19 -73 -125 40 -83 -33 20 157 155 -72 65 -23 119 14 -12 -59 -18 -63 5 26 88 37 13 -46 -26 -95 -9 92
2036I2m2o2k0N4J3k6n9QmP1r5l8K8K7J15j48m0J24J17j6r3m7j2M6j4K8L6o9L4l5L7n1R0p6
1738b7j7O2j35L9J53j03n1J23NN1j31O6qN2j18L4K4P2j52O0m6R7N1n7j0M1r2p0N2O9m7P7m4
1450B0n3Mj3kk6J63j45m7J47j55O1P2j10K08j75J18j97N2RJ37j06N1j0k39J61J15m5l4J19
1196H0M3o1j28J19p5L8j41j2J56l6J27j23K9j4mj4l3K6j55K64M0j59J13pj74N2o4J97r5M2
933C1j17RO0P0l7M5q0P8r6q0J97r1M5j80J62m9K6O2o0m8P7M5n6M7o0n7J4J03n1m3J99j44J13
645A34m4m5M5n1K0o1j07J18q3R1k9j07M6n4R4o3O9QL2l0K5N9Q5j28q5p1J42R0j35j04J45l2
365b6j31J63P8K3p0j32J54q5QJ1k9p7M5K1R6N9q2j78J63Q0j25P8l1m0Q5m6r5K7P0L6n3mQJ5
67A6k8j3J11q2j30J77Rn4Qk6K1J51m3j78L3l4oP9lq0k8L8R9J0j08ON8J3P1l9Kl1q7R4
$$ plain form
2036 92 50 -12 -32 22 35 9 -50 -42 -46 25 -70 -108 -80 -53 62 -86 -126 -2 115 99 6 -41 -53 -7 -21 7 43 -26 8 -27 10 -41 49 -27
1738 -27 -44 18 -117 -78 75 -28 -79 44 49 100 -31 35 27 79 -39 -5 19 91 -61 -1 -47 50 101 44 34 75 -17 -87 -35 34 -13 64 20
1450 20 -33 -29 -42 -44 -70 93 -52 -99 48 -107 -46 26 -84 124 -51 67 -130 -78 -69 68 -38 13 3 -236 -75 40 -5 -39 80
1196 80 123 62 -66 53 -22 16 -125 -137 19 -17 110 -13 16 2 -2 -16 -49 -23 -178 86 126 -33 80 73 -101 -49 -113 84 -11 31
933 31 -86 -77 -17 53 16 61 -19 59 -37 -117 80 -11 34 -146 16 -33 -7 55 -5 -53 24 69 13 60 0 -57 -43 60 9 -34 165 21 134
645 134 90 45 90 39 59 -2 -109 9 -74 17 -12 -119 -73 -127 -33 -96 -27 -19 13 -17 8 67 152 24 -61 -132 10 100 -35 -139 6 -26
365 -26 -157 6 84 107 37 -95 59 -26 -18 -7 -36 -113 -68 -47 49 108 26 -152 11 91 -34 44 13 -27 58 12 -83 -56 14 50 -3 -7 1 16
67 16 -12 -25 86 4 -126 51 60 6 14 -12 9 160 117 -61 -28 -62 -68 11 8 -72 -100 -62 37 47 -61 -55 3 16 87 48 50 19 -68 26
-230B6
##PAGE=	F1=2483.26
##FIRST=	23146.756194512010552,	4241.1435120000014649,	0.22904351353645324707
##DATA TABLE=	(F2++(Y..Y)), PROFILE
4241bp6L7O3p3J35n8k4LQ4j09o7J71p9p1L9k4mP6J2r1M6j5pR7j18RM0j68L9P0j8J2O0n3N3
3935a1J08k59J41N6l5L3o6P1K1j52N9RJ31j34k7J30n4Q8j55j1L9O9q7O4N9j59N1K1N9oP5l6
3655I2j08l2R6k69R2M8JO6j38J62l8R4r9m0P8q8O1j08N3K5J7J6K3r7n2K88j76K6m9n7J14r
3375ho6K9k2J0j6J02P1j55r6J70J9Q6l1j13M4j79L4O7RR3Q3j75Q7k1l5J5M9%n9l6P0J41O7
3086B34P5J06L30k55k53j70o9Q8J8J57j23J50Q60M17o59o21j10j39O4o9l6O2q7N9J2j14N9
2850a4M9j54N2L2N4j51K23k18OJ66M7l6o2R9r4l5O5N6m7o1R1j0J05j00m5r0M7m2m1K3Q9j63
2570a59J26O7Kj48Q5O6l8jk7Q6qO1p9k7j3L8j09JJ24k05J08J23j82o1J55J0l3J51o8r6J24
2299G3j3j4m5k2n0P1n6J1J00J29Ok56J23r4J21q9m6o1O2o6J51kJ4k8j6k9Jl3N7O2n6m0K7L5
$$ plain form
4241 -2 -78 -41 22 -51 84 26 2 5 89 -20 -87 84 5 -66 -27 -51 -55 21 33 -58 -12 -27 -34 63 -55 -46 -6 -174 -135 -65 -83 -71 -11 -64 -11
3935 -11 97 -162 -21 35 0 33 -33 38 59 -93 -34 -25 106 -28 -55 75 21 109 -46 -57 -18 51 -36 28 87 -72 -21 0 59 53 128 92
3655 92 -16 -48 48 -221 -129 -81 -80 -14 -152 10 -28 66 -33 -73 5 -83 -22 -130 -77 -52 -35 -19 4 -93 -145 143 -33 -7 -56 -113 1 -8
3375 -8 -74 -45 -67 -57 -73 29 100 -55 -151 19 38 124 93 -20 24 -155 -121 -54 -45 48 131 -44 43 22 -13 2 51 51 -8 -44 26 167 234
3086 234 309 415 745 490 237 67 -2 86 104 261 138 288 1148 1565 906 285 175 36 100 31 -5 57 -30 29 41 -73 -14
2850 -14 35 -119 -67 -35 19 -132 91 -127 -121 45 92 56 -6 93 -1 -36 29 85 38 -23 68 58 163 63 18 -72 -25 -67 -108 -85 4 -159
2570 -159 -33 34 36 -112 -27 39 1 0 -27 59 51 112 33 6 -7 31 -78 -77 47 -158 -50 73 -109 -170 -15 -5 -38 113 45 -51 73
2299 73 60 46 1 -21 -71 0 -56 -45 55 184 190 -66 57 -37 84 -5 -51 -112 -50 -116 35 33 47 19 3 -26 -25 -58 -1 61 5 -35 -8 27
2001B7OJ2p0j4j9J07j39m5P9L0N7j07oJ58M9k5q4q0l4J02k1MM1j8K4m7Nk8O3l0n4J06j77N2
1703g6J85j44l0P2J4P1j00N0m6K9j39J23l0J27j63M6oQ3K0j2o4O0j03n2K2J10q2Q6M8j23L1
1432Gk6J7n7J11q6j09J93j24M9L1j15K16j54J21j50%QJ22r2N6m6k11J74J29n8n0J22N0o6j28
1170f6J25nK3j77n5J87k0P2o6rN7p0L2j15P3j21J97M9j70J69l5j56PMJ54q0K9j50K8L6Q7k
890C2P2q3J6j14l4J67l7%j71J56l3k7O3l3j5O8J9o7J02o3j07M3J47q1l8J77j63J43m7n8L3
618F7o1N0p2j07J71p3K4k1q3L0n6J22n3pK2O2l3K8O0L7r6m0j23J53R8j45r9R6jj12J37R0L0
330I5k1j57J37k1l3jj6n2mL3J22M6j06j30J05P3j09Q1j2p6R9o6n9M1Q4j1o5N4l9Qqk1J20q1
32A0j16J74J3m1p1j0J01J71j15k18QlpQ9K2q9J0pP6J0m9RJ7M4M6n7Ojm7O6
$$ plain form
2001 27 33 45 -25 -39 -58 49 -90 -135 -56 -26 31 -76 -82 76 125 100 16 -64 -98 4 -17 -13 28 10 34 -13 -8 -36 27 -3 -57 49 -128 -76
1703 -76 109 -35 -65 7 21 92 -8 42 -4 25 -114 9 -21 106 -57 -11 -17 66 86 74 10 70 -33 -85 -63 47 -35 51 99 -24 7
1432 7 -19 -2 -59 52 -34 -143 50 -74 -25 6 -109 107 -47 74 -76 -76 -68 54 -38 18 -28 -239 -65 64 6 -44 78 128 62 -66
1170 -66 59 54 77 -100 -155 32 12 84 18 9 66 -4 28 -87 -14 -135 62 111 -59 110 75 -81 -74 -70 84 4 33 -117 -89 -53 34 32
890 32 104 21 37 -77 -111 56 19 19 -152 4 -29 -56 7 -26 -41 27 46 -21 81 18 -89 -46 101 20 -18 159 -4 139 92 34 67
618 67 6 56 -16 -123 48 -25 -1 -22 -105 -75 -131 -9 -62 -69 -47 15 -18 10 70 107 11 -29 -152 1 99 -46 -145 -49 -50 -162 -25 65 95
330 95 74 -83 54 33 0 -1 -17 -69 -73 -40 82 128 22 -108 -3 70 -39 42 30 -46 53 -13 -72 -31 53 42 -23 31 -8 0 -8 -29 91 10
32 10 -106 68 81 40 -31 -41 60 231 116 -102 -94 -97 -104 -15 7 -82 -72 -79 -3 7 -42 -33 -16 28 74 17 23 22 -25 41
-230D1
##PAGE=	F1=2388.91
##FIRST=	23146.756194512010552,	4241.1435120000014649,	0.19424423575401306152
##DATA TABLE=	(F2++(Y..Y)), PROFILE
4241A8n3K6K7o0J53r4l2O4J6p0r5J32k3m2Rk4l1J13nm7ML8J0J0j02oO7j72N3P5m8pR3o2M3
3935b2Q9k25J17J06p0J6n3N5P1j37L4l1J99j90PJ24o4J4o5k7Q7O5j45M6L4r8K7JR5rR5n5j13
3646b2%J9j76J07N7n4Q4j64J52m2R9o4o6M2n0Q5j04OO3qk4j4j9l1L21k24Q6q5n9P7k2o7N7
3357d0Ol0L6O8N6j46p0J59J2Q2k2j37R5j99j6O0O9R2J00j45k2k8j1L9Q3q9j6l1R0N5K2Jr0
3069C3K18o9j10o4l3O8q6J78m7K7M55J99k94l46k5j20Q3l1q4P5q4j18L7kJ06N6j29L0N8J5
2806dr4J86j90K0J03M5j5l9R2p5r2J23J2op3O8l5J83j33j15l9P2k1l6J2P6j75Q8J08J6j90
2535a28J22K1j5j6j8P6K6J8o0l5m4P8j08J8L3j93J59J80j95q7J60L2k5Q9k4j53Q9J8M1q0M3
2264B2l8pKk6J17J27Jk43R7r5J01r9o1l7M3o0K12m8J3l3K7m1oK0K3K0l9k1N3J9l9N9o6k3k4
$$ plain form
4241 18 -35 -9 18 -42 111 17 -15 49 65 -5 -100 32 9 -33 -24 -48 -79 34 29 -18 -14 24 34 44 -58 -64 3 -169 -116 -41 -89 -96 -3 -65 -22
3935 -22 67 -158 -41 65 -5 11 -42 13 84 -53 -19 -50 149 -41 -34 90 26 40 -25 -52 35 100 -45 1 35 -63 -36 -35 60 51 146 91 -22
3646 -22 -22 -3 -179 -72 -15 -69 15 -149 3 -39 60 -4 -70 -28 -78 7 -97 -91 -28 -36 -60 -74 -93 -124 197 -27 59 -26 -85 -8 -30 -97 -40
3357 -40 -34 -64 -28 40 96 -50 -120 39 51 133 111 -26 69 -130 -146 -86 -17 75 175 30 8 -20 -31 8 91 2 -14 -45 45 100 122 123 33
3069 33 251 182 72 8 -25 43 -43 135 88 115 570 769 475 129 104 -16 67 36 -48 27 -57 -175 -138 -140 -34 22 -107 -77 -19 -4
2806 -4 -98 88 -102 -82 21 66 51 12 104 29 -63 60 72 66 -7 61 26 209 76 -39 -78 -6 -27 -63 -51 25 -150 -62 46 62 -128
2535 -128 -6 15 0 -16 -34 42 68 86 26 -9 -53 25 -83 -65 -32 -225 -66 114 -81 -168 -8 24 -1 88 64 -89 0 18 59 -21 22
2264 22 -16 -23 -21 -47 70 197 198 -45 52 -43 58 -41 -102 -139 -96 -156 56 8 21 -12 15 -26 -32 -12 11 31 -8 -29 24 43 4 63 -3 -26 -50
1957e0J00j75k0J29L1j9p0K3J98l8j1r8q4k4J32k6rM7nJ5m6k8j0M0Mm7J28k10P4J87j37n3
1677e2PJ8J09n8K6n0j9j54J77p1J74j50K5K3Q4k0Lp5O8j10j2jR5j04R9J23j48K0m0P1r3N3
1397A8k4j60K08p4M8l6r3J93j07J03j10l5J7Q4p5O0q4j39J78J07p0o6J03P3o4j04Q9O8mj66
1135f2j07K24rok3k3J18j36Q5j62R2r4J33P0j43J61o1j48K1M9Q0o6N6j65L4jQ8L4Q3p0k2j41
855a11M6R0J9m0j40J17K0q8O0%QP2j8q9J36o9j00L4J79o9n0J10j46J37k2p8L4q1J10q3j04
583a16J76l2p2J5m5Lk8J24l0r1L2O3n5O3L4K3n2j6j61J71O0j10j06O5K8q2Q4Q0K8M9j66J15
303E1L8j00L1nm0l9NJ41M5j05n9J1N4p6R6l3q2J13p5m5O0J02k6r9J10j06J6J1k8J11o3p9J36
15G1L3j5j76K4J70J41j41k29j3J9J0J14Lj15Q0l2J8oJ9nLO4K4o1J0K0k0M6
$$ plain form
1957 -50 50 -125 -145 -16 15 -4 -74 -51 147 109 98 0 -84 -108 24 -2 -11 36 31 46 0 -28 -38 2 6 -41 87 -123 -49 138 1 -52
1677 -52 -45 -27 82 24 50 0 -19 -173 4 -67 107 -43 -18 5 89 69 72 -3 65 -45 -57 -58 37 -67 32 155 7 27 -13 58 -35 18
1397 18 -6 -166 42 -32 16 -20 -113 80 -27 76 -34 -69 -52 32 -43 17 -67 -206 -28 79 9 -57 46 119 55 -49 40 108 104 -62
1135 -62 -169 55 46 40 17 -6 112 -24 61 -101 -9 -103 30 100 -43 118 57 -91 -70 -21 59 -7 49 -116 -82 -83 5 39 122 52 30 -111
855 -111 -65 25 44 4 -136 -19 1 -87 -27 -27 -19 53 35 -54 82 13 -87 -53 126 57 7 117 -29 108 86 8 42 -39 71 -12 -116
583 -116 60 28 -44 -29 -74 -71 -99 25 -5 -96 -64 -1 -56 7 41 64 12 -4 -165 6 66 -44 -150 -85 -57 -139 -55 25 53 102 -64 51
303 51 89 -11 20 15 -25 -64 -59 82 127 22 -37 -26 28 -48 48 15 -67 46 -29 -74 -14 88 62 -37 73 -33 -17 -6 -34 77 14 -65 71
15 71 104 89 -87 -63 107 248 107 -122 -135 -116 -106 8 11 -104 -24 -56 -38 -44 -25 -30 -27 37 61 0 10 30 10 56
-230E6
##PAGE=	F1=2294.55
##FIRST=	23146.756194512010552,	4241.1435120000014649,	0.019365901127457618713
##DATA TABLE=	(F2++(Y..Y)), PROFILE
4241D0k4J9k4l9J69j32m4J10k4p2q1O5O5l0l1pl7R7k0J6k0N6J4o9n7oQ4j64O2N6l8l4P2k6
3944e4K9O1j55O7J38j13K9o0Q1O4r2Mp1K24j97K9J15o2o1J3j6R3P2j88K4J4k8Pk4J14k3J13
3664A47o1j31N3m4o2Q1P0j00P9j91J83o0Q7k9r1RRP1p0k7P5l9m6o6P4pL28k42J09j10n7K8
3384c0oo0M4L2k9P3J3M7j35j2J11NO3nj46J15j61m1K9J04Q8O8q8j09k3oN9J19j77M8j8Q8L
3095F3kl3j42J10N5m2rk6M3j56J91k9k5J40M9Mj88L7j10J07J1j21O9j5j53P4l8J01N7r7%P0
2815ek4mQ8j28L5M1K7j2j0Q8m1j20J30j9K2n9M4p6K06j36j45j4J13j1k2J7M5j65N5J17J5j90
2535a38J46j9j7k4QO6L3j4m1k9n0Q8o9M0n2j81J64K19j52j13J15O3j6J2N5k15O0N5O9j03P2
2264C2j0l3J8m0R4J19lj88P5j10Q9j14o6QJl8K27j07O4n8P1p8J1P9lk1pj2N4J0r7P9m6j3l6
$$ plain form
4241 40 16 35 11 -28 141 9 -35 75 51 -21 -102 -37 28 -2 -33 -40 -77 20 0 16 -4 52 66 -3 -60 -66 18 -146 -84 -28 -66 -100 -28 -54
3944 -54 -25 36 -119 -52 86 -27 2 -58 23 87 -5 -1 -72 152 -45 -16 99 37 -24 -11 -27 66 138 -50 -26 -12 -40 -33 -57 57 34 147
3664 147 86 -45 8 -36 -98 -17 53 -47 32 -159 24 -36 51 22 -69 -60 -51 20 -50 -77 -2 -41 -87 -153 -79 -86 242 0 109 -1 -58 -30
3384 -30 -36 -96 -52 -20 -49 24 37 84 -51 -63 48 53 116 111 -35 80 -81 -122 -93 11 99 167 79 -30 -53 -59 0 119 -58 -10 -28 60 63
3095 63 61 28 -114 -4 51 9 0 -26 17 -139 52 23 -2 138 187 191 3 40 -70 37 48 -73 -4 -19 -172 -98 -136 -35 22 -75 -75 -5
2815 -5 -29 -33 55 -73 -38 3 30 18 8 96 55 -65 65 46 68 9 53 -23 183 47 -98 -112 1 -10 -32 -15 30 -135 -80 37 52 -138
2535 -138 8 -11 -28 -52 -44 22 55 41 0 -29 -79 9 -60 -20 -72 -253 -89 130 -22 -135 -20 43 27 39 94 -121 -61 -6 63 -40 32
2264 32 22 -11 7 -33 61 180 177 -11 64 -46 43 -71 -137 -129 -128 -166 61 -46 18 -40 31 -47 -36 43 40 19 12 0 54 64 -33 46 0 -13 -49
1957d9P7j74K3J50K6q4m9L8K33j14K6j25q0J7J41m5jN0l3Ok5l7kJ2J9qJ23k27J00J53q4r8
1677d1m9OJ54j2kk3p9j44J83j04J91j10ML8Q1l4k2m7O9j23N9j1K2j04R9J63j18k4m5J40j28
1406a1J0K3j75J74k0O0r2p2J62n5O1q2l7K1L5m5N9j05o2J75N0o8p2O4J05o1n8J6J13k7j09
1135b3j40K43Rq5j1k4J48j65J10j55Q4r1R8Q8r3J22j07j42Q2N9Kk8R5j64M0k6N8N8O1l7l0
863C6j50J06J0N0n8r9N3Q4j22N3NL8O6n0q6J36q1n1OJ81k6p0K2r8J06J3r8M8r7J75j02r5J38
575D3J8j72Q3nl2K3R8pj42L6L7r0J10j5L1J5k5j70J76J3n2j04N5L8n8K7M9NJ21j46Q8P6j62
286c8P8Rm0n5m7J46N3r6K4p3K3m0J24q7o4J20o1m9O2J32j5j41J16j15OJ7l0R0k1m1P9N5lk49
-12a31O5J94Q3j13j99l2J6M5J44o2j41J51j5n0m7P5k5K1P3No0J0L2rL4
$$ plain form
1957 -49 28 -146 -123 27 53 -31 -80 -42 191 77 103 -22 -102 -85 56 11 10 60 27 33 8 -29 -31 -19 0 -8 115 -112 -12 141 57 -41
1677 -41 -90 -84 70 58 56 33 -46 -190 -7 -111 80 -30 -26 12 93 59 37 -10 59 -64 -5 -16 6 -98 1 164 46 22 -23 117 -11
1406 -11 -1 22 -153 21 1 61 -31 -103 59 4 65 -17 -54 -33 2 -43 16 -89 -151 24 74 6 -66 -2 103 42 -16 0 113 86 -23
1135 -23 -163 80 89 4 -7 -31 117 -48 62 -93 -9 -100 -2 86 -7 115 8 -134 -52 7 9 -19 76 -88 -48 -74 -16 42 103 66 36
863 36 -114 -8 2 52 -6 -105 -52 32 -90 -37 -32 6 72 22 -64 72 -9 -60 -54 127 101 31 53 -45 61 74 -24 24 -73 102 0 -95 43
575 43 61 -111 -28 -33 -65 -42 56 49 -93 -57 -20 -110 0 -15 16 31 6 -164 12 25 -27 -131 -76 -38 -96 -69 -20 -15 106 -40 48 124 -38
286 -38 40 49 9 -46 -93 53 106 10 34 -39 -16 -56 68 -19 -83 37 -24 -73 -11 121 106 -35 81 -34 -28 -11 -41 49 28 -13 66 121 118 -131
-12 -131 -66 128 211 98 -101 -133 -117 -72 72 10 -131 20 5 -45 -92 -17 -42 -21 52 57 -3 7 39 30 64
-230F4
##PAGE=	F1=2200.2
##FIRST=	23146.756194512010552,	4241.1435120000014649,	-0.081236027181148529053
##DATA TABLE=	(F2++(Y..Y)), PROFILE
4241D6J2J1o4k5J94j74m5J16j5j07m7kJ45k1p8K2k9M2j8P4l3N0nr3rLQ1j47N1M5no5J3M8K9
3935@J5o8MJ38j53O9q0J34J2l7k0q9J89j54K9J07n2j09O2J8N5P8j80pqK5Pl7J15o0J19m4j44
3646f6R8p4M4J9P5j15N6k07K26q3Q3k9r7rN8K7j8l6N4m9n7j00J37J4L15k13O8r7m6l5L3l1
3366e5PK7oQ3k5L2j14N4L5%M5Pj42J01p4k1k7J08R6%l6j46j1k9P6J39k26R8pP9rj7l3r9K0
3060g0J10k4Ll1L1j66J86p8Pk5LJ61j67N8j17J36L8j29L3N1j59J01p9P5P5o6k5O7m6P5j2o5
2780d9L5J1Lk2J5O9J3j12Q6l2L8l2K0j29J81j10j33kJ52j4j5L3J8j33J9J03lj52J56l4m5k8
2500i3L4N6K4k6k0k3j5N3rN2r8j66J25K28q8j17M9Q2po1J51k55M3P1O8j07N1L4rnl4M5J05
2211A38mr5M7j34P9j06n1L7l7j4J94j67J40p6P9j03M3J37j4n7RqL8Kj30N3j6Po1P3j40O1J36
$$ plain form
4241 46 58 69 5 -20 174 0 -45 71 56 -51 -98 -100 45 24 -54 -32 -61 -19 -37 37 4 54 49 -44 -53 -50 31 -116 -65 -20 -25 -90 -77 -29 0
3935 0 15 -53 -49 89 -64 5 -75 59 71 34 14 -75 114 -40 -11 96 44 -65 -3 15 70 148 -32 -39 -47 -22 -15 -52 63 3 122 78 -66
3646 -66 32 -42 2 21 96 -19 37 -170 56 -27 56 27 -70 -79 -21 6 -12 -48 6 -43 -100 -200 -63 -49 266 53 121 24 -22 -57 -24 -55
3366 -55 -48 -21 -27 56 31 63 -51 3 38 38 83 90 -52 49 -25 -46 -73 35 131 131 95 -51 -62 -91 -15 124 -102 -4 -11 68 59 42 9 -90 -70
3060 -70 40 16 19 -12 19 -147 39 -39 -32 -57 -54 107 -60 -2 -119 17 55 -74 -41 10 -149 -48 -127 -52 23 -43 -68 -1 -47 28 16 -49
2780 -49 -14 -3 0 -22 -7 62 75 -37 49 17 55 23 43 -86 95 -15 -148 -150 2 -12 -27 6 24 -109 -90 13 10 -142 14 -20 -65 -93
2500 -93 -59 -3 21 -5 -25 -48 -63 -10 -19 33 -65 -231 -106 122 34 -83 -34 48 41 -20 131 -124 -81 -10 58 -49 2 36 27 22 -12 33 138
2211 138 134 39 86 -48 31 -75 -126 -89 -126 -140 54 -113 27 -49 30 -73 -30 107 93 36 45 37 75 77 -53 0 -16 -9 -70 3 -137 -76 60
1922F0Pj10m1L6K52j58O5j44p3N1J49p1K3L1p7LKlj3l2K6L5R0k15J15J00j4j20q1j3J78K7
1642H5k9J8j27j06J58j41J67m8j6M8O2j2n7rO1j44J39j0q0q6R1J70o1q4k9J94j50j8O7j54
1380a01R7K1P6j00q0J39k2Qo3lJ0mj0M9r4k7J71j1m8o7J6J27n2j5n8J22m7k5j42K33L2j35
1100ck9k1J36j46R7j13P3j11Q9Q8m8J02j71j20J45L8n8M2J06j39M6k8MO5J8mk1j20J11l6O2
828E4n8o9jJ19j07L4l3Q5L4n7m5J01q7moJ54J4q9n0m2P1L4j02O3r7K16j31p4Q1N1k27J59J6
540Go6O8N9J1j36L6mj24J43o8M0R4n5j58J64j1np1N5K0m8j5Ql1J65j02P7Q3j94R7L6n0m9r3
242a17J40M7q1R6j22qj0J51j46l4J13k6o0M1J55Rj60M7l0m0Rj8O3L1k2L1O8j6k55R7J67K7
-38A47n4j41m6j3R0J50j33j46J92L7j08r5R7l8O1O9lo5lM5j0K1
$$ plain form
1922 60 67 -43 -84 -48 204 46 111 -33 -106 -55 94 23 46 77 0 3 5 2 -11 -43 -17 18 108 -107 8 108 94 -26 -107 -120 58 85
1642 85 56 74 -53 -159 -1 -142 25 -23 -39 9 71 59 2 -7 54 -90 49 39 -41 -127 -36 134 73 -11 -40 154 4 -14 53 -101
1380 -101 -4 17 93 -7 -87 52 30 38 -25 -28 -18 -22 -32 17 -77 -104 67 56 8 -59 -43 84 32 17 -41 81 34 9 -133 100 132 -3
1100 -3 -32 -53 83 -63 34 -79 -6 -117 -28 60 12 114 -57 -177 -32 6 -52 -10 96 -43 3 -25 -21 44 62 58 37 -83 28 -8 54
828 54 -4 -73 -74 45 -62 -28 -61 24 58 1 -44 57 -30 -34 -40 114 128 39 -11 -53 18 52 -50 13 -84 132 1 -73 8 59 -168 -9 7
540 7 -59 9 68 79 -57 -21 -25 -149 -6 -74 -34 60 5 -153 11 0 -5 -76 -21 -1 -49 -64 -56 -87 78 -24 53 136 -58 39 75 25 -24 -117
242 -117 23 70 -11 85 -37 -45 -55 96 -50 -84 29 3 -57 -16 139 148 -12 35 5 -35 -26 -44 19 50 28 59 127 111 -144 -47 120 147
-38 147 93 -48 -94 -107 -17 133 0 -146 46 83 -25 -120 -23 -61 0 69 66 1 -2 43 33 54
-230E4
##PAGE=	F1=2105.84
##FIRST=	23146.756194512010552,	4241.1435120000014649,	-0.13112555444240570068
##DATA TABLE=	(F2++(Y..Y)), PROFILE
4241B8M7kp2k1K17k04l3R1K4j45k0l9J76rj21N4j9j6MJ04l6L8l4o2J8PO0j21J6N9K0r7l1J24
3944EN1m5J3o1J08j73J16r5J75m9Ql1p1J06r4J9R4l9j19Q7O5j5O4j24k4l7M2L1l3J13j15J10
3664H2j6j36J19p0J17n5O6r8K4j95K32r2R8o3p3k3P4j3L5k7jj9n8j12J51L5K74j39k7m5j6
3392B9j00O7K5l0j0J0N7k0Qp8J00m7%L7Rj35Q3J5K8q7Q6J15o5qj41Ko8Q3J46k21J08oQ1Ll9
3086C7l2m4l3J18k3Ql1L7j26J64j62Q0q8J6K15k13N2j34J63M3j01k3Q4j55J07q5L4J18n7k6
2824e7M8m7J06o0j8RJ9j3l5J8L6P4p1K2l9M8mMj81J28o1j03J6J66k4k2N5Kq7j8Q1k5r9J48
2526A6j6q6l4M5L4L4k9Kk1N0k3M6N4j06j39O4K08l4j01KP5Nj15K28k51L3N9O3j14JQ3L2m7
2237A8j8%Q8%K0j1j45O8p0j9K8n1MJ28k11K01p1M6r1P9J65op5j5lK3j2j14j5K2J5p6R2r8P4
$$ plain form
4241 28 75 73 1 -20 197 -7 -40 51 75 -70 -90 -129 47 38 -83 -29 -48 -64 -60 44 8 46 12 -50 -32 -25 35 -86 -70 -11 9 -88 -119 5
3944 5 56 11 24 -37 71 -102 14 -81 94 45 53 22 -49 57 -37 -18 76 37 -82 5 70 55 119 -5 -29 -66 -24 7 -26 87 -28 82
3664 82 66 -70 49 -21 96 41 107 9 33 -162 70 -22 76 13 -60 -83 -9 -22 13 -14 -15 -34 -92 -204 -53 -18 256 117 90 45 29
3392 29 -71 -4 21 -9 -19 -9 48 28 36 -42 58 11 11 48 57 -78 5 20 48 -39 47 162 97 89 -52 -50 -118 -35 111 -110 -2 -8 73 76 37
3086 37 5 -39 -72 46 23 31 0 37 -89 75 -87 -7 -95 -79 136 -77 -25 -159 4 47 -54 -77 7 -148 -41 -126 -92 26 -31 -57
2824 -57 -9 -56 50 -10 -28 -19 0 -13 -48 -30 6 80 9 31 -8 40 36 40 -141 -13 -74 -177 -161 5 -19 -41 14 16 -71 -89 -8 -33 -132 16
2526 16 0 -86 -120 -75 -41 -7 -36 -34 -55 -5 -28 18 72 -34 -173 -109 99 65 -36 -34 41 46 -69 159 -92 -59 0 63 -51 -50 33 65 18
2237 18 0 0 88 88 108 97 -48 20 -50 -69 -41 -92 -88 40 -171 30 -41 5 -86 -7 158 152 77 62 59 82 70 -44 -59 -37 -22 -98 -6 -104 -30
1931c0J03j9r6l1K0K44j61P5j26n7L5J70r3M1j5r3PJ7O6n2p6L7N9L2j61J10M4N0j00q9j7J58
1651E2L7m9O5j53n3J31j86J22J0l0N7L9K7o8J2L7j60J89lj68o7R3J57j2j45MK26j54l6J13
1388H7j10JL1R7m9j26J25j9l7m7N1j1k3J6K4m3n3J60l1k0o1j4J13k6Lj00J04p1O6j27J97N1
1108A58j47n0j4Q3j00P6p4P6j38R2N8k2J18k22q3J79lr2J19P5q2N4k1n0N5j7Lj4n4P0m7P4
828F0n2o2j4J11n5lj00J45k1k5J0M7p4lK0J19K2j02q5KM9L0p7O4q3K18j59m5M2M9j99J94J2
540C5r5R4K2K0p5K7m1j46J49j00L4J53p7j41J41%J1oM8j9m5m0k6m9J50n2J00O1j96P6P5p2
260A6k2j08J26Om2J27j34qnJ59j75oR5J4p2QJ48L1j31p0J12j15mJ5L6O3k7J6O7l5k08J07J14
-29I8j2jq3m4m3J18J08j61j15J84R4j38j21P3l8J06N0J6q1l8O7j3l
$$ plain form
1931 -30 73 54 -42 -73 -53 191 30 105 -21 -78 -43 127 34 75 60 -33 -26 -9 57 5 -71 -34 25 57 -104 6 50 100 0 -89 -106 52
1651 52 89 40 105 -48 -101 30 -156 -34 -24 -54 3 42 69 1 13 50 -110 79 76 -92 -159 -66 91 79 -66 -62 164 10 -26 87
1388 87 -23 -22 9 106 57 -69 56 37 0 -47 4 -7 -30 -14 10 -33 -86 74 43 23 -38 -52 61 35 38 -62 42 -29 37 -90 107 158
1108 158 11 -39 -53 30 -70 6 -68 8 -130 -38 20 -2 116 -106 -189 -10 -13 -105 14 89 7 61 40 -10 45 28 31 17 -37 33 -14 60
828 60 8 -54 -68 43 -12 -15 -115 30 9 -16 -6 41 -33 -36 -16 103 125 23 -62 -60 -11 19 -58 6 -77 141 -18 -63 -21 28 -171 23 35
540 35 -60 34 56 76 1 28 -13 -159 -10 -110 -76 77 0 -141 0 0 11 5 53 34 -11 -51 -77 -126 24 -28 72 133 -63 13 88 16
260 16 -6 -114 12 18 -24 103 -31 -39 -44 115 -60 -66 29 43 -29 -21 127 158 27 -43 69 -46 -50 -35 1 64 37 53 120 85 -123 -16 98
-29 98 86 85 2 -42 -85 33 141 -20 -135 49 143 5 -116 -43 -81 25 75 91 10 -28 39 26 23
-230B3
##PAGE=	F1=2011.49
##FIRST=	23146.756194512010552,	4241.1435120000014649,	-0.21206025779247283936
##DATA TABLE=	(F2++(Y..Y)), PROFILE
4241fP1j4n0k5K18k02qN0O4j59j5l1J47pj52Q0j0l5L4J00l5L0n4j3K3kL1q9l5Q4K3j21j4J63
3944D1P6r6P3j27P5j61J48j01J75q6K8k9j7J2n5K0O4k7j07J12J03r0K3n6%o9K9P1k8J20j70
3672d9R9lj03J21n2J45j15N9p1%j57J75p1J24j01l0m3M7j6Q2k2p8M7m2j16J23N3J96m6j25
3410C1RM6j45O1J00n4m7LNJ4j6k6J06j11J0L3Oj34R1O4P1j32N5J27q6kj21Pr7P4J48j73Q0
3121cj3R5J4o7n5k0l1J02l5L6k5N0n8J33k32J31j20K7K40k44M1j44J78K3m8p1Q9j15R4q8j4
2850a30J65p8kK2l1P5m4J3l4N7j7m3qmJ21j3k0o3O3K5%k24P1Qp9M0J40m2k2O2kl6m2N0k6n3
2535a01J21K2j19m5L9QO1l0J8k0J11j05P9M8r7r5NJ69Kp8j0M2K7j44K54j97J8K6Q2j36m7J20
2255B8N0p8mk2P1J1J25r5j28N6k2J7j3m2J0N4k24K19m4Pn6J14J45J2p2p0pK7k7o0q4O1qn8
$$ plain form
4241 -6 65 51 1 -24 194 -8 -16 34 98 -61 -76 -107 40 33 -119 -39 -49 -84 -50 50 15 45 -9 -22 1 -1 30 -59 -94 -10 13 -108 -122 41
3944 41 117 21 94 -33 42 -119 29 -72 103 17 45 16 -1 11 -44 -24 40 13 -94 18 121 31 54 -2 -2 -71 -42 29 1 121 -49
3672 -49 50 47 -56 65 13 158 43 102 31 31 -126 49 -22 102 1 -29 -72 -25 -41 41 19 -59 -12 -54 -170 -47 6 202 156 31
3410 31 40 86 -59 2 102 48 1 4 9 23 7 -19 87 -24 -14 19 25 -109 -18 46 117 -15 40 167 81 79 -42 -35 -132 -58 90 -83 -3
3121 -3 -16 79 93 26 -29 -49 -80 22 -13 23 -2 48 -10 123 -109 22 -98 -71 169 -75 -34 -178 0 23 -25 -96 -7 -122 -28 -116 -130
2850 -130 35 -43 -45 -23 -54 21 -23 -10 -44 13 -4 -47 -55 -59 62 49 29 -34 29 54 54 -170 -99 -91 -170 -130 10 -32 -54 8 6 -30 -72 -22 -48 -101
2535 -101 20 42 -77 -122 -83 -75 -14 -44 -26 -46 65 -40 39 87 -10 -105 -100 69 71 -7 -17 25 52 -92 162 -35 -17 9 91 -45 -92 28
2255 28 78 0 -4 -26 45 56 181 86 -42 14 -8 9 -4 -46 -36 18 -206 13 -31 -24 -80 34 179 191 119 49 42 69 42 -18 -102 -41 -49 -107
1957a07J10p3O9O8l3o2j6JK02j26L7o6k0m2J99j02M1p7o1K6jJ33j00r9N7N6l8o5Q3LR1n4q5
1668e1J0R9Lo1J10j47j3J24k29P8M6l2O1K8O3n2J0%j60J84Lk04n8J10J37Nj84L5K38j43m8
1397c8J50o6p5PJ31K6j82J08l3p1j8R5l1k3K8j4L1j18J33NKn8j6N6K3mj02O7r9J53j16J45
1117I6N1j20n0JQo1P5o2J03j65R6Oj9J48k26m2J76m2r9J53K5mO0j8q4L0j5k1j4PK1l6R3m9
820B2p8K2P6Nn8j52J90p8L2M8km3m7O9R7mj05q8K3M2J5l3M7o9J88j72j5L8K2r7J60j0j10R8
522C3KJ4K2%p0j51J41j07K0J66p4j23J16K7qO8L0n7m1n7l5l1P9k5J60L0j87L6J07r8J3q1R7
233A6n8L0J05j27L2k2J42j59PP1L7p4j8J04L8n2j84K35j87j3O6J8M7m9M1O5m5j56R6O4k3J8
-47F5m1k1n2J13J7j26n8J35J25j26j15J5l1J42K6O1j03r0Q8lm2
$$ plain form
1957 -107 3 -70 -1 67 34 -28 -44 -43 159 33 70 4 -16 -58 141 39 80 3 -58 -32 -33 100 0 -99 -42 14 -24 -89 -6 -3 88 34 -51
1668 -51 -41 58 61 0 110 -37 -50 74 -155 -77 -31 -63 -2 26 89 37 47 47 -113 71 74 -130 -188 -78 59 64 -120 -85 153 10 -38
1397 -38 112 46 -29 -22 109 135 -47 61 28 -43 -61 34 3 -20 8 -6 25 -93 40 45 47 -11 -27 29 52 48 -54 13 -86 67 -49 96
1117 96 147 27 -23 -22 -14 -75 0 -62 41 -124 -28 -22 -41 107 -119 -161 15 -27 -126 27 52 48 108 90 6 36 21 0 -14 -7 14 -22 71 22
820 22 -56 -34 42 47 -11 -163 27 -51 -19 29 27 -16 -63 6 103 99 -6 -94 -71 -29 -14 -47 0 -69 119 -53 -68 -30 -8 -105 55 45 -65 33
522 33 35 49 71 71 1 -150 -9 -116 -96 70 -4 -127 -11 16 8 76 106 49 8 -49 -84 -115 -36 -61 99 129 -58 -22 85 -13 0 -81 16
233 16 -42 -12 93 -34 -2 -24 118 -41 -34 37 74 0 -18 86 124 72 -112 123 -64 -77 -11 7 54 5 46 111 66 -90 6 70 47 65
-47 65 24 3 -49 64 81 -45 -103 32 157 31 -84 -69 -100 42 68 129 26 -64 24 21 -21
-230b1
##PAGE=	F1=1917.14
##FIRST=	23146.756194512010552,	4241.1435120000014649,	-0.10841827094554901123
##DATA TABLE=	(F2++(Y..Y)), PROFILE
4241d2Q0j4j4l4J81j60K1QQ4j33l1J0Q5k8j74J01%rN8Q3l9J8o0J9L1k4Mn6q2Q4K1j26O3J39
3944F4Q1j07R6j81P0j24J47j07J44r4K5j7N4n5n6M1J9j6j03J57J11j39k4l0P1r4OJ14l6J33
3681A50k07R4k1m8J07l7J37j47P3o2lj02O8k4J40j10Qo9rL4J07k5j54J18mj26P8O4Q4L2j80
3410c4K5J27j39OJ59n9m2k3m7M0k5K8O5j42L9K2Pj42J27O2P5j44L1J13m6qj07nr3M8J54j08
3130c6L5k3J08J5q3j04j4J5Q0p7R0k8O4J2J02k61J31j48K0K67k32L6j38J75plq1Q2m4P0j04
2859h1n6J84j15L4Pj0JML8p2J07k6m4n0m2J39M2j6j07Q1O4Kk47L0P7o4M6Q5o4mM6jJ2l9J3
2552b6jk6P3O1j23n5K2j0Q0k7K3j4J35j55Q3M8r2m3m2J26L2o0lRM5j49K27j10qpJ22j68o2
2264i5J30K9q9Kk2N9L2J83j71r1N8J1L5n9l0J4rj96J94j5nk4J43P8K6m8j17m0N1k9lj14R1
$$ plain form
4241 -42 38 24 10 -24 157 -3 18 26 110 -23 -54 -44 41 13 -161 -60 -60 -69 -11 72 33 51 -9 10 41 17 21 -35 -117 -33 -12 -138 -75 64
3944 64 145 38 134 -47 23 -101 46 -61 83 -11 14 -3 51 -4 -60 -19 0 -16 -119 38 149 10 -14 -44 27 -67 -61 53 17 150
3681 150 -57 37 16 -32 75 38 175 28 101 39 36 -66 2 -22 118 8 16 -53 -62 -28 79 54 -100 18 14 -112 -34 30 114 146 -34
3410 -34 -9 118 -21 -15 144 85 43 20 -27 13 -12 16 81 -61 -22 0 7 -135 -8 54 129 -15 16 129 83 75 -32 -37 -130 -82 72 -36
3130 -36 -1 -24 84 99 16 -88 -102 -87 -7 -84 6 -22 42 54 156 -105 26 -122 -102 165 -67 -31 -169 6 -1 -4 -85 -3 -47 23 -81
2859 -81 -137 47 -68 -34 -27 -37 -36 -32 6 -66 41 15 -29 -79 -121 18 60 44 -63 18 82 84 -163 -133 -56 -120 -74 11 -53 -57 -11 -12 0 -39 -26
2552 -26 -27 -53 20 81 -42 -97 -75 -85 -5 -32 -9 -23 112 -43 40 88 -4 -47 -89 37 69 9 6 15 60 -89 138 28 20 13 135 -33 -95
2264 -95 35 64 -25 -23 -45 14 46 229 58 -33 25 36 71 12 -18 -4 -13 -209 -15 -30 -35 -59 84 162 188 140 23 -17 34 5 2 -112 -21
1975b1n8pJ11q6P8L4k2l7Lj1J33o7l7J0L2j41K14j04L1j26QN9m6J51j23q4O8L8j02M0N2j7
1695b7J07j5q1N0M0p4n8J43j17MJ29k45N0N8k1M5M2Q2l1ml2j44J30Rj82n6J28J07Mj84M0K33
1415A30j27m6J55l6j10l5J80P3k03Q2m9r1K6J06m4j4L3n6J03j77Q8O5J3n3lj8Q6j9q2J8j16
1143a21K27j24Q5L1p5k3K5o5l8Q9p5J48j88J05n3k2J53j82qJ54o6q4J20j0O6O0k7p9rK7o4
872b3qK3Jk9J03m9r5Q1M2N7j16j63J99j16Q7N9k7j9r9J10R3m4j01p3K8M8qJ5K0o6J43j59N
583h1O4j3K6O7l1j03R3%pJ16l4q7j48J34j03J8J32n3r5Q5O0n7J19Rq0k3p8j4J7j4k6K27J0
295A30j91J7J05j05L6k5N6j20J16M9j13R3n1J07j04%M6K9n3l5M7L0L7k43K85k26j5J20J4j3
32B3p8R6P2m9j37Q5K5qMk2K7l8O5q0n8%P1J27q3q2m9k4J60J8J04j16j43R2K3r0
$$ plain form
1975 -21 -79 -86 25 -61 17 51 29 -8 -5 -16 117 50 13 23 55 -86 128 24 55 -71 -63 -4 -50 101 -22 -106 -38 0 -102 -62 -10 -27
1695 -27 80 65 -16 34 74 0 -58 85 -32 -28 101 -144 -94 -36 -57 -12 30 112 81 77 45 -99 31 40 -142 -198 -70 37 41 -143 -103 130
1415 130 3 -43 112 76 -34 -69 111 184 -19 63 14 -77 -51 55 11 -3 30 -26 77 -100 -12 53 66 13 10 -8 78 59 -23 -5 -121
1143 -121 106 -18 67 98 23 0 25 -40 -78 11 -64 84 -104 1 -52 -74 79 -103 -111 43 -23 -107 13 3 69 129 102 23 14 41 -23
872 -23 -31 -8 -7 -36 67 18 -77 4 46 103 -13 -176 23 -93 -6 53 26 7 -92 18 111 67 -34 -107 -79 -31 -39 -24 -4 -70 73 -86 -81
583 -81 -17 -30 -4 63 32 -71 22 22 15 131 97 10 -138 -4 -107 -89 43 -10 -105 -20 40 -17 102 111 31 8 -70 -84 -67 -81 -107 120 130
295 130 -61 -44 61 -44 -8 -33 23 -97 19 68 -45 48 -3 104 0 0 46 75 22 -13 34 64 101 -142 143 -83 -98 22 36 23
32 23 -55 41 113 64 -73 12 37 29 33 11 38 0 65 -15 -73 -73 -2 125 42 -40 -89 -113 47 65 169 53 -90 2 25 -65
-230f5
##PAGE=	F1=1822.78
##FIRST=	23146.756194512010552,	4241.1435120000014649,	0.074750877916812896729
##DATA TABLE=	(F2++(Y..Y)), PROFILE
4241f5P1PJ9m5J12r8N1l6Q5p5n1N0L5o2j95J15J3L6O5P8n5no2L0O4m9j8l0j07M0L8j05J49
3952@O9N3o9Q6k09R6p7J09j15J06r1K0pJ18q5p9P1l2jj14K13P5j36m9o1J55j02j4J53o6J41
3681A58k19R9o2J5P6l7J21j52J11q4K1m7m1K4J25q0K8q9p2J19R9l7j88J61M5j38L6N9l0P3
3419I4j78j2J98p5p6J69m2Rm5p4L2j5O8j0j35Q8j2K3j46J64L2L0j26K4P0K8qr8m3n7K3J62
3139F2m8j0k6J00Ro7j50lO6O5j42J48n7P6O5P3k53R9j61J7K84j98K9j11J53l1Qm5P6J1L8j07
2859c0p0J52j32N6J2Oq0M7N5q1J46m9m9p3p8J34O8L3j63R8J15jk40RJ16m5J9K9q5K7RNN6j7
2561ak2L5j4RR3r3o4KpO0mK0j7J21j54O8N3q7kp5Q6O3m0p%M2j45J77j9l8l1J58j88l5J11j1
2246D4r1Jj4N1O1J78j99o0Q3K6J5q3l3K3n0j31J40jJ9j2J51jK8j9j11j03P1j4L8r4J00j13
$$ plain form
4241 -65 6 13 32 -13 99 1 52 16 101 26 -25 25 60 -2 -197 -82 -69 -33 32 110 55 50 -12 18 82 33 15 -15 -122 -82 -44 -149 0
3952 0 69 122 53 139 -70 26 -51 58 -57 49 -42 -22 -29 89 4 -75 -4 -36 -37 -151 62 137 1 -48 -109 46 -56 -70 83 17 158
3681 158 -61 38 -24 -9 67 30 151 -1 110 26 47 0 -41 -17 108 28 56 -33 -105 14 113 76 -112 49 94 -44 -8 51 21 94
3419 94 -84 -96 102 27 -49 120 78 87 42 -32 0 -15 53 43 -92 -4 -16 7 -139 25 57 87 -39 -15 55 83 75 -23 -66 -123 -100 62
3139 62 14 4 -22 78 87 20 -130 -133 -67 -2 -144 4 -53 23 88 161 -92 7 -154 -137 147 -51 -22 -133 20 -11 -3 -48 28 39 77 -30
2859 -30 -100 52 -80 -24 -12 -6 -86 -39 16 -65 81 32 -17 -90 -168 -34 34 67 -96 2 117 116 -124 -115 1 -44 -25 4 -81 -54 -45 -40 16 -1
2561 -1 -23 12 -2 7 100 7 -57 -55 -62 -2 -6 14 -3 118 -36 32 85 -2 -4 -79 7 70 30 23 23 65 -80 97 78 40 9 167 -21 -56 55 44
2246 44 -47 -46 -60 -9 52 230 31 -29 54 80 95 12 -21 2 -48 -179 -39 -40 -21 -33 118 117 145 126 15 -88 -17 -31 7 -87 13 -100
1966a00N6R5j30J23j4J6l7K5j1M9kj07N5Q7k16J98j03L0j41Q0R4q4R2r7l1M7J8j38J03M3j5
1695a5J01pq2P7J9j67m1J55p2lJ33k23L2O8j7J2P7P8l4j1l6j25O1K2j23n2J21O0J2j37J4J97
1415I4j01l0J13k4j04o2K19O4j62M7m6j01P7Q3n6nM4q4J41j89L3R7J3k7jp1J40k4o0l7j09
1143a28K75j37J8Nl2J5M6j12k0Q5q7J89j94J13r2k6J17j19J9J28p4m2L7j2R0N3m0l7n0Q3r3
872b2Oj8J4l2Q9n0q9J25K3R7j44j46J63j15J06O3k9j8j25J22R7p5r0n0K4N8l4N5pp6J01j31
592a08K8Q0k4R5l5l7p3Q9Nk9J70o1q7j40J30r9L1Q3l5n5M3Q7j18J38Kr2J2j09K9O2p8m0K58
303A22J5k15L5O0o8L0L2K2j57J72rq9J37q0P2l1k5K5non3J2J0R5k35K57k17j0J53K9r2j05
23a19J60Q0n8j47R2j0K2j2k0P6j3j2j35lL3K0J17l1m2q6k8J58L7J07j03j76P8M8j32
$$ plain form
1966 -100 -44 51 -79 44 30 46 9 34 23 72 70 -37 18 105 -111 87 -16 14 -127 -47 47 -37 55 -42 -73 -26 -8 -146 -43 0 -15
1695 -15 86 79 -3 74 93 -74 -115 40 -32 -35 98 -125 -93 -25 -42 -30 47 125 91 80 44 -81 -20 2 -121 -173 -52 8 20 -117 -103 94
1415 94 -7 -37 76 52 -52 -114 105 169 7 54 8 -93 -16 67 11 6 50 -34 107 -82 -49 48 61 34 33 -38 102 78 18 -19 -128
1143 -128 147 10 28 33 1 16 62 -50 -70 15 -72 117 -77 36 -56 -82 35 -84 -65 63 -11 -53 -16 -28 62 115 75 38 -12 71 -22
872 -22 -16 -34 -20 -52 37 -13 -102 23 46 143 -1 -147 16 -99 7 70 41 23 -102 20 117 42 -48 -98 -74 -16 -50 5 -2 -78 23 -108
592 -108 -80 0 -24 71 36 -1 -74 15 20 -9 161 100 13 -127 3 -96 -65 18 -17 -72 -29 58 -60 78 80 -12 0 -109 -80 -18 -96 -136 122
303 122 137 -78 -43 17 -51 -21 11 33 -124 48 39 -50 87 7 79 48 23 48 43 37 -16 -4 6 101 -134 123 -94 -104 49 78 -14 -119
23 -119 41 121 63 -84 8 -2 20 8 -12 64 51 39 -96 -99 -66 -46 71 40 -2 -88 -116 42 79 186 83 -93 -15 33 -99
-230i9
##PAGE=	F1=1728.43
##FIRST=	23146.756194512010552,	4241.1435120000014649,	0.13181512057781219482
##DATA TABLE=	(F2++(Y..Y)), PROFILE
4241g1N7L7M1n8L7m2O5p2P6mo5O4K2q7k07J20K0O7N6R2q0l4p2K9J21o7m0oj00l5Q0p4J87O
3944F3MrN6j97J35m5M5j08P6r6L7nJ44q1r8R0p0J6j17K45Kp9k8j36K09r1l1J81j01J25k03
3672f7J09j07P2L3m8J16j48J59j22N7%j09M9O9k4L1q7j19J99M9m5j61J66P5j32QL6j04P8j28
3410i5q7K24K8j53J25KP0m5p8J%Q5r1r8J44o3N8j44J82mm0r9L4K3Q0J4q8r8nJ9J51Lm1k4O0
3104E0J0k2j63K0P5P2j93J73j05Q4R6L9k25P2j44L6K70j72J2o9J14l3j5J7P1J5jo1n6P5j01
2832e9M6L1Qj26O6N4n5J57q7o3m4j14J13O2R7k08J05J62j4k05NJ11j5l7Or7M3k1J4Q6Qm4O6
2544E1j4n7J16l4p9j6J3%M1K5m8R4j14M5N0n7J1r6N3Q0om1L2J1j45J40M3n2m7J62j78J7P6
2255G6l6r6qj6N2Q8J23j66n3J29L0l9q5m5M4p2n1Q0rN7pJ21n2K0%m4j68N5J3O4m7Q3j45R9
$$ plain form
4241 -71 -14 23 64 6 43 1 66 -6 70 66 1 65 87 0 -207 -87 -67 0 56 148 68 34 -38 -9 112 45 5 -1 -101 -136 -56 -130 57 63
3944 63 67 58 114 -83 52 7 52 -56 20 -76 -39 -44 100 19 -79 11 -59 -43 -160 85 87 8 -20 -156 53 -38 -69 112 11 136 -67
3672 -67 42 -65 7 40 -8 108 -40 119 -3 54 54 -55 -6 63 39 70 -17 -136 63 112 67 -94 72 147 15 23 59 -45 33 -95
3410 -95 -182 42 70 -83 42 44 114 69 -9 -8 -8 77 -14 -112 32 -31 27 -117 65 61 21 -78 -44 -21 59 73 -15 -113 -118 -99 52 55 14 -10 50
3104 50 60 38 -125 -105 -30 42 -151 22 -83 1 97 136 -89 -17 -161 -125 145 -27 -15 -84 30 -3 -18 -1 70 85 84 23 -33 42 -59
2832 -59 -13 18 26 -100 -34 20 -35 122 35 -28 -72 -186 -73 -11 86 -122 -17 145 131 -74 -69 42 27 -10 -4 -101 -58 -79 -65 21 29 -15 51
2544 51 37 -20 96 62 -17 -33 -20 -20 21 46 -2 92 -22 23 73 16 27 -69 -16 64 58 17 49 60 -85 55 98 46 -1 161 -17 0 76
2255 76 40 -56 -64 -80 -28 60 183 17 -36 93 123 84 -1 -46 -2 -74 -125 -45 -54 3 -4 117 65 85 85 41 -127 -72 -59 5 -42 41 -104 -5
1957eQ0j79J87p5N8n1M6Ll6N2j37M6J26k36J55j02N2j20J23J11p4l2l3M0j6Oj39R9O2KQ5k9
1677F9q9P8M3k33j5J44k8k3J31j71J5Q4l6k5J21N5o2qpj12kN9o2m0Q4kM0o1k5J24o3rM0k1
1380gp1n4K10J7p1J2l1r2J19M4p4%O3r1J37j48j2O8QK1k3o9J57j2m6q3q2K85j30n4kj0L2N1
1082F2j17J3M2q0J99j70J09r5l2O4p4M5R9p8K6m4RN5M4n1K8q0J13q6J5p5L4m3N8n4m8J28J7
793C3J30j28j32R7p5P9Q2k5l9j12J09R2q4p9k1K4N6o6R3k6r5P4r9O3N2%Q7j03l6k7R5%l3J64
496A50o8o4j24J17r5N2M7l2k4%R8j59J25K1j06O3j43O7P3q8l3K25M7k48P4oJ5rO1J9j67J68
216E6l9n7J33r1M6L6n0Om2N2q2J2rJ04j87J91j81PJ53N3j53j19K02P4p1j57J23m8N4ll5J00
-64G8Kq5j23J7L1kJ06Rj2q5l6J37O7O3o7j75N8N2j54
$$ plain form
1957 -5 75 -104 83 8 66 15 61 64 28 80 -57 -11 115 -121 34 -68 -16 -136 -13 98 24 -8 -41 -1 -17 -11 -150 -51 11 13 98 69
1677 69 -20 58 101 -132 -147 -3 -31 -54 77 -94 -79 5 -31 -56 65 120 58 50 43 -69 -71 -12 -74 -114 -30 -32 8 -53 -78 46 -17 -26 14 -7
1380 -7 -78 -132 78 95 24 36 5 -87 32 76 2 2 65 -26 111 -37 -49 19 27 48 25 -44 113 101 55 -28 -110 175 45 -9 -11 -21 11 62
1082 62 -55 -42 0 -80 119 -51 58 -37 -69 -5 -79 -34 65 -13 13 -31 -22 33 77 26 54 -26 87 1 16 -59 -25 -68 -10 -64 -112 16 33
793 33 163 35 -97 0 -75 4 86 61 22 -90 19 111 27 -52 -73 -49 7 -59 34 8 -87 -13 -112 -49 3 3 90 -13 -49 -76 19 19 -14 150
496 150 82 18 -106 11 -84 -32 15 -17 -41 -41 57 -102 23 44 -62 1 -142 -75 -2 -90 -123 102 149 -99 -25 -31 -16 -25 36 55 -112 56
216 56 17 -40 93 2 48 84 34 40 -2 50 -32 -20 -29 75 -112 79 -102 -95 58 111 -42 -161 41 115 44 -113 10 -38 16 13 -22 78
-64 78 80 -5 -128 -111 -80 -82 24 33 21 -64 -100 37 104 167 100 -75 -17 35 -119
-230a19
##PAGE=	F1=1634.08
##FIRST=	23146.756194512010552,	4241.1435120000014649,	0.14829878509044647217
##DATA TABLE=	(F2++(Y..Y)), PROFILE
4241f4M4O3N0o7j7j0N2q3N4N3o1M5L9p7j99J12J3P0L7J11j00n8r0K4J81p2o3J5o4j07J22m5
3961i2J61pm1L1K8j58J60l7k5o4M6j10Q5j7J25o5r0R0q6K2q1K27q0MK9k05K06o6n7J90j20
3690CR3j69J21j36J07j1o0J25j50J97j57R1L1j19L6j4L6L3o5j40K39k9m4q3J44P0j00lkj20
3427g6P1n9j54J90J20j91N7O4R5k6q1k5RP8j42m4J88j22J07j41J84l7j03p8N4pO8O3o8j43
3165a49L7L7J13L9n5k0lL2K6j35M8K6J06k05J51j50Q7J09%j96P2j08P0K25j59j5k7O6j4m5
2902c7O9N5j4l7L3l4j2k8J0M5qj24P4L6k2J46j30q1L6j46Q8K5J54k24R3J84l1j64J7P8J7j03
2622c5L1r5K6j8K2R7J5m7Q3k2j12J32K7j04j6L5p1R2M4j08Q6o5J9K2J7jj12K5O6L9r3R3k1
2334E1j60J30O8m2o1J30j49O8N4l2j05k7k8O0J00O0r9p2J74M2j03q2m5O9p7PL2k5P8J0N2o1
$$ plain form
4241 -64 -20 43 93 26 9 -1 51 -32 22 75 14 59 98 21 -178 -66 -53 17 54 165 65 7 -83 -59 122 50 -13 2 -62 -169 -47 -92
3961 -92 69 62 21 52 80 -78 82 45 20 -44 2 -108 -23 -40 85 20 -70 20 -66 -44 -125 102 22 26 55 -150 56 -10 -67 123 3
3690 3 96 -73 48 -88 19 8 -52 73 -77 120 -37 54 85 -34 2 -12 24 57 -8 -148 91 62 18 -65 79 149 49 46 44 -76
3427 -76 -5 -64 -218 -28 92 -99 -42 22 117 91 10 -15 -6 72 -70 -114 74 -48 59 -82 102 65 -38 -116 -62 -69 -1 62 -6 -149
3165 -149 -112 -75 38 77 22 2 -1 31 57 -78 -30 -4 102 -103 48 -102 -15 94 94 -102 -30 -138 -68 157 -2 -17 -44 22 8 -37
2902 -37 32 87 73 36 69 35 23 -5 5 50 42 -82 -8 28 6 152 22 -59 -23 -169 -81 -56 98 -126 -33 151 120 -44 -27 51 68 -35
2622 -35 -4 -99 -73 -91 -69 28 43 -4 79 57 -55 77 104 0 -16 19 -52 40 84 -24 62 -3 16 38 55 54 -58 -33 33 72 -21 72 51
2334 51 -109 21 89 47 -14 116 -33 35 89 57 -48 -75 -103 -43 57 117 18 -54 120 162 59 -23 -68 1 -76 -69 -37 -62 16 26 78 17
2054A7J2RM9k00JL7Q4j4N0j37J07P5k00K26j27Q0o4O5K5j09Q2j10j2J43k03J01r1Q5p6J23
1791B8R7nj73K6J09j04J3j22M5R6K2P5o6j05P0Q5k39%J22Rm6J18j09KR6p7m6J55K2r6KL5j02
1502f3n6J22j9k3L4o9P9Rn3L6j6Kl5j3k4j6J26k1K6j6j2o3J38J3j00LQ3q9J10q3k0j1lP3n5
1196fj8J31J0l8j13m8K54r4j12J8rJ3L3p7N2j7n5J65j15Q2o4m4K5n7O3O8q1J05q5L5k5M7o3
907b0Q9q4R1l8Kj05L5n2L1n3OR7J1J44o3j49K7rK0J16l1n6p9R2O3p5o7J2K8M0j01J34l2j18
610i4O6o6J04k6N9J9j21l7J7J13k3j2J09o2j8j01Q6p7P3K7l7k3l0P9j52Q9O9j18J20j72O7
338g2M6n5RJ39R9k64R5n9J10o3M9N7j60J17m5j9Q0p7K7Q0o4pn5Q9j08L5l2Q3j24J21j54L6
58h6J31P2j78j12K02M5o5j41J60p8O5L2n2P9Mj34o0J5LOR2K3J2o4m0J02Q4Ll1j36M8K0j46
$$ plain form
2054 17 29 38 87 -113 -112 -75 9 -5 45 -92 15 90 -110 116 -11 69 5 70 95 -14 68 -42 -54 89 -114 -13 -104 -19 -95 28
1791 28 125 120 -53 -27 82 -22 -9 -131 -86 10 32 107 41 -64 6 91 -148 -148 -26 -17 -63 55 -54 -52 44 -33 -79 76 98 2 4 39 -63
1502 -63 -119 3 -16 -39 -5 -74 5 14 -39 -3 -19 -17 -52 -65 -89 -105 21 0 26 10 -2 -65 73 86 -14 -11 72 -17 93 10 -10 -21 -24 49 -6
1196 -6 -24 107 117 79 -34 -82 172 78 -34 -16 -25 -12 21 -56 -4 -21 -76 89 -26 56 -8 -52 -27 -84 -21 47 -34 71 -14 21 -4 43 -20
907 -20 69 -15 76 38 40 -65 -30 -82 -51 -104 -98 -1 10 154 91 -58 -31 -40 -20 96 65 9 -70 22 85 10 -57 -45 -17 23 -78 56 24 -94
610 -94 -28 -94 10 -16 43 62 -59 -96 -79 34 11 -1 108 46 28 -73 13 -64 9 36 -1 -24 -54 25 -127 -38 31 -87 33 -139 -72
338 -72 -26 -81 -72 67 166 -98 -3 -62 48 -15 34 91 -69 48 3 -16 64 -13 14 94 30 23 -32 57 -51 -16 -48 35 -89 32 -122 -86
58 -86 45 117 -61 -173 29 74 9 -132 28 -50 15 47 -5 74 78 -56 -116 -101 -98 -92 0 23 35 -29 -69 33 117 120 89 -47 1 21 -125
-230a25
##PAGE=	F1=1539.72
##FIRST=	23146.756194512010552,	4241.1435120000014649,	0.25619235634803771973
##DATA TABLE=	(F2++(Y..Y)), PROFILE
4241e6M0P8M5p2l6%Pm0OP5l9J2O0l4j71J05j2N0K4J11r7p1j03J2K13o1q5L4j7j43J32k3R1
3952C5M0o5K4J6j16J58m5p6J2Jj11J45l7P1n2n9P8p7N%J64j32O5R3k35J58l9q7J76j17O1j26
3672g2J33j44J09l1p1J38j59K08j69J06M0q7Jr7Q3M5l5j34K27j12l3MJ12M4o2Pm5q3N8J5j77
3401a81J10J58j81RJ21O8Kj08l3J0O0j38OK03j69J50j42J81o2j35o7P2j0j1J29m4j46N5O0
3147c3N2N4m8j4p2P0N2p7O9n2J51j85R8j71P6J21m0j74R6p3R5J72j55l8KJ6J7n7Q9J5l7m6
2867b7J23j4p0M2j7L6m2q8Q9K0j9J25j61q6J36j69N6k1J86j96O3J60l2j43M1M6K9j51Q5p6
2605g5j9K3K4R1ml7R2m3j34J36O1j33J2N1j23J19P1j64J00l2qk8J12j6j34J7K0P4j43J58j7
2334E1j87J36O2qq0Q2j23R7O1j8j06m5m5P1R4K5m1r9J97O4j50p8k1Q1p4J7J1l4P1M1l2l8O
$$ plain form
4241 -56 -16 62 107 35 -1 -1 6 -34 -28 47 8 20 80 46 -125 -20 -32 18 42 153 56 -15 -118 -106 107 46 -39 -5 -22 -165 -33 -56 35
3952 35 75 10 34 50 -66 92 47 -29 -17 -16 -127 18 -19 52 0 -59 19 -58 -53 -53 111 -21 44 137 -98 60 21 -66 110 -7 54 -72
3672 -72 61 -83 26 -5 -76 62 -97 111 -58 48 88 1 2 -95 -12 33 -2 -136 91 -21 -54 -50 62 106 44 51 6 -77 -19 -4 -181
3401 -181 -71 87 -94 -85 36 104 106 -2 -35 -25 35 -103 -97 106 -63 87 -55 126 64 -71 -138 -66 -76 -87 42 -2 -148 -93 -33
3147 -33 19 73 25 11 -61 9 61 -16 53 1 152 -33 65 -106 -30 91 51 -123 -27 -100 -5 167 12 -26 -24 -8 9 -48 41 56 19 -27
2867 -27 96 82 12 54 37 73 31 -57 32 52 33 158 -3 -89 47 -122 -66 -87 99 -97 -34 126 94 -49 -8 38 67 -84 1 -75
2605 -75 -94 -71 -47 44 40 3 95 52 -82 54 115 -18 -6 45 -78 41 112 -52 48 16 8 -20 92 76 -58 -41 -21 53 -90 68 51
2334 51 -136 0 62 54 -26 56 -67 30 91 73 -33 -78 -123 -52 42 67 26 -73 124 188 38 -40 -61 20 -54 -37 -26 -60 11 52 20 -18 -12
2045a2J5J16j82o5M8R9j2J9r4P8P1j65K00j42P8o8P4N6j76R6m3q0J44j48N3o0J06l4R1N6Q6
1773B05k63L7J65j91M5j04j4J14L5Q4j07j23Q0J01j81j0J03L6o6R3n2NP5j12m7J71pj15OO7
1511C0q4j12K00mpKj18R8M3n4k7K3kq7J1K8K0j0k6R4k9nk2J35qj26J2R2r1R2l0J2r4k5J03
1205C4p5N2P7L4l8j17l2K01m2j35N3k0l7Oj3P3m2l0R7n4M2k4n7J8n1O0M0q1J66p9M9j08P8
916D5r4J25o1K6L1l2q7Qn5L1m2L8N4MJ21K6j84j7N5m8J40m5m6n2Q3J4n8n2M1L5J4j26J73k8
618C7j38P3k1J25j25J29o0r5m7M3J41o3J8M0n8M5q7M6m1J01Kl3n3l8K7r6L4J36j09J61j89
347i5K3Mj4P4L6J50k40P4o9J69j11RJ11j40N9m4J5Nm6J8Q6o3j1k7Q0j04N1o3O3o9O8j59P1
58h9J12P2j70q5J57Mk3r7J72q0M4O7o0K7Kj50J1J7l2L0O3J7L9n2l2N7P6k8k0o6M5l3j12
$$ plain form
2045 -12 3 119 -63 -128 -80 19 7 26 -68 10 81 -84 116 -26 52 -16 58 114 -62 34 -9 -89 55 -93 -40 -100 6 -28 63 119 205
1773 205 -58 -21 144 -47 -2 -106 -120 -6 29 113 6 -117 -37 64 -117 -127 -24 12 -54 39 -13 -8 67 -45 -92 79 72 -43 -37 30
1511 30 -54 -166 34 30 23 25 -93 5 48 -6 -33 -10 -12 -99 -88 -60 -40 -50 -76 18 -11 -16 -38 97 89 -37 -25 67 -24 68 38 50 -44 -69 34
1205 34 -41 11 88 122 84 -33 -65 136 94 -41 12 -8 -45 -39 -52 21 -21 -51 46 -8 34 10 -47 -29 -80 -20 20 -61 105 26 75 -33 45
916 45 -49 76 15 41 72 40 -47 -39 -94 -63 -105 -67 -13 -9 112 138 -46 -63 -8 -56 84 39 -7 -59 24 38 -20 -72 -31 4 18 -108 65 37
618 37 -101 -28 -49 76 -49 80 20 -75 -122 -79 62 -1 17 57 -1 44 -43 3 -38 63 65 32 -21 -59 -32 -128 -94 42 -67 94 -95
347 -95 -72 -68 -82 -8 28 178 -62 12 -57 112 1 10 121 -19 40 -4 11 16 -30 -12 74 11 0 -27 53 -51 0 -63 0 -69 -1 -160 -89
58 -89 23 95 -75 -160 -3 1 -22 -119 53 -27 17 84 24 51 53 -97 -86 -69 -101 -71 -8 9 48 -4 -36 21 97 69 49 -17 28 -5 -117
-230a17
##PAGE=	F1=1445.37
##FIRST=	23146.756194512010552,	4241.1435120000014649,	0.30063080787658691406
##DATA TABLE=	(F2++(Y..Y)), PROFILE
4241e8M4Q7K5p2k3Km9M7p5O9rj1N7J8j29J09n1L2L3Q1p2p7r6j4K04l7r5M1K3j33R4JJ8J04
3944H8o1k1K2r3J32m2j03Q2n1p2J77n1Pn5j7P1m9l4R4R2j40P1J35k14R1j6j03J42r9M3q9J40
3664G7j27P6j4q1J35j55J82j45R4K4l8l0j46R4O4nj12J79j71j9O4P4K5m0L4q1j9L1Q3j46K0
3392g3J27j35J3J44J5K4j59l4J1M7q9L8J88j86J60j39J71p0j24o4Q2Jj10J78k1j00M9O3jM1
3130D7k8oj26J15M2j2Q0j09J88j77N1j65M8J40o8j56J22n5J06J24j46m6J1l3M9m3P7m1l5j8
2867f4J62Oq1N7oJ2q4n7J21K8o2J08j76n9K17j84J9o1J88j24K3R4oj53P6L5Qj66J30m4o4P8
2587b9J4Q2l9k4R3p1j15J17N2j48O7O0j44J09R2j77J13j2l9q4J87j5j68M3l6P8j68J97L3k13
2325a45J44L3L5r4L8j21J02R4k3q7m9o1Q1P3K8k0j10J87Q7j61p0J7O5o3j9J9k3M1O6r4j2L
$$ plain form
4241 -58 -14 73 98 26 3 5 -44 3 -72 -3 -12 -23 34 52 -77 32 -19 13 46 127 55 -22 -118 -132 72 35 -60 -19 4 -129 -35 -34 -16 88
3944 88 27 6 28 -65 67 25 -78 4 -47 -119 58 7 14 -41 -58 13 -36 -70 24 116 -24 47 182 -32 59 43 -60 82 -17 26 -63 77
3664 77 -50 26 12 -69 66 -89 93 -52 42 66 28 -2 -148 -54 10 5 -107 72 -99 -118 -54 20 45 5 39 -42 -61 -30 53 -93 -73
3392 -73 54 -81 -68 76 91 115 -44 -78 -67 -20 -109 -71 117 -69 91 -48 123 53 -71 -135 -53 -52 -162 16 -5 -105 -56 7 6 47
3130 47 19 13 -113 2 44 32 112 3 191 14 65 -100 -52 88 20 -136 -14 -69 37 161 15 -31 -20 -53 -4 -47 30 -11 -46 -64
2867 -64 98 104 23 80 74 86 2 -55 66 94 32 140 -36 -95 122 -62 -43 -104 84 -40 -17 77 71 -82 -6 29 37 -129 1 -43 -107 -29
2587 -29 -15 67 28 4 97 26 -89 28 80 -68 -1 59 -85 24 116 -61 52 40 1 -83 104 89 -79 -36 -72 6 -162 35 68 -145
2325 -145 -1 32 67 -27 11 -110 -8 86 63 -24 -73 -134 -53 20 48 28 -82 105 192 31 -39 -22 43 -20 -39 -20 -43 -2 64 -30 -42 -39
2045c9J7J29j20j09M5R7k0%l6K3N4p5J09j08N7o7P8Q6k35J07K3j16J34r8J4j2J05rL9J9J41
1773B33k64jJ92k44J01r4m7R7L9J05j36j35J09Q1q8n0R0N8q4O0nK7J4j10m0J66k0j20RP4n7
1502d0j65K63j4J8mj37Q0L9l3m2L9j1j04M1P2L0j39mJ21l4lJ3J21k8j41L3P7r3R6j4O7j33
1222b9n1Q9o8J02K6N2m3r9m9J48Mj19Q3l2q4k0M8N8nk5K7j3J3rn7K7k8L1K3o7J80n3M6j52
925d6J33j48J28j9n0Q9o2m7k7n1N2pJ3K7JN6J08k04k1Q8r8J20m2j0l9O8l1n2j6N2L5kj29J90
627E9j7j48Q3L7J03j96J85j13n1o0N1J67j04K9j2o0J09r4J2mJ45m4lr4k5m9j6l0K02o9J65
356A58j95l4k6J4J20m2J76j76K7m4J70j29l7J36j05K9n3M4n7qQN9o2KL3K8m8L9j13O1k1K6
76b0j79R3J14N3j52m6R3k8L7m0J43n2kO8l9k2Nj43N2L5n6N0K4jP1o1j7J4N5j7l8J6L5q4o0
$$ plain form
2045 -39 -22 107 -13 -122 -77 20 0 0 -36 -13 41 -34 75 -33 24 -43 35 121 -114 -7 16 -100 34 -64 -50 -62 43 34 73 92 233
1773 233 -31 -32 160 -84 17 -77 -124 -27 12 117 -19 -154 -45 36 -52 -102 -12 46 -38 22 17 44 58 -52 -92 74 54 -66 -57 17 -40
1502 -40 -205 58 44 62 58 -79 1 40 7 -35 4 -7 -111 -70 2 32 -107 -111 10 -24 -27 -14 107 79 -62 -29 48 -45 51 37 104 -29
1222 -29 -80 9 -59 43 69 121 78 -21 -70 78 82 -37 46 14 -70 -90 -42 16 11 -14 13 0 13 4 -53 -26 -54 -23 0 -67 113 60 106 -46
925 -46 87 -61 67 48 -2 87 25 -22 -49 -100 -48 -55 -42 -15 -14 42 150 -54 -75 13 -85 35 -7 -17 -56 12 -19 -71 -87 -35 0 -2 -131 59
627 59 42 -106 -23 14 117 -79 106 -7 -58 -118 -67 100 -4 25 13 -47 62 -32 -20 -24 121 77 74 -20 -45 -94 -110 -140 62 -7 158
356 158 -37 -71 -97 -83 37 -5 171 -5 22 -22 148 19 -18 118 13 42 -11 33 -24 -32 -24 35 -27 -25 8 36 -12 27 -86 -25 -46 -20
76 -20 -199 -106 8 61 -91 -137 -44 -72 -35 -75 68 16 14 82 43 21 26 -117 -65 -30 -86 -36 -12 -13 58 -3 -20 -6 49 32 -6 10 45 -39 -99
-230i9
##PAGE=	F1=1351.01
##FIRST=	23146.756194512010552,	4241.1435120000014649,	0.17857958376407623291
##DATA TABLE=	(F2++(Y..Y)), PROFILE
4241g5M2J10qo8J8j0q4J43j65N3J1j4K3N3q3J25r5L3O9L3m7q2o0n0J61qq3K6M2r6L6L0m0J40
3944H0l9o8L5q5R1rj05J02q4LJ51m7m1p1J8P8j6p8J60M4j18L5J45j68L3qp7J03q2L3p0J36
3664H1q8K8L3j00J05j13J24r3N8lLl6j50P0P4K0q2J17j91%P8L1K9m0O5j01N0k7J40q7m4M9
3384@p1O0J22k2K7j96n4J4M4k5M8J60j67J20j15J40m8p5o8Q2J2j73J76ok9L3M5k5MnMj55J45
3095BJ4M7P1j18K12k08L4j42LJ65p5j38J35o0J15Q1j26k9no9P0j6M5q0j9L1J38L2n6mM6jj18
2806b3n8J54N6j18R2j69lK51j93j0q9J59l0j0J3M0j78J14L1l2j41J26np8J14oQ1p7rP4q9o3
2526g6P6J6j36J22O9j47P4J01j45J09No9j20K09Lk10J04p4N2j59J94R2k16J45j5P3r1J2j40
2272a42Q3J37n6m8l3p6R0N1M3l4r3J52R5j34m8M8K4n5o5M5MJP0j16J0onJ07m0j11K9P5j0p
$$ plain form
4241 -75 -33 77 69 1 19 9 -75 68 -97 -44 -33 -47 -24 29 -54 71 -24 9 78 111 64 -18 -78 -128 33 25 -58 -32 10 -86 -50 -20 -60 80
3944 80 41 -27 8 -77 14 5 -100 2 -82 -79 72 25 -16 -87 -69 9 -7 -85 75 119 1 36 181 13 46 38 -39 64 -18 15 -55 81
3664 81 -7 21 54 -46 59 -54 70 -23 35 32 35 -1 -151 -81 -7 13 -69 48 -143 -143 -65 -34 -5 -45 20 -81 -31 -58 82 -5 -49 0
3384 0 -71 -11 111 89 116 -80 -134 -120 -76 -101 -53 107 -60 60 -55 85 37 -38 -106 -24 -12 -185 -9 -15 -44 -11 34 9 13 8 12 -143 2
3095 2 16 63 134 16 228 20 54 -88 -85 80 5 -133 2 -58 57 138 12 -17 -22 -91 -21 -37 8 -72 -91 -60 78 110 54 50 96 95 -23
2806 -23 -81 73 129 11 103 -66 -69 182 -11 -21 -110 49 19 9 22 62 -116 -2 29 -3 -144 -18 -23 -101 13 7 88 11 2 76 -13 -76
2526 -76 0 16 -120 2 71 -76 -2 99 -46 63 68 -1 -121 88 91 -119 -15 -89 -37 -196 -2 90 -126 19 4 77 -14 -2 -142
2272 -142 -59 78 22 -26 -59 -135 -45 6 49 15 -78 74 169 35 -13 35 59 4 -61 -16 -12 -11 59 -57 -47 -53 -58 49 9 -102 -73 2 -8 -15
1975a5J5m0K0L9j3l8L2p0Q1J03k77J25O2j09J19o8k0L4R0Mk4J0J33j90n4J82k47J69q8n7N4
1703c8M1J09j40j25J34M1Jj03P3O8r4L3L1M9n7o8l5J40j1j19J8N9l6j95K82m3O4Kj27L5J8
1432Gmk2L3qr3O1Q7J2j98RJ25m0OK4J15n6j42O7L8q3J08k4R4r7o5M1m9J13nO7m8o9r3J11K8
1126E0q5R3k6j01m0P4J6P3m3qlRl2m5L4K2oJ8l5J38m1L3j37J84k11J10K2j05J17o0k4m6l7
837i2P4M2n9K0Ql0J63j85JQ5j25N9j2L6l2L5n2o7M7M4K0mj04J78j3j40Q4R0M7k09K11j38j4
548c2o1N4J73j30Rl9n1J52j08k0J5J97j00M5j14Kj20M9r1K46j1J22j92n8l2L4J16q7J69r4
286D3j7j0J34j20o0R6n0L3p5P0q0K0JJ2p2K8J00l7M4Pj76P4J6lj89Q9J30L6j46j0M0m2Q4P
-12b3Q5j0n2K8J0l7Qj18N3N6o7M9nk3R6o7j7qL4J2o1Q6Pj10n
$$ plain form
1975 -15 0 -40 -20 19 6 -32 0 -70 11 114 -163 -38 24 -85 34 -34 -54 -20 70 74 50 60 193 3 -51 131 -116 53 -35 -92 -38
1703 -38 3 112 -28 -153 -19 22 23 -80 -7 61 -33 0 31 80 23 -45 -80 60 49 -70 -52 7 -29 -224 58 15 79 81 -46 -11 7
1432 7 3 -19 14 6 -87 -26 61 73 -125 -116 9 -31 -25 -1 114 58 -84 -17 21 -62 46 22 116 19 -46 -5 -54 59 54 121 73 4 -89 22 50
1126 50 -35 58 32 -69 -109 -35 -19 54 11 3 0 9 -23 -68 -34 -12 -18 0 -35 103 62 95 -42 142 -69 41 63 -42 75 15 -9 -55 -92
837 -92 -18 24 -35 -15 -7 -37 126 -59 -58 27 -98 -39 -51 -15 -47 -12 -64 -131 -84 -40 -20 -24 -128 50 37 -103 -19 71 118 -91 120 -18 -32
548 -32 -93 -39 134 4 13 -26 -77 75 -33 -53 -38 159 59 104 -10 -8 -128 -79 -170 76 65 187 -5 -63 -95 -61 55 -32 137 43
286 43 26 16 150 30 -30 66 16 49 -26 44 -36 -16 -15 -3 -75 -47 53 16 60 67 -109 -35 -19 -22 -211 -122 8 44 -102 -112 -72 -114 -30 -23
-12 -23 62 52 0 28 38 1 9 -109 -56 0 -67 -18 -23 -46 50 -17 -34 -42 -8 4 -57 29 36 -74 -79
-230g9
##PAGE=	F1=1256.66
##FIRST=	23146.756194512010552,	4241.1435120000014649,	0.31075516343116760254
##DATA TABLE=	(F2++(Y..Y)), PROFILE
4241i6K2J49m4n5O2l8o6J88k21N5Prl7O3l1J29j26N3J20rm5q4Jq1J01J5m9nL2o0%N7q0J18
3944C6j0q5M9p5M7L9q5O0p7Q7O5k5o2q9M2R2Oj01J72K8r2JJ34j26rj5j2Q0p5J6p4J17l8kP7
3637I6j24M8k4M6k6J1k3K4j2j26K8N3M5n5O3j75K5O2j5M7n2R0r3R9j09J67l1p1l0nJ08P7j9
3349I9%j77r2J0M5J8M1J40j23M1n9Q0Joq6Q1K0j71J08OK7J8J9j0m0J0Rj56J47pQ8M0q1K28
3051B68k68M3j17n3J95o2j23J34p7J26L7r0Ll4q2P8rJ8p6kO7P9N9k8j06J10Qj31q9J76P3j33
2771fO5j44O3K36j96j2j09J03M8j4m7P7j91J43J0n9r0O5L5n5J16k9Q9j06OK6p4KK6j6r8J40
2491DP6j44L9J07j05R0K7r2j21J87Rk35J80q6J1j18J54J12j83J44q3J03o9mj55N6J54q2rp
2229d0q3J01L1L8n7n9J15P9p8j7N3j7n4q5O6K9l2N7j07K9k4n5Q1L8q9J1M2K8j3N0r0k5J35
$$ plain form
4241 -96 -74 75 31 -24 38 0 -66 122 -99 -44 -37 -46 -83 -20 -51 78 -48 5 125 116 71 -13 -12 -93 8 23 -26 -31 1 -59 -59 -2 -82 36
3944 36 26 -59 -10 -85 -38 1 -84 -24 -101 -14 51 26 -36 -125 -83 9 15 -86 86 114 22 23 157 31 22 7 -5 75 0 16 -58 59 21 19 96
3637 96 -28 20 -4 42 16 27 4 28 16 -110 -82 -29 16 -39 24 -151 -126 -64 -79 -32 -84 6 -87 12 -97 70 39 -32 -62 -67 41 118 99
3349 99 99 -78 -170 -160 -115 -97 -56 84 -39 2 -57 23 24 18 -68 13 33 -138 -30 -24 3 21 40 30 -10 0 9 -147 0 -7 81 121 40 268
3051 268 0 43 -74 -127 68 6 -117 17 -60 66 103 13 16 -18 -100 -22 -31 -13 -89 -91 -24 55 114 86 -20 90 98 -33 -122 54 127 -6
2771 -6 59 -85 -22 214 18 6 -103 0 48 34 -13 64 -127 16 26 -33 -123 -58 -23 -78 38 9 98 -8 -2 24 -50 -48 -22 -38 -136 4
2491 4 80 -64 -25 82 -23 67 94 2 -119 68 77 -158 22 -64 -53 -171 -17 95 -88 56 -27 76 7 3 -152 -96 58 -24 -33 -40
2229 -40 -123 -22 9 47 -10 -69 46 125 47 30 83 66 12 -73 -7 22 -10 47 -60 -31 -55 -110 -29 9 -80 -69 -27 1 -12 38 -52 -77 58
1940E8j25L5J9p6Q5R2k86J54O2o8J00o3n0O3P3J0q1L3Q0r1q5J42k02K20p8o7QN3O9j03q9J22
1660A4J2N9j43M4N2q5K1M6N5r3ql1J00Mj12M1L2l5j85K40p5J33rj00qJ5J6j3K8J8p5O1N4j1
1362F2j67qJ26n4L3MJ24q0j32J02j6n4J01l1O0Mo2j4l2R1j9Q7m7l7j48J00K3o3R4Kq1n8N2
1073c8k6J39o9%j0K8q4k5L1Q1k7L1nO3n4J6q1J99k54Q9M9j25J11k3l2m0j5Q0R0j38K2K1j05
785a01J86j30J7O3j30j5L7O8j9j4l7j06J34K1j4No0J46k2j16P9J02rj62K03j42rl7N8J49j26
513A9k9o5qJ58r9n9KK35j43R5j06L5j52P7j26K48L7L8j72k4l1N8O4j05J38k4k9LR7r8n6MJ4
225dN6j00R1n9K7Jm0q2N9J37p9J32k8k22Q7L2j5j68N4J39L9j57J2Ql4R8K5L2J7q4k9O9j4k
-73bp5K8N4o8L1ql4R1m0m9PJ0K8n7J17k6j09L4
$$ plain form
1940 58 -67 -32 -13 -89 -4 88 -198 -44 18 -50 50 -13 -63 0 73 83 2 35 115 24 -61 81 -121 99 21 -46 -38 15 84 -19 -108 14
1660 14 26 85 -58 -14 38 -47 -26 20 75 -18 -26 -57 43 47 -65 -24 8 -27 -212 28 -47 86 77 -23 -31 -16 0 -13 15 33 -42 19 73 62
1362 62 -105 -113 13 -41 -8 -4 120 40 -92 10 -6 -60 41 10 70 74 12 -2 -34 57 38 125 78 41 -107 -7 16 -47 47 49 -32 -90 -38
1073 -38 -64 75 6 6 -4 24 -60 -85 -54 27 0 31 26 89 35 51 -30 169 -85 4 53 -72 39 16 -16 -56 -71 9 99 -39 -17 4 -101
785 -101 85 -45 -28 35 -95 -110 -73 -5 -24 -38 -75 -181 -47 -26 -40 -35 -95 51 29 -87 -8 94 85 -77 126 -16 -25 -62 -4 145 19
513 19 -10 -75 -83 75 -24 -83 -81 154 11 106 0 35 -117 -40 -166 82 119 157 -15 -39 -70 -12 52 -53 85 61 32 35 132 34 -22 -18 -4
225 -4 52 -48 43 -16 11 12 -28 -110 -51 86 7 139 111 -111 -24 8 -7 -175 -121 18 57 -100 -88 -80 -114 -16 9 41 58 -26 -55 14 0 -2
-73 -2 -77 -49 5 -63 -32 -40 -74 17 -23 -72 -65 -55 -27 -84 33 7 -102 -68
-230f8
##PAGE=	F1=1162.31
##FIRST=	23146.756194512010552,	4241.1435120000014649,	0.41173154115676879883
##DATA TABLE=	(F2++(Y..Y)), PROFILE
4241a07j3J85p3k8Q7q0MJ61k13P9j8j2j01M8L7R7j35Q1J67l3o8q4P9r3L8K8rm0Km5J5O8j07
3952h3N2J5o2O1m9OO2n0%l6J36m7Pn9r1M8J03J4r8J37L0p9QJ13j08l1k1M8Q2p5j3r2R0OQQ1
3637A13j36k1Q2l1M0k8k3K4K1r7oMO7l9L3j40N1M2n0N6n8R8n4J13j78J44Mo9p2M9J19L6J3
3349A07n1r6j19mL3L1K5J41q3m2K0MN3O1j20R0L2j24jJ9M3J5mK9p4J9Rj31J11oJ10pk9K39
3051C00l11N2r4j20K29l1j17J22q7J23Nn4M4o3o8P2m2Rk5QO5L5O6k1j87J46L3j17j23J78M7
2780G4q4L2j09J10J85j77J6j23K8P4K1o6Q6j85J57k8n0l8k1N5mQ9m4R8j28J3k8k2N2pk2n8
2500a04J09P5j37K3J23j07P5N1r3j02J52j6k17K36q9k3n5R9O7j10J35j58J28l7k0j40K5J25
2255A5o4J5J0p4J12K2Lp4k9R2M8j5RK8k0o9o9O2L5l9M8r7N0m3j19O8R5o4JJ6P4k3O3j06o4
$$ plain form
4241 -107 -120 65 -8 -36 51 -29 -25 136 -77 2 -16 -28 -129 -81 -44 53 -82 -1 166 133 65 -19 60 -33 5 33 24 -16 -14 -59 -44 24 -83
3952 -83 -31 -16 -78 -17 -66 -60 2 -48 -48 -84 52 5 12 -47 -138 -90 13 27 -71 66 96 17 25 138 30 -1 -22 26 108 33 20 -72 18 24 32 113
3637 113 -23 -44 38 7 47 19 -4 20 41 -56 -62 -58 9 -30 3 -137 -86 -44 -94 -38 -96 2 -52 61 -117 27 31 -38 -110 -61 58 94 107
3349 107 56 -40 -159 -163 -130 -99 -74 67 -16 -58 -38 -34 19 80 -40 50 82 -42 -43 -24 19 34 30 59 -15 4 13 -118 -7 -13 97 90 61 300
3051 300 -11 41 -53 -173 56 25 -92 30 -57 66 71 17 61 -2 -70 2 -40 -31 -56 -48 17 52 118 97 -90 56 89 -28 -151 27 74
2780 74 -10 22 -87 23 208 31 47 -76 -48 26 47 -19 67 -118 39 11 -39 -77 -98 -43 -47 42 -2 96 -32 -19 -47 -69 -17 -24 -46 -104
2500 -104 5 80 -57 -34 89 -18 57 108 15 -87 65 49 -168 68 -21 -44 -99 0 67 -43 92 -66 62 25 5 -135 -110 15
2255 15 -49 -34 -24 -98 14 36 39 -35 -64 28 76 61 70 98 78 9 -60 2 37 -2 46 -51 -1 -44 -163 -95 0 -64 -63 -47 27 4 67 -39 -103
1948a03J74j93P8K4p0P9M6k48J85L4j4P9p7o8P1N4J7j22P1L2l2q0R9j32K36n7r8j8P0rk8l6
1668c6O9jP8j44J8Kn3K5K7M9q4L9j4N2J2r7Q1Ln5j41J49r4K03m5p7k0M5K3m4L9N6o3M5j7k1
1362Ip9m6J33p7P0l9J48q0j15J27p8j9O4j2k7J23l7n4k9O0l2J16l0j9j95J13jo9J07M9n2p5
1082d6km6J53q4L4j7M5j25j1K6J25k4N7Nj3p9Kk0J65k54P3O0j17Q7K4n4j9J1P5J10j75J9L4
793A9j51J76n2lM4j10o7P8O8jm4qj48K16ln8Oj1J17m1r0P8N7l5p6J68j31m9J4O7R6j00o0r7
496a31O4J23m6j07l6K35j53J28p9O9j40P6j25K02N4m9j33N0m5Q0Oj11J07J5kk3Q1q4l0j03
233a07P2Q6j21R7j0K6Pq8p1Q2J26q6J75m1k22Q3K6j2j27J3J17O0j65K0j7j6R1RJ2J5r2o7J17
-55hK0k8j8jK3p1J4Qj4M3K9j08N5k6J5j2R8m1r1M0
$$ plain form
1948 -103 71 -122 -44 -20 -90 -11 35 -213 -28 6 -8 71 -6 -74 -3 51 68 -54 17 49 17 -63 36 -96 140 83 -15 -33 37 28 0 -36
1668 -36 33 32 110 -34 -16 -14 -67 -42 -15 34 -50 -11 -25 27 39 -58 23 26 -29 -170 -21 -115 88 43 -34 -54 -9 14 -30 9 65 2 47 30 9
1362 9 -70 -116 17 -60 10 -29 119 39 -76 51 -27 -46 18 6 -21 102 65 11 -18 42 10 126 96 77 -118 -5 -6 -75 32 81 29 -46
1082 -46 -48 -94 59 -25 9 -8 37 -88 -99 -73 52 28 85 90 77 -2 0 -20 145 -109 -36 24 -93 -6 18 -36 -55 -44 31 141 -34 -15 19
793 19 -132 44 -8 -11 33 -77 -144 -66 2 1 -43 -51 -199 17 14 -44 -38 -49 68 27 -63 15 72 37 -39 129 -2 -51 -37 30 126 26 -34 -131
496 -131 -67 56 10 -97 -133 102 -51 77 -2 67 -73 3 -122 80 134 85 -48 2 -43 37 43 -68 39 54 52 29 110 26 -4 -107
233 -107 -35 51 -70 27 17 43 50 -38 -109 -27 99 13 188 147 -75 8 34 22 -105 -92 25 85 -80 -60 -77 -93 -2 7 19 34 -58 -125 -8
-55 -8 12 -16 -34 -35 -12 -83 -69 -61 -75 -32 -3 -111 -56 -82 -67 -79 19 -22 -113 -73
-230g3
##PAGE=	F1=1067.95
##FIRST=	23146.756194512010552,	4241.1435120000014649,	0.038060449063777923584
##DATA TABLE=	(F2++(Y..Y)), PROFILE
4241i8m2J88r4J6P5j12Q2R4j43R9m2k9j47J8J10L5j23J06J94m5r7p5J50q7j2K7J7n5l5n2O7
3970a0P2j29k6K4oP3j3k3K6j3k0J0J30j40M0n0o7L4J08J1p4P4L6p6N6Q3j03m2oO2R1o3m2j16
3672h9P4K1N5L6j19q7J64q4Q4l8pLM3p3j3n8Q1l6L1j07O4M4o5M3n1Q7J0Q1j91P1K2n3p2Q2
3375d7P8K1N0j03Jj07j8%K9QJ58p0r8J01p0Q9R8j56J11N1p5j05M0K2L1k3O0q0K2J4q8L7J4
3086eJ17n3J1K35k97M3p1j95K63J1j18J05p6Q1Jl4P6p2k8M9j11K6L7J5K8L8L9l4j97J32N0
2815F6r0j25J62j6kQp4J22J09j21N3j23m2L7P6m2P5j83J57n6j2%r2M2M9O3o1J05j42kn9N5
2535f3P0j0km1N3O0j14J6J48j59P8O4o5q7J32o9j49K40r9l4J1M4qj6J06k09J49k3l4r0lN5
2255d9KK1Pm1J12K7l8p9l0Q8K1K7J9j1K7r0m7M0J0oN4j01O7n0j63N9J06l6QJ0Q5k1N0q4q7
$$ plain form
4241 -98 -140 48 -46 -30 45 -67 15 109 -34 65 23 -6 -153 -135 -25 10 -113 -7 187 142 45 -30 120 33 21 48 65 10 -25 -77 -10
3970 -10 62 -67 -93 -69 -75 -2 -15 -38 -12 -25 -45 -35 95 -45 -5 -55 -122 -88 20 31 -43 31 67 -9 47 130 27 -15 -21 41 132 69 27 -89
3672 -89 -15 6 61 97 -22 -109 55 -29 55 17 10 13 56 -17 -30 -88 -7 -43 -12 -119 -55 -11 -76 -33 -84 3 13 94 -97 -26 -4 -57 -129 -47
3375 -47 31 52 102 -1 0 -107 -125 -125 -96 -88 70 0 -98 3 -67 22 120 -36 75 126 51 -54 -14 8 39 16 76 -4 18 32 -56 -19 -5
3086 -5 112 59 70 305 8 51 -20 -215 48 59 -59 46 -30 51 52 18 94 22 -6 43 -68 -42 -5 10 38 76 115 81 -116 16 66
2815 66 -24 -149 13 -3 -5 3 -71 51 160 39 92 -31 -73 -36 40 -2 73 -110 47 -9 -21 -21 -113 -71 -22 41 -20 85 -57 -59 -118 -63
2535 -63 7 -3 -5 -46 7 67 -47 -31 117 -42 36 100 35 -52 80 11 -138 102 3 -31 -20 24 16 0 106 -103 46 23 -11 -101 -104 -49
2255 -49 -47 -26 -19 -60 52 79 41 -38 -68 20 41 68 87 76 103 13 -34 6 16 10 64 -37 30 -20 -183 -124 -18 -54 -46 -36 49 28 78 -6 -93
1948i3J52k09Q0M7m6N7k8j70K08nL3N9r6o7P6J6K6j46J13J7m2m8P7o9K16k9j37k3Q0r8O6J8
1668C5j2lP1j03J3p4JK8k4N9n6N6K2jNo3J31k3q8q5M2r4K43q2p5NR6K4j05N8R2o3J6q2j3P
1353d2p9J35r5R9r3J79n0r8J33j32MJ5K5j12K03qo8l8M6n3J47jk1k21J45l5q6J28J03m0q6
1082Dn4m7J21q6P3k2L7j17qK5J35j0Q5j5n3r9mJ7J02k00M6O1r6O8M5o3NK6O6J03j49kM7j74
785a33J36L5n4L3o7p7Q7M0Ol0J5j67K57j2j04qK7J11o0q3J02k9l2K2J15j10j13P9P5K9o8o7
505d5j28J33O5L5j49p3J88j29J35m9Q7r4O4r0J22M4j04q3J22q4R0k0j11R0L1M9q5P3q1Jj74
233a70J12J14j42Q3M0L1J5j21l4R0P9p8J63j6j66N3%Or3lO0P5j46K5n4JQ7l1K8qq2o4J31M6
-64C1o1L3j3l0p5J8J9L8l3J14j66J07o8j4M8M9l3o4J3
$$ plain form
1948 -93 59 -150 -70 -23 -69 -12 -40 -210 -2 -7 26 85 -11 -78 -2 14 40 -106 7 24 -18 -66 11 -58 158 129 -8 -31 49 -49 17 35
1668 35 23 20 91 -12 1 -73 -72 -44 -68 -9 -65 -9 13 12 17 -46 85 62 -26 -111 -69 -163 80 -2 -77 -72 24 48 -57 1 93 30 46 -36 -49 -42
1353 -42 -121 14 -81 18 -75 104 54 -44 89 -43 -39 -24 1 -111 92 84 16 -22 24 -29 118 117 96 -125 20 -15 -101 27 130 90 4
1082 4 -50 -97 24 -62 11 -11 26 -91 -99 -74 61 51 136 121 68 -31 -35 -18 84 -116 -70 -9 -105 -37 8 -55 -50 -24 42 145 -4 -6 41 -133
785 -133 3 38 -16 17 -50 -127 -40 0 6 -24 -9 -176 81 69 -35 -43 -16 95 35 -48 54 25 -7 15 130 20 -93 -14 61 90 22 -45
505 -45 -173 -40 25 60 -89 -162 26 -103 32 -17 70 -24 40 -50 72 116 12 -71 51 -33 57 37 -74 16 47 96 11 84 3 4 -170
233 -170 -58 56 -86 -3 37 68 83 -38 -72 18 97 19 182 166 0 53 53 59 -34 -37 23 98 -48 -23 -77 -76 11 -20 8 0 -82 -146 -15 31
-64 31 -30 3 -10 -40 -115 -97 -78 -40 -73 41 -125 -18 -86 -100 -52 -3 -36 -100 -87
-230h7
##PAGE=	F1=973.598
##FIRST=	23146.756194512010552,	4241.1435120000014649,	-0.21795760095119476318
##DATA TABLE=	(F2++(Y..Y)), PROFILE
4241g5m3J46j07O5L2j08J19L5m6Q3l7n3j55k2J65k5j04J29J89n6j11n6J87o7l8J0J7l8o9n6
3979h9J15P9j49q1J6N8Q4J5l6o1J3J4M1Q2j77O1m7k2JJ10Om7J1M9p2J04M1r0m3L5J3R0l8m8
3681C8j39Q4LJ08l6o8j31J78r8R8j2J3l8M7m9jj07Q4l7N1q7M1Q1o6J5l1N4R1Nj33l0L4k3n3
3384a14R3lL1O8j24O5o7j0n2M1j1J75r1j14J70j29J03Q9j70J34O4m7j76P5j5O6m5O2n5J7L4
3112F4l7n7L7J12p8L3J95k24K9n3k64K81O1j16Q3m8nL1l3R1n0J1J8j90O7P0K4k9R0j4n3j32
2832h6Q0L9o3q2J35p8M6Rm5J01J8k8P6j10p8l6J08J5P1k07J47m8K2K6j22mQ5N7q6J07j49m3
2552a23l8J17O6LK3m9QM1p2KJ63k22R3O2j7q9J22j21n3J90j09l4O8Jo3P1N4k12J58l6n1j1
2272e8k5l1P4K2j0J1Q1N7n7p6o3R4J5L0Ql6R4r7n6K3l7O2O3j08P3l7j68K8O7J3L0J7M6MJ3
$$ plain form
4241 -75 -118 28 -79 -14 18 -90 29 64 18 101 64 11 -144 -166 -1 -26 -130 -1 188 132 21 -35 152 85 47 57 74 36 -33 -89
3979 -89 26 105 -44 -125 -109 -51 33 48 12 -49 -36 -22 19 101 -76 -15 -62 -84 -83 27 33 -14 -3 46 -26 78 119 29 -14 21 34 124 86 38
3681 38 -101 -17 -14 94 58 -10 -141 37 -61 37 25 38 0 47 -2 -3 -110 -26 -63 -12 -99 -58 23 -43 -28 -59 -5 86 91 -42 -72 -38 -61 -114
3384 -114 -21 -24 7 75 -49 16 -51 -61 -113 -72 -83 92 1 -113 57 -72 31 120 -50 84 148 101 -75 0 -15 51 6 68 13 30 64
3112 64 27 -30 7 119 41 74 269 45 74 21 -243 38 99 -17 66 18 13 44 11 102 52 63 81 -109 -42 28 52 23 113 99 46 -86
2832 -86 -6 33 -30 -112 23 -55 -9 0 -45 56 74 46 122 12 -66 -102 6 21 92 -115 32 -16 6 32 -90 -94 -9 48 -38 69 -80 -123
2552 -123 -161 -44 22 25 48 -1 7 48 -24 -22 141 -81 12 74 57 -32 90 -31 -84 106 -3 -37 31 32 -31 40 94 -118 40 4 -47 -58
2272 -58 -83 -114 -40 -18 -28 -17 64 121 64 -12 -75 19 34 64 72 36 130 33 -23 0 -37 25 88 -20 53 16 -152 -124 -57 -44 -14 3 49 53 66
1966F6l7q8R6j89N6P8qJ2j03p7K19m3O3L8j06m7R6m5L0j55J53K8j08rQ3l4J75lj56j9O7j57
1686a24J45O1r1mN3m4M3j44N9J0q1J00m9N3O5o0j0j6J83l9j27l6m0q9K37q7r9N2J37K4j49
1415f7O4J08p3j6r4%N3r1J26r8R3j34K04kr0J25j65J0k2N6j37K09Qo7m8O1p9J62L3l1k31J87
1135E4o4r5J31J50n4p8q2l9P8q0R9l2kn2j3K9J11oR9n2m5j03lK7M3j04%M2o2O4K7m8K6J7N4
828C7Q7q5l4O6j87P0J21j01K0j6n3O7pqK3J7j35K31Mj47k3M7J22p0r9J47j08l0J13O1q7j58
548a15J26Q1l5m4n7j32J63J2Q9j58q2J10p9J14j7P4m3N1m2M3K6j12m0J48j23Q2oj01P6N4J02
277A65j62M8q2K7j86J26J36j62M9P1N1J8j30NQ6K6q0J25L4q0Ll3L1p7K0j7O2r3M2j03J0R5
-3B5p9O8l5o6l0J11N3p7N1op2q0M6PJ02j03J78j89J18q4n3R2Lol7l2
$$ plain form
1966 66 29 -59 37 -152 -96 -18 -26 -14 -117 -194 25 -18 45 83 -23 -70 26 -19 11 -144 9 37 -71 -80 3 -31 144 141 -15 -34 33 -124
1686 -124 21 82 -9 -13 40 -4 39 -105 -46 -36 -117 -17 -66 -13 52 -8 -18 -34 149 110 -17 -53 -93 -182 55 -32 -131 -79 58 82 -67
1415 -67 -3 105 32 16 -78 -78 -25 -116 10 -88 5 -129 75 73 -17 108 -57 -47 -69 -13 -150 59 67 0 -48 13 -66 96 129 98 -133 54
1135 54 -10 -105 26 176 122 44 -38 -77 1 -79 20 -12 -14 -66 -79 -50 61 55 154 102 57 -46 -49 -22 21 -83 -83 -41 -103 -39 -12 -60 -34 -17 37
828 37 124 39 5 71 -116 -46 75 -26 -6 -22 -75 -8 -15 -23 0 17 -118 113 117 -30 -53 -6 116 46 -53 94 -14 -44 69 130 43 -115
548 -115 11 92 57 13 -44 -176 -13 -1 88 -70 -152 -42 -121 -7 -24 50 7 58 16 59 85 -27 -67 81 -42 40 34 -67 9 63 165
277 165 3 51 -31 -4 -190 -64 72 -90 -41 30 81 99 -31 -26 60 86 6 131 165 85 88 55 86 9 29 12 74 -19 23 -80 -70 25
-3 25 -54 14 -21 -87 -117 -6 47 -30 21 15 -57 -137 -91 -84 18 -85 93 -96 22 -62 -115 -23 -20 -26 -63 -95
-230i5
##PAGE=	F1=879.244
##FIRST=	23146.756194512010552,	4241.1435120000014649,	-0.075817234814167022705
##DATA TABLE=	(F2++(Y..Y)), PROFILE
4241d9k0Q1j11J00j5o3Q7J1M2K6qn3j34o0J77n2q6J52J47o1j10l1J82m9k5k7qQr2l8J26R4
3961A41j66r7qJ15Q8K5l3j59K0O3O0K7j54P0o1K3m0J20%l1l7Q9o7J12j5n1l7Q4o4O5mk9j53
3672a04J14l2J33r5Jj48J26p3Q1L3K6q9M8k1J2j29Q1l2P4q1k5J53o9j8%jJ74q4l4j18M3K2
3392c2m1Q0q8N5N8q9O3l3K7j01P0k6J71j20j12K18j68J08M4j47J40N7m1k05J17m4J16p5L1
3139C3mLO0J4j43M7R6o6M0J18j31L8m5l09K70J08j04O1k5j05P5l1Q4pL6j2k45J13P0K3q5J59
2859A36p0n7l6K0Mm8oJ06r7J7L6k1O0p7Q4P0q8o7r7Q1Q0R8k55J33nK0O3j20o1R4P2j28J06
2570D7j38r7K0J40M9J9L3o5mL2j9l3J50k40J04M4L2j04J05j48L6J14j06l1J11l2p1J21lj62
2307i6J40o0p0P4m0j00R9L1k9O2K2J08l8p7j02R5L4lj6k8J35q0j02K5q6J44N1r3P0pj56k7
$$ plain form
4241 -49 -69 12 -99 1 -14 -77 10 21 63 89 81 28 -106 -166 11 -41 -127 25 172 111 1 -30 152 103 78 51 43 51 -41 -79 47 141
3961 141 -25 -122 -130 -15 73 98 65 -94 -74 -11 49 76 -78 -8 -69 -46 -86 34 34 3 -34 55 -12 100 85 34 -3 81 17 82 78 49 -104
3672 -104 10 -22 111 16 17 -131 -5 -78 3 36 62 -27 21 0 12 -117 -36 -68 6 -75 -100 53 -16 -34 -34 -35 139 55 21 -97 -54 -32
3392 -32 -73 7 -81 -26 32 -57 6 -27 0 -101 -31 -57 114 -6 -118 100 -68 40 84 -63 77 134 93 -112 5 -39 77 2 33
3139 33 29 32 92 106 -37 10 106 40 80 198 67 105 60 -249 21 129 25 86 61 -44 31 0 84 77 113 101 -144 -31 39 62 -23 136
2859 136 66 9 -27 -7 -3 -51 -57 49 -48 -31 5 -16 44 -33 51 121 33 -34 -131 -50 30 128 -127 6 1 21 84 -36 -97 -3 69 -59 47
2570 47 -91 -188 -168 -28 21 40 73 8 4 36 17 -16 134 -106 -2 42 74 -30 75 -73 -37 77 -29 -60 51 19 -52 69 66 -96
2307 -96 44 -16 -86 -12 -52 -152 -53 -22 -51 11 33 141 103 26 -76 19 53 50 34 6 141 61 -41 -16 -102 42 93 0 70 63 -93 -120
2027a20kR8N0K1j7M9l7J4p7L8j53L1J05J9l1j49nK19p5P2J3r7k4J36j17L2j53J85M1j83J2
1756a05J05k4J25J8j33k3L2j64J82Q4j49JL6lR6j74J00l0j10J58q4N5R2j24k5L8K19l9j68
1502a4Qp6r4J91m8j33R3J38K9j39L5J03p9m3l7lN5p7J09q3M2j49K15L7r3J07j71K0l4O0r6
1231a27J52Qo1n7J00j02J43P3l3k34K22p6q8R0J84p2n6q8k5M8p0J16m9n8L2j1L0O6j8Q4p8
960D5kr5jK9MJ3o1Lj8O6j5j3L9j5L3P8j7o8R2j88j6K01j16jJ7j1L7n1m2P1J6n8J45L9j79j9
645e8M5J37p3j25J89j33n6J73K1p7j36J30P9p4l7m1j01J43k0Q8j25n9L5j9P3K0K3%L2mnJ2
365E7q8j5J19j34P2K2p6M1J05J31k21Kq5M9j37J06J50j83J7P2Q0J1j08J3P5qr4R2Q2jn4n9
85C3N0n5N1q0K0l0Q5j49J3R4j05J05m6n8J4O2N1n6J7J3p5q6Q1k4J44j41K03j63P5n2j04R5
$$ plain form
2027 -120 -122 -24 26 47 30 79 42 56 -21 17 -136 -105 0 19 -12 -161 -166 53 -22 50 63 -34 -58 78 -39 -7 -160 25 66 -117 -105
1756 -105 0 -24 101 119 -14 -37 -5 -169 13 97 -52 -51 -15 -18 78 -96 4 -26 -136 22 -62 -7 85 -39 -64 -26 193 154 -14
1502 -14 -6 -82 -176 15 -33 -166 -73 65 94 -45 -10 93 14 -29 -66 -69 -14 -91 18 -65 -23 -172 43 80 -13 94 -77 -57 -91 -31 -127
1231 -127 25 33 -28 -85 15 -87 56 129 96 -138 84 8 -80 10 194 122 66 -22 -47 1 -69 47 -2 -60 -28 -39 -9 57 39 123 45
960 45 43 -52 -53 -24 -20 -7 -68 -65 -83 -17 -32 -45 -6 -21 12 90 73 5 97 -91 -107 94 -22 -23 -6 -17 20 -31 -73 -2 14 -44 101 140 -39 -58
645 -58 -13 124 51 -74 115 -18 -74 99 120 43 -93 37 116 42 5 -36 -137 6 -14 74 -51 -110 -75 -94 -21 -1 22 22 54 50 45 57
365 57 -31 -46 73 -61 11 33 -43 -2 103 234 13 15 -70 -21 -158 -52 98 -85 -68 4 84 95 -13 0 75 67 -27 65 147 146 92 33
85 33 83 28 79 -1 19 -11 74 -75 -62 32 -73 32 -14 -72 -58 4 55 -1 16 29 -46 -132 -51 -75 69 -72 131 -32 43 -9 -113 -18
-195a8pK3j3p1
$$ plain form
-195 -18 -25 -2 -15 -86
-230h6
##PAGE=	F1=784.89
##FIRST=	23146.756194512010552,	4241.1435120000014649,	0.10936175286769866943
##DATA TABLE=	(F2++(Y..Y)), PROFILE
4241b7KL0j04J08m6J5JPR6l9K1j6j11p5J55m4p6J71P0m4j07j2J55m1J9p8m1N4r7QR5J01j67
3952a7q0l3J49P2K8k3k18J6P2Q0%j01O8r1M9o9J35j0k9n1J47o7P3p2Pk3J04j05K5J4Lj52J39
3664D0n3J09j09O3j38L8k6M5O3L2j28O3QRj30Q9k3Q1q0j15K40q1m7L4o7K39j43N6j66M7P2
3392B2m1N3j55Q1K7rJ9m0P4j22R7k2J26j25j14K44j86J21j6r3J18K5l6j98J53n4J54j01j6
3139a4N7j8P5M8j92M4O3j6M6K7o7Q9n7l14K33J37q7L6j6j72R8qO5L2M2k5k61J39O1J1j34K09
2859A31j11l8L3j3m3l9P5P4n8p4O7QJ4j64J84M6p0j7j08j1J27J40k81J10N3k5J19j06q9O8
2596BR1j74R7j01j44Q3J22K5K6K9n5jL9K5p2J06j90Q6K7N7j16P7j49Q4N9q3m0J45m9m6J18
2325G8m5o8Q1o7q8J40m3j32N3M8l9R6m8J63Nq2j19Q1O7m5m5J4J16m4j50M3j20K02J2l9O1K0
$$ plain form
4241 -27 -25 5 -99 9 -37 -22 -21 -14 82 43 64 48 -63 -138 17 -27 -103 68 138 94 -13 -25 130 89 108 30 -11 43 -54 -46 49 150 -17
3952 -17 -97 -130 19 91 119 96 -122 -106 -34 46 46 -55 13 -78 -29 -98 37 27 -2 -53 94 27 100 28 35 12 116 11 36 50 53 -99 40
3664 40 -13 96 -13 50 -88 -50 -76 -31 32 64 -64 -1 7 16 -114 -25 -48 33 -47 -162 78 -3 -50 -16 -83 156 13 69 -97 -50 22
3392 22 -19 34 -121 -40 -13 -22 -3 -43 31 -91 6 -16 110 -15 -129 115 -71 50 34 -59 59 84 48 -150 3 -51 103 2 -14
3139 -14 43 25 100 148 -44 0 63 47 93 120 53 142 85 -229 4 141 54 90 74 -98 0 -8 57 89 131 106 -155 -16 45 56 -78 131
2859 131 20 -18 15 2 -41 -80 -5 69 11 -63 4 12 26 -138 46 92 22 5 -103 -114 13 153 -128 -18 35 10 129 23 -66 2
2596 2 93 -81 16 -85 -229 -146 -24 1 27 56 1 0 39 64 -8 98 -92 -6 21 78 -38 39 -110 -26 33 -50 -90 55 6 -40 78
2325 78 33 -35 46 -21 -109 31 -12 -144 -91 -43 -82 14 -34 129 134 52 -67 14 81 36 -9 5 121 77 -73 -30 -150 52 64 25 86 106
2045A06j55r0n4K01N4Jn7R6q6N5o3lj19L1J15J4m8j49K8K05r7O0j3p7j1J72j57K3j28J92L9
1773H5k17JJ16rO5L0o8l7rj20J66Q2j70K4QRJ39j50J11p3r5J91j36O9R0j74m2R0K22k5k06
1502c3N2p3j01J29Rj44J00R7M1q1k2Q0o3n7N3k3L4m8R5o5l2j34K06M9j03Q2j50N2l1M5l7P5
1222BNn5o6J43j24R5J24j8k36K36o6p8OK06o6l8q7jL2n7J32o7j04Q2PK9J5l4L7p0M8q4rM6
925a5k4J23j14m9L1M9m5L3L8n1JP0L4r5J19j66r3K53j00j8J3K4K5p7p8P7K1L2M0P3j84%L3
636b0J43p4j42K00r2j18J91Nq5m1Q7O3p7l9k5n5R7l6M5o8k6kL7L0N3m9K7QNkqn0nM7j05P9
321bL4m3k0J81J12k26m2r3O8n2N1J56j96PM8R9Jo9j6N8j7j05Q5R5M0q6p2M8lM3j00k0MJ50
23A18j83K5O4r2J25m0o1N1KM3mm5K1k8r5R9n6J42j37K03j16JJ8j62N8K4M5Nq2
$$ plain form
2045 106 -49 -139 -193 8 62 63 6 102 16 71 8 5 -114 -83 32 46 -2 -151 -123 82 -15 45 32 -45 -56 116 -41 -18 -146 46 85
1773 85 -132 -131 -15 -24 41 71 3 -34 -43 -163 3 85 -85 -61 -53 -44 95 -55 56 -17 -112 79 -57 12 102 -72 -114 -24 198 173 -33
1502 -33 19 -54 -155 -26 -17 -161 -61 36 77 -4 -26 54 -9 -66 -13 -36 -2 -50 45 -20 -52 -186 20 69 -34 48 -102 -50 -81 -36 -73 2
1222 2 7 -48 -114 29 -95 0 124 106 -130 106 40 -38 -32 174 108 70 -17 -18 14 -43 89 22 -82 0 7 36 51 17 54 -16 32 -52 -61 -15
925 -15 -39 84 -30 -79 -48 1 -44 -11 27 -24 -23 47 81 -14 105 -61 -154 99 -1 -19 -6 18 43 -34 -112 -35 -14 18 58 131 -53 -53 -20
636 -20 123 49 -93 107 15 -103 88 93 8 -33 54 117 40 1 -24 -79 18 -18 27 -41 -67 -69 -32 -2 51 2 29 37 42 40 32 -18 -23 24 -81 -2
321 -2 32 -11 -31 150 262 36 -6 -99 -31 -83 -32 124 -72 -65 -17 82 83 14 -2 56 39 -66 19 114 154 68 -4 44 41 84 -16 -36 -32 118
23 118 -65 -40 24 -68 57 17 -44 7 9 52 48 3 24 -4 -99 0 -56 86 -51 152 36 37 55 -107 -49 -25 20 25 -57
-230e7
##PAGE=	F1=690.536
##FIRST=	23146.756194512010552,	4241.1435120000014649,	0.11301776766777038574
##DATA TABLE=	(F2++(Y..Y)), PROFILE
4241a0jK0r0R1n2R4q8j2J11o7K8M8j14n4J26k9o8J71j6jj13nJ35m7O9j26o6P4p2N3M6Q4j35
3952a6m4n1J51L6L7j5k17J8K3J00J0o6P1j26M5o3J46l3l6k6J98p6Qj07O2LP3p6oqK4j22J22
3664C9l5N0q3R7j03l4J0QN5L4j33Q6K9jj27J12j5N7p2j88L13j01o3N6j20K67j39R7j72M4J07
3392G5m1K2j94J03j0P1j9p8J01j10R7PN2r0j24K37j79J44o9l1Q0k7j7j63J62m1J52j12n4J14
3130E8l7O2O0j89L1QN5N7l9n1J62q6k79J86J39q5J5j5j68P5L8M1M7M5k1k42J20P7j4j62K14
2859A02j34pN6oq5l3J34L9J5j69Q2M6l1k16K37K3o2M3p2j15J35J51k36O9R5q0J71r4o4J5R8
2587A07k02P8m4j72J16R3j1L5J3jj2M6N2r2N1r2L0K5N1j18N1j36Q0N2n2o3J74m6j9P1o5M5
2307D5j4l7r8J65l2j23l8O3m0J02r9J97N1q9j07N5R7o6p4O8N6j5j51N5j37K11l7M4M5K5j68
$$ plain form
4241 -10 -11 9 -81 10 -42 52 -36 -48 63 -4 24 72 -42 -96 30 1 -67 104 88 87 -26 -31 104 57 126 0 -66 8 -64 -11 35 119 -16
3952 -16 -60 -111 40 76 113 98 -119 -101 -78 22 32 -34 37 -89 -44 -107 39 6 -30 -56 142 66 74 -33 29 32 105 29 23 15 39 -83 39
3664 39 4 54 -29 68 -35 -69 -59 -51 4 38 -95 -9 20 19 -108 4 -11 46 -26 -214 99 -2 -65 -9 -129 138 -1 96 -76 -32 75
3392 75 34 56 -138 -35 -45 26 7 -71 30 -80 17 24 76 -14 -138 99 -80 64 -5 -36 44 17 0 -163 -1 -42 110 -2 -56 58
3130 58 21 83 143 -46 -15 -7 48 105 66 15 177 91 -188 -2 137 52 67 52 -116 -41 -3 38 85 130 109 -133 -13 64 50 -112 102
2859 102 -32 -39 17 11 -74 -107 27 66 81 -88 -6 40 9 -207 30 53 -9 34 -38 -153 -18 133 -103 -34 61 -19 152 58 -6 9 107
2587 107 -95 -17 -61 -233 -117 -24 -35 0 13 12 0 46 98 6 57 -35 -5 20 71 -47 4 -132 -52 0 -52 -115 59 13 -6 65 0 45
2307 45 31 -6 -104 61 29 -94 -132 -69 -109 -7 -106 91 142 53 -54 1 98 32 -42 26 82 67 -84 -29 -166 45 8 52 97 122 -46
$$ [...]
-230d3
##END NTUPLES=	nD NMR SPECTRUM
##END=	
##END=	
