##TITLE=	Oct20-2021.71.fid
TM-VI-106solid Mg+unprotect.-pyrraz. d6-dmso. 13C

##JCAMP-DX=	6.0	$$ MestReNova 14.3.0-30573
##DATA TYPE=	LINK
##BLOCK_ID=	1
##BLOCKS=	2    
##ORIGIN=	Mestrelab Research S.L.
##OWNER=	hrzepa
##$MNOVA/LINK_BLOCK_TYPE=	ITEM	$$ NMR Spectrum
##$MNOVA/ITEM/POLYGON=	(XY..XY)
5321,5835
8722,5835
8722,8208
5321,8208
5321,5835
##$MNOVA/ITEM/Z=	0
##$MNOVA/ITEM/ANGLE=	0
##TITLE=	Oct20-2021.71.fid
##JCAMP-DX=	6.0	$$ MestReNova 14.3.0-30573
##BLOCK_ID=	2
##DATA TYPE=	MNOVA NMR VIEW DATA
##DATA CLASS=	MNOVA VIEW DATA
##$MNOVA/ITEM/ZOOM/X=	-20.698776542268014111,	240.66949999422217843
##$MNOVA/ITEM/ZOOM/Y=	-149.31462907791137695,	1569.2507171630859375
##END=	
##TITLE=	Oct20-2021.71.fid
##JCAMP-DX=	6.0	$$ MestReNova 14.3.0-30573
##BLOCK_ID=	3
##DATA TYPE=	NMR SPECTRUM
##DATA CLASS=	XYDATA
##NUMDIM=	1
##ORIGIN=	Bruker BioSpin GmbH
##OWNER=	nmr
##.OBSERVE FREQUENCY=	100.69424847706599735
##.OBSERVE NUCLEUS=	^13C
##.SOLVENT NAME=	DMSO_weak
##.PULSE SEQUENCE=	zgpg30
##LONGDATE=	2021/10/20 16:59:00.000
##.ACQUISITIONMODE=	SIMULTANEOUS (DQD)
##$ORIGINAL FORMAT=	Bruker XWIN-NMR
##$MNOVA/SCALES_VERSION=	9
##$PARAMETER FILE=	(acqus, ASCII, /private/var/folders/f6/rjf_tdyn2v98c5c0wvkgn4s80000gn/T/SHA0MCwyTg60NHYStjbpaw/71/acqus, 0)
$$ ##TITLE= Parameter file, TOPSPIN		Version 3.2
$$ ##JCAMPDX= 5.0
$$ ##DATATYPE= Parameter Values
$$ ##NPOINTS= 11	$$ modification sequence number
$$ ##ORIGIN= Bruker BioSpin GmbH
$$ ##OWNER= nmr
$$ $$ 2021-10-20 16:59:12.610 +0100  nmr@CZC10666PP
$$ $$ /opt/topspin/data/agmb/nmr/Oct20-2021/71/acqus
$$ $$ process /opt/topspin3.2/prog/mod/shimcntl
$$ ##$ACQT0= -2.01680680282977
$$ ##$AMP= (0..31)
$$ 100 100 100 100 100 100 100 100 100 100 100 100 100 100 100 100 100 100
$$ 100 100 100 100 100 100 100 100 100 100 100 100 100 100
$$ ##$AMPCOIL= (0..19)
$$ 0 0 0 0 0 0 0 0 0 0 0 0 0 0 0 0 0 0 0 0
$$ ##$ANAVPT= -1
$$ ##$AQSEQ= 0
$$ ##$AQ_mod= 3
$$ ##$AUNM= <au_zgonly>
$$ ##$AUTOPOS= <54 >
$$ ##$BF1= 100.683175
$$ ##$BF2= 400.41
$$ ##$BF3= 100.683175
$$ ##$BF4= 100.683175
$$ ##$BF5= 100.683175
$$ ##$BF6= 100.683175
$$ ##$BF7= 100.683175
$$ ##$BF8= 100.683175
$$ ##$BYTORDA= 0
$$ ##$CAGPARS= (0..11)
$$ 0 0 0 0 0 0 0 0 0 0 0 0
$$ ##$CFDGTYP= 0
$$ ##$CFRGTYP= 9
$$ ##$CHEMSTR= <none>
$$ ##$CNST= (0..63)
$$ 1 1 145 1 1 1 1 1 1 1 1 1 1 1 1 1 1 1 1 1 1 1 1 1 1 1 1 1 1 1 1 1 1 1 1
$$ 1 1 1 1 1 1 1 1 1 1 1 1 1 1 1 1 1 1 1 1 1 1 1 1 1 1 1 1 1
$$ ##$CPDPRG= (0..8)
$$ <waltz16> <> <waltz16> <> <mlev> <mlev> <mlev> <mlev> <mlev>
$$ ##$D= (0..63)
$$ 0 1 0.00345 0 0 0 0 0 0 0.06 0 0.03 2e-05 3e-06 0 0 0.0002 0 0 0 0 0 0
$$ 0 0 0 0 0 0 0 0 0 0 0 0 0 0 0 0 0 0 0 0 0 0 0 0 0 0 0 0 0 0 0 0 0 0 0 0
$$ 0 0 0 0 0
$$ ##$DATE= 1634745551
$$ ##$DE= 6.5
$$ ##$DECBNUC= <off>
$$ ##$DECIM= 760
$$ ##$DECNUC= <off>
$$ ##$DECSTAT= 4
$$ ##$DIGMOD= 1
$$ ##$DIGTYP= 12
$$ ##$DQDMODE= 0
$$ ##$DR= 21
$$ ##$DS= 4
$$ ##$DSPFIRM= 0
$$ ##$DSPFVS= 20
$$ ##$DTYPA= 0
$$ ##$EXP= <c13q>
$$ ##$F1LIST= <111111111111111>
$$ ##$F2LIST= <222222222222222>
$$ [...]
$$ ##$Sgu3PowerLevels= (0..7)
$$ 0 0 0 0 0 0 0 0
$$ ##$Sgu4PowerLevels= (0..7)
$$ 0 0 0 0 0 0 0 0
$$ ##$Sgu5PowerLevels= (0..7)
$$ 0 0 0 0 0 0 0 0
$$ ##$Sgu6PowerLevels= (0..7)
$$ 0 0 0 0 0 0 0 0
$$ ##$Sgu7PowerLevels= (0..7)
$$ 0 0 0 0 0 0 0 0
$$ ##$Sgu8PowerLevels= (0..7)
$$ 0 0 0 0 0 0 0 0
$$ ##$SguType= 3
$$ ##$ShimPowMaxUA= (0..63)
$$ 130000 130000 130000 130000 130000 130000 130000 130000 130000 130000 130000
$$ 130000 130000 130000 130000 130000 130000 130000 130000 130000 0 0 0 0
$$ 0 0 0 0 0 0 0 0 0 0 0 0 0 0 0 0 0 0 0 0 0 0 0 0 0 0 0 0 0 0 0 0 0 0 0 0
$$ 0 0 0 0
$$ ##$ShimPowMaxUC= (0..63)
$$ 130000 130000 130000 130000 130000 130000 130000 130000 130000 130000 130000
$$ 130000 130000 130000 130000 130000 130000 130000 130000 130000 0 0 0 0
$$ 0 0 0 0 0 0 0 0 0 0 0 0 0 0 0 0 0 0 0 0 0 0 0 0 0 0 0 0 0 0 0 0 0 0 0 0
$$ 0 0 0 0
$$ ##$ShimPowMaxUG= (0..63)
$$ 524287 524287 524287 524287 524287 524287 524287 524287 524287 524287 524287
$$ 524287 524287 524287 524287 524287 524287 524287 524287 524287 0 0 0 0
$$ 0 0 0 0 0 0 0 0 0 0 0 0 0 0 0 0 0 0 0 0 0 0 0 0 0 0 0 0 0 0 0 0 0 0 0 0
$$ 0 0 0 0
$$ ##$ShimPowRcbType= 3
$$ ##$ShimPowRes= (0..63)
$$ 1e-20 1e-20 1e-20 1e-20 1e-20 1e-20 1e-20 1e-20 1e-20 1e-20 1e-20 1e-20
$$ 1e-20 1e-20 1e-20 1e-20 1e-20 1e-20 1e-20 1e-20 0 0 0 0 0 0 0 0 0 0 0 0
$$ 0 0 0 0 0 0 0 0 0 0 0 0 0 0 0 0 0 0 0 0 0 0 0 0 0 0 0 0 0 0 0 0
$$ ##$ShimPowRng0= (0..63)
$$ 1 1 1 1 1 1 1 1 1 1 1 1 1 1 1 1 1 1 1 1 0 0 0 0 0 0 0 0 0 0 0 0 0 0 0 0
$$ 0 0 0 0 0 0 0 0 0 0 0 0 0 0 0 0 0 0 0 0 0 0 0 0 0 0 0 0
$$ ##$ShimPowRng1= (0..63)
$$ 1 1 1 1 1 1 1 1 1 1 1 1 1 1 1 1 1 1 1 1 0 0 0 0 0 0 0 0 0 0 0 0 0 0 0 0
$$ 0 0 0 0 0 0 0 0 0 0 0 0 0 0 0 0 0 0 0 0 0 0 0 0 0 0 0 0
$$ ##$ShimPowRng2= (0..63)
$$ 1 1 1 1 1 1 1 1 1 1 1 1 1 1 1 1 1 1 1 1 0 0 0 0 0 0 0 0 0 0 0 0 0 0 0 0
$$ 0 0 0 0 0 0 0 0 0 0 0 0 0 0 0 0 0 0 0 0 0 0 0 0 0 0 0 0
$$ ##$ShimPowRng3= (0..63)
$$ 1 1 1 1 1 1 1 1 1 1 1 1 1 1 1 1 1 1 1 1 0 0 0 0 0 0 0 0 0 0 0 0 0 0 0 0
$$ 0 0 0 0 0 0 0 0 0 0 0 0 0 0 0 0 0 0 0 0 0 0 0 0 0 0 0 0
$$ ##$ShimSysFunc= (0..63)
$$ 1 2 3 4 5 7 9 11 15 16 8 10 12 14 6 17 13 18 19 20 0 0 0 0 0 0 0 0 0 0
$$ 0 0 0 0 0 0 0 0 0 0 0 0 0 0 0 0 0 0 0 0 0 0 0 0 0 0 0 0 0 0 0 0 0 0
$$ ##$ShimSysMatrix= 0
$$ ##$ShimSysType= 1
$$ ##$TFXNUM= 0
$$ ##$TRIPLO2= 0
$$ ##$VTU= 2
$$ ##$VTUETH= <149.236.99.20>
$$ ##$VTUTY= <no>
$$ ##$WBREFAM= (0..15)
$$ 135 116 100 100 100 100 100 100 100 100 100 100 100 100 100 100
$$ ##$WBREFLM= (0..15)
$$ 0 0 0 0 0 0 0 0 0 0 0 0 0 0 0 0
$$ ##$WBREFPH= (0..15)
$$ 71.66 -68.25 0 0 0 0 0 0 0 0 0 0 0 0 0 0
$$ ##$WBSGU= (0..15)
$$ 0 0 0 0 0 0 0 0 0 0 0 0 0 0 0 0
$$ ##$XFAC= 2
$$ ##END=
$$ 
##$DECIM=	760
##$DSPFVS=	20
##XUNITS=	HZ
##YUNITS=	ARBITRARY UNITS
##FIRSTX=	24231.369385662510467
##LASTX=	-2084.0185409410978536
##DELTAX=	-0.40154708059210514337
##XFACTOR=	1
##YFACTOR=	0.044530196606032891593
##FIRSTY=	5.7946729660034179688
##MINY=	-6.6554646492004394531
##MAXY=	1426.591552734375
##NPOINTS=	65536
##XYDATA=	(X++(Y..Y))
$$ [...]
13849 70 74 82 90 98 108 119 126 129 136 156 189 220 232 222 199 175 156 146 148 155 156 142 116 94 90 105 125 136 137 140 151 169 180 176 161 144 136 139 150 159 161 153 145 142 144 145
13831 145 140 134 129 127 128 137 152 170 182 184 177 169 168 175 184 184 172 157 155 169 194 217 231 235 234 232 232 229 218 195 167 146 142 154 172 186 199 215 236 257 270 270 254 221 180
13813 180 145 124 124 144 179 218 245 254 251 245 241 236 229 219 210 202 194 185 171 152 132 112 95 84 89 114 149 175 187 188 184 176 167 163 164 162 151 131 107 86 78 87 106 118 115
13795 115 105 100 98 90 72 57 61 88 132 182 224 252 261 246 207 153 106 85 84 88 85 76 68 62 61 72 98 132 158 170 173 172 170 166 161 153 141 126 111 100 99 114 143 179
13777 179 209 226 227 218 205 199 201 204 203 199 200 209 220 226 229 232 233 228 215 200 183 166 152 146 152 163 164 150 131 125 140 164 179 179 174 176 189 206 222 237 250 258 257 249 241 235 230 228
13758 228 229 232 233 234 243 264 285 293 283 266 257 258 265 273 276 271 261 252 253 261 268 270 266 257 238 211 183 165 161 161 158 154 159 181 216 250 271 273 257 229 199 178 169 174 195 230 265 285
13739 285 284 267 240 205 166 134 114 101 89 84 98 127 155 170 178 188 197 197 188 176 163 148 132 117 105 94 83 69 53 38 27 28 41 64 94 129 163 192
13723 192 214 236 260 284 304 319 325 319 300 273 249 230 214 197 177 154 133 122 121 128 139 151 161 163 156 142 129 119 110 99 87 83 90 107 129 148 161 173 187
13708 187 202 209 202 181 158 143 139 144 156 177 203 219 214 192 169 158 158 161 163 163 165 167 168 167 167 175 194 223 252 273 284 285 276 256 230 203 180 162 148 143 144 147 149 147 141 131
13689 131 119 111 111 118 126 130 128 121 113 107 107 112 121 131 144 160 180 199 212 221 234 256 286 314 327 318 294 267 243 225 207 185 160 134 111 89 65 35 10 5 27 60
13672 60 80 86 92 108 125 130 127 129 144 165 185 204 221 225 205 160 103 47 1 -30 -46 -49 -40 -20 4 26 41 48 51 53 57 63 70 71 67 67 74 84 95 107 122 134 134 125 117
13654 117 116 118 120 121 122 120 115 114 122 135 149 163 179 194 204 209 216 224 227 222 211 201 191 183 179 177 169 147 114 87 78 95 133 181 225 257 274 279 273 257 233 209 192 183 176 168
13636 168 158 150 143 132 116 100 88 80 78 85 108 147 189 217 222 214 212 225 249 264 254 221 184 161 154 148 136 120 108 106 114 127 135 129 110 91 86 98 121 140 146 140 131
13618 131 129 132 128 110 87 70 62 60 61 69 85 103 122 145 172 192 191 170 142 120 101 80 55 30 11 2 7 24 46 67 82 94 104 113 126 146 169 189 202 210
13602 210 213 210 200 189 189 200 212 212 201 185 172 163 160 167 183 200 210 211 210 208 204 192 176 161 152 151 155 160 161 154 142 124 102 82 69 67 75 87 104 121 133 135 131 132 144
13584 144 158 165 161 148 128 104 80 64 60 70 92 122 150 164 161 152 147 149 156 164 174 183 189 193 197 201 208 215 219 213 199 185 179 179 180 176 170 165 166 172 174 168 158 157 175 203 220 211 179
13565 179 142 113 101 103 108 106 96 86 84 89 92 88 85 93 112 137 158 173 178 175 165 153 149 158 182 213 239 255 261 263 267 276 287 287 266 226 183 149 134 136 151 175 201 221
13547 221 235 250 269 290 308 323 333 335 336 339 346 349 342 330 322 320 317 306 289 271 256 246 242 244 243 235 221 209 202 197 188 176 166 159 154 149 143 136 134 146 174 209 232 233 217 195
13529 195 176 166 169 188 209 216 206 188 172 156 138 125 124 137 156 175 191 202 210 214 215 214 211 202 190 180 176 174 169 158 146 139 140 143 143 141 141 147 161 178 191 200 208 219 237
13510 237 257 272 276 270 262 260 267 277 281 279 280 291 306 311 296 268 240 223 216 214 210 201 192 186 180 167 145 122 114 123 140 152 157 158 159 162 169 179 189 188 172 143 110 83 64 52
13492 52 45 41 41 46 52 59 67 79 99 128 157 173 169 151 132 117 104 93 89 94 98 90 67 39 21 17 29 51 78 98 107 105 93 72 46 25 16 21 37 59 77 87 87 88
13474 88 102 132 170 204 229 244 254 265 279 298 314 326 331 330 322 309 291 272 257 253 259 271 277 271 254 227 196 172 166 183 217 252 281 299 304 294 268 233 198
13459 198 172 152 132 107 80 60 51 51 57 71 93 117 132 133 125 121 129 147 164 171 173 178 190 209 230 252 276 299 318 326 318 296 270 245 217 180 139 109 104 124 158
13442 158 195 226 245 251 247 234 211 188 176 180 186 179 158 130 106 95 102 124 147 157 154 140 120 98 81 81 92 99 93 81 74 70 65 62 67 81 99 117 133 145 152 159 171
13425 171 188 203 213 219 224 233 246 259 259 243 220 203 193 183 169 157 157 169 184 188 181 173 173 183 193 195 190 188 189 191 190 186 179 172 172 183 201 218 230 237 242 243 239 233 230 234 242 249
13406 249 247 233 214 194 174 156 145 144 148 148 139 131 129 134 140 142 140 134 126 119 114 112 109 112 126 149 177 204 227 243 247 239 221 198 179 167 162 157 141 111 71 36 17 18 28 37
13387 37 45 53 61 64 64 69 85 102 109 107 105 114 135 167 206 244 269 273 262 246 228 207 181 156 142 145 164 186 197 191 175 156 133 107 85 76 81 90 97 100 106 119 139 160
13370 160 179 189 190 181 163 143 128 125 133 148 164 175 185 196 210 226 240 243 228 198 165 138 120 109 110 129 167 211 249 275 290 297 297 289 277 267 264 274 296
13354 296 323 343 353 353 348 337 320 301 278 249 216 183 157 141 139 153 179 208 231 247 260 271 281 292 303 307 294 262 222 192 179 179 182 176 163 154 157 168 178
13338 178 178 169 152 132 114 102 100 109 126 148 171 186 186 172 157 151 157 163 159 146 131 125 131 146 160 166 162 159 164 177 190 201 215 236 264 292 313 322 320 314 307 300 287 271
13321 271 256 249 249 256 266 280 290 294 288 274 253 231 213 199 187 181 183 189 187 170 144 119 99 87 86 95 111 126 134 140 148 155 163 172 182 187 180 160 133 109 97 99 112 127
13303 127 139 143 139 132 130 137 149 159 163 164 164 160 151 137 129 131 145 164 184 200 209 210 202 189 176 167 164 160 150 138 133 137 147 154 151 137 118 109 119 148 183 209 214 202 180 158
13284 158 143 138 140 145 149 148 144 139 135 135 140 153 175 204 233 255 265 270 275 279 274 255 230 212 204 202 201 202 209 218 224 225 216 198 175 156 142 133 130 136 146 156 164 175 191 209 220 218
13265 218 207 195 185 182 181 179 172 168 175 197 227 253 264 255 232 206 179 148 107 68 48 56 78 92 87 69 50 44 52 64 72 75 77 85 102 128 157 181 189 185 177 172 169 162 150
13247 150 135 116 97 81 74 79 96 123 155 181 193 193 190 189 188 186 180 172 163 148 123 90 55 28 13 9 12 17 20 19 21 35 62 93 115 121 111 91 66 44 35 44 67 97
13229 97 124 143 158 179 215 264 310 338 340 319 278 228 180 144 122 113 113 121 139 162 184 201 211 213 202 181 159 146 150 166 180 180 163 139 124 127 141 159 175
13214 175 187 194 195 194 195 198 196 185 167 145 117 82 47 25 23 33 49 66 85 109 141 182 229 269 288 279 248 212 185 172 166 154 130 101 78 67 66 69 71 67 56
13197 56 42 36 46 72 104 129 142 144 139 131 128 135 147 155 152 145 144 156 180 211 238 247 235 212 194 186 185 187 198 220 243 251 239 215 191 177 175 176 173 163 151 144 139 132 122
13179 122 110 100 96 100 115 135 154 167 172 165 148 124 104 94 99 116 139 164 185 201 214 223 225 220 210 198 188 178 162 143 129 128 141 158 169 171 170 170 169 165 158 146
13162 146 131 118 110 109 111 113 113 112 107 98 86 75 66 61 63 71 84 100 119 143 170 194 206 204 190 173 158 146 139 135 136 141 149 158 171 190 210 223 225 216 203 192 184 179 169 149
13144 149 125 106 103 117 139 162 186 210 232 250 262 268 266 255 240 229 220 207 184 154 124 99 81 70 74 91 116 140 162 186 207 220 220 211 199 185 170 155
13129 155 141 125 105 83 61 42 27 22 29 44 60 78 102 132 163 186 200 206 206 201 195 195 202 209 199 170 133 108 100 102 100 93 86 84 89 98 111 125 132 128 118 108 100 90
13111 90 79 71 68 69 71 81 103 134 160 176 181 182 177 155 120 86 69 74 90 110 132 155 176 186 187 186 189 199 215 231 242 245 244 243 242 236 232 235 240 231 207 181 171 178 189
13093 189 193 190 186 179 166 148 135 132 138 149 166 190 221 252 273 281 280 275 265 245 221 206 209 222 230 228 219 207 188 157 121 92 74 63 53 46 45 52 62 73 87 109
13076 109 134 154 162 162 167 179 193 201 201 199 197 194 189 187 189 192 189 179 169 164 164 167 171 175 182 193 208 228 244 251 250 246 248 256 264 266 260 247 234 228 230 238 250 263 273 276 275 271 265 254 240
13056 240 230 227 220 201 173 150 140 141 148 166 193 220 237 241 236 229 224 227 241 258 265 257 240 222 207 192 181 174 170 161 143 121 103 98 110 133 155 165 163 157 154 152 151 155 170
13037 170 190 204 204 193 182 177 180 190 204 219 229 235 238 239 240 243 250 257 254 237 208 180 163 157 156 152 144 137 135 133 131 134 146 164 179 185 187 188 187 176 154 132 123 126 130 123 109 97
13018 97 91 93 101 116 132 137 125 101 76 54 36 21 12 8 7 9 13 19 30 48 71 95 113 128 142 156 165 165 155 138 114 93 82 83 92 105 124 148 169 179 179 174 165
13001 165 151 135 119 105 90 79 75 77 82 90 99 108 115 123 135 151 163 166 163 158 155 159 169 182 192 200 211 221 223 212 196 185 181 184 192 202 205 197 179 160 143 128 112 94
12983 94 74 56 51 58 64 52 20 -13 -36 -46 -45 -31 -5 30 68 97 110 101 74 43 20 9 10 26 59 102 145 175 184 169 138 109 102 125 164 199 219 225 226 227
12967 227 225 218 208 200 195 191 186 179 175 185 211 244 270 282 281 271 252 226 195 167 146 130 120 120 131 150 170 183 189 192 198 209 219 222 210 184 153 133 139 168 204 230
12950 230 242 248 252 254 250 245 239 235 230 226 220 208 188 167 156 156 161 167 172 174 172 173 178 186 189 178 157 133 115 108 111 119 125 127 127 128 135 146 157 160 155 154 164 183 198 199 191 179 165 149 131
12930 131 119 116 124 141 163 178 179 163 143 131 133 144 162 189 223 256 280 288 283 266 240 209 184 173 175 182 185 184 181 176 170 164 167 181 202 212 205 185 167 158 153 150 155 171
12912 171 190 205 213 220 224 223 217 207 195 180 171 176 196 223 248 265 270 260 242 225 215 209 206 209 216 217 207 191 178 168 158 147 137 127 117 114 124 147 171 188 195 190
12895 190 177 169 176 195 212 212 198 185 185 199 214 219 206 180 149 124 109 107 118 141 163 175 177 173 169 165 162 162 168 178 186 184 170 142 105 69 49 51 67 87 105 122
12878 122 134 140 139 139 143 151 160 165 163 157 151 148 145 138 125 115 115 120 124 123 125 142 175 221 270 310 334 338 327 312 302 297 293 281 260 234 207 183 166 157 155 156 159 162 167 170 170 169 170 171
12858 171 167 159 149 140 130 116 99 79 58 39 27 27 34 48 65 83 95 100 102 105 109 118 135 165 201 230 244 243 236 229 222 211 197 181 167 154 141 125 103 85 80 98
12841 98 135 176 205 217 216 210 204 190 161 121 84 64 61 61 50 30 15 16 32 54 76 97 116 133 141 141 133 116 90 62 43 42 55 69 73 72 73 79 91 110 133 155
12825 155 167 168 165 163 161 158 156 159 169 184 199 207 210 210 213 220 228 231 228 217 200 182 166 151 133 116 102 86 64 39 25 28 43 60 81 109 138 152 148 135 126 125 129 139
12807 139 153 163 162 147 132 128 139 154 165 173 185 202 220 230 231 226 218 210 206 203 197 180 160 152 162 181 195 199 195 191 190 196 217 255 298 328 334 322 305 293 286 281 279 279 278
12789 278 274 267 254 229 195 165 146 130 106 74 48 36 37 48 69 94 110 110 100 84 64 39 17 7 8 14 21 28 33 33 29 28 35 51 75 106 140 165 175 177 176 175
12772 175 172 167 163 160 157 156 155 155 151 147 154 176 206 229 232 215 189 162 146 144 152 161 167 173 180 186 185 176 161 147 137 137 150 171 189 192 182 165 150 145 151 166 177 178 172 167 168 179 197
12752 197 221 241 253 257 258 262 271 283 294 298 292 280 266 251 230 200 165 139 127 126 127 127 124 123 127 140 159 171 164 138 108 92 99 120 145 165 175 173 164 155 150 149 156 175
12735 175 205 234 249 254 257 256 244 224 210 212 224 233 233 226 211 188 158 131 118 120 128 130 123 116 118 130 140 140 128 110 93 79 72 73 79 87 98 114 133 149 156 155 150 145 142 140
12716 140 136 133 135 146 159 162 150 125 99 79 65 52 42 38 45 60 78 95 112 129 147 164 176 182 181 176 172 174 181 190 199 208 214 215 207 198 193 192 189 180 169 162 160 160 160 156 149 145 150 166
12696 166 186 204 216 227 235 232 214 190 174 171 171 165 154 140 129 121 117 119 127 139 153 164 165 151 126 98 74 53 36 29 30 37 46 58 70 82 92 104 121 137 142 133
12679 133 113 92 75 64 57 55 57 69 95 131 167 196 219 237 248 245 229 207 189 184 192 210 226 234 237 244 262 289 313 324 316 290 254 221 197 183 174 169 171 183 201
12663 201 217 224 219 205 191 183 182 186 190 195 201 209 218 225 224 212 192 171 161 165 177 186 184 172 155 139 122 108 101 103 114 130 148 167 181 187 182 171 156 141 130 125 129 140 153
12645 153 161 156 139 117 99 90 90 92 95 99 108 124 146 169 186 195 199 205 214 218 210 191 172 163 167 178 190 201 212 221 230 237 243 252 268 289 304 306 304 312 331 347 343 321 292 264 240
12626 240 221 210 207 209 210 211 213 212 206 193 174 147 115 85 61 41 27 20 20 26 31 36 39 39 33 22 14 11 16 26 38 46 51 59 77 104 132 156 177 193 198 192 183 182 190 203 213
12607 213 214 201 170 129 95 81 88 105 116 112 96 78 71 80 101 122 135 143 153 165 171 163 142 115 91 75 70 77 91 107 122 133 137 128 109 89 78 76 75 73 78 91
12590 91 106 113 110 103 96 92 92 99 114 132 149 163 177 193 206 212 207 193 171 148 134 133 145 168 197 226 245 249 243 235 227 215 199 184 178 183 198 214 223 221 210 199 196 200 201
12572 201 191 172 154 144 144 147 151 155 157 152 135 111 89 79 87 114 155 196 229 249 263 270 264 246 223 210 209 220 233 242 240 226 203 179 156 139 135 151 182 216 241
12556 241 253 256 255 252 241 217 185 154 133 123 123 137 163 195 220 232 238 239 232 213 186 162 150 146 144 139 137 141 153 168 181 192 201 208 213 220 228 237 241 236 216 184 148 118
12538 118 98 86 79 80 94 119 148 172 189 198 203 206 202 188 166 143 121 97 69 41 23 18 22 30 39 46 52 59 72 84 91 92 96 102 105 100 91 84 87 107 141 183 220 246 260
12520 260 258 235 194 152 128 126 140 162 187 208 222 226 225 218 204 187 176 173 169 153 128 107 104 117 138 159 174 183 185 185 185 189 191 188 183 182 188 194 193 183 169 156 151 159 180
12502 180 209 234 247 246 234 217 202 188 171 150 134 133 148 168 183 187 177 158 140 133 136 136 124 105 94 96 105 111 108 98 86 81 86 102 122 139 150 156 156 156 160 168 176
12485 176 175 165 154 147 150 161 179 200 219 234 242 242 237 227 216 203 188 174 166 157 141 117 94 83 80 79 76 77 81 87 95 110 126 134 134 140 160 188 207 211 205 196 190 187 182 165
12466 165 138 114 111 130 155 171 175 174 171 168 161 145 114 78 53 51 71 100 128 147 158 165 172 176 172 157 136 119 110 113 123 136 150 169 196 227 253 266 268 263 248 228
12449 228 208 194 187 185 190 200 206 201 190 179 170 157 137 114 93 81 80 90 104 116 126 138 153 168 182 191 197 202 211 230 254 272 275 259 232 203 179 167 163 164 171 183
12432 183 195 198 188 172 154 131 101 68 46 42 58 89 126 160 183 195 198 196 192 188 191 205 228 252 271 284 291 290 278 257 237 224 216 207 191 175 166 168 183 207 235
12416 235 259 273 280 285 290 292 288 280 273 268 268 270 271 267 253 226 186 146 117 106 111 122 139 163 195 231 262 281 287 282 274 265 258 256 264 282 303 313 305 284 261 238 213 186 158
12398 158 134 118 113 121 135 147 152 155 157 155 142 122 104 95 93 95 103 119 136 146 149 151 152 147 133 116 105 102 101 97 94 96 103 112 123 136 148 157 165 175 188 196 194 182 167 156 144
12379 144 129 113 110 129 163 197 216 222 222 225 229 231 230 233 242 256 265 261 241 210 174 138 107 86 78 86 109 139 167 187 197 196 185 169 155 153 165 183 196 194 181 171
12362 171 176 193 206 202 185 170 172 191 214 229 233 230 225 222 217 205 184 153 115 80 59 59 76 95 105 104 99 98 108 129 155 179 193 194 182 163 143 129 129 142 158
12346 158 169 169 164 161 158 149 136 127 131 151 183 221 261 297 325 339 336 319 297 276 259 241 223 208 201 201 201 192 172 146 124 114 119 135 149 154 152 150 157 179 214 250 271
12328 271 269 249 222 196 173 155 145 145 155 169 183 191 190 186 182 182 179 168 150 131 118 115 121 136 160 190 219 240 252 257 261 263 257 240 217 201 199 212 231 244 242 226
12311 226 204 186 174 165 159 157 165 179 191 192 188 186 191 198 198 184 156 120 88 74 79 89 93 96 110 140 171 189 190 182 171 158 145 137 142 157 171 177 173 166 163 167 180 199 215
12293 215 217 205 191 188 197 205 199 183 169 162 164 172 184 196 203 206 211 220 229 231 222 200 172 147 137 140 148 155 166 181 195 204 212 223 240 261 283 304 316 312 297 281 268 254 241
12275 241 237 238 232 209 177 152 145 155 175 199 222 240 254 259 255 239 218 196 180 172 175 188 201 205 196 177 154 133 124 131 147 165 182 201 225 250 270 279 276 264 245
12259 245 221 193 161 132 116 117 128 137 132 115 97 94 108 132 153 166 168 155 130 105 100 119 147 160 146 115 84 65 60 67 83 104 129 155 179 199 211 210 193
12243 193 163 133 112 104 105 112 118 121 125 133 148 161 165 158 145 132 121 112 109 110 111 109 104 94 78 60 48 47 50 48 37 27 29 48 77 111 143 166 173 161 135 110 99 104 117
12225 117 133 153 179 209 235 243 228 196 159 134 124 122 118 111 109 120 145 181 224 265 296 316 325 326 317 299 276 253 230 208 188 177 176 183 192 199 203 200 190 174 154
12209 154 134 120 113 111 112 115 122 130 137 143 150 157 159 159 165 180 198 210 215 216 212 202 191 182 172 154 127 99 78 65 52 40 36 46 66 83 82 60 26 -5 -22 -13 25 86
12191 86 146 188 211 227 241 246 236 218 208 210 222 237 244 242 234 228 231 236 232 220 210 207 209 206 193 171 144 118 96 86 92 114 150 191 232 266 290 304 313 317 312 296 274
12174 274 256 243 226 202 176 159 152 153 159 171 181 180 166 146 124 96 64 34 17 16 29 48 69 82 81 64 43 33 43 69 98 119 129 135 140 141 141 146 159 177
12158 177 195 204 204 200 199 202 205 203 201 201 205 203 192 173 146 118 102 111 140 171 187 193 202 212 214 206 193 177 155 132 114 106 102 100 109 134 165 188 193 185 169 152 141 139 145 150 147
12139 147 136 123 115 115 120 125 126 125 121 115 110 110 113 112 96 69 48 49 65 81 83 77 79 96 125 159 188 201 198 189 188 200 216 230 240 244 236 218 201 193 192 189 185 185 191 196 194 189 183 176
12119 176 169 172 187 205 214 204 180 150 124 108 104 106 110 116 128 142 153 160 167 178 188 192 188 179 166 147 124 106 101 111 135 170 212 250 274 280 273 257 234 206 179 160
12102 160 148 142 142 149 160 171 181 189 187 170 141 114 100 100 101 98 94 96 103 106 93 67 40 23 19 23 33 44 55 63 71 85 107 131 154 180 209 240 269 290 301 299 289
12085 289 283 289 301 311 316 320 326 329 327 318 306 293 283 274 264 249 232 220 215 218 222 219 205 187 174 168 161 147 124 97 67 33 5 0 23 61 97 123 138 141 131 115 105
12067 105 107 117 128 142 161 183 203 214 217 218 224 241 265 289 302 297 277 249 221 194 169 151 143 142 145 146 142 131 115 100 95 101 113 127 141 156 172 189 207 220
12051 220 219 203 186 176 176 181 189 201 212 213 201 179 158 146 148 162 178 187 187 181 172 160 152 154 164 169 162 147 132 124 125 137 156 171 171 162 152 148 146 149 161 184 207 215 205
12033 205 185 165 153 147 143 139 137 140 151 166 179 186 186 181 168 149 129 118 121 137 155 170 180 187 191 194 203 223 250 273 287 289 284 269 247 227 219 219 220 218 218 224 229 224 208 185
12015 185 160 132 105 83 71 66 64 62 65 76 96 119 143 170 205 244 275 290 287 279 275 278 285 290 287 273 247 212 178 155 145 140 129 112 99 98 104 107 102 95 92 90 85 81 82
11997 82 87 89 88 86 86 86 89 103 130 166 204 242 278 306 316 311 298 287 277 263 243 219 192 162 138 125 124 129 133 135 138 142 146 145 135 113 83 57 44 47 53 55 53 52 57 70
11978 70 95 127 152 156 137 111 99 106 127 150 175 201 223 234 232 222 214 214 219 217 204 187 179 178 175 163 146 136 139 150 165 185 205 217 216 213 218 235 254 270 282 293
11961 293 299 294 278 255 231 209 192 178 167 156 150 150 157 167 179 190 195 190 178 162 147 128 102 68 36 12 2 6 22 51 89 130 163 180 182 180 181 186 194 201 207 213
11944 213 220 231 249 274 302 324 333 328 319 312 304 287 261 234 212 195 178 162 150 145 149 159 167 159 136 114 107 111 111 98 80 66 55 47 43 47 55 65 78 97 121 143 163
11927 163 181 194 201 202 198 189 173 151 131 122 127 143 161 177 191 203 213 219 220 216 211 206 204 204 198 180 156 140 142 150 147 129 111 112 129 145 148 142 135 135 137 134 124 112 104 102 102 105
11908 105 112 118 116 105 89 76 66 52 35 21 20 28 43 62 88 121 156 186 203 204 193 179 173 176 188 206 228 249 262 272 281 290 293 288 284 287 293 293 282 266 249 230
11891 230 206 184 171 164 152 127 95 70 65 81 108 135 156 169 176 178 174 163 151 145 147 147 136 115 96 83 73 62 52 45 44 45 50 58 67 74 83 94 108 121 132 142
11874 142 148 146 139 132 125 115 100 88 83 77 65 55 59 76 94 105 108 106 102 101 112 137 168 190 195 185 166 147 137 139 148 155 152 142 127 111 103 110 135 166 188 193 186 174 163
11856 163 156 154 158 167 180 193 200 191 166 131 102 88 87 95 109 131 159 189 212 223 220 207 194 194 209 230 248 256 254 245 234 225 222 218 205 182 156 137 128 126 127 128 121 109 100
11838 100 106 127 152 170 178 189 211 238 257 259 250 239 235 239 248 257 263 262 257 252 244 228 200 166 136 112 90 75 77 95 117 130 133 136 142 151 158 166 174 181 185 186 183 179 181 194 215 230
11819 230 231 223 215 214 216 220 223 225 226 227 228 227 224 220 216 210 200 188 182 187 205 231 260 280 282 263 235 215 210 213 214 210 207 208 214 222 229 237 246 256 266 275 281 278 259 224 184 153 137 136 146
11798 146 163 181 196 206 213 220 226 223 210 195 190 202 224 241 248 249 250 253 250 239 222 206 196 189 185 183 184 189 195 199 199 193 187 184 186 193 203 216 226 227 214 191 166 146 132 124 122
11779 122 125 124 113 95 75 58 48 48 62 89 124 155 170 165 149 139 146 167 192 220 253 285 305 308 300 291 283 272 253 226 195 169 156 159 175 201 235 275 310
11764 310 329 333 325 308 281 246 215 197 190 184 174 163 161 172 188 199 195 175 143 110 89 91 114 139 152 152 147 145 147 151 154 155 154 152 150 144 135 131 137 147 146 131 107 86 76
11746 76 78 89 105 120 131 144 162 184 204 212 206 190 176 176 188 201 203 191 171 153 146 150 156 152 137 120 112 111 114 120 135 160 189 211 222 224 222 221 222 218 203 182 164 155
11728 155 148 142 139 144 152 159 165 175 187 188 176 160 161 182 213 239 255 264 265 259 247 228 205 185 181 200 234 263 279 284 288 289 282 266 242 213 188 176 179 186 180 163 145 133
11710 133 122 110 101 97 98 102 110 124 140 150 154 151 141 125 112 112 121 132 143 156 173 186 185 172 158 147 139 131 130 143 166 183 183 167 145 129 122 121 120 115 111 115 128 139
11693 139 134 114 94 89 100 119 138 153 168 188 217 246 268 280 287 295 305 316 325 328 323 306 280 243 200 157 125 101 80 65 71 99 129 140 130 114 111 128 162
11677 162 200 227 237 237 239 242 242 237 232 231 233 235 239 241 238 229 218 210 204 203 207 217 230 241 254 267 274 266 245 216 188 165 152 153 170 193 209 211 201 189 185 189 201 219 236 248
11659 248 249 244 238 230 221 217 224 242 256 257 248 242 241 241 233 213 181 144 110 87 75 72 74 80 91 110 139 169 189 191 171 134 90 55 41 47 60 68 67 55 36 20 20 40 74
11640 74 106 128 134 122 100 80 74 84 100 111 114 112 111 110 107 99 86 77 79 97 127 164 200 225 232 222 204 188 185 202 233 261 270 256 229 201 182 177 183 189 183 165 144
11623 144 126 113 106 106 113 121 125 124 120 115 115 124 141 163 187 214 241 261 270 271 268 261 250 236 219 202 187 180 183 196 209 214 211 208 209 211 208 200 192 187 183 181 190 213 238 248 237 216
11604 216 198 187 181 176 174 172 169 163 151 133 116 112 127 151 175 189 190 177 156 142 149 171 189 190 172 146 127 125 141 167 194 218 235 244 245 246 253 265 274 278 282 287 292 295 296
11586 296 295 290 281 270 259 247 236 228 225 222 213 195 171 150 141 145 162 185 210 231 243 243 232 213 190 170 161 162 166 168 169 174 179 174 154 129 111 107 117 135 149 151 141 123
11568 123 99 70 45 38 53 81 106 121 124 115 94 68 50 49 62 82 108 140 178 213 237 248 251 249 237 211 177 148 128 114 103 103 119 143 158 158 145 123
11553 123 96 71 55 52 57 62 64 64 62 62 62 61 58 57 64 81 104 132 167 211 259 303 337 355 356 340 312 277 241 209 181 156 131 105 79 54 32 23 32 61 102 147
11536 147 192 229 250 252 245 239 238 231 211 184 165 163 175 190 198 195 180 159 141 133 135 141 143 140 133 124 117 116 120 120 114 114 133 169 208 237 254 262 264 265 270 276 271 253 226 198 171 140
11517 140 109 90 89 100 112 117 117 116 117 121 125 122 112 99 89 90 104 129 160 188 208 217 219 217 213 212 219 233 248 261 270 280 291 296 290 274 254 235 221 213 207 202 195 191 192 198 206
11498 206 216 226 230 222 199 173 162 166 177 183 182 183 188 193 193 187 176 157 127 95 76 76 90 106 120 132 139 137 128 121 122 126 124 113 102 100 108 122 136 147 157 164 171 181 197
11480 197 214 222 216 202 195 201 212 217 215 207 196 175 148 125 116 124 141 156 160 151 136 120 105 90 84 94 124 163 199 220 223 210 192 182 185 192 190 175 150 124 101 85
11463 85 73 60 46 36 39 53 66 73 75 81 92 106 117 125 132 144 166 193 216 229 233 229 218 203 187 175 159 129 85 38 6 -1 6 19 27 30 31 35 44 58 77 98
11446 98 113 120 122 128 144 167 189 201 200 189 176 165 154 139 122 109 104 103 107 116 129 141 148 150 152 157 164 173 176 169 154 137 126 125 131 138 139 129 111 95 88 88 90 93 101 114 128
11427 128 136 141 147 159 176 193 199 189 169 149 136 129 125 121 115 110 109 115 125 137 152 171 188 192 182 164 153 158 180 214 252 278 285 271 244 207 166 125 93 82 92
11411 92 115 136 151 166 188 212 229 235 236 237 238 239 248 269 298 322 332 323 301 275 257 252 255 252 238 219 205 199 199 201 204 213 225 235 238 236 235 237 244 252 262 271 274 273 270 267 263 257 246
11391 246 223 186 142 105 79 53 19 -13 -25 -10 19 48 70 85 99 116 137 153 160 158 161 174 193 203 194 172 153 146 149 154 159 165 173 176 167 156 153 163 182 198 205
11375 205 203 197 195 201 212 223 235 255 279 295 292 278 269 275 296 322 341 350 350 346 339 331 326 326 325 315 292 268 254 251 250 243 233 230 240 262 286 298 293 282 273 268 262 250 238 228
11356 228 225 229 235 236 230 223 221 227 238 253 267 274 270 258 247 236 218 191 161 137 126 127 134 141 145 149 158 177 198 214 219 217 215 218 227 236 240 235 220 197 174 158 157 172 195 215 224
11337 224 218 205 191 181 176 175 175 173 168 164 168 187 215 245 270 286 295 295 289 275 251 219 187 164 155 157 165 173 181 190 193 188 176 163 153 140 122 103 91 84 77 69 65 68 77 84 91 102
11318 102 115 126 131 132 135 142 154 166 175 184 197 218 240 256 262 258 246 230 217 209 205 203 206 217 234 248 254 250 239 226 214 206 200 197 195 193 183 164 142 131 134 144 151 148 139 130
11300 130 128 135 150 170 194 214 223 217 201 189 186 189 197 210 223 231 233 233 234 233 226 216 208 205 206 215 235 265 299 330 351 358 348 328 305 283 263 245 229 210 186 165 154
11282 154 157 164 166 163 167 185 213 236 248 254 262 271 271 260 246 239 239 240 243 253 269 282 283 276 273 283 303 319 316 297 274 256 244 236 235 242 252 258 258 259 263 263 258 248 234 212 188
11263 188 172 168 169 169 170 176 186 193 190 169 132 96 83 99 129 154 173 195 225 248 250 231 203 178 164 165 180 203 223 227 211 181 148 118 92 72 58 48 38
11248 38 24 11 5 10 27 53 81 108 129 143 147 138 124 114 115 128 149 176 201 217 219 210 201 197 200 208 211 207 197 192 195 199 197 192 188 183 170 150 128 112 105 109 120 131 139 151
11229 151 173 200 218 222 218 212 201 185 167 150 128 98 71 58 65 87 117 147 172 187 193 193 191 191 196 208 222 235 245 256 262 260 248 234 227 225 223 218 211 206 200 190 179
11212 179 178 190 210 229 243 256 271 285 293 295 294 288 271 238 201 176 174 191 212 224 223 212 200 191 184 177 169 164 166 169 169 165 165 170 172 164 151 144 146 149 149 150 154 160 162 163 163 157 146 138
11192 138 143 158 167 163 149 133 123 119 121 131 147 165 178 176 160 137 123 123 135 154 173 184 178 164 159 175 208 247 281 302 305 288 261 240 227 217 206 194 181
11176 181 165 144 120 99 80 60 35 10 -4 -3 13 38 63 84 102 117 128 136 143 145 142 138 140 145 147 147 154 167 173 163 143 128 129 140 159 185 212 232 240 242 238 224
11159 224 197 166 143 133 135 142 144 135 114 92 81 83 88 85 78 71 67 63 58 58 66 78 88 89 83 77 74 69 55 32 10 -1 0 4 7 9 20 44 79 114 134 142 147 160 176 185 183 174
11140 174 159 140 124 119 126 137 144 149 155 157 148 130 115 115 131 156 185 209 223 226 221 213 207 205 201 192 180 174 179 189 192 186 176 171 174 181 187 189 184 175 170 169 171 174 174 171 168 169 177 188 190 177
11119 177 149 114 80 52 30 14 5 8 27 55 81 101 117 129 133 123 107 94 88 86 87 91 95 93 87 87 103 131 159 175 175 163 148 139 138 142 149 160 180 207 234 253
11102 253 259 251 237 218 193 160 122 94 88 102 127 146 152 145 132 119 111 107 111 118 120 108 87 73 75 89 100 100 97 103 126 162 199 223 233 234 228 211 186 166 159 164 168 165
11085 165 156 148 142 142 147 154 158 159 161 169 182 197 207 211 209 206 209 215 218 213 204 199 206 227 259 292 314 319 312 301 292 288 289 292 293 294 293 291 282 268 254 249 251 256 262 265 264 258 249 236 216 187 161 148
11063 148 147 145 140 134 135 139 139 132 119 107 102 108 122 135 142 143 142 143 145 146 149 158 181 224 284 346 394 424 438 441 437 429 412 378 325 260 199 154 128 117 113 109 99 90 87 95 104 106
11044 106 100 90 82 79 86 104 128 151 166 175 181 180 170 156 146 147 159 173 184 186 177 161 150 153 170 186 187 173 149 125 111 111 124 145 168 187 201 210 216 220 227 237 248
11026 248 257 260 251 229 195 156 123 103 94 85 73 70 85 113 137 144 140 140 148 158 167 176 183 184 177 167 158 150 145 147 156 166 171 173 177 179 174 161 145 130 115 104 104 122 151 179 197
11008 197 199 192 187 188 193 191 179 163 153 158 176 199 218 226 224 217 209 198 184 173 175 189 209 227 241 255 269 282 294 308 321 325 311 280 240 198 156 122 100 89 83
10991 83 75 63 56 61 80 110 141 163 170 166 153 140 132 134 139 140 135 132 137 144 145 139 135 141 157 175 191 204 208 198 176 145 109 76 53 51 71 103 134 154 163 161 152 144 145 154 169
10972 169 183 197 209 213 202 177 148 130 134 161 200 240 270 286 287 271 241 205 174 152 133 113 95 88 100 128 162 195 227 258 288 314 338 359 369 360 333
10957 333 302 279 264 250 232 212 193 175 159 148 145 147 150 155 161 162 149 125 102 90 87 81 71 63 71 96 131 159 174 179 181 189 198 205 205 196 176 148 114 77 41 13 -2
10940 -2 -8 -13 -20 -26 -25 -15 2 24 48 69 84 91 93 95 95 95 97 103 112 123 136 154 178 203 222 233 237 239 241 241 235 221 201 181 166 164 169 173 169 155 132 101 66 34 12 8 22
10921 22 49 78 99 112 124 141 156 163 161 159 163 165 163 158 160 173 195 216 230 237 242 250 261 269 273 279 286 285 271 249 229 216 207 197 187 182 182 184 184 176 165 154 146 139 131 124 118 108
10902 108 95 86 92 111 131 151 176 207 236 249 241 217 184 149 119 100 92 91 94 99 104 106 104 102 107 126 156 185 196 189 178 174 182 198 217 234 242 238 226 214 197 168 130
10885 130 97 83 86 97 111 126 143 162 183 200 209 207 193 173 154 144 145 150 145 129 109 97 96 106 129 161 196 224 239 246 251 258 268 285 305 322 326 318 304 295 290
10868 290 282 264 234 202 174 159 154 157 169 192 223 256 285 310 334 359 377 382 375 368 365 362 350 326 293 259 232 215 205 193 174 149 128 115 111 114 118 120 116 111 116 128
10851 128 138 137 133 142 165 190 207 215 221 224 220 213 204 190 161 122 86 66 60 58 57 62 74 94 123 160 194 214 219 215 203 182 152 124 103 90 79 73 75 81 89 104 130 163
10834 163 191 207 217 223 223 216 206 198 189 173 149 123 106 104 109 108 96 78 63 53 41 30 25 27 33 37 47 66 90 110 127 143 155 158 153 144 133 119 104 92 88 85 79
10816 79 72 70 75 86 100 113 122 124 123 118 107 88 65 42 26 17 15 18 27 44 72 108 141 168 188 202 210 209 203 196 180 150 110 77 57 42 25 15 25 56 96 135
10800 135 169 193 205 207 211 224 238 240 227 206 190 183 187 198 209 208 196 182 175 174 171 165 156 149 146 146 148 151 150 143 136 135 147 167 190 208 221 227 226 216 202 190 186 189 193 196 202 214
10780 214 227 234 238 245 256 266 268 263 260 263 268 268 261 249 238 230 232 248 275 299 307 297 278 260 247 234 223 222 233 253 275 294 305 303 289 273 270 284 308 326 330 323 310
10763 310 296 284 272 260 248 234 215 190 166 152 148 148 144 135 129 132 142 157 170 176 176 169 154 133 112 101 104 116 125 127 128 136 148 160 166 165 162 165 180 197 203 192 172 151
10745 151 131 109 88 74 72 83 106 138 169 193 204 204 192 172 151 140 146 162 179 193 203 210 217 226 238 247 250 247 240 231 219 200 175 147 121 106 109 129 155 171
10729 171 166 141 107 77 61 66 87 112 126 126 121 124 134 145 149 144 136 133 144 169 195 208 201 181 155 130 104 83 70 65 62 55 50 57 77 98 109 111 113 118 126 132 138 146 158
10711 158 179 205 227 234 223 202 182 165 156 162 180 203 222 238 252 259 249 220 185 155 136 126 116 99 74 55 53 64 75 79 77 73 68 67 75 88 96 94 94 105 125
10695 125 143 157 167 171 166 158 156 167 192 223 252 271 277 274 266 253 237 228 232 245 257 263 265 263 253 233 212 193 175 159 148 145 146 151 162 177 189 194 197 203 205 199 191 191 199 211
10676 211 219 220 215 206 200 199 200 201 211 235 263 276 257 211 158 116 100 110 134 155 165 163 155 146 141 142 144 140 130 122 117 110 100 94 97 107 120 135 157 186 215 237 248 246 231
10658 231 213 203 199 190 170 147 130 123 122 127 138 154 171 185 195 191 170 139 116 105 93 71 46 33 41 67 105 149 188 213 224 229 232 233 228 223 223 228 233 234 230 217 198
10641 198 180 164 151 142 145 157 163 152 127 109 106 110 105 87 63 42 32 36 49 64 74 78 77 72 62 53 46 44 51 73 110 146 162 162 164 182 212 244 270 288 291 278 254
10624 254 224 194 169 155 158 174 192 206 217 224 220 201 170 135 109 95 92 90 85 75 62 49 36 27 25 33 49 66 75 71 60 56 69 92 116 139 167 199 224 234
10608 234 236 238 238 227 201 173 155 148 148 154 171 199 225 242 250 257 263 263 249 220 181 138 97 66 54 65 95 137 180 208 214 204 192 188 193 202 212 218 220 222 231 242 245 236
10590 236 227 228 239 246 244 233 218 200 182 172 176 188 199 200 190 174 161 157 157 154 149 144 140 133 120 108 100 99 98 95 88 77 64 58 65 84 108 133 157 177 195 211 222 225 219
10572 219 211 207 209 210 204 187 165 145 137 145 161 176 187 202 225 252 275 285 280 264 251 251 259 262 258 256 260 263 261 264 279 295 297 279 252 227 201 172 147 136 134 130 121 112 111 119
10553 119 133 149 164 177 186 190 190 182 162 136 119 120 135 152 163 170 171 164 154 152 167 194 225 254 279 297 303 298 291 293 302 308 300 277 245 213 185 162 148 144 150 159 166 172 181
10535 181 190 194 191 181 164 143 126 121 129 139 140 130 116 107 109 122 143 167 187 199 200 193 189 196 211 225 231 228 215 192 163 131 99 66 34 9 -5 -12 -11 1 24 53
10519 53 80 106 133 161 186 198 193 175 149 125 108 99 97 100 105 105 96 82 71 69 76 92 112 126 126 112 94 86 90 102 116 126 133 134 130 124 115 102 91 88 97 109 116 117 122 137
10500 137 150 149 137 125 122 129 137 146 151 150 141 127 117 115 120 131 148 170 191 207 216 214 203 184 170 166 167 157 131 99 74 63 64 75 94 117 133 139 142 148 155 156 149 140 138 142
10482 142 144 137 119 96 75 66 69 80 93 111 139 179 218 242 245 231 209 185 165 154 158 175 196 217 240 267 290 300 297 288 280 271 256 234 209 180 149 118 90
10466 90 66 47 33 23 16 12 15 28 47 66 80 88 92 95 99 103 105 105 107 111 111 104 97 96 106 120 133 144 152 156 157 155 150 144 141 142 143 138 128 117 110 108 111 121 132 137 132 125 127 140 163
10445 163 188 205 205 187 163 153 165 188 206 212 210 205 200 198 202 218 241 262 268 254 230 204 180 157 131 105 84 68 53 39 27 21 20 17 10 8 18 41 64 75 74
10429 74 66 57 49 41 35 28 21 15 14 21 33 45 54 58 58 63 76 95 109 111 105 99 101 111 119 116 103 89 83 86 97 114 137 155 159 152 145 147 155 164 173 185 194 195 194 193 190 176 152 132 126 132 147
10408 147 166 186 204 218 228 229 219 200 178 163 154 143 123 94 66 52 59 82 107 125 136 140 134 118 95 73 62 67 90 122 156 186 211 230 240 241 239 238 233
10392 233 221 200 174 150 132 118 109 105 108 113 116 115 117 123 129 127 120 115 117 119 117 116 122 133 145 158 167 164 147 128 128 148 171 182 179 172 168 166 167 170 171 166 158 150 141 128 112 99 91 87 84
10372 84 80 74 63 52 45 49 61 75 85 86 82 78 76 82 97 118 133 134 121 109 105 105 100 93 90 92 92 86 77 67 54 40 34 48 77 108 130 144 157 170 180 183 179 176 178 185 192 193
10352 193 188 177 165 156 156 162 172 184 199 218 236 252 267 283 293 289 274 257 240 217 188 159 136 118 102 86 73 62 53 56 79 121 170 207 227 234 238 242 246 242
10336 242 225 194 155 117 84 56 28 0 -27 -47 -50 -34 0 46 90 120 133 133 130 130 133 136 143 153 163 165 162 160 171 196 224 242 240 214 174 134 112 112 128 145
10320 145 155 155 144 126 107 93 85 80 78 80 84 86 89 96 109 123 132 137 138 135 132 130 133 134 131 127 130 142 152 151 143 134 131 134 143 154 166 178 190 203 217 229 236 238 236 232 222 204 183
10300 183 168 164 163 160 158 165 180 196 208 219 230 242 255 266 267 248 213 181 166 164 159 146 130 117 107 98 93 89 85 83 88 101 124 155 186 212 224 225 218 210 206 211 226 246
10283 246 258 260 256 251 249 245 235 215 185 150 118 92 65 34 6 -9 -9 4 32 69 106 131 141 143 149 165 191 220 242 249 243 231 222 221 228 236 239 231 216 202 192 179
10266 179 160 132 102 78 71 83 108 136 160 179 191 192 182 172 169 174 175 162 142 125 115 109 102 88 69 48 31 28 37 53 68 80 88 92 92 96 106 117 121 116 108 106 114
10249 114 130 149 163 169 171 176 187 191 180 156 132 113 91 64 42 36 46 59 66 68 75 91 112 127 135 142 150 156 158 161 173 192 208 214 213 213 218 227 234 241 253 271 289 298 298 293
10230 293 284 268 240 204 170 146 136 140 152 167 178 189 204 221 234 238 234 226 213 195 170 142 118 102 99 107 124 141 150 145 128 110 104 113 129 143 150 151 147 142 141 145 153
10213 153 159 157 145 128 114 113 124 141 149 144 131 127 140 164 184 188 179 173 174 176 172 164 156 145 129 113 107 116 139 169 199 221 235 248 267 288 298 286 259 228 206 200 207
10196 207 221 234 245 254 264 272 278 285 293 302 313 325 334 336 327 313 297 277 250 216 180 150 131 123 121 116 108 103 104 105 100 94 94 104 116 123 126 129 136 148 159 168 178 195 220 245
10177 245 261 267 269 272 270 262 250 235 218 198 179 165 155 139 120 106 103 108 109 98 75 47 21 6 4 11 15 12 6 6 20 49 90 136 177 209 229 238 238 232 221 207 194
10160 194 185 184 185 183 170 148 123 105 95 90 83 70 55 46 50 69 94 114 119 105 76 45 24 15 11 7 2 0 0 0 0 -2 -5 -10 -12 -4 11 25 30 29 34 54 85 121 154 179 192
10141 192 189 175 156 142 134 129 127 133 153 185 217 234 233 221 210 205 203 199 193 184 172 159 155 163 176 182 173 150 123 103 97 100 95 70 37 22 40 82 126 158 182 202 218
10124 218 220 204 175 141 111 91 77 71 73 84 101 117 129 140 151 160 166 171 175 182 191 204 219 229 229 222 214 212 211 208 201 196 194 193 189 184 182 183 186 193 206 222 233 239 245 252 255 250 237
10104 237 225 220 221 230 247 271 293 308 316 318 314 298 267 222 172 129 101 83 70 59 53 56 71 98 133 167 192 211 225 234 235 230 229 231 230 225 227 244 267 279 276 265 257
10087 257 252 244 229 212 197 187 181 180 184 191 201 206 204 197 189 183 177 168 157 145 138 141 159 187 214 237 258 281 304 320 322 306 276 235 190 147 114 96 89 83 77 73 73 74 71 64
10068 64 57 58 69 90 118 144 164 180 196 213 223 227 234 249 268 281 287 287 279 266 249 233 215 191 163 142 128 116 102 97 115 152 190 212 220 227 238 250 254 251 240
10052 240 223 202 191 194 200 191 166 139 124 113 97 83 86 111 144 169 178 176 165 151 140 137 142 148 149 141 130 129 144 167 184 185 176 165 153 140 130 132 153 188 229 266
10035 266 292 306 311 308 300 291 286 285 282 273 261 251 248 250 253 254 253 254 259 268 272 258 221 171 122 85 61 51 56 76 102 128 151 170 188 200 203 196 185 178 176 175 167 157 153 162 181
10016 181 201 217 228 231 227 215 201 187 179 178 189 209 229 244 254 260 260 248 222 188 153 125 110 110 118 121 115 112 121 142 162 171 170 168 169 173 173 166 156 148 142 135 128 127 136 154 173
9997 173 186 190 180 161 139 128 131 144 156 164 167 170 172 175 178 178 174 167 163 164 168 172 171 162 144 125 111 101 95 95 102 114 120 115 103 95 101 128 170 210 227 217 193 175 169 169 171 181
9978 181 201 219 224 218 210 208 212 221 230 233 224 212 204 203 197 181 160 140 118 89 59 41 36 41 50 65 84 101 107 106 108 119 130 134 131 124 113 100 88 84 90 104 125 153 183 205
9960 205 207 188 159 140 141 161 185 202 214 225 234 235 229 217 201 174 137 98 70 56 48 40 36 42 61 88 119 147 162 160 142 120 106 112 137 175 214 244 259 255 235
9943 235 205 171 136 103 72 45 22 2 -9 -11 0 18 37 55 72 87 97 101 107 123 147 168 174 165 149 133 118 107 98 91 85 86 96 111 124 130 130 127 119 106 91
9927 91 86 97 125 162 196 215 218 213 210 210 203 181 145 106 77 66 73 93 117 141 166 191 213 229 241 248 251 244 226 201 180 172 179 199 223 241 248 244 234 224 214 202
9910 202 189 176 162 147 126 104 82 64 48 35 30 38 59 90 120 148 170 187 196 198 197 200 208 218 223 223 218 208 189 164 145 143 163 197 228 242 238 229 229 241 255 259
9893 259 251 240 236 240 248 255 256 246 226 200 175 156 141 127 114 107 104 102 98 94 93 91 86 82 85 95 105 111 113 114 111 101 83 59 35 19 17 28 48 72 94 111 119 120 115 103 88
9874 88 76 75 84 94 98 100 105 108 100 84 76 87 111 133 144 147 147 146 145 143 141 142 147 156 168 187 215 248 273 279 265 240 212 190 177 173 176 185 197 203 199 187 174 160 144 125 112
9855 112 116 135 164 196 230 254 262 255 245 244 251 257 257 250 240 232 236 257 288 312 317 302 272 235 198 172 163 167 173 167 150 129 108 88 67 48 40 47 68 98 123 129 113 85
9838 85 64 60 67 79 97 123 152 174 184 183 173 152 125 97 75 65 70 91 121 147 162 167 165 162 159 157 158 157 153 149 150 159 175 190 196 191 177 164 159 162 169 174 172 161 138 109
9819 109 83 67 61 59 62 76 102 137 168 185 191 190 191 191 187 176 163 153 154 167 186 205 217 216 203 183 168 164 170 175 171 159 141 119 94 70 53 41 33 26 26 37 54
9802 54 70 80 83 83 85 95 115 138 157 164 160 151 141 131 121 109 101 103 118 137 154 172 194 214 225 222 211 198 188 186 193 200 198 186 174 169 172 181 197 222 248 266 268 256
9784 256 234 207 182 166 164 172 181 185 185 184 182 176 163 142 116 89 66 48 34 19 4 -5 -1 14 35 54 70 85 97 109 122 137 147 143 122 96 85 94 118 139 149
9768 149 150 153 159 165 172 182 195 206 210 200 176 141 110 97 106 125 137 138 134 132 131 128 123 116 112 112 115 115 110 101 93 94 108 136 163 172 155 129 111 109 114 119 124 128 126 120 118 126 138 153 171
9747 171 193 211 219 220 216 208 192 178 178 199 237 281 317 332 321 294 269 258 259 263 263 259 249 234 213 188 163 147 146 154 159 160 162 172 184 192 200 216 238 259 274 284 295
9730 295 306 315 320 324 327 326 318 304 284 262 242 233 240 258 273 269 253 243 253 281 317 355 389 410 405 378 345 319 299 279 262 257 264 276 282 284 284 278 256 223 195 192 214
9713 214 246 271 281 280 272 264 259 263 274 285 288 277 252 220 188 167 165 181 204 220 221 208 192 190 214 258 306 340 353 351 338 321 307 298 291 277 253 233 232 254 287
9696 287 312 319 305 276 240 208 185 170 159 148 137 123 112 110 122 144 166 176 172 161 152 147 143 138 135 137 141 143 140 133 127 124 123 122 121 120 119 118 119 119 115 108 98 87 78 76 88 118
9677 118 160 199 223 231 230 229 230 230 226 223 223 230 243 260 277 289 295 299 304 302 287 258 226 205 198 197 193 183 166 146 129 119 117 118 117 108 95 82 73 75 92 121 147 162 166 165 163
9658 163 159 155 159 177 198 214 220 226 235 245 250 248 240 231 227 234 250 267 277 277 269 250 221 189 170 169 178 182 175 167 163 166 172 182 191 193 185 175 170 172 175 177 174 164 148 129 115 107 106 110 119 126
9637 126 124 117 114 123 143 171 207 246 278 296 299 292 280 264 251 244 241 236 229 221 213 205 200 201 207 213 212 204 188 169 151 134 114 93 81 85 101 119 131 136 137 139 144 153 162 162 153 143 142
9617 142 150 167 190 211 218 208 188 173 165 161 159 160 162 154 134 111 101 107 122 139 151 156 152 143 137 141 154 174 195 217 237 250 257 267 284 307 323 323 304 272 238 207 178
9600 178 149 124 114 125 151 180 209 240 270 289 288 271 244 217 202 202 210 214 215 221 240 263 278 285 291 302 316 335 358 378 386 374 351 326 304 281 253 220 189
9585 189 170 167 174 183 188 191 196 207 225 243 258 268 280 297 313 321 320 315 304 284 252 220 201 200 217 245 274 296 306 303 285 257 227 208 206 212 212 206 198 194 192 192 194 199 206 213
9566 213 217 212 193 163 134 117 115 123 137 156 174 185 184 170 154 145 145 150 154 153 150 146 145 147 153 159 156 142 119 101 98 114 143 174 199 214 220 222 221 219 215 211 209 210 212 216 226 242 259
9546 259 272 278 283 288 292 289 274 251 225 201 180 158 133 112 107 122 148 174 191 193 180 161 148 148 155 162 162 160 158 158 162 168 170 160 142 130 130 135 130 110 85 66 56 47 37
9528 37 28 26 33 45 54 54 45 35 38 58 86 111 123 125 115 93 62 38 37 58 93 130 158 168 154 125 101 95 103 112 116 115 109 99 90 91 103 119 138 162 196 235 268 291
9511 291 302 306 303 291 269 239 204 171 146 135 135 141 147 153 168 198 234 263 276 275 267 258 251 248 241 223 190 153 128 127 141 153 149 134 122 123 133 140 139 136 136 139 141 142 146 160
9492 160 184 217 250 273 278 261 228 189 153 127 116 120 136 160 182 198 202 198 187 175 160 145 133 131 142 165 195 231 272 309 330 331 319 303 287 263 232 200
9477 200 175 156 137 116 96 81 72 69 70 72 76 80 84 86 83 75 63 48 37 33 36 44 57 80 117 158 187 200 197 183 165 149 145 149 152 148 143 146 153 155 148 140 136 132 128 126 123 113 90
9457 90 60 32 11 -3 -11 -8 8 37 75 117 156 184 199 205 205 201 193 188 187 186 183 180 181 187 193 195 194 192 190 190 196 211 239 275 311 335 340 327 306 285 269 254 230 190 144 111
9439 111 104 118 136 153 172 197 221 237 246 252 252 242 226 212 202 194 183 172 162 152 144 138 132 118 96 75 69 77 93 109 126 145 157 161 160 164 174 181 183 180 175 163 141
9422 141 117 102 98 99 100 104 113 119 114 95 69 42 18 3 1 10 25 35 39 35 25 13 4 4 13 26 40 50 51 44 31 22 20 28 47 77 118 164 200 215 211 194 175 155 136
9403 136 123 122 127 124 108 90 88 107 140 171 189 190 176 159 152 160 180 203 221 225 219 210 208 215 229 252 285 318 336 332 318 305 293 274 250 231 216 195 168 147 146 160
9387 160 171 169 158 151 153 160 170 183 200 218 224 214 192 172 164 167 178 194 207 207 191 169 148 128 107 89 77 73 74 79 92 113 131 137 135 138 150 169 189 206 218 224
9370 224 223 216 203 188 173 160 151 144 139 135 130 126 126 132 141 147 150 157 169 182 186 182 179 182 188 188 184 182 188 201 213 219 220 217 215 214 216 223 233 240 243 246 249 247 234 212 186 163 144 134 136 149 163
9348 163 170 169 164 154 142 131 124 116 102 85 76 80 91 104 120 141 165 187 201 203 194 176 156 137 121 110 105 109 121 141 166 191 209 220 226 227 224 219 216 217 218 216 212 208 205 204
9330 204 209 220 228 221 200 176 162 161 165 173 186 206 227 240 240 232 225 218 206 183 155 130 112 105 107 114 118 114 108 108 113 120 128 142 164 187 204 214 221 223 214 188 155 126 110 104 99
9311 99 92 83 77 77 87 106 133 162 186 202 207 201 189 181 188 208 228 240 245 246 241 225 203 186 180 185 195 207 216 222 225 227 225 213 188 158 137 128 129 132 136 142 145 139 128 120 124 135 145
9291 145 149 155 169 186 197 195 185 177 180 189 197 196 189 181 170 154 135 124 129 144 161 177 194 207 204 183 151 122 97 73 54 53 74 109 142 161 164 151 126 97 76 71
9275 71 79 92 105 118 132 143 148 142 122 91 60 42 46 71 106 138 155 154 141 127 120 119 124 137 156 170 173 170 170 175 180 186 194 199 192 175 163 163 165 158 143 131 123 111 94 82
9256 82 80 85 93 110 138 166 177 165 141 119 101 80 57 44 51 78 110 131 137 128 110 88 72 68 73 85 102 130 169 216 263 302 327 333 320 289 246 201 160 131
9240 131 114 107 102 99 100 109 124 139 151 167 191 221 243 253 252 248 242 235 234 244 258 267 267 263 257 246 229 215 207 203 192 173 149 124 98 79 75 87 100 99 83 59 39 30
9222 30 31 37 43 43 42 42 48 60 80 107 134 150 149 135 120 111 110 117 131 150 165 168 159 151 151 154 150 142 137 143 158 176 188 183 159 127 103 91 81 64 43 31 39 71 119 168
9204 168 203 220 223 223 227 233 241 245 236 211 179 156 151 159 168 166 154 142 139 144 150 151 150 151 152 150 148 150 158 166 173 181 190 195 190 180 174 173 173 168 161 154 153 157 163 164 160 155 157 168 186 206 225 239 247 241
9181 241 222 193 163 143 143 161 190 217 231 236 243 257 271 280 286 300 323 343 357 367 379 386 380 365 355 353 352 346 334 321 307 294 282 275 273 274 274 274 277 284 297 316 341
9164 341 363 374 367 349 333 325 319 303 277 246 221 205 203 216 238 259 270 272 266 252 233 215 206 203 197 185 169 153 137 123 116 121 144 186 240 288 317 324 318 314 315 319 327
9147 327 341 356 360 347 323 299 284 279 280 283 285 281 265 241 217 201 201 220 255 298 340 378 413 452 502 566 648 752 887 1056 1234 1372 1416 1344 1181
9133 1181 980 787 630 516 440 394 366 347 330 310 287 262 240 225 220 224 228 226 214 197 182 172 169 172 174 167 148 126 116 122 137 144 132 103 67 40 35 50
9118 50 73 93 104 105 97 85 79 91 122 159 181 179 160 140 126 116 104 96 99 110 124 138 159 185 206 207 191 168 152 143 139 139 142 151 164 185 206 221 225 222 220 219 214 205
9100 205 200 204 212 217 212 196 173 153 141 140 144 146 146 148 154 165 177 196 226 264 296 310 307 296 283 268 247 223 200 184 177 178 186 197 201 194 179 167 163 167 177 189 202 209 201
9082 201 181 159 146 147 160 184 214 247 273 290 297 296 289 282 275 267 251 225 196 177 177 195 218 237 246 245 234 211 175 133 97 75 66 65 73 94 123 151 170 180 188 195
9065 195 195 183 158 123 82 48 27 19 13 -3 -34 -69 -93 -92 -66 -20 31 77 109 128 137 143 146 141 124 100 79 64 56 54 60 74 91 103 112 120 128 135 141 141 130 108 85
9048 85 75 81 98 118 138 158 170 171 162 145 124 105 98 107 127 150 173 195 207 203 189 180 190 219 254 276 276 259 239 229 236 261 303 350 384 392 377 350 318 285
9032 285 259 244 239 239 239 238 234 223 207 197 203 223 251 278 297 303 297 284 265 239 208 181 162 153 148 141 129 112 93 84 91 113 144 175 202 222 234 238 237 228 211 189 167
9014 167 151 145 146 149 149 143 135 133 136 140 142 142 142 137 129 118 111 112 126 151 179 200 204 195 181 172 175 183 186 177 159 143 139 155 192 244 294 325 333 329 324 322 318 314 310 305 296 280 265 255 252 250
8993 250 245 238 229 222 221 232 249 258 248 226 207 201 205 210 213 214 214 216 224 241 259 266 259 247 245 249 246 226 194 169 163 175 191 201 200 193 185 182 188 199 210 215 212 208 207 210 211 202 184 162 147
8973 147 143 147 155 162 163 156 145 137 133 128 119 114 124 145 163 171 174 181 191 191 169 123 65 14 -15 -22 -17 -7 8 34 67 98 121 134 138 141 150 166 180 184 180 180 190 202 205 194 175
8954 175 154 139 133 139 154 177 204 232 256 274 281 278 267 250 231 215 203 193 182 171 164 159 152 142 133 139 166 210 257 293 309 303 279 245 215 194 187 191 199 205 207 202 188
8937 188 165 139 117 106 104 105 104 101 98 99 105 114 130 155 190 224 244 244 228 206 176 134 83 36 6 -5 0 19 46 78 112 149 188 223 245 249 235 208 177 148
8921 148 124 105 93 91 99 112 121 120 113 105 105 113 123 127 123 113 101 88 76 71 74 79 80 76 69 63 60 61 70 86 103 113 118 117 114 108 103 99 96 89 76 63 58 70 95 120 131 124 107 91
8901 91 85 85 90 97 112 137 167 189 192 172 143 120 110 108 112 125 155 199 244 275 291 303 317 322 303 258 205 165 147 144 151 166 189 210 219 214 203 192 183 176 168 157 146
8883 146 140 139 141 139 135 136 147 170 200 228 245 250 251 253 256 251 236 216 199 184 168 155 156 172 194 207 209 205 203 202 196 184 167 148 127 102 72 41 13 -8 -22 -28 -27 -21 -14
8865 -14 -4 12 35 54 61 61 63 70 78 84 99 125 156 178 186 185 181 176 171 163 150 133 117 111 113 110 98 81 72 70 67 63 64 73 85 90 86 78 77 93 123 156 176 181 174 165 159 158 163 174 189
8845 189 200 205 203 196 189 184 180 175 176 188 208 228 238 239 233 219 202 188 178 168 154 139 133 136 147 162 180 195 202 207 217 235 255 275 296 316 327 326 316 302 285 265
8828 265 244 227 212 198 184 167 151 141 144 158 178 199 221 241 254 256 250 239 225 212 206 211 224 238 251 261 268 271 278 291 310 326 333 331 318 299 276 254 233 218
8812 218 212 211 205 186 156 124 94 71 61 69 89 116 141 156 152 128 99 81 75 78 91 119 160 200 227 241 242 229 206 183 166 154 144 140 148 160 168 164 153 143 143
8795 143 153 161 154 129 101 83 73 63 51 43 46 60 87 124 160 184 197 203 200 184 160 143 145 164 190 216 234 239 227 204 180 161 147 136 127 117 109 104 101 95 83
8779 83 68 56 51 54 65 81 91 87 73 65 72 92 114 133 154 179 204 220 223 220 221 227 233 234 230 219 201 180 165 162 171 191 219 251 277 288 286 277 271 270 275 276 262 229 185
8761 185 147 127 127 151 194 249 298 328 340 339 329 307 274 238 204 171 140 119 116 133 162 194 225 248 263 270 269 265 259 252 251 256 259 254 237 215 193 174 156 144 143
8745 143 158 184 210 225 227 223 223 232 243 250 248 239 224 201 173 150 134 121 105 85 66 55 50 46 40 34 29 26 32 52 86 119 133 123 97 66 39 25 32 60 99 138
8728 138 171 196 207 201 184 169 162 161 159 156 154 151 142 123 99 82 82 95 104 100 89 87 99 121 144 160 167 160 144 123 105 88 77 79 101 139 177 199 200 178 138 86 37
8710 37 2 -13 -13 2 30 63 87 96 100 113 143 185 226 257 271 270 258 238 218 202 191 183 171 151 127 106 89 73 67 81 121 170 206 215 206 196 190 185 178 170 169 173
8694 173 177 172 162 151 148 150 152 152 147 134 115 97 93 107 129 149 162 169 172 173 178 190 205 211 204 192 182 178 177 178 179 177 169 156 142 136 137 141 143 141 132 119 108 102 107 120 135 146 149
8674 149 149 152 164 186 210 221 216 206 200 197 186 166 143 127 119 117 120 128 134 133 128 128 135 146 158 171 186 196 198 190 173 150 128 115 114 120 121 113 99 87 86 99 123 148 164
8656 164 171 177 180 176 160 139 125 127 144 168 191 209 221 226 218 195 158 116 83 66 66 72 76 75 75 76 77 76 78 87 101 112 117 118 118 111 95 76 65 61 56 41 23 10 4 0 -3 -7
8636 -7 -5 0 8 21 39 62 87 109 126 135 140 144 148 150 144 126 94 57 31 28 44 64 81 95 112 131 140 139 137 145 161 175 179 178 180 187 195 196 188 171 147 123 107 103 105 108 111 117 127
8617 127 134 134 132 138 149 156 146 123 100 90 97 113 128 138 144 149 155 161 166 171 179 187 193 192 185 172 158 145 132 113 85 54 36 47 80 118 150 178 205 228 241 249 261 279
8599 279 292 296 295 295 298 304 313 326 339 352 363 369 363 339 298 253 212 178 156 147 146 143 140 144 157 172 171 154 131 116 114 125 143 161 175 185 191 198 207 217 230 245 253 247 222
8581 222 189 158 139 129 123 123 133 149 162 162 147 127 114 109 106 96 78 61 54 58 64 67 67 69 70 69 65 64 68 75 80 76 63 45 27 10 -9 -31 -48 -51 -37 -11 21 52 75
8563 75 85 80 67 54 45 44 52 66 84 101 112 114 113 114 121 127 118 96 69 49 36 26 21 30 57 95 138 176 203 216 216 209 200 190 178 164 148 133 123 123 132 147 168 191
8545 191 211 223 228 230 229 218 190 157 137 138 151 159 155 144 132 118 103 90 85 94 111 126 140 159 188 220 250 273 291 303 303 291 277 272 279 292 300 297 286 271 258
8529 258 249 247 248 249 245 229 198 162 133 119 118 119 118 117 120 127 135 142 149 155 158 162 178 208 237 253 254 254 258 260 256 251 252 259 263 259 250 236 219 201 188 186 188 185 173 157 142 132 126 123 121 123
8508 123 134 151 170 182 187 190 193 192 189 190 199 215 229 232 224 210 191 165 132 100 79 71 71 71 67 61 60 69 91 119 144 158 159 150 139 128 115 96 76 60 53 56 72 100 134
8490 134 162 167 149 117 87 67 60 63 69 70 70 77 99 132 165 184 185 177 172 180 199 214 212 190 155 119 87 58 33 15 7 8 14 16 15 16 27 50 82 116 142 157 160 159 158
8472 158 160 170 189 215 237 246 236 210 175 139 109 91 86 86 86 82 73 61 47 36 34 43 59 76 92 109 128 151 176 205 235 258 268 269 266 260 244 211 170 131 98
8455 98 70 49 45 57 78 94 98 89 68 44 29 29 42 60 79 103 135 176 225 277 320 348 361 362 353 339 323 313 307 297 278 254 238 229 221 207 185 162 142 129
8439 129 122 120 122 130 140 147 149 146 145 147 147 140 125 104 78 50 27 14 13 19 26 30 39 56 79 100 114 123 131 134 129 115 100 90 90 100 111 119 124 131 147 175 211 247 274 290 296
8420 296 295 285 263 234 209 200 203 209 207 197 182 162 136 109 88 74 69 72 87 112 139 162 182 201 216 225 228 232 235 237 236 234 232 228 223 215 206 193 183 184 199 215 217 205 191
8402 191 184 185 189 192 196 202 202 189 160 127 106 109 136 171 200 220 236 255 281 305 317 310 286 255 231 223 226 233 236 235 232 229 224 209 186 161 139 123 110 107 116 134 153 170
8385 170 189 206 205 175 127 86 67 63 61 57 55 56 60 71 90 117 143 159 161 149 127 110 114 140 172 192 199 206 226 259 295 322 332 319 292 259 225 189 149 118
8369 118 108 119 138 150 150 144 137 134 134 135 138 141 141 136 130 129 134 139 142 149 164 179 180 163 139 119 109 109 119 136 152 163 166 168 171 176 182 186 185 179 170 158 141 119 103 95 92 83 67 51
8349 51 43 42 44 50 60 68 73 81 98 125 153 174 190 203 213 223 238 255 262 256 241 230 225 220 212 207 208 212 214 214 209 196 173 144 120 106 102 106 115 132 152 173 187 191 182 163 141
8330 141 120 102 83 65 48 37 33 41 59 88 124 157 178 181 169 151 130 104 71 35 4 -21 -46 -70 -88 -95 -88 -75 -62 -55 -54 -57 -62 -69 -78 -84 -79 -61 -36 -8 18
8313 18 45 73 100 124 143 158 168 172 166 150 131 116 111 110 108 103 94 83 69 52 34 18 8 14 38 73 106 128 135 132 120 106 91 76 54 30 12 8 15 22 27 33 48
8296 48 74 103 127 145 157 168 174 173 168 163 161 158 148 133 114 100 95 105 131 165 192 206 206 195 177 157 144 141 144 149 157 165 163 143 109 78 63 62 70 75 73 62 48 40 43
8278 43 53 63 69 73 75 72 63 53 43 37 32 30 31 37 50 68 91 114 136 155 166 163 146 123 102 90 87 88 91 96 105 117 128 142 159 179 193 193 177 153 134 130 142 164
8260 164 189 211 228 242 247 240 224 207 191 171 146 121 103 92 85 84 91 102 114 127 142 157 166 168 174 190 213 237 260 276 275 252 219 193 182 169 144 111 83
8245 83 68 64 64 69 74 78 81 88 100 117 138 157 170 168 155 144 146 160 173 176 169 156 144 132 120 106 93 85 85 94 108 123 135 145 154 160 159 148 133 124 131 152 180 206 232
8227 232 258 275 275 253 218 184 162 151 147 146 144 137 127 119 117 123 130 132 128 119 109 101 102 113 126 136 141 146 159 181 206 226 232 224 207 183 156 132 115 104 91 73 55 48
8209 48 60 88 121 147 153 134 101 69 44 27 20 29 56 95 139 186 230 260 267 258 246 239 235 232 230 228 223 217 215 221 232 240 241 233 218 198 178 165 164 170 178 180 176 167 156 146 140
8190 140 144 156 169 177 177 169 155 136 119 115 124 141 158 169 173 173 171 169 168 170 176 188 206 223 235 235 220 194 169 157 163 182 212 248 286 320 342 350 347 337 322 303 273
8173 273 229 179 144 136 150 175 201 224 232 218 187 159 151 163 183 200 205 199 184 166 142 112 78 53 47 61 86 115 143 166 177 176 167 157 151 146 139 127 106 81
8157 81 59 49 54 70 88 104 117 135 157 179 196 203 201 193 179 157 129 107 102 115 137 159 175 182 178 162 143 129 121 108 81 46 17 6 16 44 82 118 143
8141 143 153 152 147 144 147 156 166 167 159 150 148 157 174 197 220 235 232 216 199 191 193 198 203 209 214 215 209 197 179 157 138 128 130 144 167 193 210 211 201 193 197 207 217 221 221 218 215 216 220
8121 220 216 199 174 155 150 153 154 152 153 162 175 189 200 207 212 216 218 213 196 171 151 145 154 173 192 207 216 218 210 193 171 151 138 125 110 97 100 120 142 147 134 121 122 136 149
8103 149 156 159 162 161 153 136 112 87 66 55 52 50 46 44 48 57 68 80 90 96 94 86 81 85 96 109 122 133 138 135 128 126 134 150 170 191 215 242 266 283 291 291 284 270 251 231 212
8084 212 195 180 171 174 191 211 221 214 196 175 157 140 123 112 115 132 150 158 156 153 156 170 187 203 214 217 212 200 185 174 172 180 197 214 222 217 199 172 146 127 119 120 127
8067 127 132 135 135 130 120 105 93 90 92 86 69 50 43 49 63 78 87 87 76 62 54 56 66 79 91 93 82 64 58 75 107 139 163 181 198 217 235 250 256 249 234 216 197
8050 197 176 159 151 152 151 143 132 130 141 160 179 190 188 177 162 152 144 135 122 116 123 141 161 175 188 204 222 236 238 228 212 199 195 202 217 233 242 239 227 214 206 205 205 205
8032 205 210 225 246 261 262 253 239 221 194 162 134 117 109 102 90 74 58 48 49 62 80 96 101 91 73 58 57 65 75 88 107 125 131 120 106 102 113 129 142 144 129
8016 129 103 81 73 77 79 73 63 58 61 67 69 62 51 47 60 83 107 126 144 160 170 173 170 166 161 154 143 127 106 86 70 58 45 32 29 46 78 112 140 157 160 152 142 138
7998 138 137 131 116 96 80 70 64 61 64 75 87 97 104 113 131 154 173 185 193 200 203 197 185 179 186 198 205 197 174 139 98 65 51 60 83 114 150 186 208 209 193 168 138
7981 138 107 84 78 92 113 134 153 171 188 197 200 202 203 199 188 176 172 170 163 148 134 128 129 133 136 142 153 170 188 201 202 191 170 146 125 110 106 116 139 169 194 208 213
7963 213 210 200 183 158 133 119 121 131 136 123 99 82 85 105 126 138 144 151 160 171 182 192 200 208 217 226 234 240 244 247 244 227 196 159 129 109 98 85 68 49 40 45 63 86
7946 86 105 115 115 110 107 118 143 173 193 197 194 198 210 219 208 176 141 121 122 142 175 209 234 241 235 226 218 210 199 190 191 203 216 217 205 191 184 185 188 190 194 204 220 238 258 279
7927 279 298 307 303 286 257 217 178 154 152 166 182 195 205 210 208 199 185 175 172 177 184 187 188 192 202 217 230 239 248 262 278 294 309 317 316 306 295 294 301 305 300 290 284 281 268 239
7909 239 198 158 128 108 95 89 93 111 137 166 191 207 213 207 190 168 149 131 111 85 58 38 32 45 74 107 129 136 135 136 138 136 131 129 130 128 125 128 142 163 183 197 201
7892 201 198 190 181 174 165 154 142 126 99 60 24 8 16 43 80 121 162 196 215 221 221 223 227 232 237 245 254 254 236 204 172 152 145 140 130 115 98 83 70 64 68 81 96 98 79
7874 79 46 17 4 6 9 9 9 20 45 82 126 171 205 220 216 202 191 189 190 183 163 140 129 137 151 158 155 154 168 201 243 285 319 340 346 335 309 274 241 216 204 200
7857 200 200 202 208 221 238 253 257 248 234 224 222 223 223 223 226 229 221 195 153 109 73 53 48 51 58 67 78 91 104 114 118 115 105 90 77 72 77 85 91 97 104 116 135 158 173 169 144
7838 144 110 81 61 46 35 28 23 23 34 64 109 153 183 199 211 219 216 196 166 141 134 145 164 172 161 132 97 68 50 43 40 43 54 68 77 78 73 73 84 103 126 146
7821 146 160 173 187 204 217 221 217 211 196 165 116 64 27 14 25 48 70 81 80 72 63 57 54 57 66 78 89 104 124 148 174 198 218 228 223 207 191 186 193 207 221
7804 221 230 230 222 209 193 176 162 155 159 171 189 205 214 214 209 208 217 229 236 228 204 175 151 143 150 161 168 166 157 144 131 120 111 104 101 103 107 110 110 106 98 88 78 71 70 73 78 86 103 137
7784 137 187 245 290 313 313 301 282 252 217 186 170 167 171 179 190 199 201 198 200 216 245 275 293 293 277 251 223 199 187 191 209 230 241 238 227 214 202 192 184 180 183 193
7768 193 209 224 232 226 206 181 157 136 117 99 85 83 94 114 134 149 156 161 170 186 205 219 231 252 291 338 377 394 395 388 376 354 321 278 232 190 160 147 152
7752 152 166 178 181 177 176 180 188 194 196 192 182 166 148 138 147 176 213 242 251 241 223 210 209 218 231 244 253 261 265 265 257 241 222 201 181 164 156 157 156 145 127 116 114 114 108 100 99
7733 99 104 106 101 94 90 87 85 87 95 107 120 135 153 169 177 175 172 175 187 202 212 213 203 185 169 165 176 195 212 218 212 202 199 211 233 251 254 240 214 182 142 99 61 39 38
7715 38 57 85 111 125 124 114 105 104 114 127 136 135 125 112 103 101 114 142 176 204 214 209 198 193 195 199 201 200 203 212 225 239 250 250 232 199 167 154 162 181 200 214 224 234
7697 234 247 263 277 281 273 254 229 199 171 151 141 135 129 125 127 128 119 96 68 46 39 51 78 109 134 146 148 145 146 156 171 188 198 203 205 210 220 238 259 272 268 250 226
7680 226 209 203 209 223 236 241 236 227 220 211 191 158 119 83 59 51 55 67 81 95 103 99 82 60 41 29 22 18 17 23 37 59 79 91 93 92 100 120 147 174 196 209 212 206 195
7662 195 182 168 155 144 139 139 140 140 137 133 131 137 152 174 197 218 238 261 286 303 299 278 251 225 201 174 152 144 150 159 169 180 193 199 195 187 188 195 193 176 151 135 135 150
7644 150 178 211 242 268 287 301 308 305 294 280 267 256 243 226 208 195 187 177 161 137 111 88 74 66 67 77 99 128 157 179 194 204 212 219 226 235 243 247 240 220 189
7628 189 152 115 91 85 94 103 99 88 83 93 107 109 97 82 80 97 122 143 155 162 164 162 155 149 149 149 142 132 126 131 142 153 161 166 168 170 179 194 206 208 198 180 156 127 101 88
7609 88 87 90 96 116 156 207 250 270 270 259 250 252 263 275 278 271 256 239 223 211 203 199 192 180 162 141 121 103 88 75 66 65 71 79 86 92 98 105 112 119 124 122 107 79 45 15 -4
7590 -4 -15 -18 -14 0 23 50 67 70 64 56 58 74 107 149 188 210 214 208 201 199 201 202 190 164 133 108 96 97 107 124 141 152 154 150 147 150 156 158 152 139 127 121 116 105 87 70 57
7572 57 50 54 74 104 130 143 140 126 104 81 64 57 58 63 74 89 100 105 110 121 136 147 147 142 144 162 193 221 227 204 163 118 77 45 28 30 48 71 88 94 88 71 52
7554 52 42 44 56 72 87 97 101 104 113 128 144 157 165 168 163 156 152 148 136 115 96 91 102 123 149 173 189 193 188 180 173 166 162 160 166 182 208 234 247 242 228 216 207 199 192 186 176
7535 176 164 152 151 163 182 197 202 200 198 205 219 229 228 212 189 163 137 109 83 67 68 88 118 141 146 137 124 115 114 121 136 150 156 152 147 147 148 145 144 155 180 208 229 238 237
7517 237 231 225 217 200 175 149 132 131 146 174 208 239 262 273 273 263 240 207 170 138 113 94 82 76 80 98 128 160 183 187 172 141 102 70 59 71 94 113 122
7502 122 123 118 113 109 110 117 129 145 166 189 204 204 189 166 145 135 140 156 175 190 201 204 195 174 149 133 132 143 156 163 160 148 133 120 111 98 76 52 34 28 35 50 64
7484 64 74 78 80 85 92 98 99 91 75 57 44 45 60 84 109 129 145 153 151 139 121 107 101 101 102 103 106 109 113 122 141 166 187 191 178 159 144 138 143 154 169 181 189 193 193 189 182 174 167
7465 167 161 150 137 128 129 139 149 153 152 154 162 175 187 198 208 209 195 169 146 140 151 173 199 226 245 249 236 210 179 151 131 121 114 101 78 54 43 47 60 74 87
7448 87 103 125 149 173 195 215 237 261 283 297 299 292 281 273 270 270 269 265 257 245 234 224 215 210 209 209 205 195 189 191 200 205 200 186 161 127 93 72 69 78 87 85 71 52 41 48 69
7429 69 92 113 141 182 227 262 278 284 288 292 299 308 315 312 293 261 227 199 177 158 144 138 144 165 192 213 216 200 181 173 183 202 212 204 183 161 146 137 128 118 111 107 106 104
7412 104 98 87 76 70 79 105 139 167 177 172 161 154 155 159 159 148 122 90 67 64 73 79 76 76 94 127 161 182 189 190 186 171 142 106 75 61 67 91 125 161 193 217 232
7395 232 238 234 218 195 171 160 166 183 200 208 207 197 180 154 124 97 78 69 72 83 95 102 107 113 116 113 110 114 129 146 164 183 203 215 209 190 168 148 125 97 71 53
7378 53 46 50 61 67 58 39 26 32 50 72 96 122 146 160 163 163 163 161 151 134 114 92 73 59 51 49 55 72 95 115 120 110 90 69 56 56 71 101 140 180 211 229
7361 229 239 249 256 252 237 220 209 203 198 193 189 182 166 140 109 81 59 45 43 56 80 106 126 140 148 147 134 110 82 57 37 25 24 37 59 79 85 78 66 58 58 67 85
7344 85 108 130 145 153 157 160 167 180 198 217 233 241 238 228 219 212 199 178 152 135 132 138 149 163 181 196 205 206 203 194 184 179 183 187 183 173 164 161 159 155 156 165 180 190 195 194 193 192 189 186
7323 186 184 187 193 200 199 191 179 168 156 145 145 161 186 199 192 172 154 143 130 109 83 56 32 9 -14 -36 -51 -52 -38 -11 20 43 50 43 31 22 16 15 23 38 57 73
7307 73 81 80 72 61 56 61 72 85 96 104 107 102 93 85 79 78 83 96 112 125 132 138 141 139 133 132 144 167 193 217 245 277 307 325 322 300 266 229 198 178 170 171 178 188 202 220 238
7288 238 247 240 223 208 204 213 227 231 218 192 169 161 172 194 220 242 254 258 256 252 247 241 240 245 253 264 277 291 299 292 270 242 218 200 190 187 187 183 172 161 154 152 147 137 127 120
7269 120 115 102 78 47 22 10 11 23 44 70 98 123 144 165 182 192 192 183 169 155 145 141 138 133 128 127 127 124 121 123 133 146 154 158 159 157 156 160 171 184 197 210 222 225 213
7251 213 188 161 139 123 106 90 75 61 48 40 43 60 88 120 144 156 155 151 152 161 177 195 208 209 197 176 153 135 131 142 166 191 212 225 227 212 178 137 103
7235 103 85 74 61 43 27 24 38 59 75 77 70 71 90 121 151 175 195 212 221 216 202 190 182 173 157 136 112 88 64 47 41 48 62 80 97 112 127 144 165 184
7219 184 198 208 210 202 182 152 120 94 80 77 82 93 106 117 119 111 99 88 79 72 67 73 90 111 129 141 147 145 134 121 112 111 116 126 141 154 165 175 191 213 233 241 232
7202 232 207 172 140 118 109 106 104 105 112 128 149 166 171 159 138 118 104 96 92 91 95 107 126 151 174 188 192 188 180 168 155 135 107 71 41 26 25 27 28 38 62 92 114
7185 114 124 124 121 119 120 120 120 123 136 159 183 205 231 262 287 287 260 220 179 143 116 98 85 74 64 62 69 79 87 95 107 119 131 140 152 175 207 240 258 254 232 204
7168 204 178 153 131 116 107 102 98 97 101 103 98 82 60 39 29 34 56 92 136 182 220 242 248 245 236 218 195 179 179 190 195 186 173 170 181 194 202 201 197 195 192 185 172 155 139
7150 139 125 109 91 72 59 56 65 84 105 117 114 101 82 61 42 33 40 64 98 132 159 178 189 194 196 196 192 184 172 162 156 156 157 154 142 122 102 93 98 110 119 120 112 100
7132 100 96 111 144 182 208 216 214 214 218 220 212 195 175 157 144 141 154 181 213 234 238 230 217 202 182 155 124 95 69 48 31 16 7 5 11 20 27 34 47 66 87 105 119
7115 119 133 146 155 156 150 137 119 103 94 89 78 56 34 24 29 42 54 65 79 92 94 83 64 51 49 53 56 53 47 43 40 42 52 71 94 115 130 142 155 166 165 149 126
7098 126 104 85 70 59 60 73 93 112 129 143 153 154 147 141 147 165 188 204 212 217 226 238 251 266 279 290 294 292 283 267 247 225 206 192 180 172 164 151 125 90 59
7081 59 40 28 19 17 30 54 82 111 144 172 183 172 147 115 82 53 34 26 21 12 3 0 3 10 20 33 47 63 84 110 136 150 150 147 150 163 178 186 187 181 173 163 150
7064 150 133 114 99 90 82 72 64 63 74 93 112 122 119 107 97 98 110 130 148 158 158 145 125 105 94 96 107 117 120 117 112 108 107 109 114 116 115 114 125 151 182 201 202 196 188
7046 188 180 169 157 146 135 123 113 111 117 125 127 125 123 132 155 186 212 225 223 210 189 165 144 125 105 82 64 62 78 104 127 142 150 152 151 149 146 137 126 121 125 132 135 134 139 147
7027 147 152 152 149 149 151 157 171 196 220 235 238 237 237 240 246 257 274 299 323 336 331 310 279 241 195 145 102 74 55 34 5 -21 -39 -47 -50 -47 -38 -23 -7 4 11 10 3 -2 6
7009 6 35 77 118 148 165 176 185 189 181 159 128 104 97 104 118 132 144 148 143 136 137 149 164 176 189 209 229 238 236 230 228 227 222 214 204 191 178 170 168 169 173 182 194 202 201 192 180 164
6990 164 148 133 122 109 93 76 67 70 83 96 99 90 76 71 78 85 86 83 91 109 125 126 113 96 83 73 63 57 55 53 50 50 64 93 123 141 148 152 161 171 180 188 198 205 206 203 194
6971 194 172 135 91 59 48 50 54 50 38 24 16 19 35 59 86 112 130 136 136 135 132 118 89 55 29 15 10 10 12 15 15 19 32 55 76 87 85 78 76 83 95 109 122 134
6954 134 144 152 156 155 146 131 118 110 102 93 85 87 101 124 147 169 187 198 206 213 222 232 242 250 252 244 229 215 203 187 165 149 150 167 189 208 219 215 196 168 145 134 132 132
6936 132 130 120 99 70 44 26 17 18 33 60 90 107 107 100 97 101 111 123 136 151 172 197 219 232 234 227 213 190 161 128 94 63 41 34 41 53 67 84 111 150
6920 150 192 228 247 245 225 198 172 149 129 114 110 117 131 146 162 182 207 229 242 241 228 206 182 161 146 136 132 138 151 166 178 184 184 181 178 178 179 181 187 196 200 189 163
6903 163 133 110 99 97 96 92 85 78 75 79 88 97 102 99 87 63 29 -7 -36 -42 -24 9 41 64 82 103 128 149 159 157 144 129 123 131 151 174 193 203 201 183 155 129 114
6885 114 113 122 134 146 156 168 182 190 182 156 120 85 58 44 44 55 68 78 83 83 81 82 92 107 116 109 88 60 36 24 30 52 81 105 120 130 136 133 116 87 50 15
6868 15 -4 -4 9 27 43 59 78 93 104 110 111 107 96 77 54 29 6 -10 -19 -20 -11 6 27 45 53 54 51 47 46 49 54 57 52 43 35 30 27 22 18 22 36 54 68 74 76 79 85 90 89 80
6848 80 67 53 41 32 28 32 43 53 54 44 33 28 28 25 14 -6 -29 -46 -46 -24 14 56 85 100 112 131 157 175 173 154 134 126 130 142 158 178 197 209 213 209 199 185
6832 185 178 185 201 214 217 217 217 217 210 200 194 195 199 201 204 206 203 186 156 119 84 56 38 27 21 17 15 14 17 23 30 36 40 43 45 46 52 71 104 142 165 161 136 109 92 89 95 105 121 140
6811 140 158 167 164 149 125 97 68 43 26 21 29 45 58 59 44 17 -10 -29 -34 -28 -14 5 29 52 69 76 74 69 68 73 87 110 135 151 152 141 127 117 112 108 105 102 100 101
6794 101 108 120 136 149 154 146 127 100 73 54 43 34 23 14 17 38 69 96 108 102 86 69 53 39 26 17 19 33 55 77 95 105 109 109 105 94 75 49 18 -11 -36
6777 -36 -47 -42 -25 -2 26 62 92 99 81 61 62 83 104 115 121 133 151 165 171 173 177 183 195 213 232 239 231 212 191 175 163 153 139 117 85 50 24 14 18 30 46
6761 46 66 86 98 96 85 80 92 120 153 178 191 198 203 204 198 187 179 179 182 182 178 170 161 156 158 165 165 154 136 123 115 107 97 93 100 120 152 194 238 270 277 264 248 236 225 204
6742 204 172 139 113 98 91 90 95 107 123 138 148 150 141 120 93 68 45 21 -3 -20 -18 1 33 68 99 121 129 125 117 115 123 141 164 192 223 246 251 240 225 219 222 228
6726 228 231 229 219 203 185 172 165 158 151 145 142 142 147 161 180 196 204 206 204 195 177 157 148 148 151 151 148 145 144 146 148 143 129 114 104 100 97 98 108 129 155 178 200 220 234 241 239 230 214
6706 214 195 176 157 133 104 78 61 58 68 83 96 100 98 99 108 119 124 123 126 136 149 159 164 168 175 183 189 187 183 182 185 186 179 166 154 149 146 140 126 110 100 103 115 131 149 171
6687 171 195 215 227 228 216 193 165 140 120 102 81 61 45 35 33 42 67 103 141 174 197 209 214 217 221 224 226 232 241 251 258 265 272 276 272 258 235 204 166 132 110 106 114
6670 114 127 141 151 158 168 184 203 222 238 251 259 258 249 238 230 227 227 226 216 195 172 159 161 172 186 200 211 214 210 202 194 185 172 156 145 141 141 138 127 109 91 80 75 71
6652 71 64 51 34 16 6 17 55 114 180 237 274 284 274 253 224 184 133 78 30 -8 -38 -53 -49 -27 0 25 44 58 64 63 61 62 64 63 63 71 92 117 139 154
6636 154 164 169 167 156 145 140 143 151 159 166 170 168 160 153 152 157 165 170 170 162 151 137 124 112 101 96 97 102 106 108 111 116 128 148 171 189 188 170 142 117 101 95 96 105 122 149 179 198 201
6617 201 188 165 137 107 87 85 98 112 115 107 94 82 75 73 77 83 86 92 103 118 128 129 128 136 153 167 170 165 163 167 169 159 142 125 112 104 95 85 74 63 53 43 34 31 37 47
6598 47 55 59 68 86 109 128 135 130 117 101 88 81 69 47 16 -8 -18 -12 -1 10 20 27 27 19 4 -11 -19 -9 19 61 106 145 171 184 187 186 185 184 182 184 192 204 213 215 212 203
6580 203 185 160 133 109 88 71 66 76 95 112 122 131 145 159 161 148 128 109 95 85 80 80 83 89 102 125 152 177 196 206 210 204 194 185 181 182 176 156 128 107 104 114
6563 114 119 118 120 133 151 159 153 135 109 76 48 34 32 30 27 35 62 98 128 149 166 183 198 207 207 192 162 126 91 63 43 36 43 58 69 72 69 64 59 52 46 46 50 59 71 85
6544 85 100 114 126 128 123 118 120 124 116 88 50 16 -2 0 21 55 94 132 164 185 191 184 174 170 170 169 163 153 140 127 125 134 150 166 183 201 215 212 194 172 155 139 115
6527 115 86 62 48 41 32 22 16 17 19 12 -7 -28 -35 -20 12 56 109 162 203 219 215 209 210 212 201 173 138 109 91 88 99 120 137 145 142 131 115 95 81 79 87 94 92 83
6509 83 76 75 83 94 102 106 104 96 80 62 51 50 56 60 63 68 71 68 67 78 103 126 133 129 131 148 175 203 232 262 289 305 311 314 318 321 315 299 277 257 237 216 195 176 162 154 150 148
6490 148 151 160 175 188 190 176 145 107 72 50 44 53 70 91 107 115 121 134 158 191 226 259 289 307 307 291 264 233 201 172 152 143 140 143 150 162 170 170 164 156 147 137 134 145
6473 145 168 185 188 179 166 153 139 126 117 113 110 104 96 92 99 117 139 155 161 158 150 138 121 99 77 66 70 85 95 95 92 95 105 117 130 142 149 144 132 128 137 152 159 154 144 139
6454 139 144 158 174 184 185 182 177 167 149 131 121 119 115 104 93 90 97 106 103 81 50 26 16 17 19 20 22 25 34 51 75 101 125 149 175 192 192 177 160 151 146 141 133 126 121 112 97
6435 97 81 75 83 98 105 97 80 64 53 49 54 69 87 93 83 65 54 50 49 48 53 66 85 106 122 129 126 122 124 130 133 130 124 114 102 87 74 72 84 105 123 130 126 118 115 116 119 123 130
6416 130 144 162 180 189 192 197 210 221 219 204 187 176 171 167 166 167 161 141 111 83 65 59 68 96 135 165 177 184 194 206 210 206 206 216 231 239 239 235 230 226 220 206 180 146 115
6397 115 103 111 133 160 186 208 220 217 206 194 187 179 168 161 165 179 194 201 200 194 190 192 197 194 180 164 159 169 186 198 202 199 190 181 178 183 187 183 173 163 157 151 144 141 143 152 167 184 196
6378 196 199 191 177 159 141 127 121 123 131 146 164 172 166 149 136 136 142 148 152 154 158 165 178 200 227 254 274 282 280 274 273 279 287 296 308 325 341 344 328 301 270 240 209 178 147 119
6359 119 96 80 68 57 49 52 68 94 122 143 156 167 179 188 192 190 187 186 184 179 168 153 141 138 143 150 147 140 144 166 196 214 212 192 164 139 123 114 102 75 44 26 33 54
6342 54 76 94 106 110 103 92 81 68 55 42 34 28 21 14 12 17 26 40 59 76 87 95 109 127 141 146 144 139 131 124 125 134 143 142 131 112 93 80 75 78 83 88 92 96 99 105 113 122 127 131 140
6321 140 160 187 213 226 223 203 177 153 135 122 115 119 132 147 154 150 141 127 110 95 90 101 120 138 152 162 172 179 176 168 166 178 197 210 212 213 217 216 201 175 149 130
6304 130 119 120 133 150 154 137 110 89 83 91 106 123 140 158 173 181 178 163 143 121 99 82 72 72 75 77 77 76 76 74 74 75 75 68 54 40 32 34 40 46 52 60 68 77 86 98 116 141
6285 141 171 209 249 280 289 275 248 221 201 184 170 161 160 164 170 178 191 207 216 212 194 171 151 136 129 134 148 165 174 175 173 178 191 208 228 255 286 318 342 351 346 330 312
6268 312 291 266 237 204 172 148 133 122 108 88 72 74 96 124 145 157 163 162 153 143 142 153 170 186 199 208 211 205 194 180 163 144 122 99 72 40 9 -12 -19
6252 -19 -12 2 22 46 74 102 124 135 133 123 110 102 103 110 123 142 164 184 194 188 169 146 127 121 131 149 162 164 159 158 161 164 168 175 186 197 204 207 205 202 196 188 175 156 134
6234 134 116 102 85 69 63 74 94 108 107 99 96 103 114 121 119 114 110 112 120 135 154 171 182 191 197 198 194 192 198 207 209 198 182 170 165 164 165 170 176 183 194 212 231 244 250 255 263 272 280 288
6214 288 295 301 302 294 274 249 228 216 208 198 189 186 188 187 174 158 153 168 199 228 239 225 196 169 156 156 159 157 154 157 171 196 226 248 254 242 216 184 148 114 91 87 100
6197 100 121 144 168 189 199 190 172 159 156 157 157 157 159 159 152 142 135 131 129 127 129 136 143 145 144 142 140 135 128 122 121 127 139 154 167 176 175 168 159 159 169 181 190 194 195 199 210 227 245 251 242 227
6176 227 215 204 185 164 157 169 194 219 237 247 243 228 215 212 216 212 196 181 173 168 156 136 111 89 79 92 123 155 172 171 162 150 133 113 96 88 87 88 88 94 109 129
6159 129 147 158 161 160 153 135 102 59 18 -10 -23 -27 -26 -21 -9 13 45 78 107 124 128 119 103 88 79 80 85 88 86 82 84 93 107 118 124 124 121 120 126 141 162 183 201 212 215 210
6140 210 199 190 185 180 172 161 148 126 96 66 51 56 70 77 72 69 82 111 142 162 168 169 177 190 204 211 211 203 191 180 170 161 150 135 117 100 91 92 101 107 102 90 77 67 56
6122 56 40 23 16 26 52 83 112 138 167 198 221 231 231 234 241 246 243 232 217 201 184 166 149 128 105 86 74 69 66 64 67 71 73 72 74 80 86 92 105 125 145 153 151 144 140 142
6104 142 152 171 195 211 214 204 194 192 206 233 263 283 284 270 249 231 222 221 226 232 236 241 250 262 270 266 252 236 225 219 213 210 210 210 207 202 201 208 214 213 205 196 188 184 191 211 230 230 202
6084 202 157 115 83 62 54 60 72 84 88 87 82 71 54 37 23 13 2 -11 -19 -18 -11 -7 -9 -12 -12 -7 -1 4 10 11 4 -7 -14 -13 -4 10 31 51 54 34 -1 -31 -44 -40 -30 -23 -21
6065 -21 -18 -8 10 30 51 76 108 138 148 135 109 83 64 53 49 53 61 67 69 69 68 68 65 52 31 10 -3 -9 -11 -9 0 14 27 36 41 43 47 61 92 135 171 188 186 176 164
6047 164 150 140 136 137 141 148 159 169 176 181 191 201 204 197 182 162 142 125 117 122 134 145 147 135 116 103 109 130 155 171 180 186 193 199 204 209 214 218 209 178 130 82 53 47 53 59 64
6028 64 64 55 33 4 -18 -24 -11 18 55 88 113 131 141 137 121 101 88 85 86 88 89 85 72 51 29 12 -1 -15 -25 -30 -29 -28 -27 -22 -15 -7 -1 7 23 42 57 62 62 62 66 71 75
6010 75 80 89 104 122 134 138 134 126 113 91 64 41 34 41 53 65 83 112 147 173 185 189 192 197 202 202 195 182 166 151 137 126 120 122 132 143 151 159 170 182 195 206 214 217 211
5991 211 198 183 169 155 138 122 111 112 127 151 178 201 219 228 229 225 217 207 196 191 195 206 214 214 209 205 207 215 227 242 257 271 285 298 309 319 329 340 345 338 321 306
5975 306 303 315 344 390 458 552 670 801 938 1082 1234 1396 1558 1706 1820 1882 1880 1811 1686 1522 1337 1152 987 856 762 697 647 599
5963 599 549 506 479 469 466 459 448 438 433 430 431 437 441 434 413 390 379 383 391 390 373 348 326 316 312 305 290 274 262 259 263 275 291 302 307 310 316 329 341 350 350 341 326 313 309 314
5945 314 322 331 345 368 392 404 400 383 365 351 343 335 325 310 293 278 269 267 269 271 271 270 268 266 262 260 261 261 256 245 235 231 233 236 239 237 226 207 189 176 170 168 168 173 181 192 203 209 206 192
5925 192 176 165 161 163 170 179 188 191 188 186 187 183 174 171 181 199 211 211 205 200 195 190 190 198 209 212 200 175 145 119 110 123 151 182 208 230 250 270 289 309 334 367 400 422 421 395
5906 395 356 317 282 248 214 189 181 186 193 192 188 188 193 194 186 175 175 186 199 208 213 214 212 207 205 212 223 230 234 239 244 238 218 192 174 170 172 167 150 122 96 84 91 110 132 154 171 179
5887 179 170 147 116 90 76 69 62 50 39 37 47 65 84 99 104 97 84 78 82 89 94 99 107 113 115 119 131 146 155 153 144 131 115 102 97 98 96 91 90 90 86 74 70 86 116 146 167 179
5868 179 183 179 169 161 155 142 119 91 68 59 64 77 89 95 91 80 64 43 25 19 33 63 90 100 92 81 78 83 86 84 86 100 124 152 180 206 230 246 251 241 220 190 157
5851 157 126 104 99 112 134 151 156 152 146 138 130 128 136 148 156 157 154 148 135 118 100 80 58 38 33 43 59 71 80 94 113 127 134 134 131 127 123 120 122 132 145 151 143 131 132 152 177
5832 177 189 185 179 178 179 175 167 157 146 135 132 140 155 167 173 175 177 178 176 173 168 161 151 134 111 90 78 79 89 105 127 157 192 223 247 262 269 265 246 218 194 185 190 200 211
5814 211 221 230 230 214 187 160 144 142 150 164 176 182 178 170 164 160 158 159 168 183 194 193 184 177 171 154 121 77 40 16 5 1 -2 -13 -30 -42 -40 -26 -10 5 26 56 90 121
5796 121 145 161 171 177 182 186 186 179 170 164 161 157 151 142 130 113 96 83 72 58 43 34 39 55 70 78 82 83 81 78 75 76 85 99 115 130 145 156 161 160 158 156 152 140 116 83 47 19
5777 19 11 22 45 69 88 103 114 118 115 106 92 74 56 41 35 41 51 58 54 44 37 37 40 41 42 44 44 40 36 38 47 58 65 65 57 45 37 44 67 98 126 143 147 146 149 165 192 217 234
5757 234 245 255 262 262 257 251 247 244 240 230 217 206 205 213 222 221 206 181 152 128 114 112 117 119 115 105 99 102 113 125 134 143 157 175 189 190 177 156 137 127 126 130 136 145 161 181 199
5738 199 210 217 218 212 193 171 156 151 148 140 129 124 129 138 143 141 140 144 153 162 164 153 131 107 91 87 93 102 107 109 111 117 129 144 162 185 210 228 232 218 193 168 148 133 124 123 124 123 119
5718 119 117 121 126 127 127 131 141 153 164 176 188 196 196 188 174 155 135 114 92 72 58 54 56 53 42 26 14 8 8 9 10 5 -12 -42 -67 -70 -45 -6 27 42 42 31 17 4
5701 4 -2 -4 -3 3 19 45 69 82 84 81 77 72 66 58 46 32 24 31 47 59 62 64 75 88 96 100 108 126 150 177 206 233 246 236 208 173 140 105 71 46 39 50 68 79 83
5683 83 87 93 97 94 83 70 58 49 46 49 53 53 47 39 36 43 62 91 120 135 130 115 104 104 113 126 139 149 154 154 153 155 161 170 178 189 206 227 248 264 276 284 291 291 277 249 211 169
5663 169 124 82 49 36 42 54 62 66 74 95 125 154 169 165 145 122 103 85 65 53 54 65 74 75 76 86 108 142 181 211 217 199 177 162 155 147 142 147 159 170 175 180 192
5646 192 208 220 224 215 198 180 166 157 149 145 149 165 186 201 211 217 220 213 194 169 151 145 148 152 159 165 169 163 147 130 119 117 117 115 112 115 126 142 157 165 167 168 170 169 162 150 139 135 138
5626 138 144 149 148 139 125 106 78 43 9 -10 -8 12 40 65 81 90 94 95 88 77 71 79 96 117 138 159 180 199 217 232 239 234 216 196 183 180 185 193 197 196 191 188 188 182 167 148
5608 148 139 146 165 190 213 227 229 225 221 217 213 209 209 213 220 221 210 183 147 114 96 94 98 100 99 97 98 99 104 120 146 173 187 181 165 149 140 140 150 165 174 165 137 103 71 45 29
5589 29 28 48 83 126 168 199 210 200 175 144 110 75 41 15 2 4 20 40 56 64 71 79 83 80 71 61 48 35 24 22 26 29 29 30 30 26 17 8 6 12 23 41 63 88 105
5571 105 109 98 81 72 75 85 92 92 87 79 68 58 50 48 53 63 68 57 28 0 -8 4 21 24 15 11 24 56 94 125 141 142 133 123 118 124 143 165 183 196 204 206 196 178 161
5553 161 151 139 120 98 83 77 79 85 91 96 97 95 93 87 71 44 14 -5 -13 -17 -26 -39 -45 -35 -8 27 60 80 80 62 36 18 16 28 41 45 38 27 21 19 17 14 11 12 18 26 41
5534 41 63 89 109 118 118 112 97 79 65 60 60 61 66 83 112 141 161 167 163 153 138 118 92 63 38 24 24 38 64 96 124 140 140 126 104 81 65 55 46 35 24
5518 24 17 15 11 2 -6 -12 -11 -6 -5 -9 -20 -35 -49 -61 -63 -51 -26 -2 12 19 27 39 49 52 52 60 80 106 128 142 146 144 138 134 136 146 158 164 160 148 129 107 86 74 74 82 92 107
5498 107 128 154 178 194 194 179 150 119 94 75 61 53 53 59 65 72 88 116 143 159 160 153 146 148 162 183 202 213 214 205 188 167 144 122 100 80 70 71 79 84 84 78 65
5481 65 49 35 28 33 49 75 103 122 128 120 102 81 63 52 50 52 57 63 70 70 59 44 42 61 90 107 99 76 56 49 52 56 55 50 47 46 42 33 19 11 15 34 57 77 89 99 109
5462 109 123 140 160 174 173 157 138 126 119 114 110 106 97 77 48 24 10 3 -3 -11 -16 -12 5 39 83 127 162 180 178 162 145 139 145 160 180 199 217 230 238 236 221 199 183
5445 183 181 188 195 200 205 212 219 227 239 253 262 261 246 221 196 183 188 199 199 190 182 177 169 151 133 120 112 98 79 60 48 40 37 40 54 76 103 126 141 146 139 120 87 52 28 27
5427 27 51 85 114 127 129 133 153 181 203 211 209 203 189 167 146 136 135 134 129 127 132 143 158 175 191 201 202 196 184 171 163 161 161 157 147 136 134 144 171 215 267 309 329 326
5409 326 311 289 263 237 216 199 186 175 168 169 180 199 220 234 240 239 234 222 198 161 120 90 78 77 78 84 103 134 163 176 171 157 140 124 112 109 109 107 101 102 117 146
5392 146 181 211 231 241 245 241 228 205 184 176 183 195 204 204 191 168 140 123 125 138 151 161 168 170 163 147 129 117 113 111 109 107 107 108 103 85 54 20 -2 -6 10 42 78 109
5374 109 129 139 142 139 127 109 94 92 100 111 115 111 104 100 101 98 81 49 17 -1 0 14 33 48 58 64 70 79 87 86 74 54 38 35 48 69 90 106 116 120 117 113 115 123 129 127 120
5355 120 120 136 167 205 242 267 276 272 265 259 249 233 209 182 154 129 110 99 91 82 73 69 74 86 101 111 109 93 69 47 31 22 16 13 15 23 38 60 84 107 124 134 142
5338 142 150 163 178 191 198 197 190 183 179 176 172 167 167 173 178 176 165 149 137 138 155 186 216 232 233 230 230 230 221 199 166 133 107 98 102 111 113 104 90 74 61 49 42 42 49 57 60 57 51 46 39
5318 39 31 24 23 28 37 50 73 105 139 167 184 187 178 161 147 144 145 142 133 128 132 139 143 146 150 159 173 187 194 189 179 180 195 216 232 234 222 198 173 159 162 169 167 157 146 138 134 134 136 135
5298 135 127 114 104 98 94 91 95 107 121 134 145 153 159 164 170 177 181 182 181 181 179 178 179 179 169 150 132 123 125 129 131 135 142 148 149 144 136 127 124 126 135 149 167 182 185 171 144 113 86 70 61 55
5277 55 45 30 18 17 26 42 61 79 99 123 151 177 198 210 216 219 219 214 199 171 130 88 61 55 61 68 74 82 90 91 85 81 86 100 120 144 166 179 181 172 153 124 92 70
5259 70 65 73 85 96 102 97 81 66 69 93 127 153 165 165 157 141 125 118 129 154 182 200 204 197 181 156 125 98 86 89 97 102 103 106 110 113 116 122 132 140 143 138 126 111 100 101 114
5240 114 128 133 130 125 116 102 92 97 114 127 124 107 85 62 42 34 43 70 105 140 165 171 159 140 133 144 164 180 187 187 182 174 172 179 194 209 218 218 209 191 166 143 127 122 127
5222 127 138 144 141 129 114 99 88 83 85 95 109 120 126 130 136 146 156 163 165 167 172 180 188 192 194 202 216 232 242 239 226 204 175 142 117 105 102 96 83 73 76 89 103 110 107 98
5204 98 89 85 88 93 93 91 92 102 113 114 104 89 84 96 117 133 135 126 116 114 117 120 119 109 89 64 44 35 36 43 52 60 62 55 43 38 45 62 78 87 91 98 108 119 121 109 82 49 23
5184 23 14 21 33 43 52 67 87 110 129 149 172 192 203 200 188 174 161 153 152 160 167 164 144 116 96 96 112 128 132 123 104 78 45 13 -7 -11 -1 15 31 41 42 40 39
5167 39 40 38 33 31 40 55 65 66 68 78 99 123 144 156 158 153 146 138 123 100 80 74 76 76 71 69 69 66 61 64 81 103 121 135 153 175 191 193 182 167 154 152 158 163 156 133 103 81
5147 81 80 100 134 173 210 243 269 278 267 244 221 208 200 193 185 171 144 108 75 52 39 31 27 30 39 51 66 80 88 91 100 120 144 156 147 125 93 52 5 -38 -64 -69
5131 -69 -57 -34 -11 6 15 19 25 30 34 38 48 63 76 78 68 53 45 49 64 80 90 95 101 112 129 151 178 204 217 212 196 181 171 163 155 151 149 149 151 158 170 174 162 139 118
5113 118 107 100 89 77 69 72 84 103 123 139 152 166 177 180 172 159 148 143 145 153 161 157 137 107 76 47 21 5 8 33 70 107 137 158 165 161 154 146 137 128 120 113 103 85
5095 85 58 25 -9 -43 -62 -57 -31 2 29 42 43 37 29 22 15 12 20 44 83 128 169 195 205 200 182 158 131 108 96 96 104 118 137 161 189 215 231 229 211 185 162
5078 162 146 134 122 109 101 101 107 114 120 119 115 111 111 114 114 107 96 82 67 53 43 36 29 23 24 39 73 122 179 232 269 282 278 269 266 270 275 272 257 237 223 223 234 247 258 268
5060 268 274 273 266 255 244 233 223 218 220 232 249 262 265 252 226 192 160 134 117 113 119 132 140 139 131 124 129 145 164 176 178 174 168 162 153 145 146 157 172 180 171 149 120 96 87 93 107
5041 107 123 142 168 197 222 238 242 235 214 183 148 124 120 130 137 124 94 62 48 54 68 73 65 48 32 28 39 58 74 78 76 79 92 107 119 129 143 162 178 186 180
5025 180 161 134 105 81 64 59 65 77 92 107 123 135 141 144 149 155 152 133 101 74 61 63 75 95 118 139 151 154 153 147 133 111 89 75 70 70 72 76 87 106 131 149
5008 149 149 124 85 49 33 46 83 130 171 194 201 196 181 157 131 111 99 95 102 124 154 181 203 226 252 270 275 272 269 265 253 232 210 188 164 139 122 115 116 117 119
4991 119 126 138 155 173 188 196 200 200 193 181 173 180 198 212 212 204 197 189 180 175 175 170 152 130 118 122 132 143 162 192 222 244 259 273 287 293 284 262 238 222 220 226 230 227 220 212 206
4972 206 197 185 172 160 152 144 132 113 99 100 122 154 180 193 194 188 178 168 159 152 149 149 156 169 181 188 192 200 218 245 273 296 309 305 286 258 237 229 230 230 227 220 206 179 146
4954 146 118 104 95 83 68 54 43 30 15 3 -4 -12 -23 -39 -51 -54 -46 -29 -7 17 41 62 77 90 103 115 122 123 122 125 133 142 149 158 170 187 207 223 225 209 182 154
4937 154 128 105 87 79 81 83 79 73 75 89 110 127 132 129 130 138 147 150 143 130 113 93 74 63 65 78 90 93 82 63 46 35 31 34 45 61 74 71 59 48 45 44 39 37 45 60
4919 60 72 76 75 72 69 65 57 46 34 24 21 20 19 19 19 18 7 -11 -26 -27 -10 20 58 97 123 122 91 46 6 -16 -20 -9 10 39 77 120 157 178 186 193 211 238 266 284
4901 284 288 282 271 260 252 243 233 223 216 212 205 194 179 165 154 149 154 169 193 217 236 249 254 250 241 232 225 219 215 215 221 232 240 241 235 227 224 231 242 247 241 227 216 212 213 215 217 217 210 194 172
4881 172 151 137 134 142 157 173 186 194 195 187 170 154 148 156 175 194 208 213 211 202 191 181 173 167 166 172 180 182 175 171 182 211 243 261 263 255 243 233 226 221 215 205 191 178 168 159 152
4862 152 151 164 189 212 220 210 187 163 142 124 107 97 99 112 133 150 156 150 143 143 155 173 189 197 193 176 153 134 127 125 122 116 112 111 109 101 91 81 76 77 84 98 118 141 168
4844 168 194 214 228 233 228 209 181 154 136 128 125 119 105 88 75 72 78 87 96 106 115 118 113 108 113 126 140 146 147 148 155 167 177 176 163 146 133 125 117 110 107 115 136 165 195 221 238
4825 238 247 245 235 224 221 225 231 230 221 208 202 212 242 281 309 316 305 291 279 266 254 252 262 276 281 276 261 233 191 143 106 93 100 113 119 113 97 79 65 59 57 57 54 46 33
4807 33 20 17 32 63 102 139 170 192 197 183 154 126 110 103 99 95 94 102 116 134 154 174 194 212 227 230 219 194 165 142 129 125 129 140 152 159 159 153 146 146 157 178 197
4790 197 204 198 186 170 154 140 131 125 120 121 140 182 236 284 311 313 294 261 223 189 167 159 163 171 174 167 151 131 113 102 99 101 100 89 74 64 63 64 63 65 84 119 155 174
4772 174 174 166 161 158 155 148 138 124 109 101 106 119 133 144 155 165 167 156 135 118 113 120 134 153 173 189 198 200 199 195 185 165 137 113 98 90 80 65 48 38 37 38 32 19
4754 19 4 -3 1 17 39 65 86 98 101 101 98 88 67 43 29 31 45 67 94 118 132 135 138 144 147 139 126 128 147 167 169 155 139 133 139 148 157 159 152 137 120 109 104 102 101 104 117
4735 117 141 170 192 198 189 169 148 131 117 107 104 111 124 135 144 155 171 186 192 191 190 195 203 212 223 232 232 218 194 169 148 128 111 98 92 96 117 153 187 201 190 167
4719 167 146 131 116 101 93 97 106 110 103 87 73 71 86 114 148 182 207 218 216 203 185 164 142 129 132 146 159 162 157 146 129 108 92 85 87 89 81 59 28 2 -6 0 7
4701 7 7 4 9 20 24 17 8 5 5 0 -11 -20 -22 -14 2 25 43 52 52 51 52 54 60 77 110 152 190 215 224 218 199 173 147 124 107 95 85 71 48 18 -3 -5 10 31 40 34 20
4682 20 6 0 7 28 59 90 111 120 119 115 113 120 138 160 174 174 163 149 139 130 122 118 122 135 154 175 192 207 226 247 265 275 278 279 278 272 259 244 232 223 211 195 177 162
4665 162 150 140 134 137 145 152 150 135 109 77 52 42 51 70 87 98 104 108 108 100 86 69 53 40 30 23 23 32 50 75 100 118 125 121 115 121 150 202 263 313 340 346 340 327
4647 327 308 285 266 256 249 240 227 213 204 201 202 203 200 189 171 147 120 101 97 106 115 118 117 126 148 175 192 192 186 186 198 213 223 224 218 211 205 202 205 214 223 228 232 237 242 240 224 200 180
4627 180 176 188 210 232 253 265 264 247 224 207 202 201 198 193 188 185 187 201 228 259 277 276 268 265 270 273 268 256 245 235 226 215 204 195 187 180 168 152 134 121 119 130 150 173 191
4609 191 204 213 216 209 191 170 160 164 174 176 167 152 135 116 94 73 60 59 68 75 76 71 67 68 72 79 93 116 141 156 154 141 129 124 126 129 126 115 103 99 103 111 120 132 149 169 186
4590 186 195 198 193 182 168 158 154 153 154 156 154 145 129 114 107 108 108 105 100 88 68 42 20 11 14 21 27 31 31 29 27 27 29 27 16 -1 -17 -23 -17 -1 22 55 89 112 118 115 116 124 126 113 87
4570 87 61 40 29 30 36 39 35 32 35 41 35 19 3 2 14 36 62 91 116 131 138 140 140 139 140 142 141 132 117 105 98 98 98 97 92 81 67 56 53 54 53 47 39 33 33 46 73 109 144 167
4550 167 173 166 156 150 155 168 181 181 162 128 90 58 35 17 0 -12 -17 -11 -1 7 14 21 27 29 28 34 49 67 77 76 73 78 90 102 105 101 95 95 109 135 162 180 189 193 196 195 184
4531 184 165 148 141 143 147 147 140 132 130 141 173 222 267 284 264 221 180 149 122 95 71 54 42 26 6 -8 -8 11 43 79 109 129 138 135 117 90 67 59 69 91
4515 91 119 146 168 178 176 168 161 152 140 127 119 117 121 123 120 114 115 130 154 175 181 172 153 130 110 98 90 76 43 -5 -51 -73 -62 -24 26 73 102 106 94 79 72 75 83 91 98
4497 98 102 104 106 110 115 120 124 133 147 160 166 164 154 133 101 61 24 -2 -19 -34 -44 -41 -22 9 43 73 95 105 99 77 49 28 18 17 23 35 53 74 92 108 121 132
4480 132 142 146 145 144 151 171 198 221 231 231 224 213 201 198 210 232 250 257 257 253 246 232 212 189 172 163 161 158 153 149 148 151 152 149 146 145 146 151 166 190 218 241 253 253 244 230 215 201
4461 201 188 176 165 153 137 115 90 70 59 61 78 110 144 163 159 141 126 121 125 136 152 168 181 188 190 191 191 192 191 187 179 171 166 165 167 167 165 163 165 175 187 191 181 163 147
4443 147 131 107 75 47 38 52 82 117 144 153 144 130 123 128 136 138 132 115 89 66 55 58 61 54 40 34 40 53 65 71 64 45 25 22 46 87 127 151 158 155 150 149 153 163 176
4425 176 190 203 214 222 229 240 257 279 301 319 323 313 292 271 256 244 234 226 217 202 180 160 149 143 132 115 103 97 88 70 49 37 35 43 65 104 156 205 240 259
4409 259 267 267 261 254 251 252 258 268 278 277 255 212 157 101 54 22 5 0 3 13 29 47 66 87 108 122 128 131 132 125 105 73 44 26 22 33 57 90 119 131 122 93 54
4391 54 16 -13 -28 -29 -20 -8 0 4 7 17 35 58 78 92 100 108 123 148 174 190 193 187 181 181 182 180 174 167 163 162 157 142 124 115 123 144 168 184 190 190 188 187 184 178 174 172 170 165 154 145 142
4371 142 147 156 161 160 154 155 173 204 239 268 293 310 313 297 271 245 221 193 165 146 139 141 149 163 182 200 211 212 204 189 177 177 190 205 216 220 222 221 218 217 217 211 194 172 156
4353 156 150 150 146 136 120 98 73 50 38 42 57 72 82 85 84 82 76 69 66 72 86 101 115 129 146 166 183 193 199 206 214 220 220 217 216 212 202 187 180 186 200 213 217 212 205 202 201 200
4334 200 189 169 144 123 113 113 119 125 125 113 93 71 52 34 14 -10 -37 -53 -49 -28 0 25 43 55 59 57 50 45 44 51 65 84 99 104 98 88 80 77 78 85 99 117 136
4316 136 150 157 160 161 160 155 144 133 127 126 129 131 131 126 118 108 96 85 76 75 86 103 113 109 93 76 66 61 58 58 59 56 46 29 15 10 16 30 46 59 67 70 70 73 76 75 69 67 74 88
4296 88 106 122 134 133 117 93 70 53 40 31 27 27 25 18 11 10 16 24 31 39 48 57 64 65 61 55 58 73 98 119 128 128 128 134 146 162 176 183 180 173 170 176 185 191 191 186 183 187 200 222 245 254 239
4275 239 205 167 142 133 126 108 76 46 34 45 66 88 107 123 132 132 129 130 136 148 170 203 239 264 274 275 273 264 242 209 175 150 137 130 123 113 101 94 96 102 103 94 78
4258 78 61 52 52 57 65 78 97 120 142 158 167 164 153 144 145 153 159 161 167 180 192 193 181 157 124 87 53 30 23 31 48 67 80 90 106 128 146 153 156 163 172 170 157 141 133 134
4239 134 146 166 186 194 184 165 149 131 105 73 44 26 20 26 45 74 106 137 165 186 196 195 190 183 171 149 123 103 89 78 70 66 71 79 84 90 104 130 155 168 163
4223 163 151 140 136 139 145 149 148 140 128 118 106 85 52 11 -25 -52 -65 -64 -53 -38 -24 -11 2 14 20 19 18 28 52 81 106 122 133 145 160 174 183 183 182 194 223
4206 223 258 283 290 281 263 241 218 198 185 183 196 219 234 230 210 184 162 147 145 164 197 227 242 244 243 241 229 206 178 157 147 151 160 166 165 162 162 168 180 196 212 217 207
4189 207 186 163 140 119 108 111 124 133 132 122 108 92 81 79 86 95 104 115 131 147 160 165 164 156 145 139 141 147 152 159 167 174 175 165 141 107 71 50 47 56 61 57 49 41 33 22 6
4170 6 -9 -19 -16 -5 9 26 50 84 119 148 168 179 183 183 183 189 198 201 201 199 200 200 197 187 167 136 103 78 67 68 77 95 119 142 156 162 162 157 148 140 136 134 133 131 134 145 162 175
4151 175 176 163 142 123 110 99 87 74 65 58 53 52 59 72 83 90 95 100 102 99 97 100 112 128 148 169 186 190 182 171 168 170 174 177 179 180 180 181 186 194 199 200 199 191 173 151 140 149 172 201
4131 201 230 260 285 296 290 278 268 258 247 235 227 221 217 219 235 260 278 278 265 257 261 271 273 262 239 214 196 190 196 205 209 207 209 218 231 245 263 288 313 325 321 308 294
4113 294 285 282 284 285 276 258 241 229 225 228 244 271 300 314 311 295 279 273 286 318 355 385 398 398 391 383 379 382 386 385 374 356 334 315 306 313 333 356 372 382 387 390 394 409 438
4095 438 481 530 588 658 741 833 928 1027 1138 1271 1436 1645 1906 2228 2611 3042 3495 3929 4298 4553 4663 4621 4439 4143 3771 3367
4085 3367 2972 2613 2297 2029 1806 1625 1475 1347 1237 1144 1071 1020 993 987 996 1010 1021 1026 1024 1019 1013 1012 1020 1048 1103 1182 1273 1370 1474 1595 1739 1916
4072 1916 2135 2404 2723 3099 3559 4151 4919 5880 7028 8328 9711 11077 12292 13212 13711 13718 13235 12346 11183 9890 8598
4064 8598 7402 6351 5462 4731 4147 3690 3330 3037 2796 2603 2448 2320 2207 2111 2039 1998 1981 1983 1994 2013 2041 2078 2126 2191 2283 2415 2595
4053 2595 2821 3085 3378 3704 4087 4560 5159 5911 6838 7979 9391 11135 13250 15720 18449 21241 23819 25864 27101 27363
4045 27363 26633 25038 22813 20237 17581 15062 12814 10894 9302 8004 6960 6123 5449 4901 4453 4085 3776 3511 3291
4037 3291 3120 3001 2923 2873 2843 2828 2824 2828 2843 2878 2944 3048 3192 3378 3606 3887 4236 4666 5184 5810 6578 7538 8752 10287 12215 14586
4027 14586 17395 20549 23845 26988 29619 31387 32036 31485 29843 27372 24402 21264 18229 15480 13106 11117 9485 8165
4019 8165 7110 6273 5607 5068 4616 4223 3875 3578 3340 3161 3027 2920 2836 2780 2747 2727 2718 2729 2771 2848 2956 3100 3291 3535 3832 4186
4009 4186 4608 5123 5758 6550 7540 8772 10296 12160 14386 16937 19682 22394 24776 26517 27366 27201 26059 24121 21658
4001 21658 18964 16304 13862 11731 9922 8410 7156 6128 5294 4626 4096 3677 3347 3085 2869 2678 2502 2345 2216 2117
3993 2117 2041 1983 1939 1906 1877 1854 1847 1866 1908 1968 2045 2145 2273 2439 2654 2933 3286 3724 4273 4969 5843 6903 8135 9487 10865 12129
3983 12129 13118 13695 13779 13362 12505 11333 10001 8650 7381 6244 5260 4435 3764 3229 2803 2463 2187 1961 1766 1589 1426
3975 1426 1284 1171 1089 1027 977 937 909 896 891 887 882 877 872 868 864 866 878 906 956 1032 1131 1254 1403 1588 1817 2094 2421 2798 3218 3655 4066 4404
3962 4404 4626 4703 4619 4381 4019 3585 3135 2712 2337 2011 1730 1492 1295 1134 998 882 786 708 641 577 516 467 434 414 395 370 338
3951 338 307 281 258 237 219 209 204 201 195 187 179 171 167 169 178 193 207 210 196 172 152 149 161 175 185 188 190 188 182 171 155 138 126 124 127 128 119 100 76 51 33 32 50 80 110
3933 110 135 157 179 195 203 205 202 198 194 194 200 213 228 240 240 224 198 173 154 139 122 103 86 72 59 48 42 46 60 80 98 112 121 131 146 165 182 191 187 174 157
3916 157 142 125 105 81 63 58 64 79 94 100 91 72 54 49 53 60 65 67 63 51 34 25 27 36 43 49 58 71 84 95 104 112 116 115 106 94 84 82 87 95 100 104 108 114 122 133 144 152 152 148 145
3896 145 143 139 132 126 125 131 143 159 180 203 218 217 198 169 145 135 140 152 161 162 153 137 121 111 110 112 114 119 129 141 142 125 97 67 46 42 58 84 103 101 80 53 30 11
3878 11 -4 -10 1 32 70 101 112 103 86 75 72 70 66 64 68 69 60 47 42 49 57 53 44 45 63 93 123 149 171 187 196 204 213 222 219 201 174 149 134 130 135 149 163 169 161 141 112
3859 112 81 54 41 49 75 106 127 129 114 90 64 43 30 28 37 52 65 73 82 100 132 172 210 240 257 263 260 251 238 225 210 190 163 133 105 83 65 53 49 56
3843 56 72 95 118 136 143 143 145 156 177 199 211 210 196 178 164 158 160 167 172 167 152 134 125 131 151 174 194 209 216 219 224 233 245 253 260 268 279 288 289 286 278 266 250 232 216 201
3825 201 185 167 149 135 128 124 118 112 114 129 151 169 172 157 129 97 70 53 50 59 80 111 143 166 175 172 163 147 126 105 87 73 59 45 34 29 34 49 67 80 80 71
3808 71 57 37 17 4 5 15 26 36 45 53 57 59 64 73 79 79 78 76 69 57 50 56 74 97 117 134 151 174 200 222 233 234 239 254 276 291 289 270 238 203 174 158 147 132
3790 132 109 83 57 34 13 -2 -13 -17 -14 -5 2 1 -11 -32 -49 -54 -46 -29 -12 -5 -6 -5 8 32 54 65 65 62 64 78 101 128 148 153 144 134 132 140 150 151 139 119 98 85
3773 85 78 70 53 30 8 -4 -7 -5 4 24 52 79 93 93 88 89 97 107 116 126 142 161 178 185 180 166 143 117 95 82 81 92 112 140 166 182 181 163 136 111 98 95 96
3755 96 96 100 118 148 179 199 205 200 188 166 140 118 107 107 113 119 122 122 118 112 106 104 104 103 100 96 92 91 96 110 129 147 160 166 164 152 136 127 128 133 128 110 87 63 43 34 40 59 76
3736 76 83 80 75 68 59 55 64 82 95 98 99 106 118 131 141 149 154 158 163 173 185 187 169 134 100 82 79 84 89 93 95 98 103 110 116 116 113 113 120 130 141 154 168 172 166 157 156 160 155 141 127 120 116
3714 116 109 99 88 79 73 73 76 80 87 100 114 116 102 85 78 78 73 56 34 14 0 -7 -7 1 21 48 79 106 122 125 118 104 85 67 58 60 67 73 77 80 78 68 51 31 15 12 24
3695 24 44 56 49 32 19 19 26 33 39 49 63 77 83 86 95 114 137 151 149 135 116 95 76 62 54 50 50 59 80 105 124 136 147 160 169 168 154 135 117 107 104 98 83 61
3678 61 42 38 50 75 101 120 127 130 138 147 146 128 102 84 79 88 105 122 131 124 100 67 36 13 0 -4 -2 3 10 14 14 16 24 37 45 44 43 53 77 110 141 165 178 179 170 154 134
3659 134 110 87 71 65 66 64 52 33 17 16 30 48 63 70 67 55 39 30 32 43 51 53 53 56 66 84 109 133 148 150 140 125 110 99 92 83 66 42 19 5 0 3 11 23
3641 23 34 38 36 32 29 30 36 51 73 95 107 101 75 38 6 -5 2 22 48 72 88 93 93 98 109 124 141 161 180 192 196 197 198 198 193 184 174 167 163 160 157 158 166 180 195 201 194 177
3622 177 158 148 158 190 233 269 285 282 265 239 207 177 156 146 141 133 120 103 87 78 76 78 75 69 73 93 118 134 137 133 132 137 144 155 168 182 193 198 196 187 168 144 126
3605 126 119 121 128 134 146 166 193 220 244 265 277 269 241 207 184 176 176 171 152 120 79 42 23 26 38 41 33 26 29 47 77 114 146 159 142 101 50 5 -25 -39 -43 -42
3588 -42 -37 -27 -10 11 31 48 62 74 83 96 115 138 158 170 175 181 190 199 205 201 186 162 137 122 119 124 130 136 143 149 149 143 140 144 149 143 125 106 95 94 98 103 107 111 110 104 96 93 95 97 94
3567 94 87 80 78 77 76 73 74 81 93 108 128 156 189 215 227 232 240 252 257 244 220 197 185 176 165 151 139 131 124 119 122 134 149 158 157 148 140 133 123 104 77 52 36 30 24 15 4
3548 4 -1 5 26 58 96 136 171 197 213 223 225 213 183 144 109 89 79 71 56 31 0 -27 -40 -31 -7 15 30 41 50 53 50 48 57 76 94 103 106 113 124 132 129 120 116 124 143
3530 143 164 173 164 140 111 91 81 74 62 46 41 58 99 159 222 264 270 242 199 167 155 160 174 190 206 220 230 233 234 239 260 297 340 374 393 396 389 375 358 337
3514 337 309 276 244 218 195 166 129 92 69 67 82 104 123 139 159 189 223 250 266 275 285 292 287 265 233 206 194 193 197 199 197 188 171 154 146 146 151 156 166 178 182 170
3497 170 152 142 144 149 148 138 124 110 100 97 97 93 86 83 85 87 83 78 77 72 60 47 45 61 87 107 115 110 101 99 110 127 140 139 123 92 54 17 -8 -19 -20 -15 -6 1 8 18 38
3479 38 68 98 122 138 151 162 169 168 153 120 73 24 -15 -38 -37 -16 13 39 52 55 48 30 5 -14 -21 -17 -6 5 16 21 21 19 14 7 0 -1 5 12 10 1 -2 5 23 47 71
3461 71 93 104 101 88 70 55 47 47 51 56 61 64 62 53 37 24 21 26 29 18 -1 -9 10 52 93 112 109 97 81 61 39 19 7 2 -1 -7 -16 -24 -32 -37 -35 -22 1 25 38 38 36
3442 36 41 50 50 40 30 29 32 30 20 7 -1 -3 -1 4 18 42 71 92 100 105 116 132 145 144 132 115 96 80 68 60 57 62 74 86 86 70 48 34 32 33 26 15 1 -11 -27
3424 -27 -43 -58 -71 -82 -90 -92 -91 -89 -90 -90 -85 -71 -46 -8 46 112 175 219 240 244 241 238 236 235 233 230 225 221 221 227 233 235 232 230 228 218 199 179 167 162 157 149 145 153 163 163 151 135 123 111
3404 111 96 81 73 78 89 99 102 97 84 66 42 13 -11 -20 -3 32 73 107 127 131 128 128 134 137 131 122 123 136 151 157 149 128 98 66 39 23 15 11 10 19 35 54 67 74 74
3385 74 69 59 46 33 27 34 52 72 88 99 108 112 108 98 88 82 76 66 57 54 55 56 57 60 63 61 63 83 132 200 262 303 321 321 311 300 294 294 293 286 270 248 223 200 187 187 194
3367 194 198 197 195 195 193 181 160 137 120 115 118 121 121 121 127 134 132 115 89 68 62 68 75 77 77 84 103 132 162 188 210 224 226 215 199 190 195 203 203 185 158 135 123 117 113 110 114 122 132
3347 132 143 159 178 192 200 206 212 209 187 146 106 83 84 97 109 117 124 131 134 131 124 125 135 144 138 122 108 99 91 78 65 56 52 46 39 37 43 58 78 102 128 148 158 158 154 152 150 145
3328 145 138 133 132 133 129 122 115 107 96 80 64 56 57 61 60 50 33 11 -11 -29 -38 -35 -22 -7 0 -2 -12 -23 -30 -33 -31 -21 -7 0 -7 -23 -35 -32 -18 -4 0 0 2 16 35 47 46 34
3308 34 20 6 -7 -11 2 31 56 63 56 45 35 26 14 3 -2 0 15 39 59 63 51 31 14 7 12 30 58 88 116 143 166 180 178 164 145 127 107 85 60 33
3292 33 5 -14 -18 0 40 88 133 168 191 207 220 234 245 249 247 243 241 244 247 249 248 249 256 274 300 324 335 333 329 327 316 280 222 161 122 116 133 153 160 149 131 114 99
3275 99 84 68 55 42 18 -18 -61 -93 -107 -103 -85 -53 -15 19 42 47 40 25 12 4 0 -1 9 39 86 127 147 144 133 125 122 119 118 120 124 124 116 105 95 93 98 105 108 107 102 101
3257 101 109 128 151 172 185 188 185 186 196 213 230 243 253 263 270 270 264 258 254 245 225 198 176 170 181 203 230 258 280 289 277 248 213 181 161 157 164 176 183 184 178 163 140
3239 140 112 90 81 85 96 115 142 171 196 209 213 211 204 191 171 153 144 148 158 165 162 154 147 139 122 93 59 29 11 2 0 2 11 28 51 70 79 81 81 87 104 132 164 187 194
3221 194 188 178 169 160 151 147 153 166 181 199 215 222 218 208 194 176 149 120 98 85 76 67 59 57 63 80 102 117 115 98 78 64 59 64 69 61 37 9 -4 2 19 38 56 74
3204 74 89 103 121 143 155 144 114 80 55 46 51 65 77 81 78 80 94 118 148 178 202 211 204 186 165 148 142 152 175 200 215 218 211 203 198 199 203 203 195 188 196 221 250 271
3186 271 284 292 300 310 318 322 317 302 280 253 217 175 134 104 91 90 95 106 124 142 152 147 130 112 99 95 97 99 101 101 101 99 96 91 85 81 85 94 106 114 114 113 116 127 145 163 170 163
3167 163 146 130 122 113 98 76 59 54 63 81 101 119 128 128 120 106 90 76 72 80 92 100 105 114 131 149 162 166 164 161 159 157 153 144 129 111 95 91 107 142 184 216 232 238 241 245
3148 245 247 245 241 234 225 219 221 226 223 204 175 150 135 125 116 108 107 110 111 106 98 93 97 109 126 141 154 163 170 173 169 160 148 134 116 93 74 65 72 93 119 136 138 126 107 84 62 49
3129 49 55 78 103 117 115 107 97 86 77 71 70 72 74 70 59 40 24 24 39 61 82 101 121 134 133 116 90 63 40 25 17 15 13 10 9 14 28 49 74 99 117 125 128 134 147
3111 147 161 165 159 151 150 153 154 152 149 149 152 154 155 155 149 133 112 93 84 83 87 98 114 132 146 149 140 122 100 76 55 39 28 22 21 26 40 60 80 98 114 130 142 150 154 156 154 145
3092 145 128 107 90 79 73 68 60 46 29 15 10 15 29 51 79 108 128 130 115 91 70 58 59 72 94 116 125 117 95 73 57 49 47 51 60 65 58 41 23 14 13 16 24 40
3074 40 64 87 104 115 121 124 127 134 150 166 172 168 163 164 163 150 127 112 118 142 169 186 191 186 173 155 135 120 113 110 108 102 94 85 79 83 100 124 149 169 186 200 207 206 200 190 176
3055 176 156 136 123 114 106 101 111 142 182 214 223 208 180 145 110 81 64 65 81 95 95 82 69 64 61 51 33 13 0 -3 5 27 56 82 96 95 86 79 79 89 101 111
3038 111 112 104 91 81 81 89 95 91 74 46 12 -15 -28 -28 -24 -21 -17 -6 8 23 35 46 58 74 89 100 101 95 89 93 108 128 149 162 160 147 136 143 165 186 192 185 172 159
3020 159 146 133 122 111 99 87 84 92 106 120 129 137 146 156 163 162 152 131 102 65 30 5 -5 -2 9 29 57 88 121 153 185 215 242 262 274 280 284 290 295 290 271
3004 271 244 218 200 191 185 177 165 149 130 110 94 87 93 105 112 114 116 125 137 139 127 109 93 86 89 105 129 151 164 168 167 161 144 118 92 78 77 85 96 107 114 113 108 107 114 131
2986 131 153 176 193 197 187 167 146 129 115 102 94 93 99 109 122 137 155 170 177 180 185 195 207 217 222 223 217 204 191 186 197 218 242 266 285 301 314 326 337 341 332
2969 332 309 270 219 168 132 120 129 142 148 144 134 120 102 86 76 74 78 85 97 112 126 133 133 133 138 150 167 183 192 191 185 178 169 153 131 110 92 74 53 35 25 21 11
2952 11 -8 -32 -48 -48 -35 -20 -9 -3 3 19 44 70 82 78 60 37 20 12 14 24 38 51 58 54 40 18 -7 -29 -42 -40 -28 -14 -6 1 16 41 70 89 95 92 93 104
2935 104 118 125 125 129 142 155 159 154 150 152 155 159 165 175 184 192 204 221 236 241 239 237 235 229 218 207 204 208 218 227 228 218 197 173 150 131 120 118 123 129 140 160 188 209 209 185 147
2916 147 105 69 46 40 47 59 71 83 99 123 154 182 202 212 215 214 208 194 174 151 132 121 123 136 155 172 179 176 168 162 164 172 177 174 157 131 104 90 97 120 143 154
2899 154 149 134 117 102 90 78 67 60 60 65 70 69 66 70 85 109 133 151 162 172 189 214 238 257 269 284 305 328 342 341 321 281 225 165 115 78 47 18 -5
2884 -5 -14 -8 5 20 32 38 37 34 39 52 65 69 64 54 40 18 -11 -44 -70 -88 -98 -99 -89 -71 -50 -30 -12 8 34 64 87 93 83 67 56 55 60 67 78 91 99 94 77
2866 77 57 39 19 -9 -46 -79 -98 -106 -107 -105 -102 -101 -104 -110 -117 -126 -135 -136 -126 -106 -84 -68 -56 -44 -29 -17 -15 -22 -25 -10 24 69 106 129 142 149 148 137 117 95 79 77 93 117
2849 117 136 142 139 132 123 112 99 81 59 42 39 56 79 93 89 75 57 37 16 1 -1 9 20 20 2 -22 -40 -43 -36 -24 -9 19 62 110 144 153 139 116 92 72
2833 72 58 48 46 54 69 85 96 98 89 69 40 4 -28 -47 -46 -30 -7 23 58 90 107 105 94 84 78 71 63 54 47 42 39 44 61 85 108 119 115 98 79 63 49 36 33
2815 33 44 65 82 87 86 94 113 134 146 143 130 116 107 107 111 114 112 107 106 109 112 104 86 66 50 38 29 28 43 70 102 134 163 185 197 197 192 184 172 155 134 116 104 99 102 107
2797 107 109 107 112 129 153 171 178 178 173 168 170 180 190 188 174 157 150 156 173 192 201 194 177 166 173 192 207 209 203 197 202 219 241 254 250 231 206 183 158 131 102 77 56 37
2779 37 19 -1 -28 -61 -92 -110 -107 -84 -52 -22 6 35 66 94 111 115 106 89 71 58 54 61 75 88 94 92 88 88 97 112 126 130 124 117 118 127 140 151 153 141 118 99 96 109
2761 109 127 141 151 161 166 163 154 149 151 155 159 165 175 186 190 182 165 142 118 93 69 48 36 37 46 52 46 30 16 16 30 47 55 50 34 13 -3 -12 -12 -11 -15 -22 -19 0 31 56
2743 56 65 60 56 60 70 73 67 56 49 53 66 86 104 113 110 98 85 77 74 75 81 95 117 140 160 172 178 177 168 152 130 110 98 97 106 124 146 168 184 197 210 222 225 216 202 194
2725 194 193 193 187 181 181 187 191 184 165 141 116 92 70 49 35 28 30 42 62 84 99 107 113 121 130 129 114 93 79 77 80 77 65 51 44 49 60 70 74 73 72 71 68 64 67 79 92 99 100
2705 100 102 108 118 128 138 149 160 166 171 182 201 220 230 229 227 230 238 242 240 234 218 187 141 93 60 47 48 57 73 93 111 115 110 104 107 118 133 142 140 122 97 79 79 95 120
2687 120 147 168 174 165 148 126 97 64 32 10 -2 -11 -12 -3 11 20 19 14 7 -6 -20 -22 -3 25 49 66 78 87 90 91 92 95 96 95 91 83 70 54 40 30 23 20 21 21 19 16 18 29
2667 29 49 81 125 171 206 221 223 221 218 211 197 176 155 142 138 143 150 156 160 159 150 133 111 89 72 60 54 51 47 40 29 21 22 35 55 73 84 94 108 127 139 140 130 113
2650 113 94 81 80 88 93 95 100 115 133 144 143 131 109 83 61 54 64 83 104 117 116 97 71 54 55 74 98 116 122 119 113 110 106 96 82 70 65 68 76 84 89 89 92 102 118
2632 118 134 148 164 183 198 202 193 177 166 161 159 161 173 202 243 284 306 301 274 234 190 152 122 103 91 83 77 74 75 74 68 62 67 89 116 131 130 122 122 127 133 136 138 140 137 131 126
2613 126 132 148 168 185 196 205 214 220 220 216 211 204 191 172 158 158 170 186 199 209 213 206 189 175 170 169 167 165 166 171 173 169 162 156 151 151 154 160 168 177 184 187 187 190 197 203 196 176 154 138 133 142 166
2592 166 196 217 223 219 217 218 221 226 234 239 232 210 180 150 127 117 121 136 155 170 181 187 192 194 194 193 190 187 190 199 210 215 212 206 197 181 153 114 71 32 8 5 18 36 50 56 56 55
2572 55 59 66 72 71 63 57 61 78 102 120 124 118 111 113 124 135 141 139 134 128 124 123 122 116 99 73 49 36 42 65 93 113 118 111 99 88 75 59 40 24 22 36 60 79 86 86 92 104
2553 104 116 123 126 125 118 108 101 100 105 111 116 121 127 133 141 150 158 158 155 158 176 208 239 253 247 230 214 202 194 189 189 197 210 218 217 202 180 156 135 118 106 100 101 104 102 96 91 88 83 78 72 63 43
2532 43 16 -5 -12 -9 -2 5 18 34 52 72 95 117 131 136 140 148 155 159 164 173 181 176 155 127 100 73 41 7 -21 -36 -36 -22 2 34 64 84 93 95 99 111 131 152 164 159
2514 159 140 121 112 120 147 185 218 230 217 192 165 142 124 114 114 120 129 141 155 167 176 184 191 190 176 155 139 129 120 114 119 133 141 131 110 90 78 72 72 74 78 82 85 84 68
2496 68 36 -1 -26 -27 -2 37 77 108 126 134 137 135 129 124 125 129 131 132 137 148 163 178 191 201 203 194 179 167 165 173 186 198 204 203 196 186 174 163 149 130 107 82 59 39
2478 39 16 -9 -34 -46 -40 -21 3 27 50 73 93 104 108 110 115 119 120 120 124 127 120 103 85 74 71 70 64 54 44 37 39 46 55 64 74 89 111 137 165 193 219 238 245 239 227
2460 227 215 210 208 208 212 221 229 226 205 173 144 126 114 99 77 52 30 15 6 2 2 4 6 10 17 24 26 23 18 14 12 19 37 66 96 114 119 115 112 115 123 131 134 135 139 147 151 148 141 140 142 142 142 148
2439 148 164 181 190 190 187 185 185 183 177 165 151 140 135 131 126 119 110 102 97 98 102 103 98 91 90 98 111 125 138 154 175 200 223 233 226 200 166 134 113 104 104 108 117 129 134 122 93 64
2419 64 47 47 56 69 88 115 149 181 203 213 212 200 176 143 114 98 96 101 108 116 119 108 79 39 3 -21 -34 -35 -29 -21 -15 -9 0 9 13 13 13 14 11 6 2 0 -2 -4 -2 5 19 35 47
2400 47 47 38 32 42 63 77 69 46 24 19 33 63 98 126 135 124 102 83 76 77 80 84 87 86 76 50 17 -6 -10 2 20 32 43 65 98 129 138 120 88 67 68 86 106
2382 106 116 115 108 106 112 121 128 129 125 116 101 82 60 38 17 1 -1 8 25 37 40 32 20 14 25 52 83 105 112 107 99 94 94 97 105 115 122 121 111 97 88 83 76 55 21 -14 -36 -34
2363 -34 -17 -1 3 1 0 3 14 35 65 97 120 131 134 131 125 122 123 125 117 98 82 80 93 110 123 130 134 140 150 160 162 155 142 130 116 94 62 30 5 -12 -26 -33 -26 -6 16
2345 16 31 40 53 77 109 136 155 170 184 196 205 212 217 222 224 227 233 239 241 232 211 180 145 120 114 126 147 169 188 200 200 188 168 150 139 142 161 194 228 252 260 255 238
2328 238 204 157 113 88 86 94 100 103 109 119 125 126 123 120 111 96 81 75 81 94 106 116 127 140 159 181 197 201 186 157 122 93 81 88 106 125 141 151 150 136 119 108
2311 108 109 117 131 155 183 203 206 192 170 147 129 122 120 115 101 84 73 70 71 74 79 83 82 79 76 71 61 50 50 68 94 118 135 149 164 175 176 162 139 117 106 106 110 110 109
2293 109 111 113 107 91 74 70 86 115 140 148 140 122 99 72 42 12 -11 -26 -30 -19 1 27 53 79 103 122 137 156 182 209 220 211 192 178 178 185 193 204 219 237
2277 237 246 240 224 209 201 194 182 166 152 143 138 133 127 114 92 67 45 32 22 8 -4 -1 22 60 97 122 133 133 130 131 134 131 120 109 110 123 141 158 171 181 181 170 150
2260 150 130 112 96 82 75 80 91 97 92 78 68 72 83 89 81 67 57 55 63 80 103 126 139 140 134 125 115 106 100 98 100 100 94 85 83 96 124 152 165 162 155 156 165 173 175 173 172 168 156
2240 156 134 108 83 59 37 19 11 13 21 29 37 39 30 9 -11 -18 -14 -7 0 16 43 71 91 100 100 92 79 70 74 93 117 135 147 156 164 167 165 163 163 161 146 113 73 43 38 53 74
2221 74 87 89 84 78 77 77 76 74 75 80 90 103 117 132 145 152 157 162 165 167 174 191 215 237 243 232 209 178 143 107 75 53 43 37 34 41 65 102 132 142 138 129 121 112 104 99 94 84
2202 84 73 75 93 118 136 144 142 125 89 44 7 -7 0 26 63 99 123 130 128 128 137 148 154 148 131 110 93 90 97 111 126 142 163 183 195 196 193 191 189 181 164 145 128 111
2184 111 84 45 7 -11 -6 8 20 26 32 41 44 30 2 -19 -26 -20 -14 -13 -12 -8 -1 5 12 22 32 35 26 12 0 -13 -31 -56 -81 -98 -103 -98 -85 -69 -54 -40 -26 -13 -7 -6 -7
2166 -7 -6 -5 -8 -10 -3 13 35 58 79 98 113 128 144 153 140 105 68 49 53 73 94 108 112 110 111 120 130 134 135 137 143 150 160 172 183 188 187 190 199 205 198 180 155 129 105 88 85
2147 85 92 99 100 97 91 84 71 54 41 40 52 72 90 100 103 104 104 103 101 102 108 118 133 153 171 182 180 171 161 156 156 154 148 137 130 131 143 163 187 209 217 208 189 175 170 169 162 151 138
2127 138 128 125 135 159 187 210 224 233 242 255 271 285 290 279 255 231 214 200 181 157 136 124 120 121 125 127 122 111 93 72 51 35 33 43 56 61 51 30 11 1
2111 1 0 4 12 26 48 73 88 85 67 48 42 52 71 91 105 111 110 102 89 72 54 40 39 53 74 91 98 96 88 73 46 15 -7 -15 -11 -8 -11 -17 -18 -13 -6 1 11 26 44 58
2093 58 63 57 40 12 -15 -28 -25 -13 -6 -5 -3 -4 -11 -22 -29 -25 -15 -3 11 29 43 49 49 51 56 62 67 71 78 87 98 107 112 115 123 135 143 140 129 116 105 94 87 91 100 106 105 109 126 148 159
2072 159 154 148 157 184 220 250 265 259 238 211 185 163 141 120 105 102 115 143 181 221 251 260 243 208 171 144 127 112 97 88 93 114 144 172 187 185 170 149 129
2057 129 115 106 101 97 96 96 100 105 113 120 121 112 97 85 86 100 115 116 97 66 38 25 31 46 62 71 71 66 61 60 61 61 58 57 64 78 94 101 93 69 36 10 5 24 56 85 98 98 92
2037 92 89 96 111 132 150 156 152 147 148 155 155 142 119 97 80 68 58 50 45 44 51 64 78 81 70 49 26 3 -19 -43 -63 -77 -89 -103 -116 -113 -81 -22 46 106 150 180
2020 180 197 205 205 201 191 180 174 174 173 162 143 125 114 110 111 116 119 111 87 55 24 -3 -36 -70 -91 -85 -55 -12 27 57 70 66 52 37 24 8 -11 -29 -32 -16 14 54
2003 54 95 130 154 163 157 139 117 100 93 90 83 72 66 69 77 79 76 74 77 88 110 146 189 225 247 257 266 276 281 278 267 251 231 211 194 177 156 129 101 78 59 40 20
1986 20 3 -7 -11 -12 -11 -10 -8 -6 1 20 48 77 98 108 107 99 81 60 45 42 45 47 48 51 63 83 104 115 116 111 108 109 108 104 103 111 128 142 146 140 129 121 120 132 154 178 193 195 192
1966 192 194 203 208 196 170 145 128 115 99 82 72 77 94 116 135 141 134 124 122 128 130 117 92 65 47 43 53 73 94 109 115 120 125 131 136 142 152 169 186 196 195 181 163
1949 163 150 145 145 142 134 120 106 97 94 95 94 90 86 91 109 134 156 171 179 182 184 188 197 204 197 177 155 142 139 140 144 155 174 187 188 181 174 164 145 116 88 74 76 83 88 86 84 89 106 131
1929 131 153 162 159 151 143 131 112 91 82 91 112 132 142 141 136 129 119 108 96 85 74 63 52 43 45 59 79 95 105 114 126 136 138 132 125 123 128 137 141 134 117 98 91 101 121
1911 121 141 154 160 167 183 205 229 243 242 228 210 198 198 207 217 223 225 224 214 196 178 167 162 152 135 122 120 132 152 174 192 201 194 171 142 121 118 135 160 179 181 165
1894 165 137 105 79 68 75 98 126 147 157 156 154 156 156 145 122 95 74 59 47 38 35 36 38 34 25 12 1 -5 -7 -3 3 14 26 41 63 96 132 161 173 166 143 111 81
1877 81 60 52 53 57 63 69 70 68 66 64 59 49 47 64 99 139 166 170 151 118 86 65 56 52 50 54 66 83 97 107 113 111 100 85 71 62 57 54 56 67 83 93 89 79 74 81 97 112
1858 112 124 135 144 151 158 171 192 212 220 207 176 142 117 105 100 99 101 112 133 163 202 244 277 284 265 233 206 192 188 188 187 187 186 182 175 166 156 147 142 145 152 158 163 166 168 167 158 138
1838 138 112 86 64 51 48 50 52 58 74 101 129 149 159 170 186 201 206 200 186 166 139 108 79 58 49 47 46 42 39 42 55 75 91 99 101 100 98 95 88 77 65 58 61 76 95
1820 95 109 108 93 78 74 82 97 110 111 95 69 47 37 38 42 45 49 52 49 43 41 53 74 98 123 146 163 170 171 172 172 160 131 92 59 43 42 45 48 51 56 61 60 55 51 55 62 66 64 59
1800 59 52 42 31 23 18 11 6 13 38 77 115 135 133 117 105 107 119 125 119 110 108 112 118 123 133 149 165 170 161 142 122 110 106 105 103 96 84 73 70 78 95 118 143 166 177 170 148
1781 148 121 94 69 51 50 74 115 155 185 204 218 227 230 221 199 170 141 119 107 103 107 117 140 176 217 248 257 243 219 198 183 173 171 181 203 226 241 246 241 230
1765 230 211 181 142 102 70 51 40 27 9 -8 -17 -18 -16 -13 -10 1 24 52 74 82 80 78 80 85 90 95 97 94 89 91 100 107 105 102 107 121 131 128 120 117 122 127 125 117 113 120 135 148 150 140
1745 140 123 109 100 95 93 96 104 112 119 128 143 162 172 174 178 193 211 218 208 191 174 160 149 144 147 152 150 139 127 123 132 151 177 199 214 220 216 201 176 149 128 117 112 109 105 99
1727 99 90 82 75 67 56 39 23 12 12 24 46 68 80 79 69 57 49 42 35 29 29 40 60 79 90 94 95 91 83 75 78 95 116 124 112 84 53 27 11 3 3 6 11 17 30 53 86
1708 86 126 162 184 188 176 159 147 142 141 137 130 121 113 109 110 112 109 98 86 79 76 68 52 33 19 12 10 9 10 18 36 58 82 103 119 126 122 105 81 56 35 19 9 6 8 9 8 6
1689 6 5 4 2 3 10 18 20 15 8 1 -4 -9 -9 -8 -9 -19 -32 -41 -39 -29 -17 -7 -2 -4 -12 -19 -21 -16 -11 -6 7 36 71 96 100 89 71 52 37 29 33 46 62 77 88 95 99 101 100 92 80 73 74
1667 74 79 78 72 71 84 105 118 118 109 105 112 124 133 135 131 127 124 125 133 152 180 204 215 209 191 169 146 126 111 106 115 131 150 164 172 171 160 134 96 54 24 16 27 44 57 70
1649 70 91 122 152 174 188 202 217 231 239 243 244 243 240 232 212 178 138 105 88 88 99 115 129 135 135 133 129 118 96 66 36 15 8 14 27 43 61 84 112 141 163 176
1632 176 181 180 172 159 144 132 127 127 128 120 105 87 72 56 42 32 29 24 11 -6 -15 -8 10 27 38 40 36 29 22 17 13 8 4 6 14 19 14 -5 -28 -41 -37 -22 -8 4 18 32 42
1613 42 49 57 68 83 102 128 163 204 241 268 279 273 255 233 216 204 195 184 165 140 116 104 98 86 60 29 8 2 8 19 34 48 53 47 32 11 -12 -33 -43 -38
1597 -38 -20 4 30 48 53 47 42 50 73 102 129 150 166 174 166 139 102 69 46 25 -4 -47 -91 -123 -135 -131 -114 -86 -48 -6 25 34 20 -7 -35 -55 -67 -71 -67 -55
1581 -55 -36 -10 21 51 74 90 104 120 138 152 161 164 164 164 167 167 161 150 142 140 144 148 146 133 111 91 84 91 104 114 121 128 136 143 150 157 161 158 144 120 87 55 29 11 -4 -19
1562 -19 -27 -22 -5 15 33 47 55 57 55 51 47 43 40 41 51 69 90 108 117 115 109 108 113 123 132 140 143 140 132 118 103 89 81 75 64 44 21 11 18 32 37 35 41 64 96 119 125 118 110 110
1542 110 117 131 147 162 176 188 201 211 214 211 206 203 201 199 198 199 198 192 179 161 140 118 103 104 115 121 109 84 56 31 10 -9 -21 -18 -3 13 24 25 22 20 24 34 47 63
1525 63 82 98 111 122 134 146 155 166 183 204 220 221 206 181 155 133 118 115 125 147 172 196 220 243 258 259 255 258 276 303 328 347 363 382 407 447 511 603
1509 603 715 842 987 1163 1380 1643 1944 2273 2600 2871 3018 2993 2803 2509 2180 1865 1580 1331 1115 934 786 675 602 558
1500 558 524 486 436 381 336 315 317 326 326 316 303 290 274 255 242 235 226 207 177 142 108 80 67 70 83 93 96 94 91 83 70 59 58 69 89 115 147 180 205 215
1484 215 214 212 206 192 169 145 132 133 141 150 156 162 172 188 206 216 209 190 170 155 144 135 131 130 129 132 146 171 195 207 214 226 244 254 252 242 231 214 184 144 110 92 86
1466 86 79 63 41 24 17 22 34 45 51 51 51 58 77 108 142 170 185 186 174 153 127 100 76 59 53 60 76 99 123 140 143 127 100 77 69 75 83 81 69 55 46 46 50 49 34
1448 34 7 -16 -20 -3 19 34 41 43 45 48 54 66 79 86 84 78 74 74 80 90 106 125 140 141 124 96 66 35 1 -31 -53 -60 -57 -49 -32 -8 15 27 29 29 33 38 40 40 44 51 54 46
1429 46 28 12 9 23 42 54 63 73 83 85 75 59 43 31 26 34 53 77 98 113 119 113 101 91 92 98 103 103 107 124 150 176 192 193 180 159 140 130 130 135 140 146 157 173
1411 173 190 206 223 244 263 272 268 254 238 223 211 197 178 154 128 105 82 61 49 47 43 27 4 -5 6 28 47 60 72 81 83 80 79 82 90 104 121 132 133 128 123 117
1395 117 107 100 106 131 166 201 226 235 222 191 154 125 109 103 103 104 101 93 85 84 92 106 122 136 145 152 162 182 206 224 223 204 171 132 91 53 29 25 34 45 49 45 40 35 29
1377 29 22 19 26 44 72 102 129 151 168 178 179 175 173 178 183 179 165 147 134 127 126 126 118 98 78 69 73 81 82 73 61 49 41 39 41 41 38 39 44 53 58 60 63 71 81 91 96 97 98 102 104 96 76
1355 76 55 48 60 83 106 117 111 94 78 80 105 145 186 215 229 231 229 225 218 208 193 179 167 161 159 158 156 153 148 138 120 103 96 102 116 127 130 122 100 70 41 25 21 24 31
1337 31 37 43 54 77 112 151 183 205 217 217 203 180 154 125 94 62 38 24 13 5 1 2 3 2 1 5 8 9 12 24 44 68 87 96 94 81 56 21 -16 -49 -65 -62 -44
1320 -44 -16 16 46 63 67 66 74 96 123 143 152 154 156 155 147 138 139 152 165 170 171 174 176 172 167 167 175 182 185 186 184 182 183 193 211 226 231 230 227 223 221 226 238 252 256 246 225 197 173 160 156
1299 156 148 125 91 59 36 25 24 32 44 55 67 86 112 138 153 152 144 137 138 138 129 112 96 87 83 79 74 70 66 62 61 67 79 92 107 123 142 159 175 187 193 193 189 182 175 171 178
1281 178 196 214 218 211 206 208 208 197 179 163 155 153 155 163 179 202 222 229 221 211 209 218 231 238 241 248 258 264 258 237 210 188 177 172 166 162 164 176 192 201 197 183 164 146 130 120 117
1262 117 124 136 147 156 165 177 191 200 204 204 200 189 171 149 129 113 105 108 114 114 102 86 74 66 61 58 62 75 93 109 116 115 110 106 109 122 143 163 174 173 167 163 165 170 173 169 158 146
1242 146 141 145 150 147 131 107 76 41 13 6 17 32 39 39 37 35 32 31 35 39 42 48 59 67 58 37 22 23 31 34 31 30 38 55 78 101 118 124 119 108 92 70 45 28 25 37 57 82
1223 82 109 134 153 167 182 208 243 278 305 323 339 356 371 378 376 367 353 333 310 285 263 245 234 225 213 192 161 123 89 69 69 85 108 133 153 160 147 116
1208 116 80 57 56 73 93 101 93 83 85 100 117 126 125 121 118 124 142 167 182 176 153 128 109 96 90 99 125 159 188 209 224 233 230 214 195 183 179 179 176 172 170 171 167 154 136
1190 136 124 127 141 160 179 195 205 202 190 176 164 158 156 161 171 184 194 196 189 172 148 127 116 110 99 77 53 38 33 29 20 7 0 6 25 48 66 78 89 101 110 112
1173 112 107 103 99 94 85 76 75 81 92 107 125 145 161 170 173 176 184 192 195 191 183 177 171 163 156 153 153 151 145 137 127 116 106 101 103 109 118 130 141 143 132 111 87 64 44 30 24 21 15 7 1 1 3
1152 3 2 -5 -19 -39 -57 -63 -50 -19 18 52 77 94 106 112 112 106 98 89 77 63 54 55 61 63 66 79 104 126 137 142 151 162 166 165 163 167 173 177 175 157 122 83 60 65 93 128 154
1133 154 161 142 104 63 33 15 5 7 25 58 90 109 111 96 67 30 0 -6 7 31 54 73 88 98 101 99 96 98 110 130 153 166 160 136 102 68 47 43 51 60 62
1116 62 64 73 87 94 91 84 81 82 81 80 83 88 87 78 63 51 44 45 54 67 78 85 94 112 136 152 151 138 120 98 66 23 -20 -56 -78 -86 -85 -78 -63 -42 -16 6 23 34 45 58
1098 58 70 77 76 68 52 31 18 21 38 58 70 77 82 88 94 99 99 92 79 63 56 62 80 105 132 153 166 174 178 174 159 135 114 110 122 139 155 166 170 162 140 111 89 79 73
1080 73 64 50 37 28 21 14 7 2 3 14 38 73 114 154 184 200 201 192 180 166 147 123 103 96 95 89 78 74 82 96 107 115 123 134 145 156 165 166 151 123 93 71 56 46
1062 46 43 46 47 42 34 33 42 54 58 54 45 35 25 16 10 7 7 11 21 34 44 47 46 51 65 81 87 80 61 40 22 10 4 5 20 47 81 112 134 143 140 127 108 85 60 38 26
1043 26 25 27 28 29 32 31 23 13 12 28 56 90 122 147 163 177 198 229 258 271 266 247 219 187 157 133 115 98 80 67 60 60 66 81 103 119 116 97 72 54 43 34
1026 34 27 25 28 34 41 47 53 63 82 113 148 173 180 171 158 147 141 138 134 122 101 75 54 40 31 24 24 35 54 73 87 92 90 84 81 83 90 100 112 123 133 138 137 132 124 117 112 105 96 87
1006 87 80 78 80 86 98 112 127 144 167 194 218 231 234 230 221 211 199 184 162 134 113 113 128 144 153 156 159 159 153 144 136 128 116 95 67 35 7 -10 -21 -26 -25 -11 17 49
989 49 70 79 83 90 96 96 90 84 80 74 64 56 55 61 72 82 88 89 86 84 88 97 110 127 148 168 183 193 200 201 189 161 129 104 90 81 72 67 69 77 90 104 116 121 120 119 125 130 130 123 118 114 110
967 110 103 98 99 99 93 82 75 76 83 91 101 109 115 116 117 121 130 143 156 161 157 142 120 94 69 51 46 53 69 86 101 113 120 120 108 86 61 44 41 51 68 81 88 92 93 94 98 108 124
948 124 136 139 136 132 125 111 89 66 47 31 18 10 6 5 3 2 7 23 45 65 75 75 72 67 62 58 62 75 88 92 90 89 97 111 126 143 163 182 196 209 223 234 237 230 217 201
929 201 182 162 146 138 134 131 127 122 116 112 115 121 123 119 113 117 131 149 162 164 150 122 88 57 37 31 38 49 57 60 61 67 74 79 80 82 86 89 87 77 62 42 21 13 23 42 53 49 44 51 71
909 71 98 124 148 165 170 169 168 170 170 166 160 154 145 136 135 140 142 135 122 111 103 95 89 90 94 91 76 57 42 34 28 20 15 17 32 60 89 108 115 116 117 118 116 112 107 96 78 60 50 51 58 67 79
887 79 94 114 138 166 192 212 224 228 221 201 171 143 132 139 159 178 188 185 170 146 122 104 95 89 79 69 70 85 107 123 129 128 128 135 148 160 164 165 175 198 221 224 206
870 206 180 158 142 127 116 111 115 126 144 170 198 220 237 248 251 242 218 181 140 101 71 56 55 60 63 59 51 53 70 101 131 148 150 146 142 136 123 99 65 24 -21 -64
853 -64 -95 -111 -111 -99 -80 -58 -41 -32 -28 -25 -19 -9 4 19 28 24 14 7 9 14 15 7 -3 -10 -7 7 30 57 88 119 139 143 136 135 147 161 164 152 135 120 109 104 107 116 130 149
835 149 176 204 225 238 251 264 269 261 247 236 227 211 187 161 142 137 147 165 178 178 168 158 158 166 172 170 160 151 152 164 177 184 184 180 171 160 152 155 164 170 169 164 154 137 115 96
816 96 80 64 47 37 38 42 39 30 21 16 12 5 -3 -8 -4 6 13 5 -10 -15 2 32 57 71 78 78 66 43 21 8 2 1 5 11 9 -5 -26 -41 -41 -32 -21 -6 18 52 87 114 129
797 129 132 128 117 101 86 79 84 95 101 99 94 90 84 73 65 73 99 127 136 122 100 88 88 91 83 60 28 -6 -39 -66 -79 -72 -47 -13 17 36 46 51 57 61 60 52 46 47 54 57 48 30
778 30 11 -2 -10 -12 -2 25 67 111 148 176 202 224 234 220 181 129 85 61 54 58 67 79 92 103 111 117 124 132 145 161 177 181 168 144 124 121 131 140 139 133 128 122 112 99
761 99 89 84 79 67 53 47 54 70 92 118 141 151 140 109 73 47 34 26 15 -1 -20 -37 -50 -60 -70 -79 -85 -82 -73 -62 -51 -37 -14 14 39 53 54 42 18 -10 -30
744 -30 -34 -29 -29 -35 -40 -32 -8 30 79 127 160 169 156 130 98 61 23 -6 -19 -15 -3 10 27 45 57 58 47 33 23 16 6 -7 -26 -46 -61 -64 -50 -26 -2 13 16 6
727 6 -8 -19 -17 -8 -4 -8 -16 -23 -28 -27 -13 9 29 37 34 26 17 12 15 28 44 50 43 33 29 30 32 32 32 36 42 46 44 41 41 46 51 50 46 44 51 66 90 121 154 179 188 185 173 157 137 114 94 79
706 79 70 69 79 98 126 156 184 205 216 220 221 219 208 188 167 152 148 148 146 140 130 115 98 84 80 83 90 99 117 142 164 169 156 136 123 118 116 112 105 101 107 124 145 156 147 122
687 122 94 71 52 40 36 44 54 54 36 8 -20 -44 -60 -67 -65 -55 -41 -23 5 44 83 106 105 91 74 60 48 40 44 62 84 100 108 110 111 108 97 80 64 54 46 33
670 33 15 2 2 12 19 18 12 7 -1 -17 -36 -51 -59 -66 -74 -83 -90 -92 -88 -78 -68 -59 -45 -18 19 55 79 92 107 131 158 181 192 192 187 184 183 179 167 152 143 140 141 142 145 151 153 150 147 151
650 151 162 169 161 139 114 97 88 81 75 70 71 80 91 101 110 121 130 138 145 154 161 157 138 110 85 69 63 69 84 104 120 127 126 124 123 123 120 115 111 109 108 105 99 90 79 68 57 46 33 20
630 20 7 -6 -17 -21 -14 2 20 34 41 48 56 66 74 78 80 85 92 103 115 126 135 135 124 106 87 71 58 48 36 22 4 -13 -24 -27 -25 -19 -5 17 44 62 67 61 48 30
612 30 13 12 39 88 134 156 152 133 110 89 73 66 70 82 93 95 86 70 53 42 41 48 59 70 73 63 37 4 -24 -44 -58 -67 -66 -49 -21 1 13 22 42 74 103 114
596 114 104 85 67 55 46 41 40 41 41 38 35 38 54 81 113 141 156 158 156 156 161 163 156 137 112 94 91 99 108 112 113 110 98 73 48 38 48 67 78 77 69 64 66 69 69 69 75 90 105
576 105 114 118 123 133 147 163 182 206 230 249 254 246 230 218 217 227 237 238 231 220 213 213 217 220 217 208 198 193 192 192 188 183 178 173 170 169 170 166 153 132 110 93 81 71 64 61 58 49 37 30
556 30 37 51 61 60 52 45 41 46 62 89 118 141 155 159 153 137 119 108 114 134 154 160 150 134 124 126 135 149 168 194 220 241 255 261 259 250 240 236 236 236 232 224 215 208 207 212 218 222 226
536 226 229 230 226 222 227 241 255 266 273 276 269 256 246 239 223 190 147 116 105 105 103 92 72 52 39 37 37 28 7 -20 -44 -61 -71 -77 -77 -69 -50 -21 7 27 34 34 28 15 -7
518 -7 -34 -53 -55 -44 -25 -4 18 44 71 97 122 151 181 206 218 217 204 182 155 129 110 98 88 81 85 100 119 126 116 88 53 25 21 42 71 90 96 96 97 103 113
502 113 127 137 132 113 90 75 65 54 42 40 49 63 76 88 99 105 105 101 98 98 99 103 111 125 140 149 150 142 128 115 105 101 102 105 103 94 81 73 72 73 72 72 76 78 73 66 65 70 74 75 75 75
481 75 68 48 23 3 -6 -12 -16 -12 1 23 48 71 90 103 111 114 107 92 72 61 61 70 78 83 82 74 65 61 67 78 84 85 83 83 84 84 86 91 100 109 118 130 148 166 182 196 214 237 255 255
461 255 240 218 200 188 179 172 172 186 211 234 241 227 201 177 162 156 157 161 157 138 108 84 77 86 101 122 149 181 208 227 239 248 253 251 245 236 220 192 154 116 91 84 91 103
443 103 115 123 125 128 134 141 142 135 124 115 106 97 88 82 84 92 106 121 130 129 121 110 100 88 75 62 51 40 27 17 18 33 51 62 62 52 38 24 14 14 23 37 47 51 52 52 55 61
424 61 73 90 106 113 111 104 94 84 82 98 129 157 162 144 122 107 98 88 80 78 86 97 103 101 91 80 69 64 65 69 72 68 65 70 83 95 96 85 69 52 37 26 25 31 35 35 36 46
404 46 62 76 81 81 78 75 65 48 28 19 27 53 90 128 165 198 222 229 220 202 183 162 141 120 105 100 96 84 62 38 16 -5 -26 -43 -48 -43 -34 -24 -11 2 15 24 29
387 29 30 32 39 46 44 32 19 20 37 58 65 57 49 54 71 89 98 101 103 104 98 89 84 87 95 103 114 131 149 158 153 140 127 119 118 122 128 131 131 127 115 97 79 68 65 68 75 89 107 121 123 118 111
366 111 102 94 89 89 90 89 90 93 98 100 99 98 96 90 78 61 41 22 5 -7 -17 -20 -10 12 39 64 88 113 132 134 115 87 63 48 41 44 57 73 87 95 96 88 76 63 51 37
347 37 18 -4 -22 -33 -39 -41 -42 -40 -34 -21 -4 14 31 44 54 61 65 71 81 96 114 130 143 152 158 162 161 152 138 122 109 96 82 67 53 42 33 28 31 43 62 80 90 92
330 92 95 106 119 122 108 85 66 61 64 67 64 55 42 26 8 -10 -26 -36 -37 -35 -31 -26 -15 2 27 54 80 95 92 69 34 0 -30 -55 -73 -78 -68 -48 -30 -19 -13 -10 -5 -1
312 -1 3 10 24 41 52 49 36 21 10 4 0 3 21 53 87 107 107 89 68 56 60 76 90 96 92 81 69 60 59 65 74 79 79 71 51 16 -23 -54 -71 -76 -70 -51 -20 12 37 51
294 51 55 58 66 81 99 112 118 119 118 110 92 63 33 18 26 55 96 142 188 227 250 249 237 230 238 254 273 286 286 268 239 218 214 213 200 171 136 103 72 46 27 14 0
276 0 -17 -35 -53 -72 -89 -100 -102 -99 -92 -76 -51 -25 -11 -15 -26 -31 -26 -14 -7 -14 -32 -53 -64 -57 -33 1 35 61 74 75 62 34 0 -28 -42 -38 -18 12 51 90 121 138
259 138 139 130 119 111 106 108 117 131 142 146 148 152 154 144 126 108 98 96 100 111 129 148 161 167 165 155 137 117 104 98 94 82 62 42 32 31 28 12 -17 -47 -67 -71 -57 -26 12
241 12 47 69 81 91 99 107 114 122 130 137 137 127 107 82 60 43 31 24 26 43 73 110 149 187 218 238 247 248 241 225 204 188 186 196 205 204 191 174 158 140 114 85 63
224 63 58 67 82 95 100 97 92 91 98 112 128 144 152 145 123 96 75 64 55 41 20 -7 -39 -72 -98 -114 -124 -129 -122 -99 -68 -39 -22 -13 -9 -5 -1 1 3 5 9 20 35 47 53 51 43
205 43 30 19 17 29 46 55 53 45 43 51 62 69 72 76 86 98 100 86 58 25 -5 -30 -49 -61 -65 -60 -38 1 53 98 127 141 147 154 162 171 179 183 175 155 129 110 104 114 134 158
187 158 183 202 211 209 199 191 196 211 227 230 220 203 191 186 186 185 182 178 181 197 223 247 260 259 251 239 221 196 167 146 141 147 155 161 169 182 200 219 233 236 221 192 158 128 104
169 104 87 76 69 65 58 51 51 58 68 74 70 61 52 49 47 40 24 5 -8 -19 -28 -30 -18 5 30 47 57 63 69 76 82 85 82 74 69 67 62 49 30 10 -6 -14 0 38 91 135 160 167 163
149 163 150 129 106 89 86 96 107 106 88 65 55 65 86 103 113 115 114 111 108 108 111 113 110 103 93 86 82 75 57 34 20 23 36 45 46 48 61 87 117 133 128 111 98 99 109
131 109 118 124 132 145 163 181 199 213 223 228 233 243 254 257 244 218 186 159 143 137 129 112 89 68 59 61 70 81 93 105 110 106 94 74 47 12 -17 -33 -31 -17 0 22
114 22 56 96 125 134 124 111 108 113 120 124 128 135 146 155 160 158 148 133 118 116 128 146 157 152 134 114 101 99 107 122 137 150 156 155 144 122 92 61 36 22 17 16 11 0 -12
96 -12 -19 -19 -13 -4 6 22 39 55 70 85 95 91 69 41 20 13 17 29 47 65 74 75 76 87 103 116 120 115 105 90 67 36 -1 -41 -73 -85 -77 -61 -50 -49 -56 -60 -56 -42 -25
78 -25 -10 2 15 24 28 27 24 22 23 29 35 33 18 -5 -24 -28 -12 13 42 70 95 117 136 153 164 170 172 171 167 161 153 142 126 106 89 82 87 98 112 123 129 131 134 142 153 158 150 131
59 131 106 81 56 28 0 -22 -29 -18 0 14 22 29 34 34 28 23 27 31 23 0 -27 -47 -48 -24 20 69 102 111 105 96 90 88 90 96 96 85 64 42 26 16 7 0 -5 0 19 52 90
40 90 117 123 114 99 86 69 42 10 -13 -17 -4 12 29 48 71 95 112 120 124 123 117 105 89 67 35 1 -23 -26 -11 8 19 18 7 -9 -30 -48 -59 -59 -52 -45 -41 -36 -25
22 -25 -6 17 42 64 80 95 112 136 160 174 175 170 166 163 151 127 92 56 33 30 40 48 43 31 27 40 66 99 130 150 155 145 132 125 126 131 137 144 149 146 135 118 102 90
5 90 78 64 47 32 18 -1 -32 -67 -91 -96 -87 -74 -61 -49 -42 -45 -57 -65 -61 -43 -18 11 39 58 58 39 8 -24 -54 -70 -67 -43 -7 29 59 80 95 107 114 113 101 77
-12 77 49 27 18 22 35 49 57 59 61 72 94 118 132 131 115 92 74 67 70 78 86 93 103 112 115 108 92 75 62 53 45 40 40 46 56 72 92 112 126 132 132 127 114 98 90 96 106 102
-31 102 81 52 31 21 23 34 52 70 79 77 65 46 27 21 30 42 43 32 25 28 32 23 -1 -29 -50 -61 -67 -71 -72 -66 -56 -46 -39 -34 -24 -6 18 43 63 74 84 95 107
-49 107 114 111 98 81 63 48 41 42 50 64 83 99 104 93 75 62 57 57 64 79 102 119 116 92 61 37 24 18 13 8 8 17 30 39 37 28 18 12 13 20 33 48 60 67 72 75 79 84
-68 84 82 67 41 16 -1 -15 -29 -41 -46 -42 -30 -14 1 13 21 34 61 99 128 134 115 84 54 34 32 46 71 95 109 109 99 85 74 68 68 73 82 91 90 73 43 10
-85 10 -13 -23 -19 -7 2 6 5 9 23 43 58 62 56 48 46 54 74 97 115 124 125 123 121 121 119 113 104 96 96 106 117 116 95 63 35 20 21 33 50 68 83 94 100 98 87 71 57 49
-104 49 42 37 35 33 28 21 19 32 58 89 117 132 129 107 79 58 47 39 29 24 30 47 67 83 91 92 92 93 89 74 46 18 3 8 25 45 63 77 87 95 104 117 136 152 157
-122 157 149 132 121 123 136 153 168 177 177 172 168 171 181 190 194 194 193 193 190 182 171 161 155 156 162 165 157 134 97 54 15 -11 -23 -21 -9 10 37 66 90 105 112 117 122 127 127 122 119 126 140
-142 140 154 159 156 148 139 125 108 91 80 72 64 57 53 49 43 36 36 47 65 80 85 76 57 37 27 33 51 74 96 116 136 152 159 152 133 105 77 54 35 18 5 3 14 31
-159 31 44 46 45 52 68 85 97 103 106 108 109 113 123 143 166 188 203 212 220 229 239 248 256 264 273 279 276 266 251 233 211 187 165 147 133 119 106 96 89 83 76 71 68 65 60 55 52 54 61
-179 61 73 80 72 45 8 -24 -43 -48 -37 -13 17 47 70 81 77 60 37 20 14 18 23 30 38 48 58 67 73 73 67 58 50 45 46 56 75 93 105 111 122 137 149 150 145 144 147 143 122
-198 122 84 41 8 -6 -2 15 39 62 78 81 73 59 43 28 13 -2 -16 -19 -7 21 55 81 95 99 100 104 111 115 110 94 73 56 49 48 48 48 48 48 49 47 38 19 -8 -32
-216 -32 -38 -27 -8 10 25 33 33 30 29 34 48 67 92 115 131 134 124 101 69 35 8 -7 -13 -9 0 10 20 35 60 92 125 159 197 231 244 226 185 139 98 65
-232 65 39 20 5 -8 -21 -33 -48 -71 -94 -106 -101 -82 -55 -23 14 59 107 152 186 205 211 204 181 143 95 49 16 -1 -8 -13 -19 -19 -8 11 30 48 76 118 162
-247 162 189 195 191 187 179 168 159 159 164 165 158 144 124 102 79 57 42 35 39 48 57 62 65 65 59 46 31 17 3 -12 -28 -45 -63 -80 -91 -89 -74 -51 -24 0 16 28 41 57
-265 57 69 69 56 38 23 16 18 27 36 43 47 48 48 51 61 82 107 129 142 144 134 116 93 67 45 39 59 100 135 142 121 86 53 31 25 39 67 96 109 99 64 16
-282 16 -27 -51 -56 -51 -43 -29 -3 33 75 111 131 133 128 129 139 146 141 126 108 92 83 80 86 95 98 93 83 75 75 84 97 108 113 111 103 91 78 70 67 65 61 59 61 68 78 89 104 123 144
-302 144 165 178 182 175 163 149 133 117 102 92 82 71 59 51 46 39 23 2 -12 -17 -16 -15 -21 -31 -36 -27 -5 20 35 32 13 -8 -25 -30 -23 -4 20 48 74 94 104 101
-318 101 91 86 95 112 127 133 131 122 107 88 69 51 36 23 14 8 3 0 -1 3 12 18 16 5 -9 -22 -35 -47 -56 -58 -52 -46 -49 -61 -75 -80 -74 -56 -27 9 47 85 121 153 183
-336 183 208 231 254 274 287 287 270 234 186 139 103 79 63 50 35 17 6 10 29 54 74 83 80 62 36 13 1 2 10 21 27 27 24 31 53 83 105 118 129 140
-353 140 144 132 107 81 62 49 39 32 31 41 63 92 120 143 158 163 158 152 151 152 148 135 116 100 95 102 120 145 169 183 181 168 155 152 160 173 186 197 209 222 231 235 234
-370 234 227 207 170 123 77 47 36 42 56 70 78 77 68 60 59 67 76 76 63 45 30 23 25 35 49 58 59 56 56 62 75 88 94 84 65 54 64 88 105 103 87 69 57 48 46
-388 46 55 76 103 128 149 168 185 194 191 179 162 143 124 104 87 77 78 87 93 91 83 76 72 70 67 62 60 57 49 39 32 28 27 30 39 54 67 74 80 90 101 102 94 85 85 92 101 105 105 101 92 81
-409 81 66 48 25 4 -9 -13 -11 -10 -10 -7 1 13 20 16 7 1 7 23 36 37 27 17 17 23 26 19 3 -18 -47 -82 -115 -139 -149 -147 -132 -105 -61 -5 48 86 104 111 123 142
-426 142 158 158 146 134 128 123 110 91 73 63 62 72 89 104 104 87 68 64 81 104 113 107 92 75 59 43 32 23 11 -7 -28 -45 -52 -52 -45 -30 -2 38 87 134 174
-443 174 205 232 253 260 252 232 206 176 144 114 92 78 64 50 41 39 37 30 22 26 46 71 88 96 101 109 119 121 116 104 93 85 82 80 73 58 40 25 6 -24 -67 -108 -130
-460 -130 -128 -108 -74 -29 15 45 51 40 23 12 7 5 0 -11 -27 -38 -39 -29 -17 -7 0 -1 -9 -23 -34 -37 -33 -25 -19 -16 -14 -13 -11 -9 -7 -6 -5 -4 -2 3 14 31 48 64 74 81 81 70
-479 70 43 3 -38 -74 -99 -111 -102 -71 -28 12 41 61 78 96 118 138 146 134 107 79 60 52 53 61 78 99 118 133 141 143 141 138 135 129 119 107 100 100 102 101 94 84 74
-497 74 65 58 52 50 53 60 64 63 59 57 59 64 72 82 97 118 139 145 131 104 77 57 40 27 25 38 59 75 86 100 118 130 128 117 103 91 85 92 118 157 196 224 236 234 223
-515 223 209 193 176 162 154 153 157 165 173 178 171 153 135 123 112 91 63 40 25 12 -4 -18 -18 -6 9 22 29 27 16 -1 -18 -30 -39 -41 -36 -25 -14 -10 -8 -3 6 17 22 17
-532 17 7 2 10 23 31 31 28 27 22 7 -17 -43 -62 -67 -57 -32 0 34 71 115 157 184 188 182 177 177 176 173 164 146 114 79 58 64 92 130 164 182 179 163 146 133 120 108
-550 108 103 109 118 118 107 95 90 90 89 78 53 18 -12 -28 -27 -18 -10 -6 -5 -8 -17 -22 -15 4 25 34 29 20 10 -1 -20 -39 -42 -17 27 75 111 130 136 139 143 149 155 163 173 186 195 197 191
-570 191 176 153 123 94 78 77 86 95 100 102 101 103 110 121 131 130 116 90 57 20 -15 -43 -60 -67 -71 -77 -83 -82 -74 -62 -52 -42 -27 0 35 66 84 95 107 124 136 137 131
-587 131 124 114 98 78 64 63 74 91 111 133 148 149 136 121 115 115 110 90 64 44 35 27 12 -1 -2 15 43 68 82 87 88 87 82 69 53 38 27 21 21 30 46 64 81
-604 81 96 111 123 131 133 130 120 107 96 87 75 54 33 19 14 12 9 7 7 2 -8 -18 -16 -7 1 9 24 49 85 126 168 204 222 217 198 180 172 170 167 158 149 146 151 160 165 163 156 151 150
-624 150 151 150 148 145 138 125 105 85 73 71 77 92 112 130 140 142 139 132 122 111 106 111 120 127 131 126 110 86 63 48 42 37 30 21 17 18 23 28 36 47 58 62 57 51 52 60 66 65 60 63 74 88
-645 88 99 108 116 123 129 135 143 158 176 186 183 170 160 154 147 135 123 119 119 104 62 2 -49 -76 -76 -60 -37 -7 29 65 96 120 142 160 167 162 151 131 99 56 17 -3
-662 -3 -1 11 31 54 76 88 88 79 66 54 48 50 54 57 59 60 58 51 41 30 17 1 -11 -14 -9 -5 -11 -22 -29 -24 1 46 96 136 155 153 136 109 84 69 66 69 78 97 122 135
-680 135 122 89 53 25 5 -9 -19 -23 -18 -2 20 37 41 37 37 49 69 88 101 104 103 109 125 145 161 170 173 168 152 127 100 72 44 19 7 12 23 33 43 58 81
-697 81 109 137 160 174 175 167 155 144 134 125 115 101 76 38 -9 -59 -100 -122 -128 -122 -109 -88 -61 -36 -21 -18 -26 -39 -46 -41 -23 -3 8 11 10 6 -1 -12 -21 -21 -9 11 34
-714 34 54 65 66 50 22 -6 -25 -27 -15 4 25 40 41 26 1 -24 -45 -52 -42 -17 9 25 28 24 18 14 9 1 -10 -21 -27 -27 -23 -16 -5 9 21 24 22 21 24 30 38 50 67
-732 67 90 116 143 163 176 188 202 212 211 196 179 163 144 113 66 13 -29 -46 -31 8 55 94 121 141 158 172 181 184 186 193 206 217 219 212 200 189 177 166 158
-748 158 151 142 127 109 96 93 95 91 77 58 46 43 43 43 46 58 76 88 83 62 34 14 14 31 54 69 77 86 99 111 117 119 120 122 122 118 109 92 72 57 56 67 83 97 108
-766 108 115 115 106 88 66 44 27 19 24 40 59 72 74 67 52 36 27 29 42 61 83 109 139 167 185 189 181 169 159 153 145 131 108 87 79 82 87 84 75 63 51 39 29 25
-783 25 22 16 5 -5 -12 -19 -25 -25 -14 5 20 20 9 -1 -10 -21 -41 -64 -82 -85 -74 -54 -28 -2 18 34 50 67 80 84 73 50 18 -14 -41 -54 -54 -41 -19 6 29
-800 29 42 42 31 16 11 23 50 81 106 126 137 135 115 86 57 31 8 -7 -10 -4 0 2 7 17 26 32 40 52 61 59 51 50 62 83 111 139 159 163 152 138 128 121 111 99
-818 99 90 90 98 111 127 145 164 189 217 241 250 242 219 184 142 101 72 59 60 64 64 62 61 66 76 85 88 85 79 75 73 72 72 74 78 85 93 100 100 93 84 80 82 84 80 67 50 26 -1 -29 -44
-838 -44 -40 -22 0 19 38 62 91 119 141 150 142 116 78 31 -17 -61 -91 -102 -101 -98 -95 -86 -63 -31 -5 4 2 0 0 -2 -13 -30 -48 -55 -46 -23 3 26 45 67 91 111
-855 111 120 117 110 106 111 127 156 189 212 218 209 190 164 136 114 107 111 116 117 118 119 118 112 103 95 94 103 117 124 114 92 76 72 76 72 54 28 9 5 20 48 73 86 86 83 81 79 76 74 74
-875 74 75 74 76 81 91 102 112 119 121 119 118 121 132 146 162 175 183 188 186 171 143 112 89 78 75 74 79 89 99 101 97 93 90 89 91 96 98 92 78 64 55 52 49 41 28 14 3 -5 -13 -20 -22
-895 -22 -13 3 23 49 84 119 138 140 140 145 147 128 86 43 19 16 23 30 36 43 52 60 66 73 84 99 111 110 92 64 41 30 27 23 19 19 26 39 54 68 78 82 79 78 86 97 100 91
-915 91 77 64 53 42 37 41 52 57 52 44 39 38 38 37 36 28 11 -11 -32 -41 -38 -29 -21 -17 -21 -29 -36 -39 -32 -15 7 33 59 86 116 141 159 169 173 171 162 148 133 122 111 96 75
-934 75 55 46 53 72 94 110 117 117 114 109 103 97 95 99 111 125 133 130 121 115 116 117 108 86 61 39 23 11 6 11 22 31 31 26 24 32 53 77 96 104 103 94 78 57 37 19 2 -14 -25
-953 -25 -21 -8 -2 -11 -36 -68 -103 -131 -140 -126 -100 -77 -58 -34 -6 12 14 7 4 11 30 59 95 124 134 127 118 118 120 113 92 59 25 -1 -10 -1 17 36 54 75 100 123 140
-971 140 148 150 147 142 137 134 129 118 99 73 46 25 16 21 40 64 86 97 91 72 49 33 25 23 19 6 -18 -48 -73 -84 -83 -81 -83 -88 -85 -69 -44 -27 -27 -37 -44 -44 -43 -47 -51 -52 -53 -58
-990 -58 -65 -69 -71 -73 -75 -75 -79 -91 -108 -118 -113 -95 -72 -48 -23 0 19 28 25 9 -12 -32 -45 -49 -41 -20 7 32 48 55 60 67 79 96 112 122 125 127 130 129 119 102 86 75 68
-1008 68 63 58 54 54 60 70 80 88 94 94 85 70 52 35 14 -7 -26 -34 -32 -19 5 35 59 64 51 29 5 -17 -35 -42 -37 -24 -11 -4 -5 -9 -5 7 23 36 49 70 92 101
-1026 101 93 80 72 68 64 58 53 48 41 32 23 19 22 29 34 34 28 20 9 0 5 31 71 106 117 99 60 14 -23 -44 -51 -54 -54 -49 -38 -26 -14 1 21 39 49 51 51 51 56 72 98 120
-1045 120 128 127 130 140 149 152 150 143 133 127 126 126 118 102 89 85 92 111 136 152 147 126 107 101 108 125 151 184 213 231 237 231 214 191 168 152 139 128 122 127 136 138 129 118 108 102
-1063 102 98 98 100 101 101 100 100 102 107 113 114 106 91 74 54 32 8 -9 -18 -18 -15 -15 -20 -31 -42 -39 -14 30 79 115 126 118 102 87 76 67 61 60 62 60 54 53 62 78 91 98 103 108 108 106
-1083 106 104 107 109 110 113 120 125 118 98 72 49 33 23 19 18 18 20 28 44 67 89 106 116 118 115 111 105 97 86 74 61 43 16 -10 -31 -44 -52 -56 -51 -43 -38 -39 -41 -35 -20 -1 17
-1102 17 33 47 62 80 96 108 118 130 141 142 131 114 99 88 79 71 69 74 86 102 121 137 144 144 140 134 126 122 122 121 110 91 68 47 28 16 16 28 43 52 55 59 69
-1120 69 83 94 93 78 60 53 59 65 61 44 26 13 5 -1 -3 1 12 21 21 12 1 -6 -9 -10 -8 -2 7 17 28 39 46 51 58 75 98 117 125 121 111 98 85 80 85 94 96 86 68 54
-1139 54 49 55 69 91 117 140 153 151 137 114 84 54 34 35 55 77 86 79 66 57 55 59 67 73 72 63 51 42 39 40 37 22 -2 -29 -45 -50 -47 -39 -29 -20 -20 -28 -35 -34 -26 -13 2 21
-1158 21 42 61 79 95 110 125 141 156 163 158 145 128 106 79 51 30 15 1 -15 -33 -47 -53 -53 -46 -30 -11 3 10 13 22 38 60 81 99 109 109 99 81 58
-1174 58 35 14 -2 -13 -23 -27 -21 -1 24 43 50 49 46 42 33 22 13 17 39 78 123 161 182 189 189 189 187 181 168 151 134 120 106 92 80 72 70 72 77 80 75 58 29 -3 -33
-1192 -33 -58 -77 -91 -102 -113 -121 -121 -110 -93 -81 -78 -80 -84 -86 -81 -69 -52 -30 -7 15 32 38 37 38 47 61 70 74 74 76 77 74 60 35 5 -16 -26 -28 -34 -47 -58 -57 -47 -35 -26
-1210 -26 -24 -26 -31 -32 -25 -10 8 28 46 58 54 35 11 -7 -18 -28 -42 -57 -67 -68 -69 -74 -81 -83 -75 -61 -50 -44 -40 -31 -11 15 44 66 78 86 95 103 106 99 88 76 66 64 73 95
-1228 95 122 137 132 108 75 43 16 -3 -17 -26 -29 -22 -4 19 39 51 58 71 91 112 132 153 173 189 191 179 157 131 103 80 66 63 66 67 63 55 38 13 -12 -21 -2
-1245 -2 40 92 137 164 165 143 107 72 49 40 42 49 55 57 56 60 73 91 100 94 75 50 26 6 -6 -7 0 7 11 10 11 18 30 40 40 31 16 3 -4 -2 6 18 29 37 37 28 14 6
-1264 6 15 41 71 91 100 106 108 103 87 66 49 39 36 44 65 96 128 151 165 168 159 138 113 95 89 87 78 59 37 20 4 -13 -31 -39 -30 -4 28 56 72 77 79 85 93 99 101
-1282 101 102 104 103 94 80 62 42 19 0 -5 6 26 45 59 63 56 41 28 27 39 53 60 63 66 75 87 98 109 117 123 123 118 115 119 129 141 152 160 163 161 154 149 149 150 147 140 128 114
-1301 114 96 75 50 25 6 -2 -3 0 4 8 8 1 -8 -11 -7 -1 3 8 18 27 32 35 41 46 41 24 0 -27 -57 -87 -109 -119 -119 -110 -89 -60 -36 -19 -4 13 27 28 17 7 0 -6
-1320 -6 -19 -31 -37 -40 -42 -44 -44 -40 -35 -30 -27 -28 -36 -45 -53 -58 -62 -62 -55 -41 -27 -13 0 14 19 11 -4 -17 -25 -26 -25 -23 -22 -23 -26 -30 -34 -37 -39 -42 -48 -61 -80 -98 -108 -113 -114 -112 -101 -77 -41 -3 25
-1341 25 42 48 52 60 68 67 54 36 27 31 39 43 40 34 26 15 2 -9 -15 -13 -2 19 44 63 72 76 86 99 108 108 100 92 87 86 85 77 61 45 38 42 47 48 50 59 74 87 93 92 82 66 49
-1362 49 40 38 36 29 20 15 12 2 -16 -37 -49 -44 -25 1 32 63 90 107 113 113 109 97 79 56 37 24 15 7 3 8 27 57 92 118 127 119 105 97 105 124 142 147 140 131 128 128 125
-1381 125 119 114 110 99 80 58 40 31 34 47 62 69 62 45 28 15 7 4 9 21 34 44 49 53 56 60 62 68 83 104 123 135 147 163 181 185 174 156 145 141 141 142 141 136 125
-1399 125 109 94 80 65 50 34 16 -5 -26 -41 -49 -53 -54 -49 -32 -8 10 15 4 -11 -21 -22 -16 -5 9 27 41 46 45 48 60 77 95 112 130 144 148 140 125 113
-1415 113 114 128 146 154 147 132 112 90 64 41 29 29 33 38 46 58 74 87 94 94 86 76 68 68 76 93 115 140 162 179 189 196 199 197 188 176 167 165 164 156 136 111 90 81 82 87
-1433 87 91 93 91 85 70 51 34 27 31 40 49 51 47 40 37 39 41 36 28 23 25 32 40 49 62 84 111 128 124 103 83 75 77 80 78 72 61 48 36 27 22 21 33 56 81 93 90 83 75 71 71 80 92
-1454 92 100 105 113 126 135 133 122 107 89 66 44 29 19 10 0 -9 -19 -32 -47 -56 -55 -42 -16 13 39 55 66 73 75 67 56 51 53 57 60 68 82 99 115 127 136 139 136 130 123 116
-1473 116 110 109 115 126 138 148 154 151 137 116 98 86 78 71 61 52 49 50 53 55 60 71 84 90 86 82 85 93 94 82 62 50 51 63 76 77 63 43 28 22 24 25 26 24 20 17 21 41 78
-1493 78 114 130 114 76 30 -6 -24 -23 -15 -11 -13 -12 3 27 47 54 51 47 49 64 93 131 169 204 241 278 298 291 258 215 178 151 130 113 97 82 70 66 67 70 67 57
-1509 57 41 23 5 -7 -14 -16 -18 -25 -37 -47 -48 -41 -32 -27 -17 -2 10 4 -19 -42 -48 -34 -12 11 33 56 75 87 88 78 62 50 50 63 77 86 90 96 106 117 122 119 112 105
-1527 105 104 109 118 126 128 123 117 116 126 147 169 182 178 161 145 140 145 149 147 142 141 144 145 134 111 82 57 40 32 31 36 43 50 53 54 60 78 104 126 131 119 100 85 77 72 70 72 79 87 86 74
-1548 74 58 55 68 91 108 113 113 115 117 111 101 94 91 87 74 56 43 43 51 62 68 65 56 47 44 46 52 59 65 66 65 67 77 95 115 132 139 134 116 88 55 22 -3 -12 -1 23 52 81
-1567 81 104 117 114 95 66 37 11 -8 -21 -21 -1 36 80 117 141 156 167 169 159 145 138 139 135 119 98 87 92 110 133 159 182 195 193 179 161 147 141 142 142 134 120
-1583 120 106 100 96 86 64 36 15 3 2 9 20 30 30 17 1 -7 -7 -6 -5 -2 7 20 29 31 24 16 11 12 12 2 -18 -39 -48 -50 -54 -63 -73 -75 -70 -59 -41 -18 4 17 17 12 9 8
-1603 8 5 0 -2 7 22 32 32 26 22 23 29 39 50 56 61 69 81 88 82 67 52 44 42 44 52 64 77 83 79 69 62 65 76 92 107 117 111 82 41 9 4 24 51 69 75 71 58 41
-1622 41 25 12 1 -6 -8 -3 8 25 48 76 101 115 117 109 98 90 93 109 132 156 175 190 200 202 192 169 141 116 98 85 75 68 66 65 65 70 83 100 111 113 110 104 95
-1639 95 85 80 84 91 96 103 119 143 162 162 141 111 84 70 66 64 58 46 34 24 18 18 29 51 82 116 143 155 151 136 120 107 95 85 78 79 90 109 128 139 139 132 126
-1656 126 125 125 124 119 112 108 109 111 111 106 105 111 121 125 123 116 106 96 94 102 110 105 86 65 52 45 41 41 48 50 42 30 26 31 28 13 -4 -14 -16 -16 -11 2 20 31 33 29 22 7 -15 -33 -34 -15
-1677 -15 15 50 88 126 156 174 180 176 162 143 126 115 104 85 50 5 -41 -81 -107 -115 -103 -73 -34 3 27 37 42 50 59 63 60 52 40 21 -1 -18 -22 -16 -7 5 25
-1694 25 51 75 90 94 93 89 83 74 63 50 36 22 11 7 6 7 10 21 41 66 91 108 117 115 102 79 53 27 6 -4 -3 4 13 20 29 46 68 91 109 123 131 132 126 116
-1711 116 104 90 78 69 60 54 51 55 63 66 63 62 77 110 143 159 155 142 130 120 105 84 63 51 48 55 65 72 70 63 60 66 75 77 73 69 68 69 67 61 49 35 22 20 29 45 60 66
-1731 66 61 42 15 -6 -12 -4 10 18 15 6 2 11 34 63 85 95 99 105 113 117 112 99 82 64 45 24 0 -31 -65 -94 -109 -108 -96 -76 -47 -11 20 36 38 35 38 44 44 33
-1748 33 11 -13 -33 -40 -33 -15 9 35 54 60 53 39 23 5 -13 -31 -44 -51 -57 -59 -54 -43 -35 -38 -49 -59 -61 -59 -60 -68 -76 -75 -61 -42 -23 -10 -2 3 11 25 42 56 61 61 59 58
-1767 58 53 39 17 -4 -20 -27 -31 -34 -36 -33 -32 -37 -51 -65 -66 -52 -29 -8 3 9 12 15 17 12 5 3 11 28 49 68 80 76 57 29 6 -5 -9 -11 -18 -35 -58 -79 -91 -93 -87 -78 -66
-1786 -66 -56 -52 -59 -73 -82 -75 -52 -21 4 19 24 25 22 19 18 21 22 17 4 -12 -28 -40 -41 -28 -2 23 38 41 39 41 52 71 89 94 86 72 60 51 44 41 45 50 49 45 42 45 51 54 51 43
-1806 43 30 17 12 15 24 34 43 52 60 67 73 76 75 71 71 78 89 99 104 106 106 105 106 114 133 162 195 218 224 214 198 187 184 183 182 178 169 152 125 97 80 83 102 129 153 168 172 162
-1825 162 141 114 91 76 68 65 59 50 40 33 26 12 -13 -45 -70 -80 -74 -59 -40 -21 -7 -4 -12 -23 -30 -29 -19 -1 23 49 73 91 103 107 102 91 78 66 57 51 51 60 77
-1842 77 92 101 104 106 109 111 106 94 78 65 57 56 57 57 54 49 42 31 19 8 1 0 5 11 12 5 -1 2 20 40 54 67 89 123 156 174 174 157 130 102 77 60 54 60 75 89 97
-1861 97 99 105 115 129 142 149 146 129 106 93 95 104 107 100 85 65 45 35 39 49 55 55 56 62 74 85 93 97 100 106 112 111 101 89 81 78 73 64 58 58 59 55 45 33 24 19 14 7 -1 -10 -13 -10
-1882 -10 -5 -3 -3 -6 -13 -23 -24 -14 1 12 16 16 16 15 14 16 21 27 33 35 31 23 18 22 34 47 59 69 76 75 63 51 51 67 95 124 144 150 148 142 134 123 111 102 95 82 63 42 27
-1902 27 19 11 2 -11 -28 -41 -39 -16 19 58 97 133 161 174 174 166 155 136 113 93 81 69 51 33 26 33 46 56 59 57 53 48 48 53 59 60 54 45 37 34 33 34 36 36 30 21 15 20 32
-1921 32 45 51 53 55 62 68 70 66 57 48 39 32 25 21 19 19 20 21 23 23 19 17 20 28 32 27 15 3 -8 -21 -33 -39 -38 -34 -32 -31 -30 -30 -33 -36 -32 -23 -16 -22 -36 -48 -49 -40 -29 -19 -8 2 7 0 -15 -28
-1944 -28 -30 -18 2 26 43 50 49 44 40 35 27 12 -3 -16 -19 -14 -2 14 32 50 62 68 70 73 79 83 84 83 83 85 89 96 106 115 117 106 84 56 32 15 9 10 13 20 30 44 57 68
-1963 68 77 86 95 100 96 82 66 55 50 44 31 14 2 -2 -2 -2 -2 2 8 17 29 48 69 85 87 75 56 38 27 25 29 35 40 43 43 38 28 16 11 13 19 22 27 38 53 67 72 70 66 63
-1983 63 59 50 36 21 11 1 -13 -34 -51 -54 -47 -39 -35 -27 -13 2 13 17 20 25 35 50 71 90 104 110 113 116 116 114 106 88 62 36 19 13 10 7 1 -4 -11 -16 -18 -15 -12 -9 -2 10 29
-2003 29 51 73 92 104 111 117 128 141 151 156 159 160 158 151 137 112 79 49 33 36 51 67 77 80 76 69 60 57 60 70 83 98 113 128 140 147 148 144 136 125 112 102 94 88 80
-2021 80 73 66 58 46 34 24 19 17 17 17 15 10 6 10 23 42 64 84 101 118 135 150 160 160 149 128 98 61 24 -1 -10 -3 9 18 22 23 24 23 22 26 35 46 53 52 45 40 41 47 51
-2041 51 45 27 5 -11 -17 -17 -13 -8 1 13 24 30 33 38 50 69 90 104 107 103 102 107 112 110 103 95 92 94 101 110 116 118 116 116 120 121 115 106 101 105 118 133 144 148 147 140 132 123 114 104 94 85 79 71 60
-2063 60 50 45 47 51 56 64 75 86 93 93 91 86 78 66 54 44 34 24 18 24 38 52 59 60 61 67 80 94 106 111 108 98 84 67 50 36 29 23 11 -11 -36 -52 -54 -45 -31 -21
-2081 -21 -20 -28 -35 -35 -31 -29 -32
-2084c2
##END=	
##END=	
