##TITLE=	Oct20-2021.70.fid
TM-VI-106solid Mg+unprotect.-pyrraz. d6-dmso.

##JCAMP-DX=	6.0	$$ MestReNova 14.3.0-30573
##DATA TYPE=	LINK
##BLOCK_ID=	1
##BLOCKS=	2    
##ORIGIN=	Mestrelab Research S.L.
##OWNER=	hrzepa
##$MNOVA/LINK_BLOCK_TYPE=	ITEM	$$ NMR Spectrum
##$MNOVA/ITEM/POLYGON=	(XY..XY)
5321,5835
8722,5835
8722,8208
5321,8208
5321,5835
##$MNOVA/ITEM/Z=	0
##$MNOVA/ITEM/ANGLE=	0
##TITLE=	Oct20-2021.70.fid
##JCAMP-DX=	6.0	$$ MestReNova 14.3.0-30573
##BLOCK_ID=	2
##DATA TYPE=	MNOVA NMR VIEW DATA
##DATA CLASS=	MNOVA VIEW DATA
##$MNOVA/ITEM/ZOOM/X=	-4.005464102252559222,	16.005770000004368114
##$MNOVA/ITEM/ZOOM/Y=	-1109.3966293334960938,	12232.9453125
##END=	
##TITLE=	Oct20-2021.70.fid
##JCAMP-DX=	6.0	$$ MestReNova 14.3.0-30573
##BLOCK_ID=	3
##DATA TYPE=	NMR SPECTRUM
##DATA CLASS=	XYDATA
##NUMDIM=	1
##ORIGIN=	Bruker BioSpin GmbH
##OWNER=	nmr
##.OBSERVE FREQUENCY=	400.4124024600000098
##.OBSERVE NUCLEUS=	^1H
##.SOLVENT NAME=	DMSO_weak
##.PULSE SEQUENCE=	zg30
##LONGDATE=	2021/10/20 15:13:00.000
##.ACQUISITIONMODE=	SIMULTANEOUS (DQD)
##$ORIGINAL FORMAT=	Bruker XWIN-NMR
##$MNOVA/SCALES_VERSION=	9
##$PARAMETER FILE=	(acqus, ASCII, /private/var/folders/f6/rjf_tdyn2v98c5c0wvkgn4s80000gn/T/NSyjNZZSReaa8TTTE++2HQ/70/acqus, 0)
$$ ##TITLE= Parameter file, TOPSPIN		Version 3.2
$$ ##JCAMPDX= 5.0
$$ ##DATATYPE= Parameter Values
$$ ##NPOINTS= 11	$$ modification sequence number
$$ ##ORIGIN= Bruker BioSpin GmbH
$$ ##OWNER= nmr
$$ $$ 2021-10-20 15:13:14.245 +0100  nmr@CZC10666PP
$$ $$ /opt/topspin/data/agmb/nmr/Oct20-2021/70/acqus
$$ $$ process /opt/topspin3.2/prog/mod/shimcntl
$$ ##$ACQT0= -2.36344537815126
$$ ##$AMP= (0..31)
$$ 100 100 100 100 100 100 100 100 100 100 100 100 100 100 100 100 100 100
$$ 100 100 100 100 100 100 100 100 100 100 100 100 100 100
$$ ##$AMPCOIL= (0..19)
$$ 0 0 0 0 0 0 0 0 0 0 0 0 0 0 0 0 0 0 0 0
$$ ##$ANAVPT= -1
$$ ##$AQSEQ= 0
$$ ##$AQ_mod= 3
$$ ##$AUNM= <au_zg>
$$ ##$AUTOPOS= <54 >
$$ ##$BF1= 400.41
$$ ##$BF2= 400.41
$$ ##$BF3= 400.41
$$ ##$BF4= 400.41
$$ ##$BF5= 400.41
$$ ##$BF6= 400.41
$$ ##$BF7= 400.41
$$ ##$BF8= 400.41
$$ ##$BYTORDA= 0
$$ ##$CAGPARS= (0..11)
$$ 0 0 0 0 0 0 0 0 0 0 0 0
$$ ##$CFDGTYP= 0
$$ ##$CFRGTYP= 9
$$ ##$CHEMSTR= <none>
$$ ##$CNST= (0..63)
$$ 1 1 145 1 1 1 1 1 1 1 1 1 1 1 1 1 1 1 1 1 1 1 1 1 1 1 1 1 1 1 1 1 1 1 1
$$ 1 1 1 1 1 1 1 1 1 1 1 1 1 1 1 1 1 1 1 1 1 1 1 1 1 1 1 1 1
$$ ##$CPDPRG= (0..8)
$$ <> <> <> <> <mlev> <mlev> <mlev> <mlev> <mlev>
$$ ##$D= (0..63)
$$ 0 1 0 0 0 0 0 0 0 0.06 0 0 0 0 0 0 0.0002 0 0 0 0 0 0 0 0 0 0 0 0 0 0 0
$$ 0 0 0 0 0 0 0 0 0 0 0 0 0 0 0 0 0 0 0 0 0 0 0 0 0 0 0 0 0 0 0 0
$$ ##$DATE= 1634739193
$$ ##$DE= 6.5
$$ ##$DECBNUC= <off>
$$ ##$DECIM= 2496
$$ ##$DECNUC= <off>
$$ ##$DECSTAT= 4
$$ ##$DIGMOD= 1
$$ ##$DIGTYP= 12
$$ ##$DQDMODE= 0
$$ ##$DR= 22
$$ ##$DS= 2
$$ ##$DSPFIRM= 0
$$ ##$DSPFVS= 20
$$ ##$DTYPA= 0
$$ ##$EXP= <proton>
$$ ##$F1LIST= <111111111111111>
$$ ##$F2LIST= <222222222222222>
$$ ##$F3LIST= <333333333333333>
$$ ##$FCUCHAN= (0..9)
$$ 0 2 0 0 0 0 0 0 0 0
$$ ##$FL1= 90
$$ [...]
$$ 90 74 58 42 26 10 0 0
$$ ##$Sgu3PowerLevels= (0..7)
$$ 0 0 0 0 0 0 0 0
$$ ##$Sgu4PowerLevels= (0..7)
$$ 0 0 0 0 0 0 0 0
$$ ##$Sgu5PowerLevels= (0..7)
$$ 0 0 0 0 0 0 0 0
$$ ##$Sgu6PowerLevels= (0..7)
$$ 0 0 0 0 0 0 0 0
$$ ##$Sgu7PowerLevels= (0..7)
$$ 0 0 0 0 0 0 0 0
$$ ##$Sgu8PowerLevels= (0..7)
$$ 0 0 0 0 0 0 0 0
$$ ##$SguType= 3
$$ ##$ShimPowMaxUA= (0..63)
$$ 130000 130000 130000 130000 130000 130000 130000 130000 130000 130000 130000
$$ 130000 130000 130000 130000 130000 130000 130000 130000 130000 0 0 0 0
$$ 0 0 0 0 0 0 0 0 0 0 0 0 0 0 0 0 0 0 0 0 0 0 0 0 0 0 0 0 0 0 0 0 0 0 0 0
$$ 0 0 0 0
$$ ##$ShimPowMaxUC= (0..63)
$$ 130000 130000 130000 130000 130000 130000 130000 130000 130000 130000 130000
$$ 130000 130000 130000 130000 130000 130000 130000 130000 130000 0 0 0 0
$$ 0 0 0 0 0 0 0 0 0 0 0 0 0 0 0 0 0 0 0 0 0 0 0 0 0 0 0 0 0 0 0 0 0 0 0 0
$$ 0 0 0 0
$$ ##$ShimPowMaxUG= (0..63)
$$ 524287 524287 524287 524287 524287 524287 524287 524287 524287 524287 524287
$$ 524287 524287 524287 524287 524287 524287 524287 524287 524287 0 0 0 0
$$ 0 0 0 0 0 0 0 0 0 0 0 0 0 0 0 0 0 0 0 0 0 0 0 0 0 0 0 0 0 0 0 0 0 0 0 0
$$ 0 0 0 0
$$ ##$ShimPowRcbType= 3
$$ ##$ShimPowRes= (0..63)
$$ 1e-20 1e-20 1e-20 1e-20 1e-20 1e-20 1e-20 1e-20 1e-20 1e-20 1e-20 1e-20
$$ 1e-20 1e-20 1e-20 1e-20 1e-20 1e-20 1e-20 1e-20 0 0 0 0 0 0 0 0 0 0 0 0
$$ 0 0 0 0 0 0 0 0 0 0 0 0 0 0 0 0 0 0 0 0 0 0 0 0 0 0 0 0 0 0 0 0
$$ ##$ShimPowRng0= (0..63)
$$ 1 1 1 1 1 1 1 1 1 1 1 1 1 1 1 1 1 1 1 1 0 0 0 0 0 0 0 0 0 0 0 0 0 0 0 0
$$ 0 0 0 0 0 0 0 0 0 0 0 0 0 0 0 0 0 0 0 0 0 0 0 0 0 0 0 0
$$ ##$ShimPowRng1= (0..63)
$$ 1 1 1 1 1 1 1 1 1 1 1 1 1 1 1 1 1 1 1 1 0 0 0 0 0 0 0 0 0 0 0 0 0 0 0 0
$$ 0 0 0 0 0 0 0 0 0 0 0 0 0 0 0 0 0 0 0 0 0 0 0 0 0 0 0 0
$$ ##$ShimPowRng2= (0..63)
$$ 1 1 1 1 1 1 1 1 1 1 1 1 1 1 1 1 1 1 1 1 0 0 0 0 0 0 0 0 0 0 0 0 0 0 0 0
$$ 0 0 0 0 0 0 0 0 0 0 0 0 0 0 0 0 0 0 0 0 0 0 0 0 0 0 0 0
$$ ##$ShimPowRng3= (0..63)
$$ 1 1 1 1 1 1 1 1 1 1 1 1 1 1 1 1 1 1 1 1 0 0 0 0 0 0 0 0 0 0 0 0 0 0 0 0
$$ 0 0 0 0 0 0 0 0 0 0 0 0 0 0 0 0 0 0 0 0 0 0 0 0 0 0 0 0
$$ ##$ShimSysFunc= (0..63)
$$ 1 2 3 4 5 7 9 11 15 16 8 10 12 14 6 17 13 18 19 20 0 0 0 0 0 0 0 0 0 0
$$ 0 0 0 0 0 0 0 0 0 0 0 0 0 0 0 0 0 0 0 0 0 0 0 0 0 0 0 0 0 0 0 0 0 0
$$ ##$ShimSysMatrix= 0
$$ ##$ShimSysType= 1
$$ ##$TFXNUM= 0
$$ ##$TRIPLO2= 0
$$ ##$VTU= 2
$$ ##$VTUETH= <149.236.99.20>
$$ ##$VTUTY= <no>
$$ ##$WBREFAM= (0..15)
$$ 135 116 100 100 100 100 100 100 100 100 100 100 100 100 100 100
$$ ##$WBREFLM= (0..15)
$$ 0 0 0 0 0 0 0 0 0 0 0 0 0 0 0 0
$$ ##$WBREFPH= (0..15)
$$ 71.66 -68.25 0 0 0 0 0 0 0 0 0 0 0 0 0 0
$$ ##$WBSGU= (0..15)
$$ 0 0 0 0 0 0 0 0 0 0 0 0 0 0 0 0
$$ ##$XFAC= 2
$$ ##END=
$$ 
##$DECIM=	2496
##$DSPFVS=	20
##XUNITS=	HZ
##YUNITS=	ARBITRARY UNITS
##FIRSTX=	6408.8703656999996383
##LASTX=	-1603.8278811825093726
##DELTAX=	-0.12226593800080123864
##XFACTOR=	1
##YFACTOR=	0.013553470931179430192
##FIRSTY=	11.792222976684570313
##MINY=	2.68930816650390625
##MAXY=	11120.859375
##NPOINTS=	65536
##XYDATA=	(X++(Y..Y))
$$ [...]
2786F74J4J7Rj3l5l9k5lK1M1M9M1K6J1nj9k5j7lOQJ1J4J1Lnj7l5m8m1k1kPJ5K2K3J3%qj1k
$$ 674 688 705 714 701 666 627 602 599 620 661 710 751 777 788 783 764 739 722 719 725 733 744 758 769 772 767 750 715 667 626 605 603 610 625 647 670 683 683 675 664 662
2781F62K0M3M1J4mMK0J1k0m3m0k1oOJ3J3NMJ4K5J8jj7j6oOJ3J4J1Ojj5l2m3l7j8LJ3J1Kpo
$$ 662 682 725 766 780 776 780 800 811 791 748 708 687 681 687 700 713 718 722 736 761 779 778 761 745 739 745 758 772 783 789 788 773 741 698 661 643 646 659 670 672 665 659
2776F59%Loj7j7%J8K1J1mqnknj0j5j7j7mJ6L4L7L0K5K6J6ok3k2j0mkkmj9l2k6lJ7J8RJnmK
$$ 659 659 662 656 639 622 622 640 661 672 668 660 655 653 648 638 623 606 589 585 601 635 672 702 727 753 769 763 740 718 708 704 702 700 696 677 645 619 616 633 651 660 661 656 652 654
2771F54J3J3JnKJ4J6J0J0J1jk3l1k1j1j8k9j9J2L7L6J6%MJ5K4K2J2pl1m5m5k6mJ3J9J1j1l4
$$ 654 667 680 681 676 678 692 708 718 728 739 738 715 684 663 652 634 605 586 598 635 671 687 687 691 706 730 752 764 757 726 681 636 610 606 619 638 649 638 604
2766F04l7j3K1L8K8NrmJ2K0J3%j0p%LNOOJkOJ7J9J6J8K9L5K2ol0l6k3nLKJJ1K2J7mj9j2LL
$$ 604 567 554 575 613 641 646 637 633 645 665 678 678 668 661 661 664 669 675 681 682 680 686 703 722 738 756 785 820 842 836 806 770 747 742 745 747 748 759 781 798 794 775 763 766 769
2760G69j9l9m3k9oJ7L0K1mk4k0mJj4j9LL9N6M2K0J1Kk0m0l0PL0J7j4k5qJ4K1K0K0Pk4n5o1
$$ 769 750 711 668 639 633 650 680 701 697 673 653 649 650 636 617 620 659 715 757 777 788 790 770 730 700 707 737 754 740 715 707 721 742 762 782 789 765 710 649
2756F49l5KK5K9K8K2J3%plLJlkKmk1l0k5j5j7k1j6lLKJ1K9L6K6J1QOnj4rLNLJ0K4K7J3lj0
$$ 649 614 616 641 670 698 720 733 733 726 723 726 727 724 722 724 720 699 669 644 629 612 591 575 572 575 577 588 617 653 679 690 698 704 699 685 676 679 684 687 697 721 748 761 758 748
2750G48j5k1k0j2knj4k1j6pMOnk0k3j2%LOJ7K9K7J2LJ0K2J4j1l3l1JL5M8K9jj7rJ4K8K2%k4
$$ 748 733 712 692 680 678 673 659 638 622 615 619 625 620 600 577 565 565 568 574 591 620 647 659 662 672 694 708 697 664 633 634 669 717 746 745 728 719 733 761 783 783 759
2745G59l5l7l7l7k7pQJ3J6K4L2K7J9J8K3J7mk4k2JK5K9Ol2n2m1j6oj3j6jJ9K5J4L%J0L2M9
$$ 759 724 687 650 613 586 579 587 600 616 640 672 699 718 736 759 776 772 748 726 727 752 781 787 755 703 662 646 640 627 611 610 629 654 668 671 671 681 713 762
2740G62M6J9j5l1k8j4jNMJKjj6l5l3j4%oj4nQJj6k1q%%J5M7O7N5K6QJj0k8l7l6l0k4j3MK4
$$ 762 808 827 812 781 753 739 738 743 747 748 750 749 733 698 665 651 651 645 631 626 634 635 619 598 590 590 590 605 652 719 774 800 808 809 799 771 734 698 668 644 631 635 659
2735F59L7L7K2QJ0K7K8Mk3k7j4j0k0k2qKMOJ2J5RNL%plRJ6RKOOj6m2m3j9%%j1j8j9k2k1j3
$$ 659 696 733 755 763 773 800 828 832 809 782 768 758 738 716 708 710 714 720 732 747 756 761 764 764 757 754 763 779 788 790 796 802 786 744 701 682 682 682 671 653 634 612 591 578
2730E78pj1j2JK3L9L9K8J3MRK2L1K7J3JprqpqqjJ1J5OkKJ1Mj4k0rkj0j7mJ7J8pl4m1k7oJ3
$$ 578 571 560 548 549 572 611 650 678 691 695 704 726 757 784 797 798 791 782 774 767 759 751 750 761 776 782 780 782 793 797 783 763 754 752 742 725 721 738 756 749 715 674 647 641 654
2724F54K8M3M7K9nl5m6m2l9l6k6JL2N2N5M2K0JnPK2K5J8Olj4k0j8j2j0qNJ6J4mj9j6oknj1
$$ 654 682 725 772 801 796 761 715 673 634 598 572 573 605 657 712 754 774 775 770 777 799 824 842 848 845 831 811 793 781 771 763 768 784 798 794 775 759 753 751 746 735
2719G35j7k2k0j1%NPJpj0ML0L9K4JpLJ9K7K8J5j2l8m1k5j4j4j9j7j2qJJ4K1J9J2RMnj1j1r
$$ 735 718 696 676 665 665 670 677 678 671 661 665 695 734 758 759 752 755 774 801 829 844 832 794 753 728 714 700 681 664 652 644 645 659 680 699 711 720 724 719 708 697 688
2714F88j0j1lQRoj7mK3L7K0j2k9k3j4j1qMJ8J7J2QMj5m2m8k1J8M0L7K1%k3l8k9LL7M3K0rj7
$$ 688 678 667 664 672 681 675 658 654 677 714 734 722 693 670 656 645 637 641 659 676 688 696 700 685 643 595 574 592 632 669 690 690 667 629 600 603 640 683 703 694 677
2709F77KJ9J3oj7qLQJ1J5J3jj1mJ1J2kj9k4k1j1QL4M9L4ll5l9k3j1j0j2lJ0J1QJ0J5J2lj1
$$ 677 679 698 711 705 688 680 683 691 702 717 730 729 718 714 725 737 735 716 692 671 660 668 702 751 785 782 747 708 685 674 664 652 649 659 670 678 688 703 715 712 701
2704G01%J6K2K0J6Qpj4pNLj0j5qlpj3j1lOJ0Plj0jJ2J7Nj1k2k9l3l2k0JK9N6O2M0RpkMrk6
$$ 701 701 717 739 759 775 783 776 762 755 760 763 753 738 730 727 720 707 696 693 699 709 716 713 703 702 714 731 736 725 703 674 641 609 589 590 619 675 737 777 786 779 777 781 772 746
2698G46k9j2J0K5K7K1J1Knj0mJ3K7K3Nj0j2j3k3l6l6k1nRJ2PKMQlk3k5nJ5J2lnNPKknj4k7
$$ 746 717 705 715 740 767 788 799 801 796 786 782 795 822 845 850 840 828 815 792 756 720 699 694 703 715 722 724 728 736 733 710 685 680 695 707 704 699 704 711 713 711 706 692 665
2693F65k4qKjmMJ4Rnk5l8l4j0K2L3K3J5K3L2J9nj4nMJpkJ0J6PnnPNj4l0k3JK0K9L7M4L6J2
$$ 665 641 633 635 634 630 634 648 657 652 627 589 555 545 567 600 623 638 661 693 712 707 693 688 692 693 686 684 694 710 717 712 707 714 719 705 675 652 653 673 702 739 783 819 831
2688H31j0j3qolKLj1k6k3j2j1j9k1rNJ0J7L0L7K6jl2m4l4j3KNJ1K8M2L3Nj8k5j7mJ2J5lk9
$$ 831 821 808 800 794 791 793 796 785 759 736 724 713 694 673 664 669 679 696 726 763 789 788 756 712 678 665 667 672 683 711 753 786 791 773 748 731 727 739 754 751 722
2683G22k7KK0Jk9k5J3M9N5M2K3Lk1l5l2k1j0JRJ3jj9k9k4j4nJQK3L7M1K9Pppmnj1j0nlpj0
$$ 722 695 697 717 718 689 664 677 726 781 823 846 849 828 793 761 740 730 731 740 753 752 733 704 680 666 661 662 670 693 730 771 800 807 800 793 789 784 773 763 758 755 748 738
2677G38lMNnj2p%lj7k8k1pOJ4K3L4L7K5J0LMLjnnkKjpj0oKRJ4K1K7K0RLQMj6k9j9kql2m1k4
$$ 738 735 739 744 739 727 720 720 717 700 672 651 644 650 664 687 721 758 783 793 796 800 803 802 797 792 790 792 791 784 774 768 770 779 793 814 841 861 870 873 881 885 869 840 821 819 811 779 738 714
2671G14rj9m2m7l0nK0M1N8O2M8K1j5m1m5k1OJ4ORK6L6K4Jj5k2k8k9j7JNj5l6l4j0J4J9J1P
$$ 714 705 686 644 597 567 562 582 623 681 743 791 812 797 756 711 690 696 710 716 725 751 787 811 812 797 775 747 718 701 702 707 692 656 622 612 626 645 656 663
2667F63J3J7J0lj0nJ0K6L5L1J7Joqqj4k2k0jK7M5L0ml0k6pLJllj3l6m8l8j8kPJ9K9K0Jj0m
$$ 663 676 693 703 700 690 685 695 721 756 787 804 805 799 791 783 769 747 727 726 753 798 828 824 794 768 761 764 765 762 759 746 710 662 624 606 604 611 630 659 679 680 670 666
2661F66lj3j5RL9L8Qj6j4oj2k3j3QK0K1K6L8L0Lj9k1j4k1k8j9MK1K9L3K8Rj0j1pj7m0m0j3
$$ 666 663 650 635 644 683 721 729 713 699 693 681 658 645 653 673 694 720 758 788 791 772 751 737 716 688 669 673 694 723 756 784 793 783 772 765 748 708 668 655
2657F55Qkk2k0MK9L6K2ol0k6RL8L8J3j1k5l6l9k6oNRJ9L0K5OkJ2L2K9Jl2n1m0oK8L7J9krp
$$ 655 663 661 639 619 623 652 688 710 704 674 648 657 695 733 746 735 710 674 635 609 603 608 617 636 666 691 697 695 707 739 768 769 737 686 646 640 668 705 724 722 713 706
2652G06rj0nKMPJ3J8J5J0J2Qj2l6m1k7qKJ3K0J7jj3mJ7L2L7L1J6mj4j0lpj6j8j7k0k4j3J0
$$ 706 697 687 682 684 688 695 708 726 741 751 763 771 759 723 682 655 647 649 662 682 699 698 685 681 698 730 767 798 814 810 796 786 783 776 760 742 725 705 681 668 678
2647F78K9L1J9J0LjpqkPJ8J9Qpj2rj0k1k7j4NOj5l3k4KK2K2J0KNJ7J7nl3l8j6Kqk9k7JK8L1
$$ 678 707 738 757 767 770 769 762 754 752 759 777 796 804 797 785 776 766 745 718 704 709 715 700 667 643 645 667 689 699 701 706 723 740 735 702 664 648 650 642 613 586 587 615 646
2641F46K2J9J7Nj2j7qLMKPJ6J9Nj6k8k7k3k9l4k1J2M3N1L4J2oj2mPOj8m1l8pK1K7J9RKnj2
$$ 646 668 687 704 709 697 680 672 675 679 681 688 704 723 728 712 684 657 634 605 571 550 562 605 656 690 702 696 684 680 687 693 675 634 596 589 610 637 656 665 667 662 650
2636F50j4j1j3j7j3%J4K1K0J4NkJJ9M1M4K2j2k6j2RJ2%jJ2J6j1m6n1k6nj0k8l3j8LJ7K2J8
$$ 650 636 625 612 595 582 582 596 617 637 651 656 654 655 674 715 759 781 769 743 731 740 752 752 751 763 779 768 722 671 645 640 630 602 569 551 554 571 593 611
2631F11RLNPNjlKPNnj5j6lJ6K8K3J0Joj4k2j4QK6K7J4kj7j9lK6M2L1Kj7k0k0k0j4rj2j8rJ5
$$ 611 620 623 628 635 640 639 636 638 645 650 645 630 614 611 627 655 678 688 689 683 669 647 633 641 667 694 708 706 689 670 667 693 735 766 768 751 731 711 691 677 668 656 638 629 644
2626F44K9J7j3l1k6nPLrkK8N7N5K5%nkj2k4k0mRJ4J6K0K2J7Oqj6pJ3K2J0j1k4l4m8n1k6J6
$$ 644 673 690 677 646 620 615 622 625 616 614 642 699 754 779 779 774 772 760 736 716 712 721 735 751 771 793 810 816 808 792 785 798 820 830 819 795 761 713 662 636 652
2621F52M3M2L5L4K7Rj1k4l5m0l2pJ0Pl%J1Rlj1JJ8K2J1kn%KkkNJ3J0kj0oKMPJ1J1JolJ0J6
$$ 652 695 737 772 806 833 842 831 807 772 732 700 693 703 710 707 707 718 727 724 713 714 732 754 765 763 758 758 760 758 756 761 774 784 782 772 766 768 772 779 790 801 802 796 793 803 819
2615H19J7J6J6J2QPJj8l9m2k7j2j1j8j8j3lJ0K0K5K3J9Qoj3rOJ5J7J6Pj0l1l3j3J3K3J5N%
$$ 819 836 852 868 880 888 895 896 878 839 797 770 758 747 729 711 698 695 705 725 750 773 792 800 794 781 772 778 793 810 826 833 823 792 759 746 759 782 797 802 802
2610H02joj0j4j6j7j7j3LK7L8K3kj3KJ7J7OKMKopKJ1%k7n4n7l5nJ0J2J2J6J3ok0j9lL%jNJ1
$$ 802 801 795 785 771 755 738 721 708 711 738 776 799 797 784 786 803 820 826 828 832 834 828 821 823 834 834 807 753 696 661 656 666 678 690 706 719 713 693 674 671 674 674 673 678 689
2605F89OjlNJ6J6%k4k8pK4L6K6Rnj4j8j1NJ2PMJ0J5J0Klloj4j9j7qNJ3J0nj9k3j4LJ5J3pl0
$$ 689 695 694 691 696 712 728 728 704 676 669 693 729 755 764 759 745 727 716 721 733 740 744 754 769 779 781 778 775 769 755 736 719 711 716 729 739 734 715 692 678 681 696 709 702 672
2599F72l6k1NK2L2L1K0OLJ0Pj2k8k4j0mmRL0L6J5rj3jOJpj0j2qKJ4J9J3Kllnj6l0l8l4j9m
$$ 672 636 615 620 642 674 705 725 731 734 744 751 739 711 687 677 673 669 678 708 744 759 750 737 736 742 743 736 726 714 706 708 722 741 754 756 753 750 745 729 699 661 627 608 604
2594F04OJ2J4J0LKJ1K3K5K1J3%j5k5k0lJ1J2Jj2j4kRJ0MmpnKJ6K7K3Lj3j0NJ5J2RQNkj4k1
$$ 604 610 622 636 646 649 651 662 685 710 731 744 744 729 704 684 681 692 704 705 693 679 677 686 696 700 696 689 684 686 702 729 752 755 742 732 737 752 764 773 781 786 784 770 749
2588G49j6PL9N9N5L5J6jk0k8j6KMpj9k5l1l0rK5L6J0k3l4l2l3l8k9j2nnPL0M3L1Oj0kK0L6
$$ 749 733 740 779 838 893 928 944 943 923 895 879 881 885 878 859 834 803 773 764 789 825 835 812 778 746 713 675 646 634 629 624 631 661 704 735 741 731 729 749 785
2584G85L1Rqj0j0j8k4k1j4j8k2j2J0K2J3kpjJ3L4M6M0K1QNKqj7j1mlnkNJ0Qmk3k8qK3L7K9
$$ 785 816 825 817 807 797 779 755 734 720 702 680 668 678 700 713 711 704 703 716 750 796 836 857 865 870 872 864 847 836 832 829 824 822 827 837 845 841 818 790 782 805 842 871
2578H71J8J6J5Rjqk8n7p2n4k1kOK0L9M2K5QKkj0j6j4j1j8k8k8k2j4nJ1K9M3M3K5Npj2j5j7
$$ 871 889 905 920 929 928 920 892 835 763 709 688 686 692 712 751 793 818 826 828 826 816 800 786 775 757 729 701 679 665 660 671 700 743 786 811 816 809 797 782 765
2573G65j5nkpoJ0K7K3Krrqj1j1mjlKPll0m3k6kN%LJ4J9J8K0J7Lk0l9m2k9lK6L8K8J5J2Mk3
$$ 765 750 745 743 736 730 740 767 790 792 783 774 766 755 744 740 739 736 738 745 742 712 669 643 641 646 646 649 663 682 700 720 737 740 720 681 639 610 607 633 671 699 714 726 730 707
2568G07n0n0k3jQK0M4O1M9J9j2k7k6j2NK0L2L8K9Oj0qLol1l6j0K2K7J1jjpk4l3k8k0j6j4k
$$ 707 657 607 584 583 591 611 655 716 765 784 772 745 719 707 712 732 764 802 831 837 827 819 822 816 785 749 739 761 788 799 798 797 790 766 733 705 685 669 655 653
2563F53K0L9M0J9pj5JK3K5Qj6l5m4l4oJ9K6J7Npk3l6l5j6jJlkKNJ0J9L1L4K3lk7l3k3oKkp
$$ 653 673 712 752 771 764 749 750 773 798 806 790 755 711 677 671 690 716 733 738 731 708 672 637 621 620 621 618 616 618 623 633 652 683 717 740 737 710 677 654 648 650 648 641
2558F41o%PJ3J2QKKjj0j5mJ4K2J3MNQNNJ2J2ok5k4j3j6l4m0j9J2L1L7L8L3K0OJjnlJ2K4J8
$$ 641 635 635 642 655 667 675 677 679 678 668 653 649 663 685 698 702 707 715 720 725 737 749 743 718 694 681 665 631 591 572 584 615 652 690 723 743 749 750 749 744 741 753 777 795
2552G95jj2jJ4Rj5l6l0rNqk9l4j2J8L3K5OqrNK4L2K1OJ0K7L3J6pj6j2j0j8k4j7JQlk2k4jK6
$$ 795 794 782 781 795 804 789 753 723 714 719 711 682 648 636 654 687 712 718 710 701 706 730 762 783 789 799 826 859 875 868 852 840 830 812 788 771 772 780 777 755 731 730 756
2547G56L3K1J4K2K3Nj9k8k8l1l4j9QK2J1mkJ4J9J0MRJ2kk1k6j2Jjj3j3NK0J6mk1j6QK7K2j
$$ 756 789 810 824 846 869 874 855 827 799 768 734 715 723 745 756 752 750 764 783 793 797 806 818 816 795 769 757 758 757 744 731 736 756 772 768 747 731 739 766 788 787
2542G87k5l7l8l1j6MJ7J0oj0JJ4J5RJlnKJ4K4K8K8K2Pj7k1kJ9J3j0k3j7j1j2nJ2K2Qj2k1j9
$$ 787 762 725 687 656 640 644 661 671 665 655 656 670 685 694 695 692 687 689 703 727 755 783 805 812 795 774 772 791 804 794 771 754 743 731 726 738 760 768 756 735 716
2537G16j4pLJ3J2P%rj6rJ8L7K4j1l1k7j5rjJ4K8K7J5OPJ1J1NjjNNpk5l3k7j3mj%lprnLJ1J6
$$ 716 702 695 698 711 723 730 730 721 705 696 714 751 775 764 733 706 691 682 681 695 723 750 765 771 778 789 800 805 804 803 808 813 806 781 748 721 708 704 703 703 700 693 684 679 682 693 709
2531G09J5J3J2J3J1JojP%k8n6n5k3J7M1L4J4LJ1K3J7lj9j5qj0j7k2j8j0jLjj0oJ1K5J5qk2
$$ 709 724 737 749 762 773 774 768 767 774 774 746 690 635 612 629 670 704 718 721 732 755 772 769 750 735 727 717 700 678 660 650 649 652 651 641 635 646 671 686 678 656
2526F56j5nj%PJ8K6K7J8Kj2j8j3mOJ8K1J6PQJ3J2Lj1j8j4lNNoj4oJ3K3J9J4J7K2K0J4J4J9
$$ 656 641 636 635 635 642 660 686 713 731 733 721 703 690 686 692 710 731 747 754 762 775 787 790 779 761 747 744 749 754 748 734 728 741 764 783 797 814 836 856 870 884 903
2521I03J7Pj1k5l5l9l4k0LK1K3J2RJ9K9J8qk2j9j3j5j8j0KPRJ2J7J7Pmj6k0rOJ1%mRK2J4j6
$$ 903 920 927 916 891 856 817 783 763 766 787 810 822 831 850 879 897 889 867 848 835 820 802 792 794 801 810 822 839 856 863 859 843 823 814 820 831 831 827 836 858 872 856
2516H56m2m7l9l0j9j3j0mJ3L6N3N1L7J8ol0m2l8k7j7j3pml%kj1k9l5k1OK3L0L1K6J8J1J8L1
$$ 856 814 767 728 698 679 666 656 652 665 701 754 805 842 860 854 824 782 744 717 700 687 680 676 673 673 671 660 631 596 575 581 604 634 665 691 709 720 738 769
2511G69L1Pk1l3k5oRJ5J4NkjMLoj4j0OK1K7K8K7K0ml1m1k9k0k9m4l9j2J7L2L3K6J4OLQRNJ
$$ 769 800 807 786 753 728 722 731 746 760 765 763 762 766 769 763 749 739 745 766 793 821 848 868 864 833 792 763 743 714 670 631 619 636 668 701 727 741 747 750 758 767 772 773
2506G73nj3k2k6j7nONlk0l0k3RM0M3J5j7k4qQNj0j7oQMj0j3JJ3J3NKKLNJ7L8M9L8J0j6k7k1
$$ 773 768 755 733 707 690 685 691 696 693 673 643 620 629 669 712 727 710 686 678 686 691 681 664 658 666 670 660 647 648 661 674 679 681 683 686 691 708 746 795 833 843 827 800 779
2501G79qkpj4j7j4j1pkMPONNMnk2l5l0jK8L0J1ojRRQK1L4K5kj8j5oomQJ9J0j4l2l2j3PJ6R
$$ 779 771 769 762 748 731 717 706 699 697 701 708 714 719 724 728 723 701 666 636 635 663 693 704 698 697 706 715 723 744 778 803 801 783 768 762 756 752 760 779 789 775 743 711 698 705 721 730
2495G30oj5j3mPJ8K6K4J1LJ0J9J5Krj0j2j1lJ4K1Rrj7kK1L1J8qk6k3qkmpmmorrj4j4lJ5K0
$$ 730 724 709 696 692 699 717 743 767 778 781 791 810 825 827 818 808 796 785 782 796 817 826 817 800 798 819 850 868 860 834 811 803 801 797 790 786 782 776 767 758 744 730 727 742 762
2489G62Oj0mJ2J9OplJ1J2j0m1o1o1l6KL1L8K5J0MRJ7K2K3K1J3QJ2J7J5QNOkj7k4k2k6l2k0
$$ 762 768 758 754 766 785 791 784 781 792 804 794 753 692 631 595 597 628 666 691 701 705 714 731 753 776 797 810 818 830 847 862 870 875 881 879 862 838 816 790 758 738
2484G38K0N1L6j1m0l3j4%J1K4K4Oj1j4j0j4pJ6L7L2Pj3k2k7k9k0kJ2J8K2K3J5nj9j9oNQ%j5
$$ 738 758 809 845 834 794 761 747 747 758 782 806 812 801 787 777 763 756 772 809 841 848 835 813 786 757 737 735 747 765 787 810 825 820 801 782 776 781 789 789 774
2479G74k4j6mmj1oJ4K8K4J1LJkmjlj4k3j2J2K3J3nj3n%%kJLKmolmj7l1l1j4OJ7J5Prk4k6o
$$ 774 750 734 730 726 715 709 723 751 775 786 789 790 788 784 783 780 766 743 731 743 766 779 774 761 756 756 756 754 755 758 760 756 750 747 743 726 695 664 650 656 673 688 695 686 662 636 630
2474F30K5M4M2K7Oj4l0l5k1JJ6J5ONJ1J3OJMNpj3OM0M9K7KjMkk0k9k7k8l6l4k2nMJ2K3K9K2
$$ 630 655 699 741 768 774 760 730 695 674 675 691 706 712 717 728 741 747 748 752 757 750 737 743 783 832 859 861 860 864 862 842 813 786 758 722 688 666 661 665 677 700 729 751
2468G51Kj4j4MJ9J7%j4j1%L%QK4L5K7Nj7l0k8j4KKj0j5kK0K8K1Lj2k3k8l2k6j2RK3K3K2K8
$$ 751 753 739 725 729 748 765 765 751 740 740 743 743 751 775 810 837 842 825 795 767 753 755 757 747 732 730 750 778 799 802 790 767 739 707 681 669 678 701 724 746 774
2463G74L3K4OJJ6K2Kk9m5m3m7n9o2m2j2J2K6L6M3L8K6J5J0RRQJ1J4J1kj9k5j8rj0j8j4JJ9
$$ 774 807 831 837 838 854 876 878 849 804 761 714 655 593 551 539 551 577 613 656 694 720 735 745 754 763 771 782 796 807 805 786 761 743 734 724 706 692 693 712
2459G12K6K3K0K1K1K1K1K3J4nk5k9k1j5j9k0nJ8K7J6jnoj2j8j3LJ4J2QONMOJ3J0qk8k9j5o
$$ 712 738 761 781 802 823 844 865 888 902 897 872 843 822 807 788 768 763 781 808 824 823 818 812 800 782 769 772 786 798 806 812 817 821 827 840 850 842 814 785 770 764
2454G64j1j5KK4K8Nl0m7l8j8jLPJ3J9J7QNQRjj2j2MK1L1K9K1J4Okj4k6k9j6NJ6J0ok4l4l7
$$ 764 753 738 740 764 792 797 767 720 682 664 663 666 673 686 705 722 730 735 743 752 751 739 727 731 752 783 812 833 847 853 851 837 811 782 766 771 787 797 791 767 733 696
2449F96l3k8k7k9k4rMPNOJ0MmjJ3K3K2J9K4L0L0K8K8K6Rj6l1l2k8j8mJ1J7Mrj4j2j4k0j9j2
$$ 696 663 635 608 579 555 546 550 557 562 568 578 582 578 577 590 613 635 654 678 708 738 766 794 820 829 813 782 750 722 704 700 711 728 732 723 709 697 683 663 644 632
2444F32prj1oOK1L8N3N3L1Mr%J4J6Mpqnk%J0J9J2j0l0l1j5%POJj0k6k8j0J6K5J0j4k5j6QL5
$$ 632 625 616 605 599 605 626 664 717 770 801 805 796 796 810 826 830 823 815 810 808 808 818 837 849 839 809 778 763 763 770 776 777 767 741 713 703 719 744 754 740 715 699 707 742
2438G42M9M3K1OQJ4Oj6l2l6k1KK2J9j0l9l2PL6K1j4l1k0oorJJ5K2J9J1kj6k4j9ojpj1kJ8L8
$$ 742 791 834 855 861 869 883 889 873 841 805 784 786 808 827 817 778 746 753 789 810 796 765 745 739 733 724 725 740 762 781 792 790 774 750 731 725 724 717 706 704 722 760
2433G60M6L8K2J2Pjj3j6pONpj3j5k1l2l3k2j1j3j2MK8M0L6K3Lk3l8k5QK2RqKK9L8J7j3k5j7
$$ 760 806 844 866 878 885 884 871 855 848 854 859 852 839 824 803 771 738 716 705 692 680 684 712 752 788 811 814 791 753 728 736 758 767 759 761 790 828 845 832 807 790
2428G90mlj6k4j0J9K5nm0m6k3mjOL0M5L7K1J3J6J2NMMnk1k6j6JJ0PkrJJ6J6j0l1k1PK3J9K2
$$ 790 786 783 767 743 733 752 777 772 732 686 663 659 658 664 694 739 776 797 810 826 838 843 847 851 846 825 799 783 784 794 801 799 790 791 807 823 813 782 761 768 791 810 832
2423H32L7L9J6j6l1l0k6k0oJ2K4K7K7K0Qkooj1j9k5k9k3qJ0J4%j6j9j6j3j0JJ4J5LrrLJ4J5
$$ 832 869 908 924 908 877 847 821 801 795 807 831 858 885 905 913 911 905 899 888 869 844 815 792 784 794 808 808 792 773 757 744 734 735 749 764 767 758 749 752 766 781
2418G81kk1k4pRJ0OQMj7m1l8j3QOMJ2K6L1K6J7LqpNJ0PJ3L2M7L4Nj9k8l3l2k5j8k1k3rJ4K1
$$ 781 779 758 734 727 736 746 752 760 764 747 706 668 655 663 669 673 685 711 742 768 785 788 780 773 778 788 795 808 840 887 921 926 907 879 846 814 789 771 750 727 718 732 753
2412G53Oj0rKJ0J2Poj3oPOrj2J2L6K7j1m0l6j7lKJ0K1K2J2kj1j1j0rpMJ6J7Jj8k2qL%qq%m
$$ 753 759 749 740 742 752 764 771 765 752 746 753 759 750 738 750 786 813 802 762 726 709 706 708 718 739 761 773 771 760 749 739 730 723 727 743 760 761 743 721 713 716 716 708 700 700 696
2407F96j8j8QM0M7K2qk1j8j1j2j4j3oJNOJ1K2L4L2J4oj3nQJ8K0J3Kpj1j5j6rRJ6Mj8k3j0L
$$ 696 678 660 668 708 755 777 769 748 730 719 707 693 680 674 675 680 686 697 719 753 785 799 793 780 775 783 801 821 834 836 829 818 803 787 778 787 803 807 789 766 756 759
2402G59QJ0J0jj7k1qLlj2mJ3J6NNK2L5K8Mj8k7k4j1NJ1NJJ0K1J9Jj5k3k8l0k7j4LJ0Opj7j5
$$ 759 767 777 787 786 769 748 740 743 740 728 724 737 753 758 763 785 820 848 852 834 807 783 772 777 788 793 794 804 825 844 845 830 807 779 749 722 708 711 721 727 720 703 688
2396F88JK3L5K7Oj5j9qjrk0k1qLNPJ0J1Jrj2j4k4k8j3J5L4L1K3K6L0J8j0l4l1%L3L7J4rj0
$$ 688 689 712 747 774 780 765 746 738 737 728 708 687 679 682 687 694 704 715 716 707 695 681 657 629 616 631 665 696 719 745 775 793 783 749 718 718 751 788 802 793 783
2391G83%lk5l6k1RK7K8J9jk2l3k1jJ3J6J9K6K2Mj9k6j3OJ6J3OQJ6J7Mj0q%nk1k3j1nj3j4L
$$ 783 783 780 755 719 698 707 734 762 781 780 758 725 704 703 716 732 751 777 799 803 784 758 745 751 767 780 786 794 810 827 831 821 813 813 808 787 764 753 748 735 721 724
2386G24K4J9kj6j1nj0k1l1k9j3J7M1L4Pj3j1lnj1jJ7K4J1mp%NJ0J6K0J5Okqj3j5nRJ2%j5j8
$$ 724 748 767 765 749 738 733 723 702 671 642 629 646 687 721 728 715 704 701 696 685 684 701 725 736 732 725 725 730 740 756 776 791 797 795 787 774 759 754 763 775 775 760 742
2381G42r%jJJ3K6K5Pj0rKJ1OloLK1L4L2J8%j0j2j1j8l3m7m9l3qJ0J3OMJ2J7J2PJ1J6Qj5k3
$$ 742 733 733 732 733 746 772 797 804 794 785 787 798 804 801 795 798 819 853 885 903 903 893 881 870 852 819 772 723 690 682 692 705 711 715 727 744 756 763 774 790 798 783 760
2376G60nJ9K4R%QJ8Pj4k7k1lRJ1Kj3k1k3k2j8nJ2K5K5J8J4J6J9J6Npj9k6l5m8n1l0J2L9L5
$$ 760 755 774 798 807 807 815 833 840 826 799 778 775 784 795 797 784 763 740 718 700 695 707 732 757 775 789 805 824 840 845 838 819 793 758 710 659 629 641 680 715
2371G15J7K4N0O4M4J3%krk7l9l4j8mOJ2J4J0OJ%%%KQJ3J0JnKJ1J4Nj0k2l2k8qJ4J9Lj0kJ7
$$ 715 732 756 806 870 914 927 927 925 916 889 850 816 798 794 800 812 826 836 842 843 843 843 843 845 853 866 876 877 872 874 885 899 904 894 872 840 812 804 818 837 840 830 828 845
2366H45K8K5J7Ppk5l8l8l0j0J4K5J4j3k8j4J3K0Mj8j9lJ2Nj3k1qJ5L1K2nk8k6JK4K1%j4j5
$$ 845 873 898 915 922 915 890 852 814 784 774 788 813 827 814 786 772 785 805 809 791 772 769 781 786 773 752 744 759 790 812 807 779 753 754 778 799 799 785 770
2361G70j2j7k1j6j1jJ4L5L9J9qj7oPJ5K1J9Orj1kjqrLJ7J9Rok3l7m0k7jK2L0J4j2k3j0J1J8
$$ 770 758 741 720 704 693 692 706 741 780 799 791 774 768 775 790 811 830 836 827 816 814 813 805 796 799 816 835 844 838 815 778 738 711 710 732 762 776 764 741 731 742 760
2356G60J7J7K2K4K1K6L4K3j0l7l2j1mj9l5l4j3J3K6J5j1k6j5NJ4Qlj5k2j7KK5L2K5J3RNlj4
$$ 760 777 794 816 840 861 887 921 944 934 897 865 854 850 831 796 762 749 762 788 803 792 766 751 756 770 778 775 760 738 721 723 748 780 805 818 827 832 829 815
2351H15j8j7j2j2k0k6k0kJ1Rnj1pLJ4K1K4K8L1K5Kl3m9l0NJ9Mj7k2j2%QJ1J6K8M2M5K8QLQ
$$ 815 797 780 768 756 736 710 690 688 699 708 703 692 685 688 702 723 747 775 806 831 833 800 751 721 726 745 749 732 710 698 698 706 717 733 761 803 848 876 884 887 895
2346H95Lj3j9rJKjKlk0l5l3j8oLJ2J0rk9k6lJ3J0klQK1K6J7jj7j3OJ9J9J5J0kk2l4k3kJ1R
$$ 895 898 885 866 857 858 860 859 861 858 838 803 770 752 746 749 761 771 762 733 707 704 717 727 725 722 730 751 777 794 793 776 763 769 788 807 822 832 830 808 774 751 749 760 769
2340G69KmqrlORJj0j4oMJ0J1PknKJ6K5K3J4QOjj8l3l5j9lpk6m3l9j8NJ6J8J9K1J7Jj9j9NL6
$$ 769 771 767 759 750 747 753 762 763 753 739 733 737 747 758 765 763 758 760 776 801 824 838 846 852 851 833 800 765 746 743 736 710 667 628 610 615 631 649 668 689 706 707 688 669 674 710
2335G10L8Rk2k6pQJ4K1L8M6L0Jj5rPJ6J4Mpj2j5j7j5lJ2J4kj5j1%Krj5j2j0oOK0K0NmJRQj
$$ 710 748 757 735 709 702 710 724 745 783 829 859 860 845 836 843 859 873 877 870 858 843 826 811 808 820 834 832 817 806 806 808 799 784 772 762 756 762 782 802 807 803 804 813 821 820
2329H20oj3k4k8j4JNkljJkJjrj2KK3K5Lj6nK5M6M7L4Pk7n1m6j8NMj3k2j7qKJ0J9K6K6J5mk3
$$ 820 814 801 777 749 735 736 741 739 736 735 736 734 735 734 725 713 715 738 763 766 750 745 770 816 863 897 904 877 826 780 762 767 771 758 736 719 711 713 723 742 768 794 809 805 782
2324G82l6l3j7n%%RK0J7%j6pK0M1M1K2mk6l4k4nJ1J3jj7j7LL3M5L1Mj5j4lQJ6J5Oqk0k6k1
$$ 782 746 713 696 691 691 691 700 720 737 737 721 714 734 775 816 838 834 808 774 750 745 756 769 768 751 734 737 770 815 846 850 835 821 818 826 842 857 863 855 835 809 788
2319G88oJ3K0J1KJ1L0L1Kl4m6l7j7NK8M7M9K9Lk0l6m7m8l7j6LJ4J2J1J6K0J4PQJ7K0J2Ljq
$$ 788 782 795 815 826 828 839 869 900 902 868 822 785 768 773 801 848 897 926 929 909 873 826 778 741 725 728 742 754 765 781 801 815 822 830 847 867 879 882 881 873
2314H73k2l3k7j2mnmJ1L1L9K4mk5k4j1kJPJ4J5Pk%mj8l3k7mJ6J7RKllJ0L0L4J6j3k6k3j3n
$$ 873 851 818 791 779 775 770 766 777 808 847 871 867 842 818 807 805 806 813 827 842 849 847 847 843 825 792 765 761 777 794 803 805 802 799 809 839 873 889 876 850 827 814 809
2309H09k%KOQjj6k3rJ6L5L3J7nk2k6k6l1l9k9J0N3O6M2Qj3k4l1l1j6jLj0k0j9j3mJ1K4K7J6
$$ 809 807 807 809 815 823 822 806 783 774 790 825 858 875 870 848 822 796 765 726 697 707 760 826 868 876 863 839 808 777 761 760 763 753 733 714 701 697 708 732 759 775
2304G75KkOJ3J6J6J1pl0m3k8NL2L4J2j8l5l2j6kLLPROlnNJ3J1Lk%kj2k2k7k7k7k4j5%J9L3
$$ 775 777 775 781 794 810 826 837 830 800 757 729 734 766 800 812 794 759 727 711 709 712 715 722 731 737 734 729 734 747 758 761 759 759 757 745 723 696 669 642 618 603 603 622 655
2298F55M0L5J5rk5k2kJ8K8K1Jj7j8ML2M1L1J4RRml0n8o7m6kM2O0M8J9kj0rnMJ1Pkn%kj2j5
$$ 655 695 730 745 736 711 689 687 705 733 754 755 738 720 724 756 797 828 842 851 860 856 826 768 701 655 653 695 755 803 822 820 810 801 796 800 811 818 816 811 811 809 797 782
2293G82%J4PrrJ1J9Kk0k2pRJ8K4K0Orj5j6j7j9j2pj8k8j6J3K2ll0j9K4N4M8J9oj8k6k9k9k0
$$ 782 782 796 803 794 785 796 815 817 797 775 768 777 795 819 839 845 836 821 805 788 769 757 750 732 704 688 701 723 720 690 671 695 749 797 816 810 792 766 737 708 688
2288F88kK4M1M0L1K9L8M3L4K1Rj0l5n1m2k5j6k2l0l3k2%L1M8M2K8K2K3J4ok2k8k6k5j4OK3
$$ 688 686 710 751 791 822 851 889 932 966 987 996 986 951 900 858 833 817 795 765 732 710 710 741 789 831 859 881 904 918 912 890 862 836 811 797 803 826
2283H26K5J5Kj4l2m1l0pQQQJ3J8Oj1j6oJ0J3Nnj6k7k8j1J5K6J6LlnmNL0M6L7J4%mj6l1k6k
$$ 826 851 866 868 854 822 781 751 744 752 760 768 781 799 805 794 778 772 782 795 800 795 779 752 724 713 728 754 770 773 770 765 761 766 796 842 879 893 893 889 873 842 816 814
2278H14J4Mj5j5kMjrj1r%J5K3J7%j4k1j4NK3K1kj8pJ1J4NMNpk0j1J6K8Pj9k7j8j9k3j8%K1
$$ 814 828 832 817 802 800 804 803 794 783 774 774 789 812 829 829 815 794 780 785 808 829 827 809 802 813 827 832 836 841 834 814 803 819 847 854 835 808 790 771 748 730 730 751
2273G51L2L1J7kj7j0RK5K2Lj0jK3L4J7j5l1k8k5k9k4pQQLPJ5J5J3J6J5%k3l1k1qmlJRJ2RO
$$ 751 783 814 831 829 812 802 811 836 858 861 851 850 873 907 924 909 878 850 825 796 772 765 773 781 784 791 806 821 834 850 865 865 842 811 790 782 778 775 776 785 797 806 812
2268H12Kpj9k5j7JJ6J8RQJ6K1J5RQQlj8k9l3k5lK5L6K4RRJ0pl0l7j8%PJ2K3K8J6lk1l5m8m4
$$ 812 814 807 788 763 746 747 763 781 790 798 814 835 850 859 867 875 872 854 825 792 767 764 789 825 849 858 867 877 870 840 803 785 785 792 804 827 855 871 868 847 812 764 720
2262G20k0RK6K9L0K3Kk0k4oRQJNJ8L0K7J0j0k1j7nKkj0j5j0mmj1j7j5okpj1%K1L4K7J3OJ3
$$ 720 700 709 735 764 794 817 819 799 775 769 778 786 787 792 810 840 867 877 867 846 829 824 826 824 814 799 789 785 781 770 753 738 732 730 723 712 712 733 767 794 807 813 826
2257H26K2J6NkNPJj1j2nOJ5K2J6mk5l2k5j9k0j1J3L4L3J7PQPpl0m8n4m1j4J1K2K0K3L2L0O
$$ 826 848 864 869 867 872 879 880 869 857 852 858 873 895 911 907 882 850 825 806 786 775 788 822 855 872 879 887 894 887 857 809 755 714 700 711 733 753 776 808 838 844
2252H44k3l7l3k2j3jPPmj5j4NK8L9K7Kj2JL0M5L1lk9l3k3r%Jrk6l5k9j1%JJOJj4k3nK8M2K4
$$ 844 821 784 751 729 716 715 722 729 725 710 696 701 729 768 795 797 785 786 816 861 892 889 860 827 804 795 795 796 787 761 726 697 686 686 687 688 694 695 681 658 653 681 723 747
2247G47JpKJ1J7K0J3nj6%K4K5nk8j4J7K2lk9k3JJ8J6J1J4J8J3Kopj0j5j9j6p%MLJjJKjmjJ2
$$ 747 748 741 743 754 771 791 804 799 783 783 807 832 827 799 785 802 824 821 792 769 770 788 804 815 829 847 860 862 856 849 839 824 805 789 782 782 786 789 790 789 790 792 791 787 786 798
2241G98K4K0PjJjj2k2j7JJ5J6Pmj3j5qKJ2J5J8J7J3Nnj2j1nRK5L5M0L5J5j5m6n4l6nJ5J7J0
$$ 798 822 842 849 848 849 848 836 814 797 798 813 829 836 832 819 804 796 798 810 825 843 860 873 878 873 861 850 845 854 879 914 954 989 1004 989 943 889 853 848 863 880 890
2236H90Kmj2j9j6nJ0J3MpjJ7K9J3k0m2m0k1JJ2J5J1MRK7M5M3J9rk2k6l6n0m6j7J6K4QKJ3K7
$$ 890 892 888 876 857 841 836 846 859 863 856 855 872 901 914 894 852 812 791 792 804 819 830 834 843 870 915 958 977 968 946 920 884 834 788 771 787 811 819 821 834 861
2231H61J8lrmmj6j9kJ4J3L%PJ0MmpkJ0J9J3j2l6l4j4jlpKJ1J3J0QLnmMKj7l4k2RL2K6RJJJ
$$ 861 879 876 867 863 859 843 824 822 836 849 852 852 859 869 873 869 862 860 870 889 902 890 854 820 806 805 802 795 797 808 821 831 839 842 837 833 837 839 822 788 766 775 807 833 842 843 844 845
2225H45%j%jnj4j7j3%J5J7J0Jllmpj0j1j0mLNOJ4K3K8J7Kj0j6k1k6k2qJ2K2J7Mnpmlmoqj0
$$ 845 845 844 844 843 838 824 807 794 794 809 826 836 837 834 831 827 820 810 799 789 785 788 793 799 813 836 864 881 883 873 857 836 810 788 780 792 814 831 835 830 823 819 816 812 806 798 788
2219G88rJJ0Oqj4jJ0NnjJ1J4L%J2K2J3j2l1l5l0k1qOK6M4N2L8Rj7k9k8k1qPJ4J3J1J9K4J6
$$ 788 779 780 790 796 788 774 773 783 788 783 782 793 807 810 810 822 844 857 845 814 779 749 728 720 726 752 796 848 886 895 878 849 821 800 792 799 813 826 837 856 880 896
2214H96Lmj%rj4j2rj0j0onrj6j7r%OPPJ3K8L4J9nj2KJ2lk9l4rK1L4K6J0LJ1J8J3mj8k1j8k0
$$ 896 899 895 894 894 885 871 859 850 840 830 824 819 810 794 777 768 768 774 781 788 801 829 863 882 877 865 867 879 876 847 813 804 825 859 885 895 898 909 927 940 936 918 897 879 859
2209H59j5jP%j2pJ5K7J6oj8j5mKjj9l5l6k1mNOKqk1k6j6JJ2J4J7K7L2K3kk0j0K3M2K4j1k4
$$ 859 844 843 850 850 838 831 846 873 889 883 865 850 846 848 847 828 793 757 736 732 737 743 745 737 716 690 674 675 687 701 718 745 777 800 798 778 768 791 833 857 846 822
2204H22oJ4J2lo%%qj5j7j5rJ0K6K0lj6j1jlrnQJ6J6J0Jmrj1j7k0j6%J3J1NJ1K7K9J1rj5j1
$$ 822 816 830 842 839 833 833 833 825 810 793 778 769 779 805 825 822 806 795 794 791 782 777 785 801 817 827 828 824 815 804 787 767 751 751 764 775 780 791 818 847 858 849 834 823
2198H23j7k8k6oJ3J9Qlj2j2lJ4K5K1Mpj1j3j5qOJ2jj7j0K6O0O3L5mk8k9j7j1j0qLJ3J5QOQ
$$ 823 806 778 752 746 759 778 786 783 771 759 756 770 795 816 820 813 802 789 774 766 772 784 783 766 756 782 842 905 940 936 908 879 862 851 841 833 836 849 864 872 878 886
2193H86MlmPJ5J0j3l4m1k7oOPOJ6K6J7mk1k3k6l6m4l0%K3L4L1J5j0k7j6J6L8L1J5ORQKJPJ8
$$ 886 890 887 883 890 905 915 902 868 827 800 794 800 807 813 829 855 872 868 847 824 798 762 718 688 688 711 745 776 791 781 754 738 754 792 823 838 844 853 861 863 864 871 889
2188H89K6K8K6J3pk3k8k1j2mMJ3J1j0l5l9j5J7K9K3J4Qnk3l0j8MJ3J0L%KPQkk5m0k9nJ1Q%
$$ 889 915 943 969 982 975 952 924 903 891 887 891 904 915 905 870 831 816 833 862 885 899 907 902 879 849 831 835 848 858 861 861 863 870 878 876 851 811 782 777 788 796 796
2183G96oj2j9j6LJ9J9J0J9L7L8J8oj1j0k4n0o6n4k1J5L9M5L6J7kpOK7L2J3k0m0m0k9j6jJ1
$$ 796 790 778 759 743 746 765 784 794 813 850 888 906 900 889 879 855 805 739 685 664 679 718 763 799 816 814 807 813 840 872 885 865 825 785 756 740 739 750
2178G50J0%MK2L4J9JKJ4Rrj2QJ3j3m5m6j7J3L1L1J6j3l4l0j3nqmJ5L4L9L0J7Nmnmrj4pOOr
$$ 750 760 760 764 786 820 839 840 842 856 865 856 844 852 865 852 807 761 744 757 788 819 835 822 788 758 745 740 732 728 743 777 816 846 863 868 864 859 855 846 832 825 831 837 828
2173H28k1j8j5j9k0LL0L7K0jnJJ0K0K8K5J1JMJ4Rj0k4k0kJ1Prj9j5l%j0k1j5KJ6J6J0P%rj4
$$ 828 807 789 774 755 735 738 768 805 825 824 819 820 830 850 878 903 914 915 919 933 942 932 908 888 886 897 904 895 876 861 858 858 848 827 812 814 830 846 856 863 863 854 840
2167H40oJj3l8n1l3JK6L5L7L6K8J8Plj6k2k1j3LK0L5L8K5Qjpj2mJ5K3Mk6l4k3j4k1k6k0j9
$$ 840 834 835 822 784 733 700 701 727 762 799 835 863 881 888 885 869 847 826 813 816 836 871 909 934 942 941 934 922 918 933 956 960 934 900 877 863 842 816 796 777
2162G77k6k2KK8L4K7J8Nj2j6JK5L4L0K7K4Qj1j7j4j3k1k2k2l0m0l1OM1M3J6j3k5pK2M1K3j9
$$ 777 751 729 731 759 793 820 838 843 831 815 816 841 875 905 932 956 964 953 936 922 909 888 866 844 814 774 743 749 790 833 849 836 811 804 826 867 890 871
2158H71n0n2l6j6RM0N4L2nk1qOkk2k8j4NJ5J9K1J7%j9k8j5QK5L0K4J6Rjoj0j9l2l8k2MJ0j4
$$ 871 821 769 733 717 726 766 820 852 847 826 818 824 822 800 772 758 763 778 797 818 835 835 816 788 773 781 806 836 860 876 885 884 878 868 849 817 779 757 761 771 757
2153G57m4m0nK4J8j0k7k0lJ2K8L8L1Oj1lJ6K6J9J4J4J1mk6l4k5nJ0J4N%RK3K6J2qk0k0k2k5
$$ 757 713 673 668 692 710 700 673 653 650 662 690 728 759 765 754 751 767 793 812 826 840 851 847 821 787 762 757 767 781 786 786 795 818 844 856 848 828 808 786 761
2148G61k5oK4M6M4K0qk5k4pJ1J7Lj4j5%Pok0j7pmjJ3K7K2lj9j6oJORLj1j2jJ0J3J8L2L5J6
$$ 761 736 730 754 800 844 864 856 831 807 800 811 828 831 817 802 802 809 803 783 766 759 755 754 767 794 816 813 794 778 772 773 779 788 791 780 768 767 777 790 808 840 875 891
2143H91j0k0j5j0nRK2K0PKNMoj0m%%LQOqj4lJ3J8Oqj7j6nMJj2k9l8l9k7JL1M2K5MJJ0J9K5
$$ 891 881 861 846 836 831 840 862 882 889 891 896 900 894 884 880 880 880 883 891 897 889 875 872 885 903 909 901 884 868 863 867 868 856 827 789 750 723 724 755 797 822 826 827 837 856 881
2137H81K7J6rl5m0k3lRJ2J1OOJ2J7Oj7k6j1J0J1rk9k8j0PJ3J0MkmMJ9K9K2Nj1j8k1j9j1MJ4
$$ 881 908 924 915 880 840 817 814 823 835 846 852 858 870 887 893 876 850 839 849 860 851 822 794 784 791 804 814 818 816 812 816 835 864 886 891 880 862 841 822 811 815 829
2132H29R%mllnmKjrj6k0k5k9j7J7N4O2L7Jj5j0mj3k4j9NK5K2Lj4j5rnj0j9k5j7KK5L8L6L0
$$ 829 838 838 834 831 828 823 819 821 820 811 795 775 750 721 704 721 775 837 874 875 860 850 846 833 809 790 795 820 842 845 831 816 807 802 792 773 748 731 733 758 796 832 862
2127H62L0K9J8ok8m3m2l1pJ8L3K7J0j0k0k5k2pK0N0O6N7L0mk3k3j3qrqnqj4j0%Jj6l6m0k9
$$ 862 892 921 939 933 905 862 820 789 782 800 833 860 870 860 840 815 793 786 806 856 922 979 1009 1005 982 959 946 938 929 921 916 908 894 884 884 885 869 833 793 764
2122G64j8j0%J0J2Njk%KJ5L4M4K8Jj4j4nNJ1J4J0lj7k5k2qKoj6oK5M4L3Mj4j8k1j3J4L9K6
$$ 764 746 736 736 746 758 763 762 760 760 762 777 811 855 883 884 870 856 851 856 867 881 891 888 871 846 824 816 818 812 796 790 815 859 892 896 882 864 843 830 844 883 909
2117I09k1n1l5LK0J6J6K5J8pk7j7RK1J5QJ3J7Rqj7j8j7k0k0j8k1k6j7J0L3L3J6QJ3Qpk0k2
$$ 909 888 837 802 805 825 841 857 882 900 893 866 849 858 879 894 902 915 932 941 933 916 898 881 861 841 823 802 776 759 769 802 835 851 859 872 880 873 853 831
2112H31j9k1j6kQN%J1L0L5J8jrkJ0J6Rmq%Mj0l1l6j7PJ7J2OJ0K3L2K6Oj9k6j4%Mnk1l0k5r
$$ 831 812 791 775 773 781 786 786 797 827 862 880 879 870 868 878 894 903 899 891 891 895 885 854 818 801 808 825 837 843 853 876 908 934 940 921 895 881 881 885 880 859 829 804 795
2106G95ORJ%J0J9J9J1jj3k0j3OK8L5K5Pnj0j1j3j4j0kJlprrpkJ1J9J1j0j9mK1L0J6oj6j3m
$$ 795 801 810 811 811 821 840 859 870 869 856 836 823 829 857 892 917 924 919 909 898 885 871 861 859 860 857 850 841 832 825 823 834 853 864 854 835 831 852 882 898 892 876 863 859
2101H59%jjJKKLOLj8m2m8k5LRkj2pmj0j4pNJ1J7L0L9L1Mj8j6lNLjJNPNok5l5k4NK6K4Oj1j8
$$ 859 859 858 857 858 860 862 865 871 874 856 814 766 741 744 753 751 739 732 728 718 704 697 702 713 730 760 799 830 834 816 800 797 802 805 804 805 810 817 822 816 791 756 732 737 763 787 793 782 764
2095G64j6jK3M1L2Nj7j7m%lpnrj9l0k8j1NJ5J2Mpj4rRK9L6K1mk7m1m4l0mK2L1K9K7K7J5qj9
$$ 764 748 747 770 811 843 848 831 814 810 810 807 800 795 786 767 737 709 698 703 718 730 734 727 713 704 713 742 778 799 795 768 727 683 653 649 671 702 731 758 785 800 792 773
2090G73j0NPmqJJ9K8K1MlJ2L7M5K7Mmmj6m2o5o7m6rK5L3J1j6j8KJ6J2jqpm%QK1L7N0N0K9K
$$ 773 763 768 775 771 763 764 783 811 832 836 833 845 882 927 954 958 954 950 934 892 827 760 714 705 730 763 774 758 740 742 758 770 769 761 754 750 750 758 779 816 866 916 945 947
2084I47j0pjqk0k6k0j0KOKmkOPmj1pmpkJ9L5K8Mj1qkop%RJ3J0LjLJ1J3Jj6j5kMkj0rj0j9k5
$$ 947 937 930 929 921 901 875 855 845 847 853 855 851 849 855 862 858 847 840 836 829 827 846 881 909 913 902 894 892 886 879 879 888 901 911 914 913 916 927 940 941 925 910 908 912 910 900 891 881 862 837
2078H37k0q%jnj6k5j7J7N1M9J5k4l9l7k8j4OK9M2L8K4J1QPKnqllj0j0J0L3L3Oj7j7prj8j7
$$ 837 817 809 809 808 803 787 762 745 762 813 862 877 853 814 777 749 735 741 770 812 850 874 885 893 900 902 897 889 886 883 873 863 873 906 939 945 928 911 904 895 877 860
2073H60lJ1K4L7M5L9J9kj3k2k4k0j0qj6k5k5j4jOOJlkJkopmj1k4l1j9KJ8K3K0J1jnPK6L1J7
$$ 860 857 868 892 929 974 1013 1032 1030 1017 995 971 951 941 933 917 892 867 853 852 858 864 865 862 860 861 859 853 846 842 831 807 776 757 759 777 800 820 831 830 825 832 858 889 906
2068I06pk7l5k9qJ0J3MNK1L2K5Qmj1k3k8j4J6L0J6j3k7k1qjlpj2j2j0lKPNjmJJ0J1MJJ2K4
$$ 906 899 872 837 808 800 810 823 827 832 853 885 910 918 914 903 880 852 838 854 884 900 887 860 839 831 830 827 820 808 796 786 783 785 792 797 796 792 793 803 814 818 819 831 855
2062H55K4J2%j0j9j9rLMlJJ4K1J0kjNKj0j8k1k3j9oQMj6k5qK4M4M1K1LlLJ5K1K1K3K5K3J3
$$ 855 879 891 891 881 862 843 834 837 841 838 839 853 874 884 882 881 886 888 878 860 839 816 797 791 799 803 787 762 754 778 822 863 884 887 884 887 902 923 944 967 992 1015 1028
2057A028NKmj8l3m1m1m0l9k6%K4L0K6K2J9J4MknnkQK3K6Mk8m6m1k6j4lMNK%J1K6L3K0j2n0
$$ 1028 1033 1035 1031 1013 980 939 898 858 819 793 793 817 847 873 895 914 928 932 930 925 920 918 926 949 975 979 951 905 864 838 824 821 825 830 832 832 843 869 902 922 910 860
2052H60p2n8j9J4K0J1PJ7J7Kj7k0j0JJ0J7J6MnOK4L1J6jjJ1K5L2L2K0pl7m8l2jK3K3J2Jqj7
$$ 860 788 730 711 725 745 756 763 780 797 799 782 762 752 753 763 780 796 800 795 801 825 856 872 871 870 881 906 938 970 990 983 946 898 866 865 888 911 923 924 916 899
2047H99k5k3j2%NMjooRK8L0J0j2rJ1K0J2JMROnj7k3k2qJ0J2jj5j2OJ7J5lk0k8k2j3nPK3L0
$$ 899 874 851 839 839 844 848 847 841 835 844 872 902 912 900 891 902 922 934 935 939 948 954 949 932 909 887 879 889 901 900 885 873 879 896 911 908 888 860 838 825 820 827 850 880
2042H80J6j2k3j6oj2k1j8pJKRK0K9L5L7K4nk9k3k%j6k4j3mj4k7k4j0nrrjJ1K3K8J7qk7k1M
$$ 880 896 884 861 845 839 827 806 788 781 782 784 793 813 842 877 914 938 933 904 881 879 879 863 839 826 822 808 781 757 747 742 733 724 723 734 757 785 802 794 767 746 750
2037G50J7QjMK0K5J9J5J3Q%kPJ5J4N%PJ3Nj5l3l5k0%J1J0%ppllkOJ6J1j2l0l0j8j6k6l4k4
$$ 750 767 775 774 778 798 823 842 857 870 878 878 876 883 898 912 917 917 924 937 942 927 894 859 839 839 850 860 860 853 846 843 840 838 844 860 871 859 829 799 781 765 739 705 681
2031F81KK4L1K1PKPJ2RQJ6L1M3M7M0J6k1n0m8k1KNoj4j4j3pOJ9K3Rj1k5k8k3k1k3j8mJ1J2
$$ 681 683 707 738 759 766 768 775 787 796 804 820 851 894 941 981 997 976 926 878 857 859 864 858 844 830 817 810 816 835 858 867 856 831 803 780 759 736 718 714 725 737
2026G37jj1rkMJ6L7M9L1lk8k9j6jJ7L0K8Rj2k2k4k5j7%K1L0K8K4J7Jj9l0k7j1MJ1RNJ3K9L6
$$ 737 736 725 716 714 718 734 771 820 851 848 820 791 775 774 791 821 849 858 846 824 800 775 758 758 779 809 837 861 878 879 860 830 803 792 796 807 816 821 834 863 899
2021H99K2%j2j8k6l3k3LK2J7MLJ2J3NkkMJ3K0J9J0JKPLqj5j6k0k7l0k3j2jJ2K1J7RPJ7J9N
$$ 899 921 921 909 891 865 832 809 812 834 851 855 858 870 883 888 886 884 888 901 921 940 950 951 953 960 963 955 940 924 904 877 847 824 812 811 823 844 861 870 877 894 913 918
2016I18j1j8j9k0k2k1j7j1JJ4J9PlmKMQJ5J7P%J1L1L1Qj7k8k8k9j7PK7K5kl2m8m3j8J0J9J4
$$ 918 907 889 870 850 828 807 790 779 780 794 813 820 817 813 815 819 827 842 859 866 866 877 908 939 947 930 902 874 845 828 835 862 887 885 853 805 762 744 754 773 787
2011G87J6L3M3K0k2m5l3pNJmm%NJ3J5J5J4J6J8J3Ojpj0pmpk2l6l5j7NK4L2K6Ok0l8l7j9MK4
$$ 787 803 836 879 899 877 832 799 792 797 798 794 790 790 795 808 823 838 852 868 886 899 905 904 897 887 880 876 869 847 811 776 759 764 788 820 846 852 832 794 757 738 742 766
2006G66L1J9lj4lJ8K3Rqj4j3j1nJ1K6K9J3koLJ2J5J3J4J9J6ll3n2m4j5J4K6K2J1mj3j0kJn
$$ 766 797 816 813 799 796 814 837 846 838 824 811 800 795 806 832 861 874 872 866 869 881 896 909 923 942 958 955 922 870 826 811 825 851 873 884 880 867 857 855 856 851
2001H51j4j6j9l0l7k8KK8L0Pj6k3j6pkMJ3K3K6K6K2J0mj4j5j0oJJ1J1ql6m7k9mLJNK4M1M4
$$ 851 837 821 802 772 735 707 709 737 767 774 758 735 719 712 710 714 727 750 776 802 824 834 830 816 801 791 785 786 797 808 800 764 717 688 684 687 688 693 717 758 802
1996H02L9L6L0J2j9l9l6j9rj2j6j1KJ5K2J9J0jkPJ7K0J9K1J3j3l2k4PK2Qj4j8pKRJ8K9L3L0
$$ 802 841 877 907 919 900 861 825 806 797 785 769 758 760 775 797 816 826 825 823 830 847 867 886 907 920 907 875 851 858 880 888 874 856 849 851 860 878 907 940 970
1991I70K9K5J1qk2k9l0j8kJj3j9kJ6J2j2k9l0k7k1jK1K5Prj0qj8k9k8k5k2j0J2K8K8K3K3J8
$$ 970 999 1024 1035 1027 1005 976 946 928 926 927 914 895 893 909 921 909 880 850 823 802 801 822 847 854 845 835 827 809 780 752 727 705 695 707 735 763 786 809 827
1986H27QPK5L7J9j9m1l3pJ6K7L0K4J9J1nk1j7MJ8Mj4j2oj4k6j3J6K0j1m2m7k6KK5L1J5qj0
$$ 827 835 842 867 904 923 904 863 830 823 839 866 896 920 939 950 945 924 907 911 929 933 919 907 901 887 861 848 864 884 873 831 784 758 760 785 816 831 823 813
1981H13J5L0J6j1k1rOJ6J7J1LLOJrj0mj0l9n7l9LL0K8J2kj0mJ3K5J4j1k5j7JJ4J8J3L%J2K3
$$ 813 828 858 874 863 842 833 839 855 872 883 886 889 895 896 887 877 873 863 824 767 728 731 761 789 801 799 789 785 798 823 837 826 801 784 785 799 817 830 833 833 845 868
1976H68J4lmJ3K1Ronlj2k6j8PK8L3K7J7Nj1k9m0m4l8k9k6k7j7OL2M1L5K3J2JmlQJ7J8Rrk6
$$ 868 882 879 875 888 909 918 912 907 904 892 866 848 855 883 916 943 960 965 954 925 885 841 803 774 748 721 704 710 742 783 818 841 853 854 850 847 855 872 890 899 890 864
1971H64l6l1k1rJJ1K1K2K0J8J8J4OkokNRMpj5j7j5j1LK2L0Rk6n1m4j8QK0J5Mnnnrj6j2NK4
$$ 864 828 797 776 767 768 779 800 822 842 860 878 892 898 896 890 888 893 902 906 899 884 867 852 841 844 866 896 905 879 828 784 766 774 794 809 813 808 803 798 789 773 761 766 790
1965G90L0K5J8K0K3J8RQJ8K7J8kj7k2k4k7k3j0nj1j6j3pj0qPK7K7Pj3j8j1jK%mlOJ1Jj5j8
$$ 790 820 845 863 883 906 924 933 941 959 986 1004 1002 985 963 939 912 889 879 874 863 847 834 827 817 809 816 843 870 877 864 846 835 834 836 836 832 829 835 846 847 832 814
1960H14oMMNRJj9k9j3J4K2Ok0m2n1m2j8KNLJ1K5L4L1K9L2L2K4J8J4QJ%NMnj2mJ0J9J0rl0l8
$$ 814 808 812 816 821 830 831 812 783 770 784 806 812 792 750 699 657 639 641 646 649 660 685 719 750 779 811 843 867 885 899 907 908 908 913 917 912 900 896 906 925 935 926 896 858
1955H58l3k4j6jL3O6O2J4m0n4k7J0K8K0Npj2j5j4qLJ1Oj0k7l1j4J4L8M5L0Nj7k8l3l2k7k0
$$ 858 825 801 785 784 817 883 945 959 919 865 838 848 876 896 901 894 882 867 853 845 848 859 865 855 828 797 783 797 835 880 910 915 898 870 837 805 778 758
1950G58j0%J1J3QNJ2K5K3Oj5k7l4l6k8j0LNLK%%QK7L7K1mj4nNJ3K9M7M6J5k1l9l2j2OJ4J7
$$ 758 748 748 759 772 780 785 797 822 845 851 836 809 775 739 711 701 704 709 712 714 714 714 722 749 786 807 803 789 784 789 802 831 878 924 939 918 879 847 835 841 855 872
1945H72J7K5K8K1%j5k0k3k4j5PJ8Oj9k5j1J0J4OmnLQlk5l6k6oLJJQJ9K0J6J2J2J6J5Mrj5j1
$$ 872 889 914 942 963 963 948 928 905 881 866 873 891 897 878 853 842 852 866 872 868 863 866 874 871 846 810 784 778 781 782 783 791 810 830 846 858 870 886 901 905 896 881 870
1940H70rj1qMJ7J8J6K4L2K6Mk1l7m1l0j2jnqPK8K8Nj3j1%Jkknj3j3RL8M2J5k2m1m4m0l0qJ9
$$ 870 861 850 842 846 863 881 897 921 953 979 983 962 925 884 854 842 841 836 828 835 863 891 896 883 872 872 873 871 869 864 851 838 847 885 927 942 920 879 835 795 765 757 776
1935G76L9M3M1M0L7J9pj9j1MOj1k8k9j8rrk2l3l3j8mLPJ9L2L1K4K7L9M0K0knL%k1m0l9k1J
$$ 776 815 858 899 939 976 995 988 969 958 962 968 957 929 900 882 873 864 842 809 776 758 754 757 764 783 815 846 870 897 936 976 996 994 989 992 992 971 931 892 871 872
1930H72RLlJLok2k7j7rqlQRnj9j2LJ2J4K2L3K8J2kqj9l2k9j4kJPK2K9K1J0J3K4K5J4Lqk3l7
$$ 872 881 884 881 882 885 879 857 830 813 804 796 793 801 810 805 786 774 777 789 803 825 858 886 898 896 888 869 837 808 794 792 793 800 822 851 872 882 895 919 944 958 961 953 930 893
1924H93m3l7k5pJ0J1ok2j3J9M3M7L5K4J4KmjPLj2l1m0l2j7j0j8l5l6j9RK9L7M1M4L9K5Qmj
$$ 893 850 813 788 781 791 802 796 774 761 780 823 870 905 929 943 945 941 940 947 950 938 907 867 835 818 808 790 755 719 700 709 738 775 816 860 899 924 932 928 927
1919I27RJ6Oj6l5l8k6j8k1k4j8lPRRJ1Lj0j1OK5K4Mj1rk%QK7M0K9jk6l3k6j8j8l0m2l5j0J3
$$ 927 936 952 958 942 907 869 843 825 804 780 762 759 766 775 784 795 798 788 777 783 808 832 836 825 816 814 814 822 849 889 918 917 891 858 832 814 796 766 724 689 679 692
1914F92J2%QL5N1L2jj0PJ7jk4k5LK7K3Kj2kJ5K1Qj4k5j8nNNJ0K6M0L5J5kk%rk1j9kJ1J1QJ0
$$ 692 704 704 712 747 798 830 829 819 826 843 842 818 793 796 823 846 848 836 834 849 870 878 864 839 821 816 821 826 836 862 902 937 952 950 948 948 939 918 899 897 908 919 927 937
1909I37J2jk7n2n5l8rK5M4L4km0m8k2J2K1J1j%RK1L7M7K7j3m1l0%J2lj6qPJ1QQN%lOK0K5K1
$$ 937 949 948 921 869 814 776 767 792 836 870 868 828 780 758 770 791 802 801 801 810 831 868 915 942 929 888 858 858 870 867 851 843 850 861 869 877 882 882 879 885 905 930 951
1903I51J2Kqj4j2pj1k4m3n3m9k9pJ0K1L3L9K8Jj5rOP%MK0K6K1K3L8M2K0poJ6K7Rj7l4l9m2
$$ 951 963 965 957 943 931 924 913 889 846 793 744 715 708 718 739 772 811 839 840 825 816 822 829 829 833 853 879 900 923 961 1003 1023 1016 1010 1026 1053 1062 1045 1011 972 930
1898I30l2JM3O3M5Ll2m0k2jPlj1oK%j0k0k2k3j8nJ0J2nj9j1J7L6L5K0J0Lj2k8l9l5k3rRK5
$$ 930 898 899 942 1005 1050 1053 1021 981 959 958 965 962 951 945 947 947 937 917 895 872 854 849 859 871 866 847 836 853 889 924 944 954 957 945 917 878 843 820 811 820 845
1893H45L4K8Rqj0MJ6J8J4J3J4Mj7l6l9k7j6j7k6l1k4mJ6K3J8J4K2L5L7K3Jj1qMJ0Jj3j6nQ
$$ 845 879 907 916 908 898 902 918 936 950 963 977 981 964 928 889 862 846 829 803 772 748 744 760 783 801 815 837 872 909 932 933 922 914 918 928 929 916 900 895 903
1889I03J1MLKlj5k1j3MJ7K1J3MLPNoj6j2LQmj5j7j2lJ0J6Qj2k1oJ8K4J9J7J8Pj6l1k5j6j6
$$ 903 914 918 921 923 920 905 884 871 875 892 913 926 930 933 940 945 939 923 911 914 922 918 903 886 874 871 881 897 905 893 872 866 884 908 927 944 962 969 953 922 897 881 865
1883H65j8oJ4J8Kj4pJ2K0Nj7k2qQJ7J3RMjonKJ0J2J3J5J4QloNJ3Lk1k9qK4L6J9mj1qj1k2k8
$$ 865 847 841 855 873 875 861 854 866 886 891 874 852 844 852 869 882 891 895 894 888 883 885 895 907 920 935 949 957 954 948 953 966 969 948 919 911 935 971 990 986 975 967 956 934 906
1878I06k2j0KJ3K2K0J1MJ0K0J8%j4j0NPoj3JK3K8J6NJrk9l3j7OQnj4j7k6l5l2j6%LOJ6L0L6
$$ 906 884 874 876 889 911 931 942 946 956 976 994 994 980 970 975 982 976 963 964 987 1015 1031 1036 1037 1028 999 966 949 955 963 958 944 927 901 866 834 818 818 821 827 843 873 909
1873I09K9J7RQJ3Qj6m6n0k5KOkjJ0J2MJJ1J6Rrj7j3kJ1K0K5K6K3J6Mrj3qpj6k5k0kJ3J8J4
$$ 909 938 955 964 972 985 993 977 931 881 856 858 864 862 861 871 883 887 888 899 915 924 915 898 885 883 894 914 939 965 988 1004 1008 999 986 978 971 955 930 910 908 921 939 953
1867I53Okrrqrj4j6j2m%j%QK2L6L9L3K3J7J0lj6k2j8j2j0j4k3l1l0j8olnlKlj5j7%K3L3K8
$$ 953 959 957 948 939 931 922 908 892 880 876 876 875 875 883 905 941 980 1013 1036 1053 1063 1060 1044 1022 1004 992 982 968 945 914 884 866 860 857 852 849 851 848 833 816 816 839 872 900
1862I00J8J0OOQLj1k2k5k3k4k1mJ7K5J4KJNJ0J5J9Qqj2jOqk8k7pJ1J4J3J5K0K3K4J2j4l7l1
$$ 900 918 928 934 940 948 951 940 918 893 870 846 825 821 838 863 877 879 880 885 895 910 929 937 929 917 916 922 914 886 859 852 863 877 890 905 925 948 972 984 970 933 902
1857I02jK3K1QOJ6J5%j9k6k4k2k3k6k2pJ4K9K6Qj0j8j2KJ6K2J9PjkNPJ3K3L6L7J9rl0l6l4
$$ 902 901 924 945 953 959 975 990 990 971 945 921 899 876 850 828 821 835 864 890 898 888 870 858 860 876 898 917 924 923 921 926 933 946 969 1005 1042 1061 1052 1022 986 952
1852I52k9k8k1rLJ3J3Nrk1k4j6kOMJJJ1J5Pj0k0j6mKMOJ0J2J5K2K7K4J8J3Qok7l7l2k1j2K
$$ 952 923 895 874 865 868 881 894 899 890 869 845 829 827 833 837 838 839 850 865 872 862 842 826 822 824 828 834 844 856 871 893 920 944 962 975 983 977 950 913 881 860 848 850
1847H50K6M1L2J0kNJ3Kk5m6l9pK8L7K1K%J0K0K2K7K9K0%j5j6j2j4j9j8j4j4k0k3rJ6L7L2Q
$$ 850 876 917 949 959 957 962 975 977 952 906 867 860 888 925 946 948 948 958 978 1000 1027 1056 1076 1076 1061 1045 1033 1019 1000 982 968 954 934 911 902 918 955 987 995
1842I95j7k6j9j0jJ0K0K0Nqj7k3l2m2l7j6J4L7L6J3j3j8lJ3J5RJ1K6M1M4K9jl0m2l7k7j8k
$$ 995 978 952 933 923 922 932 952 972 977 969 952 929 897 855 818 802 816 853 889 902 889 871 868 881 896 905 916 942 983 1027 1056 1055 1025 983 946 919 901 899
1837H99K2L4K3%j3j8k6l1k4oPMoj7k9l0mL2N1L8J5RK1K8K5Rj2l1m2l7k4j1NK1K8J7mj7k1k7
$$ 899 921 955 978 978 965 947 921 890 866 860 867 871 865 848 819 789 785 817 868 906 921 930 951 979 1004 1013 1001 970 928 891 867 856 861 882 910 927 923 906 885 858
1832H58l0k1lM%JJ5K2Qj3j4LJ5J3J0J0P%p%J3J6Rkn%Kjqqljnj2j4j0jJ6L8M8K8pk4j1J0J1
$$ 858 828 807 804 808 808 809 824 846 854 841 827 830 845 858 868 878 885 885 878 878 891 907 916 914 909 909 911 910 902 894 891 890 885 873 859 849 848 864 902 950 978 971 947 936 946 957
1827I57lp%PMkkkknpj7k4k1kJ3J2%poomOK0J6nk2j7JJ3J5J9L2L9L2J6KmlKOJj1j9j7j5k0k8
$$ 957 954 947 947 954 958 956 954 952 950 945 938 921 897 876 874 887 899 899 892 886 880 876 882 902 918 913 891 874 875 888 903 922 954 993 1025 1041 1043 1039 1036 1038 1044 1045 1034 1015 998 983 963 935
1821I35k0JJ6J1jrrj3j8j7j0mmlKQJ4K0J8Lk1l5k6oPQJ0J6K5L3L6L0Rj7k8j5MJ1M%MJ1Oj0
$$ 935 915 916 932 943 942 933 924 911 893 876 866 862 858 855 857 865 879 899 917 920 899 864 838 832 839 847 857 873 898 931 967 997 1006 989 961 946 950 961 965 965 969 980 986 976
1815I76k6l1k4j3mMQLj4l1l0j3OK1K8K9J2j9l5j3L1N4L5jk0k1j8k3k3j3LJ2J4J2J5K2J9kk9
$$ 976 950 919 895 882 878 882 890 893 879 848 818 805 811 832 860 889 901 882 847 834 865 919 954 953 933 912 894 871 848 835 838 850 864 876 891 913 932 930 901
1811I01l6j7RJ2nj3jJ8K1J2OKoj9k3mJ9K8J5kj3k4l4k9oK1K2%j4mJ6J4nj6nRJ4J6K0J6j1m2
$$ 901 865 848 857 869 864 851 850 868 889 901 907 909 903 884 861 857 876 904 919 917 904 880 846 817 811 832 854 854 840 836 852 866 861 845 840 849 863 879 899 915 904 862
1805H62m8k0J5L2L0K1J4J5J7J1jnQJ9Ll5o1m8qK2L0K6J9J1NjmroJ1L1L8J6j9m4m6l1j2Jjr
$$ 862 814 794 809 841 871 892 906 921 938 949 948 943 951 970 973 938 877 829 821 843 873 899 918 929 934 933 929 920 914 925 956 994 1010 991 947 901 870 858 859 858 849
1800H49j0OK9L7K2rl2m4m0k4LL1M3L7K2QjrmJ2K3J1j2k4j4MJ2J6K3K8J9%j3j7j0jJ3K1K1J0
$$ 849 839 845 874 911 933 924 892 848 808 784 787 818 861 898 920 928 927 918 914 926 949 960 948 924 910 914 926 942 965 993 1012 1012 999 982 972 971 984 1005 1026 1036
1796A036pk3l1k2m%j6k8j4J5K8K2Qmk3m2m5k8qNJ4K4K1kk1j8JJ4J6K4L6L7J9j0l0l4k6k2k7
$$ 1036 1029 1006 975 953 949 949 933 905 891 906 934 956 964 960 937 895 850 822 814 819 833 857 878 876 855 837 838 852 868 892 928 965 984 974 944 910 884 862 835
1791H35k5oK8N6N9M3K1kk2l1k1nKJjqk1k8j1J5K1Jj3%K4L5L0K1J3kj8k2nJ3J7J2Mkj0j4rK
$$ 835 810 804 832 888 947 990 1011 1009 987 956 935 930 932 933 932 924 903 875 864 879 900 901 888 888 912 947 977 998 1011 1009 991 969 964 977 994 1006 1010 1008 998 984 975 977
1786I77J0O%KQMj3k5j5PK3K0RKJjj0j8k2j9k0k6l7l7j1L0O1O0M1K1Pj1l2l0MM7O0L5nl1m3
$$ 977 987 993 993 995 1003 1007 994 969 954 961 984 1004 1013 1015 1016 1015 1005 987 965 946 926 900 863 826 815 845 906 966 1007 1028 1035 1024 992 962 966 1013 1073 1108 1103 1072 1029
1781A029n1n8n3k8LK9M4M2K2ok3j6MJ7J3mk1k3qJ6L3L3K8K3J4nk4k6j4j2j9j9lJ6K5K3K0J1
$$ 1029 978 920 867 839 842 871 915 957 979 973 950 934 938 955 968 964 943 920 912 928 961 994 1022 1045 1059 1054 1030 1004 990 978 959 940 937 953 978 1001 1021 1032
1776A032rl2m0k9j4%RJ6J7Qoj7k4k1j5j4j5j1jOkrkJ3J6mk2k0nNQJ9M0M6K7kj7j9k4l2k3P
$$ 1032 1023 991 951 922 908 908 917 933 950 958 952 935 911 890 875 861 846 835 834 840 838 829 827 840 856 852 830 810 805 810 818 837 877 923 950 948 931 912 888 856 833 840
1771H40M1M7K5nk8l3j7J7M7N3L3Nj4j8j0MJ3Nj2j6JJ8J8O%Kmk0k8j6J0L6N1M4K7J1QNj0l0
$$ 840 881 928 953 948 920 887 870 887 934 987 1020 1025 1011 993 983 987 1000 1005 993 977 978 996 1014 1020 1020 1022 1018 998 970 954 964 1000 1051 1095 1122 1133 1141 1146 1136 1106
1766A106l6k3oLLMKnj3j2pkjMJ1J2N%LRJ0QOJj0j8nJ8K4%l0l5k0qkPJ9J5jnJ3K0Jk1j1J8L3
$$ 1106 1070 1047 1041 1044 1047 1051 1053 1048 1035 1023 1016 1014 1013 1017 1028 1040 1045 1045 1048 1057 1067 1075 1081 1082 1072 1054 1049 1067 1091 1091 1061 1026 1006 998 996 1003 1022 1037 1036 1031 1044 1064 1065 1044 1033 1051 1084
1760A084K4RMOJ4K6L2J3k2m2k8LK3K5J5LlKJ4J5Jj1nPPoj4j0%PLrk2l0k9k4k1j2OK2J8Kj6
$$ 1084 1108 1117 1121 1127 1141 1167 1199 1212 1190 1148 1120 1123 1146 1171 1186 1189 1186 1188 1202 1217 1218 1207 1202 1209 1216 1210 1196 1186 1186 1193 1196 1187 1165 1135 1106 1082 1061 1049 1055 1077 1095 1097 1081
1755A081k0j4JK3N0O8P1O1M6L8L5L3K6Qj3k6k1oQMj6l2k8j3rj9k8k3j9k6l1k2oloKJ3J1j1
$$ 1081 1061 1047 1048 1071 1121 1189 1260 1321 1367 1405 1440 1473 1499 1507 1494 1468 1447 1441 1449 1453 1437 1405 1377 1364 1355 1336 1308 1285 1266 1240 1209 1187 1181 1178 1172 1174 1187 1198 1187
1750A187k5j7LJ3Pj0k5k3QN5Q1P1M2K5J8Lk0k9j9j6l2m9m1j8nj1j6qKOPJ4J9Rj2k2j8nJmj9
$$ 1187 1162 1145 1148 1161 1168 1158 1133 1110 1118 1173 1254 1325 1367 1392 1410 1413 1393 1364 1345 1329 1297 1248 1207 1189 1184 1173 1157 1149 1151 1157 1164 1178 1197 1206 1194 1172 1154 1149 1150 1146 1127
1745A127m1m8l5j1jnnMRN%MQMjQJ8J6J2J7K2Ll0m4l0j5j9k1%L5M5J6k1l6k6j1lNK1L1K8J5
$$ 1127 1086 1038 1003 992 991 986 981 985 994 999 999 1003 1011 1015 1014 1022 1040 1056 1068 1085 1107 1110 1080 1036 1006 991 972 951 951 986 1031 1047 1026 990 964 953 950 955 976 1007 1035 1050
1740A050J0J4J6Oj0k7l8l8k3LJ8J4OQNj4l3l1j0%lkMMn%L0M9L1lj4RK8K3Jj3j6j7j8j5jJ7
$$ 1050 1060 1074 1090 1096 1086 1059 1021 983 960 963 981 995 1001 1009 1014 1000 967 936 926 926 923 921 925 929 924 924 954 1003 1034 1031 1017 1026 1054 1077 1078 1065 1049 1032 1014 999 998 1015
1735A015K3J3oj3lQRJjNJ1Mj1k3j9kJ3Rj1k4j7rj3k4k0PL6N2N1L7K6K2K4K0Mj5k5k6k4k1j0
$$ 1015 1038 1051 1045 1032 1029 1037 1046 1047 1046 1051 1062 1066 1055 1032 1013 1011 1024 1033 1022 998 981 972 959 935 915 922 958 1010 1061 1098 1124 1146 1170 1190 1194 1179 1154 1128 1104 1083 1073
1730A073MJ5K0K4K4Rj5l5m0l2k0oJ2K8L5L4K8J5OMJ7L2K8Ll3n3m5k4j6k4k9j1J6K2Nj0LK8
$$ 1073 1077 1092 1112 1136 1160 1169 1154 1119 1079 1047 1027 1021 1033 1061 1096 1130 1158 1173 1179 1183 1200 1232 1260 1263 1230 1177 1132 1108 1092 1068 1039 1028 1044 1066 1071 1061 1064 1092
1725A092M0L3K7K4J1j5l3k4JJ4J2J7M2O7O3L2ml1m2l7j4QJ0mpQK2J9PNQQNJ0J8J7J3J7K2N
$$ 1092 1132 1165 1192 1216 1227 1212 1179 1155 1156 1170 1182 1199 1241 1308 1371 1403 1399 1368 1326 1289 1275 1283 1293 1289 1282 1290 1312 1331 1338 1343 1351 1359 1364 1374 1392 1409 1422 1439 1461 1466
1720A466m0p9p2k4K6M1K8J6J5J1pk7l2k4j9k3j6LJ4QKJ1K7K7J6J5K5L6L7M1M2L2J2loJJ1K1
$$ 1466 1426 1347 1275 1251 1277 1318 1346 1362 1377 1388 1381 1354 1322 1298 1279 1256 1240 1243 1257 1265 1267 1278 1305 1332 1348 1363 1388 1424 1461 1502 1544 1576 1588 1585 1579 1580 1591 1612
1716A612K1Nj3rJ5L0K0M%Jpj7j7pNJ6K3K0Nqj2j4j9j7LK4J9j0l6l9k8j2%QPmj5j2PL6N5N0
$$ 1612 1633 1638 1625 1616 1631 1661 1681 1685 1685 1686 1679 1662 1645 1638 1643 1659 1682 1702 1707 1699 1687 1673 1654 1637 1640 1664 1683 1673 1637 1598 1570 1558 1558 1566 1573 1569 1554 1542 1549 1585 1640 1690
1711A690K6jj3qJ1K5K7J3KJ1L7N3M2J5j3l2m2l8k0MK4M0M6K8Jj0OJ8Kk0j2J3K1Lj2j7k6m3
$$ 1690 1716 1715 1702 1694 1705 1730 1757 1770 1772 1783 1820 1873 1915 1930 1917 1885 1843 1805 1785 1789 1813 1853 1899 1927 1928 1918 1924 1942 1944 1924 1912 1925 1946 1949 1937 1920 1894 1851
1706A851m6k4lKlJPLnqqj6k8l5l2k6k5k5k7k4pK1M7N9N5L5Kk2k3%K6L8M2M7M1K2L%MMkqrr
$$ 1851 1805 1781 1778 1780 1777 1778 1785 1788 1783 1775 1767 1751 1723 1688 1656 1630 1605 1580 1553 1529 1522 1543 1590 1649 1704 1739 1741 1719 1696 1696 1722 1760 1802 1849 1890 1912 1915 1915 1919 1923 1921 1913 1904 1895
1701A895mOJ3J0Kqj0kJ7L9M5L1Pj4l3m1k6J4M3L3%j5JK3K9K3J6PlrlJ0J4J0MJOJ1J0M%MRR
$$ 1895 1891 1897 1910 1920 1922 1914 1904 1902 1919 1958 2003 2034 2041 2027 1994 1953 1927 1941 1984 2017 2017 2002 2003 2026 2055 2078 2094 2101 2098 2089 2086 2096 2110 2120 2124 2125 2131 2142 2152 2156 2156 2160 2169 2178
1695B178J1K0K9K2RLRJ2J5K9N1O6N9M3L3K9K7K3J9J2J1K4M3N1M4L3K5K1J8J8K1K1J8K6L6L5
$$ 2178 2189 2209 2238 2260 2269 2272 2281 2293 2308 2337 2388 2454 2513 2556 2589 2618 2645 2668 2687 2699 2710 2734 2777 2828 2872 2905 2930 2951 2969 2987 3008 3029 3047 3073 3109 3144
1691C144J6MJ0K6L1K7K2K0J7J8K6K7J7J2K4M4M4L2L9O9R0O7J5k2k7j0J0J9K0J8K5M6P2Q3O9
$$ 3144 3160 3164 3174 3200 3231 3258 3280 3300 3317 3335 3361 3388 3405 3417 3441 3485 3529 3561 3600 3669 3759 3826 3841 3819 3792 3782 3792 3811 3831 3849 3874 3920 3992 4075 4144
1686D144M5L2L6M1L7L1L3L7L3K2K6M3N3M0K0J9L3L4J2j1j0J0L0L9M2L8L0K0J6J4RNJ1L2M6
$$ 4144 4189 4221 4257 4298 4335 4366 4399 4436 4469 4491 4517 4560 4613 4653 4673 4692 4725 4759 4771 4760 4750 4760 4790 4829 4871 4909 4939 4959 4975 4989 4998 5003 5014 5046 5092
1682E092M3K7J2QJ3J7J9K0J5J6K4L7L9K6J1%mlLJ0J1mj9j0J7M3M4K7OlokJNJ4K1J7mk4k6k
$$ 5092 5135 5162 5174 5182 5195 5212 5231 5251 5266 5282 5306 5343 5382 5408 5419 5419 5415 5412 5415 5425 5436 5432 5413 5403 5420 5463 5507 5534 5540 5537 5531 5529 5530 5535 5549 5570 5587 5583 5559 5533 5531
1677E531K4L5K5kl2m2j9J7L2J8ljJ0J0nj5j4j6k3j8%J6Rj7m2n2n0m4l5k4j1pj2j3JK0K4Pj4
$$ 5531 5555 5590 5615 5613 5581 5539 5520 5537 5569 5587 5584 5583 5593 5603 5598 5583 5569 5553 5530 5512 5512 5528 5537 5520 5478 5426 5376 5332 5297 5273 5262 5255 5243 5230 5231 5251 5275 5282 5268
1672E268k2k1k3k6j8p%MRJ7J4Okoj2k5l0k6k2k4k3k0j8k0j4KJ2OonLLllPJ2NkLJ0J0%j7l2
$$ 5268 5246 5225 5202 5176 5158 5151 5151 5155 5164 5181 5195 5201 5199 5193 5181 5156 5126 5100 5078 5054 5031 5011 4993 4973 4959 4961 4973 4979 4973 4968 4971 4974 4971 4968 4975 4987 4992 4990 4993 5003 5013 5013 4996 4964
1667D964m0k9oJ2Nj6k4j6rj8l1k4PL4L0Lj7j6jJ3J5J2Nnj2j2nKjrj1KK6M2M2L1J7QQJ7L2M5
$$ 4964 4924 4895 4889 4901 4906 4890 4866 4850 4841 4823 4792 4768 4775 4809 4839 4842 4825 4809 4808 4821 4836 4848 4853 4848 4836 4824 4819 4821 4820 4811 4800 4802 4828 4870 4912 4943 4960 4968 4976 4993 5025 5070
1662E070N3N4M4K8J8K9N0N2L2J2K2M3N0L9L1L7M1L7L3L3L5M1N9P9Q1O4N6P1Q7Q9Q8J01J10
$$ 5070 5123 5177 5221 5249 5267 5296 5346 5398 5430 5442 5464 5507 5557 5596 5627 5664 5705 5742 5775 5808 5843 5884 5943 6022 6103 6167 6223 6294 6381 6470 6558 6659 6769
1658F769R8P6P1R1J12J23J31J45J56J59J57J54J50J54J76K04K14K05J89J78J70J68J87K23
$$ 6769 6867 6943 7014 7105 7217 7340 7471 7616 7772 7931 8088 8242 8392 8546 8722 8926 9140 9345 9534 9712 9882 10050 10237 10460
1655A0460K59K77K84K89K96L09L29L51L58L57L76M21M65M78M73M78N04N31N54N86O29O77P21
$$ 10460 10719 10996 11280 11569 11865 12174 12503 12854 13212 13569 13945 14366 14831 15309 15782 16260 16764 17295 17849 18435 19064 19741 20462
1652B0462P57P82Q00Q28Q80R50J005J040J082J148J215J256J273J291J313J319J292J240J188
$$ 20462 21219 22001 22801 23629 24509 25459 26464 27504 28586 29734 30949 32205 33478 34769 36082 37401 38693 39933 41121
1650D1121J141J089J019R18P91O54N20L93K66J40K9n5j16j68k08k31k33k25k17k05j76j30
$$ 41121 42262 43351 44370 45288 46079 46733 47253 47646 47912 48052 48081 48026 47910 47742 47534 47303 47070 46845 46628 46423 46247 46117
1647D6117o6J1Q7J60K27L03L95M95N93O85P76Q69R65J070J186J308J429J548J682J839K010
$$ 46117 46051 46062 46149 46309 46536 46839 47234 47729 48322 49007 49783 50652 51617 52687 53873 55181 56610 58158 59840 61679 63689
1645F3689K179K328K469K615K772K922L052L159L255L337L374L346L258L128K963K742K462
$$ 63689 65868 68196 70665 73280 76052 78974 82026 85185 88440 91777 95151 98497 101755 104883 107846 110588 113050
1642A13050K138J780J373R08M15o2m96q95j269j605j889k119k299k431k500k509k466k396
$$ 113050 115188 116968 118341 119249 119664 119602 119106 118211 116942 115337 113448 111329 109030 106599 104099 101590 99124 96728
1640I6728k308k212k108j992j861j708j536j358j187j025q63o97n32l67k07m3J25L05M92O77
$$ 96728 94420 92208 90100 88108 86247 84539 83003 81645 80458 79433 78570 77873 77341 76974 76767 76724 76849 77154 77646 78323
1638G8323Q54J020J184J348J518J697J879K055K219K374K527K661K751K782K757K689K575
$$ 78323 79177 80197 81381 82729 84247 85944 87823 89878 92097 94471 96998 99659 102410 105192 107949 110638 113213
1636A13213K410K192J918J583J183P32K57k23o91j133j546j919k246k516k735k916l057l151
$$ 113213 115623 117815 119733 121316 122499 123231 123488 123265 122574 121441 119895 117976 115730 113214 110479 107563 104506 101355
1634A01355l187l178l134l056k952k841k735k617k471k314k167k033j899j760j634j524j406
$$ 101355 98168 94990 91856 88800 85848 83007 80272 77655 75184 72870 70703 68670 66771 65011 63377 61853 60447
1631F0447j278j159j064r75q72p51o34n30m40l56k70j75p8NO8J23J87K58L13L39L40L26L02
$$ 60447 59169 58010 56946 55971 55099 54348 53714 53184 52744 52388 52118 51943 51865 51870 51938 52061 52248 52506 52819 53158 53498 53824 54126
1629E4126K68K06J12kj10k01k99m26n71p08q26r33j032j118j184j234j266j281j282j287j290
$$ 54126 54394 54600 54712 54710 54600 54399 54100 53674 53103 52395 51569 50636 49604 48486 47302 46068 44802 43521 42239 40952 39662
1626C9662j274j233j184j148j121j082j024r56q92q41q03p81p72p64p32o72o02n58n48n46
$$ 39662 38388 37155 35971 34823 33702 32620 31596 30640 29748 28907 28104 27323 26551 25787 25055 24383 23781 23223 22675 22129
1624B2129n30n02m81m65m37l95l58l39l32l26l17l07k91k71k56k51k39k11j83j76j89j93j77
$$ 22129 21599 21097 20616 20151 19714 19319 18961 18622 18290 17964 17647 17340 17049 16778 16522 16271 16032 15821 15638 15462 15273 15080 14903
1621A4903j60j58j63j61j53j53j57j47j19r6r4j01r5p4o0o6q1q8q5p2n2k9j1pj6k6l5m0m4
$$ 14903 14743 14585 14422 14261 14108 13955 13798 13651 13532 13436 13342 13241 13146 13072 13012 12946 12865 12777 12692 12620 12568 12539 12528 12521 12505 12479 12444 12404 12360
1617A2360m0l2j9kJ6K9K5Jk6m0k6RM2N2L9J8Jj2j8rJ1K7K9K6K9L3K2NNK0L2L4M0N4N9M5K6
$$ 12360 12320 12288 12269 12267 12283 12312 12337 12338 12312 12272 12246 12255 12297 12349 12388 12406 12407 12395 12377 12368 12379 12406 12435 12461 12490 12523 12545 12550 12555 12575 12607 12641 12681 12735 12794 12839 12865
1613A2865K4L5M3M3L7L1K5K2K0K1K9M5O1O0M4L5M5N7N4M4N0O1O0M8M4N9P7Q0P2O0N4N1N1N0
$$ 12865 12889 12924 12967 13010 13047 13078 13103 13125 13145 13166 13195 13240 13301 13361 13405 13440 13485 13542 13596 13640 13690 13751 13811 13859 13903 13962 14039 14119 14191 14251 14305 14356 14407 14457
1609A4457N1N4O3O2M4J6KJ3L7N1M3J4j8l2k2pqk3l5m1m6n0m1k7k5l7m3l0j2knj5m1p3q3n8
$$ 14457 14508 14562 14625 14687 14731 14747 14749 14762 14799 14850 14893 14907 14889 14857 14835 14828 14820 14797 14762 14721 14675 14625 14584 14557 14532 14495 14452 14422 14410 14408 14403 14388 14347 14274 14191 14133
1604A4133k4j5k7l4k8k8m2n3m5k6j7k2k9l1k9k9l5m0l5k2j3j2j4rqk1m0n1n7p0r3j02r2p7
$$ 14133 14109 14094 14067 14033 14005 13977 13935 13882 13837 13811 13794 13772 13743 13712 13683 13654 13619 13579 13544 13522 13509 13497 13483 13474 13466 13445 13405 13354 13297 13227 13134 13032 12940 12863
1600A2863p5q1q4q7r5j04j10j14j23j34j34j28j22j26j32j34j27j17j06r9r3q9q9r8j19j37
$$ 12863 12788 12707 12623 12536 12441 12337 12227 12113 11990 11856 11722 11594 11472 11346 11214 11080 10953 10836 10730 10631 10538 10449 10360 10262 10143 10006
1597A0006j47j46j48j48j40j22j07j05j14j13j01q2o9o2n6n8p1r4j08j07r8q8q1p7q5j05j22
$$ 10006 9859 9713 9565 9417 9277 9155 9048 8943 8829 8716 8615 8533 8464 8402 8346 8288 8217 8123 8015 7908 7810 7722 7641 7564 7479 7374 7252
1594G252j21j07r6r1q2p1o8q2r4r0q1q6j03j10j00q8q3q5q9r0q9q5q3p7p0n9n7o9q2p8n7m2
$$ 7252 7131 7024 6928 6837 6755 6684 6616 6534 6440 6350 6269 6183 6080 5970 5870 5782 5699 5614 5525 5435 5346 5261 5178 5101 5031 4972 4915 4846 4764 4686 4629 4587
1590D587n1p8j01j07r2o7m2l1l1l6l7l9m9o6q1q7q2o7m9k9j4j2k6m6n7n3m0k5j3j1k6n2p6
$$ 4587 4536 4458 4357 4250 4158 4091 4049 4018 3987 3951 3914 3875 3826 3760 3679 3592 3510 3443 3394 3365 3351 3339 3313 3267 3210 3157 3117 3092 3079 3068 3042 2990 2914
1586B914q1p1n5l9k5k3l5m5l2lJ0kk2k9l2m5n6m4k2j9l7m6l5j9j1kJ1J9J4ONjk1l6k7mNmj4
$$ 2914 2833 2762 2707 2668 2643 2620 2585 2540 2508 2505 2515 2513 2491 2462 2430 2385 2329 2285 2263 2244 2207 2161 2126 2107 2096 2094 2105 2124 2138 2144 2149 2148 2127 2091 2064 2060 2065 2061 2047
1581B047k1l6n2m2mK7J8j1k5j7j0j4qQJ3kj9j5jJj5l4m0l2k0j5j4rkjoj0j2j2j8j6kJ6J7Q
$$ 2047 2026 1990 1938 1896 1892 1919 1937 1926 1901 1884 1874 1860 1852 1860 1873 1871 1852 1837 1836 1837 1822 1788 1748 1716 1696 1681 1667 1658 1656 1655 1649 1639 1627 1615 1597 1581 1579 1595 1612 1620
1576A620PJ6J8MnRK9K9J4KLMJoj2k0j9oJ1J7J0J3K1J4j9n0n1k4LPnj9k2j6pnpnNJ4J5QMMM
$$ 1620 1627 1643 1661 1665 1660 1669 1698 1727 1741 1743 1746 1750 1751 1745 1733 1713 1694 1688 1699 1716 1726 1739 1760 1774 1755 1705 1654 1630 1633 1640 1635 1616 1594 1578 1571 1566 1559 1554 1559 1573 1588 1596 1600 1604 1608
1570A608jpj0pOJ7J7QNJ7L3K8Jk0j4J3L2L0J5RJ1J3P%%JKMJ6L1L3J9Mlj3l0l7k7rlnnpk1m6
$$ 1608 1607 1600 1590 1583 1589 1606 1623 1631 1636 1653 1686 1714 1715 1695 1681 1694 1726 1756 1771 1780 1791 1804 1811 1811 1811 1812 1814 1818 1834 1865 1898 1917 1921 1918 1905 1875 1838 1811 1802 1799 1794 1789 1782 1761 1715
1565A715n8n2m5m4l9j3J6L1K6J2%KJ8L6L3J2j0j1KJ2Olj2j3nJ5L5M0L1K1K0J7jk4l2j8QK6
$$ 1715 1657 1605 1560 1516 1477 1464 1480 1511 1537 1549 1549 1551 1569 1605 1638 1650 1640 1629 1631 1643 1649 1646 1634 1621 1616 1631 1666 1706 1737 1758 1778 1795 1794 1770 1738 1720 1728 1754
1560A754J6qk8k6j2rj5j0J6L9L5Oj9k2k1k6k8j3Lkl0n4n9n1m1l1k6k8l6l1mL0M2L1J7RMjk
$$ 1754 1770 1762 1734 1708 1696 1687 1672 1662 1678 1717 1752 1758 1739 1717 1696 1670 1642 1629 1632 1630 1600 1546 1487 1436 1395 1364 1338 1310 1274 1243 1239 1269 1311 1342 1359 1368 1372 1371 1369
1556A369LNnk5m0m1l2j7nMRJ4J7J6J3J2J5K0K7K7J9Mrj0klj5k8l0k1qLNlj6k0j4j0k1l3l0
$$ 1369 1372 1377 1372 1347 1307 1266 1234 1217 1212 1216 1225 1239 1256 1272 1285 1297 1312 1332 1359 1386 1405 1409 1400 1390 1388 1385 1370 1342 1312 1291 1283 1286 1291 1288 1272 1252 1238 1228 1207 1174 1144
1551A144j2%kj4j8j0PK0K6L0L0K7J3pk3k2mK0L3J5k9p0p8n2k7j8j0J3L4L2J3KQK0L0M4N2M1
$$ 1144 1132 1132 1130 1116 1098 1088 1095 1115 1141 1171 1201 1228 1241 1234 1211 1189 1185 1205 1238 1253 1224 1154 1076 1024 997 979 969 982 1016 1048 1061 1063 1071 1091 1121 1165 1217 1258
1546A258J8QJ8J6ql7m8m3l4k6rQJ4Noj3j5rJ%j5l2k9j3JPROj0l1l0kL3M4K7Noqj4k1k2j2P
$$ 1258 1276 1284 1302 1318 1310 1273 1225 1182 1148 1122 1113 1121 1135 1140 1134 1121 1106 1097 1098 1098 1083 1051 1022 1009 1010 1017 1026 1032 1022 991 961 959 992 1036 1063 1068 1062 1054 1040 1019 997 985 992
1541I92J8Rj1k2j0J4K6J4pj1PK3K0MlJKlmQK0J7RQPnk4k9j9j1j1mJ4K9K7J8J5Pj0k2rK0L3
$$ 992 1010 1019 1008 986 976 990 1016 1030 1023 1012 1019 1042 1062 1066 1063 1064 1066 1063 1059 1067 1087 1104 1113 1121 1128 1123 1099 1070 1051 1040 1029 1025 1039 1068 1095 1113 1128 1135 1125 1103 1094 1114 1147
1535A147K2J0J3J5Jj2mK0K8J4j0k5l2l0j1J5K1lk7k1NJ6%k1j8%P%nJQMlmjkqoPJ8J7Kj5k2
$$ 1147 1169 1179 1192 1207 1208 1196 1192 1212 1240 1254 1244 1219 1187 1157 1146 1161 1182 1179 1152 1131 1136 1152 1152 1131 1113 1113 1120 1120 1115 1116 1124 1128 1125 1121 1120 1118 1110 1104 1111 1129 1146 1148 1133 1111
1530A111j5nkj6k7j9RL3L0J2lrj6k4k7k1j2pKJ9K7J8Jpk%jMJ5K2J7LpnLJ0Npj4rLKj5l7m4
$$ 1111 1096 1091 1089 1073 1046 1027 1036 1069 1099 1111 1108 1099 1083 1059 1032 1011 999 992 994 1013 1040 1058 1059 1052 1050 1050 1049 1053 1068 1090 1107 1110 1103 1098 1101 1111 1116 1109 1095 1086 1089 1091 1076 1039 995
1524I95l2%L5M6K8LLK8M2K9Lopj4l0l7l5k8j2J3L2K7Lj2lJ6K3Qj3k9k4nJ2J0mj3j6j9k3k0
$$ 995 963 963 998 1044 1072 1075 1078 1106 1148 1177 1180 1174 1167 1153 1123 1086 1051 1023 1011 1024 1056 1083 1086 1074 1071 1087 1110 1118 1105 1076 1052 1047 1059 1069 1065 1052 1036 1017 994 974
1520I74j3qoNK5L1J6kmMMpj3j3j5k3k6j9nLJmlQK3L1K1Jj2pJ0J5ml1l8j3J2Qj9k5OM9O6N1
$$ 974 961 953 947 952 977 1008 1024 1022 1018 1022 1026 1019 1006 993 978 955 929 910 905 908 909 905 902 910 933 964 985 986 974 967 977 992 988 957 919 906 918 926 907 882 888 937 1003 1054
1514A054K3Kj7l1l0j6JRPQJ4J7J1nk0j9lJ2J0mk0k8k7j6kQO%KPJ4K3L6L6J1k4l5j5J2K0J5
$$ 1054 1077 1079 1062 1031 1001 985 986 995 1002 1010 1024 1041 1052 1047 1027 1008 1005 1017 1027 1023 1003 975 948 932 930 938 944 944 946 953 967 990 1026 1062 1073 1049 1014 999 1011 1031 1046
1509A046QJnqkOROL%pj8k6k9k6k3k0j7pJ3K8K2kj4JK3K1%j7j7j4j9k2j8j5k1k3oK1M1M6M2
$$ 1046 1054 1055 1050 1042 1040 1046 1055 1061 1064 1064 1057 1039 1013 984 958 935 915 898 891 904 932 954 952 938 939 962 983 983 966 949 935 916 894 876 861 840 817 811 832 873 919 961
1504I61L8L7L2J9Jk0l8m2l1j7qpkQJ8J1mj6j8j7k2k1mL2O1O0L0ok5k3j4r%J9L7L7J8jopj9
$$ 961 999 1036 1068 1087 1088 1068 1030 988 957 940 932 925 923 931 949 960 956 940 922 905 883 862 858 890 951 1011 1041 1035 1010 987 973 964 964 983 1020 1057 1075 1074 1068 1061 1042
1499A042l6m1l1k0j9j8j1%PJ3K4L2L0J7RROpj5kK9M4K2k1m7m2k2j2j0j1qjQJ3RnqJ0L2L2J3
$$ 1042 1006 965 934 914 895 877 866 866 873 886 910 942 972 989 998 1007 1013 1006 991 989 1018 1062 1084 1063 1016 974 952 940 930 919 911 910 918 931 940 935 927 937 969 1001 1014
1494A014qj3j0lJ0K5K7Rj1j9j5rlQK2K8K5J5Nrj7j1NJ4Mj3j8j3mjKMKj3l0k7lK2K5J2krj3
$$ 1014 1006 993 983 980 990 1015 1042 1051 1040 1021 1006 997 994 1002 1024 1052 1077 1092 1097 1088 1071 1060 1065 1079 1083 1070 1052 1039 1035 1034 1036 1040 1042 1029 999 972 969 991 1016 1028 1026 1017 1004
1489A004j8j8pPJ7J9J5Mj0j8j5j1rqnKJ1K7M4M8K4j1l2k8j3oqj1ropj7k8k9j8jPRJ2J7J7J6
$$ 1004 986 968 961 968 985 1004 1019 1023 1013 995 980 969 960 952 947 949 960 987 1031 1079 1103 1092 1060 1032 1019 1013 1005 994 985 979 972 955 927 898 880 879 886 895 907 924 941 957
1484I57J9K8K8K2J9J7Oj6k6j5NJ1kj6j6oMQJ0J1R%j7l2l5k8k0j7j2kKKRK4K8Nk1j9J1L0J8
$$ 957 976 1004 1032 1054 1073 1090 1096 1080 1054 1039 1044 1055 1053 1037 1021 1015 1019 1027 1037 1048 1057 1057 1040 1008 973 945 925 908 896 894 896 898 907 931 959 964 943 924 935 965 983
1479I83oj2JP%j3k4l0k9j2J3K8K7J7J3J7J6PjkOJ4K0K9L8L4J3j9m3n0m4l4k2lK2M1L9J5j5
$$ 983 977 965 966 973 973 960 936 906 877 865 878 906 933 950 963 980 996 1003 1002 1000 1006 1020 1040 1069 1107 1141 1154 1135 1092 1042 998 964 942 939 961 1002 1041 1056 1041
1474A041k8j9m%m%J3K1J0rk4k9k2mK1K9Rk6m4k8OL4M4M7M4K7qm9o6n2k1QK9L8L8K6J4J2J6
$$ 1041 1013 994 990 990 986 986 999 1020 1030 1021 997 968 946 942 963 992 1001 975 931 903 909 943 987 1034 1078 1105 1097 1048 982 930 909 917 946 984 1022 1048 1062 1074 1090
1469A090J3lj5j3kJk%J0J9K6L1L2J9lk7m0m5l7j7PJ5jk0k1rJMKkprlPLj5l3m0l4j8LK2K2J0
$$ 1090 1103 1100 1085 1072 1070 1071 1069 1069 1079 1098 1124 1155 1187 1206 1203 1176 1136 1091 1054 1037 1044 1059 1058 1038 1017 1008 1009 1013 1015 1013 1006 997 994 1001 1004 989 956 916 882 864 867 889 911 921
1464I21NJ3J6MoML2M8M0J4j0k4k1rKjpmRJ8J6J4J7J5%j4nQMk6n5o0m2j6LJ2J0RJ4K3K0Kk1
$$ 921 926 939 955 959 953 957 989 1037 1077 1091 1081 1057 1036 1027 1029 1028 1021 1017 1026 1044 1060 1074 1091 1106 1106 1092 1087 1095 1099 1073 1018 958 916 900 903 915 925 934 948 971 991 993 972
1458I72l3k9j4OK6L7L4K3J3J3J7J4kk2l1k7j8j3j1kRJ2MllornPJ0kj4j2%PNKkj2k3k0kJ8L2
$$ 972 939 910 896 902 928 965 999 1022 1035 1048 1065 1079 1077 1055 1024 997 979 966 955 953 962 974 978 975 972 966 957 952 959 969 967 953 941 941 948 953 955 953 941 918 898 896 914 946
1453I46M0L7K2mk7l2k2j4j6k4l0k1JK7M1M4L5K4J2Llj5l1l6k5rnqLK1K5QroJ0K2K9L2L0J7
$$ 946 986 1023 1045 1041 1014 982 960 946 930 906 876 855 856 883 924 968 1003 1027 1039 1042 1039 1024 993 957 932 923 918 910 913 934 959 967 958 952 962 984 1013 1045 1075 1092
1448A092OKKORJ0kk2k5oJ4J5OJ2K4J7rk8k4r%NRPpj9j7jJ3J4PklljLJ2J6Qrj4%J6J2mr%Lo
$$ 1092 1098 1100 1102 1108 1117 1127 1125 1103 1078 1072 1086 1101 1107 1119 1143 1160 1151 1123 1099 1090 1090 1095 1104 1111 1104 1085 1068 1067 1080 1094 1101 1099 1096 1093 1092 1095 1107 1123 1131 1122 1108 1108 1124 1136 1132 1123 1123 1126 1120
1442A120j7j6pj%jrj2JK7L7J3k3m2l7k2rMJ3J6J3J2J3Oj2k9l4j8J0L1K8Mj8j9jJ4J5QK%jK
$$ 1120 1103 1087 1080 1079 1079 1078 1069 1057 1058 1085 1122 1135 1112 1070 1033 1011 1002 1006 1019 1035 1048 1060 1073 1079 1067 1038 1004 986 996 1027 1055 1059 1041 1022 1021 1035 1050 1058 1060 1060 1059 1061
1437A061MRK1L8M1K4ql3m3m0k5oQPknJNJjjlj1j4lJ5K1J0lqpj0j6k1j6kJ0K1K8K8K0OlkMQ
$$ 1061 1065 1074 1095 1133 1174 1198 1190 1157 1114 1074 1049 1043 1051 1058 1056 1051 1052 1057 1058 1057 1056 1053 1042 1028 1025 1040 1061 1071 1068 1060 1053 1043 1027 1006 990 988 998 1019 1047 1075 1095 1101 1098 1096 1100 1108
1431A108Mmj1j5j3j0j2j8k2j6%J6L1L6L1J5MJ1K7L7K9Oj7l0k8j3JLlkJ2K5K2Oj0pPJ2kk3l0
$$ 1108 1112 1108 1097 1082 1069 1059 1047 1029 1007 991 991 1007 1038 1074 1105 1120 1124 1135 1162 1199 1228 1234 1217 1187 1159 1146 1147 1150 1147 1145 1157 1182 1204 1210 1200 1193 1200 1212 1210 1187 1157
1426A157j5mj1k3j5J1L1L1J7nk3l0k2j3j9l0k4JJ7J1LRK3K2J2Mok0k5rK1L2K3J3J8K0Qj1j8
$$ 1157 1142 1138 1127 1104 1089 1100 1131 1162 1179 1174 1151 1121 1099 1086 1067 1037 1013 1014 1031 1042 1045 1054 1077 1099 1111 1115 1109 1089 1064 1055 1076 1108 1131 1144 1162 1182 1190 1179 1161
1422A161j2pj3j9pJ5K1Kk3k8j5pj0kK4M4M3L3K8K1Kk0l1l8n1o0m7k5j3pJ1L9M7K6mk2k8k1
$$ 1161 1149 1142 1129 1110 1103 1118 1139 1141 1118 1090 1075 1068 1058 1056 1080 1124 1167 1200 1228 1249 1251 1231 1200 1162 1111 1051 1004 979 966 959 970 1009 1056 1082 1078 1056 1028 1007
1417A007LL2L9K3QN%j6j7JK2K4J7J3jl1n4m3mK4K6K0K1K5J9Mj2j7qJ2K9L5L3K7J7Nkkrk6l1
$$ 1007 1010 1042 1081 1104 1112 1117 1117 1101 1084 1085 1107 1131 1148 1161 1160 1129 1075 1032 1028 1052 1078 1098 1119 1144 1163 1167 1155 1138 1130 1142 1171 1206 1239 1266 1283 1288 1286 1284 1275 1249 1218
1412A218j0J4J2j1k6k1j1nPK1J6qk6k5j2mKJ0J2MkKNpj4%L0M3K5%rLJ3Pj0k5k7k3k0j6jK3
$$ 1218 1208 1222 1234 1223 1197 1176 1165 1160 1167 1188 1204 1196 1170 1145 1133 1129 1131 1141 1153 1157 1155 1157 1162 1155 1141 1141 1171 1214 1239 1239 1230 1233 1246 1253 1243 1218 1191 1168 1148 1132 1131 1154
1407A154M2M1K4Poj7k8l1k4qRJ7J5RJ5K9L2J6jmKLmn%Jpj7j6oLQLlnLJ7K2J3OJ0K3K9J6j1
$$ 1154 1196 1237 1261 1268 1262 1245 1217 1186 1162 1154 1163 1180 1195 1204 1219 1248 1280 1296 1295 1291 1293 1296 1292 1287 1287 1288 1281 1264 1248 1242 1245 1253 1256 1253 1248 1251 1268 1290 1303 1309 1319 1342 1371 1387 1376
1401A376k8j8KQkj1jJ1OmMK5L8K9J3OKkmklrj2rj4k9l8k7j2qpOK4K3R%MMjKJ2J9J8J7K1J7
$$ 1376 1348 1330 1332 1340 1338 1327 1326 1337 1343 1339 1343 1368 1406 1435 1448 1454 1456 1454 1450 1448 1445 1436 1424 1415 1401 1372 1334 1307 1295 1287 1280 1286 1310 1333 1342 1342 1346 1350 1349 1351 1363 1382 1400 1417 1438 1455
1396A455ok8k8j0OJ2J4J4J5K3L2K9Ll2n5n4m1k1MK0J5j0k9j8J2L1L1K0R%pmQJ7J6QKOJ3K3
$$ 1455 1449 1421 1393 1383 1389 1401 1415 1429 1444 1467 1499 1528 1531 1499 1444 1390 1349 1328 1332 1352 1367 1357 1328 1310 1322 1353 1384 1404 1413 1413 1406 1402 1410 1427 1443 1451 1453 1459 1472 1495
1391A495L3L7L3K4J5Pok2k7j6%NKJ1L1M5L7K1J6K7L6L2J8Oj%NJ2J3Opj5j2KJ1Q%lk%kjK%o
$$ 1495 1528 1565 1598 1622 1637 1644 1638 1616 1589 1573 1573 1578 1580 1591 1622 1667 1704 1725 1741 1768 1804 1836 1854 1860 1859 1859 1864 1876 1889 1895 1888 1873 1861 1863 1874 1882 1882 1879 1877 1877 1875 1874 1876 1876 1870
1385A870oRK2J8LlOJ1KrlK0M0M6M1L1K1J3J0J7L4M4L8J2j3k0mJ1Roj6qKKnqKJ5K1J4lj8k7
$$ 1870 1864 1873 1895 1913 1916 1913 1919 1930 1932 1923 1920 1940 1980 2026 2067 2098 2119 2132 2142 2159 2193 2237 2275 2287 2274 2254 2250 2261 2270 2264 2248 2240 2242 2244 2239 2231 2233 2248 2269 2283 2280 2262 2235
1380B235k8j9j0LJ6L0L4J6j5l5k9nJ1R%%NPPRJ2MkKJ8K8K5J9K2K7K1J5J9L3L6K7K0J9J1rk7
$$ 2235 2207 2188 2178 2181 2197 2227 2261 2277 2262 2227 2198 2193 2204 2213 2213 2213 2218 2225 2232 2241 2253 2257 2255 2257 2275 2303 2328 2347 2369 2396 2417 2432 2451 2484 2520 2547 2567 2586 2597 2588 2561
1375B561k2%J6J6Omj2j4j1qj5k3j5J1K7J8Knqk1l1j5K4M4L0Nj0j8k8l5k7rMJ6L4N5N9M8M0
$$ 2561 2539 2539 2555 2571 2577 2573 2561 2547 2536 2528 2513 2490 2475 2486 2513 2531 2533 2528 2520 2499 2468 2453 2477 2521 2551 2556 2546 2528 2500 2465 2438 2429 2433 2449 2483 2538 2597 2645 2685
1370B685L9L6J7pj1NK8L8L5L3M2N4N0L4K0K3L2K7J1jkNPPKoj0KK0K6J7J3K5L2K3J0J9M1N8
$$ 2685 2724 2760 2777 2770 2759 2764 2792 2830 2865 2898 2940 2994 3044 3078 3098 3121 3153 3180 3191 3190 3188 3193 3200 3207 3209 3203 3193 3195 3215 3241 3258 3271 3296 3328 3351 3361 3380 3421 3479
1366C479N8N1N0M6M3M2M4M4L8L5L4K2KpJ6N8Q8Q5O4M2K9J9J3K0M4O8P5O3M9M7N3N7N3N0N0
$$ 3479 3537 3588 3638 3684 3727 3769 3813 3857 3895 3930 3964 3986 3988 3981 3997 4055 4143 4228 4292 4334 4363 4382 4395 4415 4459 4527 4602 4665 4714 4761 4814 4871 4924 4974 5024
1361E024N4O4P9R6J08J09R9Q7Q4R3J00R4P5O1O6Q7J16J43J59J54J31J16J24J47J61J61J54
$$ 5024 5078 5142 5221 5317 5425 5534 5633 5720 5804 5897 5997 6091 6166 6227 6293 6380 6496 6639 6798 6952 7083 7199 7323 7470 7631 7792 7946
1358G946J45J38J33J36J45J53J64J90K20K34K22K05K10K37K66K86K98L10L25L43L59L70L93
$$ 7946 8091 8229 8362 8498 8643 8796 8960 9150 9370 9604 9826 10031 10241 10478 10744 11030 11328 11638 11963 12306 12665 13035 13428
1355A3428M41N01N34N23M97M98N34N82O26O75P28P77Q25Q80R54J031J105J170J232J291J367
$$ 13428 13869 14370 14904 15427 15924 16422 16956 17538 18164 18839 19567 20344 21169 22049 23003 24034 25139 26309 27541 28832 30199
1353C0199J472J605J743J876K014K163K309K432K543K657K774K867K932K987L042L090L133
$$ 30199 31671 33276 35019 36895 38909 41072 43381 45813 48356 51013 53787 56654 59586 62573 65615 68705 71838
1350G1838L194L308L485L717L992M297M618M935N240N538N826O115O438O854P415Q147R048
$$ 71838 75032 78340 81825 85542 89534 93831 98449 103384 108624 114162 119988 126103 132541 139395 146810 154957 164005
1348A64005J0129J1405J2893J4605J6564J8808K1381K4309K7590L1178L4980L8876M2718M6317
$$ 164005 174134 185539 198432 213037 229601 248409 269790 294099 321689 352867 387847 426723 469441 515758
1347E15758M9342N1243N1235M8457M2313L2870K1029Q270l936j4663k3659l1038l6892m1141
$$ 515758 565100 616343 667578 716035 758348 791218 812247 820517 816581 801918 778259 747221 710329 669188
1345F69188m3697m4657m4342m3111m1202l8712l5731l2431k9030k5728k2661j9929j7585j5624
$$ 669188 625491 580834 536492 493381 452179 413467 377736 345305 316275 290547 267886 247957 230372 214748
1343B14748j3997j2654j1545j0615r793r030q320p674p084o536o026n554n122m743m436m198
$$ 214748 200751 188097 176552 165937 156144 147114 138794 131120 124036 117500 111474 105920 100798 96055 91619 87421
1341H7421m001l806l608l422l238l041k836k649k494k359k230k111k002j905j818j749j693
$$ 87421 83420 79614 76006 72584 69346 66305 63469 60820 58326 55967 53737 51626 49624 47719 45901 44152 42459
1339D2459j632j560j491j432j379j323j274j237j195j139j081j033r84r22q53p95p46p00o58
$$ 42459 40827 39267 37776 36344 34965 33642 32368 31131 29936 28797 27716 26683 25699 24777 23924 23129 22383 21683 21025
1337B1025o27n96n51m95m51m31m26m27m30m26l99l60l37l37l40l28l14l07l05k91k72k61k62
$$ 21025 20398 19802 19251 18756 18305 17874 17448 17021 16591 16165 15766 15406 15069 14732 14392 14064 13750 13443 13138 12847 12575 12314 12052
1334A2052k62k53k26j96j81j97k20k24k03j87j84j81j72j72j82j77j47j25j35j52j42j11j01
$$ 12052 11790 11537 11311 11115 10934 10737 10517 10293 10090 9903 9719 9538 9366 9194 9012 8835 8688 8563 8428 8276 8134 8023 7922
1331G922j21j35j30j17j09r8q0p6r0j10j14j10j06j07j06j08j12j11j07j04j05r9q3o5n3l9
$$ 7922 7801 7666 7536 7419 7310 7212 7132 7056 6966 6856 6742 6632 6526 6419 6313 6205 6093 5982 5875 5771 5666 5567 5484 5419 5366 5327
1328E327k4k2l7n3n1l9l7m9o3p4q8j02j04q9o2l6j9j7k6l5m4n6p3p6n7l2k1j8j4j4k4m1m0
$$ 5327 5303 5281 5244 5191 5140 5101 5064 5015 4952 4878 4790 4688 4584 4495 4433 4397 4378 4361 4335 4300 4256 4200 4127 4051 3994 3962 3941 3923 3909 3895 3871 3830 3790
1324C790k0lmk0m0o3q0p6n2k7k1k6l6m1m4l7k3j3j8l2m3m6m3l0qROj0j9j4j5l7p0q5o9l5j4
$$ 3790 3770 3767 3763 3743 3703 3640 3560 3484 3432 3405 3384 3358 3322 3281 3237 3200 3177 3164 3146 3114 3071 3025 2982 2952 2944 2953 2959 2949 2930 2916 2901 2864 2794 2709 2640 2605 2591
1320B591j3k2k1j3oqj0j2j0rplKK%nj2k8m1l6j4OMj8l8m1k6kJ8K3Lk5m0k8j3k0m0l9j0K1K4
$$ 2591 2578 2556 2535 2522 2516 2508 2498 2486 2476 2467 2460 2457 2459 2461 2461 2456 2444 2416 2375 2339 2325 2331 2335 2317 2279 2238 2212 2210 2228 2251 2254 2229 2189 2161 2148 2128 2088 2049 2039 2060 2084
1315B084Opo%PJ3Pj7m9o3n0l1j9j9j8j5oPRpk9l5j5RK2K0J4J0NMLpk6l6k9j4oomPJ4Rlj1r
$$ 2084 2090 2083 2077 2077 2084 2097 2104 2087 2038 1975 1925 1894 1875 1856 1838 1823 1817 1824 1833 1826 1797 1762 1747 1756 1778 1798 1812 1822 1827 1831 1834 1827 1801 1765 1736 1722 1716 1710 1706 1713 1727 1736 1733 1722 1713
1309A713mj4l3m2k9j1j6l5l0MK6J4j0qJ8L3K5J2J1J7J6J6J2%j8k3j4oj4k4k7k5l0l2k2lO%
$$ 1713 1709 1695 1662 1620 1591 1580 1564 1529 1499 1503 1529 1543 1533 1525 1543 1576 1601 1613 1624 1641 1657 1673 1685 1685 1667 1644 1630 1624 1610 1586 1559 1534 1504 1472 1450 1447 1453 1453
1304A453j5k3j7lQNmj1j1okoj5k4k0mJ1Rjrj4k4l4k9oQOlKJ4J5%j5j8rLJ5J8J7J6J6NrrJ1
$$ 1453 1438 1415 1398 1395 1403 1408 1404 1393 1382 1376 1374 1368 1353 1329 1309 1305 1316 1325 1324 1315 1301 1277 1243 1214 1208 1216 1222 1219 1221 1235 1250 1250 1235 1217 1208 1211 1226 1244 1261 1277 1293 1298 1289 1280 1291
1299A291K7Pl4n4l5olk2k7rJ2J0moJ4L3K9Lk6l6k3%J7K2K4K7L0K5Rj1k5k9k3k0k5l8m5l5p
$$ 1291 1318 1325 1291 1237 1202 1196 1193 1171 1144 1135 1147 1157 1153 1147 1161 1194 1223 1226 1200 1164 1141 1141 1158 1180 1204 1231 1261 1286 1295 1284 1259 1230 1207 1187 1162 1124 1079 1044 1037
1294A037J8K3J0JOJ0OnlJ0J3pk7k4kJ1nk3j6J1K5J7OQJ5PmmMRJ5L0M2L1Lj3nPLqpLL%PJ7J5
$$ 1037 1055 1078 1088 1089 1095 1105 1111 1106 1103 1113 1126 1119 1092 1068 1066 1077 1072 1049 1033 1044 1069 1086 1092 1100 1115 1122 1118 1114 1118 1127 1142 1172 1214 1245 1248 1235 1230 1237 1240 1232 1225 1228 1231 1231 1238 1255 1270
1288A270mj9j7mK%kLJ2J8J0ok2k9l2l6m1l7j9PK9L1J6joNJ0Kj2j4oK%ooOK2L0K0mk4l1l4l8
$$ 1270 1266 1247 1230 1226 1228 1228 1226 1229 1241 1259 1269 1263 1241 1212 1180 1144 1103 1066 1047 1054 1083 1114 1130 1129 1123 1128 1138 1140 1128 1114 1108 1110 1110 1104 1098 1104 1126 1156 1176 1172 1148 1117 1083 1045
1283A045l5j6J2K8L0K6K3J7J1J4K1K5J9R%rj4j4j0rpmlj6l3l5rK7M8M3K5Mj3k7l2k6rOJ3J3
$$ 1045 1010 994 1006 1034 1064 1090 1113 1130 1141 1155 1176 1201 1220 1229 1229 1220 1206 1192 1182 1173 1166 1162 1159 1143 1110 1075 1066 1093 1141 1184 1209 1213 1200 1173 1141 1115 1106 1112 1125 1138
1278A138J2J2jk3l0qJ7J0k4m3k9prk2j6J2L7L8K2MqqkLMPJ5J9J6Mj0k4k8j6QK7K4J4Okj8l2
$$ 1138 1150 1162 1161 1138 1108 1100 1117 1127 1103 1060 1031 1024 1015 993 977 989 1026 1064 1086 1090 1082 1074 1072 1075 1079 1086 1101 1120 1136 1140 1130 1106 1078 1062 1070 1097 1121 1135 1141 1139 1121 1089
1273A089k9j4oj7k7k5j1KPNjjJ1K7L0J7QQJ1Jj6k8k6j9j7j7j5qJKpj8rK1N0N7L8J1rj6j4j0
$$ 1089 1060 1046 1040 1023 996 971 960 962 969 974 973 972 983 1010 1040 1057 1065 1073 1084 1085 1069 1041 1015 996 979 962 947 939 940 942 935 917 908 929 979 1036 1074 1085 1076 1060 1046 1036
1268A036j0j7k2j7lRJ3J2J0J3K1K8K9J5kj3j9k8l5k8nJ4J7J3J6K3K3J3RP%j5j9pJ0J7K1K8
$$ 1036 1026 1009 987 970 967 976 989 1001 1011 1024 1045 1073 1102 1117 1115 1102 1083 1055 1020 992 987 1001 1018 1031 1047 1070 1093 1106 1115 1122 1122 1107 1088 1081 1091 1108 1129 1157
1263A157K9J2j4l5m1l6k2lJ3Rnj2mK%jLMoj8k2j9j8j5oJOJ6L0L6K1lj5j4j4k0j9j1jJOJ5K0
$$ 1157 1186 1198 1184 1149 1108 1072 1050 1047 1060 1069 1064 1052 1048 1050 1050 1049 1052 1056 1050 1032 1010 991 973 958 952 953 959 975 1005 1041 1062 1059 1044 1030 1016 996 977 966 965 966 972 987 1007
1258A007J5Kj3k0j5PL1L7K5J0kj4k1j5RL0L1J8Lqj6j9j6j0lNQM%PK5L2J5j4k6j6kMKlol%%
$$ 1007 1022 1024 1011 991 976 983 1014 1051 1076 1086 1084 1070 1049 1034 1043 1073 1104 1122 1125 1117 1101 1082 1066 1056 1053 1058 1066 1070 1070 1077 1102 1134 1149 1135 1109 1093 1091 1095 1097 1094 1088 1085 1085 1085
1253A085pj5j3nMRJ0OknLJ3Oj9m0m2k7j0jlj0j2kO%j4j5KJ5OrpJ0J8J5J5K0K0J6J5J5%j6j2
$$ 1085 1078 1063 1050 1045 1049 1058 1068 1074 1072 1067 1070 1083 1089 1070 1030 988 961 951 950 947 937 925 923 929 929 915 900 902 917 923 914 907 917 935 950 965 985 1005 1021 1036 1051 1051 1035 1023
1247A023J1K1ol9l5lJ5OkOJ3LoJJ1kl0m3k4J3M2N2L8Pk1k5rLLkKJ3K1K1J4Mnqj0j7k8k8k1
$$ 1023 1034 1055 1049 1010 975 972 987 993 991 997 1010 1013 1007 1008 1019 1017 987 944 920 933 975 1027 1065 1072 1051 1026 1017 1020 1023 1021 1023 1036 1057 1078 1092 1096 1091 1083 1073 1056 1028 1000 979
1242I79qLJ7K1J0j0j7rJkqj1j5k6k3lJ7J7Mj0k0k6j9NK5K3J4K1L4K4j2l5k4NK6L2L0K1Qlj0
$$ 979 971 974 991 1012 1022 1012 995 986 987 985 977 966 951 925 902 899 916 933 937 927 907 881 862 867 892 915 929 950 984 1008 996 961 937 942 968 1000 1030 1051 1059 1056 1046
1237A046j2pRK4J4j2k6j5kqj9k5k7m0m8l6j1PJ4K2L2K8J5QJ5J8J0jk%NPJ0QJnppmJ0K4K9J5
$$ 1046 1034 1027 1036 1060 1074 1062 1036 1021 1019 1011 992 967 940 900 852 816 805 812 826 848 880 908 923 931 946 964 974 973 971 971 976 983 993 1001 1002 997 990 983 979 989 1013 1042 1057
1232A057kj1j2kK0M3N0L0Kj8l0m1m4l2j5orqmj0k7l0rK2L5L1K1J3Lrj5j2rrpnqj9k6k3j3l
$$ 1057 1055 1044 1032 1030 1050 1093 1143 1173 1175 1157 1127 1086 1042 1010 995 989 980 972 968 958 931 901 892 914 949 980 1001 1014 1017 1008 993 981 972 963 956 951 943 924 898 875 862 859
1227H59QJ7K4K3K3K3J1j0j7LK7K3j0l2k4okml%nj0JK0L0J9Jj2j7j2QL5M6L9J8jj6k5k8k6k0
$$ 859 867 884 908 931 954 977 988 978 961 964 991 1014 1004 972 948 942 940 936 933 933 928 918 919 939 969 988 989 977 960 948 956 991 1037 1076 1094 1093 1077 1052 1024 998 978
1221I78rKLlJK2M5L5nl9m6l7k8k1lJ8K6K3J4Nqj7qJ2K0Mj6j8pKkppmlJJ4K7K9J5lj2j5k2k8
$$ 978 969 971 974 971 972 994 1039 1074 1069 1030 984 947 919 898 895 913 939 962 976 981 973 956 948 960 980 984 968 950 943 945 943 936 929 925 922 923 937 964 993 1008 1005 993 978 956 928
1216I28k0kJ1Plj0j6l2m4l6pK4L7L5K9J7jj6j7oJ0K0K4K1J3Knqrj4j8j3jJ1J4J0Mmk2l7l8
$$ 928 908 906 917 924 921 911 895 863 819 783 776 800 837 872 901 918 917 901 884 878 888 908 932 953 966 968 963 955 946 932 914 901 900 911 925 935 939 935 913 876 838
1211H38j6J8M4N2L8Ml2m9l3lJ3J2J1J9K7J5j1l0l0k3j7j6j2JK1L8M2L2J4MRK1L0K8J6jk0l4
$$ 838 822 840 884 936 974 978 946 897 864 861 874 886 897 916 943 958 947 917 887 864 847 831 819 820 841 879 921 953 967 971 980 1001 1031 1059 1075 1074 1054 1020
1206A020l7k5pKJmjJ0J2Jj3j5omj2j9j5j4k4l6k9rQQNJ1K5L4L4L1K3J6J0LmqkRJ6Pqj4j1m
$$ 1020 983 958 951 953 954 950 949 959 971 972 959 944 938 934 922 903 888 874 850 814 785 776 784 792 797 808 833 867 901 932 955 971 981 984 980 972 970 979 995 1002 994 980 969 965
1201I65NJ6K0J5KomJLLMQOj0l8n6m5rK4L2J5lj0j0prrjJ4K2Qj7k5rJ4J2nqQJ6%k5l4k0mMl
$$ 965 970 986 1006 1021 1023 1017 1013 1014 1017 1020 1024 1032 1038 1028 990 934 889 880 904 936 951 948 938 928 921 912 903 902 916 938 946 929 904 895 909 921 916 908 916 932 932 907 873 853 849 853 850
1195H50j1rJ0L0L3K4K2K7K1pk9j9J2K8J4j3l0l2k7k1j4lRJ4J1MLPJ1J7K4K9K0OLJ2Rj6l9l1
$$ 850 839 830 840 870 903 927 949 976 997 990 961 942 954 982 996 983 953 921 894 873 859 856 865 879 890 894 897 904 915 932 956 985 1005 1011 1014 1026 1035 1019 980 949
1190I49kJ6J2MNJ3J4J1QOKpj8k6j9kJ1Plrj2k2k7j7LJ2J0J1J2Jj7j8lJj4k2ML9M6K0onJ4K6
$$ 949 947 963 975 979 984 997 1011 1022 1030 1036 1038 1031 1013 987 968 966 977 984 981 972 960 938 911 894 897 909 919 930 942 943 926 908 905 906 892 870 874 913 959 979 973 968 982 1008
1185A008J5qj7kK1K6Nj8k6k0rKJ2Oj4k7k2pKRK3L5K4j2m7n6l4jK6K7Qj6l0l6m1l5j3J3K7L6
$$ 1008 1023 1015 998 996 1017 1043 1048 1030 1004 984 975 977 989 995 981 954 932 925 927 936 959 994 1018 1006 959 903 869 868 894 921 929 913 883 847 806 771 758 771 798 834
1180H34M9N1K9KJJ8J6j2l2k5j7k4l0j4OQmlJj1l0k9mJ7K4K8L6L7K2J0QKj5l0k3JK0K5J5mk8
$$ 834 883 934 963 965 966 984 1000 988 956 931 914 890 860 846 852 860 856 853 854 843 813 784 780 797 821 849 885 922 944 954 962 964 949 919 896 897 917 942 957 953 925
1175I25l8k8jK3L7L9L0J5Lnrj4pJ3L6L6K0PJ4K2J2j9m5m5k4kPkj1j0mkljMJ2K1L8N0L5Lj9
$$ 925 887 859 858 881 918 957 987 1002 1005 1000 991 977 970 983 1019 1055 1075 1082 1096 1118 1130 1111 1066 1021 997 995 1002 1000 989 979 975 973 970 969 973 985 1006 1044 1094 1129 1132 1113
1170A113j6j0k2m0l0jJ6Lj8k7k3j8j0NJ7J7QKok0k9k2%J5J3mk6m2m1k1QK5K6K5L0L1K4R%n
$$ 1113 1097 1087 1065 1025 995 994 1010 1013 995 968 945 927 917 922 939 956 964 966 960 940 911 889 889 904 917 913 887 845 804 783 791 816 842 867 897 928 952 961 961 956
1165I56nlloj5j5jJ6K1J5N%%LPLpj1nJpk0k5k4k7k9j2J8M0L8K3J0%j5k5k5k0j9k0qJ2K6K9
$$ 956 951 948 945 939 924 909 908 924 945 960 965 965 965 968 975 978 971 960 955 956 949 929 904 880 853 824 812 830 870 908 931 941 941 926 901 876 856 837 817 809 821 847 876
1160H76K6J7kk2k4j0MNJ0K6M1L9K1O%jjKNkj7k4j6PK5L4L4K6J0nj1rpplLKj2k5k5j5j2k3l0
$$ 876 902 919 917 895 871 861 865 870 880 906 947 986 1007 1013 1013 1012 1011 1013 1018 1016 999 975 959 966 991 1025 1059 1085 1095 1090 1079 1070 1063 1056 1053 1056 1058 1046 1021 996 981 969 946 916
1154I16k2j1j3k1j6KJ5J2NPRRRJ3Oj7l3k6JJ9K1J3Moj3j1%QJ1J4J4Jj2rQJ9J1K%ok1l7m0l7
$$ 916 894 883 870 849 833 835 850 862 867 874 883 892 901 914 920 903 870 844 845 864 885 898 902 896 883 872 872 880 891 905 919 920 908 899 907 926 937 939 939 933 912 875 835 798
1149G98l4k2PL0K8OlRK1J6jj5k5k5j4MJ8K6K8K5Oj7k3pJ3K1K3K0J2kj0j1k0l7m1j6K0M1M2
$$ 798 764 742 749 779 807 813 810 819 840 856 855 840 815 790 776 780 798 824 852 877 883 866 843 836 849 870 893 913 925 923 913 902 882 845 804 788 808 849 891
1144H91L6K9Ol0n5n1k3KJ1jj7k0%K9M0L2K1K3K5Qk2m3l7j7mnj1r%J1K1L2L6K9J7J0QKj3k4
$$ 891 927 956 962 932 877 826 803 805 816 815 798 778 778 807 847 879 900 923 948 956 934 891 854 837 833 828 817 808 808 819 840 872 908 937 954 964 972 974 961 937
1139I37k1j3qlLJpj1JK0J8kj7j2LJ1J0QJ2J4PmlJ7M4M7K1j2k4j8j8k7l3k4j5j1qOJ6PqrMJ2
$$ 937 916 903 895 892 895 896 889 878 879 899 917 915 898 886 889 900 910 918 930 944 951 947 944 961 1005 1052 1073 1061 1037 1019 1001 974 941 917 902 891 883 889 905 912 904 895 899 911
1134I11Qjj4k9m1l8j8MJ1J0J5J9Pk2m3l3ML9N0M0K4J1jrpJQMj2l0l8l2j9rqmNJ7K0J8J6K0
$$ 911 919 918 904 875 834 796 778 782 793 803 818 837 844 822 779 746 750 789 839 879 903 914 913 904 897 898 906 910 898 868 830 798 779 770 762 758 763 780 800 818 834 854
1129H54K2K4K5J7kk8l7k7j1lkJNJ2K0L3L7K3jj9k4k4k2j7pLOOOMKJJJjmkLRJ4J6J6K1K9L1
$$ 854 876 900 925 942 940 912 875 848 837 834 832 833 838 850 870 903 940 963 962 943 919 895 873 856 849 852 858 864 870 874 876 877 878 879 878 874 872 875 884 898 914 930 951 980 1011
1123A011K1Jk0l1k6rQRlqPK3J4j0k7j9pj0k4l1k7j8pPK0L2L7L1J1j3k6j7kkj0j0%J0PLMN%
$$ 1011 1032 1033 1013 982 956 947 955 964 961 953 960 983 997 987 960 941 934 924 900 869 842 824 817 824 844 876 913 944 955 942 916 899 897 895 885 875 875 885 892 895 899 904 904
1118I04kMJ5J7Kj7k8j9RL9N1L2nl7n1m3j9OJ6PoJK3L7L2J1j0k6l6k7lK1K3Qnppj3k4k9k0M
$$ 904 902 906 921 938 940 923 895 876 885 924 975 1007 1002 965 914 871 852 858 874 881 875 876 899 936 968 979 969 943 907 880 877 898 921 929 924 917 910 897 873 844 824 828
1113H28K8L8K4OPK5L6K8J4OKrj2jJ5J2qk4k6k4k2j5nMNKLQJ2J4J2O%JQPrk8l4k5mJ5L1L4K6
$$ 828 856 894 918 924 931 956 992 1020 1034 1040 1042 1033 1021 1020 1035 1047 1039 1015 989 965 943 928 923 927 932 934 937 945 957 971 983 989 989 990 998 1005 996 968 934 909 905 920 951 985 1011
1107A011J5J1J2Qok3l1k4j0NJ0%k5m8m6j5J9L4K4J3J1J0Jpqqj5j8qJ3K3K2K1K2J3mrKJ0pl6
$$ 1011 1026 1037 1049 1057 1051 1028 997 973 963 968 978 978 953 905 859 844 863 897 921 934 945 955 956 949 941 933 918 900 892 905 928 950 971 993 1006 1002 993 995 1005 998 962
1102I62m7l2oJ6K7L0K3J1lj4j7rOJ2QNJ0J0kj5j2PJ7J1kpnpj7k8l5k9j3OJ2PJLQRJ1J6J5O
$$ 962 915 883 877 893 920 950 973 984 981 967 950 941 947 959 967 972 982 992 990 975 963 970 987 998 996 989 984 977 960 932 897 868 855 861 873 880 881 884 892 901 912 928 943 949
1097I49mnjlj2k3k3j3MJ9K5K4J8Ork3l0l1k1nJ1J2%j0oQJ6J8K5M0M4L3J3lj4k9m2l7j5J2K7
$$ 949 945 940 939 936 924 901 878 865 869 888 913 937 955 961 952 929 899 868 847 842 853 865 865 855 849 857 873 891 916 956 1000 1033 1046 1043 1029 1000 958 921 906 918 945
1092I45L0K5J2nk3l5l4k5j3KJ2J9J5PkmkMPOkp%J3J1j0k8k3plj2j7j1qqKK2K8Qj8j9%J6J7
$$ 945 975 1000 1012 1007 984 949 915 890 877 879 891 910 925 932 930 926 924 928 935 941 939 932 932 945 956 946 918 895 888 885 873 856 845 837 829 831 853 881 889 871 852 852 868 885
1087H85J2QOQJ3J4RKOJ5J6Pjrk6m4l9jM1N4M4L1K5J6JnPK0J4pk4k1qnj5k2j6%Qlk6m4m7k8
$$ 885 897 905 911 919 932 946 955 957 963 978 994 1001 1000 991 965 921 882 881 922 976 1020 1051 1076 1092 1093 1088 1095 1115 1129 1122 1098 1077 1069 1064 1049 1027 1011 1011 1019 1016 990 946 899 871
1081H71OL5M1L0J7J5K2K7K5J7Mj4l0l7k7qJ1K1J7Jj6k0j0NJ0%rkJ4K8K7K4K7L3L0J7LmkRK3
$$ 871 877 912 953 983 1000 1015 1037 1064 1089 1106 1110 1096 1066 1029 1002 994 1005 1026 1043 1044 1028 1008 998 1003 1013 1013 1004 1002 1016 1044 1071 1095 1122 1155 1185 1202 1205 1201 1199 1208 1231
1076A231L3L2J9Jj6l3m2m1k5LK5L1K3K0K8L3K0nj8j0JkrmQLj6k5j8qj2j7oJ1J0pk3k5j8rn
$$ 1231 1264 1296 1315 1316 1300 1267 1225 1184 1159 1162 1187 1218 1241 1261 1289 1322 1342 1337 1319 1309 1310 1308 1299 1295 1303 1306 1290 1265 1247 1239 1227 1210 1204 1215 1225 1218 1195 1170 1152 1143 1138
1071A138qj0qKJ3J1OOQLj1j8j5j7l3m6l4KL5M0K2Kj3k4l1l3k4pRJ1LqqLJ0Nj0k0k5k4j8%K1
$$ 1138 1130 1120 1112 1114 1127 1138 1144 1150 1158 1161 1150 1132 1117 1100 1067 1021 987 989 1024 1064 1086 1088 1075 1051 1020 987 963 956 965 976 979 971 963 966 976 981 971 951 926 902 884 884 905
1066I05L1L0K7K9K7J1j0rJ2L6M0K7J0lqj2j6k1k3j3OK4K7J7nl3n5n5m0k9k7k2nRPjRL2M0J7
$$ 905 936 966 993 1022 1049 1060 1050 1041 1053 1089 1129 1156 1166 1163 1155 1143 1127 1106 1083 1070 1076 1100 1127 1144 1139 1106 1051 996 956 927 900 878 873 882 889 888 897 929 969 986
1061I86j1k1j3lmj6k4k3j3kJoj3j1JJ1Rmj4pJ3K2QqlJ2J6MNK5M0K5nj7nOkk0k9j7QK5J9NJ
$$ 986 975 954 941 938 934 918 894 871 858 856 857 851 838 827 828 839 848 844 830 823 836 858 866 858 855 867 883 887 892 917 957 982 977 960 955 961 959 939 910 893 901 926 945 950 951
1056I51J3K1Ok2l8l1j3%%qj3j2n%QK1L2L2J7OMlk3l8k7mPOJ1K6K7Kk2j9%J1NnpjNJ2J2RNQ
$$ 951 964 985 991 969 931 900 887 887 887 879 866 854 849 849 857 878 910 942 959 965 969 966 943 905 878 874 881 887 898 924 951 953 931 912 912 923 928 923 916 915 920 932 944 953 958 966
1050I66J6K4K5K0Mk2m5m5k1OJ4Olmpj3j1PK7L2K1QNMoj8j5OK5K7J3%rj7k6l3l4k3oMjj2j6
$$ 966 982 1006 1031 1051 1055 1033 988 943 922 928 942 948 945 941 934 921 910 917 944 976 997 1005 1010 1014 1008 990 975 981 1006 1033 1046 1046 1037 1020 994 961 927 904 898 902 901 889 873
1045H73qKJ1J7K0J0pj5j0JJ0J9L0L4K3Noj2k5l3j9J6M1L7J7OPLj0j8j7qNK4M4N0L4Qj4k1j9
$$ 873 865 867 878 895 915 925 918 903 893 894 904 923 953 987 1010 1015 1009 997 972 939 920 936 977 1014 1031 1037 1044 1047 1037 1019 1002 994 999 1023 1067 1117 1151 1159 1145 1124 1105
1040A105j4j5j7j8qNJ3RjmMJ7K3J1rj9j4lpk1l1k9k0j2lJ5L1L3K2P%MJ0R%j2j7j3oljLNL%
$$ 1105 1091 1076 1059 1041 1033 1038 1051 1060 1059 1055 1059 1076 1099 1110 1101 1082 1068 1065 1058 1037 1006 977 957 945 942 957 988 1021 1043 1050 1050 1054 1064 1073 1073 1061 1044 1031 1025 1022 1021 1024 1029 1032 1032
1034A032PJ7J6MNK2L5K3nk3j8j4k2l7l4j1J8L3K5Lj4j0QK1J3j4l8m2k4PL1L5K0LKK1M8N6L9
$$ 1032 1039 1056 1072 1076 1081 1103 1138 1161 1156 1133 1115 1101 1079 1042 1008 997 1015 1048 1073 1076 1062 1052 1060 1081 1094 1080 1042 1000 976 983 1014 1049 1069 1072 1074 1095 1143 1199 1238
1029A238Pk2l7m2l5j7QK3K0PJPJ1Lj5k9l5k5LL1M4L6J7M%no%Mok3k9j1J8L7L9K6QnmPJ7J8
$$ 1238 1245 1223 1186 1144 1109 1092 1100 1123 1143 1150 1151 1158 1169 1172 1157 1128 1093 1068 1071 1102 1146 1182 1199 1203 1203 1198 1192 1192 1196 1190 1167 1138 1127 1145 1182 1221 1247 1255 1250 1246 1253 1270 1288
1024A288J3Pok9m9m7k1J1K9K8J5MkjjJOJ7L0L2K3J0j%RK0K7K6K0J2jj4j7oNJ2J6K8L8M0L7
$$ 1288 1301 1308 1302 1273 1224 1177 1156 1167 1196 1224 1239 1243 1241 1240 1239 1240 1246 1263 1293 1325 1348 1358 1357 1357 1366 1386 1413 1439 1459 1471 1470 1456 1439 1433 1438 1450 1466 1494 1532 1572 1609
1019A609L7L6K0mj4kJ7K0J2J2L0N3O6O5M8K9K4L3M2L7L0L7N4O5O4O3O4O0N4O3Q9J06R8Q0Q3
$$ 1609 1646 1682 1702 1698 1684 1682 1699 1719 1731 1743 1773 1826 1892 1957 2005 2034 2058 2091 2133 2170 2200 2237 2291 2356 2420 2483 2547 2607 2661 2724 2813 2919 3017 3097 3180
1015C180J06J26J25J16J19J36J57J69J79J97K18K30K26K20K31K61K96L21L39L60L88M25M77
$$ 3180 3286 3412 3537 3653 3772 3908 4065 4234 4413 4610 4828 5058 5284 5504 5735 5996 6292 6613 6952 7312 7700 8125 8602
1012H602N38N99O54P17P91Q65R31R91J051J106J152J200J249J277J250J186J130J114J125
$$ 8602 9140 9739 10393 11110 11901 12766 13697 14688 15739 16845 17997 19197 20446 21723 22973 24159 25289 26403 27528
1010B7528J138J160J205J277J355J428J481J498J476J427J357J260J132R91Q74P96P52P44
$$ 27528 28666 29826 31031 32308 33663 35091 36572 38070 39546 40973 42330 43590 44722 45713 46587 47383 48135 48879
1008D8879P78Q50R19R47R26Q70P72O06L69R8j49l53n16o45p34p74p80p63p29o85o65o96p79
$$ 48879 49657 50507 51426 52373 53299 54169 54941 55547 55916 56014 55865 55512 54996 54351 53617 52843 52063 51300 50571 49886 49221 48525 47746
1005D7746q86r90j097j201j290j346j366j362j343j308j261j213j174j148j143j158j183j201
$$ 47746 46860 45870 44773 43572 42282 40936 39570 38208 36865 35557 34296 33083 31909 30761 29618 28460 27277 26076
1003B6076j199j182j157j131j107j080j048j014r87r62r20q51p70p04o56o08n47m84m36m05
$$ 26076 24877 23695 22538 21407 20300 19220 18172 17158 16171 15209 14289 13438 12668 11964 11308 10700 10153 9669 9233 8828
1000H828l73l41l17l10l07k92k59k32k22k23k13j97j85j85j83j69j51j42j35j17r3q9j05j18
$$ 8828 8455 8114 7797 7487 7180 6888 6629 6397 6175 5952 5739 5542 5357 5172 4989 4820 4669 4527 4392 4275 4182 4093 3988 3870
997C870j13r5q7r4j03j02r4q9q9p9n6l8m6o6p0n1l7m7o3n7l6j8j0nql4o6p7n9m2l6k9rONn
$$ 3870 3757 3662 3575 3481 3378 3276 3182 3093 3004 2925 2869 2831 2785 2719 2649 2598 2561 2514 2451 2394 2358 2340 2330 2325 2317 2283 2217 2140 2081 2039 2003 1974 1965 1971 1976 1971
993A971rj0j8k5k5l2m5m5k2mj0k3j5OQj0k5k5k1j3J0L6L2ml5l3j7j6k4k1j1rj6j8j6j7j9q
$$ 1971 1962 1952 1934 1909 1884 1852 1807 1762 1740 1736 1726 1703 1688 1694 1702 1692 1667 1642 1621 1608 1618 1654 1686 1682 1647 1614 1597 1581 1557 1536 1525 1516 1500 1482 1466 1449 1430 1422
988A422J5L1K6%l0m5l4pR%j3oRPj7l3k0KJ0kj9k7k6j6o%KMJ2J2Jj5k6k7k2j0MJ6J2rl6m9m4
$$ 1422 1437 1468 1494 1494 1464 1419 1385 1378 1387 1387 1374 1368 1377 1384 1367 1334 1314 1316 1326 1324 1305 1278 1252 1236 1230 1230 1232 1236 1248 1260 1261 1246 1220 1193 1171 1161 1165 1181 1193 1184 1148 1099 1055
983A055k3kJ1J6J9K6L0K5Qj6l1k6nJ7K4J7OOJ2J2LjPJ5Lk6m6l9j6j%mpj4j3NL5M6K8jj6j7
$$ 1055 1032 1030 1041 1057 1076 1102 1132 1157 1165 1149 1118 1092 1087 1104 1128 1145 1151 1157 1169 1181 1184 1183 1190 1205 1208 1182 1136 1097 1081 1080 1080 1076 1069 1055 1042 1047 1082 1128 1156 1155 1139 1122
978A122k0l1l5k6j4kMKoj9k2j2PK6M2M5L1Oj1j0klj3k3k3j3QK6K6Qj6k7k0qMJ4K3L1L3K6N
$$ 1122 1102 1071 1036 1010 996 994 998 1000 994 975 953 941 948 974 1016 1061 1092 1098 1087 1077 1075 1072 1059 1036 1013 1000 1008 1034 1060 1068 1052 1025 1005 997 1001 1015 1038 1069 1102 1128 1133
973A133k3m3m4l0j3kKKJPJ7K3J2pk5l3l3k0mLoj5nK0L6L0J7J4J7J2mk6m4m9l8k4k2l1l0qJ7
$$ 1133 1110 1067 1023 993 980 978 980 982 983 990 1007 1030 1042 1035 1010 977 944 924 920 923 917 902 897 917 953 983 1000 1014 1031 1043 1039 1013 969 920 882 858 836 805 775 767 784
968G84K5K0K0L0L6K9K0J1Mkjmj6l1k8nJ5J3JmJKJPK3L4L6K9J9jk1l0k4j0pj1j4j1%J0J4RR
$$ 784 809 829 849 879 915 944 964 975 979 977 976 972 956 925 897 892 907 920 921 917 918 920 921 928 951 985 1021 1050 1069 1068 1047 1017 993 983 976 965 951 940 940 950 964 973 982
962I82K0K7J2j7l4k7j6j9k5j6NJ7J8K2K6J4j4l3k4MK0J6ol6n9n2j5J9K0kj3NL3M3L2J2jqp
$$ 982 1002 1029 1041 1024 990 963 947 928 903 887 892 909 927 949 975 989 975 942 918 922 942 958 952 916 857 805 790 809 829 827 814 819 852 895 927 939 938 930 923
958I23kJKmj5k5k2jK0K1J1J7M3N6L0j6l8k2RK6K7K0Jk1k6j0QRjj0j1j3nJ2K7K7J2lj2j7k3
$$ 923 921 922 924 920 905 880 858 857 877 898 909 926 969 1025 1055 1039 1001 979 988 1014 1041 1061 1062 1041 1015 1005 1013 1022 1021 1011 1000 987 982 994 1021 1048 1060 1057 1045 1028 1005
953A005k7k9l5l1qK2K9J3kmj1k8l6j5J3J6kj2kJ1J0J1K2K9J2k4m0j9K0M2L5J6LKQJ2J9K1J1
$$ 1005 978 949 914 883 875 897 926 939 937 933 922 894 858 843 856 872 870 858 856 867 877 888 910 939 951 927 887 868 888 930 965 981 984 986 994 1006 1025 1046 1057
948A057qk2j7kNkj1j5j3qLJ4J6QOJ9L0K5Mj5k5l0l2l1k6j5MK6L8K9Jk4k8j3RJ9J8J0LnqjJ2
$$ 1057 1049 1027 1010 1008 1013 1011 1000 985 972 964 967 981 997 1005 1011 1030 1060 1085 1089 1074 1049 1019 987 956 930 915 919 945 983 1012 1013 989 961 948 957 976 994 1004 1007 1002 994 993 1005
943A005K0J8Qkj5k8l5l0j3MK1M1N7N6L9K2J2Jj3k3k0qJ%k%NJ3J3%j9k8k1o%NK0L9M5K8%k1
$$ 1005 1025 1043 1051 1049 1034 1006 971 941 928 932 953 994 1051 1107 1146 1168 1180 1181 1168 1145 1125 1117 1118 1118 1116 1116 1121 1134 1147 1147 1128 1100 1079 1073 1073 1078 1098 1137 1182 1210 1210 1189
937A189k9k6j8j2j0mJ3L0L0J9J0ROlqjJ0J4Pnj8l1l3k2oLkj6k7k6rRJ7J2RJ0J1jj2qOJ4J3
$$ 1189 1160 1134 1116 1104 1094 1090 1103 1133 1163 1182 1192 1201 1207 1204 1196 1195 1205 1219 1226 1221 1203 1172 1139 1117 1111 1114 1112 1096 1069 1043 1034 1043 1060 1072 1081 1091 1102 1101 1089 1081 1087 1101 1114
932A114Nnj7k5k3j2nqoPJ5Kj9k6mK2K3jk8m1m0l4k1NL1L7K3PNJ2J0nk2k5oJ6K0jk7l3j5KL
$$ 1114 1119 1114 1097 1072 1049 1037 1032 1024 1018 1025 1040 1042 1023 997 993 1015 1038 1037 1009 968 928 894 873 878 909 946 969 976 981 993 1003 998 976 951 945 961 981 980 953 920 905 907 910
927I10lJOJj2j3jJ3K3L3L5J5j6l4k3omj5j5mLjnLK2L5L2J3nmJ3K4Nk7m0k3JQjnJMmj6k5l2
$$ 910 907 908 914 915 903 890 889 902 925 958 993 1008 992 958 935 929 925 910 895 891 894 893 888 891 913 948 980 993 988 984 997 1021 1026 999 959 936 937 945 944 939 940 944 940 924 899 867
921H67l4k4kJ9K2J4J1J5J8J2J0J5J6ml3m7l3oJ6K8L2K9J7%j3k0k1j3MK0K2J1%moomNJ5J4L
$$ 867 833 809 807 826 848 862 873 888 906 918 928 943 959 955 922 875 842 836 852 880 912 941 958 958 945 925 904 891 895 915 937 948 948 944 938 932 928 933 948 962 965
916I65nlJ1J9Pk1m3m7l3j9rlJJl%RJ4Kj0%K5M0K8Onjjj2k0j2OJ4Lj4k4j6LK7M8N3L3ol9m2
$$ 965 960 957 968 987 994 973 930 883 850 831 822 819 820 821 818 818 827 841 843 833 833 858 898 926 932 927 926 925 913 893 881 887 901 904 890 866 850 853 880 928 981 1014 1008 969 927
911I27k0JMoj1j0rjJ4K7K2LrjJ4K0J8J7J3Jj2j7j6j9j9jK4L3K5J4J0Oj3l5m3l9l3k6j3MJ4
$$ 927 907 908 912 906 895 885 876 875 889 916 938 941 932 931 945 965 983 1000 1013 1014 1002 985 969 950 931 930 954 987 1012 1026 1036 1042 1029 994 951 912 879 853 840 844 858
906H58J3J0J6K7L6L1J7lk1l1l1k5j2olkjmj6k2pJ8K7J6QROrj8kK4L3J6nj7k0j1QJ7Qmm%j2
$$ 858 871 881 897 924 960 991 1008 1005 984 953 922 897 885 879 876 874 873 869 853 831 824 842 869 885 893 902 908 899 881 879 903 936 952 947 930 910 899 907 924 932 928 924 924 912
900I12l1k5MJ8mk7j7J1K0NrrookPJ3J2PJljRJ5J4J4K4L4K1nk0j2jjmkkqj5qPJ7J7Oj2k8k4
$$ 912 881 856 860 878 874 847 830 841 861 866 857 848 842 836 834 841 854 866 873 874 871 870 879 894 908 922 946 980 1001 996 976 964 963 962 958 956 954 946 931 923 930 947 964 970 958 930 906
895I06%K4K1L%J6L2K1ol3m7m6k8jK0K4J1Jnj4k8l7k8nJ4J6J0NLjj2k5l0j5J6N0O6N6L7J9Q
$$ 906 906 930 951 954 954 970 1002 1023 1017 984 937 891 863 862 882 906 917 918 913 899 871 834 806 801 815 831 841 846 849 848 836 811 781 766 782 832 898 954 991 1010 1018
890A018pj9j6MK0J5L%OLj2j7%K2K2Kj9k2j2m%joj4j8j6j1j1q%J0Qnj2jJ4J5Lj1j2ompj3j6
$$ 1018 1011 992 976 980 1000 1015 1018 1018 1024 1027 1015 998 998 1020 1042 1044 1025 1003 991 987 987 986 980 966 948 932 921 910 902 902 912 920 915 903 902 916 931 934 923 911 905 901 894 881 865
884H65j2%J2J7J0%j1j5j0NJ3Oj0j2NK6L0K4J8J1lk0k0nOLpj1pljkj1k7l7l0lK3L9L9K4Mj0
$$ 865 853 853 865 882 892 892 881 866 856 861 874 880 870 858 863 889 919 943 961 972 969 949 929 924 930 933 926 915 908 905 904 902 891 864 827 797 794 817 856 895 919 923 913
879I13pLRPJ0J6J6Lj0rmj2k5k3nPmk5l0j7npnJ2L6M5L6J9Prk9m3m3l0j9j4j2%K0M0M2K5Mk
$$ 913 906 909 918 925 935 951 967 970 960 951 947 935 910 887 882 889 885 860 830 813 808 801 796 808 844 889 925 944 951 942 913 870 827 797 778 764 752 752 772 812 854 879 883 881
874H81RJ9Qj7m0m1k1J4M4M5J8j0j4lok0j8J4M3L9Mk5l0k2j3jRMqj6j4j2j4j1KJ3J6J9K7K8
$$ 881 890 909 917 900 860 819 798 812 856 901 919 909 895 892 886 866 848 862 905 944 948 923 893 871 858 857 866 870 862 846 832 820 806 795 797 810 826 845 872 900
869I00J7MjNO%qj7k9l4k5mRMrj8k3k4j5OK7L0J5lpnnoLJ9K4J1pjK2L3J3j9m1l8k4lK0L7M1
$$ 900 917 921 920 925 931 931 923 906 877 843 818 814 823 827 818 800 777 753 738 744 771 801 816 813 806 801 796 790 793 812 836 847 840 839 861 894 907 888 847 809 785 782 802 839 880
863H80L1J4rk9l8j9J1L0K4J0NP%j6k7k0JJ9K1J2%j6l4m9m4j6J9M1M0K6Oj0j2jJ1Kj6j5QK5
$$ 880 911 925 916 887 849 830 841 871 895 905 910 917 917 901 874 854 855 874 895 907 907 891 857 808 764 748 767 808 848 874 880 870 858 857 868 870 854 839 847 872
858H72K1QRJ4QklLnk1l2k3pKJqj9k5j9nOJ2J4RjqMJ8K1J3J5K4J8KJK8M4K4j3k7j6pj0j3o%
$$ 872 893 901 910 924 932 930 927 930 925 904 872 849 842 844 845 837 818 793 774 769 775 787 801 810 809 801 805 823 844 857 872 896 914 916 917 945 989 1013 1000 973 957 950 940 927 921 921
853I21%KPJj3k1j1%kj1j0%OJrj6j7oJ0K1J9J1%n%J2K7K9J9J1Pjj1j1jLj1k4pL1M4J6k2k8m
$$ 921 921 923 930 931 918 897 886 886 884 873 863 863 869 870 861 845 828 822 832 853 872 883 883 878 878 890 917 946 965 976 983 982 971 960 959 962 951 927 920 951 995 1011 989 961 957
847I57J9K2J6J6K0K0J4Kj4l0m1l8k7j3JJ4K5K3Mk3m0l4j4MJ4J8K0Qj6m5n5l7kK4K3jk2k0N
$$ 957 976 998 1014 1030 1050 1070 1084 1086 1072 1042 1001 963 936 923 924 938 963 986 990 967 927 893 879 883 897 915 935 943 927 882 827 790 788 812 835 834 812 792 797
842G97K6K7K3K8M3M9L9K2Pqj8j7kJ4J9Rlj1rJNlk4l9m6n0n0l6qJ6J5LJQQ%jRJ7J7K1L4M2L2
$$ 797 823 850 873 901 944 993 1032 1054 1061 1053 1035 1018 1016 1030 1049 1058 1055 1044 1035 1036 1041 1038 1014 975 929 879 829 793 785 801 816 819 820 828 836 836 835 844 861 878 899 933 975 1007
837A007J2LJ%j0k5l8m0k5%J9J9J1NLJJPJ1Mj4k4j9lJ2J7J3QQJ4J4Nklrk4k8j3OJj6j8lNJM
$$ 1007 1019 1022 1023 1023 1013 988 950 910 885 885 904 923 934 939 942 943 944 951 962 966 952 928 909 906 918 935 948 956 964 978 992 997 995 992 983 959 931 918 924 925 909 891 888 893 894 898
831H98K2L7K8Oorj3j5q%krmNOjKK0L2K9K0Qj0k5k7k1k2l5m7l6j5JRJ1Mj1k5k7j6JJ7K5K0L
$$ 898 920 957 985 991 985 976 963 948 940 940 938 929 925 930 936 935 937 957 989 1018 1038 1046 1036 1011 984 963 941 906 859 823 808 809 818 829 833 822 797 770 754 755 772 797 817 820
826H20mLJ3J0J%ONqj8j5kJ7L6M5L7J4oj4j4rjKqk2k0jJ4R%RK7K7Lk0j5%nl6n6m2kK4J5n%K6
$$ 820 816 819 832 842 843 843 849 854 846 828 813 811 828 864 909 946 960 954 940 926 917 916 918 910 888 868 867 881 890 890 899 926 953 956 936 921 921 916 880 824 782 780 804 819 814 814 840
820H40L8K0kmJ1J7RNJ2J6J1PJ1Qj0l0k6jK0K0Qlpj0qNK4L2J3k3m9m3j3RJ0nj0lOQMj2l0m6
$$ 840 878 898 896 892 903 920 929 934 946 962 973 980 991 999 989 959 933 932 952 972 980 977 970 960 952 957 981 1013 1026 1003 954 911 898 907 917 912 902 899 905 913 917 905 875 829
815H29m7l2pK1M1M1K1jmMKj6k6j9lQJ3J7J7J1J4K4K5Mj7j1J3K1QmNJ8J3kqrj7l1l3k4j1mj
$$ 829 782 750 743 764 805 846 867 866 862 866 868 852 826 807 804 812 825 842 859 870 884 908 933 937 920 909 922 943 951 947 952 970 983 981 973 964 947 916 883 859 848 844 843
810H43LPJ7L5M7M1J8%%RRJqj3j5j6j1lLNjj1j7j6qjmj6k5k6k2j6j2jJ5L3M4M2L0J5lj6j5N
$$ 843 846 853 870 905 952 993 1011 1011 1011 1020 1029 1030 1022 1009 994 978 967 964 967 972 971 960 943 927 919 918 914 898 873 847 825 809 797 796 811 844 888 930 960 975 972 956 941 946
804I46K9L6J7j0k5k4j8j3j5j8k1j8j1olJJ3K4K1Nj2j6j0kjm%J7L5M0K1jj1rj2k2k3oJ5K2K1
$$ 946 975 1011 1028 1018 993 969 951 938 923 905 884 866 855 849 846 847 860 884 905 910 898 882 872 870 869 865 865 882 917 957 978 977 966 957 945 923 900 894 909 931 952
799I52K0K0J1LPK4L0J0k6n2n4l8j6MJ3J0%j0rllpj0j1j0j0j0j3j6j1LJ8K2J2J%NOMKlj1j0
$$ 952 972 992 1003 1006 1013 1037 1067 1077 1051 999 945 907 891 895 908 918 918 908 899 896 893 886 876 865 855 845 835 822 806 795 798 816 838 850 851 851 856 862 866 868 865 854 844
794H44MJ8Rj7k9j0K0L1J6lj4j7j6rkkkPK4L2K3Ooj2j4oJ1K5J9jj2jJ6K1RloKJ0J5J3Lj2k9
$$ 844 848 866 875 858 829 819 839 870 886 883 869 852 836 827 825 823 821 828 852 884 907 913 907 895 881 875 886 911 930 929 917 916 932 953 962 959 953 955 965 980 993 996 984 955
789I55m1m6m5l4j0K2M2L3QqmMjr%K1K9J8MKLrk1rK1L7J6k5m8m2k4j3j0nOJ2Mrj0NJ6J0opO
$$ 955 914 868 823 789 779 801 843 876 884 876 872 876 875 866 866 887 916 934 938 940 943 934 913 904 925 962 978 953 905 863 839 826 816 811 817 829 833 824 814 819 835 845 839 832 838
783H38J6Qpj3j1onmoj3j5jJ3J8J2J1J7J1oj8pJ3J9Qrj4nJ5K6J7j0k5j8kKkOK3L4L0J9J0%j0
$$ 838 854 862 855 842 831 825 820 816 810 797 782 781 794 812 824 835 852 863 857 839 832 845 864 872 863 849 844 859 885 902 892 867 849 847 849 847 853 876 910 940 959 969 969 959
778I59j6j3rj4k6l0k6j8j3j3j3lJ1K0J7J1J3K1K3J6Olj5k1j2QJ9J0qrMJ0%j9k7j3J4L4K1j7
$$ 959 943 930 921 907 881 851 825 807 794 781 768 765 776 796 813 824 837 858 881 897 903 900 885 864 852 860 879 889 881 872 876 886 886 867 840 827 841 875 896 879
773H79m4l4kJ7J2RJ9L0K1JrkQJ2J8K7K9J6kj2pLJ1RORJ9J8om0n3l4oNqj7pJ2J9Rrj5j0%jj6
$$ 879 835 801 799 816 828 837 856 886 907 908 899 897 905 917 935 962 991 1007 1005 993 986 989 1000 1009 1015 1024 1043 1061 1055 1015 962 928 922 927 919 902 895 907 926 935 926 911 901 901 900 884
767H84k7k5pJ0J8K0K1J4mk6l6k9j3PJ9K0Nj3j5JJ9K4J6J1J7K9L8L6K1Jj5k1k5k6k4j3KJ2J0
$$ 884 857 832 825 835 853 873 894 908 904 878 842 813 800 807 826 846 851 838 823 824 843 867 883 894 911 940 978 1014 1035 1036 1021 1000 975 949 925 912 914 926 936
762I36Jrj7k0j8j0JJ1K4L6L6J4k2m5l6j0Krk0j3jKOK2M3M6K3kj4j7j5kJ9K3Kk8l9k4lJ5K6
$$ 936 937 928 911 891 873 863 864 875 899 935 971 985 963 918 882 872 874 865 845 832 831 833 839 861 904 950 973 971 957 940 925 923 942 965 967 939 900 876 873 888 914
757I14K8K1Mj4k8l4k7nJ6K5K2J6J1Knj2k2l3l4j9kkj1j2KJ5J8J5J3J2J2J3J0mj5j2%jj9l1
$$ 914 942 963 967 953 925 891 864 859 875 900 922 938 949 951 946 934 912 879 845 826 824 822 811 799 801 816 834 849 862 874 886 899 909 905 890 878 878 877 858 827
752H27k2jJ7K5K8K6J6QPJ0J0PJoj0j2j4j7j4kJ5J6nl1l9k7lJ7J6mk1j4OJ3PJ0K4K6Oj4j2%
$$ 827 805 804 821 846 874 900 916 924 931 941 951 958 959 953 943 931 917 900 886 884 899 915 910 879 840 813 810 827 843 839 818 804 810 823 830 840 864 890 896 882 870 870
747H70lj5j8j1mLJ2J6NokLrk5j4J2J9lj9j1Jnj5oJ7L1K9J8Mj5l2l0pJ9L5L4K4Poj2j1j0j3
$$ 870 867 852 834 823 819 822 834 850 855 849 847 850 841 816 802 814 833 830 811 800 801 796 781 775 792 823 852 870 874 859 827 797 790 809 844 878 902 909 903 891 880 870 857
742H57j7k1j4PL2L8J9j4l5l3j2OJ1Jj3k1k1j3JJ8K7K6K4K8K5Lk3k9rJ0J0%mpj2j2kJ0J8K4
$$ 857 840 819 805 812 844 882 901 887 852 819 807 813 824 825 812 791 770 757 758 776 803 829 853 881 906 909 886 857 848 858 868 868 864 857 845 833 831 841 859 883
737H83K9K7J3%pj4k3k2pOLmKJ5K4K4J2rl7m9l6j5pnJ0L1L2J4jqj2j3jK0K0mk2j0J8K9K1Pl
$$ 883 912 939 952 952 945 931 908 886 879 885 888 884 886 901 925 949 961 952 915 866 830 815 808 803 813 844 876 890 889 881 869 856 855 875 895 891 869 859 877 906 927 934 931
732I31pokmqqMJ3ROJ0Pj2l2l3j5oj6k6j1K0M4M0K0J0J7K5Rk5m9m3rK2L7K7Lj9k3j1nj4k1j2
$$ 931 924 918 916 912 904 896 900 913 922 928 938 945 933 901 868 853 847 831 805 794 814 858 898 918 928 945 970 979 954 905 862 853 875 912 939 942 923 900 889 884 870 849 837
727H37LLj9l6l1pJ6K9K7J6MmlLQOJnkJmj8j4J4M6M4J3j6j8JJ7J5Nmqppol%NNOMnj7k0mJ9L3
$$ 837 840 843 824 788 757 750 766 795 822 838 842 838 835 838 846 852 853 848 846 847 843 825 811 825 871 915 928 912 894 895 912 927 932 928 920 913 906 900 897 897 902 907 913 917 912 895 875 871 890 923
721I23K4Qoj1j5j9j6nLNmj1pNJ3R%mmnj1k0k2qJ9M0L6J4jJ0K3J3j4l2l3k3mK1L5J7j8k6J2
$$ 923 947 955 949 938 923 904 888 883 886 891 887 876 869 874 887 896 896 892 888 883 872 852 830 822 841 881 917 931 930 940 963 976 962 930 897 874 870 891 926 943 925 899 911
715I11N7P1N0K3jk6m4m2k6j5j9j6JJ9J9Kk0l1k9k2k0k6l3l4k3j4j0j2j0mJ0K7M3M7L2Mk4l2
$$ 911 968 1039 1089 1112 1111 1085 1041 999 973 958 939 923 924 943 962 964 944 913 884 862 842 816 783 749 726 712 702 690 680 676 686 713 756 803 835 839 815 783
711G83j8J3L9M8L7J8kj3j2%RPLPJ6J6Nrj4j1nPK3L5L7K3Kj7k5j9oPJ5J6J0pk5l7l7k7j7j0
$$ 783 765 778 817 865 902 920 918 905 893 893 902 909 912 919 935 951 956 947 933 922 917 924 947 982 1019 1042 1044 1027 1002 983 977 984 999 1015 1025 1018 993 956 919 892 875 865
706H65jQJ8K4J8Kj1j1jLmj6j6nLNRJ6J8J5J0J0Rjj2j1JJ0ol5m9k6J4L6K6%j2oRK6L5K8Jk7
$$ 865 864 872 890 914 932 934 923 912 911 914 910 894 878 873 876 881 890 906 924 939 949 959 968 967 955 944 945 955 949 914 865 839 853 889 915 915 903 897 906 932 967 995 996 969
700I69l6k0%J3J8J3kk2k6nJ9K7J3lqjJ2K5L0K5Qj0j7rLLpj8j8j2j3k2k3j3%OLnj5j8oJ2J7
$$ 969 933 913 913 926 944 957 955 933 907 902 921 948 961 958 950 949 961 986 1016 1041 1049 1039 1022 1013 1016 1019 1012 994 976 964 951 929 906 893 893 899 902 897 882 864 858 870 887
695H87Jj6j4LJ1QNOPNOJ4J9J4PLLmj0j1nMPLqj4rNJ6J9J8J8J1j1l3m1l3k8k7j6PK4K0lj7j2
$$ 887 888 872 858 861 872 880 885 891 898 903 909 923 942 956 963 966 969 965 955 944 939 943 950 953 945 931 922 927 943 962 980 998 1009 998 965 924 891 863 836 820 827 851 871 868 851 839
689H39LJ3K1K8K6Mk9m5l1lJ3Oqj0lNOLlrj1nRJ9J4mj9j4jjj3k2j5j%lMK7M4M0J8nj6j4nNJ5
$$ 839 842 855 876 904 930 934 905 860 829 826 839 845 837 827 824 829 835 838 835 826 815 810 819 838 852 848 829 815 814 813 800 778 763 762 762 759 763 790 834 874 892 887 871 857 852 857 872
684H72J7J5RLMJ2J8J1pk3k9k6j7kJ4K3J7Olorj4j9k1j9rOK1L0L4L7L0J1j1k4l0l0j9kNok1
$$ 872 889 904 913 916 920 932 950 961 954 931 902 876 859 857 871 894 911 917 914 908 899 885 866 845 826 817 823 844 874 908 945 975 986 975 951 921 891 872 870 875 869 848
678H48k6j8qMK7M5L6Kk5k5pPQKoj4oJ3L0L1K3J6Onj2j1j6l2l8j5J9L1J6NPKk1m1k9LK8L5L5
$$ 848 822 804 796 800 827 872 908 910 885 860 853 860 868 870 864 850 844 857 887 918 941 957 963 958 946 935 919 887 849 834 853 884 900 905 912 914 893 852 823 826 854 889 924
673I24K7J1pj3njoj0nOJ6K8L8L5J0j7k2nOnk5k8j6npj7k7l9n1n1k6J1L7L9K7J9J5Oj1j7LL5
$$ 924 951 962 955 942 937 936 930 920 915 921 937 965 1003 1038 1048 1031 1009 1004 1010 1005 980 952 936 931 924 907 880 841 790 739 713 724 761 800 827 846 861 867 856 839 842 877
668H77N0L3kl0l6l2k9k8j3J6M8O4N5L0PpqJJ4K5K0Npj4k6m7o0m0LL3K9Oj0j0opj2k1l0l2k0
$$ 877 927 960 958 928 892 860 831 803 790 806 854 918 973 1003 1010 1003 995 996 1010 1035 1055 1060 1053 1039 1013 966 906 866 869 902 931 937 927 917 911 904 892 871 841 809 789
663G89KJ7K5L3L8L2J3j0k5k9k3j3KK0K9K6J1%LJ9K3J2qk0k3k3j6%K0K3Qrj3lM%oqMJ4J0nj2
$$ 789 791 808 833 866 904 936 949 939 914 885 862 849 851 871 900 926 937 937 940 959 982 994 986 966 943 920 904 904 924 947 955 946 933 930 934 934 928 920 924 938 948 943 931
658I31kLj4m3m8k6jLmoLJ3K5L6L8K7J2OO%j1k2j9oKKpj7j8j1kNPJj1j9oJ6K2Kj7oK3L8K5N
$$ 931 929 932 918 875 827 801 800 803 799 793 796 809 834 870 908 935 947 953 959 959 948 926 907 901 903 905 898 881 863 852 850 855 862 863 852 833 827 843 865 867 850 844 867 905 930 935
652I35NJ2Lj9l5l1k0j5j2%K0L7M3L6J9pk7k5jK3K2LqKJ5J3ok6l6l0rJ3J7Kj7k8l0l3l1k3j5
$$ 935 940 952 955 936 901 870 850 835 823 823 843 880 923 959 978 971 944 919 918 941 963 966 958 960 975 988 982 956 920 890 881 894 911 913 896 868 838 805 774 751 736
647G36j2oJ4M0M8K7lk0k0j0k%klQK7L0J0j0qJ0J8Oj2j4KK1K7K3J2JqrjOJj5k4j8rlMK0L3K6
$$ 736 724 718 732 772 820 847 844 824 804 794 792 792 790 787 795 822 852 862 852 844 854 872 878 866 852 854 875 902 925 937 938 930 921 920 926 927 912 888 870 861 858 862 882 915 941
642I41%j5pJ3J5jk0k4j4l%qj8j8rMJ8L4M4L7Qk9m7l9j1K3M9N3K7j0l0j9LNj4k9k4j2lNJ4J7
$$ 941 941 926 919 932 947 946 926 902 888 885 885 877 859 841 832 836 854 888 932 969 977 948 901 862 851 874 923 976 1003 993 963 944 947 952 938 909 885 873 870 875 889 906
636I06RjNJ2Oj1j4JRpk6k9j5nkPK0K1Rpj8k6k7j8mJkKPKj4k1j2%LJ0K5L6K7J4J2J6J1lj1p
$$ 906 915 914 919 931 937 926 912 913 922 915 889 860 845 840 838 845 865 886 895 888 870 844 817 799 795 796 794 796 803 805 791 770 758 758 761 771 796 832 859 873 885 901 912 909 898 891
631H91rj9k5j9rKJ1J4OmnOJ8J8J2LkjJ1K5L0J8kqLJ9J7ol1l2j2NJpML1M2K5lk2k8k9k1nPL
$$ 891 882 863 838 819 810 812 823 837 843 839 834 840 858 876 888 891 889 888 899 924 954 972 970 962 965 984 1001 995 964 932 920 925 926 919 923 954 996 1021 1018 996 968 939 918 913 920 923
625I23j1k1k1j4OL4N5M4J2j9k6k2k6l5l8k7qRL0N0O0M2Kl9n9n7m2k0LJ6J5PRJ7J9PqrKJ3J5
$$ 923 912 891 870 856 862 896 951 995 1007 988 962 940 914 879 841 814 806 815 845 895 955 997 999 960 901 844 802 782 785 801 816 823 832 849 868 875 867 858 860 873 888
620H88jk8m2k1K4N5N2L5L5N3N2J9j8l0j8qj1j9k1j7k0k6k1oOLnnL%j5k5j6RK4J8Kj4k6k8j7
$$ 888 887 859 817 796 820 875 927 962 997 1050 1102 1121 1103 1073 1055 1047 1036 1017 996 979 959 933 912 906 912 915 910 905 908 908 893 868 852 861 885 903 905 891 865 837 820
615H20jQQMMjj0j8rRK1J5jrqKJ0Qlj3j3KJ5K0J4RPRRQRJ6K6K5J2mnOJ3Mj1k0j8nJ0J5Mj7k8
$$ 820 819 827 835 839 843 842 832 814 805 814 835 850 849 840 832 834 844 852 849 836 823 825 840 860 874 883 890 899 908 916 925 941 967 992 1004 1000 995 1001 1014 1018 1007 987 969 964 974 989 993 976 948
609I48j4NQpj7rNJ9L3M7M7K6lk0k6k6k0KK5L5K8J5J0Pjj7k6k0kJ1J0qk0k0j2m%NLj3k9l1k2
$$ 948 934 939 947 940 923 914 919 938 971 1018 1065 1091 1088 1068 1042 1016 996 998 1023 1058 1086 1101 1111 1118 1117 1100 1074 1054 1052 1063 1073 1065 1045 1025 1013 1009 1009 1014 1017 1004 975 944 922
604I22j4j1kPP%QK7L1Nk6l2j8pkQJ9J5MJJ0J3Lnlnj3j4roj6k3j3knj2lJ6K0Mnmok1k5JL6M5
$$ 922 908 897 895 902 909 909 917 944 975 980 954 922 904 897 895 903 922 937 941 942 952 965 968 963 960 955 942 928 919 913 897 874 861 859 854 842 839 855 875 879 874 870 864 843 818 819 855 900
598I00L1J9K3J8j0l9m0j3J1J5OKOJ5K3K2Qj5l4l6j6J6M0M1J8j0k3j7kJ0J6J6Pkm%knJJ1J3
$$ 900 931 950 973 991 981 942 902 889 900 915 921 923 929 944 967 989 997 982 948 912 896 912 952 993 1011 1001 978 961 959 969 985 1001 1008 1006 1002 1002 1000 995 996 1007 1020
593A020Jj1j6j8k1j6QL1L1Rj2k5l3k9lL5N7M7K1Jj6l5m5l5rJ0Nk1m4m3j5K0L5K1KomnqjJ8
$$ 1020 1021 1010 994 976 955 939 947 978 1009 1018 1006 981 948 919 916 951 1008 1055 1076 1077 1061 1026 981 946 937 947 952 931 887 844 829 849 884 905 907 901 897 892 884 883 901
588I01L1K7J5QJ2J7J3MJLLkj3k2k3j4%J4J1mk1k3j4olNJ6J2j2l6m0k2%QPOJ1J6J4OklKMrk7
$$ 901 932 959 974 982 994 1011 1024 1028 1029 1032 1035 1033 1020 998 975 961 961 975 986 982 961 938 924 918 915 920 936 948 936 900 860 838 838 846 853 859 870 886 900 906 904 901 903 907 898 871
582H71l9l2rJ8L2K6J4ORJ0LnoMJ4K0K0J3OMJ2K1J9J0MJKQJ8K0Nj9l3k6j7k0k8k4mJ8K8K1L
$$ 871 832 800 791 809 841 867 881 887 896 906 909 904 898 902 916 936 956 969 975 979 991 1012 1031 1041 1045 1046 1048 1056 1074 1094 1099 1080 1047 1021 1004 984 956 932 928 946 974 995 998
577I98j2j7rPJ8K0K1K1J7RjnoqnPK4K9K0%k4m4n1l2%J5Kj4%L5N5L9Oj5j7qKMJJLLrk3k6j7
$$ 998 986 969 960 967 985 1005 1026 1047 1064 1073 1072 1067 1061 1053 1048 1055 1079 1108 1128 1128 1104 1060 1009 977 977 992 994 980 980 1015 1070 1109 1115 1100 1083 1075 1077 1081 1082 1083 1086 1089 1080 1057 1031 1014
572A014j7k8k4LL6M5L2J6Olj1j6j6j9j9pPNoqJQMkJONMOJ1J1J0Lj3k9k8jK3J7j6l9k9kK1L2
$$ 1014 997 969 945 948 984 1029 1061 1077 1083 1080 1069 1053 1037 1018 999 992 999 1004 998 990 991 999 1003 1001 1002 1008 1013 1017 1023 1034 1045 1055 1058 1045 1016 988 987 1010 1027 1011 972 943 941 962 994
566I94L4L1K0J1J3K1J9Lk0l2l3k6j4MJ6J4jj1nJ0J8J5J3J0Jj5k9k9j8lJ0J9K3J8J2Mlj0j2
$$ 994 1028 1059 1079 1090 1103 1124 1143 1146 1126 1094 1061 1035 1021 1025 1041 1055 1054 1043 1038 1048 1066 1081 1094 1104 1105 1090 1061 1032 1014 1011 1021 1040 1063 1081 1093 1097 1094 1084 1072
561A072nLKqk1k5k0j3lJ0K1K2Nj7k1JL2M2K4nj5rjkJJ2K7K6Rpj0kJjJPJ0POPlk3l1j2K1L8
$$ 1072 1067 1070 1072 1064 1043 1018 998 985 982 992 1013 1035 1040 1023 1002 1003 1035 1077 1101 1096 1081 1072 1071 1069 1070 1082 1109 1135 1144 1137 1127 1125 1126 1125 1126 1133 1143 1150 1156 1163 1160 1137 1106 1094 1115 1153
556A153L7L1K4Rj2k5k4k6l1k1QL0J8j7l8k8nNmj9k4j0J7M2N0L7K0Pok3m1l9j8OK0K9M7O4N7
$$ 1153 1190 1221 1245 1254 1242 1217 1193 1167 1136 1115 1123 1153 1171 1154 1116 1088 1083 1088 1084 1065 1041 1031 1048 1090 1140 1177 1197 1204 1198 1175 1134 1095 1077 1083 1103 1132 1179 1243 1300
551A300J8k8m3j8J7L5K8J4RJ3J8J6NnjJ1J4Lj2j3JJ8L0L6L9M5M3K6kj8j0J4K7K5K3K5K6K1
$$ 1300 1318 1290 1247 1229 1246 1281 1309 1323 1332 1345 1363 1379 1384 1379 1378 1389 1403 1406 1394 1381 1382 1400 1430 1466 1505 1550 1593 1619 1617 1599 1589 1603 1630 1655 1678 1703 1729 1750
546A750J5J8J8J7K4M1N0L8Rj2j4pJ%j0k3k8k6k6l4l8k7qLJrj4pJ2L3L9L1K5L2L6K2nk1k2j3
$$ 1750 1765 1783 1801 1818 1842 1883 1933 1971 1980 1968 1954 1947 1948 1948 1938 1915 1887 1861 1835 1801 1763 1736 1728 1731 1732 1723 1709 1702 1714 1747 1786 1817 1842 1874 1910 1932 1927 1906 1884 1871
541A871LK7M5L7J2jLJ1J2K0M3O8P4O3M7L3K2J8K2L0L7M9O5O9N1K2jj1j2j1j5k7m1m6m3m1m3
$$ 1871 1874 1901 1946 1983 1995 1994 1997 2008 2020 2040 2083 2151 2225 2288 2335 2368 2390 2408 2430 2460 2497 2546 2611 2680 2731 2753 2752 2741 2729 2718 2703 2676 2635 2589 2546 2505 2462
537B462l6j6Ljj9l2l5l7m0m2l9l8l6l0j9qMJ6K4K1J0%nnjQK5L0J8qk5k4j2mJJ3L8N4M8K6J4
$$ 2462 2426 2410 2413 2412 2393 2361 2326 2289 2249 2207 2168 2130 2094 2064 2045 2037 2041 2057 2081 2102 2112 2112 2107 2102 2101 2109 2134 2164 2182 2174 2149 2125 2113 2109 2110 2123 2161 2215 2263 2289 2303
532B303J8K6K7K3K0K0J7RKnpjJ0J4Mqqmj1j9k0j4j1rKJ8J8QRK2K4Mj8j9olqoJ3L3M5M4L4J5
$$ 2303 2321 2347 2374 2397 2417 2437 2454 2463 2465 2460 2453 2452 2462 2476 2480 2472 2464 2460 2449 2430 2410 2396 2385 2376 2378 2396 2414 2422 2431 2453 2477 2481 2463 2444 2438 2435 2427 2421 2434 2467 2512 2556 2590 2605
526B605j3l1l2j7%J7L3M8N4M7L6L0L3M2M5M2L6L4M2M8M1J7nKL4O0O4M8L7L6M0M4M6M5L7K8
$$ 2605 2592 2561 2529 2512 2512 2529 2562 2610 2664 2711 2747 2777 2810 2852 2897 2939 2975 3009 3051 3099 3140 3157 3152 3154 3188 3248 3312 3360 3397 3433 3473 3517 3563 3608 3645 3673
522C673L0M2N1M9M8O3Q2Q6P0M6L6M1M9M9M4L9M1M7O0Q3J06J08Q3N3L7L9L8K8K7M2O2O5N6N4
$$ 3673 3703 3745 3796 3845 3893 3956 4038 4124 4194 4240 4276 4317 4366 4415 4459 4498 4539 4586 4646 4729 4835 4943 5026 5079 5116 5155 5193 5221 5248 5290 5352 5417 5473 5527
518E527O6P9P3N1L3L6N5P4P9O9N6M7M5M3M1M4N1O1N9L9J5NK0M4N9N7N0N4P2R3R6O8L0J8M6
$$ 5527 5593 5672 5745 5796 5829 5865 5920 5994 6073 6142 6198 6245 6290 6333 6374 6418 6469 6530 6589 6628 6643 6648 6668 6712 6771 6828 6878 6932 7004 7097 7193 7261 7291 7309 7355
514G355Q1R0P2N8N4M7L2K4L4M7N3N6N9N6L4J3J3L6N4N5M0K6J9J5J3J5J9K7L5L5K6J1OJ3K5
$$ 7355 7436 7526 7598 7656 7710 7757 7789 7813 7847 7894 7947 8003 8062 8118 8152 8165 8178 8214 8268 8323 8363 8389 8408 8423 8436 8451 8470 8497 8532 8567 8593 8604 8610 8623 8648
509H648K7J5mj0kMkj4j5j0j0k0k9k9k1oJ4K8K7J0jjNLnj3j6j8j9j9k5l4l6k7j5j3j9k2k4k6
$$ 8648 8675 8690 8686 8676 8674 8678 8676 8662 8647 8637 8627 8607 8578 8549 8528 8522 8536 8564 8591 8601 8600 8599 8604 8607 8602 8589 8573 8555 8536 8517 8492 8458 8422 8395 8380 8367 8348 8326 8302 8276
504H276j8NK8L2K4J8J7J1lj7l0l9l5k1rj2k0k2j9k4k4qJ7K5J3Kok4m0l4j0%j8l1j2J9K7Qj3
$$ 8276 8258 8263 8291 8323 8347 8365 8382 8393 8390 8373 8343 8304 8269 8248 8239 8227 8207 8185 8166 8142 8118 8110 8127 8152 8165 8167 8161 8137 8097 8063 8053 8053 8035 8004 7992 8011 8038 8046 8033
500H033j8j0NJ7J1j1k2oJ7K0Mpmkrj1rnlJ7N1P7P4N1L5L6M2L7L0L2M9O6O9O8P4Q8R3Q0O7O5
$$ 8033 8015 8005 8010 8027 8038 8027 8005 7999 8016 8036 8040 8033 8029 8027 8018 8007 7998 7993 7990 8007 8058 8135 8209 8260 8295 8331 8373 8410 8440 8472 8521 8587 8656 8724 8798 8886 8979 9059 9126 9191
495I191O6N5M1M1N9P2P3O8P4Q8J05J21J28J28J22J22J28J37J42J50J59J71J75J76J77J87K03
$$ 9191 9257 9312 9353 9394 9453 9525 9598 9666 9740 9828 9933 10054 10182 10310 10432 10554 10682 10819 10961 11111 11270 11441 11616 11792 11969 12156 12359
491A2359K20K31K33K41K56K65K61K61K93L46L89M04M07M13M16M13M17M38M67M93N27N72O15
$$ 12359 12579 12810 13043 13284 13540 13805 14066 14327 14620 14966 15355 15759 16166 16579 16995 17408 17825 18263 18730 19223 19750 20322 20937
489B0937O42O60O89P26P59P90Q27Q69R06R39R86J034J069J093J144J230J323J392J449J522
$$ 20937 21579 22239 22928 23654 24413 25203 26030 26899 27805 28744 29730 30764 31833 32926 34070 35300 36623 38015 39464 40986
486D0986J612J711J820J950K083K202K307K429K582K755K937L125L308L473L619L770L934
$$ 40986 42598 44309 46129 48079 50162 52364 54671 57100 59682 62437 65374 68499 71807 75280 78899 82669 86603
484H6603M082M176M207M199M163M088L943L708L379K971K509K014J498R67M34q4n69r99j357
$$ 86603 90685 94861 99068 103267 107430 111518 115461 119169 122548 125519 128028 130042 131540 132507 132941 132857 132288 131289 129932
482A29932j642j863k025k116k129k086k022j936j807j638j453j272j083q74o48m22j92M9K92
$$ 129932 128290 126427 124402 122286 120157 118071 116049 114113 112306 110668 109215 107943 106860 105986 105338 104916 104724 104773 105065
479A05065N29P59J003J272J556J841K113K374K644K946L291L661M046M436M828N210N574N933
$$ 105065 105594 106353 107356 108628 110184 112025 114138 116512 119156 122102 125393 129054 133100 137536 142364 147574 153148 159081
477A59081O292O635O931P161P311P353P258P013O621O085N403M578L622K546J378J80r73k041
$$ 159081 165373 172008 178939 186100 193411 200764 208022 215035 221656 227741 233144 237722 241344 243890 245268 245448 244475 242434
475B42434l031l943m740n395n915o320o598o725o708o598o443o250o002n702n377n050m725
$$ 242434 239403 235460 230720 225325 219410 213090 206492 199767 193059 186461 180018 173768 167766 162064 156687 151637 146912
473A46912m391m050l717l403l102k805k514k249j999j740j459j179r21o77m22j58Q7L12N40
$$ 146912 142521 138471 134754 131351 128249 125444 122930 120681 118682 116942 115483 114304 113383 112706 112284 112126 112213 112525 113065
471A13065P86J036J268J486J700J904K075K206K289K315K269K148J955J699J374R89N53P7
$$ 113065 113851 114887 116155 117641 119341 121245 123320 125526 127815 130130 132399 134547 136502 138201 139575 140564 141117 141194
468A41194m34r59j476j965k415k822l169l451l670l827l922l948l920l856l769l669l555l429
$$ 141194 140760 139801 138325 136360 133945 131123 127954 124503 120833 117006 113084 109136 105216 101360 97591 93922 90367 86938
466H6938l292l143k985k825k667k518k382k261k149k045j950j856j753j646j552j488j433
$$ 86938 83646 80503 77518 74693 72026 69508 67126 64865 62716 60671 58721 56865 55112 53466 51914 50426 48993
464D8993j359j263j182j137j105j060r94r33q91q59q26p83p33o83o46o27o23o15n97n72n39
$$ 48993 47634 46371 45189 44052 42947 41887 40893 39960 39069 38210 37384 36601 35868 35185 34539 33912 33289 32674 32077 31505 30966
462C0966m98m60m35m21m12m06m07m02l73l22k75k51k44k43k41k41k34k22k09k05j95j68j32
$$ 30966 30468 30008 29573 29152 28740 28334 27927 27525 27152 26830 26555 26304 26060 25817 25576 25335 25101 24879 24670 24465 24270 24102 23970
459B3970j06r6q9q4p9q1p6o5m6k7j1oj1k1j7lRQmk0l2k6JM0O6O6N4M5M0L6L3L3L4L0K3J9J7
$$ 23970 23864 23768 23679 23595 23516 23435 23359 23294 23248 23221 23210 23204 23193 23172 23155 23152 23161 23169 23165 23145 23113 23087 23088 23128 23194 23260 23314 23359 23399 23435 23468 23501 23535 23565 23588 23607 23624
454B3624J2OMKqk0k6k2j2mJRJ6J9J3POJ2J1LkMJ2J8K3L3L7K4J0K0M9O8O2M7M1L6K5K1L5N1
$$ 23624 23636 23642 23646 23648 23640 23620 23594 23572 23560 23556 23557 23566 23582 23601 23614 23621 23627 23639 23650 23653 23651 23655 23667 23685 23708 23741 23778 23802 23812 23832 23881 23949 24011 24058 24099 24135 24160 24181 24216 24267
449B4267M9M0M4O1O1M3K8K8K7J0rrJJj5l2l8m2n7q6j15j27j18j09j14j28j38j42j51j69j82
$$ 24267 24316 24356 24400 24461 24522 24565 24593 24621 24648 24658 24649 24640 24641 24642 24627 24595 24557 24515 24458 24372 24257 24130 24012 23903 23789 23661 23523 23381 23230 23061 22879
446B2879j85j88j95j98j89j83j88j99k06k12k19k25k21k17k19k18k06j86j69j58j49j52j73
$$ 22879 22694 22506 22311 22113 21924 21741 21553 21354 21148 20936 20717 20492 20271 20054 19835 19617 19411 19225 19056 18898 18749 18597 18424
443A8424j98k01j78j52j48j56j64j69j67j50j18j03j25j70j95j88j69j57j52j42j34j44j69
$$ 18424 18226 18025 17847 17695 17547 17391 17227 17058 16891 16741 16623 16520 16395 16225 16030 15842 15673 15516 15364 15222 15088 14944 14775
440A4775j94k05k01j84j64j48j43j48j60j81k09k32k34k17j95j87j92j98k04k07k05j94j78
$$ 14775 14581 14376 14175 13991 13827 13679 13536 13388 13228 13047 12838 12606 12372 12155 11960 11773 11581 11383 11179 10972 10767 10573 10395
437A0395j73j84j97j98j81j66j64j76j84j73j50j27j18j29j51j63j60j38j08q1o6o8p5o9m7
$$ 10395 10222 10038 9841 9643 9462 9296 9132 8956 8772 8599 8449 8322 8204 8075 7924 7761 7601 7463 7355 7274 7208 7140 7065 6996 6949
434F949k4j9m2q0j18j45j58j52j35j20j20j33j46j47j43j41j27r5n2k8l8o6q6q7q0p2o1m8
$$ 6949 6925 6906 6864 6784 6666 6521 6363 6211 6076 5956 5836 5703 5557 5410 5267 5126 4999 4904 4852 4824 4786 4720 4634 4547 4467 4395 4334 4286
431D286m3n4o8o8n8m5m0m0l6k7j9j6k1l1l5k7j1%MQK0L9M5L2J7K2N2Q2Q9P9O5N1J8l0o6p2
$$ 4286 4243 4189 4121 4053 3995 3950 3910 3870 3834 3807 3788 3772 3751 3720 3685 3658 3647 3647 3651 3659 3679 3718 3763 3795 3812 3834 3886 3968 4057 4136 4201 4252 4270 4240 4174 4102
426D102o6p3r5j12j12j02r8j01j02r4q1p4q2r2q4n9l5k4j5OK6K2jj9k2j9j4pOJ5J0Mjpk0k8
$$ 4102 4036 3963 3868 3756 3644 3542 3444 3343 3241 3147 3066 2992 2910 2818 2734 2675 2640 2616 2601 2607 2633 2655 2654 2635 2613 2594 2580 2573 2579 2594 2604 2608 2607 2600 2580 2552
422B552k4rPJ9K7L0L0K8L2L8M4M6M1L9M6N8N2K3j1j4RK4J4oj8l0n3o9o4n2n5o7o2l7k2l0m3
$$ 2552 2528 2519 2526 2545 2572 2602 2632 2660 2692 2730 2774 2820 2861 2900 2946 3004 3056 3079 3068 3054 3063 3087 3101 3095 3077 3047 2994 2925 2861 2809 2754 2687 2625 2588 2566 2536 2493
417B493m2l1k6l0l4l9m0l1j4klj1rkMPO%j2k0j4LJ7K2J9J6J3PkjOJ4J4MJJ6M2N8N4M2L5L5
$$ 2493 2451 2420 2394 2364 2330 2291 2251 2220 2206 2204 2201 2190 2181 2179 2183 2190 2196 2196 2184 2164 2150 2153 2170 2192 2211 2227 2240 2247 2245 2244 2250 2264 2278 2282 2283 2299 2341 2399 2453 2495 2530 2565
412B565L5L0K3J5Lj3k9l0j9nql1m9m6l0k8m1m3k2MOj9m1l7k1j7l4n1m7k3JQlk6m6n5m2j3J5
$$ 2565 2600 2630 2653 2668 2671 2658 2629 2599 2580 2575 2567 2536 2487 2441 2411 2383 2342 2299 2277 2281 2287 2268 2227 2190 2169 2152 2118 2067 2020 1997 1998 2006 2003 1977 1931 1876 1834 1821 1836
407A836K0Nj0j1JJ2J6J2NkojRK1L3L3K0lj5j1orj3qMJ1RMlj1k2l1l5l7l6k7j6j8k7l6l4k5
$$ 1836 1856 1861 1851 1840 1841 1853 1869 1881 1886 1884 1878 1877 1886 1907 1940 1973 1993 1990 1975 1964 1958 1949 1936 1928 1932 1943 1952 1956 1953 1942 1920 1889 1854 1817 1781 1754 1738 1720 1693 1657 1623 1598
402A598j7j0oj2k4l5k9qJ0J1jj1j3j7k5l0k5j0MRLpj6j2NK3K3Nj8k7k3j4lNRKno%NJ3K2K5
$$ 1598 1581 1571 1565 1553 1529 1494 1465 1457 1467 1478 1477 1466 1453 1436 1411 1381 1356 1346 1350 1359 1362 1355 1339 1327 1332 1355 1378 1383 1365 1338 1315 1301 1298 1303 1312 1314 1309 1303 1303 1308 1321 1343 1368
397A368J4rk2j0J5K7J5j2l5m1k9qJ0K0J7nk8l5j4J1K2J5PQOmj4j1%J0Pj3l9n2m4k6j5j5j1
$$ 1368 1382 1373 1351 1341 1356 1383 1398 1386 1351 1310 1281 1273 1283 1303 1320 1315 1287 1252 1238 1249 1271 1286 1293 1301 1307 1303 1289 1278 1278 1288 1295 1282 1243 1191 1147 1121 1106 1091 1080
392A080jJ3K4L7L9K5MkJ1K0Lk6m2l6j7jOLnnNJ6K0K1K2K2Rj0k3k8k8j9lJ0Kj9l0j7MJ6J6J2
$$ 1080 1079 1092 1116 1153 1192 1217 1221 1219 1230 1250 1253 1227 1185 1149 1132 1131 1137 1140 1135 1130 1135 1151 1171 1192 1214 1236 1245 1235 1212 1184 1156 1137 1134 1144 1146 1127 1097 1080 1084 1100 1116 1128
387A128PjnlNJ2Rlj7k1j3orj4kJ8K5J6OJ0J5J0jljj2k9l5j6J0K4K0J5J9K1J4pk4k6j2kqk4
$$ 1128 1135 1134 1129 1126 1131 1143 1152 1149 1132 1111 1098 1092 1083 1069 1067 1085 1110 1126 1132 1142 1157 1167 1166 1163 1162 1150 1121 1086 1070 1080 1104 1124 1139 1158 1179 1193 1186 1162 1136 1124 1122 1114 1090
382A090l3k1RM0N2M0J4mj0pnprj1j5j7j4kJ1J2LqqLJ8K6K3J0qj9qJ5K5Nk4k9j0RMj5k7k3r
$$ 1090 1057 1036 1045 1085 1137 1177 1191 1187 1177 1170 1165 1158 1149 1138 1123 1106 1092 1090 1101 1113 1116 1108 1100 1103 1121 1147 1170 1180 1172 1153 1145 1160 1185 1190 1166 1137 1127 1136 1140 1125 1098 1075 1066
377A066%kj5k4j7qrj4JL2M3J6k2l5j9KJ5J9J7QJNMj7m7n6l3jJ9L2M6N0L0lk2j7JQmk8n0n1
$$ 1066 1066 1064 1049 1025 1008 1000 991 977 978 1010 1053 1069 1047 1012 993 995 1010 1029 1046 1054 1055 1060 1064 1047 1000 944 911 910 929 961 1007 1057 1087 1084 1062 1045 1046 1054 1050 1022 972 921
372I21l4j3mkQK5L7L5K8K9L4L4K1Jj0o%ok6m3m4l1j7q%J1K0K1J1KPK3L0J3j5k9k1j2j8k7k2
$$ 921 887 874 870 868 876 901 938 973 1001 1030 1064 1098 1119 1120 1110 1104 1104 1098 1072 1029 985 954 937 929 929 940 960 981 992 994 1001 1024 1054 1067 1052 1023 1002 990 972 945 923
366I23okj2k5k2nJ4J9Nj7k5rJ5K7J7Nlnj0j1nLJ0J6K3K7L0L6L7K1pl1l2j4NJ4J2lk2k9k1j2
$$ 923 917 915 903 878 856 851 865 884 889 872 847 838 853 880 897 902 899 894 884 873 868 871 881 897 920 947 977 1013 1050 1071 1064 1033 1001 987 992 1006 1018 1015 993 964 943 931
361I31j0nJ1K4J5pj4%J1QKOPrk7k6j1nj3j9j0J0K7M0M7L8J6oj6j4j0j2j4j6j6j7k0k1j1NJ4
$$ 931 921 916 927 951 966 959 945 945 956 964 966 972 979 970 943 917 906 901 888 869 859 869 896 936 983 1021 1037 1031 1015 1001 991 979 965 949 933 916 896 875 864 869 883
356H83J3J1J8L0L2K2Omrj2j0l%ql0m9m8j8K1M4L8J6%nrj2j2rnMK0L6L1kl3m0j9LJ2J0PJkJ
$$ 883 896 907 925 955 987 1009 1015 1011 1002 990 980 977 977 969 939 890 842 824 845 889 927 943 943 938 929 917 905 896 891 895 915 951 982 980 947 907 888 891 903 913 920 921 919 920
351I20NKnqnoj4j7rLP%nkJ2K9L7K7Ppojqk1k3j5oKJ3K9M3M1K9J6Mj0k5l0k2qkjkljkj1k5l7
$$ 920 925 927 922 914 909 903 889 872 863 866 873 873 868 866 878 907 944 971 978 971 965 964 956 935 912 897 891 893 906 935 978 1019 1048 1064 1068 1058 1033 1003 981 973 971 970 968 965 964 962 951 926 889
345H89l4j8lKJMPOJMJ4K0J5J1J1Lj4k7j7QK4J4nj6j7j1LK2L4K8QpnNRLprKJ3Mk3m5l9qJ7J7
$$ 889 855 837 834 836 837 841 848 854 855 859 873 893 908 919 930 933 919 892 875 883 907 921 916 900 883 872 875 897 931 959 967 960 955 960 969 972 965 956 958 971 975 952 907 868 860 877 894
339H94ql5m1j6K5N2M5K2J4L0M3K7jj2l%j6l1l1j8j2j2qNK1K8K0Lrrrk0l4l1oJ8J8%j9l0l4
$$ 894 886 851 810 794 819 871 916 938 952 982 1025 1052 1051 1039 1036 1036 1020 989 958 940 928 916 908 913 934 962 982 985 976 967 958 938 904 873 867 885 903 903 884 854 820
334H20k7pJ5K1J5K0L2L2Ok1k0LK3K9K7K3J4kj0pKNjj6l0l0j0J1J5Lj0j3j7k5j4K1N4N2K0j0
$$ 820 793 786 801 822 837 857 889 921 927 906 886 889 912 941 968 991 1005 1003 993 986 988 993 992 976 946 916 906 917 932 935 925 912 895 870 856 877 931 983 1003 993
329I93j9j7k1k2oJ6K1Mj3j5qor%K0L4K6Oqj2rmPK8M1L2Rj5k1j5jRJ0PNOQJ2J1Kj4k5k1j0j2
$$ 993 974 957 936 914 908 924 945 949 936 921 913 907 898 898 918 952 978 984 976 964 955 951 958 986 1027 1059 1068 1053 1032 1017 1016 1025 1035 1042 1047 1053 1061 1073 1084 1086 1072 1047 1026 1016 1004
324A004k8l3rK2K2j1l7l7k0j4j4%K0K2NoMK0K0Lj0j8k1j9lJ9L0K1Loj4k2k7k6k3k4j8KK3K8
$$ 1004 976 943 934 956 978 967 930 893 873 859 845 845 865 887 892 886 890 910 930 933 923 905 884 865 862 881 911 932 935 929 915 893 866 840 817 793 775 777 800 828
319H28J7J0J4J3mk3k7j6pmKJ0J5J0LjNJ1J5J2J1J3J4J3Olrj1j3j5j8j8rPK2K5J8QLjmlNJ0
$$ 828 845 855 869 882 878 855 828 812 805 801 803 813 828 838 841 840 845 856 871 883 894 907 921 934 940 937 928 917 904 889 871 853 844 851 873 898 916 924 927 926 922 919 924 934
314I34J0Olj1j2MK8L7K2jj0ompl%pj8j7mJ0J6J9K3K1J0%NJ3J0ok2k7k0j0lrk1k5j6ppj0%J8
$$ 934 944 950 947 936 924 928 956 993 1015 1014 1004 998 994 987 984 984 977 959 942 938 948 964 983 1006 1027 1037 1037 1042 1055 1065 1059 1037 1010 990 980 977 968 947 922 906 899 892 882 882 900
308I00K9K2Ppj3j5j2pj1k5l8k8JK8K7PpJK4L8L2J0j9m4n5m8k8pQJ5J9J8J6J5J6Qj0k7l0k2
$$ 900 929 951 958 951 938 923 911 904 893 868 830 802 803 831 858 865 858 859 883 921 953 963 944 900 845 797 769 762 770 785 804 822 838 853 869 877 867 840 810 788
303G88j2OL0N6O4N0L0J2jj6k3k0j6k4l4k7KL2M1L4J7ml0m6m1k4pklmnj0j2j3j7k1j5LK2K9
$$ 788 776 782 812 868 932 982 1012 1024 1023 1007 984 964 948 924 890 863 865 897 938 972 989 985 955 909 868 844 837 835 832 828 823 813 801 788 771 750 735 738 760 789
298G89K5K3J8J0Jpj2j4j1pj2k1j5J5M5M5K2Joj4k7k6rPQJ0K1K6J5%J0M2O1M3jm3o2n5m0l4
$$ 789 814 837 855 865 866 859 847 833 822 815 803 782 767 782 827 872 894 895 889 875 848 822 813 820 828 838 859 885 900 900 910 952 1013 1056 1055 1012 950 895 855 821
293H21l5k9pJ6K7K2J4Noj0%J8K7K5J8J1NLONmj1plqj4nJ1J0rk0nK3L4J8j4l7l2MM3M9K0j2
$$ 821 786 757 750 766 793 815 829 834 828 818 818 836 863 888 906 917 922 925 931 936 932 921 914 911 903 889 884 895 905 896 876 871 894 928 946 932 895 863 867 910 959 979 967
288I67k0p%mj2j5j4mRJ6J2Jpj4k8m3m0j4J4K8K1Pj%MMKJkqj0%J7K5J9J5K0L0K9J7Nmj5k4k4
$$ 967 947 940 940 936 924 909 895 891 900 916 928 929 922 908 880 837 797 783 797 825 846 853 852 852 856 860 862 863 861 853 843 843 860 885 904 919 939 969 998 1015 1020 1016 1001 977 953
283I53j3nj0j9j7JJ6J5KkRK0J4pj9j4moj9k7j7OK2J6j2m1m4k5lPQROkj5k4k1rJ2L0L1J2j0
$$ 953 940 935 925 906 889 890 906 921 923 921 930 950 964 957 938 924 920 914 895 868 851 857 879 895 883 842 798 773 770 777 785 794 800 798 783 759 738 729 741 771 802 814 804
277H04j2PK9L7K5%j7j4KJ0KrnOJ1PQJ6J8Lj6j9lJ5J2j0k5j2J4K6J3pj2j4k2l1j8J0K9K5J2
$$ 804 792 799 828 865 890 890 873 859 861 871 873 864 859 865 876 883 891 907 925 928 912 893 890 905 917 907 882 870 884 910 923 916 904 890 868 837 819 829 858 883 895
272H95Kqj5j9j2%J7K9K9Rj7k9k0j1j2j2jJ4J3lj9k0oJ5L0L4K6J8J3Onj0lMKppJkk1m0l3oK0
$$ 895 897 889 874 855 843 843 860 889 918 927 910 881 861 850 838 826 825 839 852 849 830 810 804 819 849 883 909 927 940 946 941 931 928 932 934 927 920 921 919 898 858 825 819 839
267H39K6J7Mnj2j3oLLqj6oJ6K9K4J2NJj1k4k7j1PJ0qk9l5k2JJ4J5Mj9m2n8n6m3k8j4JK0L3
$$ 839 865 882 886 881 869 856 850 853 856 848 832 826 842 871 895 907 912 913 902 878 851 840 847 857 849 820 785 763 764 778 793 797 778 736 678 622 579 551 537 538 558 591
262E91L8L6L5L9L7K7J1kmNJ1NmkMQNOJ6K3J5mk1k6j7nPJ8L0L5K3ql0k5kJ0Lnk%mlNMj1j8q
$$ 591 629 665 700 739 776 803 814 812 808 813 824 829 825 823 827 835 840 846 862 885 900 896 875 849 832 827 834 852 882 917 940 932 902 877 875 885 888 883 881 881 877 874 879 883 872 854 846
256H46Lnj9j0J0J4mj4jJ1J0QK0L4K3j1l9m6l3j0J4K7K1Lr%J8K5J1j4k7k7k1j4kOJj3k0j2l
$$ 846 849 844 825 815 825 839 835 821 820 831 841 849 869 903 926 915 876 830 797 787 801 828 849 852 843 843 861 886 897 883 856 829 808 794 792 798 799 786 766 754 751
251G51j0k3k3oJ5K9L4L5K8J9J6J2kj5j2LPoj4LK3J8j0k7j7J3L3L4K0Nm%Ljj5k8l0k2j0kqj9
$$ 751 741 718 695 689 704 733 767 802 830 849 865 877 875 860 848 851 858 852 838 841 864 882 872 845 828 841 874 908 928 933 929 929 932 931 916 888 858 836 826 824 816 797
246G97j9jJ8K2J1RJ9K6J9LkLJj5k6j6QJ8Qrj6j0mLJ4K2K0Pnj4k4k6j4J3K9J8mj4oJlqq%Lm
$$ 797 778 777 795 817 828 837 856 882 901 904 902 905 906 891 865 849 857 875 883 874 858 848 844 847 861 883 903 910 905 891 867 841 827 840 869 887 883 869 863 864 861 853 845 845 848 844
240H44k2l6l0JL5N0L9K4J7J3Mrk2k6j9mQPmj0%J2J4Jj2j5oJ1K4K3Mj8l3l4k6j7qLJ7L4L8K1
$$ 844 822 786 756 757 792 842 881 905 922 935 939 930 908 882 863 859 867 874 870 860 860 872 886 887 875 860 854 865 889 912 916 898 865 831 805 788 780 783 800 834 872 893
235H93ok3k0j0nJJ4K5K2J1QRlk8m4l2oQLqj1jJ0J1kj7rK1M4L6Nj9j7LK3L2K0mj9j1J1K9L0
$$ 893 887 864 844 834 829 830 844 869 891 902 910 919 916 888 844 812 806 814 817 809 798 797 807 818 816 799 790 811 855 891 896 877 860 863 886 918 938 934 915 904 915 944 974
230I74J8jk3l5k8j2lppLRlj6j1%pk1j9PK3J5%jQJ0NMPKj0j5qKLpj2jK0L2K3Jj3j0oj9l8m6
$$ 974 992 991 968 933 905 893 890 883 876 879 888 885 869 858 858 851 830 811 818 841 856 856 855 863 873 878 882 889 891 881 866 858 860 863 856 844 843 863 895 918 919 906 896 890 871 833 787
224G87l1qJ4K9L2K3J4J4J6Kk5m0k5%J2J2J8L1L5K1jk0k8k2qKJqj2qkMJ0J5Kk2l8k4J2M2N2
$$ 787 756 748 762 791 823 846 860 874 890 892 867 827 802 802 814 826 844 875 910 931 930 910 882 860 852 854 855 847 835 827 825 829 839 854 856 834 796 772 784 826 878
219H78L8J5mnRK3K6K3J9Ok0m7m9k9j4j8l1k4mJ2J7J4Qjj4j5oJlj3j4lJ9L5L4J6MJ1K4K1kj8
$$ 878 916 931 927 922 931 954 980 1003 1022 1028 1008 961 912 883 869 851 820 796 792 804 821 835 843 842 828 813 807 808 805 792 778 775 794 829 863 879 883 894 918 939 937 919
214I19j1ORJOK5L6J9pk0j4nlnkmj9l5m1k8j1jMJ3K2K6J8Kj6l0l0j1QQkoOJ8J6Njjqk1k5j4
$$ 919 908 914 923 924 930 955 991 1010 1003 983 969 964 961 956 954 950 931 896 855 827 816 815 819 832 854 880 898 900 884 854 824 813 821 829 827 821 827 845 861 866 865 864 856 835 810 796
208G96j%j2j9j6qkkPK1L1K6J9J5J5OnkRPj9m7n5l8j4RK5L1K8K5K8K5Lk2k1NK9K7J3J%RK7M1
$$ 796 795 795 783 764 748 740 738 736 743 764 795 821 840 855 870 876 871 869 878 885 866 819 764 726 712 721 746 777 805 830 858 883 886 864 843 848 877 904 917 918 918 927 954 995
203I95L4Ll1n2n9o5o6m6j1J8K7K5J9J2LjQK1K6J5lk0k8l3l2k0KK1K6J8Mqj7k2k1j2LK0K8J7
$$ 995 1029 1032 1001 949 890 825 759 713 702 720 747 772 791 803 806 805 813 834 860 875 872 852 824 791 759 739 741 762 788 806 810 802 785 763 742 730 733 753 781 798
198G98qk1j7%J5K5K9K2J1PJ7K4J2pj7j9k2k2pJ8K8K2J2QjrjJ6J7nl1m2m0l8k3KJ8J3MOJ5J1
$$ 798 790 769 752 752 767 792 821 843 854 861 878 902 914 907 890 871 849 827 820 838 866 888 900 908 907 898 897 913 930 925 894 852 812 774 751 753 771 784 788 794 809 820
193H20NMLlnOJ6J4J8L0K8pm2l8j2j0l7m5j8RPnlQPLJ0J8K3K5L2K7Kk5l1k2j3qmkkkNJ5J6J2
$$ 820 825 829 832 829 824 830 846 860 878 908 936 929 887 849 837 827 790 745 727 736 743 738 735 743 750 753 763 781 804 829 861 888 890 865 834 812 799 791 787 785 783 781 786 801 817 829
187H29QQJ3K6L2J1l1o2n9l5j2QK6L2J4prLJrpK0M7N5M3J4k1m3l8j7pj2j6pKLKLJrrQK5K6J3
$$ 829 837 845 858 884 916 927 896 834 775 740 728 736 762 794 808 801 792 795 796 787 780 800 847 902 945 959 938 895 857 840 833 821 805 798 800 803 805 808 809 800 791 799 824 850 863
182H63OOjj8l2k2JJ4Jk1l1k2rm%NJj6k7j2K2M2L6J6JkKJ1K0K0J1LMJ3K1K4J7%j6j7nKnj9k4
$$ 863 869 875 874 856 824 802 803 817 818 797 766 744 735 731 731 736 737 721 694 682 704 746 782 798 799 797 799 810 830 850 861 864 868 881 902 926 943 943 927 910 905 907 902 883 859
176H59j8pMPJrj2j0j6k6k1NK7K3J1J6L4L7J2j3j7%J4J6Qnj9k4j6kKqk5k8j2J4L6M0K7Oj2j6
$$ 859 841 834 838 845 846 837 825 815 799 773 752 757 784 807 818 834 868 905 917 904 887 887 901 917 925 920 901 877 861 859 861 853 828 800 788 802 838 878 905 911 899 883
171H83j1kkorrj0j3rKQjqplormQJ3RMnj8k5j4LLj5k2lK0K3J2J5K7K3Lj4j0%LJQK2K6J4nk2
$$ 883 872 870 868 862 853 844 834 821 812 814 822 821 813 806 803 797 788 784 792 805 814 818 813 795 770 756 759 762 747 725 722 742 765 777 792 819 842 845 831 821 821 824 825 833 855 881 895 890 868
165H68l7m3l1qMkqPL1L6J6oj2mJJLRJ4J6J4NjQK5K9Kk9k7OL4K8Jj8j2QK0J4j5m3n2l4j3kN
$$ 868 831 788 757 749 753 751 743 750 781 817 833 827 815 811 812 813 816 825 839 855 869 874 873 881 906 935 937 908 881 887 921 949 950 932 920 928 948 962 947 904 852 818 805 803 808
160H08J7K5J2j7l7l2j4mlJRJ2PPJ9L3L3J6ok0k7l0k3%K8M1L7K5J9J2mj9k3j3nnj1j8k5k8k4
$$ 808 825 850 862 845 808 776 762 758 755 756 765 777 784 791 810 843 876 892 886 866 839 809 786 786 814 855 892 917 936 948 944 925 902 889 884 879 868 850 825 797 773
155G73j8j7j8j0RK2K2J4J3K4L1K3Ooojlj3j8pPPj0j4J1M2M5J1k0k3mJ1Pmj1j4j8j8j5qlRK6
$$ 773 755 738 720 710 719 741 763 777 790 814 845 868 874 868 862 861 858 845 827 820 827 834 824 810 821 863 908 919 899 876 872 883 890 886 875 861 843 825 810 802 799 808 834
149H34L5J8j9n3o3n0k7mJ9L7L8K9J9J6J0jqlROj4l1k9qJ1J8Qoj6oK2M6L7jl8m5k5nloKJ7K4
$$ 834 869 887 868 815 752 702 675 671 690 727 765 794 813 829 839 838 830 827 836 842 828 797 768 760 771 789 797 791 775 769 791 837 874 873 835 790 765 760 757 751 753 770 794
144G94J7PMjj5l6m1l0j2LJ9L9M8L5J5OROoj0JJ7J7RMLNRJ6J5N%RK1J9Kj0j0nmrj4k2k7k5j8
$$ 794 811 818 822 821 806 770 729 699 687 690 709 748 796 831 846 852 861 867 861 851 852 869 886 895 899 902 907 916 932 947 952 952 961 982 1001 1003 993 983 978 974 965 951 929 902 877 859
139H59j7j6mJ4J6jj7j9j2qkQJ5Pj0j5mJ0K1K6K3Pj0j0J1L2L3J9Lornkj3l8n1l3jJ5NqoJnk5
$$ 859 842 826 822 836 852 851 834 815 803 795 793 801 816 823 813 798 794 804 825 851 874 881 871 861 872 904 937 956 959 953 944 939 937 924 886 835 802 801 816 821 813 807 808 803 778
133G78l4k3%J4J1nk0k3rJ7L6L7L0K5K3J4kj4j9j6j3plKLMLoj6j3OK2K1RMOKnlJ1J8J0oj5j3
$$ 778 744 721 721 735 746 741 721 698 689 706 742 779 809 834 857 871 869 855 836 820 807 800 797 799 802 806 809 803 787 774 780 802 823 832 836 842 844 839 836 847 865 875 869 854 841
128H41qrj5j9j1LJ4J4N%%j%PJ6J3j1l6l7k2oKJ3K8L5K5J0MKmjJ6L3K3pk7j9%NPK0L6L4J9N
$$ 841 833 824 809 790 779 782 796 810 815 815 815 814 814 821 837 850 839 803 766 744 738 740 753 781 816 841 851 855 857 853 852 868 901 924 917 890 871 871 876 883 903 939 973 992 997
122I97%rk1k0plplJ7K7Rk0l2k6k2k3k1j6j4j5nJ5L1L6L7L2J3oqQK1J7Omj5k7k8j9j0j1mJ4
$$ 997 997 988 967 947 940 937 930 927 944 971 980 960 928 902 880 857 836 820 806 791 786 801 832 868 905 937 950 944 936 944 965 982 988 984 969 942 914 895 885 874 870 884
117H84K4J4pk4l6m5m0j3J4J9J0J0K0K1J2J0J9J7ql0l3k5k4k6j8JJ7K4K2J1ko%J0J3J7K5L2
$$ 884 908 922 915 891 855 810 770 757 771 790 800 810 830 851 863 873 892 909 901 871 838 813 789 763 745 746 763 787 809 820 818 812 812 822 835 852 877 909
112I09J9qk9k9j3%J0J7K1K0J1Jrj7j2jJ2J3Opk0l3l6l0j8j1pLJ1QooJ4L6L8K3J7J8J5RJ1J7
$$ 909 928 920 891 862 849 849 859 876 897 917 928 929 920 903 891 890 902 915 921 914 894 861 825 795 777 766 759 762 773 781 775 769 783 819 857 880 897 915 930 939 950 967
107I67Jl4n2l3%J1OPJ2Lj6l1l5l5k9pJ4J5pk0pK1L9M3L6K0jj2ojrk5k8j3MJ2J0LkkOJ9K1Q
$$ 967 968 934 882 849 849 860 866 873 885 888 872 841 806 771 742 735 749 764 757 737 730 751 790 833 869 889 888 876 870 869 860 835 807 794 798 810 820 823 821 819 825 844 865 873
102H73j6l5k9nJ3J1JjJ0J1Jj0k0k9l2j6J2K4J5NRJ0L%J4K4J1j3k0rMRPmk0k1kJ9J3j1j9q%
$$ 873 857 822 793 788 801 812 813 812 822 833 834 824 804 775 743 727 739 763 778 783 792 802 805 805 819 843 854 841 821 812 816 825 832 828 808 787 785 804 817 806 787 779 779
97G79jJ3L7M0J4j3j3OJ8K0J3%j2j6prk3l1rK3L5K1Kj0j9k1j2qk2m5m7j4K9N2N2L9K3J0NRJ2
$$ 779 778 791 828 868 882 869 856 862 880 900 913 913 901 885 878 869 846 815 806 829 864 885 887 877 858 837 825 817 795 750 703 689 718 770 822 861 884 894 899 908 920
92I20J2J0RKqqJjj7l1k3pqk0j6NJ5%k1k0kJ1R%pj3j6j0PK2L0L1K4J2LMJ1Qmj3j0pj4k3k2j0
$$ 920 932 942 951 953 945 937 938 937 920 889 866 859 851 831 815 820 835 835 814 794 792 803 812 812 805 792 776 766 773 795 825 856 880 892 895 899 910 918 914 901 891 884 870 847 825 815
86H15KJ2J7Pj4k5oK1K7Oj9l0k9j9OL8M9K8lj2lMmj8k3j6JK0K5J1qj2ojpj3j0%RJ0jj8l0k2
$$ 815 817 829 846 853 839 814 808 829 856 862 843 813 784 765 771 809 858 886 883 871 868 872 868 850 827 811 812 832 857 868 860 848 842 841 834 821 811 811 820 830 829 811 781 759
81G59%J3J2OQJ0QKLRJ0LmjNOkj7k7k7k3j5oJ0L2M4L5J3pj4rj%lqj4j4mJ1J9J8J9L1M5M0J2
$$ 759 759 772 784 790 798 808 816 818 821 830 840 843 839 838 843 849 847 830 803 776 753 738 732 742 774 818 853 866 859 845 836 835 835 832 824 810 796 792 803 822 840 859 890 935 975 987
75I87k7n5o3n2l0oRJ1QKpj5j4jJ7K9L6L5J9mj6oNmk4l1j9qlLJ0Pj2k8k4LL3M9M3K4Olrj8k4
$$ 987 960 905 842 790 760 754 763 774 782 784 777 762 748 747 764 793 829 864 883 879 863 857 862 858 834 803 784 776 773 776 786 793 781 753 729 732 765 814 857 881 887 884 875 857 833
69H33j8j0rj1%K0L2K9J5Krj4oOKk0l9l3qJ3J7Jj9k6j3Jlk1k3JK7K6Kj5j0J2L8O0N8K8j1l1
$$ 833 815 805 796 785 785 805 837 866 881 883 874 860 854 860 862 842 803 770 762 775 792 793 774 748 735 736 733 712 689 690 717 743 745 730 720 732 770 830 888 916 905 874
64H74k1KJ9J7qm3o1m7j2J8K6J7lj8j9lJ0J0J3K5K8Kl5m4k0KJmk%rj2%J5J7J4J7J4MmRK7L1
$$ 874 853 855 874 891 883 840 779 732 720 738 764 781 778 760 741 738 748 758 771 796 824 826 791 747 727 729 730 726 724 724 715 703 703 718 735 749 766 780 784 780 789 816 847
59H47K1Pkj5k3j6%Lrj6nJ0J2Kmlkqj2j3qjNOQJ4K7K9J4j6l7l1nJ6J2npJ5M0M5K7Mj2k3k6k1
$$ 847 868 875 873 858 835 819 819 822 813 797 792 802 814 816 812 809 807 799 787 774 766 765 770 776 784 798 825 854 868 852 815 784 779 795 807 802 795 810 850 895 922 926 914 891 865 844
53H44j0rr%K0L1J9lpRK1J0j3l0k9j7lQJ8L0M0M3L1Mk2l2k4j6k1l5m2l3j8rj1j6j6nJ3K8K3
$$ 844 834 825 816 816 836 867 886 883 876 885 906 916 903 873 844 827 824 832 850 880 920 963 994 998 976 944 920 904 883 848 806 773 755 746 735 719 703 698 711 739 762
48G62Kj7j5NK4K8J8Nk%RJ3RkqnNJ3Orj8rMLj0j8j4j0j8k2j0MNmlOP%MJ8K9K6K7L7L4Ol0l7
$$ 762 764 747 732 737 761 789 807 812 810 810 819 832 841 839 831 826 831 844 850 841 823 814 818 821 811 793 779 769 751 729 719 723 728 724 721 727 734 734 738 756 785 811 838 875 909 915 885 848
42H48j5RJ8J4Nrk1k6k2j9k0j6pjkKJ5K5J7KkJ1J8J2LJ0K5K5Nj7k6j9j0qj0j0oKPlk0k6j3O
$$ 848 833 842 860 874 879 870 849 823 801 782 762 746 739 738 736 738 753 778 795 797 795 806 824 836 839 849 874 899 904 887 861 842 832 824 814 804 798 800 807 804 784 758 745 751
37G51J4QKLNMNJ0J6K3K4K2J5Njnqj3k1k9l7m0l1rJ7L3L3J7ok3j8NK7L5K8K1J3MnnLMJKJ5K5
$$ 751 765 773 775 778 783 787 792 802 818 841 865 887 902 907 906 901 893 880 859 830 793 753 722 713 730 763 796 813 807 784 766 771 798 833 861 882 895 899 894 889 892 896 897 899 914 939
31I39J7kj5j8k2k9l2k8k5k4j2J4L3K6Mp%RQQJ4J7J0%NJ4J1qk3k6j9j6j1JJ4J9Oj5k9k6qJ2
$$ 939 956 954 939 921 899 870 838 810 785 761 749 763 796 822 826 819 819 828 836 844 858 875 885 885 890 904 915 907 884 858 839 823 812 813 827 846 852 837 808 782 774 786
26G86K5K7K0Mj4k0rLkj5j9nRNnrlPRjj4j9nJ2J4%mRJ9Pj4j7kQMomKOJ1J4J3Nj%jpj7k2k2k1
$$ 786 811 838 858 862 848 828 819 822 820 805 786 781 790 795 790 781 778 785 794 793 779 760 755 767 781 781 777 786 805 812 798 781 779 787 791 785 781 783 789 800 814 827 832 831 831 830 823 806 784 762 741
20G41k0j5mJ0K3K8J5j3m0m3k3NK7L9M4L9J8j4l8m4l2j5onqlRK2K9K6J8J4J5J7Rj1l1l6k6j3
$$ 741 721 706 702 712 735 763 778 765 725 682 659 664 691 730 774 813 831 817 779 735 703 688 682 677 669 666 675 697 726 752 770 784 799 816 825 814 783 747 721 708
15G08nQK5L5K2mk1j7prj6j5nMJ2K0K8K2J2QJ4J5Lj3k4k9l2k7j2LRMjopn%PJ8L0M0L3J2nnK
$$ 708 703 711 736 771 793 789 768 751 744 735 719 704 699 703 715 735 763 785 797 805 819 834 837 824 800 771 739 712 700 703 712 716 715 709 702 697 697 704 722 752 792 825 837 832 827 829
10H29joRK9L3J4NJ4K5J6mj5k2l2l9k4NK7K1jk1k4j0OOrk3j7KJ5J2jj4k1j6lQJ0QRJ4Rkrj2
$$ 829 828 822 831 860 893 907 912 926 951 967 963 948 926 894 855 831 836 863 884 883 862 838 828 834 840 831 808 791 793 808 820 819 805 784 768 765 773 783 791 800 814 823 821 812 800
4H00j6k1j2RK5K7J9J0nj8j4KJ4Lj6j6n%olJ5K7J8ok3k6k2nJ8L6L2J7J3K4L0J9jpkLK%KOOn
$$ 800 784 763 751 760 785 812 831 841 836 818 804 806 820 823 807 791 786 786 780 777 792 819 837 831 808 782 760 755 773 809 841 858 871 895 925 944 943 936 934 937 939 939 941 947 953 948
-2I48k5m1m2k7j2mmLJ8K9K9J6lj6j6nOPJKRJ3J0nk0k9k4oRJ0OPJ3J2NLJ2K0J1oj7j4nNPmk3
$$ 948 923 882 840 813 801 797 793 796 814 843 872 888 885 869 853 848 854 861 862 864 873 886 896 891 871 842 818 812 821 831 837 844 857 869 874 877 889 909 920 914 897 883 878 883 890 886 863
-7H63l8l1nK2L0J6koPJ6Roj6k0k9l2j5RJ6KlJ8L4J9j6l1k4j7k4l0j8QM1O1N0Rl4m1j6J1J9
$$ 863 825 794 789 811 841 857 855 849 856 872 881 875 859 839 810 778 763 772 788 790 787 805 839 858 842 811 787 770 746 716 698 706 747 808 858 867 833 792 776 787 806
-12H06J8J4pl3m1j6J7K8K4L0M6N1K6j6n1n7l2%J3%j6j3%LnmJ2K4K0J1Lj0k7l6k6qKJnokOJ5
$$ 806 824 838 831 798 757 741 758 786 810 840 886 937 963 947 896 839 807 807 820 820 804 791 791 794 789 785 797 821 841 852 855 845 818 782 756 748 750 751 746 740 738 744 759
-18G59K3K3J5Nmrj4j5j7j8nK2M7M8J8j9l5k8k3k4k7j6%J1J3J5J9K9M1M0J8j9m3l9j9j0j2j5
$$ 759 782 805 820 825 821 812 798 783 766 748 743 765 812 860 878 859 824 796 773 749 722 706 706 717 730 745 764 793 834 874 892 873 830 791 772 762 750 735
-22G35qJjlmnpnNJ7K1K2K3J0j9m8m8k4jOJ0K4L8L5J7PJ2K2K8L2L1J8ok4k1pLJrj7l0l8k5R
$$ 735 727 728 727 724 720 715 708 703 708 725 746 768 791 801 782 734 686 662 661 667 677 701 739 774 791 798 810 832 860 892 923 941 935 911 890 883 886 887 878 861 831 793 768 777
-28G77L8L6J0j3j2LJ0jk3m1m2k7nRJ4K0K9L5L0K0Qmj9l1l2j8NJ9J6%lJ6L9L0ml4l5j9rj0j4
$$ 777 815 851 861 848 836 839 849 848 825 784 742 715 710 719 733 753 782 817 847 867 875 871 852 821 789 771 776 795 811 811 808 824 863 893 889 855 820 801 792 782 768
-33G68j7j0QK9K4jj8oJ5J3nk0j9k1k0qJ0J5JrnKJ1K3L4K4lk2j5kqk7l3k0pljQJ5J8J3OLMM
$$ 768 751 741 749 778 802 801 783 777 792 805 800 780 761 740 720 712 722 737 738 729 724 726 737 760 794 818 815 793 778 776 768 741 708 688 681 678 677 685 700 718 731 737 740 744 748
-38G48j1l1l0JM1N5M0J5nj7k1j4%J3J7J2mk5l8l0pJ3K7L4L7K8J2OJ1J5Orj6j4j3k0l5m3l9
$$ 748 737 706 676 677 718 773 813 828 823 806 785 771 771 784 801 813 809 784 746 716 709 722 749 783 820 848 860 866 877 892 898 889 873 859 846 826 791 748 709
-43G09k7j8j6j1kPN%QK1K0%j9k0qJMLkroRK6L3L5M2M6L2Kk3k6j9j3oJ4L6L6J0j9k8j3J0K4
$$ 709 682 664 648 637 635 642 647 647 655 676 696 696 677 657 649 650 654 657 655 646 640 649 675 708 743 785 831 863 865 842 816 797 784 778 792 828 864 874 855 827 814 824 848
-48H48K4J3oj9k1j4j6l1l9k4kKj0rK0M9M7K2%qj8l2k9KL2L1%k6k9j6jJ4K4J9%j8k0pJ0J6J5
$$ 848 872 885 879 860 839 825 809 778 739 715 713 715 705 696 716 765 812 834 834 826 808 776 747 749 781 812 812 786 757 741 740 754 778 797 797 779 759 752 762 778 793
-53G93J0J2K1K3Qk0l0j2J2J4pk3k0oLLJKQJ5J7QJOK3L1K3J0NLj1l2m1l4j8mLMkpopj7k6k2
$$ 793 803 815 836 859 867 847 817 805 817 831 824 801 781 775 778 781 782 784 792 807 824 832 833 839 862 893 916 926 931 934 923 891 850 816 798 794 797 801 799 792 786 779 762 736 714
-59G14lJ4J7Nj1k6k7j2J0K6K4J3mj9k1nJ9K5J0okOKoML4N5N1L0Rj3m5o5n0j1J8J5lj1j1j4
$$ 714 711 725 742 747 736 710 683 671 681 707 731 744 740 721 700 695 714 739 749 743 741 747 749 743 747 781 836 887 917 926 913 868 803 753 742 760 775 772 761 750 736
-64G36j8pJ1J7OLJ3J9QoJK0K5J2JOJ6J4Jj2j9k2k3j7j3qokNRJ3J1Moj5j3oNJ2J4PJJRR%j2
$$ 736 718 711 722 739 745 748 761 780 788 782 783 803 828 840 841 847 863 877 878 866 847 825 802 785 772 764 758 756 761 770 783 794 798 792 777 764 758 763 775 789 796 797 798 807 816 816 804
-69H04j4nPJ6J5NopJRPMQJ3J1Kqj5j9j5lJ0Qj0k0rJ4K0Lj9k1qok1l2k5lRN%lmjJ8M3N1L4J4
$$ 804 790 785 792 808 823 828 822 815 816 825 832 836 844 857 868 870 862 847 828 813 810 820 828 818 798 789 803 823 826 807 786 778 772 751 719 694 691 700 705 705 702 698 697 715 758 809 843 857
-75H57J0J3kl1m9m1j7LJ4J5Poj5k1k0mK2M2K9j1m3m4k5j0kJ0K4K9J7jj3j5nPJ6J7J4J3Rjj2
$$ 857 867 880 878 847 798 757 740 743 757 772 779 773 758 737 717 713 735 777 806 795 752 708 683 673 671 681 705 734 751 750 737 722 717 724 740 757 771 784 793 792 780
-80G80j6j3j5k6l1j6RK4K4K3L0K9J0j3k0kJ9K9K7K1J2%mJLj1l5n1m4j9OJ6Qj0k1j5JMpk0k4
$$ 780 764 751 736 710 679 663 672 696 720 743 773 802 812 799 779 777 796 825 852 873 885 885 881 882 885 874 839 788 744 725 731 747 755 745 724 709 710 714 707 687 663
-85F63j5lNNJlj0k3k9k0%Mqj2J3M7N2K2rrQK5L1L4L1K5J3jj4k1j1QRj8m7n0l6k4j3QL2L2J2
$$ 663 648 645 650 655 656 653 643 620 591 571 571 575 567 555 568 615 667 689 680 671 679 704 735 769 800 825 838 837 823 802 791 799 808 790 743 693 657 633 620 628 660 692 704
-91G04KJ6L0K1oj8kK1L2K6Qj1k4k7j7mJnj4j1NK2K7K1J1Lj0k1k5k2k3k9k5pJ7K8K9K5J2pj3
$$ 704 706 722 752 773 767 749 747 768 800 826 834 823 799 772 755 751 752 747 733 722 727 749 776 797 808 811 801 780 755 733 710 681 656 649 666 694 723 748 760 753 740
-96G40MK6K3mk2j8j4k0k0J1M9N8L5J3J0Lk2m8m4j9QK2L0K6Pj3j9j4j3j9j4J0K8K5Onmjqj5
$$ 740 744 770 793 789 767 749 735 715 695 706 755 813 848 861 871 874 852 804 760 741 749 771 801 827 834 821 802 788 775 756 742 752 780 805 811 806 802 801 793 778
$$ [...]
-1604G25
##END=	
##END=	
