##TITLE=	2nmAadLbRNSUOEiDCky7sA.73.ser
TM-VI-106solid Mg+unprotect.-pyrraz. d6-dmso. hmbc

##JCAMP-DX=	6.0	$$ MestReNova 14.3.0-30573
##DATA TYPE=	LINK
##BLOCK_ID=	1
##BLOCKS=	2    
##ORIGIN=	Mestrelab Research S.L.
##OWNER=	hrzepa
##$MNOVA/LINK_BLOCK_TYPE=	ITEM	$$ NMR Spectrum
##$MNOVA/ITEM/POLYGON=	(XY..XY)
5321,5835
8722,5835
8722,8208
5321,8208
5321,5835
##$MNOVA/ITEM/Z=	0
##$MNOVA/ITEM/ANGLE=	0
##TITLE=	2nmAadLbRNSUOEiDCky7sA.73.ser
##JCAMP-DX=	6.0	$$ MestReNova 14.3.0-30573
##BLOCK_ID=	2
##DATA TYPE=	MNOVA NMR VIEW DATA
##DATA CLASS=	MNOVA VIEW DATA
##$MNOVA/2D/THRESHOLD=	3.0972397327423095703
##$MNOVA/ITEM/ZOOM/X=	-0.47501081208716700033,	14.504330000039219684
##$MNOVA/ITEM/ZOOM/Y=	-9.5107036222489718114,	249.98529999918474687
##END=	
##TITLE=	2nmAadLbRNSUOEiDCky7sA.73.ser
##JCAMP-DX=	6.0	$$ MestReNova 14.3.0-30573
##BLOCK_ID=	3
##DATA TYPE=	nD NMR SPECTRUM
##DATA CLASS=	NTUPLES
##NUMDIM=	2
##ORIGIN=	Bruker BioSpin GmbH
##OWNER=	nmr
##.OBSERVE FREQUENCY=	400.41280287000000726
##.OBSERVE NUCLEUS=	^1H
##.SOLVENT NAME=	DMSO_weak
##.PULSE SEQUENCE=	hmbcgplpndqf
##LONGDATE=	2021/10/21 05:00:12.000
##.ACQUISITIONMODE=	SIMULTANEOUS (DQD)
##$ORIGINAL FORMAT=	Bruker XWIN-NMR
##$MNOVA/SCALES_VERSION=	9
##$PARAMETER FILE=	(acqu2s, ASCII, /private/var/folders/f6/rjf_tdyn2v98c5c0wvkgn4s80000gn/T/2nmAadLbRNSUOEiDCky7sA/73/acqu2s, 0)
$$ ##TITLE= Parameter file, TOPSPIN		Version 3.2
$$ ##JCAMPDX= 5.0
$$ ##DATATYPE= Parameter Values
$$ ##NPOINTS= 129	$$ modification sequence number
$$ ##ORIGIN= Bruker BioSpin GmbH
$$ ##OWNER= nmr
$$ $$ 2021-10-21 05:19:48.487 +0100  nmr@CZC10666PP
$$ $$ /opt/topspin/data/agmb/nmr/Oct20-2021/73/acqu2s
$$ $$ process /opt/topspin3.2/prog/mod/go
$$ ##$ACQT0= 0
$$ ##$BF1= 100.683175
$$ ##$FnMODE= 1
$$ ##$NUC1= <13C>
$$ ##$NusJSP= 0
$$ ##$NusT2= 1
$$ ##$NusTD= 128
$$ ##$O1= 12080.308799824
$$ ##$SFO1= 100.6952553088
$$ ##$SW= 259.972631192251
$$ ##$SW_h= 26178.0104712042
$$ ##$TD= 128
$$ ##END=
$$ 
##$PARAMETER FILE=	(acqus, ASCII, /private/var/folders/f6/rjf_tdyn2v98c5c0wvkgn4s80000gn/T/2nmAadLbRNSUOEiDCky7sA/73/acqus, 0)
$$ ##TITLE= Parameter file, TOPSPIN		Version 3.2
$$ ##JCAMPDX= 5.0
$$ ##DATATYPE= Parameter Values
$$ ##NPOINTS= 12	$$ modification sequence number
$$ ##ORIGIN= Bruker BioSpin GmbH
$$ ##OWNER= nmr
$$ $$ 2021-10-21 05:19:52.985 +0100  nmr@CZC10666PP
$$ $$ /opt/topspin/data/agmb/nmr/Oct20-2021/73/acqus
$$ $$ process /opt/topspin3.2/prog/mod/shimcntl
$$ ##$ACQT0= 1000000
$$ ##$AMP= (0..31)
$$ 100 100 100 100 100 100 100 100 100 100 100 100 100 100 100 100 100 100
$$ 100 100 100 100 100 100 100 100 100 100 100 100 100 100
$$ ##$AMPCOIL= (0..19)
$$ 0 0 0 0 0 0 0 0 0 0 0 0 0 0 0 0 0 0 0 0
$$ ##$ANAVPT= -1
$$ ##$AQSEQ= 0
$$ ##$AQ_mod= 3
$$ ##$AUNM= <au_zg>
$$ ##$AUTOPOS= <54 >
$$ ##$BF1= 400.41
$$ ##$BF2= 100.683175
$$ ##$BF3= 400.41
$$ ##$BF4= 400.41
$$ ##$BF5= 400.41
$$ ##$BF6= 400.41
$$ ##$BF7= 400.41
$$ ##$BF8= 400.41
$$ ##$BYTORDA= 0
$$ ##$CAGPARS= (0..11)
$$ 0 0 0 0 0 0 0 0 0 0 0 0
$$ ##$CFDGTYP= 0
$$ [...]
$$ 0 0 0 0
$$ ##$ShimPowMaxUC= (0..63)
$$ 130000 130000 130000 130000 130000 130000 130000 130000 130000 130000 130000
$$ 130000 130000 130000 130000 130000 130000 130000 130000 130000 0 0 0 0
$$ 0 0 0 0 0 0 0 0 0 0 0 0 0 0 0 0 0 0 0 0 0 0 0 0 0 0 0 0 0 0 0 0 0 0 0 0
$$ 0 0 0 0
$$ ##$ShimPowMaxUG= (0..63)
$$ 524287 524287 524287 524287 524287 524287 524287 524287 524287 524287 524287
$$ 524287 524287 524287 524287 524287 524287 524287 524287 524287 0 0 0 0
$$ 0 0 0 0 0 0 0 0 0 0 0 0 0 0 0 0 0 0 0 0 0 0 0 0 0 0 0 0 0 0 0 0 0 0 0 0
$$ 0 0 0 0
$$ ##$ShimPowRcbType= 3
$$ ##$ShimPowRes= (0..63)
$$ 1e-20 1e-20 1e-20 1e-20 1e-20 1e-20 1e-20 1e-20 1e-20 1e-20 1e-20 1e-20
$$ 1e-20 1e-20 1e-20 1e-20 1e-20 1e-20 1e-20 1e-20 0 0 0 0 0 0 0 0 0 0 0 0
$$ 0 0 0 0 0 0 0 0 0 0 0 0 0 0 0 0 0 0 0 0 0 0 0 0 0 0 0 0 0 0 0 0
$$ ##$ShimPowRng0= (0..63)
$$ 1 1 1 1 1 1 1 1 1 1 1 1 1 1 1 1 1 1 1 1 0 0 0 0 0 0 0 0 0 0 0 0 0 0 0 0
$$ 0 0 0 0 0 0 0 0 0 0 0 0 0 0 0 0 0 0 0 0 0 0 0 0 0 0 0 0
$$ ##$ShimPowRng1= (0..63)
$$ 1 1 1 1 1 1 1 1 1 1 1 1 1 1 1 1 1 1 1 1 0 0 0 0 0 0 0 0 0 0 0 0 0 0 0 0
$$ 0 0 0 0 0 0 0 0 0 0 0 0 0 0 0 0 0 0 0 0 0 0 0 0 0 0 0 0
$$ ##$ShimPowRng2= (0..63)
$$ 1 1 1 1 1 1 1 1 1 1 1 1 1 1 1 1 1 1 1 1 0 0 0 0 0 0 0 0 0 0 0 0 0 0 0 0
$$ 0 0 0 0 0 0 0 0 0 0 0 0 0 0 0 0 0 0 0 0 0 0 0 0 0 0 0 0
$$ ##$ShimPowRng3= (0..63)
$$ 1 1 1 1 1 1 1 1 1 1 1 1 1 1 1 1 1 1 1 1 0 0 0 0 0 0 0 0 0 0 0 0 0 0 0 0
$$ 0 0 0 0 0 0 0 0 0 0 0 0 0 0 0 0 0 0 0 0 0 0 0 0 0 0 0 0
$$ ##$ShimSysFunc= (0..63)
$$ 1 2 3 4 5 7 9 11 15 16 8 10 12 14 6 17 13 18 19 20 0 0 0 0 0 0 0 0 0 0
$$ 0 0 0 0 0 0 0 0 0 0 0 0 0 0 0 0 0 0 0 0 0 0 0 0 0 0 0 0 0 0 0 0 0 0
$$ ##$ShimSysMatrix= 0
$$ ##$ShimSysType= 1
$$ ##$TFXNUM= 0
$$ ##$TRIPLO2= 0
$$ ##$VTU= 2
$$ ##$VTUETH= <149.236.99.20>
$$ ##$VTUTY= <no>
$$ ##$WBREFAM= (0..15)
$$ 135 116 100 100 100 100 100 100 100 100 100 100 100 100 100 100
$$ ##$WBREFLM= (0..15)
$$ 0 0 0 0 0 0 0 0 0 0 0 0 0 0 0 0
$$ ##$WBREFPH= (0..15)
$$ 71.66 -68.25 0 0 0 0 0 0 0 0 0 0 0 0 0 0
$$ ##$WBSGU= (0..15)
$$ 0 0 0 0 0 0 0 0 0 0 0 0 0 0 0 0
$$ ##$XFAC= 2
$$ ##END=
$$ 
##$DECIM=	3328
##$DSPFVS=	20
##.ACQUISITIONSCHEME=	NOT PHASESENSITIVE
##NTUPLES=	nD NMR SPECTRUM
##VAR_NAME=	FREQUENCY1,	FREQUENCY2,	SPECTRUM
##SYMBOL=	F1,	F2,	Y
##.NUCLEUS=	13C,	1H
##.OBSERVE FREQUENCY=	100.69525530880000019,	400.41280287000000726
##VAR_TYPE=	INDEPENDENT,	INDEPENDENT,	DEPENDENT
##VAR_FORM=	AFFN,	AFFN,	ASDF
##VAR_DIM=	512,	512,	262144
##UNITS=	HZ,	HZ,	ARBITRARY UNITS
##FIRST=	25169.313707327481097,	5807.6787752999953227,	0.31623753905296325684
##LAST=	-957.56783717514929322,	-190.19907926730809322,	0.5632839202880859375
##MIN=	-957.56783717514929322,	-190.19907926730809322,	0.0017635230906307697296
##MAX=	25169.313707327481097,	5807.6787752999953227,	17.172388076782226563
##FACTOR=	1,	1,	0.0029649207142573605171
##PAGE=	F1=25169.3
##FIRST=	25169.313707327481097,	5807.6787752999953227,	0.31623753905296325684
##DATA TABLE=	(F2++(Y..Y)), PROFILE
$$ [...]
##PAGE=	F1=-11030
##FIRST=	25169.313707327481097,	5807.6787752999953227,	0
##DATA TABLE=	(F2++(Y..Y)), PROFILE
5808A26j1J1L9j61K23n0j8p5m5J6j3J40lk4K55r5k01r6J32j3K3p3j7J47j49J37q6J4J5j30
5456A8KJ11K9o3qM6J2J46k37J26l5p7n4Q5R0p3pL3j28J31R8j81nJ43Rj19P5km3N8j22J30n3
5068A35o4J15j56nJ14j2p2l3N4L9N7n2o3N3QM6J14r9m6N0j43L9M2o5J3o5J81J7l7nJ33kj67
4681A24r5M8M8r0k3K10%j37%l1J53R0k37m3K08P9r1q2o4Q9nr1J5J68j08J11l2q9l5P2j13Q9
4305A38p4j3J12j31Q5K3j8k3m3j3J13k4o6J32j57j5P8Q8J64j89O7r4k3po9J1J07k9ml5Q0J2
3930A83j13L6J8n2J04M7j4l8r9K03q7j0j16L9m7P0m3K1O6ro2j2O6j13J58j2L0n1r9K4l4J37
3554A91K7j38l7J64n5o3R8m5m0q7J23o3j5RQ0n5n9J39J33j03j48P1K2o4K9J4M1M3j75Q3P0
3190A90K5k6n9M4l7Rm5P7N6j37J2J15j16N5P2j37n8P3L7J33r7j56J5K50J5k50N0m8J40k2n3
$$ plain form
5808 126 115 126 165 4 227 177 159 84 39 55 42 182 179 155 410 315 114 18 150 137 160 87 70 217 68 205 119 133 148 18
5456 18 20 131 160 97 89 135 147 293 56 182 147 70 16 101 191 118 111 144 16 147 245 64 59 202 211 92 167 165 122 180 58 188 135
5068 135 71 186 30 25 139 127 55 22 76 115 172 120 57 110 118 164 278 179 133 183 40 79 121 56 69 4 185 202 165 160 293 291 124
4681 124 29 77 125 35 12 222 222 85 85 54 207 297 60 17 225 304 213 131 67 156 151 60 75 243 135 246 214 125 90 162 49 138
4305 138 64 51 163 32 117 140 122 99 56 43 156 132 66 198 41 26 104 192 356 167 234 140 117 110 41 52 159 130 126 91 171 183
3930 183 70 106 124 72 176 223 209 171 72 275 188 178 62 101 54 124 81 102 168 159 97 85 151 38 196 184 214 163 64 88 54 191
3554 191 218 80 43 207 152 89 187 142 102 15 138 75 60 69 149 94 35 174 307 204 56 127 149 85 114 128 169 212 37 120 190
3190 190 215 189 130 174 137 146 101 178 234 97 109 224 108 163 235 98 40 113 150 283 186 30 45 295 310 60 110 62 202 180 127
2826A27j22J06k7k0K4l2J02m3K36j69M1l0q2P1o2j01J58N8l5m1n4MR9K9M4j61l4j9M7J22J2
2462B48j21N9q6Rm0M5J11oM0K2j25Kq1J6k1N8J10n5n6j2J82k7p1o7J71J03l28J77n9j69J3
2099D2k0J5Pj4rL1M9M6j7pK8q8J68p1k5QP8j22n9K71j22q8J97j48l9QP2l9o2M9j1J47j06M7
1700B16l7j25O4Rp1K57k08N1R3o1j00P2n0R9k0J4O8k67J26K7n0M2Q5m3l6j2j17J1O1j0j6J20
1324A92J23q0j4j29p4K07j8r2J17k5M4k0j34o5M7m7O3%Q7j50J18r0J93k2j26j03J23p2J43
984A96l6Q2j0j39p5lK2L8J54r2r1K06M3o2j04k1k3pJ3K2Q7J48o4k26j4J4j3Q1NM8RO9j48Q7
584A96k6k7m6O1P0m0k8k0j32J39l9nJ2k6RL6N5j4p5n0M0K8l6On7M1J63no7n0l6m1K9K4M0J60
162B89r4J37j35o5j2P1m9l3P7pr7p9N7J16J51j31j12k5JJ01K8j10J42K7p4q0J0J0j5M8
$$ plain form
2826 127 5 111 84 64 88 56 158 115 351 182 223 193 111 182 120 19 177 235 200 159 105 109 208 237 281 120 86 67 114 236 248
2462 248 127 186 100 109 69 114 225 219 259 281 156 158 77 93 72 130 240 185 129 117 299 272 201 134 305 408 80 257 198 29 42
2099 42 22 37 44 30 21 52 101 147 130 123 151 63 231 160 135 143 221 99 40 311 189 101 298 150 111 119 191 152 90 139 128 275 169 216
1700 216 179 54 118 127 56 313 105 156 249 188 88 160 110 209 189 203 271 4 130 157 107 149 234 191 155 143 26 37 98 88 72 192
1324 192 315 235 221 92 18 225 207 115 232 207 251 231 97 32 79 32 95 95 182 32 150 60 253 231 105 2 125 53 196
984 196 160 242 232 93 18 15 37 75 229 137 46 252 295 233 129 108 85 78 91 113 200 348 284 58 44 58 45 126 131 179 188 257 109 196
584 196 170 143 97 158 228 188 160 140 8 147 108 103 115 89 98 134 189 175 100 50 90 118 82 88 31 72 235 230 163 113 77 36 65 89 129 289
162 289 195 332 197 132 120 191 142 109 186 179 82 3 60 176 327 196 84 59 60 161 189 79 221 248 174 94 104 114 99 147
-190A47
##PAGE=	F1=-11132.2
##FIRST=	25169.313707327481097,	5807.6787752999953227,	0
##DATA TABLE=	(F2++(Y..Y)), PROFILE
5808A40l0K2L0j16K21o1q3n1rM0j6R3n4N7J90o2k04o2P9j2M0o7OJ89j85J46j18J5m7n7nJ15
5432A44J9o1JL7m6J27j60Q8j9q1j6J11J38j08o7N2q3P8N6j36QR4j0o8L0qK5m4k2J20j10L5
5056A24L5j41RR5k8l5J3J2K0K2m1m0M3K6P5J06j16o8M1n9l0O9n6m0k1J75J3r6N4J26J8j63
4681A42q5L0M3n0qJ66k2j29j9nJ15P6j85j4K14jr1o3m6J08k9q4j8J49m6%Oj01oJ23r8P2p0
4294G4j4O7j08J28NOk8p2J0Q6K7j12J02j20j0M7J16J94j97L4j06J6l3o9R4J1l0Q3n6mO3j00
3918A04j4J1j5P7P7j2n2j16K13j26N4j57Pk8J11m9k2Q8K8o4k1L1r8J35N7M0r8j27K4M3J71
3554B72q9j04m4J64kr7R9l9q7m1Q4k0o1RJ18p8k6J19J16q4j56Q3J6r8O2jJ07nj61J00K2K0
3178A98om0O8o6p9j7K01jj55O5R9j75N8J22j31o6Q4p2J54l1j70QK54M5k65K0l6J45j4k3r4
$$ plain form
5808 140 110 132 162 46 267 206 123 72 63 103 87 180 126 183 373 311 107 45 124 112 152 85 91 280 95 241 123 138 91 34 29 144
5432 144 163 102 103 140 94 221 61 149 130 49 33 144 282 174 107 159 76 154 210 74 82 176 166 98 128 120 145 101 79 199 89 124
5056 124 159 18 27 122 94 59 72 84 104 126 85 45 88 114 189 295 179 111 152 93 63 132 76 36 15 190 203 107 161 287 305 142
4681 142 57 87 130 80 72 238 216 87 68 63 178 254 69 55 269 268 177 114 68 176 147 63 45 194 148 148 154 53 47 170 72 144 74
4294 74 60 127 19 147 152 158 130 58 68 154 181 69 171 51 41 88 204 398 201 235 129 145 112 43 137 148 118 201 145 141 204 104
3918 104 90 101 86 163 240 228 176 60 273 147 201 44 51 23 134 85 63 151 179 115 94 125 27 162 219 259 161 34 58 101 272
3554 272 183 79 35 199 197 100 199 160 73 32 116 96 35 44 162 84 58 177 293 209 53 136 152 54 116 115 222 217 56 156 178 198
3178 198 192 152 220 154 75 58 259 258 103 168 267 92 150 272 141 75 159 87 241 210 40 48 302 347 82 102 66 211 197 174 80
2815H0Q5j4r5j7L2Q1mK07j86Q4p0o6Q4j02p0K01lk5nj53L7Q7LO3j43L7k7j1Q1L7m6Qq2pj3
2404F8O0J17m3L7J6j00Ko7M1k4M4J43p1r0m0K64m0o8o3J41P8l01J27k9j67L2Om3pL2j8J3O5
2016A15Kj3jP5j7J5m4K1LR0j19p4K35o3j15J65j14k1K0jQq2P3K5J43j73J9L7j33P2k4p3K04
1629B55j51N6P2k1q6N3k5Q3m4L6O5k44P8M8j9m5J26K5r0K8r8p4P9J0m9J41R1j04k0r6n0J53
1254A83j5n8P9j1Q5m9j26k5M8n1J5J1P0j12J15j12K23k0j78j2J00m2J41n7O6K5k35l8J0QJ3
890E1J30q5lJ85L9j03o8k4ol2K7mJ19J55j22k12KJ1L7J08k4L4n8M1j16N7k8k5j2Q9N2l8n6
502A21k8k9O2L1J0k0l7l4Q8L0J1j06PK2k1n0M0p3L6J53k8k8r0M1o1K8kP3J17j23J75j51r5
115F9lO9JLM8Lo5q9LJ17J21j27m9n4j9J35Jp3J28Km5j02N5j6k2N0
$$ plain form
2815 80 165 151 56 39 71 152 148 355 169 253 183 117 201 99 29 230 227 202 197 44 81 168 171 234 91 128 101 90 171 208 162 170 88 81 68
2404 68 128 245 202 239 255 155 157 90 131 107 151 294 223 133 93 357 317 249 186 327 405 104 231 202 35 67 73 30 23 55 37 50 115
2016 115 117 104 103 178 161 176 132 153 156 246 127 53 288 225 110 275 161 140 160 159 167 85 158 183 326 153 172 209 76 148 124 51 255
1629 255 104 160 232 211 125 178 153 236 192 228 293 49 127 175 156 111 237 262 172 200 102 28 107 117 68 209 300 196 176 80 30 183
1254 183 168 110 189 178 263 214 88 63 111 60 75 86 156 44 159 47 270 250 72 60 160 118 259 202 268 293 58 20 30 38 51
890 51 181 96 93 278 317 214 146 122 116 84 111 107 226 381 259 47 49 60 97 205 181 215 157 198 82 139 111 86 74 163 215 177 121
502 121 93 64 126 157 167 147 110 76 164 194 205 99 106 128 107 57 97 24 60 213 185 157 67 108 47 75 73 146 263 140 315 164 69
115 69 66 135 136 139 187 190 125 36 39 156 277 150 101 47 28 163 164 91 219 221 176 74 129 113 91 141
-190A41
##PAGE=	F1=-11234.5
##FIRST=	25169.313707327481097,	5807.6787752999953227,	0
##DATA TABLE=	(F2++(Y..Y)), PROFILE
5808A38l1K3mk8J88p6j31K2k3P7l2L1o3Q8J26pj51p3J8PN0o8K6K16k12J56j48L5r8L7m9J20
5432A64qk6J3Pp8N1o2O5j4p4%J32J83j30j07N9m3J1J4o7K5K9j2l0l2lJ03j29M6J07j32J15
5056A77o5p7K1M7j5O0k3m5Rql6J5mL2J04J17j28j06M6Rp9J11p9m8jJ44J5j47J20R9L0j36o0
4669I9j8N9K4k0R4m1j03l6J1P7N8j13J6J81r1l3l8n7J22m7o4OQ9j8r9P7o1l7J26o7M4n5pJ4
4270I2o2J43l7M1k4j11N2O1N5j54Q3o2k6J1J51J93j87J5j08L6m1n5J51l2r2J56m9r1J14p6
3918A47n3j0j2P0R8j3o3j44K06j26J06j53k3M6M1k0RJ4O7m8j3Mr9R0J16K8j18j02J4Q0J89
3554C28j47p1mP3N3j13P4k9j32K2K8O7m4r2J59n5qP3Q1o0j43P6L8j16M9jJ40m5j02P5j4LN
3167A68j4J04o2j68J00K07o6j73Q7P6j93O1J71j27o5J03j31J26K1j25l2K20N2k30Ll3J32m
$$ plain form
5808 138 107 130 126 98 286 210 79 101 78 155 123 154 91 179 305 298 147 74 92 99 149 81 107 323 111 267 119 154 56 93 44 164
5432 164 156 130 143 150 72 123 61 126 112 38 38 170 353 223 116 175 132 143 157 90 115 144 132 102 70 67 170 41 87 194 62 177
5056 177 112 35 56 103 88 148 125 80 89 81 45 60 56 88 192 309 181 75 121 130 51 162 83 35 34 178 193 46 166 265 295 159 99
4669 99 81 140 164 144 238 197 94 58 69 146 204 91 107 288 197 164 126 69 191 144 80 86 175 157 58 135 74 37 163 96 140 85 78 92
4270 92 30 173 136 177 153 42 94 155 210 56 139 77 51 62 213 406 219 234 126 162 121 66 217 185 93 249 200 109 223 147
3918 147 94 84 72 142 240 227 164 20 226 100 206 53 30 76 117 97 106 120 187 139 126 130 31 121 237 265 147 45 59 139 328
3554 328 181 110 106 179 232 119 193 164 32 54 82 149 105 13 172 117 109 182 263 203 60 136 174 58 107 106 246 201 99 174 160 163 168
3167 168 154 258 196 28 128 335 269 96 183 259 66 127 298 171 106 209 78 204 225 100 68 288 340 110 113 80 212 208
2838B08J0o7P1k0j18K7%M0M9J41j72R0q6k0P3j21m2K05o9j7K8j67K7P9o4Q4r4J04l9o4J8Q3
2462A77J4n1o3J5j2Q5Q3q9N9Lp8Jl4N7k5M0J39q2q8m2K93l6o4q2R9L6k45R3Kj61L9M0l5n4
2063C4K2j2J4O4k8j3LJ16L8j04m2R2pR6j19q7J73jp9Q4n8j2M5q9N0j12J18N5J16k30k7J21
1688B21j31R9n0k9O8q9O9M1K8q3N2pN7m3L5N3k11M3O1Oq5J30Q2j26M4o6j32P1K7o1J24N8j30
1300A26k0m3j5P8LrK4QJ26o1j45J3P3o2k9K7L0m3Q0n6J38j2j51L2O6kJ21o0M2N9l19J5OoO
890D0P2k7L4J57K9j25k2j8lk7M4n7J47J42j66j76L1j3Q1J22l0K4r3l2o9K6rLk2J03J8k6p3
502H5l8O0L2N2L9l1q3l9J06j4N4j33N5j1n8m5P3k7j5J08m4Mr9J09m6j5j8Q6O6j15J82j57q4
115C9N0kL2L2L6J7m0r3n3J15P3r2ll6m8J31k4m7J17k3Mj30J04m8j5K8
$$ plain form
2838 208 218 151 222 202 84 111 111 151 200 341 169 259 173 153 226 105 63 268 199 182 210 43 70 149 85 169 75 179 140 76 94 177
2462 177 191 140 77 92 80 165 248 159 218 221 143 144 110 167 142 182 321 239 151 109 402 366 302 220 319 355 110 203 205 44 83 123 88 34
2063 34 56 44 58 122 94 81 84 200 238 134 92 184 177 273 154 67 240 239 160 244 186 174 219 130 180 68 186 241 357 127 100 221
1688 221 90 189 139 110 178 89 158 199 227 144 196 189 246 203 238 291 80 123 184 190 105 235 317 191 235 169 37 108 135 74 198 256 126
1300 126 106 63 48 126 129 120 144 152 278 217 72 85 158 96 67 94 124 81 161 105 243 231 80 112 178 176 297 237 279 338 19 34 40 34 40
890 40 112 85 119 276 305 180 158 140 137 110 154 97 244 386 220 44 75 62 143 265 235 259 166 134 65 91 82 85 63 166 184 158 85
502 85 47 107 139 191 230 199 116 77 183 169 223 90 145 134 76 31 104 77 62 170 126 130 31 140 94 79 61 147 213 98 280 123 39
115 39 89 87 119 151 187 204 164 71 18 133 206 114 111 75 27 158 134 87 204 181 185 55 159 111 96 124
-190A24
##PAGE=	F1=-11336.7
##FIRST=	25169.313707327481097,	5807.6787752999953227,	0
##DATA TABLE=	(F2++(Y..Y)), PROFILE
5808A19oJ3n7P0J36q7j59J08n9J15m8l4j0N6P4N1q7q9n3M8M2q1N0K25k26J66j82P3r4P9r2
5444F1J25m6K4K1k6o4n7J7O3k5l9j6J40K11j37r6L8j8o3j5QL9l9K8j9p1LJ45j01j1J08j24
5068F4J43j49qK4%M0J17p4r3Ok3KL9m6K2J05J46j22j50O8L8r3J42j18j0rQ9K4j00J12M9K3
4693B58q5j6j00R1P6k2L6o4p7l2JN6L8n8N0J27j77O2kq5J19n0l7K2N9k9j43J26Lp3O7k5J3
4305A29l5Jl4mJ28q6P1qj48R4N3N3j88P6Nn5j9J74J69j59Pr3K9k3n3J90k8j80K00k4j54J47
3930B35n8p6k7l7P9J12j9o9j00J01o3J18j17NN7o6K7Q0m6N2k4lJ1r2QJ51j0j04p1L3P4J86
3554C47j58m5L5k9R4r8K7j7j31N4m1J62k3j24J23k0lL0L9l9j20O2P1j15J7JJ38p0l7M4l3k2
3178A19QJ9J33l3j58J19J83j17j94O4N6j58N6K10j26n2J13j50P8N9p7o6J83J7j72K3l0R8R
$$ plain form
5808 119 113 126 69 139 275 188 29 137 78 193 145 111 101 157 231 282 195 106 53 101 143 62 112 337 111 277 95 168 74 153 61
5444 61 186 140 164 185 159 95 38 55 118 93 54 38 178 389 252 156 194 176 113 98 106 145 106 134 115 44 47 192 91 80 188 64
5068 64 207 58 50 74 74 114 231 157 64 70 47 49 88 42 64 169 315 193 43 111 149 56 198 80 70 61 150 174 74 186 235 258
4693 258 173 157 57 148 224 202 238 174 97 65 66 122 160 102 152 279 102 164 162 77 196 146 109 131 190 161 18 144 147 74 141 116 129
4305 129 94 95 61 57 185 99 170 162 14 108 161 214 26 102 107 52 33 207 376 217 224 131 160 137 84 274 246 66 266 242 88 235
3930 235 177 101 74 37 116 228 209 140 40 141 78 196 79 84 141 75 102 182 136 188 164 161 172 80 88 239 229 125 54 87 161 347
3554 347 189 144 179 150 244 146 173 156 25 79 38 200 177 53 176 156 153 183 222 183 63 125 196 81 98 99 237 167 130 174 141 119
3178 119 127 146 279 246 88 207 390 273 79 143 199 41 97 307 181 129 242 92 170 229 152 86 269 286 114 137 107 205 214
2838B14L0m5O0l6j20Q7l6kJ08N4j32N7o2K8M2j30l7K06j33JL8o8m1O6r4M2qJ38o6p1m8J09
2462A51M1q8l2M4k4J14K6j29J09j0p4qJ6N6k8M3J08r0n7j0K73k6o7j10N2rj58O5L3j52K8O2
2087A49kp4l5NK9N0l7j9KJ48N7j56n8J61pQ0j24q5J01M7k9Qj4LO1j56P9j40J80P7O7k44r3
1700C1J85j28J41p4J6n2n6Q1RP3p7O5jL5k9J8L0j76K7O1K9q1R6J24j32K8l0j45M2K9n8Q7K9
1312A97j39j3nJ8ML5M3l5K5J49o5j66N4J03q0n1L5j6J0N7J6Pop0L7L2M1Q8n3J7Q6l20J4rj4
901B6M5k4N6K2J26Mj17J7j2%rN3j06J69J11j89j07M4m5J04J17j2L9r7j26k7mJ5M9n4R9l0L
514A40q2j2Q9L1L7N9lj59pR9p0R7j44Q2n1o4J2O1J2n9M8l6J9j6P3k9n0k5Q0J3k9J29j54j3
115G8N6p4L8L9L5M4j5r2p5Q4K3j1j1j9o8J21k5n8J08m4O5j26J08p2Mj6
$$ plain form
2838 214 244 199 259 223 103 190 154 152 260 314 182 239 177 205 247 117 80 286 153 154 192 124 83 149 55 97 89 227 161 90 42 151
2462 151 192 104 72 116 92 206 232 103 212 202 128 120 136 192 164 207 315 225 168 158 431 405 338 228 280 271 113 178 211 59 87 149
2087 149 147 73 38 43 72 122 85 66 68 216 273 117 59 220 213 293 169 84 185 232 203 211 197 200 261 105 184 44 224 301 368 124 31
1700 31 216 88 229 155 171 119 63 144 153 226 149 214 213 248 219 237 267 91 118 179 208 127 223 347 215 243 213 68 110 139 81 168 197
1312 197 58 45 40 58 62 97 140 105 130 279 214 48 102 205 125 74 109 93 103 160 176 183 177 107 144 176 217 305 252 269 355 35 49 40 26
901 26 71 47 103 125 251 255 138 155 143 143 134 187 81 250 361 172 65 109 64 168 285 273 312 215 89 62 58 73 122 68 167 137 140
514 140 58 46 135 166 203 262 259 100 93 192 122 219 75 157 106 42 54 115 127 68 116 80 99 83 156 127 77 52 132 145 116 245 91 78
115 78 134 60 98 137 172 216 201 109 34 118 141 130 119 100 32 153 128 70 178 134 199 73 181 109 113 97
-190I7
##PAGE=	F1=-11439
##FIRST=	25169.313707327481097,	5807.6787752999953227,	0
##DATA TABLE=	(F2++(Y..Y)), PROFILE
5808H4M3lq8J23P3q6j18J38j01J41n4r0Q4lL0R3l0r6j23R6J5r8Q2K08k26J78k10J07o6J00
5456B03j29J26r0O8K3l6l7n1k4O0k7j3k8J33K06j26n2Ljj36k5P1M5r1J05l8m0j2J15o0p7J23
5080A88j25J43j82L4J7m3J20J33j18j25J6k7P4Pk8J5K3J88j01j64P5L2q0J49j50L4j2J8M4
4740A55j7P3npk1M0j66J04R8j3Oq9o4j3k8N9K1m2R4O4k34J45M9j13R2m7rK0N1m6j08R9M9r3
4340A04NK0j4j6Ko8M3J02j21Q0J7j27P3O8K3j61K8P0p9j6J53J26j18J0o3kJ6o5K08lk50K13
3965B58Oj78J54n5p5l9m2O0J27k3q9Lo5N8P3p1K4O5j79P1J54l2j6kpL1p5n7J51p1n7m1N0N1
3566A62J67j47rP1j19J04n8k5mo2K5q7K19pj37P9RKrJk2q7L6J01j09KnJ12p4J1J8k7m7MM7
3155A35J42Pj29J08J53j32k22j1N6k7JK17j25l3J12j68N1Q7l9r7J85o0j14P0k8N6K5K7k9N3
$$ plain form
5808 84 127 124 36 159 232 146 28 166 65 206 152 62 146 143 173 266 236 140 17 113 128 30 112 320 94 272 62 169 103 203
5456 203 74 200 110 178 201 165 128 77 53 113 86 73 45 178 384 258 206 209 208 72 47 118 163 72 177 139 99 87 202 142 65 188
5080 188 63 206 24 58 75 32 152 285 167 42 58 31 105 112 84 99 122 310 209 45 120 152 72 221 71 105 93 111 155
4740 155 138 211 206 199 178 218 52 156 254 241 247 158 94 81 53 112 133 91 185 249 15 160 209 96 188 141 132 152 203 157 49 148 197 104
4340 104 109 129 115 99 101 33 76 178 57 137 154 27 100 168 191 30 58 128 49 33 186 312 194 204 141 139 155 90 298 295 45 258
3965 258 264 86 240 185 110 71 29 89 216 193 104 107 42 100 173 102 126 191 12 83 237 205 189 187 180 211 136 79 230 159 102 61 111 162
3566 162 329 182 173 244 125 229 171 146 142 80 105 18 237 230 93 172 181 183 174 175 153 66 102 203 94 96 91 203 129 140 158 131 84 88 135
3155 135 277 284 155 263 416 284 62 51 107 80 81 298 173 140 252 84 135 222 183 86 271 211 97 167 139 195 220 247 218 271
2803B71o1j17J48n3l8J66l6p7rJN9Lj36m6K07j85N1KL2p4M2k5p1O5J42j02l8l9L0M3o4oN0
2416A35l4J28l4j24J59k0q9k7O9L8l7N1O1r6j1L1K38j4q3j32J0m6n1L0O6j40oO4N1p4r8K6
2040D1M8K2k1l4NJ62L7j51l6J74JM6j28p0M5P3Kl8jL9N6j92R2j42K42Q5Ok08q6J29j24J85
1664B59r6M3q9o3O0j7J07n3P8lK3j2mmj44L2M3M8n2M4J46j09j3jj16QJ3m2O6%o5J5p5L1m6
1254A2O6P9p9L2J46o8j60R2J16r8m6K7n1L7N6P6j10j9L3J4LQ0N1m8JR6k76kl2PP5l8M9kR6
843B15l2p7K9oLQN1j19J74O6j81k9L6p7J01R2K9Q6j09j83Nm4K3R8p6Q9r2N0r3N2Q7OQO8N5
432C13k44M3Q2j14J06j26Q2q1l9O9L9L0q3JKJ4M5Rj0p2k3O3l7R6N7j34K4M7j04K9K3L4P6J5
33B32p8o5L0LO0n1k4q1J22Qj11J00n8J25q7O4p9J8o4
$$ plain form
2803 271 210 93 241 188 150 316 280 203 194 195 254 257 121 75 282 97 148 150 182 108 150 125 54 119 261 159 121 82 112 155 91 85 135
2416 135 101 229 195 71 230 210 121 94 163 201 164 215 276 180 169 200 438 424 341 209 219 173 122 152 218 78 72 136 187 113 15 41
2040 41 89 111 90 56 61 223 260 109 73 247 248 294 166 96 141 214 216 178 177 216 272 80 172 30 272 357 363 155 69 198 74 259
1664 259 163 206 117 54 114 97 204 151 229 226 249 237 233 229 85 117 160 208 156 200 346 237 224 223 107 115 128 86 152 152 87 102 27 58 12
1254 12 78 157 78 110 256 188 28 120 236 138 92 119 68 105 161 237 127 108 141 155 158 238 289 241 242 338 62 60 28 35 110 72 121 119 215
843 215 183 106 135 129 132 140 191 72 246 312 131 102 138 61 162 254 283 369 260 77 82 38 61 159 83 172 80 130 37 89 176 182 190 258 313
432 313 69 112 194 80 186 60 142 61 22 91 130 160 77 78 80 94 139 148 138 66 43 106 69 165 222 88 112 159 55 84 107 141 217 232
33 232 154 89 119 122 182 131 107 26 148 156 45 145 87 212 125 189 110 128 64
-190F4
##PAGE=	F1=-11541.3
##FIRST=	25169.313707327481097,	5807.6787752999953227,	0
##DATA TABLE=	(F2++(Y..Y)), PROFILE
5808C7J05j5m9P8J2p0j5J03j39J42n1j15J69m2pJ08K1r8j17Q3l3q5R9J57k12J87k03J04l5
5467A19J16j55J22j37Q9K1rpl0n7L3Nl1j8J21J57r5Kl4J6k04J5Q3M3r0J58o7j9k1O6l6r7J26
5080A85j26J17j28J3jpJ38J09j40j27K5l4J41l6JL0r6K24p0j44N4J9o1J39j68P2mn7Q1L2M1
4716B22l8n6M4R7j56N5Q8OPj11p3Pn4Q1Lo3J45Nj25P4R8j30M0n0K5QM2m9q3P5P9r4m7O2l0
4305A04opp0N4Q1j14M4L6n4JJ05k6o5n6R9p8QJ02O9o5J3k1m7O1q2J96L3k88K08K7j70J41o4
3918A69m8m7Rk1J57j6j43J03j17Q0J8k8K1Q1j51j3J98J9p8J0k4M4m6q6J23j42J4kL5K0J41
3554B80j28M2R7j71P2qo1LJ0qn7J87jj42M4K9Rl9k5j5l7j2J17j00J3j8P8n8L0JRo6NM6J26
3143B52M5r1Q0J24j05k53K0K3M9n1J78j21j1J01j81M5R8j4j23K42j25j10J20k4J8M0jj7M8
$$ plain form
5808 37 142 127 78 156 168 98 83 186 47 189 138 23 192 150 143 251 272 174 57 140 107 22 121 278 66 253 50 154 119
5467 119 235 80 202 65 154 175 166 159 129 72 105 110 79 61 182 339 244 246 212 228 24 39 122 165 75 233 166 147 126 192 156 59 185
5080 185 59 176 48 61 60 53 191 300 160 33 58 24 165 129 130 160 64 288 218 74 128 147 86 225 57 129 125 68 149 181 222
4716 222 184 128 172 269 113 168 256 262 269 158 85 92 38 119 122 59 204 209 84 158 256 126 166 116 141 149 191 142 59 134 213 119 72 134 104
4305 104 98 91 21 75 156 42 86 122 68 69 174 148 83 27 126 48 56 158 227 162 175 154 107 168 86 282 315 27 235 262 92 233 169
3918 169 121 74 83 62 219 203 60 163 46 126 144 116 137 218 67 54 252 271 193 203 179 223 177 91 214 72 86 84 119 139 280
3554 280 152 194 291 120 192 184 123 126 136 128 71 258 257 115 159 188 197 158 133 118 81 69 186 86 99 81 159 101 131 132 141 75 80 126 252
3143 252 297 206 286 410 305 52 72 95 144 93 271 150 139 240 59 104 202 188 65 307 182 72 192 168 186 226 225 208 256
2803B56q4j20J97m4o7K17j10k1r6Q9O9l6j25p4K12k01J21n8P9o8JM4q9O4J23j39J2k5p3L1
2451H5L7j4L7m0J18q3l6J55k7j13l6J03Pm9N7J2j03L7P0K07j1j07j39j6o0M3j3R7j23n1L8
2087H2J16n3j28L2N5j7J1n5L1J45rj18K3J37OJ1j29m3J6Q1Jn1j6J00J8j84Q1r0K76P5o5j49
1711A90o9N0j08K06j06M3o1n2k2l2J21%Q2j4J7Oj9m2j18N4J1M8okJ39o4o9J5n3k6j6j0Q9k8
1312A54jK8j37NJ2J0R2j02K9J20o7j08J04J04j09k6Qo1L1P8J13j45n1J03l3j7J05L0o0rR5
948B95k25lo0M6Q2o%j0O0n4k8KJ5nJ5L7o1J39J0j40K7J9j05P4M9R7J49j42j76J9r3J9J41r0
549I7Q9j62J04j06J02J04n7j7Q0J21l14Q8N8r9M2p2N3l8m0Q2K6K9o8mjK1N3n7J7q6j0M3n6
162B2J82Rj02J8K9r8L0QMJ00N3n2m6k2J2Q6q4n2q6J30M7j65Q7n7J67m1Mp2K4j05
$$ plain form
2803 256 172 52 249 205 138 355 245 224 128 217 286 250 125 51 263 62 183 125 204 136 137 181 92 156 279 140 152 127 54 85
2451 85 122 108 145 105 223 140 104 259 232 119 83 186 193 144 201 213 110 147 217 424 413 306 167 151 91 134 121 218 95 44 82
2087 82 198 145 17 49 104 87 98 43 74 219 210 92 115 252 258 269 140 97 113 194 195 144 128 228 246 62 143 53 329 404 339 190
1711 190 121 171 63 269 163 206 145 93 71 39 160 160 242 228 245 251 232 190 72 126 137 185 179 177 316 252 183 198 145 119 103 93 182 154
1312 154 153 181 44 49 61 71 163 61 90 210 143 35 139 243 134 108 116 55 86 164 277 132 81 184 151 134 239 269 209 200 295
948 295 70 67 7 53 135 129 129 119 179 125 97 99 114 109 124 161 100 239 249 109 136 155 50 124 173 270 419 277 101 120 27 46 187 97
549 97 186 24 128 22 124 228 171 154 234 355 41 129 187 88 130 58 111 73 33 115 141 170 102 98 97 118 171 114 131 45 35 78 22
162 22 204 213 111 129 158 60 90 98 102 202 255 203 157 135 147 233 149 97 11 141 188 23 110 53 220 179 183 111 135 30
-190C0
##PAGE=	F1=-11643.5
##FIRST=	25169.313707327481097,	5807.6787752999953227,	0
##DATA TABLE=	(F2++(Y..Y)), PROFILE
5808B9J23k7j2K4l3l1O2O4j71J17m4q4K05n8k7J00O6r8q8O7j00j0O6Q1j76J79j57O3j2J27
5456B45j60J11j77P4J4N2L1l7m7pN6q7J2J15P0n0N1o8M1k11L0O6K5k9J60r7k0k1J4k5o3R9
5080A67q6N7o9mk2Q7R4N4j30r7J4m8J96o4J5M7j85K19l4j01QK0m2J17j72R7J3j20J24L7J5
4716B07m0q5O9J50j09lN0K6L3j25r8J7m6R5k4j05J95l5m0M3J21j42j3o9P1j4K3l4o1N4Q4p8
4340A17p4R0l6pk4l7K9O4p0k0L8M2r4J55q4M1o5L5m8J8O7%JJ0J6p5Q2q0J42O9k85J90L2j50
3941H9J24p2j1m8N5j03J99Ok16J72r3L4j8NqJ05p0n6J26Q2j05J5m7L6j0r3R5j80O3M3rj2J18
3554B16j06R4J09j84J3M4p4MO7l8k7J46nj43K3L7J7n2l7j8K0p4J12q6M0k9N1l1K0pO2p8J0
3167I6K0R8O9m9M0J03m5k88J57mKr6J23j02JR2j59L2Q1kj41L31j21j68J32j4nM8m9j2M9r4
$$ plain form
5808 29 152 125 113 137 104 73 135 199 28 145 101 17 222 164 137 237 303 205 117 184 84 74 140 221 45 224 67 130 118 245
5456 245 85 196 19 93 107 159 190 153 106 99 155 68 80 195 265 215 266 198 239 28 58 124 149 120 280 183 163 142 156 131 68 167
5080 167 81 138 69 65 43 130 224 278 148 51 65 17 213 149 164 211 26 245 211 110 118 138 96 213 41 138 151 31 155 192 207
4716 207 167 82 151 301 192 189 239 265 298 173 75 92 46 141 117 12 207 172 132 175 296 154 141 72 143 129 152 118 57 111 195 117
4340 117 43 133 97 90 66 29 58 122 52 32 70 112 18 173 89 130 65 100 52 70 137 137 138 148 164 89 171 91 233 302 17 207 239 89
3941 89 213 141 130 82 137 34 233 239 23 195 102 136 118 123 115 220 150 94 220 302 197 212 165 201 191 98 193 13 76 119 110 98 216
3554 216 110 204 313 129 142 186 112 116 183 145 118 264 259 116 139 176 193 141 104 86 106 32 144 58 98 69 120 89 109 102 164 86 96
3167 96 116 214 283 234 274 377 332 44 201 197 199 103 226 124 125 217 58 90 171 169 28 359 238 70 202 188 183 231 182 170 219 125
2791A25p2J61j2q8K50j47J9j85J81O0o1r3r8J97j58J61p1K8l5n0R1n8O1P9j70N9k9j14K3J15
2439A69m8K4m1J00j01M5J36l6j35pR7l3o1N7k5j05O8J04J81j4j37j31j1l0P7n8J18j02o7k3
2087A1J70j3j40L3N4o3N2q1Q2J03m8p5O3Q6kj6j17j8J0R2l3m1m1J66m7j03J8j2L04L8j39q9
1711B04n0j5p0J86r8J5j4j3j04j2P3P7P3l1OK6k0o6r8P7j6J1M2j9R9rj17J1K7n7l9K7J34m8
1312A92OM4j79k5O2k6Q2j03J8P7n3m5R9P4j09nj2l7j2J13J25j14m7J04q7k6J08M3j03rQ3j83
937E5J3m3L8P2K9k8LJ0k4k9l0O3m1OJ1N4Q0n5q8O1kj24K9kJ93J97j89j11J7j33K3J54j09J05
538B05j61Q1j10J22J20j34MR4J59l32R5K6m8o1J9RN1p0M7K3J6j1kn1N0K9j14O0r6K7RL3J31
150B20j8o8nJ0p2M4K2n8R6R2j3k7n9J3R0j01q7n8J01P9j78N6l6J77mm6o2K6j24
$$ plain form
2791 125 53 214 202 114 364 217 236 51 232 292 231 138 40 237 79 240 169 197 162 112 203 145 206 285 115 174 145 31 54 169
2439 169 121 145 104 204 103 148 284 248 113 106 203 170 109 166 141 36 104 208 389 375 238 107 96 66 143 85 203 101 34 11
2087 11 181 168 28 61 115 52 104 23 105 208 160 85 148 234 232 216 99 81 91 183 150 109 68 234 187 84 102 90 394 432 293 204
1711 204 154 139 69 255 157 172 158 145 41 29 102 179 252 221 227 253 233 167 69 146 130 141 183 164 263 254 137 148 175 118 79 106 240 192
1312 192 198 242 63 38 100 74 156 53 71 148 95 50 149 223 114 109 97 60 48 161 286 172 125 229 142 116 224 267 164 155 238 55
937 55 68 25 63 135 164 136 139 149 125 96 66 129 88 94 105 159 239 184 96 157 155 31 60 58 251 448 259 148 165 32 55 209 100 205
538 205 44 125 15 137 257 123 127 221 380 48 143 169 121 60 79 88 139 69 116 139 155 144 142 91 141 170 56 116 20 47 56 89 220
150 220 202 134 129 139 67 111 133 75 171 263 250 223 164 177 267 166 79 21 122 201 23 79 43 220 216 170 108 134 10
-190A0
##PAGE=	F1=-11745.8
##FIRST=	25169.313707327481097,	5807.6787752999953227,	0
##DATA TABLE=	(F2++(Y..Y)), PROFILE
5808H1P8m6J0j1m3J4R7K6j90O7m3k3K04n6k1P7J10r8n7O0j68O2L3jj05J25j11M0oJ30j37R1
5432A89j33k4j8J28P7o3j2m2R6j53N7J11l3%Q2r5P7j59j3N2kM9J31j21m0j0l2j0oM9j6Qm9
5045G5mk6J61L9j8r0o4Jn7K20n7JN6j73J18Nl6o3L6k1R1j71J08L5j51J42J4mj9l0OJ85m8m3
4646B18oM0O9j27j23J5oQ9n8o4J49n0j0P8J08j51m3r9J26m5j1ol9M5N6n4m8Q5m3k1m0kJ9L7
4247H8m3j9L0J02j11J15j39J34m5n0nJ4N8o6P7pL7n9M7m0M3R9k09J26K1j26J05n6Pk9Q1j74
3871FK33L7k17J43q6J4k3K7o5J35K2m7l0J37q9J5o1NJ4q7Q5r4qQ5n9m4J17r1J26J06j72m3
3495I1Q9o2oJ01o2lJ06j3j40J6L5K2l9l9j9N2j28Q3m2M8k9M1j0orJ09q8RoP9O4qoR9K7l17
3073C9K66k3n7j37Q1o3j1R4j01QL5Oj04L62q4k12R2LmM3j07j3N2o3L8J1L3j05K61j47M0j92
$$ plain form
5808 81 159 113 123 112 69 83 180 206 16 83 40 17 221 165 144 221 331 233 176 236 68 130 163 162 57 182 71 111 105 235 98 189
5432 189 56 32 14 142 219 156 144 102 198 45 102 213 180 180 262 167 244 85 72 124 122 171 302 181 141 131 99 89 83 132 116 124 75
5045 75 71 45 206 245 227 137 73 74 17 237 180 181 237 64 182 187 151 88 124 103 194 23 131 166 15 157 171 167 148 118 124 309 261 218
4646 218 212 252 321 194 71 86 80 169 111 47 196 146 136 214 322 171 128 29 155 110 99 93 54 99 155 101 53 138 95 74 34 32 51 88
4247 88 45 26 56 158 47 162 23 157 112 62 57 71 129 63 140 133 170 111 158 118 161 260 51 177 198 72 177 121 128 99 180 6
3871 6 239 276 59 202 116 130 107 134 69 204 226 179 149 286 197 212 151 156 170 83 168 74 66 151 92 48 165 74 200 306 134 91
3495 91 180 118 112 213 151 148 254 241 101 117 152 174 135 96 77 129 1 84 42 90 61 102 92 86 77 186 98 107 101 180 244 236 230 329 356 39
3073 39 305 282 225 88 169 106 95 189 88 96 131 137 33 395 311 99 191 194 190 233 126 113 165 102 140 151 184 79 340 193 233 41
2697D1J93L7o7n0p6J35j07J87m7o4%q7J00j3Q7J9j90Q2m6l3M0O4q8K0m2J21p5L3J20m5j54
2333I5N4O2p2o0L8k7ol2J34J52k0j61j12K2K4N4j01J24p2k2L2L9L3j52M2N5j01R1p9J11N0
1970A95k7m5L8L9k8l0n7k2PJ07p9k0j2J60j21L0p3O9L30k4k16l1j7o3k8J37p2l3L0M0j21J5
1594G8l0J51N4m3k2N1op4q2Q8j1o9Q2pL8M2j18j6R1p8k9L0J73n5k2O3k02m5Q5l6N6r1OM0q
1183H4k8Q7M0r8Jk0J4o5J31J15p6j8R1j23k4Q6Q6j69NO1j60M1nPM3O2j9K2n6L1o8J1Q0q6J
772H4l6J78K0j20n0Q0j6j25J8L7J78K01k32j9Lj56L9J43j38J29j19K0j06J22J08j81J04O5
444B31J59l18Q3j6Mr9P4j9R9p5k9L5oO6j9j18R4nj20Q4n9K8l2J11O0l9k8k7km0N2M5r7N1J25
33B53L0j0o7KP7j09j06j9L7R8j51K2j1J64J5o6o0L3j00
$$ plain form
2697 41 234 271 204 154 78 213 106 293 246 182 182 95 195 182 269 288 98 180 134 101 141 205 117 137 95 216 141 174 294 249 95
2333 95 149 211 139 79 117 90 84 52 186 338 318 157 45 67 91 145 44 168 96 74 106 145 178 26 68 123 22 113 34 145 195
1970 195 168 123 161 200 172 142 85 63 70 177 98 78 66 226 105 135 62 131 461 437 221 190 173 110 82 219 147 114 144 184 63 78
1594 78 48 199 253 210 188 239 233 159 77 165 154 85 167 160 198 240 122 106 197 119 90 120 293 238 216 279 77 32 117 81 137 46 52 92 84
1183 84 56 143 183 85 86 66 80 15 146 261 185 167 258 135 111 197 283 114 119 180 20 61 56 63 106 168 149 171 115 146 78 89 169 83 84
772 84 48 226 246 126 76 156 140 15 33 70 248 449 217 198 201 45 84 227 89 218 99 119 13 135 243 62 166 231
444 231 390 72 155 139 143 44 118 99 198 123 94 129 123 189 170 52 146 141 21 105 46 74 42 153 213 174 146 119 117 77 129 174 77 128 253
33 253 283 273 206 208 285 176 70 51 88 186 35 57 46 210 225 159 99 132 32
-190C2
##PAGE=	F1=-11848
##FIRST=	25169.313707327481097,	5807.6787752999953227,	0
##DATA TABLE=	(F2++(Y..Y)), PROFILE
5808A30L5p3J6j7j5J8J19pj88J5Oj5J59l7RM8J49r5l4O3k20J18Jp3l0M5p9O2k4J27r2O9r4
5420I6Mj7L6J18q6K9p4J19j97R7J00j19M1R2j13J19j00n8L3k2J15P9j32p2Qn6N3kmN1Qp8O
5033G4j6K03j4q4l7m2Kn7K04j9k6M6j27nM8M1j47O0OP4j56Q3N5j41J21k1j4J2N4p8J97Pn8
4646B45o7M8J00j12j39OM2P3r9J1P1l6l9J49P5j60l2p9J26p5n7L2l8O1Nl6J6P1o5m6j3j8O2
4258H2j5l8K8Q4O9r2K0j00J17j4p6q%P0j05J36k4M0k1k2K8p7J20j06M7Mq8O8Nj6OQ3j83K00
3859B22O8j87Q9r9K8kL7j18J45J00k2k04J68l4J3n9m0J5p6R2k6n8J19p9q2J49q9J10R3j48
3507A25p2J18l2k7J08p6J0P7j6j29J1K6J9kl2nL7j18MN8pk0N1Pm0j3J33q8nj3P5K4K7n0J07
3096B72R7l14L06m6r7j71N7Qm2R5n5kj8J8l5L23m7k08J5K9J9K2j45l3N4J5J15j31N4j22K60
$$ plain form
5808 130 165 92 108 91 76 94 213 206 18 33 39 24 183 146 155 203 352 257 223 286 66 184 185 112 82 127 48 110 86 213 121 190 96
5420 96 100 83 119 237 151 180 106 225 28 125 225 106 147 239 126 245 145 87 120 98 213 292 160 88 96 40 93 91 87 138 146 68 74
5033 74 58 261 247 163 126 84 86 29 233 214 188 234 107 102 150 191 44 104 110 184 28 111 166 25 146 125 111 123 177 99 296 303 245
4646 245 178 226 326 214 75 81 123 196 97 108 179 143 104 253 328 168 136 57 183 108 51 83 45 106 111 75 91 162 97 51 38 20 82
4258 82 67 29 57 141 210 118 138 38 155 141 65 57 57 127 22 158 134 174 153 131 159 82 202 96 143 147 59 127 132 116 122 205 22 222
3859 222 290 103 192 93 121 119 156 38 183 283 261 57 225 191 204 145 105 120 44 136 110 52 171 92 10 159 70 180 273 125
3507 125 53 171 139 112 220 144 154 231 215 86 97 123 142 140 108 103 140 22 26 84 77 57 108 115 75 62 195 107 102 89 164 188 215 165 272
3096 272 369 55 361 315 218 47 104 112 70 165 110 108 90 108 73 396 349 141 156 185 204 226 81 48 102 117 232 101 155 33 293
2732B93j23M6j01J08Nn1j6l6P1q6K18k0j32J3p9O0K8J33l4k08Q1p2O3O2lj27K9l9J95o9l5
2369A74J07m1j67J21J6j06k4j8M2O6j24J28J04k4j65l9PO4K3j19R1l7L7P7q3O8j65M7P3q7
2016D6Q1m8J08KL5m2k9Qo8k8P1n5j8J08j14J9L8Q3j79J67j45J33L49j07k85L1K3r5lQ2l5q6
1641D7O4Q8j02K1o2J51L7m8o2P5K1p4p5R4J7j40Q1K3k1P9o4l1Q8p8OpJ95m8o2Q2j92o8P7k0
1242I2K3p6pM1M1o4P1K0q3j3J5M3l0M7R0o0L0P4j25j0M0J35k27L5L1r1OL4j0j8R1K3L1j30
843F9P3q8R7N2j16K8n3K18k4j74l8R5k6q1P3P7Q3J54k44N8j7j61N5J32j78J56p0l3j04J36
491A49Q0j26J46JJ38l04Q0o5M6m2O1l8J10n6j16O2m0J40n6j48J09k9kNj4Pn9J64j2o4J6l7
115A06mj5N0N4j10jJ47O7Km4%L9j16j01J0m3J05j07NjJ50J5n1o9M5q5
$$ plain form
2732 293 170 216 115 223 228 177 161 125 196 110 328 308 176 189 110 170 198 331 297 89 170 98 161 223 220 93 122 83 278 209 174
2369 174 281 240 73 194 210 104 80 62 104 170 46 174 278 254 89 50 57 121 144 25 116 79 116 193 110 178 13 60 133 46
2016 46 127 79 187 189 224 182 153 161 93 65 136 81 63 171 57 76 114 197 18 185 40 173 522 415 130 161 184 89 86 168 133 47
1641 47 111 199 97 118 56 207 244 196 134 209 230 156 81 175 192 52 133 156 135 214 150 119 207 129 135 128 323 275 213 295 103 35 112 92
1242 92 115 39 32 73 114 50 121 141 58 45 60 103 73 120 210 150 180 254 129 119 159 294 67 102 133 42 48 82 72 54 145 168 199 69
843 69 142 54 151 203 87 115 62 280 256 82 44 139 113 32 105 182 265 419 175 233 216 55 110 242 64 220 150 117 13 149
491 149 229 103 249 250 388 84 164 99 145 103 164 126 236 180 64 126 86 226 170 22 131 102 100 105 91 98 39 203 191 127 143 106
115 106 102 87 137 191 81 80 227 294 296 252 252 291 175 74 84 41 146 39 44 43 193 208 157 88 133 48
-190D8
##PAGE=	F1=-11950.3
##FIRST=	25169.313707327481097,	5807.6787752999953227,	0
##DATA TABLE=	(F2++(Y..Y)), PROFILE
5808A67Rj02%MOMJ44l3j73M1N7o6N1JN1K1J79q6k3P1k51J54k9j17J5k6k1Q1o1J17l8N9r8O5
5409A73j6o1J40q9O3j09J29j86J03P6j55N1Q1j17J61m0q9qj0J42J1j25j02K5K6P7o5l7R1L5
5056A75j20J5rK19n6j10mk7J6n7J58L9m7J8o8j19Q6J09j88M4M7P3j33K5O3r6P9o9qL9J23j33
4681H4J89L4m9j18M7J18q3j30rQ4N2j45R1KLq3J89L4j67On4J18q3j06O5o4R8l2m1Q5O5r9p5
4294B6N1o2J07n9J0OJ59K5p4q5j7L5K6k8o9j6P9r1J49l3L8J3r8J07j90J34pl2oj3pQ7o1L9
3894A43O7j59J26R5j45N2j27P3K6L4j13R7J44Nk51O8M3J3n5p2rl0P4L2r5J46n8q7J54j06O1
3531A46P6j19n1J05J1n7R2p6J0O0nj10KJ1RM8j6Rj1q0j5R3o4j3P3K5p2k0J27p3l1OO9l5N4
3120A78q4J18J54k77K73p3j11j23j1J06m6M2l6Qo1M0NK55k0j55p8N7N5qj24o6K3J00J63j79
$$ plain form
5808 167 176 74 74 78 84 88 232 199 26 67 124 58 109 110 161 182 361 275 252 323 72 226 197 80 95 69 48 129 68 185 147 206 108 173
5409 173 157 96 236 147 210 101 230 44 147 223 68 119 200 83 244 204 115 107 97 239 250 125 23 48 74 151 86 49 140 175
5056 175 55 70 61 280 224 114 110 83 99 42 200 239 192 210 142 23 109 218 30 74 121 194 61 86 149 53 132 63 55 94 217 84
4681 84 273 307 258 140 187 305 222 92 83 167 219 74 165 167 170 87 276 310 143 149 95 213 130 24 89 25 123 91 50 135 200 101 26
4294 26 77 15 122 63 73 79 238 263 189 104 87 122 148 120 51 35 114 23 172 139 177 190 92 199 9 143 136 104 98 85 78 165 104 143
3894 143 210 51 177 272 127 179 52 125 151 185 72 169 313 318 67 135 178 191 136 64 55 25 99 131 36 182 124 37 191 85 146
3531 146 222 103 52 157 168 111 203 127 137 197 192 82 84 95 104 152 136 145 134 54 39 132 68 55 128 153 81 61 188 115 84 90 159 124 178
3120 178 94 212 366 89 362 289 178 55 44 150 104 146 110 118 57 97 102 357 337 182 104 161 216 208 84 18 41 141 304 125
2768A25Kr9K18r8M2j9L4k7j7j4J6K0r4K46oj61Mk9RM1J82o9k27P3r2J36P4n9j54M3k5K72q8
2380B59j08R4k0j56J63l0j35L5q2J30R2j50R2L7k8j20L1n7J06j5q0NrR1J03j54P9j60K2J16
2028A51p4P1j9R7k6P6n0r5lj06J0J69p2m4P1j20P2L6Mo3J29j79J76L56j98k94P2L9j10%L6
1664A12jr4O1J07p0K7n1J02K8l6q3O6N7p8p3R3N1j50K6M7m3Q5Nk4M0o2L9n7J98k4j02R9j41
1277A54j12N2J3lp2j0P0N3r9M2L2q1L4M0RJ3m9Q9j08R6M8r4J5k1J70k51O8J%p1O8Qp6P6P8
866A82K8j85P9j4J20Mj29O9n1J99m1k05j0O9l3l0J16R2K2Q0k03Q5l9j47O2J29k14J72j5o6
514A26j11J70Q8j07J52o1J22k97Q6j11P3J6O2n6R4k5j51P2q6J90j02m4Oj0P4n2J1j9n1J79
162B38p5q7N5l7kQL2M3j02l7J54R0J0%J4j8j24q6M2q8O2o3RnJ37jj0p7N4p7
$$ plain form
2768 125 127 28 246 148 190 171 205 178 161 147 163 183 89 335 329 168 172 143 152 193 375 306 79 152 60 196 270 211 57 100 75 347 259
2380 259 151 245 225 69 232 202 67 102 20 150 242 92 184 221 193 73 104 47 153 138 58 63 54 145 248 94 173 13 35 151
2028 151 77 148 129 226 200 276 226 131 128 22 32 201 129 85 156 36 108 144 148 85 214 35 211 567 369 75 147 186 76 76 112
1664 112 111 17 78 185 115 142 91 193 221 185 102 168 225 147 74 167 218 68 94 141 98 183 188 164 204 142 181 124 322 298 196 295 154
1277 154 42 94 107 104 32 22 92 145 46 88 120 39 73 113 122 135 86 175 67 163 211 117 132 111 281 30 98 99 99 28 96 104 28 104 182
866 182 210 25 104 90 210 214 85 154 103 302 261 56 46 115 82 52 168 260 282 362 159 244 205 58 120 249 35 207 192 126
514 126 15 185 273 166 318 257 379 82 168 57 130 146 208 152 246 221 70 142 56 246 144 100 106 96 170 118 129 110 59 238
162 238 163 76 131 94 92 100 132 175 73 36 190 280 290 290 304 286 162 76 118 30 92 29 38 33 170 169 159 82 136 59
-190E9
##PAGE=	F1=-12052.5
##FIRST=	25169.313707327481097,	5807.6787752999953227,	0
##DATA TABLE=	(F2++(Y..Y)), PROFILE
5808A90Jj24l4L4J0qJ66n2j46P1R2j03p4N2P9MJ97p3k6Q6k67J78n6j26J8j4M9L3j01J05KP3
5432B36j48J23k1j09J31o7R2j52J34j52R4M8j47L6N5j06J96Qr7p3L7J32o6r8l4l6J25O6j38
5092F9k9R3N5j43J2pK04q1n6l1NK0n8R7R6m8j8nr2pJ48j41l1Q6Q3j20l9N6k4N5j34J2M0J58
4693B25j48J70L0k6j52L6J20m3r4k1J14K2j93J71m8N3p9J37jj71M7l5J18o0j52P4q6J31l3
4352A06n4J24N7j27j04J16p1J03q4P5m2K21j0n5j83M2m8P4L8j24m2P3m5J35l8L6L6j57J72
4012B24j69M3O1q6jN7n2J21j02O0L8j19M0J10j02M8j56J26N0K5j10N8J49K8j86j17J20J8o3
3671A13o6LM3l2R2j21J62k5j13J68j29K4N2q5KM9O0q8N6n4lN5J2r1kqrR7OJ8p0rm4R6r3j4
3249E2R2M9r5k3R0m3n7M1M7q8P3r5J08J89k19J95j03r5J7j23K03k9m6n1L6q7N8J3J76ko7j58
$$ plain form
5808 190 191 67 33 67 77 69 235 183 37 108 200 97 23 75 154 158 355 282 256 342 75 253 197 71 89 75 124 157 56 161 163 236
5432 236 88 211 190 81 212 145 237 85 219 67 161 209 62 98 153 47 243 251 154 81 118 250 184 86 52 16 141 207 69
5092 69 40 133 188 45 57 50 254 173 117 86 91 111 53 150 246 198 180 175 83 76 224 83 52 138 221 101 62 118 94 149 15 27 67 225
4693 225 77 247 277 251 99 135 255 212 118 97 211 233 40 211 163 216 137 274 273 102 149 114 232 172 20 94 8 139 106
4352 106 52 176 233 106 2 118 47 150 66 141 99 320 310 255 72 114 66 140 178 54 12 85 40 175 137 173 209 52 224
4012 224 55 98 159 73 72 129 77 198 96 156 194 75 115 225 123 171 15 141 191 216 106 164 313 341 155 38 158 176 113
3671 113 47 50 93 61 153 32 194 169 56 224 95 119 171 86 88 137 197 109 165 111 108 163 175 84 82 74 65 162 168 186 116 107 63 159 66 52
3249 52 144 193 98 75 165 122 65 106 153 65 138 43 151 340 121 316 213 118 135 12 215 186 140 89 125 38 96 109 285 283 216 58
2873E8O8R3m1n5n7l0J26J78j60p2k4J48r7K4L7j0l3Rm8P4k1j16K59j0j63j0M1j0J5K20q4k42
2498F7P5q3J45O9r1j53M9lL11j13j62P6K1j15J60n5j67Q8o9J40J03j63P3k8l5m7N2j01J41
2157A85o2l2l7k1J22J06j71P7j28k8J61p6P5LQ2k7O6n7j24j0n6J9J78p3n7J8j09J19%m9O4
1793A58N5j82K08L45k79j56K2Kj04j3PK0j6%Q1l3M0m5M5L5j2k8k3R4q8o3O9P8j37k1N4j2N8
1406A59N5k1j0l6O8j02J79Pj27J17p0j72L8M0qq9J3P0N5j16RO7r0J25K2n4N4j32J63j58P4
1042A30Om0N1r0J82k27P9j7P8j47Q8N7n3k4J10J5j39j3J15Q8m9j23J00o0J66l2k03M1Rm4R
678F3J42Q8j8J3j14N7n9j13N9J28k01J36M0p5j19J80J22j72J79q9J15k86Q7j39Q3N5P7o7O2
338B34nj13M4j25K10j36P4r7M7Q0p4J4m6j1J64j16p2M9l8j0M7jK2o0m6J14R4J7M7L6p3j24
$$ plain form
2873 58 126 219 178 123 66 36 162 340 180 108 84 232 135 159 196 186 153 162 114 188 167 51 310 300 137 127 168 158 173 393 309 67
2498 67 142 59 204 273 182 29 78 75 386 273 111 187 208 93 253 198 31 119 50 190 293 130 203 175 140 93 145 44 185
2157 185 123 91 54 33 155 261 90 167 39 11 172 96 171 174 256 229 295 238 114 104 48 67 245 172 115 133 24 143 143 94 158
1793 158 213 31 239 584 305 149 171 173 69 56 63 83 67 67 148 115 155 110 155 190 178 150 127 221 133 70 139 217 80 59 113 101 159
1406 159 214 193 183 147 215 113 292 299 172 289 219 47 85 125 117 28 41 111 166 50 59 126 36 161 183 129 183 51 214 56 130
1042 130 136 96 147 57 239 12 91 74 152 5 93 150 97 73 183 198 59 46 161 249 200 77 177 117 283 251 48 89 98 54 63
678 63 205 293 275 288 174 231 172 59 118 246 45 181 221 146 27 207 329 157 336 247 362 76 163 24 107 162 239 172 234
338 234 229 116 160 35 245 109 183 86 133 213 139 153 107 96 260 144 72 121 83 73 120 119 141 81 35 149 243 260 307 343 270 146
-38A46q2Q1n8m7l7L6kJ04k1L6p1M9o8
$$ plain form
-38 146 64 145 87 40 3 39 37 141 120 156 85 134 66
-190F6
##PAGE=	F1=-12154.8
##FIRST=	25169.313707327481097,	5807.6787752999953227,	0
##DATA TABLE=	(F2++(Y..Y)), PROFILE
5808A97Pj40l8K7PKJ64o7j03P6J24j27k5l6O7kK02n9l6J00k70J92q2j00j3P7P3k9j35R3J6
5444A62J08k27J63k9j00R6k4J12j96J39j21Q1K0j32L2K1q0K17L9r1j39R0J04j39m8M2m8J43
5115A95M0j90lR8M3j40nLJ45q8O8j07P2oo6M3J39l4m4M7m6j03J41o5n6P3J01j18r3L1O5O9
4740B09j35l6J3J48j30J53Onj60RJ10Jl6k6J31j4k25K32q1R2n2M7k8j67P3j4J19oj77L3m1
4376D3J09k0n3J31L8j39r1J36p5P9q5J26p9K47k5l3k34M5j08J30Q7j48o7K3L9R3m1K8N2j78
4024C0J94j19k7Q3q4JQ3m3J02j34P3Mo8m1J09p0P5j59J47P4J2j23M5J24M2j10j74Q7L2q8k0
3660E7N6N1j34J57j37J60oj42J77j36K9Nn0N0l2J10j12J3nk1N4J9q4J1l3j9J27K7K1j14P8
3296A77j18R6q9j9R5Q5j07k1L7j4o3O4J6j00O7m7L0K00j54J10j35m5J50j77K52j5j26q7P0
$$ plain form
5808 197 204 64 26 53 60 62 226 159 56 132 256 129 104 68 135 133 335 276 240 340 70 262 180 80 67 144 217 188 53 146 162
5444 162 270 43 206 177 77 173 149 261 65 204 83 164 184 52 84 105 25 242 281 190 51 141 245 106 58 100 52 195
5115 195 235 45 42 140 183 43 38 41 186 98 166 59 131 125 59 102 241 207 163 210 164 61 202 137 81 154 255 137 44 75 140 209
4740 209 74 38 51 199 69 222 228 223 63 72 182 183 147 121 252 238 13 245 164 256 204 251 223 56 129 115 234 228 51 84 43
4376 43 152 132 79 210 248 109 18 154 79 158 73 199 120 367 342 309 75 120 12 142 229 81 14 37 76 169 128 156 208 30
4024 30 224 105 78 161 77 78 161 118 220 86 159 163 95 54 163 93 168 9 156 230 242 119 164 288 330 220 46 133 165 77 57
3660 57 113 164 30 187 50 210 204 62 239 103 132 137 87 137 105 215 103 116 111 90 144 163 79 90 57 38 165 192 213 99 177
3296 177 59 155 66 47 142 227 120 99 136 122 59 123 139 39 106 59 89 289 135 245 110 65 215 38 290 275 149 62 132
2955A32j05O3PJ01J0K9j61J3J20o7J3o1j5J09J49j19j12L4J20j19j5N9j2QJj14J32n4j28K39
2603B57l3j49j5J16Nl1K37q4k36Q4o9J04N0r6r8K0K0K92j26j77M6P0o6J31m9j73R1l1J24J05
2251C19j67O2o7n2J9N2j10J52j10J4k2n0J09Q7j58Q3r1j4J35q5Q8J5O5qJ0o3r1l1j6OJ68n5
1876A94n8l2q2J39m7m5J34k2j45K15L19l39J0l1p1o2k5k5K1N4k9L2oO6n4j3N9J9N7j37J23
1512B19r6k5%R2j23k8L8M3L1P0l0m5j2R5j29J39L6j29J34nk23N2L8Lj16M1M5O4j24rR0q5K02
1124B53oj24Q0j81K76j23p7n2L9P8j51J62j58O0k3J38j71N4J19l0p4P8jo3o3J82L8q5r7R6
772A74p4J20Kj67O9m0m3K3J49P1m8k9rQp6o7N0J21j51O6Q5o7j10J24J46k62K20n7J09k48O3
408A52j30O8O2R4n5J8om0jj51K14j14J41j68R2M2n6%o8M0J38j28k5jm4l7J14m7J8Mn1L8Q3
$$ plain form
2955 132 27 90 97 198 208 237 76 89 209 142 155 94 79 188 337 218 106 140 260 141 126 185 173 181 182 68 200 146 18 257
2603 257 224 75 60 176 181 150 387 303 67 151 82 186 236 140 42 62 82 374 248 71 117 187 121 252 203 30 121 90 214 319
2251 319 152 214 147 95 114 166 56 208 98 112 90 40 149 236 78 161 70 56 191 106 194 209 274 266 276 213 122 91 75 81 249 194
1876 194 136 104 22 161 114 69 203 181 36 251 570 231 241 210 139 77 52 27 48 102 73 105 99 165 111 98 157 176 233 96 219
1512 219 123 98 98 190 67 39 77 120 151 221 191 146 134 229 100 239 275 146 280 275 52 104 142 145 29 70 115 179 55 46 136 51 253
1124 253 247 123 203 22 298 175 98 46 85 163 12 174 16 76 53 191 20 74 193 163 89 167 166 103 40 222 260 175 78 174
772 174 100 220 222 55 124 84 41 64 213 284 236 207 198 206 130 63 113 234 83 149 234 167 57 181 327 65 285 228 337 89 152
408 152 22 90 152 246 191 209 203 163 162 11 225 111 252 84 176 218 162 162 94 134 272 144 119 118 74 37 151 104 122 126 75 113 196
21A96K2P5N8j15j03r5J23k3r3qPJ9M5l0O1m4K8n3
$$ plain form
21 196 218 293 351 236 133 38 161 138 45 37 44 63 108 78 139 95 123 70
-190G0
##PAGE=	F1=-12257.1
##FIRST=	25169.313707327481097,	5807.6787752999953227,	0
##DATA TABLE=	(F2++(Y..Y)), PROFILE
5808A93J7j60J2j4mM9J14p6m4N6J42j39N0j07L0rJ93m9m2J05k56J94j05n5n6J70R5q9j56Q2
5456A41JJ56k48J14l1m7M5K8J25k26J40j04N9jj19M6rn4K26M9p8j66J12P2j99K7O5m2J45N
5103B32j97kJ30Kj14k4M0K4n3J88j82J49m5q6J3J61j8n1Q6k6j64R4K4m2K0J19j14j30kJ49
4751A81J01j43r6PR9q9J33mjj22m5P5M4L4k6J36m8j73K10j05J07k9k9m4j33N2J6J14O6j81
4399A07m5RQ3nm6J28Nj28p1J43q2N2o3J43r5K35k2ok28km8J07J00j46r8QQ3M1l9KO8j45J48
4012A93n3n2N9l7j6P3j4P7j69R3l0j5p1P4n9J21j66J52J00nj46N5Q6M5m2j54QN4j20M1Q4N8
3636B24j84J82j49J48oj57J75j14N9m9k6Q9j27J51j27j6N6k7M7jq7M4o7LJ20L5K0j20J52k07
3284D1Q0o1j8P2J38j06j9j5km2O2j3n1K4kn7J83q7N0j54O1J91k19L02pj83j14Q3j21N7%M8
$$ plain form
5808 193 210 50 62 48 44 93 207 131 87 143 285 146 196 89 119 110 303 254 212 317 61 255 150 95 39 209 304 215 59 141
5456 141 142 298 50 164 133 86 131 159 284 58 198 94 153 152 33 79 70 16 242 291 213 47 159 231 32 59 124 82 227 232
5103 232 35 33 163 165 51 27 67 91 38 226 44 193 148 62 75 236 218 167 253 227 63 157 181 139 159 278 164 34 32 181
4751 181 282 139 43 50 149 60 193 189 188 66 21 96 140 174 148 284 236 63 273 168 275 246 217 173 40 92 108 222 288 107
4399 107 62 71 154 149 103 231 236 108 37 180 98 150 87 230 135 370 348 342 114 112 64 171 271 125 27 35 118 159 120 122 190 45 193
4012 193 140 88 147 110 94 167 153 230 61 154 124 109 38 112 53 174 8 160 260 255 109 164 250 295 253 99 107 161 41 82 166 224
3636 224 40 222 73 221 215 58 233 119 178 129 103 192 65 216 89 73 129 102 149 148 61 105 38 41 161 196 216 96 248 41
3284 41 121 60 42 114 252 146 127 112 110 68 130 117 66 90 88 31 214 127 177 23 84 275 56 358 351 168 54 137 16 73 73 121
2909A21K0R9j19n6J17p3N8p3J5J19P6p4j06O3J15j45o7N3K8P1l1j89J84q6q8J47o3o8K2J00
2556A70L5o9K29p3k05P6p6O3K2p9k1lK0K26j23j32j3J11k4R3j3j46M3J0J00J03j65M7p5p1
2204F0P5L3r8J42j48N5%n1O5N4j30R8m6lR5q6R6K2M5K0p7m8k5m6k9qJ51k4m9o8m1J20p8J0
1805H6J30r2p6J96K79l65J48o8j53K4k0q3MJ11m8J4j2J05p2o7R3L6J36k21J33r5K5r2R0r2
1453E4k1OR4K3N4m9m1j4J18j26P1N7j07J50L8k44O6K2K4j42O1J3Q5j44LQ5o1K52l6j85Q8j73
1077B1L49r4j96l1O6O8j40N7o9K7j9J74j63JJ72j2q2Oj3Ll7J65j3p8o8M9q0N7N2j03O6p5o
690E4MJ38N1p8l2P7l0q8k8M7R5q7mJ14n3p5OJ68q9j5L9Q6j80J4r4N1L4J02j8k7l3M2n3j13
291B5J66k6J33k01J09k4nj6p6P4J17j16Km4m8n2J71r2M1M6p0k7O8K7O5O9j32n9j19J57Qr2
$$ plain form
2909 121 141 240 121 65 182 109 167 94 109 228 304 230 124 187 302 157 90 143 171 242 211 22 206 120 32 179 116 48 70 170
2556 170 205 136 365 292 87 163 87 150 172 93 72 69 89 315 192 60 47 158 134 227 214 68 111 121 221 324 159 206 131 60
2204 60 135 168 70 212 64 119 119 68 133 187 57 155 109 106 201 115 211 233 278 298 221 173 148 102 73 65 216 192 143 75 34 154 76 86
1805 86 216 124 48 244 523 158 306 238 85 109 89 6 10 121 73 87 75 180 108 41 134 170 306 85 218 123 148 56 146 54
1453 54 33 39 133 156 210 161 120 106 224 98 169 226 119 269 307 63 129 151 175 33 94 107 192 48 51 136 75 327 291 106 194 21
1077 21 370 276 80 49 115 183 43 100 31 58 39 213 50 51 223 211 129 135 122 125 88 253 240 162 94 143 63 120 172 69 135 60 54
690 54 58 196 247 169 137 214 184 96 68 115 210 123 119 233 180 105 111 279 190 175 214 300 120 134 40 91 125 227 209 182 149 191 138 25
291 25 191 165 298 97 206 182 177 161 85 159 276 160 162 118 70 18 189 97 138 184 114 87 155 182 247 316 184 125 6 163 171 79
-85G9Nl7M7j8rM2%nl4
$$ plain form
-85 79 84 47 94 76 67 109 109 104 70
-190G0
##PAGE=	F1=-12359.3
##FIRST=	25169.313707327481097,	5807.6787752999953227,	0
##DATA TABLE=	(F2++(Y..Y)), PROFILE
5808A82K4j82P0k3k9R4N1q4J7K9J36j38J07j47Qk3J70m7l2R6k22J79j25kp9K21J17j36j59
5467G3P1l5J99j95%no%O8J33k33J34r7K3j3q6M8j4n4K29M4o6j48J03L6j68L8M4k6J36l3j44
5092E6m6J70l6p5l0O8o9Q4J65k32J93o5j18jJ72rm7J17l2j90K3J14j5m9J31r8j48PJ69J28
4740C37j35j48lL8l3J02K4j4n5l1o3P1J02k3J34p5j09J85j27Q7j6o4n5o1k3N6J04J36j73j22
4387D6L6N7J3l8J20l4r6m6J33r1L7l6J26r1J96j0K7j90n3LJ05R1j30j38O9M7qk5l7P9r5O6
4012A33K6m1NJ7l4L7K8N8k00J17n9L5o7M5m2J35j52J12J19k2j64P8N0L3Oj35k9O6j20P3R1
3648A99O7j80J63j58J34k7j47J59o4P9r4j2J25k01J57j34j3R3k5M0l1r9Q9j02L9R1K8J7q7
3308A06J98k40Lk0rK7K09j03j9m4j7pM0l0NrJ2o1Q3k7L5n7O5J65k26L24nk17j16P2j18L3k
$$ plain form
5808 182 206 24 94 71 42 136 187 103 120 149 285 147 254 107 115 92 262 215 183 279 57 236 111 109 30 251 368 232 73
5467 73 144 109 308 113 113 108 102 102 170 303 70 204 107 130 117 31 79 65 11 240 284 218 70 173 209 41 79 123 97 233 200 56
5092 56 10 180 144 69 39 107 38 122 287 55 248 183 65 64 236 227 180 297 265 75 98 212 197 148 279 181 33 40 209 337
4740 337 202 54 51 89 56 158 182 168 113 82 19 90 192 169 303 228 119 304 177 264 248 184 129 68 45 101 205 341 168 46
4387 46 82 139 152 114 234 200 104 58 191 100 137 101 227 136 332 322 349 159 106 109 214 305 175 37 106 153 145 120 83 162 67 133
4012 133 159 118 123 140 106 143 171 229 29 146 87 122 55 100 58 193 41 153 272 250 86 164 214 247 253 118 89 155 35 108 199
3648 199 266 86 249 91 225 198 51 210 146 225 131 119 244 43 200 66 53 146 121 161 130 31 120 18 57 148 176 193 106
3308 106 304 64 67 47 38 65 274 171 152 108 91 84 124 94 99 90 102 41 124 97 132 75 140 305 79 403 398 181 65 137 19 52 50
2920E0K1L9J15p6q4P7n0O3q9N4J55j5l7o7O1J14j63j16L1R2J27o7k16J91j19m8M6p8J17L1
2568A59%N8q4K06n7j71M5r6M2Jn2N3onJ39j11l5o5J00RM9L9j14pM2P4J00j57K5o7p4J20Kq9
2169G3J24j53P1J8l8J9K1r0J00PlN2p2R3K5K1M4j71J8J6m0p9k9J38J3l8q8qP9m6K4J02j46
1782E7pJ74K25l55K38q4k28J32j5j19J6R4o6M8n9J46q6p3Q5K9J98k64J31r1O5j55O6pn9k8
1430HJ29K5K3n0K1p0J21r7k3P1o3J56N3k28O3RM8j49N7j4J12j74L9N5k5K76o3k19P3j31L64
1066C97o4k57L5O0L8j38l2K1j3mJ81j39j5J68%p2p3KL3oJ25n1k7n8k1m5j7Q3k4L1r9N8k9J14
667A62L7j09NJ24m3r1j3M9N5j8n1J16l9k2q2J93J26l35J45M0j00l7n5M9%P8M5o3p5J06j07
303I0j9P9P9Q6k00J09j10O6k8o3P4J07r2Oo6m3qJ59j24N3P4q2p1N9K5K0O5j24Jq9J15L0p9
$$ plain form
2920 50 71 110 225 149 65 142 92 155 66 120 275 260 223 156 217 331 168 52 83 175 302 235 19 210 91 43 89 11 128 159
2568 159 159 217 133 339 282 111 156 60 102 103 51 104 98 93 232 121 86 21 121 130 179 218 104 97 139 213 313 156 181 114 40 160 162 73
2169 73 197 44 115 133 95 114 135 45 145 152 149 201 129 222 247 268 312 141 159 175 135 56 27 165 178 140 52 44 123 77 101 203 57
1782 57 50 224 449 94 332 248 20 152 137 18 34 128 62 110 51 197 111 38 123 152 350 86 217 126 191 36 102 95 36 8
1430 8 137 162 185 135 156 86 207 110 87 158 95 251 304 76 139 148 196 47 104 90 202 28 67 122 97 373 310 91 164 33 397
1066 397 333 76 111 171 209 71 39 60 47 43 224 85 70 238 238 166 93 95 128 122 247 196 169 111 90 45 28 111 87 118 19 77 48 162
667 162 199 90 95 219 176 85 72 121 176 158 107 223 184 162 80 273 399 64 209 249 149 112 57 106 106 184 229 166 91 197 90
303 90 71 150 229 315 115 224 114 180 152 89 163 270 178 184 118 75 67 226 102 155 229 147 76 135 160 180 245 121 122 33 148 178 99
-85I9K8q5P5n3K5j5N2m0j9
$$ plain form
-85 99 127 42 117 64 89 74 126 86 67
-190F7
##PAGE=	F1=-12461.6
##FIRST=	25169.313707327481097,	5807.6787752999953227,	0
##DATA TABLE=	(F2++(Y..Y)), PROFILE
5808A69K2j77J07qo2J22jr6O7QJ11j32J31j52J0m0J37n1%O6j66J43j33M0p0K19J37j65j45
5467I1N7o6K10j26n7M1l0k2Q0J34k24J30r0k8k3k3K4Op8K29L4o4j10R3nr8J3QoJ15o5p2o0
5080A8J60n1l7l6Q7j5R7J20k64J99n8j46j9J82pm0J45n9j79n4J85J1j20J33o3j53M8J41J36
4740C61r8j70m8j2L4N0Q2k2j0j9r2qJ48k3J30q7m8J67j46M1j9n3o1Kq4Q3R2J85j59j52J3K6
4364A03L8l4J12o8n2j0J00j06N0k9R1p1J46qO9j39p9J8J22P6j08j65J23rm6Mn1N4m4l0J05
4000A62ro4O4m4j3Q2M4j65Q4p7P6q7O4j4J14j31N2J28m5j57R9L3KK9j21k9N9q5P6Q8P6j44
3624A47J19j65J26p4j09J35pQ3j30NJ54k10R7j23MR4k2L9n3r0J07r9M0N7QK3m2K17k19j05
3272GK9kJ5K44j03k4m7m3K9%k7N0l4Pj0m8J9L9J4P4J15j91L01qk27j06N9r8J2oRN6Q9m4p0
$$ plain form
5808 169 191 14 121 113 51 173 172 76 143 151 262 130 261 109 119 79 216 165 165 231 65 208 75 115 45 264 401 236 91
5467 91 148 82 292 166 109 150 120 98 178 312 88 218 128 100 77 54 78 84 6 235 269 205 95 188 183 85 98 106 100 215 150 78 18
5080 18 178 127 90 54 141 126 223 343 79 278 220 74 55 237 230 190 335 276 97 43 228 239 119 252 189 36 84 225 361
4740 361 263 93 45 33 67 117 199 177 167 148 56 48 196 173 303 216 168 335 189 230 211 158 97 99 15 98 190 375 216 64 77 103
4364 103 141 107 219 151 99 89 189 83 133 104 195 124 270 262 331 192 113 131 253 329 221 56 179 170 124 128 77 131 87 57 162
4000 162 153 89 153 109 96 178 222 57 141 64 140 53 117 103 217 86 138 266 221 64 163 196 198 227 106 77 136 51 127 215 291 147
3624 147 266 101 227 153 44 179 172 255 125 130 284 74 171 48 52 146 124 163 110 20 127 28 68 125 133 156 114 331 112 7
3272 7 36 34 49 293 190 166 119 76 105 105 78 128 94 101 91 43 62 101 115 189 304 113 414 406 179 73 132 34 46 40 49 105 194 150 80
2862H0J4KK9r0Q1J96q7j7j7L1J13j70j36OJ45J59r6j99J70j52j8l7J04Q8L6q1O1q2J79l7j52
2498A23mj14N5j3k8J13Pm5O4r6N3o5K8L4NR0p9l8N1N5J01j50nn6n0J47k8r1J07j03L8L2k3
2110A15j3ql7P4N9j0J3n2Q3K8nN4k46J39lk4j19k7J29K5m0p8oL4M0k8Q4j71K2J75J51l09K70
1723C19p3j88J31j0j43L9N8p2Q1j08J71r3m5N4nK39k71J30r2Q9j70L2P9j10oJ00K2nQP6j32
1359A05Q1n2j19O9rJ47M5j80L8NP5j32K5k7J36j86P1ROK81q4k08L6r6L34l4k52N8Q3J5j57
995H3m1N4m6MJ74j02PJ09Mn3j34N6J8J1O8p5M3o3p0K8N6n8L2k7m0O3o3Q4L6j24N6J22k5r1
596I6j1L3J4N5o4Q2j3K3q1J27K34l84R8j7l8o9j7N4lJ0J19p8j03J16j54R2j0J69K5j72J00
232B33j98J34l1l0M0J05o4oo7k7J8J48j37K9J01q0q9N0J6l1M9p6M0o5N5L9n5N4j22R5m8L5
$$ plain form
2862 80 94 96 125 35 116 312 225 208 191 222 335 165 29 35 180 339 243 44 214 62 44 7 111 199 235 154 215 133 312 275 123
2498 123 119 5 60 47 19 132 139 94 158 62 115 50 78 112 117 207 128 90 141 196 297 147 142 86 36 183 155 64 171 68 106 138 115
2110 115 102 94 57 131 190 180 193 141 224 252 247 301 55 194 191 167 48 21 150 175 135 57 51 85 125 97 181 10 32 207 358 49 319
1723 319 246 58 189 179 36 75 133 61 142 34 205 112 67 121 116 355 84 214 122 211 41 73 152 42 36 136 158 153 161 237 105
1359 105 186 134 15 84 75 222 267 87 125 130 205 73 98 71 207 21 92 101 107 388 304 96 132 36 370 336 84 142 225 240 83
995 83 42 96 50 54 228 126 133 242 246 193 59 115 133 144 212 137 180 117 47 75 131 73 105 78 38 101 38 122 158 34 90 212 187 96
596 96 85 118 132 187 123 205 192 215 134 261 495 111 209 192 154 85 68 122 119 129 248 170 67 183 29 121 111 280 305 133 233
232 233 35 169 138 108 148 253 189 183 116 89 107 255 118 147 248 168 79 129 145 114 163 87 127 62 117 156 101 155 33 128 80 115
-143A15o4Q9n8j4
$$ plain form
-143 115 51 140 82 68
-190F8
##PAGE=	F1=-12563.8
##FIRST=	25169.313707327481097,	5807.6787752999953227,	0
##DATA TABLE=	(F2++(Y..Y)), PROFILE
5808A55J6j26R5J9r6J38l5j17R5kP9j24J18j19J9m5R7n9N4K2j08R5j20N9n5J97J49j75j14
5467A12L5o2J64n7l2M9p6j9O9J23k02J39q2q7m2L8PL2j00K16K9p8n2Q4n5m1qk2J4P9p9nm8
5080D3J14m7mm6R7M1J11P8k84J66k8j54j5J58ql1J61r2j31r6J97K8j72J15rj56R0J11J08k9
4728C16j64j14j8P1pJ29j9J5j2j03o0J53l1J27q6KJ52j54pm3lo6M4o5N2P4J99j44j41l1j3
4364E3O8l7J05q3j0L5M8j22Q4n1O4m5J09m1J23r0q4OJ49O3q8j66J53p5p4M9k6j8Qm8Q8L8j41
3977D4J04m1o8J47K7j06L4p6R9j33R9J1Q8j06JJ20p3j12J02L8m2K8j07j7L7l4P3Q2Q3q8O5
3613B79j78J42j53n3J09L8P4j51K9J72j94K6o8j0O1j7M2m8l9O2o2J7J9k4N2j1K10j74j08q
3261C4kP5J93j02l2l8n4N4m3j5Q4o2JL3p3MQO2R4N1j24K39j3k17p9N0q6J8k3kN9O1k5l6m9
$$ plain form
5808 155 171 45 140 159 63 201 166 49 144 142 221 97 215 96 115 70 167 108 162 184 76 171 51 110 55 252 401 226 112
5467 112 147 85 249 192 160 209 133 114 183 306 104 243 161 74 32 70 77 109 9 225 254 176 124 208 153 112 104 82 96 175 96 91 43
5080 43 157 110 106 60 157 198 309 387 103 269 241 87 72 230 222 191 352 260 129 33 230 258 86 201 192 36 126 237 345 316
4728 316 152 38 20 91 84 213 194 209 197 94 34 187 156 283 197 199 351 197 190 147 144 78 122 57 109 183 382 238 97 66 53
4364 53 121 84 189 106 96 131 179 57 141 90 154 109 218 177 300 210 126 132 281 344 256 90 243 168 94 143 117 99 107 59 147 185 44
3977 44 148 107 39 186 213 107 141 65 164 31 130 141 229 123 124 244 171 59 161 199 157 185 78 61 98 64 137 219 302 214 279
3613 279 101 243 90 37 146 184 258 107 136 308 114 140 72 62 123 106 148 100 61 123 61 78 97 73 125 114 324 150 42 34
3261 34 32 107 300 198 166 128 74 128 85 70 154 92 93 126 53 57 65 127 221 272 148 387 374 157 78 128 42 60 37 35 94 155 130 94 45
2850D5O4k1lK4K12j19j1K9k2J15j63j02%J30J62j10j68J51j67J7J1J14M2M4j17L9o9J56j9
2509B64j49n4Mpl2k2J49L0q8L2p0P6q1j3N4l9J26m3m5L3N4J01j48l5n5rJ62m7r7R7m0j0M8
2122A46k0k8k7MM1R4j4j5l8P4K8k5M6k14J86m3j5j30RJ36jn4l4l4J8Q8j02R5j15k1J73N6k35
1735B9K47k7j28Q8oj50O0L2n9Q1j43J68r8j6M4o3K64k49J34j08R8j38jJ34j54L4O3Pk3J04
1383B24Q9j68K3j1q4n6M6J17K7j20LJ4J00r7k8k5J50j49O7m1J8K75r6j56jp5K54j2j84L9J21
1019B64Pj84k4O3o9LJ71o1L9L5jl5j36R1Or%q5J01o2j2NJ24j33K2r5O9K6o6L6M6p7L5J01K1
608B16q2j7j0k1J19m5K1L9K9p1n6K29k14N7l8l5o9J5O2K8p6J80p3j04P3j25J35q7K31l6j30
244A45Q8j93J08l0J9rR7l8k2m8j3K2J44j32l2J39p0p9K6jj8K6oK6o7j1L7j8O9j11P6k3K9q0
$$ plain form
2850 45 109 88 85 109 321 202 191 220 198 313 150 48 48 178 340 230 62 213 46 63 74 188 230 274 157 196 127 283 264
2509 264 115 61 65 58 26 4 153 183 95 127 57 133 52 39 93 54 180 137 92 125 179 280 132 97 42 33 195 148 51 148 108 98 146
2122 146 126 98 71 75 116 210 196 181 143 217 245 220 266 52 238 195 180 50 59 195 194 140 106 72 90 178 76 171 56 35 208 264 29
1735 29 276 249 121 209 203 53 113 145 86 167 24 192 94 78 122 59 323 74 208 100 198 60 59 193 39 73 136 143 120 224
1383 224 313 145 168 157 73 17 63 180 207 87 90 104 204 107 79 54 204 55 122 81 99 374 278 122 121 46 300 288 104 143 264
1019 264 271 87 63 126 57 60 231 170 209 244 243 208 72 163 169 160 160 75 176 114 102 107 231 98 120 25 94 120 54 90 136 59 94 195 216
608 216 134 117 107 86 205 160 181 220 249 178 122 351 137 194 156 121 52 67 129 157 81 261 188 84 157 32 167 80 311 275 145
244 145 233 40 148 118 137 128 225 187 165 117 104 126 270 138 106 245 175 96 122 121 103 129 123 149 82 71 108 90 159 48 124 101 130 50
-155E0R9n8j5
$$ plain form
-155 50 149 91 76
-190G6
##PAGE=	F1=-12666.1
##FIRST=	25169.313707327481097,	5807.6787752999953227,	0
##DATA TABLE=	(F2++(Y..Y)), PROFILE
5808A39J0q2Q2M7j19J43n0j50R9mN8j23P6n4K4l8O0n9J16k5o9M5r0N8l6J65J50j68p6Pk7P7
5432A86MK3L5j10KN0Q7j59J63p8j39l6M9QM7j12J91L5j06K1P2j11Ml2l7L2L0m5K0l6P1m0K2
5045A11n7J01Q5J25M4k82R3J6j35K0R3qk3J58j19n6j11J68K7j81O9N2j48J24R0L9O0j41j64
4704E0j2Q4m4J30j4K9oj14n3J16n0J29p4L5J31j51k0q3N5o6O8m0M2M0J78j33j04n2k5N4m0
4340F0R4p1RQ8lj41J17r0P4k7J08j38J89n7p6j7J81M8p3j44J58j37r0R8Jr6N8%kQ2j91J14
3965A26k2q5J76Po2Ko6J14j57R7K8O1q1j6R8j13l2Q2N1p6J2r3j4K4K4O0P4Q4l0J3j88J76k34
3578D0qQ4N6O3j56N6J78j69l0Lj8k1ML8j3mLj3Jj7n2R9k0J82j23r1l7OJ21J20q7m3k5n2P1
3167A46o5j1J03j00J1N4m8on2R4J09j9m6J58j9j92l5M1q8M5n3K1K0M8qor3J12n1R4m8J80j19
$$ plain form
5808 139 149 67 149 196 77 220 170 20 119 115 173 50 126 72 96 58 118 59 175 150 81 126 36 94 58 223 373 205 129 136 109 186
5432 186 190 213 248 138 140 190 277 118 281 203 64 28 77 85 132 20 211 246 140 161 233 122 126 94 57 89 119 74 94 58 129 89 111
5045 111 54 155 240 365 409 127 220 236 101 121 214 206 183 341 222 166 55 223 250 69 138 190 42 166 256 295 355 214 50
4704 50 38 122 78 208 194 223 217 103 50 166 116 245 171 206 337 186 166 83 138 72 140 100 142 182 360 227 123 71 46 100 60
4340 60 154 83 92 180 177 36 153 63 137 110 218 80 269 212 136 119 300 348 275 131 289 152 62 160 161 65 123 123 121 203 12 126
3965 126 104 19 195 202 140 142 76 190 33 130 158 219 138 122 220 107 75 157 208 132 144 51 37 61 85 145 219 303 273 286 98 274 40
3578 40 32 116 172 235 79 135 313 144 114 117 99 78 82 120 107 103 106 93 94 77 25 124 104 286 163 72 35 41 162 282 195 152 127 75 146
3167 146 81 70 173 73 84 138 90 84 32 126 235 216 170 328 309 117 82 123 35 80 27 48 68 116 108 102 9 121 70 164 116 296 177
2779A77lO5r5J26j40n6rJ03J35j06j17J20j41M8J5J02j0N5j09%m7J34nj51k0O3n5m6j9J43
2427A57O4j16K0m5N8j09J6M0o6J26j1m3NP5R3j53n8l6J4J61n9q8R2On1O5l1k8l4K6J5J00o
2040A99l0l6P0K1l0K4j00J41p0k3j22L3J68k6o2J9o1K6P9j69J32r7PJ31n0j50J89O1j09M0
1688B05jj36Q1K1n1O5j62J32j03L0N1j05K36j96J34j40R0n1l9J44j82Q7L0k0k6J84P9j83k0
1347A54J5m3r0K4P0J1o7j8K4J19n9p7j9J55j12O4q3MK68j03q6j5o2J41j1p9KJ53J8k06k1O9
972A40p9KJ67j6P1k9j8k4r4R0J2n3o1p4J15l7O8n6J70j59nr9J05ml1k3N6n3JR0Q2n4m1n7m8
561E4J53kn7J20mP4K39k81k03N2M0j38k7K9Q1P4j41J99n7j03K8m5J20j47K61r0q7P6j37M3
209A24k4P3n3P2k1k8k3pPJ47j13j08J83o3m1pl7O7J9OJ0r0p2L5K5N5m5J8MJ2p4R7n2j2
$$ plain form
2779 177 174 239 144 270 130 74 65 168 303 197 80 200 59 107 122 224 214 269 160 160 113 247 242 91 71 134 79 33 14 157
2427 157 221 105 125 80 138 29 45 85 19 145 134 91 96 171 264 111 53 17 31 192 133 45 137 143 92 157 126 98 64 90 105 205 199
2040 199 169 133 203 224 194 218 118 259 189 166 44 77 245 219 157 176 115 141 220 51 183 86 93 224 174 24 213 274 165 205
1688 205 204 68 149 170 119 184 22 154 51 81 132 27 263 67 201 61 151 100 61 205 23 110 140 120 94 278 357 174 154
1347 154 169 126 36 60 130 141 74 56 80 199 140 63 44 199 87 151 68 72 340 237 151 136 74 215 204 125 127 280 298 92 71 140
972 140 61 63 230 214 285 256 238 214 120 210 222 169 108 34 149 112 180 124 294 135 130 31 136 132 101 78 134 81 82 172 254 200 159 102 54
561 54 207 205 148 268 264 338 577 296 93 145 185 47 20 49 130 204 63 262 205 102 130 85 205 58 319 229 142 218 81 124
209 124 100 173 120 192 171 143 120 113 120 267 154 46 229 166 125 118 81 148 167 173 183 93 21 56 81 136 91 109 113 125 51 148 96 84
-190H4
##PAGE=	F1=-12768.3
##FIRST=	25169.313707327481097,	5807.6787752999953227,	0
##DATA TABLE=	(F2++(Y..Y)), PROFILE
5808A20J3o1P7P0j24J39n1j63N2%N1r8j0L3J6k6L3j1J40o0o5%n7N2lJ21J38j47m1k2J5j1M3
5420A63Q1J4j20K5M0K1r8J98q0j74J4jK3M7j23J67N0j43R3O1j64L7n9rJ9k7N7j7l4M3m3M1
5045A02o3R7J14J35J4k50j0O3r0O2K0qj7J28j28K9j37J51Oj41J3R3j18J37P8n9J52j08j90
4704G5l3J11o1R4j7L3Jj19j0O8p7J32o1N1J00j35J2r2O3n7P6j7M8mJ29j21n0m7Pj4j9O8m5
4317H9%J43m0j54J26j30J14j7J26k44K35m7o1l4K08K5o5j05J45j88q6J34J4j59J01L0o8J11
3988B03j30K4Pn1J44qm5nn8J29j43N4L6K7n5MP6j45L7N0N9q1kq8j8P5K4L4O8P7J3l1j79K03
3589C05k31m2O2M3N6j40O7J82j43o7O2Kj37O3J1L4Qn4L5ol1JN9m8J36p6o7n6L4J30M3m7n8
3202A30j5n3Q8n1l0J09j39M2M3l1J0m6P1J03r0L2P7k3j60J4K8p4O7r6Q0m3M0L1qo4Q6m7J58
$$ plain form
5808 120 133 72 149 219 95 234 183 20 72 72 123 25 15 48 64 38 71 60 200 140 75 75 18 70 67 188 326 179 138 116 131 120 163
5420 163 244 258 138 163 203 224 126 324 244 70 84 83 106 153 30 197 247 104 197 258 94 131 72 63 82 55 112 95 61 104 61 102
5045 102 39 136 250 385 399 149 139 202 112 174 194 186 169 297 169 198 61 212 218 77 90 183 65 202 280 221 373 265 75
4704 75 42 153 92 186 169 202 203 84 74 142 65 197 136 187 287 152 164 72 135 78 154 137 185 181 310 189 139 92 99 85 66 134 89
4317 89 89 232 192 38 164 34 148 131 257 13 248 201 140 106 314 339 274 169 314 126 40 174 188 29 130 160 92 203
3988 203 73 97 104 53 197 189 144 139 81 210 67 121 157 184 129 133 209 64 101 151 210 129 127 39 21 96 120 154 222 299 312 281 102 305
3589 305 74 32 94 137 193 53 120 302 159 92 154 156 19 82 93 127 135 81 116 110 79 80 139 91 227 151 84 28 62 192 235 188 130
3202 130 115 62 150 99 69 178 39 81 124 93 103 57 128 231 141 173 250 227 67 81 109 35 102 6 86 43 83 114 106 42 128 81 239
2815B39j00R5r4J6Q7j75J47j02k3k9Q9Q5q4m8O7q0O7j7P9n7O6p2m2j9J10Lj48R6L0j02m5j2
2439B7J15J04j21j5k3N5q6L0kl5O3J3m7lJ01P2j60n5M9m1J35p4n7R2L1q2P6m5k4l0M2KO7J9
2040A93l3m6P2Kj6%j0Q7p0n0r7L5J95l2n3O9q4L3N6k12J67j09N6Q4j39p3J18J80j37rOj03
1664H0R7K2n8N7j72P3p6O8O6m8Q2r8J04j77O1Q1p2R8j61J18On5k1K20N8j75l9K2j1q6PK0k
1277H9l5J0J4J23l5r1l7J66r9O5j00m0K62j05j6j4m9N1l9J4k1J61L8k16j4M6o3RJ51K5J03
913C53o9m7k3m1P1K3j08r2oM3J7J16j07J84j64j5n9P9j8K2p5O7p4k5R3J47j6q5o7o3J34N0
538B45j20J97l5M26Q14m04q52k04J95j99qk0J00J11j79J82m1r1rJ7J07j87K63j41n1O7r9J8
209A02OJ01q4L4j9nj5j0k0J58r1j26J82p3J9k9r5J57J2qJ3j14n3L2K4oM8n3L3k0o1J02n3l
$$ plain form
2815 239 139 234 140 156 243 68 215 113 90 61 150 235 151 103 170 90 157 140 219 162 228 156 114 95 205 208 60 156 186 84 39 27
2439 27 142 246 125 110 87 142 56 86 84 49 112 125 78 75 176 248 88 33 82 41 176 102 45 137 168 86 162 117 93 63 105 107 174 193
2040 193 160 114 186 188 172 172 162 249 179 129 32 67 262 230 177 246 162 195 251 39 206 97 153 237 98 25 143 323 186 177 183 80
1664 80 177 199 141 198 26 99 23 91 157 109 191 93 197 20 81 162 90 188 27 145 151 96 75 295 353 178 139 161 150 64 71 91 89
1277 89 54 64 78 201 166 75 38 204 105 170 70 30 292 187 171 157 108 159 120 134 113 274 312 96 82 128 65 74 225 250 353
913 353 284 237 214 173 244 267 159 67 61 104 121 237 130 314 150 135 76 155 137 159 84 151 77 52 145 292 276 191 124 61 195 245
538 245 125 322 287 713 1527 1123 271 67 262 63 55 35 135 246 67 249 208 117 108 125 232 45 308 167 116 183 84 102
209 102 108 209 125 159 140 135 120 110 90 248 157 31 213 140 159 130 35 192 204 196 209 95 42 74 98 92 140 87 120 100 39 141 88 85
-190H5
##PAGE=	F1=-12870.6
##FIRST=	25169.313707327481097,	5807.6787752999953227,	0
##DATA TABLE=	(F2++(Y..Y)), PROFILE
5808A04J8o1P7Q2j05J30m6j49j1oM4J0No0nj7L1O2J26q2r0k5oJ5M6P0J12j13k3m3M9n3L5J24
5409B45jj07L9L8o4k6K33q6j92N8l8L4M2j44J54O7j71J37N7k00N6o7M6l1o3J46o0m1K1m8N7
5045I1o9Q6J30J29j6j90j15R9k7R2l4pk0P6j14J06j68J51k9q2J3O7p1J35O8j62K30p6j97o1
4693C5J40p6N7l1K2J0j08N7J4p9J16n9N0O0j10O9o2K4l3O9kN5m6P0j09J3l8L7p3K6M8l3l0
4305H3J99o5j66J20j49J35LJ30k10J46m2m2l9K22j4n9n5J21k21n4J33J6j81J15K6p4J03n6
3977A25n7L8m2J20j4n2J1n7J44j23J9L1ql1M3O6j20L5J6N9n8lj12J5J26j5LO9O1L1o5j33J97
3589C19j99q1M5NN2r5M1J89j14r4J03M0j64O6l5O8Nj02P5j0k1N6lo1P6m1l2p9P8J06k6K7q7
3202A07qo8J06j3o1J06j20M4mk5L4oL7R1j66J08J4l0j25M4J0MM9j02R6p8J8P6l3l1O2m2J99
$$ plain form
5808 104 122 61 138 220 115 245 199 50 39 33 77 87 92 32 27 10 41 103 229 147 57 32 26 41 87 157 269 156 133 90 139 86 121 245
5409 245 244 137 176 214 150 124 357 271 79 137 99 133 175 31 185 252 81 218 275 75 131 64 110 79 16 162 102 61 82 34 91
5045 91 22 108 238 367 351 161 46 145 118 210 176 169 149 225 111 217 49 200 171 89 102 169 98 233 301 139 369 293 96 35
4693 35 175 99 156 125 147 157 49 106 120 41 157 98 148 208 98 167 105 129 96 165 163 218 172 242 133 146 108 145 72 98 146 113 83
4305 83 282 217 51 171 22 157 160 290 80 226 184 142 103 325 311 252 197 318 97 43 176 192 11 126 152 78 181 125
3977 125 68 106 64 184 170 118 129 72 216 93 112 143 135 104 147 213 93 128 144 203 145 142 30 45 171 156 159 228 289 320 255 122 319
3589 319 120 39 84 89 141 46 87 276 162 68 171 211 47 113 78 146 151 49 124 114 93 149 146 85 161 120 88 9 87 193 167 194 107
3202 107 99 31 137 124 63 169 49 93 89 64 98 92 129 220 54 162 176 146 21 65 75 79 128 26 122 44 62 138 105 74 136 94 293
2815B93j34j2m8L6J01k04J35o9km3P5K9n5K6%nP2o3N4q2O7k8p0QQ1%j07J79k1j44k3JO2J43
2416B52r9p8MP8k9%n1QQK6o6L9R3M9j58k1R1q8R1r2j0R3M2j04P5n5k1j8O3QMN2k9n8P0k7J6
1981A58j2L2L5m1q9l2j8K04k0k6J08j02L6L7k24J83j35J01M0j97MM8K95j96n8K2n8R8K5p3
1629A45O5j77RN0J4Q6jo9K1N6j41m0K10r1J6p9R8rq8j2K01L6j47l8J2J7p1K0Mk8k3M8%J22
1230B16l4p5p7J87j13O7q8o3K18j06M8nm6K2o4L8j9J45O1k27K5j8k2K5J26N0J31q0q0l5J3
866B20L8K5j59o7M4m5Q1J20j24J63j46j5l0M5j4P4j15Q6j21l6R2K09J3j42l6o8R4Q9j19K14
514C70j2Q78J530n15j626n00K22j55p6l7P7J20k10J73m8n6m5N9R8k13K46j88j9N6p9L7N8R0
185B35j08J0l8N2l9j7m9J69p1o7J24r9R0k7r6J45j2j7K7j28%N0Mr0J35j16O4p2m2J15o5P
$$ plain form
2815 293 159 147 99 135 236 32 167 98 96 53 128 157 102 128 128 123 195 132 186 104 171 143 73 81 162 162 55 234 213 69 46 47 109 252
2416 252 153 75 79 157 128 128 77 85 93 119 53 92 185 234 76 55 146 58 149 57 47 140 182 78 153 98 77 59 122 130 134 186 157 99 169 142 158
1981 158 146 178 213 172 83 51 33 237 217 191 299 197 233 270 46 229 94 195 235 38 42 90 385 189 131 153 95 193 218 145
1629 145 210 33 42 92 106 192 191 122 143 199 58 18 228 137 153 74 172 163 75 63 264 300 153 115 127 144 73 93 97 69 46 94 94 216
1230 216 182 107 30 217 104 171 83 20 238 132 180 175 129 151 87 125 106 251 312 85 110 92 70 95 221 271 402 322 242 207 220
866 220 258 283 124 57 101 56 137 257 133 296 150 135 105 150 136 210 95 181 60 24 116 325 338 196 160 92 186 275 156 370
514 370 358 1236 2766 2251 625 125 347 192 116 79 156 276 66 239 191 135 90 149 247 34 280 92 73 129 50 87 145 235
185 235 127 137 99 151 112 95 46 215 144 77 201 102 192 165 69 214 202 185 212 84 84 134 138 48 183 67 131 59 17 132 67 74
-190G4
##PAGE=	F1=-12972.9
##FIRST=	25169.313707327481097,	5807.6787752999953227,	0
##DATA TABLE=	(F2++(Y..Y)), PROFILE
5808I9J4p2P9P7o6J22m1j39Mj9k2J18J7j48j6L1K4Q0J06r2j21K9On8R7K6P1o6l0m6P2k6l3
5420G7J42lp7L2M6j49M3K56r4j94R5n2L2M1j77J59P8j67J23O5k09O3m2P8q8pJ25q0m6j0l3
5056B7O9q7O6J39R7m3j11j04K3M5J01n8jl7J3p1J52j92J63p5j7N6nk4J27N4k29K68n5j87p8
4693B6J58r4L8n3OQm5J03m5k5O2o9K8J8p4J19l7j2J2M9mN7p6J9r2O9l9O2j17P3N3l0o9K46
4294C25q6j71J06j48J14M8J04j76P6k6k4k6K18p2n3LR7k41oR7J7j31P0rj6M8J4r7N6n9J03
3930A55np8L4n8J55j05J1J4l6mO9O8q0Oj0N4k4Lj52N2J68n9k5Q4L6K5q9n8J60j64r2L3k4L3
3531I7l7k3K05q3j08J13P8j40M4o7P7pj32R5j6PJ08p6m6Rj6K0q6R7O6o8J02j21kn5P5L2r1
3143E1R9m4J3p3l1N1L9J9R6j85J12j6l5m9k3pJ25J6r9Q8r3%J00n6%N4n9K24j53j16M7K1J02
$$ plain form
5808 99 113 41 120 197 131 253 212 73 77 58 36 154 171 23 7 38 62 142 248 156 35 64 70 12 109 135 206 140 110 64 136 110 77
5420 77 219 216 139 171 217 68 111 367 273 79 174 122 154 195 18 177 255 88 211 276 67 130 88 166 78 71 196 116 70 60 27
5056 27 96 9 75 214 311 268 157 53 76 121 222 164 163 126 139 68 220 28 191 116 99 155 150 126 253 307 78 346 291 104 26
4693 26 184 90 128 75 81 89 44 147 102 77 139 70 98 116 42 161 124 112 124 173 169 226 150 169 77 146 107 169 52 125 178 148 79 325
4294 325 239 68 174 26 140 188 292 116 192 166 142 116 334 262 209 212 309 68 62 159 176 45 115 106 90 138 152 55 111 52 155
3930 155 150 72 106 48 203 98 109 123 87 83 152 220 140 146 136 190 166 169 17 69 237 178 153 237 273 298 209 151 311 147 55 88 64 97
3531 97 60 37 242 159 51 164 242 102 146 79 156 149 17 112 96 103 211 135 89 98 82 102 16 113 179 111 213 92 90 35 110 142 51
3143 51 150 106 119 46 15 66 105 124 220 35 147 131 96 47 24 17 142 158 59 147 54 54 154 98 98 152 93 317 164 48 95 116 218
2756B18j08L4o7K0k7L8j0l7Q9n7N8O4j08L4m7K8jm0mM5rk8K00p1j43qJ2pJ67n8j37K8J20J5
2357B03m2r2P3n0L3q4R1N8L9j39qJ15j25M6r6L5Q3M7j19O3n8j9JQ2L1m9O4k1o7O0o3O0qK5
1958A69kQj07J9p0J57J1J1J25j14M3L1k19J81j60J25Pk03O2J9L51k51j16O7l2Q1K6q7Q3j74
1606D1lJ16m0J11L1j87J27J2r7l3K05j04o7J4O4k1j08LJ26J7j00k6oM1m3M4J3n5j6N0JJ29
1230B39n2n1j21K12j42O8n4k7J10j08J05Ro1K1m0ooJ21P7k38Q8r0K0M6J03N0J52o8j10n4O2
866B55pJ1j84J8L9q1J08P4r1J16r9k4k1J7lJ15j40J16j67J0K3K63J3j98K6o0P1Q7m9J68O9
502D75J318K279o38k407p44J32r9j37l5M6R6k27J91r7mp3P6J01k28K15j99J9Qn7O5J13N1j15
174A25Pp5J23q8k4n4J62o2j8Q5j08J41ro4P1n7kL3j29M8P5Qj08J33j58R1j27lJ10q1R
$$ plain form
2756 218 110 144 77 97 70 108 98 61 150 93 151 215 107 141 94 122 121 81 77 122 113 85 285 214 71 63 75 68 235 177 40 68 188 203
2357 203 161 69 142 92 125 41 132 190 229 90 82 197 72 118 22 57 140 187 68 131 73 54 55 137 168 119 183 162 95 155 92 152 144 169
1958 169 167 175 68 87 17 174 185 196 321 207 250 281 62 243 83 208 215 12 74 93 444 193 77 144 112 193 219 132 215 41
1606 41 38 154 114 225 256 69 196 208 111 78 283 179 112 126 190 169 61 64 190 207 107 81 75 116 73 117 130 75 59 109 110 239
1230 239 187 136 15 227 85 153 99 72 182 74 179 188 127 148 108 102 96 217 294 56 144 54 74 120 223 273 425 357 247 193 255
866 255 248 259 75 93 132 51 159 233 142 258 159 135 114 131 128 243 103 219 52 62 85 348 361 163 189 129 200 287 238 406 475
502 475 1793 4072 3434 1027 283 415 316 179 144 190 286 59 250 153 149 76 152 253 25 240 41 60 68 11 76 189 240 125
174 125 132 57 180 92 68 14 176 114 96 181 73 214 205 141 212 155 153 186 57 105 180 188 80 213 55 146 19 16 126 45 54
-190E4
##PAGE=	F1=-13075.1
##FIRST=	25169.313707327481097,	5807.6787752999953227,	0
##DATA TABLE=	(F2++(Y..Y)), PROFILE
5808A04%p5O6N8j7J22m0j34L1j8q5J99pj76ON6J5N7Q6q9j25Q9mr8R8LK2j3o1k5Q2K4j02J21
5409A70J1m5J4N7j68O1K47j01j78J18m7K0N0j75J42P2j28N5P8j93O9j4R4j36M5Q5p4l7l3k1
5056C8Q2j08K9J45M2n5l9rj11J10Q6m7No7l6OJ33j83J61j18N4R8q7J3J17L3k04K28n8j56q1
4693B1J57j08M0p4M6l5M6R5j00K0L5p2j2k4jJ06k7l3P8J6k3N1q8j0o7J06n4P7j42J10O9j7
4317A86j08K78j07j54P7j41O7J15M6j39K8Lj5J2J98j52m5O5Q2k53M5M0J5p2L8o3O8l8P1p2
3965G5M2q0P7K3r4K9n0J49q9K8pm4K1O1P5m7k1k2N4NQj43L3J91r7m2J10NLj00K3J09j37p0
3566G8J8mj2pm9J88n8r6Q1R7j00K9p2N9k2j09O1k1M7J53j42k2n0OP3q3R4L5n7J19j44Nkj4
3167G9O7j10R0L3j3j27K5l2P9L0J26j31K4om0nm4J4J46j9r9P3j15J3R1o4L1O7r6K17j59r1
$$ plain form
5808 104 104 29 95 153 136 258 218 84 115 97 12 211 204 28 34 90 105 162 248 159 34 123 119 21 119 122 144 131 70 45 127 151 49 170
5409 170 181 136 150 207 39 100 347 246 68 186 139 159 209 34 176 248 120 175 253 60 129 115 209 73 118 203 129 92 59 38
5056 38 120 12 41 186 228 173 134 125 14 124 210 163 168 101 65 71 204 21 182 64 118 216 129 142 259 292 88 316 258 102 21
4693 21 178 70 110 36 82 47 93 188 88 108 143 71 59 35 34 140 113 80 158 174 151 202 114 104 37 143 89 166 24 134 203 186
4317 186 78 356 249 95 172 31 98 213 259 120 148 151 136 148 346 194 149 214 296 43 88 128 143 71 109 46 114 76 147 75
3965 75 117 37 114 137 43 72 22 171 82 110 103 59 80 141 216 169 148 126 180 185 193 50 83 274 177 135 245 250 253 153 176 285 148 78
3566 78 96 92 80 73 24 212 154 58 139 236 136 165 93 152 130 21 82 61 108 261 119 97 47 53 126 43 137 172 115 234 90 95 93 79
3167 79 146 36 126 159 146 19 44 12 91 121 247 116 140 134 94 89 45 59 205 186 87 160 45 58 149 85 116 183 87 304 145 54
2791E4P8l3R4j9l0r8N4lmLo3J33p1P6M6j35K3J3k6J2K7m6Mk5N4J83j03p1k8Om7J43j2j34J6
2380G1J52M0q1q7J31j17L5o2Q3K3M9j17k2J28j46J0l6K8N5M9j21M4n9qL1P5O6p0M2j6o9M4
2005A45r9J02Lpk0O4r2J6m6K7N6M3J12j14N7L8k03J64j76J22oj47P1K4L48k67j69J25m5N0
1653A76K1q7R4j53J9J20p4J30M6k62K02j7o5j8J83j11j28R6K6l8j07K9K3pm0j2j4N2j1N6K4
1289A53p0qK7J4J45p4l1j34J96j55N7oPJ5j11J50K1r5J3kl6mJ07Q1k06J16r4kO7R3K0J64l8
901C80j33p9J04o2j5j22O7J0n5R7k1qN5k4n8l1LQJ39j45J53j98M2n4L03k6k38J05k7O3M7M7
526C27J07J61J659K912p50l037r44K1m5j80l0K5M8k13K13j71M0p3O4J23k35J70q4J4q0K3K
209F7J56lr6J8j03J65j44k0OQ9n7OO0n5J31J5k7j4j20P2pj16P5J01L6q8P6j74J12j29NR2q2
$$ plain form
2791 54 132 99 193 174 144 46 100 97 93 96 33 166 95 171 217 82 105 118 92 104 131 85 89 64 118 301 198 127 99 105 58 201 189 55 71
2380 71 223 263 182 95 226 109 144 82 165 188 237 120 98 226 80 90 54 82 137 186 65 109 50 42 73 148 214 144 186 170 101 145
2005 145 46 148 151 144 124 188 96 112 66 93 149 192 304 190 247 285 82 246 70 192 186 39 110 134 482 215 46 171 126 176
1653 176 197 110 204 51 70 190 116 246 292 30 232 215 150 132 315 204 76 172 198 160 53 82 105 98 58 46 32 84 73 129 153
1289 153 83 75 102 116 261 187 156 22 218 63 120 114 121 136 25 175 196 101 114 112 76 72 179 260 54 170 76 74 141 234 254 418 380
901 380 247 168 272 210 195 73 140 150 95 192 171 163 218 194 136 105 108 116 255 110 263 65 107 53 356 330 92 197 170 233 280 327
526 327 434 595 2254 5166 4416 1379 435 456 411 231 201 226 274 61 274 103 143 70 134 257 22 192 108 122 42 65 67
209 67 223 220 124 142 39 204 60 40 46 135 78 84 144 89 220 235 208 194 74 146 139 23 98 199 235 147 223 49 161 32 37 129 47
-178D7q
-190C9
##PAGE=	F1=-13177.4
##FIRST=	25169.313707327481097,	5807.6787752999953227,	0
##DATA TABLE=	(F2++(Y..Y)), PROFILE
5808A05j2m8K2L0L0J26l9j31M3j0q2K17o5j25nR2LJ0O9p0j03J22j7j14O7Jl1M2p4%O3O7j25
5420E8N8K5j6mP1r0LJ98j08j51J25k8NO4j22Q9N0p4l3Q7j60Q4j2J05j66R4L0n1k1j9n1J03
5045A43j15nJ36l4J2m2P6j17P5N8j0Mj05lK7P2j27J26j45J24J21j58L4J03Qj22J61r6r9p8
4693B4J38j03M7p3J15m3M4P3j41L6L3o3j8m1L4M9l5k9J44k6o1M8q4pl1J05o8P4j17J00Q4R
4317B17j37K89j18j20L0j12J0J76k9j07J2K6j7P4J73k42m4J31P1k60R5qpj7K8m9P0j26J10
3977A19qQn7OP5o3m7J1P8o8N7k6l3L3L2P5j9m2j6O6J7J1j04rJ79j20m4J37k6k1r4P9O7j23
3578A30k6qK7m0qJ2J09m6p2L1Q1n0K3m8J9l4n0j4OP5J75j73j5r1L6J00q7R4L0l6R0j43OM6
3178A49q5P0j06P9Q4k9j31O2m1J9O4J54j08l0J0n7J9LJ3J16m8j03O7j50M9N3n1N4J00j32J63
$$ plain form
5808 105 93 45 67 97 127 253 214 83 126 116 34 251 186 61 56 148 151 161 230 160 57 179 162 48 115 116 85 127 53 53 116 183 58
5420 58 116 141 125 121 192 102 105 303 195 44 169 141 146 210 88 177 227 153 120 207 47 131 119 224 58 152 182 131 110 91 40 143
5045 143 28 23 159 125 137 95 171 54 129 187 177 181 76 73 100 172 45 171 26 150 271 113 147 250 258 136 297 201 102 24
4693 24 162 59 106 33 148 105 149 222 81 117 150 87 69 28 62 111 76 47 191 165 104 152 68 61 30 135 67 141 24 124 208 217
4317 217 80 369 251 131 161 49 59 235 206 99 111 137 120 194 367 125 81 212 283 23 118 110 103 86 114 65 135 9 119
3977 119 111 119 62 68 143 80 33 44 122 54 111 85 52 85 117 192 173 131 115 181 198 209 105 96 275 155 111 248 222 201 107 186 253 130
3578 130 104 96 123 83 75 87 196 150 78 109 190 140 163 115 134 100 50 36 42 117 292 119 104 13 49 149 62 156 186 150 240 97 103 149
3178 149 64 134 28 107 191 162 31 93 52 71 135 289 181 151 161 104 123 126 139 255 207 104 171 21 70 123 72 126 226 94 257
2815B57j47K1L6q1P7M4o6j18Q7Kl0M1j07J63n9O5K2j44K6L7o4M9P1q0l7m1J17J43j10K8n0
2451A52k2l5O8K0j00MJ63M5j09k6J64j81L2l3M1kP1j01n0J26j42qML3J4N6j02K8o5J5N5M0
2075A55R8p8J2j0o3K5j23J25J2l9k2J11p5j2j4o7R8M7P5r7P0N4j73J30j75R5Lj05Q8K0L20
1711D85k32j78J35p9J5Qo6Q3j05J8J09o2J19M6k76K22k9m5rJ60j15j61J58Jp0p7N3Pm8j2j4
1347D1K7NKM8L1o4mqL4J64r0k2j03J22j12K0M2K9m4p3J30K6j29k3L0j2l2J03P5r4O5n7n1Q1
948A57Q9l0J65Mj51j01J35j22l9K4M2k3pR6j30Q5qM7r7m8lK2J43j25J84k34O0j13L25j00k31
584A6J62L0N2oJ37O2K19J833L286q19l377j050q5%k00k6J6j0j65K06k13L8l2K1J69k34J14
268A44L7J1j09K2n1J85o2m7L1r8J54j92J5L1K8l8j3M2M0Q0L8Rr0j40J62q4n8J8J25P8n9Pj73
$$ plain form
2815 257 110 131 167 86 163 207 141 23 110 112 82 123 16 179 120 185 207 63 89 126 62 111 182 102 65 24 141 284 174 202 152
2451 152 130 95 163 183 83 87 250 295 186 160 324 143 175 142 183 181 252 151 101 227 85 77 81 114 128 184 82 110 45 60 115 155
2075 155 253 175 187 177 114 139 16 141 153 114 92 203 128 116 102 35 133 180 255 158 228 282 109 239 64 159 162 57 145 165 485
1711 485 253 75 210 131 146 154 88 171 66 84 193 131 250 296 20 242 213 168 159 319 204 43 201 202 132 55 108 115 67 55 41
1347 41 68 73 75 123 154 90 86 78 112 276 186 164 61 183 71 91 133 162 118 45 175 201 72 49 79 67 35 138 213 119 184 127 76 157
948 157 246 216 381 385 234 133 268 146 107 131 173 150 143 239 109 194 186 233 136 88 85 107 250 125 309 75 135 22 347 247 16
584 16 178 208 260 254 391 453 672 2505 5791 4972 1595 545 460 460 260 234 250 240 75 281 68 106 74 95 264 30 144
268 144 181 192 83 105 54 239 177 130 161 63 217 25 40 71 99 61 48 90 130 210 248 257 167 27 189 105 47 65 190 268 209 216 43
-120D3J23j12qR2p0k3
$$ plain form
-120 43 166 54 46 138 68 45
-190D5
##PAGE=	F1=-13279.6
##FIRST=	25169.313707327481097,	5807.6787752999953227,	0
##DATA TABLE=	(F2++(Y..Y)), PROFILE
5808I4j1j9k1QO4J16l2j25L6Ln5K11j43j5l7J28qn3O1l5r0J49l6j20L5Qn9O9j4j8J8R4j20
5420H3RJ3JqQ5l0k7J20j10j05R7%j1P1m0K6J7j8j05P8j09R8m2J11j76J50l9j7rJ1q4J08r7
5033E1PP5j15J86j52J37r3M0K8L5nj41P2JJn7Q2j24J54J35j97L2P6j9l2J20j60k1q1J07p1
4669G1M1o6J56l3K7M7j55K0M7n9J2n3K4Mo0M7J44p3j08N7p0K7pQ0m4K1l8M8Q2M0j49K82j10
4282B52q8k3o5QJ75q7j00K2K9k9J54J46k99n3J69N8k54J33rp1K6K7rL4q0L6M2k8j0p6J38m6
3906A22q5M3j1m6Q8l8j5K4MO7Lo0RR0J0J4n8l6J17j24k3J50n4l0p1Q7M4j24K8l9M1m8j3P6
3507A42N4m7o0%L1qL0kl3m4J2m7M5O2J67j61l7r2N0J02r3R6M2m3N7j21PQ1j17L8p8O2J03l9
3108A59j22R0j0l7P7J67j03m3Nq6N5N5%P7o8j05P6j44M4Jk1N9J41j45O3j02R8mj03N7P4q6
$$ plain form
5808 94 83 64 43 51 115 231 199 74 110 113 58 269 126 111 74 202 194 141 202 167 77 226 190 70 105 113 54 123 109 91 109 203 83
5420 83 92 105 106 98 183 153 126 246 136 31 128 128 117 188 148 174 191 173 68 146 37 135 93 204 28 178 139 122 113 124 40 148 51
5033 51 58 133 18 204 52 189 96 136 164 199 194 53 125 126 127 70 152 28 182 317 120 152 228 209 177 297 137 116 35 142 71
4669 71 112 46 202 169 196 243 88 108 155 96 108 55 79 83 23 70 214 141 33 90 20 47 40 120 76 97 59 107 189 229 80 362 252
4282 252 164 141 76 84 259 172 72 94 123 94 248 394 95 42 211 269 15 148 139 68 94 121 112 146 66 102 144 116 106 30 168 122
3906 122 37 80 69 23 111 73 58 82 86 153 156 96 105 195 205 219 161 125 242 118 95 245 191 161 90 177 221 97 125 86 127 79 66 142
3507 142 196 149 89 89 120 112 142 140 107 63 75 28 73 135 302 141 104 12 62 164 71 167 209 166 223 102 109 190 73 111 33 95 198 159
3108 159 37 127 117 80 157 324 221 178 183 97 152 207 207 284 216 111 187 43 87 88 67 126 267 122 185 83 181 177 74 131 205 119
2732A19p5Q4k0l8O8j32J84n5N7Nj56M7J3q3J25P7r8o5k6J15R4r3J22n3p5oRJ3o5J1J59L0j16
2345A76O0J81k34K7j0j7j1Q8q7q5J14j10rkN6k4P2o9J8p3K3P1NJ14q8plm1%j17J10J6n5j8
1946G1J41o7m7J7l1N7K3K5n1O1P1j27Q6j63O2K5q9J12lK76j63j74J24j13j2j4k4M4l3oQ9k
1570A65P1L4k24J76k6l5kJ38j18j71K03kj22k5O7P2n5o2k2M8l1rK6M0l8om4N4J76r1k6n5J7
1183A23k1mO4L0n1n5R3K5j28l6j1M9n2P2O2L3%k9p2P7Q0q2J53N2j64j19J54j76MJ16nm9N3
796A86J03j59R7p1R3j21m5k4M5J32q5J98k68N7j10K94j94pJ4R8K7m4J93M7K24J800L311q22
467D969l347j035j63L0j93k7K2o6j01J54j57m2L7j9K07k27O3J21J5j19nq0K00j15RM9r1J30
138B19j76K4J5j4Qm6jJ35K7M9L7j35k8J33j25k4p8J43J15k5n9j60J27j03k0J10o3k8
$$ plain form
2732 119 44 128 108 70 138 6 190 135 192 197 41 88 101 18 143 220 122 57 31 146 240 147 269 216 141 135 144 157 92 103 262 292 176
2345 176 236 417 183 210 200 183 172 260 173 88 202 92 83 81 137 113 185 116 134 61 84 155 160 274 186 179 176 135 135 18 128 144 89 71
1946 71 212 145 98 115 84 141 164 189 138 199 270 143 229 66 128 153 64 176 173 449 286 112 236 123 111 97 73 117 84 78 167 165
1570 165 236 270 46 222 196 161 159 297 179 8 211 209 87 62 129 201 146 84 62 110 79 70 96 136 98 92 48 102 278 187 161 106 123
1183 123 102 98 162 192 141 86 179 204 76 40 29 78 26 98 160 193 193 164 92 169 249 167 320 372 208 89 243 67 71 187 182 133 186
796 186 289 130 227 156 249 128 83 59 104 236 151 349 81 138 28 322 128 121 135 233 260 216 409 456 680 2480 5791 4969
467 4969 1622 587 424 454 261 234 256 190 89 243 86 44 81 62 269 42 105 226 241 122 117 37 237 122 131 180 89 219
138 219 43 67 82 68 76 30 29 164 191 240 277 142 114 247 122 98 20 163 278 253 194 34 161 58 38 148 85 57
-190E7
##PAGE=	F1=-13381.9
##FIRST=	25169.313707327481097,	5807.6787752999953227,	0
##DATA TABLE=	(F2++(Y..Y)), PROFILE
5808F9J5qm2L7N7O2j0j17K2Rj8J89k22J24p8J56j4j14O2Kr6J76o1j17K0J0k7K9O8m1l8J09
5432B13j09K1l5qJ0R5jm2M9j06j6KK9pN0N1l5j8L1j19L1l3Q5r8J12j39J87j12K8k1M0p0O3
5045A28n2K7J2l1J97k48J51o0J9OO7k0j59J29k6o1J3L1p4J55J44j89NL1m3N3J02k17M7q4P3
4681A26m2L8o8J73j9K1K0j38qO0p2N2q3L6k9l2Q8J01j23m6qk2L0%M2K3p7M3K1M6O5j44K59
4294C33p7p3o8k0L5J56r4j32K1K7m1K28J20k93l7J32L1k29J50K4j26L5K1jK4k1LL5n6L7p7
3930F7J35n5p0K6n7m2J07m0J0j3j2M8K1p4N4J15j2J1j3l9J6j05J3J47q0j2m3M7M2j32P6o0
3554G6K2m2LJ21J8n1o4J0%l7N3M7p3m9O2j4K0N2J35j22p3q1O5R2r9R7N3o6K8q4J1R7j21mm2
3143D0N4R1m9r1J01K4o3O0J66j00k4j9j19J12R0k4M1p7j02R8j14Rm4J6L2J82j39m1oJ00m4
$$ plain form
5808 69 84 76 34 71 128 190 180 63 85 94 76 265 43 167 89 245 231 117 179 181 85 261 200 83 103 113 86 115 183 142 104 213
5432 213 104 125 90 82 92 187 186 144 193 87 71 73 102 95 145 196 161 143 174 55 86 53 138 40 152 13 200 88 116 95 135 65 128
5045 128 76 103 115 84 281 33 184 124 143 149 216 196 37 166 140 79 92 123 49 204 348 159 164 195 152 205 307 90 137 53 126
4681 126 84 122 54 227 208 229 249 111 103 163 91 143 60 96 67 35 123 224 101 55 47 25 55 55 97 120 43 86 107 153 218 74 333
4294 333 256 183 115 95 130 286 192 60 81 108 67 295 415 122 85 217 248 19 169 193 67 102 123 122 146 125 128 163 107 144 67
3930 67 202 147 77 103 46 4 111 71 81 68 56 104 125 51 105 220 208 219 206 167 183 78 91 238 158 146 103 150 192 60 136 76
3554 76 98 56 59 180 198 147 83 93 93 56 109 156 83 34 96 82 102 154 289 167 94 13 78 170 71 168 221 155 183 99 110 207 86 82 40
3143 40 94 185 136 45 146 170 107 167 333 233 209 190 71 183 273 249 290 213 111 209 95 104 60 76 108 290 151 110 104 204 160
2779A60r8L7P3r3j2Q3n8l9Q5j09J76p5O0Nj87R2m6KJ18O2r3p1pP0M7o6J96l1j50L1ol7m0L0
2380A09J51nj01J46J85k65J8J0p9qR0p1j18R5n6mm1Q7m8R4k8jp7J2Q1j3J02r4j4Rnl7j05R0
1981A09J7n5j5J48n6q2M1K4K0pqJ7J5Q1p1M6j61M9M9r3J29l4K15q2j65J06j38k1l9L1LL0l6
1594F7O3O3J3J9j55J08j5l0OJ19j22j04J73J5j82L0O8J29o4j06k1N8n3j9qO6j3pp5O8J72p5
1218A88m0Mj06Q0MP0Ok3o7P1J9j05Rl5K5l5PM0J34m0l1m3N1N5j22J30J00j73j31J58j65J31
843A66N9n4p2J20J06j22M8j35J08j18no5P6J11m4J95k73J6o0K30k69K06j34J52j1m4J86N9
514D32J78J575K978p49k960q97k08N2j69l3M1j05l4N5k8n2J1QJ65k03K2J52K8j12m3p6J94
197B22j42L6P5r0J15j24Kj1m2N2k6j9J31nL9N3j45N5J04j22j1p9P2J17J6j09j40J24j02l1
$$ plain form
2779 160 62 99 172 79 67 150 92 53 138 29 205 130 190 195 8 100 54 56 174 236 143 72 65 135 182 116 312 281 131 162 156 119 79 109
2380 109 260 255 154 300 485 220 238 248 169 161 251 180 62 157 101 97 56 143 95 189 161 160 83 95 176 163 265 171 157 166 161 124 19 109
1981 109 126 71 56 204 148 66 107 131 151 144 136 153 168 249 178 224 63 112 161 68 197 163 378 296 131 237 99 78 39 70 73 103 67
1594 67 130 193 206 225 70 178 163 133 139 258 136 32 205 220 38 68 136 265 201 95 74 132 79 60 52 118 105 98 23 91 263 188
1218 188 148 152 46 126 130 200 206 183 116 187 206 101 110 75 100 65 72 112 246 206 175 132 183 238 116 246 346 173 42 200 35 166
843 166 225 171 99 219 325 203 251 116 224 106 101 36 112 223 179 374 101 117 57 287 18 224 90 242 231 187 373 432
514 432 610 2185 5163 4414 1454 557 349 401 232 199 240 135 101 156 128 76 87 95 260 57 79 231 259 147 104 28 222
197 222 80 116 191 101 216 92 94 83 41 93 67 48 179 174 213 266 121 176 280 158 147 68 140 257 273 164 24 148 46 15
-155A5J36o2k7
$$ plain form
-155 15 151 89 62
-190F2
##PAGE=	F1=-13484.2
##FIRST=	25169.313707327481097,	5807.6787752999953227,	0
##DATA TABLE=	(F2++(Y..Y)), PROFILE
5808D8N0k1l4P2N5l6L1j14K5LMJ59j91J69j20J68j2j50N9K5j07J95q5j12L8lK1l7J45n3r2
5444A00J17r8N4p0m3L4J11Jn4Mr0O4r7M2M3k5J21p9m2O1q4qJ4O1j07N0k0J59j68P7p0O0ok5
5045H7J3M5k0L9J58k77J20k3Pj0P5l2j47J55m4j09P1k1j6J41J47j50k9k6n6J23R1k31O6o7
4693H0L3k7M5o8J63j0L1kj04j3N7j10R1j11O9n8J5Q6N0j69R4p3pJ4mnJ04j53Q2L2k2P4j23
4305F1K27k8q0r1JO6J57p9j52k0L3m6K75R3k65k0R9j8j86J46O7j38J5J6m5N7J7Kko6O7k8R5
3918B30p8m1jm0m1Q5l5L6o6k1K8L1o8J00J30m1nK9k9q9o9M7J34r7K4j3k6M8j35J06n6l4lK6
3519F6J29rm1p1L9N2j40N9P2q1l0O9J5k4N8R8p9j09p1R7P3j04Q7N7q9Pm3K2Q8j10l5j1O1O0
3120A62n9l2Q3M9q6L6J58r0On1j28J71R4n1J5p6r1J18q8k5o9M9k9K18j14q8O9N3q0p4J8N3
$$ plain form
5808 48 98 77 43 115 170 134 165 51 76 79 83 242 51 220 100 268 256 106 165 190 83 278 193 81 119 116 137 100 245 192 100
5444 100 217 119 173 103 60 94 205 206 152 156 66 130 33 75 118 93 214 135 93 154 70 62 76 137 30 80 60 219 51 128 58 118 112 87
5045 87 100 145 125 164 322 45 165 142 149 139 214 182 35 190 146 37 108 87 71 212 359 209 180 154 98 221 312 81 147 80
4693 80 113 86 131 63 226 216 247 245 141 128 185 75 166 55 124 66 81 167 217 48 142 69 62 76 72 67 171 18 100 132 110 184 61
4305 61 288 260 180 89 90 156 313 234 82 62 95 49 324 417 152 132 231 213 27 173 240 102 117 133 88 145 162 164 162 96 163 135 230
3918 230 152 111 110 70 29 114 79 115 49 28 56 87 19 119 249 208 203 232 203 114 45 92 226 129 153 140 114 162 27 133 77 43 40 66
3519 66 195 186 145 74 113 165 25 84 156 75 45 114 129 105 163 261 182 73 2 99 172 68 155 212 123 130 87 109 197 87 52 41 102 162
3120 162 103 71 154 203 117 153 311 221 227 176 48 219 313 262 277 201 110 228 140 115 46 95 66 284 170 82 151 204 124 50 68 121
2744A21p5L0R8r7l9Q8p1J69j05O0J9j47P6q6Q2O2M3o7n9mK0Om6K50Mk30P6Lj04l0N3J45n1
2357A94o5K08J78k71QK7j30nP6n2j38P8Jkp8R6l8J05J7l7o8j6Q4qN4q0k1K9L7q5q6P6J2m5
1958E5pJ28l7j05M7O9pk1jO6m6P7j2J8j75O1O7r4J24m8J32j6j49Q5j46nnK6L0Qm6K8R1k6R
1547A75r2L6Kk7J7J03j27j4J16M5j83K2N3J53o7j34j1O8o9j2m1J06j0qr5Q2J41m6m5N2j52
1183C8R2K4Q6l5J6q7N9Qr4M8mj7l5j1jJ76m0n8K2J3J3j40R8J44j80j18J31m8J69k4q4j04J84
796B41R5p6kj88Q9r0N4o7P6Q1j9J83k32o5KJ67j37J87j91J33n4OJ00Q6R8J213K367o10k313
455A134o63k26P1j32m7O4j15L2p3J20Oq1O6P3j51j3J31N0q5p0n0J62j20LJ04r3J14p2k2l8
103G9n9P1NPP5j3LN6j16R3P3r5J4m5oO4O2j38j08J12j04j1J19n8k4
$$ plain form
2744 121 46 76 174 77 38 126 55 224 119 179 198 51 127 41 123 185 228 161 102 98 118 124 78 328 332 102 178 181 77 47 100 245 194
2357 194 129 337 515 244 252 279 149 144 220 168 30 108 109 107 29 125 87 192 209 172 104 88 172 164 218 138 117 146 183 98 12 88 100 55
1958 55 48 176 139 34 81 150 143 122 121 187 141 218 206 224 49 110 177 83 207 159 291 275 126 211 65 60 55 81 111 119 73 101 192 166 175
1547 175 83 119 121 94 111 214 87 73 189 234 51 73 126 279 212 78 67 135 66 54 13 119 109 101 6 88 229 183 138 190 38
1183 38 130 154 240 205 221 134 193 201 107 155 151 134 99 88 87 263 223 165 187 200 213 73 171 315 135 17 148 100 269 245 161 57 241
796 241 336 260 258 70 159 69 123 56 132 213 194 377 145 80 82 249 112 299 108 241 187 193 293 379 477 1690 4057 3447 1134
455 1134 471 245 316 184 137 201 86 118 45 165 171 90 156 229 78 65 196 246 161 91 41 203 83 86 190 97 211 139 117 79
103 79 20 91 96 103 178 165 168 224 108 201 274 179 193 148 142 206 268 130 22 134 30 19 138 80 56
-190E6
##PAGE=	F1=-13586.4
##FIRST=	25169.313707327481097,	5807.6787752999953227,	0
##DATA TABLE=	(F2++(Y..Y)), PROFILE
5808E7N9m9j6R3P2j35Q4j13L3Nj4J31r2J46j57J62mj44K9L3r9J92r5j16Q1j6N6j06K07n6j37
5444I1J25q6P7q7p5M4J42j3o9j1o3J15j29NJ04r0J16r8m8O8m8J1NM4l1q9R1J30j74J04j44
5080A7O4Q0j29Q4O2j7N3J01k62Q5J6Jk3N7l6j06J53n3j35J07n8L6J11J37r8o0q1m3J64P2k10
4716H9M8k2k0j1M9n5J31j3N2j4o6NM5j61J18j24J03q5L8Q1Qj73J92j14j4J4j6n3J83j34J7
4352I8O4q8O1r0J89K1j00q9j0J00J73p0j26m4Km8K82O6k28pR2q3j27J18J08j24nL7j44J30
4000A58J4Ol4n1O6M6L9j04j2k2j9k6N6k6N7j14l2K6K4%R2J27o6l7O7k1j61l0O4J23r9N5L3
3613A99j13M6j20J06l0m9N3qJ04l2j3n9N1J12j48mM3n7%M9K8p5P2P5m6j34k2R3M9j02O2N3
3237A83r8j0rM3N6r0n0QP8K6o5L4N2O0j20J5J53p4L1q2p1J86O4o8Lp1p3J27p2m9q2R0j22K42
$$ plain form
5808 57 116 67 51 144 216 81 165 52 85 90 76 207 115 261 104 266 262 118 147 180 81 273 178 62 143 127 183 77 284 228 91
5444 91 216 130 207 120 45 89 231 218 149 138 75 190 61 66 170 80 196 98 50 118 70 81 86 130 99 10 101 231 57 161 17
5080 17 81 161 32 116 178 161 214 315 53 138 154 155 132 189 153 47 200 147 12 119 61 97 208 345 247 187 106 63 227 299 89
4716 89 137 115 95 84 133 78 209 196 248 234 168 173 218 57 175 51 154 69 107 188 196 23 215 101 87 101 85 32 215 81 98
4352 98 162 74 135 45 234 255 155 66 56 156 329 259 133 89 91 43 325 391 163 156 248 165 38 156 264 140 135 172 28 158
4000 158 172 178 144 93 159 205 244 140 128 106 87 61 117 91 148 34 2 28 52 52 144 271 205 168 235 214 53 23 87 210 111 166 199
3613 199 86 132 12 118 88 39 92 84 188 156 143 84 135 247 99 95 138 81 81 130 158 83 155 230 184 50 28 121 170 68 130 183
3237 183 85 75 66 109 165 75 25 33 111 137 72 106 158 218 98 113 266 192 223 141 70 256 320 252 255 184 111 238 166 117 35 125 3 245
2838B45o8o1P5jj04m7OL3%%J20j28k6O6l2J67j15K6M0q3M3o8Q9j0L1k5l9lj3l8l6K73M2k80
2439G9J15Mj53l4O5J46r9j4K29J63k51mM7j64j3N8l6j23O9L2pm2J8J6Q7O6q8l8n0P6J0k8k8
2052A08m3N4P2j33j9K9Ll2J2P7mj01K8Q8k6j3K9Q6r0N3M1Kj84Q3P7q3R0k5K8J7j28P1j22L0
1653G5L4rQ1n8k5rO1l2K0m8k8J6j7K6Q8j27O0O7O5j41k2K7J38o3j42J6P6q5J6j2Q7k3j2p4
1254B6P2P7oj6O0j05J2L3J19q5N9j03N1j2j01Q3N2m0n8K0m2J42mq1R5k6m6j32O3J78j86m3
878E6M0M9K02r0q2j60K32P3l9l7j81Nm8J13l4O3M9k9J74j58j48N0J16l9J58j56O2p8P5l8J00
514C00J1Q03J613m29j558l78k32R0q4p3Q3r4Q8l8Q4O9j61J12l0p0l8P0P2m0n8n6J33p8n3J21
162A79r9J17k2m2n9l8L2L4M2K5j4m7N0n8Q4M2n0O6j0o5k9J05j52n9R2r5K2N7m3k4
$$ plain form
2838 245 177 116 191 190 86 39 45 78 78 78 198 70 44 110 78 245 130 156 196 113 156 88 177 167 198 173 134 131 118 80 44 317 359 79
2439 79 194 198 45 11 76 222 123 109 338 501 250 246 293 129 116 174 138 15 84 116 109 67 85 101 188 254 166 128 78 154 164 136 108
2052 108 65 119 191 58 39 68 71 39 51 128 124 23 51 139 113 100 129 215 125 178 219 221 37 120 197 114 204 179 207 224 96 167 45 75
1653 75 109 100 181 123 98 89 150 118 138 90 62 78 61 87 175 48 108 175 240 99 77 104 242 179 37 53 129 44 60 48 135 112 100 26
1254 26 98 175 169 153 213 108 120 153 272 187 246 143 194 182 81 164 216 176 118 138 96 238 234 153 248 222 176 44 107 285 99 56
878 56 96 145 347 257 175 15 247 320 281 244 63 68 20 133 99 162 211 182 356 198 50 100 216 177 335 179 241 163 238 200 300
514 300 311 1114 2727 2298 740 362 130 220 136 63 146 52 140 102 186 255 94 206 176 106 68 138 210 170 112 56 189 111 58 179
162 179 80 197 175 133 74 36 68 102 144 169 155 108 158 100 184 226 176 242 232 167 138 243 91 32 124 29 51 108 65 41
-190D1
##PAGE=	F1=-13688.7
##FIRST=	25169.313707327481097,	5807.6787752999953227,	0
##DATA TABLE=	(F2++(Y..Y)), PROFILE
5808G9M9p5lJ01R2j72J09r1mL5o9J15k0J38j85J40Pj10k5L1m7J52q0j41J40j6O8j67K45n8
5456B38j62J34p0P9j02q0L7J77l3p5j0k5J34j42j6J34r2J9q5l7N4k5M5k0L5M3q8N8J02j46
5103H1J15j62K0J45j77J01P4OK4L5k16O0N6Jl5J7k0o3J36n0j37J10m8O3O6J01m8p6j24K1J52
4740B28M1j81J8M5q9L9K7k8Q6k8P7j1l5K8L0k01J25j25J23r9L7P7j8r1J85j44j7K4l8o7K25
4376B43r8n8Q9j24K9m8J50N2j22n1k9J02J93p8n4k8o7o5K63M1j76j1J07j48o1O9J40r3j3Q9
4024B43j53J02l7Lm2pK3J31k1j26J2k6k2K2J0j3P1j39RlLN4P3J12q3p5R8k8j75LN5J15p4N9
3624A74R0j78J9q1P3JPO2o7O1m7K8k9M2J48j41l6j6k4L0L1J8j14Q0P9k9j34K1O9K5q8K1M6
3237A41r0k1J4O4J3o2n6J4R3jn2P7L2N5j68NJ48m9L5j01K1J72J4o4jo8n4J25p0n8r4J54q2
$$ plain form
5808 79 128 53 50 151 243 71 180 89 85 120 51 166 146 284 99 239 246 136 111 142 95 247 167 26 166 150 218 51 296 238
5456 238 76 210 140 219 117 37 74 251 218 143 133 108 242 100 84 218 126 145 60 23 77 52 97 77 112 155 67 125 227 81
5103 81 196 34 54 199 22 123 197 203 227 262 46 106 162 163 128 145 125 62 198 148 11 121 73 136 202 303 255 179 55 76 228
4740 228 269 88 106 151 62 101 128 100 186 158 235 224 189 217 247 46 171 46 169 70 107 184 166 75 260 116 99 123 85 18 243
4376 243 145 87 176 52 81 33 183 235 113 62 33 135 328 250 196 168 101 36 299 340 164 153 260 112 51 120 260 167 154 243
4024 243 90 192 155 158 116 109 132 263 242 116 128 102 80 102 112 99 170 31 40 37 40 94 167 279 196 121 219 191 16 19 74 189 115 174
3624 174 264 86 105 24 97 98 105 167 100 161 114 142 113 155 303 162 126 110 86 116 147 165 51 131 210 181 47 68 137 162 74 95 141
3237 141 51 30 44 108 121 59 3 17 110 109 57 134 166 221 53 58 206 157 192 91 112 284 298 234 233 165 111 236 166 108 14 168 86
2850H6Q9Ll2O5l8j08l6QM7M5m1J29j52LL3qJ68r7m6O6j4Lm9Q5q7K8K3j4Nj8q7qK35O8k48J12
2427B18k2j66K0j2J55j37M4K05J45k14j2O6j75l8N2l8n9P0J8j5J0p8R3M5J12j43J4n9N3K1
2075A73j37P6q1N8R2j43M7l7pnK6OM3p2j1P4m1K3M7R6r8MP7lj47Q4P2o0L1K5p0J5j08O7m1
1664G5K9M5k6J08j21J7m7pmN2k2n5RJ0J1P1j06R1M1O2r6n2JQ0n1r3M5N7j01M1J2P3l2k5l1
1254F1N8JK0N9J6n6m0QJ61j32J00j07L9m1j05R8J23m7r8P4o5N5M4p0J45n8j10q9J7K02j91
890G2K7m4R8K34j26n9j74K09M5j6n4j09p1LQ9J1N8L0q3J75p5j81N4P6lJ41q1No6J14j31L9
514B07n9M32Q79k39q56j01k29R7k1j00Q0n6J25L9j1J21k13J38j17K1m3j3Q4J0j9r8J24m6p8
174E8J01r3J01K7n1p4Lm2N4Q9j2l1r0L9J6M0J3QJ40J2j15q7J01j61JP3p7L6j3ql7
$$ plain form
2850 86 175 178 146 211 173 65 29 37 84 129 88 217 65 68 101 93 261 164 118 184 170 173 124 209 122 150 173 159 164 146 59 51 286 354 106 218
2427 218 196 30 50 38 193 56 100 305 450 236 224 290 115 77 129 91 32 102 120 105 115 37 130 175 287 144 158 99 152 173
2075 173 36 112 31 89 181 38 85 48 41 36 62 68 111 39 28 102 61 84 131 227 129 133 210 207 60 144 216 156 187 212 142 157 49 116 75
1664 75 104 149 123 231 110 127 80 73 69 121 99 44 53 63 74 145 39 130 171 233 137 85 86 166 115 22 67 124 23 64 76 149 117 92 61
1254 61 119 120 140 199 215 159 119 127 288 156 256 149 188 147 42 140 263 216 118 192 127 182 226 156 301 243 133 44 61 263 72
890 72 99 55 153 387 261 202 28 237 282 266 212 103 32 35 124 135 193 223 140 315 240 59 113 189 186 327 246 251 185 299 168 207
514 207 148 580 1459 1220 364 263 34 131 110 10 90 34 159 198 187 308 95 233 116 137 94 81 165 175 156 58 182 136 58
174 58 159 66 167 194 143 69 72 30 84 173 161 130 40 79 95 135 148 156 296 308 193 106 207 46 47 120 43 79 66 58 21
-190B1
##PAGE=	F1=-13790.9
##FIRST=	25169.313707327481097,	5807.6787752999953227,	0
##DATA TABLE=	(F2++(Y..Y)), PROFILE
5808H7M1q2qR7J03j36R9n3p9P6j31J14RJ47j97J05J6o5q9L7M0P7l7j41J58oN7k01K49o7j66
5444E4J46m6N4j16n1QK03n3o6lK6J20j45j8J31p0j00m3j6L4j3O0k6J0J06o8PP6j03J18j64
5080E2J8J47j53N6Q0K9k8k1j48L8R3Mm5k6K6m9J12l4j39J01pP9J6L1oo9j28R1J05Mj51rJ10
4693A79j66J28k4RL8n0R6LqM3J1k08J05j18J20q4J2P3k4j4J49j62j2M2o6k0K00m8j28R2j21
4329D7Lj6J16N0j36K6J9LJ94r4M2mj32r0K21K4j00m8J31j79j5J6J50n2mJ53j44N3j14ok5N3
3953A42m6K05o8j48L0j6m5R0m8OP5j36M2l4J4P1M8Q2q5r6J07n2j10J2J7J05k6L5J44k10k2
3589H3m8M4K1N5P9j26J3m9O9KK7J49j19m7o9kO3J9j0j11N5J05j7j15M2K6Jn8k7M3p4qJ6P3
3190A05k6k4k8j0P4k1k1R6L6L5k09K9J07j6J5j01J05J48m1l5Oq3l2J12q1n0o2J90l9r1R3l4
$$ plain form
5808 87 128 46 38 135 238 102 201 148 69 145 14 128 137 284 87 192 208 143 54 91 131 208 171 30 188 182 239 38 287 220 54
5444 54 200 154 208 92 41 49 252 199 133 130 156 276 131 113 244 174 74 31 15 49 36 96 70 80 186 118 125 201 98 216 52
5080 52 70 217 64 120 200 229 201 180 32 70 163 167 122 96 122 73 185 151 12 113 106 185 201 232 226 157 29 120 225 229 78 69 179
4693 179 13 141 117 126 164 114 210 213 205 248 259 51 156 38 158 74 86 159 135 121 270 108 96 138 72 52 252 204 76 168 47
4329 47 50 34 150 200 64 90 109 112 306 212 254 250 118 28 249 273 173 125 256 77 62 78 228 176 172 325 181 234 120 114 89 142
3953 142 96 301 233 85 115 99 54 144 96 102 177 41 83 49 63 134 182 264 179 83 190 138 28 40 57 162 136 171 315 105 83
3589 83 35 79 100 155 234 108 121 72 141 143 170 319 200 153 84 82 145 164 154 43 98 203 186 71 113 139 140 82 55 98 24 16 32 105
3190 105 79 55 27 17 91 70 49 145 181 216 7 36 143 127 142 41 146 294 253 218 224 141 109 221 140 90 28 218 179 88 181 147
2815A47O1n5r3m2K8P4M8n8J15j67L3J9j3J66o6j24R0M7m3l0Q2j51K4O8J4K4j3j36L3J61P2
2451C15j53Q5p3j48P7r4J50j43Q6J56J19j72j1Q4j74p0P7p1lQ9kk5M8q8J01oJ51j91Q0m5K9
2087A78J2j01N6p1j4R8p4N3j10nL5J8n0Q6m4m4K3m0P1M4J03p4n6Q5lq2Q2N5l5l5O7j36ko0
1688C0L9M6RM0k2J05j72P8p9m4mR3km5j3K9k0N5q0R5L9L1n1o1nj2m2L0M0J8j15M4K9O7k1m3
1265H6J2M4k6k0J53n6rm1n0J91j68J38r8J4o3j7QJ93m9j43J35p1m6P6k0J64p9j70j2l9K13
901B50j96Q4j05R2K55j27l6j62J58K1pn6l4k5k5J1N6N7M0j75J87qj72M0M2k0J37Mk1l4J22
538C53j25j10p5J47K89n5l19Q4j25jM1m8J4m3J35Q1p5J54k32J47j57Q7l6o4N7M8K5j55J38
197A80k3r3O9n4L9P5m8q0M2q3K6J48m1p4k8l1P0k8oP2K19J6j54n7J2j63N9O0o4L8o1L8p0
$$ plain form
2815 147 208 153 60 18 46 120 168 110 225 58 91 110 97 263 197 73 163 210 167 137 219 68 92 160 174 198 185 49 82 243 315
2451 315 162 247 174 26 103 9 159 16 102 258 377 205 194 278 104 34 111 40 37 126 124 99 147 59 160 154 305 114 194 149 178
2087 178 190 89 145 74 60 158 84 137 27 22 57 75 25 111 67 23 46 6 77 121 224 150 94 179 176 94 176 231 196 161 228 92 90 30
1688 30 69 115 124 164 142 247 75 153 74 30 26 119 117 72 59 88 68 123 43 138 177 208 157 96 91 79 37 67 107 125 10 54 83 150 129 86
1265 86 98 142 116 96 249 193 184 143 93 284 116 254 156 170 107 90 98 291 242 99 234 163 117 193 173 337 258 88 76 37 250
901 250 54 138 33 125 380 253 217 55 213 234 227 171 137 112 87 98 154 211 251 76 263 255 83 123 165 145 282 286 265 231 353
538 353 228 118 43 190 479 424 105 189 64 63 104 56 70 27 162 243 168 322 90 237 80 167 131 67 124 172 197 42 180
197 180 157 64 133 79 118 193 145 65 107 24 50 198 157 83 55 24 94 66 60 132 351 367 213 156 168 5 64 124 60 98 37 75 5
-190E
##PAGE=	F1=-13893.2
##FIRST=	25169.313707327481097,	5807.6787752999953227,	0
##DATA TABLE=	(F2++(Y..Y)), PROFILE
5808G4L8n1l4P4J01p3R0rj42Q6j07M9mJ67j89O8J8j9j19Q9P6rJ5j03J19J4K7j90K11r2j46
5444B9J54j3Rj10j1l3K03p4m5RQ4Q6j35j1J01m6j71j0oM6LK4J7o5J56m4m7N1m4J06j64M9J14
5056B12j25K3P6M0q4n3p1J4J23Nn4m8Q3o6R1qj15M8M6J03l4o5L0m3n1R3M9l3j18kJ21j37J33
4669A83p5M2po3R8K1J8M5j4j73N7r5Q1k7k9O1j7M6R3j65jO6r4L4J53J7j78O4p1Ll0R8J3j28
4270B6J12N8r1J67j07J22J7j74j00J57J5oj17J51j38k2mJ06j0K2K13j47J4j88oMJ05r0K27
3930C16q5j81M9j2k8J15j05K8P0j10O5p6M8P0J8M6p4p3P4q2k0J5l0R3K9mJ77k13n3k6K9K6
3554I6P9J02j73k9l3R8K7J5J15r3l8q9pR4J4m8p4MJ40Jj05O0l5j6j3p6N1m3J3J2N0l3%j6l
3143D7J1m0J5J08N6Pj47K6NK2j7n7J27J18q2OK7j24MQ3r9k7JJ92jk32J58o4O3n8p8k9M2Q8
$$ plain form
5808 74 112 61 27 101 202 129 219 210 68 154 47 96 92 259 70 138 156 137 18 107 183 174 189 86 205 219 246 56 267 175 29
5444 29 183 170 179 69 58 25 228 154 109 118 202 288 153 142 243 197 26 16 10 56 59 83 100 35 191 147 100 151 107 213 49 98 212
5056 212 87 110 186 226 142 89 18 32 155 160 106 58 141 75 166 158 43 91 137 240 206 141 171 128 77 170 219 186 68 66 187 50 183
4669 183 108 150 143 80 178 199 217 262 248 75 132 37 118 91 62 123 106 152 245 80 79 145 51 85 238 255 77 141 70 73 43 141 154 26
4270 26 138 196 105 272 165 287 304 130 30 187 202 196 79 230 92 70 66 172 162 184 397 250 264 76 70 74 179 89 316
3930 316 231 50 99 87 59 174 69 97 167 57 122 46 94 164 182 228 154 81 155 73 53 68 38 131 160 156 333 120 67 41 70 96
3554 96 175 277 104 75 42 140 167 182 297 204 166 77 70 164 178 130 56 60 200 201 96 156 121 105 92 16 67 24 37 49 99 66 66 50 47
3143 47 58 18 33 141 197 204 57 83 88 110 93 36 163 281 199 205 232 108 112 195 96 69 70 262 261 29 187 123 186 128 50 21 63 151
2744A51L8n9Q5j60N0K8m1J53l6j62J00Q1r1pQ9j49l6R9M4N5j8j80P1R0N4l9N5j23j06J19r5
2380F0O0r5Q8J15P9j43OR2j71m5P8o9k0R8ml7O4l3N9n1J71k16J41k9PKk2jo0r0J02KM5j51
1981C2J9L3Kk0N9j8o9KK8J3K9J03l4j00N5Kk1Q8L6j5r4Q2j66ML7n7J11j6K8%P7k08J51p6K1
1570A18q8R0J9m4j8L7n4M3p0R7O1k0j3n5Qm8k4N7M5j4j18K0M1P2Oo1L9L3K2j37K34j32L9j1
1171A74q1J70j87J69p8k6n4Q2j02K36n6j82J90n7j07M6N3J57r2j99O4q4K09j98J26j48M6K56
843C27j05j8j35J09Rrm4J5J0l0o2R0M6P5k27J58L1j48L8Ro8J42P7j6pJ21r0k36L7jK2O8l9
455A49j8l2p8P4j8K0o3J08Q4r6J65k13J43j31R6k0q3JP1O2k09J68lj26N3Nm0J04l2p7O9o1
80G2n4K05o1j40J04m0J1q3L0P0K82%j67mr4p1K5N2o1L4n3M7p4
$$ plain form
2744 151 189 130 215 55 105 133 92 245 209 47 147 228 137 130 219 70 34 133 177 232 214 34 105 195 249 210 265 142 36 155 60
2380 60 120 25 113 228 307 164 170 262 91 46 124 55 35 133 129 92 156 123 182 131 302 86 227 198 205 207 185 184 124 34 136 138 183 32
1981 32 51 84 86 66 125 107 38 40 68 81 110 213 179 79 134 136 115 203 239 224 130 212 46 50 87 30 141 125 153 153 230 22 173 97 118
1570 118 30 120 139 95 77 114 60 103 33 130 191 171 158 103 111 63 39 96 141 127 9 29 70 142 148 87 126 159 181 44 278 146 185 174
1171 174 93 263 76 245 167 141 87 169 67 303 247 65 255 198 91 137 190 347 255 56 120 36 245 47 173 25 71 327
843 327 222 204 69 178 187 178 134 149 159 129 67 157 203 278 51 209 240 92 130 139 71 213 290 274 267 388 298 62 99 98 120 188 149
455 149 131 99 21 95 77 97 34 142 226 130 295 82 225 94 190 170 87 88 159 221 12 180 177 51 104 109 69 173 141 64 133 72
80 72 18 223 162 22 126 86 97 14 44 114 396 396 229 225 131 60 85 137 76 110 57 104 30
-190C0
##PAGE=	F1=-13995.4
##FIRST=	25169.313707327481097,	5807.6787752999953227,	0
##DATA TABLE=	(F2++(Y..Y)), PROFILE
5808D4M0Jn1K2R0pQ6L6j60L8l8l3m5J88j54M7QJ0l1J06N1q0M3p0P1L6qj59J65j32j00J44K5
5420A83m5l7k3l5J45r7k4K3J36M7j08LN6l4j26n3J1O2J3k3P6j25J51j6j00K6K3P3j13N6O4
5056A89r6LO0L2j25l1j8K0J03%n8l0J09q8P4K6p9l9J10J31p4j73Q0k9L8Q3j2o6p8L2P7m9R0
4669B12j06O6m8o3Q1L7N1L0m4j02qn8J0O8o0K2j3R1K9j56J7R1j06P3R1Q8k01J1J4%n6R0m5
4282A06o4J47P8j54J24j07J53L2j88q7Q4J8P4j83J47m7n9K7KK1O1K59j65j2k28K9NJ37q2J83
3930C11o3k35Q3l5M9P4j48N0N7o8P4j14Q5N6qRn5k8K8n8K0J3p9Q5P3m1J77j87p3pL1J8P1J21
3531B86k02n3oJ10N0QN0o4rp7l3J11J5q0n4l0J66L0j08P9j08lL1r3M5rQJ9J3pqj1J5o2K0m
3108C5R0Q4k9r6M3m6L0m3pJ04Q6r9L8O3j87O5L1r7%M5J76K9k18R6r8N7n8o0J9K8Q4L1o0M7
$$ plain form
5808 44 84 85 34 56 146 139 225 261 101 139 101 68 23 211 57 104 112 122 91 197 248 168 211 141 212 248 240 81 246 114 14 158 183
5420 183 138 101 78 43 188 91 67 90 226 273 165 168 224 190 64 11 22 84 97 74 150 25 176 160 60 86 109 182 69 125 189
5056 189 93 96 156 188 63 32 14 34 137 137 79 49 158 70 144 170 91 52 162 293 219 46 126 97 135 218 206 140 62 94 171 122 212
4669 212 106 172 124 61 142 179 230 260 216 114 106 48 58 126 66 88 75 166 195 39 56 147 41 114 205 293 92 103 117 117 61 151 106
4282 106 42 189 267 113 237 130 283 315 127 40 124 142 216 33 180 133 74 101 103 124 185 444 279 267 39 68 73 210 128 311
3930 311 248 13 96 61 110 184 36 86 143 75 149 35 120 176 168 177 122 94 122 64 84 97 18 103 176 135 312 125 52 45 76 94 165 286
3531 286 84 31 25 135 185 193 243 179 170 93 60 171 186 106 52 22 188 218 110 189 81 78 109 16 61 52 60 79 92 85 77 66 81 19 39 35
3108 35 125 209 180 84 127 81 111 68 61 165 251 152 190 253 66 131 162 65 65 110 286 315 97 193 95 152 94 34 53 81 165 196 136 183
2709A83j23N0M5p4J21j4j10P3P2j37L5J02r8q3N4P3R1l6k09J02K9K6O2K6j43n8J44r2l2n4
2357B5J01J06L5j49M3Q8j76K4M6k9m9N5J5n4O4L7J1q3J69k14J81k3j8QL5l6m9j49J14M8M1
1993B17j44K3J0j4J4L8Or0M5K0l0J8Q7Mj08j0K0NR9K5mj31O2j15MR0j24J30l8J9K6M4j55J40
1594A83l4L7j25N8M4o0lM0r5L1o5R7R6o8Rm2K1j5j4KN7k9j06RK1Q7L3p7M1L2R4j92K00j84
1195H3Q5K1n8J01j80J76n0p1mJ29j56K22o5k00K18k6j06n5J35J28r8j66J00j12J90j82J39
878A98j82rK31p2lr0O5J0j5k1K9K7j3q8Q7J0J24j77N2M0j22M9k4r6J28J22J1RJ18o2k62Q1
502A55qJ58n0o0j23K5q2N7kN5o8M7N7q6J62j61J29p8P8or5m3P5R1j92J42J9j57M5N2p0P3p
115A32o4P7k4q9K14p2j14J25l8m2l4L3ML09k7j41K2j71J2KL9o0K6l9M9o9
$$ plain form
2709 183 60 110 155 81 202 188 78 151 223 86 121 223 125 42 96 169 260 224 15 117 146 172 234 260 117 59 203 111 79 25
2357 25 126 232 267 118 161 249 73 97 143 114 65 120 135 81 145 182 193 110 279 65 246 223 205 213 248 212 163 14 128 176 217
1993 217 73 96 106 92 106 144 150 60 105 125 95 113 200 204 96 86 106 111 210 235 231 100 162 47 51 141 17 147 109 128 154 198 43 183
1594 183 149 186 61 119 163 103 100 140 45 76 11 108 204 136 145 103 124 109 95 97 154 125 19 28 49 136 169 92 133 165 259 67 267 83
1195 83 168 189 131 232 52 228 178 107 103 232 76 298 233 33 251 225 119 64 199 327 229 63 163 51 241 59 198
878 198 16 7 238 166 163 73 138 148 133 112 141 168 155 67 154 164 288 111 163 203 81 130 106 10 138 260 271 280 398 336 74 155
502 155 147 305 255 195 72 97 15 72 70 125 57 104 161 75 237 76 205 127 205 199 104 61 136 227 35 177 196 39 84 136 66 139 132
115 132 68 145 121 32 246 174 60 185 147 105 71 104 108 417 390 249 271 100 112 114 153 93 119 80 129 60
-190F0
##PAGE=	F1=-14097.7
##FIRST=	25169.313707327481097,	5807.6787752999953227,	0
##DATA TABLE=	(F2++(Y..Y)), PROFILE
5808HM3N3n4m1Q8L5Q1P4j52l3M2j05J5R3q9N6knM3J36L1j27L7m1J3N8l5j25J28j71k1R0O5
5420A88r4O8o9qQ4q9m5J4J66J8o8K2J4m4o8o8L3O4J6n3J10j08O8J2j24JO2K6J7J4pn9j5L6
5021A14Pr0M0m9N0M2j4m4lJ05r9O5O1l8j37J77J49j01j92R6p4J25P0p6r7l6O4K0N4L2j13Q5
4646A93p7n7M9M5Q8Rp6j4p8k6k6J37p4l1k8J26j6p9j6R7r5Q4K7J51j98m8J07rp7P5r2jJ59
4258B29P8j82Q4r5J24L8j72o3L1K9J15j79P6O0r8O4q4J1J01K87j88k8k15O8j0J46n6J18j4
3918B75k50Q2m7J01Qj55N8L4j5O5j08R5K1k2j4l8L%K0%J2j16Q6Q4o2J42j41q3K1M3%L3J25
3531B57k08k8J1R1P8kl0l5L8n5n2R7K4r2o7pJ45O3j17R3j78Q3K5r9L0J5MK1j8K1k8qL9r0P2
3120I3j7L1J07o6o8P3j4qn7jQ5N6q7M5J00k32J26l8k9j2N3J42M7j69L8r8J8o3mM3JO7L2p1
$$ plain form
5808 8 51 104 50 9 97 132 213 287 135 102 144 39 54 147 58 114 112 107 150 286 317 190 227 186 199 257 222 97 225 54 33 123 188
5420 188 94 162 93 85 169 80 35 49 215 233 165 187 201 157 89 21 54 118 134 81 191 83 151 163 39 40 102 128 145 159 152 93 78 114
5021 114 121 31 71 22 72 114 100 56 53 158 59 124 185 147 10 187 336 235 43 139 65 190 260 184 87 51 115 135 189 221 108 193
4646 193 116 59 108 153 241 250 174 160 82 56 30 167 93 62 34 160 144 65 49 146 51 135 162 313 115 67 174 165 88 163 71 70 229
4258 229 307 125 209 114 238 276 104 41 72 101 216 37 113 173 75 139 55 66 167 454 266 238 23 91 81 227 171 289 275
3918 275 25 107 60 161 169 14 72 106 91 156 48 143 164 142 128 90 93 93 113 113 125 9 95 179 117 259 118 35 56 99 99 132 257
3531 257 49 21 32 123 201 199 169 134 172 117 65 162 186 94 27 20 165 228 111 204 26 109 134 35 65 80 84 105 87 108 80 72 111 21 93
3120 93 76 107 214 148 80 153 139 131 74 73 158 214 127 172 272 40 166 128 99 87 140 282 329 160 198 100 118 55 51 94 95 162 194 123
2721A23J0p2N0N4r6P1%k0N4K7j75J03J04o0p1l8Q6J25o5j76R4k4lJ25%j12l1J55q1j15k2J14
2345A34J16Pj81R3P4j94R6LJ8m9k3M6o8N7R6l1j02J47j84J89l0n0M0O3m1l9j83J29N9M2j18
1981A16K3k1k4L1L6K7j07Q1Lm5PN9L0r6p5N9k0J10K6mj32KK0n3J24j27Q7l7J6K8L5o8P2J9
1582B02J6j37L5O9q7L0L8j38J1rM9J31q3ok7K8jQn9P3k7q3L8k4R5M5r1K3L9J62j73O2j52Q4
1183A41L8j1L3j48J47j7j02M6J33j61J80o3j66J75J3q7j36J87P9j02q4R6j29J71j43J20k01
866IM0Q3l9J4l8K6K1j9J5J8J6K0n4N1o4J72j09k7L2j11O4n3J0lJ32M9RJ16m8k30Q9p4J11q5
467A43K6j28L5n5K9lR0n1k8K1o2J47q6J05k7N5%r3n0M2J07j35Q5L8j29NP0n6OJ5m0O8K2j19
68D7K12o9o6R9k8q1%K8l1K96n6p8Qj97P1pK1o2K1m8O0n1
$$ plain form
2721 123 133 61 111 165 69 140 140 120 174 201 26 129 233 173 102 64 150 275 210 34 128 104 101 226 226 114 83 238 157 42 20 134
2345 134 250 257 76 169 243 49 145 148 166 117 94 140 72 129 225 194 92 239 55 244 214 164 204 267 226 187 4 133 192 234 116
1981 116 139 118 94 125 161 188 81 162 165 120 127 186 216 120 45 104 84 194 220 216 84 86 106 53 177 50 137 100 116 144 179 111 183 202
1582 202 218 81 116 185 98 128 166 28 39 30 79 210 127 121 94 122 121 129 70 143 116 33 71 47 142 187 96 119 158 320 147 209 57 141
1183 141 179 168 201 53 200 183 81 127 260 99 279 216 50 225 238 151 15 202 281 179 95 191 62 233 90 210 9
866 9 49 132 93 107 69 95 116 97 112 130 146 166 112 163 99 271 162 135 167 56 120 67 77 74 206 255 264 380 332 102 191 117 228 143
467 143 169 41 76 21 50 47 137 86 58 79 17 164 78 183 156 211 211 118 68 110 217 82 167 205 76 81 151 95 101 116 76 144 166 47
68 47 259 190 124 223 195 114 114 142 111 407 351 273 281 84 155 148 169 107 128 80 140 89
-190H9
##PAGE=	F1=-14200
##FIRST=	25169.313707327481097,	5807.6787752999953227,	0
##DATA TABLE=	(F2++(Y..Y)), PROFILE
5808B5QP8n4k1N9J9O6J02j31j01J20j62J19n0oP2Mm9Q6J59L5j61J8k0n4P5l9r8R5j61K3K5
5432H1R6j22J58j15L0P1m2o4o6J41Pk5M3j0p2k6m0M6O2J0o2J03o5j0M0r7PQk6J82m0r4rm3
5033E7Mk2O8qo1O3j1k3Jj7R3r6O2Q9Mj31J50J40j16j47Q3j43J99N6j42j24%Q4k3J49k8j01
4657A09J06r2m0mM3J28rq9N1j33j9M3J07q2n9l2J08pK2o8O0q1Q4k5J90j73r4J85j5r2M7j01
4282F8K1J59O3j75O0q9N5L7j37k9J7L0J06j18pJ45j30Q5o4m7P8K97k05m1j59Q0nJ30l4O2M3
3918B96k35N8JP2n6j00J9NM4L4m6P3l7j6j1l2KkP7k2L3j26R1M8o4Q3q5q7P7M4k5j6J02j91
3519HM3J1M1J11k0j04mR2l9n5N4M4p9n6J1P4R4j27R8j44J27j3j25J8L8PJ0k0L2n3oO6q3Q1
3120A32ql0J23r4p5J12N0m8q4pQ2K5n6L5J21k03J30j06O1l7L5Q9N3r6Lp2l9n9N7M2l2M1M6
$$ plain form
5808 25 33 111 57 36 95 114 180 282 151 50 170 8 127 77 71 143 147 98 184 343 378 217 235 215 161 236 197 99 194 33 56 81
5432 81 177 55 213 98 128 199 157 93 27 168 175 150 193 183 111 85 45 91 153 163 101 204 139 129 169 72 79 87 61 243 203 109 100 57
5033 57 61 39 107 99 38 101 90 67 68 51 144 48 110 199 203 72 222 362 246 99 182 39 238 294 152 28 28 112 89 238 210 109
4657 109 215 123 83 79 122 250 241 152 203 70 51 94 201 119 60 28 136 129 151 83 143 62 146 121 311 138 44 229 214 122 169 68
4282 68 89 248 311 136 196 107 162 199 62 33 50 80 186 68 61 206 76 161 97 50 128 425 220 179 20 100 95 225 191 253 296
3918 296 61 119 120 192 136 36 55 60 104 138 92 165 128 112 101 69 71 69 146 124 157 31 122 170 106 189 104 17 94 138 113 97 199 8
3519 8 51 62 103 214 194 90 86 178 139 84 138 182 103 47 58 132 226 99 197 53 180 167 42 60 98 105 115 95 127 74 68 134 51 132
3120 132 124 94 217 123 48 160 210 162 78 71 153 178 122 157 278 75 205 99 160 123 158 247 300 204 207 135 96 37 94 136 104 145 191
2732A91r4k0k8O4M9r6JJ2P0M9k7j33J21Q3l6m3q5M3J49r3j05P9p1k8J35k3m2l0J61n8j68J3
2357D0Q9J20Lk11J47N2k16J59m9O5l4r4P0o8N3J19n7j15J16j36J66n2p8R6O1j8k8j81J15N0
2005A84N0q5J8m8k8L0N6L5j20J07j5l3rK9L7p4j12R4p4J12M1j4r3q5J57j22J52j00L2jRmN6
1617A82j0kO7k0j30K8Q8j20P8K9j57j3M4lJ40n0n3k2L6k3N4j19R0j5m8O1m5R1M2j02j1N2K15
1230C54j25j18J2j1M1K9oj20J01K0j02O0J12j35J39l0j32R5N5p4q0J19J1r6OP1j36J59q8P9
878B10j85O0k7l2K6J1rL3j7N9Nj6N1LK3j48J79m8n0K7j24P1o8P8o9J01P8kJ14m2j82J05j37
491G8l7K3N8l2k4m1L8j4Q4k0q0K6MN1k8P5J5L4j2o7k7rJ07p2J4N2p2l8O9m5m3K7mM8O4j57
68D5K06m8l4P0j1j03RJ6l4K48p0Jl6j70R4Llo2K0q8Q3k4
$$ plain form
2732 191 97 77 49 113 162 66 67 79 149 198 171 38 159 242 206 163 78 121 270 177 72 151 80 52 187 164 122 92 253 195 27 40
2357 40 129 249 252 41 188 240 24 183 134 199 165 71 141 73 126 245 188 73 189 53 219 167 89 185 246 228 200 19 134 184
2005 184 234 149 167 119 91 121 177 212 92 199 184 151 142 171 208 134 22 116 42 154 195 181 88 3 160 38 190 90 122 121 130 126 182
1617 182 172 170 237 217 87 115 203 83 161 190 33 20 64 61 201 151 98 76 112 89 143 24 114 99 51 112 67 158 200 98 87 139 354
1230 354 229 111 123 112 153 182 176 56 157 177 75 135 247 112 251 221 89 184 239 165 85 204 215 119 125 196 60 219 131 210
878 210 25 85 58 26 52 63 54 87 70 129 134 118 169 172 195 47 226 178 128 155 31 102 34 112 43 144 222 220 334 292 110 215 78
491 78 41 64 122 90 66 25 63 49 133 113 33 59 63 114 86 161 176 210 198 131 104 95 202 130 144 196 124 86 155 110 67 94 90 138 202 45
68 45 251 203 169 239 228 125 134 150 116 364 294 295 259 89 183 186 183 121 141 53 136 112
-190A12
##PAGE=	F1=-14302.2
##FIRST=	25169.313707327481097,	5807.6787752999953227,	0
##DATA TABLE=	(F2++(Y..Y)), PROFILE
5808D0jO5n3K3N0l1M0J14j00j01J31j47J55j42M2P8J7q7R5J62O4j77mpj26Q2j3q2N9r1K1k6
5432E0J00j13K01j42O7Q7j4p6j00M0QJ5N8j5j03M%O0N5kn5N9ln8O4q2J3m4k2K84r2j78N5p4
5033D7m0N8J01o9l9N0m1KL0n2P9q4N9J06M4j05J18J03j25j20Q3j51K20M1j98p5k5O9k3J96
4681B59p6q4J31r1po7K9J61k0o4O5j60m5J21O6q0m7KQN8Q9j16Rp8Q3n2J95j32j20K39j5j08
4305A53Pp3J5J41M0j32M6q8l1K1o2OJ9QO1m9J6J34j53P9Jk9n6K88j95o3p9O3K6Q9k5L0R0k03
3906I5K7O6J0r4n0j7j5R2j3M2M7j02%Rl2l2K1R9m5Q2j31J06rn7K2k9o9J34L2n7m9M3o5J5K0
3495I6k0J42m7j30J8J26l4m9JP3m1k5k1J0J12j32Q9m8J35n2j59lO3J6j7L0J0q0kQ7p1P4J1
3108A62o9J32r7j08J32J17p7j21qR5pl6L9J11j45J18j56J33n6NL0M3oj0n5p3l0P2L3o4J8O7
$$ plain form
5808 40 39 104 51 74 124 93 133 247 147 46 177 30 185 43 85 163 180 93 188 350 414 237 233 226 100 182 169 87 146 55 76 50
5432 50 150 37 238 96 163 250 236 160 60 100 108 123 181 166 63 67 67 127 182 180 125 184 181 123 187 105 118 74 52 336 244 66 121 47
5033 47 7 65 166 97 58 108 67 69 99 47 126 42 101 207 251 146 264 367 242 122 205 54 274 315 117 42 17 86 63 259
4681 259 183 99 230 139 132 65 94 255 235 171 236 76 31 152 218 138 91 93 101 159 248 132 141 63 146 94 289 157 37 276 261 153
4305 153 160 87 102 243 283 151 197 109 78 99 37 43 62 70 131 82 98 232 79 158 159 130 74 362 167 104 25 88 114 203 178 208 298 95
3906 95 122 188 198 104 54 37 22 114 101 143 190 88 88 97 65 33 54 153 108 190 59 165 156 99 121 92 23 157 189 132 83 126 61 76 96
3495 96 76 218 171 41 59 185 151 102 103 176 135 110 89 99 211 79 168 120 255 203 44 41 104 120 103 133 143 63 61 148 77 151 162
3108 162 93 225 128 20 152 269 192 71 63 158 151 115 154 265 120 238 82 215 159 164 194 237 231 221 166 93 63 135 168 104 122 189
2732A89j22j3oO8L3p3o0M5R7N1p0n3J11M6j9oq5m6J52j03k4P1r7n1R0m2L8m2J62k1j71J9M3
2345A11J06J0k14J97K4j99J70r9J01j8j23P1m7M5J04o3j24Q5q5J23q4q1J55L4K2j8j70Q8L6
2005A57O5n3Mo1k8J7R9J7j30J29l6kk8LK6n0j12J06j21R4P2l5k8l7J22j69J60n4rL7j2l8Q6
1617A91K9p1R3n1j14M3Q9j47J30J3j48PK6qR4Oq9l7O4r5J22j18O1nqO2n4R1K9j08n0O6K46
1230C59o0k65J61j10N0L7j6j12N8N7p7M6P1q7J13L3j39K0R5p1k3O1o2m4N0L1j32J53k8K9j56
866D2N5Ln0k4L4m2L8jJ03ml7N4O2J1j34N3pl3L5j18N0l6N9n0J9Q4j3J13l9j28J26j37L8Q8
467B14j06L1o8m0O2jK9J5r4N9K9J1m9M9L9K8n2k3Mm0J03k5o5N6j5p1P6m9o2K4M2K3R2j87J82
56B21j9j7N5Pj11oMk1J85o0O4q9j07Q4K9k3o0K1j44J07K
$$ plain form
2732 189 67 54 48 116 149 76 16 61 158 209 139 86 197 243 224 218 133 87 239 136 112 183 86 35 125 83 121 79 241 220 49 68 111
2345 111 217 227 13 210 234 35 205 106 207 189 66 137 90 135 239 176 52 137 52 175 91 10 165 199 221 203 33 121 157
2005 157 222 169 173 112 84 101 200 217 87 216 180 178 150 153 179 129 17 123 2 96 168 133 105 68 190 21 181 127 118 155 143 105 191
1617 191 220 149 242 191 77 120 209 62 192 205 57 64 90 82 176 182 93 56 120 25 147 29 90 85 77 139 85 176 205 97 47 113 359
1230 359 299 34 195 85 135 172 156 44 102 159 82 128 199 112 225 258 119 139 234 163 140 201 139 95 145 176 44 197 169 198 42
866 42 97 100 50 26 60 18 56 55 158 154 117 171 233 244 110 163 156 123 158 40 90 54 113 63 82 166 153 266 227 99 225 88 126 214
467 214 108 139 71 31 93 92 121 136 42 101 130 141 92 141 180 208 156 133 137 97 200 175 110 166 151 80 156 107 45 69 111 134 226 39 221
56 221 202 185 240 247 136 130 134 113 298 238 302 213 106 190 219 196 136 157 13 120 122
-190A22
##PAGE=	F1=-14404.5
##FIRST=	25169.313707327481097,	5807.6787752999953227,	0
##DATA TABLE=	(F2++(Y..Y)), PROFILE
5808C7OM2m9O5M1o1J0R8m5l5O8j16J62j40J0P1L2j13Q2J43J02j66k0pj88O9N3q6K1k2K9rK7
5420A11o1J79j41R6R8Pq4j19k7mL2O1oj13K6K3P5M5j7l4qO7o3P6r8Qm7M1K78j34k29J11p4
5033G5qP8N4j30OJ5m5M4L1o3N3o3M9J12Q1p5Q6N4j35r9P9j01J94L2k38J8l5j6K9J65r9p4J50
4646B24p0L6j14MJ71k7j2L9j59p7J81J8n2k9K5q4J28J33j57l9q8Q4m8J65q4j31K69j1j27l8
4294A30k5RJ07J7o9L8q2p7m7Q6rKj3kJ2Q6Q3j62N0O6Rj94K64j34j11K0OP8K9l3K7J16j53q
3894A16J18n1q3m0l0L2O3p2J34K6j14j8J6k4o4L9J05q8J55j33J19o4m6k3K2l5J74Qr4n9k4
3531F5N2k1K5p5J64q2m2k4J21l6l7m5J02J7j3o2l3J13j28O0N4J40q1j77l6P8L1n0J20m3j09
3167D8J0R4m7M9K9p8J35r2r5Q8J64r5j51qJ17l7m1P5P3q8J06j84J80o3k8j0LR1no0q0pO8K4
$$ plain form
5808 37 43 85 36 101 142 81 91 189 144 109 177 61 223 83 93 164 196 83 165 308 410 244 224 217 29 98 151 65 86 64 93 84 111
5420 111 50 229 88 184 282 289 205 86 59 55 87 148 142 29 55 78 153 198 181 147 139 206 143 219 121 129 82 123 401 267 38 149 75
5033 75 67 145 199 69 75 90 45 89 120 57 110 47 96 208 289 214 300 354 219 120 199 98 292 324 86 104 69 53 82 247 148 74 224
4646 224 154 190 76 80 251 224 212 251 92 15 196 214 162 133 158 74 202 335 178 139 51 135 87 252 168 37 306 295 168 130
4294 130 105 114 221 238 169 207 125 48 1 87 78 80 67 65 77 163 246 84 134 200 209 15 279 145 34 54 60 138 167 134 161 277 124 116
3894 116 234 183 100 60 30 62 125 53 187 213 99 81 97 73 9 48 153 65 220 87 206 142 96 73 95 60 234 242 148 89 65
3531 65 117 96 121 46 210 128 86 62 183 147 110 65 167 184 171 109 76 189 61 121 175 315 234 57 21 99 130 80 200 157 48
3167 48 58 152 105 154 183 105 240 148 53 141 305 210 59 51 168 131 90 165 238 150 256 72 252 189 161 151 154 245 240 180 100 93 161 185
2768A85q7PQ4j44L7RL3J3m0j9L2M0N4r5J3J11%jK6o6j29J20p1L6O4j07n6J2k5O3n9J59K9j47
2369H1J1nP5J0j40J92rj41J38j38J12qj03N4j5K6O4m8j24O0m5P1j13R6M8lO1qj57M9K6Q7k7
1981A77k1n1l2J5J42k4j39J49n8L5m3j6kk4q1R1r5QJ11o3M3rQ0j58J21Jk1M1m7m1R6P0j28
1594A27R2o9r5Q1O1j48J64oj31K6KK1J0O8q7p5J12p9P9p8J9PJ2L4n8J02J2j11q0P6K53Qj94
1207A55R1j80P8lqj12K8R1n1K6J8l1J11R0j71l1J32q2K0J8j23P5J1j2j20J53K2j6j26L6N3
843A42o1l8K3m1ML0J30j6l5L8J13Qj10q8RqM8p7L1j3jPo8O1j7J12l2p3J36j07P1Q5j36L7j03
432F1j8P1K4l4N0j11P7P1K2j19L9K9M7j14J5M8n1J16qj30L4K6q9J14o0p3J8Q0pJ04j74J12
56A70J3rO1J7j00m4plJ31k4Q3j30m1O2O6l6n4K1j19M9J0
$$ plain form
2768 185 98 105 189 45 82 91 124 137 97 78 110 150 204 109 122 233 233 232 258 192 63 183 112 148 212 105 49 61 36 99 40 199 228 81
2369 81 92 87 162 172 32 224 215 74 212 74 186 178 75 129 114 140 204 156 32 92 47 118 5 101 149 146 207 199 42 91 117 204 177
1981 177 156 105 73 88 230 206 67 216 158 193 150 134 132 108 27 118 23 31 142 79 122 113 193 35 156 157 136 177 130 89 185 255 127
1594 127 219 150 55 136 197 49 213 207 76 102 104 125 135 203 116 41 153 74 153 75 94 101 113 147 89 191 203 92 12 88 341 349 155
1207 155 246 66 144 141 133 21 49 140 89 115 133 102 213 303 132 101 233 151 171 189 66 141 152 140 20 173 195 179 53 89 142
843 142 81 43 66 25 29 59 189 173 138 176 289 297 187 99 108 100 148 71 102 89 88 95 27 88 71 183 151 78 214 107 178 263 127 164 61
432 61 43 114 138 104 154 43 120 191 213 94 133 162 209 95 110 158 107 223 215 85 119 145 56 170 110 37 55 135 128 232 58 170
56 170 183 174 235 252 152 108 101 98 229 205 288 158 117 179 245 209 155 176 57 106 116
-190A16
##PAGE=	F1=-14506.7
##FIRST=	25169.313707327481097,	5807.6787752999953227,	0
##DATA TABLE=	(F2++(Y..Y)), PROFILE
5808C5mK8l0Q6K3n2OK7L8J0J5r7J54j19k2M8N1j29N9J00J32j23k8j8j39l6J38j08mK2M5L6
5432A44p5kJ23j10J08R3K2q7j24Ml2j3M5J7p4K3J5Q9K9k6op9J28k5P1j33j4OP1K35j59k05
5056E9J20n1MP6jj75N4l0k2O4L5n1J5l4L0J10J13n5N4J1j51o1O2l2J50K5k50Q5k3p1N1R3r1
4669A13p1J48k3P2j35rJ45m5M9Mj39o2J78k6ll1M0j13J43J60j87p0j07Q6j8J08l7j33K77p
4317C07j47q1L6J2P1moK5p0n6pO5l4j9j7l4J6J54L6j60NJ19M6k11J62m5j12M5o9J34k9n9N0
3930A23J13r1l1J25p8m1p0rP4K4j12J84J7p4o9J4j7m5MJ32j21J85j31J25r6l6m2O1j5K04k0
3566B87j31o5l6J05n1K3j11J66j17O8o6R5m6j9m9R7R5k7j06m4R6j10J3J41J41r9j68m4M8M9
3214A35m3J88j12j38L2P9qJ8L6o4J26r1q4O3J78j02j54j5J28n3p5J45J8m8J01k01K09o2m9
$$ plain form
5808 35 31 59 29 115 138 86 92 119 157 167 182 85 239 120 98 146 197 68 127 227 359 236 208 190 51 15 153 45 41 63 108 144
5432 144 69 67 190 80 188 281 303 216 92 96 64 51 96 113 39 62 77 166 195 169 163 84 212 187 258 125 111 117 188 423 264 59
5056 59 179 128 132 208 207 32 86 56 34 98 133 82 97 63 93 203 316 261 315 326 175 114 176 144 294 319 69 154 131 60 111 204 113
4669 113 42 190 167 239 104 95 240 195 244 248 109 47 225 199 196 165 205 92 235 395 208 138 31 117 99 207 170 37 314 307
4317 307 160 79 115 127 198 194 188 213 143 87 80 145 111 92 75 41 57 211 247 87 92 211 257 46 208 163 51 96 27 161 132 73 123
3930 123 236 145 114 239 161 120 50 41 115 139 27 211 228 154 85 99 82 37 41 173 52 237 106 231 135 99 57 118 103 307 287
3566 287 156 91 55 160 109 132 21 187 70 138 72 167 121 102 53 150 245 218 112 68 164 54 67 208 349 250 82 38 86 135
3214 135 92 280 168 30 62 141 133 151 187 123 249 158 74 137 315 213 59 44 172 119 44 189 207 159 260 59 268 206 157
2873A57mq5J76J4p8p4ON8J5r8J5Q5j49P0M0nj4rQK8k3N3j07O4J14m1J2M7l7j62L4K2M6M8j07
2462A19k5l3N2n5l7J13Q3j04pl7M3j8k7J57m2o5Q8j45Q3j1m0K7J7pJ4j3j06M3k2J7J7R8m0
2075A37l1P7Mj42KK8J15ko4k1m0N1J50q1j30J51p8O5n1j3n0Ll3O5q1%Q5q6J04j1N4j22P6M5
1676A76rJ1q4j1P9J15j68P4q1o8J29J1j07J54k6j12L3qN8q1J23n4j10J48l5Qo2NL6Mrn6J18
1289B01pj15m6M4K31O6j02rk00J06p0Op8K2Q1l7J8l6J2J26J15k02m9J64j04L7j2j31J68n5
937A44l4q9J32M9l6j07J3P1n7j9J8l3j1L1J43l6k3K8J46J4j07j70Kj8O9qK1k8m7O4r3j2lQ9
538A03k9%J12n2j4Q0m1Kj38M1O0M8r0Q6j41R1J21M5j87N0k2Q7j35j6J10n8J50j9j46k6L7o0
162D9J49o3j04L9R1m6J03j27K0L5%Q3J2o5j00j4J1J11J1N7j49J1M2J03l7n0J9p8j0j1
$$ plain form
2873 157 153 68 244 258 180 106 112 170 185 87 102 187 38 108 148 143 129 120 128 156 133 186 79 143 257 216 228 275 238 76 110 132 178 226 119
2462 119 94 61 113 58 21 134 217 113 106 69 112 94 67 224 182 117 205 60 143 132 92 119 136 129 143 130 24 67 45 62 79 177 137
2075 137 106 183 187 45 47 75 190 188 124 103 63 114 264 183 53 204 126 191 140 127 77 80 47 112 31 31 116 30 134 123 177 55 131 176
1676 176 167 178 94 83 162 277 109 183 102 34 163 174 67 221 195 83 116 108 166 85 208 154 44 192 157 165 103 108 144 148 139 83 201
1289 201 194 79 33 77 308 374 272 263 63 169 99 105 27 49 130 93 111 75 87 213 328 126 77 241 137 174 162 31 199 144
937 144 110 21 153 202 166 59 72 143 86 67 85 52 41 72 215 179 156 184 330 344 237 67 69 51 120 112 133 105 58 122 29 17 14 103
538 103 74 74 186 134 120 200 159 161 23 64 124 172 82 168 27 118 239 284 97 147 125 212 77 61 171 113 263 244 98 72 109 49
162 49 198 135 31 70 161 115 218 91 111 146 146 229 241 176 76 62 73 184 195 252 103 114 156 259 222 172 191 113 103 92
-190I2
##PAGE=	F1=-14609
##FIRST=	25169.313707327481097,	5807.6787752999953227,	0
##DATA TABLE=	(F2++(Y..Y)), PROFILE
5808F3n1J9J0P4Jj0J8p3J29K3or7J36j00l0RP7j35K9M4J38o0k3l7l4JO1j27J9LN2P5j41J6
5409G3N8n9J02P5L0q1j10M4l6o3LO0k3PjQ3J3k7K2j15J52L6N2j65l9P2O9J67j63j42J06j3
5033A87KN6n2j30K9m5kN2M9l6j8lPJ02J35n7K0rj73PM2J8J00J8k25J16Nq9K7Pn6l9Q6M8Q5
4622B64j33nR2p8J11k3j07l4J60n2M0n8M8r0J18J60k00p7j28R1K2M3jj28K61oj65j04R7K3
4270A41N1k3L0Ko3l4K4N7n5l5Mj2n5J99kj42l8J40O9j67R7lr2M4j33J75n8n6M0P6l0k3O7m3
3871A52j9j05L2R7nr9J52K3k4j18L3k8m4k2J92r8J17j27J24r5k5n1Q4mK15m4j62p2pJ09o7
3507A14J9j13J31j44J68r9N7n7%J1L4J86n9j47k5O3q3l8J97J33j02j41l8kO8J4K07j81j60
3167A3N8M2L6KK9m5J04r6p7P8J61j01j32j5J06m7r7J98l5l3J02k10K22n3n7L5j66J99M8r6
$$ plain form
5808 63 12 31 41 115 116 106 124 51 180 203 197 100 236 136 106 115 192 57 86 130 268 208 185 148 114 115 176 49 68 71 123 198 57 73
5409 73 131 72 174 249 279 198 88 132 96 33 36 96 73 80 79 162 175 148 170 55 207 243 295 130 91 163 232 399 236 94 200 187
5033 187 189 245 193 63 92 47 45 97 146 110 92 89 96 198 333 276 296 287 114 121 163 181 281 299 74 190 195 106 133 140 84 45 131 179 264
4622 264 131 126 218 140 251 228 121 87 247 195 235 177 225 135 253 413 213 136 8 99 121 164 163 35 296 290 125 21 118 141
4270 141 192 169 199 201 138 104 128 185 130 95 99 87 32 231 229 87 49 189 258 91 188 185 93 137 4 179 121 65 105 181 151 128 195 152
3871 152 133 28 60 157 152 53 205 228 204 86 119 91 47 25 217 119 236 109 233 138 113 62 146 142 357 313 151 79 72 181 114
3507 114 133 20 151 7 175 76 133 76 76 87 121 307 248 101 76 139 56 18 215 348 246 105 67 65 133 147 354 173 13
3167 13 71 113 149 151 180 135 239 143 66 144 305 204 72 57 163 116 19 217 182 149 251 41 263 210 153 188 22 221 269 173
2815A73p0J9M7Lr9L8P0j41Q0P2j7n3J9K1K4p3N1j15J03J11o6J1N4kj54m6J22J6J9q9K4m1P6
2427A87j31L5k8J24m8k6l7K5o4O3J06p0J8L5j13K3k2M8j5M4n2l6L6p5N2j6l3J09Q5r7l6N5
2052A46K3j25l8N5J21K8j17J7n0J07J27j39p9J05q7P8m7K1r7J1J0N1o9K7Om5J00l9N6r4N6
1688A19O5J8l8o8oM3J55j86N7j11j4J61k9o3J11m2q9J9PQ8j48J54nj36J54Km2o4nP9j7n1m6
1300G2J33k8j21J3J2J89J08k1j12j69J12j26J9k8L5M8l7J8o1J5J39J05k11l5J81j26K6k9m3
960G8J57j16pp4J00N3j6j07j5N5k5J0J8l8MKJ52n9j4K9J65K5j27j56Mo6Q4M9%p1l9Q3o3K5
561A00j1j4n1P0O5J9q6j9J28o6q3L9L9N7j32J23j58R8J52O9k37Q0q2J10n8r9J39p9J88m8j20
197A33p5QL8J25o6j40P6R0r0R1p4n2L3K4J01oj1j62PmJ28J8Qj44M5L2J32k8n2J4m4m5n4
$$ plain form
2815 173 103 122 169 172 73 111 181 40 120 192 175 122 141 162 186 113 164 49 152 263 197 208 262 260 106 60 182 198 217 128 152 111 187
2427 187 56 91 63 187 139 113 76 101 37 100 206 136 154 189 76 99 77 125 110 154 102 66 102 27 79 63 30 139 224 127 91 146
2052 146 169 44 6 61 182 210 93 110 60 167 294 155 76 181 94 172 125 146 49 60 70 121 52 79 85 40 140 101 157 63 119
1688 119 184 202 164 96 90 133 288 102 159 48 34 195 166 103 214 172 83 102 109 197 49 203 198 62 216 218 176 112 107 186 169 118 72
1300 72 205 177 56 69 81 270 378 357 245 76 188 62 81 53 88 136 99 117 56 71 210 315 104 69 250 124 150 121 78
960 78 235 119 112 38 138 191 175 68 53 108 83 93 111 73 77 79 231 172 158 187 352 377 250 94 98 32 116 165 165 94 55 138 75 100
561 100 89 75 24 94 159 178 92 73 201 135 52 91 130 187 55 178 20 118 270 339 102 182 100 210 152 53 192 113 301 253 133
197 133 58 66 104 229 163 23 99 189 99 190 116 64 97 121 222 216 205 43 50 46 174 192 200 56 101 133 265 237 185 199 155 110 56
-190E6
##PAGE=	F1=-14711.2
##FIRST=	25169.313707327481097,	5807.6787752999953227,	0
##DATA TABLE=	(F2++(Y..Y)), PROFILE
5808I9n7l2M3M7j3L9K2j10J53K1kj02J09q6j0m0J13j36mLR8N%n6N4N1%j36K9jM1R0j46j6Q
5397G8j4Q4N0K4m5q2L8k3n8k6P2J2MoL2Pj9L4q5J24R0K9j77l5R7M1Q9j40p4P9L6nK4r2l4l1
4974I8j4k2L7O8l9k4J5rR2J39q9j3Oj99Q9L8K8N6Pj69J20M0j03mp0j1K2k1J19P5j19J1L3j23
4575F4J70l5p3KJ41n4M8j03N3m5Q6J31j92o5j14P2N5rJ5j11K18qj72%M7L0N6l4K6l5o4j1N4
4188A43N4o8l1L5j0r9J99l0j05l8R0O7q1Q2k4o6M8j34J54m6j5k2K2J3J3m0N1l7j14O4J05k5
3812A55q5R4M5J8j48P6n6o2l2K58p2K9j29J18o0k1n4R3kK04n4j83p4K0R6o4J9r6P2n5J46j20
3437G6J1m2JP8m3K76r5j80J1K3o1k9J68J17r2j03k5n4Q6Q1J99k34j42N9j6P6OJ2l1P3r4p5
3061C7J20J24r2j05LN3k2k8J51p1m6J12k02K10m2m9O2j31R1R7j02p9L6M3j8r4O2N0j21P4Q9
$$ plain form
5808 99 42 10 53 100 87 126 148 38 191 212 210 108 217 131 121 81 194 58 54 57 155 160 160 104 158 209 209 73 102 101 142 232 86 70 78
5397 78 64 148 198 222 177 95 133 110 52 26 98 110 114 108 140 147 128 162 77 201 291 320 143 108 205 246 335 195 121 200 236 231 255 163 129 98
4974 98 84 62 99 167 128 104 119 110 202 341 252 239 245 46 135 173 201 257 264 95 215 255 152 148 78 67 89 68 187 262 143 154 187 64
4575 64 234 199 126 128 269 215 263 160 213 168 254 385 193 128 14 86 141 132 147 36 254 246 74 74 121 151 207 173 199 164 100 89 143
4188 143 197 129 98 133 123 24 223 193 88 50 140 207 126 208 184 118 166 32 186 140 125 103 125 138 151 111 162 125 11 75 180 155
3812 155 70 164 209 227 79 155 99 37 5 263 191 220 91 209 149 128 74 167 165 369 315 132 58 78 174 110 129 33 105 50 196 76
3437 76 87 45 46 124 81 357 262 82 93 116 55 26 194 311 219 116 91 37 123 204 403 169 27 86 70 146 152 164 133 206 112 37
3061 37 157 281 189 84 87 140 118 90 241 170 124 236 34 244 202 153 215 84 175 272 170 91 127 170 152 58 120 170 49 123 212
2697B12%j02M5L1K2j16N2j24J27R8o6rN2L1j30k0J28k6k3l3N4o0R5j19L9r5P6J0l3kRj1J2
2310A24M9q7R2pp3J6pO7o9O1r4n1P0o6Q8j4n2J18P4j23k2MM4j00K4L5Q0O0j58M5o4J58R0j83
1911A29j0K4o2N9k7P0r6l4L3O3m3%n6M0N0q3Q9q6O0O4M9r0L0o3KJ77j84O4j41J7J78k3o1N6
1512A95m9n4k3M5J00j51J38M0j58J31L0o9p0j7J22m7p5j3J28m8j24P4k0J48J33L9k08j06J00
1171A91j41K5j3N8K7l5Ro6QJ29O8j85kJ76j32j0l3N1J18j65O0r9Q4M9L8j28n0K1M7J7J8n0
796H5K3l5J59p8j2L5J75L9j65q8J5m2O5N3m1j31J5O4k0N9l3k2n4N2L2O8Jj28J49j45L4rJ4
408A34M2j24J31j42Q7J51R1k63J20r4O6L4j02R3j14K11q2q2q0JR7P1p2j63J14R2j13M9k6o5
56F2j2P3Q7k6M5j95N7o0J44J0m3j27P5L5J41j3o2Mk0n9q9
$$ plain form
2697 212 212 110 155 186 208 92 144 20 147 245 179 170 222 253 123 103 231 205 182 149 203 143 238 119 158 63 139 149 116 114 123 112 124
2310 124 173 86 178 171 98 114 107 174 105 166 72 21 91 25 113 99 47 165 239 116 94 98 142 42 66 101 181 241 83 128 64 222 312 129
1911 129 119 143 81 140 113 183 87 53 86 149 106 106 50 90 140 57 146 60 120 184 233 143 173 110 112 289 105 169 28 45 223 200 139 195
1512 195 146 92 69 114 214 63 201 241 83 214 244 175 105 88 210 163 88 75 203 155 31 105 85 233 366 405 197 91 191
1171 191 50 75 62 120 147 112 121 55 63 192 260 75 73 249 117 107 74 125 243 78 138 39 123 172 210 82 32 53 100 117 135 85
796 85 108 73 232 154 142 177 352 391 226 138 153 111 176 229 188 57 72 136 116 175 142 120 66 118 150 218 219 91 240 95 129 120 134
408 134 176 52 183 41 128 279 370 107 227 133 199 233 131 224 110 321 239 157 77 78 175 246 174 11 125 217 104 153 127 62
56 62 50 123 210 184 229 34 91 31 175 185 142 15 90 125 266 253 191 195 175 116 27
-190B7
##PAGE=	F1=-14813.5
##FIRST=	25169.313707327481097,	5807.6787752999953227,	0
##DATA TABLE=	(F2++(Y..Y)), PROFILE
5808A23m1o6M0J8nP1J1o0Q8J3K0j02Q0p5K2p6J47j45k3L8k4M4M0o1J06R4m0j39J4K4K9P6j21
5420A20n1Qk5P1J8LM0o2k2Jk5nK4M9K4qn6J8j0K6k8R7J07J2j69oQ7qJ6r2j7L2R6j4oj26P6
4986A95q8Qm5M2P4n8LJ6j0Q1J21j48l5M7j55R2N0J2K2qr4J14O8j16k6q2j5O2n0J11N8j14L9
4599A71k1q3J33l3m5M5J26m8K0j49N7MN7Q7j70l4q9M8P1l3J1p8J49j3j12P5j7K3P5k5j4p4
4223A14o5KP8M9o6lN7l1r9J54n0m7krL4L6O6o5k1M4j19J23j1J1p0k5K2N7j53J68q4m3L3J02
3824A87m0q1K4Q8M0j54J25q8p0MK58n2m5j47J13Kk8n3R1j0J70m2j87p2N0O3m7K5q0J0L7J13
3448B04j27l5M8j8P3j02L40j18k01M9j4m8jJ01R1p0o1Lq0O7J32J80k56j08N8o5P8K4ll0M1
3085A52n7l4J16P5q1r2L3oJ8L8Q7q0p9J30j61J58l2l1O3p6l1J54q7j06O6M4n0r0Q0L1r1O9
$$ plain form
5808 123 82 16 56 74 69 140 151 91 179 192 212 110 190 115 137 61 208 63 40 78 54 98 138 77 183 277 237 98 112 136 165 241 120
5420 120 69 77 52 123 141 144 184 122 100 101 76 71 95 144 168 160 104 122 112 138 110 207 314 326 157 151 238 230 246 154 137 169 265 251 245 119 195
4986 195 107 115 70 112 186 128 131 147 137 218 339 191 156 203 48 140 190 202 224 216 122 236 304 188 162 80 65 127 77 188 246 132 171
4599 171 150 67 200 167 122 167 293 245 265 116 173 177 234 321 151 117 28 76 147 114 125 47 196 183 71 146 129 152 227 202 188 114
4223 114 49 51 129 178 112 109 166 135 36 190 140 93 91 82 116 152 218 153 132 176 57 180 169 180 110 85 107 164 11 179 95 52 85 187
3824 187 147 66 90 178 218 64 189 101 31 35 293 241 196 49 162 164 136 83 174 164 334 292 105 33 83 146 99 124 44 54 91 204
3448 204 77 42 90 72 145 43 383 265 64 113 99 51 50 151 242 172 111 114 34 101 233 413 157 49 107 42 120 144 141 111 152
3085 152 95 61 177 252 171 79 112 106 124 162 249 169 90 220 59 217 185 154 217 141 110 264 177 71 137 181 131 41 121 152 61 130
2709A30P4L6j49P0M8L2j79O7j24J20P8l9m8M7N6j03M5J02o5p0N7M7q7J11p3K4q9l8N9k2O1
2345A78k8M2n9Mr2J36k4m6P2QL9j29O4j07L4J9r6J30j0p1R2P3j23mn5O1o3Q5K5K7Q3j78O9
1958A56r0J96N4k06M5o5J0NOJ04p7r5M8R3j2o5o4J04j2j27J30q5O5N9P7j31J35j19l7J75j60
1594A17P7j19k8J92J8r4Pm8om9N7R1j25J19O7j74Q6M6q0o2j3J29q4p5N1R2o3j09J13n6J25
1230B02J44O9k81l6Q1j17K8m1R9Lk0j3q0K6R1J8j16K9J44j13m5m7J32P0j91J27j37P5N6J00
878B57j61p5OJ00%K1o6M3p3J67q6j7L9J78N2k11KK0j4P5L8r6j86P0L5L0P0n7Kn2J8K1Q2Q7
479C19j25N7k03J47n2j2Rn1R0j31Q1J33J13k65J67q5j6J08p3M3j44K03j10m6o9L9J06Pp5j55
127A0J32R8j02j9J4l7n4J08M6m4Q5j84R4j15J31Qq7n8P1L2J35Kp5j1qn6p0
$$ plain form
2709 130 204 240 91 161 209 241 62 129 5 125 203 164 116 163 219 116 161 263 198 128 185 232 145 256 183 207 118 80 139 117 178
2345 178 150 192 133 137 45 181 157 111 183 191 230 101 165 58 92 111 15 145 135 64 156 229 106 102 47 108 45 130 155 182 265 87 156
1958 156 66 262 316 110 155 90 100 105 111 215 138 43 91 184 172 107 43 147 135 8 138 53 118 177 254 123 258 139 102 277 117
1594 117 194 75 47 239 257 163 170 122 116 67 124 215 90 209 276 102 188 234 154 92 79 208 124 49 100 192 129 20 133 77 202
1230 202 346 415 134 98 179 62 90 49 148 151 131 118 38 64 155 173 57 86 230 117 72 25 157 227 36 163 26 101 157 257
878 257 96 21 27 127 127 148 82 125 52 219 133 116 155 333 385 174 176 196 182 257 295 199 13 83 118 148 218 161 163 111 129 150 232 319
479 319 194 251 48 195 143 131 140 89 179 48 129 262 375 110 277 192 176 284 211 254 110 313 203 157 88 127 233 240 165 10
127 10 142 240 138 119 133 96 42 150 196 152 237 53 147 32 163 171 84 26 97 129 264 266 191 180 172 116 46
-190D6
##PAGE=	F1=-14915.8
##FIRST=	25169.313707327481097,	5807.6787752999953227,	0
##DATA TABLE=	(F2++(Y..Y)), PROFILE
5808A25j1q6K5kK2P2pNPMN1r5N9o7M5q1J57j63pO5m9k5P9n4J23J18n6j39k1O9K9L4q0o5L2
5397A13p2P8l1k9J57o4r2J3J6Rk7R7O1j8j45M6j3LM1Q4P0Rj48L0O8o9l6l2L0m5J65k5k2j60
4998F2J89j29Lo0N7O6q4M9J8%O8Q9k20j1P1n4K7N2j3mk3mJ08Q1j29l1m3o6P8j9N2P0j45O8
4599A73n8M7Rl4k6R3J11n2k8j83O6L9M0M9j43Op7L5O8l2J3n1P5k3K1O4o1KJ00Lp9o0j3p9Q8
4188A03L1m5L6O4o5p8R5o3K4K6o4j7J24J8q5L9K2q5Q2K7K3r2l7MO8n8R0j36M8j0R6n3p6m5
3789A1J35L2j26J55j11k7jK38m5q4j61Q9P0m2n0Q8k7J13jj78o7R6Pk2J7o1l1R3R4j22l1J03
3413A54j7Lr4L33j17k07P2l0l9NL2N8l9k1M6o3j1J57J58k42p6O5m7mM4nm3J9K8JQ3J8p1r0
3014F0N7n0O3R7J1o6j18J51j17J02k1j4L5lj37J96n6j42J04M7r4q2R2J7o3P1L2P5j77Q9P4
$$ plain form
5808 125 114 28 53 51 73 145 138 143 150 154 205 110 169 102 147 66 223 60 53 118 69 44 123 69 192 310 254 115 94 163 192 226 146 81 113
5397 113 41 119 88 59 216 152 60 73 89 98 71 168 229 211 66 112 99 102 143 227 297 306 158 188 256 187 151 119 149 104 269 244 222 62
4998 62 251 122 125 65 122 188 104 153 171 171 239 328 108 97 168 114 141 193 180 176 153 149 257 338 209 178 135 69 147 128 180 250 105 173
4599 173 115 162 171 137 111 204 315 263 235 52 118 157 197 246 103 109 32 67 135 103 116 65 140 117 138 202 141 143 243 246 167 107 94 15 103
4188 103 134 89 125 189 124 46 141 78 102 128 64 47 171 189 104 143 165 80 162 189 212 120 83 87 155 97 187 51 99 89 185 132 56 11
3789 11 146 178 52 207 96 69 68 306 261 177 16 105 175 133 83 171 144 257 256 78 11 107 114 92 109 48 17 110 204 82 51 154
3413 154 137 140 46 379 262 55 127 97 58 63 95 153 114 93 139 76 65 222 380 138 62 127 80 76 120 115 72 91 119 120 203 221 150 60
3014 60 117 67 130 227 238 172 54 205 88 190 169 155 190 187 50 246 190 48 152 199 105 23 115 132 69 140 172 247 70 159 233
2650B33N7k68R7r1O2O8qq4L1P7r1J08P7r1j08J55Lj08J24j4lp4j30Q5J1J38p6O6j20qr2J32
2275A58pl7J44NJ3j80N0q5Q0Qj24J38oq8N0Q5j09Qp7L9mJ34Rk5R4j86J03j32K25K4k10P5j30
1887D2R4o4M2J10m3j58O5J26J5j45%J29q4r4Q7o9M8O4R5j59K10j42p5J58j23Q0r8p1J96P2
1535C08j35l0m1L7k1J7O5j01J23P1j78L3N0q5k8K5P3j22n7J35L2p2o5J13r6J25J47P3l24K1
1183I3O3p9L6n8J24l5Ml8p4L7K9j2j5L6Q5o9k9p2J45K5j41J23j53N1P5J47j98l8MP6k7K6q1
796F0P0j07J69q0k3L7J73N8k47R3J6PR5K7j54j33K2OQ2N9q7L5l6k3J8Q0J32j06k1k12K22q0
420A52l9k7M5L5j40Q1J15J31k39K11q6r5J49k1rj47J61j23j9n2Q1J02n7n8j18J20R9p5q4O0
68A53j7o3J09Ln7R8j52J30j58R0J9j21L8M9J1J26J0q0l3ll6m1
$$ plain form
2650 233 290 22 119 28 90 158 150 66 97 174 83 191 268 177 69 224 227 119 243 229 226 152 22 107 118 256 180 246 126 118 26 158
2275 158 151 114 258 263 276 96 146 61 141 149 25 163 157 69 119 204 95 103 26 65 61 195 204 179 273 87 190 58 283 307 97 172 42
1887 42 136 72 114 224 181 23 88 214 229 84 84 213 129 35 122 53 101 165 260 101 311 169 94 252 129 209 111 40 236 308
1535 308 173 143 102 139 118 135 200 99 222 293 115 148 198 113 85 110 183 61 4 139 171 99 34 147 51 176 323 396 72 93
1183 93 156 77 113 55 179 144 148 110 36 73 102 90 75 111 196 127 98 26 171 196 55 178 25 76 151 298 100 62 66 142 115 141 60
796 60 130 23 192 112 89 126 299 357 110 203 219 226 321 348 194 61 83 89 171 230 143 178 142 119 137 217 349 243 222 10 232 152
420 152 113 86 131 166 26 107 222 353 114 325 239 144 293 272 263 116 277 154 135 83 164 266 209 151 33 153 252 177 93 153
68 153 136 73 182 185 128 226 74 204 46 136 155 34 72 121 132 258 268 188 155 152 116 75
-190G5
##PAGE=	F1=-15018
##FIRST=	25169.313707327481097,	5807.6787752999953227,	0
##DATA TABLE=	(F2++(Y..Y)), PROFILE
5808A04K6r1J0J7K1N8k6P0o8pQ4r0O0o5M4o6J47j77L5N1k9p0P2n4J36J16n0j35o6J18M3k2
5432A96l8n8M1r5R4r3k3K19p2q2n7N4K2q0J51R8l3j87O5l3j6J06P6j9K3j20P1M7j29m4LP8
5056A65j48K34l9j4j90K84j52k4o7O7N1j08R3M3J1M9N3k47R2rK1j6L0l8k9l4R0J11P3j38k0
4693A94qj10O8J4QJ26k04P3o8J50p4o3j4J42R7p7p8j55L9N1M2N2j36M7q4L2N0k7N1o1L7m9
4317F5J40K5q2k0J24M3j58K8J2j38N1nrN2O3r3l9L1p2R1M4m3K5M1n8k9O6k0l8L9O0K6r1k6
3918A05K1kM5Rj60J27n6R9o8m4M1J6j6n8J45j14L0k8K18n9p9q6j1R7n2n0J00m5L7P0j68n2
3542A2J29l2kk7l5%O6R1j11JJ15kr5l4K68r0j93O5j0l5j1k1PjJ9Q7l6j04J49J41j95n2P6j2
3143A28j01N7K7q5K1J05J3O3l7o4o0K7o2J07J40o5m1j52J66q0O1qoj0P3j43J44j9j71J41N4
$$ plain form
5808 104 130 39 49 66 87 145 119 189 121 114 198 108 168 103 147 81 228 51 86 137 108 38 110 56 192 308 258 123 57 175 218 196
5432 196 158 100 141 46 140 47 24 243 171 89 32 86 108 28 179 277 244 57 122 89 73 179 255 236 259 139 210 257 128 84 87 165
5056 165 17 251 212 198 8 292 140 116 49 116 167 59 152 195 206 255 308 61 153 144 165 149 179 141 112 78 168 279 352 214 194
4693 194 186 76 144 158 166 292 88 161 93 243 169 106 92 234 331 254 176 21 60 111 153 205 69 116 32 64 114 87 138 77 114 65
4317 65 205 230 148 128 252 295 137 165 177 39 90 85 76 128 191 98 59 90 18 109 153 110 135 176 118 89 155 135 97 136 196 222 131 105
3918 105 126 124 169 178 18 145 89 188 120 76 117 133 117 59 204 90 120 92 310 251 172 86 75 172 120 70 170 125 162 232 64 12
3542 12 141 109 107 80 45 45 111 202 91 92 207 205 110 76 344 254 61 126 116 81 70 49 56 55 74 161 125 21 170 311 116 64 140 128
3143 128 27 84 111 26 47 152 165 228 191 127 67 94 32 139 279 214 173 21 187 107 168 160 154 144 217 74 218 199 28 169 223
2779B23j49n9Q7J3m4P8j7R8j72R2J02R2k98O9o2J1R6k3o3l3J02j05J46N7r9q2J88o1j15J32
2427B04M1l5n7j01J1N6K14j14M7j63K5r4P9M0m2K07j6lk12K1m8J00K3j19R5kr4QJ04r5K1m5
2052E6l9O9J73j8p0Q6j81J48j84K47lj94P3r6J05j24O6R1Qj72M7J46K8k20Q9J52j45p9L5l5
1700E9QP7J04j74K39j26j08J35p8O8q1q4J76J24j70n1l4O2K5k8K6q5J42N3j61qM2r5K6P0r
1336A44r6PJ26m0p2nQ1j31J40J44N9l16L6N0l3M0k1J00q3K5m8k0ol1O3JL2Pj0J0p2Q5kn9P9
925A84j29OQ4J74k29K3rK9n0K8q8J14r9J22o4k1K9J55N4k53J56QQJ25K2k04o1l7j2J23L4j30
549I2P0lp0J2Q4J32p2q9j23J98q8o3n6J36rj25M4R4J43j84K47j08j53J53M4o4j12Q9j13ml2
185G0J05R1j07kr7J02Q4m6j26J17j4q0J11l1o4Q5j08J64j83L1L8j21J01K9j7J09J6p3n8Jq
$$ plain form
2779 223 74 15 102 115 71 149 132 230 58 150 252 344 46 115 53 64 160 137 74 41 143 38 184 241 142 60 248 187 72 204
2427 204 245 210 153 52 63 119 333 219 266 103 128 34 113 153 111 318 302 299 87 108 60 160 183 64 159 157 63 71 175 80 101 56
2052 56 17 86 259 241 171 257 76 224 40 287 284 90 163 67 172 48 114 205 213 41 88 234 262 42 131 283 138 59 94 59
1700 59 67 144 248 74 313 187 79 214 136 204 123 39 215 339 169 118 84 146 171 143 169 84 226 279 118 110 152 57 83 153 144
1336 144 48 55 181 141 69 64 145 14 154 298 357 41 77 127 94 134 113 213 130 155 107 87 81 50 113 114 146 153 143 153 81 166 164 105 184
925 184 55 61 145 319 90 113 104 133 83 111 23 137 38 160 96 75 104 259 313 60 216 224 232 357 379 175 114 77 65 188 222 92
549 92 162 159 89 101 185 317 245 156 33 231 143 80 24 160 151 26 70 164 307 123 370 262 109 262 306 242 130 219 106 102 70
185 70 175 266 159 157 60 162 246 200 74 191 177 97 208 177 113 198 90 254 71 102 140 19 120 149 132 241 257 184 126 127 119
-178A19k8
$$ plain form
-178 119 91
-190I1
##PAGE=	F1=-15120.3
##FIRST=	25169.313707327481097,	5807.6787752999953227,	0
##DATA TABLE=	(F2++(Y..Y)), PROFILE
5808F5O5p4j0N8pM7l5J19j20j5R9q7Q4p6K3m7J25j61P2J6l9o0M3o5J71Q9k6j36r6J50O3p4
5432A61qm2L6p8R7j43P3J50p4j2j39M8M2o2J28J24n2j60O0n7rJ29O6j39M9q5J22J9j71J7l6
5068E4J35j02J34n8J8r2K23j53n3p7P5L2j11J02J00QK3K3j53J09j01N3k3no7n1l7J73J17N0
4716C46j42jJ5j35M2L1jJ94k36L4n9K01r6j24JJ83Q3j14j19j0o4K0Q6Q1j54Q3j04L1L9m6J13
4352A78j04O6r9K04j8q6k5J43P8k33J25Qj74M4l1J8J3N8j00K1k7j6O8N4pO0n8j04R6J2p1J1
3977A04MQ7K0p7j3P6j07J01m8r4J29r3J06p8PR3q2q4L1J03q7O6o0K15r6m2k3m2L0m6n3J36
3601A83m7j1J19j83k0J22k8Rr8nK2L6J01r8K0J18J9j95L3J90m4j65K8M1l7l4lm0k4N4J06%
3225A69j15L4J36j29l3Q0J3j31L4R1j06J7J05J3O2p7n0J6q2l7J38J64j14l1j38J35n4M2J1
$$ plain form
5808 65 130 56 46 104 97 144 109 228 108 93 192 105 189 113 136 89 214 53 125 141 102 42 85 20 191 280 254 118 22 172 235 161
5432 161 153 111 147 69 166 23 96 246 172 160 21 69 111 49 177 301 249 89 149 92 83 212 278 139 188 103 225 244 73 90 54
5068 54 189 87 221 163 181 89 312 159 106 29 104 136 25 127 227 235 258 281 128 237 136 189 166 161 94 43 6 179 296 346
4716 346 204 203 218 83 125 156 155 349 113 147 88 289 193 69 70 253 336 222 103 93 29 49 135 216 62 145 41 72 111 65 178
4352 178 74 140 41 245 227 141 116 259 337 104 229 237 63 107 76 94 107 165 65 86 59 43 111 165 158 218 160 56 152 164 93 104
3977 104 108 195 215 138 125 201 94 195 147 53 182 89 195 117 124 217 135 51 82 185 98 164 104 319 223 181 158 116 146 100 47 183
3601 183 136 125 244 61 41 163 135 144 46 41 63 99 200 102 122 240 259 64 97 287 243 78 106 147 110 76 73 33 9 63 169 169
3225 169 54 88 224 95 62 142 155 24 58 149 43 60 165 178 240 163 113 129 47 10 148 312 198 167 29 164 110 152 163
2885A63j7n1J28r8N7Rj73J68P3j99k0M6K7m2P8m9R2j24O9J15J29k75Pl3J6J30j03jq9J15q2
2521F6P6M0q9J5J35j23j01J31Q1p2l0k5o3P7K72j28j2j83Q6q4j5J04m6K44n1j2k22oj6R7N8
2157B04q8J6Jp9JR3q5N1m0l8P9K01n5j06O6j62J94k35K58k6j64M4j9Q5j51O3N6O6j39QJ41
1793B40J9k43J53J80j77j12J2j5l0Q5J05j70K14q1j22J10l5M6o6o4J36J63j88o1l6O5P9n9
1465A48k2p7J62K0j22k2K9r9P2Q9p3J1JJ04j13o8O7L5j05R6J32L9k52JM2K5L2L1N9j28L1l3
1089A12L0n7k7J34l4K7o6L8M1n4KrQM3j02j1N3J87k45Q7j4l3n7J1LR9q3M6m1jJ4J17L9j95
690F2J56orJ64J7k41Rp6jJ28J0j85Q9M8j17OR7J02l2j50j4J41p8p3rJ32j8n0l3K9J47j08K72
303D09j42j77J15J13j22n0Mp9%rR9P6j32Q0j02R5M2k0j40J70j6j03J12n5o3N4n8J92j96k3
$$ plain form
2885 163 146 95 223 125 182 191 18 186 259 60 40 86 113 71 149 100 192 68 137 252 381 106 113 80 96 226 123 122 33 148 66
2521 66 142 182 93 108 243 120 19 150 231 159 129 104 41 118 390 262 250 67 153 69 54 158 112 356 305 293 71 65 49 146 204
2157 204 116 132 133 54 55 148 63 114 74 36 115 316 261 155 221 59 253 18 276 250 86 130 111 196 45 108 164 230 91 99 240
1793 240 259 16 169 349 172 60 72 57 27 112 217 47 261 180 58 168 133 179 113 49 185 348 160 99 63 128 207 148
1465 148 126 49 211 231 109 87 116 17 89 178 105 116 117 221 108 40 107 142 37 133 265 304 52 53 95 120 152 183 242 114 145 112
1089 112 142 85 58 192 158 185 119 157 198 144 146 137 145 188 86 75 128 315 70 157 143 110 53 64 67 166 83 129 88 87 101 218 257 62
690 62 218 212 203 367 384 143 152 76 75 203 213 28 117 165 48 54 151 253 221 71 57 198 120 47 38 170 152 102 69 98 245 137 409
303 409 267 90 205 318 196 146 150 71 71 62 161 237 105 185 83 178 220 200 60 230 214 111 223 168 105 159 101 293 97 74
-49G4N6q3J12J5l2O8K4n3p8J1J1l1
$$ plain form
-49 74 130 47 159 174 142 210 234 181 103 114 125 94
-190I4
##PAGE=	F1=-15222.5
##FIRST=	25169.313707327481097,	5807.6787752999953227,	0
##DATA TABLE=	(F2++(Y..Y)), PROFILE
5808B3R3l0m4R2l6M6l0J43j51lP7p9J19j02kl1R4j06Q8k4q0m2L2rJ57M5J3j54n6J13P8j04
5432A30Kk7K8l6Q4j71J49O4o5O7j57k0P4j9O1J34p6r8O3p0OJ05N8k44O0m1J80k5j58P0q9J71
5056B10m0K0p6O3oJ39j35n9j01R9J6n5J7J74j3pMn1R2j49M1lk3j07MK8R7J25J8j40J6K8j37
4669H9J3K4K1K40k31j3n3K00o9j88J5K07P5j48j31J00r8k2J34P8j73J14j24K6N6q9J56j54
4340E5J42j68K19n3q2J2J44R4k84J86qj79N8k2K9o8L9p8R1n5J3K7N4K6O6j36K4Q8o5j12M2
3977I9j5J05J0o1JJ35j54N5p8rJ15j10J05p9N5J19j58j05P5N2l4O8q8K30j43PK0l7q4k3n1
3613B2J84l3K2Q5k21J8Q4jK6j26nLK9J06q5K5J18L8k65P8J17J0j31k9J12m5n3M2k3o3K5R7
3237A61M2q2j15J34n5j7O3K1j03L1J30j22kO1J0P1q7k0Q2j81j0J38J67j15n2r4Q0l8M4L6m5
$$ plain form
5808 23 116 86 42 134 98 144 114 257 106 103 180 101 220 118 116 85 179 73 161 137 57 15 47 38 195 240 253 99 43 156 234 130
5432 130 132 105 133 97 181 10 159 223 158 225 68 48 122 103 164 298 222 124 187 117 123 228 286 42 102 61 241 216 58 128 39 210
5056 210 170 190 114 177 171 310 175 116 15 114 130 75 92 266 253 246 250 199 291 142 183 180 157 50 54 82 179 304 322 182 198 226 89
4669 89 102 126 147 387 156 143 90 290 221 33 48 255 330 182 51 151 53 31 165 243 70 184 60 86 142 53 209 55
4340 55 197 29 248 195 113 125 269 363 79 265 257 78 136 114 143 75 114 36 127 72 85 112 166 192 258 122 146 234 169 57 99
3977 99 84 189 199 138 139 274 120 175 97 88 203 93 198 119 174 293 135 30 105 157 123 191 103 333 190 197 217 180 96 73 22
3613 22 206 173 195 280 59 77 161 160 186 60 55 58 87 193 108 133 251 289 24 102 219 229 98 69 181 136 83 125 102 39 64 161
3237 161 203 121 6 140 85 68 131 152 49 80 210 88 86 147 157 228 141 121 203 22 12 150 317 202 150 56 136 98 142 178 133
2873A33p1J36m8oJ0j30J82J05k16k1mN5m8O4n6N6l7K3J00J61k29n5kN3J50j94M9j09J19l7
2521A33n4K4o3J13N9j71j4P0R8j02J9L2p1L8L01j17r1j83J58n2j11J44l9K50r4j7k06J4k2
2181D6O1R9l3q1%m3M0L4p4J04q1RN7K22r6j31L9j17K17k41K24n0j19nM8P4j34L6K3J02r2k3
1805A15J19j2j58J27K06j76j75M5m7PJ6J03j39J34k3j03P9jK3m6l8J08J80j91o7m9O0J29q0
1465A46o4o3J60k4o8j2K1k6L3O5r2R5MP8j72o2J36jp8L5J10K1j82l3L6R2J1P3J5j54J6MO0
1077A80r7K5J44n3J9j12N6N9j3q6nM9L0q5mj2J93k29J24Mq7k3k3R6O6r2j4j9K9j5P3J9j09
690H8J23k0l9K13Lk66P5q3K5R5lj44j3J11j35K2Q2N9lj42K3P6n3m1L0P9J7Rp1o5J27l1K92
303D40j69j67M6J60j64J2p9k8nK2O2N5j16J46j19J07k6Mj32J99nj22J08p9n0K2j3K09k06m9
$$ plain form
2873 133 62 198 150 144 154 24 206 311 95 74 70 125 77 141 85 141 104 127 227 388 159 104 102 155 305 111 160 51 170 133
2521 133 79 103 40 153 212 41 27 97 195 93 112 144 73 111 412 295 204 21 179 127 16 160 121 371 277 260 54 68 46
2181 46 107 206 173 92 92 49 89 123 49 153 72 81 138 360 264 133 172 55 272 31 255 205 86 81 129 203 69 105 128 230 138 115
1805 115 234 222 64 191 397 221 46 91 44 51 67 170 31 165 142 39 118 117 140 94 56 164 344 153 86 37 97 226 146
1465 146 82 19 179 155 87 75 96 70 103 168 76 171 175 253 81 19 155 154 76 111 221 242 60 27 63 155 166 239 254 100 116 120 180
1077 180 83 108 252 199 218 106 162 221 208 122 117 166 196 111 107 95 288 59 183 187 100 77 54 150 216 124 110 91 120 105 178 197 88
690 88 211 191 152 365 368 102 177 94 119 214 211 67 54 165 30 52 134 193 190 48 71 147 94 53 83 162 179 188 117 52 179 148 440
303 440 271 104 150 310 146 158 79 51 46 68 130 185 69 215 96 203 177 181 49 248 243 121 229 150 100 122 109 318 112 63
-49F3O1n7J10J8k7JL9k2q7K0J2m5
$$ plain form
-49 63 124 67 177 195 168 169 208 186 99 119 131 86
-190H6
##PAGE=	F1=-15324.8
##FIRST=	25169.313707327481097,	5807.6787752999953227,	0
##DATA TABLE=	(F2++(Y..Y)), PROFILE
5808C1O3L1q6J03n1N0rJ40j73L1K3n0J44j35k2j8N5k8Q4n6j11M3k3P0R9jN8j96OO0Q1j04j4
5420I5j3K2J5N8j65J99k6n0J34j54p7J04nOJ36j06k7P8p2RN5N9j66r4J8K23p7r0P1r3J49K
5045B18n6p6R7N9M5j01m6r5J11J2m4l8K13m2l6kK1N7j39mK5rj46Q7L9K0J30j5j32J8L9j14
4669I6rmN5K47j99l3o3J59j0j89j7K00P8j58p7J12j10J5J19M0j77J42j37J6Q9j06J36j63K08
4329B60k49K02o8q1R6J28Q2k89J84l0j46O9oN6j04m5k8J41o8J0kM8M9M1j75J82M5j32j11K3
3977H2j1J07kl8J7J71j35o4q9P2R3j04Q8o4Q8J22k10m7M6PJ8M9r5K40j73M2M5j7j95Rm3K16
3601B25k1P1L5k58O5J4L5N4j15j9m4M0R5o9J5J17N1k52N7N9O1j08o7J67n1n7O9k2q2J1P0Q0
3225B26l6r6j4J3lK3Mo5O8J46j44k7J0KQ3o1J8J14j75p9J35J47p9q8m9L5l1N8O5q3o5R2mk4
$$ plain form
5808 31 94 125 39 142 91 141 132 272 99 130 153 103 247 112 90 72 127 99 183 127 16 59 36 106 205 204 262 66 72 132 213 109 95
5420 95 82 104 119 177 12 211 185 135 269 115 38 142 137 143 279 173 146 224 152 161 216 275 109 15 33 256 179 89 160 67 216 218
5045 218 162 86 183 242 287 186 140 45 156 168 124 86 299 257 221 219 240 297 158 154 179 170 24 111 150 170 300 285 153 171 210 96
4669 96 87 83 138 385 186 153 90 249 239 50 33 233 311 153 76 188 78 93 212 252 75 217 80 96 185 79 215 52 260
4329 260 11 213 145 64 160 288 370 81 265 235 89 158 152 208 104 59 31 172 104 114 112 160 209 250 75 257 302 170 59 82
3977 82 71 178 176 138 155 326 191 127 38 110 203 99 187 123 211 333 123 76 122 129 147 196 101 341 168 210 255 238 43 52 9 225
3601 225 204 275 310 52 117 131 166 220 105 86 42 82 177 108 123 240 291 39 96 155 216 108 41 208 157 100 169 147 65 76 146 226
3225 226 190 94 80 93 90 113 117 52 120 266 122 95 105 107 190 129 147 261 86 7 142 289 210 122 73 108 77 135 200 117 52 144 140 116
2826A16k9m2J86J43k25m1m7Q1n1L9n7J7O9k7M2J82j66j11K8R5J56k60P7j18J27Oj31j6J0J28
2474A81j3j10lLR8o7N4K8o4j3L01q8j67j12J72lj43J05k7K34j35k1j61O4m8qJ32L6j60j8N
2110E2O4j7n4J54j39N5L3K32j33j40J1m9K08k18J64o9o6n8Q1P8q5QJ9Q4m6m8R4n6n0Q6K19
1746D14j52k19R2j15Q1q3R9q1L3Pm3L8K0Lql9J21J68j80p6o2P2J44r6o9k1R1p1j4J0J7L5J1
1359A27ko1J33K2N3j97m6J62j5p6j3P4Rj20l3L3J43k2R1k1j55lM3O6j17P5J31m8%j20M4O3
984B20M4j55j2P1M2p4Pr5J94j67J12L8j07J0j5J16L6j16m4jN9o4L8Ll2R3l3p3K61j5k84J39
608A96o5L9N0j6p7j10J47j03L6M6J0Mm9l2K7k2%K8L3P4M9j01q7M5K9L05j74j45oJ57j63L6
232A61j41J6j1O3OK9m8J61j42J34j03K9j12J94K7j20Q5j10k1lK1K13k21l7N0m6R2M7j8p0O0
$$ plain form
2826 116 87 45 231 374 149 108 61 142 91 130 73 90 159 132 174 356 190 79 107 202 358 98 175 57 184 190 59 43 53 181
2474 181 168 58 55 58 156 89 143 171 107 94 395 307 140 28 200 197 54 159 132 366 231 210 49 113 65 57 189 225 65 47 52
2110 52 116 99 45 199 60 115 148 380 247 107 118 69 277 59 223 154 88 30 111 189 104 112 131 215 169 121 215 159 109 195 414
1746 414 262 43 135 20 101 18 117 36 69 76 33 71 91 94 86 47 168 336 156 80 18 90 234 138 69 48 139 68 54 64 81 116 127
1359 127 125 64 197 219 272 75 29 191 176 100 87 161 170 50 17 50 193 171 262 241 86 83 126 192 75 150 281 233 233 113 157 220
984 220 264 109 97 168 210 136 143 48 242 75 187 225 118 128 113 229 265 149 105 104 163 99 137 140 108 201 168 95 356 341 57 196
608 196 131 170 220 204 127 17 164 61 97 143 153 157 108 76 103 81 81 109 142 216 265 164 77 122 151 456 282 137 131 288 125 161
232 161 20 36 25 88 94 123 75 236 94 228 125 154 42 236 263 143 228 118 97 94 115 328 107 70 120 74 166 213 195 125 185
-132A85J6q7J9Qo4
$$ plain form
-132 185 201 114 133 141 77
-190G7
##PAGE=	F1=-15427.1
##FIRST=	25169.313707327481097,	5807.6787752999953227,	0
##DATA TABLE=	(F2++(Y..Y)), PROFILE
5808E8J5R0j12P0m2N3K6J14j84P4m8JJ49j67k9j6J6N4O5p4l0N8n3P8N3l2Q8k37M9K2O5p7m5
5420E2nK3N9K4j11K08j04m2J86j32j20J17j7k0J40j45L6J00o7Oj5P2m8j39k1K22j24j2N9p9
5068A03R6K1r3m4J05J04m1o1l1o9J12J7o8l9K02o6o0NN2J3q3m8L6K3j53J12N1m4J32l8j18
4704A28kM5o9k1l4P0K21j50k2p8Q9O2j52n4J53R2j39k5Q8j06M7R8pj61J57j38NJ21r5O9r7
4340I5K21k76J12o3o1J80J06M8k57J26m7q6P0J1R3q6r6m1J64q1Jk7M5O1rj46K80Pj76q2l4
3977E2K4Q2j2mL4J70q3j60p1Q8O0p5O4l6R7J07k20oJ9k3M9K5p0K20j70M9O0Pj85k3n6K14j8
3589B09J10ok72J11o9O7Q9j04j9n3K1O6n1%J12N6k09K9J5J03j09j4J40m8m2O4k9q8K8M0Q9
3225B36J7r2j07O0Rk8l8j5J06J52j55n9l1j0R0lM6J09j47j23J12R8k7j10j5J0k7O8R7j16o1
$$ plain form
5808 58 73 163 51 121 79 132 158 272 88 162 114 115 264 97 68 52 68 122 187 113 83 141 88 166 219 187 275 38 87 109 174 97 52
5420 52 47 70 129 153 42 250 146 104 290 158 38 155 138 118 258 113 149 249 182 188 173 245 197 58 37 259 135 123 182 103
5068 103 199 220 127 83 188 292 251 190 159 90 202 219 151 112 314 248 188 193 245 258 175 127 163 186 33 145 196 152 284 246 128
4704 128 126 171 102 81 47 117 338 188 166 88 177 239 87 33 186 278 139 114 202 96 143 241 234 73 230 92 97 218 123 192 95
4340 95 316 40 152 89 28 208 314 362 105 231 184 98 168 179 272 186 90 49 213 132 133 106 151 212 203 57 337 344 168 86 52
3977 52 76 158 146 142 176 346 263 103 32 120 180 105 169 133 230 337 117 111 130 107 156 181 111 331 161 210 270 277 92 69 13 227 209
3589 209 319 313 41 152 83 150 239 135 116 63 84 150 99 99 211 267 58 87 102 205 96 82 222 174 132 196 167 79 107 147 236
3225 236 253 161 54 114 123 95 57 42 148 300 145 86 55 45 135 132 178 287 140 17 129 227 200 90 75 85 58 126 223 107 46
2862D6K0L1J5j03O6J88J67k36o2o6Q5m7J7o8JJ72p1n3J88r9j53N0J34J47k83P8j13J28M5j08
2509A16k7K0Q9n5j7o6k3J05K4L6j7o1n7K80n2k14qJ44M4j88Q5k2K12j66k7r7R1o0n3J23J02
2146B61j77m6K8N2m4k9J85j67P0OK29j57j29j7K1J80j86J01p7j3o5L3R6k2lL3K5ro8P7r8N2
1770A42M0K11j14k06J04j58J20q8K2j8P4r3PpK7j2N1q0J72J40j64q9m6R3J09j10l0j9K8r2
1418A4J2M0nQ5Qr7J3J24M8L3j85l8J48j9p9l8K6Jo6J0L8J49n5Q0m3j32J6M5M7j17J15J03k4
1031B57l3r9K2N3J04j89m1Q0P6o3J5j56J57q2O9P1j01L2KJ11J1j43m6J5Q2j29K4mK6P0m4r9
655D8K90k3k99J94l4L6Ml7j9q6Q5p2M7L7l7pJ8p1OKJ6K1%J24P6j29o8l4N3L12j55j23l6J13
256B52j13J1j15j3J2R1n9kL5J51j74J66j67N8r4J57Q8j00L9j42J7j9M3K03k39PK3m4N4R8k1
$$ plain form
2862 46 66 97 112 9 75 263 430 194 132 66 151 104 121 53 54 226 155 102 290 191 38 88 222 369 86 164 51 179 224 116
2509 116 89 109 198 143 126 60 37 142 166 202 185 124 67 347 295 81 73 217 261 73 158 136 348 182 155 58 149 89 36 159 261
2146 261 84 38 66 118 74 45 230 63 133 139 368 211 82 65 86 266 80 181 104 91 26 59 155 133 130 163 188 179 111 188 90 142
1770 142 182 393 279 73 177 19 139 51 73 55 129 36 43 36 63 51 102 22 194 334 170 81 35 128 237 127 97 78 106 14
1418 14 26 66 61 146 154 57 70 194 242 275 90 52 200 181 102 64 90 91 25 35 73 222 167 247 204 72 88 133 180 63 178 281 257
1031 257 224 125 147 200 304 115 74 154 230 167 182 26 183 101 170 241 140 172 174 285 296 153 107 122 204 75 99 95 121 191 147 48
655 48 338 315 16 210 176 212 216 179 160 74 159 87 134 171 134 127 145 74 80 82 98 119 119 243 319 190 122 88 141 453 298 175 139 252
256 252 139 150 35 22 34 125 66 64 99 250 76 242 75 133 39 196 284 184 223 81 98 79 122 325 86 93 116 72 126 224 203
-108B03j11P6N4q6OJ6q6
$$ plain form
-108 203 92 168 222 136 142 158 72
-190G2
##PAGE=	F1=-15529.3
##FIRST=	25169.313707327481097,	5807.6787752999953227,	0
##DATA TABLE=	(F2++(Y..Y)), PROFILE
5808F9j1J33j15lpN9N8P5j71J06j13N6J32j90j4k8k1J22L3o6K8Q5q2O6K9m1R5k17K1J1L0m1
5432H8n8j3K0Q8j0m2J97j57m7K26j04j52J12m0j8J52j82P7J19n7%r5R9M4j39o4J97j52O0N0
5080A99p2L7J5r9LJ01J27j01k5k3k5R5K6j07k0J71p8p1K4L7k2mn4J0N1j28Q4O4q9J33m4r5
4704A20k7L2k0k6m0M0J77r3Op6LJ25j13n5O2J16j02OO2q8O1O9m2j40J57j21lJ43p3j6PK03
4329C54k65Km2M1J68Q2Qk21M6m0l5O7L4J18n6r9r5J78r3no1N5O4o8n5K88j6j90o0r0P7L8j6
3941A13L6M9J35k0j76n6L7J9l3N6j4Q6Q1j65k2Ol1M6J5k8J60j30K6P2K8j19n8j00J96k3J32
3578C18l4k49J42j15O6J16j10mj8k6K9k9j0R6N2j68L0k2J29j36R0P6l8j4L2l7q1O9J7O2P1
3214C04j01j60R5J9p6n3M2R4J46j49r3j6l3N7O5O4P2j04j20P4J2K3j04JJ1k3O6J27j29q3k
$$ plain form
5808 69 58 191 76 73 66 125 183 258 87 193 80 136 268 78 64 36 15 137 170 104 132 217 135 201 230 189 284 67 88 99 129 88
5432 88 30 17 37 125 115 73 270 113 66 292 188 36 148 108 90 242 60 137 256 199 199 104 203 247 108 44 241 89 149 199
5080 199 127 164 179 80 83 184 311 210 185 162 137 232 258 151 131 302 224 153 177 214 192 188 134 144 195 67 151 215 126 259 215 120
4704 120 93 125 105 79 39 79 256 163 169 93 96 221 108 53 115 231 129 135 197 109 170 239 197 57 214 93 90 233 160 144 151 354
4329 354 89 91 49 90 258 340 348 127 173 133 98 165 199 317 261 162 67 245 152 147 86 141 205 137 82 370 354 164 104 14 91 129 113
3941 113 149 198 333 313 137 81 118 137 104 160 146 232 313 148 126 132 101 147 162 134 294 164 190 262 290 171 113 13 209 186 318
3578 318 284 35 177 62 128 244 134 130 112 86 115 86 76 172 224 56 86 64 193 57 147 223 185 171 203 166 85 154 171 233 304
3214 304 203 43 138 157 81 28 70 164 310 161 68 52 19 76 141 205 277 173 53 127 139 162 58 59 70 47 113 240 111 28 26
2850B6J1R0l2J5J87J65k44p7n9O5l7Pr4L2K35j05j57J74l8j49K6J68J25k63N8q6J18P2o4l2
2498A37J6N7o0K5j31j1J37P3J3o5o8r0K54k3j97M2J18P9k43R8l5J96j78l4m8R6n6l2N4J51
2146B75j61n1K5Km3j1J96j35L9k6K11j64r1n2P8J46j49M5p0K8m1l0Q5M0NL8l3J1q0O9q1Q7
1770A62lJ80p2j54R4j63J14n5m9L1J51j21n4m4K6lR2j11K03J12j48j01k6J16N4j11Rl5jk9
1418F4j5M1n2J23J7j34M6Q5O1K4j48m0J03k0p2l8%k8oM4N2J30q3M1m2r2O9J5Rj06J39P8Jp6
1019A90n6PL0J51j90q6R0J11m7K4j37L4nK6Q7q2M9J7R0oj64k8L3R7j94L6nN8N2n5j07K81p
631B94k70J92KJ5l1p0K8m8L6m9N7L9p9j8N3q3rL3J1J6j9J47R7j50l6q0M3L06j18j02o5O3n1
244A54k6o4m5N3J06j20k0Q3J36k03J77j97R4r1J14J62p4k2j31J7k9N3J85k44N6j5m2lJ58m1
$$ plain form
2850 26 37 127 95 110 297 462 218 141 82 147 110 117 23 55 290 185 28 202 164 15 41 209 334 71 129 43 161 233 169 137
2498 137 153 210 150 175 44 33 170 243 256 191 123 33 287 264 67 109 227 306 63 161 126 322 144 110 62 158 102 70 124 275
2146 275 114 63 88 90 47 36 232 97 136 110 321 157 66 14 92 238 89 134 64 92 51 21 106 146 151 189 156 167 87 156 75 162
1770 162 159 339 267 113 207 44 158 103 54 85 236 115 61 17 43 40 132 21 224 336 188 87 61 177 231 120 129 94 93 64
1418 64 49 90 38 161 178 44 90 175 236 260 112 72 175 155 83 45 45 17 11 55 107 237 154 195 153 61 130 145 154 48 187 265 266 190
1019 190 134 141 171 322 132 46 136 247 200 224 87 121 116 142 229 147 196 213 303 297 133 105 138 235 41 77 72 130 182 127 20 301 294
631 294 24 216 218 233 202 132 160 112 148 99 156 195 116 98 151 68 59 92 103 119 100 247 344 194 158 78 121 427 309 207 142 205 154
244 154 128 64 19 72 178 58 38 121 257 54 231 34 128 37 151 313 239 217 86 103 74 127 312 68 124 109 67 64 222 181
-108A81j05P5R0q4j6M0j14
$$ plain form
-108 181 76 151 241 157 141 181 67
-190F7
##PAGE=	F1=-15631.6
##FIRST=	25169.313707327481097,	5807.6787752999953227,	0
##DATA TABLE=	(F2++(Y..Y)), PROFILE
5808F5qJ43r9p8L0Q3O0M0j30J06j39Q0J07j95J9m4mJ10j2j1K7J13j03M4K7k9P6j63l4K1j1
5444I1j5j3k5j9R0m0K1J73j82o2K59p8j56O9l4j6J63j96Q4J30m5lj55J22R1j29q3J62j54J17
5092A67M7p6j7j0q2N8Q2J27j24%k2K1O7L6j42lJ35p5o3M4j5j6N6l2l2O5p9J9O8j11J36k7p0
4704A32Ok6j4k5l7rJ31l6L1m4n9J35p9j5o0J41o2L2M2o4N1L1n0j31J46q2lJ48n3r1J12J69
4329C67k34n0j5R2J35O3k4k00k4J6m2O7O6J16l6q3j32J78r6qr8P3O2j22K9K53k0j77n2p6Q2
3965A10j0lN5N6Q9L8j59o6lk5RP5j5O7O1p1q7J2j8J6L2oP6o7j7Q8L7m2q0j39J62l5J35m5j89
3554D1J46p8K5J04j40K2L1p1Lj0QN2M1j37O1n6J35j73K06Kk7J8j3l8o4J18j4K5J23j18j73
3190D9J11K8j22L7L2L8J26j24j14K9l5k1J08Q2J2n4q5M8j02N7o6%K6qM6J48j20j07J01o4Q2
$$ plain form
5808 65 57 200 101 23 53 136 196 236 106 212 73 153 260 65 84 40 36 146 134 123 150 263 160 204 231 202 278 115 81 102 91
5444 91 76 63 38 19 109 69 90 263 81 19 278 200 44 113 79 63 226 30 114 244 199 196 41 163 254 125 42 204 50 167
5092 167 214 138 121 111 29 87 169 296 172 172 150 171 238 274 132 129 264 189 126 170 155 139 195 163 131 196 117 136 204 93 229 202 132
4704 132 138 112 98 73 36 27 158 122 153 109 50 185 106 91 31 172 110 142 184 120 171 202 152 21 167 85 82 230 177 86 198 367
4329 367 133 83 68 160 295 358 334 134 110 126 84 151 217 333 297 214 82 260 164 156 58 131 193 71 100 353 333 156 104 28 110
3965 110 100 97 152 208 297 335 176 110 107 82 91 166 151 218 279 208 121 133 115 131 163 157 233 166 149 237 274 232 152 13 175 140 275 230 41
3554 41 187 109 134 238 98 120 151 80 83 73 81 133 174 37 98 42 177 4 210 212 185 203 190 152 88 206 192 217 340 222 49
3190 49 160 188 66 103 135 173 299 175 61 90 55 34 142 224 236 182 97 145 43 100 34 34 60 52 98 246 126 19 120 56 138
2826A38K9k4J83J34k41q8l2K9k5J3j04O7K57j29j54N5J4n1l0J29R1k05K0l3J05P1k3m5K1M8
2474B20n9L8j87L8J63Q0mr5q6p7K04j1j33L8R4R6k72J29p5J88j68l9k9Q6l5jmJ64j34m9L7
2110A17p9j5rJ92o5oo8J79j54k3l1M6J07j05Mn2M9l0M2m6Q3L0K7o5J1p1N5OM0l3J32m0q1P3
1711B20j58R4j5q6O6J91j24j02o3K0K7R7j02J80R4j40j04j4J32kr0K3m6Mk3J1K8r2J41K7p8
$$ plain form
2826 138 167 143 326 460 219 131 99 128 103 116 12 79 336 207 53 108 122 71 41 170 261 56 76 43 148 219 196 151 172 220
2474 220 161 199 12 50 213 293 289 194 108 31 235 224 91 129 223 319 47 176 101 289 121 82 53 139 104 103 99 263 129 80 117
2110 117 38 23 14 206 141 135 67 246 92 69 38 84 191 86 90 38 87 57 99 53 136 166 193 128 139 68 123 129 169 136 268 228 147 220
1711 220 62 156 141 55 121 312 188 86 23 43 70 167 65 245 339 199 95 81 213 211 121 144 98 102 79 90 118 26 167 194 116
$$ [...]
-190A89
##END NTUPLES=	nD NMR SPECTRUM
##END=	
##END=	
