##TITLE=	8gtaZvPpRaWsbfYEk3ASxA.72.ser
TM-VI-106solid Mg+unprotect.-pyrraz. d6-dmso. HMQC

##JCAMP-DX=	6.0	$$ MestReNova 14.3.0-30573
##DATA TYPE=	LINK
##BLOCK_ID=	1
##BLOCKS=	2    
##ORIGIN=	Mestrelab Research S.L.
##OWNER=	hrzepa
##$MNOVA/LINK_BLOCK_TYPE=	ITEM	$$ NMR Spectrum
##$MNOVA/ITEM/POLYGON=	(XY..XY)
5321,5835
8722,5835
8722,8208
5321,8208
5321,5835
##$MNOVA/ITEM/Z=	0
##$MNOVA/ITEM/ANGLE=	0
##TITLE=	8gtaZvPpRaWsbfYEk3ASxA.72.ser
##JCAMP-DX=	6.0	$$ MestReNova 14.3.0-30573
##BLOCK_ID=	2
##DATA TYPE=	MNOVA NMR VIEW DATA
##DATA CLASS=	MNOVA VIEW DATA
##$MNOVA/2D/THRESHOLD=	4.0103640556335449219
##$MNOVA/ITEM/ZOOM/X=	-0.98001264966690615488,	11.003459999979801509
##$MNOVA/ITEM/ZOOM/Y=	-9.7479769829748601495,	190.10579999390242278
##END=	
##TITLE=	8gtaZvPpRaWsbfYEk3ASxA.72.ser
##JCAMP-DX=	6.0	$$ MestReNova 14.3.0-30573
##BLOCK_ID=	3
##DATA TYPE=	nD NMR SPECTRUM
##DATA CLASS=	NTUPLES
##NUMDIM=	2
##ORIGIN=	Bruker BioSpin GmbH
##OWNER=	nmr
##.OBSERVE FREQUENCY=	400.41200205000001233
##.OBSERVE NUCLEUS=	^1H
##.SOLVENT NAME=	DMSO_weak
##.PULSE SEQUENCE=	hmqcgpqf
##LONGDATE=	2021/10/20 17:18:37.000
##.ACQUISITIONMODE=	SIMULTANEOUS (DQD)
##$ORIGINAL FORMAT=	Bruker XWIN-NMR
##$MNOVA/SCALES_VERSION=	9
##$PARAMETER FILE=	(acqu2s, ASCII, /private/var/folders/f6/rjf_tdyn2v98c5c0wvkgn4s80000gn/T/8gtaZvPpRaWsbfYEk3ASxA/72/acqu2s, 0)
$$ ##TITLE= Parameter file, TOPSPIN		Version 3.2
$$ ##JCAMPDX= 5.0
$$ ##DATATYPE= Parameter Values
$$ ##NPOINTS= 129	$$ modification sequence number
$$ ##ORIGIN= Bruker BioSpin GmbH
$$ ##OWNER= nmr
$$ $$ 2021-10-20 17:28:07.775 +0100  nmr@CZC10666PP
$$ $$ /opt/topspin/data/agmb/nmr/Oct20-2021/72/acqu2s
$$ $$ process /opt/topspin3.2/prog/mod/go
$$ ##$ACQT0= 0
$$ ##$BF1= 100.683175
$$ ##$FnMODE= 1
$$ ##$NUC1= <13C>
$$ ##$NusJSP= 0
$$ ##$NusT2= 1
$$ ##$NusTD= 128
$$ ##$O1= 9059.81359838393
$$ ##$SFO1= 100.692234813598
$$ ##$SW= 200.226863172749
$$ ##$SW_h= 20161.2903225806
$$ ##$TD= 128
$$ ##END=
$$ 
##$PARAMETER FILE=	(acqus, ASCII, /private/var/folders/f6/rjf_tdyn2v98c5c0wvkgn4s80000gn/T/8gtaZvPpRaWsbfYEk3ASxA/72/acqus, 0)
$$ ##TITLE= Parameter file, TOPSPIN		Version 3.2
$$ ##JCAMPDX= 5.0
$$ ##DATATYPE= Parameter Values
$$ ##NPOINTS= 12	$$ modification sequence number
$$ ##ORIGIN= Bruker BioSpin GmbH
$$ ##OWNER= nmr
$$ $$ 2021-10-20 17:28:11.422 +0100  nmr@CZC10666PP
$$ $$ /opt/topspin/data/agmb/nmr/Oct20-2021/72/acqus
$$ $$ process /opt/topspin3.2/prog/mod/shimcntl
$$ ##$ACQT0= 1000000
$$ ##$AMP= (0..31)
$$ 100 100 100 100 100 100 100 100 100 100 100 100 100 100 100 100 100 100
$$ 100 100 100 100 100 100 100 100 100 100 100 100 100 100
$$ ##$AMPCOIL= (0..19)
$$ 0 0 0 0 0 0 0 0 0 0 0 0 0 0 0 0 0 0 0 0
$$ ##$ANAVPT= -1
$$ ##$AQSEQ= 0
$$ ##$AQ_mod= 3
$$ ##$AUNM= <au_zg>
$$ ##$AUTOPOS= <54 >
$$ ##$BF1= 400.41
$$ ##$BF2= 100.683175
$$ ##$BF3= 400.41
$$ ##$BF4= 400.41
$$ ##$BF5= 400.41
$$ ##$BF6= 400.41
$$ ##$BF7= 400.41
$$ ##$BF8= 400.41
$$ ##$BYTORDA= 0
$$ ##$CAGPARS= (0..11)
$$ 0 0 0 0 0 0 0 0 0 0 0 0
$$ ##$CFDGTYP= 0
$$ [...]
$$ 0 0 0 0
$$ ##$ShimPowMaxUC= (0..63)
$$ 130000 130000 130000 130000 130000 130000 130000 130000 130000 130000 130000
$$ 130000 130000 130000 130000 130000 130000 130000 130000 130000 0 0 0 0
$$ 0 0 0 0 0 0 0 0 0 0 0 0 0 0 0 0 0 0 0 0 0 0 0 0 0 0 0 0 0 0 0 0 0 0 0 0
$$ 0 0 0 0
$$ ##$ShimPowMaxUG= (0..63)
$$ 524287 524287 524287 524287 524287 524287 524287 524287 524287 524287 524287
$$ 524287 524287 524287 524287 524287 524287 524287 524287 524287 0 0 0 0
$$ 0 0 0 0 0 0 0 0 0 0 0 0 0 0 0 0 0 0 0 0 0 0 0 0 0 0 0 0 0 0 0 0 0 0 0 0
$$ 0 0 0 0
$$ ##$ShimPowRcbType= 3
$$ ##$ShimPowRes= (0..63)
$$ 1e-20 1e-20 1e-20 1e-20 1e-20 1e-20 1e-20 1e-20 1e-20 1e-20 1e-20 1e-20
$$ 1e-20 1e-20 1e-20 1e-20 1e-20 1e-20 1e-20 1e-20 0 0 0 0 0 0 0 0 0 0 0 0
$$ 0 0 0 0 0 0 0 0 0 0 0 0 0 0 0 0 0 0 0 0 0 0 0 0 0 0 0 0 0 0 0 0
$$ ##$ShimPowRng0= (0..63)
$$ 1 1 1 1 1 1 1 1 1 1 1 1 1 1 1 1 1 1 1 1 0 0 0 0 0 0 0 0 0 0 0 0 0 0 0 0
$$ 0 0 0 0 0 0 0 0 0 0 0 0 0 0 0 0 0 0 0 0 0 0 0 0 0 0 0 0
$$ ##$ShimPowRng1= (0..63)
$$ 1 1 1 1 1 1 1 1 1 1 1 1 1 1 1 1 1 1 1 1 0 0 0 0 0 0 0 0 0 0 0 0 0 0 0 0
$$ 0 0 0 0 0 0 0 0 0 0 0 0 0 0 0 0 0 0 0 0 0 0 0 0 0 0 0 0
$$ ##$ShimPowRng2= (0..63)
$$ 1 1 1 1 1 1 1 1 1 1 1 1 1 1 1 1 1 1 1 1 0 0 0 0 0 0 0 0 0 0 0 0 0 0 0 0
$$ 0 0 0 0 0 0 0 0 0 0 0 0 0 0 0 0 0 0 0 0 0 0 0 0 0 0 0 0
$$ ##$ShimPowRng3= (0..63)
$$ 1 1 1 1 1 1 1 1 1 1 1 1 1 1 1 1 1 1 1 1 0 0 0 0 0 0 0 0 0 0 0 0 0 0 0 0
$$ 0 0 0 0 0 0 0 0 0 0 0 0 0 0 0 0 0 0 0 0 0 0 0 0 0 0 0 0
$$ ##$ShimSysFunc= (0..63)
$$ 1 2 3 4 5 7 9 11 15 16 8 10 12 14 6 17 13 18 19 20 0 0 0 0 0 0 0 0 0 0
$$ 0 0 0 0 0 0 0 0 0 0 0 0 0 0 0 0 0 0 0 0 0 0 0 0 0 0 0 0 0 0 0 0 0 0
$$ ##$ShimSysMatrix= 0
$$ ##$ShimSysType= 1
$$ ##$TFXNUM= 0
$$ ##$TRIPLO2= 0
$$ ##$VTU= 2
$$ ##$VTUETH= <149.236.99.20>
$$ ##$VTUTY= <no>
$$ ##$WBREFAM= (0..15)
$$ 135 116 100 100 100 100 100 100 100 100 100 100 100 100 100 100
$$ ##$WBREFLM= (0..15)
$$ 0 0 0 0 0 0 0 0 0 0 0 0 0 0 0 0
$$ ##$WBREFPH= (0..15)
$$ 71.66 -68.25 0 0 0 0 0 0 0 0 0 0 0 0 0 0
$$ ##$WBSGU= (0..15)
$$ 0 0 0 0 0 0 0 0 0 0 0 0 0 0 0 0
$$ ##$XFAC= 2
$$ ##END=
$$ 
##$DECIM=	4160
##$DSPFVS=	20
##.ACQUISITIONSCHEME=	NOT PHASESENSITIVE
##NTUPLES=	nD NMR SPECTRUM
##VAR_NAME=	FREQUENCY1,	FREQUENCY2,	SPECTRUM
##SYMBOL=	F1,	F2,	Y
##.NUCLEUS=	13C,	1H
##.OBSERVE FREQUENCY=	100.69223481359800587,	400.41200205000001233
##VAR_TYPE=	INDEPENDENT,	INDEPENDENT,	DEPENDENT
##VAR_FORM=	AFFN,	AFFN,	ASDF
##VAR_DIM=	512,	512,	262144
##UNITS=	HZ,	HZ,	ARBITRARY UNITS
##FIRST=	19140.455529915001534,	4405.895418600002813,	0.46068045496940612793
##LAST=	-981.45727250430979893,	-392.40686505384644533,	0.26599872112274169922
##MIN=	-981.45727250430979893,	-392.40686505384644533,	-0.017198767513036727905
##MAX=	19140.455529915001534,	4405.895418600002813,	35.388034820556640625
##FACTOR=	1,	1,	0.0027379616259243563098
##PAGE=	F1=19140.5
##FIRST=	19140.455529915001534,	4405.895418600002813,	0.46068045496940612793
##DATA TABLE=	(F2++(Y..Y)), PROFILE
$$ [...]
##PAGE=	F1=2247.5
##FIRST=	19140.455529915001534,	4405.895418600002813,	0.074050910770893096924
##DATA TABLE=	(F2++(Y..Y)), PROFILE
4406B7R6q1J2J58j10O3j04Q7k6J20%q1NJ00m1k20J49M4n0M2J7p7o8m0N1M8q4O3L6N5k0l5o7
$$ 27 123 42 54 212 102 165 61 148 122 242 242 161 166 266 225 5 154 198 148 190 207 130 62 22 73 121 37 100 136 191 171 136 69
4096F9N4l7N3r2LO6J0k9J05J5j11J2j7P3Mj5L5p8j10L1Q1L1n2Q8j14j0O6N8o2R7m5p6J8m5
$$ 69 123 86 139 47 50 116 126 97 202 217 106 118 101 174 178 163 198 120 10 41 122 153 101 189 75 65 131 189 127 224 179 103 121 76
3777G6n1J32J7K9j5j42K1J02%Jj06l6M5J4k1J4K7l1Q0m4p6J9M6o5J19K4k8J8J8j25J3O3O4
$$ 76 25 157 174 203 188 46 67 169 169 170 64 28 73 87 66 80 107 76 156 112 36 55 101 36 155 179 151 169 187 62 75 138 202
3467B02j03o9Q9j8K1mk9qK7p0P5n1M6J10j83J30r7J12J6o0o8M5K8n5kQ1j00l6J85O0n8J8J05
$$ 202 99 30 119 101 122 118 89 81 108 38 113 62 108 218 35 165 68 180 196 136 68 113 141 86 84 165 65 29 214 274 216 234 339
3157C39j34j39J3J0J49l9p7Om8J70Kk19K31j68K1O1O2j58J19o4P4n8k0M0o1n0K6L8n8M8o5
$$ 339 205 66 79 89 238 199 122 128 80 250 252 33 264 96 117 178 240 82 201 137 211 153 133 173 112 62 88 126 68 116 51
2866E1O5m9P0m1o1O9J0J74m5j32m1J37j1l0j00lk3J4J%Q8m0pk6J22J12j84n8O0o7L4J26N9
$$ 51 116 67 137 96 35 104 114 288 243 111 70 207 196 166 66 63 40 54 55 55 143 103 96 70 192 304 120 62 122 55 89 215 274
2556B74q0j36N3o2K5j6qj9L7K7l7J5J6k9k9Q4L1m9P8m2M6J7n9lo5LM3M2p1J70q3m3OJ24p7
$$ 274 194 58 111 49 74 58 50 31 68 95 58 73 89 60 31 115 146 97 175 133 179 196 137 134 69 72 115 157 86 256 173 130 136 260 183
2227A83%q2K7jl7j6N8O7k8o9o0K8mJ02O7j62K2j0J4j8k8O0l2N7J5P7j9q5L1l8l3q1Q7k9P4
$$ 183 183 101 128 127 90 74 132 199 171 102 42 70 66 168 235 73 95 85 99 81 53 113 81 138 153 230 211 126 157 119 86 5 92 63 137
1899A37J05k7j04Jo2N9o7M4Ml2J12J38j28p1p2O5l8O3p8J72qj12j1N5p2J6J84j10m0K6j29
$$ 137 242 215 111 112 50 109 42 86 90 58 170 308 180 109 37 102 64 127 49 221 213 101 90 145 73 89 273 163 123 149 20
1608B0L2J3K8L7ML2K9l8PK9m7j5J5N9q2J4k5k6M1J54r0r0J0K6P8k3q6J36m0j16J44J06j47
$$ 20 52 65 93 130 134 166 195 157 164 193 146 131 146 205 123 137 112 86 127 281 191 101 111 137 215 192 106 242 202 86 230 336 189
1298A89q3J7q9J44L1M2j59O2l8n6L3J2J1LR1j27k6L2L2J1n3Q2p0j9l6J17J6q1Qqj7K2n3L8
$$ 189 106 123 34 178 209 251 92 154 116 60 93 105 116 119 210 83 57 89 121 132 79 161 91 72 36 153 169 88 96 88 71 93 40 78
979G8J02j17J24K6j01q0L6J02j2K0L4l4M6m4m9m1L1L9o9Q1r7k6k6J25l8o4Q7L9j12J6R2l8
$$ 78 180 63 187 213 112 32 68 170 158 178 212 178 224 180 131 90 121 160 91 172 75 49 23 148 110 46 133 172 60 76 168 130
678A30P7o8j09J01m6M9o9J91j12o8J49o9kL0J34Q2l25K03J79K51K52Mk82m08N5R2j26p9L3
$$ 130 207 139 30 131 85 134 65 256 144 76 225 156 154 184 318 400 75 278 457 708 960 964 682 274 329 421 295 216 249
406B49p9M3j72J28p1Kk8L8j4M1L7j49J06k4J0K8k4l3K0O3j0r9N8l1%O3on7L7N6j77J29K9j10
$$ 249 170 213 41 169 98 100 72 110 96 137 174 25 131 107 117 145 121 88 108 171 161 62 120 89 89 152 146 89 126 182 5 134 163 53
86E3P3J39j21J7J80j37n5k3Ol7l1J04r0L1l3l4J31j9q7K7O2kk9m8N0R3j50j1R8l6P0q9P8J34
$$ 53 126 265 144 161 341 204 149 126 132 95 64 168 78 109 76 42 173 154 67 94 156 154 125 77 127 220 70 59 157 121 191 102 180 314
-233C14k75J71o0p9J15q8qn3J21m3P7J4j78J02q7K7O4
$$ 314 39 210 150 71 186 98 90 37 158 115 192 206 28 130 43 70 134
-392A34
##PAGE=	F1=2208.12
##FIRST=	19140.455529915001534,	4405.895418600002813,	0.067739278078079223633
##DATA TABLE=	(F2++(Y..Y)), PROFILE
4406B4R9r8K9J23p1jp3Q4kJ18lo0o1Q3j8j41R5M7L8r1L7n5q1O0M0J8o0L9RO6l4l3m4N0jL0
$$ 24 123 25 54 177 106 105 32 116 114 232 229 169 108 191 173 32 127 174 212 121 158 103 22 82 122 140 80 119 128 194 160 127 83 133 132 162
4068A62q1%L8J9j3O8O6j05J%jk0K8N9q7j31K5N6P0k5P3j36L3K3R0o8J02r3o9L9k9m8Q1J0L2
$$ 162 81 81 119 138 125 193 259 154 155 155 154 134 162 221 134 3 28 84 154 129 202 66 99 122 212 144 246 153 84 123 94 46 127 137 169
3739A69k4j18K7P6L1Kj31MoO2rK6M5o4M6j3r4MJ4O6P3m9RM8Nj51oR8M0p8p9O6K0kM2m0m1J4
$$ 169 145 27 54 130 161 163 32 36 30 92 83 109 154 90 136 123 29 33 47 113 186 137 146 194 199 48 42 140 180 102 23 89 109 107 149 109 68 82
3382H2n8J28o7L1J13j32O0n1M4pl9j2M5K7m2QO5r7o6J92N3%l8J19j46r8J6r1K41lj42k1m0
$$ 82 24 152 85 116 229 97 157 106 150 143 104 92 137 164 122 130 195 98 32 224 277 277 239 358 212 114 130 39 280 277 135 114 74
3073G4J19K1j94K48j45l2N9N9j23R2o0J04j6j19Q3q1j4k4P7n3M1p3O0p9J42r8k5K8K3J86j7
$$ 74 193 214 20 268 123 91 150 209 86 178 118 222 206 87 170 89 75 51 128 75 116 43 103 24 166 68 43 71 94 280 263
2781B63j56m1J73m4m3k4l2p0M4J1k8J23m1l1n0J45J26j86p3P9q5L1Q5O1n2j30Rk6O2Lo0J1
$$ 263 107 66 239 195 152 128 96 26 70 81 53 176 135 104 54 199 325 139 66 145 60 91 176 237 185 55 64 38 100 103 43 54
2481E4J1M2k2k1J6L7n1N1L3o1J03o4N0L5p8K1j7j8j8K3o5J73j7q5k2J15n4l1l1J7jJ7p1L7
$$ 54 65 107 85 64 80 117 66 117 150 89 192 128 178 213 135 156 139 121 103 126 61 234 217 132 110 225 171 140 109 126 125 142 71 108
2162A08P5j9q3J4j4j9J20N3j62%jrrj1P8o5M8J7J05j0j24Q6n3m8l9K7jQ7Q7m3j05Ln9Q4n4
$$ 108 183 164 81 95 81 62 182 235 73 73 72 63 54 43 121 56 104 121 226 216 92 178 125 77 38 65 64 151 238 195 90 93 34 118 64
1833F4L6m3OJ38J21j69o9J3M0o3P0q5J80k6j29j6N9n5K4K38q2j46L9j16M3NL5J6QK7O1n1O0
$$ 64 100 57 63 201 322 153 84 97 137 74 144 59 239 213 84 68 127 72 96 334 252 106 145 29 72 77 112 128 136 163 224 173 233
1523B33n3l4K9k1O7q2j8k8J1L3J97j58o9P2j6O0k8j20J11K0r3R9O1j42p9K2k4J30J8N3j36
$$ 233 180 146 175 154 221 139 121 93 104 137 334 176 107 179 163 223 195 75 186 206 113 212 273 131 52 74 50 180 198 251 115
1232A15K2j6o9M4M5m5K6J14j39%j7P0Lq6J00q9J5p4J15Km3M6k9k9N5q3K8R2j04J10J8j22l8
$$ 115 137 121 52 96 141 96 122 236 97 97 80 150 153 67 167 78 93 19 134 136 93 139 110 81 136 53 81 173 69 179 197 75 37
922C7M1R3m6K8N7j2Qqr5J0l7J12m3P0j19k3m2J15m9o4J00N2j13j6R9n5K6no8O6o3R6q5K00
$$ 37 78 171 125 153 210 198 206 198 103 113 76 188 145 215 96 73 31 146 97 33 133 185 72 56 155 100 126 121 53 119 56 152 67 267
603B67j17m9P9o0L7l9J97P6k81J51J89K33K97o1k66m16O0Q5o9p5M8q1n8j34K23j37K8p3M0
$$ 267 150 101 180 120 157 118 315 391 110 261 450 683 980 919 653 237 297 382 313 238 286 205 147 13 236 99 127 54 94
331I4M1k3M1j07R0j4k5L8k3o1L9L8om5K0j9j1P6J7m7K0J9j53J01O6p2K6J30q0j7J33j06M5
$$ 94 135 112 153 46 136 122 97 135 112 51 90 128 122 77 97 78 67 143 160 113 133 152 -1 100 166 94 120 250 170 153 286 180 225
21B25o9m3j4k3J16o0k3Lo0J34nj52L7R1K8m3o3P7P7j66j1R5m3P2o6L0J69k34P3k5m4J23j16
$$ 225 156 113 99 76 192 132 109 112 52 186 181 29 66 157 185 142 79 156 233 67 56 151 108 180 114 144 313 79 152 127 83 206 90
-289I0j5j5P2j6O2K5j42L9q9P6N7
$$ 90 75 60 132 116 178 203 61 100 11 87 144
-392A44
##PAGE=	F1=2168.74
##FIRST=	19140.455529915001534,	4405.895418600002813,	0.048466864973306655884
##DATA TABLE=	(F2++(Y..Y)), PROFILE
4406A7Q1o4J9P0ql0nNM1Q4k1k6r2M6J4q8M7M0J25j77Qk0k4Q2L5om9jJ0N5k1k2k3M5K3lp0J9
$$ 17 98 34 53 123 115 85 80 85 126 210 189 163 71 117 131 43 90 130 255 78 86 66 42 124 159 153 104 103 113 168 147 125 102 147 170 167 97 116
4049A16j3K0LM4J09r4nJ0o5k7P3P2j01j23K2K2P6L8O0j67M6L0O9n7P3r7o2N3m3l1O3jJ0j8
$$ 116 103 123 126 170 279 185 180 190 125 98 171 243 142 19 41 63 139 177 237 70 116 146 215 158 231 134 72 125 82 51 114 113 123 105
3730A05p6KN0O9j1j05L6l5O2kK6Q2q8Kj4q4L0k6J49M7j16K9N5Mj42j6J16L5p4p3K5L3j5R2
$$ 105 29 31 81 150 139 34 70 35 97 95 121 203 115 117 103 19 49 23 172 219 103 132 187 191 49 33 149 184 110 37 62 95 80 172
3411A72k3l9l1l3J33p4K9Q7o9Nl4l0j3pN4L4Nl9L5N4j08o4J94L0L1n8J02j51m9K6j37K82J2
$$ 172 149 110 79 46 179 105 134 221 152 157 123 93 80 73 127 161 166 127 162 216 108 44 238 268 299 241 343 192 143 169 32 314 326
3101C26j65p4J5M3Rj23K05j13m6M4M3p0N5o2J39J4j66R9j15K8o7R3j2Qo8M9K5Q8j51J2nK4
$$ 326 161 87 102 145 154 31 236 123 77 121 164 94 149 87 226 240 74 173 58 86 19 112 100 108 40 89 114 202 51 63 58 82
2800H2J89j6j55m2J97o5m6L0m4o1J4J3l8J25j4q1l9J36J57j76j11J02q8K5K5N6or1m1j0R9
$$ 82 271 255 100 58 255 190 144 174 130 69 83 96 58 183 169 88 49 185 342 166 55 157 69 94 119 175 169 78 37 27 126
2509A26J1p7K5l1N1j2r%N4l4%L1n6J04p6N7J4n2M4K6m5l5ko5J74L5j07r6R1j5K1l2k5J7M6
$$ 126 137 60 85 54 105 93 84 84 138 104 104 135 79 183 107 164 178 126 170 196 151 116 114 49 223 258 151 55 146 131 152 120 95 112 158
2180A58o7j4P9k7n9O6p6PJ08L6j28j0k4j9%J4P7o8K1RJ10Rj42J38o4o2j9J9nO1Q7m9p2Lp3
$$ 158 91 77 156 129 70 136 60 67 175 211 83 73 49 30 30 44 121 53 74 83 193 202 60 198 134 72 53 72 67 128 215 166 94 97 24
1852B4J14p6O7j00O7J20R7j87p3J19J0r9P2m9J23k3j33oK8o0P2K49m4j70J2r7J3K5M5Lk1K0
$$ 24 138 62 129 29 96 216 313 126 53 172 182 83 155 106 229 206 73 67 95 35 107 356 312 142 154 57 70 95 140 143 122 142
1551A42R1m7J05j01m2M7j8K6o9l7l2M4M2K07j86n9J15k3K4l8j35N8P5n2N2J4j21n8K2L1Q5
$$ 142 233 186 291 190 148 195 177 203 134 97 65 109 151 358 172 113 228 205 229 191 56 114 189 137 189 203 82 24 46 77 162
1260A62K8M9j02l2qj8K5O4p6K5J26j36K8l5N4pq2R8j04J8n8P0J9%N4l9k0O1r1J4P7p3O7nj05
$$ 162 190 239 137 105 97 79 104 168 92 117 243 107 135 100 154 147 65 163 59 77 19 89 108 108 162 123 103 164 73 87 164 91 158 153 48
932D8LM2Q1p0nJ13L8o1j6q0N9j28J89m1O0j17k8l7Q0m5l9P5M1p3l4P9J0j02O6k2Kp2J15l5
$$ 48 51 93 174 104 99 212 250 189 173 93 152 24 213 172 232 115 87 50 130 85 46 121 162 89 55 134 144 42 108 86 88 16 131 96
612I6J71j32oJ4r7P8m2J89J00k24Q0K01K59L60j23k64m06J2N9mp2P1o1j70p3K50j47J6r5N2
$$ 96 267 135 129 143 46 124 82 271 371 147 227 428 687 1047 924 660 254 266 325 321 249 320 259 89 16 266 119 135 40 92
331I2O1m0j0k4N5Ln1L6l2o1J4M4K3k4j8Pl8J12J6j6l3jj03N7P1l0mJ04m5j4P8p4J11m9j04
$$ 92 153 113 103 79 134 137 86 122 90 29 43 87 110 86 68 75 37 149 165 149 116 115 12 69 140 110 106 210 165 151 229 155 266 217 113
2A13ml3J40m9n0M2j09J33Pj25l0J13O3o5p5R9N9j69k7J02n0N5m2L0J56j68j5ooJ16j11l1J3
$$ 113 109 76 216 167 117 159 50 183 190 65 35 148 211 146 71 170 229 60 33 135 85 140 98 128 284 116 101 95 89 205 94 63 76
-308G6L3j2P2L4j21Jl7M5L8
$$ 76 109 97 169 203 82 83 46 91 129
-392A29
##PAGE=	F1=2129.37
##FIRST=	19140.455529915001534,	4405.895418600002813,	0.029194455593824386597
##DATA TABLE=	(F2++(Y..Y)), PROFILE
4406A0O4l2NJ4N9K1ro8P9M6m9lj03K8K8n5PM0J88j58j7n8L0R9K9k8l9m0J1M3rrj3L1N6k6n8
$$ 10 74 42 47 61 120 141 132 64 143 189 140 137 34 62 90 35 42 82 270 112 95 37 67 166 195 167 128 88 99 142 133 124 111 142 198 172 114
4058A14L6o3K0J1J0J51q2j1K0j19k5J18Q5j15j15K9lP2R2O2j85J2O6L4o0N3r2n4O5n7j3N4
$$ 114 150 87 107 118 128 279 197 186 206 87 62 180 265 150 35 64 61 133 225 287 102 114 180 214 154 207 115 61 126 69 56 110
3758A10kk2k1j7pQR0k3q1O8o4N3lK4J20j02l3kn8L5j1J58K3j80N4O2Nj24j7J25J9o8o8j5M4
$$ 110 108 86 65 48 41 49 139 116 35 103 39 92 89 113 233 131 98 96 38 73 62 220 243 63 117 179 184 60 43 168 187 119 51 36 80
3429H0l7J33J4j9q6j7J39q2J8N0Mm0j7j03j0L4J09J6l4n3O9N0j09n2J86lO2p7R4j47nL2j62
$$ 80 43 176 190 171 85 68 207 125 143 193 197 157 140 37 27 61 170 186 152 99 168 218 109 57 243 240 302 225 319 172 167 199 37
3119C7K70M8j67j33O5K2k6o3J51p1n1J9J9j9J9o9J70J5j64J14j50M6n7M8M2k0n9L9J28L6k05
$$ 37 307 355 188 55 120 142 116 53 204 133 82 101 120 101 120 51 221 236 72 186 36 82 25 73 115 95 36 75 203 239 34
2828C4M9l9K6J91j4j53m5K21r5n7Q3n6m3oJ5m9J18Nj22j8J16J80j58j38J23r1J9l4N0M1l0
$$ 34 83 44 70 261 247 94 49 270 175 118 201 145 102 96 111 62 180 185 63 45 161 341 183 45 168 77 96 62 112 153 123
2537A23o8k6J05K8q5M0p5O1kLj6O2k6n1K7m9J05q1P5pk6N9N9o2m4k7o6J76Q8j04j41MM3O6
$$ 123 55 29 134 162 77 117 42 103 101 104 88 150 124 73 100 51 156 75 150 143 117 176 235 173 129 102 36 212 300 196 55 59 102 168
2218A68l7o8L6O6p4n5R3k6k6J09j46K3Q7K8q5j9m7k0J7K9O7o9pJJ14K9j60J81q4o8J2J0rK5
$$ 168 131 63 99 165 91 36 129 103 77 186 40 63 150 178 93 74 27 7 24 53 120 51 44 45 159 188 28 209 125 57 69 79 70 95
1899I5P8m7k7Jq6J38j01J03p7M2Q9P8k03j3J61j3j26P4j4O8k1j37LQn6Q9K27J7j72j5p7j8
$$ 95 173 126 99 100 14 152 51 154 77 119 208 286 83 70 231 218 92 166 152 220 199 62 65 73 17 106 333 350 178 163 86 68
1598F8M6O2%n9NJ16m8J20j00n5N9k4k4m6m7l6P7L5K00j97l2J48m1nm4r0j0J11k8Nl3m5J9k
$$ 68 114 176 176 117 122 238 190 310 210 155 214 190 166 120 73 37 114 149 349 152 120 268 227 222 178 88 78 189 161 166 133 88 107 105
1279A05j1M4M4L6p7p8J0L4NQ3j07J4J28j23O6n2L6j6p8R6j19K1m3K6L6L3N3m0jO7r8kO2m0
$$ 105 94 138 182 218 141 63 73 107 112 195 88 102 230 107 173 121 157 141 63 159 40 61 18 44 80 113 166 126 125 192 94 92 154 114
960A14K2k6q9M4M3Q4q1q5J98R1j23l7p5Q0j19J83m7N1j13k3k3M6m2j4N0L0l2n9N6Q7j42Q7
$$ 114 136 110 21 65 108 192 111 26 224 315 192 155 80 160 41 224 177 228 115 92 69 115 73 59 109 139 107 48 104 191 49 136
659A36k6p0j4O7K2J48j43N1l6r8K9O6O6J48j42j1J94L14M54j23l28l59j25M1O8p9Q5j6k56
$$ 136 110 40 26 93 115 263 120 171 135 37 66 132 198 346 204 193 387 701 1155 1032 704 345 220 261 329 250 335 319 63
387F3l8K52j48J5j17O3Q2n7o3O1K0K0p9L6k6m4k9L5N2lm6M2p5J40J5J5q6k3n1J2O7Ll5P8%
$$ 63 25 277 129 144 27 90 172 115 52 113 133 153 74 110 84 40 11 46 98 95 49 91 16 156 171 186 100 77 26 38 105 108 73 151 151
58A51jJ2n1J82k4j27l3m6J58k9o7Q1j57J32J9p0o9R8N9p8p7J06K8j15o2J03o2K8k5L8J53r3
$$ 151 150 162 111 293 269 142 109 63 221 192 125 206 49 181 200 130 61 159 218 140 63 169 197 82 20 123 61 89 64 102 255 162
-242A62r3MK2J09j05m8M1ppP3L4p5j2kkJ9
$$ 162 69 73 95 204 99 51 92 85 78 151 185 110 98 96 94 113
-392A13
##PAGE=	F1=2089.99
##FIRST=	19140.455529915001534,	4405.895418600002813,	0.051572050899267196655
##DATA TABLE=	(F2++(Y..Y)), PROFILE
4406A8K9Rj9J3N9J00l2j04R7Ko1nn8jJ9l7qL7K01r0oj32M5J15J5m1l7m7L0J1j3K8l0K6P0k4
$$ 18 47 56 37 50 109 209 177 73 170 172 111 106 48 47 66 29 21 58 259 169 163 31 76 191 206 165 128 81 111 122 109 137 107 133 203 179
4068A79q2Q3j12M0l3QJ73p4KKj33k0J56P9j18j03K5j2O3J45N2j82k9R6on2L3q7nK6o3JO8q
$$ 179 97 180 68 108 75 83 256 182 184 186 53 33 189 268 150 47 72 60 123 268 320 138 109 205 199 147 180 93 88 114 51 52 120 112
3749A12k9k9K6j8k8J05m0o0R0r9L7J8K3J42j18n6J1j7K7KJ45Nj80K7M8Mo6k2J10L3q9k8o2
$$ 112 83 54 80 62 34 139 99 39 129 30 67 85 108 250 132 76 87 70 97 99 244 249 69 96 144 148 82 60 170 203 114 86 24
3439B4K9QJ04M0K5j10m0J28q0J4K1N7l8l2r2mK6J22Jq3n7P6N8j06j8J55k2N3o0Q6j15JL9j80
$$ 24 53 61 165 205 230 120 80 208 128 142 163 220 182 150 58 54 80 202 203 120 63 139 197 91 73 228 206 259 199 285 170 171 210 30
3119C0K37P5j36j55Q2K9l9l9O9k5l4j3mK7j1l7J53nj39J05j22Qj4JQ4o3l0O2J51mk05M8m1
$$ 30 267 342 206 51 133 162 123 84 153 128 94 81 77 104 93 56 209 204 65 170 48 56 42 43 127 64 34 96 247 243 38 86 45
2810D5J4J73j4j27m2K24q4j09R4l1j9l2J4j8J02J4j44RM1K12j26j36Q7n6pnLO4on6n1J04J5
$$ 45 59 232 218 91 49 273 189 80 174 143 124 92 106 88 190 204 60 69 110 322 196 60 147 91 84 79 82 146 140 84 33 137 152
2500A52o1M8p8L4qL1l0N5rp4kl9R4o5P1j1jO2Q2p3l1l7q7J89J01o8j31k7pR5o0p9N0N1o2p1
$$ 152 91 139 61 95 87 118 88 143 134 60 58 19 113 48 119 108 107 169 251 178 147 110 23 212 313 245 114 87 80 175 115 36 86 137 75 4
2162DJ07k6OJ34j72mO0K4o0jo7LK3J4M8n1k0J6R0M3j21J57j09n7K4L6mo0J21o9K3j3o7J21
$$ 4 111 85 91 225 53 49 109 133 73 72 5 8 31 45 93 42 22 38 128 171 50 207 98 41 65 101 97 37 158 89 112 99 32 153
1842A53j19J36l7k0O0O6j69M4J75m1j54N1L8L2k2j19l1L2K1J6J67O1j29l2p3m0O2Q8j3q8j2
$$ 153 34 170 133 113 173 239 70 114 289 248 94 145 183 215 193 74 43 75 96 112 279 340 211 179 106 66 128 216 203 115 103
1551A03R4qJ16p2p3N2mq1n1l2lP2J7J68j72rJ42k3l9l2j1k8N2Jl8m7K5O6pq1J6P3nn2j04K2
$$ 103 197 189 305 233 160 212 208 127 76 44 41 113 130 298 126 117 259 236 197 165 154 126 178 179 141 94 119 185 178 97 113 186 181 129 25 47
1213D7Q3qP9j10L2P0j04J18p8J0Lp3Q8j26JJ%L9L5N4m0J0O6r8j4N0k2Rl6o8L1O2R3m7j23K33
$$ 47 130 122 201 91 123 193 89 207 129 139 142 69 157 31 32 33 33 72 107 161 121 131 197 99 85 135 113 122 86 18 49 111 204 157 34 267
875B67J13j51r2p9Q3m6J32o5M1r8l0J0Rj7nK6OPo6K2J52j08O4o3p8K4j7Q4J59j90J11m9l9
$$ 267 380 229 137 58 141 95 227 162 203 105 75 85 94 77 72 98 104 111 45 67 219 111 175 112 34 58 41 125 284 94 205 156 117
565A17r5J68q8K49p8p4J57L64N41m5m36l10l13P8O3l0N9J0k43p4K63j26k5j19O1J03n7q9R7
$$ 117 22 190 102 351 273 199 356 720 1261 1216 780 470 157 235 298 268 327 337 94 20 283 157 132 13 74 177 120 31 128
293A28J8L7r8K7jm3j9k0N6Ol3N5n2R9MM9j36rj8j8M9K6o9M4L4L3n9l5K16K4j02r1o1J70j3
$$ 128 146 183 85 112 111 68 49 29 85 91 58 113 61 160 164 213 77 68 50 32 81 107 38 82 116 149 90 55 271 295 193 102 41 211 198
-36A98o2R2j85J21K1%o9L6M8q4p9R4L0l1o0K7k2m6L9J7J44l5j17PJ7Q3r4k0K5nl7O8L9m2L3
$$ 198 136 228 43 164 185 185 116 152 200 116 37 131 161 130 70 97 75 29 68 85 229 194 77 84 101 184 90 70 95 90 53 121 160 118 151
-364A51j1n5j0
$$ 151 140 85 75
-392G5
##PAGE=	F1=2050.61
##FIRST=	19140.455529915001534,	4405.895418600002813,	0.073949649930000305176
##DATA TABLE=	(F2++(Y..Y)), PROFILE
4406B7kN5m8Q2k7J69m6j28J11m7l6m6Rj1J2k0j8L9J45j6K5j84M1J10Kn5k4m4M8k1j7O5m7K2
$$ 27 25 80 32 114 87 256 210 82 193 146 110 64 73 62 74 54 36 75 220 204 229 45 86 196 198 143 119 75 123 102 85 150 103 125
4087A25Q4k3j05J29j45P6r3j0J94o4Nk6j22J1J68M8j12q1K2k2M4J90M1j80o0J35m5m5J3q2
$$ 125 209 186 81 210 65 141 48 38 232 168 173 147 25 36 204 252 140 59 81 59 103 293 334 154 94 229 184 139 152 70
3805G0M6j5o7J4Q2j4j6j6J6op0J16n8l9J12j34K1M0J1J56j26o9K4K5J7J7J16k9j66J7L4Kp
$$ 70 116 101 34 48 130 116 100 84 100 94 24 140 82 43 155 21 42 82 93 249 123 54 78 103 120 137 253 224 58 75 109 111 104
3495A04k6Q3L9j04J5o2j4M9O9N8N8j32o3J26p0J1rJ05m0n9j7k0jJ33j2j32o3Q4O6j03J7J23
$$ 104 78 161 200 96 111 49 35 84 153 211 269 137 74 200 130 141 132 237 197 138 121 101 100 233 221 89 26 110 176 73 90 213
3195B13m1M5m4P9q5RM6k14J87J10r6j14L4N4l5k3k3K1j7l6j7O3n0mJ35k5j13R6r4m0K3J6O3
$$ 213 172 217 173 252 167 176 222 8 195 305 209 95 129 183 148 125 102 123 106 70 53 116 66 62 197 172 59 155 61 21 44 60 123
2885A23r8OP0J59k8j91M7m2JJ56j4j02l8K27p4j61R7j6J4m9J4J3Q2J8j29%l1K49r5j33N6j6
$$ 123 25 31 101 260 232 41 88 46 47 203 189 87 49 276 202 41 138 122 136 87 101 114 196 214 85 85 54 303 208 75 131 115
2584A15n4P9l3K2J9m5l8O6Ol3N8q2mk2O9l5M3Mm9n8pL1rL6j0K7N7R5q3j9l7j00J87R8k1j10
$$ 115 61 140 107 129 148 103 65 131 137 104 162 80 76 54 123 88 131 135 86 28 21 52 43 79 69 96 153 248 165 146 109 9 196 294 273 163
2246A63%p3O0p0m8L1L4n4pP4l0L3J22j59l6K8Rm5Rj7PO%K9j1j0PM5N8q2J27j38j0%P2Qr2J38
$$ 163 163 90 150 80 32 63 97 43 36 110 80 113 235 76 40 68 77 32 41 24 31 37 37 66 55 45 52 97 155 73 200 62 52 52 124 132 40 178
1889A78j08N6k9m7J04j37J68Mq7K7M1p2O4J53n3j65J7Q0Pj3q7m9M2Q0p3R2J05q5m4o2n2Q7
$$ 178 70 126 97 50 154 17 185 189 102 129 170 98 162 315 262 97 114 194 201 188 101 52 94 174 101 193 298 213 169 107 55 142
1589A42J13k5j08j8O6K8O5j5q8N0K6j29o5k8L0O8j1J27j39K5J26j4o3j0O7m6j7K1o2m3P0Q8
$$ 142 255 230 122 104 170 198 263 248 160 210 236 107 42 14 44 112 101 228 89 114 240 226 163 153 220 174 157 178 116 73 143 231
1288B31Mj36j1J02m6k7j03O0O4j5Q0j10N0J2r4J61r5oK1o7R0j24k4M0J3ML2N1m1K2N5j08j6
$$ 231 235 99 88 190 144 117 14 74 138 123 203 93 143 155 61 222 127 121 142 75 165 41 17 57 70 74 106 157 116 138 193 85 69
979F9M8mnl7l7QP2R4k1r7K03J44j72j55r2Q6K6Q1q3M0p3l6M3k9RLLj8M5p4j1K01r0M9r1k2
$$ 69 117 113 108 71 34 42 114 208 187 90 293 437 265 110 18 104 130 211 128 168 95 59 102 73 82 85 88 70 115 41 30 231 141 190 99 77
640G7Jm1Q3J77k29J84m6l4m3R6j91L41k4p3J07L84N98N4n24l10m75J30mL3M9L5k29j10K72
$$ 77 78 37 120 297 68 252 206 172 129 225 34 375 351 278 385 769 1367 1421 897 587 112 242 238 271 320 355 126 16 288
368B88r2n4r8OJ19o0n2P1K4O2j19K0K2m0oo9K1N3k5O4k9N9j6P2j67K3J6m8K1L9r3K0N8N8j11
$$ 288 196 142 44 50 169 109 57 128 152 214 95 115 137 97 91 22 43 96 71 135 106 165 149 221 54 77 93 45 66 105 12 32 90 148 37
40C7LJ77P2l2j82l2J47Jo3J22j94J01J3O0p8k6L7p6o7M5P0M9o5l9K4l8N9l1J08L3j31JJN7
$$ 37 40 217 289 257 75 43 190 191 128 250 56 157 170 230 152 126 163 87 20 65 135 184 119 80 104 66 125 94 202 235 104 105 106 163
-280A63q1QQmo6O3M4j0P9k0j08m0
$$ 163 82 90 98 94 28 91 135 125 204 184 76 36
-392C6
##PAGE=	F1=2011.23
##FIRST=	19140.455529915001534,	4405.895418600002813,	0.11360829323530197144
##DATA TABLE=	(F2++(Y..Y)), PROFILE
4406D1j3O8m0J15j24K27n4j16R4n8po6K1nP%l7L9Q0L8L0j85L2R5j7n0j6k5N0k0l9Q8k7j0P8
$$ 41 28 96 56 171 47 274 220 104 198 140 133 67 88 83 90 90 53 92 172 210 240 55 87 182 165 115 99 74 124 104 65 153 126 116 194
4077A94mj32J60j44R6j54J6J54k9K4n2r8M8J20L8j03o6K7m9M3K00K8j61p2J37n3k5j6q5Q5
$$ 194 190 58 218 74 170 16 32 186 157 181 129 31 79 199 237 134 68 95 46 89 289 317 156 84 221 168 143 127 42 127
3796A27l2n4RO9qK2oj9qo1R9n1n8J32r6L1OkJ36j14q5L5N1K1J2N9m3j03j6J5kN4k9J8P3j13
$$ 127 95 41 50 119 111 133 127 108 100 39 138 87 29 161 65 96 102 100 236 122 37 72 123 144 156 215 172 69 53 68 66 120 91 109 182 69
3458F9O9n9l6Q7M9L0P8j44r3J22m2Rj6J01j9p3M0l8j3J24j5j41n8N0O9o2kR7n4L1j4R2p3o
$$ 69 138 79 43 130 179 209 287 143 50 172 130 139 123 224 205 132 172 134 121 245 230 89 31 81 150 88 86 183 129 160 146 238 165 159
3138A59O9j67P0J05k8m9k0K8Km0q4O8k0j8k7Q5p9K8J07n8p1N7n7j7J4M8Jo7kQ2J27o0j22L5
$$ 159 228 61 131 236 208 159 139 167 169 129 45 113 93 75 48 133 54 82 189 131 60 117 60 43 57 105 106 39 37 119 246 186 64 99
2819I9m1l6J44k1n5l6K17o5j65M5kM8m9J0M2P1Pr7k3j6K14q3j21K8L5j35J70k2n3L8k6j5N
$$ 99 58 22 166 145 90 54 271 206 41 86 84 132 83 93 135 206 213 116 93 77 291 208 87 115 150 15 185 163 110 148 122 107 112
2509A12j7K2O7q5m6l6R7l2M1J3j9o8Lk0K9k3L0J8M0R1p4Jo1o6J52P6N0q9J5j03rn9OJ%m2O2
$$ 112 95 117 184 99 53 17 114 82 123 136 117 49 52 32 61 38 68 86 126 217 143 144 83 17 169 245 295 206 221 118 109 50 56 57 57 15 77
2162G7N1k4QR9j24p0M3n0K1k6M7J2k0j7nP1j0k7L6M0k9P2j42L2k0R3J8n9J13j39N1n4QP8r9
$$ 77 128 104 112 211 87 17 60 10 31 5 52 64 44 27 22 93 83 56 92 132 103 175 33 65 45 138 156 97 210 71 122 68 76 154 55
1833E5J42K8j25k3K9K4M3J43o3j52KP8J8rm3n6K8J29j21l0J27k9p2m1jQ7J12n2q6j0J2O3m
$$ 55 197 225 100 77 106 130 173 316 253 101 103 181 199 190 147 91 119 248 127 97 224 195 123 82 81 168 280 228 142 132 144 207 203
1523B03L4q7N1M4j37p7oM5N5m9O5r5M8J12K4n5OP1o4m8J6n4m4Q3J12jj53k5J14l4n7p4Q6k
$$ 203 237 150 201 245 108 31 25 70 125 76 141 46 94 206 230 175 181 252 188 140 156 102 58 141 253 252 99 74 188 154 97 23 109 107
1204A07J6N3p3N9m2p9J76j09jN5r2R5j01j9L3M2m4K9N7o5K4M7r3j8M6j2J5j3l2j7N8R4No6
$$ 107 123 176 103 162 120 41 217 108 107 162 70 165 64 45 78 120 76 105 162 97 121 168 75 57 103 91 106 93 61 44 102 196 201 135
885A35J65J54j74j47q3j5J15O5j12J2l6j3M5l2Ok3L0m1M2o8nJ93o8K9r8K2j3rK9K16k53K11
$$ 135 300 454 280 133 50 35 150 215 103 115 79 66 111 79 85 62 92 51 93 25 20 213 145 174 76 98 85 76 105 321 68 279
584B79l3n3K9K6j74L10L1l4J00L54O07J73n81l38m75K7q4Q2N5O9k18j49K82o9j1j19o6J49
$$ 279 246 193 222 248 74 384 415 381 481 835 1442 1615 1034 696 221 248 164 246 301 370 152 3 285 216 205 86 20 169
321A69r3j2L6O7M7q4j5M2k0k7p7nQ5k3N4oL8l8P5j71N6%l1K0K1m9K8k9R1k8j5L9J25M1k74
$$ 169 76 64 100 167 214 130 115 157 137 110 33 28 113 90 144 138 176 138 213 42 98 98 67 87 108 59 87 58 149 121 106 145 270 311 37
-7C7M3N6J9k6J15j56J20n2P9o7r1K2k7m6MJ12Q4q0q9O8JN9p8J12N3j36k8rL2l8J1K0or4M7
$$ 37 80 136 155 129 244 88 208 156 235 168 77 99 72 26 30 142 226 146 57 125 126 185 107 219 272 136 108 99 131 93 104 124 118 24 71
-336G1L8K9J06l1j44l8
$$ 71 109 138 244 213 69 31
-392C1
##PAGE=	F1=1971.86
##FIRST=	19140.455529915001534,	4405.895418600002813,	0.15326692163944244385
##DATA TABLE=	(F2++(Y..Y)), PROFILE
4406E5k5Q3l9J45j92K36m6r1P6o9K2q5L3JKK0n7M0jP7N0j70J4P0k6l6ppN1j8o2J12pm1P1J4
$$ 55 30 113 74 219 27 263 217 126 202 133 155 70 103 104 106 126 69 109 108 185 235 65 79 149 123 87 80 73 124 106 44 156 149 108 179 193
4068A93j59J91j42J16j93O5R2j6N8o3q9O9P2K8r4n1L2p5L1K01J5j43p3J47o1mm0q4Q7j2m5
$$ 193 34 225 83 199 6 71 163 147 205 142 53 122 194 222 128 77 109 34 65 266 281 138 65 212 151 147 107 23 110 98 53
3777E3jN7lO1Mo0j5j4M6m1p1J51n7M1k9j6J18j02j02M6P8J6mJ2m8l0m0j4j4J04m0l9J16j30
$$ 53 52 109 106 167 171 111 96 82 128 87 16 167 110 151 122 106 224 122 20 66 144 160 156 168 120 90 50 36 22 126 86 47 163 33
3458C3J12m6m7J24L0j4Q1j39j07J17j5Qk4Q8qq6R7m7j5J14j8j39m4OO4k2k2P2o7J7J6J04o0
$$ 33 145 99 52 176 206 192 273 134 27 144 129 137 113 201 193 107 204 157 142 256 238 99 55 61 125 103 81 153 86 103 119 223 163
3148A63k6Q7j15L3K2L4J9o8j4K4k6j14J00m0J0k8R8j16N9P9q2j8Pl0J6J6O5p5J0l8Q1Q1q4
$$ 163 137 224 109 142 164 198 217 149 135 159 133 19 119 79 89 61 159 43 102 181 99 81 88 58 74 90 155 80 90 52 133 214 130
2838A30m4J9m5l4R4k3ml4K07m0j54k2mQ1m8PO9O0lo9n1M6J51q1j19M6N6j63J87Nj09M6j6Q
$$ 130 86 105 60 26 120 97 93 59 266 226 72 50 46 127 79 86 155 215 212 143 92 138 289 208 89 135 191 28 215 220 111 157 141 149
2519A49n5m1P6P7q7o2k4O5j3L6J6Oq3J5Nok9M7j7K5Q7o7K2q5l1J16N4J12p8M0j24o8l9N0l7
$$ 149 94 53 129 206 119 57 33 98 85 121 137 143 60 75 80 74 45 92 75 100 187 120 142 57 26 142 196 308 230 270 146 78 39 89 52
2190E2k0j7Q4N6l2l1Q5p9p2R3m9K4l8RK9l4n1K2J18m7n2L6K3K3L4j30N8n7J06J7j6R9j70M5
$$ 52 32 15 99 155 123 92 177 98 26 119 70 94 56 65 94 60 9 31 149 102 50 86 109 132 166 36 94 37 143 160 144 243 73 118
1871A18q0O3N2o0J16N2j67p9N5Q3J0J23n9j22j3P5L1pJo2MJ69j51j32J40J7r9k1N0Q7J02q9
$$ 118 38 101 153 93 209 261 94 15 70 153 163 286 227 105 92 167 198 191 192 130 134 303 152 20 160 177 78 57 107 194 296 207
1570B07n5Qm2R7q2P4p2O7K3j07r3J1O0M1p6J2o1O1J04O5%j0M0j15n6L3m5m5P4J12J7j48l8
$$ 207 152 160 118 215 133 207 135 202 225 118 25 36 96 137 61 73 12 73 177 242 242 232 272 157 101 134 89 44 118 230 247 99 61
1260F1J26j4p6o4R2n9N8J7m6Q8p6m2J38j20J0Q0j26J09p0j3K5P3r2K5O2q7K6M6o7k9L3j9L4
$$ 61 187 173 97 33 125 66 124 141 95 183 107 65 203 83 93 173 47 156 86 73 98 171 79 104 166 79 105 151 84 55 88 69 103
950A03J1k6m3M5Q4K1m2J22J71j71j11m8n5Q7O0j29k2lM7Rl0Ql9O6p4L1m0K3J46q4K6q9M9m2
$$ 103 114 88 45 90 174 195 153 275 446 275 164 116 61 148 208 79 57 54 101 110 80 88 49 115 41 72 32 55 201 117 143 54 103 61
631F1M3nK32k25J76nq3Q9k7j41K55O5M3J32L00N91K37n68l97l80j33r4K1P9J05k01j52K55
$$ 61 104 99 331 106 282 277 194 283 256 115 370 435 478 610 910 1501 1738 1170 773 393 260 166 187 266 371 170 18 273
368B73m2L6j18j18J16j13L3NJ11L1n9o0P3Rm6q4L2N4k2M2J7J7o0P9j76Q9j6j5K1JlL5j17J24
$$ 273 231 267 149 31 147 34 67 72 183 214 155 95 168 177 131 47 79 133 111 153 170 187 127 206 30 119 103 88 109 110 107 142 25 149
49A49N5l3j07J68J24l57J19l6M8J9R8j27J39j17Q2p2j35K8O2o2M9O5R8j17j21J27M0N9j15
$$ 149 204 171 64 232 356 -1 118 82 130 149 247 120 259 142 224 152 17 45 107 45 94 159 257 140 19 146 186 245 130
-223A30J24O4j51n6j9J6J5MK3Jj13K2K3N9J23l6j76%
$$ 130 254 318 167 111 92 108 123 127 150 151 38 60 83 142 265 229 53 53
-392E3
##PAGE=	F1=1932.48
##FIRST=	19140.455529915001534,	4405.895418600002813,	0.17888471484184265137
##DATA TABLE=	(F2++(Y..Y)), PROFILE
4406F5k3Q4l9J38j88J82k5o4M9m6K3p8J8J0OK4n5J6n3R9N0j15JJ7l2%j3K9J8Jp7J16J4m2L6
$$ 65 42 126 87 225 37 219 194 130 179 133 156 78 96 106 112 136 81 97 44 143 193 78 79 96 64 64 51 80 98 99 22 138 152 110 146
4077A46K9j60K09j28R4j70P2M3%P2m2p5N7K1L4r2l6N0p7KJ72K7j25q7J47m2K7q6k7K9M2n7
$$ 146 175 15 224 96 190 20 92 135 135 207 165 90 147 168 202 110 74 124 47 49 221 248 123 36 183 141 168 82 55 84 126 69
3777F9OQJ6R7J5j06l6M0J5j2j01J43j4M5m9j2Q3q9r8J2J20L5n4k1L9j0q3l6pR8m1k3J25j67
$$ 69 75 83 99 196 211 105 69 109 124 112 11 154 140 185 136 124 207 118 20 32 152 187 133 112 151 141 58 22 15 113 72 49 174 7
3458GJ40n7k3J50J0m1M7j22q5R5J3Ql1O9jj05J23m3j7J16k3j17n9J7M6j3m2N9o8K5L4R0o1
$$ 7 147 90 67 217 227 186 233 111 26 121 134 142 111 180 179 74 197 154 137 253 230 113 54 71 117 104 62 121 53 78 112 202 141
3148A41o3J26n8M7n6O3N5q4r1N6j5o9P7o2N7k0R2j61O5O5n9rm2LN0NO6j24P1o1P0L8r0K7N
$$ 141 78 204 146 193 137 200 255 171 80 136 121 52 129 67 124 104 196 35 100 165 106 97 55 58 108 113 179 55 126 65 135 173 83 110 115
2819A15m6j6K9J4Ol5J80j8j45om0P8k0QM9N2j0o8l8Q8J21q5j36Q1O6j38J32L9j26M4pK0j14
$$ 115 69 53 82 96 102 67 247 229 84 78 38 116 96 104 153 205 195 127 89 177 298 213 77 158 224 86 218 257 131 175 168 188 74
2509G4p2J45Q7j02n9qJ3qL1L6kp7L0K6l6lM4n7J1Q6q6R5j18k7J29KJ43m7M6j18j11pM8m1n9
$$ 74 2 147 234 132 73 65 78 70 101 137 135 58 88 114 78 75 119 62 73 159 73 168 50 23 152 154 297 250 296 178 67 60 108 67 8
2180HQR0P6j6j11N0k0j0J04m5K2m9k6L9l6p2P1J04p2p1M3J3M5J3j01M7o7R0KM3O8j67K2r1
$$ 8 16 106 182 166 55 105 85 75 179 134 156 107 81 120 84 12 83 187 115 44 87 100 145 158 57 104 37 127 129 172 240 73 95 4
1861DJ13L7k9R9N8j63p5K9O8k3J12m3p5lL3L6J8L1p1j2J91j46j18M7O2j05K5L4R7M5j20J7
$$ 4 117 154 125 224 282 119 44 73 141 118 230 187 112 109 142 178 196 227 156 144 335 189 71 118 180 75 100 134 231 276 156 173
1561A73Rp0Q2j31R9l4Q1l6p3q2L4P1L0o1l6KjR8J12M7k8l1j52m3L4j9l8M5J08Oq7o1J16L7
$$ 173 182 112 194 63 162 128 209 173 100 18 52 123 153 92 56 58 57 155 267 314 286 255 103 60 94 75 37 82 190 196 109 48 164 201
1241B01o4j05Q8j05J00j1k4Q8n0k6O8j10M5R5j72J26m2j0J9R6j20J6N4r6J9M0lq2O4n0O7L1
$$ 201 137 32 120 15 115 104 80 168 118 92 160 50 95 190 18 144 102 92 111 207 87 103 157 61 80 120 117 35 99 49 116 147
941A47l3k5j2P5J3j4P4J60j30m5m1n0K1N8j32jl0J01j9k5L8q2J10j35L2RK2R4q6K7m9Ro5Q7
$$ 147 114 89 77 152 165 151 225 385 255 210 169 119 140 198 66 65 35 136 117 92 130 48 158 23 55 64 86 180 94 121 72 81 16 103
622A03k4K37j63J01L7j13J36j3j38J51J08J00K00L04N56K13n06m62k76k39n7r8N7J54j70j29
$$ 103 79 316 153 254 291 178 314 301 163 314 422 522 722 1026 1582 1795 1289 827 551 312 255 157 214 368 198 69
378F9J62j5Q9r8j42L5q5M6j1J40j4Nj24R1O0o8o8M6J7J7RK4J3n1L7j31Q3m6jL8j6J8N6j51
$$ 69 231 216 305 207 65 100 15 61 50 190 176 181 57 148 208 140 72 118 135 152 161 185 198 147 184 53 136 90 89 127 111 129 185 34
58C4J27J06m5j19P7J85l30J03j14Q3P9P2j27J78j66M4n2n0jP1r4Q9L2P2j51q7J41P5M2r8R2
$$ 34 161 267 222 103 180 365 35 138 24 107 186 258 131 309 143 187 135 85 84 155 61 150 182 254 103 16 157 232 274 176 268
-233B68P7j50j13nK2N3j4M0J2j26nNQ5J18n2j64J6
$$ 268 345 195 82 77 99 152 138 178 190 64 59 64 149 267 215 51 67
-392F7
##PAGE=	F1=1893.1
##FIRST=	19140.455529915001534,	4405.895418600002813,	0.20450250804424285889
##DATA TABLE=	(F2++(Y..Y)), PROFILE
4406G4k1Q7m4J26j47R1%l2K1k3J6q0J1L0MK3k2n4k2P8N1n6k8m9QRj4O8k9Pm9Q6JJj0L5j24
$$ 74 53 140 96 222 75 166 166 134 155 132 148 68 79 109 113 136 114 60 38 116 167 111 83 34 42 51 37 105 76 83 34 120 121 122 112 147 23
4058B3J89j17O7j46P8LK6P6l1o0M6k0M8r0k0O7p8k8J43N4r1j15J31k4N8j32L0k8R5o4J8p9
$$ 23 212 95 162 16 94 97 123 199 168 108 154 134 182 92 72 139 61 33 176 230 139 24 155 131 189 57 87 59 154 90 108 29
3758B9P3J19J2j43m8R5j6L1j15J04lN0p0QO5o7q6l1J53N5j03L3Q7l9r8n6%O8o5P7R1j61Q3
$$ 29 102 221 233 90 42 137 121 152 37 141 138 188 118 126 191 124 38 7 160 215 112 145 232 193 95 39 39 107 42 119 210 49 132
3448A32n9J0J65j7o9J3q1l6N6K5Pl7N0Oj34J41l0j0J08l8q4o6K9K8j4p1P7l7J1K9P7o2j09
$$ 132 73 83 248 231 162 175 94 58 114 139 146 109 159 165 31 172 142 132 240 202 118 52 81 109 95 24 101 64 75 104 181 119 10
3138A0J56%O3p0K7R9r1j68Q8nk4N5q4J02j2Q6k04P0N2l8Jr2L8P3j4P6j64J32q4O4%j4Lqm5
$$ 10 166 166 229 159 186 285 194 26 114 109 85 140 56 158 146 232 28 98 150 112 113 21 59 132 118 194 30 162 78 142 142 128 131 123 78
2810G8J7k0L7kl5J54Lj36L8n1J4K5MK4M5j8o5k7J20Q3q0j43J15P8j23O7Q2j33L2pM0j65j5
$$ 78 95 75 112 110 75 229 232 96 134 83 97 122 126 150 195 177 112 85 205 288 208 65 180 258 135 202 284 151 183 176 216 51 36
2500C6J26R8j16n4Qm0lK6N5rp2L7L6n6L2M2r8PR5j19J55j05n0J57l2J52l8M8j16j18j3M2m6
$$ 36 162 260 144 90 98 58 55 81 136 127 55 92 128 72 104 146 48 55 150 31 186 81 31 188 156 308 270 318 202 84 71 113 67
2190F7l5l1J04J04Rj81PK8N2J16n2J2n1n1M9m0r3J21R1r8q9M9LO7qp1L5p8P6j3Q5K3j51J3
$$ 67 32 1 105 209 218 37 44 72 124 240 188 200 149 98 147 107 14 135 226 128 39 88 91 158 150 79 114 36 112 99 184 207 56 69
1871F9j5P7K2MP3N4j40n2j5L2m5J10k7k8Qj1M2M2N1q7k8K12j37r8QQ8p4L0PR5j1j51P9Jr3
$$ 69 54 131 153 157 230 284 144 92 77 109 64 174 147 119 127 116 158 200 251 164 136 348 211 113 121 209 135 165 172 267 256 105 184 185 92
1542I2P2j34R6JQ9r9m5l3K0Q6K3k5o3K2l3P0J33R9l9j32j42l4L0Pl1J6J04ok5q3J06Q2n7j10
$$ 92 164 30 126 127 216 117 72 39 59 145 168 143 80 102 69 139 272 371 332 200 58 24 54 61 30 46 150 144 119 36 142 224 167 57
1223E7M5n8N9l8%Q9k4j6on8M6J06j50O8j1kJ7J18j46PM4j03J0L4O3j31R9n2N2N5l3pp1N8o
$$ 57 102 44 103 65 65 154 130 114 108 50 96 202 52 120 109 107 124 242 96 103 147 44 54 88 151 20 119 67 119 174 141 134 63 121 115
894A15J6K5J60q1Nm9k9l0O5j24M3l5R1l9j3P5j00J05j40J3M6QK5k8K2j6r8K1J9k8K49r3RO2
$$ 115 131 156 316 235 240 191 162 132 197 73 116 81 172 133 120 195 95 200 60 73 119 127 152 124 146 130 32 53 72 44 293 200 209 271
575B71q1J19L6j02K1J26J56K70L76N91J30n05n36j78k65o6j17m1J48j17j15N9L4Q7n6j46k0
$$ 271 190 309 345 243 264 390 546 816 1192 1783 1913 1408 872 694 429 363 246 205 353 236 121 180 214 301 245 99 79
321G9l0K6J6R6n8P3j83J10J09q9n2N0k8O5j4K9J1l3Nq7P7q5LN5l3L0O7j76J40J50o5o5p1K05
$$ 79 49 75 91 187 129 202 19 129 238 149 97 147 119 184 170 199 210 177 182 95 172 87 90 145 112 142 209 33 173 323 258 193 122 327
2C27k68Q8j17M8J46P4j75J98j59l6LL8k5O0j45J39J0L8j93RR1J20L1q9M9J01j40j70RK8R0
$$ 327 59 147 30 78 224 298 123 321 162 126 129 167 142 202 57 196 206 244 51 60 151 271 302 213 262 363 223 53 62 90 180
-289A80l1N7K3j40l1j3J02J02n2j40n
$$ 180 149 206 229 89 58 45 147 249 197 57 52
-392E2
##PAGE=	F1=1853.72
##FIRST=	19140.455529915001534,	4405.895418600002813,	0.14047490060329437256
##DATA TABLE=	(F2++(Y..Y)), PROFILE
4406E1J7Q7o2J21j01j8L5j6K9j6%m7l3O8J4nJ6j18N2P3Q2q8n5n2M0j5k8J11q8Rj8O0l3P4q7
$$ 51 68 155 93 214 113 95 130 114 143 127 127 80 47 115 129 124 140 22 74 147 229 141 86 34 74 59 31 142 54 63 45 105 72 146 59
4077E9O5q7J62j10K8j14Q4k5K9N7kj3J2n3N3r4PP7o3m3J08J04n4j44Q9j3R4j44L6m1R4m8L4
$$ 59 124 37 199 89 117 3 87 62 91 148 146 133 145 92 145 51 58 135 72 29 137 241 187 43 132 119 213 69 105 64 158 110 144
3767A44j30J23R7Qj66l3R5PJ0q4N3j2M2q4N0N7o6l9k5J20O2j08J12P8p3j03n9lJ9n6J60O1
$$ 144 14 137 234 242 76 43 138 145 155 71 124 112 154 70 120 177 111 72 47 167 229 121 233 311 238 135 76 73 92 36 196 257
3467B57j73L9o9K5J70l9p5j7m0jM4J3mk6M2J1j23R1Pj4R0m9m4n0K7K7p0k6O9pL0mL7l2l2L7
$$ 257 84 123 54 79 249 210 135 118 78 77 121 134 130 104 146 157 34 125 132 118 208 159 115 65 92 119 49 23 92 85 115 111 148 116 84 121
3129A21L0Q2k7m7J36j03j58N9L0l7O7q4J09K1N9k20O3K2ppr5P3O0l0O3j39J24p8N5MM3m4M
$$ 121 151 233 206 159 295 192 34 93 123 86 153 69 178 199 258 38 101 123 116 109 14 87 147 117 180 41 165 87 142 146 189 145 149
2819A49n9J8kL4k9j8J22K7j25O2m0m1N8kj2J7np8kJ29N4o1j11J04Q4j05jJ26j40J4jM7j62
$$ 149 90 108 106 140 111 93 215 242 117 179 139 98 156 154 142 159 154 76 74 203 257 196 85 189 273 168 167 293 153 167 166 213 51
2509E1L0Q3J23j29m9Lq3NM9L1j2l5K0L9o0N4L1j08J1J11j54J97r1p4J77k6J21l0L8j01r1m9
$$ 51 81 164 287 158 109 112 29 34 83 114 102 67 87 126 66 120 151 43 54 165 11 208 117 43 220 194 315 285 323 222 131 82
2209H2J7l6J4n5O4J34J8j58n1M7Q6J17n1jn9o0M6m3q4J42P5j15p4L9NL7%p4M7p8O4KR1m0j01
$$ 82 99 63 77 22 86 220 238 80 29 76 162 279 228 227 168 108 154 111 27 169 244 129 55 94 99 136 136 62 109 31 95 97 188 148 47
1880D7PL8N3MJ3M5O2j26k5m5nl0R1j1jOm8O5N1N7r5k3K04j15p8j3J04m3K8k0R3q1j32J13j7
$$ 47 54 92 145 149 162 207 269 143 118 73 68 38 129 118 117 123 75 140 191 248 153 130 334 219 141 128 232 189 217 197 290 209 77 190 173
1551A73j23R2o8M2LR0j41l6M1qR3RJo2K6m6L2J41J23k9k19pj00M0k7j3J4P8m9M9n5M4J13k5
$$ 173 50 142 74 116 119 209 68 32 73 65 158 167 168 106 132 86 118 259 382 353 134 127 27 67 40 27 41 119 70 119 64 108 221 196
1232A96j00j4NJ1j1l6P0Moo5lM0J19j03K4j6%RJ19j63L1J4q8J3pJ36j55J27n2L3M3j9L1j28
$$ 196 96 82 87 98 87 51 121 125 119 54 51 91 210 107 131 115 115 124 243 80 111 125 37 50 43 179 24 151 99 132 175 156 187 59
913E9N1m9L1jJ57j9%m5k6m4O7r6Q8k8O5n6k0J20j05Q0j21J3K9Nk2N5K4k6j66R5o3l5K35j2
$$ 59 110 61 92 91 248 229 229 184 158 114 181 85 173 145 210 154 134 254 149 229 108 121 150 155 133 188 212 186 20 115 52 17 252 240
594B40r5R8lN6R1m4l5Q2J86L37M98P37M2o06o08j80k34j15n2r1N9p2j09k3J06qJ0j55nj5J3
$$ 240 145 243 240 296 387 343 308 390 576 913 1411 2148 2190 1584 976 796 562 447 395 304 363 291 182 159 265 257 267 112 107 92 105
302A05N2Op2J10j58O4J59q1n2K6m7Q7j0M4j0J3o2k3N9j18j7R4n9K8O6j39J26J43p1Pj48J44
$$ 105 157 163 91 201 43 107 266 185 133 159 112 199 189 233 223 236 174 151 210 92 75 169 110 138 204 65 191 334 263 270 122 266
2B66j90N3o8J7J70Q4k18J91j20j15Q2P4n2N2j91J67J2%j72N3M3J58On7k4J42j06k13NK6J14
$$ 266 76 129 61 78 248 332 114 305 185 70 152 226 174 226 35 202 214 214 42 95 138 296 302 245 221 363 257 44 49 75 189
-289A89l6M1N2j24o2k0J02P1n5r0l0
$$ 189 153 194 246 122 60 40 142 213 158 68 38
-392C8
##PAGE=	F1=1814.35
##FIRST=	19140.455529915001534,	4405.895418600002813,	0.076447300612926483154
##DATA TABLE=	(F2++(Y..Y)), PROFILE
4406B7N6Q8q1J16n6j25O9%L6ppoq6R7K9k9O2r9RJ26R7j36r3J1Pk8n1J44j10k5K2M2l7R8j49
$$ 27 83 171 90 206 150 25 94 94 130 123 116 110 24 121 150 121 183 84 93 219 316 180 87 98 105 77 26 170 60 35 57 99 62 160 11
4077A1J09n9J24j07j5l9N5j9rM1L2L5k3q6N9r8L4Q6m7n9P4J53j7j63N7j7J16j23%j2O0l5M7
$$ 11 120 61 185 78 63 24 79 60 51 92 124 159 136 50 109 11 45 131 84 25 99 252 235 72 129 112 228 105 105 93 153 118 165
3767A65j10J20O3oj65NM8N8j4n8rl0M4q9R2M8o3Oj9Q8P0j14J75N4r2r2o2oj5l4J87N1j83J
$$ 165 55 175 238 232 67 72 120 178 164 106 97 67 111 22 114 162 99 105 86 174 244 130 305 359 267 175 113 107 92 58 245 296 113 114
3448A14p9M0J74o0o4l2j5J8L2%j4j5L9K1q3pM7j2P2o1ll4K5K5j10L5L5kO0k9J4J4L9q9L6P4
$$ 114 35 75 249 189 125 93 78 96 128 128 114 99 138 159 76 69 116 104 176 115 112 78 103 128 18 53 88 86 146 117 131 145 184 95 131 205
3110B05L3j06J69j21r4RN3o0P9q4J16N4L0k34N5qJ9j9n9P0M0m9O8r6J07q2M6RR9r0J6p3J8
$$ 205 238 132 301 180 86 95 148 88 167 83 199 253 283 49 104 96 115 96 37 107 147 98 166 70 177 95 141 150 249 159 175 102 120
2800A20J8L1n8JQ9N0j13Q6k9r6R2j0m7j1Qr1K3J38K5m1p9Q2Q2p8o0J60j55%RK6j13O3K5J57
$$ 120 138 169 111 112 201 251 138 224 195 99 191 181 134 123 131 40 63 201 226 185 106 188 270 192 132 292 137 137 146 172 59 122 147 304
2481C04j33m2mj20J8J00l9MK3k2J6o4P6L0j09OJ21j26J75p0q8J95j9Q1l2K8q5n6p4qk7O2p7
$$ 304 171 129 125 5 23 123 84 88 111 89 105 41 117 147 38 44 165 39 214 144 56 251 232 313 281 309 224 168 94 86 59 121 44
2171D4J4J54L0j35k9J8R5R6l5Ko8o7L2n5p6J65O7j22n9L0OPRp9O0p9O4K5P8j21m3J0R2K9k4
$$ 44 58 212 242 107 78 96 191 287 252 254 186 119 151 96 20 185 252 130 71 101 107 114 123 44 104 25 89 114 192 71 28 38 130 159 135
1842A35J3J0O4j01J3r2J6J9K8nJ4Nq4P8N0P2r2j8J96r5n7n0J04nL2m7R1j27r0J00oj58J07
$$ 135 148 158 222 121 134 42 58 77 105 100 114 119 35 113 163 235 143 125 321 226 169 119 223 218 250 203 294 167 77 177 171 13 120
1533A20kj1jQ7j29n1R7n8J00mK6o1L9m9k2J33J40k4k84J49j49O5p5j3L6P4j15J00k7j8J36
$$ 120 118 107 106 193 64 13 110 52 152 148 174 113 152 103 81 214 354 330 46 195 46 111 36 23 59 133 18 118 91 73 209
1241B09kq2o3O7l7J7p1L9K0qo1L9J9J43m7k1k2qpJ10j89P5Ko5K4l7J43j35J21m6J7K2j5R6
$$ 209 207 125 62 129 92 109 38 77 97 89 28 67 86 229 182 161 139 131 124 234 45 120 122 57 81 44 187 52 173 127 144 166 151 247
922B47j61M4r5K9K9J26J2n0j3j8n5P5o4Q6PM5p0l5J55j10N4r2K2Lpn9J47K8l5j70J05j19j4
$$ 247 86 130 35 64 93 219 231 181 168 150 95 170 106 192 199 244 174 139 294 184 238 146 168 171 164 105 252 280 245 75 180 61 47
612D7J89L4j60R6P8jJ40J0k5K8J83L73O48R14Op80o66k44k06j68Qp1pq0j07l5J45j36P1j69
$$ 47 236 270 110 206 284 283 423 433 408 436 619 992 1640 2554 2560 1780 1114 870 664 496 504 433 426 346 239 204 349 213 284 115
331A15M9l9NR4q1q0J10r6J4K02o6m8l2k3O5K8N3l5O0j29M1M1j50l7J31q4J7N5r3J23J18r5
$$ 115 164 125 130 224 143 63 173 77 91 293 227 179 147 124 189 217 270 235 295 166 207 248 98 61 192 108 125 180 87 210 328 233
30B33R1j39Lj17K9qk2J83J04k51J79q6j57J24R7r2M2j63J38L4m4q2L3NJ92k4m0j14J95o1k02
$$ 233 324 185 188 71 100 92 70 253 357 106 285 199 42 166 263 171 213 50 188 222 178 96 129 134 326 302 262 148 343 282 80
-261H0k2LJ17l0L3P2j18q2j9J03M0n8l9n7
$$ 80 58 61 178 148 181 253 135 53 34 137 177 119 80 23
-392B3
##PAGE=	F1=1774.97
##FIRST=	19140.455529915001534,	4405.895418600002813,	0.081543862819671630859
##DATA TABLE=	(F2++(Y..Y)), PROFILE
4406B9O2R3q6J09m5r5j8PQ4j6j9L5r2R8K3n2R7n0p5J93J06j83j06L8l5ll2J13j18m7M5L8L6
$$ 29 91 184 98 207 162 67 49 56 140 124 105 140 48 146 169 117 214 164 89 282 388 205 99 137 102 99 67 180 62 15 60 98 134
4096A34M3j36J16p9R8j09n6M5M4j8k8j1R1K7l6q0K2l3J2Q7m5o0L4J68K9j48K2k6J14j01j7
$$ 134 177 41 157 78 176 67 11 56 100 82 54 43 134 161 125 45 67 34 46 133 88 28 62 230 259 111 133 107 221 120 103
3805A03PJ4nN6j03J36K0j6j53L0j2J27n2j4k0j11Q3l7N8L7n8N0m0P3O9j09J99M7r1p6p0Nn0
$$ 103 110 124 119 175 72 208 228 212 59 89 77 204 152 138 118 7 90 53 111 148 90 140 100 173 242 133 332 379 288 212 142 147 97
3495I7k4J89M8j79j5o2kJ58k5n8j3m5K4M0j1l1lL3M6m0j17J09oJ7m8K3j4RL6r3K7J5lN8j8
$$ 97 73 262 310 131 116 54 52 210 185 127 114 69 93 133 122 91 88 121 167 127 10 119 113 130 82 105 91 100 136 43 70 85 82 140 122
3166A22pO2J09j60j4O2Q2j46K03j50n8J3N4p3P2q0J13Q2J5k38Q5n3Ok1k9O8K2o7O5m2R9p8
$$ 122 115 177 286 126 112 174 256 110 313 163 105 118 172 99 171 91 204 286 301 63 148 95 101 80 51 119 141 74 139 97 196 118
2866A18QN4Q2r4L7q9qL7L7p7L4M6N4p2Q5j7j37J16rq5j8Km8J9J44Np0j9J9R6n3j00J77j63
$$ 118 126 180 262 168 205 116 108 145 182 105 139 185 239 167 252 235 98 214 205 120 102 104 56 75 219 224 154 135 154 250 197 97 274 111
2547A11k8K9L0n0O4k5J65j12m8j0j15J1J38q4J1P8p8j5l8O2L1q2jJ00q0J32n2p1J89j3O8n9
$$ 111 83 112 142 92 156 131 296 184 136 126 11 22 160 76 87 165 87 72 34 96 127 45 44 144 64 196 144 73 262 249 317 258
2246B58J5p4j1q6m1k0J05p9k6J39J3o0j4j0Q9P9k4J4n5q6Lo1m5J57O6j10o5L7L0n1J9p0M5
$$ 258 273 199 188 102 61 41 146 67 41 180 193 133 119 109 198 277 253 267 212 126 129 68 23 180 246 136 71 108 138 87 106 36 81
1936H1o9P2M4O3j74N1l5R7L4m6rlM6o3N2j29P4M0k6kL9k4j01Q2L3Q3q1mJ73q6k3r9R0L3M1
$$ 81 12 84 128 191 17 68 33 130 164 118 109 106 152 89 141 12 86 126 100 98 137 113 12 94 127 210 129 125 298 212 189 90 180 213 254
1608B54m8O6j30n4O3J0j18N8L5l5j9Q2o1m1N4r3J04j8O0n4K6j9q7J22J07Nk51K17j70Q1q2
$$ 254 206 272 142 88 151 161 43 101 136 101 82 164 103 62 116 23 127 109 169 115 141 122 35 157 264 269 18 235 65 146 64
1317F4l2L7Q7r5M4K0o5J22mm2p8J11o9K7q6J6krK1lOJ59K0l4l4m7mP8j84J08jk9nM1O1j16
$$ 64 32 69 156 61 105 125 60 182 178 136 58 169 100 127 41 57 55 46 67 64 70 229 249 215 181 134 130 208 24 132 131 102 97 138 199 83
979H3J06m2L3n1%J45j44M9j28RO1R7Rj05M1Qj06J18p1N1N8N2p4o0J55j00N2j01N8k8k0o5K02
$$ 83 189 147 180 129 129 274 130 179 51 60 121 218 227 122 163 171 65 183 112 163 221 273 199 139 294 194 246 145 203 175 155 90 292
669B92L3l1j57J00j31kQ3R2j82R0J21k0J37O5J7%J53L81P37J077L6r48p20k93k25k05L7k1
$$ 292 325 294 137 237 106 104 187 279 97 187 308 288 425 490 507 507 660 1041 1778 2855 2891 1943 1223 930 705 500 537 516
406E16rj22q6m9J77k00O2j78R8l6n1J43j24q0P1k0l3K20l4k8j33M4J8M1R4o5J11j92J00J7
$$ 516 507 385 299 250 427 227 289 111 209 173 122 265 141 61 132 112 79 299 265 237 104 148 166 207 301 236 347 155 255 272
124B72j59m5J32r5%M6m0J25N8j02J56j12r8r4K6K2m5J94J03k45J59n9j11Q6Q8j21J1o4Q1M3
$$ 272 113 68 200 105 105 151 111 236 294 192 348 236 138 44 70 92 47 241 344 99 258 199 88 174 262 141 152 88 169 212
-158B12m8j6PqJ90n0m1j64K22rj88l0k4J01JJ3O2j03r5pJ00J1n8K6m4
$$ 212 164 148 155 147 337 287 246 82 304 295 107 77 53 154 155 168 230 127 32 25 125 136 78 104 60
-392F0
##PAGE=	F1=1735.59
##FIRST=	19140.455529915001534,	4405.895418600002813,	0.17304560542106628418
##DATA TABLE=	(F2++(Y..Y)), PROFILE
4406F3N2Q3r3J03l3o5r7K4J23l5l2P6r7R8J8p6J32jj75K45J32k16j28N6o7L1j2Q2j10n3N0
$$ 63 115 198 105 208 175 110 13 37 160 125 93 169 72 170 188 112 244 243 68 313 445 229 101 157 90 121 109 191 81 28 78
4115G8J9J09j2j22J23r4P6j11j9N2L0rm1k5J12Ro1p3j6L2j1Q9m3n3NJ57N1j09J2n2R2o9k5
$$ 78 97 206 194 72 195 101 177 66 47 99 129 120 79 54 166 175 114 41 25 57 46 135 92 39 44 201 252 143 155 103 195 126 101
3805A01J8m2K4O5q6J61k4k4j41N4p1J96r5K4or1P4l4J5J5n2R3o0N9N1j18K22L9p5m3p8J6q4
$$ 101 119 77 101 166 80 241 217 193 52 106 35 231 136 160 154 63 137 103 118 133 81 174 114 173 224 106 328 367 292 249 171 187 103
3495A03j5J75K9j59j5m5m5J43Rn1Np5L2M7k2m8QK6P0j1j16R2ol2l1M0lrM9p7J9j4j4O6Kk4
$$ 103 88 263 292 133 118 73 28 171 180 129 134 59 91 138 116 68 76 102 172 161 45 137 131 99 68 108 105 96 145 68 87 73 59 125 127 103
3157A03J15J40j91o9M5J30j85K38j80k1J6O3p6N5q3J00J00Rk31J31q5k1m0LO5Mq5O1J4R0p3
$$ 103 218 358 167 98 143 273 88 326 146 125 141 204 128 183 100 200 300 309 78 209 124 103 63 66 131 135 50 111 125 215 142
2866A42m0R0P4r0N9j05m3M6N3q7O7LN8l1Q4nj77J39rj22k4oJ2L0J43k1j07L1n4J01j8j32J90
$$ 142 102 192 266 176 235 130 87 133 186 99 166 169 227 196 280 275 98 237 228 106 82 76 88 118 261 240 133 164 110 211 193 61 251
2556B51j75j3J6O7l1P0o9J72r2n4j6j04RJ54p6kJ13j25l6k3M0L2n7qQ0l4Q9l5n3J73j6O4p5
$$ 251 76 63 79 146 115 185 116 288 196 142 126 22 31 185 109 107 220 95 59 36 76 108 51 43 123 89 178 143 90 263 247 311 236
2246B36j5p7M8q2p5j1J48q2o6J23j7kJ6k1P2N3lL4m1j05k7o5k4J39P5r0p0M4N5j10L8n1K9
$$ 236 221 144 192 110 35 24 172 90 24 147 130 128 144 123 195 248 245 279 238 133 106 41 17 156 231 141 71 115 170 60 98 47 76
1936G6n9O4M6M9r9L2o5R3L1o3k5J2k0k7Q7r4P9N0r0K6Q9l7r9QJ8R9o5J0J49q2Oj18K7P0M8
$$ 76 17 81 127 176 77 109 44 137 168 105 80 92 72 45 132 38 117 167 77 103 192 155 56 64 82 181 116 126 275 193 199 81 108 178 226
1608B26l2N6j32j9K6K6p4J4L4k0m2P2Kl6lo7M7j6Q8n2J7J7j15P4O2K1q0J47j75J15p9m2K8
$$ 226 194 250 118 99 125 151 77 91 125 105 63 135 137 101 98 31 78 62 150 98 115 132 17 91 153 174 94 241 66 181 102 60 88
1298H8R0p0qM7n8Q7k6Jq7J17o3L2j06J6lm2P1l4LJ65P7l7l7q9%K7p0M3K2km0J27j1j17P3k9
$$ 88 178 108 100 147 89 176 150 151 64 181 118 150 44 60 57 15 86 52 55 220 297 260 223 134 134 161 91 134 156 154 114 241 230 113 186 157
960A57O0j29RJ66q0M5j70K7N4O9Oj07P3L8j52J46r5JR2P6o3j00J39p3O6j16Q9k6p4m0K16N1
$$ 157 217 88 97 263 183 228 58 85 139 208 214 107 180 218 66 212 117 118 210 286 223 123 262 189 255 139 228 202 128 88 304 355
659C55j3j48R1r2j4o4J82j95R5J31KP3J35P3j5J24L90Q15J231J15j068q48k93k79k79L1oL4
$$ 355 342 194 285 193 179 115 297 102 197 328 330 403 538 611 596 720 1110 1925 3156 3271 2203 1355 1062 783 504 535 529 563
396E63j21p8p8K09j89L5k04R8nj21J79j43n4J7L8r5K21J6Ok37J06kQJ40r1J72k45J57oj58
$$ 563 442 364 286 495 306 341 137 235 230 109 288 145 91 108 146 51 272 288 294 57 163 161 169 309 218 390 145 302 296 138
115A38m4J24j15j8L6J4J28j3j18K13r3j27j24K6N5m0J56Q4j81J36l9o5M8P1j60j0M3K0M8k5
$$ 138 94 218 103 85 121 135 263 250 132 345 252 125 1 27 82 42 198 282 101 237 198 133 181 252 92 82 125 145 193 168
-167A68LooJ81q5o7j15J72M2j64k6n3Q5L2oN1q8j08OR6j8n7R2l2
$$ 168 171 165 159 340 255 188 73 245 287 123 97 44 129 161 155 206 118 10 16 112 94 37 129 97
-392I7
##PAGE=	F1=1696.21
##FIRST=	19140.455529915001534,	4405.895418600002813,	0.26778757572174072266
##DATA TABLE=	(F2++(Y..Y)), PROFILE
4406I7L1P5p4N9l9jp6OP8l5k5P0o9R4pj02J75M1k64K89J16k12j02K9j11R3K4J7q5l5M2k1J64
$$ 97 128 203 129 188 149 148 72 78 156 121 96 166 97 191 184 82 257 298 34 323 439 227 125 154 43 136 160 177 92 57 99 78 242
4096B42l4j31J42j22P9j00J7N0Rk0k1k0J02k1p1m3l7L9J8M5m9j4L0O3O6n9J8n7L1m8kK4j11
$$ 242 208 77 219 97 176 76 93 143 152 132 111 91 193 172 101 58 21 60 78 123 74 60 90 153 219 160 178 121 152 104 102 126 15
3786A5N2Q3q8J90n0k2j25M5q3K23j18L9L7p8O5n5J2l0l0J15j00O6K1j30K48L9o7rr2K9j01
$$ 15 67 150 62 252 202 180 55 100 17 240 122 161 198 120 185 130 142 112 82 197 97 163 184 54 302 341 274 265 173 202 101
3495A01j3J40K1j05l2l7l7Q8M5l2J8r9M0M6m2m1KK1P9K2r6O5%p4j%L4l4O7n0lm1rM8M8j7J09
$$ 101 88 228 249 144 112 75 38 126 171 139 157 58 98 144 102 61 63 84 163 185 89 154 154 80 79 79 113 79 146 96 93 52 43 91 139 122 231
3148B31J62j73j26L9J35j67K35j94k8M7N2m8J4p4R6Q8J2k02J83j21m2n2k0P7J5r9M4N4J28
$$ 231 393 220 94 133 268 101 336 142 114 161 213 165 179 105 201 289 301 99 282 161 119 67 47 124 139 40 84 138 266
2875B66q6j08J23N1o2O6r9q0K0P8o9P6j3L6J0Q3mj92J36Qj64L1n0O1O1R4qj49O4j25J05K4
$$ 266 180 72 195 246 184 250 151 71 91 169 100 176 163 199 209 292 288 96 232 240 76 107 57 118 179 273 265 116 180 55 160 184
2575A84j41J88j79N6n9J68q4N3p2J50o5l4m6r0kJ38k6J4R0j40n9lJ4L2k2nM0J9J6K6n3J28
$$ 184 43 231 52 108 49 217 133 186 114 264 199 165 119 29 27 165 139 153 243 103 44 41 55 87 65 60 100 119 135 161 108 236
2274B36JO6q6n8q5R7n2q6k3J49n6p7Q7o8O6M4l9L2N9L3L2k4j13n7l3k8J11Q5n5j00N9P6j26
$$ 236 237 303 217 159 74 171 119 33 10 159 103 26 113 45 111 155 116 148 207 240 272 248 135 78 45 17 128 213 158 58 117 193 67
1964F7M5l1J1n1N7mO3l9J6p7N5N1n8pM6j07J4P2m4M4Q4j69M2J81n1j14m7J0Q4j8K2J11j08
$$ 67 112 81 92 41 98 94 157 118 134 57 112 163 105 98 144 37 51 123 79 123 207 38 80 261 210 96 49 59 143 125 147 258 150
1655A50N2n9j11R2M5L1K2r3oj1J3l2k7QK5m4P0J3Mp7J9m3k3J04m7kO8r1O5q0N8M4Q1j56J35
$$ 150 202 143 32 124 169 200 222 129 123 112 125 93 66 74 99 55 125 138 142 65 84 41 18 122 75 73 141 50 115 35 93 137 218 62 197
1326A97o2m4j2J08k9o8N8j4Q5n5kp8R6k6J7j22M6J9q3M3k1k1J67J19l0k9j39K5j0K2m9Q4q
$$ 197 135 91 79 187 158 90 148 134 219 164 162 84 180 154 171 49 95 114 31 74 53 32 199 318 288 259 120 145 135 157 108 192 184
1016A84q0K27n8j43L4k5J14j16q7J70ON7j96L5L0L1J9o4Q2N4j62J50j48o3J35J08l2j42R8
$$ 184 104 331 273 130 164 139 253 137 50 220 226 283 87 122 152 183 202 138 220 274 112 262 114 51 186 294 262 120 218
744B18rR2j31Q7K3j67K5J83N6K4r7L1k0j3j54K02j72J19R5R9MJ64J66j1J63M41J051J531K48
$$ 218 209 301 170 257 280 113 138 321 377 401 304 335 315 302 148 350 178 297 392 491 495 659 825 814 977 1418 2469 4000 4248
471D248j314j189k93l65l66q0q1R2j01p1j15K04j23j1k00O6L3j87J62j14k7p9J07q3J33N8
$$ 4248 2934 1745 1452 1087 721 641 560 652 551 480 365 569 446 435 235 301 334 147 309 195 168 89 196 113 246 304
227C04O5l08J11M5o6J61j07K02k64K00k6j72MR9j53l1L8N0J39r0j11K14q8p5q6kJJ5O9M8j20
$$ 304 369 61 172 217 151 312 205 407 143 343 317 145 149 248 95 64 102 152 291 201 90 304 216 141 55 53 54 69 138 186 66
-64F6J50l7j7LN6j41p4J35J1K0K0l0QK7J34j13j17NR1M5j30lm4N7M8k8P4r0q9jP1l7n5J32
$$ 66 216 179 162 165 221 80 6 141 152 172 192 162 170 197 331 218 101 106 197 242 112 109 65 122 170 142 216 126 37 36 107 70 15 147
-383A47l1
$$ 147 116
-392A16
##PAGE=	F1=1656.84
##FIRST=	19140.455529915001534,	4405.895418600002813,	0.36252954602241516113
##DATA TABLE=	(F2++(Y..Y)), PROFILE
4406A32J0O6n4J4n4N3m6kL4l6k7N4m2R1k3j19K02O5k91K71J09k01p2Rj19J17O5m3o0j6L3o1
$$ 132 142 208 154 168 114 167 121 119 153 117 90 144 102 193 170 51 253 318 27 298 407 206 134 143 24 141 206 163 103 87 120 59
4105E9K10o5j46J54j35R9r1N5L7k0l2%j6R1m0p3j3n7M6M6Kn5K4N5l0Q1rK3o9m2k2K6M2r3L
$$ 59 269 204 58 212 77 176 85 140 177 157 125 125 109 200 160 87 74 17 63 109 111 56 80 135 105 186 177 200 131 89 67 93 135 42 45
3777D5R8j04K05o7j1j16K9k3J95j42N3P1p5N6p6J8o5j8J27j29Q3%j33K64L0o8J4j04M1j09
$$ 45 143 39 244 177 166 50 79 56 251 109 162 233 158 214 138 156 91 73 200 71 154 154 21 285 315 247 261 157 198 89
3495H9kJ07J1n0n0k9k8L3Q1j4L1j23M9M5o1l6mJ8Q6M7q6M8J6j16K9m0P0o0Q6k4k4n9NK1Q4
$$ 89 87 194 205 155 105 76 48 81 162 148 179 56 105 150 89 53 49 67 153 200 114 162 178 62 91 51 121 61 147 123 99 40 45 66 150
3166A50j9R4J94j47j82L2J41j49K33k09l5P8M2k1k8o5Q5O5K5j63K34j57o4o4m1Q8L0j08N6
$$ 150 131 225 419 272 90 122 263 114 347 138 103 181 223 202 174 109 194 259 284 121 355 198 134 70 29 117 147 39 95
2894I5M7J66r9j38J18L3l0P2r1j19mJ03n2Q5k9MM2R3Nk17J24L5j96J01p9Q5O7N4J6j97R3j58
$$ 95 142 308 209 71 189 222 192 264 173 54 50 153 101 186 157 161 203 296 301 84 208 243 47 148 69 154 221 275 291 94 187 29
2594B9P1Q0j35J84j81J13j42K70j39L8p6J27l7j3p7p6j3J23K4K9O7j55q2K6kK2MLMN0lO6p3
$$ 29 100 180 45 229 48 161 19 289 150 188 112 239 202 189 112 36 23 146 170 199 266 111 29 55 53 75 79 82 86 136 133 199 126
2284A26P3J0R3p2j13j04J00Np3rR7qq8N1l6L9O5o5JP5N8K1Lj11p3J5m7O6R5j8j41O4J08j33
$$ 126 199 209 302 230 117 13 113 118 45 36 133 125 37 88 52 91 156 91 92 167 225 246 249 138 65 80 33 99 194 176 35 99 207 74
1964G4N2j2om4M2o3P6K2Qp9J7P2m5J8N8r0OPkkJ44k23M3K57p5j38p0L3M6QL4P2j34R6J4j09
$$ 74 126 114 108 64 106 43 119 141 149 70 87 159 114 132 190 100 106 113 111 109 253 30 73 330 255 117 47 80 126 134 168 240 106 202 216 107
1626A07k6K8R5rm6J7o7k0L0m9k8O1m6O8K0L9j08P1o6l7R1p3k5J14p9J21r0N1K6M8j48J43m5
$$ 107 81 109 204 195 149 166 99 79 109 60 32 93 47 115 135 174 66 137 71 34 125 52 27 141 62 183 93 144 170 218 70 213 168
1317A68m6o2J17L1j09O0K1J09n5l4r7P6J2%j38P8L9j23J5pm5J53J44opj89N1m8J16j42J47
$$ 168 122 60 177 208 99 159 180 289 234 200 103 179 191 191 53 131 170 47 62 55 10 163 307 301 294 105 156 108 224 82 229
1025B29k5j29L37r6j78j5j2J78p0j50R9R2R5j95L7jk2J6k1R2O8j71J59j97j2J14J09l0j61
$$ 229 204 75 412 316 138 123 111 289 219 69 168 260 355 160 197 196 174 190 169 261 329 158 317 120 108 222 331 301 140
753A40P9N0J13j09M7R0k41P4J39N5N5n4l4N7pj11J25j33J58P1K10j3J66K83J8K84N75J554
$$ 140 219 269 382 273 320 410 169 243 382 437 492 438 404 461 454 343 468 335 493 564 774 761 927 1210 1228 1512 2087 3641
490C641K097L85j833j784l70m75m76k33j94P4q0n8j46J30n1m9j88J9N8j91Q3q7Kj13J12m4
$$ 3641 5738 6123 4290 2506 2136 1661 1185 952 758 832 752 694 548 678 627 578 390 409 467 276 359 272 274 161 273 229
246B29P0K6J25k89K9J26j04J19j11K19k98K44m7j87N4O9j97RJ9Q0J42j71l2J27r4Jk8j3j11
$$ 229 299 325 450 161 190 316 212 331 220 439 141 385 338 151 205 274 77 86 105 185 327 156 124 251 157 158 130 117 6
-26FJ09n6N0r8K07o7K4m9N6l2n4L5N9l0N1p8L2O9P9j52j56J33J1M9j05Qk4L9O3n0J13p7q6
$$ 6 115 59 109 11 218 151 175 126 182 150 96 131 190 160 211 133 165 234 313 161 5 138 149 198 93 101 77 116 179 129 242 165 79
-336G9k3L9o5J1J09l2
$$ 79 56 95 30 41 150 118
-392A18
##PAGE=	F1=1617.46
##FIRST=	19140.455529915001534,	4405.895418600002813,	0.3908475041389465332
##DATA TABLE=	(F2++(Y..Y)), PROFILE
4406A42LN3j8l0o9Q3Lj0l3l1j6L1NP2n3j01K09O7k43J93Q3j67k4Pq0O0P7o2j8j7J2q3K14o1
$$ 142 145 198 180 150 81 164 167 157 124 93 77 108 113 185 132 31 240 307 64 257 340 173 149 156 76 136 213 151 133 116 128 45 259 198
4087A98j46J30j33J13o4O3K6n7k0J6nP1k9q5Mo6M8Q8p0l1N4O9r9Q0K1L6o8j22mP6N2m9p6J27
$$ 198 52 182 49 162 98 161 187 130 110 126 121 192 163 78 82 16 64 152 82 51 105 174 75 155 176 212 144 22 18 94 146 97 21 148
3767A48r6J69q0Rq8%J3J82j42L4R1o1N7j13M5r4KJ09j37J00l0l4K05j7p8K8r7L4q6J5M9K0
$$ 148 52 221 141 150 62 62 75 257 115 149 240 179 236 123 168 74 76 185 48 148 118 84 289 272 194 222 125 159 73 88 137 157
3467A57J9r3j8kNP6RL2j20N1L7p7k5rJ5P8N5n8J7L1j01J9q9J40p1R3k0l5p3J6M7M7j3O2K05
$$ 157 176 83 65 63 68 144 153 185 65 116 153 76 51 42 57 135 190 132 149 180 79 98 9 149 78 171 151 116 43 59 106 153 140 202 407
3138D07p2k79L7J53j24K27j90r0J19K9ll6l6N0K2M1j11K39j66l8r5n4J00N0j27P0nK06j09
$$ 407 335 56 93 246 122 349 159 69 188 217 214 178 142 192 214 255 144 383 217 179 84 30 130 180 53 123 118 324 215
2866B15r6N1K2RO0p9j34rQ7mO7k2%J9J07ok21J08N4k14J80j01O6Q9oL6j75P8r2l4J13j15J54
$$ 215 119 170 192 201 261 182 48 39 126 122 189 167 167 186 293 287 66 174 228 14 194 93 159 248 242 278 103 181 89 55 168 53 207
2556B07j49J67k24L37j92J7m0R4k0J0j03p6L8P0N5O3J3j44j22M6J9j5R0k5k5N0N1N1j01J0
$$ 207 58 225 1 338 146 163 123 217 197 207 104 28 66 136 191 254 267 123 1 47 66 51 141 116 91 141 192 243 142 152
2274A52L1J22j8j56l6l5N6n6PK1N5q8K5L8m0O1p3KO6P1mK2p8o4K5o6P2Q3J6j79N2J03j11P1
$$ 152 183 305 287 131 95 60 116 60 67 88 143 55 80 118 78 139 66 68 134 205 201 223 145 81 106 40 112 195 211 32 84 187 76 147
1955A47mj3n0M6r6L9P5J3p4j2R3l9L7N8o0k7j9K2n6K07j94k8L08r5j58p3P0kL6N3K7j60J33
$$ 147 143 130 80 126 30 69 144 157 83 71 164 125 162 220 160 133 114 136 80 287 93 65 373 278 120 47 117 115 151 204 231 71 204
1645B04O8p6q7k9J32l5K0Pj24n9R5j0k5J8m4O9LN6o3M6l4o3N7o9rP9o2J69o2O7n3M7j60J50
$$ 204 272 196 109 80 212 177 197 204 80 21 116 106 81 99 55 124 127 183 120 166 132 69 126 57 48 127 65 234 172 239 186 233 73 223
1326B23k4m3j27J28J14j47O3J2J62n2q0j22P1N9j2j65R9O0j78OL4k8P5J61RJ0k08P0m7J42
$$ 223 199 156 29 157 271 124 187 199 361 309 229 107 178 237 225 60 159 219 41 47 81 53 128 289 298 308 100 170 123 265
1044B65k45K58p1j25L61r6j97q4OK20%j42J3J34J22j69N9j8r0j4j3J33L6j42J52j93N3J13
$$ 265 20 278 207 82 443 347 150 66 72 292 292 150 163 297 419 250 309 291 201 187 174 307 343 201 353 160 213 326
781C26O4n0j30P1P7J27r7K4J29k91J32J31J2O8lj01J32pn2N2o0J68P2L20PJ80L67Q9M60P37
$$ 326 390 340 210 281 358 485 388 412 541 250 382 513 525 593 590 489 621 614 562 614 554 722 794 1114 1121 1301 1668 1757 2217 2954
500B954K230K844N09k550k491n23o17n99l78k65k0p9o9j45K5Nj08j69L5J0j79K8q0K0j06Q8
$$ 2954 5184 8028 8537 5987 3496 2973 2356 1757 1379 1114 1094 1015 946 801 826 831 723 554 589 599 420 448 368 388 282 370
256C70k0R4o4J56k65l5J82r8Q2j39K00l05K70q3j80R9K6k00P0OM9J51k02M7j3o7L6L4l4j15
$$ 370 350 444 380 536 271 236 418 320 402 263 463 158 428 345 165 264 290 90 160 166 215 366 164 211 198 131 167 201 167 52
-26E2J23p5O7j01J64j05M3r2R3O3p1n0J42o9L4j34R0J09Mj76jK8MLp5K7k5N1N5p1J69n8j12
$$ 52 175 100 167 66 230 125 168 76 169 232 161 111 253 184 218 84 174 283 287 111 110 138 142 145 70 97 72 123 178 107 276 218 106
-336A06k4J8p6N2P0l8
$$ 106 82 100 24 76 146 108
-392A08
##PAGE=	F1=1578.08
##FIRST=	19140.455529915001534,	4405.895418600002813,	0.41916543245315551758
##DATA TABLE=	(F2++(Y..Y)), PROFILE
4406A53nL9K9o5j02R4N1j7r1j8lPN2N3n6n6J43P0j54Q2N4j39L3J5n1pR9p2K6j9Mr0J66l3j12
$$ 153 148 187 216 151 49 143 194 177 86 68 65 72 124 177 121 65 208 278 124 206 260 121 154 169 118 111 210 138 164 145 149 59 225 192 80
4077H0O1j26J33m6O1J5r4JM2ON0j6r8L6n8L3J15j27RN4N4j22N2M3M3n2j11J5N1N4j6j17J19
$$ 80 141 15 148 102 163 178 84 85 127 133 183 167 69 105 47 80 195 68 77 131 185 63 115 158 201 149 38 53 104 158 142 25 144
3767A44q3J38r4K9o0k9M9J69j42J5J02n6N8j51Q2j14J7Q6j07P9n4O9J45o2r9L3q1L8o4L1p
$$ 144 61 199 105 134 74 45 94 263 121 136 238 182 240 89 171 57 74 160 53 132 78 147 292 230 131 164 83 121 57 88 81
3476H1K8Q8j37j1K0J4L3L8L7j16N3K7r2j4j5J3P0O3l0j3M4q0J4n1J23q8R6j6m7q6K8P3J0q
$$ 81 109 197 60 49 69 83 116 154 191 75 128 155 63 49 34 47 117 180 150 137 181 101 115 64 187 99 195 179 132 46 74 147 157 149
3157A49L0K16Kl75M1J66r9K21j70j46J61J5J5m4pJ6k2N6n8K33j83pj21l0P5P4j40Q2n7K47
$$ 149 179 395 397 22 63 229 130 351 181 35 196 211 226 182 175 191 169 225 167 400 217 210 89 59 134 208 68 150 93 340
2875C40j19n4j6J0M8M9o6j24J4J1N9M4j9mlJ21j8k20R6O3j68J85j21L6R9n0P3j63N3jj14J31
$$ 340 221 167 151 161 209 258 192 68 82 93 152 196 177 173 170 291 273 53 149 212 44 229 108 144 243 193 266 103 156 155 41 172
2575A72j10J28j12J96k53L43k32JJO0lL5j29p1R3N6M6Q8n1j35q7KN0n7J73o4o4O1J14K6j38
$$ 172 62 190 78 274 21 364 132 133 134 194 191 226 97 26 119 175 221 309 258 123 36 38 88 31 204 140 76 137 251 277 139
2284A39m3O1J46L2j70j4j00M8l2L2n6J18q4NO9q6L2l0N4j6Q2l2M3m7n3L4p6Q7N7L7j69J0R4
$$ 139 96 157 303 335 165 151 51 99 67 99 43 161 77 82 151 65 97 67 121 105 187 155 198 151 98 132 56 143 200 237 68 78 172
1974A72r5R2Lk4o1N5m9p7J21J9p0kP6l8N1N2l6m6k7M5j10K69j64j14L43j04j68l7O8m5P0O6
$$ 172 77 169 172 148 87 142 93 16 137 156 86 84 160 122 173 225 189 143 116 161 51 320 156 42 385 281 113 76 144 99 169 235
1673B35k3j38J43R3p0r9l6J09m6P1j8j58JP6K2k8k8l4Q0k4O4k7J1Qq1M7m3j5K2n7K08l8P5
$$ 235 212 74 217 310 240 141 105 214 168 239 221 63 64 140 162 134 106 72 152 128 192 165 176 184 103 150 107 92 114 57 265 227 302
1364C02j26N4j64J68qm6j54J02K01j80O6LK06n9j27j46P7J14k5j90J03O5k01K8O5k3L5J40
$$ 302 176 230 66 234 226 180 26 128 329 149 215 218 424 365 238 92 169 283 258 68 171 236 35 63 128 105 140 280
1101B80K1K1k27Q9o0J54k20K69j30n8L06j01j89j26J7K58K4j04j5J09J56j33P9l4j57m4oJ75
$$ 280 301 322 95 184 124 278 58 327 197 139 445 344 155 29 46 304 328 224 209 318 474 341 420 386 229 185 179 354
838C54lj16J20j36P4J47J4p5q4Q1P8J16p2J5J21l11K02J39m1P2L7j77K01j4K3nJ3J78O3M20
$$ 354 351 235 355 219 293 440 454 379 295 376 454 570 498 513 634 323 525 664 623 695 732 555 756 742 765 760 773 951 1014 1434
556A434L8K02M42J52O28Q93K887L572O15l282l137o88p54p17m92l03j34r6p1j35r5M4j52j32
$$ 1434 1472 1674 2116 2268 2896 3789 6676 10248 10863 7581 4444 3756 3002 2285 1793 1490 1356 1260 1189 1054 959 1003 851 719
331G19L5n4j51j2p4M0j01O4J4J28j73J67k25q6K00n4N1j63J71l22K97j20j72J44Oj83J20j9
$$ 719 754 700 549 537 463 503 402 466 480 608 435 602 377 291 491 437 488 325 496 174 471 351 179 323 329 146 266 247
68B47MJ43j88R2j53L5KR9n5j19J28k7O0j28J20j44K2n0J37Q9j07p8J77p9l6j65J58J58r3j46
$$ 247 251 394 206 298 145 180 182 281 226 107 235 208 268 140 260 116 138 88 225 314 207 129 306 227 191 26 184 342 249 103
-214A03J23j07K8j0o7K2k5O3M7r2K16n0j24j0j8k7N7om5
$$ 103 226 119 147 137 70 92 67 130 177 85 301 251 127 117 99 72 129 123 78
-392G8
##PAGE=	F1=1538.7
##FIRST=	19140.455529915001534,	4405.895418600002813,	0.37835922837257385254
##DATA TABLE=	(F2++(Y..Y)), PROFILE
4406A38qL1O5p4q2L8P0%r6k6o%Q4L6o0j3O7R1p6j9L1j23Q8L8o0o0J13k0L2l1j7o5J03j8m3
$$ 138 130 161 226 152 70 108 178 178 82 56 50 50 134 170 110 97 164 255 179 160 191 68 156 194 134 74 187 167 199 168 151 86 189 171 128
4077A28j0o4O1k3N2Kj16J9P7L1K5J5j43Q7l9J5J17j66L3L6L6j04J7O8K7l4n5J5J7L1Oj13P7
$$ 128 118 54 115 92 144 146 30 49 126 157 182 197 54 141 102 117 234 68 101 137 173 69 86 154 181 147 92 107 124 155 161 48 125
3767A25n6J02j01M7k4n0M6J71j12mP8m7M4j52J09j18K0N4m2L6q5J27J10r8p8j2m9M6l3L1n3
$$ 125 69 171 70 117 93 43 89 260 148 144 222 175 219 67 176 58 78 132 90 126 41 168 278 180 102 90 41 87 54 85 32
3476C2N5J28j59k6M9K0NL0M5q9L7J6p3k0mKN3N8Jn8N8l6J2j5R3r9R6l2l6q2OQ5j6kL5K15N2
$$ 32 87 215 56 30 79 99 104 134 179 90 127 143 70 50 46 48 101 159 160 102 160 124 136 121 214 115 211 179 143 61 67 152 136 134 169 384 436
3129D36l54n0J90q9K12j28j89J68J2J2k8K2k9m7M5jJ90j63Lj22J9K8P6j26P2r2K82j48Pq9
$$ 436 82 32 222 133 345 217 28 196 208 220 192 214 185 138 183 182 372 209 212 90 109 137 213 87 159 67 349 201 208 119
2847A19L0N0M1n9j01K6l8J01K5k5J7k7J14l7j88Q9N0j10J71j27pR0m3R8j47MP6j21R3r6Q3
$$ 119 149 199 240 181 80 106 68 169 194 169 186 159 273 236 48 137 187 77 248 121 114 204 161 259 112 116 192 71 164 68 151
2556A51n0K07k72L14k40lJ7N5ML2j20o8J33O8L1J03j12j32n2j4N4n2K16j02j21P1J87j8j57
$$ 151 101 308 36 350 110 107 124 179 183 215 95 27 160 228 259 362 250 118 66 52 106 54 270 168 47 118 305 287 130
2284A30n3N0J51R3j82j0q6k2RN1j18J68q8j1O4j07K4M4Q2r3O2n1Q0l4n7L1n8R5M1N0j49j5
$$ 130 77 127 278 371 189 179 93 71 80 131 13 181 93 82 146 39 63 107 189 96 158 107 187 153 96 127 69 164 205 255 106 91
1983I1N1p5R4J9rq5N0J7j06J02lo6NO4k0L4N0j3p7J0L6j57L16j29j69L39j25j56J3M7n1P5
$$ 91 142 67 161 180 171 86 136 153 47 149 146 80 85 149 129 163 213 200 123 133 169 12 328 199 30 369 244 88 101 148 97 172
1683A72P3n3o9J28N6n9j00j2P0n3J03n0j41P5J6M7l4o6qQ0n6N8J5l2N0q5M0j3l3k4j9J97n8
$$ 172 245 192 123 251 307 248 148 136 206 153 256 206 65 140 156 203 169 103 95 175 119 177 192 160 210 125 165 152 119 95 76 273 215
1373B15R9j49J3j34J92nk4j25M7K33j98O8qK02l8j71j49R0J53n4j81J06N5j99Q1N8l1O0R3
$$ 215 314 165 178 44 236 231 207 82 129 362 164 232 224 426 388 217 68 158 311 257 76 182 237 38 119 177 146 206 299
1101B99K1j1k12R0n2J24j27K25j81L4K06j16j28j06J2K27K0k7l1Q7J21o9J03m8k14p5QK00
$$ 299 320 309 97 187 135 259 132 357 176 210 416 300 172 66 78 305 325 298 267 354 475 406 509 461 247 172 180 380
838C80m5p0O9n9N6J99l1j07j5Q5M2J30q5N5N9l02K73J45q8O4N8k27K40j2Q2m7J12J38O7M87
$$ 380 335 265 334 275 331 530 499 392 377 462 504 634 549 604 663 361 634 779 691 755 813 586 826 814 896 849 961 1099 1166 1653
556A653N5K31M75K10P73R62L350M099O62l818l557p98q84p58n88l02k36j10n3j41j79L5j51
$$ 1653 1708 1939 2414 2624 3397 4359 7709 11808 12470 8652 5095 4297 3413 2655 2067 1765 1529 1419 1366 1225 1046 1081 930
340I30j10M6j30j07k7p2M2o2K9L1J58k35J45j99r7J65J9L3j82J14k90K73j30j29J36oj32J53
$$ 930 820 866 736 629 602 530 572 510 539 570 728 493 638 439 342 507 526 559 377 491 201 474 344 215 351 345 213 366
77C66l7m4J33j61J13k47J15l3J47q4j16J35K7M4j44N5j46j8M8J41P3j54l3J52n7j27j05J51
$$ 366 329 285 418 257 370 123 238 205 352 268 152 287 314 358 214 269 123 105 153 294 367 213 180 332 275 148 43 194
-186A94J82j66o6J46k10Q9j3q0L4n1P5J4m6J88k7j31ok9K2L1n7m4
$$ 194 376 210 144 290 80 169 156 76 110 59 134 148 102 290 263 132 126 97 119 150 93 49
-392D9
##PAGE=	F1=1499.33
##FIRST=	19140.455529915001534,	4405.895418600002813,	0.3375530242919921875
##DATA TABLE=	(F2++(Y..Y)), PROFILE
4406A23j0K2J01q2o2j8P3Ml3m3m8L0J10J5p4K2%J21j2j34M6j46J39N7o0j03J35M1L0n3l9l9
$$ 123 113 135 236 154 92 74 147 151 118 75 27 57 167 182 108 130 130 251 239 105 151 5 144 201 141 38 173 214 244 191 152 113
4105A13M1mL5p2j1k0j2L3Nm3m1J11N2nM5j88J38k0pJ13j67K0K3K3q7j7J02K0l6j7K4qRK7j08
$$ 113 154 150 185 113 102 82 70 103 108 65 24 135 187 182 227 39 177 157 150 263 96 116 139 162 75 58 160 180 144 127 151 143 152 179 71
3777G1L6l4O1p1K8J6o5L2J64o2oM6m8L0j52J36j23K3K3K7mr5J29R8j11l2l2m1K8k2J0RJ5J26
$$ 71 107 73 134 63 91 107 42 74 238 176 170 216 168 198 46 182 59 82 105 132 128 33 162 260 149 117 85 44 72 50 60 69 84 210
3458B10j49m1P8j2J6J6M8o1K0Nn2k6NQN2L6J7j02P2QQK1O5j12R7n7l5o9oQ8n1K1N9J96Q3l22
$$ 210 61 20 98 86 102 118 166 105 125 130 78 52 57 65 117 153 170 68 140 148 156 177 242 130 227 170 135 66 60 148 97 118 177 373 456 134
3119A34j33K13p7J98r2j94J37J4J4k2M1n4n4K6M5J38j53K4j15P0k0O9j21P1j18L07j85P7j54
$$ 134 1 214 137 335 243 49 186 200 214 192 233 179 125 151 196 334 181 205 90 160 140 209 88 159 41 348 163 240 86
2847H6N1N1L5n4p7L7q6J44mm1M8m1J07n7j57Q4K7o1J66j24n7P2L7O9j33m5J52j28N5q3L5P
$$ 86 137 188 223 169 92 129 43 187 183 142 190 149 256 199 42 126 153 92 258 134 77 149 186 255 122 77 229 101 156 73 108 115
2547A15J84k49K43k15jL7N0J1K9j10o6J73P0PJ28j64j30j6l5N4j0K21j25j62Q1J86m0j54j7
$$ 115 299 50 293 78 77 114 164 175 204 94 28 201 271 278 406 242 112 96 61 115 105 326 201 39 120 306 266 112 95
2274I5J2J41J41k01j2m7o7L3N3j18J56q4k1O6j24M8P7P6j28M8o5J07l2o1K8m7R1K6O3j19l0
$$ 95 107 248 389 188 176 129 62 95 148 30 186 102 81 147 23 71 148 224 96 144 79 186 154 93 121 74 165 191 254 135 105
1983A05Qn6R7L4Nj08L5P4j24R0k4o1LM1QK6L9Jr4O1Rj45K90r1j90K92j31j32N5J6n8Q1R0p5
$$ 105 113 57 154 188 193 85 120 194 70 160 136 75 78 119 127 153 192 193 99 160 169 24 314 223 33 325 194 62 117 133 75 156 246 171
1664A71JJ14Jo2r6J9M0m9J16r9n2R6n0O3l5r8K8R0q8N1M1q9R7q3M4K5n1p0J1J75r3J05j27
$$ 171 172 286 287 225 129 148 188 139 255 156 104 200 150 213 178 80 108 198 110 161 202 113 210 127 171 196 145 75 86 261 168 273 146
1354A46n7n4J93pop3J5K03k04P2j7J79l6j77j14P7J67o7j55R4L0j49J06M5m3R4N5J2n2j89
$$ 146 89 35 228 221 215 142 157 360 156 228 211 390 354 177 63 140 307 240 85 179 209 60 166 211 168 262 317 329 277 88
1072H8J02n4Q5l4J82k23J34R8j41n7p7kJ87QM5l2Q1O3k6J27o3k52q9M9J78q1j9J2J1K4K38
$$ 88 190 136 221 187 369 146 280 378 237 180 103 101 288 296 341 309 390 453 427 554 491 239 150 199 377 296 277 289 300 324 562
781E62n7j20M7Q5pJ31r7R3Nk86L29J40j28O1P9k77K65k5J10m5J89P6R0M97N8K47M82K43Q24
$$ 562 505 385 432 517 510 641 544 637 642 356 685 825 697 758 837 560 825 800 910 865 1054 1130 1220 1717 1775 2022 2504 2747 3571
509C571R38L519M254O42l990l662q22r43p29o45k63l13r8l5j48k57L3j32o9N8k07m9l0p0M4
$$ 3571 4509 8028 12282 12924 8934 5272 4450 3507 2778 2133 1870 1557 1459 1424 1276 1019 1052 920 851 909 702 653 623 553 597
274E97k4oL6J75k77J40j78j15J25Q6K0j95Q0k36K40j50r3J23ko5J69p1q6J30j38J28l01J56
$$ 597 573 567 603 778 501 641 463 348 473 559 579 384 464 228 468 318 225 348 346 281 450 379 293 423 285 413 112 268
11B68o4K00j13j13J37P4K8j61Pj33n8J46J23L5j80L5J12n2j86j4J13J75k20L5J33k75J43k0
$$ 268 204 404 291 178 315 389 417 256 263 130 72 218 341 376 196 231 343 291 105 91 204 379 159 194 327 52 195 175
-252A75r3M5p6Q7j9%J44k0j23J6m2P2Nj08m4
$$ 175 82 127 51 138 119 119 263 243 120 136 94 166 171 63 19
-392A9
##PAGE=	F1=1459.95
##FIRST=	19140.455529915001534,	4405.895418600002813,	0.2796007990837097168
##DATA TABLE=	(F2++(Y..Y)), PROFILE
4406A02pJ0J18p2l1n1QM5M0n6p9M6J24J0p8J7m2J53K4k06O2q7N7P8p3p9J41Q4K5p7n4l9K1
$$ 102 95 105 223 151 120 69 77 122 162 106 27 73 197 207 129 146 104 257 281 75 137 50 107 185 112 33 174 258 283 206 152 113 134
4096A34j0J00q2j4o7l3M3L8K3j06J28M1rO6k25K13l4l6J02j53pJ4M2p3m9J49J7n2k1K8k2j9
$$ 134 124 224 142 128 61 28 71 109 132 26 154 195 186 252 27 240 206 170 272 119 112 126 168 95 46 195 212 160 139 167 145 126
3796A26N1q5j2qM0k6j2M6q8L5J41j2Ok3l1J0r5J10j04J2K9P2m1j05R2J19j08K1j3j00RPk0
$$ 126 177 92 80 72 112 86 74 120 32 67 208 196 202 179 148 158 63 173 69 81 110 182 141 36 128 247 139 160 147 47 56 63 43
3486D3Q3m1R9j17m7J04n8L6rM2k0j5%j9j0OM5L2QJ3j25O2N8kL3N6j10R2r0l7m1nM8m6K4J12
$$ 43 126 85 184 67 20 124 66 102 93 135 115 100 100 81 71 77 122 154 162 175 50 112 170 168 201 257 147 239 149 112 71 66 114 68 92 204
3148B04J70O9k59j64J67l5J65p4j64R7J0J0rM1o6m7J0P5P8j38L1q3R1l5L8r3M0q7K84k09J35
$$ 204 374 443 184 20 187 152 317 243 79 176 186 196 187 228 162 115 125 200 278 140 171 88 179 144 182 89 129 42 326 117 252
2857B52j83O1L0M9p7m0K7j02J54j1o1P1n6J23q0j28Q6Mk2J57r5j23P0J33Qj25o3J70j11K2
$$ 252 69 130 160 209 132 92 119 17 171 160 99 170 114 237 157 29 115 119 97 254 159 36 106 239 247 122 59 229 118 140
2575A40l7k1M2J29k00J65j75%O2N0jJ5p4m8J68P0nJ21j83j16lk4N1L5J93j35j36P6J04o9o0
$$ 140 103 82 124 253 53 218 43 43 105 155 154 169 95 47 215 285 280 401 218 102 99 75 126 161 354 219 83 159 263 194 134
2284A34Nl8R7J79k08j9J9q6K1M9r4J25q1l1R7q0M7M2N4j18Kj5R7n5p2L0k5N3L2O1q5k2j6n8
$$ 134 139 101 198 377 169 150 169 83 104 153 59 184 103 72 169 89 136 178 232 114 116 101 198 143 71 101 76 129 161 222 137 115 99 41
1964D1R4M4M2j34J8R5j11O5j3p7J2%P6J6pJ7r7R5k0j16K45n4k03K48r7j15M7lm8N8R9o4L2
$$ 41 135 179 221 87 105 200 89 154 141 64 76 76 152 168 161 178 81 176 156 40 285 231 28 276 179 64 111 108 60 118 217 153 185
1655A85J20m2p4j04M8L5k8P5j19M7Q9q4N4o1q2M9J00j26P0L5j32J24n6L9O2o9p8K6J40j11
$$ 185 305 263 189 85 133 168 140 215 96 143 232 148 202 141 59 108 208 82 152 187 55 179 123 162 224 155 77 103 243 132
1373A32P1p5p3L4J21rJ0j3jJ21j90L7L8J20l2j83k4M3J44q0j10Q6jr3J31L1n8J08M6Jj00j52
$$ 132 203 128 55 89 210 201 211 198 197 318 128 165 203 323 291 108 84 127 271 191 81 167 166 73 204 235 177 285 331 332 232 80
1072H0J01n7K6P6J12k24K08K4j90K2m4j6J47k5J22m7R3mJ6J28o1k86q4Q4J49j19M3k8N3l3
$$ 80 181 124 150 226 338 114 322 346 156 178 134 118 265 240 362 315 408 404 420 548 487 201 117 201 350 231 274 246 299 266
791B66K62q2r5R9Q6p8J46j33J45o6k35L38J37j37M1P4k83K48k1J08j4K32kJ14M50P0K33M59
$$ 266 528 446 351 450 536 458 604 471 616 550 315 653 790 653 694 768 485 733 712 820 806 1038 1036 1150 1600 1670 1903 2362
528B362K45P88Q12L348L999N70l778l420p41r43o20o45k00l32r2k0j47k71rm9m9M9k54jj7
$$ 2362 2607 3395 4207 7555 11554 12124 8346 4926 4185 3242 2622 1977 1777 1445 1353 1333 1186 915 906 857 808 857 603 602 585
293E85o4N0J4l4K9J68k79J37j65j15N9J68Nk09M2j40J61j42l7Q0Qj4J93j11r9J14j25J40l18
$$ 585 521 571 585 551 580 748 469 606 441 326 385 553 558 349 391 251 412 270 233 313 321 307 500 389 290 404 279 419 101
21A01J66p7K38j17j48J68J04j1j36o2q7r1K03J16k2j85R4N1j1k22N3Q6J49k44J08R2k82J54
$$ 101 267 190 428 311 163 331 435 424 288 226 139 48 251 367 345 160 254 305 294 72 125 211 360 116 224 316 34 188
-242A88k3p2K0m1O5n7N5P6k5o1Rm1R7l8j17k3
$$ 188 165 93 113 72 137 80 135 211 186 125 134 93 190 152 35 12
-392A2
##PAGE=	F1=1420.57
##FIRST=	19140.455529915001534,	4405.895418600002813,	0.2216485440731048584
##DATA TABLE=	(F2++(Y..Y)), PROFILE
4406H0klJ25p1K5n8p4P1J14p0j10O1J39Oq3J1q9J82M1k21O4m3m0Q4o2l0J27J09K9r0p1l8J
$$ 80 78 75 200 129 154 96 22 93 207 137 27 88 227 233 150 161 72 254 295 74 138 95 55 139 77 47 174 283 312 222 151 113 114
4096A14j7J71q7m6o8n2N6M7O5j09Q3K9j5J12k36K71o3p5Q3j41l4J5P1o0q0J97J4p9l4M2k8
$$ 114 97 268 181 135 67 15 71 118 183 74 157 186 171 283 47 318 255 180 263 122 88 103 174 114 34 231 245 166 132 174 146
3805A46m6P4o1o1J9J9J9n1Q4j00K7J10L7J8r2j3jl0P6r6J2M4J07q7j15N5J50r6N5j4j49%M1
$$ 146 100 174 113 52 71 90 109 58 142 42 69 179 216 234 142 129 128 98 174 78 90 134 241 154 39 94 244 148 203 189 40 40 81
3495H1m5J02p4Q3p4n3J30j03N4l3L7K1n2nJ4POQ2J3k5Oj11J3J03j6M6M6j03R2q6p6rJPm0K7
$$ 81 36 138 64 147 73 20 150 47 101 68 105 126 74 69 83 90 96 178 191 166 172 61 74 177 161 207 253 150 242 156 80 71 72 79 39 66
3157F6J65J28M0j80j80J11lJ33n6j24O5PPLM1p8l9qJ06J7j21L7n2J13n1jp4J7m7K66k27J55
$$ 66 231 359 399 219 39 150 147 280 224 100 165 172 179 182 223 145 106 98 204 221 100 137 85 198 147 146 72 89 42 308 81 236
2857B36j76O8NO3j01pJ2q0J25j3p6R4p0J37j02j00R0l0QJ53o2j17O3J52n4q7m9J24q1j0Rl9
$$ 236 60 128 133 196 95 88 100 20 145 132 56 150 80 217 115 15 105 75 83 236 174 57 120 272 218 131 82 206 125 115 124 85
2556H5L9P8j47Q9j35%Q8M9j3%l8l7J51O5k3J29j86j03J1j4M9O3J52j22q4L8rp4N5K6q7M4K08
$$ 85 124 202 55 144 9 9 97 146 133 133 95 58 209 274 251 380 194 91 102 88 137 200 352 230 146 184 175 101 156 182 95 139 347
2246C47k06j7Q5j05QM6q0Q5o9l0J37k6K6j2M1r9m3L6Q6p9q1L1lJ5K9M9m2ml1m9Q1M4P9j61
$$ 347 141 124 209 104 112 158 78 163 94 64 201 175 201 189 230 131 88 124 210 131 50 81 78 93 122 171 129 125 94 45 126 170 249 88
1927H8pJ06q9N1mr2L1l3J45Oo8K0o3R2m4q2J89k6j96K21n5r2K3l9l8L5J10n5N4J17p6p6j12
$$ 88 81 187 98 149 145 53 84 51 196 202 134 154 91 183 139 57 246 220 24 245 190 98 121 82 44 79 189 134 188 305 229 153 41
1617D1P7L0qL5j39J37P3j19M4p7n6O2R9j51J05J2j18Q3k1L0R3o7o7L4R7p6l8lO1k5K9j3K5
$$ 41 118 148 140 175 36 173 246 127 171 94 38 100 199 48 153 165 47 130 109 139 232 165 98 132 229 153 115 112 173 148 177 164 189
1307A89M6j8M9j66qQ3O2k7j71Q5j7R8p9n0Q0l4l5J54Pq1J17K9Oj32j15R9o0l1J64K3j82K50
$$ 189 235 217 266 100 92 175 237 210 39 124 107 205 126 76 156 122 87 241 248 167 284 313 319 187 72 171 111 80 244 267 85 335
1007C35k6k16Q4l1l1J08o3J91n5J10p7N2J37n3l11p0J03J04j50J12o9R4j08K67q8n0J37P4
$$ 335 309 93 177 146 115 223 160 351 296 406 329 381 518 465 154 84 187 291 141 253 184 278 170 437 349 299 436 510
744E10j47J59j75J91j24j71L28J13j32L1L6k44K14l4J05J7K64r3J19L84O2K02M10K21O75O13
$$ 510 363 522 347 538 414 243 571 684 552 583 619 375 589 555 660 677 941 848 967 1351 1413 1615 2025 2246 2921 3534
500C534K859L427M61l224k910n72q86m54n69j37l33o8jj39k71m0M1k2N2k88M1j1n1O2N1o2
$$ 3534 6393 9820 10281 7057 4147 3575 2689 2235 1666 1529 1196 1128 1127 988 717 677 718 696 748 460 501 490 439 501 552 490
256D90J6J55k69J48j53j16j2K43rk23J7l1Q1j33J8L8J1L1K10j56j02J13j19J45l27J81r0K76
$$ 490 506 661 392 540 387 271 259 502 493 270 287 256 337 204 222 260 271 302 512 356 254 367 248 393 66 247 157 433
-7D33j20j83J85J22l7r9j26l7r4K12J14p6j88J52qL1j93N6N2J16k36J37P2k69J55l4n2nJ4
$$ 433 313 130 315 437 400 301 175 138 44 256 370 294 106 258 250 281 88 144 196 312 76 213 285 16 171 137 85 80 94
-280I4O0j04J01Ql1KKn1J14o1j09%
$$ 94 154 50 151 159 128 130 132 81 195 134 25 25
-392B5
##PAGE=	F1=1381.19
##FIRST=	19140.455529915001534,	4405.895418600002813,	0.20797896385192871094
##DATA TABLE=	(F2++(Y..Y)), PROFILE
4406G5kj3R9n3O3l7n0J3J37p8j22O1J53Rr8Kq0J40O1j87L0J0j19P5n6L3J06J25L5j11p6m5
$$ 75 73 60 159 106 169 132 82 95 232 154 32 93 246 255 157 159 79 219 280 93 123 133 14 89 33 66 172 297 332 221 145 100
4105A00j5mK06p3o6o2k9M7M7O6q1L0rJ6J15k07K98r9j11O0j05o2M7Q5r6m1J95J2r6o5M1j0
$$ 100 85 81 287 214 148 86 57 104 151 217 136 166 157 173 288 81 379 280 169 229 124 62 109 194 98 57 252 264 168 103 144 134
3805A34n2R3n5l3k3%L3n0J06o4j9R0O3K6j64J3M3J3J5q0KP7J15j19j15J8J72p4M4oj67j8Q8
$$ 134 82 175 120 87 64 64 97 47 153 89 70 160 223 249 85 98 141 154 169 89 91 168 283 164 49 67 239 165 209 203 36 18 106
3495A06n9P8j02N4j0j9J14j06M5m6J7N2p8J3QL8qJ26pm7j6n9l1J08j2J5O9j07J21n4j42J2
$$ 106 47 125 23 77 67 48 162 56 101 55 72 124 46 59 67 105 97 223 216 169 153 94 63 171 159 174 243 136 257 203 61 73
3195G3J4n0LM3J57R1Mj09j52L0J7J22o3o9L6kQJ6L5q0m1mJ11%j25J9K0Q6k8l1q0KKK03k02
$$ 73 87 37 40 83 240 331 335 226 74 104 121 243 180 111 147 145 153 169 204 124 83 79 190 190 65 84 104 190 162 131 51 53 55 258 56
2866E6J45j41N5qP9j32K0kn0Q4ko5J09r3J58j20p4J16r7M9J08j6p5P1R4j09k7l3Q1n2l4M4
$$ 56 201 60 115 107 186 54 74 72 22 106 104 39 148 55 213 93 19 135 38 87 195 179 104 175 269 160 133 100 181 129 95 139
2565A39l5M8M2j43P2q9k2R2K8k1llk2R2M7k1J01j51o6J4k4N1Q8J14r0m0J0j39l5J71jj02l
$$ 139 104 152 194 51 123 34 12 104 132 111 108 105 83 175 222 201 302 151 85 99 75 126 214 328 238 198 208 69 34 205 204 102 99
2256I9J99j85N6Q1j20k0L2m1J7l8j4J92j1Ko2J0m0o0M5N2r9o1M0pLK1K2JJ9op3P9J6J05j60
$$ 99 298 113 169 250 130 110 142 101 118 80 66 258 247 249 187 197 157 97 142 194 95 34 74 67 70 91 113 114 133 127 54 133 149 254 94
1927I4rO3n7L0N4j35Q2n3J77k5j25K8rO8o4o3J40Kj84K20Nj09j6n7jj7J14j2K2J24r0o3p9
$$ 94 85 148 91 121 175 40 122 69 246 221 96 124 115 183 119 56 196 198 14 234 239 130 114 57 56 39 153 141 163 287 197 134 55
1617E5M7L1J3Lr5J10O1j02J1r7N1qJ19j69J17%l2j3k1K1J22l2n0KP8j2j81Q0J80j02n7J1J9
$$ 55 102 133 146 149 54 164 225 123 134 37 88 80 199 30 147 147 115 102 81 102 224 192 142 144 222 210 29 109 289 187 130 141 160
1307A60Q6j5j4j07n1J04j3l1o1Q6j1l5m3K3N0j6k1J68j0r9Q7M4Qj43p7Q8o0q9K21m3j15K39
$$ 160 246 231 217 110 59 163 150 119 58 144 133 98 55 78 128 112 91 259 249 150 237 281 289 146 69 157 97 8 229 186 71 310
1007C10l7k01P0Ml3N5p4K06m3J22j03N1J24j5k84j07R7Q7j75J57p0J07j82K62r3J3J25P4j78
$$ 310 273 72 142 146 113 168 94 300 257 379 276 327 451 436 152 45 142 229 54 211 141 248 66 328 235 248 373 447 269
734B69J52k01K23j73r4K49J03j02L8j1k08J76n0R6M2K62j58J11K82O1J39L95J60N33L86K180
$$ 269 421 220 443 270 176 425 528 426 464 453 245 421 371 467 509 771 613 724 1006 1067 1206 1601 1761 2294 2680 4860
490D860K672L45k475k254l80p71k70m54p5l04l9j4j10k40q4J50pM6k83O6nn9J00Q1r6j4J51
$$ 4860 7532 7877 5402 3148 2768 1997 1727 1273 1198 894 855 841 731 491 407 557 550 596 313 379 374 315 415 496 400 386 537
237E37k37J66j47j10o9K75J6k56mQ8Qj31M7J8L4K4K05j69q2R4r3J21k95J62q4K95j07k22J83
$$ 537 300 466 319 209 140 415 431 175 171 259 267 136 183 201 235 259 464 295 213 307 214 335 40 202 118 413 306 84 267
-36B67J32n2n1j60Nj09K02J23j17j72J68m0M8j39L0L7Q8k28J48N9k18J30p2J0n7R4M1j30R9
$$ 267 399 347 296 136 141 32 234 357 240 68 236 196 244 105 135 172 260 32 180 239 21 151 79 89 32 126 167 37 136
-308A36k2m1O4Po3J27q9r4P
$$ 136 114 73 137 144 81 208 119 25 32
-392C2
##PAGE=	F1=1341.82
##FIRST=	19140.455529915001534,	4405.895418600002813,	0.24615252017974853516
##DATA TABLE=	(F2++(Y..Y)), PROFILE
4406H9kk2O2m4R3k7pk5J50r6j35O1J60Jj04Mp2R8Q2j53pO2q4Kp3P2P5J32M0j30p3m2l1J0K30
$$ 89 87 65 127 83 176 149 142 117 267 171 36 97 257 258 154 158 86 184 266 113 106 168 84 86 13 85 160 292 332 202 129 87 56 66 296
4077B96o7p8m7nL8L8N7m4j2m8M7J09j88L26j36j47L7n1p0O0P9j22PJ78nr9q0M0Rn9J12m9n
$$ 296 229 151 104 99 137 175 232 188 176 128 175 284 96 422 286 139 176 125 55 115 194 72 79 257 252 153 73 113 122 63 175 126 121
3767A21o3j9L6n8J38j9o6P1Q2K6j79k8J32K5m0n9rJ12J21j50j15k0J85o2K9lj10l8P6n9Oj
$$ 121 58 39 75 17 155 136 70 141 223 249 70 42 174 199 159 100 91 203 324 174 59 39 224 162 191 188 78 40 116 57 63 62
3467F2j6J5J6R8j09L6n5LO5m4Nk6P1k3J60l6o0k8op6J12pj6R1j09J49Mj80l3L9o5J4M5J34
$$ 62 46 61 77 175 66 102 47 50 115 71 76 50 121 98 258 222 162 134 128 52 164 157 141 232 123 272 276 96 63 102 37 51 96 230
3148B30O4k3l7j25n1L7J10p0j2Oj0QK9K8q1m4JJ15oj20qQ2N4qk5j22rN5J40j77J34j06M3k1
$$ 230 294 271 234 109 58 95 205 135 123 129 119 127 156 184 103 59 60 175 169 49 41 123 177 169 144 22 13 68 208 31 165 59 102 81
2828H1R5j62M7j7k0M4K4l8J17j22J69j47l8J52j66R0M5J1l4Q0L6j63M1pL8k4n8Q1k2O8M1j83
$$ 81 176 14 61 44 24 68 92 54 171 49 218 71 33 185 19 109 154 165 131 211 247 84 125 118 156 132 74 155 133 201 242 59
2528E9R1q3m7R0Qk9oL2j5K2L8j0P3j16k9J9l5N4J03O6n7Pl7j60R9J02k1j10n0J90j53J37N9
$$ 59 150 67 20 110 118 89 83 115 100 122 160 150 223 107 78 97 62 116 219 285 228 235 198 38 137 239 218 108 58 248 95 232 291
2218B91j55l7K6km9qKK30rj7j06j5K2l8J5K4j15m0M8NOkk1M4M3J7r6P6j1J31j59k0J0pK9J03
$$ 291 136 99 125 123 74 66 68 298 289 272 166 151 173 135 150 174 59 19 67 72 78 76 55 99 142 159 63 139 128 259 100 80 90 83 112 215
1880B15j88J33p3K00o5j73M6M4M4q3m6R3L0j73K20O4j25n1p0J9rR2Mj9J20r4m0l6K7J8J8K5
$$ 215 27 160 87 287 222 49 95 139 183 100 54 147 177 4 224 288 163 112 42 61 52 144 148 129 249 155 115 79 106 124 142 167
1579A67p3O4K6o7mo0Q9p5J41j49R1j5M8j00j0KJ40Nl3l2N7M5k05N2K67j63j24L3J5J16k3n6
$$ 167 94 158 184 117 113 53 142 67 208 59 150 135 183 83 73 75 215 220 187 155 212 257 52 104 371 208 84 117 132 248 225 169
1279A69k7oL6q7l4P1L3K3j40KL1M1K2l3J57j9j07M9M9K0j45l3Q0m0m9J27q2n8K15k8j68M8
$$ 169 142 136 172 85 51 122 155 178 38 40 71 112 134 101 258 239 132 181 230 250 105 72 152 112 63 190 108 50 265 237 69 117
979A17K9l1Pn7J74l0J33r1J2J26L8k67j54R2P3j04P4n5J34j92J94r9P5R8O0j47J34k44K39
$$ 117 146 115 122 65 239 209 342 251 263 389 427 160 6 98 171 67 141 86 220 28 222 123 198 296 356 209 343 99 338
706C38j75m5J66Q8n5N9o9j83J76j03Q6O7K32j75Q8J66O0P6L79J00M12J82J496J912K81j752
$$ 338 163 118 284 372 317 376 307 124 300 197 283 350 582 407 495 661 721 797 1176 1276 1688 1870 3366 5278 5559 3807
462C807j617k07o33j41l17Pk75j1l1q5j72j66K38j2O9k46L5K5p2J33J10j29m3J46k06J86j31
$$ 3807 2190 1983 1350 1209 892 899 624 613 582 497 325 159 397 385 454 208 243 268 196 329 439 310 267 413 207 393 262
209B62r3j03K52N2k80LJ59o1j24P7jM6RK10j73o3P5p2R2k15J15r2K99p0k34J49J10n0J2j94
$$ 262 169 66 318 370 90 93 252 191 67 144 143 189 198 408 235 172 247 175 267 52 167 75 374 304 70 219 329 279 291 97
-73I7M6j33J82J64j25j79J62p3O6r5nM2Q0j98J07N1j63J09j04O0m4J06K7j24N6k5k4J03j0
$$ 97 143 10 192 356 231 52 214 141 207 112 107 149 229 31 138 189 26 135 31 91 47 153 180 56 112 87 63 166 156
-345A56q0J35p9j16J4
$$ 156 76 211 132 16 30
-392C0
##PAGE=	F1=1302.44
##FIRST=	19140.455529915001534,	4405.895418600002813,	0.3132178187370300293
##DATA TABLE=	(F2++(Y..Y)), PROFILE
4406A14k4j7K6k8R5j9K1l0J39j13j32N1J52Jj17L8n8O9R1j30l2R4m9oj05Q4N1J15K3j34p0
$$ 114 90 73 99 71 166 147 168 138 277 164 32 83 235 236 119 157 99 168 259 129 97 191 142 136 31 115 166 281 304 170 100
4115A00oo5N1K03n0o8n3JN1K9N4l5n0p5Q3J09j90L44j60j64OM1p3N1M4j38P4J17k2q9p0K6
$$ 100 94 29 80 283 233 165 112 113 164 193 247 212 162 87 170 279 89 433 273 109 115 156 83 134 178 40 114 231 209 120 50 76
3814G6L2l3R4m3L8j29RK4m0J19M0j09L0J01J4r6j09J82L6o4q3J9J20R5j58j14J6J09j9MMl9
$$ 76 108 75 169 126 164 35 44 68 28 147 187 78 108 209 223 127 18 200 236 172 89 108 228 323 165 51 67 176 157 161 165 126
3514A26m9M7p4KR9o4j9N6M4j02N7n7l7Q1rQq0Q5j7J67m3q1k6K1p5R7Qo7J17j24J80M1j66r2
$$ 126 77 124 50 52 151 87 68 124 168 66 123 66 29 110 101 109 29 114 97 264 221 140 114 135 60 157 165 98 215 91 271 312 146 54
3195E4N3l1l6N7R2K9j1J0p9p0j6J24o8NommO4Pr7l4NJ06Kj00jQ6J6Mjj20lM8N6j00P6m8Nj2
$$ 54 107 76 40 97 189 218 207 217 138 68 52 176 108 113 107 103 99 163 170 73 39 44 150 152 52 51 137 153 157 156 36 33 81 137 37 113 65 70 58
2828E8Q7j37K9lPON5l3J12j15J40j36j2J78k12J20k3J6QP5k2j81J00JJ4Jm4Q2j9Q2M1k04R6
$$ 58 145 8 37 34 41 47 102 69 181 66 206 70 58 236 24 144 121 137 145 220 198 17 117 118 132 133 89 171 152 234 275 71 167
2519A67q6l3O8K2m1j2N1k7m0J8QN4j11N2jn1O4J06J9mJ4n5o4J00L2l8j15n6J57r0J74J7j72
$$ 167 81 48 116 138 97 85 136 109 69 87 95 149 38 90 89 38 102 208 227 223 237 182 118 218 250 212 97 41 198 108 282 299 127
2209A27m2L3K1j14M6jK43rm7j23l3O4Ql5J0r2k5K9J1J1Rn8Q6M2K7j25Q1l4J25j40mo8M9O3
$$ 127 85 118 139 25 71 70 313 304 257 134 101 165 173 138 148 56 31 60 71 82 91 33 119 161 188 63 144 110 235 95 91 23 72 135
1889A35J44k09J10p1J75r0j80N0Q3K6p1m3L9M7j27K15Q7j28q9n5J2J2R7lo5J13r8l8MJ7J8
$$ 135 279 70 180 109 284 194 14 64 147 173 102 59 98 145 18 233 320 192 103 48 60 72 169 166 101 214 116 78 82 99 117
1598A17K8O0q4J4j0J2k1k1Q6j19J72j38O9l0R6j34k1%J26N8j8q8L8O4j69J7L15k07j68P6j7
$$ 117 145 205 121 135 125 137 116 95 181 62 234 96 165 135 231 97 76 76 202 260 242 154 192 256 87 104 419 212 44 120 103
1307A03J17j0p5L0K9Oj42l7J46rP1j06l6j2L7M6n5J47rr7m4Q4K4j53K0P6Km8K9p2j2J49k3
$$ 103 220 210 135 165 194 200 58 21 167 158 229 123 87 75 112 158 103 250 241 144 100 184 208 55 75 151 153 105 134 62 50 199 176
997A76r9J1M6jj3m2J05j1J28n1l9J13Q8k36j24N8K9lp7k2J69j13M6p9J06P7J9q3J14j84J47
$$ 176 77 88 134 133 120 78 183 172 300 249 210 323 411 175 51 109 138 135 58 36 205 92 138 59 165 242 261 178 292 108 255
706B55j16n2Q5Q3l2J28n8k68K44k18J24L8K09j02k2J26J3K8L61O7L61O7R86J315K66j244j093
$$ 255 139 87 172 255 223 351 293 25 269 51 175 213 422 320 298 424 437 465 826 893 1254 1321 2307 3622 3888 2644 1551
453A551j51m69j41j76R8k61K5m6p6p5j97J64kR7j68m7Q5j38J93J19j47q7J53j75K04j02o5
$$ 1551 1400 931 790 614 712 451 476 430 354 279 82 246 244 341 173 126 211 73 266 385 238 151 304 129 333 231 166
199A66p2J37R6k48M9J07o2j37O5pO4l2K00j31p2O8k8M0j15M6p6K65l6j76L7R2l9O2j77L8q4
$$ 166 94 231 327 79 128 235 173 36 101 94 158 126 326 195 123 191 163 203 88 134 58 323 287 111 148 240 201 263 86 124 40
-92D0J05K02q9j78J25p1M2q1j9O5J02j88L5M4j07R7j05P9QN0L0j21L3k7K6P9rr1J37n0j59
$$ 40 145 347 258 80 205 134 176 95 76 141 243 55 90 134 27 124 19 98 106 156 186 65 98 71 97 176 167 76 213 163 4
-383DK3
-392B7
##PAGE=	F1=1263.06
##FIRST=	19140.455529915001534,	4405.895418600002813,	0.38028311729431152344
##DATA TABLE=	(F2++(Y..Y)), PROFILE
4406A38m4j3jkP2l6O3j8J28j31j29M2J29j6j15R0l5M8R1j17n7J27k3k3j29J06K8R7Pj39o5
$$ 138 94 81 80 78 150 114 177 159 287 156 27 69 198 182 67 157 122 170 261 144 87 214 191 168 39 145 173 270 277 138 73
4115G3L2l7L0J64m4m9m8PO3J1M2j8p8j02J19R9k00L71j76j71j4J23q5L2Jq0Q7M5n0p0n1J2
$$ 73 105 68 98 262 218 169 121 128 191 202 244 226 148 46 165 264 64 435 259 88 74 197 112 144 145 65 152 197 147 77 26 38
3814C8N6oP6l8Q2j74O0J1k1P3P3j17m7J13llj04J46L5p7r5M6J29N9j74r5P2J3NkL0J4q0K3
$$ 38 94 88 164 126 208 34 94 105 84 157 230 113 66 179 176 173 69 215 250 173 78 124 253 312 138 43 115 128 133 131 161 175 95 118
3495A18q5J20R1j13n7Q8k1q5Q9o0p7R6K7J1j34R8rJ63n8r4j3M7p3R0L3j17J42j58J92Q9j45
$$ 118 33 153 244 131 74 162 141 56 145 85 8 104 131 142 8 106 97 260 202 108 95 142 69 159 192 75 217 59 251 340 195
3204A95j49O5Lq4N9M0LJ2N5l2o2m3P9n0J6k1Kj8R9j4j13k4J0R8Rp9MR2k3J6L1j07oL2j9j4
$$ 195 46 111 114 30 89 129 132 144 199 167 105 62 141 91 107 86 88 70 169 155 42 18 28 126 135 56 60 152 129 145 176 69 63 95 76 62
2866F2R%l7rO0n4OPL2l1O7m7J06j08J22j16J0J99k28J03k2l7M4O2o5n8L0QrK8l0Q4l4Q1M7
$$ 62 71 71 34 25 85 31 37 44 76 45 112 65 171 63 185 69 79 278 50 153 131 94 138 200 135 77 107 115 106 134 104 188 154 235 282
2537B82k17J09q0j8M5M6m3k8O1l4r8L6j1O3p7O7j3p0O8J10k9L9J1q5K0J14k6n6j19m4J45m8
$$ 282 65 174 94 76 121 167 124 96 157 123 25 61 50 113 36 103 90 20 88 198 169 208 219 134 154 268 242 186 67 23 168 120
2237A20J92j5j80l9N0J3q4K7kK29l6n5j18n0J04N4q4J1n2k6oPQM4p1J14K5L7j53Q4n5J23j16
$$ 120 312 297 117 78 128 141 57 84 82 311 275 220 102 52 156 210 126 137 85 59 53 60 68 112 41 155 180 217 64 148 93 216 100
1927A00K2n8nJ15J83k34L3m6J49j15r0k4J23Rn8m0j5O4q1K10J00j40j18l0mK3J12kj14J01
$$ 100 122 64 59 174 357 123 156 110 259 144 54 30 153 162 104 64 49 113 32 242 342 202 84 54 50 73 185 183 69 170
1645A70n5o5M0KJ9L7Q5j04k7l7J01k8%O3j49K18j64Q4n9J30j51j2j2J02J02j2j51J3Q5j31
$$ 170 115 50 90 92 111 148 233 129 102 65 166 138 138 201 52 270 106 190 131 261 110 98 86 188 290 278 127 140 225 94
1364I4J3L19k30j92J18m7J12jp1L2Q0rj37n9J63l3J13p6o5m6L4P1p8J36Kq7j37J18K9j61P3
$$ 94 107 426 196 4 122 75 187 186 115 147 227 218 81 22 185 152 265 189 124 78 112 183 105 241 243 156 19 137 166 5 78
1072G8P3L1n8n7K4l5Q7j4k4l6N3L9k3l8K6RJ23jq1Q2J19j97q3L1pN0j49j6J74m8l9rO4N8k1
$$ 78 151 182 124 67 91 56 143 129 105 69 122 161 138 100 126 135 258 257 176 258 377 180 97 128 121 171 22 6 180 132 93 84 148 206 185
744A85k4Q9q0K4n5n5Q1K6j9J85Kl04K37k32J07m8K06qj41K00j18K0L13Q3L49O7P42R82K82
$$ 185 161 250 170 194 139 84 165 191 172 357 359 55 292 60 167 119 325 317 176 376 258 278 591 674 1023 1090 1832 2814 3096
471C096j035p51k03l05k67r7K03k52N5j0j40Oj17l8OJ10j04j08J65j85J96J32j59j30J60j51
$$ 3096 2061 1310 1107 802 535 438 641 389 444 434 294 300 183 145 151 261 157 49 214 29 225 357 198 68 228 77
227G7K15q3m6l7K7J25j57O8L0l0j19j3lR8n6J46n9r4M6K5lk3l3n9K31mj17p5P4k7J12j60K9
$$ 77 292 209 163 126 153 278 121 189 219 189 70 57 54 152 96 242 183 89 135 160 157 134 101 42 273 269 152 77 151 124 236 76 105
-83A05l5K8K39n2j68R8p9Ro8l1Q7J24j77l8L6m9J06q4P6L8k1J7j04K6k8P5M6j8q6J53m6j50
$$ 105 70 98 337 285 117 215 136 145 77 46 133 257 80 42 78 29 135 51 127 165 144 161 57 83 55 130 176 158 72 225 179 29
-383B9n
-392B4
##PAGE=	F1=1223.68
##FIRST=	19140.455529915001534,	4405.895418600002813,	0.41170623898506164551
##DATA TABLE=	(F2++(Y..Y)), PROFILE
4406A50n4k8OJ6K9m7P4K9J02j31j27L7Q4k8o3J22n1O9Q3j31n3J31j3l4j44J34M2O7m6j00p6
$$ 150 96 68 74 90 119 72 146 175 277 146 19 56 140 112 49 171 120 189 272 141 88 219 206 172 28 162 204 271 225 125 49
4115D9N3PJ7J05m6l7l7OP6J2K8l8o2p7J05J06k51L91j68j59qJ49q0pk2qP6j8p4m9k4J1O1J5
$$ 49 102 109 126 231 185 148 111 117 193 205 233 195 133 56 161 267 16 407 239 80 72 221 141 134 112 104 180 162 88 39 15 26 87 102
3796A02J9LJ04j73Q1L1k5K5R7j04j44J29k4Q2r4Q5M2o3j14R5J13J8j77q8J62n6j2M2M8%j02
$$ 102 121 124 228 55 136 167 142 167 264 160 16 145 121 203 109 194 236 173 59 154 267 285 108 20 182 126 114 156 204 204 102
3504A02Pq7K31P9j68q0R7o8o5J28n6j01P2O6jj46O6K5J33o2q9J2L7o5J08L8j04J16j65J45
$$ 102 109 22 253 332 164 84 181 113 48 176 120 19 91 157 156 10 76 101 234 172 83 95 132 67 175 213 109 225 60 205
3223B05J03q1j72M3K6q8J9J5l4M3Q1Nk7k7L3m1k4mLoJ22m2j04j7J6P8j4o3QR2k6J2K5n4k6
$$ 205 308 227 55 98 124 36 55 70 36 79 160 165 138 111 144 103 79 75 78 72 194 152 48 31 47 125 111 48 56 148 122 134 159 105 79
2894G9K4p7O2n4L1n0J6K3%K7j7L4k9N7p8J01j02J22q1JK03k21P8K1j15N8M9q4M6k2jk3M1%
$$ 79 103 26 88 34 65 15 31 54 54 81 64 98 69 126 48 149 47 169 88 89 292 71 149 170 55 113 162 78 124 102 101 78 119 119
2575A19Q8l7L9J9j76R1m8L2NO4l8m9O5o1p4M3o2J15l6J0k0n9N5J02o3P8j4q7N5R3l3n9j35
$$ 119 207 170 209 228 52 143 95 127 132 196 158 109 174 113 39 82 20 135 99 109 89 30 85 187 124 202 188 101 156 249 216 157 22
2265B2LJ17oJ71m6j59k0O9l1j9j2j8K11n4o5q7k7R2R1j24N6m5n9j7JJ6O0p9J39K5K9j73P7
$$ 22 25 142 136 307 261 102 82 151 120 101 89 71 282 228 163 76 49 141 232 108 164 119 60 43 44 60 120 41 180 205 234 61 138
1955A38o1R1o0L6j3p9J55K22k46m6l0R1j16Mn7J26%l6l7o5O4j9J83Q8j39j31ml4L3J17Pj03
$$ 138 77 168 108 144 131 52 207 429 183 137 107 198 82 86 29 155 155 119 82 17 81 62 245 333 194 63 59 25 58 175 182 79
1655G9L5L1m4%j9K8L7Q5j17l1o9J74j9j3L8j33K33j87J16j08J40j37j1j4Q7J29k2j96j2O1
$$ 79 114 145 101 101 82 110 147 232 115 84 15 189 170 157 195 62 295 108 224 116 256 119 108 94 181 310 288 92 80 141
1373A41o4L4K95k12j74R7n4P6Rk4j2J02J4j20q0J54l3J22n4q8m7K9O8p9J22J0n3j20M1O0j04
$$ 141 77 111 406 194 20 117 63 139 148 124 112 214 228 108 28 182 149 271 217 129 82 111 179 100 222 232 179 59 100 160 56
1082E6jQ8M6n6j12J17q6L2Q4j6q8N0N9j7m5k2K4R0L0o1L2J07j39l8J1j7M5p4n1J13mq8L0M8
$$ 56 55 143 189 133 21 138 52 84 168 152 64 114 173 156 111 89 113 203 233 172 204 311 172 134 145 128 173 99 48 161 157 69 99 147
763A47P0m7o7J06jp6kl9R9k3l0K01Q3k99J79j64K9r1K05K9j81K90j96jK20J04L63O5O79Q44
$$ 147 217 170 103 209 208 132 130 91 190 167 137 338 421 122 301 137 166 75 280 309 128 418 222 221 441 545 908 973 1652 2496
481B496K49r46n63k41k17l74r0K64k07O1N1k40N9p8j23N1N3p4j17K33j46J14R2j36p6N8q1
$$ 2496 2745 1799 1236 995 778 404 314 578 371 432 483 243 302 224 101 152 205 131 14 247 101 215 307 171 95 153 72
227G2J76p4j0m0qJ23r9P3k8Jp5q4J1J07k2N9Qj40N0M1oK8q0l9J88J4q7j27N9l4J29j08j0J3
$$ 72 248 174 164 124 116 239 140 213 185 186 111 27 38 145 123 182 190 50 100 141 135 163 83 44 232 246 159 32 91 57 186 78 68 81
-92H1pK09Kj35O7q5J5q4MQ6J14j74k1l5L1N9l7O6M6r6nm2J2m4J11L0m7m2J34n2j13k4
$$ 81 74 283 285 150 217 132 147 63 67 153 267 93 72 37 68 127 90 156 202 106 101 59 71 27 138 168 121 79 213 161 48 24
-392B4
##PAGE=	F1=1184.31
##FIRST=	19140.455529915001534,	4405.895418600002813,	0.44312939047813415527
##DATA TABLE=	(F2++(Y..Y)), PROFILE
4406A61o2m3J3L3j4n8P5O7Q6j22j25L3M0l9N9R6q4P3Q5j37m8J35j1n6j49J72N5L6q0m5p1J5
$$ 161 99 56 69 102 88 30 105 172 258 136 11 44 84 45 104 200 116 189 274 137 89 224 213 157 8 180 235 271 191 146 75 90
4105I0N4J1L6n9j5j5oP9J8J8q6Ln3R2J10k26L14j30j55j0J65q3l7l6M9M9m3o2m0r%N7L6l7
$$ 90 144 155 191 132 117 102 96 175 193 211 125 128 75 167 277 51 365 235 80 70 235 152 115 79 128 177 134 72 32 23 23 80 116 79
3786G9M3J25j70J01N2k9l5J11p2j44L7k5J13o0K1M3k4j07J24P9j2j69l1J75p1m9Q1O1k5j32
$$ 79 122 247 77 178 230 201 166 277 205 61 98 73 186 126 147 190 166 59 183 262 250 81 50 225 154 105 186 247 222 90
3504I0Jq1L27N3k08q8J01j20oJ29l9j09K1Q1Kj43L5N8J05o6q4L6K6n6J26M4r7Q6j35O0J13
$$ 90 91 10 337 390 182 94 195 75 69 198 159 50 71 152 154 11 46 104 209 143 59 95 121 65 191 235 138 224 89 149 262
3213B62k3j84L1M8r2j2lL6m6R6L2J7kj3l1o6J3J5J5J35p8r7rK2N9l8m7LQ2j0K7Rj0n4Ro8P9
$$ 262 239 55 86 134 42 30 27 63 17 113 145 162 160 147 116 50 63 78 93 228 150 53 44 66 125 87 40 43 125 115 142 151 141 87 96 28 107
2866A07q5J8LL1J1KM3m5L6k7M6j08Q5j04J29l5j7J98k04O1O3j92O9L0p5J04o0Ll6N2L0R3n6
$$ 107 22 40 43 74 85 87 130 85 121 94 140 32 117 13 142 107 90 288 84 145 208 16 85 115 40 144 84 87 51 103 133 226 170
2556A70j8Oj18P2j5Q0l3Q1l2p0O8q8n1O1j04J59ol7j9n6L2J08q2O3j5p1L3Q3l0j9j07J7N4
$$ 170 152 158 40 112 97 177 144 225 193 123 191 103 52 113 9 168 162 125 106 50 82 190 108 171 156 85 118 201 171 152 45 62 116
2246A16K6J40o6j29jQ8p6M8n2l4J93p2n8l9J2K1J32j58J00l9r1k8nK4O6r7J65K5L1j84P1o8
$$ 116 142 282 216 87 86 174 98 146 94 60 253 181 123 84 96 117 249 91 191 152 61 33 28 52 118 21 186 211 242 58 129 61
1946F1N9mM6K7j25J47K75k42j27j2L2j17J08q1J20j9j9l9p7K7M7J61O7j47j30L4l3nJ16J3
$$ 61 120 116 162 189 64 211 486 244 117 105 137 20 128 47 167 148 129 90 13 40 87 248 315 168 38 72 39 34 150 163
1664A63p4j1J06l2m0m1K8K8Q9j25l6k7J72pk1J6j26K40k01J56j55J50j23j0j7P2J41m8k11
$$ 163 89 78 184 152 112 71 99 127 216 91 55 28 200 193 172 188 62 302 101 257 102 252 129 119 102 174 315 267 56
1392E6nK1j3M7K61j85j47P7o2M0K1K2n7J15K8q8q8R8oJ15m9q9k7K6O4q1J09J4k4n6o5Q7n2
$$ 56 51 72 59 106 367 182 35 112 50 90 111 133 76 191 219 131 43 141 135 250 201 112 85 111 175 94 203 217 193 137 72 159 107
1082A07p6J05N2o2j03J45j17mK04o1j36N3O8k0l3n2L4N2L5Om3P1q0P%j8L1pp8O2M1j39P5L6
$$ 107 31 136 188 126 23 168 51 47 251 190 54 107 175 155 122 70 104 156 191 197 154 225 145 152 152 134 165 158 80 142 183 44 119 155
763A55O6j3j45Q5P3j83O6oJ13p7j4J66J32k51J14j01m3n2J60K1j57L20j80n7J28J28L45L0
$$ 155 221 208 63 148 221 38 104 98 211 134 120 286 418 167 281 180 137 85 245 266 109 429 249 192 320 448 793 823
500H23O49P37K21q52m65j93j75l99j40K68j25L0J32l19R1n8j27J03l7p5o3K37r8M0N2j12j3
$$ 823 1472 2209 2430 1578 1113 920 745 346 206 474 349 379 511 192 283 225 98 201 164 89 26 263 165 205 257 145 132
246A32l5k1J27o3K5l4l4R7o8R5p0L2l1j35M5O3L5l4P1j72O9J4K4M6q4l3J30K4o5p5K2p5J15
$$ 132 97 76 203 140 165 131 97 194 126 221 151 183 152 17 62 125 160 126 197 25 94 108 132 178 94 61 191 215 150 75 97 22 137
-64A37n8m7P0l3J61L7r3M5r2K1r0M9O6Q4j49J5j7K4%jM6M5j65k4O3l5k6J04J7p1pJ06m8o7
$$ 137 79 32 102 69 230 267 174 219 127 148 58 107 173 257 108 123 106 130 130 129 175 220 55 31 94 59 33 137 154 83 76 182 134 67
-383F7m4
$$ 67 23
-392B3
##PAGE=	F1=1144.93
##FIRST=	19140.455529915001534,	4405.895418600002813,	0.42345196008682250977
##DATA TABLE=	(F2++(Y..Y)), PROFILE
4406A54m7p2K1L9k1rmR2O5q0j27N6k5K8Q3O9j06N9P7j12m4J13ro5j09J57N3O1j18Nn6m2P6
$$ 154 107 35 56 95 74 65 61 153 218 138 11 67 42 70 153 222 116 175 252 140 96 209 200 135 26 183 236 297 179 184 128 86 162
4096A62K1k8p5kJ3qN1L5J1j34J18q4J05Q7j61K18r1j68j1J45o2n5l4M6N3k0m1o0K3j4M2M8
$$ 162 183 155 80 78 91 83 134 169 180 46 164 80 185 272 111 329 238 70 59 204 142 87 53 99 152 132 91 31 54 40 82 130
3796A30r4N7J45j50J02O5j1o7R0m0j23k6j4P8qm6N2ql1J01M4mj42OJ42p2n7Q8O2n0j45Qp3
$$ 130 36 93 238 88 190 255 244 177 267 227 104 78 64 142 134 88 140 132 101 202 246 242 100 106 248 176 119 207 269 219 74 82 9
3486IL71M6k29r6P8j31O2J13l0j06m9R2%j13K0P5O9o3o9N2Pm3J37L6q5O0j06j4Q6L4j62K6
$$ 9 380 426 197 101 179 48 110 223 193 87 38 130 130 17 37 112 181 118 49 101 108 65 202 238 153 213 107 93 179 213 51 77
3185G7L1n7k0M9N9r7K0M5N9L2j7q3q3N2NL7J30r7q4NJ5L3l9k9k7Q9J3L2%J0n2k0n0O9m3l6
$$ 77 108 51 31 80 139 42 62 107 166 198 181 98 15 67 72 109 239 142 58 63 78 111 72 43 16 105 118 150 150 160 108 88 38 107 64 28
2847B8L2M7J6k0O6p3K3RK3j32N7l8P2K1l1J71j83M5R3k26P6J3n9Q8l6l5%J8O2R4o7o7K1p2
$$ 28 60 107 123 103 169 96 119 128 151 19 76 38 110 131 100 271 88 133 226 0 76 89 30 118 82 47 47 65 127 221 154 87 108 36
2528C6L5M3J02o2O7rp8O1j16m0N7n7J19M1p0nm6j1J24n3jK5o3l0M1J7L1n8j0%M5J11q1p4J5
$$ 36 71 114 216 154 221 212 134 195 79 39 96 39 158 199 129 124 78 67 191 138 137 162 99 69 110 127 158 100 90 90 135 246 165 91 106
2199A06P7j19J05q6m9K04m8m8l9K5J0J25j78J23m1j23J6l8M0O1r0J48K1K9j60L5n3K4L7N2
$$ 106 183 64 169 83 34 238 190 142 103 128 138 263 85 208 167 44 60 22 62 123 33 181 202 231 71 106 53 77 114 166
1918A66N3j36J16L16k27j27n2no5J11r1J11m1j0k9p2J1O9J30L0j34p1K5ol7N5L9j8l1J07o
$$ 166 219 83 199 515 288 161 109 104 39 150 59 170 129 119 90 18 29 98 228 258 124 53 78 72 35 90 129 111 80 187 181
1626A81n6l6K3j6Q2r5n0J2J32L8lk7j14K02j79J66j58J24q9k2k5N1J50o9j37J3m3nO2K00j61
$$ 181 125 89 112 96 178 83 33 45 177 215 212 185 71 273 94 260 102 226 137 115 90 141 291 222 85 98 55 50 112 312 151
1335A51j18P2o7K6J6P7o5O6N3p8m6jL0Q1l1q0RJ4O5p3P8J9%mj16R8k8j19R8L3n5o4J43j43
$$ 151 33 105 38 64 80 157 92 158 211 133 87 86 116 197 166 86 95 109 174 101 179 198 198 194 78 176 148 29 127 160 105 41 184 41
1016D1K2K73j13j82P0M7j6jr9P7k0L5P3n9j7k0M4J6k5j1N3q1L2P5j93J10L4N0K9j24l3J37
$$ 41 63 336 223 41 111 158 142 141 42 119 99 134 207 148 131 111 155 171 146 135 188 107 139 214 21 131 165 215 244 120 87 224
716B24j57j2O8O9j09K4J04J48j61L8m9r9RJ35k9j21L25j41q9N2J16L45j8N46O59J79p06l94
$$ 224 67 55 123 192 83 107 211 359 198 236 187 88 97 232 203 82 407 266 177 229 345 690 672 1218 1877 2056 1350 956
453I56r2j74l56j37J22lj6K09l31N5k3r2J19m7j22m9K41p7J1J6q9K7n7k0R9p0O8k3o3P9o1
$$ 956 864 690 334 197 319 316 300 509 178 233 210 118 237 190 68 19 260 183 194 210 121 148 91 71 170 100 168 145 82 161 100
162A00Q8p7N4J4j70O0M2P2o9P3j51P5l6O3M0n6n8R3M4j03J9Op7M8k3k6N8j8R7O0o5K4p3J6
$$ 100 188 111 165 179 9 69 111 183 114 187 36 111 75 138 178 122 64 157 201 98 117 123 46 94 71 45 103 85 182 242 177 201 128 144
-158A44q1N9M7N6j19O9MJ5o9L8J4L3j94N0O9r4PP6J2q8L1O8n5l3k2
$$ 144 63 122 169 225 106 175 179 194 125 163 177 210 16 66 135 41 48 124 136 48 79 147 92 59 37
-392C7
##PAGE=	F1=1105.55
##FIRST=	19140.455529915001534,	4405.895418600002813,	0.40377452969551086426
##DATA TABLE=	(F2++(Y..Y)), PROFILE
4406A47k3r2J9L8l4L6m5P8M9l2j24Q4m2O8N8O8j41L0Q0p8m1R1Mo7q6J22N5R1j18J8k8q5R0
$$ 147 124 32 51 89 55 91 46 124 173 141 17 101 59 127 185 253 112 142 222 144 103 194 198 131 45 167 222 313 195 213 185 100 190
4096A90K0p5p5j1K1K8j5M2nn3J36j17J17O4r5J20n2j76oP6j2o7k7L3M8J2j0q0N3k3L4L7r8
$$ 190 210 135 60 49 70 98 83 125 120 67 203 86 203 267 172 292 240 64 58 134 122 55 28 61 109 121 111 31 84 61 95 132 34
3786C4M1J36j31J03P7Rj01P0j3j07j9rK1K1o5L2ML9P9RK0r9MP3n2m3P9M6n9j42K1o1L68O8
$$ 34 75 211 80 183 260 269 168 238 225 118 99 90 111 132 67 99 103 142 221 230 250 151 155 228 176 133 212 258 199 57 78 17 385 453
3467D53k45r9N4j42J20Q8j6r9q9N6J6o5L4M4L9n6n3O6j1l0J38J9o8L9q6j9j5R3j31L3J0k7
$$ 453 208 109 163 21 141 229 213 114 25 81 97 32 66 110 149 93 40 106 95 65 203 222 154 193 107 88 73 166 35 68 78 51
3166E1J3O8N9r5p1M3R3N6j7j30n1O2j0N4J15j25o1K8LLJ6l2l8M2M1M1qL0n1n0l1N8J5p3L6
$$ 51 64 132 191 96 25 68 161 217 200 70 19 81 71 125 240 115 54 82 85 88 104 72 34 76 117 158 150 180 129 79 48 106 121 48 84
2838H4L7L0l3R0j00J3N1j6r5J0J1MO8n4J36j48M2R4k11Q5mn8N6j1p3L6j8Q5Q5o3j01Q0n9j2
$$ 84 121 151 118 208 108 121 172 156 61 71 82 86 154 100 236 88 130 224 13 98 94 36 92 81 8 44 26 111 196 133 32 112 53 41
2519D1R1J23r2N3J5q6N3j43k9N3j0P0P9r5K0l6n5J40k3n6P4m9q6jO3O5k4l6n6O4Q3r7j8K2
$$ 41 132 255 163 216 231 145 198 55 26 79 69 139 218 123 143 107 52 192 169 113 187 138 52 51 114 179 155 119 63 127 210 113 95 117
2199A17O0j00R8j11n7K38kp0o9M6RJ18j98J37n2j41P3m3J0P6o3J06qL8j27Ql0k0O9N4P3j18
$$ 117 177 77 175 64 7 245 243 173 104 150 159 277 79 216 164 23 96 53 63 139 76 182 174 212 85 93 63 43 112 166 239 121
1899A21L6L62k06j14p6mn1J09j05J01o2j1k9m8J5P1Q0Kj11j2J7M0m8p0P8M3m6R2Mn5j7Ro9
$$ 121 157 519 313 199 123 119 68 177 72 173 111 100 71 23 38 109 189 191 80 68 85 125 77 7 85 128 82 174 178 123 106 115 46
1589D6J00l9p9L4R2Q2L3n6j22J43j23J33j17O3n0l0m2K1J54r5j4Om0n5O5J28j28q0P7o2J6
$$ 46 146 107 28 62 154 236 269 213 91 234 111 244 127 190 140 110 68 89 243 148 134 140 100 45 110 238 110 30 107 45 61
1298F1J6R5l5KO4o8nr9O5M8j4o9M5JO5o5M9K4K3M8j67J05rj26N5J9m4k4J40j63N1K95j37k23
$$ 61 77 172 137 139 203 135 130 31 96 144 130 61 106 107 172 107 156 180 203 251 84 189 180 54 109 128 84 60 200 37 88 383 246 23
979B3R1K6j1L2j48J31q4K7J31o8r5L2P0L3l1o2J02p1J7Q8j94J25J1J3N1m5j69K04n2r6N8K9
$$ 23 114 140 129 161 13 144 60 87 218 150 55 87 157 190 159 97 199 128 145 233 39 164 175 188 239 194 25 229 177 81 139 168
678A68j36O3M0J50q9k9Qj35Q8J16p3j16K99o4q3m6Q2L71l6M36N76J40n54l85K7j61k99j21
$$ 168 32 95 135 285 196 167 175 40 128 244 171 55 354 290 207 161 243 614 578 1014 1590 1730 1176 791 818 657 358 237
415B37q2J22n8K62k41p5M5p9J10k5j38o0K20n6j9Ql9Rj3p3R1p2J17k3j01O0n2Q0q3P1N3j68
$$ 237 155 277 219 481 240 165 210 131 241 216 78 18 238 182 163 171 132 141 128 55 146 74 191 168 67 127 75 155 72 143 196 28
115B8L8K1J10o7L8j11J04j03Q6L5k9q3N6O4j40R7k6o0Mj4M9j2J7O6L9l1Pn4J0p0O8K8K8r0
$$ 28 66 87 197 130 168 57 161 58 144 179 150 67 123 187 47 144 118 58 62 48 97 85 102 168 207 176 183 129 139 69 137 165 193 103
-205A03J25K4Oj38P6k8Rr2P5M6j84M0N0J6r7O0K2o3%%
$$ 103 228 252 258 120 196 168 177 85 160 206 22 62 112 128 31 91 113 50 50 50
-392E0
##PAGE=	F1=1066.17
##FIRST=	19140.455529915001534,	4405.895418600002813,	0.35817551612854003906
##DATA TABLE=	(F2++(Y..Y)), PROFILE
4406A30rq0QJ7j1M0m5L8M7Oj23J23m7O3K3P5j40j9Q2j8l3N0J6n2r3J17M4J17r7qlq6O8K4r5
$$ 130 121 41 49 66 55 95 50 88 135 141 18 141 94 157 180 255 115 96 178 160 127 177 193 141 48 165 209 326 229 221 218 132 200 224 129
4077A29m2k0j9P0n1Oj7J04P3j62J35J6k1N2l2j27Nk7L8j06M9l6N4M0J3q5O6l5K8L8p6mJ17
$$ 129 87 67 48 118 67 73 56 160 233 71 206 222 201 253 221 94 99 72 110 4 53 17 71 111 124 39 105 70 98 136 60 56 173
3767A73q3M1J04M0j10J7kp1J9k4J1K7J5n3l3J10M8j5M4n7nj9j3j2K0O2o3j20J9l2L37Q4k25
$$ 173 90 131 235 275 165 182 180 109 128 104 115 142 157 104 71 181 229 214 258 201 196 177 164 152 172 234 171 51 70 38 375 459 234
3458B34j05M5j63J59N7j0p2o8n7K8KM1J0L3m9m3P7m0j6J16Rm4K7o6K7r7N6o0M2l0K0K5R6L3
$$ 234 129 174 11 170 227 217 145 77 20 48 50 91 101 134 85 42 119 79 63 179 188 144 171 105 132 35 91 31 73 43 63 88 184 217
3138B17p6p0j3O9R3rj62rN9k6M9Q5j18m7O6m9j0J00m3l3j3M7M8%L9n3m5m6N5O3q8KM1K6k3
$$ 217 141 71 58 127 220 211 49 40 99 73 122 207 89 42 108 59 49 149 106 73 60 107 155 155 194 141 96 50 105 168 80 82 123 149 126
2810A26R1j11J6O6k8m8j4Oj6Q6q0R8j11K9Q8j72R6j8m4j7K8l9K6k5M5P7n0o8J00n9j3J04Q6
$$ 126 217 106 122 188 160 112 98 104 88 174 94 192 81 110 198 26 122 104 60 43 71 32 58 33 78 155 105 37 137 78 65 169 255
2500B55j04P4K3j16O1j57nM4K3JJ09q2J9k2q8J41J5q8J17o9o9M7K2L8om4r7P6O7q7J8OM4m2
$$ 255 151 225 248 132 193 36 31 75 98 99 208 126 145 123 35 176 191 103 220 151 82 129 151 189 183 139 42 118 185 98 116 122 166 124
2180A24L1j04k5K31K9r7j15P7M0P3j79J13o4r9J03n2m4Q2j9J01o4M1q7k4Jm4O9O7P5p2m0L60
$$ 124 155 51 26 257 286 189 74 151 191 264 85 198 134 35 138 86 42 124 105 206 142 183 96 72 73 29 98 165 240 168 128 488
1880D88j69q1j06J0n3J04r8P4p8j3m1MNN4M5k0n7J8j1O6k2n2j0O2k6M6J5k3j0Mj00J12%o1
$$ 488 319 238 132 142 89 193 95 169 91 78 37 41 46 100 145 125 68 86 75 141 119 67 57 119 93 139 154 131 121 125 25 137 137 76
1561G6lP3J01Q3j02r8M5n4P9o3Lj1l7k3l5J56j14R3j2l8r0Q3O2j25K4L8n1J7lR2j8kP3q8K5
$$ 76 73 146 247 330 228 130 175 121 200 137 140 129 92 69 34 190 76 169 157 119 29 112 174 49 73 111 60 77 74 166 148 146 219 131 156
1232A56p7nL2K0o0M1K4K4l5L1K1K1P8j83J11j5j01K1J2n1NJ18j62P4K83j28k22Q0J3LN3j40
$$ 156 79 74 106 126 66 107 131 155 120 151 172 193 271 88 199 184 83 104 116 65 70 188 26 100 383 255 33 113 126 129 182 42
932D2J39j39K1J39n7j18L8Q9O0n4q7J14o1J5R9j86J39j2k6M1M6j99J92L4j03On5q0N5QJ01
$$ 42 181 42 63 202 145 27 65 154 214 160 73 187 126 141 240 54 193 181 155 196 242 43 235 269 166 172 117 37 92 100 201
640B01j9p3M0j27J47J03o2j70K66mm5j31O1L67OL42M93J01m59l77J05j28k42j32k46J93l6
$$ 201 182 109 149 22 169 272 210 40 306 302 257 126 187 554 560 902 1395 1496 1037 660 765 637 395 263 17 210 174
387A74K37j14j99J29r0P4Pj28p1J85l6m4M3Qm0M4j02N8q2J53j7j58P3m0M9n3O5P4j43j0K1
$$ 174 411 297 98 227 137 211 218 90 19 204 168 124 167 175 135 179 77 135 53 206 189 31 104 64 113 60 125 199 56 46 67
96F7J21m4j9n1J26j14O2L1j9r9K7Q4j47J11m3o3J3RR2o6L0P4K9n8Nl1Rq3Q0LJ2m6J56K0J0
$$ 67 188 144 125 74 200 86 148 179 160 61 88 172 25 136 93 30 43 52 144 78 108 182 211 153 158 127 136 53 133 136 148 102 258 278 288
-233B88j68Q4o0k3J9R8K4k56N0O2Kp4M5on8NK8
$$ 288 120 204 144 121 140 238 262 6 56 118 120 46 91 85 27 32 60
-392F0
##PAGE=	F1=1026.8
##FIRST=	19140.455529915001534,	4405.895418600002813,	0.31257653236389160156
##DATA TABLE=	(F2++(Y..Y)), PROFILE
4406A14Lo7mmML5k8J7L6L6j23J61o0M7j2Q3j29n9Q5M1k4PK1m9r5J17P2J06q9m4K7q1M7K8j06
$$ 114 117 50 46 42 46 81 53 70 106 142 19 180 120 167 155 238 109 50 135 176 152 159 180 131 36 153 225 331 242 198 225 144 191 219 113
4077A13Jk4n4R5k9p4KJ99K5k13J49l2N2nmp0K4n5L5q0O2m4kJ5O0r5P5m7K3L0o5l8J07l7k1
$$ 113 114 90 36 131 102 28 30 229 254 41 190 158 210 205 201 131 155 100 135 55 117 73 71 86 146 51 126 79 102 132 67 29 136 99 78
3749G8J31P2j19l6%m5O7l1KL3J12j21n3J20K2l4N9k4rj07O3j8m4P3n7q9K5PK89Q0j95j01L6
$$ 78 209 281 162 126 126 81 148 117 119 152 264 143 90 210 232 198 257 233 224 117 180 162 118 191 134 45 70 77 366 446 251 150 186
3439A86j85J88J7mm9k1o9j3J8M7k2K7m2l3Q7p0jQ4j0rK3m8P2m1j19J3N2o1P8J6J05Pn6m4m3
$$ 186 1 189 206 202 153 132 63 50 68 115 93 120 78 45 132 62 61 145 135 126 149 101 173 132 13 26 78 17 95 111 216 223 167 123 80
3110H0J2J01N1j37m9M9l8N0N5j10l5J04r1j2J65p4j0m9L5L5K0N7n7l8n2O2J01j13m3L7L2n
$$ 80 92 193 244 107 58 107 69 119 174 64 29 133 42 30 195 121 111 62 97 132 152 209 152 114 62 124 225 112 69 106 138 133
2810A33Q3j31K8R0l9jl8%l5J04j05N9p4J5Q3j33R7m2rp2O3j0pK1j5M8l0l1P7k7K1P4N3j12
$$ 133 216 85 113 203 164 163 125 125 90 194 89 148 74 89 172 39 136 94 85 13 76 66 59 80 65 113 83 52 129 102 123 197 250 138
2490A38R5L3j46O8j61K8L1N0l8R2o5K3qj22J27M0p4J32q4m6J03j0qpm1j29Q3M6l8J5nL2J3
$$ 138 233 266 120 188 27 55 86 136 98 190 125 148 140 18 145 185 111 243 159 113 216 206 198 191 150 21 104 150 112 127 122 154 167
2180A67m1n1k2K04M0j17j55J08P1L8j52R0p5n7J33o1r8Q8K4J05j10L4n5n7L2o8P0P9P8k8j16
$$ 167 126 75 53 257 297 180 25 133 204 242 90 180 105 48 181 120 22 110 134 239 129 163 108 51 83 15 85 164 242 214 98
1889I8L50j42m8j36L3m5R9r1M7r3pm4N2j0J6O2m1lj6k5R7Rk5q8O2k7RL8LpNn0Q6kl7l6Q2P3
$$ 98 448 306 258 122 155 110 209 118 165 72 65 21 73 63 79 141 100 97 81 56 153 162 137 49 111 84 93 131 134 127 132 82 168 166 129 93 175 248
1533B48J39j43p4n4OJ5rn7L8l5L2n6P2r3J38j5k5j13R2j2m9P4lm1J7k0Q7jMR2j18M6m6o5P
$$ 248 387 244 170 116 122 137 128 71 109 74 106 50 122 29 167 152 127 14 106 94 45 119 116 75 92 72 159 158 162 254 136 182 136 71 78
1204G8M5n2L7M6j6nJ3QRJ08j97J17k2o7lJ4m8K4Q7j60R6K62j30k11P9NK3L5r5J47j95M1R4
$$ 78 123 71 108 154 138 133 146 154 163 271 74 191 169 102 99 113 65 89 176 16 112 374 244 33 112 117 140 175 80 227 32 73 167
894A67m7o6J6Q0Q7p6j13J28n1J2J01j89J63k6q1J7J54k16J66J03r3l0j15klN2K4K5j13P7p8
$$ 167 120 54 70 150 237 161 48 176 125 137 238 49 212 186 105 122 276 60 226 329 236 206 91 89 86 138 162 187 74 151 73
603G3J21J07l3k34K24M2k2j48L2L25Q4K86M50J6m10l30R5p1j60k27j13K8K8J68l1k63J97j05
$$ 73 194 301 268 34 258 300 278 130 162 487 571 857 1307 1323 913 583 678 607 447 220 107 135 163 331 300 37 234 129
340A29L3L4j22l4J20j5o9J25K6q9J01r3j3r2J90k7j56O0n5J7k1N8R5j10m6%J15j3o6RJ48j25
$$ 129 162 196 74 40 160 145 76 201 227 138 239 146 133 41 231 204 48 108 53 70 49 107 202 92 46 46 161 148 82 91 239 114
40A14L8K8j0j20pJ05p5L4k3o9K0N9Q9j17M7Q3J9q5Mj0J0r7R3k3mj2J77J0Rj92R8q3m6J20J10
$$ 114 152 180 170 50 43 148 73 107 84 15 35 94 183 66 113 196 215 130 134 124 134 37 130 107 103 91 268 278 287 95 193 110 64 184 294
-289B94Jk55KR1j6n5L9k4o3%N6
$$ 294 295 40 42 133 117 62 101 77 14 14 70
-392G0
##PAGE=	F1=987.419
##FIRST=	19140.455529915001534,	4405.895418600002813,	0.26778757572174072266
##DATA TABLE=	(F2++(Y..Y)), PROFILE
4406I7j2k7J0j9k1L5k3P2J0J1j04J75n3J1n9R7j08p3Q7Q0k2l6K0l8r4J36J11M7q1q0N2o8K5
$$ 97 85 58 68 49 28 63 40 112 122 133 29 204 151 162 103 200 92 19 106 186 164 128 148 110 16 152 263 310 229 149 201 133 158
4096A58K5p6J8l2m8P5J3j09O4J69j0j84R0p7J04l7L0oJ8k3Po3P4n3m2m5J07r4P2m5M3Kp4k5
$$ 158 183 107 125 93 45 120 133 24 88 257 247 63 153 76 180 143 173 167 185 162 169 106 180 127 85 40 147 53 125 80 123 125 51 26
3777B6Q1J4q7J51Q2j30o7j5J6O9l4J9L5J79j57m5P0J1k3M5J3j8j73J67p4j02R7n8k7pO1K61
$$ 26 107 121 34 185 267 137 70 55 71 140 106 125 160 339 182 137 207 218 195 240 253 235 62 229 155 53 150 92 65 58 119 380
3476C80L4j66q5M7k06J97k5pk0K6m4l7k1L5k8L0k6l5Q6p9lN5l3J5N3j9Q1mj11l2J9l3Q2jJ00
$$ 380 414 248 163 210 4 201 176 169 149 175 131 94 73 108 80 110 84 49 135 56 53 108 75 90 143 124 205 201 90 58 77 44 126 125 225
3148B25j1m3j9n0m3R6J37j04j06K4m8N3K1n2j6Q5j31O2J29p4k2j4j8K7L2P0q1kl6O5J07j33
$$ 225 214 171 152 102 59 155 292 188 82 106 58 111 132 80 64 149 18 80 209 135 113 99 81 108 140 210 129 127 91 156 263 130
2847A30q0O3j1K6R1j74M9J00k0J7m2k4l7J02j27K5rk1P2q0Q1n8K5l9KJ7j1M8l0Kj7J4J3J8
$$ 130 50 113 102 128 219 45 94 194 174 191 149 125 88 190 63 88 79 58 130 50 131 73 98 59 61 78 67 115 85 87 70 84 97 115
2528A15O5M7j1r3J27K7j89R0j47L0M1O0j4J9m5RQq1L6O5m2J55j14k6J42j0p1j4k5j38P0L3
$$ 115 180 227 216 123 250 277 88 178 31 61 102 162 148 167 122 131 139 58 94 159 117 272 158 132 274 264 193 179 154 16 86 119
2227A19j6K9l0N7L3p1lm6J54M0p6j34L6Q7K9j11M1o4j4J51p6j14O7N4J22j30ppm7Pn4N9P2
$$ 119 103 132 102 159 192 121 118 72 226 266 190 56 92 179 208 97 138 74 60 211 135 21 88 142 264 134 127 120 73 80 26 85 157
1918A57J03j5j27K71r4m1j54L3K0O8p1J1q9Nj3K2j9j9J25m2no2l6J04N9jj27J3J%M6K7m7J7
$$ 157 260 245 118 389 295 254 100 133 153 221 150 161 72 77 64 86 67 48 173 131 126 64 28 132 191 190 63 76 77 77 123 150 103 120
1598A20J0O5k4J1r3J22M0J64j80m1j14M2n5L6r2O3j4P2m1Jj6P7%rq4L0n9P9N9m8l5j7MR7m
$$ 120 130 195 171 182 89 211 251 415 235 194 80 122 67 103 11 74 60 132 91 92 76 153 153 144 60 90 31 110 169 121 86 69 73 170 166
1270A66J5J16j11J5k2j02k5M9oj4R6m3j0M3j9l3J05j71J27l8m8K8J8o9M6L4j30J25J99j28
$$ 166 181 297 186 201 179 77 52 101 95 81 177 134 124 167 148 115 220 49 176 138 90 118 136 67 113 147 17 142 341 213
988B13j59N5K1J2J1l6J49k05K8N5n3l0M8L5P4p7r7J05j4j4Q3j56J60k9j10l7K31k02J58J17
$$ 213 54 109 130 142 153 117 266 61 89 144 91 61 109 144 218 141 44 149 135 121 204 48 208 179 69 32 263 61 219 336
706C36p1m0j51M6k1Q9J0J1j32J08n0R3Q0J1k48J38P1oj16qK82J17L04M34m8m48k42K4On7l70
$$ 336 265 225 74 120 99 188 198 209 77 185 135 228 308 319 71 209 280 274 158 150 432 549 853 1287 1239 791 549 573 579 522 152
415A52L6j47J07J04K0k21J54r7K1K9j05NO4Nn4J59M1j16J24o4r4r0K04k9r3M6j18OPL3R7o1
$$ 152 188 41 148 252 272 51 205 108 129 158 53 58 122 127 73 232 273 157 281 217 123 33 237 208 115 161 43 49 56 89 186 125
115A25m8k5O3J8q5M2J56j35L4L2j9j22k2R8Kn8O7n3k7J09N3j15K5O6L5j03K3k8O3j41R9p3
$$ 125 77 52 115 133 48 90 246 111 145 177 158 36 14 112 114 56 123 70 43 152 205 90 115 181 216 113 136 108 171 30 129 56
-186E6J4J0J73j6J5j60O6q3o5J96J15k1k30k0J15n0l6L1j9o3JN0
$$ 56 70 80 253 237 252 92 158 75 10 206 321 300 70 50 165 115 79 110 91 28 29 79
-392G9
##PAGE=	F1=948.041
##FIRST=	19140.455529915001534,	4405.895418600002813,	0.22299861907958984375
##DATA TABLE=	(F2++(Y..Y)), PROFILE
4406H1k8J4L3k4m0M2k6J20k4k5q4J88m5k6j15J01o1o2O3R5j9p9K2k1n6J17J55op4j17P7n5
$$ 81 53 67 100 76 36 78 52 172 148 123 39 227 182 156 41 142 81 19 82 177 158 79 101 80 24 141 296 290 216 99 176 121
4105A21LK2n5K7l1l2M6M6p9O2J32n1j11lp9J23o6P0M2lJ6j6l6R6o7q7o9J18q8P3m3O4l5r3
$$ 121 124 146 91 118 87 55 101 147 68 130 262 211 100 97 18 141 75 145 187 184 200 184 148 244 177 90 21 139 51 124 81 145 110 17
3786A7J4Q2K6o7Q6Q6j21p7k6Q2J8j6K2K2K46j93l6K0RjJ9L8k2j58J98j26p9P5p4K1l9J15K34
$$ 17 31 113 139 72 158 244 123 46 20 102 120 104 126 148 394 201 165 185 194 193 212 250 228 70 268 142 63 138 64 85 46 161 395
3476C95j2j47p8O7k18K06o7k0jP5k0n1n1K3l3L3j1l7Q4q7nM2l9K2O7%Q2M0r2p7j5lQ5k8Q7
$$ 395 383 236 158 225 7 213 146 126 125 200 180 129 78 101 68 101 90 53 137 50 45 87 48 70 137 137 219 259 167 90 75 72 157 129 216
3148B16l0l0J5m8r7R2K21o9j64%n9N6lJ6j2N1j32R8Q7p8k5L0p0J8M6Q3j06L4k0O8J07j57o3
$$ 216 186 156 171 123 26 118 339 270 106 106 47 103 100 116 104 155 23 121 208 130 105 135 65 83 129 212 106 140 120 188 295 138 75
2838G5O8o7M8J08k08N2R0jL6l8l8m9R1j39jP3m1M5m4O6p3N3j0k2Oj0P9l4l5j4N0n1O3R9J1
$$ 75 143 76 124 232 24 76 166 165 201 163 125 76 167 28 27 100 59 104 60 126 53 106 96 74 80 70 149 115 80 66 116 65 128 227 238
2509B38o5o6J60K1k32J12j33L2M1O1J9m4k4oK4m0n6R2j2J78j44nJ71j9j25j0Jj38M7J0OM4
$$ 238 173 107 267 288 56 168 35 67 108 169 188 144 120 114 138 98 42 134 122 300 156 151 322 303 178 168 169 31 78 88 94 138
2209A38n2Q7K5n4K1r3R8L4Lp6n8Q1J9o9pn5K1J60p3j11K0N9J55j35m7M1l7j8l1N8N5J18%j40
$$ 138 86 173 198 144 165 72 170 204 207 131 73 154 173 104 97 42 63 223 150 39 59 118 273 138 91 132 95 77 46 104 159 277 277 137
1889A37J93m6k9j67nJ21K4o5j5p7J8J9rk7m5J96o2k4r0k7R1R0L3j56m0K2L3K3Q3j30L6P3M4
$$ 137 330 284 255 88 83 204 228 163 148 71 89 108 99 72 27 223 161 137 47 20 111 201 234 78 38 60 93 116 199 69 105 178 222
1579B22m5N7j48J56KJ45j85Pj58N0q0O2k0k4K0R7m3nlK4K3J2n1n3n3J78J2q2k0n1K7J07pK6
$$ 222 177 234 86 242 244 389 204 211 53 103 23 85 65 41 61 158 115 110 107 131 154 166 115 62 9 187 199 117 97 46 73 180 173 199
1260A99J40j04j5Jj37n9N5L9o5J55o0k5O4n1q0Q3q6J11p7k0O9K2r0O4k5o3J18J42j24j07L2
$$ 199 339 235 220 221 84 25 80 119 54 209 149 124 188 137 57 140 54 165 88 68 137 159 69 133 108 45 163 305 181 74 106
969A06L8%k3J4J60k06J1J1k1l1Q3nO2p7q2Q3K3m1O6j24J61k8j24jJ59j60J32J13l7l6j78J03
$$ 106 144 144 121 135 295 89 100 111 90 59 142 137 199 122 40 123 146 105 171 47 208 180 56 55 214 54 186 299 262 226 48 151
669A51l9J26OOj61J29l1N6N0M9k15K4J04J5r0n1K61R6L59M57p4n25j69o5Q1M3m41Q0j71N9
$$ 151 112 238 244 250 89 218 187 243 293 342 127 151 255 270 180 129 390 486 845 1302 1228 703 534 469 550 593 152 232 61 120
387A20R2M4j17mo3L4j3n1M4PMJ4J73L4j42J47m0j79n0J80k6k7M3j72j4K5RR9j2n0m7J6K8n1
$$ 120 212 256 139 135 72 106 93 42 86 93 97 111 284 318 176 323 283 104 54 234 208 181 224 52 38 63 72 171 159 109 62 78 106 55
68E5L9J27j29M5L6k7r6qN7M7r6J34m8q5J48J0j03J0N1N1j22M2m7J18j86J05j06M8NJ44m2K2
$$ 55 94 221 92 137 173 146 50 42 99 146 50 184 136 51 199 209 106 116 167 218 96 138 91 209 23 128 22 70 75 219 177 199
-233A99j20M5l8l8J72R3k9j94mJ00p6j4K3j4o2JM4
$$ 199 79 124 86 48 220 313 284 90 86 186 110 96 119 105 43 44 88
-392H8
##PAGE=	F1=908.664
##FIRST=	19140.455529915001534,	4405.895418600002813,	0.18685019016265869141
##DATA TABLE=	(F2++(Y..Y)), PROFILE
4406F8n3Q2J8k1m9O4k0J37o2o3n4J86k2m1j52P0k0l7L3R2k7r7K4L1l9P5J82m9o2j08O8l9O
$$ 68 15 97 115 94 45 109 89 226 164 101 47 233 211 170 18 88 68 31 64 156 129 32 56 87 48 123 305 256 194 86 154 115 121
4096A21Jn0L9kk3j0Q8l8M2N0l2m1q5M0j7n9J08N5l4L6k1RJ10r7j06l9O9q0Q1k4P2p0o9JJ21
$$ 121 122 72 111 109 86 76 164 126 168 218 186 145 60 100 83 24 132 187 153 189 168 177 287 190 84 45 114 34 115 91 163 93 24 25 146
3767A46lk8K8O1j19j0NN9n1K9L6k3K66j98k0m1L0K2j8O5lj37J79j56lL3j06O5j00J68K14n1
$$ 146 143 115 143 204 85 75 80 139 88 117 153 130 396 198 178 137 167 189 171 236 233 96 275 119 116 149 43 108 8 176 390 339
3467C39j26p6P7k07J95r7k2J1R8Lo1p9M2kmJ5k9O6o6k5M4ok8P3L3M6N8n6r2p1K0R5l5M0mn6
$$ 339 213 137 214 7 202 105 83 94 192 195 134 55 97 95 91 106 77 143 77 52 96 90 62 135 168 214 272 216 124 53 73 168 133 173 169 113
3129A13N5n5q4Q0K47m3j72m5m2M5K0J1rK3j07J15J4n8j0O9j18RM2R2j13N1K2P6P9j74j8O6
$$ 113 168 113 29 109 356 313 141 96 54 99 119 130 121 144 37 152 166 108 98 167 49 58 100 192 79 130 152 228 307 133 115 181
2828A81j32P0J27j75j8Q4J2M2l0l0q7R0r5J8O4j2K1n5J9o1P9J5j9l8j5J06j6p3J0O0p3N4J11
$$ 181 49 119 246 71 53 137 149 191 161 131 44 134 39 57 121 109 130 75 94 33 112 127 108 70 55 161 145 72 82 142 69 123 234
2519B34j5q9k0J50L7k78J42j03k0N2P2M4p7j1l2N2Jj20P9J4K04j34k0J90j3j78j5K2j05Qk0
$$ 234 219 130 110 260 297 19 161 58 38 90 162 206 129 118 86 138 139 19 98 112 316 182 162 352 339 161 146 168 63 71 51
2227E1L6M6n8R4jmJ9j21M1M1J10n7j05M6M8p8m8k9L1J44n7j07J2K5J57r5r2Q5k0m3OO9k2J60
$$ 51 87 133 75 169 168 164 183 62 103 144 254 197 92 138 186 108 60 31 62 206 149 42 54 79 236 141 49 134 114 71 77 146 124 284
1908B84mj31J32om5j45l8J97k2o5k3p4L3L2j8k7lJ73q3n4l0j8K0J09N5j60p0M3O7l2J50j55
$$ 284 280 149 281 275 230 85 47 244 222 157 134 60 93 125 107 80 77 250 167 113 83 65 85 194 249 89 19 62 129 97 247 92
1608I2qJ18M2q5J08j73J36NQ5j56K9j47L6k9L6L8j07O8P4o0M5k8KL3K1l0r7j9J98j2r4j9q3
$$ 92 84 202 244 159 267 94 230 235 320 164 193 46 82 53 89 127 20 88 162 102 147 119 121 154 175 145 48 29 227 215 121 102 19
1298A9Q4P8J2L0J44q0m6k1j23k7J0O2r4J58l3o3R5n9j17J8N8L2q0j9J20J5q5O3o4k1J13Q2
$$ 19 103 181 193 223 367 287 241 220 97 70 80 142 48 206 173 110 205 146 29 47 105 137 57 38 158 173 88 151 87 66 179 261
997B61j32l0%N9k9m6N6J57j70j3j3Qm1R2k3K6p5m8M3O5o0K9o9J64l7j11N8L0q7P9Q8j5kj76
$$ 261 129 99 99 158 129 83 139 296 126 113 100 108 67 159 136 162 87 39 82 147 87 116 47 211 174 63 121 151 64 143 231 216 214 38
678C8J17j1J14NJ5j75J41k4K0J8P6j56o9Q4O8p7o6K67J9L93M99m8o03j08j43R8J36m01K9j39
$$ 38 155 144 258 263 278 103 244 220 240 258 334 178 109 193 261 184 118 385 404 797 1296 1248 645 537 394 492 628 227 256 117
396A17l3J39M6l3j85j9P9o3M5K0j8l2J06J43L0j41J36m0k16j4J46k2M7M3j96n6M4J4O7L5o6
$$ 117 84 223 269 236 51 32 111 48 93 113 95 63 169 312 342 201 337 297 81 67 213 191 238 281 85 29 73 87 154 189 123
105A23o6k1L1J8jQ7r8N9L6l9o8QK8N6m3J41o7r6J33l1o4qJ4N7r4M4n2J38j80Q5j31Q5k4J16
$$ 123 57 36 67 85 84 171 73 132 168 129 61 69 97 153 110 251 184 88 221 190 126 118 132 189 95 139 87 225 45 130 -1 84 60 176
-214A76l8J3o3L8k1lJ32M7m6j39L7P0j02jL6j4n5j5N7
$$ 176 138 151 88 126 105 102 234 281 235 96 133 203 101 100 136 122 67 52 109
-392A09
##PAGE=	F1=869.286
##FIRST=	19140.455529915001534,	4405.895418600002813,	0.15070176124572753906
##DATA TABLE=	(F2++(Y..Y)), PROFILE
4406E5k4Q2Rrn9Q6k4J46r1r1k5J83Ln4j25k4J8j3kQ4k8l3mN3l7K0J80m4l5p9M6l7K3qn7L8
$$ 55 31 113 122 113 54 140 116 262 171 80 55 238 241 187 62 38 56 43 41 125 97 64 60 113 76 96 276 232 197 118 164 127 150 142 85 123
4068A23J9k6o5J30oJ2j8%J7j07Q8j05K2M4N5q0N1l4N5J24j11j11j4J7l4N0JQ3r3l7k2J51l7
$$ 123 142 116 51 181 175 187 169 169 186 79 167 62 84 128 183 103 154 120 175 299 188 77 63 80 46 96 97 180 87 50 28 179 142
3758A42PQkj13O1K7K7r5J00L9q0K32j81Lr6Q9Pn0R6Pj25J70j77P3rj37J12j07J48K02q2j06
$$ 142 149 157 155 42 103 130 157 62 162 201 121 353 172 175 79 168 175 125 221 228 103 273 96 169 160 23 135 28 176 378 296 190
3458A90p4Q8j97J84j28k3K2J06J1n6r1P1L9n0L1k2M8m5m5M6K7p8P9N6JO9k6r2j11L4R7l4M
$$ 190 116 204 7 191 63 40 62 168 179 123 32 103 142 92 123 101 149 104 59 105 132 54 133 189 190 259 233 141 30 64 161 127 131
3148A31K2q2R3o2o1P7K48m2j62p5k7L6M3Noor7J17m9k7M3P2j52J2K9R3j21O8O4Q3N1j89K6
$$ 131 153 71 164 102 41 118 366 324 162 87 60 96 139 144 138 132 35 152 103 76 119 191 39 51 80 173 52 120 184 267 318 129 155
2838A55O3j97R3J47j44q7P8J7L6klj34Q0m2M6M5Pko6j3l1P8J5Ko1m0J15J1j02L3P1r5M4J14
$$ 155 218 21 114 261 117 30 108 125 161 159 156 22 102 60 106 151 158 156 90 77 46 124 139 141 80 40 155 166 64 97 168 73 117 231
2519B31n0j04L5J31M2k20R8p7p7N4P2P9j01Mn9P2L5j06J8L3K22j24l5J99j5k24rM3p2l1m9
$$ 231 181 77 112 243 285 65 163 86 9 63 135 214 113 117 58 130 165 59 77 110 332 208 173 372 357 133 124 167 95 64 15
2227A5O5M7o3J00l5L7K5j39L0R3J23n8j19M6M9j14m1l2L6J24m0j03KpJ58n6j36J29mo7M2Q1
$$ 15 80 127 64 164 129 166 191 52 82 175 298 240 121 167 216 102 61 29 65 189 149 46 48 41 199 143 7 136 132 65 107 188
1927A88j08J92Kj13P1L3n5j19JJ69o5o4k2o0L7L6j8j7K8J42r4p4K8rn0J29P6j63j01O4J07
$$ 188 80 272 274 161 232 265 210 91 92 261 196 132 110 50 87 123 105 88 116 258 164 90 118 109 59 188 264 101 0 64 171
1636A71q3K01j21q8J27N4j10J26j55O2L4K7j21N2j37J8J8M3N2j48Q3M7q2J05m4k0M4K4j4j12
$$ 171 88 289 168 80 207 261 151 277 122 184 218 245 124 176 39 57 75 118 170 22 105 152 70 175 131 111 155 179 165 53
1354E3l3K23l2r1lq7R3M5K6L4J48m7o7m4j07J8k0M6q3J45k0r7J32o6p7k6R6l2p0l4J56Qp9
$$ 53 20 243 211 120 117 30 123 168 194 228 376 329 262 218 111 129 109 155 72 217 197 100 232 166 89 63 159 127 57 23 179 187 108
1044A08P1r3JQ9L2j31M7l1P9n9p6Q7J64j26l7l7L8n0R0n0%o3j6MJ08q1oj6J78l7j17R8q0N
$$ 108 179 86 87 176 208 77 124 93 172 113 37 124 288 162 125 88 126 76 166 116 116 53 37 41 149 68 62 46 224 187 70 168 88 93
725I3PM5%K9j27J03K0J08nJ4j88J52j7j7j3J00j03r3L5Q9l9n8K30k4L49N39K7o33j20j68Q6
$$ 93 100 145 145 174 47 150 170 278 273 287 99 251 234 217 204 304 201 108 143 232 193 135 365 341 690 1229 1256 623 503 335 421
434D21J98l39Jj07j26J97N9J0k34o9J05p1J09%l7p8J88J04J6j47J19k3k38K3J11k8J11N4k11
$$ 421 619 280 281 174 48 245 304 314 80 11 116 45 154 154 117 39 227 331 347 200 319 296 58 81 192 164 275 329 118
162A18r0P5PK7P3r1o7l9K4P8n0L9PK0L4n4m4K0L6K7J5J54q7j06J17p2k5k6k3O4o7M6n7J58
$$ 118 28 103 110 137 210 119 52 13 37 115 65 104 111 131 165 111 67 87 123 150 165 319 232 126 243 171 146 120 97 161 94 140 83 241
-158B41j79O1j20Q6m8R1k3J4oL1k4J3R1Ln5p3O8L1j19K1M9j3n0l0O9
$$ 241 62 123 3 89 41 132 109 123 117 148 124 137 228 231 176 103 171 202 83 104 153 140 90 60 129
-392A29
##PAGE=	F1=829.909
##FIRST=	19140.455529915001534,	4405.895418600002813,	0.13310007750988006592
##DATA TABLE=	(F2++(Y..Y)), PROFILE
4406D8MO5Nk1l3Q0k1J56j05j15LJ62K8n4j09p6K1K0k5N6k2O3k2K8n2jJ27j3J3n8L0m6L2J6
$$ 48 52 117 122 101 68 148 127 283 178 63 66 228 256 202 93 17 38 58 33 89 67 130 108 136 84 83 210 197 210 152 182 136 168 184
4087A84q8M4N1n0r0J58Mk2o9N0L1r0Q9j12M2qM6r6L1k5P5J25j06r1j3j4J4J0J5P1p3l5l1J81
$$ 184 96 140 191 141 51 209 213 191 122 172 203 113 202 90 132 124 170 74 105 80 155 280 174 83 70 56 70 80 95 166 93 58 27 208
3767B08p6L2Mo2r2J00L4%m7R8K8j04J53j39J0j01J39k7p3J18L1j52J34j25R8m1j42J45r2Q9
$$ 208 132 164 168 106 14 114 148 148 101 199 227 123 276 137 147 46 185 158 85 203 234 82 216 91 189 148 6 151 59 148
3486A48J87r0o7j00P6j37J57j29j6M2N8J1o6o1J15O5r6M8j3L8l5n0J3N7o8L9P9k7N8j2p1j13
$$ 148 335 245 178 78 154 17 174 45 29 71 129 140 74 13 128 193 97 145 132 170 135 85 98 155 87 126 205 178 236 224 153 40
3185D0M7M6k0kN7j35J25p6m3J08K01l8j35r0jJ2M3Nj6j7q7R5p4J0J00M4j55RJ6O6q0M6J17
$$ 40 87 133 113 111 168 33 158 82 39 147 348 310 175 85 84 96 139 144 128 111 24 119 45 55 155 199 44 53 69 135 55 101 218
2875B18Q2J2j90M8M9j77P7J45j08j34N6K6L6J5K4j23K0j5Q5K9K9qj08l8L6M3J2K2n4q0J13
$$ 218 300 312 122 170 219 42 119 264 156 22 78 104 140 155 179 56 76 61 146 175 204 196 88 50 86 129 141 163 109 29 142
2584A42L8j38P0N8r4M5P1o7o9M0J14P0j77P7m4p6K3L3P0p3Rq0O8O8q6k5M6K10j10l3J98k9
$$ 142 180 42 112 170 76 121 192 125 56 96 210 280 103 180 136 60 83 116 186 113 122 42 110 178 92 67 113 323 213 180 378 349
2284C49k27j2O7n9m9n9R9K0m9O3o6O2M4j45J24J03O8p9j04P3J3j40k8l2N1O4pq4Jn6J50kj15
$$ 349 122 110 177 118 69 10 109 129 80 143 77 139 183 38 162 265 333 254 150 223 236 96 68 36 87 151 144 60 61 5 155 153 38
1974C8R9Mq5O5J02j67J84J4j00K0O2m7r7N3R3n4q6J4p0J6M0L1k7O0Q5r8q0Q6lr9J19R3j48
$$ 38 137 141 56 121 223 56 240 254 154 174 236 189 92 145 238 184 98 112 42 58 98 129 102 162 247 149 69 155 152 53 172 265 117
1664A17r3L3J51r6J94p5j16Q6N5r6R8q5n9Q4l8o1M0p8QRN7O1j48P4J9j23J64n9k5K6K4J0q1
$$ 117 24 57 208 112 306 231 115 201 256 160 258 173 114 198 160 99 139 61 69 78 135 196 48 122 141 18 182 123 98 124 148 158 77
1354G7m1J99m3o6j2o5Q2kN1M5J46m0m8q2r5Q1m6J8o5J13jj16J52o5l8J0N2q4l4k0J18%o3P6
$$ 77 36 235 192 126 114 49 131 129 180 225 371 331 283 201 106 187 141 159 94 207 206 90 242 177 139 149 201 117 83 63 181 181 118 194
1035A94q8k2O7j1p3P0o0Q8o4n9O7J42p2l1n0M3n7O7n9j3m5J5l2J15q6jRJ82l3j00P8j68J20
$$ 194 106 84 151 140 67 137 77 165 101 42 109 251 179 148 98 141 84 151 92 79 34 49 17 132 46 45 54 236 203 103 181 13 133
725A33n4K2m0O8o7P3O9O9l2K2j56J23om4l1J09o0n5k4Q0k8PJ46J0K43N40J10n88j90j36%K45
$$ 133 79 101 61 129 62 135 204 273 241 263 107 230 224 180 149 258 198 143 119 199 171 178 324 334 577 1117 1227 639 449 313 313 558
425E58k68Rj20j61K22P0M2k00j01Q0n7J27oo8p7K13O3jj33Q1j3k27L9R2k4J41O7j85j00O4
$$ 558 290 299 179 18 240 310 352 152 51 131 74 201 195 127 50 263 326 325 192 273 260 33 72 164 140 281 348 163 63 127
143A27L1m1J03j10q6L1m1J26j04J1J28l2Qn5l7L4N3k1P3J65j19q4R2j10Nm0l3N5o3N5l0J33
$$ 127 158 117 220 110 24 55 14 140 36 47 175 143 151 96 59 93 146 125 198 363 244 160 252 142 147 107 74 129 66 121 91 224
-158B24j69P0q9M5n5P2J4J5KN3n6K1N2l5m5j0Q0pj08NP7j1m8m0O3
$$ 224 55 125 36 81 26 98 112 127 129 182 126 147 199 164 119 109 189 182 74 79 156 145 97 57 120
-392A20
##PAGE=	F1=790.531
##FIRST=	19140.455529915001534,	4405.895418600002813,	0.1154984012246131897
##DATA TABLE=	(F2++(Y..Y)), PROFILE
4406D2K1L9J0k2j8O5j8J66j10j29L2J39M2o5r2n1j0K2pqM0R4l4J1o7k2P4J8N0m5J4n5M1M1
$$ 42 63 102 112 90 72 137 119 285 175 46 78 217 259 194 102 51 41 63 56 48 88 182 148 159 92 70 144 162 212 167 181 126 167 208
4087B08j11N9Q4p3j15J84J5n5j22J00L1q9R6j12P5m5J3o0l3J8P2J03r3o1Lk9M8m8K9O0n7l8
$$ 208 97 156 240 167 52 236 251 196 74 174 205 116 212 100 175 130 143 83 50 68 140 243 150 89 92 63 111 63 92 152 95 57
3786E7kJ71j18N2K6r4n6P9M7k3JR6J7j27O8j02J5l2J25m9j01J35N5j79R8p2J17p9j08J40p0
$$ 57 55 226 108 160 186 92 36 115 162 139 140 236 253 126 194 92 107 75 200 151 50 185 240 61 159 87 204 125 17 157 87
3495H7L3J73r9k8j27P1p4J09p7k9M1jjp5M4J24N5j34P6nK7k3n5k1Q7n8jJ02n5M7Kl5r9M4k0
$$ 87 120 293 194 166 39 110 36 145 68 39 80 79 78 3 47 171 226 92 168 163 190 167 112 91 178 120 119 221 166 213 215 180 81 125 105
3166A05J4J3O0j46R7p2l0J35J45m4r7r7K5j2L3mj7j8q4O4j3OJ32pj48J5KM0l9K5J59P1j7j81
$$ 105 119 132 192 46 143 71 41 176 321 277 180 83 108 96 129 125 108 90 6 70 57 63 195 188 40 55 57 97 58 83 242 313 296 115
2847A15N5J7j39P5J34q0j56N8L0K9K2M2j12l9JJ15J3N0lj42o1J02jjM6m2q2P3P0j69R7L5q3
$$ 115 170 187 48 123 257 177 21 79 109 138 160 202 90 51 52 167 180 230 227 85 24 126 125 124 170 128 46 119 189 20 117 152 69
2537F9N5L9p6n2K6J08J07j34N5j2p5J4J4kl1K6q6M4Q3n7n8M9J88q5k2J87n2k21oR2m6n8n8
$$ 69 124 163 87 35 61 169 276 142 197 185 110 124 138 136 105 131 45 89 172 115 57 106 294 209 187 374 322 101 95 187 141 83 25
2227B5J23j6m5J9l3K4P1j44K17J13kj16q2J07j5j55nk5N8oL0n9j6m5J14K6r4O9J2j02P9J16
$$ 25 148 132 87 106 73 97 168 24 241 354 352 236 154 261 246 91 86 61 119 113 143 84 68 23 137 163 69 138 150 48 127 243
1927B43j63J12L4p9l2R1l8p5Q9Jk8r0M9q0mM4P8l6Q3J9q5o5J28j1j09P1J14j27q6KK10r7J24
$$ 243 80 192 226 147 115 206 168 93 182 183 155 65 114 34 30 74 152 116 199 218 133 68 196 185 76 147 261 134 48 50 260 163 287
1617B87j4j34N5N7q2P1j7j84J31o7l8L3j5jjO2O1j45P0qq6J19n5l1OK4L4k6k5J18l6l5j7m3
$$ 287 273 139 194 251 169 240 223 39 170 103 65 98 83 82 81 143 204 59 129 121 35 154 99 68 74 98 132 106 81 199 163 128 111 68
1298F8P0n7O5N6J44l1l1j10p3J34q1%l7O6Mq7J43o8nM6Qj27J2pQ2rm7Q1q2n4L4k5J7K8p5J00
$$ 68 138 81 146 202 346 315 284 174 101 235 154 154 117 183 187 100 243 175 170 216 224 97 109 102 184 175 128 209 127 73 107 82 99 127 52 152
960A52o3m2M6J12k7j6n3M8o6M5o9k6k6N6n8J23r1L7j1J81l3r7M2j25J37r2K2o4N0rL7J18L0
$$ 152 89 47 93 205 178 162 109 157 91 136 67 41 15 71 13 136 45 82 71 252 219 122 164 39 176 84 106 42 92 83 120 238 268
650B68o8K0j23R2Pp3l7J26k1k2l7M3k1O8P2N6J62M92J60m99k49r4j16K59j90K4j14j77K08
$$ 268 200 220 97 189 196 123 86 212 191 169 132 175 154 222 294 350 512 1004 1164 665 416 322 206 465 275 299 185 8 216
378B16M4P9j60j11P8m4J46j2r9p7K39J2k6j21M3J7j97N5P4l9J50Q1j59j01O3N5j09J29j35
$$ 216 260 339 179 68 146 102 248 236 137 60 299 311 285 164 207 224 27 82 156 117 267 348 189 88 151 206 97 226 91
105I1n5P4q0J25j19J9J74q3j3n1m1L8Q0n8J14J61j45n6P6j38L5n4m3M6n9O4mJ10j60Q0n0J4
$$ 91 36 110 30 155 36 55 229 146 133 82 41 79 159 101 215 376 231 175 251 113 148 94 51 97 38 102 98 208 48 128 78 92
-195I2o2N2M3NKO5q7K7K4o5l5N4Q3n5q8jR6j8l8l9N7
$$ 92 30 82 125 130 132 197 110 137 161 96 61 115 198 143 55 54 150 132 94 55 112
-392A12
##PAGE=	F1=751.154
##FIRST=	19140.455529915001534,	4405.895418600002813,	0.12381827831268310547
##DATA TABLE=	(F2++(Y..Y)), PROFILE
4406D5J3L8J0m0OM6k4J78q6j61O0J13M7p2n4k3m1K2J4p3J04J03n4ro8l6K9N4O2m6jn1J3R0
$$ 45 58 96 106 66 72 118 94 272 186 25 85 198 245 173 119 96 55 77 91 18 122 225 171 162 94 58 87 141 203 157 156 105 118 208
4087B08r6M3J05q5j00J62Ro1j18Q4L9j01Q8p7R1n4k9j3n7M3O6M4p5oJ3k5K9o5J3N2k6n2L6
$$ 208 112 155 260 175 75 237 246 185 67 151 190 89 177 100 191 137 108 95 38 81 147 191 116 110 123 98 127 62 75 127 101 49 85
3777H5J45j41M9N4p2n6L3O3m5N2Q4j6j11%o9RL9R0p2q7J37N6j66P4l4J05j16m2J06m8j8J54
$$ 85 230 89 138 192 120 64 97 160 115 167 251 235 124 124 55 64 103 193 121 34 171 227 61 135 101 206 90 48 154 106 88 242
3476B42j04jj18M1RP6l9o9M9l3l4O8%J04N9j60R3nK1k8m3n0J02j6m8J20n1K3J1m4n8M9p8N
$$ 242 138 137 19 60 69 145 106 37 86 53 19 87 87 191 250 90 183 178 199 171 128 78 180 164 116 236 185 208 219 175 117 166 88 93
3157I3O7M5j40N5o0mJ35J07n8n5j12M2k0j0J9qm0j6k0R0k6J31m5j13Jj0J0J1j0J73Q5l0j70
$$ 93 160 205 65 120 60 56 191 298 240 185 73 115 95 85 104 96 56 40 20 110 84 215 170 57 58 48 58 69 59 232 317 287 117
2847A17K4Nr0P3J10o7j49P9K0J1L6L6j07p7MJ30J8O8k7j54j8J21l2l2N7k0n2M3N2j64P7L1
$$ 117 141 146 56 129 239 172 23 102 122 133 169 205 98 21 25 155 173 241 214 60 42 163 131 99 156 136 84 127 179 15 92 123
2547A23k1J6L1m4n6k8R1J56j27Q8J5q6J6Or4PM0m9l2J07m7m6N3J41r8K9J42o1j67j5J11n3
$$ 123 102 118 149 105 49 21 112 268 141 229 244 158 174 180 86 93 133 84 52 159 112 66 119 260 162 191 333 272 105 90 201 148
2246A48o8n0J20Nn7k7M1n8J26j51K85J05o1j50o4J38l6j36j3J0M2p2N4l3j4m6J02L8p1K9J
$$ 148 80 30 150 155 98 71 112 54 180 29 314 419 358 208 144 282 246 110 97 107 149 77 131 98 84 38 140 178 107 136 137
1955A37j00O2J39j12J6P5q9m2R3j6r2J16q2M9j03P8q9k7L3J27m6R0l5o1l2J27%j09K4J04j10
$$ 137 37 99 238 126 142 217 128 86 179 163 71 187 105 154 51 129 40 13 46 173 127 217 182 121 89 216 216 107 131 235 125
1664A25k8n3K54p7K2J7j08J8M3k7K0M1j60N4l1p4M5J0NNL3O4j18L3Rm0M1o0Om4K5M0L1%N2
$$ 125 97 44 298 221 243 260 152 170 213 186 206 247 87 141 110 36 81 91 96 101 134 198 80 113 122 82 123 63 69 25 50 90 121 121 173
1335A73m5ql0j8N7p4O1N3J37m1J2j05q5J79j11j8j8K9j1j2J08p3J5O7j0j43L4K1L4rm7P8p4
$$ 173 128 120 90 72 129 55 116 169 306 265 277 172 87 266 155 137 119 148 137 125 233 160 175 242 232 89 123 144 178 169 122 200 126
1025A26q7K7m6J09qq0R4l2m6M1N8PK4o4M1q5L5m0n5J4M6n6J37p7J3%J58j8r6po6J34p9lm1
$$ 126 39 66 20 129 121 41 135 103 57 98 156 163 187 123 164 79 114 74 19 33 79 23 160 83 96 96 254 236 140 133 67 201 122 119 78
697G8pN3jJ30qr0K3j05N9Oq4N1P8Jj7j6L4o3J13L5Q2J61L76K03l97k97m1j91J89j09L4q6j50
$$ 78 71 124 123 253 245 155 178 73 132 138 54 105 183 184 167 151 185 122 235 270 352 513 889 1092 695 398 357 166 355 246 280 194 44
387D4J24L7Q1j14j08R5j4J25Jj38p2K49k0p1q3oN2j46O8P8l8J01Q2j32r0O2O5j37J11j29J0
$$ 44 168 205 286 172 64 159 145 270 271 133 61 310 290 219 136 130 182 36 104 182 144 245 327 195 105 167 232 95 206 77 87
96H7P5j06J04j06M6J61j12m5k8j7J2P2n4J04J68j54m0O5j37L3n5l6N3p0O5RQ5j42R7onq5N5
$$ 87 162 56 160 54 100 261 149 104 76 59 71 143 89 193 361 207 167 232 95 128 73 37 90 20 85 94 179 37 134 128 123 38 93
-214I3L1pkO2j06K1K2q0k2J05O8r7n3j0R5j8k9j9M4
$$ 93 124 117 115 177 71 92 114 34 12 117 185 88 35 25 120 102 73 54 98
-392I8
##PAGE=	F1=711.776
##FIRST=	19140.455529915001534,	4405.895418600002813,	0.13213814795017242432
##DATA TABLE=	(F2++(Y..Y)), PROFILE
4406D8NL7J1n9K9K9m2J83m3j76P9P9M2r0nJ4o7K7J2q5J39Q2o4j9p0n1oJ01M7p2%l2k4J30q0
$$ 48 53 90 101 42 71 100 58 241 198 22 101 180 222 132 127 141 74 101 113 28 167 249 185 166 96 45 39 140 187 115 115 83 59 189 109
4077A09K7J29r2o3Q6K4m6j14O8L8j22Q8l2J07o3p8K6k0OP7Mo7M0K2k2J2q3kM2J5n5O4J08j63
$$ 109 136 265 173 110 196 220 174 60 128 166 44 132 100 207 144 66 92 72 78 155 159 92 132 154 132 144 61 59 101 116 61 125 233 70
3758G0M5Q3n1n5j2P9o7J03P1n0r4m5j5j9Q9M9r8l6J01P0j38L9mJ02j43J1N5m2j4J27j20J1
$$ 70 115 198 147 92 80 159 92 195 266 216 122 77 62 43 132 181 83 47 148 218 80 119 115 217 74 85 140 98 84 211 91 102
3458A02n0j6O6M3kj18M9qrR8l1P5N6j76J20nJ3l2l1p8J17K5r5J46l7rJ0o3k6P9j11l4Q9M1
$$ 102 52 36 102 145 143 25 74 66 57 155 124 199 255 79 199 194 207 175 144 66 183 208 113 259 222 213 223 160 134 213 102 68 157 198
3138A98j22j8JJ7J31O8p1j4j28O1k8n5M3On7N6k3P4n0J38p6p7j3j1j2N0n3J78Q9k5j38k6k7
$$ 198 76 58 59 76 207 275 204 190 62 123 95 40 83 89 32 88 65 139 89 227 151 74 61 50 38 88 35 213 302 277 139 113 86
2828H6l2Q2Q4n4j41J00Jj7N4L5j02l9k6J13PP0l6j50K6J39o3o3O7Lk3J5L2j57N6K8M0k2M0
$$ 86 54 136 220 166 25 125 126 109 163 198 96 57 31 144 151 221 185 35 61 200 137 74 141 144 121 136 168 11 67 95 135 113 153
2519A53Lj03%K4J52j04J35L3j06K7Qj85M5N2j0j10J31l5l5M7Q5j02R0R6o9j12k5J20p0o8l1
$$ 153 156 53 53 77 229 125 260 293 187 214 222 37 82 134 124 14 145 110 75 122 207 105 195 291 222 110 85 205 135 67 36
2227C6J16K7o7o7R3q7J66j74K99J20j10j73n5J60l7j00k9L4K7j38P0j9jl9R0N2n0j1rr8L0
$$ 36 152 179 112 45 138 51 217 43 342 462 352 179 124 284 247 147 118 152 179 41 111 92 91 52 142 194 144 133 124 26 56
1936E6J46m6o5J09j06K5M8kj16J42j63J39j01O1o9Rm5J73n7R8r0l7JJ16Kj01j3Q6j03N3q5
$$ 56 202 156 91 200 94 119 167 165 49 191 28 167 66 127 58 67 22 195 138 236 146 109 110 226 228 127 114 200 97 150 65
1645F5K38m4n3Jo2KK8K8m0Q9j17mjj14Q6j2J6J5MO7r1lJ5mk7n6Q4n5m7N0P4J0nm3J9m4jL7
$$ 65 303 259 206 207 145 147 175 203 163 252 135 131 130 16 102 90 106 121 125 192 101 98 113 109 82 26 110 55 8 58 132 142 137 94 113 69 68 105
1288A05pJ5L7J15n0N4r8r9K26j41m7qKj7O3P3q7K6R6j8j59N6M9j5rm7P5o4j09L0jR1l4p2Q7
$$ 105 98 113 150 265 215 269 171 72 298 157 110 102 104 87 150 223 136 162 258 240 81 137 186 171 162 115 190 126 17 47 46 137 103 31 118
960A18%n2L8MM1O3p5L5j05M1Mj00L9L5n2J50o4rRJ36lr5n7j6J22o7l0k6LO3j5J39n1j13K6
$$ 118 118 66 104 108 149 212 137 172 67 108 112 12 51 86 34 184 120 111 120 256 253 158 101 85 207 140 110 84 87 150 135 274 223 110 136
631A36q3L1j1l5J23J1J5k2J5L3j22J42O0M5J78K76K17l25k83kj92O7m2L0n9j22M0K9O6q2q9
$$ 136 53 84 73 38 161 172 187 165 180 213 91 233 293 338 516 792 1009 684 401 399 207 274 232 262 203 81 121 150 216 134 45
340D5J27J6J05Lj86o7K59m3j06m5n5Q7r4R1R0m7M2O8j21p2O7Q5j56R3j22P5P6j32Q2j01O2
$$ 45 172 188 293 296 110 43 302 259 153 108 53 140 46 137 227 180 222 290 169 97 164 249 93 186 64 139 215 83 165 64 126
49A26J48j42p2JM5n3Q3l0L6J94j68k8O3j26L2n6k2O8k5lK1N9j26J14L9k5j07N7J9j9j4M8j14
$$ 126 274 132 60 61 106 53 136 106 142 336 168 140 203 77 109 53 31 99 74 71 92 151 25 139 178 153 46 103 122 103 89 137 23
-261B3K5N9n3m9J15N1j38klP9l5j9jL2
$$ 23 48 107 54 5 120 171 33 31 28 107 72 53 52 84
-392H4
##PAGE=	F1=672.399
##FIRST=	19140.455529915001534,	4405.895418600002813,	0.099415563046932220459
##DATA TABLE=	(F2++(Y..Y)), PROFILE
4406C6M4K6j7o1L6L6p3J76J0j74O2N7K7r9O9J8r0K4J2o5J34P1r0ko6k7l6J04L5j04JJ2n3J25
$$ 36 80 106 89 28 64 100 27 203 213 39 101 158 185 86 155 173 83 107 119 54 188 259 169 167 101 74 38 142 177 73 74 86 33 158
4087A58m2j8J55p1l4j2M8k0j15R3J3j30O7QJ27p5j27M6N9n9Q7j7o1O5K1j2Jq7k2M1M8m0O1
$$ 158 116 98 253 182 148 136 184 164 49 142 155 25 92 100 227 152 25 71 130 71 158 141 80 145 166 154 155 68 46 87 135 95 156
3777A56O8j67M1Q2j4m8m8Q1p0J22P2o7j17j8K6o4J19J0j33L4O7M4q9L8pR2j10J2J8n5L7Q0
$$ 156 224 57 98 180 166 118 70 151 81 203 275 208 91 73 99 35 154 164 31 65 132 176 87 125 118 210 100 112 130 75 112 192
3476A92j04l2L0NL6L8Oj58L4L4J9J07o2L6O1j64J25j3Pl4j7r0J32O0j16J40k3k6qq2PR3q5
$$ 192 88 56 86 91 127 165 171 13 47 81 100 207 145 181 242 78 203 190 197 163 146 56 188 248 132 272 249 223 215 133 140 233 148
3166A48j14J10K9q4p4P9NJ06M0q7J9j34P2k9n9M1J4o2R2QJ5n1J20o9n2k1rrN2o6J44J00%j02
$$ 148 34 144 173 89 15 94 99 205 245 158 177 43 115 86 27 68 82 20 112 120 135 84 204 135 83 62 53 44 96 30 174 274 274 172
2847A72p8l4j9R5O6o1r5R4m2l1O9M1q5K4l3O9m1Q0p0o5K0J47q1q0O4%K6%oj34J9N6O0n9Q2
$$ 172 94 60 41 136 202 141 46 140 98 67 136 177 92 116 83 152 111 191 121 56 76 223 142 62 126 126 152 152 146 12 31 87 147 88 170
2519A70J1j25M6k2Q1p1J80N3j25L2J4j75lO3J3r1R8n0OJ9K9j02J47L3m5o7l2J06n9r1MJ00
$$ 170 181 56 102 80 161 90 270 323 198 230 244 69 66 129 142 51 149 99 105 124 153 51 198 231 186 119 87 193 134 43 47 147
2218A47N5r5p6J13o0J62j79K72J38j41j53r2J73k0o1m0M9lj67N6k5O1o6O6Q3mq0k6n6j4J47
$$ 147 202 107 31 144 84 246 67 339 477 336 183 91 264 244 183 143 192 189 22 78 53 114 48 114 197 193 113 87 31 17 164
1927A64Kr7J18j21R0J9pj33J49j20J06q3L9m5L0r2J73n7J03j23k9L4J04Kq5m2L8q3J36r2J84
$$ 164 166 69 187 66 156 175 168 35 184 64 170 87 126 81 111 19 192 135 238 115 86 120 224 226 141 99 137 54 190 98 282
1636B82j3o5n6n3J0OQ3o3J04q0j5j3p9Q0o0K2M1j2O4n0p1N0j1m2K0P8o2p9J8Q4K1qm6mk1j
$$ 282 269 204 148 95 105 111 194 131 235 155 140 127 48 128 68 90 131 119 183 133 62 112 101 59 79 157 95 16 34 118 139 131 85 81 60 59
1298E9K7P4nqO5m9R2p2j05K33j58p0pk2l1J53L0r7K9J06k0j29L5P2k9Kp4O2n1q2J9K7N5m2
$$ 59 86 160 155 147 212 163 255 183 78 311 153 83 76 54 23 176 206 109 138 244 224 95 130 202 173 175 101 163 112 30 49 76 131 89
979H9o0R8J0p6O3n4P2P7p4Jq6L9O0j26N1J0k5J25n3k4J6J19Nj05n5l0J21k2r9j3N8N3oR2n9
$$ 89 29 127 137 61 124 70 142 219 145 146 60 99 159 33 84 94 69 194 141 117 133 252 257 152 97 67 188 166 67 54 112 165 159 251 192
650A92j17L4p0M2p8J12Q8m5N0l2lP5j57J21J11RJ97K04J85k69k55M4j78l7J8Pm1q3pM0J6m4
$$ 192 75 109 39 81 3 115 203 158 208 176 173 248 91 212 323 332 529 733 918 649 394 438 260 223 241 248 207 124 117 157 173 129
349A29j09J31N4R8Nk22o6K71m6j46j4p0J06o2J02J02l6j0M2j36m2P2R5j45N7r5J16P2j55O1
$$ 129 20 151 205 303 308 86 20 291 245 99 85 15 121 59 161 263 227 217 259 123 81 153 248 103 160 65 181 253 98 159
68A59r3P2J15j50q5M3R8r2O8J2m6J95j33o3O4q8%m4RO2Ol9J2M0q6J16N5m5r5L2K0n6%J2j5
$$ 159 66 138 253 103 18 61 159 67 135 147 101 296 163 100 164 76 76 32 41 103 109 70 82 122 36 152 207 162 67 99 119 63 63 75 60
-261F0k8Q1pq4R3K1j04j9N1K2k6k8K7K5
$$ 60 32 113 106 22 115 136 32 13 64 86 60 32 59 84
-392H4
##PAGE=	F1=633.021
##FIRST=	19140.455529915001534,	4405.895418600002813,	0.066692963242530822754
##DATA TABLE=	(F2++(Y..Y)), PROFILE
4406B4Q4J5m5o4M8M7p6J22O8j67M5L5J2j09J43K3j12K0J2m5J19N1j08K6n2Np5R8M5j13j4M4
$$ 24 108 123 78 14 62 109 33 155 223 56 101 136 148 39 182 205 93 113 125 80 199 250 142 168 116 121 46 144 189 76 62 106
4105A06k6N0j5p4K01l2k5j29Q3J4r5J39l8q6K3K2J30j03r4K4J06p9M5j5n9Q6J8jj0r1m2M0
$$ 106 80 130 115 41 242 210 185 56 139 153 58 197 159 73 96 118 248 145 51 75 181 102 147 132 73 159 177 176 166 75 33 73
3805G3Q2k6N8K7j71L8P1J4k1o6Q3p4J33O3q3j40J8P6j14J44l9j00P0%Qm9M5KQ1p6J2j9o8Q9
$$ 73 155 129 187 214 43 81 152 166 145 79 162 88 221 284 201 61 79 155 41 185 146 46 116 116 124 75 120 122 203 127 139 120 52 141
3486A41M1p9q3J00K6PK5Oj26l5O6L4J16r2lO7j44J40k0jm4j2r3J57R5j39J36j0n4l4j00L9
$$ 141 182 103 20 120 146 153 178 184 58 23 89 123 239 147 144 211 67 207 187 186 142 130 37 194 289 150 286 276 222 188 88 127
3185A27J08n6j31O8K6l7j6M3j8P0K1r2N0j39Q5k9rl4L9m8J08J9l3m3J03o2k9k8jkL0k3Q9Q9
$$ 127 235 179 48 116 142 105 89 132 114 184 205 113 163 24 109 80 71 37 76 28 136 155 122 79 182 120 91 63 62 60 90 67 156 245
2866B45K5o4j02j3l4P9M7o7m9Q9q6m5P9M2l0N0k5L8j08P2q5L7mJ36p9p9N1j2P5j4m1j04J9
$$ 245 270 206 104 91 57 136 183 116 67 156 70 25 104 146 116 166 141 179 71 143 58 95 91 227 148 69 120 108 183 169 128 24 43
2556D3M7O4j09J23K0j43R6k9k8m4K22P2j43L2J4j18p9P9M2p3O5o5M7j0l0k1J05j9j0l1n0J02
$$ 43 90 154 45 168 188 45 141 112 84 40 262 334 191 223 237 119 40 119 161 88 153 88 135 125 95 74 179 160 150 119 69 171
2256A71l8j14M0Q3Q2j13p5J13n1J67j74K29J41j56j17j30J87mk3n0O4k3j87L2m0J22r2M2J14
$$ 171 133 19 59 142 224 111 36 149 98 265 91 320 461 305 188 58 245 241 218 168 232 209 22 54 14 136 44 86 200
1983B00M1j49m4j6K3M8O2j19J29j37J54rLj37J08m7N9q0K6j1O5j25J16l8J14j52k1O7Q2oo1
$$ 200 241 92 48 32 55 103 165 46 175 38 192 183 186 49 157 110 169 89 115 104 169 44 160 122 236 84 63 130 212 206 145
1692A45o2Jn3J98j18J25J2l9p6o7lk1J34n8P2l0j0k6m4P3j06K8O7j9P0j9j48Q1k3j1O9N0q8
$$ 145 83 84 31 229 111 236 248 209 133 66 63 42 176 118 190 160 150 124 80 153 47 75 142 123 193 174 26 107 84 73 142 192 104
1382A04q7J1Q6K2kl9k7Lj2PJ60k0j9k8oR8n2j14K40j76r3onoJ69j0j11K8J15k3r9J5R5m4J3
$$ 104 17 28 114 136 134 95 68 71 59 66 226 206 187 159 153 251 199 85 325 149 56 50 45 39 208 198 87 115 230 207 108 123 218 174 187
1054A87j00N0l9n5QM6Ql9l9J08K1j01Q9j02J11P3r2j3n0J9R7j42P2j6LQ9m9l1L3R2Mr6l4o3
$$ 187 87 137 98 43 51 97 105 66 27 135 156 55 144 42 153 226 134 121 71 90 187 45 117 101 104 193 144 113 146 238 242 146 112 49
734D9J02L1j58%J13M2MM6o8j21M3m2P2l3R7M5j10J12j8m1R9j82J08J77j2J90J82J17k49k21
$$ 49 151 182 24 24 137 179 183 229 161 40 83 41 113 80 177 222 112 224 206 165 264 82 190 367 355 545 727 844 595 374
453C74R4j88q9L5J7l3n2nK4K1k7j53J12Q2Q2J8k46j3K10l5j73J9rM8l2R3R3qm6J5j50k2O6
$$ 374 468 280 191 226 243 210 158 153 177 198 171 18 130 212 294 312 66 53 263 228 55 74 65 113 81 174 267 259 213 228 78 56 122
143A22J16j25K1o8J47N9j67M7r3P1R3j46m4J2J68j13L6L6m9J50j06j07O4m9k2k2K9M7L8p6
$$ 122 238 113 134 66 213 272 105 152 59 130 223 77 33 45 213 100 136 172 123 273 167 60 124 75 53 31 60 107 145 69
-139F9KK1m6J18P2o6r1lL0q3J4k4J06n8P0Qj09Q0Pn6m9Q9k0kn1L7J9
$$ 69 71 92 46 164 236 170 79 76 106 23 37 13 119 61 131 139 30 110 117 61 12 101 81 79 28 65 84
-392H4
##PAGE=	F1=593.644
##FIRST=	19140.455529915001534,	4405.895418600002813,	0.070692583918571472168
##DATA TABLE=	(F2++(Y..Y)), PROFILE
4406B5J04mn5n6N8M9p2O2J15j56K2PMo6J58K6j02jlj6R6L2j31P0m4M4r8N0Q2r0nJ5j6MKp1
$$ 25 129 125 70 14 72 121 49 111 226 70 92 99 103 37 195 221 119 118 115 99 195 227 96 166 122 166 68 118 200 110 105 120 104 108 110 39
4068C9K02Ok7j88R9K4q9K02p5q4J8KJ18j21k1j1J23o8m5J2l7O3kM9lr8o0M2J10k3L1Oj65L7
$$ 39 241 247 220 32 131 155 66 268 193 109 127 129 247 126 105 94 217 149 104 116 79 142 140 189 186 88 28 70 180 157 188 194 29 66
3749F6O3L4Mp2P3n3J08O3r3j63Q5Q5j35J49q9j4M9n2l8j3N7jP4l4ok1r9J29J0o6m9R0M4k5
$$ 66 129 163 167 95 168 115 223 286 193 30 115 200 65 214 125 111 160 108 70 57 114 113 187 153 147 126 27 156 166 100 51 141 185 160
3429A60K1J2r5p7P0L9R5r3l7O7r7J31k6jo3Np8J78R7j30J08%m5j03r1O1J17k3j22K1K2j0K9
$$ 160 181 193 98 21 91 130 225 132 95 162 65 196 170 169 106 111 33 211 308 178 286 286 241 138 47 108 225 202 80 101 123 113 142
3119A42K7n2K4Rp9M8r2O4k4M8q0L3j3Q0L5p1k4P4l9l2j4J2K1k4J4P6O6M6m3j19Pl1L5L9p5
$$ 142 169 117 141 150 71 119 27 91 67 115 35 68 55 135 170 99 75 149 110 78 64 76 97 73 87 163 229 275 232 113 120 89 124 163 88
2791H8LP2j51M3J2N1L2L9j6M7j50M3o3Q6n2J38q0m7L4n4J08jp7n2M6rM1j25J54J1j00R0j8
$$ 88 91 163 12 55 67 118 150 189 173 220 70 113 50 136 84 222 142 95 129 75 183 182 105 53 99 90 131 6 160 171 71 161 143
2481A43q3k8J88R6j31OJ6o6j19O9O9m2M8j09J24n5q4P8K7n9L5k0m3R8lj43O2R7O4j26n1Q1
$$ 143 60 32 220 316 185 191 207 141 22 91 160 118 166 57 181 126 42 120 147 88 123 103 60 158 155 12 74 171 235 109 58 139
2180A39k0J21j35J70J59j75p3j47J80J3Lm0O2m0j66pL4R1j25QJ43O5j94m2JP3n6R3q7R1r9
$$ 139 119 240 105 275 434 259 186 39 219 232 235 195 257 217 51 44 78 169 44 52 195 260 66 24 25 98 42 135 48 139 40
1889D0J49kMj23P1j7L5r0O2J1P2j31M4k0J27j64k2R1N6po7l9l9M6J48j38P6RJ9k7r5o4J1J07
$$ 40 189 187 191 68 139 122 157 67 129 140 212 81 125 105 232 68 46 137 193 186 119 80 41 87 235 97 173 182 201 174 79 15 26 133
1570A33k8L7j7K3k7j7P1j59O3N0nP1J8j87P6n3M4J02Nj09p7K7O4N2pk6l7J0m3J0K13l1qj29
$$ 133 105 142 125 148 121 104 175 16 79 129 124 195 213 26 102 49 93 195 200 91 14 41 105 157 150 124 87 97 54 64 277 246 238 109
1251A09O0Q5n7r9K23j80j06QN6j2J41m3r6M3J09m3p5k7R2k1K1j17M5l9m8KN6j4Kl7J23lj07
$$ 109 169 254 197 98 321 141 35 43 99 87 228 185 89 132 241 198 123 96 188 167 188 71 116 77 29 31 87 73 75 38 161 158 51
941E1J15j11J04M8r1j7Qm4J24j10O7j4OK2l7lK9N9Oq1j7p8P2Q5j31L6O1J1K3Lo4j13N1j0P8
$$ 51 166 55 159 207 116 99 107 63 187 77 144 130 136 158 121 118 147 206 212 131 114 36 108 193 62 98 159 170 193 196 132 19 70 60 138
612A38J0O6oj65J86pp3J17j77P6K10RJ79J94K0k24k39J60j66j49K1P1p2mL2m4O7k1j72O8R4
$$ 138 148 214 208 43 229 222 149 266 89 165 375 384 563 757 777 553 314 474 308 159 180 251 179 175 207 163 230 209 37 105 199
321A99O4M0k63N4J35pj97L7K2N0k1N4Q6Rm2Rj42j9K5J08r4K3o4J44N5j61K8p4N1O1j03Pn5
$$ 199 263 303 40 94 229 222 25 62 84 134 113 167 253 262 220 229 87 68 93 201 107 130 66 210 265 104 132 58 109 170 67 74 19
11A9K15j04kO2qP2p9j48N8mk2mL2RO3p6k4oL1R4P5p8r4m1M3m6jM9Q7r0L9L9r6K9kpn5R7l4
$$ 19 234 130 128 190 182 254 175 27 85 81 59 55 87 96 159 83 59 53 84 178 253 175 81 40 83 37 36 85 172 82 121 160 64 93 91 84 29 126 92
-355I2Qn9K9j0
$$ 92 100 41 70 60
-392F0
##PAGE=	F1=554.266
##FIRST=	19140.455529915001534,	4405.895418600002813,	0.12653531134128570557
##DATA TABLE=	(F2++(Y..Y)), PROFILE
4406D6J04m1n7l8O9M9n7J1J48j60L7n8J0rJ55J0p3mk7MP1J4j54J15m2P7q1l7J15p2Rrl0J1
$$ 46 150 109 52 14 83 132 75 86 234 74 111 53 63 54 209 219 146 142 115 119 190 204 50 165 123 200 119 82 197 125 134 125 95 106
4087A06LoJ61Mm2j33P3rr2K55j03p2J4j9R6j48O1l6J40n6j35L8j6M1k3J01Lj05p7M3J29l0
$$ 106 109 103 264 268 226 93 166 157 65 320 217 145 159 140 236 88 149 113 253 197 62 100 84 125 102 203 206 101 24 67 196 166
3786A66J4nj60L6N4N5K0q7P2k3P3N5p9j61J35P9j55J55j40P3K8j05p5L3N8j1N6jj4j5j28J68
$$ 166 180 175 15 51 105 160 180 93 165 142 215 270 191 30 165 244 89 244 104 177 205 100 25 58 116 105 161 160 146 131 3 171
3486A71l1o3j4Q0O2n7K7K8n4j11N5K4Q5q5p1O6m9J22l3jq7J8k5J61R5j25Q9K0k9j61r1P3J16
$$ 171 140 77 63 143 205 148 175 203 149 38 93 117 202 117 46 112 63 185 152 151 64 82 57 218 313 188 277 297 268 107 16 89 205
3176B05Kq9%JJN8mp0pko5N4l5L9k4Q3p2MMM7M6o2l4M2k1l7JL4N3q7M3O2M4O6k3j45J9j9%L1
$$ 205 207 118 118 119 120 178 174 104 97 95 30 84 49 88 64 147 75 79 83 130 176 114 80 122 101 64 65 99 152 65 108 170 214 280 257 112 131 112 112 143
2800A43q3N3N3j20M8m9O4O8NKO6j32ljM6j01J39p1pJ8r5J41J1j13%P2o6Kk9R4rn7Q2Nm8o7
$$ 143 60 113 166 46 94 45 109 177 182 184 250 118 115 114 160 59 198 127 120 138 43 184 195 82 82 154 88 90 61 155 146 89 171 176 128 61
2462F1R7J40j00k4J3m2j12M4Q1rK9j51K00q6j24J26k8o6L8ml2R9L6j43L8J04M2j31j7M9J1
$$ 61 158 298 198 174 187 145 33 77 158 149 178 27 227 141 17 143 115 49 87 83 51 150 186 43 81 185 227 96 79 128 139
2171A39P6r7J13J76j93k9j66J75K8K9k8O0o2j50qP1O4j50K7R9J03k28ok4J15r0O0m4M7o6J35
$$ 139 215 118 231 407 214 185 19 194 222 251 223 283 221 71 63 134 198 48 75 174 277 49 43 19 134 44 104 60 107 41 176
1880A76lJ4j00K4MK2r2R7L4P8j36k9jJ40j76k3J15L0qq0k6j5Q2R6j59K0JR2L8q1q2L3nOPm
$$ 176 173 187 87 111 115 137 45 142 176 254 118 89 88 228 52 29 144 174 166 86 60 45 127 223 64 84 85 177 215 134 52 85 80 86 93 89
1542H9N8l3NO2j42O0kJ3P7M1j64J9o0Q5J22m0j28mk1O8J05l3l3j0k0n6L2K09k1Ok24J26P2
$$ 89 147 114 119 181 39 99 97 110 187 228 64 83 23 108 230 190 62 58 37 105 210 177 144 134 114 58 90 299 278 284 60 186 258
1232B58o4q2K06j86j02L7J03l6J14p6q1N8J02o2n1o9Q0qL9j24M0l9m2lO6l8M5l5J28l6j05
$$ 258 194 112 318 132 30 67 170 134 248 172 91 149 251 189 138 69 149 141 180 56 96 57 15 12 78 40 85 50 178 142 37
941C7J50j18R6K4r0k7O2o9J11p1O7j2Pm4k4J5J5K6Po4jq5N4J47r3O2kk0M3l1n0j15M9PO9N1
$$ 37 187 69 165 189 99 72 134 65 176 105 172 160 167 123 99 114 129 155 162 98 97 12 66 213 120 182 180 160 203 172 122 7 56 63 132 183
603A83L3m6j33J79%r4J46j71M3K28J3J93K32p7k00k75K07j31j93m2J54j15M0O2j18J13j6j75
$$ 183 216 170 37 216 216 122 268 97 140 368 381 574 806 729 529 254 461 330 137 95 249 134 174 236 118 231 215 40
340D0L9R9L5P1k69J21N9L6k04K9K8O2j%O3M1k2J9j20l1l2J01o3K6o2J31M4j46J8n6L3L3n6
$$ 40 79 178 213 284 15 136 195 231 27 56 84 146 145 145 208 249 227 246 126 95 63 164 101 127 65 196 240 94 112 56 89 122 66
30F6K5p9K10p1m5Q4L2ol3j71M3L3k3J4K6l8R7o7n1l2J08P1P6q8q8o9O7Nm9R0O9j21PP1p5j2
$$ 66 91 12 222 151 106 190 222 216 183 12 55 88 65 79 105 67 164 97 46 14 122 193 269 181 93 24 91 96 47 137 206 85 92 163 88 76
-308G6k1L2n0J14m7J6o7K2m0
$$ 76 55 87 37 151 104 120 53 75 35
-392C5
##PAGE=	F1=514.888
##FIRST=	19140.455529915001534,	4405.895418600002813,	0.20647700130939483643
##DATA TABLE=	(F2++(Y..Y)), PROFILE
4406G5P4o5l1l6Q9L3n3J6J12j40O4j33K1L9J29J6k8j5n2MN4lj58J42k7Q1m0j35J20l4Oln5
$$ 75 149 84 53 17 106 139 86 102 214 74 138 5 26 65 194 210 182 167 115 119 173 170 12 154 127 208 168 33 153 119 125 122 67
4096F7L1jO0J32j9m6r2O9l2r2K68j17q0Nk0N1j39J39o6J36m0j65L9NMk7J47Qj06j01M4J39
$$ 67 98 97 157 289 270 224 132 201 169 77 345 228 148 153 133 184 45 184 118 254 214 49 88 93 97 70 217 225 119 18 62 201
3796B01l9j6J1j21pP2M9K2q5O0J4K7M6o6j15J58N1j52J45k00J70J2j34k2mO0m6M9Nk9K5j19
$$ 201 162 146 157 36 29 101 150 172 87 147 161 188 234 168 53 211 262 110 255 55 225 237 103 81 77 137 91 140 145 116 141 22
3495B2J52p6o3K8O5P7q7M8M8m7j16K7K8O6n4r8N0kR9m7J1j13L6N1J28O5j06N7M5J2j71j04
$$ 22 174 98 35 63 128 205 118 166 214 167 51 78 106 172 118 20 70 68 167 120 131 18 54 105 233 298 192 249 294 306 135 31
3195C1M7J02J4o8QLj6M8lj05j6K4o5P8Ljj4R2n5Oj3K6K6j0p3K2rk4K7L1R6j49M3N4M4P6j1
$$ 31 78 180 194 126 134 137 121 169 166 61 45 69 4 82 85 84 70 162 107 113 100 126 152 142 69 91 82 58 85 116 212 63 106 160 204 280 269
2847B69j42lkl8J2n2Q3L9q1K1n5N9O5l1L8P8r6j2KJ7j29J23o2M0K0j43J62K0j51P1R4j21m0
$$ 269 127 124 122 84 96 44 127 166 85 106 51 110 175 144 182 260 164 152 154 171 42 165 103 143 163 20 182 202 51 122 216 95 55
2537E5M6M5l9%N9K6j1p6k6J79l6m3Po1p8J1R9oL3j55K45j16j03P7n8j9k0J4kJ32J7j30QR4
$$ 55 101 146 107 107 166 192 181 105 79 258 222 179 186 125 47 58 157 151 184 29 274 158 55 132 74 55 35 49 47 179 196 66 74 168
2218A68K3q4k7M4N6Ko1P2J74j83l1j20J33N4L4k5P5q0j43PR0M0j61O2L3J04k01K0n3J39n8
$$ 168 191 107 80 124 180 182 121 193 367 184 153 33 166 220 254 229 304 224 81 88 178 218 57 119 152 256 55 75 22 161 103
1927A03l2oOl1R9J0L4r2pK3M0j12J14O3N7j32p0RJ26j64j3J26Qkr0k9L9Q8K5j80jK2Q5J14
$$ 103 71 65 71 40 139 149 183 91 84 107 147 35 149 212 269 137 67 76 202 38 25 151 159 157 67 38 77 165 190 10 9 31 116 230
1608B30o0n9J8r0J8jJ1O2j7KN6r2N0p6M2P5N0j22j7l8P3J36r2j04M3n9P7J39n8m0J9n4n8N6
$$ 230 170 111 129 39 57 56 67 129 112 114 170 78 128 52 94 169 219 97 80 42 115 251 159 55 98 39 116 255 197 157 176 122 64 120
1288A20J73j3L6k32R0Q3p8n6J91k07n8M3J08l1R6j06o2O4R5o9m6q7R9m8N9j19K5l4j5nM6k8
$$ 120 293 280 316 84 174 257 179 123 314 107 49 92 200 169 265 159 97 161 256 187 141 54 153 105 164 45 70 36 21 16 62 34
988C4O2m3J12n7m7J38j08N5Lp3%O4n8N1j5N5J6j8p7k4K6PJJ1m1%o8M7J60n0P1m2k1M2l2p3
$$ 34 96 53 165 108 61 199 91 146 149 76 76 140 82 133 118 173 189 171 94 70 96 103 104 115 74 74 6 53 213 163 234 192 171 213 181 108
650A08p4L9l0O0P8Nn6k2Q2j8o8J58j14l8K23RK40K49r6k06l34K25n1j85j25J72j23M4J11j71
$$ 108 34 73 43 103 181 186 130 108 190 172 104 262 148 110 333 342 582 831 735 529 195 420 369 184 59 231 108 152 263 92
368I2J13j0j40J1J10k5J11k17J20j4P2j82J7PR3J7n7L9N8J3K2r3m6m6O1m0M1p2J06N3j37K7
$$ 92 205 195 55 66 176 151 262 45 165 151 223 41 58 65 158 175 118 157 215 228 250 157 111 65 126 86 127 55 161 214 77 104
68A04m3%L8l8K1m2J25qr1J01N8n5qj10kM5j8K0Nn7J15m9m9qR4N7O5q7p4l4N3K2q1R6M4j20
$$ 104 61 61 99 61 82 40 165 157 66 167 225 170 162 52 50 95 77 97 102 45 160 111 62 54 148 205 270 183 109 75 128 150 69 165 209 89
-270H9k4P8j6p5k4M1rR3m9J4n6kk9
$$ 89 65 143 127 52 28 69 60 153 104 118 62 60 31
-392C1
##PAGE=	F1=475.511
##FIRST=	19140.455529915001534,	4405.895418600002813,	0.23457556962966918945
##DATA TABLE=	(F2++(Y..Y)), PROFILE
4406H5N3q0ll5J10J6m9K1P1j24J17j08k7K9R4J3K6j7p8NL9j8r9J06k4P0Jj60N1OJ4J4q0N2
$$ 85 138 58 55 20 130 146 97 118 189 65 182 74 47 76 170 183 209 192 114 119 158 140 41 147 123 193 194 34 85 91 105 119 39 91
4087I1oJ26R4n1n1n0P3m6j07K66j25q2Nj4k0l2J33j02J38j9j48J3K5l2lJ45J8j02j25M5J39
$$ 91 85 211 305 254 203 153 226 180 73 339 214 132 137 123 103 71 204 102 240 221 73 86 111 79 76 221 239 137 12 57 196
3796A96n7k7M5r0n9Q8M3J5r3N0M9j9L8m2o2J72J4j53J31k23K29Rj48L0m0O3q3M3J2m4O3j10
$$ 196 139 112 157 67 8 96 139 154 61 111 160 141 179 137 75 247 261 108 239 16 245 254 106 136 96 159 76 119 131 87 150 40
3495D0J36j04m7L8J9J08j01N9N8l0j13J0M1M2k7q8lM0P0n8K4p6j0J17Q5L4q7K6O9P2j62j27
$$ 40 176 72 25 63 82 190 89 148 206 176 63 73 114 156 129 41 38 78 148 90 114 38 28 145 230 264 177 203 272 344 182 55
3195E5J2P9J7m8J5J5k3K8j1j08OL7p6R2L0m1lJ01l8Qk9NMM3j12KKrN3K2J35j74OM9N0Q7jj38
$$ 55 67 146 163 115 130 145 122 150 139 31 37 74 -2 90 120 79 76 177 139 147 118 123 127 170 58 60 62 53 106 128 263 89 95 144 194 281 280 142
2838A42k4J3p5Lj3J05J6m3oo0N3N3p6P2R1n1j2lk1j49J16n2Q6N0j65J14L5j84J47J20j70n5
$$ 142 118 131 56 59 46 151 167 124 118 58 111 164 88 160 251 200 188 185 164 15 131 79 165 215 50 164 199 15 162 282 112 57
2537E7P5Rn4M7K8K9J1n3j17K02J2m1K1j34k1k7J11rK8r6K28j38p5K7q7M8n6k2N1J58oj28l0
$$ 57 132 141 87 134 162 191 202 149 32 234 246 205 226 92 71 44 155 146 174 78 306 168 93 120 33 81 25 3 54 212 206 78 48
2227D8R3J5l8l7L4R7l5o3M6J86j82m3p4R1P9M1k4R1r8j36J2J00K6j63J01k8P3j33Nm9J58l1
$$ 48 141 156 118 81 115 212 177 114 160 346 164 121 47 138 217 258 234 325 227 91 103 203 229 66 167 139 212 79 84 35 193 162
1927A62j23L1l4MO1K4M5r4j8O0O4j25J05O7M0j23p3j9J17j48kJ37j0J0o2p2P9P9k2j01J1P5
$$ 162 39 70 36 40 101 125 170 76 58 118 182 57 162 229 269 146 73 54 171 23 21 158 148 158 96 24 103 182 160 59 70 145
1626A45o2J27k5k5qj13L1pNM3j%M8m0L9j50P2P1N1q9m5pN3J40j19n6P7j13O9J58p8m1N9q0
$$ 145 83 210 185 160 152 39 70 63 68 111 110 110 158 118 157 7 79 150 201 112 67 60 113 253 134 78 155 42 111 269 191 150 209 129
$$ [...]
-392I7
##END NTUPLES=	nD NMR SPECTRUM
##END=	
##END=	
