##TITLE=	Oct20-2021.21.fid
TM-VI-108solid Ca+pmb-pyrraz. batch 2 13C

##JCAMP-DX=	6.0	$$ MestReNova 14.3.0-30573
##DATA TYPE=	LINK
##BLOCK_ID=	1
##BLOCKS=	2    
##ORIGIN=	Mestrelab Research S.L.
##OWNER=	hrzepa
##$MNOVA/LINK_BLOCK_TYPE=	ITEM	$$ NMR Spectrum
##$MNOVA/ITEM/POLYGON=	(XY..XY)
5321,5835
8722,5835
8722,8208
5321,8208
5321,5835
##$MNOVA/ITEM/Z=	0
##$MNOVA/ITEM/ANGLE=	0
##TITLE=	Oct20-2021.21.fid
##JCAMP-DX=	6.0	$$ MestReNova 14.3.0-30573
##BLOCK_ID=	2
##DATA TYPE=	MNOVA NMR VIEW DATA
##DATA CLASS=	MNOVA VIEW DATA
##$MNOVA/ITEM/ZOOM/X=	-31.150195598113686657,	251.15679998888273872
##$MNOVA/ITEM/ZOOM/Y=	-759.24724388122558594,	8042.41583251953125
##END=	
##TITLE=	Oct20-2021.21.fid
##JCAMP-DX=	6.0	$$ MestReNova 14.3.0-30573
##BLOCK_ID=	3
##DATA TYPE=	NMR SPECTRUM
##DATA CLASS=	XYDATA
##NUMDIM=	1
##ORIGIN=	Bruker BioSpin GmbH
##OWNER=	nmr
##.OBSERVE FREQUENCY=	100.64143946071199309
##.OBSERVE NUCLEUS=	^13C
##.SOLVENT NAME=	Acetone
##.PULSE SEQUENCE=	zgpg30
##LONGDATE=	2021/10/21 01:48:00.000
##.ACQUISITIONMODE=	SIMULTANEOUS (DQD)
##$ORIGINAL FORMAT=	Bruker XWIN-NMR
##$MNOVA/SCALES_VERSION=	9
##$PARAMETER FILE=	(acqus, ASCII, /private/var/folders/f6/rjf_tdyn2v98c5c0wvkgn4s80000gn/T/M15eMSK4TVC94X7z9+0weQ/21/acqus, 0)
$$ ##TITLE= Parameter file, TOPSPIN		Version 3.2
$$ ##JCAMPDX= 5.0
$$ ##DATATYPE= Parameter Values
$$ ##NPOINTS= 11	$$ modification sequence number
$$ ##ORIGIN= Bruker BioSpin GmbH
$$ ##OWNER= nmr
$$ $$ 2021-10-21 01:48:03.748 +0100  nmr@CZC2439F63
$$ $$ /opt/topspin/data/agmb/nmr/Oct20-2021/21/acqus
$$ $$ process /opt/topspin3.2/prog/mod/shimcntl
$$ ##$ACQT0= -2.26890760309556
$$ ##$AMP= (0..31)
$$ 100 100 100 100 100 100 100 100 100 100 100 100 100 100 100 100 100 100
$$ 100 100 100 100 100 100 100 100 100 100 100 100 100 100
$$ ##$AMPCOIL= (0..19)
$$ 0 0 0 0 0 0 0 0 0 0 0 0 0 0 0 0 0 0 0 0
$$ ##$ANAVPT= -1
$$ ##$AQSEQ= 0
$$ ##$AQ_mod= 3
$$ ##$AUNM= <au_zg>
$$ ##$AUTOPOS= <2 >
$$ ##$BF1= 100.63037
$$ ##$BF2= 400.2
$$ ##$BF3= 100.63037
$$ ##$BF4= 100.63037
$$ ##$BF5= 100.63037
$$ ##$BF6= 100.63037
$$ ##$BF7= 100.63037
$$ ##$BF8= 100.63037
$$ ##$BYTORDA= 0
$$ ##$CAGPARS= (0..11)
$$ 0 0 0 0 0 0 0 0 0 0 0 0
$$ ##$CFDGTYP= 0
$$ ##$CFRGTYP= 9
$$ ##$CHEMSTR= <none>
$$ ##$CNST= (0..63)
$$ 1 1 145 1 1 1 1 1 1 1 1 1 1 1 1 1 1 1 1 1 1 1 1 1 1 1 1 1 1 1 1 1 1 1 1
$$ 1 1 1 1 1 1 1 1 1 1 1 1 1 1 1 1 1 1 1 1 1 1 1 1 1 1 1 1 1
$$ ##$CPDPRG= (0..8)
$$ <waltz16> <> <waltz16> <> <mlev> <mlev> <mlev> <mlev> <mlev>
$$ ##$D= (0..63)
$$ 0 1 0.00345 0 0 0 0 0 0 0.06 0 0.03 2e-05 3e-06 0 0 0.0002 0 0 0 0 0 0
$$ 0 0 0 0 0 0 0 0 0 0 0 0 0 0 0 0 0 0 0 0 0 0 0 0 0 0 0 0 0 0 0 0 0 0 0 0
$$ 0 0 0 0 0
$$ ##$DATE= 1634777282
$$ ##$DE= 6.5
$$ ##$DECBNUC= <off>
$$ ##$DECIM= 704
$$ ##$DECNUC= <off>
$$ ##$DECSTAT= 4
$$ ##$DIGMOD= 1
$$ ##$DIGTYP= 12
$$ ##$DQDMODE= 0
$$ ##$DR= 21
$$ ##$DS= 4
$$ ##$DSPFIRM= 0
$$ ##$DSPFVS= 20
$$ ##$DTYPA= 0
$$ ##$EXP= <c13>
$$ ##$F1LIST= <111111111111111>
$$ ##$F2LIST= <222222222222222>
$$ ##$F3LIST= <333333333333333>
$$ [...]
$$ 90 74 58 42 26 10 0 0
$$ ##$Sgu3PowerLevels= (0..7)
$$ 0 0 0 0 0 0 0 0
$$ ##$Sgu4PowerLevels= (0..7)
$$ 0 0 0 0 0 0 0 0
$$ ##$Sgu5PowerLevels= (0..7)
$$ 0 0 0 0 0 0 0 0
$$ ##$Sgu6PowerLevels= (0..7)
$$ 0 0 0 0 0 0 0 0
$$ ##$Sgu7PowerLevels= (0..7)
$$ 0 0 0 0 0 0 0 0
$$ ##$Sgu8PowerLevels= (0..7)
$$ 0 0 0 0 0 0 0 0
$$ ##$SguType= 3
$$ ##$ShimPowMaxUA= (0..63)
$$ 130000 130000 130000 130000 130000 130000 130000 130000 130000 130000 130000
$$ 130000 130000 130000 130000 130000 130000 130000 130000 130000 0 0 0 0
$$ 0 0 0 0 0 0 0 0 0 0 0 0 0 0 0 0 0 0 0 0 0 0 0 0 0 0 0 0 0 0 0 0 0 0 0 0
$$ 0 0 0 0
$$ ##$ShimPowMaxUC= (0..63)
$$ 130000 130000 130000 130000 130000 130000 130000 130000 130000 130000 130000
$$ 130000 130000 130000 130000 130000 130000 130000 130000 130000 0 0 0 0
$$ 0 0 0 0 0 0 0 0 0 0 0 0 0 0 0 0 0 0 0 0 0 0 0 0 0 0 0 0 0 0 0 0 0 0 0 0
$$ 0 0 0 0
$$ ##$ShimPowMaxUG= (0..63)
$$ 524287 524287 524287 524287 524287 524287 524287 524287 524287 524287 524287
$$ 524287 524287 524287 524287 524287 524287 524287 524287 524287 0 0 0 0
$$ 0 0 0 0 0 0 0 0 0 0 0 0 0 0 0 0 0 0 0 0 0 0 0 0 0 0 0 0 0 0 0 0 0 0 0 0
$$ 0 0 0 0
$$ ##$ShimPowRcbType= 3
$$ ##$ShimPowRes= (0..63)
$$ 1e-20 1e-20 1e-20 1e-20 1e-20 1e-20 1e-20 1e-20 1e-20 1e-20 1e-20 1e-20
$$ 1e-20 1e-20 1e-20 1e-20 1e-20 1e-20 1e-20 1e-20 0 0 0 0 0 0 0 0 0 0 0 0
$$ 0 0 0 0 0 0 0 0 0 0 0 0 0 0 0 0 0 0 0 0 0 0 0 0 0 0 0 0 0 0 0 0
$$ ##$ShimPowRng0= (0..63)
$$ 1 1 1 1 1 1 1 1 1 1 1 1 1 1 1 1 1 1 1 1 0 0 0 0 0 0 0 0 0 0 0 0 0 0 0 0
$$ 0 0 0 0 0 0 0 0 0 0 0 0 0 0 0 0 0 0 0 0 0 0 0 0 0 0 0 0
$$ ##$ShimPowRng1= (0..63)
$$ 1 1 1 1 1 1 1 1 1 1 1 1 1 1 1 1 1 1 1 1 0 0 0 0 0 0 0 0 0 0 0 0 0 0 0 0
$$ 0 0 0 0 0 0 0 0 0 0 0 0 0 0 0 0 0 0 0 0 0 0 0 0 0 0 0 0
$$ ##$ShimPowRng2= (0..63)
$$ 1 1 1 1 1 1 1 1 1 1 1 1 1 1 1 1 1 1 1 1 0 0 0 0 0 0 0 0 0 0 0 0 0 0 0 0
$$ 0 0 0 0 0 0 0 0 0 0 0 0 0 0 0 0 0 0 0 0 0 0 0 0 0 0 0 0
$$ ##$ShimPowRng3= (0..63)
$$ 1 1 1 1 1 1 1 1 1 1 1 1 1 1 1 1 1 1 1 1 0 0 0 0 0 0 0 0 0 0 0 0 0 0 0 0
$$ 0 0 0 0 0 0 0 0 0 0 0 0 0 0 0 0 0 0 0 0 0 0 0 0 0 0 0 0
$$ ##$ShimSysFunc= (0..63)
$$ 1 2 3 4 5 7 9 11 15 16 8 10 12 14 6 17 13 18 19 20 0 0 0 0 0 0 0 0 0 0
$$ 0 0 0 0 0 0 0 0 0 0 0 0 0 0 0 0 0 0 0 0 0 0 0 0 0 0 0 0 0 0 0 0 0 0
$$ ##$ShimSysMatrix= 0
$$ ##$ShimSysType= 1
$$ ##$TFXNUM= 0
$$ ##$TRIPLO2= 0
$$ ##$VTU= 2
$$ ##$VTUETH= <149.236.99.20>
$$ ##$VTUTY= <no>
$$ ##$WBREFAM= (0..15)
$$ 135.5 97.7 100 100 100 100 100 100 100 100 100 100 100 100 100 100
$$ ##$WBREFLM= (0..15)
$$ 0 0 0 0 0 0 0 0 0 0 0 0 0 0 0 0
$$ ##$WBREFPH= (0..15)
$$ 72.26 -67.22 0 0 0 0 0 0 0 0 0 0 0 0 0 0
$$ ##$WBSGU= (0..15)
$$ 0 0 0 0 0 0 0 0 0 0 0 0 0 0 0 0
$$ ##$XFAC= 2
$$ ##END=
$$ 
##$DECIM=	704
##$DSPFVS=	20
##XUNITS=	HZ
##YUNITS=	ARBITRARY UNITS
##FIRSTX=	25274.001712016048259
##LASTX=	-3134.6557087493106337
##DELTAX=	-0.43348832563920586258
##XFACTOR=	1
##YFACTOR=	0.084750348835539987546
##FIRSTY=	5.5346088409423828125
##MINY=	-27.603189468383789063
##MAXY=	7311.06640625
##NPOINTS=	65536
##XYDATA=	(X++(Y..Y))
25274F5RRRRRJ0RRqqqqk1k1k1k1j9j8j9j9NNNNPPPPJ4J5J5J5KKKJ%jJ5J5J6J6j1j1j8j9j8
25254D5j9NNNNqqqqJ0J0J1J0j3j3J3J3QPqqj6j6j5j5POPPj7j6j7j7J5J5J5J4PPPPKLKKjkk
25233D3jj3j2j3j1j6j6J1J0K7K8JKk2k0k2k2K4K4K4K4%%J%j3j3j3j2J5J6J6J6qppp%J%JON
25214D7ONKJKJj9k0k0j9MMj2j2KJK7K9j3j2k7k8j8j8lkOPOOJ2J1J2J1OOONJ6J6j1j1J%J6J6
25194D5k5k4rrppQRK2K3K3K3J7J6J6J6lmlml2l3l2l2NMNNqpqrNMMMKJj3j3ppL1K9L8L8KJl4
25173F6l5j8j8NMNMj1j0j0j1J3J2klrrJ8J7K5K5kklmmlonnoQQQQk1k2k0k1mnmmJ9J9J9J9j1
25152A4j1rj1RQJ0RnmK2K2QRj8j7ppppj5j5J0J1NONOL1L1L1L1ooopkkkkrrrrj6j5%%K2K2m
25131H5nMLMMlmllllllooooQPPPj6j6j5j6JKKJKJj4j4j8j8J8J9J4J5J5J5llmllll8m0k2k2
$$ y = [65, 74, 83, 92, 101, 110, 120, 129, 138, 130, 122, 114, 106, 85, 64, 43, 22, 3, -15, -34, -53, -48, -43, -38, -33, -26, -19, -12, -5, 9, 24, 39, 54, 56, 58, 60, 61, 61, 60, 75, 90, 106, 122, 111, 100, 82, 63, 45, 26, 31, 36, 41, 46, 38, 30, 22, 14, 24, 34, 45, 55, 42, 29, 42, 55, 63, 70, 62, 54, 38, 22, 7, -8, -1, 5, 12, 19, 2, -14, -31, -48, -33, -18, -3, 11, 18, 25, 32, 39, 41, 44, 46, 48, 47, 45, 43, 42, 29, 17, 4, -7, -23, -39, -28, -18, 9, 37, 38, 40, 18, -2, -24, -46, -22, 2, 26, 50, 50, 50, 51, 51, 38, 25, 12, 0, 15, 31, 47, 63, 55, 48, 41, 34, 34, 35, 35, 36, 42, 47, 53, 58, 60, 61, 63, 64, 45, 25, 5, -14, -10, -6, -18, -30, -28, -27, 0, 29, 16, 4, -23, -51, -69, -87, -90, -92, -86, -79, -73, -67, -55, -44, -32, -21, -15, -9, -3, 2, 18, 34, 23, 12, 13, 13, 29, 45, 20, -4, -13, -22, -29, -36, -28, -19, 3, 26, 49, 72, 89, 105, 121, 137, 134, 130, 127, 123, 91, 58, 26, -6, -1, 3, 8, 13, 5, -2, -10, -19, -14, -10, -6, -2, 0, 1, -12, -25, -32, -39, -8, 21, 59, 97, 99, 100, 66, 31, 13, -5, 0, 4, 9, 13, 2, -8, -18, -29, -16, -4, -6, -9, -18, -27, -9, 8, 33, 58, 56, 54, 51, 47, 43, 40, 34, 29, 24, 18, 26, 34, 42, 50, 29, 7, -13, -34, -38, -43, -47, -51, -32, -13, 6, 25, 14, 3, -6, -17, -8, 0, 10, 19, 14, 10, 32, 54, 62, 71, 53, 36, 29, 22, 15, 8, -7, -22, -12, -1, 4, 10, 15, 21, 52, 83, 114, 145, 139, 133, 127, 120, 118, 116, 114, 112, 103, 94, 85, 76, 60, 45, 45, 45, 67, 89, 85, 80, 84, 87, 91, 95, 92, 88, 85, 82, 79, 76, 73, 70, 64, 58, 52, 46, 54, 61, 68, 75, 59, 43, 28, 12, 13, 15, 17, 18, 20, 21, 7, -7, -25, -43, -25, -6, 8, 23, 38, 53, 50, 47, 43, 40, 37, 34, -4, -44, -66, -88]
25108h8J5J5KLj3j4LKj2j2k2oK8N4N2L8K0NOOONj0rJ6J7KJk5k5j7j6j7j5k0j9j8j8J1L7L1
25091aJ4mk0k1nJ7J6Nj9k6k6k6k6kK5L6L6ONNOK5K6j1j0k6k6J0J1K4K5J0RJ4J3J4J3RQRQK
25072A52JJJ%%j%nok1l7k7%L1L1OPj0j0l2l2l2l1ppopJJJJjkkjOPOOlmmlqqpqJJJ%ONl1l2
25049a12l5l4j6J6L4L5L6L6L5L3QQLLj3j3k1j9j8j8j8J3L3L2nlnnKJKKmlllMNNLprrrJ0RJ0
25028dRJ1J2J2J2K4K4K7oj3j3J2J1J%J%rj0OPOPk0k0l2l2NMLLj3j3ook9l0mK8K6K5J5J5J5
25009F1J5lklkj7j6j6j7J3J3J3J3J5J6J6J6QPQQj4j3j4j4J0J0ook0k0OOpol3l2j9j9QQJ3J3
24991clkJ4J6J5J6k0j9j9k0J2J1J1J2llJ3J3K1K1nok2k2op%%j%%JJ%lkllnoL0L1K9K9J3J3
24971A39nnnmk4k4k3k4J1J0J1J1QRRQk0k1k0k1J0J0J1J0llllOPOPj7j6j6j7k3k4qqPOL3L3
$$ y = [-88, -73, -58, -56, -53, -66, -80, -77, -75, -87, -99, -121, -127, -99, -45, 7, 45, 65, 70, 76, 82, 88, 93, 83, 74, 90, 107, 109, 110, 85, 60, 43, 27, 10, -5, -25, -44, -62, -80, -69, -32, -1, 13, 9, -11, -32, -37, -20, -4, 1, -18, -44, -70, -96, -122, -124, -99, -63, -27, -21, -16, -11, -5, 20, 46, 35, 25, -1, -27, -17, -6, 18, 43, 53, 62, 76, 89, 103, 116, 125, 133, 142, 150, 152, 153, 154, 155, 155, 155, 154, 154, 149, 143, 122, 85, 58, 58, 89, 120, 126, 133, 123, 113, 81, 49, 17, -14, -21, -28, -34, -41, -40, -39, -38, -37, -38, -40, -42, -43, -37, -30, -24, -18, -21, -25, -29, -32, -40, -48, -55, -63, -62, -61, -60, -60, -54, -49, -80, -112, -147, -181, -197, -181, -147, -112, -76, -40, -5, 28, 36, 44, 47, 50, 37, 24, 3, -16, -34, -52, -70, -57, -24, 8, 3, 0, -5, -10, -8, -7, -5, -3, -7, -10, -13, -16, -12, -7, -2, 1, -6, -15, -24, -33, -23, -14, -4, 5, 16, 28, 40, 52, 76, 100, 127, 121, 108, 95, 107, 118, 119, 119, 120, 120, 111, 101, 107, 114, 120, 127, 107, 87, 55, 23, 28, 32, 35, 38, 25, 12, 6, 0, -29, -59, -63, -35, -9, 16, 31, 46, 61, 76, 73, 71, 68, 66, 49, 33, 17, 0, 13, 26, 39, 52, 67, 83, 99, 115, 123, 130, 138, 146, 132, 119, 105, 91, 101, 111, 105, 99, 79, 59, 65, 71, 64, 58, 25, -7, -26, -45, -37, -29, -16, -3, -6, -8, 6, 22, 37, 53, 33, 14, -5, -25, -13, -2, 9, 21, 18, 15, 28, 41, 62, 83, 78, 72, 50, 28, 22, 15, 15, 15, 14, 14, 14, 15, 16, 16, 13, 11, 8, 5, 0, -6, 24, 55, 84, 113, 126, 139, 134, 129, 124, 120, 96, 72, 49, 25, 36, 46, 57, 68, 76, 85, 94, 102, 82, 61, 41, 20, 30, 40, 51, 61, 58, 55, 52, 49, 55, 62, 68, 75, 58, 42, 26, 9, -14, -38, -46, -54, -47, -41, -8, 25]
24951B5K1K1NOLLk4l9k5JJ0J1mmnmJ1J0J1J0j3j3j3j2kkkjJ1J0J2J1rj0j0qJKKJJ5J7j6j4
24932@k0j9J2J2PPOPk3k3k4k3JJL4L3POQPpoopQPL8L8L4PrrLLk9k8kkkkj1j2j2j0J5J6J6J6
24912F3LLLLqrqrJJL3L2L2L1kjj2l7l2j5LLNMJ4J4j7j8j5j6j5j6JJJKonnnJ0J1QRJ8ql5m9
24891c4l3NM7O2N6L9K7J0kkl4l5l1l2l1l1j3j3j3j3jjL0L1j7j6j7j6k1k2j9k0J8M9M0K4J1
24875a8J2RJ0K7K7K6K7J6J6j5j6l0l0l0l1%%L0L1L1L1jjk1k1k1k1k2k2RRLMMLK4K4K4K4qq
24857A05qqJ2J2k0j9l1l1j6J4L3L3L4L5NONNl6l7k2RK2K1qqk2k3k3k2K1K1K2K1qpqqJ3J3J2
24839A09J3JKl1l0k5k4k4k5KLKKJ4J3J3J4nnnmRQRRj7j7jK7K8K9jjKKKKl1l2j4J1RQRJ0j9
24819E1k0j9j9MMMMJ9J8J8J8j6j6j6j6ppoppqppk7k7l3j8K8O5O7N3L3J6Kj4l1l0j6j6rqqr
$$ y = [25, 46, 67, 72, 78, 81, 84, 60, 21, -4, -3, 7, 18, 14, 10, 5, 1, 12, 22, 33, 43, 30, 17, 4, -8, -10, -12, -14, -15, -4, 6, 18, 29, 20, 10, 0, -8, -7, -5, -3, -2, 13, 30, 14, 0, -20, -39, -27, -15, -8, -1, 5, 12, -11, -34, -58, -81, -80, -79, -45, -12, -5, 1, 9, 16, 9, 3, -3, -10, -2, 5, 43, 81, 115, 122, 113, 104, 107, 110, 81, 53, 51, 49, 47, 45, 34, 22, 10, 0, 15, 31, 47, 63, 66, 69, 72, 75, 67, 58, 50, 41, 42, 43, 76, 108, 140, 171, 169, 168, 156, 119, 87, 72, 75, 78, 83, 87, 101, 115, 98, 80, 65, 49, 34, 18, 19, 20, 21, 23, 17, 12, 7, 2, 12, 23, 31, 40, 58, 50, 15, -34, -67, -62, -15, 47, 103, 142, 169, 179, 177, 175, 141, 106, 75, 43, 12, -19, -32, -45, -58, -71, -72, -73, -43, -12, -29, -45, -62, -78, -99, -121, -140, -160, -142, -93, -53, -29, -18, -6, 3, 13, 40, 67, 93, 120, 136, 152, 137, 121, 91, 61, 31, 0, 0, 0, 30, 61, 92, 123, 122, 121, 100, 79, 58, 37, 15, -7, 2, 11, 14, 18, 22, 25, 49, 73, 97, 121, 113, 105, 97, 89, 101, 113, 93, 74, 43, 12, -4, 10, 43, 76, 110, 145, 150, 156, 161, 166, 130, 93, 71, 80, 102, 123, 115, 107, 85, 62, 39, 17, 38, 59, 81, 102, 94, 87, 79, 71, 84, 97, 109, 122, 123, 125, 94, 64, 39, 15, -9, -34, -32, -29, -27, -25, -11, 2, 15, 29, 24, 19, 14, 10, 19, 27, 36, 45, 28, 11, 10, 37, 65, 94, 93, 92, 94, 96, 98, 100, 69, 37, 23, 34, 43, 51, 60, 70, 51, 31, 12, -7, -3, 1, 5, 9, 28, 46, 64, 82, 66, 50, 34, 18, 11, 4, -2, -9, -16, -24, -31, -38, -65, -92, -125, -143, -115, -50, 17, 70, 103, 119, 121, 107, 76, 46, 30, 14, 5, -3, -11, -20]
24801b0j2j1j2j2mmmmJ9K0J9K0J3J3J4J3K5K5K4K5K1K2j1j0j9j8J3J4j1j0j1j0j7j8j7j8n
24785D2nk2k0l8l8opJ9J8J9J8llmlpoppK8K7K5K6jk7k1nJ2J3J4J4K7K7K8K7k2k2k2k2j9j9
24767B8mlJ8J9j3j3onno%%j%rpk2k2KL9N6M1J4j2j4j5k3k3pJ9K3Pj4j4rqrp%%%%K9K9K8K8
24747A09Kj4k0PL0L1J4j2k6m2l4l5nnK6K6NMNMnnk1k1J5J5%k7k3qJ0J1J7j1k5k6JJ8Qj8l5
24729f0j9RL5L8L8K5K5KKLKOOj0l7n4n3l9j2J2J2kkJ3J2J2J2J1J1J1J1j8j6j8j7J9J9Lk3k8
24712e9j2RRRRK5M9O1L4kl9m5k9MK0K2K2rrqqK5K4OOk6k5k4k4QRJ2J3J2J3j4j5j4j5j0j0r
24694ej0k4k3k3k4LLLMJ9K0J9K0L1L2J%J7J8J7J7J1J1nml6l6mlj1j0J0K7Qj8j7RJ7J8j3j3
24676E6llllj9j9j9j9ooooJ4J4J4J4NNNNJ1J1nnQRql5k5k6MLK2K0%j5OL2M8M8J6J5j%k4k4
$$ y = [-20, -32, -43, -55, -67, -71, -75, -79, -83, -64, -44, -25, -5, 8, 21, 35, 48, 73, 98, 122, 147, 168, 190, 179, 169, 150, 132, 145, 159, 148, 138, 127, 117, 100, 82, 65, 47, 42, 37, 15, -5, -43, -81, -87, -94, -75, -57, -38, -20, -23, -26, -30, -33, -40, -46, -53, -60, -32, -5, 20, 46, 45, 18, -3, -8, 4, 17, 31, 45, 72, 99, 127, 154, 132, 110, 88, 66, 47, 28, 24, 21, 39, 58, 45, 32, 26, 21, 16, 10, 10, 10, 9, 9, 0, -7, -29, -51, -49, -10, 46, 87, 101, 89, 75, 60, 37, 14, 7, 26, 49, 56, 42, 28, 19, 11, 2, -5, -5, -5, -5, -5, 24, 53, 81, 109, 111, 97, 77, 84, 114, 145, 159, 147, 121, 79, 45, 10, 5, 0, 26, 52, 57, 61, 66, 70, 65, 60, 39, 18, 33, 48, 48, 21, -2, -10, 0, 11, 28, 17, -8, -34, -33, -15, -7, -25, -60, -79, -70, -35, 3, 41, 66, 91, 93, 95, 98, 100, 106, 112, 102, 65, 11, -42, -81, -93, -81, -69, -71, -73, -60, -48, -36, -24, -13, -2, 9, 20, 2, -14, -32, -49, -30, -11, -8, -31, -59, -71, -62, -53, -44, -35, -10, 39, 100, 134, 132, 93, 48, 19, 23, 43, 65, 87, 78, 69, 61, 53, 78, 102, 108, 114, 88, 63, 39, 15, 23, 32, 44, 57, 69, 82, 68, 53, 39, 24, 14, 4, -5, -15, -39, -62, -85, -109, -106, -103, -100, -96, -77, -57, -38, -18, 13, 45, 46, 46, 63, 81, 98, 115, 126, 137, 132, 128, 92, 56, 52, 49, 38, 28, 38, 65, 73, 55, 38, 47, 64, 82, 69, 56, 53, 50, 47, 44, 25, 6, -13, -32, -38, -44, -50, -56, -42, -28, -14, 0, 5, 10, 15, 20, 31, 42, 37, 32, 40, 49, 41, 6, -19, -45, -41, -38, -16, 4, 4, -11, -5, 27, 75, 123, 139, 154, 153, 153, 129, 105]
24656A05k3k4k0k1j9k1J4J3J4J3J5J5kk8m2m2QRJ5J5jjJ3J4J4J4j1j1j1j1qrrrK0J9K0K0%
24639D7j%%J3J3J3J3KLLKK5K5K2K3J0j7l2l2l0mJ3J3j1j1j1j2J7J7%k6n4n3k4k3ppK3K3K0
24622a5pj6jRJ0noRQK3K4L2L1J5j2k2k2qpJ6J7K4Qk9n5k9PK5K5j0l6k2k2QQJ5J4J0oj4J1L6
24603D1K0j4l0k1k2MMLMKKKJjkl1l2rJ7J2nj5j5J6J6J1J1J1J1j%JJLK8L0Lj8j7j9j9j1j1j1
24584e0j1J4J4J4J4J6J8J7J8j8j8K5M0J5j1j2J5K8J2k1l7k7j2J0J0J7J7j4j5j5j5j5j6k8k9
24569e0OL4K1mj8j9J1J2K6K8J6J7J7J6k0j9k0j9k3k2opJ8J8Jk4m9m9l5l5%jJ6J6PPPOK3K3
24552g4K2mk8k8j2J3M6M5K9Mj0rMMJ3J4J3J4k0j9j9k0ppk2NK9K8L1L1PPQPj7j6j7j7j9j9k0
24534c0k0j1j2j2j2RRRJ0L2M8N3K6j0l5l9l7k2k2J0J0K5K4Mj0j7J0M6M7L3L3J6j1k2k3rrK
$$ y = [105, 82, 58, 38, 17, -2, -23, -9, 4, 18, 31, 46, 61, 59, 31, -11, -53, -45, -36, -21, -6, -7, -8, 5, 19, 33, 47, 36, 25, 14, 3, -5, -14, -23, -32, -12, 7, 27, 47, 47, 46, 46, 46, 59, 72, 85, 98, 100, 103, 106, 108, 133, 158, 180, 203, 213, 196, 164, 132, 102, 98, 111, 124, 113, 102, 91, 79, 96, 113, 113, 87, 33, -20, -44, -67, -74, -81, -58, -35, -15, -22, -38, -39, -30, -20, -25, -31, -22, -14, 9, 33, 65, 96, 111, 99, 77, 55, 47, 40, 56, 73, 97, 105, 76, 21, -8, -1, 24, 49, 39, 3, -19, -41, -33, -25, -10, 4, 14, 8, -6, 5, 41, 61, 47, 17, -4, -26, -22, -18, -15, -11, -9, -7, -5, -4, -5, -7, -38, -70, -79, -62, -50, -55, -70, -85, -69, -53, -42, -31, -20, -9, -10, -10, -9, -8, -5, 23, 53, 56, 38, 21, 2, -17, -28, -39, -50, -61, -47, -33, -19, -5, 11, 29, 46, 64, 46, 28, 53, 93, 108, 97, 85, 100, 128, 140, 119, 82, 55, 43, 53, 63, 80, 97, 83, 68, 53, 38, 23, 7, -21, -50, -44, -10, 11, 7, -11, -30, -19, -7, 19, 47, 63, 80, 97, 113, 93, 74, 54, 35, 12, -10, -16, -23, -5, 13, 14, -10, -59, -108, -143, -178, -178, -179, -163, -147, -140, -133, -126, -120, -97, -74, -52, -56, -84, -112, -124, -111, -65, -20, 9, 13, 3, -6, -2, 2, 15, 29, 42, 56, 36, 17, -2, -22, -29, -36, -58, -53, -24, 4, 35, 66, 73, 80, 88, 95, 78, 62, 45, 28, 9, -10, -30, -50, -61, -73, -85, -97, -88, -79, -70, -60, -28, 20, 73, 99, 89, 54, 15, -22, -44, -66, -56, -46, -21, 3, 7, -3, -20, -10, 36, 83, 116, 149, 165, 154, 132, 109, 100, 91, 93]
24518I3JKKk8k8j3j2k2k3pJ9K8J3%j5j6j7jK5M6M6J6J6ppl8l8n8m4j5J1jj6porrQL5M4M4J5
24499B7J4rrK2K3J3J3j9j8j1j1K1K1L9L8K8rl2l1mlk8n5n2k6J7M3L1L1M3M2J1k6l9l8rrk3
24483A6k2k3k3J3J3J4J2prpp%K7M2M4mmlmkkjkk3k4k3k3l1l2l1l2j3j3j3j3K8K8O0N9L7L7
24465C9ONKKJKrj0j0rJ9K0J9K0J7J7J7J7rql8l8l1nJ2J2J0J1M0M0K0qPOQql7o2n1l5oJ8K3
24446C6K2K5K4lllkj6j6j6j6j4j3j3j3LLLLK2K4qqKKKJ%jJ8j5m1m1l0KK6K6K8K7j5j4j5j5
24428c2J3J3J2J3j1rj1j1MNMNK1K2j0rJ2J2J1J2llmlj2j2j2j3L7L6L6L6J0J0k0k0j2MJ4j9
24410A16m0m0k9MJ2J3L1%m4n9l9qJJLLJ4J4J4J4OOONPPPOPPNNRk2k2RJ4J3J6J5klklNONOj9
24389H0j8j9j8j9j7j8j9J8J7J7J8K2K2rj0l7l6l7l7nnnnK6K5K4K5M1K7Kk9j6J5Nj1mmmkL7
$$ y = [93, 94, 96, 98, 70, 42, 29, 17, -5, -28, -35, -16, 12, 25, 25, 10, -6, -23, -24, 1, 47, 93, 109, 125, 118, 111, 73, 35, -23, -67, -82, -71, -72, -88, -95, -101, -110, -119, -111, -76, -32, 12, 27, 41, 32, 23, 45, 68, 81, 94, 75, 57, 46, 35, 56, 77, 116, 154, 182, 173, 141, 110, 106, 103, 75, 20, -32, -58, -41, 2, 33, 64, 107, 149, 160, 134, 95, 57, 48, 39, 16, -6, -29, -52, -39, -26, -12, 0, -7, -16, -23, -30, -30, -3, 39, 83, 79, 75, 72, 68, 66, 64, 63, 61, 38, 14, -9, -32, -63, -95, -126, -158, -171, -184, -197, -210, -182, -154, -94, -35, 2, 39, 45, 50, 52, 54, 55, 57, 48, 38, 28, 19, 38, 58, 77, 97, 114, 131, 148, 165, 156, 148, 110, 72, 41, 36, 48, 60, 70, 81, 121, 161, 181, 173, 180, 186, 194, 186, 149, 87, 36, 1, -5, 13, 36, 58, 83, 107, 104, 101, 98, 96, 80, 64, 48, 32, 18, 5, -8, -21, -18, -15, -12, -9, 13, 37, 29, 21, 23, 25, 27, 28, 28, 27, 45, 30, -11, -52, -82, -80, -54, -28, 0, 27, 12, -2, -17, -32, -19, -6, 6, 19, 8, -1, -12, -23, -19, -14, -10, -5, 16, 38, 28, 19, 31, 43, 54, 66, 63, 60, 56, 53, 41, 29, 17, 4, 41, 77, 113, 149, 159, 169, 149, 129, 117, 121, 135, 116, 76, 36, 7, 11, 23, 36, 67, 67, 23, -36, -75, -83, -82, -81, -78, -75, -61, -47, -33, -19, -13, -7, -1, 4, 11, 18, 25, 31, 38, 45, 50, 55, 64, 42, 20, 29, 43, 56, 72, 87, 85, 82, 80, 77, 82, 88, 93, 99, 80, 62, 43, 25, 6, -11, -29, -48, -30, -13, 4, 22, 44, 66, 57, 47, 10, -26, -63, -100, -105, -110, -115, -120, -94, -69, -45, -20, 21, 48, 50, 21, 5, 20, 25, 14, 10, 6, 2, 0, 37]
24372C7N5O2L0ml5k9j2kk%jj9k0j9j9j9j8k0j9ooooJ2J2J2J2jjjkmmmmK5K5K4K5nnnnm0m1
24352e3j0rOOPOj0j1j0j0llQpl2%M5O0L6Ok5k7k2J0K4K3kljkj6j7J6J6QRL0M6K8mj7j7j5j5
24333D9j5j5K7K8K8K8k9k8k9k8J%J%k0k1k1k1QQQQj4j4l0kJ8J9j2j1MMMMooook5k5k5k5K5
24315a62K5K5K5K1K0K0K0J1J2J2J2KKJKopooqpqoj4j3j4j4qrK3K3K4K3Lj3qJ7L3L2Rj7l5l4
24296Bk0k2J0J0J4J4J4J4JJJJJ9K0J9K0MNMNj5j4j4j4k2k2k2k0kjkjPOL8L8PQNOk3n0m3k8
24277d2j4j5j4j3J6J5J6J6ooook1k1J1J1JJk9l0m0k4KL4K8K8L0L1M1M1K7mqqj0rK0K1K1K1
24260A06j3j4j3j4j7j7j6j6J4J5M6M5J0k1llLKLLJ4J5j7j7j6j5m6m4oK6J6JPONNnnnnJKk9
24241a2l1KKL3L3M3M2K8mj8l5l6k1KKLLK0K1K0K1j9k0j9j9j5j4j4j5MMMLllllJ3J3J3J3L9
$$ y = [37, 92, 154, 184, 180, 145, 116, 104, 102, 100, 100, 99, 80, 60, 41, 22, 3, -15, -35, -54, -60, -66, -72, -78, -66, -54, -42, -30, -31, -32, -33, -35, -39, -43, -47, -51, -26, -1, 23, 48, 43, 38, 33, 28, -12, -53, -63, -72, -66, -60, -53, -47, -57, -68, -78, -88, -91, -94, -86, -93, -125, -125, -80, -20, 16, 22, -3, -30, -52, -42, -18, 5, 3, 0, -1, -3, -19, -36, -20, -4, 4, 13, 43, 89, 117, 113, 96, 79, 64, 49, 34, 19, 46, 74, 102, 130, 101, 73, 44, 16, 17, 17, 18, 18, -2, -23, -44, -65, -57, -49, -41, -33, -47, -61, -91, -93, -75, -56, -68, -79, -75, -71, -67, -63, -69, -75, -81, -87, -112, -137, -162, -187, -162, -137, -112, -87, -66, -46, -26, -6, 5, 17, 29, 41, 43, 45, 46, 48, 42, 35, 29, 23, 15, 8, 0, -6, -20, -33, -47, -61, -69, -78, -55, -32, -8, 15, 18, 5, -3, 14, 47, 79, 88, 71, 36, 2, -18, -40, -30, -20, -6, 8, 22, 36, 37, 38, 39, 40, 59, 79, 98, 118, 122, 127, 131, 136, 121, 107, 93, 79, 57, 35, 13, -7, -9, -10, -12, -13, -6, 0, 38, 76, 83, 91, 96, 102, 79, 29, -14, -42, -56, -71, -85, -98, -82, -67, -51, -35, -41, -47, -53, -59, -80, -101, -90, -79, -78, -77, -106, -136, -176, -200, -198, -164, -136, -108, -78, -47, -6, 35, 62, 58, 50, 42, 32, 23, 43, 64, 85, 106, 93, 79, 66, 52, 35, 18, 2, -14, 0, 15, 61, 106, 116, 95, 92, 89, 92, 94, 97, 100, 114, 129, 112, 95, 79, 64, 18, -26, -32, -6, 10, 11, 18, 24, 29, 34, 29, 24, 19, 14, 15, 17, -12, -43, -41, -39, -6, 27, 70, 112, 140, 136, 118, 83, 47, 26, 28, 30, 33, 36, 56, 77, 97, 118, 99, 79, 60, 41, 26, 12, -2, -17, -13, -9, -5, -2, -5, -8, -11, -14, -1, 12, 25, 38, 77]
24223G7L8K5qj4j5j6j7l7l7k4PRok6k5j0K1M5O0L7Nj9l5l5j8pRK2Qk5m2l8k3jjqqqqJ9J9J9
24205i1K0kjjjL6L7MNj4j4j5j5qqK4K4K3K4qqK2K1K2K1RQk4k5l0m6n5k4K9K9L1L0L1L1k2k2
24187D7KKKKj9j8J3J3K0K1Pk4n6n6m3j2J4K9K2K2j0j0j0j0J6J6j6j6j%%%JKKJJ6J5L2Jj5j4
24169a2j8j7POOPMMNMK6K6J0j6j7j7kkPPQPLKKLk9k7LLK8K8K9K8J9J9j3j3j8j8l3l3j8OJ6
24149B0L1M7O3N3K6ok2m6m6l1l2j5j5k8k9k9k8ooJ1J0k0k0lK3L1L2L2L2L4L4L4L4j2j2m2m3
24133E6l2oJ0J1j4j5k0oJ7M5N0J3l0n7n7l3MLNNk6k6j5l1l7j0K6O3O6L9J2lrrK0K1J4J4j7
24116D1j8l7l7l8l7NONOL1L1L1L0rrPPJ5J6j6j6j1j0J8J9j9m5l8k2KK8M6M4K5K6RRRRk3k3
24098F7mmmmj3j3J9J9rrm0m0l2l1%%llj8j8k8j2J8M3M6M6K9Mk5k6j2J6K9K8K9L0J8Jk5n2n7
$$ y = [77, 115, 140, 132, 118, 103, 87, 70, 33, -4, -28, -21, -12, -18, -44, -69, -79, -58, -13, 47, 84, 89, 70, 35, 0, -18, -25, -16, 6, 14, -11, -53, -91, -114, -115, -116, -124, -132, -140, -148, -129, -110, -91, -71, -73, -74, -75, -76, -40, -3, 1, 6, -8, -22, -37, -52, -60, -68, -44, -20, 3, 27, 19, 11, 33, 54, 76, 97, 106, 114, 90, 65, 35, -11, -66, -90, -61, -32, -1, 29, 60, 91, 69, 47, 49, 51, 53, 55, 36, 18, 31, 44, 64, 85, 92, 68, 12, -44, -87, -99, -85, -56, -34, -12, -22, -32, -42, -52, -36, -20, -36, -52, -53, -53, -53, -53, -52, -50, -48, -47, -31, -16, 16, 17, 2, -12, -30, -47, -40, -34, -28, -21, -17, -13, -8, -4, 22, 48, 58, 42, 25, 8, 6, 4, 11, 18, 26, 33, 36, 38, 40, 43, 14, -13, -10, -7, 21, 49, 78, 106, 125, 144, 131, 118, 100, 82, 49, 16, -2, 4, 20, 51, 98, 161, 214, 240, 234, 212, 166, 120, 89, 57, 42, 27, -1, -30, -59, -87, -93, -99, -88, -78, -98, -118, -121, -98, -67, -35, -3, 29, 63, 97, 131, 165, 153, 141, 99, 56, 24, 18, 28, 39, 25, 10, -10, -16, 1, 46, 96, 109, 79, 22, -35, -68, -64, -61, -56, -51, -77, -103, -118, -149, -186, -196, -170, -107, -41, -2, 10, 7, -2, -11, 9, 30, 44, 58, 41, 23, -14, -51, -89, -126, -121, -115, -110, -104, -73, -42, -11, 19, 10, 1, 8, 15, 30, 46, 30, 14, 3, -7, 11, 30, 11, -34, -72, -94, -92, -64, -18, 26, 51, 77, 86, 95, 104, 113, 90, 67, 63, 59, 55, 51, 38, 25, 44, 63, 54, 45, 5, -35, -67, -98, -98, -98, -101, -104, -122, -140, -168, -180, -162, -119, -73, -27, 2, 6, -19, -45, -57, -41, -12, 16, 45, 75, 93, 94, 69, 17, -40]
24081d0l2J0L7K0Nj7j7k2k3qJ8L0Ll3l3k1k2nnJ8J9J9J8j5j6JK8N3N3K3j4l1k9jjOPK1K3J2
24063C9J3j9j9ooK6K6J4J4jkrrrj0j8j9j7j9J4J4J3J3MLk9k7j0j0K0K0Mk3j6jJJJKPOL7L8
24045E1K5K5opj6j6j6j5J1J1J1J2j8j8j8j7qqqqk2k1nK2L6L5OOLLLMj5j4j3j4J0Rj1k7j8R
24026d7M5M5K5K6pok9k9LLKLk9k8k1k1J1J0LLk8k9J0J0J0Rj5j6j5j6K5K4K4K4lmmlk7k8NM
24008h1j2j3RK4K6%l8l7j%JJM1O8N9M5K4Qj6j6l0l0l0k9l5l5o5o5k2RK4K3ONQPLL4M9M8J0
23990b3RRQK2K1j1j0k0k0rk5m1j0J5L1K1NOK2L1L2%l2k9LJ5J5%jjjj4k9l8nL0M5L8L7K7mj8
23972A01j8j6j5j6j6k5k7k7k7ppK5K5K9K8llJ1J1J1J1L2L2J%rrl9l8kL0K2NJJ%%kjkkm1m1
23954a7k7MMNOPj0j0j1j0RJ0RRJ1J1J0J1J5J6j6j7J0RJ0RK0K0K0K0k0j9k0k0J6J5J6J5j3j4
$$ y = [-40, -72, -62, -25, -5, 0, -17, -34, -56, -79, -87, -69, -39, -36, -69, -102, -123, -145, -150, -155, -137, -118, -99, -81, -96, -112, -111, -83, -30, 23, 46, 32, 1, -28, -29, -30, -24, -17, 4, 27, 39, 52, 33, 14, 8, 2, 28, 54, 68, 82, 81, 79, 70, 61, 52, 42, 24, 5, -12, -31, -17, -3, 10, 23, 27, 30, 1, -26, -36, -46, -26, -6, -2, -25, -41, -42, -41, -40, -39, -37, -30, -24, 13, 51, 76, 101, 95, 88, 72, 56, 40, 25, 36, 47, 58, 70, 52, 34, 16, -1, -9, -17, -25, -33, -55, -76, -81, -59, -23, 12, 18, 24, 27, 30, 33, 37, 22, 8, -5, -19, -9, 0, -11, -38, -56, -47, -2, 43, 68, 94, 87, 81, 52, 23, 26, 29, 31, 34, 5, -23, -44, -65, -54, -44, -41, -38, -66, -95, -85, -75, -65, -56, -71, -87, -102, -118, -93, -69, -45, -21, -24, -28, -32, -35, -62, -90, -85, -81, -93, -106, -97, -73, -47, -47, -85, -122, -123, -123, -122, -121, -80, -12, 47, 92, 116, 124, 108, 92, 62, 32, 2, -27, -62, -97, -162, -227, -249, -240, -216, -193, -187, -182, -174, -167, -164, -130, -81, -33, -23, -14, -5, 3, 25, 46, 35, 25, 5, -15, -24, -49, -90, -100, -85, -54, -33, -28, -22, 0, 31, 63, 63, 31, 2, 5, 20, 35, 35, 34, 33, 32, 18, -11, -49, -54, -24, 21, 59, 96, 123, 119, 101, 83, 67, 52, 36, 20, -5, -32, -59, -86, -93, -100, -75, -50, -21, 7, 4, 1, 12, 23, 34, 45, 77, 109, 110, 110, 101, 92, 53, 15, 13, 43, 65, 70, 71, 72, 72, 72, 70, 69, 67, 65, 24, -17, -44, -40, -36, -31, -25, -18, -28, -38, -49, -59, -50, -40, -31, -22, -11, 0, 10, 21, 36, 52, 36, 19, 29, 38, 48, 57, 77, 97, 117, 137, 117, 98, 78, 58, 74, 89, 105, 120, 107, 93]
23936I3j4j3m6m5m5m5m4k8kK9N5N4K5K4j5j5j5j5j8j7j8j7J6J7J7J7J0J1J1J0J5J3J5J4J2
23921D6J2K9kj9j8k1k1j0j1j1j1j1j1j1j1lmmmKKLKk6k7ONL0K9K8K9J1mJ5M8M7J6LMK2K1K2
23903A92K2j6j6m6m6l1JJ4J5k2k2k2k1pqpqj6j5j6j5j%j%j9j8J3J4L4L3L4L3j4j5j3j5k4k4
23886g3k4k4J9J9J9J9J2J1j8j8QM1L9Pl0m4l9l9k0k0J2J2K2K3rrj5j5J7J7K4K4K4K4j0j1K1
23870dK1L3L3L1L1K8mqk5l1l2l3l2k4k5k5k4%%L2L1pqqqJJJ4M5M2K7Lk9l7l7l7l8l1%K6M2
23852f6L6L5L7L7J5J4J5J4j4j4m4m5m6l1oK6K6J1j0j0llllK2K1K2K2J6J6j6j5NONNJ2J1J2
23835A12J1j1j1j1j1j0j0JL4K3rk0k1j0j1j0j1klklj8j9j9j9k2k3QRJ0RJ0RK5K5K2K3Qk4l6
23818gl7j2j1j2j1M0M0L7L8J0k2l3l3oK4QPJ6J6J6J6l2l2l1l2j3j2J8J7j9n1m1k5j4JJ5L2
$$ y = [93, 79, 66, 20, -25, -70, -115, -159, -187, -189, -160, -105, -51, -26, -2, -17, -32, -47, -62, -80, -97, -115, -132, -116, -99, -82, -65, -55, -44, -33, -23, -8, 5, 20, 34, 46, 58, 87, 85, 66, 48, 27, 6, -4, -15, -26, -37, -48, -59, -70, -81, -84, -88, -92, -96, -94, -92, -89, -87, -113, -140, -134, -129, -99, -70, -42, -13, -2, -6, 9, 57, 104, 120, 123, 127, 149, 170, 192, 214, 198, 182, 136, 90, 59, 60, 74, 89, 67, 45, 23, 2, -5, -13, -20, -28, -44, -59, -75, -90, -91, -91, -92, -92, -111, -129, -116, -102, -68, -35, -1, 32, 18, 3, -10, -25, -49, -73, -97, -121, -102, -83, -64, -45, -33, -22, -40, -58, -50, -9, 30, 37, 7, -37, -76, -115, -135, -155, -143, -131, -109, -86, -95, -104, -119, -134, -117, -100, -76, -52, -28, -4, -14, -25, -4, 17, 50, 83, 114, 145, 173, 169, 161, 136, 105, 73, 40, 8, -16, -41, -66, -90, -90, -90, -58, -27, -34, -42, -50, -58, -57, -56, -42, 3, 45, 72, 75, 46, 9, -28, -65, -103, -134, -134, -108, -66, -30, 5, 42, 79, 94, 108, 123, 137, 123, 109, 65, 20, -26, -57, -63, -37, -11, 0, -10, -20, -23, -26, -29, -32, -10, 11, 33, 55, 71, 87, 71, 56, 61, 67, 72, 77, 89, 100, 112, 123, 112, 101, 90, 79, 69, 59, 60, 94, 117, 108, 88, 67, 57, 46, 36, 25, 23, 20, 18, 15, -3, -22, -41, -60, -82, -105, -97, -88, -78, -69, -59, -50, -25, 0, 22, 45, 53, 29, -7, -44, -56, -67, -79, -90, -50, -10, 27, 65, 75, 53, 20, -13, -19, 5, 13, 20, 36, 52, 68, 84, 52, 20, -11, -43, -56, -68, -50, -33, -52, -103, -144, -169, -183, -182, -167, -135]
23802a35O7O7N3K2%JjkJ7J7j6j5l3l4kkL7L6M3K7Kk9m5m4j6j5j4j6POPOjkjjPOPPj0j0K0K1
23783C9jkkjQQRQOOOOJ4J4J2J2j2m4l5k0oonoONONklklJ8J7J8J7K4K3M0Rl0m5m7l1j6j6J6
23762A7J7J8J8j4j3kkjkoono%%L2L2rrqrj4j5j3j5K0K2K1K1K6K6onk0k0j9k0llllk8k9k9l0
23743i7j0j1j0j1POOOL6L5L5L5rrrqppppLML4L5QPQPrrm1l9l8k3LL4L6K0k1k1KLLKQQPPnn
23721honj3j2j3j2J6J7J6J7LNNMk3k5k4k4jjjjjjjjj6j7j6j7j6j5j6j5j1j0ONJ7J6L7N4N9
23703d5L3mmJ4J3j7j7LMj2j2j1j2K0K0K1K0j1j0mmnmj2j3j3j2j8j7J5J4J6J7J6J6oonoJ9J8
23685aJ8J9J6J7J5J5ol3m9m9l0l0k8k8j8J9N0N1L5L4MLk0j9J1J1LMk7k8%%L2L1L1L1%jNMK1
23667A13K0J2J1mmk0j9mlJ3J3lljjj7j7l9l8k1NJ3J4J6J6L1L1J4j2j9j8nmqpqpMMMMJ8J8L
$$ y = [-135, -68, -1, 52, 74, 74, 75, 74, 72, 89, 106, 90, 75, 42, 8, 6, 4, 41, 77, 120, 147, 149, 120, 75, 31, 15, 0, -14, -30, -23, -17, -10, -4, -5, -7, -8, -9, -2, 4, 11, 18, 8, -2, 18, 39, 38, 36, 34, 33, 41, 49, 58, 66, 72, 78, 84, 90, 104, 118, 130, 142, 130, 86, 51, 31, 25, 19, 14, 8, 14, 19, 25, 30, 28, 25, 23, 20, 38, 55, 73, 90, 114, 137, 177, 186, 156, 111, 64, 33, 17, 1, 17, 34, 52, 70, 56, 43, 41, 39, 38, 36, 30, 24, 19, 13, 13, 13, 45, 77, 68, 59, 51, 42, 28, 13, 0, -15, 5, 27, 48, 69, 95, 121, 115, 110, 90, 70, 51, 31, 28, 25, 22, 19, -9, -38, -67, -97, -107, -118, -128, -139, -132, -126, -120, -114, -78, -43, -8, 27, 18, 9, 0, -8, -15, -22, -29, -36, -33, -29, 5, 40, 48, 55, 63, 70, 61, 52, 11, -28, -66, -89, -86, -52, -16, 4, -17, -38, -36, -33, -30, -28, -20, -12, -5, 2, -3, -8, -14, -19, -32, -44, -57, -69, -53, -36, -20, -3, 0, 5, 10, 14, -9, -34, -58, -82, -83, -84, -85, -86, -87, -88, -89, -90, -106, -123, -139, -156, -172, -187, -203, -218, -229, -239, -233, -228, -211, -195, -158, -104, -45, -12, -16, -20, -6, 7, -10, -27, -24, -20, -32, -44, -55, -67, -47, -27, -6, 14, 3, -7, -11, -15, -20, -24, -36, -49, -62, -74, -92, -109, -94, -80, -64, -47, -31, -15, -21, -27, -32, -38, -19, -1, 17, 36, 52, 69, 84, 99, 93, 60, 11, -38, -68, -98, -126, -154, -172, -153, -103, -52, -17, 17, 21, 24, 4, -15, -4, 7, 10, 14, -13, -41, -41, -41, -9, 22, 53, 84, 84, 83, 88, 92, 113, 133, 145, 156, 152, 148, 128, 109, 105, 102, 115, 128, 125, 122, 121, 120, 103, 86, 47, 9, -12, -7, 6, 20, 36, 52, 83, 114, 128, 116, 97, 79, 74, 70, 62, 55, 47, 40, 44, 48, 52, 56, 74, 92, 95]
23648I5k4k8jJ4J3ONK1K1nmmnJ0J0J0J0kjkjrqrqk3k2poj5j5J7J7MLLMj8j7j8j6rj0PPJ4J6
23628B0j6j4lJ3J8qj6j8j9j9nmnoJ0oj2J4M8M6J2j4j6kJ8J8J4j2k9k8llllJJJJj3j2j2j3%
23609g9jjjNNNOlkK9K9K0K2J0K6N0K0k7m2k9j4k1k1jK9N2L5J4j8l2l3opooj4j4j4j4mlJ7L3
23590fJ7j2k7k6j0j0j0j0J2J1J2J2QQQQK3K4K4K3J6%nl6m6l0j0j0jj%jRRRRj2j3j1j2J2K8
23572a7L6N%%kkooonLMMLj3j5j4j5J9J8J8J9J3J3j7j7J5M8L7K1lk0k9KOPQQk0k1k1k1k8k7
23553a8k8k8POOPJ8J9J8J9nnnnJ7J8J8J7KJJJk6k6NOk0k0k0k0j%j%%jJ%RK4L2Krrrj1J4J6
23532A7J5J5j4j4j4j2LLKLm3m3m2m2k2RM5M5LMLMK9K8K8K8M5M6J0k2j9j8J1J2QRQRKK%%k1
23514A20n3m3k6lJ1J4lj1j0j2j2PPOOQoj4J6L9M0Nk6m1n6o8l6J1J0k0j9j6j6J7J6M7M8M8M6
$$ y = [95, 71, 43, 42, 56, 69, 75, 80, 101, 122, 117, 113, 109, 104, 114, 124, 134, 144, 142, 141, 139, 138, 129, 121, 112, 104, 81, 59, 52, 46, 31, 16, 33, 50, 54, 57, 60, 64, 46, 29, 11, -5, -14, -24, -17, -10, 4, 20, 4, -10, -13, 0, 18, 10, -6, -24, -43, -62, -67, -71, -76, -82, -72, -78, -90, -76, -28, 18, 30, 16, 0, -2, 16, 34, 48, 36, 7, -21, -24, -27, -30, -33, -32, -31, -30, -29, -42, -54, -66, -79, -79, -80, -81, -82, -77, -72, -67, -61, -64, -66, -37, -8, 12, 34, 44, 70, 120, 140, 113, 71, 42, 28, 7, -14, -15, 14, 66, 101, 115, 97, 65, 32, 26, 19, 13, 7, -7, -21, -35, -49, -53, -56, -39, -6, 11, -1, -28, -54, -64, -74, -84, -94, -82, -71, -59, -47, -39, -31, -23, -15, 8, 32, 56, 79, 95, 95, 90, 54, 8, -22, -32, -42, -43, -44, -44, -45, -36, -27, -18, -9, -21, -34, -45, -57, -45, -17, 19, 24, 24, 24, 22, 20, 14, 8, 2, -3, 0, 4, 8, 11, -2, -17, -31, -46, -27, -9, 9, 28, 41, 54, 37, 20, 35, 83, 120, 141, 138, 118, 89, 91, 97, 104, 112, 120, 100, 79, 58, 37, 9, -18, -46, -74, -67, -61, -55, -48, -30, -11, 7, 26, 21, 16, 11, 6, 23, 41, 59, 76, 78, 79, 80, 81, 55, 29, 34, 40, 20, 0, -20, -40, -41, -41, -42, -42, -42, -43, -42, -42, -33, -9, 23, 25, 16, 7, -2, -13, 1, 17, 32, 47, 33, 19, 5, -7, -4, -1, 1, 4, -39, -82, -124, -166, -188, -179, -134, -89, -86, -82, -79, -75, -46, -18, 10, 38, 83, 129, 139, 117, 98, 80, 91, 103, 111, 120, 128, 137, 139, 141, 141, 141, 120, 67, 24, -2, -5, 6, 20, 17, 6, -4, -16, -28, -21, -14, -8, -2, 6, 0, -14, 2, 41, 81, 86, 60, 19, -37, -105, -141, -130, -120, -140, -159, -175, -191, -174, -158, -111, -63, -15, 31]
23497C1K4K4K4K4J0J1k2k1k8k8LLLKJ7J6J1k1l5l5j4j4j5j5k5k6J0M2O1O3Rk3k0j9k1k0l1
23481d5l2J%J6J6J5J6jkj8j7ooM5M4L1jj5j4j9j9j9j9JJkjMk9j0j0JKJKk4k4qrJ7J7M9M9L3
23462A1L4j8j8j0j1K0K1K7K7J1J2k7k7k6k6mmJ1J2K5K6poj5j4j5j4RJ0L9L9J8j4k8k8j0j1
23446A9j0j0j8j9l5lK4M1N0K0kjllj1j1j1j1KKKKK0K1K0K1k5k5k4k4%j%%j1j1m2m3j3j4KK
23427a33JJJ4M6N3L6Mj2j2j3m4m4k6NJ9J9RRRRQQQQNNK0K1J5J6j7j6m8m9j4J8M3M1M5M4K1
23410A32K1j1j1j7j7j7j7klklJ1J1k1k1j3j3LLrpk5k4k4k4pqJ3J2J3J3J3J4J4J3j4j4j4j4
23393f6kjJ9L6K7ln4n5l5J8M1M1J8J8j2j3j0j1j0j0K2K1K1K2kklkMMMMk2k1J0RK0K0K0K0k3
23375F2k3k3k2j5j5j4j5j3j3MLLLk9k9pqOPol2m6m7nL1M3M2L4L4O4O3M8K2j7j6ppppLLLLq
$$ y = [31, 55, 79, 103, 127, 137, 148, 126, 105, 77, 49, 52, 55, 58, 60, 77, 93, 104, 83, 48, 13, -1, -15, -30, -45, -70, -96, -86, -44, 17, 80, 89, 66, 46, 27, 6, -14, -45, -77, -76, -76, -60, -44, -29, -13, -14, -16, -34, -51, -57, -63, -18, 26, 57, 56, 41, 27, 8, -11, -30, -49, -48, -47, -49, -50, -46, -75, -85, -95, -94, -92, -91, -89, -113, -137, -145, -154, -137, -120, -71, -22, 11, 45, 27, 9, -1, -12, 8, 29, 56, 83, 94, 106, 79, 52, 26, 0, -4, -8, 3, 15, 40, 66, 59, 53, 38, 24, 9, -5, 4, 14, 53, 92, 110, 96, 68, 40, 30, 19, 9, -1, -19, -38, -73, -76, -52, -11, 39, 59, 57, 56, 53, 50, 39, 28, 17, 6, 8, 10, 12, 14, 34, 55, 75, 96, 71, 46, 22, -2, -2, -3, -3, -3, -14, -25, -67, -110, -123, -137, -135, -133, -132, -131, -117, -71, -18, 18, 22, 10, -2, -15, -59, -103, -129, -124, -105, -86, -77, -68, -59, -50, -42, -34, -26, -18, -13, -8, 12, 33, 48, 64, 47, 31, -17, -66, -80, -62, -19, 22, 67, 111, 132, 153, 142, 131, 114, 97, 80, 63, 61, 58, 56, 53, 64, 75, 54, 33, 20, 7, 10, 13, 4, -3, -28, -52, -76, -100, -107, -115, -102, -90, -77, -64, -51, -37, -23, -10, -24, -38, -52, -66, -68, -69, -50, -14, 13, 10, -44, -99, -134, -116, -75, -34, -16, 2, -10, -23, -33, -44, -54, -64, -42, -21, 0, 22, 20, 18, 15, 13, 17, 21, 25, 29, 7, -14, -4, 5, 25, 45, 65, 85, 62, 39, 16, -6, -21, -36, -50, -65, -78, -91, -87, -84, -81, -78, -107, -136, -143, -151, -145, -138, -144, -176, -222, -269, -274, -243, -200, -158, -124, -90, -26, 37, 85, 107, 90, 74, 67, 60, 53, 46, 49, 52, 55, 58, 50]
23356E0rqrJ0J0J0J0j8j8j8j7J5J6J7J6k5k5k4k5J9J8J8J9j6j6l2l3k3k2QRqrqrK8K8K7K8
23339a6j1j0j1j1poppJ6J6J7J6QRPQJ5J4J4J4J9J9j3j3JJJ%rrrrK8K9K9K9NNNNk6k5k6k6j7
23319F2j8j8j8K2K2K1K2k9k8k9k7k7k7k7k7J0J0M1M1M2M3K7K8K2K3K1K1ol3m9n0k0k0k1j9
23304a5nnnnj1j1j1j2jjk2l8l1mJ1J1K2K2K1K2JJL2L3K6K7J1J1PPPPj2j2m1m1k8jJ6J6KLL
23286GLonooqpK5K3K0J9j0j1J2L8K9rm0m0k6JK4K3K5K6JKJJj4j5m4m4l5mL1L0L3L3J7J7j6
23267I5j5l1l1k6k6ON%%%jRRQRj0ql9m0l7oK9K9RQpqppppJJL3L3J1J2j9j8kL0M3M4J4J4j7
23247H3j8mmmlm3m2k9LK4K5nnRQQRj1j1j2j1KLKLrj0K3K1L5L5MLj7j6j7j6JJJJJ4J5J4J4l2
23228D2l2l2l2QPQPj5j6j5j5ooK4K4K9Mj4j4jkK9K9J0J0k2k1j2j2LMmmk0k0j7j8j8j8PPPP
$$ y = [50, 41, 33, 24, 34, 44, 54, 64, 46, 28, 10, -7, 8, 24, 41, 57, 32, 7, -17, -42, -23, -5, 13, 32, 16, 0, -32, -65, -88, -110, -102, -93, -101, -110, -118, -127, -99, -71, -44, -16, -27, -37, -48, -59, -66, -72, -79, -86, -70, -54, -37, -21, -13, -4, 3, 11, 26, 40, 54, 68, 87, 106, 93, 80, 81, 82, 83, 83, 74, 65, 56, 47, 75, 104, 133, 162, 167, 172, 177, 182, 156, 131, 105, 79, 62, 44, 26, 8, 30, 52, 73, 95, 66, 38, 9, -18, -45, -72, -99, -126, -116, -106, -65, -24, 18, 61, 88, 116, 138, 161, 182, 203, 197, 164, 115, 65, 45, 25, 4, -15, -20, -25, -30, -35, -46, -57, -68, -80, -81, -82, -104, -142, -173, -177, -166, -155, -133, -111, -90, -68, -67, -66, -34, -1, 25, 52, 63, 74, 81, 88, 95, 102, 90, 78, 37, -4, -32, -33, -17, -1, 1, 4, 7, 10, 4, -1, -7, -13, -21, -28, -3, 20, 40, 59, 49, 38, 50, 88, 117, 108, 68, 28, 2, 3, 27, 50, 75, 101, 102, 104, 105, 106, 92, 77, 33, -11, -46, -50, -19, 11, 44, 77, 94, 111, 95, 80, 49, 18, -8, -34, -28, -23, -23, -23, -23, -24, -15, -6, 2, 11, 1, -7, -46, -86, -123, -129, -100, -71, -62, -54, -61, -69, -76, -83, -90, -97, -96, -95, -62, -29, -18, -6, -25, -43, -45, -15, 28, 72, 86, 100, 83, 65, 61, 57, 53, 50, 7, -35, -64, -61, -37, -12, -17, -22, -13, -5, 3, 12, 1, -10, -22, -33, -31, -28, -26, -23, -32, -42, -19, 2, 37, 72, 76, 79, 62, 46, 29, 13, 14, 15, 16, 17, 31, 46, 60, 74, 42, 10, -22, -54, -46, -39, -31, -24, -39, -55, -70, -85, -91, -97, -73, -49, -20, -16, -30, -44, -45, -47, -18, 11, 21, 31, 9, -12, -24, -36, -33, -29, -33, -37, -57, -77, -94, -112, -130, -148, -141, -134, -127, -120]
23209a20nmK7K6J5J5j7j7ppK5K4K6K4K6K5rrrr%Jl1l2k7k8MMPQPPRRRRPPPPJ5J5J4J5K7K6
23189A16M0J3j7l3l6k0k0l7l9j4NK2K1Prj1j1j2J8J7J7J7j0rj0rK5K5K5K4pk3j3J3N5N4L9
23173B13J2j0k6j8j9k1k2k1k2rj0j0j0RRQRj2j3j3j2J1J1J0J0j0k6k5j1RRQJ0K2K2K1K2J7
23156A22J6K6J0j2j2j2j3j0j1j8l3m4m4k1oMJ9K0Nj7j7jK5L5L6K2K2POOONj2l4l4l6l5j4L
23140d1J3J4J4J4J3J3J2J2J2mmJ2K1K1jj7k2k2k3k4m0m2l0OK4K5onMMj1j2LLLLopppJJJJK5
23120e6K5L3J8j3j2j2j3oJ0J0nqPK8K9J7J8J8J7mnJ2J1PPk5k6l1l2j%QQQQlmllQQRQj0j0j1
23100C9j0j5j4j5j5%jL1L1RRj2k8l1nJ1J0RJ1J0J1qpK4K5K1K1j0j0l4l4l2l4j4j4J8J7K2K0
23083FK1K2PQk4k4j7j7pk2j8QM3M3J8qlJ4MMNOllkllkklklklmmmm%%%%poonj2j2J9J7Kk4l3
$$ y = [-120, -125, -129, -102, -76, -61, -46, -63, -80, -87, -94, -69, -45, -19, 5, 31, 56, 47, 38, 29, 20, 20, 21, -10, -42, -69, -97, -93, -89, -82, -74, -67, -60, -51, -42, -33, -24, -17, -10, -3, 4, 19, 34, 48, 63, 90, 116, 156, 169, 152, 119, 83, 63, 43, 6, -33, -47, -42, -20, 1, 8, -1, -12, -23, -35, -17, 0, 17, 34, 24, 15, 5, -4, 21, 46, 71, 95, 88, 65, 52, 65, 120, 174, 213, 225, 215, 189, 171, 152, 131, 109, 88, 66, 57, 47, 37, 27, 36, 45, 53, 62, 50, 37, 24, 12, 23, 34, 44, 54, 44, 18, -7, -18, -9, 0, 8, 18, 40, 62, 83, 105, 122, 138, 164, 174, 162, 150, 138, 125, 115, 104, 86, 53, 9, -35, -56, -62, -58, -39, -19, -14, -31, -48, -49, -24, 11, 47, 69, 91, 98, 104, 110, 116, 121, 109, 75, 41, 5, -30, -44, -41, -28, -14, 0, 14, 27, 40, 52, 64, 76, 72, 68, 80, 101, 122, 121, 104, 82, 60, 37, 13, -27, -69, -99, -93, -69, -44, -50, -55, -51, -47, -58, -70, -67, -64, -61, -58, -64, -71, -78, -85, -84, -83, -82, -81, -56, -31, 2, 20, 7, -5, -17, -30, -36, -26, -16, -21, -29, -22, 6, 35, 52, 70, 88, 105, 101, 96, 108, 119, 126, 133, 108, 82, 51, 19, 18, 18, 26, 34, 42, 50, 47, 43, 40, 37, 45, 53, 62, 70, 60, 50, 39, 29, 14, 0, -15, -30, -30, -31, 0, 31, 40, 49, 37, 9, -22, -27, -16, -6, 3, 14, 24, 35, 27, 20, 44, 69, 90, 111, 101, 91, 57, 23, -9, -43, -57, -71, -53, -36, -14, 6, 27, 49, 56, 64, 40, 16, -1, -18, -25, -47, -65, -57, -14, 29, 47, 39, 36, 50, 54, 58, 63, 69, 66, 63, 61, 58, 55, 53, 51, 48, 46, 43, 41, 38, 34, 30, 26, 22, 22, 22, 22, 22, 15, 9, 3, -2, -14, -26, -7, 10, 12, -12, -45]
23060d5j8QK4J6J5qrrrLLk7k8j7QK6K5J6J5J4J5RQRQ%jl3l1l6l7mnooooM4M3M1M2L0Nl2l2
23041B2j8RLj2nQ%%j0j1j1j1j0j1OL1L9K4LLj3j2j3j2ooonkkj%J7M4L7K1jj7j7kQK3L7N1L6
23021B08jj1j2j5j6j6j6n8n8m0j5NMOOj5j6j5j6%%%j%%%%j5j6j5j5J0RM0M0L3Oj1j1lkK9K8
23003A5K4K3K2K2J5j1m7m8k9JJ3J5K0J9K0J9klklONONj4j5j5j5opppj2j1j3j2k5k6k5k6L0
22985a01L1L0L1OOK4pm6m7j7j8K9K9K9K8MNk6k8l6l5K0N2L8M0M0L9Pk5qpj2j3j2j3mnmnK8
22967D7K8K6K5K9ll9l8j0j0j0rj3j2J9J9J6J6J5J6J0J0J0Rk0k1k0k1j3j2j3j3J7J7J7J6k8
22952E7k8k8k8JJ%JJ%JJkjkkK0K0K0K0J3J2j9j9k3k2k2k1k7jJ6J6J0Rk0k0J8M5M2J7j4k9k9
22934a6j4J3L8K3K3Qj9l5l5llklppopOPj5l0k4MJ9J9nmnmM4M4J2J3%J%%POOPj2j2j2j2nmk6
$$ y = [-45, -63, -55, -31, -15, 0, -8, -17, -26, -35, -32, -29, -56, -84, -101, -93, -67, -42, -26, -11, 3, 18, 27, 35, 44, 52, 52, 51, 18, -13, -49, -86, -90, -95, -101, -107, -113, -119, -75, -32, 9, 51, 81, 86, 54, 22, 4, 13, 16, 4, -1, 7, 7, 7, -3, -14, -25, -36, -46, -57, -51, -20, 19, 43, 46, 49, 36, 24, 11, -1, -7, -13, -19, -24, -26, -28, -29, -29, -12, 32, 69, 90, 89, 72, 55, 53, 61, 84, 121, 172, 208, 207, 196, 184, 169, 153, 137, 121, 63, 5, -35, -50, -45, -41, -35, -29, -44, -60, -75, -91, -91, -91, -91, -92, -92, -92, -92, -92, -107, -123, -138, -153, -143, -134, -94, -54, -21, -15, -26, -37, -40, -42, -13, 15, 39, 62, 84, 106, 121, 110, 63, 15, -14, -13, 0, 15, 35, 54, 74, 93, 91, 88, 86, 83, 89, 94, 100, 105, 91, 76, 61, 46, 40, 33, 26, 19, 7, -4, -17, -29, -54, -80, -105, -131, -101, -70, -40, -9, -3, 3, 27, 20, -26, -73, -90, -108, -79, -50, -21, 7, 11, 16, -10, -38, -74, -109, -89, -37, 1, 41, 81, 120, 127, 102, 94, 87, 75, 62, 50, 37, 33, 28, 24, 19, 47, 75, 101, 126, 155, 152, 113, 75, 65, 55, 45, 36, 23, 11, 30, 49, 65, 81, 96, 112, 122, 132, 142, 151, 131, 110, 90, 69, 56, 44, 31, 18, 35, 52, 69, 85, 57, 29, 1, -27, -26, -25, -25, -24, -23, -23, -22, -21, -23, -24, -26, -28, -8, 12, 32, 52, 65, 77, 58, 39, 16, -6, -28, -49, -76, -77, -61, -45, -35, -26, -46, -66, -48, -3, 39, 56, 42, 13, -16, -30, -17, 21, 44, 67, 75, 56, 21, -14, -17, -20, -22, -25, -32, -39, -45, -52, -46, -39, -54, -84, -108, -104, -85, -66, -71, -75, -80, -84, -40, 4, 16, 29, 29, 30, 30, 30, 37, 43, 49, 56, 44, 32, 20, 8, 3, -1, -27]
22913b7m2k5JL8L9K5K7K6K7j2j1j2j2mlmml0l0l0l1j9j9J2J3J1J1J1J1j1j1j1j1LMLLL7L8
22896a9L6L8OOOOj8j8jK5J5J5J6J6j4j4j4j4J5J5l7l8k1k0k2k1%j%%poooqpK4K5OPOPNNON
22876aL5L6NN%J%Jj5j5j4j5J6J5J6J5ooK6K5RRPOJ9j3m6m6j6J6L0L0K9K8llj5j4j4j5opoo
22857I7l0k9KLj2j1j2j0lklkNNNNNMMNJ1J1k1k1j8k0J1J0K6nl7l8j8J4K8K7K2K3j1m3n3n3
22839a29n2n3k6OK0K0L3L3L3L3j8j9j6j7j1K1L5L5K2K2L5L6kl4l0l2J1J1J1J0mnnmL0L2J5
22823D7J6LLk9k9l9m1nK6L9L8K5K5QRpqk4k4QPj3j3KLJ4J4lkj1j1k7k7qrQPJ2J3K7K8MLMM
22803F7rqqrllllRQK3K2L1jl5l6k7k6j1j1l4l3k0J2L0K9%%L0K9K8K8J2k1l4l3opppj0j0K2
22784c5K1L8M0PQqpppJ2J3J0J0Rk4l6l5j3J2K9L0kkkjk0j9j9j8JKJJkkK9K9J5J4j7j8k7k7
$$ y = [-27, -69, -94, -93, -55, -16, 9, 36, 62, 89, 77, 66, 54, 42, 38, 35, 31, 27, -3, -33, -63, -94, -113, -132, -120, -107, -96, -85, -74, -63, -74, -85, -96, -107, -104, -100, -97, -94, -57, -19, 17, 55, 61, 67, 73, 79, 61, 43, 42, 67, 82, 97, 113, 129, 115, 101, 87, 73, 88, 103, 66, 28, 7, -13, -35, -56, -56, -57, -57, -57, -64, -70, -76, -82, -90, -97, -73, -48, -42, -35, -29, -22, -17, -12, -6, -1, 34, 70, 75, 80, 80, 81, 81, 82, 67, 52, 38, 23, 39, 54, 70, 85, 79, 73, 99, 124, 133, 142, 149, 155, 174, 161, 115, 69, 53, 69, 99, 129, 158, 186, 183, 180, 165, 151, 137, 122, 116, 109, 103, 97, 67, 38, 40, 43, 31, 20, 8, -2, -5, -7, -10, -12, -7, -2, 3, 8, 13, 17, 21, 26, 37, 48, 27, 6, -12, -32, -21, -11, 15, 10, -27, -65, -83, -69, -41, -14, 8, 31, 20, -23, -76, -129, -181, -234, -260, -254, -234, -214, -181, -148, -115, -82, -100, -119, -135, -152, -163, -142, -107, -72, -50, -28, 7, 43, 41, 7, -23, -55, -44, -33, -22, -12, -16, -21, -26, -30, 0, 32, 47, 63, 66, 69, 40, 11, -28, -69, -74, -48, -9, 29, 54, 79, 87, 96, 89, 81, 57, 33, 41, 48, 35, 22, 24, 27, 41, 55, 52, 50, 39, 28, 1, -26, -34, -43, -35, -28, -16, -3, 24, 52, 56, 59, 63, 67, 58, 50, 42, 33, 30, 27, 24, 21, 30, 38, 61, 83, 114, 113, 78, 42, 15, -11, -22, -33, -67, -100, -120, -108, -78, -49, -49, -49, -19, 10, 38, 66, 78, 57, 23, -10, -16, -23, -30, -37, -47, -57, -35, -14, 24, 64, 71, 79, 71, 64, 57, 50, 62, 75, 85, 95, 104, 80, 44, 9, -4, 8, 37, 67, 65, 63, 61, 60, 40, 21, 2, -16, -15, -13, -12, -11, -13, -15, 14, 43, 58, 72, 55, 37, 10, -17]
22766a7K4K6K4K5pqj7j7j7j7j5j5j6j5J1J1J1J1LLLLL1L1L2L2pqqqJ%%%%%k0l7l7j2NMJ4J5
22747B2J5J6J3J3J1J1ql5l5qJ5J6j4j5NNk7k6j8j8J4J4rj0j0j0J2J1J2J1jkjkK7K6K7K8K5
22730A00K4RJ0pom8o3l5JL0L1%j6oK0M4M3K9Kk2k3k4k4j%j%j9j9J3J3QQm2m2l2nJ2J2j7j8
22712f1J4J5L4L6L5L6J1J2k0k1n1n1l4l5j1MJ2L8N0N1L6Rk6k6j2J4J7j1m5m4l1nL3L2L5L6
22696G6K0K0rrk6k5k1k2k1k1j2j1K0K0J6J4J6J5oopoJ3J3J3J3j2j1j2j2%jj6j5POL7L7J2k4
22679F3m5k7%%j4j5j5j6K7M2K6%rOK2K1rrqrl8l9KK8K1OmmlnJ6J7J7J7j5j5j6j5mmK6K7lm
22660C9j9k0j6j8J4J4L1L2K4Qj4m1m0j6J8J6K0J9L5L5L5L5j0j0j0rj5j5j4j5l1l1j4J3J6J7
22644F3J8J8M9M8J7k1l8l8k5k4K2K2K2K1J5J5j7j7l3l2%jj9j9m8m9k7jJ6J6J6J7J6J7ONOO
$$ y = [-17, 7, 33, 57, 82, 75, 67, 50, 33, 16, -1, -16, -31, -47, -62, -51, -40, -29, -18, -15, -12, -9, -6, 25, 56, 88, 120, 113, 105, 97, 89, 90, 90, 90, 90, 90, 90, 70, 33, -4, -16, -11, -7, 7, 22, 37, 53, 66, 79, 90, 101, 93, 58, 23, 15, 30, 46, 32, 17, 22, 27, 0, -26, -44, -62, -48, -34, -43, -53, -63, -73, -61, -50, -38, -27, -28, -30, -31, -33, -6, 20, 47, 75, 100, 124, 133, 143, 136, 130, 82, 19, -16, -15, 15, 46, 46, 30, 24, 44, 88, 131, 160, 162, 140, 117, 93, 69, 68, 68, 67, 67, 48, 29, 42, 55, 63, 71, 29, -13, -45, -50, -38, -26, -43, -61, -47, -32, 2, 38, 73, 109, 120, 132, 112, 91, 40, -11, -45, -80, -91, -87, -75, -37, 13, 64, 100, 109, 83, 57, 45, 59, 76, 65, 20, -24, -55, -60, -27, 5, 40, 76, 96, 116, 107, 98, 72, 47, 26, 4, -17, -38, -50, -61, -41, -21, -5, 9, 25, 40, 34, 28, 21, 15, 28, 41, 54, 67, 55, 44, 32, 20, 20, 19, 3, -12, -5, 1, 38, 75, 87, 63, 18, -9, -9, -9, -23, -38, -53, -69, -42, 0, 26, 26, 17, 23, 45, 66, 57, 48, 40, 31, -7, -46, -44, -16, 5, 11, 7, 3, 0, -5, 11, 28, 45, 62, 47, 32, 16, 1, -3, -7, 19, 46, 43, 39, 20, 0, -16, -34, -20, -6, 25, 57, 81, 89, 75, 34, -6, -22, -4, 12, 32, 51, 86, 121, 156, 191, 181, 171, 161, 152, 137, 122, 108, 93, 62, 31, 17, 30, 46, 63, 81, 99, 148, 196, 213, 192, 154, 116, 91, 67, 89, 111, 133, 154, 169, 184, 167, 150, 117, 85, 85, 84, 65, 46, -2, -51, -78, -79, -63, -47, -31, -14, 2, 19, 25, 30, 36, 42]
22628D2OPPOqpm0l9mnK7K7L6L7jk7j9lLKj6j7m5m6l5KL4L4POj5l0l4pL0L0L1L0%jj5j7j6j7
22609f0k1k1L2L2L5L5MMk2k1nK0L3L3MLj4j3J8J9PPQPj4j5j4j4k2k2k3k1lmlmqrqrK1K0K1
22590gJ9mnmnMKLLmlmmj4j4j4j4J3J3j9j9j4j4j4j4J9K0J9K0L6L6%k6l2oRRRQQPK4K3L8J2
22571A00j3j4j4j5lkllk1j9J0J1K1K2K1K1j%j%j8j7j7j7K7K8K8K7j2j2j2j2j4j5L9L8L8L9
22554B15OPk8k7k8k8l9l8l9l8j3j3J9N1M2J0jkQQPQk4k5RM0M4J2k0k1%%j%qpqpk0k0j9j9J
22536fJJ%KKL0L2M2J1k4k4j6j6j7j6J5J5J5J5%%%Jk6k6POOPPORRQRJJK0j3l1l1kjkkjkj1j1
22514@J9K1K9L0kkj0rj0rk5k5PPj7j6j7j7nmK7K7j2j2j3j2j3j3J9J9K0J9J9K0K1K2K1K1j8
22498A07j8j9j8NNNNklllkkkkk6k6j0j1J7J6k0k0j5j4JJK3K3L7L9K3K4llm0m0j3j4K6K5K6
$$ y = [42, 48, 55, 62, 68, 60, 53, 13, -26, -30, -35, -8, 19, 55, 92, 91, 64, 45, 42, 45, 47, 31, 14, -31, -77, -112, -110, -76, -42, -35, -29, -44, -74, -108, -115, -85, -55, -24, 6, 6, 5, -10, -27, -43, -60, -81, -102, -70, -38, -3, 32, 36, 40, 18, -3, -8, 12, 45, 78, 82, 85, 71, 58, 76, 95, 102, 109, 117, 124, 110, 95, 81, 67, 45, 23, 0, -21, -24, -28, -31, -35, -43, -52, -60, -69, -48, -28, -7, 12, 8, 3, -1, -6, -2, 0, 3, 6, 2, -1, -5, -9, -23, -37, -51, -65, -52, -39, -58, -77, -91, -105, -119, -133, -114, -94, -75, -55, -19, 17, 17, -9, -41, -47, -38, -29, -20, -12, -4, 3, 27, 50, 88, 100, 87, 73, 59, 44, 41, 39, 36, 33, 12, -7, 3, 14, 35, 57, 78, 99, 98, 98, 97, 97, 79, 62, 45, 28, 55, 83, 111, 138, 126, 114, 102, 90, 76, 61, 100, 138, 176, 215, 221, 228, 200, 173, 145, 117, 78, 40, 1, -37, -50, -63, -44, 7, 49, 59, 58, 56, 64, 72, 79, 87, 63, 38, 47, 87, 131, 143, 123, 102, 102, 102, 101, 101, 93, 86, 78, 71, 51, 31, 12, -7, -6, -5, -4, -4, -2, 0, 30, 62, 104, 115, 91, 67, 51, 35, 18, 2, 17, 32, 47, 62, 62, 62, 62, 63, 37, 11, 18, 24, 30, 37, 44, 50, 59, 68, 76, 85, 86, 87, 107, 94, 63, 32, 30, 29, 27, 25, 24, 22, 11, 0, 19, 40, 69, 99, 97, 95, 85, 76, 66, 57, 32, 7, 14, 21, 4, -12, -29, -46, -51, -55, -28, -1, -13, -25, -38, -50, -63, -76, -57, -38, -18, 1, 20, 40, 61, 83, 104, 125, 107, 89, 70, 52, 57, 62, 67, 72, 70, 67, 64, 61, 59, 57, 55, 53, 27, 1, -9, -20, -3, 13, -7, -27, -42, -56, -55, -54, -31, -8, 29, 68, 91, 115, 112, 109, 69, 29, 16, 2, 28, 53, 79]
22479G9K5j6j6j6j6j6j6j6j6k0k1k0k1RQRQNNMNJ5J5J5J4L3L3j5j4j2j2J5J5j0j1k5k5l3l3
22462h8j1J6M1M1J9oj7j9KK8M6M7K6%k4k3rrONk1k0l0k8llJKk3k3OL3K7J1MNLMrqJ6J7K8K7
22443H7JJj0j0ONJ0RRRj0j0m7m6n3l9nK2L0K9jk8l8l8klJ7J7J8J7L8L8J2J3MMJ9qk2k2J4J3
22425E0RJ0pok0j9j7j8j3J3M3M4K2nl8l7k7k7jjrrOPK3K4K2K3OOOOj%l6l5k7JJ1J2J0J1k5
22406a3k7l4l3qpj1j2j1j1J6J6J6J6J4J4jkJKL6L7K0nk4k6j2J3J4j3m4m5%L8L3PlmJj4k1N
22389h2J0J0J2J1llllkkkjj%l0l0rJ8J8J9J6J6J6J6RRJ0J0j8j7kK4L2J6nnJ1J1nnooooJ5J6
22369G3J4J5j9l5m0j4J6J7J9J9j9j8llK4K3qrrrrj0ppnnnK0J6jj4j4j6j6QQQQJ4J5J5J5KJ
22350E5l0k9l7l7nnMNMN%%%%QRQRMNMMnononok1k1j0j0M3M2L1L2J4J5Rj8k8j2nomnOQL7L6
$$ y = [79, 104, 88, 72, 56, 40, 24, 8, -8, -24, -44, -65, -85, -106, -97, -89, -80, -72, -67, -62, -58, -53, -38, -23, -8, 6, 39, 72, 57, 43, 31, 19, 34, 49, 39, 28, 3, -22, -55, -88, -99, -83, -42, -1, 18, 12, -5, -24, -22, 6, 52, 99, 125, 125, 101, 78, 69, 60, 66, 71, 50, 30, 0, -28, -31, -34, -33, -31, -54, -77, -71, -38, -11, 0, 4, 9, 12, 16, 7, -1, 15, 32, 60, 87, 88, 89, 79, 69, 75, 80, 90, 99, 108, 117, 107, 97, 50, 4, -49, -88, -93, -71, -41, -12, -13, -41, -79, -117, -119, -122, -105, -88, -70, -53, -15, 23, 35, 48, 52, 56, 75, 67, 45, 23, 37, 50, 59, 69, 62, 56, 36, 17, 0, -18, -31, -18, 25, 69, 91, 86, 48, 11, -16, -43, -44, -45, -54, -63, -57, -50, -27, -3, 19, 42, 48, 54, 60, 66, 65, 65, 29, -6, -33, -32, -21, -9, 1, 12, -13, -40, -74, -107, -115, -122, -133, -145, -156, -167, -151, -135, -119, -103, -89, -75, -76, -78, -77, -75, -39, -2, 18, 13, -11, -37, -49, -36, -22, -35, -79, -124, -124, -86, -53, -46, -49, -53, -52, -66, -87, -82, -72, -62, -50, -39, -42, -45, -48, -51, -53, -55, -57, -58, -59, -59, -89, -119, -128, -110, -92, -73, -57, -41, -25, -9, 0, 9, 19, 29, 11, -6, -8, 16, 48, 64, 59, 54, 65, 76, 71, 66, 60, 54, 48, 42, 57, 73, 87, 102, 83, 48, 8, -6, 10, 27, 46, 65, 46, 28, 25, 22, 46, 69, 61, 52, 43, 34, 25, 15, 8, 1, -4, -9, -14, 6, 22, 21, 7, -7, -23, -39, -31, -23, -15, -7, 7, 22, 37, 52, 54, 55, 25, -4, -41, -78, -83, -88, -84, -79, -75, -70, -70, -70, -70, -70, -62, -53, -45, -36, -32, -27, -23, -19, -24, -30, -35, -41, -46, -52, -73, -94, -104, -114, -71, -29, 2, 34, 48, 63, 72, 54, 26, 14, 9, 3, -1, -6, 0, 8, 45, 81]
22328H1K3j4m7m5l1l1JJL6L6L6L7j0j0j0j0k7k5l3j8J4M0M1J5ppqrlklkj1j2j2j1KLLLRJ0
22310gQJ0J2J2J3J2J0Rol2m5k1J7J5j8j8j9j9rqJ2K8K7Jj5j5mnnmJ7J7J7j1j7j8J2J2qqkJ3
22292d0Mk3k1ML2L2M0K5kk8j4j3ppopk2k1k2k1K7K7K7K8K4K5K5K4k1k1k1k2prqrj2j3j3j3
22274g9rrK8K8RRj8j7MMj2j2ooL0M7M7J7ml6k5j0NNj1j1J6J5J9K1K0K0j1j1l7l7l8l8qK4M3
22256c4M2QQj6j6%jjjj6j7k5k4k7NL3L2QQK7K5K6K6K4K4kkj8j8j8j8LKKKMLk1k0j5J8J5J5
22238E0K5K4K4K4j1j1j2j1l7n2o0k8mJ2K3qqqj0j0K9K9J4J3KJK8K8QQj8j9NNNMj0j0j0j0M
22220A8NMMK3K2K4K3KJ8K2ll5n0l7k0l1l2nL2N7M2Rj7k5k5j1j0J4J5J4J5J9K0J9K0k6k6k6
22204F2k5m2m3m1m1j9PK9M6N3L6J9Lj4j4KJJ8J8j8j9k3k5rqJ5J6%%J6J5%%j0rrj0JKl0n6m7
$$ y = [81, 104, 90, 43, -2, -33, -64, -63, -62, -26, 10, 46, 83, 73, 63, 53, 43, 16, -9, -42, -60, -46, -6, 35, 50, 43, 36, 28, 19, 16, 14, 11, 9, -2, -14, -26, -37, -35, -32, -29, -26, -17, -7, 1, 11, 23, 35, 48, 60, 70, 79, 73, 41, -4, -25, -8, 7, -11, -29, -48, -67, -76, -84, -72, -44, -17, -16, -31, -46, -50, -55, -60, -64, -47, -30, -13, -24, -41, -59, -47, -35, -43, -51, -53, -40, -36, -59, -80, -76, -44, -12, 28, 53, 51, 23, 9, -4, -11, -18, -24, -31, -53, -74, -96, -117, -90, -63, -36, -8, 16, 41, 66, 90, 69, 48, 27, 5, -2, -11, -19, -28, -40, -53, -66, -79, -88, -97, -69, -41, -32, -23, -41, -58, -54, -50, -62, -74, -80, -86, -56, -9, 38, 55, 51, 15, -10, -20, -15, -10, -21, -32, -16, -1, 18, 39, 59, 79, 68, 57, 20, -17, -55, -93, -101, -77, -34, 8, 16, 24, 8, -8, -8, -9, -10, -11, -27, -44, -69, -93, -120, -115, -82, -50, -42, -34, -7, 18, 44, 70, 94, 118, 116, 114, 96, 78, 60, 42, 45, 47, 49, 51, 55, 58, 37, 17, 2, 20, 35, 50, 75, 99, 123, 147, 136, 125, 113, 102, 65, 13, -47, -75, -79, -67, -44, -52, -60, -68, -78, -88, -59, -30, -16, -3, -1, 0, 28, 56, 64, 72, 54, 35, 40, 45, 50, 54, 44, 34, 24, 14, 18, 23, 27, 31, 54, 76, 100, 123, 125, 143, 165, 162, 127, 77, 40, 20, -11, -43, -48, -16, 41, 83, 92, 75, 50, 25, 14, 4, 18, 33, 47, 62, 81, 101, 120, 140, 114, 88, 62, 37, -5, -48, -89, -130, -149, -142, -113, -67, -14, 22, 41, 44, 30, 16, 18, 19, 37, 55, 37, 18, -5, -30, -39, -47, -32, -16, -16, -16, 0, 15, 15, 15, 5, -4, -13, -23, -22, -20, -50, -106, -153]
22185a53k0rqlK3L5L5JKJJK1K0jk7l7k2J1L7L7L6J6j0k0j9J5J6K2K1K2K2k2k1k2k1k0j9j8
22169g8j8JK7L8L8J6JJJ6J6J6jj6k8k8j1MPQRRj1j1j0j1j3j3MK0J9Mj0NJ9K1mmkJ4NNmlmm
22149C9llllk1k0k8j3jJ5J6JlmmmPOOPJ5J7Rok5k6%J6J3%j6jQpl4l3k2pj2j3jL5N1L4K9K9
22129D0L8K2nnnoQPQQnmnmj8j8j7j8rrj6kPQQQqqpqKLk3k3j5%ppRL6N6N7M3J7noppj3k8l3
22107C4oK5K6LLLMk3k2k2k2J2J2J2J2mmmmj0j1j1j0J9K0L5L4K2mk6k6j3j4LKrrPPj0j1MMl
22088B5k8l8k3RK5J8J6RRopj8k0PQRRJ0J0PPPPMLLLk9l0k9k9ooJ0J0K3K3jjML1L1L2QQQQl5
22067I5l4l5l3j8j9QQJ1J2J0J2j6j5j5j6lklkkjllJ3mj0J6L6J9j1l9m1m1oL2M9M8M9M9L9J3
22050A47j1k7j7j8klKKJKkjl8l6m4k8mK2L3L1J9J8j4j4k9k9l4l3j1J5L6L7K7%mnooJ%%Jj2
$$ y = [-153, -173, -182, -190, -193, -170, -135, -100, -99, -97, -96, -95, -74, -54, -55, -82, -119, -141, -130, -93, -56, -20, -4, -14, -34, -53, -38, -22, 0, 21, 43, 65, 43, 22, 0, -21, -41, -60, -78, -96, -95, -68, -30, 8, 24, 25, 26, 42, 58, 74, 73, 57, 29, 1, -10, -6, 1, 9, 18, 27, 16, 5, -5, -16, -29, -42, -38, -18, 1, 5, -5, 0, 19, 40, 36, 32, 30, 44, 49, 54, 50, 47, 43, 39, 36, 33, 30, 27, 6, -14, -42, -55, -56, -41, -25, -24, -27, -31, -35, -39, -32, -26, -20, -13, 2, 19, 28, 22, -3, -29, -29, -13, 0, 0, -16, -17, -9, -16, -50, -83, -105, -112, -124, -137, -138, -103, -52, -18, 11, 40, 78, 100, 95, 90, 85, 79, 87, 94, 102, 110, 105, 101, 96, 92, 74, 56, 39, 21, 12, 3, -13, -15, -8, 0, 8, 16, 8, 0, -7, -15, -13, -10, -33, -56, -71, -71, -78, -85, -76, -40, 16, 73, 116, 133, 128, 122, 115, 108, 95, 67, 34, 28, 53, 79, 82, 85, 88, 92, 69, 47, 25, 3, 15, 27, 39, 51, 47, 43, 39, 35, 25, 14, 3, -7, 12, 32, 67, 101, 123, 119, 93, 67, 54, 40, 43, 45, 36, 27, 34, 41, 31, 20, 24, 28, 25, -3, -41, -64, -55, -30, -12, 4, 13, 22, 16, 9, -9, -29, -22, -14, -5, 4, 14, 24, 31, 38, 45, 52, 56, 59, 62, 65, 36, 6, -23, -52, -58, -64, -54, -44, -21, 2, 1, 0, 4, 35, 66, 98, 106, 114, 122, 130, 95, 61, 26, -7, -25, -44, -36, -28, -17, -5, 5, 17, 1, -14, -29, -45, -48, -50, -53, -55, -57, -58, -61, -64, -51, -55, -65, -49, -13, 6, -5, -44, -85, -126, -132, -100, -51, -3, 46, 95, 134, 147, 136, 109, 92, 74, 72, 69, 71, 73, 74, 76, 74, 73, 35, -1, -45, -73, -77, -55, -22, 9, 28, 46, 32, 18, -11, -40, -74, -107, -118, -103, -67, -30, -3, -3, -7, -12, -18, -24, -23, -23, -23, -22, -34]
22031c4j1j2j2POL3L1K8K8KJKKKKJKl5n1n1k5lmjjjjJ3J3K9K9RPL5N0L5Rj3j3j3j2LLkkjk
22011H2J2J2j4j5k3k3k3k3OPNOkkjkJ2J2J2J2J6J6J6J6QPQPJ7J6j1j0m1m1l0lNOj9j9l4l4
21992e4k2MJ5J5K6N2O0L3j4m2l4l5l6l6k6k6J1J1J8J8J7J8K5K3jkj8j9j9j9j6j6OL3N0N0M0
21976I0J3j6l3k5KQQoooopoj4j5j5j5K3K4K2K3%%%jj3j4j3j3onmmK0M6M0K4pk2j5j4QQQRn
21957G0nnnQPQQk1k1k1k1l4l5l5l5J5J6J5J5%%j%%j%%K4K4K3K2K0Nj8j8kkjkmnJ1L6M5K9l
21937A06j9j4J2J2j5k5k5k7k6j7j8k7j0QQRRJ7J7J6J5PqqNok2k0mJ6M1L6K0Mk3l9l9j4KRR
21919b8K9L1J4j2k1oJ4J4%j6k2k2j6j6k3pK2M9M2K8Orj0OJ7J7Lk4l9k1j6j6j3LK5K5K9L0L7
21902A04K1mk1k2nJ2J2kk9l1j5lJ3RQpojj%jkkqk3l3j7mJ2ook0k1lmK8K8J%JJLLLKMMLMj3
$$ y = [-34, -45, -57, -69, -62, -56, -23, 8, 36, 64, 66, 67, 69, 71, 73, 75, 76, 78, 43, -8, -59, -84, -87, -91, -92, -93, -94, -95, -82, -69, -40, -11, -2, 5, 40, 90, 125, 134, 121, 108, 95, 83, 86, 89, 87, 85, 84, 82, 94, 106, 92, 77, 54, 31, 8, -15, -9, -2, 3, 9, 7, 5, 4, 2, 14, 26, 38, 50, 66, 82, 98, 114, 122, 129, 137, 144, 161, 177, 166, 156, 115, 74, 44, 41, 46, 52, 33, 14, -20, -54, -76, -72, -57, -42, -16, 36, 96, 129, 115, 73, 39, 4, -32, -68, -94, -120, -109, -98, -80, -62, -45, -27, -2, 21, 20, 18, 0, -19, -38, -57, -73, -89, -83, -50, 0, 50, 90, 103, 87, 54, 29, 31, 39, 47, 41, 35, 29, 23, 16, 10, -4, -19, -34, -49, -26, -2, 20, 43, 43, 43, 43, 42, 29, 15, 2, -11, -17, -22, -26, -30, -10, 36, 76, 100, 93, 71, 56, 42, 50, 58, 66, 75, 70, 65, 60, 55, 63, 70, 78, 86, 65, 44, 23, 2, -32, -67, -102, -137, -122, -106, -91, -76, -76, -76, -77, -77, -77, -78, -78, -78, -54, -30, -7, 15, 35, 40, 22, 4, 2, 0, -1, -3, -7, -12, -1, 35, 80, 109, 106, 87, 73, 85, 97, 82, 57, 32, 5, -21, -38, -56, -83, -93, -85, -77, -68, -59, -42, -25, -9, 6, 13, 5, -3, 2, -4, -26, -46, -50, -34, 7, 43, 63, 67, 44, 5, -34, -48, -46, -37, -28, 1, 32, 46, 34, 13, 7, 21, 35, 35, 19, -3, -25, -41, -57, -80, -87, -65, -16, 26, 54, 60, 51, 41, 47, 64, 81, 84, 60, 21, 0, -16, -32, -45, -42, -17, 8, 37, 67, 104, 125, 121, 100, 78, 73, 85, 97, 95, 66, 35, 20, 17, 30, 39, 47, 40, 34, 33, 32, 32, 31, 29, 27, 19, -4, -37, -54, -58, -46, -52, -58, -78, -99, -102, -106, -78, -50, -49, -49, -48, -47, -44, -41, -38, -36, -32, -28, -25, -21, -34]
21880c4j3j3j3MLL4L3M2K6%l2n7n8m5j4K3L8K4Rj2j2k6k7j8J4M6M7K2j0k2k2pK4M6K8Qk4l7
21864b5l9j5j5j2j3RM2N3N2J4j7l2l0l1l2J%J4J3lkJ6J6J6J5PQK4K4K4K5qpj4j5J8J7j7j8
21847F3j7j7QQRQrqrqonk1k1m4m3j2j1j%j%ooJ0J0M8M8J7J6K1K2K3K2j%%jJ9J9j3j3k5k4K6
21827G5K6kk9k3pj5j4j3j3jjjjqrrrQQQQnonnK4K4K4K4QQk4k3k5k6k6k6J0J0J0J0J0J1k2k1
21808f3QQPQJ7J5j4j5k1k1J1J1K1K1j0j1mnK7K7j7j7j7j8j7j8J3J4LKL3L2K0ok2k2nnonop
21790e4K4K4pl4k8j1RJ0L2M7L9J2k5k5mnmmLJj7l4k5JJ7J7jkJ4M0M3K8J5kk0l5l6j9pQJ1o
21771a0j1MooK0J8J9J9lllkNNNNrj0rrj5j3J7J8j5j3j4j5JJJJJ9J8J9J9j6j5j4j3MK9L0Lk9
21752B7k8JJ%Jl0l1j7j8J4J4L4L4KLomK3K5Mk3l8l8k6rJ2M9N7M2Qql8n3m4m4k2NJ2K9L8L7
$$ y = [-34, -47, -60, -73, -69, -66, -32, 1, 43, 69, 69, 37, -20, -78, -123, -137, -114, -76, -52, -43, -55, -67, -93, -120, -138, -124, -78, -31, -9, -19, -41, -63, -70, -46, 0, 28, 36, 12, -25, -64, -79, -94, -106, -119, -110, -68, -15, 37, 51, 34, 2, -28, -59, -91, -90, -90, -76, -63, -66, -68, -52, -36, -20, -5, 2, 10, 34, 58, 82, 107, 99, 92, 78, 63, 81, 98, 81, 63, 46, 29, 37, 45, 54, 62, 53, 45, 36, 28, 22, 17, -4, -25, -69, -112, -124, -135, -136, -136, -137, -137, -143, -149, -139, -129, -81, -33, -16, 0, 21, 43, 66, 88, 87, 87, 87, 86, 105, 124, 111, 98, 73, 49, 75, 101, 99, 70, 47, 40, 25, 11, -2, -15, -16, -17, -18, -19, -27, -36, -45, -54, -46, -38, -30, -22, -27, -33, -38, -43, -19, 5, 29, 53, 61, 69, 45, 22, -3, -29, -55, -81, -71, -61, -51, -41, -31, -20, -42, -63, -55, -47, -40, -32, -15, 0, -14, -29, -50, -71, -60, -49, -28, -7, -17, -28, -32, -37, -10, 17, 0, -17, -34, -52, -69, -87, -74, -60, -57, -55, -22, 10, 30, 24, 2, -20, -25, -30, -36, -41, -47, -54, -30, -6, -13, -47, -75, -86, -77, -67, -35, 12, 51, 63, 38, 13, 9, 4, 0, -4, -1, 0, -17, -51, -76, -75, -58, -41, -42, -44, -30, 10, 53, 81, 96, 94, 74, 39, 3, -16, -23, -15, -4, -10, -21, -17, -23, -29, -9, 9, 28, 47, 44, 41, 38, 36, 41, 46, 51, 56, 47, 37, 28, 19, 4, -9, 8, 26, 11, -2, -16, -31, -30, -29, -28, -27, -8, 10, 29, 48, 32, 17, 3, -10, -6, 23, 53, 56, 27, -1, 0, 1, 1, 2, -28, -59, -76, -94, -80, -66, -32, 2, 4, 7, 1, -3, 20, 45, 49, 26, -12, -50, -76, -85, -73, -24, 33, 75, 83, 75, 37, -16, -60, -104, -126, -121, -109, -80, -42, -5]
21734eL8L9nmnmJ2J1nl1k8k7l0k9qqqqqqrqJJL3L2M9M9L5Mj3j2j4j4m9m9l5mK4K5K7K6L0L1
21715C9jjk5k4j1K1J0J0j8k0NMNMj7j7j8j7NML7L5QPON%l1m3m3pK4L8L7K5K5ppk0j9j9j9l2
21696f2l1KKK8N9N9K8j0rj1j2k5k5ONKJJKK3K4K3K3KJKJj0j1K1K0K7K7J3j9l8l8m0m0k8k8
21679c5j5J6J5J4J5J7M4M4J0J1j4m6m5j4J%k8k9j4j5j4j5MMMLJ0RM1M0M0L9Nk7l5l5nnK4K6
21661D5K4K3K0j2m8m7nopoj1j1rrJ1M2K2K3J3j9l2l1PPQPJ4J6J5J5K1K2L9Pj0j0j2j2l0l0
21644D4KKkkkkk3k3k3k4j7j8j7j7J7J7J7J7J1J1J2J1mlmmJ1J2k1k0j9j8J3J4LML3L3J5j6k9
21626il0k1k1J1J0OOj2K0L4L4N4K3j5j5j7j7K3K2K2K2K0K0K0K0nnj9n1q0p8o7l6k3k3J0J1
21610a56L2L3L2L3J2J3k0j9J7J7J6J7J2J2J3J2l6l6l5l6k3k3RQK4K3K3K3NNk5k6j3j3J9J8
$$ y = [-5, 33, 72, 67, 63, 58, 54, 66, 77, 72, 41, 13, -14, -44, -73, -81, -89, -97, -105, -113, -121, -130, -138, -137, -136, -103, -71, -22, 27, 62, 66, 53, 41, 27, 13, -36, -85, -120, -124, -100, -75, -48, -22, 8, 39, 38, 37, 12, -12, -23, -2, 8, 18, 0, -20, -15, -11, -6, -2, -19, -36, -54, -71, -66, -62, -25, 10, 18, 25, 31, 36, 36, 5, -38, -81, -88, -64, -26, 11, 36, 61, 54, 47, 27, 8, -11, -30, -62, -93, -91, -89, -61, -2, 57, 85, 75, 66, 55, 43, 18, -7, -1, 4, 6, 7, 8, 10, 33, 57, 80, 103, 105, 106, 108, 109, 99, 88, 109, 129, 156, 183, 196, 177, 139, 101, 61, 21, -7, -35, -50, -34, -19, -5, 10, 27, 71, 115, 125, 136, 122, 76, 31, 17, 18, 18, -10, -39, -53, -68, -82, -97, -93, -89, -85, -82, -72, -63, -22, 18, 58, 97, 102, 75, 40, 5, 0, -5, 19, 45, 69, 92, 112, 100, 52, 5, 0, -6, -13, -19, -30, -41, -50, -59, -48, -6, 16, 39, 52, 33, 1, -30, -23, -16, -8, -1, 13, 29, 44, 59, 80, 102, 141, 148, 138, 128, 116, 104, 74, 44, 46, 48, 46, 44, 42, 40, 17, -6, -29, -53, -70, -88, -105, -122, -105, -88, -71, -54, -43, -32, -20, -9, -13, -16, -20, -24, -13, -1, -22, -42, -61, -79, -66, -52, -49, -45, -12, 21, 36, 20, -9, -39, -60, -81, -70, -60, -54, -48, -60, -40, -6, 28, 82, 105, 90, 75, 58, 41, 64, 86, 108, 130, 150, 170, 190, 210, 205, 200, 181, 130, 50, -28, -95, -131, -154, -177, -167, -156, -124, -91, -59, -26, -14, -1, -21, -40, -23, -6, 10, 27, 39, 51, 64, 76, 40, 4, -31, -67, -90, -113, -104, -96, -72, -49, -26, -3, 2, 7, -18, -44, -57, -70, -51, -33]
21595c3K2K0K2K2J6J5OK1L7J0l3o0m9m9l9kL4M9N9L2mmnoJ0J0L9M0L0Nj3j3k0k0k0k0rqrr
21577G4opook5k4k5k5J2J2J2J2J5J6J6J6l2l1l2l3k9k9k9k8l1l1JL8O0O0P0N3L1Mk4m1j9m
21561a5j5j4J6J6J5J6j6j4JK7L4L5K2j0k0k0k2k2j1rK0K1J6J6MK1K5pk0j9qqqqj8j9j7j8%
21544c3%KKNL6L7Nj7j8L3L3POPOJ%l1l1k3k3lJ4Rk2l2l3lL0N1L5Pj0jjQQQQ%%%J%%j9J3M8
21523A20L1j1m3j3J9Rqjkkkj1j0j1j0j9j8j8j8J9K0K0K0mmmlKLLLjjl3l1l1l2JJJJJJl2l3
21504a31j8J4M1N7L5Lj5j7j8j9pqnoJ2L9K4K3L5L5K4j3l8l9qrJ9K0j2j2j9k0J1J2j0rK2K1
21487A4J6J6j5j6k0k1k2k1J8J7j4j4k2k1RJ0L2L2L1L2J1J0J0J1j2j2j1j2ONk6k5j6j6K6M1
21471C1L3Pl1l1j0j1j1j1oopoJ1J1J2J1J6J7J7J8PPk5k4k8k9k8k9NML6L6QQQQONk6k5j3j2
$$ y = [-33, -11, 9, 31, 53, 69, 84, 90, 111, 148, 158, 125, 65, 16, -33, -72, -74, -40, 9, 68, 100, 96, 92, 87, 81, 91, 101, 140, 180, 210, 215, 202, 189, 169, 149, 129, 109, 100, 92, 83, 74, 68, 61, 55, 49, 24, 0, -25, -50, -38, -26, -14, -2, 13, 29, 45, 61, 29, -2, -34, -67, -96, -125, -154, -182, -213, -244, -243, -205, -145, -85, -15, 38, 69, 73, 49, 8, -11, -15, -30, -44, -28, -12, 3, 19, 3, -11, -10, 17, 51, 86, 108, 98, 78, 58, 36, 14, 3, -6, 14, 35, 51, 67, 71, 92, 117, 110, 90, 71, 63, 55, 47, 39, 21, 2, -15, -33, -33, -33, -31, -29, -24, 12, 49, 54, 37, 19, 52, 85, 92, 98, 105, 111, 112, 112, 81, 50, 27, 4, 1, 15, 24, 2, -30, -63, -66, -36, 15, 50, 57, 47, 46, 45, 53, 61, 69, 77, 77, 77, 77, 78, 78, 78, 59, 72, 120, 151, 140, 97, 84, 103, 112, 104, 103, 101, 99, 97, 86, 76, 65, 55, 36, 18, 0, -18, 1, 21, 41, 61, 57, 53, 49, 46, 48, 51, 54, 57, 56, 55, 22, -9, -40, -72, -71, -70, -69, -68, -67, -66, -98, -131, -149, -135, -94, -37, -2, 1, -14, -31, -49, -68, -75, -83, -88, -94, -82, -43, -19, 4, 39, 74, 98, 85, 47, 8, 0, -9, 10, 30, 18, 6, -13, -33, -22, -10, -20, -29, -7, 14, 30, 46, 31, 15, -5, -26, -48, -69, -51, -34, -48, -62, -84, -105, -96, -86, -54, -22, 9, 41, 52, 62, 72, 83, 71, 59, 48, 36, 42, 47, 21, -4, -20, -36, -10, 31, 64, 71, 40, 9, -1, -12, -23, -34, -40, -46, -53, -59, -48, -37, -25, -14, 2, 19, 36, 54, 61, 68, 43, 19, -9, -38, -66, -95, -90, -86, -50, -14, -6, 2, 10, 18, 24, 29, 3, -22, -35, -47]
21453d7j3j2MLLMj%kkj0k7l3oJ9K0rrJ0L7K3K2K3K3K2K2J6j1k8k8j1j0J9K1%J%%KLKKJ7J6
21434G5L1Nrrj1j1j2j3j2j2JJJJpppoL6L6M4K9%k6j2j2k7k6k7k6mlmml3l3j6J1K6K7K9K7K3
21416C4K2K2K1pk3l0lK2Pk6m1j5%rj0k2k1J0J0ppppK8K7K8K6K8K7J1j5k0j9k1k0j9k0K2L7
21399A3Ol0k3LK5K5lkOL3L3Pk1k0k2k2mlllK8L0L0K9klllk3k3QQJ9J8j4j3l0l1KJJ1J1J0J1
21380F6J3J4J3J4nnnnk4k4k4k4l8l9%K5K4K4K3K3j2l7l8j2J6J7J8J7J1J1j0k6pJ7J1mQRPO
21362D8K3Pk1m7n8m4j5J2K1L8L0K9K3K3qrk2k2k1k3kkK9K8J5J5J4J5K5K4k8k9l0l0JKK2K2
21346E5j0j0oopoKJKKk8k8LLrrOL3K7Kj3j2J5J6J6J6QRk3k4JJ%JJJL3L2KKJKj8j9j8j8NON
21324D5OLLLMj6j5j5j5j0j1j1j1j5j5j5j4QRRQPPOPK7K6nnrj1j1j1J8J8J6J8J0J0RJ0kjkj
$$ y = [-47, -60, -72, -68, -65, -62, -58, -59, -59, -61, -63, -73, -100, -133, -139, -120, -100, -109, -118, -108, -71, -48, -26, -3, 20, 42, 64, 80, 69, 41, 13, 2, -8, 11, 32, 32, 33, 33, 33, 35, 38, 40, 42, 59, 75, 106, 111, 102, 93, 82, 71, 59, 46, 34, 22, 23, 24, 25, 26, 19, 12, 5, -1, 35, 71, 115, 144, 144, 118, 106, 94, 67, 41, 14, -12, -16, -19, -23, -27, -60, -93, -109, -98, -72, -45, -16, 11, 34, 56, 78, 99, 92, 69, 39, 36, 58, 65, 39, -2, -17, -17, -26, -36, -58, -79, -69, -59, -66, -73, -80, -87, -59, -32, -4, 22, 50, 77, 88, 73, 53, 34, 13, -7, -26, -46, -24, 13, 19, -11, -34, -31, -6, 19, 16, 14, 20, 53, 86, 93, 72, 52, 30, 8, 4, 1, -2, -5, 23, 53, 83, 112, 110, 107, 104, 101, 78, 55, 63, 71, 90, 108, 94, 81, 51, 20, 22, 23, 34, 45, 55, 66, 79, 93, 106, 120, 115, 110, 105, 100, 76, 52, 28, 4, -34, -73, -73, -48, -24, 0, 23, 46, 34, -3, -41, -53, -37, -20, -2, 15, 26, 37, 27, 1, -6, 11, 22, 18, 26, 35, 42, 48, 71, 78, 57, 10, -48, -92, -107, -95, -74, -36, -6, 23, 46, 69, 61, 52, 30, 8, -13, -36, -38, -40, -11, 17, 32, 47, 61, 76, 101, 125, 97, 68, 38, 8, 9, 11, 33, 55, 45, 35, 29, 23, 16, 10, 12, 13, 15, 17, -11, -39, -36, -33, -42, -51, -45, -12, 15, 17, 4, -8, 7, 23, 39, 55, 63, 72, 49, 25, 26, 27, 27, 28, 29, 30, 63, 95, 97, 99, 100, 102, 84, 65, 47, 29, 34, 40, 45, 51, 54, 57, 60, 64, 48, 33, 18, 3, -7, -18, -29, -40, -55, -70, -85, -99, -91, -82, -73, -65, -58, -51, -45, -38, -11, 15, 10, 5, -4, -15, -26, -37, -19, -1, 15, 33, 43, 53, 62, 72, 70, 69, 67, 66]
21305F6J0J0k1k2l3l3klok1l1JM2M3J1J2ooqpNk4m7l0jL2L2Jj6j5J6M8N7K7j8l3k0lj2j2P
21287a0K2L2%l6l4l8l8KKKJKK%%Pk5l9l9RQRRJ4J5J5J4L4L4L3L4mnnmJ6J7L0L1K7%l8l7j8
21268E1j8j7j6j8QJ8KmJ2L2L2J9rrrjjK1L6K8Kl5l5PQqqj6j6l1l0k1k1J1J1M2M3K6jj4j4j5
21250D2j6j3j2J9J9LLj3j3k2k4k4k4j3j3J8J9N3N2K1K1J2J1J2J2ppopk5k5j5K3L9K4rk4rr
21233G3rj0j4j3j3j3j3Lql4l5l5k0OL3L2J8rk7k7j3j3JJJ7J7L8L8K3K1J1J0m1m2l5l5mlJ1
21216a13J2J1J1K1K1K2K0K7K6K7K7LLLLooopPPPPj8j8j7j6nK6K7nl3l2lkNNk6k6k9k9k7k7
21197a23K3N4N3K3rrj1j0k2k2RJ0L3L1J7J7jjj7j7l5l6nmm0m0nK7L7L8PQj4j4J8J8PNrrJK
21179a5JJj5j5j5j5j9j9J1J1j0m1k6ON0N1L8Pqqj0j0j2j2j2j2K4K4K3K4J4J6J6J5lmlmnon
$$ y = [66, 76, 86, 65, 43, 10, -23, -25, -28, -34, -55, -86, -85, -43, 0, 11, 23, 17, 11, 3, -4, 1, -23, -70, -100, -101, -69, -37, -36, -52, -67, -51, -3, 54, 81, 63, 30, 10, 7, -5, -17, -10, 12, 44, 44, 8, -26, -64, -102, -100, -98, -96, -95, -93, -91, -91, -91, -84, -109, -148, -187, -178, -170, -161, -152, -138, -123, -108, -94, -60, -26, 7, 41, 37, 32, 27, 23, 39, 56, 86, 117, 144, 144, 106, 69, 51, 33, 16, 0, -18, -10, 8, 10, 6, 18, 50, 82, 101, 92, 83, 74, 73, 72, 93, 129, 157, 159, 124, 89, 96, 104, 96, 88, 72, 56, 25, -5, -26, -47, -36, -25, 17, 60, 86, 85, 71, 57, 42, 26, 13, 1, 20, 39, 42, 45, 32, 19, -3, -27, -51, -75, -88, -101, -83, -64, -11, 41, 62, 83, 95, 106, 118, 130, 123, 116, 110, 103, 78, 53, 38, 61, 100, 124, 115, 91, 82, 73, 64, 54, 40, 27, 14, 1, -12, -9, -17, -51, -86, -121, -141, -135, -102, -70, -52, -61, -88, -115, -128, -141, -140, -139, -122, -105, -67, -29, -6, 15, 26, 36, -5, -47, -82, -117, -121, -124, -113, -101, -90, -79, -58, -37, -15, 5, 32, 58, 85, 112, 115, 118, 121, 124, 118, 112, 106, 99, 106, 113, 120, 127, 109, 91, 74, 58, 53, 79, 106, 101, 68, 36, 33, 31, 36, 41, 15, -11, -40, -69, -96, -123, -100, -46, 7, 30, 21, 12, 1, -9, -31, -53, -44, -34, -1, 30, 47, 64, 63, 62, 45, 28, -7, -43, -48, -52, -92, -132, -137, -110, -73, -35, -28, -20, -34, -48, -30, -12, -5, 0, -9, -18, -17, -15, -14, -13, -28, -43, -58, -73, -92, -111, -100, -89, -99, -140, -166, -160, -110, -59, -21, -14, -22, -30, -40, -50, -62, -74, -86, -98, -74, -50, -27, -3, 11, 27, 43, 58, 55, 51, 48, 44, 39, 33, 28]
21161B8nj5j3l0m6m0rjkK4K3L9L9K3K3L9L9J9Kj7m8n0l4qqk0k0OK2J7j6k3k3pqL0K9L3L1m
21144A9mk9k9j4j4NNk2k2k7k6j%K0J9N5P0N4Jk7k7k2k4k3k3lmllPPQPk1k1J7J6OOrj0l1l1
21126a48mmPQPPK0J9pplmmlmlK3K3J5J6L1L0K4K5j3j2k3k3k3k4pqJ8J9J7J5JJ%%%jK4K4j4
21106C5j3k0j8j9k0llllK0K0K0K0J8J9pqk3k3jK4M1M1K1nk5k5k7k7J6J6J6J6j4j4j4j5J3J3
21089C9L9M0K2K3k4k5k7k6J0J0K4K3mlj6j5l1l1k3k1MMkkJ2J0ql3k9j2%jJJL0L0MMj%j1l7
21071e2l7k2lJ2LMNNJ0J1j6j5j0j0OOpqqpJ4J5N1N2M0M2oorrPQj8j7j2MQj7n3n3l7j1OOK3
21051a05K4K2mj9j9J1J1K7K6j1l7l0j5PORQM1M0LLj4j3j3j4JK8L2OrqKLKKJ0RJ0Rk6k5k7k6
21033f3jjjkQPj4l0k3LLMpoM6M6M9L3Ok0k6j0J2J1RRQRk2k1l6l6k1OK2K2j2j3LMK7K6nmk4
$$ y = [28, 23, 8, -5, -35, -81, -121, -130, -131, -133, -109, -86, -47, -8, 15, 38, 77, 116, 135, 137, 120, 72, 22, -12, -20, -28, -48, -68, -62, -40, -23, -39, -62, -85, -92, -100, -70, -41, -8, 23, 19, 15, -14, -43, -57, -71, -66, -61, -83, -105, -132, -158, -159, -159, -139, -120, -65, 5, 59, 60, 33, 6, -16, -40, -63, -86, -89, -93, -96, -99, -92, -85, -77, -70, -91, -112, -95, -79, -73, -67, -76, -86, -117, -148, -152, -156, -149, -141, -134, -127, -107, -88, -95, -102, -105, -109, -113, -116, -120, -123, -100, -77, -62, -46, -15, 15, 39, 64, 51, 39, 16, -7, -30, -54, -61, -69, -51, -32, -15, 0, 1, 2, 2, 2, 2, 1, 25, 49, 35, 22, 2, -16, -35, -55, -58, -61, -64, -67, -47, -27, -7, 13, 31, 50, 43, 35, 12, -11, -12, 12, 53, 94, 115, 110, 85, 60, 33, 6, 22, 38, 54, 70, 56, 42, 28, 13, 26, 39, 78, 118, 140, 163, 139, 114, 87, 61, 71, 81, 105, 128, 124, 121, 105, 90, 59, 28, 5, -16, -12, -8, -10, -12, 0, 10, 2, -31, -60, -72, -72, -73, -72, -71, -41, -11, -7, -3, -4, -4, -15, -52, -89, -111, -114, -102, -99, -95, -90, -85, -75, -64, -80, -95, -105, -115, -109, -103, -110, -118, -126, -133, -119, -104, -53, -1, 39, 81, 75, 69, 60, 51, 58, 66, 48, 31, 19, 23, 31, 14, -39, -92, -129, -140, -134, -128, -105, -81, -59, -63, -82, -101, -90, -79, -52, -26, -37, -74, -104, -119, -112, -106, -97, -89, -48, -8, -5, -2, -16, -29, -42, -56, -55, -27, 5, 11, 2, -6, -4, -1, 1, 3, 13, 22, 32, 41, 15, -10, -37, -63, -64, -65, -66, -68, -60, -53, -67, -97, -120, -117, -114, -110, -117, -123, -77, -31, 18, 51, 57, 37, 11, 1, 13, 24, 33, 42, 50, 59, 37, 16, -20, -56, -77, -71, -49, -27, -39, -52, -49, -45, -18, 8, 3, -1, -25]
21013b5k4QQnnnnJ8J7JJk0k0J1J2QRRQK3K2PPj4j5J8J7j3j3jL0J1k1l2l2kjJ3J4j4j3j2j2
20995c2ML5K6J0nk0k1oK3K5K3K3Mk7k7NK7K7K9K9j7j7j8j7l7l7l6l8RJ0RRnmnmQPPQK6K7K4
20976F1K5nl7k8j2kjj%K7K7K8K7nnonJ7J7Mk8k9j2QRk1k0k0k0J0J0M0M0J9j2j9mKLLLpqpp
20956E9opopklklJ7J7J7J7KKLKj5j5j5j5lllmqrrp%J%Jk3k2k2k2K4K4K4K4mnon%%j%OPk5k6
20934e6j6j5J5J6M0L9L9L8K5pm2m1l0k8LKj5j5j4j5PPPPK7K6Ork0J2M2M3J4j9rOJ5J5j5j6
20917F9%J%%L2L2J8j3k2k1QRK3K3%n2o6n0j9lPPPQrk4l3kRQj9k0pK4OPK3K2K2K3kkklJ1J1
20897D1J1J1mlmmJ4J3KJ9K8mj7j7j0j0%j6l5j7J4L0J4kj4l1k7k8l7k1KJ8K0NRK5J5J4ONON
20878B6J%rOJ4kk2k1k6%J7J6K9K9K7K7J5j1k7k6j7%j0rqpJj3j8j8j8j8j6jK0K1J0nMMK1L6
$$ y = [-25, -49, -41, -33, -38, -43, -48, -53, -35, -18, -17, -16, -36, -56, -45, -33, -25, -16, -7, 1, 24, 46, 53, 60, 46, 31, 49, 66, 53, 40, 39, 69, 80, 59, 27, -5, -7, -8, 5, 19, 5, -8, -20, -32, -28, 7, 33, 43, 38, 18, -3, -9, 14, 39, 62, 85, 89, 62, 35, 40, 67, 94, 123, 152, 135, 118, 100, 83, 46, 9, -27, -65, -56, -46, -37, -28, -33, -37, -42, -46, -38, -31, -24, -16, 10, 37, 61, 86, 81, 44, 16, 4, 2, 1, 0, 0, 27, 54, 82, 109, 104, 99, 93, 88, 105, 122, 126, 98, 69, 57, 65, 74, 53, 33, 13, -7, 3, 13, 53, 93, 112, 100, 81, 77, 79, 82, 85, 88, 81, 73, 66, 59, 53, 46, 40, 33, 31, 28, 26, 23, 40, 57, 74, 91, 93, 95, 98, 100, 85, 70, 55, 40, 37, 34, 31, 27, 19, 10, 1, -6, -6, -5, -5, -4, -27, -49, -71, -93, -69, -45, -21, 3, -1, -6, -12, -17, -17, -17, -18, -18, -12, -5, -30, -56, -72, -87, -72, -56, -16, 23, 62, 100, 125, 118, 76, 35, 5, -23, -20, -18, -33, -48, -62, -77, -70, -63, -56, -49, -22, 4, 10, 1, -19, -7, 35, 78, 92, 73, 64, 70, 85, 100, 85, 69, 69, 70, 70, 70, 102, 134, 152, 139, 117, 96, 104, 113, 136, 159, 159, 107, 41, -9, -28, -31, -24, -17, -10, -2, -11, -35, -68, -70, -61, -53, -72, -92, -99, -75, -69, -62, -39, -17, 5, 28, 26, 24, 22, 19, 30, 41, 52, 63, 59, 56, 52, 48, 62, 75, 77, 96, 124, 120, 103, 86, 76, 66, 66, 50, 15, -2, 12, 42, 56, 54, 40, 9, -18, -46, -83, -104, -102, -84, -64, -59, -50, -25, -10, 4, 10, 15, 21, 26, 27, 27, 18, 24, 38, 36, 14, -7, -33, -33, -16, 0, 29, 58, 85, 112, 127, 116, 89, 63, 46, 46, 36, 27, 19, 12, 13, 0, -18, -36, -54, -72, -88, -89, -69, -48, -38, -43, -39, -35, -14, 22]
20860B2K7K7Pj8mmJ2J2J2J1J4J3J4J3J8J8nk1k4k5lJ3qrpqj4j4m4m3k3LJ9J9j5l0k9j3OK1
20843f0J3J2RqqRkkj%J0J1J1J1J2K9J9K0%%l1l2k9l1KJJ3J3K7K9K1K2j1j1LKLKj1j0NOlll3
20823B9l2j5J2K8K9PQk4k4lkJ4J4J0J0k2k2k7k9k7k7l0lK5M0M9L1Ok1k1ook2l6j0J6L3J2j4
20806e0k3qK1K0Ok1j8kJ9J9K9K8J3J3QQK3K4K1K0j1j2k4k4QPONk4k5RL6L4Ql0m5k2NJ2J2J4
20789H9J4qqqqLMLMMLMLJJ%Jj0j1K2K1J7J6JJj6j5l2l1j4j3m2m2k5J2K3K3KJKKlkK9K9J9J9
20768H5LLrrj5l0l2pK8K8Qj9j3Ljj%%j8j8llJ2J1j9j9j5j5J7J7PQQQk0j9j9k0KKKKJ3J4j8
20749f1j8rj0PL3M4K7NOLj2j7PK9K8jjK9K9ql4m2k5PK4J1J1K6K6K8Kj4j5j9j9l4l5%%j%MN
20730A6k4k6J1L6L2J5K5K4K3K4k2k1k2k2PPOPj5j6j5j5j6j5J6J6J4J5J5J5M4M5L1jj0j0j2
$$ y = [22, 49, 76, 83, 65, 61, 57, 69, 81, 93, 104, 118, 131, 145, 158, 176, 194, 189, 168, 144, 119, 116, 129, 121, 112, 105, 97, 83, 69, 25, -18, -41, -38, -19, 0, -15, -45, -74, -87, -81, -60, -47, -35, -26, -34, -42, -33, -35, -37, -38, -38, -28, -17, -6, 5, 17, 46, 65, 85, 85, 85, 54, 22, -7, -38, -36, -35, -22, -9, 18, 47, 68, 90, 79, 68, 71, 73, 76, 78, 67, 57, 62, 68, 65, 62, 29, -3, -18, -6, 22, 51, 58, 66, 42, 18, 15, 13, 27, 41, 51, 61, 39, 17, -10, -39, -66, -93, -123, -126, -101, -61, -12, 19, 25, 4, -17, -23, -29, -51, -87, -97, -81, -48, -36, -50, -73, -81, -60, -40, -34, -55, -73, -75, -56, -37, -8, 20, 33, 46, 54, 62, 85, 109, 130, 150, 139, 127, 103, 79, 87, 94, 100, 105, 81, 56, 65, 101, 135, 143, 113, 68, 46, 51, 63, 75, 89, 103, 95, 87, 79, 71, 74, 78, 81, 85, 89, 92, 96, 99, 100, 101, 101, 102, 92, 81, 103, 124, 141, 157, 158, 159, 143, 128, 96, 65, 51, 38, -4, -46, -71, -59, -36, -13, -11, -10, -8, -6, -9, -11, 18, 47, 66, 85, 88, 91, 82, 73, 58, 28, -4, -11, 17, 45, 53, 34, 21, 24, 23, 22, 22, 22, 4, -14, -17, -20, -8, 3, -16, -35, -50, -65, -48, -31, -24, -16, -8, 0, -20, -39, -58, -78, -76, -74, -72, -70, -57, -43, -61, -79, -88, -98, -91, -58, -14, 13, 18, 24, 27, 15, -2, 5, 34, 62, 61, 60, 89, 118, 110, 76, 34, 9, 16, 40, 51, 62, 88, 114, 142, 144, 130, 115, 96, 77, 43, 8, 8, 8, 7, 7, 11, 16, -8, -34, -23, 13, 45, 60, 85, 109, 132, 156, 134, 113, 91, 69, 76, 83, 89, 96, 81, 65, 50, 35, 19, 4, 20, 36, 50, 65, 80, 95, 139, 184, 215, 214, 204, 194, 182]
20714A82j2j4j3j4j4k5k5k5k5j5j6J6J6L2L3L3L2j9j8j9j9k1k1k1k0MML4L6K2K3j0rJ7J7J8
20699A44J7mlllJ6J7L4Ll8l8oK7N0N0K0K0J7J8J7J8lmllJ3J4K7N9P5P6M6M6K4K5O0R1J15J16
20682A147J15J15J00O8K9kk7k7k9k9k7k8j2K0M1P2R2J23J66J66J71J70K14K47K89L21L80M54
20669D319N18N93O73Q11R94J195J445J773K237K797L495M331N248O210P123P810Q131P973
20662F7676P223N838L922J606q55l254n348o944p905q233q034p390o484n459m475l597k871
20654A5416k269j825j497j233j010q38p00n97n01m23l91l58l05k46j94j52j53j48j48j02p1
20645B255l6l6l2l2K1K1L3L2L2L3PQrm0p0j01j18j17j09j10p7p8m9m9j8j7m4m4m4m4o7o8n4
20631I79k2K0J9Qk4k8k8l0l0KJl1l1l6l7l6l7J1J1J1J1j1j1j1j1k4k5NNrm1n5n5k8k8MMJ8
$$ y = [182, 170, 156, 143, 129, 115, 90, 65, 40, 15, 0, -16, 0, 16, 48, 81, 114, 146, 127, 109, 90, 71, 50, 29, 8, -12, -8, -4, 30, 66, 88, 111, 101, 92, 109, 126, 144, 161, 157, 154, 151, 148, 164, 181, 215, 218, 180, 142, 136, 163, 213, 263, 283, 303, 320, 338, 355, 373, 370, 366, 363, 360, 373, 387, 414, 473, 548, 624, 670, 716, 740, 765, 825, 916, 1031, 1147, 1262, 1377, 1477, 1545, 1574, 1572, 1545, 1518, 1489, 1460, 1433, 1405, 1393, 1413, 1454, 1526, 1618, 1741, 1907, 2073, 2244, 2414, 2628, 2875, 3164, 3485, 3865, 4319, 4837, 5430, 6103, 6914, 7908, 9103, 10548, 12321, 14558, 17355, 20850, 25181, 30429, 36639, 43762, 51572, 59703, 67676, 74899, 80737, 84659, 86265, 85410, 82156, 76808, 69864, 61959, 53726, 45692, 38302, 31818, 26359, 21884, 18287, 15416, 13147, 11322, 9825, 8592, 7582, 6744, 6044, 5447, 4946, 4523, 4132, 3774, 3469, 3223, 3029, 2877, 2724, 2576, 2428, 2326, 2255, 2219, 2183, 2151, 2119, 2140, 2161, 2194, 2226, 2258, 2291, 2298, 2306, 2297, 2257, 2187, 2086, 1968, 1851, 1742, 1632, 1555, 1477, 1428, 1379, 1361, 1344, 1300, 1256, 1212, 1168, 1101, 1033, 979, 957, 977, 996, 1004, 980, 952, 924, 894, 864, 866, 867, 836, 805, 769, 732, 696, 659, 670, 681, 692, 703, 692, 681, 670, 659, 635, 610, 615, 620, 611, 570, 515, 460, 432, 404, 408, 412, 430]
20614D30J8j8m9n5n5k6k5MMK0K1K5K5J0RRRk2k3l0l0j4j4j6j6j7j6j0j0OORRk3k3k9k8LLm
20597F7lmlpopopopoJ4J4J5J4J9J9Mk3l1j6OOJ0J1J1J0jkjkQPQPK0K0L4L5L0Mk4m0l0j4qp
20577A32k3k3k3k3j3j2j2j2j8j8j8j9llK9K9M0M1Mk2k4qJ3J3j4j4j5j5ONONJ1J3j7j8oK0L7
20560C1L7J9J9J9J9j4j4j4j4NNj1j1k9k8LLMMMMkkJ4J5K0J9l2l2l8k1LL3K1Mj6j7j0j0NMj
20542bkJ3J4J6J6J5J6jj%jKKJ7J6Jl1n2l7j6jJ3K7L5J9pl8l2l1j8j8J8J8LKmnmmJ2J2J3J1
20523Fonk0k0j4J7M1N6L8Oppk1k0k2RJ0J1j9j9mnmlnnnnj3j2k9k8j0rK2K2L6L6L5L5QPk4k5
20504B9j5j5J%rj0rj0lmJ7L2K6nj9j8k0k1pK5L7L7L8L9K5Rj6m6n6k3RRrj0l8m0j8J3K6K5p
20486c1l8l9pMMONJ1J1J0J1J5J6K8K9J9j3n4l9J3M4M5J4JKj%JJJJkllll1l0l1l1j1j0j1j1
$$ y = [430, 448, 430, 381, 326, 271, 245, 220, 224, 228, 248, 269, 294, 319, 329, 338, 347, 356, 334, 311, 281, 251, 237, 223, 207, 191, 174, 158, 148, 138, 144, 150, 159, 168, 145, 122, 93, 65, 68, 71, 67, 64, 60, 57, 50, 44, 37, 31, 24, 18, 11, 5, 19, 33, 48, 62, 81, 100, 104, 81, 50, 34, 40, 46, 56, 67, 78, 88, 87, 85, 84, 82, 90, 97, 105, 112, 132, 152, 186, 221, 251, 255, 231, 191, 161, 147, 139, 132, 109, 86, 63, 40, 27, 15, 3, -9, -27, -45, -63, -82, -85, -88, -59, -30, 10, 51, 55, 33, 9, 1, 14, 27, 13, -1, -16, -31, -25, -20, -14, -9, 2, 15, -2, -20, -26, -6, 31, 68, 87, 106, 125, 144, 130, 116, 102, 88, 93, 98, 87, 76, 47, 19, 22, 25, 29, 33, 37, 41, 39, 37, 51, 66, 86, 105, 73, 41, 3, -18, -15, 18, 39, 43, 27, 10, 0, -10, -5, -1, -2, -4, 9, 23, 39, 55, 70, 86, 85, 84, 84, 83, 85, 87, 104, 120, 121, 90, 38, 1, -15, -16, -3, 24, 59, 78, 71, 33, 1, -30, -48, -66, -48, -30, -27, -25, -29, -34, -38, -42, -30, -18, -5, 6, 0, -5, -25, -45, -59, -42, -1, 55, 93, 99, 92, 85, 64, 44, 22, 31, 41, 52, 33, 14, 10, 5, 1, -2, -7, -12, -17, -22, -35, -47, -76, -104, -114, -123, -101, -79, -43, -7, 28, 63, 71, 78, 54, 29, 14, -1, 0, 0, -9, -19, -28, -38, -41, -45, -28, 4, 30, 25, 6, -12, -32, -53, -60, -35, 2, 39, 77, 116, 141, 150, 134, 88, 32, 9, 18, 27, 18, 8, -30, -70, -88, -75, -49, -24, -31, -69, -108, -115, -111, -107, -101, -96, -85, -74, -64, -53, -38, -22, 6, 35, 54, 41, -13, -52, -39, 5, 50, 64, 65, 67, 66, 66, 67, 68, 69, 70, 68, 65, 62, 59, 28, -2, -33, -64, -75, -85, -96, -107]
20467a07j4j4J6J6Qrj7J4K6K6Pr%L1N1L7J3kNNj2j2j2j2k3k1k3k2JJJKJKLLK6M2N1J9rqj1
20449G0j0l1k9j5j5KJL3L3MLLMQRRRool5l6j6J0L5K0qqrqk1k1k1k1J8J8L3L4M1M1J0RJJJ7
20430A60J7j3j3j3j3nnk1k1m4m2k7JL4M9M1J5%j6l8l8l6%L0L0pk3j2J3L8N4N4L8Lk4j2j2l1
20413A11n7o2k6J3J4J3J5L0J4j3m0l0nJ1J0j2j1k6k5%K6M4M2L5L5MLk8k8m2m2l3qJ0Rj5j6
20397h0j6j6NMK0K1M3M3K8JoRJ4j3l1l0J9J9kj8k2KL3L3LLj4j3j2j2NL1L0Mj5l1l3j5LMMN
20379GpoM6M6K5K5K6K5k0k0k0j9j4j3ML0M4M5J4J4j7j7j7j7l7l7nonnnnK2K3Ok0m7m6l1oN
20361c5NPPJ7J9J9J8J9J8J9J8rrrj0J0RRRQROPj1l8l8j1lmkkLLk9k9J%%%llmmK2K3Ok0j3j3
20340hj3j3rJ8M5O1M8K2J4kj6l1l7j2J2J3j8j8J7J6J7J6PPOPnnmnnnnmPPPPrj0rj0k8k9LL
$$ y = [-107, -121, -135, -119, -103, -95, -104, -121, -107, -81, -55, -48, -57, -57, -26, 25, 62, 75, 73, 78, 83, 71, 59, 47, 35, 12, -9, -32, -54, -53, -52, -51, -49, -48, -46, -43, -40, -14, 28, 79, 98, 89, 81, 70, 60, 29, 0, -15, -30, -28, -27, 6, 39, 43, 46, 49, 53, 61, 70, 79, 88, 82, 76, 41, 5, -11, -1, 34, 54, 46, 38, 29, 21, 0, -21, -42, -63, -45, -27, 6, 40, 81, 122, 132, 141, 142, 143, 160, 177, 164, 151, 138, 125, 120, 115, 94, 73, 29, -13, -40, -39, -5, 44, 85, 100, 100, 84, 46, 8, -28, -28, 2, 32, 25, 2, -10, 3, 41, 95, 149, 187, 190, 166, 154, 142, 111, 54, -8, -34, -21, -7, 6, 21, 51, 65, 52, 12, -18, -23, -12, -2, -14, -25, -51, -76, -76, -50, -6, 36, 71, 106, 110, 113, 85, 57, 15, -27, -60, -68, -58, -49, -64, -80, -96, -112, -107, -103, -83, -62, -19, 24, 52, 53, 47, 56, 70, 57, 26, -4, 15, 34, 32, 14, -8, -6, 27, 60, 63, 66, 52, 39, 27, 15, 20, 51, 81, 85, 70, 39, 6, -9, -6, -2, 2, 7, 0, -6, 40, 86, 111, 136, 162, 187, 167, 147, 127, 108, 94, 81, 85, 115, 159, 204, 218, 232, 215, 198, 181, 164, 127, 90, 85, 79, 74, 69, 64, 59, 81, 104, 110, 90, 43, -3, -34, -40, -35, -30, -23, -16, 1, 20, 39, 57, 76, 94, 113, 131, 122, 113, 104, 94, 104, 113, 122, 131, 139, 148, 154, 161, 150, 112, 74, 63, 60, 56, 54, 52, 55, 58, 29, 0, 1, 1, 1, 1, -2, -5, -9, -13, 9, 32, 38, 18, 5, -8, -21, -34, -43, -25, 20, 81, 129, 151, 165, 163, 147, 116, 79, 67, 79, 92, 74, 56, 73, 89, 106, 122, 129, 136, 142, 149, 144, 139, 135, 130, 125, 120, 115, 111, 118, 125, 132, 139, 130, 120, 111, 101, 73, 44, 47, 50]
20320E0LMLMononPQQQj1j1j1j0j6j4J4J4%k7k0nJ6J4J7J6ooj3LJ6M3M5J7onqpkkK9K8j0l7
20300A18l1j5%%JJpqppk1k1j9k1KLKKj1j1j1j1k3k2l7j0K0L7L8K2LMKLL3L3L2L2kj8OL3K7
20282A41J1kj7n2n3l9qJ5J5J5J5Nk7rrj6j6j7j7J1J0M3M1N5N4KJJ1J0J1J0j7j6j7j6rrqrj6
20264G7j7j6j6rrrpJ4J5J5J5j0j1j0j0J6J7J7J7L2L1%Jk2k1l7l8j8j7J1J2J9j3k6k7K4K3J2
20248B5k0k5NL5L6K2rppj2j1k8k6RRRRnmnmMLMMMMMMJ5J5L2Jk1k1k2k3MMNMMNMMpppqk1k2
20226c5ool7l7k0OL0L1J6J6KJL4L2M4M4qrkjkkjjj6j7k7k7K5K6MMj2j2MMLMlllmj2j3J9J9
20206E2MMj2j2k9k9KKJ1J1J1J1K1K1NOOOm7m5m3m3j0j1K1K2K1K2J6J5j3j4QL3L4QooK3K2O
20188A04k0k1OJ9J8j2j1J4J4kk9l5l6l4l6k0PK3K3LLLLllj8j9nmK6K7K5K6noMNMMNMMNj9j9
$$ y = [50, 53, 57, 60, 64, 58, 53, 47, 42, 49, 57, 65, 73, 62, 51, 40, 30, 14, 0, 14, 28, 28, 1, -19, -24, -8, 6, 23, 39, 33, 27, 14, 17, 33, 76, 121, 138, 132, 127, 119, 112, 110, 108, 137, 165, 155, 118, 87, 72, 72, 72, 73, 74, 67, 59, 52, 45, 24, 3, -16, -37, -35, -32, -30, -28, -39, -50, -61, -72, -95, -117, -154, -164, -144, -107, -69, -47, -44, -40, -38, -35, -2, 31, 63, 95, 93, 75, 81, 114, 141, 152, 150, 133, 81, 28, -11, -19, -4, 11, 26, 41, 46, 19, 10, 1, -15, -31, -48, -65, -54, -44, -1, 40, 95, 149, 151, 152, 163, 173, 184, 194, 177, 161, 144, 128, 119, 110, 102, 93, 77, 60, 44, 28, 19, 10, 1, -6, 8, 23, 38, 53, 43, 32, 22, 12, 28, 45, 62, 79, 111, 142, 142, 143, 121, 100, 63, 25, 7, -10, 1, 13, 32, 19, -7, -34, -10, 13, 25, 5, -20, -15, 20, 56, 78, 69, 62, 55, 43, 32, 4, -22, -13, -4, 5, 14, 9, 5, 0, -4, 0, 3, 7, 11, 15, 19, 23, 27, 42, 57, 89, 90, 69, 48, 26, 3, 7, 11, 16, 20, 24, 29, 33, 37, 30, 23, 16, 8, -13, -35, -41, -47, -84, -121, -141, -135, -105, -74, -58, -42, -40, -39, -5, 27, 71, 115, 107, 98, 96, 95, 93, 91, 90, 89, 73, 56, 29, 2, 27, 53, 57, 61, 49, 37, 41, 45, 48, 52, 49, 46, 43, 39, 27, 14, 33, 52, 56, 60, 48, 36, 7, -22, -20, -18, -7, 4, 15, 26, 47, 68, 73, 79, 85, 91, 44, -1, -44, -87, -97, -108, -87, -65, -44, -22, -6, 9, -4, -18, -10, 23, 57, 65, 59, 53, 76, 98, 104, 84, 63, 69, 88, 106, 94, 83, 97, 111, 109, 80, 45, 9, -25, -61, -81, -74, -51, -28, -25, -22, -19, -16, -19, -22, -40, -59, -64, -68, -42, -15, 10, 36, 31, 25, 29, 34, 38, 42, 47, 51, 55, 60, 41, 22]
20168B2J2J3J1J2J1J1LKk8k8j9lOk5m1k6onJ7J8J7J7MLKMLLMLQRQQ%jm3n7m9j8mnK7K6K7K6
20148b1J5J4J5J4%%j%K9K8llrrrj0j9j9j8j9J0J0RRJ9J8J8J9mlnmm0n4l2jMMOOpqK4K5K7K8
20128E3K6K6Kk9m3m3j2j2j2j2lkK8K8J5j4l0k9K4K3K3K4NNMNJ9Lk2n2n1l5k4pL8L8L9L7L0
20112F3L0kkj9j8j8j9ppopM2M3M1M1K5j3n4o9m5rL1M9M2J5jjj8j8j8j9J1J1k1k1k5k4k5k5
20095f7J2J3J3J2K8K9L0K9%%%%k7k7k7k6qrqr%%j%j%%jK3K2K3K3nnK7K7QRk3k4k3k3RQJ7J6
20075F4j5j5rrqqRRRJ0j5j4j3j5lmlmK0J9K0K1K6K7K5K5K9Kj4j5k8k9k8k8l5l4llJ0J0J1R
20057CMNk1k2llJ3J2MLj3j2J2J2J1J2j2j2j3j2j6j6j7j6qqqqJ6J7J6J7RQppj4j3J4J3J6J6
20038b8%%j9j8QQqqqqQPQPPPOPK8L0J4J4nol2l1j7j8RQK6K5jjl0l1l0k9JL3M1M0K8K8JKj7
$$ y = [22, 34, 47, 58, 70, 81, 92, 95, 97, 69, 41, 22, 19, 25, 0, -41, -67, -73, -78, -61, -43, -26, -9, -5, -2, 0, 4, 7, 10, 14, 17, 25, 34, 42, 50, 50, 49, 6, -51, -100, -118, -122, -127, -100, -74, -47, -21, -6, 8, 23, 37, 37, 37, 36, 36, 65, 93, 90, 87, 78, 69, 60, 50, 31, 12, -6, -25, -15, -5, 4, 13, 32, 50, 68, 87, 83, 80, 75, 71, 31, -23, -55, -56, -52, -48, -42, -36, -43, -51, -27, -2, 25, 53, 79, 105, 107, 78, 35, -8, -20, -32, -44, -56, -59, -61, -33, -5, 10, -4, -34, -63, -39, -16, 7, 31, 36, 41, 45, 50, 69, 72, 50, -2, -53, -88, -112, -119, -81, -43, -4, 33, 63, 93, 91, 89, 70, 52, 34, 15, 8, 1, -5, -12, 30, 73, 114, 155, 180, 167, 113, 44, -1, -10, 21, 70, 112, 127, 126, 125, 107, 89, 71, 52, 63, 74, 53, 32, 7, -17, -42, -67, -55, -42, -29, -17, 11, 40, 70, 99, 99, 99, 99, 99, 72, 45, 18, -8, -16, -25, -33, -42, -42, -42, -43, -43, -44, -44, -44, -45, -22, 0, 23, 46, 41, 36, 63, 90, 98, 107, 84, 60, 37, 14, 23, 31, 48, 64, 49, 34, 25, 16, 8, 0, 9, 18, 27, 37, 22, 8, -5, -20, -23, -27, -30, -34, -14, 5, 25, 46, 72, 99, 124, 149, 178, 180, 166, 151, 123, 94, 66, 38, 3, -31, -34, -37, -27, -17, -6, 3, 7, 12, -9, -31, -34, -37, -24, -12, -8, -5, -18, -30, -18, -6, 5, 17, 5, -7, -20, -32, -48, -64, -81, -97, -105, -113, -121, -129, -113, -96, -80, -63, -54, -46, -53, -60, -74, -87, -73, -60, -44, -28, -28, -28, -47, -65, -57, -49, -57, -65, -73, -81, -73, -66, -58, -51, -44, -37, -31, -24, 4, 34, 48, 62, 57, 51, 19, -12, -29, -47, -38, -30, -4, 21, 20, 19, -11, -42, -72, -101, -100, -67, -26, 14, 42, 70, 71, 73, 56]
20018E6j6j6j7QQQQj6j6j4j6J5J3L3Jl1k9ooJ9J8J9K0K7K6J9j4j7j8mlRJ0RJ0j3j4j3j3pp
20000C0K4N1L7J1k0k1k0k0k1k0JKJ7J7K2K3Jk5l3j7J1K6K1Nk2k2k0k0KK9M2M1Ol1m5m6j0q
19984bNK3J3j4m4m5j3J2NMPOjjj%jjj%JKKKK0K0K0K0k5k5k6k5ooK0K0J4J5J3J4j9j7j9j8M
19964d8MMMLLLLM1M2K6K6J7J6ol2n2n1k6k7J1J2L5L6J2j5k3pPL3M2K7jk8l9k2j1j0rqLLKL
19946Cj4j5j6j5NMNMRQRQRRJ0J0k0j8k0j9j9j9j7j7RL9K4K3L2M9L7j6n6p1n0j9J9N1L6L4J0
19928C5J0J0J1j0j0j0j0j7j5J4J5kkl2l4l8l7k3RL3M9M1M1K0J9j2j2k9k7LLPPPPrj0qrJ4J4
19910A3J4J5k1k0j9k1NNL3L5K5ok0k0k5k6k6k6MMMMJ2J1J2J2%j%jj0j1ML5M9M9K0K0KKKKk0
19891A20j9J2J2K1K0j2j1l4l3l4l3J%JJl1l2k3J5L0Ml1l0j1J5L2L2K8K9J2j5k5k5k7k8K1K1
$$ y = [56, 40, 24, 7, 15, 23, 31, 39, 23, 7, -7, -23, -8, 5, 38, 39, 8, -21, -27, -33, -14, 4, 23, 43, 70, 96, 115, 101, 84, 66, 62, 59, 68, 78, 87, 97, 84, 70, 57, 44, 37, 30, 54, 105, 142, 153, 133, 112, 92, 72, 51, 31, 32, 34, 51, 68, 90, 113, 114, 89, 56, 39, 50, 76, 97, 102, 80, 58, 38, 18, 20, 49, 91, 132, 138, 107, 62, 16, 6, -2, 3, 26, 39, 25, -19, -64, -77, -65, -60, -56, -49, -43, -44, -45, -46, -46, -47, -48, -49, -49, -48, -46, -44, -42, -22, -2, 18, 38, 13, -12, -38, -63, -69, -75, -55, -35, -21, -6, 7, 21, 2, -15, -34, -52, -48, -44, -40, -36, -33, -30, -27, -24, 17, 59, 85, 111, 128, 144, 138, 106, 54, 3, -23, -50, -39, -27, 8, 44, 56, 41, 18, 11, 18, 51, 93, 120, 119, 91, 52, 30, 19, 9, 0, -8, -5, -2, 0, 3, -11, -26, -42, -57, -52, -48, -43, -39, -30, -22, -13, -5, 4, 13, 23, 33, 13, -5, -25, -44, -63, -82, -99, -116, -107, -68, -44, -21, 11, 60, 97, 81, 25, -46, -96, -115, -96, -45, -9, 25, 35, 45, 55, 66, 56, 46, 36, 26, 9, -6, 8, 23, 21, 19, -13, -47, -85, -122, -145, -136, -103, -54, -13, 28, 48, 67, 55, 43, 14, -13, -10, -7, 0, 7, 14, 21, 12, 2, -6, -15, -1, 13, 27, 42, 21, 1, -18, -39, -34, -29, 4, 39, 64, 58, 38, 18, -7, -33, -59, -85, -81, -77, -73, -69, -57, -46, -34, -22, -22, -23, -23, -24, -34, -45, -41, -6, 43, 92, 112, 132, 134, 136, 138, 140, 120, 101, 113, 125, 146, 166, 154, 143, 109, 76, 42, 9, 10, 10, 11, 12, -19, -51, -74, -59, -29, -25, -56, -86, -97, -82, -50, -18, 10, 39, 51, 36, 11, -14, -41, -69, -48, -27]
19875b7K1K0j8j9j8j9k0k0J1J2K6K5Rj8j5j6j7j7ooK6K6K1K1K0K1K3K3K3K3j%jjMMLMrj0r
19858I9j0lklkj4j4j4j4l0l2%JOOOOJ4J5J5J4K7K7nnl5l4j8RJ9J9K0K1j1j0j1j0j%j%j8j7
19839A0J4J5MMNMKKKKJ7J7j0rk7k6k6k7m5m5l6lK8M4L7L7L2L2mnl2l2j6j7OPj0rNNL1L1L9
19820E3M0J0k1k7j1J5L1L6Lj4j4j3j2j3j3qrrqRRKl0m2k7J1K8J8J8LMjjK6K5K1K0j6j7k3k3
19803C0LLJ7J7%%l0m4l8pJ3J3k2k2QQPQj4j4j5j4NMk2k2JJ%JMNM1M1N6N7J0J0J0K5L5Kpor
19783A49rl9l9jknnk1k1nmRJ1KKKKKKKKRJ0pok6k4%JL0L1L8K2j0m1l2j6oRKKj9j8k0j9mlK3
19762d0K3qqpqK2K2Mk8l1j5j6l2k4rJ9L6J7J7J8J8j8j8RM2N2K1pk3k4qJ7L4J6j6j6J5Mj1j
19745C8joooo%J%%J3J4J3J3qqqrkkkkj2j2l8l8l1l0k2J0L2L1PPQQL4L4LMj3j1j7j7j7j7oo
$$ y = [-27, -6, 14, -4, -23, -41, -60, -80, -100, -89, -77, -51, -26, -17, -35, -50, -66, -83, -100, -106, -112, -86, -60, -39, -18, 2, 23, 46, 69, 92, 115, 114, 114, 113, 112, 116, 120, 123, 127, 118, 108, 99, 89, 86, 84, 81, 79, 65, 51, 37, 23, -7, -39, -39, -38, -32, -26, -20, -14, 0, 15, 30, 44, 71, 98, 93, 88, 53, 19, 1, 10, 29, 48, 68, 89, 78, 68, 57, 47, 46, 46, 45, 45, 27, 10, 24, 39, 43, 47, 52, 56, 58, 60, 62, 64, 81, 98, 88, 79, 52, 26, 0, -27, -72, -117, -153, -156, -128, -84, -47, -10, 22, 54, 50, 45, 13, -19, -35, -52, -46, -39, -49, -58, -53, -48, -17, 14, 53, 93, 103, 82, 55, 44, 59, 90, 126, 129, 115, 101, 88, 76, 63, 50, 42, 33, 24, 16, 25, 34, 36, 6, -36, -63, -52, -24, -6, 12, 15, 19, 18, 17, 43, 68, 89, 109, 93, 76, 53, 30, 33, 36, 53, 70, 70, 70, 40, -4, -42, -49, -36, -23, -45, -67, -59, -51, -44, -36, -50, -64, -79, -93, -88, -84, -106, -128, -127, -126, -126, -125, -121, -116, -75, -34, 22, 79, 89, 99, 109, 134, 169, 171, 164, 158, 149, 140, 101, 62, 61, 59, 54, 49, 28, 7, 2, -2, 7, 18, 20, 22, 24, 26, 28, 30, 32, 34, 43, 53, 46, 40, 14, -10, -10, -9, 21, 52, 90, 112, 102, 61, 29, 13, 7, 16, 18, 20, 1, -17, -37, -56, -60, -63, -40, -17, -25, -33, -40, -48, -26, -4, 0, -28, -59, -74, -90, -122, -146, -155, -136, -100, -83, -66, -48, -30, -48, -66, -57, -15, 37, 58, 51, 28, 4, -4, 13, 47, 63, 47, 31, 46, 50, 39, 38, 37, 31, 25, 19, 13, 13, 14, 14, 14, 27, 41, 54, 67, 59, 51, 43, 34, 32, 30, 28, 26, 14, 2, -36, -74, -105, -135, -157, -147, -115, -84, -77, -70, -62, -54, -20, 14, 17, 21, 8, -3, -20, -37, -54, -71, -77, -83]
19724h3l8l8l2l3LL4P0O9L7N%%jkK1K2K1K0K1j0k4k4rrrrQQQPk4k3k4k4%%j%J0RJ0RJ7J7J7
19705B6J8j6j6j5j6LLLKJ7J7J7J8RJ0RRj6j6j5j6j%l1l1k4k5QPK7K8K6K7jjj%j5j4j4j3J3
19687@J3J4J3ONONj1j1j1j2K2K1J9J9ml5m8m6j8J5K9K7ONONMLMLLKKKk4k3j0K2J4J5j6j5j4
19668A2j4j4j4j9j9j9k0L1L1L1L0k1k2k1k1j3J3K9L0K5K6K6K6k2k2k2k2k0k1j9k0L0M5K7j0
19653A7l5rK6K5k1j9%J6Mk1k1OJ3J3J3J5kkl2l4qqqpjj%jj5j5KK9M2M1K6jk7m5k0ORJ0J1J1
19633a8%%%%opppPOOPklkkJ9J9J9K0J9J9j3j3m3m2m3m3ppK4K5L6L6J9pk4k5k6k7JJ%JJ2J2
19614f6J2J2MMMMj9k0j9j9k4k4QQK0K0K1K0K8K8K8K8K5K4qpj0rrrook2k1ppk2m9m7l2LJ9M1
19595a01N6N7M2J2J3J0J0k4n1m2k8j3LmnJ5J5J5J4J6J7J7J7K3K2K1nk4k5OOj4j3j3j3NOON
$$ y = [-83, -121, -159, -191, -224, -221, -187, -117, -48, -11, -6, -6, -6, -7, -9, 12, 34, 55, 75, 96, 86, 62, 38, 29, 20, 11, 2, 10, 18, 26, 33, 9, -14, -38, -62, -62, -62, -63, -63, -53, -44, -34, -25, -8, 9, 26, 44, 28, 12, -3, -19, -16, -13, -10, -8, 9, 26, 43, 61, 70, 80, 89, 98, 82, 66, 51, 35, 34, 34, 3, -28, -52, -77, -69, -62, -35, -7, 19, 46, 45, 44, 43, 43, 28, 14, 0, -13, 0, 13, 27, 40, 46, 51, 57, 62, 51, 40, 29, 17, 39, 60, 79, 98, 94, 59, 11, -35, -53, -38, -9, 18, 24, 29, 35, 40, 44, 47, 51, 54, 57, 59, 61, 63, 39, 16, 6, 28, 42, 57, 41, 26, 12, -2, -16, -30, -49, -68, -87, -107, -76, -45, -14, 16, -5, -27, -48, -69, -82, -69, -40, -10, 15, 41, 67, 93, 71, 49, 27, 5, -15, -36, -55, -75, -45, 0, 27, 17, -18, -27, -1, 24, 3, -16, -16, 0, 4, -17, -38, -32, -19, -6, 7, 22, 20, 18, -14, -48, -56, -64, -72, -79, -80, -81, -81, -82, -97, -112, -110, -81, -39, 2, 28, 27, 0, -45, -65, -59, -50, -40, -29, -18, -18, -18, -18, -18, -24, -31, -38, -45, -38, -32, -26, -19, -21, -24, -26, -28, -9, 10, 29, 49, 68, 87, 74, 61, 18, -24, -67, -110, -117, -124, -100, -75, -39, -3, 16, 9, -15, -40, -66, -93, -92, -91, -91, -90, -78, -66, -54, -42, -38, -34, -30, -26, -45, -65, -84, -103, -127, -151, -143, -135, -115, -95, -74, -54, -26, 2, 30, 58, 83, 107, 99, 92, 82, 73, 64, 55, 49, 43, 21, 0, -7, -14, -36, -85, -132, -164, -161, -142, -101, -45, 12, 54, 66, 79, 89, 99, 75, 24, -18, -46, -59, -56, -60, -65, -50, -35, -20, -6, 10, 27, 44, 61, 84, 106, 127, 122, 98, 73, 79, 85, 71, 58, 45, 32, 37, 43, 49, 54]
19578E4J1J1RJ0j3k8j9QL2L1ml0k9j3PQNNj6l2l4rL2N8M3J6JJj0j1j0j1J5J4J3J3j0l7n2n0
19561b1k3J5L5N2N0J8pk3j9j8n0m8rK3M3K8pl8l6pJ0K5L6Mj6j6j7j9J3J3J1J3%jj%lmllMN
19542IMNj%jjOOrj0J2J2M1M1Mk8m1m2j4j6J%j1j1MNK3K3K3K4J5J5j6j7j8j9LJ8J2j9l2l2k7
19524e9k7k7k7K1K1K1K2j6j6j5j6LLLLK2K1K2K2L2L3JJj6j5%%qroqK0L6J5j7l7j9%%j3j4j3
19506e6j4j8j8J3J3L0L0kkmmmmj0j0K2K2K6K8K8K7%%kjj6m2k8k6ononK3K3K3K4%J%%pqpqK
19486B2Lj3J4N2N3L7J0rk4m9m8k4k4k3k4k1k1J1J0M0L9QQqrqpj7j6J5J5M1M3K6jj6j6j8j8
19469C3MMMLj4j5j5j5k0l6m1j6J6J6Kk5k0nQK3J4J5J5J5J0J0J0J0j9j9j9j9J7J6J8J8L0M6
19452E9N2K5j1k7k0k0qpqqNMMMK0K1j5m2l4rPOPPQPnmK6K6Qpj3J4L3L4J8pj5j5j7j6k1k0k1
$$ y = [54, 65, 76, 85, 95, 82, 54, 35, 43, 75, 106, 102, 72, 43, 30, 37, 45, 50, 55, 39, 7, -27, -36, -4, 54, 97, 113, 114, 115, 105, 94, 84, 73, 88, 102, 115, 128, 118, 81, 29, -21, -44, -29, 6, 58, 108, 126, 119, 96, 77, 59, 9, -39, -48, -25, 18, 46, 39, 1, -35, -42, -32, -7, 29, 33, 17, 1, -16, -35, -22, -9, 2, 15, 15, 14, 13, 13, 10, 6, 3, 0, 4, 9, 13, 18, 17, 17, 16, 15, 21, 27, 18, 8, 20, 32, 73, 114, 118, 90, 49, 7, -7, -23, -22, -22, -33, -44, -40, -35, -12, 11, 34, 58, 73, 88, 72, 55, 37, 18, 21, 39, 51, 32, 0, -32, -59, -86, -113, -140, -119, -98, -77, -55, -71, -87, -102, -118, -115, -112, -109, -106, -84, -63, -41, -19, 13, 46, 47, 48, 32, 17, 17, 17, 9, 0, -6, -14, 6, 42, 57, 40, 3, -16, -16, -16, -29, -43, -56, -70, -88, -106, -93, -80, -50, -20, -22, -24, -28, -32, -36, -40, -50, -60, -38, -16, 10, 38, 66, 93, 93, 93, 91, 90, 74, 32, 4, -22, -28, -33, -39, -44, -21, 2, 25, 49, 49, 50, 50, 50, 43, 35, 28, 20, 22, 25, 12, 26, 78, 131, 168, 178, 169, 145, 96, 48, 24, 0, -23, -47, -68, -89, -78, -68, -28, 11, 19, 27, 19, 10, 2, -5, -22, -38, -23, -8, 33, 76, 102, 101, 85, 69, 51, 33, 37, 41, 45, 48, 34, 19, 4, -11, -31, -67, -108, -124, -108, -92, -90, -115, -135, -140, -132, -109, -95, -80, -65, -50, -40, -30, -20, -10, -29, -48, -67, -86, -69, -53, -35, -17, 13, 59, 111, 136, 125, 98, 78, 58, 50, 43, 35, 27, 32, 36, 40, 44, 64, 85, 70, 28, -6, -15, -8, -2, 5, 12, 20, 27, 22, 18, 44, 70, 78, 71, 58, 72, 105, 139, 157, 150, 135, 120, 103, 87, 66, 46, 25]
19433B5k0J2J2J2J1K2K2j0j0k7k7k3k5LK9L0Mj2j2j4j3j0rK2K1K2K2j0rLLMLl9l7l8l9PPP
19415h1PK0K0K0J9pqpqk7k6k6k7QPQPK1K1K0K1mnmmK3K3L4J9K6N2M4K8kk9m6m5o5m9k0OJ2
19397b4J2M2M3K1j6l5j9kJ4J5%k4k3k2k3PL4J8J9RRRRK8K8K7K8KLLKk2k2k2k2qqk3k4l5l4
19379b6JKJ1J1J0J1onk0k1j5j4J2J2lmmmJ%%Jj8j9j8j8JJJJJ4J3J3J3POJj5j8QK8J1j3j4J2
19360e3J1jkjkj0rj0j0rj0j0j0L1L0L1L0K1K1nn%j%jJ7J6J6J7JJ%Jk4l9l0kK1K3lkMNK0K0
19340H8j8j8j8j8mnK0K0K0j3l0j5J5J6J6J6mmmmj0j0k5k5lkj8l4k4RNNJ1J2K7K7J1J2mnjj
19322A3K3K3Qk3m1m0j3J9L3J8j2m3k9KL7L6K3K3J2J3mlk3k4k3k3k4k4k5k4J9K0K0J9j3j3j1
19306g4j1JL2M2M0J5J5j2j1pqRQj1j0OL8N0J7j0j0ppppj1j2j1j2j1j2j1j1QPPQJ8J9LLk1k1
$$ y = [25, 5, 17, 29, 41, 52, 74, 96, 86, 76, 49, 22, -1, -26, -23, 6, 36, 40, 28, 16, 2, -11, -21, -30, -8, 13, 35, 57, 47, 38, 41, 44, 48, 51, 12, -25, -63, -102, -95, -88, -81, -74, -54, -34, -14, 5, -2, -10, -17, -25, -52, -78, -104, -131, -123, -116, -108, -101, -80, -59, -39, -18, -22, -27, -31, -35, -12, 11, 45, 64, 90, 142, 186, 214, 212, 183, 137, 92, 27, -22, -42, -36, -24, -12, 30, 73, 94, 78, 43, 24, 22, 36, 51, 51, 27, 4, -18, -41, -34, 0, 18, 37, 46, 55, 64, 73, 101, 129, 156, 184, 186, 189, 192, 194, 172, 150, 128, 106, 98, 90, 67, 43, 8, -26, -25, -23, -12, -1, 9, 20, 14, 9, -11, -32, -47, -61, -49, -37, -40, -44, -48, -52, -51, -51, -51, -50, -68, -87, -105, -123, -122, -121, -120, -119, -105, -92, -79, -66, -59, -53, -52, -67, -85, -77, -49, -38, -51, -65, -53, -42, -43, -45, -46, -48, -58, -67, -77, -87, -96, -106, -116, -126, -95, -65, -34, -4, 17, 38, 33, 28, 28, 27, 27, 26, 43, 59, 75, 92, 93, 94, 94, 95, 71, 32, 2, 0, 21, 44, 41, 39, 43, 48, 68, 88, 70, 52, 34, 16, 12, 7, 27, 47, 67, 54, 24, 9, 24, 40, 56, 72, 68, 64, 60, 56, 46, 36, 11, -14, -17, -19, -37, -71, -95, -86, -81, -76, -65, -53, -26, 1, 12, 24, 20, 15, 14, 13, 36, 59, 67, 44, 3, -37, -50, -31, 2, 20, 8, -35, -64, -62, -25, 11, 34, 57, 69, 82, 78, 75, 52, 28, 5, -18, -42, -66, -91, -115, -96, -76, -56, -37, -50, -63, -74, -85, -84, -52, -10, 30, 45, 60, 48, 37, 30, 22, 31, 39, 28, 18, 24, 62, 112, 129, 119, 109, 102, 95, 88, 81, 70, 58, 47, 35, 24, 12, 1, -10, -2, 5, 12, 20, 38, 57, 60, 63, 42, 21]
19288B1J4J4kl3l2jJ8J7K0K0rrrrpqqqJj4j9OJ0J0J2J1MMk7k8k4k3QQK1K0J9J9J2j3m0n7n1
19269a42k5LJ9L1L2L3L3L8L9QQnnmnj3j3j3j3llkkK0K2j0j0j6j6j6j6KKKKK6K4ooNONNj6j4
19249ij5j4K4M9M9K3j2k7j9k0k1k0k0k1k2k1k2k1JJJJK3K3K4K3ONk6k6J3J3J3J3lkllJ1J2
19232a9j9j9PL3J7J8poopKKKKj3j3J9J8J5J4j7j7m7m7l3jJ7L3K7K6K4K5K3K3%l3l2jK3K2K5
19214H0K4OOk6k5j6j5J6J6J1J1J1J1%J%Jj0rrj0mmK7K8PPk3k3k1J0K4K4J7J8j4j5qrqql3l3
19196C3l3l2mmlmJ8J9J7J9lklkj6j7j6j5RL9K9J3j4m5l7k0QK4J6J6NNOOKKk8k9l0k9LKj5j5
19177a25j4j3j4J8L2L2JKKKL0L1JJJ7M9L9K4j3k9k1k1j2j1j1j1nnonqrrqKKj3j4J0J0k1k2
19158a15j2j1K0K0L6L7K0K0OPOOmnnnl7l8l9l8opK6K6J4J4J5J4J7J6J5J7LLLLrqQQK9K8ol8
$$ y = [21, 35, 49, 47, 14, -18, -19, -1, 16, 36, 56, 47, 38, 29, 20, 13, 5, -3, -11, -10, -24, -43, -37, -27, -17, -5, 6, 10, 14, -13, -41, -65, -88, -80, -72, -51, -31, -12, 7, 19, 6, -34, -91, -142, -167, -164, -145, -114, -82, -49, -16, 22, 61, 69, 77, 72, 67, 63, 58, 45, 32, 19, 6, 3, 0, -2, -4, 16, 38, 28, 18, 2, -14, -30, -46, -44, -42, -40, -38, -12, 12, 6, 0, 5, 11, 16, 21, 5, -9, -24, -38, -14, 35, 84, 107, 95, 68, 49, 29, 8, -12, -32, -53, -75, -96, -118, -139, -138, -137, -136, -135, -112, -89, -65, -42, -36, -31, -57, -83, -70, -57, -44, -31, -34, -36, -39, -42, -31, -19, -38, -57, -50, -17, 0, 18, 11, 5, -1, -8, -6, -4, -2, 0, -13, -26, -7, 11, 26, 40, 23, 6, -41, -88, -121, -122, -105, -72, -45, -19, 5, 30, 53, 76, 76, 43, 11, 10, 33, 55, 80, 104, 110, 116, 90, 65, 49, 34, 50, 66, 77, 88, 99, 110, 110, 111, 111, 112, 102, 93, 84, 74, 70, 66, 93, 121, 128, 135, 112, 89, 68, 78, 102, 126, 143, 161, 147, 132, 124, 115, 107, 99, 66, 33, 0, -32, -36, -40, -43, -47, -29, -10, 7, 26, 23, 21, 18, 16, 0, -17, -33, -48, -39, 0, 29, 42, 28, -17, -54, -74, -66, -42, -26, -10, -5, 0, 6, 12, 14, 16, -12, -41, -71, -100, -97, -95, -110, -125, -139, -152, -166, -148, -116, -84, -83, -81, -79, -77, -47, -16, -15, -14, 3, 52, 91, 115, 102, 73, 52, 31, 19, 8, -3, -14, -19, -24, -30, -35, -43, -52, -61, -69, -67, -65, -78, -92, -82, -72, -93, -115, -127, -138, -118, -98, -62, -25, -5, 15, 21, 28, 34, 40, 36, 31, 26, 21, -16, -54, -93, -131, -137, -144, -118, -92, -78, -64, -49, -35, -18, -2, 13, 30, 33, 36, 39, 42, 33, 25, 33, 41, 70, 98, 92, 54]
19139E4k7k7MLPPPPJ2J3J2J2JKJ5J5Nk7m1m0n1n1j7J5J0J0J1J2J9J9j3j2L6L8K4qk4k3k4k5
19122d0qqqqL6L6MNJ%j3j3J3M4J5j7j9QL2J5j3j4j4j5j0rrj0l8l8%K6J6J5J7J7j3j2j3j3K
19104e3JJJrj0j0rJ2J2K9K8K2K4qrj2j1LNlJ3J8pl1l1kjj9j9mlJ2J2J2J2j5j5j5j5J5J4J4
19086e1J5rrPL3N0L5Kj4kkllrrrrPOPP%JNK2K3ml1m6m8l4nK1L1L0J7J6j1j1k6k7OPK2K1J8
19066C7J8KJk4k5k3k5jjL1L0NNj1j1k4k5k5k5NNNNonK7K7K7K7K7K7LLqQQk4l7l6j6j5J6J7
19047aK4K6K4K3Ok5j7jkkJ2M4M7L2Qk4m0m0n9k8j2j4j1j2j1j2rj0KL3K5RQPQPl2l2jjONNN
19028c0RRRRK7K7nnj2j1j1j1K7M2N0J9j6l1k5k5j7j7J5M6K9k4m4m2j4J8Ppj8l5m3j1L2M8K7
19011dmmmonJ0J1J0J0POOOJ%KKnK1L7L7j0l6k1k1k0k1j9k0j8j8j8j9nnK7K7L7L7K7j1l2l4
$$ y = [54, 27, 0, 4, 7, 14, 21, 28, 35, 47, 60, 72, 84, 85, 87, 102, 117, 122, 95, 54, 14, -37, -88, -105, -90, -80, -70, -59, -47, -28, -9, -22, -34, 2, 40, 64, 56, 32, 9, -15, -40, -48, -56, -64, -72, -36, 0, 4, 9, 10, 10, -3, -16, -3, 41, 56, 39, 20, 28, 60, 75, 62, 48, 34, 19, 9, 0, -9, -19, -57, -95, -95, -69, -53, -38, -21, -4, -17, -29, -42, -55, -53, -52, -51, -50, -59, -69, -79, -88, -76, -64, -35, -7, 15, 39, 31, 22, 10, -1, 2, 7, 4, 17, 35, 28, -3, -34, -36, -37, -56, -75, -79, -82, -70, -58, -46, -34, -49, -64, -79, -94, -79, -65, -51, -36, -45, -54, -47, -14, 36, 71, 73, 59, 57, 55, 52, 49, 40, 31, 22, 13, 20, 26, 33, 40, 40, 41, 46, 68, 91, 87, 56, 10, -38, -72, -77, -56, -25, 5, 22, 38, 27, 16, -10, -37, -31, -24, -2, 19, 37, 55, 57, 58, 34, 9, -14, -39, -40, -41, -10, 20, 25, 30, 19, 8, -16, -41, -66, -91, -86, -81, -76, -71, -77, -82, -55, -28, -1, 26, 53, 80, 83, 86, 78, 86, 94, 70, 33, -3, -19, -34, -18, -1, 23, 49, 73, 96, 102, 77, 60, 59, 57, 55, 67, 111, 158, 190, 198, 174, 134, 94, 35, 7, -5, -19, -30, -42, -53, -65, -74, -84, -82, -49, -24, -15, -7, 0, 8, 15, -17, -49, -50, -51, -45, -40, -35, -30, -21, -12, -3, 6, 33, 60, 55, 50, 38, 27, 16, 5, 32, 74, 124, 143, 127, 96, 71, 46, 29, 12, 27, 73, 102, 78, 34, -8, -22, -4, 3, -4, -22, -57, -100, -111, -79, -31, -4, -8, -12, -16, -22, -27, -17, -6, 4, 14, 21, 27, 33, 39, 40, 40, 42, 44, 39, 60, 97, 134, 124, 88, 67, 46, 26, 5, -14, -34, -52, -70, -88, -107, -112, -117, -90, -63, -26, 11, 38, 27, -5, -39]
18993c9l6l6NNMNl4l5J7J7J7JoK2K4K4K5K5K0J9j2j2k3k3k4k4k8k9j1J6L6N3M2M4L9J3lmj8
18976G6j8j7j7J7L4Pj9k6k6l4j9J5M0M1J6j1j0j2j2j2j2j1j2J8J7J8J8j1j1j0rJ4M1L4J8M
18960A19j2k5m0k6Kok0j3j2J9J7MNLLk8m5n0k4K5M0L4L2J1J0J1J1m1l9m0m0qqK4K4J2J2J2
18944d7J2j0j0j0j0J8J8J7J8L5L5MMppppJ0J0J0Rj0j0j1j0mnK8K7J1J2J1J1J0Rk3k2k7k7M
18926E9NRQRQONMMKk8k9LK1K1qrKJKJOPOOl1l2l1l1k5k5j1K1M6M8L6Lj9k0J0J0LLMLKJJKJ
18905I0JKJj7j7j8j7k7k9k6k7lK9M3M2M5M5J3J3rqrrnmnnnnl7l8m9n1LL5K3rJ1J1K6K7K7K6
18886H4J0RRRj3j2j3j2k2k1pK5L7L7j4j4j1j1j1j1k0k0j9k1k5k6OOL2L1kl3k9LJ4J5mnmnJ1
18868d7J0J1J1j6j5J7J6JJJJLLKKk8k9k9k9mlmlj3j3J8J9M6M5M5M6llkll2l1l1l2j6j7j6j6
$$ y = [-39, -75, -111, -106, -101, -97, -92, -126, -161, -144, -127, -110, -109, -115, -93, -69, -45, -20, 5, 25, 44, 32, 20, -3, -26, -50, -74, -102, -131, -142, -126, -90, -37, 5, 49, 88, 101, 98, 94, 76, 58, 41, 24, 41, 75, 82, 63, 37, 11, -23, -42, -27, 13, 54, 70, 59, 49, 37, 25, 13, 1, -10, -22, -4, 13, 31, 49, 38, 27, 17, 8, 22, 63, 97, 115, 119, 107, 82, 42, 16, 18, 12, -8, -21, -33, -14, 3, 7, 12, 15, 18, -10, -55, -105, -129, -104, -64, -30, 2, 13, 23, 34, 45, 4, -35, -75, -115, -123, -131, -107, -83, -71, -59, -47, -35, -45, -55, -65, -75, -57, -39, -22, -4, 31, 66, 70, 74, 67, 60, 53, 46, 56, 66, 76, 85, 75, 65, 54, 44, 40, 35, 63, 90, 101, 113, 124, 135, 145, 154, 131, 109, 82, 55, 59, 64, 73, 81, 90, 98, 104, 109, 113, 117, 119, 91, 62, 65, 86, 107, 99, 90, 92, 93, 95, 96, 102, 109, 115, 121, 90, 58, 27, -4, -29, -54, -65, -44, 2, 50, 86, 89, 70, 50, 60, 70, 73, 76, 80, 83, 85, 86, 87, 89, 90, 91, 93, 94, 77, 60, 42, 25, -2, -31, -57, -84, -87, -58, -15, 27, 72, 117, 130, 143, 134, 126, 117, 108, 103, 99, 94, 89, 84, 79, 42, 4, -45, -96, -93, -58, -35, -44, -33, -22, 4, 31, 58, 84, 94, 103, 112, 121, 108, 96, 83, 71, 49, 28, 21, 46, 83, 120, 106, 92, 81, 70, 59, 48, 28, 8, -11, -32, -57, -83, -77, -71, -39, -8, -10, -43, -72, -69, -55, -40, -44, -49, -53, -58, -47, -37, -26, -15, -31, -46, -29, -13, -12, -11, -10, -9, -6, -3, -1, 1, -27, -56, -85, -114, -118, -121, -125, -128, -141, -154, -136, -117, -71, -26, 19, 65, 62, 59, 57, 54, 22, -9, -40, -72, -88, -105, -121, -137]
18850a37J4J5J5J5j1j1K1K1J9K0J9J9J6J6j6j6k3k4k2k2j4J7N2N2nnmnMLMLmmnmNOONMMMM
18831E1rql5l5m7m7j5J1K0Nj1j1J0J0J1J2J6M3L5K1LMKKnnJ1J1ONl1l0qqJ6J7J5j2m1m3k5
18813h9JK3K4J8J8qqj6j7K1K0J3J2klj4j4K1K2J8J7KJk8k8k6k8k6k6nK2K4QpqPPOPMLk2k1
18794g7nK1L2J6J0K6N2N1M4J8jk6l5l4l7l6l7l7J0K6J4j3k1olmklL2L0L2L1jjj7l3l2pK4M0
18777D1K9Lk0l5k9j4NK0J5J5JJqrrqj8j7j8j8KJJJJ5J4J5J4qrrrMML0K9K3K3mml4l3j8j8J5
18757b8J5L8M0Ok1k1k2nlJ0J1K4K3QQj8j7j8j8%%%%MLMMOPrql6l6j4J2J9K0onoppoqrqqK7
18737e5K8K7K7j3j2j1j2j4j3j4j3K3K3K2K1J5kk4m9n8m1j9PK3K3K5K4M6M4J4J4J6J6J6J6J3
18721A33J4j9j8k9k8k9k7LLNNmJ1J8rm3m5l5JL0L0JJJ6J6J6J7poookkklK6K6K6K6J3J3J3J3
$$ y = [-137, -123, -108, -93, -78, -89, -100, -79, -58, -39, -19, 0, 19, 35, 51, 35, 19, -4, -28, -50, -72, -86, -69, -17, 35, 30, 25, 21, 16, 20, 23, 27, 30, 26, 22, 17, 13, 18, 24, 30, 35, 39, 43, 47, 51, 42, 34, -1, -36, -83, -130, -145, -134, -114, -109, -120, -131, -121, -111, -100, -88, -72, -29, 6, 27, 30, 34, 36, 38, 33, 28, 39, 50, 56, 61, 30, 0, -8, -16, 0, 17, 32, 20, -21, -64, -89, -88, -65, -41, -23, -5, -13, -21, -37, -54, -33, -13, 0, 12, 10, 7, -7, -21, 0, 22, 40, 57, 59, 60, 32, 4, -22, -50, -76, -102, -107, -85, -61, -53, -60, -68, -61, -54, -48, -41, -37, -34, -56, -77, -82, -61, -29, -13, -3, 23, 75, 126, 170, 188, 187, 161, 126, 92, 55, 19, -18, -55, -45, -19, -5, -18, -39, -45, -48, -52, -54, -57, -25, 5, 37, 68, 67, 66, 49, 16, -16, -23, 1, 41, 70, 73, 53, 18, -11, -25, -20, 0, 15, 30, 31, 32, 24, 15, 6, -2, -20, -37, -55, -73, -71, -70, -69, -68, -53, -39, -24, -10, -18, -27, -36, -45, -41, -37, -7, 22, 45, 68, 64, 60, 26, -7, -25, -43, -28, -13, 25, 65, 71, 50, 29, 7, 2, -1, 9, 20, 44, 67, 75, 83, 65, 48, 30, 12, 12, 12, 12, 12, 16, 19, 23, 27, 33, 40, 31, 23, -13, -49, -63, -51, -32, -12, -18, -23, -29, -36, -43, -49, -57, -66, -74, -82, -55, -27, 0, 27, 14, 2, -9, -21, -35, -48, -62, -75, -52, -29, -7, 14, 29, 27, 3, -46, -104, -145, -164, -157, -134, -111, -86, -62, -16, 28, 42, 56, 72, 88, 104, 120, 133, 147, 128, 110, 81, 53, 24, -3, 0, 3, 8, 13, 9, 20, 38, 29, -14, -59, -94, -93, -63, -33, -32, -31, -15, 1, 17, 34, 27, 21, 15, 9, 7, 5, 3, 0, 26, 52, 78, 104, 117, 130, 143, 156]
18702A56lklkk6k6k6k7nnonJ6J6j5j5KLLKk3k2k2k1K0M5M0K4kj8rj0k2k1k1k0k5KL0M4J4j3
18684BLLjkjjJ3J3j9j8J1J2J2J3j1j1j1rJ5J6j5n1o2m6j2MK7M3L5L6L1L2k0k0nnk5m1k4QM0
18666d1M1Nk4l9l9MMNMK6K6J4j7qK4MMJ8K0J9J9j9j8J3J2j2j3j2j2jJ4K3ql5l3l7l6RRRRr
18648g8j0rj0K3K3K3K2K7K7J4j8n3n4k5k4k6k5j2K0K5K5K7K7j0j1m0m0k3RM4M4K0K1j1j1j8
18633h7j7J4J4K5K5opJ%J8j3l2l2l5l4rrrrj3j3K2N4N1N2N2N4K8K9Mj2m5p6p6m5mJ1NNJ9K0
18615h0J9K0K7K7K8K7J3J4LJ8J4j8l6l6mmlmk7k7k8k7j8j8J9K0L3L4mmjkJ4J3kjj7j8KJJJ
18597c1%%%%J5J5J4J5mlmlNNNNj4j3j2j4MMLMj9j8l3l3j5J5L6N2M9L5J5j7k8k8l0l0j3j3j2
18578i1j3j5j5K1K2M5M5N1L5Rk4j5%J7J7J6J6J5j7k4k3QL9L5L6J6j6j5J6M3M3j5m6n4k3ML
$$ y = [156, 153, 151, 148, 146, 120, 94, 68, 41, 36, 31, 25, 20, 36, 52, 37, 22, 24, 27, 30, 32, 9, -13, -35, -56, -36, 9, 49, 73, 71, 53, 44, 34, 12, -9, -30, -50, -75, -73, -43, 1, 15, 2, 5, 8, 7, 5, 4, 3, 16, 29, 10, -8, 3, 15, 27, 40, 29, 18, 7, -2, 13, 29, 14, -37, -99, -145, -157, -153, -126, -83, -48, -12, 19, 51, 31, 11, 6, 1, -24, -65, -89, -81, -41, 0, 5, -19, -58, -97, -93, -89, -84, -80, -54, -28, -14, -31, -39, -15, -11, -7, 11, 31, 50, 69, 50, 32, 45, 57, 45, 32, 20, 8, 7, 21, 44, 36, 1, -32, -69, -105, -96, -87, -78, -69, -78, -88, -97, -107, -84, -61, -38, -16, 11, 38, 52, 34, -19, -73, -98, -122, -148, -173, -185, -165, -140, -115, -88, -61, -71, -82, -122, -162, -185, -176, -132, -88, -68, -47, -58, -69, -87, -104, -90, -76, -51, -26, -32, -39, -38, -38, -20, -33, -65, -97, -132, -166, -175, -184, -193, -202, -215, -228, -206, -152, -101, -49, 3, 57, 85, 114, 118, 106, 61, -15, -91, -136, -140, -129, -124, -119, -100, -80, -61, -41, -14, 13, 41, 68, 81, 95, 98, 116, 130, 112, 76, 40, 36, 32, 29, 25, -2, -29, -57, -84, -102, -120, -101, -81, -48, -14, -18, -22, -23, -25, -11, 2, 0, -1, -18, -36, -34, -33, -32, -31, -31, -31, -31, -31, -16, -1, 13, 28, 24, 21, 17, 14, 19, 24, 29, 34, 20, 7, -5, -19, -15, -11, -8, -4, -23, -41, -74, -107, -122, -107, -71, -19, 30, 65, 80, 63, 35, 7, -23, -53, -66, -79, -91, -104, -119, -134, -113, -91, -46, -1, 50, 85, 94, 70, 55, 55, 72, 89, 105, 121, 136, 119, 95, 72, 80, 119, 154, 190, 206, 190, 175, 191, 234, 277, 262, 216, 162, 139, 143, 146]
18562A46Ok7l5l5j7j8l1l2k3MK6K6K9L0LLopMj2k0PL8L8K4K3j4j4k0j9J8J7j3j3j4j3LLKL
18545G0j5j6j6j5rrj0rKJJKpoK5N1N8M2J0j7k5k4k5k6j6j7j5j6RQRPnpooJ6J5Ok0l1nK5M1
18525B5L1Mj7j7pqpomlllJ0RJ0J0j7j5j6j7j5j6%%mmQL4N8N9L8J2%Jjjk2k2k2k2K2K1K2K1
18506A26j8j8j8j8k5k5k5k5lmllJ3J4j8j8kkkkK5K5N7N7L3L3JJj3k9l6rJ3lk4k4j%jjnnK6
18488D4K6L0K9k3k3j9j9j8j9l5l7lmK3M0M3J8k1l5l7k1j2LK7K7J3J1J3J3K0J9Mk2l2j6ONk3
18471ek3qJ8K4Qj2j2MML2L3K0j7m7m7j0J7J0nJKjkj0l7l8j1J4kk3k3J0J0J0J1M6M6K7Kk5m2
18453e1l4l5j6j6J6J6N0N1M6M7J7l6n6n6l8pjJ5L6L7K2pl1l1j9J2K8K9K9L1LMLLk4k4k3k4
18437c4qqK4K4%%j%L1L3JJj1j0j1j0k3k4k3k4JKJ5M7O2O3L0kj9j9k1k0j9j8j8j7J3J4j7j6
$$ y = [146, 152, 125, 90, 55, 38, 20, -11, -43, -66, -62, -36, -10, 19, 49, 52, 55, 49, 42, 46, 34, 14, 21, 59, 97, 121, 144, 130, 116, 96, 77, 95, 112, 99, 86, 72, 59, 62, 65, 67, 70, 55, 39, 23, 8, -1, -10, -20, -29, -27, -26, -25, -23, -30, -36, -11, 40, 98, 140, 150, 133, 108, 84, 59, 33, 17, 0, -15, -31, -22, -14, -5, 2, -3, -10, -16, -22, -6, 9, 15, -5, -36, -41, -16, 25, 56, 60, 43, 26, 19, 11, 4, -2, -6, -9, -12, -15, -5, 4, 14, 24, 7, -8, -24, -41, -56, -72, -72, -72, -76, -80, -72, -38, 20, 79, 117, 129, 129, 130, 129, 128, 106, 84, 62, 40, 62, 83, 105, 126, 108, 90, 72, 54, 29, 4, -21, -46, -49, -53, -56, -59, -46, -32, -50, -68, -70, -72, -74, -76, -51, -26, 31, 88, 121, 154, 155, 156, 143, 114, 78, 69, 82, 79, 55, 31, 30, 30, 29, 28, 23, 18, 44, 70, 100, 129, 106, 83, 64, 45, 27, 8, -27, -64, -67, -71, -48, -8, 35, 53, 32, -3, -40, -61, -73, -70, -43, -16, -3, 8, 21, 34, 54, 73, 77, 55, 23, 7, 13, 18, -5, -28, -36, -18, 6, 14, 2, -10, -6, -2, 30, 63, 83, 66, 19, -28, -38, -21, -11, -16, -15, -13, -14, -16, -26, -63, -101, -112, -98, -100, -123, -146, -136, -126, -116, -105, -59, -13, 14, 16, -9, -51, -85, -120, -136, -152, -136, -120, -70, -19, 27, 74, 91, 55, -1, -57, -95, -102, -103, -88, -52, -15, 7, 0, -31, -62, -81, -69, -41, -12, 17, 48, 51, 55, 58, 61, 37, 13, -10, -34, -42, -50, -26, -2, -2, -2, -3, -3, 28, 61, 62, 63, 52, 42, 31, 21, -2, -26, -49, -73, -72, -70, -55, -8, 54, 117, 147, 145, 126, 107, 86, 66, 47, 29, 11, -6, 7, 21, 4, -12]
18420a2l6l6k2RL2L2KKkkkloppoj5j4j5j5J3J3J3J3J7J7J6J7K0K0K1K0J0Rk2k3lmmlj6j5j5
18401ij6k1k2K1L6K5pj8j9%%%%kkkkL4L3M1K5Lk4m1m0l2l1%%QPL8L6jk7k8jK4K4J0j6j1J3
18382FOrl0l0%L6M0K6MNrj0rj0LKKLk2k0k1k2kjkkMMNMKKk8k8kK4J8Kj3j3j4j4J5J5J5J5K9
18362b4K8L0K9K0K0j1j2j6j6J6J5OOk6k6j4j4j2j4l8l8n3k7K0J9K1K0N3N1L5RqrK1K1QPm5
18346E2m5k1k2k0k1j4KL0N6N0L4Qj9l0l0J%jjjjpoppppk6PL0L0%JONONK2K1j0j0rj0rrK3K3
18325F2K3K3k6k5k6k6j6j8j8j7NNNOqqqqLLLLJ8J8J8J7MML4L4Jl1o3o4o3l1oJ1J6J5M8M9L5
18307AL7j6j6j6j6j7j7j9j9J3J3K6K5noj8j8j8j8j0j0j0rkkL0L0L1L1L0L0NMNMJ8J8J7J8k4
18289A00k5k4k5j1j2j0j1J3J2J3J3k2k0k1k2j0j0rrK6M1M4K0j0l6l1j7J7J6J7J7L5L6NMj1
$$ y = [-12, -48, -84, -106, -97, -65, -33, -31, -29, -31, -33, -35, -38, -44, -51, -58, -64, -79, -93, -108, -123, -110, -97, -84, -71, -54, -37, -21, -4, 16, 36, 57, 77, 87, 96, 74, 51, 48, 44, 40, 37, 21, 6, -9, -25, -46, -68, -47, -11, 14, 7, -11, -30, -30, -30, -30, -30, -32, -34, -36, -38, -4, 29, 70, 95, 98, 74, 33, -7, -39, -70, -70, -70, -62, -55, -17, 19, 18, -9, -37, -38, -14, 10, 20, 4, -7, 6, 12, 3, -27, -57, -57, -21, 19, 45, 49, 54, 45, 35, 26, 16, 19, 21, 23, 26, 4, -16, -37, -59, -61, -62, -64, -66, -62, -58, -53, -49, -47, -45, -73, -101, -103, -79, -61, -59, -72, -85, -99, -113, -98, -83, -68, -53, -24, 4, 34, 63, 83, 103, 92, 80, 64, 48, 64, 79, 85, 91, 65, 39, 25, 11, -1, -15, -53, -91, -144, -171, -151, -132, -111, -91, -38, 13, 48, 57, 49, 40, 61, 82, 90, 97, 52, 7, -14, -36, -56, -77, -91, -89, -59, -3, 47, 81, 89, 70, 40, 10, 11, 11, 10, 9, 8, 7, 0, -6, -13, -20, -27, -34, -60, -53, -23, 7, 7, 8, 14, 19, 25, 30, 52, 73, 63, 53, 44, 34, 25, 16, 39, 62, 85, 108, 82, 57, 31, 5, -11, -29, -47, -64, -59, -54, -49, -43, -51, -59, -67, -75, -72, -69, -66, -63, -45, -27, -9, 8, 12, 16, 50, 84, 85, 54, -9, -73, -136, -167, -173, -162, -146, -131, -83, -34, 1, 38, 22, 6, -10, -26, -43, -60, -79, -98, -85, -72, -46, -21, -26, -32, -50, -68, -86, -104, -114, -124, -134, -143, -145, -147, -117, -87, -56, -25, 5, 35, 40, 44, 49, 53, 71, 89, 106, 124, 100, 75, 51, 26, 15, 3, -7, -18, -5, 7, 20, 33, 11, -9, -30, -52, -62, -72, -81, -90, -64, -23, 21, 41, 31, -5, -36, -53, -36, -20, -3, 14, 49, 85, 90, 94, 83]
18274H3j0Mk2n6n7k1OJ0RJ2J1J1J2k0k1%%j%JJL3L1lmlmj7j9j8j8K7K7K5K7k1j9k1k1rj0K3
18255d2K2J9J7J9J9J2J3J3J2j1j2Mk3n0l4J2L8L0Lj2j2jjj%l9l9kK5K9J4opLKLLJ4J4J4J4
18238G6%%%JJ2J2k0j9nnK7K7qqrqLLk8k9k4k5PPj7j6j7j7j4j5j5j5K4K4RL4N6M2pl4l4l5o
18219f6nJ2J2J2J2J0J0RJ0lmll%%%%K2K2K1K2J0Rpl4m3m1oK0RRJ1J2mmmmj3j3j3j3k5k5k4
18200a03k5jkL0L0K3K4K3K2L3L2J5j1pqrrjjjjPPPPJ2J2J2J2k2k3k2k2k8k7k8k7k0k0k0k0
18182a50ONOOK0K0N2N1J9K0j3j2mml5l5ppppPQL9L8J2J2J2J1NNk8k7l3l5llrj0rj0pqpqJ6
18163a08J6J7J6PQPQK6K6J0J0k5k4NLJ4j7l3l2j4j5j5j5K1K1K1K1K6K5J3j9n3n4m3j0J0J0
18147a36K8K7J2J1nmLLLLJ6J5J6J4j3j5j4j5J8J8L5Mk9k9l1l2j4j5J7J7K0K1K1K1K2K3K2K3
$$ y = [83, 73, 77, 55, -1, -58, -79, -73, -63, -54, -42, -31, -20, -8, -28, -49, -49, -49, -50, -50, -49, -48, -15, 16, 13, 9, 6, 2, -15, -34, -52, -70, -43, -16, 9, 36, 15, -4, -25, -46, -55, -65, -42, -20, -1, 16, 35, 54, 66, 79, 92, 104, 93, 81, 85, 62, 12, -22, -10, 28, 58, 61, 49, 37, 36, 35, 34, 34, -5, -44, -46, -21, 8, 22, 16, 9, 12, 14, 17, 20, 34, 48, 62, 76, 76, 76, 76, 77, 89, 101, 81, 62, 57, 52, 79, 106, 98, 90, 81, 73, 76, 79, 51, 22, -2, -27, -20, -13, -30, -46, -63, -80, -94, -109, -124, -139, -115, -91, -82, -48, 8, 50, 43, 9, -25, -60, -66, -71, -59, -47, -35, -23, -13, -3, 6, 16, 13, 9, 6, 3, 3, 3, 3, 3, 25, 47, 68, 90, 100, 109, 102, 68, 25, -16, -22, -2, 7, 16, 27, 39, 35, 31, 27, 23, 10, -3, -16, -29, -54, -79, -103, -128, -129, -131, -101, -71, -48, -24, -1, 21, 54, 86, 101, 90, 83, 75, 66, 57, 56, 55, 54, 53, 60, 67, 74, 81, 93, 105, 117, 129, 107, 84, 62, 40, 12, -15, -43, -70, -90, -110, -130, -150, -144, -139, -133, -127, -107, -87, -35, 16, 35, 55, 42, 30, 26, 22, -13, -48, -55, -62, -69, -76, -69, -61, -22, 16, 28, 40, 52, 63, 68, 73, 45, 18, -15, -50, -53, -56, -65, -75, -84, -94, -101, -109, -116, -124, -108, -92, -75, -59, -52, -44, -37, -29, -3, 23, 33, 43, 18, -6, -1, 2, 16, -1, -34, -66, -80, -95, -110, -125, -104, -83, -62, -41, -15, 10, 23, 4, -49, -103, -146, -156, -146, -136, -108, -81, -69, -58, -63, -67, -64, -61, -58, -55, -39, -24, -8, 6, -7, -22, -36, -51, -33, -15, 20, 24, -5, -34, -65, -97, -111, -126, -109, -92, -72, -51, -30, -9, 13, 36, 58, 81]
18130H1J6J5J5J6k3k4k3k3jjJ5J5J1J1k1k1JJKJk9k8LLJ2J1k0k0K0K2K1K1k4k4n2n4m3j0L
18113a25LL4L4L3L3JKJKnmnmjjkjKKj2j1j1K2L2L3J0k3k0j9J4J6J6J6J7J8j4j4l3l3kjj2j3
18095b5k8k9J2J1J2J2OOOOJ2J2j6j7k0J1K5K4L1L1O0N9J7l6n9n9l5l4mlLKLKnonoK2K0j0r
18076akjl4l3k1k2J0J1L3L3JJk9k9l1%J6J5J8J8kkj7j8KJL1L2J1k1j9j8K1K1j1j0qqqqkkk
18058h4lL2L2M9J7j9k0k1k2J7J6J6J7K7K7K6K5J4j7l7l7l5l4j9j9QPPPK0J9K0K0POk0j9k2
18041Hk1J5J5J1J2J1J2nnmnj1j0j1j1LKLKJ5J5J3J2j4m6k7k8rrrrJ4J5jjj4j3J3J3L1L0K2
18023B4rj7j7J8J6K9K8KKkklkk6k7k6k6onJ0J1K5K5jjooJ0J0j3j4j3j4J7J5J6J7qpqprqrr
18004b6lllmkkK4K4J5J6j%j2j1MMJ1J2J1J1rql5l4j4j3K3K4J6J7rj0J5J4K8K8J2k5n1n0m2
$$ y = [81, 97, 112, 127, 143, 120, 96, 73, 50, 49, 48, 63, 78, 89, 100, 79, 58, 59, 60, 62, 63, 34, 6, 9, 12, 24, 35, 15, -5, 15, 37, 58, 79, 55, 31, -21, -75, -118, -128, -125, -122, -88, -54, -21, 12, 13, 15, 16, 18, 13, 9, 4, 0, -1, -2, -4, -5, -3, -1, -13, -24, -35, -13, 19, 52, 62, 39, 19, 0, 14, 30, 46, 62, 79, 97, 83, 69, 36, 3, 1, 0, -12, -25, -53, -82, -70, -59, -47, -35, -29, -23, -17, -11, 1, 13, -3, -20, -40, -29, -4, 20, 51, 82, 142, 201, 218, 182, 123, 64, 29, -5, -9, -12, -9, -7, -4, -2, -7, -13, -18, -24, -2, 18, 8, -1, -3, -4, -38, -71, -92, -114, -104, -93, -60, -27, -26, -25, -54, -83, -114, -114, -98, -83, -65, -47, -49, -51, -68, -86, -84, -83, -52, -20, -9, -30, -49, -67, -46, -25, -36, -46, -54, -62, -70, -78, -80, -82, -84, -87, -55, -23, 26, 43, 24, 4, -17, -39, -22, -6, 10, 27, 54, 81, 107, 132, 146, 129, 92, 55, 20, -14, -33, -52, -44, -37, -30, -23, -3, 16, 36, 56, 63, 69, 49, 30, 8, -13, 2, 17, 28, 40, 51, 63, 58, 53, 49, 44, 33, 23, 12, 1, 4, 6, 9, 11, 26, 41, 54, 66, 52, 6, -21, -49, -58, -67, -76, -85, -71, -56, -57, -58, -72, -85, -72, -59, -28, 2, 24, 15, -2, -19, -1, 15, 44, 72, 74, 76, 74, 72, 69, 67, 41, 14, -12, -38, -44, -49, -39, -28, -3, 22, 21, 20, 14, 8, 18, 28, 15, 1, -12, -26, -9, 6, 22, 39, 31, 24, 16, 9, 0, -8, -17, -26, -29, -32, -35, -39, -41, -43, -19, 5, 20, 36, 35, 35, 23, 12, 16, 20, 31, 43, 54, 65, 56, 48, 13, -21, -35, -48, -25, -1, 15, 32, 23, 13, 28, 42, 70, 98, 110, 85, 34, -16, -58]
17986e8k6j3J3M4M2L2Ok1l7l0l0nnL1M8M5J9jkK5K6jjJJJKqpm3m2k9lRQKJk5k5qqK9L0J6J8
17966B1k0j8j7j6j6j7K0K0pp%JJ6J6j3j2LLJ0J1k5k5lK3M3M3K2mk5k6j0Nnl1l6l6j5J0K4K4
17949f9K6K7K9M6N4K2j8l3m1m0l3kJ1J2J0J1J1J2j%%%nnnnkjjjqqqqrqqqj0j1j0j0JJJJj2
17929a05j3K2N4M2M3J3J3j8j8j8j7RJ0k0k1qPKl0m2j1K2K2K0J9L3L3J9j4k5k4J2M5M4J3nk0
17913H8k7k7l7pK7K9J6J7%JJ1J2J2J1LLKLmmmmj6j5j5j5qpJ3K9K1j2k4k4j1j1MNl7l7k3QM4
17894a0M4J5J5j8j9j9j7%%K1L7K5kj7j8NNONl2l0l1l2j4j5j3j3LK8K4QJJ7M6L1Lj2ooj1k6
17876b2l3oK2K3K3K5J5J6J5J6LKj3j3l4l3kkj8j8lk%%l1l2j1j0j1j1k9l0j2J4M2N8M0Mk2o
17859h6L4L3J0k8l0j5NK1J3J3K5K4L3J6Lk4j9lPOk4k4j7j8kK5K9J4ppk6k7k7k8NNONRRJ0R
$$ y = [-58, -84, -97, -84, -40, 2, 34, 40, 19, -18, -48, -78, -83, -88, -57, -9, 36, 55, 54, 52, 77, 103, 102, 101, 102, 103, 104, 106, 98, 91, 48, 6, -23, -26, -17, -9, -7, -6, -31, -56, -64, -72, -43, -13, 3, 21, 1, -17, -34, -50, -66, -83, -63, -43, -50, -57, -57, -56, -40, -24, -37, -49, -46, -43, -33, -22, -47, -72, -75, -52, -9, 34, 56, 52, 27, 1, -9, -4, -9, -40, -76, -112, -127, -117, -93, -69, -43, -16, 13, 59, 113, 135, 117, 84, 43, 3, -30, -32, -21, -9, 1, 12, 23, 35, 34, 34, 34, 34, 29, 24, 19, 14, 12, 11, 10, 9, 1, -7, -15, -23, -32, -40, -48, -56, -66, -77, -87, -97, -96, -95, -94, -93, -105, -118, -96, -42, 0, 43, 56, 69, 51, 33, 15, -2, 7, 17, -3, -24, -32, -25, -23, -53, -95, -106, -84, -62, -42, -23, 10, 43, 62, 48, 23, -1, 11, 56, 100, 113, 108, 88, 61, 34, -3, -10, 17, 46, 62, 79, 79, 80, 91, 103, 115, 126, 129, 132, 134, 137, 133, 129, 125, 121, 105, 90, 75, 60, 52, 45, 58, 87, 108, 96, 72, 48, 37, 26, 30, 35, -2, -39, -62, -54, -10, 34, 49, 64, 46, 27, 8, -9, -9, -9, 12, 49, 74, 72, 55, 37, 42, 47, 53, 58, 26, -4, -35, -67, -81, -96, -109, -122, -119, -91, -67, -59, -58, -41, 5, 36, 39, 27, 21, 15, 4, -22, -55, -61, -39, -16, 7, 32, 47, 63, 78, 94, 97, 99, 86, 73, 39, 6, 4, 2, -16, -34, -37, -39, -39, -39, -70, -102, -113, -123, -134, -145, -174, -204, -216, -202, -160, -102, -62, -58, -80, -86, -52, -19, -9, -37, -67, -82, -77, -56, -43, -30, -5, 19, 52, 68, 71, 47, 28, 25, 32, 38, 14, -10, -27, -45, -47, -22, 7, 21, 14, 7, -19, -46, -73, -101, -96, -91, -85, -80, -71, -62, -52, -43]
17841d3RQQRK1K3OPNOj6l2j9PK1K2JJKJmlJ3J2j1j1RK6K5kj8j8kjJ4J4LLj2j3j6j6j6j6po
17821fppJ2J0J2J1J6J5J5J5KJKKk1k1k1k1KLLLK9K9K8K7J2j4l1l2k6k7ONj4j2k9l0MNMMNN
17802c2j6l2k8kK6M1K9J3Jj6k0k0nnjjJ5J5rrj0rNNNNJJJJNNNNPPPPkkkkopk2k2llK8K9L0
17779A3L2J5J6lkllLLLLl2l2l0l2J7J7J5J4J3j4k9l0RK4J4j1l2l2l2l2k5JJ9J8J5J6J5J6K3
17762d0K4K3K4NONNj8j9j8j8J0J1RJ1K1K2K1K2ook1k2k8k7QL5L4J8Oj0j3j3j3j4%JK2L7K0
17745A14pj7kRqk9k9k0j8mlJ5J7j5j5PNPOrprrj5j6j5j5J4J3J4J4qqooK4M8M4K7%%jkj0j0
17725F5j1j0QQRQppk8m2j5J6L1%l7l7J4J3K4K4M0M0J3J4j9j8m9m8l6mJ1J0J2J1J1J0J1J0O
17708E1Oj1j0J1J1ll4m0m0j0j1pqpqK4K4qpJ5J6J6J5k3k4qqJ5J5L6N0M5J4k1n4l7oK5K7LM
$$ y = [-43, -34, -26, -18, -9, 12, 35, 41, 48, 53, 59, 43, 11, -8, -1, 20, 42, 43, 44, 46, 47, 43, 40, 53, 65, 54, 43, 52, 78, 103, 101, 83, 65, 63, 62, 76, 90, 93, 96, 84, 71, 55, 39, 23, 7, 0, -6, -13, -20, -8, 2, 14, 25, 41, 56, 71, 86, 88, 89, 91, 93, 72, 51, 30, 9, 11, 14, 17, 20, 49, 78, 106, 133, 145, 131, 100, 68, 42, 15, 21, 26, 12, 0, -29, -59, -55, -50, -46, -42, -37, -32, -48, -80, -108, -110, -84, -43, -14, -1, 0, -16, -36, -56, -61, -66, -67, -68, -53, -38, -47, -56, -66, -75, -70, -65, -60, -55, -54, -53, -52, -51, -46, -41, -36, -31, -24, -17, -10, -3, -5, -7, -9, -11, -17, -24, -46, -68, -71, -74, -46, -17, 13, 45, 60, 76, 73, 71, 68, 65, 68, 71, 74, 77, 45, 13, -17, -49, -32, -15, 0, 14, 27, 13, -16, -46, -37, -13, 1, -10, -42, -74, -106, -138, -163, -162, -143, -125, -110, -94, -79, -63, -40, -16, 7, 31, 36, 42, 47, 52, 34, 15, -3, -21, -11, 0, 9, 20, 41, 63, 84, 106, 100, 94, 73, 51, 23, -4, 4, 39, 73, 91, 97, 87, 74, 61, 48, 34, 34, 35, 57, 94, 114, 107, 90, 88, 97, 89, 60, 31, 11, -7, -11, -14, 1, 18, 3, -12, -5, 0, 7, 13, 4, -3, -12, -21, -36, -52, -67, -82, -68, -55, -41, -27, -35, -43, -49, -55, -31, 17, 61, 88, 88, 88, 87, 85, 75, 65, 54, 44, 52, 60, 69, 77, 70, 63, 35, -7, -22, -6, 25, 25, -12, -49, -35, -22, 2, 26, 66, 106, 119, 133, 114, 96, 47, -1, -37, -41, -30, -20, -8, 3, 14, 24, 35, 45, 51, 57, 46, 36, 47, 58, 55, 21, -19, -59, -69, -80, -87, -95, -102, -110, -86, -62, -70, -77, -62, -46, -30, -15, -38, -62, -70, -78, -63, -48, -12, 38, 83, 97, 76, 22, -15, -21, 4, 31, 34, 38]
17691C8j3j3j7j7j8j8J2J2l0m6mK7M7L1ml7m3k7oJ0K7J1ppNL7M1K3MMJ7J7JJ%%j%KLLKnol
17671E3mPL9L7Nm1p2p1m2KJ8J1J1%%L2L0%%%%K8K9J4j7l1l1j8J1K5K4J1J1nmmmK4K4j0m2o0
17653a0m6kL0L5K1kjj8l3k7NJ8J9j1j1MMMMopppJ2J2K2PLL4K4RJ3J4J2J2k2k2m3n8n1j9NK1
17634e9J5%JJ6M1M1J1J1j6j6J6J5J6J5l7l7k3k3RPqj0k5k6mmJ1J2J3J4%jK4N5M0Pl9n5l3l
17617b9j6j7j4j5%j%jPPQPK4K5K3K4L0K9K9L0j5j5j5j5k9k9LLJ2J2k0j9j9j7j8j8KLKKJ1J1
17599a8J0J0LLMLK8K9nl7n4k4JJ6L3L4L5L6J0J0k2k2j0j0j0j0m1l9J3M5L6Nk8k8NMMNj2j1
17581Aj1j1j7j6j6j6j6j6J5J6RJ0k3k2k1k2K1L7J2j9j9J4M6M6J2j9j1j1J9J9L0L2j%rqqrq
17564A0qpqONk4k4LL0K3Q%jjjPPPPK7K7nnj8j8LJ9Rj7l2l1k2ML1M7L1J5Kj4j6j5j6j7%jl1
$$ y = [38, 25, 12, -5, -22, -40, -58, -46, -34, -64, -110, -114, -87, -40, -9, -13, -50, -93, -120, -126, -116, -89, -78, -85, -92, -87, -50, -9, 14, 18, 22, 39, 56, 57, 58, 58, 58, 57, 57, 59, 62, 65, 67, 62, 56, 53, 49, 56, 95, 132, 137, 96, 24, -47, -89, -87, -69, -58, -47, -47, -47, -15, 15, 15, 15, 15, 15, 43, 72, 86, 69, 38, 7, -11, 0, 25, 49, 60, 71, 66, 62, 58, 54, 78, 102, 92, 50, -10, -56, -58, -28, 7, 28, 26, 25, 7, -26, -53, -48, -30, -11, -22, -33, -29, -25, -21, -17, -23, -30, -37, -44, -32, -20, 2, 9, 12, 46, 70, 79, 92, 106, 118, 130, 108, 86, 43, -15, -66, -85, -80, -59, -44, -44, -43, -27, 14, 55, 66, 77, 61, 45, 61, 76, 92, 107, 70, 33, 10, -13, -4, 3, -5, -15, -40, -66, -70, -74, -63, -51, -38, -24, -24, -25, -1, 54, 94, 101, 62, 7, -26, -29, -45, -62, -76, -91, -91, -92, -92, -93, -86, -79, -71, -64, -40, -15, 8, 32, 62, 91, 120, 150, 135, 120, 105, 90, 61, 32, 35, 38, 50, 62, 42, 23, 4, -13, -31, -49, -47, -44, -42, -40, -29, -18, -8, 2, 5, 8, 12, 15, 43, 72, 67, 30, -24, -48, -47, -31, 2, 36, 71, 107, 117, 127, 105, 83, 73, 63, 53, 43, 2, -37, -24, 21, 57, 62, 34, 6, 11, 15, 19, 24, 12, 1, -10, -21, -38, -54, -70, -86, -102, -118, -103, -87, -78, -68, -91, -113, -134, -156, -135, -98, -86, -105, -124, -110, -64, -18, -6, -25, -36, -47, -28, -9, 21, 53, 52, 52, 43, 35, 27, 18, 10, 2, -5, -13, -7, -2, -26, -50, -47, -17, 6, 14, 14, 13, 12, 11, 18, 25, 32, 39, 66, 93, 88, 83, 65, 47, 50, 69, 78, 61, 29, -2, -24, -20, 11, 58, 89, 104, 106, 92, 76, 61, 45, 28, 28, 27, -4]
17544dl2j3j2j2j2L3L2L2L3K9K8lkk6k7k6k5PPpJ8M0M1J0k7k9k9l7k3J5M0L5J9Nj0l5l3j7
17528a7j8j7j8j0rj0j0K3K4K3K3J1J0J1J1klllK9L0lkk6k5k5k5MLMMK1K1K2K1J9J9j3j4j3
17511F7j3j3j3k7k5NN%%%%K6K8JJj3j3k5k7j4J7L5L7L7L7J%j4j4j5j4k4k3LLJ7J7J6J6k3l9
17493B0m7j6J0Rj2j3j7J6L2L2L1%l0m5l1%K9K9K0K1nol0l1j5j5J7J7J7J7JJJ7L3L2Jk8k8l
17476C0kJ3J3j%jjMNMMj0rj0j0MLMLpqqqL6L6J7j6k0j9poKJJJ%jj%kklkl1l1NNRQJ3K9L1j
17453F4j9j9k8k8rK2L5L5J%lmJ2J2k3k4k3k3J2J1J2J2MNMMmmlmNNNNj3j3k8k8k5k6J2J2K5
17434c7K4K3K5k8k6k8k8PPPOJ6J6J6J5qppqnnonMNMMj7j7RRL1L0pok2k4J4J4J7J8KK%j%jq
17414B4rl4l5k2k2MMPOOPJ4J4J5J4j5j4j5j5k4k5k4k5J0J0J0J0J9J9J9J9K7K6K7K7j3j2j3
$$ y = [-4, -36, -49, -61, -73, -85, -52, -20, 12, 45, 74, 102, 99, 97, 71, 44, 18, -7, 0, 7, 0, 18, 58, 99, 109, 82, 53, 24, -13, -36, -21, 19, 54, 73, 78, 68, 33, 0, -17, -35, -52, -70, -80, -89, -99, -109, -86, -62, -39, -16, -5, 5, 16, 27, 25, 22, 19, 16, 45, 75, 72, 70, 44, 19, -6, -31, -27, -24, -20, -16, 5, 26, 48, 69, 88, 107, 94, 80, 67, 54, 41, 28, 1, -24, -19, -14, -14, -14, -14, -14, 12, 40, 41, 42, 29, 16, -9, -36, -50, -33, 2, 39, 76, 113, 114, 114, 100, 86, 71, 57, 33, 10, 13, 16, 33, 50, 66, 82, 59, 20, -27, -43, -33, -24, -36, -49, -66, -50, -18, 14, 45, 45, 15, -30, -61, -61, -32, -3, 17, 38, 33, 27, -3, -34, -49, -64, -47, -30, -13, 4, 5, 6, 23, 56, 88, 89, 61, 33, 30, 28, 41, 54, 53, 53, 52, 51, 55, 60, 64, 68, 58, 49, 39, 29, 33, 36, 40, 43, 36, 28, 20, 12, 48, 84, 101, 85, 65, 46, 39, 33, 35, 36, 37, 38, 38, 37, 36, 36, 34, 32, 29, 27, -4, -35, -30, -25, -16, -8, 5, 34, 65, 64, 45, 26, -2, -30, -39, -17, 18, 53, 54, 54, 51, 47, 59, 71, 48, 24, 1, -22, -10, 1, 13, 25, 29, 34, 38, 42, 38, 34, 31, 27, 32, 37, 42, 47, 34, 21, -7, -35, -60, -86, -74, -62, -37, -13, 10, 35, 7, -19, -47, -75, -68, -61, -54, -48, -32, -16, 0, 15, 7, 0, -7, -15, -20, -25, -31, -36, -32, -27, -23, -19, -36, -53, -44, -35, -4, 26, 19, 13, -9, -33, -19, -5, 12, 30, 32, 34, 34, 33, 33, 32, 24, 15, -19, -54, -76, -98, -94, -90, -83, -77, -71, -64, -50, -36, -21, -7, -22, -36, -51, -66, -90, -115, -139, -164, -154, -144, -134, -124, -105, -86, -67, -48, -21, 5, 32, 59, 46, 34, 21]
17397B1j2kjjjL2L3JJllllj6j6J6J5J2J2k0k0k3k3k3k3j4j4J7J8RJ0RJ0LKk7k8m5m5qJ9L9
17379i5L9K4lj5j6j7j7NNMNK0K1K0K0J6J6J6J7PPQPJ5J6J5J5k3k3k3k3k3k2pJ9L0J3Jj4l4
17362B6l3mmj1k7l2pMMNNL2L3K0L6M4Qk4k4k6k5k5k5j6j6j5j6L7L7L6L6L4L5L5L4J0Rk2k2
17345A46n1n2j9k0k0k1k2k1NMNMK2K1J9J9j1l7l1j4qJ9M6O2M2Ml7n3l2j7k6k7llK8K9J1J1
17328b8J2J1NMONPPJ5jl1n7n8l1oJ0J1mj9j8l5qL0L0j%j2j1j2j2%%%%J5J5J6J5j%L1L1L1L2
17309fj%qpqpMMLMRRRRJ5J6j6j6l6l7nnkjjjJ0J0RQj9m6l1l1j0rJ2K7K5kMK0J0oNML0M5J9
17288Ipj3j3j5j6J9J9J9J9J1J1k2n3m0rK4K4K6K5K6K5l3l4l3l3m0m1J3J3M2M2M1M2K0K0j2
17272G6j1j0rK2K2J4J4j8j8l9m0l9l9k9l0NL7N4L8K6J0j5k9k3k2l0l0KJL3L3L2L2j4j2PK3
$$ y = [21, 9, 7, 6, 5, 4, 36, 69, 70, 71, 68, 65, 62, 59, 43, 27, 43, 58, 70, 82, 62, 42, 19, -4, -27, -50, -64, -78, -61, -43, -34, -24, -15, -5, -2, 0, -27, -55, -100, -145, -153, -134, -95, -56, -32, -35, -50, -66, -83, -100, -95, -90, -86, -81, -61, -40, -20, 0, 16, 32, 48, 65, 72, 79, 87, 94, 109, 125, 140, 155, 132, 109, 86, 63, 40, 18, 11, 30, 60, 73, 74, 60, 26, -7, -11, -15, -26, -53, -85, -92, -88, -84, -79, -74, -42, -9, 11, 47, 91, 99, 75, 51, 25, 0, -25, -50, -66, -82, -97, -113, -76, -39, -3, 33, 67, 102, 137, 171, 181, 190, 168, 146, 95, 43, 24, 4, -16, -37, -59, -80, -75, -71, -66, -62, -40, -19, 0, 19, 8, -29, -60, -74, -82, -63, -17, 45, 87, 91, 54, 1, -31, -48, -74, -101, -104, -107, -79, -50, -39, -28, -16, -5, 0, 4, 10, 15, 22, 29, 44, 43, 12, -45, -103, -134, -140, -130, -119, -123, -142, -160, -195, -203, -173, -143, -144, -144, -156, -167, -179, -191, -191, -191, -191, -191, -176, -161, -145, -130, -131, -131, -100, -69, -38, -6, -7, -7, -15, -22, -30, -37, -33, -29, -26, -22, -13, -4, 5, 14, 29, 45, 29, 13, -23, -60, -65, -70, -72, -73, -74, -75, -65, -55, -46, -38, -57, -103, -134, -165, -175, -184, -172, -145, -120, -122, -118, -98, -88, -94, -89, -85, -55, -10, 9, 2, -11, -24, -39, -55, -36, -17, 2, 21, 32, 43, 21, -32, -72, -81, -57, -33, -7, 18, 44, 69, 36, 2, -31, -64, -104, -145, -132, -119, -77, -35, 6, 48, 68, 88, 76, 65, 55, 46, 68, 90, 104, 118, 100, 82, 43, 3, -36, -75, -104, -134, -129, -92, -38, 0, 26, 36, 21, -8, -31, -53, -83, -113, -111, -110, -77, -44, -12, 20, 6, -6, 1, 24]
17256B4Kl0n0l4J2M5K7K6OOOOmmmmK0K0jj7j3J9L0L0pl8k1k1rj0rrJ0J1j9k1J5J5J5J6j5j5
17238Fj4j5LMj5J6L3J9klJ0J0m1m0jL0L0jj4j3j5j6opopRRRQj3j4J8J8K3K5K4K4J2J1J2J2
17220A32K0J9j2j1k4k3n2n2k5J2K1K3%j%%JKKJRRRRj0rj0rllklJ6J6J6J6j7j6j6j7KLKKJ3
17200D0J3J2J3k0k0J1J2J8J8j4j4j5j6J4J5j3l9l1j7J1K6J9J9QQQQJKk8k8%K7K6%k8m3l5l5
17183f7j3j2j2j2NML6L6nnonk1k1J0J1K2K2K2K2J0J0K5jk4k4rj0jkL5L5L2L1MNl4l4j4J7L
17166F5Ll3l2j7j7J9J8J9K0LLOOK2K1QQQRl6l6l6l5lmmmk2k2k3k2POPPj2j2j2j2J0J0J0Rq
17147i8rqrllllL1L1L2L1qqrqj6j6j6j6L1L1M8J7j5j4j7j7j1j0j1j1j8j8KL3K6K7KKl3l2l5
17128a31kK1K1K3K3j0j0j1j0kkkjK7K7K7K6j3j3j3j3onnoPQPQj7j6j7j6K7K6K7K6LLLLk2k1
$$ y = [24, 26, -4, -54, -88, -76, -31, -4, 22, 28, 34, 40, 46, 42, 38, 34, 30, 50, 70, 69, 52, 39, 58, 88, 118, 111, 73, 52, 31, 22, 12, 3, -6, 4, 15, -4, -25, -10, 5, 20, 36, 21, 6, -8, -23, -20, -16, -31, -15, 18, 37, 35, 32, 42, 52, 11, -29, -30, 0, 30, 29, 15, 2, -13, -29, -35, -42, -48, -55, -46, -37, -28, -20, -33, -47, -29, -11, 12, 37, 61, 85, 97, 108, 120, 132, 152, 171, 159, 148, 124, 101, 49, -3, -28, -16, 5, 28, 28, 27, 27, 27, 28, 30, 32, 33, 42, 51, 60, 69, 59, 50, 40, 31, 28, 25, 23, 20, 36, 52, 68, 84, 67, 51, 35, 18, 20, 23, 25, 27, 40, 53, 65, 78, 58, 38, 49, 61, 79, 97, 83, 69, 54, 38, 52, 67, 54, 15, -16, -33, -22, 4, 23, 42, 50, 58, 66, 74, 75, 77, 49, 21, 21, 48, 74, 74, 46, 3, -32, -67, -80, -92, -104, -116, -111, -107, -71, -35, -40, -45, -51, -56, -77, -98, -88, -77, -55, -33, -11, 11, 21, 31, 56, 55, 31, 7, -2, -12, -13, -15, 20, 55, 87, 118, 122, 127, 93, 59, 45, 62, 65, 68, 35, 3, -14, -31, -12, 6, 25, 45, 48, 51, 57, 63, 85, 106, 114, 122, 130, 139, 103, 67, 31, -4, -7, -11, -15, -19, -41, -63, -86, -108, -101, -95, -88, -81, -93, -105, -117, -129, -119, -109, -99, -90, -98, -107, -115, -124, -127, -130, -133, -136, -105, -74, -42, -11, -19, -27, -36, -44, -60, -76, -92, -108, -77, -46, 2, 19, 4, -10, -27, -44, -55, -65, -76, -87, -105, -123, -121, -88, -62, -35, -33, -31, -64, -96, -131, -133, -112, -91, -68, -45, -55, -65, -76, -86, -88, -90, -92, -93, -66, -39, -12, 14, 1, -12, -25, -38, -44, -49, -54, -60, -53, -45, -38, -30, -47, -63, -80, -96, -69, -43, -16, 10, 13, 16, 19, 22, 0, -21]
17110b1l7j0K6K7J2J1J4J4j3k7j1J5L5L6K4K4K5K4j3j3j3j3j6j6j5j6KLLKk6k7k6k6j3j2J4
17094e3J4J4J4J3J4k3k4k4k3j%%jnnL2L2L1L2nnj5j4j5j4mlK1K0Pj8l1l1nnonOOL3L3J9K0
17075B6MMPOPPk2k1k1k1J3J3kkqqK8K9K8K7k1k0k6k6j0j0KJKKj3j3j3j2k3k3RRK0J9K0J9K0
17056GK1j1j1k6k6m2j4J4J4L7N1N6K9qqpoppk3k2k2k3K6K5K5K6QQk3k4KKKLOOOPppppj4j3
17037A6j4j2j2j2j1j2j1j0K1K1nnnnJ6J5J5J4pqrqllllk8k7l5j9lK5N3O9O8N3J0k7m3m3j3
17019@j3jkjkLKKKl0l0l1l0k1k0J2J2K5M1M7K0JJL0L2K6K7K4K5ol3k8j1j2k8j7j7j2j2J0K4
17001IJ4j2k7k8opK5K5J8J9j1j2PK3K9Ll4l3k4J3K6K6K9K9J0J0J1J0k1k1n1n0j2J3Ppk2k2
16985d4RQMMMMoonoj6j6J7J6QQRQk4k3k3k2J5M1L4J7Pj8l6l7k4k4QQJ5J5J5J5MNk7k7%jL2
$$ y = [-21, -58, -68, -42, -15, -3, 8, 22, 36, 23, -4, -15, 0, 35, 71, 95, 119, 144, 168, 155, 142, 129, 116, 100, 84, 69, 53, 55, 58, 61, 63, 37, 10, -16, -42, -55, -67, -53, -39, -25, -11, 2, 16, -7, -31, -55, -78, -79, -79, -79, -80, -85, -90, -58, -26, 5, 37, 32, 27, 12, -2, -17, -31, -35, -38, -17, 3, 10, -8, -39, -70, -75, -80, -86, -91, -85, -79, -46, -13, 6, 26, 30, 34, 41, 47, 54, 61, 39, 18, -3, -24, -11, 2, 0, -2, -10, -18, 10, 39, 67, 94, 73, 53, 27, 1, -9, -19, -17, -16, -14, -12, -25, -38, -51, -63, -86, -109, -100, -91, -71, -52, -32, -13, 7, 28, 17, 6, -20, -46, -88, -102, -88, -74, -37, 14, 70, 99, 91, 83, 76, 70, 63, 56, 33, 11, -11, -34, -8, 17, 42, 68, 76, 84, 61, 37, 39, 41, 43, 46, 52, 58, 64, 71, 64, 57, 50, 43, 29, 16, 2, -10, -22, -34, -45, -57, -68, -78, -57, -36, -41, -46, -51, -56, -40, -25, -10, 4, -3, -11, -20, -28, -31, -34, -37, -40, -68, -95, -130, -149, -152, -127, -74, -5, 63, 116, 126, 99, 56, 13, 0, -13, -14, -16, -17, -19, -16, -14, -12, -10, -40, -70, -101, -131, -152, -172, -160, -148, -123, -82, -35, -15, -14, -13, 17, 49, 75, 102, 126, 151, 145, 112, 84, 73, 61, 33, 16, -1, -13, -25, -15, 9, 23, 11, -16, -44, -50, -57, -32, -7, 11, 30, 19, 7, 14, 37, 66, 69, 35, 2, -22, -9, 17, 43, 72, 101, 111, 121, 132, 142, 121, 100, 49, -1, -13, 0, 7, 0, -22, -44, -35, -27, -23, -19, -15, -11, -17, -23, -28, -34, -50, -66, -49, -33, -25, -17, -8, 0, -24, -47, -70, -92, -77, -36, -2, 15, 22, 4, -32, -69, -93, -117, -109, -101, -86, -71, -56, -41, -37, -32, -59, -86, -86, -87, -55]
16965e5L2K3K5ppK6K6K4K4ql4l5qRJ0J1J1j0j1j0j0RK4L0Ll5n2m2m4j6j6j6j5J7J8J8J7kk
16948g8L0K9K2K4rqrqK3K3J0J1k1k1kkJ4J4JJKJkjkkjjjjNOk5k3k1NK1K3j2j2MMKKJ7J8J9
16928F9J8LLQQQQK1K1j1j0k6k6k5k6j7j8MK0J1j5l0l0j9j8J4J3K9K8J3J3j%j7j6j4j6J%K0
16911bJ9J9J9j3k9l3q%%JKJKJJJ0RQJ0K6K6K6K6llj8j9m4m3k7jNNOPJ4J3J2J2K0qm2m2j3K4
16891b4L4L6PQqqnmJ1J1L0L0L0L1RRRRj0j0rj0LKKKL7L7K1K1KKL3L4O6O5O4L8J4kj1j0j2j1
16872E73o5o4o3o2l1l1mmk5m1m3j7jjk8k9j1J5K9K9J6J5K3K4Qj9k1npk3k6k5j1j1rj0J2K8
16856H5J7rk5k5k3k2ppMMMMJ2J4j8j8k0j9mK2L2J7k3k3OL2K7J1j6j7J3J4J1J1nnlll5l3k8
16838d8k8k6k7j6jK6N7M9M7M9M8J6j7l0l0k2k2k3k1MLLMJ2J3J3J4k3k3qK1N1N1J9j3k9j4N
$$ y = [-55, -23, 0, 25, 18, 11, 37, 63, 87, 111, 103, 69, 34, 26, 35, 45, 56, 67, 57, 46, 36, 26, 35, 59, 89, 92, 57, 5, -37, -81, -97, -113, -129, -144, -127, -109, -91, -74, -76, -78, -48, -19, 3, 27, 18, 10, 1, -7, 16, 39, 49, 60, 39, 18, 16, 14, 28, 42, 43, 44, 46, 47, 45, 44, 42, 40, 39, 38, 37, 36, 41, 47, 22, -1, -22, -17, 4, 27, 15, 3, 7, 11, 13, 15, 32, 50, 69, 87, 90, 93, 101, 109, 117, 125, 146, 167, 156, 146, 120, 94, 69, 43, 26, 8, 12, 32, 43, 28, -2, -32, -51, -69, -55, -42, -13, 15, 28, 41, 40, 40, 23, 7, -7, -23, -22, -22, -2, 17, 36, 55, 42, 13, -20, -28, -28, -28, -27, -25, -24, -22, -21, -20, -10, -1, 7, 17, 43, 69, 95, 121, 118, 115, 97, 78, 34, -9, -36, -37, -32, -27, -21, -14, 0, 13, 25, 37, 57, 49, 7, -35, -48, -24, 10, 46, 53, 61, 53, 45, 40, 36, 47, 58, 88, 118, 148, 179, 188, 197, 206, 215, 205, 195, 186, 176, 179, 181, 183, 185, 222, 259, 280, 301, 303, 305, 338, 372, 438, 503, 567, 605, 619, 617, 606, 596, 584, 573, 508, 444, 381, 319, 288, 257, 253, 249, 224, 183, 140, 123, 122, 121, 93, 64, 53, 68, 97, 126, 142, 157, 180, 204, 212, 193, 172, 167, 160, 137, 111, 86, 75, 64, 55, 45, 57, 85, 102, 93, 68, 43, 20, -2, -9, -16, -12, -8, -4, 0, 12, 26, 8, -10, -30, -49, -53, -31, 1, 18, -5, -28, -22, 10, 37, 48, 32, 15, 28, 42, 53, 64, 59, 54, 51, 48, 13, -20, -48, -76, -102, -129, -145, -146, -120, -63, -14, 33, 82, 130, 146, 129, 99, 69, 47, 25, 2, -19, -15, -12, -9, -5, 7, 20, 33, 47, 24, 1, -7, 14, 65, 116, 135, 122, 93, 79, 84]
16821H4Onk2l0JJ5J5j6j5j0j1j1rLMLLmlnmj0j0j0j0MLLLJ2J2J2J1j1j2j2j2j2j2j3j2j1j0
16803a08j0j1POL8L8L7L6L7L7J1J2k0k0l7l6l6l7%%%jl1l1%%klkl%jj%L2L1L2L1K9L0K9L0
16785A13J0J0k2k2K2K1j0j0l7l6l5l4k7MJ8J8POOPj2j3j4j3k3k3RJ0K2L9M6J5k2k3PPJ3J3
16768D7J3J3llkkj7kQk5n1n2j8J3J8J9K1K1OPk3k5poppJ7J7J7J6J4J4J3J4L4L5%l1n2l6j0
16750bJ9M6M6L2Kj6l2l3j7NK0K1Mk5m2m1k5qQJ1oj5KK3K3RJ1J1J1K5K6onk8k7NL7L7Nppj2
16732H5j2j2j1j6j6j7j6kk8m3m3rJ7L3L4j4j5j4j4jjJ5J5M7M5Rj7j0j0MMj8j8j8j8KKKJPO
16714f5POooJ0RK5Rj8m5m5k0RK4L4L5J9pj6%K1K0opppj3j4J8J8J5J5K0L7K1nk1k1j4j3J8J8
16696E2PPrj0j3l0l4rJJLLK6K4onLLJ9J8llklj6j5j4j5j2j3j0j1PL4L3Pj2j2j4j4j2j1J9J9
$$ y = [84, 90, 85, 63, 33, 34, 49, 64, 48, 33, 23, 12, 1, -8, -5, -1, 2, 5, 1, -2, -7, -11, -21, -31, -41, -51, -47, -44, -41, -38, -26, -14, -2, 9, -2, -14, -26, -38, -50, -62, -75, -87, -98, -108, -118, -129, -122, -116, -78, -40, -3, 33, 70, 107, 118, 130, 110, 90, 53, 17, -19, -56, -56, -56, -56, -57, -88, -119, -119, -119, -121, -124, -126, -129, -129, -130, -131, -131, -99, -68, -36, -5, 24, 54, 83, 113, 123, 133, 111, 89, 111, 132, 122, 112, 75, 39, 4, -30, -57, -53, -35, -17, -10, -4, 2, 9, -3, -16, -30, -43, -66, -89, -80, -70, -48, -9, 37, 52, 30, 7, 14, 21, 34, 47, 60, 73, 70, 67, 65, 63, 46, 44, 52, 27, -24, -76, -94, -81, -63, -44, -23, -2, 4, 11, -12, -37, -44, -50, -57, -64, -47, -30, -13, 3, 17, 31, 44, 58, 92, 127, 127, 96, 44, 8, -2, 17, 63, 109, 141, 143, 127, 95, 62, 45, 50, 70, 91, 95, 70, 28, -13, -38, -46, -38, -27, -33, -48, -46, -23, 0, 9, 20, 31, 42, 67, 93, 87, 82, 54, 27, 32, 69, 106, 111, 104, 97, 85, 73, 61, 50, 34, 18, 1, -15, -17, -45, -88, -131, -140, -123, -90, -56, -70, -85, -99, -113, -114, -115, -100, -85, -38, 7, 16, -1, -11, -21, -17, -13, -31, -49, -67, -85, -83, -81, -79, -78, -71, -65, -58, -52, -58, -64, -54, -45, -20, -11, -29, -74, -119, -139, -130, -106, -72, -37, -18, -25, -41, -41, -20, 0, -6, -13, -20, -27, -40, -54, -36, -18, -3, 12, 32, 69, 90, 85, 64, 43, 29, 16, 34, 52, 59, 66, 57, 47, 34, 4, -30, -39, -38, -37, -34, -31, -5, 19, 13, 8, 11, 14, 33, 51, 48, 45, 43, 40, 24, 9, -5, -20, -32, -45, -55, -66, -59, -25, 8, 15, 3, -9, -23, -37, -49, -60, -41, -22]
16677b2L4J8j0l6m5m5l0lK0K0M2N7N3K2l4l4j1j2j3j2k2k2pK4L7L7K6oj8j7k1k0j0j0j0rj2
16661a01j2j2j1j2j2m2m2j6J6L0L0L9L8K3K2norK3L3J8j4k9k2J0M2M1J5j6k9l0QQPQlklkK8
16644IK9kkklJ4J4LKLL%%%%%%%%j7j7j7j6J7J7J8J7lkllJ6J6J6J6k6k6k5k6j8j6j8j8ooop
16623g5J7J7J4J5J3j7k5rjjl0l0PL4K8J2J3J2J1J2J1J2J2J2rqrqjjk8k6j7j7j6j7K2K2K3K2
16606dK5K6K6K6jjkjj6j6j5m3n2l7j9lJ4L0M4K8Lk3k6k6mmJ2J2L9L9L8J2qqj0rJ3J3J3J3Q
16588A06PPQK1K0onj5j4l0m5m4pJ8Jk1k1MJ9rl6k8j2KJ8J0J0J3J3M7M8J3j3JKj9j8j9j8j3
16571ej4mK3L1J7J1J1K3K2nnk8m4m9k4jkJ%POPPK5K5K5K6QQRQK9K9J1J1Lk9l5l6KL3J8j4k3
16552A18k3JKj%j7j6k3k3ppJ4J5jjL0L0J5J5K1K2L7L7L1L0L1L1M4M4N8N8N0J8%jj6j6m3m3
$$ y = [-22, 12, 30, 20, -16, -61, -106, -136, -139, -119, -99, -57, 0, 53, 75, 41, 7, -4, -16, -29, -41, -63, -85, -92, -68, -31, 6, 32, 26, 8, -9, -30, -50, -60, -70, -80, -89, -101, -113, -125, -136, -148, -160, -202, -244, -260, -244, -214, -184, -145, -107, -84, -62, -67, -73, -82, -59, -26, -8, -22, -51, -73, -63, -21, 20, 35, 19, -10, -40, -32, -24, -17, -9, -12, -14, -17, -19, 9, 38, 36, 34, 32, 29, 43, 57, 60, 62, 65, 68, 68, 68, 68, 68, 68, 68, 68, 68, 51, 34, 17, 1, 18, 35, 53, 70, 67, 65, 62, 59, 75, 91, 107, 123, 97, 71, 46, 20, 2, -14, -32, -50, -56, -62, -68, -75, -58, -41, -27, -12, 1, -16, -41, -50, -51, -52, -82, -112, -105, -71, -43, -31, -18, -6, 5, 17, 28, 40, 52, 64, 55, 47, 38, 30, 29, 28, 0, -26, -43, -60, -76, -93, -71, -49, -26, -4, 21, 47, 73, 99, 98, 97, 95, 94, 78, 62, 47, 4, -48, -85, -104, -107, -93, -63, -19, 9, 12, -11, -37, -63, -67, -71, -59, -47, -8, 31, 69, 81, 73, 65, 55, 46, 59, 72, 85, 98, 106, 113, 120, 128, 149, 169, 163, 158, 143, 129, 99, 54, 10, 3, 21, 22, 1, -20, -16, 3, -6, -42, -70, -82, -80, -62, -52, -42, -29, -16, 31, 79, 92, 79, 80, 82, 63, 45, 26, 8, -5, -19, -23, 0, 31, 48, 59, 70, 93, 115, 110, 105, 77, 33, -16, -40, -41, -43, -42, -42, -35, -29, -22, -15, 10, 35, 60, 86, 94, 102, 111, 119, 148, 177, 188, 199, 202, 173, 138, 102, 104, 137, 155, 141, 118, 95, 96, 98, 97, 97, 80, 64, 41, 18, 11, 4, 18, 33, 32, 31, 61, 91, 106, 121, 142, 164, 201, 238, 269, 299, 330, 361, 405, 449, 507, 565, 615, 633, 633, 632, 616, 600, 557, 514]
16535E14m2m2m2m2m5m5qqm1m2k6k5j2j3MMk0k0k0k0%%J7M8L6Nj3j3nnm2m1j7j6j7j6NOqrm
16517h0K6M7M5L8L8J9j3l1l1j7j7nmnmrj0j0j0lkkknmnnppK3K3RqJ3M4O1K9j5l1k1oj5j6k6
16498a1k7j2J9K7M2M4K9Mj2mmk7k7k7k7J5J6J6J5MMj7l2j5J5J5j7k6k8LKLLMMJ3K8L7Oj5j5
16480B5j6j6m2m2m9l3j1K1M5K9J2J2M2M2lklkj9j9j9k0oopoRJ0RJ0j5j4j4j5poppooK5K6J5
16462h6J5J5J5jjJ0M0K5k8l6k1KKKLL8L7j5j5j3j4j5j4RRQRRQQRJ4J4J4J4OOOOooook1k1k1
16442Gk1l9l9jK5J0J0J1J1j3j3j2j2L1M7K1mk1k1RRJ0J1M1M1nl1k4qJ4L0K0K0pl4k8j2rrq
16424Gq%J%%j1j1j2j1k2k3J0RK8K7mm%%%%J0J0k2k2l8l7ooJ0J1J1J0QPK9M4L7J2k5k4j0j1
16406b6j1j0PQQQM4M5K9Kj8j8J3J2nnnnllllQRRQJ9J8j3j3k4k5k4k4rrj0rk9l0RL5M4M4L1
$$ y = [514, 472, 430, 388, 346, 301, 256, 248, 240, 199, 157, 131, 106, 94, 81, 85, 89, 69, 49, 29, 9, 9, 9, 26, 74, 110, 115, 102, 89, 84, 79, 37, -4, -21, -37, -54, -70, -65, -59, -67, -76, -80, -54, -7, 38, 76, 114, 133, 120, 89, 58, 41, 24, 19, 15, 10, 6, -3, -13, -23, -33, -36, -38, -40, -42, -47, -51, -56, -61, -68, -75, -52, -29, -20, -28, -15, 29, 90, 119, 104, 73, 52, 46, 31, 15, -11, -38, -50, -31, -4, 38, 82, 111, 115, 103, 99, 95, 68, 41, 14, -13, 2, 18, 34, 49, 53, 57, 40, 8, -7, 8, 23, 6, -20, -48, -45, -43, -40, -37, -33, -29, -16, 12, 49, 55, 40, 25, 9, -7, -49, -91, -140, -173, -184, -163, -118, -89, -77, -65, -23, 19, 16, 14, 11, 9, -10, -29, -48, -68, -74, -80, -87, -93, -84, -74, -65, -55, -70, -84, -98, -113, -120, -126, -133, -140, -146, -152, -127, -101, -86, -71, -56, -41, -42, -43, -33, 7, 32, 4, -32, -53, -51, -49, -47, -44, -6, 31, 16, 1, -12, -26, -41, -55, -46, -37, -29, -20, -11, -3, 5, 14, 28, 42, 56, 70, 76, 82, 88, 94, 88, 82, 76, 70, 49, 28, 7, -14, -53, -92, -93, -68, -58, -48, -37, -26, -39, -52, -64, -76, -45, 2, 23, 19, -2, -23, -14, -5, 5, 16, 57, 98, 93, 62, 38, 30, 44, 74, 94, 114, 107, 73, 45, 33, 24, 15, 7, -1, -1, 0, 0, 0, -11, -22, -34, -45, -67, -90, -80, -71, -43, -16, -20, -24, -24, -24, -24, -24, -14, -4, -26, -48, -86, -123, -129, -135, -125, -114, -103, -93, -85, -78, -49, -5, 32, 44, 19, -5, -15, -26, -37, -47, -40, -32, -24, -16, 28, 73, 102, 104, 86, 68, 81, 93, 88, 83, 78, 73, 70, 67, 64, 61, 69, 78, 87, 95, 114, 132, 119, 106, 82, 57, 33, 9, 0, -9, -19, -28, -57, -87, -78, -43, 1, 45, 76]
16386G6L0NNMMK9J3j5m0l4oPQmj9j0J8L3L3K6J1Jk5m3m3rqrqj0j1rj1klkkJ0J0J1J1llllJ4
16366B4J5J4J5j2j1k6k4j5J1K8K8JJ%JnnnnJ5J5J6J5KKKKj2j2j2j2j7j7J4J4J9K0LLNMNMJ2
16347A20J2j9k0j5j5KJqqqqJ8J7JKonK7K6J4J3j8j9l4l4j8j8%%%%%JJ%mnpol4m9k6NL4N0N0
16327A0L4K7J1j3j2j5j4k8k7j0K1L4L6K0J9j2j2k7k8NMQQk3k3mnK6K7M0M0L7L8J3j9l1l1k3
16311A01RK1K1Kl1k8k8k6k5NOK6K5poj9j9j9j8LMK3M1K0j2k4k5j0j0rj0JJJJmnnmQRQQNMN
16291A4MJ1J0k2k0j7j6j%J9J9rj1J1L7L1J5Mj2j2LJ2J2K8Kj1j1j2j2k2k3J0J0j%%jQQQQrq
16272E4rrl5l5mmPQPPopopPPOPL0L2L1L1llllllllKLLLJ1J1k1k1k1k1k1k1j3j4j3j4j3j3J9
16251f6J9J%JJL7L7K1oonppjjjjj5j4j4j3J2L6K3K3kllkllklmnnmnmnmkkjkkkkkkkkkJ6J6
$$ y = [76, 106, 111, 116, 120, 124, 153, 166, 151, 111, 77, 71, 78, 86, 82, 63, 53, 71, 104, 137, 163, 174, 175, 150, 107, 64, 55, 47, 38, 30, 20, 9, 0, -11, -13, -16, -18, -20, -10, 0, 11, 22, 19, 16, 13, 10, 24, 39, 53, 68, 56, 45, 19, -5, -20, -9, 19, 47, 48, 49, 49, 50, 45, 40, 35, 30, 45, 60, 76, 91, 93, 95, 97, 99, 87, 75, 63, 51, 34, 17, 31, 45, 64, 84, 87, 90, 95, 99, 104, 108, 120, 132, 113, 93, 78, 63, 65, 66, 58, 50, 42, 34, 52, 69, 70, 72, 66, 61, 88, 114, 128, 141, 123, 104, 70, 36, 18, 0, 0, 0, 0, 0, 0, 1, 2, 2, -2, -7, -14, -20, -54, -103, -129, -124, -90, -40, 10, 44, 71, 82, 69, 57, 42, 28, 0, -27, -37, -16, 18, 54, 74, 93, 81, 69, 42, 14, 19, 23, 31, 39, 16, -7, -11, -16, 10, 37, 77, 117, 154, 192, 205, 186, 155, 124, 101, 110, 131, 152, 154, 123, 95, 67, 41, 16, 21, 27, 53, 78, 71, 65, 46, 27, 8, -10, -7, -3, 20, 61, 81, 69, 45, 20, 10, 0, -9, -19, -18, -17, -16, -15, -19, -24, -29, -33, -25, -16, -8, 0, 5, 9, 14, 18, 29, 39, 17, -3, -20, -36, -37, -37, -18, 1, -8, -19, -8, 29, 60, 75, 79, 67, 55, 58, 70, 82, 110, 112, 101, 90, 78, 66, 44, 21, 31, 41, 40, 40, 40, 39, 47, 55, 63, 71, 62, 54, 45, 36, 1, -34, -38, -42, -35, -27, -20, -13, -19, -26, -32, -39, -32, -25, -19, -12, 18, 50, 81, 112, 109, 106, 103, 100, 97, 94, 91, 88, 90, 93, 96, 99, 110, 121, 100, 79, 58, 37, 16, -5, -18, -32, -45, -59, -72, -85, -66, -47, -46, -46, -45, -44, -7, 30, 51, 45, 39, 34, 27, 20, 19, 18, 17, 16, 1, -13, -27, -40, -28, 8, 31, 54, 52, 49, 46, 44, 41, 38, 36, 33, 29, 24, 19, 15, 10, 6, 1, -3, -5, -7, -8, -10, -12, -14, -16, -18, -20, -22, -24, -26, -10, 6]
16227FJ6J6J9J9J9J9QRRRrrl8l9m3j1JLNNNNJ4J4K1Nj5m6m8j7pk4l0KJ4J4J6J6L4L3KLK2K3
16208G0K2K3j9k0j9j9j9j9j9j9RJ0J0Rj6j6j5j5lJ3K2j0m7m7NL7M3J0jkrrj0rMLMMJJL2L1
16190AK5K4pprrrrk3k4k4k4J3J2J3J3K3K1K1K1J5j7m0n8m9l4j0K3K3PJ8J8K5K5opooooqrq
16171g4qjkkjKLKKK9K8K8K8NNMNrrrrk6k7j3J9L0L1KKj0j0rrK8L0llj4j3j4j3m1m0l8l9LL4
16151a26M9M8J0J1RJ1k1k2k2k2NONORJ0RRmmnmJ5J6j8m9k1J1Rk3k5k4RM0M0M0Pk5k6k6MML2
16132d3L3L2L2K4K3qql1l2m8j7K0K1Pk2k8k7KKK7K7K6K7QQQQj1j0j1j1mnk1QJ3J3J6J5PQk4
16114E4k5l4l6l3l4J1M2K5K4PQQQMLLMjj%jK0K0L8Ok1k1k2k3QRQRj0j0j0j0j2j3j2j2RRQR
16094A3K9L0klk9l0k8k9poopKJKJJ2J1J1J2PQPOrj0j0j0K3K3rqj9k0nK6L2L3L6L5j8j7j8j8
$$ y = [6, 22, 38, 57, 76, 95, 114, 122, 131, 140, 149, 140, 131, 93, 54, 11, 0, 1, 4, 9, 14, 19, 24, 38, 52, 73, 78, 63, 17, -31, -48, -55, -79, -109, -107, -93, -79, -63, -47, -13, 20, 22, 25, 47, 70, 92, 115, 96, 76, 57, 38, 19, 0, -19, -38, -29, -19, -9, 0, -16, -32, -47, -62, -65, -52, -30, -40, -87, -134, -129, -92, -49, -39, -40, -42, -51, -60, -70, -79, -75, -72, -68, -64, -63, -62, -30, 1, 26, 50, 43, 36, 27, 18, 9, 0, -23, -47, -71, -95, -82, -70, -57, -44, -21, 0, 21, 42, 57, 40, 0, -58, -107, -141, -151, -128, -105, -98, -80, -62, -37, -12, -18, -25, -31, -37, -43, -49, -57, -66, -74, -82, -83, -85, -87, -88, -86, -83, -81, -79, -50, -22, 6, 34, 39, 44, 48, 53, 44, 35, 26, 17, -9, -36, -49, -30, 0, 31, 33, 35, 25, 15, 6, -3, 25, 55, 52, 49, 35, 22, 8, -5, -46, -86, -124, -163, -160, -126, -77, -29, -19, -8, 1, 12, -9, -31, -53, -75, -70, -64, -59, -53, -44, -34, -25, -16, -20, -24, -29, -33, -18, -2, -20, -69, -90, -79, -70, -93, -118, -142, -133, -93, -53, -13, -6, -31, -57, -83, -79, -75, -43, -10, 22, 54, 78, 101, 93, 85, 54, 22, -26, -43, -23, -2, 5, -17, -45, -72, -70, -68, -41, -14, 12, 39, 47, 55, 63, 71, 60, 50, 39, 28, 24, 19, -2, 6, 19, 32, 48, 63, 70, 78, 54, 29, -5, -41, -74, -108, -97, -55, -30, -6, 1, 9, 17, 25, 29, 32, 35, 39, 38, 37, 37, 36, 56, 76, 114, 120, 99, 78, 56, 33, 41, 50, 58, 67, 57, 47, 37, 27, 15, 2, -10, -22, -13, -4, 4, 13, 42, 72, 70, 67, 38, 8, -20, -49, -56, -62, -68, -75, -73, -72, -70, -69, -57, -46, -35, -23, -16, -8, -1, 5, -4, -14, -24, -34, -11, 12, 3, -5, -24, -44, -49, -23, 9, 42, 78, 113, 95, 78, 60, 42]
16075D2NMMML5L5K1j1k2k2k4k3%Jl1l0l1l1JJQQPQj3j4JL2L1K9k0j9k9k8k8k9J7J7J7J7nn
16057g0nnkjL0L1J3J2J3J4L5L6Ml3l2j7MLk9k9l0l0j9j8l2nM3O9O9M4J8J7J6J6j2j2K0J9K
16040A47KKKj1j0j0j1m0m0J3J3RRQRj2j1j2j2mmmmk1j9k1k0J8J8j1m9m3nL5N1M5L0J5%l4n8
16022d0l5KK6K7klopopk0k1k0k1J0J0M1M2J9J8j2j2KKj9l4l7j0ONOOOO%%%%L3L2K9L1ml6m6
16003c9m7j9J4M8M7J4J3J4J3RRRQnonoLKKLJKJ8j4n4q5o8j4L5L5L9L7L1L0L1L0K5K5qpl9m0
15984I1l9m0j7j9j8j9%%%%L1L0K8K9L2%j3j4j8j8J4J4K1K1K1K1mnl6l7l4l3k1J1K8K9L0L1
15968I7K5K5K4K5RQJ1J0L0O2Q2J12J36J67K16K15J19m0j54j86j41j41j43j43r7r7o2l1mnk
15954A27lk3k3k3k3k0j9k0j9k3k2RRQPK9M3M2J0llK0K0K1K0oonok0k0k0k0j5j4J8J7JJJ%j
$$ y = [42, 47, 51, 55, 59, 94, 129, 150, 139, 117, 95, 71, 48, 48, 49, 18, -12, -43, -74, -73, -72, -64, -56, -49, -41, -54, -68, -67, -35, -4, 25, 5, -14, -43, -71, -99, -128, -111, -94, -77, -60, -65, -70, -75, -80, -82, -83, -53, -22, -9, 3, 16, 30, 65, 101, 105, 72, 40, 23, 27, 30, 1, -28, -58, -88, -107, -125, -157, -162, -119, -50, 19, 63, 81, 98, 114, 130, 118, 106, 126, 145, 147, 149, 151, 153, 142, 132, 122, 111, 71, 31, 44, 57, 66, 75, 83, 92, 80, 69, 57, 45, 41, 37, 33, 29, 8, -11, -32, -52, -34, -16, -27, -76, -119, -124, -89, -38, 7, 37, 52, 52, 18, -40, -75, -73, -47, -20, -22, -25, -31, -38, -44, -51, -71, -92, -112, -133, -123, -113, -72, -30, -11, 7, -5, -17, -15, -13, -32, -66, -103, -113, -107, -102, -96, -90, -84, -78, -78, -78, -78, -78, -45, -13, 16, 47, 43, 7, -39, -86, -105, -91, -43, 4, 18, 31, 45, 58, 67, 76, 85, 93, 88, 82, 77, 71, 74, 76, 78, 81, 82, 84, 102, 88, 34, -51, -119, -133, -98, -63, -24, 13, 44, 74, 105, 135, 160, 185, 177, 170, 131, 91, 52, 12, -5, -24, -42, -61, -61, -61, -61, -61, -30, 0, 28, 57, 89, 89, 76, 62, 44, 26, 40, 54, 75, 96, 117, 138, 134, 129, 93, 56, 22, -11, -32, -21, 7, 36, 66, 97, 122, 147, 171, 196, 205, 213, 224, 234, 264, 326, 408, 520, 656, 823, 1039, 1254, 1373, 1333, 1179, 993, 852, 711, 568, 425, 328, 231, 169, 138, 134, 129, 127, 124, 101, 78, 55, 32, 12, -7, -27, -46, -69, -91, -82, -73, -65, -58, -29, 14, 56, 66, 63, 60, 80, 100, 121, 141, 135, 129, 124, 118, 98, 78, 58, 38, 23, 9, 27, 44, 45, 46, 47, 47, 46]
15936D6jjkjjj%lJ2K2j1j9k0k0k2k1k1J1J0L0K8K8K7L3Jj3j3j4j5J7J7L7L8K3rk8k8l0l0j6
15919D0j7j7j5opK3K3pl9l1j4onK7K7RJ0QRLLKLJ0J1J0J1j3j4j3j4L4L3KKjjj%llllppqpp
15898C1qppj5j7j6j6K1K1J8J9j1m8o7n1k4KK6N2O3O1J1J2KLj9l5k2MJ8K0jj%jLMj3l8n7m1
15880a24PL2L1J4poPPOPL2L2L9K4ql4m1mL5L5K2nj2MQj8m8m8o4l8jJ4J6%k6k6k5k5j3J3L1
15863a57L0J0J0J0J0J6J6J6J6J2J1J2J2j9j8J3J2j0qrj0lmlmooooJ8J8J7J7j0j1j1j1L6L5
15846C5L4L4K9Kl6l5j8j7j7j5OK4lk7m3m2j2j1RJ0J0Rj0j0j0j0J0J1M2M2J%j5j5l4l5j8RL2
15829h4L3KKJ1J0K1MkK3M7L2j9m6l5%J8J9%j5pJ9L4L3K5lj8j9kjkjk3k4PPj3l8n4n4k3J5M7
15811g4M7K8L0lkmlmm%%J5J6K1K1Mk2m1m0k6%K7K5K9K8mmlmk8k6k8k8J3J3J3J3J6J7J6J6J
$$ y = [46, 45, 44, 42, 41, 40, 39, 39, 36, 48, 70, 59, 40, 20, 0, -22, -43, -64, -53, -43, -13, 15, 43, 70, 103, 104, 91, 78, 64, 49, 66, 83, 120, 158, 181, 172, 144, 116, 86, 56, 40, 23, 6, -9, -15, -22, 1, 24, 17, -22, -53, -67, -73, -78, -51, -24, -15, -5, 3, 12, 15, 18, 20, 23, 33, 44, 54, 65, 52, 38, 25, 11, 45, 78, 80, 82, 81, 80, 79, 79, 76, 73, 70, 67, 60, 53, 45, 38, 31, 23, 16, 9, -6, -23, -39, -55, -34, -13, 5, 24, 13, -35, -102, -153, -177, -175, -149, -97, -34, 27, 38, 50, 52, 55, 36, 1, -21, -17, 1, 21, 20, 19, 19, 18, 21, 25, 12, -26, -83, -124, -117, -85, -54, -40, -47, -53, -46, -39, -33, -26, 6, 38, 77, 101, 93, 59, 18, 14, 49, 84, 106, 101, 89, 93, 101, 83, 35, -13, -77, -115, -116, -102, -86, -86, -112, -138, -163, -188, -201, -188, -157, -127, -117, -107, -97, -87, -71, -55, -39, -23, -11, 0, 12, 24, 5, -13, 0, 12, 2, -6, -15, -25, -28, -32, -35, -39, -45, -51, -57, -63, -45, -27, -10, 7, -3, -14, -25, -36, 0, 35, 69, 103, 132, 134, 98, 63, 45, 28, 11, -4, 2, 26, 23, -4, -47, -89, -101, -112, -103, -93, -83, -74, -84, -94, -104, -114, -104, -93, -51, -9, -8, -8, -23, -38, -72, -107, -125, -116, -84, -51, -49, -47, -36, -26, -5, -1, -3, 20, 67, 99, 80, 34, -1, -1, 17, 36, 36, 21, 14, 33, 67, 100, 125, 122, 104, 85, 83, 82, 80, 79, 56, 32, 39, 46, 33, -5, -59, -113, -136, -121, -74, -27, 1, 31, 28, 26, 22, 19, 15, 11, 11, 11, 26, 42, 63, 84, 88, 66, 25, -15, -41, -41, -14, 11, 40, 68, 64, 60, 57, 53, 25, -1, -29, -57, -44, -31, -18, -5, 11, 28, 44, 60, 61]
15792F1j6k2LMk3j4JJ2J3J4J4J0Rk3k2MNK0K1PQPQMMk8k8l7l6l7l7mmK8K8L3L2j9k0rrPPj0
15773c4rj0rLLLLj0j1j0j0PPPONNNNRRk3k3l2l2j5j5K4N6L7L8J0J0k1k1k8k7MMK7K8M4J3q
15754B4qj0rj3j3LLJ5J5j5j6ppRRMNj2j1kkL0K9L1L1J6J5k0k0n2n1m6m7j2j3J1M3L9L9kl2
15736d9l1l1poK5K6qqpqqqNL8N1N1O1M5J2j5l2l2k8k8m1j6L0M6K2nopqr%%j%k3k3pK0J5J3
15717HJ6J6OOk5k6rrj0rj7j6J5J6j0j1j0j1L0K9K8K9j6j6j5j6j2j1j2j2RRRQMML3L4Ok0j6
15700FJPqk9l0rrK2K3K4K4qpj6j6j7j6qpqpL1L0%jj%K9K9J0j6l2l4j6j7jK5N4L8mm0n7n6l5
15680a52j8kK5N1L5J5%lJ4K4Rj4j3ONOOQJ0M1M2J0J0RQk9n5m8l2j2Mmmlllkj2j2j9lL3N8N9
15661D5L3ONMLk8k8K5K5J4J5j8j7nmmmkklknnOj0j8QK5K4MNMMqqPj9m1m0j1j1PQQPK7K7L4
$$ y = [61, 45, 23, 26, 30, 7, -7, -6, 6, 19, 33, 47, 57, 66, 43, 21, 25, 30, 50, 71, 78, 86, 93, 101, 105, 109, 81, 53, 16, -20, -57, -94, -98, -102, -74, -46, -13, 19, 0, -20, -29, -38, -31, -24, -34, -43, -53, -62, -59, -56, -53, -50, -60, -71, -81, -91, -84, -77, -70, -64, -59, -54, -49, -44, -35, -26, -49, -72, -104, -136, -151, -166, -142, -86, -49, -11, -1, 9, -12, -33, -61, -88, -84, -80, -53, -25, 19, 32, 24, 16, 6, -3, -16, -29, -26, -23, -8, 7, -8, -24, -31, -38, -29, -20, -16, -11, -23, -34, -36, -38, -8, 21, 52, 83, 99, 114, 94, 74, 22, -29, -75, -122, -134, -147, -136, -93, -54, -15, -17, -49, -80, -111, -118, -124, -99, -73, -81, -89, -96, -104, -112, -120, -115, -77, -26, 25, 86, 131, 143, 128, 96, 64, 36, 8, -33, -49, -19, 27, 49, 44, 38, 31, 23, 14, 14, 14, 13, 13, -10, -33, -40, -20, -5, 8, 24, 40, 46, 52, 27, 1, -8, -17, -27, -36, -53, -69, -54, -38, -48, -59, -69, -80, -50, -21, 7, 36, 20, 4, -11, -27, -39, -50, -62, -74, -65, -56, -47, -39, -35, -31, 2, 36, 42, 22, 6, 7, 14, 6, -23, -53, -62, -71, -49, -26, -2, 22, 14, 7, -9, -25, -42, -58, -66, -73, -81, -88, -57, -27, -27, -28, -29, -29, 0, 29, 39, 23, -9, -43, -59, -76, -77, -52, 2, 40, 36, -4, -61, -117, -152, -170, -172, -147, -96, -61, -46, -46, -49, -35, -11, -2, -16, -29, -23, -18, -12, -6, 2, 12, 53, 95, 105, 115, 124, 132, 103, 48, 0, -32, -44, -40, -44, -48, -51, -54, -57, -59, -71, -83, -102, -105, -72, -14, 45, 78, 84, 89, 93, 96, 68, 40, 65, 90, 104, 119, 101, 84, 79, 75, 71, 67, 65, 63, 60, 58, 53, 48, 54, 44, 26, 34, 59, 83, 87, 92, 96, 100, 92, 84, 91, 72, 31, -9, -20, -31, -24, -16, -8, -1, 26, 53, 87]
15641H7J9j8m5l9k3nnl6l6k9k8K4K4J3J3J2J3J1J1M1M1J6j0k7k6rrrr%%%%J5J5j5j5RL4K8
15623C3J2Kj4l4l6qK9M6L1%l2j5j5j5j6j6j6j6j7L6L6K2K2K3K3L1L2j%ppk3k3k3k3ppPOPP
15605C4RQRQj5j5j5j5llklllllj7j7j7j6k2k1J0J0MLMLJ4J4J3J4J7J8J4J6J1k0l3l4OOOOM
15586a9MMMk2k1k2k2j0j1ML5M6M5L4Lk5k4rj1K8K8K9K8J4J4j7j8k4k4qqJ7J6l6l5l9l9ppl
15569a08klkmnK8K7J4J5j8j7PPQPL2L1%Jk1k1noK9K8J2j4k3k5k5k6j3j2J9K0K7K7J1J0j8k0
15551b8j9k0lml6l5j0rj0j0RQRRK7K7K7K7%jj%RJ0RRqrK3K3J9J9j2j1KJ8K3ll4l5nmpqQPP
15530GQk4k4k2k2J0J0J9K0LMJ0J0L2M7O2L6j2k9j5%%j6l7l7ooj0rrropooj7j7j5J1L8L8K4
15512B8lj4j3%JNOj0qj2j3j2j2PQPPk7k7MNK0K1K1K0onoo%Jl1l2PPL6L5J6k0n2n3k0k1k1k1
$$ y = [87, 106, 88, 43, 4, -19, -24, -29, -65, -101, -130, -158, -134, -110, -97, -84, -72, -59, -48, -37, 4, 45, 61, 51, 24, -2, -11, -20, -29, -38, -38, -38, -38, -38, -23, -8, -23, -38, -29, 5, 33, 45, 47, 33, -1, -37, -45, -16, 30, 61, 61, 29, 14, -1, -16, -32, -48, -64, -80, -97, -61, -25, -3, 19, 42, 65, 96, 128, 127, 127, 120, 113, 90, 67, 44, 21, 14, 7, 14, 20, 27, 34, 43, 51, 60, 68, 53, 38, 23, 8, 5, 2, 0, -3, -6, -9, -12, -15, -32, -49, -66, -82, -104, -125, -115, -105, -101, -98, -94, -91, -77, -63, -50, -36, -19, -1, 13, 29, 40, 20, -13, -47, -41, -35, -29, -23, -19, -15, -11, -7, -29, -50, -72, -94, -104, -115, -111, -76, -30, 15, 49, 52, 27, 3, -6, -17, 11, 39, 68, 96, 110, 124, 107, 89, 65, 41, 33, 25, 42, 58, 22, -13, -52, -91, -98, -105, -108, -110, -113, -115, -119, -124, -96, -69, -55, -40, -58, -75, -68, -61, -53, -46, -14, 17, 17, 18, -3, -24, -29, -35, -6, 22, 34, 20, -3, -28, -53, -79, -92, -104, -85, -65, -38, -11, 0, 10, -8, -28, -47, -67, -70, -74, -110, -145, -155, -164, -174, -184, -175, -167, -158, -149, -122, -95, -68, -41, -41, -42, -43, -43, -34, -24, -15, -6, -14, -23, 0, 23, 42, 61, 49, 38, 40, 58, 81, 78, 44, 9, 4, 0, -7, -15, -7, 0, 7, 15, -9, -33, -55, -77, -67, -57, -38, -18, -15, -11, -1, 9, 41, 88, 150, 186, 174, 145, 130, 130, 130, 114, 77, 40, 34, 28, 18, 9, 0, -9, -15, -22, -28, -34, -51, -68, -83, -72, -34, 4, 28, 25, 11, -2, -2, -1, 4, 10, 0, -8, -20, -33, -45, -57, -50, -42, -35, -28, -55, -82, -78, -73, -53, -32, -11, 9, 3, -2, -8, -14, -14, -13, -44, -76, -69, -62, -26, 9, 25, 5, -47, -100, -120, -141, -162, -183]
15493a83k9k9l6k1QL4N1N2K1K0K0K1J6J7j5j5K5K5K2K3Pk0l4l5k2MK1K2J3J3J4J4OK2K8Jk3
15477E8k3k4k4rj0Ok0l9k3ML1L0L0L0L2RJ0k4k3k3l9n0j3K5M0M1K7ok1j2j3j7j8j8j7OOOP
15460f8RJ0J0Rj6j6J6J5LLLMM2N9L9Kk6k6LLrqrrj1j2j1j0K2K3K3K3QQRQmllll9l8k6PJ0n
15440A9k5k6J1J1J0J2j6j6J5J4J6J7J6J6J8J8J9J8J4J4J2J2j8m9p1n5k4rj6j7KKL4L2M2M1
15424I3J1J0L0M5K3j0k5k6k8k8jj%jnmnmJ7J7J7J8J2J3j9k0k0j9j8j8k4QRk2m1k6j4KJ3J4
15407b7J4J4JKJJK2K2pqRM0M1Rrj0j1j1J7J8J8J8NONOJ9K0pqj6j6l2l2k6k5%JJ%J7J6J2J3
15388A23j4j4l7l7j1j0prqrj1j1j2j1OOrk5k2J1M0N5M9L5J5jk1l7m0m1j4L9O4O5K5pl5l5k6
15371A9OJ4J5RRJ0Rj7j8jJ4J4j7k3qJ1J0mmkkK5K5KLKLJ3J4k4k4m8m8m8j7KL2M1K4RpqQPP
$$ y = [-183, -212, -241, -277, -298, -290, -256, -205, -153, -132, -112, -92, -71, -55, -38, -53, -68, -43, -18, 4, 27, 34, 14, -20, -55, -77, -73, -52, -30, -17, -4, 10, 24, 30, 52, 80, 81, 58, 35, 11, -13, -22, -32, -26, -46, -85, -108, -104, -73, -43, -13, 17, 49, 58, 68, 44, 21, -2, -41, -91, -104, -79, -39, 2, 29, 23, 2, -10, -23, -40, -58, -76, -93, -87, -81, -75, -68, -59, -49, -39, -30, -46, -62, -46, -31, -28, -25, -22, -18, 24, 83, 122, 124, 98, 72, 75, 78, 69, 61, 52, 43, 32, 20, 9, -1, 21, 44, 67, 90, 98, 106, 115, 123, 119, 116, 113, 110, 71, 33, 7, 14, 24, 19, -6, -32, -21, -10, 0, 12, -4, -20, -5, 9, 25, 42, 58, 74, 92, 110, 129, 147, 161, 175, 187, 199, 181, 132, 61, 6, -18, -27, -43, -60, -58, -56, -22, 10, 52, 93, 104, 114, 144, 189, 212, 202, 177, 151, 123, 95, 94, 93, 93, 92, 87, 83, 78, 74, 91, 108, 125, 143, 155, 168, 149, 129, 109, 90, 72, 54, 30, 38, 47, 25, -16, -42, -56, -54, -41, -27, -13, 1, 2, 4, 5, 6, 28, 50, 43, 35, 44, 84, 125, 134, 125, 115, 104, 93, 110, 128, 146, 164, 169, 175, 180, 186, 205, 225, 218, 210, 194, 178, 146, 114, 88, 63, 63, 64, 65, 65, 82, 98, 110, 123, 109, 95, 58, 21, 10, 0, -7, -16, -24, -33, -44, -55, -67, -78, -72, -66, -75, -100, -122, -111, -71, -16, 33, 68, 83, 82, 61, 24, -16, -57, -71, -32, 32, 97, 122, 115, 80, 45, 19, 25, 39, 54, 63, 72, 82, 91, 74, 56, 55, 69, 83, 66, 43, 35, 46, 56, 52, 48, 46, 44, 69, 94, 96, 99, 101, 104, 117, 131, 107, 83, 35, -13, -61, -78, -76, -44, -3, 21, 30, 23, 15, 23, 30, 37]
15351C7QQnnnnQRRQj9k0j9j8J0J2K7K7OOl1l1k1k2oorrQPJ1J1mnk7k7j2j1J8J9J9J9KJKJQ
15331a6QQOonl3l3mnmnPPPPM8M6M8M7opook6k5rOnl1m9n0j7J0J0J1QPQPlkL4L3L1L0J5J4J4
15310A24J3J3J4l3l3j6j7llk9k9j3j3j4j3j2j2j1j2kklkJ%K7K7M5M3K3ljJ4J2nk4m1m0k4m
15293e8J3L2L0QRQRK0K0K0qk4k4JJRRk3k2j9j8klK2K3K4K3j7j7j8j7k7k9j2J4K2Pj4j5%%j
15275d4%K3K1K3K3LLMLRRRRj9k0mK2L4Pk9k9rj0j0rl9l9k4k4J1J0M3M2K7K7K6K6Jk6m3m1J
15257c%JJj4j5J8J6J0J0J0RmnJ1J2K9K9kkj9j9j9j9mnmnj5j4J5J7QPqqk0k2k1k1J7J6J6J6
15238@mmmnj0j0j0j1K7K8nnk1k2k1k2qrPPLML5L5L3L4J8j3m8o6n8k7L1O3M9J6j3j4J4J3ll4
15220c0n6l9j1K1L6L6lmj9j9%JJJPQPQnnool0m5k3QL6J9jkJ8J7L3L4L9M0RQpoppkklkkllk
$$ y = [37, 45, 53, 48, 43, 38, 33, 41, 50, 59, 67, 48, 28, 9, -9, 1, 13, 40, 67, 73, 79, 48, 17, -4, -26, -32, -38, -47, -56, -48, -41, -30, -19, -23, -28, -55, -82, -94, -105, -87, -68, -49, -30, -28, -27, -25, -24, -16, -8, 0, 6, 0, -5, -38, -71, -75, -80, -84, -89, -82, -75, -68, -61, -13, 33, 81, 128, 122, 115, 109, 103, 77, 52, 43, 49, 44, 13, -36, -86, -103, -93, -83, -72, -64, -57, -49, -42, -45, -47, -13, 20, 51, 81, 96, 110, 124, 137, 150, 164, 131, 98, 82, 65, 62, 59, 30, 1, -12, -25, -39, -52, -64, -76, -87, -99, -101, -103, -106, -108, -107, -107, -80, -53, -8, 35, 58, 55, 54, 68, 80, 75, 51, 10, -30, -54, -58, -45, -13, 17, 25, 34, 42, 51, 71, 91, 111, 103, 79, 55, 56, 57, 66, 75, 52, 30, 11, -7, -9, -12, 10, 33, 57, 80, 63, 46, 28, 11, -16, -45, -57, -43, -21, -14, -28, -43, -43, -43, -44, -44, -21, 0, 23, 46, 49, 52, 56, 59, 68, 77, 86, 95, 76, 56, 52, 74, 108, 115, 86, 57, 48, 38, 28, 19, -20, -59, -83, -107, -96, -86, -43, -1, 26, 53, 79, 105, 106, 80, 37, -4, -3, -3, -2, -1, -15, -30, -12, 4, 14, 24, 34, 43, 39, 34, 45, 57, 86, 115, 113, 111, 92, 73, 54, 35, 31, 26, 22, 17, 2, -12, 3, 20, 28, 35, 27, 19, -1, -23, -44, -65, -48, -32, -16, 0, -4, -8, -12, -17, -27, -37, -47, -58, -31, -3, -8, -13, -34, -56, -77, -99, -107, -116, -109, -102, -99, -95, -60, -25, 8, 42, 60, 47, -1, -67, -125, -152, -121, -58, -9, 7, -6, -20, -6, 7, 4, -30, -86, -125, -136, -115, -79, -43, -46, -50, -69, -88, -88, -87, -86, -85, -78, -70, -63, -55, -60, -65, -71, -77, -107, -152, -175, -167, -131, -112, -113, -115, -97, -80, -47, -13, 26, 66, 75, 83, 76, 70, 63, 56, 54, 52, 49, 47, 45, 42, 39, 37]
15198C7j6j5lK9K5QJKkl4l8k4OK2J3J4K5K6poLKLLj1j1j1j1jkjkNNK1K1MNk4k5lK8L4J9ok1
15178H7j4j3nnnnk1j9J0J1J1J1K5K5Pj9k0k0j3j2LLJ5J5%jK7K7K7K7J6J6jk8m4o0o6m0%J5
15161c3QP%%j%PPOPJ1J1J1J1J6J5J4J4nl2k7j0J7J7J8J8j2j3j2j3%%j%lkklj0j1l9m0k4LK0
15141e5K0K0J9MLj4j5JJ%%j5j6OOOOMLMLj4j3j4j4J3J2J2J3J2J2J2J3j4j3j1j2lJ2J7qm0m1
15123g8l2NK6K7ol3j9J9K8K8PPPQl3l3j6J1K7K8J4J2NMNNMLMMMNMNnmnm%%%%J1J1nnK6K5o
15101I5oj5j5j5j5l5l7mnj8j8J4J3J2J2J1J2J5J7K4Pk1m7m7k2%J6RRJ9J9j3j3K0K0J8K0kk
15084C2lkklkkjjjjQQK4K4jkk3l8k8lK1Pj7j8llJ4J4M5M6K6K7nnj1j1j1j1l5l4klLMk7k9p
15064d2oK5K3kmmmJJj4j3j3J9L1L0Pk4l7l8j5j4J7J8RJ0RJ0MMLMJ4J5J5J5J9J9J9K0popok8
$$ y = [37, 21, 6, 3, 32, 57, 65, 66, 68, 66, 32, -6, -30, -24, -2, 11, 25, 50, 76, 69, 63, 66, 68, 71, 74, 63, 52, 41, 30, 29, 27, 26, 24, 29, 34, 55, 76, 80, 85, 61, 36, 33, 61, 95, 114, 108, 87, 73, 60, 55, 50, 45, 40, 19, 0, 10, 21, 32, 43, 68, 93, 100, 81, 61, 41, 28, 16, 19, 22, 37, 52, 52, 51, 78, 105, 132, 159, 175, 191, 190, 162, 118, 58, -8, -48, -48, -33, -25, -18, -18, -18, -19, -19, -12, -5, 1, 8, 19, 30, 41, 52, 68, 83, 97, 111, 106, 74, 47, 37, 54, 71, 89, 107, 95, 82, 70, 57, 57, 57, 56, 56, 53, 51, 49, 46, 36, 25, -14, -54, -78, -75, -55, -35, -15, 4, 8, 11, -3, -18, -17, -16, -16, -16, -31, -47, -41, -35, -29, -23, -19, -16, -12, -9, -23, -36, -50, -64, -51, -39, -27, -14, -2, 10, 22, 35, 21, 8, -3, -15, -18, -6, 11, 3, -37, -78, -110, -105, -79, -52, -58, -91, -110, -91, -63, -35, -28, -21, -14, -6, -39, -72, -88, -77, -50, -22, -8, 4, 9, 13, 18, 23, 27, 30, 34, 38, 42, 47, 51, 56, 51, 47, 42, 38, 38, 38, 38, 38, 49, 60, 55, 50, 76, 101, 95, 89, 74, 59, 44, 29, -6, -43, -47, -52, -70, -88, -74, -61, -49, -37, -26, -14, 1, 18, 42, 49, 28, -19, -66, -88, -88, -72, -63, -54, -35, -16, -29, -42, -22, -2, 16, 36, 34, 32, 29, 27, 25, 22, 20, 18, 17, 16, 15, 14, 22, 30, 54, 78, 77, 75, 52, 14, -14, -17, 4, 11, -6, -24, -27, -30, -16, -2, 43, 89, 115, 142, 137, 132, 121, 110, 99, 88, 53, 19, 17, 14, 17, 21, -6, -35, -42, -48, -23, 0, -2, -6, -10, -14, -13, -12, -26, -39, -52, -33, -2, 28, 35, 11, -26, -64, -79, -93, -76, -58, -49, -39, -30, -20, -16, -12, -9, -5, 9, 24, 39, 54, 73, 92, 111, 131, 124, 118, 111, 105, 77]
15045G7k8k9k7rrK3K2J0J0ooJJJJ%%%%JKJJQQqpjjK9K9J3j8j7j6jjjjj5j5j5j4j6j7j7j7K
15024g2JKKk8k9k6k6KL4N0J8j6j6J3J4L4L5L3L4LKk7k7k9KL6L7L8L9K4pl9l9m3j2llL0L0K2
15007I3K2l2l1m2m2j0j1J3J3J7L3L3Ok1l6k9mJ2J3jjJ3J4L8K2nl2k8kJ4J4KKJ6J6J0j6l2l3
14990Hl1l1%%nol6l5oK1L8L7L1K9jkj7j8lK4L7K2J%J0J0ooJ3J3J3J2l8l9l8l7J1J2J2J1MN
14972A9j2j1k4k5PPPPPOppqpk3k2opk1k2oK0K3PQK4K3K3K2K4NONNqqrqmmnlMMMNJ2J2J3J2
14950F4l1l1l0l1qppqJ1J1K8lk1k2pqMLL5L5K2K1K2K2kkkjj0j0rj0qqpqNNMNj5j6j6j6LKK
14930e0LJ4J4J4J3J0J1J0J0KLKLLKLKj2j3j2j2l3l5l4l4j3j3J8J9QRL8L9M6J5j9k0j1j1J9
14912HK0PPPPk0k0k0k0JJJJLKLLk9k9j6J7L8L7RQPOPOj7j8l3l3k1k1K9L0Ol0o1o1j2J5L2L2
$$ y = [77, 49, 20, -7, -16, -25, -2, 20, 30, 40, 34, 28, 29, 30, 31, 32, 32, 32, 32, 32, 33, 35, 36, 37, 45, 53, 45, 38, 37, 36, 65, 94, 107, 89, 72, 56, 55, 54, 53, 52, 37, 22, 7, -7, -23, -40, -57, -74, -72, -71, -69, -67, -95, -124, -150, -176, -174, -140, -90, -72, -88, -104, -91, -77, -43, -8, 25, 59, 62, 64, 37, 10, -19, -17, 19, 56, 94, 133, 157, 150, 111, 72, 29, 17, 14, 11, 41, 71, 93, 115, 83, 52, 10, -32, -42, -53, -40, -27, -10, 23, 56, 62, 41, 5, -24, -28, -16, -3, -4, -5, 8, 22, 60, 82, 77, 45, 17, 15, 29, 43, 45, 47, 63, 79, 89, 73, 41, 8, -23, -54, -54, -54, -59, -65, -101, -136, -142, -121, -83, -46, -15, 14, 13, 11, -6, -24, -27, -3, 34, 56, 57, 57, 67, 77, 71, 65, 78, 91, 104, 116, 78, 39, 1, -36, -25, -13, -1, 10, 14, 19, 7, -4, -28, -53, -46, -39, -32, -25, -18, -12, -19, -26, -34, -41, -64, -86, -92, -99, -120, -142, -148, -128, -105, -98, -90, -66, -43, -20, 2, 26, 31, 37, 42, 47, 39, 31, 22, 14, 10, 6, 1, -2, 2, 6, 10, 15, 27, 39, 52, 64, 33, 2, -28, -59, -67, -74, -81, -89, -78, -67, -39, -42, -63, -85, -92, -100, -96, -93, -58, -23, -1, 20, 42, 64, 62, 60, 58, 57, 47, 37, 28, 18, 10, 2, -5, -13, -8, -3, 1, 6, -9, -25, -41, -57, -54, -52, -50, -47, -33, -19, -5, 8, 18, 29, 39, 49, 51, 54, 56, 59, 62, 64, 67, 69, 57, 44, 32, 20, -13, -48, -82, -116, -129, -142, -124, -105, -97, -88, -50, -11, 35, 50, 31, 11, 0, -11, 8, 28, 35, 42, 49, 56, 36, 16, -4, -24, -23, -22, -21, -20, -17, -15, -12, -9, -38, -67, -83, -66, -28, 9, 18, 26, 33, 39, 46, 52, 35, 17, -16, -49, -70, -91, -62, -32, -26, -56, -117, -178, -190, -175, -143, -111]
14893a11K5K6K5K6ppppppppL9L9M0L9%%%%j5j6j5j6l0l0l1l1QQk2k3jK4J9Lj0rj1j1K4K4K4
14874d5K4J2J1J2J3JKKK8M0K5rk5j9j8j9k0pqK4K4jkjkk8k8k8k8j5j5j5j5LLKLNNNNJ2J2j9
14855i4j9llK9K9M1M1QRKk5l8m0j8PK5K5K1K1NOpok7m3l1nLJ8J2J2J3J2pk3l2jN0M9J8j4j8
14837Bklk0k4k3J0M2N0N2J9j2NK1K7mk8k8l0l0j3j2j2j3k3k3qK2N6N6M3J1Jj4l8l7k0J0K3
14820C3K3Qk3l6l4k8MJ8J8%%%%J7J5J6J5Rpj0m2n2l6lJ3K7K6K7K6K7J1Pk6l5l5l7l8rrqrK0
14802a17K0K0K1J1J1J2J1RRRJ0LMj1m1m9m9qM5O0M3Kk9l0JL3L2j0k5nK7Lj3kkNOOOk0j9qK2
14784CK1j1k2k3J3J3J2J4j%%jkknmml5n6m1K8N9M8L3J5j8l2l1l4l5l5l5PQPPK9K8K9K9L0L2
14765C8j%opnnJ7L3M2J0j7j8J2J2jjkjk0j9k0k0J1J2kl3l7k2jjk1k0j8j9qK3J5jk4k3J0M2
$$ y = [-111, -86, -60, -35, -9, -16, -23, -30, -37, -44, -51, -58, -65, -26, 13, 53, 92, 92, 92, 92, 92, 77, 61, 46, 30, 0, -30, -61, -92, -84, -76, -98, -121, -122, -98, -79, -76, -86, -95, -106, -117, -93, -69, -45, -21, -9, 2, 14, 27, 28, 30, 32, 60, 100, 125, 116, 91, 72, 54, 35, 15, 8, 0, 24, 48, 47, 45, 44, 42, 14, -14, -42, -70, -85, -100, -115, -130, -127, -124, -122, -119, -114, -109, -104, -99, -87, -75, -94, -113, -116, -119, -90, -61, -20, 21, 29, 38, 40, 15, -23, -63, -81, -74, -49, -24, -3, 18, 23, 29, 22, 16, -11, -54, -85, -90, -87, -69, -57, -45, -32, -20, -27, -50, -82, -83, -33, 16, 34, 20, 2, 0, -3, -23, -47, -70, -60, -18, 32, 84, 103, 91, 96, 117, 144, 140, 112, 84, 54, 24, 11, -1, -13, -26, -49, -72, -80, -58, -2, 54, 97, 108, 109, 95, 57, 20, 0, 10, 33, 56, 64, 41, 5, -29, -57, -53, -35, -17, -17, -17, -17, -17, 0, 15, 31, 46, 55, 48, 38, -4, -56, -92, -95, -82, -55, -29, -2, 24, 51, 62, 69, 43, 8, -27, -64, -102, -111, -120, -128, -137, -117, -97, -77, -56, -45, -34, -22, -11, -2, 7, 16, 26, 29, 33, 22, -19, -68, -117, -125, -80, -20, 23, 25, -4, -34, -33, 0, 32, 22, -3, -8, 19, 22, 9, 7, 5, 10, 16, 22, 28, 8, -11, -19, 3, 24, 13, -9, -32, -19, -6, 6, 20, 19, 19, 19, 18, 16, 14, 9, 5, 1, -34, -90, -131, -103, -44, 4, 37, 52, 34, 2, -29, -63, -98, -133, -168, -161, -153, -146, -139, -110, -82, -53, -24, 6, 38, 37, 37, 31, 24, 19, 14, 31, 64, 106, 116, 99, 81, 93, 105, 104, 103, 101, 100, 80, 61, 41, 21, 32, 44, 42, 9, -28, -50, -51, -52, -73, -93, -111, -130, -138, -115, -100, -101, -125, -148, -138, -96]
14747i6L6L7L6L7L3J7rm1k7k6k8k9m2m3k8L%%KKK3K3J0k2j8kL1M6M1K5LLJ4J6J5J5jjj2LR
14729E5j7j1NK2K1Ok1j8j7j9j8J5J6J6J5K1K1Nk2l3j6MMJ0RRJ0j6j5j4j3k9mJ4J2RRql3l6
14712e2l6ooJ1J1J1J1j6j6j6j6%%%%K9K9K9K9qpqpQPQQj1j0K2K0j0qj0j0llllK1K0K1K0J6
14693F6J6J6J5K4K4K4K3j9k0j9k0k0j9k0j9k3k3k1k3rrj0rQPQPLLL5L4j6j5j6j7j4j4j4j4
14676i0M1M0M0M1JKJJpqpp%J%JooonLLL6L5J2J3k0j9J2J2J2J2QRrl4m2m2k7%J7J6J9J9lml
14656F2ll5l3l5l5LLL5L5LKLMlllj%J%JJ4J4J4J5JKKKKKKKk9k9k8k9mmJ7L3K9Lk3l9l8k3j
14635i2j%%K0L7K6jj6j6J6J6J6J6mmnmqrrj0L2L2JJmlmlJ8J8J8J9j6j5j5j5l2l4jjPPPPmm
14615a6mmJ3J2J3J3K3K3j9l5pK0J1mk5m0k2J4L7L8j2j2l6l6l4l5mK3J7JppppJ4L0L5J0k8k7
$$ y = [-96, -60, -23, 13, 50, 83, 100, 91, 50, 23, -3, -31, -60, -102, -145, -173, -170, -170, -170, -168, -166, -143, -120, -110, -132, -150, -152, -121, -75, -34, -9, -6, -3, 11, 27, 42, 57, 56, 55, 43, 46, 55, 38, 27, 32, 54, 75, 81, 60, 42, 25, 6, -12, 3, 19, 35, 50, 71, 92, 97, 75, 42, 26, 30, 34, 44, 53, 62, 72, 56, 41, 27, 14, -15, -19, -5, 7, 16, 25, 17, -16, -52, -88, -94, -100, -89, -78, -67, -56, -72, -88, -104, -120, -120, -120, -120, -120, -91, -62, -33, -4, -12, -19, -27, -34, -26, -19, -11, -3, -14, -24, -2, 18, 8, 0, -10, -20, -23, -26, -29, -32, -11, 9, 30, 50, 66, 82, 98, 113, 137, 161, 185, 208, 189, 169, 150, 130, 110, 91, 71, 52, 29, 6, -15, -38, -47, -56, -66, -75, -67, -60, -52, -45, -42, -39, -4, 30, 14, -1, -17, -34, -48, -62, -76, -90, -49, -9, 31, 72, 73, 75, 76, 77, 70, 62, 55, 48, 48, 49, 49, 50, 44, 38, 32, 27, 30, 33, 69, 104, 116, 129, 109, 90, 102, 114, 126, 138, 146, 155, 146, 112, 70, 28, 1, 1, 18, 34, 53, 72, 69, 65, 62, 59, 24, -9, -44, -79, -76, -73, -38, -3, 0, 2, 5, 9, 6, 3, 0, -1, -1, 0, 0, 1, 15, 29, 43, 58, 59, 61, 63, 65, 67, 69, 71, 73, 44, 15, -13, -42, -46, -50, -33, 0, 29, 32, 9, -30, -68, -91, -92, -93, -93, -93, -73, -36, -10, -11, -27, -43, -27, -11, 5, 21, 17, 13, 8, 4, -4, -13, -22, -32, 0, 32, 33, 34, 30, 27, 23, 20, 38, 56, 74, 93, 77, 62, 47, 32, 0, -34, -35, -36, -29, -22, -15, -8, -12, -16, -20, -24, -11, 1, 14, 27, 50, 73, 54, 19, 12, 32, 43, 39, 14, -26, -48, -34, 3, 41, 29, 17, -19, -55, -89, -124, -128, -105, -88, -87, -94, -101, -108, -115, -101, -71, -36, -26, -54, -81]
14597h1j3J5K8K8kkj1j1rj0PL3K7J0nmopn1n1k0j9popoppK5K5J3J3J3J3L2L3%%j8j8j7j6j6
14579a12J1L9N4L9J4lkj2j1l2m9l3oJ0RK2K3K4K3J9M5P5M8Ol0m3m4k5k6k5k5rqrqk5k4j1K2
14562h9L0L0L1L1j1j1j1j0llllk1k0J2M4L6Ok7k7k0k0k0k0J9J8J7J8j6l1qK3M0L9J0J1JJJ
14545D4%J1J0J0J0POOOqrqrJ0J0J0J1lkkkJ4J4j8j8j6j5J5J6qqppjJ4K4rn5n5k6k6qrK3K4
14525c4J5J5M3M3J6l8n9n8n5l9j2J9L2L2L2L2K6oj9j9lmllonnnkjkjJ7J7J7J7QRRRNNNOj7
14506C3j6j6j5l3l3l2l3j8j8J4J4M1M1RRJ8J8Lk4l8j3LL%JJJK6K7K6K6j1j1j0j1mmmmK3K3
14488A2QQK1K1Mk2k3k3prj7j7kjJ6J6jk7m4m4NM3N0K4lj9k2k3pqJ8J7Kk5l0j3QQNMK5M1K6
14469ej1l0j4J3J2RpKK8L6K1mk0j2j2KJJKk4k5k5k4j1j0K1K2K1K2j0j0k2k1J0J1J2J3J2J3
$$ y = [-81, -94, -79, -51, -23, -25, -27, -38, -49, -58, -68, -61, -28, -1, 9, 4, 0, -6, -13, -64, -115, -135, -154, -161, -167, -174, -180, -187, -194, -169, -144, -131, -118, -105, -92, -60, -27, -27, -27, -45, -63, -80, -96, -112, -101, -62, -8, 31, 45, 42, 40, 28, 17, -15, -64, -97, -103, -93, -84, -62, -39, -15, 8, 27, 72, 147, 195, 201, 171, 128, 84, 59, 33, 8, -17, -26, -34, -43, -51, -76, -100, -111, -89, -59, -29, 2, 33, 22, 11, 0, -10, -13, -16, -19, -22, -43, -63, -51, -7, 29, 35, 8, -19, -39, -59, -79, -99, -80, -62, -45, -27, -43, -74, -82, -59, -19, 20, 30, 41, 42, 43, 44, 44, 55, 65, 75, 85, 92, 98, 104, 110, 102, 93, 85, 76, 86, 96, 106, 117, 114, 112, 110, 108, 122, 136, 118, 100, 84, 69, 84, 100, 92, 84, 77, 70, 69, 83, 107, 98, 43, -12, -38, -64, -72, -81, -58, -34, -19, -4, 39, 82, 98, 60, 1, -57, -112, -151, -163, -144, -112, -80, -48, -16, 10, 4, -15, -34, -37, -41, -44, -47, -53, -58, -63, -68, -70, -71, -73, -74, -57, -40, -23, -6, 2, 11, 20, 29, 34, 39, 44, 50, 33, 17, 1, -14, -47, -80, -112, -145, -163, -181, -167, -153, -112, -71, -62, -53, -35, -17, -14, -38, -76, -89, -86, -83, -83, -82, -81, -80, -54, -27, -1, 25, 14, 3, -7, -18, -22, -26, -30, -34, -11, 12, 20, 28, 49, 70, 74, 52, 29, 6, -1, -10, -27, -44, -46, -47, -31, -15, -16, -43, -87, -131, -126, -83, -33, -9, -12, -31, -53, -76, -83, -91, -73, -56, -54, -79, -109, -122, -114, -106, -101, -97, -72, -31, -5, -16, -46, -60, -47, -35, -26, -33, -31, -3, 33, 54, 50, 30, 18, 6, 8, 9, 10, 12, -12, -37, -62, -86, -97, -107, -86, -64, -43, -21, -31, -41, -63, -84, -74, -63, -51, -38, -26, -13]
14452a3llllLLJ8J8J5J4j7j8j1rj1j1J1J1J0J1j3j4j4j4j4j5j4j4j1j1j2j2j4l0rK2M7J6j5
14435a29j5J5M7N9N9M7L1Ok6l1j5OOk5k5j0K0J8J9NNqqk4k4k7k8MLJ0Rk2k2RRRQK0J8Nk5k8
14417d5k7j4j4j0j1ONnoJ1J0L1L0jjQQK1K1j1m2m9l3j8jj0rJ1J0M3M2M8M7J7J6RQj2k9l0J
14400B5L5L5J8J7l5l5n0m8j7j8K1K1K0K0K9K8K7K6K4qk2k2m1m1l9m1J1J0J1J0J1J0RJ1J1J1
14384C4J0J1J1J1J0J1j7j6j7j7PPPPqqqqj8j7J3J4K0J9K0J9j4j4m6m4k3k3RRJ3J3J3J2prr
14366b3rMMN4N6L9Roomll6l5m6m6lN1O4O5J3k0m3m3j0K1M0M1j5m5l5l3nmKKJKk1k2j9k0j1
14348i5K0N3N2K5pJ1J1j6j7j7j6k1k2k1k2j6j5J6J6opooMLMMK7K7K7K7rrrrRJ0k3k3k0k1J2
14330g5J1J7J8j4j4J2J2J2J1%%l0l0J0L7K2K1K4K4qpj9j9j8j9NNMNlllmj4j5j4j5J2J1J1J1
$$ y = [-13, -16, -19, -22, -25, -22, -19, -1, 17, 32, 46, 29, 11, 0, -9, -20, -31, -20, -9, 1, 12, -1, -15, -29, -43, -57, -72, -86, -100, -111, -122, -134, -146, -160, -190, -199, -177, -130, -114, -129, -144, -129, -82, -23, 36, 83, 114, 120, 94, 63, 48, 54, 60, 35, 10, 0, 20, 38, 57, 62, 67, 59, 51, 27, 3, -24, -52, -48, -45, -35, -26, -48, -70, -61, -52, -43, -35, -15, 3, 8, -17, -45, -72, -86, -100, -110, -121, -115, -110, -115, -121, -110, -100, -69, -39, -40, -41, -33, -25, -4, 17, 6, -36, -85, -118, -136, -137, -147, -156, -145, -135, -92, -50, -2, 45, 62, 78, 87, 95, 83, 54, 24, 25, 60, 95, 113, 130, 95, 60, 10, -38, -55, -73, -52, -31, -11, 9, 38, 66, 93, 119, 143, 135, 113, 91, 50, 9, -30, -71, -60, -50, -39, -29, -18, -8, 1, 12, 23, 34, 44, 55, 66, 77, 87, 98, 81, 65, 48, 31, 38, 45, 52, 59, 51, 43, 35, 27, 9, -8, 5, 19, 39, 58, 78, 97, 83, 69, 23, -21, -44, -67, -58, -49, -36, -23, -10, 2, -5, -14, -23, -32, -28, -24, 30, 86, 125, 134, 128, 122, 118, 115, 79, 44, -2, -48, -51, 0, 64, 129, 142, 122, 79, 36, 26, 47, 87, 128, 113, 68, 33, 0, -5, -9, -7, -5, -4, -2, -23, -45, -64, -84, -95, -75, -22, 30, 55, 48, 59, 70, 54, 37, 20, 4, -17, -39, -60, -82, -98, -113, -97, -81, -87, -94, -100, -106, -102, -99, -95, -91, -64, -37, -10, 17, 8, -1, -10, -19, -10, 0, -23, -46, -66, -87, -75, -64, -47, -29, -43, -57, -45, -33, -21, -10, -10, -10, -40, -70, -60, -23, -1, 20, 44, 68, 60, 53, 34, 15, -3, -22, -17, -12, -8, -3, -6, -9, -12, -16, -30, -45, -59, -74, -62, -51, -40, -29]
14312b9j7j8kK5K2Pj4j5J2J3J2J2qqqqPPOOk0k1lK2M6M6J0j6j5j4j7j6j5j7j6j7J1J1J0J1
14295a8M5M7J5J4k2k3n3n2m9k3OK3JKLLK2K3K3K2kkkkJ4J4kkrrK3K3M6M7L1%k5m1l4l4k0k0
14276Cj8k0NNONKLJ8J9j4j3jL1N5L9OrOONNNMNNj5j6Kk9l2l1l4l2k1k0k0k1K0K1K0K0l3l4
14257i2l3l3QQL9M0L1L1J3J5K9K8K8K9LMKLk1l8m6j4j3j4j1j1k7k6j0j0L3L3JKoonok1k1k0
14240a04k0LJ9K8lrrj0j1J0RJ0J0mmlmJ5J4J4J5onK6K5QQk2k4m2m3k8LJ4J5L2L2L2L1J%j5
14221Hj4J5J7QPk4k3PQK4K3QQk4k4kkJ4J4qqK4K4K8K8J2J2rj0m1m1m1m0m1m1kkklonqK4O2
14202d6O2L1kj2MM3M4Pk5m7l1NK1Jl1l6k0%%J9J8J8J9KKLKj2j2j2j2j1j3j2j2J2K7K1j1k9
14185b5j4J8L3K5Rj3j3j4j4JJK0K1K0K1j6j6j7j7m4o2l9qK9K9J5J5J6J7KKJ1K6K1j1l7k2R
$$ y = [-29, -46, -64, -66, -41, -19, -12, -26, -41, -29, -16, -4, 8, 0, -8, -16, -24, -17, -10, -4, 2, -18, -39, -42, -20, 26, 72, 82, 66, 51, 37, 20, 4, -11, -28, -44, -61, -50, -39, -29, -18, 27, 74, 89, 103, 81, 58, 5, -47, -96, -119, -113, -90, -89, -87, -84, -81, -59, -36, -13, 9, 7, 5, 3, 1, 15, 29, 27, 25, 16, 7, 30, 53, 99, 146, 177, 177, 152, 111, 77, 43, 23, 3, -15, -35, -30, -25, -19, -14, -12, -9, 9, 28, 14, 1, 0, 31, 86, 125, 131, 122, 128, 134, 139, 144, 149, 153, 158, 163, 148, 132, 134, 105, 73, 42, 8, -24, -45, -65, -85, -106, -86, -65, -45, -25, -58, -92, -125, -158, -150, -142, -103, -63, -32, -1, 12, 27, 56, 84, 112, 141, 144, 148, 150, 153, 132, 94, 48, 34, 21, 7, -4, -15, -42, -68, -78, -88, -55, -22, -21, -19, -25, -31, -36, -42, -63, -84, -104, -124, -121, -102, -74, -77, -86, -95, -105, -116, -106, -97, -87, -77, -81, -85, -88, -92, -77, -63, -49, -34, -40, -45, -19, 6, 14, 22, 0, -24, -66, -109, -137, -134, -120, -105, -73, -41, -9, 22, 23, 23, 8, -6, 9, 26, 34, 41, 17, -6, 1, 9, 33, 56, 64, 72, 48, 24, 22, 20, 34, 48, 40, 32, 56, 80, 108, 136, 148, 160, 151, 141, 100, 59, 18, -22, -63, -104, -106, -108, -110, -113, -119, -124, -132, -108, -46, 16, 47, 45, 33, 37, 80, 124, 131, 106, 59, 28, 33, 54, 55, 24, -12, -32, -32, -32, -13, 5, 23, 42, 44, 46, 49, 51, 39, 27, 15, 3, -8, -21, -33, -45, -33, -6, 15, 4, -25, -39, -21, 12, 37, 46, 33, 20, 6, -8, -7, -6, 14, 35, 55, 76, 60, 44, 27, 10, -34, -96, -135, -143, -114, -85, -70, -55, -39, -22, -20, -18, -7, 19, 40, 29, -8, -30, -21]
14168b1K3Nk7j1K0L2J7lmJ6J6jjPrl3o4o2l1j5J7L8L8K4K4J2J3K9L0J9J9Ok7l0l0%%llklj2
14150A3j2%L2L3Jj1j1j3j4j8l3l0KJ5J5K0K0K0K1L1L1L8K2j2m4l5j9j8kjj7m3m3j2K0K0j2
14134d6l1j6J7L2K5K4K1K2Pk4m8m9j7J6L0L0L1L2LLk9k9rrPOk2k2qK3K9K7jjj6j5j7j6k5k4
14117h9n5n5k5JJ0K7L5N2N1L6kj8rj0mmJ3J2kkL0K9J9K0j2j2l2l2l1l2J3K9Mk2k1OK1K1M1
14100AM3M9L3lm1p2p1o0l4mJ1J7J6L4L4K1K1j1j0j5j4j4j5rj0rj0KKLKNNNNJ9J9K0J9J4J3
14082A1J4J4L2L2ol3m5m4j5j5j5j5JK7M1J4k2k2JKJKj1j2j1j1OOPOqppqKKMMOL7K7J0qk5k5
14063e6rJ1K6K7J0J2J1J1J1j5j4j5j4j2j3j3j2j0rNL7N1N2M1Qj5j6j8j8j0j1j0j0K7K8K8K7
14047A23nnonkkklnnJ1J1J4J4k8m4j4J8J8j3k9j3%j5m0n6l4kJ7L2M2M0L3L4KJk7k8k7k8mm
$$ y = [-21, 2, 7, -20, -31, -11, 21, 38, 35, 31, 47, 63, 62, 61, 68, 59, 26, -38, -100, -131, -146, -129, -91, -53, -29, -5, 7, 20, 49, 79, 98, 117, 123, 96, 66, 36, 36, 36, 33, 30, 28, 25, 13, 1, 1, 33, 66, 67, 56, 45, 32, 18, 0, -33, -63, -61, -46, -31, -11, 9, 29, 50, 81, 112, 150, 172, 160, 116, 81, 62, 44, 42, 41, 24, -19, -62, -74, -54, -34, -46, -77, -93, -76, -44, -19, 5, 26, 48, 55, 31, -17, -66, -83, -67, -37, -7, 24, 56, 59, 62, 33, 4, -5, -14, -7, -1, -23, -45, -53, -30, -1, 26, 25, 24, 8, -7, -24, -40, -65, -89, -144, -199, -224, -223, -213, -186, -151, -99, -48, -12, -14, -32, -41, -51, -55, -59, -46, -34, -36, -38, -8, 21, 40, 60, 48, 36, 4, -28, -59, -91, -78, -49, -45, -67, -88, -82, -61, -40, 1, 44, 93, 126, 123, 82, 10, -61, -121, -155, -159, -148, -131, -115, -81, -47, -26, -5, -16, -26, -41, -55, -69, -84, -93, -103, -112, -122, -120, -118, -115, -113, -108, -103, -98, -93, -74, -55, -35, -16, -2, 11, 25, 39, 71, 103, 97, 64, 19, -25, -40, -55, -70, -85, -84, -57, -16, -2, -24, -46, -45, -43, -42, -40, -51, -63, -74, -85, -79, -73, -66, -60, -68, -75, -82, -90, -88, -86, -82, -78, -72, -35, -8, 2, -6, -31, -56, -65, -54, -28, -1, 9, 21, 32, 43, 54, 39, 25, 10, -4, -16, -29, -42, -54, -64, -73, -68, -31, 20, 72, 113, 121, 106, 90, 72, 54, 44, 33, 23, 13, 40, 68, 96, 123, 118, 113, 107, 102, 100, 98, 96, 93, 88, 83, 94, 105, 119, 133, 105, 61, 47, 65, 83, 70, 41, 28, 28, 13, -27, -83, -117, -119, -102, -70, -28, 12, 45, 79, 81, 82, 55, 27, 0, -28, -32, -36]
14028c6mmONpl9m3k7oopoK5K5OPOOJ4J3K9K9L1L1%%k1k1k0k1j8j8J3J3POPPQRPRj3j1j2j3
14009c4j8j8J3J3nnnnkjkkL2L3M8M9K8K8lmk1k1onjjj7j7mmnmjjkjNNNNmmmmOOPOpqRQk0k1
13985A9j1K5L6RJJ7K5J0j2j2ppRRK0K1j1j2k3k4k3k3l4l2jkJ2J2K7K7J3J3lkk3k3RRJ6J5J6
13967H5J5nnpoj6m1m6j0M1N7N8M2J2k5m6l0j7j8l2l1k0j9mmJ0J1k0k0J1L7O2M6K0Mj0k7n2
13951@n1k1k1LMMMRRRRJ3J4j8j8popoqrqrk2k2k0k0lK4M1M1OOOP%%J%RQQQK9J3j3m0m8k1J4
13929i9J5MLj1J5L6L5L5L5J3j4l1l0opppmnnnJ4J3J3J2J5J4j7j7j6j6J5J4J4J3j8j8j0j0j0
13912c5j0ooK6K6K7K9K8K8RQk2k2J0K5L0Mj3l0l1j6K6K6nnj2j3J9J9MLMMklkkj5j6j3j3k9
13894C4LL9L8K5K5ppk8k9k8k9j3j3J9J9RRRRj9k0j9k0%jjjk0k0k1k0OPOPJ7J8j4j4k0k0k0
$$ y = [-36, -40, -44, -38, -33, -40, -79, -122, -149, -155, -161, -168, -174, -149, -124, -118, -111, -105, -99, -85, -72, -43, -14, 17, 48, 48, 48, 27, 6, -14, -35, -53, -71, -58, -45, -38, -32, -25, -18, -10, -1, 6, 15, 2, -9, -21, -34, -52, -70, -57, -44, -49, -54, -59, -64, -66, -67, -69, -71, -39, -6, 42, 91, 119, 147, 144, 140, 119, 98, 92, 87, 86, 85, 68, 51, 47, 43, 38, 34, 33, 32, 30, 29, 34, 39, 44, 49, 45, 41, 37, 33, 39, 45, 52, 58, 51, 43, 52, 60, 40, 19, 8, 33, 69, 78, 79, 96, 121, 131, 119, 107, 100, 93, 102, 111, 131, 152, 141, 129, 106, 82, 59, 36, 2, -30, -31, -33, -21, -9, 18, 45, 58, 71, 68, 66, 43, 20, 29, 38, 54, 69, 85, 100, 95, 90, 83, 77, 61, 20, -26, -36, 5, 62, 120, 162, 174, 149, 103, 73, 56, 38, 6, -25, -45, -64, -68, -72, -62, -51, -71, -91, -80, -43, 19, 65, 85, 89, 79, 52, 0, -51, -72, -93, -90, -86, -82, -78, -69, -60, -51, -42, -29, -15, -33, -51, -58, -64, -71, -77, -85, -94, -102, -111, -133, -155, -175, -195, -198, -174, -133, -92, -86, -80, -74, -67, -67, -67, -66, -66, -57, -49, -41, -33, -4, 9, -4, -44, -92, -113, -99, -84, -80, -77, -88, -73, -37, -2, 33, 68, 81, 67, 36, 6, 0, -7, -14, -21, -25, -30, -35, -40, -26, -13, 0, 12, 27, 41, 24, 7, -9, -25, -10, 4, 18, 31, 13, -5, -15, -25, -35, -45, -51, -57, -31, -5, 22, 51, 79, 107, 116, 124, 102, 80, 90, 115, 145, 149, 136, 106, 75, 59, 85, 111, 106, 101, 89, 76, 95, 114, 118, 121, 125, 129, 127, 124, 122, 120, 105, 89, 76, 63, 34, 37, 76, 114, 139, 164, 157, 150, 122, 93, 65, 36, 23, 10, 29, 48, 57, 66, 75, 84, 65, 45, 26, 6, 6, 5, 4, 3, -17, -37, -58, -78, -72, -65, -59, -52, -35, -17, -31, -45, -65, -85, -105]
13875a05k0K8K8K7K8M5M6M6M6klkkJ5J5j6j6k7k7k6k7opK5K5ooooKKJ6M8M6M7J7J7L2L3L4
13858C58L4O0R1J28J28J52J83J97J97K08K09J72N7r1j85k32k33j98j66j31j32r7r6r5r5p0
13847C53l8k4k4k1k2k1k2j9k0j9k0k3k3J4J4K5K4QRj5j4l0l0l6l5j6J0J6rl0l1MMjj8rJ7K7
13830d5K8K5K6J5j2k9k8j5j5K6K5K6K6pqppl1l1l2l1J8J9J9J9%%J%M3M4N2L6jk7j3j3j9j9
13813E8j9j8L0L0L7K2j5m1l6k0LMMNj4j4k8k8rJ7K9K8K4K4j2j3j9k0J6J6J1j6k7k6opK1J9
13797A0mnlmRJ0J0J0rqrpPPQQJ6J6J3J4pl8l9nJ6J7K1j1k5k4qK2K1K1K1K1M2J0j9k0k3k3l6
13778B3l6k9LK2K1K1K1K0K1KKJKLMk3k3rqqrOOk9k8l6nK6K5K1K2mmj5j3KJLJLKPQj9j9n1n1
13758a20m3j2JJLKJ8J7L4L3K1K1onkjJ4J4K7K9%l1k3PK4K4ooonj2j2j0j2mnnmLLMLk0k0l8
$$ y = [-105, -125, -97, -69, -42, -14, 31, 77, 123, 169, 167, 164, 162, 160, 175, 190, 174, 158, 131, 104, 78, 51, 45, 38, 63, 88, 82, 76, 70, 64, 66, 68, 84, 132, 178, 225, 242, 259, 291, 324, 358, 392, 452, 543, 671, 799, 951, 1134, 1331, 1528, 1736, 1945, 2117, 2174, 2083, 1898, 1666, 1433, 1235, 1069, 938, 806, 709, 613, 518, 423, 353, 315, 291, 267, 246, 224, 203, 181, 162, 142, 123, 103, 80, 57, 71, 85, 110, 134, 142, 151, 136, 122, 92, 62, 26, -9, -25, -15, 1, -8, -38, -69, -65, -61, -62, -80, -89, -72, -45, -17, 8, 34, 49, 37, 8, -20, -35, -50, -24, 1, 27, 53, 46, 38, 31, 24, -7, -38, -70, -101, -83, -64, -45, -26, -26, -26, -25, -25, 18, 62, 114, 150, 149, 122, 109, 96, 77, 58, 39, 21, 51, 81, 118, 140, 125, 84, 48, 28, 31, 35, 39, 44, 30, 16, -12, -40, -49, -32, -3, 25, 49, 73, 61, 48, 29, 9, 25, 41, 52, 36, 9, -17, -23, -30, -9, 10, 6, 1, -2, -6, 3, 13, 23, 33, 24, 16, 7, 0, 7, 14, 22, 30, 46, 62, 75, 89, 82, 44, 5, 0, 16, 33, 54, 43, 18, -6, -14, 8, 29, 50, 71, 92, 134, 144, 125, 105, 82, 59, 23, -13, -42, -39, -17, 4, 25, 46, 66, 87, 89, 91, 92, 94, 97, 101, 78, 55, 46, 38, 30, 21, 27, 33, 4, -24, -60, -65, -39, -14, 7, 29, 25, 21, 6, -7, -5, -4, -1, 0, 3, 5, 12, 20, 1, -18, -69, -120, -163, -175, -174, -173, -170, -168, -150, -133, -99, -66, -45, -24, -30, -35, -37, -38, -24, -10, 17, 46, 46, 15, -8, -1, 23, 47, 41, 35, 29, 24, 12, 0, -10, -22, -26, -31, -36, -40, -37, -34, -30, -27, -47, -67, -105]
13738a05oK5K4K7K6RPj7j8l7l7rM5N7N6Mk7j3j2j6j5k8k8k9k8K9K8K9K8kjkkj1j1j1j1J6J5
13722e1J6J6J6J6j4j6NMMMJKKLNNONj4j5j3j5k3k3k3k3j2j3J9K0K7K7mnj1j2K0K0mmmm%%j
13702f1%K3K3Rk2l7l6mK8L5L5NMNMMNj0rm1m1k2k1J0J0NONNJ7J6J7J6j3j3j3j4NNk7k7qqq
13683a38qL4L5L4L4J9K0j1j2OOOOj9j9j9k0J1J1J1J1K4K6K5K6%%J%k9k8k9k8j1j1K1K0KJK
13666A0KllllLKLLL3L4J8rk7j1j1k7l9k4J0K6J6J7J8J8j5j5j5j5j2j3J9J8J8J7Jk6k4k4k5
13648e8k4j1J7L3L2JJJ%J1J2J2J2RRJ0Rk4k3k4k3oopoj2j3LL0K9J2qqj3j4m3m3k2OK2K2LM
13630h8MMj2j1j1j0K0L5M2J5qqj0rKKKKj5j5j5j5rrrj0k5k5POK8K8M3M4J3J4klqrk6NK9K7
13611A0J4J4K2K3j0rk2k2poJ5J6j%LLJ9J9J6J6J5J6j3j3j3j3l3l2l2l3J1J1J1J1oooorj0j0
$$ y = [-105, -111, -86, -62, -35, -9, 0, 7, -10, -28, -65, -102, -111, -66, -9, 47, 51, 24, 11, -1, -17, -32, -60, -88, -117, -145, -116, -88, -59, -31, -33, -34, -36, -38, -49, -60, -71, -82, -66, -51, -35, -19, -3, 13, -1, -17, -12, -8, -4, 0, 1, 3, 5, 8, 13, 18, 24, 29, 15, 0, -13, -28, -51, -74, -97, -120, -132, -145, -126, -106, -79, -52, -56, -61, -72, -84, -64, -44, -48, -52, -56, -60, -60, -60, -61, -61, -38, -15, -6, -28, -65, -101, -105, -77, -42, -7, -2, 2, 7, 11, 15, 20, 10, 1, -40, -81, -103, -124, -114, -104, -99, -93, -88, -83, -66, -50, -33, -17, -30, -43, -56, -70, -65, -60, -87, -114, -122, -130, -138, -146, -112, -77, -43, -9, 10, 30, 19, 7, 13, 19, 25, 31, 12, -7, -26, -46, -35, -24, -13, -2, 22, 48, 73, 99, 99, 99, 100, 100, 71, 43, 14, -14, -25, -36, -15, 5, 7, 8, 10, 12, 9, 6, 3, 0, 3, 5, 8, 11, 44, 78, 96, 87, 60, 49, 38, 11, -28, -52, -42, -16, 0, 17, 35, 53, 38, 23, 8, -7, -19, -32, -13, 5, 23, 40, 41, 15, -9, -33, -58, -82, -93, -76, -43, -11, -10, -9, -8, -8, 3, 15, 27, 39, 48, 57, 67, 76, 52, 29, 5, -18, -24, -30, -37, -43, -55, -68, -65, -35, -6, 6, -2, -10, -23, -37, -80, -123, -145, -139, -117, -95, -92, -88, -84, -80, -92, -103, -114, -124, -104, -69, -27, -12, -20, -28, -38, -47, -45, -43, -41, -39, -54, -69, -84, -99, -108, -117, -126, -136, -161, -186, -179, -173, -145, -117, -74, -30, -17, -3, -5, -8, -16, -25, -51, -46, -17, 10, 24, 38, 60, 83, 73, 64, 42, 20, 13, 7, 22, 38, 37, 37, 40, 43, 62, 81, 97, 113, 128, 144, 131, 118, 105, 92, 59, 27, -5, -38, -27, -16, -5, 6, 0, -6, -12, -18, -27, -37, -47]
13593d7ronK7K7llkloopqj6l2k6PJ7J7j3j3ppL5N0N1J9l4l6j3j3j8l4k6NJ9J9K4K4K4K4OO
13574HOPk3k3k3k3qrk4k4rj0ML6N5N4M2J1j9j9nmmnJ1J1NMk6k7l0l0KKJ6J6J6J6J8J7J8J8
13556D8OOONNNk7k7k2k1noNNK1K1J8J9j3j3KJL3L2K5Rj5m7m5j5J9J9k5k5k4k5lkM0N4L8Ok8
13537F0k7j1j1j1rm5m6k3L0M0K4MMK2K2OPj2j2j2j0l2l2l2l2J9K0J9K0J3J4J3J4L0L1%jj0
13521D4j1j0j1j2j2j3j2J4J4J3J4J4J3J3J3lmkl3l5l7J5J4%J%%j4j4j4j4lkJ4J3MLM4O1M3
13503A08J1j1MJ9Ll0m6l0j5rqk4k3l8l7k0J2J0RJ0J0M1M2L8M0j4j3j7j6j3j4J1M3M2J0nk1
13487E9l0k9qqK3K4J3J3j8j7J1K6Mk7l9m0j0j1K4K4K3K4jjJ2M3N4L9Nj1ook3k3k9k9j4j3K
13471C0Lj4j3m5m6j3K0K7nl6l6k0J2J0RQQK4K4M1M0K5K6RRJ0Rkjl2l1k8NJ8J8kkl3l1j3J3
$$ y = [-47, -56, -62, -67, -40, -13, -16, -19, -21, -24, -30, -36, -43, -51, -67, -99, -125, -118, -101, -84, -97, -110, -117, -124, -89, -39, 12, 31, -3, -39, -52, -65, -83, -117, -143, -138, -119, -100, -76, -52, -28, -4, 2, 8, 14, 21, -2, -25, -48, -71, -79, -88, -112, -136, -145, -155, -151, -115, -60, -6, 36, 47, 28, 9, 4, 0, -4, -9, 2, 13, 18, 22, -4, -31, -61, -91, -89, -87, -71, -55, -39, -23, -5, 12, 30, 48, 54, 60, 66, 71, 76, 81, 54, 27, 5, -16, -21, -27, -22, -17, 4, 25, 43, 62, 49, 36, 38, 39, 72, 104, 129, 138, 123, 76, 31, 16, 35, 54, 29, 4, -20, -45, -48, -50, -10, 44, 82, 88, 60, 33, 22, 11, 0, -9, -54, -100, -123, -93, -53, -29, -25, -21, 1, 23, 29, 36, 24, 12, 0, -10, -42, -74, -106, -138, -119, -99, -80, -60, -47, -33, -20, -6, 24, 55, 55, 54, 44, 33, 23, 12, 0, -12, -25, -37, -23, -9, 4, 18, 32, 45, 58, 71, 68, 64, 62, 29, -6, -43, -28, -14, -14, -13, -13, -13, -27, -41, -55, -69, -72, -74, -60, -47, -43, -40, 4, 65, 108, 119, 108, 112, 131, 134, 104, 58, 28, 13, 4, -4, -28, -51, -89, -126, -146, -134, -124, -115, -105, -95, -54, -12, 26, 66, 52, 39, 22, 6, -7, -21, -10, 33, 75, 85, 80, 59, 29, 0, -8, -16, 7, 31, 44, 57, 39, 22, 33, 59, 63, 36, -3, -43, -53, -64, -40, -16, 7, 31, 30, 29, 41, 84, 138, 177, 182, 171, 165, 159, 136, 113, 84, 55, 41, 28, 30, 33, 19, 6, -39, -85, -98, -78, -51, -56, -92, -128, -148, -136, -126, -117, -109, -101, -77, -53, -12, 28, 53, 79, 88, 97, 107, 116, 114, 113, 81, 50, 22, 27, 45, 63, 61, 59, 26, -5, -18, -5]
13453eQpj6jK1K0MMMMj8j8j7j8J7J6JJl5l5llPPK2K3K6K6ook3m0l1lJ4J3L2L0M0M0j3j3j0
13434E9j1j0j1j1j2NMJ5J5kk7m2k6nolmK8K8K9L1J4J4klkK4K9J3k0l6k5k4k4k2j5J2K8K8p
13417B6qpqK1K1j0j1k4k5j0j0l0l0JJJ4J4J4J3K4K4N2N3L3ml6l6j1j1l3m7l6qOPKKKKllkl
13398g4L3L4L2L2K4Qj5m1m7l2j4J%jJJj%%%J8J7L2L3LLk3k3KKrl6m2m2k7k6l0lK4N0N0K3L
13380f0LJ1J1K5K4Lk2k4k4ooooj4j3kK5L1L1J7J6LML0L0K6K5RJ0J9K0ppONl1l1k5k5KKOPk0
13360G2k0k1k1NOOOl1m6k4KK3K3L1L2Pl0l1oJ3J3poJ7J8M1K5ql4l4qK3K4J5J5jjJ0J1%k7k8
13342E4j3j2k9l5j0K1K2KJKKMMk1l8l0mPOklllmnL3L2J6J6%Jj1rNM1M9L4Jk5l5l5l6l7k0k0
13323h7PONNNNL5L4L6L5JJJJjjj%l6l5l4l5mmlmj5j5j6j5l4l5qqNOL2L2J6J7rqK6N3N0K6j4
$$ y = [-5, 3, -4, -20, -21, 0, 20, 24, 28, 32, 36, 18, 0, -17, -35, -18, -2, -1, 0, -35, -70, -73, -76, -69, -62, -40, -17, 9, 35, 29, 23, 0, -40, -71, -74, -60, -47, -15, 15, 55, 95, 82, 69, 59, 48, 38, 27, 16, 4, 9, 13, 28, 43, 41, 14, -28, -54, -59, -65, -68, -72, -44, -16, 13, 44, 58, 72, 70, 67, 65, 89, 118, 131, 111, 75, 50, 26, 2, -20, -35, -23, 5, 33, 26, 18, 11, 3, 24, 45, 35, 24, 0, -25, -35, -45, -75, -105, -104, -103, -89, -75, -61, -48, -24, 0, 52, 105, 138, 134, 98, 62, 51, 40, 7, -40, -76, -84, -78, -71, -69, -67, -65, -63, -66, -69, -71, -74, -41, -7, 25, 57, 81, 89, 74, 33, -14, -46, -60, -59, -59, -60, -59, -58, -59, -59, -59, -59, -41, -24, 8, 41, 44, 47, 24, 1, 3, 5, -4, -40, -82, -124, -151, -177, -207, -210, -186, -136, -86, -63, -60, -57, -46, -35, -10, 14, 17, -5, -29, -53, -59, -65, -71, -77, -91, -104, -106, -81, -50, -19, -2, 14, 17, 21, 51, 81, 107, 132, 141, 151, 170, 190, 183, 176, 182, 187, 156, 125, 100, 75, 77, 79, 85, 92, 72, 52, 31, 10, 15, 21, 27, 33, 2, -44, -68, -66, -43, -20, 11, 43, 50, 20, -11, -17, -4, 9, 2, -4, 13, 31, 72, 97, 89, 55, 21, 13, 36, 60, 75, 90, 89, 88, 98, 109, 109, 82, 54, 41, 29, 0, -35, -45, -24, -2, 0, 1, 3, 5, 9, 13, -8, -46, -76, -80, -73, -67, -69, -72, -75, -78, -82, -87, -54, -22, -6, 10, 10, 11, 0, -9, -4, 37, 86, 120, 121, 96, 61, 26, -10, -47, -67, -87, -80, -74, -69, -64, -59, -54, -19, 15, 51, 86, 87, 88, 89, 90, 89, 88, 87, 87, 51, 16, -18, -53, -57, -61, -64, -68, -83, -98, -114, -129, -163, -198, -206, -214, -209, -203, -171, -139, -123, -106, -115, -123, -97, -44, 6, 32, 18]
13302A8k9k3k2ppRRK6K6N2N2M3K8J4j2m1m1k6k7j9j9PPNOj0j1j9k1rJ7K0J9K2K1J8J7j4j4
$$ y = [18, -11, -34, -56, -63, -70, -61, -52, -26, 0, 52, 104, 147, 175, 189, 177, 136, 95, 69, 42, 23, 4, 11, 18, 23, 29, 19, 8, -11, -32, -41, -24, -4, 15, 37, 58, 76, 93, 79, 65]
$$ [...]
-3135C5
##END=	
##END=	
