##TITLE=	Oct20-2021.20.fid
TM-VI-108solid Ca+pmb-pyrraz. batch 2

##JCAMP-DX=	6.0	$$ MestReNova 14.3.0-30573
##DATA TYPE=	LINK
##BLOCK_ID=	1
##BLOCKS=	2    
##ORIGIN=	Mestrelab Research S.L.
##OWNER=	hrzepa
##$MNOVA/LINK_BLOCK_TYPE=	ITEM	$$ NMR Spectrum
##$MNOVA/ITEM/POLYGON=	(XY..XY)
5321,5835
8722,5835
8722,8208
5321,8208
5321,5835
##$MNOVA/ITEM/Z=	0
##$MNOVA/ITEM/ANGLE=	0
##TITLE=	Oct20-2021.20.fid
##JCAMP-DX=	6.0	$$ MestReNova 14.3.0-30573
##BLOCK_ID=	2
##DATA TYPE=	MNOVA NMR VIEW DATA
##DATA CLASS=	MNOVA VIEW DATA
##$MNOVA/ITEM/ZOOM/X=	-4.0107147498308073352,	16.011019999997905927
##$MNOVA/ITEM/ZOOM/Y=	-802.88875389099121094,	8791.95355224609375
##END=	
##TITLE=	Oct20-2021.20.fid
##JCAMP-DX=	6.0	$$ MestReNova 14.3.0-30573
##BLOCK_ID=	3
##DATA TYPE=	NMR SPECTRUM
##DATA CLASS=	XYDATA
##NUMDIM=	1
##ORIGIN=	Bruker BioSpin GmbH
##OWNER=	nmr
##.OBSERVE FREQUENCY=	400.20240119999999706
##.OBSERVE NUCLEUS=	^1H
##.SOLVENT NAME=	Acetone
##.PULSE SEQUENCE=	zg30
##LONGDATE=	2021/10/20 15:58:00.000
##.ACQUISITIONMODE=	SIMULTANEOUS (DQD)
##$ORIGINAL FORMAT=	Bruker XWIN-NMR
##$MNOVA/SCALES_VERSION=	9
##$PARAMETER FILE=	(acqus, ASCII, /private/var/folders/f6/rjf_tdyn2v98c5c0wvkgn4s80000gn/T/C2J+EDXwTByy4HdfSfKDxQ/20/acqus, 0)
$$ ##TITLE= Parameter file, TOPSPIN		Version 3.2
$$ ##JCAMPDX= 5.0
$$ ##DATATYPE= Parameter Values
$$ ##NPOINTS= 11	$$ modification sequence number
$$ ##ORIGIN= Bruker BioSpin GmbH
$$ ##OWNER= nmr
$$ $$ 2021-10-20 15:58:39.558 +0100  nmr@CZC2439F63
$$ $$ /opt/topspin/data/agmb/nmr/Oct20-2021/20/acqus
$$ $$ process /opt/topspin3.2/prog/mod/shimcntl
$$ ##$ACQT0= -2.10084033613445
$$ ##$AMP= (0..31)
$$ 100 100 100 100 100 100 100 100 100 100 100 100 100 100 100 100 100 100
$$ 100 100 100 100 100 100 100 100 100 100 100 100 100 100
$$ ##$AMPCOIL= (0..19)
$$ 0 0 0 0 0 0 0 0 0 0 0 0 0 0 0 0 0 0 0 0
$$ ##$ANAVPT= -1
$$ ##$AQSEQ= 0
$$ ##$AQ_mod= 3
$$ ##$AUNM= <au_zg>
$$ ##$AUTOPOS= <2 >
$$ ##$BF1= 400.2
$$ ##$BF2= 400.2
$$ ##$BF3= 400.2
$$ ##$BF4= 400.2
$$ ##$BF5= 400.2
$$ ##$BF6= 400.2
$$ ##$BF7= 400.2
$$ ##$BF8= 400.2
$$ ##$BYTORDA= 0
$$ ##$CAGPARS= (0..11)
$$ 0 0 0 0 0 0 0 0 0 0 0 0
$$ ##$CFDGTYP= 0
$$ ##$CFRGTYP= 9
$$ ##$CHEMSTR= <none>
$$ ##$CNST= (0..63)
$$ 1 1 145 1 1 1 1 1 1 1 1 1 1 1 1 1 1 1 1 1 1 1 1 1 1 1 1 1 1 1 1 1 1 1 1
$$ 1 1 1 1 1 1 1 1 1 1 1 1 1 1 1 1 1 1 1 1 1 1 1 1 1 1 1 1 1
$$ ##$CPDPRG= (0..8)
$$ <> <> <> <> <mlev> <mlev> <mlev> <mlev> <mlev>
$$ ##$D= (0..63)
$$ 0 1 0 0 0 0 0 0 0 0.06 0 0 0 0 0 0 0.0002 0 0 0 0 0 0 0 0 0 0 0 0 0 0 0
$$ 0 0 0 0 0 0 0 0 0 0 0 0 0 0 0 0 0 0 0 0 0 0 0 0 0 0 0 0 0 0 0 0
$$ ##$DATE= 1634741918
$$ ##$DE= 6.5
$$ ##$DECBNUC= <off>
$$ ##$DECIM= 2496
$$ ##$DECNUC= <off>
$$ ##$DECSTAT= 4
$$ ##$DIGMOD= 1
$$ ##$DIGTYP= 12
$$ ##$DQDMODE= 0
$$ ##$DR= 22
$$ ##$DS= 2
$$ ##$DSPFIRM= 0
$$ ##$DSPFVS= 20
$$ ##$DTYPA= 0
$$ ##$EXP= <proton>
$$ ##$F1LIST= <111111111111111>
$$ ##$F2LIST= <222222222222222>
$$ ##$F3LIST= <333333333333333>
$$ ##$FCUCHAN= (0..9)
$$ 0 2 0 0 0 0 0 0 0 0
$$ ##$FL1= 90
$$ ##$FL2= 90
$$ [...]
$$ ##$Sgu3PowerLevels= (0..7)
$$ 0 0 0 0 0 0 0 0
$$ ##$Sgu4PowerLevels= (0..7)
$$ 0 0 0 0 0 0 0 0
$$ ##$Sgu5PowerLevels= (0..7)
$$ 0 0 0 0 0 0 0 0
$$ ##$Sgu6PowerLevels= (0..7)
$$ 0 0 0 0 0 0 0 0
$$ ##$Sgu7PowerLevels= (0..7)
$$ 0 0 0 0 0 0 0 0
$$ ##$Sgu8PowerLevels= (0..7)
$$ 0 0 0 0 0 0 0 0
$$ ##$SguType= 3
$$ ##$ShimPowMaxUA= (0..63)
$$ 130000 130000 130000 130000 130000 130000 130000 130000 130000 130000 130000
$$ 130000 130000 130000 130000 130000 130000 130000 130000 130000 0 0 0 0
$$ 0 0 0 0 0 0 0 0 0 0 0 0 0 0 0 0 0 0 0 0 0 0 0 0 0 0 0 0 0 0 0 0 0 0 0 0
$$ 0 0 0 0
$$ ##$ShimPowMaxUC= (0..63)
$$ 130000 130000 130000 130000 130000 130000 130000 130000 130000 130000 130000
$$ 130000 130000 130000 130000 130000 130000 130000 130000 130000 0 0 0 0
$$ 0 0 0 0 0 0 0 0 0 0 0 0 0 0 0 0 0 0 0 0 0 0 0 0 0 0 0 0 0 0 0 0 0 0 0 0
$$ 0 0 0 0
$$ ##$ShimPowMaxUG= (0..63)
$$ 524287 524287 524287 524287 524287 524287 524287 524287 524287 524287 524287
$$ 524287 524287 524287 524287 524287 524287 524287 524287 524287 0 0 0 0
$$ 0 0 0 0 0 0 0 0 0 0 0 0 0 0 0 0 0 0 0 0 0 0 0 0 0 0 0 0 0 0 0 0 0 0 0 0
$$ 0 0 0 0
$$ ##$ShimPowRcbType= 3
$$ ##$ShimPowRes= (0..63)
$$ 1e-20 1e-20 1e-20 1e-20 1e-20 1e-20 1e-20 1e-20 1e-20 1e-20 1e-20 1e-20
$$ 1e-20 1e-20 1e-20 1e-20 1e-20 1e-20 1e-20 1e-20 0 0 0 0 0 0 0 0 0 0 0 0
$$ 0 0 0 0 0 0 0 0 0 0 0 0 0 0 0 0 0 0 0 0 0 0 0 0 0 0 0 0 0 0 0 0
$$ ##$ShimPowRng0= (0..63)
$$ 1 1 1 1 1 1 1 1 1 1 1 1 1 1 1 1 1 1 1 1 0 0 0 0 0 0 0 0 0 0 0 0 0 0 0 0
$$ 0 0 0 0 0 0 0 0 0 0 0 0 0 0 0 0 0 0 0 0 0 0 0 0 0 0 0 0
$$ ##$ShimPowRng1= (0..63)
$$ 1 1 1 1 1 1 1 1 1 1 1 1 1 1 1 1 1 1 1 1 0 0 0 0 0 0 0 0 0 0 0 0 0 0 0 0
$$ 0 0 0 0 0 0 0 0 0 0 0 0 0 0 0 0 0 0 0 0 0 0 0 0 0 0 0 0
$$ ##$ShimPowRng2= (0..63)
$$ 1 1 1 1 1 1 1 1 1 1 1 1 1 1 1 1 1 1 1 1 0 0 0 0 0 0 0 0 0 0 0 0 0 0 0 0
$$ 0 0 0 0 0 0 0 0 0 0 0 0 0 0 0 0 0 0 0 0 0 0 0 0 0 0 0 0
$$ ##$ShimPowRng3= (0..63)
$$ 1 1 1 1 1 1 1 1 1 1 1 1 1 1 1 1 1 1 1 1 0 0 0 0 0 0 0 0 0 0 0 0 0 0 0 0
$$ 0 0 0 0 0 0 0 0 0 0 0 0 0 0 0 0 0 0 0 0 0 0 0 0 0 0 0 0
$$ ##$ShimSysFunc= (0..63)
$$ 1 2 3 4 5 7 9 11 15 16 8 10 12 14 6 17 13 18 19 20 0 0 0 0 0 0 0 0 0 0
$$ 0 0 0 0 0 0 0 0 0 0 0 0 0 0 0 0 0 0 0 0 0 0 0 0 0 0 0 0 0 0 0 0 0 0
$$ ##$ShimSysMatrix= 0
$$ ##$ShimSysType= 1
$$ ##$TFXNUM= 0
$$ ##$TRIPLO2= 0
$$ ##$VTU= 2
$$ ##$VTUETH= <149.236.99.20>
$$ ##$VTUTY= <no>
$$ ##$WBREFAM= (0..15)
$$ 135.5 97.7 100 100 100 100 100 100 100 100 100 100 100 100 100 100
$$ ##$WBREFLM= (0..15)
$$ 0 0 0 0 0 0 0 0 0 0 0 0 0 0 0 0
$$ ##$WBREFPH= (0..15)
$$ 72.26 -67.22 0 0 0 0 0 0 0 0 0 0 0 0 0 0
$$ ##$WBSGU= (0..15)
$$ 0 0 0 0 0 0 0 0 0 0 0 0 0 0 0 0
$$ ##$XFAC= 2
$$ ##END=
$$ 
##$DECIM=	2496
##$DSPFVS=	20
##XUNITS=	HZ
##YUNITS=	ARBITRARY UNITS
##FIRSTX=	6407.6102040000005218
##LASTX=	-1605.0880428824991668
##DELTAX=	-0.12226593800080109986
##XFACTOR=	1
##YFACTOR=	0.019775858486247667456
##FIRSTY=	7.7688317298889160156
##MINY=	-3.6202602386474609375
##MAXY=	7992.68505859375
##NPOINTS=	65536
##XYDATA=	(X++(Y..Y))
$$ [...]
$$ plain form
2854 18413 17817 17245 16702 16204 15735 15264 14798 14381 14015 13648 13254 12882 12577 12305 11996 11644 11298 10989 10701 10421 10160 9918 9683
2852 9683 9461 9280 9137 8993 8820 8639 8478 8329 8165 7972 7759 7544 7356 7218 7117 7005 6867 6741 6652 6560 6408 6216 6068 5998
2849 5998 5950 5865 5755 5670 5618 5565 5495 5421 5355 5284 5202 5128 5072 5023 4961 4891 4826 4759 4673 4573 4494 4460 4452 4424 4354 4265 4188 4136 4101 4072 4039 3985 3910 3841
2844 3841 3810 3805 3781 3706 3601 3503 3425 3361 3310 3281 3274 3274 3265 3234 3176 3095 3014 2957 2933 2932 2934 2912 2845 2752 2694 2714 2769 2777 2711 2635 2606 2601 2570 2522 2510 2549 2589 2589
2840 2589 2567 2552 2541 2514 2492 2508 2548 2553 2492 2407 2354 2337 2323 2302 2303 2334 2358 2340 2299 2270 2253 2221 2177 2149 2139 2113 2057 2012 2010 2029 2025 2007 2014 2048 2069 2053 2024
2835 2024 2008 2003 1994 1981 1963 1930 1888 1862 1859 1850 1817 1784 1787 1818 1842 1850 1858 1870 1864 1836 1816 1818 1825 1815 1806 1821 1847 1847 1814 1789 1802 1828 1814 1754 1695 1682 1707 1732 1744 1757
2830 1757 1771 1767 1737 1701 1677 1656 1628 1609 1617 1640 1653 1650 1641 1617 1569 1519 1513 1558 1603 1599 1556 1519 1510 1515 1516 1517 1524 1536 1540 1528 1499 1465 1439 1431 1439 1456 1477 1496 1509 1517 1529 1538
2825 1538 1522 1471 1409 1379 1400 1446 1474 1467 1441 1424 1424 1429 1422 1402 1382 1366 1352 1341 1344 1358 1365 1354 1341 1344 1358 1365 1364 1371 1393 1411 1407 1392 1387 1401 1415 1408 1381 1357 1353 1361 1361 1345
$$ packed form
2854A8413n96n72n43m98m69m71m66m17l66l67l94l72l05k72l09l52l46l09k88k80k61k42k35
2852I683k22j81j43j44j73j81j61j49j64j93k13k15j88j38j01j12j38j26q9r2j52j92j48p0
2849E998m8q5j10q5n2n3p0p4o6p1q2p4n6m9o2p0o5o7q6j00p9l4qk8p0q9p7n2l5k9l3n4p5o9
2844C841l1nk4p5j05r8p8o4n1k9p%rl1n8q1q1n7k4jKk2o7r3n8K0N5Qo6p6k9nl1m8j2L9M0%
2840B589k2j5j1k7k2J6M0No1q5n3j7j4k1JL1K4j8m1k9j7l2m4k8j0k6n6m5kJ9mj8PL4K1j6k9
2835B024j6nrj3j8l3m2k6lrl3l3LL1K4QQJ2ok8k0KPj0rJ5K6%l3k5J3K6j4o0n9j3K5K5J2J3
2830A757J4ml0l6k4k1k8j9QK3J3lrk4m8n0oM5M5mm3l7rNJJPJ2Mj2k9l4k6qQJ7K1J9J3QJ2R
2825A538j6n1o2l0K1M6K8pk6j7%Npk0k0j6j4j1LJ4Pj1j3LJ4PjPK2J8mj5nJ4J4pk7k4mQ%j6
$$ plain form
2820 1345 1330 1327 1329 1325 1318 1306 1272 1214 1174 1194 1260 1298 1263 1192 1156 1181 1234 1268 1266 1239 1210 1196 1198 1200 1198 1198 1195 1167 1116 1090 1135 1222 1265 1228 1170 1162 1199 1224 1212 1190
2815 1190 1183 1180 1175 1180 1200 1211 1196 1174 1180 1214 1247 1258 1243 1201 1139 1087 1080 1108 1129 1122 1116 1144 1189 1211 1190 1147 1109 1098 1123 1175 1215 1208 1162 1111 1078 1062 1063 1089 1129
2810 1129 1148 1123 1078 1047 1035 1015 978 956 981 1039 1076 1057 1001 962 969 1001 1024 1028 1025 1023 1020 1022 1046 1090 1124 1122 1093 1068 1068 1086 1109 1130 1146 1151 1132 1088 1042 1022 1035
2806 1035 1052 1043 1008 976 964 966 970 976 986 988 979 976 999 1042 1079 1091 1083 1069 1055 1041 1030 1031 1055 1099 1138 1145 1125 1102 1087 1063 1024 997 1006 1031 1028 985 932 907 915 939 960
2801 960 974 988 1013 1039 1037 994 934 899 899 921 958 1013 1065 1077 1038 984 955 953 962 973 990 1002 990 950 907 890 910 951 992 1022 1045 1061 1052 1014 977 974 992 988
2796 988 948 914 925 966 990 986 984 1010 1054 1082 1072 1038 1023 1051 1093 1100 1071 1055 1076 1093 1073 1052 1083 1145 1169 1133 1095 1103 1139 1158 1147 1124 1110 1123 1168 1229 1274
2791 1274 1297 1321 1347 1347 1309 1267 1253 1258 1256 1257 1284 1322 1332 1309 1288 1293 1307 1304 1281 1253 1230 1216 1207 1202 1207 1228 1262 1287 1293 1290 1286 1273 1246 1231 1252 1284 1278 1237 1220 1258 1311
2786 1311 1325 1293 1248 1209 1175 1159 1172 1199 1214 1214 1219 1233 1242 1248 1264 1280 1269 1237 1230 1270 1316 1315 1278 1260 1282 1309 1301 1266 1251 1286 1359 1425 1439 1399 1352 1347 1389 1434
$$ packed form
2820A345j5lKmpj2l4n8m0K0O6L8l5p1l6K5N3L4kk7k9j4KKk%lk8n1k6M5Q7M3l7n8qL7K5j2k2
2815A190plnNK0J1j5k2OL4L3J1j5m2o2n2pK8K1poK8M5K2k1m3l8j1K5N2M0pm6n1l3j6JK6M0
2810A129J9k5m5l1j2k0l7k2K5N8L7j9n6l9PL2K3MlklKK4M4L4kk9k5%J8K3K1J6Nj9m4m6k0J3
2806A035J7rl5l2j2KMOJ0KrlK3M3L7J2qj4j4j4j1JK4M4L9Pk0k3j5k4l9k7RK5lm3n3k5QK4K1
2801I60J4J4K5K6km3o0l5%K2L7N5N2J2l9n4k9kRJ1J7J2j2m0m3j7K0M1M1L0K3J6rl8l7lJ8m
2796I88m0l4J1M1K4mkK6M4K8j0l4j5K8M2Pk9j6K1J7k0k1L1O2K4l6l8QL6J9j1k3j4J3M5O1M5
2791A274K3K4K6%l8m2j4NkJK7L8J0k3k1NJ4lk3k8k3j4rnNK1L4K5Olmj3k7j5K1L2om1j7L8N3
2786A311J4l2m5l9l4j6J3K7J5%NJ4ROJ6J6j1l2pM0M6jl7j8K2K7ql5j5L5P3O6J4m0m7nM2M5
$$ plain form
2782 1434 1444 1427 1416 1424 1434 1428 1411 1398 1391 1375 1345 1322 1330 1365 1384 1364 1323 1305 1316 1329 1329 1334 1358 1384 1381 1347 1308 1285 1268 1241 1196 1146 1115 1111 1116 1103 1079 1079 1118
2777 1118 1165 1190 1198 1208 1204 1166 1122 1124 1166 1190 1163 1126 1129 1159 1171 1149 1114 1081 1052 1039 1053 1079 1087 1079 1087 1128 1172 1177 1135 1077 1044 1056 1096 1131 1144 1148 1161 1177 1177
2772 1177 1164 1159 1154 1113 1035 971 972 1022 1069 1098 1128 1162 1159 1101 1029 998 1009 1024 1028 1036 1043 1020 969 942 979 1049 1085 1068 1036 1017 1003 989 993 1024 1050 1040 1012 1010 1048
2768 1048 1096 1119 1115 1108 1122 1160 1193 1182 1125 1066 1052 1078 1102 1103 1089 1073 1059 1062 1094 1142 1171 1174 1173 1179 1176 1159 1157 1185 1212 1199 1158 1140 1161 1198 1223 1238 1247 1239 1210 1182
2763 1182 1186 1217 1239 1232 1213 1218 1246 1266 1251 1215 1184 1167 1152 1140 1147 1177 1206 1216 1211 1199 1183 1170 1180 1206 1213 1185 1154 1158 1185 1190 1171 1162 1180 1203 1210 1206 1199 1185 1170 1181
2758 1181 1225 1263 1263 1245 1255 1298 1328 1314 1277 1261 1274 1295 1309 1330 1367 1401 1400 1359 1314 1309 1347 1399 1443 1487 1541 1589 1605 1582 1541 1509 1496 1498 1510 1529 1548 1553 1536
2753 1536 1512 1511 1543 1586 1603 1584 1547 1509 1477 1463 1482 1530 1573 1583 1569 1557 1558 1572 1602 1648 1683 1673 1627 1582 1558 1540 1510 1486 1490 1513 1527 1519 1503 1500 1524 1579 1653
2749 1653 1713 1721 1684 1646 1644 1675 1707 1712 1683 1633 1593 1597 1651 1722 1772 1786 1773 1741 1700 1679 1713 1806 1916 1998 2039 2051 2044 2025 2005 1994 1999 2021 2052 2069 2051 2004 1967
$$ packed form
2782A434J0j7j1QJ0oj7j3pj6l0k3QL5J9k0m1j8J1J3%NK4K6ll4l9k3j7k7m5n0l1mNj3k4%L9
2777A118M7K5QJ0ml8m4KM2K4k7l7LL0J2k2l5l3k9j3J4K6QqQM1M4Nm2n8l3J2M0L5J3MJ3J6%
2772A177j3nnm1p8o4JN0M7K9L0L4ln8p2l1J1J5MQPk3n1k7L7P0L6j7l2j9j4j4ML1K6j0k8kL8
2768A048M8K3mpJ4L8L3j1n7n9j4K6K4Jj4j6j4LL2M8K9LjOlj7kK8K7j3m1j8K1L7K5J5Rqk9k8
2763A182ML1K2pj9NK8K0j5l6l1j7j5j2PL0K9J0nj2j6j3J0K6Pk8l1MK7Nj9rJ8K3Pmpj4j5J1
2758A181M4L8%j8J0M3L0j4l7j6J3K1J4K1L7L4jm1m5nL8N2M4M4N4M8J6k3m1l2j3KJ2J9J9Nj7
2753A536k4jL2M3J7j9l7l8l2j4J9M8M3J0j4j2JJ4L0M6L5j0m6m5k4j8l0k4MK3J4qj6lK4N5P4
2749A653O0Ql7l8kL1L2Nk9n0m0MN4P1N0J4j3l2m1k1L4R3J10Q2M1J2pj9k0j1NK2L1J7j8m7l7
$$ plain form
2744 1967 1962 1971 1966 1955 1980 2050 2119 2138 2112 2085 2088 2107 2111 2094 2078 2085 2110 2130 2142 2156 2159 2122 2051 2002 2022 2082 2113 2097 2082 2107 2150 2177 2188 2197 2192 2154 2100 2068 2074
2739 2074 2098 2109 2096 2063 2027 2007 2009 2021 2028 2035 2053 2082 2118 2164 2210 2225 2191 2134 2100 2095 2091 2079 2084 2119 2156 2168 2158 2152 2156 2158 2151 2144 2157 2194 2242 2271 2264 2235 2221 2231
2734 2231 2239 2220 2189 2177 2188 2194 2174 2141 2119 2118 2125 2123 2110 2103 2111 2121 2110 2080 2051 2035 2021 2002 1995 2017 2051 2063 2049 2033 2031 2021 1983 1932 1900 1896 1896 1880 1859 1855 1871 1886
2730 1886 1884 1868 1855 1852 1858 1866 1868 1859 1841 1825 1816 1809 1801 1794 1792 1792 1799 1827 1873 1906 1890 1839 1803 1810 1835 1837 1809 1773 1750 1743 1741 1731 1709 1685 1669 1665 1673 1702 1752 1799 1807 1778 1753 1747 1730
2724 1730 1680 1624 1604 1608 1600 1582 1591 1626 1641 1612 1578 1581 1611 1626 1612 1592 1586 1590 1597 1607 1620 1626 1620 1607 1601 1610 1626 1632 1626 1625 1633 1629 1595 1555 1554 1591 1617 1605 1594 1625 1678 1688 1635
2719 1635 1568 1542 1556 1577 1587 1587 1582 1577 1581 1598 1616 1622 1620 1625 1638 1642 1625 1594 1563 1543 1536 1543 1561 1574 1566 1548 1548 1584 1642 1691 1705 1680 1636 1608 1616 1634 1616 1557 1521 1571 1680
2714 1680 1761 1769 1745 1736 1735 1711 1678 1675 1709 1741 1751 1755 1767 1777 1770 1760 1771 1804 1838 1850 1835 1810 1799 1810 1823 1817 1808 1827 1869 1888 1854 1805 1799 1837 1863 1834 1781 1767 1815
2709 1815 1890 1941 1956 1967 1993 2013 1997 1962 1952 1969 1965 1923 1890 1922 1988 2013 1981 1953 1977 2031 2071 2085 2084 2069 2048 2042 2058 2064 2043 2034 2078 2146 2172 2155 2159 2208 2253
$$ packed form
2744A967nRnj1K5P0O9J9k6k7LJ9Mj7j6PK5K0J2J4Ll7p1m9K0O0L1j6j5K5M3K7J1Rnl8n4l2O
2739B074K4J1j3l3l6k0KJ2PPJ8K9L6M6M6J5l4n7l4nmj2NL5L7J2j0oMKppJ3L7M8K9pk9j4J0
2734B231Qj9l1j2J1Ok0l3k2jPkj3pQJ0j1l0k9j6j4j9pK2L4J2j4j6kj0l8n1l2m%j6k1mJ6J5
2730A886kj6j3lOQKrj8j6rpqpk%PK8M6L3j6n1l6PK5Kk8l6k3pkj0k2k4j6mQK9N0M7Qk9k5oj7
2724A730n0n6k0Mqj8RL5J5k9l4LL0J5j4k0oMPJ0J3Ooj3oRJ6OojQml4m0jL7K6j2j1L1N3J0n3
2719A635o7k6J4K1J0%nnMJ7J8OkNJ3Mj7l1l1k0pPJ8J3qj8%L6N8M9J4k5m4k8QJ8j8n9l6N0J09
2714A680Q1Qk4rjk4l3lL4L2J0MJ2J0pj0J1L3L4J2j5k5j1J1J3orJ9M2J9l4m9oL8K6k9n3j4M8
2709A815P5N1J5J1K6K0j6l5j0J7mm2l3L2O6K5l2k8K4N4M0J4jj5k1oJ6Ok1rM4O8K6j7MM9M5
$$ plain form
2705 2253 2253 2247 2284 2342 2364 2345 2324 2305 2254 2179 2149 2207 2304 2360 2354 2330 2330 2360 2406 2456 2493 2502 2490 2490 2529 2592 2632 2621 2582 2561 2584 2627 2648 2628 2580 2540 2528
2700 2528 2540 2553 2557 2566 2606 2670 2717 2717 2686 2666 2676 2701 2720 2726 2729 2745 2788 2840 2859 2823 2769 2762 2822 2905 2959 2983 3005 3033 3046 3024 2976 2939 2954 3029 3123 3185 3208
2695 3208 3224 3252 3276 3285 3301 3340 3384 3404 3404 3406 3419 3439 3463 3491 3520 3550 3597 3656 3696 3701 3706 3755 3836 3903 3942 3976 4011 4027 4021 4030 4074 4123 4138 4120 4102 4110 4144 4200
2691 4200 4276 4364 4450 4519 4561 4588 4630 4698 4765 4796 4794 4805 4853 4924 4999 5079 5163 5231 5271 5293 5317 5349 5397 5474 5578 5679 5760 5830 5895 5941 5965 5999 6069 6151
2687 6151 6212 6262 6341 6456 6578 6682 6775 6871 6972 7076 7186 7294 7394 7487 7583 7689 7817 7972 8132 8257 8336 8415 8539 8702 8871 9034
2684 9034 9199 9362 9517 9688 9895 10108 10288 10460 10684 10963 11238 11489 11762 12083 12407 12692 12970 13287 13634 13974 14316 14704 15146
2681 15146 15605 16060 16524 17014 17537 18101 18718 19389 20099 20834 21596 22399 23267 24215 25214 26211 27196 28220 29329 30509 31725
2678 31725 32986 34321 35721 37154 38641 40249 42004 43865 45792 47802 49938 52221 54650 57218 59895 62641 65450
$$ packed form
2705B253%oL7N8K2j9k1j9n1p5l0N8R7N6ok4%L0M6N0L7Rj2%L9O3M0j1l9k1K3M3K1k0m8m0j2
2700B528J2J3MRM0O4M7%l1k0J0K5J9OLJ6M3N2J9l6n4pO0Q3N4K4K2K8J3k2m8l7J5P5R4O2K3
2695C208J6K8K4RJ6L9M4K0%KJ3K0K4K8K9L0M7N9M0NNM9Q1O7L9L4L5J6oRM4M9J5j8j8QL4N6
2691D200P6Q8Q6O9M2K7M2O8O7L1kJ1M8P1P5Q0Q4O8M0K2K4L2M8P7J04J01Q1P0O5M6K4L4P0Q2
2687F151O1N0P9J15J22J04R3R6J01J04J10J08J00R3R6J06J28J55J60J25P9P9J24J63J69J63
2684I034J65J63J55J71K07K13J80J72K24K79K75K51K73L21L24K85K78L17L47L40L42L88M42
2681A5146M59M55M64M90N23N64O17O71P10P35P62Q03Q68R48R99R97R85J024J109J180J216
2678C1725J261J335J400J433J487J608J755J861J927K010K136K283K429K568K677K746K809
$$ plain form
2676 65450 68352 71347 74366 77322 80182 82942 85559 87940 90014 91765 93201 94307 95062 95458 95513 95239 94634 93697 92461
2674 92461 90988 89338 87550 85644 83648 81587 79469 77301 75126 73001 70944 68931 66953 65050 63256 61549 59883
2672 59883 58260 56735 55353 54112 52987 51965 51062 50304 49710 49264 48936 48725 48676 48816 49108 49503 50011 50682 51518 52469 53505
2669 53505 54653 55927 57292 58713 60204 61796 63475 65200 66953 68747 70588 72467 74373 76278 78132 79898 81572
2667 81572 83155 84604 85855 86877 87663 88176 88355 88171 87655 86834 85702 84261 82534 80547 78308 75852 73253 70572 67822
2665 67822 65019 62225 59506 56873 54303 51807 49425 47181 45064 43058 41153 39335 37592 35942 34410 32979 31613
2663 31613 30306 29083 27937 26824 25719 24655 23661 22723 21816 20952 20151 19394 18647 17909 17212 16567 15954 15360 14799 14286 13813
2660 13813 13357 12904 12461 12055 11707 11400 11095 10764 10421 10091 9774 9466 9183 8945 8735 8513 8269 8027 7807 7600 7399 7220 7069
$$ packed form
2676F5450K902K995L019K956K860K760K617K381K074J751J436J106P55L96N5k74o05r37j236
2674I2461j473j650j788j906j996k061k118k168k175k125k057k013j978j903j794j707j666
2672E9883j623j525j382j241j125j022r03p58n94m46l28k11m9J40K92L95N08O71Q36R51J036
2669E3505J148J274J365J421J491J592J679J725J753J794J841J879J906J905J854J766J674
2667H1572J583J449J251J022P86N13J79j84n16q21j132j441j727j987k239k456k599k681k750
2665F7822k803k794k719k633k570k496k382k244k117k006j905j818j743j650j532j431j366
2663C1613j307j223j146j113j105j064r94r38r07q64q01p57p47p38o97o45o13n94n61n13m73
2660A3813m56m53m43m06l48l07l05l31l43l30l17l08k83k38k10k22k44k42k20k07k01j79j51
$$ plain form
2657 7069 6923 6756 6573 6406 6279 6184 6088 5964 5809 5643 5490 5347 5208 5083 4996 4941 4885 4810 4732 4659 4570 4453 4331 4231 4138 4028
2654 4028 3920 3847 3798 3724 3613 3509 3460 3457 3462 3448 3405 3335 3256 3192 3144 3094 3038 3000 2991 2979 2935 2879 2841 2815 2772 2719 2690 2677 2635 2553 2485 2478 2512 2533 2524
2650 2524 2503 2471 2416 2349 2300 2284 2285 2284 2275 2257 2226 2186 2154 2134 2120 2101 2076 2043 2005 1978 1976 1984 1976 1953 1942 1950 1951 1929 1898 1881 1875 1859 1821 1765 1705 1674 1696 1748 1774
2645 1774 1755 1730 1736 1748 1730 1695 1687 1705 1707 1679 1652 1637 1612 1577 1568 1600 1638 1644 1628 1609 1582 1537 1497 1484 1485 1474 1452 1442 1443 1435 1414 1398 1400 1414 1430 1443 1455 1472 1498
2640 1498 1517 1496 1427 1348 1301 1289 1292 1311 1358 1411 1429 1407 1380 1367 1352 1329 1324 1351 1376 1355 1296 1241 1219 1219 1224 1235 1257 1278 1282 1269 1251 1237 1221 1196 1175 1181 1218
2636 1218 1259 1275 1260 1239 1232 1241 1254 1268 1283 1304 1328 1341 1331 1310 1296 1288 1270 1239 1218 1218 1212 1177 1131 1112 1131 1167 1204 1238 1248 1215 1154 1117 1127 1160 1172 1148 1100
2631 1100 1053 1035 1052 1075 1073 1059 1071 1111 1143 1143 1129 1115 1084 1030 993 1000 1028 1038 1033 1040 1054 1053 1042 1044 1061 1070 1068 1070 1076 1070 1046 1017 993 983 1005 1062 1110 1103 1060 1051 1091
2626 1091 1123 1098 1052 1046 1080 1102 1086 1050 1016 979 938 914 929 965 977 943 897 890 930 971 973 953 959 997 1033 1038 1018 995 978 966 957 944 927 922 945 976 979 950
$$ packed form
2657G069j46j67j83j67j27r5r6j24j55j66j53j43j39j25q7n5n6p5p8p3q9j17j22j00r3j10
2654D028j08p3m9p4j11j04m9lNj4m3p0p9o4m8n0n6l8rj2m4n6l8k6m3n3k9j3m2q2o8pL4K1r
2650B524k1l2n5o7m9j6Jjrj8l1m0l2k0j4j9k5l3l8k7kQqk3j1QJk2l1j7oj6l8n6o0l1K2N2K6
2645A774j9k5OJ2j8l5qJ8Kk8k7j5k5l5rL2L8Oj6j9k7m5m0j3Jj1k2j0Jqk1j6KJ4J6J3J2J7K6
2640A498J9k1o9p9m7j2LJ9M7N3J8k2k7j3j5k3nK7K5k1n9n5k2%NJ1K2K1Mj3j8j4j6k5k1OL7
2636A218M1J6j5k1pRJ3J4J5K1K4J3j0k1j4qj8l1k1%ol5m6j9J9L6L7L4J0l3o1l7J0L3J2k4m8
2631A100m7j8J7K3kj4J2M0L2%j4j4l1n4l7PK8J0nPJ4jj1KJ7RkKOok4k9k4j0K2N7M8pm3rM0
2626A091L2k5m6oL4K2j6l6l4l7m1k4J5L6J2l4m6pM0M1Kk0OL8L6Nk0k3j7j2rj3j7nK3L1Lk9
$$ plain form
2622 950 930 936 938 903 852 830 852 892 927 955 968 954 914 864 831 837 879 927 935 897 856 858 900 945 962 954 928 893 859 836 830 839 860 878 869 833 806 812 826 815
2617 815 801 831 900 944 914 831 748 700 706 763 838 883 885 879 889 898 884 858 834 798 745 710 717 734 717 677 657 658 648 634 657 715 744 715 676 674 692 687 673
2612 673 686 714 715 688 675 684 676 643 629 659 695 685 640 614 632 671 694 685 650 611 594 609 625 609 566 538 543 559 559 544 533 531 539 565 607 644 649 626 598
2607 598 584 588 609 642 667 657 605 541 505 512 546 576 579 547 496 457 460 500 546 570 580 597 628 654 651 609 545 486 457 463 496 535 563 569 560 556 564 571 559 537
2602 537 534 557 577 566 552 583 659 717 714 674 646 628 588 528 497 517 559 581 585 594 613 628 634 636 638 633 622 614 611 608 610 629 666 697 697 674 668 712 787 835 819 759
2597 759 711 704 720 734 744 760 779 789 800 823 853 880 904 933 954 947 921 911 928 948 951 950 962 974 962 931 916 929 944 936 911 899 909 919 908 877 847
2593 847 836 838 837 831 832 843 847 829 800 782 777 760 718 674 663 691 720 722 703 693 696 696 690 701 734 761 758 749 772 817 832 800 761 748 745 719 679 667 687 710 721
2588 721 741 792 853 897 917 922 907 869 837 848 897 934 927 901 891 888 860 807 762 739 721 701 695 713 737 746 749 747 719 662 621 644 700 718 680 646 655 675 663
$$ packed form
2622I50k0OKl5n1k2K2M0L5K8J3j4m0n0l3OM2M8Ql8m1KM2M5J7qk6l5l4k3oRK1J8rl6k7OJ4j1
2617H15j4L0O9M4l0q3q3m8ON7P5M5KoJ0Rj4k6k4l6n3l5PJ7j7m0k0Jj0j4K3N8K9k9l9kJ8nj4
2612F73J3K8Jk7j3Rql3j4L0L6j0m5k6J8L9K3rl5l9j7J5J6j6m3k8NJ6%j5j1kQK6M2L7Nk3k8
2607E98j4MK1L3K5j0n2o4l6PL4L0Ll2n1l9LM0M6K4J0J7L1K6lm2o4n9k9OL3L9K8OrmQPj2k2
2602E37lK3K0j1j4L1P6N8lm0k8j8m0o0l1K0M2K2MRJ9J5OKKnj1qllKJ9L7L1%k3oM4P5M8j6o0
2597G59m8pJ6J4J0J6J9J0J1K3L0K7K4K9K1pk6j0J7K0LjJ2J2j2l1j5J3J5qk5j2J0J0j1l1l0
2593H47j1KjoJJ1Mj8k9j8nj7m2m4j1K8K9Kj9j0L%oJ1L3K7lrK3M5J5l2l9j3lk6m0j2K0K3J1
2588G21K0N1O1M4K0Nj5l8l2J1M9L7pk6j0lk8n3m5k3j8k0oJ8K4RLkk8n7m1K3N6J8l8l4RK0j2
$$ plain form
2583 663 635 629 641 642 632 632 638 626 601 598 621 636 621 592 573 560 548 549 564 572 555 538 549 576 583 558 522 498 492 502 518 518 490 453 437 442 446 439 436 446 462 481
2578 481 510 537 532 494 466 476 496 479 430 395 392 403 413 423 419 387 353 368 427 459 416 347 327 360 395 415 445 489 513 499 477 475 486 482 456 414 364
2573 364 324 323 361 401 409 398 401 414 406 364 320 315 354 403 419 394 365 365 379 369 339 339 383 418 397 348 331 353 381 407 445 476 454 382 334 358 416 442
2568 442 423 398 391 393 394 396 397 396 398 408 410 389 360 355 380 403 400 385 379 383 386 387 388 375 340 310 325 378 413 392 347 325 335 348 355 371 399 417 417 412 412 413 411 415 415 386
2563 386 334 306 331 376 394 389 391 405 404 384 364 347 317 282 270 290 316 320 306 293 292 303 318 321 312 310 326 337 322 307 326 349 317 245 217 270 332 332 294
2558 294 288 315 324 301 280 278 274 264 271 304 342 366 389 418 442 441 414 380 361 368 384 379 348 319 313 321 334 353 372 361 313 283 323 399 434 409 377 375 375 346 305
2553 305 286 295 316 340 360 363 350 329 298 251 212 229 302 361 351 293 258 272 299 301 280 263 273 311 358 388 389 375 371 382 394 390 371 357 365 395 425 439
2548 439 437 422 390 351 333 352 378 375 351 345 361 367 347 328 333 347 347 328 301 274 265 288 330 349 336 324 334 345 333 316 314 319 306 280 260 248 236 233 255 295
$$ packed form
2583F63k8oJ2Jj0%Oj2k5lK3J5j5k9j9j3j2JJ5Qj7j7J1K7Pk5l6k4oJ0J6%k8l7j6NMplJ0J6J9
2578D81K9K7nl8k8J0K0j7m9l5lJ1J0J0ml2l4J5N9L2m3o9k0L3L5K0L0M4K4j4k2kJ1mk6m2n0
2573C64m0jL8M0Qj1LJ3qm2m4nL9M9J6k5k9%J4j0l0%M4L5k1m9j7K2K8K6L8L1k2p2m8K4N8K6
2568D42j9k5pKJKJjKJ0Kk1k9nK5K3lj5oMLJJj3l5l0J5N3L5k1m5k2J0J3PJ6K8J8%n%JkM%k9
2563C86n2k8K5M5J8nKJ4jk0k0j7l0l5j2K0K6Mj4j3jJ1J5LrkJ6J1j5j5J9K3l2p2k8N3O2%l8
2558B94oK7Rk3k1kmj0PL3L8K4K3K9K4jk7l4j9PJ6nl1k9oQJ3J9J9j1m8l0M0P6L5k5l2k%k9m1
2553C05j9RK1K4K0Lj3k1l1m7l9J7P3N9j0n8l5J4K7Kk1j7J0L8M7L0Jj4mJ1J2mj9j4QL0L0J4
2548D39kj5l2l9j8J9K6lk4oJ6Ok0j9NJ4%j9k7k7rK3M2J9j3j2J0J1j2j7kNj3k6k0j2j2lK2M0
$$ plain form
2544 295 331 349 341 303 255 236 261 289 287 273 280 295 276 233 217 244 277 284 276 272 269 266 273 301 334 354 353 330 295 271 282 322 360 377 382 391 401 399 376 333 294
2539 294 290 322 348 334 303 299 314 295 229 167 149 161 173 184 209 241 266 285 306 323 335 357 402 446 457 437 422 430 439 413 354 302 290 310 333 357 389
2534 389 415 405 369 359 386 399 365 337 371 421 399 315 266 283 295 270 269 333 388 366 312 310 347 349 313 306 340 352 314 278 285 307 302 276 266 282 306 327
2529 327 337 334 323 314 305 289 277 291 325 341 320 289 278 283 278 262 261 290 332 355 342 305 273 263 275 300 330 357 366 354 339 339 345 330 296 276 301 356 397
2525 397 394 358 323 315 323 319 295 271 265 262 244 211 189 192 203 196 163 133 145 202 259 276 271 287 331 360 356 347 344 314 245 184 182 227 274 305 326 321 286 256 261 274
2519 274 266 264 309 371 388 366 362 384 379 331 287 272 258 232 221 227 216 192 212 277 308 263 206 208 245 261 263 283 312 318 308 300 275 222 190 231 310 352 342
2515 342 317 290 252 232 263 319 339 319 302 294 259 199 161 159 158 158 200 279 321 285 224 214 265 338 397 418 390 344 328 344 343 305 279 305 352 366 343
2510 343 315 286 248 223 242 293 338 368 397 417 392 314 234 203 215 225 214 217 268 336 353 309 276 309 372 388 352 325 327 320 283 253 249 239 207 189 209
$$ packed form
2544B95L6J8ql8m8j9K5K8kj4PJ5j9m3j6K7L3PqmllPK8L3K0jk3l5k4J1M0L8J7NRJ0kk3m3l9
2539B94mL2K6j4l1mJ5j9o6o2j8J2J2J1K5L2K5J9K1J7J2K2M5M4J1k0j5QRk6n9n2j2K0K3K4L2
2534C89K6j0l6j0K7J3l4k8L4N0k2q4m9J7J2k5jO4N5k2n4kL7Kl6pL4J2l8l6PK2nk6j0J6K4K1
2529C27J0lj1rrj6j2J4L4J6k1l1j1Nnj6jK9M2K3j3l7l2j0J2K5L0K7Rj2j5%Oj5l4k0K5N5M1
2525C97ll6l5qQmk4k4olj8l3k2LJ1pl3l0J2N7N7J7nJ6M4K9mrll0o9o1kM5M7L1K1nl5l0NJ3
2519B74qkM5O2J7k2mK2nm8m4j5j4k6j1Oj1k4K0O5L1m5n7KL7J6KK0K9Oj0qk5n3l2M1P9M2j0
2515C42k5k7l8k0L1N6K0k0j7ql5o0l8kj%M2P9M2l6o1j0N1P3N9K1k8m6j6J6jl8k6K6M7J4k3
2510C43k8k9l8k5J9N1M5L0K9K0k5p8q0l1J2J0j1LN1O8J7m4l3L3O3J6l6k7Kpl7l0mj0l2j8K0
$$ plain form
2506 209 232 224 213 234 261 252 228 237 275 288 266 243 239 236 228 232 250 269 296 339 366 337 267 220 218 227 222 217 219 199 157 140 177 232 260 267 276 274 239 200 201 236 259
2500 259 262 281 330 370 366 334 314 317 317 297 263 235 218 208 201 204 226 257 270 246 202 180 200 233 236 205 181 197 239 261 248 226 223 234 246 254 257 242 215 209
2495 209 251 312 334 303 262 246 239 214 178 161 171 190 207 236 287 345 382 380 355 340 347 361 361 352 342 323 282 240 235 262 270 236 208 242 319 365 341 292
2491 292 276 296 308 295 283 304 339 338 284 221 200 221 253 285 328 366 360 318 299 339 400 423 410 400 399 375 323 277 258 248 232 225 236 248 246 239 234 221
2486 221 196 185 202 221 207 169 154 186 241 279 273 222 158 137 186 257 273 219 164 164 194 200 185 193 228 250 239 224 228 230 202 162 145 163 196 220 223 196
2482 196 156 138 167 215 242 245 249 251 233 200 184 187 174 138 124 164 222 249 249 263 295 306 275 229 206 209 217 217 216 231 269 308 314 279 237 223 235 243 229 207
2477 207 193 195 213 248 282 291 267 231 210 208 217 225 227 223 223 230 233 221 204 204 223 234 218 190 179 192 217 239 256 261 244 200 153 139 171 216 229 207 183 181 186 182
2472 182 186 211 233 220 191 190 221 244 243 244 259 252 198 138 128 168 209 225 231 248 273 289 285 260 225 196 180 175 180 204 238 253 232 203 201 217 212 177 147 158
$$ packed form
2506B09K3qj1K1K7rk4RL8J3k2k3mlqMJ8J9K7M3K7k9p0m7kRnnKk0m2j7L7N5K8PRkl5l9JL5K3
2500B59LJ9M9M0ml2k0L%k0l4k8j7j0pLK2L1J3k4m4k2K0L3Ll1k4J6M2K2j3k2lJ1J2QLj5k7o
2495B09M2O1K2l1m1j6pk5l6j7J0J9J7K9N1N8L7kk5j5PJ4%rj0j9m1m2nK7Ql4k8L4P7M6k4m9
2491B92j6K0J2j3j2K1L5jn4o3k1K1L2L2M3L8om2j9M0O1K3j3j0jk4n2m6j9j0j6pJ1J2kpnj3
2486B21k5j1J7J9j4l8j5L2N5L8on1o4k1M9P1J6n4n5%L0Oj5QL5K2j1j5MKk8m0j7J8L3K4Lk7
2482A96m0j8K9M8K7LMKj8l3j6Lj3l6j4M0N8K7%J4L2J1l1m6k3LQ%jJ5L8L9Ol5m2j4J2Qj4k2
2477B07j4KJ8L5L4Rk4l6k1kRQKm%PLj2j7%J9J1j6k8j1J3K5K2J7Nj7m4m7j4L2M5J3k2k4kNm
2472A82MK5K2j3k9jL1K3jJJ5pn4o0j0M0M1J6OJ7K5J6mk5l5k9j6nNK4L4J5k1k9kJ6nl5l0J1
$$ plain form
2467 158 201 240 256 260 277 317 360 381 370 344 321 307 306 323 342 331 284 241 237 252 251 241 255 289 302 291 295 324 330 287 235 215 206 166 122 137 219 305
2462 305 335 315 277 241 209 178 137 80 24 10 50 113 161 188 208 222 226 225 232 247 253 232 186 132 94 85 90 88 84 107 165 225 253 263 298 362 415 416 364
2457 364 289 221 184 186 207 219 214 210 212 199 172 171 218 263 243 177 152 206 274 287 261 257 283 288 252 214 212 239 267 284 287 270 238 216 224 248 262 263 268 287 307
2452 307 309 285 244 207 195 211 239 255 250 232 211 195 185 179 173 172 182 208 240 277 318 351 352 309 245 196 164 135 111 122 174 227 239 210 181 182 208 243
2448 243 274 290 286 264 246 248 259 257 239 222 220 230 248 269 275 237 155 82 82 154 228 239 193 143 122 128 149 179 207 213 199 199 234 280 294 273 256 269 283
2443 283 252 182 127 116 121 107 90 113 181 247 272 261 237 211 182 152 127 109 107 137 184 208 195 185 215 254 249 203 181 211 248 242 198 158 134 117 107
2438 107 113 128 131 116 102 105 130 172 217 241 238 229 242 269 274 245 210 200 208 206 185 163 160 179 211 240 243 204 137 91 104 169 236 269 271 271 284 298 297 271 233
2433 233 202 191 196 201 209 235 278 306 292 248 216 220 248 272 265 214 142 104 133 190 210 188 184 220 246 220 181 188 230 247 228 212 221 232 235 242 253 251 243 262 299
$$ packed form
2467A58M3L9J6MJ7M0M3K1j1k6k3j4jJ7J9j1m7m3mJ5jj0J4L4J3j1MK9Om3n2k0rm0m4J5Q2Q6
2462C05L0k0l8l6l2l1m1n7n6j4M0O3M8K7K0J4MjPJ5Ok1m6n4l8rNkmK3N8O0K8J0L5O4N3Jn2
2457C64p5o8l7KK1J2nmKj3k7jM7M5k0o6k5N4O8J3k6mK6Nl6l8kK7K8J7Lj7l2k2QK4J4JNJ9K0
2452C07Kk4m1l7j2J6K8J6nj8k1j6j0oojJ0K6L2L7M1L3Jm3o4m9l2k9k4J1N2N3J2k9k9JK6L5
2448B43L1J6mk2j8KJ1kj8j7kJ0J8K1Ol8q2p3%P2P4J1m6n0k1OK1L0K8Oj4%L5M6J4k1j7J3J4
2443B83l1p0n5j1Nj4j7K3O8O6K5j1k4k6k9l0k5j8kL0M7K4j3j0L0L9nm6k2L0L7om4m0k4j7j0
2438A07OJ5Lj5j4LK5M2M5K4lrJ3K7Nk9l5j0Qkk1k2lJ9L2K9Ll9o7m6J3O5O7L3K%J3J4jk6l8
2433B33l1j1NNQK6M3K8j4m4l2MK8K4pn1p2l8K9N7K0k2mL6K6k6l9PM2J7j9j6RJ1LPJ1kqJ9L7
$$ plain form
2428 299 296 236 181 192 235 235 179 134 145 181 195 186 191 226 265 280 274 281 316 348 339 294 263 272 297 303 290 280 276 266 250 244 254 273 285 279 248 213 208 246 297
2423 297 321 314 295 278 261 251 246 231 196 163 165 203 247 273 278 264 231 195 173 160 144 134 143 159 153 133 132 154 157 117 69 61 96 139 167 188 219 267 309
2418 309 301 228 137 98 122 150 146 140 165 197 194 170 167 188 199 185 172 179 203 231 246 232 197 183 214 263 282 267 247 229 203 182 199 242 260 235 209 219
2414 219 249 263 256 251 265 296 333 349 328 291 274 271 247 199 165 163 162 138 120 138 166 159 122 91 80 76 81 111 155 183 184 177 174 175 183 207 244 283 322 354 362 333
2409 333 293 276 275 259 235 233 255 265 247 230 232 235 222 212 229 260 288 313 340 345 309 261 249 285 328 334 303 265 245 243 245 247 260 288 301 265 192 141 148 181
2404 181 194 179 162 155 151 155 177 203 206 190 188 213 234 223 191 164 152 157 177 204 221 226 230 244 260 276 299 324 330 313 300 306 313 297 264 230 188 139 125 185
2399 185 284 333 300 240 218 227 229 217 208 206 204 213 246 285 298 282 266 263 259 246 241 248 244 210 159 125 128 161 201 225 227 221 229 253 277 288 286 274 249 223 213 219 220 209
2393 209 202 203 198 178 159 163 183 196 201 204 195 166 130 118 138 175 206 218 206 178 157 162 184 200 211 222 227 210 185 183 210 235 242 250 281 311 304 259 217 208 231 262
$$ packed form
2428B99lo0n5J1M3%n6m5J1L6J4rNL5L9J5oPL5L2rm5l1RK5Oj3j0mj0j6oJ0J9J2ol1l5nL8N1
2423B97K4pj9j7j7j0nj5l5l3KL8M4K6Nj4l3l6k2j3j6j0RJ6ok0jK2Lm0m8qL5M3K8K1L1M8M2
2418C09qp3r1l9K4K8moK5L2lk4lK1J1j4j3PK4K8J5j4l5j4L1M9J9j5k0j8k6k1J7M3J8k5k6J0
2414B19L0J4pnJ4L1L7J6k1l7j7lk4m8l4kjk4j8J8K8pl7l1j1mNL0M4K8JplJQK4L7L9L9L2Qk9
2409C33m0j7jj6k4kK2J0j8j7KLj3j0J7L1K8K5K7Nl6m8j2L6M3Ol1l8k0kKKJ3K8J3l6p3n1PL3
2404A81J3j5j7pmMK2K6Lj6kK5K1j1l2k7j2NK0K7J7NMJ4J6J6K3K5Oj7j3OPj6l3l4m2m9j4O0
2399A85R9M9l3o0k2RKj2rkkRL3L9J3j6j6lmj3nPml4n1l4LL3M0K4KoQK4K4J1kj2k5k6j0OJj1
2393B09pJnk0j9MK0J3NLrk9l6j2K0L7L1J2j2k8k1NK2J6J1J1Nj7k5kK7K5PQL1L0pm5m2rK3L1
$$ plain form
2388 262 274 254 212 167 136 120 119 136 164 186 194 199 211 217 197 161 138 149 184 220 238 231 202 170 159 176 206 231 249 263 264 239 193 163 176 215 227 187
2384 187 119 71 67 101 152 200 218 197 162 153 181 216 225 208 190 188 202 223 243 252 248 238 225 202 170 139 128 140 166 188 192 185 187 208 236 246 232 202 161
2379 161 123 118 154 196 198 169 161 196 238 257 267 283 285 256 220 196 168 126 105 137 191 210 197 194 208 206 184 182 215 246 244 220 188 148 110 103 131 158 161 155
2374 155 148 126 95 96 150 214 233 207 169 131 94 82 124 193 229 210 171 147 144 164 213 275 312 302 266 236 220 210 209 226 253 266 250 210 170 153 161
2370 161 167 154 134 139 178 228 260 267 258 241 228 231 249 254 223 174 153 181 222 234 219 213 231 245 236 226 245 285 311 310 301 303 303 286 266 266 293 325 337 319 286
2365 286 265 260 249 210 165 149 163 177 182 196 220 227 209 199 217 242 254 274 312 322 263 171 125 147 186 202 211 229 227 183 125 103 131 179 212 210 181 157
2360 157 172 216 244 226 186 161 161 172 184 190 183 167 165 186 210 210 197 192 198 200 201 223 265 299 303 285 267 249 229 215 222 241 251 245 238 243 244 221 177 139 123 124 128
2355 128 133 138 145 160 183 195 180 153 145 160 160 137 125 149 176 173 171 215 274 281 236 221 274 338 353 338 343 365 367 341 311 280 243 224 253 309 337 317 282 261
$$ packed form
2388B62J2k0m2m5l1j6jJ7K8K2QNJ2Ok0l6k3J1L5L6J8pk9l2j1J7L0K5J8J4Jk5m6l0J3L9J2m0
2384A87o8m8mL4N1M8J8k1l5rK8L5Rj7j8kJ4K1K0Rmj0j3k3l2l1j1J2K6K2MpKK1K8J0j4l0m1
2379A61l8nL6M2Kk9qL5M2J9J0J6Kk9l6k4k8m2k1L2N4J9j3lJ4kk2kL3L1kk4l2m0l8pK8K7Lo
2374A55pk2l1JN4O4J9k6l8l8l7j2M2O9L6j9l9k4lK0M9O2L7j0l6l0j6j0jJ7K7J3j6m0m0j7Q
2370A61Oj3k0NL9N0L2Prj7j3LJ8Nl1m9k1K8M1J2j5oJ8J4rj0J9M0K6jrK%j7k0%K7L2J2j8l3
2365B86k1nj1l9m5j6J4J4NJ4K4Pj8j0J8K5J2K0L8J0n9r2m6K2L9J6RJ8km4n8k2K8M8L3kk9k4
2360A57J5M4K8j8m0k5%J1J2Opj6kK1K4%j3nOKJK2M2L4Mj8j8j8k0j4PJ9J0opNJk3m4l8j6JM
2355A28NNPJ5K3J2j5k7qJ5%k3j2K4K7lkM4N9Pm5j5N3O4J5j5NK2Kk6l0l1l7j9K9N6K8k0l5k1
$$ plain form
2350 261 247 226 209 218 247 261 232 179 161 211 286 315 292 278 306 340 340 324 328 340 328 303 290 280 245 208 210 246 268 272 287 311 306 280 285 330 350 306
2345 306 236 196 181 167 156 157 154 141 148 189 228 228 212 211 200 152 111 145 238 300 292 263 262 272 268 265 284 308 308 296 295 293 254 174 100 79 112 155 164 139 120
2340 120 137 170 177 147 111 102 119 138 150 159 174 197 217 211 168 112 82 94 123 143 146 132 101 76 96 171 256 296 282 248 221 207 210 229 250 253 240 228
2335 228 225 220 199 164 126 108 127 180 226 223 182 151 155 181 208 234 257 256 220 174 149 148 164 196 239 266 249 210 193 210 230 229 222 230 239 228 203 177 149 112
2331 112 91 123 203 277 308 309 310 304 265 204 164 169 195 204 194 186 188 192 193 204 231 250 230 182 160 200 276 321 306 272 263 275 273 251 238 254 278 284 274 260 238
2326 238 205 180 192 241 295 320 315 293 260 220 187 175 186 205 207 187 168 183 232 266 249 202 183 210 244 251 248 258 260 222 163 142 183 238 253 228 203
2321 203 207 230 252 254 232 198 179 195 229 245 230 211 223 265 303 309 290 268 250 235 234 265 316 341 305 235 189 185 181 134 69 52 119 229 302 295 239 194
2316 194 179 172 163 174 208 224 185 119 93 127 183 218 233 240 237 227 233 259 269 238 194 187 224 259 249 200 153 149 190 244 271 261 245 249 262 267 263 266 268 261 249
$$ packed form
2350B61j4k1j7RK9J4k9n3j8N0P5K9k3j4K8L4%j6MJ2j2k5j3j0l5l7KL6K2MJ5K4nk6NM5K0m4
2345C06p0m0j5j4j1Jlj3PM1L9%j6jj1m8m1L4R3O2qk9jJ0mlJ9K4%j2jkl9q0p4k1L3M3Rk5j9
2340A20J7L3Pl0l6rJ7J9J2RJ5K3K0om3n6l0J2K9K0Lj4l1k5K0P5Q5M0j4l4k7j4LJ9K1Lj3j2
2335B28lnk1l5l8j8J9N3M6lm1l1MK6K7K6K3jl6m6k5jJ6L2M3K7j7l9j7J7K0jpQRj1k5k6k8l7
2331A12k1L2Q0P4L1JJol9o1m0NK6Rj0qKMJJ1K7J9k0m8k2M0P6M5j5l4rJ2kk2j3J6K4Oj0j4k2
2326B38l3k5J2M9N4K5nk2l3m0l3j2J1J9Kk0j9J5M9L4j7m7j9K7L4PlJ0Kl8n9k1M1N5J5k5k5
2321B03MK3K2Kk2l4j9J6L4J6j5j9J2M2L8Oj9k2j8j5jL1N1K5l6p0m6mmm7o5j7O7J10P3pn6m5
2316A94j5prJ1L4J6l9o6k6L4N6L5J5Plj0OK6J0l1m4pL7L5j0m9m7mM1N4K7j0j6MJ3NmLKpj2
$$ plain form
2311 249 250 260 267 277 301 324 317 279 243 229 226 220 217 224 236 246 253 258 262 273 290 287 246 195 191 248 314 338 324 298 271 243 226 232 253 260 236 186 128 95 110 162
2306 162 213 234 233 230 232 238 258 291 315 314 300 298 316 330 312 247 163 119 154 230 267 236 185 156 134 98 83 123 185 202 178 179 227 267 246 181 129 127 165
2301 165 205 210 185 175 209 259 273 256 250 259 244 200 177 203 240 245 231 231 239 232 214 204 201 194 194 216 243 239 208 187 195 216 229 233 236 240 249 265 286 305 325 352 386
2296 386 414 418 384 318 250 221 237 262 253 210 165 131 103 84 92 130 167 174 154 136 138 160 193 225 241 226 188 161 174 217 257 275 278 274 262 249 253 274 281
2291 281 253 217 210 224 224 210 220 260 286 265 226 214 226 224 195 170 176 203 216 193 145 106 108 144 188 219 238 241 229 216 225 251 262 247 230 233 243 249 262
2287 262 281 274 222 160 135 147 163 180 213 249 257 245 250 286 324 346 354 350 328 312 336 382 387 323 245 217 235 242 213 177 168 182 192 191 203 248 298 305 272 253
2282 253 272 284 248 202 211 272 310 295 265 246 219 182 171 203 231 222 207 222 247 242 223 229 251 253 241 259 307 334 306 249 199 168 151 144 142 131 117 121 150
2277 150 193 234 271 294 286 247 204 188 200 211 199 172 149 139 137 138 148 176 216 259 297 323 321 284 238 222 239 262 279 299 309 275 204 161 189 247 269
$$ packed form
2311B49JJ0PJ0K4K3pl8l6j4lolPJ2J0PNMJ1J7lm1n1mN7O6K4j4k6k7k8j7OK1Pk4n0n8l3J5N2
2306A62N1K1jlKOK0L3K4jj4kJ8J4j8o5q4m4L5P6L7l1n1k9k2l6j5M0O2J7k4JM8M0k1o5n2kL8
2301A65M0Nk5j0L4N0J4j7oRj5m4k3K6L7Nj4%Qpj8j0lp%K2K7ml1k1QK1J3MLMRJ6K1J9K0K7L4
2296C86K8Ml4o6o8k9J6K5rm3m5l4k8j9QL8L7Pk0j8KK2L3L2J6j5l8k7J3M3M0J8Lmj2j3MK1P
2291B81k8l6pJ4%j4J0M0K6k1l9j2J2kk9k5OK7J3k3m8l9KL6M4L1J9Lj2j3RK6J1j5j7LJ0OJ3
2287B62J9pn2o2k5J2J6J7L3L6Qj2NL6L8K2Qmk2j6K4M6No4p8k8J8Pk9l6rJ4J0jJ2M5N0Pl3j9
2282B53J9J2l6m6RO1L8j5l0j9k7l7j1L2K8rj5J5K5nj9OK2Kj2J8M8K7k8n7n0l1j7pkj1j4MK9
2277A50M3M1L7K3ql9m3j6J2J1j2k7k3j0kJJ0K8M0M3L8K6kl7m6j6J7K3J7K0J0l4p1m3K8N8K2
$$ plain form
2272 269 250 238 250 262 259 257 260 247 220 208 230 270 304 326 336 339 342 348 340 301 255 244 272 297 289 265 249 232 201 171 166 186 214 244 283 319 334 323 298
2268 298 270 237 210 206 231 263 272 254 238 253 280 276 229 180 178 217 256 272 268 247 216 199 220 260 273 253 238 249 268 274 278 288 290 280 270 261 234 201 216
2263 216 291 359 355 305 274 266 240 204 212 267 306 293 270 293 350 389 378 322 250 198 194 223 242 238 245 288 333 320 254 198 200 238 271 289 310 334 338 317 306
2258 306 334 383 400 365 313 281 262 225 177 157 179 213 226 221 216 218 225 233 240 240 229 214 201 187 175 175 186 191 181 162 148 150 170 207 240 248 237 245 285 322 313
2253 313 272 249 265 292 305 313 321 307 257 208 206 245 266 238 195 180 188 183 161 162 192 203 156 84 59 98 149 170 184 226 278 290 248 192 164 172 200 230
2248 230 253 268 282 297 294 265 230 224 252 294 330 360 375 361 325 296 283 265 228 196 191 199 196 191 209 242 251 228 204 205 220 230 238 247 240 206 167 159 187 225 249
2243 249 261 271 283 292 292 279 257 241 236 234 233 251 293 332 325 269 210 186 192 196 189 187 204 226 233 218 197 192 212 254 307 347 351 316 282 291 324 320 258 193 186 214 208
2238 208 158 124 147 192 210 206 207 213 212 213 221 211 166 123 131 180 215 228 258 317 362 358 332 321 316 300 298 331 362 335 268 236 261 276 231 168 163 217 259 246
$$ packed form
2272B69j9j2J2J2lkLj3k7j2K2M0L4K2J0LLOql9m6j1K8K5qk4j6j7l1l0nK0K8L0L9L6J5j1k5
2268B98k8l3k7mK5L2Rj8j6J5K7mm7m9kL9L9J6mk1l1j7K1M0J3k0j5J1J9OMJ0Kj0j0rk7l3J5
2263B16P5O8mn0l1qk6l6QN5L9j3k3K3N7L9j1n6p2n2mK9J9mPM3M5j3o6n6KL8L3J8K1K4Mk1j1
2258C06K8M9J7l5n2l2j9l7m8k0K2L4J3nnKPQP%j1j5j3j4j2%J1Nj0j9j4KK0L7L3Qj1QM0L7r
2253C13m1k3J6K7J3QQj4n0m9kL9K1k8m3j5Qnk2JL0J1m7p2k5L9N1K1J4M2N2J2m2n6k8QK8L0
2248B30K3J5J4J5lk9l5oK8M2L6L0J5j4l6k9j3j8l7l2nQlnJ8L3Rk3k4JJ5J0QRpl4l9qK8L8K4
2243B49J2J0J2R%j3k2j6nkjJ8M2L9pn6n9k4OMpkJ7K2Pj5k1nK0M2N3M0Ml5l4RL3mo2o5pK8o
2238B08n0l4K3M5J8mJOjJQj0m5m3QM9L5J3L0N9M5mk6j1nj6kL3L1k7o7l2K5J5m5o3nN4M2j3
$$ plain form
2233 246 208 194 212 234 237 224 210 210 226 248 264 267 260 243 214 186 176 186 192 174 152 156 184 198 189 195 253 332 362 321 268 266 304 317 275 217 197 220 246
2229 246 247 226 203 196 206 227 238 225 203 199 218 240 248 246 243 238 234 239 245 232 208 216 270 320 319 289 290 324 336 307 281 294 313 296 264 258 278 292 288 280 274 261 239
2223 239 216 200 196 209 223 205 156 133 182 260 282 235 183 177 195 192 170 165 198 255 305 330 333 335 345 341 305 257 233 231 222 205 205 226 238 225 207 195 176 156
2218 156 170 231 289 295 266 252 267 282 278 265 253 244 237 234 232 230 230 224 203 182 193 244 296 306 278 243 222 219 234 250 237 200 181 205 232 214 170 154 173 187
2214 187 184 191 213 215 182 150 149 169 190 213 237 237 209 185 197 233 260 268 264 250 223 197 182 168 142 118 123 151 169 159 148 164 201 221 198 147 103 90 97
2209 97 101 103 123 169 217 235 223 209 208 214 206 182 155 142 141 136 119 98 89 97 113 125 135 141 146 151 159 171 191 228 274 304 301 283 286 315 338 335 317 305 301 301 308 324 336
2203 336 330 305 280 266 261 252 235 221 223 235 234 216 205 222 253 278 297 314 303 248 195 205 270 312 291 259 270 309 326 317 312 316 317 322 342 360 346 311 288 281
2198 281 266 240 229 239 246 233 217 221 238 249 253 262 278 286 273 246 230 241 265 275 263 254 266 286 298 312 338 354 336 304 296 303 282 238 230 274 310 278 211
$$ packed form
2233B46l8j4J8K2Lj3j4%J6K2J6Lpj7k9k8j0J0Oj8k2MK8J4rON8P9L0m1n3kL8J3m2n8k0K3K6
2229B46Jk1k3pJ0K1J1j3k2mJ9K2QklnmNOj3k4QN4N0jl0JL4J2k9k6J3J9j7l2oK0J4mqoj3k2
2223B39k3j6mJ3J4j8m9k3M9P8K2m7n2oJ8lk2nL3N7N0K5LKJ0ml6m8k4krj7%K1J2j3j8j2j9k0
2218A56J4O1N8Ok9j4J5J5mj3j2rplkk%ok1k1J1N1N2J0k8l5k1lJ5J6j3l7j9K4K7j8m4j6J9J4
2214A87lPK2Kl3l2jK0K1K3K4%k8k4J2L6K7Qmj4k7k6j5j4k6k4NK8J8j0j1J6L7K0k3n1m4j3P
2209I7MKK0M6M8J8j2j4jOqk4k7j3jnj7k1rQJ6J2J0ONNQJ2K0L7M6L0lj8LK9K3lj8j2m%PJ6J2
2203C36ok5k5j4nrj7j4KJ2jj8j1J7L1K5J9J7j1n5n3J0O5M2k1l2J1L9J7rnMJNK0J8j4l5k3p
2198B81j5k6j1J0Pj3j6MJ7J1MRJ6Qj3k7j6J1K4J0j2rJ2K0J2J4K6J6j8l2qPk1m4qM4L6l2o7
$$ plain form
2194 211 195 256 334 354 307 242 213 227 251 256 247 238 226 205 194 214 247 243 201 180 214 261 260 223 204 214 215 192 187 226 275 287 265 250 262 279 276 250 220
2189 220 212 243 301 343 335 288 242 217 208 216 256 312 337 304 254 241 265 289 294 297 301 289 269 270 298 314 293 259 243 246 254 264 280 288 279 266 261 254 245 259 306 348
2184 348 344 303 265 249 252 283 340 380 364 325 311 314 287 240 236 282 316 312 320 364 391 362 324 331 357 344 299 271 261 240 217 227 259 269 249 236 243 244 232
2179 232 229 249 275 297 313 311 280 245 240 250 230 189 188 243 292 294 286 313 348 334 284 256 268 285 288 290 291 261 195 140 145 202 268 313 334 338 330 326 345 379 402
2174 402 399 384 378 375 355 324 303 289 254 197 156 159 184 197 207 240 286 305 288 262 246 231 223 243 287 317 310 287 268 241 194 161 175 219 246 242 230 223 211
2169 211 195 191 207 225 240 263 297 320 307 263 226 230 278 346 394 399 363 314 286 290 307 314 308 306 316 325 323 324 342 357 338 298 287 316 336 310 264 243 248 249 248
2164 248 267 293 274 194 111 102 170 244 257 209 158 153 184 211 215 215 225 236 239 242 256 263 252 243 264 308 339 338 312 274 236 221 247 285 292 267 253 271 293 296
2159 296 295 311 327 322 312 319 332 322 289 262 254 252 246 237 229 223 216 203 176 143 139 200 305 390 399 337 248 185 179 221 269 286 268 243 230 223 214 209 220 251 287 305
$$ packed form
2194B11j6O1P8K0m7o5k9J4K4Nrrj2k1j1K0L3mm2k1L4M7jl7j9J0Jk3nL9M9J2k2j5J2J7lk6l0
2189B20qL1N8M2qm7m6k5rQM0N6K5l3n0j3K4K4NLMj2k0JK8J6k1l4j6LQJ0J6Qrj3nprJ4M7M2
2184C48mm1l8j6LL1N7M0j6l9j4Lk7m7mM6L4mQM4K7k9l8PK6j3m5k8j0k1k3J0L2J0k0j3PJj2
2179B32lK0K6K2J6kl1l5nJ0k0m1jN5M9KqK7L5j4n0k8J2J7LKJl0o6n5NN7O6M5K1MqmJ9L4K3
2174D02lj5olk0l1k1j4l5n7m1LK5J3J0L3M6J9j7k6j6j5qK0M4L0pk3j9k7m7l3J4M4K7mj2pj2
2169B11j6mJ6J8J5K3L4K3j3m4l7MM8O8M8Nl6m9k8MJ7PokJ0RkJJ8J5j9m0j1K9K0k6m6k1NJj
2164B48J9K6j9q0q3rO8P4J3m8n1nL1K7M%J0J1LLJ4Pj1rK1M4L1jk6l8l8j5K6L8Pk5j4J8K2L
2159B96jJ6J6nj0PJ3j0l3k7qkorqopj3k7l3mO1J05Q5Ro2q9o3oM2M8J7j8k5j3prnJ1L1L6J8
$$ plain form
2154 305 287 246 221 232 258 264 249 240 249 263 277 299 324 325 297 262 244 242 257 295 339 347 311 276 280 299 292 273 280 309 317 300 289 292 275 237 226 267 316 325 313
2149 313 327 366 388 373 342 323 322 342 371 382 354 308 284 294 313 323 327 326 314 290 269 257 254 267 304 344 352 326 299 292 289 280 284 314 336 316 272 258 294
2144 294 348 383 393 396 403 404 386 356 339 342 339 307 270 272 306 322 300 280 299 332 344 338 341 344 331 324 352 397 407 380 361 366 365 335 295 263 232 213 237 301 338
2139 338 298 219 176 193 225 232 221 217 234 267 305 340 371 397 406 387 347 307 280 257 244 251 274 283 269 260 276 298 302 297 305 322 330 336 347 344 308 266 265 303 329
2134 329 316 284 263 252 244 247 273 319 374 417 429 404 373 364 362 332 282 257 266 274 263 267 301 321 295 259 269 314 331 289 231 207 228 266 296 307 305 304 308 308
2129 308 292 274 272 282 285 269 246 239 271 344 431 487 487 449 406 369 342 341 371 393 367 309 276 286 299 279 242 217 203 188 185 214 261 292 296 295 299 303 304 308 312
2124 312 299 270 253 261 267 246 213 212 249 284 286 274 281 302 307 291 278 274 267 251 248 263 272 265 264 286 312 322 329 346 340 282 214 211 271 317 311 295 308 321 299 265 265
2119 265 298 324 331 332 330 322 322 337 343 319 288 282 281 241 174 150 193 251 275 283 311 347 349 304 239 190 178 204 240 245 213 184 196 231 253 256 265 283 291 283 278 290 306
$$ packed form
2154C05j8m1k5J1K6Oj5rRJ4J4K2K5Jk8l5j8kJ5L8M4Ql6l5MJ9pj9PK9Qj7j1Lj7l8j1M1M9Rj2
2149C13J4L9K2j5l1j9jK0K9J1k8m6k4J0J9J0Mjj2k4k1j2lJ3L7M0Qk6k7plrML0K2k0m4j4L6
2144B94N4L5J0LPJj8l0j7Lll2l7KL4J6k2k0J9L3J2oLLj3pK8M5J0k7j9Njl0m0l2l1j9K4O4L7
2139C38m0p9m3J7L2Pj1mJ7L3L8L5L1K6Rj9m0m0k7k3j3PK3Rj4rJ6K2MnQJ7QOJ1ll6m2jL8K6
2134C29j3l2k1j1qLK6M6N5M3J2k5l1rkl0n0k5RQj1ML4K0k6l6J0M5J7m2n8k4K1L8L0J1kjM%
2129C08j6j8kJ0Lj6k3pL2P3Q7N6%l8m3l7k7jL0K2k6n8l3J0J3k0l7k5j4j5lK9M7L1MjMMJMM
2124C12j3k9j7QOk1l3jL7L5Kj2PK1Nj6j3mpj6lJ5RpjK2K6J0PJ7on8o8lO0M6oj6J3J3k2l4%
2119B65L3K6PJkq%J5Ok4l1ojm0o7k4M3N8K4QK8L6Km5o5m9j2K6L6Nl2k9J2L5K2LRJ8QqnJ2J6
$$ plain form
2114 306 313 317 331 352 365 359 340 326 332 351 357 340 313 293 273 248 235 263 323 370 369 337 311 305 309 316 330 344 330 273 206 185 230 297 334 340 344 354 343 313
2109 313 302 337 385 394 358 322 319 344 368 367 340 320 339 385 400 347 266 228 246 271 268 246 226 209 198 214 261 309 322 301 280 284 312 342 343 312 284 298
2104 298 341 359 333 310 330 372 387 368 352 360 379 390 395 404 415 419 397 341 268 220 221 257 296 315 303 262 216 214 273 349 385 375 357 346 327 295 276 281
2100 281 289 281 273 286 318 343 341 313 274 245 231 225 230 267 330 371 348 295 281 315 337 320 305 322 337 316 286 293 326 341 329 318 311 294 287 324 386 409 378
2095 378 352 381 435 451 410 341 282 250 253 277 290 276 250 233 225 223 236 267 293 289 276 290 325 330 283 232 230 269 295 282 264 283 338 397 430 428 396 344
2090 344 289 255 254 280 318 353 372 370 356 341 332 323 319 330 347 345 312 284 298 344 370 355 324 309 302 286 270 273 284 277 251 234 243 264 275 275 269 264 277 320 375
2085 375 398 372 334 330 361 396 413 409 387 353 323 310 305 292 282 294 321 341 357 394 447 472 448 414 413 433 429 395 367 366 377 379 370 365 376 399 415 407 383 376
2080 376 396 414 400 374 368 372 348 301 274 289 320 346 375 409 420 402 387 400 416 401 376 381 408 407 359 297 259 259 287 325 340 317 283 282 322 361 362 337
$$ packed form
2114C06PMJ4K1J3oj9j4OJ9Oj7k7k0k0k5j3K8O0M7jl2k6oMPJ4J4j4n7o7k1M5O7L7OMJ0j1l0
2109C13j1L5M8Rl6l6lK5K4jk7k0J9M6J5n3q1l8J8K5lk2k0j7j1J6M7M8J3k1k1MK8L0Jl1k8J4
2104B98M3J8k6k3K0M2J5j9j6QJ9J1NRJ1Mk2n6p3m8JL6L9J9j2m1m6kN9P6L6j0j8j1j9l2j9N
2100B81QqqJ3L2K5kk8l9k9j4oNL7O3M1k3n3j4L4K2j7j5J7J5k1l0PL3J5j2j1pj7pL7O2K3l1
2095C78k6K9N4J6m1o9n9l2LK4J3j4k6j7qkJ3L1K6mj3J4L5Nm7n1kL9K6j3j8J9N5N9L3kl2n2
2090C44n5l4jK6L8L5J9kj4j5rrmJ1J7kl3k8J4M6K6j5l1j5pj6j6LJ1pk6j7RK1J1%onJ3M3N5
2085C75K3k6l8mL1L5J7mk2l4l0j3nj3j0J2K7K0J6L7N3K5k4l4jK0ml4k8jJ1KrnJ1K3J6qk4p
2080C76K0J8j4k6oMk4m7k7J5L1K6K9L4J1j8j5J3J6j5k5NK7jm8o2l8%K8L8J5k3l4jM0L9Jk5
$$ plain form
2076 337 319 323 345 371 387 379 357 345 352 357 350 351 373 394 383 353 353 398 445 440 390 348 349 378 402 412 410 394 370 360 375 382 340 275 255 301 357 376 377 396 417
2071 417 413 403 424 458 449 396 363 385 427 441 420 383 340 316 335 377 379 321 273 306 385 411 347 262 230 253 279 283 284 304 332 341 332 343 396 458 483 470
2066 470 451 435 402 359 354 399 448 451 426 413 413 413 427 476 539 575 580 583 583 557 517 509 541 568 555 531 544 594 638 652 648 649 653 642 613 589 599 629 636 608 579
2061 579 578 577 542 493 479 504 525 520 505 484 446 404 393 415 427 413 400 405 413 415 434 470 484 458 433 441 457 449 435 449 473 470 458 481 534 563 547 517 497
2056 497 469 422 378 359 367 391 417 432 432 431 447 465 461 443 439 452 455 435 413 402 393 380 374 388 417 451 484 499 474 425 400 422 456 462 442 426 428 440 451 461
2051 461 474 500 548 598 607 559 494 459 456 452 436 421 415 411 405 405 416 435 462 494 505 469 400 355 367 418 460 478 489 501 501 475 436 410 407 408 393 365 344 349
2047 349 369 381 367 332 309 334 413 504 554 546 506 463 427 405 407 426 436 432 439 470 495 481 446 438 467 501 523 539 544 518 483 495 560 605 574 503 469 484
2042 484 506 522 552 586 582 538 507 521 542 533 519 537 568 577 575 597 619 589 521 499 561 647 690 700 713 716 680 628 622 676 739 775 800 838 881 915 942 966
$$ packed form
2076C37j8MK2K6J6qk2j2PNpJK2K1j1l0%M5M7nn0m2JK9K4J0kj6k4j0J5Pm2o5k0M6N6J9JJ9K1
2071D17mj0K1L4rn3l3K2M2J4k1l7m3k4J9M2Kn8m8L3P9K6o4q5l2K3K6MJK0K8RrJ1N3O2K5j3
2066D70j9j6l3m3nM5M9Lk5j3%%J4M9O3L6NL%k6m0qL2K7j3k4J3N0M4J4mJMj1k9k4J0L0Pk8k9
2061E79jjl5m9j4K5K1nj5k1l8m2j1K2J2j4j3NQKJ9L6J4k6k5QJ6qj4J4K4lj2K3N3K9j6l0k0
2056D97k8m7m4j9QK4K6J5%jJ6J8mj8mJ3Lk0k2j1rj3oJ4K9L4L3J5k5m9k5K2L4Ok0j6KJ2J1J0
2051D61J3K6M8N0Rm8o5l5lmj6j5omo%J1J9K7L2J1l6o9m5J2N1M2J8J1J2%k6l9k6lJj5k8k1N
2047C49K0J2j4l5k3K5P9R1N0qm0m3l6k2KJ9J0mPL1K5j4l5qK9L4K2J6Nk6l5J2O5M5l1p1l4J5
2042D84K2J6L0L4mm4l1J4K1rj4J8L1RkK2K2l0o8k2O2Q6M3J0J3Ll6n2oN4O3L6K5L8M3L4K7K4
$$ plain form
2037 966 979 979 986 1012 1054 1098 1144 1184 1202 1198 1202 1243 1310 1358 1363 1334 1306 1302 1321 1347 1371 1411 1481 1549 1541 1428 1273 1178 1182 1240 1288 1298 1280 1256 1245 1248 1246 1213 1149
2032 1149 1082 1038 1020 1007 978 928 879 865 895 935 938 901 857 830 816 802 793 797 803 787 739 681 651 666 708 737 742 743 761 785 795 798 807 812 788 740 705 700 706 710
2028 710 714 714 685 634 606 624 652 644 610 596 616 638 642 635 622 604 588 598 633 666 681 696 726 746 727 676 640 646 675 693 692 690 698 712 725 736 734 702 646 605
2023 605 610 645 667 669 681 709 716 682 643 642 679 723 760 785 779 734 691 708 776 826 819 797 816 867 897 881 844 809 777 742 720 729 754 759 734 718 754 833 893
2018 893 893 854 827 818 803 780 779 816 863 880 861 831 820 838 869 888 885 877 882 884 861 826 823 863 901 898 868 852 871 907 934 932 905 881 885 910 926 934 960 1002 1005
2013 1005 946 878 869 911 952 969 985 1001 993 963 953 991 1059 1118 1143 1127 1089 1070 1094 1135 1154 1153 1163 1177 1162 1123 1105 1117 1111 1065 1031 1053 1099 1114 1102 1103 1119
2008 1119 1126 1128 1139 1141 1108 1067 1071 1111 1130 1123 1153 1241 1314 1304 1254 1245 1283 1307 1295 1296 1332 1363 1344 1291 1255 1268 1318 1379 1426 1455 1482 1524 1566 1569 1522 1466 1451 1481
2004 1481 1534 1590 1641 1668 1656 1624 1603 1597 1581 1557 1564 1622 1699 1746 1749 1725 1698 1688 1700 1722 1727 1719 1734 1782 1818 1807 1785 1822 1924 2019 2053 2035 2012 2013 2046 2094 2122
$$ packed form
2037I66J3%PK6M2M4M6M0J8mMM1O7M8Nk9k8mJ9K6K4M0P0O8qj13j55r5MN8M8J0j8k4j1Lkl3o4
2032A149o7m4j8j3k9n0m9j4L0M0Ll7m4k7j4j4rMOj6m8n8l0J5M2K9NJJ8K4J0LRNk4m8l5nOM
2028G10M%k9n1k8J8K8ql4j4K0K2Mpj3j8j6J0L5L3J5J5L0K0j9n1l6OK9J8jkQJ4J3J1kl2n6m1
2023F05NL5K2KJ2K8Pl4l9jL7M4L7K5om5m3J7O8N0pk2J9N1L0j6l7l5l2l5k2RK5Nk5j6L6P9O0
2018H93%l9k7rj5k3jL7M7J7j9l0j1J8L1J9lqNKk3l5lM0L8ll0j6J9L6K7kk7k4MK5J6QK6M2L
2013A005n9o8rM2M1J7J6J6ql0j0L8O8N9K5j6l8j9K4M1J9jJ0J4j5l9j8J2om6l4K2M6J5j2JJ6
2008A119PKJ1Kl3m1MM0J9pL0Q8P3j0n0rL8K4j2JL6L1j9n3l6J3N0O1M7K9K7M2M2Lm7n6j5L0
2004A481N3N6N1K7j2l2k1oj6k4PN8P7M7Lk4k7j0J2K2NqJ5M8L6j1k2L7J02R5L4j8k3JL3M8K8
$$ plain form
1999 2122 2112 2097 2121 2172 2196 2182 2181 2225 2279 2305 2326 2381 2459 2522 2558 2586 2611 2625 2632 2637 2635 2633 2659 2717 2765 2773 2773 2802 2835 2839 2847 2918 3030 3097 3090 3067 3085 3129 3161
1994 3161 3168 3154 3126 3125 3194 3312 3402 3428 3432 3453 3468 3455 3449 3491 3556 3590 3587 3577 3572 3565 3568 3591 3619 3638 3665 3715 3751 3740 3710 3715 3753 3774 3760 3744 3752 3769 3772 3766 3758 3749 3746
1989 3746 3757 3777 3790 3799 3810 3815 3810 3826 3893 3985 4044 4045 4015 3985 3973 3996 4057 4114 4127 4127 4176 4260 4304 4279 4256 4298 4379 4440 4473 4501 4522 4520 4512 4533 4590 4669 4748 4797
1985 4797 4787 4737 4712 4746 4790 4792 4783 4835 4953 5063 5105 5087 5065 5099 5211 5358 5463 5495 5513 5578 5663 5698 5690 5728 5857 6018 6138 6217 6303 6408 6503
1981 6503 6563 6591 6611 6653 6732 6839 6943 7027 7105 7202 7328 7467 7588 7673 7748 7858 8005 8135 8209 8262 8347 8452 8530 8597 8725 8932 9149 9318
1978 9318 9455 9598 9741 9870 10005 10167 10338 10498 10660 10840 11026 11204 11391 11592 11779 11953 12183 12507 12857 13133 13349 13601 13918
1975 13918 14233 14513 14822 15208 15624 16001 16353 16739 17166 17597 18026 18483 18982 19511 20077 20695 21350 21999 22637 23309 24053 24860 25701
1972 25701 26576 27508 28509 29581 30724 31944 33240 34619 36100 37701 39430 41275 43225 45293 47510 49906 52486 55238
$$ packed form
1999B122j0j5K4N1K4j4jM4N4K6K1N5P8O3L6K8K5J4PNkkK6N8M8Q%K9L3MQP1J12O7pk3J8M4L2
1994C161Pj4k8jO9J18R0K6MK1J5j3oM2O5L4lj0npLK3K8J9K7N0L6j1l0NL8K1j4j6QJ7Loqrl
1989C746J1K0J3RJ1NnJ6O7R2N9Jl0l0j2K3O1N7J3%M9Q4M4k5k3M2Q1O1L3K8K1kqK1N7P9P9M9
1985D797j0n0k5L4M4KrN2J18J10M2j8k2L4J12J47J05L2J8O5Q5L5qL8J29J61J20P9Q6J05R5
1981F503O0K8K0M2P9J07J04Q4P8R7J26J39J21Q5P5J10J47J30P4N3Q5J05P8O7J28K07K17J69
1978I318J37J43J43J29J35J62J71J60J62J80J86J78J87K01J87J74K30L24L50K76K16K52L17
1975A3918L15K80L09L86M16L77L52L86M27M31M29M57M99N29N66O18O55O49O38O72P44Q07Q41
1972B5701Q75R32J001J072J143J220J296J379J481J601J729J845J950K068K217K396K580K752
$$ plain form
1970 55238 58165 61301 64697 68379 72343 76577 81087 85890 90995 96393 102072 108023 114238 120687 127305 133998 140682
1968 140682 147302 153800 160074 165984 171412 176294 180577 184173 186964 188866 189849 189905 189027 187239 184605 181190 177031 172170
1965 172170 166721 160850 154696 148327 141786 135153 128537 122028 115681 109532 103612 97941 92532 87404 82587 78090 73893
1963 73893 69954 66246 62767 59533 56545 53776 51186 48758 46493 44381 42397 40524 38771 37152 35659 34261 32934
1961 32934 31666 30455 29303 28222 27213 26258 25339 24457 23630 22859 22130 21431 20750 20077 19414 18793 18246 17757 17274 16772 16280
1959 16280 15835 15425 15011 14579 14156 13775 13441 13129 12804 12456 12119 11830 11583 11318 10995 10647 10344 10111 9912 9704 9472 9226 8977
1956 8977 8747 8553 8378 8187 7973 7770 7604 7450 7269 7069 6891 6746 6601 6433 6267 6136 6030 5912 5771 5633 5521 5427 5324
1953 5324 5198 5061 4930 4819 4729 4649 4567 4480 4398 4336 4292 4251 4194 4123 4056 4009 3973 3920 3837 3747 3679 3635 3596 3555 3524 3506 3478 3434 3407 3422 3446 3414
$$ packed form
1970E5238K927L136L396L682L964M234M510M803N105N398N679N951O215O449O618O693O684
1968A40682O620O498O274N910N428M882M283L596K791J902R83N6q78j788k634l415m159m861
1965A72170n449n871o154o369o541o633o616o509o347o149n920n671n409n128m817m497m197
1963G3893l939l708l479l234k988k769k590k428k265k112j984j873j753j619j493j398j327
1961C2934j268j211j152j081j009r55r19q82q27p71p29o99o81o73o63o21n47m89m83n02m92
1959A6280m45m10m14m32m23l81l34l12l25l48l37k89k47k65l23l48l03k33j99k08k32k46k49
1956H977k30j94j75j91k14k03j66j54j81k00j78j45j45j68j66j31j06j18j41j38j12r4j03
1953E324j26j37j31j11r0q0q2q7q2o2m4m1n7p1o7m7l6n3q3r0o8m4l9m1l1j8k8m4k7J5K4l2
$$ plain form
1949 3414 3308 3185 3102 3066 3045 3013 2972 2938 2917 2901 2875 2833 2795 2782 2778 2747 2687 2644 2649 2672 2658 2600 2535 2492 2474 2481 2512 2549 2562 2537 2493 2454 2422 2394 2375
1945 2375 2373 2384 2389 2369 2324 2277 2258 2275 2298 2293 2260 2229 2219 2218 2204 2168 2119 2072 2031 1993 1952 1918 1906 1917 1937 1947 1945 1933 1905 1863 1827 1805 1783 1752 1738 1767 1812
1940 1812 1820 1786 1751 1738 1723 1688 1659 1664 1692 1713 1713 1698 1681 1681 1709 1739 1725 1675 1646 1669 1694 1670 1622 1603 1616 1619 1602 1595 1602 1586 1542 1513 1535 1586 1620 1621 1603 1582
1936 1582 1569 1565 1566 1565 1567 1576 1583 1572 1552 1545 1552 1549 1529 1511 1512 1521 1525 1524 1520 1505 1482 1469 1482 1515 1549 1567 1552 1503 1456 1447 1466 1462 1416 1369 1353 1348 1321 1290 1297 1338 1372 1377 1370 1365 1364
1930 1364 1368 1375 1377 1369 1367 1382 1382 1333 1256 1218 1242 1289 1309 1297 1269 1241 1220 1213 1209 1197 1192 1219 1265 1288 1274 1263 1279 1292 1272 1238 1224 1225 1224 1234 1272 1307 1288 1230 1203 1232
1925 1232 1268 1260 1236 1244 1274 1277 1243 1215 1223 1244 1245 1224 1211 1226 1263 1291 1284 1246 1220 1230 1246 1218 1158 1140 1200 1282 1307 1277 1247 1239 1220 1179 1161 1189 1227 1231 1213 1211 1227
1921 1227 1238 1236 1231 1230 1234 1256 1298 1327 1311 1268 1250 1266 1275 1249 1217 1217 1251 1292 1320 1322 1296 1264 1259 1281 1296 1287 1279 1304 1355 1401 1426 1434 1418 1376 1330 1311 1318 1321 1299 1269 1262
1916 1262 1288 1327 1342 1321 1290 1285 1304 1305 1268 1218 1192 1187 1177 1154 1126 1096 1067 1060 1084 1117 1123 1104 1087 1085 1091 1112 1150 1181 1167 1116 1078 1079 1093 1088 1066 1044 1029 1023 1033
$$ packed form
1949C414j06j23q3l6k1l2m1l4k1j6k6m2l8j3ml1o0m3NK3j4n8o5m3j8PL1L7J3k5m4l9l2k8j9
1945B375kJ1Nk0m5m7j9J7K3nl3l1j0jj4l6m9m7m1l8m1l4j2J1K0J0kj2k8m2l6k2k2l1j4K9M5
1940A812Ql4l5j3j5l5k9NK8K1%j5j7%K8L0j4n0k9K3K5k4m8j9J3Lj7pPj6m4k9K2N1L4Jj8k1
1936A582j3mJjKRPj1k0pPlk0j8JRMjmj5k3j3J3L3L4J8j5m9m7rJ9mm6m7j6nk7l1PM1L4Npnj
1930A364MPKqkJ5%m9p7l8K4M7K0j2k8k8k1pmj2nK7M6K3j4j1J6J3k0l4j4JjJ0L8L5j9n8k7K9
1925A232L6qk4QL0Ll4k8QK1Jk1j3J5L7K8pl8k6J0J6k8o0j8O0Q2K5l0l0qj9m1j8K8L8Mj8kJ6
1921A227J1knjMK2M2K9j6m3j8J6Rk6l2%L4M1K8Kk6l2nK2J5rqK5N1M6K5Qj6m2m6j9PLk2l0p
1916A262K6L9J5k1l1nJ9Jl7n0k6nj0k3k8l0k9pK4L3Oj9j7kOK1L8L1j4n1l8JJ4nk2k2j5oJ0
$$ plain form
1911 1033 1045 1045 1056 1116 1203 1238 1183 1103 1079 1102 1103 1061 1019 1007 1008 1007 1020 1050 1066 1051 1027 1020 1027 1033 1033 1020 990 964 980 1032 1059 1019 952 927 955 978 963 934
1906 934 916 901 875 856 863 876 867 845 847 875 897 887 856 833 835 867 922 960 944 892 878 944 1029 1047 994 941 935 947 942 932 947 981 1017 1057 1106 1139 1128 1085
1901 1085 1045 1025 1017 1018 1026 1023 1003 993 1029 1087 1109 1084 1065 1097 1156 1200 1224 1251 1283 1301 1303 1310 1335 1368 1395 1424 1467 1521 1562 1570 1553 1543 1562 1598 1631 1661 1695 1720
1897 1720 1708 1659 1616 1612 1635 1646 1632 1605 1575 1537 1498 1471 1455 1432 1388 1334 1301 1309 1343 1367 1350 1293 1224 1170 1141 1135 1144 1149 1130 1088 1047 1020 999 982 982 1002 1013
1892 1013 986 936 899 883 862 824 795 798 828 853 861 860 859 853 835 813 808 827 843 829 796 776 774 761 733 728 769 815 805 744 691 680 695 716 747 785 806 803 798
1888 798 800 793 773 767 782 776 729 683 696 747 762 716 660 649 679 717 750 774 773 738 695 679 694 711 711 702 690 662 611 566 562 592 613 599 579 598 657 713 724
1883 724 688 629 571 529 508 503 503 506 519 544 572 595 608 606 590 576 586 616 639 639 634 638 633 596 543 512 517 534 547 562 587 616 636 637 612 556 486 434 423 450
1878 450 495 537 561 568 573 590 610 612 595 582 588 597 591 577 565 553 535 536 580 646 680 657 613 598 609 603 560 512 501 521 536 531 523 526 527 516 505 510 527 538 541 548
$$ packed form
1911A033J2%J1O0Q7L5n5q0k4K3Jm2m2j2JjJ3L0J6j5k4pPO%j3l0k6J6N2K7m0o7k5K8K3j5k9
1906I34j8j5k6j9PJ3rk2KK8K2j0l1k3KL2N5L8j6n2j4O6Q5J8n3n3oJ2nj0J5L4L6M0M9L3j1m3
1901A085m0k0qJQlk0j0L6N8K2k5j9L2N9M4K4K7L2J8KPK5L3K7K9M3N4M1Qj7j0J9L6L3L0L4K5
1897A720j2m9m3mK3J1j4k7l0l8l9k7j6k3m4n4l3QL4K4j7n7o9n4k9oRNj9m2m1k7k1j7%K0J1
1892A013k7n0l7j6k1l8k9LL0K5Qjjoj8k2nJ9J6j4l3k0kj3k8nM1M6j0o1n3j1J5K1L1L8K1ln
1888G98Kpk0oJ5om7m6J3N1J5m6n6j1L0L8L3K4jl5m3j6J5J7%rj2k8n1m5mL0K1j4k0J9N9N6J1
1883G24l6n9n8m2k1n%LJ3K5K8K3J3kj6j4J0L0K3%nMnl7n3l1NJ7J3J5K5K9K0Jk5n6p0n2j1K7
1878D50M5M2K4PNJ7K0Kj7j3ORoj4j2j2j8JM4O6L4k3m4j5J1om3m8j1K0J5nqLJj1j1NJ7J1LP
$$ plain form
1873 548 558 558 548 541 543 545 543 545 548 532 495 465 472 514 563 595 600 582 562 567 594 612 600 573 554 539 512 482 481 528 604 666 681 639 569 525 532 562 566 531 486
1868 486 459 456 469 487 495 486 470 465 465 459 460 496 560 603 592 551 524 528 549 575 601 609 588 560 557 574 567 520 475 483 534 573 574 566 580 606 609 591 588 619 648 638 600
1862 600 573 570 566 549 541 563 592 598 585 587 610 621 599 565 555 577 602 604 577 532 489 472 486 510 522 536 586 663 706 673 606 581 615 657 669 658 640 606
1858 606 557 521 518 532 547 572 604 611 573 537 557 619 659 655 643 635 606 554 527 557 607 624 603 575 561 563 575 582 570 558 575 601 578 503 457 492 550 550
1853 550 506 494 519 510 447 390 388 419 448 473 496 485 434 392 403 443 463 459 460 474 485 491 496 492 463 421 395 394 404 418 440 461 459 431 404 405 441 492 521 501
1848 501 443 395 385 398 401 393 394 401 402 406 437 490 526 523 499 468 424 374 353 384 433 445 410 372 378 424 470 487 481 478 495 520 530 520 503 492 483 460 425 393
1843 393 384 410 466 529 571 575 550 517 496 500 531 563 557 495 406 346 341 371 407 434 451 456 449 439 433 430 423 416 414 410 393 375 379 409 440 445 434 435 449 448 415 367 333
1838 333 322 323 333 362 403 435 443 439 445 467 489 492 472 446 426 404 370 335 327 350 380 397 409 426 429 402 366 361 382 382 346 318 338 385 405 386 367 375 401 421
$$ packed form
1873E48J0%j0pKKkKLj6l7l0PM2M9L2Nj8k0NK7J8j2k7j9j5k7l0jM7P6O2J5m2p0m4PL0Ml5m5
1868D86k7lJ3J8Qrj6n%oJL6O4M3j1m1k7MK1K6K6Qk1k8lJ7pm7m5QN1L9JqJ4K6Lj8lL1K9j0l8
1862F00k7lmj7qK2K9Oj3KK3J1k2l4j0K2K5Kk7m5m3j7J4K4J2J4N0P7M3l3o7k5L4M2J2j1j8l4
1858F06m9l6lJ4J5K5L2Pl8l6K0O2M0mj2qk9n2k7L0N0J7k1k8j4KJ2Pj2j2J7K6k3p5m6L5N8%
1853E50m4j2K5ro3n7kL1K9K5K3j1n1m2J1M0K0mJJ4J1ONmk9m2k6jJ0J4K2K1kk8k7JL6N1K9k0
1848E01n8m8j0J3LqJPJML1N3L6lk4l1m4n0k1L1M9J2l5l8OM6M6J7olJ7K5J0j0j7j1rk3l5l2
1843C93rK6N6O3M2Mk5l3k1ML1L2oo2q9o0nL0L6K7J7Npj0olppkmj7j8ML0L1Nj1JJ4jl3m8l4
1838C33j1JJ0K9M1L2QmOK2K2Lk0k6k0k2l4l5qK3L0J7J2J7Lk7l6nK1%l6k8K0M7K0j9j9QK6K0
$$ plain form
1833 421 426 428 437 457 479 485 468 452 455 465 449 410 391 415 451 456 435 425 444 465 464 442 419 412 424 445 451 432 414 429 468 478 438 388 375 384 375 351 360 417 482
1828 482 522 552 588 602 567 513 501 532 546 507 445 410 414 434 448 446 425 394 369 362 366 373 382 389 383 362 349 358 384 420 470 526 556 539 502 491 507 512 483 440
1823 440 414 407 408 406 393 372 369 404 461 486 459 422 423 451 456 423 392 401 440 474 489 496 498 488 469 466 493 530 537 503 458 440 458 483 485 461 436 435 462 491 496 479
1818 479 467 474 478 463 454 475 498 476 422 405 447 488 472 431 425 444 430 383 367 413 479 518 531 533 516 479 452 453 450 419 389 400 434 440 412 390 397 411 419 431
1813 431 447 449 437 436 458 477 470 452 452 465 475 479 484 482 464 445 443 452 449 430 413 415 444 497 550 556 495 414 382 403 420 391 349 346 377 398 390 382 405 456 507 537
1808 537 548 548 544 533 513 494 488 491 488 475 464 464 466 457 436 411 391 386 401 431 452 452 446 452 458 447 425 420 442 469 482 475 459 442 434 441 458 473 481 488 487 465 428 404 407
1803 407 421 419 406 398 405 417 427 437 447 450 447 442 436 424 405 388 383 391 404 419 437 454 455 430 402 403 433 447 417 365 338 343 356 370 396 426 426 395 373 383 390 362
1798 362 324 321 347 359 347 344 365 395 418 437 447 434 415 425 469 505 503 483 475 465 433 394 391 426 462 468 451 428 401 375 363 372 387 385 364 354 381 433 468
$$ packed form
1833D21NKRK0K2Oj7j6LJ0j6l9j9K4L6Nk1j0J9K1jk2k3pJ2K1Oj9j8J5L9J0m0n0j3Rrk4RN7O5
1828D82M0L0L6J4l5n4j2L1J4l9o2l5MK0J4kk1l1k5pMPRPok1j3RK6L6N0N6L0j7l7j1J6Nk9m3
1823D40k6pJkj3k1lL5N7K5k7l7JK8Nl3l1RL9L4J5PKj0j9lK7L7Pl4m5j8J8K5Kk4k5jK7K9Nj7
1818D79j2PMj5rK1K3k2n4j7M2M1j6m1oJ9j4m7j6M6O6L9J3Kj7l7k7Jll1l0J1L4Ok8k2PJ4QJ2
1813D31J6Kj2jK2J9pj8%J3J0MNkj8j9kRlj9j7KK9N3N3Oo1q1l2K1J7k9m2lL1K1qqK3N1N1L0
1808E37J1%mj1k0j9oLlj3j1%Krk1k5k0nJ5L0K1%oOOj1k2nK2K7J3pj6j7qPJ7J5QPjk2l7k4L
1803D07J4kj3qPJ2J0J0J0Llnoj2j9j7nQJ3J5J8J7Jk5k8JL0J4l0n2k7NJ3J4K6L0%l1k2J0Pk8
1798C62l8lK6J2j2lK1L0K3J9J0j3j9J0M4L6kk0qj0l2l9lL5L6Oj7k3k7k6j2RJ5kk1j0K7N2L5
$$ plain form
1793 468 460 428 411 418 426 430 454 500 527 500 447 418 419 413 385 373 406 458 476 447 398 371 378 407 429 431 425 433 449 449 426 403 400 409 418 424 427 419 406 409 433 449 441 433 447
1787 447 460 432 382 358 372 384 381 394 438 480 483 458 432 409 391 401 448 485 465 409 379 387 387 358 338 359 397 422 441 467 472 435 398 412 461 477 446
1783 446 424 445 471 464 451 473 518 538 521 490 460 432 415 415 411 383 356 372 422 448 433 417 423 423 392 362 361 364 343 328 358 398 386 329 300 327 370 396
1778 396 423 462 479 458 431 422 407 367 338 363 409 420 399 401 445 490 501 486 463 440 423 423 430 423 402 393 414 451 476 476 459 447 453 468 460 421 385 381 395 391
1773 391 375 384 421 448 445 436 443 457 466 478 487 474 444 438 470 507 522 525 521 483 408 350 351 378 379 361 363 374 353 305 280 298 333 375 436 495 505 465 433 443 460
1768 460 446 415 401 406 415 422 426 416 396 396 429 468 483 476 462 441 411 388 390 414 449 489 521 529 521 532 564 568 511 434 396 394 376 331 303 321 362 386 377 345 313
1763 313 312 343 374 371 353 359 389 405 397 399 436 491 537 569 574 525 425 327 281 281 293 306 329 357 375 386 407 430 433 413 390 383 384 378 362 340 320 315 335 367
1758 367 383 372 352 346 352 353 344 340 361 406 459 492 492 472 459 467 478 467 435 411 414 434 444 437 427 421 409 387 371 377 398 419 431 433 413 367 312 282 289 322 364
$$ packed form
1793D68ql2j7PQMK4M6K7k7n3k9Jok8j2L3N2J8k9m9k7PK9K2KoQJ6%k3k3lRROLqj3LK4J6qqJ4
1787D47J3k8n0k4J4J2lJ3M4M2Lk5k6k3j8J0M7L7k0n6l0Q%k9k0K1L8K5J9K6Nl7l7J4M9J6l1
1783D46k2K1K6pj3K2M5K0j7l1l0k8j7%mk8k7J6N0K6j5j6O%l1l0jLk1j5L0M0j2n7k9K7M3K6
1778C96K7L9J7k1k7rj5m0k9K5M6J1k1KM4M5J1j5k3k3j7%Ppk1rK1L7K5%j7j2OJ5ql9l6mJ4m
1773C91j6RL7K7lrPJ4RJ2Rj3l0oL2L7J5Lml8p5n8JK7Jj8KJ1k1m8k5J8L5M2O1N9J0m0l2J0J7
1768D60j4l1j4NRPMj0k0%L3L9J5pj4k1l0k3KK4L5M0L2QqJ1L2Mn7p7l8kj8m5k8J8M1K4rl2l2
1763C13jL1L1lj8OL0J6qKL7N5M6L2Nm9j00r8m6%J2J3K3K8J8J1K1K3Lk0k3pJoj6k2k0nK0L2
1758C67J6j1k0oOJrmK1M5N3L3%k0j3QJ1j1l2k4LK0J0pj0oj2k2j6OK1K1J2Kk0m6n5l0PL3M2
$$ plain form
1753 364 408 445 461 457 454 467 484 485 476 472 470 463 460 487 540 578 569 521 472 443 435 443 464 483 487 484 501 541 574 563 515 460 424 416 437 477 506 493 442 392 370 367
1748 367 365 363 366 372 384 422 481 518 501 455 436 455 469 445 401 375 374 389 422 468 499 480 412 341 316 343 386 402 384 358 356 381 407 420 426 431 423 389 342
1743 342 315 327 359 376 364 342 339 354 367 372 387 416 430 407 375 382 430 468 462 435 425 436 446 443 436 437 452 475 483 461 422 399 407 427 444 464 489 489 442 370
1739 370 319 306 319 350 397 439 448 432 420 425 426 412 401 411 430 435 421 397 380 382 405 428 427 402 378 373 378 375 362 349 345 356 380 399 392 361 335 335 351 361 358
1734 358 343 318 295 293 317 342 343 329 325 336 347 353 360 371 378 381 387 401 420 438 437 402 341 294 295 332 363 372 379 400 423 426 408 395 414 467 524 550 533 502 489
1728 489 497 503 493 472 440 395 349 328 332 337 336 349 382 399 372 332 333 373 403 405 410 443 475 466 420 373 348 343 352 376 406 425 419 392 353 312 282 267 268 280 303
1723 303 329 350 364 379 399 421 443 472 499 501 467 421 393 384 384 400 441 482 477 429 392 409 461 508 535 545 537 506 466 433 417 420 443 473 480 452 416 407 422
1719 422 431 419 398 386 392 420 457 475 464 445 436 426 398 373 380 406 411 397 407 455 502 505 475 440 411 387 374 376 382 387 401 421 424 404 396 430 480 495 466 435
$$ packed form
1753C64M4L7J6mlJ3J7JrmkplK7N3L8rm8m9k9qQK1J9MlJ7M0L3j1m8n5l6qK1M0K9j3n1n0k2l
1748C67kkLOJ2L8N9L7j7m6j9J9J4k4m4k6jJ5L3M6L1j9o8p1k5K7M3J6j8k6kK5K6J3ONql4m7
1743C42k7J2L2J7j2k2lJ5J3NJ5K9J4k3l2PM8L8ok7j0J1J0lpJJ5K3Qk2l9k3QK0J7K0K5%m7p2
1739C70n1j3J3L1M7M2Rj6j2NJj4j1J0J9Nj4k4j7KK3K3jk5k4nNlj3j3mJ1K4J9pl1k6%J6J0l
1734C58j5k5k3kK4K5Jj4mJ1J1OPJ1PLOJ4J9J8jl5o1m7JL7L1RPK1K3Lj8j3J9N3N7K6j7l1j3
1728D89QOj0k1l2m5m6k1MNjJ3L3J7k7m0JM0L0KNL3L2rm6m7k5nRK4L0J9ok7l9m1l0j5JJ2K3
1723C03K6K1J4J5K0K2K2K9K7Kl4m6k8r%J6M1M1nm8l7J7N2M7K7J0ql1m0l3j6LK3L0Pk8l6rJ5
1719D22Rj2k1j2OK8L7J8j1j9rj0k8k5PK6Nj4J0M8M7Ll0l5k9k4j3KONJ4K0Lk0qL4N0J5k9l1
$$ plain form
1714 435 436 455 459 445 439 462 498 508 479 440 423 421 404 377 377 410 438 432 418 427 449 455 445 438 431 408 380 380 408 429 423 407 396 387 384 400 438 467 458 421 398 423
1709 423 483 526 509 441 386 393 447 489 488 464 446 442 445 456 469 472 461 451 456 474 489 481 441 387 358 378 423 441 422 403 413 426 412 385 384 417 448 446 412
1704 412 367 337 342 392 461 504 501 480 487 530 563 544 485 444 459 502 517 484 434 411 429 473 518 542 536 512 490 475 460 449 454 472 483 475 462 458 457 449 440 449
1699 449 475 502 521 537 549 550 539 526 521 523 519 499 475 466 473 468 434 395 395 430 450 427 393 388 407 422 430 449 473 474 447 428 443 468 464 423 380 377 428 506 563
1694 563 562 518 481 490 534 563 551 517 495 488 480 473 490 527 544 525 504 514 525 493 441 442 512 582 595 582 598 635 650 638 630 623 587 524 473 454 439 409 384
1689 384 391 419 438 438 437 454 493 536 556 540 511 501 514 515 486 447 435 461 500 521 512 493 499 542 587 588 540 484 456 459 481 524 579 619 616 580 546 536 537 523
1684 523 489 459 464 510 562 574 540 505 506 528 530 503 480 497 547 594 608 588 561 546 546 550 552 554 558 562 567 580 613 664 714 734 715 679 655 643 616 566 516 488
1679 488 481 491 526 585 635 644 621 597 587 584 589 610 636 651 657 672 691 698 695 701 705 682 641 621 633 641 619 586 563 549 552 592 654 677 636 587 589 619 618 588 574
$$ packed form
1714D35JJ9Mj4oK3L6J0k9l9j7kj7k7%L3K8oj4RK2Oj0ppk3k8%K8K1oj6j1rlJ6L8K9rl7k3K5
1709D23O0M3j7o8n5PN4M2jk4j8mLJ1J3Lj1j0NJ8J5qm0n4k9K0M5J8j9j9J0J3j4k7jL3L1kl4
1704D12m5l0NN0O9M3lk1PM3L3j9n9m1J5M3J5l3n0k3J8M4M5K4ok4k2j5j5j1NJ8J1qj3mjqrR
1699D49K6K7J9J6J2Jj1j3nKmk0k4rPnl4l9%L5K0k3l4nJ9J5QJ9K4Jk7j9J5K5mm1m3lN1P8N7
1694E63jm4l7RM4K9j2l4k2pqpJ7L7J7j9k1J0J1l2n2JP0P0J3j3J6L7J5j2qpl6o3n1j9j5l0k5
1689C84PK8J9%jJ7L9M3K0j6k9j0J3Jk9l9j2K6L9K1rj9OM3M5Jm8n6k8LK2M3N5M0ll6l4j0Jj4
1684E23l4l0NM6N2J2l4l5JK2Kk7k3J7N0M7J4k0k7j5%MKKMMNJ3L3N1N0K0j9l6k4j2k7n0n0k8
1679D88pJ0L5N9N0Rk3k4j0lNK1K6J5OJ5J9PlOMk3m1k0J2Qk2l3k3j4LM0O2K3m1m9KL0jl0j4
$$ plain form
1674 574 589 608 620 634 640 619 585 576 590 593 587 610 659 683 661 636 647 663 645 609 603 631 659 661 644 623 609 612 636 667 691 713 745 775 776 743 697 671 681
1670 681 720 754 755 728 717 743 779 785 766 756 758 741 694 653 658 701 735 727 690 665 684 740 791 809 806 814 839 861 870 880 896 898 882 876 897 915 903 888 923 995
1665 995 1039 1028 1015 1037 1060 1029 969 947 979 1015 1027 1044 1081 1103 1077 1032 1017 1032 1038 1022 1012 1021 1023 999 966 951 955 959 956 961 987 1025 1049 1051 1048 1060 1072 1056 1018
1660 1018 1006 1045 1093 1089 1038 1008 1043 1116 1172 1188 1175 1152 1132 1121 1118 1117 1127 1157 1197 1206 1166 1111 1091 1112 1143 1163 1186 1216 1234 1226 1213 1221 1246 1263 1261 1250 1236 1215
1655 1215 1196 1203 1250 1312 1353 1365 1360 1337 1286 1230 1211 1237 1266 1266 1258 1281 1328 1359 1359 1344 1325 1293 1259 1258 1296 1338 1352 1350 1350 1341 1312 1289 1313 1378 1433 1447 1439 1442 1457 1470
1650 1470 1474 1478 1490 1508 1525 1532 1525 1512 1511 1529 1548 1544 1520 1498 1490 1490 1494 1506 1519 1512 1481 1455 1460 1477 1468 1435 1415 1420 1423 1420 1440 1485 1507 1477 1432 1415 1408 1374 1336 1350 1406 1442
1645 1442 1432 1418 1420 1417 1410 1437 1497 1531 1506 1467 1462 1463 1428 1384 1390 1450 1512 1540 1535 1507 1464 1433 1432 1447 1451 1445 1447 1454 1461 1475 1501 1510 1489 1475 1511 1567 1577 1538 1507 1510 1515 1497
1640 1497 1475 1465 1454 1446 1467 1514 1548 1552 1563 1597 1616 1574 1498 1445 1438 1458 1490 1531 1572 1594 1586 1551 1501 1458 1447 1468 1488 1486 1470 1459 1451 1431 1406 1397 1418 1457 1488 1489
$$ packed form
1674E74J5J9J2J4Ok1l4rJ4LoK3M9K4k2k5J1J6j8l6oK8K8Kj7k1j4LK4L1K4K2L2L0Jl3m6k6J0
1670F81L9L4Jk7j1K6L6Oj9j0Kj7m7m1NM3L4ql7k5J9N6N1J8lQK5K2RJ0J6Kj6oK1J8j2j5L5P2
1665I95M4j1j3K2K3l1o0k2L2L6J2J7L7K2k6m5j5J5Oj6j0RKk4l3j5MMlNK6L8K4KlJ2J2j6l8
1660A018j2L9M8mn1l0L5P3N6J6j3k3k0j1ljJ0L0M0Rm0n5k0K1L1K0K3L0J8qj3QK5J7kj1j4k1
1655A215j9PM7O2M1J2nk3n1n6j9K6K9%qK3M7L1%j5j9l2l4jL8M2J4k%rk9k3K4O5N5J4qLJ5J3
1650A470MMJ2J8J7Ppj3jJ8J9mk4k2q%MJ2J3pl1k6NJ7rl3k0NLlK0M5K2l0m5j7pl4l8J4N6L6
1645A442j0j4KlpK7O0L4k5l9nJl5m4OO0O2K8nk8m3l1jJ5MoKPPJ4K6Rk1j4L6N6J0l9l1LNj8
1640A497k2j0j1qK1M7L4MJ1L4J9m2p6n3pK0L2M1M1K2ql5n0m3j1K1K0kj6j1qk0k5rK1L9L1J
$$ plain form
1636 1489 1472 1476 1523 1577 1585 1549 1515 1510 1514 1518 1534 1551 1538 1506 1514 1573 1605 1556 1486 1486 1539 1548 1491 1445 1457 1483 1466 1426 1416 1447 1491 1536 1595 1661 1702 1694 1650 1612 1613
1631 1613 1653 1695 1709 1701 1686 1662 1621 1581 1570 1581 1581 1563 1554 1571 1595 1608 1616 1630 1642 1652 1669 1691 1687 1636 1562 1512 1510 1547 1593 1614 1595 1564 1562 1595 1620 1605 1579 1583
1626 1583 1612 1620 1587 1551 1554 1598 1647 1660 1632 1600 1611 1673 1748 1795 1813 1829 1838 1810 1739 1667 1637 1642 1647 1649 1679 1743 1790 1769 1699 1660 1703 1794 1863 1875 1851 1828 1827 1852
1622 1852 1892 1920 1914 1882 1862 1872 1897 1900 1867 1826 1825 1886 1968 1996 1936 1841 1797 1832 1910 1979 2023 2039 2027 2003 2001 2034 2087 2135 2173 2200 2208 2202 2202 2211 2204 2162 2104 2072 2086
1617 2086 2117 2127 2097 2056 2062 2138 2241 2299 2299 2301 2350 2416 2449 2454 2468 2492 2489 2455 2428 2431 2440 2440 2460 2529 2630 2705 2715 2676 2635 2627 2659 2711 2761 2800 2826 2836 2839 2851
1612 2851 2876 2893 2879 2848 2844 2892 2973 3047 3088 3100 3098 3093 3080 3066 3076 3125 3191 3236 3267 3323 3403 3443 3407 3358 3379 3451 3479 3441 3428 3512 3647 3744 3782 3805 3838
1608 3838 3864 3870 3868 3873 3892 3936 4010 4090 4134 4132 4125 4167 4269 4395 4493 4544 4573 4615 4669 4706 4721 4742 4795 4862 4918 4963 5016 5073 5113 5146 5204 5299 5393 5442 5451 5469
1603 5469 5536 5635 5721 5778 5832 5915 6015 6105 6182 6273 6384 6483 6550 6606 6681 6777 6882 6991 7106 7224 7351 7500 7663 7794 7869 7929 8036 8195
$$ packed form
1636A489j7MM7N4Ql6l4nMMJ6J7j3l2QN9L2m9p0%N3Rn7m6J2K6j7m0j0L1M4M5N9O6M1qm4l8J
1631A613M0M2J4qj5k4m1m0j1J1%j8rJ7K4J3QJ4J2J0J7K2mn1p4n0kL7M6K1j9l1kL3K5j5k6M
1626A583K9Ql3l6LM4M9J3k8l2J1O2P5M7J8J6Rk8p1p2l0NNKL0O4M7k1p0l9M3R1O9J2k4k3jK5
1622A852M0K8ol2k0J0K5Ll3m1jO1Q2K8o0r5m4L5P8O9M4J6j2k4kL3N3M8L8K7Qo%Rpm2n8l2J4
1617B086L1J0l0m1OP6J03N8%KM9O6L3NJ4K4ll4k7LR%K0O9J01P5J0l9m1qL2N2N0L9K6J0LJ2
1612B851K5J7j4l1mM8Q1P4M1J2knj3j4J0M9O6M5L1N6Q0M0l6m9K1P2K8l8j3Q4J35R7L8K3L3
1608C838K6OkNJ9M4P4Q0M4kpM2J02J26R8N1K9M2N4L7J5K1N3O7N6M5N3N7M0L3N8R5R4M9RJ8
1603E469O7R9Q6N7N4Q3J00R0P7R1J11R9O7N6P5R6J05J09J15J18J27J49J63J31P5O0J07J59
$$ plain form
1600 8195 8364 8514 8644 8752 8836 8931 9079 9269 9448 9598 9759 9954 10152 10332 10523 10753 10987 11180 11347 11549 11800 12060 12292 12512
1597 12512 12754 13034 13338 13645 13945 14253 14594 14970 15354 15720 16069 16417 16775 17146 17532 17926 18320 18724 19164 19631 20077 20479 20880
1594 20880 21322 21782 22212 22614 23033 23470 23881 24259 24643 25047 25432 25768 26081 26402 26720 27015 27292 27561 27809 28034 28273 28549 28831
1591 28831 29077 29289 29495 29702 29912 30154 30449 30755 31013 31239 31507 31849 32227 32602 32984 33378 33770 34171 34632 35175 35755 36332 36930
1589 36930 37579 38251 38903 39557 40271 41042 41810 42553 43315 44125 44956 45775 46584 47390 48175 48921 49651 50383 51089 51721 52271 52763 53219
1586 53219 53640 54026 54373 54653 54834 54929 54976 54990 54942 54810 54616 54398 54161 53881 53551 53196 52847 52512 52173 51809 51417 51019 50654 50352
1583 50352 50109 49891 49664 49422 49189 48998 48872 48819 48827 48871 48926 48994 49097 49255 49465 49708 49983 50298 50646 50999 51348 51712 52113 52531 52929
1580 52929 53293 53634 53965 54290 54612 54921 55180 55347 55429 55473 55497 55462 55333 55128 54877 54567 54170 53699 53201 52688 52125 51491 50807 50099
$$ packed form
1600H195J69J50J30J08Q4R5J48J90J79J50J61J95J98J80J91K30K34J93J67K02K51K60K32K20
1597A2512K42K80L04L07L00L08L41L76L84L66L49L48L58L71L86L94L94M04M40M67M46M02M01
1594B0880M42M60M30M02M19M37M11L78L84M04L85L36L13L21L18K95K77K69K48K25K39K76K82
1591B8831K46K12K06K07K10K42K95L06K58K26K68L42L78L75L82L94L92M01M61N43N80N77N98
1589C6930O49O72O52O54P14P71P68P43P62Q10Q31Q19Q09Q06P85P46P30P32P06O32N50M92M56
1586E3219M21L86L47K80J81R5M7J4m8j32j94k18k37k80l30l55l49l35l39l64l92l98l65l02
1583E0352k43k18k27k42k33j91j26n3QM4N5O8J03J58K10K43K75L15L48L53L49L64M01M18L98
1580E2929L64L41L31L25L22L09K59J67Q2M4K4l5j29k05k51l10l97m71m98n13n63o34o84p08
$$ plain form
1577 50099 49369 48618 47854 47072 46253 45402 44565 43776 43027 42295 41581 40886 40178 39423 38655 37946 37328 36762 36203 35656 35146 34678 34236
1574 34236 33804 33380 32963 32561 32193 31876 31600 31339 31075 30821 30598 30399 30189 29950 29704 29484 29281 29058 28814 28589 28394 28168 27852
1571 27852 27469 27102 26786 26484 26158 25811 25453 25068 24652 24228 23816 23400 22958 22500 22044 21595 21157 20739 20325 19870 19364 18859 18413
1568 18413 18013 17611 17196 16793 16409 16025 15652 15322 15031 14730 14402 14087 13819 13562 13259 12905 12556 12254 11993 11738 11473 11214 10984
1566 10984 10784 10590 10380 10171 9987 9820 9640 9445 9265 9105 8934 8744 8580 8481 8414 8316 8171 8017 7879 7743 7605 7490 7409 7337
1563 7337 7239 7114 6983 6859 6746 6644 6552 6463 6378 6300 6225 6137 6034 5939 5871 5817 5749 5666 5597 5560 5535 5501 5454 5399 5332 5246 5156 5087 5043 5012 4986
1559 4986 4970 4955 4914 4848 4801 4806 4824 4788 4690 4595 4545 4508 4439 4359 4326 4343 4353 4311 4239 4183 4156 4141 4125 4108 4091 4067 4032 3992 3965 3966 3995 4021 4013 3983 3975 4009
1555 4009 4045 4032 3973 3934 3964 4043 4110 4134 4143 4181 4258 4347 4421 4489 4580 4704 4838 4950 5023 5065 5080 5070 5044 5019 5001 4976 4922 4836 4728 4608 4479 4350
$$ packed form
1577E0099p30p51p64p82q19q51q37p89p49p32p14o95p08p55p68p09o18n66n59n47n10m68m42
1574C4236m32m24m17m02l68l17k76k61k64k54k23j99k10k39k46k20k03k23k44k25j95k26l16
1571B7852l83l67l16l02l26l47l58l85m16m24m12m16m42m58m56m49m38m18m14m55n06n05m46
1568A8413m00m02m15m03l84l84l73l30k91l01l28l15k68k57l03l54l49l02k61k55k65k59k30
1566A0984k00j94k10k09j84j67j80j95j80j60j71j90j64r9o7r8j45j54j38j36j38j15q1p2
1563G337r8j25j31j24j13j02r2q9q5p8p5q8j03r5o8n4o8q3o9l7k5l4m7n5o7q6r0o9m4l1k6
1559D986j6j5m1o6m7NJ8l6r8r5n0l7o9q0l3J7J0m2p2n6k7j5j6j7j7k4l5m0k7JK9K6ql0qL4
1555D009L6j3n9l9L0P9O7K4RL8P7Q9P4O8R1J24J34J12P3M2J5j0k6k5j8k5n4q6j08j20j29j29
$$ plain form
1551 4350 4237 4141 4047 3950 3867 3810 3759 3688 3603 3520 3431 3323 3226 3194 3215 3203 3110 2995 2947 2964 2972 2938 2898 2882 2864 2820 2764 2723 2697 2679 2678 2689 2681 2640
1546 2640 2596 2574 2557 2525 2496 2501 2522 2511 2468 2441 2451 2468 2459 2435 2426 2439 2455 2457 2438 2406 2385 2398 2438 2472 2482 2486 2495 2486 2434 2358 2313 2324 2362 2382 2365 2326 2287 2259
1542 2259 2242 2239 2254 2281 2298 2286 2256 2241 2253 2264 2251 2231 2226 2225 2199 2153 2137 2170 2217 2236 2237 2253 2273 2253 2189 2136 2134 2151 2130 2068 2026 2043 2096 2142 2168 2188 2198
1537 2198 2177 2127 2078 2059 2077 2118 2163 2188 2182 2158 2146 2155 2168 2178 2192 2217 2247 2272 2281 2264 2212 2157 2151 2203 2253 2243 2189 2147 2132 2119 2106 2128 2179 2213 2219 2254 2355
1533 2355 2468 2526 2533 2539 2545 2517 2469 2461 2506 2545 2535 2507 2512 2550 2591 2621 2633 2609 2536 2442 2369 2322 2288 2274 2305 2372 2427 2424 2370 2311 2297 2332 2382 2405 2402 2408 2434 2448
1528 2448 2426 2387 2364 2353 2338 2329 2348 2385 2405 2403 2403 2417 2434 2450 2471 2482 2466 2440 2446 2485 2512 2505 2495 2520 2572 2623 2655 2656 2621 2568 2542 2556 2578 2585 2590 2603 2592 2543
1523 2543 2511 2551 2630 2667 2647 2635 2673 2724 2739 2727 2732 2765 2801 2815 2813 2816 2833 2850 2846 2831 2840 2887 2939 2961 2965 2987 3029 3061 3073 3076 3076 3072 3078 3115 3165 3192 3197 3213 3243 3241
1519 3241 3191 3144 3154 3214 3287 3365 3443 3493 3493 3482 3515 3592 3663 3701 3728 3769 3809 3828 3828 3830 3847 3878 3914 3951 3994 4056 4128 4182 4204 4223 4276 4355 4422 4463 4504 4572
$$ packed form
1551D350j13r6r4r7q3n7n1p1q5q3q9j08r7l2K1j2r3j15m8J7Ql4m0j6j8m4n6m1k6j8jJ1qm1
1546B640m4k2j7l2k9NK1j1m3k7J0J7rk4rJ3J6Kj9l2k1J3M0L4J0MRrn2p6m5J1L8K0j7l9l9k8
1542B259j7lJ5K7J7j2l0j5J2J1j3k0njk6m6j6L3M7J9JJ6K0k0o4n3kJ7k1o2m2J7N3M6K6K0J0
1537B198k1n0m9j9J8M1M5K5ok4j2RJ3J0J4K5L0K5Rj7n2n5oN2N0j0n4m2j5j3j3K2N1L4OL5J01
1533B355J13N8POOk8m8qM5L9j0k8NL8M1L0J2k4p3r4p3m7l4j4L1O7N5ln4n9j4L5N0K3lOK6J4
1528B448k2l9k3j1j5rJ9L7K0k%J4J7J6K1J1j6k6OL9K7pj0K5N2N1L2Jl5n3k6J4K2PNJ3j1m9
1523B543l2M0P9L7k0j2L8N1J5j2NL3L6J4kLJ7J7mj5RM7N2K2MK2M2L2J2L%mOL7N0K7NJ6L0k
1519C241n0m7J0O0P3P8P8N0%j1L3P7P1L8K7M1M0J9%KJ7L1L6L7M3O2P2N4K2J9N3P9O7M1M1O8
$$ plain form
1514 4572 4664 4756 4835 4906 4981 5070 5173 5275 5370 5472 5595 5737 5894 6077 6298 6532 6751 6967 7222 7515 7808 8098 8434 8839 9265
1511 9265 9659 10055 10525 11067 11592 12031 12401 12747 13072 13338 13529 13658 13737 13760 13721 13613 13430 13175 12873 12560 12254 11944 11619 11290
1508 11290 10967 10642 10303 9969 9682 9464 9302 9166 9038 8910 8776 8642 8526 8444 8383 8313 8227 8136 8050 7966 7884 7820 7789 7777 7751 7689 7603
1505 7603 7525 7476 7446 7413 7380 7365 7379 7400 7406 7400 7403 7418 7423 7404 7366 7324 7288 7259 7233 7199 7158 7127 7128 7149 7155 7130 7101 7098 7119 7142 7160 7176 7188 7186 7174 7166 7174 7189 7202
1500 7202 7214 7233 7263 7297 7322 7328 7324 7329 7349 7372 7396 7436 7508 7601 7686 7745 7785 7818 7858 7926 8030 8140 8204 8212 8210 8253 8340 8427 8484 8529 8590 8675 8776 8881 8979
1496 8979 9057 9111 9163 9247 9372 9512 9631 9718 9794 9882 9984 10082 10168 10258 10380 10533 10687 10815 10924 11036 11160 11282 11398 11522 11660 11786
1493 11786 11878 11957 12070 12230 12409 12575 12732 12897 13073 13249 13423 13602 13789 13976 14164 14358 14566 14789 15026 15278 15543 15809 16070
1490 16070 16334 16621 16942 17287 17630 17956 18268 18578 18897 19233 19602 20012 20454 20912 21376 21854 22354 22877 23413 23958 24512 25091 25726
$$ packed form
1514D572R2R2P9P1P5Q9J03J02R5J02J23J42J57J83K21K34K19K16K55K93K93K90L36M05M26
1511I265L94L96M70N42N25M39L70L46L25K66J91J29P9K3l9j08j83k55l02l13l06l10l25l29
1508A1290l23l25l39l34k87k18j62j36j28j28j34j34j16q2o1p0q6r1q6q4q2o4l1j2k6o2q6
1505G603p8m9l0l3l3j5J4K1OoLJ5Nj9l8m2l6k9k6l4m1l1JK1Ok5k9lK1K3J8J6J2kj2qQJ5J3
1500G202J2J9L0L4K5OmNK0K3K4M0P2R3Q5N9M0L3M0O8J04J10O4QkM3Q7Q7N7M5O1Q5J01J05R8
1496H979P8N4N2Q4J25J40J19Q7P6Q8J02R8Q6R0J22J53J54J28J09J12J24J22J16J24J38J26
1493A1786R2P9J13J60J79J66J57J65J76J76J74J79J87J87J88J94K08K23K37K52K65K66K61
1490A6070K64K87L21L45L43L26L12L10L19L36L69M10M42M58M64M78N00N23N36N45N54N79O35
$$ plain form
1487 25726 26440 27231 28070 28938 29845 30811 31839 32922 34068 35309 36664 38120 39661 41303 43089 45035 47111 49302 51664
1485 51664 54296 57248 60490 63990 67795 72012 76729 81992 87853 94394 101705 109880 119033 129291 140767 153555
1483 153555 167749 183424 200563 219041 238662 259176 280214 301248 321677 340923 358435 373667 386134 395503
1481 395503 401568 404163 403148 398505 390386 379053 364831 348138 329503 309510 288734 267741 247087 227249 208554
1479 208554 191184 175244 160778 147761 136096 125652 116297 107914 100410 93699 87680 82239 77283 72764 68649
1477 68649 64892 61449 58300 55440 52843 50458 48241 46161 44205 42385 40723 39213 37805 36455 35162 33944 32793
1475 32793 31689 30644 29676 28767 27875 26995 26156 25370 24619 23898 23222 22592 21972 21339 20711 20113 19555 19045 18586 18145 17677 17187
1473 17187 16733 16348 15984 15592 15194 14840 14521 14199 13868 13552 13233 12875 12495 12154 11859 11547 11191 10843 10558 10313 10059 9795 9552
$$ packed form
1487B5726P14P91Q39Q68R07R66J028J083J146J241J355J456J541J642J786J946K076K191K362
1485E1664K632K952L242L500L805M217M717N263N861O541P311Q175R153J0258J1476J2788
1483A53555J4194J5675J7139J8478J9621K0514K1038K1034K0429J9246J7512J5232J2467R369
1481C95503O065K595j015m643q119j1333j4222j6693j8635j9993k0776k0993k0654j9838j8695
1479B08554j7370j5940j4466j3017j1665j0444r355q383p504o711o019n441m956m519m115
1477F8649l757l443l149k860k597k385k217k080j956j820j662j510j408j350j293j218j151
1475C2793j104j045r68r09q92q80q39p86p51p21o76o30o20o33o28n98n58n10m59m41m68m90
1473A7187m54l85l64l92l98l54l19l22l31l16l19l58l80l41k95l12l56l48k85k45k54k64k43
$$ plain form
1470 9552 9330 9113 8907 8728 8555 8360 8154 7974 7815 7636 7425 7220 7057 6924 6799 6685 6588 6497 6395 6290 6193 6101 6002 5903 5817
1467 5817 5740 5655 5558 5470 5406 5353 5273 5152 5020 4928 4894 4887 4877 4865 4856 4832 4776 4710 4670 4657 4630 4574 4507 4449 4397 4355 4334 4327 4303 4265 4243 4249 4249 4219 4181 4151
1462 4151 4107 4031 3960 3938 3952 3957 3940 3923 3908 3884 3863 3864 3867 3838 3792 3776 3792 3797 3779 3778 3810 3834 3820 3791 3778 3779 3782 3796 3817 3807 3742 3654 3590 3561 3556 3571 3602 3616
1458 3616 3596 3567 3566 3579 3568 3528 3491 3472 3459 3444 3428 3414 3409 3427 3466 3489 3467 3425 3408 3415 3408 3382 3376 3415 3475 3519 3535 3524 3501 3494 3516 3540 3531 3501 3502 3547 3597 3621
1453 3621 3648 3707 3778 3824 3846 3872 3910 3951 3999 4071 4166 4255 4304 4318 4335 4408 4550 4712 4834 4912 4995 5116 5250 5367 5478 5612 5763 5911 6061
1449 6061 6230 6417 6609 6820 7072 7345 7595 7812 8035 8286 8529 8718 8856 8982 9121 9274 9431 9593 9755 9913 10066 10220 10373
1447 10373 10521 10676 10856 11056 11244 11395 11532 11706 11937 12194 12448 12721 13058 13465 13902 14336 14782 15275 15818 16388 16966 17552 18157
1444 18157 18786 19435 20084 20707 21293 21847 22362 22814 23184 23491 23770 24039 24292 24508 24663 24738 24746 24739 24769 24832 24880 24882 24848 24805 24778 24782 24822 24880
$$ packed form
1470I552k22k17k06j79j73j95k06j80j59j79k11k05j63j33j25j14r7r1j02j05r7r2r9r9q6
1467E817p7q5r7q8o4n3q0j21j32r2l4pj0j2rk4n6o6m0j3k7n6o7n8n2m2k1pk4l8k2O%l0l8l0
1462D151m4p6p1k2J4Nj7j7j5k4k1JLk9m6j6J6Nj8jL2K4j4k9j3JLJ4K1j0o5q8o4k9nJ5L1J4
1458C616k0k9jJ3j1m0l7j9j3j5j6j4nJ8L9K3k2m2j7Ppk6oL9O0M4J6j1k3pK2K4rl0JM5N0K4
1453C621K7N9P1M6K2K6L8M1M8P2R5Q9M9J4J7P3J42J62J22P8Q3J21J34J17J11J34J51J48J50
1449F061J69J87J92K11K52K73K50K17K23K51K43J89J38J26J39J53J57J62J62J58J53J54J53
1447A0373J48J55J80K00J88J51J37J74K31K57K54K73L37M07M37M34M46M93N43N70N78N86O05
1444A8157O29O49O49O23N86N54N15M52L70L07K79K69K53K16J55P5QpL0O3M8Kl4m3k7MM0N8
$$ plain form
1440 24880 24926 24957 24995 25042 25082 25126 25217 25375 25568 25760 25965 26221 26534 26890 27314 27857 28521 29250 30006 30813 31707 32688 33752 34920
1437 34920 36194 37518 38831 40146 41521 42941 44299 45517 46623 47673 48637 49424 49985 50340 50502 50449 50168 49692 49061 48297
1435 48297 47422 46467 45455 44381 43247 42073 40877 39667 38465 37325 36289 35345 34463 33642 32897 32227 31620 31081 30625 30252
1433 30252 29952 29722 29554 29439 29381 29409 29531 29724 29974 30320 30793 31352 31939 32570 33317 34207 35183 36201 37270 38404 39575 40753
1430 40753 41925 43060 44090 44970 45725 46377 46883 47178 47253 47131 46803 46237 45441 44465 43337 42047 40603 39056 37467 35864
1427 35864 34259 32672 31122 29611 28134 26710 25376 24159 23051 22027 21073 20199 19409 18683 17997 17370 16841 16410 16035
1425 16035 15689 15394 15173 15008 14864 14742 14659 14624 14636 14708 14840 15008 15194 15414 15688 15986 16268 16535 16811 17087 17327 17530 17722 17887
1422 17887 17978 17978 17917 17809 17623 17338 16977 16559 16077 15527 14939 14340 13726 13085 12439 11817 11218 10630 10054 9506 8986 8489 8022 7596
$$ packed form
1440B4880M6L1L8M7M0M4R1J58J93J92K05K56L13L56M24N43O64P29P56Q07Q94R81J064J168
1437C4920J274J324J313J315J375J420J358J218J106J050R64P87N61L55J62n3k81m76o31p64
1435D8297q75r55j012j074j134j174j196j210j202j140j036r44q82q21p45o70o07n39m56l73
1433C0252l00k30j68j15n8K8J22J93K50L46M73N59N87O31P47Q90R76J018J069J134J171J178
1430D0753J172J135J030Q80P55O52N06K95P5j22l28n66p96r76j128j290j444j547j589j603
1427C5864j605j587j550j511j477j424j334j217j108j024r54q74p90p26o86o27n29m31l75
1425A6035l46k95k21j65j44j22q3l5J2P2J32J68J86K20K74K98K82K67K76K76K40K03J92J65
1422A7887R1%o1j08j86k85l61m18m82n50n88n99o14o41o46o22n99n88n76n48n20m97m67m26
$$ plain form
1419 7596 7208 6846 6502 6176 5872 5602 5366 5143 4915 4697 4522 4383 4245 4097 3969 3871 3768 3641 3531 3475 3449 3401 3324 3248 3185
1416 3185 3120 3052 2995 2945 2890 2846 2842 2873 2902 2902 2882 2868 2869 2869 2840 2772 2692 2648 2643 2638 2617 2617 2659 2696 2682 2650 2654 2674 2654 2605 2594 2640 2675 2653 2607 2584 2581 2581 2587 2600
1411 2600 2603 2595 2597 2611 2616 2624 2684 2802 2906 2943 2957 3015 3116 3215 3305 3405 3502 3565 3612 3693 3821 3955 4064 4148 4213 4254 4283 4312 4322 4281 4199 4132 4104
1407 4104 4081 4018 3915 3792 3661 3535 3436 3371 3325 3283 3250 3237 3236 3233 3218 3184 3135 3089 3066 3067 3078 3094 3119 3148 3166 3177 3201 3236 3252 3235 3212 3217 3249 3289
1403 3289 3335 3392 3444 3460 3440 3427 3476 3596 3736 3838 3889 3923 3971 4027 4068 4102 4146 4199 4250 4315 4425 4567 4696 4800 4913 5042 5144 5192 5244
1400 5244 5374 5571 5761 5911 6055 6222 6392 6546 6698 6870 7049 7209 7360 7533 7747 7987 8234 8488 8765 9068 9374 9653 9887
1397 9887 10086 10283 10512 10776 11038 11259 11444 11637 11861 12081 12258 12407 12577 12764 12907 12984 13049 13161 13303 13425 13518 13614 13727 13834
1394 13834 13919 13986 14043 14105 14204 14356 14531 14679 14792 14912 15062 15224 15380 15539 15715 15905 16097 16283 16455 16607 16753 16909 17062 17176
$$ packed form
1419G596l88l62l44l26l04k70k36k23k28k18j75j39j38j48j28r8j03j27j10n6k6m8p7p6o3
1416C185o5o8n7n0n5m4mL1K9%k0j4J%k9o8q0m4nnk1%M2L7j4l2MK0k0m9j1M6L5k2m6k3l%OJ3
1411B600LqKJ4NQO0J18J04L7J4N8J01R9R0J00R7O3M7Q1J28J34J09Q4O5M1K9K9J0m1q2o7k8
1407D104k3o3j03j23j31j26r9o5m6m2l3j3jlj5l4m9m6k3JJ1J6K5K9J8J1K4L5J6j7k3NL2M0
1403C289M6N7N2J6k0j3M9J20J40J02N1L4M8N6M1L4M4N3N1O5J10J42J29J04J13J29J02M8N2
1400E244J30J97J90J50J44J67J70J54J52J72J79J60J51J73K14K40K47K54K77L03L06K79K34
1397I887J99J97K29K64K62K21J85J93K24K20J77J49J70J87J43P7O5J12J42J22R3R6J13J07
1394A3834Q5O7N7O2R9J52J75J48J13J20J50J62J56J59J76J90J92J86J72J52J46J56J53J14
$$ plain form
1391 17176 17245 17305 17371 17416 17412 17377 17340 17296 17222 17120 17006 16869 16680 16428 16146 15873 15627 15401 15177 14942 14704 14475 14254 14024 13788 13571
1388 13571 13387 13213 13016 12800 12591 12397 12198 11988 11786 11611 11460 11315 11161 11005 10875 10788 10715 10599 10423 10232 10067 9909 9721
1385 9721 9516 9332 9169 8993 8807 8647 8504 8313 8052 7791 7604 7477 7337 7156 6956 6755 6542 6320 6119 5958 5824 5693 5555
1382 5555 5409 5258 5115 4993 4881 4750 4605 4479 4390 4309 4198 4069 3962 3884 3803 3691 3568 3469 3405 3353 3290 3206 3109 3014 2940 2897 2866 2822
1379 2822 2760 2703 2670 2649 2622 2587 2559 2536 2499 2438 2373 2336 2330 2332 2316 2272 2211 2154 2113 2088 2065 2032 1988 1943 1910 1892 1887 1886 1884 1880 1876 1870 1853 1825 1794 1777 1782 1803 1819
1374 1819 1808 1770 1739 1745 1776 1784 1741 1676 1649 1675 1718 1732 1720 1713 1727 1743 1733 1695 1644 1596 1560 1538 1523 1508 1493 1495 1521 1542 1516 1444 1377 1355 1362 1362 1349 1338 1324
1369 1324 1296 1278 1301 1345 1356 1324 1305 1331 1361 1345 1309 1316 1370 1414 1406 1366 1331 1314 1309 1309 1306 1295 1283 1280 1280 1277 1285 1324 1374 1393 1373 1365 1401 1447 1458 1439 1432 1439 1429 1398
1365 1398 1383 1406 1431 1416 1371 1333 1311 1291 1267 1248 1233 1206 1176 1173 1203 1222 1196 1150 1128 1136 1134 1107 1080 1073 1066 1045 1031 1046 1071 1072 1063 1083 1127 1144 1120 1101 1118 1133
$$ packed form
1391A7176O9O0O6M5ml5l7m4p4j02j14j37j89k52k82k73k46k26k24k35k38k29k21k30k36k17
1388A3571j84j74j97k16k09j94j99k10k02j75j51j45j54j56j30q7p3j16j76j91j65j58j88
1385I721k05j84j63j76j86j60j43j91k61k61j87j27j40j81k00k01k13k22k01j61j34j31j38
1382E555j46j51j43j22j12j31j45j26q9q1j11j29j07p8q1j12j23r9o4n2o3q4r7r5p4m3l1m4
1379B822o2n7l3k1k7l5k8k3l7o1o5l7oKj6m4o1n7m1k5k3l3m4m5l3j8njkmmoj7k8l1j7NK1J6
1374A819j1l8l1OL1Qm3o5k7K6M3J4j2pJ4J6j0l8n1m8l6k2j5j5j5KK6K1k6p2o7k2P%j3j1j4
1369A324k8j8K3M4J1l2j9K6L0j6l6PN4M4qm0l5j7n%lj1j2l%lQL9N0J9k0qL6M6J1j9pPj0l1
1365A398j5K3K5j5m5l8k2k0k4j9j5k7l0lL0J9k6m6k2Qkk7k7ppk1j4J5K5JrK0M4J7k4j9J7J5
$$ plain form
1360 1133 1101 1050 1047 1095 1123 1088 1039 1047 1110 1163 1160 1120 1087 1079 1086 1091 1088 1086 1094 1113 1128 1130 1118 1099 1074 1044 1022 1023 1039 1043 1025 1000 979 947 892 844 845 894 941 945 919
1355 919 907 922 940 927 884 838 823 844 879 900 900 887 866 841 824 827 835 820 778 742 740 759 773 781 794 807 806 796 798 809 816 827 857 893 898 859 811 787 784 776
1350 776 756 744 752 781 816 838 835 820 818 831 835 815 789 778 772 750 722 715 731 752 762 762 750 724 700 700 718 722 699 679 694 736 759 735 681 637 633 667 710 725
1345 725 691 622 558 530 542 573 612 660 712 741 731 702 687 687 672 637 611 620 643 647 629 611 614 649 717 786 800 738 659 637 670 694 676 647 642 648 640 628
1340 628 631 643 648 650 656 654 633 606 592 588 586 596 636 687 714 708 696 700 712 713 697 674 658 658 661 647 612 587 602 657 719 760 771 752 714 688 699 730 738 706 665
1335 665 649 659 683 718 750 751 700 624 570 566 604 654 684 679 647 622 624 639 647 649 663 681 682 662 654 679 713 722 705 689 683 673 653 647 669 703 724 734 747 757
1331 757 751 745 774 829 852 807 738 722 768 815 812 765 718 699 713 743 764 757 742 761 813 851 840 808 806 832 844 822 798 805 835 849 820 765 724 721 740 743 723
1326 723 717 753 798 799 756 721 723 730 711 681 667 663 653 645 656 663 626 557 523 559 624 656 649 645 665 681 664 622 601 624 668 687 665 633 629 642 639 619 625 676 730
$$ packed form
1360A133l2n1lM8K8l5m9QO3N3lm0l3qPNlkQJ9J5Kj2j9k5l0k2JJ6Mj8k5k1l2n5m8JM9M7Mk6
1355I19j2J5J8j3m3m6j5K1L5K1%j3k1k5j7LQj5m2l6kJ9J4QJ3J3jj0KJ1PJ1L0L6Nl9m8k4lq
1350G76k0j2QK9L5K2lj5kJ3Mk0k6j1ok2k8pJ6K1J0%j2k6k4%J8Mk3k0J5M2K3k4n4m4mL4M3J5
1345G25l4o9o4k8J2L1L9M8N2K9j0k9j5%j5l5k6RK3Mj8j8LL5O8O9J4o2p9k2L3K4j8k9nOqj2
1340F28LJ2NKOkk1k7j4mkJ0M0N1K7oj2MJ2Jj6k3j6%Lj4l5k5J5N5O2M1J1j9l8k6J1L1Ql2m1
1335F65j6J0K4L5L2Jn1p6n4mL8N0L0nl2k5KJ5QKJ4J8Jk0qK5L4Rj7j6oj0k0oK2L4K1J0J3J0
1331G57ooK9N5K3m5o9j6M6M7lm7m7j9J4L0K1pj5J9N2L8j1l2kK6J2k2k4PL0J4k9n5m1lJ9Lk0
1326G23oL6M5Jm3l5KPj9l0j4mj0qJ1Pl7o9l4L6O5L2pmK0J6j7m2k1K3M4J9k2l2mJ3lk0ON1N4
$$ plain form
1321 730 739 707 683 676 658 623 606 628 648 623 574 552 571 596 609 627 658 675 657 624 603 588 563 541 541 547 526 486 478 516 562 585 610 665 706 669 565
1316 565 498 537 636 701 706 698 706 694 635 567 543 562 583 596 627 676 695 657 604 590 609 612 588 576 596 618 613 607 635 679 689 648 588 542 522 532 574 624
1312 624 646 632 605 575 531 478 460 499 547 548 510 487 495 497 481 480 517 563 581 574 558 534 502 481 485 488 474 470 507 562 586 583 593 616 605 545 489 488 522 541
1307 541 541 542 548 544 542 559 580 566 521 499 541 616 654 625 564 528 535 555 554 537 531 542 551 544 528 506 467 421 401 422 453 463 474 517 564 553 478 408 400 439
1302 439 479 506 539 582 616 622 603 575 557 553 540 500 458 464 525 590 609 589 564 545 520 501 515 554 566 519 448 418 456 525 564 551 514 489 482 477 472 475
1297 475 478 472 467 487 519 517 473 439 456 497 520 533 567 605 605 571 547 541 518 478 468 501 519 481 426 415 443 458 451 461 507 556 576 567 546 524 511 523 555
1292 555 581 572 526 468 436 455 519 592 628 605 537 464 421 422 450 487 530 580 611 588 521 463 450 463 463 451 450 462 466 459 455 460 468 480 494 495 478 473 511 575
1287 575 609 590 553 541 556 582 612 638 647 635 618 595 543 459 384 366 400 438 446 430 415 431 487 557 589 555 493 468 499 548 576 586 606 636 639 592
$$ packed form
1321G30Rl2k4pj8l5j7K2K0k5m9k2J9K5J3J8L1J7j8l3k1j5k5k2%Ok1m0qL8M6K3K5N5M1l7j04
1316E65o7L9R9O5NqQj2n9o8k4J9K1J3L1M9J9l8n3j4J9Lk4j2K0K2noK8M4J0m1o0m6k0J0M2N0
1312F24K2j4k7l0m4n3j8L9M8Jl8k3QKj6jL7M6J8pj6k4l2k1MLj4mL7N5K4lJ0K3j1o0n6jL4J9
1307E41%JOmkJ7K1j4m5k2M2P5L8k9o1l6PK0jj7oJ1Rpj6k2l9m6k0K1L1J0J1M3M7j1p5p0qL9
1302D39M0K7L3M3L4Oj9k8j8mj3m0m2OO1O5J9k0k5j9k5j9J4L9J2m7p1l0L8O9L9j3l7k5pnnL
1297D75LonK0L2km4l4J7M1K3J3L4L8%l4k4ok3m0j0L3J8l8n5j1K8J5pJ0M6M9K0rk1k2j3J2L2
1292E55K6rm6n8l2J9O4P3L6k3o8p3m3JK8L7M3N0L1k3o7n8j3J3%j2jJ2MpmNQJ2J4Jj7nL8O4
1287E75L4j9l7j2J5K6L0K6Rj2j7k3n2q4p5j8L4L8Qj6j5J6N6P0L2l4o2k5L1M9K8J0K0L0Lm7
$$ plain form
1283 592 513 454 444 474 512 545 574 593 590 566 538 517 501 489 485 486 481 479 510 574 630 633 592 548 525 513 498 487 494 526 573 609 603 560 520 522 558 593 606
1278 606 612 623 638 646 639 613 577 550 543 543 538 540 556 566 544 511 509 535 539 502 466 476 514 528 508 493 511 547 571 584 607 639 644 593 511 460 464 487 485 467 466
1273 466 474 453 405 378 396 424 430 427 444 480 515 541 549 528 492 481 506 525 510 491 509 544 538 489 451 457 486 505 513 519 525 534 555 579 579 549 511 490 486 484 479 470
1268 470 463 467 482 490 475 450 448 477 523 565 588 576 531 490 497 536 551 524 501 522 573 616 642 655 652 633 616 614 616 605 592 589 585 563 534 520 524 534 550 576
1263 576 609 637 654 652 619 564 512 480 457 439 444 480 520 532 531 552 585 595 580 575 589 594 569 535 518 509 486 447 411 391 388 393 392 384 390 427 478 504 489 461
1258 461 453 470 487 485 468 449 443 451 463 477 501 542 584 606 605 587 553 508 478 493 535 561 551 531 522 512 496 492 510 531 539 547 570 587 576 554 551 555 535 500
1253 500 491 516 537 534 549 622 719 762 725 660 626 625 617 590 571 582 600 592 556 523 521 558 616 669 698 705 702 693 670 638 626 635 619 545 459 441 496 554 568 572
1249 572 611 669 701 698 680 656 630 622 645 671 671 660 664 672 654 620 612 636 650 630 595 574 564 561 573 606 638 647 632 605 587 596 636 675 676 642 608 605 632 672
$$ packed form
1283E92p9n9j0L0L8L3K9J9lk4k8k1j6j2mJnkL1O4N6Lm1m4k3j2j5j1PL2M7L6om3m0KL6L5J3
1278F06OJ1J5Qpk6l6k7p%nKJ6J0k2l3kK6Ml7l6J0L8J4k0j5J8L6K4J3K3L2Nn1q2n1MK3kj8j
1273D66Qk1m8k7J8K8OlJ7L6L5K6Qk1l6j1K5J9j5j9J8L5om9l8OK9J9QOORK1K4%l0l8k1mknr
1268D70pMJ5Qj5k5kK9M6M2K3j2m5m1PL9J5k7k3K1N1M3K6J3lj9j7kKj1j3lmk2k9j4MJ0J6K6
1263E76L3K8J7kl3n5n2l2k3j8NL6M0J2jK1L3J0j5nJ4Nk5l4j7rk3l9l6k0lNjqOL7N1K6j5k8
1258D61qJ7J7kj7j9oQJ2J4K4M1M2K2jj8l4m5l0J5M2K6j0k0rj0j6mJ8K1QQK3J7j1k2lMk0l5
1253E00rK5K1lJ5P3R7M3l7o5l4jqk7j9J1J8ql6l3kL7N8N3K9Plrk3l2j2Rj6p4q6j8N5N8J4M
1249E72L9N8L2lj8k4k6qK3K6%j1MQj8l4qK4J4k0l5k1j0lJ2L3L2Rj5k7j8RM0L9Jl4l4lK7M0
$$ plain form
1244 672 708 717 692 651 616 587 563 573 642 727 745 684 622 619 647 656 655 673 696 687 652 625 612 593 567 558 567 566 552 549 577 620 655 677 693 706 713 706 685 666
1239 666 675 719 773 807 812 794 760 722 700 697 695 682 676 686 688 658 622 614 623 609 576 569 607 657 686 693 684 665 656 676 712 727 717 716 733 738 718 707 726 756 771 784
1234 784 818 855 860 833 801 784 782 803 854 920 956 934 869 813 807 843 862 835 798 804 837 835 794 775 808 841 826 801 813 830 797 738 729 778 813 792 758 756
1229 756 774 784 788 803 831 864 902 929 926 905 907 940 952 906 833 791 800 833 863 885 899 907 924 949 964 954 936 932 940 940 937 951 986 1027 1064 1097 1113 1098 1062
1224 1062 1030 1010 991 975 981 1006 1016 1001 993 1019 1048 1033 977 941 961 1007 1030 1023 1025 1058 1107 1137 1136 1121 1119 1141 1172 1186 1172 1150 1148 1170 1200 1218 1221 1206 1173 1143
1220 1143 1148 1193 1240 1247 1222 1199 1194 1200 1221 1252 1261 1213 1136 1107 1151 1207 1218 1211 1243 1312 1368 1392 1407 1419 1403 1358 1329 1350 1401 1434 1437 1435 1450 1492 1555 1613 1626 1586
1215 1586 1542 1557 1638 1726 1762 1747 1715 1692 1683 1691 1719 1757 1777 1773 1768 1789 1826 1845 1835 1820 1822 1837 1850 1857 1859 1854 1842 1833 1840 1864 1902 1953 2007 2042 2057 2074 2105 2132 2141 2151
1210 2151 2183 2212 2204 2181 2205 2282 2348 2359 2346 2358 2389 2404 2404 2421 2458 2487 2503 2530 2584 2651 2705 2733 2738 2736 2741 2747 2744 2749 2800 2898 2984 3012 3012 3037 3069 3059 3020 3032 3122
$$ packed form
1244F72L6Rk5m1l5k9k4J0O9Q5J8o1o2lK8RjJ8K3rl5k7j3j9k6rRjj4lK8M3L5K2J6J3Ppk1j9
1239F66RM4N4L4Nj8l4l8k2lkj3oJ0Kl0l6qRj4l3pL8N0K9Prj9rK0L6J5j0jJ7Nk0j1J9L0J5J3
1234G84L4L7Nk7l2j7kK1N1O6L6k2o5n6oL6J9k7l7OL3km1j9L3L3j5k5J2J7l3n9rM9L5k1l4k
1229G56J8J0MJ5K8L3L8K7lk1KL3J2m6p3m2RL3L0K2J4QJ7K5J5j0j8mQ%lJ4L5M1L7L3J6j5l6
1224A062l2k0j9j6OK5J0j5qK6K9j5n6l6K0M6K3pKL3M9L0jj5kK2L1J4j4k2kK2L0J8Lj5l3l0
1220A143NM5M7Pk5k3nOK1L1Rm8p7k9M4N6J1pL2O9N6K4J5J2j6m5k9K1N1L3LkJ5M2O3N8J3m0
1215A586m4J5Q1Q8L6j5l2k3rQK8L8K0mnK1L7J9j0j5KJ5J3PKnj2rPK4L8N1N4L5J5J7L1K7RJ0
1210B151L2K9qk3K4P7O6J1j3J2L1J5%J7L7K9J6K7N4O7N4K8NkNOlNN1R8Q6K8%K5L2j0l9J2R0
$$ plain form
1205 3122 3226 3285 3320 3375 3439 3485 3533 3617 3719 3786 3806 3816 3849 3899 3953 4019 4095 4163 4209 4240 4275 4329 4407 4501 4586 4651 4714 4799 4896 4975 5034 5108 5215
1201 5215 5338 5452 5560 5674 5785 5875 5944 6008 6081 6170 6283 6421 6571 6710 6827 6931 7037 7157 7291 7435 7586 7739 7884 8013 8138
1198 8138 8288 8473 8671 8860 9050 9257 9467 9651 9815 10000 10222 10461 10696 10930 11162 11382 11595 11824 12074 12316 12533 12752 13002
1195 13002 13263 13502 13719 13931 14139 14339 14557 14813 15080 15314 15514 15719 15944 16164 16361 16547 16735 16928 17128 17340 17540 17690 17791
1193 17791 17890 18021 18165 18285 18368 18416 18436 18440 18446 18449 18436 18413 18411 18433 18436 18379 18286 18208 18161 18117 18059 17994 17930 17857 17766 17661 17555 17446 17322 17173 17005 16846
1189 16846 16716 16600 16465 16303 16139 15992 15856 15717 15575 15431 15287 15150 15031 14913 14770 14612 14489 14426 14373 14277 14155 14063 13998 13907 13777
1186 13777 13663 13604 13556 13455 13301 13150 13046 12977 12912 12830 12729 12623 12537 12494 12491 12486 12443 12365 12282 12214 12147 12067 11986 11921 11859 11783 11698 11619 11537 11435 11343
1182 11343 11303 11294 11244 11137 11038 10998 10978 10919 10833 10761 10692 10585 10449 10320 10199 10071 9965 9912 9871 9767 9608 9480 9406 9315 9167 9020 8931 8867
$$ packed form
1205C122J04N9L5N5O4M6M8Q4J02O7K0J0L3N0N4O6P6O8M6L1L5N4P8R4Q5O5O3Q5R7P9N9P4J07
1201E215J23J14J08J14J11R0O9O4P3Q9J13J38J50J39J17J04J06J20J34J44J51J53J45J29J25
1198H138J50J85J98J89J90K07K10J84J64J85K22K39K35K34K32K20K13K29K50K42K17K19K50
1195A3002K61K39K17K12K08K00K18K56K67K34K00K05K25K20J97J86J88J93K00K12K00J50J01
1193A7791R9J31J44J20Q3M8K0MOLj3k3kK2Ln7r3p8m7m4n8o5o4p3r1j05j06j09j24j49j68j59
1189A6846j30j16j35j62j64j47j36j39j42j44j44j37j19j18j43j58j23o3n3r6j22r2o5r1j30
1186A3777j14n9m8j01j54j51j04o9o5q2j01j06q6m3lnm3p8q3o8o7q0q1o5o2p6q5p9q2j02r2
1182A1343m0rn0j07r9m0k0n9q6p2o9j07j36j29j21j28j06n3m1j04j59j28p4r1j48j47q9o4
$$ plain form
1178 8867 8765 8627 8495 8370 8232 8081 7929 7774 7631 7539 7493 7422 7276 7091 6928 6787 6645 6519 6431 6340 6197 6043 5963 5957 5929 5815
1175 5815 5655 5511 5394 5291 5207 5143 5075 4984 4886 4802 4729 4647 4544 4422 4302 4220 4180 4144 4075 3992 3939 3914 3872 3802 3730 3667 3583 3474 3375 3317
1172 3317 3289 3272 3258 3218 3129 3020 2959 2956 2945 2884 2812 2775 2758 2728 2695 2674 2634 2549 2459 2421 2417 2384 2311 2250 2235 2246 2254 2260 2271 2278 2274 2250 2196 2118 2052 2032 2048
1167 2048 2065 2069 2067 2052 2012 1965 1945 1948 1941 1908 1862 1804 1727 1656 1635 1663 1684 1659 1607 1566 1541 1519 1501 1495 1485 1455 1411 1379 1375 1392 1412 1418 1414 1417 1434 1439 1409 1362 1337
1162 1337 1340 1334 1301 1262 1236 1211 1177 1147 1143 1157 1177 1202 1225 1227 1197 1157 1129 1111 1101 1117 1172 1240 1272 1254 1212 1178 1160 1152 1141 1119 1095 1090 1104 1108 1080 1037 1006 988
1158 988 982 1010 1087 1172 1191 1122 1014 934 908 925 958 977 965 940 936 957 972 958 929 908 893 877 870 879 888 879 855 836 829 828 821 805 780 756 746 745 735 709 688
1153 688 699 739 788 830 861 882 904 935 956 925 839 761 760 821 867 858 827 816 818 806 782 759 738 715 716 762 830 869 863 836 811 789 770 765 765 742 686 634
1148 634 620 640 663 679 694 699 680 655 659 690 708 689 660 654 666 673 682 717 775 821 833 822 810 801 786 770 761 752 723 668 606 577 603 670 727 731 682 622 588
$$ packed form
1178H867j02j38j32j25j38j51j52j55j43r2m6p1j46j85j63j41j42j26q8r1j43j54q0ok8j14
1175E815j60j44j17j03q4o4o8r1r8q4p3q2j03j22j20q2m0l6o9q3n3k5m2p0p2o3q4j09r9n8
1172C317k8j7j4m0q9j09o1lj1o1p2l7j7l0l3k1m0q5r0l8ml3p3o1j5J1QOJ1Pmk4n4p8o6k0J6
1167B048J7Mkj5m0m7k0Lpl3m6n8p7p1k1K8K1k5n2m1k5k2j8oj0l0m4l2mJ7K0OmLJ7Nl0m7k5
1162A337Lol3l9k6k5l4l0mJ4K0K5K3Kl0m0k8j8j0J6N5O8L2j8m2l4j8qj1k2k4nJ4Mk8m3l1j8
1158I88oK8P7Q5J9o9j08q0k6J7L3J9j2k5mK1J5j4k9k1j5j6pRRrk4j9pjpj6k5k4j0jj0k6k1
1153F88J1M0M9M2L1K1K2L1K1l1q6p8jO1M6rl1j1Kj2k4k3k1k3JM6O8L9ok7k5k2j9n%k3n6n2
1148F34j4K0K3J6J5Nj9k5ML1J8j9k9oJ2PRL5N8M6J2j1j2rj5j6rrk9n5o2k9K6O7N7Mm9o0l4
$$ plain form
1143 588 578 574 574 592 631 674 705 714 703 682 665 660 662 659 651 650 654 653 642 633 633 628 610 595 607 632 631 590 549 557 605 642 625 564 503 481 504 549 584 590 573 549 525
1138 525 509 515 549 600 641 658 656 645 631 620 615 608 596 587 595 615 631 639 648 642 591 511 470 512 586 605 562 533 562 606 606 576 569 596 616 606 579 549 514 476
1133 476 457 462 464 451 456 512 592 632 606 555 527 526 534 548 575 607 620 611 603 609 618 616 605 601 607 609 592 558 527 524 539 535 491 440 446 522 602 611 556 509 518 556 567 541
1128 541 513 512 527 536 530 523 525 533 532 513 487 471 472 476 469 460 472 506 538 550 545 534 517 493 478 486 512 533 541 544 538 513 485 486 525 560 553 525 521 544 544 491 424 394 409
1122 409 433 445 447 441 421 391 372 377 398 430 477 530 552 519 460 434 456 485 477 440 414 415 432 458 489 512 504 472 447 445 446 430 409 408 428 456 487 517 533
1118 533 520 490 468 457 440 412 394 406 452 513 558 557 509 457 451 488 523 528 523 532 544 536 518 516 539 567 577 560 531 516 525 530 494 435 410 439 470 451 405
1113 405 386 402 410 389 365 369 402 454 513 561 580 567 540 511 488 474 466 451 430 430 471 520 532 507 488 492 490 457 414 398 414 436 443 432 409 391 389 401 416
1108 416 431 444 448 441 437 451 460 431 374 329 316 315 324 354 390 384 338 321 369 423 403 328 281 304 358 396 409 405 387 368 368 389 416 434 441 437 428 428 441 445 424 394
$$ packed form
1143E88j0m%J8L9M3L1Rj1k1j7nKlqjMjj1r%nj8j5J2K5jm1m1QM8L7j7o1o1k2K3M5L5Oj7k4k4
1138E25j6OL4N1M1J7kj1j4j1npj2rQK0J6QRon1q0m1M2P4J9m3k9K9M4%l0pK7K0j0k7l0l5l8
1133D76j9NKj3NN6Q0M0k6n1k8jQJ4K7L2J3rqORkj1mOKj7l4l1lJ5mm4n1OP6Q0Rn5m7RL8J1k6
1128E41k8jJ5RopKQjj9k6j6JMprJ2L4L2J2nj1j7k4j5QK6K1QLok5k8JL9L5pk8mK3%n3o7l0J5
1122D09K4J2Kok0l0j9NK1L2M7N3K2l3n9k6K2K9ql7k6JJ7K6L1K3ql2k5kJj6k1jK0K8L1L0J6
1118E33j3l0k2j1j7k8j8J2M6O1M5jm8n2oL7L5NnRJ2qj8kK3K8J0j7k9j5RNl6n9k5K9L1j9m6
1113D05j9J6Qk1k4ML3N2N9M8J9j3k7k9k3j4qj5k1%M1M9J2k5j9Mkl3m3j6J6K2Pj1k3j8kJ2J5
1108D16J5J3MpmJ4Rk9n7m5j3jRL0L6om6j7M8N4k0p5m7K3N4L8J3mj8j9%K1K7J8Pmr%J3Mk1l0
$$ plain form
1103 394 383 385 374 351 340 351 368 377 369 340 305 311 389 492 536 501 441 400 366 326 306 322 340 326 303 311 347 378 397 418 438 445 446 454 447 402 341 321 356
1098 356 391 377 334 320 361 423 453 433 388 364 382 421 440 428 412 418 440 449 439 427 427 431 426 406 375 343 327 352 412 460 442 369 309 308 342 370 387 415
1094 415 448 449 412 372 359 360 360 372 408 449 462 450 447 469 495 493 461 421 392 370 344 325 340 391 447 471 461 443 429 420 421 437 457 469 481 512 543 535 489
1089 489 453 442 412 344 292 308 358 367 331 311 331 348 333 317 337 378 411 438 469 491 484 466 472 503 519 493 441 397 379 380 386 399 429 473 505 499 465 437
1084 437 429 408 350 285 275 335 409 440 432 426 429 403 333 264 248 271 282 258 230 229 248 270 299 336 358 347 330 351 408 455 454 421 393 386 385 377 362 350 342 322
1079 322 283 245 248 293 336 339 322 321 337 345 354 392 442 453 407 355 343 363 387 412 441 451 421 378 365 380 381 356 336 341 352 349 343 362 405 447 467 458 423 373
1074 373 331 314 322 330 322 305 300 310 314 307 313 349 394 406 380 355 359 372 369 360 373 406 435 449 459 465 449 408 367 354 365 369 348 314 302 328 378 424 453 472 475
1069 475 449 404 386 415 444 416 341 286 285 310 334 367 413 431 389 326 311 352 391 392 376 372 363 329 292 293 322 336 332 352 410 462 468 451 456 471 450 398 370
$$ packed form
1103C94j1Kj1k3j1J1J7Rqk9l5OP8J03M4l5o0m1l4m0k0J6J8j4k3QL6L1J9K1K0PJQpm5o1k0L5
1098C56L5j4m3j4M1O2L0k0m5k4J8L9J9j2j6OK2Rj0j2%Mnk0l1l2j6K5O0M8j8p3o0jL4K8J7K8
1094D15L3Jl7m0j3J%J2L6M1J3j2lK2K6kl2m0k9k2k6j9J5N1N6K4j0j8j4rJJ6K0J2J2L1L1qm6
1089D89l6j1l0o8n2J6N0Rl6k0K0J7j5j6K0M1L3K7L1K2pj8OL1J6k6n2m4j8JOJ3L0M4L2ol4k8
1084D37qk1n8o5j0O0P4L1qoLk6p0o9j6K3J1k4k8jJ9K2K9L7K2j1j7K1N7M7jl3k8pjqj5j2qk0
1079C22l9l8LM5M3Lj7jJ6QRL8N0J1m6n2j2K0K4K5K9J0l0m3j3J5Jk5k0NJ1loJ9M3M2K0rl5n0
1074C73m2j7QQqj7nJ0MpOL6M5J2k6k5MJ3lrJ3L3K9J4J0Oj6m1m1j3J1Mk1l4j2K6N0M6K9J9L
1069D75k6m5j8K9K9k8p5n5jK5K4L3M6J8m2o3j5M1L9Jj6mrl4l7JK9J4mK0N8N2Oj7NJ5k1n2k8
$$ plain form
1065 370 396 432 439 434 451 469 447 388 334 304 285 273 282 307 324 329 336 346 336 313 311 340 365 371 389 426 437 392 342 348 386 383 327 282 291 329 362 385 386 341
1060 341 264 227 271 348 383 375 379 414 449 451 430 406 387 379 377 367 337 306 309 342 365 355 334 339 373 413 437 432 405 387 410 465 501 489 449 422 411 392 357
1055 357 315 272 236 231 272 329 349 323 297 301 317 317 301 292 290 290 300 335 380 399 381 353 341 339 332 325 332 351 364 365 371 390 405 391 351 308 277 255 236 226 230
1050 230 247 269 290 302 304 307 325 351 355 323 280 254 242 225 208 208 216 204 172 155 176 212 231 231 232 246 279 326 365 368 334 300 304 337 362 357 326 290 272 279
1045 279 296 295 282 292 334 373 374 358 367 396 406 386 365 367 383 400 410 396 352 301 288 319 356 368 359 338 304 277 298 365 421 417 376 355 365 376 376 383 403
1040 403 421 434 450 451 403 309 231 225 280 337 352 329 303 309 353 406 426 408 387 395 416 415 388 374 390 411 410 402 415 439 439 410 391 401 414 392 345 315 321
1035 321 344 358 358 344 316 289 287 310 325 309 280 269 283 294 283 264 260 273 287 294 296 300 299 292 291 315 355 378 367 345 340 340 312 271 274 342 415 427 385 352 356
1030 356 365 355 340 334 325 297 266 252 246 234 231 257 304 338 352 370 392 387 342 292 271 267 259 258 296 362 408 408 383 360 342 323 306 290 264 238 236 267 306 326
$$ packed form
1065C70K6L6PnJ7J8k2n9n4l0j9j2RK5J7NPJ0j0k3kK9K5OJ8L7J1m5n0OL8ln6m5RL8L3K3Jm5
1060C41p7l7M4P7L5qML5L5Kk1k4j9qkj0l0l1LL3K3j0k1NL4M0K4nk7j8K3N5L6j2m0k7j1j9l5
1055C57m2m3l6nM1N7K0k6k6MJ6%j6rk%J0L5M5J9j8k8j2kppPJ9J3JOJ9J5j4m0m3l1k2j9j0M
1050B30J7K2K1J2KLJ8K6Ml2m3k6j2j7j7%Qj2l2j7K1L6J9%JJ4L3M7L9Ll4l4ML3K5nl1l6j8P
1045B79J7jj3J0M2L9Jj6RK9J0k0k1KJ6J7J0j4m4n1j3L1L7J2rk1l4k7K1O7N6mm1k1J0J1%PK0
1040D03J8J3J6Jm8r4p8oN5N7J5k3k6OM4N3K0j8k1QK1jk7j4J6K1jqJ3K4%k9j9J0J3k2m7l0O
1035C21K3J4%j4k8k7kK3J5j6k9j1J4J1j1j9mJ3J4PKMjpjK4M0K3j1k2n%k8m1LO8P3J2m2l3M
1030C56Rj0j5ork8l1j4oj2lK6M7L4J4J8K2nm5n0k1mqjL8O6M6%k5k3j8j9j7j6k6k6kL1L9K0
$$ plain form
1026 326 336 357 387 405 405 402 406 421 451 495 525 512 459 397 351 329 336 361 377 365 339 328 332 325 299 270 254 259 288 333 359 339 298 291 320 339 327 319 348
1021 348 393 418 414 393 361 334 332 346 338 300 278 307 355 368 349 343 359 361 333 304 309 341 365 347 287 228 216 248 278 272 249 240 245 255 279 320 342 321 296
1016 296 320 385 438 452 441 409 351 291 269 284 300 310 341 383 382 316 234 198 220 269 319 345 337 312 311 340 361 339 291 256 254 277 309 325 308 279 274
1012 274 299 323 327 331 345 352 336 314 308 318 332 346 360 367 370 375 373 358 345 354 362 330 274 255 282 291 249 209 235 305 358 380 393 394 366 329 324 357 396 412 397
1007 397 353 301 283 313 355 382 409 446 450 389 312 291 322 340 330 336 363 361 311 266 265 273 240 171 117 109 144 193 224 227 224 240 261 257 236 238 271 301 307 307 322
1001 322 345 356 344 305 253 226 245 276 284 287 321 360 345 288 277 333 377 350 294 275 284 284 287 313 328 295 260 290 371 425 427 416 411 384 334 304 317 334
997 334 313 270 248 257 274 281 278 280 292 304 304 300 314 345 352 306 237 208 236 280 307 322 340 355 357 351 348 349 348 346 347 342 323 292 266 265 302 362 412 433 423 390 345
992 345 311 307 321 317 282 250 243 239 217 207 241 285 277 219 177 187 216 229 234 247 251 235 220 230 253 267 274 293 321 343 357 364 366 365 373 388 384 348 305 281 273 265 268
$$ packed form
1026C26J0K1L0J8%lMJ5L0M4L0j3n3o2m6k2PK5J6j2k6j1Mpk6k9j6NK9M5K6k0m1pK9J9j2qK9
1021C48M5K5mk1l2k7kJ4ql8k2K9M8J3j9oJ6Kk8k9NL2K4j8o0n9j2L2L0ok3rNJ0K4M1K2k1k5
1016B96K4O5N3J4j1l2n8o0k2J5J6J0L1M2jo6q2l6K2M9N0K6qk5jK9K1k2m8l5kK3L2J6j7k9n
1012B74K5K4MMJ4Pj6k2oJ0J4J4J4PLNkj5j3RQl2n6j9K7Rm2m0K6P0N3K2J3Jk8l7nL3L9J6j5
1007C97m4n2j8L0M2K7K7L7Mo1p7k1L1J8j0OK7kn0m5jQl3o9n4qL5M9L1LlJ6K1mk1KL3L0O%J5
1001C22K3J1j2l9n2k7J9L1QLL4L9j5n7j1N6M4k7n6j9R%LK6J5l3l5L0Q1N4Kj1nk7n0l0J3J7
997C34k1m3k2RJ7PlKJ2J2%mJ4L1Pm6o9k9K8M4K7J5J8J5KolJjkJnj9l1k6jL7O0N0K1j0l3m5
992C45l4mJ4ml5l2pmk2j0L4M4qn8m2J0K9J3NJ3Mj6j5J0K3J4PJ9K8K2J4PKjQJ5ml6m3k4qqL
$$ plain form
986 268 303 351 364 328 281 270 294 321 325 303 270 246 245 264 279 277 264 269 299 338 359 357 343 324 304 292 303 330 341 322 293 287 301 302 279 261 275 308 324
982 324 307 284 289 317 336 325 304 304 324 329 311 302 326 359 373 377 402 437 444 413 379 366 364 363 373 389 379 326 269 266 323 389 413 392 358 346 362 383 382 362
977 362 344 331 302 265 263 317 387 408 371 318 283 265 256 262 278 291 295 299 302 282 239 210 226 263 271 241 217 235 274 290 276 263 269 283 296 318 352 367 346
972 346 323 343 399 438 433 408 382 341 288 258 271 290 277 262 293 358 397 388 368 363 350 317 296 313 337 321 282 269 287 287 247 207 209 237 243 230 235 266 276
967 276 235 174 145 164 205 249 294 336 358 361 361 364 360 345 335 328 311 287 287 323 358 355 317 279 259 250 240 224 196 163 154 183 224 251 274 321 377 397 368 330
962 330 317 321 316 297 281 286 318 358 369 332 281 263 272 258 216 208 269 345 357 307 262 263 285 290 272 250 239 256 301 345 351 321 299 311 330 323 300 295 312 330
957 330 341 353 360 343 304 277 282 299 289 254 230 241 274 306 337 372 400 395 352 298 263 252 244 227 213 215 229 249 283 329 358 340 293 262 254 241 218 228
953 228 283 329 322 298 308 326 292 227 214 260 276 228 193 230 279 269 235 254 306 310 260 227 239 250 241 244 268 269 240 234 274 311 306 292 304 314 286 250 253
$$ packed form
986B68L5M8J3l6m7j1K4K7Mk2l3k4jJ9J5kj3NL0L9K1kj4j9k0j2J1K7J1j9k9oJ4Jk3j8J4L3J6
982C24j7k3NK8J9j1k1%K0Nj8rK4L3J4MK5L5Pl1l4j3kjJ0J6j0n3n7lN7O6K4k1l4j2J6K1jk0
977C62j8j3k9l7kN4P0K1l7n3l5j8rOJ6J3MMLk0m3k9J6L7Ql0k4J8L9J6j4j3OJ4J3K2L4J5k1
972C46k3K0N6L9nk5k6m1n3l0J3J9j3j5L1O5L9rk0nj3l3k1J7K4j6l9j3J8%m0m0KK8Oj3NL1J0
967B76m1o1k9J9M1M4M5M2K2L%Lmj5j0pj7k4%L6L5ll8l8k0rj0j6k8l3rK9M1K7K3M7N6K0k9l8
962C30j3Mnj9j6NL2M0J1l7n1j8Rj4m2qO1P6J2n0m5JK2Nj8k2j1J7M5M4Ol0k2J2J9pk3nJ7J8
957C30J1J2Pj7l9k7NJ7j0l5k4J1L3L2L1L5K8nm3n4l5j1qj7j4KJ4K0L4M6K9j8m7l1qj3k3J0
953B28N5M6pk4J0J8l4o5j3M6J6m8l5L7M9j0l4J9N2Mn0l3J2J1rLK4Jk9oM0L7nj4J2J0k8l6L
$$ plain form
948 253 279 279 254 247 266 272 255 248 281 336 376 378 338 274 224 217 252 296 316 302 270 247 257 283 283 244 211 231 293 343 352 332 309 290 276 272 284 311 341 349
943 349 325 300 312 354 367 333 304 332 393 433 447 461 465 429 374 362 400 423 392 342 319 320 325 335 356 369 363 360 383 417 420 384 338 322 344 380 387 354 311
938 311 296 305 306 295 300 329 357 368 370 360 321 265 240 264 294 298 303 339 375 366 325 304 316 332 334 327 307 265 217 204 234 270 280 272 270 285 313 342 361 371 379
933 379 385 374 349 338 356 370 347 315 322 360 376 359 346 350 334 287 261 289 323 299 236 206 229 254 248 238 260 304 334 338 338 344 342 316 283 269 277 285 277 269 285
928 285 321 349 356 354 361 372 370 345 305 267 249 256 275 290 302 323 347 352 328 289 256 244 254 280 295 272 222 192 205 232 235 224 237 272 286 257 221 225 270
923 270 318 337 332 333 349 361 346 315 307 339 375 364 304 255 270 343 411 426 389 336 296 268 246 234 244 263 265 245 226 235 263 284 286 278 265 249 241 259 292
919 292 304 277 234 213 217 218 212 227 282 345 365 341 328 365 419 432 397 366 373 394 389 368 361 366 352 312 276 266 271 280 297 326 348 349 341 331 303 252 211 225 283
914 283 332 346 344 347 352 350 349 353 348 330 317 326 335 315 278 259 270 282 280 286 324 377 402 380 335 305 310 337 355 347 325 323 354 386 381 341 307 306 323 331 328 324 313 284 256
$$ packed form
948B53K6%k5pJ9Oj7pL3N5M0Km0o4n0pL5M4K0j4l2k3J0K6%l9l3K0O2N0Rk0k3j9j4mJ2K7L0Q
943C49k4k5J2M2J3l4k9K8O1M0J4J4Ml6n5j2L8K3l1n0k3JNJ0K1J3olK3L4Ll6m6j6K2L6Pl3m3
938C11j5RJj1NK9K8J1Kj0l9n6k5K4L0MNL6L6rm1k1J2J6Kpk0m2m8j3L0L6J0qkJ5K8K9J9J0Q
933C79Oj1k5j1J8J4k3l2PL8J6j7j3Mj6m7k6K8L4k4o3l0K3K5oj0K2M4L0M%Okk6l3j4QQqqJ6
928B85L6K8PkPJ1kk5m0l8j8PJ9J5J2K1K4Nk4l9l3j2J0K6J5k3n0l0J3K7Lj1J3L5J4k9l6MM5
923B70M8J9nJJ6J2j5l1qL2L6j1o0m9J5P3O8J5l7n3m0k8k2j2J0J9Kk0j9RK8K1Kqj3j6qJ8L3
919B92J2k7m3k1MJoJ5N5O3K0k4j3L7N4J3l5l1PK1nk1pNj4m0l6j0NRJ7K9K2Jqj0k8n1m1J4N8
914B83M9J4kLNkjMnj8j3RRk0l7j9J1J2kOL8N3K5k2m5l0NK7J8qk2kL1L2nm0l4jJ7Qlmj1k9k8
$$ plain form
908 256 262 306 351 361 344 332 337 345 349 353 361 360 343 323 310 298 273 242 227 243 281 321 348 359 364 370 371 350 306 265 264 304 354 390 417 441 449 428 397 388 401 400
903 400 365 320 295 293 297 295 287 270 251 252 289 334 344 316 293 306 332 337 323 305 280 237 208 242 325 380 362 318 313 341 339 293 253 267 313 347 357 362 365 351
898 351 320 294 299 332 371 390 380 356 343 350 359 355 352 383 455 542 598 597 551 506 503 538 571 571 551 546 570 605 630 640 646 657 672 680 666 635 620 647 700 745 778
893 778 824 887 932 938 929 939 972 1006 1028 1036 1025 997 979 992 1019 1018 978 927 893 885 909 980 1087 1181 1211 1177 1126 1094 1077 1046 1000 962 950 948 929 897 881 891
889 891 906 913 929 970 1005 992 940 906 920 950 949 910 859 807 750 693 666 683 716 724 695 667 675 703 705 670 639 642 651 624 582 573 593 588 543 503 494 485 453 435 456
884 456 465 416 363 393 492 554 531 484 484 510 509 482 461 445 409 366 354 381 410 415 408 415 451 508 559 569 525 453 393 362 352 361 392 438 481 506 511 491 452
879 452 421 423 447 455 430 396 376 370 373 394 438 477 481 454 434 439 452 444 418 396 390 384 368 364 398 461 511 523 512 499 483 464 460 486 512 492 425 361 350 388 439
874 439 465 452 417 403 444 514 559 563 562 580 592 576 560 574 591 569 522 507 539 572 566 535 508 490 484 503 546 584 593 589 589 581 547 505 490 512 544 571 600
$$ packed form
908B56OM4M5J0j7j2NQMMQjj7k0j3j2k5l1j5J6L8M0K7J1NOJk1m4m1jM0N0L6K7K4Qk1l1rJ3j
903D00l5m5k5kMkqj7j9JL7M5J0k8k3J3K6Nj4j8k5m3k9L4Q3N5j8m4nK8km6m0J4M6L4J0NLj4
898C51l1k6NL3L9J9j0k4j3PRmlL1P2Q7N6jm6m5lL5L3%k0nK4L5K5J0OJ1J5Qj4l1j5K7N3M5L3
893G78M6O3M5OrJ0L3L4K2Qj1k8j8J3K7jm0n1l4qK4P1J07R4L0l4n1l2j7l1m6l8j2kj9l2j6J0
889H91J5PJ6M1L5j3n2l4J4L0jl9n1n2n7n7k7J7L3Qk9k8QK8Kl5l1LRk7m2rK0nm5m0rrl2j8K1
884D56Rm9n3L0R9O2k3m7%K6jk7k1j6l6m3j2K7K9NpPL6N7N1J0m4p2o0l1j0RL1M6M3K5Nk0l9
879D52l1KK4Qk5l4k0oLK1M4L9Mk7k0NJ3qk6k2ooj6mL4O3N0J2j1j3j6j9mK6K6k0o7o4j1L8N1
874D39K6j3l5j4M1P0M5MjJ8J2j6j6J4J7k2m7j5L2L3ol1k7j8oJ9M3L8Rm%ql4m2j5K2L2K7K9
$$ plain form
869 600 636 671 696 704 689 652 613 595 595 604 633 691 745 741 674 606 585 590 578 557 569 613 646 644 635 650 670 660 630 622 656 700 721 721 732 767 805 814 792 762
864 762 751 761 769 749 712 697 728 774 776 724 678 698 765 806 785 743 733 752 762 751 740 742 742 725 703 700 726 770 813 844 861 862 845 818 812 857 935 986 974
859 974 927 900 902 908 911 927 961 995 1033 1091 1155 1177 1137 1081 1062 1080 1106 1127 1147 1156 1145 1135 1154 1197 1229 1241 1250 1264 1269 1257 1244 1242 1249 1256 1264 1278 1303 1341 1376 1374 1329
854 1329 1276 1257 1263 1261 1255 1282 1351 1419 1456 1471 1483 1485 1470 1456 1463 1482 1495 1500 1501 1503 1512 1543 1585 1608 1604 1603 1622 1637 1629 1617 1629 1651 1659 1666 1695 1732 1753 1771 1818 1883 1922 1930
849 1930 1947 1991 2026 2019 1986 1962 1957 1958 1955 1951 1966 2019 2108 2194 2233 2232 2227 2240 2258 2273 2292 2313 2330 2355 2408 2477 2524 2542 2559 2587 2602 2603 2633 2708 2789 2840 2878 2933 2989
844 2989 3022 3039 3065 3096 3123 3168 3249 3340 3395 3408 3414 3439 3484 3547 3618 3675 3714 3765 3849 3940 4000 4032 4061 4073 4054 4049 4115 4225 4289 4284 4291 4367 4469 4536 4575 4627
840 4627 4688 4723 4743 4787 4868 4975 5101 5237 5346 5393 5412 5470 5594 5745 5885 6020 6177 6368 6592 6842 7105 7356 7578 7778 7969 8156
837 8156 8341 8529 8723 8915 9092 9246 9384 9521 9680 9873 10097 10342 10607 10903 11242 11634 12081 12579 13118 13704 14367 15153 16107
$$ packed form
869F00L6L5K5Qj5l7l9j8%RK9N8N4mo7o8k1Nj2k1J2M4L3krJ5K0j0l0qL4M4K1%J1L5L8Rk2l0
864G62j1J0Qk0l7j5L1M6Kn2m6K0O7M1k1m2j0J9J0j1j1K%j7k2lK6M4M3L1J7Jj7k7oM5P8N1j2
859I74m7k7KOLJ6L4L4L8N8O4K2m0n6j9J8K6K1K0Rj1j0J9M3L2J2RJ4Nj2j3kPPQJ4K5L8L5km5
854A329n3j9OkoK7O9O8L7J5J2Kj5j4PJ9J3NJKRL1M2K3mjJ9J5qj2J2K2QPK9L7K1J8M7O5L9Q
849A930J7M4L5pl3k4nJlmJ5N3Q9Q6L9jnJ3J8J5J9K1J7K5N3O9M7J8J7K8J5JL0P5Q1N1L8N5N6
844B989L3J7K6L1K7M5Q1R1N5J3OK5M5O3P1N7L9N1Q4R1O0L2K9J2j9nO6J10O4nPP6J02O7L9N2
840D627O1L5K0M4Q1J07J26J36J09M7J9N8J24J51J40J35J57J91K24K50K63K51K22K00J91J87
837H156J85J88J94J92J77J54J38J37J59J93K24K45K65K96L39L92M47M98N39N86O63P86R54
$$ plain form
834 16107 17285 18761 20604 22839 25457 28461 31846 35514 39234 42748 45910 48719 51207 53363 55159 56606 57736
832 57736 58593 59304 60146 61408 63175 65329 67815 70801 74458 78647 82943 86964 90575 93771 96511 98731 100379 101385
830 101385 101702 101538 101424 101862 102915 104313 106011 108425 111964 116456 121211 125601 129390 132553 135003 136587 137164 136568 134657
827 134657 131583 127921 124262 120652 116680 112227 107918 104654 102807 102028 101744 101598 101437 101143 100602 99693 98205 95908 92840
825 92840 89394 85942 82433 78541 74220 69932 66282 63537 61559 60077 58884 57838 56807 55686 54394 52838 50916
823 50916 48605 46008 43249 40315 37069 33463 29711 26188 23160 20653 18564 16828 15422 14293 13353 12551 11871 11296
821 11296 10794 10353 9964 9595 9214 8831 8485 8183 7901 7633 7387 7146 6881 6608 6378 6205 6049 5882 5718 5571 5418 5241 5053
818 5053 4874 4698 4520 4356 4221 4107 4005 3923 3851 3755 3627 3507 3428 3372 3297 3197 3093 2997 2914 2853 2810 2753 2664 2559 2471 2402 2329 2253 2191
$$ packed form
834A6107J178J476J843K235K618L004L385L668L720L514L162K809K488K156J796J447J130
832E7736Q57P11Q42J262J767K154K486K986L657M189M296M021L611L196K740K220J648J006
830A01385L17j64j14M38J053J398J698K414L539M492M755M390L789L163K450J584N77n96j911
827A34657l074l662l659l610l972m453m309l264j847p79k84j46j61k94n41r09j488k297l068
825I2840l446l452l509l892m321m288l650k745j978j482j193j046j031j121j292j556j922
823E0916k311k597k759k934l246l606l752l523l028k507k089j736j406j129r40q02o80n75
821A1296n02m41l89l69l81l83l46l02k82k68k46k41k65k73k30j73j56j67j64j47j53j77j88
818E053j79j76j78j64j35j14j02q2p2r6j28j20p9n6p5j00j04r6q3o1m3n7q9j05q8o9p3p6o2
$$ plain form
814 2191 2154 2129 2095 2038 1965 1902 1871 1856 1823 1766 1718 1695 1676 1642 1608 1592 1579 1547 1499 1441 1367 1289 1258 1294 1347 1356 1324 1294 1270 1225 1163 1132 1148 1175 1175 1151
810 1151 1125 1110 1106 1105 1097 1082 1080 1096 1102 1079 1053 1058 1076 1060 1016 997 1027 1068 1089 1106 1136 1158 1149 1116 1077 1023 947 873 848 893 979 1044 1045 995 952 950 960 934 883
805 883 859 876 900 904 897 886 862 837 845 880 893 866 846 875 914 897 829 771 759 772 780 780 780 785 796 809 811 799 794 810 832 834 817 800 790 789 800 819 830 823 812
800 812 805 788 753 728 747 790 807 786 764 766 777 773 761 761 779 806 829 838 833 828 839 854 844 806 771 768 790 807 796 763 729 714 725 748 766 766 742 694 644 634
795 634 681 750 788 794 812 855 884 860 799 746 723 731 768 822 850 820 759 737 777 829 840 822 819 835 826 780 733 727 755 790 823 856 877 875 864 867 871 845 790
791 790 748 749 781 815 834 829 799 764 762 800 838 843 821 795 765 724 689 678 683 688 696 714 717 674 606 574 604 658 686 678 659 651 652 642 611 579 588 650 730 778 790
786 790 789 782 756 716 691 700 727 744 736 702 653 612 598 601 599 595 613 655 688 685 657 639 644 661 668 667 679 722 773 786 754 724 738 762 734 665 627 663 732 769 765
781 765 758 776 814 851 863 843 813 802 806 799 776 764 776 794 801 804 808 794 752 703 669 646 626 617 629 650 663 670 669 641 588 546 553 600 645 661 649 620 595 593 610
$$ packed form
814B191l7k5l4n7p3o3l1j5l3n7m8k3j9l4l4j6j3l2m8n8p4p8l1L6N3Rl2l0k4m5o2l1J6K7%k4
810A151k6j5mjqj5kJ6Ok3k6NJ8j6m4j9L0M1K1J7L0K2rl3l9n4p6p4k5M5Q6O5Jn0m3kJ0k6n1
805H83k4J7K4Mpj1k4k5QL5J3k7k0K9L9j7o8n8j2J3Q%%NJ1J3Kj2nJ6K2Kj7j7j0jJ1J9J1pj1
800H12pj7l5k5J9M3J7k1k2KJ1mj2%J8K7K3RnnJ1J5j0l8l5lK2J7j1l3l4j5J1K3J8%k4m8n0j0
795F34M7O9L8OJ8M3K9k4o1n3k3QL7N4K8l0o1k2M0N2J1j8lJ6rm6m7oK8L5L3L3K1kj1LMk6n5
791G90m2JL2L4J9nl0l5kL8L8Nk2k6l0m1l5j1NNQJ8Lm3o8l2L0N4K8qj9qJj0l1l2RO2Q0M8J2
786G90jpk6m0k5RK7J7ql4m9m1j4LkmJ8M2L3lk8j8NJ7PjJ2M3N1J3l2l0J4K4k8o9l8L6O9L7m
781G65pJ8L8L7J2k0l0j1Mpk3j2J2J8PLMj4m2m9l4k3k0rJ2K1J3Pjk8n3m2PM7M5J6j2k9k5kJ7
$$ plain form
776 610 616 611 633 708 787 797 734 664 647 675 697 676 630 610 651 729 779 776 756 759 771 758 728 716 731 752 765 772 768 750 743 770 804 795 735 678 669 704 755 803
771 803 839 861 863 844 809 782 790 825 846 839 842 889 945 956 934 933 958 958 921 892 895 900 888 885 914 952 980 1013 1061 1095 1089 1066 1065 1084 1107 1140 1193 1244 1266 1260 1246
766 1246 1226 1200 1186 1204 1233 1244 1234 1230 1250 1298 1368 1435 1460 1428 1378 1356 1367 1383 1397 1416 1420 1378 1302 1246 1236 1246 1241 1222 1214 1221 1222 1208 1189 1178 1177 1177 1178 1178 1157 1091
761 1091 995 936 960 1023 1047 1020 1005 1035 1067 1053 1015 987 959 905 851 837 850 843 812 792 789 772 731 696 688 699 716 735 734 691 632 618 668 733 762 761 764 786
756 786 818 850 867 861 844 837 828 788 730 708 737 763 739 691 669 671 659 636 645 702 766 787 756 706 687 719 773 793 757 704 679 674 648 599 571 594 650 698
751 698 717 717 718 733 758 775 775 767 768 777 778 765 737 700 666 653 664 680 681 675 681 692 693 683 676 678 685 699 723 745 745 723 695 672 654 644 644 640 621 604 618 657 683 676
746 676 660 658 664 662 657 662 669 669 668 679 702 722 720 691 645 617 634 684 715 697 657 640 649 660 666 679 693 690 671 663 682 709 717 704 682 668 677 709 745 759 744 720 709
741 709 708 707 710 721 732 734 732 734 731 715 696 696 718 742 752 754 762 775 789 801 812 817 821 836 866 895 901 877 834 791 759 745 746 751 750 740 721 700 691 710 760 818 855 862
$$ packed form
776F10OnK2P5P9J0o3p0j7K8K2k1m6k0M1P8N0lk0LJ2j3l0j2J5K1J3Pmj8pK7L4ro0n7rL5N1M8
771H03L6K2Kj9l5k7QL5K1pLM7N6J1k2jK5%l7k9LNj2lK9L8K8L3M8L4ok3jJ9K3L3N3N1K2oj4
766A246k0k6j4J8K9J1j0mK0M8P0O7K5l2n0k2J1J6J4J9Mm2p6n6j0J0nj9qPJj4j9j1j%J%k1o6
761A091r6n9K4O3K4k7j5L0L2j4l8k8k8n4n4j4J3pl1k0lj7m1l5qJ1J7J9jm3n9j4N0O5K9jLK2
756G86L2L2J7oj7prm0n8k2K9K6k4m8k2Kj2k3RN7O4K1l1n0j9L2N4K0l6n3k5nk6m9k8K3N6M8
751F98J9%JJ5K5J7%qJRJj3k8l7l4j3J1J6JoOJ1Jj0pKPJ4K4K2%k2k8k3j8j0%mj9j7J4L9K6p
746F76j6kOknNP%jJ1K3K0kk9m6k8J7N0L1j8m0j7RJ1OJ3J4lj9qJ9K7Qj3k2j4RL2L6J4j5k4j1
741G09jjLJ1J1KkKlj6j9%K2K4J0KQJ3J4J2J1NMJ5L0K9Ok4m3m3l2j4JNjj0j9k1rJ9N0N8L7P
$$ plain form
735 862 845 815 779 747 732 740 768 811 850 855 819 772 754 765 765 733 692 676 689 713 736 749 742 717 703 725 771 815 847 876 897 886 840 788 760 756 760 766 780
731 780 801 814 801 760 706 661 641 637 634 635 668 744 826 855 820 778 786 830 851 822 784 779 801 816 827 854 885 886 854 831 828 810 765 744 790 866 895 871 849
726 849 855 849 811 777 785 815 828 828 843 872 891 892 890 890 882 865 849 839 826 813 811 824 847 877 913 931 911 865 837 846 857 837 802 792 812 826 822 830 873 923 934
721 934 902 868 859 858 837 799 773 777 809 857 901 919 900 866 854 873 894 890 866 848 850 862 873 885 908 945 972 963 921 885 877 877 855 825 828 868 897 887 870 887
716 887 931 969 985 988 982 974 989 1041 1093 1091 1034 980 966 964 938 907 913 949 963 937 914 940 994 1014 972 904 863 866 896 932 961 967 953 948 980 1031 1052 1029 1006 1010
711 1010 1007 959 904 906 957 980 933 870 858 896 939 972 1009 1050 1071 1058 1021 983 956 953 979 1030 1088 1134 1147 1110 1039 976 953 958 958 944 940 958 983 1003 1021 1043
706 1043 1058 1058 1047 1037 1032 1038 1063 1103 1139 1150 1145 1145 1150 1135 1098 1076 1099 1136 1129 1075 1038 1060 1108 1124 1110 1109 1128 1128 1102 1085 1099 1113 1097 1067 1049 1038 1024 1032 1083 1146
702 1146 1166 1143 1116 1098 1076 1057 1072 1120 1154 1162 1182 1230 1257 1218 1144 1093 1072 1046 1016 1017 1053 1080 1072 1063 1092 1146 1191 1214 1229 1231 1203 1153 1115 1111 1125 1135 1148 1177
$$ packed form
735H62j7l0l6l2j5QK8M3L9Nl6m7j8J1%l2m1j6J3K4K3J3pk5j4K2M6M4L2K9K1j1m6n2k8mMOJ4
731G80K1J3j3m1n4m5k0mlJL3P6Q2K9l5m2QM4K1k9l8nK2J5J1K7L1Jl2k3lj8m5k1M6P6K9k4k2
726H49Ool8l4QL0J3%J5K9J9Jk%qj7j6j0j3j3kJ3K3L0L6J8k0m6k8RJ1k0l5j0K0J4mQM3N0J1
721I34l2l4rjk1l8k6ML2M8M4J8j9l4j2J9K1mk4j8KJ2J1J2K3L7K7rm2l6q%k2l0LM0K9j0j7J7
716H87M4L8J6LoqJ5N2N2kn7n4j4kk6l1OL6J4k6k3K6N4K0m2o8m1LL0L6K9Oj4nL2N1K1k3k3M
711A010lm8n5KN1K3m7o3j2L8M3L3L7M1K1j3l7l8k7lK6N1N8M6J3l7p1o3k3N%j4mJ8K5K0J8K2
706A043J5%j1j0nOK5M0L6J1n%Nj5l7k2K3L7pn4l7K2M8J6j4jJ9%k6j7J4J4j6l0j8j1j4QN1O3
702A146K0k3k7j8k2j9J5M8L4QK0M8K7l9p4n1k1k6l0JL6K7qrK9N4M5K3J5Kk8n0l8mJ4J0J3K9
$$ plain form
697 1177 1204 1198 1161 1135 1149 1182 1194 1178 1156 1150 1159 1176 1192 1203 1211 1221 1229 1214 1167 1116 1102 1136 1189 1223 1224 1200 1173 1168 1186 1197 1174 1141 1147 1201 1253 1253 1211 1167 1146
692 1146 1140 1138 1133 1127 1124 1125 1129 1128 1122 1117 1112 1107 1116 1154 1197 1200 1162 1136 1155 1185 1180 1151 1136 1141 1144 1150 1183 1230 1255 1245 1229 1221 1208 1181 1157 1139 1116 1089 1081 1098 1121 1138 1159 1181 1183
687 1183 1167 1174 1223 1273 1278 1254 1251 1282 1305 1281 1221 1169 1159 1183 1204 1195 1169 1166 1200 1236 1238 1205 1169 1153 1158 1173 1183 1188 1198 1221 1235 1209 1155 1125 1149 1196 1226 1236 1243
682 1243 1241 1214 1170 1136 1127 1130 1132 1121 1092 1063 1064 1092 1098 1058 1021 1048 1127 1188 1192 1153 1096 1043 1032 1090 1171 1191 1140 1100 1131 1190 1214 1206 1209 1222 1202 1144 1093 1091 1139 1209
677 1209 1262 1275 1257 1237 1232 1229 1220 1224 1253 1283 1281 1242 1188 1146 1138 1180 1251 1299 1297 1270 1261 1271 1278 1275 1267 1251 1234 1247 1304 1357 1343 1272 1213 1205 1234 1273 1310 1321 1282 1213 1164
672 1164 1150 1133 1096 1072 1085 1107 1112 1108 1108 1091 1049 1024 1061 1138 1197 1213 1205 1187 1162 1143 1145 1157 1165 1185 1231 1276 1282 1263 1272 1313 1329 1292 1244 1226 1228 1213 1181 1152 1133
667 1133 1117 1119 1149 1187 1202 1191 1176 1166 1147 1119 1098 1092 1090 1086 1089 1106 1127 1145 1161 1183 1207 1221 1211 1172 1118 1085 1100 1149 1187 1189 1177 1181 1188 1167 1121 1088 1089 1095 1073 1039
662 1039 1040 1089 1146 1170 1170 1176 1195 1205 1205 1216 1249 1280 1286 1274 1271 1276 1274 1254 1219 1161 1076 997 978 1034 1112 1152 1154 1165 1199 1224 1217 1207 1230 1262 1244 1172 1119 1142 1203 1215
$$ packed form
697A177K7ol7k6J4L3J2j6k2oRJ7J6J1QJ0Qj5m7n1j4L4N3L4Jk4k7nJ8J1k3l3ON4N2%m2m4k1
692A146oknolJMjonnnRL8M3Ll8k6J9L0nk9j5NLOL3M7K5j0j6qj3k7k4j8k3k7qJ7K3J7K1K2K
687A183j6PM9N0Nk4lL1K3k4o0n2j0K4K1rk6lL4L6Kl3l6j6NJ5J0NJ0K3J4k6n4l0K4M7L0J0P
682A243kk7m4l4rLKj1k9k9JK8Om0l7K7P9O1Ml9n7n3j1N8Q1K0n1m0L1N9K4qLJ3k0n8n1kM8P0
677A209N3J3j8k0nlrMK9L0kl9n4m2qM2P1M8kk7rJ0Plqj6j7J3N7N3j4p1n9qK9L9L7J1l9o9m9
672A164j4j7l7k4J3K2Nm%j7m2k5L7P7N9J6qj8k5j9KJ2QK0M6M5Oj9RM1J6l7m8j8Kj5l2k9j9
667A133j6KL0L8J5j1j5j0j9k8k1okmLJ7K1J8J6K2K4J4j0l9n4l3J5M9L8Kj2MPk1m6l3JOk2l4
662A039JM9N7K4%OJ9J0%J1L3L1Oj2lNkk0l5n8q5p9j9N6P8M0KJ1L4K5pj0K3L2j8p2n3K3O1J2
$$ plain form
657 1215 1159 1108 1126 1183 1199 1159 1118 1116 1126 1112 1089 1096 1133 1161 1165 1165 1177 1178 1144 1092 1065 1083 1125 1156 1167 1180 1213 1258 1286 1281 1254 1226 1204 1189 1193 1219 1239 1224
653 1224 1185 1173 1207 1254 1269 1255 1243 1244 1235 1196 1146 1126 1157 1212 1241 1224 1197 1207 1244 1262 1252 1250 1270 1260 1193 1132 1156 1241 1288 1272 1262 1309 1363 1359 1318 1295 1293
648 1293 1275 1242 1232 1255 1280 1291 1297 1303 1296 1280 1275 1283 1292 1299 1315 1326 1302 1241 1190 1191 1234 1285 1317 1315 1277 1229 1209 1216 1213 1179 1146 1150 1185 1220 1247 1272 1283 1274 1272 1300 1331 1326
643 1326 1291 1272 1281 1294 1303 1331 1374 1387 1349 1307 1310 1350 1387 1401 1394 1359 1302 1267 1287 1336 1354 1337 1333 1362 1386 1366 1320 1294 1298 1300 1275 1226 1186 1180 1209 1239 1247 1248 1277 1322
638 1322 1336 1303 1275 1299 1349 1362 1327 1297 1311 1350 1376 1381 1377 1365 1342 1315 1294 1280 1273 1277 1301 1341 1387 1421 1423 1390 1345 1323 1332 1355 1378 1404 1423 1410 1359 1315 1328 1382
634 1382 1410 1374 1309 1274 1281 1300 1306 1305 1313 1327 1334 1325 1307 1288 1272 1261 1260 1278 1316 1363 1402 1421 1413 1375 1330 1315 1345 1384 1383 1335 1286 1275 1285 1278 1257 1262 1313 1369 1379 1346
629 1346 1316 1314 1315 1297 1286 1317 1372 1389 1345 1289 1280 1318 1369 1412 1445 1456 1433 1396 1381 1385 1363 1307 1275 1317 1413 1490 1506 1469 1410 1360 1343 1362 1386 1390 1383 1388 1400 1395 1378
624 1378 1386 1427 1465 1473 1466 1469 1476 1473 1475 1496 1513 1490 1440 1412 1421 1426 1392 1339 1315 1320 1317 1290 1273 1307 1375 1417 1394 1331 1279 1269 1292 1325 1350 1354 1336 1311 1302 1315 1331 1327 1306 1286
$$ packed form
657A215n6n1J8N7J6m0m1kJ0j4k3PL7K8M%J2Jl4n2k7J8M2L1J1J3L3M5K8nk7k8k2j5MK6K0j5
653A224l9j2L4M7J5j4j2Jrl9n0k0L1N5K9j7k7J0L7J8j0kK0j0o7o1K4Q5M7j6j0M7N4mm1k3k
648A293j8l3j0K3K5J1OOpj6nQRPJ6J1k4o1n1JM3N1L2kl8m8k0Pll4l3ML5L5K7K5J1rkK8L1n
643A326l5j9RJ3RK8M3J3l8m2LM0L7J4pl5n7l5K0M9J8j7mK9K4k0m6k6MKk5m9m0oK9L0QJK9M5
638A322J4l3k8K4N0J3l5l0J4L9K6Nmj2k3k7k1j4pMK4M0M6L4Kl3m5k2RK3K3K6J9j3n1m4J3N4
634A382K8l6o5l5PJ9OjQJ4Prj8j9j6j1jJ8L8M7L9J9ql8m5j5L0L9jm8m9j1J0pk1NN1N6J0l3
629A346l0kJj8j1L1N5J7m4n6rL8N1M3L3J1k3l7j5Mk2n6l2M2R6P7J6l7n9n0j7J9K4MpNJ2nj7
624A378QM1L8QpLPlKK1J7k3n0k8RNl4n3k4Nlk7j7L4O8M2k3o3n2j0K3L3K5Mj8k5rJ3J6mk1k0
$$ plain form
619 1286 1284 1297 1315 1325 1317 1304 1316 1356 1386 1371 1328 1318 1368 1443 1488 1488 1466 1455 1472 1507 1518 1473 1394 1340 1339 1355 1349 1342 1370 1411 1411 1361 1314 1308 1326 1334 1328 1319 1309 1307 1327
614 1327 1358 1361 1324 1291 1301 1340 1368 1385 1423 1482 1532 1558 1570 1567 1534 1478 1437 1424 1412 1376 1339 1337 1370 1409 1433 1434 1413 1374 1337 1330 1360 1407 1439 1436 1404 1370 1360 1372
609 1372 1393 1419 1457 1496 1505 1472 1428 1403 1390 1368 1344 1343 1368 1398 1415 1411 1383 1336 1289 1266 1267 1288 1333 1396 1440 1429 1388 1376 1415 1464 1479 1466 1451 1432 1401 1374 1376
605 1376 1394 1391 1360 1337 1351 1392 1427 1435 1406 1342 1268 1228 1246 1294 1323 1319 1315 1343 1387 1404 1383 1364 1379 1408 1413 1393 1385 1405 1430 1434 1415 1378 1323 1269 1262 1320 1393 1419 1406
600 1406 1410 1450 1477 1454 1408 1383 1374 1356 1332 1329 1341 1334 1305 1297 1338 1396 1417 1392 1363 1372 1419 1470 1486 1459 1416 1400 1421 1446 1444 1420 1405 1409 1416 1416 1417 1421 1419 1410 1411 1423 1427 1414 1404
595 1404 1405 1393 1348 1311 1337 1419 1486 1494 1470 1461 1470 1474 1468 1463 1456 1435 1403 1380 1366 1351 1338 1340 1356 1373 1391 1414 1433 1431 1412 1397 1391 1379 1360 1365 1410 1469 1500 1493 1461 1417 1373
590 1373 1343 1342 1361 1383 1402 1426 1456 1483 1497 1495 1476 1443 1414 1414 1446 1490 1517 1516 1497 1473 1456 1458 1480 1516 1550 1565 1555 1532 1520 1527 1535 1515 1471 1451 1492 1574 1637 1644 1609
585 1609 1568 1532 1489 1444 1427 1460 1522 1569 1583 1574 1558 1538 1515 1501 1505 1513 1508 1493 1495 1526 1560 1560 1526 1495 1504 1537 1545 1508 1462 1462 1509 1560 1574 1563 1564 1590 1622 1637 1632 1616
$$ packed form
619A286kJ3J8J0qj3J2M0L0j5m3j0N0P5M5%k2j1J7L5J1m5p9n4jJ6opK8M1%n0m7oJ8Qorj0kK0
614A327L1Ll7l3J0L9K8J7L8N9N0K6J2ll3n6m1j3j2l6l7kL3L9K4Jk1l9l7pL0M7L2ll2l4j0J2
609A372K1K6L8L9Rl3m4k5j3k2k4jK5L0J7mk8m7m7k3JK1M5O3M4j1m1j2L9M9J5j3j5j9l1k7K
605A376J8ll1k3J4M1L5Qk9o4p4m0J8M8K9mmK8M4J7k1j9J5K9Nk0qK0K5Mj9l7n5n4pN8P3K6j3
600A406MM0K7k3m6k5rj8k4lJ2pk9qM1N8K1k5k9RM7N1J6k7m3j6K1K5kk4j5MP%JMkrJJ2Mj3j0
595A404Jj2m5l7K6Q2O7Qk4rRMonpk1l2k3j4j5j3KJ6J7J8K3J9kj9j5oj2j9NM5N9L1pl2m4m4
590A373l0jJ9K2J9K4L0K7J4kj9l3k9%L2M4K7jj9k4j7KK2L6L4J5j0k3j2PQk0m4k0M1Q2O3Pl5
585A609m1l6m3m5j7L3O2M7J4rj6k0k3j4MQnj5KL1L4%l4l1RL3Ql7m6%M7N1J4j1JK6L2J5nj6
$$ plain form
580 1616 1594 1570 1550 1546 1566 1599 1627 1640 1647 1651 1642 1610 1574 1557 1556 1548 1534 1539 1562 1565 1531 1501 1519 1561 1574 1557 1557 1587 1606 1591 1582 1613 1651 1646 1610 1595 1619 1644 1642 1632 1649
575 1649 1695 1733 1725 1669 1600 1565 1586 1634 1671 1687 1699 1708 1698 1664 1627 1603 1585 1569 1566 1583 1594 1575 1537 1515 1532 1585 1653 1710 1730 1719 1714 1731 1740 1698 1630 1601 1631
570 1631 1676 1700 1717 1749 1772 1753 1707 1682 1693 1717 1742 1776 1818 1852 1879 1909 1932 1919 1878 1853 1858 1859 1827 1790 1779 1783 1776 1764 1772 1784 1765 1721 1697 1715 1756 1799 1846
566 1846 1893 1920 1918 1904 1891 1874 1854 1853 1875 1888 1865 1831 1828 1860 1900 1926 1938 1941 1938 1935 1925 1895 1858 1846 1874 1908 1921 1932 1969 2008 2006 1974 1967 1994 2011 1998 1986 1999 2003
561 2003 1971 1925 1899 1893 1895 1914 1961 2007 2017 2000 1988 1990 1997 2009 2023 2012 1959 1904 1906 1960 2008 2013 1999 1988 1975 1961 1974 2016 2047 2037 2014 2018 2041 2043 2014 1982 1973 1988 2020
556 2020 2064 2101 2113 2098 2085 2092 2110 2119 2123 2148 2209 2282 2329 2324 2275 2206 2147 2126 2151 2194 2210 2195 2188 2206 2208 2152 2077 2053 2079 2084 2047 2021 2044 2071 2062 2051 2088 2144 2156
552 2156 2129 2118 2131 2122 2091 2093 2147 2199 2203 2183 2180 2185 2174 2155 2160 2190 2226 2257 2284 2293 2281 2276 2304 2346 2358 2327 2286 2264 2267 2291 2331 2370 2394 2406 2421 2435 2435 2426 2431 2457 2484
547 2484 2495 2496 2500 2506 2508 2514 2532 2557 2571 2558 2529 2508 2508 2522 2525 2513 2504 2509 2522 2536 2566 2627 2692 2714 2682 2638 2621 2626 2632 2640 2657 2671 2660 2633 2622 2647 2698 2754 2807 2858 2900
$$ packed form
580A616k2k4k0mK0L3K8J3PMrl2l6j7jqj4NK3Ll4l0J8M2J3j7%L0J9j5rL1L8nl6j5K4K5kj0J7
575A649M6L8qn6o9l5K1M8L7J6J2Rj0l4l7k4j8j6lJ7J1j9l8k2J7N3O8N7K0j1nJ7Rm2o8k9L0
570A631M5K4J7L2K3j9m6k5J1K4K5L4M2L4K7L0K3j3m1k5NJl2l7j1Mpj2QJ2j9m4k4J8M1M3M7
566A846M7K7kj4j3j7k0jK2J3k3l4lL2M0K6J2Lllj0l0l7j2K8L4J3J1L7L9kl2pK7J7j3j2J3M
561B003l2m6k6oKJ9M7M6J0j7j2KPJ2J4j1n3n5KN4M8Nj4j1j3j4J3M2L1j0k3MK3Kk9l2rJ5L2
556B020M4L7J2j5j3PJ8RMK5O1P3M7nm9o9n9k1K5M3J6j5pJ8Kn6p5k4K6Nl7k6K3K7rj1L7N6J2
552B156k7j1J3rl1KN4N2Mk0lNj1j9NL0L6L1K7Rj2nK8M2J2l1m1k2LK4M0L9K4J2J5J4%rNK6K7
547B484J1JMOKOJ8K5J4j3k9k1%J4Lj2rNJ3J4L0O1O5K2l2m4j7NOQJ7J4j1k7j1K5N1N6N3N1M2
$$ plain form
542 2900 2922 2927 2927 2927 2921 2900 2873 2862 2879 2923 2981 3045 3109 3162 3184 3175 3159 3161 3187 3225 3260 3289 3311 3326 3340 3358 3373 3372 3356 3352 3386 3453 3518 3552 3555 3544 3529 3510 3491
537 3491 3484 3495 3515 3533 3548 3572 3611 3659 3688 3682 3648 3623 3639 3693 3756 3802 3829 3851 3883 3924 3959 3972 3967 3965 3982 4006 4022 4032 4057 4106 4162 4206 4239 4266 4287 4304 4326
532 4326 4359 4405 4463 4533 4597 4628 4629 4637 4675 4717 4735 4758 4827 4923 4980 4985 5003 5081 5187 5258 5294 5346 5433 5523 5594 5659 5731 5787 5801 5799 5832 5909 5987 6027 6060 6145
528 6145 6290 6437 6531 6582 6639 6726 6827 6926 7025 7126 7228 7346 7501 7683 7849 7983 8120 8291 8478 8645 8807 9018 9290 9571 9805
525 9805 9999 10207 10459 10736 10999 11235 11468 11722 11990 12245 12471 12671 12845 12975 13048 13070 13048 12974 12848 12703 12571 12425 12197 11872 11528
522 11528 11254 11048 10824 10529 10198 9894 9624 9340 9023 8720 8487 8323 8179 8024 7868 7720 7562 7375 7177 7000 6859 6746 6646
519 6646 6550 6454 6365 6290 6220 6136 6043 5977 5958 5955 5919 5844 5763 5693 5624 5562 5538 5560 5590 5591 5574 5580 5629 5705 5777 5824 5844 5844 5825 5792 5755 5731 5713 5663 5563 5455
515 5455 5386 5340 5250 5108 4987 4934 4905 4826 4702 4598 4538 4489 4428 4364 4311 4257 4195 4134 4082 4036 4001 3981 3964 3927 3886 3872 3878 3854 3781 3712 3699 3722 3732
$$ packed form
542B900K2N%%ok1k7j1J7M4N8O4O4N3K2rj6KK6L8L5K9K2J5J4J8J5jj6mL4O7O5L4Lj1j5j9j9
537C491pJ1K0J8J5K4L9M8K9ol4k5J6N4O3M6K7K2L2M1L5J3nkJ7K4J6J0K5M9N6M4L3K7K1J7K2
532D326L3M6N8P0O4L1JQL8M2J8K3O9R6N7NJ8P8J06P1L6N2Q7R0P1O5P2N6J4kL3P7P8M0L3Q5
528F145J45J47R4N1N7Q7J01R9R9J01J02J18J55J82J66J34J37J71J87J67J62K11K72K81K34
525I805J94K08K52K77K63K36K33K54K68K55K26K00J74J30P3K2k2p4j26j45j32j46k28l25l44
522A1528k74k06k24k95l31l04k70k84l17l03k33j64j44j55j56j48j58j87j98j77j41j13j00
519F646r6r6q9p5p0q4r3o6j9ll6p5q1p0o9o2k4K2L0Jj7OM9P6P2M7K0%j9l3l7k4j8n0j00j08
515E455o9m6r0j42j21n3k9p9j24j04o0m9o1o4n3n4o2o1n2m6l5k0j7l7m1j4Ok4p3o9j3K3J0
$$ plain form
510 3732 3717 3711 3739 3789 3839 3877 3899 3918 3958 4028 4095 4120 4108 4096 4101 4111 4125 4147 4168 4162 4136 4126 4146 4159 4146 4133 4150 4172 4156 4111 4081 4063 4016 3932 3856 3820
506 3820 3794 3753 3727 3744 3760 3713 3618 3556 3557 3556 3490 3389 3327 3328 3355 3371 3364 3332 3287 3263 3285 3323 3327 3304 3302 3330 3336 3297 3262 3275 3300 3286 3253 3268 3327 3360 3338 3309
501 3309 3317 3333 3319 3287 3276 3287 3300 3313 3339 3367 3376 3375 3383 3387 3360 3312 3285 3292 3294 3261 3215 3197 3217 3249 3263 3237 3169 3095 3069 3109 3169 3189 3164 3134 3119 3110 3096 3089 3099
497 3099 3122 3151 3187 3224 3244 3234 3204 3177 3162 3158 3158 3162 3179 3215 3264 3303 3314 3301 3286 3285 3294 3299 3299 3299 3309 3334 3367 3393 3404 3399 3387 3377 3380 3398 3421 3424 3404 3391 3413 3457
492 3457 3483 3481 3478 3495 3527 3561 3595 3627 3641 3628 3604 3598 3623 3671 3731 3786 3824 3844 3853 3846 3819 3787 3783 3809 3834 3840 3845 3871 3908 3940 3976 4022 4050 4038 4015 4033 4102 4180 4231
487 4231 4248 4241 4224 4221 4246 4287 4322 4353 4395 4430 4439 4455 4523 4613 4637 4569 4496 4506 4584 4650 4670 4666 4660 4659 4674 4718 4777 4824 4856 4885 4909 4927 4951 4992 5023 5023 5014 5038 5089
482 5089 5123 5134 5162 5234 5329 5407 5448 5443 5409 5386 5409 5465 5509 5535 5574 5624 5648 5642 5654 5719 5794 5826 5819 5814 5825 5836 5845 5867 5902 5936 5961 5983 5997 6004 6019 6053 6093 6124
478 6124 6149 6177 6198 6209 6228 6277 6341 6393 6428 6458 6468 6449 6437 6483 6585 6687 6753 6791 6813 6809 6792 6799 6843 6890 6911 6924 6958 7012 7067 7122 7177 7223 7253 7288 7347
$$ packed form
510C732j5oK8N0N0L8K2J9M0P0O7K5j2j2NJ0J4K2K1ok6j0K0J3j3j3J7K2j6m5l0j8m7q4p6l6
506C820k6m1k6J7J6m7r5o2Jjo6j01o2JK7J6pl2m5k4K2L8Mk3kK8Ol9l5J3K5j4l3J5N9L3k2k9
501C309QJ6j4l2j1J1J3J3K6K8RjQMk7m8k7PKl3m6j8K0L2J4k6o8p4k6M0O0K0k5l0j5rj4pJ0
497C099K3K9L6L7K0j0l0k7j5m%MJ7L6M9L9J1j3j5jRN%%J0K5L3K6J1nj2j0LJ8K3Lk0j3K2M4
492C457K6klJ7L2L4L4L2J4j3k4oK5M8O0N5L8K0Rpk7l2mK6K5ONK6L7L2L6M6K8j2k3J8O9P8N1
487D231J7pj7lK5M1L5L1M2L5RJ6O8R0K4o8p3J0P8O6K0mojJ5M4N9M7L2K9K4J8K4M1L1%rK4N1
482E089L4J1K8P2R5P8M1nl4k3K3N6M4K6L9N0K4oJ2O5P5L2pnJ1J1RK2L5L4K5K2J4PJ5L4M0L1
478F124K5K8K1J1J9M9O4N2L5L0J0j9j2M6J02J02O6L8K2mj7PM4M7K1J3L4N4N5N5N5M6L0L5N9
$$ plain form
473 7347 7424 7502 7579 7657 7721 7760 7795 7844 7893 7913 7911 7923 7964 8016 8061 8116 8200 8300 8378 8411 8412 8421 8460 8518 8572 8617 8671 8745 8835 8937 9046 9138 9195 9237 9312
469 9312 9421 9503 9523 9538 9623 9764 9880 9938 9989 10078 10187 10289 10391 10512 10639 10752 10862 10987 11117 11226 11319 11433 11593 11786 11981 12153
466 12153 12303 12449 12615 12808 13016 13226 13445 13684 13939 14188 14422 14649 14889 15159 15466 15815 16208 16643 17107 17591 18101 18666 19313
463 19313 20051 20886 21841 22967 24320 25955 27932 30321 33225 36773 41080 46191 52062 58604 65652 72892 79863 86145
461 86145 91525 95975 99490 102019 103504 103872 103011 100875 97646 93648 89042 83692 77479 70689 63984 57987 52976 48915
459 48915 45666 43100 41114 39625 38569 37876 37457 37233 37157 37215 37395 37681 38060 38541 39156 39931 40856 41902 43068 44393 45918
456 45918 47674 49698 52046 54767 57920 61620 66047 71389 77841 85635 94989 105970 118483 132381 147422 163023
454 163023 178242 192184 204411 214869 223511 230186 234765 237123 237034 234372 229466 222945 215091 205585 194151 181332
$$ packed form
473G347P7P8P7P8O4L9L5M9M9K0kJ2M1N2M5N5Q4J00P8L3JRL9N8N4M5N4P4R0J02J09R2N7M2P5
469I312J09Q2K0J5Q5J41J16N8N1Q9J09J02J02J21J27J13J10J25J30J09R3J14J60J93J95J72
466A2153J50J46J66J93K08K10K19K39K55K49K34K27K40K70L07L49L93M35M64M84N10N65O47
463A9313P38Q35R55J126J353J635J977K389K904L548M307N111N871O542P048P240O971O282
461H6145N380M450L515K529J485L68q61k136l229l998m606n350o213o790o705n997n011m061
459D8915l249k566j986j489j056o93m19k24p6N8J80K86L79M81O15P75R25J046J166J325J525
456D5918J756K024K348K721L153L700M427N342O452P794R354J0981J2513J3898J5041J5601
454A63023J5219J3942J2227J0458Q642O675M579K358q9k662m906o521p854r506j1434j2819
$$ plain form
452 181332 168384 156488 146200 137545 130335 124318 119230 114874 111116 107823 104854 102137 99659 97381 95228 93177
450 93177 91277 89563 88026 86673 85551 84675 84005 83514 83234 83221 83503 84098 85029 86325 88038 90263 93100 96620 100887 106000
448 106000 112043 119019 126853 135415 144452 153535 162206 170205 177480 184002 189667 194374 198053 200586 201850 201894 200954 199184
446 199184 196472 192665 187923 182741 177633 172888 168571 164627 160943 157385 153851 150279 146635 142912 139117 135239 131248
443 131248 127169 123104 119137 115254 111404 107616 103976 100527 97245 94121 91191 88474 85952 83612 81475 79566 77879
441 77879 76386 75055 73866 72844 72035 71437 70967 70559 70256 70152 70266 70531 70898 71377 71969 72633 73344 74116 74955 75838 76744 77654
439 77654 78514 79256 79878 80427 80898 81203 81274 81130 80808 80279 79501 78490 77303 75956 74442 72775 70982 69063 67019 64899
436 64899 62774 60667 58559 56450 54378 52370 50425 48541 46723 44967 43272 41659 40151 38723 37337 36000 34759
$$ packed form
452A81332j2948j1896j0288q655p210o017n088m356l758l293k969k717k478k278k153k051
450I3177j900j714j537j353j122q76o70m91k80j3K82N95R31J296J713K225K837L520M267N113
448A06000O043O976P834Q562R037R083Q671P999P275O522N665M707L679K533J264M4r40j770
446A99184k712l807m742n182n108m745m317l944l684l558l534l572l644l723l795l878l991
443A31248m079m065l967l883l850l788l640l449l282l124k930k717k522k340k137j909j687
441G7879j493j331j189j022q09n98m70m08l03j04J14K65L67M79N92O64P11P72Q39Q83R06R10
439G7654Q60P42O22N49M71L05P1j44l22n29p78j011j187j347j514j667j793j919k044k120
436F4899k125k107k108k109k072k008j945j884j818j756j695j613j508j428j386j337j241
$$ plain form
434 34759 33626 32556 31517 30525 29599 28707 27817 26953 26172 25477 24812 24132 23449 22807 22221 21675 21147 20634 20137 19646 19151 18667
431 18667 18224 17833 17463 17082 16702 16355 16043 15735 15423 15131 14865 14589 14274 13957 13684 13440 13166 12863 12598 12409 12251 12060 11840
429 11840 11637 11465 11296 11112 10926 10756 10606 10482 10377 10260 10104 9933 9801 9724 9659 9565 9446 9331 9236 9155 9069 8956 8813 8674 8580
426 8580 8510 8408 8263 8140 8084 8052 7972 7846 7733 7669 7640 7623 7598 7538 7434 7324 7244 7173 7074 6966 6905 6885 6835 6731 6633 6596 6592 6562 6502 6454 6438
422 6438 6430 6405 6364 6322 6293 6266 6215 6123 6023 5967 5970 5993 5995 5969 5922 5859 5793 5747 5717 5672 5607 5556 5543 5544 5533 5519 5518 5509 5478 5451 5453 5446 5385 5297 5260 5293 5335 5325
417 5325 5276 5234 5207 5168 5105 5050 5044 5085 5117 5090 5030 5007 5042 5077 5059 5015 4994 4993 4975 4958 4980 5018 4997 4909 4838 4849 4901 4924 4918 4924 4949 4961 4948 4932 4924 4904 4861
413 4861 4811 4774 4745 4708 4665 4634 4627 4634 4631 4597 4534 4462 4401 4367 4365 4379 4382 4364 4341 4336 4337 4316 4266 4218 4197 4198 4202 4212 4233 4260 4267 4236 4170 4103 4076 4106 4158 4173 4135 4086
408 4086 4068 4069 4051 4005 3970 3983 4036 4088 4107 4104 4106 4123 4128 4096 4043 4010 4019 4044 4045 4018 3995 4003 4035 4059 4056 4027 3994 3975 3980 4003 4017 3996 3946 3911 3917 3940 3936 3909 3892 3892 3867
$$ packed form
434C4759j133j070j039r92r26q92q90q64p81o95o65o80o83o42n86n46n28n13m97m91m95m84
431A8667m43l91l70l81l80l47l12l08l12k92k66k76l15l17k73k44k74l03k65j89j58j91k20
429A1840k03j72j69j84j86j70j50j24j05j17j56j71j32p7o5r4j19j15r5q1q6j13j43j39r4
426H580p0j02j45j23n6l2q0j26j13o4k9j7k5o0j04j10q0p1r9j08o1k0n0j04r8l7ml0o0m8j6
422F438qk5m1m2k9k7n1r2j00n6LK3Kk6m7o3o6m6l0m5o5n1j3Jj1j4jrl1k7Kpo1q8l7L3M2j0
417E325m9m2k7l9o3n5oM1L2k7o0k3L5L5j8m4k1jj8j7K2L8k1q8p1J1N2K3oOK5J2j3j6qk0m3
413D861n0l7k9l7m3l1pPll4o3p2o1l4kJ4Lj8k3nJk1n0m8k1JMJ0K1K7Pl1o6o7k7L0N2J5l8m9
408D086j8Jj8m6l5J3N3N2J9lKJ7Nl2n3l3RK5Jk7k3QL2K4lk9l3j9NK3J4k1n0l5OK3mk7j7%k5
$$ plain form
403 3867 3805 3750 3748 3778 3793 3783 3772 3763 3742 3711 3687 3667 3642 3629 3645 3670 3668 3645 3640 3656 3658 3641 3641 3668 3697 3716 3747 3797 3836 3847 3849 3859 3860 3851 3870 3941 4023 4056 4041
398 4041 4023 4041 4101 4175 4219 4205 4165 4162 4205 4236 4214 4175 4161 4156 4120 4058 3997 3938 3876 3836 3840 3855 3830 3767 3714 3693 3698 3734 3795 3838 3823 3775 3752 3759 3756 3739 3733 3730 3694
393 3694 3638 3628 3678 3719 3705 3676 3688 3741 3798 3837 3857 3866 3900 4002 4154 4277 4328 4354 4410 4475 4512 4543 4617 4705 4732 4684 4623 4591 4564 4519 4480 4470 4459 4412
389 4412 4341 4286 4246 4191 4120 4070 4057 4043 3987 3906 3856 3863 3900 3935 3971 4022 4075 4097 4069 4000 3916 3840 3781 3735 3703 3698 3733 3783 3797 3761 3722 3727 3755 3761 3756 3789 3866
385 3866 3937 3972 3990 4011 4025 4037 4084 4172 4244 4253 4221 4195 4186 4178 4173 4181 4183 4155 4117 4113 4146 4173 4160 4114 4065 4031 4019 4017 4002 3966 3931 3920 3924 3915 3896 3895 3920 3940 3932 3907 3884
380 3884 3859 3821 3779 3760 3775 3805 3816 3793 3743 3694 3660 3639 3620 3597 3579 3568 3559 3540 3509 3477 3466 3483 3507 3511 3493 3485 3511 3561 3605 3625 3625 3616 3615 3638 3685 3733 3758 3749
375 3749 3714 3672 3644 3645 3672 3708 3740 3763 3771 3763 3753 3752 3745 3716 3694 3729 3815 3881 3871 3824 3815 3874 3967 4039 4060 4033 3997 3996 4023 4027 3988 3948 3953 3994 4033 4074 4140 4217 4267
370 4267 4287 4306 4339 4368 4375 4363 4349 4357 4403 4465 4493 4473 4465 4515 4586 4628 4662 4743 4855 4926 4945 4968 5016 5048 5051 5078 5162 5260 5324 5367 5416 5459 5477 5487 5510 5543
$$ packed form
403C867o2n5kL0J5j0j1rk1l1k4k0k5j3J6K5kk3nJ6Kj7%K7K9J9L1N0L9J1KJ0JrJ9P1Q2L3j5
398D041j8J8O0P4M4j4m0lM3L1k2l9j4nl6o2o1n9o2m0MJ5k5o3n3k1NL6O1M3j5m8k3Plj7oll6
393C694n6j0N0M1j4k9J2N3N7L9K0RL4J02J52J23N1K6N6O5L7L1P4Q8K7m8o1l2k7m5l9j0j1m7
389D412p1n5m0n5p1n0j3j4n6q1n0PL7L5L6N1N3K2k8o9q4p6n9m6l2nL5N0J4l6l9NK8OnL3P7
385C866P1L5J8K1J4J2M7Q8P2Rl2k6rqnQKk8l8mL3K7j3m6m9l4j2kj5l6l5j1Mrj9jK5K0qk5k3
380C884k5l8m2j9J5L0J1k3n0m9l4k1j9k3j8j1rj9l1l2j1J7K4Mj8qK6N0M4K0%rjK3M7M8K5r
375C749l5m2k8JK7L6L2K3Qqj0jpk9k2L5Q6O6j0m7rN9R3P2K1k7l6jK7Ml9m0NM1L9M1O6P7N0
370D267K0J9L3K9Pj2j4QM6O2K8k0qN0P1M2L4Q1J12P1J9K3M8L2LK7Q4R8O4M3M9M3J8J0K3L3
$$ plain form
366 5543 5590 5669 5768 5841 5874 5906 5963 6013 6031 6049 6098 6145 6151 6137 6151 6189 6225 6262 6309 6335 6318 6301 6341 6413 6443 6426 6438 6514 6603 6658 6705 6793 6914 7018
362 7018 7075 7112 7181 7304 7452 7569 7632 7684 7781 7930 8083 8196 8265 8317 8383 8484 8602 8692 8736 8773 8837 8904 8920 8869 8787 8698 8606 8521 8457 8399 8314
358 8314 8211 8120 8040 7936 7805 7694 7631 7583 7508 7411 7325 7265 7233 7231 7247 7250 7215 7162 7127 7126 7153 7198 7252 7302 7333 7347 7359 7384 7438 7534 7656 7760 7807
354 7807 7803 7797 7829 7899 7966 7995 7989 7973 7959 7937 7906 7889 7901 7916 7900 7839 7742 7623 7511 7437 7385 7293 7138 6986 6905 6861 6765 6600 6440 6335 6256 6171 6096
350 6096 6033 5949 5824 5698 5611 5547 5476 5397 5325 5265 5225 5216 5220 5190 5128 5087 5087 5075 5015 4955 4945 4961 4956 4936 4922 4886 4800 4707 4668 4662 4623 4557 4523 4530 4524 4480 4432
345 4432 4401 4367 4331 4321 4327 4295 4214 4140 4106 4080 4030 3978 3952 3927 3874 3811 3764 3726 3680 3636 3611 3588 3548 3501 3474 3467 3461 3445 3418 3383 3358 3365 3394 3405 3384 3360 3348
341 3348 3315 3238 3160 3130 3142 3147 3120 3074 3023 2986 2994 3046 3087 3075 3039 3040 3072 3067 3002 2935 2924 2961 2993 2995 2978 2963 2959 2963 2963 2961 2963 2961 2942 2917 2920 2953 2965 2924 2872 2869 2893
336 2893 2886 2851 2847 2881 2883 2820 2751 2741 2772 2792 2790 2780 2759 2723 2698 2700 2696 2655 2606 2595 2615 2624 2618 2624 2641 2639 2616 2600 2590 2559 2512 2493 2511 2517 2484 2447 2447 2459 2431 2359 2285
$$ packed form
366E543M7P9R9P3L3L2N7N0J8J8M9M7Oj4J4L8L6L7M7K6j7j7M0P2L0j7J2P6Q9N5M7Q8J21J04
362G018N7L7O9J23J48J17O3N2R7J49J53J13O9N2O6J01J18R0M4L7O4O7J6n1q2q9r2q5o4n8q5
358H314j03r1q0j04j31j11o3m8p5r7q6o0l2kJ6Ll5n3l5jK7M5N4N0L1J4J2K5N4R6J22J04M7
354G807moL2P0O7K9oj6j4k2l1j7J2J5j6o1r7j19j12p4n2r2j55j52q1m4r6j65j60j05p9q5p5
350F096o3q4j25j26q7o4p1p9p2o0m0rMl0o2m1%j2o0o0j0J6nk0j4l6q6r3l9ol9o6l4Pom4m8
345D432l1l4l6j0Ol2q1p4l4k6n0n2k6k5n3o3m7l8m6m4k5k3m0m7k7poj6k7l5k5PK9J1k1k4j2
341C348l3p7p8l0J2Nk7m6n1l7QN2M1j2l6JL2no5o7j1L7L2Kj7j5mM%kKkj9k5LL3J2m1n2lK4
336B893pl5mL4Ko3o9j0L1K0kj0k1l6k5Kmm1m9j1K0RoOJ7kk3j6j0l1m7j9J8Ol3l7%J2k8p2p4
$$ plain form
331 2285 2243 2242 2280 2339 2381 2382 2364 2362 2366 2345 2304 2282 2291 2300 2287 2273 2268 2247 2195 2152 2169 2225 2249 2208 2151 2144 2188 2230 2221 2166 2103 2065 2055 2064 2079 2089 2087 2073 2058 2049 2034
326 2034 1999 1954 1930 1938 1954 1947 1923 1911 1921 1933 1934 1939 1957 1965 1935 1880 1846 1862 1897 1902 1859 1806 1792 1820 1844 1828 1791 1778 1796 1805 1772 1725 1711 1737 1774 1801 1817 1816 1785
321 1785 1739 1718 1734 1760 1765 1757 1750 1727 1671 1609 1585 1595 1599 1576 1548 1534 1522 1503 1501 1526 1552 1553 1549 1570 1605 1614 1594 1584 1605 1630 1626 1602 1582 1570 1552 1524 1500 1480 1456
316 1456 1428 1420 1443 1480 1498 1479 1438 1405 1395 1405 1419 1425 1421 1404 1380 1365 1376 1410 1440 1444 1427 1415 1421 1431 1424 1396 1361 1336 1322 1309 1298 1305 1341 1389 1420 1418 1383 1324 1254
311 1254 1204 1205 1247 1284 1289 1281 1292 1317 1332 1332 1333 1334 1316 1277 1243 1234 1244 1260 1277 1289 1292 1288 1281 1265 1234 1212 1227 1262 1259 1203 1157 1190 1283 1361 1375 1338 1282 1224 1180 1173 1208
306 1208 1266 1323 1369 1396 1391 1352 1293 1233 1188 1168 1175 1193 1201 1202 1211 1228 1239 1245 1264 1292 1299 1263 1203 1157 1147 1169 1213 1268 1324 1372 1398 1381 1315 1232 1181 1173 1173 1161 1154 1175
301 1175 1210 1227 1221 1201 1171 1134 1118 1137 1163 1160 1132 1115 1116 1114 1112 1138 1185 1214 1208 1201 1220 1244 1244 1226 1208 1192 1186 1219 1300 1383 1410 1375 1320 1283 1270 1274 1287 1292 1281 1269
297 1269 1268 1268 1247 1208 1172 1141 1105 1076 1079 1115 1148 1152 1132 1095 1048 1008 1001 1017 1014 981 961 990 1039 1047 1014 991 1002 1016 999 972 973 1010 1053 1073 1070 1054 1033 1015 1011 1021
$$ packed form
331B285m2jL8N9M2Jj8kMk1m1k2RRj3j4nk1n2m3J7N6K4m1n7pM4M2rn5o3l8j0RJ5J0kj4j5rj5
326B034l5m5k4QJ6pk4j2J0J2JNJ8Ql0n5l4J6L5Nm3n3j4K8K4j6l7j3J8Rl3m7j4K6L7K7J6jl1
321A785m6k1J6K6Nqpk3n6o2k4J0Mk3k8j4j2j9kK5K6JmK1L5Rk0j0K1K5mk4k0j2j8k8k4k0k4
316A456k8qK3L7J8j9m1l3j0J0J4Omj7k4j5J1L4L0Mj7j2OJ0pk8l5k5j4j3j1PL6M8L1kl5n9p0
311A254n0JM2L7NqJ1K5J5%JJj8l9l4rJ0J6J7J2Lmpj6l1k2J5L5ln6m6L3R3P8J4l7n6n8m4pL5
306A208N8N7M6K7nl9n9o0m5k0PJ8QJRJ7J1OJ9K8Pl6o0m6j0K2M4N5N6M8K6j7o6q3n1q%j2pK1
301A175L5J7ok0l0l7j6J9K6lk8j7JkkK6M7K9opJ9K4%j8j8j6oL3Q1Q3K7l5n5l7j3MJ3Nj1j2
297A269j%k1l9l6l1l6k9LL6L3Mk0l7m7m0pJ6ll3k0K9M9Ql3k3J1J4j7k7JL7M3K0lj6k1j8mJ0
$$ plain form
292 1021 1027 1012 991 987 996 987 947 909 913 958 1013 1054 1074 1064 1019 966 943 948 951 946 967 1015 1045 1026 990 984 1003 1006 990 992 1026 1050 1023 948 873 848 877 913 905 857 829
287 829 855 899 915 912 924 943 940 918 910 912 898 886 930 1025 1086 1064 1009 988 992 970 916 874 871 889 902 900 881 859 861 888 902 881 855 871 918 955 963 960 947 916
282 916 885 883 893 864 799 764 799 856 868 838 822 841 867 862 824 768 716 695 716 758 791 811 839 885 932 952 936 896 850 828 850 912 973 990 960 914
277 914 884 869 853 835 830 843 851 844 843 871 912 918 869 813 810 863 912 906 858 812 788 774 766 775 794 785 741 718 767 854 893 870 856 894 932 913 874 886 933 926 840
272 840 753 737 765 774 760 761 788 813 820 822 825 819 799 782 791 830 869 873 838 801 809 857 890 879 854 859 884 887 857 822 800 774 733 699 698 727 760 779 791 809 837
267 837 865 890 917 940 938 899 855 855 900 935 920 877 853 849 831 784 734 710 721 752 783 791 776 767 787 821 835 825 811 797 774 756 770 805 819 801 786 802
263 802 827 835 837 851 866 863 853 857 868 852 808 767 751 753 755 751 739 725 715 713 710 700 702 728 753 738 693 674 704 739 728 686 669 697 740 765 770 761 739 712 708 733
258 733 765 777 776 778 775 745 696 667 681 721 759 782 794 790 767 733 705 692 696 712 725 720 705 711 748 783 782 751 726 720 718 714 721 740 753 751 761 802 852 871 851 816
$$ packed form
292A021Oj5k1mRrm0l8MM5N5M1K0j0m5n3k3NLnK1M8L0j9l6oJ9Lj6KL4K4k7p5p5k5K9L6qm8k8
287H29K6M4J6lJ2J9lk2qKj4j2M4R5O1k2n5k1Mk2n4m2lJ8J3kj9k2KK7J4k1k6J6M7L7Qlj3l1
282I16l1kJ0k9o5l5L5N7J2l0j6J9K6nl8n6n2k1K1M2L3K0K8M6M7K0j6m0m6k2K2O2O1J7l0m6
277I14l0j5j6j8nJ3QpjK8M1Om9n6lN3M9om8m6k4j4qRJ9rm4k3M9Q7L9k3j4L8L8j9l9J2M7pq6
272H40q7j6K8Rj4JK7K5PKLok0j7RL9L9Ml5l7QM8L3j1k5NK5Ll0l5k2k6m1l4jK9L3J9J2J8K8
267H37K8K5K7K3kl9m4%M5L5j5m3k4mj8m7n0k4J1L1L1Qj5rK0L4J4j0j4j4k3j8J4L5J4j8j5J6
263H02K5QKJ4J5lj0MJ1j6m4m1j6KKmj2j4j0klj0KK6K5j5m5j9L0L5j1m2j7K8M3K5Nrk2k7mK5
258G33L2J2jKll0m9k9J4M0L8K3J2mk3l4k8j3MJ6J3nj5OL7L5jl1k5okmPJ9J3kJ0M1N0J9k0l5
$$ plain form
252 816 786 762 741 726 716 703 686 678 687 707 722 731 744 759 759 730 690 673 683 691 674 649 651 686 727 749 751 741 720 690 663 650 655 673 691 690 662 631 628 658
247 658 692 704 696 684 677 685 719 771 803 789 744 702 679 670 674 693 711 709 688 668 656 636 605 582 585 607 625 628 631 648 671 674 642 596 572 578 594 604 607 608 607 604 613
242 613 634 652 660 670 695 716 712 690 678 686 695 692 678 661 641 614 584 563 571 612 660 673 642 602 591 599 597 585 595 634 674 694 702 715 737 761 781 785 761 715
237 715 667 634 625 643 679 701 685 644 624 639 657 643 600 559 539 542 564 598 618 605 566 534 544 593 650 683 696 707 714 691 644 623 664 736 774 762 727
233 727 688 646 626 660 724 751 719 679 672 672 643 607 604 621 622 606 604 626 644 640 616 585 561 565 597 630 636 625 616 609 602 616 661 704 716 728 781 837 820 726 644
228 644 637 669 675 653 632 615 579 536 520 531 535 511 481 479 513 565 611 642 665 677 666 630 586 551 524 504 507 541 576 574 539 512 510 513 509 513 528 529 508 496 507
223 507 520 514 515 543 578 589 586 592 590 563 538 555 595 597 547 505 517 571 628 676 707 710 686 666 662 657 638 630 660 706 723 702 676 663 653 633 607 582 558 546
218 546 559 586 602 595 582 574 562 542 535 565 617 647 637 605 583 579 588 604 619 618 600 582 576 568 542 512 510 543 582 595 577 544 518 521 558 606 628 614 591 584 588
$$ packed form
252H16l0k4k1j5j0j3j7qRK0J5RJ3J5%k9m0j7J0Qj7k5KL5M1K2Kj0k1l0k7j3NJ8J8jk8l1lL0
247F58L4J2qj2pQL4N2L2j4m5m2k3rMJ9J8kk1k0j2k0l1k3LK2J8LLJ7K3Ll2m6k4OJ6J0LJjlR
242F13K1J8QJ0K5K1mk2j2QRlj4j7k0k7l0k1QM1M8J3l1m0j1Qkj2J0L9M0K0QJ3K2K4K0Mk4m6
237G15m8l3rJ8L6K2j6m1k0J5J8j4m3m1k0LK2L4K0j3l9l2J0M9N7L3J3J1Pk3m7k1M1P2L8j2l5
233G27l9m2k0L4O4K7l2m0p%k9l6lJ7Jj6kK2J8mk4l1k4ML2L3Oj1rppJ4M5M3J2J2N3N6j7r4q2
228F44pL2Ok2k1j7l6m3j6J1Mk4l0kL4N2M6L1K3J2j1l6m4l5k7k0LL4L5kl5k7kLmMJ5Jk1j2J1
223E07J3oJK8L5J1lOkk7k5J7M0Kn0m2J2N4N7M8L1Lk4k0mnj9qL0M6J7k1k6j3j0k0k6k5k4j2
218E46J3K7J6pj3qj2k0pL0N2L0j0l2k2mRJ6J5jj8j8oqk6l0kL3L9J3j8l3k6LL7M8K2j4k3pM
$$ plain form
213 588 584 579 592 622 654 674 684 676 644 604 586 604 636 653 637 600 561 544 556 583 594 575 533 491 471 485 523 558 562 540 523 534 567 596 605 597 587 584 576
208 576 550 520 523 568 604 583 527 502 533 573 578 561 549 540 528 538 584 633 636 603 583 595 607 596 578 571 568 562 567 589 609 607 591 579 576 583 610 653 680 665 624
203 624 593 586 585 582 581 576 552 515 491 488 492 491 497 515 523 502 470 459 467 463 439 422 439 482 521 534 527 523 538 574 618 643 631 586 536 517 539 578 605 614 612 603 592 586
198 586 589 589 573 555 557 576 579 562 560 595 640 657 649 646 655 659 657 661 658 627 582 558 567 578 573 564 561 551 531 530 562 597 601 578 556 542 535 554 609 672 695 665 616 581 564
192 564 550 529 501 480 484 511 530 521 506 518 555 587 595 582 547 488 432 421 464 525 570 594 597 572 524 482 463 448 428 419 440 473 491 496 505 518 522 520 526 540
187 540 552 560 571 584 588 575 543 496 455 449 491 552 591 595 576 551 534 545 588 636 647 612 559 518 496 490 496 506 512 512 506 493 472 452 441 436 431 434 453 468 450
182 450 410 387 401 432 469 518 568 576 528 473 467 498 510 487 470 491 532 564 582 589 574 533 498 503 538 562 559 549 546 533 501 468 464 478 475 444 421 440 490
178 490 522 500 439 393 399 446 486 492 483 484 487 468 428 409 437 492 535 547 538 526 519 519 517 511 518 549 577 559 501 460 467 484 470 453 477 516 504 442 406 430 463
$$ packed form
213E88mnJ3L0L2K0J0ql2m0j8J8L2J7j6l7l9j7J2K7J1j9m2m2k0J4L8L5Mk2j7J1L3K9Rqj0lq
208E76k6l0LM5L6k1n6k5L1M0Nj7j2rj2J0M6M9Ll3k0J2J2j1j8ploNK2K0kj6j2lPK7M3K7j5m1
203F24l1pjljnk4l7k4lMjOJ8Qk1l2j1Qmk4j7J7M3L9J3pmJ5L6M4K5j2m5n0j9K2L9K7Rkrj1o
198E86L%j6j8KJ9Lj7kL5M5J7qlRMkMll1m5k4RJ1nrlj0k0jL2L5Mk3k2j4pJ9N5O3K3l0m9l5j7
192E64j4k1k8k1MK7J9rj5J2L7L2Qj3l5n9n6j1M3O1M5K4Lk5m8m2j9j5k0rK1L3J8NRJ3MkOJ4
187E40J2QJ1J3Mj3l2m7m1oM2O1L9Mj9k5j7J1M3M8J1l5n3m1k2oOJ0O%oj3k1k0j1nnLJ9J5j8
182D50m0k3J4L1L7M9N0Qm8n5oL1J2k3j7K1M1L2J8Pj5m1l5NL5K4lj0lj3l2l3mJ4ll1k3J9N0
178D90L2k2o1m6OM7M0OrJLj9m0j9K8N5M3J2rj2p%koPL1K8j8n8m1PJ7j4j7K4L9j2o2l6K4L3
$$ plain form
173 463 458 449 481 523 507 440 405 438 485 484 454 459 506 530 483 408 390 450 527 552 532 512 509 495 460 430 425 432 435 448 487 537 572 574 539 476 416 397 423 445
168 445 425 389 392 441 493 513 507 495 484 479 484 495 500 497 491 487 491 506 522 510 464 418 416 451 473 458 428 409 393 368 342 330 334 349 378 414 445 466 486 505 506
163 506 482 458 455 468 478 479 471 455 432 414 406 394 379 376 392 408 414 433 482 533 542 518 505 519 523 491 445 424 435 449 448 427 398 378 381 404 426 429 419 415 424 430
157 430 407 349 286 258 283 335 377 390 380 363 354 371 413 454 467 465 482 523 544 515 461 430 429 427 400 365 351 364 384 392 387 383 394 411 407 375 340 336 368 410
153 410 441 461 481 497 502 495 480 456 420 382 359 363 392 432 467 484 478 460 440 418 397 384 385 393 393 379 367 382 432 493 527 510 456 410 409 453 502 516 488
148 488 441 410 414 443 476 489 484 476 475 474 465 455 454 459 454 430 402 396 426 481 528 541 522 504 511 529 526 496 471 466 458 424 383 378 415 450 444 411 396 414 434 432 422 435
142 435 470 497 500 489 473 437 379 334 332 360 374 366 362 377 389 391 408 453 499 513 503 494 486 474 477 511 543 530 483 456 472 498 504 494 482 465 433 401 392 413
$$ packed form
173D63nrL2M2j6o7l5L3M7jl0NM7K4m7p5j8O0P7K5k0k0lj4l5l0nPLJ3L9N0L5Kl5o3o0j9K6K2
168D45k0l6LM9N2K0oj2j1nNJ1NlomMJ5J6j2m6m6kL5K2j5l0j9j6k5k6j2MJ5K9L6L1K1K0J9J
163E06k4k4lJ3J0Jqj6k3j8qj2j5lJ6J6OJ9M9N1Rk4j3J4Ml2m6k1J1J4jk1k9k0LK3K2Lj0mRO
157D30k3n8o3k8K5N2M2J3j0j7rJ7M2M1J3kJ7M1K1k9n4l1jkk7l5j4J3K0QnmJ1J7ml2l5mL2M2
153D10L1K0K0J6Npj5k4l6l8k3MK9M0L5J7oj8k0k2k1j3JQ%j4j2J5N0O1L4j7n4m6jM4M9J4k8
148D88m7l1MK9L3J3nqjjrj0jNnk4k8oL0N5M7J3j9j8PJ8ll0k5nql4m1nL7L5ol3j5J8K0kj0J3
142D35L5K7Lj1j6l6n8m5kK8J4qmJ5J2KJ7M5M6J4j0rqj2LL4L2j3m7k7J6K6Oj0j2j7l2l2rK1
$$ [...]
-1605B95
##END=	
##END=	
