##TITLE=	PRh8JVeeSXmovZWLXqd81g.22.ser
TM-VI-108solid Ca+pmb-pyrraz. batch 2 hmbc

##JCAMP-DX=	6.0	$$ MestReNova 14.3.0-30573
##DATA TYPE=	LINK
##BLOCK_ID=	1
##BLOCKS=	2    
##ORIGIN=	Mestrelab Research S.L.
##OWNER=	hrzepa
##$MNOVA/LINK_BLOCK_TYPE=	ITEM	$$ NMR Spectrum
##$MNOVA/ITEM/POLYGON=	(XY..XY)
5321,5835
8722,5835
8722,8208
5321,8208
5321,5835
##$MNOVA/ITEM/Z=	0
##$MNOVA/ITEM/ANGLE=	0
##TITLE=	PRh8JVeeSXmovZWLXqd81g.22.ser
##JCAMP-DX=	6.0	$$ MestReNova 14.3.0-30573
##BLOCK_ID=	2
##DATA TYPE=	MNOVA NMR VIEW DATA
##DATA CLASS=	MNOVA VIEW DATA
##$MNOVA/2D/THRESHOLD=	5.1636791229248046875
##$MNOVA/ITEM/ZOOM/X=	-0.47893103590269503478,	14.508270000071124883
##$MNOVA/ITEM/ZOOM/Y=	-9.5608721214139968936,	250.07129999451962021
##END=	
##TITLE=	PRh8JVeeSXmovZWLXqd81g.22.ser
##JCAMP-DX=	6.0	$$ MestReNova 14.3.0-30573
##BLOCK_ID=	3
##DATA TYPE=	nD NMR SPECTRUM
##DATA CLASS=	NTUPLES
##NUMDIM=	2
##ORIGIN=	Bruker BioSpin GmbH
##OWNER=	nmr
##.OBSERVE FREQUENCY=	400.20280139999999847
##.OBSERVE NUCLEUS=	^1H
##.SOLVENT NAME=	Acetone
##.PULSE SEQUENCE=	hmbcgplpndqf
##LONGDATE=	2021/10/21 01:48:39.000
##.ACQUISITIONMODE=	SIMULTANEOUS (DQD)
##$ORIGINAL FORMAT=	Bruker XWIN-NMR
##$MNOVA/SCALES_VERSION=	9
##$PARAMETER FILE=	(acqu2s, ASCII, /private/var/folders/f6/rjf_tdyn2v98c5c0wvkgn4s80000gn/T/PRh8JVeeSXmovZWLXqd81g/22/acqu2s, 0)
$$ ##TITLE= Parameter file, TOPSPIN		Version 3.2
$$ ##JCAMPDX= 5.0
$$ ##DATATYPE= Parameter Values
$$ ##NPOINTS= 129	$$ modification sequence number
$$ ##ORIGIN= Bruker BioSpin GmbH
$$ ##OWNER= nmr
$$ $$ 2021-10-21 02:08:16.400 +0100  nmr@CZC2439F63
$$ $$ /opt/topspin/data/agmb/nmr/Oct20-2021/22/acqu2s
$$ $$ process /opt/topspin3.2/prog/mod/go
$$ ##$ACQT0= 0
$$ ##$BF1= 100.63037
$$ ##$FnMODE= 1
$$ ##$NUC1= <13C>
$$ ##$NusJSP= 0
$$ ##$NusT2= 1
$$ ##$NusTD= 128
$$ ##$O1= 12075.7644147886
$$ ##$SFO1= 100.642445764415
$$ ##$SW= 260.109045168497
$$ ##$SW_h= 26178.0104712042
$$ ##$TD= 128
$$ ##END=
$$ 
##$PARAMETER FILE=	(acqus, ASCII, /private/var/folders/f6/rjf_tdyn2v98c5c0wvkgn4s80000gn/T/PRh8JVeeSXmovZWLXqd81g/22/acqus, 0)
$$ ##TITLE= Parameter file, TOPSPIN		Version 3.2
$$ ##JCAMPDX= 5.0
$$ ##DATATYPE= Parameter Values
$$ ##NPOINTS= 12	$$ modification sequence number
$$ ##ORIGIN= Bruker BioSpin GmbH
$$ ##OWNER= nmr
$$ $$ 2021-10-21 02:08:19.716 +0100  nmr@CZC2439F63
$$ $$ /opt/topspin/data/agmb/nmr/Oct20-2021/22/acqus
$$ $$ process /opt/topspin3.2/prog/mod/shimcntl
$$ ##$ACQT0= 1000000
$$ ##$AMP= (0..31)
$$ 100 100 100 100 100 100 100 100 100 100 100 100 100 100 100 100 100 100
$$ 100 100 100 100 100 100 100 100 100 100 100 100 100 100
$$ ##$AMPCOIL= (0..19)
$$ 0 0 0 0 0 0 0 0 0 0 0 0 0 0 0 0 0 0 0 0
$$ ##$ANAVPT= -1
$$ ##$AQSEQ= 0
$$ ##$AQ_mod= 3
$$ ##$AUNM= <au_zg>
$$ ##$AUTOPOS= <2 >
$$ ##$BF1= 400.2
$$ ##$BF2= 100.63037
$$ ##$BF3= 400.2
$$ ##$BF4= 400.2
$$ ##$BF5= 400.2
$$ ##$BF6= 400.2
$$ ##$BF7= 400.2
$$ ##$BF8= 400.2
$$ ##$BYTORDA= 0
$$ ##$CAGPARS= (0..11)
$$ 0 0 0 0 0 0 0 0 0 0 0 0
$$ ##$CFDGTYP= 0
$$ ##$CFRGTYP= 9
$$ [...]
$$ 0 0 0 0
$$ ##$ShimPowMaxUC= (0..63)
$$ 130000 130000 130000 130000 130000 130000 130000 130000 130000 130000 130000
$$ 130000 130000 130000 130000 130000 130000 130000 130000 130000 0 0 0 0
$$ 0 0 0 0 0 0 0 0 0 0 0 0 0 0 0 0 0 0 0 0 0 0 0 0 0 0 0 0 0 0 0 0 0 0 0 0
$$ 0 0 0 0
$$ ##$ShimPowMaxUG= (0..63)
$$ 524287 524287 524287 524287 524287 524287 524287 524287 524287 524287 524287
$$ 524287 524287 524287 524287 524287 524287 524287 524287 524287 0 0 0 0
$$ 0 0 0 0 0 0 0 0 0 0 0 0 0 0 0 0 0 0 0 0 0 0 0 0 0 0 0 0 0 0 0 0 0 0 0 0
$$ 0 0 0 0
$$ ##$ShimPowRcbType= 3
$$ ##$ShimPowRes= (0..63)
$$ 1e-20 1e-20 1e-20 1e-20 1e-20 1e-20 1e-20 1e-20 1e-20 1e-20 1e-20 1e-20
$$ 1e-20 1e-20 1e-20 1e-20 1e-20 1e-20 1e-20 1e-20 0 0 0 0 0 0 0 0 0 0 0 0
$$ 0 0 0 0 0 0 0 0 0 0 0 0 0 0 0 0 0 0 0 0 0 0 0 0 0 0 0 0 0 0 0 0
$$ ##$ShimPowRng0= (0..63)
$$ 1 1 1 1 1 1 1 1 1 1 1 1 1 1 1 1 1 1 1 1 0 0 0 0 0 0 0 0 0 0 0 0 0 0 0 0
$$ 0 0 0 0 0 0 0 0 0 0 0 0 0 0 0 0 0 0 0 0 0 0 0 0 0 0 0 0
$$ ##$ShimPowRng1= (0..63)
$$ 1 1 1 1 1 1 1 1 1 1 1 1 1 1 1 1 1 1 1 1 0 0 0 0 0 0 0 0 0 0 0 0 0 0 0 0
$$ 0 0 0 0 0 0 0 0 0 0 0 0 0 0 0 0 0 0 0 0 0 0 0 0 0 0 0 0
$$ ##$ShimPowRng2= (0..63)
$$ 1 1 1 1 1 1 1 1 1 1 1 1 1 1 1 1 1 1 1 1 0 0 0 0 0 0 0 0 0 0 0 0 0 0 0 0
$$ 0 0 0 0 0 0 0 0 0 0 0 0 0 0 0 0 0 0 0 0 0 0 0 0 0 0 0 0
$$ ##$ShimPowRng3= (0..63)
$$ 1 1 1 1 1 1 1 1 1 1 1 1 1 1 1 1 1 1 1 1 0 0 0 0 0 0 0 0 0 0 0 0 0 0 0 0
$$ 0 0 0 0 0 0 0 0 0 0 0 0 0 0 0 0 0 0 0 0 0 0 0 0 0 0 0 0
$$ ##$ShimSysFunc= (0..63)
$$ 1 2 3 4 5 7 9 11 15 16 8 10 12 14 6 17 13 18 19 20 0 0 0 0 0 0 0 0 0 0
$$ 0 0 0 0 0 0 0 0 0 0 0 0 0 0 0 0 0 0 0 0 0 0 0 0 0 0 0 0 0 0 0 0 0 0
$$ ##$ShimSysMatrix= 0
$$ ##$ShimSysType= 1
$$ ##$TFXNUM= 0
$$ ##$TRIPLO2= 0
$$ ##$VTU= 2
$$ ##$VTUETH= <149.236.99.20>
$$ ##$VTUTY= <no>
$$ ##$WBREFAM= (0..15)
$$ 135.5 97.7 100 100 100 100 100 100 100 100 100 100 100 100 100 100
$$ ##$WBREFLM= (0..15)
$$ 0 0 0 0 0 0 0 0 0 0 0 0 0 0 0 0
$$ ##$WBREFPH= (0..15)
$$ 72.26 -67.22 0 0 0 0 0 0 0 0 0 0 0 0 0 0
$$ ##$WBSGU= (0..15)
$$ 0 0 0 0 0 0 0 0 0 0 0 0 0 0 0 0
$$ ##$XFAC= 2
$$ ##END=
$$ 
##$DECIM=	3328
##$DSPFVS=	20
##.ACQUISITIONSCHEME=	NOT PHASESENSITIVE
##NTUPLES=	nD NMR SPECTRUM
##VAR_NAME=	FREQUENCY1,	FREQUENCY2,	SPECTRUM
##SYMBOL=	F1,	F2,	Y
##.NUCLEUS=	13C,	1H
##.OBSERVE FREQUENCY=	100.64244576441500101,	400.20280139999999847
##VAR_TYPE=	INDEPENDENT,	INDEPENDENT,	DEPENDENT
##VAR_FORM=	AFFN,	AFFN,	ASDF
##VAR_DIM=	512,	512,	262144
##UNITS=	HZ,	HZ,	ARBITRARY UNITS
##FIRST=	25164.767445380970457,	5806.2096540000038658,	0.249483451247215271
##LAST=	-962.11409912165936476,	-191.66820056731904742,	0.25439524650573730469
##MIN=	-962.11409912165936476,	-191.66820056731904742,	0.0012742886319756507874
##MAX=	25164.767445380970457,	5806.2096540000038658,	45.267421722412109375
##FACTOR=	1,	1,	0.0032726946750487886061
##PAGE=	F1=25164.8
##FIRST=	25164.767445380970457,	5806.2096540000038658,	0.249483451247215271
##DATA TABLE=	(F2++(Y..Y)), PROFILE
$$ [...]
##PAGE=	F1=8905.77
##FIRST=	25164.767445380970457,	5806.2096540000038658,	0.095761157572269439697
##DATA TABLE=	(F2++(Y..Y)), PROFILE
$$ plain form
4386 30 92 77 188 79 55 84 81 67 54 76 189 200 109 58 79 118 58 76 121 105 54 104 199 284 136 129 88 152 47 124 160 121 39 105
3987 105 72 145 82 109 119 139 242 163 172 73 89 71 111 109 273 103 224 284 93 354 217 166 203 83 166 227 93 142 148 92 135 72
3611 72 181 120 74 6 104 103 119 27 16 144 176 74 131 64 103 60 65 138 15 152 108 68 212 166 142 242 139 161 137 66 98 63
3236 63 115 144 54 16 136 210 235 120 13 162 207 49 71 129 141 86 15 118 98 84 33 180 145 88 115 124 147 59 98 78 99 233
2860 233 231 112 41 66 176 52 156 140 163 112 195 275 80 105 28 152 148 153 211 59 109 14 90 204 220 23 139 173 214 100 194
2496 194 139 39 116 99 229 332 185 206 142 5 39 70 201 202 278 177 99 233 107 150 172 56 76 205 176 32 112 155 116
2156 116 181 84 28 197 260 88 149 174 202 91 203 256 243 161 164 74 132 273 231 304 201 97 143 165 258 136 132 102 109 118 115 13 175
1768 175 152 120 123 237 348 68 227 85 82 208 96 44 187 77 45 309 195 253 104 59 124 208 186 140 85 147 151 104 145 99
$$ packed form
4386C0O2j5J11j09k4K9lj4j3K2J13J1r1n1K1L9o0J8M5j6n1N0R5Q5j48pm1O4j05P7L6l9q2O6
3987A05l3P3o3K7J0K0J03p9Rr9J6j8M0kJ64j70J21O0j91K61j37n1L7j20Q3O1j34M9On6M3o3
3611G2J09o1m6o8R8jJ6r2j1J28L2j02N7o7L9m3NP3j23J37m4m0J44m6k4J00j03K2k4p1L2l5
3236F3N2K9r0l8J20P4K5j15j07J49M5j58K2N8J2n5p1J03k0j4n1J47l5n7K7RK3q8L9k0K1J34
2860B33kj19p1K5J10j24J04j6K3n1Q3Q0j95K5p7J24mNN8j52N0r5P6J14J6j97J16L4M1j14R4
2496A94n5j00P7j7J30J03j47K1o4j37L4L1J31JP6j01p8J34j26M3K2j16K0J29k9j44Q0M3l9
2156A16O5r7n6J69O3j72O1K5K8j11J12N3j3q2Lr0N8J41m2P3j03j04M6K2R3j22ml0PRlj02J62
1768A75k3l2LJ14J11k80J59j42lJ26j12n2J43j10l2K64j14N8j49m5O5Q4k2m6n5O2Mm7M1m6
$$ plain form
1416 99 335 253 80 57 79 98 45 185 96 50 145 218 246 203 361 311 160 11 66 173 273 95 108 23 84 61 212 239 191 210
1064 210 120 253 261 165 210 192 18 91 211 120 134 87 229 82 48 72 131 164 34 39 202 55 211 175 58 4 132 131 136 365 301
700 301 201 217 180 250 137 168 142 35 108 104 18 228 360 258 199 116 157 124 111 120 21 173 181 225 185 130 73 47 31 179 117 319
325 319 219 94 75 172 99 133 129 150 241 262 131 50 72 131 173 211 212 156 119 170 231 143 207 218 138 88 147 233 211 180 193 108 223 209
-74 209 103 55 105 212 211 120 102 43 52 37
$$ packed form
1416I9K36q2j73k3K2J9n3J40q9m6R5P3K8m3J58n0j51j49N5J07J00j78J3q5O1k3J51K7m8J9
1064B10r0J33Qr6M5j8j74P3J20r1J4m7J42j47l4K4N9L3j30NJ63j47J56l6j17n4J28jNK29o4
700C01j00J6l7P0j13L1k6j07P3mq6K10J32j02n9q3M1l3j3Rr9J52QM4m0n5n7k6j6J48o2K02
325C19j00j25j9R7p3L4mK1R1K1j31q1K2N9M2L8Jn6l7N1O1q8O4J1q0n0N9Q6k2l1J3q5J15j4
-74B09j06m8N0J07jr1j8n9Rj5
-192C7
##PAGE=	F1=8803.51
##FIRST=	25164.767445380970457,	5806.2096540000038658,	0.29608935117721557617
##DATA TABLE=	(F2++(Y..Y)), PROFILE
$$ plain form
5806 177 196 52 116 152 273 151 80 262 282 39 86 190 197 20 203 245 201 143 57 104 238 178 162 249 173 107 105 48 189 324
5454 324 52 220 137 146 82 210 264 225 91 194 179 201 205 211 151 61 102 132 204 237 94 62 89 66 176 267 238 149 64 72 70 282 383
5067 383 163 100 239 116 177 80 284 163 66 130 122 107 119 50 74 126 273 204 28 140 84 209 155 257 201 120 170 95 81 321
4715 321 400 132 51 174 162 58 268 97 190 177 110 9 156 187 168 46 137 109 125 78 164 41 208 164 44 102 52 62 53 60
4362 60 177 80 33 58 70 90 60 74 171 156 116 104 100 111 51 112 142 138 38 97 187 228 111 140 74 152 54 114 157 116 50 94 116 82 11
3952 11 177 131 126 213 139 114 78 110 65 87 144 269 71 182 275 151 359 185 202 231 125 199 270 113 156 180 78 123 49 218
3600 218 175 29 11 145 99 87 40 44 166 96 32 144 78 134 32 145 152 70 208 177 118 251 203 168 253 156 231 147 76 94 84 142
3224 142 140 51 55 150 153 180 121 40 149 231 57 69 78 122 109 23 91 86 115 15 177 177 118 119 104 141 48 129 62 84 200 199 170 97 40 185
$$ packed form
5806A77J9j44O4L6J21j22p1J82K0k43M7J04Pj77J83M2m4n8q6M7J34o0j6Q7p6o6kn7J41J35
5454C24k72J68q3Ro4J28N4l9j34J03j5K2MOo0r0M1L0P2L3j43l2K7k3J10R1k9q9q5QkK12J01
5067C83k20o3J39j23O1r7K04j21r7O4qj5J2o9K4N2J47o9j76J12n6J25n4J02n6q1N0p5j4K40
4715C21P9k68q1J23j2j04K10j71R3j3o7j01J47L1j9j22R1k8J6m7Q6j23J67m4j20N8n0J0rP
4362F0J17r7m7K5J2K0l0J4R7j5m0j2mJ1o0O1L0mj00N9R0M1j17K9o6P8r8O0M3m1o6M4K2l4p1
3952A1J66m6nQ7p4k5l6L2m5K2N7J25j98J11R3j24K08j74J7K9j06P4P1j57M3K4j02M5p4J69
3600B18m3j46j8J34m6j2m7MJ22p0o4J12o6N6j02J13Pq2J38l1n9J33m8l5Q5r7P5q4p1J8j0N8
3224A42kq9MR5LK7n9q1J09Q2j74J2RM4j3q6O8nK9j00J62%n9Jj5L7r3Q1o7K2J16jk9p3n7J45
$$ plain form
2801 185 92 130 122 136 57 131 221 135 77 40 185 163 144 190 33 165 13 159 170 174 3 105 201 206 81 181 99 76 68 133 234 262
2426 262 177 172 115 8 92 55 266 228 277 236 133 212 84 148 188 53 52 242 182 65 180 157 117 188 103 80 255 255 109 121 162
2062 162 223 120 235 244 232 158 144 142 182 284 185 223 155 90 81 219 253 142 153 78 153 94 105 52 152 206 143 103 203 348 51 232
1686 232 69 100 205 85 65 162 13 52 389 231 185 163 98 106 216 184 130 105 106 121 111 131 92 325 236 81 30 73 97 57 220
1322 220 150 35 210 281 247 207 372 322 199 16 56 209 290 67 111 80 114 62 192 260 201 190 109 258 274 135 176 202 83
982 83 108 205 100 119 121 223 117 94 63 86 201 80 33 210 65 200 217 83 50 148 172 113 328 326 207 233 180 227 142 159 160 29
606 29 97 94 68 230 360 276 176 117 161 154 111 91 25 159 188 151 143 156 61 37 79 182 141 313 211 79 77 190 105 148 171 182 215
219 215 233 87 80 65 81 197 226 219 174 89 167 228 156 207 183 119 43 127 241 181 206 239 170 221 216 81 69 69 151 187 140 105 20 61 44
$$ packed form
2801A85r3L8qJ4p9P4R0q6n8l7J45k2j9M6j57J32j52J46J1Mj71J02R6Nj25J00q2k3qO5J01K8
2426B62q5nn7j07Q4l7K11l8M9m1j03P9j28O4M0j35jJ90o0j17J15k3m0P1q5k3J75%j46J2M1
2062A62O1j03J15Rj2p4j4kM0J02r9L8o8o5rJ38L4j11J1p5P5n9J1n3J00N4o3m0J00J45k97J81
1686B32j63L1J05j20k0R7j49L9L37j58m6k2o5QJ10l2n4k5JJ5j0K0l9K33q9j55n1M3K4m0J63
1322B20p0j15J75P1l4m0J65n0j23j83M0J53Q1k23M4l1L4n2J30O8n9j1q1J49J6j39M1K6j19
982H3K5R7j05J9KJ02j06k3l1K3J15j21m7J77j45J35J7j34l3R8K4n9K15kj19K6n3M7q5J7Jj31
606B9O8lk6J62J30q4j00n9M4pm3k0o6J34K9l7qJ3r5k4M2J03m1J72j02j32kJ13q5M3K3J1L3
219B15J8j46pj5J6J16K9pm5q5P8O1p2N1k4o4p6Q4J14o0K5L3o9N1nj35j2%Q2L6m7l5q5M1j7
-192D4
##PAGE=	F1=8701.25
##FIRST=	25164.767445380970457,	5806.2096540000038658,	0.35936456918716430664
##DATA TABLE=	(F2++(Y..Y)), PROFILE
$$ plain form
5806 169 210 78 105 107 256 200 53 312 318 69 44 187 175 27 205 232 166 93 26 121 251 220 134 274 168 49 83 65 170
5466 170 301 44 199 140 99 78 167 198 195 60 201 180 180 153 129 127 31 131 164 194 198 36 120 25 28 189 269 210 130 92 44 71 274
5078 274 336 86 83 239 135 140 142 262 211 95 144 85 69 115 50 44 86 256 180 32 157 68 209 169 247 165 104 142 96 113 311 357
4703 357 143 63 201 175 87 241 142 213 138 108 27 150 161 133 54 88 151 195 98 170 27 184 149 47 87 81 101 74 79 169 98 50
4327 50 37 57 122 98 91 147 100 125 152 161 148 111 143 167 192 15 100 165 166 122 144 90 162 65 91 148 124 80 95 146 52 42 227 151 104 185
3905 185 117 84 142 129 62 72 151 245 60 136 264 204 346 164 221 244 147 223 293 111 169 198 79 122 40 233 235 54 24 191 150
3541 150 37 84 106 178 33 80 151 78 156 38 188 194 132 234 213 139 258 221 182 248 186 297 182 125 89 89 152 141 84 88 151 94
3165 94 123 113 75 126 235 44 75 43 145 128 19 61 72 141 49 161 209 143 119 86 108 30 142 35 76 164 161 218 161 21 201
$$ packed form
5806A69M1j32K7KJ49n6j47K59Ok49k5J43j2j48J78K7o6p3o7R5J30l1q6J40j06j19L4j8J05
5466A70J31k57J55n9m1k1Q9L1lj35J41k1%k7k4kr6J00L3L0Mj62Q4r5LJ61Q0n9q0l8m8K7K03
5078B74O2k50lJ56j04NKJ20n1j16M9n9j6M6o5oM2J70p6j48J25q9J41m0P8q2o1L8m6J7J98M6
4703C57k14q0J38k6q8J54r9P1p5l0q1J23J1k8p9L4O3M4r7P2j43J57l5j02M0oK0k7NR0p1m8
4327E0j3K0O5k4pN6m7K5K7Rj3l7L2K4K5j77Q5O5Jm4K2n4P2r7K6N7k4m4J5N1r4j0J85p6m7Q1
3905A85o8l3N8j3o7J0P9R4j85P6J28o0J42j82N7K3r7P6P0j82N8K9j19M3q2J93Kj81l0J67m1
3541A50j13M7K2P2j45M7P1p3P8j18J50Oo2J02k1p4J19l7l9O6o2J11j15n7l6%O3j1n7MO3n7
3165I4K9j0l8N1J09j91L1l2J02j7j09M2J1O9r2J12M8o6k4l3K2p8J12j07M1Q8lN7n7j40J80
$$ plain form
2801 201 147 121 96 98 31 103 146 181 99 55 203 186 112 165 71 219 38 212 129 130 21 91 210 170 71 157 74 131 70 176 234 185
2426 185 152 134 77 19 150 101 295 232 274 294 168 178 62 120 172 50 24 265 168 101 248 183 123 189 104 120 281 228 120 107
2074 107 144 236 137 276 243 225 152 124 199 209 265 124 130 112 115 37 259 213 123 177 31 168 64 95 106 125 244 158 82 162 330 59
1698 59 222 42 92 201 78 83 127 48 56 437 242 133 193 100 94 205 164 98 145 63 103 115 121 74 308 237 92 13 56 102 61 237
1322 237 187 58 255 308 245 211 353 318 219 21 51 218 279 37 107 129 139 108 159 246 186 158 88 248 270 105 166 205 152 155 182
959 182 94 107 152 200 150 136 88 47 237 123 18 202 82 185 248 113 103 141 221 111 261 318 192 242 173 206 143 146 179 27
606 27 64 87 138 216 323 259 136 133 152 152 98 87 49 138 175 107 104 165 30 25 117 156 168 284 200 66 91 203 102 147 188 207 180 203
207 203 51 107 62 83 202 240 221 184 54 168 220 169 198 137 88 47 107 236 141 215 271 205 204 216 62 97 43 84 169 157 104 49 96
$$ packed form
2801B01n4k6k5Ko7P2M3L5q2m4J48j7p4N3r4J48j81J74q3Jj09P0J19m0r9Q6q3N7o1J06N8m9
2426A85l3j8n7n8J31m9J94o3M2K0j26J0j16N8N2j22k6K41r7o7J47o5o0O6q5J6J61n3j08j3
2074A07L7R2r9J39l3j8p3k8P5J0N6j41Oj8Lp8K22m6r0N4j46J37j04L1J1J9J19q6p6Q0J68k71
1698E9J63j80N0J09j23NM4p9QL81j95j09O0r3oJ11m1o6M7q2M0J2Om7K34p1j45p9M3M6m1J76
1322B37n0j29J97N3o3l4J42l5r9j98L0J67O1k42P0K2J0l1N1Q7o0k8p0J60K2j65O1L9n3LK7
959A82q8J3M5M8n0j4m8m1J90j14j05J84j20J03O3j35j0L8Q0j10J50N7j26N0o9L3o3LL3j52
606B7L7K3N1P8J07o4j23lJ9%n4j1l8Q9L7o8lO1j35nR2L9J2J16q4j34K5J12j01M5M1J9k7K3
207B03j52N6m5K1J19L8j9l7j30J14N2n1K9o1m9m1O0J29r5P4N6o6jJ2j54L5n4M1Q5j2n3n5M7
$$ plain form
-180 96 56
$$ packed form
-180I6m0
-192E6
##PAGE=	F1=8599
##FIRST=	25164.767445380970457,	5806.2096540000038658,	0.31501230597496032715
##DATA TABLE=	(F2++(Y..Y)), PROFILE
$$ plain form
5806 138 206 100 104 78 237 244 30 349 332 114 18 162 125 28 188 216 116 69 28 129 248 238 97 283 158 13 85 72 146
5466 146 252 44 192 184 51 77 111 138 161 11 185 174 150 93 103 135 74 178 176 170 147 29 182 44 31 193 244 185 119 110 49
5102 49 82 238 271 21 56 221 180 90 202 232 256 134 145 49 61 86 60 80 54 229 121 29 166 42 170 139 222 118 88 118
4750 118 111 157 269 282 143 53 205 185 117 204 171 200 115 101 41 140 158 87 58 58 182 235 103 175 65 164 130 64 94 113 126 147 118
4362 118 173 132 81 26 33 169 141 110 131 68 118 193 236 200 157 163 184 246 59 118 130 121 153 144 123 177 86 63 139 144 110 117 164 64 78 258
3940 258 171 81 163 99 92 195 131 53 60 133 200 76 95 245 238 324 161 229 239 145 234 295 88 177 196 82 116 46 229 277 95 41
3564 41 221 216 19 129 156 173 93 137 142 62 167 57 189 225 167 228 214 132 233 222 180 230 210 339 210 171 64 59 144 139 106 109 142
3177 142 63 76 118 103 104 224 19 107 60 191 135 18 38 56 151 75 134 225 159 124 80 60 33 138 14 81 132 127 251 221 47 219
$$ packed form
5806A38O8j06Mk6J59Pk14L19j7k18r6J44l7r7J60K8j00m7m1J01J19j0j41J86j25j45P2j3P4
5466A46J06k08J48qj33K6L4K7K3j50J74j1k4n7J0L2o1J04kok3j18J53j38j3J62N1n9o6ro1
5102D9L3J56L3k50L5J65m1r0J12L0K4j22J1r6J2K5k6K0k6J75j08r2J37j24J28l1Q3j04l0L0
4750A18pM6J12J3j39r0J52k0o8Q7l3K9q5j4o0R9J8p1k9%J24N3j32P2j10R9l4o6L0J9J3K1k9
4362A18N5m1n1n5PJ36k8l1K1o3N0P5M3l6m3OK1O2j87N9J2rL2rk1N4r1k3P6Nl4PM7j00J4J80
3940B58q7r0Q2o4pJ03o4p8PP3O7j24J9J50pQ6j63O8J0r4Q9O1k07Q9J9j14L4p0J83M8j82n4
3564D1J80nj97J10K7J7q0M4Nq0J05j10J32L6n8O1j4q2J01j1m2N0k0J29j29l9j07nQ5nl3LL3
3177A42p9J3M2j5JJ20k05Q8m7J31n6j17K0J8R5p6N9R1o6l5m4k0k7J05j24O7N1nJ24l0j74J72
$$ plain form
2801 219 209 129 69 59 57 125 62 210 150 69 214 212 76 139 113 256 66 234 89 102 31 103 201 118 76 121 83 176 99 196 233 121
2426 121 115 99 35 31 202 171 286 209 263 335 196 139 54 89 125 45 53 270 139 127 302 217 130 185 92 131 277 187 122 109 119 234
2050 234 146 312 260 221 136 121 189 182 220 102 49 74 139 91 280 148 94 210 74 158 49 80 143 110 263 165 68 125 305 75
1698 75 207 14 62 174 65 97 87 92 54 442 221 101 184 66 92 181 128 79 189 43 119 112 113 43 293 248 106 6 30 110
1346 110 61 236 201 79 268 291 239 219 316 314 219 6 60 198 237 36 95 161 153 161 132 202 153 143 87 223 247 73 161 197 204 187 148
959 148 93 103 176 167 175 151 111 70 253 150 22 184 87 166 262 143 152 117 274 123 176 275 160 240 154 183 141 138 197 40 25 99 179
571 179 181 255 206 87 151 141 126 76 91 68 112 147 100 81 156 19 34 145 109 193 245 199 73 108 213 96 126 181 224 145 195 46
196 46 126 41 103 184 241 216 185 38 177 221 181 179 83 55 99 90 214 94 192 277 202 166 208 86 131 32 35 156 176 106 92 129 70
$$ packed form
2801B19j0q0o0j0kO8o3J48o0q1J45kj36O3k6J43j90J68j45J3p1P2R8q3m2M5l8R3p7R7L7j12
2426A21oj6o4mJ71l1J15p7N4P2j39n7q5L5L6q0QK17j31j2J75q5q7N5r3L9J46r0o5j3J0J15
2050B34q8J66n2l9q5j5O8pL8j18n3K5O5m8J89j32n4J16j36Q4j09L1O3l3J53r8r7N7J80k30
1698G5J32j93M8J12j09L2j0Nl8L88k21j20Q3j18K6Q9n3m9J10j46P6pJp0K50m5j42j00K4Q0
1346A10m9J75l5j22J89K3n2k0R7kr5k13N4J38L9k01N9O6qQk9P0m9j0n6J36K4j74Q8L6Pj7l9
959A48n5J0P3rQk4m0m1J83j03j28J62r7P9R6j19Rl5J57j51N3R9j15Q0q6K9m2lN9j57j5P4Q0
571A79KP4m9j19O4j0j5n0J5k3M4L5m7j9P5j37J5J11l6Q4N2m6j26L5J05j17L0N5M3p9N0j49
196D6Q0q5O2Q1N7k5l1j47J39M4m0kr6k8M4rJ24j20R8Q5p5l6M2j22M5r9LJ21K0p0j4L7n9
-192G0
##PAGE=	F1=8496.74
##FIRST=	25164.767445380970457,	5806.2096540000038658,	0.40436381101608276367
##DATA TABLE=	(F2++(Y..Y)), PROFILE
$$ plain form
5806 95 184 123 108 69 224 279 21 371 334 160 17 133 62 47 183 210 67 123 75 131 225 230 64 278 147 62 104 70 121 193
5454 193 45 198 229 9 83 52 88 130 49 149 159 128 73 156 147 147 240 169 136 91 90 234 107 66 183 198 160 108 110 81 100 184 198
5067 198 55 25 182 228 39 247 204 295 170 131 46 115 39 87 116 60 202 52 51 168 21 104 74 189 69 83 121 141 193 199
4715 199 201 126 27 189 185 145 172 187 157 133 90 55 120 166 36 55 62 197 237 90 180 99 158 109 88 115 139 132 212 155 191 170 102 20 4
4304 4 222 174 119 129 100 87 219 306 241 176 174 187 284 111 154 90 107 178 158 154 187 119 39 131 165 130 154 185 88 102 270 186 68 150
3905 150 83 102 218 118 35 44 115 141 90 72 215 245 298 169 231 216 126 230 285 53 182 178 78 96 58 212 295 120 66 226
3553 226 271 70 161 184 155 156 172 113 41 169 71 156 229 180 200 193 106 191 211 160 199 214 347 214 198 26 1 125 123 102 112 126 84
3165 84 58 148 122 98 208 46 150 79 240 129 47 28 56 140 84 101 215 172 168 63 26 60 125 72 101 104 99 272 268 84 233 270
$$ packed form
5806I5Q9o1j5l9J55N5k58L50l7j74j43J16p1j5J36K7j43N6m8N6R4Nj66K14j31q5M2l4N1P2
5454A93j48J53L1k20P4l1L6M2q1J00J0l1n5Q3r%R3p1l3m5jJ44j27m1J17J5l8n2Kk9J9Q4J4
5067A98j43l0J57M6j89K08m3R1j25l9q5O9p6M8K9n6J42j50jJ17j47Q3l0J15j20J4L8K0N2O
4715A99Kp5r9J62mm0K7J5l0k4m3l5O5M6j30J9PJ35M0j47R0q1N9m9k1K7K4pQ0n7L6k1o8q2j6
4304DK18m8n5J0k9j3J32Q7o5o5kJ3R7j73M3o4J7P1k0mL3o8q0R2L4l5K4L1r7J4J68q4j18Q2
3905A50o7J9J16j00q3RP1K6n1j8J43L0N3j29O2j5r0J04N5k32J29mj00J8l8J54Q3j75n4J60
3553B26M5k01R1K3k9JJ6n9p2J28r8Q5P3m9K0pq7Q5K0n1L9J5J33j33j6j72k5J24kk1J0J4m2
3165H4k6R0k6k4J10j62J04p1J61j11q2j9K8Q4n6J7J14m3mj05l7L4O5n3K9LnJ73mj84J49L7
$$ plain form
2790 270 142 52 34 83 160 39 218 201 71 220 231 77 115 141 267 92 222 71 97 36 126 188 70 83 76 117 204 107 185 226
2438 226 80 70 72 22 46 241 236 241 163 239 343 206 97 80 101 58 38 98 254 116 139 330 238 130 179 75 118 252 144 118
2085 118 110 95 214 155 326 289 216 108 147 145 131 157 152 36 36 147 149 278 78 74 244 157 136 69 65 159 109 263 163 68 101 279 86
1698 86 197 15 60 135 45 104 51 115 42 399 171 90 155 14 95 146 83 122 213 87 162 103 101 26 281 250 111 7 2 114 60
1334 60 218 191 90 249 236 223 225 280 323 203 47 78 154 170 84 73 170 155 199 123 141 120 161 123 192 207 44 148 177 224 186 115
959 115 85 99 181 133 189 131 113 106 235 156 56 168 81 140 257 165 184 91 319 137 101 207 117 228 125 152 134 141 210 55 34
595 34 120 184 128 169 126 37 167 152 99 50 98 81 86 113 102 81 137 76 65 164 57 207 211 203 102 119 218 106 91 155 232 115 216 79
196 79 135 32 109 145 222 201 178 62 193 242 188 150 28 28 141 87 173 57 138 251 157 114 194 141 164 29 46 155 198 114 129 142
$$ packed form
2790B70j28r0j8M9P7j21J79j7j30J49J1j54L8K6J26j75J30j51K6o1R0O2j18J3pM1Q7r7P8M1
2438B26j46j0Kn0K4J95nNp8P6J04j37j09j7K1m3k0O0J56j38K3J91r2j08M9j04M3J34j08k6
2085A18qj5J19n9J71l7p3j08L9kj4K6nj16%J11KJ29k00mJ70q7k1o7mR4n0J54j00r5L3J78j93
1698H6J11j82M5P5r0N9n3O4p3L57k28q1O5j41Q1N1o3L9R1j26P5n9kp5K55l1j39j04nJ12n4
1334F0J58k7j01J59j3j3KN5M3j20j56L1P6J6q6j1R7j5M4p6J8k1M1l8O9J5j63J04K9M7l8p1
959A15l0J4Q2m8N6n8j8pJ29p9j00J12q7N9J17r2J9r3K28j82l6J06r0J11j03K7j8PO9j55k1
595C4Q6O4n6M1m3q9J30j5n3m9M8j7NK7j1k1N6o1j1R9j07J50Mqj01J7R9j12j5O4P7j17J01j37
196G9N6j03P7L6P7k1k3j16J31M9n4l8j22%J13n4Q6j16Q1J13r4m3Q0n3K3j35J7J09M3q4J5J3
$$ plain form
-180 142 80
$$ packed form
-180A42o2
-192H0
##PAGE=	F1=8394.48
##FIRST=	25164.767445380970457,	5806.2096540000038658,	0.3978531956672668457
##DATA TABLE=	(F2++(Y..Y)), PROFILE
$$ plain form
5806 70 146 144 109 75 221 301 22 374 335 202 21 135 37 83 216 214 46 180 105 125 185 198 63 263 143 96 118 62 101 151
5454 151 61 208 249 51 89 64 39 102 105 96 136 136 122 214 144 215 301 148 94 41 139 261 154 91 165 143 133 86 94 119 115 118 131 85 41
5043 41 128 260 62 266 189 323 190 103 74 173 43 129 131 82 188 100 97 164 48 73 35 151 31 93 140 179 209 110 149 91 71
4679 71 162 169 170 152 197 106 160 87 76 95 165 15 54 85 194 200 62 182 110 163 87 113 130 149 119 244 178 216 197 105 23 56 269 194
4280 194 115 130 144 42 227 347 259 167 177 178 295 150 195 67 113 187 196 177 184 160 22 125 177 136 190 217 113 115 267 192 74
3916 74 139 70 96 206 96 18 32 135 97 90 70 181 220 268 178 227 180 106 210 272 14 188 151 71 62 73 192 290 128 99 205
3553 205 303 107 171 184 131 195 180 66 44 161 78 107 205 184 170 164 75 148 192 126 153 193 321 198 204 62 72 113 90 74 95 106 113
3165 113 66 187 133 111 192 93 182 79 282 114 80 30 85 112 80 70 177 191 280 82 46 103 112 133 113 72 71 278 300 115 238
$$ packed form
5806G0P6kl5l4J46Q0k79L52l9j33j81J14r8M6J33kj68J34p5K0O0J3j35K00j20m7K2n6L9N0
5454A51r0J47M1j98L8k5k5O3LrM0%j4R2p0P1Q6j53n4n3R8J22j07o3P4k2j0m7QK5mLJ3m6m4
5043D1Q7J32j98K04p7J34j33q7k9R9j30Q6Km9J06q8lO7j16K5l8J16j20O2M7L9L0r9L9n8k0
4679G1R1PJj8M5r1N4p3j1J9P0j50L9L1J09Oj38J20p2N3p6K6J7J9l0J25o6L8j9r2q2L3K13p5
4280A94p9J5J4j02J85J20q8r2J0JJ17j45M5j28M6P4Rj9Pk4j38J03N2m1N4K7j04KJ52p5j18
3916G4O5o9K6J10j10p8J4J03l8pk0J11L9M8r0M9m7p4J04O2k58J74l7q0rJ1J19R8j62k9J06
3553B05R8j96O4J3n3O4j5j14k2J17q3K9R8k1j4oq9P3M4o6K7M0J28j23Oj42J0M1k3j6K1J1P
3165A13m7J21n4k2Q1r9Q9j03K03j68l4n0N5K7l2j0J07J4Q9j98l6N7RK1k0m1jK07K2j85J23
$$ plain form
2801 238 318 151 63 40 94 187 112 207 243 52 211 232 114 101 152 245 106 182 87 99 47 148 188 40 81 32 156 212 84 148
2449 148 206 55 24 56 56 63 261 283 176 104 198 313 192 66 128 145 23 30 133 216 117 139 330 238 116 171 63 93 220 114
2097 114 116 100 85 179 172 307 309 200 69 226 364 271 102 214 55 9 139 183 253 38 62 265 225 117 101 55 159 116 247
1757 247 154 84 101 255 87 192 35 103 116 45 105 35 115 22 317 100 98 160 64 97 109 44 163 187 158 201 89 85 62 267 234
1393 234 95 11 36 112 54 187 163 91 204 163 191 226 259 342 181 103 95 100 94 146 45 162 149 213 126 82 101 195 169 171 152 39 129
1006 129 150 211 150 95 71 76 162 103 188 80 88 117 181 136 91 158 74 104 236 173 190 73 347 145 98 133 83 213 100 112 118 153 214
618 214 62 57 131 157 61 85 37 7 188 191 102 44 114 100 61 83 102 92 119 128 98 173 16 203 191 200 137 124 216 138 54 125 232 92
219 92 249 115 133 87 101 92 181 177 164 96 211 274 185 115 23 19 161 96 118 73 64 196 80 69 180 201 191 46 64 177 226 126 151
$$ packed form
2801B38Q0j67q8k3N4R3p5R5L6j91J59K1j18j3N1R3j39P6r5J2n2J01M0j48M1m9J24N6j28O4
2449A48N8j51l1L2%PJ98K2j07p2R4J15j21j26O2J7j22PJ03Q3r9K2J91r2j22N5j08L0J27j06
2097A14Kj6j5R4pJ35Kj09j31J57J38r3j69J12j59m6J30M4P0k15K4K03m0j08j6m6J04m3J31
1757B47r3p0J7J54j68J05j57O8J3p1O0p0Q0r3K95k17kO2r6L3J2o5J19K4k9M3j12mk3K05l3
1393B34j39q4K5P6n8J33k4p2J13m1K8L5L3Q3j61p8qNoN2j01J17j3O4q7m4J9R4k6Kj9j13R0
1006A29K1O1o1n5k4NQ6n9Q5j08QK9O4m5m5O7q4L0J32o3J7j17K74k02m7L5n0J30j13J2OL5O1
618B14j52nP4K6r6K4m8l0J81Lq9n8P0j4l9K2J9j0K7Rl0P5j57J87j2Ro3j3R2p8q4P1J07j40
219I2J57j34J8m6J4rQ9mj3o8J15O3q9p0r2mJ42o5K2m5rJ32j16j1J11K1j0j45J8J13M9j00K5
$$ plain form
-168 151 130 80
$$ packed form
-168A51k1n0
-192H0
##PAGE=	F1=8292.22
##FIRST=	25164.767445380970457,	5806.2096540000038658,	0.22885583341121673584
##DATA TABLE=	(F2++(Y..Y)), PROFILE
$$ plain form
5806 98 99 153 99 89 220 303 25 353 342 234 18 166 87 125 270 216 63 203 107 123 134 149 90 243 148 112 115 48 91 144 85
5442 85 210 233 105 89 135 36 70 147 45 115 175 180 249 122 262 344 123 56 25 176 259 178 99 162 109 98 46 77 158 118 44 87
5067 87 91 82 64 270 124 251 182 337 187 65 103 212 106 174 124 95 193 195 147 160 91 126 119 109 11 100 151 210 205 30 144 40
4691 40 151 130 139 188 142 202 87 167 101 108 68 146 50 65 111 177 133 28 176 96 173 65 137 130 143 95 230 181 235 199 84 55 117
4304 117 299 199 96 117 169 70 218 343 251 141 176 160 277 169 228 75 115 181 247 191 166 205 36 118 181 133 214 250 138
3963 138 118 248 185 91 123 62 73 168 77 32 43 178 116 82 74 153 169 237 178 214 141 105 177 264 25 196 122 69 20 84 172 271 125
3576 125 133 168 310 125 156 159 105 207 166 23 70 147 84 78 161 187 163 139 53 119 172 92 97 154 270 178 193 126 140 119 48 48 63 89 129
3165 129 71 214 142 140 179 130 191 76 307 102 106 48 129 82 84 59 132 225 449 201 65 160 103 175 95 26 37 272 315 137 236 348
$$ packed form
5806I8JN4n4j0J31Q3k78L28j1j08k16J48p9L8J45n4j53J40r6J6J1J5n9J53r5l6Lo7M3N3n9
5442H5J25K3j28j6M6r9L4P7j02P0O0NO9j27J40Q2k21o7l1J51Q3q1p9O3n3j1n2L1Q1m0p4M3
5067H7Mrj8K06j46J27o9J55j50j22L8J09j06O8n0k9R8Km8J3o9L5pj0r8Q9N1N9nj75J14j04
4691D0J11k1RM9m6O0j15Q0o6Pm0P8r6J5M6O6m4j05J48q0P7j08P2pJ3m8J35m9N4l6j15k9O2
4304A17J82j00j03K1N2r9J48J25r2j10L5j6J17j08N9j53M0O6O6n6k5L9j69Q2O3m8Q1L6j12
3963A38k0J30o3r4L2o1J1R5r1m5J1J35o2l4qP9J6O8n9L6p3l6P2Q7k39J71p4n3m9O4Q8R9j46
3576A25QL5J42j85L1Ln4J02m1j43M7P7o3oQ3K6k4k4q6O6N3q0NN7J16r2J5o7J4k1p1%J5K6M0
3165A29n8J43p2kL9m9O1j15K31k05Mn8Q1m7Kk5P3R3K24k48j36R5n7P2q0o9J1K35M3j78R9J12
$$ plain form
2790 348 153 93 59 89 201 172 190 270 29 175 204 147 107 143 190 106 134 108 91 60 169 204 40 79 43 193 205 41 111 172 45
2426 45 18 51 95 86 262 306 117 45 146 251 155 96 179 181 90 23 148 164 136 127 309 224 89 164 58 73 195 105 125 80 92 149
2050 149 197 258 309 166 47 356 773 555 107 256 44 41 122 188 208 59 41 259 260 116 134 52 161 122 218 142 112 120 237 72
1698 72 182 55 140 126 75 104 52 96 8 216 26 131 228 121 99 93 55 157 88 237 221 75 66 97 243 205 56 32 68 101 39
1334 39 148 122 81 152 116 145 222 257 360 160 155 101 82 57 206 16 148 141 200 124 48 102 224 200 187 87 67 115 124 171 83 93 54
947 54 32 131 83 168 21 39 101 122 95 119 149 79 72 210 164 171 63 345 142 150 84 85 199 100 72 89 164 206 53 63 124 113 29 27 43
536 43 39 220 238 130 73 134 127 40 65 103 101 111 157 123 172 16 177 185 181 163 125 204 170 35 106 227 74 270 138 126 154 96 40 128
137 128 145 146 129 226 304 166 94 67 36 160 108 56 114 37 126 38 72 174 252 210 87 70 221 258 132 152 99 68
$$ packed form
2790C48j95o0l4L0J12k9J8Q0k41J46K9n7m0L6M7q4K8k6j7l1J09L5j64L9l6J50J2j64P0O1j27
2426D5k7L3M4rJ76M4j89p2J01J05r6n9Q3Kr1o7J25J6k8rJ82q5j35P5j06J5J22r0K0m5J2N7
2050A49M8O1N1j43j19L09M17k18m48J49k12lQ1O6K0j49j8K18Jj44J8q2J09l9R6p6l0QJ17j65
1698G2J10j27Q5j4n1K9n2M4q8K08j90J05R7j07k2ol8J02o9J49j6j46rL1J46l8j49k4L6L3o2
1334C9J09k6m1P1l6K9P7L5J03k00nn4j9k5J49j90J32pN9p6p6N4J22k4j3j00k0M8RM7q8J0l9
947E4k2R9m8Q5j47J8O2K1k7K4L0p0pJ38m6Pj08K82k03Qo6JJ14r9k8J7P5M2j53J0O1j1q4kJ6
536D3mJ81J8j08n7O1pq7K5L8kJ0M6l4M9j56J61Qmj8l8P9l4j35P1J21j53J96j32j2K8n8n6Q8
137A28J7Jj7R7P8j38p2k7l1J24n2n2N8p7Q9q8L4J02P8m2j23j7J51L7j26K0n3l1
-192F8
##PAGE=	F1=8189.96
##FIRST=	25164.767445380970457,	5806.2096540000038658,	0.11926865577697753906
##DATA TABLE=	(F2++(Y..Y)), PROFILE
$$ plain form
5806 148 56 145 78 109 214 282 36 308 353 256 10 191 126 161 315 207 82 187 80 138 90 94 112 219 165 123 102 27 86 151
5454 151 97 198 186 155 78 206 94 35 166 60 122 221 225 258 89 279 356 106 49 45 201 231 178 89 185 129 48 19 94 197 110
5090 110 44 84 79 113 7 255 176 205 175 332 157 23 124 223 168 208 103 97 215 274 189 160 134 177 196 60 9 92 145 226 196
4726 196 97 154 20 229 101 106 194 140 202 100 145 119 148 47 116 68 90 132 148 55 32 159 69 186 41 155 115 123 66 172 161
4362 161 234 168 41 103 177 304 188 67 83 168 144 196 287 221 119 170 139 239 168 239 85 110 169 294 198 137 243 82 109 179
4010 179 146 220 267 161 113 217 166 107 103 59 35 117 73 56 65 208 166 93 65 138 107 207 163 189 107 119 134 264 57 209 102 82
3635 82 22 87 155 249 117 156 126 295 123 126 122 78 197 144 55 89 140 97 106 108 188 180 118 52 106 158 84 66 121 211 171 181 176 182 132 26
3212 26 71 25 77 133 58 219 150 169 167 150 176 104 308 97 123 76 169 61 103 68 126 263 638 364 70 220 98 185 46 42 17
$$ packed form
5806A48r2Q9o7L1J05O8k46K72M5r7k46J81o5L5J54j08j25J05j07N8m8MJ8J07n4m2k1p5N9O5
5454A51n4J01j2l1p7J28j12n9J31j06O2R9ML3j69J90P7k50n7mJ56L0n3q9R6n6q1k9P5J03q7
5090A10o6M0nL4j06K48p9K9l0J57j75j34J01R9n5M0j05oJ18N9q5k9k6M3J9j36n1Q3N3Q1l0
4726A96r9N7j34K09j28NQ8n4O2j02M5k6K9j01O9m8K2M2J6r3k3J27r0J17j45J14m0Qn7J06j1
4362A61P3o6j27O2P4J27j16j21J6Q5k4N2R1o6j02N1l1J00p1P1j54K5N9J25r6o1J06j61K7P0
4010A79l3P4M7j06m8J04n1n9mm4k4Q2m4j7RJ43m2p3k8P3l1J00m4K6q2J2J5J30k07J52j07k0
3635H2o0O5O8R4j32L9l0J69j72Lmm4J19n3q9L4N1m3RKQ0qo2o6N4N2p4j8N5R0m0J0nOn0j06
3212B6M5m6N2N6p5J61o9J9kj7K6p2K04k11K6m7R3j08M2l5N8J37L75k74k94J50j22Q7j39mk5
$$ plain form
2848 17 253 314 147 228 357 152 129 75 73 204 207 178 278 75 116 146 160 129 117 112 95 110 113 65 67 188 224 65 88 85 223 189 44
2461 44 117 131 78 55 58 137 116 244 300 104 8 90 176 100 169 224 192 143 21 143 105 148 110 278 213 56 160 55 75 181 105
2097 105 145 55 98 145 225 191 283 111 85 509 1234 868 157 270 5 73 109 168 150 88 10 224 252 141 167 54 178 125 179
1757 179 135 143 147 228 37 160 73 155 129 103 100 80 67 28 128 39 182 311 153 106 124 93 126 76 313 214 69 48 113 209 179 19
1381 19 71 94 85 16 114 77 61 109 138 92 217 263 365 142 193 90 125 87 253 12 137 135 167 109 51 114 246 204 234 51 105 114
1006 114 116 120 11 108 43 44 124 97 131 71 28 79 143 43 135 136 100 86 194 137 131 56 311 125 189 86 112 191 122 74 51 162 186 33
606 33 50 101 82 101 37 97 58 257 275 157 112 151 153 26 55 111 99 121 154 133 164 28 133 188 149 174 127 179 181 38 101 217 67
219 67 262 139 127 212 109 45 95 112 129 158 235 319 129 109 96 58 143 114 29 145 98 69 118 100 171 285 219 139 83 272 290 126
$$ packed form
2848A7K36O1j67Q1J29k05k3n4kJ31Lk9J00k03M1L0J4l1j2nj7J5Lm8KJ21L6j59K3lJ38l4j45
2461D4P3J4n3k3LP9k1J28N6j96r6Q2Q6p6O9N5l2m9j22J22l8M3l8J68o5j57J04j05K0J06p6
2097A05M0r0M3M7Q0l4R2j72k6M24P25l66p11J13k65O8L6N9j8o2p8K14K8j11K6j13J24n3N4
1757A79m4QMQ1j91J23q7Q2k6k6lk0j3l9J00q9J43J29j58m7J8l1L3n0K37r9j45k1O5R6l0j60
1381A9N2K3ro9R8l7j6M8K9m6J25M6J02k23N1j03L5l8J66k41J25kL2n8n8O3J32m2L0j83N4R
1006A14KMj09R7o5JQ0k7L4o0m3N1O4j00R2Jl6j4J08n7op5K55j86O4j03K6P9o9m8k3J11K4j53
606C3J7N1j9J9o4O0l9J99J8j18m5L9Kj27K9N6j2K2L3k1L1j36J05N5l9K5m7N2Kj43O3J16j50
219F7J95j23j2Q5j03o4N0J7J7K9P7Q4j90k0j3l8Q5k9q5J16m7k9M9j8P1J14o6q0n6J89J8j64
$$ plain form
-156 126 137 72 57
$$ packed form
-156A26J1o5j5
-192E7
##PAGE=	F1=8087.71
##FIRST=	25164.767445380970457,	5806.2096540000038658,	0.17756679654121398926
##DATA TABLE=	(F2++(Y..Y)), PROFILE
$$ plain form
5806 193 57 126 80 132 196 238 47 247 360 262 13 189 141 185 333 192 97 138 33 170 88 48 114 192 191 141 99 15 79 142
5454 142 86 172 118 192 58 262 148 20 161 115 166 258 251 246 50 260 332 101 70 58 216 191 157 63 211 183 32 76 137 232
5102 232 103 125 107 60 124 57 220 212 145 162 308 108 22 138 209 223 223 77 95 239 322 214 161 170 191 246 9 21 76 129 220 198
4726 198 174 150 80 286 82 88 185 146 191 104 101 127 192 32 103 68 120 139 108 44 65 130 77 197 18 160 86 104 43 94 126 206 104
4339 104 24 158 225 282 165 45 42 146 208 162 182 175 126 163 113 188 155 224 76 110 162 321 202 102 266 136 96 170 187 208 259
3975 259 180 105 182 142 117 87 61 12 79 92 74 84 205 204 138 42 128 69 175 137 153 79 129 86 266 81 224 99 107 59 78 137 232
3588 232 110 156 89 262 105 104 104 54 175 132 91 94 154 120 152 55 181 196 99 70 109 153 107 114 119 160 176 186 196 187 136 58 112 31 76
3177 76 130 26 199 150 186 151 149 148 152 281 94 128 107 197 43 122 74 169 292 803 525 65 266 95 160 54 106 66 225 301
$$ packed form
5806A93j36O9m6N2O4M2j91K00J13r8k49J76m8M4J48j41r5M1j05J37q2m0O6P8jn0m2q4O4O3
5454A42n6Q6n4P4j34K04j14j28J41m6N1R2pnj96K10P2k31l1j2J58k5l4r4J48k8j51M4O1R5
5102B32j29K2j8m7O4o7J63qo7J7J46k00q6J16P1J4%j46J8J44Q3j08n3RK1N5k37J2N5N3R1k2
4726A98k4k4p0K06k04OR7l9M5q7lK6O5j60P1l5N2J9l1o4K1O5n3J20j79J42p4J8o1N1L2Q0j02
4339A04q0J34O7N7j17j20lJ04O2m6K0pm9L7n0P5l3O9j48L4N2J59j19j00J64j30m0P4J7K1N1
3975B59p9p5P7m0k5l0k6m9O7J3j8J0J21jo6r6Q6n9J06l8J6p4N0m3J80j85J43j25Qm8J9N9R5
3588B32j22M6o7J73j57j%n0J21m3m1LO0l4L2r7J26J5r7k9L9M4m6PNM1J6J0J0rn1p8N4q1M5
3177G6N4j04J73m9L6l5kjMJ29j87L4k1R0j54P9m8R5J23N11k78m60K01j71O5j06N2m0J59P6
$$ plain form
2825 301 148 220 346 153 161 87 60 197 214 178 262 139 86 100 152 148 83 44 94 125 100 35 62 204 238 101 102 118 246 173 94 158
2449 158 105 134 85 73 182 149 212 268 132 31 50 118 41 241 255 181 177 23 124 56 139 92 249 210 36 161 55 90 180 103
2097 103 171 27 89 158 246 131 240 44 136 645 1638 1136 205 257 44 96 107 136 89 120 62 164 204 180 198 62 202 118 132
1757 132 137 163 173 229 9 134 82 147 102 112 96 109 45 49 106 79 234 370 157 132 174 122 170 257 368 184 70 37 105 168 167 82
1381 82 119 107 68 27 100 33 28 83 185 44 210 263 352 126 213 61 179 107 274 39 131 134 124 83 64 134 267 179 289 121 141
1017 141 121 130 81 98 134 37 118 163 139 85 131 99 97 230 41 139 120 127 140 202 97 82 53 248 91 197 99 133 183 143 115 46 141
630 141 154 35 33 77 96 174 50 122 61 284 290 173 149 157 168 28 50 122 84 146 120 130 155 40 84 191 116 165 133 138 157 37 96
243 96 201 79 219 122 147 248 129 84 115 93 115 179 239 312 90 141 110 84 123 107 68 153 138 72 181 111 160 291 214 190 121 311
$$ packed form
2825C01j53P2J26j93Qp4k7J37J7l6Q4j23n3J4N2mo5l9N0L1k5o5K7J42L4j37JJ6J28p3p9O4
2449A58n3K9m9j2J09l3O3N6j36j01J9O8p7K00J4p4mj54J01o8Q3m7J57l9j74J25j06L5R0p7
2097A03O8j44O2O9Q8j15J09j96R2N09R93n02r31N2k13N2J1K9m7L1n8J02M0k4J8j36J40q4J4
1757A32NK6J0N6k20J25n2O5m5J0j6J3o4MN7k7J55J36k13k5M2n2M8Q7J11j84j14l3O8O3jq5
1381H2L7j2l9m1P3o7nN5J02j41J66N3Q9k26Q7j52J18p2J67k35R2Lj0m1j9P0J33q8J10j68K0
1017A41k0Rm9J7L6r7Q1M5k4n4M6l2kJ33j89R8j9PJ3O2j05j5k9J95j57J06r8L4N0m0k8o9R5
630A41J3j19kM4J9P8j24P2o1K23Oj17k4QJ1j40K2P2l8O2k6J0K5j15M4J07p5M9l2NJ9j20N9
243I6J05j22J40r7K5J01j19m5L1k2K2O4O0P3k22N1l1k6L9j6l9Q5j5o6J09p0M9J31p7k4o9J90
$$ plain form
-133 311 314 105 118 82 70
$$ packed form
-133C11Lk09J3l6j2
-192G0
##PAGE=	F1=7985.45
##FIRST=	25164.767445380970457,	5806.2096540000038658,	0.25126555562019348145
##DATA TABLE=	(F2++(Y..Y)), PROFILE
$$ plain form
5806 227 98 122 124 152 169 180 51 183 355 252 30 155 129 194 319 190 116 75 23 201 121 36 90 160 220 173 122 46 64 109
5454 109 55 137 45 209 30 298 183 38 137 164 223 271 259 225 20 208 276 103 87 61 217 153 125 28 216 238 109 129 174
5114 174 259 110 196 126 47 114 100 171 233 123 145 269 56 57 144 180 269 219 58 96 251 338 223 159 190 170 264 65 32 79 119
4750 119 195 212 224 125 130 312 77 94 166 155 167 83 53 119 229 23 138 58 149 123 62 104 88 93 125 202 26 148 56 103 43 81
4374 81 86 152 18 85 210 254 235 134 60 50 110 249 122 59 122 156 155 82 139 140 188 57 125 165 323 205 72 266 186 79 154
4010 154 240 186 228 195 101 155 131 119 90 66 65 77 127 81 96 169 219 197 39 110 90 141 106 113 54 124 40 259 97 235 115 138 88
3623 88 60 118 222 110 130 66 223 74 125 131 46 152 132 105 84 178 146 184 9 164 194 81 94 127 158 135 179 140 125 180 205 180
3247 180 153 126 90 141 66 89 127 31 159 137 179 130 132 130 194 230 79 118 134 203 15 124 63 214 299 903 642 62 286 92 112
$$ packed form
5806B27j29K4KK8J7J1j29J32J72j03k22J25k6O5J25j29p4m1n2J78q0q5N4P0O0m7n1p6J8M5
5454A09n4Q2r2J64j79K68j15j45R9K7N9M8j2l4k05J88O8j73j6k6J56o4k8r7J88K2j29K0M5
5114A74Q5j49Q6p0p9O7j4P1O2j10K2J24k13JQ7L6Q9n0j61L8J55Q7j15o4L1k0R4j99l3M7M0
4750A19P6J7J2r9NJ82k35J7P2j1J2q4l0O6J10k06J15q0R1k6o1M2j6NL2P7j76J22r2M7o0L8
4374H1NO6j34O7J25M4j9j01p4j0O0J39j27o3O3L4jp3N7JM8j31O8M0J58j18j33J94q0j07P5
4010A54Q6n4M2l3r4N4k4j2k9k4jJ2N0m6J5P3N0k2j58P1k0N1l5Pn9P0q4K19j62J38j20K3n0
3623H8k8N8J04j12K0o4J57j49N1Oq5J06k0k7k1R4l2L8j75J55L0j13J3L3L1k3M4l9j5N5K5k5
3247A80k7k7l6N1p5K3L8r6J28k2M2m9KkO4L6j51L9J6O9j88J09o1J51Q5O04k61n80K24j94K0
$$ plain form
2884 112 122 144 121 191 281 144 216 321 155 183 89 73 180 193 180 226 189 136 152 130 150 65 95 114 148 77 50 45 213 238 132 107
2508 107 136 266 162 135 195 111 187 106 91 225 179 172 223 154 37 57 108 20 293 266 158 196 29 102 28 115 82 230 211 45 169
2144 169 63 100 199 106 193 5 62 158 249 107 192 53 172 727 1888 1296 238 220 91 106 109 109 50 163 128 100 136 214 219 76
1792 76 216 100 86 148 164 192 237 58 112 75 120 49 98 87 138 51 64 133 87 270 386 140 176 214 129 239 374 380 149 69 35
1428 35 79 131 159 148 167 106 57 58 107 30 18 67 215 21 199 246 318 109 217 21 220 93 262 65 123 135 83 54 84 163 287
1064 287 134 330 209 173 125 151 75 182 164 30 189 209 177 45 165 158 138 310 92 133 106 154 192 222 72 47 62 174 44
724 44 168 92 137 167 147 159 89 102 111 75 35 78 130 235 52 124 51 289 282 178 175 150 165 49 49 127 64 176 66 116 146 52 64 192
325 192 100 139 141 91 98 27 87 179 100 141 125 183 257 139 110 154 95 106 192 237 280 87 165 112 113 111 88 95 141 144 102 208 98 132 266 193
$$ packed form
2884A12J0K2k3P0R0j37P2J05j66K8r4j6J07J3j3M6l7n3J6k2K0q5L0J9L4p1k7nJ68K5j06k5
2508A07K9J30j04k7O0q4P6q1j5J34m6pN1o9j17K0N1q8K73k7j08L8j67P3p4Q7l3J48j9j66J24
2144A69j06L7R9r3Q7j88N7R6R1j42Q5j39J19N55J161n92j058j8j29J5L%n9J13l5k8L6P8Nj43
1792G6J40j16j4O2J6K8M5j79N4l7M5p1M9j1N1q7J3O9m6J83J16k46L6L8q5J10J35Ok31q0l4
1428C5M4N2K8j1J9o1m9JM9p7j2M9J48j94J78M7P2k09J08j96J99j27J69j97N8J2n2k9L0P9J24
1064B87j53J96j21l6m8K6p6J07j8j34J59K0l2j32J20pk0J72k18M1k7M8L8L0j50k5J5J12j30
724D4J24p6M5L0k0J2p0J3Rl6m0M3N2J05j83P2p3K38pj04lk5J5j16%P8o3J12j10N0L0r4J2J28
325A92r2L9Kn0Pp1O0R2p9M1j6N8P4j18k9M4n9J1Q6M5M3j93P8n3Jkk3PM6Lm2J06j10L4J34p3
$$ plain form
-98 193 226 169 322 321 71 114 106 108
$$ packed form
-98A93L3n7J53jk50M3qK
-192A08
##PAGE=	F1=7883.19
##FIRST=	25164.767445380970457,	5806.2096540000038658,	0.32653099298477172852
##DATA TABLE=	(F2++(Y..Y)), PROFILE
$$ plain form
5806 248 136 146 176 164 146 117 43 143 339 226 48 105 97 190 273 214 144 23 62 213 152 45 45 130 243 211 162 82 53 62 40 100
5431 100 38 210 18 311 192 44 107 197 266 255 250 200 46 134 201 105 89 65 195 131 92 18 190 281 194 159 190 275 134 243
5078 243 126 46 94 127 119 247 164 127 218 57 78 137 154 309 199 55 96 242 323 219 150 189 128 255 136 30 110 123 156 221
4726 221 241 85 162 307 89 110 140 157 134 46 34 103 250 25 201 64 174 82 15 144 98 54 171 197 68 120 64 121 74
4386 74 149 56 83 74 139 248 259 171 99 94 89 73 261 84 122 77 183 149 60 109 134 146 73 149 174 301 210 51 238 218 62 131 281
3999 281 165 182 202 104 144 145 116 109 70 115 91 167 82 99 111 214 253 88 78 124 102 78 79 28 104 10 234 102 233 140 168 111 58
3611 58 97 217 120 82 56 185 48 172 181 59 134 128 94 65 192 163 190 26 139 171 64 110 154 171 154 225 149 101 178 219 131 90
3236 90 114 113 154 92 113 125 94 110 122 146 105 104 131 212 170 45 88 156 186 45 104 30 233 277 909 686 69 272 91 70 153 128
$$ packed form
5806B48j12J0L0j2j8k9p4J00J96j13j78N7qR3Q3n9p0j21L9J51o1j07%Q5J13l2m9q0k9Rk2O0
5431A00o2J72j92K93j19j48O3R0O9j1nn0j54Q8O7r6j6k4J30o4l9p4J72R1q7l5L1Q5j41J09
5078B43j17q0M8L3qJ28q3l7R1j61K1N9J7J55j10j44M1J46Q1j04o9L9o1J27j19j06Q0J3L3O5
4726B21K0j56P7J45k18K1L0J7k3q8j2O9J47k25J76j37J10r2o7J29m6m4J17K6j29N2n6N7m7
4386G4P5r3K7rO5J09J1q8p2nnj6J88j77L8m5J06l4q9M9K5J2p3P6K5J27r1j59J87k0j56O9J50
3999B81j16J7K0r8M0Jk9pl9M5k4P6q5J7J2J03L9j65j0M6k2k4Jn1P6r4K24j32J31r3K8n7n3
3611E8L9J20r7l8k6J29j37J24Rj22P5ol4k9J27k9K7j64J13L2j07M6M4J7j7P1p6m8P7M1q8m1
3236I0K4jM1o2K1J2l1J6J2K4m1jK7Q1m2j25M3O8L0j41N9p4K03M4O32k23o17K03j81k1Q3k5
$$ plain form
2860 128 170 156 257 141 216 292 151 191 77 105 149 151 172 178 207 184 241 113 127 91 164 137 158 55 86 19 214 220 142 97 139 286
2484 286 154 157 209 139 222 115 104 256 197 139 183 161 32 83 126 58 313 258 141 205 40 89 27 99 83 222 205 61 183 77
2132 77 101 234 126 201 35 35 129 228 118 150 121 180 734 1921 1311 259 168 119 104 108 104 65 207 186 96 89 226 221 95 207 73
1768 73 62 155 139 197 241 92 90 60 91 17 65 72 165 74 74 152 68 281 355 112 225 226 104 221 352 337 127 63 41 55 108 136 195
1381 195 203 88 55 78 120 68 68 55 215 27 178 203 264 89 213 39 243 48 220 89 106 135 52 29 115 194 302 82 346
1041 346 281 199 125 160 91 244 193 31 243 231 188 42 168 192 166 358 135 122 101 176 223 234 107 77 92 130 37 110 66 122 143
677 143 134 189 133 57 58 118 49 107 156 276 61 113 39 268 251 176 184 135 149 80 58 125 51 199 25 98 139 53 88 187 112 104 146 61 29
266 29 44 82 152 117 48 186 224 242 133 120 176 104 98 194 230 231 134 170 113 141 111 59 98 112 121 115 196 67 87 213 155 239 211 299 301 33
$$ packed form
2860A28M2j4J01j16P5P6j41M0j14K8M4KK1OK9k3N7j28J4l6P3k7K1j03L1o7J95Op8m5M2J47
2484B86j32LN2p0Q3j07j1J52n9n8M4k2j29N1M3o8K55n5j17O4j65M9o2P2j6J39j7j44J22j06
2132G7K4J33j08P5j66%R4R9j10L2k9N9N54J187o10j052r1m9j5Mml9J42k1r0pJ37nj26J12j34
1768G3j1R3j6N8M4j49kl0L1p4M8PR3r1%P8q4K13P4k43J13Jj22J17J31j5k10o4k2J4N3K8N9
1381A95Qj15l3K3M2n2%j3J60j88J51K5O1j75J24j74K04j95J72j31J7K9q3k3Q6P9J08k20K64
1041C46o5q2p4L5o9J53n1j62K12j2m3j46J26K4k6J92k23j3k1P5M7J1j27l0J5L8r3P3m4N6K1
677A43rN5n6p6JO0o9N8M9J20k15N2p4K29j7p5Qm9J4o9k2O7p4J48j74P3M1q6L5R9p5qM2q5l2
266B9J5L8P0l5o9J38L8J8j09j3N6p2oR6L6Jr7L6n7K8l0n2L9J4RoQ1j29K0J26n8Q4k8Q8Kk68
$$ plain form
-156 33 124 115 150
$$ packed form
-156C3R1rL5
-192A50
##PAGE=	F1=7780.93
##FIRST=	25164.767445380970457,	5806.2096540000038658,	0.32112589478492736816
##DATA TABLE=	(F2++(Y..Y)), PROFILE
$$ plain form
5806 255 159 175 211 167 146 61 25 148 316 189 59 77 56 178 202 252 178 26 78 200 167 47 17 112 254 247 204 110 60 19 76
5442 76 67 95 200 45 305 177 28 86 213 277 209 229 173 82 51 123 102 78 79 148 128 70 61 144 305 270 162 181 279 165 258 106
5067 106 58 92 138 75 256 216 107 161 103 84 114 146 341 169 73 90 206 288 208 134 165 85 232 204 8 140 126 123 208 229 43
4703 43 173 281 117 128 118 150 99 39 47 104 250 43 262 96 195 18 26 160 96 35 194 185 123 92 116 141 124 199 50 38 151
4339 151 174 265 240 100 67 121 111 48 246 78 249 80 195 149 76 110 143 124 127 163 181 265 215 41 185 224 46 104 292 158
3987 158 137 198 113 146 169 110 129 75 157 97 203 83 94 55 198 294 146 34 144 73 57 55 30 80 17 186 97 209 160 191 136
3623 136 96 75 207 141 22 52 154 63 218 228 75 121 112 64 44 180 163 169 50 115 133 52 113 175 185 158 240 132 81 170 217 63
3247 63 42 112 128 154 106 139 122 160 65 133 91 90 74 135 200 129 5 40 180 149 110 67 19 219 231 819 643 73 227 95 79 132
$$ packed form
5806B55r6J6L6m4k1q5l6J23J68j27j30J8k1J22K4N0p4j52N2J22l3j20l0R5J42pm3r4n0m1N7
5442G6rK8J05j55K60j28j49N8J27O4o8K0n6r1l1P2k1k4JO9k0n8rQ3J61l5j08J9R8j14R3j52
5067A06m8L4M6o3J81m0j09N4n8j9L0L2J95j72r6J7J16Q2q0p4L1q0J47k8j96J32j4lQ5K1j86
4703D3J30J08j64J1j0L2n1o0QN7J46k07K19j66R9j77QJ34o4o1J59ro2l1K4K5j7P5j49j2J13
4339A51K3R1k5j40l3N4j0o3J98j68J71j69J15m6p3L4L3j9LL6J8Q4n0j74J44L9j78N8J88j34
3987A58k1O1q5L3K3n9J9n4Q2o0J06j20J1l9J43R6j48j12J10p1j6kk5N0o3J69q9J12m9L1n5
3623A36m0k1J32o6j19L0J02r1J55J0j53M6rm8k0J36j7Oj19O5J8q1O1O2J0k7Q2j08n1Q9M7j54
3247F3k1P0J6K6m8L3j7L8r5O8m2jj6O1O5p1j24L5J40l1l9m3m8K00J2N88j76n70J54j32j6N3
$$ plain form
2872 132 80 214 124 231 138 218 264 137 181 49 144 108 102 148 138 192 185 302 115 81 131 204 141 146 39 107 10 206 179 127 88 132
2496 132 306 145 163 205 169 232 112 114 265 194 132 173 160 49 104 137 85 299 231 138 209 55 92 49 115 89 224 194 72 201
2144 201 87 91 270 161 191 65 63 74 184 128 126 172 160 666 1733 1183 275 109 124 87 102 110 86 233 230 164 109 207 203 115 177 49
1768 49 73 152 94 186 231 101 62 71 90 68 36 52 184 96 81 155 56 265 290 83 259 201 48 80 163 241 121 61 57 63 103 90 213
1381 213 220 61 53 79 123 104 115 57 188 25 149 135 193 72 206 81 248 26 158 110 76 130 37 20 145 218 306 36 336
1041 336 321 217 124 151 107 274 213 50 271 218 162 57 141 195 167 367 162 110 103 190 225 222 172 145 144 149 107 54 30 94 119 107 204
653 204 161 52 17 153 56 139 162 289 77 99 52 227 203 168 172 122 135 119 78 119 58 208 61 84 128 33 115 177 138 79 144 83
278 83 82 87 94 123 120 91 274 257 212 113 114 169 103 95 182 211 183 191 160 125 161 123 28 76 76 78 110 157 36 36 141 104 225 237 245 253 12 125 98
$$ packed form
2872A32n2J34r0J07r3Q0M6j27M4j32R5l6oM6j0N4pJ17j87l4N0P3o3Nj07O8r7J96k7n2l9M4
2496A32J74j61J8M2l6O3j20KJ51p1o2M1j3j11N5L3n2K14o8r3P1j54L7m3O6k6J35l0j22J29
2144B01j14MJ79j09L0j26kJ1J10n6kM6j2N06J067n50r08j66J5l7J5Qk4J47lo6n5R8mq8O2j28
1768D9K4P9n8R2M5j30l9RJ9k2l2J6J32q8j5P4r9K09K5k07J76n8j53L2Q3P8j20o0mOM0j3J23
1381B13Pj59qK6M4j9J1n8J31j63J24j4N8j21J34j25J67k22J32m8l4N4r3j7J25P3Q8k70L00
1041C36j5j04r3K7m4J67o1j63K21n3n6j05Q4N4k8K00k05n2pQ7L5ln0k7jNm2n3k4O4K5j2R7
653B04m3j09l5J36r7Q3K3J27k12K2m7J75k4l5Mn0J3j6m1M1o1J50j47K3M4r5Q2O2l9n9O5o1
278H3jNPK9lk9J83j7m5r9JN5o6qQ7K9k8Ql1l5L6l8r5M8%KL2M7j21%J05l7J21J2QQk41J13k7
$$ plain form
-180 98 183
$$ packed form
-180I8Q5
-192A83
##PAGE=	F1=7678.67
##FIRST=	25164.767445380970457,	5806.2096540000038658,	0.22526638209819793701
##DATA TABLE=	(F2++(Y..Y)), PROFILE
$$ plain form
5806 247 162 184 218 168 172 22 10 180 292 151 60 98 20 168 117 284 211 35 69 168 169 55 77 115 251 274 236 123 75 11 118
5442 118 38 144 190 72 285 146 20 85 215 248 138 201 142 112 53 70 97 69 111 79 143 68 107 121 308 327 142 161 271 198
5090 198 240 72 79 120 138 54 251 240 83 107 143 76 79 162 362 132 106 92 149 242 195 119 118 49 206 259 50 150 119 116 168 200 40
4703 40 168 249 153 146 106 144 67 68 47 129 223 75 307 131 216 71 60 160 92 51 191 173 183 98 171 152 181 209 69 74 196 186
4327 186 256 201 34 44 133 109 43 210 111 340 136 195 150 110 128 156 130 183 158 183 225 217 51 114 202 32 80 264 165 98 179 125
3952 125 152 185 107 142 94 188 92 224 95 80 33 183 314 193 17 149 79 40 37 62 82 23 121 84 162 164 200 163 146 57 184 160
3576 160 38 53 127 95 251 259 86 107 83 26 36 142 141 123 63 100 90 46 102 183 195 150 227 89 66 160 196 41 97 122 133 151 110
3189 110 160 113 216 45 175 36 95 53 126 160 132 58 29 212 99 175 19 75 178 174 654 526 64 160 106 108 118 160 258 104
$$ packed form
5806B47q5K2L4n0Mj50j2J70J12j41r1L8p8J48n1J67p3j76L4R9Jj14K2L8J36K3l8j13m8o4J07
5442A18q0J06M6j18K13j39j26O5J30L3j10O3n9l0n9J7K7k8M2l2O4p5L9J4J87J9j85J9J10p3
5090A98M2j68PM1J8q4J97j1j57K4L6o7LQ3K00k30k6j4N7R3m7p6jo9J57N3k09J00l1lN2L2j60
4703D0J28Q1r6pm0L8p7Jk1Q2R4j48K32j76Q5j45j1J00o8m1J40j8J0q5P3j9K9K8j40NJ22j0
4327A86P0n5j67J0Q9k4o6J67r9K29k04N9m5m0J8K8k6N3k5K5M2qj66O3Q8j70M8J84r9o7Q1n4
3952A25K7L3p8L5m8R4r6J32j29j5m7J50J31j21j76J32p0l9lK5K0n9R8l7P8KL6l7j7q9J27k4
3576A60j22J5P4l2J56Qj73K1k4n7J0J06jj8o0L7j0m4N6Q1J2m5P7j38k3R4L6j55N6K5J1J8m1
3189A10N0m7J03j71J30j39N9m2P3L4k8p4k9J83j13P6j56N6J03mM80j28m62R6n4KJ0M2R8j54
$$ plain form
2837 104 203 131 215 237 113 153 12 185 69 76 109 127 163 135 312 126 27 165 204 118 118 34 106 33 187 120 112 113 125 322 129 158
2461 158 192 196 218 104 123 247 166 155 190 167 88 120 130 111 260 192 140 206 72 101 90 150 92 231 178 82 218 84 72 285 194
2097 194 160 86 103 52 137 121 120 192 126 543 1376 948 290 68 106 59 90 108 86 230 259 245 145 158 168 130 135 46 94 133 39 156
1722 156 197 92 44 119 129 94 58 41 196 112 85 154 95 229 212 51 266 149 24 185 143 127 112 77 85 84 108 37 200 218 41
1358 41 49 61 113 128 146 64 139 10 120 51 111 74 199 111 239 86 98 126 44 115 36 25 160 226 296 15 305 322 226 121 124 115
982 115 270 219 75 272 181 105 56 103 174 152 346 175 95 105 190 203 186 232 220 211 188 179 101 19 61 117 79 208 168 89 66 173 54
595 54 159 147 275 85 89 87 177 140 157 139 117 140 160 106 110 69 196 90 78 113 19 131 168 163 80 134 114 149 132 116 94 109 191 351
196 351 270 182 87 98 136 81 101 152 178 163 240 148 150 164 137 15 36 39 34 101 109 32 50 66 53 188 241 170 181 37 100 58 197
$$ packed form
2837A04R9p2Q4K2j24M0j41J73j16PL3J8L6k8J77j86r9J38L9q6%q4P2p3J54o7qJJ2J97j93K9
2461A58L4MK2j14J9J24q1j1L5k3p9L2J0j9J49o8n2O6j34K9j1O0n8J39n3r6J36j34j2K13r1
2097A94l4p4J7n1Q5j6jP2o6M17Q33m28o58k22L8m7L1J8k2J44K9j4j00J3J0l8Nq9M8L9r4J17
1722A56M1j05m8P5J0l5l6j7J55q4k7O9n9J34j7j61K15j17j25J61m2j6j5l5QjK4p1J63J8j77
1358D1QJ2N2J5J8q2P5j29J10o9O0l7J25q8J28j53J2K8q2P1p9j1J35O6P0k81K90J7r6j05Lr
982A15J55n1j44J97r1p6m9M7P1k2J94j71q0J0Q5J3j7M6j2rk3rp8q2M2N6l8J29m0p9k3J07j19
595E4J05j2J28j90MkR0l7J7j8k2K3K0n4Mm1J27j06j2L5r4J12L7nq3N4k0L5j7j6k2J5Q2J60
196C51q1q8r5J1L8n5K0N1K6j5P7r2KJ4k7j22K1LnO7Qp7J8J6j3J35N3p1J1j44O3m2J39
-192A97
##PAGE=	F1=7576.42
##FIRST=	25164.767445380970457,	5806.2096540000038658,	0.19494308531284332275
##DATA TABLE=	(F2++(Y..Y)), PROFILE
$$ plain form
5806 226 145 165 200 181 206 21 25 209 268 129 48 122 11 169 31 296 235 52 43 130 162 86 127 128 232 290 251 117 89 15 147
5442 147 11 185 190 90 257 110 62 101 209 184 60 173 110 129 123 80 95 85 155 13 170 85 151 157 289 358 113 148 251 227
5090 227 200 39 101 154 130 57 224 229 68 64 166 76 41 199 364 94 143 124 86 200 181 108 57 34 185 293 121 140 104 135
4738 135 109 177 75 156 225 188 164 104 154 36 81 53 159 173 122 329 153 238 162 89 160 95 72 165 168 237 133 208 148 236 179 105
4362 105 108 200 179 219 149 15 35 128 88 44 162 152 380 204 193 145 133 136 163 141 228 129 180 190 212 82 37 157 16 73 201 172
3987 172 63 145 137 153 182 108 152 131 208 83 226 116 60 33 175 305 213 57 142 114 23 21 93 121 46 54 68 97 142 195 189 186 57
3600 57 143 166 80 62 95 111 269 268 92 92 48 10 46 90 106 62 65 93 52 46 82 179 194 131 195 47 55 149 162 104 158 130 131 155 113 171 98
3165 98 252 54 217 61 113 51 101 102 148 101 86 250 47 226 29 126 122 134 456 360 35 92 123 130 181 285 305 101 174 115 198
$$ packed form
5806B26q1K0L5j9K5j85MJ84N9j39q1P4j11J58j38K65o1j83rQ7L2p6M1JJ04N8l9j34k8p4J32
5442A47j36J74Nj00J67j47m8L9J08k5j24J13o3J9om3J5j0P0j42J57q5O6OJ32O9k45L5J03k4
5090B27k7j61O2N3k4p3J67Nj61mJ02r0l5J58J65k70M9j9l8J14j9p3n1k3J51J08j72J9l6L1
4738A35k6O8j02Q1O9l7k4o0N0j18M5k8J06J4n1K07j76Q5p6p3P1o5k3R3LO9j04P5o0Q8n7p4
4362A05LR2k1M0p0j34K0R3m0m4J18j0K28j76j1m8j2LK7k2Q7r9N1J0K2j30m5J20j41N7J28k9
3987A72j09Q2qJ6K9p4M4k1P7j25J43j10n6k7J42J30r2j56Q5k8r1kP2K8p5QJ4K9M5N3olj29
3600E7Q6K3q6j8L3J6J58jj76%m4l8L6M4J6m4LK8m1oL6R7J5o3O4j48QR4J3n8N4k8JK4m2N8p3
3165I8J54j98J63j56N2o2N0JM6m7j5J64k03J79j97R7mJ2L22r6l25N7L1PN1J04K0k04P3n9Q3
$$ plain form
2801 198 206 88 107 25 224 70 97 61 138 152 56 267 124 59 188 167 76 79 58 85 48 162 69 138 166 124 334 107 148 183 219
2438 219 189 101 132 202 118 187 205 185 132 138 115 146 215 146 136 193 83 106 137 177 89 232 157 98 228 67 50 265 208 114 92 124 118
2050 118 140 101 122 179 111 400 940 672 306 92 73 27 77 88 64 193 283 318 160 89 124 136 98 54 102 103 18 112 139 98 74 171
1675 171 175 91 102 55 198 123 86 150 144 186 151 26 244 125 86 398 414 106 85 99 124 88 112 67 170 207 52 44 39 92 131 153 55
1287 55 80 15 104 61 31 95 192 124 222 135 79 136 41 92 43 23 149 217 280 24 263 287 226 119 87 117 234 207 95 249 139
923 139 57 35 87 153 153 307 182 80 99 176 171 131 271 288 281 208 239 184 39 27 136 60 205 154 125 117 178 59 160 118 234 76
548 76 85 125 134 68 146 92 120 165 199 136 99 69 166 98 80 101 75 140 165 179 99 118 125 180 166 138 70 91 263 388 256 163 68 77 92 39
125 39 112 106 133 174 271 144 176 149 146 34 22 38 17 104 75 42 98 21 53 138 227 95 93 64 49 20 190
$$ packed form
2801A98Qj18J9q2J99j54K7l6P7J4r6K11j43o5J29k1r1Lk1K7l7J14r3O9K8m2K10k27M1L5L6
2438B19l0q8L1P0q4O9J8k0n3Ok3L1O9o9j0N7j10K3L1M0q8J43p5n9J30j61j7K15n7r4k2L2o
2050A18K2l9K1N7o8K89N40k68l66k14j9m6N0J1k4J29R0L5j58p1L5J2l8m4M8Jq5R4K7m1k4R7
1675A71Mq4J1m7J43p5l7O4oM2l5j25K18j19l9L12J6l08k1J4K5l6K4m5J03L7j55qnN3L9K2r8
1287E5K5o5Q9m3l0O4R7o8R8q7n6N7r5N1m9k0J26O8O3k56K39K4o1j07l2L0J17k7j12J54j10
923A39q2k2N2O6%J54j25j02J9P7nm0J40J7pp3L1n5j45j2J09p6J45n1k9qO1j19J01m2J16j58
548G6RM0Ro6P8n4K8M5L4o3l7l0R7o8j8K1k6O5K5J4q0J9PN5j4k8o8K1J72J25j32r3r5RJ5n3
125C9P3oK7M1R7j27L2k7lj12j2J6k1Q7k9l3N6p7L2Q5Q9j32kk9j5k9J70
-192A90
##PAGE=	F1=7474.16
##FIRST=	25164.767445380970457,	5806.2096540000038658,	0.29614201188087463379
##DATA TABLE=	(F2++(Y..Y)), PROFILE
$$ plain form
5806 192 114 122 168 208 231 35 39 219 241 130 29 121 14 178 51 283 246 91 29 105 153 126 155 137 205 291 243 98 113 65 166
5442 166 13 218 206 99 226 79 104 121 204 116 44 152 84 135 178 112 102 126 207 83 198 114 188 209 253 364 93 154 218 247
5090 247 154 27 119 176 117 65 170 193 74 35 169 100 36 246 345 61 173 173 46 174 167 96 8 99 169 299 196 124 97 160
4738 160 57 176 105 146 218 212 179 107 181 18 67 101 176 103 179 324 153 262 248 117 173 107 85 125 163 269 162 212 131 276
4386 276 121 145 119 167 164 157 93 43 40 107 60 40 110 183 367 262 200 131 141 125 155 138 257 83 178 161 194 122 68 96 11 92 121 164
3987 164 30 104 149 147 159 111 163 174 218 79 211 145 51 11 179 267 198 85 125 149 7 5 115 173 86 50 54 55 95 183 204 201 82
3600 82 84 147 96 73 57 104 275 251 98 78 13 32 57 55 87 3 56 83 37 52 60 171 178 105 163 74 46 141 125 159 197 127 127 174 128 171
3177 171 88 262 69 238 113 128 68 75 51 146 122 127 281 16 253 72 161 62 138 281 183 10 77 138 148 216 325 342 119 143
$$ packed form
5806A92p8QM6M0K3j96MJ80K2j11j01R2j07J64j27K32l7j55o2P6M8k7K9j8O8Q6m8j45J5m8J01
5442A66j53K05j2j07J27j47K5J7Q3q8p2J08o8N1M3o6j0K4Q1j24J15q4P4K1M4J11k71O1O4K9
5090B47r3j27R2N7n9n2J05K3j19l9J34o9o4K10R9k84J12%j27J28pp1q8R1P0J30j03p2k7O3
4738A60j03J19p1M1P2ol3p2P4j63M9L4P5p3P6J45j71J09j4j31N6o6k2M0L8J06j07N0q1J45
4386B76j55K4k6M8lpo4n0lO7m7k0P0P3J84j05o2o9J0j6L0j7J19j74R5j7L3p2n4K8q5Q1K9M3
3987A64j34P4M5kJ2m8N2J1M4j39J32o6r4m0J68Q8o9j13M0K4j42kJ10N8q7l6MJM0Q8K1lj19
3600H2KO3n1k3j6M7J71k4j53k0o5J9K5kL2q4N3K7m6J5QJ11Pp3N8q9k8R5j6L4L8p0%M7m6M3
3177A71q3J74j93J69j25J5o0Pk4R5k4NJ54k65K37j81Q9r9P6J43r8j73O7O1J0O8J09J7k23K4
$$ plain form
2825 143 88 163 170 78 52 51 258 108 133 18 142 164 39 177 99 119 203 100 64 37 94 53 54 139 80 189 218 131 340 89 138
2461 138 182 236 154 110 137 137 77 207 197 204 172 159 100 183 183 100 123 170 79 102 177 187 78 214 125 114 222 52 39 211 198 64 78
2074 78 117 182 198 80 122 139 130 280 534 423 318 144 33 44 83 55 36 132 306 373 159 29 78 130 78 47 95 73 57 61 64 142
1698 142 113 207 204 64 142 80 193 125 85 139 174 150 122 54 216 177 108 404 458 160 37 111 169 72 108 123 152 199 69 45 53 73
1322 73 113 131 17 24 38 107 143 56 118 184 122 202 156 92 139 68 66 50 11 116 194 268 32 224 229 215 115 62 111 174 180 106 206 116
923 116 102 18 116 167 192 263 192 82 84 150 150 71 276 331 333 199 273 250 45 14 153 52 199 125 148 153 172 85 142 83 174 53 94
536 94 157 113 7 142 39 125 191 231 163 88 59 129 97 90 104 134 151 169 184 112 98 109 167 181 154 51 84 292 374 212 153 68 56
149 56 77 23 121 47 83 188 280 140 193 123 140 54 66 85 28 115 72 42 134 72 113 86 199 47 10 95 58 61 165
$$ packed form
2825A43n5P5Pr2k6jK07j50K5j15J24K2j25J38p8K0Q4j03l6k7N7m1JQ5n9J09K9q7K09k51M9
2461A38M4N4q2m4K7%o0J30j0Pl2j3n9Q3%q3K3M7r1K3P5J0j09J36q9j1J08j70j3J72j3j34J4
2074G8L9O5J6j18M2J7rJ50K54j11j05j74j11J1L9k8j9R6J74O7k14j30M9N2n2l1M8k2j6MLP8
1698A42k9R4lj40P8o2J13o8m0N4L5k4k8o8J62l9o9K96N4k98j23P4N8r7L6J5K9M7j30k4QK0
1322G3M0J8j14PJ4O9L6q7O2O6o2Q0m6o4M7p1kj6l9J05P8P4k36J92Nj4j00n3M9O3Op4J00r0
923A16j4q4R8N1K5P1p1j10KO6%p9K05N5Kj34P4k3k05l1J39j01J47p4K3NJ9q7N7n9R1j21M1
536I4O3m4j06J35j03Q6O6M0o8p5k9P0l2pJ4L0J7J8J5p2j4J1N8J4k7j03L3K08Q2j62n9q5j2
149E6K1n4R8p4L6J05R2j40N3p0J7q6J2J9n7Q7m3l0R2o2M1k7J13j52l7Q5l7LJ04
-192A65
##PAGE=	F1=7371.9
##FIRST=	25164.767445380970457,	5806.2096540000038658,	0.36139908432960510254
##DATA TABLE=	(F2++(Y..Y)), PROFILE
$$ plain form
5806 152 82 72 137 233 236 43 48 209 206 143 35 98 6 186 112 247 239 130 47 98 143 159 155 135 176 277 212 85 161 148 182 35 240
5419 240 232 101 195 60 132 140 202 123 95 144 71 132 212 133 120 180 259 146 217 152 212 242 205 350 87 165 170 253 116 33 129 178 100
5032 100 78 102 157 89 28 159 134 61 291 306 48 185 213 44 173 154 74 69 193 161 274 257 127 108 175 64 188 122 142 228
4679 228 219 190 113 210 53 29 169 176 22 234 295 129 284 319 139 196 123 93 82 145 268 169 178 107 291 61 173 112 109 152 81
4316 81 42 51 48 73 40 39 62 198 310 294 211 114 138 99 128 124 269 30 186 136 161 163 148 38 35 124 75 136 37 67 157 133 121 112 177 206
3893 206 218 86 184 179 80 37 192 200 144 94 101 172 4 6 130 218 122 95 43 102 38 170 196 182 116 25 105 83 76 50 73 271 211 102
3494 102 68 16 45 61 67 119 59 47 60 63 64 35 167 147 76 142 122 33 141 95 198 216 116 126 202 158 161 101 246 85 231 155 132
3107 132 90 65 68 122 115 139 297 39 250 108 177 14 171 190 29 62 124 140 173 146 222 354 150 111 52 114 133 96 26 58 280
$$ packed form
5806A52p0j0O5R6Lj93NJ61lo3j08O3r2J80p4J35qj09q3N1M5J6mk0M1J01o5j27P6j3L4j47K05
5419B40qj31R4j35P2QO2p9k8M9p3O1Q0p9j3O0P9j13P1o5O0L0l7J45k63P8NQ3j37q3R6M9p8
5032A00k2K4N5o8o1J31k5p3K30J5k58J37K8j69J29j9q0nJ24l2J13j7j30j9O7j11J24o6K0Q6
4679B28rk9p7R7j57k4J40Pj54K12O1j66J55L5j80N7p3l0j1O3J23r9Rp1J84k30J12o1lM3p1
4316H1l9RlK5l3jK3J36J12j6q3r7K4l9K9mJ45k39J56n0K5Kj5j10lQ9m9O1r9L0R0k4j2rO5K9
3893B06J2j32R8nr9m3J55Qn6n0PP1j68KJ24Q8r6k7n2N9o4J32K6j4o6r1Q0k2pk6K3J98o0j09
3494A02l4n2K9J6ON2o0j2J3LJk9J32k0p1O6k0q9J08m6J03J8j00J0P6m4Lo0J45j61J46p6k3
3107A32m2k5LN4pK4J58k58K11j42O9j63J57J9j61L3O2J6L3k7P6J32k04l9n9O2J9l7p0L2K22
$$ plain form
2743 280 149 159 45 127 161 82 64 54 164 213 32 114 11 119 31 58 126 110 224 249 142 344 94 135 188 246 121 123 131 62
2391 62 103 205 165 210 212 183 96 210 173 59 106 145 57 88 200 179 57 172 80 120 197 71 52 133 167 28 47 86 219 259 71
2027 71 110 88 155 216 263 257 320 184 8 90 115 27 48 63 324 399 156 60 35 111 64 19 77 55 88 24 22 191 133 215 202 26 173
1639 173 100 182 116 88 116 176 125 105 99 234 241 116 75 149 171 35 106 209 66 93 154 173 206 74 50 87 83 79 85 52 26 50 116 202
1240 202 116 126 172 111 182 147 89 138 93 48 51 18 88 162 268 37 194 172 196 112 64 95 97 142 107 152 115 161 47 154 211 245 219
853 219 205 109 68 121 155 18 242 333 352 169 272 283 35 46 148 47 186 91 156 171 166 121 108 66 105 48 116 177 116 75 147 9
477 9 124 206 252 182 78 42 106 108 102 119 180 163 179 176 111 78 68 118 173 164 44 101 277 309 143 148 84 45 117 88 125 37 53 181 266 123
55 123 199 114 118 74 102 133 27 126 81 36 151 126 180 45 164 47 62 131 145 108 135
$$ packed form
2743B80j31J0j14Q2L4p9j8j0J10M9j81Q2j03J08q8K7O8j6J14K5j07K02k50M1N3N8j25KQo9
2391F2M1J02m0M5Kk9q7J14l7j14M7L9q8L1J12k1j22J15r2M0P7j26j9Q1L4j39J9L9J33M0j88
2027G1L9k2O7O1M7oO3j36j76Q2K5q8K1J5K61P5k43r6k5P6m7m5N8k2L3o4kJ69n8Q2j3j76J47
1639A73p3Q2o6k8K8O0n1k0oJ35Pj25m1P4K2j36P1J03j43K7O1J9L3j32k4L7mmOl3k6K4O6Q6
1240B02q6J0M6o1P1l5n8M9m5m5Ll3P0P4J06k31J57k2K4q4m8L1KM5l5M5l7M6j14J07N7L4k6
853B19j4r6m1N3L4j37K24R1J9j83J03J1k48J1J02j01J39r5O5J5nm5j3m2L9n7O8O1o1m1P2j38
477IJ15Q2M6p0j04l6O4KoJ7O1j7J6lo5l3j0N0N5rj20N7J76L2j66No4l9P2k9L7q8J6J28Q5j43
55A23P6q5Mm4K8L1j06R9m5m5J15k5N4j35J19j17J5O9J4l7K7
-192A35
##PAGE=	F1=7269.64
##FIRST=	25164.767445380970457,	5806.2096540000038658,	0.32776600122451782227
##DATA TABLE=	(F2++(Y..Y)), PROFILE
$$ plain form
5806 117 70 54 113 241 225 48 51 185 169 150 70 78 23 182 149 196 213 150 57 91 127 172 130 126 155 251 166 95 225 241 193 55 248
5419 248 260 98 167 50 137 155 203 186 119 151 79 120 225 141 143 236 302 184 221 195 220 244 154 326 84 163 110 241 93 33 130
5055 130 163 83 99 62 146 94 59 145 158 77 316 258 58 175 223 32 198 144 39 119 284 162 224 291 154 122 177 96 195 123
4703 123 146 249 208 195 122 226 99 40 233 162 59 272 249 93 300 366 143 213 138 98 49 105 230 152 117 95 279 56 177
4362 177 102 52 144 24 36 45 51 37 39 62 26 196 225 293 214 123 134 73 94 116 262 30 206 113 115 193 216 38 59 154 118 92 72 44
3963 44 158 115 79 108 189 214 206 105 158 212 126 94 204 113 59 84 71 178 5 7 143 247 142 123 42 159 62 156 162 133 148 72
3588 72 62 60 66 96 33 258 157 104 66 43 56 52 91 176 104 60 24 100 81 26 169 108 51 126 145 24 148 76 225 225 108 126 230
3200 230 198 147 132 213 103 199 187 125 108 67 108 111 96 117 295 57 219 135 184 47 204 186 88 110 166 122 209 269 307 351 187 83
$$ packed form
5806A17m7j6N9J28j6j77LJ34j6j9q0Qn5J59l3M7J7o3r3L4L6M5m2mK9R6q5p1J30J6m8j38J93
5419B48J2j62O9j17Q7J8M8j7o7L2p2M1J05q4KR3O6j18L7k6K5K4r0J72k42P9n3J31j48o0R7
5055A30L3q0J6l7Q4n2l5Q6J3q1K39n8k00J17M8j91J66n4j05Q0J65j22O2O7j37l2N5q1R9p2
4703A23K3J03m1j3p3J04j27n9J93p1j03K13k3j56K07O6k23P0p5m0m9N6J25p8l5k2J84k23J21
4362A77p5n0R2j20J2ROj4KK3l6J70K9O8p9r1J1o1K1K2J46k32J76r3KP8K3j78K1R5l6k6k0k8
3963D4J14m3l6K9Q1K5qj01N3N4q6l2J10r1n4K5j3J07j73KJ36J04j05j9q1J17r7R4Ok9J5p6
3588G2j0kOL0o3K25j01n3l8k3J3mL9Q5p2m4l6P6j9n5J43o1n7P5J9j21J24p2J49%j17J8J04
3200B30l2n1j5Q1j10R6j2o2j7m1M1Lj5K1J78k38J62q4M9j37J57j8r8K2N6m4Q7O0L8M4j64j04
$$ plain form
2825 83 32 76 101 133 75 47 285 181 167 87 96 121 145 98 28 187 214 78 168 49 118 39 71 127 109 216 254 157 343 119 142 199
2449 199 245 96 132 119 28 167 180 131 195 256 202 104 214 175 23 92 135 47 63 201 159 23 112 27 111 154 108 70 54 121 38 4
2074 4 56 226 295 69 92 59 166 200 190 169 307 201 46 130 153 33 84 20 326 385 159 100 44 80 37 30 54 60 121 50 79 211
1698 211 133 191 166 26 197 107 162 91 113 99 164 107 74 142 311 273 257 859 877 236 136 107 236 120 74 152 222 223 70 63 115
1334 115 117 48 35 145 57 45 122 225 153 113 153 93 170 111 54 135 107 53 46 50 113 126 286 43 171 133 175 109 73 73 28 105 101 97 120
923 120 194 76 176 251 286 177 216 141 67 107 168 24 171 291 327 131 237 280 31 77 117 41 161 61 146 175 164 155 62 82
571 82 36 97 140 184 128 124 148 38 115 201 257 190 67 34 117 134 114 133 201 167 189 154 95 71 42 63 145 169 61 130 225 207 57 150
172 150 108 62 164 149 122 99 69 151 233 88 196 147 89 96 120 166 18 136 87 33 150 176 241 46 131 45 103 165 229 138 117
$$ packed form
2825H3n1M4K5L2n8k8K38j04j4q0RK5K4m7p0J59K7j36R0j19O9p9L2N6j8J07L8r7J86k24K3N7
2449A99M6j49L6j3r1J39J3m9O4O1n4r8J10l9j52O9M3q8J6J38m2j36Q9q5Q4M3m6l8j6O7q3l4
2074DN2J70O9k26K3l3J07L4j0k1J38j06j55Q4K3j20N1o4L06N9k26n9n6L6m3pK4OO1p1K9J32
1698B11p8N8k5j40J71r0N5p1K2j4O5n7l3O8J69l8j6O02J8o41j00k9J29j16m6P8P0Jj53pN2
1334A15Ko9j3J10q8j2P7J03p2m0M0o0P7n9n7Q1k8n4pMO3J3J60k43J28l8M2o6l6%m5P7mmK3
923A20P4j18J00P5L5j09L9p5p4M0O1j44J47J20L6j96J06M3k49M6M0p6J20j00Q5K9j1rr3K0
571H2m6O1M3M4n6mK4j10P7Q6N6o7j23l3Q3J7k0J9O8l4K2l5n9k4k9K1Q2K4j08O9R5j8j50R3
172A50m2m6J02j5k7k3l0Q2Q2j45J08m9n8PK4M6j48J18m9n4J17K6O5j95Q5q6N8O2O4r1k1
-192A17
##PAGE=	F1=7167.39
##FIRST=	25164.767445380970457,	5806.2096540000038658,	0.26393520832061767578
##DATA TABLE=	(F2++(Y..Y)), PROFILE
$$ plain form
5806 99 81 75 87 222 209 61 49 158 148 146 106 93 48 160 162 140 168 141 46 70 103 157 86 113 148 216 121 121 282 317 190 79 238
5419 238 274 93 146 38 119 162 200 231 107 165 113 102 220 144 162 283 327 198 212 235 213 221 106 298 81 140 40 210 85
5078 85 31 124 139 72 128 97 157 84 113 147 162 82 307 211 73 147 197 28 242 134 23 157 347 172 160 290 184 126 168 110
4726 110 185 111 160 275 182 196 138 223 143 105 278 142 129 282 196 76 305 390 120 214 150 99 39 47 164 117 60 114 244 94
4374 94 154 100 49 134 80 64 35 40 37 64 108 21 180 131 256 201 167 134 64 79 124 234 67 229 91 62 209 262 65 71 173 172 45
3987 45 95 31 149 100 49 99 197 198 180 132 153 238 167 143 203 41 43 55 39 165 6 15 163 253 135 132 62 189 122 131 128 94 177 138 84
3576 84 82 42 147 26 236 110 103 70 71 74 33 109 227 136 94 23 132 98 70 170 73 42 101 131 38 152 68 243 234 113 119 248 236
3189 236 133 160 175 121 157 212 111 113 60 131 155 111 80 279 65 166 154 195 88 228 196 153 146 178 85 254 743 855 384 223
$$ packed form
5806I9j8oJ2J35j3j48j2J09j0km0j3m5J12Kk2K8k7r5K4L3N4p1K7L5O8r5%J61L5j27j11J59
5419B38L6j81N3j08Q1M3L8L1j24N8n2j1J18p6J8J21M4j29J4K3k2Qj15J92k17N9j00J70j25
5078H5n4R3J5o7N6l1O0p3K9L4J5q0K25r6j38P4N0j69K14j08j11J34J90j75j2J30j06n8M2n8
4726A10P5p4M9J15r3J4n8Q5q0l8J73j36j3J53q6j20K29Q5k70R4o4n1o0QJ17m7n7N4J30j50
4374I4O0n4n1Q5n4j6k9NlK7M4q7J59m9J25n5l4l3p0J5M5J10j67J62j38k9J47N3j97OJ02jj27
3987D5N0o4J18m9n1N0R8Jj8m8K1Q5p1k4O0j62KJ2j6J26j59RJ48R0j18lp0J27o7Rll4Q3l9n4
3576H4km0J05j21K10j26pl3JLm1P6J18r1m2p1J09l4k8J00r7l1N9L0r3J14q4J75rj21OJ29j2
3189B36j03K7J5n4L6N5j01Kn3P1K4m4l1J99k14J01j2M1j07J40l2m3pL2r3J69M89J12m71j61
$$ plain form
2837 223 65 69 104 74 181 116 38 271 204 158 121 66 87 306 243 68 185 202 142 200 93 89 50 95 132 65 164 230 179 333 145
2473 145 158 209 231 78 130 116 84 223 138 137 160 307 210 113 190 176 9 84 150 99 31 182 134 23 44 30 91 107 142 79 16 74
2097 74 71 44 75 208 297 61 82 76 160 196 168 92 280 190 89 149 176 43 111 45 306 328 158 121 91 39 19 84 33 79 163 79 108
1710 108 185 132 140 98 65 213 102 130 53 166 110 161 112 23 182 410 282 526 2179 2272 486 266 157 248 202 70 123 273
1381 273 239 73 91 134 154 56 63 248 81 19 125 210 162 82 133 71 178 61 30 131 110 83 47 82 163 98 317 56 146 107 157
1017 157 106 74 61 74 89 90 50 121 196 90 177 263 300 132 220 162 83 117 170 50 74 212 258 95 176 247 60 100 71 41 118 38
642 38 116 173 164 182 15 117 39 165 159 179 135 145 132 56 97 177 247 188 51 51 142 162 123 135 195 155 194 118 70 81 97 76 113 169 96
231 96 154 153 92 29 165 134 97 196 191 116 150 102 108 190 46 193 198 73 118 118 172 41 155 87 32 136 219 283 86 102 22 112 189 288
$$ packed form
2837B23j58ML5l0J07o5p8K33o7m6l7n5K1K19o3j75J17J7o0N8j07ml9M5L7o7R9O6n1J54j88
2473A45J3N1K2j53N2j4l2J39q5jK3J47r7r7P7j4j67P5O6n1o8J51m8j11K1j4O1J6L5o3o3N8
2097G4lk7L1J33Q9k36K1oQ4L6k8p6J88r0j01O0K7j33O8o6K61K2j70l7l0n2k0O5n1M6Q4q4K9
1710A08P7n3Qm2l3J48j11K8p7J13n6N1m9q9J59K28j28K44J653R3j786k20j09R1m6j32N3J50
1381B73l4j66J8M3K0r8PJ85j67o2J06Q5m8q0N1o2J07j17l1J01k1k7l6L5Q1o5K19k61R0l9N0
1017A57n1l2j3J3J5Jm0P1P5j06Q7Q6L7j68Q8n8p9L4N3j20K4J38M6j63Q1P1j87M0k9l0P7q0
642C8P8N7rJ8j67J02p8J26oK0m4J0j3p6M1Q0P0n9j37%R1K0l9J2O0m0L9p6m8J1J6k1L7N6p3
231I6N8jo1o3J36l1l7R9np5L4m8OQ2j44J47Nj25M5%N4j31J14o8n5J04Q3O4j97J6q0R0P7R9
$$ plain form
-168 288 150 115
$$ packed form
-168B88j38l5
-192A15
##PAGE=	F1=7065.13
##FIRST=	25164.767445380970457,	5806.2096540000038658,	0.26460373401641845703
##DATA TABLE=	(F2++(Y..Y)), PROFILE
$$ plain form
5806 100 92 92 55 177 207 92 44 147 159 133 133 127 71 120 154 90 111 106 27 34 70 115 38 104 158 180 114 143 315 356 163 112 213 262 86
5395 86 137 17 85 163 189 234 65 177 161 78 202 148 170 309 329 192 195 269 200 184 65 270 87 102 39 169 102 42 119 120 84
5032 84 156 134 163 70 173 174 145 84 260 173 87 112 140 96 292 126 63 186 368 183 98 256 199 117 155 103 159 93 183 297 149
4668 149 192 165 202 173 166 296 126 179 259 152 108 295 389 83 194 161 96 48 49 89 82 74 149 194 118 109 109 68 114 131 82 31 13 74 115
4257 115 164 29 150 48 193 173 218 129 66 99 137 181 91 245 72 25 206 280 69 65 178 202 28 96 15 130 94 51 85 197
3905 197 168 143 160 182 252 186 167 182 109 145 14 22 136 22 43 191 236 104 132 98 186 161 86 152 137 203 189 141 143 22 183 48
3529 48 208 106 107 82 104 95 13 123 257 156 132 59 150 112 125 165 56 41 65 81 61 139 68 249 237 125 101 248 263 124 172
3165 172 149 131 119 227 97 100 37 134 223 171 93 258 74 102 166 216 123 241 190 176 172 156 50 309 1356 1561 499 256 59
$$ packed form
5806A00q%l7J22L0j15m8J03J2k6%on6M9L4o4K1np9PL6M5p7O6N4K2o6K9J72M1j93n1J01M9j76
5395H6N1j20O8P8K6M5j69J12j6q3J24n4K2J39K0j37LP4o9j6j19K05j83J5o3J30o7o0P7Jl6
5032H4P2k2K9r3J03Jk9o1J76q7q6K5K8m4J96j66o3J23J82j85q5J58n7q2L8n2N6o6R0J14j48
4668A49M3k7L7k9pJ30j70N3Q0j07m4J87R4l06J11l3o5m8JM0pqP5M5p6r%m1M6J7m9n1j8O1M1
4257A15M9j35J21j02J45k0M5q9o3L3L8M4r0J54j73m7J81P4k11mJ13K4j74O8q1J15l6m3L4J12
3905A97k9k5J7K2P0o6j9J5p3L6j31QJ14j14K1J48M5j32K8l4Q8k5p5O6j5O6j4m8Kj21J61j35
3529D8J60j02Jk5K2rq2J10J34j01k4p3R1l8J3M0j09j5K4J6k0P8p1J81j2j12k4J47J5j39M8
3165A72k3j8j2J08j30Lo3R7Q9n2p8J65j84K8O4N0r3J18n1j4mj6j06K59J047K05j062k43j97
$$ plain form
2825 59 122 162 42 241 138 66 242 213 137 150 64 168 548 398 96 165 176 183 205 140 64 52 120 130 15 82 185 206 312 157
2473 157 182 212 208 68 120 140 130 255 88 179 112 357 201 109 144 173 42 81 177 170 21 153 112 76 18 75 86 93 160 71 43 36 111
2085 111 91 113 176 266 42 94 100 149 184 95 9 242 161 139 141 170 36 125 54 268 232 146 131 130 6 77 134 17 106 209 93 98 110
1698 110 157 71 28 101 218 92 87 15 232 134 175 167 45 231 497 331 847 3756 3949 842 409 251 252 274 99 100 311 249
1369 249 93 132 154 179 83 117 343 115 27 129 163 141 61 124 52 214 40 98 131 111 127 66 106 198 101 353 78 116 73 149 94
1006 94 76 86 138 105 73 20 116 187 91 158 240 286 88 213 163 97 137 154 73 54 126 156 64 112 200 103 114 50 59 57 19 84 172 155 196
595 196 34 154 96 230 170 163 130 129 93 79 75 140 224 180 34 83 158 179 134 124 169 123 187 77 46 100 167 123 101 164 138 165 84 12
196 12 101 193 162 132 201 207 107 178 133 71 145 36 199 238 86 133 101 146 86 188 85 27 113 242 297 133 79 37 98 196 313 148
$$ packed form
2825E9O3M0j20J99j03p2J76k9p6J3q6J04L80j50l02O9J1PK2o5p6j2O8J0j15O7J03K1J06j55
2473A57K5L0mj40N2K0j0J25j67R1o7K45j56r2L5K9j31L9R6pj49J32m1l6n8N7J1PO7q9k8pP5
2085A11k0K2O3R0k24N2OM9L5q9q6K33q1k2KK9j34Q9p1K14l6q6j5jj24P1N7j17Q9J03j16NJ2
1698A10M7q6m3P3J17j26np2K17r8M1qj22J86K66j66N16K909J93l107m33j58JK2j75JK11o2
1369B49j56L9K2K5r6L4K26k28q8J02L4k2q0O3p2J62j74N8L3k0J6o1M0R2r7K52k75L8m3P6n5
1006I4j8J0N2l3l2n3R6P1r6O7Q2M6j98J25n0o6M0J7q1j9P2L0r2M8Q8r7J1o4Rkl8O5Q8j7M1
595A96j62J20n8J34o0pl3jl6j4mO5Q4m4j46M9P5K1m5j0M5m6O4j10l1N4O7m4k2O3k6K7q1p2
196A2Q9R2l1l0O9Oj00P1m5o2P4j09J63L9j52M7l2M5o0J02j03n8Q6J29N5j64n4m2O1R8J17j65
$$ plain form
-180 148 118
$$ packed form
-180A48l0
-192A18
##PAGE=	F1=6962.87
##FIRST=	25164.767445380970457,	5806.2096540000038658,	0.28469514846801757813
##DATA TABLE=	(F2++(Y..Y)), PROFILE
$$ plain form
5806 106 92 90 16 120 224 133 45 156 185 112 143 150 89 67 132 57 52 59 48 17 36 52 20 107 181 156 153 152 312 344 112 155 179 218 75
5395 75 136 19 52 162 170 197 41 185 206 61 174 152 161 307 306 176 178 293 190 148 34 240 98 71 114 134 147 63 124 118 116 173
5020 173 141 151 68 224 214 116 97 182 141 101 91 67 172 331 120 98 207 347 188 62 201 194 101 141 86 124 83 205 306 118
4668 118 181 204 174 181 208 287 118 203 208 135 158 267 363 86 155 170 90 61 119 61 67 108 176 141 122 62 132 62 86 156 82 51 38 110 176
4257 176 221 27 110 26 123 141 251 115 62 127 143 104 106 246 58 53 186 269 47 48 172 206 49 74 16 105 101 69 68 192 153 102
3881 102 180 236 260 176 162 136 191 228 32 31 97 41 80 224 201 57 134 138 153 171 39 226 217 227 220 185 204 53 202 50 187 137
3506 137 117 103 138 113 29 130 261 167 160 79 147 119 169 154 52 29 35 21 82 110 71 237 221 126 71 229 272 125 167 144 130 93 229
3118 229 94 71 13 121 276 241 162 237 94 37 172 236 150 245 175 170 197 102 76 369 1971 2257 656 284 64 178 212 25
$$ packed form
5806A06j4kp4J04J04r1q8J11K9p3L1Po1k2O5p5nPj1l1J9J6l2Q7P4k5ljJ60L2k32M3K4L9j43
5395G5O1j17L3J10QK7j56J44K1j45J13k2RJ46jj30KJ15j03m2j14K06j42k7M3K0J3q4O1okN7
5020A73l2J0q3J56j0r8j9Q5m1m0j0k4J05J59k11k2J09J40j59j26J39pr3M0n5L8m1J22J01j88
4668A18O3K3l0PK7P9j69Q5Np3K3J09R6k77O9J5q0k9N8n8OM1O8l5j9o0P0p0K4P0p4l1j3P2O6
4257A76M5j94Q3q4R7J8J10j36n3O5J6l9KJ40j88nJ33Q3k22JJ24L4j57K5n8Q9ml2jJ24l9n1
3881A02P8N6K4q4j4k6N5L7j96jO6n6L9J44k3j44P7MJ5J8j32J87rJ0pl5J9j51J49j52J37n0
3506A37k0j4L5k5q4J01J31r4pq1O8k8N0j5j02k3Oj4O1K8l9J66j6r5n5J58M3j47M2k3j4l7J36
3118B29j35k3n8J08J55l5p9P5j43n7J35O4q6R5p0nK7r5k6K93J602K86j601l72k20J14L4j87
$$ plain form
2790 25 305 140 108 211 205 108 172 77 288 809 541 92 134 144 197 188 186 98 48 135 114 107 63 128 234 284 150 208 201 181 68 106 178
2402 178 158 258 44 215 66 390 176 86 110 171 75 86 201 228 56 128 103 131 61 106 114 127 160 47 54 16 149 128 137 147 215
2038 215 18 113 110 148 168 47 121 207 140 196 106 136 25 129 48 226 119 131 135 147 48 141 165 13 136 244 96 55 16 194
1686 194 22 107 128 209 86 45 55 288 144 185 253 106 290 553 449 1145 5278 5571 1206 539 355 261 314 146 131 334
1381 334 252 117 172 179 187 99 157 416 165 84 135 97 95 92 133 64 269 87 165 139 113 178 97 116 203 139 382 102 95 31 148 71 104
994 104 129 182 135 54 25 103 196 93 127 184 249 46 199 145 98 151 124 97 153 91 40 39 82 163 146 117 85 94 20 15 103 172 129 199 69
583 69 183 147 282 177 139 112 79 51 121 57 102 192 165 33 118 156 178 154 112 132 70 164 56 48 124 229 151 116 162 178 162 51 82
196 82 146 224 187 155 179 198 101 182 159 61 110 57 211 252 109 135 82 95 139 229 80 24 90 239 278 173 65 89 81 187 302 137
$$ packed form
2790B5K80j65l2J03or7O4r5K11N21k68m49M2J0N3rkq8n0Q7k1pm4O5J06N0j34N8pk0j13L8P2
2402A78k0J00k14J71j49L24k14r0K4O1r6J1J15K7j72P2k5K8p0M5QJ3L3j13Pl8J33k1RJ0O8
2038B15j97R5lL8K0j21P4Q6o7N6r0L0j11J04q1J78j07J2MJ2r9R3K4j52J23J08j48m1l9J78
1686A94j72Q5K1Q1j23m1J0K33j44M1O8j47J84K63j04O96M133K93m365o67j84r4N3j68j5K03
1381C34q2j35N5PQq8N8K59k51q1N1l8klM1o9K05j82P8k6k6O5q1J9Q7o4K43k80po4J17p7L3
994A04K5N3m7q1k9P8R3j03L4N7O5k03J53n4m7N3k7k7N6o2n1jM3Q1j7k9l2Rp4nQ8O9m3P0j30
583F9J14l6J35j05l8k7l3k8P0o4M5R0k7j32Q5L8K2k4m2K0o2R4j08qP6J05p8l5M6J6j6j11L1
196H2O4P8l7l2K4J9r7Q1k3r8M9n3J54M1j43K6n3J3M4R0j49n6O6J49L9j05j08K4qJ06J15j65
$$ plain form
-180 137 111
$$ packed form
-180A37k6
-192A11
##PAGE=	F1=6860.61
##FIRST=	25164.767445380970457,	5806.2096540000038658,	0.25943812727928161621
##DATA TABLE=	(F2++(Y..Y)), PROFILE
$$ plain form
5806 105 80 73 20 79 247 172 71 178 202 88 133 154 106 21 103 50 28 20 90 62 45 22 45 127 211 150 201 146 273 283 61 205
5431 205 149 142 67 137 53 47 165 144 135 98 185 236 63 139 146 136 275 260 157 167 306 193 126 8 203 100 85 177 134 201 82 138
5055 138 134 151 174 115 123 72 254 254 87 121 88 107 118 92 18 229 347 118 114 218 304 186 64 140 171 87 130 75 89 90 212 300 106
4668 106 163 247 152 164 222 259 114 203 141 145 198 224 311 137 106 177 91 78 174 98 67 108 186 96 110 57 164 27 56 156 64 92 96
4280 96 139 232 267 31 67 63 75 116 255 90 55 139 137 16 124 234 47 84 154 237 25 58 164 187 62 34 52 79 116 88 46
3916 46 182 176 66 188 296 281 142 128 69 246 277 76 47 58 54 119 255 158 12 141 172 106 155 72 293 282 245 231 200 245 94
3553 94 203 31 188 163 129 138 167 120 52 123 240 169 170 75 126 115 187 140 51 6 60 88 98 78 70 207 181 106 34 195 262 137 158
3165 158 151 116 79 213 103 46 38 99 296 300 235 214 118 19 174 239 168 242 165 150 225 31 132 422 2450 2785 790 303 78
$$ packed form
5806A05k5pn3N9J68p5j01J07K4j14M5K1m8q5Q2n3k2qP0k8j7k3K3Q2Q4o1N1n5J27J0k22J44
5431B05n6pp5P0q4oJ18k1rl7Q7N1j73P6Pj0J39j5j03J0J39j13o7j18J95j03j5R2m3O7j19N6
5055A38mJ7K3n9Qn1J82%j67L4l3J9J1k6p4K11J18k29mJ04Q6j18j22P6L1q4M3n5J4JJ22Q8j94
4668A06N7Q4r5J2N8L7j45Q9o2MN3K6Q7j74l1P1q6j3R6p6l1M1P8r0J4n3J07j37K9J00r2K8M
4280I6M3R3L5k36L6mJ2M1J39j65l5Q4kj21J08J10j87L7P0Q3k12L3J06K3j25k8J8K7L7k8m2
3916D6J36oj10J22J08j5j39j4n9J77L1k01k9J1mO5J36r7j46J29L1o6M9q3K21j1l7j4l1M5j51
3553I4J09j72J57k5l4RK9m7o8P1J17p1Jr5N1j1P2m7q9m5N4K8J0k0qJ37k6p5p2J61O7j25K1
3165A58pl5l7J34j10n7qO1J97Mo5k1r6r9J55O5p1P4p7j5P5j94J01K90K028L35j995m87k25
$$ plain form
2825 78 232 240 89 364 131 151 186 176 72 190 80 383 1020 649 52 100 122 187 158 220 148 42 134 87 195 141 73 250 262
2484 262 125 225 170 158 82 91 205 170 237 16 220 55 394 138 40 148 175 108 94 210 257 87 118 112 181 84 120 145 167 140
2132 140 30 79 27 174 153 144 135 157 18 122 115 158 156 133 215 189 159 254 65 87 44 134 59 200 66 135 129 135 80 199 171 27 164
1745 164 258 100 43 127 219 87 207 133 182 89 65 102 318 132 175 339 150 350 570 589 1346 6401 6772 1487 627 441
1440 441 278 308 194 193 345 252 133 198 203 177 101 179 455 221 138 139 25 32 143 148 104 323 139 207 160 112 226 130 114 178 183 394
1064 394 112 123 74 146 57 150 163 205 160 41 53 86 228 107 98 106 195 13 185 115 86 154 88 119 229 125 69 47 95 155 182 111
689 111 117 138 100 44 165 166 84 192 91 198 188 310 180 112 85 14 92 175 58 83 157 145 50 149 134 161 186 112 102 20 124 80
313 80 84 151 276 159 133 167 207 149 64 113 156 246 209 159 137 168 103 168 177 69 101 64 220 235 122 125 77 38 191 266 71 34 85 210
$$ packed form
2825G8J54Qj51K75k33K0L5j0j04J18j10L03O37l71n97M8K2O5k9O2p2j06R2m7J08n4o8J77J2
2484B62j37J00n5j2p6RJ14l5O7k21K04j65L39k56r8J08K7o7j4J16M7j70L1oO9r7L6K5K2k7
2132A40j10M9n2J47k1rrK2j39J04pM3kk3Q2k6l0R5j89K2m3R0p5J41j34O9oOn5J19k8j44J37
1745A64R4j58n7Q4R2j32J20p4M9r3k4L7K16j86M3J64j89K00K20J9P57N055L71n285q60j86
1440D41j63L0j14jJ52r3j19O5Nk6p6P8K76k34q3Jj14PJ11Nm4K19j84O8m7m8J14r6j6O4NK11
1064C94k82J1m9P2q9R3J3M2m5j19J2L3J42j21rQQ9j82J72p0k9O8o6L1J10j04n6k2M8O0K7p1
689A11OK1l8n6J21Jq2J08j01J07j0J22j30o8k7p1P8Q3j17K5P4j2r5R9j5K7K5p4j0q2J04m4
313H0MO7J25j17k6L4M0n8q5M9M3R0l7n0k2L1o5O5Rj08L2l7J56J5j13Lm8l9J53P5j95l7N1J25
$$ plain form
-86 210 226 195 58 136 84 163 264 125 91
$$ packed form
-86B10J6l1j37P8n2P9J01j39l4
-192I1
##PAGE=	F1=6758.35
##FIRST=	25164.767445380970457,	5806.2096540000038658,	0.32054039835929870605
##DATA TABLE=	(F2++(Y..Y)), PROFILE
$$ plain form
5806 98 67 48 49 89 259 194 114 198 203 63 102 142 124 60 74 62 62 24 125 103 90 95 57 162 241 160 237 134 207 188 93 257 143 47
5407 47 75 136 84 62 169 116 75 157 179 241 74 105 127 98 218 201 140 164 309 205 123 14 154 87 123 219 166 246 98 147 150 174
5032 174 159 67 91 64 257 284 68 148 29 61 138 96 50 248 338 121 116 213 267 180 72 89 137 80 120 78 63 104 195 280 121 138
4656 138 286 148 126 204 224 107 181 74 161 218 170 234 176 58 187 110 100 197 125 60 72 175 71 86 82 195 28 35 136 36
4304 36 141 156 157 268 293 61 35 80 64 102 226 64 62 128 125 84 152 217 39 101 119 194 61 97 159 155 75 12 94 59 127 105 26 171
3905 171 219 55 184 346 328 113 77 11 265 288 109 66 35 59 153 282 114 32 147 189 71 128 125 320 311 253 223 182 261 125
3553 125 198 3 212 167 138 181 184 117 69 100 199 162 160 49 94 99 172 127 65 43 100 166 108 73 58 168 127 65 21 151 243 160 160 152 93
3142 93 76 183 113 59 60 73 276 342 291 185 138 54 176 216 177 242 164 128 248 44 176 454 2680 3022 848 310 98 283
$$ packed form
5806I8l1j9JM0J70o5q0Q4Nj40L9M0j8o4J4j2%l8J01k2j3Nl8J05P9q1P7j03P3j9r5J64j14r6
5407D7K8O1n2k2J07n3m1Q2K2O2j67L1K2k9J20j7o1K4J45j04q2j09J40o7L6R6n3Q0j48M9LK4
5032A74j5r2K4k7J93K7k16Q0j19L2P7m2m6J98R0k17nR7N4q7j08J7M8n7M0m2j5M1R1Q5j59J7
4656A38J48j38k2P8K0j17P4j07Q7N7m8O4n8j18J29p7j0R7p2o5J2J03j04J5mJ13j67PJ01j00
4304C6J05J5JJ11K5k32k6M5j6L8J24j62kO6lm1O8O5j78O2J8P5j33L6O2mq0o3Q2l5O8k2p9J45
3905A71M8j64J29J62j8k15l6o6K54K3j79m3l1K4R4J29j68q2J15M2j18N7lJ95rn8l0m1P9j36
3553A25P3j95K09m5k9M3Lo7m8L1R9l7kj11M5NP3m5o2k2N7O6n8l5j5J10m1o2m4J30R2q3%qn9
3142I3j7J07p0n4JJ3K03O6n1j06m7q4J22M0l9O5p8l6J20k04J32K78K226L42k174n38k12J85
$$ plain form
2813 283 244 170 403 131 194 168 125 30 200 68 424 1122 700 22 78 124 165 131 233 174 39 116 57 261 205 43 249 255 93
2473 93 220 117 141 102 79 210 166 201 27 189 73 361 93 25 232 182 136 97 198 246 109 117 134 227 97 120 157 186 101 67
2121 67 126 56 173 165 140 145 107 32 113 127 168 148 197 269 187 207 307 83 79 73 142 96 198 137 158 106 97 96 242 156 55 186 244 114
1722 114 104 237 219 152 298 109 138 97 117 139 307 115 156 401 170 394 547 689 1395 6850 7265 1618 648 490 292
1428 292 253 236 247 349 251 152 205 215 153 95 183 456 270 176 135 43 44 189 157 144 354 181 212 192 102 259 158 103 134 216 384
1064 384 99 192 151 136 96 191 171 211 174 53 90 93 260 124 78 27 134 13 179 82 69 149 59 133 262 151 156 80 108 168 205
700 205 91 124 183 173 77 223 145 28 179 99 192 217 311 177 89 69 83 173 227 75 92 125 120 63 168 99 140 223 122 98 90 73
325 73 113 135 180 304 161 139 173 220 136 76 106 134 256 223 143 90 133 113 150 182 81 123 50 217 189 121 111 90 35 229 286 52
$$ packed form
2813B83l9p4K33k72O3k6m3r5J70j32L56O98m22o78N6M6M1l4J02n9j35P7n9K04n6j62K06Oj62
2473I3J27j03K4l9k3J31m4L5j74J62j16K88k68o8K07n0m6l9J01M8j37QJ7R3j30K3L7K9q5l4
2121F7N9p0J17qk5Nl8p5Q1J4M1k0M9P2q2K0J00k24moO9m6J02o1K1n2rjJ46q6j01J31N8j30
1722A14j0J33j8o7J46j89K9m1K0K2J68j92M1K45k31K24J53J42P06N455M15n647r70j58j98
1428B92l9j7J1J02r8r9N3J0o2n8Q8K73j86r4m1r2JJ45l2j3K10j73L1k0r0J57j01n5L1Q2J68
1064C84k85R3m1j5m0R5k0M0l7j21L7LJ67j36m6n1J07j21J66r7j3Q0r0P4J29j11Np6K8O0L7
700B05j14L3N9j0r6J46p8j17J51q0R3K5R4j34q8k0J4R0N4j52J7L3nn7J05o9M1Q3j01k4qj7
325G3M0K2M5J24j43k2L4M7q4o0L0K8J22l3q0n3M3k0L7L2j01M2p3J67k8o8j0k1n5J94N7k34
$$ plain form
-51 52 42 117 165 151 193 57 168 103 129 210 118 62
$$ packed form
-51E2j0P5M8j4M2j36J11o5K6Q1r2n6
-192F2
##PAGE=	F1=6656.1
##FIRST=	25164.767445380970457,	5806.2096540000038658,	0.48323452472686767578
##DATA TABLE=	(F2++(Y..Y)), PROFILE
$$ plain form
5806 89 75 28 66 123 247 191 158 209 192 49 55 121 139 103 47 80 96 36 143 130 137 157 57 195 265 176 254 123 134 87 162 300 160
5419 160 64 100 134 100 75 167 91 56 192 167 220 80 86 99 57 146 140 125 164 304 218 139 39 97 63 152 231 202 270 109 138 153 178
5032 178 138 23 65 38 241 300 63 170 85 5 157 87 64 231 314 131 117 193 248 172 75 64 101 81 108 82 49 113 154 253 150
4668 150 114 308 159 82 154 194 96 146 22 169 218 111 141 176 35 200 150 125 183 130 47 18 151 87 61 93 212 86 39 105
4316 105 29 188 203 164 272 292 102 34 78 50 88 173 47 80 94 112 164 182 199 39 108 94 151 98 131 160 117 103 54 138 53 127
3940 127 122 30 161 259 79 170 373 383 135 25 91 251 264 129 88 33 59 182 302 77 50 146 186 72 109 151 298 303 247 201
3588 201 136 250 141 196 32 245 149 144 224 188 110 81 67 149 143 132 19 61 73 129 116 96 86 128 222 113 93 32 147 110 14 45
3212 45 106 232 187 174 138 76 82 146 112 88 64 47 223 370 324 151 145 68 180 171 180 252 179 109 256 100 198 458 2613 2916 806
$$ packed form
5806H9j4m7L8N7J24n6l3N1j7j43OO6J8l6n6L3J6o0J07j3PK0j00J38P0q9P8j31J1m7P5J38j40
5419A60r6L6L4l4k5R2p6l5J36k5N3j40OJ3m2Q9oj5L9J40q6p9j00N8l4Q9P9k9O8j61K9J5K5
5032A78m0j15M2k7K03N9k37J07q5q0J52p0k3J67Q3j83j4P6N5p6r7j1L7k0K7k6l3O4M1R9j03
4668A50l6J94j49p7P2M0r8N0j24J47M9j07L0L5j41J65n0k5N8n3q3k9J33o4k6L2J19j26m7O6
4316A05p6J59J5l9J08K0j90o8M4k8L8Q5j26L3J4J8N2J8J7j60O9j4N7n3L3K9m3j4m9Q4q5P4
3940A27nr2J31R8j80R1K03J0k48j10O6J60J3j35m1n5K6J23J20k25k7R6M0j14L7M2J47Nn6m6
3588B01o5J14j09N5j64K13r6nQ0l6p8k9j4Q2oj1j13M2J2N6j3k0j0M2R4j09k0o1J15l7r6L1
3212D5O1J26m5j3l6o2OO4l4k4k4j7J76J47m6j73op7J12rRP2p3p0J47j56R8K60K155L03k110
$$ plain form
2848 806 301 119 328 223 248 414 152 236 145 62 24 201 48 403 1085 682 111 84 140 145 123 224 166 34 88 49 303 241
2520 241 59 225 259 74 190 62 129 117 71 189 147 164 56 128 83 293 54 93 314 186 159 88 167 196 122 114 158 272 117
2179 117 109 139 180 53 115 170 94 153 170 136 161 72 39 89 147 169 141 219 278 185 253 344 142 127 98 151 137 208 195 180 64 45 95 273
1780 273 150 96 196 203 132 153 310 194 204 369 54 79 102 160 166 255 119 159 423 164 408 493 712 1275 6509 6927 1570
1463 1570 597 489 289 169 268 280 348 245 189 197 208 121 92 177 423 299 184 118 97 110 222 153 172 349 207 184 229 79 267
1123 267 176 91 92 230 356 62 267 218 116 156 213 147 212 174 81 127 140 271 128 64 50 75 22 182 58 66 147 50 131 250 146
759 146 211 107 108 187 211 58 107 216 225 105 253 107 62 170 92 169 233 289 171 85 86 158 247 264 93 109 108 106 64 175 58 134
383 134 251 124 123 172 51 131 189 207 312 169 138 171 213 125 75 74 87 252 226 115 61 106 122 144 169 92 155 24 195 124 111 106
$$ packed form
2848H06n05j82K09j05K5J66k62Q4r1q3l8J77j53L55O82m03n71k7N6Nk2J01n8j32N4l9K54o2
2520B41j82J66L4j85J16j28O7j2m6J18m2J7j08P2m5K10k39L9K21j28k7p1P9K9p4qM4J14j55
2179A17qL0M1j27O2N5p6N9J7l4K5q9l3N0N8K2k8P8N9r3O8R1k02j5k9N3j4P1j3j5j16j9N0J78
1780B73j23n4J00Pp1K1J57j16J0J65l15K5K3N8OQ9j36M0K64k59K44Q5K19N63N234M18n357
1463A570r73j08k00j20R9J2O8j03n6QJ1q7k9Q5K46j24j15o6k1J3J12o9J9J77j42k3M5j50J88
1123B67r1q5JJ38J26k94K05m9j02M0N7o6O5l8r3M6J3J31j43o4j4K5n3J60j24QQ1r7Q1J19j04
759A46O5j04JP9K4j53M9J09Rj20J48j46m5J08p8P7O4N6j18q6JP2Q9J7j71J6jkm2J11j17P6
383A34J17j27jM9j21Q0N8J8J05j43l1L3M2q8n0jJ3J65k6j11n4M5J6K2K5p7O3j31J71p1j3n
$$ plain form
8 106 111 66 242 286 32 36 174 131 66 170 61 182 123 88 157 115 33
$$ packed form
8A06Nm5J76M4k54MJ38m3o5J04j09J21n9l5O9m2q2
-192C3
##PAGE=	F1=6553.84
##FIRST=	25164.767445380970457,	5806.2096540000038658,	0.49704089760780334473
##DATA TABLE=	(F2++(Y..Y)), PROFILE
$$ plain form
5806 81 101 23 72 151 210 161 193 205 182 70 16 103 143 126 31 97 129 53 142 140 174 200 56 212 279 194 255 119 78 51 213 326 184
5419 184 151 128 135 101 89 155 72 64 198 151 183 82 91 82 42 74 91 112 163 292 227 166 64 56 57 157 211 220 267 121 105 134 160 129 46
5008 46 51 25 219 302 66 181 125 53 175 69 66 194 292 147 127 164 235 160 89 74 65 90 93 72 42 116 101 228 178 99 306 167
4632 167 85 81 174 90 104 20 165 196 55 73 126 60 222 198 147 136 133 60 55 122 130 47 80 204 132 62 74 62 220 226 159 245 259 137
4233 137 46 65 17 72 108 43 95 45 96 219 203 181 47 114 93 118 109 142 161 78 138 85 177 57 115 138 55 155 284 121 155 364
3858 364 412 188 23 163 213 218 137 109 31 54 206 313 57 45 138 161 85 107 139 232 264 226 167 71 220 144 205 54 270 120
3506 120 153 260 184 111 93 49 104 116 98 44 43 45 74 108 126 117 139 248 112 111 22 161 154 52 61 76 238 206 182 108 86 97 113 90 104
3095 104 49 34 151 385 334 127 141 65 186 126 181 276 207 97 247 130 191 437 2276 2503 672 272 136 361 182 305
$$ packed form
5806H1K0p8M9P9N9m9L2J2k3j12n4Q7M0j7r5O6L2p6Q9kL4K6j44J56O7q5O1j36m1k7J62J13j42
5419A84l3k3Pl4j2O6q3qJ34m7L2j01Rrm0L2J7K1N1J29o5o1j02qJJ00N4RM7j46j6K9K6l1q3
5008D6Nk6J94Q3k36J15n6p2J22j06lJ28R8j45k0L7P1p5p1j5rK5Lk1l0P4j5J27n0p9K07j39
4632A67q2mR3q4J4q4J45L1j41J8N3o6J62k4n1j1lp3nO7Qq3L3J24p2p0J2j2J58Oo7Q6J4j22
4233A37r1J9m8N5L6o5N2n0N1J23j6k2j34O7k1K5rL3J9q3O0n3R2j20N8K3q3J00J29j63L4K09
3858C64M8k24j65J40N0Nq1k8p8K3J52J07k56j2R3K3p6K2L2R3L2l8n9r6J49p6O1j51K16j50
3506A20L3J07p6p3j8m4N5J2j8n4jKK9L4J8rK2J09j36jq9J39pj02RJ5J62l2k4p4k2J1J6k3J4
3095A04n5j5J17K34n1k07J4p6J21o0N5R5o9j10J50j17O1K46J839K27j831m00j36K25j79J23
$$ plain form
2790 305 392 184 270 108 20 72 191 31 329 914 603 205 116 154 142 141 194 129 27 75 72 329 260 82 181 257 82 146 88 133
2438 133 121 74 155 116 138 93 52 86 201 45 150 370 183 174 72 121 123 134 101 175 313 150 94 95 158 60 156 193 135 148 177 129
2062 129 165 47 52 59 168 159 128 210 249 168 277 357 190 174 118 154 165 216 212 188 19 44 82 292 187 143 197 143 142 168 332 157 242
1675 242 414 23 13 102 186 189 172 144 194 403 138 385 416 648 1011 5458 5843 1358 487 438 257 117 291 290 343 230 245
1358 245 187 183 89 96 164 366 303 157 87 137 159 244 140 176 300 217 140 262 46 247 181 84 74 233 321 28 326 261 87 204
1006 204 210 97 218 161 110 155 199 252 110 42 92 30 18 189 59 83 150 64 116 200 124 234 115 102 203 202 12 74 224 243 121
642 121 243 59 131 171 76 140 236 261 167 104 125 211 301 279 102 118 109 118 57 170 22 150 259 107 152 243 94 126 231 225 301 176
266 176 146 154 187 115 69 34 33 242 214 88 63 97 120 149 139 96 174 20 157 59 102 121 131 79 225 266 54 13 238 128 20 141
$$ packed form
2790C05Q7k08Q6j62q8N2J19j60K98N85l11l98q9L8j2jN3o5j02M8lK57o9j78R9P6j75O4n8M5
2438A33j2m7Q1l9K2m5m1L4J15j56J05K20j87rj02M9KJ1l3P4J38j63n6JO3r8R6L7n8J3K9m8
2062A29L6j18NPJ09rl1Q2L9q1J09Q0j67j6n6L6J1N1mk4j69K5L8K10j05m4N4n4jK6J64j75Q5
1675B42J72l91j0Q9Q4Lj7k8N0K09k65K47L1K32L63M447L85m485q71m9j81j40J74jN3j13J5
1358B45n8mr4PO8K02o3j46p0N0K2Q5j04L6J24q3p7J22k16K01o6r7j0J59Q8k93K98o5j74J17
1006B04Oj13J21n7n1M5M4N3j42o8N0o2j2J71j30K4O7q6N2Q4p6J10j19j3J01jj90O2J50J9j22
642A21J22j84P2M0r5O4R6K5r4o3K1Q6R0k2j77J6rRo1J13j48J28J09j52M5R1j49L2J05oP6j25
266A76l0QL3p2m6l5jK09k8j26k5L4K3K9j0m3P8j54J37r8M3J9J0n2J46M1k12m1K25j10j08J21
$$ plain form
-110 141 70 181 144 52 119 116 16
$$ packed form
-110A41p1J11l7r2O7lj00
-192A6
##PAGE=	F1=6451.58
##FIRST=	25164.767445380970457,	5806.2096540000038658,	0.38540527224540710449
##DATA TABLE=	(F2++(Y..Y)), PROFILE
$$ plain form
5806 70 129 26 69 165 155 107 211 185 179 116 57 94 134 125 45 108 163 84 120 130 197 224 68 201 277 212 244 118 66 97 232 327 197
5419 197 210 149 138 92 118 134 63 56 174 129 146 91 108 90 67 18 63 101 153 271 225 192 85 86 84 134 171 211 236 134 68 90 127 143
5020 143 71 47 57 201 288 67 182 141 105 188 65 95 175 283 163 142 139 211 141 121 112 29 104 85 49 40 119 76 207 194 97 279
4644 279 162 144 5 162 97 61 36 152 158 27 111 40 103 249 241 160 72 158 101 103 99 178 54 51 170 156 92 52 98 229 217 147 191
4257 191 197 153 48 45 66 81 40 49 103 30 74 243 207 152 57 127 109 99 84 128 161 43 165 100 206 64 93 150 80 149 291 165
3881 165 142 313 391 226 52 218 168 168 137 121 18 46 224 312 60 26 122 118 86 115 99 151 213 195 126 20 183 139 221 61 280
3517 280 100 166 278 181 127 105 57 74 90 77 73 50 22 45 105 141 123 133 243 105 122 75 190 198 98 65 84 252 208 171 75 125
3142 125 116 96 48 104 24 56 88 387 328 128 133 52 197 122 183 303 238 92 235 129 157 398 1766 1890 475 224 150 376
$$ packed form
5806G0N9j03M3R6j0m8J04k6oo3n9L7M0rq0O3N5p9L6J0O7K7j56J33P6o5L2j26n2L1J35R5j30
5419A97J3o1j1m6K6J6p1pJ18m5J7n5J7j8k3m9M5L8N2J18m6l3j07JkN0L7M0K5j02o6K2L7J6
5020A43p2k4J0J44Q7k21J15m1l6Q3j23L0Q0J08j20k1lP2p0k0rq3P5j9l6rP9m3J31j3r7J82
4644B79j17j8j39J57o5l6k5J16Oj31Q4p1O3J46qq1q8Q6n7KmP9j24lJ19j4o4m0M6J31j2p0M4
4257A91Om4j05lK1J5m1RN4p3M4J69l6n5r5P0j8j0j5M4L3j18J22o5J06j42K9N7p0O9J42j26
3881A65k3J71P8j65j74J66n0%l1j6j03K8J78Q8k52l4R6ml2K9j6N2O2j8o9j06J63m4Q2j60K19
3517B80j80O6J12r7n4k2m8J7J6j3mk3k8K3O0L6j8J0J10j38J7m7J15Qj00l3J9J68m4l7r6N0
3142A25rk0m8N6q0L2L2K99n9k00Nq1J45p5O1J20o5j46J43j06K8K41J368J24j415k51p4K26
$$ plain form
2813 376 127 332 338 207 286 58 65 119 172 28 226 652 487 287 155 162 159 173 152 81 20 97 98 349 280 91 125 240 96 117
2461 117 165 169 119 97 126 77 127 128 46 105 107 59 184 383 167 182 68 75 70 151 88 181 345 185 78 38 136 128 178 187 172 193 185 112 148
2050 148 24 77 33 177 141 106 186 204 131 273 342 211 196 140 153 178 214 194 181 51 89 64 302 256 191 191 76 136 147 304 125
1686 125 265 429 106 56 98 194 212 87 158 226 347 101 333 329 515 662 3947 4277 1037 347 348 199 161 302 284 333 202
1369 202 303 182 147 75 101 149 302 280 101 53 161 183 257 124 155 213 214 112 279 29 200 176 87 80 237 292 74 355 276
1029 276 69 217 184 57 222 142 136 170 246 206 74 7 100 24 8 191 85 103 153 94 92 139 114 232 100 97 211 180 38 47 200
665 200 223 123 194 43 189 179 54 122 228 254 174 135 166 233 328 274 103 114 117 138 50 159 22 170 239 72 170 288 141 100
313 100 248 231 272 168 164 121 146 101 67 7 38 236 186 78 67 102 100 153 101 90 167 48 110 47 101 145 154 85 182 237 100 24 297
$$ packed form
2813C76k49K05Oj31P9k28PN4N3j44J98M26j65k00j32PlJ4k1p1o1P7JK51o9j89L4J15j44K1
2461A17M8Mn0k2K9m9N0Jq2N9Km8J25J99k16J5j14PnQ1o3R3J64j60j07m0R8qN0Rj5K1qp3L6
2050A48j24N3m4J44l6l5Q0J8p3J42O9j31j5n6J3K5L6k0j3j30L8k5K38m6o5%j15O0J1J57j79
1686A25J40J64l23n0M2R6J8j25P1O8J21k46K32mJ86J47L285L30l240o90Jj49l8J41j8M9j31
1369B02J01j21l5p2K6M8J53k2j79m8J08K2P4j33L1N8Jj02J67k50J71k4q9pJ57N5k18K81p9
1029B76k07J48l3j27J65q0oL4P6m0j32o7R3p6j6J83j06J8N0n9kM7k5J18j32lJ14l1j42RJ53
665B00K3j00P1j51J46j0j25O8J06K6q0l9L1O7R5n4j71J1LK1q8J09j37J48O9j67R8J18j47m1
313A00J48j7M1j04mm3K5m5l4o0L1J98n0j08j1L5kN3n2j1P7j19O2o3N4M4Ro9R7N5j37p6K73
$$ plain form
-74 297 143 86 127 81 171 169 46 110 119 15
$$ packed form
-74B97j54n7M1m6R0kj23O4Rj04
-192A5
##PAGE=	F1=6349.32
##FIRST=	25164.767445380970457,	5806.2096540000038658,	0.41011136770248413086
##DATA TABLE=	(F2++(Y..Y)), PROFILE
$$ plain form
5806 55 151 23 59 168 100 56 208 150 182 168 96 97 119 104 79 118 192 114 83 108 201 233 83 158 260 226 229 113 76 116 214 300 192
5419 192 230 155 142 85 154 117 63 34 128 104 128 112 117 110 90 32 58 89 131 240 210 209 98 134 113 87 135 177 189 146 95 37 105 166 72
5008 72 55 80 185 258 59 179 154 142 190 85 144 187 278 173 150 128 187 122 160 162 10 112 104 46 44 125 106 186 194 98 230 138 209
4621 209 92 156 104 30 46 133 109 58 171 96 160 276 268 159 39 199 144 124 89 221 72 39 115 156 124 44 127 216 177 128 123 112
4245 112 140 36 28 141 127 25 64 108 74 46 238 190 108 60 143 129 100 28 114 159 23 173 98 218 72 72 156 99 142 282 199
3881 199 129 221 311 231 68 253 132 129 133 120 17 32 232 297 72 24 102 67 75 124 83 115 170 158 82 79 150 130 231 55 275 102
3506 102 184 276 183 152 111 63 65 81 86 84 76 10 68 102 140 99 114 215 91 131 140 207 204 118 61 113 257 186 137 79 171 133 97 31 98 3
3083 3 86 92 371 309 155 130 40 209 156 187 320 265 97 232 102 99 348 1212 1227 262 159 170 366 64 323 262 210 273 27
$$ packed form
5806E5R6j28L6J09o8m4J52n8L2j4p2JK2j5k5L9P4p8l1K5R3L2j50P5J02l4Lj16l7M0R8Q6j08
5419A92L8p5j3n7O9l7n4k9R4k4K4j6Npk0n8K6L1M2J09l0jj11L6k1k6M8M2J2m3n1n8O8O1r4
5008G2j7K5J05P3j99J20k5j2M8j05N9M3R1j05k3k2N9o5L8Kj52J02qn8kQ1j9Q0Qr6J32r2P1
4621B09j17O4n2p4J6Q7k4n1J13p5O4J16qj09j20J60n5k0l5J32j49l3P6M1l2q0Q3Q9l9m9nj1
4245A12K8j04qJ13j4j02L9M4l4k8J92m8q2m8Q3j4k9p2Q6M5j36J50p5J20j46%Q4n7M3J40q3
3881A99p0R2R0q0j63J85j21lMj3j03J5K00O5k25m8P8l5QM9m1L2N5j2p6lP1k0J01j76K20j73
3506A02Q2R2r3l1m1m8KJ6Nkqo6N8L4L8m1J5J01j24M0RO7lq6n7N2J44p1m9n8R2l8l6o6O7r5
3083CQ3OK79o2j54k5r0J69n3L1J33n5j68J35j30lK49Q64J5r65j03J1J96l02K59o1n2O3k46
$$ plain form
2743 27 100 159 148 36 121 358 367 341 188 166 180 203 108 41 16 132 112 367 308 81 69 201 98 132 230 223 127 130 125 47 126 151 116
2355 116 147 68 70 189 350 139 183 91 50 107 169 89 176 357 209 64 23 130 192 180 158 197 263 186 80 116 18 102 18 172 134
1992 134 89 156 162 76 241 295 200 189 164 151 174 203 156 164 87 116 50 302 321 229 182 32 116 103 240 108 274 411 178 113 89 191
1616 191 230 70 146 228 276 62 265 243 352 306 2321 2586 683 211 237 126 222 298 272 314 165 342 181 124 87 102 135 246
1287 246 237 51 68 167 176 262 113 108 107 201 119 275 65 138 163 101 93 255 277 125 348 263 104 190 147 92 209 132 157 172 268 149
912 149 42 39 75 32 9 182 115 115 146 125 64 114 131 218 66 88 205 154 85 56 143 166 109 120 92 226 182 34 122 216 284 192 165
524 165 200 224 329 251 97 99 118 141 57 146 46 171 193 27 167 301 170 61 234 221 232 144 178 81 97 77 75 23 78 244 144
160 144 87 57 111 63 147 68 76 135 79 80 85 106 162 178 99 122 215 137 64 336 152 130 137 92 160 196 67 120 124 14
$$ packed form
2743B7P3N9j1j12Q5K37Rk6j53k2J4K3r5o7k5J16k0K55n9k27j2J32j03L4R8pr6Lnp8P9K5l5
2355A16L1p9KJ19J61k11M4r2m1N7O2q0Q7J81j48j45m1J07O2j2k2L9O6p7j06L6r8Q4q4J54l8
1992A34m5O7Oq6J65N4r5j1k5j3K3K9m7Qp7K9o6K52J9r2m7j50Q4j3J37j32J66J37k33o5k4J02
1616A91L9j60P6Q2M8k14K03k2J09m6K015K65j903m72K6j11R6P6k6M2j49J77j61n7l7J5L3J11
1287B46rj86J7R9RQ6j49njR4q2J56k10P3K5o2qJ62K2j52K23q5j59Q6m3n5J17p7K5J5R6j19
912A49j07lL6m3k3J73o7%L1k1o1N0J7Q7j52K2J17n1o9k9Q7K3n7J1k8J34m4j48Q8R4O8r2k7
524A65L5K4J05p8j54KJ9K3q4Q9j00J25K2j66J40J34j31j09J73j3J1q8L4r7J6k0kn2N5J66j00
160A44n7l0N4m8Q4p9QN9n6JNK1N6J6p9K3R3p8p3K72j84k2Pm5O8L6j29N3Mj10
-192A4
##PAGE=	F1=6247.06
##FIRST=	25164.767445380970457,	5806.2096540000038658,	0.43252366781234741211
##DATA TABLE=	(F2++(Y..Y)), PROFILE
$$ plain form
5806 48 166 17 49 160 77 94 186 109 186 210 117 109 119 69 118 131 203 133 38 91 186 235 90 102 228 231 219 99 76 105 165 253 166
5419 166 213 147 143 87 186 120 72 56 80 77 130 131 108 123 96 52 72 72 98 198 185 215 100 160 129 64 143 134 148 152 166 74 120 180 52 78
4996 78 78 158 212 37 190 180 155 179 110 184 199 259 173 152 137 191 116 191 214 45 109 150 96 49 133 142 161 178 94 166 99 262 168 152
4597 152 98 50 53 111 68 90 203 216 230 294 273 145 85 233 170 116 97 250 86 71 51 137 154 43 146 189 115 104 60 16 96 15
4222 15 28 203 181 87 83 112 108 28 213 153 62 63 159 143 118 60 146 154 31 157 83 209 82 63 158 109 130 257 213 112 100 184 201
3834 201 76 267 115 108 124 105 43 20 223 269 82 47 79 25 65 134 137 154 144 120 52 137 129 122 228 46 260 118 200 251 180 174 106
3447 106 59 70 94 114 77 113 8 84 95 139 56 87 176 73 138 206 200 162 110 60 137 239 143 88 127 209 140 109 98 102 19 105 143 336
3048 336 282 193 139 32 218 187 189 319 282 107 240 60 25 291 737 652 88 85 200 328 28 285 175 188 233 67 118 186
$$ packed form
5806D8J18j49L2J11q3J7R2p7P7K4r3qJ0n0M9J3P2p0r5N3R5M9j45J2J26Lj2j20k3K9O0Q8q7
5419A66M7o6mn6R9o6m8j6K4lN3Jk3J5k7m4K0%K6J00j3L0j15O0l1o5P9rJ4MJ4r2M6O0j28K6
4996G8%Q0N4j75J53j0k5K4o9P4J5O0q6k1j5N4p5P5K3j69O4M1n4m7Q4RJ9J7q4P2o7J63r4j6
4597A52n4m8LN8m3K2J13J3J4O4k1j28o0J48o3n4j9J53j64j5k0Q6J7j11J03M3p4j1m4m4Q0q1
4222A5J3J75k2r4mK9mq0J85o0r1JR6j6k5n8Q6Qj23J26p4J26j27j9R5m9K1J27m4j01j2Q4J7
3834B01j25J91j52pJ6j9o2k3K03M6j87l5L2n4M0O9LJ7j0k4o8Q5qpJ06j82K14j42Q2N1p1oo8
3447A06m7J1K4K0l7L6j05P6J1M4q3L1Q9j03O5O8ol8n2n0P7J02r6n5L9Q2o9l1j1Mq3Q6L8J93
3048C36n4q9n4j07J86l1KJ30l7j75J33j80l5K66M46q5n64lJ15J28l00K57j10J3M5j66N1O8
$$ plain form
2719 186 126 56 39 96 269 360 209 174 192 218 74 17 22 156 108 375 333 56 23 145 86 162 264 273 152 159 143 49 124 153 172 192
2344 192 111 72 169 276 101 175 120 60 161 178 100 162 341 214 54 60 136 236 162 122 207 321 173 38 95 49 115 11 158
2003 158 162 111 124 142 28 189 222 165 159 185 152 155 184 119 139 99 115 46 291 363 252 169 62 89 72 164 108 270 364 224 154 80 185
1616 185 237 112 109 194 211 36 200 166 207 17 919 1129 371 104 131 61 246 278 260 284 131 350 174 131 108 94 119 211 181
1276 181 99 122 153 141 259 112 46 57 182 131 247 113 80 151 124 112 281 272 154 308 234 171 126 116 137 167 149 174 165 264 108
912 108 60 88 41 32 19 161 131 119 132 142 36 141 157 197 23 78 180 131 121 82 69 83 82 40 145 239 169 31 124 208 334 209
536 209 187 224 193 306 216 90 79 106 117 81 132 68 148 129 32 143 284 173 30 191 196 190 110 171 45 54 50 91 31 104 263 95
160 95 103 38 114 16 135 51 74 101 110 101 111 110 161 194 117 60 203 153 97 347 151 148 156 100 149 218 88 128 128 19
$$ packed form
2719A86o0p0j7N7J73R1j51l5J8K6j44n7NJ34m8K67m2k77l3J22n9P6J02Rj21Pj6r4P5K9J9K0
2344A92q1l9R7J07j75P4n5o0J01J7p8O2J79j27j60OP6J00p4m0Q5J14j48j35N7m6O6j04J47
2003A58Mn1J3J8j14J61L3n7oK6l3LK9o5K0m0J6o9K45P2j11q3j07K7j7R2n6J62R4j40p0p4J05
1616A85N2j25lQ5J7j75J64l4M1j90R02K10p58k67K7p0J85L2j8K4j53K19j76m3k3j4K5R2l0
1276A81q2K3L1j2J18j47o6J1J25n1J16j34l3P1k7j2J69rj18J54p4o3m5j0K1L0j8K5rR9j56
912A08m8K8m7rj3J42l0j2J3J0j06J05J6M0j74N5J02m9j0l9j3J4jm2J05R4p0j38R3Q4J26j25
536B09k2L7l1J13r0j26j1K7J1l6N1o4Q0j9r7J11J41j11j43J61Noq0O1j26RmM1o0P3J59j68
160I5Qo5P6r8J19q4K3K7RrJ0jN1L3p7n7J43n0n6K50j96lQn6M9O9j30M0%j09
-192A9
##PAGE=	F1=6144.81
##FIRST=	25164.767445380970457,	5806.2096540000038658,	0.21818976104259490967
##DATA TABLE=	(F2++(Y..Y)), PROFILE
$$ plain form
5806 70 176 26 52 144 102 173 150 72 195 229 116 126 145 31 151 148 189 139 30 97 157 232 82 102 189 225 218 78 61 89 99 197
5431 197 124 174 130 142 94 205 139 83 102 76 59 134 134 78 124 83 53 94 49 67 153 159 217 93 155 128 121 184 119 143 144 227 148 157 173 42
5008 42 107 48 114 154 33 223 213 141 152 128 200 184 219 161 161 159 226 128 207 253 75 93 205 159 51 135 157 130 151 85 100 56 296
4621 296 225 140 85 94 55 88 77 112 201 319 303 298 255 121 121 243 170 90 117 265 92 106 22 108 177 39 156 159 46 71 41 78 32
4233 32 18 35 232 221 143 99 106 123 50 184 109 88 87 178 149 142 142 214 141 41 127 58 181 94 64 160 111 113 216 200 87 45 62 148 77
3823 77 261 115 99 104 80 68 45 198 230 85 62 57 40 74 148 202 200 127 83 69 176 119 113 208 40 240 132 208 207 162 186 94 65 83
3423 83 116 144 75 150 21 80 77 157 56 63 139 61 134 263 173 79 89 68 147 195 93 35 178 231 132 127 165 114 34 100 185 285 250 232
3024 232 155 30 213 195 186 292 282 116 245 31 73 233 423 262 112 48 235 266 74 227 94 143 176 104 129 201 109 87
$$ packed form
5806G0J06j50K6R2m2P1k3p8J23L4j13J0J9j14J20lM1n0j09O7O0P5j50K0Q7L6pj40j7K8J0R8
5431A97p3N0m4J2m8J11o6n6J9k6j7P5%n6M6m1l0M1m5J8Q6ON8j24O2k7pO3o5K4JQ3p9RJ6j31
5008D2O5n9O6M0j21J90j0p2J1k4P2j6L5n8%kO7r8P9M6j78J8J12m6j08Q4K2k7K1o6J5m4K40
4621B96p1q5n5Rl9L3j1L5Q9J18j6nm3j34%J22p3q0K7J48j73J4q4Q6O9j38J17Lj13K5l0L7m6
4233C2j4J7J97j1p8m4PJ7p3J34p5k1jR1k9p%P2p3j00Q6o9J23q7l0R6m9KJ03j6j13m2J7Q6p1
3823G7J84j46j6Nk4j2k3J53L2j45k3nj7L4P4N4kp3m4j4J07n7oR5j68K00j08P6jm5K4r2k9J8
3423H3L3K8o9P5j29N9lQ0j01PP6p8P3J29r0r4J0k1P9M8j02n8J43N3r9nL8n1q0O6Q5J00l5j8
3024B32p7j25J83j8rJ06j0j66J29k14M2J60J90j61j50o4J87L1j92J53j33M9L3p2K5P2r2k2
$$ plain form
2696 87 11 98 197 340 216 188 187 212 64 40 42 159 90 362 341 39 9 77 74 179 258 296 177 172 157 69 113 135 206 222 146 70 134
2308 134 181 60 160 137 74 190 172 105 150 298 197 52 74 140 252 136 99 200 346 142 17 108 81 105 26 145 216 166
1980 166 89 147 71 129 133 122 118 193 155 128 162 99 110 88 90 59 270 371 256 153 102 61 90 109 120 252 298 237 178 75 183 223 129
1592 129 58 135 167 40 154 103 129 181 244 316 155 48 72 54 226 243 249 244 115 329 166 157 120 77 104 200 123 170 176 118 87 248
1217 248 124 31 138 163 124 197 160 68 146 154 141 298 268 156 247 197 239 51 107 152 101 188 184 157 241 105 94 130 72 49 24 129
841 129 123 118 124 130 10 176 171 168 24 99 138 115 145 103 73 16 48 49 185 228 133 49 117 205 375 214 199 235 151 265 175 86 66 82 74 117
419 117 114 90 107 65 65 104 246 156 43 131 159 159 83 137 20 52 35 106 29 113 280 50 119 21 109 33 125 50 95 102 135 147 117 109 137
8 137 195 124 17 194 145 114 322 149 144 171 104 138 227 102 122 130 37
$$ packed form
2696H7p6Q7R9J43j24k8jK5j48k4KJ17o9K72k1l02l0O8lJ05P9L8j19nj5q8M4K2P1J6p6p6O4
2308A34M7j21J00k3o3J16j8o7M5J48j01j45K2O6J12j16l7J01J46k04j25R1k7K4p9J19P1n0
1980A66p7N8p6N8Mj1mP5l8k7L4o3J1k2Kl1K11J01j15j03n1m1K9J9J1J32M6o1n9j03J08M0r4
1592A29p1P7L2j27J14n1K6N2O3P2j61j07K4j8J72J7Onj29K14j63rl7m3K7R6p7M7On8l1J61
1217B48j24r3J07K5l9P3l7r2P8Qj3J57l0j12R1n0M2j88N6M5n1Q7mk7Q4j36j1L6n8k3k5J05
841A29onOOj20J66nlj44P5L9k3L0m2l0n7L2JJ36M3r5q4O8Q8J70j61j5L6q4J14r0q9k0J6qM3
419A17lk4J7m2%L9J42r0j13Q8K8%p6N4j17L2j7P1p7Q4J67k30O9r8Q8p6R2p5M5PL3J2l0qK8
8A37N8p1j07J77m9l1K08j73nK7o7L4Q9j25K0Qr3
-192C7
##PAGE=	F1=6042.55
##FIRST=	25164.767445380970457,	5806.2096540000038658,	0.15457734465599060059
##DATA TABLE=	(F2++(Y..Y)), PROFILE
$$ plain form
5806 102 182 47 67 127 136 243 117 49 211 218 97 143 180 18 170 161 146 152 74 116 130 219 61 175 153 206 227 56 32 110 41 143
5431 143 79 142 111 138 101 206 158 88 136 118 61 124 116 32 117 53 46 113 25 68 119 148 225 80 120 119 191 220 143 171 120 257 209 189 144
5020 144 75 132 26 71 91 83 265 233 104 113 144 193 136 163 144 184 189 264 142 204 269 92 78 255 217 52 128 147 102 121 77 44 29
4632 29 306 255 112 105 139 51 69 120 124 173 387 368 284 220 93 131 225 140 79 137 265 88 132 61 84 190 36 159 138 28 31 72
4257 72 154 60 50 39 222 237 189 110 81 120 81 171 89 158 137 205 148 160 207 279 113 41 101 31 146 104 77 170 107 97 162 163 62 163
3858 163 133 87 66 238 122 92 71 58 85 84 162 188 82 61 36 64 94 159 247 221 107 49 106 194 110 102 177 39 221 137 203 150 126
3470 126 189 93 94 98 134 169 101 176 39 61 47 184 115 63 113 75 112 301 137 29 96 79 148 136 74 11 214 230 107 152 216 118
3095 118 61 75 200 230 211 267 174 39 192 180 175 237 258 118 237 59 163 186 276 93 188 93 261 190 120 164 32 82 131 125 147
$$ packed form
5806A02Q0j35K0O0RJ07j26o8J62Pj21M6L7j62J52rj5Op8M2J4Q9j58J14k2N3K1j71k4P8o9J02
5431A43o4O3l1K7l7J05m8p0M8j8n7O3qq4Q5o4pO7q8M3N1K9P7j45M0jP2K9p7K8n1J37m8k0m5
5020A44o9N7j06M5K0qJ82l2j29RL1M9n7K7j9M0NP5j22O2O5j77j4J77l8j65P6J9m5J9m4l3j5
4632B9K77n1j43pL4q8J8N1MM9K14j9q4o4j27L8R4q5o1N8J28j77M4p1K3J06j54J23k1j10LM1
4257G2Q2r4j0j1J83J5m8p9k9L9l9R0q2O9k1O8n7J2M7P2j66p2O0p0J15m2k7R3o3j0O5Jj01J01
3858A63l0m6k1J72j16l0k1j3K7jP8K6j06k1k5K8L0O5Q8k6j14n8N7Q8q4qP5j38J82q4O6n3k4
3470A26O3r6JML6L5o8P5j37K2j4J37o9n2N0l8L7J89j64j08O7j7O9j2o2o3K03J6j23M5O4r8
3095A18n7J4J25L0j9N6r3j35J53j2nO2K1j40J19j78J04K3R0j83R5r5J68p1p0M4j32N0M9oK2
$$ plain form
2731 147 208 100 125 26 195 139 286 213 205 172 190 83 95 71 140 67 324 325 76 33 19 81 172 217 281 184 163 155 84 88 100 216 225 153
2332 153 65 97 88 26 139 134 77 190 149 95 150 234 160 58 67 137 239 120 98 178 336 103 47 132 103 73 56 140 265 226 55 169
1956 169 131 83 41 96 92 184 157 102 145 111 100 61 60 88 240 348 246 138 137 37 114 97 131 222 229 221 185 85 185 185 108 19 79 138
1557 138 59 133 59 121 258 612 546 77 74 89 82 172 205 236 196 123 299 175 178 116 55 102 202 71 221 214 67 28 229 145 89 207
1182 207 146 96 133 203 104 155 185 174 293 256 140 182 162 289 61 114 132 77 226 183 154 213 121 114 158 129 90 31 93 102 122 144 83
794 83 22 199 167 132 65 153 88 110 166 118 152 96 29 98 206 200 77 71 96 199 384 205 202 233 109 213 127 90 66 54 63 154 91 111
395 111 74 21 81 62 205 123 63 77 111 146 70 87 17 82 51 112 26 112 282 38 125 20 92 77 119 77 121 126 149 190 106 106 89 175
-4 175 112 37 176 120 113 264 151 126 178 108 127 219 113 99 127 57
$$ packed form
2731A47O1j08K5r9J69n6J47p3ql3J8j07J2k4O9p3K57Jk49m3j4O2R1M5O4r7k1qp1MJ2J16Rp2
2332A53q8L2ro2J13nn7J13m1n4N5Q4p4j02RP0J02j19k2Q0J58k33n6Q5k9l0j7Q4J25l9j71J14
1956A69l8m8m2N5mR2k7n5M3l4j1l9jK8J52J08j02j08jj00P7j7L4R1Pql6j00J00%p7q9O0N9
1557A38p9P4p4O2J37L54o6m69lJ5pR0L3L1m0p3J76j24Lo2o1M7J00j31J50pj47l9K01q4n6J18
1182B07o1n0L7P0r9N1L0j1J19l7j16M2k0J27k28N3J8n5J49m3k9N9r2pM4k9l9n9O2RK0K2o1
794H3o1J77l2l5o7Q8o5K2N6m8L4n6o7O9J08oj23oK5J03J85j79lL1j24J04q6l7k4j2RR1o3K0
395A11l7n3O0j9J43q2o0J4L4L5p6J7p0O5l1O1q6Q6J70k44Q7j05P2j5M2m2M4NK3M1q4%j7Q6
-4A75o3p5J39n6pJ51j13k5N2p0J9R2j06j4K8p0
-192E7
##PAGE=	F1=5940.29
##FIRST=	25164.767445380970457,	5806.2096540000038658,	0.37896651029586791992
##DATA TABLE=	(F2++(Y..Y)), PROFILE
$$ plain form
5806 126 185 68 80 115 161 290 119 44 230 178 68 160 206 40 169 159 82 193 116 129 128 190 44 251 125 176 240 51 4
5466 4 153 74 97 62 144 96 133 105 192 165 80 146 154 81 98 80 25 106 12 67 122 40 98 111 160 245 69 68 120 240 231 173 196 83 249
5055 249 243 204 100 118 147 79 84 32 136 296 226 66 75 158 182 67 102 129 205 216 279 144 184 257 90 91 292 259 61 112 118 93 97
4668 97 80 11 40 294 257 64 171 180 41 57 156 129 135 414 409 254 177 67 117 183 83 117 151 255 76 143 86 70 194 62 161
4304 161 123 66 21 103 203 135 78 47 175 224 215 119 36 110 104 185 118 215 194 233 143 167 239 320 75 31 98 17 126 106 108 183 99 86
3905 86 99 113 63 253 225 33 42 200 130 82 32 54 93 120 137 150 80 47 26 72 113 160 259 213 79 30 138 192 102 93 150 50 205
3517 205 127 183 90 90 185 123 129 111 141 183 139 180 52 41 10 196 166 87 102 112 74 316 103 134 133 86 148 81 96 35 224 209 72
3130 72 185 244 100 99 55 179 185 165 293 192 54 153 151 162 158 207 118 218 96 237 161 241 74 217 136 268 125 149 110 24 14
$$ packed form
5806A26N9j17J2L5M6J29j71p5J86n2j10R2M6j66J29j0p7J11p7J3jO2j46K07j26N1O4j89m7
5466DJ49p9K3l5Q2m8L7k8Q7k7q5O6Qp3J7j8n5Q1r4N5N5q2N8J3M9Q5j76jN2J20rn8K3j13J66
5055B49ol9j04J8K9o8Nn2J04J60p0j60RQ3K4j15L5K7P6J1O3j35M0P3j67JK01l3j98N1Ok5M
4668I7j7o9K9K54l7j93J07Rj39J6R9k7OK79nj55p7j10N0O6j00L4L4J04j79O7n7j6J24j32R9
4304A61l8n7m5Q2J00o8n7l1J28M9rr6q3P4oQ1o7R7k1L9r0K4P2Q1k45m4O7q1J09k0KP5q4j3
3905H6J3J4n0J90k8j92RJ58p0m8n0K2L9K7J7J3p0l3k1M6M1M7R9m6j34m9J08N4r0rN7j00J55
3517B05p8N6r3%R5o2Oj8L0M2m4M1j28j1l1J86l0p9J5J0l8K42k13L1jm7O2o7J5o1J89j5j37
3130G2J13N9j44jm4J24Ok0J28j01j38R9kJ1mM9q9J00j22J41p6Q0j67J43q1J32j43K4l9q6j0
$$ plain form
2766 14 137 130 177 212 98 162 32 213 81 210 209 220 163 167 110 159 99 107 59 263 285 130 62 68 103 143 153 228 162 132 133 92 49 58 205
2355 205 201 132 54 61 44 28 120 115 69 167 118 77 164 164 109 65 48 134 211 130 107 146 299 72 62 135 113 21 89 140 289 267 35 201
1956 201 182 90 47 100 99 163 153 92 138 150 129 30 68 123 203 307 235 139 172 27 112 101 129 179 176 185 181 114 186 126 56 27 60 109 82 130
1534 130 39 116 243 657 587 85 117 101 94 108 177 220 147 147 289 214 180 96 56 127 209 33 243 227 34 47 207 170 128 240 133
1170 133 58 64 238 141 177 215 202 266 232 118 134 128 311 110 124 101 155 246 169 155 193 124 116 168 171 132 49 62 112 132 186 13 59 209
771 209 147 105 105 206 56 112 189 130 215 153 50 116 206 161 38 90 68 178 352 185 198 220 75 155 77 105 77 32 108 174 71
407 71 133 81 26 80 33 171 85 64 58 58 144 68 71 47 107 74 104 25 109 262 53 113 36 65 111 109 129 143 130 154 220 88 114 27 137
-4 137 89 58 147 95 96 183 155 111 180 121 118 196 125 63 118 72
$$ packed form
2766A4J23pM7L5j14O4j30J81j32J29jJ1n7Mn7M9o0Qm8K04K2j55o8OL5M0J0P5o6l0Jm1m3RJ47
2355B05mo9p8Pj7j6R2nm6R8m9m1Q7%n5m4j7Q6P7q1k3L9J53k27j0P3k2r2O8N1J49k2k32J66
1956B01j9r2m3N3jO4j0o1M6J2k1r9L8N5Q0J04p2r6L3j45Q5j1K8N0lRmo7P2o0p0k9L3M9k7M8
1534A30r1P7J27M14p0n02L2j6pJ4O9M3p3%J42p5l4q4m0P1Q2j76K10j6j93J3J60l7m2J12j07
1170A33p5OJ74r7L6L8j3O4l4j14J6oJ83k01J4k3N4R1p7j4L8o9qN2Ll9q3J3N0K0N4j73M6J50
771B09o2m2%J01j50N6P7n9Q5o2j03O6R0m5j23N2k2J10J74j67J3K2j45Q0p8K8k8m5P6O6j03
407G1O2n2n5N4m7J38q6k1o%Q6p6Lk4O0l3L0p9Q4J53k09O0p7K9M6kK0J4j3K4O6j32K6q7J10
-4A37m8l1Q9n2JQ7k8m4O9n9lP8p1o2N5m6
-192G2
##PAGE=	F1=5838.03
##FIRST=	25164.767445380970457,	5806.2096540000038658,	0.2623532712459564209
##DATA TABLE=	(F2++(Y..Y)), PROFILE
$$ plain form
5806 128 184 84 77 112 175 304 159 62 241 118 41 180 214 55 147 138 23 253 149 125 158 144 69 301 102 139 248 76 45
5466 45 187 134 59 95 173 89 127 104 164 159 58 131 167 111 60 43 73 97 32 122 116 76 127 121 179 274 67 35 140 254 210 182 200 50
5067 50 210 250 204 57 149 150 138 137 13 170 299 191 85 63 166 184 9 49 119 203 226 267 132 154 220 69 135 313 276 81
4715 81 92 83 107 84 95 11 51 263 231 41 251 214 34 58 170 131 100 403 418 214 138 53 87 128 13 181 156 243 65 142 90
4351 90 62 189 110 170 107 83 69 132 220 191 95 67 106 185 215 132 37 105 117 220 160 242 238 252 135 163 233 330 54 16 109 27 138
3963 138 95 154 193 90 86 31 91 90 295 256 12 21 149 128 69 40 68 96 142 145 119 85 26 43 70 126 151 240 185 53 40 154 175 97
3564 97 92 143 74 192 104 150 35 93 175 167 153 120 137 180 167 163 58 27 32 176 191 113 107 152 46 306 80 214 160 82 153 51 113
3177 113 42 208 172 48 225 254 60 136 92 123 156 112 309 210 63 103 119 160 90 135 119 197 125 279 149 261 110 209 155 249
$$ packed form
5806A28N6j00pL5O3J29j45r7J79j23p7J39L4j59R2rj15K30j04k4L3j4p5K32j99L7J09j72l1
5466D5J42n3p5L6P8q4L8k3O0nj01P3L6n6n1j7L0K4o5R0om0N1oN8R5k07l2J05J14m4k8J8j50
5067E0J60M0m6j47R2Jj2jj24J57J29j08j06k2J03J8j75M0P0Q4K3M1j35K2O6j51O6J78l7j95
4715H1J1rK4k3J1q4M0K12l2j90K10l7j80K4J12l9l1L03J5k04p6q5L4M1j15J68k5Q7j78P7n2
4351I0k8J27p9O0o3k4j4O3Q8k9r6k8L9P9L0q3r5O8J2J03o0Q2mJ4j17K8P0R7k76l8R3q2J11
3963A38m3N9L9j03mn5O0jK05l9k44RJ28k1n9k9K8K8M6Lk6l4n9J7K7N6K5Q9n5j32j3J14K1p8
3564I7nN1o9J18q8M6j15N8Q2qj4l3J7M3j3mj05l1NJ44J5p8oM5j06K60k26J34n4p8P1j02O2
3177A13p1J66l6j24J77K9j94P6m4L1L3m4J97r9j47M0J6M1p0M5j6P8p2J54j30J12j51R9n4R4
$$ plain form
2825 249 102 156 82 47 58 181 128 209 219 102 190 52 178 26 143 209 226 173 163 133 213 116 78 74 188 230 178 96 127 120 101 89
2449 89 150 114 95 99 98 3 33 176 157 92 30 25 63 47 113 99 60 129 90 70 183 101 48 68 35 138 185 160 115 109 250 64 55 114 121 41
2027 41 124 146 281 277 46 240 219 130 112 113 124 136 139 100 141 197 168 22 110 152 164 263 236 159 207 57 81 90 104 125 153 142 168 156 184
1616 184 56 20 26 68 89 109 132 46 96 177 467 392 83 141 79 85 78 167 202 106 178 317 268 163 66 94 173 213 23 240 217 85
1240 85 93 187 193 140 237 127 42 14 261 168 207 237 224 222 196 102 113 95 308 126 134 110 235 236 141 159 188 104 111 160 182 158 74 45 168
829 168 140 230 95 107 215 118 130 151 235 62 116 211 141 247 173 72 104 192 120 87 105 40 135 278 161 190 200 55 101 40 128
466 128 87 27 143 163 62 153 107 33 73 30 144 48 48 66 11 141 74 126 89 118 90 82 25 113 221 64 79 67 36 138 90 188 167
78 167 96 166 237 74 144 55 95 72 68 115 82 70 99 149 116 184 148 115 165 132 36 105 76
$$ packed form
2825B49j47N4p4l5J1J23n3Q1J0j17Q8j38J26j52J17O6J7n3j0l0Q0r7l8mJ14M2n2q2L1pj9j2
2449H9O1l6j9Mjr5L0J43j9o5o2nL8j6O6j4l9O9l9k0J13q2n3K0l3J03M7k5m5oJ41j86rN9Pq0
2027D1Q3K2J35mk31J94k1q9j8JJ1J2Ll9M1N6k9j46Q8M2J2R9k7p7M8j50K4RJ4K1K8j1K6j2K8
1616A84j28l6OM2K1K0K3q6N0Q1K90p5l09N8o2OpQ9L5r6P2J39m9j05r7K8P9M0j90K17k3j32
1240H5QR4On3R7j10q5k8K47r3L9L0j3kk6r4J1j8K13j82Qk4J25Jr5J8K9q4PM9K2k4q4k9J23
829A68k8R0j35J2J08r7J2K1Q4j73N4R5p0J06p4j01L2Q8p2l3J8o5R5J43j17K9J0j45M6o1Q8
466A28m1o0J16K0j01R1m6p4M0m3J14r6%J8n5J30o7N2l7K9k8qn7Q8J08j57J5j2l1J02m8R8k1
78A67p1P0P1j63P0q9M0k3mM7l3j2K9N0l3O8l6l3N0l3r6O9k9
-192G6
##PAGE=	F1=5735.78
##FIRST=	25164.767445380970457,	5806.2096540000038658,	0.14575724303722381592
##DATA TABLE=	(F2++(Y..Y)), PROFILE
$$ plain form
5806 104 179 91 60 113 179 287 207 100 235 64 29 205 209 60 113 99 75 310 170 108 199 108 116 314 74 95 240 116 89 197
5454 197 180 51 138 204 89 117 91 126 142 21 100 156 144 22 40 106 95 71 190 103 108 145 125 188 301 76 73 168 228 159 170 181
5078 181 57 165 237 195 35 161 141 184 184 36 170 270 143 143 85 156 199 62 12 110 168 210 237 114 121 169 38 187 318 267
4726 267 101 81 50 127 82 116 8 50 217 185 112 322 237 40 77 159 133 76 363 392 167 112 62 53 74 78 242 153 234 69 131
4362 131 82 56 183 160 188 90 85 112 161 208 217 100 93 33 132 192 147 108 106 120 257 187 233 256 252 131 152 197 310 83 21 116 38 167
3963 167 69 201 190 83 93 36 123 112 284 222 55 56 92 110 54 80 80 93 147 172 96 98 32 76 69 132 134 196 145 45 49 152 150 102 112
3553 112 155 98 178 72 105 10 129 161 205 161 122 124 153 175 134 69 20 74 122 186 127 125 184 68 275 66 253 155 67 157 42 105
3177 105 35 174 128 64 269 262 17 158 149 44 137 61 314 229 57 56 93 180 129 68 118 179 143 281 131 282 176 180 156 207 118
$$ packed form
5806A04P5q8l1N3O6J08q0j07J35j71l5J76Mj49N3j4k4K35j40o2R1r1QJ98k40K1J45j24k7J08
5454A97j7j29Q7O6j15K8k6L5J6j21P9N6j2j22J8O6j1k4J19q7NL7k0O3J13k25lR5O0o9J1J1
5078A81j24J08P2m2j60J26k0M3%j48J34J00j27%n8P1M3j37n0R8N8M2K7j23PM8j31J49J31n1
4726B67j66k0l1P7m5L4j08M2J67l2p3K10q5j97L7Q2k6n7K87K9k25n5n0rK1MJ64q9Q1j65O2
4362A31m9k6J27k3K8r8nK7M9M7Rj17po0R9O0m5l9kJ4J37p0M6K3mj21K1M5J13k27o2R5p8J29
3963A67r8J32j1j07J0n7Q7j1J72o2j67JL6J8n6K6%J3N4K5p6Ko6M4pO3KO2n1j00MJ03km8J0
3553A12M3n7Q0j06L3r5J19L2M4m4l9KK9K2m1o5m9N4M8O4n9kN9j16K07k09J87r8q8R0j15O3
3177A05p0J39m6o4K05pk45J41rj05R3p6K53q5j72jL7Q7n1o1N0O1l6J38j50J51j06Mk4N1q9
$$ plain form
2813 118 142 86 71 118 227 127 233 227 110 204 77 125 36 134 212 219 192 175 147 241 116 74 91 108 165 209 128 172 119 87 51 71 54
2426 54 89 73 105 54 56 137 101 45 7 31 68 60 125 108 57 89 79 83 196 54 16 64 36 153 178 195 122 70 202 62 32 94 148 104
2027 104 161 159 246 250 67 279 243 167 157 113 143 113 114 109 145 230 185 66 156 167 133 223 253 189 234 99 29 62 55 70 155 102 151 198 177
1616 177 28 85 23 68 101 146 128 63 70 104 259 198 72 130 31 62 108 167 182 83 207 363 318 136 38 142 219 207 40 218 191
1252 191 148 123 171 211 127 207 130 58 53 267 184 234 246 242 173 152 91 107 66 292 113 148 155 278 192 112 163 191 63 111 136 161 155 100
853 100 42 228 138 255 192 163 217 104 199 202 226 75 114 219 148 246 156 81 87 177 82 140 119 14 77 174 142 180 175 49 58 56 156 92
454 92 32 147 117 65 170 124 47 71 37 121 36 21 72 46 128 85 191 132 116 98 47 27 125 165 73 41 106 26 164 72 234 205 27
67 27 191 238 85 192 128 76 64 70 88 85 55 56 125 137 199 183 123 139 125 52 95 66
$$ packed form
2813A18K4n6j5M7J09j00J06oj17R4j27M8q9R8P8Pk7j7k8R4j25m2J7J7N7M4q1M4n3l2l6K0j7
2426E4L5j6L2n1KQ1l6n6l8K4L7qO5j7n1L2j0MJ13j42l8M8k8J17K5J7p3n2J32j40l0O2N4m4
2027A04N7kQ7Mj83K12l6p6j0m4L0l0JnL6Q5m5j19R0J1l4R0L0o4M5j35p0L3pJ5Q5n3M9M7k1
1616A77j49N7o2M5L3M5j8o5PL4J55o1j26N8r9L1M6N9J5r9J24J56m5j82r8J04P7j2j67J78k7
1252A91m3k5M8M0q4Q0p7p2nK14q3N0J2mo9k1o1J6m1K26j79L5PJ23q6q0N1K8j28M8K5K5on5
853A00n8J86r0J17o3k9N4j13R5LK4j51L9J05p1R8r0p5OR0r5N8k1j05O3R7l2L8nj26RkJ00o4
454I2o0J15l0n2J05m6p7K4l4Q4q5j5N1k6Q2m3J06n9j6j8n1k0R8M0r2l2O5q0J38r2J62k9j78
67B7J64M7j53J07o4n2j2OJ8ll0JO9J2O2j6o0J6j4p3M3k9
-192F6
##PAGE=	F1=5633.52
##FIRST=	25164.767445380970457,	5806.2096540000038658,	0.42872929573059082031
##DATA TABLE=	(F2++(Y..Y)), PROFILE
$$ plain form
5806 57 168 88 39 108 174 246 244 144 212 66 43 237 201 56 94 52 132 343 182 84 232 128 160 293 36 48 208 157 129 184
5454 184 209 86 177 226 100 103 65 81 122 22 79 133 172 21 59 117 106 96 250 99 130 152 113 176 320 90 115 191 168 97 160
5090 160 150 87 148 216 188 38 152 123 212 211 34 131 215 106 190 112 122 210 102 32 96 103 167 203 103 91 115 43 234 308 231 108
4715 108 84 30 143 89 143 41 49 161 130 189 369 250 62 105 125 133 66 308 337 115 102 87 29 37 156 285 144 233 88 115
4362 115 74 64 182 199 210 93 104 139 186 179 211 97 115 29 77 152 158 176 106 114 282 189 196 248 233 131 143 149 272 125 46 116 48 193
3963 193 37 234 172 80 103 98 168 111 228 140 99 102 43 72 40 106 81 82 131 192 85 119 60 112 76 129 115 142 98 54 42 133 122 117 149
3553 149 170 108 161 53 59 42 155 141 219 155 112 106 104 165 116 99 37 113 44 157 129 154 202 98 228 56 247 112 54 155 48
3189 48 70 23 136 93 89 311 283 60 158 193 73 120 55 311 244 33 38 79 218 215 64 101 157 151 242 96 260 207 146 154 151 134 110
$$ packed form
5806E7J11q0m9O9O6P2kj00O8j46k3J94l6j45L8m2Q0K11j61r8J48j04L2J33k57J2J60n1k8N5
5454A84K5j23R1M9j26Ll8J6M1j00N7N4L9j51L8N8j1j0J54j51L1K2l9O3J44k30K5P6k3p1O3
5090A60j0o3O1O8k8j50J14k9Q9jj77R7Q4j09Q4p8J0Q8j08p0O4PO4L6j00j2K4p2J91P4p7j23
4715A08k4n4J13n4N4j02QJ12l1N9J80j19j88M3K0Qo7K42K9k22j3j5n8QJ19J29j41Q9j45K7
4362A15m1j0J18J7J1j17J1L5M7pL2j14J8q6M8P5OJ8p0QJ68r3PN2j5j02J2OJ23j47p9P0o8J45
3963A93j56J97o2r2K3nP0n7J17q8m1Ln9K9l2O6k5JM9O1j07L4n9N2l6N3j4K7m4m4j2R1j1nL2
3553A49K1o2N3j08Oj7J13j4P8o4m3okO1m9j7o2P6o9J13k8K5M8j04J30j72J91j35n8J01j07
3189D8K2m7J13m3mK22k8k23R8L5j20M7o5K56o7k11NM1J39lj51L7N6oR1j46J64n3o1Qlj7k4
$$ plain form
2801 110 105 100 164 263 132 238 227 116 201 100 81 77 179 213 198 199 181 154 237 98 88 98 34 100 219 147 201 97 147 46 47 36 123
2414 123 87 114 104 94 101 49 15 52 76 52 67 145 137 60 66 94 100 196 29 73 56 42 177 189 223 133 38 160 50 19 115 198 157 200 185
2003 185 198 189 75 310 253 185 180 96 150 97 77 107 145 235 166 123 198 165 131 189 279 219 245 132 27 23 53 58 165 71 129 230 169 90
1604 90 144 71 70 135 187 113 82 50 58 218 228 57 81 67 34 152 161 155 79 227 399 352 110 33 183 249 187 59 188 163 202 135 159
1217 159 224 111 164 140 79 84 257 186 249 237 256 132 107 84 103 64 279 103 166 191 270 122 114 165 193 20 125 102 113 124 121 37
841 37 260 117 252 267 219 211 127 271 249 183 74 104 206 143 220 110 77 114 180 53 166 136 19 44 60 125 167 145 48 35 82
477 82 179 89 43 127 55 69 176 129 78 81 41 127 79 29 81 81 100 93 241 164 108 102 9 43 144 108 90 77 135 55 192 83 256 252 57
67 57 212 221 124 247 190 96 50 74 78 112 76 80 85 155 219 211 140 131 99 76 98 43
$$ packed form
2801A10nnO4R9j31J06j1j11Q5j01j9mJ02L4j5Jj8k7Q3j39j0J0o4O6J19p2N4j04N0j01Jj1Q7
2414A23l6K7j0j0Pn2l4L7K4k4J5P8qp7OK8OR6j67M4j7j4J35J2L4r0r5J22j10l1R6Q3m1M3j5
2003A85J3rj14K35n7o8nq4N4n3k0L0L8R0o9m3P5l3l4N8R0o0K6j13j05mL0NJ07r4N8J01o1p9
1604I0N4p3jO5N2p4l1l2QJ60J0j71K4j4l3J18Rop6J48J72m7k42p7J50O6o2j28J29k5L9o7K4
1217A59O5j13N3k4o1NJ73p1O3j2J9j24k5k3J9l9K15j76O3K5P9j48qN1K8j73J05k3J1J1lq4
841C7K23j43J35J5m8qq4J44k2o6j09L0J02o3P7j10l3L7O6j27J13l0j17K5J6O5M2k2r7j3M7
477H2R7r0m6Q4p2J4J07m7n1Lm0Q6m8n0N2%J9pJ48p7n6or3L4J01l6j8j3N8q0J37j09J73mj95
67E7J55Rr7J23n7r4m6K4ML4l6MNP0O4qp1rl2k3K2n5
-192D3
##PAGE=	F1=5531.26
##FIRST=	25164.767445380970457,	5806.2096540000038658,	0.58153337240219116211
##DATA TABLE=	(F2++(Y..Y)), PROFILE
$$ plain form
5806 18 150 75 38 89 159 201 264 182 180 98 74 271 201 47 115 23 169 340 184 63 246 181 187 245 12 28 153 189 158 156 218 129
5431 129 212 239 123 87 42 58 111 66 93 117 189 37 64 106 132 104 285 109 140 155 91 144 328 102 143 201 85 79 177 131 108 160
5055 160 195 194 33 127 100 224 214 18 60 147 103 208 133 66 207 131 71 78 28 114 175 103 63 71 88 265 281 175 97 94 26 154 108
4668 108 176 88 57 104 81 245 386 258 92 131 76 126 69 249 263 57 103 117 27 41 218 296 128 234 110 98 76 96 192 215
4316 215 224 122 149 145 198 148 178 103 124 67 33 108 161 227 99 103 288 164 155 230 206 134 142 106 228 158 78 115 61 206 33 248 141
3928 141 83 110 153 204 87 147 46 136 142 56 27 30 112 69 64 97 190 90 142 88 145 84 114 98 101 58 71 31 107 98 136 192 176 99 137 73
3506 73 44 66 152 117 203 140 89 89 42 158 128 138 72 148 38 118 125 188 203 110 172 46 205 40 70 157 102 39 13 115 85 102 344
3118 344 316 109 138 209 163 104 96 304 255 26 60 98 259 279 94 65 131 151 175 50 187 184 113 165 93 137 68 118 123 187 284 144
$$ packed form
5806A8J32p5l7N1P0M2O3q2kq2k4J97p0j54O8r2J46J71j56j21J83o5ON8k33J6J25L6l1kO2q9
5431A29Q3K7j16l6m5J6N3m5K7K4P2j52K7M2K6k8J81j76L1J5o4N3J84k26M1N8j16oR8m6k3N2
5055A60L5jj61R4k7J24j0j96M2Q7m4J05p5o7J41p6o0Pn0Q6O1p2m0QJ7J77J6j06p8lo8J28m6
4668A08O8q8l1M7k3J64J41j28j66L9n5N0n7J80J4k06M6J4r0J4J77P8j68J06j24j2k2K0R6K3
4316B15Rj02K7mN3n0L0p5K1n7l4P5N3O6j28MJ85j24rP5k4p2Ql6J22p0q0L7n4J45j73K15j07
3928A41n8K7M3N1j17O0j01R0Oq6k9LQ2m3nL3R3j00N2n4N7o1L0j6Lm3J3m0P6rL8N6j6p7L8o4
3506G3k9K2Q6l5Q6o3n1%m7J16l0J0o6P6j10Q0PO3J5r3O2j26J59j65L0Q7n5o3k6J02l0J7K42
3118C44k8k07K9P1m6n9qK08m9k29L4L8J61K0j85k9O6K0K4j25J37lp1N2p2M4o9N0NO4R7j40
$$ plain form
2743 144 220 210 111 181 118 60 107 224 210 163 181 166 155 205 73 96 93 34 40 210 149 209 69 233 36 75 76 161 122 124 143 133 95 52
2344 52 41 90 110 32 76 161 167 65 93 133 109 181 31 119 48 55 205 204 241 146 32 123 27 43 156 253 193 238 220 150 110 64 321 244
1945 244 181 189 68 149 89 32 94 140 208 120 178 233 148 158 158 298 240 235 145 77 19 141 120 169 55 102 243 159 138 184 134 88 160 224
1545 224 86 105 30 36 217 257 69 36 149 8 189 145 115 84 235 407 365 95 47 204 256 156 79 164 151 240 134 146 232
1205 232 132 123 152 100 97 229 172 244 209 265 109 66 89 112 97 272 127 181 201 214 44 158 167 187 48 145 64 59 82 139 30 244
829 244 81 219 306 262 196 165 321 280 129 63 90 168 123 186 56 70 174 202 42 161 158 54 90 63 106 146 109 43 37 90 193
466 193 77 64 119 89 70 168 128 107 103 45 179 139 59 99 97 57 93 269 178 104 105 39 88 164 57 118 146 139 100 219 116 248 291 135
67 135 206 178 174 295 231 124 27 91 86 166 119 97 35 157 232 221 163 141 59 85 111 9
$$ packed form
2743A44P6j0r9P0o3n8M7J17j4m7J8j5j1N0j32K3ln9OJ70o1O0j40J64j97L9JQ5l9KJ9j0l8m3
2344E2j1M9K0p8M4Q5Oj02K8M0k4P2j50Q8p1PJ50jL7r5j14R1r6J6J13R7o0M5j8p0m0m6K57p7
1945B44o3Qj21Q1o0n7O2M6O8q8N8N5q5J0%J40n8nr0o8n8J22k1M9j14M7J41q4k1M6n0m6P2O4
1545B24j38J9p5OJ81M0j88l3J13j41J81m4l0l1J51J72m2k70m8J57N2j00p7Q5j3Q9j06J2Q6
1205B32j00rK9n2lJ32n7P2l5N6j56m3K3K3j5J75j45N4K0J3j70J14RK0j39R7q1nK3N7j09K14
829B44j63J38Q7m4o6l1J56m1j51o6K7P8m5O3j30J4J04K8j60J19lj04L6k7M3M0l7o6oN3J03
466A93j16j3N5l0j9R8m0k1mn8J34m0q0M0km0L6J76r1p4Jo6M9P6j07O1K8pl9J19j03J32M3j56
67A35P1k8mJ21o4j07r7O4nQ0m7k2o2J22P5j1n8k2q2K6K6j02
-192I
##PAGE=	F1=5429
##FIRST=	25164.767445380970457,	5806.2096540000038658,	0.73698133230209350586
##DATA TABLE=	(F2++(Y..Y)), PROFILE
$$ plain form
5806 79 126 57 50 61 131 176 270 206 151 116 116 301 209 41 153 56 181 298 174 50 237 221 191 183 50 69 80 207 169 128 215 171
5431 171 246 247 156 76 61 86 116 103 119 115 188 37 50 86 164 99 282 118 139 161 70 98 323 106 157 194 4 138 214 139 114 166
5055 166 172 215 10 95 76 220 195 50 27 84 107 191 150 23 194 158 115 69 51 91 154 102 36 40 132 271 237 108 68 102 30 169
4679 169 139 213 137 68 60 48 269 376 268 126 146 39 111 76 198 188 3 107 148 32 70 256 268 102 231 128 87 86 137
4339 137 212 203 224 157 195 130 189 131 126 127 119 83 9 77 155 252 84 86 269 114 143 222 183 133 153 76 193 181 114 119 76 203 52 243
3940 243 104 89 110 195 230 59 79 76 157 172 103 61 24 97 43 66 53 166 110 164 111 172 84 85 81 104 55 108 64 86 83 149 228 173 71
3529 71 105 106 77 85 118 103 154 126 55 78 54 179 158 167 109 180 108 93 124 221 194 99 113 40 143 39 103 180 189 75 12 117 100 100 362
3118 362 347 139 114 192 228 90 137 297 258 68 85 148 290 302 98 47 122 147 110 17 103 123 80 182 44 140 29 115 127 181
$$ packed form
5806G9M7o9pJ1P0M5R4o4n5l5%J85r2j68J12r7J25J17j24j24J87j6l0qj33J9J1J27l8m1Q7m4
5431A71P5Jr1q0j5K5L0j3J6mP3j51J3L6P8o5J83j64K1K2r1K8K25k17N1L7j90J34P6p5k5N2
5055A66OM3k05Q5j9J44k5j45k3N7K3Q4m1j27J71l6m3m6j8M0O3n2o6MR2J39l4j29m0L4p2J39
4679A69l0P4p6o9qj2K21J07j08j42K0j07P2l5J22j0j85J04M1j16L8J86J2j66J29j03m1jN1
4339A37P5rK1o7L8o5N9n8nJql6p4O8P8R7j68KJ83j55K9P9l9n0K0p7J17j2o7Nm3J27j51J91
3940B43j39j5K1Q5L5j71K0lQ1J5o9m2l7P3n4K3j3J13n6N4n3O1q8JmK3m9N3m4K2lO6P9n5j02
3529G1L4Jk9QL3j5N1k8p1K3k4J25k1Rn8P1p2j5L1R7k7r5J4p3J03j04O4P7Rj14o3J05j7%K62
3118C62j5k08k5P8L6j38M7J60l9j90J7O3J42J2k04n1P5K5l7r3Q6K0m3J02j38R6j11Q6J2N4
$$ plain form
2766 181 286 157 178 167 92 149 136 58 122 249 207 118 140 131 148 153 65 89 79 80 31 189 133 197 82 311 21 84 99 182 146 131 166
2379 166 174 135 100 63 107 121 40 91 166 186 77 150 186 115 154 50 149 46 75 230 212 245 160 47 90 28 68 180 293 208 269 251
2003 251 106 47 34 302 214 156 189 40 147 86 32 79 135 162 91 216 255 126 192 135 303 247 207 138 111 55 237 195 162 53
1651 53 72 231 150 161 202 195 111 161 247 51 135 1 12 139 195 119 107 221 15 216 123 63 103 227 381 358 92 62 198 243
1299 243 130 102 154 160 260 127 129 235 187 98 159 130 93 187 143 220 167 265 111 31 108 144 137 256 154 186 189 127 61 214 168 177 82
912 82 159 29 59 79 152 54 181 48 161 303 278 177 186 334 284 112 62 89 112 93 161 40 76 228 224 52 127 182 93 139 139 79
536 79 113 66 42 70 90 191 58 93 151 172 74 141 125 116 142 54 248 199 83 118 92 21 91 272 173 103 113 81 158 184 28 151 201
149 201 112 154 240 143 216 309 184 159 106 218 324 247 141 45 118 110 230 161 86 27 136 226 205 188 153 33 76 124 31
$$ packed form
2766A81J05j29K1j1p5N7j3p8O4J27m2q9K2rJ7Nq8K4j0Jm9J58n6O4j15K29k90O3J5Q3l6j5L5
2379A66Ql9l5l7M4J4q1N1P5K0j09P3L6p1L9j04R9j03K9J55j8L3q5j13M3o2M0J12J13q5O1j8
2003B51j45n9j3K68q8n8L3j49J07o1n4M7N6K7p1J25L9j29O6n7J68n6m0o9k7n6J82m2l3j09
1651E3J9J59q1J1M1pq4N0Q6j96Q4j34J1J27N6p6j2J14k06K01r3o0M0J24J54k3k66l0J36M5
1299B43j13k8N2OJ00j33KJ06m8q9O1k9l7R4m4P7n3R8j54q0P7L6pJ19j02L2Lo2o6J53m6Rr5
912H2P7j30L0K0P3r8J27j33J13J42k5j01RJ48n0j72n0K7K3j9O8j21L6J52mj72P5N5q9M6%o0
536G9L4m7k4K8K0J01j33L5N8K1r8O7j6rK6q8J94m9j16L5k6p1P0J81r9p0J0l2P7K6j56J23N0
149B01q9M2Q6r7P3R3j25k5n3J12J06p7j06r6P3qJ20o9p5n9J09R0k1j7l5j20M3M8r3
-192C1
##PAGE=	F1=5326.74
##FIRST=	25164.767445380970457,	5806.2096540000038658,	0.92235153913497924805
##DATA TABLE=	(F2++(Y..Y)), PROFILE
$$ plain form
5806 136 100 40 56 66 94 178 266 212 132 114 160 321 216 46 183 91 173 222 151 48 208 226 168 121 74 101 19 209 159 120 213
5442 213 212 279 251 193 80 96 125 135 130 137 118 168 23 23 72 195 96 241 111 130 169 66 49 304 101 158 173 84 203 241 156 109
5067 109 143 158 249 24 66 56 201 158 108 112 50 93 141 163 78 178 177 160 82 94 111 135 89 35 20 162 249 176 41 26 101 32 191
4679 191 182 248 178 71 60 28 260 348 283 159 144 64 92 75 162 123 63 108 175 30 108 267 207 69 221 140 82 91 172 237 164 206
4304 206 176 220 101 161 125 68 158 103 88 25 67 143 249 67 66 224 50 172 233 166 124 174 50 178 196 150 130 92 188 54 225
3940 225 73 97 101 220 252 92 94 138 156 190 143 121 22 69 27 113 51 131 128 178 127 190 73 62 67 132 94 166 117 82 82 154 250 164 36
3529 36 67 131 112 105 61 114 81 120 29 75 121 226 183 173 133 205 151 109 136 244 182 72 58 39 81 102 125 229 281 129 27 125 115
3142 115 91 360 362 151 108 146 249 82 169 293 252 111 104 205 303 284 76 114 159 146 97 48 116 62 43 190 20 156 40 92
$$ packed form
5806A36l6o0J6J0K8Q4Q8n4q0j8M6J61j05j70J37r2Q2M9p1j03J60J8n8m7m7K7q2J90n0l9R3
5442B13jO7k8n8j13J6K9J0nPj9N0j45%M9J23r9J45j30J9L9j03j7K55k03N7J5q9J19L8q5m7
5067A09L4J5R1k25M2j0J45m3n0Mo2M3M8K2q5J00jj7p8J2J7K4m6n4j5J42Q7p3j35j5P5o9J59
4679A91rO6p0j07j1l2K32Q8o5j24j5q0K8j7Q7l9o0M5O7j45P8J59o0j38J52q1n8RQ1O5p3M2
4304B06l0M4j19O0l6n7R0n5j5o3M2P6J06j82jJ58j74J22O1o7m2N0j24J28J8m6k0l8R6j34J71
3940B25j52K4MJ19L2j60KM4J8L4m7k2r9M7m2Q6o2Q0lN0n1O3j17j1NO5l8P2m9l5%P2R6q6j28
3529C6L1O4j9pm4N3l3L9r1M6M6J05m3j0m0P2n4m2K7J08o2j10j4j9M2K1K3J04N2j52j02R8j0
3142A15k4K69Kk11m3L8J03j67Q7J24m1j41pJ01R8j9k08L8M5j3m9m9O8n4j9J47j70J36j16N2
$$ plain form
2790 92 108 143 266 163 115 101 61 111 153 60 119 253 209 72 92 101 128 92 82 70 63 107 75 160 107 167 139 361 66 83 97 181 147
2402 147 130 172 215 191 144 73 92 101 72 112 157 191 96 210 238 123 127 69 160 54 93 246 208 239 170 53 69 53 90 171 305 201
2027 201 286 266 70 78 26 249 168 120 183 21 148 82 85 77 131 129 126 222 259 108 215 128 291 235 168 132 132 85 321 266 142 57 42
1639 42 194 140 155 199 241 124 132 248 13 166 47 47 23 133 171 181 265 30 231 105 13 143 208 327 334 99 77 171 227 132
1287 132 128 168 178 261 119 101 231 244 92 158 167 77 133 105 184 120 256 136 18 131 187 167 216 151 183 171 33 122 258 170 168 99
912 99 155 6 108 118 156 105 93 70 91 264 259 161 170 306 260 142 83 110 48 75 150 70 96 254 230 65 82 201 123 166 176 45
536 45 65 20 59 125 117 172 42 125 194 231 85 95 117 97 199 76 303 247 97 129 71 65 96 252 153 97 128 118 245 203 63 187
160 187 231 58 208 248 149 172 300 192 80 27 246 329 238 139 87 138 142 281 191 54 81 99 198 161 212 154 67 59 127 71
$$ packed form
2790I2J6L5J23j03m8j4m0N0M2r3N9J34m4j37K0RK7l6j0j2pM4l2Q5n3O0k8K22k95J7J4Q4l4
2402A47j7M2M3k4m7p1J9Rk9M0M5L4r5J14K8j15Mn8R1j06L9J53l8L1o9j17J6j6L7Q1J34j04
2027B01Q5k0j96Qn2K23q1m8O3j62J27o6LqN4klR6L7j51J07q7J63n6o7l6%m7K36n5j24q5j5
1639D2J52n4J5M4M2j17QJ16k35J53j19%k4J10L8J0Q4k35K01j26r2J30O5J19Pk35k2R4N6r5
1287A32mM0J0Q3j42j8J30J3j52O6Rr0N6k8P9o4J36j20j18J13N6k0M9o5L2j2j38Q9J36q8ko9
912I9N6j49J02J0L8n1j2k3K1J73nr8RJ36m6j18n9K7o2K7P5q0K6J58k4j65J7J19p8M3J0j31
536D5K0m5L9O6qN5j30Q3O9L7j46J0K2k0J02j23K27n6j50L2n8oL1J56r9n6L1j0J27m2j40J24
160A87M4j73J50M0r9K3J28j08j12n3K19Q3r1r9n2N1MJ39r0j37K7J8R9l7N1n8q7qO8n6
-192G1
##PAGE=	F1=5224.49
##FIRST=	25164.767445380970457,	5806.2096540000038658,	0.95462030172348022461
##DATA TABLE=	(F2++(Y..Y)), PROFILE
$$ plain form
5806 173 72 33 59 116 64 190 256 204 121 100 198 324 211 52 195 117 150 133 113 65 171 189 121 68 75 107 77 200 128 135 226 255
5431 255 308 249 225 101 119 149 158 145 145 130 141 17 6 71 215 115 172 85 111 174 73 11 269 87 144 141 144 247 238 159 98 86 180
5043 180 285 59 51 42 165 106 167 173 65 53 74 172 129 158 177 200 104 100 127 113 62 76 8 175 204 107 34 29 91 35 212 228 276 204
4644 204 60 84 14 225 322 300 186 121 104 86 62 148 74 113 106 197 19 148 252 128 34 207 150 84 89 189 256 108 172 168 209
4280 209 69 122 116 31 177 84 96 60 72 128 216 58 55 158 34 208 242 147 108 199 33 184 206 184 145 110 169 34 203 58
3928 58 100 86 222 268 160 140 160 140 202 175 168 38 41 66 185 105 98 135 178 138 198 51 91 62 154 143 235 164 86 94 151 253 158 38
3529 38 28 143 138 129 23 143 38 121 46 78 176 272 192 156 135 222 164 151 161 248 169 48 28 41 38 132 123 279 358 169 53 125 116 86
3130 86 336 353 152 119 81 219 82 194 291 236 140 113 247 299 240 73 199 224 153 132 72 177 43 16 177 39 179 77
$$ packed form
5806A73j01l9K6N7n2J26O6n2q3k1R8J26j13j59J43p8L3j7k0m8J06J8o8n3PL2l0J23p2PR1K9
5431B55N3n9k4j24J8L0Rj3%j5J1j24j1O5J44j00N7q7K6O3j01o2K58j82N7lLJ03rp9o1j2R4
5043A80J05k26qrJ23n9O1Oj08j2K1R8m3K9J9K3r6mK7j4n1J4o8J67K9r7p3nO2n6J77J6M8p2
4644B04j44K4p0K11R7k2j14o5j7j8k4Q6p4L9pR1j78J29J04j24r4J73n7o6NJ00O7j48O4mM1
4280B09j40N3oq5J46r3J2l6J2N6Q8j58lJ03j24J74L4r5l9R1j66J51K2k2l9l5N9j35J69j45
3928E8M2j4J36M6j08k0K0k0O2k7pj30LK5J19q0pL7M3m0O0j47M0k9R2j1R2p1p8QN7J02r5j20
3529C8j0J15nrj06J20j05Q3p5L2R8R6q0l6k1Q7n8j3J0Q7p9j21k0J3lR4rJ56P9j89j16P2rl0
3130H6K50J7k01l3l8J38j37J12R7n5r6k7J34N2n9j67J26K5p1k1o0J05j34k7J61j38J40j02
$$ plain form
2801 77 51 76 78 220 158 50 28 23 77 167 58 101 250 219 42 74 107 96 30 101 49 62 110 108 127 75 123 200 376 132 115 78 159
2414 159 128 118 163 250 242 173 77 48 54 116 133 138 184 115 254 273 138 117 78 152 73 97 245 195 224 175 48 68 68 115 127 284 178 284
2015 284 258 73 126 74 170 119 94 176 11 148 75 134 85 129 137 169 194 241 98 219 132 266 202 128 150 148 106 378 322 119 57 13
1639 13 135 127 121 175 267 129 80 225 21 191 105 102 87 168 199 223 271 34 231 101 70 199 182 254 298 109 93 148 236 160 154 203
1264 203 192 243 112 62 215 283 101 147 201 61 71 74 150 82 238 172 51 145 223 182 148 107 179 161 40 157 281 172 169 110 128
900 128 6 150 148 147 163 106 119 32 205 205 153 115 243 210 169 107 139 11 95 149 89 117 241 213 66 49 203 137 168 172 13 10 42
513 42 82 189 175 141 48 153 217 246 103 36 104 61 262 114 323 274 106 134 58 112 109 216 128 84 149 151 331 220 120 223 230
149 230 13 251 237 133 133 271 162 77 114 254 309 208 116 115 138 172 301 199 15 134 85 161 96 230 140 104 57 113 106
$$ packed form
2801G7k6K5KJ42o2j08k2nN4R0j09M3J49l1j77L2L3j1o6P1n2J3M8kJ9n2M8P7J76k44j7l7Q1
2414A59l1j0M5Q7qo9r6k9OO2J7NM6o9J39J9j35k1l9P4p9K4J48n0K9m9j27K0%M7J2J57j06J06
2015B84k6j85N3n2R6n1k5Q2j65J37p3N9m9M4QL2K5M7j43J21q7J34o4p4K2km2K72n6k03o2m4
1639A3J22qoN4R2j38m9J45k04J70q6lj5Q1L1K4M8k37J97j30l1J29j7P2M4j89j6N5Q8p6oM9
1264B03j1N1j31n0J53O8j82M6N4j40J0LP6o8J56o6j21R4P8m1l4m1P2j8j21J17J24j09ln9J8
900A28j22J44kjJ6n7J3q7J73%n2l8J28l3m1o2L2j28Q4N4o0K8J24k8j47j7J54o6L1Mj59lL2
513D2M0J07j4l4r3J05O4K9j43o7O8m3K01j48K09m9j68K8p6N4lJ07q8m4O5KJ80j11j00J03P
149B30k17K38j4j04%J38j09q5L7J40N5j01r2jK3L4J29j02j84J19m9P6o5J34r0l6m7N6p
-192A06
##PAGE=	F1=5122.23
##FIRST=	25164.767445380970457,	5806.2096540000038658,	0.78510314226150512695
##DATA TABLE=	(F2++(Y..Y)), PROFILE
$$ plain form
5806 181 45 37 82 169 67 191 240 190 108 82 220 308 191 48 190 135 122 90 61 99 146 118 68 33 58 83 131 187 84 158 256
5442 256 297 326 236 247 132 127 154 177 148 151 171 137 36 29 68 222 150 111 53 89 176 84 27 218 67 113 106 175 263 204 138 87 13 241
5043 241 311 84 49 49 114 48 215 198 103 32 39 173 160 134 151 227 118 72 112 89 31 122 14 175 151 44 77 69 74 49 219 269 295
4656 295 214 37 98 20 182 310 311 201 80 133 106 52 156 36 145 102 211 9 178 216 56 25 198 157 87 81 182 261 52
4316 52 134 131 160 51 86 101 61 178 68 112 108 81 114 162 65 84 94 101 229 230 113 90 221 46 196 209 208 163 126 156 23 182 56
3928 56 96 68 196 267 222 164 141 126 212 198 192 72 44 120 260 165 77 130 161 144 197 33 151 72 160 193 293 189 87 113 146 239
3553 239 159 71 33 141 157 155 77 175 111 120 68 86 211 295 182 129 112 231 152 194 188 230 151 58 52 38 25 122 97 310 405 191 84
3165 84 114 101 90 293 321 155 129 15 140 103 219 289 211 147 111 261 281 188 111 274 289 172 157 79 205 41 55 140 61 195
$$ packed form
5806A81j36qM5Q7j02J24M9n0q2k6J38Q8j17j43J42n5j3l2k9L8M7k8n0l5K5K5M8N6j03P4R8
5442B56M1K9r0J1j15nK7K3k9LK0l4j01pL9J54p2l9n8L6Q7r2n7J91j51M6pO9Q8n9o6n1p4K28
5043B41P0k27l5%O5o6J67j7r5p1PJ34j3k6J7P6j09m6M0k3n8R1j08J61k4j07L3qNk5J70N0K6
4656B95q1j77O1p8J62J28Jj10j21N3k7n4J04j20J09m3J09k02J69L8j60l1J73m1p0oJ01P9k09
4316E2Q2lK9j09L5J5m0J17j10M4mk7L3M8r7J9J0PJ28Jj17k3J31j75J50J3jm5l7L0j33J59j26
3928E6M0k8J28P1m5n8k3j5Q6j4oj20k8P6J40r5q8N3L1j7N3j64J18p9Q8L3J00j04j02K6L3R3
3553B39q0q8l8J08J6kp8R8o4Rn2J8J25Q4j13n3j7J19p9M2oM2p9r3oj4j3R7k5K13R5k14j07
3165H4L0j3j1K03K8j66k6j14J25l7J16P0p8o4l6J50K0r3p7J63J5j17j5p8J26j64J4Q5p9J34
$$ plain form
2813 195 109 2 67 35 152 141 63 81 15 52 175 53 76 253 233 46 92 131 67 33 111 42 90 87 121 90 48 74 243 356 200
2449 200 177 62 124 97 95 140 271 275 182 82 27 23 165 146 113 169 124 272 280 156 138 74 129 100 90 224 176 205 174 59 78 67 146
2062 146 64 234 147 265 225 112 153 118 98 106 98 172 18 137 62 169 88 124 164 183 140 202 93 204 133 232 150 100 184 166 121 402
1686 402 356 116 45 17 67 110 67 134 271 136 15 182 49 202 166 155 138 211 193 223 237 28 214 104 133 256 152 175 255
1346 255 117 116 171 283 196 174 245 196 212 104 11 183 297 115 129 219 63 15 61 126 68 217 210 96 151 240 182 63 38 181
994 181 159 76 163 283 177 182 136 78 14 176 150 131 218 213 158 44 152 124 148 33 158 144 170 123 161 59 132 146 88 132 189 186 50
606 50 50 183 129 146 135 32 70 87 93 246 233 102 70 170 206 218 121 25 93 66 318 160 299 274 114 142 83 136 112 172 110 81
231 81 174 176 401 233 176 259 203 72 273 211 103 110 232 110 174 219 243 267 166 76 117 116 191 282 184 32 186 125 138 21 239
$$ packed form
2813A95q6j07O5l2J17j1p8J8o6L7J23j22K3J77k0j87M6L9o4l4P8o9M8lL4l1m2K6J69J13j56
2449B00k3j15O2k7kM5J31Mr3j00n5mJ42j9l3N6m5J48Qj24j8o4N5k9j0J34m8K9l1j15J9j1P9
2062A46q2J70q7J18m0j13M1l5k0QqP4j54J19p5J07q1L6M0J9m3O2j09J11p1R9q2n0Q4j8m5K81
1686D02m6k40p1k8N0M3m3O7J37j35j21J67j33J53l6j1j7P3j8L0J4k09J86j10K9J23j04K3Q0
1346B55j38jN5J12q7k2P1m9J6j08r3J72J14j82J4R0j56m8M6O5n8J49pj14N5Q9n8j19k5J43
994A81k2q3Q7J20j06Nm6n8o4J62k6j9Q7nn5j14J08k8K4j15J25j4K6m7L8j02P3J4n8M4N7lj36
606E0%J33n4J7j1j03L8J7OJ53j3j31l2J00L6J2r7r6O8k7K52j58J39k5j60K8n9N3k4O0o2k9
231H1R3KK25j68n7Q3n6j31K01o2j08PJ22j22O4M5K4K4j01r0M1jP5R1r8j52J54o1J3j17K18
$$ plain form
-133 239 111 123 78 84 132
$$ packed form
-133B39j28J2m5OM8
-192A32
##PAGE=	F1=5019.97
##FIRST=	25164.767445380970457,	5806.2096540000038658,	0.67143332958221435547
##DATA TABLE=	(F2++(Y..Y)), PROFILE
$$ plain form
5806 161 17 54 126 201 88 173 217 179 99 69 217 274 159 28 180 146 110 149 21 135 152 49 80 27 61 45 166 171 37 173
5454 173 289 326 328 207 253 162 130 144 182 137 159 239 176 52 44 51 215 180 107 55 74 183 108 52 152 45 70 72 176 251 146 95
5078 95 76 84 308 314 94 47 78 54 29 241 186 145 87 88 164 170 115 104 237 113 38 73 65 39 154 19 168 113 26 103 97 53 76 204
4679 204 291 304 208 9 91 39 144 303 304 204 27 144 138 71 185 47 155 97 217 35 189 164 52 39 191 160 84 71 154
4339 154 249 51 103 70 84 46 70 92 98 161 56 130 160 89 109 95 81 146 107 160 229 192 66 79 235 65 201 198 219 178 137 153 59
3952 59 163 54 84 60 144 244 263 162 97 127 221 216 189 114 74 174 327 215 67 119 126 145 186 44 207 82 156 237 327 186
3600 186 76 131 144 212 168 97 73 131 177 185 122 201 178 107 84 98 224 287 157 116 69 235 128 218 206 191 122 88 74 26 32 91 57
3212 57 306 416 199 115 102 75 97 235 269 163 129 63 32 147 248 282 179 133 98 241 256 142 148 325 338 202 159 73 195
$$ packed form
5806A61j44L7P2P5j13Q5M4l8q0l0J48N7j15j31J52l4l6L9j28J14J7j03L1n3L4j6J21Nj34J36
5454A73J16L7Kj21M6r1l2J4L8m5K2Q0o3j24qPJ64l5p3n2J9J09p5n6J00j07K5KJ04P5j05n1
5078I5j9QK24Ok20m7L1k4k5K12n5m1n8JP6On5j1J33j24p5L5qk6J15j35J49n5q7P7om4K3J28
4679B04Q7J3r6j99Q2n2J05J59Jj00j77J17oo7J14j38J08n8J20j82J54k5j12j3J52l1p6j3Q3
4339A54R5j98N2l3J4l8K4K2OO3j05P4L0p1K0j4j4O5l9N3O9l7j26J3J56j70J36lK1m1m1J6r4
3952E9J04j09L0k4Q4J00J9j01o5L0R4nk7p5m0J00J53j12j48N2PJ9M1j42J63j25P4Q1R0j41
3600A86j10N5J3O8m4p1k4N8M6Qo3P9k3p1k3J4J26O3j30m1m7J66j07R0j2j5o9l4j4m8ON9l4
3212E7K49J10k17q4j3k7K2J38L4j06l4o6l1J15J01L4j03m6l5J43J5j14OJ77J3j36m3q6J22
$$ plain form
2872 195 35 100 87 75 188 131 39 90 112 72 119 126 161 46 46 180 53 57 263 245 55 103 139 76 90 117 54 135 39 112 64 58 27
2484 27 259 308 260 241 66 87 74 62 104 268 282 171 92 90 78 205 146 87 151 117 259 256 174 182 62 94 132 94 189 154 184 174 109
2097 109 91 52 173 29 171 115 237 169 145 163 147 118 139 121 176 52 115 43 180 76 116 175 162 81 151 90 175 126 198 90 89
1733 89 207 183 131 394 361 147 21 58 30 90 50 84 258 149 46 130 69 193 220 200 138 218 161 188 172 33 183 105 185 301
1381 301 119 101 209 120 152 234 349 231 180 279 188 173 95 48 132 290 130 105 215 86 57 62 103 69 192 239 148 159 233 168 36
1017 36 73 189 154 75 158 274 182 202 181 32 43 184 128 125 258 304 178 69 124 34 141 68 71 75 148 128 170 89 159 135 74 138 106
630 106 175 16 55 141 104 104 78 66 135 114 81 278 267 62 89 171 165 157 136 79 86 118 352 205 235 245 119 148 126 133 97 132 106 110 199
219 199 190 440 235 216 284 161 110 268 176 75 106 198 84 255 294 221 210 121 27 94 82 195 229 150 62 232 178 141 51 233 73
$$ packed form
2872A95j60O5j3j2J13n7r2N1K2m0M7PL5j15%J34j27MK06j8j90M8L6o3J4K7o3Q1r6P3m8ol1
2484B7K32M9m8j9j75K1j3j2M2J64J4j11p9kj2J27n9n9O4l4J42lq2Qj20L2L8l8R5l5L0j0o5
2097A09j8l9J21j44J42n6J22o8k4J8j6k9K1j8N5j24O3p2J37j04M0N9j3q1P0o1Q5m9P2j08j
1733H9J18k4n2K63l3k14j26L7k8O0m0L4J74j09j03Q4o1J24K7k0o2Q0n7K7j6j39J50p8Q0J16
1381C01j82j8J08q9L2Q2J15j18n1R9r1j5p8m7Q4J58j60k5J10j29k9NM1l4J23M7r1J1P4o5j32
1017C6L7J16l5p9Q3J16r2K0k1j49J1J41n6lJ33M6j26j09N5r0J07p3LMP3k0M2q1P0k4o1O4l2
630A06O9j59L9Q6l7%k6j2O9k1l3J97j1k05K7Q2oqk1n7PL2K34j47L0J0j26K9k2Pl6L5k6MQ9
219A99rK50k05j9O8j23n1J58r2j01L1R2j14J71L9p3j1q9r4O7j2J13L4p9q8J70n4l7r0J82j60
$$ plain form
-145 73 121 103 44 144
$$ packed form
-145G3M8j8n9J00
-192A44
##PAGE=	F1=4917.71
##FIRST=	25164.767445380970457,	5806.2096540000038658,	0.7180233001708984375
##DATA TABLE=	(F2++(Y..Y)), PROFILE
$$ plain form
5806 118 15 85 175 203 100 140 188 174 107 62 186 225 123 7 181 151 129 219 72 164 178 100 146 36 105 59 186 150 1 175
5454 175 311 333 310 163 245 179 132 129 166 111 164 307 232 64 58 27 199 188 135 89 79 202 156 80 80 23 29 44 149 218 83 39 64
5067 64 159 352 290 91 39 117 14 71 240 145 180 140 127 147 168 119 63 225 87 63 61 43 75 161 39 159 102 36 105 106 34 106
4691 106 163 285 303 195 23 62 57 112 283 276 200 36 140 161 107 227 110 150 94 217 65 175 109 82 41 176 150 71 61 113
4339 113 224 92 87 30 46 51 70 113 124 131 45 144 206 91 119 37 96 219 184 203 208 140 35 78 239 65 198 173 217 180 142 152 87
3952 87 147 50 69 71 73 204 276 140 48 139 228 227 161 154 104 217 373 249 63 118 81 144 169 71 243 83 158 269 328 161 56 141
3576 141 151 181 178 109 108 113 203 214 144 220 212 80 106 118 220 248 124 129 18 235 104 213 208 136 88 116 76 14 61 90 41 266 392
3189 392 199 142 98 47 102 171 204 164 123 117 98 206 277 268 145 104 77 192 229 102 157 350 365 238 146 61 165 76 143 27 78
$$ packed form
5806A18j03P0R0K8j03M0M8j4o7m5J24L9j02j16J74l0k2R0j47R2J4p8M6j10O9m6J27l6j49J74
5454A75J36K2k3j47Q2o6m7lL7n5N3J43p5j68ol1J72j1n3m6j0J23m6p6%n7OJ5J05O9j35m4K5
5067F4R5J93o2j99n2P8j03N7J69r5L5m0j3K0K1m9n6J62j38k4kj8L2Q6j22J20n7o6O9Jp2P2
4691A06N7J22J8j08j72L9nN5J71pp6j64J04K1n4J20j17M0n6J23j52J10o6k7m1J35k6p9j0N2
4339A13J11j32nn7J6NJ9M3J1Pq6R9O2j15K8q2N9J23l5J9No8j05M3J61j74J33k5M4l7l8J0o5
3952H7O0r7J9KKJ31P2j36r2R1Q9jo6pn0J13J56j24j86N5l7O3K5r8J72j60P5J11N9j67j05Q5
3576A41J0L0lo9jNR0J1p0P6qj32K6J2J02K8j24Nj11K17j31J09np2m8K8m0o2M7K9m9K25J26
3189C92j93n7m4n1N5O9L3m0m1oj9J08P1rj23m1k7J15L7j27N5J93J5j27r2q5J04q9O7j16N1
$$ plain form
2825 78 158 138 63 104 187 50 103 179 220 66 60 185 60 59 268 251 60 88 124 108 140 126 70 187 30 82 81 109 14 246 245 306 286
2438 286 77 65 64 16 59 239 262 144 99 138 123 220 132 62 135 92 219 209 188 233 56 58 163 129 155 134 162 181 173 104 33 182 79
2050 79 110 95 208 98 155 166 161 185 176 138 187 93 87 24 162 47 104 161 118 54 100 90 137 115 170 49 88 204 192 137 362 336 190
1663 190 19 112 75 72 114 43 232 159 91 87 81 166 255 235 117 210 118 138 103 64 146 98 221 321 83 44 162 124 201 301 409 264
1287 264 163 291 173 135 85 103 70 273 148 79 189 114 97 56 70 70 160 255 200 178 208 146 106 152 193 149 74 171 263 187 223 221 76
900 76 83 178 108 137 273 349 174 70 118 49 127 148 18 43 120 124 166 99 163 114 60 141 24 196 31 44 86 82 51 19 98 184 116 44
501 44 275 268 32 97 158 112 86 148 116 75 160 359 243 148 192 114 142 165 110 63 110 110 157 218 190 438 222 230 292 118 116 237 147 60
102 60 112 168 119 292 322 194 145 79 31 56 62 184 157 108 82 270 212 150 106 210 33 103 121 20 143
$$ packed form
2825G8Q0k0p5M1Q3j37N3P6M1j54oJ25j25jK09j7j91K8L6j6L2j4n6J17j57N2jK8r5K32jO1k0
2438B86k09j2jm8M3J80K3j18m5L9j5R7q8p0P3m3J27j0k1M5j77KJ05l4K6k1K8J9qo9p1J49j03
2050G9L1j5J13j10N7J1nK4rl8M9r4oo3J38j15N7N7m3o4M6j0M7k2N5j21L9J16j2n5K25k6j46
1663A90j71R3l7lM2p1J89p3o8moQ5Q9k0j18R3r2K0l5l9Q2m8J23J00k38l9J18l8P7J00J08j45
1287B64j01J28j18l8n0J8l3K03j25o9J10p5j7m1J4%R0R5n5k2L0o2m0M6M1m4p5R7R2p6L6kj45
900G6PR5p0K9J36P6j75j04M8o9P8K1j30K5P7MM2o7O4m9n4Q1j17J72j65J3M2ml1l2P9Q6o8p2
501D4K31pk36O5O1m6k6O2l2m1Q5J99j16r5M4p8K8K3n5m7M7%M7O1k8K48k16QO2j74kJ21r0q7
102F0N2N6m9J73L0j28m9o6m8K5OJ22k7m9k6J88n8o2m4J04j77P0J8j01J23
-192A43
##PAGE=	F1=4815.45
##FIRST=	25164.767445380970457,	5806.2096540000038658,	0.63580834865570068359
##DATA TABLE=	(F2++(Y..Y)), PROFILE
$$ plain form
5806 62 47 124 217 176 93 102 159 169 132 62 130 166 96 42 203 149 167 263 123 179 201 179 206 47 155 105 200 127 24 164 311 313 277
5419 277 110 224 173 125 114 129 73 158 348 275 80 82 33 180 162 139 112 93 228 216 114 12 14 35 21 102 179 44 19 59 211
5055 211 358 241 88 24 151 67 102 215 97 195 168 136 127 165 142 64 188 60 102 106 28 109 138 88 149 94 28 87 101 32 131 101
4679 101 251 294 180 45 41 77 80 238 230 199 95 123 163 136 273 185 143 102 217 91 138 63 94 35 142 126 48 46 70 190 123 79
4304 79 98 120 81 69 157 138 99 41 153 239 83 141 57 113 288 258 229 175 108 67 86 233 40 196 139 207 166 143 149 92 141 45 60
3916 60 92 8 168 262 110 39 148 226 230 115 186 129 245 389 264 65 132 49 145 153 96 251 76 181 284 298 140 44 142 166
3564 166 153 179 107 128 92 230 236 143 235 209 45 145 151 208 185 106 153 47 231 90 176 186 81 76 132 58 36 107 136 64 193 342
3189 342 199 163 103 39 100 109 131 142 122 152 210 267 300 246 112 72 62 125 202 73 130 350 373 275 137 51 137 148 193 32 68 109
$$ packed form
5806F2j5P7R3m1q3RN7J0l7p0O8L6p0n4J61n4J8R6j40N6K2k2K7j59J08n0R5p3j03J40J47Kl6
5419B77j67J14n1m8j1J5n6Q5J90p3j95Km9J47j8k3k7j9J35j2j02j02KK1j4Q1P7j35k5M0J52
5055B11J47j17j53o4J27q4L5J13j18R8k7l2rL8k3p8J24j28M2Mp8Q1K9n0O1n5o6N9J4o9R9l0
4679A01J50M3j14j35mL6LJ58ql1j04K8M0k7J37q8m2m1J15j26M7p5L1n9J07j6p8kK4J20o7m4
4304G9J9K2l9j2Q8j9l9n8J12Q6j56N8q4N6J75l0k9n4o7m1J9J47j93J56n7O8m1k3On7M9r6J5
3916F0L2q4J60R4j52p1J09P8Mj15P1n7J16J44j25j99O7q3R6Qn7J55j75J05J03J4j58r6R8K4
3564A66j3K6p2K1l6J38Or3R2k6j64J00ON7k3p9M7j06J84j41Q6J0j05nN6p4k2P1K9p2J29J49
3189C42j43l6o0o4O1RK2J1k0L0N8N7L3n4j34m0j0O3P7j29N7K20K3r8j38q6Q6J1M5j61L6M1
$$ plain form
2813 109 126 62 88 233 120 96 217 249 74 86 193 78 85 255 249 81 50 95 128 178 139 86 237 109 37 123 172 36 214 179
2461 179 331 303 77 71 52 47 56 186 221 109 99 154 140 203 113 39 119 58 171 160 196 277 67 44 184 178 143 116 141 196 229 116 37
2074 37 161 115 71 92 189 26 141 169 163 227 191 143 196 129 67 33 112 11 96 126 71 69 67 93 98 109 151 62 86 175 185 139 319 284 224
1663 224 62 174 111 60 178 52 203 151 109 73 86 124 262 256 99 205 79 101 94 102 110 88 240 309 46 36 116 135 252 348 442
1299 442 293 120 274 158 105 75 148 30 260 167 57 151 136 111 36 31 68 122 258 248 202 178 121 152 202 184 154 123 210 255 191
935 191 239 233 132 124 162 115 151 257 340 150 54 109 109 106 196 50 81 103 117 153 88 144 84 55 145 93 228 81 36 50 94 53 39 127
536 127 209 90 34 237 249 40 93 140 89 46 156 130 48 171 338 271 74 122 94 117 188 100 49 104 110 196 225 175 396 193 217
172 217 275 93 108 188 133 55 119 135 164 277 296 164 82 46 71 19 65 161 89 70 94 293 214 142 136 172 28 85 132 62 131
$$ packed form
2813A09J7o4K6J45j13k4J21L2j75J2J07j15PJ70oj68l1M5L3N0l9n3J51j28p2Q6M9j36J78l5
2461A79J52k8k26oj9nRJ30L5j12j0N5j4O3r0p4Q0o1J13j1L6Q1k10k3J40ol5k7K5N5L3j13p9
2074C7J24m6m4K1R7j63J15K8oO4l6m8N3o7o2l4P9j01Q5L0n5kkK6NJ1M2q9K4Q9J0m6J80l5o0
1663B24j62J12o3n1J18j26J51n2m2l6J3L8J38oj57J06j26K2pQQk2J52O9k63j0Q0J9J17R6R4
1299D42j49j73J54j16n3l0P3j18K30r3j10R4j5k5p5nL7N4J36j0m6k4n7L1N0j8l0l1Q7M5o4
935A91M8oj01qL8m7L6J06Q3j90r6N5%lR0j46L1K2J4L6o5N6o0k9R0n2J35j47m5J4M4m1j4Q8
536A27Q2j19n6K03J2k09N3M7n1m3J10k6q2J23J67o7j97M8k8K3P1q8n1N5OQ6K9n0K21k03K4
172B17N8j82J5Q0n5p8O4J6K9J13J9j32q2l6K5n2M6R6p2j9K4J99p9p2oL6j44N7M7p0O9
-192A31
##PAGE=	F1=4713.2
##FIRST=	25164.767445380970457,	5806.2096540000038658,	0.36884105205535888672
##DATA TABLE=	(F2++(Y..Y)), PROFILE
$$ plain form
5806 7 78 162 246 131 77 69 136 156 158 64 57 105 90 72 238 141 202 273 157 181 206 230 241 58 188 131 209 118 30 141 287 273 238 54
5407 54 197 139 96 95 76 31 136 349 289 107 119 60 161 101 104 113 102 248 270 148 40 32 61 4 59 145 54 68 71 233 323 181 96
5020 96 17 172 112 111 177 73 182 165 119 111 164 159 75 129 90 116 147 25 136 85 157 137 67 54 57 93 47 141 34 198 283 168 60
4632 60 88 101 41 170 180 209 148 98 140 148 315 257 147 120 221 112 88 48 93 50 85 95 40 33 35 157 141 64 167 188 133 68 207
4245 207 144 74 48 156 254 68 162 100 140 337 308 244 142 125 104 102 219 5 207 108 198 143 151 145 77 154 43 68 114 68 158 226
3870 226 82 67 145 208 227 63 206 147 252 373 261 70 147 65 154 151 115 229 77 216 277 252 147 63 133 185 132 164 96 129
3517 129 71 247 245 123 247 184 43 188 190 190 113 129 182 90 216 86 113 139 66 105 133 27 67 155 178 78 102 275 202 179 111
3154 111 61 89 65 63 95 125 166 294 318 310 215 85 46 71 66 178 92 72 330 365 305 143 52 125 224 253 77 49 65 93 41 58 240
$$ packed form
5806GP1Q4Q4j15n4qO7K0Kr4pM8j5j8J66r7O1P1j16K4K5K4J1j83J30n7P8r1q8J11J46j4l5j84
5407E4J43n8m3jj9m5J05K13o0j82J2n9J01o0LRj1J46K2j22j08qK9n7N5Q6r1J4LJ62R0j42q5
5020I6p9J55o0jO6j04J09j7m6qN3nq4N4l9K6L1j22J11n1P2k0p0j3LL6m6R4j07J64Q5j15j08
4632F0K8J3o0J29J0K9o1n0M2QJ67n8j10k7J01j09k4m0M5m3L5J0n5pKJ22j6p7J03K1n5o5J39
4245B07o3p0k6J08R8j86R4o2M0J97k9o4j02j7k1kJ17k14K02r9R0n5Qoo8P7j11K5M6m6R0O8
3870B26j44j5P8O3J9j64J43n9J05J21j12j91P7q2Q9ll6J14j52J39O1k5j05q4P0N2n3L2o8L3
3517A29n8J76kj22J24o3j41J45K%p7J6N3r2J26j30K7K6p3L9K8j06M0Q8K3j00K4J73p3k3o8
3154A11n0K8k4kL2L0M1J28K4qr5j30l9K5nJ12q6k0K58L5o0j62r1P3R9K9j76k8J6K8n2J7J82
$$ plain form
2766 240 179 91 238 244 69 111 195 104 130 221 239 125 38 72 124 202 152 102 281 188 12 162 233 50 176 126 332 290 59 87
2414 87 24 127 130 123 169 76 91 133 128 156 105 20 100 23 139 135 199 302 86 66 191 220 156 101 124 214 263 126 64 106 128 65 110 184
2015 184 59 127 176 158 227 178 134 196 150 59 68 39 60 100 82 39 79 58 98 65 107 140 82 78 132 164 140 280 213 237 102 231 121
1628 121 58 222 83 179 120 98 83 84 77 239 265 102 192 51 102 147 130 81 89 243 263 12 71 78 150 290 366 441 314 51 232
1264 232 154 90 64 174 67 256 186 49 126 145 93 6 52 64 81 250 284 219 155 97 170 211 160 172 187 251 246 195 241 205 165 156 139
876 139 130 143 212 283 116 40 87 138 83 202 66 117 94 106 132 60 113 67 61 149 165 246 122 57 77 130 121 87 152 210 45 99 176 237
477 237 73 83 127 133 80 160 125 21 149 295 290 96 47 55 83 188 127 93 102 101 211 215 149 324 154 181 234 103 128 133 128 45 117 91
78 91 195 218 227 130 28 27 92 3 61 138 54 49 103 295 182 111 138 123 65 82 138 106 115
$$ packed form
2766B40o1q8J47Oj75M2Q4r1K6R1J8j14q7L4N2P8n0n0J79r3j76J50P1j83J26n0K06m2k31K8
2414H7o3J03LpM6r3J5M2nK8n1q5Q0p7J16mO4J03k16k0J25K9o4n5K3R0M9j37o2M2K2o3M5P4
2015A84j25O8M9j8O9m9m4O2m6r1Rk9K1M0j8m3M0k1M0l3M2L3n8mN4L2k4J40o7K4j35J29j10
1628A21o3J64j39R6n9k2j5JpJ62K6j63R0j41N1M5j7m9QJ54K0k51N9PP2J40P6P5j27k63J81
1264B32p8o4k6J10j07J89p0j37P7J9n2q7M6J2J7J69L4o5o4n8P3M1n1J2J5O4nn1M6l6m0rj7
876A39rJ3O9P1j67p6M7N1n5J19j36N1k3J2K6p2N3m6oQ8J6Q1j24o5K0N3rl4O5N8j65N4P7O1
477B37j64J0M4On3Q0l5j04J28J46nj94m9QK8J05o1l4RjJ10Mo6J75j70K7N3j31K5Nnq3P2k6
78I1J04K3Rr7j02jO5q9N8P7q4nN4J92j13p1K7j5n8J7N6l2R
-192A15
##PAGE=	F1=4610.94
##FIRST=	25164.767445380970457,	5806.2096540000038658,	0.056285679340362548828
##DATA TABLE=	(F2++(Y..Y)), PROFILE
$$ plain form
5806 43 101 189 259 91 77 46 126 128 173 71 26 55 104 83 272 136 225 249 167 177 189 245 248 73 194 123 211 138 29 113 243 220
5431 220 205 7 172 81 44 68 21 11 105 310 269 138 159 76 141 15 41 92 108 253 301 171 70 57 75 32 83 127 65 102 92
5067 92 229 261 132 111 39 173 144 98 146 80 142 129 85 103 160 158 55 62 162 99 158 42 155 21 230 133 47 115 31 99 58 132
4691 132 52 154 273 161 71 155 123 15 101 141 227 187 73 94 140 347 312 156 136 223 135 61 63 95 91 32 85 73 45 13 131 150
4316 150 41 215 225 192 84 249 148 60 59 156 253 62 169 128 173 354 331 256 120 168 124 121 199 57 227 95 195 129 169
3975 169 145 84 186 40 86 130 110 167 176 69 88 128 168 219 39 213 157 238 326 243 67 150 98 167 168 130 180 99 247 254 207 169 93
3588 93 120 203 119 130 79 109 52 242 236 94 259 182 87 214 225 167 53 178 217 113 186 86 46 72 105 143 116 38 91 192 191 68
3212 68 43 201 206 190 120 91 70 57 62 55 121 165 339 349 303 178 65 37 97 74 157 149 8 294 345 318 155 59 123 287 314 108 32
$$ packed form
5806D3N8Q8P0j68j4l1Q0KM5j02m5K9M9k1J89j36Q9K4q2J0J2N6Lj75J21p1Q8p3j09Q4J30k3
5431B20j5j98J65r1l7K4m7j0R4K05m1j31K1q3O5j26K6N1J6J45M8j30j01j3J8m3N1M4o2L7j0
5067I2J37L2j29k1p2J34k9m6M8o6O2j3m4J8N7kj03PJ00o3N9j16J13j34K09r7q6O8q4O8m1P4
4691A32q0J02J19j12r0Q4l2j08Q6M0Q6m0j14K1M6K07l5j56k0Q7q8p4KL2mn9N3j2k8l2J18J9
4316A50j09J74J0l3j08J65j01q8jR7R7j91J07m1M5J81k3p5j36M8m4lP8j42J70j32J00o6M0
3975A69k4o1J02j46M6M4k0N7Rj07J9M0M0N1j80J74n6Q1Q8q3j76Q3n2O9Jl8N0q1J48Pm7l8p6
3588I3K7Q3q4J1n1L0n7J90oj42J65p7r5J27J1n8j14J25L9j04P3j00m0K6L3L8k7p8N3J01jj23
3212F8k5J58Nj6p0k9k1j3NpO6M4J74J0m6j25j13k8O0k3Q3qj41K86N1k7j63r6O4J64K7k06p6
$$ plain form
2825 32 73 44 35 84 213 208 80 243 209 54 130 183 136 183 173 222 175 90 58 95 211 163 122 315 254 57 187 279 63 146 98 308
2449 308 251 25 99 31 215 220 76 119 50 76 90 95 90 116 30 77 8 130 139 195 301 103 94 180 242 173 88 113 225 269 136 99 32
2062 32 131 76 136 187 120 144 189 146 190 140 119 181 152 41 111 58 121 119 39 30 73 59 106 43 98 135 83 70 92 137 138 252 135 226 130
1651 130 270 102 65 236 107 163 78 62 93 77 34 195 262 142 169 42 122 190 139 58 106 231 187 17 105 58 153 301 355 404
1299 404 317 32 185 164 92 53 179 95 263 200 56 141 140 56 53 102 63 54 234 300 219 141 77 165 182 123 187 230 272 230 200 229 136
912 136 168 174 116 126 104 146 192 98 55 56 137 61 170 69 135 76 90 103 20 94 94 76 150 203 237 146 90 111 166 189 126 170 196 26 162
501 162 119 253 107 78 122 194 121 158 108 81 105 240 297 148 38 4 84 160 156 143 92 85 196 183 114 239 114 137 172 136 183 93
125 93 117 32 98 54 214 132 134 97 38 31 91 17 34 124 56 49 109 276 126 66 115 71 104 101 144 142 100
$$ packed form
2825C2M1k9rM9J29nj28J63l4j55P6N3m7M7j0M9m7q5l2L7J16m8m1J93o1j97J30R2k16Q3m8K10
2449C08n7k26P4o8J84Nj44M3o9K6J4NnK6q6M7o9J22RN6J06j98rQ6O2o9q5K5J12M4j33l7o7
2062C2R9n5O0N1o7K4M5m3M4n0k1O2k9j11P0n3O3kq0rM3j4M7o3N5L7n2j3K2M5JJ14j17R1r6
1651A30J40j68l7J71j29N6q5j6L1j6m3J61O7j20K7j27Q0O8n1q1M8J25m4j70Q8m7R5J48N4M9
1299D04q7k85J53k1p2l9J26q4J68o3j44Q5jq4lM9l9rJ80O6q1p8o4Q8J7n9O4M3M2m2l0K9r3
912A36L2On8J0k2M2M6r4m3JQ1p6J09j01O6n9J4J3q3P4%j8P4N3L4r1n6K1N5K3o3M4K6j70J36
501A62m3J34j46k9M4P2p3L7n0k7K4J35N7j49j10l4Q0P6mj3n1pJ11j3o9J25j25K3L5l6M7r0
125I3K4q5O6m4J60q2Kl7n9pO0p4J7R0o8pO0J67j50o0M9m4L3lM3km2
-192A00
##PAGE=	F1=4508.68
##FIRST=	25164.767445380970457,	5806.2096540000038658,	0.22416642308235168457
##DATA TABLE=	(F2++(Y..Y)), PROFILE
$$ plain form
5806 74 112 199 259 86 109 28 127 86 173 84 93 38 135 73 294 145 232 199 157 174 150 227 230 91 176 84 200 173 39 87 188 169 183
5419 183 33 155 58 56 39 38 21 80 247 220 162 194 75 119 79 57 62 121 236 298 179 79 82 76 71 143 119 59 121 112 206 191 117 122 73
5008 73 160 162 70 138 87 82 70 63 99 148 144 4 65 236 54 137 79 164 78 292 150 104 172 37 121 55 107 110 154 269 153 85 212
4621 212 131 59 71 126 240 211 61 50 114 359 342 156 133 209 163 92 80 110 135 82 109 111 72 11 117 156 29 235 230 242 120 277
4245 277 152 52 63 151 242 78 158 139 200 332 333 269 108 206 129 135 175 103 239 105 193 133 193 154 135 225 35 102 139 119 171 119
3870 119 78 94 96 112 211 66 214 162 207 256 212 49 138 122 175 190 143 112 131 263 219 175 178 114 111 218 109 78 63 69 36 210 205 65
3470 65 269 231 132 211 241 139 52 226 255 115 137 77 55 6 148 167 88 83 101 209 170 40 110 131 207 194 129 122 45 68 122 115 104
3083 104 155 344 355 279 137 58 42 127 122 136 202 87 239 317 309 157 65 117 319 357 122 28 111 44 73 156 168 203 74 231 158
$$ packed form
5806G4L8Q7O0j73K3q1R9m1Q7q9Rn5R7o2K21j49Q7l3m2J7k4P7Lj39Q5r2J16k7j34M8J01j9J4
5419A83j50J22r7kj7jj7N9J67k7n8L2j19M4m0k2NN9J15O2j19j00LonP2k4o0O2rR4j5p4Nm9
5008G3Q7Kr2O8n1nj2pL6M9mj40O1J71j82Q3n8Q5q6K14j42m6O8j35Q4o6N2LM4J15j16o8J27
4621B12q1p2J2N5J14k9j50j1O4K45j7j86k3P6m6p1j2L0K5n3K7Kl9o1J06L9j27K06nJ2j22J57
4245B77j25j00J1Q8R1j64Q0j9O1J32Jo4j61R8p7OM0p2J36j34Q8o0O0l9j9R0j90O7L7k0N2n2
3870A19m1J6KJ6R9j45J48n2M5M9m4j63Q9j6N3J5m7l1J9J32m4m4Lo4lJ07j09l1j5Ol3J74nj40
3470F5K04l8r9P9L0j02q7J74K9j40K2o0k2m9J42J9p9nJ8J08l9j30P0K1P6j3o5pp7K3N4pj1
3083A04N1J89J1p6j42p9j6Q5nJ4O6j15J52P8qj52r2N2K02L8k35r4Q3o7K9Q3J2L5j29J57p3
$$ plain form
2719 158 34 138 149 163 227 131 200 211 144 45 53 207 171 145 333 297 91 197 303 81 122 90 263 199 29 103 90 298 304 81
2367 81 86 38 62 68 63 26 133 62 51 19 121 148 185 268 118 113 165 245 176 76 104 222 246 146 137 93 145 92 159 186 162 185 209 130 142
1956 142 86 101 150 135 2 153 140 176 149 14 39 54 59 120 34 75 131 73 74 69 117 136 230 59 194 137 281 61 89 220 120 153
1581 153 57 11 94 70 13 143 249 200 154 61 138 205 124 33 131 207 90 44 133 63 135 281 319 337 296 115 167 185 109 41 171 90
1205 90 274 206 71 177 121 68 114 139 71 59 213 290 199 125 69 149 139 82 186 233 262 204 206 206 41 142 176 100 97 52 85 96 124
818 124 85 24 115 44 116 78 129 40 64 72 25 107 144 96 145 204 204 148 118 127 195 240 152 178 180 65 204 103 280 134 82 117 245 150
419 150 151 89 153 75 185 289 174 100 64 130 102 155 178 81 76 164 128 75 161 91 95 98 173 234 78 93 38 61 103 232 52 59 73 81 47
8 47 72 52 39 118 52 69 109 241 61 40 75 38 138 132 151 165 88
$$ packed form
2719A58j24J04J1J4O4r6O9J1o7r9QJ54l6k6J88l6k06J06J06k22M1l2J73o4j70P4j3K08Ok23
2367H1Nm8K4Onl7J07p1j1l2J02K7L7Q3j50nN2Q0o9j00K8J18K4j00rm4N2n3O7K7k4K3K4p9J2
1956A42n6J5M9j5j33J51j3L6k7j35K5J5NO1q6M1N6n8JnM8J9R4j71J35n7J44k20K8J31j00L3
1581A53r6m6Q3k4n7J30J06m9m6r3P7O7q1r1R8P6j17m6Q9p0P2J46L8J8m1j81N2J8p6o8J30q1
1205I0J84o8j35J06n6n3M6K5o8j2J54P7r1p4n6Q0j0n7J04M7K9n8K%j65J01L4p6lm5L3J1K8
818A24l9o1R1p1P2l8N1q9K4Qm7Q2L7m8M9N9%n6l0RO8M5q8K6Kj15J39j01J77j46n2L5J28r5
419A50Jo2O4p8J10J04j15p4l6O6k8N3K3r7nQ8l6n3Q6p0MLP5O1j56J5n5K3M2J29j80PJ4Ql4
8D7K5k0j3P9o6J7M0J32j80k1L5l7J00oJ9J4p7
-192H8
##PAGE=	F1=4406.42
##FIRST=	25164.767445380970457,	5806.2096540000038658,	0.29757824540138244629
##DATA TABLE=	(F2++(Y..Y)), PROFILE
$$ plain form
5806 87 108 189 249 106 151 25 132 50 164 103 139 54 180 49 298 172 221 134 136 175 104 193 195 112 144 32 175 201 61 77 131
5442 131 126 168 56 146 135 135 13 69 16 82 183 156 178 218 62 94 163 132 55 149 200 258 169 72 106 69 119 194 107 40 135 125 177 142
5043 142 123 119 112 143 171 65 144 90 39 41 87 97 128 139 79 132 296 20 98 131 164 156 329 186 185 206 48 153 39 79 158 191 268
4656 268 144 104 245 117 105 89 136 237 217 67 83 75 345 339 138 107 173 190 131 91 132 169 144 136 134 86 21 116 166 61 230 211
4280 211 273 157 288 155 46 54 141 229 109 129 141 207 270 322 278 96 229 127 139 149 131 231 123 184 141 211 171 195 259 26
3928 26 110 139 99 159 63 103 82 53 76 207 91 217 167 164 177 169 32 121 133 167 201 155 41 160 264 181 156 163 116 112 225 96 20
3541 20 56 39 31 154 155 43 273 300 161 178 227 106 81 255 282 100 73 50 101 77 178 172 61 117 97 202 128 25 175 80 201
3177 201 191 137 154 21 71 178 203 72 145 317 335 238 92 57 53 152 160 113 233 158 164 283 277 141 66 97 308 365 121 35 135
$$ packed form
5806H7K1Q1O0j43M5j26J07q2J14o1L6q5J26j31K49j26M9q7KL9p1Q9Kq3L2j12J43K6j40J6N4
5442A31nM2j12R0j1%j22N6n3O6J01k7K2M0j56L2O9l1p7R4N1N8q9r7L4l7N0P5q7o7R5j0N2l5
5043A42j9mpL1K8j06P9n4n1KM6J0L1J1o0N3J64k76P8L3L3qJ73j43jK1j58J05j14M0P9L3P7
4656B68j24m0J41j28j2j6M7J01k0j50J6qK70ok01l1O6J7n9m0M1L7k5qkm8o5R5N0j05J69j9
4280B11O2j16J31j33j09QQ7Q8j20K0J2O6O3N2m4j82J33j02J2J0j8J00j08O1m3P0m0K4O4k33
3928B6Q4K9m0O0r6M0k1k9K3J31j16J26n0lJ3qj37Q9J2L4L4m6j14J19J04q3k5Pm7mJ13j29p6
3541B0L6j7qJ23Jj12K30K7j39J7M9j21k5J74K7j82k7k3N1k4J01oj11N6k0J05p4j03J50r5J21
3177B01j0n4J7j33N0J07K5j31P3J72J8r7j46l5mR9Qm7J20p5OJ19oj36p5L1K11N7k44q6J00
$$ plain form
2813 135 105 113 224 134 167 94 200 118 22 139 92 174 247 118 173 223 187 69 49 194 176 170 334 311 109 197 303 103 94 80 205
2449 205 153 83 107 150 357 363 103 79 41 54 104 70 37 144 96 26 38 97 144 171 207 127 119 170 241 160 62 101 202 202 158 171 195 174
2050 174 113 167 171 181 219 228 122 124 40 87 111 109 69 189 198 216 180 46 71 50 67 137 31 39 125 79 94 72 113 133 204 9 146 122 262
1639 262 38 130 181 127 142 78 41 90 65 34 98 232 243 158 87 146 197 97 41 153 176 12 76 151 77 95 233 265 252 248 179 191
1264 191 205 134 38 166 57 288 206 87 206 90 132 173 156 90 85 189 254 165 98 85 130 126 47 165 191 222 172 208 187 74 99
900 99 166 97 53 87 97 79 174 116 5 80 39 64 89 101 7 29 74 68 134 192 115 136 175 156 132 140 124 220 266 159 175 173 86 215 116 291
477 291 147 88 116 275 161 146 75 211 93 141 267 168 146 127 176 32 112 195 86 83 143 55 39 122 92 61 21 201 256 76 59
114 59 59 34 193 258 88 77 62 118 65 51 107 100 106 32 101 101 199 39 69 30 58 165 169 158 172 72
$$ packed form
2813A35l0QJ11r0L3p3J06q2r6J17m7Q2P3j29N5N0l6j18k0J45j8oJ64k3k02Q8J06k00rj4J25
2449B05n2p0K4M3K07Ok60k4l8J3N0l4l3J07m8p0J2N9M7K7L6q0qN1P1q1r8L9J01%m4J3K4k1
2050A74o1N4MJ0L8Rj06Kq4M7K4km0J20RJ8l6j34K5k1J7P0j06QQ6m6J5k2M1K0P1j95J37k4J40
1639B62k24R2N1n4J5o4l7M9k5l1O4J34J1q5p1N9N1j00n6J12K3j64O4P5p4J8J38L2j3mo9J2
1264A91J4p1r6J28j09K31q2j19J19j16M2M1j7o6nJ04O5q9o7j3M5mp9J18K6L1n0L6k1j13K5
900I9O7o9m4L4J0j8R5n8j11P5m1K5K5J2r4K2M5oO6N8p7K1L9j9k4Qj6R6M6j07J6kq7J29r9J75
477B91j44n9K8J59j14j5p1J36j18M8J26r9k2j9M9j44Q0Q3j09lO0q8j6Q3l0l1m0J80N5j80j7
114E9%k5J59O5j70j1j5N6n3j4N6pOp4O9%R8j60L0l9K8J07Mj1J4j00
-192G2
##PAGE=	F1=4304.17
##FIRST=	25164.767445380970457,	5806.2096540000038658,	0.096850290894508361816
##DATA TABLE=	(F2++(Y..Y)), PROFILE
$$ plain form
5806 85 91 160 230 119 182 56 137 71 156 119 154 71 231 44 282 204 197 67 117 176 86 176 157 136 120 48 142 209 83 83 81 95 149 72
5407 72 136 220 201 9 77 49 110 143 97 187 228 45 73 218 189 78 180 155 183 141 61 125 59 170 222 89 17 159 133 152 130
5043 130 123 103 155 135 175 108 148 115 82 111 129 97 103 157 160 188 332 86 79 188 151 220 337 229 255 208 46 185 37 81 197 230
4668 230 267 134 123 249 84 146 109 166 215 209 82 149 30 299 307 104 81 131 202 150 91 155 182 182 144 133 75 35 125 179 105 207
4292 207 180 278 181 285 154 36 35 123 223 140 90 135 184 180 300 271 82 235 123 131 125 137 202 136 161 136 219 190 236 280 24 110
3916 110 132 61 144 18 133 52 21 113 205 98 229 177 118 109 114 61 115 133 139 191 163 49 180 252 142 152 140 102 122 222 79 52
3541 52 59 84 63 89 92 35 265 351 166 131 183 71 97 258 284 75 40 10 128 133 195 163 56 128 88 175 93 59 206 77 190 179
3165 179 139 184 25 56 219 277 32 137 270 292 185 47 55 64 168 181 84 234 209 70 256 231 114 61 64 257 332 108 42
$$ packed form
5806H5OO9P0j11O3j26Q1o6Q5l7L5q3J60j87K38p8pj30N0N9r0R0j9k1j6p2R4O7j26%kJ4N4p7
5407G2O4Q4j9j92O8k8O1L3m6R0M1j83K8J45k9j11J02k5K8m2q0O4o6J11N2j33p2J42k6J9k2
5043A30pk0N2k0M0o7M0l3l3K9J8l2ON4LK8J44k46pJ09l7O9J17j08K6m7j62J39j48M4J16L3
4668B30L7j33j1J26j65O2l7N7M9oj27O7j19K69Qk03k3N0P1n2n9O4K7%l8j1n8m0R0N4p4J02
4292B07k7R8r7J04j31j18jQ8J00q3n0M5M9mJ20k9j89J53j12QoJ2O5o6K5k5Q3k9M6M4k56Q6
3916A10K2p1Q3j26J15q1l1R2R2j07J31n2n9rNn3N4J8ON2k8j14J31P2j10J0j2l8K0J00j43k7
3541E2PK5k1K6Ln7K30Q6j85l5N2j12K6J61K6k09l5l0J18NO2l2j07P2m0Q7q2l4J47j29J13j1
3165A79m0M5j59L1J63N8k45J05J33K2j07j38QRJ04J3r7J50k5j39J86k5j17n3LJ93P5k24o6
$$ plain form
2825 42 134 155 143 267 134 114 136 153 121 38 147 34 167 239 131 139 207 216 143 101 173 168 195 316 296 116 190 285 122 56 57 153 141
2438 141 135 119 196 381 384 107 85 51 53 144 103 65 145 122 7 75 70 125 152 125 127 114 206 245 127 45 114 170 149 167 195 277 202 138 157
$$ packed form
2825D2R2K1j2J24j33k0K2J7l2q3J09j13J33P2j08QO8Rp3m2P2nK7J21k0j80P4R5j63o6JR6j2
2438A41oj6P7J85Lk77k2l4KR1m1l8Q0k3j15O8nN5K7k7Kj3R2L9j18q2O9N6k1J8K8Q2p5o4J9
$$ [...]
-192G7
##END NTUPLES=	nD NMR SPECTRUM
##END=	
##END=	
