##TITLE=	Oct20-2021.23.ser
TM-VI-108solid Ca+pmb-pyrraz. batch 2 hsqc

##JCAMP-DX=	6.0	$$ MestReNova 14.3.0-30573
##DATA TYPE=	LINK
##BLOCK_ID=	1
##BLOCKS=	2    
##ORIGIN=	Mestrelab Research S.L.
##OWNER=	hrzepa
##$MNOVA/LINK_BLOCK_TYPE=	ITEM	$$ NMR Spectrum
##$MNOVA/ITEM/POLYGON=	(XY..XY)
5321,5835
8722,5835
8722,8208
5321,8208
5321,5835
##$MNOVA/ITEM/Z=	0
##$MNOVA/ITEM/ANGLE=	0
##TITLE=	Oct20-2021.23.ser
##JCAMP-DX=	6.0	$$ MestReNova 14.3.0-30573
##BLOCK_ID=	2
##DATA TYPE=	MNOVA NMR VIEW DATA
##DATA CLASS=	MNOVA VIEW DATA
##$MNOVA/2D/THRESHOLD=	8.7241106033325195313
##$MNOVA/ITEM/ZOOM/X=	-0.97752777163086645995,	15.008820000058459954
##$MNOVA/ITEM/ZOOM/Y=	-9.5471849045210372964,	230.01680000068574827
##END=	
##TITLE=	Oct20-2021.23.ser
##JCAMP-DX=	6.0	$$ MestReNova 14.3.0-30573
##BLOCK_ID=	3
##DATA TYPE=	nD NMR SPECTRUM
##DATA CLASS=	NTUPLES
##NUMDIM=	2
##ORIGIN=	Bruker BioSpin GmbH
##OWNER=	nmr
##.OBSERVE FREQUENCY=	400.20280139999999847
##.OBSERVE NUCLEUS=	^1H
##.SOLVENT NAME=	Acetone
##.PULSE SEQUENCE=	hsqcedetgpsisp2.3
##LONGDATE=	2021/10/21 02:10:00.000
##.ACQUISITIONMODE=	SIMULTANEOUS (DQD)
##$ORIGINAL FORMAT=	Bruker XWIN-NMR
##$MNOVA/SCALES_VERSION=	9
##$PARAMETER FILE=	(acqu2s, ASCII, /private/var/folders/f6/rjf_tdyn2v98c5c0wvkgn4s80000gn/T/e6r777MiTsC1Wjc7IEdifQ/23/acqu2s, 0)
$$ ##TITLE= Parameter file, TOPSPIN		Version 3.2
$$ ##JCAMPDX= 5.0
$$ ##DATATYPE= Parameter Values
$$ ##NPOINTS= 221	$$ modification sequence number
$$ ##ORIGIN= Bruker BioSpin GmbH
$$ ##OWNER= nmr
$$ $$ 2021-10-21 02:57:21.469 +0100  nmr@CZC2439F63
$$ $$ /opt/topspin/data/agmb/nmr/Oct20-2021/23/acqu2s
$$ $$ process /opt/topspin3.2/prog/mod/go
$$ ##$ACQT0= 0
$$ ##$BF1= 100.63037
$$ ##$FnMODE= 6
$$ ##$NUC1= <13C>
$$ ##$NusJSP= 0
$$ ##$NusT2= 1
$$ ##$NusTD= 220
$$ ##$O1= 11069.3807043987
$$ ##$SFO1= 100.641439380704
$$ ##$SW= 240.006398165762
$$ ##$SW_h= 24154.5893719807
$$ ##$TD= 220
$$ ##END=
$$ 
##$PARAMETER FILE=	(acqus, ASCII, /private/var/folders/f6/rjf_tdyn2v98c5c0wvkgn4s80000gn/T/e6r777MiTsC1Wjc7IEdifQ/23/acqus, 0)
$$ ##TITLE= Parameter file, TOPSPIN		Version 3.2
$$ ##JCAMPDX= 5.0
$$ ##DATATYPE= Parameter Values
$$ ##NPOINTS= 12	$$ modification sequence number
$$ ##ORIGIN= Bruker BioSpin GmbH
$$ ##OWNER= nmr
$$ $$ 2021-10-21 02:57:25.008 +0100  nmr@CZC2439F63
$$ $$ /opt/topspin/data/agmb/nmr/Oct20-2021/23/acqus
$$ $$ process /opt/topspin3.2/prog/mod/shimcntl
$$ ##$ACQT0= 0
$$ ##$AMP= (0..31)
$$ 100 100 100 100 100 100 100 100 100 100 100 100 100 100 100 100 100 100
$$ 100 100 100 100 100 100 100 100 100 100 100 100 100 100
$$ ##$AMPCOIL= (0..19)
$$ 0 0 0 0 0 0 0 0 0 0 0 0 0 0 0 0 0 0 0 0
$$ ##$ANAVPT= -1
$$ ##$AQSEQ= 0
$$ ##$AQ_mod= 3
$$ ##$AUNM= <au_zg>
$$ ##$AUTOPOS= <2 >
$$ ##$BF1= 400.2
$$ ##$BF2= 100.63037
$$ ##$BF3= 400.2
$$ ##$BF4= 400.2
$$ ##$BF5= 400.2
$$ ##$BF6= 400.2
$$ ##$BF7= 400.2
$$ ##$BF8= 400.2
$$ ##$BYTORDA= 0
$$ ##$CAGPARS= (0..11)
$$ 0 0 0 0 0 0 0 0 0 0 0 0
$$ ##$CFDGTYP= 0
$$ ##$CFRGTYP= 9
$$ ##$CHEMSTR= <none>
$$ ##$CNST= (0..63)
$$ [...]
$$ 0 0 0 0
$$ ##$ShimPowMaxUC= (0..63)
$$ 130000 130000 130000 130000 130000 130000 130000 130000 130000 130000 130000
$$ 130000 130000 130000 130000 130000 130000 130000 130000 130000 0 0 0 0
$$ 0 0 0 0 0 0 0 0 0 0 0 0 0 0 0 0 0 0 0 0 0 0 0 0 0 0 0 0 0 0 0 0 0 0 0 0
$$ 0 0 0 0
$$ ##$ShimPowMaxUG= (0..63)
$$ 524287 524287 524287 524287 524287 524287 524287 524287 524287 524287 524287
$$ 524287 524287 524287 524287 524287 524287 524287 524287 524287 0 0 0 0
$$ 0 0 0 0 0 0 0 0 0 0 0 0 0 0 0 0 0 0 0 0 0 0 0 0 0 0 0 0 0 0 0 0 0 0 0 0
$$ 0 0 0 0
$$ ##$ShimPowRcbType= 3
$$ ##$ShimPowRes= (0..63)
$$ 1e-20 1e-20 1e-20 1e-20 1e-20 1e-20 1e-20 1e-20 1e-20 1e-20 1e-20 1e-20
$$ 1e-20 1e-20 1e-20 1e-20 1e-20 1e-20 1e-20 1e-20 0 0 0 0 0 0 0 0 0 0 0 0
$$ 0 0 0 0 0 0 0 0 0 0 0 0 0 0 0 0 0 0 0 0 0 0 0 0 0 0 0 0 0 0 0 0
$$ ##$ShimPowRng0= (0..63)
$$ 1 1 1 1 1 1 1 1 1 1 1 1 1 1 1 1 1 1 1 1 0 0 0 0 0 0 0 0 0 0 0 0 0 0 0 0
$$ 0 0 0 0 0 0 0 0 0 0 0 0 0 0 0 0 0 0 0 0 0 0 0 0 0 0 0 0
$$ ##$ShimPowRng1= (0..63)
$$ 1 1 1 1 1 1 1 1 1 1 1 1 1 1 1 1 1 1 1 1 0 0 0 0 0 0 0 0 0 0 0 0 0 0 0 0
$$ 0 0 0 0 0 0 0 0 0 0 0 0 0 0 0 0 0 0 0 0 0 0 0 0 0 0 0 0
$$ ##$ShimPowRng2= (0..63)
$$ 1 1 1 1 1 1 1 1 1 1 1 1 1 1 1 1 1 1 1 1 0 0 0 0 0 0 0 0 0 0 0 0 0 0 0 0
$$ 0 0 0 0 0 0 0 0 0 0 0 0 0 0 0 0 0 0 0 0 0 0 0 0 0 0 0 0
$$ ##$ShimPowRng3= (0..63)
$$ 1 1 1 1 1 1 1 1 1 1 1 1 1 1 1 1 1 1 1 1 0 0 0 0 0 0 0 0 0 0 0 0 0 0 0 0
$$ 0 0 0 0 0 0 0 0 0 0 0 0 0 0 0 0 0 0 0 0 0 0 0 0 0 0 0 0
$$ ##$ShimSysFunc= (0..63)
$$ 1 2 3 4 5 7 9 11 15 16 8 10 12 14 6 17 13 18 19 20 0 0 0 0 0 0 0 0 0 0
$$ 0 0 0 0 0 0 0 0 0 0 0 0 0 0 0 0 0 0 0 0 0 0 0 0 0 0 0 0 0 0 0 0 0 0
$$ ##$ShimSysMatrix= 0
$$ ##$ShimSysType= 1
$$ ##$TFXNUM= 0
$$ ##$TRIPLO2= 0
$$ ##$VTU= 2
$$ ##$VTUETH= <149.236.99.20>
$$ ##$VTUTY= <no>
$$ ##$WBREFAM= (0..15)
$$ 135.5 97.7 100 100 100 100 100 100 100 100 100 100 100 100 100 100
$$ ##$WBREFLM= (0..15)
$$ 0 0 0 0 0 0 0 0 0 0 0 0 0 0 0 0
$$ ##$WBREFPH= (0..15)
$$ 72.26 -67.22 0 0 0 0 0 0 0 0 0 0 0 0 0 0
$$ ##$WBSGU= (0..15)
$$ 0 0 0 0 0 0 0 0 0 0 0 0 0 0 0 0
$$ ##$XFAC= 2
$$ ##END=
$$ 
##$DECIM=	3120
##$DSPFVS=	20
##.ACQUISITIONSCHEME=	ECHO-ANTIECHO
##NTUPLES=	nD NMR SPECTRUM
##VAR_NAME=	FREQUENCY1,	FREQUENCY2,	SPECTRUM
##SYMBOL=	F1,	F2,	Y
##.NUCLEUS=	13C,	1H
##.OBSERVE FREQUENCY=	100.64143938070399997,	400.20280139999999847
##VAR_TYPE=	INDEPENDENT,	INDEPENDENT,	DEPENDENT
##VAR_FORM=	AFFN,	AFFN,	ASDF
##VAR_DIM=	512,	512,	262144
##UNITS=	HZ,	HZ,	ARBITRARY UNITS
##FIRST=	23146.675690215950453,	6006.5297639999989769,	-0.24898904561996459961
##LAST=	-960.73674939750048907,	-391.2066142051489237,	0.12232157588005065918
##MIN=	-960.73674939750048907,	-391.2066142051489237,	-90.119293212890625
##MAX=	23146.675690215950453,	6006.5297639999989769,	105.12471771240234375
##FACTOR=	1,	1,	0.0056821770032887478075
##PAGE=	F1=23146.7
##FIRST=	23146.675690215950453,	6006.5297639999989769,	-0.24898904561996459961
##DATA TABLE=	(F2++(Y..Y)), PROFILE
$$ [...]
##PAGE=	F1=-11386.8
##FIRST=	23146.675690215950453,	6006.5297639999989769,	0
##DATA TABLE=	(F2++(Y..Y)), PROFILE
4404a1K1J09n8q1MJ18j88RJ28n8k22L57m3j98O9P0k9j18N9P9K6k5o6l1km8J49j0l0j51K63
4016I2r0L0q0M2O0J8J81k89R8q0J75j26o2q1O0M2k8N0n2j7J00l2n0N3J14r7l8m3NJ03j17M5
3615a4P2p9O3j3j71j5K86n4m0OM1K8%j2j9j89J09KO0l2p1J4J59l9j69N7n9O8J0K4R7p2j00
3202e2Nj8Q7m8P5j20pK04j32N9o2jo8O2j3J16j42O8j11J84j31J22j3qM4P0k10J8L3j7n4O7
2801GJ09Rj34M7r4p7N2NM7K0J59j56M1J22Jj71n4K0NNN0j7l1qJ12j6KoJ0L9l7lj4j4l7J2K
2338GN2m0k9j4l4J33q4k8J66r9k2M9j20j4N5j3J7J31j65J06j01k8K2J18n7l0o0o3M5J21n5
1950c4R0r0P1O9j33J23n8j11lJ10J4M2o0j19J75O6O1k56P1K8j3M0j19l5J08j55q4q88l523
1587d613k26L621R30K01k1K2l6k28j12M72k37j84L64P5Po2J19j88J73j19j7m5J27j21M8J38
$$ plain form
4404 -11 10 119 61 -20 -16 102 -86 -77 51 -7 -229 128 85 -113 -44 26 -3 -121 -62 17 43 18 -48 -79 -81 -129 20 10 -20 -171 92
4016 92 2 32 -48 -6 54 72 253 -36 62 -18 157 31 -31 -112 -52 -10 -38 12 -40 -57 43 11 -39 14 128 31 -7 -50 -45 58 -59 -14
3615 -14 58 -21 42 29 -142 -157 129 75 35 41 82 110 110 98 79 -110 -1 1 61 29 -42 -28 131 92 -77 -20 -79 -11 -1 23 120 48 -52
3202 -52 -47 -65 22 -26 49 -71 -78 126 -6 53 -9 -10 -78 -16 -29 87 -55 13 -98 86 -45 77 64 56 100 170 -40 -22 11 -6 -60 7
2801 7 116 125 -9 38 -56 -133 -81 -76 -29 -9 150 -6 35 157 158 -13 -67 -47 -42 -37 13 -4 -35 -43 69 53 55 49 59 98 61 58 44 30 -7 5 7
2338 7 59 19 -10 -24 -58 75 -9 -37 129 30 8 57 -63 -77 -22 -35 -18 113 -52 54 -47 -75 -53 65 8 -22 -82 -145 -100 21 -34
1950 -34 56 -34 37 106 -27 96 38 -73 -76 34 48 90 30 -89 86 152 213 -43 28 56 43 83 -36 -71 37 -118 -202 -1090 -4613
1587 -4613 -4839 -1218 -288 -87 -108 -86 -122 -350 -462 10 -227 -411 -47 28 35 -27 92 -96 77 -42 -59 -104 23 -98 -50 88
1261H8k0p7J38q8P4o2j16N4oJ13o0n3j6j1K0N8J05j47j0j1j07M7OP5J5nm5L4O7l5j03k0k8
848a26r2J26R4o8J5J10o3L1O3j59j9K5J35l6m9m0o6L1R9O4o8pN8N9j77J0J49q1O2M6J22p11
448d63K62K14j9r7J25Mp1L4m2O9q8P8O1q8J7k1O3j19J29l9L0o2J4J11k8q6M1o0J15j18N7p5
47e2J3k1M2k5o4Q5L8Q1j27J02pq3KJ67o5o4j09J70o9Oj7l7O4p7pL5J10q7j1M4m6N1P9j37J06
$$ plain form
1261 88 68 -9 129 41 115 53 -63 -9 -15 98 38 -15 -31 -42 -22 36 141 -6 -16 -27 -134 -87 -81 -6 9 4 -41 -7 60 25 -78 -98 -126
848 -126 -218 -92 2 -66 -51 59 -4 27 90 -69 -88 -63 72 36 -13 -53 -119 -88 11 75 7 0 58 117 -60 -50 99 18 80 126 248 -463
448 -463 -201 13 -6 -103 22 26 -45 -11 -53 16 -72 6 67 -21 -4 -25 38 -81 48 9 39 -23 -9 102 74 -12 29 -31 84 -34 23 -52
47 -52 -39 -60 -18 -43 -107 -22 16 97 -30 72 65 -18 -16 151 86 22 -87 83 14 20 3 -34 30 -47 -54 -19 91 4 -7 37 -9 42 121 -16 90
-391I0
##PAGE=	F1=-11481.2
##FIRST=	23146.675690215950453,	6006.5297639999989769,	0
##DATA TABLE=	(F2++(Y..Y)), PROFILE
6007c6M4K1k5k0j2KK22j04k8K4n3m8J9n6J0O2K6n1M4r6Q4j5J43j58l4Q1q3jo1J06o1l1J94
5593A09j52J64k16P8P4mJ06k14PM9j33J53j4q8l3J29L7p1m5K2O3Q7j8j47J26o4M7l8l6oR5
5205F7j66J06p9J3M1jJ01j76K25j0q7j04N6K9j5J10j43o5J24j4J7L4j92J49Qj05J09Kq4M4
4830fp7l6J26R8l3L8o0j06P9M8j35M0l1R5K5j0j32OO9lL2j2P9%j07m5J71j87k1N3N6K0J01
4416A35j71M2J30o4n9j6J38k05K9J13j4k34L20k9k14K3J44n0j41M1Q6L3l1l1l2k6l5J35K4
4053D1m3j74K48j19M5j2QK7R2R6k16L5l8J96j50o8q7M8R3o8L2k2k8J30p5n0P6J09o2o7l7l
3653d3J12j28M0N3r2J37o4j68k5K72%m5m0Q4k3qK3k7j69Q1P0MJo5mJ14m1j27nm7J32M5l4R4
3227A07Kj58ll6R0m1Q6r8j9J82j12N9m4j4r6R8j9Q3r3M9r9J27r3Q1RK0K8O5j76n0N4j0rJ08
$$ plain form
6007 -36 8 29 4 -16 -28 -26 196 92 64 88 35 -13 6 -50 -40 22 48 -3 41 -55 29 14 157 -1 -35 46 -37 -38 -99 7 -54 -85 109
5593 109 -43 121 -95 -17 57 53 159 -55 -48 1 -132 21 7 -81 -114 15 52 -19 -64 -42 21 108 90 -57 69 5 52 14 -22 -28 67
5205 67 -99 7 -72 -59 -18 -19 82 -94 131 121 34 -70 -14 15 0 110 -33 -98 26 12 29 63 -129 20 28 -77 32 34 -50 -6
4830 -6 -83 -119 7 105 72 110 50 -56 23 71 -64 -24 -55 40 65 55 -77 -71 -2 -5 27 15 94 94 -13 -58 113 -74 -95 -42 14 34 135
4416 135 -36 6 136 72 13 -3 135 -70 -41 72 58 -176 144 115 -99 -76 68 18 -123 -82 4 37 6 -25 -57 -83 -118 17 41
4053 41 -2 -176 72 -47 -2 -14 -6 21 113 209 -7 28 -10 186 36 -32 -119 -71 22 -46 -14 -36 -64 66 -9 -59 17 126 64 -3 -40 -43
3653 -43 69 -59 -19 34 -58 79 15 -153 -178 94 94 49 9 93 70 62 85 58 -111 -30 40 44 45 -20 -24 90 49 -78 -83 -130 2 47 13 107
3227 107 109 -49 -52 -88 2 -39 47 -51 -70 112 0 59 15 1 -95 3 -16 67 -26 23 -76 51 -42 39 48 68 96 161 -15 -65 -11 -21 -30 78
2801G8L2j2j01M1o7n1K5l7Q9MJ29j43J5J96k0j73n1L4j9j6M4j2o9K3O1N2Nl4L9K0rj3Kk3n1
2363a2J0j2Q5l2j8j1n8J17q8qJ48j28K4J9j07RJ00n0K3P1j13P6p6n5K8J15m1o5k6l9N5J9K8
1950a2J21j63J00N9o5R9j03j03L4M2P2P4n9j30J33K5J05k39O2M7o0N3j25k0R5j18n6o96k630
1587c458m19K850P60J84k0j8j2k36r1M76l12p10N30M72M3m1J23k27J59o8n2n6J81j35O8Q3
1261G4J5p9R0j05J40j26o8P1J7O9o0n5mMrP4R2j43J3o2k7j4mP7K3M2q4N3N2l1n5n6m8m7R4
823g7P1m8K0J31q6j2O3j19l3K1J26n3m2j2o8O8M6P7r6M5K2O2j66LJ41r7R7O0P7o40K97J24
423BJ9r3N9M7r6Op1J43j00J12L1q8J1KN0j05J06l2N0p8j5R9L4j16Mn8J55j07L4k1m4L0J5O
-3ir9J09O1K0j05O8j6k6%J19m1k8j68J83m4jp3J7M3n0l9N8J14m2p7K8pL2J24j37J10
$$ plain form
2801 78 110 98 -3 38 -29 -80 -55 -92 -3 1 130 -13 2 198 178 5 -46 -12 -31 -47 -3 -15 -84 -61 0 52 57 23 62 82 73 60 62 39 -12
2363 -12 -2 -14 71 39 21 10 -48 69 -19 -27 121 -7 17 36 -71 -62 38 -12 11 82 -31 45 -31 -86 -58 57 16 -49 -75 -114 -59 -40 -12
1950 -12 109 -54 46 105 40 139 36 -67 -33 9 81 155 96 -34 99 124 229 -10 52 99 39 92 -33 -53 42 -76 -132 -828 -3458
1587 -3458 -3877 -1027 -267 -83 -103 -121 -133 -369 -460 16 -296 -1006 -476 -4 39 -2 121 -106 53 -15 -67 -123 58 -77 -9 74
1261 74 89 10 100 -5 135 9 -59 12 29 98 38 -17 -21 -17 -26 48 140 -3 10 -52 -79 -93 -97 -20 3 45 -39 14 66 35 -20 -76 -124 -171 -77
823 -77 -6 -54 -34 97 11 -1 62 -57 -90 -69 57 4 -38 -50 -118 -50 -4 73 -23 22 44 106 -60 -57 84 -13 84 144 221 -419 -122 2
423 2 21 -72 -13 34 -62 -56 -127 16 -84 28 59 -29 -18 -16 34 -71 35 3 53 -25 -40 59 93 -23 -19 -77 78 -29 5 -16 -60 -30 -15 -9
-3 -9 -108 1 62 82 -23 45 29 3 3 122 81 53 -115 68 24 23 -50 -33 10 -40 -79 -21 93 51 -26 2 -5 27 151 14 124
-391A24
##PAGE=	F1=-11575.5
##FIRST=	23146.675690215950453,	6006.5297639999989769,	0
##DATA TABLE=	(F2++(Y..Y)), PROFILE
6007c5L8J1m1O1n0L6J91j40l4M2m6p4j3j6K5Q3K8l0Qj02J17q1J95j82n2R5l3l1o9N0j4K2J49
5593A08j49J61k10O1R3J9O1k06mO7j04J26%o1r3J36K4j2j09L5O6P2pj05O6l7L9K3p3jP8j53
5193h9R5j18L5L2M5N9j80K48p9J1q5J8M6L5L5j47q2J14J6j2N1j80J55N2j58R7M1n7m9m5m8
4805a44J24J13M2L9j55l7O7L3j06rl8O9N8L4j76PQ1JK6RJ14n9j18m6J08p7p9R2O2nN5j41P9
4391B3J16o7l3j7J34k10Q9P7mk26K23K3k00j7J84n1j55L3O3M3k3j2k0n9jR6O5o0j63J95r6
4003e0K3M1Om2J68j6j05rk0J87j67m1p9M8R4r6OK1k5J38r8n3O7R8j5q1k1j3J12j23L2L5r9
3590g7J91r8j61l6K24O3m7p5J18p7k1R6n5j32K8J33m2K5o7MN3n5n4p2k4J69O0p9R9N5j80j4
3190d8n1J03l8Q9q8k0J44q0M3k8j9q8R3k0N2m1N7q9M6o2M6K2N9J3L5j56p8O4J1L1J32l6j7
$$ plain form
6007 -35 3 14 -27 34 -16 20 211 71 37 79 33 -41 -54 -70 -45 38 66 36 44 -58 59 -22 173 -9 -61 34 1 -30 -99 -49 -63 -41 108
5593 108 -41 120 -90 -29 64 83 144 -62 -66 1 -103 23 23 -38 -131 5 29 17 -92 -57 9 81 74 -31 35 -2 37 60 -13 -14 64 -89
5193 -89 6 -112 -77 -45 0 59 -121 127 48 59 -26 -8 38 73 108 -39 -121 -7 9 -3 48 -132 23 75 -83 14 55 -2 -51 -96 -144
4805 -144 -20 93 135 174 19 -18 49 82 -24 -33 -71 -2 56 90 -86 -79 2 3 29 38 152 93 -25 -71 37 -40 -119 -27 35 30 85 -56 23
4391 23 139 72 39 22 156 -54 35 112 108 -118 105 128 -72 -89 95 44 -111 -78 -15 28 5 -7 -27 -86 -87 9 74 14 -149 46 -50
4003 -50 -27 14 20 -22 146 130 25 16 -4 183 16 -25 -104 -56 38 -58 -52 -31 -56 82 -16 -69 -2 96 81 0 -21 -34 78 -45 -13 22 -77
3590 -77 114 16 -145 -181 43 106 59 -16 102 25 4 100 45 -87 -59 74 32 57 -10 -6 47 -8 -62 -134 -158 11 71 -8 91 146 -34 -48
3190 -48 -99 4 -34 55 -33 -53 91 11 54 26 7 -81 12 -8 44 3 60 -29 17 -45 1 23 82 95 130 -26 -104 -40 -29 2 134 98 81
2776H1o6J9l5j4Qj11J18j3R1q4j2K22m4j15o7N0n9l9M7k9p4M8K7J08K4p9M6J4K1k0L5l9q3
2363b4J0k0J08%l3Lr3R1o0J1J03j23M7j7q0M5J22q7L3Mm7K2l8n9M0R6l0q7qQM6p3J04J50k16
1925e2R0L6J7O1j22o1M2j0P3J28l9j44R2l0J27j95O5L4p6O4j32jN8q9Om44j535m26J784M84
1549a95J52n5o2N5l86r6O03l69j304O28R67J06j3J32k73J29k1m7r8K15j16P2K8O3r6M2j03
1211d2J69j47k6P9J4K1m2o2K5%j0R0M3j31O0r9N4p4qP0K4Q1j17O4J1rqq8n0lN5M6k8JJ40o7
761C6m4L4q3k5mJ29p2j1jo7J15k3Q6j04O8J1M2j29qR3p3J04R5Jn01L08K9M2q2j5R5j24l0p7
335a85K05q5J15mq0%L8Jo3O2k3R3q8k2N2Q1j59mm2J47o4K2L3p7M3KK2j07J10P2n1p3N9l1K9
-103B8j4P0l3J4j99J49Rj1q3L6K7k1l7O5J00j6j11l0L8L8J42j12R0
$$ plain form
2776 81 15 34 -1 -15 -7 -118 0 -13 78 -6 -18 204 160 45 -22 28 -31 -70 -23 -52 -126 -78 -51 57 81 2 48 62 83 63 98 59 -24
2363 -24 -14 -34 74 74 41 44 -49 42 -18 -7 96 -27 20 3 -77 -32 90 3 36 40 -7 15 -23 -82 -42 54 24 -63 -71 -63 -17 -90 14 164 -52
1925 -52 38 74 91 152 30 -31 11 1 74 202 163 19 111 81 208 13 78 112 36 100 -32 -33 25 -64 -58 -502 -2037 -2463 -679 -195
1549 -195 -43 -98 -160 -105 -491 -587 16 -353 -1657 -1029 -62 44 31 163 -110 19 -2 -49 -147 68 -48 24 52 115 19 61 -42
1211 -42 127 -20 -46 33 47 68 26 -36 -11 -11 -21 69 112 -19 41 -58 -4 -78 -86 -16 8 89 -28 36 47 38 30 -58 -108 -111 -56 -10 -38 -37 103 36
761 36 -8 26 -57 -82 -86 43 -29 -40 -41 -108 7 -16 70 -34 34 45 87 -42 -50 43 -30 74 169 170 -331 -23 6 48 -34 -49 46 -78 -108 -185
335 -185 20 -65 50 46 -34 -34 4 5 -58 4 -19 74 -14 -36 16 97 -62 -66 -108 39 -25 -3 30 -47 -4 -2 20 -87 23 95 44 -29 30 -1 28
-103 28 14 84 51 65 -134 15 24 13 -70 -34 -7 -28 -65 0 100 84 -27 -57 -19 19 161 49 139
-391A39
##PAGE=	F1=-11669.9
##FIRST=	23146.675690215950453,	6006.5297639999989769,	0
##DATA TABLE=	(F2++(Y..Y)), PROFILE
6007b5Njn2J43p4O8J11j28m1N7n1m9n5NO6P3K0qj5j15J39j30K27j89n5J15J4q0p5OL7N7P1
5593G1j22J32j65N1J02M3nj85J2O7o1J09%l1j30J02K3M6j39M2M4L8J6o1kj8K1P6o5j3L4j12
5193h0Q0j31L9J2Q3K0j49K46j37N1j2k8N9O4m6j20p4O7N7k3M8j46J22J13j91N8J01n3j17j3
4817a00m2J01J46P7J4k12J8N3J8n0p6j3K7P8P3k00%Q4NK0L7J35j01j11o0N5K4j20R9O5k3%
4416B1q4J13O9m3k6%R3j90J65M0k9j96R6R5j67m2J99n2j56M0K6M9ok1Qq4L6M2J07p5j33J34
4016B9l6k9O0L3j18K14j05Mk9l4J56j58J3q2N8O0j09kM4mJ28r9n6L1O5M6p1qk3J04j06K2L2
3603C0j07K19j14j45m1J67J06m7r5J36j16m1J76r4j00k4J72o5N1q8L3no5L5j14j6J68M4r5
3240c5J11P3j58l2n4J33n0P6r1pJ02m1J5k2pn8N8k0K4J5P5p4k2n7L5J1P9J0oj61m2O6L4N7
$$ plain form
6007 -25 -20 -21 -73 70 -4 64 175 47 6 63 12 -37 -92 -87 -21 52 72 64 49 -66 73 -57 170 -19 -74 41 55 -25 -100 -94 -57 0 71
5593 71 -51 81 -84 -33 69 112 107 -78 -66 1 -60 49 49 18 -112 -10 13 59 -80 -38 6 44 60 -1 -3 -21 0 76 11 -2 32 -80
5193 -80 0 -131 -92 -80 3 23 -126 120 -17 34 22 -6 53 117 71 -49 -123 -56 1 -22 26 -120 2 115 -76 -18 83 30 -87 -100
4817 -100 -142 -41 105 182 196 -16 2 55 73 23 -53 -66 -39 39 112 -88 -88 -4 1 21 58 193 92 -19 -79 -24 0 -120 -21 44 21 21
4416 21 -63 50 119 76 50 50 143 -47 118 158 129 -67 29 124 -43 -85 114 62 -94 -54 -28 21 15 -6 2 -82 -46 -4 103 28 -105 29
4016 29 -7 -36 24 57 -61 153 48 52 23 -11 145 -13 0 -82 -24 36 -73 -75 -31 -35 93 -6 -62 -31 34 80 9 1 -22 82 -24 -2 30
3603 30 -77 142 28 -117 -158 9 115 68 -27 109 -7 -48 128 34 -66 -90 82 17 68 -20 13 8 -57 -22 -136 -152 16 60 -35
3240 -35 76 149 -9 -41 -95 38 -12 64 -27 -34 68 27 42 20 13 -45 13 -7 17 32 107 33 11 -46 -11 0 79 89 83 -78 -120 -54 -20 37
2814C7J08o5Qn3j2j1K3J2j90J22k1M5Ol8J95n3l0p9O0j01p0M3m4m2N8J5J47L9j15L9J8L7k0
2401F8P5o3j15J1j6J00M2p0L8j21O4j7NN2o3L0n5m8Q6J00r7L7l6Nk6j5m5N5O1mr7oM7K5j12
1963a05J35J60k26N2J2P7L2j08%Nl2L1J78j6j43O0p7J22j42Q2ko3P0j26J5Kq1P7k35o94l07
1574a247R03K39J17j01j04J45o16j24Q01l69j721N94J367J61KJ51l04Q9J7rj55K23q7P1l0
1261A3J21j16Pq5J45j08j0P4mj9j3o1N6l3J0J11k0j07J04j09J22j31qP5J2J01j37O0l6K4K2
873F0j09n2M0J8M0k0l1J31j9m4j4o1ol5J42q7L1rn9J43q3P7p0N3J8J0o4l6K5k5Q1J41o9l44
448b27K85m9M3m3p3J20j45o2n3K28o0R3k2n7k7P8o6oPj0J49r3j5j3J12j90Ll1J12nK0P1q1
34gJ7J0K0r5R4P3j08l7N8m9P5l4L5m2K7j74Q4O9k4m8K6J9j1J2L9P9k4r8j10Q2N0J31o8N4
$$ plain form
2814 37 145 80 88 35 23 12 35 47 -143 -21 -42 3 9 -29 166 113 83 4 64 -37 -107 -64 -108 -150 -92 -77 70 109 -6 33 51 88 68
2401 68 143 80 -35 -24 -40 60 102 32 70 -51 13 -4 1 53 -10 20 -35 -83 3 103 6 43 7 12 -14 -29 -74 -19 42 38 -59 -65 -18 7 -105
1963 -105 30 190 -36 16 28 105 137 29 29 34 2 33 211 195 52 112 35 157 15 97 95 32 102 -24 -9 -7 -88 -11 -246 -940 -1247
1574 -1247 -344 -105 12 -89 -193 -48 -664 -788 13 -356 -2077 -1483 -116 45 47 198 -106 -17 0 -9 -164 59 -28 43 13
1261 13 134 18 25 -60 85 -23 -33 41 37 18 5 -56 0 -33 -23 88 68 -39 65 -44 78 -53 -61 14 26 127 -10 50 14 38 60
873 60 -49 -101 -61 -43 -3 -23 -54 77 58 14 0 -61 -67 -102 40 -47 -16 -25 -84 59 -24 53 -17 36 54 64 0 -36 -11 -36 45 186 117 -227
448 -227 58 9 52 9 -64 56 -89 -151 -204 24 -36 57 35 -22 -49 29 -37 -43 -36 -46 103 10 -5 -18 94 -96 -93 -124 -12 -17 3 74 -7
34 -7 10 20 40 -55 39 112 4 -33 25 -24 51 17 52 10 37 -137 -53 16 -8 -56 -30 -11 -22 -10 29 108 84 -14 -124 -42 8 139 71 125
-391A25
##PAGE=	F1=-11764.3
##FIRST=	23146.675690215950453,	6006.5297639999989769,	0
##DATA TABLE=	(F2++(Y..Y)), PROFILE
6007a0m1j2n8J91o5Q9J5q7m0O6o8J8q3j3J25L4MOk0j24J51j51K17j76m7J40N2j40o5j4O5O4
5606B3or0R1q8M4R9O3p8j44L6N1k4J08j1nj41M6L7P9j23L3J4pM5l8o1oK0R0j9l6k1o0P1j12
5168a20J7pJ10j2j04K23j63L0Q1o7P1O6r9p2n8J1Q6j2K6j10P9J51j79MJ42n9j31Rk5N7J82
4780A27P6k5k11L4L9kK5j41K6kQ8R1k10jO6%J1P6J33j09q9q8L1Q6j25Q3O3k8n1k9J27J2J0
4366I3m2J4K8j40K13K4p3j44j7J57j32m7K01p1j43N5KL2J8m8M3q2N1k1J50q1j02R1J8p9N5
3978B3N9j68K12j28P0l8n8J11j16P4j04O9K1j11J4L5K7J08q8n2k0RJ12l1j2l4Q7p6NN3j16
3590f3K13j08j23l5J23J15n0r3J35j29o6K30j30q7n0J79p2Q5j17O7m8n0J07j12l4J36Jq8J22
3227E8O1r7n4m3J68p7N0r9J2P0j2pl3K0j9J3j8KN8Q2m3n2p9M5j9N9L0l9j85M4P0M3N4M7n2
$$ plain form
6007 -10 -51 -63 -121 70 5 94 109 22 -18 48 -20 -2 -85 -98 27 61 65 71 51 -73 78 -73 144 -32 -79 61 113 -27 -92 -106 -41 23
5606 23 17 -73 18 -70 -26 73 136 58 -86 -50 1 -23 85 74 69 -72 -26 11 90 -33 0 14 7 52 14 -47 -53 -33 57 38 2 -19 -79 -8 -120
5168 -120 -103 -110 0 -12 -116 107 -56 -26 55 -12 59 125 26 -46 -104 -93 -7 -19 7 -103 -24 127 -52 -48 94 35 -96 -87 -112 -55 127
4780 127 203 178 -33 1 40 38 63 -78 -52 -54 34 125 -85 -86 -20 -20 -9 67 200 91 2 -86 -55 31 -94 -11 52 24 -27 -56 71 83 93
4366 93 51 65 93 -47 166 190 117 -27 -44 113 -19 -66 135 64 -79 -24 -22 10 28 -20 23 -59 -8 -29 121 40 -62 29 47 -32 23
3978 23 82 -86 126 -2 68 30 -28 83 -33 41 -63 6 27 -84 -70 -35 -8 100 12 -40 -60 -51 61 30 18 -16 71 -5 0 53 -63
3590 -63 150 42 -81 -116 7 122 72 -21 114 -15 -81 149 19 -68 -118 61 -11 74 -43 24 -24 -74 33 -79 -113 23 24 -64 58
3227 58 119 22 -32 -75 93 16 66 -33 -21 49 37 30 -3 17 -2 11 -7 -5 53 135 92 40 -39 6 -13 46 76 37 -148 -104 -34 9 63 110 58
2789E8N5o7m0JM6L2k38R6nj5J03o7J40l9M4o4N3j29j15K3l9J4N3K1J62M0j25L2K4L2j8J10
2388A78r0j35K5j2O0P8j06Q7j29M4J3j9NM1j5j00pJ22L2p2K5l0K4n1ll4O9J3M7r9j6L8J7r0
1963i0J13J44j85KKR5K6p5O2p2k5j9J94Jj16L3q9R1r9J12m0m7P2j02L6p0r1J33j12k86j68
1574e70M35J10Q2j28j16K12o56r7P50l05j770M28J493J68%J77l07N1M7L4k04K05n9O8q8J78
1249A38j20j3o4Q0k7k1N1j0n1K5n4P4q1M4J25n9q1J15r8J70j74mR7j0J04j41L4o3N2K3j15
861e4o2Q4rN3k4o0J04L3oo7n1Qm5J47r2P2l7m3J32j06M3nJ4L0k0J5p5l2J9L7J76j07k01K19
435I0r9K8L2j08J12j46p9nK07m7N7qk7o9J06j16M5l8kK00r8%p8J33j86Lm4R0M8K3P6o6k1L5
9D8Lp9P2O9j32oM7o1J09n7K0n8%r9J8J12m3PJ6J4k6Q9j5O1n5m6j77J12M5R6j1J4
$$ plain form
2789 58 113 46 6 7 53 85 -153 -57 -62 -77 26 -41 99 60 104 40 93 -36 -151 -128 -167 -153 -100 -79 83 123 -2 30 54 86 68 178
2388 178 88 -47 -22 -34 26 104 -2 85 -44 0 13 -6 -1 40 25 -75 -82 40 72 0 25 -5 19 -32 -35 -69 0 13 60 -39 -55 -17 0 -90
1963 -90 23 167 -18 -16 -14 81 107 32 94 22 -3 -22 172 173 57 90 1 92 -7 105 65 18 90 -12 24 -46 -137 -4 -116 -402 -570
1574 -570 -135 -25 57 -71 -187 25 -631 -728 22 -283 -2053 -1625 -132 36 36 213 -94 -43 4 38 -166 39 -20 48 -40 138
1249 138 18 5 -59 21 -6 -27 24 14 -37 -12 -66 8 -73 -29 96 37 -44 71 -27 143 -31 -35 62 52 156 15 49 -14 38 61 -54
861 -54 -116 -32 -41 12 -12 -72 32 65 59 -8 -59 -51 -96 51 -41 31 -6 -49 83 -23 20 15 29 59 39 54 -21 -53 -34 3 179 72 -129 90
435 90 -9 19 51 -57 55 -91 -170 -175 32 -15 42 34 7 -62 44 -72 -27 -65 -67 133 35 35 -43 90 -96 -93 -137 -47 1 24 100 34 13 48
9 48 51 -28 44 113 -19 -25 22 -39 70 13 33 -25 -25 -124 -106 6 -37 -30 -14 0 -26 63 48 109 54 8 -169 -57 -12 84 73 87
-391H7
##PAGE=	F1=-11858.6
##FIRST=	23146.675690215950453,	6006.5297639999989769,	0
##DATA TABLE=	(F2++(Y..Y)), PROFILE
6007Ep3j9o7J90k1R1n9m0m1P5q6Q9p8o2J76j8j3J2j7j12J57j49J58j39l3J61P9k00l6j0N5
5618b5M9n1p2N4lL3Q5P6j33q1M4K3PJ02k5J5j24j6N9Q3p1J1pm9O1l4j02MM1N9L8m7p4k0P8
5180a2o3l0j4J15k8o6J88j56k9J53q1P9N1j07k3m6l6R3J3Lq8N0J43j27l7J27n6r2K5j3NJ94
4780A35O1o0j59NL0k1R1j74N3jQ8P4k04J9K5j4j1J25J09q4o7j15L9R8q8O1M9j4r7J0J13l2
4379D4P2o5Nl3p0K10L1j16p9p8J77r9l4J96j13j19O8Nj5M9p3O5m0L2q6J85p0q1O7L7j01N1
3978B2O0j81J71p9Q5o5n2N8n3J22j34P2kj08M1NN0P8o1m2o6o5J82K4m3m2N9l4j6R0j23J80
3578A33q4r9k7J07R4n9o9J25j21q9K40j54r0l8J60p8J19j31Q3o8mJ29o9o6Q8n6p0J24L9j8
3202E1p0k9J88j08K5j04K9N7jj4n7N0J6k4j1j6Q2O4jm3j10O1m9KP0n4j97J33Q0L4J3j2k0J02
$$ plain form
6007 5 -68 -87 -154 36 15 106 47 7 -34 41 -45 44 -34 -96 80 62 49 61 44 -68 89 -60 98 -41 -74 87 166 -34 -70 -80 -25
5618 -25 24 -27 -99 -45 -48 -15 70 146 13 -68 -24 -1 6 108 83 98 -26 -42 17 100 29 40 33 -16 45 11 -91 -87 -46 13 51 4 -70 -90 -12
5180 -12 -75 -105 -119 -4 -32 -98 90 -66 -95 58 -23 56 107 0 -23 -69 -105 -12 1 4 -84 -34 109 -18 -55 72 16 -76 -51 -64 -59 135
4780 135 196 136 -23 -18 12 -9 82 -92 -39 -40 48 122 -82 -63 -38 -52 -63 62 171 87 20 -95 -56 42 -46 15 64 50 -47 -37 76 44
4379 44 116 51 56 23 -47 163 194 78 -1 -79 98 -1 -35 161 48 -71 -3 2 -13 36 -37 28 -12 20 -66 119 49 -32 35 72 -29 22
3978 22 82 -99 72 -7 78 13 -39 19 -34 88 -46 26 24 -84 -43 -38 12 90 29 -13 -79 -144 38 62 19 -23 36 2 -14 76 -47 133
3578 133 49 -50 -77 30 124 65 -4 121 0 -89 151 -3 -93 -131 29 -49 70 -61 22 -46 -50 79 10 -56 32 -24 -94 30 69 51
3202 51 -19 -48 140 32 57 -47 -18 39 38 24 -33 17 33 9 -2 -18 64 128 127 84 -26 35 -14 -12 58 4 -193 -60 20 54 67 55 35 137
2776A37r5n7RL7N6k21M8K4p3J69r2R3j4Q4k5L6j26j80pj4O9M2L0J62K4j12L5K4J1k1J34j17
2376G0j30M9j4MR3j17J42j24M2J2n1l1J57o5j50M7J34n2k2nJ3J2n1J1m3Q0l8J09j03k1m4M7
1975c9k0N6J09j16m6QQ2M1m2J00j49j1n0J77%n8Jn6M4p8J46n8n2P1o5P6j50j11J61n6k00q5
1574c70L09R3M2j18o2K14j49R9kk06j437J93J296J17qJ95k76K0P0N6k27J70l8O7j39K19j02
1236B6j7n4PM9l7J7Jp8O5m1P1j23Q3J23n1o9Q9q6J95j88%J17k4R7j26j0o2O1Nj13o6J19k0
823d0P3l6p7O2P1M7j01m7J5l1J35q4J08q5k2R1r1rO6l0L8m3R2j08n6L1JJ77j11q6J15j19J7
410c7J17j19P4j16p8M9J56n2J3L9mj12J13j27O7m5j2K26j07K0j21J47j45j8p8J08P4J5N6m6
34E7n0O3j6o8M6P0j24J8K2o5J27q0K5p2m5qj5J14o1M4K7J1n6J60p9N5q6J9k02J20J1N0M2j0
$$ plain form
2776 137 42 -15 -6 31 87 -134 -86 -62 -135 34 -58 35 21 105 80 116 -10 -190 -197 -211 -142 -100 -70 92 116 4 39 63 74 53 187 70
2376 70 -60 -11 -25 -21 72 -45 97 -27 15 27 -24 -55 102 37 -113 -66 68 16 -6 -11 2 14 -37 -26 -69 11 -27 82 -21 -42 -86 -39
1975 -39 -59 -3 106 -10 -56 -48 34 75 33 133 -16 -27 -77 100 100 42 43 -13 31 -47 99 41 -11 60 -5 71 -79 -190 -29 -85 -285 -370
1574 -370 -61 32 74 -44 -106 108 -41 58 56 -150 -1587 -1394 -98 19 11 206 -70 -50 20 76 -151 19 -19 48 -91 128 26
1236 26 9 -45 -38 11 -26 -9 -8 -86 -21 -62 9 -114 -31 92 41 -28 61 -25 170 -18 -18 99 75 172 46 36 -26 35 40 -73 -139 -20 -40
823 -40 33 -3 -80 -18 53 100 -1 -48 -33 -64 71 -13 95 10 -12 79 -12 -21 45 15 53 10 102 -6 -62 -31 -30 147 36 -50 65 -54 -37
410 -37 80 -39 35 -81 -159 -110 46 -6 7 46 42 -70 43 -84 -17 -62 -74 152 45 65 -56 91 -54 -72 -150 -42 32 47 103 57
34 57 7 70 54 -14 32 102 -22 -4 18 -47 80 0 25 -47 -92 -100 -115 -1 -62 -18 9 20 -36 124 45 100 14 33 -169 -49 -38 12 54 44
-391D4
##PAGE=	F1=-11953
##FIRST=	23146.675690215950453,	6006.5297639999989769,	0
##DATA TABLE=	(F2++(Y..Y)), PROFILE
6007B1p9j2q6J48L3P1p5j3n2Q9r9J33m6j20J97n5k4Rj5o8J53j39P8q3k3J73Q4k39mJ0J8K5
5606A0n6p3L1O8NO7Q7j51qK0pM3P2l6K7q2p5Q2O2jj2k2p0N1l4j19PP9%P7k8j13oJ02jr5MR1
5130dk3m7J46j33q2J79p2P9L8p8Qm6n8P8M2oq8N3R2o5m2N5l7k7M4k0l6J65M9p7p8n2L0l9J21
4692F9j57N9K1P9K5j72N0k2l1m9J76P4m7n9j22O1P0j4N0J6K0j40K7P9n1J22p4l7o0KJ61M1
4291A67j39j7p3J38o8j0J89j60r5P0K8p4Q3p7O3K5j3j40J97l8p1M9Pp7O4L3j72J19J4O9j20
3903b9kNPJ44j50O0lj04O0j6M4L8j5l5r4j29K44P4r0n2K7J6m2J20j16J32m3q6k6J16O0p2l1
3490A2J19j09j05K13j63q7%J25q6J39j21P6o4N2R0nq5M1j12n4J12L0N3p1k1J75j30K0j05L5
3114b6O4plq4O6M5m9Nk3P9K6L4j4j22N7n6o5J11m7j76J82R2Rn2l1%J21j12n8J9jO6j36qM8
$$ plain form
6007 21 -58 -70 -156 -8 25 96 21 8 -44 45 -54 79 33 -87 110 55 31 40 25 -43 110 -29 49 -34 -57 116 200 -39 -43 -33 -15 10
5606 10 -46 -119 -88 -20 -15 52 139 -12 -20 0 -7 36 108 72 99 17 -58 24 86 85 73 51 -19 32 -2 -121 -114 -35 -35 42 14 -99 -105 -3 -4 -99 -95 -4
5130 -4 -27 -74 72 -61 -143 36 -36 43 81 3 11 -35 -93 -15 27 21 -67 -14 78 13 -29 26 -11 -38 6 -14 -50 115 164 87 9 -43 -13 -52 69
4692 69 -88 -29 -8 71 96 -76 -26 -48 -79 -128 48 122 75 16 -106 -45 25 11 61 77 97 -43 -16 63 12 134 60 23 -37 -35 126 167
4291 167 28 11 -62 76 8 -2 187 27 -68 2 30 -44 39 -38 25 50 37 -103 94 56 -15 34 41 -36 28 61 -111 8 22 91 -29
3903 -29 -31 -26 -19 125 -25 35 32 -72 -12 -28 16 54 39 4 -90 -219 25 99 9 -43 -16 0 -42 78 -38 94 51 -35 -61 55 115 43 12
3490 12 131 22 -83 130 -33 -120 -120 5 -81 58 -63 13 -51 1 91 86 1 42 -70 -124 -12 18 71 0 -21 154 24 44 -61 -26
3114 -26 38 31 28 -56 10 55 6 11 -12 67 93 127 113 -9 48 -8 -73 38 -9 -185 -3 89 98 46 15 15 136 24 -34 -15 -16 50 -86 -94 -46
2676d6j03J81j08P6NQ3K3J8q6k51k7NJ02L9K6J53Pr2M3J8j2l3J41j34j01P4k0m1Q2r7J85j18
2276hP0k4q3m9K36r3j94J08J21j11K6n0P5k0m0M1p8R1p9J54j13j0j80J17P0rO5m6q6K7N7O6
1875E1k3R9j89Jn7J42j6Rk7LJp9J65m7q6P0l0J34k24j25J63k3k14p6L12J36j5o9O7J38J062
1487A253N15j650j24q90k7Q94K8mJ92k22nQ8M7k17J29k4O3j64K26o5j2n9m1Q2l5j6J3j03J04
1124b4k6N0j43J20J02%q1M4q1J94j67LJ13j8Q4r9n5l4M3j0j14m8J34j7Q6n3q0J5R3Q0j07l3
723b9J6rJ15o9J39j43j0N4o0n9J10n5M2n6J33j08m5Pj3J44r4nkj15K1J76j10J7n3o3Q5J02
322F3o3k8J02nj45J03r9N0jl8K14j20M6j37J52q7n5j11J58O7j3L1l1n3P3k2o2J8Q0j03L1k
-78A3o0J20r8M0p5p1N3KO9o3M3N8Np9J94j27O2r8O4j74J05l6OP3j1
$$ plain form
2676 -46 -149 32 -76 0 5 88 111 129 43 -208 -235 -230 -128 -89 -63 90 97 5 48 66 54 21 162 28 -73 1 -19 -60 22 -75 110 -8
2276 -8 62 38 -45 -94 142 49 -145 -37 84 -27 -1 -51 24 4 -36 5 -73 18 -61 93 -20 -30 -210 -93 -23 -32 33 -13 -99 -72 -15 51
1875 51 28 127 -62 -61 -118 24 8 17 -10 -7 -6 -85 80 33 -53 17 -13 121 -103 -228 -65 -88 -302 -378 -66 70 55 -14 53 191 1253
1487 1253 1768 118 -6 -896 -923 -29 -1 -5 187 -35 -40 48 95 -122 7 -17 46 -118 108 43 31 -28 -69 13 -22 -38 -25 -128 -24
1124 -24 -50 0 -143 -23 79 79 -2 42 -39 155 -12 -9 104 86 170 71 16 -18 25 15 -99 -147 -13 -30 56 3 -77 -62 31 111 4 -29
723 -29 -13 -22 93 24 163 20 10 64 4 -55 55 0 42 -14 119 11 -34 -27 -40 104 10 5 3 -112 -91 85 -25 -8 -61 -124 -39 63
322 63 0 -28 74 69 -76 27 -72 -22 -23 -61 153 33 79 -58 94 7 -48 -159 -1 66 53 84 53 0 73 51 -11 7 87 -16 15 13
-78 13 -47 73 -25 15 -60 -131 -78 -76 -7 -70 -27 31 36 -43 151 24 86 -12 52 -122 -17 -53 -47 26 15
-391A5
##PAGE=	F1=-12047.3
##FIRST=	23146.675690215950453,	6006.5297639999989769,	0
##DATA TABLE=	(F2++(Y..Y)), PROFILE
6007C5n7Oj13Q9O9M0l5rp3J00j02J34mj59J81o4k9%j2LJ35j35J3k1k4J71O6k42RL3k2J7l5
5593c5r0K8J04m1M9J03j31N6k7l1Q4K2l9K9k3j32R9L0N9k1l6o2J8j9j18kJ17n6Q2K2j28j8
5193a07J28N0j62N4L6nl9J04j12j05J66n3O4M4m2K4n8n5M9O6Lj02P9K7k6lm1j4K8P4n2m4R9
4780G5M4p9Kj01L7n1J01r5M6M2O1l0j14P3o0l8r2K20L7k1o8j07P6L3P0N0k6O2j80K8M7n1J48
4366A39o2j00m0N4R8L2j34K1j6N5l3J3J73j85q0O2M5j06J09o1M0Q1o4j64J80Jo0J7m9j6Q5
3978C5Jj65Q2J07N0j91P4m5N1J37j33L5Lr3O3j4JnN0l2j06j63K93R3j24p1nO5o6J27r7R2J
3565E0q8l5J33L3q6J8J17j01j15J66j52n9L0Q7q6J31q9N4m3Q5J4M6o9Oj50m4Q4M9R4n8k4J31
3164A29j35M4j03K8Q1j6J5j01N9O1n9L1k4O0j3M0Nr9K3k9j14J36k5j25J75R3j1j18%mR5j02
$$ plain form
6007 35 -22 -16 -129 -40 29 69 34 25 -48 52 -50 84 80 -79 102 38 9 9 -3 0 135 0 13 -8 -32 139 205 -37 -28 5 -17 0 -35
5593 -35 -125 -97 7 -34 15 118 -13 43 16 -15 69 91 52 81 58 -74 25 55 114 93 57 -5 13 -6 -124 -126 -9 -65 17 39 -89 -107
5193 -107 21 71 -91 -37 -1 -6 -45 59 -53 -158 8 -45 19 63 21 45 -13 -68 -19 47 50 -52 27 54 28 25 -16 -30 -2 72 20 -24 75
4780 75 119 40 42 -59 -22 -73 28 -67 -21 21 82 52 -62 11 -49 -87 -179 41 78 57 -11 -118 -42 -9 61 111 85 147 -33 -5 42 -9 139
4366 139 77 -23 -63 -9 89 121 -13 8 -8 47 14 27 200 15 -65 -3 42 -64 45 -16 24 105 41 -123 57 58 -2 15 -34 -50 35
3978 35 36 -129 -47 60 110 -81 -7 -52 -1 136 3 38 41 -52 11 -3 -2 -7 43 11 -95 -258 35 128 4 -67 -72 -7 -73 54 -43 49 50
3565 50 -38 -73 60 93 7 25 142 41 -74 92 -60 -119 -89 -2 -88 43 -46 8 -35 50 64 110 41 47 -103 -147 -63 -14 80 22 -2 129
3164 129 -6 38 -65 -37 44 28 43 -58 1 62 3 34 10 70 57 97 102 3 26 -3 -117 19 -6 -131 44 137 126 8 8 4 99 -3
2764cm3L7n9O2j5o0N4q6J41j09P1J6N3N2J5j8l06k3KJ03M7NJ39%p4M5J1k4n0J22j26n8Q0j5
2338a4m8M3o0K05j26J27p3j14m7K47r4k14J61R0j23N2r1J29n5k7Q1j29J02r8J64j30K1l15
1988c36K05J52o1K0Jj12N0K8Q9j7N6j72Pn1J14l6N6m0O1l0q5J60k1j39P6j2J99k80j26J47
1612i7J5j86j09K90J77q3%K42J0K700J050l826q3l67j75M85o9K4J71j63k9R4K6j83R9k4M8
1274C7j49J94k4%p5m2N8qk8Lj32J36j3K8j40J44P1O7j11Pp9J72j24PP7MO7o8q3J0%kj21nJ22
836@j3Q6o8q1k1J11O9q6j0J3PJ01n2J52j84k1N1l4r0J11n2M6n7J18o4k0k9pR5p1L5r8r2M1
410a14J76p9m7K6m7Q7O8n7n6J53l0j58Q3m8%P4n9J60j27P3j32J48l2r5j21K05L9o0K5j7m2
22dN3qm9j5R7q4K4mm8Q3j05N5o4n5N3O2nm5J4Q4%p4J79j47P6r3Q1j15P4o0l2P3J1
$$ plain form
2764 -3 -46 -9 -68 -6 -21 -81 -27 -113 28 -81 -10 6 59 111 126 108 -198 -221 -219 -116 -69 -64 75 75 1 46 57 33 -17 105 -21 -79 1 -14
2338 -14 -62 -19 -79 126 0 127 54 -60 -107 140 46 -168 -7 83 -40 12 -79 50 -5 -32 49 -80 22 -76 88 -42 -21 -336
1988 -336 -131 21 -40 -20 -19 -131 -81 -53 36 19 75 -97 -90 -141 -27 -63 -7 -47 14 -16 -101 59 38 -101 -25 -37 162 -118 -244 -97
1612 -97 -82 -268 -377 -87 90 7 7 249 259 2959 4009 183 100 -267 -442 43 -26 -2 169 6 -23 71 97 -86 13 -11 37
1274 37 -112 82 58 58 -17 -59 -1 -9 -37 -34 -166 -30 -43 -15 -155 -11 60 127 16 23 -56 116 -8 -1 76 80 147 79 -4 6 6 4 -117 -122 0
836 0 -13 73 5 -76 -97 14 83 -3 -13 0 7 108 56 208 24 3 54 20 -70 41 -11 35 -22 96 32 12 -17 -24 71 0 35 -63 -155 -114
410 -114 62 -17 -64 -38 -85 2 70 13 -43 110 80 -78 5 -43 -43 31 -28 132 5 78 -54 94 62 -33 -154 51 90 30 55 38 -4
22 -4 49 41 -8 -23 74 -10 14 10 -38 45 -60 -5 -69 -124 -71 -9 -14 -59 -45 39 39 -35 144 -3 73 -20 61 -54 20 -40 -72 1 12
-391A2
##PAGE=	F1=-12141.7
##FIRST=	23146.675690215950453,	6006.5297639999989769,	0
##DATA TABLE=	(F2++(Y..Y)), PROFILE
6007D9l0L0j37M2O4J2L4j5r3R7j00J01K7j62J40n1k7j1lQ4R1j32j2K5l4J57L1k01j4N0m2L9
5606Ij0j13L6J05r8M0J21q4R3q1l9J12k3k5J7L5j78J01MQ4mo0k8j6J6j09l1J43p8N2Q2j13
5205d0m4J43P1k20J26l4Qk9P0r8j01J40m0L9O7k2K7o5l8J4P9K1j16J06j7k7O7j14jM2J15r8
4805C1j9K2M1p0N0j11M5n6L8j4L1M9L3o1m5P4q2l2j19K52Kj7q6q6P3J6J32N5o3R7k10J2M1
4391B3m9J56l8j56J6O6N9lj10K8N1k9LL2J38j71p0M1M4r1J22m1J2R3r7j48J41L0l6l3r9N9
3991e7R5j7j69O3J66M3k38J32q2P0J13r0KLo6N7No9l9J29m1j04j63L21P7j27j00k1R4q3J09
3603A3p8Q2L5j03m6J34K4r3O6J13r9j18J21j24jJ6N2n9R8n9L8j7P5n2O0k5rj62l4M2Q8R9m8
3190B9k2P2j21Q9r9J1R0j2K6j01L8N8n1N3k4M4l9J4mm4k8K0j31J33Qp2J28P2nj57M7k2L9o8
$$ plain form
6007 49 19 49 -88 -46 18 30 64 49 -44 53 -47 54 81 -81 59 8 -19 -30 -33 51 142 10 -2 23 -11 146 177 -24 -38 12 -30 9
5606 9 -1 -114 -78 27 -71 -31 90 6 99 18 -21 91 68 43 60 95 -83 18 22 106 102 42 14 -2 14 -95 -126 17 -61 -9 73 -40
5205 -40 -84 59 130 -90 36 2 10 -19 51 -47 -148 -8 -48 -9 58 36 63 -2 -40 -26 53 74 -42 64 47 20 87 -27 -28 14 129 31
4805 31 12 34 75 5 55 -56 -11 -67 -29 -43 -12 37 70 9 -36 38 -44 -76 -195 57 59 42 -44 -130 -57 -41 91 146 83 180 -30 -18 23
4391 23 -26 130 92 -64 -48 18 77 74 -36 -8 43 14 17 49 187 16 -54 -13 31 -60 62 21 33 126 29 -119 22 52 16 -17 -116 -57
3991 -57 38 21 -148 -85 81 124 -114 18 -64 6 119 29 31 34 -32 25 30 -39 -78 51 10 -94 -257 64 141 14 -86 -107 -13 -96 13
3603 13 -65 17 52 -51 -97 37 61 -32 34 147 48 -70 51 -73 -74 -58 -6 -65 33 -26 12 -5 70 18 78 53 44 -118 -152 -110 -22 77 29
3190 29 7 79 -42 47 -52 -41 49 37 63 -38 0 58 7 60 36 80 41 55 51 7 -21 -1 -132 1 9 -63 65 137 132 -25 22 0 39 -29
2764b9j8N4j10M8R6r7L4k1P0r2N2K6NN4L1N4l25Pk5Q2N9k5J19Po0L5Nk0o2Q2r1k1O2Oj5nl3
2301f1J95j39J87j02j44k9J89p7j95J86N9r1M6j08J52p9j8J09j67J06r2J43j47O2l91K70K02
1963F6q0k9K1j15O6KR8j7j3j09J2m5R6m3O4k4R5m6q5J31jj88Q7j1K51l15j05J25N3j11j42
1574c12K18J84j42O8L93j17M112J487n672p0l5k43K24j51P0J41j12n6R0J6j39Q6m0J6r7J34
1249E3RPq5klL3j2l6j58J48JK0j27J45M0J22j38op2J41q1RK7K8L9l9q5N4n0L6j32M4Q8j7P2
811G3p4q9l2J35J7n7K3NPJ04l9J36j86o2Q8k1r3Q0k9M9l7N0Pnn1JO4n8L0j42n3O3J17l0j05
373a14R4m1O2N4j6o7J72o7j49O4jo0J42n6Q0j24R5j20J36Pj22j00K19Pj15M5Nl4PK1k5m6J13
-41F6p3j0K9l4K4r3N6l7rmJ39p5j6qP7ol8J32j42Q5q1P1n5M8m4n8M5M1
$$ plain form
2764 -29 -47 7 -103 -55 41 -56 -22 -43 27 -65 -13 13 18 72 103 157 -168 -161 -186 -104 -45 -70 49 56 -4 31 36 16 -46 36 -55 -76 -14 -8 -23 -28 -61
2301 -61 134 -5 182 80 -64 -93 96 19 -176 10 69 -22 24 -84 68 -11 -29 80 -87 19 -73 70 -77 -15 -406 -136 66
1963 66 -14 -43 -22 -137 -71 -69 29 12 -1 -110 -98 -143 -47 -90 -26 -50 45 -1 -86 45 44 -144 -57 -68 183 -132 -237 -112 -59 -170 -312
1574 -312 -94 90 -52 16 409 292 4404 5891 219 149 114 -129 95 -56 14 155 43 -13 77 93 -46 40 0 16 -81 53
1249 53 62 69 -16 -18 -21 12 0 -36 -194 -46 -45 -25 -152 -7 33 155 17 11 -61 80 -1 8 35 63 102 63 -22 32 -18 18 -114 -70 18 1 73
811 73 -1 -90 -122 13 30 -27 -4 1 8 112 73 209 23 -39 49 28 -65 15 -14 35 -2 48 55 50 -1 0 64 6 36 -106 -159 -96 21 -9 -114
373 -114 -20 -61 1 55 39 -28 144 77 -72 -8 -9 -69 73 17 97 -27 68 -52 84 91 -31 -131 88 95 -20 25 30 -4 3 24 -1 -47 66
-41 66 -7 -17 12 -22 2 -91 -35 -72 -81 -85 54 -21 -37 -45 32 26 -12 120 -22 63 -18 53 -2 46 2 -56 -11 30
-391C0
##PAGE=	F1=-12236
##FIRST=	23146.675690215950453,	6006.5297639999989769,	0
##DATA TABLE=	(F2++(Y..Y)), PROFILE
6007E8j4M9j47K0K0LR4j4j00P3r6N3L8j27Q9k7k6k2J5J57K3j21kM7m7J30Lj34o3M8k7Q4Kj25
5581h6M0Q0j47M2J33l2R7j19l2J03l1JLP0j99Q1mO5L9r5K0k9O4j08p9J59n8LJ23p6o6J40N2
5168A54k44J94r5Jj8N1q2q8J21l8J1Q4j8K8n7k1j8P8L9j21J14k4n8J39j33oJ5J54j45K5l3
4780IL1n3N3p7M9n0m5N1L0M3Jn1PN2r3j4j09K64l1l2r0q5N2M1J45N1p6J13k23k0O4m9J49j7
4354I0j73P2M1N8n4p2OR3o7L0L7Q1j20n3J5K3m2J23l2nN4j05j00J04L0J1r2j14J13Q1j3j74
3953a54N3J75M6k31J45j06P2Q0m4k5rj8M9K3j39n2K00n9q7j47L29L6j05j29j0R5r4P9o8J00
3578EM9j13n6J16K4q7J05R3q8j19R4q4O6m9K7qN2m4M0%L4p4L9J8oj45j8oJ26P6n6JK1r4J29
3139F8q6j6Q2PK8q8K0L2l0O3l4N2n1k2m5K2p3P0j27J10N3m8O5L6L6j62P2l7j5j8kN7j27L7
$$ plain form
6007 58 44 93 -54 -34 -14 -11 83 69 -31 42 -54 -1 37 -90 -1 -28 -54 -76 -61 96 119 -2 -4 43 -4 126 129 -5 -68 -20 -47 37 39 -86
5581 -86 -46 34 -113 -71 62 30 127 8 -24 79 48 49 52 122 -77 4 0 65 104 9 29 0 64 -44 -123 36 -22 -19 104 28 -38 102 154
5168 154 -90 104 9 10 -8 43 -39 -127 -6 -44 -33 51 33 61 4 -17 -35 43 82 -39 75 51 -7 132 -1 -7 8 162 17 42 9
4780 9 40 -13 40 -37 12 -38 -83 -32 -2 41 42 -9 -2 50 -43 -57 -166 98 67 35 -55 -140 -88 -47 98 149 73 186 -37 -57 7 -42 107 90
4354 90 -83 -11 30 88 34 -38 -32 61 -6 24 61 142 22 -31 -16 7 -35 88 56 51 105 0 -100 4 34 45 -47 -161 -48 33 20 -154
3953 -154 -101 74 120 -111 34 -72 0 80 36 11 2 -16 33 56 -83 -135 65 6 -81 -228 101 137 32 -97 -107 -12 -106 -27 -95 5
3578 5 54 -59 -115 1 25 -62 43 136 48 -71 23 -61 5 -44 -17 -25 27 -17 23 23 57 -17 22 40 34 -111 -129 -135 -9 67 11 12 33 -61 68
3139 68 -18 -34 48 55 83 -5 15 47 17 80 46 98 47 25 -20 2 -71 -1 -128 -18 35 -13 52 88 124 -38 34 -3 -18 -36 -38 19 -108 -71
2714g1J60j22JN8Lo1LM5m6L8N5J06l02M6n5N5N7m1R3J1l9J6oKn6L0m1lK3M1L5l4l4J59j49
2276b3K20q6j68kR0n7j36J72M4m9K1r2J37q7j4J11j71J03p3J10j58R9l82K75K04n2p1J7r1
1912a09P1k7R1k1q1k9K4m3P9k5L2K2R4n5o9R2ok09R9k3K75l31o3J01Q5n5j53J48J54j74J19
1524A3M61k00M666J619o355n0Q2k59J44k09J16J12p7q1P8L4j01Q9p1k1l7P6K7%q2N7n9N9K6
1161E7q6j71J34OL9j17J16K5J40j33ko2J19n9J4j5M5%k2n6P5q2Q9j42O8N4l3M9o7j02j1J57
761B7m4l8N1mqJ20l4Q9j37j28J42j4p2M4mN3nl6P6j7m0j2P2n5j6j28lP0L1K3j39J25m9L1M3
322A4N7o6J55r2j21M8K4j01J60j8nj06J05j11J25K9j34n6J89j6j60Q4L6m0m8N4no0J23o5p5
-66g6R5k5l2o2L4NL9q7J96j13R%L4j6J7Q1j27Q0p3N2k0L9J2p6KO8
$$ plain form
2714 -71 89 -33 -32 26 29 -32 -29 16 -30 8 63 169 -133 -87 -142 -87 -30 -71 22 33 -6 10 4 6 -50 -20 -61 -64 -41 0 35 1 -33 126 -23
2276 -23 197 111 -57 -59 31 -26 -162 10 54 5 26 -66 71 -16 -30 81 -90 13 -60 50 -108 -9 -391 -116 88 36 -35 -18 -109
1912 -109 -38 -65 26 5 -76 -105 -81 -124 -45 -70 -38 -16 78 23 -46 46 40 -169 -70 -93 182 -149 -212 -111 -26 -81 -234 -86 68 -106 13
1524 13 474 274 4940 6559 204 154 236 -23 121 -88 28 140 63 -18 60 94 -7 82 11 -10 -47 29 56 56 -26 31 -28 31 57
1161 57 -29 -200 -66 -60 -21 -138 -22 3 143 10 8 -54 65 6 20 5 50 50 28 -28 47 -35 54 -88 -20 34 1 50 -17 -119 -130 27
761 27 -17 -55 -4 -8 -16 104 70 159 22 -106 36 22 -50 -6 -10 43 38 2 78 61 21 9 81 26 10 -118 -121 -51 -20 3 -136 -11 -60 -29 14
322 14 71 5 160 68 -53 -5 19 -82 78 60 55 -51 54 -57 68 97 -37 -93 96 80 -80 4 40 0 -48 6 1 -59 64 -1 -76
-66 -76 19 -6 -38 -100 -66 -61 -22 -109 87 -26 -17 -17 17 1 18 99 -28 52 -21 31 11 50 62 -14 -12 56
-391E6
##PAGE=	F1=-12330.4
##FIRST=	23146.675690215950453,	6006.5297639999989769,	0
##DATA TABLE=	(F2++(Y..Y)), PROFILE
6007E8j5N1j34K1m2J8J17Lq6L1q3kM1p3L3Nl1l2L4K05n0r6K2M3m8Q8No7j12J9J8J31lj19L1
5568a9M5j67N6J19QQ4j29k3N2QK5KP0j83L7J1J4R4j31O0oR3j15j28J64om5J22k4p1J19Pk22
5155g9K21j17k8j5N1o1q4J19l9pO9j5L4l0j6m0N6N6j17R8nr5J86r9k3l0J79j78O0n0Rk4K0
4742Fj9M8l5j11O9N2L1k6j7K5L2j03Mn8K51o0n8o4j13K5J02J10L0n8J09k22n9J02n1J34j0
4354F6j39R3oQ8r7l4k5R3m3M5J9J2m9j7j1jnJ16l1qj3r9l9R0jP4j34r4J27M8Lj65L7J48M3
3916I1j66J11j12N7N5k0l6k6M2L6K9j80m6K47q2n1j39L18qp9j41K4P3j05N2o8J35M1j06o5
3540a19R1K2p1J29N7o2j15Q7m1J13j43J6M3J0m7O7Mj8m9J2K7Nj03On3J40L8p3M5oo6J41n8
3127B9n1N9L8K0o5J4j1nO1n9Q4n8l9j02P7q9J01j20P6J07o0LQR9j43N7m0l9L1oL8j02L7J68
$$ plain form
6007 58 43 94 -40 -19 -61 -43 74 77 -9 22 -61 -63 -22 -95 -62 -57 -88 -120 -86 119 69 -27 -5 38 -10 78 83 16 -96 -77 -59 72 69 -50 -19
5568 -19 26 -141 -85 34 42 126 -3 -26 26 34 59 61 131 -52 -15 -4 10 104 -27 33 27 120 5 -123 41 35 -10 112 88 17 136 143 -79
5155 -79 142 25 -3 -18 33 -28 -112 7 -32 -39 30 15 49 19 3 -37 19 75 -42 56 51 -44 142 43 20 -10 169 -9 51 1 10 -14 6
4742 6 -13 35 0 -111 -42 10 41 15 -2 23 55 -48 -44 -102 149 89 31 -33 -146 -121 -19 91 121 63 172 -50 -109 -7 -58 76 66
4354 66 -73 20 14 102 5 -29 -54 39 -4 41 60 72 23 6 -5 -6 -11 105 74 66 53 -46 -85 5 4 78 -56 -150 -23 25 28 -137 -100 48 91
3916 91 -75 36 -76 -19 36 16 -20 -46 -4 32 61 -119 -165 82 0 -51 -190 128 120 41 -100 -76 -3 -108 -56 -124 11 52 -54 -119
3540 -119 -28 -6 -77 52 109 47 -68 19 -22 91 -52 -36 7 17 -30 37 41 23 -26 -14 13 18 -85 -79 -132 8 46 -27 18 12 -54 87 29
3127 29 -22 37 75 95 30 44 33 28 89 30 114 56 17 -85 -8 -97 4 -116 -40 67 7 10 18 117 -26 31 -9 -48 -17 -23 15 -87 -50 118
2701A18j39l0J18l8k6o6P6r1L1O3J28k58Q2o7L6L2l1O4%qjk7L7l4j7Pj1j2O7P1j9n9J00j35
2276c9J93k4j69J7om8n2J28M3j8rm6Q9p7j5Q6j37R6n8Q7j62J20l07K20J70Mr3om0O1n6P0l0
1862hj17L1M6l9M9J5j9P5P2o7m0O5m2j87J01l6K63l29qP8J03n0j42J13J03j67J37M34k27M161
1487D368J402n623jN8k45J68k42J43Q7n0j00O8P1q2R3q7o0JM6L3k1o6J02p4N3O4j26j52R6
1124g6rP8j05O1K9J16q0jn7J20o0J4l2N4m2k1pO1p6J31j52N2M2n7J9l4j16L1J65q5l4O5j2
711a8k7J31k9K0n2j89J74ol9K1PO0K4r3J18n3on2J16n8q0p5M7O3m7O0j37J16p4K2J4J32n3
297C7J12r7p3L3K2j03J18L5o8p1R0j01J18L7j35rJ36k9j73J15P4o6r2Q3lm7J16m6j51J70l1
-91An8k4pN6O4j58K08j09J8L4k1l0P2M0j12O0o6L5j2N1O9q3l1P8
$$ plain form
2701 118 -21 -51 67 29 3 -63 13 -78 -47 16 144 -114 -32 -99 -63 -31 -62 2 2 -6 -7 -34 3 -31 -48 -41 -52 -64 3 74 55 -4 96 -39
2276 -39 154 130 -39 -22 -28 -76 -128 0 43 25 16 -30 59 -18 -33 53 -84 12 -46 41 -121 -1 -308 -88 82 86 -7 -13 -53 8 -48 22 -8
1862 -8 -125 -94 -48 -87 -38 -23 -42 33 105 38 -2 63 21 -166 -65 -101 162 -167 -175 -97 6 -44 -186 -73 30 -137 0 434 207 4368
1487 4368 5770 147 146 204 -41 127 -115 28 115 65 -35 33 104 22 115 28 -32 -31 15 48 27 -39 63 -11 42 106 -20 -172 -76
1124 -76 -85 -7 -112 -51 -22 94 14 13 -44 76 16 30 -2 52 10 -11 -18 43 -33 98 -54 -2 40 -17 2 -32 -148 -117 48 -37 -71 -6 -18
711 -18 -45 86 57 77 25 -164 10 4 -35 -14 -7 53 77 -16 102 49 43 -9 107 49 -31 -106 -59 4 -43 17 -120 -4 -78 -56 -42 90 37
297 37 149 52 -21 12 34 -69 49 84 16 -55 35 -66 52 89 -46 -55 81 52 -121 -6 68 2 -90 -7 -10 -57 59 13 -138 32 1
-91 1 -57 -81 -88 -32 32 -126 82 -27 -9 25 4 -26 46 86 -26 34 -32 3 -9 42 111 28 -3 75
-391G5
##PAGE=	F1=-12424.7
##FIRST=	23146.675690215950453,	6006.5297639999989769,	0
##DATA TABLE=	(F2++(Y..Y)), PROFILE
6007D5k4L6j05L4q6M7R8L1o2j3n3o1N0k2k7M5m5m3M8K22j03n9L6K5k9L3L9k6j37k5P0J53j7
5593G5r1OJ6j51Q0O8L1P5j18k4j4O9L0L2L6j40k5M7m0J45j59P5M6Q4j18j61J57N7q2Q1K7m8
5193F6Q4m3j53J89r6o5k9O8l7r2J29l3pJ2JM3Mj8m6PP9j07O8J8j21J96m0l5o4J79j93O7l1
4780@j8J2k3K9M9j2j40L7Q8J9l8J6PL1j14J8J1K15q0q5j4j56J2J64N6j1j4Q7k09q7J25m5J13
4366D3j5o4O2n1J20j10mm6O5J9M7k4m3J4M4l7j7j1J03k8%p2r7J8J01m8J34j42n5J02QK1j37
3953a00J7J03K2o7N6j02K5N0k9l2l1R6RK9j80l5K66j08Rj51K89m0p5j18O7M0j18L7p0J69J6
3565D4p9p9P7J1m9J32J1k2j00R4j0J17k19K0O7k2n1J13rn5%JlJ3n1L7r3J26pp9R2rm8J17j2
3127G5r0L4P0J1m0J8o1J4N2r0J19o3k2j43J01p6J08j21M2J57q4n5QJ55j13J2l3k5O3l1Rn0
$$ plain form
6007 45 21 57 -48 -14 -100 -53 45 76 14 1 -52 -113 -63 -85 -112 -67 -112 -155 -107 115 12 -47 -11 14 -15 18 57 31 -106 -131 -61 92 75
5593 75 -16 -10 6 -145 -65 3 34 109 -9 -33 -47 22 52 84 120 -20 -45 2 -38 107 -52 23 69 153 35 -126 31 88 6 87 114 66
5193 66 150 107 -46 143 47 -18 -47 21 -16 -108 21 -12 -19 -7 -6 37 41 23 -23 -16 63 -44 24 42 -79 117 77 42 -22 157 -36 31 0
4780 0 -18 -6 -29 0 49 37 -103 -66 22 41 3 19 26 57 -57 -39 -28 187 107 22 8 -148 -136 28 84 73 59 146 -63 -150 -25 -70 43
4366 43 28 -36 26 -25 95 -15 -19 -65 0 19 66 42 -1 13 57 20 3 -8 95 67 67 -5 -102 -84 17 -31 103 -39 -94 8 16 37 -100
3953 -100 -83 20 42 -25 31 -71 -46 4 -25 -57 -88 8 17 46 -134 -169 97 -11 -2 -153 136 96 21 -97 -30 10 -108 -71 -141 28 44
3565 44 -35 -114 -37 -26 -75 57 68 46 -54 40 30 147 -72 -52 15 -7 -58 55 46 -9 -9 -8 -11 2 -49 -12 -105 21 14 -65 27 18 -30 87 75
3127 75 -15 19 89 100 60 78 17 31 83 -7 112 49 27 -116 -15 -91 17 -104 -62 95 11 -44 -36 119 6 18 -15 -40 23 -8 1 -49
2726d9M9J30j51m7J32m6Pj23J05j18M7L6J27k16J08n2K1qNM2l3K3pn6P6pm0L2l4k5P4O4M0
2313A06q5K8q7J02O1j41K3o8m9K2P3N4nl2J2K6n1k5N0p9R3n8P3j52J20k06J34J49K5q7l8K0
1912HM2q3N0n4j02N5P1k6PN8o8J11M7q2j2O3r5j18Q4m2K19l12M9N3J12p8j22J03M8j29J24
1524a9L46k09K943R81l962O4rk09J97k46J41O2k2j13P2R9q3Q4o7q7jM7L5m2n0J12m3K5Q1j45
1149a8r6N0n3J22q0oM4O2J4j8o0J45p4Kl0O9p6m1M9J6l5J51j67J0O3q7j5K8j29Q0J46r4m1
736f9O3lm7J20j8m8L5k14J57NnJ3%P3K8r3J28r1K2j06J69n8j29j6Q4N6r2N8r1P8j08M7m9J84
310H3l2N9p8j8K0j2n7M1O9q8j9M0q0J16L1j29K8Q5l8j44J19J06r7j12J01l0j1R1j2k12K23
-78D3m3m7Kn0J05O3j96J76p7J8O5o2m1J10Rj01L2m6K4k9P8R2p1l9O2
$$ plain form
2726 -49 0 130 -21 -68 64 18 25 -98 7 -111 -64 -28 99 -117 -9 -61 -40 -48 -43 -1 -34 -11 -18 -74 2 -5 -45 -13 -47 -72 2 66 106
2313 106 21 49 -38 64 125 -16 7 -61 -110 -88 -15 39 34 2 14 40 -11 -36 14 -65 28 -30 43 -109 11 -195 -61 88 113 26 -12 8
1912 8 50 -33 17 -37 -139 -84 -13 -39 -32 26 -42 69 116 34 22 85 -10 -128 -44 -86 133 -179 -130 -77 35 -43 -165 -62 -14 -143 -19
1524 -19 327 118 3061 4042 80 144 135 -74 123 -123 18 80 58 -55 17 116 33 117 50 -37 -38 9 44 2 -48 64 21 46 127 -18
1149 -18 -114 -64 -117 5 -75 -81 -37 25 39 21 -39 106 32 34 4 73 -3 -44 5 21 -14 137 -30 -20 43 -44 -59 -31 -160 -80 66 -28 -69
736 -69 -6 -9 -56 64 46 -2 33 -181 -24 -19 -24 -11 -11 62 90 -3 125 34 56 -50 119 61 -68 -84 0 56 -36 22 -69 9 -99 -52 -101 83
310 83 51 110 32 14 34 22 -35 6 75 -13 -32 8 -72 44 75 -54 -26 59 21 -123 -4 102 5 -107 -6 -36 -47 44 32 -180 43
-78 43 0 -47 -45 -95 10 73 -123 53 -24 -6 59 -3 -44 66 75 -26 6 -40 -16 -45 33 125 54 15 77
-391G7
##PAGE=	F1=-12519.1
##FIRST=	23146.675690215950453,	6006.5297639999989769,	0
##DATA TABLE=	(F2++(Y..Y)), PROFILE
6007B7l1Rp4M9r1P3N2N7m2m2j2j12O9Oq5R3o7n2M8K12j14k2L0QNk4Q5k2j31n7J01J37l0n0
5581Ck3Lj04J00nL5Q5r7m1n9J11QR2rr6q8Q8p1J82j75O2J03L7j05j63J39R8r9K4O6lM7p8o3
5155DJ08m6q7o1R8k2j05J34j0Ro5K2N5K8k0l3o6J10r5M4K3j28J75Rl1o2J48j88M1Nm0M6n3
4742e3M4O3Rj33k4J24Ol4L1l0N5j16K0O9J62q5j05M0j86J8J97J4o2L3N6j84q5J10k5Q7j8J3
4341A1qp1J33r5J9n1L5P5M4q4o2N4J12n7j9o6Q2j0Qr6j07O4J18q6J68j14k1N9k9M1j02NN4
3928Dj4K4Rp7j8O4o6j2j9J28l8M1j45l8K61j31Q3j71K41o1r0o4J00J1j28L1o7J89j5m0j05
3540a13R2ol5J16k8J5p0J02%Q3k39L4M9m4m4J69l5p1M3J4n6J1KO3j19R6n7m9J09Om4O7M2j25
3114b2J9J00%j0J3j04K3M8j19J39o4K3j50R5n8J01j21PJ86r0j09M2J81q0l8k4J0O5o0poO5
$$ plain form
6007 27 -4 5 -69 -20 -111 -38 14 71 29 -13 -25 -137 -68 -62 -147 -54 -121 -173 -125 87 -27 -49 -19 -11 -6 -30 55 33 -98 -155 -54 83 53 3
5581 3 -20 -17 -121 -21 -26 9 94 -3 -44 -103 8 16 108 99 3 -85 3 -68 114 -61 1 104 141 36 -127 12 110 11 35 101 98 145 67 4
5155 4 112 66 -21 -82 16 -6 -111 23 13 22 -43 -21 34 62 42 9 -57 53 -42 2 25 -103 72 81 50 -12 136 -52 -11 -6 -46 0 -53
4742 -53 -9 54 63 -70 -94 30 36 2 33 3 58 -58 -38 31 193 108 3 43 -143 -125 72 86 24 57 113 -71 -156 -46 -71 16 -2 11
4341 11 3 -68 65 -30 -11 -62 -27 48 92 8 -54 0 112 55 36 -30 52 42 50 -46 -153 -89 29 -57 111 -3 -24 35 6 47 -55 -50 4
3928 4 -10 14 23 -54 -72 -8 -74 -86 -105 23 -15 26 -119 -157 104 -27 56 -115 126 65 -25 -89 11 22 -106 -75 -142 47 32 -8 -113
3540 -113 -21 -27 -62 54 26 41 -29 73 73 156 -83 -49 0 -44 -88 81 46 -25 18 32 -24 -13 -11 52 -67 29 -28 -77 32 38 -6 61 103 -22
3114 -22 -3 97 97 87 100 -4 19 67 -52 87 23 46 -104 -9 -67 34 -87 -80 106 16 -93 -51 130 50 12 -12 -2 63 3 -4 -10 55
2714E5P0j52m9J02k6K4j40J15j20Q7l6J27j91J26j8Km4M9K8o8L8jp7J04%l2K7n3pN9K1J09
2313A29q2m6j3k4J30r2K0q9n1N9L6N6Kl8O0l0j9m7K9k1R6p6O4j31J11j27N9J78l3n5p3O7K0
1900F9r7L8r0m2M3Q5Ml2Q4j03J06M1r1jQ6j48j4M7l7J58k83Q9L1J10j00j04R5Lp7Q9K51j68
1499D2J642N74k226J13n8j57J82k18J18K8J9j26Q8R5r4N7or7l9O9L4m4m6Q6K0jO3j48k0K1
1124b9j18J51l4o7N7kJ17m9o4J86r4k5j8R2q9q1R6m3K0J57j89k5R9j16m9J13j41J16J03q3
748im6N2K7o4Q8nr5R8j95R6J5K6Mj4Q6Kl8J10j08K0j43J98m8j41K4R3O4j05K2j9L9j44R7j29
322a42J90kPm5L1Op0K1k2O8p4M3l4m2J14Mj15N1N3m4p6Q9J21j18j07J03p3L0M6L1k37K33m5
-91ej5Lp4J44M7j97J16l7K2O2p7k9J22k1r8OkJ4n7J06O7l9k1K8
$$ plain form
2714 55 125 -27 -76 26 0 24 -116 -1 -121 -34 -70 57 -134 -8 -26 -24 -68 -19 9 -59 -21 -22 -99 5 5 -27 0 -53 -60 -1 20 129
2313 129 47 1 -12 -36 94 2 22 -67 -118 -59 -23 33 35 -3 57 27 8 -39 -10 -31 65 -11 53 -78 33 -94 -35 143 110 55 -18 49 69
1900 69 -28 10 -80 -122 -79 6 10 -22 62 -41 65 106 15 14 100 -48 -62 -15 -52 106 -177 -88 -57 53 -47 -151 -56 -53 -130 -41 210 42
1499 42 1684 2258 32 145 87 -70 112 -106 12 40 59 -67 21 116 22 79 73 -24 -63 6 40 -4 -50 36 56 55 118 -30 -50 -29
1124 -29 -147 4 -30 -97 -40 -42 75 26 -38 148 54 29 11 103 14 -67 29 -14 6 163 -26 -51 48 -68 -117 -4 -145 -29 74 -9
748 -9 -55 -3 24 -40 48 43 -52 46 -149 -53 -38 -12 -8 -22 64 66 28 138 30 50 -93 105 57 -84 -60 33 97 -8 14 -5 34 -110 -13 -142
322 -142 48 46 53 8 39 45 -25 -4 -26 42 -32 11 -23 -65 49 53 -62 -11 42 -2 -78 11 132 14 -93 10 -63 -33 13 44 -193 40 -5
-91 -5 -20 -17 -91 53 100 -97 19 -18 4 66 -11 -40 82 61 -37 -31 -33 -19 -76 30 97 58 37 65
-391F5
##PAGE=	F1=-12613.4
##FIRST=	23146.675690215950453,	6006.5297639999989769,	0
##DATA TABLE=	(F2++(Y..Y)), PROFILE
6007A3l0k0n8O4n3Q0LP0m4m9L0j41R0J0j28J32q5n9M3J81r0OJ4%L4o3J13m7j03m7R0R0l4m
5581Hn2Qm5J02o2K3J10q1o5n8J03k8J57l4p2j44J18o3J93j79L7J36k0p8j34J13R7r6j6Q6N1
5193A15J8r2J9NOq0j01J38k6j11J19L1L3j29K9O8K6j5Kj48J45q4L1Qj22J37L9j4k5Q8j68j
4792e9M2m5O2n8K2R3J8j10p8J44j4j5K8n4Q4j04J2R1J12q1j10O7j74L7J79Rj09O1J9j41n1
4404a23N8QO2k0P0q6o3J22o8L8m2J7R4M0j37l9O4J64p5j5j29N1K0J4q5j28J09J17r3J56o6
4016C5kK1o5O8p6J7Kn2Q7k2m9n4Q9j08QJ0J31r4P8j02n6K37j40J44j77J78q0j03JJ07rj24
3615a00K8n9J98m8rj33J30j2l6P7m0L3k8J00j5L8j98M9No0k9K19o6o5O4L5r7qM7P3j17O7j13
3202g0J9P8K2m5RQ8j39J1J32k1L3j7j33K7N8j34J24n2P4j16O1n5R3j08l2J85o7j43R5J65m9
$$ plain form
6007 13 -17 -37 -95 -31 -84 -4 -1 69 25 -24 6 -135 -45 -35 -163 -31 -116 -175 -132 49 -41 -35 -21 -21 13 -50 63 16 -87 -134 -44 46 12 8
5581 8 -44 -36 -81 21 -41 -18 92 11 -54 -112 -9 -37 120 86 14 -130 -12 -75 118 -61 -24 112 92 14 -120 -7 90 -6 -22 64 115
5193 115 133 41 60 65 71 -9 -110 28 2 -109 10 41 74 -55 -26 42 68 53 55 -93 52 -32 -1 7 -115 22 61 47 22 110 -58 -59
4792 -59 -17 -62 0 -58 -36 57 75 -35 -113 31 17 2 30 -24 60 -44 -32 59 171 90 -20 47 -127 -90 89 98 -11 50 69 -72 -123
4404 -123 -65 -57 5 -15 55 -31 -94 28 -40 -2 -44 -27 67 107 -30 -69 -5 159 84 69 -60 -9 11 25 -60 -188 -79 38 -55 101 35
4016 35 33 54 -11 57 -19 -2 0 -52 35 13 -36 -90 -1 -109 -101 -91 40 -54 24 -78 -134 103 -37 107 -70 108 28 -75 -74 33 24 -100
3615 -100 -72 -131 67 19 10 -123 7 -5 -41 36 -4 29 1 101 86 124 -74 -25 -20 -80 -109 110 44 -21 43 78 -19 -27 20 93 -24 43 -70
3202 -70 -51 27 49 4 13 101 -38 -27 105 84 117 100 -33 -6 52 -82 42 -10 64 -52 9 -46 47 -61 -93 92 25 -118 -23 142 93
2814I3p4j2L9L1o9MLQ5Jj27m5M6NK0j09R3q9J26j28J38j77J35K0k5n8P7K6q3K0J1o9J01k1
2401a2%Po1K9L7k7J40m1j02O1j40J61m0J2p7m6M8L0L9J6l7Q7o2J9q3L5K4R0j01O0j04R9q4
1988b3LK28j26j4r8Q5Or5L9j26L4J2Q0M4m9Q2j27O2N9q2j4J13j79R8Kk4J00k47R8K1Q8r4r1
1574a35Q1k6l0N5J75j16P47L29j064J19p2j02J30j59Q6j2P0j43J07N6j01K4O7q9q7R3K6k3
1224Fn4M6P9kJ9j46M5K4j79J51K5j08N7o0J92p6n7K30j13o7jJ16p3j35J16r0O3J67k09k8J18
836E6j38p4J97j54J29N8p4l8L7P4q0N4Lj19J26j47K2K4M9j7j9Q8l8L4P6r2j2j44J89l3j06
448f9L3P6Q4j01k3M6J7j67J43j90J54K9l6pN4lj42J00l6M2m9J05j18J6J03l9r0O0L8m3J2M0
47C9J13j18q0Q0j07N6j2P1k28J96j8J9k4o6J59L5j73N5rM5K0p4RJ16n9r9k0O6Jq3J16J2J1
$$ plain form
2814 93 19 7 46 77 8 12 15 100 101 -26 -71 -25 -20 0 -109 -16 -105 21 -107 31 -146 -11 9 -16 -74 3 29 -54 -34 -23 -92 9 -12
2401 -12 -12 -5 -66 -37 0 -27 113 72 -30 31 -109 52 12 24 -53 -99 -51 -21 18 34 -3 84 22 41 -42 -7 17 107 6 66 -38 61 -23
1988 -23 -20 208 82 68 -30 55 61 -34 5 -121 -87 -75 5 49 0 82 -45 17 76 -6 -20 93 -86 12 14 -10 90 -157 -59 -38 50 -44 -135
1574 -135 -54 -80 -110 -55 120 4 751 1080 16 135 63 -39 91 -68 18 6 76 -67 40 96 -5 19 86 -3 -90 3 29 6
1224 6 -48 -2 77 75 94 -52 -7 17 -162 -11 14 -94 -37 -97 95 19 -38 192 79 12 11 127 54 -81 35 -55 8 175 -34 -62 56
836 56 -82 -156 41 -113 16 74 0 -38 -1 73 -7 47 50 -69 57 -90 -68 -44 5 -12 -31 57 19 53 129 37 25 -119 70 37 -69
448 -69 -36 40 124 23 0 46 63 -104 39 -151 3 32 -4 -11 43 40 -102 -2 -38 4 -45 60 -58 -42 61 22 -68 -8 30 -13 -1 39
47 39 152 34 -46 34 -73 -17 -29 42 -186 10 -8 11 -13 -79 80 115 -58 -3 -12 33 53 -21 -12 104 45 -54 -74 -8 -7 -90 26 38 49
-366D9Qj0
$$ plain form
-366 49 57 47
-391D7
##PAGE=	F1=-12707.8
##FIRST=	23146.675690215950453,	6006.5297639999989769,	0
##DATA TABLE=	(F2++(Y..Y)), PROFILE
6007Ik4n0n2P7J1N8l1P0o6m0N3j25R4lj34J39q9o0M1J41n3J5OQL7p0R9q2o6PM5L6k5L1q3L5
5556d1jQ1o5oJ34p3q2j7L7n1J93j4p8j82J26l0J77j72J5J38n8m8q7Q7N3p5k1Q7R0Rq9O8q0
5143B5L6n4j32J80m0j07Q1P4N8j53J0P7JoN0k13J73p6K3j8j04R8N2OK6J1j37l5O8k8N3m3k0
4729f4J22J4r2j01J44m1J0K1m7J01q0mP3P8p0j06O1j13N2J15M0j39N1j3p4mrM5M2k2R1j35
4329e4l8R8m5N1k3JQ0L2j58J2M0J88r0j9j51J8M7J7n8j43J47R2o3J04k4KLj01J06p1M9n1p8
3916h0J20m6k9o0J13j37J1M9J15j42J34p1p6J96j22J56j52J05r1r5M4Q4j2r8K5n1J92p3%j50
3540a41J73Jn1K4k5L1J1Q4m4J4j20M8l2o9k0K44r0m3O1M5j02m0Q2O0q3M9j60R0J0L1l7m7J22
3127G6j27KJ62n3R0p5j39K9Q3j36P4k5J14n7J6p2Q3q1o6J56k7j36J36J18k2r4J5M1l0m8M3
$$ plain form
6007 9 -15 -65 -117 -40 -29 29 -2 68 2 -38 15 -110 -16 -19 -153 -14 -103 -163 -122 19 -34 -19 -13 -5 32 -38 61 -21 -87 -80 -35 1 -24 7 -76 -41
5556 -41 -42 39 -26 -32 102 29 -53 -70 -33 -84 109 95 17 -165 -39 -69 108 -64 -49 89 31 -17 -104 -17 36 -39 -60 27 117 126 37 105 25
5143 25 61 7 -125 55 15 -92 -11 63 121 -32 -22 55 56 50 100 -113 60 -16 7 -11 -115 -17 35 41 67 78 -59 -94 -26 -54 -1 -44 -64
4729 -64 58 72 -20 -121 23 -18 -8 13 -34 67 -13 -17 56 134 64 -42 19 -94 -42 73 113 -26 25 12 -62 -66 -75 -30 12 -10 81 -54
4329 -54 -92 6 -39 12 -11 -10 70 102 -56 -44 -4 184 94 75 -76 -58 -11 6 -52 -195 -48 44 -19 85 61 63 66 -35 71 0 49 -2 -80
3916 -80 40 -6 -35 -95 18 -119 -108 -59 56 -86 48 -23 -99 97 -25 131 -21 84 -7 -102 -58 26 14 -84 -59 -110 82 9 9 -141
3540 -141 32 33 -18 6 -19 12 23 107 63 77 -43 5 -27 -96 -116 128 38 -5 56 101 -1 -41 41 101 18 67 -93 -3 7 38 1 -46 76
3127 76 -51 -49 113 60 150 75 -64 -35 48 -88 -14 -39 75 18 34 -38 45 -36 -102 54 27 -109 27 145 123 29 44 85 55 7 50
2739E0k9R8n8o8n0rL8j1m5M7l6J41k04J58j61J30N0n1n0Q3K7n8l2J4k0N8o9M4j2n3O7K7n8
2326d2J06K7j25J12k10J46kQn4l2RN2JL5l9R4o8N4j17O3M8O5j20O8q1Q9p1n0K22j44J9j03
1925d0O8Rp5M2j44Q7j6N1Q5l2N8j52JR3n0n1J25j75J87l0j8O7k17Q0K3M7o4p1O3m2LL4J15
1512F1n4L66K46o02R0n5p4Q3q7O1m6J10j59J15Kr1LJ07o6j15J06OJ7p0J4J09K8l1j48P6N7
1124E9k12J16Q7j30M5r8K12q3l6K64j26j08K0J24l5j87J02j06P6J89k09%R1j41q0K48j59J16
773C9L0p5j4J4J16q9M2qj21J20r8k5M3N8n4oP3o8P9L7n3m9j12J53k6m1K6M1R7q8n2P6K1j72
347h6J64k01R5M8o5L0L9kk04J44QJ3m0J45j76Q5P2q4n2N6K7k7R1j1Q9r1m5L0j11O0o5R1j99
-66a72J25M1M7p4l0J47L3j36QKQ1l6o7O0J07r9j06m6J38j5r9J06l9O5K2l1
$$ plain form
2739 50 21 119 61 -7 -57 -66 -28 -39 -84 -37 -73 68 -136 22 -139 -9 41 -10 -60 23 50 -8 -40 -26 -46 12 -57 -13 -25 -78 -11 16 -42
2326 -42 64 91 -34 78 -132 14 12 20 -34 -66 -57 -5 -4 31 -8 86 18 72 -45 18 66 131 11 79 -2 87 16 -34 188 44 63 -40
1925 -40 28 37 -38 4 -140 -53 -69 -18 67 35 93 -59 -58 35 -15 -66 59 -116 71 41 23 90 -127 -47 -24 23 -41 -112 -49 -91 -88 -54 61
1512 61 7 373 619 17 107 52 -22 61 -26 35 -11 99 -60 55 57 -34 -31 76 10 -105 1 7 24 -46 -32 77 105 74 -74 2 59
1124 59 -153 -37 50 -80 -35 -133 79 -4 -40 224 98 -10 10 134 99 -88 14 -92 -16 173 -36 -36 55 -86 -166 82 -77 39
773 39 69 -6 -20 -6 110 21 63 55 -66 54 -44 -69 -26 32 -22 -28 45 -23 56 93 40 -9 -121 32 6 -35 -9 32 129 41 -11 65 86 -86
347 -86 78 -123 -28 20 -45 -15 24 22 -182 -38 -30 -17 -57 88 -88 -3 69 -15 -67 -11 16 -11 80 69 158 67 22 52 -59 1 -64 27 -172
-66 -172 -47 -6 41 -33 -63 84 117 -19 -11 -9 72 36 -31 29 136 37 -69 -115 23 8 -91 15 -24 41 63 32
-391C2
##PAGE=	F1=-12802.1
##FIRST=	23146.675690215950453,	6006.5297639999989769,	0
##DATA TABLE=	(F2++(Y..Y)), PROFILE
6007A3j8p9m7Q6P7Rl9O4j00k4N1o8P7k3r4J03p2n8M9J01l0J1J1K9Pm3M9j08l2Q2j0knM6j22
5568a09Q0J0M5mn2J43p2p5L0o1l7J75M6r5j96J16kJ38j55RJ09n7l5l5P3k0l8NP3R8J9p6Q4
5155A34j26L9k8j51K18m9r7L1J02P5j38k2P6l5%J00k34J84p6J0m8o9O1O6J7O3o2j02m5P9M
4767b3K6k0n5J24Rr0r2J30p3L6K5j1J03o4k3L3O2n6r5L3k0M2L2Q8j42Nl6J4K8o6Q0K4l3R1
4341H6j30j9P0l2N5Pl7O2J3j30N5oJ86j04l5j09KN1J8l8j36J66N4qL1mmOj31J44p7Q3j02q0
3916i3J29p3k5k1J23j45j1Q6R1j57J87o4p9J38p4J10j05L9q4o1L8M5Kn7K1m6J70q4j8j36J94
3528D0L4p2l3J4J6K9O0o8K2m0K6m2p3k7K30r6rM4L0p1o9J04K9k2M1j79J22o0L0j8r3J45r2
3114d8j5J79q5J48j43j22K9J12j25mJ5J36Ql1r4O3n2q0J12J1q0J40O0pj01O1J3r2qQ6q2J05
$$ plain form
6007 13 -5 -84 -131 -45 32 41 2 66 -34 -58 -7 -75 2 -21 -115 -12 -84 -142 -93 8 -22 -11 0 29 36 -7 42 -66 -98 -16 -26 -28 -33 13 -109
5568 -109 -29 -19 26 22 -30 113 41 -34 -4 -65 -102 73 119 24 -172 -56 -58 80 -75 -66 43 -14 -49 -84 -11 -31 -69 -64 9 107 126 50 134
5155 134 8 47 19 -132 86 37 -60 -29 73 148 10 -12 64 29 29 129 -105 79 3 13 -35 -104 -43 23 40 103 41 -61 -106 -27 -23
4767 -23 3 -17 -72 52 61 -29 -121 9 -64 -28 -3 -14 89 25 2 35 97 41 -54 -21 -41 1 33 121 -21 -16 -52 -38 -10 -76 4 28 -5 86
4341 86 -44 -63 7 -25 30 37 0 62 75 -55 0 -6 180 76 41 -68 -66 -15 3 -35 -171 -5 49 41 72 68 64 70 -61 83 6 89 -13 -93
3916 -93 36 -37 -62 -83 40 -105 -116 -30 61 -96 91 27 -52 86 12 122 17 56 -28 -89 -51 -6 -4 -61 -40 -86 84 0 -18 -154 40
3528 40 74 2 -31 -17 -1 28 88 20 42 2 28 -14 -87 -114 116 20 11 55 85 14 -55 49 78 56 97 -82 40 -20 10 -8 -101 44 -48
3114 -48 -63 116 31 179 36 -86 -57 55 -70 -74 -59 77 85 54 -40 23 -29 -109 3 14 -66 74 134 127 26 87 100 8 0 86 4 109
2714A09r7K0o7m3O1o6K9%J2J29k35J71j36J07O3n9l4P3L0lr6kN6j7j17Q2j0l9Q6L8o2J6R4
2301I3j06J25k22J02J5Ll1ql7R0n3N4n3R3o0P7j26R6M6K3j24R4p2P7n7j07J50p2L8r0K4L1
1900A3l8L7j38R3k9RJ12J1L0j82n2J34qr2J07j37K32l7l0O6k03N1M0ql1k6M0n1K2L0N6J4L03
1487C38K33n55N2j9q6O1j9M1n3J11j58J03l5o5MQ5k8j10J04k8N7q2RJ01O6o4j49P6J01k09
1111a18N7J33j37L2j13J76p3nK77j31j32M8J11Rk21O6r1N8K10j82L8K2j15o9K41j43Q7K2p6
748a9J9k2J39r2O1l4j15R0o3k3P4N0r8K0N4q2P7Jqo7o9J18m2K7K1QQ2o8m8N5M5j52J56j58
322f3L8M0p5O0qJ1k31J29R1j1n0J44j80J55J6j15nL9J5nJ42m8O0m6j2m2p5M9r9Q4j67M5J12
-91bP4j33J4J13M2r4k2rJ17p0o3R9J03j27j11q1J94k8r8P9o4J09Qk6
$$ plain form
2714 109 12 32 -35 -78 -17 -83 -54 -54 -42 87 -148 23 -113 -6 57 -2 -36 37 67 64 -32 -34 22 5 -112 -30 -40 -79 7 45 -17 -1 93
2301 93 -13 112 -110 -8 7 10 -21 -29 -66 24 -29 25 -28 65 5 82 -44 52 98 121 -3 91 19 96 39 -68 82 10 48 -42 -18 13
1900 13 -25 12 -126 -33 -62 -53 59 70 100 -82 -134 0 -8 -100 7 -130 102 65 35 101 -102 -51 -11 -19 -50 -76 -36 -87 -65 -35 21 35 338
1487 338 571 16 68 49 -37 24 5 46 -7 104 -54 49 14 -51 -47 38 10 -100 4 -24 33 -49 -40 61 127 63 -86 -10 91 -118
1111 -118 -61 72 -65 -33 -146 30 -43 -48 229 98 -34 14 125 134 -87 -21 -112 -54 156 -26 12 34 -81 -150 91 -52 35 57 -19
748 -19 0 -22 117 25 86 52 -63 27 -36 -59 15 65 -33 -13 41 -41 36 37 29 -38 -107 11 -31 -4 17 25 107 39 -9 46 91 -61 95 -63
322 -63 -25 15 -60 0 -8 3 -228 -99 -8 -19 -69 75 -105 50 66 -49 -54 -15 0 -5 137 89 149 103 91 49 -26 23 -76 8 -159 -114 -2
-91 -2 72 -61 -47 66 108 14 -8 -17 100 30 -33 66 169 42 -69 -150 44 16 -82 -3 -67 42 50 24
-391B4
##PAGE=	F1=-12896.5
##FIRST=	23146.675690215950453,	6006.5297639999989769,	0
##DATA TABLE=	(F2++(Y..Y)), PROFILE
6007A5j3j10k3Q8J20n5j7N5j35kK8J0M7m7k3L8l4n7O5O8l4PK3N5m9Pj8j09lJ35m9j0K3L7j72
5568a39J34j4J7R0j05J27o9m3N0j47RJ10J20j02j82J01nQ8j33K1O1l0l3J0O9r5J2M1M7P2L7
5180A19n3Q2j30K4j8j59K36l7q8mR6Q3j08m2N4n5nJ37k01J81q5k3o8j8K7Q3J7P0j10o4l3P0
4780b2L8Kqo2Q4J7r7o6J14j01N3L0L7J07o7l7j5N5l7q4J0P5Om5J26j13o3m5J04K7r3J05Ro0
4354a6Q9p7k3M9k2M0N5j07O9k5n4O8o8J68j08o5j5J7K5J9m1r7J41K6N2l6pk1K5j39J67p9R0
3941A00j37n8J25j03l6N0J17j33n2J13O6j37K17p0o3P2qK2n8%n0j8k1J3K7j4J3l6J24p4o2
3553g1p8J79P0q8q0O2lK6L1o5M9J9j7k9p1m1J78p5K4K2mk0q4J09mM7L3j59R5r8K0J1j28J61
3127B1m5m3J67r1J83j91r0K2J32j07q9N3J41O4n8j09L3m5o0O8L6JJ00J7qr8J14k9j26K8J02
$$ plain form
6007 15 2 -108 -131 -43 77 22 5 60 -75 -77 -49 -39 8 -39 -62 -24 -58 -115 -50 18 -16 -9 14 69 20 27 9 -100 -103 32 -17 -27 -4 33 -139
5568 -139 -5 -19 -2 88 -17 110 41 -2 48 -99 -90 20 140 38 -144 -43 -48 40 -93 -72 -11 -41 -74 -64 5 -90 -78 -37 10 82 119
5180 119 66 148 18 42 24 -135 101 64 -24 -28 68 151 43 1 55 0 -5 132 -69 112 27 4 -64 -82 -55 28 45 115 5 -59 -92 -22
4780 -22 16 18 10 -52 32 49 -48 -114 0 -101 -48 -18 19 126 59 22 7 62 25 -59 -49 26 32 -13 113 0 -63 -108 -4 23 -70 35 44 -16
4354 -16 73 -4 -27 22 0 40 95 -12 57 32 -22 46 -22 146 38 -27 -42 -25 0 19 -22 -119 22 48 100 64 57 36 61 -78 89 10 100
3941 100 -37 -95 30 -73 -109 -59 58 -75 -127 -14 52 -85 132 62 -1 71 63 85 27 27 -23 -41 -62 -49 -22 -36 -23 -59 65 -9 -71
3553 -71 -149 30 100 12 -68 -6 -9 17 48 -17 32 51 34 5 -66 -107 71 -4 20 42 38 18 -66 43 39 86 119 -40 55 -43 -23 -12 -140 21
3127 21 -24 -67 100 9 192 1 -89 -67 65 -42 -131 -78 63 127 69 -40 -7 -52 -112 -44 -8 -7 93 110 102 4 118 89 -37 -9 93
2739I3j23J00j04J16q6n7O8j24R0k3K9J08k20J56j03O8N6l9j7N9L3O0j51l6J30r8j35R7J6
2376c7k9P8O5n4q3J33n7J09j91N2J4mj2J6o3J29j12O6p9R1m9Q0r7J11K4j5j19J30p3N2k1j09
1975e4J32q6M8p2l5O3J7J7j16N9k8k9J12O2J7k16p5J64K6j17O6p6K26k1o5R1k03K8O3n7j0
1587f9M4Nn1K7L3JP3L11K11n82L0K0j29O5L2K0k0N4j34P6l0l3J5J6J4p9R3p5R6q5K5O7Q8p5
1161E4j46P0J34j81rJ58j34L2j19J14o1K2K60j17j28P4Q4L9k20K7n9K6K02j34O2n6n7n3J73
798E7j01O1K2o3N0p1J39r4J00o1j05M5l5J8J13K3j42M9N2q4L4k6K5n8m1J05q1P4L3pL1m4j7
385AjP3j09J35q7lPo4P5p1L2k01N5J75k7o9J01j26K12n6j18L6J4NQJ58o8L5MPj07j4K9r8N3
-53dj35j8J52J14j95M7P2N7n0m1l8J35o0n9J04J05j30j08j18K14l7p2M7o3J37l4k
$$ plain form
2739 93 -30 70 -34 82 -4 -61 7 -117 -27 -50 -21 87 -133 23 -80 -12 44 5 -12 47 80 140 -11 -47 83 -15 -150 -53 -37
2376 -37 -66 12 77 23 -60 73 16 125 -66 -14 0 -4 -16 0 -63 66 -46 20 -59 32 -17 63 -34 77 101 86 -33 97 24 76 55 -54
1975 -54 78 -8 40 -32 -67 -4 13 30 -86 -27 -55 -84 28 90 107 -109 -184 -20 6 -111 -45 -121 105 84 19 110 -93 -65 -2 -59 -69
1587 -69 -25 -20 -71 -44 -11 -10 63 374 585 3 33 53 -76 -11 21 41 21 75 -59 17 -13 -46 -31 -15 -1 -80 13 -62 34 -51 -26 41 129 54
1161 54 -92 -22 112 -69 -78 80 -54 -22 -141 -27 -88 -66 194 77 -51 23 107 146 -74 -47 -106 -80 122 -12 50 -6 -63 -116 57
798 57 -44 17 39 -24 26 -45 94 0 100 39 -66 -21 -56 -38 75 98 -44 5 57 -27 7 -19 6 -52 -93 12 -69 5 38 31 62 18 1
385 1 0 73 -36 99 12 9 16 -48 27 -44 -12 -213 -158 17 -10 -79 22 -104 108 52 -66 -30 -16 -11 -3 155 87 122 126 133 26 12 41 -57 -4
-53 -4 -139 -157 -5 109 -86 -39 33 90 40 -1 -39 96 36 -23 81 186 56 -52 -170 44 7 -65 -18 -81 56 22 20
-391B0
##PAGE=	F1=-12990.9
##FIRST=	23146.675690215950453,	6006.5297639999989769,	0
##DATA TABLE=	(F2++(Y..Y)), PROFILE
6007Foj42L1Q0J29j17K6M6j61K6NO6K2p3M6k1J8p2Q9M2o0J7K4P5j05O1p5q3J8J41o4J1N1P
5581E8k17J81n6RJ63j46R5o0QL1j92O7K2J70q4j39R4m3M1j11M3KKk6M1O6j43O3O2J1L9M0k2
5168F9P7j01Kj9j64K23pp5j1O0Q1q8l4J1m9j6J54j25J67j04o5p4L7oR8J1N1j26k6j1M1O1j1
4755C1jl9J0M1r5m4J00j12M6L0P0J26q9m0n3M6j7p1J5J40m5j03J39o0j21m0J66kq9J17or6
4354d6R7om5L5j0PJ14j84R4p3M2N2j29J44r5j04R7N2j8K2o1l9P8J2R9p6k1n3M6j12J66o8N6
3941G3j45j6J08j23n2J27R4j08r4J25L8q3K12p4m2J7M5o9l1JPJ1j09ON6NlqN9m2j14QJ34R4
3515A07j04r7R6j8J9nk9P2N3p2qo4m3J07l8M1Mm4K6p1R3k1R3K4j10K6q3JL7j43J62kp2J22
3089E9n0J76k00n8QJ37r0j59P4J32J05n3j08lo7j1K9N5O6L3Jk0p9J47o4j19M2P7j36Q8p8J92
$$ plain form
6007 6 0 -142 -111 -31 98 -19 7 53 -108 -82 -77 -11 11 -62 -16 -37 -19 -91 -2 40 -20 -3 21 96 -9 52 -23 -106 -88 53 -11 0 51 58
5581 58 -159 22 -34 -25 138 -8 87 27 35 66 -126 -59 -37 133 49 -90 4 -39 2 -109 -66 -64 -62 -88 -47 19 -124 -61 1 12 51 91 69
5168 69 146 45 47 28 -136 87 80 5 -6 54 135 47 13 24 -25 -41 113 -12 155 51 -14 -88 -51 -57 41 52 103 -23 -49 -60 -19 42 31
4755 31 30 -9 1 42 -53 -97 3 -109 -63 -33 37 163 74 34 -19 27 10 -61 -46 94 49 -54 85 25 -96 -136 30 28 -61 56 50 -46
4354 -46 51 45 0 35 25 32 146 -38 56 -17 25 77 -52 92 -3 -107 -10 42 24 46 -15 -54 24 36 135 59 38 -15 31 -81 85 17 73
3941 73 -72 -88 20 -103 -155 -28 66 -42 -136 -11 27 -56 156 82 40 57 102 33 2 3 10 21 -88 -82 -26 -21 -24 -32 27 -15 -129 -121 13 107
3515 107 3 -94 2 -16 3 -2 -31 41 94 22 14 -50 -93 14 -24 17 21 -23 3 -68 25 4 97 121 11 37 -46 -45 -8 -151 11 9 -63 59
3089 59 9 185 -15 -73 -65 72 -18 -177 -103 29 134 81 -27 -30 -97 -108 -79 -24 42 75 76 56 -23 124 60 -59 -17 60 -76 12 -66 126
2689A26r6n5O1j61J21j1MJ04j85J10p2K8L1%lM7M3R9j75p8J72j56j08Q5N5l4M9J00n0j47J35
2301C9kQ5j44J1Kj7PM1o8J56j65Q1j09Q7m6O4l7R7nl0j11J52p3J8L8j0L03l70M9n8r4Q8R1
1887G0j4r2Rj8m8Q2R9K0k36o7J73M0j17K2j4J79Nj02J14k03K0Q1q5j0J15l8l2J7L0l2J04K74
1487C46J65n27K7M3j67P6O5oN0n6r4N1J1rK1n7M8m3P7j15J29p7M0L0P9p1j39Q9J38j49o3J64
1086G6j15M1j25N4n1L0K15q6r3P6O7M1j80Lk5lJ53q4N4r6K2m8O4m2N7J3l1O0j16J28r8J28
686H9o5r7nQO8J44j9j77P1P8q9k1m4M6l6l9J17j24Q6N5Lm2j7K3o5R2n0J18k9j9m0m2P5j26
260g3M8j19m3K28m5p5K9l9K42j14r8N4pOmJ44p0J6M5jj30N1Ko3J1j00m8J36J60k46O0L9P2
-153F8j0n4p4J29j5m7P9R1r9r1j45J97m3k2J4n0J49q8K3
$$ plain form
2689 126 30 -25 36 -125 -4 -15 -11 93 -92 18 -54 -26 5 5 2 49 92 191 16 -62 110 -46 -154 -69 -14 -48 1 101 51 -96 39
2301 39 37 122 -22 -11 -9 -26 -19 22 -46 110 -55 26 -83 4 -42 22 -15 82 77 47 -64 88 15 33 71 61 364 -6 43 -15 -109 -21 70
1887 70 56 -36 -27 -45 -93 -11 88 108 -128 -195 -22 18 -99 -77 -91 88 93 -9 105 -98 -78 3 -82 -92 23 -15 -47 -30 0 -32 72 346
1487 346 511 -16 11 54 -113 -37 28 22 72 16 -78 -27 -16 -25 -4 -61 -13 -56 21 -94 35 -42 -2 28 107 36 -103 -14 124 -25 -88 76
1086 76 -39 2 -123 -69 -120 -90 125 39 -54 22 89 130 -50 -47 -72 -75 78 -6 48 -48 -26 -74 -10 -52 5 18 -13 47 -69 59 -39 89
686 89 24 -73 -78 -70 -2 142 123 -54 17 95 6 -15 -59 -13 -49 -88 29 -95 -9 46 49 7 -10 13 -52 40 -10 108 79 60 20 -22 53 -73
260 -73 -25 -144 -187 41 -4 -79 -50 -89 153 39 -59 -5 -12 -6 -10 134 64 80 125 124 -6 45 47 -16 -5 -105 -153 -17 143 -103 -43 -4 68
-153 68 58 4 -70 59 44 -3 76 167 68 -23 -168 29 -14 -36 -22 -72 77 -11 12
-391A2
##PAGE=	F1=-13085.2
##FIRST=	23146.675690215950453,	6006.5297639999989769,	0
##DATA TABLE=	(F2++(Y..Y)), PROFILE
6007a3Lj69J06O8J00j53P1L8j74N7JP4J2j03Q4m5P0j06J20K2r0M4KQ0j42J04j05l5K2J08o8
5618a7N5O6k7k36K07r7K0J71j54O4n0O3j3j87J13o0J73n3p1R8r3J2r9O1n4J5MN3N6j49J02
5230b7O0l3K6J6OP0n2j2j5j73J79L0n4LJ3P3q1j1m1j9j8J44l9J48j21j04n8P4l6J01QJ5j19
4817d7J9P%O3j1jNo1O8p4l4Q6j00RJ7O8J62j11l3p4L4kn5N0J54q3j34J17Qj43l2J77m1n9J16
4379F5j5j30J09N1p8L1Ml1J61k24J12j18J30K5j76J20o7j39J84Q4n6L4q6J1OMJ24p5m0j00
4003h0O4n3J42n1lj25L3P7j26n5J77N9p5j17J22Qj2J78p2k8qN3j22l2M2O3K3j95L1P2j2k4
3603d6L6lOj64R5P7R9j21q1J02l0L5n5K5P4O7j18Nn8j3M4kL5rq0N6l4O6k1J01J1n1m7k6k2
3164d7M8j35J41K5q7N5L8J28j70m4kJ26q0j96O8J10J28j0j02k4j11M7%P7P6l4J6l1m9J43p8
$$ plain form
6007 -13 -10 -179 -73 -5 95 -58 13 51 -123 -66 -65 9 21 -82 2 -43 27 -79 41 63 -27 17 19 99 -43 61 -44 -79 -57 51 -17
5618 -17 38 104 77 -159 48 -49 -29 142 -12 52 2 65 52 -135 -22 -82 91 38 -33 65 -28 -16 -115 -54 -108 -93 -89 -36 20 -129 -27
5230 -27 33 0 26 42 48 118 66 54 39 -134 45 75 21 24 37 110 29 18 -23 -42 -60 84 45 193 72 -32 -90 -16 -52 49 57 72 -47
4817 -47 -28 -21 -21 42 31 30 35 -26 42 -32 -66 20 -80 -71 -54 14 176 65 32 -42 -8 -10 -65 -15 139 56 -78 39 47 -96 -128 49 8 -51 65
4379 65 50 -80 29 80 2 33 37 6 167 -57 55 -63 67 92 -84 36 -31 -170 14 98 42 76 -10 1 7 11 135 60 20 -80
4003 -80 -16 -69 73 22 19 -106 -73 4 -122 -177 0 59 -16 -133 -11 -3 -15 163 91 63 55 108 -14 -46 -4 59 82 -113 -82 -10 -22 -46
3603 -46 -10 -13 -7 -171 -76 1 100 -21 -102 0 -30 5 -50 -25 49 116 -2 3 -55 -68 -24 -26 9 0 -80 -24 -58 8 -13 88 99 48 1 -25 -47
3164 -47 1 -134 7 32 -55 0 38 166 -4 -48 -50 76 -4 -200 -132 -22 106 96 -6 -30 -141 -94 -94 -17 59 25 41 10 -39 104 26
2776B6p7L6J5j20P2l1K28q1o0N3j64J16L0m9J26j63N0n0MkL6J7L2N5J04j67j09J75j78n0N1
2388g5R5n8K1J24n6j46J04K7P7j01j9j4k7K3O2n4J62k06J10j28P5n6M1K0O9k3k0j08J35n5
2013aj5Q8J11N34p21N2n0j39R4J67l6p4l3qm5M0J01L5k33l5J53M0j00mK7J08K8j11J09j79
1637i7J6Q6r2k2J48p4J8j4J6k9J03K11J19m20L1M0j71Q4Q7l8J31j78o4M4O4jJ1q6O1k1N3j28
1236a12J62o5L4OM8p3j23J39J10j26r9J62p4M3j39K0m2K3J53n0m2M6O9J6j06jJk2P7m7K0p4
836f6R4o3n2J8Q5j2NL3j31J23j04J18l3q9m4O9R4J52o6j91P8J19r6o9n3O4k0n4J32j40O8O8
435C7L7j12LN1j07R4J5J11j0j6q2k1O2j50N1j6j25K34o1o3m7M1K38j27o5L6j1J9l6J12o4M
34C2O9l4j03J02l5kk9o0m5P2J96k83N8K4Q8J9o5j04J06L7k3M0M4l1o6j44J50n5M6k3l5J51
$$ plain form
2776 26 -51 -15 0 -120 -48 -79 149 68 8 61 -103 13 43 -6 120 -43 7 -43 -39 -41 -5 12 44 99 203 36 -73 102 -76 -126 -75
2388 -75 20 -38 -17 107 51 -95 9 36 113 12 -7 -21 -48 -25 37 -17 145 -61 49 -79 -4 -60 -19 1 70 47 27 -81 54 -1
2013 -1 -16 72 183 717 -4 48 -2 -141 -47 120 84 10 -23 -31 -76 -36 65 100 -133 -168 -15 25 -75 -79 -52 56 84 -27 82 -97
1637 -97 -81 5 -87 -109 39 -35 -17 -31 -15 -44 59 270 389 -31 0 40 -131 -47 40 2 133 -45 -109 -65 -1 -2 9 -77 -16 -37 16 -112
1236 -112 50 -15 19 25 73 0 -123 16 126 0 -99 63 -11 32 -107 -87 -129 -106 47 -3 -45 1 70 86 -20 -21 -20 -42 35 -12 8 -66
836 -66 28 -35 -87 -69 16 4 9 42 -89 34 -70 48 15 -74 -118 -49 45 197 131 -60 18 137 41 -28 -81 -17 -37 -91 41 -99 -31 37
435 37 74 -38 -35 16 -91 3 18 129 119 103 21 0 62 -88 -37 -53 -178 56 -5 -68 -115 -74 164 37 -28 8 -3 16 -20 92 28 32
34 32 101 67 -36 66 31 29 0 -60 -105 -33 163 -120 -62 -38 50 69 4 -100 6 43 20 60 104 73 7 -137 13 -42 4 -19 -54 97
-366I7j30L3
$$ plain form
-366 97 -33 0
-391@
##PAGE=	F1=-13179.6
##FIRST=	23146.675690215950453,	6006.5297639999989769,	0
##DATA TABLE=	(F2++(Y..Y)), PROFILE
6007c2J0j87J84N8M7j51J02K5j72P9K6M2Nj26P9k9J12j52J48J7j15P8m0O9j55J27j02K1RO1
5631C8q1J06O3m2k17K03j23L1J12j23N1m2J04n4j44J30j11J26l0J0R8j19Nr7O3r5ON6M9L8
5255A1j24J20M1q1N6k7J2N3Jj0Mj85J17O1k1J9k2O3p6Kq3J6JJ08K8J22j25j19k8Q0n6Q8J1
4842E7k4j05O6J9m6N2qoN6j00Q7m6k5O6o2n9NK7J92j10k0p5K9rl2J01J13q6j36O5P1j19k6
4429h8J29p0j2J06j5j46J09P1r9L2J0n7J78j97R7j41J78Rj94R6l4j53K23P6p1O2r9K5k6j9
4053b0J28l8n3j49O3K2J04l8n7q9P2L6j11l5J84J9m0j16J11j9O3J22o8k1LJ1j29m8J00R2K8
3665A27k46P2P5o6l9P5l8O0j95J47L2R0j42m1O8l7Q9j14O5N4P2j39J1n6M6JK0J5j5j05O0J6
3265c8M1j7P8%j3q0L8l7M3j10Q8L8p9j1J43O5j19n1jJ04q6j90L6Q1J33N1r8j3j51Q3j8J04
$$ plain form
6007 -32 -22 -209 -25 33 80 -71 31 56 -116 -37 -11 31 36 -90 -11 -40 72 -80 68 85 -30 48 8 77 -78 49 -53 -32 -23 38
5631 38 -43 63 126 84 -133 70 -53 -22 90 -33 18 -24 80 26 -118 12 -99 27 -3 7 105 -14 -9 -106 -43 -138 -132 -76 -27 11
5255 11 -113 7 48 -33 23 -4 8 61 62 52 56 -129 -12 49 28 47 25 88 12 14 -69 -53 -52 56 84 206 81 -38 -66 14 -42 46 57
4842 57 33 -72 -6 13 -33 19 11 5 61 -39 48 2 -23 43 -19 -78 -73 -46 146 36 16 -59 -30 -39 -71 30 143 57 -79 -14 57 -62 -88
4429 -88 41 -29 -41 65 50 -96 13 84 -15 17 27 -30 148 -49 48 -93 85 94 -100 -4 -38 -191 32 108 37 99 0 25 -1 -20
4053 -20 108 70 17 -132 -69 -47 57 19 -38 -127 -55 -19 -130 -165 19 38 -2 -118 -7 -26 37 159 91 70 73 84 -45 -93 7 99 127
3665 127 -119 -47 28 -38 -77 -2 -40 20 -175 -28 4 94 -48 -89 -21 -58 31 -83 -18 36 108 -31 -20 -76 -30 -29 -9 6 -9 -114 -54 -38
3265 -38 3 -14 64 64 51 -29 9 -28 15 -95 -7 31 -48 -59 84 149 30 -21 -22 82 -4 -194 -158 -77 56 107 9 -4 -155 -72 -90 14
2864A4K1p1M7k6j8J03o9k7K6n5r2N0K0K25m8p9N6j41Q6Q1j03J57j69J0m2Nl5N2M5J2O1Q0j35
2451D1j16J56j78J3J3J26j00J4J24o4q8O3J5Q9p1m3k8k5K8Q0l3J39k27J53j29N5p9L1M0N4
2075E3k1jj12P5k4k8Q9l1K95l34O8l4j59P7K25l0n8n8jl2J4N5N0j98LJ04M8q9mL7L3M4o8O0
1650D8j16nP7q6l5J19q1R3o2kNQ0J73R3l31K1J3j31Q8J02o5J89k64n6N4R3non7M2j5K5j05
1236a07J82n2RoJ2q7r4K02N5j13j16J59j0J7j56J6k2QR6l3J6j3Q6k3j9NJ5k8Pk3k4pJ37r1
811bj43N9J36m5L0l3r9J27j04O4K1q1n3J30Q1J37j11j64O1J49r8r9n7Q6j5p1J30j14M1N3Q0
423I6j56J1N6j18Q9P2J05l4J1j12j5M4j31L8O3j60J95o3m4r4P5K02p9l0j3lM7p6P3n2qP7p4
9hm7J26p2O6n6k9k5KK04l01N4L0R7L6q1j17Q3O8J6Mm2O7m4j11R2p8J21p4j7J44j43K5
$$ plain form
2864 14 35 -36 11 -15 -33 70 1 -26 0 -55 -147 -97 -77 148 100 21 77 -64 22 103 0 157 -12 -2 -44 -39 -74 -22 23 35 96 176 41
2451 41 -75 81 -97 -84 -71 55 -45 -31 93 29 -59 4 19 108 37 -6 -34 -59 -31 49 16 155 -72 81 -48 7 -72 -41 -1 53
2075 53 32 31 -81 -6 -30 -58 31 0 295 -39 29 -5 -164 -87 138 108 50 -8 -9 -41 -27 28 78 -120 -117 -13 35 -54 -58 -21 12 56 -12 48
1650 48 -68 -73 4 -82 -117 2 -79 14 -48 -50 -45 35 208 301 -30 -9 4 -127 -39 63 -2 187 -77 -133 -79 14 9 3 -54 -12 -27 -2 -107
1236 -107 75 23 32 26 38 -49 -143 59 114 1 -115 44 34 51 -105 -89 -111 -103 -7 -40 -24 -37 49 26 7 12 27 -1 6 -17 -41 -48 89 -2
811 -2 -145 -86 50 5 35 2 -97 30 -74 -10 11 -70 -123 7 88 225 114 -50 11 160 62 -37 -94 -8 -23 -94 36 -78 -37 16 96
423 96 -60 -49 7 -111 -22 50 155 121 132 20 5 49 -82 -44 19 -141 54 -9 -53 -147 -72 130 51 21 8 5 52 -24 49 -3 -11 66 -8
9 -8 -55 71 -1 65 9 -20 -45 -43 161 -140 -86 -56 41 77 -4 -121 -38 30 46 50 8 75 31 -80 12 -66 55 -19 -36 108 -35 -10
-391a0
##PAGE=	F1=-13273.9
##FIRST=	23146.675690215950453,	6006.5297639999989769,	0
##DATA TABLE=	(F2++(Y..Y)), PROFILE
6007c7J1j94K33O7k1j10J03Qj50P9O9Nj4j34M0J1J32j85J55M0j36J04q7N1j50J28p2O6j4K2
5631B0j07J44M6k2j61J68j34K4K6o9O5m7J20p0q1J20j24M8l3R0P3r5J9j00L9j12qJ11L4K0
5255Dr0J17J3j13J14o7j3K6L8PL4j98O3Q4J7Rk6N5n9j4q8L4L6N6N2R1j08j05MO1o6O6K0o2
4830hr7J07L1q8M8j3j6R7r3Q4k6rM5rj37Pm0J96p9nn7L6m1nJ42L0m7j07j0J17o4k0L2p3L8
4391c4R2nj36Q9N3j00L9%o2J57j05N0j28J74%j78P7j0j39K10K2o2J03r6jOo2J17K1o0j73L9
3991a02Q4O1l6q2n2R0rq7MJ53j3pj02R7l1J30N7o8k2M4o3r8o3J50P7M3k51J02P6j41k8Q0l6
3578d3J11k07J44J4P8j62J0%l6J66j68O2K5P4j22J2n3J04j7K1Lk2j07L4N8M0k8M6qpo4Q2l8
3164BK9q3J3M5m9n4K21J6o2p3QQ0j09j46j2O2J12J03r6K4j59P6k2J31o8p5Q1j3ON4m8MK9j07
$$ plain form
6007 -37 -26 -220 13 80 59 -51 52 60 -90 -11 58 63 49 -85 -45 -34 98 -87 68 108 -28 76 -11 40 -110 18 -54 12 -2 20
5631 20 -87 57 103 81 -80 88 -46 -22 4 -65 0 -47 73 3 -78 42 -82 -34 -67 23 96 1 20 -80 -41 -153 -161 -50 -16 4
5255 4 -86 31 44 -69 45 -22 -35 -9 29 36 70 -128 -65 19 36 45 19 74 15 1 -87 -53 -17 39 91 182 74 -31 -27 34 -32 34 54 -8
4830 -8 -105 2 33 -55 -7 -20 -36 61 -32 52 26 17 62 53 -84 -77 -117 79 0 -5 -62 -26 -67 -72 70 100 53 -54 -64 53 -11 -31 1 -72 -34
4391 -34 58 53 -83 6 59 -41 -2 -2 -64 93 -12 38 -90 84 84 -94 -17 -27 -166 44 66 4 107 11 10 16 -46 71 92 32 -141 -102
3991 -102 -18 43 7 -75 -127 -37 -46 -133 -129 24 11 4 -98 -1 -32 98 155 87 65 109 46 -52 -115 35 112 155 -96 6 82 -59 -87 -7 -43
3578 -43 68 -139 5 19 97 -65 -55 -55 -91 75 -93 -31 -6 68 -54 -42 -95 9 -8 13 16 -6 -113 -79 -21 19 -9 37 29 22 -42 40 2
3164 2 31 -52 -39 6 -43 -97 124 140 78 5 13 93 -16 -162 -174 -112 0 103 7 31 -128 -52 -74 57 -11 -86 -5 -18 -12 42 -6 -2 27 -80
2739h0o5K5N4J92oj10P6j16M8J17j25J60j81Ll9K4n5M6O9j1N4M2r2r5J37j82O0j3J45j46L9
2351b5R4p1mL4k6J03n1o1l4nJ4R2j2Q2k23J95j13M5j17M5MP9nPj21m%j6J4p73j065J766J23
1938b9%j47M0K49Pl9o6lj4K3l6N9j36L6L0P9r8J3K4l0N4K1j8k5n2O0p7m0M1n2J72j14j7M6
1512c9N5J71P3k73pk5o6R0J12q2K09k80o9O5Q1j0j4Jjj1on6J72l7rk6rj07m8K42j4r5j22J57
1086B2P0m8j64K8J4jO8n1O7p2Q8n4O3KJ8k4k6qn7O1J37j13j89P7J81o7L4j17k7J31r6j0O8
673Eo9k5J61L6J08j46q6J9J44q4j16n4J11j0q6J00m8K5J0J16j72J6L4j08Q7J14R3q1N9j35
297A8l1L5p2J1Q9j45J28m0l5j03O2J47J0Np3jQ3j01L1l8k2Q1r7j0J25r4J27p2k0qk9J84k98
-116a53N3M9R2M6j10j07O8O8O6k6j42J81m0n7M0j09J85j31QJ26j21J
$$ plain form
2739 -80 -145 -120 -66 126 120 10 86 -30 18 135 10 170 -11 -8 -47 -23 -78 -32 37 26 80 122 30 -65 72 -110 -50 -63 82 -64 -25
2351 -25 69 -2 -6 28 2 105 54 -7 -41 -46 -32 60 48 130 -93 102 -11 34 -83 -38 -34 45 40 47 -74 -78 -78 -94 -80 -853 -1918 -152 -29
1938 -29 -29 -176 -136 113 120 81 15 12 -2 21 -15 44 -92 -56 -26 53 -45 -32 -8 -38 16 37 19 -6 -58 2 -75 -115 -74 -126 46 -68 -85 -39
1512 -39 16 187 260 -13 -20 -45 -111 -21 91 9 218 -62 -131 -66 15 5 -9 -8 -9 -20 -26 -82 90 53 44 18 9 -98 -146 96 82 -13 -135 22
1086 22 92 44 -120 -92 -78 -79 -11 -62 5 -67 21 -33 30 32 50 26 0 -8 -65 -4 133 20 -169 -92 89 22 56 -61 -88 43 -53 -63 5
673 5 -64 -89 72 108 216 70 -16 3 147 63 -53 -107 4 -6 -92 8 -40 -15 -5 111 -61 -45 -11 -119 -32 82 175 94 153 18
297 18 -13 22 -50 -39 50 -95 33 -7 -42 -145 -83 64 74 79 6 5 88 -13 18 -20 -42 39 -58 -68 57 -37 90 18 -2 -10 -39 145 -153
-116 -153 -100 -51 41 87 -23 -130 -62 6 72 46 -96 85 45 -12 28 -81 104 -27 -19 107 -14 -13
-391a3
##PAGE=	F1=-13368.3
##FIRST=	23146.675690215950453,	6006.5297639999989769,	0
##DATA TABLE=	(F2++(Y..Y)), PROFILE
6007a8Mj95K41Q9q3m7P2j1j10N4J13ln3j21j2N1J23j80J28R3j58J10j21M0j44J14k8R1l1j3
5631ej32J53L1K9r0J12j35lm2k1J00n9J05n3j9R3j10k6n6J47J2j8M0r3j1r8j0J44J8Ko3R8
5230D0j4j14J68q1o5KM8L4N3k08L8J06M4l0pM8l2m0n2K0P4OK7O0p3p4K6L6o5M4L4j04q7J31
4805gM6j28P0k7l4J18n1O1k8J9L5L5j93K9j10J65l2J1k8N6q9J8J52o2J7m8r1J35rnq4m9P3
4391c5P7J2j04N5J6p8M3k1m7J08J0mq2J27j3j34O9or9J57n7l2J35q1m8R4j19R1Q3n5j54j0
3991a02J15K2m4p0k6Q0m1o8M2J07k8K2r0Q0k4J81op3k7J01j34n6o0J60L4O8k16J03Q6k08J7
3603e5L7oJ45j92Q7K1O8j68N1p7k9K36j98QjP9o8Rm2J30k4J3J4l3q2k0P9O6o3L3j3k7j7R3
3177E4k7K0p0o4O1ro9K43pj1q3J1N4j36q7o0P0O1J23q6O7j27L2j4J49j47n0R6JQK8l0J1M8
$$ plain form
6007 -18 -14 -209 32 121 38 -9 63 52 -58 -4 109 106 53 -68 -80 -29 94 -86 42 135 -23 87 -34 6 -138 -24 -52 39 8 -5
5631 -5 -137 16 47 76 -14 98 -37 -40 -82 -103 -3 -62 43 -10 -29 64 -46 -72 -128 19 31 13 53 -40 -51 -149 -159 -15 3 5 -58 40
5230 40 26 -88 80 -1 -66 -64 -16 18 71 -137 -99 7 51 21 14 62 30 -10 -62 -42 32 38 65 125 52 -22 4 40 -25 19 53 -51 -138 -7
4805 -7 39 -89 -19 -46 -80 38 -13 48 20 39 74 109 -84 -55 -165 0 -32 -21 -49 7 -82 -64 88 26 43 -5 -96 39 30 25 -59 -108 -35
4391 -35 42 54 -50 5 21 -57 -14 -35 -82 26 36 32 -50 77 64 -70 -1 -7 -106 51 -6 -38 97 16 -32 62 -57 34 117 62 -92 -102
3991 -102 13 35 -9 -79 -105 -25 -66 -134 -92 15 -13 9 -81 -1 -25 156 150 77 50 151 17 -39 -99 61 95 163 -53 50 136 -72 -55
3603 -55 -18 -24 121 -71 16 37 105 -63 -12 -89 -118 118 -80 -72 -73 6 -62 -53 -95 35 11 24 38 5 -77 -97 -18 48 -15 18 5 -22 -39 54
3177 54 27 47 -23 -87 -26 -35 -104 139 132 121 38 49 103 -33 -120 -180 -110 -49 74 -12 55 -72 -40 -54 95 -52 -102 -6 -5 3 31 1 12 60
2751F0j29m5%O0J49L1j37R9j04J5J26j10J16j65K7l9M8n5K9P1k7L5Mn1n5J32k05Q7k3J60j83
2363g9Q2M3p8P0K7o6J00l6o8k6K4j9R2NPj94K05q7O1j56P4o8J42Qlj27o9rQj20k197l729N838
1950c45K28N7j15lK34O2j8o4j1%O9j51O7o6N3m9J29j24K9No6O2J15r3O3j12M8p2m5m5OK26
1549G4j50k5P3M0J80M6k27m0o1kQ4J18p9J91k33p9N2L6loM7n2Ql8lJ25j9Op1j0j14QK41q6
1124C1o5j18J57J41j30j58M4N4NP2r8J09j05N4p0J23j6LJk2%n8Q7J00j11j86P6J85o1K3j86
736a19N8J21q5o2P8n1K7J43j5P8j62K6m2J07n2j28m2J32Lr6M9K9K6m2J31j65L1j2r0R2J38
347A06P6j25J21j59o4M3Mj7N8j06N7Pm3p6K1R2R9L3j14j9J22j13nj9l7R1q5k9J07q2J64q1
-53B7l6j0mJ59k82M9P1P0N4j45q2O3L7J24n2k21K83n9KPj39K25j79L8R2p4k5
$$ plain form
2751 60 -69 -114 -114 -54 95 126 -11 88 -16 -1 125 15 131 -34 -7 -46 2 -53 -24 47 20 55 59 8 -47 85 -120 -33 -56 104 -79
2363 -79 3 46 -32 38 65 -1 99 63 -5 -31 -7 -26 66 71 78 -116 89 2 63 -93 -19 -87 55 63 60 -67 -136 -145 -137 -257 -2454 -6183 -345
1950 -345 -117 -60 -175 -178 56 118 100 36 25 25 94 -57 10 -56 -3 -52 77 -47 -18 -13 -79 -17 98 5 68 -44 4 -68 -113 -158 -152 74
1549 74 -76 -101 -28 12 192 238 11 -29 -90 -92 -8 110 31 222 -11 -90 -38 -2 -5 -11 36 -16 -8 -46 -49 76 57 63 -8 -18 -132 -124 117 31
1124 31 -34 -152 5 146 16 -142 -98 -44 -39 33 -65 44 -61 -7 -77 46 30 33 34 12 12 -46 41 141 30 -156 -80 105 44 67 -119
736 -119 -61 60 -25 -87 -9 -60 -33 110 95 173 11 37 -5 102 50 -78 -120 12 15 -81 -32 -3 23 -19 112 -53 -22 -34 -124 -32 106
347 106 182 57 178 19 -45 -2 2 -15 43 -63 -6 1 -42 -118 -97 -5 94 127 13 -6 116 3 -2 -21 -58 33 -52 -81 26 -56 108 27
-53 27 -9 -19 -23 136 -146 -97 -26 44 98 -47 -129 -66 -29 95 43 -178 105 46 48 55 -84 141 -38 0 92 18 -7
-391g
##PAGE=	F1=-13462.6
##FIRST=	23146.675690215950453,	6006.5297639999989769,	0
##DATA TABLE=	(F2++(Y..Y)), PROFILE
6007B0j0j90K08J16j28J2K2k4n9J6J35L1j01q9o3P6R1j32P1J56j75R8j32L8j40R0J0J01k6
5643B2n7j40J24L9Q8l4N3j30l4p1%J44p6O8j7L3N8q4o7q1J68p0Q0N6o5p1o4NJ45J1k3m3P2
5230C9l6p9J81o0j18kK3N9M9k10M8J33M3p4J3L1nm6J0j9R7k8k9L6l5l6K9J4n2K9M8j46o1J23
4805c1O6j65J19m1o1J14jL1m6M1N6M5k00O1j62J10J0L7nP6j26K8J24j31Q1K5j56J23K1L0j94
4416a21oP9O3L3o7K7k0m2M4l7k9M9J02l7k1O5m6p5P4k4m7Q8j24OJ39o6q7J92j64N3J26l1r7
4003ap1J12j2n4l2j0N3n6o3O4O6k0M5r0N7lK04n2o9m5J58j81j6l8J26j2R3j62P5J12k43Q0
3603A5l4K4J52j53OL5N8j47O9j28k6K70j91p8j2Q5Jjj3J02k3LM7n1l0r2Q2J01j10M5j3n1K8
3190c0P9j6K5p7j16Q9K4o6K11k0M0o3qK6j50k8r8J09j5J08o3R7o6k5oJ56j81j3Q1MmL2j9N
$$ plain form
6007 20 10 -180 28 144 16 28 50 26 -33 -17 118 149 48 -41 -104 -28 63 -69 2 158 -17 81 -51 -13 -153 -63 -53 48 22
5643 22 -35 -175 -51 -12 76 42 95 -35 -69 -140 -140 4 -72 -4 -21 12 70 -14 -81 -162 6 -64 16 72 7 -64 -128 -123 22 33 10 -33 39
5230 39 3 -76 105 45 -73 -75 -52 7 56 -154 -106 27 70 -4 9 40 35 -11 -1 -20 77 49 20 56 21 -15 14 28 -24 5 53 -93 -154 -31
4805 -31 35 -130 -11 -52 -113 1 0 31 -15 26 82 127 -73 -12 -174 -64 -54 -17 -22 54 -72 -44 80 -51 30 55 -101 22 43 73 -121
4416 -121 -127 -48 15 48 -19 8 -12 -54 -10 -47 -76 -27 75 38 17 82 36 -39 35 11 -36 52 -72 -66 73 7 -80 112 -52 1 127 96 -1
4003 -1 -72 40 28 -26 -58 -68 -15 -71 -134 -70 -4 -24 21 -69 -12 -15 189 137 68 23 181 0 -16 -54 72 60 153 -9 66 178 -65 15
3603 15 -19 5 157 4 10 45 103 -44 25 -103 -129 141 -50 -128 -140 -55 -54 -55 -68 34 11 14 61 10 -20 -112 -30 71 -39 6 -7 -58 -30
3190 -30 49 33 58 -19 -135 -46 -22 -88 123 103 143 80 72 98 -52 -80 -178 -69 -84 24 -39 58 -8 -33 -39 117 -64 -77 4 8 4 36 17 22
2764B2O9j27l2j8M8R4O3j38J03j03rJ09p0L0j04N7l7O8l9J2N0k9J2k4k1j6J35k30R8k8J83
2376A28j98J19j4r0J07L2p9P7j3o6oN1o3P7J9o1j49J70n7J02j77Q8j32K13Pk7j15r5o7K6k52
1988d45l919o976J0782L63J15p8m1J97J04nn3k6K2J20k46P7j1M9j11J75j48L1Lp6O6J68j27
1650A0J10j58M7o4o6r8P6K37j57l1Q7L0J80J4j84o5q2M0O7J13n5J48j51o7Lj2J5J4N6r3M4
1261Ho3K6N9kO7j47Jr2N6K05j44k4j02J52J82j97j40N6P4L0R6j50J38j00j5o8J46m3k5M3N
873C2nk4O3M7q6j45O8J30k6J0k03J11R5q1n7M0k4P5Q4n2N9j56J37j06O3j4j35k0J37K0j06
485f9JQ9L5p3J14j48O6o9p2R3J44O8j53J77j75j03O5O7m1Np9NO3n8m1rM7J51N0j15n9J62j27
72A1l4Rn3J14m6r5Q4l3J67r0o3l3N7J50k53K7R3K9O4j67n8N8j4J81o9k56L47r9N5%j59K30
$$ plain form
2764 22 91 -36 -68 -86 -38 56 119 -19 84 -19 -28 81 11 41 -63 -6 -43 25 -14 -2 48 19 31 7 -14 -30 105 -125 -27 -55 128
2376 128 -70 49 35 -55 52 84 5 82 69 3 -3 48 -15 62 81 20 -129 41 -16 86 -91 -3 -135 78 85 58 -57 -152 -219 -193 -445
1988 -445 -4364 -11340 -558 -195 -80 -158 -199 -2 102 97 44 18 40 160 -86 -9 -20 29 -82 93 -55 -24 -21 -97 -31 137 10
1650 10 120 -38 9 -55 -121 -219 -143 94 -63 -94 -7 23 203 217 33 -32 -114 -74 -7 106 51 199 48 -19 -16 -28 -13 1 57 -36 8
1261 8 -55 -29 30 28 95 -52 -51 -143 -87 118 -26 -50 -152 0 182 -15 -155 -99 -25 5 101 -49 89 -11 -26 -94 52 9 -16 27 32
873 32 27 3 66 113 27 -118 -50 80 54 64 -139 -28 67 -14 -71 -31 -55 20 104 52 111 -45 92 -14 49 35 -100 -120 17 37 -69
485 -69 -68 21 56 -17 97 -51 15 -54 -126 -33 111 179 26 203 28 -75 -10 57 16 21 -58 -53 10 -48 -89 -98 -51 100 150 35 -24 138 11
72 11 -23 -14 -67 47 1 -94 -10 -43 124 34 -29 -62 -5 145 -108 -81 12 41 105 -62 -120 -62 -76 105 36 -220 127 28 83 83 -76 154
-329A54j98O7M2j7m8
$$ plain form
-329 154 -44 23 65 48 0
-391@
##PAGE=	F1=-13557
##FIRST=	23146.675690215950453,	6006.5297639999989769,	0
##DATA TABLE=	(F2++(Y..Y)), PROFILE
6007F6k8j78J52J30j46M1k1k9j4j2J28Q7j34m7j11Q6M7n8J3J94j68P3j25L8j36P2K2J05Lj11
5631f1j28O5P1J37j3Lj20m6o3j4J83r7L2J5P0K4o6n9r0J51j48J61O2k0j17k6K5J25J3o6j8
5243a5M9n3k1J45j6j44J5k2O7K4j95P7J59J3r3J3mRnP2o7R3l9q5K4omJ3nk7K1O1j86kQ1Q2
4792B9j93J68l8r4Q5M2No3M5J01J9j56Q3j86N4L7P0%P7j23K0P0j56J25Q7j85Q8J5P9k66M5
4404a16M9M5N8l9J2m3KM2l8j8pJ41l9L5J6q9k5Q9n1nK5j48M8R6n3r6K51j83J2J36J2k6j27
3991c4Q7l7n5RkK4n2p3O7M2QN3r4K8J5J96p1m8p9K04j98J3%O1l9J06j14L4J46k36J32q9L0
3578C4J26r3o7L7M6r9O3j33l8K62j57j54rQ1O5j8L3L0j6nQ3p4L5j52P3J17j45P1j2n5M4O1
3177C4j7L8r7j27J21M2o0J51m3R5j3m8qj36K2j19J57r3P2k5R9ko3j5J55j62K2L2Pk7N0j5J1
$$ plain form
6007 66 38 -140 12 142 -4 37 16 -13 -27 -39 89 176 42 -5 -116 -30 17 -41 -28 166 -2 71 -54 -16 -152 -80 -58 47 50 -61
5631 -61 -189 -124 -53 84 71 74 -46 -92 -155 -169 14 -83 -51 -36 34 58 -8 -67 -157 -6 -154 7 69 49 -68 -94 -69 56 69 3 -15
5243 -15 34 -19 -40 105 89 -55 -40 -62 5 29 -166 -89 70 83 -10 3 -1 8 3 75 8 101 62 -23 1 -5 -9 4 -1 -28 -7 54 -132 -134 -53 29
4792 29 -164 4 -34 -128 -43 -1 4 -59 -14 87 106 -50 33 -153 -99 -62 8 8 85 -38 -18 52 -104 21 108 -77 11 26 105 -161 -116
4404 -116 -67 -22 36 -3 9 -34 -32 10 -28 -46 -53 88 49 84 100 11 -14 75 24 19 44 -104 -56 40 -13 -109 142 -41 -29 107 119 93 -34
3991 -34 53 16 -39 -30 -32 -8 -60 -133 -66 -24 -16 37 -57 -29 -14 182 111 63 -16 188 -10 3 3 64 25 131 17 51 197 -39 93 4 34
3578 34 160 67 0 37 83 -16 47 -86 -124 138 -19 -173 -182 -101 -36 -54 -21 9 -7 -12 71 -3 32 -120 -47 70 -75 -4 -16 -71 -27 34
3177 34 17 55 -42 -169 -48 -6 -66 85 42 137 124 76 68 -68 -46 -165 -8 -101 -29 -54 45 43 -20 -35 120 -42 -20 12 19 -8 42 27 38
2764C8P2j13l2j1K9K9R3j00P1r6k8P4k3o8j7O9l1P6j1LJ6j9Jm0qkJ41k35R6l4K15j86J28o3
2338C4r9R4L6n4M4K8o9J5O7j02M6L7r6j00J00l2J48j60O6j55K53ln5p4q3j56K1l15n208r423
1963a5195J4501M73J50n3o4J50J16j3l0m1N1J43k77Q6J0K5j33J87j43J4K1o4O0J55j05J01
1637A25j60N4m9j07j08J37K13j37m5J00J7J67Kj68o8q5N4L8R7j9R9p2l2o4l1L6K4L4j13Q8
1261B7q7K3J1QJ47k31J7m8P8J58j82K6p3J31J89k27j11N5O0O9J12j69J51o9r0o4J37o3o4R6
886A7L4l6L8J1Oo0q1N5L1K7Pj58J05N8q0kj8LR8J1p2O0j31J99j47L9K1j40OJ27K0j09k3J14
460C0L6o6P1j34J20j22n4P8J35P0j54K04j75j28Q8R4n3l1q7j6J04o4j9j0J9J57M2p0r8J89
85A56j58m8M6o8J39kj65N9M1J32r6q2o6J15J64k10j9J17k8P3j60m1L7n9K13o1k49L57j44R6
$$ plain form
2764 38 110 -3 -35 -46 -17 12 105 5 76 -20 -48 26 3 -65 -82 -13 -44 32 21 24 40 21 22 -18 -26 -28 113 -122 -26 -60 155 -31 97 34
2338 34 -65 29 65 11 55 83 14 29 96 -6 40 77 -19 -119 -19 -51 97 -63 3 -152 101 98 43 -31 -114 -270 -249 -564 -5772 -15195
1963 -15195 -694 -221 -71 -124 -188 -38 78 65 35 -6 45 188 -89 -3 7 32 -101 86 -57 -43 -22 -86 -26 129 24 125
1637 125 -35 19 -30 -137 -245 -108 105 -32 -77 23 40 207 209 41 -27 -112 -58 -20 77 58 157 85 53 -11 -42 -6 18 52 -61 27
1261 27 -60 -37 -26 -18 129 -102 -85 -133 -55 103 -79 -53 -126 5 194 -33 -144 -89 -29 40 152 -17 134 65 -25 -89 48 -15 -79 17
886 17 51 15 53 64 70 10 -71 -16 15 42 49 -109 -4 54 -26 -28 -46 -43 55 66 -6 54 -77 122 -25 14 35 -105 -99 28 48 -61 -84 30
460 30 66 0 71 -63 57 -65 -119 -41 94 164 10 214 39 -89 -1 93 40 9 -78 -94 10 -54 -73 -83 -64 93 135 65 -33 156
85 156 -2 -50 -4 -72 67 65 -100 -41 0 132 36 -46 -112 3 167 -43 -62 55 27 100 -60 -101 -64 -123 90 29 -220 137 -7 89
-291H9J6j63J94j77Q9j6K9o1
$$ plain form
-291 89 105 -58 136 -41 48 32 61 0
-391@
##PAGE=	F1=-13651.3
##FIRST=	23146.675690215950453,	6006.5297639999989769,	0
##DATA TABLE=	(F2++(Y..Y)), PROFILE
6007A01m3j53R5J14j33K5l0k8J1j4R8J31j32rj51Q7ORj5J79j20M2j12L1j29O9NJ12M0j54j06
5618a74rJ11J68l1k4j11k2m2m5K02j17J6K4R1mo6j1p7J02j85J95N6L0j29mL8J01J8j25J6L7
5230B9o5L3Q1K4j30L9n9M9jj55R6J69l2o4qo3J0P7J05j02O6l3j23L5OK1j1l7J1J4P5k14Q4
4817g3J2Q8k02J91j6j25L5O8po1K5J56k8q6Q7j87J3M8J08j4N1p9MJ2j39J41J11j68M9j5J22
4429A21k89R0lJ9Q9k6Qn3M2M7k9j7n1J29k6O9%j21JJ04p8K1j8j28R1J8m3p8K50j74k0J15O7
4016A27K4j59N9n8m7M2PJl6r2N9M3M2L7q8kJ7J56n6j4j20K32k02M0L9om5J03q1jJ70j93J42
3603A40q8QO5k1j06J5L3l1L4q5p9K35j19j85%O3J00l5Q7n6mj3J04j00R7j70N9R4j46Q7ql2
3202e7K7M7k7M4j17r5J38M7o1R4q4J57L9r2m2r6O9j27J80j44L4K2P6M2o8m5J47j13M5l5K0
$$ plain form
6007 101 58 -95 0 114 -19 6 -24 -52 -41 -55 43 174 42 33 -118 -31 -25 -16 -31 148 28 70 -42 -11 -140 -71 -66 46 86 -68 -174
5618 -174 -183 -72 96 65 41 -70 -92 -134 -179 23 -94 -78 -54 37 33 -33 -44 -121 -19 -204 -9 47 77 -52 -56 -18 83 101 -24 -8 29
5230 29 -36 -3 78 102 -28 11 -48 1 0 -155 -59 110 78 14 6 -57 -47 30 135 33 99 66 -57 -22 -16 5 -6 -43 -32 -18 57 -157 -73
4817 -73 -61 27 -175 16 0 -125 -90 -22 -29 -90 -65 91 63 -23 64 -123 -110 -62 46 32 83 4 8 20 -119 22 133 -35 14 -1 121
4429 121 -168 -78 -81 -62 27 1 9 -44 -2 45 16 -1 -52 77 51 120 120 -1 0 104 26 47 29 -99 -8 10 -33 -111 139 -35 -55 60 127
4016 127 151 -8 51 -7 -54 -12 -5 -4 -40 -132 -73 -30 12 49 -39 -41 -24 132 76 62 -58 174 -28 12 51 45 0 103 22 21 191 -2 140
3603 140 52 60 125 104 -2 13 46 15 49 -36 -115 120 1 -184 -184 -121 -21 -56 31 -25 -29 -42 62 -38 59 -111 -52 42 -104 -17 -25 -57
3202 -57 -30 17 -10 34 -83 -178 -40 7 -54 40 -44 113 152 60 18 -78 -9 -136 44 -100 -66 -44 32 74 6 -39 108 -5 40 5 25
2814B5m6N4j0M1N0j07m3L0J8m7J29l2Lo7m8M1Rj45N9N4j8O8K6lrrPm1j2k0J39k01P7l7K43
2376A78j57J12r9r0M1K8rK0Q8r7K9P4j25RO0q8o2K5j3J71j07J3j35K45oq2pm8k42mk77n431
1975e986r873J5178M98J45l7p2J06R5m2Mm9Q3J20k35Q6jj8j03J58j01j9M5m3M9Q6m0N1j07
1625b2N2k5j52r2J75J75j06p3J26mJ46K2j91m8p4N2LP0J6N1j8J3j21qM5RJ6j14J14j05JQk
1211f1K08k90L9j1O9J29k01P8l8R1J69k13p9L7J9J11R6j27J46l8j37o8J09o6j02J40N7r3J01
848G5l1qn0k1M1p2P7J7p4L9K4o8O9o4K3Q6m4q8R2r8J93j50M2N0j44K4J07j7r2j2J05K5l2J6
423D0j25J73j54l0M0J11P8j28J92j52j30R7Q5n5k4j27lJ12n6k2J5OJ36Pkj06J89k03m7Q8q0
34g5J47K2j86L4J10P3r8q1r3J48J81j54p8J47q7P2j20l2rp1J97j6k23L22j83J27N1j55J23
$$ plain form
2814 25 -21 33 23 64 114 7 -36 -6 12 -35 94 62 65 -2 -50 -9 0 -145 -86 -32 -50 18 44 41 32 23 30 -11 -23 -43 96 -105 -28 -65 178
2376 178 21 133 34 -56 -15 13 4 24 112 15 44 118 -7 2 62 -26 -88 -63 -76 95 -12 1 -134 111 105 23 16 -32 -274 -278 -555 -5986
1975 -5986 -15859 -681 -183 -38 -75 -147 -41 54 12 16 -33 50 170 -65 21 20 2 -101 57 -44 -63 -18 -61 -12 74 34 85 -22
1625 -22 30 5 -147 -239 -64 111 5 -68 58 54 200 222 31 -17 -91 -39 -36 34 50 101 83 96 -25 -33 12 21 37 -77 37 -68 -67 -59 -61
1211 -61 147 -143 -104 -115 -46 83 -118 -40 -78 13 182 -31 -110 -73 -54 57 153 26 172 134 -3 -71 38 -28 -130 10 67 -26 75
848 75 44 36 -14 -35 6 -66 11 28 -46 -7 17 -51 18 -46 -23 63 19 -69 23 -75 118 -32 10 60 -84 -60 47 30 -62 -74 31 56 24 40
423 40 -85 88 -66 -96 -56 55 133 5 197 45 -85 12 97 42 18 -109 -112 0 -56 -78 -63 -57 79 86 84 -22 167 -36 -83 5 -75
34 -75 72 94 -92 -58 52 125 27 -54 -147 1 182 28 -50 97 10 82 -38 -70 -79 -150 47 31 -192 130 -53 74 125 -30 93
-329I3j33J06o6N1o2
$$ plain form
-329 93 -40 66 0 51 -11
-391a1
##PAGE=	F1=-13745.7
##FIRST=	23146.675690215950453,	6006.5297639999989769,	0
##DATA TABLE=	(F2++(Y..Y)), PROFILE
6007A16n1j18N2P0r2l1Kk7J3J2N7J41r2J5j78Q2k5N0JJ13l7Lr7J5j21Q3l5J26O4j58r1p4J31
5593h1J88p3k5j07K7k2p2K02j37K8JR7j9q0N2n6M4j68J68N7O1j00rL7Q9K1j87N3L6p3O4K0
5193C6M4q9N0o7J1j0r0Q3J57p3Rl7j35OJ63R9j09K8k4j33O6J3L4l5q0N3LQ9k23J73o9Q2j80
4780a55J71K0j47j7P4rl3oJ89o3k9Q1j78j4O0J35l7J0j3j0k8j00J32R0j10J5m5J38k65J20
4404b4n5j4J26k0Jn7P0N7k4k4o8R0k5P6J2j21%J15r8L3l8q6J31o6k8n3K00j53l0Q1J12L5j60
3991eM7q6k9O1K1j5j4j11N0O4P1j0o2k4NR2j1J8j43K27j93N8O3m4l9Q7o6j7J71j36J05k7k5
3578H3j7M5j06k1K1M3nj3j40K15r9j65J3K4J05l8J28j23Rk2J06j26J31j26M2M1j14Q0mJ1j0
3190c2L6l5K9j28l6J27N3o9N5j28K14O8j24n9n0J13j24J57j45KP0L4N5m2q2J25n8N3r8M8n6
$$ plain form
6007 116 65 -53 -1 69 -23 -54 -52 -79 -66 -54 3 144 52 67 -111 -29 -54 -4 -3 110 73 76 -21 -6 -127 -44 -79 47 111 -47 -138 -212 -81
5593 -81 107 34 9 -98 -71 -93 -165 37 -100 -72 -71 26 7 -73 -21 -77 -33 -201 -33 24 85 -15 -24 13 102 123 -64 -11 25 -48 16 36
5193 36 80 -9 41 -26 -15 -25 -115 -32 125 52 61 24 -111 -105 58 157 48 76 52 -81 -15 -2 32 -3 -83 -30 -27 62 -161 12 -57 25 -155
4780 -155 16 36 -111 -128 -54 -63 -96 -102 87 24 -5 76 -102 -116 -56 79 42 52 39 29 1 -99 33 123 13 28 -17 121 -144 -24
4404 -24 -79 -93 33 13 14 -43 27 84 60 36 -32 58 33 109 121 0 0 115 17 50 12 -74 57 -9 -37 -90 110 -43 -73 8 120 155 -5
3991 -5 42 -44 -73 -12 9 -6 -20 -131 -81 -17 54 44 -18 -42 -37 55 44 62 -81 146 -47 11 74 30 -9 78 12 -5 166 30 135 108 83
3578 83 66 111 5 -16 5 48 43 30 -110 105 6 -159 -146 -122 -17 -55 73 -50 -41 -63 43 -83 48 -78 -36 5 -109 -29 -33 -22 -32
3190 -32 4 -31 -2 -130 -166 -39 14 -55 0 -128 86 154 30 -29 -79 34 -90 67 -78 -76 -6 28 83 41 -41 84 26 79 -19 29 -27
2801b7K7MR0Pj06o4R5J9j19J70L3p5k0o2J3K6j82Q8K7ML9O7j1oj3K0k0k9o2J24j40M0k2K48
2376A83j22R1j27n7k9J4L2J3J55j57K6Q3j32j6Q8n0m2k3oJ58l6m6r9J99Rj05P8k1k90l0j67
1988d26m482q131J2522M11J04j2p7O9N6p6M0l9J01N9j48P9l3o6l1J03l6n8N5k7M2kL2jj8L0
1612D0Lj77p3J85J42p9j14J55k0J16N9k29j7n5M8k6M1L3LJ7M0j41M8L5l0L2j11J10j12j9M9
1224d7l8K19k94O4jL4J32k10J22pM0J37j67m5kk6J37M7k6J27k8j37q0P9m9j31J51P7j56J40
848F2l9Mo3J4K6j34J10L1Pn7Ll4J14p5K7N0n9j11J50o6J30j20O2P7j53K8Q8q9n7L1P5QMk9
423A5j19K01j55loP3P6p8J49j14j07Q5N4m3J6j68K7Q5m4m3M8NJ08m5N9o9J58k39l5J31q9J17
22E0J9j40LJ61Or7o1j02J58J77r2j28J76j29O2p4k0p6l0J28N5k06K72k04J46R1j41L5q8J19
$$ plain form
2801 -27 0 4 94 101 -5 -69 26 45 -74 96 129 54 34 -28 -15 11 -171 -83 -56 -52 -13 54 43 37 24 44 24 -5 -67 57 -83 -43 -65 183
2376 183 61 152 25 -32 -61 -47 -15 -2 153 -4 22 105 -27 -43 45 -5 -47 -70 -76 82 46 0 -99 100 109 4 82 61 -229 -259 -426
1988 -426 -4908 -13039 -517 -106 -2 -14 -91 -22 34 -42 -2 -41 60 119 -29 50 17 -49 -80 23 -13 -71 -16 -43 -1 -3 29 28 10 40
1612 40 43 -134 -207 -22 120 41 -73 82 62 178 237 8 -9 -64 -16 -42 -1 32 35 52 92 -49 -1 34 4 36 -75 35 -77 -96 -47
1224 -47 -85 134 -160 -96 -97 -63 69 -141 -19 -26 14 151 -16 -61 -63 -89 48 95 69 196 168 31 -49 30 -19 -150 1 78 -78 62
848 62 23 27 -36 -22 4 -130 -20 11 18 -39 -36 -70 44 -31 -4 46 -13 -124 26 -40 90 -30 32 109 -44 -16 72 -17 -74 -43 32 40 44 15
423 15 -104 97 -58 -61 -67 6 82 4 153 39 -68 17 71 28 44 -124 -97 -12 -56 -99 -51 -46 62 17 76 7 165 -74 -109 22 -67 50
22 50 69 -71 -68 93 99 2 -59 -161 -3 174 82 -46 130 1 63 -11 -31 -107 -137 -9 46 -160 112 -92 54 145 4 39 -49 70
-354G0r5M8m5
$$ plain form
-354 70 -25 23 -22
-391b2
##PAGE=	F1=-13840
##FIRST=	23146.675690215950453,	6006.5297639999989769,	0
##DATA TABLE=	(F2++(Y..Y)), PROFILE
6007A09n0q1L0Rk6j08O4m0OM9K1J21l7J5j77P3m4O5L8K6N3l8p7mj18J05p8J42N8j13q3j18
5606b08J13K07j12nj15P8rp7J84j51N7m8R6k1r0R8m7Pj09R3P5O5n8l0L4Q6K3k25O9L9q0P4
5205A3j5M1n3M2m4k8jj0L3J27q8R1n1k00QK10N6q0pk5j28J17K6K3m7j12Q3j3J05k10K25j38
4805e0P1j34J21N4j53n3O3rPl0J83o7mQ1j71l5P8J41n6k6M4j3l9o3J09L4k7j3m9J10k14J31
4404B1q0m7J64j0k0n9Q2O2l7k8n7O0n4O0L3q5k4J25j08M4m0n3J63j32ll3J29j32j9N6J24J9
4003A21j35N4j18j4O8M0l4J4j19M1R3Q2p7k2k3j9J9O0K6j23J84j70N5O6m1l9P0n2l3J57p9
3615E2L9N5m8r3R4q4n5J8J00l1M5k05K16j09j05L1l3R0k1J37j53J9k6R5j45J24l2K2j5p0N6
3227c2MN0m4J5k9pj24L0Q2O7p3L2j48K51N9j41m4j9J49j18R8r4k6J07j0L8rr4Q0j0M2j34Q0
$$ plain form
6007 109 59 -22 8 17 -9 -117 -53 -93 -87 -38 -17 104 67 82 -95 -22 -66 -1 37 63 116 78 1 -3 -121 -16 -94 48 106 -7 -90 -208
5606 -208 -95 112 0 -5 -120 -42 -51 -128 56 -95 -38 -86 10 -11 -101 -3 -50 -43 -152 -59 16 81 23 -7 27 113 136 -89 -20 19 -61 13
5205 13 -2 39 -14 28 -16 -44 -45 -55 -22 105 17 108 57 -143 -135 75 131 51 44 19 -109 8 34 57 10 -102 -19 -32 73 -137 88 -50
4805 -50 21 -113 8 62 -91 -144 -81 -90 -83 -113 70 3 -1 80 -91 -126 -48 93 37 11 55 42 3 -60 49 83 56 43 -6 104 -110 21
4404 21 -59 -106 58 48 28 -31 51 113 76 48 -9 51 -3 57 90 5 -19 106 -2 42 2 -51 112 -20 -23 -56 73 -59 -78 -22 102 121
4003 121 -14 40 -78 -92 -24 16 -18 -4 -123 -82 11 93 16 -6 -29 -48 -29 31 57 -66 118 -52 3 69 28 -11 59 7 -26 131 52
3615 52 91 146 98 5 99 15 -40 -22 78 47 92 -113 103 -6 -111 -80 -113 -23 -44 93 -60 -41 -67 28 -117 7 -25 -3 -18 -88 -32
3227 -32 -28 22 -22 -7 -36 -43 -167 -137 -55 12 -61 -29 -177 74 133 -8 -52 -71 78 -40 58 -36 -62 45 35 73 64 -30 50 40 82 -52 28
2814B8n6k6L7J31l9j09p1J49K8j60K04O6j40L5o2pK7j79O5J2K6rJ05k2K5l3K4J8n2r5Q9q1
2413g2mJ9K20j01R2j41k1p8lN6J2K07k27J0R8j30k0J17j1m0l6rJ25K3q2p7J46L4j17J55j6
2025A29k88l5m8k856n137P958K39N2L7r6M5J9r9O9j0R7j2o8P1o2j11O3M7K1q6L8j8M4p3P4
1650Dj8O9j0L0j72n7J68J18o4j51J72k5Q4Q1k44Ml3N1m1J8K6m1M6L2j15J06Po9Q2j20P9r7
1249h0k1J05r3J79k36Q6k2j5J65k15J45J0lJ00j03j8n2n1J33j6J01J05m4r5r7O1k3j46J31
886iR0j95J44k3K7q0PJ8j26J14L5N3j39j0K7J05n1J7Ql6j41K16m2M9p7Q4R7j62K0O9j68j6
485i5Q9M1oJ8m7j09J87j27K2l8K5N9j3R8q1p1N3L0j4N2j76N4K9m0o2O6J7Q0q8Q9JR7k34k2
60a16J67q9M1Km8l7J86m4j02l3q7J60J45m5j48J92j31M5n5Jj44N8K4J26k09K35k03J52J21
$$ plain form
2814 28 -28 -54 -17 114 75 -34 -105 44 72 -88 116 182 42 77 15 8 35 -144 -79 -67 -41 -50 55 33 58 25 49 67 15 -80 9 -72
2413 -72 -76 -57 163 62 154 13 -8 -86 -89 -33 -21 186 -41 -31 67 -63 -83 34 23 -17 -53 -62 63 86 4 -73 73 107 -10 145 129
2025 129 -159 -194 -242 -3098 -8235 -277 -38 14 51 -45 0 19 -80 -11 -21 76 64 -4 67 5 -106 -43 4 25 -61 -23 -41 3 -70 4
1650 4 -14 55 45 75 -97 -154 14 132 68 -83 89 64 148 229 -15 -11 -44 7 -34 -16 10 -31 15 47 -68 38 45 -24 58 -62 17 -80
1249 -80 -101 4 -89 90 -146 -60 -82 -97 68 -147 -2 8 5 105 2 -16 -68 -119 14 -2 99 204 160 65 -32 29 6 -140 -9
886 -9 81 -114 30 7 34 -46 -39 -21 -147 -33 2 55 -84 -94 -67 38 -13 4 12 -24 -165 51 9 58 -19 65 162 0 20 89 -79 -95
485 -95 -6 35 29 47 0 -109 78 -49 -27 -65 -40 19 6 104 23 -48 5 35 21 73 -103 -49 -20 -60 -122 -56 -39 41 -47 42 43 140 -94 -116
60 -116 51 -38 3 5 -43 -80 106 62 -40 -73 -160 0 145 100 -48 144 13 58 3 4 -140 -82 -58 68 -141 94 -109 43 164
-304A64j24m9o1J27r6K8j1
$$ plain form
-304 164 40 -9 -70 57 -39 -11 -22
-391b2
##PAGE=	F1=-13934.4
##FIRST=	23146.675690215950453,	6006.5297639999989769,	0
##DATA TABLE=	(F2++(Y..Y)), PROFILE
6007H8m2n7L0m3M5j74J25p7J3P5pR6Oqj38N8n3O7N9m5J20p5l8k6j19J15j02J50K9m0p8j24
5606a70O0K15j31K6j25J05Jo2J55j51P9j06J02k0p8J03n3Pm1MJ09M3k6n5L4R5K6k21N2L2r3
5218h4Q4k7K8m3K9j8m0J4N8l7R9p3J46m2k39K2J99ok6k5m2j23J71N4j9l9j09Q7l1J19j80K15
4817A22j71O1p9P4O4j39o0M0j2L7l9J40m1lR6j71n6R5J27o5l3O1nk1l9P7k8N3l8k0M4j61J30
4404D0p3p3K04Lm9n9P4N6p0k5k6O3j08L0M3k7n5J33j06N9l4m1J78j65K6j3N9j15lN7R2Nj00
3991b0P2j42j2O5N5o3N2j03J9J14P8j44J8%m4m9J48No3J12j25K3M9om9N6k8o6J44l6j7J06
3590A49n5j31J18o5o2K0J26k4N3k51K33j44l4N9r3P3J1J08j51K8k2Q3j55P9P9Jm6m0L3K1O6
3202F7o3k7om6j04Q3J8Q6p2J7j30K58K1j48Pj7J62j08L1j3n0J23m5POn8QL4J4j33J00n6q0
$$ plain form
6007 88 46 -11 19 -24 21 -153 -28 -105 -92 -17 -24 72 78 70 -68 -10 -63 4 63 18 138 63 25 -1 -120 -5 -107 43 72 32 -46 -170
5606 -170 -110 105 -26 0 -125 -20 -19 -81 74 -77 2 -104 -2 -22 -100 3 -50 -43 -84 -80 29 72 46 -9 25 120 146 -75 -23 9 -84
5218 -84 0 -27 1 -42 -13 -31 -71 -57 1 -36 63 -10 136 94 -145 -123 76 70 44 19 -23 -146 25 79 60 21 -88 -1 -32 87 -93 122
4817 122 -49 12 -67 7 71 -68 -128 -88 -100 -63 -102 38 -3 -6 90 -81 -137 -42 85 20 -13 48 43 22 -17 60 32 85 47 27 71 -90 40
4404 40 -33 -106 98 101 52 -7 67 123 53 28 2 65 -43 -13 30 3 -52 81 -25 34 0 -41 137 -28 -2 -15 44 -71 -74 -17 75 80 -20
3991 -20 52 -90 -102 -37 18 -45 7 -96 -77 37 115 -29 -11 -11 -55 -104 44 49 -14 98 -27 -4 45 39 -10 46 18 -48 96 60 43 149
3590 149 94 -37 81 16 -46 -26 100 76 129 -122 111 -33 -67 -8 -101 -28 -17 91 -60 -32 -54 29 -126 -47 32 33 -13 -53 -20 1 67
3202 67 4 -23 -29 -75 -179 -96 -78 8 -64 -47 -177 81 102 -46 -39 -56 106 -2 29 16 -34 89 44 51 57 -1 7 41 55 -78 22 -34 -114
2789a14R0J39o8j11m7J57L4j48K14N9j76P9m0j9J5j48PK6L5o3J31l3P0o4RO5p1r4L2n2l0P4
2388d2J67j05J25j35j4q4pO3LK18k68j2J13j26kJ39Qn3l0j7J03M9q5p9J10N0j13K04l4k42
2013i6j3K7j299k287L611M1K3J06j39L7nj02R0K6P3o7l4P4o9j43J44J2M9r0jj8N7j06O5LJ22
1625I1m7N4j55m0J43R6n5j69J65k2O6O6k27J0j5O0l7J4pp6P9lo8J45k9q8J38j41L9n5mJ37
1224F5j50J18j32Q9n9n8K08k18J33J3j7N9l2nr6m7R8p2K06R2p0m0j07N8%j53R4R3j89J24p
836bM1q2l1J4n1R1J8N2j67k0R9M3pJl0J8j67K53j5j9m6J00J01j60J0M5k15QJ42J0j3Rl5r4
410i9J34q4M2m4k2L8M6O1o6l8J7K4L1N2j40O5l7m9o0N7L9M6j03Q3P3K8j76j5J88p9o2j3M5
-3a8q3J90o4j15rn2J70R2k6j41J86q9L1p6K8j84J56p5J61k21K22j83J42J33j04j11n0J21p6
$$ plain form
2789 -114 -24 115 47 -64 -111 46 80 -68 146 205 29 108 68 49 64 -84 -77 -51 -16 -79 52 19 89 25 34 99 28 -66 -34 -86 -116 -42
2388 -42 125 20 145 10 -4 -88 -95 -32 -29 189 -79 -91 22 -104 -106 33 41 -12 -42 -59 44 93 8 -71 39 89 -24 180 146 -96
2013 -96 -109 -82 -1381 -3668 -57 -16 7 113 -26 11 6 -96 -6 20 93 26 -8 66 -3 -146 -2 10 59 -31 -32 -50 7 -99 -34 -31 91
1625 91 44 98 -57 -97 46 142 87 -82 83 61 127 193 -34 -24 -39 21 -16 -2 -9 -85 -6 -9 -77 68 39 -49 89 -52 -13 -68 -72 65
1224 65 -85 33 -99 -10 -69 -127 81 -137 -4 9 -8 51 19 14 -82 -129 -31 -103 103 195 125 85 -22 36 36 -117 -23 70 -119 5 -2
836 -2 39 -43 -74 -60 -111 -20 -2 50 -117 -137 -38 5 -2 -1 -31 -13 -180 73 58 39 -7 93 194 34 44 89 -126 -118 24 34 21 30 -5 -99
410 -99 35 -49 -7 -51 -73 -35 11 72 6 -32 -15 9 40 92 -48 17 -20 -69 -129 -72 -33 13 -90 -7 66 94 -82 -97 91 12 -50 -63 -18
-3 -18 -101 89 25 -90 -99 -151 19 111 85 -56 130 41 72 -4 24 -160 -4 -79 82 -139 83 -100 42 175 71 -40 -90 31 -45
-366d5KL9
$$ plain form
-366 -45 -43 -4
-391d
##PAGE=	F1=-14028.7
##FIRST=	23146.675690215950453,	6006.5297639999989769,	0
##DATA TABLE=	(F2++(Y..Y)), PROFILE
6007E9k8n3M6p0J02k01J52j30M7P4k4Q3K0m6o6L6m8P3L6q4J51r8K1m8j23J04r8J49j1K7o9
5618a7r1mJ99j27N2j21R8Ol4J19j33P7j51J18j7l9O1o9M5Jo6J50Rk8o3M1J09L2j78OJ5j15
5218a15J07k6K1o3K2j2j3J9R8j04Q5m0J58k0k39M1J42o2L3k3p1j22J97R6p8j5p1O7l4J21j43
4830d4J44j55N6l0N2M0j07l7J2j8M1l7Q3j0KJ19j77p1R5J03n8j6L8NJ7l0M5p8J16o9L6l8j25
4416i6J20l8q8K45Kp0n4N2L5j07qKR3j56rL9K8p4J28q6P3k8m6J71j72N6J9kr7OP6K9K0p6Q3
3978G0j36l1N0O1r9J06p0k2J16O9j92M8L3o4r6K38l8RM4p0l5K8L4o4M8J2j30J54j4l9R6n3
3578F3j16J21p1l1K6J15K0Jk56K42j80K3R7j41N6N5N0j32M3j0O7j53J8J66j0m8m1K3N9M9o2
3190D3r1K4o1p9J16m0R9p5Rq2K37k8j50Q0m3J44r9mO4o8J14o1k6nJ8p6Q2k8j02J08o8j14J52
$$ plain form
6007 59 31 -22 24 -46 56 -145 7 -123 -76 -2 -26 57 77 31 -35 1 -47 26 62 -22 129 31 52 4 -119 -15 -113 36 25 52 -17
5618 -17 -108 -112 87 -40 12 -109 -11 -5 -39 80 -53 24 -127 -9 -26 -65 -4 -73 -28 -27 -93 57 66 38 -25 16 125 157 -21 -15 0 -115
5218 -115 -8 -34 -13 -76 -54 -66 -79 -60 38 -66 19 -21 137 117 -122 -81 61 -1 32 9 -62 -184 13 109 31 16 -55 12 -22 99 -44
4830 -44 100 -55 1 -29 23 63 -44 -81 -69 -87 -46 -83 0 -10 -8 111 -66 -137 -42 61 3 -13 25 30 47 17 62 -16 100 31 67 29 -96
4416 -96 24 -14 -102 143 145 75 21 73 108 1 -7 -5 88 -68 -77 -38 -10 -84 44 -42 31 3 -43 128 -44 12 31 29 -68 -62 14 43 63 -13 70
3978 70 -66 -97 -47 14 -85 21 -49 -71 45 114 -78 -30 3 -61 -157 81 43 52 96 26 -9 19 53 -11 37 49 -81 73 59 20 116 63
3578 63 -53 68 -3 -34 -8 107 127 128 -128 114 -66 -43 54 -87 -31 24 74 -58 -15 -25 42 -111 -93 73 63 15 -26 -3 56 105 43
3190 43 -48 -24 -85 -164 -48 -88 11 -64 -55 -137 100 72 -78 2 -41 103 4 0 64 -4 110 49 23 18 36 -40 42 14 -88 20 -48 -162 -10
2776a0J06o7j11PJ07L4q9J94K7j78J01ok3qj01n3O0J5r9J40l6J05r5j9J03p8n2l7n3k3J14
2388b5J14j33J71r7n4m9KO0k0J80k47k4J07j17K4J48ko9l1k0J12M3o2r6R4M8r4K14o3j78L6
2000b8M1l31n41R38j18K9J68j95M7j7r0J05N3M4r5m9R3n1j57J84LM7p0m1k3O6r4OM4J25n1
1612D2P3j52j6J23P4n2j55J33j6P3K3j98MjO2j6K9n6q6J06m0k8J53o2p5J64j67J1PJ6J33j90
1211h4P0j2N7q8q2K36k08P9J5JJ7L2rj12k6M2r4K41R3q6Kj02O2Rj58P5P2j39J01j3L7o0p5
798a07J3N3N5k2K1j35k9J61m4K9j1o0Q5j74K39K0o8l0J08Q4j33KRk02lJ80j9j7mj1o8N7l6
385e7N4l3m4J9Q4M2o4k3pL2P7J2p6O8r3p0k9K0O8Jq6N3J17k3q6j0J87o3j58k2J07j24J78n6
-41ej24KqJ84M1m0j23J57j3K6j31N8j72K12j34J51k28K22j47J18J21o9j52m1R3m9j2Q6
$$ plain form
2776 -10 96 29 -82 -75 32 66 -23 171 198 20 121 115 92 84 -17 -70 -10 5 -94 46 10 115 20 1 104 26 -26 -63 -116 -139 -25
2388 -25 89 -44 127 30 -24 -73 -71 -11 -31 149 -98 -122 -15 -132 -108 40 38 -31 -62 -82 30 73 11 -85 9 57 -37 177 114 -64 -28
2000 -28 13 -318 -859 79 -39 -10 158 -37 10 -7 -97 8 61 105 10 -39 54 3 -154 30 33 80 10 -31 -54 12 -82 -76 -32 93 42
1612 42 115 -37 -53 70 144 92 -63 70 54 127 150 -48 -44 -45 17 1 30 -26 -112 -6 -46 -74 79 17 -58 106 -61 -50 -43 -27 106 -84
1211 -84 -14 -26 31 -57 -139 97 -111 -32 -17 -16 1 33 24 -88 -114 -72 -166 75 168 82 84 -18 44 53 -105 -30 42 -97 4 -9 28 -32 -107
798 -107 -94 -41 14 -8 13 -122 -151 10 -34 -5 -16 -76 9 -165 74 94 26 -4 104 188 55 57 66 -136 -139 41 22 5 1 -10 -78 -21 -57
385 -57 -3 -36 -80 -61 23 65 1 -22 -29 3 80 92 16 84 -9 -79 -108 -88 -20 -19 -105 -52 65 42 -44 -54 133 70 -88 -110 -3 -127 51 -5
-41 -5 -129 -127 -135 49 90 50 -73 84 71 97 -34 24 -148 64 -70 81 -147 75 -72 46 167 98 -54 -95 -2 -51 -63 23
-391B3
##PAGE=	F1=-14123.1
##FIRST=	23146.675690215950453,	6006.5297639999989769,	0
##DATA TABLE=	(F2++(Y..Y)), PROFILE
6007C2j9o0O8o4J21j79J36j75R6M9l2Q1J3q9J8J5l2Q6k8r7J62j04Q6p2j24P0o9J37l9O2n8
5618ik6n8J56j13O4q7O1OoQ0j03N5j71J42j6J5j8p7J01Or1J75k5n2n2M8J21M3j19m9kj43J35
5205ij7K6r5K9l9M0J7J02j48P9oJ37jk03N1P5r4P2kj00j17J74J39j26J4l0M2rJ01j11M9j01
4805f1N1RN9j3o5jpk7K3l1L1OK6J34j81o9O9Q0l5J1q%O2k4J3j05J54j01R1j02j09J06Pr7K84
4366A80k8o6m2K3Pj25J6kJ38j66n2K2O7o8R6m5P2j4o3J48j70Q4O8n6p0JR6l8O5p4P7r4p1K7
3941e7N7j25J61l3o9R6O9k08O2N7p7j13L04p8N9J2k3j04J3N9p7M5N6k06J90k1k6M4o0n4J06
3553E9j04L0L3P7Q7r0k21K31j95M9J42j70L7J02j3j12P3%L9j44k3J99jl5p4K4J21Qn2j58N6
3164b5m4n8J25o5R3r5J8l2J98o5j43J48q9J03q8LJ04p3Q9n3n4l3J03j51J32o3o7J12r5j18
$$ plain form
6007 32 13 -47 21 -43 78 -101 35 -140 -44 5 -27 54 67 -22 -4 11 -21 65 37 -60 102 -2 84 12 -112 -42 -111 26 -13 49 -9
5618 -9 -35 -93 63 -50 14 -73 -12 -6 -12 68 -35 20 -151 -9 -25 -10 -28 -105 -4 2 -89 86 61 9 -43 5 126 169 50 1 -1 -144 -9
5205 -9 -26 0 -95 -66 -105 -65 -48 54 -94 -15 -21 116 115 -88 -37 38 -56 16 14 -86 -203 -29 110 -16 -2 -32 10 1 102 -9 40 -61
4805 -61 -10 -1 58 45 -20 -21 -28 -55 -32 -63 -32 -26 0 134 -47 -116 -47 33 -2 9 1 1 63 39 52 -53 101 0 91 -11 -120 -14 -7 -104 180
4366 180 152 86 44 67 74 -51 -35 -37 101 -65 -117 -95 -28 -96 0 -45 27 13 -50 98 -72 12 80 24 -46 -45 51 13 78 4 81 -13 -84 -57
3941 -57 0 -125 36 3 -66 30 99 -109 -47 10 -67 -180 124 46 105 117 94 -10 3 62 -15 30 86 -120 70 49 23 67 7 -47 59
3553 59 -45 -15 18 95 182 92 -129 102 -93 -44 98 -72 -35 67 54 -58 15 15 54 -90 -113 86 85 50 -24 0 121 129 77 -81 -25
3164 -25 -69 -127 -2 -67 26 -69 -51 -83 115 50 -93 55 -34 69 -19 -16 88 15 104 51 -3 -36 67 -84 48 -15 -82 30 -65 -183
2789a83K02M3l1j14P2K4K2j1J48Kj52R8J8j2l3n4r4R1l6r7J31k5J13j18l9J20p0J0r3p4K1
2401a21J12Q4j77K09l4j29OJ4N0m6J11j68j7P0r5L7J45l0p4n6j3J40K4k5j17R2L1p0J91q6
2025E8j18R3J8pK1O3k09O0J95k37O8k5p6J20N5K7j01q5J20j4j57J82NL2l6o4k7N4m9p4P3R2
1625E7j6Q6j71LJ18N6m9j16Q5j2R7j1j90NNM7J8N7j08o4J11n6j5J32p7m9J47j75OO2K2J06
1224A11j95M7R5j0r8q0K31j74kK3L7j5P0k2r3lj5q0J94J03q1J7q2O5Lj65R7K8o8R0m2J4k2
811b2r1%J47K2p3k2n9l8K05j33N1j5p7J37j55J72O4j07j9J08N3q2ol4j31m2J90m8k2JOl0k6
398g6QO0k4k9J2R2L1o4k7mL7R9m4j4P5j26q6K1l9R7m6n4K4J19l7oJJ63m7k10l4J29j48J54
-28Gl5j13kL4J87J1p5j13J24O1L3j92Q1j06K00j46J09k19K13j03R1Q8j5j78k1M4k5j0J16
$$ plain form
2789 -183 19 62 31 -83 -11 13 35 24 172 174 22 120 138 126 93 39 -55 36 0 -97 34 9 122 4 -35 85 15 25 -68 -142 -121
2401 -121 -9 75 -102 107 73 -56 -50 -36 14 -32 79 -89 -106 -36 -131 -94 51 21 -53 -109 -122 18 42 17 -100 -8 23 -47 144 58
2025 58 -60 33 51 44 65 128 -81 -21 174 -63 5 -20 -96 24 79 106 5 -80 40 26 -131 51 56 88 52 -12 -39 15 -34 -108 -35 57
1625 57 41 127 -44 -41 77 133 84 -32 53 41 138 127 -63 -58 -53 -6 12 69 -39 -103 8 -48 -63 69 -8 -57 90 -85 -79 -17 5 111
1224 111 -84 -37 58 48 -50 -130 101 -73 -75 -52 -15 -30 40 18 -75 -78 -93 -173 21 124 43 60 -22 43 46 -119 -22 6 -62 28 -14 0 -22
811 -22 -113 -113 34 56 -17 -39 -98 -136 69 -64 -13 -28 -105 32 -123 49 113 6 -13 95 148 66 60 26 -105 -147 43 -5 -27 -26 -20 -50 -76
398 -76 -68 -8 -32 -61 -49 43 74 10 -17 -21 16 115 71 57 132 6 -80 -59 -98 -1 -47 -101 -77 42 5 -1 0 163 116 -94 -128 1 -147 7
-28 7 -28 -141 -143 -109 78 89 14 -99 25 86 119 -73 8 -98 102 -44 65 -154 59 -44 47 135 120 -58 -79 -35 -60 -70 46
-391D6
##PAGE=	F1=-14217.5
##FIRST=	23146.675690215950453,	6006.5297639999989769,	0
##DATA TABLE=	(F2++(Y..Y)), PROFILE
6007A6k0o4Q5m0R5j21Q9j82J39J5l7P4Lj24R1jj5J04j02r6J73j03J36r8j16K5l1J20m7O3m7
5618a6M3q4R9j02N8k7J1OJ0M2p1L0j63J61j2O3j10o8J40mp1J68m9p5k5M6J20N6o9r2mj65J49
5205elM1j20M3q6R0J8P9j61O1K0J01J3j45L9K9q6P5K4j19r3R8J67j39L8k1K6N2N4r1j7m0L5
4792b3M9P2p0k5K2ql1ok3mMN9J30j79m7K7N9JL5n5k8J02j8rj13J68j26J22j26r9Q5N1j09L09
4366A96p7m3k4mj4j10M0m5J68j25q9KQ5l8M0JN4J3q7J19j67J10J14j00l4qR9p7J13q9N0l1
3966D2j18kN4j24J91oj03O7Q4j97O4O2p8j04L21r7O7L2jj61NO9q7M4Q8k63K37n9Poq5K8P7
3553D8j47R1M6L0J44j80j55J99j79M5J75j76J1J48n8r7J16kj1j30k2J76L1l5j13K4J89l5l9
3190I4k12R3mn7J12m4P1j39N1nJ55q3j20J86j39O5q6M6J00o6O6k9q1n6J59j94J74p8m4J16
$$ plain form
6007 16 -4 -68 17 -23 72 -49 40 -142 -3 12 -25 49 52 -72 19 18 3 107 5 -91 82 -21 115 17 -99 -74 -105 15 -32 31 -16
5618 -16 27 -57 42 -60 -2 -29 -18 -12 -2 40 -31 -1 -164 -3 -15 48 -62 -130 10 6 -65 103 54 -21 -46 0 120 176 107 15 11 -154 -5
5205 -5 -8 33 -87 -44 -130 -40 -22 57 -104 -43 -23 78 91 -54 -15 14 -72 3 27 -92 -185 -87 80 -59 -21 -42 -16 36 90 -1 -18 -58 -23
4792 -23 26 98 28 3 25 17 -14 -20 -43 -47 -43 16 146 -33 -80 -53 6 7 42 -13 -41 61 43 34 -79 89 -37 85 -41 -140 -55 -4 -113 196
4366 196 119 76 52 48 34 -76 -36 -81 87 -38 -127 -125 -40 -78 -38 -37 17 30 -57 62 -105 5 119 19 -15 -23 76 -1 112 23 73 42
3966 42 -76 -78 -24 -148 43 37 -66 1 85 -112 -48 14 -64 -168 153 56 123 155 154 -7 -2 67 -20 24 112 -151 86 27 34 28 -57 -29 48
3553 48 -99 -8 38 68 212 32 -123 76 -103 -58 117 -59 -48 100 42 -55 61 59 48 -82 -104 72 103 68 -45 -21 168 133 94
3190 94 -118 -25 -29 -86 26 -18 53 -86 -35 -40 115 32 -88 98 -41 24 -62 -16 84 18 84 55 -26 -82 77 -117 57 -21 -65 51
2814E1j25r9K19k8L4j20J10m2KM6R4Pj14P6K2J2n3j4j08R6j09n7J16lQ9j26l6J14m4N7j12
2426d5r5Q6O4P7k12K17K7j96M9J9L4o4M6o4ORo1L2J34o3n5j01lJ62J6J3j34R3J4n8J57r5p9
2013g0J48j0m2p2J62k26R3J74k33P7k8p3J35L2K8r7j12J40K3j37J50NK7j3o3k5J6J0j38P6
1637d3M6M3Q5j99QJ25N0n1p0L4%J09j1k05K9jJ1O0P9j43j0P7m0k7R1o8l5J01j53K7Q0PQ2j67
1211g9M1J74j01q7n6J90j13p9M2N6k6P2l1n0J6n9m1Q6J11n2Qn7O2pj73J53k4lQ9p2k6K4p1
798h3l1K05Jj13o4K7m1K26j97N1rp8J48j12Q3J04j50KJ01K4j7k9o9l4q0J66p3k9K9QJ3r6M8
385f9N4l0K4J1P6J8n6m4K3K8Q2q7K3J01j33q5O5j09J26p5l3J5Q3j3L2K2J16l4j99n8J22j49
-16a53J21j5p1j6N9J68Pj11j16J10R9M8k35R6j2J28j25N8j93J84n4O9L6N8k02J4j4njJ22
$$ plain form
2814 51 -74 -173 46 18 52 -68 42 0 2 48 142 149 35 111 133 145 92 78 -30 66 -43 -100 16 13 102 -24 -60 54 10 67 -45
2426 -45 -140 -54 10 87 -125 92 119 -77 -28 -9 25 -39 7 -57 -51 -42 -103 -71 63 0 -55 -156 -159 3 19 32 -102 -9 5 -53 104 9 -70
2013 -70 78 68 26 -46 116 -110 -17 157 -76 1 -27 -100 35 67 95 -2 -114 26 49 -88 62 67 94 81 18 -7 9 19 -119 -43
1637 -43 3 46 131 -68 -60 65 115 64 -6 28 28 137 126 -79 -50 -51 -40 20 99 -44 -54 23 -17 -44 47 -21 -56 45 -108 -81 -1 6 88 -79
1211 -79 -38 136 35 -52 -108 82 -31 -110 -68 -12 -38 34 3 -47 -31 -90 -131 -45 66 14 22 -35 27 20 -153 0 -24 -27 62 -10 -36 -12 -83
798 -83 -114 91 92 -21 -85 -58 -99 127 -70 -19 -28 -106 42 -70 13 117 -33 -31 70 94 77 48 -21 -55 -135 31 -42 -71 -42 -34 -21 -117 -69
385 -69 -15 -45 -21 -10 66 84 28 -16 7 35 117 30 53 154 21 -64 1 -108 18 -57 -90 -75 8 -5 27 49 165 131 -68 -126 -4 -153
-16 -153 -32 -47 -118 -134 -75 93 100 -11 -127 -17 82 130 -105 -9 -21 107 -18 40 -153 31 -23 46 82 140 -62 -48 -62 -67 -68 54
-391E4
##PAGE=	F1=-14311.8
##FIRST=	23146.675690215950453,	6006.5297639999989769,	0
##DATA TABLE=	(F2++(Y..Y)), PROFILE
6007A8l5n3R1k8M9o0L4j34J56j0m6N0J0j43J37j5oJ19j52q4J94j10J54j26r4j2nJ03l4M3l8
5618b7Q7q1N1r6M0L2l4J8J0Qn2K7j39J64qR3j88m5J43pj9J25n7q1J2K8J02O5m2j16K2j68J33
5205@J3N7j28N4j31J09L7M7j53K3L2P0K8q3OJ5m5M9M3j27m5JJ65j13N0o0K5J33pq2k1mRR1
4780E8P2j07NJ2Ok7l2pj6j4P8J12j73j7%L5M3M5q6p3J25j1j7j09J63j27J11j08p5N8Q6j36
4379a26L06j18j3qj9j7o5M9j06J59m1j13j4Q4%k3L9L2N2j23J00j64J29J34j25joQ0p8J42j07
3991C9J0K4j55k9N7q3J70kj04M3J16j77O3N2o7p9K71q4M0R2mj97kQ5j04M5R3k73K70j16L6
3603C0j5j22R2M3j73J21O1nJ70k34q1J63j46K8J82j64k0J83p1q3J47rp4j16K2J13P7n8j39
3240g8J0K48o2l2k34J35L6q0Q4J2M2j91J00oJ15q6q1J94j85N0r5J00O3n3N9%j08n5J59j99
$$ plain form
6007 18 -17 -70 21 -7 42 -18 16 -118 38 28 -18 32 42 -101 36 21 15 134 -18 -102 92 -18 136 10 -84 -96 -101 2 -32 11 -27
5618 -27 60 -21 30 -66 -26 6 -28 -10 0 8 -44 -17 -156 8 0 93 -95 -140 3 -4 -23 102 45 -36 -24 4 106 171 129 13 35 -133 0
5205 0 13 70 -58 -4 -135 -26 11 58 -95 -72 -40 30 58 -25 -19 -4 -49 0 43 -84 -129 -128 37 -76 -26 -86 -61 72 65 -17 -38 -42 -33 58
4780 58 130 23 28 40 46 19 -13 -20 -36 -50 28 140 -33 -50 -50 -15 28 73 -13 -86 39 28 11 -98 65 -62 49 -59 -134 -76 10 -126
4379 -126 180 62 49 41 22 5 -60 -11 -117 42 1 -112 -126 -42 -42 -65 -26 6 58 -65 35 -129 0 134 9 8 2 82 4 146 39
3991 39 49 73 -82 -111 -54 -137 33 31 -73 -30 86 -91 -28 24 -43 -122 149 65 105 197 193 -4 -6 79 -25 20 113 -160 110 -6 30
3603 30 15 -107 -15 28 -145 -24 37 32 202 -32 -113 50 -96 -68 114 -50 -70 113 42 -41 106 97 23 -93 -71 42 119 61 -78
3240 -78 -68 180 118 86 -148 -13 23 -57 27 39 81 -110 -10 -16 99 13 -68 126 -59 -9 -104 -4 59 6 65 65 -43 -98 61 -138
2864a38J99o3l9J10j38p0J92q0J05j22J06o2j8N5N3L8p4M0J1M1n8J2j01O4j73JJ04K8L4j15
2488e8jQ5lO3q4j08J49nP6k23J94N6k16O4J0J3o6J5K6K9m9k8J5J19r1rj45JJ55K5N1j51R4
2075CQo2J27q5o7J82j7j28k55L72j90J03J25j74N6k1q3J39jM2r0j16J41M4r3J11pM3j7m0k3
1687B7l8O7j61N5J5R1O3k14lJ37N4n0l7j0K6R2K2k21P7k6l4R6Q3j48N9Ojm3M1l9n3N9j03O7
1261d4M9k7Q0j19L3K13j87o1k4J24l4j18O6L9j8M3k4j3L9q7jl8J14rj1l9N4j0j76K15o6L9
861BQ8q4p5P2l1p6K21jj30j00R3l7K26k21L5Po6J10o0J3J20j95M4Q4QM3p5p6M9q9J11q7l8
448a15P1lN5j42P6L9n1R1J3N3Km6o0O1ML0r9L2J38j19o7R2j78J57p9l5L5K3L2J8N7M8k0j39
22b6q6R8j28Q2kpk8O1J30J5j33j20J23Q9O2k50R5P8M4j02J7j54J40oN6k9J35k22N5o4J3LJ09
$$ plain form
2864 -138 61 -2 -41 69 -69 -139 53 -27 78 -44 62 0 -18 37 90 128 54 94 105 146 88 100 -1 63 -110 -109 -5 23 57 -58
2488 -58 -59 26 23 86 2 -106 43 38 114 -109 85 141 -75 -11 -1 12 -54 -39 -13 16 -33 -61 -46 73 -18 -27 -172 -171 -16 9 60 -91 3
2075 3 11 -51 76 -9 -76 106 89 -39 -294 78 -112 -9 116 -58 -2 -23 -106 33 32 74 -16 -132 9 53 -40 71 64 107 90 50 27
1687 27 -11 56 -105 -50 -35 56 119 -95 -98 39 93 43 6 -4 22 114 136 -85 -8 -34 -68 28 111 -37 22 28 27 -16 25 -14 -67 -8 -111 -44
1261 -44 5 -22 58 -61 -28 185 -2 -63 -87 37 3 -115 -49 -10 -28 15 -9 -22 17 -70 -71 -109 5 -4 -15 -54 0 -10 -186 29 -37 2
861 2 90 6 -69 3 -28 -104 117 116 -14 -114 -21 -58 168 -53 -18 -11 -77 33 -27 -14 106 -89 -45 39 47 90 15 -61 -12 -101 10 -77 -115
448 -115 -44 -47 8 -134 -58 -19 -70 21 34 87 89 43 -17 44 48 78 -21 11 149 30 -37 55 -123 34 -45 -80 -45 -22 10 28 85 133 113 -26
22 -26 -112 -14 -142 -60 -62 -69 -97 -36 94 109 -24 -144 -21 68 130 -120 -25 53 97 -5 12 -142 -2 -8 48 19 154 -68 -13 -77 -64 -61 48
-391D8
##PAGE=	F1=-14406.2
##FIRST=	23146.675690215950453,	6006.5297639999989769,	0
##DATA TABLE=	(F2++(Y..Y)), PROFILE
6007C6n2l4Q1l9J6k8om5J46k2o5J7L6j45J51k8j1J29j66n6K18j33J39j45o4k9JQ7nJ6k9Q7
5606E8n9K8q5K1N7o2M8ok0m9N3j10J50pR7k32j5J06PM6O5n3o6M7OO0O9l7j22O0j39R2K5N9
5180I2j20N8j54R1P5J3j31k8L8M6M9l1l3K1J4QN3j30J1o6J28p3N1j20L8J90n7p8L6j0j5J23
4780H9N1j08K1l0K6j4n0J6lm1O7R2j61LPLP8M9r7j18J24kj1j04J47j03P1o9k8L0J07j79K65
4366A28j20QMk0nlL3j53J14N3j24k5P1K6o1M8K6R8j71J01j57J28J20j26K1J4M4m5J37j17k4
3978B3M5j65m9O4mR5k2p7L7J55j64O2M2m8n3J68m9J2J53j7k12j2J24j43N0P5k35K61j66N5
3603EK2j54J14J6j65J00P1j6J63k40j7J42j18J9J56j41m4J94n5p1J45oj27j04Q3L2J20r3j37
3240a06j5K78o4l6k20J75O4j23M9P7K0k26J39j8P7q0l4J83k16N9j14J38K5m5O3K9j35k6J11
$$ plain form
6007 36 -16 -50 31 -8 8 -20 -26 -71 75 53 -12 5 41 -104 47 19 8 137 -29 -85 133 0 139 -6 -70 -99 -98 -11 -16 0 -29 58
5606 58 -1 27 -58 -37 20 -42 6 0 -20 -69 -16 -126 24 17 114 -118 -133 -27 -20 26 91 38 -28 19 25 85 154 117 -5 55 -84 8 33 92
5180 92 -28 30 -124 -33 42 55 -76 -104 -66 -20 29 -2 -35 -14 0 8 61 -69 -58 -124 4 -69 -18 -138 -100 90 33 -45 -9 -19 -34 89
4780 89 140 32 53 23 49 35 -15 1 -2 -43 24 116 -45 -42 -35 -32 46 95 -2 -120 4 2 -9 -113 34 -69 2 -67 -95 -65 42 -137 128
4366 128 8 16 20 0 -5 -8 25 -128 -14 39 -85 -110 -39 -13 -74 -26 0 98 -73 28 -129 -1 119 -7 14 28 72 27 164 47 23
3978 23 68 -97 -146 -82 -86 9 -13 -90 -53 102 -62 0 42 -6 -59 109 60 72 225 208 -4 -16 108 -35 15 90 -145 116 -50 5
3603 5 27 -127 -13 3 -162 -62 9 -7 156 -84 -101 41 -77 -58 98 -43 -87 107 52 -19 126 120 -7 -111 -28 4 124 31 -106
3240 -106 -121 157 93 57 -163 12 76 -47 2 79 99 -127 12 -6 71 -9 -43 140 -76 -17 -131 7 32 -13 50 79 -56 -82 29
2877B9j76J99k6l7P5j14m4J33j11J64j10O7l3l5J9L6P1m4NKO4n0K3q6J3j99M3J03O0l9q6N3
2476c1M5M0K6j7j15J92o6O1k02J48M3j80N5j0jo0J9Q2M2q5j0LR6j07N6j76nJ16N0Q5j72J01
2075B3J0p3J11p1p2J84Oj41k88L40j24Q6P7p7%jr9J28k4N3p7j12J29M0k7Q5l4P4m1j1k3r1
1675d0J08j41L0NJ04K2k07j9J44O2l1l2m1O3N4O1k08J26o2p2J15O6j23J24q5M4m9pJj00L6
1286e2m0J17j2p3R8p2J5K13k41k7lN3M9j14Q9pqRq%P4j01J8j29J08L4k6l8M7lj66K50q9N7
861B2P8o7j25J19%j18K04J5j27j21J19k1J99j98J1K9n3M2j6j5J03k23R7N9LQ7j39m7Q9n8L3
473a9p9n0J07j1Q9j63R1J5p6J44K1L6j2m6p2R3k3k4r3L0J66r4m2R5k25J86o2n1P3m2P6l0R6
60A04k8Jp0r4O9r7L7QN6k4L7Q9J7j34j11J52M5O8k37P3J38rr7j0j05R3L8N0r2J86k30R4r2
$$ plain form
2877 29 -147 52 26 -11 64 -50 -94 39 -72 92 -18 49 16 -19 0 36 107 63 68 70 134 84 107 21 34 -165 -122 -19 41 2 -84 -31
2476 -31 14 54 80 63 -52 140 74 135 -67 81 124 -56 -1 -11 -12 -72 -53 29 71 -14 -24 -21 75 -32 24 -152 -157 -41 9 94 -78 23
2075 23 33 -40 71 0 -72 112 118 -23 -311 29 -95 -9 68 -9 -9 -10 -109 19 -5 48 -29 -141 -12 28 1 86 52 126 85 74 51 -40
1675 -40 68 -73 -43 -38 66 88 -119 -138 6 68 37 5 -36 27 81 142 -66 60 -2 -74 41 107 -16 108 23 67 18 11 12 -88 -52
1286 -52 -92 25 13 -60 38 -34 -19 194 -47 -74 -77 -24 25 -89 0 -7 -15 -6 -14 -14 60 -41 -23 -152 -44 -10 -36 -74 -27 -30 -196 54 -35 22
861 22 100 33 -92 27 27 -91 113 128 1 -120 -1 -22 177 -21 -10 19 -34 8 -8 -23 80 -143 -46 13 16 103 -36 -83 6 -52 -19
473 -19 -98 -148 -41 -52 37 -126 -35 -20 -96 48 69 105 93 47 -25 68 45 21 -72 -42 124 30 -12 83 -142 44 -18 -69 4 -38 38 8 104
60 104 76 77 7 -87 -18 -115 -78 -70 -14 -38 -1 88 105 -29 -140 12 57 125 -112 -39 99 90 -7 -17 -122 -29 9 59 -33 153 -77 17 -75
-354g5L1rR0
$$ plain form
-354 -75 -44 -53 37
-391C7
##PAGE=	F1=-14500.5
##FIRST=	23146.675690215950453,	6006.5297639999989769,	0
##DATA TABLE=	(F2++(Y..Y)), PROFILE
6007F0n9j6N7o9J7l1k7M8J25k8r2oO9j31J32l9k1J29j50j3K34j62R7j48l1k4pO8L4j9j7N4
5606C4l4K6n9J5K6o5R2l7m0n4R6p9J21j6Q3k38J2N4K5J03J5m4l7O8j1J1O2m5j15Q9p8M8J6
5193D4M7j07N8j46M7J21k6r8o7M7K1O6On7K5P1k5N0j32N7q2P8n2M4j55N7J85p3p0J13m1k5
4792a9J22K5p8K4q1M1Ko7M8K7p4L0Q4j39pM9k8R2N6r7j41J00J0jj02J29o3K4l5L1RJ10k21
4379a40J87p3J7MpJ4N6lj63M9J24j25l4N6K4n4L0M2J37k14J14j39R7Q2j02K1M9QoJ09j11m4
3978EL7j45o1O0R4rn2m6N2J87j63O2M5l1l8M8qJ1J79k0k13k4J84k04O0M8j74K05j83P0P1j60
3578a13R3J0j27L2O8j0J45k08K2J44j19L8J07j17n1J75j8o7J03J6j46q7J26n3J42j13j13l6
3227a57K72m0n6j77J94P4j58K0J17J2k25J46k2L3p2J2J69k20P2j36J54Om6O4N4j51K0L4j40
$$ plain form
6007 60 1 -15 42 -27 -10 -41 -68 -20 105 77 -15 -21 48 -83 49 10 -11 118 -32 -45 189 27 124 -24 -55 -79 -86 -18 16 -3 -20 34
5606 34 0 26 -33 -18 8 -57 35 -2 -42 -96 0 -79 42 26 109 -129 -117 -63 -38 65 80 36 -1 67 56 67 129 84 -31 58 -20 28 44
5193 44 91 -16 42 -104 -57 64 38 -60 -127 -80 -59 7 13 -44 -19 52 27 77 -55 2 -80 -2 -54 -10 -165 -108 77 4 -66 47 6 -19
4792 -19 103 128 50 74 -7 34 36 -31 17 44 -30 0 84 -55 -62 -13 -41 51 107 10 -131 -31 -21 -22 -124 5 -58 -34 -69 -38 -29 81 -140
4379 -140 47 -26 -9 -5 -12 2 58 55 -108 -59 65 -60 -94 -38 -14 -68 -38 4 141 -73 41 -98 -1 81 -21 0 49 57 51 160 49 5
3978 5 42 -103 -164 -104 -10 -19 -71 -117 -65 122 -41 21 66 35 -3 45 37 48 227 207 -6 -30 154 -50 10 58 -116 89 -94 -24 47 -113
3578 -113 -20 -10 -137 -105 -37 -47 98 -110 -88 56 -63 -25 82 -35 -86 89 71 4 107 123 -23 -110 16 -37 105 -8 -121 -157
3227 -157 115 75 19 -158 36 110 -48 -28 89 101 -124 22 0 33 -39 -27 142 -78 -6 -142 12 18 -28 36 90 -61 -41 -7 -147
2864a47J77J9k8Mn2k8O7j22J96q6K7Ql6m0M2P6k4j7OP6l9K5p0l2j78M3J17Q4j14m0R7J0O3
2451H4l1O4j17K03r8L4j60R2Jj11M0l0Kn4L3J19L1r2j1LO4j11J23j93j2O2P7J10j92J07K0
2063E7q0J08o2q0J48N4j16k31J78n0N1N2K0o9K5j08J01k9N3n1j17J12J4N5P3p3J09o6Rl3j17
1675f3J25j00K0QP9k7j81l2J42O7J5n2m9Q8K5P1j51J47r5r0J08M2q5J64j63P5l2m9L7j54L2
1286g8J8J60o8j17J22l9j0J76k41%mnJ22q2J08n9k0LOj7J15j00Pj59R4O4k9n6M5J0j36K35
886F5r6N8O2l0j64J58Nj36J64M9j19j28J12LJ43j30j8N6n3j9OnO0k18J43L0kJ12k01J5Q0p
485em5m7p1J24jJ04j52Q9j0r9J62M1L0k1o2q1J09l9m5q6K2J70o5k6Q1k32K01l8o2J15r1R4
85F4q0J27r8K8k5o5M6p4j2J8J01mmO2Jj13q9J77pO1j94K5J58j3j11k6m7N5P2M5j37J89k15
$$ plain form
2864 -147 30 49 21 25 -27 -55 12 -110 86 0 27 35 -1 -41 1 77 53 36 42 118 79 104 34 2 -176 -133 -16 68 -46 -86 11 21 84
2451 84 53 117 0 203 105 139 -21 71 72 -39 1 -29 -27 -81 -48 71 102 10 -1 2 66 -45 78 -115 -127 -65 12 122 -70 37 57
2063 57 -23 85 23 -57 91 145 29 -202 -24 -74 -23 29 49 -20 5 -103 -2 -31 22 -29 -146 -34 -20 35 108 35 144 78 87 54 -63
1675 -63 62 -38 -18 -10 69 42 -139 -171 -29 38 53 1 -48 40 65 136 -15 132 37 -53 55 97 12 176 13 88 56 7 44 -110 -78
1286 -78 -60 100 32 -85 37 -2 -12 164 -77 -77 -81 -86 36 -46 62 3 -17 -14 -8 -25 90 -10 -3 -162 -68 -4 -33 -89 -44 -34 -170 65
886 65 -31 27 89 59 -105 53 58 -78 86 135 16 -112 0 3 146 16 -2 54 1 -18 -12 -17 43 -175 -32 -2 -4 108 -93 -78 2 -5
485 -5 -50 -97 -168 -44 -45 59 -93 -4 -14 -113 49 90 120 99 37 -44 65 26 -19 -105 -83 87 22 -4 77 -155 46 8 -54 61 -30 64
85 64 -16 111 13 41 16 -49 -3 -77 -89 -71 30 26 22 84 85 -28 -117 60 53 114 -80 -55 103 90 -21 -47 -94 -39 33 78 -59 130 -85
-329h5J27r6M3l6P4
$$ plain form
-329 -85 42 -54 -11 -47 27
-391B7
##PAGE=	F1=-14594.9
##FIRST=	23146.675690215950453,	6006.5297639999989769,	0
##DATA TABLE=	(F2++(Y..Y)), PROFILE
6007G6m6j3K5q9M3m7l8J05J11m4j11qR7j06Q0l8k7J16j17L1K35j77L8j29%pj7N1P2o9nK5k7
5593a0L1k1K3m1m4J27p8m4n8J29l8Q4l3N8k14L3J4K4J37mk9j3O4j5k3M2n4r4Q5JK2j8L2r9
5168b4N4j12KJ60p9n2p4O1oN5K9n1J5J09m2M0j29Q1o0L3o0L7j40Q4J07m7n6J59o7k2Q8J2l8
4755F7J7j12N2Pq6P7O5j20mR0j05m5R9l7P2P4r4j34N9L1Oj12J21k9nk1Q1LR1k43R3kK4j1K1
4316a0K5J00n1j30j2J55j26m2M7%j4NO5J58k31J31j13L8M4o1lQ8j7J1P7r0n0K8j07o7L3J84
3916F5j01p7l1P4K05j68N5O2k0l7m4K2M3J57qk04k9K39k74P8K9j26J17j51Q4R9j39M7L3p7
3540g7n3L8J3J33j64L7J59j49Q5N3r6m3J31L1p6L1N4j16o2J27j38J39j06p8l9K41Jr2j20J75
3164C9P4j59PJ10K1j95J10%k1o0N0J57j88N9j51J49J8n3M5P8j44O4m7r6J36M9%q7K4j8J5j20
$$ plain form
6007 76 30 17 42 -47 -4 -51 -89 16 127 83 -28 -36 61 -45 35 -3 -30 86 -31 0 235 58 96 -33 -33 -40 -57 -6 66 -3 -8 17 -10
5593 -10 21 0 23 -18 -62 65 -13 -57 -115 14 -24 60 27 85 -129 -96 -82 -58 79 75 46 33 97 82 59 101 47 -47 38 39 61 43 75 -24
5168 -24 30 -82 -80 80 1 -51 -125 -64 -70 -15 14 -37 -22 87 45 85 -44 37 -23 10 -50 -13 -153 -69 38 -9 -65 94 27 5 93 105 67
4755 67 84 -28 24 31 -55 22 87 -33 -37 53 -52 -97 2 -35 37 111 17 -117 -58 -27 -21 -133 -12 -41 -46 -67 14 17 108 -135 -42 -44 -20 -31 -10
4316 -10 15 115 64 -66 -78 77 -49 -91 -44 -44 -58 -53 12 170 -61 70 -43 -5 39 -22 -25 63 46 57 134 44 -6 22 -85 -152 -119 65
3916 65 -36 -113 -144 -70 135 -33 22 84 64 27 -17 5 48 205 197 -7 -36 203 -71 7 36 -90 27 -124 -40 59 -80 -33 0 -77
3540 -77 -130 -92 -79 54 -110 -73 86 -63 22 75 -21 -64 67 98 22 53 107 -9 -71 56 -82 57 -49 -127 -166 75 76 -16 -136 39
3164 39 113 -46 -39 71 92 -103 7 7 -14 -74 -24 133 -55 4 -147 2 20 -33 12 90 -54 10 -37 -133 3 52 52 -35 -11 -29 -14 -134
2764a34J95n5J7J6j4r5O5M2j2j1QP7l1L0o1m8j25jJ41J01j80J4J11nM3p6J42j16J79r9Oj10
2363A4L5l7m7L4l9K5n7K6J54Op7k9J4K1j00J71j95j8J2J00J26k08J04L7p4J06o1p7Q0J15j16
1975D5j97P8J5J7M7Q4j19M2r9O5j6L5pj39J05k6J32O8j14J32o9J3n8j03J24o9K2J8L4o4j50
1587a54m1J28P1Q4q8l0P9K9M9o9J19j02q9P7K6n8J67j98Q6Lp8N6j90L7N2J80q3j47J34k3k9
1199bJ13j86J1k6l8J72n6J24r0o4M7jm8J45q5k0j35P7O9k2p7M7K0q9J76j01N2N2Qj80J66n
798E4j21J15Q8j19j16Q2L3P0l7m7P5o7m1NJ5J1j74J64%j1J20k33Q4M3L0r7Lj10J22L2R7j15
398d5P8l1j19J44P5K8k8q8r4J11l2k2q6J2J43l0l8O1j82J81j8n5J43j07P9j06J36j48N7k3
22dlM4p6n7L2J22K6n1M9k7p7o4J77m6M7j20m9J50J6j32l1J9K3R3L8j48J38j81J52p7L6o1O0
$$ plain form
2764 -134 61 6 23 39 25 -70 -5 37 25 14 22 99 68 98 37 -11 -136 -137 4 105 -75 -61 50 45 88 12 154 38 217 118 124 14
2363 14 49 12 -35 -1 -40 -15 -72 -46 108 114 37 8 22 43 -57 114 -81 -99 -87 13 139 -69 35 72 -2 104 43 -34 46 161 45
1975 45 -152 -74 -59 -42 5 89 -30 12 -87 -22 -38 -3 -10 -149 -44 -70 62 130 16 148 79 92 34 -69 55 -14 8 26 60 -4 -154
1587 -154 -195 -67 4 88 0 -30 49 78 127 58 177 75 -14 63 89 31 198 0 86 89 11 67 -123 -86 -34 146 63 -84 50 27 -2
1199 -2 111 -75 -64 -90 -128 44 -12 112 22 -42 5 4 -44 101 16 -4 -139 -62 7 -15 -92 -45 -25 -114 62 -39 13 65 73 -107 59 54
798 54 -67 48 136 17 -99 -17 16 86 49 2 77 10 -31 -26 -11 0 -174 -10 -10 -21 99 -134 -50 -7 23 -74 -71 -181 -59 -27 70 -45
398 -45 33 2 -117 27 102 130 102 14 -80 31 -1 -23 -109 -97 46 16 -22 39 -143 38 20 -35 108 1 80 -26 110 -38 19 -4
22 -4 -7 37 -39 -96 -64 58 84 33 82 55 -22 -86 91 45 92 -28 -77 73 89 -43 -74 -55 -32 61 99 -49 89 -92 60 -17 19 -42 18
-391A8
##PAGE=	F1=-14689.2
##FIRST=	23146.675690215950453,	6006.5297639999989769,	0
##DATA TABLE=	(F2++(Y..Y)), PROFILE
6007G3j6k2pp6O1m4m9J08J12p7j06QJ09p5Mj6k1Q2p6N9K27j66k9q9K1Rj1L4R8j32NK8m5L4
5581A5J2L9j09oJ34j20k8n8J40J7M3n4L0j73M2PpJ39J3j1JL2j0k5Pn4n9M6P7J7o4K5r5M1n7
5143e3l3J86j43Ln0P3k8jM4j8pJ22m4K3j08Q0l5J9r2L7q5J12qLl4J40o5j1L1K7j1Oj03O4j3
4704B8j01R2Q9j70j2J04o0r4J30j7J6J07r4j01J6N7Jj31J25j4j0j9J08NN3k33J1N7M2m1N6
4316@J7J27r5p2m9J47j32m7M9k3K5nP2J57k12J42q4k7K1j6m6J27k9nM7o0n2N2p4o7j9K44j50
3903c7q2l7Q5K09j69L8Q1j7m5q1L7Q3J03J3j81k4K53l13R3K8j11K9q6R9R0j01%Q1m2j20j3
3515a37M2J32j26L4J67j92J46J0q3k9P9Q3r7l7Q8m8l2Q6k11J17p6m7k3K03M7j37o3J20P3j24
3139c5J6N7M7j68N6L7q1m0Q3J37j22J1j53J32M9n6PR5j03R2j12m8Q3N2L7j62Q5j4k1j02J69
$$ plain form
6007 73 57 35 28 -48 13 -31 -80 28 140 63 -43 -35 74 -1 3 -13 -34 48 -28 31 258 92 63 -26 -5 4 -7 27 125 -7 -2 26 -19 15
5581 15 27 66 -43 -49 85 -35 -63 -121 19 36 79 25 55 -118 -76 -69 -76 63 76 65 66 98 88 63 70 16 -43 3 80 97 33 58 -37 4 -53
5143 -53 -86 100 -43 -40 -90 -17 -45 -46 -2 -20 -27 95 51 74 -34 46 11 30 -62 -25 -110 2 -6 -3 -37 103 38 27 58 85 74 80 -23 41 28
4704 28 -73 19 108 -62 -74 30 -30 -124 6 -11 5 112 18 -83 -67 -10 -9 -140 -15 -29 -39 -58 50 55 108 -125 -114 -57 -15 -56 0
4316 0 17 144 49 -23 -72 75 -57 -104 -55 -78 -53 -58 14 171 -41 101 17 -10 11 -5 -51 76 47 42 89 29 -23 29 -45 -112 -131 113 -37
3903 -37 -119 -156 -71 138 -31 7 88 71 26 -55 -18 65 168 181 0 -24 229 -84 9 37 -74 -45 -131 -32 58 -43 -43 38 -4 -124 -137
3515 -137 -95 37 -89 -55 112 -80 66 76 -7 -36 43 126 29 -8 80 32 0 86 -125 -8 -84 -131 -154 49 96 -41 -104 16 89 -35
3139 -35 -19 38 85 -83 -27 10 -71 -111 -28 109 -13 -2 -155 -23 26 -30 -23 72 -31 61 -51 -99 -16 36 73 -89 -4 -18 -39 -141 28
2751B8l0M4k5L1j26Q7j5%K1j1P2l0M6n8k9o9o7J66J06k21O2Q4Pj9r3K11j14J28p7qo4j7n0
2338c0j3L7k7N3o7j5J98k2n6m6K0k1p3J84j82k3k4J22J38k27Q5O6o1J02o8o0LJ71j42k05P1
1950a12O4mM3J00j29M5p0L4%%N1j64J06o5J88N5j43J34m9Kr1n1J12o8L3K4pp4j18o0J06Q4
1549b4J50j22QL0O7J7PM1p4p4L4K7p0J43j79Q3M6q9N6k02M4O0J64n3j54J31j4l7M1r6Kn7m0
1136a34J90n8J33r3j23J31k8p4J47n6m5q2N7M4j0q0N0K2m0R7j07M7M7L3j68J34j3p6O5J20
761A30j28r3M5O0RN2o7O7p8j8j4K1k9r9J51k7j5J08k17J32KL4j12N7j65J12P8P3o0O9m6j45
360a13J13J10K1m4j04j18J10%K6q6jR9Jp1M1q5J19pk5J46q1M0j07J19j75Q4n6P0P3j18q2M5
-41e6J28M7q6M4m9l7n3J52o8L7k5j36J30M1j36k2P7mR6L7j25N3j37J59m6J4p3M1
$$ plain form
2751 28 -2 42 17 48 -78 9 -6 -6 15 4 76 46 92 34 5 -64 -131 35 141 -80 -18 66 73 54 -39 172 58 186 109 101 37 20 -30
2338 -30 -43 -6 -33 20 -47 -62 136 114 58 12 32 11 -62 122 -60 -83 -107 15 153 -74 11 77 16 118 50 -10 -7 164 22 -183 -112
1950 -112 -48 -52 -9 91 -38 7 -63 -29 -29 -29 22 -142 -36 -101 87 142 -1 133 84 86 -5 -56 56 -12 21 45 38 -36 -154 -214 -108 -24
1549 -24 126 4 12 42 109 126 133 174 100 26 60 87 17 160 -19 64 110 21 77 -125 -81 -21 143 90 -64 67 53 16 57 -39 -37 -94 -134
1136 -134 56 -2 131 38 -85 46 18 -56 91 35 -10 -92 -35 9 -1 -81 -31 -9 -49 48 -59 -12 35 68 -100 34 21 -55 10 130
761 130 2 -91 -46 14 23 75 8 75 -3 -21 -35 -14 -43 -142 9 -18 -33 75 -142 -10 -8 26 -86 -29 -194 -82 -4 69 9 78 32 -113
360 -113 0 110 131 87 -17 -135 -25 -25 1 -85 -86 13 14 -57 -16 -101 18 11 -14 132 51 91 -16 103 -72 12 -44 26 99 -19 -101 -56
-41 -56 72 119 33 77 28 -9 -62 90 22 59 34 -102 28 69 -67 -89 -12 -16 80 117 -8 45 -92 67 21 35 -38 3
-391C
##PAGE=	F1=-14783.6
##FIRST=	23146.675690215950453,	6006.5297639999989769,	0
##DATA TABLE=	(F2++(Y..Y)), PROFILE
6007E0K1l8k9k7N1j4o4O9J27j22o8K2J05m8p5K7j0L0k6O0K14j25r7l9L0J6NL2J03j97J0O6
5606E9q4L8K5M4j32L4J07j58J2o1J30Q4Jp3Pj29M4K4m9J09M4J1Lj6oMl1m4k0nJ26K2r9L5r3
5168c7K1Jn7J99k04N6oO6l5q3M3L0k9J12l2lo2N9l1L1j20N2l0J35j07N1j2O5l5pj6O4j1pn9
4729BQ3n6j01Q9Q4k13J3J19k0j25J25L0o5J48r6n8j9Q0k0j43J37j8qj0J09LJ5j98l3P5P3p8
4329g6Q3oJ37j25rn7J12j36n0O0k0K7J6N0J38j67J44o0p0J6J7r1J59l0m2J3k7n8J16o4n8q2
3928a40K62j50o6m9P4K03j56J3Q6k1n3o0L9R8M4L6j39k0K15k94R4M4j28l6j4J12N6o7l1J35
3553H7l5j39p3P2J30j01K2J56k23J91j6p6j1L5J27j21p8J01L0mK7k59Q5m0k7JJ77Q2j72j6
3177f8N1P1p2L8j7Q7j69J2O6j24j2J10J00m0o5j35J08Q2n1l2R9m3J03j43lK8L6O1j87J03j6
$$ plain form
6007 50 71 33 4 -23 28 14 -50 19 146 24 -44 -22 83 35 -40 -13 -23 7 -19 41 255 130 33 -6 24 40 45 77 180 -17 -7 59
5606 59 -25 13 38 82 -50 -16 91 -67 -55 -116 14 98 99 26 33 -96 -52 -28 -77 32 76 87 90 74 68 72 41 -3 -23 -28 98 120 21 56 -37
5168 -37 -16 -15 -72 127 -77 -21 -27 39 4 -79 -36 -6 -35 77 45 42 -20 39 8 39 -81 -29 -59 76 -31 20 8 73 38 31 15 79 68 61 2
4729 2 85 29 -72 17 101 -112 -99 20 0 -125 0 30 -35 113 17 -41 -60 20 0 -143 -6 -24 -32 -42 67 70 85 -113 -146 -71 2 -76
4329 -76 7 1 138 13 4 -53 59 -77 -127 -67 -87 -60 -44 6 144 -23 121 61 -9 7 24 -67 92 62 20 33 6 -52 64 0 -58 -140
3928 -140 122 -28 -94 -143 -69 134 -22 -9 77 56 3 -57 -18 80 124 160 21 1 216 -78 16 60 -68 -104 -118 -6 50 -17 -48 87
3553 87 52 -87 -160 -88 42 -59 -37 119 -104 87 71 -5 -16 19 146 25 -53 48 78 74 101 -158 -73 -113 -140 -139 38 120 -52 -68
3177 -68 -17 54 -18 20 3 90 -79 -67 -1 -125 -137 -27 73 33 -32 -167 -59 23 -28 -60 39 -4 99 -44 -47 -19 17 78 -109 -6 -22
2789b2m4o6J28j9Q8r2Q3j27J03o7RO6n2N2k9P5n4J1m0j22J75J06k33R4K6L9r0r0K69j16P1
2401A32m5j1k3n3m2rM0kP3p9p3K35m0k9o1J2m5l3J57j45m2m3J52J45k56N8J03n0R9q1l8n6
2000e0K05j51k08P3R8pK1P5j01M3l5J7J0m5J14j78J02q9K14K9j43J09k4j4j19K0R6r2L9K4
1625C3k1n3r2r8Q0J16J82j37M6l9J16J0M2n6k1n9jL8j25J07j10P3P8p7M9k05N9M6J13Oj40
1236d0J15Jl9k2jj6r0j1J73q0J21q1j63K23o1q6J29l0n1l5L9mLm7M5K1j2K7j07M1M7L6j37
823i2P5kk6K9J29j34o7J2P5j5J11p8K9p1K8l6Qn3j4J10m8lP8j59J40k2kq8R7k20J04J20M5
410F0jO3n9j70R0J26Oo4j01j51J12N4O2p4j0N3K1j09K2L1L3nJ6J21k2Jj02Q4j75J01r6J25
9D2J15j85p1N2J24N0j04M0m6oo6J18q0M4P0k20J10L9j13lJ16l0Q8M5r0k4r5J40j4j8o8K1
$$ plain form
2789 -22 -66 -132 -4 -23 65 -27 56 -71 32 -35 -26 40 -12 40 11 86 32 43 3 -119 56 162 -71 23 49 88 -2 -92 177 61 132
2401 132 87 76 53 0 -42 -51 -11 -13 60 -19 -92 143 103 74 13 25 -20 -53 104 -41 -83 -126 26 171 -85 -27 76 26 125 44 6 -50
2000 -50 155 4 -204 -131 -33 -40 -19 56 -45 -2 -37 -20 -10 -55 59 -119 -17 -106 108 137 -6 103 79 65 -54 -34 62 -30 9 33
1625 33 12 -41 -133 -231 -151 -35 147 10 56 17 133 143 185 129 108 49 48 86 -39 68 -42 31 109 32 81 -124 -65 -19 94 100 -40
1236 -40 75 76 37 15 14 -2 -92 -103 70 -10 111 30 -133 90 29 -57 72 42 -9 -44 -5 -9 -6 -53 -8 13 1 28 -79 -38 9 45 -92
823 -92 -17 -19 -45 -16 113 -21 -88 -76 -1 -16 95 17 46 -25 3 -33 -25 -78 -92 18 -30 -33 45 -114 26 4 2 -86 11 -209 -105 15 60
410 60 59 122 63 -107 -17 109 115 51 -50 -201 -89 -35 27 -47 -57 -4 17 -92 -70 -39 -6 -11 5 126 104 105 3 87 -88 13 -83 42
9 42 157 -28 -99 -47 77 127 23 63 17 11 -55 63 -17 27 97 -123 -13 26 -87 -90 26 -4 84 129 39 15 -80 60 46 28 -40 -19
-391a9
##PAGE=	F1=-14877.9
##FIRST=	23146.675690215950453,	6006.5297639999989769,	0
##DATA TABLE=	(F2++(Y..Y)), PROFILE
6007A9N0n5l3L0K0L3p9J4J45j54j1J8Q6k8j33P7mk9L1L9J96p0j51OL0J5J3N2Q4k41J7J06j19
5593b6M5J4K2q9N7O5j84O3p1J16J40l3r0oq7M4M1o9N9N8L0on2j0M2n7k5Rm6J38K8j04N3q2
5168a3oM9p5J98k34Q6L8L9k9j48J8P2l9Q5jm1KK6m3M6j21P9nJ39j45P5Lk4lj0l3J02l5j7o
4729B9J06j04p3O4N1k34N8J28kj23R0R2j57J87q7k5m3Q8n2j29J42l0k0K3R5j5pj53l0M8J15
4341C2j17Q9k8J31j37M1m4O8j32m9P0J6j5N8J2J09j25J43n4o8K5K9j23J83k6q0l1Lo4J93p9
3953C0m2j32K42j19l4n0L8J95j31qP2l0n6lL8O6NN4q0l0J37k08P0O7j59o8L9J21J8m6m7J75
3553A24n1j06j24R9J12q3PJ28k28K02l2p2J4QJ50j37p8Q9P6J8k4k62N3j8j3J5J68R4j81K4
3177b8j3P1l7N8p7J31j96kO1j25K0J22N0L2j38r9P7R2k7n3Q1J1J05j34K7rJ2N5j52P2k8n7
$$ plain form
6007 19 69 14 -19 11 31 64 -15 -1 144 -10 -21 -3 83 55 -78 -1 -5 -34 -3 36 232 162 11 17 47 62 75 127 211 -30 -13 93 -26
5593 -26 19 33 55 -34 23 88 -96 -33 -104 12 152 119 29 23 -64 -20 21 -48 11 69 99 93 41 31 73 16 -9 0 -46 92 120 16 69 -13
5168 -13 -19 30 -45 153 -81 5 43 82 53 -95 -77 -5 -44 41 40 -1 1 27 -16 30 -91 -12 -17 122 -23 52 55 31 28 18 -15 87 52 35 29
4729 29 135 31 -42 22 73 -161 -103 25 23 -100 -10 82 -75 112 25 0 -43 45 -7 -136 6 -24 -44 -21 74 59 52 -101 -131 -83 32
4341 32 -85 4 -24 107 -30 11 -33 35 -97 -146 -76 -60 -75 -17 -5 104 -21 122 68 0 25 54 -69 114 88 8 -23 -20 -84 109 30
3953 30 -12 -144 98 -21 -55 -105 -67 128 -3 -11 61 31 -25 -28 10 76 81 135 55 25 162 -46 24 91 -68 -136 -97 24 42 -4 -51 124
3553 124 73 -33 -157 -58 54 -29 -22 106 -122 80 48 -24 -10 -2 148 11 -67 22 98 116 92 -170 -117 -135 -148 -133 35 129 -52 -28
3177 -28 -41 30 -7 51 -26 105 -91 -93 -32 -157 -137 -15 35 67 -71 -170 -93 -1 -28 -81 0 11 116 -18 9 0 12 67 -85 -13 -41 -98
2776i8j6Q0j2J17j51J24j02J04q3J1J01r8J5k0J06m5M6l6j44J56R9k11J04m0P1j33p8L08j23
2413E2K9j3j6J5p3k0k5L5K2P8r3j15K48m4Oq0mm8K0R6q2q3m2J85J46k93L6J31m2J00r2k8p7
2000g1K05j20j81L6J23kj6K5n6M9j0J6J2q5J63j69Q0r1K15%j15N5j1k4j23Q1P3j18M0J2%j0
1599a7q2j46N7J63J60j25P0r5J52L9K5j33K8n2j0M3k05P7j3O3Q4m2M9k14Q4K3M1O0j08Q9K5
1211I0m3n4P0l2j19L7J28r3P8p2j58K79p3r0J14k9l6j2K6o7K2K1K4L3j9j7r1L3M2J5r3J7K0
798d9QJ4J10j28l9j1O5J1J31q3k9l9O6n4po9O2N8o0K5M3r2J12k3o0m5J18k57J04J43K4M7N8
385A54p4j85Q5J10j4p3p5j89J18J15O2m6oJ5K1j25PJ11l6j1N6Q2L9j9j07N0j57J11j23J45
9D1J42k50j9M8J08M1j03L6j8J2j00R0r2P7J37k82Q4K0o7J0J33m8P1O6p1n7o2R4Pm1n7N
$$ plain form
2776 -98 -114 -34 -46 71 -80 44 -58 46 -37 -26 75 -23 -8 -28 78 33 79 43 -101 55 154 -57 47 7 78 -55 -133 175 52
2413 52 81 68 52 67 -6 -26 -51 -16 6 84 -9 -124 124 80 86 6 2 -46 -26 70 -12 -95 -137 48 194 -99 -63 68 26 126 34 6 -71
2000 -71 134 14 -167 -131 -8 -10 -26 -1 -57 -8 -18 -2 10 -75 88 -81 -1 -92 123 123 8 63 52 28 -95 -14 59 -59 -19 -7 -7 -17
1599 -17 -99 -245 -188 -25 135 10 80 -15 137 176 201 68 96 44 34 77 -128 -51 -64 -1 83 41 90 -124 -40 -17 24 84 -24 65 90
1211 90 47 -7 63 31 -88 -51 77 -16 62 -10 -168 111 38 -52 62 33 -3 -15 11 -56 -34 -13 11 44 25 8 -83 -50 -8 7 -86 -69 -49
798 -49 -41 -27 83 -45 -84 -95 -30 -19 112 29 0 -39 27 -27 -34 -103 -41 17 -43 -18 25 -67 45 22 -38 -83 35 -222 -118 25 49 96 154
385 154 80 -105 -20 90 76 3 -72 -261 -143 -28 34 -12 -18 -3 18 -107 -100 11 -25 -36 20 102 141 122 15 65 -92 19 -104 41
9 41 183 -67 -86 -38 70 111 8 44 26 38 -62 28 -64 13 150 -132 -48 -28 -95 -85 48 0 71 137 66 9 -53 41 48 7 -50 -45
-391d5
##PAGE=	F1=-14972.3
##FIRST=	23146.675690215950453,	6006.5297639999989769,	0
##DATA TABLE=	(F2++(Y..Y)), PROFILE
6007fO2o5k4O5%O4r1l3J61j50L9rO1k2j44J07%q5Q8J1J67k1j75L2K2J7j1J03M7k47L0J10j26
5593b3N1j1k4JO3K0j87J07q9J14J64m9j08pm8M5L6m4J0L3L6k3m8k7O4n9mK4o7J16L6q2O9o2
5168B7k9O9r0J86k18P8Q1qk4j48l9J00l8N3M6q4O5j6n2M9r2J12k1J20j18O7J3q1Nj3j8J17
4767I9o1k7K2J28j28k4K0J5k27R7J25j0r7N1J45k34K15o7mo5Q1q8p7J23l2o0P9P3m4mj18J2
4366h2lJ53j46O7l2J07j30O7j9K8j15m1O7O9q2J00j5P4j00J36p0k4M6J9j35J98k4r9q1K5n7
3978i9K37r9k5j55K03q3Kl9j0J85r6j3M5m6n5O1M5nqO5j7o6N5q1K5Q7j83p6O3J30j3l4n6J89
3553A33p6l8j50J13P7o4j2J00k08J77n1o4N2oJ45j38m7O2P1K8m4k18K4j0jJ0J66Q3j55N3n6
3164d4P1l4N5r2J56k15J1J6p3M9J03NP3j79n5M5O3J8m5M6K7J12r4L1j7lJ5p2Mn5m8L0L8oJ13
$$ plain form
6007 -6 56 -9 -33 32 32 96 5 -28 133 -17 22 13 74 52 -92 15 15 -70 18 29 196 175 0 32 54 71 60 163 210 -37 -7 103 -23
5593 -23 28 17 -7 -6 57 77 -110 -3 -92 22 186 137 29 22 -26 19 55 11 21 54 90 67 19 -8 56 -3 -7 17 -50 66 102 20 89 27
5168 27 -2 67 -23 163 -55 23 104 96 72 -76 -115 -15 -53 0 46 -38 27 11 -41 8 -84 28 7 127 9 76 89 8 13 0 -18 99
4767 99 38 11 33 161 33 9 29 44 -183 -86 39 29 -68 -17 128 -106 109 42 38 -27 54 -34 -111 12 -20 -80 -1 72 28 24 -94 -82
4366 -82 -85 68 -78 -11 -43 64 -66 1 -18 10 -105 -146 -79 -10 -92 8 -7 67 -33 103 33 9 55 74 -61 137 113 14 -67 -42 -99
3978 -99 138 39 14 -141 62 -21 -19 -58 -68 117 21 8 53 7 -48 13 58 53 45 110 93 27 82 1 26 113 -70 -146 -83 47 34 0 -56 133
3553 133 57 19 -131 -18 59 -5 -17 83 -125 52 1 -63 -11 -17 128 -10 -57 5 76 104 60 -158 -134 -144 -145 -135 31 114 -41 12 -44
3164 -44 27 -7 48 -44 112 -103 -92 -76 -149 -100 3 8 81 -98 -153 -108 -45 -27 -72 -26 1 113 19 50 33 30 45 -27 -23 -78 -126 -96 -58 -64 49
2726D9j69J40o7Q9n2lJ12j15m5nJ31k8N0m1j23J11Q2j60R0q2P8j18p6L15j31J9J1l6M7p2J
2338Bm4K1L3P2j09j21K31m0N6j10k3l3P6J9oj33k1K08J28l13L0J26l0J05r8l6o4J77p0j41
1963a08j3J44Km8l7j4P2j0K4J2j09J86j38L6p1J97j1o9k3j1k2r7J03M2j22L6j2N1L9r7j87
1574b55M4K08R3q9P6j16J67Q3k6j64M6n8K1K7k78N7Q7N3N8PO7k30J10Ll5R4p1O3M1m7n2J08
1174I2l5j46Q4P8p3Jp2j10K85n7r6J25n9j9j0K1j28M8J04j4N9n8k9n3J8K8j9n1mL6JL0P2j12
748f3ok1K7P1J18q5q3LP5o8nq1J19J2n7M7K4n2O5j1j14jJ18k54J05J38J9P7M2q7j75Q5O7l3
322A6n5k9k23J22J56L1j4J6j0%j03jJ19n0k0P7M6P6k0j28L7j27J12j27J33J25k76N4L9P4L4
-66H4q9L3K5J2j42P5j04J32J60l12N1kj3OJ31n1M9R2q0l3m5M1J0m1n7O
$$ plain form
2726 49 -120 20 -47 42 -10 -13 99 -16 -61 -66 65 37 87 46 -77 34 116 -44 46 -36 42 -76 -152 163 32 51 62 26 73 1 2
2338 2 -42 -21 12 84 -25 -146 85 45 101 -9 -32 -65 11 30 24 -109 -130 78 206 -107 -77 49 19 124 26 -10 -74 103 33 -108
1963 -108 -121 23 25 -23 -60 -74 -2 -12 12 24 -85 101 -37 -1 -72 125 114 45 22 11 -11 -108 -5 37 -85 -49 -61 -10 29 -68 -255
1574 -255 -211 -3 90 1 77 -39 128 211 185 21 67 9 30 57 -221 -164 -77 -24 34 41 108 -122 -12 -9 -44 50 -21 42 83 36 -16 92
1174 92 57 -89 -5 73 0 1 -71 -181 104 47 -49 76 17 -2 -12 9 -119 -71 33 19 78 20 -9 -62 -44 -16 -35 -86 -90 -54 -53 -23 49 -63
748 -63 -69 -90 -63 8 126 41 -42 -39 36 -32 -37 -118 1 13 -44 3 27 -25 40 29 -85 -86 32 -222 -117 21 40 117 159 72 -103 -18 49 16
322 16 -39 -68 -291 -169 -13 18 4 20 10 10 -93 -94 25 -25 -45 32 78 154 134 6 43 -84 28 -99 34 159 -117 -63 -24 50 84
-66 84 -5 28 53 65 -77 -2 -106 26 186 -126 -75 -77 -90 -84 47 -4 45 137 57 24 -21 20 30 -11 -68 -62
-391f2
##PAGE=	F1=-15066.6
##FIRST=	23146.675690215950453,	6006.5297639999989769,	0
##DATA TABLE=	(F2++(Y..Y)), PROFILE
6007a7N6o3j3O2J9N7r1o9J75j03N9n0L2k0j10J00J3j29J37k0J28Rj62L3LL8p6J82kk10N1O2
5606H1r8M6l5q1R8N9j1j64J28j01J23J44m0j24lj3N0jK4k0k5J8m2Mn0N1m0J6L2p4P7N0m6O9
5180A02l6m3O0r6J59j61L2J20m9l7p3j19J11l6K9J05j21J04n2n0L5m8J43o6Q9n3L4J9p7k5
4805@%J2R1p0l4PJ39j08L3m1%j94J11J07l3o9L0J71k71K18l7J2r3O7j21OO9rj15J34M7p1J9
4391Gr9P0m9J71j55J9kO7j08O5QLr4k7M8J08j39J30j7L5r3J26j03L6Q2rj28K00k7r5j21L7
3991e4k2K16j05j2j59J62n2K8k3n1J69n3%J5o6n5J13N8q4mO2L8j18kM2k1R7j97p2O9J38m1
3590A6j3o9J77r4M1j51J08M0m4l4Q8j74J34q2n1R9j3J14j26mL9K0L1l5j37qpJ3rJ50O7j02
3190a6O5q4P5n4K0n5J48j89K1m8J6O9N2k2Q2j75j7J6MP2j0kjJ35m9POom7K8p3r8mM9J4lQ3
$$ plain form
6007 -17 39 -24 -37 25 44 101 10 -59 116 13 72 22 54 34 -76 24 37 -92 45 25 153 162 0 33 36 74 -2 180 178 -32 19 81
5606 81 -17 29 -6 -87 11 70 59 -105 23 -78 45 189 149 25 22 9 59 58 82 62 37 55 13 17 -33 18 -22 -6 26 -48 29 79 33 102
5180 102 66 23 83 -13 146 -15 17 137 88 51 -22 -141 -30 -66 -37 68 -53 51 -1 -51 -16 -64 79 13 102 49 83 102 25 0
4805 0 0 12 103 33 -1 6 145 37 70 29 29 -165 -54 53 20 -49 -19 152 -119 99 62 74 -19 48 -73 -67 2 -7 -122 12 59 -12 7
4391 7 -92 -22 -71 100 -55 -36 -38 29 -79 -14 -6 -3 -97 -124 -76 32 -107 23 6 41 -52 74 -29 7 89 80 -48 152 125 30 -91 -54
3991 -54 -76 140 35 23 -136 26 -26 2 -21 -72 97 44 44 59 -7 -62 51 109 25 21 83 121 3 1 43 22 119 -78 -150 -81 57 16
3590 16 3 -66 111 17 58 -93 15 55 11 -23 65 -109 25 -57 -108 -9 -22 92 -34 -38 1 21 52 17 -120 -128 -135 -122 -131 19 86 -16
3190 -16 49 -35 40 -14 6 -49 99 -90 -69 -117 -101 -32 20 -2 80 -95 -112 -96 -92 -20 -30 -32 -33 102 53 60 66 60 13 41 -32 -130 -134 -85 -71 -74 9
2726Ij46J35l5N9Mk6R3q6j04PJ40rJ8l7o7M7N9r2O0q9N7n7q6K79j27M2J6o5O6n6K2o3PK7O3
2288F5j24r3J95l6J12j50l9j2J30n7O2j66J7K03Q5k89L4Q7oR8r2n9l4J40l7j11l1J64mn6j01
1900a05J4J02l2L7Oj04J72r5j2l8J67Ml0r6j2j4m6P5Rj01L3m3J11P9j37k03M8K27Qm1P9j03
1499d1J55J12q0j44K1o9Q4nl21N0J60M5PN4R3k28J11lr6J08l5L7L3m2k5J19l0j65J05N0j7
1111D3r2p5m7K52k0j13J56j02j2j4K4j75P8J74o6R3j07j3pmJ0n7j4K1L7n2O8L4r5L9k6k6J35
698D7Q6r0j14L8O1q5K0q6J50j4l7M3L0n8K4Lj42K7J03k06J00J04K4R6J2r0j41P9J1m3j6K9
297c5k40J18J57kOM2k1k7o1RN0Jl0P5K5P7j0j50M9j01J10j15J06O1k45J17K7L0L9p7L5O2%
-116H2j77O9j07J93J43l10J1qK4j5J24l8K0J14j06K7m5Pjk3p2K8
$$ plain form
2726 9 -137 -2 -37 22 26 0 93 7 -97 -90 50 41 59 22 -45 2 61 -31 29 -60 -3 -60 -146 133 6 48 64 -1 65 9 31 -32 -25 2 65
2288 65 -59 -152 43 7 119 -31 -70 -82 48 -9 53 -113 -96 107 192 -97 -63 24 18 116 24 -35 -69 71 34 -77 -108 56 52 -4 -105
1900 -105 -91 11 -21 16 22 -82 90 -5 -17 -55 112 116 86 -10 -22 -36 -82 -7 2 -99 -66 -109 2 81 -56 -259 -211 16 24 -17 62 -41
1499 -41 114 226 146 2 23 -46 38 33 -288 -238 -78 -33 -26 28 121 -107 4 1 -95 13 -22 15 48 6 -19 100 70 -95 10 60 43
1111 43 -49 -124 -171 81 61 -52 104 2 -10 -24 0 -175 -97 77 11 104 -3 -16 -23 -27 -17 -74 -88 -67 -30 -82 -14 20 -75 -36 -62 -88 47
698 47 133 43 -71 -33 28 -57 -37 -123 27 13 -24 19 49 -9 15 18 -124 -97 6 -200 -100 4 28 124 136 46 -95 -16 -5 -48 -64 -35
297 -35 -275 -157 0 -2 4 46 25 -2 -63 -54 -4 -3 -33 42 67 144 134 -16 33 -68 42 -73 33 94 -151 -34 -7 23 62 -15 20 82 82
-116 82 -95 -26 -133 60 203 -107 -96 -104 -80 -95 29 -9 11 125 19 46 1 8 7 -16 -88 -60
-391f0
##PAGE=	F1=-15161
##FIRST=	23146.675690215950453,	6006.5297639999989769,	0
##DATA TABLE=	(F2++(Y..Y)), PROFILE
6007a0L2m7j2L8O9K0q4r7J87k6L7q9J1j4n8O4M4j57J68n1Q3K1j17J0k5P3j57K66n1j45P8k4
5606C7m9L1n5j24J62N9l0j21J31r9J24R7j3j24nJ6M5m8J02j9r2k1n1P6o7Qj5K8N0q1M3O9j5
5193D9N4j6m5L3r1J21q9k7J43n8p1M0j96J11m4K7J49j33J10p0m6J8oJ56j19P2NqK7j8q5K7
4792B0M0L3n0m7l7J40n6P5j08K1j40Q7P4m3o0L5J61k59J96j1K9j26O4j50J00j4M1j60J62J4
4416C1q4N3r7J17o1J55j41l5N0J8o9L5L3np5j0J7J15j63J42Krq3J09j37Q0J30m6j10J88l4
4028A16p9j31L8L8J33q1rj62J32k4L7j6o9J40%J4kq6n6J38P4j34PL7P7j62l1J22m7R5k01o0
3628a52O7J43p5L4r5J47r5J09j40Q2K0k7n2R4j36R1j26l6J43j7P3j05L1L5m7L1j2n2m2JL0
3240g8l6J12O6l9M9r9P7o8l8J4J02j08Rj02J11P3j5k6O7j33N%o1J14L9n6n9J73k6k5M1jj05
$$ plain form
6007 -10 22 -25 -37 1 70 90 6 -91 96 70 107 18 29 15 -43 21 65 -92 76 25 108 129 12 22 -3 70 -87 179 128 -17 61 37
5606 37 -12 19 -36 -160 2 61 31 -90 41 -58 66 163 150 26 21 37 82 34 136 117 25 4 -47 29 -38 -30 -45 -17 33 -48 -5 64 49
5193 49 103 87 42 75 -16 105 16 -11 132 74 3 43 -153 -42 -86 -59 90 -43 67 -3 -49 -31 -37 119 0 72 77 69 96 78 -7 20
4792 20 60 93 43 -4 -41 99 43 118 10 31 -109 -22 52 9 -51 -16 145 -114 82 71 100 -26 38 -112 -12 -26 15 -145 17 31
4416 31 -53 0 -97 20 -41 114 -27 -62 -12 6 -63 -28 5 0 -75 -85 -68 47 -116 26 28 19 -64 45 -92 -12 118 72 -38 150 116
4028 116 37 -94 -56 -18 115 34 25 -137 -5 -29 8 -8 -77 63 63 77 75 -11 -67 71 145 11 18 55 132 -30 -61 61 14 109 -92 -152
3628 -152 -85 58 -17 17 -78 69 -26 83 -57 25 45 18 -34 60 -76 15 -111 -147 -4 -21 52 -53 -22 13 -34 -3 -15 -67 -109 -108 -78
3240 -78 -114 -2 64 25 74 -25 52 -16 -54 -40 62 -46 -37 -139 -28 45 30 4 71 -62 -57 -57 -118 -4 35 -21 -80 93 67 42 83 82 -23
2826b3J22j36j47P3K9J5j1N2j06J21j2J9N1m8N8k6j32LJ33J0l6j9Kj7L2k5L2p0K0J1r8K06
2426H3j02Q2nr1P0l0M3p7jJ8M6j25n6J58m0J62j79n6KJ68j13J03j56N4J65L1k17L5K8L2O2
2038I4o8q1j1J07l4q4j9J80k0l7j57L1J18n8M9j0p2J28n5m0mJ32L1j1j36LrJ4Nj4p1L0o1J52
1612B2R9j83j87P0J99o5LR6p6J19J11j12r0l4q4J66l4l27M9J85M2m8Q9J02j87P4Pj29J10q
1236b1K1j1j9OJ23l3j65R5N5M8j78o7%K10J4j33J75j21k5qL5k00R7K14j18J11j39K6K7k5r
848a5q4RP6K9j35J12J3q3Q6k9p7J77M8r2j21N9M2j10M7o8J50k0JNN6j00J0J0j43M0P7j25Q4
435g1M9L0J13j9q6r2O5m8l6K2R0k27J03J14j9RN5k1m1k7L7n6Q3k8N4K1M9Kj60P3q8J07j02
22d5Q4k0j70J50RoN4p0K8P9j6j88O7r6K34J14k88k6mL7l7J17j7j7J19j14Q4o0Oj5Mr3N9
$$ plain form
2826 -23 99 -37 -184 -111 -82 -67 -78 -26 -132 -11 -23 -4 47 -1 57 31 -101 -98 35 45 9 -10 -8 -25 7 -18 14 -56 -36 -25 -123 83
2426 83 -19 63 58 -33 37 7 50 -27 -28 -10 36 -89 -145 13 -27 135 -44 -100 -98 70 -43 60 -96 -42 123 154 -63 -28 0 32 94
2038 94 26 -55 -66 41 7 -77 -96 84 64 27 -130 -99 19 -39 10 0 -72 56 1 -39 -43 89 120 109 -27 -24 -33 -19 -14 -28 -99 -69 -130 22
1612 22 121 -62 -249 -179 20 -45 -42 54 -22 97 208 96 6 -28 -112 54 20 -307 -258 -73 -31 -79 10 112 -75 -1 6 -123 -13 -21
1236 -21 0 -11 -30 -24 99 66 -99 -4 51 99 -79 -146 -146 64 78 -55 120 -1 -26 -34 1 -199 -102 112 -6 105 -34 -8 19 -6 -15
848 -15 -99 -90 -14 15 -120 -8 5 -78 8 -21 -98 79 127 35 -86 -27 15 -95 -48 -116 34 14 15 20 76 -24 -14 -4 -147 -107 -30 -155 -71
435 -71 -22 8 121 102 16 -76 -11 -59 -95 -73 17 -210 -107 7 -12 -3 52 31 -10 -37 0 -56 27 -1 53 74 123 125 -35 38 -50 57 -45
22 -45 39 19 -151 -1 8 2 56 -14 14 93 77 -111 -44 -140 94 208 -80 -106 -110 -73 -110 7 -10 -27 92 -22 62 2 8 -7 -3 -96 -37
-391c7
##PAGE=	F1=-15255.3
##FIRST=	23146.675690215950453,	6006.5297639999989769,	0
##DATA TABLE=	(F2++(Y..Y)), PROFILE
6007IJk0k7J8J19k4p2j23J94N4j3j16PLk4K4Q6j66J78p6L9K0n7k5o2J08k14L23r1p3J00j07
5606gpJ7p2j34J71O8l7p9J29p6R8M7K2r6k2L3K5q3J53Oj38o3m3J33p5m2jK8Q8r4K4Q8KL0j
5168I2n2J3p3P6l0p4J41k8j05J31k39R7o0N4J51j14R4n9o1K0J9J41j59Q0L6m7L3O7j55O4M9
4780A02k5j2o6q9J43qR3j63O2p2K9L6j8p6N8J18k06J55NM3j58P9j68J73j03J08j72J50k3p9
4404h4Q8j09J37l7J08j07p6R2j8k2j0N1J0o8%j4R2j54J51J1m8n9Q9j47Q5J75q4q6J63m0o6
4016B3j13M1J00K6l5j3j74J07PL1k0n8R8N7J0Pj03n8J36Q8j39J6rJ00j75m2J43m4Q4k03l2
3628a44O2J37j13J01j28J05p8J57j32M2K8k6m8J01r5N9j75k4J68j3L7q4N1M7r4L5LJ1q1K0
3252g1M6o0N6R2K1nr9O8n0r9P9M0mk5j23J72O8p2j3M1p7Pjr3J13R3j12j12K15m2l1N4Lj40
$$ plain form
6007 9 10 -10 -37 -19 100 76 4 -119 75 129 116 0 7 10 -14 10 96 -70 108 32 71 91 34 9 -53 55 -159 164 73 0 100 -7
5606 -7 -14 3 -69 -203 -32 36 -1 -80 49 -27 71 118 140 44 22 55 80 -3 150 156 18 -45 -88 45 -30 -72 -73 -45 43 -51 -27 61 63 93 92
5168 92 40 53 -20 56 26 -48 93 65 -40 91 -148 -51 -111 -57 94 -20 74 15 -46 -26 -7 134 -25 55 91 44 77 144 -11 53 102
4780 102 77 65 -1 -90 53 45 138 -25 37 -35 -6 30 12 -64 -6 112 -94 61 66 109 -49 30 -138 35 -68 40 -132 18 -5 -84
4404 -84 4 -105 32 -5 103 -4 -80 12 -6 -28 -38 13 23 -45 -45 -59 33 -121 30 41 -7 -66 23 -124 -39 136 52 -34 129 89 23
4016 23 -90 -49 51 77 42 29 -145 -38 -31 0 -20 -78 20 77 87 94 -9 -67 69 157 18 34 25 125 -50 -92 51 7 91 -112 -144
3628 -144 -82 55 -58 43 -85 20 -58 99 -33 9 37 11 -37 64 -31 28 -147 -171 -3 -16 21 -63 -12 35 -59 -24 -21 -10 -91 -71
3252 -71 -25 -85 -29 63 84 79 -20 48 -2 -101 -22 18 14 -11 -134 38 106 34 21 62 -15 -8 -9 -102 11 104 -8 -120 95 53 22 76 79 -61
2826f1J93j65j88J59k4L8k9L6p2J14mk5O4n7K5L0j10j7J16K7q2kO2p0J3K0K3n0jL8r6J19o2
2413c8J23m9j06O6%O1q4kJ5K4j05l2J26n1J91j78p6NJ80j38J15j03P3J03rj21J6k0P6ok9q6
2013e9pQ0m8m7pJ94m1oj94M2J03o2N5m3j8O7k9l2K1R6M6j2j21L0j1O4q2j7n0J9m8J50J00k03
1587g0j49J01J25j10L5J31n8O5Q8j17k4r6r2K37l8l03M7J55M7q0J06Q0j15NL2j31J05J0J8
1224Dq0J9K8J24m7j39O3Q2R3k35m4J9J83K6j46J46r0m7J2N2j99Q5K25j56R6j33P2M3m2l1q4
836a01J4J27K7k16J40J3p3J22l8j07J82J3q3j19P8K8j36N3k0J14rN0m6P2j45K6Qj18M3M1l4
448i4N6j4L4J30l5q1m0N2j03j3L1J46j79P6L9j5MN0j7l1k6P3j35J41j4K8K4J4J4j45P9q8J03
34F4r5P5p3q6J50j8j4O2o8JP3k5j66O5p0K33R7k53n4jL3m7J11Oo7J08q2J04q0K7k3K8j04Q6
$$ plain form
2826 -61 132 -33 -221 -62 -86 -48 -77 -41 -113 1 -3 -28 36 -21 4 34 -76 -93 23 50 -32 -34 28 -42 -29 -9 14 -36 -37 1 -95 24 -38
2413 -38 85 36 -70 -4 -4 57 -27 -29 -14 10 -95 -127 -1 -52 139 -39 -115 -110 70 -68 47 -56 17 120 111 -10 6 -14 62 56 27 -59
2013 -59 -66 14 -34 -81 -88 106 65 59 -135 -93 10 -52 3 -40 -58 9 -20 -52 -31 65 111 99 -22 8 -3 61 -21 -38 -88 -69 -117 33 133 -70
1587 -70 -219 -118 7 -103 -68 63 5 70 158 41 17 -79 -171 66 28 -275 -228 -73 -26 -106 0 80 -35 -30 2 -129 -24 -14 4
1224 4 -76 -57 -29 95 48 -91 -28 54 147 -88 -132 -113 70 96 -50 96 6 -41 -29 23 -176 -91 134 -22 74 -59 13 56 14 -17 -101
836 -101 -87 40 67 -149 -9 4 -69 53 15 -92 90 103 20 -99 -21 7 -129 -76 -96 18 9 59 13 85 -60 -34 -26 -144 -101 -60 -94
448 -94 -38 -52 -18 112 77 -4 -44 8 -95 -108 -77 69 -110 -34 5 -10 -6 44 27 -4 -30 43 -92 49 35 63 87 101 115 -30 49 -39 64
34 64 -31 44 -29 -115 35 17 3 65 -3 -2 71 46 -120 -55 -125 108 205 -48 -102 -103 -70 -117 -6 0 -67 41 -41 63 -17 10 -13 15 -89 -3
-391c
##PAGE=	F1=-15349.7
##FIRST=	23146.675690215950453,	6006.5297639999989769,	0
##DATA TABLE=	(F2++(Y..Y)), PROFILE
6007B9k5Om6J4J41n3n8j45J89J14p2j28L0K5k7QJ15j50J67q7mK0on2r7J18k14L24j13j1J04
5618A16j55J3K1r0j08J29Q2l9n1J32m0M4J3N1l4n3L4j2r5J67L7j48r4rJ45p8p3mJ7J38j09
5230e3J9R5QJ4Oo9J3n0L7oq7J09K7j18J58k29P1p5R5J02o8P2j9r6M4K2J05j80J07M7q0L0J42
4817A93k07R2L4m5K3r2j19J50LR3j90R6Jm8PM5r8P7M8j33J11J2L7j77J09j70K08j69J70j48
4442h7J02n7n6J18j32J26J3M2o3r5J00l4K8n1N5L9o3ll6N9j26J64j2p2k3P5j20N6J91j15o1
4053c8J33l9o5q0N3J37n9J6j7j94Q0L8J7k6l0N1J09j8L9j13o1J16R6j10K7o6J12j46n5J15
3678B2j9O8j99J8M6J13j36J63j58O1m9J81j37NN7m6j6R3n3L8k16j8J71%J9p4O4O4j01M2%L1
3277C4j18M4N9p5QJ27O5p9p6L4%j32J04nP3o1j07J83N4r1LPk5rJ0p0O3J33j64j24K35q0RK6
$$ plain form
6007 29 4 10 -36 -22 119 66 8 -137 52 166 94 -34 -4 21 -6 2 117 -33 134 47 43 63 57 5 -92 26 -188 136 23 12 116
5618 116 -39 -26 -5 -95 -203 -74 8 -31 -82 50 10 54 67 118 84 31 65 53 -42 125 162 14 -80 -89 56 -22 -95 -99 -82 56 -53
5230 -53 -34 61 69 83 89 20 33 -17 20 14 -73 36 63 -55 103 -126 -55 -130 -35 67 -1 71 52 -44 0 22 127 -53 54 101 21 51 193
4817 193 -14 78 112 67 90 -2 -121 29 32 125 -65 31 32 -16 -9 36 -62 15 63 -70 41 53 90 -87 22 -148 60 -109 61 -87
4442 -87 15 -42 -98 20 -112 14 27 69 6 -89 11 -23 5 -46 9 48 -15 -18 -54 5 -121 43 31 -41 -64 11 -109 -53 138 23 -38
4053 -38 95 56 -9 -89 -36 101 42 58 41 -153 -73 -35 -18 -44 -74 -23 86 68 107 -6 -67 49 145 35 62 -4 108 -38 -93 22
3678 22 3 71 -128 -110 -64 49 -87 76 -82 -21 -70 111 -26 -21 36 -10 -26 67 14 52 -164 -182 -11 -11 8 -66 -2 62 -39 3 3 34
3277 34 -84 -40 19 -56 -48 79 144 65 -11 23 23 -109 -5 -10 63 2 -105 78 132 41 44 51 26 17 27 -43 20 153 -11 -135 100 20 29 55
2851E5%j45K25j59k04K22q6P0n2M4n8J15oo2M4n1RM7m5n0J02M3r9%R8j04JL3M0m6J2J5p3L9
2426b6k1J47r6j15O1L6O5p7nK5%o5k8Q6n7J95j41r4JJ60j36J15l4O5M2j6m7j6m3J13q7J7o6
2013d2k3M7n6mqK04n1J5k09N2O2l6N2q8M1Qk8J0L8O8K3j4n9N3k3J04j66Nm8pOR9R3j85r9J27
1562c9K6j28N2J64n1PO5j05L4j39r4K68j0k56L9Q0O3p2J05L0m6o3O4j12J00J7K6j48O0L5J16
1174H8o7r3L5J05R7k50j1J6J77J5j48O5ro6L5P4j72L3K18j66M6r3J12M0m2o2n9PJ46L4k57
786a52J37K3n5J31m5j13J53j3n9j22J02K2j49K3N0M9QR7p7N4j64O6Lq5M7jL7J8o0K6J45k5
385G1q6PN7j55K3%J81j03M4l9oOL1j0pm9R8j51J36J5OK6j3L2j15N1r5J02r5Q0p9k3J38o5J7
-53C0N0o4n7N6j5j18O5l6J85R6k08o1j9L3l9R3K8j21Q4j2Q0r4M0rM1r9R7
$$ plain form
2851 55 55 -90 135 -24 -228 -6 -92 -22 -74 -30 -88 27 21 -41 3 -48 -39 8 -37 -87 15 58 -41 -41 57 -47 -46 -13 27 -19 -7 8 -65 -26
2426 -26 -47 100 4 -111 -50 -14 51 -26 -31 -6 -6 -71 -99 -13 -70 125 -16 -110 -109 51 -85 30 -4 61 103 87 40 24 -19 94 7 24 -42
2013 -42 -65 -18 -74 -78 -86 118 67 82 -127 -75 -13 -49 3 -85 -44 -36 -64 -54 -16 52 75 61 2 55 32 136 -30 -25 -73 -80 -74 25 118 -67 -166 -39
1562 -39 -13 -141 -89 75 24 31 96 -9 25 -114 -208 60 50 -206 -167 -87 -24 -96 9 39 -7 -70 -6 -118 -18 -1 25 -123 -63 -28 88
1174 88 21 -72 -37 68 165 -85 -96 -80 97 112 -36 29 20 -46 -11 63 -109 -76 142 -24 22 -71 41 81 39 -23 -82 -75 71 105 -152
786 -152 -15 8 -47 84 39 -74 79 66 7 -115 -13 9 -140 -117 -67 -18 -10 87 10 64 -100 -34 -31 -116 -69 -70 -33 -15 -75 -49 96 71
385 71 -15 -8 49 -106 -83 -83 98 -5 39 0 -6 0 31 21 14 -35 63 -88 48 63 69 95 82 114 -1 50 -45 57 -38 42 -37 -60 78 13 30
-53 30 80 16 -41 15 0 -118 -53 -89 96 192 -16 -77 -96 -63 -102 -9 19 -102 -18 -30 50 -44 -4 -13 28 -71 26
-391B6
##PAGE=	F1=-15444.1
##FIRST=	23146.675690215950453,	6006.5297639999989769,	0
##DATA TABLE=	(F2++(Y..Y)), PROFILE
6007C8l1J6n5K5J23o0m5j50J64J46j22j25P1L9m8J9J14j15J40p4n4L5K0n8j16R5j60K66j11
5643a3K8Q4j54J3M2r9o1O3Q7m0m2J37%j9pO6M5q3K4n5q6J52N6j31j04M4J14q0p6j8NJ75j15
5230d8J2R1J0RJ3r2K8k5Nj1o9O2P5r6J19j73L5p6J31J6qN0L2j24P5J2N7j80J29N4j04J2J83
4817B04k21R7Nj7L7j20j18J63k6Q4j80R6P1j26JJ18j00P8l0o4P8J4Lj80J37j45J95j88K06
4454G2j03M0p7k7J45j64R4O8k2k3r2O8l2P5p7M7O5m9k0l8L1r8J84o7p0NP0o3J2J69j37l3J12
4041F5l6p3n3Q0J29r5N5j8k03M9N6J4l9%J1J44o2Q6j18o2R1R9p4M3j19J17q5p5N7J3N8j88
3640a33Q4J5O9j25J93j75K4j6J77j41j8Q9q4L8O6j2J8k37j5J58K2J8q4P5P6o8M7k2J5j52P1
3252b7P2q5mJ40Q3j39k9k3O1j23P8j6R2p4o9J47M3p0J2l6J4l1J9Nk4J47j97q7K19j11Q6l8
$$ plain form
6007 38 7 23 -32 -7 116 56 11 -139 25 171 49 -76 -5 34 -14 5 119 4 144 70 16 51 71 13 -103 -8 -168 98 -13
5643 -13 15 99 -55 -42 0 -99 -160 -97 -10 -50 -92 45 45 26 19 85 130 47 71 16 -70 82 138 7 -97 -53 61 -19 -95 -113 -108 67 -48
5230 -48 -36 55 65 74 87 -5 23 -2 3 -8 -77 -15 60 -36 83 -90 -55 -131 0 16 8 58 90 -34 41 53 110 -70 59 113 9 21 204
4817 204 -17 80 85 68 105 -15 -133 30 4 88 -92 4 75 -51 -50 68 -32 46 16 -48 30 44 47 -133 4 -141 54 -134 72
4454 72 -31 9 -68 -95 50 -114 -20 48 26 3 -89 -21 -53 22 -55 -8 57 8 -12 -50 -19 -117 67 0 -70 -65 5 -58 -46 123 -14 -47 65
4041 65 29 -44 -97 -17 112 17 72 54 -149 -100 -44 -30 -69 -69 -58 86 24 110 -8 -70 21 120 46 89 -30 87 2 -73 -16 -3 55 -133
3640 -133 -49 -34 35 -90 103 -72 -48 -64 113 -28 -46 43 -41 -3 63 51 69 -168 -183 -25 -3 15 -69 6 82 14 61 39 54 -98 -27
3252 -27 45 -40 -44 96 179 40 11 -12 49 -74 4 -12 80 6 -63 84 127 57 69 33 47 16 35 40 16 163 -34 -121 98 -13 73 35
2851C5j0j29K12j24j87K33j29R3o1O2n4J08qq7K6m2QK4K5q1R4O4q7j8J01j08nJ1P0n2M9l1
2451Bl4k5J3J47j25j28O6P5M5n1k0M0j2k5l3L5n1J74q0j04jJ17j20J22J4L5MJ0j8n2m4J33
2050A09j48N5k7m4pm2K4rK04l8J2k01N9J5NM0j21Q7l7m8O0N3N2l1oK1M5l1J31k27M1n4m5Q8
1625a5J4Q5j31n3J28o3j20N6J68m6l2N3q8P8j55r0K46L7j89K1j1Q3l6J04k7k4r3R1q8R3K1
1236A7L4j87Q9L0Q4p7m2L3R8O7k28K4OJ78jj43l9R4p7M7R6j21m8K08j52j9l7J30L8l8r1k3
836e0oJ24M6k34J03K2k3J10l7r9R1k2k5j29J29J3j34l1J16l4K6J34p2Lj48J17ln3N5m7P2k9
435a5p1J2J43Or7M0P9j88N7n1J81k0J9j01pK3J4pJ8o2Q8j11P2N4j1K3k9N9q5jr6J03r7R1m6
-3a3PJ31j30O8K5n0j28K9K1n9O3JJ00R8j52m9n1N0k9O5N0j68N2O6L1r1J9L1M0q3R4
$$ plain form
2851 35 25 -104 108 -16 -203 30 -99 -6 -67 -5 -59 49 41 -46 -20 -62 -54 -30 -5 -86 8 72 -15 -33 68 -40 -45 -34 36 -16 33 2
2451 2 -32 -57 -44 103 -22 -150 -84 -9 36 -15 -35 5 -7 -32 -65 -30 -81 93 13 -91 -92 25 -95 27 41 76 80 90 72 20 -24 109
2050 109 -39 16 -11 -55 -62 -104 -80 -89 115 77 89 -112 -53 -38 -33 7 -114 -27 -64 -112 -52 1 53 22 16 37 82 51 182 -45 -4 -58 -103 -15
1625 -15 -1 84 -47 -100 28 -35 -155 -99 69 23 -9 44 -44 34 -121 -211 35 72 -117 -96 -107 -24 -60 44 17 -7 -100 -9 -97 -4 17
1236 17 51 -136 -47 -17 67 -10 -52 -19 79 146 -82 -58 -52 126 125 -18 -57 37 -40 7 103 -18 -66 142 -10 -29 -66 64 102 64 -27 -50
836 -50 -56 68 114 -120 -17 5 -18 92 55 -44 47 25 0 -129 0 13 -121 -152 -36 -70 -44 90 18 21 -127 -10 -13 -66 -11 -58 14 -15
435 -15 -86 -74 69 75 -22 18 97 -91 -34 -85 96 76 95 -6 -13 10 24 17 35 -27 61 -50 22 76 65 88 59 118 33 32 -64 39 -58 33 -13
-3 -13 -6 125 -5 63 88 38 -90 -61 -40 -99 -36 -35 65 163 11 -38 -89 -39 -68 -3 47 -121 -69 -3 28 -63 -44 -13 27 -56 38
-391C8
##PAGE=	F1=-15538.4
##FIRST=	23146.675690215950453,	6006.5297639999989769,	0
##DATA TABLE=	(F2++(Y..Y)), PROFILE
6007B9j2Lm3L6P9n0m3j18J12J60j53j15J17L1n3L7Q4p2J07m3j11O4K4m5j05M7q3J75q9M2M4
5618E6j12OO5r1j3KP0l8m2J29L3n7k8O3J15r4Nq7o4J27N8j03j05J01O7q3n8k9JJ76j04j2Q6
5205D0RJ7J8j04L7Lj9l1l3K0R5n2M8r6jo2J48p8N3J9P6j18Q9KK1j65J23O6j14j6J77j88P8
4792F2k5L7K6j45q7J72o7P8j45N9J26j85K4J61p0N5r3j2O3J6n6j65J48r5J45j54K00o3j4p8
4416h2JJ67j92M9J09n9jp7J8l0J13p7K9O9j8m0j8Qp3J94j27m7J5O9Jk5J22j50oJ13l9q0m4
4003a08J13Q3q7Q0k3j86K4N3K7o2J8qJ44r2J26j20o0P0R9m8O1j49J09j3r4j5L8O8j70J44k6
3615dJ4p7J79j79RMJ52j31j7J05j29R6L2K1pk33nJ39L7L1j10Q8P5j5L4m7k0j76J02Q2q7K2
3215a5J11P7j57L0r5J11p8J9LO1n9k9Q7M3l3J5q3L7m6J7R7j10J27j93j9J61j13J73j10k1j12
$$ plain form
6007 29 17 20 -23 13 92 42 -1 -119 -7 153 0 -115 2 33 -20 17 101 29 136 93 -18 46 70 25 -80 -33 -116 59 -30 12 56
5618 56 -56 -50 15 -76 -89 -87 -17 -55 -97 32 65 8 -20 43 158 64 69 -18 -82 45 103 0 -105 -4 63 -20 -78 -107 -106 70 -34 -46 40
5205 40 49 66 84 -20 17 20 1 -30 -63 -43 52 0 48 -48 -49 -111 37 -41 12 31 107 -11 78 80 101 -64 59 125 11 -5 172 -16 62
4792 62 37 74 100 -45 -132 40 -27 51 -94 -35 91 -94 -70 91 21 76 -17 -29 34 50 -6 -171 -23 -118 27 -127 73 10 -4 -82
4416 -82 -81 86 -106 -57 52 -7 -8 -85 -67 -97 16 -61 -32 37 19 -21 -39 -31 -104 90 -37 -84 -69 0 1 -24 98 -52 -58 55 16 -64 -108
4003 -108 5 88 1 81 58 -128 -104 -51 -24 -86 -68 -76 68 -24 102 -18 -78 -8 91 43 104 -45 64 51 -43 -58 -20 48 -122 22 -4
3615 -4 10 -67 112 -67 -58 -54 98 -33 -50 55 -74 22 54 75 68 -165 -170 -31 6 37 -73 15 90 75 109 62 42 -134 -32 50 -37 -15
3215 -15 96 173 16 46 -49 62 -16 3 6 67 8 -21 66 109 76 91 8 45 -1 16 113 3 130 -63 -82 79 -34 139 29 8 -104
2826a04J69q2j37J87j42R8m7P6m6P7lr3M0l8J3k8P0r3Q4R0o3m6P6q5Jl4Q2n0R3o4Mp2L4J25
2401I2j21j49Q1J10Nj3m6N3npl4k1k8J33j4j03MO3j01J45K1m%M3k8p5l9J31j64P2K3n9p5o
1975a16K2nJ94lqj80O6j3K8K3j25J13o6p6R0P5M2q5J6Q1ml1J52k54P1n1q0J65p5P9o0k4R7
1562E8j14q9N1J34l5l3M6o9J01j48q1J81P5j08jq2R0PJ08o2o1p5J07p8Q8K8K9j84J01J7L0
1174C1p5%N3O6J9j79N6mJ68nj42j12J82q2M3J08n6j29J91j23o5MJ26M9m0j03%k0P8N2j50M6
773a3MJ4P2op5Rj8J1j25J38Jq6q9J49j08M3J49l5n5j16J67ql2O9q9O7q3l5mJ19L4j02N8J03
347A28j88P2q3J40M1J1j37j3M6jjL0k9L4n6j0R6l1J8m1Q7o7m5q3J03r4R4qK5J26j99J10J2
-66H7l4j81pP9qN7L0J2P6q2k6q5Q5l2L3P5j96J6J13j1o5l1Q0L1o7P8
$$ plain form
2826 -104 65 -17 -154 33 -109 -11 -58 18 -28 49 46 -47 -7 -45 -32 -60 10 -83 1 91 28 -18 58 -27 -26 -60 22 -28 65 1 5 -67 -33 92
2401 92 -29 -178 -97 13 18 5 -41 12 7 0 -34 -55 -83 50 36 -67 -63 0 -101 44 65 61 61 104 76 1 -38 93 -71 1 24 -35 -110 -116
1975 -116 -94 -99 95 92 84 -96 -30 -43 -15 8 -117 -4 -70 -146 -56 19 61 -24 -8 73 69 38 190 -64 7 -44 -124 41 -34 45 -15 -39 58
1562 58 -56 -145 -94 40 5 -28 18 -51 50 -98 -179 2 77 -31 -32 -114 -24 -17 91 29 -32 -107 0 -78 10 38 67 -117 -16 1 31
1174 31 -44 -44 9 75 94 -85 -29 -33 135 130 -12 -124 58 -24 19 127 71 -58 133 10 -55 -51 75 124 84 -19 -19 -39 39 91 -59 -13
773 -13 -9 5 77 71 -4 5 -13 -2 -127 11 12 -74 -163 -14 -122 -79 70 35 -20 -136 31 23 -9 60 -29 38 -45 -80 -84 35 69 -33 25 128
347 128 -60 12 -71 69 110 121 -16 -29 17 16 15 45 16 50 -6 -16 80 49 67 26 113 46 1 -82 21 -73 21 13 38 164 -35 75 87
-66 87 53 -128 -135 -56 -64 -7 23 35 111 29 3 -82 3 -29 4 79 -117 -101 12 1 -64 -95 -15 16 -51 27
-391B7
##PAGE=	F1=-15632.8
##FIRST=	23146.675690215950453,	6006.5297639999989769,	0
##DATA TABLE=	(F2++(Y..Y)), PROFILE
6007IK0k9j2L7K9l3n5m9M5J67j68j03J53%j2L2L9l2Q1k1j64J07J3k8n9%k6Q8n6L5Jn0JP5o8
5568c3J7l0K9l2l8R8N5n0o6M6J59q0j5j00l5J06M1p6j06J40L5q2l7l0J3J34p5n6R4nL8Rq4
5155a6K2L5l8m7JOQ3k0ol1l0l5J43j53J00k0R4o8O8J2Nj42R0P3j06m1J29j16M2l6P1Kj58l9
4729a26J68q4P5j07PJ55k17P5J43j7J5j24L0N6K1j18j32J28k9P9q5J53m3m7o6K7J79k06PJ18
4354C5n3pn0k3m2J35n7J6M5J7n0J9j2n3J78j61j6RO2N1m9P8j53J5J37n5p5n1J39K6o5R5m3
3941D2j43K2K8N5j00K9mJ02r0J42j17n2N4R7l4P4j51Q5M4r9q0N0R8j50J76o6l5j4J29j72K7
3553e3JJ13r4KR3j62J40RL7l8k01J3J23K6N1j36R5O5L5lo4m7j86J38Q9q3O1N3N0j27P5j48
3152g3J34k4m0L0J8l1mK9O0j3J7j18M2m7OJ57j57Q5j50N0P4q0K31j57l2j01J14m8p0R8j21
$$ plain form
6007 9 29 0 -12 25 54 21 -34 -83 -38 129 -39 -142 11 11 -1 31 70 38 119 98 -66 41 54 26 -33 -33 -59 29 -27 8 9 -41 -40 35 -33
5568 -33 -16 -46 -17 -49 -87 11 66 16 -50 -4 155 75 60 -40 -75 31 72 -4 -110 30 65 -17 -54 -84 -71 63 -12 -68 26 21 59 68 -16
5155 -16 6 41 3 -44 -43 -37 46 26 20 -11 -41 -76 67 -86 14 -6 88 20 88 100 105 -37 53 126 20 -21 108 -8 34 -2 69 71 -87 -126
4729 -126 42 -42 33 -74 -67 88 -129 -54 89 72 87 -37 -7 49 70 -48 -180 -52 -81 -2 -87 66 23 -24 -90 -63 116 -90 -83 35
4354 35 -18 -25 -75 -98 -140 -5 -62 -46 -1 16 -34 -15 -27 -80 98 -63 -79 -70 -8 43 -6 72 -81 -66 71 16 -59 -110 29 55 -10 85 42
3941 42 -101 -79 -51 4 -96 -67 -71 31 -59 83 -34 -86 -32 65 31 105 -46 39 83 -16 -96 -46 52 -98 78 12 -23 -37 92 -80 -53
3553 -53 -52 61 -33 -31 62 -100 40 49 86 48 -153 -140 -17 9 60 -76 19 84 119 116 52 5 -181 -43 46 -37 24 77 127 0 75 -73
3152 -73 61 37 -3 27 45 14 10 39 99 86 103 -15 27 -20 -14 143 -14 71 -79 -29 45 -35 196 39 7 -94 20 -28 -98 0 -121
2764a21Q4j6Q4k8J8Rq0R5m4Rp9Q3q0N8J24n3o8L7m2J7p6N2k5J14n8K3j07N1R1r0j63R9J29
2351D7m7L0p6N7J9j9k5o3OQ1L7r9J9J2q1J78j4l6K2N6m4q0m0J11j29N9P3o3j33L9o%J70L7
1925I8k3j58P3j1J6Kr0J13q1r2Q4J01L1j07M4J00q1j9J65k40P7l2r8K12j40O5Rj9L6j16l1
1537a12L6P8j6KL3m9J04j35o1J00Q4l0j8j06P0L1J22o7j26k8J00q2Q8L8J0j48J04qk6o8K6
1149e4P9K7k9j13Q0j5J44Lj49j19K31q5K6R9J4j83J60r1p1RJ09P8n7q7pl6M1M4m1j2k9M5L7
736D8M2m8p9j2M0q9J16j3j5j33J39j50N7J41Pr3q7K13j6l0Q7j20K9j31M1k3P9L8q2N4J12j45
335b3N7p2P2N6L0j50k0O7k1J1L1N8n6k3o5J37o6J4n1J02o7m9n6J00q3Q3%N8J12k54J13L2j8
-78E9j94m8J47J4M4M7m9J9j2Kr9J24n7J3R9j98j8J07k6k4p8J17J7o2N8
$$ plain form
2764 -121 -37 -53 31 3 21 30 -50 45 1 10 -69 14 -66 -8 116 63 -5 32 -10 7 -69 -17 -42 72 14 37 -70 -19 72 -18 -181 -82 47
2351 47 0 30 -46 11 30 11 -14 -77 -71 10 47 -52 -33 -21 -102 76 62 26 48 104 60 -20 -60 51 -78 -19 54 -9 -142 -103 -109 -109 61 98
1925 98 75 -83 -10 -21 -5 -3 -93 20 -61 -153 -69 32 63 -44 0 100 19 0 165 -75 2 -30 -128 84 -56 9 18 -1 35 -81 -112
1537 -112 -76 2 -14 -12 21 -28 76 -59 -120 -20 64 34 16 -90 -20 11 133 66 -60 -88 12 -70 18 56 66 -82 22 14 -12 -80 -54
1149 -54 25 52 23 -90 -10 -25 119 122 -27 -146 85 0 26 125 139 -44 116 25 -46 -37 72 150 93 6 -1 -37 4 48 7 -5 -34 11 48
736 48 90 42 -37 -49 -9 -98 18 5 -10 -143 -4 -154 -97 44 51 -42 -129 84 68 38 125 5 34 -97 -56 -79 0 38 -44 10 122 -23
335 -23 34 -38 34 90 120 -30 -50 17 -4 7 38 96 40 17 -48 89 23 37 -14 88 21 -28 -84 16 -67 16 16 74 186 -68 45 77 59
-78 59 -135 -183 -36 -22 22 69 20 39 27 29 -70 54 -3 10 109 -89 -107 0 -26 -50 -128 -11 6 -56 2
-391B
##PAGE=	F1=-15727.1
##FIRST=	23146.675690215950453,	6006.5297639999989769,	0
##DATA TABLE=	(F2++(Y..Y)), PROFILE
6007gM1n9J7L1j3j0p7L8k1J73j69r2J71m3O3rLJP0l8j88J51Jk6J4k9j3L4k3J2k4PjO7m5K7
5556C4l3k0j9k3M8O5%j18J2J76m5l2r1kQ6J2n3j09J52J8o4k2k4L9O6l8j11J24m3O8k2l0j5
5143a4O3m8n0K6J8N4k9j7Qn0jJ25j91J23o2Q2J1RM5J4j15M8N8q0m5N8l1Kk5N4j2j54J0J48
4717C2o2P2q6k6J54k30J41O8L0k4j15N9N5K3j54q4Q5K2K4j1P9m2n5n1M6J82k04k2R6j1k8k2
4316e9l8p1J39k7J9JL7l7N5l2l3J31j50JNM1P2o5O2j46K9J66p7n4o3J46j9o0J14q0r3N0rQ4
3891C9j39M5RL0n2J22j05l1L7Q8j8P2j30M7P3q7j17M8J38j37J66q9n9L1O9j60O8k3P2l6K6
3503cO3j72J55J6L3p9j43M1J04k3P9j46R4M3P6o0o6n5j77J72R7p8Q1jJ8q1Q9j56J36Jp4M7
3102C1Pj2knQ9l1K1j24L0l0j1J60j57M5q1R2j7l1K46j64m5r3P4l3pqp6N7J7R0Oo4K5n3J70
$$ plain form
6007 -7 34 -25 -8 23 10 0 -77 -39 -60 113 -56 -148 23 -20 43 34 37 38 108 70 -118 33 34 8 22 -7 -20 14 -9 3 -21 -14 -15 52 7 34
5556 34 1 -19 -38 -61 -13 52 52 -66 -54 122 77 45 -46 -48 38 50 -3 -112 40 58 -6 -28 -52 -13 53 15 -96 28 -15 53 31 1 -14
5143 -14 49 1 -49 -23 -5 49 20 3 11 -39 -40 85 -106 17 -45 37 48 57 102 116 1 49 107 27 -18 40 9 11 -14 40 28 -126 -116 32
4717 32 -30 42 -44 -70 84 -146 -5 63 93 69 -46 13 68 91 -63 -147 -62 -40 -16 -27 52 10 -45 -96 -50 132 -72 -94 2 -9 -37 -59
4316 -59 -97 -168 -29 -56 -37 -36 1 -36 19 -13 -46 85 -65 -64 -59 -18 54 -11 51 -95 -66 100 23 -31 -94 52 33 -27 87 7 -86 -36 -45 39
3891 39 -100 -55 -46 -16 -68 54 -51 -82 -45 43 25 97 -33 14 87 0 -117 -69 69 -68 98 9 -50 -19 50 -110 -42 -65 7 -29 -3
3503 -3 60 -112 43 59 92 13 -130 -89 15 -8 71 -75 19 62 138 78 12 -43 -220 -48 49 -29 52 51 69 -12 77 -79 57 58 -16 31
3102 31 38 26 24 19 108 77 98 -26 4 -26 -37 123 -34 11 -70 22 5 -26 220 56 11 -82 -8 -41 -48 -56 -132 -75 -58 32 38 -26 -1 -54 116
2664A16o0qj13P8m0OJ63o9o9JjM3r0k4J6J04k0J8j27O9N8n1j56J14J26r8N9r5N8M0m8op7L8
2238d5K8P0j09M4k8n4K00o7n4N2L5l8o8m2P7o0RJ19n0j58P5m8kJ39O1k0j41P7J7k2k0l2R1
1825C6q2q2M5J19J1p7O6Q1j59JJ61j83N5qq9K12j66L6O9m3k5r1N0J4L2kN4Mk9R6j29l1L7O4
1399D7K1k3p8K2K5J39n2j67J2P1r1R1M2j2r6J10n0o3o4M5Q7Jo4m8R8l0J14Rj53o8K35q6OO9
973I9P4j93J08o2l4k5Q9J17p7n2m3n2K7L1N0n7o0N9J8Q5j5j56j7N6j8O5k3O0j53R0j47P0J11
$$ plain form
2664 116 56 48 -65 13 -27 -21 142 73 4 5 4 47 -43 -67 -51 53 33 51 -76 -7 51 0 -156 -42 84 -14 45 -50 8 48 0 -6 -83 -45
2238 -45 -17 53 -56 -12 -40 -94 106 39 -15 37 72 34 -34 -76 1 -59 -50 69 19 -139 -64 -112 -114 25 86 66 -75 2 19 -3 -23 -55 36
1825 36 -46 -128 -83 36 47 -30 36 117 -42 -41 120 -63 -8 -16 -105 107 -59 -23 46 3 -22 -113 -63 -49 -17 -19 35 39 10 106 -23 -54 -17 47
1399 47 68 45 -33 -11 14 153 101 -66 -54 17 -74 17 59 47 -49 61 11 -52 -116 -71 16 17 -47 -95 3 -27 87 96 -57 -125 110 24 30 99
973 99 173 -20 88 26 -8 -33 56 173 96 44 1 -51 -24 7 57 0 -60 -1 17 102 87 -69 -86 -30 -48 17 -6 54 -99 -9 -156 -86 25
$$ [...]
-391B1
##END NTUPLES=	nD NMR SPECTRUM
##END=	
##END=	
