##TITLE=	Oct20-2021.31.fid
TM-VI-107solid Ca+Ph-pyrraz. 13C

##JCAMP-DX=	6.0	$$ MestReNova 14.3.0-30573
##DATA TYPE=	LINK
##BLOCK_ID=	1
##BLOCKS=	2    
##ORIGIN=	Mestrelab Research S.L.
##OWNER=	hrzepa
##$MNOVA/LINK_BLOCK_TYPE=	ITEM	$$ NMR Spectrum
##$MNOVA/ITEM/POLYGON=	(XY..XY)
5321,5835
8722,5835
8722,8208
5321,8208
5321,5835
##$MNOVA/ITEM/Z=	0
##$MNOVA/ITEM/ANGLE=	0
##TITLE=	Oct20-2021.31.fid
##JCAMP-DX=	6.0	$$ MestReNova 14.3.0-30573
##BLOCK_ID=	2
##DATA TYPE=	MNOVA NMR VIEW DATA
##DATA CLASS=	MNOVA VIEW DATA
##$MNOVA/ITEM/ZOOM/X=	-31.150195598113686657,	251.15679998888273872
##$MNOVA/ITEM/ZOOM/Y=	-885.43500900268554688,	9428.08929443359375
##END=	
##TITLE=	Oct20-2021.31.fid
##JCAMP-DX=	6.0	$$ MestReNova 14.3.0-30573
##BLOCK_ID=	3
##DATA TYPE=	NMR SPECTRUM
##DATA CLASS=	XYDATA
##NUMDIM=	1
##ORIGIN=	Bruker BioSpin GmbH
##OWNER=	nmr
##.OBSERVE FREQUENCY=	100.64143946071199309
##.OBSERVE NUCLEUS=	^13C
##.SOLVENT NAME=	Acetone
##.PULSE SEQUENCE=	zgpg30
##LONGDATE=	2021/10/21 03:32:00.000
##.ACQUISITIONMODE=	SIMULTANEOUS (DQD)
##$ORIGINAL FORMAT=	Bruker XWIN-NMR
##$MNOVA/SCALES_VERSION=	9
##$PARAMETER FILE=	(acqus, ASCII, /private/var/folders/f6/rjf_tdyn2v98c5c0wvkgn4s80000gn/T/R+0qdR+qSp+05mVEZpEOrQ/31/acqus, 0)
$$ ##TITLE= Parameter file, TOPSPIN		Version 3.2
$$ ##JCAMPDX= 5.0
$$ ##DATATYPE= Parameter Values
$$ ##NPOINTS= 11	$$ modification sequence number
$$ ##ORIGIN= Bruker BioSpin GmbH
$$ ##OWNER= nmr
$$ $$ 2021-10-21 03:32:14.661 +0100  nmr@CZC2439F63
$$ $$ /opt/topspin/data/agmb/nmr/Oct20-2021/31/acqus
$$ $$ process /opt/topspin3.2/prog/mod/shimcntl
$$ ##$ACQT0= -2.26890760309556
$$ ##$AMP= (0..31)
$$ 100 100 100 100 100 100 100 100 100 100 100 100 100 100 100 100 100 100
$$ 100 100 100 100 100 100 100 100 100 100 100 100 100 100
$$ ##$AMPCOIL= (0..19)
$$ 0 0 0 0 0 0 0 0 0 0 0 0 0 0 0 0 0 0 0 0
$$ ##$ANAVPT= -1
$$ ##$AQSEQ= 0
$$ ##$AQ_mod= 3
$$ ##$AUNM= <au_zg>
$$ ##$AUTOPOS= <3 >
$$ ##$BF1= 100.63037
$$ ##$BF2= 400.2
$$ ##$BF3= 100.63037
$$ ##$BF4= 100.63037
$$ ##$BF5= 100.63037
$$ ##$BF6= 100.63037
$$ ##$BF7= 100.63037
$$ ##$BF8= 100.63037
$$ ##$BYTORDA= 0
$$ ##$CAGPARS= (0..11)
$$ 0 0 0 0 0 0 0 0 0 0 0 0
$$ ##$CFDGTYP= 0
$$ ##$CFRGTYP= 9
$$ ##$CHEMSTR= <none>
$$ ##$CNST= (0..63)
$$ 1 1 145 1 1 1 1 1 1 1 1 1 1 1 1 1 1 1 1 1 1 1 1 1 1 1 1 1 1 1 1 1 1 1 1
$$ 1 1 1 1 1 1 1 1 1 1 1 1 1 1 1 1 1 1 1 1 1 1 1 1 1 1 1 1 1
$$ ##$CPDPRG= (0..8)
$$ <waltz16> <> <waltz16> <> <mlev> <mlev> <mlev> <mlev> <mlev>
$$ ##$D= (0..63)
$$ 0 1 0.00345 0 0 0 0 0 0 0.06 0 0.03 2e-05 3e-06 0 0 0.0002 0 0 0 0 0 0
$$ 0 0 0 0 0 0 0 0 0 0 0 0 0 0 0 0 0 0 0 0 0 0 0 0 0 0 0 0 0 0 0 0 0 0 0 0
$$ 0 0 0 0 0
$$ ##$DATE= 1634783533
$$ ##$DE= 6.5
$$ ##$DECBNUC= <off>
$$ ##$DECIM= 704
$$ ##$DECNUC= <off>
$$ ##$DECSTAT= 4
$$ ##$DIGMOD= 1
$$ ##$DIGTYP= 12
$$ ##$DQDMODE= 0
$$ ##$DR= 21
$$ ##$DS= 4
$$ ##$DSPFIRM= 0
$$ ##$DSPFVS= 20
$$ ##$DTYPA= 0
$$ ##$EXP= <c13>
$$ ##$F1LIST= <111111111111111>
$$ ##$F2LIST= <222222222222222>
$$ ##$F3LIST= <333333333333333>
$$ ##$FCUCHAN= (0..9)
$$ [...]
$$ ##$Sgu3PowerLevels= (0..7)
$$ 0 0 0 0 0 0 0 0
$$ ##$Sgu4PowerLevels= (0..7)
$$ 0 0 0 0 0 0 0 0
$$ ##$Sgu5PowerLevels= (0..7)
$$ 0 0 0 0 0 0 0 0
$$ ##$Sgu6PowerLevels= (0..7)
$$ 0 0 0 0 0 0 0 0
$$ ##$Sgu7PowerLevels= (0..7)
$$ 0 0 0 0 0 0 0 0
$$ ##$Sgu8PowerLevels= (0..7)
$$ 0 0 0 0 0 0 0 0
$$ ##$SguType= 3
$$ ##$ShimPowMaxUA= (0..63)
$$ 130000 130000 130000 130000 130000 130000 130000 130000 130000 130000 130000
$$ 130000 130000 130000 130000 130000 130000 130000 130000 130000 0 0 0 0
$$ 0 0 0 0 0 0 0 0 0 0 0 0 0 0 0 0 0 0 0 0 0 0 0 0 0 0 0 0 0 0 0 0 0 0 0 0
$$ 0 0 0 0
$$ ##$ShimPowMaxUC= (0..63)
$$ 130000 130000 130000 130000 130000 130000 130000 130000 130000 130000 130000
$$ 130000 130000 130000 130000 130000 130000 130000 130000 130000 0 0 0 0
$$ 0 0 0 0 0 0 0 0 0 0 0 0 0 0 0 0 0 0 0 0 0 0 0 0 0 0 0 0 0 0 0 0 0 0 0 0
$$ 0 0 0 0
$$ ##$ShimPowMaxUG= (0..63)
$$ 524287 524287 524287 524287 524287 524287 524287 524287 524287 524287 524287
$$ 524287 524287 524287 524287 524287 524287 524287 524287 524287 0 0 0 0
$$ 0 0 0 0 0 0 0 0 0 0 0 0 0 0 0 0 0 0 0 0 0 0 0 0 0 0 0 0 0 0 0 0 0 0 0 0
$$ 0 0 0 0
$$ ##$ShimPowRcbType= 3
$$ ##$ShimPowRes= (0..63)
$$ 1e-20 1e-20 1e-20 1e-20 1e-20 1e-20 1e-20 1e-20 1e-20 1e-20 1e-20 1e-20
$$ 1e-20 1e-20 1e-20 1e-20 1e-20 1e-20 1e-20 1e-20 0 0 0 0 0 0 0 0 0 0 0 0
$$ 0 0 0 0 0 0 0 0 0 0 0 0 0 0 0 0 0 0 0 0 0 0 0 0 0 0 0 0 0 0 0 0
$$ ##$ShimPowRng0= (0..63)
$$ 1 1 1 1 1 1 1 1 1 1 1 1 1 1 1 1 1 1 1 1 0 0 0 0 0 0 0 0 0 0 0 0 0 0 0 0
$$ 0 0 0 0 0 0 0 0 0 0 0 0 0 0 0 0 0 0 0 0 0 0 0 0 0 0 0 0
$$ ##$ShimPowRng1= (0..63)
$$ 1 1 1 1 1 1 1 1 1 1 1 1 1 1 1 1 1 1 1 1 0 0 0 0 0 0 0 0 0 0 0 0 0 0 0 0
$$ 0 0 0 0 0 0 0 0 0 0 0 0 0 0 0 0 0 0 0 0 0 0 0 0 0 0 0 0
$$ ##$ShimPowRng2= (0..63)
$$ 1 1 1 1 1 1 1 1 1 1 1 1 1 1 1 1 1 1 1 1 0 0 0 0 0 0 0 0 0 0 0 0 0 0 0 0
$$ 0 0 0 0 0 0 0 0 0 0 0 0 0 0 0 0 0 0 0 0 0 0 0 0 0 0 0 0
$$ ##$ShimPowRng3= (0..63)
$$ 1 1 1 1 1 1 1 1 1 1 1 1 1 1 1 1 1 1 1 1 0 0 0 0 0 0 0 0 0 0 0 0 0 0 0 0
$$ 0 0 0 0 0 0 0 0 0 0 0 0 0 0 0 0 0 0 0 0 0 0 0 0 0 0 0 0
$$ ##$ShimSysFunc= (0..63)
$$ 1 2 3 4 5 7 9 11 15 16 8 10 12 14 6 17 13 18 19 20 0 0 0 0 0 0 0 0 0 0
$$ 0 0 0 0 0 0 0 0 0 0 0 0 0 0 0 0 0 0 0 0 0 0 0 0 0 0 0 0 0 0 0 0 0 0
$$ ##$ShimSysMatrix= 0
$$ ##$ShimSysType= 1
$$ ##$TFXNUM= 0
$$ ##$TRIPLO2= 0
$$ ##$VTU= 2
$$ ##$VTUETH= <149.236.99.20>
$$ ##$VTUTY= <no>
$$ ##$WBREFAM= (0..15)
$$ 135.5 97.7 100 100 100 100 100 100 100 100 100 100 100 100 100 100
$$ ##$WBREFLM= (0..15)
$$ 0 0 0 0 0 0 0 0 0 0 0 0 0 0 0 0
$$ ##$WBREFPH= (0..15)
$$ 72.26 -67.22 0 0 0 0 0 0 0 0 0 0 0 0 0 0
$$ ##$WBSGU= (0..15)
$$ 0 0 0 0 0 0 0 0 0 0 0 0 0 0 0 0
$$ ##$XFAC= 2
$$ ##END=
$$ 
##$DECIM=	704
##$DSPFVS=	20
##XUNITS=	HZ
##YUNITS=	ARBITRARY UNITS
##FIRSTX=	25274.001712016048259
##LASTX=	-3134.6557087493106337
##DELTAX=	-0.43348832563920586258
##XFACTOR=	1
##YFACTOR=	0.083466085082948865415
##FIRSTY=	-6.4686446189880371094
##MINY=	-28.335948944091796875
##MAXY=	8570.990234375
##NPOINTS=	65536
##XYDATA=	(X++(Y..Y))
$$ [...]
8695i7k1j4jQJ3J5J2RRJ8K8L0K3Qkj1j8k2k5k1j3pjLKnj5k0j5pmj0k2l1l1j9NK4L0K1J3Mm
$$ -97 -118 -132 -133 -125 -112 -97 -85 -76 -67 -49 -21 9 32 40 38 27 9 -13 -38 -59 -72 -79 -80 -77 -75 -80 -95 -115 -130 -137 -141 -151 -173 -204 -235 -254 -249 -225 -195 -174 -161 -157 -161
8676a61nJ6N5P8N5Ok8k9j3kmj1j0jJ1J2ok5k5j1KLQJ8K1J0OJ7K8J8qk5k2pNMrk8l6k0RL0L1
$$ -161 -166 -150 -95 -17 38 44 16 -13 -26 -28 -32 -43 -53 -54 -43 -31 -37 -62 -87 -98 -96 -93 -85 -67 -46 -36 -30 -13 15 33 25 0 -22 -29 -24 -20 -29 -57 -93 -113 -104 -74 -43
8658d3K2J0LNJ4J3pk6k6oLrk6l4l5l3j6J4L8L5J9J2K2K6J2j7l8l5j3J3K0Oqrknj7k4k4k2k2
$$ -43 -21 -11 -8 -3 11 24 17 -9 -35 -41 -38 -47 -73 -107 -142 -175 -191 -177 -139 -104 -85 -73 -51 -25 -13 -30 -68 -103 -116 -103 -83 -77 -85 -94 -96 -101 -118 -142 -166 -188 -210
8640b10j5kKoj7k1j3LL0N8O7M0lk7j6J2K1Qj1rJ1L3L9L2K3J7Pj1k8k8j5jMLLLqk5l3j8RK8
$$ -210 -225 -227 -225 -231 -248 -269 -282 -279 -249 -191 -124 -84 -87 -114 -130 -118 -97 -89 -100 -109 -98 -65 -26 6 29 46 53 42 14 -14 -29 -30 -26 -23 -20 -17 -25 -50 -83 -101 -92 -64
8622f4K9J6lj4j1QK9L2K3J4J1%l0n9o5m4j9mMRJ1J0J1J5J3KmMJ6Rj5l3k7lJ5K1K2K7L2K9K3
$$ -64 -35 -19 -22 -36 -47 -39 -10 22 45 59 70 70 40 -19 -84 -128 -147 -151 -147 -138 -127 -117 -106 -91 -78 -76 -80 -76 -60 -51 -66 -99 -126 -129 -114 -93 -71 -44 -12 17 40
8604D0J5R%j6k6k0kjk6n3n3k5MJ1Mqj1nJ6L7M2K4%mPJ6J4QN%j5k9k2lJ2J6K1L0L8K5nk9l4
$$ 40 55 64 64 48 22 2 0 -1 -27 -80 -133 -158 -154 -143 -139 -147 -158 -163 -147 -110 -68 -44 -44 -48 -41 -25 -11 -3 2 2 -13 -42 -64 -67 -55 -39 -18 12 50 75 70 41 7
8585Gk2nOJ2J5J3Jj8l1l4k8j6kOKj3k7k8j6mJ1L1M8M6K2rk6k2mJ3J5kk0j6J0L1K2qk8k9k3
$$ 7 -15 -20 -14 -2 13 26 27 9 -22 -56 -84 -100 -102 -96 -94 -107 -134 -162 -178 -182 -171 -140 -92 -46 -24 -33 -59 -81 -85 -72 -57 -59 -79 -95 -85 -54 -32 -40 -68 -97 -120
8567a20k2k0oJ5L0L4L2L0K8K3J2mj5j5rokLQLpqJNnk0j7mkj3j9nJ4J5lj7j1%MkkMQKj1j9j5
$$ -120 -142 -162 -168 -153 -123 -89 -57 -27 1 24 36 32 17 2 -7 -13 -15 -12 -4 -1 -8 -16 -15 -10 -15 -35 -52 -56 -58 -71 -90 -95 -81 -66 -69 -86 -97 -97 -93 -95 -97 -93 -85 -83 -94 -113 -128
8547a28LK5M1M2K5Jj7j9rjllMJ3Rj0k6j8J2L9M3K8Pmpj1k2k9k3lJ4J0j0j9pJ7L3K8J3nk5l9
$$ -128 -125 -100 -59 -17 8 9 -8 -27 -36 -37 -40 -43 -39 -26 -17 -27 -53 -71 -59 -20 23 51 58 54 47 36 14 -15 -38 -41 -27 -17 -27 -46 -53 -36 -3 25 38 33 8 -31
8529c1m4l2j2%%LJ3K1J9QNOkk2m1m0j5J7L8M3L7K8K2J3mj7j4KJ9J9Opk4m3n7m3oK6L2J6kr
$$ -31 -75 -107 -119 -119 -119 -116 -103 -82 -63 -55 -50 -44 -46 -68 -109 -149 -164 -147 -109 -66 -29 -1 21 34 30 13 -1 1 20 39 45 38 14 -29 -86 -129 -135 -109 -77 -61 -63 -72
8511g2nLJ1Rkj1j2oloqkJ2L0L8K4rl1k9j4rj9k1rJ3K9L2J9lj6JL7N2L4kj6plj7l4l9k9j7k
$$ -72 -77 -74 -63 -54 -56 -67 -79 -85 -88 -94 -102 -104 -92 -62 -24 0 -9 -40 -69 -83 -92 -111 -132 -141 -128 -99 -67 -48 -51 -67 -66 -29 23 57 55 39 32 29 12 -22 -61 -90 -107 -109
8492a09J2K5K6K0J3Nlj1j8k6m0n2m2j1K4L7K8J6J7K5K6J6Lrj8k7l0k1%J6J0j4l1k7j2pj0%
$$ -109 -97 -72 -46 -26 -13 -8 -11 -22 -40 -66 -106 -158 -200 -211 -187 -150 -122 -106 -89 -64 -38 -22 -19 -28 -46 -73 -103 -124 -124 -108 -98 -112 -143 -170 -182 -189 -199 -199
8475a99K7M9M6L0J6Lj9l3k1J3L9L9K3J5J6J9J6Rok4l7l9l8k9rJ7L2K1kk1k5j7%J6J6JpMK2
$$ -199 -172 -123 -77 -47 -31 -28 -47 -80 -101 -88 -49 -10 13 28 44 63 79 88 82 58 21 -18 -56 -85 -94 -77 -45 -24 -26 -47 -72 -89 -89 -73 -57 -56 -63 -59 -37
8458c7J7rk7k3qLJ3K2K1Jk2k8k2j8j7qJ1K0QlPL0M2L0RllMRNqk5l8l3j6NJ7K0J8J4QPPOlj8
$$ -37 -20 -29 -56 -79 -87 -84 -71 -49 -28 -27 -49 -77 -99 -117 -134 -142 -131 -111 -103 -106 -99 -69 -27 3 12 9 6 10 19 24 16 -9 -47 -80 -96 -91 -74 -54 -36 -22 -14 -7 0 6 3 -15
8438a5k6j6PK9L5L1K1Qpk2k5j6nlqj2j0oMJ5K4K4J0j2l0l4j9onj3j8j5j3j3qNJ3J2J9L4L7
$$ -15 -41 -57 -50 -21 14 45 66 74 67 45 20 4 -1 -4 -12 -24 -34 -40 -36 -21 3 27 37 25 -5 -39 -58 -64 -69 -82 -100 -115 -128 -141 -149 -144 -131 -119 -100 -66 -29
8420b9J2j3rJ6K1KmJ3K8J2j5k1j1pj6k2j9j7j8j6j4k1l1k8j4mJJ5L6M7L2Kj7k1j9j8k2j7%
$$ -29 -17 -30 -39 -23 -2 0 -4 9 37 49 34 13 2 -5 -21 -43 -62 -79 -97 -113 -127 -148 -179 -207 -221 -225 -224 -209 -173 -126 -94 -92 -109 -130 -149 -167 -189 -206 -206
8404b06K0K0jj3ML0L1Qj2qK%pj3k1l4l7k0RL0L1K6K2K8M1M8K9pl7l7k0lJ0K3K6J4ko%mj7k5
$$ -206 -186 -166 -167 -180 -176 -146 -115 -107 -119 -127 -125 -125 -132 -145 -166 -200 -237 -257 -248 -218 -187 -161 -139 -111 -70 -22 7 0 -37 -74 -94 -97 -87 -64 -38 -24 -26 -32 -32 -36 -53 -78
8385g8j7kRJ4Poj0NJ8Ol0m8l3oJ2K0L6M8L5Oj8j6lONpj6j7lJ3J7J2O%j2k5k3pRJ0L%%Jjnj3
$$ -78 -95 -97 -88 -74 -67 -73 -83 -78 -60 -54 -84 -132 -165 -171 -159 -139 -103 -55 -20 -14 -32 -48 -51 -45 -40 -47 -63 -80 -83 -70 -53 -41 -35 -35 -47 -72 -95 -102 -93 -83 -80 -80 -80 -79 -80 -85 -98
8365i8k2k6k6k7l4l4j7NJ2JJK5N4N9L4Lj6j8j2kMNJLPO%nLK4M0L9K4J3J7K5K2%k6l8m0m0l3
$$ -98 -120 -146 -172 -199 -233 -267 -284 -279 -267 -266 -265 -240 -186 -127 -93 -90 -106 -124 -136 -138 -134 -129 -128 -125 -118 -112 -112 -117 -114 -90 -50 -11 13 26 43 68 90 90 64 26 -14 -54 -87
8346h7j9lok1l0k6j7j1%J9K7J6kj5k0j3J2N3P9O4K7Jpj1j1%J5J4j9n2o0m1j8JJ8K5J9RQK2
$$ -87 -106 -109 -115 -136 -166 -192 -209 -220 -220 -201 -174 -158 -160 -175 -195 -208 -196 -143 -64 0 27 28 21 10 -1 -1 14 28 9 -43 -103 -144 -162 -161 -143 -118 -99 -90 -82 -60
8329f0L1K0jj3rKJ1Rjj7l4m0k9j1LQJ4K0J9Nj2k2k6l4l7k2JJ3J2QJ1J3OlmLJ4K8M0M1K5J1
$$ -60 -29 -9 -10 -23 -32 -30 -19 -10 -11 -28 -62 -102 -131 -142 -139 -131 -117 -97 -78 -73 -85 -107 -133 -167 -204 -226 -225 -212 -200 -192 -181 -168 -162 -165 -169 -166 -152 -124 -84 -43 -18 -7
8311gQJ2Oj4k5k3j4j3j9k8l4k9j1J5K9K3J0J0J9J8pl0k3J4M6M4J4j5k7k6j9j2rj0oJ1L2L7
$$ -7 1 13 19 5 -20 -43 -57 -70 -89 -117 -151 -180 -191 -176 -147 -124 -114 -104 -85 -67 -74 -104 -127 -113 -67 -23 -9 -24 -51 -77 -96 -108 -117 -127 -133 -122 -90 -53
8294e3K5J5J8K9K2Lrokrk4k9k3pN%j2j6mOOjLJ9K9J6mj5j4j1j6j7lJ7K6J0j1j4QL2L3J5pj7
$$ -53 -28 -13 5 34 56 59 50 44 42 33 9 -20 -43 -50 -45 -45 -57 -73 -77 -71 -65 -66 -63 -44 -15 1 -3 -18 -32 -43 -59 -76 -79 -62 -36 -26 -37 -51 -43 -11 22 37 30 13
8275A3j4j0nJJ1J5J6Qmj2j8j9j8j1kLQJ2J3Mj2j6nJ1J6J4PMmj1j4j5j3pRK0J3pk1j7j0okO
$$ 13 -1 -11 -16 -15 -4 11 27 35 31 19 1 -18 -36 -47 -49 -46 -38 -26 -13 -9 -21 -37 -42 -31 -15 -1 6 10 6 -5 -19 -34 -47 -54 -45 -25 -12 -19 -40 -57 -67 -73 -75 -69
8256f9Qmk3l8l9k6lK2L1J7pk3k6k2j3nJJQK7M6M8L4J2qk5k5mK9N1M5K9J6Mj3l0l6k9j8j3j2
$$ -69 -61 -65 -88 -126 -165 -191 -194 -172 -141 -124 -131 -154 -180 -202 -215 -220 -219 -218 -210 -183 -137 -89 -55 -43 -51 -76 -101 -105 -76 -25 20 49 65 69 56 26 -10 -39 -57 -70 -82
8238h2q%J1J4J0NQJ4J2kj1lOnl0m9n0l9k1OL6N0M2K8J7Qqj5jK3L4K6K1K2J7Nlmqj7k0nPnk6
$$ -82 -90 -90 -79 -65 -55 -50 -42 -28 -16 -18 -29 -32 -26 -31 -61 -110 -160 -199 -220 -214 -178 -128 -86 -58 -41 -33 -41 -56 -57 -34 0 26 47 69 86 91 88 84 76 59 39 34 41 36 10
8219A0k6pPkk0k7j6KJ5J9J1KMJ6K4K0OJQJ8J3lj7j9j4j2j7k3k3k3k6j6QL2L0Mk2k8j2PJ3%
$$ 10 -16 -23 -16 -18 -38 -65 -81 -79 -64 -45 -34 -32 -28 -12 12 32 38 39 47 65 78 75 58 39 25 13 -4 -27 -50 -73 -99 -115 -107 -75 -45 -41 -63 -91 -103 -96 -83 -83
8201h3k0l4k8j0PRjj6k3j6LJ9J7MkJnj8k1jL1N2N5L9J2j5j9NL2L2J4oj5l0m7m8k2LJ0KjQJ3
$$ -83 -103 -137 -165 -175 -168 -159 -160 -176 -199 -215 -212 -193 -176 -172 -174 -173 -178 -196 -217 -218 -187 -135 -80 -41 -29 -44 -63 -58 -26 6 20 14 -1 -31 -78 -126 -148 -145 -135 -133 -134 -126 -113
8182a13J0Lmj3k0j6nLNPJ4K1J7QRJ5Pj4l0k1OK5K2Orj6j6qLJ8K8K8J8JoPL1M6L0nk9k7j2q
$$ -113 -103 -100 -104 -117 -137 -153 -158 -155 -150 -143 -129 -108 -91 -83 -74 -59 -52 -66 -96 -117 -111 -86 -64 -58 -67 -83 -99 -107 -104 -86 -58 -30 -12 -11 -17 -10 21 67 97 92 63 36 24 16
8163A6j9k8j7OJ9J2ORRnj7j2J0K2J9Qjpj7j8j2nmrj1kJ2L0L6J9j4l2k6j1oqmQJ4J0%mm%J2
$$ 16 -3 -31 -48 -42 -23 -11 -5 4 13 8 -9 -21 -11 11 30 38 37 30 13 -5 -17 -22 -26 -35 -46 -48 -36 -6 30 49 35 3 -23 -34 -40 -48 -52 -44 -30 -20 -20 -24 -28 -28 -16
8143a6K0K0J1Jqj8k2k2j9j8j5%K0K4J3JlmkPJ8J8Oomjqk4l1k5rQK4L0K3J2Omj5k0lJ8J7j1
$$ -16 4 24 35 36 28 10 -12 -34 -53 -71 -86 -86 -66 -42 -29 -28 -31 -35 -37 -30 -12 6 12 6 2 1 -7 -31 -62 -87 -96 -88 -64 -34 -11 1 7 3 -12 -32 -35 -17 0 -11
8124a1l7m3l3k4j5KK6M4N0M6L8J9ql1l5j9LJ3RJMJ2J8Rmj0pj2k5m0l9k8k5k5j3J3L3K6%j9
$$ -11 -48 -91 -124 -148 -163 -161 -135 -91 -41 5 43 62 54 23 -12 -31 -28 -15 -6 -5 -1 11 29 38 34 24 17 5 -20 -60 -99 -127 -152 -177 -190 -177 -144 -118 -118 -137
8107a37j9rNK1L3K6Nj0lJ3J9J2lj8l4l6k3jPLlJQJ0J1J4J4Orj5j4j0j0pKJ8K7K2J2POLmlJ3
$$ -137 -156 -165 -160 -139 -106 -80 -75 -85 -88 -75 -56 -44 -47 -65 -99 -135 -158 -159 -152 -149 -152 -151 -143 -133 -122 -108 -94 -88 -97 -112 -126 -136 -146 -153 -151 -133 -106 -84 -72 -65 -59 -56 -60 -63 -50
8087e0K9K5Lj9k5j4kKRK2L8M3L1Oj6l2m3m5l6j4NJ3J7J7J4PLJ2J7Nj7k1mNj6m7m8k0NPKJ0
$$ -50 -21 4 7 -12 -37 -51 -53 -51 -42 -20 18 61 92 98 82 50 7 -38 -74 -88 -83 -70 -53 -36 -22 -15 -12 0 17 22 5 -16 -20 -15 -31 -78 -126 -146 -141 -134 -132 -122
8069a22K9M0L9L4K3lk8l4j9jmj6j2RK7J7j3m0m5k6%J4J3NlppkRJ8K1J5Pkj0j2rKROrk1k3j4
$$ -122 -93 -53 -14 20 43 40 12 -22 -41 -42 -46 -62 -74 -65 -38 -21 -34 -74 -119 -145 -145 -131 -118 -113 -116 -123 -130 -132 -123 -105 -84 -69 -62 -64 -74 -86 -95 -93 -84 -78 -87 -108 -131 -145
8050a45mmrkJ7K9K0MNK4L4K6J1N%j2k7k5lJ9K4Rj0j7kK4L4J8j3k9k6j5p%J3K8K9J3j4l0k4
$$ -145 -149 -153 -162 -164 -147 -118 -98 -94 -89 -65 -31 -5 6 11 11 -1 -28 -53 -56 -37 -13 -4 -14 -31 -33 -9 25 43 30 1 -25 -40 -47 -47 -34 -6 23 36 22 -8 -32
8032c2j0j3k9l6j9%%j1j4nkmjRJ5Qjmqj3j0JQMPK4M5M6K9J1OQMj%NMj0k9l8k4LK2K6J3lj4
$$ -32 -42 -55 -84 -120 -139 -139 -139 -150 -164 -169 -171 -175 -176 -167 -152 -144 -145 -149 -157 -170 -180 -179 -171 -167 -160 -136 -91 -45 -16 -5 1 9 13 12 12 17 21 11 -18 -56 -80 -77 -55 -29 -16 -19 -33
8012c3j5p%lrnJ4L0K5kk7k9qJ4K2J1qk0k7k9k0LK4K5QkJjj8l3k6jJ7L0M1M9L5Lk4k7j6omj0
$$ -33 -48 -55 -55 -58 -67 -72 -58 -28 -3 -5 -32 -61 -69 -55 -33 -22 -30 -50 -77 -106 -126 -123 -99 -74 -66 -68 -67 -68 -86 -119 -145 -146 -129 -99 -58 -9 26 29 5 -22 -38 -44 -48 -58
7993e8j7k5k6k1j1rj2j1kJ0J2LnkJ3K5K9L0K7J6nk4k3j0NJ3J5J0j1l4l8j5J3K6K4J5OJMJ4
$$ -58 -75 -100 -126 -147 -158 -167 -179 -190 -192 -182 -170 -167 -172 -174 -161 -136 -107 -77 -50 -34 -39 -63 -86 -96 -91 -78 -63 -53 -64 -98 -136 -151 -138 -112 -88 -73 -67 -66 -62 -48
7976d8J9J3MLNMjoj0j2j2mLMlnjKoj5j4LK3L3K2Mj5k8l5l7l4k2jK4M9O3M9J4k4l9k6jJ6K2
$$ -48 -29 -16 -12 -9 -4 0 -1 -7 -17 -29 -41 -45 -42 -38 -41 -46 -47 -45 -51 -66 -80 -77 -54 -21 1 5 -10 -38 -73 -110 -144 -166 -167 -143 -94 -31 18 32 8 -31 -57 -58 -42 -20
7957b0K0J5J1RRjk5m5m5k6j1j0j0MK6L3K0%pOK5L1K1kj8j5kRJ0NK%qj5k1j5rj1k6m2m7l3j4
$$ -20 0 15 26 35 44 43 18 -27 -72 -98 -109 -119 -129 -125 -99 -66 -46 -46 -53 -47 -22 9 30 28 10 -5 -7 2 12 17 19 19 11 -4 -25 -40 -49 -60 -86 -128 -175 -208 -222
7938b22jjnnNK0L2L8M0M0M0K7Kk7l8k4p%JJ1K7L0J9Lqk2l1k1MK5K5J0nj3k0k0nJ7K7J2ppO
$$ -222 -223 -224 -229 -234 -229 -209 -177 -139 -99 -59 -19 8 10 -17 -55 -79 -86 -86 -85 -74 -47 -17 2 5 -3 -25 -56 -77 -73 -48 -23 -13 -18 -31 -51 -71 -76 -59 -32 -20 -27 -34 -28
7919b8J2O%jj0l2m9l8j0Mj0l1l4j3J2K4K5K3K4K5J8kk3k7j4lpj8j7oKKKJlrmJ7M0M9L6J3p
$$ -28 -16 -10 -10 -11 -21 -53 -102 -140 -150 -146 -156 -187 -221 -234 -222 -198 -173 -150 -126 -101 -83 -85 -108 -135 -149 -152 -159 -177 -194 -200 -198 -196 -194 -193 -196 -205 -209 -192 -152 -103 -67 -54 -61
7901f1j7j5mL%rk2l0k7j1J3L3L6K0%rJJ2RkmORJmNJ3%k2k7j8j3k0j9lJ0RLJ0K6L9M4L7J6j3
$$ -61 -78 -93 -97 -94 -94 -103 -125 -155 -182 -193 -180 -147 -111 -91 -91 -100 -99 -87 -78 -80 -84 -78 -69 -68 -72 -67 -54 -54 -76 -103 -121 -134 -154 -173 -176 -166 -157 -154 -144 -118 -79 -35 2 18 5
7881Ek8j9kKoj1j0j3k1k5k4k1k0j6pl%KRK2L5L8K1orJ7M1L2Kj4nOLjNJ4J5J0mk4m5m0pK2K2
$$ 5 -23 -42 -44 -42 -48 -59 -69 -82 -103 -128 -152 -173 -193 -209 -216 -219 -219 -217 -208 -186 -151 -113 -92 -98 -107 -90 -49 -17 -15 -29 -34 -28 -25 -26 -21 -7 8 18 14 -10 -55 -95 -102 -80 -58
7862e8Jj2mPO%rk0l0l5l2k1j1jJ3K7L6K9J3NJ3K7K4jk1j6NJ8J4J3K0K2Mk3l6k9j7j1j1j7j8
$$ -58 -57 -69 -73 -66 -60 -60 -69 -89 -119 -154 -186 -207 -218 -219 -206 -179 -143 -114 -101 -96 -83 -56 -32 -33 -54 -70 -65 -47 -33 -20 0 22 26 3 -33 -62 -79 -90 -101 -118 -136
7844a36j1JOmj7j7rmj0j5rMK0L0K9J6KQL0L6Rk8l4j3MJlMMj8l5k5OK1J2JNJ9K7L2L8L7K7N
$$ -136 -147 -146 -140 -144 -161 -178 -187 -191 -201 -216 -225 -221 -201 -171 -142 -126 -124 -116 -86 -50 -41 -69 -103 -116 -112 -111 -114 -110 -106 -124 -159 -184 -178 -157 -145 -144 -139 -120 -93 -61 -23 14 41 46
7825D6j3j3KJ5J3nj9j8j1rqnnqjK6N7O6M3J6NOJj3k6l1l5l7l3k2j6j7k7l3k5oKoj8j4l%on
$$ 46 33 20 22 37 50 45 26 8 -3 -12 -20 -25 -30 -38 -39 -13 44 110 153 169 174 180 181 168 142 111 76 39 6 -16 -32 -49 -76 -109 -134 -140 -138 -144 -162 -176 -179 -179 -185 -190
7806a90J2K8L1K4J9J5RJnqkNJ2RLRK1K0jk1k0%J4J5J2RNjpj2j5j5r%QJ1J1M%MJ5K3J0j3k4
$$ -190 -178 -150 -119 -95 -76 -61 -52 -51 -56 -64 -66 -61 -49 -40 -37 -28 -7 13 12 -9 -29 -29 -15 0 12 21 26 25 18 6 -9 -24 -33 -33 -25 -14 -3 1 1 5 20 43 53 40 16
7786A6j4NJ5Qj7m5n8m3j3MOJ2K4L3K3PKJ0K0K1J9J9K3K1Qj0k3k9l7n0o0m6j3J7K7J7Npj7k3
$$ 16 2 7 22 30 13 -32 -90 -133 -146 -142 -136 -124 -100 -67 -44 -37 -35 -25 -5 16 35 54 77 98 106 96 73 44 7 -43 -103 -149 -162 -145 -118 -101 -96 -103 -120 -143
7769a43j7%J9K1J1%KJ1J3Mllmj4j8mK0L0J9%j6k5k6rJ8K8J5oj8k4k6j4QK3J7NRK3K7J9J3J0
$$ -143 -160 -160 -141 -120 -109 -109 -107 -96 -83 -79 -82 -85 -89 -103 -121 -125 -105 -75 -56 -56 -72 -97 -123 -132 -114 -86 -71 -77 -95 -119 -145 -159 -151 -128 -111 -106 -97 -74 -47 -28 -15 -5
7751eJp%J0Nj2j8nOjqOK3J8OMPlk0j7MJ5Mj3j4j4k2k8j5J5M2N3M8K0k5n8n7l0mNKnk0l6l6
$$ -5 -4 -11 -11 -1 4 -8 -26 -31 -25 -26 -34 -28 -5 13 19 23 30 27 7 -10 -6 9 13 0 -14 -28 -50 -78 -93 -78 -36 17 65 85 60 2 -55 -85 -89 -84 -82 -87 -107 -143 -179
7731a79j6MJ1J3K7M6M8K4j2l1k8pPOnj1j3j5j2PL8N5M1J0mljmkJ0K2J7lj9k6k1kJ7K1Oj9l0
$$ -179 -195 -191 -180 -167 -140 -94 -46 -22 -34 -65 -93 -100 -93 -87 -92 -103 -116 -131 -143 -136 -98 -43 -2 8 4 1 0 -4 -6 4 26 43 40 21 -5 -26 -28 -11 10 16 -3 -33
7713c3k0mKJjJ%j0k4l5l6k9j3RK8L8L2J5ql0m1l2rJ7L2L7L2J6lj2jK0L3K3jk2k4j2OJ5J2J0
$$ -33 -53 -57 -55 -54 -55 -54 -54 -64 -88 -123 -159 -188 -201 -192 -164 -126 -94 -79 -87 -117 -158 -190 -199 -182 -150 -113 -81 -65 -68 -80 -81 -61 -28 -5 -6 -28 -52 -64 -58 -43 -31 -21
7695b1J2J4J7K2K5Qk7n4m8j7QJ1J2K4K9K1lk1k3j3J0K6K3Lj1rqj9l0j9kJj4k0oJ0J5J7K4K8
$$ -21 -9 5 22 44 69 77 50 -4 -52 -69 -61 -50 -38 -14 15 36 33 12 -11 -24 -14 12 35 38 27 18 10 -9 -39 -58 -60 -59 -73 -93 -99 -89 -74 -57 -33 -5
7677eK2Oj0j5nJ6L2K4jj9j9j4j4j9rNJ4J2J3J4J0MNJ9L0K3J0LJ0Rrm2o6o6n0l4l1k8j1K1M1
$$ -5 17 23 13 -2 -7 9 41 65 64 45 26 12 -2 -21 -30 -25 -11 1 14 28 38 42 47 66 96 119 129 132 142 151 142 100 34 -32 -82 -116 -147 -175 -186 -165 -124
7660a24L4Pj7k6k7k5j7LK0J9LlRK5K7Rj3j9qOJj9l7l4k3j7k0j2QK6K6J3NKKj%MJ1J9K4K5K3
$$ -124 -90 -83 -100 -126 -153 -178 -195 -192 -172 -153 -150 -153 -144 -119 -92 -83 -96 -115 -123 -117 -116 -135 -172 -206 -229 -246 -266 -278 -270 -244 -218 -205 -200 -198 -196 -197 -197 -193 -182 -163 -139 -114 -91
7641i1K0J3Jj2qOJ5PjMJ5J7J1ONnj2qMJk2m3m7l8k4mJ9K7J2j1k0j5j4j4j1JPKlJMjj2j1NK5
$$ -91 -71 -58 -57 -69 -77 -71 -56 -49 -50 -46 -31 -14 -3 3 8 3 -9 -17 -13 -12 -34 -77 -124 -162 -186 -190 -171 -144 -132 -143 -163 -178 -192 -206 -217 -216 -209 -207 -210 -209 -205 -206 -218 -229 -224 -199
7621a99K8J7QJ1J6RopQK0J1j4k8k0KJ5J6J1POKoj8l0l1j8LRrl3k9J0M8N2K2pj2JJ5K3K7K2
$$ -199 -171 -154 -146 -135 -119 -110 -116 -123 -115 -95 -84 -98 -126 -146 -144 -129 -113 -102 -95 -89 -87 -93 -111 -141 -172 -190 -187 -178 -187 -220 -249 -239 -191 -139 -117 -124 -136 -135 -120 -97 -70 -48
7603d8Rnj0qrj2qJ0L6M9M3K4P%pk0k7j8lJoj3oLPJ0J3K0J8Jk5m8n4l8j3LPOJj0j9pK0L0Pk4
$$ -48 -39 -44 -54 -62 -71 -83 -91 -81 -45 4 47 71 78 78 71 51 24 6 3 4 -2 -15 -21 -18 -11 -1 12 32 50 51 26 -22 -76 -114 -127 -124 -117 -111 -110 -120 -139 -146 -126 -96 -89 -113
7583a13k4RL9M1K5Ooj4k2k7l0k2JL0M5L5J0j2rJ3K8K6J1MM%j4k2j6j3j4j9j9j7k1k4k3k3k7
$$ -113 -137 -128 -89 -48 -23 -17 -23 -37 -59 -86 -116 -138 -137 -107 -62 -27 -17 -29 -38 -25 3 29 40 44 48 48 34 12 -4 -17 -31 -50 -69 -86 -107 -131 -154 -177 -204
7566b04k0NK5K4J2PJ0Mj0j7j6j4j0OJ9J0j4j8PL1L2J7Olj3pK0M5M4K2Mmpj3j5j8k4k1pMNJ
$$ -204 -224 -219 -194 -170 -158 -151 -141 -137 -147 -164 -180 -194 -204 -198 -179 -169 -183 -201 -194 -163 -131 -114 -108 -111 -124 -131 -111 -66 -22 0 4 0 -7 -20 -35 -53 -77 -98 -105 -101 -96 -95
7548i5MQK%J1K4K5K1K9M3L3Mj4qql2n7m9qK5K7Pj5k5j6QK7K2%j2nLlj7j9nOPRK1L0K4NjJ4
$$ -95 -91 -83 -81 -81 -70 -46 -21 0 29 72 105 109 95 87 79 47 -10 -59 -67 -42 -15 -8 -23 -48 -64 -56 -29 -7 -7 -19 -24 -21 -24 -41 -60 -65 -59 -52 -43 -22 8 32 37 36 50
7528E0K8K1pl2l4j4J1K4K1Ork5l7l7k6j0oj5k5l0l3l3k7qJ2K4L4L8L5K1QPJ3J2QRJ7J8J2M
$$ 50 78 99 92 60 26 12 23 47 68 74 65 40 3 -34 -60 -70 -76 -91 -116 -146 -179 -212 -239 -247 -235 -211 -177 -139 -104 -83 -75 -68 -55 -43 -35 -26 -9 9 21 25
7511B5knlPJ9J1j6l8l6j5JPNNKnj1j2rpj0j2pQJ8J0lpjok7m0l1j6r%J9L9L8J6mj5k6l2j8J0
$$ 25 23 18 15 22 41 52 36 -2 -38 -53 -52 -45 -40 -35 -33 -38 -49 -61 -70 -77 -87 -99 -106 -98 -80 -70 -73 -80 -81 -87 -114 -154 -185 -201 -210 -210 -191 -152 -114 -98 -102 -117 -143 -175 -193 -183
7491a83K3Qj0j2oj1j7j1RK2K1J7K2K9L0K4J1lqklj4k7k0MK4K8K2J0pk5k8j4PK4L8M0K1j5l7
$$ -183 -160 -152 -162 -174 -180 -191 -208 -219 -210 -188 -167 -150 -128 -99 -69 -45 -34 -37 -45 -47 -50 -64 -91 -111 -107 -83 -55 -33 -23 -30 -55 -83 -97 -90 -66 -28 12 33 18 -19
7474a9l1kJ7K2K3K8K6Mk5m3m6l2k1k0k1j1KMjLJ6J3qj8PM0L8QrLJ1jj1LK2K3J3J3J9J7Kj1
$$ -19 -50 -52 -35 -13 10 38 64 68 43 0 -46 -78 -99 -119 -140 -151 -149 -145 -146 -143 -127 -114 -122 -140 -133 -93 -55 -47 -56 -53 -42 -43 -54 -51 -29 -6 7 20 39 56 58 47
7455D7j9k8l0k2lJ1J2Mqj9j9qJpk5k8pJ9L2K7J7J2J1J1Ppj5j0lok3k9k1qrj6j1PJ5Nj1j1J2
$$ 47 28 0 -30 -52 -55 -44 -32 -28 -36 -55 -74 -82 -81 -88 -113 -141 -148 -129 -97 -70 -53 -41 -30 -19 -12 -19 -34 -44 -47 -53 -76 -105 -126 -134 -143 -159 -170 -163 -148 -143 -154 -165 -153
7437a53L6L9K4J2J3J3jk2k9j6lLJ0K1K9K8K8K2Mk2l1j2J1J3koKMj3k9k8j4oj0j2qnj3k6k5
$$ -153 -117 -78 -54 -42 -29 -16 -17 -39 -68 -84 -87 -84 -74 -53 -24 4 32 54 58 36 5 -7 4 17 15 9 11 15 2 -27 -55 -69 -75 -85 -97 -105 -110 -123 -149 -174
7419a74jL3M9L4jk3j7QK9L8L5K0kk0k1j6qjOJ3J7J5J2Nqj2LL0M1L0Nj4k4k4j9j4j9k7k6oJ2
$$ -174 -175 -142 -93 -59 -60 -83 -100 -92 -63 -25 10 30 28 8 -13 -29 -37 -38 -32 -19 -2 13 25 30 22 10 13 43 84 114 119 105 81 57 38 24 5 -22 -48 -54 -42
7402d2Qj1k1k4k6k2lK1K3Jj9j0J6K9J9%j1oKKrk1j4MJ3J2J3J8J2j1l2k8oJ6L2M1L4J4%PJ8
$$ -42 -34 -45 -66 -90 -116 -138 -141 -120 -97 -96 -115 -125 -109 -80 -61 -61 -72 -78 -76 -74 -83 -104 -118 -114 -101 -89 -76 -58 -46 -57 -89 -117 -123 -107 -75 -34 0 14 14 21 39
7384C9Mk3l1j7nrj1oj1l6n3m3j3OJ1J9L0L0J4koNJ9L0K7Ok6n5o2m3rK2L9M8N3M3J3k2l6j9
$$ 39 43 20 -11 -28 -33 -42 -53 -59 -70 -106 -159 -202 -215 -209 -198 -179 -149 -119 -105 -107 -113 -108 -89 -59 -32 -26 -52 -107 -169 -212 -221 -199 -160 -112 -59 -16 -3 -25 -61 -80
7367h0%kk5l8k6jJ4Mj7j6J0L2K3L%J1Rj2j6PL0J8j4l2k7j8j0lkj4k1qK1L7K9J6J1J2J2J1L
$$ -80 -80 -82 -107 -145 -171 -172 -158 -154 -171 -187 -177 -145 -122 -119 -119 -108 -99 -111 -127 -120 -90 -72 -86 -118 -145 -163 -173 -176 -178 -192 -213 -221 -200 -163 -134 -118 -107 -95 -83 -72 -69
7349f9j4k9k3lJ3Nj2k4k2j5pJPQONJ2K2L3L1J3pj5rrk1l9m6k8RM8O2M4J1qqjOJ5J8J2JjNJ
$$ -69 -83 -112 -135 -138 -125 -120 -132 -156 -178 -193 -200 -199 -192 -184 -178 -173 -161 -139 -106 -75 -62 -69 -84 -93 -102 -123 -162 -208 -236 -227 -179 -117 -73 -62 -70 -78 -79 -73 -58 -40 -28 -27 -28 -23 -22
7329b2j2j6lJ7K1Mj9l4k9j0NMrqJ0K9L5L1K2J0nj4ppk6m7m8k3JKj0j5jJ6K0J0NJ7L4M0K9J3
$$ -22 -34 -50 -53 -36 -15 -11 -30 -64 -93 -103 -98 -94 -103 -111 -101 -72 -37 -6 16 26 21 7 0 -7 -33 -80 -128 -151 -150 -148 -158 -173 -174 -158 -138 -128 -123 -106 -72 -32 -3 10
7311A0jj6l6m4k8RM6N8L8Prnlk5m4l8qJk4n4n1j4L0O5P8N9K0j3j5njm%J4K0J0qj9k2j2kkj3
$$ 10 9 -7 -43 -87 -115 -106 -60 -2 36 43 34 29 26 1 -43 -81 -89 -88 -112 -166 -217 -231 -201 -136 -58 1 21 8 -7 -12 -13 -17 -17 -3 17 27 19 0 -22 -34 -36 -38 -51
7292e1j7mJ2Nj8l3l2k3j7j3nMJ1K0L5M7M1K0KJJ9L9L5J4oqoj5l2l6k6nQRJkPJ8J3j1k8j5J5
$$ -51 -68 -72 -60 -55 -73 -106 -138 -161 -178 -191 -196 -192 -181 -161 -126 -79 -38 -18 -16 -15 4 43 78 92 86 78 72 57 25 -11 -37 -42 -34 -25 -24 -26 -19 -1 12 1 -27 -42 -27
7274b7L2K3PMJ4J5kk3l3j6J1L7M4L9K7J0j1k2k5l1m9n7l9lK1K4K0J5Kj4j6%J0QKLJnj3j2j3
$$ -27 5 28 35 39 53 68 66 43 10 -6 5 42 86 125 152 162 151 129 104 73 24 -33 -72 -75 -54 -30 -10 5 7 -7 -23 -23 -13 -5 -3 0 1 -4 -17 -29 -42
7256d2k2k9j7NK1K6K4K2J7Pnj2j8k3k3j8kJ7J9Jj7j4%P%lKLpj4kJ1J3MJJ%rj5oJ3K5J9mj5
$$ -42 -64 -93 -110 -105 -84 -58 -34 -12 5 12 7 -5 -23 -46 -69 -87 -89 -72 -53 -52 -69 -83 -83 -76 -76 -79 -77 -74 -81 -95 -97 -86 -73 -69 -68 -67 -67 -76 -91 -97 -84 -59 -40 -44 -59
7237e9KL0L4J5jPJ7J1PJ9K5lm0m6j3Rlk0j4OJ1NPK4K6Mk2k8j2JKkjMP%j1j6j0PK8L8K2qk8
$$ -59 -57 -27 7 22 21 28 45 56 63 82 107 104 64 18 5 14 11 -9 -23 -17 -6 -1 6 30 56 60 38 10 -2 -1 1 -1 -2 2 9 9 -2 -18 -28 -21 7 45 67 59 31
7217C1k5j2j4k3k6j7qjOJ0PKOJ8K4J7Kj0j4j3qorj3qRK3K6J8Nrj9j9pJ2K9L8L9L0J7%j6l3
$$ 31 6 -6 -20 -43 -69 -86 -94 -95 -89 -79 -72 -70 -64 -46 -22 -5 -3 -13 -27 -40 -48 -54 -63 -76 -84 -75 -52 -26 -8 -3 -12 -31 -50 -57 -45 -16 22 61 91 108 108 92 59
7198E9m6m5k8jJ3J2LMJ0Lj8l3k0RK5J8J0J2J2JoKJ4J8J2ROpk2k0opk8m3k6J0L6L2Pj3j6lQ
$$ 59 13 -32 -60 -61 -48 -36 -33 -29 -19 -16 -34 -67 -87 -78 -53 -35 -25 -13 -1 0 -6 -4 10 28 40 49 55 48 26 6 0 -7 -35 -78 -104 -94 -58 -26 -19 -32 -48 -51 -43
7180d3J0Nlj2k1k0j2lKPJ2Lk0k6lK1J3qLM2N3J4l1m4k5pKJ2J7Qk%Pjj6j5jKnoMJj6k7j5RK3
$$ -43 -33 -28 -31 -43 -64 -84 -96 -99 -97 -90 -78 -75 -95 -121 -124 -103 -90 -98 -95 -53 0 14 -17 -61 -86 -93 -91 -79 -62 -54 -56 -56 -49 -50 -66 -81 -82 -80 -85 -91 -87 -86 -102 -129 -144 -135 -112
7159a12K0Pqj2JJ7J5kj3pOPjj3k0k0nJ7K8J7MOK0K7J9QRJ5Qj1k9l1j3OOj5l2k9nK3L7L1J4
$$ -112 -92 -85 -93 -105 -104 -87 -72 -74 -87 -94 -88 -81 -82 -95 -115 -135 -140 -123 -95 -78 -74 -68 -48 -21 -2 6 15 30 38 27 -2 -33 -46 -40 -34 -49 -81 -110 -115 -92 -55 -24 -10
7141a0kj2k5m1m5k8KK6M4N7N5K8j5l6k3JKj8k7k0j0j2j2mNJj3j7pJ0K5L2L1K1RLmj4k5k3o
$$ -10 -12 -24 -49 -90 -135 -163 -161 -135 -91 -34 21 49 34 -2 -25 -24 -22 -40 -67 -87 -97 -109 -121 -125 -120 -119 -132 -149 -156 -146 -121 -89 -58 -37 -28 -25 -29 -43 -68 -91 -97
7123i7Nkk6l9k9qNjj3j5MK8L6J6j2k5j1J0J7Prj7lK5M9N2K7pl0l5j8J1L3K6%j6oPmk3j9LJ0
$$ -97 -92 -94 -120 -159 -188 -196 -191 -192 -205 -220 -216 -188 -152 -136 -148 -173 -184 -174 -157 -150 -159 -176 -179 -154 -105 -53 -26 -33 -63 -98 -116 -105 -72 -46 -46 -62 -68 -61 -65 -88 -107 -104 -94
7104i4%jJ7L0J6kl%j0k4j9MJ5Pmn%MJ0J6J2kj4rOK2K3J2mj3j2nLK1M2N5L8Oj3j4qpjQMk0l8
$$ -94 -94 -95 -78 -48 -32 -34 -37 -37 -47 -71 -90 -86 -71 -64 -68 -73 -73 -69 -59 -43 -31 -33 -47 -56 -50 -28 -5 7 3 -10 -22 -27 -24 -3 39 94 132 138 125 111 103 96 95 103 107 87 49
7084D9k9lQjj3j7j4oMQJo%J3J3KjONj3k4j0J6J9lj9j5qj2j7rKLjJPMlKK1L0J7j1l7m5l0jK2
$$ 49 20 17 25 24 11 -6 -20 -26 -22 -14 -13 -19 -19 -6 7 9 8 14 19 6 -18 -28 -12 7 4 -15 -30 -38 -50 -67 -76 -74 -71 -72 -71 -64 -60 -63 -61 -40 -10 7 -4 -41 -86 -116 -117 -95
7063i5J8rl3k5JK2K3J8J4J2RJ1J5QjNJ8K4%k9l8k9j2MJ9L1K4Mj4j3JJ3J8J9J4Jj1j0jKj4l5
$$ -95 -77 -86 -119 -144 -143 -121 -98 -80 -66 -54 -45 -34 -19 -11 -12 -7 11 35 35 6 -32 -61 -73 -69 -50 -19 5 9 -5 -18 -17 -4 14 33 47 48 37 27 26 28 14 -21
7045b1m6l8k5j3NL2M7L3kk5k3rJOJ3J3Kj1kK1L8L1Rj8m3n1k9RK5J3poKlj5j4MJ2Jj8j8MK7
$$ -21 -67 -105 -130 -143 -138 -106 -59 -26 -28 -53 -76 -85 -84 -78 -65 -52 -50 -61 -63 -42 -4 27 36 18 -25 -76 -105 -96 -71 -58 -65 -71 -69 -72 -87 -101 -97 -85 -84 -102 -120 -116 -89
7026h9L2J7qk1j3Jkk0l2k2%J3RjokOP%pJK0L8M0K9J2%qj3j6j7j7j4j3k0k4j0J9L6K5NLJ9K7
$$ -89 -57 -40 -48 -69 -82 -81 -83 -103 -135 -157 -157 -144 -135 -136 -142 -144 -138 -131 -131 -138 -137 -117 -79 -39 -10 2 2 -6 -19 -35 -52 -69 -83 -96 -116 -140 -150 -131 -95 -70 -65 -62 -43 -16
7007a6J7jj6k4k2pJ3K5K6K7L3K5jk2j8RK7K0kj6j6oNRJ0J3J4Lk0l4k5KJ5Kj4j1RK5K1Mj1j7
$$ -16 1 0 -16 -40 -62 -69 -56 -31 -5 22 55 80 79 57 39 48 75 95 93 77 61 55 60 69 79 92 106 109 89 55 30 32 47 49 35 24 33 58 79 83 72 55
6989E5j1mmj6k8l4k7j4n%jloqokPJ6J9Oj5k7k2qPJ8K5K7K8L4L9J8l0o3m9KL3J9rj4JJ0J3K1
$$ 55 44 40 36 20 -8 -42 -69 -83 -88 -88 -89 -92 -98 -106 -112 -114 -107 -91 -72 -66 -81 -108 -130 -138 -131 -113 -88 -61 -33 1 40 58 28 -35 -84 -82 -49 -30 -39 -53 -52 -42 -29 -8
6970hK0nl9m3j3J5Pj2j7rqj6oJ9L8K8Mj3k1k6k3j0RJ4Lj4j8j5j3j2nRJ6Lk7m5l9j3RJ5J0J
$$ -8 12 7 -32 -75 -88 -73 -66 -78 -95 -104 -112 -128 -134 -115 -77 -49 -45 -58 -79 -105 -128 -138 -129 -115 -112 -126 -144 -159 -172 -184 -189 -180 -164 -161 -188 -233 -272 -285 -276 -261 -251 -250
6952b50ml%MQK3M2M7K9%j3JK3K9J9QQJ0QKj0j8k1rQJ6Nj7l2k9j7lLKnqjOJj5k6j8OK6K7J9
$$ -250 -254 -257 -257 -253 -245 -222 -180 -133 -104 -104 -117 -116 -93 -64 -45 -37 -29 -19 -11 -9 -19 -37 -58 -67 -59 -43 -38 -55 -87 -116 -133 -136 -133 -131 -136 -144 -145 -139 -138 -153 -179 -197 -191 -165 -138 -119
6932a19J5K6M2M7K9lk9l5l3l1k2oJ1J4QQJ3Prj5nNKrrk%jLJ4J3rl4m5l9k5rJ1K8L6L4K8K8
$$ -119 -104 -78 -36 11 40 37 8 -27 -60 -91 -113 -119 -108 -94 -86 -78 -65 -58 -67 -82 -87 -82 -80 -89 -98 -100 -100 -101 -98 -84 -71 -80 -114 -159 -198 -223 -232 -221 -193 -157 -123 -95 -67
6913f7K6J9J4J5J9Pk2m2l6j0J5K8K9J3j4m0l5j2jj3k3qK0L1K4J8J5Lj8l1k7j7j1qnoJJ5K8
$$ -67 -41 -22 -8 7 26 33 11 -31 -67 -77 -62 -34 -5 8 -6 -46 -81 -93 -94 -107 -130 -138 -118 -87 -63 -45 -30 -27 -45 -76 -103 -120 -131 -139 -144 -150 -149 -134 -106
6896a06K5J6J9L1K6jl2m7m8m9m6l0kK1L6L5K4Lp%J8K4J7Pjrj9j8pK%rqMJ9K4K1J9K0K3K3K3
$$ -106 -81 -65 -46 -15 11 10 -22 -69 -117 -166 -212 -242 -244 -223 -187 -152 -128 -125 -132 -132 -114 -90 -73 -66 -67 -76 -95 -113 -120 -118 -118 -127 -135 -131 -112 -88 -67 -48 -28 -5 18 41
6878D1J5%j2j3mnk4m1k3J7L8J8j4l1k3nJ0K2K5J3mj5j2j0j7k6k4oK1L9L3jl8n1l7rRJ4J2J2
$$ 41 56 56 44 31 27 22 -2 -43 -66 -49 -11 7 -7 -38 -61 -66 -56 -34 -9 4 0 -15 -27 -37 -54 -80 -104 -110 -89 -50 -17 -18 -56 -107 -144 -153 -144 -130 -118 -106
6861a06J9J8Nj4j5RL6L8J9OJ1K3K1%l1m7l6mK0J2rj9j0jnqLJ1Lj9k6j3NJ8K2J7lk9l7j1K7
$$ -106 -87 -69 -64 -78 -93 -84 -48 -10 9 15 26 49 70 70 39 -8 -44 -48 -28 -16 -25 -44 -54 -55 -60 -68 -65 -54 -51 -70 -96 -109 -104 -86 -64 -47 -50 -79 -116 -127 -100
6843a00M4L1J1NPkj7k3j7q%RJ8J6lk3l2k8j6KJ8J8Lj1jJ9K0QKRJ3KnJ1L0K6Lj6j6j1rnJLm
$$ -100 -56 -25 -14 -9 -2 -4 -21 -44 -61 -69 -69 -60 -42 -26 -29 -52 -84 -112 -128 -126 -108 -90 -87 -98 -99 -80 -60 -52 -50 -41 -28 -26 -31 -20 10 36 39 23 7 -4 -13 -18 -17 -14 -18
6823a8oNJ6Ppj2mnk5l9k2RK5J3oj5j2oJJj8m1m5j7K0L6L4K8K6J5mj8j4njJQK0L0L0J9J1OO
$$ -18 -24 -19 -3 4 -3 -15 -19 -24 -49 -88 -110 -101 -76 -63 -69 -84 -96 -102 -101 -100 -118 -159 -204 -221 -201 -165 -131 -103 -77 -62 -66 -84 -98 -103 -104 -103 -95 -75 -45 -15 4 15 21 27
6804B7KjNJ6J5ok3j6%Kj6k5j3LQPPOJjMKj6l5l4j4PJ9K3K9L1L2K3ml6m7k8J1L2K4O%OJ0jj9
$$ 27 29 28 33 49 64 58 35 19 19 21 5 -20 -33 -30 -22 -15 -8 -2 -1 -2 2 4 -12 -47 -81 -95 -88 -69 -46 -17 14 46 69 65 29 -18 -46 -35 -3 21 27 27 33 43 42 23
6784B3k3rRJ3OOJ6K0Rk%OQQJ2Qrk8k4jJ5J5RJqj9j9j3j5j7j3lpl3n7n7m0j6J1L6M1K6QNMj1
$$ 23 0 -9 0 13 19 25 41 61 70 68 68 74 82 90 102 110 101 73 49 48 63 78 87 88 80 61 42 29 14 -3 -16 -19 -26 -59 -116 -173 -213 -229 -218 -182 -141 -115 -107 -102 -98 -109
6764a09k5j1K5M8L7J6RJ0Kj1j5nLJJRJ3Kj6k0j3rj7k1j3NK1L0L0J6j1l5l8k3kJ4K1J7jk1k7
$$ -109 -134 -145 -120 -72 -35 -19 -10 0 2 -9 -24 -29 -26 -25 -24 -15 -2 0 -16 -36 -49 -58 -75 -96 -109 -104 -83 -53 -23 -7 -18 -53 -91 -114 -116 -102 -81 -64 -65 -86 -113
6747a13j6LJ7K8L9L9K5J0OOjj5k5j6JJ2J0nj8k3j6lLNORRnl6o7p0l7J2L5K2oj6oNKqqPK5L5
$$ -113 -129 -126 -109 -81 -42 -3 22 32 38 44 43 28 3 -13 -12 0 10 5 -13 -36 -52 -55 -52 -47 -41 -32 -23 -28 -64 -131 -201 -238 -226 -191 -169 -175 -191 -197 -192 -190 -198 -206 -199 -174 -139
6727a39L4K5RmkJ5L0K0pl0l1j6kPQlk4l5k1PK4K3J6J0MLJ1K2J6%jJ7K3Kk6l4k5j6j2JK2K6
$$ -139 -105 -80 -71 -75 -77 -62 -32 -12 -19 -49 -80 -96 -98 -91 -83 -86 -110 -145 -166 -159 -135 -112 -96 -86 -82 -79 -68 -46 -30 -30 -31 -14 9 11 -15 -49 -74 -90 -102 -101 -79 -53
6709e3Qj6k3j3JNpk1j3J3L4K5%j0LJ5J6J1jk4m6m0nK1J8%MK3L4K4Jj7k8k4j4rj3j3MK2J6r
$$ -53 -45 -61 -84 -97 -96 -91 -98 -119 -132 -119 -85 -60 -60 -70 -67 -52 -36 -25 -26 -50 -96 -136 -141 -120 -102 -102 -98 -75 -41 -17 -16 -33 -61 -85 -99 -108 -121 -134 -130 -108 -92 -101
6691a01k5j5OK0K2J7MppMOoj6qNJk0l2k6j2lJMOPJ2J9K1J5Moj3j6j2JJ2J2jj5j5mONMJ4K5
$$ -101 -126 -141 -135 -115 -93 -76 -72 -79 -86 -82 -76 -82 -98 -106 -101 -100 -120 -152 -178 -190 -193 -192 -188 -182 -175 -163 -144 -123 -108 -104 -110 -123 -139 -151 -150 -138 -126 -127 -142 -157 -161 -155 -150 -146 -132 -107
6671a07J3j7l1j4J5J9Kj1nQJ4J7J3jk0j8MK8K7J1j1k9l5k4JJ6J1MM%j2j2J0L0K4QRK2J4j1
$$ -107 -94 -111 -142 -156 -141 -122 -120 -131 -136 -128 -114 -97 -84 -85 -105 -123 -119 -91 -64 -53 -64 -93 -128 -152 -151 -135 -124 -120 -116 -116 -128 -140 -130 -100 -76 -68 -59 -37 -23 -34
6654c4k3rLjlMMrrJ6L8K9Mpkjj4k9k8j5lkj5k4j2J3K0nl8m6l0j4jJ9M2N2N1M9M5L5J5lj6l0
$$ -34 -57 -66 -63 -64 -67 -63 -59 -68 -77 -61 -23 6 10 3 1 0 -14 -43 -71 -86 -89 -91 -106 -130 -142 -129 -109 -114 -152 -198 -228 -242 -243 -224 -182 -130 -79 -30 15 50 65 62 46 16
6634A6l7k8jK2K7K3K7K6J6pk8l6k6mJ6J8Jj7j9qJ2J9Rj9m1m4l3k5k2j3kKk%J1J8J6J8K4L0
$$ 16 -21 -49 -50 -28 -1 22 49 75 91 84 56 20 -6 -10 6 24 25 8 -11 -19 -7 12 21 2 -39 -83 -116 -141 -163 -176 -178 -176 -178 -178 -167 -149 -133 -115 -91 -61
6617f1K9K6K5K1Nrj7k2k6j9jQJqjJ2Oj5k1lJ6J7OMQPmj2j3j3k1k8j7QK9L1K1J5J6J2OkppK
$$ -61 -32 -6 19 40 45 36 19 -3 -29 -48 -49 -41 -40 -48 -49 -37 -31 -46 -67 -70 -54 -37 -31 -27 -19 -12 -16 -28 -41 -54 -75 -103 -120 -112 -83 -52 -31 -16 0 12 18 16 9 2 4
6598DJ6K7K0Olpj5k4j9%J5J4OM%j0k0j8k3l3l7j5K0M3L9J9jj3j5oNRJ5K3K0Lj9l1m0n0m5j9
$$ 4 20 47 67 73 70 63 48 24 5 5 20 34 40 44 44 34 14 -4 -27 -60 -97 -112 -92 -49 -10 9 8 -5 -20 -26 -21 -12 3 26 46 49 30 -1 -41 -91 -136 -155
6579a55OOj2j7JJ7K1K4L1L8L6L5L6K3Jj3j3j4k9l8k9j0LJ2J9J7ol1l9k3lLjooNK2L1K5J9K3
$$ -155 -149 -143 -155 -172 -171 -154 -133 -109 -78 -40 -4 31 67 90 91 78 65 51 22 -16 -45 -55 -52 -40 -21 -4 -10 -41 -80 -103 -106 -103 -104 -110 -116 -111 -89 -58 -33 -14 9
6562IL3K9J2nj6j9j9j3k%mj0k1l0k9j1J7K7J2rj6j4j3j0MK2K7J3%kLOJ0J7K6L2K3Pj0j9k1
$$ 9 42 71 83 78 62 43 24 11 9 9 5 -5 -26 -56 -85 -96 -79 -52 -40 -49 -65 -79 -92 -102 -98 -76 -49 -36 -36 -38 -35 -29 -19 -2 24 56 79 86 76 57 36
6544C6k4l0l3j9JOpj8nK3M0L0J1pj6j8qRK1J6OLJ0J3Jj5j6NK5J9j6m6m5j8lj2k1j1RJ5J0J2
$$ 36 12 -18 -51 -70 -69 -63 -70 -88 -93 -70 -30 0 11 4 -12 -30 -38 -29 -8 8 14 17 27 40 41 26 10 15 40 59 43 -3 -48 -66 -69 -81 -102 -113 -104 -89 -79 -67
6526f7K4L3K5Rpj9j7QL1K8Jk1j6pj2k1j2J0K0Rrk2k9k7j1J9L9L6J1pj2nlj9m1m0pL3M6K6K
$$ -67 -43 -10 15 24 17 -2 -19 -11 20 48 49 28 12 5 -7 -28 -40 -30 -10 -1 -10 -32 -61 -88 -99 -80 -41 -5 6 -1 -13 -18 -21 -40 -81 -121 -128 -95 -49 -23 -21
6508b1LJ8K8J7JljKkj0j9k4k2rNQKKJ2K2J8QOJ1Rqk5k6j5j1rkRJ2mk5l7k8nJ8K7K8K9L1K0
$$ -21 -18 0 28 45 46 43 42 44 42 32 13 -11 -33 -42 -37 -29 -27 -25 -13 9 27 35 41 52 61 53 28 2 -13 -24 -33 -35 -26 -14 -18 -43 -80 -108 -113 -95 -68 -40 -11 20 40
6488D0rl5m5l6k8k5k4j9j6pJ3L6M7L8K7K4K3Pj9l3k2NK2K0Pmqrj2j7j6oQJ9K0J1j1l3l9j8
$$ 40 31 -4 -49 -85 -113 -138 -162 -181 -197 -204 -191 -155 -108 -70 -43 -19 4 11 -8 -41 -63 -58 -36 -16 -9 -13 -21 -30 -42 -59 -75 -81 -73 -54 -34 -23 -34 -67 -106 -124
6471a24J7L7K5%j0%J7K2J1mj9k6j6LJ6Qj1j7oJrk2k0kJ7K8L7M3M0K7J0lj4k2k6l0m5o0n6k9
$$ -124 -107 -70 -45 -45 -55 -55 -38 -16 -5 -9 -28 -54 -70 -67 -51 -43 -54 -71 -77 -76 -85 -107 -127 -129 -112 -84 -47 -4 36 63 73 70 56 34 8 -22 -67 -127 -183 -212
6454b12LJ7J5J8K7K9J9NKLMOJ4K3K3J3PMoj8k7j9nPJ9L3M1K6Jj3pLLkjMLlj1j6j4rnj4l1l7
$$ -212 -209 -192 -177 -159 -132 -103 -84 -79 -77 -74 -70 -64 -50 -27 -4 9 16 20 14 -4 -31 -50 -55 -48 -29 4 45 71 72 59 52 55 58 56 55 59 62 59 48 32 18 9 4 -10 -41 -78
6434g8k1%J0J0J3K2K3J2rk8l8k9rQJ1J0J3Rj3l0k0J3K9J5%MJ5J1MOJ4Qlooj7k6rK5M3L2J1
$$ -78 -99 -99 -89 -79 -66 -44 -21 -9 -18 -46 -84 -113 -122 -114 -103 -93 -80 -71 -84 -114 -134 -121 -92 -77 -77 -73 -58 -47 -43 -37 -23 -15 -18 -24 -30 -47 -73 -82 -57 -14 18 29
6416B9kj0j4qPJ5jk3l0k3j7j7j1JJ0Pjpj4k0j9pNRNLjqj7rJ6L9L8J5jJJ0OonJ5K9K1MjJ0K0
$$ 29 27 17 3 -5 2 17 16 -7 -37 -60 -77 -94 -105 -104 -94 -87 -88 -95 -109 -129 -148 -155 -150 -141 -136 -133 -134 -142 -159 -168 -152 -113 -75 -60 -61 -60 -50 -44 -50 -55 -40 -11 10 14 13 23 43
6395D3K0J7J5Qnk3l2l0k0rlnj2j2nnj7k9j7MPj0k0lJ8J7lqPJ6Oj0pJ0J7Nj3k0j3KNnj8j5J0
$$ 43 63 80 95 103 98 75 43 13 -7 -16 -19 -24 -36 -48 -53 -58 -75 -104 -121 -117 -110 -120 -140 -143 -125 -108 -111 -119 -112 -96 -90 -100 -107 -97 -80 -75 -88 -108 -121 -119 -114 -119 -137 -152 -142
6376a42M0M9L0LrKJ6J5Lpqj2j8j4PK3Pl0m3k4MJ1QJ0Rpl1l4k0lPJ6K5K3J4MkonOJ7Rj0j5k
$$ -142 -102 -53 -23 -20 -29 -27 -11 4 7 0 -8 -20 -38 -52 -45 -22 -15 -45 -88 -112 -108 -97 -89 -79 -70 -77 -108 -142 -162 -165 -158 -142 -117 -94 -80 -76 -78 -84 -89 -83 -66 -57 -67 -82 -84
6356h4Ook2j7PK8L6L7L2K1Qknj2k2k4j7%J6K0J4RJ2J8J7jk3l2k4j1JN%qj9k3k1qJ1K5K2Lr
$$ -84 -78 -84 -106 -123 -116 -88 -52 -15 17 38 46 44 39 27 5 -19 -36 -36 -20 0 14 23 35 53 70 69 46 14 -10 -21 -20 -15 -15 -23 -42 -65 -86 -94 -83 -58 -36 -33 -42
6337d2oLJ1J6J9J3jqNK8L0J2j3k5k2qLnl1n1l5LK5J0j3j5KJ7J7J8K8L4K7Oj1j5mPJ2J2J1J1
$$ -42 -48 -45 -34 -18 1 14 13 5 10 38 68 80 67 42 20 12 15 10 -21 -72 -107 -104 -79 -69 -82 -97 -95 -78 -61 -43 -15 19 46 52 41 26 22 29 41 53 64 75
6319G5Oj0l0m1l2oK0K0pm1m3j2J7J9LkPJ1RJ2K5L0K0%oLJ1Mj4k2j2J0K1J5kj3k0k4k2nK2L7
$$ 75 81 71 41 0 -32 -38 -18 2 -5 -46 -89 -101 -84 -65 -62 -64 -57 -46 -37 -25 0 30 50 50 44 47 58 62 48 26 14 24 45 60 58 45 25 1 -21 -26 -4 33
6301C3L2J3kpj1j9l1m5n5m4j6J2J5MNK2L2J4j4k4qJ0J2LrrKJ9K6K0J5J5J4ml1m6m4l5k3nJ8
$$ 33 65 78 76 69 58 39 8 -37 -92 -136 -152 -140 -125 -121 -116 -94 -62 -48 -62 -86 -94 -84 -72 -69 -78 -87 -85 -66 -40 -20 -5 10 24 20 -11 -57 -101 -136 -159 -164 -146
6283a46L1K5J4RQORJ5K0J4PQJ3J2POJ3J7J2KkLJ3J7J3jj3j7j4j4j5j4j5j5j6j5j6k1k6k7k5
$$ -146 -115 -90 -76 -67 -59 -53 -44 -29 -9 5 12 20 33 45 52 58 71 88 100 102 100 103 116 133 146 145 132 115 101 87 72 58 43 28 12 -3 -19 -40 -66 -93 -118
6266a18k3j5%J7J6lk3k9k6j7kK2M1N0N1N2M4K4j0l0k3j0pj4j9j9j9k5k4qJ9L9M0K3LqkRQj0
$$ -118 -141 -156 -156 -139 -123 -126 -149 -178 -204 -221 -223 -201 -160 -110 -59 -7 37 61 51 21 -2 -12 -19 -33 -52 -71 -90 -115 -139 -147 -128 -89 -49 -26 -23 -31 -33 -24 -16 -26
6248b6k9k6kJ8J6Knmqj6k3k4k2k2k2k1k3j9lK4L8L6K5K0K0K1K5K2Lk8n0m2rJ9K7K0Qkj2k2
$$ -26 -55 -81 -83 -65 -49 -47 -52 -56 -64 -80 -103 -127 -149 -171 -193 -214 -237 -256 -259 -235 -197 -161 -136 -116 -96 -75 -50 -28 -25 -53 -103 -145 -154 -135 -108 -88 -80 -82 -94 -116
6231a16k9k3jK2K5QnJJ2Rkomj2k0mL3M4J4k5l5k5k1k2nK7M7L9J7mk7n0n5k8RL2L5L6M4M8M0
$$ -116 -145 -168 -169 -147 -122 -114 -119 -118 -106 -97 -99 -105 -109 -121 -141 -145 -112 -68 -54 -79 -114 -139 -160 -182 -187 -160 -113 -74 -57 -61 -88 -138 -193 -221 -212 -180 -145 -109 -65 -17 23
6213B3L1K2J3mk6l6k7j0Lnk4l3k5j0MQP%qlK2M8M4J6j4j9j6k0k8k2KK5L1K0QkojPJ3J1OKl
$$ 23 54 76 89 85 59 23 -4 -14 -11 -16 -40 -73 -98 -108 -104 -96 -89 -89 -97 -100 -78 -30 14 30 16 -3 -19 -39 -67 -89 -87 -62 -31 -11 -3 -5 -11 -12 -5 8 19 25 27 24
6194B4j4k5k7j9j5j5j2LK3L5L5K2Qoj2rljnj3j8j4KK0K8K4K3K1Ok6n0m3j3Jj4k9j5RJ6Kj4
$$ 24 10 -15 -42 -61 -76 -91 -103 -100 -77 -42 -7 15 23 17 5 -4 -7 -8 -13 -26 -44 -58 -56 -36 -8 16 39 60 66 40 -10 -53 -66 -65 -79 -108 -123 -114 -98 -96 -110
6176a10j8rQL5N4M8K3kj3j3rmjj1k9l3j5NOoqLJ3J1%mJMLMJ5L3L5J9%LK2K6Kk6k7oRMj0k0
$$ -110 -128 -137 -129 -94 -40 8 31 29 16 3 -6 -10 -11 -22 -51 -84 -99 -94 -88 -94 -102 -99 -86 -75 -75 -79 -78 -74 -71 -67 -52 -19 16 35 35 38 60 86 88 62 35 29 38 42 32 12
6156A2k4k6k3j8j5j4pRJ8J4MLJ1J3ol2m1k6nPJ2K8M9N5K9j0l6m2k8j1kpj8j5PK9K9RnolMJ7
$$ 12 -12 -38 -61 -79 -94 -108 -115 -106 -88 -74 -70 -67 -56 -43 -49 -81 -122 -148 -153 -146 -134 -106 -57 -2 27 17 -19 -61 -89 -100 -102 -109 -127 -142 -135 -106 -77 -68 -73 -79 -82 -78 -61
6138f1K9K2KoPJ6Mk0l5l2k1j0%J1J4J3Lj3k5j7J3L8L3J1NJ7K8K4J1M%k%J4K9L1J0j9m0m5l7
$$ -61 -32 -10 -8 -14 -7 9 13 -7 -42 -74 -95 -105 -105 -94 -80 -67 -64 -77 -102 -119 -106 -68 -35 -24 -19 -2 26 50 61 65 65 63 63 77 106 137 147 128 88 43 6
6120Fk8k4j7%J8K7K3J9Rql0l8k0MJ2Lqp%%j9m4n5m2j9olNK8N2N3L6J6Lj3l2m1l0qONMPNnj6
$$ 6 -22 -46 -63 -63 -45 -18 5 24 33 25 -5 -43 -63 -59 -47 -44 -52 -59 -59 -59 -78 -122 -177 -219 -238 -244 -247 -242 -214 -162 -109 -73 -57 -54 -67 -99 -140 -170 -178 -172 -167 -163 -156 -151 -156 -172
6100a72j7j5k1k3%L9N9M0Oj1kJ1J5J0%j6l4l8k3nPJ1J1QJ%QK0K4J8Onrprj4j4KJ8J9NjJ6L6
$$ -172 -189 -204 -225 -248 -248 -209 -150 -110 -104 -115 -117 -106 -91 -81 -81 -97 -131 -169 -192 -197 -190 -179 -168 -160 -159 -159 -151 -131 -107 -89 -83 -88 -97 -104 -113 -127 -141 -139 -121 -102 -97 -98 -82 -46
6081d6L1Oj5j4qj3k3k3rKLnmLOkj1pOJ4J1JKJ4K2J3qk2j8lJ2J9K4K2Qj1k7k5qJ1K1K0Qrj7
$$ -46 -15 -9 -24 -38 -46 -59 -82 -105 -114 -112 -109 -114 -118 -115 -109 -111 -122 -129 -123 -109 -98 -97 -95 -81 -59 -46 -54 -76 -94 -97 -85 -66 -42 -20 -12 -23 -50 -75 -83 -72 -51 -31 -23 -32 -49
6061d9j9j9k1j9j6j3j1KJ7K0%j9j4J0L0L6M1L8J9jJJ9K3%k7k8j0RK0L0K8J1j5l0k3kJ7J1k0
$$ -49 -68 -87 -108 -127 -143 -156 -167 -165 -148 -128 -128 -147 -161 -151 -121 -85 -44 -6 13 12 13 32 55 55 28 0 -10 -1 19 49 77 88 73 43 20 18 35 46 26
6044B6m7m4j1J6K0K0L8N4M3K1J5K0Rk1l7k4okj0k1l4m5m3k3JK0L1L3K1Jrmpk8n1m5j8LJ2J8
$$ 26 -21 -65 -76 -60 -40 -20 18 72 115 136 151 171 180 159 122 98 92 90 80 59 25 -20 -63 -86 -85 -65 -34 -1 20 21 12 8 1 -27 -78 -123 -141 -138 -126 -108
6027a08K3K1J2OJ4K5K3Pj4k0j5nJQK4M0K9qm3m1j2J8K7K7K3J6Qjj0k2l2k7rJ1J5J3RJ0J2O
$$ -108 -85 -64 -52 -46 -32 -7 16 23 9 -11 -26 -31 -30 -22 2 42 71 63 20 -21 -33 -15 12 39 62 78 86 85 75 53 21 -6 -15 -4 11 24 33 43 55 61
6010F1mj6l0m3m8k6QL0K1LJK1K8Pk4m1l5k9l1l3j9PK4K6K1J5J0NKMNJqj5j5j4j4j8j9j1OK5
$$ 61 57 41 11 -32 -80 -106 -98 -68 -47 -44 -43 -22 6 13 -11 -52 -87 -116 -147 -180 -199 -192 -168 -142 -121 -106 -96 -91 -89 -85 -80 -79 -87 -102 -117 -131 -145 -163 -182 -193 -187 -162
5992a62K5Jk7k8OM4N1K7J%J2J2pl3m4k9lJ3PpoJ8M1M3K6J5J4J1nk1k6j3kmj4j6lJ8K5J4qj9
$$ -162 -137 -136 -163 -191 -185 -141 -90 -63 -62 -62 -50 -38 -45 -78 -122 -151 -154 -141 -134 -141 -147 -129 -88 -45 -19 -4 10 21 16 -5 -31 -44 -46 -50 -64 -80 -83 -65 -40 -26 -34 -53
5973e3j1NJ4Qnj6j4oPJ9K8K7J5qk9m3m4l1rJ8L3K8Pqj0ljk%PQKrj1j2j7k0j1J1K8K7J6PNQ
$$ -53 -64 -59 -45 -37 -42 -58 -72 -78 -71 -52 -24 3 18 10 -19 -62 -106 -137 -146 -128 -95 -67 -60 -68 -78 -81 -82 -84 -84 -77 -69 -67 -76 -87 -99 -116 -136 -147 -136 -108 -81 -65 -58 -53 -45
5954d5J5J7Pj1j4lLj4l6l9k4j2oMK2L7M1L8K6NqJJ6Rj6k4mJ9L1L2K6J4J2M0Q2J03J11J49K16
$$ -45 -30 -13 -6 -17 -31 -34 -31 -45 -81 -120 -144 -156 -162 -158 -136 -99 -58 -20 6 11 3 4 20 29 13 -11 -15 4 35 67 93 107 119 159 241 344 455 604 820
5937H20K76L56N41P76P97M00k55p54q48o53m31k92j98j18p6p0o2m2l8m7m4k2mKQJ9K0Rjnj4
$$ 820 1096 1452 1993 2769 3566 3966 3711 2957 2109 1456 1025 733 535 417 341 271 209 167 129 82 38 16 12 14 22 41 61 70 69 64 50
5924E0k6k6j3mkkkoj5j4qnqj0j0rlK2M5L6lk9j2J9L0J4mk0l9m7k4J5L8K7PJPJj1j2PK9K4%
$$ 50 24 -2 -15 -19 -21 -23 -25 -31 -46 -60 -68 -73 -81 -91 -101 -110 -113 -91 -46 -10 -13 -42 -54 -35 -5 9 5 -15 -54 -101 -125 -110 -72 -45 -38 -37 -30 -29 -40 -52 -45 -16 8 8
5904Hk4l0j1J7L9L9J6j3j6NJ9km2n9m6k8k4j8OL7M9M0K2Mj5k7k4j3j1j9k4rK0M2M8L8K1Rp
$$ 8 -16 -46 -57 -40 -1 38 54 41 25 30 49 47 5 -54 -100 -128 -152 -170 -164 -127 -78 -38 -16 -12 -27 -54 -78 -91 -102 -121 -145 -154 -134 -92 -44 -6 15 24 17
5888A7k7m5m4j4K0L5K3MlJQJ0OLJ0K6L1J1k4m1k4NJ9J5RJ1J1Lrj7j7j4lRJ7J2QJ4J8J2MJ2
$$ 17 -10 -55 -99 -113 -93 -58 -35 -31 -34 -33 -25 -15 -9 -6 4 30 61 72 48 7 -17 -12 7 22 31 42 53 56 47 30 13 -1 -4 5 22 34 42 56 74 86 90 102
5869A02J9%m4p1n3j2K1L2L1K4RopMQNkoj4k2k3k3l2l7j8K1M3K7mj6qj1k9l4j5MJj0lJ6J8m
$$ 102 121 121 77 6 -47 -59 -38 -6 25 49 58 52 45 49 57 62 60 54 40 18 -5 -28 -60 -97 -115 -94 -51 -24 -28 -44 -52 -63 -92 -126 -141 -137 -136 -146 -149 -133 -115 -119
5851a19k5j5J1K4J3jKRLj3j8mJ0Kk0l3j9J0L2M0L3K0RQJ0Pok1k3oJ3K1J8J1jj5k5j4OPj6k7
$$ -119 -144 -159 -148 -124 -111 -112 -110 -101 -98 -111 -129 -133 -123 -121 -141 -174 -193 -183 -151 -111 -78 -58 -49 -41 -31 -24 -30 -51 -74 -80 -67 -46 -28 -17 -18 -33 -58 -72 -66 -59 -75 -102
5833a02jL2K8j2l9k5OJ5J0QJ1MqlJ5K2J0pj0oqqn%LJ0K0K3Pj7l3l4j8OK4K7J6OMNMJjnj5j9
$$ -102 -103 -71 -43 -55 -94 -119 -113 -98 -88 -80 -69 -65 -73 -76 -61 -39 -29 -36 -46 -52 -60 -68 -73 -73 -70 -60 -40 -17 -10 -27 -60 -94 -112 -106 -82 -55 -39 -33 -29 -24 -20 -19 -20 -25 -40 -59
5813e9j1PJ8J3%j6k2j0J7L6L2J4NJ7L8M0J6k2m9n2l3j7pKJ5K5J8Lqroj0j0oLJ0J5J3QKJJ3
$$ -59 -70 -63 -45 -32 -32 -48 -70 -80 -63 -27 5 19 24 41 79 119 135 113 64 12 -21 -38 -45 -43 -28 -3 15 18 10 1 -5 -15 -25 -31 -28 -18 -3 10 18 20 21 34
5795C4K5K1kl0m3l4j6nj2k9l2j4J1K1J1JMK0L6L7K5Oj0j5j0%Mkj4k3k4k3k5k0nPMplJ6K8J6
$$ 34 59 80 78 48 5 -29 -45 -50 -62 -91 -123 -137 -126 -105 -94 -93 -89 -69 -33 4 29 35 25 10 0 0 4 2 -12 -35 -59 -82 -107 -127 -132 -125 -121 -128 -131 -115 -87 -71
5777g1loMMj0k4k3j6rkQJ9K9L2K4J1%jLMMJ7K9K3ql7l8k5j3kJ4K7J7rk8k8j7oPJ5Oj9l4j8
$$ -71 -74 -80 -76 -72 -82 -106 -129 -145 -154 -156 -148 -129 -100 -68 -44 -33 -33 -34 -31 -27 -23 -6 23 46 38 1 -37 -62 -75 -77 -63 -36 -19 -28 -56 -84 -101 -107 -100 -85 -79 -98 -132 -150
5757a50ORj4k5nK8L6J6qj2jJ0J8K0J5Jj1qkJ%jkj1k0j3MJ2OQK9M8L7J3llkqj4j7k5l1k4oN
$$ -150 -144 -135 -149 -174 -179 -151 -115 -99 -107 -119 -120 -110 -92 -72 -57 -56 -67 -75 -77 -76 -76 -77 -79 -90 -110 -123 -119 -107 -101 -93 -64 -16 21 34 31 28 26 18 4 -13 -38 -69 -93 -99 -94
5738i4M%LQQJ2K0K3J9J9J8Nj8l8m3l6k6j0J2J8Lj0RM3N8M3K3J8K5L3L9M2L5J6j0l0m1l3qJ5
$$ -94 -90 -90 -87 -79 -71 -59 -39 -16 3 22 40 45 27 -11 -54 -90 -116 -126 -114 -96 -93 -103 -94 -51 7 50 73 91 116 149 188 230 265 281 271 241 200 167 159 174
5721A74J9%j6k2k3l2m2m2l3k4j5rrj0jJ9L0K3Ppk0l9m6k4J7M6M4K5J4J6J7Qj2k9k9j6kMOJ4
$$ 174 193 193 177 155 132 100 58 16 -17 -41 -56 -65 -74 -84 -85 -66 -36 -13 -6 -13 -33 -72 -118 -142 -125 -79 -35 -10 4 20 37 45 33 4 -25 -41 -43 -39 -33 -19
5703a9K1K5K0J3Jj7k8k7k8m0m8k9PK7J3mQL6M1J7qj9k2k5l0k9k7k2lK9N4N1K5mj7qQJ7J0q
$$ -19 2 27 47 60 61 44 16 -11 -39 -79 -127 -156 -149 -122 -109 -113 -105 -69 -28 -11 -19 -38 -60 -85 -115 -144 -171 -193 -196 -167 -113 -62 -37 -41 -58 -66 -58 -41 -31 -39
5686c9j7j0QJ9J5nk8l9k9qOQJ5L2M8M4L0K1K0J3mk1k4j2LJ8K2J5MOK1L0K2Mpj0j6j6nJ2J3
$$ -39 -56 -66 -58 -39 -24 -29 -57 -96 -125 -133 -127 -119 -104 -72 -24 20 50 71 91 104 100 79 55 43 46 64 86 101 105 111 132 162 184 188 181 171 155 139 134 146 159
5668A59ok3k4k5m2o7p5m8pK5L7L0Rj3k3j2MJ0RRJ4Ok4n3n6k7J0K8K4J0%llmrj1j3j4j6j3N
$$ 159 153 130 106 81 39 -28 -103 -151 -158 -133 -96 -66 -57 -70 -93 -105 -101 -91 -82 -73 -59 -53 -77 -130 -186 -213 -203 -175 -151 -141 -141 -144 -147 -151 -160 -171 -184 -198 -214 -227 -222
5650b22K7L7K1%qNJ4Pj0j7%L0N8O9N3J7k3l9l2j7qqoJNpk8m3l7j1K0M1M0K4P%ql0n8o3l2J5
$$ -222 -195 -158 -137 -137 -145 -140 -126 -119 -129 -146 -146 -116 -58 11 64 81 58 19 -13 -30 -38 -46 -52 -51 -46 -53 -81 -124 -161 -172 -152 -111 -71 -47 -40 -40 -48 -78 -136 -199 -231 -216
5632b16L9L6K7J9Lk2l1qK2L1J7MQJ6K1K5L1K8Rj6k9k1pMLmj1j0j0j6k3j4J1L5L7K0Nnj5k1
$$ -216 -177 -141 -114 -95 -92 -114 -145 -153 -131 -100 -83 -79 -71 -55 -34 -9 22 50 59 43 14 -7 -14 -10 -7 -11 -22 -32 -42 -58 -81 -95 -84 -49 -12 8 13 8 -7 -28
5615b8j7nJkkJ3K8K4%k9m3l6j6%jj2j5%K3L2K6J1pk1k4j0J0J9J6J5K1K2J2NKLnj0pPRlj7k4
$$ -28 -45 -50 -49 -51 -53 -40 -12 12 12 -17 -60 -96 -112 -112 -113 -125 -140 -140 -117 -85 -59 -48 -55 -76 -100 -110 -100 -81 -65 -50 -29 -7 5 10 12 15 10 0 -7 0 9 6 -11 -35
5596c5k0j4j4j4j5j2pljPK3L4L2J3oj4rkKmj9l2k4OL9M7K7lj4pLNMMMpk5k7j0RJ4KolOJ8L5
$$ -35 -55 -69 -83 -97 -112 -124 -131 -134 -135 -128 -105 -71 -39 -26 -32 -46 -55 -57 -55 -59 -78 -110 -134 -128 -89 -42 -15 -18 -32 -39 -36 -31 -27 -23 -19 -26 -51 -78 -88 -79 -65 -63 -69 -72 -66 -48 -13
5575a3M3L8J5mj0rj4k2k5k1j5rjNJ2K1K9K4Kj9k3pQJ6J3jk5m5n3l7j1J3K0Lk3l3j3K3M1L5
$$ -13 30 68 83 79 69 60 46 24 -1 -22 -37 -46 -47 -42 -30 -9 20 44 46 27 4 -3 5 21 34 33 8 -37 -90 -127 -138 -125 -105 -102 -125 -158 -171 -148 -107 -72
5558g2K4K0J8OpkJ7L3K3rl6m6l7j9%K1L4L3J8%j2k0k7k6j0NNqpJ6L9M1K6J1Moj7j8mJ0Prk1
$$ -72 -48 -28 -10 -4 -11 -13 4 37 60 51 15 -31 -68 -87 -87 -66 -32 1 19 19 7 -13 -40 -66 -76 -71 -66 -74 -81 -65 -26 15 41 52 56 50 33 15 11 21 28 19 -2
5539bj6nlj0j2jJ0Poj2qlpnKJ1Nj3k4k2mK1L9M1K0qk6j9LK0J8Mmkjj1k1j8lJ1J2J0QLnnPJ3
$$ -2 -18 -23 -26 -36 -48 -49 -39 -32 -38 -50 -58 -61 -68 -73 -71 -60 -55 -68 -92 -114 -118 -97 -58 -17 3 -5 -31 -50 -47 -27 -9 -5 -9 -11 -12 -23 -44 -62 -65 -54 -42 -32 -24 -21 -26 -31 -24 -11
5519a1mk8l4j7j%m%Nlj7k5j5jPJ2J7K2J7%j7j8KK7L5K7J3%j9m1n0l4qLoj7j5oLJ3K6L4K5J3
$$ -11 -15 -43 -77 -94 -95 -95 -99 -99 -94 -97 -114 -139 -154 -155 -148 -136 -119 -97 -80 -80 -97 -115 -113 -86 -51 -24 -11 -11 -30 -71 -121 -155 -163 -160 -166 -183 -198 -204 -201 -188 -162 -128 -103 -90
5500i0J0J5J2mj7k0k0j9qJ3K8J8lj8j7j1KK7N6O1M1Nk2l5l5k4r%KMOlk1k6pJ6J3rk1j3%%j
$$ -90 -80 -65 -53 -57 -74 -94 -114 -133 -141 -128 -100 -82 -85 -103 -120 -131 -129 -102 -46 15 56 61 39 4 -31 -55 -64 -64 -62 -58 -52 -55 -76 -102 -109 -93 -80 -89 -110 -123 -123 -123 -124
5481a24OJ1N%OJ8J8Kj6j6lJ2J6Mj9l7l8k7qRK6L3K5Nj0pJ1K6K9K4J7RNKK%oj2j1jOOjnJJ2
$$ -124 -118 -107 -102 -102 -96 -78 -60 -58 -74 -90 -93 -81 -65 -61 -80 -117 -155 -182 -190 -181 -155 -122 -97 -92 -102 -109 -98 -72 -43 -19 -2 7 12 14 16 16 10 -2 -13 -14 -8 -2 -3 -8 -7 5
5461EK2K3J7J2J1J0Llmrk7m9n1k9%J0RNJKQK9M6M7L1J3kj8l0l1k3k1k6l1k7k4k3j2J4L8L9
$$ 5 27 50 67 79 90 100 103 100 96 87 60 11 -40 -69 -69 -59 -50 -45 -44 -42 -34 -5 41 88 119 132 130 112 82 51 28 7 -19 -50 -77 -101 -124 -136 -122 -84 -45
5443d5K3O%mmKRQqj9j5j0j8l5m1k9j6j3qJ0L4M2L2J6QJmnMJ1J3J4K0J7Kj3j1JKj2k6k9k6j9
$$ -45 -22 -16 -16 -20 -24 -22 -13 -5 -13 -32 -47 -57 -75 -110 -151 -180 -196 -209 -217 -207 -173 -131 -99 -83 -75 -74 -78 -83 -79 -68 -55 -41 -21 -4 -2 -15 -26 -25 -23 -35 -61 -90 -116 -135
5424a35jK8N2N5M5L7K8Ml1o2o7n0j9QK2K8K6J7RPJ6K2J5kj8k5k5k6k3k3l2m5m4k0J4M1N1M3
$$ -135 -136 -108 -56 -1 44 81 109 113 82 20 -47 -97 -116 -108 -86 -58 -32 -15 -6 1 17 39 54 52 34 9 -16 -42 -65 -88 -120 -165 -209 -229 -215 -174 -123 -80
5408h0K1Kmoj9l8m0j6PQjLJ5J8J2J4K6K8J7LJOPKmj3k1k1j2k%kml%LNJrj8j5JJ4J1kj0olj3
$$ -80 -59 -57 -61 -67 -86 -124 -164 -180 -173 -165 -166 -163 -148 -130 -118 -104 -78 -50 -33 -30 -29 -23 -16 -14 -18 -31 -52 -73 -85 -87 -87 -89 -93 -96 -96 -93 -88 -87 -96 -114 -129 -128 -114 -103 -105 -115 -121 -124 -137
5386a37k5k1jJ7J5Kj0j1nLMmj4mK5M6L2OJ0M2O4M9J0k1k8k5k3k8k9j8J0M2N0K5j3m3n3m6l1
$$ -137 -162 -183 -184 -167 -152 -150 -160 -171 -176 -173 -169 -173 -187 -191 -166 -120 -88 -82 -72 -30 34 83 93 72 44 19 -4 -32 -61 -79 -69 -27 23 48 35 -8 -61 -107 -138
5370a38j4kLPJ9L4L8L0J6NKQJ1Nj3k7l3k9k3rJ3K9K8J9Rmk9n0m4j4QQkLK7M2L5J3nj3j2rp
$$ -138 -152 -154 -151 -144 -125 -91 -53 -23 -7 -2 0 8 19 24 11 -16 -49 -78 -101 -110 -97 -68 -40 -21 -12 -16 -45 -95 -139 -153 -145 -137 -139 -136 -109 -67 -32 -19 -24 -37 -49 -58 -65
5351f5plQK0K1Nj7k9k2jJ4K3K2J9J6J7K0J6Noj1j7k8l2j2K1K7%k9k5jQqj8pPMpj0pomQK3K6
$$ -65 -72 -75 -67 -47 -26 -21 -38 -67 -89 -90 -76 -53 -31 -12 4 21 41 57 62 56 45 28 0 -32 -44 -23 4 4 -25 -50 -51 -43 -51 -69 -76 -69 -65 -72 -82 -89 -95 -99 -91 -68 -42
5331d2J8J9K3J7ok1j3klj4j7pKnj6k2j7jJ7K8K4Qoj2j7k6l3k4kJ8K4J9J0PQ%k0l9l5nL2M0
$$ -42 -24 -5 18 35 29 8 -5 -7 -10 -24 -41 -48 -46 -51 -67 -89 -106 -107 -90 -62 -38 -30 -36 -48 -65 -91 -124 -148 -150 -132 -108 -89 -79 -72 -64 -64 -84 -123 -158 -163 -131 -91
5313i1J8j2k0mJ3J7J2J1J9K3Rj6l6l9l3k7j9pRK6M1M7L2Mj8k0j0qj2j1qpmJ1K6K3NoNK2K7
$$ -91 -73 -85 -105 -109 -96 -79 -67 -56 -37 -14 -5 -21 -57 -96 -129 -156 -175 -182 -173 -147 -106 -59 -27 -23 -41 -61 -71 -79 -91 -102 -110 -117 -121 -110 -84 -61 -56 -62 -57 -35 -8
5295hK0Pj0k6l3k5j2kLJ0J6J7J3Lj0j5lJ6J5lj3JJ3Jj8j5QK4K0J0Mqk1k5j3kljJ3K3J2j2l0
$$ -8 12 19 9 -17 -50 -75 -87 -89 -86 -76 -60 -43 -30 -27 -37 -52 -55 -39 -24 -27 -40 -39 -26 -25 -43 -58 -50 -26 -6 4 8 0 -21 -46 -59 -61 -64 -65 -52 -29 -17 -29 -59
5277e9k8j0J6L8M3L0J0momppJJ7K9K2Kj7k0j9k3k5j9%Ook2k6j7nOJ3Poj3pJ1K3K8K2Rj3k4
$$ -59 -87 -97 -81 -43 0 30 40 36 30 26 19 12 13 30 59 81 83 66 46 27 4 -21 -40 -40 -34 -40 -62 -88 -105 -110 -104 -91 -84 -90 -103 -110 -99 -76 -48 -26 -17 -30 -54
5258e4j6MJ9K0K0J9J3ql7n7n4k9MK7K9J4nj2kJ8L0K3Jj9k4j8oMLoj1qJLnrnNQKj%OLj1k4k2
$$ -54 -70 -66 -47 -27 -7 12 25 17 -20 -77 -131 -160 -156 -129 -100 -86 -91 -103 -105 -87 -57 -34 -33 -52 -76 -94 -100 -96 -93 -99 -110 -118 -117 -114 -119 -128 -133 -128 -120 -118 -119 -119 -113 -110 -121 -145 -167
5238a67%K1L0K8L1L1K2OLKj4m3m7j7Rlk8k4PL2K7J4QMnpJKj4l2l0qJ8L5L6K9K0J0%j2j5lK0
$$ -167 -167 -146 -116 -88 -57 -26 -4 2 5 7 -7 -50 -97 -114 -105 -108 -136 -160 -153 -121 -94 -80 -72 -68 -73 -80 -79 -77 -91 -123 -153 -161 -143 -108 -72 -43 -23 -13 -13 -25 -40 -43 -23
5219b3K9J8kj0onomjkj0pQJ6Jj7k0rmj4j4J5N1N9L2%j0%Kj4l7m4l1lK3L9L7K3Kj6k4j7onj8
$$ -23 6 24 22 12 6 1 -5 -9 -10 -12 -22 -29 -21 -5 -4 -21 -41 -50 -54 -68 -82 -67 -16 43 75 75 65 65 67 53 16 -28 -59 -62 -39 0 37 60 62 46 22 5 -1 -6 -24
5200b4l0k6lK3L6K7J2kqj3k0j7%K3K8J1j2j8qKKjKNmj9k6k0lRJ1O%mj1j6j0RK7L1J9Jj8k8
$$ -24 -54 -80 -83 -60 -24 3 15 13 5 -8 -28 -45 -45 -22 6 17 5 -13 -21 -19 -17 -18 -16 -11 -15 -34 -60 -80 -83 -74 -63 -57 -57 -61 -72 -88 -98 -89 -62 -31 -12 -11 -29 -57
5181e7k1%J9J1j1j5J8N6N5J3l6m9k9pkqnJ1J9J1mj0p%MRJ0OKQK1K9K1%k2k8j2PQj7m2l3jJ8
$$ -57 -78 -78 -59 -48 -59 -74 -56 0 55 68 32 -17 -46 -53 -55 -63 -68 -57 -38 -27 -31 -41 -48 -48 -44 -35 -25 -19 -17 -9 12 41 62 62 40 12 0 7 15 -2 -44 -77 -78 -60
5161f0J4RJ9K8L0K3J5mm1p5p6m3nJ2Pqj4jK7M8M4K3lj7j1PK6K1%j5j2oj2k4j8jJ2K1L4M6L7
$$ -60 -46 -37 -18 10 40 63 78 74 33 -42 -118 -161 -166 -154 -147 -155 -169 -170 -143 -95 -51 -28 -31 -48 -59 -52 -26 -5 -5 -20 -32 -38 -50 -74 -92 -93 -81 -60 -26 20 57
5144E7Mk9m0l2k0j0pj0j5j4j0j1j4j4rmLJ6L4M1K8J2lj7k8l3k5j4qJJ0J3PRK0K7J3pj2lNP
$$ 57 61 32 -8 -40 -60 -70 -77 -87 -102 -116 -126 -137 -151 -165 -174 -178 -175 -159 -125 -84 -56 -44 -47 -64 -92 -125 -150 -164 -172 -171 -161 -148 -141 -132 -112 -85 -72 -79 -91 -94 -89 -82
5125h2J0J5J6J1J0J5J3Mj0j5j5pMJ3J3Nkpj0lK2N4O4L3j4m3m0k9k6l2l0k6k8l5l2j2J1K4K9
$$ -82 -72 -57 -41 -30 -20 -5 8 12 2 -13 -28 -35 -31 -18 -5 0 -2 -9 -19 -22 0 54 118 151 137 94 54 25 -1 -33 -63 -89 -117 -152 -184 -196 -185 -161 -132
5109a32L4M1M2L5K5Pj7l4l3j9jJ0J7J8Lj8k6j3lj0k0rJ9L6L2K0J7Roj5j1pj1j8j5njMJ8L3
$$ -132 -98 -57 -15 20 45 52 35 1 -32 -51 -52 -42 -25 -7 -4 -22 -48 -61 -64 -74 -94 -103 -84 -48 -16 4 21 30 24 9 -2 -9 -20 -38 -53 -58 -59 -55 -37 -4
5091dL3J1j7k8j7mj0l6o0o3l9qJ6K3J1pj4KK2J6qj6RM0M4K0MNQPJ3L0L6K6Nk%%j1k0j7nJ0
$$ -4 29 40 23 -5 -22 -26 -36 -72 -132 -195 -234 -242 -226 -203 -192 -199 -213 -211 -189 -173 -181 -197 -188 -148 -104 -84 -80 -75 -67 -60 -47 -17 19 45 50 48 48 48 37 17 0 -5 5
5073EJ7Oj3k0oJ1Qqj5nJj1k8k2OK9K7Rj1k1k5j4OK0Qk1l0mL1M3L0K1K0J3rk5k1j0j2k1k1j0
$$ 5 22 28 15 -5 -11 0 8 0 -15 -20 -19 -30 -58 -80 -74 -45 -18 -9 -20 -41 -66 -80 -74 -54 -46 -67 -97 -101 -70 -27 3 24 44 57 48 23 2 -8 -20 -41 -62 -72
5054g2J%jMJ1J0NJJKK%nj1j1rj2j6j2MJ4J2OOQMmmJjj5k1rL%j6j9kJ9K8K1Poj6j8qOJ4J2P
$$ -72 -71 -71 -72 -68 -57 -47 -42 -41 -40 -38 -36 -36 -41 -52 -63 -72 -84 -100 -112 -108 -94 -82 -76 -70 -62 -58 -62 -66 -65 -66 -81 -102 -111 -108 -108 -124 -143 -145 -126 -98 -77 -70 -76 -92 -110 -118 -112 -98 -86 -79
5033g9K%LJ3L0L8L1Ok0l0k2jJ4J4Mklj1k5l1j8JNok0k3j9j4lK1M2M6L3J7RJ3Rkj6j5nLjj6
$$ -79 -77 -77 -74 -61 -31 7 38 44 24 -6 -28 -29 -15 -1 3 1 -2 -13 -38 -69 -87 -86 -81 -87 -107 -130 -149 -163 -166 -145 -103 -57 -24 -7 2 15 24 22 6 -9 -14 -11 -12 -28
5014b8k4j5%OMMJ3K4K1%k4l4k5j3qpk%j0k3k7j8pKJ0J5J0%jNMqj3kJ2J4J1QNloJPJnKJ3J0
$$ -28 -52 -67 -67 -61 -57 -53 -40 -16 5 5 -19 -53 -78 -91 -99 -106 -108 -108 -118 -141 -168 -186 -193 -191 -181 -166 -156 -156 -157 -152 -148 -156 -169 -171 -159 -145 -134 -126 -121 -124 -130 -129 -122 -121 -126 -124 -111 -101
4993a01pj8k2j8oJ4K7J6nj3lLpj9k4k4k3j1QK3K3J7J1J2J7K7L3K4J1J0Rj1l6k9J6M9L7Jj3
$$ -101 -108 -126 -148 -166 -172 -158 -131 -115 -120 -133 -136 -133 -140 -159 -183 -207 -230 -241 -233 -210 -187 -170 -159 -147 -130 -103 -70 -46 -35 -25 -16 -27 -63 -92 -76 -27 10 11 -2
4976bmMpk2k3j0RK0J4KKJ7K2Kk7l7k6j0NJ9K5J2pj1j%lLJ5J3lj2poj3j0J3K4Mk8m0k6%K2L9
$$ -2 -6 -2 -9 -31 -54 -64 -55 -35 -21 -19 -17 0 22 24 -3 -40 -66 -76 -71 -52 -27 -15 -22 -33 -34 -34 -37 -34 -19 -6 -9 -21 -28 -34 -47 -57 -44 -20 -16 -44 -84 -110 -110 -88 -49
4956d9L6J0k7n0m4j8J5M2M7L2RJJlj3k6l4l3j6PJ7Nj1j1JOPK2N0O5N7L6J5ok1k3j3j5l0m3
$$ -49 -13 -3 -30 -80 -124 -142 -127 -85 -38 -6 3 4 5 2 -11 -37 -71 -104 -120 -113 -96 -91 -102 -113 -112 -106 -99 -77 -27 38 95 131 146 140 119 96 83 68 38 -5
4939el5j9j5j7j0QJ6RNRJ2Lj5k4k1qLOj1l5m1k0OJ1LJ0L7N1L5Mpoj1l1m5l9j4J8M8O6N8K7
$$ -5 -40 -59 -74 -91 -101 -93 -77 -68 -63 -54 -42 -39 -54 -78 -99 -107 -104 -98 -109 -144 -185 -205 -199 -188 -185 -175 -138 -87 -52 -48 -55 -61 -72 -103 -148 -187 -201 -183 -135 -69 -11 16
4921A6KmJnj9k8j7MK3K9K8K1Rj0l0l5j2K5M1K3j0l1l6l1j8KJ9J9J4K2L5L1Rrj1j3j7j4NJ8
$$ 16 18 14 15 10 -9 -37 -54 -50 -27 2 30 51 60 50 20 -15 -27 -2 39 62 52 21 -15 -46 -64 -62 -43 -24 -10 12 47 78 87 78 67 54 37 23 28 46
4904D6J3JKLj1l3l7k6j0JJ0J0pk9l2j2jrj0J4L8L1Prj0j7k7k0LJ4MkQJ8QmNK3J6rk3j3mj0
$$ 46 59 60 62 65 54 21 -16 -42 -52 -51 -41 -31 -38 -67 -99 -111 -112 -121 -131 -117 -79 -48 -41 -50 -60 -77 -104 -124 -121 -107 -103 -105 -97 -79 -71 -75 -70 -47 -31 -40 -63 -76 -80 -90
4884i0j3jQkj6j0ROk0l4j2K1L8L3K9K8J5j2l1k6j0k%PJ6Rj0k2j2NJ1J2K1L8L9J8j1j9j2j0
$$ -90 -103 -104 -96 -98 -114 -124 -115 -109 -129 -163 -175 -154 -116 -83 -54 -26 -11 -23 -54 -80 -90 -92 -92 -85 -69 -60 -70 -92 -104 -99 -88 -76 -55 -17 22 40 29 10 -2 -12
4867a2k1l9m1k5JK0K0Jj9k6j1J7L9M3K8Rmollrj4j7k0j8j0RK7L0J8jj2j0PK4K9J3j4l1k8j3
$$ -12 -33 -72 -113 -138 -137 -117 -97 -96 -115 -141 -152 -135 -96 -53 -25 -16 -20 -26 -29 -32 -41 -55 -72 -92 -110 -120 -111 -84 -54 -36 -37 -49 -59 -52 -28 1 14 0 -31 -59 -72
4849g2oqoOK1K3J0j0k2k2kK4L2J8%LJ6J7mk3j7NJ2lk3k2lJ7K5J9J2%j5k2k1nJ4K8L0J9ol2
$$ -72 -78 -86 -92 -86 -65 -42 -32 -42 -64 -86 -88 -64 -32 -14 -14 -11 5 22 18 -5 -22 -17 -5 -8 -31 -53 -56 -39 -14 5 17 17 2 -20 -41 -46 -32 -4 26 45 39 7
4831Gm2l4j8%J4K2J5j0k8k9k3k9l3j5J9L1Rj5j7lKOK5M6M4J5j7l3l7l1j6RL0L2J1j6k8k0k
$$ 7 -35 -69 -87 -87 -73 -51 -36 -46 -74 -103 -126 -155 -188 -203 -184 -153 -144 -159 -176 -179 -177 -171 -146 -100 -56 -41 -58 -91 -128 -159 -175 -166 -136 -104 -93 -109 -137 -157 -159
4814a59P%j4k0j9j5pJ0L5N9P6P6N5J8j2j7qj0k6l8l7k6j4kJ4K8L1J9Lj5k9l2k8k3j4NK8M0
$$ -159 -152 -152 -166 -186 -205 -220 -227 -217 -182 -123 -47 29 84 102 90 73 65 55 29 -9 -46 -72 -86 -88 -74 -46 -15 4 7 -8 -37 -69 -97 -120 -134 -129 -101 -61
4798f1L2J5RJ0J4Kj1j4nMMJNJ5J5KrkJ4J9Qrk6l8m2l1j1PJ6J6QnrOK1J3qj5nJprNJ8J6RJ9
$$ -61 -29 -14 -5 5 19 21 10 -4 -9 -5 -1 0 5 20 35 37 28 26 40 59 67 58 32 -6 -48 -79 -90 -83 -67 -51 -43 -48 -57 -51 -30 -17 -25 -40 -45 -44 -51 -60 -55 -37 -21 -12 7
4777GL8L7Qk4l6k5j0%K%j0k5l6l2qK0L7L2J8Kqq%J3K0J7Nj5l2m0l0rJ0J9K4K3J7Qok3l3k5
$$ 7 45 82 90 66 30 5 -5 -5 -3 -3 -13 -38 -74 -106 -114 -94 -57 -25 -7 -5 -13 -21 -21 -8 12 29 34 19 -13 -53 -83 -92 -82 -63 -39 -16 1 9 3 -20 -53 -78
4759g8KK1J0j6k3qPOPJ6J9Nj1j0jNNNLljJ3K1J0mq%Lknj0j9k2nJ5J9J1Koj6j5J1L8L4Qj0k
$$ -78 -76 -55 -45 -61 -84 -92 -85 -79 -72 -56 -37 -32 -43 -53 -54 -49 -44 -39 -36 -39 -40 -27 -6 4 0 -8 -8 -5 -7 -12 -22 -41 -63 -68 -53 -34 -23 -21 -27 -43 -58 -47 -9 25 33 23 21
4739B1PPQJ1Lk1l5j9MRmj3j5k2l1l0j2J4L5L2J3pnJ1J5Nnljj1k4k4j9k0j7LK6K8J0opmoqm
$$ 21 28 35 43 54 57 36 1 -18 -14 -5 -9 -22 -37 -59 -90 -120 -132 -118 -83 -51 -38 -45 -50 -39 -24 -19 -24 -27 -28 -39 -63 -87 -106 -126 -143 -140 -114 -86 -76 -82 -89 -93 -99 -107 -111
4719a11NJ1J5J6Pj0k6k8j8MK7M1M4M2L8K1pl2l4j7kLJKMMNLqk2k3mJ8J7rk9k9j7j6k3j8OL6
$$ -111 -106 -95 -80 -64 -57 -67 -93 -121 -139 -135 -108 -67 -23 19 57 78 71 39 5 -12 -14 -11 -10 -8 -4 0 5 8 0 -22 -45 -49 -31 -14 -23 -52 -81 -98 -114 -137 -155 -149 -113
4701a13M7L9K2Mj7l5l9k9j1MJ6K2J8Nj3k7l4k7j4mj0j9j1J3K5J2lPL6N3M8L3J8%j8k6j7ml
$$ -113 -66 -27 -5 -1 -18 -53 -92 -121 -132 -128 -112 -90 -72 -67 -80 -107 -141 -168 -182 -186 -196 -215 -226 -213 -188 -176 -179 -172 -136 -83 -35 -2 16 16 -2 -28 -45 -49 -52
4684e2j2k2k5j8mRJ9K5K4%m1p1n7qL4M2K5J1PJ3K5L6L1Qj3j0PPrj9qRJ0mj7k4k8l1l2k6j8
$$ -52 -64 -86 -111 -129 -133 -124 -105 -80 -56 -56 -97 -168 -225 -233 -199 -157 -132 -121 -114 -101 -76 -40 -9 -1 -14 -24 -17 -10 -19 -38 -46 -37 -27 -31 -48 -72 -100 -131 -163 -189 -207
4666b07rKRROQJ8K3K1J8K0K0J6J4J5J1j3m1n0l2j0kmnJPRJ5J8J2lk0k5j6%QP%oj7l1l7k7p
$$ -207 -216 -214 -205 -196 -190 -182 -164 -141 -120 -102 -82 -62 -46 -32 -17 -6 -19 -60 -110 -142 -152 -154 -158 -163 -162 -155 -146 -131 -113 -101 -104 -124 -149 -165 -165 -157 -150 -150 -156 -173 -204 -241 -268 -275
4647b75jmjJ7L0K6K2K5K3ml4l6oK5K4MroMRNPJ8K9K7J4LM%j4k3oK3L9K8Kj5j9j0PJ4Lj6j8
$$ -275 -276 -280 -281 -264 -234 -208 -186 -161 -138 -142 -176 -212 -218 -193 -169 -165 -174 -180 -176 -167 -162 -155 -137 -108 -81 -67 -64 -60 -60 -74 -97 -103 -80 -41 -13 -11 -26 -45 -55 -48 -34 -31 -47 -65
4628f5mLnj6rPK2L4M1M0J4k2m6m7k6oPQKoj2j9k2j7q%jjJPJ0J2J2J5J9K2J5%j5j7pJRK0K8
$$ -65 -69 -66 -71 -87 -96 -89 -67 -33 8 48 62 40 -6 -53 -79 -85 -78 -70 -68 -74 -86 -105 -127 -144 -152 -152 -153 -154 -153 -146 -136 -124 -112 -97 -78 -56 -41 -41 -56 -73 -80 -79 -70 -50 -22
4608b2K1Mpj0j0j0JJ8J7ml2m1l0j3NJ9J9NkJ0K6K2QKPKj7l3l1j9pnkMJ7K5J3j6l1j2K0L3K1
$$ -22 -1 3 -4 -14 -24 -34 -33 -15 2 -2 -34 -75 -105 -118 -113 -94 -75 -70 -72 -62 -36 -14 -6 -4 3 5 -12 -45 -76 -95 -102 -107 -109 -105 -88 -63 -50 -66 -97 -109 -89 -56 -35
4590c5J3J6J4lj9j9nOJ0Pqk9l9k5JJ6J0nj7k1j8j5oJ0L5N5N6L1lj8j1RJ9Pk5n2m7j5K0L5L5
$$ -35 -22 -6 8 5 -14 -33 -38 -32 -22 -15 -23 -52 -91 -116 -115 -99 -89 -94 -111 -132 -150 -165 -171 -161 -126 -71 -15 16 13 -5 -16 -7 12 19 -6 -58 -105 -120 -100 -65 -30
4572c0K7J7ROKj1k7m0l7k5j3OL3N1M0J1j9l3l0j7%J2J4RNkj9l6l9l4l2l4k3LK4K8K2K2K8K6
$$ -30 -3 14 23 29 31 20 -7 -47 -84 -109 -122 -116 -83 -32 8 19 0 -33 -63 -80 -80 -68 -54 -45 -40 -42 -61 -97 -136 -170 -202 -236 -259 -256 -232 -204 -182 -160 -132 -106
4555a06J7J5J9K4K1J5J4RMMJ4K6K8J6Jj2k3l2l8l3k5j1jMMlpnPJ7J9J3Nlqj3j6j4j2j1qqj1
$$ -106 -89 -74 -55 -31 -10 5 19 28 32 36 50 76 104 120 121 109 86 54 16 -17 -42 -53 -54 -50 -46 -49 -56 -61 -54 -37 -18 -5 0 -3 -11 -24 -40 -54 -66 -77 -85 -93 -104
4536a04j7j9j1J1L4M1K9QjQK5K9J6nk0k5k6k4k5l0l4k6mJ9K6K0K0L0L3J2j9l4k3jJ4J4Mj4
$$ -104 -121 -140 -151 -140 -106 -65 -36 -28 -29 -21 4 33 49 44 24 -1 -27 -51 -76 -106 -140 -166 -170 -151 -125 -105 -85 -55 -22 -10 -29 -63 -86 -87 -73 -59 -55 -69
4519f9l0l1j6NJ6J7J3RJ1K4M0M0K0qk5k7k6k5k3j6pMJ1R%j3j3jJ6K1J6Npj3j0LJ7K1J7J2J5
$$ -69 -99 -130 -146 -141 -125 -108 -95 -86 -75 -51 -11 29 49 41 16 -11 -37 -62 -85 -101 -108 -104 -93 -84 -84 -97 -110 -111 -95 -74 -58 -53 -60 -73 -83 -80 -63 -42 -25 -13 2
4502BK1K1J4PNNj1l3m5l3kK0K3J1MJjjKOPjj2k5l2l3l2l3l2k1kJ0OkkJ1J8J4OKKnj1j3j0j2
$$ 2 23 44 58 65 70 75 64 31 -14 -47 -49 -29 -6 5 9 10 9 8 10 16 23 22 10 -15 -47 -80 -112 -145 -177 -198 -200 -190 -184 -186 -188 -177 -159 -145 -139 -137 -135 -140 -151 -164 -174 -186
4482a86j1RL9N6M0Oj8k0j1kJ2K4J7j1l8m4k8rJ1K3K8J8PNJ6K4K0Pj0k3k3rPJ4J8K1J9Jj8j5
$$ -186 -197 -188 -149 -93 -53 -47 -65 -85 -96 -98 -86 -62 -45 -56 -94 -138 -166 -175 -164 -141 -113 -95 -88 -83 -67 -43 -23 -16 -26 -49 -72 -81 -74 -60 -42 -21 -2 -1 -19 -34
4464c4J1K7J9kj5j9k8l1j8%Oqj6oJ4K6K4J7J1QNLKLKqk9m9m8k6LJ9J9K0L1M2L0jk4j7OK2J5
$$ -34 -23 4 23 21 6 -13 -41 -72 -90 -90 -84 -92 -108 -114 -100 -74 -50 -33 -22 -14 -9 -6 -4 -1 1 -7 -36 -85 -133 -159 -156 -137 -118 -98 -67 -25 5 4 -20 -37 -31 -9 6
4446FJj3k1j0QOk6o1n4j2K2J7KjPJ1J7L0L8K6RJ3K7K9J8N%qj3pNLj1k1j7oMPMorJJ6J8Jj7
$$ 6 7 -6 -27 -37 -29 -23 -49 -110 -164 -176 -154 -137 -135 -136 -129 -118 -101 -71 -33 -7 2 15 42 71 89 94 94 86 73 66 71 74 63 42 25 19 23 30 34 28 19 20 36 54 55 38
4426C8k8l3l5k1%RKj0qMK0L3M0L5J5kkQPnj7k2k1k0j7mJ3K0J4PJ1J7J8J1J3K7L1J0k8n1n0
$$ 38 10 -23 -58 -79 -79 -70 -68 -78 -86 -82 -62 -29 11 46 61 59 57 65 72 67 50 28 7 -13 -30 -34 -21 -1 13 20 31 48 66 77 90 117 148 158 130 79 29
4408B9l6k0jJ4J3JkMJ4J2RQ%j6k8k5k6l8m9l1J1M1L4Nj8j5MK1K5J5MKJj0k4k8j1J5L4M0L9
$$ 29 -7 -27 -28 -14 -1 0 -2 2 16 28 37 45 45 29 1 -24 -50 -88 -137 -168 -157 -116 -82 -77 -95 -110 -106 -85 -60 -45 -41 -39 -38 -48 -72 -100 -111 -96 -62 -22 17
4390A7K7Kk2k6j2NOLQJ7J7lk0k0j0pj9l2k2RL3K9Kj4oOjk4l3j8jmqMK7L4K2J5K3L3K6J1NM
$$ 17 44 46 24 -2 -14 -9 -3 0 8 25 42 39 19 -1 -11 -18 -37 -69 -91 -82 -49 -20 -18 -32 -38 -32 -33 -57 -90 -108 -109 -113 -121 -117 -90 -56 -34 -19 4 37 63 74 79 83
4371H3%o%J5K1J5OQJ2Oj0j9j1kj1l5m7l3j5pnLJ3RmkK1M1L5Kl1m9m5k5LK1K4J4J0J4J3Mj0
$$ 83 83 77 77 92 113 128 134 142 154 160 150 131 120 118 107 72 25 -8 -23 -30 -35 -32 -19 -10 -14 -16 5 46 81 83 52 3 -42 -67 -64 -43 -19 -5 5 19 32 36 26
4353B6j4NL4M5K9%j4j0oj0j3j4j4j8j8j0omKQMkOK4K6%j8mK5K7Mj3pOLnj0j1rj2k2m1n3l7
$$ 26 12 17 51 96 125 125 111 101 95 85 72 58 44 26 8 -2 -8 -12 -10 -2 2 0 6 30 56 56 38 34 59 86 90 77 70 76 79 74 64 53 44 32 10 -31 -84 -121
4333a21%K1J2j0j0J0K6K2J6K5L2K0j2l2k9j8j5j4OL2L4Pj4j6qj2k0j9k2l2l2mL2M1K6J5J8
$$ -121 -121 -100 -88 -98 -108 -98 -72 -50 -34 -9 23 43 31 -1 -30 -48 -63 -77 -71 -39 -5 2 -12 -28 -36 -48 -68 -87 -109 -141 -173 -177 -145 -104 -78 -63 -45
4317d5J2j1l2l2k2j3lJ6L6L5J1j8l3k8pJ5K6K4J2nj8j6jJ1J0J0K1L3K5NqJJ1Qrk5l5l0qJ9
$$ -45 -33 -44 -76 -108 -130 -143 -146 -130 -94 -59 -48 -66 -99 -127 -134 -119 -93 -69 -57 -62 -80 -96 -97 -86 -76 -66 -45 -12 13 18 10 11 22 30 21 -4 -39 -69 -77 -58
4300e8L3K6J4Kmqmjj1k1j9n%rj4lJ0J1POOJPK6L9K7ok7k3kJ1Mk1m4l5LL1K2pj7JK1K5J7Rj
$$ -58 -25 1 15 17 13 5 1 0 -11 -32 -51 -56 -56 -65 -79 -82 -72 -61 -54 -48 -42 -41 -34 -8 31 58 52 25 2 0 11 15 -6 -50 -85 -82 -51 -29 -36 -53 -52 -31 -6 11 20 19
4280A9j3j6j5j0mPJ6J5kj1jK2L6K8J0JLRNpj5j3m%oj7k6k3j5j0j2j5j1NJ8J9RlpjJ8L5L6J4
$$ 19 6 -10 -25 -35 -39 -32 -16 -1 -3 -14 -15 7 43 71 81 82 85 94 99 92 77 64 60 60 54 37 11 -12 -27 -37 -49 -64 -75 -70 -52 -33 -24 -27 -34 -35 -17 18 54 68
4261F8j9l9l4j8jLmj4j9k3k9k5pJ6K5J6NKLKMJ1J1LkLPPRJ6J6KqkJ0Nj4k4k0rjPJ1Qlqj1j1
$$ 68 49 10 -24 -42 -43 -40 -44 -58 -77 -100 -129 -154 -161 -145 -120 -104 -99 -97 -94 -92 -88 -77 -66 -63 -65 -62 -55 -48 -39 -23 -7 -5 -13 -15 -5 0 -14 -38 -58 -67 -68 -61 -50 -42 -45 -53 -64 -75
4240g5jK6M8M2J1j8k2j7k3k9k4j0nqj0LJ8K3Pj1j4%J0Ol%OPMLMlj2j0jNLQK0K7K4J5Plj3j2
$$ -75 -76 -50 -2 40 51 33 11 -6 -29 -58 -82 -92 -97 -105 -115 -112 -94 -71 -64 -75 -89 -89 -79 -73 -76 -76 -70 -63 -59 -56 -52 -55 -67 -77 -78 -73 -70 -62 -42 -15 9 24 31 28 15 3
4220Cloj8k7k6k5k3j7kRJ3K1L4L7K1KmLPKjnm%RJ4J1QRJ0kk3l4l0j6oj0j8k1j4ppnPK7M0M1
$$ 3 0 -6 -24 -51 -77 -102 -125 -142 -144 -135 -122 -101 -67 -30 -9 -7 -11 -8 -1 1 0 -5 -9 -9 0 14 25 33 42 52 50 27 -7 -37 -53 -59 -69 -87 -108 -122 -129 -136 -141 -134 -107 -67 -26
4200b6K8J3nj4oJ3J5nk6l0j7rkQJ9K0J1POLlm%nj2j5j5k4l6l1pJ3J7J7K1K1Lj8k0KK3K8K3
$$ -26 2 15 10 -4 -10 3 18 13 -13 -43 -60 -69 -71 -63 -44 -24 -13 -6 0 3 0 -4 -4 -9 -21 -36 -51 -75 -111 -142 -149 -136 -119 -102 -81 -60 -57 -75 -95 -93 -70 -42 -19
4181a9J4POQJ2Kj7k6k1oNJ1J8J7PokJ0J5PQJ7J7nl0l2j7qj2j8j6j3nJ0K8L0J8J3K0K7J9MJ
$$ -19 -5 2 8 16 28 30 13 -13 -34 -40 -35 -24 -6 11 18 12 10 20 35 42 50 67 84 79 49 17 0 -8 -20 -38 -54 -67 -72 -62 -34 -4 14 27 47 74 93 97 98
4163I8J5K9K2%j4%K6K9qm9o3m6l1l0k4lJ6J3%MK6M3L2nm0n0l4j6j2j7j4nnj3rOJ3NJRJ4PL
$$ 98 113 142 164 164 150 150 176 205 197 148 85 39 8 -22 -46 -49 -33 -20 -20 -16 10 53 85 80 40 -10 -44 -60 -72 -89 -103 -108 -113 -126 -135 -129 -116 -111 -110 -101 -87 -80 -77
4144g7J7K9J3j4k5k0k5m1m3j1L1N7N6L8J1j3k1j6j3j8k5k2oJ0K0K0J1Jqk0k9k7qJ5K8K9K0
$$ -77 -60 -31 -18 -32 -57 -77 -102 -143 -186 -197 -166 -109 -53 -15 -4 -17 -38 -54 -67 -85 -110 -132 -138 -128 -108 -88 -77 -76 -84 -104 -133 -160 -168 -153 -125 -96 -76
4128g6Kj9l0k2rplJ9M3L9Qk2k6pJ9M4N7N0K8J0jj0k2k5j9j3j6j9qPJ4Prl4m5k2K6N9N2J8j3
$$ -76 -74 -93 -123 -145 -154 -161 -164 -145 -102 -63 -55 -77 -103 -110 -91 -47 10 60 88 98 97 87 65 40 21 8 -8 -27 -35 -28 -14 -7 -16 -50 -95 -117 -91 -32 20 38 25
4110B5k5k5j7lPJ3J5J4Olmjqk8m2l9k4oJ7L6L0%k5j8J0K6K7K5K2J8RJ4K4K1Lj2qNPqk6l3k8
$$ 25 0 -25 -42 -45 -38 -25 -10 4 10 7 3 2 -6 -34 -76 -115 -139 -145 -128 -92 -62 -62 -87 -105 -95 -69 -42 -17 5 23 32 46 70 91 94 82 74 79 86 78 52 19 -9
4092ik3j8oJ8M7N6L6Oj3j9k1k3j7rnmMOok7k5MK7J8rk1j4nj3l0l9l0lL1N4M9K6%j2j2qlOR
$$ -9 -32 -50 -56 -38 9 65 101 107 94 75 54 31 14 5 0 -4 0 6 0 -27 -52 -48 -21 -3 -12 -33 -47 -52 -65 -95 -134 -164 -167 -136 -82 -33 -7 -7 -19 -31 -39 -42 -36 -27
4073b7%j1nJ8K7Rk9n1l7nJ4Nj7k8j7QL1M3M1L2J7nj8j0J3K3Rprlj1k1k1mNoj8mK9N1M4J3j9
$$ -27 -27 -38 -43 -25 2 11 -18 -69 -106 -111 -97 -92 -109 -137 -154 -146 -115 -72 -31 1 18 13 -5 -15 -2 21 30 23 14 11 0 -21 -42 -46 -41 -47 -65 -69 -40 11 55 68 49
4054D9l8l5j6RK3J7PJ0K6L9L1Ok3n0o2n3k2J1K6K6K0J2LNJ9K5J0j4j8omk5l7l0j8k1k8k1p
$$ 49 11 -24 -40 -31 -8 9 16 26 52 91 122 128 105 55 -7 -60 -82 -71 -45 -19 1 13 16 21 40 65 75 61 43 37 33 8 -29 -59 -77 -98 -126 -147 -154
4037a54pj5j1J3M0N6N4L6J2nmLOLJJKKMN%j0k0l1l7k3OK5K6J7J1Jj6l4l3k8k9k7rJ1J1MJ3
$$ -154 -161 -176 -187 -174 -134 -78 -24 12 24 19 15 18 24 27 28 29 31 33 37 42 42 32 12 -19 -56 -79 -73 -48 -22 -5 6 7 -9 -43 -76 -104 -133 -160 -169 -158 -147 -143 -130
4018a30L0K4ql0j9MJ7K2K6K2OolJ0J7K1K1Rj4k9k5j4j0pNJ5J5Noj3j7pJ4L0J9rk9k7j4JJ3
$$ -130 -100 -76 -84 -114 -133 -129 -112 -90 -64 -42 -36 -42 -45 -35 -18 3 24 33 19 -10 -35 -49 -59 -66 -61 -46 -31 -26 -32 -45 -62 -69 -55 -25 -6 -15 -44 -71 -85 -84 -71
4001g1J9J7J4K5M3M3J4k2l7k7oONkpj5l2m6m9l5j1J5L1L3K4K1K7L5K7Kj9k2j8j5j3pqj5k0
$$ -71 -52 -35 -21 4 47 90 104 82 45 18 12 18 23 21 14 -1 -33 -79 -128 -163 -174 -159 -128 -95 -71 -50 -23 12 39 41 22 0 -18 -33 -46 -53 -61 -76 -96
3984i6j3nnmJ0L1L5K0JnjJ%OJ7J9Qj4k8k2LK4K9K5J6Kj8l4l1j6mrj9k5k0nOJ1RKqk4m0m0j6
$$ -96 -109 -114 -119 -123 -113 -82 -47 -27 -26 -31 -32 -31 -31 -25 -8 11 19 5 -23 -45 -42 -18 11 36 52 54 36 2 -29 -45 -49 -58 -77 -102 -122 -127 -121 -110 -101 -99 -107 -131 -171 -211 -227
3964b27J4K4J0oj2rkPJ8K8L3L3L1K4J3NOQJj0j3ojNJ8L5M0K5Kqj0j7l3l5k0RL1L8K1j2l1j5
$$ -227 -213 -189 -179 -185 -197 -206 -208 -201 -183 -155 -122 -89 -58 -34 -21 -16 -10 -2 -1 -11 -24 -30 -31 -26 -8 27 67 92 94 86 76 59 26 -9 -29 -20 11 49 70 58 27 12
3946A2K2M1K7Mrj5k7k8rJ2RlLK1J8j0k5rJ5J7Nlnj2k0j9j4j5j7nJ3K1J8J3J2RNkj0j3j2rj3
$$ 12 34 75 102 106 97 82 55 27 18 30 39 36 39 60 78 68 43 34 49 66 71 68 63 51 31 12 -2 -17 -34 -39 -26 -5 13 26 38 47 52 50 40 27 15 6 -7
3927gk2k1nJ1J4Pkj5l2m0l2j5kQJ4J2mj7j5o%NK1M1M1J6j3j7OL6M6L7K8L6M6K8k1o1o2l8j4
$$ -7 -29 -50 -55 -44 -30 -23 -25 -40 -72 -112 -144 -159 -161 -153 -139 -127 -131 -148 -163 -169 -169 -164 -143 -102 -61 -45 -58 -75 -69 -33 13 50 78 114 160 188 167 106 44 6 -8
3910ho%Jrj4jJ4J1qqJ9L9K6j2l2j2K1L8K2qk8l4l4l1k0lM%MK2L4K3QQJ7Rj1k0j0LJ3K4L1J4
$$ -8 -14 -14 -13 -22 -36 -37 -23 -12 -20 -28 -9 30 56 44 12 0 21 59 81 73 45 11 -23 -54 -74 -77 -73 -73 -69 -47 -13 10 18 26 43 52 41 21 11 14 27 51 82 96
3890I6j5l3k6j3nklj4k2nK8M0K3PK0M0L2%k5k2oNkk2m0l8j8%Lpj2oLMpj8j2J2L7M1K7J0Om
$$ 96 81 48 22 9 4 2 -1 -15 -37 -42 -14 26 49 56 76 116 148 148 123 101 95 100 98 76 36 -2 -20 -20 -17 -24 -36 -42 -39 -35 -42 -60 -72 -60 -23 18 45 55 61 57
3871E7k2l6l3j8rj2j6j4kJ3J8Nj7k5j9j1j2j1kJ3K5L1L7L3J9jj8k9k4%K6K5mk7k0JLj7l4l6
$$ 57 35 -1 -34 -52 -61 -73 -89 -103 -105 -92 -74 -69 -86 -111 -130 -141 -153 -164 -166 -153 -128 -97 -60 -27 -8 -9 -27 -56 -80 -80 -54 -29 -33 -60 -80 -79 -76 -93 -127 -163
3854a63k2jJ4J3%qNJ9J5%pLJ6K5K2J2MJ2L0L3J5rj2kjj5l2l7k8qJ8L1J8kmJ2K3J4lj7k0j1
$$ -163 -185 -186 -172 -159 -159 -167 -162 -143 -128 -128 -135 -132 -116 -91 -69 -57 -53 -41 -11 22 37 28 16 14 13 -2 -34 -71 -99 -107 -89 -58 -40 -42 -46 -34 -11 3 0 -17 -37 -48
3836d8jmk4l7k6%J5Rnj6j6ML7O4O0L4Ppj3j5qNQkj0qlrj6j2JJ9K8K5J2OJ0Rrk6k0%J1Lpj4
$$ -48 -49 -53 -77 -114 -140 -140 -125 -116 -121 -137 -153 -149 -112 -48 12 46 53 46 33 18 10 15 23 21 11 3 0 -9 -25 -37 -36 -17 11 36 48 54 64 73 64 38 18 18 29 32 25 11
3816A1k4l3k5jJ6J0kllpj1mkj6l7l7j8J0L1M6N0M3L4L2L5K3rm2m5j9J0J7Nk%NOPOpk7l0rJ4
$$ 11 -13 -46 -71 -72 -56 -46 -48 -51 -54 -61 -72 -76 -78 -94 -131 -168 -186 -176 -145 -99 -49 -6 28 60 95 118 109 67 22 3 13 30 35 33 33 38 44 51 57 50 23 -7 -16 -2
3797bQj2k0lJ1PnoLJ6J5Lj6k1pPjk0k6j8qJJ1J7PpkJ9K4QnKRJj1j1mkkOJ6J4PPJ1Lrj5pLR
$$ -2 6 -6 -26 -29 -18 -11 -16 -22 -19 -3 12 15 -1 -22 -29 -22 -23 -43 -69 -87 -95 -94 -83 -66 -59 -66 -68 -49 -25 -17 -22 -20 -11 -10 -21 -32 -36 -38 -40 -34 -18 -4 3 10 21 24 15 0 -7 -4 5
3775EJ4J1O%j2l7o8p4m1PL8M0K5J1MJ2K0J7nk6k5j1jmj1j1pj%lkNJ1J1J8M1N6M1Kk3j5LPL
$$ 5 19 30 36 36 24 -13 -81 -155 -196 -189 -151 -111 -86 -75 -71 -59 -39 -22 -27 -53 -78 -89 -90 -94 -105 -116 -123 -124 -124 -127 -129 -124 -113 -102 -84 -43 13 54 56 33 18 21 28 31
3756C1Mkj9k0ML1L1Lk3l6l9l3j4NQML%j0j4%J4Jk4k5NK9K8J1loNL2N2M4J5lKJ4J4Npk7m6n3
$$ 31 35 33 14 -6 -2 29 60 63 40 4 -35 -68 -82 -77 -69 -65 -62 -62 -72 -86 -86 -72 -71 -95 -120 -115 -86 -58 -47 -50 -56 -51 -19 33 77 92 89 91 105 119 124 117 90 44 -9
3736im2k0jJ5K5K9K4J6Jk5m1l0%J2jj8j4jkj0j1LK1L9M8L9J2j2j7rj3k5l3k3j0j2k6l5k8j1
$$ -9 -51 -71 -72 -57 -32 -3 21 37 38 13 -28 -58 -58 -46 -47 -65 -79 -80 -82 -92 -103 -100 -79 -40 8 47 59 47 30 21 8 -17 -50 -73 -83 -95 -121 -156 -184 -195
3719a95LRJ5K6L5K8R%RK0K2J1ONNkooklj0j5qNJ4Kj7k7j6QK6K3Kj8k0qLKKMjj5j3RK1ll8m1
$$ -195 -192 -183 -168 -142 -107 -79 -70 -70 -61 -41 -19 -8 -2 3 8 6 0 -6 -8 -11 -21 -36 -44 -39 -25 -23 -40 -67 -83 -75 -49 -26 -24 -42 -62 -70 -67 -65 -63 -59 -60 -75 -88 -79 -58 -61 -99 -140
3698a40j1J2OlLPqk3j5J0K5K9L1L4K3Lj3j6pJ0K6K9J6lj3j3j4j1LK1K4J3LPJ9J9Oj2k3k7l2
$$ -140 -151 -139 -133 -136 -133 -126 -134 -157 -172 -162 -137 -108 -77 -43 -20 -17 -30 -46 -53 -43 -17 12 28 25 12 -1 -15 -26 -23 -2 22 35 38 45 64 83 89 77 54 27 -5
3680el9l5j9LJ7K2K1J1nj9k3j9k0k5k5j6j0j4j4%K3L8L9L1J8MJOJ0LpkJ8L4L5J9mk4l5l5k1
$$ -5 -44 -79 -98 -95 -78 -56 -35 -24 -29 -48 -71 -90 -110 -135 -160 -176 -186 -200 -214 -214 -191 -153 -114 -83 -65 -61 -60 -54 -44 -41 -48 -50 -32 2 37 56 52 28 -7 -42 -63
3662f3kNlj2j0NJ5J4OMOMpk0k7j9ML0L5J8jjQKj7k5j3JQJ1J6J6Kj5k2j6%J6J7OKK0M1K8k3
$$ -63 -65 -60 -63 -75 -85 -80 -65 -51 -45 -41 -35 -31 -38 -58 -85 -104 -100 -70 -35 -17 -18 -19 -11 -9 -26 -51 -64 -63 -55 -44 -28 -12 -10 -25 -47 -63 -63 -47 -30 -24 -22 -2 39 67 44
3643D4n9m8j0RjqKK0L0L0K3J3NNJj1k1k1j3j2j2pQJ7J4Jj1j6j0KPNJ0K7M0K8%j6j5qqpMJ3
$$ 44 -15 -63 -73 -64 -65 -73 -71 -51 -21 9 32 45 50 55 56 45 24 3 -10 -22 -34 -41 -33 -16 -2 -1 -12 -28 -38 -36 -29 -24 -14 13 53 81 81 65 50 42 34 27 31 44
3624D4Pj2k8k6pJ2K1J9Lk0l9l7rK2K7QkJ2K7K0lj4nOMqj7j5lROrk7l1l0l0l2l0k4rJ7M5M7
$$ 44 51 39 11 -15 -22 -10 11 30 33 13 -26 -63 -72 -50 -23 -15 -17 -5 22 42 39 25 20 26 30 22 5 -10 -13 -4 2 -7 -34 -65 -95 -125 -157 -187 -211 -220 -203 -158 -111
3605a11K2KPK3K6J5RQLnqjJjpk1m3n2l3%J9J5MLJ0J6J8J1LMJ4J4lk1k5j5j2j7j5qqj2nJ3K7
$$ -111 -89 -87 -80 -57 -31 -16 -7 1 4 -1 -9 -10 -9 -10 -17 -38 -81 -133 -166 -166 -147 -132 -128 -125 -115 -99 -81 -70 -67 -63 -49 -35 -38 -59 -84 -99 -111 -128 -143 -151 -159 -171 -176 -163 -136
3586a36K8K7K0J0mj4k3k7j6OJ6ol2k5JNj4k0NL0L3J9J3J6J9J9J0qj7JL0K7j2m7m5j6J1K9L8
$$ -136 -108 -81 -61 -51 -55 -69 -92 -119 -135 -129 -113 -119 -151 -176 -175 -170 -184 -204 -199 -169 -136 -117 -104 -88 -69 -50 -40 -48 -65 -64 -34 -7 -19 -66 -111 -127 -116 -87 -49
3569d9L3Rj0qjmj5j4jJ2K2K9L0J6pk3k6k6j8oJ0K0K0R%JJ7K5J3j1j9j1pj3j5onj1rNJ1KjP
$$ -49 -16 -7 -17 -25 -26 -30 -45 -59 -60 -48 -26 3 33 49 42 19 -7 -33 -51 -57 -47 -27 -7 2 2 3 20 45 58 47 28 17 10 -3 -18 -24 -29 -40 -49 -44 -33 -31 -32 -25
3550b5J3LnLOj3l6l5j9j3j6j3onqkJ3J9K2L0L6K3j3m3m5k0J6M3N3M3K6Oj0k1j7mMnj6j7mR
$$ -25 -12 -9 -14 -11 -5 -18 -54 -89 -108 -121 -137 -150 -156 -161 -169 -171 -158 -139 -117 -87 -51 -28 -41 -84 -129 -149 -133 -90 -37 6 32 38 28 7 -10 -14 -10 -15 -31 -48 -52 -43
3532d3K4L1K3jk3k0qmqj3j5j2mNJj9l2k2%N%KJ4J8J5J8K7K9J3oj9k3j3MJ6Oj7l3l2j7mNRJ9
$$ -43 -19 12 35 34 11 -9 -17 -21 -29 -42 -57 -69 -73 -68 -67 -86 -118 -140 -140 -135 -135 -133 -119 -101 -86 -68 -41 -12 1 -5 -24 -47 -60 -56 -40 -34 -51 -84 -116 -133 -137 -132 -123 -104
3512a04L9N3M3J4pqqk1k8j6MPoj2pMJ8L9M9K4k3m7l6j3mpj3j2j0j5k3j6J0L0J5k7m1j1K8K8
$$ -104 -65 -12 31 45 38 30 22 1 -27 -43 -39 -32 -38 -50 -57 -53 -35 4 53 77 54 7 -29 -42 -46 -53 -66 -78 -88 -103 -126 -142 -132 -102 -87 -114 -155 -166 -138 -110
3495a10kk7l6l5j1L6P1N5J4lJ4K1NrkMkojlk0j9QL5L2Rj3k0j8pONqk1k2j7mK1M5L9Rj8j8r
$$ -110 -112 -139 -175 -210 -221 -185 -114 -59 -45 -48 -34 -13 -8 -17 -19 -15 -17 -23 -24 -27 -47 -66 -58 -23 9 18 5 -15 -33 -40 -34 -29 -37 -58 -80 -97 -101 -80 -35 4 13 -5 -23 -32
3476c2mjJ2K6L1K4J3mk1l2l5l6l0pK4L9L1J1%npj0j5k3k3%K8L2J4KJlj8k9l4m0m6l0JK2K5
$$ -32 -36 -37 -25 1 32 56 69 65 44 12 -23 -59 -89 -96 -72 -33 -2 9 9 4 -3 -13 -28 -51 -74 -74 -46 -14 0 2 3 0 -18 -47 -81 -121 -167 -197 -196 -174 -149
3458a49K8M0M0K6J5J5J3kj7k7m4n0k2K7M4J3k0j6LPjKN%%J9L0J4rqJ0J8J5J0pl3m8l1mMjK
$$ -149 -121 -81 -41 -15 0 15 28 26 9 -18 -62 -112 -134 -107 -63 -50 -70 -86 -83 -76 -77 -75 -70 -70 -70 -51 -21 -7 -16 -24 -14 4 19 29 22 -11 -59 -90 -94 -90 -91 -89
3440h9Kj0k1mK4L1K2K1K4J6QK2L9L1lk5k2j8j1J0L5L5Mk8l3k6j6j0pj6k5j5QJ9J0jNK0L4L7
$$ -89 -87 -97 -118 -122 -98 -67 -45 -24 0 16 24 46 85 116 113 88 66 48 37 47 82 117 121 93 60 34 18 8 1 -15 -40 -55 -47 -28 -18 -19 -14 6 40 77
3423G7J9j1k8j9%kj7k1j2l%RJ7K1J4RLj4k8k2n%oqlk%J2K0J3PK5M7L5kj8mLqj4JPj0k4k1j6
$$ 77 96 85 57 38 38 36 19 -2 -14 -17 -17 -8 9 30 44 53 56 42 14 -8 -13 -13 -19 -27 -30 -32 -32 -20 0 13 20 45 92 127 125 107 103 106 98 84 85 92 82 58 37 21
3403B1k8l8k8kJ8K7K5Qj0j1MRJJJ5J8jk0j8rpnLRlj0kJ3J5Omk1l3k3RL5L4J7Pnk2k6oQpl3
$$ 21 -7 -45 -73 -75 -57 -30 -5 3 -7 -18 -14 -5 -4 -3 12 30 29 9 -9 -18 -25 -30 -27 -18 -21 -31 -33 -20 -5 1 -3 -24 -57 -80 -71 -36 -2 15 22 17 -5 -31 -37 -29 -36 -69
3383f9l3pK0L6M6L9J1k4l1j4KjoojnoJROj1k5k0JJ8J6J0K1L2K7LmJ2K5J0j8l1k0lLjlRL4M8
$$ -69 -102 -109 -89 -53 -7 32 43 19 -12 -26 -24 -25 -31 -37 -38 -43 -49 -48 -39 -33 -44 -69 -89 -88 -70 -54 -44 -23 9 36 39 35 47 72 82 64 33 13 10 13 12 9 18 52 100
3363A00L1pl4l9l1j8jJ6J2pk1j6nJ1L0M5K7j4m0k7pj0j9j1PJ3O%nj5j7mRP%lqj9j1K8O6O6
$$ 100 131 124 90 51 20 2 1 17 29 22 1 -15 -20 -9 21 66 93 79 39 12 5 -5 -24 -35 -28 -15 -9 -9 -14 -29 -46 -50 -41 -34 -34 -37 -45 -64 -75 -47 19 85
3345H5L3QNOnj6j8j1lnk0l3k3NJ9Nj3qM%j2j0qk3m1l1MK3J2l%RJ4J8K6L0L2K7J3j7m8n2k7
$$ 85 118 126 131 137 132 116 98 87 84 79 59 26 3 8 27 32 19 11 15 15 3 -7 -15 -38 -79 -110 -106 -83 -71 -74 -74 -65 -51 -33 -7 23 55 82 95 78 30 -22 -49
3326d9J0L3L3J7Jklk3n4o2k7J3J6llK0K9J6KLPJ0J9L7L7J4qj5j4j1mRJ2lj8j7qjkj0j9k7k1
$$ -49 -39 -6 27 44 45 43 40 17 -37 -99 -126 -113 -97 -100 -103 -83 -54 -38 -36 -33 -26 -16 3 40 77 91 83 68 54 43 39 48 60 57 39 22 14 13 11 1 -18 -45 -66
3308f6j0lJJ1K2K0Mj0j5j2nNJ0QJ0K1K3Lk3l1k0j2mJ3K9J7j3l3l5l4k3RM6N2K2j3k5k3k0j0
$$ -66 -76 -79 -78 -67 -45 -25 -21 -31 -46 -58 -63 -58 -48 -40 -30 -9 14 17 -6 -37 -57 -69 -73 -60 -31 -14 -27 -60 -95 -129 -152 -143 -97 -45 -23 -36 -61 -84 -104 -114
3291a14OK3L4L6J5k2n1l8nNqj0J5L0K0LLQRJ4K4K4J2%kj1k9l5j2J3J0prRK4K7J8LoJR%k7l5
$$ -114 -108 -85 -51 -15 0 -22 -73 -111 -116 -111 -119 -129 -114 -84 -64 -61 -58 -50 -41 -27 -3 21 33 33 31 20 -9 -44 -56 -43 -33 -40 -49 -40 -16 11 29 32 26 27 36 36 9 -26
3271b6j8PJ5J3J7L0L7L4K1Kj4rQNk1m2l9k7l0l0j9kNJ1K4K8J5MJ2L0L3K4J5Lk0l7l2rPRJj1
$$ -26 -44 -37 -22 -9 8 38 75 109 130 132 118 109 117 122 101 59 20 -7 -37 -67 -86 -88 -83 -72 -48 -20 -5 -1 11 41 74 98 113 116 96 59 27 18 25 34 35 24
3253B4k5l6l2j2J3L4L5J2k3l8j8J0K1J6J2J8K7K9J8mj8j4lnk0k2j8k3k8qK7L5Rj7j8j3j4k
$$ 24 -1 -37 -69 -81 -68 -34 1 13 -10 -48 -66 -56 -35 -19 -7 11 38 67 85 81 63 49 46 41 21 -1 -19 -42 -70 -78 -51 -16 -7 -24 -42 -55 -69 -71
3237g1K7M6L5J7J1Jk5l6pK2J4j9l5k9j7j2nmj4j4OK0J0ol%j9m0k7J1L2K4J2MNJ9M4M7J7k0
$$ -71 -44 2 37 54 65 66 41 5 -2 20 34 15 -20 -49 -66 -78 -83 -87 -101 -115 -109 -89 -79 -85 -88 -88 -107 -147 -174 -163 -131 -107 -95 -91 -86 -67 -23 24 41 21
3219B1j8NQqpJ4K2RKRJ4QJ2K0Qk5m6l9j7mOJ4K1K2J9Ok1m2l8k7k7l8l0lJ2KrnJ1K6L5L9L9
$$ 21 3 8 16 8 1 15 37 46 48 57 71 79 91 111 119 94 48 9 -8 -12 -6 8 29 51 70 76 55 13 -25 -52 -79 -117 -147 -150 -138 -136 -145 -150 -139 -113 -78 -39 0
3201@L5K6lm2n1k3J5K0ONJ1LmLJ8Mk7l7j6kplJ4J6kk0j9j2o%Jrj7KK9K3j0k9j1J3J7J2J1J2
$$ 0 35 61 58 16 -35 -58 -43 -23 -17 -12 -1 2 -2 1 19 23 -4 -41 -57 -59 -66 -69 -55 -39 -41 -61 -80 -92 -98 -98 -97 -106 -123 -121 -92 -69 -79 -108 -119 -106 -89 -77 -66 -54
3182e4J2J7J9kl1l9k4j4j0J0L5L5Kk6k8k0j0OJ8Qj8j8OJ0j7l2nL3M3L6K8J8ONJ3Pk9n3l2J
$$ -54 -42 -25 -6 -8 -39 -78 -102 -116 -126 -116 -81 -46 -44 -70 -98 -118 -128 -122 -104 -96 -114 -132 -126 -116 -133 -165 -170 -137 -94 -58 -30 -12 -6 -1 12 19 -10 -63 -95 -94
3164i4J0JKJ5J3kj8j9rJ2K5J8KMK9L8J3k3l3k3j0LJ4J5OJLkk0l4l4l3l1j5J8M0M4M3M2K6%
$$ -94 -84 -83 -81 -66 -53 -55 -73 -92 -101 -89 -64 -46 -44 -40 -11 27 40 17 -16 -39 -49 -46 -32 -17 -11 -10 -7 -9 -29 -63 -97 -130 -161 -176 -158 -118 -74 -31 11 37 37
3147C7lK2L4Rk4l5l3l2k4KJ9J7J2K6L6K6J5J5Pj3k6j7rj6j9mJ1OMJ5J3j2k8j0Qpk5j5J5K0
$$ 37 34 56 90 99 75 40 7 -25 -49 -47 -28 -11 1 27 63 89 104 119 126 113 87 70 61 45 26 22 33 39 43 58 71 59 31 21 29 22 -3 -18 -3 17
3129A7J1NMj5l2k7mP%j3k6l0rL5N9L9Ol%j0k4k1j1j6j9%J6Lj8j3RJ0mlJ4K0J3RKj7l1j4J4
$$ 17 28 33 37 22 -10 -37 -41 -34 -34 -47 -73 -103 -112 -77 -18 21 27 24 24 14 -10 -31 -42 -58 -77 -77 -61 -58 -76 -89 -80 -70 -74 -77 -63 -43 -30 -21 -19 -36 -67 -81 -67
3111f7K1J7K2K7J1j1j1Jqk3k5j5j3oK2M5K9mj2OJ8J0POknJ2K6Ml0l4oQKJNpk4j8LOnjJ7J3
$$ -67 -46 -29 -7 20 31 20 9 10 2 -21 -46 -61 -74 -80 -58 -13 16 12 0 6 24 34 41 47 45 40 52 78 82 52 18 12 20 22 23 28 21 -3 -21 -18 -12 -17 -18 -1 12
3091A2kjJ0lk9l2lJ3QJ1K0Rj8k7j4j2k9l1jK4K8K6K6J4oj2pj3k4j2K0L3J5mqpjK0L7K2j6l0
$$ 12 10 9 19 16 -13 -45 -48 -35 -27 -16 4 13 -5 -32 -46 -58 -87 -118 -119 -95 -67 -41 -15 -1 -7 -19 -26 -39 -63 -75 -55 -22 -7 -11 -19 -26 -27 -7 30 52 36 6
3073Fj0NJ3K7M2L2KoJ0Rj6k7j9j6k7j7QJ8PPK0Rk6m0k1rj2pJ4J3j7l8k5oNK5M5L2ok9k1j2
$$ 6 -4 1 14 41 83 115 117 111 121 130 114 87 68 52 25 8 16 34 41 48 68 77 51 11 -10 -19 -31 -38 -24 -11 -28 -66 -91 -97 -92 -67 -22 10 4 -25 -46 -58
3055e8rJ0L3J8k3k7J3L5J0j1NK3J8RJ9K5J3RJ8Pk8m2k3rj6nL2M8J6k1l1l3l6j9J6K6MqMkk9
$$ -58 -67 -57 -24 -6 -29 -56 -43 -8 2 -9 -4 19 37 46 65 90 103 112 130 137 109 67 44 35 19 14 46 94 110 89 58 25 -11 -30 -14 12 16 8 12 10 -19
3037a9k7J8M3J8j4j9k7m9l8J4L8Ok6j3Jk0k3J6M6J7j7PM7M1J2NJ6J1JKnl4m3j2J6nl4k5MJ8
$$ -19 -46 -28 15 33 19 0 -27 -76 -114 -100 -62 -56 -82 -95 -94 -114 -137 -121 -75 -58 -75 -68 -21 20 32 37 53 64 65 67 62 28 -15 -27 -11 -16 -50 -75 -71 -53
3020e3K6L8K4j8l0QL6J9nQK4J0kJ8K7kk5j4j4m8n6j5J3j4l5KL8J3j1K5O8M3rj4Plk2%L2K6
$$ -53 -27 11 35 17 -13 -5 31 50 45 53 77 87 85 103 130 128 103 89 75 27 -29 -44 -31 -45 -80 -78 -40 -27 -38 -13 55 98 89 75 82 79 57 57 89 115
3002A15RK3L1lk6OM4L3J2K9L9nm3j2L6K4j3qMk5m4NO3M6j1k6j5l4n4k8Krj9K4O7M4J1K9N5
$$ 115 124 147 178 175 149 155 199 232 244 273 312 307 264 252 288 312 299 291 295 270 226 231 294 340 329 303 288 254 200 172 174 165 146 170 237 281 292 321 376
2985C76K9pOK1pj7L3O7L3PN6J00O8L1M9N1MJ0J10J89K06L02N33P92J126J702K227J896L92
$$ 376 405 398 404 425 418 401 434 501 534 541 597 697 765 796 845 896 900 910 1020 1209 1415 1717 2250 3042 4168 5870 8097 9993 10385
2973A0385j401k254j962j290q45n75l27j87j81j39k4Po5o7K1M8oOO9M3l3jR4Q2J0N5J65J63
$$ 10385 8984 6730 4768 3478 2633 2058 1731 1544 1363 1224 1200 1207 1142 1075 1096 1144 1138 1144 1213 1256 1223 1222 1316 1398 1408 1463 1628 1791
2961A791J19J94K73J77Q0K27M52N12O27J103J759K484L831N877O822M426q30n500o784n266
$$ 1791 1910 2104 2377 2554 2634 2861 3313 3825 4452 5555 7314 9798 13629 19506 26328 30754 29924 24424 17640 12374
2952A2374l342k225j552r58o19n20l75j79j37j69p2M1k0j14m4M2k9p6O0J64P5L6K10L46K85
$$ 12374 9032 6807 5255 4297 3678 3158 2783 2604 2467 2298 2226 2267 2247 2133 2089 2131 2102 2026 2086 2250 2325 2361 2571 2917 3202
2941C202L02M97N13K72K54O34R32J032J543K661L915N672R066J2919J2737N479n453j2793
$$ 3202 3504 4001 4514 4786 5040 5674 6606 7638 9181 11842 15757 21429 30495 43414 56151 61630 56177 43384
2933D3384j3037r150n675l895k703j642j120r93p16l53k78l43k19n1q6j50m5L7n4r1M7J11
$$ 43384 30347 21197 15522 11627 8924 7282 6162 5169 4453 4100 3822 3479 3260 3209 3123 2973 2928 2965 2911 2820 2867 2978
2924B978J4M4K52L25K32L05N21N03L40N14R46J159J382K265L649N146P735J2246J5779J2817
$$ 2978 2992 3036 3288 3613 3845 4150 4671 5174 5514 6028 6974 8133 9515 11780 15429 20575 28310 40556 56335 69152
2915F9152K043j0206j5981j3919r048n757m136k752j599j185j069o98l62m12m96k96j05j66
$$ 69152 71195 60989 45008 31089 22041 16284 12148 9396 7797 6612 5543 4845 4483 4071 3575 3279 3174 3008
2907C008k02m2M5o2q7N0Q1k0K9K32K90K10K67L99L67L36N84Q95J010J334K282L530N036P840
$$ 3008 2806 2764 2809 2747 2660 2710 2791 2771 2800 3032 3322 3532 3799 4198 4565 4901 5485 6380 7390 8724 11006 14536 19572 27412
2897B7412J1818J3380Q364k104j1271j3684j0481o517m352l168k003j225j062r18n14k83l80
$$ 27412 39230 52610 60974 58870 47599 33915 23434 16917 12565 9397 7394 6169 5107 4189 3675 3392 3012
2890C012l88j79r9k17k03rN6n6p8J9K0n5oR8O2k0O1J97J98J86L33M95N61P88J336K005K912
$$ 3012 2624 2445 2346 2129 1926 1917 1973 1917 1839 1858 1878 1823 1817 1915 1977 1957 2018 2215 2413 2599 2932 3427 3988 4776 6112 8117 11029
2878A1029M572O441O299K601k909o511o484m468k796j986j389q32n95n66m12k10k05k78j92
$$ 11029 15601 22042 28341 30942 28033 21522 15038 10570 7774 5788 4399 3567 2972 2406 1994 1784 1579 1301 1109
2870A109m5m4r7l8L1k5q6k1M8j0p7l2K6mk4L9O9J3J2J21K00K10L13N53Q04J135J723K223J809
$$ 1109 1064 1020 923 885 916 891 805 784 832 822 745 713 739 735 711 750 819 832 844 965 1165 1375 1688 2241 3045 4180 5903 8126 9935
2857I935K53j481k237j909j271q66o32m17k78k30j73q6o4r3p0rll9k1K3ko4o6k3k5m6j5J9
$$ 9935 10188 8707 6470 4561 3290 2424 1792 1375 1097 867 694 608 544 451 381 372 369 330 309 332 330 266 200 177 152 106 91 110
2845A10k0q0n3K5M6K4L6O0K4l1k9Pnk9J1P0M9k3m2j5j5l5rM1L7j2l2k5l6m3MO5O6K9K5L4k
$$ 110 90 10 -43 -18 28 52 88 148 172 141 112 119 114 85 96 166 215 192 150 135 120 85 76 117 154 142 110 85 49 6 10 75 141 170 195 229 227
2829B27n1m2PK1LRL0J6j1kJ3j7n3k3L4L4j6l5j7j8l6k2Qkk9j5K5K6omK1J1l4m8k6j8k1JL2
$$ 227 176 134 141 162 165 174 204 220 209 207 220 203 150 127 161 195 179 144 127 109 73 51 59 57 28 13 38 64 58 54 75 86 52 4 -22 -40 -61 -60 -28
2812b8J8j8j5K1K7JlJ5%m3n9l3oQM2P8O8J7j7j9k7m4l9j8j7k8j0K0J3j8j7J1J6JPL2K6KJ4
$$ -28 -10 -28 -43 -22 5 6 3 18 18 -25 -84 -117 -123 -115 -73 5 73 90 73 54 27 -17 -56 -74 -91 -119 -129 -109 -96 -114 -131 -120 -104 -103 -96 -64 -38 -36 -22
2795b2N8O4J9j9k1k1k9j7OJk8l1jJ1j4k6j3oj4oJ7J8pj4MOj2j1J8K8J2OJ4lm3n8l2pkQK5J7
$$ -22 36 100 119 100 79 58 29 12 18 19 -9 -40 -41 -30 -44 -70 -83 -89 -103 -109 -92 -74 -81 -95 -91 -85 -97 -108 -90 -62 -50 -44 -30 -33 -76 -134 -166 -173 -175 -167 -142 -125
2777a25oON0O6L1LMjk8m3j6J3J0jQJ5QOJ8K0mk0j2nj4j1J4K0pm1m8m4l9j1L9O7N2K2Mj7m2
$$ -125 -131 -125 -75 -9 22 25 29 28 0 -43 -59 -46 -36 -37 -29 -14 -6 0 18 38 34 14 2 -3 -17 -28 -14 6 -1 -42 -90 -134 -173 -184 -145 -78 -26 -4 0 -17 -59
2759e9m2oL0L6K9K5J4rj7jNnj1npk3j8PJ7%nJ7K6MnJ5L3J3j7k2j6j5rJ6K4NoJ7K7j0n8o2l7
$$ -59 -101 -107 -77 -41 -12 13 27 18 1 0 5 0 -11 -16 -23 -46 -64 -57 -40 -40 -45 -28 -2 2 -3 12 45 58 41 19 3 -12 -21 -5 19 24 18 35 62 52 -6 -68 -105
2740a05k5k1RN2O3L1MKJ8K9K5Oj3j9j0oj3j4mloJK8L9K4RPkk5l1j6j3l7n0k3NMkJ6L3J5j0
$$ -105 -130 -151 -142 -90 -27 4 8 10 28 57 82 88 75 56 46 40 27 13 9 6 0 1 29 68 92 101 108 106 81 50 34 21 -16 -66 -89 -84 -80 -82 -66 -33 -18 -28
2722b8oJ3J6PPR%nJ0K3J5NJ5K2Jj9j4nk3n4n5k9oQK7M0K6PPJ7J3KLLj6l8l5j6qnJ0K0Kk7l1
$$ -28 -34 -21 -5 2 9 18 18 13 23 46 61 66 81 103 104 85 71 66 43 -11 -66 -95 -101 -93 -66 -26 0 7 14 31 44 46 49 52 36 -2 -37 -53 -61 -66 -56 -36 -34 -61 -92
2703i2j6qqNK0J5jKJ3J0kKRql6l8j8oqMK7L1J6J0J8J7J%J9K9J4j3l8n2l9KM0M0Rj2j1mJQJ2
$$ -92 -108 -116 -124 -119 -99 -84 -85 -83 -70 -60 -62 -60 -51 -59 -95 -133 -151 -157 -165 -161 -134 -103 -87 -77 -59 -42 -41 -41 -22 7 21 8 -30 -82 -121 -119 -79 -39 -30 -42 -53 -57 -56 -48 -36
2683c6MKK1L9L2J0OJ1ol5l2kJ0j7m2l7j7JJ9L9M3K6Lpj0pjM%OK4L1mn2o1k8LQPPpl3l4mJ7
$$ -36 -32 -30 -9 30 62 72 78 89 83 48 16 14 24 7 -35 -72 -89 -88 -69 -30 13 39 42 35 25 18 17 21 21 27 51 82 78 26 -35 -63 -60 -52 -45 -38 -45 -78 -112 -116 -99
2664i9OqKK5L1J8%j5j4KJ8Qj1qJ9M0M2L4K0kj9oJ3Lk7k8LJ8kj7pKmjK5L9J5j2j1%j1k9k4r
$$ -99 -93 -101 -99 -74 -43 -25 -25 -40 -54 -52 -34 -26 -37 -45 -26 14 56 90 110 108 89 83 96 99 72 44 47 65 63 46 39 41 37 36 61 100 115 103 92 92 81 52 28 19
2645A9mkJ3K1Mk8l1oK2L1K0Npj0j1j6k1j4PJ9J7J3J0ql1l1lK4K8K0J8J3mk0k0j2nKJ0Mj8l2
$$ 19 15 13 26 47 51 23 -8 -14 8 39 59 64 57 47 36 20 -1 -15 -8 11 28 41 51 43 12 -19 -22 2 30 50 68 81 77 57 37 25 20 22 32 36 18 -14
2626a4k2%J1J2RJqmOKj1j1RJ5KlJ4K8J8QK0K1j2m9m6j8KMMMjjRRrk0JL0L3J2KLkpLPj4m4m1
$$ -14 -36 -36 -25 -13 -4 -3 -11 -15 -9 -7 -18 -29 -20 -5 -3 -6 8 36 54 62 82 103 91 42 -4 -22 -20 -16 -12 -8 -9 -10 -1 8 -1 -21 -20 10 43 55 57 60 58 51 54 61 47 3 -38
2605c8rK1K4K3K9L7L7L1J2k1m6m0k1j5j5kRol4l5%K9K8J2%j6m0m9l5qJ9L4L6K2PRK2K8J8O
$$ -38 -47 -26 -2 21 50 87 124 155 167 146 100 60 39 24 9 7 16 10 -24 -59 -59 -30 -2 10 10 -6 -46 -95 -130 -138 -119 -85 -49 -27 -20 -11 11 39 57 63
2588F3Jjnnqk4m1l9j8%J2K7L7K9QlJKpj0moj8k7j4MJ5J7J0pk8k8jK8L2J2mqopj1j5j1olj0
$$ 63 64 63 58 53 45 21 -20 -59 -77 -77 -65 -38 -1 28 36 33 34 36 29 19 15 9 -9 -36 -50 -46 -31 -14 -4 -11 -39 -67 -68 -40 -8 4 0 -8 -14 -21 -32 -47 -58 -64 -67 -77
2568g7j1%J4J6R%ljRK4L0K0Nj0k6m7m4nM3N8L4Mj4j8j7j2oqj0KJ6Qj3k2j4kkpj3j4NL8N6L6
$$ -77 -88 -88 -74 -58 -49 -49 -52 -53 -44 -20 10 30 35 25 -1 -48 -92 -97 -54 4 38 42 28 10 -7 -19 -25 -33 -43 -41 -25 -17 -30 -52 -66 -68 -70 -77 -90 -104 -99 -61 -5 31
2549C1%j6mRPMMlj8k5k6k7k7j5RJ7PJQJ3Onj2j5j5j1nmkJ0J7RkMRnk5j9OQpkL3N1L1QJ3K5
$$ 31 31 15 11 20 27 31 35 32 14 -11 -37 -64 -91 -106 -97 -80 -73 -72 -64 -51 -45 -50 -62 -77 -92 -103 -108 -112 -114 -104 -87 -78 -80 -76 -67 -72 -97 -116 -110 -102 -109 -111 -78 -27 4 12 25 50
2528E0J3rk0k2j9mK1L2Rj9j7MJ4PKLK%jjrj5j8k0k2j2KPmpMJ2PPK2L1J2j7k8j7nKJnj6k3k5
$$ 50 63 54 34 12 -7 -11 10 42 51 32 15 19 33 40 42 45 47 47 46 45 36 21 3 -17 -39 -51 -49 -42 -46 -53 -49 -37 -30 -23 -1 30 42 25 -3 -20 -25 -23 -22 -27 -43 -66 -91
2508i1k4j7QL8L6%l1k0QJ9J1J3K4K3Mqj4j3j3j8k7l3k1PK4J5KJKrrJ3L8L5RqqopkORJ5K1J2
$$ -91 -115 -132 -124 -86 -50 -50 -81 -101 -93 -74 -63 -50 -26 -3 1 -7 -21 -34 -47 -65 -92 -125 -146 -139 -115 -100 -98 -97 -95 -104 -113 -100 -62 -27 -18 -26 -34 -40 -47 -49 -43 -34 -19 2 14
2488A4j6l6k2KNlLJ8K5K4L5L9J3k8m5l1k1j9j1NJ0lj0jRJ3K1K7K1jj4j3k0m0m1j7K%qMK0K8
$$ 14 -2 -38 -60 -58 -53 -56 -53 -35 -10 14 49 88 101 73 28 -3 -24 -43 -54 -49 -39 -42 -52 -53 -44 -31 -10 17 38 37 23 10 -10 -50 -91 -108 -106 -106 -114 -110 -90 -62
2470f2K6K7K1MrmPMj4k1j2MOoj7j0J0K4K1RNMJPK2L3K7J2POkj4j4mOJ1J8K0Oj1j9k0k7l6k5
$$ -62 -36 -9 12 16 7 3 10 14 0 -21 -33 -29 -23 -29 -46 -56 -46 -22 -1 8 13 17 18 25 47 80 107 119 126 132 130 116 102 98 104 115 133 153 159 148 129 109 82 46 21
2450B1kP%mok3m7m1lJ8Jk1j3J1K1K1K3K4J8J7K5L4K4Lj3j9k2k5l2m3m6k9MK6K2Mj3k5k9j3
$$ 21 19 26 26 22 16 -7 -54 -95 -98 -80 -79 -100 -113 -102 -81 -60 -37 -13 5 22 47 81 105 108 95 76 54 29 -3 -46 -92 -121 -117 -91 -69 -65 -78 -103 -132 -145
2433a45J4K5J3KJ3L1L2K3K1K3J9J3J4J2knK3N8N3Jn2o1l0QK3J5ok6m0m8m3k3RK7K5J2MJkM
$$ -145 -131 -106 -93 -91 -78 -47 -15 8 29 52 71 84 98 110 108 103 126 184 237 238 186 125 95 103 126 141 135 109 69 21 -22 -45 -36 -9 16 28 32 33 31 35
2416C5K1L8L7J5j2k5k4k0j8k2k2j5j0rqjMNMJ1J6Lj9l0k1o%QK0L0K8J9RjmOJ0j0m7n8k9J1
$$ 35 56 94 131 146 134 109 85 65 47 25 3 -12 -22 -31 -39 -40 -36 -31 -27 -16 0 3 -16 -46 -67 -73 -73 -65 -45 -15 13 32 41 40 36 42 52 42 -5 -63 -92 -81
2398h1K9K6J9Oj9m2m1k3j0pkNJ4K6L6K6jk5k4oNkj1j8j6mJ2J7RLRJ1j1l7m0j0L2N8N8L6J5
$$ -81 -52 -26 -7 -1 -20 -62 -103 -126 -136 -143 -145 -140 -126 -100 -64 -38 -39 -64 -88 -94 -89 -91 -102 -120 -136 -140 -128 -111 -102 -99 -90 -79 -90 -127 -167 -177 -145 -87 -29 7 22
2380B2LKnj5oJ4J6j5l8k0K5M2K6Llnj2j7j2lQJ6J5nk8l3k4j6j1mNKrj1MK0K2J0pj8j5JJ5J8
$$ 22 25 27 22 7 1 15 31 16 -22 -42 -17 25 51 54 51 46 34 17 5 2 10 26 41 36 8 -25 -49 -65 -76 -80 -75 -73 -82 -93 -89 -69 -47 -37 -44 -62 -77 -76 -61 -43
2361d3J1Mj0l1m3k7LK0J4%qr%J3K0Rj0k4k9k5j2KKj1j2J1K9J9mjJ8J8kj1NK0J9J5Rmj8j6N
$$ -43 -32 -28 -38 -69 -112 -139 -136 -116 -102 -102 -110 -119 -119 -106 -86 -77 -87 -111 -140 -165 -177 -175 -173 -184 -196 -185 -156 -137 -141 -142 -124 -106 -108 -119 -114 -94 -75 -60 -51 -55 -73 -89 -84
2342h4J5NnJ%j4k5j5RK7L0J3j9m3l8mK5K9K2J4Lj3j2OJ5nl4m4l2j4l%rk1j5J0L4M0L3K4Qn
$$ -84 -69 -64 -69 -68 -68 -82 -107 -122 -113 -86 -56 -43 -62 -105 -143 -147 -122 -93 -71 -57 -54 -67 -79 -73 -58 -63 -97 -141 -173 -187 -190 -190 -199 -220 -235 -225 -191 -151 -118 -94 -86 -91
2324i1jK2L7L4K8L4K9Mk7l5k4j1nOJ2Pmrj2k2k3nJ8J9kj7j6rrj2pJ3L7N0L9Ml2m4l1nJ9L3
$$ -91 -92 -70 -33 1 29 63 92 96 69 34 10 -1 -6 0 12 19 15 6 -6 -28 -51 -56 -38 -19 -21 -38 -54 -63 -72 -84 -91 -78 -41 9 48 52 20 -24 -55 -60 -41 -8
2306hL3K4Qpj5j3ook0l4k6JK2K4J6Ppk5k0J3M8N9N5N5N3L0nk7l0k6k5k7l0l2l0j8j1j4j3j
$$ -8 25 49 57 50 35 22 16 10 -10 -44 -70 -69 -47 -23 -7 0 -7 -32 -52 -39 9 68 123 178 231 261 256 229 199 173 148 121 91 59 29 11 0 -14 -27 -28
2288b8Rjj6j3LPoj2KJ9K1QLJ1K5K6J1lrj0k0l0k6nJ1J3OMnj5j7ljj8l5k3LJ3J2K0L6L6J9O
$$ -28 -19 -20 -36 -49 -46 -39 -45 -57 -55 -36 -15 -7 -4 7 32 58 69 66 57 47 27 -3 -29 -34 -23 -10 -4 0 -5 -20 -37 -40 -41 -59 -94 -117 -114 -101 -89 -69 -33 3 22 28
2269B8NN%LJ1J0ok1k0j4j3j4j0mpoNK4L4K7Rpj3j0nJQJ0lk6l0j6kpj4jJ2QoJK1K3%k3k5j9
$$ 28 33 38 38 41 52 62 56 35 15 1 -12 -26 -36 -40 -47 -53 -48 -24 10 37 46 39 26 16 11 12 20 30 27 1 -29 -45 -47 -54 -68 -69 -57 -49 -55 -54 -33 -10 -10 -33 -58 -77
2249g7j5j3j1j0j0mJ0J8K0K5L3L3K3J6J4Kj8k7k3k0k8l4k7j2kOJ7L0L6L3J8lk0j5jjj9l4k6
$$ -77 -92 -105 -116 -126 -136 -140 -130 -112 -92 -67 -34 -1 22 38 52 54 36 9 -14 -34 -62 -96 -123 -135 -137 -131 -114 -84 -48 -15 3 0 -20 -35 -36 -37 -56 -90 -116
2232a16kK1L0J9lj7kK6L4J7kpj1j8k0j5rrmJ1K0J4QJ1J7J4J0QJj2j4%J9K4J5OOQJ4J5Kk4m3
$$ -116 -118 -97 -67 -48 -51 -68 -70 -44 -10 7 5 -2 -13 -31 -51 -66 -75 -84 -88 -77 -57 -43 -35 -24 -7 7 17 25 26 14 0 0 19 43 58 64 70 78 92 107 109 85 42
2214D2l8j9qokQJ7J7J4QQJ7L2L4K5J3Ook5m1m1l3k3j8j4j6k6l0k0qNJ9M1M8L1%j8j8mJ1K2
$$ 42 4 -15 -23 -29 -31 -23 -6 11 25 33 41 58 90 124 149 162 168 162 137 96 55 22 -1 -19 -33 -49 -75 -105 -125 -133 -128 -109 -68 -20 11 11 -7 -25 -29 -18 4
2196DK5J7ROPJ2J9J8ll7o1o0m7l0rJ1J7J2J4K7K8Mk0j8LJ2J1J1J6J8K5L8L9J8j3l5l9l3j9
$$ 4 29 46 55 61 68 80 99 117 114 77 16 -44 -91 -121 -130 -119 -102 -90 -76 -49 -21 -17 -37 -55 -52 -40 -29 -18 -2 16 41 79 118 136 123 88 49 16 -3
2179cjMnj7j3qrmK4M3K7j2k8j5JLRK0J8mk0j0%lj7j9rkMRJ3PMJ6M0N0K7j7n1n2k8lJ2J9K3
$$ -3 -4 0 -5 -22 -35 -43 -52 -56 -32 11 38 26 -2 -17 -16 -13 -4 16 34 30 10 0 0 -3 -20 -39 -48 -50 -46 -37 -24 -17 -13 3 43 93 120 103 52 0 -28 -31 -19 0 23
2160B3J9NkQJ5Kk4l7k8j7lJ3J6jk5l0j5qj7k1j0LL%LKnj0lLQJ8K9K8Qj0mJ6K7J7Jj2j7k0j8
$$ 23 42 47 45 53 68 70 46 9 -19 -36 -39 -26 -10 -11 -36 -66 -81 -89 -106 -127 -137 -134 -131 -131 -128 -126 -131 -141 -144 -141 -133 -115 -86 -58 -50 -60 -64 -48 -21 -4 -3 -15 -32 -52 -70
2140g0rRK2K0Lj3j5oKLnk3l3j7J7K7qm4l1J7M5L4K0K5L0J8Kpk0m0m0j3J3J6J0K0L0J5j5l6
$$ -70 -79 -70 -48 -28 -25 -38 -53 -59 -57 -54 -59 -82 -115 -132 -115 -88 -96 -140 -171 -154 -109 -75 -55 -30 0 18 20 13 -7 -47 -87 -100 -87 -71 -61 -41 -11 4 -11 -47
2123d7l5j9ML3M7L7J3nrppj0j7k1k0j3lQK7M4M8L2J3Jrk0k1rkljPQmnJ7L8K6j1l7l3j6kJo
$$ -47 -82 -101 -97 -64 -17 20 33 28 19 12 5 -5 -22 -43 -63 -76 -79 -71 -44 0 48 80 93 94 85 65 44 35 33 30 29 36 44 40 35 52 90 116 105 68 35 19 17 18 12
2103A2j3j5%J3J2NNJ0QNJ0J3Lj4j8qNJ0J2Pnj4j3rj0nRJ7J0MJ2K4J1j4k3pNPQJ7J4j1l6l6
$$ 12 -1 -16 -16 -3 9 14 19 29 37 42 52 65 68 54 36 28 33 43 55 62 57 43 30 21 11 6 15 32 42 46 58 82 93 79 56 49 54 61 69 86 100 89 53 17
2084A7j7pk1m6n8m3j0K2L7L3J5rk4j9LJ7J0jQK9L5K4Mj2k1pL0N6M5Lk3j9j2j8k2j4%NJ3K9
$$ 17 0 -7 -28 -74 -132 -175 -185 -163 -126 -93 -78 -87 -111 -130 -127 -110 -100 -101 -93 -64 -29 -5 -1 -13 -34 -41 -11 45 90 93 70 51 39 21 -1 -15 -15 -10 3 32
2067C2L3J7JJJj0j4LK2Pl2n7m6k5j8k6k6j3loj1mJ1J8RLJ6M2N4M7L4K2J0jkJ1K1J7%j8l7n0
$$ 32 65 82 83 84 85 75 61 64 86 93 61 4 -42 -67 -85 -111 -137 -150 -153 -159 -170 -174 -163 -145 -136 -133 -117 -75 -21 26 60 82 92 91 89 100 121 138 138 120 83 33
2049C3m8l0kK2K7J6rk5k1j2j7l0k9j6j4k8l0kK7L4K8K3J6rl5k8QL2K0oj5lJ7K7L1K6J3mj4
$$ 33 -15 -45 -47 -25 2 18 9 -16 -37 -49 -66 -96 -125 -141 -155 -183 -213 -215 -188 -154 -126 -103 -87 -96 -131 -159 -151 -119 -99 -105 -120 -123 -106 -79 -48 -22 -9 -13 -27
2032b7pJ3K4K0PKjk0m1m0rJ4Nj1lK1K4Pqnlj6l1l1k4j6r%J1J6J3PK%JjkLJ9L3L4J7qk2k2q
$$ -27 -34 -21 3 23 30 32 31 11 -30 -70 -79 -65 -60 -71 -74 -53 -29 -22 -30 -35 -38 -54 -85 -116 -140 -156 -165 -165 -154 -138 -125 -118 -116 -116 -115 -116 -118 -115 -96 -63 -29 -12 -20 -42 -64 -72
2012g2MOPJ8K7J8oj5jJ5RqrKNqk0j3MJ8K8L2K3PLQJ0Jj0k0l2m6m7k8kJ4K3K5J2j6l9l5j2O
$$ -72 -68 -62 -55 -37 -10 8 2 -13 -14 1 10 2 -7 -5 0 -8 -28 -41 -37 -19 9 41 64 71 74 82 92 93 83 63 31 -15 -62 -90 -92 -78 -55 -30 -18 -34 -73 -108 -120 -114
1993a14RJ1K2M0M6L9K0JnLRJj4k5k8k4k1j1kQJ7K1J7lk3k5lK3L6L0Rj4k9k8j5JOlj9l2l5k7
$$ -114 -105 -94 -72 -32 14 53 73 74 69 72 81 82 68 43 15 -9 -30 -41 -43 -35 -18 3 20 17 -6 -31 -34 -11 25 55 64 50 21 -7 -22 -21 -15 -18 -37 -69 -104 -131
1974a31k0j8j9j4mPJ7L0M3M4K8J1J1K3K6J4mj5k0j4NK8L6J5j5k7k0j3j1nPJ0jj5k2pK3M7M9
$$ -131 -151 -169 -188 -202 -206 -199 -182 -152 -109 -65 -37 -26 -15 8 34 48 44 29 9 -5 0 28 64 79 64 37 17 4 -7 -12 -5 5 4 -11 -33 -40 -17 30 79
1958G9K3j0k5k4k8l4k5kJ0rl3l1kK4L0K3J5J2Nj2l4m4l2oJ0PlKJ9K9K0Kj1j6j0jJmnOJ9K1
$$ 79 102 92 67 43 15 -19 -44 -46 -36 -45 -78 -109 -111 -87 -57 -34 -19 -7 -2 -14 -48 -92 -124 -130 -120 -113 -116 -114 -95 -66 -46 -44 -55 -71 -81 -82 -81 -85 -90 -84 -65 -44
1939d4J6J2Moj1KK5L4K2Jj2j5j6j4j3j3j0pk%mrrmPJ6J7J2PJ1J9K1Pj8m0m4k6NK5K6J7Omj1
$$ -44 -28 -16 -12 -18 -29 -27 -2 32 54 55 43 28 12 -2 -15 -28 -38 -45 -47 -47 -51 -60 -69 -73 -66 -50 -33 -21 -14 -3 16 37 44 26 -14 -58 -84 -79 -54 -28 -11 -5 -9 -20
1920b0rKOpk2j3K0M8M8K5qk9k9j0NKj4l0l0k5j7nJ1K0K3K0J5OKRJ3Lj4j9mJ1J6J8K3J9Nj0
$$ -20 -29 -27 -21 -28 -50 -63 -43 5 53 78 70 41 12 2 7 9 -5 -35 -65 -90 -107 -112 -101 -81 -58 -38 -23 -17 -15 -6 7 10 -4 -23 -27 -16 0 18 41 60 65 55
1902E5j7l0m6m7k3PJ7Opj0lQJ8J6Nrj2j5j5rMJ4NppQK2K2Oj6k5oL1N3L4kk7l2k5k2j7nOJ1
$$ 55 38 8 -38 -85 -108 -101 -84 -78 -85 -95 -98 -90 -72 -56 -51 -60 -72 -87 -102 -111 -107 -93 -88 -95 -102 -94 -72 -50 -44 -60 -85 -91 -60 -7 27 25 -2 -34 -59 -81 -98 -103 -97 -86
1883h6J3J9K6K4Rqk0j4JPKkKRJ1J4K6L8L5J5rk2k0oJpk3k8j4LMnkJ2K7K6J3%nlOJ6K1J9J4
$$ -86 -73 -54 -28 -4 5 -3 -23 -37 -36 -29 -27 -29 -27 -18 -7 7 33 71 106 121 112 90 70 64 65 58 35 7 -7 -4 0 -5 -7 5 32 58 71 71 66 63 69 85 106 125 139
1863A39Jj9m0m4k7mQNpj6k6k9k2rJjj0j4mQJ0RJ5K6K7J9J5K9L6K0j2l0k3j0mqj1j2pkkljJ
$$ 139 140 121 81 37 10 6 14 19 12 -4 -30 -59 -81 -90 -89 -90 -100 -114 -118 -110 -100 -91 -76 -50 -23 -4 11 40 76 96 84 54 31 21 17 9 -2 -14 -21 -23 -25 -28 -29 -28
1844b8rk9l4nL7N2K6rk3j9rkPJ3Rpk1k5j7jJ8L0K7J5PJ5K5J7qk7k0MJ8Mj7j5QL3L3J8J1J6
$$ -28 -37 -66 -100 -105 -68 -16 10 1 -22 -41 -50 -52 -45 -32 -23 -30 -51 -76 -93 -94 -76 -46 -19 -4 3 18 43 60 52 25 5 9 27 31 14 -1 7 40 73 91 102 118
1826A18K0Qj7l6l8l1k4j8nRJ3QLJMQJ5J6Kj6j8olj7k0J4N5P3N7M2M3M9M6L8K5Jl0n7p4p6o3
$$ 118 138 146 129 93 55 24 0 -18 -23 -14 -1 7 10 11 15 23 38 54 56 40 22 16 13 -4 -24 -10 45 118 175 217 260 309 355 393 418 419 389 332 258 182 119
1808A19m0j6lLJ3J6pl7l7jL1K6ok6k4j1kKL%lKJ5K5K6J9J0Kkqj9k5k2j3rj5k3j7lQMllJ1K3
$$ 119 79 63 60 63 76 92 85 48 11 10 41 67 61 35 11 0 -2 0 3 3 0 2 17 42 68 87 97 99 97 89 70 45 23 10 1 -14 -37 -54 -57 -49 -45 -48 -51 -40 -17
1789a7J8MmNQj1m2n4l2MK9L4K7J4RJ3K0J6OLJ2J8J0%j0j8k6k1LK4J9rl9m5k8kJ2Oj1j7j4j6
$$ -17 1 5 1 6 14 3 -39 -93 -125 -121 -92 -58 -31 -17 -8 5 25 41 47 50 62 80 90 90 80 62 36 15 18 42 61 52 13 -32 -60 -62 -50 -44 -55 -72 -86 -102
1771a02k4j9OL1L8L3L3M3N2M4K1qk5k4j5j1j0mONrj5qkj3k5k1ojoj0lQJ7J9Qpj8j2rj9k8j7
$$ -102 -126 -145 -139 -108 -70 -37 -4 39 91 135 156 148 123 99 84 73 63 59 65 70 61 46 38 36 23 -2 -23 -29 -30 -36 -46 -49 -41 -24 -5 3 -4 -22 -34 -43 -62 -90 -107
1752a07NJ3MkOJ6J4MLJ2K2K0Nj3j7nJ2J6Qloqj0pMJ6K7K7J6%j2j9k7l4l4k4j8k2j6QL2L6K5
$$ -107 -102 -89 -85 -87 -81 -65 -51 -47 -44 -32 -10 10 15 2 -15 -20 -8 8 16 13 7 -1 -11 -18 -14 2 29 56 72 72 60 41 14 -20 -54 -78 -96 -118 -134 -126 -94 -58 -33
1733c3K1K2J5oj9j7j3j4j2m%j2k1j7jRNmqmOJ5J4RPRJ3J0N%lnmJNRJ8K0J4mj9k3j7LK9M4M2
$$ -33 -12 10 25 19 0 -17 -30 -44 -56 -60 -60 -72 -93 -110 -111 -102 -97 -101 -109 -113 -107 -92 -78 -69 -62 -53 -40 -30 -25 -25 -28 -33 -37 -36 -31 -22 -4 16 30 26 7 -16 -33 -30 -1 43 85
1713H5K6J5J6J4QNPJj3k9l4l3k9j6PK3K2J4QQKj3k3k3j4nlmlLRjk4l9l2mJ4J1oj6j1%%nnO
$$ 85 111 126 142 156 164 169 176 177 164 135 101 68 39 23 30 53 75 89 97 105 107 94 71 48 34 29 26 22 19 22 31 30 6 -33 -65 -69 -55 -44 -50 -66 -77 -77 -77 -82 -87 -81
1693h1J0jj1j1qj3j7nJ5K7K6L4M7M7K2qj8qJkj5k3j6%RNnkNLj0j6rnlPK1J5qk3pJ4J3mj2j0
$$ -81 -71 -72 -83 -94 -102 -115 -132 -137 -122 -95 -69 -35 12 59 81 73 55 47 48 46 31 8 -8 -8 1 6 1 -1 4 7 -3 -19 -28 -33 -36 -29 -8 7 -1 -24 -31 -17 -4 -8 -20 -30
1673c0j0rJ0L4L8K3Jj2j6j1MJ1j1n0p1n0mL8N4M0Ok2j9OJ8PlQK9L5J9kj1pLJ8K8K1ol4m7l9
$$ -30 -40 -49 -39 -5 33 56 57 45 29 18 22 33 22 -28 -99 -149 -153 -115 -61 -21 -15 -37 -56 -50 -32 -25 -28 -20 9 44 63 61 50 43 46 64 92 113 107 73 26 -13
1655a3l0l1l8l5j4J6M0M7M0K3RPJ2J2jj6j8qkj2k5k7j0J9L6K9J2jKRRKj3k3j8LK4K2KrkNJ
$$ -13 -43 -74 -112 -147 -161 -145 -105 -58 -18 5 14 21 33 45 44 28 10 2 0 -12 -37 -64 -74 -55 -19 10 22 21 23 32 41 43 30 7 -11 -8 16 38 40 31 29 34 35
1636C5lRJ8Rj2k6l3l8l6j5J0J4kj2KK6L9L1Ok2l5k4j0oqOK3K8J7RKqj5nJ1Qj6l5l5k7k1pJ8
$$ 35 32 41 59 68 56 30 -3 -41 -77 -92 -82 -68 -70 -82 -80 -54 -15 16 22 0 -35 -59 -69 -75 -83 -77 -54 -26 -9 0 2 -6 -21 -26 -15 -7 -23 -58 -93 -120 -141 -148 -130
1618a30L2K8K0K6K9J6qk0j3NJ9K7K0Pmnlmpk0l6m7l6pJ9L3M1M6M4L4K8K3Pk2l6k9j8k1k7j8
$$ -130 -98 -70 -50 -24 5 21 13 -7 -20 -15 4 31 51 58 54 49 46 42 35 15 -21 -68 -104 -111 -92 -59 -18 28 72 106 134 157 164 142 106 77 59 38 11 -7
1600gopj1oJ1J7R%jJOK2L6M0L1J1j2l2l9l2k4j3KK0K4J2KPRj1l7l8j6PK5M8O4M5om6m8k7j7
$$ -7 -13 -20 -31 -37 -26 -9 0 0 -1 0 6 28 64 104 135 146 134 102 63 31 7 -6 -4 16 40 52 54 61 70 59 22 -16 -32 -25 0 48 112 157 151 105 57 30 13
1582A3k5l4l1k6j8%K0K9K1Mqj1j4k2l3k9oK5L6K1%j0qmJJ1K4K2OqpLJ1RJj3k7l0k0j1j6k5
$$ 13 -12 -46 -77 -103 -121 -121 -101 -72 -51 -47 -55 -66 -80 -102 -135 -164 -170 -145 -109 -88 -88 -98 -106 -110 -109 -98 -74 -52 -46 -54 -61 -58 -47 -38 -37 -50 -77 -107 -127 -138 -154 -179
1563a79j2J6L3K4J4J7J8ll1l0JK2J3qoJ4L8M9M9M5L4J8pm2o6n6k2J1K0J7J6J8Qj3l4m1k3J6
$$ -179 -191 -175 -142 -118 -104 -87 -69 -72 -103 -133 -132 -110 -97 -105 -111 -97 -59 -10 39 84 118 136 129 87 21 -35 -57 -46 -26 -9 7 25 33 20 -14 -55 -78 -62
1547f2M7L7Jk3j4NOJPJ6Lj7j6KJ5J8J7J2nk8l3k3j8k1j5NJ6PopLPJ1J9J9Nj1j8j9k2k8k4m
$$ -62 -15 22 23 0 -14 -9 -3 -2 5 21 24 7 -9 -7 8 26 43 55 50 22 -11 -34 -52 -73 -88 -83 -67 -60 -66 -73 -70 -63 -52 -33 -14 -9 -20 -38 -57 -79 -107 -131 -135
1528a35J8K5Rj3j8oRPKPK0K2Nj3k4k3rJ2K5J5nj4n%mlPJ7J8K1K8K4OnNK2J8j0l8m4l0KK4J3
$$ -135 -117 -92 -83 -96 -114 -120 -111 -104 -102 -95 -75 -53 -48 -61 -85 -108 -117 -105 -80 -65 -70 -84 -89 -89 -93 -96 -89 -72 -54 -33 -5 19 25 20 25 47 65 55 17 -27 -57 -55 -31 -18
1509a8k5m9k9J6L8L2J6PJqj2j1plOJ3Nj1k1j7oLJ3K4K6J3rl4n3m6j3J8K1jj1MJ7RqoJ5K6K0
$$ -18 -43 -92 -121 -105 -67 -35 -19 -12 -11 -19 -31 -42 -49 -52 -46 -33 -28 -39 -60 -77 -83 -80 -67 -43 -17 -4 -13 -47 -100 -146 -159 -141 -120 -121 -132 -128 -111 -102 -110 -116 -101 -75 -55
1491e5J2J7K4K0J8K6M1L9J5j4k6l0l2k7j2POj3k7k5j2plKJ0Pjm%NPPJ0J3J7J7Nj3j6PL7M5
$$ -55 -43 -26 -2 18 36 62 103 142 157 143 117 87 55 28 16 23 29 16 -11 -36 -48 -55 -58 -56 -46 -39 -40 -44 -44 -39 -32 -25 -15 -2 15 32 37 24 8 15 52 97
1472I7K7QMRJ3Qnk6m1l7j2J4K4K2J6%k5m6n0m0l0j5MJ6RopQK0K1J7J4Kj8k3mJ5J3%LJ3J5P
$$ 97 124 132 136 145 158 166 161 135 94 57 45 59 83 105 121 121 96 50 0 -40 -70 -85 -81 -65 -56 -62 -69 -61 -41 -20 -3 11 13 -5 -28 -32 -17 -4 -4 -1 12 27 34
1454C4RK1K7J3kqrj0qJPPM%npjJ5K1Pj3k9l9m3l6j6lmrmPJ0J4K5L2K2Lqrpo%lk3m7m8k2J3
$$ 34 43 64 91 104 102 94 85 75 67 68 75 82 86 86 81 74 73 88 109 116 103 74 35 -8 -44 -60 -63 -67 -76 -80 -73 -63 -49 -24 8 30 33 25 16 9 3 3 0 -23 -70 -118 -140 -127
1433a27M4O5N8K1k1l7k4j4j6j4MK7L6K8Jk7k7NM2M7K6Olj6j5J0M0L9L3N4Q1O9N0R0J78K62
$$ -127 -83 -18 40 61 40 3 -21 -35 -51 -65 -61 -34 2 30 31 4 -23 -18 24 71 97 103 100 84 69 79 119 158 191 245 326 395 445 535 713 975
1417I75L90O71R81R48L69m49r52r22o23l89k81j99j12o9o7n6l3l1m3m2k8k5j8QL8K4j4k5N
$$ 975 1365 2036 3017 3965 4334 3885 2933 2011 1388 999 718 519 407 338 271 215 182 151 108 66 38 13 -5 3 41 65 51 26 31
1405C1L2K5Jk0m1o1o6l8ML9N0M4L3K9K6J3j1k9k8j2OJ5J9J5Jj5k3k4k2j5lPLmkJ2K7L3K5K
$$ 31 63 88 89 69 28 -33 -99 -137 -133 -94 -44 0 33 62 88 101 90 61 33 21 27 42 61 76 77 62 39 15 -7 -22 -25 -18 -15 -19 -21 -9 18 51 76 78
1387G8k6m2l8k0kJ2J7K1K0K3J8Lk0l2k5j1%NJ0J1J2J4J5J0qk2j9qnmMJ7K9L3K9J3j4l3l1j7
$$ 78 52 10 -28 -48 -50 -38 -21 0 20 43 61 64 44 12 -13 -24 -24 -19 -9 2 14 28 43 53 45 23 4 -4 -9 -13 -9 8 37 70 99 112 98 65 34 17
1370A7pn%Nlk3l6j6K4N4N8L3nk6k6j2kLLJjnrj9k6j9MK0J3%NK2L1K5J5Kk5m7l9nK1J2j2k3
$$ 17 10 5 5 10 7 -16 -52 -68 -44 10 68 101 96 70 44 32 30 33 36 37 36 31 22 3 -23 -42 -38 -18 -5 -5 0 22 53 78 93 95 70 23 -16 -21 0 12 0 -23
1351b3j0J9M5N2L0nk8l3l3l4l2k0o%JjprJK0K7J6K%Lnj9k3j4kkj0j2MK5L1J6lkJ4J6%j8j8
$$ -23 -33 -14 31 83 113 108 80 47 14 -20 -52 -72 -78 -78 -77 -78 -85 -94 -93 -73 -46 -30 -28 -28 -25 -30 -49 -72 -86 -88 -90 -100 -112 -108 -83 -52 -36 -39 -41 -27 -11 -11 -29 -47
1332d7rnmJ0L2M4L3Lk6l6l4l1l0k0OL0L7K9J7Jj9m4n3m8m0k9kL9O6O7N3L5J1j7k6j0RRKMR
$$ -47 -56 -61 -65 -55 -23 21 54 57 31 -5 -39 -70 -100 -120 -114 -84 -47 -18 -1 0 -19 -63 -116 -164 -204 -233 -235 -196 -130 -63 -10 25 36 19 -7 -17 -8 1 3 7 16
1314A6Lj0rJ2L0L3K4Qj4l2l8l3k4pJ4K9K9J2JOJ3Qok3l2k7j4%Nkj1j0MK4L1K1jj7j6j5j3l
$$ 16 19 9 0 12 42 75 99 107 93 61 23 -10 -34 -41 -27 2 31 43 44 50 63 71 65 42 10 -17 -31 -31 -26 -28 -39 -49 -45 -21 10 31 30 13 -3 -18 -31 -34
1296c4J3K0RKQJ3nk8k8jK2K2J3J7K3J5mj6k1l2m8n2l2kJ5J4J0J2K1K8K2PmqkJ0K1L1K8J5m
$$ -34 -21 -1 8 10 18 31 26 -2 -30 -31 -9 13 26 43 66 81 77 61 40 8 -40 -92 -124 -126 -111 -97 -87 -75 -54 -26 -4 3 -1 -9 -11 -1 20 51 79 94 90
1278I0j4j2rj6k3j9qKMNJ0Rrl1m5m5l9k9lK9M7M2L4L6M0K6QKPNpj1kJ1J2kk3l9l8k3j0j5k6
$$ 90 76 64 55 39 16 -3 -11 -9 -5 0 10 19 10 -21 -66 -111 -150 -179 -182 -153 -106 -64 -30 6 46 72 80 82 89 94 87 76 74 85 97 95 72 33 -5 -28 -38 -53 -79
1260g9k0kRJ2K2M1M1J4j4j2QJ1qk0pRJ2MMJ4J6Kj3j6rpj5k5k6k3k1j6nNPKJ%%OK2L8L8K0J0
$$ -79 -99 -101 -92 -80 -58 -17 24 38 24 12 20 31 23 3 -4 5 17 21 25 39 55 57 44 28 19 12 -3 -28 -54 -77 -98 -114 -119 -114 -107 -105 -104 -104 -104 -98 -76 -38 0 20 30
1240C0J8L1L3K8K3J1j6m2n1m1k6rJ3L6L5J3rj2j7l1m4l4pJ0Mrj6k2k7k8j3LJ0RJ4K5L7M2M3
$$ 30 48 79 112 140 163 174 158 116 65 24 -2 -11 2 38 73 86 77 65 48 17 -27 -61 -68 -58 -54 -63 -79 -101 -128 -156 -169 -166 -156 -147 -133 -108 -71 -29 14
1223A4M1K9J6J3J2%k5m2m1k6j7j4j1j1k0k6j3J7M1L7J7KKNJkkLjk0m4n1l3oQPRK3L4K6RNK1
$$ 14 55 84 100 113 125 125 100 58 17 -9 -26 -40 -51 -62 -82 -108 -121 -104 -63 -26 -9 -7 -5 0 1 -1 -3 0 -1 -21 -65 -116 -149 -155 -147 -140 -131 -108 -74 -48 -39 -34 -13
1205a3L5L0QnNK7M7M9L0qn1p5p1m8l2k5j4NK8L3J6pj0PK9L3K6K3K7K4Lk2l1k3j2nLJ2J0kr
$$ -13 22 52 60 55 60 87 134 183 213 205 154 79 8 -40 -72 -97 -111 -106 -78 -45 -29 -36 -46 -39 -10 23 49 72 99 123 126 104 73 50 38 33 36 48 58 56 47
1187D7mJqk0k0oJ2K0J2j3l6m4k7KJ6J6J6K4L1K8Pj7l2k9j3LJ1J3J8K2K0J1Lnj2j3pLOLMOM
$$ 47 43 44 36 16 -4 -10 2 22 34 21 -15 -59 -86 -84 -68 -52 -36 -12 19 47 54 37 5 -24 -37 -34 -23 -10 8 30 50 61 64 59 47 34 27 30 36 39 43 49 53
1168E3MNOJqnPJ6J1oj7k1j7j2j0rqoj7l0k9qQKj4j9j0jPK6L7K4jkJ8K8J5lj0j2k4k8j4LMl
$$ 53 57 62 68 69 61 56 63 79 90 84 67 46 29 17 7 -2 -10 -16 -33 -63 -92 -100 -92 -90 -104 -123 -133 -134 -127 -101 -64 -40 -41 -43 -25 3 18 15 5 -7 -31 -59 -73 -70 -66 -69
1148f9l%mnRK6L0J9Oj1l2m2k5%J0J1K2L4K2j2l6l6k7k0mK3M3L6J7PMlj1j4j2j7k5k4pJ7L3
$$ -69 -72 -72 -76 -81 -72 -46 -16 3 9 -2 -34 -76 -101 -101 -91 -80 -58 -24 -2 -14 -50 -86 -113 -133 -137 -114 -71 -35 -18 -11 -7 -10 -21 -35 -47 -64 -89 -113 -120 -103 -70
1130g0L0J5jj4j8j3mNRJ4K1K6J9MlOJ5Qrj3mRJ1Jj3k3j7jJ1MpmJ3J2j6m1l9k4k3l5l0oJ9L1
$$ -70 -40 -25 -26 -40 -58 -71 -75 -70 -61 -47 -26 0 19 23 20 26 41 49 40 27 23 32 43 44 31 8 -9 -10 1 5 -2 -6 7 19 3 -38 -77 -101 -124 -159 -189 -195 -176 -145
1111a45L9N1N3L1Lj1lOlj6j8j4j7k8k5jK6L4K2J1NOJ3J9K3J5KjKMnj4k4l0k6j2OJ1%j1j3r
$$ -145 -106 -55 -2 29 32 21 18 24 21 5 -13 -27 -44 -72 -97 -98 -72 -38 -16 -5 0 6 19 38 61 76 78 77 79 83 78 64 40 10 -16 -28 -22 -11 -11 -22 -35 -44
1093d4mPJ9K2J7J8J8Kk9m8l5KK6K6Qqj6mJ8K7Rk0l6l9m3m8l8j1J7K4J5J1K1L5L6J4j4k5pK6
$$ -44 -48 -41 -22 0 17 35 53 55 26 -22 -57 -55 -29 -3 5 -3 -19 -23 -5 22 31 11 -25 -64 -107 -155 -193 -204 -187 -163 -148 -137 -116 -81 -45 -31 -45 -70 -77 -51
1076e1M5L4Jk7k5nJ0J0MJ2K6K7J5RJ0NoqOJ7J8J8K1J4j6m3m4l0l4m5m0rJ0Jj6j7lQJ3J6J4
$$ -51 -6 28 29 2 -23 -28 -18 -8 -4 8 34 61 76 85 95 100 94 86 92 109 127 145 166 180 164 121 77 47 13 -32 -72 -81 -71 -70 -86 -103 -106 -98 -85 -69 -55
1058e5NjJ1K8L9M0L6L2K0Mj0j2j0j0k4m4n3m4j8LJ9L4M0K8lk3j2K0L5K4Jj0j1j2j5j6qlqk1
$$ -55 -50 -51 -40 -12 27 67 103 135 155 159 149 137 127 117 93 49 -4 -48 -66 -63 -44 -10 30 58 55 32 20 40 75 99 100 90 79 67 52 36 28 25 17 -4
1041dl7l9k7kK5M5M4K8QJNJ3J7Rnk6m2m4l6j7QK8L5K2QJJ0K1K5J4j0l1l0nJ9J9JmJ4L5L3J7
$$ -4 -41 -80 -107 -109 -84 -39 5 33 41 42 47 60 77 86 81 55 13 -31 -67 -84 -76 -48 -13 9 17 18 28 49 74 88 78 47 17 12 31 50 51 47 61 96 129 146
1022A46kj5l0m1m3l5k7j6pJPK3M2M2J3k0k2KK3J6mj6k7m4n9n4k9jJ4K0K9L2K7J2LLONLRJ3
$$ 146 144 129 99 58 15 -20 -47 -63 -70 -69 -62 -39 3 45 58 38 16 18 41 57 53 37 10 -34 -93 -147 -176 -177 -163 -143 -114 -82 -55 -43 -40 -37 -31 -26 -23 -14 -1
1005aLj1j6J1M6N8L3kj9j5qj1j8k0j5pLQNjLJ9K8J4j6m1l5qK6N2N6M0J4rk0k5k6k6j9j0pp
$$ -1 2 -9 -25 -14 32 90 123 121 102 87 79 68 50 30 15 8 11 19 24 23 26 45 73 87 71 30 -5 -13 13 65 121 161 175 166 146 121 95 69 50 40 33 26
987B6jPPJJJ5L2L1J3nrj0j8l3m1l1qJ4K3K6K8K4Pj9l8l7k1pJJ2K5K7QrqJ4L0K6Qoqpqrpml
$$ 26 25 32 39 40 41 56 88 119 132 127 118 108 90 57 16 -15 -23 -9 14 40 68 92 99 80 42 5 -16 -23 -22 -10 15 42 50 41 33 47 77 103 111 105 97 90 82 73 66 62 59
966E9qj4qMPrl0k9rQOoqrj8l1k8qJ2J9K0K0J2Jqrj0j2oJ0J9J5J0J1J2Mj5k6k1oPPrk7l0k1
$$ 59 51 37 29 33 40 31 1 -28 -37 -29 -23 -29 -37 -46 -64 -95 -123 -131 -119 -100 -80 -60 -48 -47 -55 -64 -74 -86 -92 -82 -63 -48 -38 -27 -15 -11 -26 -52 -73 -79 -72 -65 -74 -101 -131 -152
946a52pPL2N6N9L4J4J6K8K4J2QRMpj1j2k4l8l1qOKKJ3J4lk1j2J3K8K6K1J7J6J1Kj1k9m2m9
$$ -152 -159 -152 -120 -64 -5 29 43 59 87 111 123 131 140 144 137 126 114 90 52 21 13 19 21 23 36 50 47 26 14 27 55 81 102 119 135 146 148 137 108 66 17
928A7m9m3k7jK3L3L0J7kk4l1j8KJ4J8J6J0jj2j5j1jJ2J9J1kj0lNQOnj8k5j3MQMJ0L0L6K2L
$$ 17 -32 -75 -102 -103 -80 -47 -17 0 -2 -26 -57 -75 -73 -59 -41 -25 -15 -16 -28 -43 -54 -55 -43 -24 -13 -15 -25 -28 -23 -15 -9 -14 -32 -57 -70 -66 -58 -54 -44 -14 22 44 47
910D7loj4k0j0KPJ1J4Pj4k2oJ8K5J4QJ2J3OJqj6j4NJ8Mk1k4nOmj5j3kJ4K6K9J9Olj4l1m3l7
$$ 47 44 38 24 4 -6 -4 3 14 28 35 21 -1 -7 11 36 50 58 70 83 89 90 82 66 52 57 75 79 58 34 29 35 31 16 3 1 15 41 70 89 95 92 78 47 4 -33
890c3k4k3k3j3jnj3ML1L6J8J1K5K8jl2l9k5rNJ8K5J9J6K4L1K4J7K0J8Jj4j2JOLJKjLJ6J9J
$$ -33 -57 -80 -103 -116 -117 -122 -135 -131 -100 -64 -46 -35 -10 18 17 -15 -54 -79 -88 -83 -65 -40 -21 -5 19 50 74 91 111 129 130 116 104 105 111 114 115 117 116 119 135 154 155
872A55k1k3j3j7l3m0l1k5k1j2J2L6M2K7ll0l0pJ8J9NmmlnkNNjkMJ5K2K6J4j4m0m1k1jOPRJ2
$$ 155 134 111 98 81 48 8 -23 -48 -69 -81 -69 -33 9 36 33 3 -27 -34 -16 3 8 4 0 -3 -8 -10 -5 0 -1 -3 1 16 38 64 78 64 24 -17 -38 -39 -33 -26 -17 -5
853eQLj2l8n0k9J3M3M0K6J6Rnj3lJ9L1K1%j6j5ojrk2k0qjj0k3k0kJ1J1NJ0K5L3K8J3jj3k7
$$ -5 3 6 -6 -44 -94 -123 -110 -67 -27 -1 15 24 19 6 3 22 53 74 74 58 43 37 36 27 5 -15 -23 -24 -34 -57 -77 -79 -68 -57 -52 -42 -17 16 44 57 56 43 16
834A6k7kL6M9K1j7k9k1j9j6OL8M9K3noJ3L2M1L7J4k2m5m3l1l1l3j7RJ5lk2k4j6j1j3j3j5j5
$$ 16 -11 -13 23 72 93 76 47 26 7 -9 -3 35 84 107 102 96 109 141 182 219 233 211 166 123 92 61 28 11 20 35 32 10 -14 -30 -41 -54 -67 -82 -97
817i7j3nKNLLJ4L2M0K8J1KPJ3J0K%M%j1j2RL3L6J3j2j9j1nmJNql4m2j9J3J7lj5rLNJJ1L7O1
$$ -97 -110 -115 -113 -108 -105 -102 -88 -56 -16 12 23 25 32 45 55 57 57 61 61 50 38 47 80 116 129 117 98 87 82 78 79 84 76 42 0 -19 -6 11 8 -7 -16 -13 -8 -7 4 41 102
797A02N9K6j7m2l9k8k3j8LK3J6j3l0j7QJ7J4Kj1k5k9k5k0j7j0KLj2j8mK2L5L4J9mk8l5j5J3
$$ 102 161 187 170 128 89 61 38 20 23 46 62 49 19 2 10 27 41 43 32 7 -22 -47 -67 -84 -94 -92 -89 -101 -119 -123 -101 -66 -32 -13 -17 -45 -80 -95 -82
780h2K6K6K6K5J9PONlj1j0jkj0j5j0om%Llj8k3j5qroOJ8J7Lj1j9j4jJ5K2K2J9J5J1J2J7J8
$$ -82 -56 -30 -4 21 40 47 53 58 55 44 34 33 31 21 6 -4 -10 -14 -14 -11 -14 -32 -55 -70 -78 -87 -93 -87 -69 -52 -49 -60 -79 -93 -94 -79 -57 -35 -16 -1 10 22 39 57
761E7Nj1j6j2j3j0%J3Mk7m6l0lJ0PJ1K5K9K0Rlj5j9pJ6L0K6J0ok2l3l8l2k4k0j7j9l2m3k9
$$ 57 62 51 35 23 10 0 0 13 17 -10 -56 -86 -89 -79 -72 -61 -36 -7 13 22 19 4 -15 -22 -6 24 50 60 54 32 -1 -39 -71 -95 -115 -132 -151 -183 -226 -255
743b55J2N5O8N0K1OMNJ1J9K4J9Pkljjl%KkppKMj0k9l0LM5O2L4j2m0l9l0l0k4%K6K8Lk6l8l6
$$ -255 -243 -188 -120 -70 -49 -43 -39 -34 -23 -4 20 39 46 44 41 40 39 36 36 38 36 29 22 24 28 18 -11 -41 -38 7 69 103 91 51 12 -18 -48 -72 -72 -46 -18 -15 -41 -79 -115
724a15l2k8j9qNK1M2N8N9M2J8qk3k4j4jRJ6K2K1J3J3J9J5ql6m5l5j7MK7L1J4j0rJ8M0L7K8
$$ -115 -147 -175 -194 -202 -197 -176 -134 -76 -17 25 43 35 12 -12 -26 -27 -18 -2 20 41 54 67 86 101 93 57 12 -23 -40 -36 -9 22 36 26 17 35 75 112 140
707A40K9L0J2j4k5j6mqj7k0j6j2j5k0k3k4k0rJ3K3Rk1m2k6NK5K3J5Pmj6j1J5L4L2J4K%pj8
$$ 140 169 199 211 197 172 156 152 144 127 107 91 79 64 44 21 -3 -23 -32 -19 4 13 -8 -50 -76 -71 -46 -23 -8 -1 -5 -21 -32 -17 17 49 63 65 65 58 40
690D0k3j8k0k3k0p%oj8k5k7k4j0J7L5K6Kj0%J4J9J0oj7j7kK3L7L4K0RRJ5J5Lj6k6j3QK9L8
$$ 40 17 -1 -21 -44 -64 -71 -71 -77 -95 -120 -147 -171 -181 -164 -129 -103 -101 -111 -111 -97 -78 -68 -74 -91 -108 -110 -87 -50 -16 4 13 22 37 52 55 39 13 0 8 37 75
672G5M2L2Ll3m7k5J2L2K5Lj5j9nJ6K3J2lonj5k8k4pNORJ9L1K8J9J5Qj1l9n5m8l0j3j0j3j0
$$ 75 117 149 152 119 72 47 59 91 116 119 104 85 80 96 119 131 128 122 117 102 74 50 43 48 54 63 82 113 141 160 175 183 172 133 78 30 0 -13 -23 -36 -46
654d6JJ8K7K0Om%J1J7J1nj9j6%K1L8M4L3J6JjJmj2j5j6k4l4l4k8k8l8m0k5qoj2qRK3K8K9L5
$$ -46 -45 -27 0 20 26 22 22 33 50 61 56 37 21 21 42 80 124 157 173 174 173 174 170 158 143 127 103 69 35 7 -21 -59 -99 -124 -132 -138 -150 -158 -149 -126 -98 -69 -34
635c4L6K4Kj7j6KJ9K3J0JRK4K8J5Lkmj5l0l4k1JJ2QjjPJ4Oj4l4m3m1k4kJ3J8J9K0J6lk8l7
$$ -34 2 26 28 11 -5 -3 16 39 49 50 59 83 111 126 129 127 123 108 78 44 23 24 36 44 43 42 49 63 69 55 21 -22 -63 -87 -89 -76 -58 -39 -19 -3 -6 -34 -71
617g1k5qMJ4K1J9Pqj4j2j1j1rMJ9K5J9OKPJ6J1jj2j3mMMnj2pMJ1RKlpj3j6nJ6L3L0J7OKJj0
$$ -71 -96 -104 -100 -86 -65 -46 -39 -47 -61 -73 -84 -95 -104 -100 -81 -56 -37 -31 -29 -22 -6 5 4 -8 -21 -25 -21 -17 -22 -34 -41 -37 -26 -17 -15 -18 -25 -38 -54 -59 -43 -10 20 37 43 45 46 36
596C6k8m0l3j0Kj0l2m0k8rPJ7K0J1%MK0K9K2PjmlOK2K6J5NRJ5%l2m7m2k9k6k2oJ4J4mj9j3
$$ 36 8 -32 -65 -75 -73 -83 -115 -155 -183 -192 -185 -168 -148 -137 -137 -133 -113 -84 -62 -55 -56 -60 -63 -57 -35 -9 6 11 20 35 35 3 -44 -86 -115 -141 -163 -169 -155 -141 -145 -164 -177
577a77MK2L7M7N0L7K4K2L1L1Pk9n1n0l3k2j5j1mNJ5K4K7J5ok3j7JJ2Oookj0k8l3rK3L5J8p
$$ -177 -173 -151 -114 -67 -17 20 44 66 97 128 135 106 55 5 -28 -50 -65 -76 -80 -75 -60 -36 -9 6 0 -23 -40 -39 -27 -21 -27 -33 -35 -45 -73 -106 -115 -92 -57 -39 -46
560d6k1j8qKjj2k2j9okj2k0j4kMLMJ1J9J9J6J6K6M0L7Rk4l7j7OQmrlOJ4K4K8J8MmJKpj9k4
$$ -46 -67 -85 -93 -91 -92 -104 -126 -145 -151 -153 -165 -185 -199 -201 -197 -194 -190 -179 -160 -141 -125 -109 -83 -43 -6 3 -21 -58 -75 -69 -61 -65 -74 -77 -71 -57 -33 -5 13 17 13 14 16 9 -10 -34
540c4k1j7pJ4L6M6M7M5L5J4j6m0m1k5oNJqnJ2K8K4ll0l7k2jJ5J9Pj7l4l2j3L%rj0kO%rqLJ9
$$ -34 -55 -72 -79 -65 -29 17 64 109 144 158 142 102 61 36 30 35 36 28 23 35 63 87 84 54 17 -5 -6 9 28 35 18 -16 -48 -61 -58 -58 -67 -77 -79 -73 -73 -82 -90 -87 -68
520f8K9K9K4J9J5J0NKPJ1Qpj7j3%MkrrlQJ8K0Mk1l9l8k4j1poqpjJ1K3K2Mj5k1j3k%jNJ6K4
$$ -68 -39 -10 14 33 48 58 63 65 72 83 91 84 67 54 54 58 56 47 38 35 43 61 81 85 64 25 -13 -37 -48 -55 -61 -69 -76 -77 -66 -43 -21 -17 -32 -53 -66 -68 -68 -69 -64 -48 -24
500b4K1J6J5Pqj7j3m%klknj4k1k4j8oPJ0jj2j0LJ0J5K7M6N4M1J0k4n2o6n9l3rmj4j4LK6L8
$$ -24 -3 13 28 35 27 10 -3 -7 -7 -9 -12 -14 -19 -33 -54 -78 -96 -102 -95 -85 -86 -98 -108 -105 -95 -80 -53 -7 47 88 98 74 22 -44 -103 -136 -145 -149 -163 -177 -174 -148 -110
481a10L1J6%lRK3K5J2J%J0K3K9K5J7J2J4J7Oj3k9l8m2l9l1j5lorJK0L2K6K0K0K3J6lk0k6k7
$$ -110 -79 -63 -63 -66 -57 -34 -9 3 4 4 14 37 66 91 108 120 134 151 157 144 115 77 35 -4 -35 -50 -53 -59 -68 -67 -47 -15 11 31 51 74 90 87 67 41 14
463A4l3m3l9j4J0J1j1k9k4lJ7L3M2L5Qk3l1j6OJ5J5J5J1JJK2M8N0J8j7l0k5k7l7m5m0l2j9
$$ 14 -19 -62 -101 -115 -105 -94 -105 -134 -158 -161 -144 -111 -69 -34 -26 -49 -80 -96 -90 -75 -60 -45 -34 -33 -32 -10 38 88 106 89 59 34 7 -30 -75 -115 -147 -166
447a66MK7L2K2K0M4O5N7J5k7m3l4k0j1n%QJ0jk6m9m6j7J7L4L4L3L8L9K8RjjKlk0l6l2j6lo
$$ -166 -162 -135 -103 -81 -61 -17 48 105 120 93 50 16 -4 -15 -20 -20 -12 -2 -3 -29 -78 -124 -141 -124 -90 -56 -23 15 54 82 91 90 89 91 88 68 32 0 -16 -19 -25
429b5j5j0J0K2J0j3k7k0kJ6K6J7lj9j6nMOJ2J9J7Orj6k1k0j6nNQJj1k1j9JK4L0J8J0J7K6J8
$$ -25 -40 -50 -40 -18 -8 -21 -48 -68 -70 -54 -28 -11 -14 -33 -49 -54 -50 -44 -32 -13 4 10 1 -15 -36 -56 -72 -77 -72 -64 -63 -74 -95 -114 -113 -89 -59 -41 -31 -14 12 30
411C0j0l7m9l6mL0M2K3ok1j8j4j2lMLmjJ3J9RkjjqrKK0K0Mj4k1j7j1pk%KRJ9K7K2Kj1nJ3J7
$$ 30 20 -17 -66 -102 -106 -76 -34 -11 -17 -38 -56 -70 -82 -85 -81 -78 -82 -83 -70 -51 -42 -44 -45 -46 -54 -63 -61 -41 -21 -17 -31 -52 -69 -80 -87 -89 -89 -87 -78 -59 -32 -10 -8 -19 -24 -11 6
390FKj0NL5L6Kk6j8J1K2Pj6k6k4j7j1j7l2m0k6KK4K9K6J8%j8k1nJ5K0J7K1L3L1Ml2m5l0j3
$$ 6 8 -2 3 38 74 76 50 32 43 65 72 56 30 6 -11 -22 -39 -71 -111 -137 -135 -111 -82 -56 -38 -38 -56 -77 -82 -67 -47 -30 -9 24 55 59 27 -18 -48 -61
373f1j9l5l2lK4L1K2J4J0Jj2j9j7mRJ5J2RJ9L6L9K5J3K1L1K0j2l7m4l3j5MQrk1oK5L6J8JO
$$ -61 -80 -115 -147 -150 -126 -95 -73 -59 -49 -48 -60 -79 -96 -100 -91 -76 -64 -55 -36 0 39 64 77 98 129 149 137 100 56 23 8 12 20 11 -10 -16 9 45 63 64 70
355G0K3L0K8J6j2m5n6l1llk2l2j4J2K5K4J3kr%J7J9Lj8k5j6%J3J8Prj2QK8K7jl3l9k1MQjm
$$ 70 93 123 151 167 155 110 54 23 20 17 -5 -37 -51 -39 -14 10 23 21 12 12 29 48 51 33 8 -8 -8 5 23 30 21 9 17 45 72 71 38 -1 -22 -18 -10 -11 -15
337a5J0K6L2K2Qnj2j2oKLjrj2oOJ0Mqj5j7j4nJ1K3J8QMNj1l5m2k5nJMJ1Rnj1QL0K5mk6l6l3
$$ -15 -5 21 53 75 83 78 66 54 48 50 53 52 43 31 25 31 41 45 37 22 5 -9 -14 -3 20 38 46 50 55 44 9 -33 -58 -63 -62 -58 -47 -38 -43 -54 -46 -16 9 5 -21 -57 -90
316i0k2NK7K6J2J3K4J5j0j9OK9K0j3l2l1j9oJ0J8J1pj8j6pMQMLJ5L3L2Mj9oK5L5Pk6l4k1q
$$ -90 -112 -107 -80 -54 -42 -29 -5 10 0 -19 -13 16 36 23 -9 -40 -59 -65 -55 -37 -26 -33 -51 -67 -74 -70 -62 -58 -55 -40 -7 25 29 10 4 29 64 71 45 11 -10 -18
298a8jKPJ0J0Pkj7l3m2l5j4J1K0RppJ2L8N3N1K9lk8l7l5l0k2nJ3J9J3J5K4K6Qj4j9qmj5l1
$$ -18 -19 -17 -10 0 10 17 15 -2 -35 -77 -112 -126 -115 -95 -86 -93 -100 -88 -50 3 54 83 80 52 15 -20 -50 -72 -77 -64 -45 -32 -17 7 33 41 27 8 0 -4 -19 -50
280e0l2j7QK8L3J8j0l6m1j8J0J9Mj7k0%K5M0L8L1L0K4J1nrJJ0jk3l4j8JJ3J7K2K5J7Jrk4m8
$$ -50 -82 -99 -91 -63 -30 -12 -22 -58 -99 -117 -107 -88 -84 -101 -121 -121 -96 -56 -18 13 43 67 78 73 64 65 75 74 51 17 -1 0 13 30 52 77 94 95 86 62 14
262A4o3m4PM2K9j5m4l8qK2M4N0M1K5Q%jLLj3m0m8k7MJ4%j1qoj3j5kRkk3k9j8%J3K7L9L8K2
$$ 14 -49 -93 -86 -44 -15 -30 -74 -112 -120 -98 -54 -4 37 62 70 70 69 72 75 62 22 -26 -53 -49 -35 -35 -46 -54 -60 -73 -88 -90 -81 -83 -106 -135 -153 -153 -140 -113 -74 -36 -14
244a4P%nrkJ6L1K9J8J7K3J3j1k8j6RK4K1J3Kk1m8o2m6k1pmMK4M0L9K4Omrqnnj2k3k8k7j6%
$$ -14 -7 -7 -12 -21 -23 -7 24 53 71 88 111 124 113 85 69 78 102 123 136 138 117 69 7 -39 -60 -67 -71 -67 -43 -3 36 60 66 62 53 45 40 35 23 0 -28 -55 -71 -71
224g1QJj0j0OK2K2J1J1K4L1K0JqlMNNOJ2J1Npj6k1k7k8j4PJ7Mj7j7KJ4Kj5k1j3m%NNkj0pN
$$ -71 -63 -62 -72 -82 -76 -54 -32 -21 -10 14 45 65 66 58 55 59 64 69 75 87 98 103 96 80 59 32 4 -10 -3 14 18 1 -16 -14 0 2 -13 -34 -47 -51 -51 -46 -41 -43 -53 -60 -55
204e5J7K3K6K8J9mk3k8j6KJ3J0nj4rRK2K4J8J1Mrj6j3kQJ2J1Npk3l5k7jK8M0L4K1J2Jj9l8
$$ -55 -38 -15 11 39 58 54 31 3 -13 -11 2 12 7 -7 -16 -7 15 39 57 68 72 63 47 34 32 40 52 63 68 61 38 3 -24 -25 3 43 77 98 110 111 92 54
186E4l8j7%Jj2k9k6oK2L1K4J7K0K0Mj4j6qj0j2KK7L3J2j2k4l4m1l2KL7L8J5nj2j1oOJ7J9J3
$$ 54 16 -1 -1 0 -12 -41 -67 -73 -51 -20 4 21 41 61 65 51 35 27 17 5 7 34 67 79 67 43 9 -32 -64 -62 -25 13 28 23 11 0 -6 0 17 36 49
168D9J4J8J4jj3k3l0l0k0JJ5J7J4Kj5k2j7mkmOK8L6K6RKMKlpnk%jnrj2j2j0kJ1K0J2pk1j7
$$ 49 63 81 95 94 81 58 28 -2 -22 -21 -6 11 25 27 12 -10 -27 -31 -33 -37 -31 -3 33 59 68 70 74 76 73 66 61 59 59 58 53 44 32 20 10 8 19 39 51 44 23 6
148FJJ4Rj8m9o5n3l6l2k6QN6P6N2J6OJ5J6NjMJ0J0Jj1k4l4l5l4l1k1nMKkJ0L2M3L1Ok2m0l1
$$ 6 7 21 30 12 -37 -102 -155 -191 -223 -249 -241 -185 -109 -57 -41 -35 -20 -4 1 0 4 14 24 25 14 -10 -44 -79 -113 -144 -165 -170 -166 -164 -166 -156 -124 -81 -50 -44 -66 -106 -137
130a37J2O2Q0N0lm3n1l8j3J0K4K5K3L0L5L2J9J2J1Oqj3qkj3l3l0JL6M2K3Jrj1j0ojmj6k6k6
$$ -137 -125 -63 17 67 64 21 -30 -68 -81 -71 -47 -22 1 31 66 98 117 129 140 146 138 125 117 115 102 69 39 40 76 118 141 142 133 122 112 106 105 101 85 59 33
112C3j5oqj6k2j2J4L9M8L4Nk0l1k7j6j3j8k2j3KQmj6k3l0l4k4JK4K7J7P%ppJ0K8K9J1j2l0
$$ 33 18 12 4 -12 -34 -46 -32 7 55 89 94 74 43 16 0 -13 -31 -53 -66 -64 -56 -60 -76 -99 -129 -163 -187 -186 -162 -135 -118 -111 -111 -118 -125 -115 -87 -58 -47 -59 -89
94h9l4k1J0L8L6RrnOOnj1j1j0mJ1K1J1j1k2qJ9M1M1K2ok9l6l2k5j4MK3K8J7Korj6k1rK4M6
$$ -89 -123 -144 -134 -96 -60 -51 -60 -65 -59 -53 -58 -69 -80 -90 -94 -83 -62 -51 -62 -84 -92 -73 -32 9 31 25 -4 -40 -72 -97 -111 -107 -84 -56 -39 -37 -43 -52 -68 -89 -98 -74 -28
75b8L3jk1oK4L2Ok4l4k5oJ2K4K7K3J5J2J0LmJJ5K1J2%ljqk7m7m9l8k3j3mKkj4j5J0M7O8N8
$$ -28 5 4 -17 -23 1 33 39 15 -19 -44 -50 -38 -14 13 36 51 63 73 76 72 73 88 109 121 121 118 117 109 82 35 -14 -52 -75 -88 -92 -90 -92 -106 -121 -111 -64 4 62
57F2K8LqokLnk9n7o4m0JL6N3N3L5Kk5k9j1JJknj2k9l7j9J3K9K4J3QOMLKok0k9k5j9j8j7qM
$$ 62 90 93 85 79 77 80 75 46 -11 -75 -115 -114 -78 -25 28 63 65 40 11 0 1 2 0 -5 -17 -46 -83 -102 -89 -60 -36 -23 -15 -9 -5 -2 0 -6 -26 -55 -80 -99 -117 -134 -142 -138
37a38J6K4K6K3J7J9K7K2lk3j9MK8L9L4J4rk0j6j3k7m0l2j3rj5oK2L6K2%rj8k8k2PL6L9J9P
$$ -138 -122 -98 -72 -49 -32 -13 14 36 33 10 -9 -5 23 62 96 110 101 81 65 52 25 -15 -47 -60 -69 -84 -90 -68 -32 -10 -10 -19 -37 -65 -87 -80 -44 -5 14 21
19B1Lnj9k2j2%Lkqj1rkORJ4K9L8L3J4lj5l0l5j3K9N7M3Oj7j4o%J0K5K3jj9pK3L2Rj4j3mqj6
$$ 21 24 19 0 -22 -34 -34 -31 -33 -41 -52 -61 -63 -57 -48 -34 -5 33 66 80 77 62 32 -3 -16 13 70 113 119 102 88 82 82 92 117 140 139 120 113 136 168 177 163 150 146 138 122
-1A22mK1K2j1m4m2j5MPJ0J9J5lk4k8j9mJ4K9L3J7j6n1o7n7k8KJ6J5J5J6J6J1KkJQJ3J0nj8
$$ 122 118 139 161 150 106 64 49 53 60 70 89 104 101 77 49 30 26 40 69 102 119 103 52 -15 -72 -100 -98 -82 -67 -52 -36 -20 -9 -7 -9 -8 0 13 23 18 0
-18@k2j5j0j2j7k0j3jJ1J6J9K2K5J7%rj2nQK1L3K9Pj1j5j1k0m0m7k9KK4L2L1K6J7jj9k7j5
$$ 0 -22 -37 -47 -59 -76 -96 -109 -110 -99 -83 -64 -42 -17 0 0 -9 -21 -26 -18 3 36 65 72 61 46 35 15 -25 -72 -101 -99 -75 -43 -12 14 31 30 11 -16 -31
-36c1J3L2L3K7K7K3Kk0k0oLmj3j6k1k8k4j1mn%J6K7K4J9K7L2J1k4l8k6j3j7k7k4lK6M5M1J3
$$ -31 -18 14 47 74 101 124 126 106 86 80 83 79 66 50 29 1 -23 -34 -38 -43 -43 -27 0 24 43 70 102 113 89 51 25 12 -5 -32 -56 -59 -33 12 53 66
-53F6j7j7OJ6ol0k1J3M0L8K0J0Kj1k1j5KR%pJJ1Mj3k3k4k8l8l6qK8M1K3j1l3l4j7KQQJ6L7
$$ 66 49 32 38 54 48 18 -3 10 50 88 108 118 120 109 88 73 75 84 84 77 78 89 93 80 57 33 5 -33 -69 -77 -49 -8 15 4 -29 -63 -80 -78 -70 -62 -46 -9
-71iN0M0J1j9l0k3mJ5K3J8Pmk1l8m0j9J4K7J6NQJ1kk7l6k4jK1L7N0N3L8Rj8k8j7JOmj8j4%
$$ -9 41 81 92 73 43 20 16 31 54 72 79 75 54 16 -24 -43 -29 -2 14 19 27 38 36 9 -27 -51 -52 -31 6 56 109 147 156 138 110 93 94 100 96 78 64 64
-89F4OK%J5L0K1rk6k1j5k4l6l1j3JNJ4K3J7rk6j8J1L1K8Oj9k7rR%l0m7l0k%j5j4J1L4L6K5
$$ 64 70 72 72 87 117 138 129 103 82 67 43 7 -24 -37 -36 -31 -17 6 23 14 -12 -30 -19 12 40 46 27 0 -9 0 0 -30 -77 -107 -109 -109 -124 -138 -127 -93 -57 -32
-108c2J9J0%kPJ5Oqj0jJkjPQlrMK7M3L7K0Kqj1j1rokkj2l0m5l8j4J1J6OJRJ7J6J0J1J4Rnj4
$$ -32 -13 -3 -3 -5 2 17 23 15 5 4 5 3 2 9 17 14 5 9 36 79 116 136 138 130 119 108 99 93 91 89 77 47 2 -36 -50 -39 -23 -17 -16 -7 10 26 36 47 61 70 65 51
-128E1j2mKPRJ2J2J4J6J0lj4j3lQJ3Mj5l4m1l0j7j2qOK9M0K7kk4k5j1LJ3J7Rj2l4n0m9l6k2
$$ 51 39 35 37 44 53 65 77 91 107 117 114 100 87 84 92 105 109 94 60 19 -11 -28 -40 -48 -42 -13 27 54 52 28 3 -8 -5 8 25 34 22 -12 -62 -111 -147 -169
-147a69j1mJJ0K2M0N0L9Qk0k6j3jRL3O7Q3M7j1m1k4Jkj4kK7L6J7mjMj4m8p4p5n5k0K2M9M7
$$ -169 -180 -184 -183 -173 -151 -111 -61 -22 -14 -34 -60 -73 -74 -65 -32 35 118 165 154 113 89 90 88 74 72 99 135 152 148 147 151 137 89 15 -60 -115 -135 -113 -64 -17
-164a7K7J1QJ2K0K8L3K3kk3k8j5j1k1l5k7LL2L6J8LJok7m3l4j2NJ7L0M2L1Kk5l1j6J1L2L1
$$ -17 10 21 29 41 61 89 122 145 143 120 92 77 66 45 10 -17 -14 18 54 72 75 76 70 43 0 -34 -46 -41 -24 6 48 79 81 56 25 9 20 52 83
-181H3Qj6j5MJ3Kj6l0m0m9m3j8NJ6K1K8L0J4rj5qKMkj2j7mK3M5M3K7J8J9J9Rok0l2l9l5k2
$$ 83 91 75 60 64 77 79 63 33 -7 -56 -99 -117 -112 -96 -75 -47 -17 -3 -12 -27 -35 -33 -29 -31 -43 -60 -64 -41 4 47 74 92 111 130 139 133 113 81 42 7 -15
-199a5r%Lmj4j8j1jKlj1j2kJ4K2J6RJ5K8K7Mj2j1qj6k1rQPmoKjj1j1MJ6J4J0Qlk4k8rJ7K2
$$ -15 -24 -24 -21 -25 -39 -57 -68 -69 -67 -70 -81 -93 -95 -81 -59 -43 -34 -19 9 36 40 28 17 9 -7 -28 -37 -29 -22 -26 -32 -30 -31 -42 -53 -49 -33 -19 -9 -1 -4 -28 -56 -65 -48 -26
-219b6J4J6L5N0L9Qk3l9l8l7m9n2l1NK8K1jj0oNK3M3N5N2L4J2rk7l5k8k0j9k7k6qJ5L3M1M3
$$ -26 -12 4 39 89 128 136 113 74 36 -1 -50 -102 -133 -128 -100 -79 -80 -90 -96 -91 -68 -25 30 82 116 128 119 92 57 29 9 -10 -37 -63 -71 -56 -23 18 61
-235F1L5J6j4m7o2n0j5J6K5J6KnlRK0K4J0j4k7k8j3RK8M0M6L7J8mj6rOJ2jj8k7k5j8kK2M1
$$ 61 96 112 98 51 -11 -61 -76 -60 -35 -19 -17 -22 -25 -16 4 28 38 24 -3 -31 -44 -35 -7 33 79 116 134 130 114 105 111 123 122 104 77 52 34 32 54 95
-253I5M3K8J3OMLok2m1m7l8k5j8j6pJ1K1J9Qpj7j9j5j2j8k3qK6N4N2K5jqomopomnpj2j0PL6
$$ 95 138 166 179 185 189 192 186 164 123 76 38 13 -5 -21 -28 -17 4 23 31 24 7 -12 -27 -39 -57 -80 -88 -62 -8 44 69 68 60 54 50 44 37 31 27 22 15 3 -7 0 36
-272C6N1M3K8L0L1Mm9q1o1k3rk1k0LJ4%j4KK8K6jk3j5RK0J3qj9j7kOLmjPJ1QLjnlKMrk4j9
$$ 36 87 130 158 188 219 223 174 93 32 9 0 -21 -41 -38 -24 -24 -38 -36 -8 18 17 -6 -21 -12 8 21 13 -6 -23 -25 -19 -16 -20 -21 -14 -3 5 8 7 2 -1 1 5 -4 -28 -47
-292d7KK3L3M6N5M2Ml7n0m2k6j1NK1K8J8Jj7l4m0l0nJ4J4J0J6K4J8nk5k6j3PK6K9J0k5l9k2
$$ -47 -45 -22 11 57 112 154 158 121 71 29 3 -8 -3 18 46 64 65 48 14 -26 -56 -61 -47 -33 -23 -7 17 35 30 5 -21 -34 -27 -1 28 38 13 -26 -48
-309d8J0J9LrnMJjJ3K9L0K4K9M2L5Lk2k0mKjLJ3J3ok1k2k0k8l4j9RJ7ok8j5J2K3Kk2k1pOJ5
$$ -48 -38 -19 -16 -25 -30 -26 -25 -26 -13 16 46 70 99 141 176 179 157 137 133 135 134 137 150 163 157 136 114 94 66 32 13 22 39 33 5 -10 2 25 27 5 -16 -23 -17 -2
-328bK4K4qn2o5k6K9N2L7K0J3Kk3l7k0K0L6J2l1m7l4rJ0J9J5j1m2m0NN3N9K5rk2j7j2j1j0
$$ -2 22 46 38 -14 -79 -105 -76 -24 13 33 46 48 25 -12 -32 -12 24 36 5 -42 -76 -85 -75 -56 -41 -52 -94 -134 -129 -76 -17 8 -1 -23 -40 -52 -63 -73
-345g3oPK9M5M0J7NJ0Qj4l8l6j5JKMJ0RKLK0L3K8Qnpj5l1m1k6jJ7J2MJ0K9L1Ml1l5qK1K5J5
$$ -73 -79 -72 -43 2 42 59 64 74 82 68 30 -6 -21 -20 -18 -14 -4 5 7 10 30 63 91 99 94 87 72 41 0 -26 -27 -10 2 6 16 45 76 80 49 14 6 27 52 67
-364F7RPlj8k0j1oj3j7rjmj0LK3K6J3%jLJJMlk5l6j7J2J3rj3J5L7K5qk2mK0L4L8L5K6J4Qk
$$ 67 76 83 80 62 42 31 25 12 -5 -14 -15 -19 -29 -26 -3 23 36 36 35 38 39 40 44 41 16 -20 -37 -25 -12 -21 -34 -19 18 43 35 13 9 29 63 101 136 162 176 184 182
-383A82k0m0m3l2k4k8l5k4jJ2J3J7K8M3M5K9ll2l9j9NJ0lpPJ6Oj7l3l6l6k9oK5L9L0J0lpl
$$ 182 162 122 79 47 23 -5 -40 -64 -65 -53 -40 -23 5 48 93 122 119 87 48 29 34 44 41 34 41 57 63 46 13 -23 -59 -88 -94 -69 -30 0 10 7 0 -3
-401cJ2L6M3K2nj2OK2J8Lj0j4rmqj7k5j8mkj8l1k3kJ0MlJJ2J3OOK2M2M3K9J0Jlrj3j3j4k6
$$ -3 9 45 88 110 105 93 99 121 139 142 132 118 109 105 97 80 55 37 33 31 13 -18 -41 -43 -33 -29 -32 -31 -19 -6 0 6 28 70 113 142 152 153 150 141 128 115 101 75
-420G5l7l3j8okLJ2Rlj7j4nnj4j4jJ5K1J9PloLJ8L0K7J5JpmKJj4l0k7KL7N3L8J0j1j1kJkn
$$ 75 38 5 -13 -19 -21 -18 -6 3 0 -17 -31 -36 -41 -55 -69 -70 -55 -34 -15 -8 -11 -17 -14 4 34 61 76 77 70 66 68 69 55 25 -2 0 37 90 128 138 127 116 114 115 113 108
-440A08oqj4j2kJ4K7L8M1L2J4L%nj9l7m2l9l5k9j8kJ0J6K2K1J3Krj9l3l8k3J0L4L4J4j2l0
$$ 108 102 94 80 68 66 80 107 145 186 218 232 235 235 230 211 174 132 93 58 29 11 9 19 35 57 78 91 93 84 65 32 -6 -29 -19 15 49 63 51 21
-457B1l3j9J0K9L3J9Mk%J2K4K5Pj5k7j9kOlk1l2l3l5l8l6k4j5j2pJ6M5N4L7J5NNMJjJLOLl
$$ 21 -12 -31 -21 8 41 60 64 62 62 74 98 123 130 115 88 69 67 73 70 49 17 -16 -51 -89 -125 -149 -164 -176 -183 -167 -122 -68 -31 -16 -11 -6 -2 -1 -2 -1 2 8 11 8
-476HqlKnk3l0k0kJ4K5K3Nk1k8pJ8K3Mj6j7%K2K9J0j1j4MJ1j1l5l2qQRJ2K4K7J3kn%LJjlM
$$ 8 0 -3 -1 -6 -29 -59 -79 -81 -67 -42 -19 -14 -35 -63 -70 -52 -29 -25 -41 -58 -58 -36 -7 3 -8 -22 -18 -7 -18 -53 -85 -93 -85 -76 -64 -40 -13 0 -2 -7 -7 -4 -3 -4 -7 -3
-496cJ6K7J6j2l0k0LJ2ml0m3l2rJ2K2K7L7N4O3N1K0j8l7k9kJ5J1npMJ0jj8k2j6j5j9k0j3n
$$ -3 13 40 56 44 14 -6 -3 9 5 -25 -68 -100 -109 -97 -75 -48 -11 43 106 157 177 159 122 93 91 106 117 112 105 109 119 118 100 78 62 47 28 8 -5 -10
-513a0jJOJ3K2K3J7Rmj4k2k4j6nNJ2Nmj2rlkj0j1%J5J5KkRL0M3L9K6Pj3k4k6j8j1j2j3pKM
$$ -10 -11 -10 -4 9 31 54 71 80 76 62 40 16 0 -5 0 12 17 13 1 -8 -11 -13 -23 -34 -34 -19 -4 -2 -4 5 35 78 117 143 150 137 113 87 69 58 46 33 26 28 32
-532C2qj9j3LRkj3rJpk9l9k5MK3L0L0L3M0L9K2%j1njk1m6m6j8J3K4J7J0Mnj0lRJ5Qmj3j9k4
$$ 32 24 5 -8 -5 4 2 -11 -20 -19 -26 -55 -94 -119 -115 -92 -62 -32 1 41 80 102 102 91 86 85 64 18 -28 -46 -33 -9 8 18 22 17 7 4 13 28 36 32 19 0 -24
-551b4k7k5j1J4L3L7K9K4K2J7J2PJj4l2l9k8j6j4j3nPJ3J3J6J5J4K1M1N8M8J6j4k3k2k4l2
$$ -24 -51 -76 -87 -73 -40 -3 26 50 72 89 101 108 109 95 63 24 -4 -20 -34 -47 -52 -45 -32 -19 -3 12 26 47 88 146 194 210 196 173 151 127 95
-568I5l4l3l4l5k4%K8L3J0j6k3lJ5J4ONRjj3nJ4J6pk3j9pqj5j1npoPK3J8JmPJ7J3J3K5L0K0
$$ 95 61 28 -6 -41 -65 -65 -37 -4 6 -10 -33 -36 -21 -7 -1 4 13 12 -1 -6 8 24 17 -6 -25 -32 -40 -55 -66 -71 -78 -84 -77 -54 -36 -35 -39 -32 -15 -2 11 36 66 86
-587H6OOJ6J8J4J6K9K8Ok1l1k3j9k6k9j9lQJ1Okj5k0pJ5K4J4mj2qorqPK2L1K4J4Mjlorp%L
$$ 86 92 98 114 132 146 162 191 219 225 204 173 150 131 105 76 57 54 62 73 79 77 62 42 35 50 74 88 84 72 64 58 49 41 48 70 101 125 139 143 142 139 133 124 117 117 120
-607A20pk4l3k6rkj0k0k7k5j8rJJ2J6J1K%MQLpoJ0L4M8M6L0Pk0l9m2k0J5M0L2jk7k3jJ2Nk
$$ 120 113 89 56 30 21 19 9 -11 -38 -63 -81 -90 -89 -77 -61 -50 -48 -48 -44 -36 -33 -40 -46 -36 -2 46 92 122 129 109 70 28 8 23 63 95 94 67 44 43 55 60 58
-625E8RJ8Nk3k7lK1K2Rkj1k5l2j5J4K7J1j2l0l9m6l7j1K1L9M0K5R%RK8L2J7LOR%j1nJ3K0K0
$$ 58 67 85 90 67 40 37 58 80 89 87 76 51 19 4 18 45 56 44 14 -25 -71 -108 -119 -98 -59 -19 6 15 15 24 52 84 101 104 110 119 119 108 103 116 136 156
-643A56K6L2J6k5o1o3l8j0J1K9L3K1LmKJ0Opk2l0k4qjj8m5n5l2JJ4Pqj4j4qJ0K9L0J1jJ0K8
$$ 156 182 214 230 205 144 81 43 33 44 73 106 127 130 126 128 138 144 137 115 85 61 53 52 34 -11 -66 -98 -97 -83 -76 -84 -98 -112 -120 -110 -81 -51 -40 -41 -31 -3
-661cK1lj0RK9K0nj5oMNNPMljJ2K2J1j2l2l9l2k3j0MJ7K4J9jk0j9JJ6J2PRJ3RJJOQlj7l3m8
$$ -3 18 15 5 14 43 63 58 43 37 41 46 51 58 62 59 58 70 92 103 91 59 20 -12 -35 -45 -41 -24 0 19 18 -2 -21 -20 -4 8 15 24 37 46 47 48 54 62 59 42 9 -39
-682c9n8n1k5JJ6J6J9K7M3M8L5J5%lkjLJ5K3J3qj5lJ1J1Kpj0j2j7j9j4nQK0K2Qj2k4j7rnk
$$ -39 -97 -148 -173 -172 -156 -140 -121 -94 -51 -3 32 47 47 44 42 41 44 59 82 95 87 72 69 80 91 93 86 76 64 47 28 14 9 17 37 59 67 55 31 14 5 0 -2
-700bJ2L2M2L7K2Qj1l3m7n0m3l2rJ9L7L2J7J2K0J8Kj6j8j8k2k5j8jJ1J2QPLoj6k1j8qJ0L3
$$ -2 10 42 84 121 143 151 140 107 60 10 -33 -65 -74 -55 -18 14 31 43 63 81 83 67 49 31 9 -16 -34 -35 -24 -12 -4 3 6 0 -16 -37 -55 -63 -53 -20
-718b0M7M6K6OjPJ4J6J3J2Jj5k5j0J3J7KoQK1J4j3l4m0l4j0K4M6L5Jk3k8k2j6nQRjqnj0k3
$$ -20 27 73 99 105 104 111 125 141 154 166 167 152 127 117 130 147 149 143 151 172 186 173 139 99 65 55 79 125 160 161 138 110 88 72 67 75 84 83 75 70 60 37
-736C7l0k0okjJ1K6K9J6PJ0K0K1J2%j0j3j5j9k6l4l8m2l5j3J6K9K0LMK0K7J2qrQK8K8J7J4
$$ 37 7 -13 -19 -21 -22 -11 15 44 60 67 77 97 118 130 130 120 107 92 73 47 13 -25 -67 -102 -115 -99 -70 -50 -47 -43 -23 4 16 8 -1 7 35 63 80 94
-753I4K2K3Lj8j7PK5J6oj8j3llpj1qjJ1J6J1qk7l7k8j1mj2k0oJ5J5mj8kK0K3J5J7K0Nk2l1
$$ 94 116 139 142 124 107 114 139 155 149 131 118 115 112 105 94 86 85 96 112 123 115 88 51 23 12 8 -4 -24 -30 -15 0 -4 -22 -24 -4 19 34 51 71 76 54 23
-771B3j1ROj3k1j6KJ8K4J1j4k9k7j9j6j3%J8K7K5J8J1MNK1L5K4j0l3k7KK8L4K1PKMmk6m0k4
$$ 23 12 21 27 14 -7 -23 -21 -3 21 32 18 -11 -38 -57 -73 -86 -86 -68 -41 -16 2 13 17 22 43 78 102 92 59 32 34 62 96 117 124 126 130 126 100 60 36
-789C6JJ1ok1k3j4LL1O5P0L8rl5l0rPJ0jj6j5jJk2m9m6j6J2J5Jj4k3k2qJ1K7L2L6L6K4Lpr
$$ 36 37 48 42 21 -2 -16 -13 18 83 153 191 182 147 117 108 115 125 124 108 93 92 93 71 22 -24 -40 -28 -13 -12 -26 -49 -71 -79 -68 -41 -9 27 63 87 90 83 74
-807G4j4k5k5oJ5J8J2J2K1J5nk7l1k0%J7K7K4J5RMlj1j4j8k4k9k6j7lJ6L7N1L6jl8n5n3m1
$$ 74 60 35 10 4 19 37 49 61 82 97 92 65 34 14 14 31 58 82 97 106 110 107 96 82 64 40 11 -15 -32 -35 -19 18 69 105 104 66 11 -42 -83
-824h3k3jK1L6M1L1J5lj4j7j7j0MJ8J7NmMJ9K7K6J8Oj5l2l8l8m2m1k9nJ8K4J3mj4nJ4K7J3
$$ -83 -106 -107 -86 -50 -9 22 37 34 20 3 -14 -24 -20 -2 15 20 16 20 39 66 92 110 116 101 69 31 -7 -49 -90 -119 -124 -106 -82 -69 -73 -87 -92 -78 -51 -38
-842c8j2k2j3MJ2J9L4N4O1L9Jk8l6k2r%NJ4J8J0pj8j5pqj0jJ3J4jj4qPNj0j9j3qj0oJ3K5J7
$$ -38 -50 -72 -85 -81 -69 -50 -16 38 99 138 139 111 75 53 44 44 49 63 81 91 84 66 51 44 36 26 25 38 52 51 37 29 36 41 31 12 -1 -9 -19 -25 -12 13 30
-860C0nj5pLMJNJ1J2QKnj1j5j4j1rmk%OJ1Ooj8j8j1j0nJ5M1M4L0J8J7J1qk3j7j0j8k7j2J0
$$ 30 25 10 3 6 10 11 16 27 39 47 49 44 33 18 4 -7 -16 -20 -22 -22 -16 -5 1 -5 -23 -41 -52 -62 -67 -52 -11 33 63 81 98 109 101 78 61 51 33 6 -6 4
-879DK1Rjlpj9k1rKMKNJ0RNlqplnj4j3OK5K1kk3l7m2l8j4K7N6N5L2Nj6k3j2OJ0LQL4N4M5J5
$$ 4 25 34 33 30 23 4 -17 -26 -24 -20 -18 -13 -3 6 11 8 0 -7 -10 -15 -29 -42 -36 -11 10 8 -15 -52 -94 -132 -146 -119 -63 -8 24 29 13 -10 -22 -16 -6 -3 5 39 93 138 153
-900A53pj7j6mJ8K8Qk4l8k8j6j3j5j3j2j1kJ5K7K0Omrj8k8k4j0LMJNJ0PJLJ2K1J0j2k4j5J
$$ 153 146 129 113 109 127 155 163 139 101 73 57 44 29 16 4 -7 -9 6 33 53 59 55 46 28 0 -24 -34 -31 -27 -26 -21 -11 -4 -3 0 12 33 43 31 7 -8 -7
-918gJ5K6K6Rk2m6n0l6j7oLJ5K3K4J8RLNJ0J8J6PNJ6L2L7J9j4l7l6j4RJ3Mnnmqj0%J4J6Lo
$$ -7 8 34 60 69 47 1 -49 -85 -102 -108 -105 -90 -67 -43 -25 -16 -13 -8 2 20 36 43 48 64 96 133 152 138 101 65 51 60 73 77 72 67 63 55 45 45 59 75 78 72
-937G2%J3J1qj5pkj2k1nK7M0K6PPQlk1l0k5j1PK3L1K1OjJoj6k1j6j5j8k3k6l0l7l5j9LJ0L
$$ 72 72 85 96 88 73 66 64 52 31 26 53 93 119 126 133 141 138 117 87 62 51 58 81 112 133 139 138 139 133 117 96 80 65 47 24 -2 -32 -69 -104 -123 -120 -110 -107
-956a07j2j8j6j0jJ5L6N3N1L2J3LJORNqk0qK3M4L1Lj0mjj8l5l6k3j4j8k5k8j9mQJ0RJ9L5M2
$$ -107 -119 -137 -153 -163 -164 -149 -113 -60 -9 23 36 39 40 46 55 60 52 32 24 47 91 122 125 115 111 110 92 57 21 -2 -16 -34 -59 -87 -106 -110 -102 -92 -83 -64 -29 13
-974A3K8ll4m8m5k1QL3M6N0N1L8J1j8k7j7%%j3k2j9j1j0j4lJ6K9L3K4Pj6k6nL8N9M2J5RJ2
$$ 13 41 38 4 -44 -89 -110 -102 -69 -23 27 78 116 127 109 82 65 65 65 52 30 11 0 -10 -24 -27 -11 18 51 75 82 66 40 35 73 132 174 189 198 210
-991B10%k4l6l5m0m3k1K3M9L2%j6j2nNJ6K0Nj5k4k0j9k4k5j5lQK0M0N3M1Nl4n1m3k4j1mlj3
$$ 210 210 186 150 115 75 32 11 34 83 115 115 99 87 82 87 103 123 128 113 89 69 50 26 1 -14 -17 -9 11 51 104 145 150 116 65 22 -2 -13 -17 -20 -33
-1008c3k8k8j2PQkpmoj2nJ2K1J9J9K3J4llJ6K8J9RK2L6K7Loqk0l6l4j5nj1j1J2M0M0J5j2j6
$$ -33 -61 -89 -101 -94 -86 -88 -95 -99 -105 -117 -122 -110 -89 -70 -51 -28 -14 -17 -20 -4 24 43 52 74 110 137 140 134 126 106 70 36 21 16 5 -6 6 46 86 101 89 73
-1026G3NL1L5J1j3j1QJ0j3l1k8k4l2l5j8J8L9M2L4K3Lj8k5j1MMmnLNpk1k1j3j0j6j9pJ5K3
$$ 73 78 109 144 155 142 131 139 149 136 105 77 53 21 -14 -32 -14 25 67 101 124 127 109 84 73 77 81 77 72 75 80 73 52 31 18 8 -8 -27 -34 -19 4
-1044DJ7RPJ4J8J3Kj1k2k1qJ1K6L1K0ROOmk0k4j3koj6j4prj5j1oj7l4k3J4L9K1j4k7lK6M5
$$ 4 21 30 37 51 69 82 84 73 51 30 22 33 59 90 110 119 125 131 127 107 83 70 68 62 46 32 25 16 1 -10 -16 -33 -67 -90 -76 -37 -16 -30 -57 -60 -34 11
-1062A1M8L5J0j6j8NL1L9K9J3mk1l9m5l7k9l6n2n1j8K3L7K1%qj1j7k5j9QM1N3L6PjJ4K7J6
$$ 11 59 94 104 88 70 75 106 145 174 187 183 162 123 78 41 12 -24 -76 -127 -145 -122 -85 -64 -64 -72 -83 -100 -125 -144 -136 -95 -42 -6 1 0 14 41 57
-1078E7KJ2M0N0K9Kj3k1k7j6QK0Kj7j0J2K2J0lj7l7m8l2mLj0j3LJ1mj9j6jOJ1J7K0PkOK4K6
$$ 57 59 71 111 161 190 192 179 158 131 115 123 143 145 128 118 130 152 162 159 142 105 57 25 21 24 14 1 4 15 11 -8 -24 -25 -19 -8 9 29 36 34 40 64 90
-1096I0J2lrj6k8l7l2k4j7j1PK5L1J6mk1j9kK0K9J8jpPK1J8NmjjjJJ0J3OKQJ7J4Mrk0k6k2
$$ 90 102 99 90 74 46 9 -23 -47 -64 -75 -68 -43 -12 4 0 -21 -40 -42 -22 7 25 24 17 24 45 63 68 64 63 62 61 62 72 85 91 93 101 118 132 136 127 107 81 59
-1115E9oQQnrjJ1J5J3J2J1Olk2m8o2n6k9jK0L3M1M1M1L4J8qk2j2J2K5K0J8J8Jl3n7m2oK1K0
$$ 59 53 61 69 64 55 54 65 80 93 105 116 122 119 97 49 -13 -69 -98 -99 -79 -46 -5 36 77 111 129 121 99 87 99 124 144 162 180 181 148 91 49 43 64 84
-1133H4Pjllj1k6k7rK0L2K0KnprmKkj4rJ8L2Pk8l4nJ6J8J5J6Qj1j9mJ0N%J4M1M2J3j6k2j2
$$ 84 91 90 87 84 73 47 20 11 31 63 83 85 80 73 64 60 62 60 46 37 55 87 94 66 32 27 43 61 76 92 100 89 70 66 76 81 81 95 136 178 191 175 153 141
-1152A41pj8l1l7l1k2j8qNRnk4k3jK1K0LqLK9N1N5K9j6m4m1j9KJ7K7K0j0l8l1QL6K9Jj2oR
$$ 141 134 116 85 48 17 -5 -23 -31 -26 -17 -22 -46 -69 -70 -49 -29 -26 -34 -31 -2 49 104 133 117 73 32 13 15 32 59 79 69 31 0 8 44 73 74 62 56 65
-1170F5K2L5L3Qk1k6pJ1J3MNJ3J4Lnj0j3j9k0j3nmj1j8j9j2mQK0K5J9Mnqorj4j6j4j4j1lQ
$$ 65 87 122 155 163 142 116 109 120 133 137 142 155 169 172 167 157 144 125 105 92 87 83 72 54 35 23 19 27 47 72 91 95 90 82 76 67 53 37 23 9 -2 -5 3
-1189CJ8J7RLKMPJ2J5J7J9J6QjlNPj1l3l6j5MJj7k5j7njjkJJMJ5L1M0L8K9K3J9Pj2l0l3k5
$$ 3 21 38 47 50 52 56 63 75 90 107 126 142 150 149 146 151 158 147 114 78 63 67 68 51 26 9 4 3 2 0 1 2 6 21 52 92 130 159 182 201 208 196 166 133 108
-1208A08j4onqrmJ2K0J1j7m1m4k7j0LJ5K1J5j4m0m2j2K3M0L7K4Lk2m3m3j8J0K2J8J3Ook3k4
$$ 108 94 88 83 75 66 62 74 94 105 88 47 3 -24 -34 -31 -16 5 20 6 -34 -76 -88 -65 -25 12 36 39 17 -26 -69 -87 -77 -55 -37 -24 -18 -24 -47 -71
-1225g1kL5N8N8L3Mj7k5k6k2j7j1mJkj3k4j5J3L8L9K2OPJ6J5%k2m1m4l1oOok1k1rlmnoj7k8
$$ -71 -73 -38 20 78 111 115 98 73 47 25 8 -3 -7 -6 -8 -21 -45 -60 -47 -9 30 52 58 65 81 96 96 74 33 -11 -42 -48 -42 -48 -69 -90 -99 -102 -106 -111 -117 -134 -162
-1244a62k1QL6L7J6j0k4j6J1L5L4J5JKQJ1K3M1M2J6j2j0J2K2J6Lnj3j6rPJ7K1K3K1Qj5l6m6
$$ -162 -183 -175 -139 -102 -86 -96 -120 -136 -125 -90 -56 -41 -40 -38 -30 -19 4 45 87 103 91 81 93 115 131 134 129 116 100 91 98 115 136 159 180 188 173 137 91
-1261I1m8m1k4kJ5K0J9J1jj1j6j6k5l3k2LK7L4K7J8J4J7K6L0J7%kJ0J4%rkPjj9k7k2j5roo
$$ 91 43 2 -22 -24 -9 11 30 41 40 29 13 -3 -28 -61 -83 -80 -53 -19 8 26 40 57 83 113 130 130 128 138 152 152 143 141 148 147 128 101 79 64 55 49 43
-1278D3j3k0j3mj2l5n3m4j7J3L1L5L4L7L9K9Mk0k7k3k5j9NL4L7J3j0pNOlqjNJj0j8j8mJ4K7
$$ 43 30 10 -3 -7 -19 -54 -107 -151 -168 -155 -124 -89 -55 -18 21 50 54 34 7 -16 -41 -60 -55 -21 16 29 19 12 17 23 20 12 11 16 17 7 -11 -29 -33 -19 8
-1296HK9J9MpoPJ9J7Kj6l4n2o4m6pK3K7K9M5N4L2j2l2j2J6K3J2Nkj4k4j7NJ6J0KQK6L5K9Q
$$ 8 37 56 60 53 47 54 73 90 92 76 42 -10 -74 -120 -127 -104 -77 -48 -3 51 83 71 39 27 43 66 78 83 81 67 43 26 31 47 57 59 67 93 128 157 165
-1314A65j5k9k8k1k0k1j6o%jlMRJ0J2J8J9RkMK0K7J1j9l6k9rQJ0Koqj2j8k0mK1L2K5J0%j0
$$ 165 150 121 93 72 52 31 15 9 9 8 5 9 18 28 40 58 77 86 84 88 108 135 146 127 91 62 53 61 71 73 67 59 47 29 9 5 26 58 83 93 93 83
-1332H3j9k1rJ2K3J8Jj6k4k3j5qkjLJ2J9J7QjjRJ7J4ll2o0o4l7jJ3LMK4L6J4k1k6mJ2Jj3j4
$$ 83 64 43 34 46 69 87 88 72 48 25 10 2 0 -1 2 14 33 50 58 57 56 65 82 96 93 61 1 -63 -100 -101 -88 -85 -81 -57 -21 -7 -28 -54 -58 -46 -45 -58 -72
-1351g2olKJ4J8RLMMj0k1j9pMJ6L5M3L3J5J0J5Oj2k2k0j6j0RK6J6j2k8j9onlPQoj9j0QJ6J4
$$ -72 -78 -81 -79 -65 -47 -38 -35 -31 -27 -37 -58 -77 -84 -80 -64 -29 14 47 62 72 87 93 81 59 39 23 13 22 48 64 52 24 5 -1 -6 -9 -2 6 0 -19 -29 -21 -5 9
-1370IJ6J9Qj4l4m4m5l5j6K%j1j5lJ7L2L3J6rk4k2j0lnjRK1K1J1kJK1L6K4kj0J2M0M0J3j0
$$ 9 25 44 52 38 4 -40 -85 -120 -136 -134 -134 -145 -160 -163 -146 -114 -81 -65 -74 -98 -120 -130 -133 -138 -139 -130 -109 -88 -77 -79 -78 -57 -21 3 1 -9 3 43 83 96 86
-1388H6j6j4j2lPPj0l2m0l4j6QK4K4QnoLQQN%rk2k2oJ9L9L6K1LmlJQJ4Qqj2OK9L5K2Qkk0m3
$$ 86 70 56 44 41 48 55 45 13 -27 -61 -77 -69 -45 -21 -13 -18 -24 -21 -13 -5 0 0 -9 -31 -53 -59 -40 -1 35 56 59 55 52 53 61 75 83 75 63 69 98 133 155 163 161 141 98
-1408I8m9l1j5j2j3LK1J7rk4j3J6L4L8L1J7kk0k2j2k%JOJ3Rmj3j4j5k7l6k9qMkoJ0L5M4L5
$$ 98 49 18 3 -9 -22 -19 2 19 10 -14 -27 -11 23 61 92 109 107 87 65 53 51 51 52 58 71 80 76 63 49 34 7 -29 -58 -66 -62 -64 -70 -60 -25 19 54
-1426E4J7PKjnnoj0j7k4l0m1m9m6k5OL1L6K7J4LopLJ9K2QqoJ6L1K8Rrj3rmoj2k0k3j5kJ2K6
$$ 54 71 78 80 79 74 69 63 53 36 12 -18 -59 -108 -154 -179 -173 -142 -106 -79 -65 -62 -68 -75 -72 -53 -31 -23 -31 -37 -21 10 38 47 38 25 16 12 6 -6 -26 -49 -64 -66 -54 -28
-1445b8L4L3J6JNL0M9M1J6jlj3l3m6l5qQPJkkLJ0Pj2l3l7k4j3pKJ5J9Mj1j9j3JK0L4L2J3J
$$ -28 6 39 55 56 61 91 140 181 197 196 193 180 147 101 66 58 66 73 74 72 70 73 83 90 78 45 8 -16 -29 -36 -34 -19 0 4 -7 -26 -39 -38 -18 16 48 61 62
-1464F2J3K7K0jj5j0nj3k2k6k7k6k0%J5J0orJ1L7M3K6PPK0J7pk9k7lJ3Lj7k7j6PK6L5K8J3
$$ 62 75 102 122 121 106 96 91 78 56 30 3 -23 -43 -43 -28 -18 -24 -33 -22 15 58 84 91 98 118 135 128 99 72 69 82 85 68 41 25 32 58 93 121 134
-1481A34MMJrj9j3%PMJQJ6J2j1l7m7l4rJpj7j9qlrj5jK6M6M2J2j8k9k2j0KJ0J0OPK0L5L3Q
$$ 134 138 142 143 134 115 102 102 109 113 114 122 138 150 139 102 55 21 12 13 6 -11 -30 -38 -41 -50 -65 -66 -40 6 48 60 42 13 -9 -19 -17 -7 3 9 16 36 71 104 112
-1500A12j5k4j9j1jQJ2Pjj0k1k9k2LL0M3M0K5Jk8l7k2j%j0rMRMQK3K8J4%OJ6J2lj5k8m4n2
$$ 112 97 73 54 43 42 50 62 69 68 58 37 8 -14 -11 19 62 102 127 128 100 63 41 40 40 30 21 25 34 38 46 69 97 111 111 117 133 145 142 127 99 55 3
-1519Cl5mK2L0J7j2m0m2pL6M9M1L1L0K0Kojlj7k6j8pnomJQJ9K7J5j2k7j8lnj4j4pnjRJ3lk0
$$ 3 -32 -36 -14 16 33 21 -19 -61 -68 -32 17 58 89 119 139 141 135 134 131 114 88 70 63 58 52 48 49 57 76 103 118 106 79 61 58 53 39 25 18 13 12 21 34 31 11
-1538A1j5LJ2PLRJ0NPK3L3K0j0m1n4m0pK0K0KmRK6L6M4M3K5ok3k2k2k9k5pJopJ4K7Pk4l0j9
$$ 11 -4 -1 11 18 21 30 40 45 52 75 108 128 118 77 23 -17 -24 -4 16 18 14 23 49 85 129 172 197 191 168 146 124 95 70 63 64 58 51 65 92 99 75 45 26
-1557B6k2l5l6j6mrrLJ0KjJ9M3L9J3j5j8pRJ2QJk%JkjPJ4J8K0K5K3J5Lqj8k6k8k3j6lK0M4
$$ 26 4 -31 -67 -83 -87 -96 -105 -102 -92 -90 -91 -72 -29 10 23 8 -10 -17 -8 4 12 13 11 11 12 10 9 16 30 48 68 93 116 131 134 126 108 82 54 31 15 12 32 76
-1576G6N6M6K4Lj1j7j7j7k6l1k3pmk0l1k1lJj0j1QK6L0K9L8M9L5on5q1p7n0j4J7K8J3j0j7
$$ 76 132 178 202 205 194 177 160 143 117 86 63 56 52 32 1 -20 -23 -22 -32 -43 -35 -9 21 50 88 137 172 166 111 30 -47 -97 -111 -94 -66 -53 -63 -80
-1592h0kJ9K4J9J4J6K4L3M2M4L1Pj2j7j6j4oRK0J7Lqj8k3j8kJ1Oj0k0j6j0j1j6j9j7j8j9j9
$$ -80 -82 -63 -39 -20 -6 10 34 67 109 153 184 191 179 162 146 132 126 135 155 172 175 167 149 126 108 106 117 123 113 93 77 67 56 40 21 4 -14 -33 -52
-1609e2j4nPK1L0L0K2Mj6k4j3LJ3J7K0J8J0jMK3L1J2j6l0k6k3k8l0j9KK0K8K9K2J0NJ0J4K
$$ -52 -66 -71 -64 -43 -13 17 39 43 27 3 -10 -7 6 23 43 61 71 70 74 97 128 140 124 94 68 45 17 -13 -32 -30 -10 18 47 69 79 84 94 108 110
-1626A10j7k1j7k0k8k2NK8K8J0nj1j8k4j4OJ3MokNJ0J2K0K7K2J1%ormQJ5Kj9k6j1OQoj7j6
$$ 110 93 72 55 35 7 -15 -10 18 46 56 51 40 22 -2 -16 -10 3 7 1 -1 4 14 26 46 73 95 106 106 100 91 87 95 110 112 93 67 56 62 70 64 47 31
-1644C1pjkpnMRQOQJk2m7n3l5j4LJ8L7M6L3Oj9l0k0jJ8K5J8LplJ4L3L0Ok7m7n0m0j8MJ1lj7
$$ 31 24 23 21 14 9 13 22 30 36 44 45 23 -24 -77 -112 -126 -123 -105 -68 -22 11 17 -2 -32 -52 -53 -35 -10 8 11 4 1 15 48 78 84 57 10 -40 -80 -98 -94 -83 -86 -103
-1664a03nK4M0K3j2l6l3nL2N2M5K6J6J3NlOK6K6ll0k7j0oj2qQJ2lj9k3k5l3l5k1MK9M0L6K3
$$ -103 -108 -84 -44 -21 -33 -69 -102 -107 -75 -23 22 48 64 77 82 79 85 111 137 134 104 77 67 61 49 41 49 61 58 39 16 -9 -42 -77 -98 -94 -65 -25 11 34
-1681C4RKlj1j8j3%PJnlJqk4k2PM1N2M2K5K1K1Oj9l2k5rkllKjpoMPlj7k5k5l0k5%K9L1jl5
$$ 34 43 45 42 31 13 0 0 7 8 3 0 1 -7 -31 -53 -46 -5 47 89 114 135 156 162 143 111 86 77 75 72 69 71 70 63 57 61 68 65 48 23 -2 -32 -57 -57 -28 3 2 -33
-1702c3k9QL2J7j6k9j7MJ2J5J5J9K5L1K6Rj2j8oRJ0Jj7l4l7j3L0N6M1Nj7j8j4k2k9j9NL3N3
$$ -33 -62 -54 -22 -5 -21 -50 -67 -63 -51 -36 -21 -2 23 54 80 89 77 59 53 62 72 73 56 22 -15 -28 2 58 99 104 87 69 55 33 4 -15 -10 23 76
-1718G6N1K3j2l0k5j3j5l0m0l0pJ3K0J8J6J4NmpjJJNJ1J1J%J3K4J2j1j9j0NJ0J3J3Mj6l5l9
$$ 76 127 150 138 108 83 70 55 25 -15 -45 -52 -39 -19 -1 15 29 34 30 23 22 23 24 29 40 51 52 52 65 89 101 90 71 61 66 76 89 102 106 90 55 16
-1736A6k4mQKj7k7j7NJ4J7K0K1Mk6m1k6pj0k6k9j4PK3L6M3M0K5Nk0l8l3kK5K8QojJ6K3J7K
$$ 16 -8 -12 -4 -2 -19 -46 -63 -58 -44 -27 -7 14 18 -8 -49 -75 -82 -92 -118 -147 -161 -154 -131 -95 -52 -12 13 18 -2 -40 -73 -75 -50 -22 -14 -20 -21 -5 18 35 37
-1754C7kQJ6Kk4k6LL0L0J5RQkj7j7qj0j6kK5K7ol8l6j1%mmNJ4K1K9L8L4J5%%P%j8l5l8k8j6
$$ 37 35 43 59 61 37 11 14 44 74 89 98 106 104 87 70 62 52 36 34 59 86 80 42 6 -5 -5 -9 -13 -8 6 27 56 94 128 143 143 143 150 150 132 97 59 31 15
-1773A5rj0j3j3j3j2pLJ2J8K3L0L7K9Oj9l2j8RK5J2k2m5l9j4QJ0kj6j3J3M2M5J1l2m8l3j1
$$ 15 6 -4 -17 -30 -43 -55 -62 -59 -47 -29 -6 24 61 90 96 77 45 27 36 61 73 51 6 -33 -47 -39 -29 -31 -47 -60 -47 -5 40 51 19 -29 -62 -73
-1790g3klkLJ0J9K5J8ql0k9nJ2J1ORK0K1J2LknrmJKkLK6M2K9ql3k8j2mnqppJJ6K6J3pj4mJ2
$$ -73 -75 -78 -80 -77 -67 -48 -23 -5 -13 -43 -72 -77 -65 -54 -48 -39 -19 2 14 17 15 10 1 -3 -2 0 -2 1 27 69 98 90 57 29 17 13 8 0 -7 -14 -13 3 29 42 35 21 17 29
-1810B9J6Ppj7j4JJ5J7J5J5J0mj8k1j3j2j8j5MK5L3K8K5K1J3NJmj3k1j6rj1j4nJ2K0J7J3J1
$$ 29 45 52 45 28 14 15 30 47 62 77 87 83 65 44 31 19 1 -14 -10 15 48 76 101 122 135 140 141 137 124 103 87 78 67 53 48 60 80 97 110 121
-1828A21jj9k6j2QJ3Ook1l2l0j3QJ9K0Pj7l3k8ML3L1QmLJ1QJMJ0Mqj8k3k8l2k5nJ5K5J8PN
$$ 121 120 101 75 63 71 84 90 84 63 31 1 -12 -4 15 35 42 25 -8 -36 -32 1 32 40 36 39 50 58 59 63 73 77 69 51 28 0 -32 -57 -62 -47 -22 -4 3 8
-1846HRJ4J4J4J4J3RQJ1J1Lorj0j5k3k2j7k1k9l3k5j4kJ6L7L8J8OJ3K1Oj9k1m%j4k4rJ1J2
$$ 8 17 31 45 59 73 86 95 103 114 125 128 122 113 103 88 65 43 26 5 -24 -57 -82 -96 -98 -82 -45 -7 11 17 30 51 57 38 17 13 13 -1 -25 -34 -23 -11
-1864a1kj2rKJ9K9K7Mk2l3l2k4nK3N2O0L8%l2n3n4l8pJ6J8jj7j7mPJ0OjnKJ5K2J5lj3qNJ4
$$ -11 -13 -25 -34 -32 -13 16 43 47 25 -8 -40 -64 -69 -46 6 66 104 104 72 19 -35 -73 -80 -64 -46 -47 -64 -81 -85 -78 -68 -62 -63 -68 -66 -51 -29 -14 -17 -30 -38 -33 -19
-1883a9J2Opj5rJ3K7J9qk2j3RK4K6J8MomOJ1MpqLJ7J8Mj6k5j2QJ1jj3j4j2j2mJ2J9Oj7k8k5
$$ -19 -7 -1 -8 -23 -32 -19 8 27 19 -3 -16 -7 17 43 61 65 59 55 61 72 76 69 61 64 81 99 103 87 62 50 58 69 68 55 41 29 17 13 25 44 50 33 5 -20
-1902b0j9j3MK4L2K2Noj1j6k1k2k0j1LK1L3L1K4K0K8M0M0J8j2k0JL0K8j2n5o3l6kOnk1k7k7
$$ -20 -39 -52 -48 -24 8 30 35 29 18 2 -19 -41 -61 -72 -69 -48 -15 16 40 60 88 128 168 186 174 154 155 185 213 201 146 83 47 45 51 46 25 -2 -29
-1919b9k2nK1M1M2K1ok2k5k5k7k3j5kJ5L3M8N7M7J9j2l1k1jRL%J0J8Mj8k7j7kMPJ2J6J6J8
$$ -29 -51 -56 -35 6 48 69 63 41 16 -9 -36 -59 -74 -76 -61 -28 20 77 124 143 131 100 79 78 87 90 90 100 118 122 104 77 60 58 62 69 81 97 113 131
-1936A31K3K6K0Kk0l3k7oOnk3k8j9rnlJ%mmrk4m4m2j6RJ3ONLjJJ6K9K4RNQKprj%MK3M4M1J0
$$ 131 154 180 200 202 182 149 122 116 122 117 94 66 47 38 33 30 31 31 27 23 14 -10 -54 -96 -112 -103 -90 -84 -79 -76 -77 -76 -60 -31 -7 2 7 15 17 10 1 0 0 4 27 71 112 122
-1957A22j1nJ0J0%LJ4J1qk6k9l3m1m0k1J0K1Oj1mJ6J9nk8k2OK3J2j1l0l6l0qJ4J4qk3j2J5
$$ 122 111 106 116 126 126 129 143 154 146 120 91 58 17 -23 -44 -34 -13 -7 -18 -22 -6 13 8 -20 -42 -36 -13 -1 -12 -42 -78 -108 -116 -102 -88 -96 -119 -131 -116
-1974a16K7J8PQJ4J2ONRQKqr%J9L8M7L5Rk1m0m2k7mRJ2%j0j3rJJ0J4PmnJ6L9L8J3pqmk2m6
$$ -116 -89 -71 -64 -56 -42 -30 -24 -19 -10 -2 0 -8 -17 -17 2 40 87 122 131 110 70 28 1 -3 6 18 18 8 -5 -14 -13 -3 11 18 14 9 25 64 102 115 108 100 96 74 28
-1993B8m3qK4K0j4l4k6kJ9L3L7L1J0j2k4k5k1j9j1NK5L1K0jj6j8qQJ9J9OjNK1K2Jk0j8OL1
$$ 28 -15 -23 1 21 7 -27 -53 -55 -36 -3 34 65 75 63 39 14 -7 -26 -37 -32 -7 24 44 43 27 9 1 9 28 47 53 52 57 78 100 101 81 63 69 100
-2011A00M1L0Jl3m7l0nkk3l6k9j7j9k8k4pJ2K8M4N7O3N4L3Oj6k9k8k5l0l8l3j6NJ6J2jj3j2
$$ 100 141 171 172 139 92 62 57 55 32 -4 -33 -50 -69 -97 -121 -128 -116 -88 -44 13 76 130 163 169 153 124 96 71 41 3 -30 -46 -41 -25 -13 -14 -27 -39
-2027c9NK2K2J0LLjj5j7kK0K4PojJ6K9K5Lk3l9l2j0PJ2Lj1l1n2n5l3lJ3%k5l7k1J0L5M8M7
$$ -39 -34 -12 10 20 23 26 25 10 -7 -9 11 35 42 36 35 51 80 105 108 85 46 14 4 11 23 26 15 -16 -68 -123 -156 -159 -146 -146 -171 -208 -229 -219 -184 -136 -89
-2045h9M1K6J1KLjj0j6JK5K7Lk2k2pJkjRJ6Nj0j5JK9N2M9K6LJJ2J7RPJ7K9K6J0nj1j5j4qm
$$ -89 -48 -22 -11 -9 -6 -7 -17 -33 -32 -7 20 23 1 -21 -28 -27 -29 -30 -21 -5 0 -10 -25 -24 5 57 106 132 135 136 148 165 174 181 198 227 253 263 258 247 232 218 210 206
-2064B06j4l1l0lK3K9J6Mkj6l4m0k9j0lnlNQJpjJ7L4L2J5KKJ3J0j3m2n7n2l4j6JJ0J0NQJ1
$$ 206 192 161 131 128 151 180 196 200 198 182 148 108 79 69 66 61 58 63 71 72 65 64 81 115 147 162 164 166 179 189 176 134 77 25 -9 -25 -24 -14 -4 1 9 20
-2082B0Pqj6lJ0J5MkJMNMRNqj8j3nj0j5pJ4J8Kj3oJ2J7Jj7j9j4omj1k7l9l1NM7O7N7M0L8M7
$$ 20 27 19 3 0 10 25 29 27 28 32 37 41 50 55 47 29 16 11 1 -14 -21 -7 11 13 0 -6 6 23 24 7 -12 -26 -32 -36 -47 -74 -113 -144 -139 -92 -25 32 72 110 157
-2102A57M3Ol8n2k4RJ2j7m2m2k8k0j7pQK0J7P%jJMNPJ1J5J5PjlJkj7k7k3j1qj3j0J3L8M2J7
$$ 157 200 206 168 116 92 101 113 96 54 12 -16 -36 -53 -60 -52 -32 -15 -8 -8 -9 -8 -4 1 8 19 34 49 56 55 52 53 51 34 7 -16 -27 -35 -48 -58 -45 -7 35 52
-2120E2j9l9l8j8%NJLJ3K4K0J3RJ5J4Jj3j5j4k3l7l3qJ8K5J8J4J2Onj1lJ5L1K9J1j7l3l1j7
$$ 52 33 -6 -44 -62 -62 -57 -56 -53 -40 -16 4 17 26 41 55 56 43 28 14 -9 -46 -79 -87 -69 -44 -26 -12 0 6 1 -10 -13 2 33 62 73 56 23 -8 -25
-2138b5noj3j4pLJ3K3K9K7K6K0Pj7l9l9k3lOPJ0J3J2J3J9K9K5Oj3j8j3j4k0k2k3k3k2rJ7L8
$$ -25 -30 -36 -49 -63 -70 -67 -54 -31 -2 25 51 71 78 61 22 -17 -40 -43 -37 -30 -20 -7 5 18 37 66 91 97 84 66 53 39 19 -3 -26 -49 -71 -80 -63 -25
-2155b5L5J7%lNJ7K9L5K6Jk7m7m7l1j6rrpKJ2J1NJNJ2J2OjLK0L7L3Ml3m9l6j0J4K3K5K1J9
$$ -25 10 27 27 24 29 46 75 110 136 137 110 63 16 -15 -31 -40 -49 -56 -54 -42 -31 -26 -25 -20 -8 4 10 9 12 32 69 102 106 73 24 -12 -22 -8 15 40 61 80
-2173H0K1K2J5Krj2j3j0%J7L0K7J5%j1k3l5l5k0PL0L6K2pl2l7j8J4L2K5%j2KK2K4ll4m7l7
$$ 80 101 123 138 140 131 119 106 96 96 113 143 170 185 185 174 151 116 81 61 68 98 134 156 149 117 80 62 76 108 133 133 121 123 145 169 166 132 85 48
-2190D8j2J8M3M9K8mk6k6j6nOJ1Lrj5mJ1J2%j3j2jPJ1J5K4L1K6Lk7n1o0n3l0JK1K0MlLRMp
$$ 48 36 54 97 146 174 170 144 118 102 97 103 114 117 108 93 89 100 112 112 99 87 86 93 104 119 143 174 200 203 176 125 65 12 -18 -17 4 24 28 25 28 37 41 34
-2209C4rjMOM%n%J5K8K6J2LOJ3J1Jj1k1l4m2m0l0j8kJ9L9M0J7j7k7j0J5K4J4jj3j5oJ6L5L4
$$ 34 25 24 28 34 38 38 33 33 48 76 102 114 117 123 136 147 148 137 116 82 40 0 -30 -48 -50 -31 8 48 65 48 21 11 26 50 64 63 50 35 29 45 80 114
-2227A14J6OJ5L2L6K3Jk5n5p7p2l9%K1J5pk4k8j4LJ7K6K8K3J0JLQPORJ0Mpj5j8j4%K4M5M3
$$ 114 130 136 151 183 219 242 243 218 163 86 14 -25 -25 -4 11 4 -20 -48 -62 -59 -42 -16 12 35 45 46 49 57 64 70 79 89 93 86 71 53 39 39 63 108 151
-2245A51K1jj4k2k1j1jpk5l2j4Lok8l3j1ROlPL3N2M2J4rj6j3j1rn%PJ1Rkk0k6j2J1J7QJ0K7
$$ 151 172 171 157 135 114 103 102 95 70 38 24 27 21 -7 -40 -51 -42 -36 -39 -32 1 53 95 109 100 84 71 60 51 46 46 53 64 73 71 51 25 13 24 41 49 59 86
-2263H6L7K0j1l0k5j3noroNJ6K2J5PMLpj8j7rjLJ1J2ll0n0m2j8PJ9J3koPK3K7J6O%oj3rjk
$$ 86 123 143 132 102 77 64 59 53 44 38 43 59 81 96 103 107 110 103 85 68 59 58 61 72 84 81 51 1 -41 -59 -52 -33 -20 -22 -28 -21 2 29 45 51 51 45 32 23 22 20
-2283B0j8j9KK5K2Kj0opj6j7RL8N0M2L1K2Kk9m9m1pK7L8K7Lk7n3o1m1mJ9J5mrLK1L0K8Rj5
$$ 20 2 -17 -15 10 32 34 24 18 11 -5 -22 -13 25 75 117 148 170 172 143 94 53 46 73 111 138 141 114 61 0 -41 -45 -26 -11 -15 -24 -21 0 30 58 67 52
-2301E2k9k0KJ5Nj1j8j5j0j2j8j9mK4M4M0K1%lPJ5J5Jk5m5l7kL2M3K7Qnj3pJ7M3L7nm6n6l8
$$ 52 23 3 5 20 25 14 -4 -19 -29 -41 -59 -78 -82 -58 -14 26 47 47 44 51 66 81 82 57 12 -25 -27 5 48 75 83 78 65 58 75 118 155 150 104 48 10
-2319A0j8nQJ8J7Nl%kj1j7mQLk1l8k8kK0K2J4%j5k2j5jQJoq%OJ8L8N4M5J4rjJ8J9Lj2j0or
$$ 10 -8 -13 -5 13 30 35 32 32 30 19 2 -2 6 9 -12 -50 -78 -80 -60 -38 -24 -24 -39 -61 -76 -77 -69 -68 -74 -82 -82 -76 -58 -20 34 79 93 84 83 101 120 123 111 101 95 86
-2339H6j1rpj4k2k4k5k2j4kJrj3JK7M1L7L1K3Qpj4j2j4k0qK2M4L4Nj2oRJ7J4%j7k6j3J0K5
$$ 86 75 66 59 45 23 -1 -26 -48 -62 -64 -63 -72 -85 -84 -57 -16 21 52 75 83 76 62 50 36 16 8 30 74 108 113 101 95 104 121 135 135 118 92 79 89 114
-2357A14K1Ork2k7j9jJ0LqqKJ0Mj1k9m0l5j4QJ4PJ0K3M2M5L7K5J3lj9k7l0l0k7j3OJ8J4QJ1
$$ 114 135 141 132 110 83 64 63 73 76 68 60 62 72 76 65 36 -4 -39 -53 -45 -31 -24 -14 9 51 96 133 158 171 168 149 122 92 62 35 22 28 46 60 68 79
-2374G9J2ol6n0l7nJ9K8K9K4J3KmmopLJ6J6Kj3j4j5k2k4rJ2K2J6J1J1Qlj1j2j3k2k6k2j4j2
$$ 79 91 85 49 -1 -38 -43 -24 4 33 57 70 72 68 64 58 51 54 70 86 88 75 61 46 24 0 -9 3 25 41 52 63 71 68 57 45 32 10 -16 -38 -52 -64
-2392f4j0%J6K3K3K0J9J0qj8j0OJ4J2MKLJ5L2L7K0nj4%J8K0Rnj4j8j5mJ%nqj0j5j4NK8L1J1
$$ -64 -74 -74 -58 -35 -12 8 27 37 29 11 1 7 21 33 37 39 42 57 89 126 146 141 127 127 145 165 174 169 155 137 122 118 119 119 114 106 96 81 67 72 100 131 142
-2411A42j2j9j9k6l9l8k3jRJ0J5K8M9O0M9K4kj8k5k4k0j4j1j0JJ7K6K2J6J5J0rl5m2l2j8j1
$$ 142 130 111 92 66 27 -11 -34 -35 -26 -16 -1 27 76 136 185 209 207 189 164 140 120 106 95 85 86 103 129 151 167 182 192 183 148 106 74 56 45
-2427D5lJ1K2J7NKQJ3Mj9m0m2j8J4K8J5oj4j0nJJ8L3K9Pj0rKOJ%OJ7K1J3LJNNpj5oJ0Qj3k6
$$ 45 42 53 75 92 97 99 107 120 124 105 65 23 5 19 47 62 56 42 32 27 28 46 79 108 115 105 96 98 104 105 105 111 128 149 162 165 166 171 176 169 154 148 158 166 153 127
-2447A27j5jkj2j2kkmKJ7K1Roj2j3j5k3l1l7l3j1K1L9L4J1mplLONJlrj5j3jJ2Oj5l2l2j4M
$$ 127 112 111 109 97 85 83 81 77 79 96 117 126 120 108 95 80 57 26 -11 -44 -55 -34 5 39 50 46 39 36 39 45 50 51 48 39 24 11 10 22 28 13 -19 -51 -65 -61
-2466f1K2L6M1L2J4jqmJ1L1M2K7Jj5j3pj1j8j6mQRjrrnj1k1j7QL4L2J7J0J5J5lk0k3j6j2j4
$$ -61 -39 -3 38 70 84 83 75 71 82 113 155 182 183 168 155 148 137 119 103 99 107 116 115 106 97 92 81 60 43 51 85 117 134 144 159 174 171 151 128 112 100 86
-2484H6j8k5k8j3J9M8N3L6J4J%RK1K5Ok0l9m3m0l0j2J0J6Mj2j4mRJ6J9K0J2LjRK8L8K7Nj4
$$ 86 68 43 15 2 21 69 122 158 172 173 173 182 203 228 234 214 175 132 92 62 50 60 76 80 68 54 50 59 75 94 114 126 129 128 137 165 203 230 235 221
-2501B21j7j4j5j8j2JRJ0QMjj0k3l2l3k0J1L6M1K3Kj1k1k7k1NK8L2J7Jqj3j7j7j5j1mRJ9K3
$$ 221 204 190 175 157 145 146 155 165 173 177 176 166 143 111 78 58 69 105 146 169 171 160 139 112 91 96 124 156 173 174 166 153 136 119 104 93 89 98 117 140
-2519A40J8J5J1jj4k0k0k2k5j5NK1J9PLLmj3j7j2j1j4j0LJ3J0%%J5L5M1L0QmJPjj9l0k6j5
$$ 140 158 173 184 183 169 149 129 107 82 67 72 93 112 119 122 125 121 108 91 79 68 54 44 47 60 70 70 70 85 120 161 191 199 195 196 203 202 183 153 127 112
-2536A12rqlJNKloo%ROj0k4j9mMpk1k0rLLmqKJ5K3J6JokLjplJ3L0L6J6j5l0k0JNnrKOok1j8
$$ 112 103 95 92 93 98 100 97 91 85 85 94 100 90 66 47 43 47 40 19 -1 -10 -7 -4 -8 -16 -14 1 24 40 41 35 33 36 35 28 25 38 68 104 120 105 75 55 56 61 56 47 49 55 49 28 10
-2559A0mMjopj1j5j2%J2J9K3L1K8J2rj7jK7L8K4nj8nJ5J8Kj4k2l0m2m4k4MJ9J0nj1lJ3K9L1
$$ 10 6 10 9 3 -4 -15 -30 -42 -42 -30 -11 12 43 71 83 74 57 56 83 121 145 140 122 117 132 150 152 138 116 86 44 0 -24 -20 -1 9 4 -7 -10 3 32 63
-2577F3K3Pj0k0k1j3qj0j1jJ4K6J8Jj8k5j9pQJ4J8K7L6L1J1rk0j8j1JJ1J0rl6m6k8OL2L7K1
$$ 63 86 93 83 63 42 29 21 11 0 -1 13 39 57 58 40 15 -4 -11 -3 11 29 56 92 123 134 125 105 87 76 77 88 98 89 53 7 -21 -15 17 54 75
-2595G5%qlKkj0j1ojKONKlmmoqnMJ1Rjj1j2%J2J5QL%jqj0KJ6K1J0nj7k0j6j1njjnrj3pJ1K3
$$ 75 75 67 64 66 64 54 43 37 36 38 44 49 51 48 44 40 34 26 21 25 36 45 44 33 21 21 33 48 56 59 59 58 50 40 42 58 79 89 84 67 47 31 20 15 14 13 8 -1 -14 -21 -10 13
-2617A3K4Qj3l1l9l7k4j1lJ0K6L3K2QRK4L6L3K6K0Mj6k0lJ8J6nk3l0k9j8KJ7Rj2j9KK8L5K3
$$ 13 37 45 32 1 -38 -75 -99 -110 -113 -103 -77 -44 -22 -14 -5 19 55 88 114 134 138 122 102 99 117 133 128 105 75 46 28 30 47 56 44 25 27 55 90 113
-2634A13J2J1J2%k5n0o0m8k9j2KJ9L0K8J3JKJ1J5Qmj4j6j4j4j8j5%J8K3Ppj1kJ1J3J0RRQM
$$ 113 125 136 148 148 123 73 13 -35 -64 -76 -74 -55 -25 3 16 17 19 30 45 53 49 35 19 5 -9 -27 -42 -42 -24 -1 6 -1 -12 -14 -3 10 20 29 38 46 50
-2652E0LQJ4J1nk8l9l0j4%J1K3M6O3O1L1j4l9l2kK6L1K3J3Qkj8k9k5j6j5k4k8j4OJ8J6J0O
$$ 50 53 61 75 86 81 53 14 -16 -30 -30 -19 4 50 113 174 205 191 152 120 118 144 175 198 211 219 217 199 170 145 129 114 90 62 48 54 72 88 98 104
-2669A04jj0j6j2l%lpj3k1k7k1jJ5J3KlQL1M8N0L9K0jj3j9j8j9k2l0l5l4k4qPPok5k8nL0N1
$$ 104 103 93 77 65 62 62 59 52 39 18 -9 -30 -31 -16 -3 -1 -4 4 35 83 133 172 192 191 178 159 141 122 100 70 35 1 -23 -31 -24 -17 -23 -48 -76 -81 -51 0
-2687@M1Rk3l5k7pJ4L3M6L7Pk6l3qK1K4MqLK0J6j1l7l6j9JJ1J6J9J7Jj8k7k0nQK5M1M9M1J6
$$ 0 41 50 27 -8 -35 -42 -28 5 51 88 95 69 36 28 49 73 77 69 72 92 108 97 60 24 5 6 17 33 52 69 70 52 25 5 0 8 33 74 123 164 180
-2705A80j1l1l1j2J3J8pl3l7j9oojJ3J9QojJ5J5%j1qjnj3j5j1rj0j2oLJ2J4J9K9M0L4J6MJ4
$$ 180 169 138 107 95 108 126 119 86 49 30 24 18 17 30 49 57 51 50 65 80 80 69 61 60 55 42 27 16 7 -3 -15 -21 -18 -6 8 27 56 96 130 146 150 164
-2723A64L0L3J7Jnj0j5j6j3j2j9k4k6l1l4k0J5L8K8lj7pjj7l4k9j2pj4oK2M9M6J8l%QKj5k0
$$ 164 194 227 244 245 240 230 215 199 186 174 155 131 105 74 40 20 35 73 101 98 81 74 73 56 22 -7 -19 -26 -40 -46 -24 25 71 89 86 86 94 96 81 61
-2741F1qPJ1PPJ1J4J7K2K2J0qj8j6j9l0l6k0OJ6PpoLRPMJpj2nJ2K1J5mk0k5k6k2rkjqj4j1
$$ 61 53 60 71 78 85 96 110 127 149 171 181 173 155 139 120 90 54 34 40 56 63 56 50 53 62 69 73 74 67 55 50 62 83 98 94 74 49 23 1 -8 -10 -11 -19 -33 -44
-2760d4nNK1M0M4K0j2k0mJ0ml6n7n5l7j9oKJ3K4L6M4N0N1M6L2J7Onj7l2m4m9m3k6LK3K0Ll
$$ -44 -49 -44 -23 17 61 81 69 49 45 55 51 15 -42 -97 -134 -153 -159 -157 -144 -120 -84 -40 10 61 107 139 156 162 157 140 108 64 15 -28 -54 -51 -28 -8 -5 -8
-2777hJ4L7L5J0j3j2J3L6M0K2mk3l4m1m5l4mL1N1M5K3Lpj2k2l7m3l6k5j8j1RL1L7K3POJ2J1
$$ -8 6 43 78 88 75 63 76 112 152 174 170 147 113 72 27 -7 -11 20 71 116 139 142 135 123 101 64 21 -15 -40 -58 -69 -60 -29 8 31 38 44 56 67
-2794F7KlklmMK1L1K3Mj4k6l1k4j0QK1K3J1pk3k4j6j4j4oPK0J7J2J3K0K3J9Rmj4j7j6k3l6
$$ 67 69 66 64 61 57 61 82 113 136 140 126 100 69 45 35 43 64 87 98 91 68 44 28 14 0 -6 1 21 38 50 63 83 106 125 134 130 116 99 83 60 24
-2812B4l0nK5L4K3J2O%ljjj4k7j8NK0J3KNRRKnj3k4k6j4JLkqj0j7j6jK2L5M0L7K5%k8m5m2
$$ 24 -6 -11 14 48 71 83 89 89 86 85 84 70 43 25 30 50 63 65 70 79 88 90 85 72 48 22 8 9 12 10 2 -8 -25 -41 -42 -20 15 55 92 117 117 89 44 2
-2831Bl1k5j8jJ9K7K0QQJ8K0Oj0nJ9L6K6Mj2j5rJJ0J5RLK%j3k7k4oMmj1mJ3K0J1mj3j7j9k0
$$ 2 -29 -54 -72 -73 -54 -27 -7 1 9 27 47 53 43 38 57 93 119 123 111 96 87 88 98 113 122 125 127 127 114 87 63 57 61 57 46 42 55 75 86 82 69 52 33 13
$$ [...]
-3135I4
##END=	
##END=	
