##TITLE=	Oct20-2021.30.fid
TM-VI-107solid Ca+Ph-pyrraz.

##JCAMP-DX=	6.0	$$ MestReNova 14.3.0-30573
##DATA TYPE=	LINK
##BLOCK_ID=	1
##BLOCKS=	2    
##ORIGIN=	Mestrelab Research S.L.
##OWNER=	hrzepa
##$MNOVA/LINK_BLOCK_TYPE=	ITEM	$$ NMR Spectrum
##$MNOVA/ITEM/POLYGON=	(XY..XY)
5321,5835
8722,5835
8722,8208
5321,8208
5321,5835
##$MNOVA/ITEM/Z=	0
##$MNOVA/ITEM/ANGLE=	0
##TITLE=	Oct20-2021.30.fid
##JCAMP-DX=	6.0	$$ MestReNova 14.3.0-30573
##BLOCK_ID=	2
##DATA TYPE=	MNOVA NMR VIEW DATA
##DATA CLASS=	MNOVA VIEW DATA
##$MNOVA/ITEM/ZOOM/X=	-4.0107147498308073352,	16.011019999997905927
##$MNOVA/ITEM/ZOOM/Y=	-627.83941531181335449,	6874.0504150390625
##END=	
##TITLE=	Oct20-2021.30.fid
##JCAMP-DX=	6.0	$$ MestReNova 14.3.0-30573
##BLOCK_ID=	3
##DATA TYPE=	NMR SPECTRUM
##DATA CLASS=	XYDATA
##NUMDIM=	1
##ORIGIN=	Bruker BioSpin GmbH
##OWNER=	nmr
##.OBSERVE FREQUENCY=	400.20240119999999706
##.OBSERVE NUCLEUS=	^1H
##.SOLVENT NAME=	Acetone
##.PULSE SEQUENCE=	zg30
##LONGDATE=	2021/10/20 16:01:00.000
##.ACQUISITIONMODE=	SIMULTANEOUS (DQD)
##$ORIGINAL FORMAT=	Bruker XWIN-NMR
##$MNOVA/SCALES_VERSION=	9
##$PARAMETER FILE=	(acqus, ASCII, /private/var/folders/f6/rjf_tdyn2v98c5c0wvkgn4s80000gn/T/9UkUjz7JSo6RmVciZo9zgQ/30/acqus, 0)
$$ ##TITLE= Parameter file, TOPSPIN		Version 3.2
$$ ##JCAMPDX= 5.0
$$ ##DATATYPE= Parameter Values
$$ ##NPOINTS= 11	$$ modification sequence number
$$ ##ORIGIN= Bruker BioSpin GmbH
$$ ##OWNER= nmr
$$ $$ 2021-10-20 16:01:37.620 +0100  nmr@CZC2439F63
$$ $$ /opt/topspin/data/agmb/nmr/Oct20-2021/30/acqus
$$ $$ process /opt/topspin3.2/prog/mod/shimcntl
$$ ##$ACQT0= -2.10084033613445
$$ ##$AMP= (0..31)
$$ 100 100 100 100 100 100 100 100 100 100 100 100 100 100 100 100 100 100
$$ 100 100 100 100 100 100 100 100 100 100 100 100 100 100
$$ ##$AMPCOIL= (0..19)
$$ 0 0 0 0 0 0 0 0 0 0 0 0 0 0 0 0 0 0 0 0
$$ ##$ANAVPT= -1
$$ ##$AQSEQ= 0
$$ ##$AQ_mod= 3
$$ ##$AUNM= <au_zg>
$$ ##$AUTOPOS= <3 >
$$ ##$BF1= 400.2
$$ ##$BF2= 400.2
$$ ##$BF3= 400.2
$$ ##$BF4= 400.2
$$ ##$BF5= 400.2
$$ ##$BF6= 400.2
$$ ##$BF7= 400.2
$$ ##$BF8= 400.2
$$ ##$BYTORDA= 0
$$ ##$CAGPARS= (0..11)
$$ 0 0 0 0 0 0 0 0 0 0 0 0
$$ ##$CFDGTYP= 0
$$ ##$CFRGTYP= 9
$$ ##$CHEMSTR= <none>
$$ ##$CNST= (0..63)
$$ 1 1 145 1 1 1 1 1 1 1 1 1 1 1 1 1 1 1 1 1 1 1 1 1 1 1 1 1 1 1 1 1 1 1 1
$$ 1 1 1 1 1 1 1 1 1 1 1 1 1 1 1 1 1 1 1 1 1 1 1 1 1 1 1 1 1
$$ ##$CPDPRG= (0..8)
$$ <> <> <> <> <mlev> <mlev> <mlev> <mlev> <mlev>
$$ ##$D= (0..63)
$$ 0 1 0 0 0 0 0 0 0 0.06 0 0 0 0 0 0 0.0002 0 0 0 0 0 0 0 0 0 0 0 0 0 0 0
$$ 0 0 0 0 0 0 0 0 0 0 0 0 0 0 0 0 0 0 0 0 0 0 0 0 0 0 0 0 0 0 0 0
$$ ##$DATE= 1634742096
$$ ##$DE= 6.5
$$ ##$DECBNUC= <off>
$$ ##$DECIM= 2496
$$ ##$DECNUC= <off>
$$ ##$DECSTAT= 4
$$ ##$DIGMOD= 1
$$ ##$DIGTYP= 12
$$ ##$DQDMODE= 0
$$ ##$DR= 22
$$ ##$DS= 2
$$ ##$DSPFIRM= 0
$$ ##$DSPFVS= 20
$$ ##$DTYPA= 0
$$ ##$EXP= <proton>
$$ ##$F1LIST= <111111111111111>
$$ ##$F2LIST= <222222222222222>
$$ ##$F3LIST= <333333333333333>
$$ ##$FCUCHAN= (0..9)
$$ 0 2 0 0 0 0 0 0 0 0
$$ ##$FL1= 90
$$ ##$FL2= 90
$$ ##$FL3= 90
$$ [...]
$$ ##$Sgu3PowerLevels= (0..7)
$$ 0 0 0 0 0 0 0 0
$$ ##$Sgu4PowerLevels= (0..7)
$$ 0 0 0 0 0 0 0 0
$$ ##$Sgu5PowerLevels= (0..7)
$$ 0 0 0 0 0 0 0 0
$$ ##$Sgu6PowerLevels= (0..7)
$$ 0 0 0 0 0 0 0 0
$$ ##$Sgu7PowerLevels= (0..7)
$$ 0 0 0 0 0 0 0 0
$$ ##$Sgu8PowerLevels= (0..7)
$$ 0 0 0 0 0 0 0 0
$$ ##$SguType= 3
$$ ##$ShimPowMaxUA= (0..63)
$$ 130000 130000 130000 130000 130000 130000 130000 130000 130000 130000 130000
$$ 130000 130000 130000 130000 130000 130000 130000 130000 130000 0 0 0 0
$$ 0 0 0 0 0 0 0 0 0 0 0 0 0 0 0 0 0 0 0 0 0 0 0 0 0 0 0 0 0 0 0 0 0 0 0 0
$$ 0 0 0 0
$$ ##$ShimPowMaxUC= (0..63)
$$ 130000 130000 130000 130000 130000 130000 130000 130000 130000 130000 130000
$$ 130000 130000 130000 130000 130000 130000 130000 130000 130000 0 0 0 0
$$ 0 0 0 0 0 0 0 0 0 0 0 0 0 0 0 0 0 0 0 0 0 0 0 0 0 0 0 0 0 0 0 0 0 0 0 0
$$ 0 0 0 0
$$ ##$ShimPowMaxUG= (0..63)
$$ 524287 524287 524287 524287 524287 524287 524287 524287 524287 524287 524287
$$ 524287 524287 524287 524287 524287 524287 524287 524287 524287 0 0 0 0
$$ 0 0 0 0 0 0 0 0 0 0 0 0 0 0 0 0 0 0 0 0 0 0 0 0 0 0 0 0 0 0 0 0 0 0 0 0
$$ 0 0 0 0
$$ ##$ShimPowRcbType= 3
$$ ##$ShimPowRes= (0..63)
$$ 1e-20 1e-20 1e-20 1e-20 1e-20 1e-20 1e-20 1e-20 1e-20 1e-20 1e-20 1e-20
$$ 1e-20 1e-20 1e-20 1e-20 1e-20 1e-20 1e-20 1e-20 0 0 0 0 0 0 0 0 0 0 0 0
$$ 0 0 0 0 0 0 0 0 0 0 0 0 0 0 0 0 0 0 0 0 0 0 0 0 0 0 0 0 0 0 0 0
$$ ##$ShimPowRng0= (0..63)
$$ 1 1 1 1 1 1 1 1 1 1 1 1 1 1 1 1 1 1 1 1 0 0 0 0 0 0 0 0 0 0 0 0 0 0 0 0
$$ 0 0 0 0 0 0 0 0 0 0 0 0 0 0 0 0 0 0 0 0 0 0 0 0 0 0 0 0
$$ ##$ShimPowRng1= (0..63)
$$ 1 1 1 1 1 1 1 1 1 1 1 1 1 1 1 1 1 1 1 1 0 0 0 0 0 0 0 0 0 0 0 0 0 0 0 0
$$ 0 0 0 0 0 0 0 0 0 0 0 0 0 0 0 0 0 0 0 0 0 0 0 0 0 0 0 0
$$ ##$ShimPowRng2= (0..63)
$$ 1 1 1 1 1 1 1 1 1 1 1 1 1 1 1 1 1 1 1 1 0 0 0 0 0 0 0 0 0 0 0 0 0 0 0 0
$$ 0 0 0 0 0 0 0 0 0 0 0 0 0 0 0 0 0 0 0 0 0 0 0 0 0 0 0 0
$$ ##$ShimPowRng3= (0..63)
$$ 1 1 1 1 1 1 1 1 1 1 1 1 1 1 1 1 1 1 1 1 0 0 0 0 0 0 0 0 0 0 0 0 0 0 0 0
$$ 0 0 0 0 0 0 0 0 0 0 0 0 0 0 0 0 0 0 0 0 0 0 0 0 0 0 0 0
$$ ##$ShimSysFunc= (0..63)
$$ 1 2 3 4 5 7 9 11 15 16 8 10 12 14 6 17 13 18 19 20 0 0 0 0 0 0 0 0 0 0
$$ 0 0 0 0 0 0 0 0 0 0 0 0 0 0 0 0 0 0 0 0 0 0 0 0 0 0 0 0 0 0 0 0 0 0
$$ ##$ShimSysMatrix= 0
$$ ##$ShimSysType= 1
$$ ##$TFXNUM= 0
$$ ##$TRIPLO2= 0
$$ ##$VTU= 2
$$ ##$VTUETH= <149.236.99.20>
$$ ##$VTUTY= <no>
$$ ##$WBREFAM= (0..15)
$$ 135.5 97.7 100 100 100 100 100 100 100 100 100 100 100 100 100 100
$$ ##$WBREFLM= (0..15)
$$ 0 0 0 0 0 0 0 0 0 0 0 0 0 0 0 0
$$ ##$WBREFPH= (0..15)
$$ 72.26 -67.22 0 0 0 0 0 0 0 0 0 0 0 0 0 0
$$ ##$WBSGU= (0..15)
$$ 0 0 0 0 0 0 0 0 0 0 0 0 0 0 0 0
$$ ##$XFAC= 2
$$ ##END=
$$ 
##$DECIM=	2496
##$DSPFVS=	20
##XUNITS=	HZ
##YUNITS=	ARBITRARY UNITS
##FIRSTX=	6407.6102040000005218
##LASTX=	-1605.0880428824991668
##DELTAX=	-0.12226593800080109986
##XFACTOR=	1
##YFACTOR=	0.020528813568885855012
##FIRSTY=	8.9143037796020507813
##MINY=	-2.9257190227508544922
##MAXY=	6249.13671875
##NPOINTS=	65536
##XYDATA=	(X++(Y..Y))
$$ [...]
1913E22k6m9n5j0L6L2oj6J3L3J6j6l3l4k0MJ8on6p6m2J3M1M8N4N7L7Ppj3k0k7j8nj6m0m2j9
$$ 522 496 447 392 382 418 450 444 428 441 474 490 474 441 407 387 391 409 403 347 271 229 242 283 331 385 442 479 486 479 466 446 419 401 396 380 340 298 279
1909B79nmLJ9Pl0m7j1L6M6L1K2J8pl3k5KJl1l9KM1L7J1J3K9J4l1n5l0K1N3N2J7l3n4j1N6O1
$$ 279 274 270 273 292 299 269 222 211 247 293 324 346 364 357 324 299 301 302 271 232 234 275 312 323 336 365 379 348 293 263 284 337 389 406 373 319 308 364 425
1904D25j2p4m9J6K3k6m1J1N3K0l6l7NJ4k7n3j8M2P1N6L0Nk1n4p5o1oN3P0L5j3k6mJ9J3j8m1
$$ 425 413 339 290 306 329 303 262 273 326 346 310 273 278 292 265 212 194 236 307 363 393 398 377 323 248 187 181 234 304 339 326 300 296 315 328 310 269
1899B69k5L0P4O7J5k1j6%oj1OK2Mk5k2KKk5l3qJ4J2NLj1l9n4m6k6%L8N5L0NM2J03P9l4j13
$$ 269 244 274 348 415 430 409 393 393 387 376 382 404 408 383 361 363 365 340 307 299 313 325 330 333 322 283 229 183 157 157 195 250 280 285 327 430 509 475 362
1895C62q1j2Jj7JL0K1KK2M7J1m8m4J6M5K2PJ7Jl9m7mK3Nj4%Lj9k2J2L3Rj2J1L9K8%j0k0m2
$$ 362 281 269 270 253 254 284 305 307 329 376 387 339 295 311 356 378 385 402 403 364 317 313 336 341 327 327 330 311 289 301 334 343 331 342 381 409 409 399 379 337
1890C37k9M0R7O7j5o5o4n4l6NM0K1k9m0kK1J0jJ8L1J2j5j7lQKj1j9nJ7K0pl1j5J1J3KJ2M0
$$ 337 308 348 445 512 497 432 368 314 278 283 323 344 315 275 273 294 304 303 321 352 364 349 332 329 337 339 328 309 304 321 341 334 303 288 299 312 314 326 366
1885C66M6K0j3m9p3n4J7P0L7l4m2J5L9jk9RN1M0Kj6k7n5n6pL5J2l2k3K4L7OrJ1J8ql0j1K5
$$ 366 412 432 419 370 297 243 260 330 367 333 291 306 345 344 315 324 375 415 417 401 374 319 263 256 291 303 271 248 272 309 315 306 317 335 327 297 286 311
1880C11L5J6j1k9k9j7jRJ9L1L3J3plJ8K2J0Jok4m9m8j2L1M0J5j7k6j0J5K5J3jmrk4k4ML3K5
$$ 311 346 362 351 322 293 276 275 284 303 334 367 380 373 370 388 410 420 421 415 391 342 294 282 313 353 368 351 325 315 330 355 368 367 363 354 330 306 310 343 368
1875C68krNPj0j8qjlMJ6Pk7m2j7J7K0NOJ5Nk4l4j2J2J0j1k2j6rj3j0J3M0M2J9LJ2J7ol4k0
$$ 368 366 357 362 369 359 341 333 332 329 333 349 356 329 287 270 287 307 312 318 333 338 314 280 268 280 290 279 257 241 232 219 209 222 262 304 323 326 338 355 349 315 295
1870B95K8N8M0%k1j0J3J4j9o2o6k4J6K0K1M9O8J6o5p4NO2K5m1m0J1L4J5NJ8J4k8o4n5j0L0
$$ 295 323 381 421 421 400 390 403 417 398 336 270 246 262 282 303 352 420 436 371 297 302 364 389 348 308 319 353 368 373 391 405 377 313 258 248 278
1866B78M0K9J8K2K1j3n8o6k3J8J5mQL3K4pk1j2j3k1jL4L5jk2lJ4pl4l0lJ1PK%LJ4K5J7pj8
$$ 278 318 347 365 387 408 395 337 271 248 266 281 277 285 318 342 335 314 302 289 268 267 301 336 335 313 310 324 317 283 253 250 261 268 270 270 273 287 312 329 322 304
1861C04jK3K9K7K4J3k0n0n5m5l3k2qrj9j0L1O5M9%k1ML2L3Qj6k7k5j5%J4K8K8%m4n3rL6J7
$$ 304 303 326 355 382 406 419 399 349 294 249 216 194 186 177 158 148 179 244 293 293 272 276 308 341 349 333 306 281 266 266 280 308 336 336 292 239 230 266 283
1856B83l6l8K5O7K8m9o6j3M0M5K9L2L9Pn2q0m1K1M0Rk0j1J4K0J3J2J2mk4k5mROJ3M0O0M3J
$$ 283 247 209 234 301 329 280 214 201 241 286 315 347 386 393 341 261 220 241 281 290 270 259 273 293 306 318 330 326 302 277 273 282 288 301 341 401 444 445
1851D45l1l3j6LJ8K5J9%k2k6qJ5J0j9m0k8mok9l6kM0M7J5j3%L6N3L2kj6rjj1k7l0k3j6mJ5
$$ 445 414 381 365 368 386 411 430 430 408 382 374 389 399 380 340 312 308 302 273 237 235 275 322 337 324 324 360 413 445 443 427 418 417 406 379 349 326 310 306 321
1847C21L1K7Mk5m0m2l4j3J0L1M4M0K0%mJql7n5l8lK6N1P5P6L0k7m1pK2Qk4m3m0k5lJ1Jk3l0
$$ 321 352 379 383 358 318 276 242 229 239 270 314 354 374 374 370 371 363 326 271 233 230 256 307 382 458 488 461 420 413 435 443 419 376 336 311 308 319 320 297 267
1842B67j7qoJ5M8M5nm5k4J8J8j5k2QK9J5qj4j1kK5N5M9on9n9j2K5K1oj5J0L8K9j1l9l1j4j0
$$ 267 250 242 236 251 299 344 339 294 270 288 306 291 269 277 306 321 313 299 288 286 311 366 415 409 350 291 279 304 325 319 304 314 352 381 370 331 300 286 276
1837B76MM4O7J8o0q0k3L0K9LMK2K2Mpj3k3j7J2L5J8j5k2j0j5l2k3J3L0J0kJ4K4kl2j3M1O0
$$ 276 280 324 391 409 349 269 246 276 305 308 312 334 356 360 353 340 317 300 312 347 365 350 328 318 303 271 248 261 291 301 299 313 337 335 303 290 331 391
1832C91K7nOK6Om3n3j4J3j4n1l3K1M2J1j9j3mj4j6J7N0L0j5k2RJ5k1l4J6Q1Q1K4j6qjl2p1
$$ 391 418 413 419 445 451 408 355 341 354 340 289 256 277 319 330 311 298 294 280 264 281 331 361 346 324 333 348 327 293 309 390 471 495 479 471 470 438 367
1828C67o9l0KKqj0opkJ1J0j8l8j4K5K1l1o2k5L5N6L3J2J6K8M1N3L7j5o2m7J2L4ml9k5Lnk8
$$ 367 298 268 270 272 264 254 248 241 239 250 260 242 204 190 215 236 205 143 118 153 209 242 254 270 298 339 392 429 414 352 305 317 351 347 308 283 286 281 253
1823B53j6J6K1MJ2M3N1J8oJ3L5J1m1o6m3JK7L1K1J2J3K5K8Kl9o0l2K2N7M5mn0o3m1pJ3J2q
$$ 253 237 253 274 278 290 333 384 402 396 409 444 455 414 348 305 306 333 364 385 397 410 435 463 465 426 366 334 356 413 458 454 404 341 300 293 306 318 310
1818C10k9l7k2J0L4K5j0l7k4J3K7Kk0kM0N3J7l0m5k4JPmj3JL1N7M7Mm0n5l2PL3L1J2LJ6K6
$$ 310 281 244 222 232 266 291 281 244 220 233 260 262 242 240 280 333 350 320 275 251 252 259 255 242 243 274 331 378 382 342 287 255 262 295 326 338 341 357 383
1813C83Rk5m2l3j9j3LK3K0j0k9qK3K2JLJ5Nj9j7J8L3Rj6pJ4J1pj9k2k1j4lpk9l3%K8K0kJ1
$$ 383 392 367 325 292 273 260 263 286 306 296 267 259 282 304 305 308 323 328 309 292 310 343 352 336 329 343 354 347 328 306 285 271 268 261 232 199 199 227 247 245 256
1808B56M1L9Mj8lPrk0ML2J1n3r2o1PM6K6j4k7pJ1J4K1M1M7K3o%K7L4Rj1j0LRJ5J5pl7l1J2
$$ 256 297 336 340 322 319 326 317 297 301 333 344 291 199 138 145 191 217 203 176 169 180 194 215 256 303 326 320 320 347 381 390 379 369 372 381 396 411 404 367 336 348
1803C48M4K5j8k6JJ1j8m3k8J9N4M6J3j6j8kJ2Rpk2k7k5k0k0j8qQJ7J1QK4L9K1k1m1k5n%J3
$$ 348 392 417 399 373 374 385 367 324 296 315 369 415 428 412 394 392 404 413 406 384 357 332 312 292 274 266 274 291 302 310 334 373 394 373 332 307 302 302 315
1799C15M5N6J0m6l9J9M4kn2l3K3L7j1n4m8j0J4J7K8M8N0J4l3n3l6j0mj1j7j2QL6M7K7j0j0
$$ 315 360 416 426 380 341 360 404 402 350 317 340 377 366 312 264 254 268 285 313 361 411 425 392 339 303 293 289 278 261 249 257 293 340 367 357 347
1794C47L4O8M5j2l7j9nj9l1pK7L3J3lJPkj7k4k1k1l1l2oL0L3%l1k1Jol1k8J1M4M6K5jk5k9
$$ 347 381 449 494 482 445 426 421 402 371 364 391 424 437 434 435 442 440 423 399 378 357 326 294 288 318 351 351 320 299 300 294 263 235 246 290 336 361 360 335 306
1789C06mK4K2OJ7L8J3n4q2l5K3K7J3K6M0Om3l9jPj2%L8L8j2m3j4J9Qj3qMrl0j6J7K9J3lnJ
$$ 306 302 326 348 354 371 409 422 368 286 251 274 301 314 340 380 386 343 304 303 310 298 298 336 374 362 319 305 324 332 319 311 315 306 276 260 277 306 319 316 311 312
1784C12RJ3Lj5j3J2K4Mk0j0J7J7j0k2mJ8K3J1oj4jK9M4J9k4l6qJ8Km0n9l3RK1ql5j3L9N5J5
$$ 312 321 334 337 322 309 321 345 349 329 319 336 353 343 321 317 335 358 369 363 349 348 377 421 440 416 380 372 390 392 352 293 260 269 290 282 247 234 273 328 343
1779C43k9k3QRj8l1j1PJ1K3L9K7j9m9k4K1L1J2PJ2ml8m8j6K2K6J4J4K6K2QPK5M2K8qm5n4k8
$$ 343 314 291 299 308 290 259 248 255 266 289 328 355 336 287 263 284 315 327 334 346 342 304 256 240 262 288 302 316 342 364 372 379 404 446 474 466 421 367 339
1775C39J2K8Mk7j7K5L9Ll5j9J9K0j5k8kK2J6RJ5Qk8n1k6J0J3jkol9o4l2L4N4K1JK6M6K5j0
$$ 339 351 379 383 356 339 364 403 406 371 352 371 391 376 348 346 368 384 393 408 416 388 337 311 321 334 333 331 325 286 222 190 224 278 299 300 326 372 397 387
1770C87j6j7l9n1j1N7P7L1k4l6j1J5J7ol2m1j5K9N0K5k3m5k0K0K3j2k9LM5M4QqKkl0l5NM4
$$ 387 371 354 315 264 253 310 387 418 394 358 347 362 379 373 341 300 285 314 364 389 366 321 301 321 344 332 303 306 351 395 403 395 397 395 365 330 335 379
1765C79L5OPK6J6j9k9jK8L4L9M6L0j8n2l0L1O4M4ll2l4k6k6k3rPKj8k9k1j2j6j5PL0K6RNO
$$ 379 414 420 427 453 469 450 421 420 448 482 521 567 597 579 527 497 528 592 636 633 601 567 541 515 492 483 490 492 474 445 424 412 396 381 388 418 444 453 458 464
1760D64j3m3m6qK6K9J3Njj4j6J0M3L8Mj6lJ0lj4RN4Q0Q1Q2R4R0N9L3L9N2L0j7l7j8Jj6l7k9
$$ 464 451 408 362 354 380 409 422 427 426 412 396 406 449 487 491 475 472 482 479 465 474 528 608 689 771 865 955 1014 1047 1086 1138 1168 1151 1114 1096 1097 1081 1044 1015
1756A015j1k1n8q0p5o3o1n5k4K0M0J3m1p5n4mK0Oj1jPj0l3l0j4j5k2%M0M8K4NNj0l7l7QM6
$$ 1015 1004 983 925 845 770 707 646 591 567 587 627 640 599 524 470 466 486 492 481 480 487 477 444 414 400 385 363 363 403 451 475 480 485 475 438 401 409 455
1751D55M4J9J5L2N4Q2J04Q9L4qOM9O2L2mk6k9oL9P0M3l0r4j18j10q2n2m4o3p2m0MJ0j0j0J7
$$ 455 499 518 533 565 619 701 805 894 928 920 926 975 1037 1069 1065 1039 1010 1004 1043 1113 1156 1126 1032 914 804 722 670 626 563 491 451 455 465 455 445 462
1747D62K4KoJ0J6%nJ2Om1p4n2nQLK0M5L9J0OL1L7J2qmkj7k3mK2L8N0N6L7Kj1J0K0pm5m9k5
$$ 462 486 488 482 492 508 508 503 515 521 480 406 354 349 357 360 380 425 464 474 480 511 548 560 552 548 546 529 506 502 524 562 612 668 705 707 696 706 726 719 674 625 600
1741F00nRK6L4Om0o1n1m3m3k6QK5Nj7j1J1J8J5J6J4pk9k3kNlNK4K8Kj8j3NJ0%j3k3j8PL9N0
$$ 600 595 604 630 664 670 630 569 518 475 432 406 414 439 444 427 416 427 445 460 476 490 483 454 431 429 434 431 436 460 488 490 472 459 464 474 474 461 438 420 427 466 516
1736E16L2Oqk4m5n2l0PK4J7jj6j6%J6J0j2pL1M8Nm9l0N0Q8L2n1o7k5PJrnnk0j9J1L7K5rk1
$$ 516 548 554 546 522 477 425 395 402 426 443 442 426 410 410 426 436 424 417 448 496 501 452 422 472 560 592 541 474 449 456 457 448 443 438 418 399 410 447 472 463 442
1731D42j0mj2j6j1j9m3m1J6Q3Q3J6m2l3PK1MlK%rPM1M9Om6n2j3K1J7j1l8m2j3L6O3L8j6l4
$$ 442 432 428 416 400 389 370 327 286 302 385 468 484 442 409 416 437 441 438 440 440 431 438 479 528 534 488 436 423 444 461 450 412 370 357 393 456 494 478 444
1727D44NN3M8%k7rJ1j2m3k1L8N6oq4r7m2J9M7N5O3O6N1K0j4m3m3rL1L0j2m3k6QRk2l6rL0L1
$$ 444 449 502 550 550 523 514 525 513 470 449 487 543 537 453 356 314 333 380 435 498 564 615 635 621 578 535 526 557 587 575 532 506 514 523 501 465 456 486 517
1722E17j2n3m7kL9M4K4Lj2k8l9l3j8mJ2K7K9J0jJ4L3J7j0%M2M8Ll5j9RLk0j9lmrJ3M2M0K2
$$ 517 505 452 405 403 442 486 510 513 501 473 434 401 383 379 391 418 447 457 456 470 503 520 510 510 552 600 603 568 549 558 561 541 522 519 515 506 519 561 601 623
1717F23K4L3J1k7k7RJ9j8l8nL1K7J4M1P5N1k8q1o4j3J3KoJ8N8P1L0k7l8J0N1K9l0n9l7kQL
$$ 623 647 680 691 664 637 646 665 647 609 604 635 662 676 717 792 843 815 734 670 657 670 672 666 684 742 813 843 816 778 788 839 868 838 779 742 740 748 751
1712G51pk1l2j6K0M2L1QLJ2J8J7J1mk9l6rL5N8M9K3pl6m3oM8O7L3j4k4qQJ2J2kk9l7J1Q4J17
$$ 751 744 723 691 675 695 737 768 776 779 791 809 826 837 833 804 768 759 794 852 901 924 917 881 838 832 880 947 980 966 942 934 942 954 966 964 935 898 909 993 1110
1707A110Q6L4Jj3k7l2k6k5l0j1L6O2K7l3m4LN1N0K1JMJ1Nj4k9k2LK0K1K4M3O1N6M1L9L6J0
$$ 1110 1196 1230 1231 1218 1191 1159 1133 1108 1078 1067 1103 1165 1192 1159 1115 1118 1169 1219 1240 1241 1245 1256 1261 1247 1218 1196 1199 1219 1240 1264 1307 1368 1424 1465 1504 1540 1550
1703A550j5mK8L0%nL1N5L1JRL4L7K6L6O0N9L4J8K6L8L1J8J4K9N4O8M5nl1pL9O2O2O4O3M2K0
$$ 1550 1535 1531 1559 1589 1589 1584 1615 1670 1701 1702 1711 1745 1782 1808 1844 1904 1963 1997 2015 2041 2079 2110 2128 2142 2171 2225 2293 2338 2333 2302 2295 2334 2396 2458 2522 2585 2627 2647
1698B647K5N2O6N9N7O9P5O8O4O9O7N8N4N1L8L2O2J06J06O6N1R7J48J35R3R3J41J75J66J56
$$ 2647 2672 2724 2790 2849 2906 2975 3050 3118 3182 3251 3318 3376 3430 3481 3519 3551 3613 3719 3825 3891 3942 4039 4187 4322 4415 4508 4649 4824 4990 5146
1695E146J71J91J88J92K38L11L59L65L77M41N54O78Q14J000J257J573J942K395K937L474L834
$$ 5146 5317 5508 5696 5888 6126 6437 6796 7161 7538 7979 8533 9211 10025 11025 12282 13855 15797 18192 21129 24603 28437
1692B8437L899L685L309K878K433J990J586J265J011P07K12n01j311k061k694l228l643l858
$$ 28437 32336 36021 39330 42208 44641 46631 48217 49482 50493 51200 51412 50911 49600 47539 44845 41617 37974 34116
1690C4116l817l554l139k627k089j621j273j020q03o04m49l48k87k35j65o8K4Q1J18J97L17
$$ 34116 30299 26745 23606 20979 18890 17269 15996 14976 14173 13569 13120 12772 12485 12250 12085 12017 12041 12122 12240 12437 12754
1687A2754M06M31M63N76P39Q68R73J142J420J776K201K745L469M418N663P247R044J0720J1875
$$ 12754 13160 13591 14054 14630 15369 16237 17210 18352 19772 21548 23749 26494 29963 34381 40044 47291 56335 67055 78930
1685G8930J2243J1746J0515Q861P160N694M562L725L001K044M88j733m288o737q862j0634
$$ 78930 91173 102919 113434 122295 129455 135149 139711 143436 146437 148481 148969 147236 142948 136211 127349 116715
1683A16715j1950j2592j2437j1575j0210q574o921n491m371l483k750k187j804j525j278j073
$$ 116715 104765 92173 79736 68161 57951 49377 42456 36965 32594 29111 26361 24174 22370 20845 19567 18494
1681A8494r33p99n99l69j98j06l2N8J50K42L64N23O89Q67J086J342J638K024K598L388M379
$$ 18494 17561 16762 16163 15794 15596 15490 15458 15516 15666 15908 16272 16795 17484 18351 19437 20779 22417 24441 27039 30427 34806
1678C4806N597P124Q912J0655J1904J2313J1806J0564Q918P211N690M485L600K866J921L92
$$ 34806 40403 47527 56439 67094 78998 91311 103117 113681 122599 129810 135500 139985 143585 146451 148372 148764
1676A48764j803m358o844r010j0809j2165j2888j2809j1945j0514q821p156n710m540l624
$$ 148764 146961 142603 135759 126749 115940 103775 90887 78078 66133 55619 46798 39642 33932 29392 25768
1675B5768k937k447k082j760j464j237j092r62p93o11m71l80l10k46j88j26m8K9R5J67K70
$$ 25768 22831 20384 18302 16542 15078 13841 12749 11787 10994 10383 9912 9532 9222 8976 8788 8662 8614 8643 8738 8905 9175
1672I175L83M79N81P56J029J374J766K240K815L406L841L969L777L375K880K362J860J430
$$ 9175 9558 10037 10618 11374 12403 13777 15543 17783 20598 24004 27845 31814 35591 38966 41846 44208 46068 47498
1670D7498J105Q42N16K5o46j436k260l011l589l954m130m141l951l541k992k456k022j665
$$ 47498 48603 49445 49961 49986 49340 47904 45644 42633 39044 35090 30960 26819 22868 19327 16335 13879 11857 10192
1668A0192j336j046q29o85n89n18m59m14l81l63l31k61j68j10j24j68j76j36r0p3p2o5n7n7
$$ 10192 8856 7810 6981 6296 5707 5189 4730 4316 3935 3572 3241 2980 2812 2702 2578 2410 2234 2098 2008 1935 1863 1798 1741 1684
1665A684o6o0m1k6l6n5n8l0mpl8o1n4k8ppk6m1l6j5Kkk2l8m2l8k2mol0m0JN9P1K1l2l9j4K
$$ 1684 1618 1558 1517 1491 1455 1400 1342 1312 1308 1301 1263 1202 1148 1120 1113 1106 1080 1039 1003 988 990 988 966 928 886 848 826 822 816 786 746 747 806 877 898 866 827 813 815
1660H15%j1k6k9lL4M0Kl6l5k1k6l3j5Kj8m6l1J0J8lRO3Q0K2m2m3j1j6n3n8j2L9M9K0j8l3j5
$$ 815 815 804 778 749 746 780 820 822 786 751 730 704 671 656 658 640 594 563 573 591 588 597 660 740 762 720 677 666 650 597 539 527 566 615 635 617 584 569
1655E69K2L4Ok3qL3L9%l6l6k2l0m6l9qJ6J2%RM0O2M4mm0m2l7m7n8k9K9N3J8k4j0M6P4M1j4
$$ 569 591 625 631 608 600 633 672 672 636 600 578 548 502 463 455 471 483 483 492 532 594 638 634 594 552 515 468 410 381 410 463 481 457 447 493 567 608 594
1651E94l5j1J9J7j5l8l1j5k5n1m6J5Q3R3M6%rmj9m1m4k1J2L3L3Nm5q3o7pL8L6J3K0M3L5j1
$$ 594 559 548 567 584 569 531 500 485 460 409 363 378 461 554 600 600 591 587 568 527 483 462 474 507 540 545 500 417 350 343 381 417 430 450 493 528 517
1646E17l8j4K2J5k8m6k1J2K3J6jl2n9l8L6R1O3j6o1k9L5O6L9k3q1q8l0M7O7J3m4l8J7N2L6
$$ 517 479 465 487 502 474 428 407 419 442 458 457 425 366 328 364 455 518 502 441 412 447 513 552 529 448 360 330 377 444 457 413 375 392 444 480
1642D80%j3n%j0j5JL0M5K5j2m5n5m9l2j4jJj1j9j1RK6K6J0j2j2K3P2Q2L6l1n9k8K2L6Pk6k2
$$ 480 480 467 462 462 452 437 438 468 513 538 526 481 426 377 345 331 330 331 320 301 290 299 325 351 361 349 337 360 432 514 550 519 460 432 454 490 497 471 449
1637D49QL0K4J0QJ4Qj4l5m1l0lK1J0k4l3J1N4K4n3p8k8K0Jm0l8j3j0j9%K7J5rJ3O7P8L6NJ4
$$ 449 457 487 511 521 529 543 551 537 502 461 431 428 449 459 435 402 413 467 491 438 360 332 352 353 313 275 262 252 233 233 260 275 266 279 346 424 460 465 479
1632D79J3k1l7rJ4j1l3oL0Ko0p3j0O1P8M7%l6m1j6J1J3LKM%JK0K6ml3k4%j1l6j9L7N1Ol1k4
$$ 479 492 471 434 425 439 428 395 389 419 421 361 288 278 339 417 464 464 428 387 371 382 395 398 400 404 404 405 425 451 447 414 390 390 379 343 324 361 412 418 387 363
1627C63j8m5n6jO0N0j6n3l0J0L2L7L2J3mRM4N9M2J6lj3j6onl0n8l7K1M9J8k2k6j3k2l5j8J9
$$ 363 345 300 244 243 303 353 337 284 254 264 296 333 365 378 374 383 427 486 528 544 541 528 512 506 501 471 413 376 397 446 464 442 416 403 381 346 328 347
1623C47L3K1J1J4Nj4j2Pjl9o4m2lJ4J7M0P0N9J0k7j6J3J6j2l7l1mJ7J4ok0rJ5K3Kj6pK3M4
$$ 347 380 401 412 426 431 417 405 412 411 372 308 266 263 277 294 334 404 463 473 446 430 443 459 447 410 379 375 392 406 400 380 371 386 409 411 395 388 411 455
1618D55L8J8KNK3M0L1jk4j6RJ2knJ3K7K0Pkj8m3n2k7OOj8k6j2kqj4jK0K1OmjOKj4k8k5j3q
$$ 455 493 511 513 518 541 581 612 611 587 571 580 592 590 585 598 625 645 652 650 632 589 537 510 516 522 504 478 466 464 456 442 441 461 482 488 484 483 489 491 477 449 424 411 403
1612D03j5j1K0N3N1J4j8j3J0K3J7J2J5K6L5L7M0N2O9P4N5L2K9M3L8Pj5kOl3q9q6j7L8J8l9
$$ 403 388 377 397 450 501 515 497 484 494 517 534 546 561 587 622 659 699 751 820 894 949 981 1010 1053 1091 1098 1083 1081 1087 1054 965 879 862 900 918 879
1608H79n9m8o4j09j15n2J5K4nj0Mpl7l1K5O9N7J9lk4o5q5l9M6Q7O3K8K4K3kk9k6kK4M0M5L3
$$ 879 820 772 708 599 484 432 447 471 466 456 460 453 416 385 410 479 536 555 552 528 463 378 339 385 472 535 563 587 610 608 579 553 551 575 615 660 693
1604F93J6L0P3R3N6LLM7P3N5J9qj9qJ8K2k5r0j10q2o5q8r7o1k0plK1K5k4p7o6qK3Mj3kJ1J4
$$ 693 709 739 812 905 961 964 967 1014 1087 1142 1161 1153 1134 1126 1144 1166 1141 1051 941 859 794 706 609 548 528 521 518 539 564 540 463 397 389 412 416 403 401 412 426
1599D26L5P1O6np4o6kM1K2k5n2m5j7mj9l6j3M8Q8O7K3RK0J6LJ0L1L0Jj8j8j8j5PK2j2q1r6
$$ 426 461 532 598 593 519 453 451 492 514 489 437 392 375 371 352 316 303 351 439 506 529 538 558 574 577 587 618 648 649 631 613 595 580 587 609 597 516 420
1594D20l3K9K1j4nL3L2j2k7NL2J5j0qjk2m6l4NK9K6J8J8J2qk4j9kJ1Mj3k7l3l3k7j1J7M2M3
$$ 420 387 416 437 423 418 451 483 471 444 449 481 496 486 478 477 455 409 375 380 409 435 453 471 483 475 451 432 430 441 445 432 405 372 339 312 301 318 360 403
1589D03J4k7n1m9k7plpkK0L7K5pl2l4k9k2lL4N8M5RoQK4J3j0j6MJ7Oj7k3nJ2Nj3j6mLqj5J
$$ 403 417 390 339 290 263 256 253 246 244 264 301 326 319 287 253 224 202 199 233 291 336 345 339 347 371 384 374 358 362 379 385 368 345 340 352 357 344 328 324 327 319 304 305
1584C05K2J9pk4j7rk3l7j6L4O4M9J9J0J2Kj2jK1J4k0l3kJ9lk9rL6M5J5kJ1J2j6m8n7n0l2N
$$ 305 327 346 339 315 298 289 266 229 213 247 311 360 379 389 401 403 391 390 411 425 405 372 370 389 386 357 348 384 429 444 442 453 465 449 401 344 294 262 267
1579B67M0L8OpJ2K0j3l4nL1J9j6j5J8K1k0m5k1J7K7J9Pj0m0n4l1J2M0M2L2K3K0J7Pj4l4l4
$$ 267 307 345 351 344 356 376 363 329 324 355 374 358 343 361 382 362 317 296 313 340 359 366 356 316 262 231 243 283 325 357 380 400 417 424 410 376 342
1575C42j1J9L6K7%k8k7J5O3P2L5j4m5n3m3j6J2J5j5n4p2n4j0L4M1Rk3j0K8M0J6qj4j7k2mK4
$$ 342 331 350 386 413 413 385 358 373 436 508 543 529 484 431 388 372 384 399 384 330 258 204 194 228 269 278 255 245 273 313 329 321 307 290 268 264 288
1570B88J3m0o4j4N7O8K6jJ6L4L0Rrj8j0QLl1n0j9J9Ml7k7L6O2J9k6k2nj2j2K9O1K9k8k1L6
$$ 288 301 261 197 183 240 308 334 333 349 383 413 422 413 395 385 393 396 365 315 296 315 319 282 255 291 353 372 346 324 319 307 295 324 385 414 386 365 401
1566D01M9j2o9n7oJ5pk7j9jJ2J5Lj7l5l4j4RK1K0J3QMmj4j9j7k1k3kM6P6N1kk6lK5L1K4J6
$$ 401 450 438 369 312 306 321 314 287 268 267 279 294 297 280 245 211 197 206 227 247 260 268 272 268 254 235 218 197 174 172 218 294 345 343 317 314 339 370 394 410
1561D10jk5k7KK6J3j3lK8L1j0m2k2K1L3jl2j9K6N5L5j1k9oJ8Pk5k9jJ8Pj4j6nk%OOlkK6N6
$$ 410 409 384 357 359 385 398 385 382 410 441 431 389 367 388 421 420 388 369 395 450 485 474 445 439 457 464 439 410 409 427 434 420 404 399 397 397 403 409 406 404 430 486
1556D86M1rm5l6j1mj3rJ0K9K9J9J1Lj8m8o5m3LL2J8j3j7J0K8J4j7k8j4J2K4Ol4n9l3K4N5K7
$$ 486 527 518 473 437 426 422 409 400 410 439 468 487 498 501 483 435 370 327 330 362 380 367 350 360 388 402 385 357 343 355 379 385 351 292 259 283 338 365
1551C65j6j9NRqlK9L1j9n9l1L1M6Nk4JL7M1K8J9km7p3l5K7L4j7m6j1K4Qk6j5K5M2K0jj2k4
$$ 365 349 330 335 344 336 333 362 393 374 315 284 315 361 366 342 343 380 421 449 468 466 419 346 311 338 372 355 309 298 322 330 304 289 314 356 376 375 363 339
1546C39k3J0M6L6qj4K4L2l2r5q2k7KJJ7M3L2j2l2lK0Ok2j9OK1K5K7K3Kj9j7PK5K4J3J1Mk1
$$ 339 316 326 372 408 400 386 410 442 410 315 233 206 208 209 226 269 301 289 257 254 274 280 258 239 245 266 291 318 341 343 324 307 314 339 363 376 387 391 370
1541C70n7o7k4M1O3K1k8k8J4L9K9J0kk2m3l1K6O6M3j1k9pKk6m7k6J1J8ok0oK0L1K6J0j0k2
$$ 370 313 246 222 263 326 347 319 291 305 344 373 383 381 359 316 285 311 377 420 409 380 373 375 349 302 276 287 305 299 279 273 293 324 350 360 350 328
1537C28j8MK7L6L6L4K3j0m1m2j4Nqk8k3njqlJ8L3M3N5N7K3k8m9k6kj7m3l7NL4J9k3n1m8k3
$$ 328 310 314 341 377 413 447 470 460 419 377 363 368 360 332 309 304 303 295 292 310 343 386 441 498 521 493 444 418 416 399 356 319 324 358 377 354 303 255 232
1532B32lkpKK1K8J6NOJ9L4M4L7J2j3oJ8J6j8l7j2K5L2J9J5J1j4m6n5l5lK4L5J5k2m3k9qmN
$$ 232 229 227 220 222 243 271 287 292 298 317 351 395 432 444 431 425 443 459 441 404 392 417 449 468 483 494 480 434 379 344 341 365 400 415 393 350 321 313 309 314
1527C14L1L8Jk3J7P2N8j0l9qOk4m2j0J0j8l0K2P1M3k6m4lJ9j4n3n5k0L5Q4Q1Qo5n6K3P2L8
$$ 314 345 383 384 361 378 450 508 498 459 451 457 433 391 381 391 373 343 365 436 479 453 409 406 425 411 358 303 283 318 402 483 491 426 370 393 465 503
1523E03k6n4l9j0J2K3Rj2j4mk1o2o6nO0O1Qk8j6J6K5QrlL2N7L2l1o5k7M6P6M0k1o7q7p3k3
$$ 503 477 423 384 374 386 409 418 406 392 388 367 305 239 234 294 355 363 335 319 335 360 368 359 356 388 445 477 446 381 354 400 476 516 495 428 341 268 245
1518B45L9O6M1Jj1QK6K4Qmj3k0k5k0j8l1m3k4L3Q0P0J5k4j9JNKJ6L0J7j3k9j5MOj0k7k6lK8
$$ 245 284 350 391 392 381 389 415 439 447 443 430 410 385 365 347 316 273 249 282 362 432 447 423 404 405 410 412 428 458 475 462 433 418 422 428 418 391 365 362 390
1513C90L4J4lNK2J4j4l7k7%J5jl3m5rM4O2L7K0L0L4mm4l9j3j3k8pL9M7Jl1j2K4K6J1L%kJ2
$$ 390 424 438 435 440 462 476 462 425 398 398 413 412 379 334 325 369 431 468 488 518 552 548 504 465 452 439 411 404 443 490 491 460 448 472 498 509 512 512 510 522
1508E22L3J4n2r5p0j7KJ0N1R6P5mn6m3j5j1nJ3J4k5n8l6J0K2j4n3n3j6K4M0K8J0jj3k9l0J
$$ 522 555 569 517 422 352 335 337 347 398 494 569 565 509 466 451 440 435 448 462 437 379 343 353 375 361 308 255 239 263 303 331 341 340 327 298 268 269
1504B69M3N7M5L7L3Ql3l8jK7J5LJ5J8k2n9l4K0L2MLN0Q3N2j4n9n4j4K5K8pl2j1J9qp5r7m0
$$ 269 312 369 414 451 484 492 459 421 420 447 462 465 480 498 476 417 383 403 435 439 442 492 575 627 613 554 500 486 511 539 532 500 489 508 500 425 328 288
1499B88K2L1J3J2J8jj7QL9K3k2k7J1K5j2m0j2K7J5l1m1nK7K2QQJ3KoRK9J8j3l1k6k1k5j0K6
$$ 288 310 341 354 366 384 383 366 374 413 436 414 387 398 423 411 371 359 386 401 370 329 324 351 373 381 389 402 404 398 407 436 454 441 410 384 363 338 328 354
1494C54L4qn2m2OM0M3N1N8K4m4p7m1RJ9J6K9L2qn1l0L1M8jl6j7J0j0m8l9J6O6O9L0j8l9k2
$$ 354 388 380 328 286 292 332 375 426 484 508 464 387 346 355 374 390 419 451 443 392 362 393 441 440 404 387 397 387 339 300 316 382 451 481 463 424 402
1490D02M%k4k0K5N5L3QJ9L8J8j3QN6M8k4p4n2oKpJ1L6K6j0k5j1KLORmk6k8j5j6k9k1J6L3P
$$ 402 406 406 382 362 387 442 475 483 502 540 558 545 553 609 657 633 559 507 501 503 496 507 543 569 559 534 523 525 528 534 543 539 513 485 470 454 425 404 420 453 460
1485D60k6k1OJ0j0j4J4M7M7K1j4l9m8l1NL8L9J8JNJ2Jk1k2%J6%k6l1j8j1j6j5jJ1RQJ4J5P
$$ 460 434 413 419 429 419 405 419 466 513 534 520 481 433 402 407 445 484 502 503 508 520 521 500 478 478 494 494 468 437 419 408 392 377 376 387 396 404 418 433 440
1480D40%KNNJ7L5L3Mj8j5nj4k0KL6L3ml5l1j9j1kJ7K7J4oj9k5k7oL0N0K8j9m8m7k1J3L1J2
$$ 440 440 442 447 452 469 504 537 541 523 508 503 489 469 471 507 540 536 501 470 451 440 438 455 482 496 490 471 446 419 413 443 493 521 502 454 407 386 399 430 442
1475D42l0m3mM4M2jk4RN8O8K0m4p4n8j9J6L1K5kl4m0oL8M6K0momqkJ4J2j6l1pK3K0j3l4k1
$$ 442 412 369 365 409 451 450 426 435 493 561 581 537 463 405 386 402 433 458 456 422 382 376 414 460 480 476 470 466 458 456 470 482 466 435 428 451 471 458 424 403
1470D03OL3M1K3noK9N1K3k0k0J7L4J1k2l8m8m5j5K4L0OmJ3K9K1J1Pkj4%K9K8j0l3qK1J1j3
$$ 403 409 442 483 506 501 495 524 575 598 578 558 575 609 620 598 560 512 467 452 476 506 512 508 521 550 571 582 589 587 573 573 602 630 620 587 579 600 611 598
1465E98j6j1k4l6j2K3L2J7J2Pk5o0m1K4N5K2j3J1N8N9J1k0kK5K4OMJ3J5J7K9L7ko9r2l4M8
$$ 598 582 571 547 511 499 522 554 571 583 590 565 505 464 488 543 565 552 563 621 680 691 671 669 694 718 724 728 741 756 773 802 839 837 768 676 642 690
1461F90O9L1mKK0K3J6Oj6l3pN8R0N1j2k9qjj5j8LJ1oj8LM1O2N3K9J2J1J3Qk%J0J4RJ0K3L0
$$ 690 759 790 786 788 808 831 847 853 837 804 797 855 945 996 984 955 947 946 931 913 916 927 921 903 906 947 1009 1062 1091 1103 1114 1127 1135 1133 1133 1143 1157 1166 1176 1199 1229
1456A229L0M0N9N0Ok8j5J6K9K7L5M0K3joMJ1K6N7O7L5lNM7P1P2P5P5N3M2P6J20J12P5P6J04
$$ 1229 1259 1299 1358 1408 1414 1386 1371 1387 1416 1443 1478 1518 1541 1540 1534 1538 1549 1575 1632 1699 1734 1731 1736 1783 1854 1926 2001 2076 2129 2171 2247 2367 2479 2554 2630 2734
1451B734Q3L2N2J54K18J73J02R9J38J55J58J84K11K10K19K67K94K48J98K43L45L94L72L67
$$ 2734 2817 2849 2901 3055 3273 3446 3548 3647 3785 3940 4098 4282 4493 4703 4922 5189 5483 5731 5929 6172 6517 6911 7283 7650
1449G650L98L94L28K84L12L50L16K23J49J25J22J02N1j3o5r0j01j22j57j89k17k41k46k16
$$ 7650 8048 8442 8770 9054 9366 9716 10032 10255 10404 10529 10651 10753 10804 10791 10726 10636 10535 10413 10256 10067 9850 9609 9363 9147
1446I147j75j70j91j86j34p4m5l0%M8R6J34J64J84K01K25K64L09L52L88M16M44M90N52N94
$$ 9147 8972 8802 8611 8425 8291 8217 8172 8142 8142 8190 8286 8420 8584 8768 8969 9194 9458 9767 10119 10507 10923 11367 11857 12409 13003
1443A3003O14O60P65Q79R16Q84Q70R16R63R57R15Q77Q47Q07P44O43M96L38K16J03n5k37l50
$$ 13003 13617 14277 15042 15921 16837 17721 18591 19507 20470 21427 22342 23219 24066 24873 25617 26260 26756 27094 27310 27413 27358 27121 26771
1440B6771l89m71o63q54r06q53q33q84r18q81q24q01p92p53o84o10n45m85m32l73k95k12j42
$$ 26771 26382 25911 25248 24394 23488 22635 21802 20918 20000 19119 18295 17494 16702 15949 15265 14655 14110 13625 13193 12820 12525 12313 12171
1437A2171q0rN6Q3R0J28K15L15L92M48M86N09N46O25P24P88Q02Q15Q62R06R04Q61Q11P69P25
$$ 12171 12091 12082 12138 12221 12311 12439 12654 12969 13361 13809 14295 14804 15350 15975 16699 17487 18289 19104 19966 20872 21776 22637 23448 24217 24942
1434B4942O69N85M62L10J60K0j19k51l56m51n82p45q75r33r60r97j032j030j009r96r77r23
$$ 24942 25611 26196 26658 26968 27128 27148 27029 26778 26422 25971 25389 24644 23769 22836 21876 20879 19847 18817 17808 16812 15835 14912
1431A4912q59q22p94p32o46n77n24m50l73l50l65l40k49j64j49j63j40q2l4pK9P5J01R8R2
$$ 14912 14053 13231 12437 11705 11059 10482 9958 9508 9135 8785 8420 8080 7831 7667 7518 7355 7215 7133 7099 7092 7121 7196 7297 7395 7487
1428G487J09J55K13K55K56K32K16K18K01J66J57J93K12J49L5m8q9j43k26k76k67k47k70l13
$$ 7487 7596 7751 7964 8219 8475 8707 8923 9141 9342 9508 9665 9858 10070 10219 10254 10206 10117 9974 9748 9472 9205 8958 8688 8375
1425H375l33l32l42l62l62l37l12l00l00l13l30l28k91k44k24k27k10j51r1q4j22j56j55j39
$$ 8375 8042 7710 7368 7006 6644 6307 5995 5695 5395 5082 4752 4424 4133 3889 3665 3438 3228 3077 2986 2902 2780 2624 2469 2330
1422B330j34j30r5m0j8n3r1p2j3J0k0n6n7m9o2p0m2mkl5n7m8k1J0L3L3Ll0l1j1lj6k4j5nk
$$ 2330 2196 2066 1971 1931 1913 1860 1769 1697 1684 1694 1674 1618 1561 1512 1450 1380 1338 1334 1332 1297 1240 1192 1171 1181 1214 1247 1250 1220 1189 1178 1175 1159 1135 1120 1115 1113
1418A113jj3m1n9l3J3K2j4m6l6oJ1K5L6K6oj4K2N0J8m6o9l4J5K9J1qrRL3M3L8L5M0L1Nj9k9
$$ 1113 1112 1099 1058 999 966 979 1001 987 941 905 899 910 935 971 997 991 977 999 1049 1067 1021 952 918 933 962 973 965 956 965 998 1041 1079 1114 1154 1185 1190 1171 1142
1413A142l6m3k0L1N3J4l6k1M4P0K5l4n0k6PK6K8J7QK1L1Nm7o6l4J1K9K8L2L2K0QNkj7k6j1
$$ 1142 1106 1063 1043 1074 1127 1141 1105 1084 1128 1198 1223 1189 1139 1113 1120 1146 1174 1191 1199 1220 1251 1256 1209 1143 1109 1120 1149 1177 1209 1241 1261 1269 1274 1272 1255 1229 1218
1409A218J0K0J6POJ9M6N4J7l5m4lK9K0J6N2Q2N2ql2pJ0LJJ8L2K1LnQL5O1M9mm8k2M2O5K1k7
$$ 1218 1228 1248 1264 1271 1277 1296 1342 1396 1413 1378 1334 1331 1360 1380 1396 1448 1530 1582 1574 1542 1535 1545 1548 1549 1567 1599 1620 1623 1618 1626 1661 1722 1771 1767 1719 1697 1739 1804 1825 1798
1404A798k5RM4P4Q8N6kj8M5J12J04M0kNJ8J8J6J3%oL3R2R8L8j8j2K5M1M5O1O9L3j4j0L8O8
$$ 1798 1773 1782 1826 1900 1988 2044 2042 2024 2069 2181 2285 2325 2323 2328 2346 2364 2380 2393 2393 2387 2420 2512 2610 2648 2630 2618 2643 2684 2729 2790 2859 2892 2878 2868 2906 2974
1399B974M7K5L7O3O6N0L9L3L4N3Q0P8M0J0K0M5M9N0P6R4N5j1k6L0P7O6L0K5L8L1RMK4N0P5
$$ 2974 3021 3046 3083 3146 3212 3262 3301 3334 3368 3421 3501 3579 3619 3629 3649 3694 3743 3793 3869 3963 4018 4007 3981 4011 4088 4154 4184 4209 4247 4278 4287 4291 4315 4365 4440
1395D440Q9P1K7lJ8N6O1K8kNM3R0J14P8jn1k3L8N0J6J4O0P7K1m8n3oL2L6L3L7L7J9jj2kK9
$$ 4440 4529 4600 4627 4624 4642 4698 4759 4787 4785 4790 4833 4923 5037 5115 5114 5063 5040 5078 5128 5144 5158 5218 5295 5316 5268 5215 5209 5241 5277 5310 5347 5384 5403 5402 5390 5388 5417
1391E417N4M0j4o0n4j4J5K5L1L2J9jlLql8n2m7m3m5l7j7j1k6l5k5j7k5k6lJ4pn0p1o2m5l4
$$ 5417 5471 5511 5497 5437 5383 5369 5384 5409 5440 5472 5491 5490 5487 5490 5482 5444 5392 5345 5302 5257 5220 5203 5192 5166 5131 5106 5089 5064 5038 5035 5049 5042 4992 4921 4859 4814 4780
1386D780k1j5l3o8p4m1j1k1n4p0o2m0j8KMk5o4p6n1k2j3j8k5m2p9j10r0k8K6K0l1o9o8m8m4
$$ 4780 4759 4744 4711 4643 4569 4528 4517 4496 4442 4372 4310 4270 4252 4254 4258 4233 4169 4093 4042 4020 4007 3989 3964 3922 3843 3733 3643 3615 3641 3661 3630 3561 3493 3445 3401
1382C401n9o9n7l7k8l7m5m0j9lj4m6o1l7KNl1o4o0l4j6j3oKkk2m4o0n8m0j8k7o6q6n4j1j4
$$ 3401 3342 3273 3216 3179 3151 3114 3069 3029 3010 3007 2993 2947 2886 2849 2851 2856 2825 2761 2701 2667 2651 2638 2632 2634 2632 2610 2566 2506 2448 2408 2390 2363 2297 2211 2157 2146 2132
1377B132n1n1kK6ml6j1L7L7j1m4m5m8o4n2mL2J9j7k8j8j8l4m1l1k2k4j6J7N0L8k2q4r5o0k3
$$ 2132 2081 2030 2028 2054 2050 2014 2003 2040 2077 2066 2022 1977 1929 1865 1813 1809 1841 1860 1843 1815 1797 1779 1745 1704 1673 1651 1627 1611 1628 1678 1716 1694 1610 1515 1455 1432
1373A432kJ9M6M4jm3l3jj0n2n8j0J7j8n6l0K9L6j1l5jL9L2JnJ6K9J2j1j9j2j5l8o8o7k7J7
$$ 1432 1430 1449 1495 1539 1538 1495 1462 1461 1451 1399 1341 1331 1348 1330 1274 1244 1273 1309 1298 1263 1262 1301 1333 1334 1329 1345 1374 1386 1375 1356 1344 1329 1291 1223 1156 1129 1146
1368A146K8Kk6k3%J6J0j0k6k3kJ8J9Nrj3j8k9l8l5k8k6k1%L7O3N6J8k1m0l5j6RL1K6qm1l2
$$ 1146 1174 1176 1150 1127 1127 1143 1153 1143 1117 1094 1092 1110 1129 1134 1125 1112 1094 1065 1027 992 964 938 917 917 954 1017 1073 1091 1070 1030 995 979 988 1019 1045 1037 996 964
1364I64J2M0J9j6j8OJ8J2J3L0M1K6kk0l1m1m4l9k8j2J7M3L1j9o4n5rK1J3qj5mJ1J7QjLK0J4
$$ 964 976 1016 1035 1019 1001 1007 1025 1037 1050 1080 1121 1147 1145 1125 1094 1053 1009 970 942 930 947 990 1021 1002 938 883 874 895 908 900 885 881 892 909 917 916 919 939 953
1359I53k9p1o3oL5K2k1m3l6k4j9j2LL0N2M9J4l7n7l9qNPK3L7K8Jj0kjk4m3k7J5M1K4k5o8o8
$$ 953 924 853 790 784 819 841 820 777 741 717 698 686 689 719 771 820 834 797 740 701 693 698 705 728 765 793 794 784 782 781 757 714 687 702 743 767 742 674 606
1354F06k2K6L9K1J0J3J1kj3lJ6L2M2L7Qk6l0nQnj6JJ3nk7l0k5l1k4QK1k0n0pO0N3j7l4K1M2
$$ 606 584 610 649 670 680 693 704 702 689 686 702 734 776 813 821 795 765 760 768 763 747 748 761 756 729 699 674 643 619 627 648 628 578 571 631 684 667 633 654 696
1349F96k3q2m7K7M6J0j5j6j7oL2N8K4k9l3lj1n0l9K5N9K0k8l2j5j1oJ5J9jnK2K4l4q4n2L1
$$ 696 673 591 544 571 617 627 612 596 579 573 605 663 687 658 625 622 611 561 522 547 606 626 598 566 551 540 534 549 568 567 562 584 608 574 490 438 469
1345D69O3L1KJ1J4j4l0mK3Ll3k5K2M1J0j5J0N4N8K7LLlj7j2J5J2l8p5m3J9L4Jj4OJ7%j1lq
$$ 469 532 563 565 576 590 576 546 542 565 568 535 510 532 573 583 568 578 632 690 717 720 723 720 703 691 706 718 680 605 562 581 615 616 602 608 625 625 614 611 603
1340F03l5l6OL6Pl8l1PJ8ljL5O0M0qm2n4m5j8J2L1L4L4L1K0%k1l2k3kJ2kk7k6jJ4%j0J2L8
$$ 603 568 532 538 574 581 543 512 519 537 534 533 568 628 668 660 618 564 519 501 513 544 578 612 643 663 663 642 610 587 585 597 595 568 542 541 555 555 545 557 595
1335E95K7JRM6O0L0rk4j5OL1M3L0RL%j8l5k0Qjm2n0lL5J6k4k1J0J3k4m1kN5P1K1m8p7m2J7
$$ 595 622 623 632 678 738 768 759 735 720 726 757 800 830 839 842 842 824 789 769 777 776 734 684 681 716 732 708 687 697 710 686 645 643 698 769 790 742 665 623 640
1330F40N0M2J0k9o9q7n5J2O3N9J9j5k5j6LJ8J7Mkjqk6k3J7O5O3No1q0m9rkk7m8k6K6O5N5K
$$ 640 690 732 742 713 644 557 502 514 577 636 655 640 615 599 602 620 637 641 639 638 630 604 581 598 663 726 731 670 590 541 532 530 503 455 429 455 520 575 577
1325E77n2n4jN7N4Lj4K8N4rr6j01k4K2LqL2O0K9j1%K7J0k4k3%JoJ5M0K2pKJ9pn2m3OJ7j5j2
$$ 577 525 471 470 527 581 584 570 598 652 643 547 446 422 444 447 439 471 531 560 549 549 576 586 562 539 539 540 534 549 589 611 604 606 625 618 566 523 529 546 531 519
1320E19L6M5j2m7pM0K0k1j2J8Ll8l3PJ4j6k2J3K7j1n0l9qj7o0p3k6L8N7K7NK5N1L2j2j6L2
$$ 519 555 600 588 541 534 574 594 573 561 579 582 544 511 518 532 516 494 507 534 523 473 434 426 409 349 276 250 288 345 372 377 402 453 485 473 457 489
1316D89O2K9j6pL2L2j5n6n8l9k3kK2K4J0J0L0L4Jl6m5k6mJ1J8J8J3J1Oj6l7j7M0O4J4n8p0
$$ 489 551 580 564 557 589 621 606 550 492 453 430 428 450 474 484 494 524 558 559 523 478 452 448 459 477 495 508 519 525 509 472 455 495 559 573 515 445
1311D45j7L5L7J1ooLJ1J4OlMK2K4%l2m4k7LL4N2M1Rj5j1M%j2lK2J8k6n8l3K1L3rm2k5ROl0
$$ 445 428 463 500 511 505 499 502 513 527 533 530 534 556 580 580 548 504 477 480 514 566 607 616 601 590 594 594 582 579 601 619 593 535 502 523 556 547 505 480 489 495 465
1306D65m7l1nRK0K8K3J1J6L2K6qk5MM1L5jj6ljk0l3j9%Jorj1j7j0J3K8J9Kpj5k3j4QPl1n4
$$ 465 418 387 382 391 411 439 462 473 489 521 547 539 514 518 559 594 593 577 574 573 553 520 501 501 502 496 487 476 459 449 462 490 509 511 504 489 466 452 460 467 436 382
1301C82k7J7J4k2k7J5M5L9K5K9K9PqQK3Nk4l3k7k7k6j1NJlK2N9N8J0l8n1l4lK9L8J5j3j7j
$$ 382 355 372 386 364 337 352 397 436 461 490 519 526 518 526 549 554 530 497 470 443 417 406 411 412 409 431 490 548 558 520 469 435 432 461 499 514 501 484 483
1296D83ol1m5l1mK7N3M8on8l1N6J00M8k7l7LL0K8K8J7k5o6m4K1M6Km5m5j6mKJ7K7Kl4l2K3
$$ 483 477 446 401 370 366 393 446 494 488 430 399 455 555 603 576 539 542 572 600 628 645 620 554 510 531 577 579 534 489 473 469 471 488 515 517 483 451 474
1292D74P5P1J9k7l2rJrj3J3M0L0ok3j5j4l1m1k6pJJ2K6J7j4k5LK7Qj5OM8M6kl5k9k0l1k9N
$$ 474 549 620 639 612 580 571 572 563 550 563 603 633 627 604 589 575 544 503 477 470 471 483 509 526 512 487 490 517 525 510 516 564 610 608 573 544 524 493 464 469
1287D69M1M7L4J6j8o9r1m9J7N7O2N6L7RkK2K8k5q4o7JK4j9l8RM8J2m5m5mRoNM1M6J2rOK0M
$$ 469 510 557 591 607 589 520 429 380 397 454 516 572 609 618 616 638 666 641 557 490 491 515 496 458 467 515 527 482 437 433 442 436 441 482 528 540 531 537 557 561
1282E61j5pRJ0Kkpk0k8k5j3QL6N7M7K2J8L4K2k4n4l5pj3k7lL3K9j0k1MJ7pk6mK8K5ql2k9j4
$$ 561 546 539 548 558 560 558 551 531 503 478 465 473 509 566 613 635 653 687 709 685 631 596 589 576 549 546 579 608 598 577 581 598 591 565 561 589 614 606 574 545 531
1277E31OK7L9K1j2k6kK9L3Pj2mJ4J1rj8j1lqk3l9m5k6K0N3L0l5o4j3O6Q8L8k8n9n0k4KPoj5
$$ 531 537 564 603 624 612 586 584 613 646 653 641 637 651 662 653 635 624 621 613 590 551 506 480 500 553 583 548 484 471 537 625 663 635 576 526 502 504 511 505 490
1272D90MM1O2N0K4RJ1J3jk8m1j6K2K4j3k6QL4Jm8m4jK1J4J4On0j17r1K5J11Q8K0%J6J3mJ3
$$ 490 494 535 597 647 671 680 691 704 703 675 634 618 640 664 651 625 633 667 668 620 576 575 596 610 624 630 580 463 372 397 508 596 616 616 632 645 641 654
1267F54M1K5l1o0l7KK7L1J8mrJ1K4%l8l8mJ5jk2k4j6jK7N2M1Lj2J4L4J3l3n6l8JL2K9ol3j4
$$ 654 695 720 689 629 592 594 621 652 670 666 657 668 692 692 654 616 612 627 626 604 580 564 563 590 642 683 686 674 688 722 735 702 646 608 609 641 670 664 631 617
1262F17L4N6K7qj0MOKQJ0mj2PL1K5Ml%j5m3m3j7%onJ6J8j4l4lM9M9J0nK8M5Kn1n0jK0rm1l2
$$ 617 651 707 734 726 716 720 726 728 736 746 742 730 737 768 793 797 794 794 779 736 693 676 676 670 665 681 699 685 651 648 697 746 756 751 779 824 826 775 725 724 744 735 694 662
1257F62KL3M6M1J6j3j2J8L5J1k2k3JJ2MKJ4J8MoKJ3J5J1ROnj3qLJ3J5J2J0J5K4K6J1kjRNj2
$$ 662 664 697 743 784 800 787 775 793 828 839 817 794 795 807 811 813 827 845 849 843 845 858 873 884 893 899 894 881 873 876 889 904 916 926 941 965 991 1002 1000 999 1008 1013 1001
1252A001k3k2j3QL4L9J0k7k4QJ1l1p4o3rM3P0P0M9J6n%J6J1qk3k1j4j6k7k9j3J2K8K7K2K5
$$ 1001 978 956 943 951 985 1024 1034 1007 983 991 1002 971 897 834 825 868 938 1008 1057 1073 1068 1068 1084 1095 1087 1064 1043 1029 1013 986 957 944 956 984 1011 1033 1058
1247A058K4Jk0j2J4J9JKL0L6kl3qM2N3K1qk0k3j4K8P9Q1K5l2l5lJ3kk4k3lJ3J2mj0JJ7J9J5
$$ 1058 1082 1083 1063 1051 1065 1084 1085 1087 1117 1153 1151 1118 1110 1152 1205 1226 1218 1198 1175 1161 1189 1268 1349 1374 1342 1307 1304 1317 1315 1291 1268 1265 1278 1290 1286 1276 1277 1294 1313 1328
1242A328K8N8P6N3Kl6l2kJ3pl5l2jK6L4K8J4j0k0QM3L7qk6opm8n8J5R3Q3K5K1N1K8l4k9N5
$$ 1328 1356 1414 1490 1543 1545 1509 1477 1475 1488 1481 1446 1414 1413 1439 1473 1501 1515 1505 1485 1493 1536 1573 1565 1539 1533 1526 1478 1420 1435 1528 1611 1636 1657 1708 1736 1702 1673 1728
1238A728Q7J1o2k2O5P1Kl6nL8M8M2L5J2j6l1k6j9nK5N7N4K8J3J2%j2J0O2R3P4L1%j2j4j2j5
$$ 1728 1815 1826 1764 1742 1807 1878 1880 1844 1839 1877 1925 1967 2002 2014 1998 1967 1941 1922 1917 1942 1999 2053 2081 2094 2106 2106 2094 2104 2166 2259 2333 2364 2364 2352 2338 2326 2311
1233B311j8jM3O9M4LQM7M9Nj1M1R0P1J4pK5O1P1N9L5Kj9mK7L7K3RJ0K6M8O7O0L6K2L4M4L7
$$ 2311 2293 2292 2335 2404 2448 2451 2459 2506 2555 2560 2549 2590 2680 2751 2765 2758 2783 2844 2915 2974 3009 3011 2992 2988 3015 3052 3075 3084 3094 3120 3168 3235 3295 3331 3353 3387 3431 3468
1228C468L7N8N8J5j8K1R9J14N7J6M4Q5Q6O7N9M6J3JL6P2O5N0P9J17J01M9L1N7P2O1O5Q4P9
$$ 3468 3505 3563 3621 3636 3618 3639 3738 3852 3909 3925 3969 4054 4140 4207 4266 4312 4325 4326 4362 4434 4499 4549 4628 4745 4846 4895 4926 4983 5055 5116 5181 5265 5344
1224E344N2O1J16J46J18Q8J07J36J16P8P9J03J06R1J02J19R8O4Q0J46J84J58J17J05J14J21
$$ 5344 5396 5457 5573 5719 5837 5925 6032 6168 6284 6362 6441 6544 6650 6741 6843 6962 7060 7124 7204 7350 7534 7692 7809 7914 8028 8149
1221H149J37J64J76J64J58J77J87J70J55J69J90J94K02K38K66K42J90J89K45K92K76K37K40
$$ 8149 8286 8450 8626 8790 8948 9125 9312 9482 9637 9806 9996 10190 10392 10630 10896 11138 11328 11517 11762 12054 12330 12567 12807
1218A2807K87L20K99K49K32K73L39L77L72L62L73L90L84L67L74M13M58M90N15N38N43N24N09
$$ 12807 13094 13414 13713 13962 14194 14467 14806 15183 15555 15917 16290 16680 17064 17431 17805 18218 18676 19166 19681 20219 20762 21286 21795
1216B1795N29N86O41O63O64O84P32P68P62P46P76Q58R27R43R31R37R66R97J030J078J131J168
$$ 21795 22324 22910 23551 24214 24878 25562 26294 27062 27824 28570 29346 30204 31131 32074 33005 33942 34908 35905 36935 38013 39144 40312
1213D0312J186J196J197J194J229J314J398J400J340J305J347J414J436J408J359J300J233
$$ 40312 41498 42694 43891 45085 46314 47628 49026 50426 51766 53071 54418 55832 57268 58676 60035 61335 62568
1211F2568J177J141J101J036R66R13Q61P73O56N45M46L30K01Q6%r6k28l80n06n89o49p16q02
$$ 62568 63745 64886 65987 67023 67989 68902 69763 70536 71192 71737 72183 72513 72714 72800 72800 72704 72476 72096 71590 71001 70352 69636 68834
1208F8834q99r87j047j090j139j199j252j284j304j329j343j329j297j282j293j300j282j258
$$ 68834 67935 66948 65901 64811 63672 62473 61221 59937 58633 57304 55961 54632 53335 52053 50760 49460 48178 46920
1206D6920j249j235j190j136j111j108j086j032r92r85r75r40r09r08r02q49p88p72p84p60
$$ 46920 45671 44436 43246 42110 40999 39891 38805 37773 36781 35796 34821 33881 32972 32064 31162 30313 29525 28753 27969 27209
1203B7209o96o60o73o81o52o27o30o20n60m86m61m80m98m93m80m65m41m19m06l82l34k96l12
$$ 27209 26513 25853 25180 24499 23847 23220 22590 21970 21410 20924 20463 19983 19485 18992 18512 18047 17606 17187 16781 16399 16065 15769 15457
1201A5457l59l83l65l42l35l24k96k70k61k61k49k30k20k23k27k25k10j96k12k57k76k27j41
$$ 15457 15098 14715 14350 14008 13673 13349 13053 12783 12522 12261 12012 11782 11562 11339 11112 10887 10677 10481 10269 10012 9736 9509 9368
1198I368j00j26j68j75j59j49j45j42j52j80j99j73j20q2q2j00j13j20j28j30j22j00p6o2
$$ 9368 9268 9142 8974 8799 8640 8491 8346 8204 8052 7872 7673 7500 7380 7298 7216 7116 7003 6883 6755 6625 6503 6403 6327 6265
1195F265p0r6j22j32j21r6o8n8p0q8r6j00j09j08p7l8l8p8j11j07r1q5p7n7m7n8o3l2Lqn7
$$ 6265 6195 6099 5977 5845 5724 5628 5560 5502 5432 5344 5248 5148 5039 4931 4854 4816 4778 4700 4589 4482 4391 4306 4229 4172 4125 4067 4004 3972 3975 3967 3910
1191C910q9p8n1l8l2k2k5n1p3o3k8rl2p2q9p4m6l1j6RJ8j6p7r7n8j6j6l5k5pl3q9j10p1k1
$$ 3910 3821 3743 3692 3654 3622 3600 3575 3524 3451 3388 3360 3351 3319 3247 3158 3084 3038 3007 2991 3000 3018 3002 2925 2828 2770 2754 2738 2703 2678 2671 2638 2549 2439 2368 2347
1187B347%MOrl8m4k2rl8o1l2K0K4k0l7lK5nn2n0LL4J1k8l8l0l9n7m2NK7nm3k6K5M1Ml2l2k5
$$ 2347 2347 2351 2357 2348 2310 2266 2244 2235 2197 2136 2104 2124 2148 2128 2091 2088 2113 2108 2056 2006 2009 2043 2054 2026 1988 1958 1919 1862 1820 1825 1852 1847 1804 1778 1803 1844 1848 1816 1784 1759
1182A759n0p8p1l8k2j8JK4J1k6k9RK8Jk5kL3J4m4o7k6K9M6K1k6o4o5j8L3K8k4m6mL4Lo1p4
$$ 1759 1709 1631 1560 1522 1500 1482 1483 1507 1518 1492 1463 1472 1500 1501 1476 1474 1507 1521 1477 1410 1384 1413 1459 1480 1454 1390 1325 1307 1340 1368 1344 1298 1294 1328 1331 1270 1196
1177A196k5J3PlJ8M2J9k9n0l1lLoj8k5k6j3J0K9K2ol9m5j4L4N8M3Pj2oNjk5n3n9l3MK3J9J3
$$ 1196 1171 1184 1191 1188 1206 1248 1267 1238 1188 1157 1154 1157 1151 1133 1108 1082 1069 1079 1108 1130 1124 1085 1040 1026 1060 1118 1161 1168 1156 1150 1155 1154 1129 1076 1017 984 988 1011 1030 1043
1172A043J8J6lk3k1j7l6o1n3j9ok7l4J0O3N6qo2n5j4J4Mk4l9k2K0M7L5mk4lK7K8Jk3k6j8j3
$$ 1043 1061 1077 1074 1051 1030 1013 977 916 863 844 838 811 777 787 850 906 898 836 781 767 781 785 761 722 700 720 767 802 798 774 771 798 826 827 804 778 760 747
1168G47mJ1J9Nj3j6kOok0j9roj1oJ3K6K0KlQJ9J5NQJ4Jl0m6k6NRj2k3j9k4l9k5L0P6O6K0p
$$ 747 743 754 773 778 765 749 747 753 747 727 708 699 693 682 676 689 715 735 737 734 742 761 776 781 789 803 804 774 728 702 707 716 704 681 662 638 599 574 604 680 746 766 759
1163G59llk8m5l1pJjJ1L0L2Mm1o9o1k4RK2L3N1N9L1j4l0pJ5Oj8k0oON%mNK8L5ko6r2n1OK4
$$ 759 756 753 725 680 649 642 643 642 653 683 715 719 678 609 548 524 533 555 588 639 698 729 715 685 678 693 699 681 661 655 661 666 666 662 667 695 730 728 662 570 519 525 549
1157E49J4J3K3J7OJ0K3J8pj7rkKJ4J7ol3k3J5J7l0o8m9NL7L2Ok6m6l3RM1M0K3Nj3k1MM2L7
$$ 549 563 576 599 616 622 632 655 673 666 649 640 638 640 654 671 665 632 609 624 641 611 543 494 499 536 568 574 548 502 469 478 519 559 582 587 574 553 557 599 636
1152F36k5o8l4L1M5Nj6PK7J1k1m4n4l9J2P1P4J6l5l3nKmNJ4Mj4qJ9L1J7j0l2m0k1J7M1K9P
$$ 636 611 543 509 540 585 590 574 581 608 619 598 554 500 461 473 544 618 634 599 566 561 563 559 564 578 582 568 560 579 610 627 617 585 545 524 541 582 611 618
1148F18OJ4rm2l5J4M1Rl1l1qj0k8k2J3L8M2L6J7k3o5o5j9K7M1K9Qj9l7j0M4N3j6q7p3MM0N
$$ 618 624 638 629 587 552 566 607 616 585 554 546 536 508 486 499 537 579 615 632 609 544 479 460 487 528 557 565 546 509 499 543 596 580 493 420 424 464 469
1143D69k7%M3L6qk9j1J1J7J7J9J6MjMml1n1l7OM0M5L0Qj1k1qK5L6kn8n7J6Q4O9qn3l0PMj6
$$ 469 442 442 485 521 513 484 473 484 501 518 537 553 557 556 560 556 525 474 437 443 483 528 558 566 555 534 526 551 587 585 527 470 486 570 639 631 578 548 555 559 543
1138E43j1RJ3qk8l6l1j4J3K3Lk1j7QJ7Qmj0j6j7jJ2nk7pM4O2K4j4kK5J7k1l7k1omkJrk0j0
$$ 543 532 541 554 546 518 482 451 437 450 473 476 455 438 446 463 471 467 457 441 424 423 435 430 403 396 440 502 526 512 510 535 552 531 494 473 467 463 461 462 453 433 423
1133D23J9L5K6J7K0K1Kk0k7k5k4j8OK9K1j6l0kL6L9J5jLpm1n8l0K0L5Qj7j4KPNNlk3l6k6%
$$ 423 442 477 503 520 540 561 563 543 516 491 467 449 455 484 505 489 459 457 493 532 547 546 549 542 501 443 413 433 468 476 459 445 447 454 459 464 461 438 402 376 376
1128C76J8K6L7N5O0M1Jl9o0n4l3k2k9k6NM4N7L7Oj9l2l4j7J5L9L3Ok7m5l4lK2K3lk2j5J2K7
$$ 376 394 420 457 512 572 613 614 575 515 461 428 406 377 351 356 400 457 494 500 481 449 415 398 413 452 485 491 464 419 385 382 404 427 424 402 387 399 426
1123D26Qk3k5RK6j2o6n5K7Q4N9K%K8Ro0r0l6L2M6K8K5K8qo3o8j0L9K2l4n4j1N0O7J9n2q1m4
$$ 426 434 411 386 395 421 409 343 288 315 399 458 460 460 488 497 437 347 311 343 389 417 442 470 462 399 331 321 360 382 348 294 283 333 400 419 367 286 242
1119B42K2N7L6kk2qK1M7O2N8L5Nj3j5pjJj1l6n3m3nK4K7K6M0M5J0l9m1KJ8j9n7m1ork7j0K4
$$ 242 264 321 357 355 333 325 346 393 455 513 548 553 540 525 518 517 518 507 471 418 375 370 394 421 447 487 532 542 503 462 464 482 463 406 365 359 350 323 313 337
1114C37J9j3lM6N5jm3j5L6L7OjJ0%k7l0j1j0k6k3J2L8K9Qjlrj4mJ9M3N2L3ml4l6l0l8n3m4
$$ 337 356 343 340 386 441 440 397 382 418 455 461 460 470 470 443 413 402 392 366 343 355 393 422 430 429 426 417 403 399 418 461 513 546 542 508 472 442 404 351 307
1109C07k1j0j4j0RK6L2K6J8J2K3L8K0m2q2m6J7J6m0m3M5J31J12J6o2p7m9qK3K3kj2J3L7K6
$$ 307 286 276 262 252 261 287 319 345 363 375 398 436 456 414 332 286 303 319 279 236 281 412 524 540 478 401 352 344 367 390 388 376 389 426 452
1104D52J0J6J9j3m1k2J6J1k3k5OJ1k1l1%J7j1l3JM7M0j1m1k5PK3K7L0L0K7J5ql5m4l0j9k7
$$ 452 462 478 497 484 443 421 437 448 425 400 406 417 396 365 365 382 371 338 339 386 426 415 374 349 356 379 406 436 466 493 508 500 465 421 391 372 345
1100C45k9JM6M9Km1k8J6L0qm5k4L9Q2O6J8k0m4o2n7j0M3M7Kk2KK9Ql3m4k1qj1nJ6K8L0M0N4
$$ 345 316 317 363 412 414 373 345 361 391 383 338 314 353 435 501 519 499 455 393 336 326 369 416 418 396 398 427 435 402 358 337 329 318 313 329 357 387 427 481
1095D81L6k0o4n6j9PJ8M2P0O6Op0r5m9K6O0L3k0m7m2l1j5K6P3P4J1o2p8m1JK5M5O2O0M2K7
$$ 481 517 497 433 377 358 365 383 425 495 561 567 497 402 353 379 439 472 452 405 363 332 317 343 416 490 501 439 361 320 321 346 391 453 513 555 582
1091E82J3j8o1o9k6K1J9j9m0k8j8k7k4RM3M8L4L4M2K1l0o1l5J5K7ll2k7qmmJ2L2K5kj5ool2
$$ 582 595 577 516 447 421 442 461 442 402 374 356 329 305 314 357 405 439 473 515 536 506 445 410 425 452 449 417 390 382 378 374 386 418 443 441 426 420 414 382
1086C82m0nL0J5k5k7J7L6Ll2j5K1L0J7J5J2j7m8l6J3M0K6%j2j5j0J1K3on0l8K4M6j4p9o4L
$$ 382 342 337 367 382 357 330 347 383 386 354 339 360 390 407 422 434 417 369 333 346 386 412 412 400 385 375 386 409 403 353 315 339 385 371 292 228 231
1081B31M1M0M6N2K3k2l0jPj2oL7N6K1j7j5lk1l8j8J2pn8p5k5N0R8R3L8l5p0m3KLl6n1j4L0
$$ 231 272 312 358 410 433 411 381 380 387 375 369 406 462 483 466 451 448 427 389 371 383 376 318 243 218 268 366 459 497 462 392 349 351 354 318 267 253 283
1077B83M1L1K1J2loJ3K8J2j7k5rKjlok2m4l5J1N1L9kj8PL2K9J7J4J4kj7j1J1J9Pmnmrj3j9
$$ 283 324 355 376 388 385 379 392 420 432 415 390 381 383 382 379 373 351 307 272 283 334 373 371 353 360 392 421 438 452 466 464 447 436 447 466 473 469 464 460 451 438 419
1072D19l3l3pJ5j2o3o4RQ1Q5M2J4PlqJ6L9J4l7n6l4k4l4k1K0L5Kj9J3M7L0pj0Qrm5m1J6N2
$$ 419 386 353 346 361 349 286 222 231 312 397 439 453 460 457 449 465 504 518 481 425 391 367 333 312 332 367 369 350 363 410 440 433 423 431 422 377 336 352 404
1067D04K1l8n9k1L1M9J8k8m4k1NLJK7N7M0k3o8o0j8K5N6P2N7Nm8n5j5L5M4Ol9m4j2J7J2lJ
$$ 404 425 387 328 307 338 387 405 377 333 312 317 320 321 348 405 445 422 354 294 276 301 357 429 486 491 443 388 373 408 452 458 419 375 363 380 392 389 390
1062C90J4OoPL6L9J1rrj4k6j5J9J5m8r6o0K7P1M3kj2OK5K5Pj6k4j0Mlk0j6J3K9J9ok4k5nK4
$$ 390 404 410 404 411 447 486 497 488 479 465 439 424 443 458 410 314 254 281 352 395 393 381 387 412 437 444 428 404 394 398 395 375 359 372 401 420 414 390 365 360 384
1057C84L4J2j1kK3K1rk3rKj8m6m2j4J0J5RK%jok5l9k2J4L0J0lJ8M4L2%j0J0J9Kk0k1j6j3p
$$ 384 418 430 419 417 440 461 452 429 420 422 404 358 316 302 312 327 336 338 338 337 331 306 267 245 259 289 299 296 314 358 390 390 380 390 409 411 391 370 354 341 334
1052C34NOj6l4k4RL1K7J3%j4k9k2J0L9L0kj6%J2lj4J0M4M7J3j7j8jJ3K0J3qk3nK6J5l8o1j2
$$ 334 339 345 329 295 271 280 311 338 351 351 337 308 286 296 335 365 363 347 347 359 356 342 352 396 443 456 439 421 420 433 453 466 458 435 430 456 471 433 372 360
1047C60M9M6pl1lK5J2j6j6KNoj0RL7M9L3Lj4j5j9l5l4%M2L9OoK0L9J8j7k7j7j7l3m3l6j3J9
$$ 360 409 455 448 417 414 439 451 435 419 421 426 420 410 419 456 505 538 541 527 512 493 458 424 424 466 505 511 505 525 564 582 565 538 521 504 471 428 392 379 398
1042C98M6L8kl8m0k4j2jJ3J3j0k4lK6J8j2j1L0N7L6mk4j3J3K9J5k3m3rM2L3k8n4oL9Rn9q0
$$ 398 444 482 480 442 402 378 366 365 378 391 381 357 354 380 398 386 375 405 462 498 494 470 457 470 499 514 491 448 439 481 514 486 432 426 465 474 415 335
1038C35m8k1j7lJ9J0k3j8K8N2K1mK4O6M8j5n6m7k2j4j0nJNJ5K8K6Oj5k4j1J9N0M7Rk3qK7J9
$$ 335 287 266 249 246 265 275 252 234 262 314 335 331 355 421 469 454 398 351 329 315 305 300 301 306 321 349 375 381 366 342 331 350 400 447 456 433 425 452 471
1033D71k9n3j8K3J9k0m4l3rQK0K2Oj1j1QK1J6QJ2J2%k0k4j1kjmkjonJ5M1M1J1j7rJ7J6j5m2
$$ 471 442 389 371 394 413 393 349 316 307 315 335 357 363 352 341 349 370 386 394 406 418 418 398 374 363 361 360 356 354 353 347 342 357 398 439 450 433 424 441 457 442 400
1028D00l7k1j4j6qPQpk7l3k0J4N0N4K7KPJ2j4m9m5pJ4%j3MK4J8JLJ6K1K1K2Mm0o9m6nlk5m
$$ 400 363 342 328 312 304 311 319 312 285 252 232 246 296 350 377 379 386 398 384 335 290 283 297 297 284 288 312 330 331 334 350 371 392 414 418 378 309 263 258 255 230 226
1023B26O1R2M1k7l6KJ7mj5%J1J%J7L1K1jj6k3k8k9k7l2l1KM8N3Ll9k1K5L4Nj4oqk7k6J0L2
$$ 226 287 379 420 393 357 359 376 372 357 357 368 369 369 386 417 438 437 421 398 370 341 314 282 251 253 301 354 357 318 297 322 356 361 347 341 333 306 280 290 322
1018C22J4j5qK1K4jj5QM3N2K4k0m2k8rk0n3n2mM0L5PJ3M4M5Qk0j4LLJRQrk4j7kmj7k2j1RK3
$$ 322 336 321 313 334 358 357 342 350 393 445 469 449 407 379 370 350 297 245 241 281 316 323 336 380 425 433 413 399 402 405 406 415 423 414 390 373 371 367 350 328 317 326 349
1013C49K6J6Nnj6l0k9kK7K9J7J9L2J0m0o2k7J0MrK7Q4P8%o5n4kJ9kk1rK4L9J3l4m9j1L8L9
$$ 349 375 391 396 391 375 345 316 314 341 370 387 406 438 448 408 346 319 329 333 324 351 435 513 513 448 394 392 411 409 388 379 403 442 455 421 372 361 399 438
1008D38ol7k3jj4m2l6PM1M2K7J7Oj7l7l1nRlj6KL7M3Pl1l0jJ8J6QPJj2j7r%kprj4k8l7k5O
$$ 438 432 395 372 371 357 315 279 286 327 369 396 413 419 402 365 334 329 338 335 319 321 358 401 408 377 347 346 364 380 388 395 396 384 367 358 358 356 349 340 326 298 261 236 242
1002B42L5M6L8J0k8n4m3JL9L8Nj2LK6K2MkJj4m0l6J1N6N9L0Kk0m0l8jK8J0l5m0KL3K5J1K1
$$ 242 277 323 361 371 343 289 246 247 286 324 329 317 320 346 368 372 370 371 357 317 281 292 348 407 437 439 419 379 341 340 368 378 343 303 305 338 363 374 395
998C95L9L3J0j0l0m8l6J3M9K6k9n1k0J3Kl4m7j4L5M9J4k7k7QK2ll2k3OJ2lmJ4K7J3k2m3l1
$$ 395 434 467 477 467 437 389 353 366 415 441 412 361 341 354 356 322 275 261 296 345 359 332 305 313 335 332 300 277 283 295 292 288 302 329 342 320 277 246
993B46J4N1M9J5nLQrj5J1L1Pl0k5J3K2pl0k5j7j4OL2L2LrQJ0k2m2k3%j2k4jL1K3j4k9j0RK6
$$ 246 260 311 360 375 370 373 381 372 357 368 399 406 376 351 364 386 379 349 324 307 293 299 331 363 366 357 365 375 353 311 288 288 276 252 251 282 305 291 262 252 261 287
988B87N9R1Q2K4l6n9n1k7mO%jK1M6L4ql3k5j9l2l9j8MQJ0L2M9K6j7l4j5M%k1m4n5l6J5O6O6
$$ 287 346 437 519 543 507 448 397 370 366 372 372 371 392 438 472 464 431 406 387 355 316 298 302 310 320 352 401 427 410 376 361 365 365 344 300 245 209 224 290 356
983C56K0j1PL8K2l6p1n0mJ8J2KLN%lOJ6J0lj1oOJ9K3J0j9m3l3ML2L5K8K3Pl0n1j9L8M9Ll8
$$ 356 376 365 372 410 432 396 325 275 271 289 301 303 306 311 311 308 314 330 340 337 326 320 326 345 368 378 359 316 283 287 319 354 382 405 412 382 331 312 350 399 402 364
978C64k6J0Ml3l6J5O2M7ol3qK9L0ll2k0K6N8M1j3n3m5j1Mj4m1m5k4J3M1L4j2o4o8j5M5N8K3
$$ 364 338 348 352 319 283 298 360 407 401 368 360 389 419 416 384 364 390 448 489 476 423 378 367 371 357 316 271 247 260 301 335 323 259 191 176 221 279 302
973C02qnJ7K5J2oj7j6j2j3j7MN4R8P7np9q6n0k8l0j9J5L1J5jQK6K5J3Loj8j8mMmkK6M4K8J2
$$ 302 294 289 306 331 343 337 320 304 292 279 262 266 320 418 495 490 411 325 275 247 217 198 213 244 259 258 266 292 317 330 333 327 309 291 287 291 287 285 311 355 383 395
968C95L0M8K0k4j9K1J2n1p8k6L7L8O%J5QqlNj4m1l1PK6Qj7k5qK2M6K8k0l5ML2mn3m0J2K0j1
$$ 395 425 473 493 469 450 471 483 432 354 328 365 403 409 409 424 432 424 421 426 412 371 340 347 373 381 364 339 331 353 399 427 407 372 376 408 404 351 311 323 343 332
963C32j0K7K6l0n8j4L0J6k9m6l3pL5O7M2k3m3ML1k0o7k5N2O5K2OJ8kn1n9j8Om%K6K8lj1K3
$$ 332 322 349 375 345 287 273 303 319 290 244 211 204 239 306 348 325 282 286 317 297 230 205 257 322 344 350 368 366 315 256 238 244 240 240 266 294 291 280 303
958C03M9K5j4k7k3k6k5pO%JK3M3L6Ll6o1n0KN6O1K4%J6K9J5lJLj4k2OL6K0k9n2k3K9N4L9J
$$ 303 352 377 363 336 313 287 262 255 261 261 262 285 328 364 367 331 270 220 222 278 339 363 363 379 408 423 420 421 424 410 388 394 430 450 421 369 346 375 429 468 469
953D69k8l0j9j0%J4Ql3o7m9RM5M2M0M3J0n2p3k6J6ll0kM8M9J0qPJ2NNQj3l3k4rl0o0l1M2P4
$$ 469 441 411 392 382 382 396 404 371 304 255 264 309 351 391 434 444 392 319 293 309 306 276 274 322 371 381 373 380 392 397 402 410 397 364 340 331 301 241 210 252 326
948C26L9MJ6L1Jl4k0K6M5J7j9l0j2J7K8Pl0l7KM6M1pn0n2k3LRORNj4l3k3MJm1n9j2N4O0J3
$$ 326 365 369 385 416 417 383 363 389 434 451 432 402 390 407 435 442 412 375 377 423 464 457 407 355 332 335 344 350 359 364 350 317 294 298 299 258 199 187 241 301 314
943C14j8j1j9n1n1ON8M2j2l2pK3L3L4L6L5L1L3L2J4k6n7n1pL4K8j1k7jJ1l2q2o0K0N9K6mK1
$$ 314 296 285 266 215 164 170 228 270 258 226 219 242 275 309 345 380 411 444 476 490 464 407 356 349 383 411 400 373 372 383 351 269 209 229 288 314 310 331
939C31O0M7jl4m4n0l9j1J0NJK2L6K2PK8M3J2l2k7ROl6n0k2MOK3M8K8l3n3jM9L7KQL0J2l6n4
$$ 331 391 438 437 403 359 309 270 259 269 274 275 297 333 355 362 390 433 445 413 386 395 401 365 315 293 297 303 326 374 402 369 316 315 364 401 403 411 441 453 417 363
934C63l2oQK0J8j1m1k6K0M1J6j0mOnj6JK5K4MjJ2Qk1l9k0J9L6K2Jj0j5k0j9j4j3j8j4LJ7J9
$$ 363 331 325 333 353 371 360 319 293 313 354 370 360 356 362 357 341 342 367 391 395 394 406 414 393 354 334 353 389 411 412 402 387 367 348 334 321 303 289 292 309 328
929C28K4L6K9j1m1k5J0J8LJ1L3Qn7q2k9L0J9l0l4J3M3K9MnoKK7M3J5l6m1MK6j7n9k8N0P1J1
$$ 328 352 388 417 406 365 340 350 368 371 382 415 423 366 284 255 285 304 274 240 253 296 325 329 324 318 320 347 390 405 369 328 332 358 341 282 254 304 375 386
924C86n1l8K4N2J1m1l8J3M0Om3l8J3M1J4k8l6k1j2lJ8L5K4%kJ9L4K6Rpj8j4QK1ll3k2J3kp1
$$ 386 335 297 321 373 384 343 305 318 358 364 321 283 296 337 351 323 287 266 254 251 269 304 328 328 326 345 379 405 414 407 389 375 383 404 401 368 346 359 357 286
919B86j08m8M2N9Kl6rL8M6K5J5K4L1K1Jk5n1n3j4M7R1Q7L0m1p5m6J0L0ll4rM8O6J8m5o4l4
$$ 286 178 130 172 231 233 197 188 226 272 297 312 336 367 388 389 364 313 260 246 293 384 471 501 460 385 339 349 379 376 342 333 381 447 465 420 356 322
914C22JJ3J3J7J6nk9k7OK9J3j4qK1K4rk4OL4J1k7j7L4M8Km5m2j0Noj4j3ML8O9N4km2j9K1J6
$$ 322 323 336 349 366 382 377 348 321 327 356 369 355 347 368 392 383 359 365 399 410 383 366 400 448 450 405 363 353 358 352 338 325 329 367 436 490 488 446 427 448 464
909D64k1l1j0nk7k6OK1pk8%L3J9j4oK9L0j0l6j9N%j6j6mQK5L6K0j8m0k7j6l0k9J8O9O7K1p
$$ 464 443 412 402 397 370 344 350 371 364 336 336 369 388 374 368 397 427 417 381 362 367 367 351 335 331 339 364 400 420 402 362 335 319 289 260 278 347 414 435 428
905D28lmk1k1MQk9n0qN7O5Qn1n5k0Mj2l7k3L1O3K2m8n8KM7K2j9qL0L0mj1K1M4L6K1Ok4m9k6
$$ 428 425 421 400 379 383 391 362 312 304 361 426 434 383 328 308 312 300 263 240 271 334 356 308 250 252 299 321 302 294 324 354 350 339 360 404 440 461 467 443 394 368
900C68K8L7j5m4lM8L3j7k9okk1j5K9N5L6Mj0j4j4mJ4K2J5QLrj4J4N6O8L6RJ4J7rk7rK4K4M
$$ 368 396 433 418 374 371 419 452 435 406 400 398 377 362 391 446 482 486 476 462 448 444 458 480 495 503 506 497 483 497 553 621 657 666 680 697 688 661 652 676 700 704
895G04OK1J1k2l2mK1Rj1jL1M3L0J4J7K8L3K7J9J5J1JqKL3N7M2Kj7RN2O4L7Qjmk5m9m1qJ4j
$$ 704 710 731 742 720 688 684 705 714 703 702 733 776 806 820 837 865 898 925 944 959 970 971 963 965 998 1055 1097 1099 1082 1091 1143 1207 1244 1252 1251 1247 1222 1173 1132 1124 1138 1137
889A137k5k2KJ1rk7j9pk1n0n2j7J8K3Mk1m2n9n4k0J4Mm8p6m7KJ1k0k9JK3%l2k2RJn2p7l0L8
$$ 1137 1112 1090 1092 1103 1094 1067 1048 1041 1020 970 918 901 919 942 946 925 883 824 770 750 764 768 720 644 597 599 610 590 561 562 585 585 553 531 540 541 489 412 382 420
884D20N4J8j2rLlj7j0J0J7pm3n2j8L2N0J2l5l8LL4K0j3k7j5jJjnolRK6L3K4Kk3l4k9j4jRJ0
$$ 420 474 492 480 471 474 471 454 444 454 471 464 421 369 351 383 433 445 410 372 375 409 429 416 389 374 373 374 373 368 362 359 368 394 427 451 453 430 396 367 353 352 361 371
879C71kk8l8pM1N3J9oJ0L2J1k9l0NJ9rk8j0J7J4l%K2K8J2l%J3J5kl2n1l8kK3K5J9J9J2j3l8
$$ 371 369 341 303 296 337 390 409 403 413 445 456 427 397 402 421 412 384 374 391 405 402 402 424 452 464 461 461 474 489 487 455 404 366 364 387 412 431 450 462 449 411
874D11l4lL1M6K7k0n2k5L7N3kn6m8mJ6J9M2M8pp3n4L0N8km7qM5L4qk0k1m5m4L0J04P5k5o4
$$ 411 377 374 405 451 478 458 406 381 418 471 469 413 365 361 377 396 438 486 479 406 352 382 440 438 391 383 428 462 454 434 413 368 324 354 458 533 508 444
870D44j6K2rl4J4P3N9j2m7k4Kql2l6k0nnj2j2MK6L1J2j3k3j4J2M1N2L1j6m6l4OL3K9jj8nL0
$$ 444 428 450 441 407 421 494 553 541 494 470 472 464 432 396 376 371 366 354 342 346 372 403 415 402 379 365 377 418 470 501 485 439 405 411 444 473 472 454 449 479
865D79L6Kl0qM9N9Ln2m0RL1J2jJ6L9L9K7J7jk8m2j9K2L2rn5m2K0O1M1lj7qk0m2k1L5O2L1m
$$ 479 515 517 487 479 528 587 590 538 498 507 538 550 549 565 604 643 670 687 686 658 616 597 619 651 642 587 545 565 626 667 664 647 639 619 577 556 591 653 684 680
860F80OK8J2j7rJ7Nl8m1J1N4L9KpJ1K4K0J2Nj3k9k3%J7J0mOM1N9L5nrK7M0qo8n9KL8K6K5O3
$$ 680 686 714 726 709 700 717 722 684 643 654 708 747 749 742 753 777 797 809 814 801 772 749 749 766 776 772 778 819 878 913 908 899 926 966 958 890 831 833 871 897 922 985
855I85P5J0o7o4QN4L3LJ0K6J2j8k7j9j6lM5J00J04M4j9l7k9l7n6m9qL6N4M3J4j5j8J3M6L8
$$ 985 1060 1070 1003 939 947 1001 1034 1037 1047 1073 1085 1067 1040 1021 1005 1002 1047 1147 1251 1295 1276 1239 1210 1173 1117 1068 1060 1096 1150 1193 1207 1192 1174 1187 1233 1271
850A271mj6L2Q8Q0K3j1LK3J4LJ7L1Pl2k5L0O6M1oj8OK6K1J3RRJ6L8O2N4J5j2lK3L6M3N2M8
$$ 1271 1267 1251 1283 1371 1451 1474 1463 1466 1489 1503 1506 1523 1554 1561 1529 1504 1534 1600 1641 1635 1617 1623 1649 1670 1683 1692 1701 1717 1755 1817 1871 1886 1874 1871 1894 1930 1973 2025 2073
845B073K2LK2M8M2J9K9N9N6J5MN3J05J02N9L0L4N3P2Q0O5M0M3P5Q9O3M4O4Q0N4J9L1O8O8L4
$$ 2073 2095 2098 2120 2168 2210 2229 2258 2317 2373 2388 2392 2445 2550 2652 2711 2741 2775 2828 2900 2980 3045 3085 3128 3203 3292 3355 3399 3463 3543 3597 3616 3647 3715 3783 3817
841C817J9L3M6N4P7R9Q8P2J04J59J53P3J5L9R2J04Q8Q4J00J19J53J94K05J77J61J92K37K59
$$ 3817 3836 3869 3915 3969 4046 4145 4233 4305 4409 4568 4721 4794 4809 4848 4940 5044 5132 5216 5316 5435 5588 5782 5987 6164 6325 6517 6754 7013
838G013K79L23L59L38K77K26J96J75J74K14K63K68K26J82J72J87K07K16K03J96K38L25L84
$$ 7013 7292 7615 7974 8312 8589 8815 9011 9186 9360 9574 9837 10105 10331 10513 10685 10872 11079 11295 11498 11694 11932 12257 12641
835A2641L92M03M71N60O28P22R05J148J409J768K354L132L868M348M511M385M003L452K902
$$ 12641 13033 13436 13907 14467 15095 15817 16722 17870 19279 21047 23401 26533 30401 34749 39260 43645 47648 51100 54002
833E4002K496K271K193K215K233K088J730J325J173J462K172L094L929M406M414M063L555
$$ 54002 56498 58769 60962 63177 65410 67498 69228 70553 71726 73188 75360 78454 82383 86789 91203 95266 98821
831I8821L054K667K496K588K813K870K493J680P43J43K34J038K240L376M081M242L954L412
$$ 98821 101875 104542 107038 109626 112439 115309 117802 119482 120225 120368 120602 121640 123880 127256 131337 135579 139533 142945
828A42945K807K318K092K167K348K212J366k39k240m089n358n866n690n102m416l807l244
$$ 142945 145752 148070 150162 152329 154677 156889 158255 158016 155776 151687 146329 140463 134773 129671 125255 121448 118204
826A18204k665k107j629j187o84j92Ml69j341k654l926m852n311n371n163m778m265l672l075
$$ 118204 115539 113432 111803 110616 109932 109740 109744 109375 108034 105380 101454 96602 91291 85920 80757 75979 71714 68042 64967
824F4967k519k028j608j256r85q67j028j523k242k982l625m143m497m601m423m046l562l007
$$ 64967 62448 60420 58812 57556 56571 55704 54676 53153 50911 47929 44304 40161 35664 31063 26640 22594 19032 16025
822A6025k419j899j525j260j016p83o19n46n01m38l71l34l17k80k13j50j27j43j62j53j21
$$ 16025 13606 11707 10182 8922 7906 7123 6504 5958 5457 5019 4648 4314 3997 3717 3504 3354 3227 3084 2922 2769 2648
819B648r2q3q8j05j28j30r0k7jl1q1r9q7p4o4l8rj1m3n7k8J0J5pj9j4j7l6l9qK1mo0o9j0M0
$$ 2648 2556 2473 2385 2280 2152 2022 1932 1905 1904 1873 1792 1693 1606 1532 1468 1430 1421 1410 1367 1310 1282 1292 1307 1300 1281 1267 1250 1214 1175 1167 1188 1184 1124 1055 1045 1085
815A085J2m7m6J9N5J8l5l5lNj1j5LJ5Qj0l1m8l6PM2K3k9n0l0oMK3L9J3m6o5qN8M9j7n3l7k4
$$ 1085 1097 1050 1004 1023 1078 1096 1061 1026 1023 1028 1017 1002 1005 1020 1028 1018 987 939 903 910 952 975 946 896 866 860 864 887 926 939 893 828 820 878 927 910 857 820 796
810G96n0p2l8K6M6Jn0m3J6O5O0J7j9k6j8j4j2mJ0K1J7ql8m4rL4L5nk8j0J7Pj9j8%ml4m8k7
$$ 796 746 674 636 662 708 709 659 616 632 697 757 774 755 729 711 697 685 681 691 712 729 721 683 639 630 664 699 694 666 656 673 680 661 643 643 639 605 557 530
805E30%J1K2M7M8Jn7o3k2J3J7J5K6K4k0o6o1j0L1L2J9K7L7J5k2l6j7PQok1l5m3k2K3M6K0k8
$$ 530 530 541 563 610 658 659 602 539 517 530 547 562 588 612 592 526 465 455 486 518 537 564 601 616 594 558 541 548 556 550 529 494 451 429 452 498 518 490
801D90m5k3kjKJ9L0K3J5J6J3mj2PK9K0rk8k5j9j7k1l8o8p2j5P2J10O6Jj4J8L1Ll7m3j3J7P
$$ 490 445 422 420 419 421 440 470 493 508 524 537 533 521 528 557 577 568 540 515 496 479 458 420 352 280 265 337 447 513 514 500 518 549 552 515 472 459 476 483
796D83l6o7m0K6P0N7J8KRjk4k6J3N3M7Mk6j6K0L8K1j7m4m6l1j8kJ6K8K0LLK1K9Jl4l9j0J4
$$ 483 447 380 340 366 436 493 511 513 522 521 497 471 484 537 584 588 562 546 566 604 625 608 564 518 487 469 467 483 511 531 534 537 558 587 588 554 515 505 519
791E19Qj3k5k1j2kLmk4k8NN7P6M6kl1l3k7j0J5L6L3Kl5o0n5j8K8M7K3llQjk6k8j0oj8qK7L9
$$ 519 527 514 489 468 456 454 457 453 429 401 406 463 539 585 583 552 519 492 482 497 533 566 568 533 473 418 400 428 475 498 495 492 500 499 473 445 435 429 411 403 430 469
786D69Jm9n8k5MRMMJ3K4K1ol4k7J3M2K9NKOlj3KK1Rj6j7mj3l7k7J6M0J7rKK7L0J1monj0k1
$$ 469 470 421 363 338 342 351 355 359 372 396 417 411 377 350 363 405 434 439 441 447 444 431 433 454 463 447 430 426 413 376 349 365 405 422 413 415 442 472 483 479 473 468 458 437
781D37k9k0J3M2K3l3o7m3OL3K8Pj1j1QK3Pj5LN2O8K0l9n6m5l6k1J9N7N4K3QJ4Pj3k2k0k1j7
$$ 437 408 388 401 443 466 433 366 323 329 362 390 397 386 375 383 406 413 398 401 453 521 541 502 446 401 365 344 363 420 474 497 505 519 526 513 491 471 450 433
776D33KK2Rj8k3jPj3k8j1K3L3Kn2q5o0QN5L4j4k4KJ7J6L0M5J3n6p9k3L4K6p%K4Ml3j1N9Q1
$$ 433 435 457 466 448 425 424 431 418 390 379 402 435 437 385 300 240 248 303 337 323 299 301 318 334 364 409 422 366 287 264 298 324 317 317 341 345 312 301 360 441
771D41K1m7m5JK4J9K9N9O4L3RJ5K4Qj3MM7N7J7k2j2K4K7j1m4k8J5M6M6L3L0L8L9L0J7Qkj3
$$ 441 462 415 370 371 395 414 443 502 566 599 608 623 647 655 642 646 693 750 767 745 733 757 784 773 729 701 716 762 808 841 871 909 948 978 995 1003 1001 988
766I88nK6M7Qo6q8j8O4P1K1JL4N8L8QjLJ0L5N8L3l6o5k0K5lo4p0k4jk4m6l0qqrJLk0n2n9m5
$$ 988 983 1009 1056 1064 998 910 892 956 1027 1048 1049 1083 1141 1179 1187 1186 1189 1199 1234 1292 1325 1289 1224 1204 1229 1226 1162 1092 1068 1067 1043 997 967 959 951 942 943 946 926 874 815 770
761G70k3mOJ0J6L6M3No6j10p6QP9P9J0q0j27r9l4QOmkNOJ1J5pn3p4l8NKl3l4J3M7L4PJ5L6
$$ 770 747 743 749 759 775 811 854 859 793 683 607 615 694 773 783 703 576 477 443 451 457 453 451 456 462 473 488 481 428 354 316 321 323 290 256 269 316 350 357 372 408
756D08L0%rNOj2j5LOk9n1j5L8L5j9m5mM6M1Lk3j9qRK3J2k1l8qL4L4QJJ8K5J5J3J6qm5m7kL0
$$ 408 438 438 429 434 440 428 413 416 422 393 342 327 365 400 381 336 332 378 419 422 399 380 372 381 404 416 395 357 349 383 417 425 426 444 469 484 497 513 505 460 413 411 441
751D41Pl3m3k0OL0M9L8nl3j1K1Ql4m4j1J3pl4k9LK5K7J2qk7k3PL4J9k7n3l0J1K4QjJ6L5L1
$$ 441 448 415 372 352 358 388 437 475 470 437 426 447 455 421 377 366 379 372 338 309 312 337 364 376 368 341 318 325 359 378 351 298 268 279 303 311 310 326 361 392
746C92J4KLJ5L7N8M1k7q3o6nJ7j8l7JL9K7LK3N6L5l0o2k9J2J5%qj2j6qJ2J6ok1kK5K8OrmN
$$ 392 406 408 411 426 463 521 562 535 452 386 381 398 380 343 344 383 410 413 436 492 527 497 435 406 418 433 433 425 413 397 389 401 417 411 390 388 413 441 447 438 434 439
741D39L%JKnk7m5l6%K7K2%KK2L0J9J1J1pm1n2k7qj7k2RM1L2%j3j4k6l3%M1K6l6o0j2M8N7L4
$$ 439 442 442 443 445 440 413 368 332 332 359 381 381 383 405 435 454 465 476 469 428 376 349 341 324 302 311 352 384 384 371 357 331 298 298 339 365 329 269 257 305 362 396
736C96K0Ok1l0KL2On1o3k1J7K1J7K6K1oj4J7M6K4k4l9j4RJ1J5K5J7rk4j0Qlk9l8k2LK7M5M9
$$ 396 416 422 401 371 373 405 411 360 297 276 293 314 331 357 378 372 358 375 421 445 421 382 368 377 388 403 428 445 436 412 402 410 407 378 340 318 321 348 393 442
731D42L0QJKmj9l0l7m1j9L4P4N0k7p4n4rJ0J5L3M5J2m3o1l3kJ2K9M5K1l6n8mN9M8j4m8l7k9
$$ 442 472 480 481 483 479 460 430 393 352 333 367 441 491 464 390 336 327 337 352 385 430 442 399 338 305 303 315 344 389 410 374 316 312 371 419 405 357 320 291
726B91m2l0K7P5O3J8pkN%j2k5l2j5J8L2Nk4lM6O4K7j7l2j7RL4M2J0m7p7n0lJ4JoNK3L2K9J3
$$ 291 249 219 246 321 384 402 395 393 398 398 386 361 329 314 332 364 369 345 342 388 452 479 462 430 413 422 456 498 508 461 384 334 331 345 346 340 345 368 400 429 442
721D42j1k9k8j5mPJ8K0Oj5l1m1l8kN8Q7L8m8q0l5K1K6jnJ7L2K1QM%j3k4k7k5k4j5RL3L8K3
$$ 442 431 402 374 359 355 362 380 400 406 391 360 319 281 279 337 424 462 414 334 299 320 346 345 340 357 389 410 418 422 422 409 385 358 333 309 294 303 336 374 397
716C97RJ0J8J0j2k2pK3L9K8Jj9k3j3NJ9J7lk9m3l8k6j8k0k4k1nJ7L7M2L7K7J6%j9l1l0k7l2
$$ 397 406 416 434 444 432 410 403 426 465 493 494 475 452 439 444 463 480 477 448 405 367 341 323 303 279 258 253 270 307 349 386 413 429 429 410 379 349 322 290
711B90m0k3J7L9J2l1k9K6P3O6L2J7J8J1jPK4K1mj7j3k3n4o9l3J7L5K1PNpl5n9o0l4J2M8M3
$$ 290 250 227 244 283 295 264 235 261 334 400 432 449 467 478 477 484 508 529 525 508 495 472 418 349 316 333 368 389 396 401 394 359 300 240 206 218 266 309
707C09ml8k3J2J7ppK1L4K3K0L7L2j5m0JM2J2n7o6j1K1mj3M0Q1M4k4l4LJ4j2j4K2L6pn1m5l
$$ 309 305 267 244 256 273 266 259 280 314 337 357 394 426 411 371 372 414 426 369 303 292 313 309 296 336 417 461 437 403 406 420 408 394 416 452 445 394 349 346
702C46K5L0K8J7kqNJ1j6m7m1kK7L2K4K4L0L1J6j8m4k8J6K7j3m6j7L5M2Oj3oj0k5mN0P2L6m
$$ 346 371 401 429 446 444 436 441 452 436 389 348 346 373 405 429 453 483 514 530 512 468 440 456 483 470 424 407 442 484 490 477 471 461 436 432 482 554 590 586
697E86j1j8m2m6oK5mm6l3J5K6mj4QJ4j3k5kJ1j4l9j9L3O3N1J4k7n8o3l3J2L9L3Oj3jK8M0K0
$$ 586 575 557 515 469 463 488 484 438 405 420 446 442 428 436 450 437 412 410 421 407 368 349 382 445 496 510 483 425 362 329 341 380 413 419 406 405 433 473 493
692D93opJ0Pk2m3l3nJ6J7kl1l5QO0N2j1n4l0J0%l6l7OL6K8J1%k0m5m3jM4M4Pj8kL6N3K2l3
$$ 493 487 480 490 497 475 432 399 394 410 427 425 394 359 367 427 479 468 414 384 394 394 358 321 327 363 391 402 402 382 337 294 293 337 381 388 370 368 404 457 479 446
687D46n4j6L8M9J8plmk3k9NM6L8j9o6o3k1J8L6L7L0J9Prk6m0m6m1k6mO%nJ5N0N8K8jKJ3Jk5
$$ 446 392 376 414 463 481 474 471 467 444 415 420 466 504 485 419 356 335 353 389 426 456 475 482 473 447 407 361 320 294 290 296 296 291 306 356 414 442 441 443 456 457 432
682D32k7lJ5J0M%j5l4k4J8M6L1pk8l5m0k8QM0L7K2J9K1ml4l4qJj1qJ2J8mj4MJ5mk3qJ9K4J1
$$ 432 405 402 417 427 431 431 416 382 358 376 422 453 446 418 383 343 315 323 363 400 422 441 462 458 424 390 382 383 372 364 376 394 390 376 380 395 391 368 360 379 403 414
677D14PJ6J6Mj1l3o4o8j7O0R3N8Jk4j1OPnj2j4j8j9mK0K6rm4k9K2L9jl4j1K6J2k4j8L0M7J0
$$ 414 421 437 453 457 446 413 349 281 264 324 417 475 476 452 441 447 454 449 437 423 405 386 382 402 428 419 375 346 368 407 406 372 361 387 399 375 357 387 434 444
672D44k2qK5K8Qpj4j9j8jJ6J7QKk%J0K8L0Ll4n2m3j7Llk1j9J9M9K9j9m2l6m0n0rP3J10N0k9
$$ 444 422 414 439 467 475 468 454 435 417 416 432 449 457 459 457 457 467 495 525 528 494 442 399 382 385 382 361 342 361 410 439 420 378 342 302 252 243 316 426 476 447
667D47l6J4L9J5lOJ0qk9l4l2k2RL8K1l0n3k3J2%l8m0KL9L7J3%LQMKMKj0j6jK1J9mj4NJ8Jk3
$$ 447 411 425 464 479 476 482 492 484 455 421 389 367 376 414 435 405 352 329 341 341 303 263 265 304 341 354 354 357 365 369 371 375 377 367 351 350 371 390 386 372 377 395 396 373
662C73pM1O7M3ll0k7j0%j0l0m1k7ML0L9L1Jl6m3lM5M7Nl2l9l5k5MM9O6L3j8m5l2%K7L1Mk9
$$ 373 366 407 474 517 514 484 457 447 447 437 407 366 339 343 373 412 443 444 408 365 362 407 454 459 427 388 353 328 332 381 447 480 462 417 385 385 412 443 447 418
657D18k6OK1pl3j0M6Q0O4K2k1n3o8o3m0j3J6L6K6j2m7l7LL3L1J8J1MorJ0K5Jn3q2m7K2N5L0
$$ 418 392 398 419 412 379 369 415 495 559 581 560 507 439 376 336 323 339 375 401 389 342 305 308 341 372 390 401 405 399 390 400 425 426 373 291 244 266 321 351
652C51roK7M1K2LKnk5l1kK9K2j1k2mJ3J2jj8l9n0l3MK5J6OJ6K5J6NJ5L5K6j0k9j1J3J0qnK1
$$ 351 342 336 363 404 426 429 431 426 401 370 368 397 419 408 386 382 395 407 406 388 349 299 266 270 295 311 317 333 358 374 379 394 429 455 445 416 405 418 428 420 415 436
647D36K7pm2k6L1O4L6k3n0k9OK0Oj3k3k4k8k3lK6L5K4RMj1l6l7J3O2M2k9o2k7J8Rk1j9J1K1
$$ 436 463 456 414 388 419 483 519 496 446 417 423 443 449 436 413 389 361 338 335 361 396 420 429 433 422 386 349 362 424 466 437 375 348 366 375 354 335 346 367
642C67OjJ4K8K3Lj6k6j5%nk8k6J1L9K6J2L5M7rq9q3J5P6L2m2l4M5R3O4Jl9l7kK9K1k3n4l0
$$ 367 373 372 386 414 437 440 424 398 383 383 378 350 324 335 374 400 412 447 494 485 396 313 328 404 436 394 360 405 498 562 563 524 487 485 514 535 512 458 428
638D28J5K5rm5o2o0m2oK8L8K7J6Kj9l0j0K1K8J0PK8M8M2J9qm1n7l2J8L5Mk2nK1Nl4l9kK8K5
$$ 428 443 468 459 414 352 292 250 244 272 310 337 353 355 336 306 296 317 345 355 362 390 438 480 499 491 450 393 361 379 414 418 396 391 412 417 383 344 342 370 395
633C95J5J5J0j0j8MK2ln5o8j8M9P2M6J1pqoJJ6K8K5J0lrmNLk2n8o6k3L0M1Kl1k4MJ6J7K6L6
$$ 395 410 425 435 425 407 411 433 430 375 307 289 338 410 456 467 460 452 446 447 463 491 516 526 523 514 510 515 518 496 438 372 349 379 420 422 391 367 371 387 404 430 466
627D66J9j7k8mJ7kl7m9l2pNQOJJJ0K2K1Oj0k4l5l6j2K7N4M5K0jprj1j2j6j2J4N2O4K0m8p4
$$ 466 485 468 440 436 453 451 414 365 333 326 331 339 345 346 347 357 379 400 406 396 372 337 301 289 316 370 415 435 434 427 418 407 395 379 367 381 433 497 517 469 395
622C95l5J7K9J4K2N3N9J3l7m0j3j6m7n5j2L1K8joJ7K9J7kj9l8m1lN5O2Ol8rN2N9Lm4l8oQk
$$ 395 360 377 406 420 442 495 554 567 530 490 477 461 414 359 347 378 406 405 399 416 445 462 460 441 403 362 359 414 476 482 444 435 487 546 549 505 467 461 469 467
618D67j0qlMkk3m4m0j3NkoJ1K3J0j2j2OJ1QK2L6J3l9o3k8K3L6J5nj6l0l8k0J7L3J7lomjJ2
$$ 467 457 449 446 450 448 425 381 341 328 333 331 325 336 359 369 357 345 351 362 370 392 428 441 402 339 311 334 370 385 380 364 334 296 276 293 326 343 340 334 330 329 341
612C41L2K2k5n1j4N1O9K2l3n6n2l6oK7L3Pj6j0RJ9K9L7K6lj2J2K2k5q1p1jM6L3OJ1K6Pl4n4
$$ 341 373 395 370 319 305 356 425 447 414 358 306 270 264 291 324 331 315 305 314 333 362 399 425 422 410 422 444 419 338 267 266 312 345 351 362 388 395 361 307
608C07l6jK2K4Ok0k8oK8L9J8mOL4M1Lm1l8OL1%m2l9LK4Lj5qJj8m6m1kM3O4O0L2%j7j2JQRO
$$ 307 271 270 292 316 322 302 274 268 296 335 353 349 355 389 430 433 392 354 360 391 391 349 310 313 337 340 325 317 318 300 254 213 211 254 318 378 410 410 393 381 382 390 399 405
602D05JKPNj5l2k1Jkk9l2OL9K4j9k7LK8K0jqkLOJ4K3J5qk3MO3R0M6l3p3n7l2l1l8l2j5RM9
$$ 405 406 408 415 420 405 373 352 353 351 322 290 296 335 359 340 313 316 344 364 363 355 353 356 362 376 399 414 406 383 387 450 540 586 553 480 423 391 360 322 290 275 284 333
597C33P4M3k6n3rL6J9k7m2l3l4k9K3P9O3j1n4k9K%j0J1L9L5jl0k6J3N1L9k3o4l6J3Ol4k3M0
$$ 333 407 450 424 371 362 398 417 390 348 315 281 252 275 354 417 406 352 323 325 325 315 326 365 400 399 369 343 356 407 446 423 359 323 336 342 308 285 325
592C25O2Pm1j7K6J8j9k0PJ5OJ5L4J7l1n5l9kK7M4M0J0j7j3J2K6K8L7L8kn9p2l1J2J4kkRNj3
$$ 325 387 394 353 336 362 380 361 341 348 363 369 384 418 435 404 349 310 308 335 379 419 429 412 399 411 437 465 502 540 538 479 407 376 388 402 400 398 407 412 399
588C99k1j3PK9L3Ql0m1j1K0J0k7k8L1R3Q8J6n6p1l5OK8K7Pj6k2kJ6Kk0j6Okm0n1rM3M9J6p
$$ 399 378 365 372 401 434 442 412 371 360 380 390 363 335 366 459 547 563 507 436 401 407 435 462 469 453 431 429 445 447 427 411 417 415 375 324 315 358 407 423 416
583D16nOJ6K0J2kqKOppJ2J1l6o7k2O5R8N5ROJ2mj6J2N5P8Q6R1P8M3K3M4P1N0MoK7M4J9qj4
$$ 416 411 417 433 453 465 463 455 457 463 456 449 461 472 436 369 347 412 510 565 574 580 592 588 572 584 639 717 803 894 972 1015 1038 1082 1153 1203 1207 1201 1228 1272 1291 1283 1269
577A269l5r6j43j13l4nm9r1p0j7Lj0j3KOjJLk8p2p0j2L1J7lK8P6O7Rk2J0M8N0K6Pj1l6l1K7
$$ 1269 1234 1138 995 882 848 843 794 703 633 616 619 609 596 598 604 603 604 607 579 507 437 425 456 473 470 498 574 641 650 628 638 686 736 762 769 758 722 691 718
573G18J03J38J23J06J20J41J34J07Q5P7O7N0N3P6P4J9n5q4p4p3j05j34j41j44j49j34r4p8
$$ 718 821 959 1082 1188 1308 1449 1583 1690 1775 1852 1919 1969 2022 2098 2172 2191 2136 2052 1978 1905 1800 1666 1525 1381 1232 1098 1004 926
569I26r9j06o7k3j9k6JK9Pl7l2J3J7k9m9kM6M7K4J6Rj4k1QL7K2j9m4m1j9J4N0P1P8J01J35
$$ 926 827 721 654 631 612 586 587 616 623 586 554 567 584 555 506 504 550 597 621 637 646 632 611 619 656 678 659 615 574 555 569 619 690 768 869 1004
565A004J27O2mj3J6L4L6L9K4k0n7m9k8m6r3j05o6k5j1j2j7l3n0m5l0l4n5n5k4J2K9L4L1J1
$$ 1004 1131 1193 1189 1176 1192 1226 1262 1301 1325 1305 1248 1199 1171 1125 1032 927 861 836 825 813 796 763 713 668 638 604 549 494 470 482 511 545 576 587
561E87j5j9pj7m4m2lK1j1n2m1J2M3L8L1L9L7Qk1k8k0j5pRK0J3JOK0J1k2m2k6LK1L1M1M0J8
$$ 587 572 553 546 529 485 443 440 461 450 398 357 369 412 450 481 520 557 565 544 516 496 481 474 483 503 516 517 523 543 554 532 490 464 467 488 519 560 600 618
556F18pj1kqk6k3MK4K7K1J1j5l8k4K5M3jn6n1MM0L0JnQK1J4loJ5L3J5k8l8jL4K9J5K8M1J1
$$ 618 611 600 598 590 564 541 545 569 596 617 628 613 575 551 576 619 618 562 511 515 555 585 586 581 589 610 624 621 615 630 663 678 650 612 611 645 674 689 717 758 769
551G69l9n6m0k9l1j6J3J9LOL6M9K0j6l4m2l8qL9M7Jm2k1L5N2J2k7k2PK6K5K2J5LjJ8M4L9j1
$$ 769 730 674 634 605 574 558 571 590 593 599 635 684 704 688 654 612 574 566 605 652 653 611 590 625 677 689 662 640 647 673 698 720 735 738 737 755 799 838 827
546H27n5l5K5M5km2j6K8J7l1l6QL1PoK6M8J8k0j8ol3p0n4J5O9P1N1L2Ll5n0l4j0%RL5O7P6
$$ 827 772 737 762 807 805 763 747 775 792 761 725 733 764 771 765 791 839 857 837 819 813 780 710 656 671 740 811 862 894 897 862 812 778 768 768 777 812 879 955
541I55N7K3j4l6l3pK0K3RjMMj2l2k5K0P4R8P4J3m6n4KP2Q9M4nj0kj5k2J0M3J6m1m2J9O0L5
$$ 955 1012 1035 1021 985 952 945 965 988 997 996 1000 1004 992 960 935 955 1029 1127 1201 1214 1168 1114 1116 1188 1277 1321 1316 1306 1304 1289 1267 1277 1320 1336 1295 1253 1272 1332 1367
537A367jlll2m2MN9N9L0L4N2L2pLN3O7J5l9m1j8lK0N1N1Jl7j1L9M4Pj0J6M3L9K6L4M9M8L8
$$ 1367 1366 1363 1360 1328 1286 1290 1349 1408 1438 1472 1524 1556 1549 1552 1605 1672 1687 1648 1607 1589 1586 1606 1657 1708 1709 1672 1661 1700 1744 1751 1741 1757 1800 1839 1865 1899 1948 1996 2034
532B034L1K9J9J6L0M6M1J7QJ8K4J9K8N8P6N4K0QJ3NjK8P2P3L2PL0O0N9N0O9R4Q5N8N8P6P6
$$ 2034 2065 2094 2113 2129 2159 2205 2246 2263 2271 2289 2313 2332 2360 2418 2494 2548 2568 2576 2589 2594 2593 2621 2693 2766 2798 2805 2835 2895 2954 3004 3073 3167 3252 3310 3368 3444 3520
527C520M7K4K6L6M0N2P9J04J07Q6O2N4P0R0J05J22J48J61J26P0O3J14J55J29Q8J03J54J66
$$ 3520 3567 3591 3617 3653 3693 3745 3824 3928 4035 4121 4183 4237 4307 4397 4502 4624 4772 4933 5059 5129 5192 5306 5461 5590 5678 5781 5935 6101
524F101J32J20J51J70J29O9M0M0N1Q1J29J64J46R6N9N6O8Q5J04J21J23J17J20J32J37J24J12
$$ 6101 6233 6353 6504 6674 6803 6872 6912 6952 7003 7084 7213 7377 7523 7619 7678 7734 7802 7887 7991 8112 8235 8352 8472 8604 8741 8865 8977
521H977J21J47J69J71J76K08K64L10L16L02L06L52M24N03N78O42O87P10P44Q40J028J271J524
$$ 8977 9098 9245 9414 9585 9761 9969 10233 10543 10859 11161 11467 11819 12243 12746 13324 13966 14653 15363 16107 16947 17975 19246 20770
518B0770J819K258K902L717M708O012P762R813J1693J2872J3068J2322J0887R109P345N864
$$ 20770 22589 24847 27749 31466 36174 42186 49948 59761 71454 84326 97394 109716 120603 129712 137057 142921
516A42921M777M010L285K175L54k127m875p482r743j1549j2726j3134j2789j1807j0286q422
$$ 142921 147698 151708 154993 157168 157522 155395 150520 143038 133295 121746 109020 95886 83097 71290 61004 52582
514E2582o583n113m045l191k462j914j548j255r85p75o10l96j37M2J10J84L31M87O07P51R42
$$ 52582 45999 40886 36841 33650 31188 29274 27726 26471 25486 24711 24101 23705 23568 23610 23720 23904 24235 24722 25329 26080 27022
511B7022J122J300J606K075K583L112L881N085O702Q735J1457J5112J9388K3357K5969K6546
$$ 27022 28144 29444 31050 33125 35708 38820 42701 47786 54488 63223 74680 89792 109180 132537 158506 185052
509A85052K5013K1889J8055J4341J1260R050P678O568M605Q97m390j0195j5552k0137k3879
$$ 185052 210065 231954 250009 264350 275610 284660 292338 298906 303511 304408 300018 289823 274271 254134 230255
508B30255k6464k7468k6732k4460k1078j7215j3580j0630q372o595n205m200l480k897k409
$$ 230255 203791 176323 149591 125131 104053 86838 73258 62628 54256 47661 42456 38256 34776 31879 29470
506B9470k041j752j452j157r43q00o60n14l95k82j13P8K17L27N02P52J016J320J786K456L258
$$ 29470 27429 25677 24225 23068 22125 21325 20665 20151 19756 19474 19361 19439 19656 19983 20485 21237 22253 23573 25359 27815 31073
503C1073M208N481P193R163J0967J2165J2475J1840J0457Q705O966N478M343L544K850J829
$$ 31073 35281 40762 47955 57118 68085 80250 92725 104565 115022 123727 130693 136171 140514 144058 146908 148737
501A48737J08k290m977p528r739j1537j2788j3301j2990j1960j0423q632o873n394m289l464
$$ 148737 148845 146555 141578 134050 124311 112774 99986 86685 73695 61735 51312 42680 35807 30413 26124 22660
499B2660k782k221j827j588j395j180r80q58p93p19o19n34m83m32l61l07l05l17k79k01j60
$$ 22660 19878 17657 15830 14242 12847 11667 10687 9829 9036 8317 7698 7164 6681 6249 5888 5581 5276 4959 4680 4479 4319
497D319j95k44k27j56j00q3o6m9p3j33j46o9J8J6m7p3m8m5q9j15q0l8l8n0l2lql9n2m2k9k6
$$ 4319 4124 3880 3653 3497 3397 3314 3248 3199 3126 2993 2847 2778 2796 2812 2765 2692 2644 2599 2510 2395 2315 2277 2239 2189 2157 2154 2146 2107 2055 2013 1984 1958
493A958k8m3o5p1m5j0kj9l3l3k9k6j9lJ9L3K6lk6k3j0k6o4o7k1J6%l4l4rKkOK7L5K1kk6m8
$$ 1958 1930 1887 1822 1751 1706 1696 1694 1675 1642 1609 1580 1554 1535 1532 1551 1584 1610 1607 1581 1558 1548 1522 1458 1391 1370 1386 1386 1352 1318 1309 1311 1309 1315 1342 1377 1398 1396 1370 1322
488A322n2k3J4K4Qj2k1k1qJ0Rq%M3O8K9l1m2j2Jk0l1j4KQJ3J3nj4K2P8P2oq2r8p2n0k8PL6
$$ 1322 1270 1247 1261 1285 1293 1281 1260 1239 1231 1241 1250 1242 1242 1285 1353 1382 1351 1309 1297 1298 1278 1247 1233 1235 1243 1256 1269 1264 1250 1272 1350 1422 1416 1334 1236 1164 1114 1086 1093 1129
483A129L6J7Lj1k5k0MK5K0nk9m9n5l2J1M1M3M0M0K3ljK8L3j2n6m7k2l4n8k5M9R0O1J6%kj5
$$ 1129 1165 1182 1185 1174 1149 1129 1133 1158 1178 1173 1144 1095 1040 1008 1019 1060 1103 1143 1183 1206 1203 1202 1230 1263 1251 1195 1148 1126 1092 1034 1009 1058 1148 1209 1225 1225 1223 1208
478A208k9k7j7rOL5N5M8K2ol5o0n7j9J9K3NPL6N0K6%J2M6N3J8j8k2kJ1J5J9J8%j8qK5N0N0
$$ 1208 1179 1152 1135 1126 1132 1167 1222 1270 1292 1286 1251 1191 1134 1115 1134 1157 1162 1169 1205 1255 1281 1281 1293 1339 1392 1410 1392 1370 1368 1379 1394 1413 1431 1431 1413 1405 1430 1480 1530
474A530M4M2K9jk1j1J3J7Jk0l4l6j7J9M1K7%jK8M8L6J4NJ5K7L9M8N0L5K0K1L9N6N3L2J0QK3
$$ 1530 1574 1616 1645 1644 1623 1612 1625 1642 1643 1623 1589 1553 1536 1555 1596 1623 1623 1622 1650 1698 1734 1748 1753 1768 1795 1834 1882 1932 1967 1987 2008 2047 2103 2156 2188 2198 2206 2229
469B229L6L4K9L8M9M3L1M0P5R2P0L9L7N2M5K2L1P7J10J03Q3P0M5LpN7J39J66J39J31J62J89
$$ 2229 2265 2299 2328 2366 2415 2458 2489 2529 2604 2696 2766 2805 2842 2894 2939 2961 2992 3069 3179 3282 3365 3435 3480 3483 3476 3533 3672 3838 3977 4108 4270 4459
465D459J88J89J99J94J87K33L40M37N07O32Q81J212J567K010K627L339L915M177M112L788
$$ 4459 4647 4836 5035 5229 5416 5649 5989 6426 6933 7565 8446 9658 11225 13235 15862 19201 23116 27293 31405 35193
463C5193L267K630K018J576J345J231J053O43m9r33j856k704l417l937m208m206l950l482
$$ 35193 38460 41090 43108 44684 46029 47260 48313 48956 48907 47974 46118 43414 39997 36060 31852 27646 23696 20214
460B0214k879k272j773j396j089q24o24m85l76k92k54k42k05j19j7P1J40J76J73J71K17K81
$$ 20214 17335 15063 13290 11894 10805 9981 9357 8872 8496 8204 7950 7708 7503 7384 7367 7438 7578 7754 7927 8098 8315 8596
458H596L13L51M71O53Q01R26J167J589K120K759L673M961O404P590Q227Q221P602O495N170
$$ 8596 8909 9260 9731 10384 11185 12111 13278 14867 16987 19746 23419 28380 34784 42374 50601 58822 66424 72919 78089
455G8089L952L053K514K235J951J284mj791l704n432o848p877q429q463q020p160n985m722
$$ 78089 82041 85094 87608 89843 91794 93078 93074 91283 87579 82147 75299 67422 58993 50530 42510 35350 29365 24643
453B4643l639k849k260j767j364j080q86p38o24n30m35l53l16k98k28j22p1r9j24q5l2nM4
$$ 24643 21004 18155 15895 14128 12764 11684 10798 10060 9436 8906 8471 8118 7802 7504 7276 7154 7083 6984 6860 6775 6743 6738 6782
450F782J59K88L69M49O15Q87J241J699K295K976L594L994M069L790L231K570J974J525J238
$$ 6782 6941 7229 7598 8047 8662 9549 10790 12489 14784 17760 21354 25348 29417 33207 36438 39008 40982 42507 43745
448D3745J086R70O93J04p67j743k642l364l866m138m194m038l653l090k474j938j506j145
$$ 43745 44831 45801 46494 46598 45831 44088 41446 38082 34216 30078 25884 21846 18193 15103 12629 10691 9185 8040
446H040q59o69n42m16k96k26k12k02j71j38j15r0p7j11j81k24k03j54j33j58k08k46k39j85
$$ 8040 7181 6512 5970 5554 5258 5032 4820 4618 4447 4309 4194 4104 4027 3916 3735 3511 3308 3154 3021 2863 2655 2409 2170 1985
443A985j22q8p9o7n6o4p3m7njm0o6m3qK%NRj2m2m6k2J0J5j0m6n1j3K7K6knK8O0O7O0N1L5K3
$$ 1985 1863 1775 1696 1629 1573 1509 1436 1389 1384 1383 1343 1277 1234 1226 1228 1228 1233 1242 1230 1188 1142 1120 1130 1145 1135 1089 1038 1025 1052 1078 1076 1071 1099 1159 1226 1286 1337 1372 1395
438A395L8O5N5Lk8kL3K9jj0kj5m2n6n0n8q7j14j14q7m5oMj9m0k2J9K5j5m3j7L2M5J1j6lL0
$$ 1395 1433 1498 1553 1556 1528 1526 1559 1588 1587 1577 1575 1560 1518 1462 1412 1354 1267 1153 1039 952 907 901 905 886 846 824 843 868 853 810 793 825 870 881 865 862 892
434H92M1K2jmNMrj9j3LK0L7N8O9N3J1l1m7l6j9rqponrj9l1m2m6l9j9J2L5K9j8o9p8m4j6k9
$$ 892 933 955 954 950 955 959 950 931 918 921 941 978 1036 1105 1158 1169 1138 1091 1055 1036 1027 1019 1012 1006 1001 992 973 942 900 854 815 796 808 843 872 854 785 707 663 647 618
429F18m5j8M0O6M2J0LJj9k9rJ4Lk2j3K5M0J1k4k8nJ3Ok0m2l1KK4J3mKK5K6jk7l8l7j9K0N2
$$ 618 573 555 595 661 703 713 716 717 698 669 660 674 677 655 642 667 707 718 694 666 661 674 680 660 618 587 589 613 626 622 624 649 675 674 647 609 572 553 573 625
424F25L3k1n1l0%pk9k8j0nj3kK4L3Pj3MM1M6Ll9l7nJ1oj8JK8L6L7M9M7Pm2m7j8qk9m3k4no
$$ 625 658 637 586 556 556 549 520 492 482 477 464 462 486 519 526 513 517 558 604 607 568 531 526 537 531 513 514 542 578 615 664 711 718 676 629 611 603 574 531 507 502 496
419D96nJ5K9K1MOJ1Kj4k2k5k5j3J6L9M2L3J8j5n2n6j8J7J6mj0lOK4M6M5Kl6l6j2mj5k3l3m0
$$ 496 491 506 535 556 560 566 577 579 565 543 518 493 480 496 535 577 610 628 613 561 505 487 504 520 516 506 503 509 533 579 624 626 590 554 542 538 523 500 467 427
414D27j8L9P2L8j8k5Lll1j1M6N1k4q1m7K4L4prL8O4K2l5m1j2ml7o6n6j8J3L0M0M6M0L5M6N9
$$ 427 409 448 520 558 540 515 518 515 484 473 519 570 546 465 418 442 476 469 460 498 562 584 549 508 496 492 455 389 333 315 328 358 398 444 484 519 565 624
409F24L2k5o1m8k9l7m0JM6L2j2pM5N3j6o9l5L3L6j6k9J9N1Pn9o1lM1K2j9k5MJ9ml0k4JJ6J1
$$ 624 656 631 570 522 493 456 416 417 463 495 483 476 521 574 558 489 454 487 523 507 478 497 548 555 496 435 432 473 495 476 451 455 474 470 440 416 417 433 444
404D44kj4k1oL4P0O4J4l6n4l6PN3P2L9j9m2j6K6M7M2J5l0o9n5J0O4N7J2k5m0l8j5L4O6M1j4
$$ 444 442 428 407 401 435 505 569 583 547 493 457 464 517 589 628 609 567 551 577 624 666 681 651 582 527 537 601 658 670 645 605 567 552 586 652 693 679
400F79k8J0M2K7KK0P2Q4K8m7o9k8K1L2Ol7p7r7p3oM2J7n6q6l6K7L4mj9MK3K2K6M5M5jn6o2
$$ 679 651 661 703 730 732 752 824 908 936 889 820 792 813 845 851 814 737 640 567 561 603 620 564 478 442 469 503 499 480 484 507 529 555 600 645 644 588 526
395E26k4Oql3k3K3N9N8K9kk0j8kJ0J2RK7O2Q2O6L1RPJ4K6M0M0J9oj2prj6j2kpk3m0o2r3r9
$$ 526 502 508 500 467 444 467 526 584 613 611 591 573 571 581 593 602 629 691 773 839 870 879 886 900 926 966 1006 1025 1019 1007 1000 991 975 963 961 954 931 891 829 736 637
390F37m8K9N6J5m2o6n8l7nK2K0jkJ8J8oj5MRj2j4K1M0Qk0kK2Lk4mL5L8K4L9M7qq1o6L0R0O3
$$ 637 589 618 674 689 647 581 523 486 481 503 523 522 520 538 556 550 535 539 548 536 522 543 583 591 571 569 591 594 570 566 601 639 663 702 749 741 660 594 624 714 777
385G77K0K0K6jl0l3l9o0o0j3L3K9RJ7L0Nl3l0J0K6po1r1p2pO7Q1K5l8m0jJ8kk2j8j3j5j1M
$$ 777 797 817 843 842 812 779 740 680 620 607 640 669 678 695 725 730 697 667 677 703 696 635 544 472 465 532 613 638 600 560 559 577 575 553 535 522 507 496 500
380E00Pqk3k6k4j7mMqj5OM3N7L7J9J0ok5j5K6M7J9k2k5%J3Kolj%PRj5m3l0J3K8j3n4l1K8N4
$$ 500 507 499 476 450 426 409 405 409 401 386 392 435 492 529 548 558 552 527 512 538 585 604 582 557 557 570 572 566 563 562 562 569 578 563 520 490 503 531 518 464 433 461 515
375E15K5j2j8kJ3K1J7j1m5l7K1N6J5n4o1jN0M0NqMJ0J1K0L0K2%k4l2k2OL4K5k1o2o1k2J6L7
$$ 515 540 528 510 508 521 542 559 548 503 466 487 543 558 504 443 442 492 532 537 529 533 543 554 574 604 626 626 602 570 548 554 588 613 592 530 469 447 463 500
370E00M7M3K2rk4j6jqm2p0n0K0P4N3j8m9j1L2K1j0lK8K9NJ7N8O5J9k6k8k2l4k9K7Q2O1k0o5
$$ 500 547 590 612 603 579 563 562 554 512 442 392 412 486 539 521 472 461 493 514 504 501 529 558 563 580 638 703 722 696 668 646 612 583 610 692 753 733 668
366F68l5J3J4j3rL2N3K2k8m2mM1N4L7K1K3L1L0J6Mlrk3m0m6l0oOJlJ0L5N4N7M7K4rl8l7mL1
$$ 668 633 646 660 647 638 670 723 745 717 675 671 712 766 803 824 847 878 908 924 928 925 916 893 853 807 777 771 777 778 775 785 820 874 931 978 1002 993 955 918 914 945
361I45M6K9j3o6r3o9lN1N7L2J5J8J8jk4k8oK4M6N1M2K9J3%j4k6l1k5j3KJ0J0J0J0jk9o0p1
$$ 945 991 1020 1007 941 848 779 776 827 884 916 931 949 967 966 942 914 908 932 978 1029 1071 1100 1113 1113 1099 1073 1042 1017 1004 1006 1016 1026 1036 1046 1045 1016 956 885
356H85m7j0K1L3K3pm0n0l0kJ1J2K2M2M5K1KJ1L3K2k8o3m1K0N4L3rk2rlj6j5J8N4M3k3q6r1
$$ 885 838 828 849 882 905 898 858 808 778 776 787 799 821 863 908 929 931 942 975 997 969 906 865 885 939 972 963 941 932 929 913 898 916 970 1013 990 904 813
351H13m4LJ7J1J8L3L4J8kk3m9o2l9J2L2nn7n5MN1L1l4o5k9L5N3Jp0p8j7M7N4J2k0qK3L8K2
$$ 813 769 772 789 800 818 851 885 903 901 878 829 767 728 740 772 767 710 655 659 710 741 707 642 613 648 701 702 632 554 537 584 638 650 630 622 645 683 705
347G05j0l7l5oK4K9J1LJ6K2Jl1m1k6j0j1j4oQJ3Mqj2pRL1M2K2j9m4k7J0K4J4LNkl0m9m1k1
$$ 705 695 658 623 617 641 670 681 684 700 722 723 692 651 625 615 604 590 584 592 605 609 601 589 582 591 622 664 686 667 623 596 606 630 644 647 652 650 620 571 530 509
342E09j1pJ2K5%n0p8n4oL0M4M5L0om8o1k7L1O0K7k4k6K6N8J7m5m2J7N0J7k4k3NJ4QMkk7l6
$$ 509 498 491 503 528 528 478 400 346 340 370 414 459 489 483 435 374 347 378 438 465 441 415 441 499 516 471 429 446 496 513 489 466 471 485 493 497 495 468 432
337D32jN3O1J2k4MO4P0Mo8p6l3%knJ6L1Mm0m8j4J3OrkJ3J8J0OJ5L2M2K8j8n9n2kL7K7ok6l3
$$ 432 431 484 545 557 533 537 601 671 675 607 531 498 498 496 491 507 538 542 502 454 440 453 459 450 448 461 479 489 495 510 542 584 612 594 535 483 481 518 545 539 513 480
332D80m1m4l1j5ojQLj7k3NL7K9rl1k1lRJ6K2K2K3L4M4K4j9m0j6J6J5j8m2k6J6M9N4L3Nj8k6
$$ 480 439 395 364 349 343 342 350 353 336 313 318 355 384 375 344 323 320 329 345 367 389 412 446 490 514 495 455 439 455 470 452 410 384 400 449 503 536 541 523 497
327D97j3Lmk9l1J1M9K6l3n2j3K1J8J1K2J5k3l5PM4J5l2l0%j6p0p5j2M9O1N4M6K2j8l4rJ0%
$$ 497 484 487 483 454 423 434 483 509 476 424 411 432 450 461 483 498 475 440 447 491 506 474 444 444 428 358 283 271 320 381 435 481 503 485 451 442 452 452
322D52j8j7mJ0L1L5qp0p2lM8K9j0jL3L0j6m7m2k7k2k1j8nK7N4M7QrJ3K3j2m2j0M7N8J6j6j2
$$ 452 434 417 413 423 454 489 481 411 339 336 384 413 403 402 435 465 449 402 360 333 311 290 272 267 294 348 395 403 394 407 430 418 376 366 413 471 487 471 459
318D59PK0K4Nl1m0jL8J6l6l9RM0K1jmj2k8j1L6N2Qk6kL8K9rj7JKj3j1Npm9p2n1k2k1k6nL8
$$ 459 466 486 510 515 484 444 443 481 497 461 422 431 471 492 491 487 475 447 436 472 524 532 506 504 542 571 562 545 546 548 535 524 529 522 473 401 350 328 307 281 276 314
312C14O1N7L9K3nm0n5l4MJ4lj5ML3L7J5ornKJ6K9K4nk8j6J6K3ol4k5OJ3j9n2n4l2j8j0J2M2
$$ 314 375 432 471 494 489 449 394 360 364 378 375 360 364 397 434 449 443 434 429 431 447 476 500 495 467 451 467 490 484 450 425 431 444 425 373 319 287 269 259 271 313
307C13M5J4rPL3J9k5m6l0lMjmOK3L4K2KOL5M6Ql6l2J0L1J0j7l1m4m7j0N1P7M5Lj3j4k1k5k1
$$ 313 358 372 363 370 403 422 397 351 321 318 322 321 317 323 346 380 402 404 410 445 491 499 463 431 441 472 482 465 434 390 343 333 384 461 506 509 496 482 461 436 415
302D15k8m9m5jL6K8PJ9M1L5Pmoj9k8kL7L8Lj9j3j2k3k4r%kJ1L3K8j3m3l8j6nNK3L4K8J7Lk4
$$ 415 387 338 293 292 328 356 363 382 423 458 465 461 455 436 408 406 443 481 484 465 452 440 417 393 384 384 382 393 426 454 441 398 360 344 339 344 367 401 429 446 449 425
297D25m6l5%J0k2l9nL4K8JJ3N6O5J4m2n1j5K3K9Lk5j5K5M2ko0o3j1K9J9nmROjPK0Pk9n7n1
$$ 425 379 344 344 354 332 293 288 322 350 351 364 420 485 499 457 406 391 414 443 446 421 406 431 473 471 411 348 337 366 385 380 376 385 391 390 397 417 424 395 338 287
292B87k2RK9L8M0L9K9Ll1m2j6K0K6Kj5lJ9K3Lk0k3rmj5l2k4MK1QNM4Q9O2l9j06o3L5P1L4K
$$ 287 265 274 303 341 381 420 449 452 421 379 363 383 409 411 396 393 412 435 438 418 395 386 382 367 335 311 315 336 344 349 393 482 544 505 399 336 371 442 476 478
287D78J5J6l2p2l7L7O2K4j4k8n0q2p2nM8L7NJ6N4N1Jl1j6NJqMJ9QqJK6K1k0n5m7nK8L5K7K3
$$ 478 493 509 477 405 368 405 467 491 477 449 399 317 245 240 288 325 330 346 400 451 452 421 405 410 411 403 407 426 434 426 427 453 474 454 399 352 347 375 410 437 460
282D60K0Jl2n3l8pKk3m5m0j7nNL4O6P1M6K5J4kk1j9J4M1L5J5PNrl3m4l8l0k5j6j0lJ2M1N2
$$ 460 480 481 449 396 358 351 353 330 285 245 228 223 228 262 328 399 445 470 484 482 461 442 456 497 532 547 554 559 550 517 473 435 405 380 364 354 351 363 404 456
277D56K9kpQkl0k9RL7J9j1j6j3l5p6q5m8J4N8O6L4pj7PL0K0J1K9M3Lo2o1J8P8M5k6l9KJ5k4
$$ 456 485 483 476 484 482 452 423 432 469 488 477 461 448 413 337 252 204 218 276 342 376 369 352 359 389 409 420 449 492 495 433 372 390 468 513 487 448 450 465 441
273D41m4kN2M9jm1l9j6MK5L7K1j0k0JJ3j7o3o9k2L6O0M5Qk1k8qJ8J8rl9m3j9J9M9M9J0k9l0
$$ 441 397 395 447 496 495 454 415 399 403 428 465 486 476 456 457 470 453 390 321 299 335 395 440 448 427 399 391 409 427 418 379 336 317 336 385 434 444 415 385
268C85jJ2krLLk3l2MM6M6K6K3K8mm3l4J6L3kk4OL7J4k9m0k6k4l3k2kMjMJ4J5K1M3N3J9k3k6
$$ 385 384 396 394 385 388 391 368 336 340 386 432 458 481 509 505 462 428 444 477 475 451 457 494 508 479 439 413 389 356 334 332 336 335 339 353 368 389 432 485 504 481 455
263D55jmk9k9MK3MpMjm3p1m2J2L3K0J3J4Kj3qQnk9k4J2L4K5J7K5J8j9m2k4OPrmJ5J4nmK0K9
$$ 455 454 450 421 392 396 419 423 416 420 419 376 305 263 275 308 328 341 355 357 344 336 344 339 310 286 298 332 357 374 399 417 398 356 332 338 345 336 332 347 361 356 352 372 401
257D01Nj5KK8K8Jk5m1n1n3m2k0NL6O5O1J2l8l9OM1L7J8kk8n1l1M0R4P2Lm1m3l6l0jM3N3Mn6
$$ 401 406 391 393 421 449 450 425 384 333 280 238 218 223 259 324 385 397 359 320 326 367 404 422 420 392 341 310 350 444 516 519 478 435 399 369 368 411 464 468 412
252D12p3m0OM6O9N8J1l9n0k4kmj9k6j9kJ6K3J1pj1kLknnj0k3k9j8jJ0J6K2K6K1J0Klj5k7k1
$$ 412 339 299 305 351 420 478 489 450 400 376 374 370 351 325 306 304 320 343 354 347 336 334 337 335 330 325 315 292 263 245 244 254 270 292 318 339 349 351 348 333 306 285
247B85JJ7J4MMJ2J7J6Rmk3k7jL3L5Lk5k3pmqnNRRJ0jk4l2nL1L4PrKP%KJ9J4j8l6pK4J1j8j0
$$ 285 286 303 317 321 325 337 354 370 379 375 352 325 324 357 392 395 370 347 340 336 328 323 328 337 346 356 355 331 299 294 325 359 366 357 359 366 366 368 387 401 383 347 340 364 375 357 347
241C47K2K4rk1QL2J9pk3l5m9l1J9N0K8pnK1K2pk0qjj3k0j1j2l2m0oM5O1L0j3l1j6J5L8K9p
$$ 347 369 393 384 363 371 403 422 415 392 357 308 277 296 346 374 367 362 383 405 398 378 370 369 356 336 325 313 281 241 235 280 341 371 358 327 311 326 364 393 386
237C86k9j6K5N1M3Pl4m7j6L7N8J7m7o2j6L3L1j0l3j9NRKQK9L6K0Kknl2p3p9l1K8M6K3NJ4K8
$$ 386 357 341 366 417 460 467 433 386 370 407 465 482 435 373 357 390 421 411 378 359 364 373 375 383 412 448 468 470 468 463 431 358 279 248 276 322 345 350 364 392
232C92K6J8K0K8K1kk3k6j8j9l0l7k3%Rnk2j7MK2K6J5nk4j9J0L2J4k1k9mJ6J3OR%j3nL2M6J1
$$ 392 418 436 456 484 505 503 480 454 436 417 387 350 327 327 336 331 309 292 296 318 344 359 354 330 311 321 353 367 346 317 313 329 342 348 357 357 344 339 371 417 428
227D28k9k9j1j6k0J4N5K7m6o9j3K6j1n3k0M5M3j3l2J2M1J5j8rJ4Nj5%L0K6j2k7JL0J2l5n6
$$ 428 399 370 359 343 323 337 392 419 373 304 291 317 306 253 233 278 321 308 276 288 329 344 326 317 331 336 321 321 351 377 365 338 339 369 381 346 290
222B90l5QL9M3K7OKJ2J4nk8k3OK8K2Mlkj1l3m5k7J0L4L1J0j0j6pJ0J9Pk4m7l6jK3K1J3K2L4
$$ 290 255 263 302 345 372 378 380 392 406 401 373 350 356 384 406 410 407 405 394 361 316 289 299 333 364 374 364 348 341 351 370 377 353 306 270 269 292 313 326 348 382
217C82K3jrlrl3l9j1J3ol9l3J5N1M6K3J6J9J6Qjj0j6j0MJ2Jj1j2j4l1n3n1j6K9N5N5L8J8K
$$ 382 405 404 395 392 383 350 311 300 313 307 268 235 250 301 347 370 386 405 421 429 428 418 402 392 396 408 409 398 386 372 341 288 237 221 250 305 360 398 416 418
212D18j9l5k9JK7K3lk5l1l5k9JL9M5J5%K4M2Pn1o9l7jQNLmj0%K5L3Pk5k3QK7Rj4mL5L9rn3
$$ 418 399 364 335 336 363 386 383 358 327 292 263 264 303 348 363 363 387 429 436 385 316 279 278 286 291 294 290 280 280 305 338 345 320 297 305 332 341 327 323 358 397 388 335
207C35k8L0L3k5m6J4O4K2m8l4M2N9j3o5k4M5M8jk0J5N3N6K3k8p2p4k5L8O0L8mm2o0m6nK8J9
$$ 335 307 337 370 345 299 313 377 399 351 317 359 418 405 340 316 361 409 408 388 403 456 512 535 507 435 361 336 374 434 472 468 426 366 320 315 343 362
202C62pj6kMJJ1L9N0K1k9o2n3j8RK0J9J7jl9o5l2L9P4L8j8k7OK7K1J3J8K0Qqj4pPJ5km5o9
$$ 362 355 339 337 341 342 353 392 442 463 434 372 319 301 310 330 349 366 365 326 261 229 268 342 380 362 335 341 368 389 402 420 440 448 440 426 419 426 441 439 394 325
197C25l8J9M6K5oj7j2oOJ9J2j5l6k4RL2L4J4j7l8l3lK1J8kj1qpj0jK2L4K1rk9k3j1j1k2j9
$$ 325 287 306 352 377 371 354 342 336 342 361 373 358 322 298 307 339 373 387 370 332 299 296 317 335 333 322 314 307 297 296 318 352 373 364 335 312 301 290 268 249
193B49JJ3Jk0j8J2L6L4J0j4j9kK8M9L6qn5p2m8LM7N1J3k6k2K3O2N1Kl8l8rJ2Jk1k4kJ8J9O
$$ 249 250 263 264 244 226 238 274 308 318 304 285 283 311 360 396 388 333 261 213 216 263 314 327 301 279 302 364 415 417 379 341 332 344 345 324 300 298 316 335 341
188C41mj7k2%L9N5K6j1j7mOK3N5N4pp0n7%J0l3m0J7N6K1j6J1N7L9k2m4k0rk7l1j0kj7j8OK1
$$ 341 337 320 298 298 337 392 418 407 390 386 392 415 470 524 517 447 390 390 400 367 327 344 400 421 405 416 473 512 490 446 426 417 390 359 349 347 330 312 318 339
183C39QkMJk4l6mL5L2j3m0k3J1K0NKJ9L1J5o%K9M3K2pk2l4m4l5JK1Kj8RN9P0K8k2m6m7k6J5
$$ 339 347 345 349 350 326 290 286 321 353 340 300 277 288 308 313 315 334 365 380 374 374 403 446 468 461 439 405 361 326 327 348 350 332 341 400 470 498 476 430 383 357 372
178C72M4L0j0k0nj7n7n7MN1K8j9j0L6L9j4n3l2LOj4j6MK5L1K3Rnj0mjqj0KJ6J4%nNJ3Omj0
$$ 372 416 446 436 416 411 394 337 280 284 335 363 344 334 370 409 395 342 310 313 319 305 289 293 318 349 372 381 376 366 362 361 353 343 345 361 375 375 370 375 388 394 390 380
172C80j5k5k4nJ2kk1qK8K8j9m6lO3P5L5lj9m5p3n4PM6L0NJ3L2K9J1RJ3jj3NK8J9k2m8m3k1
$$ 380 365 340 316 311 323 321 300 292 320 348 329 283 280 343 418 453 450 431 386 313 259 266 312 342 347 360 392 421 432 441 454 453 440 445 473 492 470 422 379 358
168C58%K0L1J8jpnj2k5k0JRJ%J3K3K1J5J1pk4j9krl5k9L1Q2N9jk2RK9Jl1k6JMk0l7l3k0j2
$$ 358 358 378 409 427 426 419 414 402 377 357 358 367 368 368 381 404 425 440 451 444 420 401 399 390 355 326 357 439 498 497 475 484 513 514 483 457 458 462 442 405 372 352 340
162C40kJ5K4Pk3l5j4K1L9L4J7Mj1l0l5j0K8M3K4KPK7K8Nj3j9l2n9o8l2K1M1K3QJ2J4qk8j8
$$ 340 338 353 377 384 361 326 312 333 372 406 423 427 416 386 351 341 369 412 436 438 445 472 500 505 492 473 441 382 314 282 303 344 367 375 387 401 393 365 347
157C47J0K1OnOK6K6jl2m3k3J%j8k2JK1J2j0j0J7L3J8j2k7j9pkkJ0K8L3K0PJ2J7kl6m6j6J6
$$ 347 357 378 384 379 385 411 437 436 404 361 338 339 339 321 299 300 321 333 323 313 330 363 381 369 342 323 316 314 312 322 350 383 403 410 422 439 437 401 355 339 355
152C55J7JlON%OK3K1j1n3o9m5J1O1O7K7j5j7%j0m2n7l2KJ9J7kk8l4MN6O1J2k5%M7N4K7J2J9
$$ 355 372 373 370 376 381 381 387 410 431 420 367 298 253 264 325 392 419 404 387 387 377 335 278 246 248 267 284 282 254 220 224 280 341 353 328 328 375 429 456 468 487
147D87Rk9n3l0PJ6KPL0K9j3n8n4j8kj5j1L1O0L9PPJ4k1p2o8j2J8j4m2j7K2K7J8L1M8K6j8l1
$$ 487 496 467 414 384 391 407 409 416 446 475 462 404 350 332 330 315 304 335 395 434 441 448 462 441 369 301 289 307 293 251 234 256 283 301 332 380 406 388 357
143C57pJ3J4Nj0k8k3J4L0j1o7n7QM7L7L3N2L7l7q8m8L3M7j3n1j2N7P8M6Nj0pj0k2l1k5j0l
$$ 357 350 363 377 382 372 344 321 335 365 354 287 230 238 285 322 355 407 444 407 319 271 304 351 338 287 275 332 410 456 461 451 444 434 412 381 356 346 343
138C43nkJ3K6K4J9K4K9J2j5k3nJ3Rmrrrj0jPkk4l2j6KMpnOJ1Jj3j8j4kMj2m9o8l3K8N6L9J7
$$ 343 338 336 349 375 399 418 442 471 483 468 445 440 453 462 458 449 440 431 421 420 427 425 401 369 353 355 359 352 347 353 364 365 352 334 320 318 322 310 261 193 160 188 244 283 300
133C00Qj4n3n1J8Q5P2Lk7NL2Pl0l5j9j4j5JJ8J2j3k6j6%J1J9K3J2omK7O7O9J7m7o5l1NJk4
$$ 300 308 294 241 190 208 293 365 368 341 346 378 385 355 320 301 287 272 273 291 303 290 264 248 248 259 278 301 313 307 303 330 397 466 483 436 371 340 345 346 322
128C22k5J2N2O4M5kn0o4l3M%k3j9OOj7j1K7L3j5m3%N5M1j8l7%K7J4ojJ8K6K4J0j2l4m0l6k5
$$ 322 297 309 361 425 470 468 418 354 321 325 325 302 283 289 295 278 267 294 327 312 269 269 324 365 347 310 310 337 351 345 344 362 388 412 422 410 376 336 300 275
123B75%L4L9nm6l2K2N2M1J9Oj1l3l3j8j9k6j0K9M2J4j5qJ7L3L2K5Qrr%nk1k0KOj5k3jK2J6
$$ 275 275 309 348 343 297 265 287 339 380 399 405 394 361 328 310 291 265 255 284 326 340 325 317 334 367 399 424 432 423 414 414 409 388 368 370 376 361 338 337 359 375
118C75Kpk8n1l4K9O5L2k2k8kkk7l6k8k3qM6R6P2j3o1k9K1J4l1m9k0J9L9M0L2K0J0lj4j0J3
$$ 375 377 370 342 291 257 286 351 383 361 333 331 329 302 266 238 215 207 253 349 421 408 347 318 339 353 322 273 253 272 311 351 383 403 413 410 396 386 399
113C99K5Kl4l6oJ7J6J7L0K7ok7rJ0k0p8r4m8QK4J2J6M3M9Qm1l6K3P3O3K8K0K9Nm7p3m7j5j9
$$ 399 424 426 392 356 350 367 383 400 430 457 451 424 415 425 405 327 233 185 193 217 229 245 288 337 345 304 268 291 364 427 455 475 504 509 462 389 342 327 308
108C08l1k2nj0j8lJ8J1j1kM5P5N0nm1m0k0j2k7m2l1MK5J1oNK5J3j7j9J7M0J9j5j4J3K5Rj0
$$ 308 277 255 250 240 222 219 237 248 237 235 280 355 405 400 359 319 299 287 260 218 187 191 216 227 221 226 251 264 247 228 245 285 304 289 275 288 313 322 312
104C12j0OK2K7J9jj4qJ8M4M0jn1o3k1K3K2j4k6J0M0K6oj3MOj3k3j1J%KJ2Rj8l9k8OK2Oj6k7
$$ 312 302 308 330 357 376 375 361 353 371 415 455 454 403 340 319 342 364 350 324 334 374 400 394 381 385 391 378 355 344 345 345 347 359 368 350 311 283 289 311 317 301 274
98B74k5j7JL0M7L6Ok0k8k5j8nJ1Rj7m6l7J6P1Q5N5J4j2k2k7k9k2j3qj3j7pQJ6J5J5K0J7ok8
$$ 274 249 232 233 263 310 346 352 332 304 279 261 256 267 276 259 213 176 192 263 348 403 417 405 383 356 327 305 292 284 271 254 247 255 271 286 301 321 338 332 304
94C04k2OK6J7jrqmJ1M0N5L5j2m3l6KL8N2L0j1l7l0j0rk9m2l3j6KK4L4Mm5n5kN8N8J5kK1L4
$$ 304 282 288 314 331 330 321 313 309 320 360 415 450 438 395 359 361 399 451 481 470 433 403 393 384 355 313 280 264 266 290 324 328 283 228 226 284 342 357 355 376 410
89D10lm7n5k5KOJkPK0L1K1lk0j3JJpoLKqJK9M4K0j8k1NJ4j8m7k3L3N2Nn2n2j0Rj9m1j1L9M8
$$ 410 407 360 305 280 282 288 289 287 294 314 345 366 363 343 330 331 332 325 319 322 324 316 317 346 390 410 392 371 376 390 372 325 302 335 387 392 340 288 278 287 268 227 216 255 303
83C03J0k0j3Kj0l2k0K2M2J3k6k0K7O0L7j4m3l0j1mJK1L6J8k0l5j7JJKK1L1Kl4k7J2J8k9o5
$$ 303 313 293 280 282 272 240 220 242 284 297 271 251 278 338 375 361 318 288 277 273 274 295 331 349 329 294 277 278 279 281 302 333 335 301 274 286 304 275 210
78B10l0L6M9Ll2rL3M1J9MRJ4PPJ6Rk3n3l4K6O5M1j3l3j1jl3o2l4L1O5M7J2kLQJ1J1Jj5k1j7
$$ 210 180 216 265 268 236 227 260 301 320 324 333 347 354 361 377 386 363 310 276 302 367 408 395 362 351 350 317 255 221 252 317 364 376 374 377 385 396 407 408 393 372 355
73C55k0k0OM9N4%o0o6k3J7L4M0K5j3m7l5KJ7jnK3N8O4M0Mk7k8MK6j2p8r0l0K3Pl5l2J1M8N3
$$ 355 335 315 321 370 424 424 364 298 275 292 326 366 391 378 331 296 298 315 314 309 332 390 454 494 498 471 443 447 473 461 383 293 263 286 293 258 226 237 285 338
68C38L9J2j2j2J3K5RnPRk4n2l0Lmk4OO0N4ol1OL6J1j0J5L5ln3m3RK0k3n2k3L0N1L3J0MRJk9
$$ 338 377 389 377 365 378 403 412 407 414 423 399 347 317 320 316 292 298 358 412 406 375 381 417 428 418 433 468 465 412 369 378 398 375 323 300 330 381 414 424 428 437 438 409
63D09n7n5k4kj1k1kL7N8M9K1oj6pQJ2RJ8L5L3J7J6K6Qm6p6m2J0J4j1j0J4Qk8l8%L7L6J0j3
$$ 409 352 297 273 271 260 239 237 274 332 381 402 396 380 373 381 393 402 420 455 488 505 521 547 555 509 433 391 401 415 404 394 408 416 388 350 350 387 423 433 420
58D20k8l6k6OL2L3Rj7l1k3KJ4nj6J1M8L6j3l7j7ol0m3rL1L3J9K6L1mn0m9j6rl3k7K5O3M3L
$$ 420 392 356 330 336 368 401 410 393 362 339 341 355 350 334 345 393 429 416 379 362 356 326 283 274 305 338 357 383 414 410 360 311 295 286 253 226 251 314 357 360
53C60KL4L8nn1m7%L1J7k1l2lK8L0Qj3j7j2mLlj4pK5M7L2rk9k2qj1j8k1j5nJ3K5J8mj7oJ2K0
$$ 360 362 396 434 429 378 331 331 362 379 358 326 323 351 381 389 376 359 347 343 346 343 329 322 347 394 426 417 388 366 358 347 329 308 293 288 301 326 344 340 323 317 329 349
48C49J4Jrj1NK2K5J1MJ2J7OjOJ0j2n0o2l5QL7M9M6K4j8n0l5J6N3M4Pj7j8k3m4o6n8k1K5M8
$$ 349 363 364 355 344 349 371 396 407 411 423 440 446 445 451 461 449 399 337 302 310 347 396 442 466 448 398 363 379 432 476 483 466 448 425 381 315 257 236 261 309
43C09M1J7ok3l8m6l9j4RJ7K4M3N2K8j0rL5O8M5rn3p0o0k3J8K3j2l1%L5J9k5l2kQpkL5N0J5
$$ 309 350 367 361 338 300 254 215 201 210 227 251 294 346 374 364 355 390 458 503 494 441 371 311 288 306 329 317 286 286 321 340 315 283 281 289 282 280 315 365 380
38C80k2k2rj2j7PL2K2j3l2k2mJ0K0J7lk2j4NJk6m2k4QL1M0M6M6L7J7qk5k0%PqrK5N3K3m6o6
$$ 380 358 336 327 315 298 305 337 359 346 314 292 288 298 318 335 332 310 296 301 302 276 234 210 218 249 289 335 381 418 435 427 402 382 382 389 381 372 397 450 473 427 361
33C61j2M3L5rj7Ojm5o8l4J7M0M3M9N2K6j8m1k9pkj2k0j9lK2L6K3MMJ4jl9n1rL6L1j0k2%J0
$$ 361 349 392 427 418 401 407 406 361 293 259 276 316 359 408 460 486 468 427 398 391 389 377 357 338 335 357 393 416 420 424 438 437 398 347 338 374 405 395 373 373 383
28C83j6l8j8J8L1Nl3n3l9PM8M9J5j5j8rLK7O0O6L1pj4pj8l5l2j7j1rJ1L3J5l2n9l6QL7K7j4
$$ 383 367 329 311 329 360 365 332 279 240 247 295 344 359 344 326 317 320 347 407 473 504 497 483 476 458 423 391 374 363 354 365 398 413 381 322 286 294 331 358 344
23C44o0o2mO1O8K1mK0M1J5k3k2JNj5j8njj3j2QK0PkJ6M2L4rl8k5J2K1mk7k5j6k3k8oK7K9m
$$ 344 284 222 218 279 347 368 364 384 425 440 417 395 396 401 386 368 363 362 349 337 345 365 372 370 386 428 462 453 415 390 402 423 419 392 367 351 328 300 294 321 350 346
18C46j5K0N5L4k3n1k5J0J0j8l9l2j0J4L3M3L8K0pk6l0j8jLj3k7j1L2N7L0k6m1%M3L6jj4LM
$$ 346 331 351 406 440 417 366 341 351 361 343 304 272 262 276 309 352 390 410 403 377 347 329 328 331 318 291 280 312 369 399 373 332 332 375 411 410 396 399 403
13D03j8k8j3qk6k5J5N1L4j2k8j2OJ4K7L2Ol6m5j9NLOK6L5J3j4j1Mlk5k4J1M1K7j9n7n0nL9
$$ 403 385 357 344 336 310 285 300 351 385 373 345 333 339 353 380 412 418 382 337 318 323 326 332 358 393 406 392 381 385 382 357 333 344 385 412 393 336 286 281 320
8C20L7j0m9l5K2O9O8L0j0l3l7k8qJ6K3km4o7m1J1M3L0jj2RL6L9J3k1l6k7oNJrj3nK0M9O4M3
$$ 320 357 347 298 263 285 354 422 452 442 409 372 344 336 352 375 373 329 262 221 232 275 305 304 292 301 337 376 389 368 332 305 299 304 305 296 283 278 298 347 411 454
3D54%k6j4J5J6j5m8m9k4jMKJ4L3L8J2k9n9n3k6KMj2j3K1O7O9J8k8k0J3Ol9n2oL3J7k1j1L3
$$ 454 454 428 414 429 445 430 382 333 309 308 312 314 328 361 399 411 382 323 270 244 246 250 238 225 246 313 382 400 372 352 365 371 332 280 274 307 324 303 292 325
-2C25M0om6m1j4JJ4L3L3ll2j1L6M1Mk1pKk7n9l6K5O1N4L9K6on3o8k1K7J0m0l7L4Q4L9m4p1
$$ 325 365 359 313 272 258 259 273 306 339 336 304 293 329 370 374 353 346 348 321 262 226 251 312 366 405 431 425 372 304 283 310 320 280 243 277 361 400 356 285
-6B85l1Nlj5J3N6N9J5k9l9k8j2OK1J9OPK1K0j0k9qK5J6j7k2J3K8qm5l3jkk1pL6N5L2RQOj2
$$ 285 254 259 256 241 254 310 369 384 355 316 288 276 282 303 322 328 335 356 376 366 337 329 354 370 353 331 344 372 364 319 286 285 283 262 255 291 346 378 387 395 401 389
-11C89j7OK1Oj1MK2Kl8m4j7NQRRj1k8pL9M7nn7n2nK8K5Poj1j1KK4L9L8J5j5l2j9QJ7J0J6M2
$$ 389 372 378 399 405 394 398 420 422 384 340 323 328 336 345 354 343 315 308 347 394 389 332 280 275 303 328 335 329 318 307 309 333 372 410 425 410 378 359 367 384 394 410 452
-17D52M8Mn4p2m6k0j2oMkk1k0J1M3M7L8L3J6k4o0n4j6J2J4J0Nj5m5n6k5J8M1L9K2lk9k9q%
$$ 452 500 504 450 378 332 312 300 294 298 296 275 255 266 309 356 394 427 443 419 359 305 289 301 315 325 330 315 270 214 189 207 248 287 309 306 277 248 240 240
-21B40k8m4qN6P3L3oj2mqkJ8J5l0o7m4J1L2Kk4j7JRJ4K2J4jmJ3K4J7Nlj8l1j4K5L4om0j7L6
$$ 240 212 168 160 216 289 322 316 304 300 292 290 308 323 293 226 182 193 225 227 203 186 187 196 210 232 246 245 241 254 278 295 300 297 279 248 234 259 293 287 247 230 266
-27B66N4L4J6J5kl6n7l9nJ8K0J3mj3pRK1K3K0Jl5n8l8QL7L9L8M1K8LnMqm7o0j4L7K3l2n4k8
$$ 266 320 354 370 385 383 347 290 251 246 264 284 297 293 280 273 282 303 326 346 347 312 254 216 224 261 300 338 379 407 410 405 409 401 354 294 280 317 340 308 254 226
-32B26JPK0N3O8L5j5l5k4qMJ5J7kl0l8j8NJ2RJ2J7J8J3RKj1k3k1JK1K6K3J9Mk1l4j6Pj2o0
$$ 226 227 234 254 307 375 410 395 360 336 328 332 347 364 362 332 294 276 281 293 302 314 331 349 362 371 373 362 339 318 319 340 366 389 408 412 391 357 341 348 336 276
-37B76p8l1L7O5M6J5j1l5m6k5J3L0J9Lpk1l3j5K1L5J1j4j4jjnkKmlJ7L5K4ONJ9K3Prk1k9j8
$$ 276 198 167 204 269 315 330 319 284 238 213 226 256 275 278 271 250 217 202 223 258 269 255 241 240 239 234 232 234 230 227 244 279 303 309 314 333 356 363 354 333 304 286
-42B86J7N1N1K1KJpl1l4kK9J7k6n1l4PL1K4mj9nK0K2j0m8n7l0PL4L8K7K0K8L0%l3k6J5K8j1
$$ 286 303 354 405 426 428 429 422 391 357 355 384 401 375 324 290 297 328 352 348 329 324 344 366 356 308 251 221 228 262 300 327 347 375 405 405 372 346 361 389 378
-47C78m7k7J8L0J5OJk6m7j3M5M3k6o8k4L7L0j4j6L0M8J0l0l3k2k5k7rJ6K4K3K1Oj9k8j2No
$$ 378 331 304 322 352 367 373 374 348 301 288 333 376 350 282 258 295 325 311 295 325 373 383 353 320 298 273 246 237 253 277 300 321 327 308 280 268 273 267
-51B67k2j1J2Jl3l6J2N0L1j9l0J3O2O4K2k1k5PM0M1J3j6k3j5pononpj6k9k9j1J3J4LRL3L4
$$ 267 245 234 246 247 214 178 190 240 271 252 222 235 297 361 383 362 337 344 384 425 438 422 399 384 377 371 366 360 355 348 332 303 274 263 276 290 293 302 335 369
-56C69j2n7m7ML4K1LLLqjL8O3L1l4o6l9LJ2j7m3l1J2N0N1K3%KJ3J0Joj0j5rRK2J1j0j4qpo
$$ 369 357 300 253 257 291 312 315 318 321 313 312 350 413 444 410 344 305 308 320 303 260 229 241 291 342 365 365 367 380 390 391 385 375 360 351 360 382 393 383 369 361 354 348
-61C48J2L5L1jk7l0k0j2nOJ0O%j1l9o4m8ON1M4Ok0k2j8j0OK8L3J8kk1l0j4L1O9O3J2k7j5K0
$$ 348 360 395 426 425 398 368 348 336 331 337 347 353 353 342 303 239 191 197 248 292 298 278 256 238 228 234 262 295 313 311 290 260 246 277 346 409 421 394 379 399
-66C99K8%k5j4J2Rk9n2k6K0K4j9n0k7K3M0J7nnj1l0l5jM3M8J6j5j7mmj2j0RK6J6j2k5pK2K9
$$ 399 427 427 402 388 400 409 380 328 302 322 346 327 277 250 273 313 330 325 320 309 279 244 243 286 334 350 335 318 314 310 298 288 297 323 339 327 302 295 317 346
-71C46J0nNK3Rl3o3m3J9P2P4K9k1m2m3m2l7rL4M9J8k2k7mKj5j4J6L1J2j1%J0k3p6p5j5L5L8
$$ 346 356 351 356 379 388 355 292 249 268 340 414 443 422 380 337 295 258 249 283 332 350 328 301 297 299 284 270 286 317 329 318 318 328 305 229 154 139 174 212
-76B12L1N3P3M0k6n4k3K4M9N3M2J1l5n9m1kK1K2J3OQJ5J3mk2j3K0L9J3l2n0k0K3K5k0o6o0
$$ 212 243 296 369 409 383 329 306 330 379 432 474 485 450 391 350 348 369 391 404 410 418 433 446 442 420 407 427 466 479 447 397 377 400 425 405 339 279
-81B79j2K9L2J7Lk3o0n6J4Q8P6jl7LM1J3k4mM5N2J6lkj4l9m1k2j6k4j5RJ3JJ2M1M1nm1k9%
$$ 279 267 296 328 345 348 325 265 209 223 311 387 386 349 352 393 406 382 378 423 475 491 488 486 472 433 392 370 354 330 315 324 337 338 350 391 432 427 386 357 357
-85C57J1J4L7N5L0l0p4p2l5NK8L0K7L0L1J4k0l8l4k4j9j0OJ3PRJ8J6OJ2K8J7k1l5oJ4j6n0
$$ 357 368 382 419 474 504 474 400 328 293 298 326 356 383 413 444 458 438 400 366 342 323 313 319 332 339 348 366 382 388 400 428 445 424 389 383 397 381 331
-90C31l1J9L3Jl0l5l0j4J8L9J9k0k6LJ0j6k4RM5M1J0k0l6m0j9J5K8J0%K2L7J0l0k7J1L2J0
$$ 331 300 319 352 353 323 288 258 244 262 301 320 300 274 277 287 271 247 256 301 342 352 332 296 256 237 252 280 290 290 312 349 359 329 302 313 345 355
-95C55k2l1k2j6j6j2QM0O5O1K5j6l8m4n0n8n1k1J8N0O3M9Km8n9j0N3P3L3j7k7pMpj0J1L2K3
$$ 355 333 302 280 264 248 236 244 284 349 410 435 419 381 337 287 229 178 157 175 225 288 337 339 291 232 222 275 348 381 364 337 330 334 327 317 328 360 383
-99C83nrJ2K5J2qj3nNNnk4m0l3j3lj2j6jJ8J7J1J8L1K3pl1l6k8k0lK2L7K5ql1k3J2M0L6%l8
$$ 383 378 369 381 406 418 410 397 392 397 402 397 373 333 300 287 284 272 256 255 273 290 301 319 350 373 366 335 299 271 251 248 270 307 332 324 293 270 282 322 358 358 320
-104C20m7k9jJ9K3J8J1Mpj9k6k3nK1M5N2L5MrKMk1m5k4K7N4L4Mnj3l0l5qJ6%l3l7j1RJ4L0
$$ 320 273 244 243 262 285 303 314 318 311 292 266 243 238 259 304 356 391 395 386 388 392 371 326 302 329 383 417 421 416 403 373 338 330 346 346 313 276 265 274 288 318
-109C18N4N5J9j3qJ0Rrj9j7k3l3l7m3o0o7l0L3N9L0nJK4J2k4k8RK8J0jK8N5J9m7o7k3K2K2
$$ 318 372 427 446 433 425 435 444 435 416 399 376 343 306 263 203 136 106 139 198 228 223 224 248 260 236 208 217 245 255 254 282 337 356 309 242 219 241 263
-114B63mk0j5LK7L3Rj5OO5Q9M4k1m7l2k2k3j8%J7K8K6Nk9l6mL0K1k1n3n0j8K8N8M2rl2MM0
$$ 263 259 239 224 227 254 287 296 281 287 352 441 485 464 417 385 363 340 322 322 339 367 393 398 369 333 329 359 380 359 306 256 238 266 324 366 357 325 329 369
-119C69J8k1j1K8J7l2l6K2N8K7j8k1j1k8m1k2%j3k0J7O1M3j6l7mK8J5j8l6l7j9J5N1M6Ll5
$$ 369 387 366 355 383 400 368 332 354 412 439 421 400 389 361 320 298 298 285 265 282 343 386 370 333 329 357 372 354 318 281 262 277 328 374 377 342
-123C42l4nK2L4L5K1pk9k6nLk4n9n7oN3O3K1l0m1j4K0L9L2ro7q8m4K5M5J1k0lL7M9K6pk0j4
$$ 342 308 303 325 359 394 415 408 379 353 348 351 327 268 211 205 258 321 342 312 271 257 277 316 348 339 272 184 140 165 210 221 201 198 235 284 310 303 283 269
-128B69lQK1L4L4Qk9m2j3K8L7J1k1k3jK1J8j7n3n0qK4J3j3pK9M6K2j0j4jOKkPL0N0L8j2n4
$$ 269 266 274 295 329 363 371 342 300 287 315 352 363 342 319 318 339 357 340 287 237 229 253 266 253 246 275 321 343 333 319 318 324 326 324 331 361 411 449 437 383
-133C83l9K3N7K8k1l0KK9L0J8J0Krj8k4k3j6rj3k5k0J1L8J7m2p6m3K9P1N2on1n4j8L0N3L5
$$ 383 344 367 424 452 431 401 403 432 462 480 490 492 483 465 441 418 402 393 380 355 335 346 384 401 359 283 240 269 340 392 386 335 281 263 293 346 381
-137C81jj6JJ1j5m8l9J1M6L1KKJ3rm5k9M2R8P6Jn4o3m2j8MJ6Rj1j4J3M6N3K2k0m3k9kJ6J8
$$ 381 380 364 365 376 361 313 274 285 331 362 364 366 379 370 325 296 338 436 512 513 459 396 354 336 340 356 365 354 340 353 399 452 474 454 411 382 380 396 414
-142D14J6Nj2k5k2qj3l1l4pK3L1K3J3kk0j8MJ0j6m3k5K2M8M0K2Jk7m3j3L6L7j9o6m6KJ6np
$$ 414 430 435 423 398 376 368 355 324 290 283 306 337 360 373 371 351 333 337 347 331 288 263 285 333 373 395 396 369 326 313 349 386 367 301 255 257 273 268 261
-147B61J8L5J9lpjjMK4L6K4lj2%%k7m9l3JJ3ok0jK9M0K4Kj3j6nRQqrJ8L0qn8m8K1O3L0j9q
$$ 261 279 314 333 330 323 322 321 325 349 385 409 406 394 394 394 367 318 285 286 299 293 273 272 301 341 365 367 354 338 333 342 350 342 333 351 381 373 315 267 288 351 381 362 354
-152C54L4M2J2JJ1mn0o1oN0L9j6m3k4%%j1j9k7k7oK9M4L1Rpl2n5m4NM0L1OjLqk3oL3N8N2M1
$$ 354 388 430 442 443 454 450 400 339 333 383 422 406 363 339 339 339 328 309 282 255 249 278 322 353 362 355 323 268 224 229 269 300 306 305 308 300 277 271 304 362 414 455
-157D55K9Ll3n1l6j5ojJqk5k2J5N0N0K5J0Olj5rJ7L3K0j4l7k7RK9Rk5k2K2M0pp3q4l9LJ6K6
$$ 455 484 487 454 403 367 352 346 345 346 338 313 291 306 356 406 431 441 447 444 429 420 437 470 490 476 439 412 421 450 459 434 412 434 474 467 394 310 271 274 290 316
-162C16M3L8jk9j8%j1k9j1K9L7QlL3O7M1k9o9n1j5qk4l3k6j5JL1N9N3J3k3l1k3k1j4J2L2K0
$$ 316 359 397 396 367 349 349 338 309 298 327 364 372 369 402 469 510 481 412 361 346 338 314 281 255 240 241 272 331 384 397 374 343 320 299 285 297 329 349
-167C49j4k5pOoj7jK9M0K3kj8k0k4l2l0mL6M8J6j7jM6O1K2k3k7pM%NJ5J5J2J9J6j4m9m7rJ6
$$ 349 335 310 303 309 303 286 285 314 354 377 375 357 337 313 281 251 247 283 331 347 330 329 375 436 458 435 408 401 405 405 410 425 440 452 471 487 473 424 377 368 384
-172C84J0qrnj0j6j6k1l0j5L0O7M5j1l3JL8K7j1k6j9j8l2l4j7jQK4M6M7J3k2k1kRJ5K8L1L
$$ 384 394 386 377 372 362 346 330 309 279 264 294 361 406 395 362 363 401 428 417 391 372 354 322 288 271 270 278 302 348 395 408 386 365 363 372 387 415 446 449
-177D49k8k4PJ7MMK0Ln1p4l3J6J0j5MN6P2L1j7k8j2J6M5M9On4o5j4L6L4nk9k4j4r%RPj1l2
$$ 449 421 397 404 421 425 429 449 452 401 327 294 310 320 305 309 365 437 468 451 423 411 427 472 521 527 473 408 394 430 464 459 430 406 392 383 383 392 399 388 356
-182C56m1k6JK4L1L4M4M1J0k7l1lJ5Mj1j4k0l9m4j7J2J6J1K4L8J7k0k6RL9K8j1l8k8J2N0M2
$$ 356 315 289 290 314 345 379 423 464 474 447 416 413 428 432 421 407 387 348 304 287 299 315 326 350 388 405 385 359 368 407 435 424 386 358 370 420 462
-186D62j4o8n9%L5J4j6j3OPLJ8L3Rl8m4JL0Nk9j4L1M1J5QL1L7%l6k5NQqrKkj1ML7M1J3j8l0
$$ 462 448 380 321 321 356 370 354 341 347 354 357 375 408 417 379 335 336 366 371 342 328 359 400 415 423 454 491 491 455 430 435 443 435 426 428 426 415 419 456 497 510 492 462
-192D62l3l2nL1L9Rj3rj3m0m4mK8Pk5kN0N7J4j1OJ7%rJ1K4ll6l3j1%KJ3K7J8j3m1m6k5J5M7
$$ 462 429 397 392 423 462 471 458 449 436 396 352 348 376 383 358 356 406 463 477 466 472 489 489 480 491 515 512 476 443 432 432 434 447 474 492 479 438 392 367 382 429
-197D29L9jl0j7NOojRnl1k8PL9M4L7L0J7%ppj5k0NN1N8%o9p6k1K7K2j6m7n5n0l1JM0N5L3p
$$ 429 468 467 437 420 425 431 425 424 433 428 397 369 376 415 459 496 526 543 543 536 529 514 494 499 550 608 608 539 463 442 469 491 475 428 373 323 292 293 333 388 421 414
-202D14l0j9LJ3J0J7K5Ol8n9k1L9N6J6k7k2J1K4Lk1k3j1KJ8L3K9qm8m7J2P7Q2K3m2m8oK1n
$$ 414 384 365 368 381 391 408 433 439 401 342 321 360 416 432 405 383 394 418 421 400 377 366 368 386 419 448 440 392 345 357 434 516 539 497 449 443 464 459
-206D59n0n7j6K5K6j0l4k7nMkLJ6Ql0n3j9M8P0J7m6l8K6O5M4Nl%j5l2k2QJ5j4n0o0l6J1N4
$$ 459 409 352 336 361 387 377 343 316 311 315 313 316 332 340 310 257 238 286 356 373 327 289 315 380 424 429 426 426 411 379 357 365 380 366 316 256 220 231 285
-211B85N5J3k4j8QMl0m2mM7O6N3K1j6n0n1k5mj4k8j9RL4N9P8O2jo4o8j9K7L2Ll3o1o5l8pR
$$ 285 340 353 329 311 319 323 293 251 247 294 360 413 434 418 368 317 292 288 274 246 227 236 270 329 407 469 468 404 336 317 344 376 379 346 285 220 182 175 184
-216A84K6O1Q1M0l9p0l1J3J1j5j1J9M5O0O7M4j3o5n8rK4J9MKmk9m9l2J8N3M3Mj7KK5K2%mP
$$ 184 210 271 352 392 353 283 252 265 276 261 250 269 314 374 441 485 472 407 349 340 364 383 387 389 385 356 307 275 293 346 389 393 376 378 403 425 425 421 428
-221D28Pqj6pj1k2qL2M5Rk2pK0lm7m6kJ9j1l7k7NL1N0M7jn5m4L1P9M4j8l7j8rkK2M0J1l6l3
$$ 428 435 427 411 404 393 371 363 395 440 449 427 420 440 437 390 344 342 361 350 313 286 291 322 372 419 418 363 319 350 429 473 455 418 400 391 389 411 451 462 426 393
-226C93J6L9jo0p5m5LM0N4L7om2m8k8lJ6K2J6J2K2M2M8K8j0m1m1j0K6K7ql7k7J2K8Ll1l4n
$$ 393 409 448 447 387 312 267 270 310 364 401 395 353 305 277 274 290 312 328 340 362 404 452 480 470 429 388 378 404 431 423 386 359 371 399 402 371 337 332
-230C32J8Ok5l5jM6N4J5k4k9j4k0l7l3pJ3J1MN%j4j3J8N8P4M1j6n5m7j4jk4m0j4K8L6J5J1
$$ 332 350 356 331 296 295 341 395 410 386 357 343 323 286 253 246 259 270 274 279 279 265 252 270 328 402 443 427 372 325 311 310 286 246 232 260 296 311 322
-235C22L5M3J5j4j2lj2j9jK5J8k4n6m4LM4M3Ml7m2k3rqQL4L2kk1%K0Lj9mK7K4qk5k4k8k7J0
$$ 322 357 400 415 401 389 386 374 355 354 379 397 373 317 273 276 320 363 367 330 288 265 256 248 256 290 322 320 299 299 319 322 303 299 326 350 342 317 293 265 238 248
-240B48O5P2K2j9qJ8Qk5m0k2QL3L8J2k7m4k6j3j7qK8M9J9k2j9J6K5jj9rjqj3JQLlJnj8rJ8
$$ 248 313 385 407 388 380 398 406 381 341 319 327 360 398 410 383 339 313 300 283 275 303 352 371 349 330 346 371 370 351 342 341 333 320 321 329 332 329 330 325 307 298 316
-245C16J8j9m1pL5K8j6l4j2Lqk2j9j0kJ8L6J4l6m9%N1L6k2n0k8J1L4M5L6Ll0k3J1K4kj9nN
$$ 316 334 315 274 267 302 330 314 280 268 271 263 241 222 212 210 228 264 278 242 193 193 244 280 258 208 180 191 225 270 306 309 279 256 267 291 289 270 265 270
-250B70j8l7rL7M3Mk3mK4K6J3NLj1k1mK0J9j2l2k2mj0k3qK9N0K8rl6m9m8k5K1N2M1Kk0k1k4
$$ 270 252 215 206 243 286 290 267 263 287 313 326 331 334 323 302 298 318 337 325 293 271 267 257 234 226 255 305 333 324 288 239 191 166 187 239 280 282 262 241 217
-255B17k2NL6K8j4l1%L0J8omJ0%k1k2rj4k1JM0N4L8L1L5J9j2j7QJ0k9n0j5L5K7k5n4l5qko
$$ 217 195 200 236 264 250 219 219 249 267 261 257 267 267 246 224 215 201 180 181 221 275 313 344 379 398 386 369 377 387 358 308 293 328 355 330 276 241 233 231 225
-260B25mkqnK1N0N2K9J9L5M0ln9n8PM8No4o7qL5L5L6M5J7n7r3m8J3J3k1qM5O1J7l8o1n4l3
$$ 225 221 219 211 206 227 277 329 358 377 412 452 449 390 332 339 387 392 328 261 253 288 323 359 404 421 364 271 223 236 249 228 220 265 326 343 305 244 190 157
-264A57PM5N3L0Pj1l8n7k9L3O2L1pnJ0mk5pL1M1J9Mnm0r1q6jP4N4k7n6jM9K2l8l8K3O3L6j6
$$ 157 164 209 262 292 299 288 250 193 164 197 259 290 283 278 288 284 259 252 283 324 343 347 342 302 211 125 124 198 252 225 169 168 217 239 201 163 186 249 285 269
-269B69l8k9j6oJ2K7K6J4QJ0J2J4Ml0o7n4J9Q3P0Pk8j5KKRK4J7j4k5lJl6o1k3L4L9kj5J7M3
$$ 269 231 202 186 180 192 219 245 259 267 277 289 303 307 277 210 156 175 258 328 335 307 292 294 296 305 329 346 332 307 304 305 269 208 185 219 258 256 241 258 301
-274C01K2j5j9kQLKol6p4o6nN7O2K0j5j6j0rKL4M4Nm6n0kM1M6K1j4n0n6j5M4N4J5j0K2N5K6
$$ 301 323 308 289 287 295 298 300 294 258 184 118 113 170 232 252 237 221 211 202 204 238 282 287 241 191 189 230 276 297 283 233 177 162 206 260 275 265 287 342 368
-279C68m1p1m6j4j0j6j3KJ6K7K6J3noJnj4%L4M5On0o4k7J9L6L2K6K2km1o2m5pK2L6M3M6L8
$$ 368 327 256 210 196 186 170 157 159 175 202 228 241 236 230 231 226 212 212 246 291 297 247 183 156 175 211 243 269 291 289 248 186 141 134 156 192 235 281 319
-284C19K8K4Pl9q2p0pM3L3pk2%L3M9L9Ok5k3RL3L0K1J1k1p3j00o6j2J4J7L1M8L1j3l7k0OJ3
$$ 319 347 371 378 339 257 187 180 223 256 249 227 227 260 309 348 354 329 306 315 348 378 399 410 389 316 216 150 138 152 169 200 248 279 266 229 209 215 228
-289B28Lj9l9l5J4P4Q8L9k7o4n9k3J4J8j1k6PN5N7J7j3k2m5q0p9j9M9Q0P6O4L3j7o1o8l7J2
$$ 228 231 212 173 138 152 226 314 353 326 262 203 180 194 212 201 175 182 237 294 311 298 276 231 151 72 53 102 182 258 322 355 338 277 209 172 184
-293A84N3N9K2j6lM8N9On7p0m4nL1M8J8l8m7ML5qo6n9qJ1jJ0M4M1qm6l3KK4L3K9Pj8pL2M6
$$ 184 237 296 318 302 299 347 406 412 355 285 241 236 267 315 333 295 248 252 287 279 213 154 146 157 156 166 210 251 243 197 164 166 190 223 252 259 241 234 266 312
-298C12J4k2k7j1opMK6M0L5J3k3m9m2j3Llj0lKqk0k2j6oNJ8K0J9L3M7K6k4m7k0J0Lj6oK3K7
$$ 312 326 304 277 266 260 253 257 283 323 358 371 348 299 257 244 247 244 234 231 233 225 205 183 167 161 166 184 204 223 256 303 329 305 258 238 248 251 235 229 252 279
-303B79J0lj0l5n2j7O0J00P0J8%jk3o1o9m1j9k8m4l2NM7P3O9L8lk3j5MJ8K8K4j4p1r7n7J7
$$ 279 289 286 276 241 189 172 232 332 402 420 420 419 396 335 266 225 206 178 134 102 107 154 227 296 334 331 308 293 297 315 343 367 353 282 185 128 145
-307A45N7M5K1Mj0k5j3K7M6Qn4p0k4L7N8K7k1m1j5K5L1PrPK1PpJ3L9K5j5k2J4L7J8pjJ5J2
$$ 145 202 247 268 272 262 237 224 251 297 305 251 181 157 194 252 279 258 217 202 227 258 265 256 263 284 291 284 297 336 361 346 324 338 375 393 386 385 400 412
-312D12pk5l6m5m1j7J1L0M1M1J6k6l8rK4J1l0m5j7J0Lk1k8j1RRqk3j8kONJ0L1N0M9L1Rpk6
$$ 412 405 380 344 299 258 241 252 282 323 364 380 354 316 307 331 342 312 267 250 260 263 242 214 203 212 221 213 190 172 170 176 181 191 222 272 321 352 361 354 328
-317C28m5n2l4NM7P1O8L8pn1o8m9qJ5Mj2kJ9Qk9m9l2j2j1j0J6M7L9nm2l5OL8L3J0NK6L3nn2
$$ 328 283 231 197 202 249 320 388 426 419 368 300 251 243 258 262 250 248 267 275 246 197 165 153 142 132 148 195 234 229 187 152 158 196 229 239 244 270 303 298 246
-322B46n3j7lk4l1%L1K8J3J3J3K%K4M0K7J4K5K1j7m4oM8L9k4n9m1j4KK8N3K9l3n7j5K9K3N
$$ 246 193 176 173 149 118 118 149 177 190 203 216 218 218 242 282 309 323 348 369 352 308 302 350 389 365 306 265 251 253 281 334 363 330 273 258 287 310 315
-327C15J5L1J8j0k3k1j8lK2J8j9l9mL2J6j7j0K4K1j4l1j6rk6k9oJ0LnQJ4kk0j1QJ6J2J1Mj5
$$ 315 330 361 379 369 346 325 307 304 326 344 325 286 282 314 330 313 303 327 348 334 303 287 278 252 223 217 227 230 225 233 247 245 225 214 222 238 250 261 265 250
-331B50k9j7K1M3K0k9n7l3K1M8L5J1J0J6Oj7k4j9j6j8lK1K8K2K5L5K1k3m5j7K9L1j1m7l9l
$$ 250 221 204 225 268 288 259 202 169 190 238 273 284 294 310 316 299 275 256 240 222 219 240 268 290 315 350 371 348 303 286 315 346 335 288 249 246
-336B46K5L0J5jn%jj5l2l5k1OK5J9j5m7m7j3J7J6MJ2L6M9L9J8jj9k7j7JJk2l7j9J5K9Qj7k4
$$ 246 271 301 316 315 310 310 309 294 262 227 206 212 237 256 241 194 147 134 151 167 171 183 219 268 307 325 324 305 278 261 262 263 241 204 185 200 229 237 220 196
-341A96k0k3k4MN9R0O1j1o3o1k7jKOK1L0J5j5k9j1K4L7K1nj2MJ5Kk1k7nK5L5K0LKjk1m8m4
$$ 196 176 153 129 133 192 282 343 332 269 208 181 180 182 188 209 239 254 239 210 199 223 260 281 276 264 268 283 285 264 237 232 257 292 312 315 317 316 295 247 203
-346B03LM6M5J0j7k1k4l0k1NJ6MnJ0K4Qk1j8J1K8J7MOQjolj5n0p2m4J5M5L2J4K5M2K6j2l0
$$ 203 206 252 297 307 290 269 245 215 194 199 215 219 214 224 248 256 235 217 228 256 273 277 283 291 290 284 281 266 216 144 100 115 160 192 206 231 273 299 287 257
-351B57oL5M7J9j8l1j4OMj0j4jQjj3qJ2J7%j9k0oKjnMK2K6Mk7l9k4jJ7L2M3L2ml4k2K0M9L3
$$ 257 251 286 333 352 334 303 289 295 299 289 275 274 282 281 268 260 272 289 289 270 250 244 246 245 240 244 266 292 296 269 230 206 205 222 254 297 329 325 291 269 289 338 371
-356C71mk7l0k2j6j7j7oJ4J9j0m9n7k8JLNL0N1L5jj5KK0K2J4jk2l5j9J2K1MKL0N5M1rm7n4
$$ 371 367 340 310 288 272 255 238 232 246 265 255 206 149 121 122 125 130 160 211 246 245 230 232 252 274 288 287 265 230 211 223 244 248 250 280 335 376 367 320 266
-361B66l9j4RK0Nj9k8kL1L6%l8l6KK6J1j4mK6K7nk9j7QK0J7Pj0k4j1K6M4K3rj6nLQJ0jk3k5
$$ 266 227 213 222 242 247 228 200 198 229 265 265 227 191 193 219 230 216 212 238 265 260 231 214 222 242 259 266 256 232 221 247 291 314 305 289 284 287 295 305 304 281 256
-366B56JK1Pj4rLnj2K4P2O1j5p6o8k6PL3O1O2J8l4m0rJ7J6Kj8l3j9K0M2J3l6l8J1M8K5l0n7
$$ 256 257 278 285 271 262 265 260 248 272 344 405 390 314 246 220 227 260 321 383 401 367 327 318 335 351 353 335 302 283 303 345 358 322 284 295 343 368 338 281
-371B81l2J5M4L7Qj3k0k2k7k6k1k4k4jM0N1Mn3n6j3J8RjQJ7PokKnpRK3J7Klj5m1n1j1M4N9
$$ 281 249 264 308 345 353 340 320 298 271 245 224 200 176 175 215 266 270 217 161 148 166 175 174 182 199 206 200 198 200 195 188 197 220 237 239 236 221 180 129 118 162 221
-376B21K7KMRoqJ2K5pn2o0k3J8L1K1PllQK0K3J5Jj5l0k4JK0J1nPL3K5k2n4k3L3N1K5JJLj8
$$ 221 248 250 254 263 257 249 261 286 279 227 167 144 162 193 214 221 218 215 223 243 266 281 282 267 237 213 214 234 245 240 247 280 305 283 229 206 239 290 315 316 317 320 302
-381C02m8o0l9PM8N4K4rj0POj4j0K0L7J1k2k0LRj0k3j7nknooLK4M1L5Qj8k2j6k2l7m9l2J4
$$ 302 254 194 155 162 210 264 288 279 269 276 282 268 258 278 315 326 304 284 287 296 286 263 246 241 239 234 228 222 225 249 290 325 333 315 293 277 255 218 169 137 151
-386A51N5N0%l6k2QPj9k0MJ3JMK5J9l3o7l9J3K2JKL2M4K6J5K8M2K9ll5n9n8j8L7N1Om5m6p
$$ 151 206 256 256 220 198 206 213 194 174 178 191 192 196 221 240 207 140 101 114 136 137 139 171 215 241 256 284 326 355 352 317 258 200 182 219 270 276 231 185 178
-391A78L0M1K9Kk6l0kL2L2kl1l1j2oj7k8j8J8N5O1L1j3l7k6NK2Rj5j1K4M6K5j3k0QK6J4%K
$$ 178 208 249 278 280 254 224 222 254 286 284 253 222 210 204 187 159 141 159 214 275 306 293 256 230 235 257 266 251 240 264 310 335 322 302 310 336 350 350 352
-396C52RQJ0J5Nk0l1k1k1m2m7rL2K7koK1K9Jk8l4k8k0jK1L2K8K7K9J9nk1k3k7l8m3l5k0kK4
$$ 352 361 369 379 394 399 379 348 327 306 264 217 208 240 267 265 259 280 309 310 282 248 220 200 199 220 252 280 307 336 355 350 329 306 279 241 198 163 143 141 165
-401A65L2Rj4RN7O1J1k9k2nj2j9lkl0l6J9Q0O2pl8nK4Rj2j1rk1k8j3LJ2L4O7O6J0m8n3k1p
$$ 165 197 206 192 201 258 319 330 301 279 274 262 243 240 238 208 172 191 271 333 326 288 283 307 316 304 293 284 263 235 222 225 237 271 338 404 414 366 313 292 285
-405B85j7k1LK3J6pk0j4kLRJ7J3j6m7l9J2M9K2m0o6k5L6O3N0J8j4m0l7lL6M4J7j4j7PK2Ll3
$$ 285 268 247 250 273 289 282 262 248 246 249 258 275 288 272 225 186 198 247 269 229 163 138 174 237 287 305 291 251 214 211 247 291 308 294 277 284 306 309 276
-410B76l7lK2lm4m9j7koPM9O8M2Mopk4l8k2OJ2qk1j5LL0N3M6Kl6l5nJ7J6QkqNL6M7Rm2m4M
$$ 276 239 236 258 255 211 162 145 143 137 144 193 261 303 307 301 294 270 232 210 216 228 220 199 184 187 217 270 316 318 282 247 242 259 275 283 281 273 278 314 361 370 328 284 288
-416B88M2L3jk8m3n2m4j7ROj5k2KL3K9j4n1l4K1M5J5j8mL6M5J3j6k8k4nK2L0nm1k6J8L1Mj1
$$ 288 330 363 362 334 291 239 195 178 187 193 178 156 158 191 220 206 155 121 142 187 202 184 180 216 261 274 258 230 206 201 223 253 248 207 181 199 230 234 223
-420B23LJ1kkK3K8ml1k5plPL1M3K9J2Rol9m6j4Pj0k3MK9Ml0j4K4K1oNM1L5j5l2%K0nk1J1M0
$$ 223 226 237 235 233 256 284 280 249 224 217 214 221 252 295 324 336 345 339 300 254 240 247 237 214 218 247 251 221 207 231 252 246 251 292 327 312 280 280 300 295 274 285 325
-426C25Pn7p8l6K5M9L1j0l3k9j7k0k1KL3L3J8K3L9J4m0n1jL5jn2l7L1O3L6lj3m%Jjpj2j0p
$$ 325 332 275 197 161 186 235 266 256 223 194 177 157 136 138 171 204 222 245 284 298 258 207 206 241 240 188 151 182 245 281 278 265 261 261 262 261 254 242 232 225
-430B25j2j5j0%JOK0L0J8qk5k2mJ9L0J8ljK0J6k1m3j7J7J6MK2M2J3l9m4LK9Nk1j5lmRL9M0
$$ 225 213 198 188 188 189 195 215 245 263 255 230 208 204 223 253 271 268 267 287 303 282 239 222 239 255 259 281 323 336 297 253 256 285 290 269 254 251 247 256 295 335
-435C35rn4n4l7l8l0J5N3L0j6j2K9L5j0m6l0JJ3J4K1J7qk7j5J0J9J7K2K3Nk0k6k1l5n4l4K7
$$ 335 326 272 218 181 143 113 128 181 211 195 183 212 247 237 191 161 162 175 189 210 227 219 192 177 187 206 223 245 268 273 253 227 206 171 117 83 110
-440A10O5L0l0l6K1O7N0ml7l9k7pK1K5j6o5n6J2P2Q2O1L4on1n1J1P1N9%k3QL3J3j7k5k3l0
$$ 110 175 205 175 139 160 227 277 273 236 197 170 163 184 209 193 128 72 84 156 238 299 333 327 276 225 236 307 366 366 343 351 384 397 380 355 332 302
-445C02l0j3lk1m2k8QL1K5Pkmjnk3m0l2kPj7k9K1R0R2J7m7l4K5N1K9Jrk1l5k1J9M0Ql9m6j4
$$ 302 272 259 256 235 193 165 173 204 229 236 234 230 229 224 201 161 129 127 134 117 88 109 199 291 308 261 227 252 303 332 333 324 303 268 247 266 306 314 275 229 215
-450B15J7K9L7M2J8k9n5l5n%lPJ6ml5k8K1O0M5om9n3k3K3N1L9Lk3k3nJ0J8J3%pQK0lm6m7N
$$ 215 232 261 298 340 358 329 274 239 234 234 231 238 254 250 215 187 208 268 313 307 258 205 182 205 256 295 298 275 252 247 257 275 288 288 281 289 309 306 260 213 218
-455B18M9K9k4m6j8J3K4K1K0Rj5m0m7k4RK7J6nnJ2J4pj9rnk3k6J4N6L6j9l9j2RmpJ5K1j5m0
$$ 218 267 296 272 226 208 221 245 266 286 295 280 240 193 169 178 205 221 216 211 223 237 230 211 202 197 174 148 162 218 254 235 196 184 193 189 182 197 218 203 163
-459A63JP3R0L1l5m8k2j6m6o6k8M9Q8M6k8n3j2K4J0j9j2K1L0jl1k6LK8L4L3L2K6Ll0m4k9n
$$ 163 164 237 327 358 323 275 253 237 191 125 97 146 234 280 252 199 187 211 221 202 190 211 241 240 209 183 186 214 248 281 313 339 342 312 268 239 234
-464B34kj1nJ1J1pj3%jk6l4mK7J8j0j0J3J8nk3j8oNK4M5M1J6rk2l8n3n2l2k2j9KM4O8M4Nl
$$ 234 232 221 216 227 238 231 218 218 217 191 157 153 180 198 188 178 191 209 204 181 163 157 162 186 231 272 288 279 257 219 166 114 82 60 41 43 87 155 199 204 201
-469B01J6K8K1Oj7n0p3n2kK7J5OK6M2J2l5l7QL5J7lJ4L1po8p1qM8M3J2jJl%K8N7M6jm2n2l1
$$ 201 217 245 266 272 255 205 132 80 78 105 120 126 152 194 206 171 134 142 177 194 191 205 236 229 161 90 82 130 173 185 184 185 182 182 210 267 313 312 270 218 187
-474A87J2N7O0J0l8l2J2L1J5kj1k9n0m3mJ8Jj5KK4K4P%pk7m0k2J4K9J6lrLJ6K6K4J8J0kj8
$$ 187 199 256 316 326 288 256 268 299 314 312 301 272 222 179 175 193 194 179 181 205 229 236 236 229 202 162 140 154 183 199 196 187 190 206 232 256 274 284 282 264
-479B64l7m7n3m8oP5J39J09J0n6l2J4Ql0l2NK1j0m9n5k9PL2L1Kk2j8OJ6RQJ2Mj6k3pJ6L0L3
$$ 264 227 180 127 79 73 148 287 396 406 350 318 332 340 310 278 283 304 294 245 190 161 168 200 231 233 211 193 199 215 224 232 244 248 232 209 202 218 248 281
-484B81K5Kk7m1l2rOlk9m7k9OJ5j2k4PM4L7J0J2K5%m8m8QM1Lm2l1J7M2M0M1M4J8k1l2j3nj3
$$ 281 306 308 281 240 208 199 205 202 173 126 97 103 118 106 82 89 133 170 180 192 217 217 169 121 129 170 173 131 100 117 159 199 240 284 302 281 249 236 231 218
-489B18rJ6K7Mk4k1NJ3kj0J5M5L7rm1k6J0J3j5l4j9MK0L4M7L5ml7l8k3j5jK5L1on1m5J3N9
$$ 218 209 225 252 256 232 211 216 229 227 217 232 277 314 305 264 238 248 261 246 212 193 197 217 251 298 333 329 292 254 231 216 215 240 271 265 214 169 182 241
-493B41N1Rk5l4k9j9j1qoJJ4J9J9J6J0lj1%J7J3npJ7K9Mk8k6NJ8ok8j4J6K0rl5k7%K2L3L2
$$ 241 292 301 276 242 213 194 183 175 169 170 184 203 222 238 248 245 234 234 251 264 259 252 269 298 302 274 248 253 271 265 237 223 239 259 250 215 188 188 210 243 275
-498B75J5j9l9j7K6M1J5k3l9l3j5QK6K0jjK7L9Mm1m4j1KqlL7P0N2on2n2pM7O6L1k4m9l3j6
$$ 275 290 271 232 215 241 282 297 274 235 202 187 195 221 241 240 239 266 305 309 268 224 213 215 207 204 241 311 363 357 305 253 246 293 359 390 366 317 284 268
-503B68k0j8J2M2L0k0n3m0qNqk0lL2N2L7Rrk0l9n3j9M9Q4M0l7n8rL6J4m6o7k2L7N4K7kj0n
$$ 268 248 230 242 284 314 294 241 201 193 198 190 170 167 199 251 288 297 288 268 229 176 157 206 290 330 293 235 226 262 276 230 163 141 178 232 259 257 247 242
-508B42lkKNj0l5m8m3l4k7j6PL5N1N3L9J3k5n1m4nL0L6J8J0J8K1Jk2k0lJj4k2rNNJ1L8N0J8
$$ 242 239 237 239 244 234 199 151 108 74 47 31 38 73 124 177 216 229 204 153 109 104 134 170 188 198 216 237 238 216 196 193 194 180 158 149 154 159 170 208 258 276
-513B76l3l8RN1L9nl8m7l7j1K4L0lm2m8k9j4kK6N7N5J9oKJ2lk8l0j8j5j1J6N1N0Lm0l2J0L5
$$ 276 243 205 214 265 304 299 261 214 177 166 190 220 217 175 127 98 84 82 108 165 220 239 233 235 247 244 216 186 168 153 142 158 209 259 262 222 190 200 235
-518B35J9j2k5k4k5k8k2nK0M5O0N2J6j8k1KJ2j5m7m2pJ6Mk2k6%K8L6K6J0mj7l1l2j0K8O0N4
$$ 235 254 242 217 193 168 140 118 113 133 178 238 290 306 288 267 269 281 266 219 177 170 186 190 168 142 142 170 206 232 242 238 221 190 158 148 176 236 290
-522B90J2l5m6l1k5m5n1j6L2L4KQO9J06N0m2o4mN1L5j1l2k6j9pK5N6N4J8j6k7k2j2JJ6K2J9
$$ 290 302 267 221 190 165 120 69 53 85 119 121 129 198 304 354 312 248 244 295 330 319 287 261 242 235 260 316 370 388 372 345 323 311 312 328 350 369
-527C69Lj8l2m2n6p2n6MO6P4L2NJ4J4k9o4l9J5L0Kj3J1M0M0J7rk3j2K1N4N5K3j9n4p1n4oL3
$$ 369 372 354 322 280 224 152 96 100 166 240 272 277 291 305 276 212 173 188 218 220 207 218 258 298 315 306 283 271 292 346 401 424 405 351 280 226 220 253
-531B53K0j9k4QK7Oj4mJ0MnNJ4pm0m7j4L4O0M4ll8k4J9L2%k8j2J3Lk9k8QL7L1J1mj6k2j0K1
$$ 253 273 254 230 238 265 271 257 253 263 267 262 267 281 274 234 187 173 207 267 311 308 270 246 265 297 297 269 257 270 273 244 216 224 261 292 303 299 283 261 251 272
-536B72L3Ol6m6j4K9L6Ml2l7j7mqj5j4k2m4n1k2K1L3J4qlK1M9O0M5Ol0l5j5PJ6J5Rlj9k9k2
$$ 272 305 311 275 229 215 244 280 284 252 215 198 194 186 171 157 135 91 40 18 39 72 86 78 75 96 145 205 250 256 226 191 176 183 199 214 223 220 201 172 150
-541A50J0N7Q5O1Jl9k7PJ6j0l9m7k5J7N0L5k2o1l3K7N1K5%QL2L6J5k4n4m6jL1Ql4l4pj3m9
$$ 150 160 217 302 363 364 325 298 305 321 311 272 225 200 217 267 302 280 219 186 213 264 289 289 297 329 365 380 356 302 256 255 286 294 260 226 219 206 157
-546A57m4K3Q0O6J6rj5k4k8pRj1m2l5%J5NJJ3J3kj2qllKPMOJ9L0K4K0L1L0j3n8m7J1L5Pk4
$$ 157 113 136 216 282 298 289 274 250 222 215 224 213 171 136 136 151 156 157 170 183 181 169 161 158 155 157 164 168 174 193 223 247 267 298 328 315 257 210 221 256 263 239
-551B39k3k1l2k6J0K6nl2jN2N3Ok4j7oj4j3OK3K2J7J6km1o7l8K4O0L0l1o2l7OL0K7K1J8Mk3
$$ 239 216 195 163 137 147 173 168 136 135 187 240 246 222 205 199 185 172 178 201 223 240 256 254 213 146 108 132 192 222 191 129 92 98 128 155 176 194 198 175
-556A75l9k9rLJ0J7J7RJ4L7M4J7j6k0%Mj0k2j7j4j1KJ7J3oj2kMLJ2L2L2Q%K8N2K8l0p0o6l8
$$ 175 136 107 98 101 111 128 145 154 168 205 249 266 250 230 230 234 224 202 185 171 160 162 179 192 186 174 172 176 179 191 223 255 263 263 291 343 371 341 271 205 167
-561A67qK0M1M5K0k2o3p2l6J9M2J8j3kL8M9jo1o3J1R6J11L7n3q1m5qpqJ5L7J6k5l5oJ5Kj3
$$ 167 159 179 220 265 285 263 200 128 92 111 153 171 158 156 194 243 242 181 118 129 225 336 373 320 239 194 186 179 171 186 223 239 214 179 173 188 190 177
-566A77nJ1Qrj7j2njQK5K7Jl6l9KM6L6j3l8j0J8km2m1LM0M6L6K8J4JMJ2Oj3j6%Kj3j6OJ9l
$$ 177 172 183 191 182 165 153 148 147 155 180 207 208 172 133 135 181 217 204 166 156 174 172 130 89 92 132 178 214 242 256 257 261 273 279 266 250 250 252 239 223 229 248 245
-571B45m3o4m4JL9L7nl1LN6M5k3n6j2L0J2k0lL3K0k0j2L3M2Kl1k0kKK1M3K3m1o9j8M1L5m%
$$ 245 202 138 94 95 134 171 166 135 138 194 239 216 160 148 178 190 170 167 200 220 200 188 221 263 265 234 214 212 214 235 278 301 260 191 173 214 249 245 245
-576B45L7L3k8o0j3M9L2n2r6l8N4P5J5l6j8K8K8j5l4mM1N9M7J8k0n1n2l1j8k3k1kJ4J1OJ5
$$ 245 282 315 287 227 214 263 295 243 147 109 163 238 253 217 199 227 255 240 206 202 243 302 349 367 347 296 244 213 195 172 151 149 163 174 180 195
-580A95J9J2MOLqlJ8K6Oj2kQj2l4j2L1L7Kk1j1Jj1k1lK3K4ol8m5k0K0L3Nl0k4K1M7K3j7j9
$$ 195 214 226 230 236 239 231 228 246 272 278 266 264 272 260 226 214 245 282 284 263 252 253 242 221 218 241 265 259 221 176 156 176 209 214 184 160 181 228 251 234 215
-585B15J4L6K1j2l7n0m9k4K1N2L8mk1%K1Qj7j1K1L1J7J6L8M3J2k2k8k8m1m5rL3L5Q%Rjl1m3
$$ 215 229 265 286 274 237 187 138 114 135 187 225 221 200 200 221 229 212 201 222 253 270 286 324 367 379 357 329 301 260 215 206 239 274 282 282 291 290 259 216
-590B16k7j2j4mK7M2K3JJ0K8J1l2n8l2K1N8N0Km4n6l4lJ5K5K1QkQK1J1j1j0J5K6Kk4k4j5j9
$$ 216 189 177 163 159 186 228 251 252 262 290 301 269 211 179 200 258 308 310 266 210 176 173 188 213 234 242 240 248 269 280 269 259 274 300 302 278 254 239 220
-595B20k8k1rKJ6L6L8J8lolj1j6j0lpmJ3J8ql5k2J4K3qm4m8j8L1O1M1j3m1j6J9K3J5K7L3L
$$ 220 192 171 162 164 180 216 254 272 269 263 260 249 233 223 220 213 209 222 240 232 197 175 189 212 204 160 112 94 125 186 227 214 173 157 176 199 214 241 274 277
-599B77k9j3K0Lm3l4K7M4j6o8m3J6L6K7L4L9Pm1m8j5OkrlJ1K8M3L9Km0l6NL1Pk8l0PM0L8J
$$ 277 248 235 255 258 215 181 208 252 236 168 125 141 177 204 238 277 284 243 195 180 186 184 175 172 183 211 254 293 295 255 219 224 255 262 234 204 211 251 289 290
-604B90m1n7l7mK2K9K0Lj4k0j2KJ9K9K1rk3QN8O2J0m1m9m2m3k0M1P5L1l9m2J4L2j6n6l1K6
$$ 290 249 192 155 151 173 202 222 225 211 191 179 181 200 229 250 241 218 226 284 346 356 315 266 224 181 161 202 277 308 269 227 241 273 257 201 170 196
-609A96M5K8J6K0K8K2pn5q9o5NN8M9Jl9m1j2K8M4J5k9m0j0J9K0J0Nj1l9l8QN1L7ok1KK4K4
$$ 196 241 269 285 305 333 355 348 293 204 139 144 202 251 252 213 172 160 188 232 247 218 178 168 187 207 217 222 211 172 134 142 193 230 224 203 205 229 253
-614B53J0j5m3m9j6K0J6j4j4K3M8K6j1k0nQ%k0l6k6J0M0L3jk3j3J2L5M5K8k0o2n0KL8L0J1
$$ 253 263 248 205 156 140 160 176 162 148 171 219 245 234 214 209 217 217 197 161 135 145 185 218 217 194 181 193 228 273 301 281 219 169 171 209 239 250
-618B50J6L0K6Rkoj3j6qkj1k5j9KJ3Qjlpk3l9l5pK1J8pj5J1L7K4mjK9K9j3m5l1qqnL3O5M3
$$ 250 266 296 322 331 329 323 310 294 286 284 273 248 229 231 244 252 251 248 241 218 179 144 137 158 176 169 154 165 202 226 222 221 250 279 266 221 190 182 174 169 202 267 310
-623C10ok1%%l2m6j6Pj9n8n0QN7N4J3j6j1P%k8l4jL6L9K6L1L2j7q0p8%N5K6k9k9O%m0m1K2
$$ 310 304 283 283 283 251 205 189 196 177 119 69 77 134 188 201 185 174 181 181 153 119 118 154 193 219 250 282 265 185 107 107 162 188 159 130 136 136 96 55 77
-628G7P2N7J1p%jj5j6jLj6l1k1J0L8M9L6Pj6j3RJ3j5l5rM1M8mn8o3l6k4j1L6R8J02L1l8l8
$$ 77 149 206 217 210 210 209 194 178 177 180 164 133 112 122 160 209 245 252 236 223 232 245 230 195 186 227 275 271 213 150 114 90 79 115 213 315 346 308 270
-633B70OL1K1Nj1l7o1m6LL9K9jj2%J8K3Rj9l8l4j5KQJ6J8Kj8j4QJ4oj9j0mj6rL4N6Lp7q0O
$$ 270 276 307 328 333 322 285 224 178 181 220 249 248 236 236 254 277 286 267 229 195 180 182 190 206 224 226 208 194 202 216 210 191 181 177 161 152 186 242 245 168 88 94
-638I4Q5Q2K3k2l3l4k7jL1M1K4Nqj7k6k1oRJ9K0Pj6k5j4Joj5JL1L4Oj5j1qk9m3k0K3L8J6j4
$$ 94 179 261 284 262 229 195 168 167 198 239 263 268 260 243 217 196 190 199 218 238 245 229 204 190 191 185 170 171 202 236 242 227 216 208 179 136 116 139 177 193 179
-643A79k8j5J7M8N1J8k3m7m7l5j3NPJ1M0P5N7j9n9kP6N9l4o8%P0M5l1o6m9k4j0J1K5Rk8m1
$$ 179 151 136 153 201 252 270 247 200 153 118 105 110 117 128 168 243 300 281 222 220 296 355 321 253 253 323 368 337 271 222 198 188 199 224 233 205 164
-648A64k5kRJ4J5J7K6L2J9oj2K0N5N4K3pk8l5j9Lmm0n5k5Lj3l1JM2K0l9m0K4N5J0m4k9K5M3
$$ 164 139 137 146 160 175 192 218 250 269 263 251 271 326 380 403 396 368 333 314 317 313 273 218 193 196 183 152 153 195 215 176 136 160 215 225 181 152 177 220
-652B20J1k7k9QN0M9nm9l1J2Mm4l7L2O5K1j8K0O8L8l1l9QK8NnQjm5p3n0qK0K9J9j6m4k6J8
$$ 220 231 204 175 183 233 282 277 228 197 209 213 169 132 164 229 250 232 252 320 358 327 288 296 324 329 324 332 331 286 213 163 155 175 204 223 207 163 137 155
-657A55L2J2J1M2N1Nm3l9jPk0m0k5MJ1qk5nM5O7K3m3n2LM0J1l2j9K7L8j0n4m3NL3K6J2J3J3
$$ 155 187 199 210 252 303 308 265 226 225 232 212 172 147 151 162 154 129 124 169 236 259 216 164 167 207 218 186 167 194 232 222 168 125 130 163 189 201 214 227
-662B27j4m9m7%M3L6Q%J0%k6k5QK5Kk1qJ6K1J4J3J3Mpmjj0j8pRJj6j5LJ2%j0%K4M2L9J5j8
$$ 227 213 164 117 117 160 196 204 204 214 214 188 163 171 196 198 177 169 185 206 220 233 246 250 243 239 238 228 210 203 212 213 197 182 185 197 197 187 187 211 253 292 307 289
-667B89m0m0k3jJ3J3KmPJ2j5n4n9j4L2M1J8j1k5k0RL9L3kk0JK1RlJ1K6jl5k6J4K4j2m4l7p
$$ 289 249 209 186 185 198 211 213 209 216 228 213 159 100 86 118 159 177 166 141 121 130 169 202 200 180 181 202 211 208 219 245 244 209 183 197 221 209 165 128 121
-672A21J8K6J1k1m2k3J3L4L9N0N4K6j4k1pk1n7n5lL8L7L1L1Ln3o7mO0N2Oj3oj7l2j7Nj2m3
$$ 121 139 165 176 155 113 90 103 137 176 226 280 306 292 271 264 243 186 131 128 166 203 234 265 268 215 148 144 204 256 262 249 243 226 194 177 182 170 127
-677A27k8K2L8Rj4j3k3n1m7OM9M1J2RK2J7lj1NL0L6J0k6k7J7M0j9j04r9mN6Lo4l0P0J12O1
$$ 127 99 121 159 168 154 141 118 67 20 26 75 116 128 137 159 176 173 162 167 197 233 243 217 190 207 247 228 124 25 21 77 80 16 -14 56 168 229
-681B29mj7jJ0J6J4j2l9k4K0L6km0l3p%nnj1l5m8k1K6M9M1K3%l4n3k2M8R0P0K3OK2K2j6n2
$$ 229 225 208 207 217 233 247 235 196 172 192 228 226 186 153 146 146 141 136 125 90 42 21 47 96 137 160 160 126 73 51 99 189 259 282 288 310 332 316 264
-686B64m0kPl0n3k3K6K7j0j2L9P8N4qm8m9l6j7PJ6Rknk2n6n9mN4N2J1NM2N3J8j3oMj6m1l1
$$ 264 224 222 229 199 146 123 149 176 166 154 193 271 325 317 269 220 184 167 174 190 199 197 192 170 114 55 51 105 157 168 173 215 268 286 273 267 271 255 214 183
-691A83mJ1J0O%j2j4nnj9j5J5L2J3j2JL3M0K2Lj0l3m6k6K0N1M7J2l9r0j01n0K8O5M7J7J3L6
$$ 183 179 190 200 206 206 194 180 175 170 151 136 151 183 196 184 185 218 258 280 283 273 240 194 168 188 239 286 298 259 169 68 18 46 111 158 175 188 224
-696B24N7N1K1j6l2j8mpj1mrl9n7k8J5K1NK5O8O8Om5l7nLj1j9k1k1j0J1J3mlK9M4J4j3PL8
$$ 224 281 332 353 337 305 287 283 276 265 261 252 213 156 128 143 164 169 194 262 330 336 291 254 249 252 241 222 201 180 170 181 194 190 187 216 260 274 261 268 306
-700C06K1l0n0k9j2j2KK7K2k4n2k5K0K1j8l6qK4J4k0k9LK9J7j1j1J0Pk6l7%M4M4J2lPQj9l4
$$ 306 327 297 247 218 206 194 196 223 245 221 169 144 164 185 167 131 123 147 161 141 112 115 144 161 150 139 149 156 130 93 93 137 181 193 190 197 205 186 152
-705A52mN3Q3N3j1n6n2j9RJ9K9M0L4Ok1k9k2j9j6j8k4k8j5PPrrJ7L4J8qj2pj2j0NPk1l1J6
$$ 152 148 201 284 337 326 270 218 199 208 227 256 296 330 336 315 286 264 245 229 211 187 159 144 151 158 149 140 157 191 209 201 189 182 170 160 165 172 151 120 136
-710A36O5M0l1m8J1N6K9j8j5J6J8qj7kJk1l6j4K7M3J7k9n2k6K3N2M5K2R%j8l1k6pPQMQJ3J2
$$ 136 201 241 210 162 173 229 258 240 225 241 259 251 234 232 233 212 176 162 189 232 249 220 168 142 165 217 262 284 293 293 275 244 218 211 218 226 230 238 251 263
-715B63%j5j7mJ8L0J7j8n3n5j4L1L1ok0QK8jl1j0L1J7m5o4rM8M0%j3OK1K2K5K6J1j5l1k8j1
$$ 263 263 248 231 227 245 275 292 274 221 166 152 183 214 208 188 196 224 223 192 182 213 230 185 121 112 160 200 200 187 193 214 236 261 287 298 283 252 224 213
-720B13Kol4m7j5L9N9M0J5%l1o7n3K6R3P9J8k1k7l0l4j9RJ6QJ5L3L2Kl0m8n3m3j8MRJ3K9L9
$$ 213 215 209 175 128 113 152 211 251 266 266 235 168 115 141 234 313 331 310 283 253 219 200 209 225 233 248 281 313 315 285 237 184 141 123 127 136 149 178 217
-725B17J4k6l8j4J3K2J6Jk1k4NM1M0Qk2l0k7j2K3N1L5qk5jJ7jk7l6l5l6k3J0L8L5J9J6L1M0
$$ 217 231 205 167 153 166 188 204 205 184 160 165 206 246 254 232 202 175 163 186 237 272 264 239 238 255 254 227 191 156 120 97 107 145 180 199 215 246 286
-729B86K7j5o0o6k3K4K7%r%j5m5m3mQk2k4L5Q6N2k1m4j5%k2j9K3N3K3k6m1j6Llk3k8qK3M3
$$ 286 313 298 238 172 149 173 200 200 191 191 176 131 88 84 92 70 46 81 167 219 198 154 139 139 117 98 121 174 197 171 130 114 117 114 91 63 55 78 121
-734A21L5Pj4j6kJ8L2K8Jk4j9PK0jl1l9k3qKK8P1Q9M7k3m8j5J4j8p0o0J0N7L7npJ5J7qk5j8
$$ 121 156 163 149 133 131 149 181 209 210 186 167 174 194 193 162 123 100 92 94 122 193 282 329 306 258 243 257 239 169 109 119 176 213 208 201 216 233 225 200 182
-739A82lMOPJ2K1K5Kl9n7k6K3M4L5K6J5k1o8p0pO1O4J1k7rL5M5Nm4n5k1J5K3Oj0j7l2n5o7
$$ 182 179 183 189 196 208 229 254 256 217 160 134 157 201 236 262 277 256 188 118 111 172 236 247 220 211 246 291 296 252 197 176 191 214 220 210 193 161 106 39
-744C9m6jM2O2N6L9K3J3N%lmqj7k5k9l0l3k8qK4M5L3rm3l2J8N7N4L0J8J9Mk1k0NJ9Nj4j8j6
$$ 39 -7 -8 34 96 152 191 214 227 232 232 229 225 217 200 175 146 116 83 55 47 71 116 149 140 97 65 83 140 194 224 242 261 265 244 224 229 248 253 239 221 205
-749B05k0rJ3K0Jj3mnl7n5j3M4M2j7l9J3P1N8j2o1n0j3Lrj9qJ1J5J4L0M6L1j2l1jL7L4Pnk
$$ 205 185 176 189 209 210 197 193 188 151 96 83 127 169 152 113 126 197 255 243 182 132 119 122 113 94 86 97 112 126 156 202 233 221 190 189 226 260 267 262 260
-754B60nqMNk4n4m0oql4k8J3L6K8L6O7O6J2k7nL4K1k9m7k2PQpk1k5j4jpl3m3j7K7N4O0M1k
$$ 260 255 247 251 256 232 178 138 132 124 90 62 75 111 139 175 242 308 320 293 288 322 343 314 267 245 252 260 253 232 207 193 192 185 152 109 92 119 173 233 274 272
-759B72n0o0k2J4J3qj6j9k2qK6L5jk7%M2K7k3l7ML8K5ql2l5j3K9M9J3m4n4j3K5L8N5P2M5k5
$$ 272 222 162 140 154 167 159 143 124 102 94 120 155 154 127 127 169 196 173 136 140 178 203 195 163 128 115 144 193 206 162 108 95 120 158 213 285 330 305
-763C05o7l9RK3J3K3L5J4k9m5k0J4K1Lk0l0j8koj5lK4K3k0n6l8PL5L6L6K7qm6l9J5N8M7Nk2
$$ 305 238 199 208 231 244 267 302 316 287 242 222 236 257 260 240 210 192 190 184 169 166 190 213 193 137 99 106 141 177 213 240 232 186 147 162 220 267 272 250
-768B50j6%ol4n9m7lK4Ok4j6K0L5Ok4j9J3L2K0kj3kK1L0J4rj3mmk3l3j5RJ7RJ3L5N3M4J6j0
$$ 250 234 234 228 194 135 88 85 109 115 91 75 95 130 136 112 93 106 138 158 156 143 141 162 192 206 197 184 180 176 153 120 105 114 131 140 153 188 241 285 301 291
-773B91k2k2j2J2M6O1L1l3q0p4k6K2L9J6l1o2m6J0N2M1Kk4k7k8l1qL5O4O1M1K6Qj5k0m%k8
$$ 291 269 247 235 247 293 354 385 352 272 198 172 194 233 249 218 156 110 120 172 213 215 191 164 136 105 97 132 196 257 298 324 332 317 297 293 293 265
-777B65n4l9NK3nl9m0kL3L1ol2j5L1M7J7j5j4jj0k4nK9L2lk4rJ2J3J1J6J2oj7pRJ7K7M3L8
$$ 265 211 172 177 200 195 156 116 114 147 178 172 140 125 156 203 220 205 191 190 180 156 151 180 212 209 185 176 188 201 212 228 240 234 217 210 219 236 263 306 344
-782C44Ok2k2j0j3j4%km1p8o0jM2M8M7M1K3KNK0Ml8n5k9mnj4pKJQK2J8LJ0L4K2l8o5j7M2K6
$$ 344 350 328 306 296 283 269 269 267 226 148 88 87 129 177 224 265 288 290 295 315 319 281 226 197 193 188 174 167 169 170 178 200 218 221 231 265 287 249 184 167 209 235
-787B35l0l8LJ6j9m2j5K2K3%j5j7qK0M3K6k4n0k2QLj2RM2L1k0m8j6L0L6Qj3pPKnQL4L1j0m9
$$ 235 205 167 170 186 167 125 110 132 155 155 140 123 115 135 178 204 180 130 108 116 119 107 116 158 189 169 121 105 135 171 179 166 159 166 168 163 171 205 236 226 177
-793A77l8QM2L5Qk1m7o1m6mK9L4K2Qqk6k7rJ0K3M1M6Pn7q0k6M0L7j5l3PN3M8J3j1j9k1j5J1
$$ 177 139 147 189 224 232 211 164 103 57 53 82 116 138 146 138 112 85 76 86 109 150 196 203 146 66 40 80 117 102 69 76 129 177 190 179 160 139 124 135
-797A35M3N2K5j2k9j7RL0L7K5nm4p1n4qL0K4lj2J2L9L4om5n0j8J3Pk8l8oM0N5K6j8m6l7KM4
$$ 135 178 230 255 243 214 197 206 236 273 298 293 249 178 124 116 146 170 167 155 167 206 240 234 189 139 121 134 141 113 75 69 109 164 190 172 126 89 91 135
-802A35M5J0j6%L8N4L9J1pj2lJk4o2o1lN2M2jLN1O8J4n3o5k9OJ3KoMK8L4Jm2m4j1pn1p1j3
$$ 135 180 190 174 174 212 266 305 316 309 297 294 295 271 209 148 145 197 239 238 241 292 360 374 321 256 227 233 246 248 242 246 274 308 309 267 223 212 205 154 83 70
-807G0P3R9N0j5m5m2j9QJ8J0OJ4J3j4l4j1K8L1mk6j3Knk0k3k5l1j4L1N9M1%j7%K3L3L2J5k0
$$ 70 143 242 292 277 232 190 171 179 197 207 213 227 240 226 192 181 209 240 236 210 197 199 194 174 151 126 95 81 112 171 212 212 195 195 218 251 283 298 278
-812B78m3l4qlj5kL9O2L2k4n5m8l1j5J0L6L5Kl3l3jL8N8N1J0n3j00r5m3J1L8L5K2J3J1K5M3
$$ 278 235 201 193 190 175 173 212 274 306 282 227 179 148 133 143 179 214 216 183 150 149 187 245 296 306 253 153 58 15 26 64 99 121 134 145 170 213
-816B13M6K4oj4jJ1Kj9l0k1%J4J2%n%%j4l8n1l6%L3M6L7K1J4Nj7m6m8rL8M3Nk2kL7L9Jl2l1
$$ 213 259 283 277 263 262 273 275 256 226 205 205 219 231 231 226 226 226 212 174 123 87 87 120 166 203 224 238 243 226 180 132 123 161 204 209 187 185 222 261 262 230 199
-821A99j1OK4M5L8j1o6o0MN4L4k6n6m2qJ4L0M1L2%l4m2k2LJ8K3K5L3L0Mk7k7ML4K7jj9j8k
$$ 199 188 194 218 263 301 290 224 164 168 222 256 230 174 132 124 138 168 209 241 241 207 165 143 146 164 187 212 245 275 279 252 225 229 263 290 289 270 252 250
-826B50J6K0om4l6K9P1K0o6o9RM9ln7k9K7K1l4n4l0k0l0qL9M0k4p3l8L1N7K6LK1M6L5ol7l7
$$ 250 266 286 280 236 200 229 300 320 254 185 194 243 240 183 154 181 202 168 114 84 64 34 26 65 105 81 8 -30 1 58 84 87 108 154 189 183 146 109
-831A09j5PJ5J2Nj0k7l6j9K1N4N8K7j9m5l7j0J2K1L1M6M5J7j7k6j1J0K6L4K2pl1k5lJj5k1
$$ 109 94 101 116 128 133 123 96 60 41 62 116 174 201 182 137 100 90 102 123 154 200 245 262 245 219 208 218 244 278 300 293 262 237 234 235 220 199
-835A99qjj5k8j5J5L5L6K0lk6m3m9m3j6K1M7M9L8K3jl0l7j2J0pm3l7K1P1N6%m3m7k6qjLK1
$$ 199 191 190 175 147 132 147 182 218 238 235 209 166 117 74 58 79 126 175 213 236 235 205 168 156 166 159 116 79 100 171 227 227 184 137 111 103 102 105 126
-840A26M7N5L4J2Jk5q2j11m8N8R6M1k2k0RJ7J6K9K7ml2k3j%KK1J6l9q7o5lK4J3J3K3Mj9ON5
$$ 126 173 228 262 274 275 250 168 57 9 67 163 204 182 162 171 188 204 233 260 256 224 201 200 200 202 223 239 200 113 48 45 69 82 95 118 122 103 109 164
-845A64N0pl7j6pl2l4J8N7L1k0k6qmnK2N0L6jj2kj2l7l0J5L9J5j6j3NLj9k6kK5K5jk0j8j0
$$ 164 214 207 170 154 147 115 81 99 156 187 167 141 133 129 124 146 196 232 231 219 217 205 168 138 153 192 207 191 178 183 186 167 141 139 164 189 188 168 150 140
-850A40j2j3J0M5M7J3k1k1ppj4jJ8K4J4Pmk7l9j0M2N5Rl6k7K4M4Rl8m8l1l2o4p9l2N1J00Q2
$$ 140 128 115 125 170 217 230 209 188 181 174 160 159 177 201 215 222 218 191 152 142 184 239 248 212 185 209 253 262 224 176 145 113 49 -30 -62 -11 89 171
-854A71L2MOJ9K0Mk7o0o9m0kJ8K7L6M3L0J0LROj3k4rK1M7N0J7l6n8k3K7K8k5o2l7J6L7J4j8
$$ 171 203 207 213 232 252 256 229 169 100 60 58 76 103 139 182 212 222 225 234 240 227 203 194 215 262 312 329 293 235 212 239 267 242 180 143 159 196 210 192
-859A92k5oJ6K0Kj9k4pJ4K0J0j8n0n4pN9P5K1l5l3PK3Kj4rqqMK3J0l0l8NM8L6nj4J5L3K1P
$$ 192 167 161 177 197 199 180 156 149 163 183 193 175 125 71 64 123 198 219 184 151 158 181 183 169 160 152 144 148 171 181 151 113 118 166 202 197 183 198 231 252 259
-864B59J2J6Jk2l3l3k9k0rrk8l7j7J2K7K7L2L6J4l3n5k9J8L4J7QK6M2K6ok0j3pqLJ9Rl3n7
$$ 259 271 287 288 266 233 200 171 151 142 133 105 68 51 63 90 117 149 185 199 166 111 82 100 134 151 159 185 227 253 247 227 214 207 199 202 221 230 197 140
-869A40j4N9P6J2o1o5j2K8K4lk7m3m4j6L1N8M4Qj8k5j9rjPJ8K7J1l2o4m1J9N3L3ok2k5k9k4
$$ 140 126 185 261 273 212 147 135 163 187 184 157 114 70 54 85 143 187 195 177 152 133 124 123 130 148 175 186 154 90 49 68 121 154 148 126 101 72 48
-874D8QL7L0lj8JK3K6J5kj8j4J9N0L3j5l6j7PJ0J7L6L2j6n9m7jK1J4J7L9L8Mk6j5J7K7Qk1
$$ 48 56 93 123 120 102 103 126 152 167 165 147 133 152 202 235 220 184 167 174 184 201 237 269 253 194 147 146 167 181 198 237 275 279 253 238 255 282 290 269
-878B69m5n0l0RL2J9mrOJ3Jj0j1rpkJ0J3Jrqpj4j6nKj1k6j3J3J4j7k9NN4O3L2kk1l2l6j9K2
$$ 269 224 174 144 153 185 204 200 191 197 210 211 201 190 181 174 172 182 195 196 187 179 172 158 142 137 139 128 102 89 102 116 99 70 75 129 192 224 222 201 169 133 114 136
-884A36N2M0jl5m1k6rPK4L3K0ok0nJ5J3pj9j9l0m1j5N3R4N6j5m3k3mq%L2M3J6oOJ9om8o1l8
$$ 136 188 228 227 192 151 125 116 123 147 180 200 194 174 169 184 197 190 171 152 122 81 66 119 213 269 254 211 188 184 176 176 208 251 267 261 267 286 280 232 171 133
-889A33j3LJ0Kk6m4j9L1N8M4K4K1K2Qj2j3nnk1l2k4rKKmj0j1JL3N9M4qm6l7j7k7m3mP3R9L9
$$ 133 120 123 133 135 109 65 46 77 135 179 203 224 246 254 242 229 224 219 198 166 142 133 135 137 133 123 112 113 146 205 249 241 195 158 141 114 71 67 140 239 278
-894B78l0l3JOj5j7m%kK1M8K9j9l3lRj7l6j7J1J6J4J6Kl0m5j4K4L1K2J9J4j0k7j5kj5l3l1
$$ 278 248 215 216 222 207 190 186 186 184 205 253 282 263 230 227 236 219 183 166 177 193 207 223 225 195 150 136 160 191 213 232 246 236 209 194 192 177 144 113
-899A13j9k2k5lJ3kj9J0N6N8J4j6j2j0j8j0J4J7LQK9On2o4LO2L5l0m2MM1N1M7K6k5o6m4RK2
$$ 113 94 72 47 44 57 55 36 46 102 160 174 158 146 136 118 108 122 139 142 150 179 185 133 69 72 134 169 139 97 101 142 193 240 266 241 175 131 140 162
-903A62rk6oNolK1K1j2k5PK9Jl0j0K0Ml7l4MJ6KRL8L5rk6jQk4l6J0N5K5l5l6J3L0KkL9M9j7
$$ 162 153 127 121 126 120 117 138 159 147 122 129 158 159 129 119 139 143 106 72 76 92 94 103 141 176 167 141 140 148 124 88 98 153 178 143 107 120 150 152 150 189 238 221
-909B21q9p7%N2M4K6K9K6j2n0m4jK1MrJ5M5K7l3p2m4J3M2L6K5J8qm5n2k8pj5j6J7N5N5K8J8
$$ 221 132 55 55 107 151 177 206 232 220 170 126 125 146 150 141 156 201 228 195 123 79 92 134 170 195 213 205 160 108 80 73 58 42 59 114 169 197 215
-913B15K7K2JpQOk5n5m7k1j4l0l9k0J6M6N0L0J0J2K8K5nk4%L5L3Mj1PK1Lk6l9l1j2J8M3L4
$$ 215 242 264 265 258 266 272 247 192 145 124 110 80 41 21 37 83 133 163 173 185 213 238 233 209 209 244 277 281 270 277 298 301 275 236 205 193 211 254 288
-918B88j3n0l5PK5Oj1j0k0n0o7m0J5M6L5J4NJ1J8J2qk5k2OL1L1Pj4j8pJ7M8O0L8LpKql9m4
$$ 288 275 225 190 197 222 228 217 207 187 137 70 30 45 91 126 140 145 156 174 186 178 153 131 137 168 199 206 192 174 167 184 232 292 330 333 326 328 320 281 237
-923B37kK5j5p7p4%N1K8k7m1j8%JJ2K7J9j1k3KL6M4K9Pj8m9o1l4J5M0K3rk3rJ1J7J2lj5nK6
$$ 237 235 260 245 168 94 94 145 173 146 105 87 87 88 100 127 146 135 112 114 150 194 223 230 212 163 102 68 83 123 146 137 114 105 116 133 145 142 127 122 148
-928A48N6N3J3k8m5l9k4mJ8K2%j9oK2J2l3o0k5K7L7Nj5rnoJ6N8O4No1o1nL1K1JMPrj9PM3M4
$$ 148 204 257 270 242 197 158 134 130 148 170 170 151 145 167 179 146 86 61 88 125 130 115 106 101 95 111 169 233 238 177 116 111 142 163 164 168 175 166 147 154 197 241
-933B41Rk1k8k5k0mJ5K1Oj3l2m7n0k2K9N9M7J9MNmj9k3rjj0k3k8j1K9P3Q5L8l4p3m9%L0K7
$$ 241 250 229 201 176 156 152 167 188 194 181 149 102 52 30 59 118 165 184 188 193 189 170 147 138 137 127 104 76 65 94 167 252 290 256 183 134 134 164 191
-938A91Lk2l8l3j3%qj7j1PJ3RRJ6J6KqlJ6L6M5L6J4%MJ1Mj6j9lJk9o1n5j6J1RJ6M9P6N8J4
$$ 191 194 172 134 101 88 88 80 63 52 59 72 81 90 106 122 124 116 113 129 165 210 246 260 260 264 275 279 263 244 241 242 213 152 97 81 92 101 117 166 242 300 314
-943C14pOJ2j1m0m6m1l8k8OL5J7l1m5mL5J7l6n8j9L5N6M0J4qk7m4l9kM0M6J6j1j3prkK9O0
$$ 314 307 313 325 314 274 228 187 149 121 127 162 179 148 103 99 134 151 115 57 38 73 129 169 183 175 148 104 65 63 103 149 165 154 141 134 125 123 152 212
-948B12N2K6K6L7J0n0p7m2MOj3j2mk2l9k5MJ4J7M4O1K2m5n8j0L0K6J9K6J0l8o0j8K9J8k9m7
$$ 212 264 290 316 353 363 313 236 194 198 204 191 179 175 153 114 89 93 107 124 168 229 251 206 148 138 168 194 213 239 249 211 151 133 162 180 151 104
-952A04k6oOK0J9j4m7k7L2N8K5j5k0MK3K7K1J5J8K7K4nl2j9J5K2ql6l4j9j1%J2J2oj6j2oJ
$$ 104 78 72 78 98 117 103 56 29 61 119 144 129 109 113 136 163 184 199 217 244 268 263 231 212 227 249 241 205 171 152 141 141 153 165 159 143 131 125 126
-957A26J5K6Ml8m7rK3J3lJ1L5L6K4L0K8rn0l7J2K1k5o4n6k5qNK8M4L3J1mj3k3k1plj4j7KJ4
$$ 126 141 167 171 133 86 77 100 113 110 121 156 192 216 246 274 265 215 178 190 211 186 122 66 41 33 38 66 110 143 154 150 137 114 93 86 83 69 52 54 68
-962F8NOL6O2M3jj9j0j6l7k7J7M2J4j9j5J4J5rk3j4pj0j1kJ3J8J2jj3nK2L8J7j8j9K5O5N4
$$ 68 73 79 115 177 220 219 200 190 174 137 110 127 169 183 164 149 163 178 169 146 132 125 115 104 102 115 133 145 144 131 126 148 186 203 185 166 191 256 310
-966C10Ll9m4j7J0J2j7m6m3j3RNjMOpj6KK2J7JOK4K2kj6j4j4rK0N7N3Jm8n3m3m7m5j0K3J7
$$ 310 313 274 230 213 223 235 218 172 129 116 125 130 129 133 139 132 116 118 140 157 158 164 188 210 208 192 178 164 155 175 232 285 286 238 185 142 95 50 40 63 80
-972H0j0j1J7K9J7RJ1Jk2k7oJ2NokJ6L6O0P7O6J7m2p8p7m5jL5L7J4j0j5j0kRJ3rl8l9j1PJ
$$ 80 70 59 76 105 122 131 142 143 121 94 88 100 105 99 97 113 149 209 286 352 369 327 249 172 127 126 161 198 212 202 187 177 175 184 197 188 150 111 100 107 108
-977A08PM0N5J5m1m6pJ5KmJ7L2Rl8o6n5j5K5L8J8jLJ4Nj2j1ONlJ1M1L8j0m7k5K4L8J0j6pK0
$$ 108 115 155 210 225 184 138 131 146 148 144 161 193 202 164 98 43 28 53 91 109 108 111 125 130 118 107 113 118 115 126 167 205 195 148 123 147 185 195 179 172 192
-982A92M0K9j2n7o1k1K0K6RJRJ0%qj5k7l3oL7N4K2k2l5j1J6K6J2j6l6l2KM0M9K1j6k9j4KO
$$ 192 232 261 249 192 131 110 130 156 165 166 175 185 185 177 162 135 102 96 133 187 209 187 152 141 157 183 195 179 143 111 113 153 202 223 207 178 164 166 172
-986A72%k%PK2L5K2j6l4lL5K1k7m1kK1j0l8j1L4L2pj7MJ2klJ5J3j8l4j5mk6m5k1K2M0L7K9
$$ 172 172 170 170 177 199 234 256 240 206 203 238 259 232 191 189 210 200 162 151 185 217 210 193 197 209 207 204 219 232 214 180 165 161 135 90 69 91 131 168 197
-991A97J6rk0ML0K0j2j8NJ4mk0j0PQOJ2J8Qj6l5l0lL5N6M6J7j1k5l3m4m9m0j1K2L2J3j8k7
$$ 197 213 204 184 188 218 238 226 208 213 227 223 203 193 200 208 214 226 244 252 236 201 171 168 203 259 305 322 311 286 253 209 160 120 109 131 163 176 158 131
-996A31nK2K9K4J4pl6m1mL4K5j8l7qK4K0%lJ6L5L0Nk9m7l3%K3K3J3RJ4K4K4Ll6n5l1%kj2K0
$$ 131 126 148 177 201 215 208 172 131 127 161 186 168 131 123 147 167 167 164 180 215 245 250 221 174 141 141 164 187 200 209 223 247 271 274 238 183 152 152 150 138 158
-1001A58P2O2j8p5l8L5N4K7J1Nl1o5l6M0O7K2k9k8j1j5k0mMk0l5NN8M9j6n5l4PK1K1K9L1Q
$$ 158 230 292 274 199 161 196 250 277 288 293 262 197 161 201 268 290 261 233 222 207 187 183 187 167 132 137 195 244 228 173 139 146 167 188 217 248 256
$$ [...]
-1605C34
##END=	
##END=	
