##TITLE=	RNmpkYyrSfmM13rl+tTA5g.32.ser
TM-VI-107solid Ca+Ph-pyrraz. 13C hmbc

##JCAMP-DX=	6.0	$$ MestReNova 14.3.0-30573
##DATA TYPE=	LINK
##BLOCK_ID=	1
##BLOCKS=	2    
##ORIGIN=	Mestrelab Research S.L.
##OWNER=	hrzepa
##$MNOVA/LINK_BLOCK_TYPE=	ITEM	$$ NMR Spectrum
##$MNOVA/ITEM/POLYGON=	(XY..XY)
5321,5835
8722,5835
8722,8208
5321,8208
5321,5835
##$MNOVA/ITEM/Z=	0
##$MNOVA/ITEM/ANGLE=	0
##TITLE=	RNmpkYyrSfmM13rl+tTA5g.32.ser
##JCAMP-DX=	6.0	$$ MestReNova 14.3.0-30573
##BLOCK_ID=	2
##DATA TYPE=	MNOVA NMR VIEW DATA
##DATA CLASS=	MNOVA VIEW DATA
##$MNOVA/2D/THRESHOLD=	3.3818912506103515625
##$MNOVA/ITEM/ZOOM/X=	-0.47893103590269503478,	14.508270000071124883
##$MNOVA/ITEM/ZOOM/Y=	-9.5608721214139968936,	250.07129999451962021
##END=	
##TITLE=	RNmpkYyrSfmM13rl+tTA5g.32.ser
##JCAMP-DX=	6.0	$$ MestReNova 14.3.0-30573
##BLOCK_ID=	3
##DATA TYPE=	nD NMR SPECTRUM
##DATA CLASS=	NTUPLES
##NUMDIM=	2
##ORIGIN=	Bruker BioSpin GmbH
##OWNER=	nmr
##.OBSERVE FREQUENCY=	400.20280139999999847
##.OBSERVE NUCLEUS=	^1H
##.SOLVENT NAME=	Acetone
##.PULSE SEQUENCE=	hmbcgplpndqf
##LONGDATE=	2021/10/21 03:32:50.000
##.ACQUISITIONMODE=	SIMULTANEOUS (DQD)
##$ORIGINAL FORMAT=	Bruker XWIN-NMR
##$MNOVA/SCALES_VERSION=	9
##$PARAMETER FILE=	(acqu2s, ASCII, /private/var/folders/f6/rjf_tdyn2v98c5c0wvkgn4s80000gn/T/RNmpkYyrSfmM13rl+tTA5g/32/acqu2s, 0)
$$ ##TITLE= Parameter file, TOPSPIN		Version 3.2
$$ ##JCAMPDX= 5.0
$$ ##DATATYPE= Parameter Values
$$ ##NPOINTS= 129	$$ modification sequence number
$$ ##ORIGIN= Bruker BioSpin GmbH
$$ ##OWNER= nmr
$$ $$ 2021-10-21 03:52:27.166 +0100  nmr@CZC2439F63
$$ $$ /opt/topspin/data/agmb/nmr/Oct20-2021/32/acqu2s
$$ $$ process /opt/topspin3.2/prog/mod/go
$$ ##$ACQT0= 0
$$ ##$BF1= 100.63037
$$ ##$FnMODE= 1
$$ ##$NUC1= <13C>
$$ ##$NusJSP= 0
$$ ##$NusT2= 1
$$ ##$NusTD= 128
$$ ##$O1= 12075.7644147886
$$ ##$SFO1= 100.642445764415
$$ ##$SW= 260.109045168497
$$ ##$SW_h= 26178.0104712042
$$ ##$TD= 128
$$ ##END=
$$ 
##$PARAMETER FILE=	(acqus, ASCII, /private/var/folders/f6/rjf_tdyn2v98c5c0wvkgn4s80000gn/T/RNmpkYyrSfmM13rl+tTA5g/32/acqus, 0)
$$ ##TITLE= Parameter file, TOPSPIN		Version 3.2
$$ ##JCAMPDX= 5.0
$$ ##DATATYPE= Parameter Values
$$ ##NPOINTS= 12	$$ modification sequence number
$$ ##ORIGIN= Bruker BioSpin GmbH
$$ ##OWNER= nmr
$$ $$ 2021-10-21 03:52:30.490 +0100  nmr@CZC2439F63
$$ $$ /opt/topspin/data/agmb/nmr/Oct20-2021/32/acqus
$$ $$ process /opt/topspin3.2/prog/mod/shimcntl
$$ ##$ACQT0= 1000000
$$ ##$AMP= (0..31)
$$ 100 100 100 100 100 100 100 100 100 100 100 100 100 100 100 100 100 100
$$ 100 100 100 100 100 100 100 100 100 100 100 100 100 100
$$ ##$AMPCOIL= (0..19)
$$ 0 0 0 0 0 0 0 0 0 0 0 0 0 0 0 0 0 0 0 0
$$ ##$ANAVPT= -1
$$ ##$AQSEQ= 0
$$ ##$AQ_mod= 3
$$ ##$AUNM= <au_zg>
$$ ##$AUTOPOS= <3 >
$$ ##$BF1= 400.2
$$ ##$BF2= 100.63037
$$ ##$BF3= 400.2
$$ ##$BF4= 400.2
$$ ##$BF5= 400.2
$$ ##$BF6= 400.2
$$ ##$BF7= 400.2
$$ ##$BF8= 400.2
$$ ##$BYTORDA= 0
$$ ##$CAGPARS= (0..11)
$$ 0 0 0 0 0 0 0 0 0 0 0 0
$$ ##$CFDGTYP= 0
$$ ##$CFRGTYP= 9
$$ [...]
$$ 0 0 0 0
$$ ##$ShimPowMaxUC= (0..63)
$$ 130000 130000 130000 130000 130000 130000 130000 130000 130000 130000 130000
$$ 130000 130000 130000 130000 130000 130000 130000 130000 130000 0 0 0 0
$$ 0 0 0 0 0 0 0 0 0 0 0 0 0 0 0 0 0 0 0 0 0 0 0 0 0 0 0 0 0 0 0 0 0 0 0 0
$$ 0 0 0 0
$$ ##$ShimPowMaxUG= (0..63)
$$ 524287 524287 524287 524287 524287 524287 524287 524287 524287 524287 524287
$$ 524287 524287 524287 524287 524287 524287 524287 524287 524287 0 0 0 0
$$ 0 0 0 0 0 0 0 0 0 0 0 0 0 0 0 0 0 0 0 0 0 0 0 0 0 0 0 0 0 0 0 0 0 0 0 0
$$ 0 0 0 0
$$ ##$ShimPowRcbType= 3
$$ ##$ShimPowRes= (0..63)
$$ 1e-20 1e-20 1e-20 1e-20 1e-20 1e-20 1e-20 1e-20 1e-20 1e-20 1e-20 1e-20
$$ 1e-20 1e-20 1e-20 1e-20 1e-20 1e-20 1e-20 1e-20 0 0 0 0 0 0 0 0 0 0 0 0
$$ 0 0 0 0 0 0 0 0 0 0 0 0 0 0 0 0 0 0 0 0 0 0 0 0 0 0 0 0 0 0 0 0
$$ ##$ShimPowRng0= (0..63)
$$ 1 1 1 1 1 1 1 1 1 1 1 1 1 1 1 1 1 1 1 1 0 0 0 0 0 0 0 0 0 0 0 0 0 0 0 0
$$ 0 0 0 0 0 0 0 0 0 0 0 0 0 0 0 0 0 0 0 0 0 0 0 0 0 0 0 0
$$ ##$ShimPowRng1= (0..63)
$$ 1 1 1 1 1 1 1 1 1 1 1 1 1 1 1 1 1 1 1 1 0 0 0 0 0 0 0 0 0 0 0 0 0 0 0 0
$$ 0 0 0 0 0 0 0 0 0 0 0 0 0 0 0 0 0 0 0 0 0 0 0 0 0 0 0 0
$$ ##$ShimPowRng2= (0..63)
$$ 1 1 1 1 1 1 1 1 1 1 1 1 1 1 1 1 1 1 1 1 0 0 0 0 0 0 0 0 0 0 0 0 0 0 0 0
$$ 0 0 0 0 0 0 0 0 0 0 0 0 0 0 0 0 0 0 0 0 0 0 0 0 0 0 0 0
$$ ##$ShimPowRng3= (0..63)
$$ 1 1 1 1 1 1 1 1 1 1 1 1 1 1 1 1 1 1 1 1 0 0 0 0 0 0 0 0 0 0 0 0 0 0 0 0
$$ 0 0 0 0 0 0 0 0 0 0 0 0 0 0 0 0 0 0 0 0 0 0 0 0 0 0 0 0
$$ ##$ShimSysFunc= (0..63)
$$ 1 2 3 4 5 7 9 11 15 16 8 10 12 14 6 17 13 18 19 20 0 0 0 0 0 0 0 0 0 0
$$ 0 0 0 0 0 0 0 0 0 0 0 0 0 0 0 0 0 0 0 0 0 0 0 0 0 0 0 0 0 0 0 0 0 0
$$ ##$ShimSysMatrix= 0
$$ ##$ShimSysType= 1
$$ ##$TFXNUM= 0
$$ ##$TRIPLO2= 0
$$ ##$VTU= 2
$$ ##$VTUETH= <149.236.99.20>
$$ ##$VTUTY= <no>
$$ ##$WBREFAM= (0..15)
$$ 135.5 97.7 100 100 100 100 100 100 100 100 100 100 100 100 100 100
$$ ##$WBREFLM= (0..15)
$$ 0 0 0 0 0 0 0 0 0 0 0 0 0 0 0 0
$$ ##$WBREFPH= (0..15)
$$ 72.26 -67.22 0 0 0 0 0 0 0 0 0 0 0 0 0 0
$$ ##$WBSGU= (0..15)
$$ 0 0 0 0 0 0 0 0 0 0 0 0 0 0 0 0
$$ ##$XFAC= 2
$$ ##END=
$$ 
##$DECIM=	3328
##$DSPFVS=	20
##.ACQUISITIONSCHEME=	NOT PHASESENSITIVE
##NTUPLES=	nD NMR SPECTRUM
##VAR_NAME=	FREQUENCY1,	FREQUENCY2,	SPECTRUM
##SYMBOL=	F1,	F2,	Y
##.NUCLEUS=	13C,	1H
##.OBSERVE FREQUENCY=	100.64244576441500101,	400.20280139999999847
##VAR_TYPE=	INDEPENDENT,	INDEPENDENT,	DEPENDENT
##VAR_FORM=	AFFN,	AFFN,	ASDF
##VAR_DIM=	512,	512,	262144
##UNITS=	HZ,	HZ,	ARBITRARY UNITS
##FIRST=	25164.767445380970457,	5806.2096540000038658,	0.1274668276309967041
##LAST=	-962.11409912165936476,	-191.66820056731904742,	0.13258203864097595215
##MIN=	-962.11409912165936476,	-191.66820056731904742,	0.0010408168891444802284
##MAX=	25164.767445380970457,	5806.2096540000038658,	24.169527053833007813
##FACTOR=	1,	1,	0.0033117481121458861026
##PAGE=	F1=25164.8
##FIRST=	25164.767445380970457,	5806.2096540000038658,	0.1274668276309967041
##DATA TABLE=	(F2++(Y..Y)), PROFILE
$$ [...]
##PAGE=	F1=-11136.8
##FIRST=	25164.767445380970457,	5806.2096540000038658,	0
##DATA TABLE=	(F2++(Y..Y)), PROFILE
$$ plain form
407 181 159 91 79 126 231 198 100 124 97 53 53 150 155 140 120 149 100 166 195 120 91 92 232 294 167 32 60 237 166 129 108 116 23 120 142
-4 142 72 20 70 92 224 127 74 58 82 77 74 137 211 84 33 53
$$ packed form
407A81k2o8j2M7J05l3r8K4k7m4%R7Nj5k0K9m9O6K9p5k9JJ40O2j27j35K8J77p1l7k1Qr3R7K2
-4A42p0n2N0K2J32r7n3j6K4nlO3P4j27n1K0
-192E3
##PAGE=	F1=-11239
##FIRST=	25164.767445380970457,	5806.2096540000038658,	0
##DATA TABLE=	(F2++(Y..Y)), PROFILE
$$ plain form
5806 64 70 107 178 144 169 82 197 98 99 129 80 59 78 206 218 173 99 68 208 295 49 124 89 85 159 68 115 128 100 47 121 74 145 189 172
5395 172 109 38 78 108 190 142 44 188 65 171 138 88 92 207 266 173 274 166 21 90 205 99 124 203 167 141 19 96 164 49
5043 49 173 223 179 161 109 132 37 91 58 161 189 248 255 109 101 126 76 101 141 247 268 201 165 130 166 145 134 51 35 27 75 111 138 86 141
4632 141 61 113 211 178 111 241 143 257 245 111 149 206 257 252 100 218 278 94 135 242 146 141 234 201 107 129 242 122 149 240 164
4269 164 167 174 154 134 114 65 120 190 212 170 151 63 21 81 116 213 134 156 190 51 236 229 120 70 45 94 126 123 176 104 179 165 199 139 121
3858 121 71 79 159 62 51 70 164 227 248 67 75 255 239 88 184 116 179 222 288 208 92 101 96 140 140 126 100 124 222 260 224 52 90 208
3459 208 246 89 282 242 59 81 46 123 124 162 193 48 65 19 87 64 107 83 93 91 131 109 109 160 217 126 86 143 194 280 15 259 79
3071 79 232 476 281 32 135 160 130 175 180 157 242 294 254 138 199 189 212 105 236 97 162 214 268 39 98 105 123 35 105 67 177
$$ packed form
5806F4OL7P1l4K5q7J15r9JL0m9k1J9J28J2m5p4l1J40Q7k46P5l5mP4r1M7J3k8n3P4m7P1M4j7
5395A72o3p1M0L0Q2m8r8J44j23J06l3n0MJ15N9r3J01j08j45O9J15j06K5P9l6k6j22P7O8j15
5043D9J24N0m4j8n2K3r5N4l3J03K8N9Pj46qK5n0K5M0J06K1o7l6l5L6k1j1q3j6qM8L6K7n2N5
4632A41q0N2R8l3o7J30r8J14j2j34L8N7N1nj52J18O0j84M1J07r6nR3l3r4K2J13j20K7R1p6
4269A64LPk0k0k0m9N5P0K2m2j9q8m2O0L5R7p9K2L4j39J85pj09n0k5M9L2lN3p2P5j4L4o0j8
3858A21n0QQ0r7j1J9R4O3K1j81QJ80j6j51R6o8O3M3O6q0j16RnM4%j4k6K4R8L8l6j72L8J18
3459B08L8j57J93m0j83K2l5P7JL8L1j45J7m6O8k3M3k4J0kM0k2%N1N7r1m0N7N1Q6k65K44j80
3071G9J53K44j95k49J03K5l0M5Nk3Q5N2m0j16O1j0K3j07J31j39O5N2N4k29N9PJ8q8P0l8J10
$$ plain form
2708 177 140 46 77 109 192 159 42 83 165 79 90 82 189 90 98 211 109 15 41 60 152 159 268 268 104 100 131 73 126 76 104 134 117 257
2308 257 162 146 122 13 94 110 173 9 212 186 186 101 55 68 135 220 104 120 274 89 191 66 46 279 123 217 113 171 24
1968 24 52 323 288 81 124 149 191 178 170 150 133 37 120 134 184 23 278 274 180 76 148 133 128 81 161 155 223 52 138 60 192 163 47
1581 47 168 129 155 120 64 134 124 22 156 193 92 117 46 71 23 51 73 86 125 130 129 160 251 409 173 307 322 34 68 197 48
1217 48 161 85 160 88 122 188 177 153 66 79 94 135 169 51 71 130 132 150 131 176 197 53 92 208 142 211 133 172 125 228 157 39 41
829 41 78 73 209 127 184 257 210 63 106 192 139 148 277 334 52 183 159 107 88 140 273 223 84 142 136 130 135 292 191 122 68 60 133 132 238
419 238 163 174 109 133 127 214 172 76 108 144 81 63 161 157 155 103 181 87 176 193 143 96 126 205 182 157 42 31 214 207 119 84 125 20 105 140
-4 140 70 22 94 86 219 105 85 73 105 26 65 127 208 105 43 71
$$ packed form
2708A77l7r4L1L2Q3l3j17M1Q2q6J1qJ07r9QJ13j02r4K6J9R2PJ09%j64mL1n8N3n0K8L0j7J40
2308B57r5j6k4j09Q1J6O3j64K03k6%q5m6J3O7Q5j16J6J54j85J02j25k0K33j56R4j04N8j47
1968B4K8K71l5k07M3K5M2j3qk0j7r6Q3J4N0j61K55mr4j04P2j5nm7Q0oO8j71Q6p8J32k9j16
1581D7J21l9K6l5n6P0j0j02J34L7j01K5p1K5m8K8K2J3L9NjL1R1J58k36J34J5k88L4J29j49
1217D8J13p6P5p2L4O6j1k4q7J3J5M1L4j18K0N9KJ8j9M5K1j44L9J16o6O9p8L9m7J03p1j18K
829D1L7nJ36q2N7P3m7j47M3Q6n3RJ29N7k82J31k4n2j9N2J33n0j39N8ooNJ57j01o9n4qP3jJ06
419B38p5J1o5K4oQ7m2r6L2L6o3j8R8mkn2P8r4Q9J7n0m7L0P9k3k5j15j1J83pq8l5M1j05Q5L5
-4A40p0m8P2qJ33j14k0j2L2p9L9O2Q1j03o2K8
-192G1
##PAGE=	F1=-11341.3
##FIRST=	25164.767445380970457,	5806.2096540000038658,	0
##DATA TABLE=	(F2++(Y..Y)), PROFILE
$$ plain form
5806 21 62 94 170 140 214 136 173 76 143 127 34 26 103 223 216 209 70 63 206 280 58 52 115 119 169 74 92 93 111 17 151 64 135 192 205 94
5384 94 26 99 94 181 150 74 135 76 176 125 61 100 194 265 161 258 166 61 113 246 59 122 241 184 128 17 148 174 38 181 203
5020 203 176 106 203 212 50 107 97 182 233 233 238 98 110 120 78 138 176 268 292 218 190 172 165 129 132 51 22 52 109 174 154 38 165 69 87
4609 87 202 189 122 260 157 246 204 134 148 245 289 276 117 222 278 75 128 188 120 155 212 171 103 128 230 132 150 228 217 242 200 132
4233 132 163 103 68 115 204 237 175 137 122 76 83 182 261 118 164 203 72 226 171 171 98 105 64 117 96 168 87 132 150 171 145 185 94 75 162
3823 162 67 25 75 97 199 204 52 56 228 217 61 187 133 204 201 224 180 138 148 148 173 143 142 119 102 142 201 186 56 55 223 239 99 228
3423 228 204 80 52 47 130 130 146 191 25 84 25 94 69 54 62 92 100 116 113 78 223 274 176 118 117 177 248 46 277 100 232 465 275
3036 275 52 115 124 138 194 182 201 257 303 265 160 195 188 224 83 133 152 183 196 252 50 85 119 116 64 139 85 211 152 16 72 92 237
$$ packed form
5806B1M1L2P6l0P4p8L7r7O7j6r3qP7J20ppj39pJ43P4k22oO3MN0r5J8JJ8r4J34q7P1N7J3j11
5384I4o8P3nQ7l1p6O1n9J00n1o4L9R4P1j04R7r2j05N2J33j87O3J19n7n6j11J31K6j36J43K2
5020B03k7p0R7Rj62N7j0Q5N1%Nj40J2J0m2O0L8R2K4p4k8j8pl6Lq1k9L0N7O5k0j16J27r6J8
4609H7J15j3o7J38j03Q9m2p0J4R7M4j3j59J05N6k03N3O0o8L5N7m1o8K5J02r8J8P8j1K5m2o8
4233A32L1o0l5M7Q9L3o2l8j5m6PR9P9j43M6L9j31J54n5%p3Pm1N3k1P2q1M5J8K1k6M0r1j9Q7
3823A62r5m2N0K2J02Nj52MJ72j1j56J26n4P1lK3m4m2J0%K5l0jk3j7M0N9j5j30jJ68J6j40J29
3423B28k4j24k8nQ3%J6M5j66N9n9O9k5j5QL0QJ6ll5J45N1r8n8jO0P1k02K31j77J32K33j90
3036B75k23O3RJ4N6j2J9N6M6l8j05L5pL6j41N0J9L1J3N6k02L5L4ln2P5n4J26n9j36N6K0J45
$$ plain form
2649 237 169 70 55 142 82 85 92 194 112 108 201 108 51 25 95 159 115 290 255 102 109 176 37 98 42 139 176 130 264 156 203 154 65 107
2250 107 21 169 40 230 222 206 98 30 88 102 209 99 122 329 73 191 93 85 282 135 197 121 212 59 67 270 270 96 126 113
1898 113 193 189 177 91 69 26 153 139 139 117 329 274 140 66 123 141 146 102 122 109 200 57 143 33 190 192 79 189 135 164 141 28
1522 28 97 126 65 210 208 113 136 35 94 44 45 38 97 101 132 69 134 255 403 243 300 351 41 85 193 65 177 132 169 115 103 144 119
1135 119 157 77 78 63 136 161 69 82 115 125 126 119 183 180 61 143 228 197 229 188 143 78 236 166 69 25 99 98 247 144 192 256 235 23 44
724 44 227 142 141 258 331 29 189 177 112 60 66 222 190 91 142 143 110 90 257 209 141 88 109 121 128 195 149 176 121 169 151 194 153 76 97
313 97 178 98 73 157 158 183 92 200 79 165 181 159 104 150 162 46 167 83 9 176 233 106 56 109 19 81 145 76 60 118 80 205 127
-74 127 138 118 131 33 62 104 197 114 61 84
$$ packed form
2649B37o8r9j5Q7o0LPJ02q2mR3r3n7k6P0O4m4J75l5j53PO7j39O1n6R7L7m6J34j08M7m9q9M2
2250A07q6J48j29J90qj6j08o8N8J4J07j10K3K07k56J18r8qJ97j47O2p6R1j53QK03%j74L0j3
1898A13Q0mj2q6k2m3J27j4%k2K12n5j34p4N7J8Nm4K0j3R1j43Q6j10J57Kj13J10n4K9k3j13
1522B8O9K9o1J45kr5K3j01N9n0JpN9ML1o3O5J21J48j60N7N1l10M4J08j28J12m5L7n4j2M1k5
1135A19L8q0Jj5P3K5r2J3L3J0JpO4lj19Q2Q5l1L2m1m5o5J58p0r7m4P4jJ49j03M8O4k1k12K1
724D4J83q5jJ17P3l02J60j2o5n2OJ56l2r9N1Jl3k0J67m8o8n3K1J2PO7m6K7n5M8j8M3m1p7K1
313I7Q1q0k5Q4JK5r1J08j21Q6J6k2n5M6J2j16J21q4p4J67N7j27n0N3r0O2O4o9j6N8l8J25p8
-74A27J1k0J3r8K9M2R3q3n3K3
-192H4
##PAGE=	F1=-11443.5
##FIRST=	25164.767445380970457,	5806.2096540000038658,	0
##DATA TABLE=	(F2++(Y..Y)), PROFILE
$$ plain form
5806 23 70 72 143 144 250 179 123 48 174 121 15 28 119 203 190 226 45 88 204 238 64 35 124 131 152 66 69 71 89 41 172 52 123 184
5407 184 215 68 63 93 93 170 138 108 79 103 174 99 76 122 178 246 149 215 164 115 133 287 68 122 261 187 118 17 211 166 93 180 175
5020 175 171 111 300 278 84 133 124 184 265 227 221 91 126 118 70 176 183 265 316 225 217 204 177 111 135 30 53 70 146 245 199 10 157 63
4621 63 60 189 184 137 271 160 215 169 161 139 276 305 267 131 205 256 81 122 125 87 162 182 147 101 112 196 124 148 207 243 295 212 116 179
4222 179 89 73 99 187 240 173 103 163 127 77 236 300 94 150 199 85 194 112 225 114 179 99 95 76 143 61 63 106 131 156 234 88
3846 88 63 154 126 16 129 71 170 154 93 55 195 183 46 177 112 235 168 150 165 182 178 180 212 131 172 135 104 58 124 133 84 49 217
3459 217 196 106 165 156 92 37 50 133 143 120 168 37 107 78 100 86 25 67 91 110 97 104 66 265 303 208 165 80 138 198 85 292 133
3071 133 224 419 251 63 96 100 136 181 160 228 241 288 272 166 165 180 229 174 57 191 192 173 214 79 71 135 97 85 143 92 225 158 17
$$ packed form
5806B3M7KP1JJ06p1n6p5J26n3j06J3R1Q4j3L6j81M3J16L4j74k9Q9PK1q6LKJ8m8J31j20P1O1
5407A84L1j47nL0%P7l2l0k9K4P1p5k3M6N6O8r7O6n1m9J8J54k19N4J39p4o9j01J94m5p3Q7n
5020A75mo0J89k2j94M9rO0Q1l8oj30L5qm8J06PQ2N1r1qj3k7o6K4j05K3J7P6R9m6j89J47r4
4621F3lJ29nm7J34j11N5m6qk2J37K9l8j36P4N1j75M1Ll8P5K0l5m6J1Q4p2K4N9L6N2q3r6O3
4222A79r0j6K6Q8N3o7p0O0l6n0J59O4k06N6M9j14J09q2J13j11O5q0mj9O7q2KM3K5K5P8j46
3846H8k5R1k8j10J13n8R9j6o1l8J40j2j37J31o5J23o7j8J5J7mKL2q1M1l7l1m6O6Rm9l5J68
3459B17k1r0N9ro4n5J3Q3J0k3M8j31P0k9K2j4o1M2K4J9j3Pl8J99L8r5m3q5N8O0j13K07j59
3071A33R1J95j68j88L3ML6M5k1O8J3M7j6j06jJ5M9n5j17J34Jj9M1j35qO4l8j2N8n1J33o7j41
$$ plain form
2684 17 100 66 271 163 107 29 108 76 71 94 180 115 104 156 93 100 74 142 154 62 279 210 70 144 210 11 69 61 171 203 135 260 128
2297 128 232 178 142 128 66 153 70 226 245 212 98 101 160 71 191 86 160 369 82 157 106 141 249 155 164 129 272 90 88 219 236
1933 236 105 123 75 194 200 206 117 16 29 168 154 151 226 391 275 121 72 80 146 154 118 81 118 169 81 141 6 175 219 111 185 118
1557 118 159 182 79 53 130 98 267 208 133 132 54 128 68 50 14 110 77 127 16 97 258 381 291 282 363 51 91 182 54 175 168 180
1182 180 142 71 110 86 155 97 87 29 137 166 140 100 90 128 99 82 160 163 98 182 246 245 245 230 117 68 231 164 85 51 129 120 270 176 191
771 191 250 256 36 16 226 126 113 207 292 79 180 170 101 34 25 160 145 85 140 150 69 46 174 196 167 148 131 86 115 169 139 172 131
383 131 186 178 177 149 102 93 197 106 77 135 162 217 96 194 77 136 167 166 105 159 139 93 201 122 44 134 242 97 50 77 19 48 136 86
-16 86 109 130 82 191 171 186 157 155 73 62 74 180 107 83 85
$$ packed form
2684A7Q3l4K05j08n6p8P9l2nK3Q6o5j1N2o3Pk6O8J2r2K17o9j40P4O6j99N8qJ10L2o8J25j32
2297A28J04n4l6j4o2Q7q3J56J9l3j14LN9q9J20j05P4K09k87P5n1L5J08r4Rl5J43j82kJ31J7
1933B36j31J8m8J19OOq9j01J3J39j4lP5J65j16j54m9QO6Ql6l7L7N1q8O0j35J69M4j08P4o7
1557A18M1K3j03k6P7l2J69n9p5jp8P4o0j8l6R6l3N0j11Q1J61J23r0rQ1l12M0R1j28J21pJ2
1182A80l8p1L9k4O9n8j0n8J08K9k6m0j0L8k9j7P8Lo5Q4O4j%j5j13m9J63o7p9l4P8rJ50r4J5
771A91N9Ok20k0K10j00j3R4Q5k13J01j0o9o7rJ35j5o0N5J0q1k3J28K2k9j9j7m5K9N4l0L3m1
383A31N5qjk8m7rJ04r1k9N8K7N5j21R8j17N9L1jo1N4k0m6J08p9p8R0J08j45m7K7n8K9Q8n0
-16H6K3K1m8J09k0J5k9kq2j1J2J06p3k4K
-192H5
##PAGE=	F1=-11545.8
##FIRST=	25164.767445380970457,	5806.2096540000038658,	0
##DATA TABLE=	(F2++(Y..Y)), PROFILE
$$ plain form
5806 51 82 39 99 162 269 199 61 31 188 129 63 59 123 154 145 218 20 98 204 187 56 114 114 115 114 48 55 60 44 81 175 44 116 170 199
5395 199 32 104 75 95 164 112 134 87 137 172 71 103 146 163 218 134 154 150 164 142 321 104 122 251 173 104 63 268 151 154 175 148
5020 148 168 156 369 319 116 155 130 174 280 227 211 82 144 126 57 218 167 248 327 216 239 212 180 95 136 11 104 80 178 301 246
4656 246 34 126 47 42 177 162 149 266 151 171 150 186 117 284 297 227 137 176 219 104 118 73 55 154 154 126 106 85 159 102 137 185 236
4269 236 308 203 107 184 87 77 85 149 221 158 64 182 163 68 269 315 76 117 189 86 141 84 267 113 242 152 71 88 104 25 19 46
3893 46 86 169 264 60 45 145 188 44 174 113 155 115 142 61 160 148 54 163 60 265 127 87 173 207 180 179 238 102 200 145 128
3529 128 82 50 88 111 60 185 127 107 104 108 91 67 51 125 160 92 124 60 127 134 105 101 51 96 97 115 79 84 76 280 302 220 209 45 88 170 121
3095 121 301 160 206 346 218 88 82 85 125 147 129 231 189 252 277 168 117 170 220 269 104 202 184 155 165 111 61 138 63 94 117 90
$$ packed form
5806E1L1m3O0O3J07p0j38l0J57n9o6mO4L1rP3j98P8J06j7j31N8%Jjo6PNj6L7R4j31P2N4K9
5395A99j67P2k9K0O9n2K2m7N0L5j01L2M3J7N5q4K0mJ4k2J79k17J8J29p8o9m1K05j17LK1k7
5020A48K0j2K13n0k03L9k5M4J06n3j6j29O2j8o9J61n1Q1P9j11K3k7l2q5M1j25R3k4R8J23n5
4656B46k12R2p9nJ35j5j3J17j15K0k1L6o9J67J3p0r0L9M3j15J4m5j8R9%k8k0k1P4n7L5M8N1
4269B36P2j05r6P7r7j0QO4P2o3r4J18j9r5K01M6k39M1P2j03N5n7J83j54J29r0q1J7J6p9oK7
3893D6M0Q3R5k04j5J00M3j44J30o1M2m0K7q1R9j2r4J09j03K05j38m0Q6L4k7jN9j36R8n5j7
3529A28m6l2L8K3n1J25n8k0lMj7k4j6P4L5o8L2o4O7Pk9mn0M5JJ8l6NqK04K2q2j1j64M3Q2m9
3095A21J80j41M6J40j28j30oLM0K2j8J02m2O3K5j09n1N3N0M9j65R8j8k9J0n4n0P7p5L1K3k7
$$ plain form
2719 90 217 156 43 140 29 284 144 141 22 84 86 57 87 153 98 95 85 89 155 120 177 142 19 238 144 14 197 224 28 62 97 193
2344 193 211 128 244 84 225 194 197 133 130 130 84 200 247 204 100 164 236 44 168 68 209 391 111 99 104 202 194 173 135 148 330
1980 330 111 109 182 195 118 115 87 203 207 234 186 70 29 165 164 191 329 451 272 124 86 32 132 149 131 59 154 136 98 128 17 149
1604 149 225 132 168 85 141 212 120 16 148 116 306 198 148 116 80 151 84 73 56 126 55 121 83 59 248 353 312 255 360 63 89
1240 89 165 16 170 181 187 170 31 94 97 147 114 105 21 142 171 195 129 60 129 64 35 119 146 138 205 254 279 261 249 98 84 218 153 86
841 86 79 151 135 275 221 190 242 268 70 57 190 95 76 133 229 119 158 145 68 21 88 94 104 80 131 150 28 25 80 153 179 184 121 53 98
430 98 172 131 172 149 194 195 161 163 138 96 199 106 73 106 169 240 110 160 82 98 154 162 90 153 170 193 231 142 62 97 233 100 68 70 24 23
8 23 104 108 157 124 96 181 209 208 169 170 94 65 54 165 88 102 76
$$ packed form
2719I0J27o1j13R7j11K55j40lj19O2Kk9L0O6n5lj0MO6l5N7l5j23K19r4j30J83K7j96L4L5R6
2344A93J8q3J16j60J41l1Lo4l%m6J16M7m3j04O4P2j92J24j00J41J82k80j2NR8qk1l8J3J82
1980C30k19kP3J3p7lk8J16MK7m8j16m1J36jK7J38J22j79j48l8n4J00J7j8p2R5j8l8L0j11J32
1604A49P6r3L6q3N6P1r2j04J32l2J90j08n0l2l6P1o7j1j7P0p1O6l8k4J89J05m1n7J05k97K6
1240H9P6j49J54J1Oj7j39O3LN0l3rq4J21K9K4o6o9O9o5k9Q4K7qO7M9K5j8j2j51j4J34o5o7
841H6pP2j6J40n4l1N2K6j98j3J33r5j9N7R6j10L9j3p7m7O7OJ0k4N1J9j22lN5P3K6No3o8M5
430I8P4m1M1k3M5Jl4Kk5m2J03r3l3L3O3P1j30N0p8J6N6Qp2O3J7K3L8q9q0L5J36j33l2Km6j
8B3Q1MM9l3k8Q5K8jl9Jp6k9j1J11p7J4k6
-192G6
##PAGE=	F1=-11648.1
##FIRST=	25164.767445380970457,	5806.2096540000038658,	0
##DATA TABLE=	(F2++(Y..Y)), PROFILE
$$ plain form
5806 80 95 27 44 190 267 193 24 57 183 157 107 87 114 95 95 187 7 85 205 153 38 174 85 77 67 35 46 56 19 111 158 40
5431 40 111 157 159 13 132 68 93 166 89 150 150 169 172 54 114 162 151 187 117 98 118 193 135 341 140 121 210 148 91 121 308 157 205
5043 205 167 131 167 196 396 330 140 165 118 157 275 227 209 67 155 142 51 259 142 226 314 187 247 196 167 87 125 50 154 86 197
4679 197 331 274 46 92 40 37 170 130 151 240 130 125 148 203 83 262 263 164 129 149 181 129 120 61 53 136 148 116 122 61 144 73 121 171 202
4269 202 282 174 103 184 93 81 89 104 184 128 63 180 178 69 275 301 84 75 188 84 72 99 282 92 280 188 59 116 66 13 87
3905 87 16 45 178 270 18 36 137 224 66 194 161 163 96 169 59 126 123 77 158 29 284 88 56 193 203 163 146 243 60 216
3553 216 147 156 152 28 101 124 66 137 75 117 53 70 77 104 56 108 179 78 89 82 140 186 114 109 78 124 107 114 63 64 83 267 278 214 244 62
3130 62 40 190 149 301 168 178 263 194 135 78 70 106 108 110 210 111 204 277 176 66 160 192 327 153 180 163 144 118 136 55 124 24
$$ packed form
5806H0J5o8J7J46P7p4j69L3J26k6n0k0K7j9%R2j80P8J20n2j15J36q9qj0l2J1J0l7R2M7j18
5431D0P1M6Kj46J19o4K5P3p7O1%J9Lj18O0M8j1L6p0j9K0P5n8K06k01j9Q9o2n7L0J87j51M8
5043B05l8l6L6K9K00o6j90K5m7L9J18m8j8j42Q8j3r1K08j17Q4Q8j27O0n1k9q0L8p5J04o8J11
4679A97J34n7k28M6n2lJ33m0K1Q9j10nK3N5j20J79Jr9l5K0L2n2rn9qQ3J2l2Oo1Q3p1M8N0L1
4269B02Q0j08p1Q1r1j2QJ5Q0n6o5J17kj09K06K6k17rJ13j04j2K7J83j90J88r2j29N7n0n3P4
3905H7p1K9J33R2k52J8J01Q7j58J28l3Ko7P3j10O7lm6Q1j29K55j96l2J37J0m0j7R7j83J56
3553B16o9Rmj24P3K3n8P1o2M2o4J7PK7m8N2P1j01J1pN8M6p2nl1M6j7Pn1JJ9J84J1o4L0j82
3130F2k2J50m1J52j33J0Q5o9n9n7qL6KKJ00r9R3P3j01j10R4L2J35j74K7j7j9k6J8q1O9j00
$$ plain form
2754 24 94 72 85 184 145 59 162 17 271 118 162 29 81 108 50 70 125 70 103 56 124 204 152 191 129 44 179 74 55 254 217
2391 217 40 98 141 204 205 111 218 30 183 201 217 114 164 107 81 158 223 181 109 201 295 34 141 46 250 388 133 44 92 252
2038 252 155 183 127 176 368 116 131 165 151 141 99 131 212 212 241 227 115 25 152 162 227 409 496 259 141 101 19 105 138 142 62 185
1663 185 110 103 105 35 122 212 134 154 61 108 215 134 11 177 114 323 189 157 104 105 160 97 102 101 137 36 115 146 50 224 327 304 225
1276 225 344 75 82 145 58 184 172 190 197 20 92 121 135 121 121 45 149 166 220 166 30 123 29 49 81 127 169 216 246 289 279 242 82
888 82 94 203 139 79 99 160 146 262 265 198 237 265 93 79 133 48 52 51 160 142 128 112 19 28 138 43 85 88 112 140 29 43 73 96 168
477 168 186 93 95 92 183 119 180 174 208 200 142 188 170 102 186 101 69 94 172 238 123 104 91 68 143 144 55 135 226 243 231 136 61 68 208 112 86
43 86 113 30 56 55 140 196 103 114 171 227 200 145 172 94 69 59 159 68 112 71
$$ packed form
2754B4P0k2J3R9l9q6J03j45K54j53M4j33N2K7n8K0N5n5L3m7O8Q0n2L9o2q5J35j05j9J99l7
2391B17j77N8M3O3Jr4J07j88J53J8J6j03N0n7k6P7O5m2p2R2R4k61J07r5K04J38k55q9M8J60
2038B52r7K8n6M9J92k52J5L4j4j0m2L2Q1%K9j4j12r0J27J0O5J82Q7k37j18m0q2Q6L3Mq0J23
1663A85p5pKp0Q7R0p8K0r3M7J07q1j23J66o3K09j34l2n3JN5o3NjL6j01P9L1r6J74J03k3p9
1276B25J19k69PO3q7J26j2J8Pj77P2K9J4j4%p6J04J7N4n4j36R3r4K0L2M6M2M7L0M3j0l7j60
888H2J2J09o4o0K0O1j4J16Lo7L9K8j72j4N4q5MjJ09j8j4j6r3RJ10r5M2LK4K8j11J4L0K3P2
477A68J8r3KlR1o4O1oL4qn8M6j8o8Q4q5l2K5P8O6j15j9j3k3P5Jq9Q0R1J7j2r5p5PJ40r6k6
43H6K7q3K6jQ5N6r3J1N7N6k7n5K7p8k5j0J00r1M4m1
-192G1
##PAGE=	F1=-11750.3
##FIRST=	25164.767445380970457,	5806.2096540000038658,	0
##DATA TABLE=	(F2++(Y..Y)), PROFILE
$$ plain form
5806 111 102 71 15 214 245 163 54 95 160 194 145 114 93 56 65 149 27 54 200 144 34 206 63 27 34 46 34 65 76 124 122 45 101
5419 101 147 103 56 142 75 90 175 82 158 210 191 167 47 101 163 139 154 102 89 72 190 115 348 171 114 153 145 91 174 329 199 238
5043 238 154 121 166 218 380 315 156 162 102 133 246 221 210 45 157 162 60 289 117 201 273 137 240 169 142 89 100 90 195 99
4691 99 202 329 280 36 79 60 42 167 97 136 196 100 87 159 208 42 211 207 92 109 132 153 147 128 82 82 119 166 124 142 69 159 45
4304 45 109 168 152 229 136 107 179 91 84 103 70 132 82 100 172 167 84 255 260 107 32 202 100 20 123 268 52 288 198 66 131 63
3928 63 49 142 68 30 179 255 30 53 127 220 77 189 194 181 93 165 52 93 111 114 169 89 289 57 58 211 170 156 94 231 33 217
3553 217 145 172 190 49 144 123 63 91 110 149 37 44 55 129 67 97 203 85 125 105 147 232 137 112 94 136 114 103 52 65 75 230 241
3165 241 193 266 118 40 230 164 287 152 146 191 194 187 89 46 83 75 112 167 65 160 268 189 28 147 147 334 158 128 133 138 82 144 50
$$ packed form
5806A11rl1n6J99L1q2j09M1O5L4m9l1k1l7RQ4j22K7J46n6j10J72j43l6PJ2j2L1J1M8kp7N6
5419A01M6m4m7Q6o7J5Q5r3P6N2j9k4j20N4O2k4J5n2j3j7J18p5K33j77n7L9qn4Q3J55j30L9
5043B38q4l3M5N2J62o5j59Oo0L1J13k5j1j65J12Nj02K29j72Q4P2j36J03p1k7n3J1j0J05r6
4691I9J03J27m9k44M3j9j8J25p0L9O0r6j3P2M9j66J69mj15J7K3K1oj9m6%L7M7m2J8p3R0j14
4304D5O4N9j6P7r3k9P2q8pJ9l3O2n0J8P2nq3J71Nj53p5J70j02q0J03J45k16K36r0j32O5o8
3928F3j4R3p4l8J49P6k25K3P4R3j43J12Nj3q8P2j13M1J8LN5q0K00k32JJ53m1j4o2J37j98J84
3553B17p2K7J8j41R5k1o0K8J9L9j12PJ1P4o2L0J06j18M0k0M2Q5r5k5j8M2k2j1n1J3J0J55J1
3165B41m8P3j48p8J90o6J23j35oM5Lpr8m3L7qL7N5j02R5J08p9j61J19%J87j76l0NNn6O2r4
$$ plain form
2778 50 97 44 94 49 80 130 128 62 155 60 232 94 168 38 82 118 42 51 114 41 133 132 175 236 171 184 120 66 121 43 119 304 196 39
2379 39 152 187 204 200 90 185 27 121 195 198 83 164 84 63 110 178 145 131 205 326 48 112 22 273 354 131 57 76 282 172 180 141
2003 141 201 372 111 156 165 106 171 74 159 211 221 220 217 136 28 134 148 246 450 512 226 164 117 51 80 125 148 68 201 95 101 81 48
1616 48 104 194 119 154 85 61 190 124 29 202 92 319 195 162 103 125 158 108 126 138 134 18 99 186 82 186 305 273 193 315 85
1252 85 71 125 136 224 151 190 217 47 100 135 121 118 126 68 146 148 208 206 23 112 24 91 73 108 190 218 218 268 294 214 60 95 189 132 78 108
829 108 159 154 233 300 212 234 245 107 77 87 22 58 22 107 151 95 81 50 36 159 57 92 106 82 118 29 69 100 42 140 160 84 170 112
430 112 179 100 187 197 238 194 118 212 193 105 161 94 82 119 169 209 130 52 99 58 129 113 7 108 270 237 193 111 74 44 171 127 107
43 107 161 31 101 33 173 218 74 125 152 225 167 91 162 77 80 75 162 66 111 86
$$ packed form
2778E0M7n3N0m5L1N0ko6R3r5J72j38P4j30M4L6p6RO3p3R2jM3O1o5J3o4n4N5p8P6J85j08j57
2379C9J13L5J7mj10R5j58R4P4Lj15Q1q0k1M7O8l3j4P4J21k78O4r0K51Q1k23p4J9K06j10Ql9
2003A41O0J71k61M5Rn9O5r7Q5N2J0jlq1j08J06J4R8K04O2k86o2m7o6K9M5K3q0J33j06Ok0l3
1616D8N6R0p5L5o9k4J29o6r5J73j10K27j24l3n9K2L3n0J8J2mj16Q1Q7j04J04J19l2q0J22k30
1252H5j4N4J1Q8p3L9K7j70N3L5j4lQn8P8KO0kj83Q9q8O7j8L5Q2K8%N0K6q0j54L5R4n7n4L0
829A08N1nP9O7q8K2J1j38l0J0o5L6l6Q5M4n6j4l1j4J23j02L5J4k4L6q9M0L1n8R8K0p6Q6n8
430A12O7p9Q7J0M1m4p6R4j9q8N6o7j2L7N0M0p9p8M7m1P1j6j06J01J62l3m4q2l7l0J27m4k0
43A07N4j30P0o8J40M5j44N1K7P3n8p6P1q5LnQ7r6M5k5
-192H6
##PAGE=	F1=-11852.6
##FIRST=	25164.767445380970457,	5806.2096540000038658,	0
##DATA TABLE=	(F2++(Y..Y)), PROFILE
$$ plain form
5806 145 103 118 64 222 207 116 72 122 125 224 172 145 70 55 66 120 46 14 182 140 58 205 93 24 34 64 27 84 124 121 74 62 80 136
5407 136 51 94 138 71 100 186 81 157 252 195 149 31 65 147 121 123 91 118 35 161 102 342 193 100 123 198 107 210 331 262 252 135
5032 135 114 161 226 332 283 163 151 100 102 193 207 209 18 152 180 80 299 96 167 208 75 230 154 125 101 65 118 218 121 200 300
4668 300 273 6 92 97 63 161 72 105 146 63 66 174 198 11 139 136 27 78 125 142 158 142 102 121 110 183 140 163 103 178 26 101 171
4280 171 105 165 115 119 169 70 90 117 56 86 29 130 177 137 106 220 202 120 8 226 136 81 133 228 12 269 179 83 122 87 76 175
3905 175 100 48 169 226 74 76 112 175 80 165 207 189 95 135 56 64 108 158 189 142 281 35 67 224 126 175 39 208 73 202 140
3541 140 169 185 41 169 111 55 73 163 186 69 27 38 135 78 108 228 100 203 129 151 266 176 116 100 133 113 85 47 83 55 181
3177 181 203 156 273 177 74 255 161 259 117 122 144 215 230 114 42 61 48 118 110 134 136 245 192 20 123 92 288 120 57 99 133
$$ packed form
5806A45m2J5n4J58j5r1m4N0LR9n2k7p5j5J1N4p4l2J68m2q2J47j12o9J0L0l7N7M0lm7j2J8N6
5407A36q5M3M4o7K9Q6j05P6R5n7m6j18L4Q2k6Kl2K7q3J26n9K40j49r3K3P5r1J03J21o9j0j17
5032A35k1M7O5J06m9j20j2n1KR1J4Kj91J34K8j00K19k03P1M1j33J55p6k9k4l6N3J00r7P9J00
4668C00k7k67Q6Nl4R8q9L3M1q3LJ08K4j87J28lj09N1M7J7J6j6m0J9j1P3m3K3o0P5j52P5P0
4280A71o6O0n0MN0r9K0K7o1L0n7J01M7m0l1J14j8q2j12K18r0n5N2R5k16K57r0r6L9l5j1R9
3905A75p5n2J21N7j52KL6O3r5Q5M2j8r4M0p9QM4N0L1m7J39k46L2J57r8M9j36J69j35J29o2
3541A40K9J6j44J28n8n6J8R0K3j17m2J1R7n7L0J20j28J03p4K2J15r0o0j6L3k0k8l8L6k8J26
3177A81K2m7J17r6j03J81r4R8j42NK2P1J5j16p2J9j3P0qK4KJ09n3j72J03l1J96j68o3M2L4
$$ plain form
2813 133 64 130 40 66 92 99 80 70 62 106 54 121 96 172 77 156 54 71 106 33 47 121 17 164 206 216 240 178 164 119 61 90 87 166 339
2402 339 169 27 201 218 195 208 86 151 72 66 176 148 73 134 62 39 76 119 101 164 175 325 65 83 12 276 289 107 86 64 287
2038 287 219 164 160 212 336 113 188 174 60 199 45 152 190 238 178 155 131 42 119 128 249 449 494 172 184 132 81 84 107 145 72 202
1663 202 92 99 69 53 93 189 97 165 137 14 142 103 64 210 58 302 213 165 112 136 149 111 144 163 117 18 65 196 117 143 281
1299 281 227 165 275 93 57 107 213 273 130 190 225 57 115 130 114 112 112 85 127 118 166 240 56 101 38 113 84 90 203 216 171 217 302
912 302 179 31 99 177 132 89 105 152 157 189 318 222 220 213 125 59 98 82 74 71 87 159 75 62 115 47 149 98 110 114 45 86 15 135 101 18
489 18 111 112 120 235 148 153 86 175 202 276 184 95 229 203 102 125 94 111 157 157 174 134 65 101 50 112 71 68 80 291 190 122 95 124 52 131
67 131 145 140 193 25 140 74 198 222 51 121 121 208 121 35 146 58 98 82 166 82 102 115
$$ packed form
2813A33o9O6r0K6K6Pj9j0qM4n2O7k5P6r5P9j02J7L5p3J4P4j04J47M2J0K4o2j4m5n8K9lP9J73
2402C39j70j42J74J7k3J3j22O5p9oJ10k8p5O1p2k3L7M3j8O3J1J50k60J8p1K64J3j82k1k2K23
2038B87o8n5mN2J24k23P5j4j14J39j54J07L8M8o0k3k4q9P7RJ21K00M5l22J2n2n1LK3L8p3J30
1663B02j10Pl0j6M0R6r2O8k8j23J28l9l9J46j52K44q9m8n3K4J3l8L3J9m6r9M7J31p9K6J38
1299B81n4o2J10j82l6N0J06O0j43O0L5j68N8J5j6k%k7M2rM8P4j84M5o3P5k9OJ13J3m5M6Q5
912C02j23j48O8P8m5m3J6M7NL2J29r6kpq8o6L9j6qlJ6P2q4j3N3o8J02n1J2Mo9M1p1J20l4q3
489A8R3JQJ15q7No7Q9K7P4r2q9J34k6j01K3l1J7M6%J7m0o9L6n1O2m1lJ2K11j01o8k7K9p2P9
67A31J4nN3j68J15o6J24K4j71P0%Q7q7q6J11q8M0j6Q4q4K0J3
-192A15
##PAGE=	F1=-11954.8
##FIRST=	25164.767445380970457,	5806.2096540000038658,	0
##DATA TABLE=	(F2++(Y..Y)), PROFILE
$$ plain form
5806 175 95 154 94 204 158 63 72 127 86 234 184 184 68 60 70 114 63 33 153 121 88 179 145 66 44 78 35 99 153 104 29 83 49 115
5407 115 55 117 139 47 131 191 81 150 269 181 119 2 27 114 92 99 86 135 68 132 115 325 201 78 153 280 131 220 318 323 254 117
5032 117 106 148 228 270 239 161 133 120 74 129 187 199 16 143 192 100 286 74 121 132 45 228 167 142 120 49 129 221 149 206 254 273
4656 273 49 107 140 101 147 65 66 118 23 65 185 173 44 61 66 38 39 124 153 164 157 111 158 108 182 150 179 136 181 14 90 168 68 102
4257 102 126 134 150 33 99 130 50 96 48 139 199 97 121 182 143 114 47 249 176 134 127 177 63 232 134 111 97 101 90 186 112 65 156 198
3858 198 111 94 95 98 93 137 201 175 98 99 75 48 102 193 205 173 265 15 80 234 115 201 27 181 124 175 132 149 143 18 160 89 48 86
3459 86 187 206 106 7 41 118 81 141 248 107 272 148 155 285 219 130 97 121 105 68 42 99 29 131 171 104 264 226 99 253
3107 253 137 217 76 110 120 238 255 143 89 51 20 112 52 214 130 207 179 34 79 42 202 64 46 68 129 68 97 29 43 128 105
$$ packed form
5806A75q0N9o0J10m6r5RN5m1J48n0%j16qJ0M4n1l0J20l2l3R1l4p9k2L4m3O4N4m9p5N4l4O6
5407A15o0O2K2r2Q4O0j10O9J19q8o2j17K5Q7k2Pj3M9o7O4j7K10j24j23P5J27j49Q9R8No9j37
5032A17j1M2Q0M2l1p8k8j3m6N5N8J2j83J27M9r2J86k12M7J1q7J83o1k5k2p1Q0R2p2N7M8J9
4656B73k24N8L3l9M6q2JN2r5M2J20j2j29J7Nk8JQ5K9J1pm6M7n0P4l2K9m3M5j67P6P8j00L4
4257A02K4QJ6j17O6L1q0M6m8R1O0j02K4O1l9k9o7K02p3m2pN0j14J69r8k3j4Mj1R6p4m7R1M2
3858A98q7j7JLnM4O4k6p7Jk4k7N4R1J2l2R2k50O5J54j19Q6j74J54n7N1m3J7oj25J42p1m1L8
3459H6J01J9j00r9L4P7l7O0J07j41J65j24PJ30o6q9l3K4j6l7k6N7p0J02M0o7J60l8j27J54
3107B53j16Q0j41L4J0J18J7j12n4l8l1R2o0J62q4P7k8j45M5l7J60j38j8K2O1o1K9o8J4Q5k3
$$ plain form
2743 105 105 52 16 81 46 80 118 107 67 136 78 49 75 58 64 130 16 170 256 238 213 177 145 125 31 104 130 185 352 148 20 231 222
2355 222 179 237 118 115 103 70 150 80 98 87 38 30 76 59 60 198 118 298 71 58 41 261 202 81 87 53 275 254 134 168 204 264 144
1968 144 224 178 17 215 35 113 151 263 128 57 106 54 110 104 239 408 440 100 196 143 114 118 83 131 89 191 94 97 67 54 77 193
1592 193 79 176 189 71 81 92 112 193 39 277 229 168 124 135 130 96 155 172 93 37 11 178 148 102 249 179 141 223 100 52 88 278
1217 278 315 121 194 219 44 132 109 117 114 88 96 91 83 107 260 96 93 40 109 84 79 213 209 109 151 300 148 39 117 172 135 105 94 144
818 144 153 136 318 224 184 181 153 41 138 141 92 87 90 175 87 69 171 74 117 128 127 103 32 45 67 226 141 26 109 54 166 274 182 124 97
407 97 136 182 302 177 92 234 199 93 83 110 143 189 139 175 144 103 93 29 97 34 137 76 293 124 45 119 188 95 101 165 181 204 24
20 24 171 109 208 205 41 96 80 184 71 77 128 65 119 78 161 99 91 144
$$ packed form
2743A05%n3l6O5l5L4L8j1m0O9n8k9K6j7OO6j14J54Q6j8k5l6l2k0r4P3K6N5J67k04j28K11r
2355B22m3N8j19lj2l3Q0p0J8j1m9qM6j7JJ38q0J80k27j3j7K20n9j21Ol4K22k1j20L4L6O0j20
1968A44Q0m6j61J98j80P8L8J12j35p1M9n2N6oJ35J69L2l40R6n3k9Ml5M8m2J02r7Ll0j3K3J16
1592A93j14R7J3j18J0J1K0Q1j54K38m8o1m4J1nl4N9J7p9n6k6J67l0m6J47p0l8Q2j23m8L6J90
1217B78L7j94P3K5j75Q8k3Qlk6QnqK4J53j64ln3O9k5nJ34mj00M2J49j52j09P8N5l7l0j1N0
818A44Rj7J82r4m0lk8j12R7Lm9nLQ5q8j8J02r7M3J1jk4p1J3K2J59q5j15Q3n5J12J08r2n8k7
407I7L9M6J20j25q5J42l5j06j0K7L3M6n0L6l1m1j0o4O8o3J03o1K17j69p9P4O9r3OO4J6K3j80
20B4J47o2R9lj64N5j6J04j13ON1o3N4m1Q3o2qN3
-192A44
##PAGE=	F1=-12057.1
##FIRST=	25164.767445380970457,	5806.2096540000038658,	0
##DATA TABLE=	(F2++(Y..Y)), PROFILE
$$ plain form
5806 196 82 174 100 160 107 19 73 104 45 219 176 230 106 52 59 117 83 88 129 85 113 140 184 98 61 96 42 105 158 80 58 99 31 78
5407 78 89 120 164 51 171 186 86 134 263 148 97 53 57 76 58 84 88 128 118 140 137 297 193 51 196 351 150 203 294 364 252
5043 252 115 106 127 232 214 188 147 112 154 92 83 165 176 51 135 197 113 255 68 64 63 94 241 198 185 141 78 119 206 178 233 204 291 106
4644 106 107 185 146 124 73 58 129 12 80 191 135 76 45 33 68 3 125 182 165 167 114 192 107 154 145 191 154 167 15 72 153 33 41 150
4245 150 148 123 38 112 146 45 150 99 127 225 59 123 154 98 86 89 263 208 162 107 138 119 190 76 149 108 97 93 181 106 78 149 184 133
3846 133 105 84 15 128 124 179 140 98 84 90 49 83 198 205 185 252 10 103 241 155 211 67 155 161 141 122 120 88 60 117 60 45 104 177 198
3435 198 131 19 57 77 73 178 257 102 307 156 156 290 256 154 90 111 92 68 35 106 10 93 148 54 243 255 113 225 102 164
3083 164 49 103 105 251 260 167 148 60 25 92 53 266 122 157 152 73 31 46 101 70 115 41 129 91 51 46 40 142 103 102 49 86 57 50 79 125
$$ packed form
5806A96j14R2p4O0n3q8N4L1n9J74m3N4j24n4PN8l4NM1m4K8K7M4q6l7L5n4O3N3p8k2M1o8M7
5407G8J1L1M4j13J20J5j00M8J29j15n1m4MJ9j8K6MM0j0K2lJ60j04j42J45J55k01N3R1P0j12
5043B52j37rK1J05j8k6m1l5M2o2rQ2J1j25Q4O2q4J42j87mjL1J47m3j3m4o3M1Q7k8N5k9Q7j85
4644A06JP8l9k2n1j5P1j17O8J11n6n9l1j2L5o5J22N7j7Kn3P8q5M7rM6l7J3j52N7Q1j20QJ09
4245A50kk5q5P4L4j01J05n1K8R8j66O4L1n6j2LJ74n5m6n5L1j9P1j14P3m1j1mQ8p5k8P1L5n1
3846A33k8k1o9J13mN5l9m2j4Om1L4J15Pk0O7k42R3J38q6N6j44Q8Ok0j9kl2k8N7n7j5N9P3K1
3435A98o7j12L8K0mJ05P9j55K05j51%J34l4j02o4K1j9k4l3P1r6Q3N5r4J89J2j42J12j23O2
3083A64j15N4KJ46Rr3j9q8l5O7l9K13j44L5np9m2J5N5l1M5p4Q8l8m0noJ02l9jn3L7k9pK9M6
$$ plain form
2661 125 67 62 128 103 25 43 108 86 130 52 142 276 242 158 170 140 137 47 142 152 179 338 136 36 242 200 161 282 172 81 118 102
2285 102 128 16 129 42 20 45 89 11 56 225 52 259 63 46 73 231 106 94 59 41 259 263 97 159 178 172 198 259 169 33
1933 33 216 51 76 107 287 85 54 69 58 105 83 217 338 356 30 200 143 148 164 91 109 122 170 97 85 65 49 52 188 71 176
1569 176 233 139 22 101 159 153 59 241 232 172 130 123 101 73 160 165 77 57 65 143 180 76 210 140 124 163 105 70 66 320 339 128 204 199 20
1158 20 144 77 127 127 88 98 47 49 59 262 134 87 38 86 66 77 224 196 40 108 290 129 85 143 177 131 116 86 140 136 73 298 223
771 223 123 169 189 49 165 179 113 73 93 194 127 97 207 115 77 143 133 74 63 11 113 283 198 26 132 14 202 281 201 133
419 133 126 75 136 301 176 111 229 180 77 46 141 170 203 114 220 162 115 74 26 102 48 192 108 287 76 76 159 238 140 85 185 220
43 220 197 38 193 123 203 170 50 52 37 158 22 145 111 97 136 68 144 101 81 165
$$ packed form
2661A25n8nO6k5p8J8O5k2M4p8R0J34l4q4J2l0lr0R5J0K7J59k02j00K06m2l9J21j10r1L7j6
2285A02K6j12J13q7k2K5M4p8M5J69j73K07j96j7K7J58j25j2l5j8K18Mj66O2J9oK6O1r0j36
1933C3J83j65K5L1J80k02l1J5j1M7k2J34J21J8l26J70n7NJ6p3J8J3M8p3j2k0j6LJ36j17J05
1569A76N7r4j17P9N8or4J82ro0m2pk2k8Q7Nq8k0QP8L7j04J34p0j6L9n8l5mK54J9k11P6nj79
1158B0J24o7N0%l9J0n1KJ0K03j28m7m9M8k0J1J47k8j56O8J82j61m4N8L4m6j5l0N4mo3K25p5
771B23j00M6K0j40J16J4o6m0K0J01o7l0J10r2l8O6j0n9j1n2J02J70q5j72J06j18J88P9q0o8
419A33pn1O1J65j25o5J18m9j03l1R5K9L3q9J06n8m7m1m8P6n4J44q4J79k11%Q3P9r8n5J00L5
43B20k3j59J55p0Q0l3j20Kj5J21j36J23l4j4L9o8P6m3k0Q4
-192A65
##PAGE=	F1=-12159.3
##FIRST=	25164.767445380970457,	5806.2096540000038658,	0
##DATA TABLE=	(F2++(Y..Y)), PROFILE
$$ plain form
5806 203 71 176 79 96 83 40 94 60 11 183 151 278 160 43 41 114 108 149 137 40 134 105 195 118 91 127 37 108 138 59 114 103 59
5419 59 31 110 101 203 110 210 170 98 106 243 104 122 113 97 64 53 83 99 100 157 170 143 260 174 26 213 385 154 164 260 376 248
5043 248 137 118 101 238 178 128 119 91 187 148 95 143 140 87 133 199 113 217 93 7 43 141 254 227 230 157 118 89 180 200 276 159 320
4656 320 153 90 223 187 98 82 96 150 30 108 191 93 99 99 65 76 33 128 224 166 168 112 214 107 107 129 197 151 145 28 50 127 19 38
4257 38 166 151 97 87 125 165 56 199 132 113 238 33 111 141 80 44 126 261 226 161 81 129 168 156 41 191 178 79 90 166 96
3893 96 91 153 180 135 110 81 75 175 137 147 103 99 89 90 52 53 161 180 187 247 35 127 241 203 202 109 134 175 107 107 103 79 113 49 27 48 121 144
3447 144 163 141 48 73 28 54 206 253 84 298 150 156 280 280 182 82 109 80 93 34 105 20 75 131 63 216 255 120 178 84 108 42
3071 42 93 95 251 248 180 195 84 60 67 116 280 99 103 126 133 77 79 43 116 168 22 137 123 10 92 61 127 91 70 98 146 38 66 113
$$ packed form
5806B03j32J05r7J7j3m3N4l4m9J72l2J27j18j17kP3oM1j2r7R4k9R0p7k7L6r0P1L0p9N5j1m4
5419E9k8P9rJ02r3J00m0p2QJ37j39J8rj6l3j1L0J6JN7J3k7J17q6j48J87J72k31J0R6J16j28
5043B48j11j9j7J37o0n0rk8R6l9n3M8ln3M6O6q6J04j24q6L6R8J13k7Lp3l9k9R1K0P6j17J61
4656C20j67o3J33l6q9j6J4N4j20P8Q3r8O%l4J1m3R5R6n8Kn6J02j07%K2O8m6oj17K2P7j08J9
4257C8J28j5n4j0L8M0j09J43o7j9J25k05P8L0o1l6Q2J35l5o5q0M8L9j2j15J50j3r9J1P6p0
3893I6nO2K7m5k5k9oJ00l8J0m4mj0Jl8JJ08J9PO0k12R2J14l8jr3K5M1o8%mk4L4o4k2K1P3K3
3447A44J9k2r3K5m5K6J52M7j69K14j48OJ24%r8j00K7k9J3n9P1q5N5N6o8J53L9j35N8r4K4o6
3071D2N1KJ56lo8J5j11k4PM9J64j81MK3Pn6Kl6P3N2j46J15j4j13Q2l1O6l6k1K8M8j08K8M7
$$ plain form
2672 113 124 97 64 150 124 22 42 161 104 117 102 81 269 234 87 157 150 151 118 178 150 156 299 131 58 241 179 142 331 224 68
2308 68 116 116 121 50 149 42 27 58 92 38 87 245 65 223 43 46 102 192 20 133 16 29 248 247 68 141 140 94 257 287 143 61
1933 61 202 66 120 94 301 60 151 39 54 106 69 182 254 252 77 197 131 174 208 146 93 157 144 97 62 70 40 28 162 64 157 264
1557 264 199 30 120 194 97 79 189 217 176 125 101 71 90 156 141 81 76 138 108 215 69 170 120 111 100 109 102 42 334 342 152 219 169 35
1158 35 145 50 136 147 132 95 9 23 56 247 166 81 53 61 33 81 236 177 24 127 277 124 128 171 192 114 121 87 139 104 10 263 222
771 222 51 180 224 63 168 187 127 40 89 205 176 127 214 158 51 144 123 55 94 61 121 245 188 32 149 63 221 255 203 181
419 181 154 69 80 267 176 134 213 146 55 54 173 187 198 81 266 182 91 51 67 126 84 222 148 278 71 143 185 258 173 76 200 248
43 248 178 54 203 116 187 125 90 5 11 138 28 205 95 131 145 56 117 87 73 180
$$ packed form
2672A13J1k7l3Q6k6j02K0J19n7J3j5k1J88l5j47P0pJl3O0k8OJ43j68p3J83o2l7J89j07j56
2308F8M8%Np1R9j07j5L1L4n4M9J58j80J58j80LN6R0j72J13j17J3K19jj79P3jm6J63L0j44q2
1933F1J41j36N4k6K07k41R1j12J5N2l7J13P2kj75J20o6M3L4o2n3O4j3m7l5Ql0j2J34r8R3J07
1557B64o5j69R0P4r7j8J10K8m1n1k4l0J9O6j5o0nO2l0J07j46J01n0rj1Rpo0K92Qj90O7n0j34
1158C5J10r5Q6J1j5l7q6J4L3J91q1q5k8Qk8M8J55n9j53J03J50j53MM3K1p8Pl4N2l5r4K53m1
771B22j71J29M4j61J05J9o0q7M9J16k9m9Q7n6j07R3k1o8L9l3O0J24n7j56J17q6J58L4n2k2
419A81k7q5J1J87r1m2P9o7r1jJ19J4J1j17J85q4r1m0J6N9m2J38p4J30k07P2M2P3q5r7J24M8
43B48p0j24J49q7P1o2l5q5OJ27j10J77j10L6J4q9O1l0j4J07
-192A80
##PAGE=	F1=-12261.6
##FIRST=	25164.767445380970457,	5806.2096540000038658,	0
##DATA TABLE=	(F2++(Y..Y)), PROFILE
$$ plain form
5806 198 65 166 37 38 111 68 126 54 46 139 126 318 209 51 39 101 139 206 175 13 152 91 172 124 124 164 26 125 99 52 168
5442 168 95 98 72 116 63 235 176 241 148 111 65 218 57 186 174 117 90 91 99 119 68 180 181 123 218 151 11 196 367 137 114 223
5067 223 359 239 166 137 75 241 172 62 79 75 208 200 124 116 96 120 135 203 101 189 123 39 65 163 256 240 259 163 149 48 154 208
4691 208 317 121 339 179 61 249 216 82 80 135 149 28 143 187 55 116 139 89 60 54 140 264 170 156 109 219 110 64 107
4351 107 198 124 131 45 42 100 79 113 167 138 82 127 130 182 83 224 135 127 234 12 92 140 87 19 148 239 233 133 58 142 209 137 83 226
3952 226 264 60 90 149 93 109 158 170 114 110 83 132 218 163 107 107 103 85 74 48 44 84 132 187 251 55 141 232 233 184 147 118 162 87 88 114 125
3517 125 151 26 26 56 142 113 116 142 72 83 76 41 217 234 57 245 131 157 259 294 207 77 111 77 127 50 101 27 78 119 100 190 228
3130 228 124 127 113 62 40 78 103 237 227 179 219 110 96 48 180 259 68 53 114 198 150 102 90 138 193 16 151 158 42 154 104
$$ packed form
5806A98j33J01j29JP3m3N8p2qR3j3J92j09j58j2O2L8O7l1j62J39o1Q1m8%M0j38R9k6m7J16
5442A68p3Lk6M4n3J72n9O5r3l7m6J53j61J29j2n7k7JQK0n1J12Jn8R5o7j40J85J71k30k3J09
5067B23J36j20p3k9o2J66o9j10J7mJ33qp6qk0K4J5O8j02Q8o6q4K6R8R3j6J9r6j4j01J06N4
4691B08J09j96K18j60j18J88l3j34kN5J4j21J15M4j32O1K3n0k9oQ6J24r4j4m7J10j09m6M3
4351A07R1p4Pq6lN8k1L4N4k9n6M5LN2r9J41q9qJ07k22Q0M8n3o8J29R1oj00p5Q4O7p2n4J43
3952B26L8k04L0N9n6J6M9J2n6mk7M9Q6n5n6%mj8j1k6mM0M8N5O4j96Q6R1Jm9l7k9M4p5JK6J1
3517A25K6j25%L0Q6k9LK6p0J1pl5J76J7j77J88j14K6J02L5q7j30L4l4N0p7N1p4N1M1j9R0L8
3130B28j04Lj4n1k2L8K5J34j0m8M0j09j4m8J32P9j91j5O1Q4m8m8j2M8N5j77J35Pj16J12n0
$$ plain form
2766 104 84 71 23 167 188 27 80 138 125 152 74 188 140 31 69 204 116 95 152 38 242 226 30 140 167 164 189 203 120 126 235
2402 235 123 76 243 194 124 372 263 101 107 109 130 85 153 67 45 59 78 65 119 258 132 198 29 50 123 147 46 162 31 18
2050 18 239 218 65 131 106 111 303 304 109 73 176 72 200 122 304 48 210 48 51 117 73 136 174 141 143 190 107 184 242 206 96
1686 96 181 118 92 55 99 34 51 116 53 119 279 240 60 134 212 36 84 123 189 173 105 73 63 147 135 100 98 97 193 94 248 77 141 117
1287 117 96 41 109 132 17 318 324 186 232 130 69 134 58 135 164 187 99 12 25 67 219 185 70 74 59 15 85 245 154 71 165 262
912 262 126 157 195 208 85 125 97 140 61 63 217 224 46 198 247 64 150 162 120 26 80 201 221 147 192 186 48 136 96 85 116 119 103
524 103 116 84 67 145 109 224 208 190 226 173 154 91 204 172 145 186 94 27 95 190 189 174 46 282 191 32 35 105 149 113 223 172 258
137 258 73 184 185 242 183 63 205 263 153 59 195 96 164 85 156 67 46 132 86 261 81 154 140 43 89 61 68 190
$$ packed form
2766A04k0j3m8J44K1j61N3N8j3K7p8J14m8j09L8J35q8k1N7j14K04j6j96J10K7lK5J4q3OJ09
2402B35j12m7J67m9p0K48j09j62OKK1m5O8q6k2J4J9j3N4J39j26O6j69K1P3K4j01J16j31j3
2050A8K21k1j53O6k5NJ92Jj95l6J03j04J28p8J82k56J62j62LO6m4O3L8l3KM7q3P7N8l6j10
1686I6Q5o3k6l7M4o5J7O5o3O6J60l9j80P4P8j76M8L9O6j6o8l2j0Q4j2l5kjR6r9J54j71O4k4
1287A17k1n5O8K3j15L01Oj38M6j02o1O5p6P7K9K3q8q7J3M2J52l4j15Mj5m4P0J60r1q3R4R7
912B62j36L1L8J3j23M0k8M3p9KJ54Pj78J52M9j83Q6J2m2r4N4J21K0p4M5oj38Q8m0j1L1Lj6
524A03J3l2j7P8l6J15j6j8L6n3j9o3J13l2k7M1r2o7O8R5jj5j28K36r1j59LP0M4l6J10n1Q6
137B58j85J11JN7n9j20J42N8j10r4J36r9O8p9P1q9k1Q6m6J75j80P3j4r7M6k8PJ22
-192A90
##PAGE=	F1=-12363.9
##FIRST=	25164.767445380970457,	5806.2096540000038658,	0
##DATA TABLE=	(F2++(Y..Y)), PROFILE
$$ plain form
5806 187 67 148 25 64 150 83 155 119 94 106 126 336 238 65 55 86 177 248 209 37 169 94 118 112 146 198 40 159 52 64 214
5442 214 80 131 154 113 13 245 228 260 127 119 31 199 34 254 232 111 122 130 131 149 56 182 154 91 175 131 22 152 297 96
5090 96 70 194 323 224 185 154 51 235 194 38 45 75 207 227 131 91 61 145 142 213 84 172 133 66 69 166 242 232 261 158 165 40 133
4703 133 200 346 96 333 179 38 260 230 80 62 159 121 34 179 182 36 129 159 97 28 59 165 292 181 132 104 203 115 72
4362 72 90 192 78 130 61 59 92 144 189 155 113 85 148 125 189 107 216 109 171 219 27 73 146 99 51 145 196 236 86 54 152 242 136
3975 136 131 249 340 60 100 135 103 126 154 143 75 106 89 154 246 187 64 155 115 61 52 47 85 36 70 187 255 61 140 215 239 172 170 113
3576 113 124 95 66 141 167 166 94 65 68 160 106 79 143 87 90 154 66 210 206 26 158 101 162 229 302 219 78 109 77 153 75 95 24 94 112
3165 112 117 175 187 122 89 153 51 42 70 133 213 205 171 213 132 138 43 233 213 58 11 127 253 208 111 125 126 188 22 168 188 87 225
$$ packed form
5806A87j20Q1j23L9Q6o7P2l6k5J2K0K10r8j73j0L1R1P1l9j72J32p5K4oL4N2j58J19j07J2J50
5442B14j34N1K3m1j00K32j7L2j33qq8J68j65K20k2j21J1QJJ8r3J26k8o3Q4m4j09J30J45k01
5090I6k6J24J29r9l9l1j03J84m1j56PL0J32K0r6m0l0Q4lP1j29Q8l9o7LR7P6j0K9j03Pj25R3
4703A33O7J46k50K37j54j41K22l0j50j8R7l8q7J45Lj46R3L0o2o9L1J06J27j11m9k8R9q8m3
4362G2J8J02j14N2o9kL3N2M5l4m2k8O3k3O4q2J09j07O2M8j92M6P3m7m8R4N1M0j50l2R8R0j06
3975A36nJ18R1k80M0L5l2K3K8j1o8L1j7O5R2n9j23R1m0n4rnL8m9L4J17O8j94P9P5K4o7kn7
3576A13J1k9k9P5K6jp2k9LR2n4k7O4n6LO4q8J44mj80J32n7O1O7P3q3j41L1l2P6p8K0p1P0J8
3165A12NN8J2o5l3O4j02rK8O3Q0ql4M2q1Or5J90k0j55m7J16J26m5r7J4JO2j66J46K0j01J38
$$ plain form
2778 225 157 36 52 35 231 211 26 86 140 132 199 85 216 149 36 98 230 121 64 189 121 200 223 81 122 186 168 240 209 75
2426 75 99 155 103 85 252 231 100 394 280 154 104 92 143 100 147 82 62 48 51 77 139 269 185 179 46 50 133 105 80 166 54 11 219
2038 219 187 80 149 108 176 323 306 88 65 144 70 269 155 297 56 221 72 55 134 93 84 116 38 187 184 81 179 257 247 111
1686 111 189 97 79 97 144 45 93 66 45 72 279 258 71 138 213 25 80 63 154 158 72 40 74 197 96 47 116 119 216 112 267 93
1311 93 134 127 76 8 104 150 17 270 290 220 234 85 92 116 86 123 174 230 121 16 40 64 189 191 57 82 68 51 79 243 131 94
935 94 183 245 128 163 213 215 47 140 103 137 33 121 169 220 99 207 254 47 119 111 84 52 69 177 255 157 148 190 48 125 61 129 133 171
536 171 154 219 160 114 128 146 216 158 166 244 182 242 179 139 161 140 143 27 9 132 185 172 137 30 260 184 52 37 123 159 131 197 167 218
137 218 58 194 160 196 170 42 200 266 128 48 165 65 143 81 236 125 89 137 146 311 70 162 123 27 72 38 68 199
$$ packed form
2778B25o8j21J6j7J96k0j85O0N4qO7j14J31o7j13O2J32j09n7J25o8P9K3j42M1O4j8P2l1j34
2426G5K4N6n2j8J67k1j31K94j14j26n0j2N1m3M7o5k0j4LK6O2J30q4oj33MQ3k8k5Q6j12m3K08
2038B19l2j07O9m1O8J47j7k18k3P9p4J99j14J42k41J65j49j7P9m1rL2p8J49lj03R8P8j0j36
1686A11P8r2j8J8M7r9M8k7k1K7K07k1j87O7P5j88N5j7R1Mq6l2L4J23j01m9O9LR7j04J55j74
1311I3M1pn1o8R6M6j33K53K0p0J4j49PK4l0L7N1N6j09j05K4K4J25Kj34K5j4j7K8J64j12l7
935I4Q9O2j17L5N0Kj68R3l7L4j04Q8M8N1j21J08M7k07P2qk7l2J7J08P8r8rM2j42P7o4O8ML8
536A71j7O5n9m6J4J8P0n8QP8o2O0o3m0K2k1Lj16j8J23N3j3l5j07K30p6j32j5Q6L6k8O6l0N1
137B18j60J36l4L6k6j28J58O6j38q0J17j00P8o2J55j11l6M8RJ65k41R2l9r6M5l4L0J31
-192A99
##PAGE=	F1=-12466.1
##FIRST=	25164.767445380970457,	5806.2096540000038658,	0
##DATA TABLE=	(F2++(Y..Y)), PROFILE
$$ plain form
5806 177 74 129 75 108 167 83 174 185 140 97 155 325 234 71 72 76 217 268 218 48 183 103 44 82 147 218 72 197 38 84 249
5442 249 76 155 236 108 41 234 256 267 116 122 57 186 64 308 281 84 145 154 165 187 71 165 93 85 136 118 51 102 192 34 49
5078 49 183 289 210 186 170 33 222 231 110 72 90 179 222 110 86 71 156 153 229 79 159 115 71 51 168 223 203 233 142 162 78 117
4703 117 173 355 92 299 161 41 260 227 84 28 164 84 78 206 181 39 142 161 94 14 57 199 302 196 99 97 169 111 106
4362 106 87 177 27 133 78 85 113 200 250 131 91 100 150 108 184 115 178 65 215 206 70 64 157 103 76 119 137 240 39 70 149 266
3987 266 147 160 259 388 70 120 125 117 134 133 102 51 99 107 141 254 199 22 208 128 48 38 62 132 138 12 185 252 49 124 193 229 170
3600 170 168 122 79 121 43 169 189 162 141 105 79 166 113 62 148 94 96 222 110 184 173 41 65 68 169 195 300 211 83 102 70 160 95
3212 95 88 15 116 108 105 172 163 111 82 173 71 62 74 172 184 189 163 180 150 198 48 264 156 84 26 160 284 239 112 134 90 157 31 184
$$ packed form
5806A77j03N5n4L3N9q4R1J1m5m3N8J70r1j63JMJ41N1n0j70J35q0n9L8O5P1j46J25j59M6J65
5442B49j73P9Q1j28o7J93K2J1j51Oo5J29j22K44k7j97O1RJ1K2j16R4p2qN1j8o7N1R0j58J5
5078D9J34J06p9k4j6j37J89Rj21l8J8Q9M3j12k4j5Q5lP6j50Q0m4m4k0J17N5k0L0r1K0q4L9
4703A17N6J82k63K07j38j20K19l3j43n6J36q0oJ28k5j42J03J9o7q0M3J42J03j06r7kP2n8n
4362A06j9R0j50J06n5PK8Q7N0j19m0RN0m2P6o9O3j13J50rj36oR3n4k7M3J8J03k01L1P9J17
3987B66j19J3R9J29l18N0NqJ7jl1n1M8QL4J13n5j77J86q0q0j0K4P0Oj26J73O7k03P5O9L6n9
3600A70km6m3M2p8J26K0k7k1l6k6Q7n3n1Q6n4KJ26j12P4j1j32K4LJ01K6J05q9j28J9l2R0o5
3212I5pp3J01qlO7rn2k9R1j02rJ2R8J2Nk6J7l0M8j50K16j08p2n8J34J24m5j27K2m4O7j26J53
$$ plain form
2813 184 210 142 301 207 74 57 77 275 219 32 81 117 143 229 89 221 152 34 119 236 121 31 200 206 153 225 142 108 206 162
2461 162 258 195 52 82 73 69 87 260 254 74 388 274 201 122 81 151 100 141 83 75 29 28 78 144 276 214 150 62 41 133 69 86 151 53
2062 53 13 178 160 85 184 156 228 313 292 90 43 112 67 309 171 280 94 187 85 62 147 119 36 93 46 205 183 75 169 252 255
1698 255 120 182 87 58 156 188 76 131 44 56 43 262 250 65 129 202 67 81 74 123 127 46 10 74 214 50 43 128 139 202 156 262
1322 262 117 151 149 56 37 93 152 46 197 244 245 215 38 102 99 110 99 177 251 153 46 52 64 166 187 58 68 68 88 59 225 114 93
935 93 173 225 123 144 219 210 11 172 102 124 52 160 127 207 125 200 240 16 88 55 20 73 55 142 273 160 101 164 40 109 46 166
560 166 147 202 242 415 321 138 109 170 202 126 136 228 187 311 276 135 142 127 82 57 49 157 159 137 97 48 207 163 148 36 119 147 142 156
160 156 131 152 30 177 121 133 136 26 186 259 105 26 118 28 127 114 314 173 136 139 200 347 62 153 99 21 74 40 77 201
$$ packed form
2813A84K6o8J59r4j33j7K0J98n6j87M9L6K6Q6j40J32o9j18Q5J17j15r0J69On3P2q3l4R8m4
2461A62R6o3j43L0rmJ8J73oj80L14j14p3p9m1P0n1M1n8qm6jN0O6J32o2o4q8k1R2o4J7O5r8
2062E3m0J65j8p5R9k8P2Q5k1k02m7O9m5K42j38J09j86R3j02k3Q5k8q3N7m7J59k2j08R4Q3L
1698B55j35O2r5k9R8L2j12N5q7J2j3K19j2j85O4P3j35J4pM9Mq1l6O4J40j64pQ5J1O3m6J06
1322B62j45L4kr3j9N6N9j06J51M7Jl0j77O4lJ1j1P8P4r8j07OJ2J02K1j29J0%K0k9J66j11k1
935I3Q0N2j02K1P5rj99J61p0K2p2J08l3Q0q2P5M0k24P2l3l5N3j8Q7J31j13n9O3j24O9o3J20
560A66j9N5M0J73r4j83k9O1L2p6J0R2m1J24l5j41Pj5m5k5qJ08Kk2m0m9J59m4j5j12Q3K8nJ4
160A56k5K1j22J47n6J2Lj10J60P3j54p9R2r0R9j3K00j41l7LO1J47k85R1n4p8N3l4L7J24
-192B01
##PAGE=	F1=-12568.4
##FIRST=	25164.767445380970457,	5806.2096540000038658,	0
##DATA TABLE=	(F2++(Y..Y)), PROFILE
$$ plain form
5806 170 83 113 114 123 150 73 180 228 171 92 185 284 196 68 83 75 256 276 198 45 188 108 50 48 127 220 102 226 84 109 271 103
5431 103 174 304 101 91 207 257 259 117 122 96 173 105 340 316 46 159 164 189 227 87 132 39 122 107 110 90 75 76 40 51 185 269 206
5043 206 168 186 41 204 267 184 130 109 129 187 69 111 105 149 167 250 93 135 71 61 22 192 212 157 176 121 140 109 102 131 346 110
4668 110 247 145 47 254 212 85 19 155 99 130 217 185 48 156 155 93 56 61 236 293 205 67 93 129 97 124 99 153 45 128 96
4304 96 114 142 232 285 99 92 117 139 92 170 105 119 45 237 203 116 74 169 96 85 83 74 248 52 90 134 276 162 165 254 402 74 147
3916 147 118 127 128 102 90 98 89 144 105 242 199 21 245 135 88 43 87 169 228 44 175 234 24 104 175 212 170 143 140 84 143 21 192
3529 192 198 150 162 140 88 154 109 45 151 104 106 266 151 143 142 86 65 40 172 158 281 179 91 94 48 141 102 81 25 139 107 70 177
3142 177 180 87 95 161 98 99 80 210 157 179 159 129 167 274 68 264 103 112 63 200 287 239 106 128 50 109 41 195 220 209 375 240
$$ packed form
5806A70q7L0JRK7p7J07M8n7p9R3R9q8j28J5qJ81K0p8j53J43q0n8kP9R3j18J24j42K5J62j68
5431A03P1J30k03j0J16N0Kj42Nk6P7o8K35k4k70J13NK5L8j40M5r3Q3j5Lk0j5Jl6J1J34Q4o3
5043B06l8J8j45J63O3q3n4k1K0N8j18M2oM4J8Q3j57M2o4j0l9J70K0n5J9n5J9l1pK9K15k36
4668A10J37j02r8K07m2j27o6J36n6L1Q7l2j37J08jo2l7NJ75N7q8j38K6L6l2K7k5N4j08Q3l2
4304I6J8K8R0N3j86pK5K2m7P8o5J4p4J92l4q7m2R5p3j1krJ74j96L8M4J42j14LQ9J48l28P3
3916A47k9RJk6j2QrN5l9J37m3j78K24j10m7m5M4Q2N9j84J31N9k10Q0P1L7m2k7ln6N9j22J71
3529A92Om8J2k2n2O6m5o4J06m7KJ60j15qjn6k1k5J32j4J23j02q8Lm6R3l9k1n6J14l2l7J07
3142A77Lr3QO6o3Jj9J30n3K2k0l0L8J07k06J96j61Rm9J37Q7m8j33K2p8N9o8J54K5j1J66j35
$$ plain form
2766 240 137 95 107 290 219 37 66 79 153 233 85 200 151 27 122 222 115 49 178 262 118 229 187 98 227 150 241 167 82
2426 82 76 70 48 85 257 246 70 352 251 230 157 91 152 98 140 76 83 10 45 67 135 275 217 104 59 25 124 43 78 141 50 26 118 134
2027 134 70 212 219 259 274 262 101 27 84 69 313 164 254 147 126 83 62 150 143 32 92 99 200 190 95 166 230 232 112 166 91 34 211
1639 211 222 113 161 66 81 58 231 221 53 110 185 95 91 113 105 87 63 43 48 185 69 110 132 150 165 214 233 147 188 186 58 49 83 139
1240 139 76 111 193 254 173 53 108 88 122 73 174 250 179 101 61 96 156 180 84 38 55 124 28 188 106 89 150 201 104 108 210 198 43
853 43 216 94 99 63 170 100 183 118 181 203 31 84 61 65 90 45 112 272 163 89 119 35 88 57 189 160 196 251 411 299 95 85
477 85 176 192 117 104 185 181 350 356 197 123 115 22 142 91 168 131 87 70 60 147 149 239 17 97 118 148 116 74 70 28 142 79 84 92 32 167
55 167 242 87 29 77 13 118 151 376 209 179 123 236 357 54 129 87 43 89 52 91 195
$$ packed form
2766B40j03m2J2J83p1j82K9J3P4Q0j48J15m9j24R5J00j07o6J29Q4j44J11m2q9J29p7R1p4q5
2426H2ook2L7J72j1j76K82j01k1p3o6O1n4M2o4Pp3L5K2O8J40n8j13m5l4R9q1L5O3r1k4R2J6
2027A34o4J42PM0J5j2j61p4N7j5K44j49R0j07k1m3k1Q8pj11O0PJ01j0r5P1O4Kj20N4p5n7J77
1639B11J1j09M8r5J5k3J73j0j68N7P5r0mK2qj8k4k0NJ37j16M1K2J8J5M9J9q6M1kj28rL4N6
1240A39o3L5Q2O1q1j20N5k0L4m9J01P6p1p8m0L5O0K4r6m6J7O9r6J60q2j7O1N1r7MJ02j2j55
853D3J73j22Nl6J07p0Q3o5O3K2j72N3k3MK5m5O7J60j09p4L0q4N3l1J32k9L6N5J60j12k04j0
477H5R1J6p5j3Q1mJ69Oj59p4qr3J20n1P7l7m4j7j0Q7KR0k22Q0K1L0l2m2mm2J14o3NQo0J35
55A67P5j55n8M8o4J05L3K25j67l0n6J13J21l03P5m2m4M6l7L9J04
-192A95
##PAGE=	F1=-12670.6
##FIRST=	25164.767445380970457,	5806.2096540000038658,	0
##DATA TABLE=	(F2++(Y..Y)), PROFILE
$$ plain form
5806 159 90 102 129 106 97 59 177 240 178 73 197 224 130 61 90 86 288 295 162 33 181 111 130 60 90 205 123 237 135 140 280
5442 280 149 194 349 87 130 180 233 237 128 120 122 155 142 347 330 12 166 169 191 260 93 89 97 163 84 100 129 85 28 117 56 181 259
5055 259 212 136 195 72 186 292 240 190 124 75 137 21 143 129 122 184 271 112 100 12 58 46 232 220 107 99 99 102 127 85 82 327 136
4668 136 192 150 35 248 189 86 62 144 159 170 203 192 61 173 150 98 90 76 265 267 202 53 99 101 78 118 113 118 89 116 115 144 161 237
4269 237 292 71 112 131 123 98 157 81 51 79 222 199 155 106 183 80 84 77 37 260 98 100 117 275 174 147 231 377 63 177 116 127
3893 127 109 83 141 165 78 193 81 218 189 54 262 131 140 58 113 193 282 69 157 201 34 92 167 194 173 124 158 141 150 4 209
3529 209 205 143 158 169 103 131 87 13 149 129 124 278 178 92 124 126 125 28 162 120 238 123 100 86 39 92 92 74 49 154 109 28 184
3142 184 214 55 106 122 131 140 76 244 142 171 157 74 182 348 108 230 68 125 100 231 261 215 90 120 32 54 50 198 218 277 436
$$ packed form
5806A59o9J2K7k3rl8J18O3o2j05J24K7r4o9K9mK02Pj33j29J48p0J9p0L0J15q2J14j02NJ40
5442B80j31M5J55k62M3N0N3Mj09qKL3j3K05j7l18J54LK2O9j67mQO6p9J6K9m4n7Q9o1J25P8
5055B59m7p6N9j23J14J06n2n0o6m9O2j16J22j4pO2Q7j59j2q8M6j2J86j2j13q%LK5m2lK45j91
4668A36N6m2j15K13n9j03k4Q2J5J1L3j1j31J12k3n2qj4J89Ko5j49M6Kk3M0nNk9K7jK9J7P6
4269B37N5k21M1J9qk5N9p6l0K8J43k3m4m9P7j03Mpm0K23j62KJ7J58j01k7Q4J46l14J14o1J1
3893A27j8k6N8K4q7J15j12J37k9j35K08j31Rq2N5Q0Q9k13Q8M4j67N8P5K7k1m9L4j7Rj46K05
3529B09mo2J5J1o6K8m4p4J36k0nJ54j00q6L2Kjr7J34m2J18j15k3j4m7N3%j8k5J05m5q1J56
3142A84L0j59N1J6RRo4J68j02K9j4q3J08J66k40J22j62N7k5J31L0m6j25L0q8K2mJ48K0N9J59
$$ plain form
2778 436 250 180 147 133 278 215 40 44 33 159 212 78 160 145 22 102 185 107 105 128 276 117 226 212 92 246 154 198 137 110
2426 110 80 151 103 80 238 229 109 292 217 235 193 121 149 101 143 73 86 13 76 52 116 262 201 41 39 17 112 33 83 158 93 42 57
2038 57 102 37 222 274 278 215 220 116 57 62 73 284 142 216 195 85 68 55 143 160 65 90 123 181 204 120 171 199 191 93 151 108 37 254
1639 254 243 147 183 88 104 78 187 176 47 88 169 111 100 124 107 56 93 84 5 118 135 177 126 149 139 265 184 178 236 232 88 47 92 116
1240 116 104 44 142 247 114 113 123 86 121 64 168 232 186 160 77 143 163 175 118 33 48 157 36 140 108 118 143 175 73 75 184 184
865 184 80 260 87 67 42 151 92 156 91 155 143 76 119 110 146 118 50 102 256 163 114 96 33 78 55 204 186 139 141 244 160 78 36
477 36 153 194 123 88 131 152 359 404 256 111 117 78 216 130 173 138 44 76 51 111 169 309 26 79 77 149 89 66 28 53 107 54 87
90 87 52 45 147 216 74 63 78 54 115 177 411 235 208 85 247 332 41 102 101 72 107 53 104 177
$$ packed form
2778D36j86p0l3j4J45o3j75Mj1J26N3j34Q2j5j23Q0Q3p8kK3J48j59J09j4j20J54r2M4o1k7
2426A10l0P1m8k3J58rj20J83p5J8m2p2K8m8M2p0J3p3O3k4O4J46o1j60kk2R5p9N0P5o5n1J5
2038E7M5o5J85N2Mo3Nj04n9NJ1K11j42P4k1j10j7j3Q8J7r5K5L3N8K3q4N1K8qr8N8m3p1K17
1639B54j1r6L6r5J6k6J09j1j29M1Q1n8j1K4j7n1L7rp9J13J7M2n1K3j0J26q1oN8mj44m1M5K4
1240A16j2o0R8J05j33jJ0l7L5n7J04O4m6k6q3O6K0J2n7q5J5J09j21J04l2J0K5L2j02KJ09%
865A84j04J80j73k0k5J09n9O4o5O4j2o7M3rL6k8o8N2J54r3m9j8o3M5k3J49j8m7KJ03q4q2m2
477C6J17M1p1l5M3K1K07M5j48j45Ol9J38q6M3l5r4L2k5O0N8J40k83N3kP2o0k3l8K5N4n3L3
90H7l5pJ02O9j42j1J5k4O1O2K34j76k7j23J62Q5k91O1jk9L5n4N1P3
-192A77
##PAGE=	F1=-12772.9
##FIRST=	25164.767445380970457,	5806.2096540000038658,	0
##DATA TABLE=	(F2++(Y..Y)), PROFILE
$$ plain form
5806 138 90 98 119 63 15 46 171 220 159 50 188 171 48 65 102 103 305 337 141 26 157 111 196 106 43 176 134 228 180 174 282
5442 282 199 217 368 60 154 160 188 198 140 119 131 134 170 331 317 12 163 175 165 280 90 46 157 192 62 82 157 112 92 183 63
5078 63 157 239 215 102 190 101 172 299 269 246 139 62 86 23 162 131 79 203 287 122 59 48 78 93 269 244 65 21 82 64 136
4715 136 67 44 306 161 157 171 26 244 161 93 99 142 212 183 163 198 81 189 149 110 110 90 280 228 184 67 121 100 66 89 118 75
4339 75 115 102 129 178 163 218 277 73 126 141 104 128 152 65 15 107 170 179 179 148 196 72 81 114 54 270 135 96 114 272 180 113 190 315
3940 315 38 208 119 114 88 107 207 221 74 237 108 191 175 81 262 118 180 74 135 208 293 76 131 155 73 91 170 179 185 152 164
3576 164 196 138 18 215 217 146 139 190 129 118 62 40 146 165 148 259 187 45 122 152 150 33 132 84 178 56 106 76 95 27 69 65 71 156
3177 156 118 17 185 232 35 106 75 170 178 60 271 145 154 148 28 191 398 159 170 62 122 127 241 212 175 60 125 38 3 57
$$ packed form
5806A38m8QK1n6m8L1J25M9o1j09J38j7j23J7L7JK02L2j96j15J31m6Q5r0o3J33m2R4m8oJ08
5442B82q3J8J51l08R4OK8J0n8k1J2LL6J61j4l05J51J2j0J15j90m4J11L5j30K0P5m5k0R1j20
5078F3R4Q2k4j13Q8q9P1J27l0k3j07p7K4o3J39l1n2J24Q4j65o3j1L0J5J76k5j79m4O1j8P2
4715A36o9k3K62j45mJ4j45K18q3o8OM3P0k9k0L5j17J08m0l9%k0J90n2m4j17N4k1l4K3K9m3
4339G5M0j3K7M9j5N5N9k04N3J5l7K4K4q7n0R2O3R%l1M8j24RL3o0K16j35l9J8J58r2o7P7J25
3940C15k77J70q9nk6J9J00J4j47J63j29Q3j6r4J81j44O2j06O1P3Q5k17N5K4q2J8P9ROl3J2
3576A64L2n8j20J97Kp1pN1o1j1n6k2J06J9j7J11p2j42P7L0kj17R9m8R4j22N0l0J9o8M2mOQ5
3177A56l8j01J68M7j97P1l1R5Qj18K11j26Roj20J63K07k39J1j08O0NJ14k9l7j15O5q7l5N4
$$ plain form
2825 57 191 207 330 471 237 195 198 164 243 208 39 22 16 162 170 75 117 131 29 66 126 99 163 84 244 137 215 215 88 260 185 156
2449 156 117 113 96 231 184 77 208 245 162 222 183 214 221 168 152 109 138 80 84 34 99 40 92 238 177 30 50 40 103 43 110 192 156 58
2050 58 52 61 34 212 308 291 150 175 149 106 47 75 230 123 161 225 114 48 49 133 171 93 79 126 161 221 136 178 164 149 77 147 132 68
1651 68 280 249 171 199 102 116 87 140 126 50 79 161 120 100 96 130 67 109 117 55 42 196 229 113 136 141 288 134 203 281 272 121 50 124
1252 124 96 127 71 97 223 57 167 149 94 105 82 161 206 170 204 106 182 184 175 147 66 64 184 78 90 118 171 174 150 41 87 145 171 108
853 108 285 80 67 27 114 102 133 87 131 62 121 176 149 208 157 65 112 230 154 141 136 30 123 32 218 258 31 401 1023 941 372
489 372 92 92 215 153 123 95 92 340 413 277 107 135 145 265 161 179 179 53 100 28 112 216 346 84 94 40 149 74 145 92 72
125 72 101 64 118 46 56 128 193 66 90 101 86 114 190 416 256 213 32 231 270 27 91 127 100 124 40 110 153
$$ packed form
2825E7J34J6J23J41k34m2Ll4P9l5j69j7oJ46Qr5M2J4j02L7O0k7O4p9J60j07P8%j27J72p5k9
2449A56l9mj7J35m7j07J31L7q3O0l9L1Pn3j6m3K9n8Mn0O5n9N2J46o1j47K0j0O3o0O7Q2l6r8
2050E8oRk7J78R6j7j41K5k6m3n9K8J55j07L8O4j11o6JQ4L8p8j4M7L5O0q5M2j4j5p2P0j5o4
1651F8K12l1p8K8r7J4k9N3j4p6K9Q2m1k0mL4o3M2Qo2j3J54L3j16K3NJ47j54O9P8rj51p1P4
1252A24k8L1n6K6J26j66J10j8n5J1k3P9M5l6L4r8P6Krk8q1kJ20j06J2K8N3Lk4j09M6N8K6o3
853A08J77k05j3m0Q7j2L1m6M4o9N9N5k7N9n1r2M7J18p6j3nj06R3r1J86M0k27L70O22q2n69
489C72k80%J23o2l0k8lK48P3j36j70K8J0J20j04J8%j26M7p2Q4J04J30k62J0n4J09p5P1n3k0
125G2K9l7N4p2J0P2O5j27K4J1j5K8P6K26j60m3j81J99L9k43O4L6k7K4q4P0M3
-192A53
##PAGE=	F1=-12875.2
##FIRST=	25164.767445380970457,	5806.2096540000038658,	0
##DATA TABLE=	(F2++(Y..Y)), PROFILE
$$ plain form
5806 103 82 104 87 43 80 49 175 177 115 72 172 154 41 90 119 120 302 387 158 26 115 110 240 147 20 139 137 204 215 205 279 239
5431 239 242 361 23 161 147 129 142 145 123 128 114 178 295 276 35 153 182 109 284 94 31 184 207 44 50 165 145 117 225 82
5078 82 110 196 199 84 164 112 165 289 266 291 159 98 45 58 163 117 41 221 293 125 22 93 106 138 287 275 46 69 76 72 151 54
4703 54 53 290 183 156 190 63 237 128 110 123 148 237 170 99 198 100 196 154 122 113 99 275 182 152 86 150 113 65 46 104 31 119 93
4316 93 136 215 157 184 250 105 123 147 80 158 161 77 67 111 88 141 188 185 205 85 87 154 65 274 159 77 135 280 177 71 132 224 33
3928 33 237 123 94 77 155 259 255 87 264 154 170 162 100 251 104 198 86 150 216 269 85 107 107 107 95 180 171 208 202 154 228 114 33
3541 33 209 231 152 115 201 163 131 75 90 146 198 174 218 183 47 133 156 133 39 87 59 130 45 105 72 170 72 41 66 85 143 137 40 175
3142 175 217 44 96 59 205 206 45 290 167 124 129 18 184 405 207 104 79 108 135 228 151 132 23 150 61 42 60 178 186 354
$$ packed form
5806A03k1K2j7m4L7l1J26Ko2m3J00j8j13M9K9JJ82Q5k29j32Q9nJ30r3j27J19kO7J1j0P4m0
5431B39LJ19l38J38j4j8J3Lk2Nj4O4J17j9k41J18K9p3J75j90o3J53K3j63OJ15k0k8J08j43
5078H2K8Q6Lj15Q0n2N3J24k3K5j32o1n3J3J05m6p6J80P2j68j03P1J3L2J49j2k29K3PmP9r7
4703E4jK37j07k7L4j27J74j09j8J3K5Q9o7p1R9r8R6m2l2rj4J76r3l0o6O4l7m8j9N8p3Q8k6
4316I3M3P9n8K7O6j45J8K4o7P8Lq4j0M4k3N3M7lK0j20KO7q9K09j15q2N8J45j03j06O1R2j91
3928C3K04j14k9j7P8J04mj68J77j10J6qo2J51j47R4j12O4O6N3j84K2%%j2Q5rL7om8P4j14q1
3541C3J76K2p9l7Q6l8l2n6J5N6N2k4M4l5j36Q6K3k3r4M8k8P1q5O0l3R8r8l1K5J9N8or7J35
3142A75M2j73N2l7J46Jj61K45j23m3Nj11J66K21j98j03k5K9K7R3p7j9j09J27q9j9J8J18QJ68
$$ plain form
2790 354 470 201 185 235 196 195 197 37 5 52 159 117 78 91 110 44 52 52 102 214 119 173 150 205 203 87 265 226 143 109 101 129 294 260
2391 260 84 179 303 207 167 153 174 233 225 164 120 118 93 83 59 107 39 68 206 153 97 108 66 100 66 139 218 205 69 89 31 80 186
2003 186 311 303 95 141 204 158 38 76 163 129 91 228 154 38 50 125 177 113 63 126 150 234 140 188 134 122 76 155 157 97 288 241 185
1616 185 214 114 113 88 103 82 54 87 162 125 94 35 167 106 106 136 101 75 236 259 98 115 145 266 115 211 311 293 145 72 162 85
1240 85 139 109 73 188 57 200 176 110 73 110 146 176 132 217 139 204 210 177 163 86 82 197 109 55 132 219 222 131 29 128 99 158 125 281
841 281 66 119 110 83 121 118 130 106 38 161 240 170 237 194 78 127 205 132 155 198 40 206 78 237 390 130 1016 2389 2170 799
489 799 250 44 250 216 190 95 47 300 389 249 107 162 192 277 185 195 221 80 121 46 122 263 344 149 128 39 157 57 228
149 228 134 89 135 86 140 61 73 117 186 76 99 107 103 112 190 394 274 191 33 191 183 35 108 147 121 135 27 110 129
$$ packed form
2790C54J16k69j6N0l9jKj60l2M7J07m2l9J3J9o6Q%N0J12r5N4k3N5kj16J78l9q3l4qK8J65l4
2391B60j76R5J24r6m0j4K1N9qo1m4kk5j0k4M8o8K9J38n3n6J1m2L4l4P3P9j3j36K0n8M9J06
2003A86J25qk08M6O3m6j20L8Q7l4l8J37p4j16J2P5N2o4n0O3K4Q4r4M8n4j2m6P9Ko0J91m7n6
1616A85K9j00jk5J5k1k8L3P5l7l1n9J32o1%L0l5k6J61K3j61J7L0J21j51R6J00j8j48p3R0p7
1240H5N4l0l6J15j31J43k4o6l7L7L6L0m4Q5p8O5Ol3j4p7mJ15q8n4P7Q7Lr1j02R9k9N9l3J56
841B81k15N3rk7L8lJ2k4o8J23P9p0O7m3j16M9P8p3K3M3j58J66j28J59J53k60Q86J373k19j371
489G99n49k06K06l4k6r5m8K53Q9j40j42N5L0Q5r2J0K6j41M1p5P6J41Q1j95k1q9J18j00J71
149B28r4m5M6m9N4p9J2M4O9j10K3QmRP8K04j20q3j58J58qj48P3L9k6J4j08Q3J9
-192A29
##PAGE=	F1=-12977.4
##FIRST=	25164.767445380970457,	5806.2096540000038658,	0
##DATA TABLE=	(F2++(Y..Y)), PROFILE
$$ plain form
5806 57 65 116 45 91 169 82 198 128 55 120 169 166 114 124 141 132 273 418 185 22 58 111 258 168 58 96 137 172 237 222 271 261 263 334
5407 334 18 155 137 62 74 138 135 122 96 162 243 214 69 144 186 36 273 130 64 174 217 75 24 148 176 114 239 107 49 133
5055 133 163 92 120 99 167 269 231 314 187 130 14 86 154 104 59 232 290 133 14 115 129 171 280 301 54 130 81 115 176 60
4703 60 79 283 203 178 196 105 223 91 131 133 153 227 144 26 187 108 190 162 136 101 108 251 131 113 98 172 130 59 6 70 7 103 93
4316 93 135 254 163 151 220 143 102 150 47 173 182 101 103 93 8 116 186 203 205 109 101 181 55 270 171 47 163 302 167 41 70 119
3940 119 79 258 123 77 78 199 282 262 120 266 188 160 153 115 238 91 194 84 156 216 227 103 103 89 127 98 189 176 235 235 130
3576 130 234 91 45 193 243 159 96 198 194 147 112 126 148 216 194 173 177 85 144 137 81 49 57 62 129 88 93 86 239 151 36 108 90 116 161
3165 161 59 150 172 49 80 72 222 219 57 300 202 81 101 32 158 367 237 87 108 84 116 198 88 97 61 186 99 77 58 161
$$ packed form
5806E7QN1p1M6P8q7J16p0p3O5M9ln2J0J7rJ41J45k33j63L6N3J47r0j10L8M1L5O5j5M9j0KP1
5407C34l16J37j8p5J2O4lj3k6O6Q1k9j45P5M2j50K37j43o6J10M3j42n1J24K8o2J25j32n8Q4
5055A33L0p1K8k1O8J02l8Q3j27n7j16P2O8n0m5J73N8j57j19J01J4M2J09K1k47P6m9L4O1j16
4703F0J9K04q0k5J8r1J18j32M0KK0P4q3j18J61p9Q2k8k6l5PJ43j20j8j5P4m2p1n3O4o3R6j0
4316I3M2J19r1j2O9p7m1M8j03J26Rq1Kj0q5J08P0J7Kr6qQ0j26K15r9j24J16J39j35j26K9M9
3940A19m0J79j35m6JJ21Q3k0j42J46p8k8pl8J23j47J03j10P2O0J1j24%j4L8k9R1j3N9%j05
3576A30J04j43m6J48N0q4o3J02mm7l5J4K2O8k2k1Mr2N9pn6l2QNO7m1NpJ53q8j15P2j8K6M5
3165A61j02R1K2j23L1qJ50lj62K43r8j21K0o9J26K09j30j50K1k4L2Q2j10Rl6J25q7k2j9J03
$$ plain form
2813 161 154 344 429 149 161 250 216 145 181 37 5 76 147 75 78 88 82 62 95 28 117 249 192 74 140 212 192 96 255 251 158 104 116 175
2414 175 334 318 108 155 363 228 146 128 125 228 279 176 130 80 105 89 87 96 43 61 174 130 151 169 84 101 94 150 220 224 77 106 57
2027 57 119 154 281 309 80 129 262 208 36 77 98 159 50 204 165 48 49 123 183 127 50 138 149 240 136 204 111 108 84 166 180 112
1651 112 279 218 190 227 132 96 81 101 66 60 93 168 125 87 43 208 147 86 139 125 131 251 263 86 93 118 196 135 195 318 287 152 100
1264 100 186 78 136 120 89 150 90 206 195 128 29 135 116 148 80 197 160 209 231 174 166 85 85 191 120 44 145 241 263 122 36 163
888 163 54 144 133 242 36 184 207 81 138 105 180 77 140 196 300 174 232 217 85 142 196 101 157 249 76 293 173 268 558
548 558 303 1771 4030 3632 1296 438 183 288 290 256 104 141 247 352 175 110 192 213 250 202 219 245 88 132 95 123 291
231 291 308 210 154 60 182 32 292 140 115 179 99 143 70 100 124 199 117 86 97 104 108 182 355 286 148 80 139 98 60 138 149 133 137 41
$$ packed form
2813A61pJ90Q5k80J2Q9l4p1L6j44l2P1P1p2LJ0ok0L3o7Q9J32n7j18O6P2k0r6J59mr3n4J2N9
2414A75J59j6k10M7K08j35q2j8lJ03N1j03m6n0K5j6kRn3J8J13m4K1J8q5J7pN6P0Mj47K9m9
2027E7O2L5J27K8k29M9J33n4j72M1K1O1j09J54l9j17JP4O0n6p7Q8J1R1j04O8r3lk4Q2J4o8
1651A12J67o1k8L7r5l6j5K0l5oL3P5m3l8m4J65o1o1N3j4OJ20J2j77PK5P8o1O0J23l1j35n2
1264A00Q6j08N8j6l1O1o0J16j1o7r9J06j9L2o8J17l7M9K2n7qq1%J06p1p6J01R6K2j41q6J27
888A63j09R0j1J09k06J48K3j26N7l3P5j03O3N6J04j26N8j5j32N7N4r5N6R2j73K17j20R5K90
548E58k55J468K259l98k336q58k55J05Kl4j52L7J06J05j77o5Q2K1L7m8J7K6j57M4l7K8J68
231B91J7r8n6r4J22j50K60j52k5O4q0M4p3L0K4P5q2l1J1PMP4J73o9j38o8N9m1l8P8J1j6Mr6
$$ plain form
-168 41 107 112
$$ packed form
-168D1O6N
-192A12
##PAGE=	F1=-13079.7
##FIRST=	25164.767445380970457,	5806.2096540000038658,	0
##DATA TABLE=	(F2++(Y..Y)), PROFILE
$$ plain form
5806 25 43 130 25 140 232 130 226 94 13 158 185 175 173 153 163 138 219 411 196 19 20 118 253 171 90 51 136 140 247 215 252 258
5431 258 273 291 50 138 127 23 4 113 152 118 76 122 178 142 114 153 184 76 251 191 102 139 229 140 60 114 196 118 225 127 21
5067 21 62 120 111 67 60 180 249 168 309 217 148 30 112 143 107 95 232 279 155 38 112 140 187 248 312 79 169 94 148 202 88 95 287
4679 287 222 195 190 130 200 52 146 132 149 189 131 40 165 97 162 166 154 80 124 212 82 80 100 177 151 41 43 22 33 75 96 128 287 198
4280 198 131 193 173 69 152 16 168 206 120 118 72 95 163 182 193 185 126 117 190 33 257 173 33 181 324 150 53 46 40 134 266 112
3905 112 80 81 232 275 242 164 244 198 162 151 128 230 81 172 61 153 205 191 119 122 121 129 107 187 194 255 232 103 213 87 57 177 251
3517 251 170 84 176 211 143 138 137 143 214 204 141 181 117 147 101 32 71 96 87 147 101 68 115 285 210 64 181 91 81 181 82 110 106 35 64
3107 64 70 211 213 83 299 238 29 68 39 113 297 241 128 141 49 87 171 41 85 124 213 137 103 53 145 109 304 356 87 138 240
$$ packed form
5806B5J8Q7j05J15R2j02R6j32q1J45K7j0kk0J0k5Q1J92k15j77JR8J35q2q1l9Q5MJ07l2L7O
5431B58J5J8k41Q8j1j04j9J09L9l4m2M6N6l6k8L9L1j08J75o0q9L7R0q9q0N4Q2p8J07r8j06
5067B1M1N8rm4pJ20O9q1J41r2o9j18Q2L1l6j2J37M7j24j17P4K8M7O1O4k33R0p5N4N4j14PJ92
4679B87o5k7no0P0j48R4j4J7M0n8r1J25o8O5Mj2p4M4Q8j30kK0P7k6j10Kk1J1M2K1L2J59q9
4280A98o7O2k0j04Q3j36J52L8q6km6K3O8J9J1qn9rP3j57K24q4j40J48J43j74r7poR4J32j54
3905A12l2JJ51M3l3p8Q0m6l6j1k3J02j49R1j11R2N2j4p2LjQk2Q0PO1k3j29J10j26l0J20P4
3517B51q1q6R2L5o8njOP1j0o3M0o4L0m6o9L9K5rO0m6l3M7J70p5j46J17r0j0J00r9K8mp1K9
3107F4OJ41Kj30K16o1k09L9k9P4J84n6j13J3r2L8Q4j30M4L9Q9p6l4n0R2l6J95N2k69N1J02
$$ plain form
2743 240 209 99 160 44 10 82 123 70 67 89 49 85 143 100 141 267 255 33 104 240 204 113 229 247 172 95 169 223 345 346 143 134
2367 134 391 219 154 104 87 204 317 177 138 37 111 105 113 70 46 83 152 104 185 214 85 99 120 138 196 208 84 94 94 135 121 224
1992 224 308 113 138 298 246 45 82 45 188 120 161 141 79 42 128 193 136 49 158 152 236 132 225 95 94 92 178 196 107 252 185 191 232
1604 232 150 69 62 130 88 81 88 170 121 76 120 245 185 57 127 120 149 244 246 82 76 51 100 162 153 294 255 144 117 185 63 121 112 122 117 104
1182 104 187 203 139 53 151 72 121 26 149 157 203 238 160 157 75 68 166 110 50 154 230 286 128 34 177 35 132 134 177 14 243 292 87
794 87 140 94 208 37 237 222 348 169 205 218 88 152 207 73 151 284 119 362 272 306 723 458 2509 5619 5039 1774
489 1774 619 368 333 338 296 102 251 185 334 73 126 224 209 197 214 244 248 78 132 139 115 295 249 254 159 78 220 34 323 116
137 116 154 211 97 134 68 131 148 215 172 57 101 98 101 171 312 290 107 106 82 85 86 167 132 135 129 65 104 105
$$ packed form
2743B40l1j10O1j16l4P2M1n3lK2m0L6N8m3M1J26j2k22P1J36l6r1J16J8p5p7P4N4J22Jk03r
2367A34K57j72o5n0j7J17J13j40l9j01P4oQm3k4L7O9m8Q1K9j29J4K1J8N8J2j24J0%M1j4J03
1992B24Q4j95K5J60n2k01L7l7J43o8M1k0o2l7Q6O5n7q7J09oQ4j04R3j30jkQ6J8q9J45o7OM1
1604B32q2q1pO8m2pPQ2m9m5M4J25o0j28P0pK9R5Kj64ok5M9O2rJ41l9j11k7O8j22N8rJ0nj3
1182A04Q3J6o4q6R8p9M9r5J23QM6L5p8lq2pR8n6o0J04P6N6j58r4J43j42R7KM3j63K29M9k05
794H7N3m6J14j71K00j5J26j79L6J3j30O4N5j34P8J33j65K43r0L4M17k65K051L110n80l265
489A774j155k51l5Nm2j94J49o6J49k61N3R8j5j2J7L0Mj70N4Pk4J80m6Nr5q1J42j86K89k07
137A16L8N7j14L7o6O3J7O7m3j15M4lLP0J41k2j83jk4LJQ1l5Loo4L9J
-192A05
##PAGE=	F1=-13181.9
##FIRST=	25164.767445380970457,	5806.2096540000038658,	0
##DATA TABLE=	(F2++(Y..Y)), PROFILE
$$ plain form
5806 52 18 139 56 165 258 174 241 91 62 174 203 164 212 164 180 146 146 362 193 45 86 130 231 163 105 10 136 119 246 182 215
5442 215 229 265 242 66 115 118 70 77 69 171 124 54 85 114 74 157 184 177 166 223 253 138 102 242 206 106 85 197 143 195 132 71 9 89
5043 89 125 38 5 203 237 88 275 239 154 70 131 136 115 113 220 266 177 62 90 136 185 199 298 111 187 116 152 216 133 105 299 238 193
4656 193 177 131 173 17 150 126 135 138 133 83 134 65 114 166 175 61 144 166 50 79 94 160 179 38 72 43 50 51 94 116 308 249 130 167
4257 167 194 32 154 38 145 221 130 113 75 159 252 181 155 144 131 134 187 32 233 168 62 180 332 128 80 78 92 184 261 91
3905 91 101 79 250 242 199 207 212 188 168 154 139 227 69 143 23 137 185 176 125 149 169 119 122 167 210 262 197 92 176 92 76 173 256 182 82
3494 82 136 209 107 140 121 128 192 202 130 195 137 139 61 83 104 155 113 136 78 32 143 298 236 102 259 98 57 190 112 58 38 36 55
3107 55 40 171 189 101 284 265 22 37 41 63 228 214 162 168 23 103 157 35 100 176 214 155 121 48 134 58 246 265 33 125 208 171
$$ packed form
5806E2l4J21q3J09R3q4O7j50k9J12K9l9M8m8J6l4%K16j69j48M1M4J01o8n8r5J26j7J27o4L3
5442B15J4L6k3j76M9Lm8PqJ02m7p0L1K9m0Q3K7pj1N7L0j15l6J40l6j00k1J12n4N2o3o1o2Q0
5043H9L6q7l3J98L4j49J87l6q5q4O1Nk1kJ07M6q9j15K8M6M9J4R9j87P6p1L6O4q3k8J94o1m5
4656A93j6m6M2j56J33k4RLnn0N1o9M9N2Rj14Q3K2j16K9J5O6J9j41L4k9PJM3K2J92n9j19L7
4257A67K7j62J22j16J07P6r1j7l8Q4R3p1k6j1j3LN3j55K01o5j06J18J52k04m8kJ4R2P7j70
3905I1J0k2J71qm3QNk4k0j4j5Q8j58P4j20J14M8rn1K4K0n0LM5M3N2o5j05Q4q4j6R7Q3p4j00
3494H2N4P3j02L3j9PO4J0p2O5n8Kp8K2K1N1m2K3n8m6J11J55o2j34J57j61m1J33p8n4k0kJ9
3107E5j5J31J8q8J83j9k43J5MK2J65j4n2Oj45Q0N4j22O5P6L8n9l4p3Q6p6J88J9k32R2Q3l7
$$ plain form
2731 171 64 141 58 17 68 83 92 41 84 23 115 180 156 168 266 288 133 45 269 237 138 187 211 166 78 227 261 326 341 176 111 375
2355 375 178 175 75 83 164 327 161 141 70 111 125 132 41 48 112 145 74 199 232 74 91 140 102 151 164 96 58 113 125 91 155 302 171
1968 171 155 296 262 65 94 5 198 202 111 92 125 54 140 208 141 60 173 152 221 134 240 84 73 107 194 207 89 209 146 182 216
1604 216 156 37 45 167 126 116 71 162 118 54 180 272 214 34 105 93 127 219 215 82 79 56 99 179 100 242 204 124 116 152 38 99 101 145
1205 145 97 94 152 201 132 127 159 46 95 20 104 124 195 224 131 138 81 35 126 96 71 155 192 289 151 16 171 60 124 133 115 65 287 350
806 350 73 119 85 204 18 318 236 377 159 180 199 90 151 231 59 137 305 150 394 346 339 846 556 3064 6803 6079 2130
489 2130 754 566 410 329 296 96 331 121 346 34 166 253 185 149 223 265 239 68 125 166 104 275 181 274 142 101 255 70
160 70 317 73 196 220 84 120 59 156 175 216 224 23 134 94 99 162 273 285 97 102 30 138 108 187 102 127 110 83 104 106
$$ packed form
2731A71j07P7q3m1N1J5Rn1M3o1R2O5k4J2R8K2j55q8K24l2r9M9K4m5q8J49L4O5J5j65o5K64
2355C75j97lj00QQ1J63j66k0p1M1J4Pr1PO4L3p1J25L3j58J7M9l8M9J3o8l8N5J2l4O4J47j31
1968A71j6J41l4j97K9q9J93Mr1j9L3p1Q6O8o7q1J13k1O9q7J06j56j1L4Q7J3j18J20o3L6L4
1604B16o0j19QJ22m1j0m5R1m4o4J26R2n8j80P1j2L4R2mj33lk3M3Q0p9J42l8q0qL6j14O1KM4
1205A45m8lN8M9o9nL2j13M9p5Q4K0P1K9r3Pn7m6R1l0k5Q4L7R7j38j35J55j11O4Rj8n0K22O3
806C50k77M6l4J19j86L00q2J41k18K1J9j09O1Q0j72P8J68j55K44m8pN07k90K508L739p24l949
489B130j376j88j56q1l3k00K35k10K25l12J32Q7o8l6P4M2k6j71N7M1o2J71r4R3j32m1J54j85
160G0K47k44J23K4j36L6o1R7J9M1Qk01J11m0NO3J11J2j88Np2J08l0P9q5K5j7k7K1K
-192A06
##PAGE=	F1=-13284.2
##FIRST=	25164.767445380970457,	5806.2096540000038658,	0
##DATA TABLE=	(F2++(Y..Y)), PROFILE
$$ plain form
5806 80 10 140 81 163 244 200 229 99 94 165 208 133 231 152 187 165 74 282 196 88 150 146 198 154 104 31 132 118 238 127 160 176 239
5419 239 193 61 89 109 111 143 11 193 143 61 109 76 23 188 220 165 238 192 297 171 83 246 253 137 87 181 169 167 123 103 38 83
5043 83 129 60 70 232 235 22 217 245 148 104 134 131 104 103 198 250 181 82 60 118 165 142 258 138 189 149 123 212 186 123 313 245 165 166
4644 166 114 143 15 143 119 116 91 126 91 95 16 50 161 195 55 153 122 60 105 85 124 212 81 84 102 65 59 83 102 308 297 145 140 208
4245 208 17 155 70 115 215 133 95 100 187 338 181 101 85 121 148 175 56 199 158 96 160 320 102 101 101 144 219 241 61 124 74
3881 74 257 196 143 243 192 165 168 156 146 226 56 121 53 113 164 183 137 170 210 112 135 132 207 255 155 109 132 94 105 181 257 193 92 80
3482 80 190 46 116 85 107 157 191 127 207 144 122 45 141 141 200 130 81 82 8 161 273 226 142 319 111 73 181 141 16 55 98 58
3107 58 35 108 153 100 258 271 62 18 39 48 208 166 168 181 84 173 149 53 125 203 183 143 132 44 128 37 186 179 64 119 164 113 43 130
$$ packed form
5806H0p0J30n9Q2Q1m4K9j30nP1M3p5R8p9L5k2r1K08q6j08O2mN2m4n0p3J01j4J20j11L3J6O3
5419B39m6j32K8K0KL2j32J82n0q2M8l3n3J65L2n5P3m6J05j26q8J63Pj16n0R4j2km4k0o5M5
5043H3M6o9J0J62Lk13J95K8r7m4L0lk7jR5N2o9r9k2N8M7k3J16j20N1m0k6Q9k6o3J90o8q0J
4644A66n2K9j28J28k4lk5L5l5Mp9L4J11L4j40R8l1o2M5k0L9Q8j31LJ8l7oK4J9K06j1j52nO8
4245B08j91J38q5M5J00q2l8NQ7J51j57q0j6L6K7K7j19J43m1o2O4J60k18j%M3P5K2j80O3n0
3881G4J83o1n3J00n1k7Lj2j0Q0j70O5o8O0N1J9m6L3M0r8K3lP5M8j00m6K3l8J1P6P6o4j01j2
3482H0J10j44P0l1K2N0L4o4Q0o3k2p7R6%N9p0m9Jp4J53J12m7q4J77k08l8J08m0j25L9M3m0
3107E8k3P3M5n3J58J3k09m4K1RJ60m2KJ3r7Q9k4r6P2P8k0m0j1q8Q4r1J49pj15N5M5n1p0Q7
$$ plain form
2708 130 78 31 50 38 116 6 74 38 148 208 192 192 250 289 208 30 278 274 167 136 158 142 56 262 274 281 307 195 82 321 113
2344 113 205 36 108 112 305 132 134 135 108 143 143 51 53 129 147 57 199 227 79 76 153 50 96 111 112 32 109 96 78 102 300 236 170 247 248
1933 248 91 114 31 176 260 68 67 175 90 154 219 138 75 176 148 196 138 238 80 48 136 221 212 87 153 107 157 170 137 7 89
1569 89 198 162 151 58 142 120 16 216 284 225 27 79 58 85 184 184 86 108 163 204 182 89 166 149 100 97 89 4 82 94 152 85 75 116 191
1158 191 103 200 160 93 67 52 112 73 192 188 87 108 101 20 86 108 106 148 138 275 187 17 149 95 117 130 111 108 313 371 41 79 90
771 90 169 83 370 235 381 151 176 163 96 133 250 55 106 318 156 384 374 354 893 569 3302 7298 6501 2284 814 749
466 749 548 250 255 113 359 55 367 119 218 276 146 153 225 277 225 84 115 171 89 236 121 266 112 144 272 108 275 46
137 46 230 204 74 108 51 168 193 195 258 35 171 94 108 163 238 271 114 68 21 181 121 196 77 113 81 89 102 109
$$ packed form
2708A30n2m7J9j2P8j10O8l6J10O0j6%N8L9q1j78K48mj07l1K2j6q6K06J2PK6j12j13K39k08
2344A13R2j69P2MJ93j73KJk7L5%r2KP6J8r0J42K8j48lP7j03M6J5Jq0P7j3j8K4J98o4o6P7J
1933B48j57K3q3J45Q4j92jJ08q5O4O5q1o3J01k8M8n8J00j58l2Q8Q5rj25O6m6N0J3l3j30Q2
1569H9J09l6j1r3Q4k2j04K00O8n9j98N2k1K7R9%r8K2N5M1k2r3P7j7m9lqq5P8J2N8o7j0M1P5
1158A91q8R7m0o7k6j5O0l9J19mj01K1pq1O6K2kM2j0J37q8j70J32n4K2J3j9lK05N8l30L8J1
771I0P9q6K87j35J46k30K5j3o7L7J17j95N1K12j62K28j0k0N39l24K733L996p97m217j470o5
466G49k01k98Nj42K46l04L12k48R9N8j30PP2N2n2j41L1N6q2J47j15J45j54L2J28j64J67k29
137D6J84k6j30L4n7J17K5KO3k23J36p7J4N5P5L3j57m6m7J60o0P5j19L6l2QJ3P
-192A09
##PAGE=	F1=-13386.4
##FIRST=	25164.767445380970457,	5806.2096540000038658,	0
##DATA TABLE=	(F2++(Y..Y)), PROFILE
$$ plain form
5806 89 36 130 95 140 197 197 186 95 101 136 193 89 229 121 181 189 59 194 223 134 195 158 162 153 98 61 122 136 228 61 94 113 201 151 34
5395 34 62 102 135 192 53 215 171 103 169 85 5 202 245 145 276 161 313 200 71 227 265 146 111 167 172 158 107 108 46 91 122
5032 122 77 136 261 238 88 150 236 129 117 119 123 62 68 174 227 152 90 41 88 135 93 198 147 179 187 64 192 243 156 322 235 113
4656 113 163 91 115 35 133 114 99 64 89 69 51 39 30 159 204 61 148 88 86 132 80 80 243 131 80 154 90 90 67 90 287 330 172 115
4257 115 221 36 152 94 86 180 132 83 129 179 398 178 57 29 99 155 159 76 154 143 119 128 290 73 113 97 161 233 211 31 140
3893 140 73 257 153 83 264 191 139 152 150 145 220 44 120 117 85 150 205 177 182 239 119 140 106 173 234 147 136 95 94 137 183 251 196 113 17
3482 17 165 32 77 43 95 122 173 111 206 137 100 66 175 173 222 135 45 173 46 166 214 190 179 341 120 111 151 157 55 111 175 73
3107 73 97 39 110 79 223 248 84 33 41 71 235 119 147 174 166 246 131 66 140 201 138 100 136 48 123 72 139 116 110 112 121 89 48 137 99
$$ packed form
5806H9n3R4l5M5N7%j1r1OL5N7j04J40j08O0Qj30J35K9q9O1l7Mrn5l7O1J4R2j67L3J9Q8n0j17
5395C4K8M0L3N7j39J62m4o8O6q4q0J97M3j00J31j15J52j13j29J56L8j19l5N6Nj4n1Jo2M5L1
5032A22m5N9J25k3j50O2Q6j07j2KMo1OJ06N3p5o2m9M7M7m2J05n1L2Qj23J28N1q7J66q7j22
4656A13N0p2K4q0R8j9j5l5K5k0j8j2rJ29M5j43Q7o0kM6n2%J63j12n1P4o4%k3K3J97M3j58n7
4257A15J06j85J16n8qR4m8m9M6N0K19k20j21k8P0N6Mq3P8j1k4RJ62k17M0j6O4P2k2j80J09
3893A40o7J84j04p0J81p3n2J3knP5j76P6ll2O5N5k8NN7j20K1l4O7O1q7j1m1jM3M6O8n5q3r6
3482A7J48j33M5l4N2K7N1o2R5o9l7l4J09kM9q7r0J28j27J20M8k4j1J62k21rM0Oj02N6O4j02
3107G3K4n8P1l1J44K5j64n1QL0J64j16K8K7qQ0j15o5P4O1o3l8L6q8P5n1O7k3oKRl2m1Q9l8
$$ plain form
2696 99 52 73 59 139 44 67 69 177 227 213 213 226 262 249 105 256 296 195 91 124 109 31 260 258 216 251 192 51 247 46 247 14
2320 14 137 53 257 103 117 190 106 157 143 85 60 125 148 84 193 216 125 56 160 13 62 72 125 71 85 65 93 105 306 295 178
1956 178 159 204 118 136 74 123 277 46 120 212 123 155 213 126 93 168 147 162 140 216 94 30 168 255 212 123 89 75 111 92 86 22 165
1569 165 218 188 173 61 108 127 34 224 279 212 32 53 45 76 147 161 94 156 258 292 177 134 79 102 77 66 27 33 81 81 152 76 78 94
1170 94 173 57 258 157 147 39 69 154 84 194 137 40 65 113 57 65 138 142 135 87 250 228 50 124 126 104 126 147 124 322 359 41 69
783 69 119 119 153 390 220 360 146 179 117 104 95 255 54 54 321 132 338 348 340 851 492 3164 6982 6198 2197 790 890
466 890 734 144 182 153 330 25 369 165 267 288 93 193 217 279 210 111 104 160 63 187 81 230 94 203 265 139 204 72
137 72 246 168 73 99 48 167 196 154 263 64 186 86 130 179 204 246 121 20 69 205 127 196 82 100 45 84 95 109
$$ packed form
2696I9m7K1j4Q0r5K3KJ08N0j4%J3L6j3j44J51M0j01j04L3j5p8K29km2L5n9j41J96k01K01k33
2320A4J23q4K04j54J4P3q4N1j4n8k5O5K3o4J09K3r1o9J04j47M9J0N3n4J4k0K8J2K01j1j17
1956A78j9M5q6J8o2M9J54k31P4R2q9L2N8q7l3P5k1J5k2P6j22o4J38Q7m3q9l4j4L6j9oo4J43
1569A65N3l0j5j12M7J9r3J90N5o7j80K1qL1P1J4o7O2J02L4j15m3n5K3k5j1l9OM8%P1p6KJ6
1170I4P9j16K01j01j0j08L0Q5p0J10n7r7K5M8n6QP3Mpm8J63k2j78P4Kk2K2K1k3J98L7l18K8
783F9N0%L4K37j70J40k14L3o2j3rJ60k01%K67j89K06J0qN11l59K672L818p84m001j407J00
466H90j56n90L8k9J77l05L44k04J02K1j95J00K4O2o9r9pN6r7J24j06J49j36J09O2j26O5j32
137G2J74p8r5K6n1J19K9m2J09j99J22j00M4M9K5M2j25j01M9J36p8O9j14J8n5L9J1J4
-192A09
##PAGE=	F1=-13488.7
##FIRST=	25164.767445380970457,	5806.2096540000038658,	0
##DATA TABLE=	(F2++(Y..Y)), PROFILE
$$ plain form
5806 80 62 110 100 111 133 165 120 77 86 99 160 43 205 83 161 206 102 130 259 167 214 159 126 157 120 80 101 165 219 16 41 80 172
5419 172 120 10 38 99 142 219 112 233 199 150 217 102 10 198 254 112 271 134 302 225 40 175 240 132 132 173 144 162 98
5078 98 89 35 108 105 69 189 285 239 154 89 214 99 100 103 109 7 39 160 190 90 86 47 60 107 67 143 128 159 222 32 166 294 196 317
4679 317 206 45 165 72 92 50 137 114 94 58 24 43 13 89 96 164 195 72 147 75 103 143 83 51 265 168 63 192 121 122 53 83
4304 83 249 346 206 95 234 49 143 108 61 121 126 101 160 147 424 169 68 69 67 152 143 88 101 123 130 93 250 46 117 71 148 226 177
3916 177 7 145 86 257 130 30 268 194 123 114 134 133 204 34 130 171 66 142 237 232 188 256 142 134 125 112 202 171 156 72 106 158 166
3529 166 236 190 136 51 146 97 36 29 102 100 149 76 186 123 81 89 182 193 216 129 139 285 74 162 133 145 209 321 121 148 103 157 90 152
3130 152 250 95 157 54 66 43 184 198 87 55 63 81 257 110 112 147 247 294 99 74 134 179 133 36 134 61 113 101 115 90 135 103
$$ packed form
5806H0j8M8j0J1K2L2m5m3RJ3O1j17J62j22P8M5j04K8J29r2M7n5l3L1l7m0K1O4N4k03K5L9R2
5419A72n2j10K8O1M3P7j07J21l4m9O7j15r2J88N6j42J59j37J68p7j85J35O5j08%M1k9J8o4
5078I8rn4P3ll6J20R6m6q5o5J25j15JLOj02L2J21L0j00ml9J3M7m0P6j5L1O3j90J34J28r8J21
4679C17j11j61J20r3K0m2Q7k3k0l6l4J9l0P6PO8L1j23P5p2K8M0o0l2K14r7j05J29p1Jo9L0
4304H3J66R7j40j11J39j85R4l5m7O0Nk5N9j3K77k55j01JkQ5rn5J3K2Pl7J57k04P1m6P7P8m9
3916A77j70J38n9J71j27j00K38p4p1rK0jP1j70R6M1j05P6R5nm4O8j14qrj3R0l1j5q4L4N2Q
3529A66P0m6n4q5R5m9o1pP3kM9p3J10o3m2QR3J1K3q7J0J46k11Q8k9J2O4J12k00K7m5N4o7O2
3130A52R8j55O2j03J2k3J41J4j11l2QJ8J76j47KL5J00M7j95k5O0M5m6r7R8p3N2j2J4k5M5l2
$$ plain form
2754 103 93 147 79 159 117 75 124 117 165 90 70 102 191 235 223 227 201 216 254 171 203 295 223 75 145 85 21 221 213 140 188 167 42 179
2355 179 71 298 67 158 21 195 86 90 222 109 169 134 109 62 105 140 130 187 218 193 36 163 66 86 57 130 115 59 58 120 135
1992 135 315 334 175 72 141 138 152 118 52 247 48 185 221 131 131 182 106 110 158 155 126 139 183 130 52 188 281 208 171 25 58 50 24
1604 24 37 49 235 226 200 174 65 62 130 89 212 255 176 40 32 60 115 119 152 108 206 321 337 166 176 23 67 57 53 100 69 94 54 170
1205 170 91 106 83 143 28 289 150 177 30 75 183 162 194 78 41 24 108 90 68 158 162 117 55 226 266 78 102 151 79 117 167
841 167 102 319 325 85 134 168 97 220 379 195 318 138 165 66 112 57 241 62 19 311 82 271 271 295 723 342 2682 5933
513 5933 5241 1891 692 967 925 215 102 190 257 85 338 165 297 286 35 223 200 268 187 132 96 145 25 147 65 174
207 174 115 259 234 160 117 107 240 120 71 92 60 157 184 101 236 80 170 63 153 206 166 209 100 75 125 213 122 186 108 95 15 73
$$ packed form
2754A03j0N4o8Q0m2m2M9pM8p5k0L2Q9M4j2Mk6J5L8q3L2R2p2j48P0o0o4K00qp3M8k1j25J37
2355A79j08K27k31R1j37J74j09MJ32j13O0l5k5m7M3L5j0N7L1k5j57J27r7K0k9P3j5n6jO2J5
1992A35J80J9j59j03O9lJ4l4o6J95j99J37L6r0%N1p6MM8lk9J3M4n3p8J36R3p3l7j46L3qk6
1604B4J3J2J86rk6k6j09lO8m1J23M3p9j36qK8N5ML3m4R8J15J6j71J0j53M4j0mM7l1K5m0J16
1205A70p9J5k3O0j15K61j39K7j47M5J08k1L2j16l7j7Q4j8k2R0Mm5o2J71M0j88K4M9p2L8N0
841A67o5K17Ok40M9L4p1J23J59j84J23j80K7r9M6n5J84j79m3K92k29J89%K4M28l81K340L251
513E933o92l350j199K75m2p10j13Q8O7j72K53j73J32j1k51J88k3O8q1n5l6M9j20J22q2J09
207A74n9J44k5p4m3j0J33j20m9K1l2R7K7q3J35j56R0j07R0N3m0M3j09k5N0Q8r1O4p8j3q0N8
$$ plain form
-168 73 85 102
$$ packed form
-168G3J2J7
-192A02
##PAGE=	F1=-13591
##FIRST=	25164.767445380970457,	5806.2096540000038658,	0
##DATA TABLE=	(F2++(Y..Y)), PROFILE
$$ plain form
5806 62 85 85 107 97 70 119 44 54 54 66 118 17 159 56 131 205 131 116 277 176 201 140 99 161 174 95 73 192 212 55 62 117 172
5419 172 103 61 18 102 131 224 154 240 218 181 233 97 12 184 250 74 224 126 278 244 14 89 190 102 142 196 90 162 102 54 48
5055 48 133 78 44 221 296 232 197 44 187 62 53 122 86 91 81 159 135 43 79 61 67 90 70 140 83 128 246 109 148 328 229 296 164
4668 164 27 163 51 81 67 160 119 105 82 61 76 45 120 150 178 166 83 172 89 102 129 93 58 268 184 42 213 146 149 51 79 207
4292 207 349 238 86 248 52 126 109 32 62 116 138 189 114 415 155 99 123 30 136 129 99 45 100 129 66 207 24 115 31 125
3940 125 201 150 26 140 117 261 131 27 257 182 139 55 114 107 177 26 131 204 74 131 272 275 192 263 167 126 173 38 162 190
3588 190 165 70 130 158 124 211 180 153 106 138 142 31 46 117 100 119 21 154 111 69 101 172 197 186 120 230 376 91 158 42 116 228
3212 228 268 122 177 44 141 102 176 310 122 199 115 52 13 148 129 74 68 103 62 244 128 86 104 312 305 64 79 107 165 187 33
$$ packed form
5806F2K3%K2j0k7M9p5J0%J2N2j01J42j03P5P4p4j5J61j01K5o1m1O2J3p9k2J19K0j57PN5N5
5419A72o9m2m3Q4K9R3p0Q6k2l7N2j36q5J72O6j76J50r8J52l4k30P5J01q8M0N4j06P2o0m8o
5055D8Q5n5l4J77P5o4l5j53J43j25rO9l6Nj0P8k4r2L6j8OK3k0P0n7M5J18j37L9J80r9O7j32
4668A64j37J36j12L0j4R3m1j4k3k1J5l1P5L0K8j2q3Q9q3J3K7l6l5K10q4j42J71o7Lr8K8J28
4292B07J42j11j52J62j96P4j7p7L0N4K2N1p5L01k60n6K4r3J06pl0n4N5K9o3J41j83R1q4R4
3940A25P6n1j24J14k3J44j30j04K30p5m3q4N9pP0j51J05P3j30N7J41Lq3P1r6m1M7j35J24K8
3588A90k5r5O0K8l4Q7l1k7m7L2Mj11J5P1j7J9r8J33m3m2L2P1K5j1o6J10J46k85O7j16P4J12
3212B28M0j46N5j33R7l9P4J34j88P7q4o3l9J35j9n5oL5m1J82j16m2J8K08pk41J5K8N8K2j54
$$ plain form
2848 33 127 84 97 107 118 108 138 96 86 220 120 185 127 97 170 161 194 130 90 136 186 223 225 231 181 162 227 220 139 272 247 92 193 84
2449 84 51 153 148 64 138 128 84 139 133 345 117 169 67 135 75 60 227 118 179 116 117 56 89 125 174 180 237 261 29 160 108 128 48
2062 48 123 143 62 68 140 153 313 345 163 131 100 146 153 149 62 176 62 228 195 103 80 128 91 121 154 171 91 132 153 176 100 190 281 200
1663 200 205 38 68 24 124 120 70 281 222 199 156 58 25 125 140 188 215 120 52 14 74 151 107 153 126 247 344 338 147 184 85 49 46 82
1264 82 188 103 108 48 216 150 131 71 106 77 287 139 174 57 79 183 233 186 24 77 71 113 114 74 149 155 97 51 215 296 98 83 167
876 167 47 103 159 43 308 287 118 215 224 135 274 343 173 261 123 126 22 120 73 210 83 90 285 36 202 162 225 536 155
536 155 1973 4404 3855 1437 546 967 1068 407 74 207 177 144 277 125 304 269 37 227 176 246 153 140 95 134 40 153
231 153 72 105 156 297 189 171 46 129 215 71 59 86 90 146 162 48 184 82 128 33 167 234 128 158 57 159 183 211 108 168
$$ packed form
2848C3R4m3J3J0J1j0L0m2j0J34j00O5n8l0P3rL3o4m0M6N0L7KOn0j9O5pq1J33k5j55J01j09
2449H4l3J02nq4P4j0m4N5oK12k28N2j02O8o0j5J67j09O1o3Jo1L3L6M9ON7K4k32J31n2K0q0
2062D8P5K0q1OP2J3J60L2j82l2l1M6Pmq7J14j14J66l3r2k3M8l7L0L3J7q0M1K1K3p6R0R1q1
1663B00Nj67L0m4J00mn0K11n9k3m3r8l3J00J5M8K7r5o8l8O0P7m4M6k7J21R7oj91L7r9l6lL6
1264H2J06q5No0J68o6j9o0L5k9K10j48L5j17K2J04N0m7j62N3oM2Jm0P5On8m6J64Q1j98j5Q4
876A67j20N6N6j16K65k1j69R7Rq9J39O9j70Q8j38Lj04R8m7J37j27PJ95k49J66m0O3L11l81
536A55J818K431n49k418q91M21J01o61l33J33l0l3J33j52J79l5k32J90n1P0r3j3m5L9r4J13
231A53q1L3N1J41j08j8j25Q3Q6j44j2K7MN6J6j14J36j02M6r5J34O7j06L0j01J02K4K8j03O0
$$ plain form
-121 168 133 97 43 60 74 84
$$ packed form
-121A68l5l6n4J7J4J0
-192H4
##PAGE=	F1=-13693.2
##FIRST=	25164.767445380970457,	5806.2096540000038658,	0
##DATA TABLE=	(F2++(Y..Y)), PROFILE
$$ plain form
5806 50 103 59 117 105 36 93 27 52 20 51 74 41 95 46 97 182 132 129 257 151 159 98 86 160 238 110 51 212 210 79 97 167 196 99
5407 99 109 10 117 102 206 168 233 222 187 212 71 33 165 241 62 143 147 257 252 84 21 145 66 144 217 28 145 106 14 84 157
5043 157 42 54 230 294 217 214 29 160 42 29 180 51 170 140 163 65 123 93 71 108 74 92 188 55 90 253 183 140 336 246
4691 246 260 127 86 152 21 87 88 196 128 131 136 134 127 85 125 182 199 119 99 215 113 83 90 106 71 247 175 30 215 158 171 58 69
4304 69 172 344 257 89 260 54 108 94 29 90 103 170 208 111 374 135 117 157 14 103 121 116 23 80 121 58 165 14 109 17 114
3940 114 164 136 55 129 159 269 143 62 237 154 189 34 107 71 144 21 118 212 106 113 296 284 196 262 186 121 214 56 122 184 164
3576 164 87 148 129 73 175 165 161 144 140 157 55 52 126 114 96 46 124 118 65 104 155 187 143 115 285 428 98 157 44 109 237 205 133
3189 133 196 33 112 91 186 348 153 217 162 90 42 120 54 55 70 143 36 191 135 84 54 347 277 60 81 66 184 245 90 114 110
$$ packed form
5806E0N3m4N8j2o9N7o6K5l2L1K3l3N4m9N1Q5n0lJ28j06Qo1j2P4P8j28n9J61kj31J8P0K9r7
5407I9J0r9J07j5J04l8O5j1l5K5j41l8J32P6j79Q1MJ10nj68o3J24p9P8P3j89J17l9r2P0P3
5043A57j15J2J76O4p7lj85J31j18j3J51j29J19l0K3r8N8l0k2L7l4J8R6j33L5J63p0m3J96r0
4691B46J4j33m1O6j31O6JJ08o8LNkpm2M0N7J7q0k0J16j02l0PJ6l5J76p2j45J85n7J3j13J1
4304F9J03J72q7j68J71k06N4j4o5O1J3O7L8r7K63k39j8M0j43Q9J8nr3N7M1o3J07j51R5r2R7
3940A14N0k8q1P4L0J10j26q1J75q3L5j55P3l6P3j23R7R4j06PJ83j2q8O6p6o5R3j58O6O2k0
3576A64p7O1j9n6J02j0mj7mJ7j02lP4j2j8n0P8on3L9N1L2m4k8J70J43l30N9j13O5J28l2p2
3189A33O3j63P9k1R5J62j95O4n5p2m8P8o6JJ5P3j07J55n6n1l0K93p0k17K1j5J18O1j55K4m
$$ plain form
2825 110 80 93 144 163 134 91 88 270 162 201 126 115 192 175 216 158 129 171 159 191 214 221 168 114 180 244 104 236 267 119 229 99
2449 99 90 80 78 26 121 87 147 135 175 374 153 171 106 95 57 40 211 133 185 92 108 42 99 106 204 173 256 312 48 149 132 156 28 104
2050 104 151 91 74 147 150 294 327 145 237 134 141 136 156 134 87 76 235 135 39 24 85 103 121 160 187 59 115 138 216 157 175 243 188
1663 188 213 85 84 73 219 224 85 289 210 185 126 44 66 110 180 160 164 58 69 15 80 164 106 155 145 270 329 305 123 156 130 59 53
1276 53 123 255 137 114 90 268 230 136 50 80 129 253 123 145 88 91 154 269 162 23 99 138 159 131 70 108 118 75 63 226 317
912 317 113 71 172 40 85 142 44 294 258 129 281 274 184 305 293 164 200 98 98 46 127 122 172 106 153 244 86 147 46 145 326
548 326 24 1202 2748 2351 937 385 890 1119 576 113 195 150 190 204 62 290 240 84 205 147 215 109 140 100 129 106
243 106 210 87 32 188 306 145 172 89 134 180 29 38 89 132 144 138 25 120 74 80 45 166 253 100 99 53 241 234 197 84 142 146 102
$$ packed form
2825A10l0J3N1J9k9m3lJ82j08L9p5j1P7j7M1n8k9M2j2L2K3Pn3n4O6O4j40J32L1j48J10j30
2449I9rj0kn2R5l4O0j2M0J99k21J8o5j1l8j7J71p8N2r3J6o6N7PR8l1Q3N6k64J01j7K4j28P6
2050A04M7o0j7P3LJ44L3j82R2j03PnK0k2m7j1J59j00r6j5O1J8J8L9K7j28N6K3P8n9J8O8n5
1663A88K5j28jj1J46Nj39K04p9k5n9q2K2M4P0k0Mj06J1n4O5Q4n8M9j0J25N9k4j82L3k6p1o
1276E3P0J32j18k3k4J78l8r4q6L0M9J24j30K2n7LO3J15j07j39P6L9K1k8o1L8J0m3j2J63R1
912C17k04m2J01j32M5N7r8K50l6j29J52pr0J21j2j29L6j02%n2Q1nN0o6M7R1j58O1j01R9J81
548C26l02J178J546l97j414n52N05K29n43m63Q2m5M0J4j42K28n0j56J21n8O8j06L1m0K9k3
243A06J04j23n5J56J18j61K7q3M5M6j51RN1M3J2oj13R5m6Ol5J21Q7j53jm6J88pl7j13N8Mm4
$$ plain form
-145 102 79 52 66 61
$$ packed form
-145A02k3k7J4n
-192F1
##PAGE=	F1=-13795.5
##FIRST=	25164.767445380970457,	5806.2096540000038658,	0
##DATA TABLE=	(F2++(Y..Y)), PROFILE
$$ plain form
5806 59 114 36 129 117 42 117 79 73 28 54 35 62 30 32 63 143 107 136 199 94 97 40 92 154 288 129 58 222 211 80 109 200 210 107
5407 107 142 17 142 55 172 155 212 212 166 159 44 62 146 236 97 45 191 243 246 151 133 145 38 143 223 38 111 97 27 112 165 26
5032 26 117 218 282 194 209 44 137 63 106 244 23 228 184 156 18 214 127 77 157 48 126 239 113 65 243 237 131 313 243
4691 243 219 118 119 131 34 90 112 231 137 161 202 176 165 117 102 187 221 66 120 248 126 57 28 118 71 198 145 35 199 153 189
4327 189 65 47 145 331 254 105 268 64 96 66 87 156 96 185 210 134 308 112 121 166 46 58 119 140 64 79 105 71 126 16 100
3963 100 47 117 122 137 90 113 195 281 158 92 215 126 256 105 124 33 112 21 95 201 143 103 300 251 195 250 191 121 227 115 90
3600 90 154 161 116 146 78 69 129 146 159 162 146 143 78 39 123 128 103 116 124 147 66 98 143 172 99 118 297 430 102 158 114 109 243 163 153 208 84
3165 84 77 63 184 363 181 216 190 137 61 97 24 58 69 170 78 110 114 90 33 345 223 84 77 33 219 272 123 95 134 89 79 188
$$ packed form
5806E9N5p8R3j2p5P5l8om5K6j9K7l2KL1Q0l6K9O3j05Ln7N2O2J34j59p1J64j1j31K9R1J0j03
5407A07L5j25J25q7J17j7N7%m6pj15J8Q4R0j39n2J46N2Lr5j8J2j07J05Q0j85P3j4p0Q5N3j39
5032B6R1J01O4q8J5j65R3p4M3J38k21K05m4k8j38J96q7n0Q0j09P8J13j26m8J78oj06J82p0
4691B43k4j01JJ2r7N6K2J19r4K4M1k6j1m8j5Q5L4j55N4J28j22o9k9R0m7J27n3j10J64m6L6
4327A89j24j8R8J86p7j49J63k04L2l0K1O9o0Q9K5p6J74j96RM5j20J2O1K1p6J5K6l4N5j10Q4
3963A00n3P0NJ5m7K3Q2Q6j23o6J23q9J30j51J9r1P9r1P4J06n8m0J97m9n6N5n9p0J06j12k5
3600I0O4Pm5L0o8rO0J7J3Lj6lo5l9Q4Nk5J3QK3q1L2M5K9p3J9J79J33l28N6m4nJ34q0j0N5j24
3165H4pj4J21J79j82L5k6n3p6L6p3L4J1J01r2L2Mk4n7L12j22j39pm4J86N3j49k8L9m5j0J09
$$ plain form
2790 188 238 145 93 85 287 199 195 113 126 181 156 221 173 181 204 116 153 188 195 163 87 126 242 120 197 279 145 244 115 128 76 25 73 127
2391 127 65 212 150 189 379 171 167 126 84 27 44 187 151 183 72 92 23 121 88 216 164 258 336 80 127 134 158 8 78 139 122 77
2015 77 144 132 256 287 126 316 192 131 106 131 183 49 81 207 61 47 78 115 142 109 183 198 30 83 132 239 211 154 169 168 194
1651 194 114 85 99 283 311 100 260 195 161 98 53 114 89 208 136 113 15 90 59 79 156 101 157 162 269 288 254 97 105 149 87 73 158
1264 158 293 172 110 131 301 302 122 33 102 168 196 105 116 113 106 105 259 122 47 99 197 232 147 56 51 57 54 80 248 330 127 78 168 71
865 71 65 145 135 279 242 123 319 305 211 306 239 171 155 88 149 80 127 160 145 117 195 196 154 118 63 77 133 158 542 1308 1042 492 241
477 241 749 1060 674 147 156 176 211 146 12 262 206 113 168 115 182 76 139 109 125 174 281 93 37 201 283 120 164 153 125 146
125 146 23 23 100 173 158 118 65 64 69 67 83 150 257 92 69 121 309 269 165 56 114 149 102 110 51 63 37
$$ packed form
2790A88N0r3n2qK02q8mq2J3N5k5O5m8QK3q8L7L5Pl2p6L9J16j22P7Q2j34R9j29J3n2n1M8N4
2391A27o2J47o2L9J90k08mm1m2n7J7J43l6L2j11K0o9R8l3J28n2R4P8k56M7PK4j50P0O1j7m5
2015G7O7j2J24L1j61J90j24o1k5K5N2j34L2J26j46j4L1L7K7l3P4J5j68N3M9J07k8n7J5jK6
1651A94q0k9J4J84K8k11J60o5l4o3m5O1k5J19p2k3r8P5l1K0P7n5N6NJ07J9l4j57QM4o2j4Q5
1264A58J35j21o2K1J70Jj80q9O9O6K8r1J1lpjJ54j37p5N2R8L5q5r1nOlK6J68Q2k03m9R0r7
865G1oQ0j0J44l7j19J96j4r4R5o7o8j6o7O1o9M7L3j5k8P8Jm2l6n5J4N6K5L84P66k66n50k51
477B41N08L11l86n27RK0L5o5j34K50n6r3N5n3O7j06O3l0J6M9J07j88n6J64Q2j63M4j1k8K1
125A46j23%P7P3j5m0n3jNkJ6O7J07j65k3N2J88m0j04j09N8L5m7Qn9J2k6
-192C7
##PAGE=	F1=-13897.7
##FIRST=	25164.767445380970457,	5806.2096540000038658,	0
##DATA TABLE=	(F2++(Y..Y)), PROFILE
$$ plain form
5806 76 118 28 136 120 45 153 108 94 54 62 10 71 67 21 40 101 65 132 134 23 29 41 110 146 307 149 79 224 214 66 98 210 196
5419 196 121 158 23 175 6 128 121 186 194 121 87 56 97 128 237 141 63 241 229 226 197 230 177 27 138 212 80 66 75 54 119 149
5043 149 91 193 191 269 170 192 69 118 91 180 292 76 252 203 127 97 280 160 81 203 21 166 263 186 76 221 265 113 260
4703 260 221 182 126 118 107 79 72 136 256 139 184 261 178 184 136 60 170 238 51 147 254 120 50 48 127 64 125 97 45 174 133 203 67
4316 67 21 121 305 225 127 268 86 95 60 156 202 102 183 194 157 225 85 115 154 70 23 121 168 95 105 81 91 87 30 89 65 117 79
3928 79 146 126 102 212 293 173 119 195 124 315 164 147 19 89 27 77 177 174 119 278 187 186 224 179 121 209 150 73 111 159 150 125 53
3541 53 124 72 118 149 159 149 113 99 17 108 139 136 177 161 181 65 86 138 165 75 129 282 389 106 153 163 102 251 152 168 216 119 43
3154 43 34 178 360 201 209 201 171 56 76 78 94 95 174 147 26 73 81 65 307 166 104 70 46 239 259 125 70 151 133 96 241 317 171
$$ packed form
5806G6M2r0J08j6p5J08m5j4m0Qn2O1mm6J9O1l6O7Kj11OJ2O9L6J61j58p0J45j0j48L2J12j4
5419A96p5L7j35J52j69J22pO5Qp3l4l1M1L1J09r6p8J78j2lk9L3n3j50J11P4j32j4Rk1O5L0
5043A49n8J02kP8r9K2j23M9k7Q9J12k16J76m9p6l0J83j20p9J22j82J45R7p7j10J45M4j52J47
4703B60l9l9n6qj1k8pO4J20j17M5P7q3Om8p6J10O8j87R6J07j34p0kP9o3O1k8n2J29m1P0j36
4316F7m6J00J84q0r8J41j82Rl5R6M6j00Q1J1l7O8j40L0L9q4m7R8M7p3J0k4J0mn7N9k4N2l8
3928G9O7k0k4J10Q1j20n4P6p1J91j51j7j28P0o2N0J00ln5J59r1jL8m5n8Q8n9p7L8M8rk5p2
3541E3P1n2M6L1J0j0l6j4q2R1L1lM1j6K0j16K1N2K7r0N4J53J07k83M7J0o1J49r9J6M8r7p6
3154D3rJ44J82j59Qql0j15K0KJ6JP9k7j21M7Qj6K42j41o2l4k4J93K0j34n5Q1j8l7J45P6j46
$$ plain form
2766 171 106 69 269 232 167 90 130 139 111 204 177 237 231 69 135 154 154 160 86 78 216 141 165 281 170 235 122 158 139 44 112 127 80 269
2367 269 166 180 357 175 162 130 89 10 59 172 167 169 65 79 8 132 74 209 154 237 330 116 97 117 134 31 51 117 148 85 136
2003 136 116 213 236 113 350 228 129 83 80 196 101 69 152 60 135 139 173 187 92 221 206 18 47 123 238 254 138 76 139 153 115 62
1628 62 92 307 360 120 204 184 128 77 78 143 66 225 122 91 49 112 123 73 134 87 156 175 245 233 201 76 73 151 116 97 184 297 208
1240 208 101 146 299 349 104 49 149 193 131 91 125 130 118 48 204 74 57 81 238 305 161 36 68 28 36 91 263 336 143 107
888 107 157 98 44 174 206 265 236 112 323 309 206 274 191 182 154 123 232 95 120 177 144 109 206 149 207 122 136 50 43 226 223 383 293
501 293 183 135 567 900 687 162 99 187 203 125 61 230 175 117 130 85 155 92 135 119 117 233 335 77 97 192 235 120 149 194 106
137 106 125 45 21 109 201 186 109 106 50 76 92 108 122 247 102 115 188 355 283 117 45 90 146 97 132 56 66 21
$$ packed form
2766A71o5l7K00l7o5p7M0Rk8R3k7O0oj62O6J9%Op4qJ38p5K4J16j11O5j13L6j9r5O8J5m7J89
2367B69j03J4J77j82j3l2m1p9M9J13nKj04J4p1J24n8J35n5Q3R3k14j9K0J7j03K0O6L1o3N1
2003A36k0R7K3j23K37j22r9m6lJ16r5l2Q3r2P5ML4J4r5J29j5j88K9P6J15J6j16o2O3J4l8n3
1628F2L0K15N3k40Q4k0n6n1JO5p7J59j03l1m2O3J1n0O1m7O9J9P0j2l2j25lP8l5j9Q7J13q9
1240B08j07M5J53N0k45n5J00M4o2m0L4Nj2p0J56j30j7K4J57O7j44j25L2m0QN5J72P3j93l6
888A07N0n9n4J30L2N9k9j24K11j4j03O8q3rk8l1J09j37K5N7l3l5R7n7N8q5J4q6pJ83lJ60r0
501B93j10m8M32L33k13n25o3Q8J6p8o4J69n5n8J3m5P0o3M3j6kJ16J02k58K0R5M3j15K9M5q8
137A06J9q0k4Q8R2j5p7ln6K6J6J6J4J25j45J3P3J67p2j66p2M5N6m9L5p6J0m5
-192B1
##PAGE=	F1=-14000
##FIRST=	25164.767445380970457,	5806.2096540000038658,	0
##DATA TABLE=	(F2++(Y..Y)), PROFILE
$$ plain form
5806 88 120 42 136 116 34 173 117 106 70 61 15 70 127 70 35 81 33 124 147 84 28 97 128 135 289 163 86 221 215 44 69 199 148 132
5407 132 169 26 208 68 81 85 158 172 66 15 83 138 109 243 175 147 283 204 194 212 292 202 27 125 187 99 18 50 67 105 118 175
5032 175 266 154 260 153 181 94 107 110 234 312 140 242 197 76 167 309 178 80 238 63 195 254 240 98 193 266 93 184
4703 184 183 161 126 82 85 114 30 158 264 130 190 295 144 190 143 51 142 244 95 177 226 94 76 123 130 72 53 40 53 156 104 215
4327 215 69 34 93 264 170 150 256 116 95 105 219 215 122 169 167 167 134 61 106 128 78 59 119 192 111 136 48 107 50 49 77 70 104 50 154
3916 154 156 103 203 303 186 142 174 140 344 192 155 39 78 41 85 148 186 147 234 120 169 182 150 115 167 155 73 74 163 179 107 112 179
3529 179 6 81 138 139 148 83 119 37 86 142 165 219 212 204 60 69 135 177 82 147 272 318 108 138 188 95 265 151 170 219 130 22 35 172
3130 172 345 207 202 195 179 31 51 118 143 151 152 205 74 66 52 91 243 135 107 64 64 229 210 102 46 156 186 139 294 383 194 128
$$ packed form
5806H8L2p8R4k0q2J39n6j1l6rm6N5N7n7l5M6m8R1K3o3n6O9L1PJ54j26p7J35oj71K5J30n1j6
5407A32L7j43J82j40J3MP3J4j06n1O8N5k9J34o8k8J36p9j0J8Q0r0j75R8O2q8q1L2J7L8J3N7
5032A75R1j12J06j07K8q7J3LJ24P8j72J02m5j21R1J42j31r8J58j75J32N9j4j42R5P3j73R1
4703A84jk2l5m4LK9q4J28J06j34O0J05j51M6m7r2R1J02j49Q2M9j32j8M7Pn8j9j3J3J03n2J11
4327B15j46l5N9J71r4k0J06j40k1J0J14mr3M7k%l3p3M5K2n0j9O0P3q1K5q8N9n7jK8pL4n4J04
3916A54Kn3J00J00j17m4L2l4K04j52l7j16L9l7M4O3L8l9Q7j14M9J3l2l5N2j2q2JQ9J6p2NO7
3529A79j73P5N7JRo5L6q2M9N6K3N4pqj44RO6M2r5O5J25M6k10L0N0r3J70j14J9M9q9j08J3J37
3130A72J73j38npj6j48K0O7K5QJN3j31qj4L9J52j08k8m3%J65j9j08n6J10L0m7J55Q9j89o6
$$ plain form
2754 128 37 227 268 129 60 130 76 71 163 174 284 246 44 149 127 109 159 101 39 172 133 144 269 186 209 117 177 194 66 132 106
2391 106 121 312 176 158 317 170 158 123 95 46 70 171 179 148 73 79 22 124 71 185 145 199 293 146 74 89 91 46 34 95 168 97
2015 97 131 112 179 189 103 337 228 143 99 32 173 124 53 91 121 202 171 208 221 84 267 209 51 73 112 214 278 127 48 100 106 89
1639 89 30 58 293 363 148 139 182 91 59 91 145 48 231 118 115 72 131 198 63 111 69 153 186 200 176 154 60 91 153 137 119 197 270 237
1240 237 99 126 257 359 108 81 188 212 80 86 159 144 119 16 121 62 60 52 257 358 168 20 132 92 36 89 255 331 160
900 160 140 144 106 28 200 240 248 230 106 297 284 168 210 158 193 193 181 296 84 110 176 161 86 190 109 238 150 175 58 119 228 313
524 313 367 510 102 72 373 675 624 164 38 158 165 126 95 199 154 99 102 66 138 141 125 127 106 270 356 41 146 166 180 131 129 205
149 205 79 112 58 9 107 206 219 114 140 61 93 109 108 90 227 118 177 234 371 280 59 64 84 143 93 145 63 73 16
$$ packed form
2754A28r1J90M1j39o9P0n4nR2J1J10l8k02J05k2j8N0n8o2J33l9J1J25q3K3r2O0J7j28O6k6
2391A06J5J91j36j8J59j47j2l5k8m9K4J01Ql1p5On7J02n3J14m0N4R4j47p2J5Km5j2O1P3p1
2015I7L4j9O7J0q6K34j09q5m4o7J41m9p1L8L0Q1l1L7J3j37J83n8j58K2L9J02O4j51p9N2Oj7
1639H9n9K8K35P0k15rM3r1l2L2N4r7J83j13lm3N9O7j35M8m2Q4L3J4k4k2r4L1O2j6j8P8P3l3
1240B37j38K7J31J02k51k7J07K4j32OP3j5k5j03J05n9kqK05J01j90j48J12m0n6N3J66P6j71
900A60k0Ml8p8J72M0Qj8j24J91j3j16M2n2L5%j2J15k12K6O6j5p5J04q1J29q8K5j17O1J09Q5
524C13N4J43m08l0L01L02n1m60j26J20Pl9l1J04m5n5Ll6P2Lj6Kk1J64Q6l15J05K0J4m9kP6
149B05j26L3n4m9R8R9J3j05K6p9L2J6jj8J37j09N9N7J37r1k21NK0N9n0N2q2J0n7
-192A6
##PAGE=	F1=-14102.2
##FIRST=	25164.767445380970457,	5806.2096540000038658,	0
##DATA TABLE=	(F2++(Y..Y)), PROFILE
$$ plain form
5806 94 121 65 129 115 16 169 113 106 73 49 20 65 161 131 46 95 69 120 237 163 63 132 138 114 240 172 70 214 207 23 35 175 76
5419 76 136 191 27 232 124 39 71 134 150 37 52 98 185 90 246 189 202 306 167 156 195 307 206 34 110 156 97 37 50 63
5067 63 77 107 265 327 116 256 150 193 116 109 112 259 302 192 202 172 47 216 299 174 72 255 117 199 211 266 105 159 246 89
4715 89 98 138 153 104 27 59 131 46 174 251 105 172 294 104 184 139 108 125 231 140 209 177 81 104 187 127 101 89 21 63 157 70 223
4327 223 75 63 62 211 102 167 233 150 98 155 261 194 146 150 140 160 52 49 100 98 70 99 109 205 117 154 12 113 31 64 70 69 81 55
3928 55 161 173 116 168 305 191 157 149 149 331 181 139 52 74 62 115 123 173 170 176 103 146 126 108 103 111 142 79 59 175 200 126 177 217 67
3517 67 45 130 108 141 72 132 81 60 132 169 236 257 211 47 46 130 204 101 168 284 234 110 108 190 99 277 149 161 213 116 19 51 170
3130 170 322 201 200 178 156 48 24 145 191 213 110 233 137 121 8 100 171 139 94 62 62 191 140 64 43 149 229 184 340 427 196
$$ packed form
5806I4K7n6O4j4r9J53n6pl3k4k9M5R6l0q5M9k6N1J17p4j00O9Ok4J26o8j02J44pj84J2J40r9
5419G6O0N5j64K05j08q5L2O3J6j13J5M6Q7r5J56n7J3J04j39j1L9J12j01j72P6M6n9o0J3J3
5067F3J4L0J58O2k11J40j06M3p7pLJ47M3j10J0l0j25J69Q3j25j02J83j38Q2J2N5j61N4Q7j57
4715H9RM0J5m9p7L2P2q5J28P7j46O7J22j90Q0m5l1J7J06r1O9l2r6K3Q3o0k6j2o8M2R4q7J53
4327B23j48j2jJ49j09O5O6q3n2N7J06o7m8Mj0K0j08lN1kk8K9J0R6q8L7j42J01q2L3OjJ2k6
3928E5J06J2n7N2J37j14l4q%J82j50m2q7K2j2N3QN0lOp3M3k0j8nQL1o3k0J16K5p4N1M0j50
3517F7k2Q5k2L3o9O0n1k1P2L7O7K1m6j64jQ4P4j03O7J16n0j24kQ2r1J78j28J2N2r7r7L2J19
3130A70J52j21jk2k2j08k4J21M6K2j03J23r6j6j13R2P1l2m5l2%J29n1p6k1J06Q0m5J56Q7k31
$$ plain form
2766 196 150 14 176 305 117 43 132 27 91 110 171 311 245 63 167 118 73 159 120 8 120 93 128 245 185 173 96 181 224
2426 224 68 138 71 174 337 176 136 270 158 153 113 97 76 75 178 185 127 92 97 42 104 84 148 138 160 234 161 81 71 46 52 41 84 177
2027 177 104 133 112 166 154 92 284 194 162 138 71 132 103 88 75 158 233 166 206 237 93 303 204 94 144 111 174 284 126 120 64 77
1651 77 40 72 13 250 322 174 85 191 59 35 81 119 39 225 119 152 75 146 268 50 94 64 149 195 142 125 119 59 110 167 151 135
1276 135 197 222 251 108 81 185 334 138 111 206 229 72 90 184 158 106 60 77 106 67 33 255 385 160 32 175 141 53 71 218
923 218 314 172 159 133 95 32 207 227 225 216 105 253 237 107 125 149 209 240 231 317 48 110 165 175 52 153 77 245 183 185 60 153
548 153 185 328 398 575 121 43 198 440 519 163 27 100 104 116 110 171 147 66 84 64 132 189 107 135 95 275 339 32 180 135 138 139
172 139 111 185 50 92 52 38 98 186 245 126 161 60 104 102 86 60 202 134 220 247 357 271 11 91 96 138 108 150 67 80 13
$$ packed form
2766A96m6j36J62J29j88p4Q9j05O4J9O1J40o6j82J04m9m5Q6l9j12J12k7L5J17o0j2p7Q5M3
2426B24j56P0o7J03J63j61m0J34j12nm0j6k1jJ03Pn8l5Nn5O2k0O4j0K2P4p3q0j0k5Oj1M3R3
2027A77p3K9k1N4j2o2J92r0l2k4o7O1k9j5j3Q3P5o7M0L1j44K10r9j10N0l3O3J10j58on6J3
1651G7l7L2n9K37P2j48q9J06j32k4M6L8q0J86j06L3p7P1J22k18M4l0Q5M6n3j7oo0N1N7j6j6
1276A35O2K5K9j43k7J04J49j96k7R5K3j57J8R4k6n2m6J7K9l9l4K22J30k25j28J43l4q8J8J47
923B18R6j42j3k6l8o3J75K0krj11J48j6j30J8K4O0L1rQ6k69O2N5J0j23J01p6J68o2Kj25R3
548A53L2J43P0J77m54p8J55K42P9l56j36P3MJ2oO1k4q1J8k0O8N7q2K8m0J80O4l07J48m5LJ
172A39k8P4j35M2m0j4O0Q8N9j19L5j01M4kj6k6J42o8Q6K7J10q6k60Q0NM2l0M2q3J3o7
-192A3
##PAGE=	F1=-14204.5
##FIRST=	25164.767445380970457,	5806.2096540000038658,	0
##DATA TABLE=	(F2++(Y..Y)), PROFILE
$$ plain form
5806 94 121 86 119 124 25 145 104 97 65 30 27 67 162 185 62 124 121 119 325 216 70 133 136 82 174 183 38 203 186 14 35 144 14 130
5407 130 226 28 240 158 9 77 114 128 69 91 95 232 80 241 182 222 301 127 113 155 276 195 55 103 125 78 85 74 45 48 141 346
5032 346 367 84 250 169 226 131 126 99 253 268 220 143 146 128 241 256 152 55 248 159 171 146 261 90 119 209 101 30 98 148 65
4668 65 64 23 142 123 181 217 64 132 256 108 166 130 172 149 196 172 239 132 119 121 229 115 134 165 75 73 170 36 229 92 82 37
4292 37 160 45 171 199 187 131 184 270 149 169 127 124 140 55 55 103 75 54 122 89 198 126 147 34 109 55 66 76 71 65 75 165 172 131 117
3881 117 298 180 164 119 140 274 133 101 54 76 82 151 122 133 181 117 137 121 66 61 88 58 130 87 63 192 215 172 217 238 142 42 130
3494 130 72 126 76 135 124 37 107 139 229 288 201 30 21 125 233 116 184 303 154 121 66 175 111 275 157 152 195 81 18 54 170
3130 170 291 188 198 150 105 104 13 162 225 259 62 224 174 180 51 101 115 154 74 66 39 137 69 35 64 132 250 215 373 442 172 161
$$ packed form
5806I4K7l5L3Nr9J20m1pl2l5lM0R5K3j23O2lkK06j09j46O3Ln4R2Rj45J65j7j72K1J09j30J16
5407A30R6j98K12q2j49O8L7J4n9K2MJ37j52J61n9M0P9j74j4M2J21q1j40M8K2m7Pj1k9LR3K05
5032C46K1k83J66q1N7r5nk7J54J5m8p7Lj8J13J5j04r7J93q9J2k5J15j71K9R0j08p1O8N0q3
4668F5jm1J19j9N8L6j53O8J24j48N8l6M2k3M7k4O7j07j3KJ08j14J9L1r0kR7j34J93j37j0m5
4292C7J23j15J26K8j2n6N3Q6j21K0m2lJ6q5%M8k8k1O8l3J09p2K1j13P5n4J1J0noJ0R0Pm1j4
3881A17J81j18j6m5K1J34j41l2m7K2OO9k9J1M8o4K0j6n5nK7l0P2m3k4J29K3m3M5K1r6j00Q8
3494A30n8N4n0N9j1q7P0L2R0N9q7j71rJ04J08j17O8J19j49l3n5J09o4J64j18nM3j14o3L6J16
3130A70J21j03J0m8m5jr1J49O3L4j97J62n0Oj29N0J4L9q0qk7R8o8l4K9O8J18l5J58O9k70j1
$$ plain form
2754 161 74 139 334 156 74 142 71 134 68 171 312 227 82 169 121 65 158 137 28 70 44 113 215 161 132 59 170 223 55 135
2402 135 64 224 343 165 126 228 137 142 102 99 102 75 181 186 118 115 124 62 91 110 103 137 144 163 155 107 81 43 62 56 96 171 100 145 103 166 137
1968 137 81 207 138 174 171 118 96 48 164 111 162 224 131 171 236 110 315 186 138 217 126 134 272 145 168 60 86 47 134 24 192
1604 192 252 186 65 208 48 18 48 71 38 206 115 179 66 150 319 32 84 78 146 203 85 87 97 97 100 190 165 139 186 166 241 117
1229 117 61 98 285 171 135 200 243 96 97 185 171 78 102 151 156 79 48 236 383 134 63 181 161 71 43 155 281 173 155 124 78
865 78 54 195 173 197 197 110 205 182 45 41 164 237 270 252 287 6 127 150 174 20 110 53 228 205 177 54 149 137 260 221 413 87
489 87 25 75 256 408 158 57 69 47 82 109 146 150 42 71 69 127 221 84 145 97 246 290 82 199 107 121 140 109 136 37 57 25
114 25 101 99 146 253 137 166 48 102 69 50 37 171 141 235 225 316 266 36 109 113 125 148 148 67 85 15
$$ packed form
2754A61q7O5J95j78q2O8p1O3o6J03J41q5j45Q7m8n6R3k1j09M2k6O9J02n4k9p3J11N3j68Q0
2402A35p1J60J19j78l9J02r1Nm0lLk7J06No8lRo2K9J9pL4PJ9qm8k6l8J9oM0P5p1M5m2O3k9
1968A37n6J26o9L6ln3k2m8J16n3N1O2r3M0O5j26K05j29m8P9r1QJ38j27K3j08K6l9Q7j10J68
1604A92O0o6j21J43j60l0L0K3l3J68r1O4j13Q4J69k87N2oO8N7j18KJ0%LR0k5k6M7k0P5j24
1229A17n6L7J87j14l6O5M3j47JQ8j4r3K4M9Np7l1J88J47k49p1J18k0r0k8J12J26j08j8l1m6
865G8k4J41k2K4%q7R5k3j37mJ23P3L3j8L5k81J21K3K4j54R0n7J75k3k8j23R5j2J23l9J92l26
489H7o2N0J81J52k50j01J2k2L5K7L7Mj08K9kN8R4j37O1m8J49M4k08J17r2J4J9l1K7r9K0l2
114B5P6kM7J07j16K9j18N4l3j9j3J34l0R4j0R1n0k30P3MJ2K3%q1J8p0
-192A5
##PAGE=	F1=-14306.8
##FIRST=	25164.767445380970457,	5806.2096540000038658,	0
##DATA TABLE=	(F2++(Y..Y)), PROFILE
$$ plain form
5806 92 118 100 109 135 47 109 93 84 51 39 46 88 128 218 83 154 170 119 381 232 65 100 118 40 110 202 60 183 150 30 59 107 70
5419 70 115 256 29 232 166 29 79 104 108 98 100 81 273 83 226 160 208 266 96 67 105 211 183 86 111 99 52 132 100 19 35 191
5043 191 405 379 69 243 210 262 139 154 77 221 226 220 76 141 229 241 194 117 32 213 175 115 81 234 56 70 160 108 65 83 138
4679 138 33 133 31 167 193 174 165 9 85 189 139 130 121 228 205 144 188 262 118 177 125 244 93 159 219 117 78 178 6 234
4327 234 118 87 28 126 62 160 156 224 204 183 244 94 188 100 124 118 112 66 109 65 53 122 59 167 142 110 60 97 86 52 95 80 74 82 170 153
3905 153 139 65 282 148 162 86 116 185 59 58 49 80 96 186 151 76 191 76 162 96 28 35 70 25 132 99 78 212 229 211 226 248 207
3517 207 68 136 39 104 75 133 157 27 70 83 203 298 180 16 21 125 256 124 190 306 95 143 17 150 125 253 180 149 167
3177 167 34 30 41 168 254 180 196 119 43 153 41 170 236 270 41 180 186 224 104 111 100 163 63 71 14 85 40 44 89 109 245 225
$$ packed form
5806I2K6j8RK6q8O2j6rl3j2PM2M0R0j35P1J6n1K62j49j67L5J8p8P0R2j42J23l3j20K9M8l7
5419G0M5J41k27K03o6j37N0K5Mj0Kj9J92j90J43o6M8N8j70k9L8J06k8r7K5j2m7Q0l2q1J6J56
5043A91K14k6l10J74l3N2j23J5p7J44Noj44O5Q8J2m7p7q5J81l8o0l4J53j78J4R0n2m3J8N5
4679A38j05J00j02J36K6j9rj56P6J04n0rrJ07k3o1M4P4j44N9n2J19j51O6O0j02l9J00j72K28
4327B34j16l1n9R8o4R8mO8k0k1O1j50R4q8K4oom6M3m4j2O9o3J08k5l2n0L7j1l4M3j5oQQ8j7
3905A53j4p4K17j34J4p6L0O9j26jrL1J6R0l5p5J15j15Q6o6o8PL5m5J07l3k1J34J7j8J5K2m1
3517B07j39O8r7O5k9N8K4j30M3J3J20R5j18j64NJ04J31j32O6J16k11M8j26J33k5J28p3l1J8
3177A67j33mJ1J27Q6p4J6p7p6J10j12J29O6L4k29J39OL8j20Pj1O3j00Qn7P1m5MM5K0J36k0
$$ plain form
2801 225 386 431 125 153 141 133 340 211 132 155 109 156 68 171 288 197 83 154 118 79 155 150 60 37 73 99 188 122 91 7 151 191
2426 191 43 129 110 261 329 145 127 201 109 125 86 109 131 74 174 179 127 140 148 80 97 141 60 142 163 100 132 126 98 65 86 62 123 149
2027 149 83 160 87 166 134 81 135 89 172 185 139 84 55 244 142 141 185 83 124 229 125 295 151 176 274 143 114 249 186 179 91
1663 91 111 117 178 40 135 176 179 73 225 58 46 25 14 44 177 103 188 57 139 336 16 69 96 146 207 60 82 87 163 76 214 184
1287 184 127 167 116 203 112 107 18 229 190 156 173 253 123 99 160 178 47 139 238 189 85 71 210 358 92 97 152 151 83 25 81 236
912 236 156 129 119 81 82 172 99 169 184 127 167 137 69 69 189 270 273 236 216 63 151 133 160 6 82 40 193 206 160 59 136 134 237 153
513 153 183 33 10 80 171 319 145 65 112 63 28 99 118 156 64 57 74 117 231 61 157 119 191 225 119 199 89 118 135 128 70 58 8
125 8 31 176 118 101 237 140 155 50 85 28 31 31 128 137 220 171 255 265 54 116 125 104 198 141 62 88 26
$$ packed form
2801B25J61M5l06K8j2qK07j29p9K3m6M7q8J03J17r1j14P1l6l9P6nr0k3L6K6Q9o6l1q4J44M0
2426A91j48Q6j9J51O8j84j8P4r2J6l9K3K2n7J00Nn2J3Qo8J7M4q1Q2K1o3L2ok8l3K1k4O1K6
2027A49o6P7p3P9l2n3N4m6Q3J3m6n5k9J89j02jM4j02M1J05j04J70j44K5R8j31k9J35o3pq8
1663I1K0OO1j38R5M1Lj06J52j67j2k1j1L0J33p4Q5j31Q2J97l20N3K7N0O1j47K2NP6q7J38l0
1287A84n7M0n1Q7r1nq9K11l9l4J7Q0j30k4O1J8j31R2R9m9j04j4J39J48k66NN5jo8n8N6J55
912B36q0k7j0l8JR0p3P0J5n7M0l0o8%J20Q1Ll7k0j53Q8j8K7j54P6m2J53J3m6j01P7kJ03q4
513A53L0j50k3P0R1J48j74q0M7m9l5P1J9L8r2pJ7M3J14j70R6l8P2L4j06Q0j10K9J7pn8j2n0
125HK3J45n8j7J36r7J5j05L5n7L%R7RQ3m9Q4J0k11O2Rk1R4n7p9K6o2
-192B6
##PAGE=	F1=-14409
##FIRST=	25164.767445380970457,	5806.2096540000038658,	0
##DATA TABLE=	(F2++(Y..Y)), PROFILE
$$ plain form
5806 91 113 102 99 139 65 74 86 78 43 78 68 126 67 223 106 183 211 119 394 212 82 69 85 16 67 230 127 148 105 50 73 62 103
5419 103 94 259 30 213 151 64 71 106 92 108 81 70 298 91 201 143 170 200 83 19 54 137 178 117 120 79 24 177 117 25 35 225
5043 225 433 363 73 246 264 283 136 179 64 170 197 199 16 166 319 223 124 76 18 156 162 44 72 198 29 32 105 97 102 99 123
4679 123 49 182 88 209 238 152 106 51 82 107 147 73 113 270 269 95 186 272 136 224 119 232 64 170 240 137 72 170 19 237
4327 237 148 83 27 111 99 133 107 256 295 162 189 44 201 77 145 123 161 69 111 63 78 105 28 115 160 56 66 88 110 26 119 95
3952 95 99 68 177 120 136 24 260 95 155 55 86 89 36 61 39 82 97 208 187 64 211 74 159 73 59 59 53 39 140 126 108 228
3576 228 243 226 204 252 251 84 142 24 77 63 136 172 39 35 53 170 289 158 18 41 132 266 126 186 285 90 169 36 119 141
3224 141 210 203 147 131 19 61 28 159 216 185 196 93 57 181 76 167 218 240 53 116 181 247 143 136 111 167 79 75 49 51 62 62 105 86
$$ packed form
5806I1K2j1lM0p4RJ2ql5L5j0N8n9J56j17P7K8r2K75j82j30j3J6o9N1J63j03K1m3n5K3j1M1
5419A03rJ65k29J83o2q7PL5j4J6k7j1K28k07J10n8K7L0j17o4L5Q3M1o1Lm1n5J53o0r2J0J90
5043B25K08p0k90J73J8J9j47M3j15J06K7Kj83J50J53r6r9m8n8J38Oj18K8J26j69LP3qNlK4
4679A23p4J33r4J21K9q6m6n5L1K5M0p4M0J57jj74R1Q6j36Q8j05J13j68J06P0j03o5R8j51K18
4327B37q9o5n6Q4j2L4k6J49L9j33K7j45J57j24O8k2L8r2M2m8J5K7p7Q7M5j04J0K2K2q4R3k4
3952I5Ml1J09n7J6j12K36j65O0j00L1Ln3K5k2M3J5J11k1j23J47j37Q5q6j4%oj4J01j4j8J20
3576B28J5j7k2M8jj67N8j18N3j4P3L6j33mJ8J17J19j31j40K3R1J34j40O0R9j95P9j33Q3K2
3224A41O9pn6j6j12M2l3J31N7l1J1j03l6J24j05R1N1K2j87O3O5O6j04pk5N6q8mk6KJ1%M3j9
$$ plain form
2825 86 217 211 377 402 67 121 201 151 316 257 196 163 119 148 89 168 244 160 63 134 102 96 146 157 85 54 140 101 174 102 59 53 132 130 62
2414 62 123 159 273 294 122 130 192 99 123 61 128 160 80 160 163 141 158 155 93 117 164 24 149 199 78 104 127 102 69 115 53 154 115 60
2015 60 172 75 157 138 99 112 91 158 180 134 77 128 310 151 111 136 42 111 234 139 245 105 199 306 153 117 220 228 160 126 130 178
1639 178 190 28 90 132 157 78 233 67 75 64 42 56 146 82 178 68 111 316 33 41 109 148 205 82 112 84 234 89 233 201 94
1276 94 146 88 144 90 151 37 187 188 178 135 256 151 96 121 173 51 171 301 204 78 85 186 317 44 126 100 117 84 42 46 189
912 189 121 86 119 109 112 149 53 151 185 152 148 114 121 125 213 295 246 185 125 113 169 113 144 26 89 52 147 183 141 80 145 176 277 287 76 36
489 36 10 123 158 260 121 58 156 105 41 81 86 155 104 44 86 104 216 42 170 156 133 164 127 181 80 112 124 160 27 92 52 91
114 91 245 142 74 197 131 133 76 58 53 50 48 74 118 183 97 183 261 65 115 128 84 241 132 57 92 37
$$ packed form
2825H6J31oJ66K5l35N4Q0n0J65n9o1l3m4K9n9P9P6q4r7P1l2oN0J1p2l1Q6l9P3p2m3oP9ko8
2414F2O1L6J14K1j72QO2r3K4o2O7L2q0Q0Lk2J7lo2K4M7j40J25N0j21K6K3k5l3M6o2J01l9n5
2015F0J12r7Q2j9l9J3k1O7K2m6n7N1J82j59m0K5r4O9J23r5J06j40R4J07j53l6J03Qo8l4MM8
1639A78J2j62O2M2K5p9J55j66Qj1k2J4R0o4R6j10M3K05k83QO8L9N7j23L0k8J50j45J44l2j07
1276I4N2n8N6n4O1j14J50Jj0m3J21j05n5K5N2j22J20J30r7j26PJ01J31k73Q2k6J7l3m2MJ43
912A89o8l5L3j0LL7r6R8L4l3ml4PMQ8Q2m9o1o0j2N6n6L1j18O3l7R5L6m2o1O5L1J01J0k11m0
489C6k6J13L5J02j39o3R8n1o4M0NO9n1o0M2J8J12j74J28j4k3L1l7N4j01L2J2L6j33O5m0L9
114I1J54j03o8J23o6Kn7j8nlkK6M4O5q6Q6P8j96N0J3m4J57j09p5L5n5
-192C7
##PAGE=	F1=-14511.3
##FIRST=	25164.767445380970457,	5806.2096540000038658,	0
##DATA TABLE=	(F2++(Y..Y)), PROFILE
$$ plain form
5806 92 105 91 87 129 73 62 86 82 57 118 84 176 21 203 129 211 245 122 365 165 121 102 46 64 56 261 196 95 80 66 71 19 99 73
5407 73 224 33 195 136 108 78 114 77 99 43 74 300 91 175 154 120 117 83 28 8 103 180 144 117 62 3 219 128 53 30 236 429
5032 429 320 91 268 318 280 116 193 79 109 198 170 50 198 381 200 60 39 28 89 120 44 117 169 65 78 62 73 110 125
4691 125 106 69 200 140 247 249 120 72 113 133 30 114 1 104 297 324 101 167 265 161 246 109 197 34 166 226 132 56 145
4351 145 40 237 173 74 23 101 119 98 55 277 382 145 120 14 205 79 177 169 203 63 105 60 108 83 35 59 170 70 47 83
3999 83 121 22 139 113 124 45 184 85 121 10 233 35 149 33 63 45 109 107 32 81 86 209 206 127 236 93 132 49 91 84 45 61
3623 61 140 169 155 232 250 211 162 252 262 84 139 41 51 51 145 164 52 41 113 138 264 140 23 54 142 262 123 180 249 134 187 86
3247 86 88 163 154 210 140 95 66 95 52 144 187 200 197 91 113 186 119 154 174 173 50 65 172 251 161 162 119 172 112 75 89 41 72 70 109 68 177
$$ packed form
5806I2J3j4mM2n6j1K4mk5O1l4R2j55J82p4Q2L4j23K43k00m4j9n6J8qK05o5j01j5j4Nn2Q0k6
5407G3J51j91J62n9k8l0L6l7K2n6L1K26k09Q4k1l4ll4n5k0R5P7l6k7n5n9K16r1p5k3K06J93
5032D29j09k29J77N0l8j64P7j14L0Q9k8j20J48J83j81j40k1j1O1L1p6P3N2j04J3j6J1L7J5
4691A25j9l7J31o0J07Kj29m8M1K0j03Q4j13J03J93K7k23O6R8j04Q5j37Q8j63J32O0r4p6Q9
4351A45j05J97o4r9n1P8J8k1m3K22J05k37k5j06J91j26R8qL4j40M2m5M8k5m8K4J11j00k3L6
3999H3L8r9J17k6J1p9J39r9L6j11K23j98J14j16L0j8O4kp5M9NJ23lp9J09j43L9q3M2pl9J6
3623F1P9K9j4P7J8l9m9R0J0j78N5r8J0%R4J9j12j1P2K5J26j24j17L1Q8J20j39N7O9j15N3j01
3247H6KP5rN6p0m5k9K9m3R2M3J3lj06K2P3o7L5K0jj23J5J07P9r0Jm3N3o0l7J4m8L1kL9m1J09
$$ plain form
2813 177 176 350 363 31 71 244 173 265 283 257 162 99 119 103 158 190 125 30 120 72 111 128 154 97 97 194 126 172 131 49 116 128 46 101
2414 101 118 187 257 240 102 130 201 141 159 30 151 179 93 150 132 146 159 139 96 138 171 3 151 234 105 95 112 85 48 135 29
2050 29 179 77 37 172 78 138 138 129 140 124 140 160 123 59 184 346 139 95 102 20 140 255 156 175 65 202 309 154 130 191 252
1686 252 126 153 138 217 169 27 66 138 133 73 223 69 91 98 87 77 122 57 158 99 74 263 67 18 115 149 199 102 148 84 291 141
1311 141 245 202 50 130 87 88 75 166 63 173 164 207 97 255 181 89 80 155 88 195 332 202 60 85 172 266 22 144 58 72
959 72 75 58 93 158 73 39 129 139 137 139 86 150 194 170 150 105 144 145 228 299 195 116 77 147 180 91 141 53 119 86 98 140 121 101 176 224 290
524 290 316 120 64 31 144 149 231 92 71 175 127 106 58 57 140 138 33 110 98 180 22 184 194 115 133 113 145 71 99 110 188 79 122
137 122 105 153 294 154 75 143 111 110 99 44 100 66 74 30 86 136 31 110 247 94 115 119 81 264 124 52 102 44
$$ packed form
2813A77jJ74J3l32M0J73p1R2J8k6r5o3K0j6N5L2o5r5R0m8L9J7K6n7%R7o8M6m1q2O7J2q2N5
2414A01J7O9P0j7j38K8P1o0J8j29J21K8q6N7j8J4J3k0m3M2L3j68J48Q3j29j0J7k7l7Q7j06
2050B9J50j02m0J35r4O0%rJ1j6J6K0l7o4J25J62k07m4Pq2J20J15r9J9j10J37J07j55k4O1O1
1686B52j26K7j5P9m8j42L9P2no0J50j54K2Pj1j0M5o5J01n9k5J89j96m9R7L4N0r7M6o4K07j50
1311A41J04m3j52Q0m3Jj3R1j03J10rM3j10J58p4r2rP5o7J07J37j30j42K5Q7R4k44J22q6J4
959G2Lj7L5O5q5l4R0J0kKn3O4M4k4k0m5L9JQ3P1j04p9l9P0L3q9N0q8O6l3J2M2j9k0P5M8O6
524B90K6j96n6l3J13NQ2j39k1J04m8k1m8jQ3kj05P7j2Q2j58J62J0p9J8k0L2p4K8J1P8j09M3
137A22j7M8J41j40p9O8l2jj1n5N6l4Qm4N6N0j05P9J37j53K1Ml8J83j40p2N0n8
-192D4
##PAGE=	F1=-14613.5
##FIRST=	25164.767445380970457,	5806.2096540000038658,	0
##DATA TABLE=	(F2++(Y..Y)), PROFILE
$$ plain form
5806 92 96 68 71 104 71 82 98 93 85 149 88 229 89 166 143 234 270 134 301 106 150 155 40 110 73 287 250 28 111 82 53 47 62 67 151
5395 151 35 182 156 158 108 114 60 79 36 89 275 77 159 185 78 84 86 69 39 141 180 164 98 50 29 251 135 74 18 223 395 259
5020 259 112 299 355 253 80 192 107 45 217 148 94 218 402 180 48 23 40 28 57 105 156 157 112 143 78 75 92 148 96 69 186
4656 186 177 263 226 89 104 167 187 57 57 76 92 308 356 152 132 242 182 243 98 146 27 152 183 104 51 111 58 229 185 61 20
4292 20 89 125 62 8 283 446 151 60 9 198 103 204 231 238 48 98 56 130 79 75 66 165 149 12 80 115 48 148 132 142 66 193
3916 193 63 100 29 203 64 146 33 57 80 165 150 53 76 66 183 194 189 249 105 91 25 104 91 47 80 123 220 212 219 237 168 113 250
3529 250 236 68 122 65 41 63 154 132 54 71 177 107 229 131 18 55 149 244 113 179 209 193 190 132 61 190 98 197 127 67 105 121
3154 121 90 126 169 212 193 114 143 186 167 133 110 86 15 76 168 238 159 176 114 176 143 70 117 53 58 69 103 54 136 128 309 321 67 13 264
$$ packed form
5806I2Mk8LL3l3J1J6nqO4o1J41j40P7k3R1L6j36J67j95M4Nj15P0l7K14l7k22Q3k9k9oJ5NQ4
5395A51j16J47k6Kn0On4J9m3N3J86j98Q2K6j07OKj7l0J02L9j6o6m8k1K22j16o1n6K05J72j36
5020B59j47J87N6j02j73J12q5o2J72o9n4J24J84k22j32k5J7j2K9M8N1Jm5L1o5lJ7N6n2k7J17
4656A86rQ6l7j37J5O3K0j30%J9J6K16M8k04k0J10o0O1j45M8j19J25L1p9n3O0n3J71m4j24m1
4292B0O9L6o3n4K75J63k95r1n1J89r5J01K7Pj90N0m2P4n1mrR9j6j37O8L5o7J00j6J0p6J27
3916A93j30L7p1J74j39Q2j13K4K3Q5j5r7K3j0J17J1nO0j44j4o6P9j3m4L3M3R7qPJ8o9n5J37
3529B50j4j68N4n7k4K2R1k2p8J7J06p0J22r8j13L7R4R5j31O6L0j6ln8p1J29r2R9p0o0L8J6
3154A21l1L6M3M3j9p9K9M3j9l4k3k4p1O1R2P0p9J7o2O2l3p3M7o4NJ1L4m9Q2qJ81J2k54n4K51
$$ plain form
2743 264 190 197 286 301 147 60 94 117 143 136 104 40 119 35 120 99 138 96 142 226 161 170 175 59 167 147 54 141 116 188 220 171 97 124 218
2332 218 212 225 31 168 178 111 164 87 134 141 102 89 153 155 10 144 258 139 108 93 51 14 139 5 189 46 18 156 83 108 125
1968 125 159 171 149 123 131 141 73 208 349 118 98 93 3 168 282 182 97 58 185 284 153 142 176 247 93 169 134 227 128 80 71 153
1592 153 120 60 194 65 91 109 115 110 111 33 137 136 72 192 99 65 119 144 191 100 170 89 320 188 246 178 71 119 103 85 102 148 79
1205 79 181 122 241 79 257 213 79 53 129 120 207 333 191 51 69 170 215 47 148 73 32 60 59 131 152 46 30 148 156 152 144
841 144 114 162 195 169 168 98 126 123 231 274 133 73 124 159 183 78 154 89 151 124 53 87 100 113 214 260 245 233 105 74 66 155 138 230
442 230 71 115 170 129 160 39 54 109 157 28 138 113 133 5 198 222 140 141 118 97 61 85 92 199 122 145 145 203 315 149 76 85 83
55 83 93 107 57 132 65 106 72 47 95 72 44 224 139 119 99 94 256 118 46 113 43
$$ packed form
2743B64p4PQ9J5j54q7L4K3K6pl2o4P9q4Q5k1L9m2M6Q4o5RNj16J08k0r3Q7k5P2L2m9p4K7R4
2332B18oJ3j94J37J0o7N3p7M7Pl9j3O4Kj45J34J14j19l1j5m2l7J25j34J84j43k8J38p3K5J7
1968A25L4J2k2k6QJ0o8J35J41k31k0nr0J65J14j00q5l9J27R9j31j1L4P1j54P6l5R3r9m8rQ2
1592A53l3o0J34j29K6J8OnJp8J04jo4J20r3l4N4K5M7r1P0q1K31j32N8o8j07M8j6j8J7M6o9
1205G9J02n9J19j62J78m4j34k6P6rQ7J26j42j40J8J01M5j68J01p5m1K8jP2K1j06j6J18Qmq
841A44l0M8L3k6jp0K8lJ08M3j41o0N1L5K4j05P6o5O2k7p1L4J3J3J01M6j5j2j28l1qQ9j7R2
442B30j59M4N5m1L1j21J5N5M8j29J10k5K0j28J93K4q2Jk3k1l6K4PJ07p7K3%N8J12j66p3Rk
55H3J0J4n0P5o7M1l4k5M8k3k8J80q5k0k0nJ62j38p2O7p0
-192D3
##PAGE=	F1=-14715.8
##FIRST=	25164.767445380970457,	5806.2096540000038658,	0
##DATA TABLE=	(F2++(Y..Y)), PROFILE
$$ plain form
5806 91 91 37 51 70 59 112 121 102 115 166 79 279 148 123 146 248 281 150 217 51 151 182 81 148 111 300 284 47 170 115 29
5442 29 88 26 86 58 37 169 214 207 142 101 50 61 80 103 222 52 161 211 88 167 88 95 85 191 178 178 70 51 51 267 142 80 23
5055 23 196 344 192 130 318 360 209 36 176 130 19 231 134 127 214 378 168 98 42 49 19 16 150 177 156 151 202 130 124 70 165 99
4679 99 45 149 193 249 181 69 156 209 221 111 92 149 77 304 358 199 84 211 197 222 93 86 50 129 122 66 73 75 72 209 183 40 38
4292 38 89 129 34 55 271 479 165 64 6 178 123 215 288 263 33 105 59 142 101 118 127 147 222 50 74 95 70 141 153 148 125 203 67
3905 67 81 53 170 131 150 54 71 96 196 182 98 76 48 135 156 228 238 104 48 6 100 78 48 97 90 264 264 189 199 117 69 244 178 47
3506 47 88 89 62 98 149 84 39 93 215 72 191 134 15 46 149 212 93 185 173 255 179 176 43 215 68 165 114 44 134 132 121 110
3130 110 154 211 175 143 138 207 212 107 41 56 50 101 170 208 140 171 98 175 166 66 128 85 29 67 94 41 107 84 258 279 104 43 260 202
$$ packed form
5806I1%n4J4J9j1N3Rj9J3N1q7K00j31k5K3J02L3j31O7j66J00L1j01O7l7J89j6k37J23n5q6
5442B9N9o2O0k8k1J32M5po5m1n1J1J9K3J19j70J09N0j23P9p9Pj0J06j3%j08j9%K16j25o2n7
5055B3J73J48j52o2J88M2j51j73J40m6j11K12r7pQ7J64k10p0n6Pl0lJ34K7k1nN1p2on4R5o6
4679I9n4J04M4N6o8j12Q7N3J2j10j9N7p2K27N4j59j15J27j4K5j29pl6P9pn6PKlJ37k6j43k
4292C8N1M0r5K1K16K08l14j01n8J72n5R2P3k5k30P2m6Q3m1J7RK0P5j72K4K1k5P1J2nk3P8j36
3905F7J4k8J17l9J9r6J7K5J00j4q4k2k8Q7K1P2J0j34n6m2R4k2l0M9pJ74%p5J0q2m8J75o6j31
3506D7M1Jk7L6N1o5m5N4J22j43J19n7j19L1J03O3j19R2j2Q2p6lj33J72j47R7n1p0R0kj1j1
3130A10M4N7l6l2nO9Nj05o6J5oN1O9L8o8L1p3P7rj00O2m3n6L8K7n3O6k3J74K1j75o1K17n8
$$ plain form
2731 202 126 267 317 124 32 110 147 122 88 112 89 128 43 113 60 108 92 179 233 190 164 203 67 198 181 151 172 117 168 178 101 113 114
2344 114 229 278 291 68 173 152 130 208 43 112 110 55 80 162 119 34 127 272 164 119 94 42 49 132 43 183 26 4 126 77 71 98
1968 98 179 180 158 110 100 188 141 206 318 97 117 99 41 176 294 213 30 81 149 235 159 155 188 217 73 169 113 208 94 138 96 146 117
1581 117 55 148 57 77 95 128 155 112 16 122 173 125 131 121 120 125 127 182 79 170 101 315 210 235 127 147 107 128 124 149 102 120 196 70
1182 70 273 85 266 238 68 45 101 136 204 309 181 82 41 174 177 62 140 95 21 44 45 143 155 81 67 171 156 149 156 110 178 183 152
794 152 192 91 69 66 220 222 77 103 172 153 179 76 170 130 177 155 32 54 77 112 244 273 159 106 85 63 114 167 142 244 63 161
419 161 154 121 194 35 74 69 158 33 157 144 100 38 212 232 163 168 171 51 52 73 74 186 135 157 167 232 309 128 61 35 54 81 99 69 145
8 145 50 141 124 15 71 121 19 199 182 120 73 101 216 111 37 116 33
$$ packed form
2731B02p6J41N0j93r2P8L7k5l4K4k3L9q5P0n3M8j6Q7N4m3k6L9j36J31j7l0K1n5N1J0p7J2J
2344A14J15M9J3k23J05k1k2P8j65O9kn5K5Q2m3q5R3J45j08m5k5n2PQ3q9J40j57k2J22m9oK7
1968I8Q1Jk2m8j0Q8m7O5J12k21K0j8n8J35J18q1j83N1O8Q6p6mL3K9j44R6n6R5j14M4m2N0k9
1581A17o2R3r1K0J8L3K7m3r6J06N1m8Oj0jNKN5j03R1o9K14j05K5j08K0m0K1mK5m7J8P6j26
1182G0K03j88J81k8j70k3N6L5O8J05j28r9m1J33Lj15P8m5p4K3JR8J2p4j4J04j5pPm6O8Nl1
794A52M0j01k2lJ54Kj45K6O9j9K6j03R4m0M7k2j23K2K3L5J32K9j14n3k1k2N1N3k5J02j81R8
419A61pl3P3j59L9nQ9j25J24j3m4o2J74K0o9NLj20JK1JJ12n1K2J0O5P7j81o7k6J9K7J8l0P6
8A45r5R1j7j09N6N0j02J80j7o2m7K8J15j05p4P9q3
-192C3
##PAGE=	F1=-14818.1
##FIRST=	25164.767445380970457,	5806.2096540000038658,	0
##DATA TABLE=	(F2++(Y..Y)), PROFILE
$$ plain form
5806 87 91 5 33 37 42 141 147 107 139 169 70 318 184 88 133 251 275 164 125 23 121 167 120 179 154 297 298 118 222 172 24 113 71
5419 71 114 52 38 147 278 247 164 79 72 60 119 108 148 24 173 217 145 263 87 102 126 217 180 190 48 64 67 264 152 71 47 169
5043 169 291 133 144 310 326 166 29 151 146 68 225 120 149 181 315 164 157 65 59 35 80 178 182 151 176 245 180 185 96 181 108 14
4668 14 103 191 213 129 67 196 236 231 156 187 205 67 283 325 222 38 185 201 188 98 40 75 102 56 65 104 43 83 173 167 24 78 109
4280 109 135 20 102 245 481 162 106 39 146 124 204 324 269 36 125 71 145 129 158 185 118 271 103 64 67 86 120 171 139 184 209
3916 209 85 77 74 131 181 160 82 99 97 206 200 149 81 38 82 118 238 199 93 20 8 82 50 44 120 54 291 303 147 138 110 44 234 101
3517 101 33 40 109 97 134 126 44 14 109 224 27 159 146 38 38 144 174 63 190 141 313 157 218 40 231 70 122 104 23 152
3165 152 131 134 100 131 193 140 165 106 257 242 81 42 126 132 101 169 164 109 145 76 163 177 77 119 124 29 70 88 27 95 73 202 233 121
$$ packed form
5806H7Mq6K8MNR9Om0L2L0r9K48j34r6M5J18K4j11l9j02R8M6m7N9k5J43Jj80J04n0j48Q9m2
5419G1M3o2j4J09J31l1q3q5pj2N9j1M0j24J49M4p2J18j76J5K4R1l7J0j42J6LJ97j12q1k4J22
5043A69J22j58J1J66J6j60j37J22np8J57j05K9L2J34j51pr2ok4M5R8Ml1K5O9o5Nq9Q5p3r4
4668A4Q9Q8K2q4o2J29M0np5L1J8j38K16M2j03j84J47J6j3r0n8L5K7m6RL9o1M0R0oj43N4L1
4280A09K6j15Q2J43K36l19n6o7J07k2Q0J20n5k33Q9n4P4j6K9K7o7J53j68l9LJ9L4N1l2M5K5
3916B09j24qlN7N0k1p8J7kJ09on1o8m3M4L6J20l9j06p3j2P4l2oP6o6K37J2j56rk8o6J90j33
3517A01o8PO9j2L7qq2l0R5J15j97J32j3j08%J06L0j11J27m9J72j56O1j78J91j61N2j8q1J29
3165A52k1Ll4L1O2n3K5n9J51j5j61l9Q4Ol1O8nn5L6o9Q7J4j00M2Nr5M1J8o1O8k2J29L1j12
$$ plain form
2766 121 78 234 208 63 228 300 103 62 149 189 103 48 142 133 150 107 85 17 64 97 198 215 205 153 209 65 201 215 236 188 120 138
2391 138 146 51 148 113 222 323 336 101 168 102 143 265 64 111 84 23 85 166 70 70 104 280 180 116 118 84 102 127 76 163 20 10
2015 10 94 65 37 62 185 165 154 97 65 236 217 193 263 83 155 121 91 165 279 242 51 116 101 172 168 169 227 192 66 150 73 169 92
1628 92 183 130 111 111 69 102 50 62 66 127 208 120 10 112 203 186 104 128 162 135 98 173 64 146 120 280 207 212 56 220 86 158 153 186
1229 186 45 184 202 36 293 99 281 252 56 50 81 132 186 265 174 131 33 174 169 61 122 91 25 29 20 129 146 121 104 190 139 127
853 127 161 80 195 163 132 211 91 18 21 199 154 51 140 187 131 165 78 182 164 191 172 76 92 50 104 258 260 74 38 107 32 171
477 171 182 154 250 61 192 133 117 206 52 89 43 142 46 157 179 106 75 224 224 162 197 235 42 57 68 56 148 114 158 174 235 284 100
90 100 52 18 26 64 82 62 148 37 172 156 29 60 138 52 178 209 109 56 86 146 97 37 105 12
$$ packed form
2766A21m3J56k6j45J65P2j97m1Q7M0q6n5R4rJ7m3k2o8M7L3J01J7j0n2N6j44J36J4K1m8o8J8
2391A38Qr5R7l5J09J01J3k35O7o6M1J22k01M7k7o1O2Q1r6%L4J76j00o4Kl4J8K5n1Q7j43j0
2015A0Q4k9k8K5J23k0j1n7l2J71j9k4P0j80P2l4l0P4J14l7j91O5j5P1mJN8l5j26Q4p7R6p7
1628I2R1n3j9%m2L3n2J2MO1Q1q8j10J02R1j7q2K4L4k7l7P5j09Q2k6J60p3Nj56J64j34P2nL3
1229A86j41J39J8j66K57j94J82k9j96oL1N1N4P9r1m3r8J41nj08O1l1o6MrJ09J7k5j7Q6n1j2
853A27L4q1J15l2l1P9j20p3LJ78m5j03Q9M7n6L4q7J04j8K7j9r6J6m2N4J54Kj86l6O9p5J39
477A71J1k8R6j89J31n9j6Q9j54L7m6R9r6J11K2p3l1J49%o2L5L8j93J5J1j2R2l4M4J6O1M9j84
90A00m8l4QL8J8k0Q6j11J35j6j27L1P8q6J26L1j00n3L0O0m9o0O8r3
-192A2
##PAGE=	F1=-14920.3
##FIRST=	25164.767445380970457,	5806.2096540000038658,	0
##DATA TABLE=	(F2++(Y..Y)), PROFILE
$$ plain form
5806 80 90 33 29 26 29 162 164 109 150 162 78 338 194 67 108 240 250 169 46 40 79 116 144 204 186 278 297 173 255 245 53 117 120 136
5407 136 129 38 111 327 273 171 66 113 77 143 98 68 11 186 199 207 331 84 93 155 212 189 202 41 79 73 244 166 56 70 154 249
5032 249 93 149 272 258 145 62 124 156 104 197 109 164 125 232 163 214 83 70 37 129 194 175 130 188 272 221 241 156 197 110 56 62 183
4644 183 167 85 72 215 244 220 194 266 241 68 249 261 217 50 178 189 148 116 60 98 75 45 106 125 19 96 120 143 54 133 143 140
4269 140 24 136 212 462 139 141 84 104 101 178 334 250 56 143 84 138 147 192 229 86 289 144 57 46 104 91 185 119 226 208 102
3905 102 88 78 86 205 177 108 130 119 205 207 195 82 33 59 131 221 140 74 36 28 57 46 47 155 57 291 322 107 77 161 51 217 33
3517 33 33 18 126 134 160 90 57 39 126 214 32 134 162 68 46 134 136 31 188 112 355 129 256 51 233 74 76 95 22 160 131
3154 131 122 97 99 157 94 174 73 308 249 64 85 178 215 80 159 111 74 105 61 140 176 111 92 155 62 83 91 15 95 99 142 179 113 83 197
$$ packed form
5806H0J0n7mlLJ33Kn5M1J2q4K60j44j27M1J32J0q1j23oL9L7K8O0j8R2J9j24Q2j0j92O4LJ6
5407A36pr1P3K16n4j02j05M7l6O6m5l0n7J75J3QJ24k47RO2N7k3J3j61L8oJ71p8j10J4Q4R5
5032B49j56N6J23j4j13q3O2L2n2R3q8N5l9J07o9N1j31j3l3R2O5j9m5N8Q4n1K0q5M1q7n4OJ21
4644A83j6q2j3J43K9k4k6P2k5j73J81J2m4j67J28J1m1l2n6L8k3l0O1J9j06P7K4K3q9P9J0l
4269A40j16J12P6K50l23Kn7K0lP7J56q4j94Q7n9N4RM5L7j43K03j45q7j1N8j3R4o6J07j8j06
3905A02j4j0QJ19k8o9K2j1Q6Kj2j13m9K6P2R0q1o6l8qK9j1JJ08r8K34L1k15l0Q4j10J66j84
3517C3%j5J08QK6p0l3j8Q7Q8j82J02K8r4k2Q8Kj05J57p6K43k26J27k05J82j59KJ9p3J38k9
3154A31rk5KN8o3Q0j01K35n9j85K1R3L7j35P9m8l7L1m4P9L6o5j9O3r3K1Qp6Q0MM3L7o6l0J14
$$ plain form
2743 197 205 22 175 251 103 96 183 227 93 15 172 162 179 183 49 26 14 107 190 174 201 145 200 69 174 239 295 188 121 112 130 44
2367 44 195 139 194 336 349 123 160 41 147 308 115 153 82 28 112 173 34 109 77 283 193 101 143 124 148 135 96 135 23 29 80
2003 80 56 42 44 172 130 144 87 29 265 276 188 192 72 212 164 135 148 238 262 102 161 50 109 174 189 276 208 65 110 21 126 101
1628 101 206 167 75 90 92 82 45 68 46 123 257 128 19 100 221 229 103 118 183 149 72 164 87 107 138 225 187 181 19 267 50 187
1252 187 159 201 9 241 190 79 293 105 300 251 44 60 74 117 154 208 168 178 69 169 190 52 99 60 20 31 14 97 123 141
900 141 133 200 109 93 150 75 216 142 127 216 96 119 99 167 81 59 152 168 99 137 83 192 180 190 171 143 155 23 94 253 223 72 57
513 57 120 63 227 196 161 234 52 199 108 117 199 90 105 58 118 63 139 210 137 109 232 203 136 213 273 56 75 75 43 94 65 152 173 216
114 216 251 76 87 49 3 36 79 33 158 48 195 165 47 44 120 70 165 215 81 73 51 59 77 56 76 20
$$ packed form
2743A97Qj83J53P6j48pQ7M4j34p8J57j0J7Mj34k3j2R3Q3j6K7n6N5j31J05O5N6j07o7rJ8q6
2367D4J51n6N5J42J3k26L7j19J06J61j93L8p1n4Q4O1j39P5l2K06r0r2M2j9K4j3l9L9j12ON1
2003H0k4j4KJ28m2J4n7n8K36J1q8Mj20J40m8k9J3R0K4j60N9j11N9O5J5Q7o8j43M5q9J05k5
1628A01J05l9r2J5Kj0l7K3k2P7J34j29j09Q1J21Qj26J5O5l4p7R2p7K0L1Q7l8oj62K48k17J37
1252A87k8M2j92K32n1j11K14j88J95m9k07J6J4M3L7N4m0J0j09J00K1j38M7l9m0J1j7Q3K6J8
900A41qO7r1j6N7p5J41p4j5Q9j20K3k0O8q6k2R3J6o9L8n4J09j2J0j9k8J2j32P1J59l0j51j5
513E7O3n7J64l1l5P3j82J47r1RQ2j09J5m7O0n5P6P1p3k8J23k9o7P7O0k17J9%l2N1k9Q7K1M3
114B16L5j75J1l8m6L3M3m6J25j10J47l0j18lP6n0R5N0j34qk2QJ8k1K0n6
-192B0
##PAGE=	F1=-15022.6
##FIRST=	25164.767445380970457,	5806.2096540000038658,	0
##DATA TABLE=	(F2++(Y..Y)), PROFILE
$$ plain form
5806 70 86 60 37 34 33 174 162 110 146 150 98 335 184 56 75 214 210 162 51 56 81 74 150 221 197 248 283 201 262 318 88 106 152 143 174
5395 174 38 65 347 281 172 80 151 99 153 77 53 25 194 161 254 355 74 75 168 177 199 216 35 96 73 213 179 54 87 154 225
5032 225 77 144 211 168 149 83 103 162 120 160 121 175 56 154 166 262 97 78 54 157 204 164 93 187 286 250 284 218 214 101 110 35 177
4644 177 129 61 74 212 234 200 225 307 256 75 205 175 188 95 188 157 99 144 100 123 50 99 140 135 12 115 57 118 94 192 183 140 35
4257 35 147 180 432 120 163 131 65 73 148 315 212 79 146 87 119 148 218 257 53 277 164 61 56 129 71 192 101 243 193 116
3905 116 105 60 38 203 200 127 156 166 201 202 227 69 39 78 180 185 78 52 59 62 37 87 76 202 110 264 319 84 80 216 83 191 58
3517 58 52 70 139 163 169 63 86 80 143 198 82 119 173 96 64 125 111 43 179 84 367 95 283 66 223 62 40 82 55 156 147 87
3142 87 106 70 110 51 172 80 336 229 63 102 195 281 79 135 59 37 61 62 105 167 162 57 165 87 100 99 15 95 125 80 117 83 56
$$ packed form
5806G0J6k6k3ljJ41j2n2L6Mn2K37j51j28J9J39mm8j11NK5pP6P1k4N1L5q2O1N6k30J8M6rL1
5395A74j36K7K82o6j09r2P1n2N4p6k4k8J69l3R3J01k81JR3RK2J7j81O1k3J40l4j25L3O7P1
5032B25j48O7O7m3j9o6K0N9m2M0l9N4j19R8J2R6j65j9k4J03M7m0p1R4R9l6L4o6mj13Rp5J42
4644A77m8o8J3J38K2l4K5Q2n1j81J30l0J3r3R3l1n8M5m4K3p3M9M1nj23J03n8O1k4R8rm3j05
4257C5J12L3K52l12M3l2o6QP5J67j03j33O7n9L2K9P0L9k04K24j13j03nP3n8J21r1J42n0p7
3905A16j1m5k2J65lp3K9J0L5JK5j58l0L9J02Nj07k6PLk5N0j1J26r2J54N5k35mJ36j33J08j33
3517E8oJ8O9K4Oj06K3oO3N5j16L7N4p7l2O1j4o8J36r5K83k72J88k17J57j61k2M2k7J01ro0
3142H7J9l6M0n9J21r2K56j07j66L9R3Q6k02N6p6k2K4JM3O2nj05J08p8J3jq4Q0L0m5L7l4k7
$$ plain form
2754 56 155 192 47 125 186 127 113 201 251 106 21 182 170 204 253 85 62 36 109 156 116 185 151 188 98 124 246 320 174 112 93 114
2379 114 50 245 187 152 319 326 135 156 50 137 322 149 209 92 24 145 187 53 140 50 279 207 90 156 142 182 152 98 108 30
2027 30 58 94 50 64 62 144 86 127 79 12 268 302 195 118 58 275 213 157 135 185 270 147 211 3 90 173 213 319 258 61 62 66 108
1639 108 93 204 202 105 54 115 99 45 97 57 125 292 127 41 84 226 245 95 93 180 163 84 160 126 65 152 162 156 147 82 271 3 207
1252 207 144 195 44 267 154 137 270 100 317 234 37 75 72 103 114 145 158 212 107 159 217 50 76 35 23 59 47 61 97 136 152
888 152 194 69 67 128 135 240 128 128 204 98 214 166 128 21 72 136 125 60 104 91 203 173 177 156 213 213 38 95 229 169 130 51 120
501 120 151 271 202 163 199 34 182 76 115 177 144 139 70 97 79 111 229 163 134 236 180 96 212 267 46 91 94 37 55 29 145 171
125 171 184 225 63 141 85 18 20 100 26 182 69 204 159 53 20 72 70 158 203 47 109 7 32 64 84 36 59
$$ packed form
2754E6R9L7j45P8O1n9j4Q8N0j45q5J61j2L4M9j68k3k6P3M7m0O9l4L7r0K6J22P4j46o2j9K1
2379A14o4J95n8l5J67Pj91K1j06Q7J85j73O0j17o8J21M2j34Q7r0K29p2j17O6j4M0l0n4J0p8
2027C0K8L6m4J4kQ2n8M1m8o7K56L4j07p7o0K17o2n6k2N0Q5j23O4k08Q7Q3M0J06o1j97JMM2
1639A08j5J11kr7n1O1j6n4N2m0O8J67j65q6M3J42J9j50kQ7j7p9P6l4o1Q7J0oro5J89k68K04
1252B07o3N1j51K23j13j7J33j70K17q3j97L8lL1J1L1J3N4j05N2N8j67K6m1j2L6j2J4L6L9J6
888A52M2j25kO1PJ05j12%P6j06J16m8l8j07N1O4j1o5M4j3J12l0Mk1N7%j75N7J34o0l9p9O9
501A20L1J20o9l9L6j65J48j06L9O2l3no9K7j8L2J18o6k9J02n6q4J16N5k21M5Ln7J8k6J16K6
125A71J3M1j62P8n6o7KQ0p4J56j13J35m5j06l3N2kQ8M5j56O2j02K5L2K0m8K3
-192E9
##PAGE=	F1=-15124.8
##FIRST=	25164.767445380970457,	5806.2096540000038658,	0
##DATA TABLE=	(F2++(Y..Y)), PROFILE
$$ plain form
5806 59 75 77 46 34 46 173 136 112 129 135 108 307 160 55 42 176 162 147 95 66 121 111 140 228 182 217 258 195 242 377 124 94 172
5419 172 129 178 42 18 336 270 178 109 172 121 161 62 108 41 194 113 276 331 55 62 173 124 202 230 36 119 75 180 186 75 99
5055 99 161 210 77 129 147 82 158 88 91 159 110 138 160 179 11 120 171 295 103 75 87 163 209 165 50 180 291 270 316 266 228 84
4679 84 156 19 173 107 64 70 190 205 182 243 302 251 86 164 86 145 131 195 110 47 174 127 144 41 145 151 146 21 140 26 99 124
4304 124 241 226 136 44 130 154 397 142 169 171 60 90 123 273 168 97 132 79 91 136 232 273 31 243 158 73 77 150 74 195 106
3940 106 229 160 126 117 22 22 184 228 136 169 210 192 186 240 48 70 92 219 142 31 26 71 104 48 130 118 252 173 215 299 69 123 245
3553 245 131 161 94 91 106 152 176 157 79 94 111 151 185 119 110 171 118 82 118 105 83 169 47 343 68 298 79 203 36 44 69 92
3177 92 143 178 51 133 79 60 42 162 102 327 191 69 86 179 313 114 99 34 6 50 72 58 151 216 59 149 97 115 105 21 89
$$ packed form
5806E9J6Kl1j2J2J27l7k4J7Ok7J99j47j05j3J34j4j5n2k9N5j0K9Q8m6L5M1o3M7J35k53l0P8
5419A72m3M9j36k4L18o6r2o9O3n1M0r9M6o7J53q1J63N5k76PJ11m9P8K8j94Q3m4J05Oj11K4
5055I9O2M9j33N2J8o5P6p0LO8m9K8K2J9j68J09N1J24j92k8J2P6M6m4j15J30J11k1M6n0l8j44
4679H4P2j37J54o6m3OJ20J5k3O1N9n1j65P8p8N9j4O4q5o3J27m7J7j03J04Onj25J19j14P3K5
4304A24J17j5r0r2Q6K4K43k55K7Kj11L0L3J50j05p1L5n3J2M5R6M1k42K12q5q5MP3p6J21q9
3940A06J23o9l4rr5%J62M4r2L3M1j8oN4j92K2K2J27p7j11nM5L3n6Q2j2J34p9M2Q4k30N4J22
3553B45j14L0o7lJ5M6K4j9p8J5J7M0L4o6rO1n3l6L6j3k2Q6j22K96k75K30k19J24j67QK5K3
3177I2N1L5j27Q2n4j9j8J20o0K25j36j22J7R3J34j99j5o5k8M4K2j4R3O5j57R0n2J8j0q4O8
$$ plain form
2813 89 137 17 57 38 31 114 168 81 117 155 156 112 204 255 140 55 162 159 209 303 167 83 69 94 108 54 169 180 182 142 59 230 310 153
2414 153 94 70 87 53 284 239 113 276 274 142 160 112 110 296 148 245 93 6 172 202 76 154 48 259 226 87 154 128 203 161
2062 161 82 87 38 93 112 36 70 80 104 41 102 75 41 246 291 201 48 45 330 255 150 123 142 264 180 253 31 143 168 234 343 307
1686 307 52 63 141 130 64 177 230 175 16 134 122 53 131 76 136 300 111 73 63 216 232 67 59 157 171 124 163 155 35 159 105
1322 105 116 106 118 229 68 215 119 172 56 251 101 192 225 85 328 201 45 94 69 105 78 85 142 228 132 152 231 55 57 85
970 85 42 96 83 55 96 112 153 172 22 68 111 210 267 124 116 175 94 286 206 90 47 85 103 71 25 90 102 208 141 159 133 271 257
583 257 81 112 189 114 185 86 148 240 295 196 161 160 32 149 42 108 146 200 192 58 83 91 93 232 173 150 238 166 61 192 215 3 98
196 98 118 36 83 90 142 167 152 213 71 188 119 39 68 134 82 211 84 196 154 47 31 26 59 151 179 51 143 43 103 77 108 27 99
$$ packed form
2813H9M8j20M0j9pQ3N4q7L6L8Jm4R2N1j15q5J07lN0R4j36q4j4K5J4n4J15J1Km0q3J71Q0j57
2414A53n9k4J7l4K31m5j26J63kj32J8m8kJ86j48R7j52q7J66L0j26P8j06K11l3j39O7k6P5m2
2062A61p9Nm9N5J9p6L4J0K4o3O1k7l4K05M5r0j53lK85p5j05k7J9J22q4P3k22J12K5O6J09l6
1686C07k55J1P8j1o6J13N3n5j59J18j2o9P8n5O0J64j89l8j0J53J6j65qR8J4m7L9qj20J24n4
1322A05J1j0J2J11j61J47r6N3j16J95j50R1L3j40K43j27j56M9k5L6k7PN7Q6r6K0P9j76KK8
970H5m3N4j3k8M1J6M1J9j50M6M3R9N7j43qN9q1J92q0j16m3L8J8l2m6O5J2J06o7J8k6J38j4
583B57j76L1P7p5P1r9O2R2N5r9l5jj28J17j07O6L8N4qj34K5QKJ39n9k3Q8p2j05J31K3k12R5
196I8K0q2M7PN2K5j5O1j42J17o9q0K9O6n2J29j27J12m2j07j6nL3R2K8j28R2j00O0k6L1q1P2
-192I9
##PAGE=	F1=-15227.1
##FIRST=	25164.767445380970457,	5806.2096540000038658,	0
##DATA TABLE=	(F2++(Y..Y)), PROFILE
$$ plain form
5806 46 56 82 50 25 54 159 86 111 101 116 97 258 132 67 16 129 118 131 120 78 142 164 120 220 148 191 220 154 202 410 160 101
5431 101 190 97 149 51 27 294 237 186 136 170 138 175 74 147 58 186 62 268 266 26 61 179 84 195 244 66 147 91 156 179 100
5067 100 112 170 194 82 107 112 52 155 82 85 138 77 155 203 171 58 130 172 304 103 62 116 156 206 189 44 170 291 282 339 294 232
4691 232 73 183 28 162 100 86 60 152 157 172 244 256 227 102 148 58 104 148 190 60 31 196 137 157 66 177 143 169 26 167
4339 167 78 99 136 263 267 140 43 86 137 354 193 157 197 89 152 105 215 140 112 106 66 72 125 230 277 42 197 131 85 92 160 92
3963 92 199 134 192 112 134 120 32 63 160 257 142 166 231 174 161 235 64 116 83 228 105 24 3 68 143 74 155 157 289 230 159 267
3588 267 46 148 237 191 134 111 142 119 170 167 128 116 80 129 147 171 131 104 153 132 97 115 109 115 159 13 287 75 298 89 177 3
3212 3 66 63 123 120 207 81 170 118 25 51 149 102 283 147 66 49 144 303 147 61 44 44 79 79 7 130 262 109 110 98 122 106 22 74
$$ packed form
5806D6J0K6l2k5K9J05p3K5j0J5j9J61j26o5n1J13j1J3j1m2O4K2m4J00p2M3K9o6M8K08k50n9
5431A01Q9r3N2r8k4K67n7n1n0L4l2L7j01P3q9J28j24K06kk40L5J18r5J11M9j78Q1n6O5K3p9
5067A00J2N8K4j12K5No0J03p3LN3o1P8M8l2j13P2M2J32k01m1N4M0N0j7j45J26J21rN7m5o2
4691B32j59J10j55J34o2j4k6R2NJ5P2J2k9j25M6r0M6M4M2j30k9J65n9K0r1J11l4K6j43J41
4339A67q9K1L7J27Mj27r7M3N1K17j61l6M0j08O3m7J10p5k8om0ON3J05M7k35J55o6m6PO8o8
3963I2J07o5N8q0K2j4q8L1R7R7j15K4O5n7j3P4j71N2l3J45j23q1k1O5P5o9Q1KJ32n9p1J08
3588B67k21J02Q9m6n7k3L1k3N1ll9j2l6M9J8K4m0k7M9k1l5J8oOM4j46K74k12K23k09Q8j74
3212CO3lO0lQ7j26Q9n2r3K6R8m7J81j36q1j7R5J59j56q6j7%L5%p2J23J32j53Jj2K4j6q4N2
$$ plain form
2813 74 136 43 34 23 82 76 134 103 158 203 175 104 199 240 186 96 117 138 187 318 241 86 79 64 86 50 170 226 183 181 15 194 272 133
2414 133 70 43 59 72 304 281 89 218 206 151 162 162 70 234 110 243 81 43 187 206 79 145 80 220 248 85 143 81 210
2074 210 149 49 77 53 126 117 6 54 80 63 25 66 71 65 208 247 191 14 35 363 280 117 102 124 244 197 276 52 211 164 243 342
1698 342 329 60 119 201 168 36 133 248 241 45 150 136 76 159 93 147 278 86 111 45 192 197 33 40 123 169 159 172 165 28 155
1334 155 61 63 62 124 146 138 209 93 141 44 193 77 238 167 69 330 155 73 110 59 118 63 38 122 225 143 156 222 58 47 146 59
959 59 129 118 91 120 89 131 136 26 75 113 271 290 137 80 135 94 325 215 86 85 99 67 19 37 113 108 198 94 145 112 302 281 128
571 128 138 142 79 229 138 189 304 295 178 156 136 62 110 19 104 111 244 244 19 73 96 96 215 162 154 239 167 48 162 132 72 97 138 39
172 39 127 154 143 159 137 215 97 214 144 64 122 172 139 232 88 173 161 37 74 83 53 138 146 94 168 75 142 103 124 65 130
$$ packed form
2813G4O2r3rj1N9oN8l1N5M5k8p1R5M1n4r0K1K1M9J31p7j55pj5K2l6J20N6m3kj66J79P8j39
2414A33o3k7J6J3K32k3j92J29j2n5J1%r2J64j24J33j62l8J44J9j27O6o5J40K8j63N8o2J29
2074B10o1j00K8k4P3rj11M8K6j7l8M1NoJ43L9n6j77K1L28q3j63j5K2J20m7P9k24J59m7P9R9
1698C42j3k69N9Q2l3j32R7J15pj96J05j4o0Q3o6N4J31j92K5o6J47Nj64PQ3M6j0J3pj37J27
1334A55r4KjO2K2qP1j16M8r7J49j16J61p1r8K61j75q2L7n1N9n5k5Q4J03q2J3O6j64j1R9q7
959E9P0j1k7K9l1M2Nj10M9L8J58J9j53n7N5m1K31j10j29jJ4l2m8J8P6nR0j04N1l3J90k1j53
571A28J0Mo3J50r1N1J15rj17k2k0p4M8r1Q5PJ33%k25N4K3%J19n3qQ5p2j19J14l0o0K5M1r9
172C9Q8K7j1J6k2P8j18J17p0q0N8N0l3R3j44Q5j2j24L7Rl0Q5Qn2P4r3O7l9K1n9O5
-192A30
##PAGE=	F1=-15329.3
##FIRST=	25164.767445380970457,	5806.2096540000038658,	0
##DATA TABLE=	(F2++(Y..Y)), PROFILE
$$ plain form
5806 29 30 74 51 21 58 135 38 106 74 90 66 200 115 88 6 84 90 124 127 94 126 185 100 194 109 166 169 87 162 411 191 120 208 55 105
5395 105 66 51 229 183 184 153 143 148 197 96 155 71 173 30 233 180 12 65 191 101 182 256 106 169 118 140 156 117 128 177 172 87
5020 87 86 118 83 139 75 81 99 30 196 230 150 76 141 166 285 95 45 129 147 188 224 76 162 289 283 349 300 223 80 182 59 138 106
4632 106 114 43 104 93 164 231 180 184 126 170 112 78 148 174 41 74 201 130 156 111 193 137 201 26 187 117 125 131 248 299 158 32 28 128
4233 128 302 240 130 208 119 219 91 150 138 127 79 61 76 130 213 271 66 152 92 95 97 154 115 209 162 149 68 137 110 82 95 146 281
3846 281 157 151 221 144 134 215 124 165 55 205 85 39 34 47 167 93 157 184 306 269 108 231 47 150 197 256 122 129 195 104 197
3482 197 136 89 149 52 137 135 143 123 98 119 141 110 114 111 128 146 77 225 110 287 96 149 39 77 69 140 88 220 138 206 156 40 42 135
3083 135 74 214 115 45 65 115 250 152 36 55 90 106 83 55 106 291 164 64 102 118 100 17 52 131 102 70 59 136 42 96 110 206
$$ packed form
5806B9JM4k3l0L7P7r7O8l2J6k4J34q5k7q2P8OL4Ll3L2N9q5R4q5N7Lq2P5K49k20p1Q8j53N0
5395A05l9j5J78m6Jl1j0NM9j01N9q4J02j43K03n3j68N3J26r0Q1P4j50O3n1K2J6l9J1M9nq5
5020H7jL2l5N6o4OJ8o9J66L4q0p4O5K5J19j90n0Q4J8M1L6j48Q6J27oO6m9p7j43J02j23P9l2
4632A06Qp1O1j1P1O7n1Mn8M4n8l4P0K6j33L3J27p1K6m5Q2n6O4j75J61p0QOJ17N1j41j26mJ00
4233A28J74o2j10P8q9J00j28N9j2j1m8j8J5N4Q3N8k05Q6o0LKN7l9R4m7j3q1O9k7k8J3N1J35
3846B81j24oP0p7j0Q1r1M1j10J50j20m6nJ3J20p4O4K7J22l7j61J23j84J03M7N9j34PO6r1R3
3482A97o1m7O0r7Q5kQk0k5K1K2l1MlJ7J8o9J48j15J77j91N3j10L8qP1n2J32q2O8n0j16KR3
3083A35o1J40r9p0K0N0J35r8j16J9L5J6k3k8N1J85j27j00L8J6j8q3L5P9k9l2j1P7r4N4J4R6
$$ plain form
2708 206 282 180 110 196 212 233 144 81 121 138 290 286 70 70 51 115 100 190 273 186 204 68 144 221 121 53 55 70 101 300 304 76 156
2320 156 139 164 154 193 54 153 52 196 63 82 187 198 64 119 119 175 267 80 137 35 202 113 16 77 76 144 102 39 36 58 35 50
1945 50 40 68 82 169 185 162 62 30 370 287 67 75 117 212 192 277 55 265 163 233 317 317 104 170 232 195 58 79 250 282 87
1581 87 163 138 115 175 109 150 230 77 152 38 160 149 40 61 87 153 174 182 156 23 137 40 5 57 111 42 202 195 73 108 17 107
1205 107 129 272 106 74 318 98 111 122 44 125 69 16 105 209 148 176 193 55 50 195 70 149 151 136 142 93 91 101 69 65 125 305 303
818 303 161 23 93 112 329 197 124 113 110 44 22 65 144 99 166 51 142 94 299 282 172 166 104 82 255 159 210 330 274 147 147 128
442 128 95 75 20 106 76 262 274 39 73 96 110 179 133 146 234 178 50 136 52 163 107 149 41 156 198 144 143 145 225 133 217 152 93
55 93 166 209 182 235 82 140 171 38 121 151 64 117 110 128 187 88 142 122 129 93 144
$$ packed form
2708B06P6j02p0Q6J6K1q9o3M0J7J52mk16%j9O4j5R0Q3q7J8j36P6P7j00o8KJ5L1J99Mk28Q0
2320A56j7K5j0L9j39R9j01J44j33J9J05J1j34N5%N6R2j87N7j02J67q9r7O1jO8m2o3lK2k3J5
1945E0j0K8J4Q7J6k3j00l2L40q3k20QM2R5k0Q5k22K10j02P0Q4%k13O6O2l7j37K1J71L2j95
1581H7P6k5k3O0o6M1Q0j53P5j14J22j1j09K1K6O6K1Qk6j33J14r7l5N2N4o9J60pj22L5r1R0
1205A07K2J43j66l2K44k20J3J1p8Q1n6n3Q9J04o1K8J7j38nJ45j25P9Kj5Om9kJ0l2mO0J80k
818C03j42j38P0J9K17j32p3j1lo6k2M3P9m5O7j15R1m8K05j7j10oo2k2J73r6N1J20n6j27%j9
442A28l3k0n5Q6l0J86J2k35L4K3J4O9m6J3Q8n6j28Q6q4J11n6M2j08J15M2n4jKQ0r2Q4o5n9
55I3P3M3k7N3j53N8L1j33Q3L0q7N3pJ8N9r9N4k0Pl6N1
-192A44
##PAGE=	F1=-15431.6
##FIRST=	25164.767445380970457,	5806.2096540000038658,	0
##DATA TABLE=	(F2++(Y..Y)), PROFILE
$$ plain form
5806 9 20 59 50 35 57 112 75 97 64 65 56 154 125 109 6 53 76 126 120 110 75 167 86 151 89 137 118 18 153 382 212 133 221 13 84
5395 84 82 61 152 111 160 159 102 154 217 107 136 68 168 64 183 98 52 69 204 145 176 265 135 176 147 129 120 124 144 175 143 90 76 136
4996 136 99 117 70 72 46 55 236 231 116 60 133 152 241 80 48 125 151 153 247 100 160 281 269 342 290 203 95 152 91 103 123 137 26
4609 26 54 23 149 220 96 122 152 211 151 68 130 158 71 108 184 114 138 162 198 151 224 31 196 132 169 118 196 311 184 23 55 123
4233 123 245 267 95 202 138 272 80 86 147 147 58 63 84 149 181 254 80 114 53 102 96 138 138 225 175 131 84 138 88 119 111 143 292 188
3834 188 135 187 103 110 185 190 207 33 160 84 63 63 10 165 98 137 199 298 282 67 196 105 149 141 314 122 169 238 66 228 94 52
3459 52 175 42 145 132 95 111 95 76 148 119 111 116 118 131 149 191 140 267 102 123 75 71 81 135 48 214 180 229 179 64 12 122 45
3071 45 142 104 10 137 107 166 120 31 69 137 114 90 102 81 299 209 51 112 103 89 11 34 134 157 103 78 162 28 63 103 239 344
$$ packed form
5806IJ1L9rj5K2N5l7K2l3JrR8k9j6j03M7K3N0oj0l5R2q1O5o2M8j9j00J35K29j70p9Q8k08P1
5395H4kk1R1m1M9jn7N2O3j10K9o8J00j04J19q5m6J7J35n9L1Q9j30M1k9j8rMK0L1l2n3j4O0
4996A36l7J8m7Kk6RJ81nj15n6P3J9Q9j61l2P7K6KR4j47O0J21j2P3n2q7j08N7o1J2K0J4j11
4609B6K8l1J26P1j24K6L0N9o0q3O2K8q7L7P6p0K4K4L6m7P3j93J65o4L7n1P8J15j27j61L2O8
4233A23J22K2j72J07o4J34j92OO1%q9NK1O5L2P3j74L4o1M9oM2%Q7n0m4m7N4n0L1qL2J49j04
3834A88n3N2q4PP5NJ7j74J27p6k1%n3J55o7L9O2R9j6k15J29r1M4qJ73j92M7O9j72J62j34m2
3459E2J23j33J03j3l7J6j6j9P2k9qNKJ3J8M2n1J27j65K1m8mJ0N4q7J66l4M9n0j15n2J10p7
3071D5R7l8r4J27l0N9m6q9L8O8k3k4J2k1K18r0j58O1rj4p8K3J00K3n4k5Q4j34L5M0J36J05
$$ plain form
2696 344 172 145 201 178 270 194 117 122 75 219 287 41 76 94 148 136 216 307 190 204 109 100 171 120 55 102 109 119 280 304 58 104 88
2308 88 174 134 205 107 92 88 112 45 107 174 189 39 87 147 157 279 78 143 104 182 55 51 86 99 138 70 87 66 22 34 71 67 70 94 144
1898 144 118 118 100 27 352 281 19 63 99 173 166 262 45 286 159 199 271 275 169 202 230 202 97 20 234 294 122 175 131 161 179 124
1522 124 142 170 108 194 44 123 99 69 88 54 127 164 191 140 2 105 43 73 113 106 67 249 175 62 77 33 21 192 292 58 105
1158 105 290 36 150 130 34 122 82 26 92 185 164 206 156 49 62 225 76 155 183 172 150 120 46 101 100 34 128 305 299 180 48
794 48 62 142 303 163 171 136 111 50 53 80 159 76 114 55 149 75 263 263 206 186 96 101 260 143 198 315 239 107 147 126 119 50 26 102 49
383 49 251 271 99 98 94 126 133 88 123 223 193 49 124 74 248 139 150 45 166 214 140 121 162 236 168 200 143 126 190 241 200 215 70
-4 70 107 170 57 165 207 83 87 80 139 203 92 109 129 122 99 135
$$ packed form
2696C44j72k7N6k3R2p6p7Nm7J44O8k46L5J8N4j2Q0R1j17J4r5rP1n1o5M7PJ0J61K4k46M6j6
2308H8Q6m0P1r8j5mK4o7O2O7J5j50M8O0J0J22k01O5l9P8j27mL5J3L9o8J7k1m4J2L7mLK4N0
1898A44k6%j8p3L25p1k62M4L6P4pR6k17K41j27M0P2Mj06L3K8k8j05p7K14O0j72N3m4L0J8n5
1522A24J8K8o2Q6j50P9k4l0J9l4P3L7K7n1j38J03o2L0M0pl9J82p4j13J5m4j2J71J00k34M7
1158A05J85k54J14k0r6Q8m0n6O6R3k1M2n0j07J3J63j49P9K8j1k2l0p4N5jo6R4J77oj19j32
794D8J4Q0J61j40Ql5k5o1LK7P9q3L8n9R4p4J88%n7k0r0NJ59j17N5J17p6j32M0k1po9k4P6n3
383D9K02K0j72jmL2Pm5L5J00l0j44P5n0J74j09J1j05J21M8p4j9M1P4o8L2n7j7O4N1m1J5j45
-4G0L7O3j13J08M2j24MpN9O4j11J7K0pk3L6
-192A35
##PAGE=	F1=-15533.9
##FIRST=	25164.767445380970457,	5806.2096540000038658,	0
##DATA TABLE=	(F2++(Y..Y)), PROFILE
$$ plain form
5806 28 46 49 50 49 53 106 132 83 75 55 109 144 155 124 2 43 66 134 105 120 15 120 81 96 101 100 92 82 185 331 220 131 217 18 99 97
5384 97 72 77 28 114 157 67 160 234 108 104 46 189 113 134 51 85 84 208 178 188 268 144 163 168 117 75 122 152 161 114 89 80 144 100 100 67 55
4949 55 29 121 263 207 80 16 114 135 181 61 71 108 172 101 241 106 165 264 235 315 267 176 99 99 115 74 147 148 28 24 64 126 232
4562 232 24 47 172 247 162 72 103 154 101 119 146 101 109 209 201 170 226 47 192 124 218 108 117 298 207 37 116 120 191 270 65 186
4186 186 144 299 73 39 153 169 47 57 70 166 139 227 81 90 30 108 93 124 159 240 172 155 141 139 59 136 107 141 284 226 129 140 60
3799 60 97 146 243 236 53 108 88 92 83 42 136 87 113 202 267 262 33 166 168 166 98 352 124 223 265 16 256 72 36 200 68 158 146
3412 146 32 124 99 43 155 129 102 131 88 126 204 195 146 235 107 105 109 52 90 104 2 187 192 234 182 79 50 112 78 87 99 44 207 111
3013 111 69 57 22 93 178 106 103 130 56 284 235 79 117 80 79 27 40 142 203 122 69 149 42 43 87 252 369 165 197 211 143 285
$$ packed form
5806B8J8LJjMN3K6m9qk0N4L5J1l1j22M1K3O8k9J5j05J05l9J5Njqj0J03J46j11q9Q6j99Q1k
5384I7k5Nm9Q6M3r0R3P4j26mn8J43p6K1q3L4jJ24l0J0Q0j24J9Nn1m2M7L0Rm7k5rO4m4%l3j2
4949E5k6R2J42n6j27o4R8K1M6j20J0L7O4p1J40j35N9R9k9Q0m8r1p7%J6m1P3Jj20mM0O2J06
4562B32k08K3J25P5q5r0L1N1n3J8K7m5QJ00ql1N6j79J45o8R4j10RJ81r1j70P9MP1P9k05J21
4186A86m2J55k26l4J14J6j22J0J3R6k7Q8j46Ro0P8j5L1L5Q1o8j7j4kq0P7k9L4J43n8r7J1q0
3799F0L7M9R7pj83N5k0Mrm1R4m9K6Q9O5nk29J33Kko8K54k28R9M2k49K40j84l6J64j32R0j2
3412A46j14R2k5n6J12k6k7K9m3L8P8rm9Q9j28kMn7L8J4j02J85NM2n2j03k9O2l4RJ2n5J63r6
3013A11m2j2l5P1Q5p2lK7p4K28m9j56L8l7jn2J3J02O1q1n3Q0j07JM4J65J17k04L2J4o8J42
$$ plain form
2637 285 235 176 137 40 115 242 29 125 151 155 147 236 314 191 185 132 94 128 128 66 145 140 112 259 286 33 71 59 176 109 205 176 109 181
2238 181 8 27 112 152 198 18 76 156 191 277 88 157 194 157 23 99 99 115 108 28 127 119 30 44 80 116 85 100 136 64 68 130 27 317
1839 317 271 13 76 67 134 126 242 48 266 146 149 211 218 235 213 209 190 124 36 200 278 151 188 117 201 172 131 131 126 153 232 59 86 48
1440 48 83 102 32 98 136 196 136 36 62 58 139 177 126 151 275 151 50 49 74 81 232 294 46 146 248 24 182 137 48 114 95 50
1064 50 80 162 192 240 124 47 79 234 80 152 213 193 143 149 55 144 118 29 112 271 273 180 121 57 173 258 125 205 158 106 76 73 83 154
665 154 55 51 84 159 51 207 232 224 192 121 121 245 111 160 272 201 65 165 122 131 39 35 82 51 216 234 146 137 100 147 99 39 88 217
266 217 202 45 115 123 308 183 146 62 164 201 132 95 173 248 197 173 123 159 188 260 187 170 60 85 152 81 205 249 96 49 67 125
-110 125 218 107 78 128 106 81 104
$$ packed form
2637B85n0n9l9r7P5J27k13R6K6MqQ9P8j23on3l8L4%o2P9nk8J47K7k53L8j2J17o7R6k9o7P2
2238A81j73J9Q5M0M6j80N8Q0L5Q6j89O9L7l7j34P6%J6pq0R9qq9J4L6L6l1J5L6p2MO2j03K90
1839C17m6k58O3rO7qJ16j94K18j20LO2PJ7k2mj9o6q8J64P8j27L7p1Q4k9m1%nK7P9j73K7l8
1440D8L5J9p0O6L8O0o0j00K6mQ1L8n1K5J24j24j01jK5PJ51O2k48J00J02k24J58m5q9O6j9m5
1064E0L0Q2L0M8j16p7L2J55j54P2O1k0n0Or4Q9k6q9Q3J59Kr3n9o4J16Q5j33Q0m7n2l0lJ0P1
665A54r9mL3P5j08J56K5ql2p1%J24j34M9J12p1j36J00m3Rr2mM7l1J65J8q8rl7M7m8o0M9J29
266B17j5j57P0QJ85j25l7q4J02L7o9l7P8P5n1k4n0L6K9P2p3j7j10K5O7p1J24M4j53m7J8N8
-110A25R3j11k9N0k2k5K3
-192A04
##PAGE=	F1=-15636.1
##FIRST=	25164.767445380970457,	5806.2096540000038658,	0
##DATA TABLE=	(F2++(Y..Y)), PROFILE
$$ plain form
5806 66 74 56 56 55 51 120 169 65 90 65 173 165 184 135 6 39 59 140 86 115 66 79 86 49 123 66 110 147 227 267 213 112 193 31 112 108
5384 108 105 22 61 57 155 70 172 249 116 87 20 236 154 104 44 102 114 199 195 212 256 133 134 173 99 36 118 145 129 86 84 88 138 113 104 65
4961 65 40 76 179 273 165 67 54 97 121 116 42 96 86 202 57 200 103 174 236 187 267 239 153 85 55 124 77 168 146 43 59 137 100
4574 100 269 34 51 177 264 150 86 76 163 120 105 93 103 76 240 206 166 203 64 181 110 258 107 39 259 217 55 158 114
4233 114 151 251 52 166 138 299 73 61 157 187 40 34 23 175 93 192 72 81 30 112 84 127 171 246 153 190 194 148 43 133 90 133
3858 133 256 257 132 92 36 92 102 272 246 77 63 88 114 88 93 90 66 111 196 221 214 42 142 210 196 92 358 120 269 273 33 275
3482 275 96 40 227 97 169 159 40 157 112 56 164 138 87 155 47 149 226 202 126 191 112 100 140 40 96 47 48 148 172 222
3130 222 163 87 109 107 129 63 84 90 257 108 60 36 9 121 203 90 117 131 34 252 241 94 105 57 77 60 56 141 230 126 38 97 58
$$ packed form
5806F6Qj8%jmO9M9j04K5k5J08qJ9m9j29L3K0Q1n4K9m9J3Pl7P4n7M4L7Q0M0n4j01Q1j62Q1m
5384A08lq3L9mR8q5J02P7j33k9o7K16q2n0o0N8J2Q5mJ7M4j23JL9p4o3Q2K7j6m3kMN0k5rl9
4961F5k5L6J03R4j08r8j3M3K4np4N4j0J16j45J43r7P1O2m9Q0k8q6o8l0O9m7R1k2j03J6P8l7
4574A00J69k35J7J26Q7j14o4j0Q7m3j5j2J0k7J64l4m0L7j39J17p1J48j51o8K20m2j62J03m4
4233A14L7J00j99J14k8J61k26j2R6L0j47oj1J52q2R9j20Rn1Q2k8M3M4P5r3L7Mm6j05R0m3M3
3858A33J23Jj25m0n6N6J0J70k6j69j4K5K6k6Nlk4M5Q5K5pj72J00O8j4j04K66k38J49Mk40K42
3482B75j79n6J87j30P2j0j19J17m5n6J08k6n1O8j08J02P7k4p6O5p9j2M0j00N6m9JJ00K4N0
3130B22n9p6K2kK2o6K1OJ67j49m8k4k7J12Q2j13K7J4r7K18j1j47J1m8K0j7mQ5Q9j04q8N9l9
$$ plain form
2743 58 35 70 248 350 169 246 217 114 272 259 214 151 91 15 162 67 188 195 129 133 243 293 185 156 138 120 91 142 77 171 146 89
2367 89 253 255 16 62 55 168 95 195 236 153 258 92 21 107 129 227 14 93 144 243 260 99 167 264 145 105 143 117 124 64 15 150
1992 150 169 76 51 77 160 116 95 135 32 24 155 40 277 265 25 88 34 103 84 227 92 203 123 92 152 170 289 209 201 172 136
1628 136 89 153 239 178 204 94 223 156 124 131 126 188 263 80 53 7 82 99 45 78 104 196 162 89 32 73 185 228 153 198 277 126 30
1240 30 25 110 142 234 279 58 183 202 76 201 142 79 115 109 85 67 142 219 272 114 55 99 225 82 149 236 196 129 170 102 197 129 75
853 75 79 211 224 157 191 70 199 203 96 218 182 107 112 89 79 134 72 8 104 168 19 164 199 222 181 153 137 219 92 110 217 167 27
466 27 191 115 134 49 48 41 84 170 173 169 167 127 172 95 55 79 231 200 50 95 139 328 218 139 97 157 163 119 65 173 261 214 148 106 191 160
43 160 260 146 109 61 79 118 97 241 281 96 14 74 89 226 140 109 127 81 46 62
$$ packed form
2743E8k3L5J78J02j81P7k9j03J58j3m5o3o0p6J47r5J21Po6MJ10N0j08k9j8j8k9N1o5R4k5n7
2367H9J64Kk39M6pJ13p3J00M1q3J05j66p1Q6K2R8k13P9N1R9J7j61O8R7j19m0L8k6Po0m9J35
1992A50J9r3k5K6Q3m4k1M0j03qJ31j15K37j2k40O3n4O9j9J43j35J11q0l1O0J8J19q0qk9l6
1628A36m7O4Q6o1K6j10J29o7l2PnO2P5j83k7m6P5J7n4L3K6R2l4p3n7M1J12M3p5M5P9j51r6
1240C0nQ5L2R2M5k21J25J9j26J25n9o3L6ok4j8P5P7N3j58n9M4J26j43O7Q7m0o7M1o8R5o8n4
853G5MJ32J3o7L4j21J29Mj07J22l6p5Nk3j0N5o2o4R6O4j49J45L5K3m1k8j6Q2j27J8J07n0j40
466B7J64p6J9q5jpM3Q6Lmkm0M5p7m0K4J52l1j50M5M4J89j10p9m2O0Om4n4J08Q8m7o6m2Q5l1
43A60J00j14l7m8J8L9k1J44M0j85q2O0J5J37q6l1J8m6l5J6
-192F2
##PAGE=	F1=-15738.4
##FIRST=	25164.767445380970457,	5806.2096540000038658,	0
##DATA TABLE=	(F2++(Y..Y)), PROFILE
$$ plain form
5806 106 94 70 68 51 62 140 176 43 100 73 221 184 201 144 20 30 61 145 66 95 105 88 108 65 138 67 140 185 252 202 197 85 150 26
5407 26 101 117 156 45 132 37 158 99 190 266 149 106 52 287 182 101 28 99 146 179 201 233 226 115 99 161 72 37 116 123 79 64 75
5020 75 92 124 150 131 76 54 109 216 265 119 91 121 87 104 70 30 113 62 232 80 131 110 184 198 140 204 210 147 55 85 118 102 177 133
4621 133 55 98 197 78 314 56 128 165 255 129 101 58 175 129 71 40 123 49 244 217 125 161 73 173 116 282 109 66 200 210
4269 210 69 173 99 127 212 46 145 125 272 80 108 160 193 31 28 49 181 48 153 61 87 44 111 61 152 166 236 127 208 226
3916 226 166 63 116 72 116 213 271 130 55 58 87 59 274 239 84 33 81 118 76 134 43 47 133 181 170 148 92 125 215 217 94 330 109
3529 109 287 261 69 280 133 42 253 116 171 151 102 183 130 83 172 148 70 174 26 191 208 184 88 140 114 110 172 62 99 30
3177 30 100 102 129 200 127 89 158 113 165 69 59 122 280 103 134 112 51 139 205 80 121 104 26 208 231 84 73 44 84 103 67 121 231
$$ packed form
5806A06j2k4kj7J1P8L6j33N7k7J48l7J7n7j24J0L1Q4p9K9J0j7K0m3P3p1P3M5O7n0nj12O5j24
5407B6P5J6L9j11Q7r5J21n9R1P6j17m3n4K35j05q1p3P1M7L3K2L2pj11j6O2q9l5P9Pm4j5J1
5020G5J7L2K6j9n5k2N5J07M9j46k8L0l4J7l4m0Q3n1J70j52N1k1P4J4n8O4Oo3r2L0L3j6P5m4
4621A33p8M3R9j19K36k58P2L7R0j26k8m3J17m6n8l1Q3p4J95k7r2L6q8J00n7J66j73m3J34J0
4269B10j41J04p4K8Q5j66R9k0J47j92K8N2L3j62lK1J32j33J05r2K6m3O7n0R1J4P0j09Q1J8
3916B26o0j03N3m4M4R7N8j41p5LK9k8K15l5j55n1M8L7m2N8r1MQ6M8j1k2n6L3R0Kj23K36k21
3529A09J78k6j92K11j47r1K11j37N5k0m9Q1n3m7Q9k4p8J04j48J65J7k4r6N2k6mO2j10L7o9
3177C0P0KK7P1p3l8O9m5N2r6j0O3J58j77L1k2o1Q8O6j25M1j7p8J82K3j47j1k9M0J9l6N4J10
$$ plain form
2790 231 114 31 36 75 27 58 233 294 184 278 209 97 230 260 219 154 142 124 69 110 239 214 78 101 239 247 170 125 133 141 58 154 90
2402 90 178 124 95 260 220 26 60 71 155 99 173 273 173 299 168 56 104 117 257 18 115 116 280 229 98 166 298 164 188
2062 188 178 145 141 49 45 157 210 116 53 63 193 160 75 129 26 33 179 58 245 269 38 81 36 82 50 219 158 105 93 45 125 158
1686 158 319 195 228 164 135 137 105 186 196 215 67 221 139 104 147 152 208 282 109 34 50 72 83 79 75 78 191 205 148 64 87 206 260 167
1287 167 203 261 113 29 14 137 172 199 245 63 210 177 111 199 143 114 136 127 120 64 123 228 292 128 77 120 200 81 147 249 184 123
912 123 181 140 242 144 115 41 143 159 121 251 84 223 149 82 208 206 123 150 104 84 116 114 54 118 175 28 171 177 201 151 182 153 188
524 188 105 61 165 141 9 204 102 142 72 55 19 131 129 100 165 176 176 196 102 117 131 269 187 62 58 120 305 233 128 141 148 108 105
137 105 33 161 272 221 132 98 218 117 236 98 73 77 88 83 97 271 306 86 34 83 46 220 169 164 127 57 32 44
$$ packed form
2790B31j17q3NL9m8L1J75O1j10R4o9j12J33L0m1o5j2j8n5M1J29k5j36K3J38Qp7m5QQq3R6o4
2402I0Q8n4k9J65m0j94L4J1Q4n6P4J00j00J26j31j12M8J3J40k39R7JJ64n1j31O8J32j34K4
2062A88j0l3mr2mJ12N3r4o3J0J30l3q5N4j03PJ46j21J87K4k31M3m5M6l2J69o1n3j2m8Q0L3
1686A58J61j24L3o4k9Kl2Q1J0J9j48J54q2l5M3NN6P4j73p5J6K2J1mmLJ13J4n7q4K3J19N4r3
1287A67L6N8j48q4j5J23L5K7M6j82J47l3o6Q8n6k9K2rpn6N9J05O4j64n1M3Q0j19O6J02o5o1
912A23N8m1J02r8k9p4J02J6l8J30j67J39p4o7J26kq3K7m6k0L2ko0O4N7j47J43OK4n0L1k9L5
524A88q3m4J04k4j32J95j02M0p0j7l6J12kk9O5J1%K0r4J5J4J38q2j25mO2J85p2j05J3Pm0l
137A05p2J28J11n1q9l4J20j01J19j38k5MJ1nJ4J74L5k20n2M9l7J74n1nl7p0k5J2
-192D4
##PAGE=	F1=-15840.6
##FIRST=	25164.767445380970457,	5806.2096540000038658,	0
##DATA TABLE=	(F2++(Y..Y)), PROFILE
$$ plain form
5806 141 101 76 84 37 89 150 155 21 105 70 242 182 198 155 40 32 75 149 51 59 107 118 144 114 145 102 156 193 250 144 179 69 94 8
5407 8 65 127 208 78 178 71 165 123 202 281 201 134 92 321 199 109 16 81 167 159 207 236 177 105 69 131 36 66 122 92 43 45 65 92
5008 92 111 192 172 104 85 117 228 239 80 123 173 71 76 76 30 121 34 253 128 51 141 189 158 133 134 182 163 19 138 102 122 168 110
4621 110 58 123 237 62 341 53 187 137 220 114 102 59 182 131 30 26 156 37 219 233 58 113 72 174 149 284 107 116
4292 116 137 187 95 166 74 110 158 37 125 109 225 98 147 165 180 16 76 130 189 12 117 56 104 73 98 24 191 144 208 102 199
3928 199 232 191 94 98 72 97 167 267 113 32 100 76 27 252 218 73 18 73 102 53 159 23 44 153 154 130 88 140 120 181 211 74
3553 74 275 100 269 230 85 271 160 38 272 129 166 111 146 187 147 96 177 152 59 180 49 230 159 137 60 95 116 133 202
3212 202 96 101 109 151 60 86 186 80 82 184 132 181 97 43 131 277 110 183 172 102 136 181 79 114 69 44 162 213 63 52 42 95
$$ packed form
5806A41m0k5Qm7N2O1Nj34Q4l5J72o0J6m3j15qM3P4r8QM8J1K6l0L1m3N4L7N7j06L5j10K5q6
5407HN7O2Q1j30J00j07R4m2P9P9q0o7m2K29j22r0r3O5Q6qM8K9n9p2l6O2r5L0N6l0m9KK0K7
5008I2J9Q1k0o8j9L2J11J1j59M3N0j02N%m6R1q7K19j25p7R0M8l1k5JM8j9j44J19l6K0M6n8
4621A10n2O5J14j75K79k88J34n0Q3j06j2m3J23n1j01mJ30j19J82J4j75N5m1J02k5J35j77R
4292A16K1N0r2P1r2L6M8j21Q8j6J16j27M9J8J5j64O0N4N9j77J05o1M8l1K5p4J67m7O4j06R7
3928A99L3m1r7Mk6K5P0J00j54q1O8k4m9K25l4j45n5N5K9m9J06j36K1J09Jk4m2N2k0O1L0j37
3553G4K01j75J69l9j45J86j11j22K34j43L7n5L5M1m0n1Q1k5r3J21j31J81p1k2p7L5K1J7O9
3212B02j06NQM2r1K6J00j06KJ02n2M9q4n4Q8J46j67P3j1p0L4M5j02L5m5k5J18N1j50j1j0N3
$$ plain form
2837 95 149 70 87 203 89 75 84 105 19 54 210 215 202 283 181 92 166 243 199 142 175 221 48 144 264 205 38 65 224 193 142 101
2461 101 123 141 48 156 104 176 78 153 264 183 28 54 95 143 119 138 279 164 298 207 102 107 125 271 17 129 84 287 188 77
2109 77 151 289 205 264 201 185 178 80 62 153 241 143 50 49 208 208 49 114 35 63 205 75 225 278 69 55 54 69 35 219 228 50 73
1722 73 27 150 173 323 171 272 172 130 178 76 129 196 209 46 196 124 76 165 171 215 285 146 37 92 63 64 113 95 58 179 245
1358 245 201 108 95 201 273 163 175 234 127 69 20 155 170 138 196 54 223 192 125 177 131 146 173 150 146 82 104 211 294 156 116
994 116 138 166 79 138 246 169 134 184 164 270 169 138 44 98 86 97 299 94 247 102 79 184 228 141 185 119 103 116 153 82 133
$$ packed form
2837I5N4p9J7J16j14j4RK1q6L5J56Nj3Q1j02q9P4P7m4n7L3M6j73R6J20n9j67K7J59l1n1m1
2461A01K2J8r3J08n2P2r8P5J11q1j55K6M1M8k4J9J41j15J34r1j05NJ8J46k54J12m5K03r9j11
2109G7P4J38q4N9o3j6pr8j8R1Q8r8r3jJ59%j59O5p9K8J42j30J50N3k09j4jJ5l4J84Rj78K3
1722G3m6J23K3J50j52J01j00m2M8j02N3O7J3j63J50p2m8Q9OM4P0j39j09N5k9JM9j8l7J21O6
1358B45m4r3j3J06P2j10J2N9j07n8m9J35J5l2N8j42J69l1o7N2m6J5K7k3mo4K2J07Q3j38m0
994A16K2K8q7N9J08p7l5N0k0J06j01l1r4N4j2J1K02k05J53j45k3J05M4q7M4o6j6J3L7p1N1
$$ [...]
-192D0
##END NTUPLES=	nD NMR SPECTRUM
##END=	
##END=	
