##TITLE=	Oct20-2021.33.ser
TM-VI-107solid Ca+Ph-pyrraz. 13C hsqc

##JCAMP-DX=	6.0	$$ MestReNova 14.3.0-30573
##DATA TYPE=	LINK
##BLOCK_ID=	1
##BLOCKS=	2    
##ORIGIN=	Mestrelab Research S.L.
##OWNER=	hrzepa
##$MNOVA/LINK_BLOCK_TYPE=	ITEM	$$ NMR Spectrum
##$MNOVA/ITEM/POLYGON=	(XY..XY)
5321,5835
8722,5835
8722,8208
5321,8208
5321,5835
##$MNOVA/ITEM/Z=	0
##$MNOVA/ITEM/ANGLE=	0
##TITLE=	Oct20-2021.33.ser
##JCAMP-DX=	6.0	$$ MestReNova 14.3.0-30573
##BLOCK_ID=	2
##DATA TYPE=	MNOVA NMR VIEW DATA
##DATA CLASS=	MNOVA VIEW DATA
##$MNOVA/2D/THRESHOLD=	8.73777008056640625
##$MNOVA/ITEM/ZOOM/X=	-0.97752777163086645995,	15.008820000058459954
##$MNOVA/ITEM/ZOOM/Y=	-9.5471849045210372964,	230.01680000068574827
##END=	
##TITLE=	Oct20-2021.33.ser
##JCAMP-DX=	6.0	$$ MestReNova 14.3.0-30573
##BLOCK_ID=	3
##DATA TYPE=	nD NMR SPECTRUM
##DATA CLASS=	NTUPLES
##NUMDIM=	2
##ORIGIN=	Bruker BioSpin GmbH
##OWNER=	nmr
##.OBSERVE FREQUENCY=	400.20280139999999847
##.OBSERVE NUCLEUS=	^1H
##.SOLVENT NAME=	Acetone
##.PULSE SEQUENCE=	hsqcedetgpsisp2.3
##LONGDATE=	2021/10/21 03:54:00.000
##.ACQUISITIONMODE=	SIMULTANEOUS (DQD)
##$ORIGINAL FORMAT=	Bruker XWIN-NMR
##$MNOVA/SCALES_VERSION=	9
##$PARAMETER FILE=	(acqu2s, ASCII, /private/var/folders/f6/rjf_tdyn2v98c5c0wvkgn4s80000gn/T/um$z68pVSK+KL9AwwwRWCw/33/acqu2s, 0)
$$ ##TITLE= Parameter file, TOPSPIN		Version 3.2
$$ ##JCAMPDX= 5.0
$$ ##DATATYPE= Parameter Values
$$ ##NPOINTS= 221	$$ modification sequence number
$$ ##ORIGIN= Bruker BioSpin GmbH
$$ ##OWNER= nmr
$$ $$ 2021-10-21 04:41:39.548 +0100  nmr@CZC2439F63
$$ $$ /opt/topspin/data/agmb/nmr/Oct20-2021/33/acqu2s
$$ $$ process /opt/topspin3.2/prog/mod/go
$$ ##$ACQT0= 0
$$ ##$BF1= 100.63037
$$ ##$FnMODE= 6
$$ ##$NUC1= <13C>
$$ ##$NusJSP= 0
$$ ##$NusT2= 1
$$ ##$NusTD= 220
$$ ##$O1= 11069.3807043987
$$ ##$SFO1= 100.641439380704
$$ ##$SW= 240.006398165762
$$ ##$SW_h= 24154.5893719807
$$ ##$TD= 220
$$ ##END=
$$ 
##$PARAMETER FILE=	(acqus, ASCII, /private/var/folders/f6/rjf_tdyn2v98c5c0wvkgn4s80000gn/T/um$z68pVSK+KL9AwwwRWCw/33/acqus, 0)
$$ ##TITLE= Parameter file, TOPSPIN		Version 3.2
$$ ##JCAMPDX= 5.0
$$ ##DATATYPE= Parameter Values
$$ ##NPOINTS= 12	$$ modification sequence number
$$ ##ORIGIN= Bruker BioSpin GmbH
$$ ##OWNER= nmr
$$ $$ 2021-10-21 04:41:42.829 +0100  nmr@CZC2439F63
$$ $$ /opt/topspin/data/agmb/nmr/Oct20-2021/33/acqus
$$ $$ process /opt/topspin3.2/prog/mod/shimcntl
$$ ##$ACQT0= 0
$$ ##$AMP= (0..31)
$$ 100 100 100 100 100 100 100 100 100 100 100 100 100 100 100 100 100 100
$$ 100 100 100 100 100 100 100 100 100 100 100 100 100 100
$$ ##$AMPCOIL= (0..19)
$$ 0 0 0 0 0 0 0 0 0 0 0 0 0 0 0 0 0 0 0 0
$$ ##$ANAVPT= -1
$$ ##$AQSEQ= 0
$$ ##$AQ_mod= 3
$$ ##$AUNM= <au_zg>
$$ ##$AUTOPOS= <3 >
$$ ##$BF1= 400.2
$$ ##$BF2= 100.63037
$$ ##$BF3= 400.2
$$ ##$BF4= 400.2
$$ ##$BF5= 400.2
$$ ##$BF6= 400.2
$$ ##$BF7= 400.2
$$ ##$BF8= 400.2
$$ ##$BYTORDA= 0
$$ ##$CAGPARS= (0..11)
$$ 0 0 0 0 0 0 0 0 0 0 0 0
$$ ##$CFDGTYP= 0
$$ ##$CFRGTYP= 9
$$ ##$CHEMSTR= <none>
$$ ##$CNST= (0..63)
$$ [...]
$$ 0 0 0 0
$$ ##$ShimPowMaxUC= (0..63)
$$ 130000 130000 130000 130000 130000 130000 130000 130000 130000 130000 130000
$$ 130000 130000 130000 130000 130000 130000 130000 130000 130000 0 0 0 0
$$ 0 0 0 0 0 0 0 0 0 0 0 0 0 0 0 0 0 0 0 0 0 0 0 0 0 0 0 0 0 0 0 0 0 0 0 0
$$ 0 0 0 0
$$ ##$ShimPowMaxUG= (0..63)
$$ 524287 524287 524287 524287 524287 524287 524287 524287 524287 524287 524287
$$ 524287 524287 524287 524287 524287 524287 524287 524287 524287 0 0 0 0
$$ 0 0 0 0 0 0 0 0 0 0 0 0 0 0 0 0 0 0 0 0 0 0 0 0 0 0 0 0 0 0 0 0 0 0 0 0
$$ 0 0 0 0
$$ ##$ShimPowRcbType= 3
$$ ##$ShimPowRes= (0..63)
$$ 1e-20 1e-20 1e-20 1e-20 1e-20 1e-20 1e-20 1e-20 1e-20 1e-20 1e-20 1e-20
$$ 1e-20 1e-20 1e-20 1e-20 1e-20 1e-20 1e-20 1e-20 0 0 0 0 0 0 0 0 0 0 0 0
$$ 0 0 0 0 0 0 0 0 0 0 0 0 0 0 0 0 0 0 0 0 0 0 0 0 0 0 0 0 0 0 0 0
$$ ##$ShimPowRng0= (0..63)
$$ 1 1 1 1 1 1 1 1 1 1 1 1 1 1 1 1 1 1 1 1 0 0 0 0 0 0 0 0 0 0 0 0 0 0 0 0
$$ 0 0 0 0 0 0 0 0 0 0 0 0 0 0 0 0 0 0 0 0 0 0 0 0 0 0 0 0
$$ ##$ShimPowRng1= (0..63)
$$ 1 1 1 1 1 1 1 1 1 1 1 1 1 1 1 1 1 1 1 1 0 0 0 0 0 0 0 0 0 0 0 0 0 0 0 0
$$ 0 0 0 0 0 0 0 0 0 0 0 0 0 0 0 0 0 0 0 0 0 0 0 0 0 0 0 0
$$ ##$ShimPowRng2= (0..63)
$$ 1 1 1 1 1 1 1 1 1 1 1 1 1 1 1 1 1 1 1 1 0 0 0 0 0 0 0 0 0 0 0 0 0 0 0 0
$$ 0 0 0 0 0 0 0 0 0 0 0 0 0 0 0 0 0 0 0 0 0 0 0 0 0 0 0 0
$$ ##$ShimPowRng3= (0..63)
$$ 1 1 1 1 1 1 1 1 1 1 1 1 1 1 1 1 1 1 1 1 0 0 0 0 0 0 0 0 0 0 0 0 0 0 0 0
$$ 0 0 0 0 0 0 0 0 0 0 0 0 0 0 0 0 0 0 0 0 0 0 0 0 0 0 0 0
$$ ##$ShimSysFunc= (0..63)
$$ 1 2 3 4 5 7 9 11 15 16 8 10 12 14 6 17 13 18 19 20 0 0 0 0 0 0 0 0 0 0
$$ 0 0 0 0 0 0 0 0 0 0 0 0 0 0 0 0 0 0 0 0 0 0 0 0 0 0 0 0 0 0 0 0 0 0
$$ ##$ShimSysMatrix= 0
$$ ##$ShimSysType= 1
$$ ##$TFXNUM= 0
$$ ##$TRIPLO2= 0
$$ ##$VTU= 2
$$ ##$VTUETH= <149.236.99.20>
$$ ##$VTUTY= <no>
$$ ##$WBREFAM= (0..15)
$$ 135.5 97.7 100 100 100 100 100 100 100 100 100 100 100 100 100 100
$$ ##$WBREFLM= (0..15)
$$ 0 0 0 0 0 0 0 0 0 0 0 0 0 0 0 0
$$ ##$WBREFPH= (0..15)
$$ 72.26 -67.22 0 0 0 0 0 0 0 0 0 0 0 0 0 0
$$ ##$WBSGU= (0..15)
$$ 0 0 0 0 0 0 0 0 0 0 0 0 0 0 0 0
$$ ##$XFAC= 2
$$ ##END=
$$ 
##$DECIM=	3120
##$DSPFVS=	20
##.ACQUISITIONSCHEME=	ECHO-ANTIECHO
##NTUPLES=	nD NMR SPECTRUM
##VAR_NAME=	FREQUENCY1,	FREQUENCY2,	SPECTRUM
##SYMBOL=	F1,	F2,	Y
##.NUCLEUS=	13C,	1H
##.OBSERVE FREQUENCY=	100.64143938070399997,	400.20280139999999847
##VAR_TYPE=	INDEPENDENT,	INDEPENDENT,	DEPENDENT
##VAR_FORM=	AFFN,	AFFN,	ASDF
##VAR_DIM=	512,	512,	262144
##UNITS=	HZ,	HZ,	ARBITRARY UNITS
##FIRST=	23146.675690215950453,	6006.5297639999989769,	0.37432423233985900879
##LAST=	-960.73674939750048907,	-391.2066142051489237,	0.57493740320205688477
##MIN=	-960.73674939750048907,	-391.2066142051489237,	-31.09482574462890625
##MAX=	23146.675690215950453,	6006.5297639999989769,	116.8743133544921875
##FACTOR=	1,	1,	0.0057240023485981327347
##PAGE=	F1=23146.7
##FIRST=	23146.675690215950453,	6006.5297639999989769,	0.37432423233985900879
##DATA TABLE=	(F2++(Y..Y)), PROFILE
$$ [...]
##PAGE=	F1=4936.38
##FIRST=	23146.675690215950453,	6006.5297639999989769,	0.205608367919921875
##DATA TABLE=	(F2++(Y..Y)), PROFILE
$$ plain form
3953 -32 -25 -59 87 -63 -34 -116 -159 -144 3 4 -79 -152 -168 21 -67 -3 -34 53 -79 -12 -75 59 -53 17 -17 -64 -36 -50 6 -45 -35 92
3553 92 26 10 18 -62 11 31 102 37 7 34 57 -14 -26 -110 -8 -34 10 52 -56 125 -24 -62 -164 -44 -129 -53 -54 -76 32 148 3 -26
3152 -26 8 138 -22 115 73 -102 -179 -183 -396 9624 2280 281 116 78 115 108 -41 -103 3 -61 98 82 51 62 -50 -70 51
2814 51 75 17 -50 19 27 55 -94 15 36 3 79 32 117 41 107 158 50 -95 66 91 8 70 154 -41 -18 -104 51 68 32 -58 79 -56
2413 -56 56 36 -37 82 -2 -68 -95 -76 4 -161 -61 -63 49 136 30 -27 -13 26 130 -27 -46 -72 -51 -185 -126 -22 -11 71 -53 102
2038 102 29 -46 -134 188 89 -51 -20 38 -53 -86 73 -75 -214 -94 9 96 -20 -71 7 -40 0 38 -57 19 16 -57 58 -119 -29 -128
1662 -128 -87 0 2 -62 1 5 -26 -78 -45 73 3 -62 -72 0 120 77 -75 -202 56 -2 -67 -111 28 -100 105 75 164 51 -92 -4 -85
1274 -85 2 -30 -59 -128 -52 -41 0 -27 89 -104 35 63 -66 -41 77 45 -68 -13 66 -11 -176 -24 67 -126 -41 84 20 -15 -160 -56
$$ packed form
3953c2Pl4J46j50K9q2m3J5J47Jq3p3j6J89q8O4l1Q7j32O7o3J34j12P0l4m7K8j4N6n1J0J27
3553I2o6j6Qq0P3K0P1o5l0K7K3p1j2q4J02k6M4M2j08J81j49l8j02J20q5P6jk2J08J16j45k9
3152b6L4J30j60J37m2j75p7mk13J0020p344j999j65l8L7pj49o2J06o4J59j6l1J1j12k0J21
2814E1K4n8o7O9QK8j49J09K1l3P6m7Q5p6O6N1j08j45J61K5q3O2Q4j95K3q6J55J7l6r0J37j35
2413e6J12k0p3J19q4o6k7J9Q0j65J00kJ12Q7j06n7J4L9J04j57j9k6K1j34N9J04J1Q2j24J55
2038A02p3p5q8L22r9j40L1N8r1l3J59j48j39J20J03Q7j16n1P8m7M0L8r5P6lp3J15j77R0r9
1662a28M1Q7Ko4O3Ml1n2L3J18p0o5j0P2J20m3j52j27K58n8o5m4J39j28K05l0Q9j13j43Q8q1
1274h5Q7l2k9o9P6J1M1k7J16j93J39K8j29K5J18l2j13N5P9p7j65J52R1j93Q5J25o4l5j45J04
$$ plain form
898 -56 0 -53 -31 -46 -94 80 32 -33 -114 -48 -131 -122 -43 111 85 73 7 -14 6 -7 -3 -82 8 -42 5 71 -64 44 32 31 8 -124 -92 3 92
460 92 -21 -92 37 -4 -47 126 -80 -67 41 65 10 -52 -38 -56 165 -49 -34 27 69 -56 -41 46 -35 49 0 115 -58 -66 -42 -49 -262
72 -262 -112 62 5 112 19 28 7 35 37 -99 -82 55 -108 18 30 -78 100 -11 -8 23 -63 -36 171 -14 -143 -100 -84 -48 -44 -4 59
-316 59 51 90 -79 -73 -27 -14
$$ packed form
898e6N6n3K2j5m8J74m8o5q1O6q3RP9J54k6j2o6k1K0j3Mp9R0n0M7O6j35J08j2jk3j32L2R5Q9
460I2j13p1J29m1m3J73k06J3J08K4n5o2J4j8K21k14J5O1M2j25J5Q7q1Q4m9J15j73qK4pk13
72b62J50J74n7J07r3Rk1K8Kj36J7J37j63J26J2j08J78j11LL1q6K7K07j85j29M3J6L6MM0O3
-316E9qL9j69OM6J3
-391a4
##PAGE=	F1=4842.03
##FIRST=	23146.675690215950453,	6006.5297639999989769,	0.47177302837371826172
##DATA TABLE=	(F2++(Y..Y)), PROFILE
$$ plain form
6007 -51 -41 -17 81 7 -38 116 -96 -37 -6 -23 21 -22 68 12 90 147 -19 56 -54 87 6 25 108 -36 18 141 73 -178 -58 -37 -42
5618 -42 -2 78 118 120 -12 -204 -12 -2 48 -107 -40 -81 29 -22 -33 -108 -12 -65 -64 -5 74 159 11 6 -112 -29 -39 46 76 -92 -25 17 4
5205 4 -53 -24 -170 -63 -39 -60 -37 26 -5 -57 45 -85 -45 -71 -2 -13 62 0 -38 71 60 37 -6 -10 57 -35 -12 18 57 78 -19 47 -48 90
4780 90 -17 0 42 -42 21 21 -40 -67 72 63 -12 0 -15 -28 -12 94 -68 -68 -129 -67 -104 154 24 37 7 -3 59 4 -62 -63 108 128 42 25
4354 25 107 -26 -62 -75 -60 -13 22 -51 -46 -90 10 78 -4 38 155 -24 20 93 54 -27 -91 115 -84 -19 -95 74 11 131 37 49 -37 -14
3953 -14 -5 -8 91 -82 -30 -173 -167 -104 4 -34 -57 -151 -135 36 -12 8 16 64 -72 40 -124 4 -95 17 -9 -96 -55 -80 20 -40 -58 78
3553 78 25 15 -11 -88 5 33 118 71 -23 17 63 -20 -3 -137 -18 -88 21 40 -58 100 -47 -22 -153 -47 -144 -21 -47 -79 69 107 -22
3164 -22 -15 -25 97 -46 66 -37 -135 -216 -200 -477 11364 2630 331 188 122 109 89 -22 -89 37 -28 92 125 94 61 -57 -68
$$ packed form
6007e1J0K4R8p4m5J54k12N9L1j7M4m3R0n6P8N7j66P5j10J41q1J9Q3j44N4J23o8k51J20K1n
5618d2M0Q0M0Kj32j92J92J0N0j55O7m1J10n1j1p5R6n3JN9P9Q5j48nj18Q3j0Q5L0j68O7M2j3
5205Dn7K9j46J07K4k1K3O3l1n2J02j30M0k6O9j1P5o2l8J09j1k3m3mO7r2K3L0L9K1r7O6r5J38
4780I0j07J7M2q4O3%o1k7J39rp5J2j5j3J6J06j62%o1O2l7K58j30J3l0j0O2n5o6jJ71K0q6j7
4354B5Q2j33l6j3J5M7L5p3Nm4J00O8q2M2J17j79M4P3l9q1o4K06j99O5p6J69o3J20r4J2q6K3
3953a4RlR9j73N2j43OO3J08l8k3r4J6J71m8K0QM8j36J12j64J28r9J12k6q7M1k5J00o0j8J36
3553G8n3j0k6p7R3K8Q5m7r4M0M6q3J7j34J19p0J09J9r8J58j47K5j31J06r7J23k6l2J48L8j29
3164b2Pj0J22j43J12j03r8q1J6k77J1841q734k299j43o6j3k0j11o7J26o5J20L3l1l3j18j1
$$ plain form
2826 -68 79 87 51 -36 3 48 37 -67 49 38 14 66 19 100 52 81 130 45 -135 8 65 55 34 88 -65 -57 -99 0 51 12 -94 46
2426 46 -68 47 28 -11 48 10 -8 -88 -77 -29 -155 -47 -59 66 109 -19 16 11 9 86 -22 -36 -90 -71 -147 -122 37 -55 34 -77 101
2038 101 46 -47 -136 204 110 -48 -43 32 -63 -67 85 -36 -193 -54 -5 129 -42 -53 -31 -78 24 40 -18 15 -8 -23 60 -102 -35 -151
1662 -151 -88 18 -2 -79 5 24 -50 -87 -6 56 19 -33 -30 30 119 71 -63 -171 27 6 -111 -130 51 -87 23 42 131 54 -132 22
1286 22 -31 5 -21 -49 -116 -47 -46 13 -29 45 -94 26 46 -73 -36 43 73 -47 4 58 -74 -147 -12 49 -142 -28 60 -9 -10 -139 -46 16
886 16 -53 -21 -19 -49 136 12 -57 -92 -39 -104 -154 -56 102 50 62 5 -27 36 -18 3 -49 19 -38 23 35 -74 35 38 35 32 -119 -114 41 62 -32
448 -32 -46 -17 -48 4 103 -84 -43 67 84 -25 -94 -92 -75 150 -96 -18 31 75 -29 -56 63 -79 11 -16 89 -77 -84 1 -48 -272 -52
60 -52 49 60 127 25 45 -17 23 -1 -125 -106 49 -59 -1 27 -70 88 -28 -22 14 -61 -50 188 9 -126 -55 -76 -60 -82 56 68 59 115
$$ packed form
2826f8J47Ql6q7L9M5j1j04J16j1k4N2m7Q1m8K9M9q5j80J43N7j0k1N4j53Qm2R9N1l9j06J40
2426D6j14J15j9l9N9l8j8q0J1M8j26J08j2J25M3j28L5nkP7j08j4n4J9p6K5J59r2Q9j11J78
2038A01n5r3q9L40r4j58NP5r5mJ52j21j57J39M9J34j71j1K2m7J02J6n8L3k3j5Q3j62O7j16
1662a51O3J06k0p7Q4J9p4l7Q1O2l7n2LO0Q9m8j34j08J98k1j17j9J81j38J10J9Q9p7j86J54
1286B2n3L6k6k8o7O9JN9m2P4j39J20K0j19L7P9L0j20N1N4j32p3J35O1j91J14Q8o9jj29R3O2
886A6o9L2Kl0J85j24o9l5N3o5n0R8J58n2J2n7l2O3n4K1n2O8n7O1J2j09J09Lllj51NJ55K1r4
448c2j4K9l1N2R9j87M1J10J7j09o9KJ7K25k46P8M9M4j04k7J19j42R0k7J05j66pQ5m9k24K20
60e2J01J1O7j02K0o2M0k4j24J9J55j08N8K8r7J58j16OL6p5J1K38j79j35P1k1J6k2J38J2rN6
$$ plain form
-341 115 -105 -59 -35 -49
$$ packed form
-341A15k20M6K4j4
-391d9
##PAGE=	F1=4747.67
##FIRST=	23146.675690215950453,	6006.5297639999989769,	0.4097086489200592041
##DATA TABLE=	(F2++(Y..Y)), PROFILE
$$ plain form
6007 -50 -48 -1 66 -31 -48 114 -87 -47 2 23 44 -5 23 -20 85 175 15 100 -72 62 -29 3 86 1 21 123 82 -131 -19 -12 -27 -10
5606 -10 93 145 114 11 -153 -43 18 37 -66 -26 -72 26 -48 10 -90 -9 -89 -60 -24 50 185 67 35 -106 -19 0 52 69 -115 -13
5230 -13 6 -20 -69 -27 -194 -59 -16 -27 -41 4 -11 -77 0 -67 -60 -74 -42 -2 73 -29 -17 74 93 -9 -43 -28 74 -4 -37 -21 48 64 7
4817 7 52 -15 100 -74 -11 65 -2 27 -25 -32 -39 57 23 -12 -8 -20 -31 -11 63 -62 -82 -179 -127 -74 162 15 45 14 -1 74 44 -65 -61 99
4391 99 94 32 19 108 -12 -94 -29 -34 0 -4 -37 -29 -34 3 74 22 19 130 12 39 82 84 -32 -107 80 -95 -40 -118 72 43 126 5 14 -4 5 10
3941 10 46 97 -77 -29 -199 -162 -46 0 -56 -13 -133 -88 19 28 14 57 67 -46 95 -147 -39 -95 9 -4 -135 -39 -76 23 -32 -67
3565 -67 76 8 13 -25 -87 5 32 128 122 -35 -1 74 -27 5 -132 -8 -137 15 51 -45 57 -55 18 -132 -36 -132 17 -22 -61 102
3190 102 55 -29 19 -46 64 -38 29 -121 -148 -188 -143 -423 10412 2351 301 218 138 87 48 -17 -74 70 0 73 149 121 70 -64
$$ packed form
6007e0KM7O7r7j7J62k01M0M9K1K1m9K8m3J05R0j60Q5j72J34r1L2Q3q5K0J02m1k13J12Pj5J7
5606a0J03N2l1j03j64J10O1J9j03M0m6R8p4N8j00Q1q0K9L6P4J35j18l2j41Q7J9N2J7j84J02
5230a3J9k6m9M2j67J35M3j1j4M5j5o6P7o7Pj4L2M0P5j02J2R1J9j02l4J5J02p8l3J6O9J6n7
4817GM5o7J15j74O3P6o7K9n2ppR6l4l5Mj2j1K0P4j25k0r7N2N3K36j47L0l1j5P5l0j09MJ60
4391I9no2j3Q9j20q2O5nL4ml3QnL7P1n2lJ11j18K7M3Kj16p5J87j75N5p8J90k9Q3j21Rj8RN
3941A0L6N1j74M8j70L7J16M6n6M3j20M5J07Rj4M3J0j13J41k42J08n6J04j3j31R6l7R9n5l5
3565f7J43o8Nl8o2R2K7R6oj57L4P5j01L2j37J24j29J52L6r6J02j12P3j50R6r6J49l9l9J63
3190A02m7q4M8o5J10j02O7j50k7m0M5k80J0835q061k050q3q0n1l9o5n7J44p0P3P6k8n1j34
$$ plain form
2839 -64 -71 103 99 67 -13 -7 64 17 -26 63 24 21 38 15 62 40 34 71 27 -152 -44 48 79 9 32 -69 -94 -87 -46 61 -11 -103 -3 -107 33
2401 33 29 5 2 3 42 -74 -67 -48 -128 -5 -41 74 70 -66 46 36 -7 37 -5 -1 -107 -79 -99 -99 69 -99 11 -89 69 58 -53 -103 211
1988 211 112 -25 -51 29 -65 -33 95 6 -142 12 -11 128 -58 -31 -48 -99 40 37 21 16 -28 30 62 -61 -20 -189 -85 45 -15 -84
1612 -84 -9 32 -53 -64 30 48 41 -10 2 41 113 71 -43 -108 -19 9 -150 -139 67 -58 -47 0 71 37 -144 46 21 23 -10 -39 -105 -35 -41 38
1186 38 -32 12 -67 0 29 -64 -30 10 88 -32 18 14 -132 -104 6 -4 -148 -15 29 -41 7 -83 -39 37 -53 -7 0 -6 151 -1 -75 -48 -18
773 -18 -62 -166 -48 73 19 42 -22 -35 48 -29 -2 2 26 -31 26 -33 -69 13 16 14 47 -67 -119 73 35 -31 2 -58 -78 59 79 -62 -9 96
347 96 62 -79 -118 -152 -93 123 -118 -21 36 77 8 -46 71 -102 -21 -33 58 -92 -104 41 -48 -259 12 31 108 127 39 51 -18 2 -35
-41 -35 -116 -113 32 -21 2 21 -49 77 -26 -23 14 -58 -71 163 34 -74 2 -69 -50 -86 87 65 59 119 -112 -32 -28 -63
$$ packed form
2839f4pJ74ml2q0OP1m7m3Q9l9lJ7k3M7k2oL7m4j79J08R2L1p0K3j01k5PM1J07p2r2J00j04J40
2401C3mk4lJL9j16PJ9q0J23l6J15mj36J12j0m3M4m2Mj06K8k0%J68j68J10j00J58j1j11n0L14
1988B11r9j37k6Q0r4L2J28q9j48J54k3J39j86K7j7n1J39lj6nm4N8L2j23M1j69J04J30o0o9
1612h4P5M1q5j1R4J8pn1J2L9P2m2j14o5Q9K8j59J1K06j25J1M7P1l4j81J90k5Kl3k9o6P0oP9
1186C8p0M4p9O7K9r3L4M0P8j20N0mj46K8J10j0j44J33M4p0M8r0M4P6r0M6PoJ57j52p4K7L0
773a8m4j04J18J21n4K3o4j3Q3p7K7MK4n7N7n9l6Q2LkL3j14n2J92l8o6L3o0k0J37K0j41N3J05
347I6l4j41l9l4N9K16k41R7N7M1o9n4J17j73Q1j2R1j50j2J45q9k11K71J9P7J9q8J2o9K0l7
-41c5q1LJ45n3K3J9p0J26j03LL7p2j3K34j29j08P6p1J9l6J73k2oO0k31Q0Ml5
-391f3
##PAGE=	F1=4653.32
##FIRST=	23146.675690215950453,	6006.5297639999989769,	-0.079505257308483123779
##DATA TABLE=	(F2++(Y..Y)), PROFILE
$$ plain form
6007 -48 -39 17 38 -53 -62 111 -91 -39 6 49 38 17 -13 -34 71 158 54 131 -78 55 -61 5 48 28 -2 81 70 -61 26 13 -22 -23 95
5593 95 139 99 35 -100 -71 45 12 -21 -19 -68 17 -51 64 -70 0 -106 -47 -26 11 172 106 81 -78 -8 70 70 33 -118 -11 -19 -40 -56
5193 -56 -30 -188 -52 -9 0 -46 -26 -35 -81 -40 -41 -63 -29 -57 12 80 -67 -2 77 115 -37 -71 -50 78 11 -61 -43 38 48 7 48 19 102 -118
4767 -118 -13 73 52 56 -39 -17 -1 52 -21 -10 -36 -50 -42 -23 -1 -54 -95 -199 -154 -11 162 -2 46 16 3 98 80 -66 -52 66 27 10
4366 10 11 82 0 -107 16 -8 21 -34 -16 -3 20 12 85 48 23 87 42 58 82 109 -33 -97 36 -115 -61 -118 79 64 104 -25 -20 17 27
3953 27 16 79 94 -44 -25 -181 -136 5 -8 -52 29 -103 -38 -17 36 11 76 47 -15 119 -134 -64 -52 0 -1 -169 2 -50 11 -25 -54 86
3553 86 -16 3 -12 -61 2 27 125 168 -34 -12 89 -42 3 -104 16 -168 -9 68 -26 12 -54 48 -111 -24 -103 59 11 -20 111
3190 111 4 -12 64 -46 49 6 9 -153 -141 -116 -42 -284 7502 1629 214 196 114 54 8 -17 -67 82 5 44 147 130 82 -74 -79
$$ packed form
6007d8RN6K1r1rJ73k02N2M5M3j1k1l0k1J05Q7j04P7k09J33j16O6M3k0l0Q3j1j31Q7j3l5jJ18
5593I5M4m0o4j35K9J16l3l3Km9Q5o8J15j34P0j06N9K1L7J61o6k5j59P0P8%l7j51J07qk1j6
5193e6K6j58J36M3Rm6K0rm6M1jk2L4k8O9O8j47O5P9L8j52l4K1J28o7p2J8Q1J0m1M1k9Q3k20
4767a18J05Q6k1Mr5K2J6N3p3J1k6j4QJ9K2n3m1j04M5J43J73j64M8l0j3R5j8j46J4J18l9j7
4366A0JP1q2j07J23k4K9n5J8J3K3qP3l7k5O4m5J6K4K7j42o4J33j51N4n7J97j5M0j29NL7J0
3953B7j1O3J5j38J9j56M5J41j3m4Q1j32O5K1N3k5O5k9o2J34k53P0J2N2jj68J71n2O1l6k9J40
3553H6j02J9j5m9O3K5R8M3k02K2J01j31M5j07J20j84J59P7r4L8o6J02j59Q7p9J62m8l1J31
3190A11j07j6P6j10R5m3Lj62J2K5P4k42P786n873j415j8q2o0m6k5n0J49p7L9J03j7m8j56n
$$ plain form
2826 -79 116 105 66 10 -13 57 0 14 50 -3 20 9 23 33 10 -12 8 15 -143 -75 55 88 -15 -14 -55 -124 -69 -66 81 -38 -91 -49 -152
2413 -152 14 26 19 -33 -23 71 -53 -44 -38 -91 45 -21 69 30 -94 51 51 -26 -3 17 40 -113 -73 -56 -67 69 -124 2 -84 23 63 -63
2013 -63 -50 204 93 6 -33 32 -60 20 114 42 -71 88 4 95 -56 -9 -37 -98 33 26 48 23 -38 85 76 -10 0 -231 -79 83 -30
1625 -30 -71 -31 24 -37 -13 50 50 51 3 14 38 107 76 -25 -42 -63 13 -174 -131 79 -21 -85 -37 13 5 -136 65 55 44 -5 -35 -112 -20 -34
1199 -34 70 -40 -1 -37 -33 17 -40 -34 -9 85 -22 25 -40 -163 -65 28 -74 -141 4 6 -74 26 -19 -40 45 -64 1 18 18 121 -12 -82
798 -82 3 0 -23 -155 -32 34 9 18 -71 -50 37 -29 -17 56 15 -19 10 -112 -51 -16 -24 -30 56 14 -110 92 8 -12 41 -69 -88 92 61 -37
373 -37 12 107 6 -127 -119 -195 -87 94 -115 -51 35 63 40 -11 67 -95 -38 -42 30 -94 -110 70 -49 -220 64 15 131 110 52 49 1
-16 1 -12 -42 -69 -98 2 -5 22 27 -13 75 -11 -24 14 -47 -86 98 43 -18 44 -73 -28 -61 77 53 60 98 -97 -9 -13 -60
$$ packed form
2826g9J95j1l9n6k3P0n7J4L6n3K3j1J4J0k3k2K0Pj58O8J30L3j03Jm1o9N5LJ47j19n3M2j03
2413a52J66J2pn2J0R4j24ROn3J36o6R0l9j24J45%p7K3K0K3j53M0J7j1J36j93J26q6J07M0j26
2013f3J3K54j11q7l9O5r2Q0R4p2j13J59q4R1j51M7k8o1J31pK2k5o1J23rq6J0k31J52J62j13
1625c0m1M0N5o1K4O3%Jm8J1K4O9l1j01j7k1P6j87M3K10j00o4M8N0qj41K01j0j1m9l0p7R2j4
1199c4J04j10L9l6MN0n7OK5R4j07M7o5j23R8R3j02o7J45Kq0J00m5k1Q5j09O5J7%J03j33p0
798h2Q5lk3j32J23O6k5Rq9K1Q7o6J2P3m1l4K9j22O1L5qoQ6m2j24K02q4k0N3j10j9J80l1r8
373c7M9R5j01j33Qp6J08J81k09O4Q6K8k3n1P8j62N7mP2j24j6J80j19j71K84m9J16k1n8lm8
-16Aj3l0k7k9J00pK7Nm0Q8q6j3L8o1l9J84n5o1O2j17M5l3J38k4PL8j95Q8mm7
-391f0
##PAGE=	F1=4558.96
##FIRST=	23146.675690215950453,	6006.5297639999989769,	-0.30731791257858276367
##DATA TABLE=	(F2++(Y..Y)), PROFILE
$$ plain form
6007 -52 -21 34 5 -56 -72 111 -97 -14 11 47 2 41 -20 -31 49 93 83 129 -65 58 -83 20 11 41 -35 24 35 -1 64 41 -24 -39 76
5593 76 84 81 55 -66 -89 61 -22 1 -36 -80 13 -28 110 -51 12 -112 -36 -8 -23 129 113 128 -31 1 146 90 -10 -92 -3 -45 -56 -22
5193 -22 -36 -158 -47 -16 13 -43 -57 -71 -65 -59 -15 -55 52 -37 39 90 -97 6 81 123 -48 -85 -70 64 5 -61 -46 22 34 -18 27 50 83
4780 83 -143 -15 69 110 80 -24 5 34 53 -46 -4 -68 -92 -61 -37 -67 -38 -93 -182 -138 64 156 -28 33 21 9 123 104 -54 -35 23 -29
4379 -29 -17 0 33 19 -97 60 19 43 -59 -5 25 48 38 94 60 46 38 59 70 89 129 -36 -74 -13 -134 -71 -84 85 70 67 -53 -44 26
3966 26 52 17 84 77 11 -15 -125 -86 29 -21 -34 51 -69 4 -51 13 0 71 5 3 99 -84 -64 7 -7 2 -180 47 -24 -10 -23 -22 98 -40
3540 -40 -9 24 -16 -8 17 107 188 -31 -16 101 -65 -8 -74 44 -173 -46 67 -6 -13 -47 66 -95 -22 -69 93 42 35 89 -31 21 98
3152 98 -33 50 62 -3 -131 -122 -42 57 -149 4216 848 115 136 62 22 -4 -13 -58 71 -18 16 121 129 95 -87 -90 116 88 59 24 -23
$$ packed form
6007e2L1N5k9o1j6J83k08Q3K5L6m5L9o1j1Q0M4j0M6j94J23j41J03rL0p6N9J1l6O5k3o5j5J15
5593G6Qlk6j21k3J50q3K3l7m4R3m1J38j61O3j24P6K8j5J52j6J5j59L2J45n6j00q2Q9m2j1L4
5193b2j4j22J11L1K9n6j4j4OOM4m0J07q9P6N1j87J03P5M2j71l7J5J34n9o6J5O8J2n2M5K3L3
4780H3k26J28Q4M1l0j04K9K9J9r9M2o4k4L1K4l0K9n5q9M4K02R2j84O1j2j2J14j9j58J9N8n2
4379b9J2J7L3j4j16J57m1K4j02N4L0K3j0N6l4j4qK1J1J9M0j65l8O1j21O3j3J69j5lj20RP0
3966B6K6l5O7po6k6j10L9J15n0j3Q5j20P3n5O4j3P1o6kR6j83K0P1j4Rj82K27p1J4j3JJ20j38
3540d0L1L3m0QK5R0Q1k19J5J17j66N7o6J18k17J27J13p3pl4J13j61P3m7J62n1pN4j20N2P7
3152I8j31Q3J2o5j28RQ0R9k06M365l368p33K1p4m0k6rm5J29q9L4J05Ql4j82lK06k8k9l5m7
$$ plain form
2764 -23 21 -9 47 17 -37 12 -7 38 29 -28 -36 -39 12 -119 -76 82 93 -51 -57 -34 -136 -45 -49 88 -69 -70 -74 -179 -1 19 32 -43 -53 71
2338 71 -33 -14 -5 -53 82 -11 55 4 -94 36 53 -48 -27 42 75 -96 -60 -31 -34 46 -119 5 -72 -19 65 -73 0 180 62 36 2
1950 2 39 -57 84 142 65 -3 142 38 47 -35 6 -9 -80 1 4 55 33 -29 124 103 30 10 -256 -66 121 -45 -47 -43 -1 -15 40 46 54 34 7
1512 7 -1 30 104 74 -17 10 -87 23 -168 -105 89 10 -94 -55 -17 -25 -115 78 60 57 -6 -37 -136 -9 -32 96 -47 -3 -17 -57 8 -9 -45
1099 -45 -16 64 -11 20 -79 -153 -38 47 -130 -124 27 -3 -102 32 21 -45 30 -85 0 43 23 60 -27 -70 48 -1 -1 -129 -23 2 21 -9
698 -9 -127 -75 12 -12 -32 94 -6 -4 -14 -167 -26 -35 -63 -84 64 93 -97 88 -20 20 64 -53 -78 99 52 -22 14 92 -60 -142 -99
310 -99 -205 -53 64 -97 -100 22 33 48 38 57 -60 -36 -38 8 -81 -91 86 -44 -162 90 3 119 81 59 45 33 -9 -19 -1 -70 -41
-78 -41 -10 43 50 35 81 7 -38 3 -31 -81 17 27 15 46 -88 -8 -24 32 38 69 61 -63 0 -1 -48
$$ packed form
2764b3M4l0N6l0n4M9j9M5rn7qlN1j31M3J58J1j44oK3j02R1mJ37j57jmj05J78K0J3p5j0J24
2338G1j04J9Rm8J35r3O6n1r8J30J7j01K1O9L3j71L6K9lQ0j65J24p7N3Q4j38P3J80j18k6l4
1950BL7r6J41N8p7o8J45j04Rq2M1j5p1Q1LN1k2o2J53k1p3k0k66J90J87j66kMM2j4N5OQk0k7
1512GqL1P4l0r1K7r7J10j91O3J94p9j04L9L8qr0J93j8lo3l1r9J27k3J28j43M4j4m0O5j7l6
1099d5K9Q0p5L1r9p4J15Q5j77OJ51l0r9J34j1o6P5j15Q5M3k0L7q7m3J18m9%j28J06K5J9l0
698ij18N2Q7k4k0J26j00Kj0j53J41rk8k1J48K9j90J85j08M0M4j17k5J77m7p4L6P8j52q2M3
310i9j06J52J17j61lJ22J1J5j0J9j17K4kM6q9j0J77j30j18K52q7J16l8k2j4j2m2j0J8o9K9
-78d1L1N3Pj5M6p4m5M1l4n0R8J0j2L1j34Q0j6N6OL1qj24O3jm7
-391d8
##PAGE=	F1=4464.61
##FIRST=	23146.675690215950453,	6006.5297639999989769,	-0.14698782563209533691
##DATA TABLE=	(F2++(Y..Y)), PROFILE
$$ plain form
6007 -59 -2 52 -17 -46 -70 115 -97 11 22 26 -48 58 9 -18 26 6 92 94 -41 54 -85 32 -7 45 -48 -30 -12 30 86 79 -27 -47 38
5593 38 -8 61 69 -61 -99 59 -57 -7 -73 -109 21 4 129 -28 21 -106 -36 23 -36 77 89 150 19 9 192 96 -37 -46 11 -55 -63
5205 -63 12 -46 -120 -45 -27 9 -34 -76 -105 -33 -47 0 -40 140 11 73 95 -110 12 80 117 -42 -82 -80 31 -20 -31 -39 -2 19 -57 -3 74
4792 74 40 -147 -15 60 162 71 -3 34 59 50 -42 4 -87 -124 -86 -40 -102 -16 -71 -134 -88 120 141 -54 9 35 9 137 112 -25 -10 -2 -49
4379 -49 -35 -20 -26 43 -68 100 43 58 -70 -14 53 42 73 82 49 72 -4 68 70 89 148 -34 -48 -61 -141 -65 -22 71 62 27 -70 -51 21 79 26
3941 26 77 57 74 0 -55 -24 24 -37 -24 42 -37 40 -66 -23 -15 52 -48 0 49 -8 -42 51 -11 9 -157 66 -19 -29 -22 19 104 -56 -17 67
3515 67 34 -24 3 76 174 -32 -22 101 -88 -25 -56 62 -159 -76 33 5 -8 -33 81 -82 -30 -45 106 55 88 50 -49 60 106 -27
3139 -27 55 97 -17 -74 -103 -2 123 -81 1889 323 44 63 4 4 16 0 -25 60 -63 2 84 128 112 -96 -99 103 37 58 24 -50
$$ packed form
6007e9N7N4o9k9k4J85k12J08J1Mp4J06m9k7M4k0Q6Kj35R5j39J17l9N2r3J8J8M2N6pj06k0Q5
5593C8m6O9Qj30l8J58j16N0o6l6J30j7J25j57M9j27P0N9n9J13J2O1j31j0J83r6j33rN7o6q
5205f3P5n8p4P5J8L6m3m2k9P2j4M7m0J80j29O2K2k05J22O8L7j59m0KJ11n1j1qL7K1p6N4P7
4792G4l4j87J32P5J02r1p4L7K5rr2M6r1l7L8M6o2Q6n5o3M6K08K1j95O3K6k6J28k5j37J5Qm7
4379d9J4J5oO9j11J68n7J5j28N6O7j1L1Rl3K3p6P2KJ9N9j82j4j3q0P6M3R3rl5r7J9P2N8n3
3941B6N1k0J7p4n5L1M8o1J3O6p9P7j06M3QO7j00M8M9n7l4R3o2K0j66K23q5j0PM1Q5j60L9Q4
3515F7l3n8K7P3R8k06J0J23j89O3l1J18k21Q3J09k8j3k5J14j63N2j5J51n1L3l8r9J09M6j33
3139b7Q2M2j14n7k9J01J25k04J970j566k79J9n9%J2j6k5Q5j23O5Q2M4j6k08lK02o6K1l4p4
$$ plain form
2764 -50 -37 -4 70 -15 -68 1 -5 52 49 -63 -31 -60 11 -97 -52 115 97 -98 -93 -19 -123 -18 -11 66 -103 -53 -76 -175 -9 14 40 -32 -63
2351 -63 49 -28 13 31 -17 89 -16 44 -3 -71 17 43 -65 -34 60 94 -52 -50 -22 -6 18 -92 17 -61 -48 64 -74 24 141 39
1975 39 56 38 43 -72 139 171 72 42 158 73 5 -6 8 20 -59 -35 -27 46 45 -2 141 132 49 6 -251 -38 140 -58 -32 -37 -32 0 69 23
1549 23 51 -5 -2 -45 24 100 53 -18 41 -86 30 -132 -67 99 27 -86 -53 -10 -36 -80 86 40 58 -8 -36 -162 -11 -34 100 -48 1
1161 1 -9 -63 0 14 -57 -12 37 6 1 -87 -110 -25 57 -148 -106 44 -4 -113 17 23 -46 -2 -101 -11 62 12 -6 -50 -36 71 -20 3 -98 -24
736 -24 -8 40 -45 -172 -103 -9 12 -38 105 -18 11 -35 -178 -4 -28 -79 -123 78 141 -83 63 -50 53 72 -31 -61 91 52 -12 2
360 2 54 -106 -113 -60 -178 -11 31 -79 -142 -1 -1 25 82 45 -7 -21 -25 -7 -61 -50 90 -22 -101 89 -9 82 49 63 41 54 5 17 57 -41
-66 -41 -90 -30 52 81 83 79 18 -66 -24 -16 -47 -45 -3 17 10 -110 -2 8 -27 24 82 23 -17 -2 9 -37
$$ packed form
2764e0J3L3P4q5n3O9oN7lj12L2k9P1j08M5J67j8j95NP4j04J05PP7j69N0k3r9J66K3K6p2l1
2351f3J12p7M1J8m8J06j05O0m7o8Q8K6j08L1R4L4j46KK8J6K4j10J09p8J3J12j38R8J17j02
1975C9J7j8Nj15K11L2r9l0J16q5o8j1J4J2p9K4QP3jm7J43rq3m3k57K13J78j98K6nNL2O9m6
1549B3K8n6Lm3O9P6m7p1N9j27J16j62O5J66p2j13L3M3k6m4J66m6J8o6k8j26J51k3J34j48M9
1161Aj0n4O3J4p1M5M9l1nq8k3Q5Q2k05M2J50m8j09J30Oo9M4r9R0P3n0j8m4J4J07r1K3j01P4
736b4J6M8q5j27O9R4K1n0J43j23K9m6j43J74k4n1m4K01O3k24J46j13J03J9j03l0J52l9o4J4
360BN2j60pN3j18J67M2j10o3J41%K6N7l7n2j4mJ8n4J1J40j12p9J90r8R1l3J4k2J3m9J2M0r8
-66d1m9O0Q2K9Kmo1q4M2Ql1KM2K0pj20J08J0l5N1N8n9m0J5J1m6
-391c7
##PAGE=	F1=4370.26
##FIRST=	23146.675690215950453,	6006.5297639999989769,	-0.15807105600833892822
##DATA TABLE=	(F2++(Y..Y)), PROFILE
$$ plain form
6007 -60 14 70 -20 -31 -54 117 -88 19 37 0 -91 62 60 -9 13 -63 81 42 -19 35 -60 29 -5 47 -28 -64 -55 29 95 124 -22 -40 -6
5593 -6 -113 41 77 -76 -98 49 -82 -35 -113 -141 42 27 112 5 23 -95 -49 63 -18 36 52 132 50 14 186 75 -37 -2 25 -38
5218 -38 -58 33 -64 -93 -47 -28 -10 -23 -76 -127 4 -11 -1 -20 202 65 98 85 -109 18 63 95 -20 -63 -72 -12 -52 17 -35 -38 3 -89 -23
4805 -23 90 -21 -133 -15 52 199 19 1 57 65 35 -16 8 -83 -129 -110 -22 -94 0 -35 -67 -28 131 120 -72 -14 52 -6 126 102 12
4416 12 18 11 -31 -34 -53 -74 62 -30 131 58 69 -68 -43 73 14 103 43 17 82 -38 71 56 67 170 -18 -18 -101 -131 -43 43 31 47 -3
4003 -3 -72 -38 3 100 47 80 48 123 18 0 33 3 -49 -38 0 -12 70 -59 -56 -36 28 -96 -21 4 75 -8 57 -11 17 -101 46 -41 -32 -19
3578 -19 58 101 -61 -17 98 75 -37 -9 42 139 -36 -38 85 -99 -45 -51 62 -139 -86 -21 6 19 -9 102 -68 -45 -39 93 47 121 13
3190 13 -55 91 90 -40 51 89 -32 -10 -90 -4 149 -81 894 136 17 0 -33 4 53 23 34 68 -103 8 50 135 130 -90 -101 86
$$ packed form
6007f0P4N6r0j1k3J71k05J07J8l7r1J53ko9K2p6J44l9o1N4r5Q9l4N2p5l6RQ4O6K9j46j8L4
5593fj07J54L6j53k2J47j31M7p8k8J83j5Q5j07J8j18M6J12q1N4J6Q0q2l6J72j11j12L5K7o3
5218c8k0R1r7k9M6J9J8j3n3n1J31j5J0j9K22j37L3j3j94J27M5L2j15m3rO0m0O9n2lM1r2O6
4805b3J13j11j12J18O7J47j80j8N6Ql0n1K4r1m6J9Q8p2R4l5l2L9J59j1j92N8O6n8J32k4r0
4416A2Opm2lj9k1J36r2J61p3J1j37K5J16n9Q9o0k6O5j20J09j5J1J03j88%q3l0Q8Q6j2J6n0
4003co9L4M1R7n3L3l2P5j05j8L3l0n2J1L8j2Q2j29LK0O4j24P5K5P1q3O5o8K8j18J47q7RJ3
3578a9P7M3j62M4J15k3j12K8N1R7j75kJ23j84N4oJ13k01N3O5K7J3k8J11j70K3OJ32m6P4j08
3190A3o8J46jj30R1L8j21K2q0Q6J53k30R75p58j19j7l3L7M9l0J1L4j71J11M2Q5nk20j1J87
$$ plain form
2814 86 -36 60 12 -95 -103 17 81 -36 -93 -9 11 63 73 -84 -9 -54 5 -83 -17 136 94 -139 -113 -22 -83 7 25 23 -134 -47 -65 -146
2413 -146 -13 20 34 -18 -51 17 -45 33 53 12 66 -33 36 -2 -38 5 32 -69 -31 64 94 10 -47 -16 12 6 -61 36 -54 -68 58 -66 16
2000 16 95 35 65 55 44 -116 164 186 65 54 142 91 -16 16 -2 40 -43 -58 -60 33 59 31 148 148 47 -4 -215 11 129 -66 -43
1612 -43 -16 -46 8 63 0 38 -44 -24 -107 25 86 13 -22 53 -70 24 -78 -29 112 30 -79 -35 25 -20 -29 92 7 52 0 -27 -171 -26
1211 -26 -39 75 -43 12 -2 -48 -5 15 -63 -3 21 30 -27 -68 -56 -14 54 -118 -92 47 -6 -93 -15 -7 -40 -36 -95 -25 66 -6 -59 -76 9 65 -45
773 -45 7 -65 -30 0 52 -83 -193 -120 -11 32 -37 88 -6 25 -48 -152 10 5 -69 -130 95 153 -67 26 -73 70 71 -20 -46 86 58 3
373 3 -12 7 -110 -51 -7 -125 13 -11 -66 -149 -27 -25 -18 107 37 48 -7 -16 -22 -44 1 86 16 -52 71 -28 40 24 71 33 48 23 52 87 -21
-66 -21 -128 -54 48 102 108 58 17 -99 -66 -8 4 -73 -29 4 -44 -130 -8 31 -74 15 96 0 32 -5 22 -31
$$ packed form
2814H6j22R6m8j07qJ20O4j17n7Q4K0N2J0j57P5m5N9q8O6J53m2k33K6R1o1R0J8kj57Q7j8q1
2413a46J33L3J4n2l3O8o2P8K0m1N4r9O9l8l6M3K7j01L8R5L0q4n7L1K8oo7R7r0j4J26j24Q2
2000A6P9o0L0j0j1j60K80K2j21j1Q8n1j07L2j8M2q3j5kR3K6k8J17%j01n1k11K26J18j95K3
1612d3K7l0N4N5o3L8q2K0q3J32O1p3l5P5j23R4j02M9J41q2j09M4O0m5rJ21q5M5n2k7j44J45
1211b6j3J14j18N5j4m6M3K0p8O0K4Rn7m1J2M2O8j72K6J39n3q7P8Ql3Mn9P0R1p2n3j7Q5N6j10
773d5N2p2L5L0N2j35j10P3J09M3o9J25r4L1p3j04J62np4o1K25N8k20R3r9J43Jr1k6J32k8n5
373Cj5J9j17N9M4j18J38k4n5q3J22KPJ25p0J1n5rok2M5Q5p0o8J23r9O8j6M7l8J5k5K9L5j08
-66b1j07P4J02N4On0m1j16L3N8J2p7M4L3m8q6J22L9j05Q9Q1r6L2l7K7n3
-391c1
##PAGE=	F1=4275.9
##FIRST=	23146.675690215950453,	6006.5297639999989769,	-0.25309610366821289063
##DATA TABLE=	(F2++(Y..Y)), PROFILE
$$ plain form
6007 -48 30 85 -4 -20 -30 106 -74 2 56 -22 -106 54 110 -15 11 -86 59 -4 -16 3 -15 10 13 49 12 -70 -79 13 96 163 -14 -17 -37 -200
5581 -200 19 74 -95 -85 48 -92 -67 -133 -159 69 29 72 53 17 -82 -72 104 22 14 25 80 45 17 124 33 -16 19 22 -8 -41 37 -87
5180 -87 -90 -58 -13 -37 -10 -62 -133 33 26 -20 3 218 101 97 52 -104 26 29 63 14 -37 -50 -45 -74 62 -38 -83 -8 -104 -11 101 -85 -110
4767 -110 -12 42 213 -53 -16 64 53 6 8 2 -58 -104 -128 8 -58 -2 -3 -3 17 98 101 -76 -35 65 -45 85 73 41 45 61 3 -16 -97 -95 68
4329 68 0 148 58 82 -54 -80 76 -14 113 -6 -19 67 -62 64 29 20 187 11 16 -130 -107 -10 90 -22 31 -18 -56 -10 -19 105
3953 105 74 98 62 145 38 30 74 -13 -52 -77 -66 2 94 -38 -73 -57 11 -126 -49 -9 147 19 24 -9 21 -26 -5 -79 -19 -8 84 89 -59
3540 -59 -13 105 90 -40 -17 18 101 -40 -59 59 -89 -64 -48 40 -125 -74 -76 -5 49 27 130 -54 -63 -49 60 28 127 -2 -57 108 63
3152 63 -68 36 45 -41 39 -80 -31 146 -103 767 166 22 -48 -46 12 76 40 89 91 -112 34 33 144 146 -66 -96 71 -100 54 -2
$$ packed form
6007d8P8N5q9j6j0J36j80P6N4p8q4J60N6j25K6r7J45o3j2J9j8K5LL6l7q2rR2Q3O7j77lk0j63
5581b00K19N5j69J0J33j40K5o6k6K28m0M3j9l6r9J0J76q2qJ1N5l5k8J07r1m9L5Ll0l3P8j24
5180h7lL2M5k4K7n2p1J66pm6K3K15j17mm5j56J30LL4m9n1j3Nk9J36j00m5P5r6R3J12j86k5
4767a10R8N4J71k66L7Q0j1m7Koo0m6k4J36o6N6j%K0Q1Lj77M1J00j10J30j2l2MJ6n8j9q1KJ63
4329F8o8J48r0K4j36k6J56r0J27j19j3Q6j29J26l5rJ67j76Nj46K3R7J00j12N3m9l8M6rJ24
3953A05l1K4l6Q3j07qM4q7l9k5J1O8R2j32l5J6O8j37P7M0J56j28Nl3L0m7K1p4O0J1R2Nj48
3540e9M6J18j5j30K3L5Q3j41j9J18j48K5J6Q8j65N1kP1N4k2J03j84rJ4J09l2R9j29n5J65m5
3152F3j31J04Rq6Q0j19M9J77k49Q70o01j44p0KN8O4l6M9Kk03J46jJ11Kk12l0J67j71J54n6
$$ plain form
2776 -2 -148 -159 44 72 -38 -117 -20 27 69 86 -86 3 -30 -4 -74 7 135 82 -153 -106 -44 -27 27 42 -20 -149 -50 -54 -108 -25 33 9 -17
2363 -17 -29 -8 -78 39 56 36 31 -56 19 -12 -11 1 29 -56 -25 51 78 73 -46 0 23 17 -42 54 -46 -81 49 -57 -19 55 48 63 51 44 -176
1925 -176 148 171 47 38 113 91 -13 29 -12 49 -37 -57 -87 24 74 56 154 145 38 -11 -162 72 89 -66 -79 9 -26 15 29 -9 20 -58
1524 -58 -51 -169 38 55 -32 -18 51 -52 1 -30 -6 121 25 -78 -10 68 16 31 96 -25 43 17 -9 -152 -49 -47 29 -37 31 15 -13 -7 -14
1111 -14 -62 8 23 48 -52 -40 -16 3 47 -51 -82 32 -14 -43 -47 -50 -29 -57 -63 -39 51 -26 -89 -99 53 36 -55 25 -33 -38 12 56 -114 -192 -120
673 -120 7 36 -36 50 23 41 -54 -114 15 47 -48 -104 106 139 -47 -6 -79 60 67 -23 -35 92 70 30 -32 -35 -72 17 54 -70 6 -61 -53
260 -53 -111 -47 -33 -63 106 29 95 -7 -23 -42 -34 47 75 60 -23 57 -53 9 12 84 18 9 36 77 83 -14 -134 -73 35 100 93 21 1 -123 -110
-178 -110 -2 51 -68 -28 -3 -93 -138 -20 42 -89 12 109 -1 74 1 42 -30
$$ packed form
2776bj46j1K03K8j10p9R7M7M2J7j72Q9l3K6p0Q1J28n3k35M7O2J7N4J5o2j29R9mn4Q3N8k4k6
2363a7j2K1p0J17J7k0nq7P5l1JJ2K8q5L1P6K7nj19M6K3on9R6j00l5J30j06L8P4pJ5j2pk20
1925a76L24K3j24rP5k2j04M2m1O1q6k0l0J11N0j8R8rj07m9j51K34J7j55j3Q8l5M1J4l8K9p8
1524e8Pj18K07J7q7J4O9j03N3l1K4J27r6j03O8P8n2J5O5j21O8k6k6j43J03KP6o6O8j6k8Op
1111a4m8P0J5K5j00J2K4J9M4r8l1J14m6k9mlK1k8oK4R0p7o3j0J52j7r1Q0n8nN0M4j70p8P2
673a20J27K9p2Q6k7J8r5o0J29L2r5n6K10L3j86M1p3J39Pr0j2J27k2m0o2ll7Q9L7j24P6o7Q
260e3n8O4J4l0J69p7O6j02j6j9QQ1K8j5q3Q0j10O2LP2o6rK7M1Or7j20O1J08O5pp2k0j24J3
-178a10J08N3j19M0K5r0m5J18O2j31J01R7j10P5p3M1p2
-391c0
##PAGE=	F1=4181.55
##FIRST=	23146.675690215950453,	6006.5297639999989769,	-0.19852861762046813965
##DATA TABLE=	(F2++(Y..Y)), PROFILE
$$ plain form
6007 -30 42 85 14 -20 -11 74 -58 -28 72 -39 -88 43 147 -40 15 -58 40 -31 -34 -29 30 -18 44 47 43 -52 -81 0 96 181 -14 13 -37 -253
5581 -253 -2 56 -102 -58 67 -90 -88 -127 -152 89 15 28 101 7 -69 -91 145 64 6 24 19 12 17 29 -11 10 16 0 13 -19 33 -106 -111 -78
5155 -78 10 -59 2 -46 -122 46 47 -45 31 192 103 64 3 -96 32 -13 31 49 -18 -24 -47 -71 88 -42 -130 -13 -98 37 107 -132 -86 -8
4755 -8 21 202 -110 -49 55 38 -24 12 -14 -23 -57 -136 39 -19 -24 12 40 43 46 92 -69 -52 64 -103 23 31 47 65 124 33 4 -142 -89 60
4329 60 8 149 51 95 -34 -110 53 -33 101 -47 -47 29 -81 39 -2 -34 189 37 53 -150 -76 22 107 -65 15 -23 -32 24 -36 89
3953 89 89 115 94 135 56 39 95 -16 -45 -126 -142 12 111 -20 -74 -72 0 -140 -62 10 193 27 -27 -9 17 43 -66 -115 -1 7 94 73 -51
3540 -51 -10 94 78 -28 -13 12 68 -44 -72 36 -57 -76 -44 1 -121 -55 -108 -27 61 68 155 -51 -79 -66 25 17 111 1 -57 112 46 -100
3139 -100 19 -11 -39 69 -67 -60 125 -106 844 241 41 -84 -42 18 66 40 95 107 -83 71 37 146 150 -36 -91 62 -124 33
$$ packed form
6007c0P2M3p1l4RQ5j32L0J00j11m9J31J04j87N5p3R8p1lNN9m8O2Lmr5k9Q1R6Q5j95K7n0k16
5581b53K51N8j58M4J25j57Kl9k5K41p4J3P3r4p6k2K36q1n8J8npNJ2m0K1Oj6J3l2N2j39nL3
5155g8Q8o9O1m8p6J68Jr2P6J61q9l9o1r9J28m5M4J8o7ok3k4J59j30q8J17q5J35P0k39M6P8
4755hK9J81l12O1J04j7o2L6k6rl4p9J75n8nL6K8LLM6j61J7J16j67J26QJ6J8N9r1k9j46N3J49
4329F0n2J41r8M4j29p6J63q6J34j48%P6j10J20m1l2K23j52J6k03P4R8Q5j72Q0l8rN6o0J25
3953H9%K6k1M1p9j7N6j11k9q1j6J54R9j31n4KP2j40P8P2J83j66n4J8K6K6j09m9J14QQ7k1j24
3540e1M1J04j6j06J5K5N6j12k8J08r3j9L2M5j22O6n3Q1Q8PQ7k06k8J3R1qR4j10n8J69o6j46
3139a00J19l0k8J08j36PJ85k31R50o03k00j25M2O0M8k6N5J2j90J54l4J09Mj86n5J53j86J57
$$ plain form
2789 33 -14 -189 -200 59 41 -27 -137 -30 29 68 83 -73 -14 -1 -8 -58 11 110 60 -133 -76 -76 27 37 39 -45 -140 -63 -49 -77 -49 42 -30
2376 -30 -29 -13 -17 -105 33 51 52 9 -76 -21 -43 1 -7 36 -34 -22 26 48 120 -39 31 34 47 -38 59 -36 -86 42 -60 -63 29 64 48 39 51 -224
1925 -224 98 125 23 11 85 82 2 36 -5 53 -38 -38 -100 15 88 58 163 131 30 -15 -112 124 38 -56 -118 34 32 28 -17 5 8 -35 -74 -215
1499 -215 62 14 -63 -5 44 -46 -28 -5 -1 118 16 -84 11 97 59 80 90 -52 30 33 12 -111 -69 -57 -21 -35 53 40 28 -9 -65 -58 20
1086 20 40 49 -61 -21 -4 33 43 26 -69 5 -25 17 -56 -83 -21 -63 -17 -48 30 -45 -99 -109 77 0 -40 57 -1 -49 13 55 -131 -183 -107 36
660 36 27 -41 2 46 59 -56 -84 7 68 -33 -58 101 115 -23 -25 -65 25 64 -29 -24 103 78 55 -64 -72 -11 69 116 -32 -22 -106 -36 -37 -60 -26
222 -26 -90 86 23 125 -21 -41 -67 -29 70 60 93 -8 60 -75 -3 9 96 -3 -47 43 93 56 -18 -99 -84 18 77 47 -7 -23 -127 -145
-178 -145 7 70 -51 0 4 -122 -129 -32 46 -66 16 120 10 96 21 63 -30
$$ packed form
2789C3m7j75j1K59j8o8j10J07N9L9J5j56N9J3pn0O9R9n0j93N7%J03J0Kq4r5P7J4k8K8R1p2
2376c0JJ6mq8J38J8Jm3q5N5k2M4qM3p0J2M8K2P2j59P0LJ3q5R7r5n0J28j02lR2L5j6rJ2k75
1925b24L22K7j02j2P4lq0L4m1N8r1%o2J15P3l0J05l2j01m5r7K36q6r4o2J52kmm5K2Lm3l9j41
1499b15K77m8p7N8M9r0J8K3MJ19j02j00R5Q6l8K1J0j42Q2Lk1j23M2J2L6j4Q8j3j2l7n6PP8
1086B0K0Rj10M0J7L7J0j7r5P4l0M2p3k7O2m2M6l1P8p5n4j0J86p7m0R7n8m8O2M2j86n2P6J43
660C6ro8M3M4J3j15k8R1O1j01k5J59J4j38km0R0L9r3NJ27k5k3j19qO1Q0M7j48J0q4P0jk3L4
222b6o4J76o3J02j46k0k6L8R9j0L3j01O8j35P2J2Q7r9m4R0N0l7p4q1J5J02N9l0n4j6j04j8
-178a45J52O3j21N1Mj26pR7P8j12Q2J04j10Q6p5M2r3
-391c0
##PAGE=	F1=4087.2
##FIRST=	23146.675690215950453,	6006.5297639999989769,	-0.38415190577507019043
##DATA TABLE=	(F2++(Y..Y)), PROFILE
$$ plain form
6007 -15 40 62 21 -37 -10 29 -39 -52 79 -53 -42 40 167 -78 17 -1 30 -36 -63 -53 56 -49 84 36 45 -24 -71 1 98 168 -30 36
5606 36 -8 -270 -26 19 -88 -27 97 -82 -95 -100 -119 96 3 -1 132 -1 -50 -91 176 87 0 47 -21 -23 14 -61 -37 30 4 -29 12 0
5205 0 32 -104 -143 -109 28 -71 11 -41 -93 44 45 -64 60 142 78 6 -45 -76 34 -43 6 70 -18 -9 -17 -41 95 -35 -166 -8 -82 104
4805 104 107 -149 -67 0 -12 166 -124 -79 37 35 -40 -9 -34 6 -4 -127 58 6 -56 11 58 61 4 98 -54 -66 47 -165 -42 -8 28
4416 28 79 162 48 12 -177 -70 44 -4 138 57 98 -14 -115 6 -36 70 -65 -62 -16 -96 -5 -28 -74 170 39 81 -159 -47 47
4053 47 96 -80 -1 -21 -5 51 -36 58 77 112 129 102 63 41 94 -7 -30 -163 -202 22 119 -14 -65 -74 -2 -139 -46 39 209 18 -72 -14
3653 -14 0 87 -108 -132 7 19 86 54 -37 -6 78 51 -5 3 19 35 -55 -61 29 -13 -73 -43 -44 -118 -47 -111 -44 50 99 157 -67 -84 -81 8 31 88
3202 88 16 -49 110 46 -124 10 -54 -29 86 -50 -73 89 -86 791 264 60 -111 -38 13 32 18 52 106 -28 109 61 134 134 -16
$$ packed form
6007a5N5K2m1n8K7L9o8j3J31j32J1Q2J27k45R5j8L1o6k7J0J09j05J33m8Ro9m7P2R7P0j98O6
5606C6m4k62K44M5j07O1J24j79j3nj9K15r3mJ33j33m9m1K67q9q7M7o8kL7p5K4O7k6l3M1j2
5205@L2j36l9L4J37r9Q2n2n2J37Jj09J24Q2o4p2n1l1J10p7M9O4q8Rqk4J36j30j31J58p4J86
4805A04Lk56Q2O7j2J78k90M5J16kp5L1k5M0j0j23J85n2o2O7M7Ln7R4j52j2J13k12J23L4L6
4416B8N1Q3j14l6j89J07J14m8J42q1M1j12j01J21m2J06j35LM6q0R1k3m6K44j31M2k40J12R4
4053D7M9j76P9k0J6N6q7R4J9L5J7k7l9k2N3j01k3j33l9K24R7j33n1rP2j37R3Q5J70j91r0N8
3653a4J4Q7j95k4J39J2O7l2r1L1Q4k7n6QJ6J6r0oR0m2o0L0jp4P1o4O7R4M9N8k24j7LQ9K3N7
3202H8p2o5J59o4j70J34o4K5J15j36k3J62j75Q77n27k04j71P3N1J9j4L4N4j34J37m8P3%j50
$$ plain form
2839 -16 -87 54 -101 0 -19 -200 -224 50 -4 -9 -142 -38 8 60 72 -54 -64 20 -1 -30 0 69 31 -86 -34 -100 64 40 24 -41 -108
2451 -108 -84 -41 -62 -82 33 -72 -39 -5 -9 -105 15 51 66 17 -83 -86 -86 2 -33 47 -14 -26 0 12 145 -19 66 56 79 -43 41 -22 -79
2038 -79 43 -80 -94 19 66 18 31 63 -232 34 60 1 -11 59 76 16 39 22 59 -40 -16 -98 -2 96 38 163 114 27 -24 -76 148 -2
1637 -2 -35 -137 55 109 43 -70 33 6 10 -88 -233 88 -21 -69 12 40 -57 -50 0 -4 97 7 -96 19 102 97 97 61 -79 3 25 26 -62
1224 -62 -76 -68 -61 -35 60 56 66 -16 -111 -54 32 54 32 -52 -16 -22 70 46 89 -50 -27 -34 55 -37 -95 -25 -61 18 -54 15 -59 -96 -105 77 -26 -8 87
761 87 23 -69 -4 55 -133 -180 -89 57 18 -54 -39 45 72 -55 -60 -16 47 -35 -13 80 91 0 -30 -38 -21 63 -28 -9 102 76 61 -109 -105 47
335 47 93 169 -20 -57 -127 -16 45 -72 -13 -95 61 17 137 -45 -57 -93 -25 57 47 105 7 74 -81 -4 3 95 -24 -98 48 101 23 -30
-66 -30 -34 -87 -1 44 -3 -7 -45 -113 -165 28 57 -42 42 18 -127 -104 -39 48 -21 29 128 24 87 49 75 -33
$$ packed form
2839a6p1J41j55J01j9j81k4K74n4nj33J04M6N2J2j26j0Q4k1k9L0O9l8j17N2o6J64k4j6o5o7
2451a08K4M3k1k0J15j05L3L4mr6J20L6J5m9j00l%Q8l5Q0o1j2K6J2J33j64Q5j0K3j22Q4o3n7
2038g9J22j23j4J13M7m8J3L2k95K66K6n9j2P0J7o0K3j7L7r9K4q2R6R8n8J25m9q7n1n2K24j50
1637bl3j02J92N4o6j13J03k7Mr8j45L21j09m8Q1K8r7PN0mJ01r0j03J15Q3n%l6j40Q2K2Jq8
1224f2j4QPK6R5mJ0q2r5N7Q6K2k2q4L6oR2k4M3j39K3pQ9r2n8P0l6P9p2O9p4l7rJ82j03J8R5
761H7o4r2O5N9j88m7R1J46l9p2J5Q4K7j27nM4O3q2K2R3J1r1l0qJ7Q4r1J9J11k6j5j70MJ52
335D7M6P6j89l7p0J11O1j17N9q2J56m4J20j82j2l6O8Q2j0N8r8O7j55P7PR2j19p4J46N3p8n3
-66c0mn3Q6M5m7ml8o8n2J93K9r9Q4k4j45K3O5Q7o9N0R9j04O3l8K6j08
-391c3
##PAGE=	F1=3992.84
##FIRST=	23146.675690215950453,	6006.5297639999989769,	-0.72351372241973876953
##DATA TABLE=	(F2++(Y..Y)), PROFILE
$$ plain form
6007 -9 16 18 3 -74 -29 -11 -13 -49 69 -61 14 48 171 -116 20 53 28 -26 -86 -67 52 -76 127 13 12 -2 -60 22 99 130 -56 35
5606 35 27 -260 -57 -32 -55 -2 119 -72 -84 -62 -75 97 1 -15 131 2 -24 -68 185 80 -9 78 -27 -36 4 -114 -36 35 1 -47 -10
5218 -10 11 38 -71 -161 -146 27 -75 5 -50 -48 37 29 -70 84 98 42 -61 -82 -39 32 -46 -8 70 -37 -15 26 2 89 -12 -178 -2 -67
4817 -67 161 100 -133 -54 13 -47 115 -94 -96 20 51 -29 -37 -43 24 35 -99 63 24 -83 4 60 79 -14 111 -35 -72 21 -206 -90 -31
4429 -31 -1 90 150 51 -1 -189 -50 27 -26 124 90 74 0 -90 -44 -24 35 -57 -66 -57 -107 -63 -44 -79 136 13 87 -156 -24 59 69 -68
4028 -68 -16 -13 17 60 -16 22 39 86 147 53 48 40 76 -2 -13 -172 -226 35 116 -17 -50 -59 -1 -122 1 52 196 4 -92 -26 -29 94 -113
3615 -113 -125 1 21 66 34 -15 8 70 25 16 32 28 -5 -75 -25 39 27 -54 -48 -85 -101 -53 -94 -45 28 112 125 -98 -70 -85 23 73 69 30 -32
3177 -32 107 60 -138 12 -70 -16 101 -35 -69 36 -65 644 237 73 -124 -45 0 7 -17 -2 101 25 132 94 108 96 -18 -85 43
$$ packed form
6007iK5Kj5p7M5J8kl6J18j30P5L4J23k87J36L3k5n4o0J9J19j28K03j14jj4n8Q2P7L1j86R1
5606C5qk87K03K5k3N3J21j91j2K2j3J72r6j6J46j29k6m4K53j05q9Q7j05rM0j18P8P1l4m8L7
5218a0K1K7j09r0J5J73j02Q0n5KQ5qr9J54J4n6j03k1M3P1p8L8P8j07K2M1k4Q7j01j66J76o5
4817f7K28o1k33P9O7o0J62k09kJ16L1q0qoO7J1j34J62l9j07Q7N6J9r3J25j46l7R3k27J16N9
4429c1L0R1O0r9n2j88J39P7n3J50l4j6p4r0M6K0N9r2rRn0M4J9l5K15j23P4k43J32Q3J0j37
4028f8N2LL0M3p6L8J7M7O1r4nqL6p8j1j59n4K61Q1j33l3rN8j21J23N1J44j92r6O6lJ23k07
3615a13j2J26K0M5l2m9K3O2m5rJ6ml3p0N0O4j2q1Ol7j6M8m1M9P3Q4J3k23K8j5J08N0ml9o2
3177c2J39m7j98J50q2N4J17j36l4J05j01P09m07j64j97P9M5Pk4J5J03p6J07l8J4j2j14o7J28
$$ plain form
2814 43 -55 -33 -17 -177 -229 19 -47 10 -120 -36 -27 44 60 -35 -126 25 11 5 -12 18 3 -31 0 -104 78 39 10 -11 -64 -110 -24 -65 -109
2401 -109 4 -103 -30 4 3 -75 -12 62 85 51 -68 -151 -123 -4 -76 55 -4 -34 -21 -21 154 6 84 92 93 -48 5 -10 -56 51 -109 -107
2000 -107 15 48 -23 30 71 -195 -24 -2 -8 -18 28 72 15 37 60 73 -40 -3 -77 -36 88 5 140 98 23 -47 -56 136 -21 -10 -127
1612 -127 72 171 47 -128 55 7 58 -91 -224 103 -36 -57 24 40 -78 -58 -4 -1 61 -1 -109 5 83 126 72 8 -106 -40 -12
1249 -12 27 -17 -65 -73 -80 -29 30 43 87 -27 -130 -50 39 50 8 -28 -16 -54 101 54 118 -28 -56 -36 43 -1 -90 -40 -58 25 -58 10 -65 -87
823 -87 -90 59 -36 22 93 34 -94 -35 52 -121 -188 -75 61 19 -71 -64 23 65 -47 -28 -55 -4 -47 15 49 65 19 -24 -14 -58 60 -18 9
410 9 83 54 43 -148 -137 79 99 208 -27 -79 -115 1 107 -92 -3 -87 45 15 135 -66 -56 -112 -22 8 39 98 35 84 -66 -3 -14
22 -14 74 -36 -125 46 99 -6 -46 32 -81 -21 20 -29 23 -54 -91 -171 55 26 -48 80 22 -115 -67 -43 52 23 50 129 29 48 74 65 -38
$$ packed form
2814D3r8K2J6j60n2K48o6N7j30Q4RP1J6r5r1J51j4oj7L0j5l4L1j04J82l9k9k1n3m6Q6m1m4
2401a09J13j07P3L4jp8O3P4K3l4j19q3K8J19p2J31n9l0J3%J75j48P8QJj41N3j5m6J07j60K
2000a07J22L3p1N3M1k66J71K2oj0M6M4n7K2K3J3j13L7p4M1J24q3J35m2p5p0rJ92j57J1j17
1612a27J99R9j24j75J83m8N1j49j33L27j39k1Q1J6j18K0N4LO2o2j08J14P8M3n4o4j14O6K8
1249a2L9m4m8qpN1N9J3M4j14j03Q0Q9J1m2l6J2l8J55m7O4j46k8K0P9m4q9N0j8Q3q3O8p5k2
823h7lJ49r5N8P1n9j28N9Q7j73o7J13J36m2r0PQ7M2j12J9k7N1m3O2L4J6m6m3J0m4J18p8K7
410IP4k9j1j91J1K16K0J09k35n2l6J16J06j99Q9q4J32l0J20k01J0n6R0L0L1N9o3M9j50O3j1
22a4Q8j10q9J71N3j05m0P8j13O0M1m9N2p7l7q0K26k9p4J28n8j37M8K4R5k9K7P9j00J9K6rj03
-391c8
##PAGE=	F1=3898.49
##FIRST=	23146.675690215950453,	6006.5297639999989769,	-0.66495573520660400391
##DATA TABLE=	(F2++(Y..Y)), PROFILE
$$ plain form
6007 -9 -27 -32 -33 -124 -59 -32 18 -13 34 -59 64 62 161 -138 33 85 29 -9 -95 -74 22 -92 156 -18 -38 6 -50 53 96 82 -76 4 45
5593 45 -231 -96 -90 -11 5 120 -59 -56 -21 -35 104 10 -24 100 21 4 -32 162 47 -21 97 -8 -14 -6 -116 -11 22 13 -43 -38 19 42
5193 42 -10 -146 -176 7 -76 -22 -61 8 29 13 -66 97 76 15 -122 -102 11 29 -23 -13 51 -66 -38 55 38 75 18 -162 -3 -59 184
4805 184 91 -90 -39 32 -68 57 -45 -95 9 77 1 -46 -38 29 53 -58 61 45 -94 1 61 100 -19 121 -10 -59 0 -211 -105
4442 -105 -30 -23 101 92 50 -30 -173 -35 13 -37 110 149 21 6 -39 -71 0 9 -33 -67 -86 -115 -115 -45 -45 97 -24 67 -138 -6 55 43 -43
4028 -43 -24 12 37 50 17 -9 -8 54 138 -2 7 29 45 -11 2 -151 -207 46 103 -19 -30 -29 5 -86 66 35 160 4 -79 -41 -55 70 -81
3615 -81 -97 -15 15 42 15 9 40 73 13 28 66 28 -55 -97 20 60 52 -25 -56 -111 -58 -63 -75 -22 11 104 57 -124 -34 -71 60 131 52 35 -12
3177 -12 101 69 -146 16 -63 -6 114 -34 -49 -28 -67 546 198 73 -117 -54 -17 14 -51 -40 95 53 132 119 77 46 -40 -85 28 -17
$$ packed form
6007ij8njr1O5K7N0l1M7r3J23kR9k99J71N2n6l8q6K1R6j14K48j74k0M4n6J03M3j4j58Q0M1
5593D5k76J35OP9J6J15j79LL5j4J39r4l4J24p9j7l6J94j15o8J18j05oQj10J05L3rn6NN7K3
5193D2n2j36l0J83q3N4l9O9K1j6p9J63k1o1j37K0J13J8n2J0O4j17K8R3j7L7n7j80J59n6K43
4805A84r3j81N1P1j00J25j02n0J04O8p6m7QO7K4j11J19j6j39R5O0L9j19J40j31m9N9k11J06
4442a05P5PJ24rm2q0j43J38M8n0J47L9j28j5m5l2P1Rm2l4j9k9%P0%J42j21R1k05J32O1j2q6
4028d3J9L6K5J3l3k6JO2Q4j40RK2J6n6J3j53n6K53N7j22j1JL4r1J52l1J25j56q3L8j4J25j51
3615h1j6Q2L0K7k7oL1L3o0J5L8l8q3m2J17M0qp7l1n5N3nj2N3L3R3m7j81R0l7J31P1p9j7m7
3177a2J13l2k15J62p9N7J20j48j5K1l9O13l48j25j90O3L7L1o5J1J35m2P9j3m2l1q6m5J13m5
$$ plain form
2801 -17 -57 -10 -128 -208 -18 -69 29 -67 -20 -61 27 51 -18 -170 10 20 43 -10 -32 -20 15 19 -91 74 37 7 33 -22 -134 0 -81 -114
2401 -114 -36 -116 -5 25 6 -26 -48 78 112 92 -27 -180 -131 -14 -126 57 -7 -46 -33 -44 159 25 73 128 71 -46 -33 -2 -24 62
2025 62 -134 -107 4 18 -61 30 68 -130 -69 -49 -7 -12 -12 61 1 30 93 94 -35 0 -39 -79 58 -24 93 80 12 -78 -41 99 -18 6 -100
1612 -100 82 195 27 -187 54 0 89 -85 -194 96 -24 -48 23 43 -95 -59 -6 18 21 -9 -116 -26 51 146 20 -53 -126 -94 -66
1249 -66 19 16 -38 -67 -76 -7 -39 0 85 -39 -110 -47 38 25 -4 2 -6 -85 115 58 112 -9 -67 -36 -15 30 -81 -61 -57 -2 -58 11 -61 -76 -72 35
798 35 -32 34 67 32 -108 -64 36 -96 -195 -64 50 28 -86 -73 -1 30 -33 22 -100 -57 -59 20 15 31 35 -12 -5 -71 52 -6 28 49 17 15
373 15 -157 -163 79 97 232 -42 -87 -76 10 130 -123 -4 -75 47 15 125 -75 -36 -116 -25 -58 37 85 73 69 -35 -5 -44 37 -38 -126
-16 -126 28 80 -31 -59 75 -62 -35 15 -22 60 -47 -72 -167 77 -1 -57 101 10 -86 -24 -40 54 48 75 113 26 -5 85 31 -43
$$ packed form
2801a7m0M7j18q0J90n1R8r6M7m1Q8K4o9j52J80J0K3n3k2J2L5Mj10J65l7l0K6n5j12J34q1l3
2401a14P8q0J11L0j9l2k2J26L4k0j19j53M9J17j12J83o4l9J3j1K03j34M8N5n7j17J3L1k2Q6
2025F2j96K7J11J4p9R1L8j98O1K0M2n%P3o0K9O3Jj29L5l9m0J37q2J17j3o8r0L7J40j17K4j06
1612a00J82J13j68k14K41n4Q9j74j09K90j20k4P1K0j38L6N3K4Ll0j07R0P7R5j26p3p3L2K8
1249f6Q5ln4k9rO9l2L9Q5j24p1O3Q5j3k9Oqp9K00n7N4j21n8L1K1M5j11K0MN5n6O9p2j5MJ07
798C5o7O6L3l5j40M4J00j32r9J31J14k2j14J3P2L1o3N5j22M3kP9nJ6Mm7Po6J23n8L4K1l2k
373A5j72oK42J8J35k74m5J1Q6J20k53J19p1J22l2J10k00L9q0R1l3R5M8j2mj04L0l9Q1p5q8
-16a26J54N2j11k8J34j37K7N0l7Q2j07k5r5K44p8n6J58r1r6O2j6R4oK7L8q7l1R0n4p4
-391d3
##PAGE=	F1=3804.13
##FIRST=	23146.675690215950453,	6006.5297639999989769,	-0.29627940058708190918
##DATA TABLE=	(F2++(Y..Y)), PROFILE
$$ plain form
6007 -7 -74 -70 -74 -168 -86 -30 51 44 -21 -47 93 71 136 -136 61 90 28 8 -92 -78 -15 -96 152 -49 -86 3 -38 79 81 40 -77 -47 29 -188
5581 -188 -138 -144 27 -4 104 -42 -10 14 -9 124 19 -39 53 49 24 1 115 4 -27 94 9 29 -8 -79 16 0 30 -20 -55 29 30 62
5180 62 -95 -186 -16 -74 -67 -62 66 16 2 -61 93 82 5 -161 -112 59 27 7 -10 23 -85 -65 48 49 53 38 -124 -17 -58 167 82 -36
4780 -36 -18 54 -65 2 -4 -77 6 91 29 -19 -18 27 46 -20 59 71 -87 2 74 114 -27 116 21 -21 -10 -176 -86 -13 -26 115 15 50 -59
4366 -59 -130 -19 0 -27 92 212 -42 8 19 -54 31 3 -1 -68 -107 -123 -144 -35 10 64 -50 35 -108 5 36 26 -21 -16 60 50 36 58
3966 58 -30 -41 37 100 -53 -48 2 8 -30 13 -111 -154 48 87 -9 -6 6 14 -32 122 -5 110 25 -44 -51 -65 27 -33 -60 -31 11 21 -4 27 82
3528 82 82 13 22 93 12 -98 -111 51 81 55 0 -53 -121 6 -62 -63 17 8 87 -38 -135 14 -40 98 182 33 31 -2 81 58 -149 9 -48
3114 -48 2 119 -55 -22 -92 -87 531 169 59 -83 -55 -30 54 -72 -85 65 50 103 121 46 -3 -75 -96 13 -10 -59 2 -73 -159 -46 -63
$$ packed form
6007go7Mmr4Q2N6Q1po5k6J40k2O5k72J97K9o2k0j00J4O3q1K48k01l7Q9m1J17Km1j17L0P6k17
5581a88N0oJ71l1J08j46L2K4k3J33j05n8R2mk5k3J14j11l1J21q5K0l7p1R5j6L0n0l5Q4JL2
5180F2j57r1J70n8PNJ28n0j4o3J54j1p7j66M9J71l2k0j7L3j08K0J13JMj5j62J07m1K25q5j18
4780c6J8P2j19O7op3Q3Q5o2m8JM5J9o6P9J2j58Q9P2M0j41J43r5m2J1j66R0P3j3J41j00L5j09
4366e9p1J11J9k7J19J20k54N0J1p3Q5k8mo7l9j6k1J09M5N4j14Q5j43J13L1j0m7NP6j0j4K2
3966E8q8j1P8O3j53NN0Ol8M3j24m3K02L9r6LJ2Qm6J54j27J15q5o9pj4R2o0k7K9M2J0k5L1N5
3528H2%o9RP1q1j10j3J62L0k6n5n3o8J27o8jQ0rP9j25r7J49n4J38Q4j49kl3Q3k3k07J58n7
3114d8N0J17j74L3p0NO18l62j10j42K8K5Q4j26j3J50j5N3J8p5m9p2k1J09k3m9O1p5q6J13j7
$$ plain form
2726 -63 40 1 12 -81 17 42 -5 -177 -21 19 75 3 -72 -38 47 19 -80 59 33 19 80 6 -145 19 -96 -90 -71 -112 20 54 -8 20
2326 20 -82 87 141 115 29 -150 -103 -28 -168 55 -15 -59 -40 -48 164 26 32 141 14 -37 -56 3 8 69 -145 -103 -15 -4 -74 27 56
1938 56 -64 -96 -79 1 -3 -56 39 -11 24 109 116 -24 -5 7 -118 7 -40 36 57 -3 -98 -21 54 0 12 -77 83 181 -13 -234 27 -25
1537 -25 102 -70 -154 68 7 -57 9 42 -95 -60 -6 49 -3 -15 -106 -63 24 157 -33 -97 -126 -138 -107 9 38 -6 -44 -51 28 -124 -57 68
1136 68 -42 -61 -44 26 -9 6 34 16 -106 104 56 81 5 -54 -36 -88 40 -75 -73 -54 -50 -44 9 -50 -64 -55 14 -27 18 23 28 -96 -76 4 -55
698 -55 -184 -53 29 26 -97 -69 -10 -27 -18 81 -135 -79 -63 1 -16 -12 49 0 -12 -55 40 4 40 16 -24 -5 -123 -171 57 95 240 -56 -86
285 -86 -31 13 117 -153 -17 -63 65 16 111 -64 -10 -102 -39 -113 37 76 111 23 -1 -12 -73 -3 -35 -110 -10 41 -50 -61 83 -32 -37 26
-116 26 0 72 -33 -65 -157 86 -9 -58 103 -8 -43 11 -25 48 48 98 80 24 -51 78 -13 -46
$$ packed form
2726f3J03l9J1r3R8K5m7j72J56M0N6p2p5L4Q5k8r9J39k6j4O1p4j51J64j15OJ9m1J32L4o2K8
2326B0j02J69N4k6q6j79M7P5j40K23p0m4J9qK12j38OJ09j27n1j9N9NO1k14M2Q8J1p0J01K9
1938E6j20l2J7Q0mn3R5n0L5Q5Pj40J9J2j25J25m7P6K1o0r5P7P5n4J2q9J60R8j94k21K61n2
1537b5J27j72q4K22o1o4O6L3j37L5N4N5n2j2r1M3Q7J33j90o4k9j2L1J16K9m4l8pP9j52O7J25
1136F8j10j9J7P0l5J5K8j8j22K10m8K5p6n9J8n2J28j15KJ9MON3n9j4RO9m1M5NNj24K0Q0n9
698e5j29J31Q2lj23K8N9j7RR9k16N6J6O4j7MO1m9j2m3R5l6L6k4m0J9j18m8K28L8J45k96l0
285h6N5M4J04k70J36m6J28m9R5j75N4r2O3p4J50L9L5q8k4j1o1P0l2p5J00N1r1j1J44j15nO3
-116B6k6P2j05l2r2K43r5m9J61j11l5N4l6P3%N0j8n6p5J29r1l3
-391d6
##PAGE=	F1=3709.78
##FIRST=	23146.675690215950453,	6006.5297639999989769,	0.065805517137050628662
##DATA TABLE=	(F2++(Y..Y)), PROFILE
$$ plain form
6007 3 -104 -82 -101 -189 -103 -18 76 104 -86 -30 89 69 99 -111 96 75 26 26 -86 -82 -41 -87 110 -65 -116 -5 -21 88 51 8 -63 -97
5606 -97 -9 -138 -172 -182 47 -23 84 -23 41 36 1 152 26 -64 8 71 23 22 65 -32 -23 66 0 74 7 -30 29 -24 39 5 -56 43 -1 127
5180 127 -22 -167 -27 -62 -110 -49 107 -3 -2 -59 76 100 7 -168 -117 88 27 27 -3 -2 -79 -77 10 26 24 36 -80 -37 -55 120 70 6
4780 6 7 70 -40 -45 16 -49 8 77 32 35 8 23 26 -5 61 93 -68 3 95 114 -45 96 53 29 -3 -114 -41 2 -13 127 -44 48 -72 -72
4354 -72 -1 -18 -3 66 254 -90 10 63 0 54 12 31 -65 -120 -134 -144 -22 59 37 -57 5 -72 9 3 25 -10 11 124 47 31 95 -35 -41
3941 -41 43 44 -87 -96 -38 -27 -45 20 -67 -90 37 77 13 18 33 26 26 146 -54 54 57 -5 -50 -49 -18 3 -29 -35 14 4 -23 31 111 86 15 5 106
3477 106 -16 -115 -109 59 92 40 12 -33 -119 72 -41 -54 57 12 77 -145 -134 60 2 107 203 10 22 -5 40 24 -147 -12 -36 13
3102 13 106 -91 7 -133 -101 530 151 33 -28 -40 -37 98 -75 -156 6 26 56 91 17 -39 -117 -125 0 -26 -39 20 -27 -91 -59 -33 34 59
$$ packed form
6007Cj07K2j9q8Q6Q5R4K8j90N6J19k0L0k10K07k1m9%j12MM1m6J97j75n1J11j6J09l7m3p1l4
5606i7Q8j29l4j0K29p0J07j07O4nl5J51j26r0P2O3m8jM3r7RQ9o6P4o7l7N9n3O3l4o1R9m4J28
5180A27j49j45J40l5m8O1J56j10Jn7J35K4r3j75N1K05o1%l0Jp7KQ7J6kJ2j16M3j8J75n0o4
4780FJO3j10nO1o5N7O9m5Lk7J5Ll1O6L2j61P1R2J9j59J41m3k4l2j11P3M3j5J40j71R2j20%
4354g2P1j7J5O9J88l44J00N3o3N4m2J9r6n5j4j0J22Q1k2r4O2p7Q1oK2l5K1J13p7j6O4j30o
3941d1Q4Jj31rN8J1j8O5q7k3J27M0o4NJ5p%J20k00J08Lo2m5JL1K1l2oM9j0k7N4Q0k5p1j0J01
3477A06j22r9OJ68L3n2k8m5q6J91j13j3J11m5O5k22J1J94n8J05R6j93J2k7M5j6j71J35k4M9
3102A3R3j97R8j40L2O31l79j18o1j2LJ35j73q1J62K0L0L5p4n6p8qJ25k6j3N9m7o4L2K6O7K5
$$ plain form
2701 59 51 -79 20 31 0 -150 -56 14 90 14 -91 -50 64 4 -89 40 29 48 115 19 -138 15 -95 -41 -85 -98 24 77 -37 46 -101
2313 -101 85 156 111 82 -75 -49 -45 -191 55 -20 -69 -46 -36 161 7 -28 111 -61 -26 -58 16 35 67 -138 -95 -39 -8 -48 24 49 -17
1925 -17 -105 -95 10 0 -88 15 -8 26 112 128 -8 -16 48 -136 -51 -37 -8 34 -14 -90 4 19 18 7 -68 78 146 -63 -247 -11 -64 102
1524 102 -48 -114 28 43 -80 -10 31 -76 -61 -9 78 -3 -16 -75 -88 11 157 -69 -103 -95 -153 -107 4 50 15 -6 -10 69 -186 -104 43
1136 43 -31 -3 -42 6 -33 36 68 43 -113 70 49 34 16 -18 -33 -127 24 -73 -63 -46 -93 -8 7 -39 -49 -44 -4 -35 -18 -15 35 -56 -63 -32 0
698 0 -140 -37 6 0 -100 -62 -3 -89 -12 121 -142 -60 -62 -31 -50 -66 59 11 -26 -16 31 15 47 -3 -56 -8 -61 -153 31 82 223 -63 -84
285 -84 4 16 83 -169 -37 -46 87 20 99 -36 9 -76 -60 -131 30 75 136 -37 20 -17 -85 -36 -34 -89 -57 -7 -59 -47 65 2 -26 42 13
-128 13 47 -25 -68 -140 79 0 -45 89 -17 11 31 -1 32 27 110 38 29 -72 58 -51 -41
$$ packed form
2701E9qj30R9J1l1j50R4P0P6p6j05M1J14o0r3J29j1J9O7r6j57J53j10N4m4j3J22N3j14Q3j47
2313a01J86P1m5k9j57K6Mj46K46p5m9K3J0J97j54l5J39j72L5l2P4J9L2k05M3N6L1m0P2K5o6
1925a7q8J0J05j0q8J03k3L4Q6J6j36qO4j84Q5J4K9M2m8p6R4J5jj1p5J46O8k09j84K36n3J66
1524A02j50o6J42J5j23P0M1j07J5N2Q7q1j3n9j3R9J46k26l4Qn8M6J11M6l5k1mP9k55Q2J47
1136D3p4K8l9M8l9O9L2k5j56J83k1j5j8l4j5r4J51r7J0J7m7Q5J5m6j0NM0l1J7LN0r1pL1L2
698@j40J03M3oj00L8N9q6P7J33k63Q2kL1j9j6J25m8l7J0M7j6L2n0n3M8n3r2J84N1J41k86k1
285h4Q8J2O7k52J32rJ33o7P9j35M5q5J6p1J61M5O1j73N7l7o8M9Kn5L2N0n2J2J12o3k8O8k9
-128A3L4p2m3p2K19p9m5J34j06K8K0l2L3nQ3p2rj01J30j09J0
-391d1
##PAGE=	F1=3615.43
##FIRST=	23146.675690215950453,	6006.5297639999989769,	0.27670401334762573242
##DATA TABLE=	(F2++(Y..Y)), PROFILE
$$ plain form
6007 22 -107 -68 -106 -178 -107 -11 90 145 -141 -17 57 58 57 -74 116 52 25 47 -86 -86 -47 -69 49 -55 -121 -15 0 72 13 -19 -45 -120
5606 -120 -49 -90 -179 -192 39 -41 72 -7 79 39 7 174 33 -89 -25 71 2 27 29 -49 -6 26 -43 99 39 6 16 -38 34 20 -49 52
5205 52 -44 172 49 -119 -11 -31 -131 -36 118 -26 -4 -58 53 110 9 -145 -116 96 32 26 9 -21 -45 -64 -37 -19 -3 10 -46 -51 -43
4817 -43 62 50 20 27 75 -7 -82 20 -17 12 37 2 90 35 20 10 -20 61 101 -49 -5 107 105 -65 65 72 74 15 -43 15 10 2 126 -65
4391 -65 35 -70 -13 14 -35 20 34 260 -100 14 83 68 60 28 55 -55 -121 -144 -122 -11 81 14 -55 -8 -38 3 -35 40 -9 55 179 23
3991 23 39 121 -28 -8 55 -15 -93 -117 -77 -57 -43 27 -37 -36 15 76 39 35 42 38 70 124 -96 3 76 17 -33 -16 -61 9 -16 -26 22 -11 -37 18
3540 18 109 81 6 -15 99 -44 -96 -87 49 88 15 10 3 -107 114 -6 -40 77 11 83 -236 -132 88 40 72 181 -8 13 -14 -13 -16 -135
3139 -135 -37 -24 31 73 -125 40 -136 -90 491 137 0 31 -13 -37 116 -62 -194 -28 6 8 33 -6 -52 -167 -166 -4 -45 -1 39 0
$$ packed form
6007B2j29L9l8p2P1R6J01N5k86J24P4Jjj31J90o4k7K2j33%L9k2J18j04o6J06J5P2n9l2k6p5
5606a20P1m1q9j3K31q0J13p9Q6m0l2J67j41j22O4R6o9K5Kp8M3L2o9J42o0l3J0n4P2j4o9J01
5205E2r6K16j23j68J08k0j00R5J54j44K2n4J11N7j01j54K9K12o4oj7l0k4j9K7J8J6J3n6nQ
4817d3J05j2l0PM8q2p5J02l7K9K5l5Q8n5j5j0l0Q1M0j50M4J12kj70J30PKn9n8N8nqJ24j91
4391f5J00j05N7K7m9N5J4K26l60J14O9j5ql2K7j10o6k3K2J11R2o7o9M7l0M1l8P5m9O4J24j56
3991B3J6Q2j49K0O3p0p8k4M0K0J4P0o4JN1O1l7mPmL2N4k20R9P3n9n0J7m5P0k5j0M8l3k6N5
3540A8R1k8p5k1J14j43n2RJ36L9p3npj10K21j20l4J17o6P2l19J04K20m8L2J09j89K1k7Jlj19
3139a35R8J3N5M2j98J65j76M6N81l54j37L1m4k4J53j78j32J66L4KK5l9m6j15JJ62m1M4M0l9
$$ plain form
2764 0 -22 -59 11 9 88 81 -62 35 16 -7 -109 -78 22 85 4 -84 -55 68 -16 -120 22 25 93 129 17 -112 -15 -73 18 -75 -82 0 83 -62
2338 -62 43 -99 75 144 90 104 6 10 -63 -193 57 -18 -78 -56 -14 136 -28 -92 42 -129 -17 -46 46 56 59 -119 -79 -55 6 14 27
1950 27 62 15 -91 -99 16 -3 -95 4 15 37 113 119 7 -33 67 -123 -99 -15 -30 20 -6 -49 29 -6 24 -3 -67 72 111 -103 -216 -39
1549 -39 -100 98 -20 -82 -9 69 -100 -24 9 -49 -51 -21 88 17 -8 -28 -87 14 144 -80 -70 -39 -131 -66 3 51 14 33 32 97 -202 -126
1149 -126 21 -17 43 -39 -15 -33 68 100 64 -110 21 41 -16 25 29 -23 -105 -5 -67 -29 -35 -109 47 11 -34 -30 -37 -23 -64 -62 -31 59 -12 -32
723 -32 -54 62 -68 -13 -19 -48 -90 -52 3 -135 -22 126 -114 -21 -62 -63 -85 -122 55 15 -40 26 33 28 51 -8 -70 3 -3 -110 17 48 175
310 175 -62 -82 28 28 47 -158 -56 -24 101 29 90 0 17 -45 -81 -108 16 80 138 -88 19 -17 -69 -54 -38 -68 -90 -50 -48 -19 38 30 -5
-103 -5 50 7 1 -30 -74 -115 61 13 -27 64 -5 65 31 23 8 -4 109 4 42 -66 39 -65 -27
$$ packed form
2764@k2l7P0kP9pj43R7j9k3j02L1J00O3q1q8K9J23q4j04J42LO8L6j12j29R7n8R1r3pQ2Q3j45
2338f2J05j42J74O9n4J4r8Mp3j30K50p5o0K2M2J50j64o4J34j71J12k9R2J0Lj78M0K4O1QJ3
1950B7L5m7j06qJ15j9r2R9J1K2P6Oj12m0J00j90K4Q4j5N0k6m3P8l5L0k7o4J39L9k14j13J77
1549c9o1J98j18o2P3P8j69P6L3n8kL0J09p1k5k0n9J01J30k24J0L1r2O5O9M8l7J9jO5k99P6
1149a26J47l8O0q2K4j8J01L2l6j74J31K0n7M1Mn2q2J00o2L8op4J56l6m5MpJ4m1KL1R0p1k0
723c2k2J16j30N5ok9m2L8N5j38J13J48k40R3m1jk2l7J77m0n5O6PnK3n9o2P3oj07J27L1J27
310A75k37k0J10%J9k05J02L2J25p2O1r0J7o2l6k7J24O4N8k26J07l6n2J5J6l0k2M0KK9N7ql5
-103eN5m3ol1m4m1J76m8m0R1o9P0l4qj5j2J13j05L8j08J05j04L8
-391b7
##PAGE=	F1=3521.07
##FIRST=	23146.675690215950453,	6006.5297639999989769,	0.13283503055572509766
##DATA TABLE=	(F2++(Y..Y)), PROFILE
$$ plain form
6007 45 -93 -39 -94 -142 -103 -12 94 158 -172 -10 14 49 19 -38 105 36 22 70 -87 -89 -36 -49 2 -19 -107 -24 9 33 -21 -48 -32 -101 -69
5593 -69 -57 -154 -169 3 -52 67 2 88 28 16 181 49 -99 -49 48 -28 22 15 -41 16 -10 -101 101 76 20 -16 -39 23 17 -43 43 -77 199
5180 199 101 -50 28 18 -122 -45 95 -43 -5 -51 36 94 1 -104 -103 95 42 7 26 -25 6 -26 -69 -68 -17 -26 -29 -51 -19 12 19 5 29 67
4755 67 16 -106 20 10 18 -8 -48 120 55 16 15 -51 55 89 -34 -26 97 103 -74 31 64 94 34 16 66 10 11 100 -50 8 -61 28 21 -42
4329 -42 34 6 238 -70 17 82 115 51 38 57 -40 -102 -151 -96 -4 77 -3 -61 -11 -13 -9 -66 65 -12 104 202 -18 47 132 -13 42 53 -67
3916 -67 -74 -108 -96 -80 -22 36 -28 0 -9 81 56 37 34 47 84 63 -117 -36 69 13 -5 13 -96 -16 -24 -9 27 -29 -39 -2 72 64 -17 -28 78 -53
3465 -53 -50 -48 41 70 -11 1 42 -86 122 26 -20 67 1 102 -282 -133 97 56 3 123 -14 8 -17 -63 -43 -115 -48 -4 56 28 -139 77
3064 77 -99 -52 425 123 -31 80 9 -33 92 -40 -113 25 2 -27 -35 -24 -46 -221 -195 0 -46 38 53 13 26 -56 55 -30 88 89
$$ packed form
6007D5j38N4n5m8L9R1J06O4l30J62K4L5l0n7J43o9j4M8j57kN3j3N1k1q8Q3L3K4n4k7J6o9L2
5593f9J2r7j5J72n5J19o5Q6o0j2J65j32j48N0R7p6N0pn6N7k6r1K02k5n6l6k3O2oo0Q6j20K76
5180A99r8j51P8j0j40P7J40j38L8m6Q7N8r3j05JJ98n3l5J9n1L1l2m3JN1rlk2L2L1Pj4K4L8
4755F7n1j22J26j0Qk6m0J68o5l9jo6J06L4j23QJ23Oj77J05L3L0o0j8N0n6JQ9j50N8o9Q9po3
4329d2P6k8K32l08Q7O5L3o4j3J9r7o2m9N5R2Q1q0n8N0kMn7J31p7J16R8k20O5Q5j45N5J1j20
3916f7pl4J2J6N8N8o4K8rR0k5j9lJ3L7k1j80Q1J05n6j8J8j09Q0qJ5L6n6j0L7P4qq1j1J06j31
3465e3LKQ9K9q1J2M1j28K08r6m6Q7o6J01l84J49K30m1n3J20j37K2k5m6K0p2O7M4O0k8j67K16
3064G7j76M7M77l02j54J11p1m2J25j32p3J38k3k9qJ1k2j75K6J95m6Q4J5m0J3q2J11q5J18J
$$ plain form
2689 89 -39 54 -1 -30 -75 -76 48 63 -29 -55 -50 58 -34 -157 8 23 146 116 5 -79 -62 -36 72 -48 -70 -35 74 -71 19 -76 67
2301 67 105 70 86 51 54 -77 -179 58 -7 -84 -68 0 84 -74 -144 -36 -171 -14 -35 98 76 49 -94 -55 -59 26 93 44 96 46 -53 -84
1900 -84 17 -7 -77 12 46 51 118 87 18 -58 61 -82 -117 18 -33 20 26 7 42 -28 9 -14 -57 77 86 -130 -146 -42 -115 92 10 -61 -39
1487 -39 80 -98 -26 -21 -33 -16 -40 72 39 4 21 -64 24 127 -77 -18 23 -85 -7 -1 38 -11 55 58 99 -181 -123 1 -15 71 -33 -29 -15
1074 -15 81 121 70 -98 -25 32 -59 32 71 1 -34 -34 -46 20 -23 -95 108 28 -36 -12 -32 -39 -113 -96 -23 93 8 1 -46 114 10 12 -44 -100 -67
635 -67 -37 -3 -151 -46 101 -62 7 -69 -82 -116 -165 29 8 -53 58 45 40 58 -3 -65 14 23 -52 13 -10 94 -51 -79 45 54 22 -124
235 -124 -63 -2 105 45 80 28 23 -14 -95 -59 -1 86 119 -111 -2 -10 -32 -60 -47 -41 -96 -75 -16 14 13 44 16 46 -8 -33 -40 -74 -86 43 14 -21
-216 -21 29 19 99 15 34 -16 -37 101 -11 52 -44 33 -49 -5
$$ packed form
2689H9j28R3n5k9m5jJ24J5r2k6NJ08r2j23J65J5J23l0j11q4J7K6J08j20k2L5J09j45R0r5J43
2301F7L8l5J6l5Lj31j02K37o5p7J6O8Q4j58p0J08j35J57k1J33k2k7j43L9mQ5O7m9N2n0r9l1
1900h4J01k4p0Q9L4NO7l1o9p6J19j43l5J35n1N3Oj9L5p0L7k3m3J34Rk16j6J04p3K07q2p1K2
1487c9J19j78P2Nj2J7k4J12l3l5J7q5Q8J03k04N9M1j08P8OL9m9O6LM1k80N8J24j6Q6j04MJ4
1074a5R6M0n1j68P3N7r1R1L9p0l5%j2O6m3p2K03q0o4K4k0pp4J7P3J16q5pm7J60j04Kn6n6L3
635f7L0L4j48J05J47j63O9p6j3l4m9J94k1o1J11j3nJ8o1o2P9Rp5O5k3J04j45k8J24Rl2j46
235a24O1O1J07o0L5n2nl7q1L6N8Q7L3k30J09qk2k8J3On5K1N9L0jL1k8L0n4k5pl4j2J29k9l5
-216b1N0j0Q0q4J9n0k1J38j12O3r6P7q2M4
-391e
##PAGE=	F1=3426.72
##FIRST=	23146.675690215950453,	6006.5297639999989769,	-0.041510846465826034546
##DATA TABLE=	(F2++(Y..Y)), PROFILE
$$ plain form
6007 62 -81 -10 -78 -98 -94 -20 90 147 -173 -7 -16 55 -10 -12 68 39 14 93 -80 -91 -19 -32 -8 31 -83 -25 -3 -14 -39 -75 -22 -46 -61 -48
5581 -48 -104 -114 -48 -63 59 9 68 17 27 170 72 -84 -64 15 -51 14 10 -13 40 -31 -141 87 97 16 -47 -27 19 0 -45 12 -86 216 129
5168 129 23 81 73 -91 -82 42 -44 -6 -35 34 53 -23 -62 -75 102 56 -19 43 -10 62 23 -73 -97 -7 -63 -24 -34 8 -16 -15 -21 8 49 21 -113
4729 -113 24 31 28 -38 -97 116 64 12 41 -74 39 64 -26 -54 60 112 -66 1 27 82 45 51 94 10 7 48 -23 -30 -62 41 18 -27 41 -10
4304 -10 207 -21 16 78 122 38 38 30 -20 -60 -150 -79 1 61 -9 -81 -10 0 -18 -73 89 -9 147 190 -63 37 124 0 96 31 -107 -46
3903 -46 -79 -83 -91 4 49 -37 19 -27 83 56 22 21 49 71 -14 -109 -58 37 -8 22 20 -122 -54 -47 3 18 -47 -28 -17 13 38 -49 -25 55 -33 6 -4
3440 -4 49 42 -34 -4 73 -56 100 45 -4 30 -12 122 -271 -136 94 42 -70 50 -3 8 -10 -87 -40 -95 -38 26 83 -17 -123 121 -33
3052 -33 -6 366 111 -56 105 21 -23 38 -27 33 121 9 -50 -94 -29 -30 -264 -206 16 -32 61 55 18 44 -54 86 -70 75 75 -18 65 -18
$$ packed form
6007F2j43P1o8k0MP4J10N7l20J66rP1o5kQ0k9k5P9j73j1P2j3K4L9j14N8K2j1k5l6N3k4j5J3
5581d8n6j0O6j5J22n0N9n1J0J43r8j56K0P9o6O5mk3N3p1j10K28J0q1o3K0M6j9m5N7r8L02q7
5168A29j06N8qj64RJ24q6L8k9O9J9p6l9j3J77m6p5O2n3P2l9r6k4R0n6L9j0M2k4JoK9M1k8j34
4729a13J37Plo6n9K13n2n2K9j15J13K5r0k8J14N2j78O7K6N5l7OM3q4lM1p1pl2J03k3m5O8n1
4304a0K17k28L7O2M4q4%qn0m0r0P1Q0O0p0p2P1J0j8n5J62r8J56M3k53J00Q7j24R6o5j38O1
3903d6l3mqR5M5q6N6m6J10k7l4jK8K2q5r5N1R5m5L0kj42O8PN0J5o5J9J1L0K5q7K4Q0q8L9j0
3440dN3pp6L0P7j29J56n5m9L4m2J34l93J35K30n2j12J20n3J1j8p7M7n5N7O4N7j00j06K44j54
3052c3K7L72k55j67J61q4m4O1o5O0Q8j12n9m4O5jk34N8K22m8R3ol7K6r8J40j56J45%r3Q3q3
$$ plain form
2651 -18 -64 -59 -53 87 32 -72 -17 -34 38 -43 -173 4 22 192 77 -15 -47 -100 -3 110 -19 -65 -57 57 -54 -10 -42 69 56 65 44 44
2251 44 72 -86 -154 54 4 -87 -80 0 16 -124 -171 -92 -180 -16 -34 160 96 35 -71 -33 -56 35 159 70 138 82 0 -43 17 -1 -41 32
1850 32 61 58 122 42 18 -81 41 -26 -101 50 -32 26 75 52 38 -49 -24 -33 -31 96 67 -144 -54 -21 -104 81 38 -48 -65 78 -69 -15 -56
1437 -56 -41 36 -58 32 40 20 58 -30 28 118 -72 31 72 -38 35 -13 8 -52 42 53 73 -158 -108 -20 -39 78 -23 -33 6 68 118 66 -74
1024 -74 -56 22 -80 33 94 37 46 -49 -7 65 -10 -66 151 53 -40 2 -27 -42 -170 -102 -3 126 -7 18 -11 145 65 33 -65 -131 -34 -16
623 -16 -22 -145 -73 73 -6 10 -82 -81 -134 -179 -14 -2 -73 72 60 40 67 5 -46 14 14 7 7 -77 -3 -34 -76 68 82 10 -77 -53 8 103 66 66
172 66 28 40 16 -100 -5 -13 87 86 -103 -34 2 11 -61 -55 -8 -77 -80 27 44 -5 43 34 36 -14 -39 -39 -60 -62 27 -9 -37 -5 41 99 -3 25 -35 -63
-304 -63 95 -10 49 -22 45 -16 15
$$ packed form
2651a8m6NOJ40n5j04N5j7P2q1j30J77J8J70j15r2l2n3R7J13j29m6QJ14j11M4l2J11j3Rk1%
2251D4K8j58o8K08n0r1PQ0J6j40m7P9q8J64j8J94o4o1j06L8k3R1J24q9O8n6q2m3O0j8m0P3
1850C2K9lO4q0k4r9J22o7p5J51q2N8M9k3j4q7K5rKJ27k9k11R0L3q3J85m3q6j7J43j47N4m1
1437e6J5P7r4R0Qk0L8q8N8R0j90J03M1j10P3m8K1o0R4J1K0k31N0Q8j9J17j01j0L9O2N0n2j40
1024g4J8P8j02J13O1n7Rr5M2P2p5n6K17r8r3M2k9j5j28O8R9J29j33K5k9J56q0l2r8o6R7J8
623a6oj23P2J46p9J6r2Jn3m5J65J2p1J45j2k0K7o2n1O0%p%q4P4l1m2J44J4p2q7K4O1R5l7%
172F6l8J2k4j16R5qJ00jj89O9L6Rp2OM7o9lJ07J7m9M8rKn0k5%k1kQ9l6k8L2M6N8j02K8o0k8
-304f3J58j05N9p1O7o1L1
-391A5
##PAGE=	F1=3332.36
##FIRST=	23146.675690215950453,	6006.5297639999989769,	0.15189561247825622559
##DATA TABLE=	(F2++(Y..Y)), PROFILE
$$ plain form
6007 71 -85 13 -66 -63 -82 -26 78 118 -153 0 -16 81 -30 0 30 62 -1 109 -57 -91 -5 -19 12 72 -62 -10 -37 -55 -39 -94 -3 16
5606 16 -32 -58 -49 -41 -99 -80 45 21 33 18 31 143 89 -45 -64 -9 -53 8 5 15 57 -33 -134 72 93 11 -53 -6 28 -24 -54 -32 -65 223
5180 223 138 85 125 114 -51 -130 -23 -34 -8 -14 49 7 -64 -28 -42 117 70 -49 53 20 106 70 -52 -100 22 -93 -23 -5 32 -16 -43
4792 -43 -36 -28 26 13 -106 30 47 47 -40 -122 92 55 13 75 -72 18 36 -16 -78 5 124 -43 -20 -21 52 40 55 92 15 -1 -19 -9 -70 -78 28
4354 28 14 12 49 -14 177 21 11 83 90 36 36 -12 3 0 -142 -75 7 54 2 -102 -16 0 -17 -52 104 6 179 160 -95 1 96 8 142
3941 142 5 -132 -30 -46 -38 -84 27 65 -54 30 -31 72 43 -1 16 38 44 -82 -74 -57 0 -31 42 -1 -129 -77 -72 6 -7 -65 -10 -19 -45
3528 -45 5 -76 -9 42 10 60 27 70 13 -47 -2 94 -23 71 49 -7 -18 -23 130 -221 -137 84 7 -121 -14 16 14 2 -82 -12 -86 -16 59
3114 59 100 -52 -85 171 39 24 317 101 -70 112 25 -4 -21 -53 -8 70 4 -68 -123 -17 -16 -277 -221 32 -23 50 40 21 34 -49 95
$$ packed form
6007G1j56R8p9Lj9N6J04M0k71J53j6R7j11L0L0L2o3J10j66l4Q6j4L1O0j34N2k7j8J6n5R1J9
5606A6m8k6RQn8J9J25k4J2j5J3J12n4j34j9N5m4O1lJ0M2r0j01K06K1q2o4M7L4n2l0K2l3K88
5180B23q5n3M0j1j65p9J07j1K6oO3m2p1L6j4J59m7j19J02l3Q6l6j22m8J22j15P0J8L7m8k7
4792d3PQN4j3j19J36J7%q7q2K14l7m2O2j47R0J8n2o2Q3J19j67K3jP3j2J5L7p7j6j8J0o1qJ06
4354B8j4kL7o3J91j56j0P2Pn4%m8J5lj42O7Q2M7n2j04Q6J6j7l5J56r8J73j9k55R6R5q8J34
3941A42j37j37J02j6Qm6J11L8j19Q4o1J03k9m4J7K2Oj26QJ7N7l1P3m3j28N2NP8j3n8N5rk6
3528d5N0q1O7N1l2N0l3M3n7o0M5R6j17R4k2n6j1nJ53l51Q4K21p7j28J07L0kj2q4P0p4P0P5
3114E9M1j52l3K56j32j5K93k16j71J82q7k9j7l2M5P8o6p2n5J06Jk61N6K53n5P3j0j9J3q3J44
$$ plain form
2726 95 -95 64 54 3 63 -30 -97 -57 -24 114 8 -97 15 -10 19 -34 -157 10 17 212 24 -39 -23 -112 12 128 -1 -68 -48
2363 -48 38 -16 -29 -14 80 18 71 7 -2 65 -90 -126 36 10 -86 -89 -16 -41 -171 -163 -103 -168 -17 -39 207 112 13 -51 -28 -58 26 188 94 164
1938 164 112 46 12 13 17 0 44 42 54 116 2 8 -92 23 28 -63 64 -36 24 118 66 25 -67 -62 -68 5 129 53 -149 35 3 -73 64 61
1512 61 -40 -92 64 -29 3 -88 -71 85 -66 -16 17 33 71 0 22 121 -65 64 94 -3 46 -36 -38 -85 -7 13 29 -159 -88 -49 -85 68
1111 68 -9 -25 12 32 86 57 -40 -64 12 -68 26 96 71 99 -41 43 89 6 -42 157 75 -41 12 -23 -28 -218 -75 19 149 -48 9 27
711 27 152 79 43 -77 -131 0 4 -41 -129 -87 65 39 -5 -98 -69 -130 -150 -60 -4 -102 71 64 27 79 22 -14 5 -8 55 -10 -125 -90 -17 -72
285 -72 96 96 12 -31 -25 5 107 84 43 -4 73 44 -101 38 -10 77 48 -78 -53 18 45 -64 -58 29 -56 -69 69 64 -20 35 52 35 0 -20
-141 -20 -21 -33 -50 15 -54 -73 -29 40 67 -13 0 -47 -76 96 -7 26 -7 65 18 25
$$ packed form
2726I5j90J59j0n1O0r3o7M0L3J38j06j05J12k5K9n3j23J67PJ95j88o3J6q9J24J16j29o7K0
2363d8Q6n4j3J5R4o2N3o4rO7j55l6J62k6r6lP3k5j30QO0o5J51k2K46r5r9o4K3l0Q4J62r4P0
1938A64n2o6l4JMj7M4kJ2O2j14Oj00J15Nr1J27j00O0R4n2m1r2NoP3J24p6k02J84l2p6J37l
1512F1j01n2J56r3L2r1J7J56j51N0L3J6L8p1K2R9j86J29L0r7M9q2km7P8K0J6j88P1L9l6J53
1111F8p7j6L7K0N4k9r7k4P6q0R4P0k5K8j40Q4M6q3m8J99q2j16N3l5nj90J43R4J30j97N7J8
711B7J25p3l6j20n4J31Mm5q8M2J52k6m4r3K9o1k0R0N6r8J73pl7N2n7l6J9j3O3o5j15L5P3n5
285g2J68%q4m3OL0J02k3m1m7P7k9j45J39m8Q7k9j26K5P1K7j09OQ7q5j3J38nq4N5J7j7l5k0
-141b0jj2j7O5o9j9M4O9K7q0J3m7k9J72j03L3l3P2m7P
-391B5
##PAGE=	F1=3238.01
##FIRST=	23146.675690215950453,	6006.5297639999989769,	0.13411167263984680176
##DATA TABLE=	(F2++(Y..Y)), PROFILE
$$ plain form
6007 69 -99 27 -59 -45 -68 -31 59 76 -127 12 13 120 -38 7 17 93 -23 111 -19 -86 -1 -10 37 83 -51 27 -76 -83 -30 -95 32
5618 32 61 4 -70 -10 31 -133 -106 30 36 4 35 12 96 86 3 -46 -13 -32 7 -3 26 64 -22 -73 63 63 16 -21 18 47 -40 -67 -75 -26 213
5180 213 132 123 144 127 -9 -161 -84 -23 -16 3 80 -22 -116 3 -15 131 80 -72 50 54 132 100 -25 -84 58 -113 -22 27 44 9 -50
4792 -50 -26 -66 2 1 -91 32 61 79 -14 -116 70 29 26 99 -44 0 10 -1 -88 -48 121 -10 -35 -57 21 20 29 63 16 -7 -84 -22 -98 -105 4
4354 4 19 63 59 -13 148 44 10 100 37 46 42 -43 30 61 -127 -79 15 61 31 -105 -28 -9 -6 -14 109 38 201 140 -107 -45 57 6 178 -8
3928 -8 -142 -35 -14 25 -58 40 77 -71 34 -18 46 28 -22 24 14 23 -118 -25 -34 -21 -38 53 -36 -110 -66 -85 0 -47 -80 3 -6 -90 -29 -86 13
3490 13 42 56 105 33 88 -11 -46 5 109 0 53 46 -31 -59 -30 117 -170 -142 68 -30 -141 -52 30 21 9 -63 25 -89 5 75 100 -70
3089 -70 -43 212 94 26 263 93 -69 111 31 22 -66 -128 -420 -236 -27 -89 -111 8 -10 -250 -269 32 -35 8 7 23 8 -40 78 -94
$$ packed form
6007F9j68J26q6J4k3L7R0J7k03J39JJ07j58M5J0P6j16J34j30o7Q5rM7M6j34P8j03pN3o5J27
5618C2K9n7p4O0M1j64K7J36Ol2L1k3Q4j0q3m9L3j9L9j0K9L8q6n1J36%m7l7L9K9q7k7qM9K39
5180B13q1rK1j7j36j52P7O1PJ9P7j02r4J19j8J46n1j52J22MP8l2j25n9J42j71R1M9J7l5n9
4792e0K4m0O8jr2J23K9J8r3j02J86m1lP3j43M4J0j1q7M0J69j31k5k2P8jRL4m7k3p7O2p6pJ09
4354DJ5M4mp2J61j04l4R0o3Rmq5P3L1j88M8R4M6l0j36P7J9LqJ23p1J63o1k47O2J02n1J72j86
3928hj34J07K1L9q3R8L7j48J05n2O4j8n0M6j0Rj41R3rJ3j7R1q9p4M4j9Q5m7l3Q3rq4O1n7R9
3490A3K9J4M9p2N5r9l5N1J04j09N3pp7k8K9J47k87K8K10r8j11Q9Q2rj2p2Q8j14R4P0K5j70
3089g0K7K55j18o8K37j70j62J80q0rq8o2k92J84K09o2k2J19j8k40j9L01o7M3jJ6j5m8J18j72
$$ plain form
2714 -94 59 41 30 49 -31 -116 -57 -10 110 -3 -90 31 17 12 -8 -117 18 2 195 -25 -59 -9 -100 8 130 -1 -76 -15 13 30
2338 30 -27 -4 96 5 75 2 -62 37 -91 -101 2 10 -82 -96 -34 -68 -205 -117 -75 -150 -5 -40 215 114 -19 -33 -45 -77 0 173 100
1950 100 161 122 67 64 6 45 29 40 -5 49 98 -12 -6 -86 17 67 -21 51 -44 9 136 51 12 -72 -84 -117 34 164 48 -142 109 15
1549 15 -34 42 77 -32 -120 38 2 17 -111 -107 109 -63 -56 -16 44 64 24 10 125 -52 76 87 17 34 -64 -93 -91 -76 -43 -18 -183 -64
1149 -64 -81 -133 48 4 -6 0 -10 32 45 -4 -53 8 -27 16 87 83 109 -10 88 84 32 -37 125 80 -35 18 -20 -3 -241 -22 36 157 -86
736 -86 -19 49 142 57 37 -82 -108 24 17 -44 -114 -75 80 68 -21 -110 -59 -108 -82 -88 14 -130 64 51 10 91 48 30 -5 -23 83 -35 -131
322 -131 -135 -6 -71 126 83 27 5 11 -3 119 89 15 -59 110 64 -96 67 10 56 14 -51 -43 34 60 -71 -52 60 -51 -48 98 77 -30
-78 -30 29 77 48 30 1 8 -6 -56 3 -105 -113 -28 10 22 -8 -32 -56 -74 103 -12 -10 0 77 40 17
$$ packed form
2714i4J53j8j1J9q0q5N9M7J20j13q7J21j4nk0j09J35j6J93k20l4N0r1J08J22j31p5O1K8J7
2338C0n7K3J00r1P0p3o4R9j28j0J03Qr2j4O2l4j37Q8M2p5J45l5K55j01j33j4j2l2P7J73p3
1950A00O1l9n5ln8L9j6J1m5N4M9j10Oq0J03N0q8P2r5N3J27q5l9q4j2l3J51J30j16j90K51r4
1549A5m9P6L5j09q8J58l6J5j28MK16j72PM0O0K0m0j4J15j77J28J1p0J7r8k9KJ5L3K5j65J19
1149f4j7n2J81m4j0Oj0M2J3m9m9O1l5M3P1mK6j19R8mn2o9J62m5j15N3l8J7k38K19N8J21k43
736h6O7O8R3q5k0j19k6J32po1p0L9J55j2q9q9N1m9K6oJ02j44J94j3m1Q1m3j8l5j8J06j18r6
322a31mJ29o5J97m3n6k2Oj4J22l0p4p4J69m6j60J63n7M6m2o5QP7K6j31J9J12j11LJ46k1j07
-78c0N9M8k9j8k9Pj4n0N9j08qQ5L8J2l0k4k4j8J77j15KJ0P7l7k3
-391A7
##PAGE=	F1=3143.66
##FIRST=	23146.675690215950453,	6006.5297639999989769,	-0.31355065107345581055
##DATA TABLE=	(F2++(Y..Y)), PROFILE
$$ plain form
6007 61 -105 29 -49 -41 -47 -37 39 21 -104 29 53 154 -32 14 31 111 -41 92 21 -79 -11 -3 37 59 -48 87 -101 -95 -24 -76 78
5618 78 69 33 -68 6 86 -144 -134 22 47 -5 58 -33 27 53 44 -14 0 0 13 -9 3 57 -13 20 58 15 36 34 42 71 -40 -78 -101 10 177
5180 177 107 133 129 117 27 -152 -128 -23 -36 10 113 -25 -167 46 -7 135 84 -79 27 69 139 100 -10 -73 83 -119 -20 60 46
4817 46 44 -37 0 -92 -19 -3 -74 27 71 123 25 -81 69 -4 54 98 -2 -11 -16 17 -79 -90 93 24 -45 -64 0 -3 -16 19 4 -5 -130 -59 -106
4379 -106 -127 -13 32 97 65 -17 106 45 18 112 -16 59 61 -30 62 107 -104 -78 20 71 66 -84 -41 -27 3 21 108 80 209 142 -104 -76
3978 -76 19 -5 200 -3 -131 -52 14 93 -20 46 77 -82 34 11 10 21 -29 42 -19 17 -115 12 2 -20 -25 61 -60 -68 -19 -79 -10 -92
3578 -92 -94 2 15 -119 -62 -76 36 47 79 137 10 86 -33 -35 11 120 1 48 44 -66 -79 -37 84 -141 -148 42 -53 -140 -58 31 23 7 -52
3164 -52 54 -99 16 60 79 -70 -11 225 114 5 209 92 -54 106 42 53 -94 -204 -847 -491 -64 -107 -59 40 -15 -197 -319
$$ packed form
6007F1j66J34p8QoJ0P6j8j25J33K4J01j86M6J7Q0j52J33p1j00O8QM0K2j07J35j88OP1n2J54
5618G8rl6j01P4Q0k30J0J56K5n2O3r1O0K6rn8J4%J3k2J2N4p0L3L8m3K1kQK9j11l8k3J11J67
5180A77p0K6mj2r0j79K4J05j3M6J03j38j42K13n3J42n1j63J06M2P0l9j10o3J56k02R9Q0j4
4817D6kq1L7r2P3J6p1J01M4N2r8j06J50p3N8M4j00rnL3r6j1J83o9o9j9O4lj3L5j5rj25P1m7
4379a06k1J14M5O5l2q2J23o1k7R4j28P5Kr1R2M5k11K6R8N1nj50M3J4L0J8Q7k8J29o7k46K8
3978g6R5k4K05k03j28P9O6P9j13O6L1j59J16k3jJ1n0P1o1L6j32J27j0k2nQ6j21qM9o0O9q2
3578i2kR6J3j34N7j4J12J1L2N8j27P6j19kM6J09j19M7mj10j3M2J21k25pJ90r5q7Q2Q9qj6n9
3164e2J06j53J15M4J9j49N9K36j11j09K04j17j46J60o4J1j47j10o43L56M27m3M8R9n5j82j22
$$ plain form
2826 -319 10 -71 -41 -37 24 -20 -28 45 -67 51 47 63 32 -21 -113 -54 -18 66 -4 -54 28 35 24 27 -77 16 -26 142 -62 -64 0 -78 -7 121
2401 121 -12 -85 14 -26 70 -6 -13 113 16 64 30 -114 2 -86 -83 -43 9 -76 -102 -38 -60 -213 -42 -28 -136 26 -28 176 98 -55 -16
2013 -16 -69 -114 -29 125 83 129 101 54 89 -4 69 37 26 -63 53 75 0 -21 -68 17 81 10 16 -41 -9 118 26 5 -59 -74 -165 45 184
1599 184 51 -116 155 9 0 17 88 -25 -140 3 12 19 -124 -131 99 -50 -72 -36 53 48 42 4 109 -31 67 56 35 23 -90 -138 -64
1211 -64 -130 -91 -55 -200 -37 -102 -158 27 20 17 -16 -41 -22 27 21 -37 17 24 13 76 63 93 36 109 58 65 -48 69 61 -20 26 -19 16 -234 38
773 38 46 151 -99 -52 45 126 26 19 -83 -77 32 17 -33 -102 -38 100 82 -23 -111 -62 -75 -2 -87 52 -141 61 25 0 97 84 85 -7 -26
360 -26 81 -56 -93 -119 1 -72 147 46 53 32 45 -6 128 76 -10 -113 134 69 -82 82 46 30 -5 -24 -1 47 58 -84 -38 77
-16 77 -66 -19 113 89 -32 32 114 67 62 8 28 6 -76 -10 -141 -139 -2 -37 -13 6 -54 -63 -60 113 -26 -46 5 70 49 -4
$$ packed form
2826c19L29q1L0MO1m4qP3j12J18mJ6l1n3r2N9L6Q4p0n0Q2Pj1Lj04R3m2J68k04kO4p8P1J28
2401A21j33p3R9m0R6p6pJ26r7M8l4j44J16q8LM0N2q5k6O4k2j53J71J4j08J62n4K04p8j53L9
2013a6n3m5Q5J54m2M6k8m7L5r3P3l2j1q9J16K2p5k1m7Q5O4p1On7L2J27r2k1o4j5r1K10J39
1599A84j33j67K71j46rJ7P1j13j15J43RPj43pK30j49k2L6Q9nol8J05j40R8j1k1j2j13m8P4
1211f4o6L9L6j45J63o5n6J85pll3k5J9M9on8N4Pj1O3j3L0n7P3n1Pj13J17qq1M6m5L5k50K72
773C8QJ05k50M7R7Q1j00pj02OJ09j5n0o9O4J38j8j05q8M9j3P3q5J39j93K02l6k5R7j3Jr2j9
360b6J07j37l7k6J20p3K19j01Pk1J3n1J34n2q6j03K47o5j51J64l6j6l5j9K3M8J1j42M6J15
-16G7j43M7J32k4j21O4Q2m7nn4K0k2q2O6j31KJ37l5K4J9o0rLJ73j39k0N1O5k1n3
-391d
##PAGE=	F1=3049.3
##FIRST=	23146.675690215950453,	6006.5297639999989769,	-0.40646225214004516602
##DATA TABLE=	(F2++(Y..Y)), PROFILE
$$ plain form
6007 52 -87 19 -28 -41 -21 -42 26 -42 -85 40 76 166 -10 27 53 101 -49 55 49 -74 -33 1 4 14 -40 154 -100 -98 -30 -44 113 43
5606 43 42 -46 7 112 -131 -148 23 40 -2 74 -90 -55 -4 60 13 18 26 25 -12 -49 40 -15 106 52 -37 60 87 58 91 -24 -82 -105 29 112
5180 112 56 113 83 98 50 -110 -150 -38 -67 3 128 -10 -199 104 -18 127 82 -61 -13 51 127 72 -15 -83 89 -105 -20 84 47
4817 47 66 -13 16 -101 -42 1 -61 20 75 168 63 -31 90 -33 88 72 39 -12 -48 30 -59 -110 49 55 -59 -45 -8 -16 -64 -19 -26 -4 -149
4404 -149 -101 -98 -134 -13 37 93 57 -29 48 34 37 105 -59 63 83 32 91 128 -72 -69 24 71 97 -45 -49 -46 3 39 107 115 198 152 -98 -73 -2
3966 -2 -25 198 3 -99 -63 35 145 11 45 61 -92 31 52 -24 23 -19 62 -52 24 -83 22 35 -4 -4 67 -59 -21 51 -58 -20
3590 -20 -133 -107 -6 45 -134 -86 -54 56 42 64 147 -33 61 -53 -21 7 123 -15 42 47 -91 -72 -46 37 -122 -148 4 -56 -138 -43
3215 -43 18 14 1 -63 63 -108 17 16 47 -61 2 198 95 -25 180 100 -29 94 47 76 -108 -164 -283 75 -47 -100 15 64 -26
$$ packed form
6007E2j39J06m7j3K0k1O8o8m3J25L6R0j76L7K6M8j50J04oj23M1L4LJ0n4J94k54KO8j4J57p0
5606D3jq8N3J05k43j7J71J7m2P6j64L5N1O4m7NQjl7l7Q9n5J21n4q9R7K7k9L3j15n8k3J34Q3
5180A12n6N7l0J5m8j60m0J12k9P0J25j38j89L03j22J45m5j43M8O4P6n5q7o8J72j94Q5J04l7
4817D7J9p9K9j17N9M3o2Q1N5R3j05r4J21j23J21j6l3n1l6P8q9n1J59Oj14J4L7qm8M5pK2j45
4404a49M8Ll6J21N0N6l6q6P7j4LO8j64J22K0n1N9L7k00LR3M7K6j42mLM9L6O8QQ3m6k50K5P1
3966bk3K23j95j02L6R8J10j34L4J6j53J23K1p6M7m2Q1j14P6j07J05J3l9%P1j26L8P2j09L8
3590b0j13K6J01N1j79M8L2J10j4K2Q3j80R4j14L2K8J16j38N7Nj38J9K6Q3j59k6J52o0q2R5
3215d3O1mj3o4J26j71J25jL1j08O3J96j03j20K05q0j29J23m7K9j84n6j19L58j22n3J15M9r0
$$ plain form
2851 -26 -153 -259 -25 -108 -71 -80 21 -39 -21 12 -21 34 65 99 20 -5 -89 -52 -44 -1 -2 -6 13 35 48 60 -55 -2 -63 67 -82 -52 7 -58
2426 -58 -24 99 -27 -94 11 -80 88 24 -31 128 38 36 68 -145 -29 -69 -71 -92 15 -67 -105 -23 -33 -188 40 14 -120 73 -6 105
2050 105 68 -80 3 -80 -162 -48 66 51 85 56 16 84 -14 82 18 14 -103 66 58 32 -31 -54 9 69 25 -24 -20 -16 73 12 0 -36 -38 -187
1625 -187 39 166 55 -75 166 0 23 -6 89 -21 -145 -32 4 11 -127 -129 69 -31 -62 -29 63 35 54 9 62 -8 37 10 60 30
1249 30 -104 -158 -13 -143 -113 -73 -184 -10 -99 -148 10 41 43 -19 -56 -55 5 26 -29 42 63 22 67 13 78 79 98 26 96 -57 10 23 -3
836 -3 40 -19 14 -204 81 48 130 -82 -73 22 110 11 -4 -82 -50 28 7 -18 -87 11 106 83 -14 -101 -74 -42 52 -67 91 -126 62 -4 1 89
410 89 117 136 -1 -24 51 -61 -31 -49 18 -76 154 1 80 51 61 0 122 47 -22 -145 132 60 -51 85 86 13 -12 8 52 55 51 -101
9 -101 -20 73 -86 12 116 97 -21 44 157 67 77 0 25 -2 -97 -26 -146 -139 35 -87 -27 18 -62 -65 -43 124 -34 -64 16 44 51 -28
$$ packed form
2851b6j27j06K34q3L7rJ01o0J8L3l3N5L1L4p9k5q4L7QM3jmJ9K2J3J2j15N3o1J30j49L0N9o5
2426e8L4J23j26o7J05r1J68o4n5J59r0kL2k13J16m0kk1J07q2l8Q2j0j55K28k6j34J93p9J11
2050A05l7j48Q3q3q2J14J14j5L4k9m0O8r8R6o4mj17J69qk6o3k3O3O0m4m9MMQ9o1j2l6kj49
1625a87K26J27j11j30K41j66K3k9R5j10j24J13L6Pj38kJ98j00l1L3R2k8J9m5N3p0M5k7N0l0
1249C0j34n4J45j30L0M0j11J74q9m9J58L1Ko2l7JO0K1n5P1K1m1M5n4O5JJ9p2P0j53O7J3k6
836cM3n9L3k18K85l3Q2k12RR5Q8r9j5p8L2P8k1k5o9R8R5k3r7q7K7L2R4j19J58k17J88o6NQ8
410H9K8J9j37k3P5j12L0j8O7r4K30j53P9k9J0o1J22p5o9j23K77p2j11J36Jp3k5K0M4Lmj52
9a01Q1R3j59R8J04j9j18O5J13r0J0p7K5k7r5P1j20PJ74j22O0M5q0lK2J67j58l0Q0K8Pp9
-391b8
##PAGE=	F1=2954.95
##FIRST=	23146.675690215950453,	6006.5297639999989769,	-0.03607662394642829895
##DATA TABLE=	(F2++(Y..Y)), PROFILE
$$ plain form
6007 48 -51 0 0 -35 6 -42 26 -105 -61 41 66 153 23 43 52 61 -48 8 55 -78 -66 4 -47 -30 -19 204 -80 -97 -43 -12 120 3
5606 3 25 -11 5 110 -104 -137 22 9 3 79 -132 -128 -74 46 19 27 31 38 -23 -109 21 -29 151 39 -83 72 112 57 98 -6 -73 -92 22
5193 22 33 -18 70 20 84 40 -56 -152 -58 -105 -14 107 0 -199 163 -40 114 79 -14 -65 2 97 22 -37 -115 75 -74 -19 89 53 63
4805 63 6 7 -91 -65 12 -51 19 65 195 83 17 116 -47 113 34 75 -5 -83 26 -39 -109 11 78 -88 -20 -14 -4 -90 -36 -67 -15 -150
4404 -150 -121 -85 -121 -2 18 45 37 -45 -17 20 56 72 -88 59 93 116 112 128 -35 -56 29 54 120 -4 -51 -61 -8 41 106 129 161 148 -94
3991 -94 -41 -2 -54 165 -3 -50 -63 39 166 22 36 28 -103 29 93 -45 25 8 79 -70 37 -46 2 48 10 10 72 -37 6 129
3615 129 -30 -26 -163 -117 -10 78 -139 -99 -37 70 16 20 127 -77 25 -71 -15 -7 116 -35 21 51 -88 -46 -51 -11 -76 -145 -46 -45 -147
3227 -147 -22 -4 -6 0 -90 53 -111 6 -36 18 -54 3 137 52 -45 192 108 -5 64 29 81 -113 107 2304 2197 77 -52 88
$$ packed form
6007D8r9N1%l5M1m8O8j31M4J02K5Q7j30K0RRj09N6M7j33J2P0n1J7J1K23k84j7N4L1J32j17
5606CK2l6J6J05k14l3J59j3oP6k11MN4J20k7QMPo1q6J30n0J80j12j22J55M0n5M1j04o7j9J14
5193B2J1n1Q8n0O4m4r6r6R4m7R1J21j07j99L62k03J54l5r3n1O7R5p5n9p8J90j49N5J08l6J0
4805F3n7Jr8K6P7o3P0M6J30j12o6R9j63J60p9M1q0p8J09o5p0J20O7j66O8OJ0q6N4l1N2j35
4404a50K9L6l6J19K0K7qq2K8L7L6J6j60J47L4K3mJ6j63k1Q5K5O6j24m7j0N3M9O5K3L2j3k42
3991i4N3L9n2K19j68m7j3J02J27j44J4qj31J32O4j38P0j7P1j49J07q3M8M6l8%O2j09M3J23
3615A29j59Mj37M6J07Q8k17M0O2J07n4MJ07k04J02r6N6QJ23j51N6L0j39M2nM0o5o9R9Jj02
3227a47J25J8kOr0J43j64J17m2N4p2N7J34q5r7K37q4j13O9l5N2j94K20K197j07k120j29J40
$$ plain form
2877 88 76 -41 -157 13 -54 -121 -64 -102 16 -42 -20 -4 28 10 82 128 18 3 -53 -60 -69 -67 -1 33 -2 9 66 74 -60 -33 -95 -6 -90 -30
2451 -30 16 -35 -36 65 -40 -99 -32 -131 74 52 -45 137 56 2 86 -153 -44 -40 -64 -131 32 -54 -105 0 -10 -136 104 43 -91 113
2075 113 14 34 33 -84 23 -69 -206 -50 15 22 50 4 -21 63 -19 81 -22 9 -117 79 54 66 -37 -55 -18 36 22 -57 10 -6 19
1687 19 13 -13 -15 0 -166 28 102 43 -31 142 6 37 -24 75 -18 -130 -60 -3 3 -122 -98 37 -13 -34 -2 70 32 53 25 -7 1 -2 -38 87
1261 87 54 -99 -148 36 -114 -111 -69 -134 7 -68 -107 0 67 60 0 -55 -53 -12 14 -31 78 77 36 56 -47 77 100 59 0 112 -52 -38
861 -38 -21 10 63 -20 -13 -162 92 39 94 -50 -77 -4 94 18 -26 -75 -28 18 -6 -11 -67 57 92 71 -10 -83 -85 -15 57 -46 109 -89 64
448 64 -32 5 57 131 160 1 -32 4 -50 25 47 54 -83 145 -33 96 61 53 11 96 10 -17 -150 105 46 -4 78 115 17 -11 50 93 58
34 58 47 -118 -4 49 -94 39 110 92 -1 58 192 34 67 -8 5 -29 -102 -43 -119 -115 66 -119 -25 21 -58 -57 -32 136 -26 -58 32 10
$$ packed form
2877H8j2j17j16J70o7o7N7l8J18n8K2J6L2j8P2M6j10j5n6prKO6L4l5J1N7Qj34K7o2Q9q4O0
2451c0M6n1jJ01j05n9O7r9K05k2r7J82q1n4Q4k39J09Mk4o7J63q6n1J05j0j26K40o1j34K04
2075A13r9K0jj17J07r2j37J56O5PK8m6k5Q4q2J00j03L1j26J96k5J2j03j8L7N4j4p9O7j6K5
1687A9ok6kJ5j66J94P4n9p4J73j36L1o1R9r3j12P0N7Oj25K4J35n0k1L2P2l8K1k8l2Qll6J25
1261H7l3j53m9J84j50LM2o5J41p5l9J07O7po0n5KM1K6m5J09jm1K0j03J24K3m1n9J12j64J4
861c8J7L1N3q3Pj49K54n3N5j44k7P3R8p6m4m9M7M6k4nn6J24L5k1q1p3kP0P2j03J55j98J53
448F4r6L7N2P4K9j59l3L6n4P5K2Pj37K28j78J29l5qm2Q5q6k7j33K55n9n0Q2L7r8k8O1M3l5
34E8j1j65J14N3j43J33P1j8r3N9J34j58L3p5J3l4p3N9p6MJ81j85R4M6p9JK5J68j62l2R0k2
$$ plain form
-366 10 56 -38
$$ packed form
-366A0M6r4
-391c8
##PAGE=	F1=2860.59
##FIRST=	23146.675690215950453,	6006.5297639999989769,	0.14687499403953552246
##DATA TABLE=	(F2++(Y..Y)), PROFILE
$$ plain form
6007 46 -14 -21 26 -17 30 -30 35 -150 -29 34 30 126 59 53 19 7 -46 -37 37 -92 -100 10 -96 -58 13 216 -58 -95 -49 15 96 -32 -14 15
5581 15 5 86 -70 -101 8 -35 5 75 -132 -163 -133 10 0 22 15 46 -50 -148 10 -43 147 18 -109 61 102 37 88 -2 -54 -71 -2
5193 -2 -31 -99 14 -35 78 -10 -15 -141 -66 -139 -39 45 -13 -165 196 -63 98 78 45 -115 -59 51 -33 -60 -151 48 -35 -13 66 66 38
4805 38 17 -24 -67 -87 20 -38 25 42 192 75 46 130 -44 113 1 99 4 -110 3 -28 -90 -4 89 -134 -5 -21 33 -78 -24 -102
4429 -102 -45 -142 -101 -80 -94 7 -28 -27 20 -59 -68 9 62 25 -109 54 83 172 120 116 0 -49 41 33 136 23 -47 -65 -22 37 106 114 106 115 -91
3991 -91 -5 17 -88 101 -28 0 -60 22 153 7 19 -12 -114 28 120 -49 16 47 94 -66 46 -26 -29 34 10 10 67 -19 0 194 0
3603 0 -29 -174 -126 1 108 -134 -99 -34 78 -25 -31 77 -105 -3 -81 -23 -28 105 -40 -18 54 -59 -15 -45 -53 13 -158 -102 -35 -166
3227 -166 -12 -35 -37 10 -110 37 -108 -18 -76 4 -63 -5 66 10 -40 227 108 9 15 -19 63 -108 626 6950 5803 306 32 136
$$ packed form
6007D6o0pM7m3M7o0O5j85J21O3mR6o7ol4j2n3RP4j29qJ10j06L8P1K03k74l7M6O4Q1j28J8K9
5581A5j0Q1j56l1J09m3M0P0k07l1L0J43j0K2pL1r6r8J58n3J90j29j27J70M1o5N1r0n2j7O9
5193bk9o8J13m9J13q8nj26P5p3J00Q4n8j52L61k59J61k0l3j60N6J10q4k7r1J99q3K2P9%k8
4805C8k1m1m3k0J07n8O3J7J50j17k9Q4j74J57j12R8r5j14J13l1o2Q6R3k23J29j6N4j11N4p8
4429a02N7r7M1K1j4J01l5JM7p9rP7N3l7j34J63K9Q9n2mj16m9R0qJ03j13p0j8M3N9O9QqRk06
3991i1Q6K2j05J89j29K8o0Q2J31j46J2l1j02J42R2j69O5L1M7j60J12p2lO3k4%N7q6J9J94j94
3603@k9j45M8J27J07k42L5O5J12j03oJ08j82J02p8N8nJ33j45K2P2j13M4l0qO6j71N6O7j31
3227a66J54k3kM7j20J47j45R0n8Q0o7N8P1n6n0K67j19r9Ol4Q2j71P34O324j147n497k74J04
$$ plain form
2877 136 77 -57 -224 477 -69 -95 -29 -89 10 -29 -17 2 70 -8 85 144 26 -4 -17 -85 -77 -111 -1 53 -13 -35 64 63 -84 -64 -103 -65
2476 -65 -90 -15 21 -1 -43 24 -50 -95 -96 -158 37 68 -47 131 61 -29 67 -133 -33 -12 -62 -147 51 -30 -96 15 -5 -80 130 59 -44
2088 -44 123 20 -7 7 -65 40 -43 -230 -33 -16 13 35 -40 -42 48 -17 72 -68 4 -113 77 59 83 -39 -71 -64 -8 3 -73 30 11
1700 11 -23 20 -37 -6 17 -111 26 0 8 -1 94 33 43 -30 44 -12 -101 -74 -1 4 -111 -42 12 0 0 19 68 37 33 42 -71 -5 -37 -80 104 82
1249 82 -69 -117 63 -65 -97 -43 -81 6 -19 -53 -7 94 61 30 -45 -19 -13 1 -33 110 74 44 43 -92 85 84 9 -14 106 -33 -73 -64 10
836 10 89 -18 -54 -120 72 21 48 -20 -71 -26 71 33 -41 -58 -7 13 -20 -15 -39 85 71 44 -26 -66 -86 0 14 -43 92 -46 65 -56 -1
423 -1 0 115 146 -11 -49 -38 -31 52 128 107 -93 117 -52 90 62 26 17 66 -28 0 -133 67 40 48 66 119 43 -9 93 108 60 45 -130
9 -130 2 7 -87 48 94 60 21 68 207 -25 36 -3 -7 -58 -83 -58 -76 -84 76 -125 -25 11 -50 -38 -32 148 -5 -35 45 -18 62 -29
$$ packed form
2877A36n9j34j67P01n46k6O6o0R9l9J2J9O8p8R3N9j18l0j3o8Ql4J10N4o6k2R9jj47K0l9L8
2476f5k5P5L6k2m2O7p4m5jo2J95L1j15J78p0r0R6k00J00K1n0q5J98q1o6J11k0p5K10p1j03
2088d4J67j03k7J4p2J05q3j87J97J7K9K2p5kR0o5Q9j40P2j17J90j8K4j22l2PN6J1p6J03j9
1700A1l4M3n7L1K3j28J37k6QrR5o1J0p3P4n6q9K7P3Nj15O9N4j2%J9M9l1mRj13O6l2m3J84k2
1249H2j51m8J80j28l2N4l8Q7k5l4M6J01l3l1p5K6OJ4l4J43l6l0jj35J77jp5k3J20j39m0RP4
836A0P9j07l6o6J92n1K7o8n1M5R7l8p4j7N1K0l3Nk4J24j4k7p0m0k0Q6J4n7J35j38J11j21N5
423aJJ15L1j57l8J1PQ3P6k1k00K10j69J42k8l6rM9r4K8j33K00k7QJ8N3p6n2J02J5m8j5j75
9a30J32Nr4J35M6l4l9M7J39k32O1l9mn1k5K5j8qJ60k01J00L6o1J2OJ80j53l0Q0o3Q0r1
-391b9
##PAGE=	F1=2766.24
##FIRST=	23146.675690215950453,	6006.5297639999989769,	-0.04531408846378326416
##DATA TABLE=	(F2++(Y..Y)), PROFILE
$$ plain form
6007 37 1 -32 33 10 44 -10 39 -162 5 28 -8 101 83 48 -32 -35 -48 -68 7 -107 -124 23 -126 -64 40 179 -45 -90 -37 34 58
5618 58 -49 -62 20 7 49 -33 -53 -18 -77 6 65 -87 -146 -161 -33 -28 10 -10 44 -90 -147 7 -41 111 -2 -102 28 77 4 61 -22
5230 -22 -32 -48 -30 -62 -157 -45 -66 75 -91 2 -122 -55 -159 -63 -40 -47 -117 185 -79 80 81 92 -148 -108 -2 -84 -70 -168 13 -11 -1
4842 -1 20 80 13 21 -57 -32 -105 23 -18 28 14 162 42 44 120 -32 88 -19 105 12 -112 -28 -28 -60 1 84 -183 -7 -28 81 -27
4454 -27 10 -117 -84 -136 -42 -86 -63 6 -90 -94 20 -66 -85 0 46 -21 -123 53 52 163 116 102 26 -51 59 23 148 35 -40 -60 -28 34
4053 34 105 82 48 65 -81 5 47 -121 25 -58 38 -70 -2 121 -20 1 -47 -118 24 127 -34 -11 88 108 -42 49 -29 -50 0 -1 1
3665 1 52 -21 -31 229 30 -31 -161 -131 29 128 -119 -89 -40 77 -72 -67 12 -113 -14 -71 -41 -45 98 -18 -65 51 -17 8 -23 -81 119
3277 119 -206 -157 -34 -180 -17 -66 -73 26 -100 25 -107 -55 -87 9 -93 -22 16 -5 -7 257 96 17 -40 -85 29 -93 1238 12157
$$ packed form
6007C7l6l3O5k3L4n4M9k01J67K3l6J09j8l5q0lj3k0P5j14j7J47j49O2J04J39k24m5N3P1K4
5618E8j07j3Q2j3M2q2k0L5n9Q3N9j52n9j5J28NL8k0N4j34n7J54m8J52j13j00J30M9p3N7q3
5230b2j0j6J8l2r5J12k1J41j66R3j24O7j04R6K3pp0L02k64J59JJ1k40M0J06q2J4r8J81k4J0
4842aK1O0o7Qp8K5p3J28m1M6j4J48j20KP6j52J20j07J24r3j24Q4%l2O1Q3k67J76k1J09j08
4454b7L7j27L3n2R4m4K3O9r6mJ14q6j9Q5M6o7j02J76jJ11m7j4p6p7J10l6J25j13p5k0L2O2
4053C4P1k3l4J7j46Q6M2j68J46q3R6j08O8J23j41K1m8p1J42J03j61K3R9K0j50R1p8k1N0jK
3665AN1p3j0K60j99o1j30L0J60R9k47L0M9J17j49NP9j25R9n7L0mJ43j16m7J16o8K5l1n8K00
3277A19l25M9J23j46J63m9pR9j26J25j32N2l2R6j02P1L8k1kK64j61p9n7m5J14j22J331J0919
$$ plain form
2927 12157 9674 556 121 147 75 -71 -334 950 -74 -35 9 -44 4 -7 0 27 93 -14 74 145 41 -22 9 -118 -64 -123 0
2589 0 54 -13 -81 36 30 -112 -77 -82 -99 -84 -19 16 48 -47 -7 -61 -79 -146 -147 -2 74 -41 107 47 -56 19 -85 0 -4 -62 -137 59 6 -79
2163 -79 12 -17 -42 116 64 10 91 7 -13 -5 -36 52 -20 -221 -5 -29 29 41 -73 -41 46 -10 63 -98 -6 -109 54 60 78 -38 -91 -111
1762 -111 -51 -29 -78 23 18 -45 24 -64 -8 1 -49 40 -107 -39 9 41 63 41 -17 0 -2 -62 -77 8 16 -94 30 -7 7 32 15 49 44 -3 53
1324 53 -107 -21 -52 -109 98 98 -14 -77 55 -30 -82 -4 -57 -11 29 -6 -16 113 43 46 -32 31 6 6 -24 124 76 37 31 -100 87 38 -31
911 -31 -25 81 -11 -94 -100 -7 110 -9 -90 -83 37 0 9 1 -65 -43 33 35 -46 -32 10 16 -36 -22 -4 92 54 6 -60 -58 -79 2 -51 -61 46 -10 62
448 62 -72 -23 -69 72 99 -45 -65 -56 -12 44 162 161 -107 68 -62 64 56 0 17 57 -63 12 -106 38 48 91 54 93 76 -14 118
60 118 103 59 40 -133 2 -42 -72 32 71 0 40 68 191 -86 -4 18 5 -74 -44 -64 -37 -63 64 -104 -39 -6 -41 -19 -42 150 14
$$ packed form
2927A2157k483r118m35K6p2j46k63J284j024L9M4n3M8j1PK7O6j07Q8P1j04o3L1j27N4n9J23
2589@N4o7o8J17oj42L5nj7J5O5L5L2r5M0n4j8o7jJ45P6j15J48o0j03P5j04Q5mn8p5J96n3q5
2163g9R1k9k5J58n2n4Q1q4k0Ql1Q8p2k01K16k4N8J2j14L2Q7n6P3j61R2j03J63OJ8j16n3k0
1762a11O0K2m9J01no3O9q8N6Rn0Q9j47O8M8L2K2k2n8J7ko0j5Q5Qj10J24l7J4K5j7L4nm7N6
1324E3j60Q6l1n7K07%j12o3J32q5n2P8n3M6M0l5j0J29p0Lp8O3k5%l0J48m8l9oj31J87m9o9
911c1OJ06r2q3oR3J17j19q1PJ20l7Rqo6K2P6Kq1J4M2On2J4J8R6l8m8o6Kk1Q1n3j0J07n6P2
448F2j34M9m6J41K7j44k0RM4N6J18jk68J75j30J26qn6J7M0j20P5j18J44J0M3l7L9j7r0J32
60A18j5m4j9j73J35m4l0J04L9p1M0K8J23k77Q2K2j3p9L0k0K7k6J27j68O5L3l5K2k3J92j36
$$ plain form
-329 14 -8 50 -37 63 -8
$$ packed form
-329A4k2N8q7J00p1
-391h
##PAGE=	F1=2671.89
##FIRST=	23146.675690215950453,	6006.5297639999989769,	-0.18580944836139678955
##DATA TABLE=	(F2++(Y..Y)), PROFILE
$$ plain form
6007 10 -6 -27 16 42 50 6 30 -140 33 30 -26 90 84 20 -78 -53 -52 -76 -22 -111 -126 49 -133 -57 42 102 -36 -77 -6 46 33 -44 -98 5
5581 5 6 10 5 -14 -50 -102 13 52 -14 -87 -147 -69 -46 3 -26 33 -123 -109 10 -15 74 -20 -58 -10 63 -26 26 -59 -21 -24 -43 -53 -172 -93 -65 69
5130 69 -168 0 -100 -23 -156 -79 -116 -82 -76 135 -87 53 84 107 -155 -124 -50 -124 -63 -154 -23 -14 13 -31 86 11 30 -66 3 -118 23
4742 23 7 17 -7 119 1 12 86 -15 50 -31 86 14 -81 -47 -32 -27 12 64 -211 -15 -31 114 44 51 -109 -108 -133 35 -102 -38 -2 -145
4341 -145 -131 38 -63 -65 -9 12 -53 -125 55 10 88 101 88 41 -60 71 30 148 36 -33 -52 -24 25 105 54 5 28 -60 -16 79 -141
3953 -141 -37 -76 54 -99 -11 89 -43 -5 -59 -113 10 116 -4 -53 117 115 -7 47 -46 -48 -28 -16 -3 35 -42 -61 223 59 -37 -129
3578 -129 -134 62 130 -97 -72 -39 66 -107 -76 -40 -105 -6 -35 -57 -50 103 26 -101 39 16 24 6 -96 184 -278 -199 -46 -177 -28 -91
3202 -91 -107 39 -54 22 -109 -94 -67 24 -133 -47 1 11 41 272 75 28 -86 -141 -5 -73 1687 15561 12016 707 174 127
$$ packed form
6007A0j6k1M3K6Qm4K4j70J73ln6J16oo4r8K5Jk4N4q9j5J75j82P6R9O0j38m1P1N2j3p7n4J03
5581EJMnj9l6n2J15L9o6p3o0P8K3M9k9N9j56J4J19k5Q9r4l8M8P3q9N2q5L8lj9j0j19P9K8J34
5130F9k37J68j00P7j33P7l7L4OK11k22J40L1K3k62L1P4p4O1r1J31RK7m4J17p5J9r6O9j21J41
4742B3j6J0k4J26j18J1P4j01O5q1J17p2r5L4J5NL9N2k75J96j6J45p0Pj60Jk5J68j37O4L6j43
4341a45J4J69j01kN6K1o5p2J80m5P8J3j3m7j01J31m1J18j12o9j9K8M9Q0n1m9K3q8M4R5k20
3953a41J04l9J30j53Q8J00j32L8n4n4J23J06j20m9J70kj22N4r3kK0J2J3L8p7j9K84j64r6r2
3578a29nJ96O8k27K5L3J05j73L1L6o5R9k9k2PJ53p7j27J40k3Qj8j02K80m62P9J53j31J49o3
3202i1j6J46r3P6j31J5K7R1j57Q6M8J0L0K31j97m7j14n5J36o8J760J3874l545j1309n33m7
$$ plain form
2877 127 74 -80 -428 1211 -73 35 28 9 -3 11 33 58 95 -7 62 133 58 -36 23 -140 -40 -110 -2 44 -4 -111 -9 -7 -136
2513 -136 -62 -40 -111 -72 -40 -4 100 -47 -7 -70 -51 -150 -96 -19 79 -36 64 17 -77 -31 -16 43 -29 -63 -110 50 50 -59 -2 -32 -31 77
2113 77 59 52 30 -14 4 -7 -12 61 -11 -177 21 -26 59 62 -98 -30 47 -3 61 -100 -17 -113 21 44 57 -37 -96 -140 -78 -69 -80 -12 6 -43 28
1675 28 -81 -15 -34 -7 66 -176 -78 6 2 71 35 13 -44 8 -17 -80 8 31 -66 105 -23 13 56 -13 20 45 -42 59 -111 -28 -45 -123 70
1261 70 96 54 -37 17 -26 -67 37 -75 -35 59 20 -27 107 9 28 -19 80 35 35 -3 110 96 15 28 -68 74 -17 -52 -34 45 0 -97 -131
848 -131 -39 117 6 -107 -50 8 -17 -6 16 -67 -58 -17 15 -41 -6 16 20 -54 -22 34 82 45 -32 -102 -60 -69 -9 -109 -87 -7 17 51 -72 -51
423 -51 -132 15 39 -94 -67 -41 5 17 140 193 -124 5 -72 31 51 -6 21 80 -93 10 -77 29 66 109 47 44 97 -28 108 96 52
34 52 24 -122 1 -88 -63 0 47 -70 55 58 148 -119 -39 50 48 -75 -7 -58 -16 -64 41 -67 -66 -25 -30 -13 -56 136 23 8 46 -47 49
$$ packed form
2877A27n3j54l48J639j284J08pj9j2J4K2K5L7j02O9P1p5r4N9j63J00p0J08M6m8j07J02Kj29
2513a36P4K2p1L9L2L6J04j47M0o3J9r9N4P7R8j15J00m7r4M6J5N9p2l4m7J60%j09N7l0JJ08
2113G7j8pk2m4J8j1nP3p2j66J98m7Q5Lj60O8P7n0O4j61Q3r6J34K3J3r4n9m4O2Rj1O8J8m9P1
1675B8j09O6j9K7P3k42R8Q4mO9l6k2n7N2k5o3Q8K3r7J71j28L6M3o9L3K5q7J01j70Q3j7p8J93
1261G0K6m2r1N4m3m1J04j12M0R4l9m7J34r8J9m7R9m5%l8J13j4q1J3r6J42r1l5J8P9m5r7l4
848a31R2J56j11j13N7N8k5J1K2q3RM1L2n6L5K2Mp4L2N6M8l7p7p0M2rO0j00K2Q0K4L4j23K1
423e1q1J47K4j33K7K6M6J2J23N3l17J29p7J03K0n7K7N9j73J03q7J06L7M3o2lN3j25J36j2m4
34E2k8j46J23q9K5O3M7j17J25LR0k67Q0Q9kj23O8n1M2m8J05j08JM1nJ7m3J92j13j5L8r3R6
$$ plain form
-379 49 10
$$ packed form
-379D9l9
-391A0
##PAGE=	F1=2577.53
##FIRST=	23146.675690215950453,	6006.5297639999989769,	-0.025466063991189002991
##DATA TABLE=	(F2++(Y..Y)), PROFILE
$$ plain form
6007 -35 -23 -9 -17 68 52 9 16 -94 40 36 -17 90 58 -28 -99 -44 -51 -64 -41 -94 -104 85 -117 -45 13 6 -23 -52 33 46 37 -23 -110 -16 4 -21
5556 -21 46 1 -75 -107 25 35 55 -19 -91 -87 -45 10 -23 15 -129 -54 11 26 56 -29 7 -37 71 -42 1 -93 -27 0 -33 -23 -143 -121 -38
5143 -38 61 -204 -13 -79 17 -131 -83 -152 -97 -59 72 -87 21 84 93 -134 -99 -80 -155 -41 -118 -57 -43 19 -65 86 36 48 -45 33 -124
4755 -124 24 33 -12 -15 80 -25 -32 39 2 18 -41 41 14 -20 -37 -32 0 10 34 -203 -20 -26 114 103 76 -86 -94 -131 97 -120 -24 -11 -171
4341 -171 -134 58 -49 -19 -20 -28 -70 -110 50 -28 -18 73 67 45 -69 63 44 130 38 -30 -51 -17 3 107 49 -13 21 -31 -56 107 -137 -69
3941 -69 -75 51 -130 10 73 -53 5 -41 -102 -13 101 32 -91 122 106 24 48 -56 -23 -31 -21 7 27 -64 -61 173 85 -54 -87 -127 88
3553 88 115 -74 -52 -21 45 -123 -66 -58 -89 10 19 -63 -39 116 76 -112 19 33 37 31 -101 162 -333 -222 -65 -147 -29 -103 -129 38 14
3164 14 25 -109 -113 -25 39 -163 -80 14 52 88 275 53 48 -108 -162 -24 -55 1770 15455 11620 680 168 91 72 -76 -442 1165
$$ packed form
6007c5J2J4qQ5j6m3Pj10J34mn3J07l2q6p1N5pj3K3n3j0J89k02P2N8pk9k9Q5J3ro0q7R4K0k5
5556b1O7m5p6l2J32J0K0p4p2MM2N5l3L8j44P5O5J5L0q5L6m4J08j13M3r4O6K7l3J0j20K2Q3
5143c8R9k65J91o6R6j48M8o9N5L8J31j59J08O3Rk27L5J9p5J14p7O1J4O2q4J51n0J2r3P8j57
4755a24J48Rm5lR5j05pP1l7J6n9Q2k7l4j7NL2J0K4k37J83oJ40j1k7j62ql7K28k17R6J3j60
4341a71L7J92j07L0jqm2m0J60p8J0R1ok2j14J32j9Q6r2o8k1L4K0J04n8o2L4n2k5J63k44O8
3941f9oJ26j81J40O3j26N8m6o1Q9J14o9j23K13j6q2K4j04L3qJ0K8K0r1LK34q8j39l3m0K15
3553H8K7j89K2L1O6j68N7Ql1R9Rq2K4J55m0j88J31J4Moj32K63m95J11J57q2J18p4k6J67k4
3164A4J1j34mQ8O4k02Q3R4L8L6J87k22nj56n4J38l1J825J3685l835j0940n12p7j9j48l66J607
$$ plain form
2826 1165 -61 98 16 42 -13 21 74 85 76 0 60 112 74 -34 24 -134 -21 -89 -13 27 9 -112 -58 -35 -154 -25 -2 -107 -58 -60
2451 -60 -33 131 -43 31 -72 -16 -106 -21 -2 85 -42 12 -24 -84 -62 49 76 -83 -60 -82 28 91 -42 -10 -35 -39 34 37 64 -33 -30 23 -7
2038 -7 -5 73 -11 -112 32 -10 86 92 -114 -21 40 1 68 -77 -13 -118 -7 8 36 -41 -79 -142 -81 -106 -85 -56 -19 -22 42 -76 -15 -67 4 93
1612 93 -184 -92 1 -17 41 31 55 -74 10 32 -89 -12 36 -31 168 -29 17 70 -46 -4 35 -65 66 -97 -12 -27 -126 29 81 116
1236 116 0 -33 -51 -49 67 -116 -47 64 28 -33 72 -25 -17 -3 111 54 76 19 70 125 -7 40 -9 52 -54 -56 -38 6 1 -76 -156 -76 101
823 101 26 -103 -21 -2 -21 7 25 -72 -69 -68 -15 -26 2 3 19 -71 -13 74 66 38 -61 -139 -65 -63 -29 -139 -103 -47 39 25 -46 -68 -166 -40 -14 -136
373 -136 -50 -6 21 -3 82 190 -135 -57 -81 6 52 20 34 127 -113 -6 -52 42 84 96 39 -10 87 -47 65 97 34 1 -98 10 -112
-16 -112 -63 -25 33 -121 74 45 91 -116 -56 77 101 -73 5 -42 -15 -85 17 -29 -94 -40 -14 -26 -69 105 21 13 37 -53 22 13
$$ packed form
2826A165j226J59q2K6n5L4N3J1rp6O0N2l8j08N8j58J13o8P6M0j8j21N4K3j19J29K3j05M9k
2451f0K7J64j74P4j03N6r0Q5J9Q7j27N4l6o0K2J11K7j59K3k2J10O3j33L2k5mP3LK7r7LN3l0
2038gKP8q4j01J44m2R6Ok06R3O1l9O7j45O4j05J11J5K8p7l8o3O1k5K1K9L7lO4j18O1n2P1Q9
1612I3k77R2R3j8N8j0K4j29Q4K2j21P7M8o7J99j97M6N3j16M2L9j00J31j63Q5j5r9J55N2L5
1236A16j16l3j8KJ16j83O9J11l6o1J05r7QJ4J14n7K2n7N1N5j32M7m9O1j06kJ8M4np7q0Q0J77
823A01p5j29Q2J9j9K8J8r7LJN3j1K8JJ6r0N8Q7qk8r9p8P4KL4j10L6N6Q6j4p1k2r8J26K6j22
373a36Q6M4K7k4Q5J08l25P8k4Q7M6l2J4R3k40J07m6R4M2J2n7m9R7j34J12L2o3l3r9J08j22
-16a12M9L8N8j54J95k9M6k07O0J33K4j74P8m7K7p0J02m6o5N4K6j2m3J74q4qK4r0P5r
-391A3
##PAGE=	F1=2483.18
##FIRST=	23146.675690215950453,	6006.5297639999989769,	0.031247451901435852051
##DATA TABLE=	(F2++(Y..Y)), PROFILE
$$ plain form
6007 -88 -29 10 -50 81 57 4 10 -42 24 40 6 83 8 -85 -92 -18 -38 -40 -45 -58 -69 121 -79 -31 -30 -83 -5 -11 60 28 65 1 -99 -26 8 -38
5556 -38 82 -9 -91 -97 33 15 99 26 -13 -81 -30 34 0 -5 -106 -5 9 61 54 -34 69 -37 91 -43 0 -103 -43 23 -4 -1 -91 -121 -5
5143 -5 53 -183 -34 -61 55 -96 -80 -142 -83 -60 31 -79 -7 81 71 -93 -36 -81 -184 -14 -78 -80 -75 13 -62 87 74 70 -11 47 -122 29
4742 29 50 -52 -7 49 -26 -69 -8 23 2 -55 -20 11 54 0 -24 15 -7 2 -160 -17 -17 76 125 68 -61 -39 -123 120 -134 -23 -12 -166
4341 -166 -111 61 -22 30 -28 -59 -76 -74 36 -56 -112 32 30 40 -77 26 50 94 53 -34 -55 -17 -34 108 74 -16 40 0 -89 134 -106 -67
3941 -67 -63 36 -141 56 72 -58 28 1 -89 -34 94 65 -107 95 74 41 62 -44 8 0 -14 32 34 -67 -20 95 99 -86 -51 -104 103 94
3540 94 -54 -32 9 22 -121 -50 -39 -66 27 74 -56 -13 125 115 -98 -2 31 53 41 -101 57 -347 -226 -84 -92 -13 -105 -133 18 81
3164 81 25 -99 -94 23 41 -169 -111 32 99 117 273 34 73 -106 -145 -24 -44 1469 11975 8721 491 111 52 67 -56 -362
$$ packed form
6007h8N9L9o0J31k4n3On2O6J6l4P7p5r3pP4k0knj3j1J90k00M8Jn3P8oP1l2L7o4j00P3L4m6
5556c8J20r1q2oJ30j8Q4p3l9o8N1O4l4nj01J01J4N2pq8J03j06J28j34M3j03O0O6k7Lr0l0J16
5143eN8k36J49k7J16j51J6o2N9K3R1j10P2Q8j0j64N7m5j03J70o4kNQ8p5J49j3mq1N8j69J51
4742B9K1j02M5N6p5m3O1L1k1n7L5L1M3n4k4L9k2Rj62J43%R3M9n7j29K2q4K43k54J11J1j54
4341a66N5J72q3N2n8l1j7KJ10r2n6J44kJ0j17J03K4M4m1q7k1L8j7J42l4r0N6m0q9K23k40L9
3941f7MR9j77J97J6j30Q6k7r0N5J28k9j72K02k1l3K1j06N2qj4M6Kj01M7J15Mj85L5n3K07r
3540I4j48K2M1J3j43P1J1k7R3M7j30M3J38j0k13R6L3K2j2j42J58m04J21J42qP9r2k8J51O3
3164H1n6j24NJ17J8k10N8J43O7J8J56k39L9j79l9J21k0J513J0506l254q230l80n9J5j23l06
$$ plain form
2839 -362 868 -38 140 -16 31 -19 20 101 101 40 -4 71 89 86 -19 13 -94 -18 -71 -39 5 19 -88 -96 -44 -166 17 8 -93 -50 -60
2451 -60 -56 126 -33 91 -62 13 -38 54 41 91 -57 -40 -70 -70 -68 91 84 -142 -55 -66 7 114 -38 -1 -22 -46 4 1 51 -72 -30 27 -15
2038 -15 -14 93 -4 -51 22 12 102 126 -117 -21 24 6 82 -44 13 -108 -21 -38 30 -55 -49 -118 -66 -131 -93 -86 -40 3 76 -53 -3 -81 0 108
1612 108 -140 -83 0 -25 -15 36 96 -84 2 81 -100 -53 23 6 203 -21 22 73 -63 -11 20 -67 82 -83 18 -15 -119 -10 58
1249 58 152 31 -81 -86 -33 74 -142 -39 51 18 -31 11 -50 -67 10 114 48 103 28 21 142 -19 59 47 30 -58 -48 -33 -28 1 -34 -174
848 -174 -106 60 39 -84 1 7 -11 39 28 -72 -66 -103 -37 -5 -10 -29 5 -76 1 108 49 28 -75 -165 -62 -61 -50 -142 -101 -59 56 -14 9 -66
423 -66 -162 -81 -52 -156 -24 29 33 0 16 154 -134 -96 -82 -3 59 71 52 167 -115 -23 -32 68 98 59 25 -57 42 -65 7 100 8 -17 -68
9 -68 35 -103 -62 -28 34 -126 103 37 42 -92 -48 92 135 -77 -14 -26 -25 -110 -3 -3 -108 -41 8 -44 -76 71 19 16 30 -58 -7 -1
$$ packed form
2839c62J230r06J78j56M7n0L9Q1%o1m4P5J8lj05L2j07P6n3L2M4J4j07qN2j22J83rj01M3j0
2451f0MJ82j59J24j53P5n1R2j3N0j48J7l0%KJ59pk26Q7j1P3J07j52L7k1k4N0lN0j23M2N7m2
2038a5JJ07r7m7P3j0R0K4k43R6M5j8P6j26N7j21Q7j7O8q5Oo9N2o5L8PM6M3P3j29N0p8Q1J08
1612A08k48N7Q3k5J0N1O0j80Q6P9j81M7P6j7J97k24M3N1j36N2L1q7J49j65J01l3j04J09O8
1249E8R4j21j12nN3J07k16J03R0l3m9M2o1j7P7J04o6N5p5pJ21j61P8j2j7q8J0J5NK9l5j40
848a74O8J66k1j23Q5Oj8N0j1j00Ol7O6L2nj9L4q1P7J07n9k1j03r0J03JJ1r2M1M2J15p0K3p5
423f6r6Q1K9j04J32N3Ml3J6J38k88L8J4P9O2J2j9J15k82R2rJ00L0l9l4q2R9j07P2R3r2k5n1
9f8J03j38M1L4O2j60K29o6Nj34M4J40M3k12O3j2Jq5J07%j05O7M9n2l2J47n2lJ4q8N1O
-391a
##PAGE=	F1=2388.83
##FIRST=	23146.675690215950453,	6006.5297639999989769,	-0.12065714597702026367
##DATA TABLE=	(F2++(Y..Y)), PROFILE
$$ plain form
6007 -126 -19 24 -65 79 60 4 21 -3 -7 32 23 56 -49 -134 -72 4 -16 -15 -38 -15 -39 146 -19 -12 -67 -145 7 45 61 -9 94 17 -81
5593 -81 -18 26 -35 105 -45 -99 -77 24 -1 108 34 59 -55 -11 66 32 -29 -67 28 2 71 48 -39 99 -19 105 -37 27 -77 -52
5218 -52 48 24 -8 -44 -97 19 44 -117 -58 -46 79 -62 -71 -105 -46 -64 27 -60 -18 75 61 -46 46 -60 -207 7 -50 -85 -86 -4 -23 97
4817 97 104 84 12 46 -110 35 54 -86 9 19 -5 -87 -46 41 2 -69 -83 8 119 46 -14 19 -33 -22 -107 -13 -13 17 101 25 -44 40 -105 100
4391 100 -142 -30 -4 -140 -80 34 9 63 -29 -71 -79 -29 24 -63 -161 -15 -24 24 -83 -26 41 50 81 -49 -56 -28 -76 108 118 -16 58 22
3991 22 -98 159 -51 -44 -50 20 -123 96 69 -71 47 51 -77 -39 101 82 -87 44 24 40 90 -12 32 50 0 61 46 -50 47 16 94
3603 94 -129 -32 -59 108 77 -38 -14 39 6 -109 -34 1 -31 41 108 -39 18 121 134 -68 -15 22 72 40 -94 -88 -339 -214 -95 -24
3227 -24 14 -108 -116 -15 124 16 -75 -40 63 26 -150 -134 36 132 120 259 14 86 -90 -108 -11 -36 962 6969 4813 244 35
$$ packed form
6007a26J07M3q9J44j9n6J7k4mL9rL3j05q5O2P6k0Jk3K3k4J85j65Pn5p8J52L8J6p0J03p7r8
5593h1O3M4o1J40j50n4K2J01k5J09p4K5j14M4P7l4o1l8R5k6O9k3q7J38j18J24j42O4j04K5
5218e2J00k4l2l6n3J16K5j61N9J2J25j41rl4N9j8R1q7M2R3j4j07R2j06j47K14n7l5jQ2j9J20
4817I7Pk0p2L4j56J45J9j40R5J0k4q2M1Q7l9p1j4R1J11p3o0L3n2J1q5R4%L0Q4p6o9Q4j45K05
4391A00k42J12K6j36O0J14k5N4r2m2qN0N3q7r8J46rM8j07N7O7RL1j30pK8m8J84J0j34P4l6
3991B2j20K57k10PoP0j43K19k7j40J18Mj28L8J40j9j69J31k0J6N0j02M4J8n0O1j5r6R7l1P8
3603I4k23R7k7J67l1j15K4N3l3j15P5L5l2P2O7j47N7J03J3k02N3L7N0l2j34Ok51J25J19P1
3227b4L8j22qJ01J39j08r1L5J03l7j76J6J70R6j2J39k45P2j76j8R7k5R98O007k156m569k09
$$ plain form
2889 35 12 63 -23 -252 418 -24 160 -54 -17 -14 19 102 106 -4 -23 84 70 95 -5 -5 -35 -30 -58 -72 -20 10 -53 -114 -34 -171 47 -12
2488 -12 -71 -44 -30 -58 92 -18 138 -37 28 17 110 88 89 -75 -84 -105 -32 -56 96 66 -174 -49 -63 -3 114 -44 22 0 -32 -12 -36
2100 -36 29 -77 -13 11 -31 -32 114 16 -13 -3 29 104 159 -101 -31 12 13 95 -21 57 -79 -23 -83 41 -76 -19 -76 -47 -136 -98 -85 -40 20
1687 20 118 -22 19 -76 1 109 -81 -69 4 -32 -70 54 124 -79 -7 118 -102 -93 -5 33 196 -1 23 67 -58 2 10 -57 105 -78
1312 -78 49 -11 -103 -40 29 153 48 -116 -115 -32 55 -129 -12 29 -2 -17 -52 -60 -96 19 83 22 97 18 -12 132 -16 70 78 11 -36 -33 -15
898 -15 -51 11 17 -179 -122 1 35 -59 15 32 9 68 24 -59 -40 -108 -34 16 -35 -67 -22 -63 18 124 38 17 -72 -172 -42 -58 -61 -127 -83 -44
473 -44 61 -58 81 -46 -127 -101 -74 -147 -3 50 37 23 -28 103 -111 -100 -68 -3 66 125 60 177 -96 -19 -19 93 111 14 6 -85 -19 -77
72 -77 -42 87 -14 -22 -43 72 -66 -45 -2 51 -83 139 41 18 -68 -20 93 133 -88 -49 -24 -38 -117 -27 2 -105 -24 32 -48 -76 46 29
$$ packed form
2889C5k3N1q6k29O70m42J84k14L7LL3Q3Mj10j9J07j4K5j00%l0Nk8j4N2L0o3o1Q0j37K18n9
2488a2n9K7J4k8J50j10J56j75O5j1R3k2Jj64rk1P3k4J52l0k40J25j4O0J17j58O6k2l2K0k4
2100c6O5j06O4K4m2jJ46r8k9J0L2P5N5k60P0M3JQ2j16P8j36N6o0J24j17N7n7K9q9L8J3M5O0
1687B0R8j40M1r5P7J08j90J2P3l6l8J24P0k03P2J25k20RQ8L8J63j97K4M4j25O0Qo7J62j83
1312g8J27o0r2O3O9J24j05j64JQ3Q7j84J17M1l1j5l5ql6J15O4o1P5p9l0J44j48Q6Qo7m7LJ8
898a5l6O2Oj96N7J23L4r4P4J7k3N9m4q3J9o8P4N0n1l2M5m1Q1J06q6k1q9j00J30j6lo6M4L9
473d4J05j19J39j27q1K6K7p3J44N3j3j4n1J31k14J1L2O5O9N9o5J17k73P7%J12J8r7qr1O6n8
72g7L5J29j01qk1J15j38K1M3N3j34K22r8k3q6M8J13M0k21L9K5j4p9R0K9j07Q1N6q0k8J22j7
$$ plain form
-329 29 25 28 -63 -26 -25
$$ packed form
-329B9mLr1L7J
-391b5
##PAGE=	F1=2294.47
##FIRST=	23146.675690215950453,	6006.5297639999989769,	0.0085898563265800476074
##DATA TABLE=	(F2++(Y..Y)), PROFILE
$$ plain form
6007 -134 -2 31 -58 64 54 21 41 13 -41 18 23 7 -96 -153 -55 7 3 8 -29 20 -25 153 54 12 -78 -171 2 107 34 -56 99 13 -74
5593 -74 0 54 -15 104 -93 -100 -45 -11 -10 88 10 104 -16 6 94 58 -56 -34 48 -6 56 24 -44 91 -2 98 -31 73 -23 -34 77 34
5193 34 -46 -17 -64 28 26 -43 -80 -33 83 -40 -59 -66 -6 -57 53 -32 -8 70 66 -3 118 -28 -216 24 -39 -69 -63 -26 30 115 116 80 12 33
4767 33 -86 37 48 -100 27 -22 12 -85 -69 48 6 -71 -131 3 158 76 -8 16 -59 -33 -68 -16 -23 -37 44 -39 -33 112 -76 54 -139
4379 -139 -37 8 -108 -55 -14 39 71 -17 -62 -76 8 25 -46 -164 -59 -90 0 -86 -67 25 14 109 -73 -40 -44 -103 110 164 -20 53 29 -84
3978 -84 180 12 -16 -41 8 -88 102 46 -101 44 89 -64 -19 112 76 -39 -9 -29 26 126 24 38 88 9 80 45 -31 112 -36
3615 -36 72 -169 -31 0 105 72 -23 0 51 2 -94 -18 42 14 53 113 -19 45 105 132 -31 -11 16 89 36 -72 -220 -348 -185 -90
3240 -90 37 36 -119 -85 -56 135 1 -43 22 80 -1 -115 -140 19 144 99 227 -4 77 -72 -72 5 -21 490 2672 1607 51 -25
$$ packed form
6007a34J32L3q9J22j0l3K0k8n4N9Nj6j03n7R8O2mNl7M9m5J78r9m2r0r3J73J05p3r0J55q6q7
5593g4P4N4o9J19j97pN5L4JR8p8R4j20K2Q8l6j14K2Q2n4O2l2o8J35r3J00j29J04r6j1J11m3
5193C4q0K9m7R2ko9l7M7J16j23j9pO0n1J10q5K4P8mo9J21j46j88K40o3l0OL7N6Q5Jl6o8K1
4767C3j19J23J1j48J27m9L4r7J6J17m2p7o0J34J55q2q4K4p5K6l5N2pj4Q1q3OJ45j88J30j93
4379a39J02M5j16N3M1N3L2q8m5j4Q4J7p1j18J05l1R0q6J9R2j1R5j82L3mn9K13N4j84P3k4j13
3978h4K64j68k8k5M9r6J90n6j47J45M5j53M5J31l6j15L0k0N5J00j02J4N0p9P1l5p6J43j48
3615c6J08k41J38L1J05l3r5K3N1m9r6P6O0k8L9O0j32O4O0K7j63K0K7P3n3j08j48j28J63R5
3240i0J27jj55L4K9J91j34m4O5N8q1j14k5J59J25m5J28k31Q1j49%P7k6N11K182j065j556p6
$$ plain form
2889 -25 -25 61 14 -217 -117 -47 161 -80 -79 3 25 79 105 -44 -50 87 58 99 -7 -23 18 -50 -48 -93 -46 -21 -25 -106 -11 -165 49 -50 -37
2476 -37 -30 16 -37 57 0 144 -8 25 36 131 111 73 -84 -116 -116 17 -41 71 31 -163 -51 -65 -3 95 -49 50 26 9 -24 -59 19 -60
2075 -60 10 -16 -48 -50 122 45 -3 -30 20 96 185 -64 -46 20 19 93 -20 99 -40 -19 -113 63 -91 -4 -28 -41 -123 -93 -60 -16 16 142
1675 142 3 48 -60 15 102 -45 -60 8 -41 -94 76 134 -70 -4 126 -86 -111 -40 39 148 13 20 58 -43 18 10 -52 124 -76 61
1299 61 -8 -77 -57 -2 127 38 -135 -131 -57 15 -79 19 4 -24 5 -99 -59 -94 20 21 -9 57 -3 -12 94 -4 58 69 -7 -10 -13 8 -55 33 61
861 61 -166 -122 -58 9 -39 16 65 34 77 16 -32 6 -86 -10 32 -50 -91 -55 -41 34 113 34 15 -56 -156 -5 -46 -60 -104 -61 -17 46 -86 148
435 148 -18 -76 -97 -84 -118 0 55 33 45 -42 56 -71 -72 -49 0 61 161 48 154 -62 18 -9 107 126 -23 -12 -93 -77 -76 -67 52 -23
34 -23 -8 -32 109 -24 -10 36 79 -16 169 60 25 -53 14 83 95 -95 -69 -41 -53 -91 -55 -8 -86 11 54 -26 -67 34 48 40 32 -63 -30 -44
$$ packed form
2889b5%Q6m7k31J00P0K08k41JQ2K2N4K6j49oJ37k9M1j06j6M1o8Km5M7K5mq1R5j54K14r9J3
2476c7PM6n3R4n7J44j52L3J1R5k0l8j57l2%J33n8J12m0j94J12j4O2R8j44R9k4j7l3l5P8p9
2075f0P0k6l2kJ72p7m8k7N0P6Q9k49J8O6jP4j13J19j39K1r4J76j54Q7k4j3q2L0L3M4L2J26
1675A42j39M5j08P5Q7j47j5O8m9n3J70N8k04O6J30k12k5P1P9J09j35PL8j01O1qo2J76k00J37
1299F1o9o9K0N5J29q9j73MP4P2r4R8j5k8K9j04M0l5J14Jl0O6o0rJ06r8O2J1p6llK1o3Q8K8
861F1k27M4O4O7m8N5M9l1M3o1m8L8r2P6M2q2m1L6J4P5P9p9j9p1j00J51m1j4m4M3M4O3j32K34
435A48j66n8k1J3l4J18N5k2J2q7R8j27jK3M9O1J00j13J06k16Q0k7J16J9j49J1q1J6JRJ19p5
34b3J5k4J41j33J4M6M3r5J85j09l5p8O7O9J2j90K6K8j2l8L6M7p8R7M3q0m1J01J4qqr5L3j4
-391d4
##PAGE=	F1=2200.12
##FIRST=	23146.675690215950453,	6006.5297639999989769,	0.36168679594993591309
##DATA TABLE=	(F2++(Y..Y)), PROFILE
$$ plain form
6007 -112 1 35 -39 41 32 52 46 7 -65 7 7 -45 -120 -134 -45 -15 16 33 -21 41 -25 144 123 34 -66 -167 -22 155 -7 -92 73 -12
5606 -12 -84 11 80 17 78 -137 -88 -1 -71 -12 52 -31 112 21 24 106 68 -81 -15 61 -17 33 -16 -40 58 -2 76 -21 119 38 10 107 22 -92
5180 -92 -13 -43 26 -1 10 -88 -20 67 -30 -44 -40 24 -44 81 -2 15 68 70 28 151 -2 -195 39 -39 -36 -20 -45 68 128 112 62 -4 10 -50
4755 -50 32 41 -95 40 -77 5 -75 -81 39 2 -54 -155 -1 167 76 -9 16 -81 -29 -56 -29 -48 -68 -21 -102 -21 150 -42 2 -119 -37
4366 -37 23 -82 -42 -64 57 61 8 -39 -64 23 41 -8 -139 -89 -146 -21 -79 -72 10 -6 114 -97 0 -59 -104 120 196 -25 21 14 -64 183
3966 183 70 4 -29 0 -55 69 -1 -140 16 104 -46 18 111 45 13 -43 -66 8 153 48 18 88 1 78 19 -30 143 -52 39 -187
3590 -187 -43 49 88 72 -3 3 43 10 -79 1 63 63 64 96 2 57 83 113 3 10 20 102 39 -33 -296 -372 -135 -71 77 39 -136 -54 -88 121
3164 121 -11 -16 62 70 -33 -79 -130 -8 131 63 184 -17 46 -61 -51 18 0 202 317 -24 -35 -55 -57 65 45 -300 -597 -81 148
$$ packed form
6007a12J13L4p4Q0rK0ol9p2P2%n2p5j4Q9L0L1J7n4O2o6J69k1q9j00j01J45J77j62q5J65q5
5606a2p2R5O9o3O1k15M9Q7p0N9O4q3J43r1LQ2l8j49O6P6p8N0m9k4R8o0P8r7J40q1k8R7q5j14
5180i2P9l0O9k7J1r8O8Q7r7j4MO4o8J25q3J7N3Km2J23j53j93K34p8LJ6k5J13O0j6n0o6J4o0
4755e0Q2Rj36J35j17Q2q0oJ20l7n6j01J54J68r1q5K5r7N2k7K7j9k0M7q1Q1J71j92M4j21Q2
4366c7O0j05M0k2J21Mn3m7k5Q7J8m9j31N0n7J25n8PQ2j6J20k11R7n9m5K24P6k21M6pp8K47
3966A83j13o6l3K9n5J24p0j39J56Q8j50O4R3o6l2n6k3P4J45j05l0P0q7P7n9m9J73j95R1k26
3590a87J44R2L9j6p5OM0l3q9Q0O2%JL2r4N5K6L0j10PJ0Q2o3p2k63p6K37O4J48l8j75Q2l4K09
3164A21j32nP8Qj03m6n1J22J39o8J21k01O3j07J0O9j8K02J15l41j1k0kJ22k0l45k97N16K29
$$ plain form
2801 148 -83 -118 30 39 44 102 -62 -73 73 52 93 -28 -34 50 -70 -38 -83 -65 -73 -13 -74 16 -142 25 -80 5 1 57 -12 44 15 103 11
2388 11 6 16 114 103 48 -79 -131 -100 62 -36 36 -2 -121 -68 -62 -2 68 -42 71 50 67 -38 -53 24 -36 33 -47 -58 -59 99 65 -7 -42
1975 -42 -22 77 200 -16 -62 48 18 68 -38 123 -10 -22 -121 76 -85 -5 15 -49 -98 -76 -30 20 -8 130 19 73 -45 37 101 -49
1599 -49 -54 7 -42 -74 91 126 -66 17 99 -56 -98 -65 22 69 8 15 55 -36 14 22 -61 129 -70 53 7 -49 -63 -34 89 -2 -140 -137 -105
1186 -105 -33 -19 40 -18 -34 32 -113 -54 -71 13 -49 -31 1 -19 21 48 3 22 25 -35 -4 12 22 -38 56 85 -136 -111 -100 -32 -32 5 98 53 61
748 61 9 2 53 -53 22 37 -39 -88 -83 -23 48 74 39 26 -34 -112 37 -25 -49 -76 -47 3 14 -80 185 7 -22 -71 -77 -82 -16 50 18 44 -30 27
297 27 -25 -31 -39 8 41 172 24 118 -28 79 4 107 138 -42 -20 -81 -107 -59 -67 3 -14 13 -33 130 -1 32 65 107 40 177 90 55 -39
-116 -39 44 65 38 -85 -51 -68 -71 -35 -88 -29 -56 54 68 14 -54 23 62 51 35 -59 -28 -51
$$ packed form
2801A48k31l5J48RNN8j64j1J46k1M1j21oQ4j20L2m5J8qO0o1R0j58J67j05Q5mN6o9N6k9Q8r2
2388A1nJ0R8j1n5j27n2L1J62r8P2l8j19N3OO0P0j10J13k1J7j05j5P7o0O9q0j1jJ58l4p2l5
1975d2K0R9J23k16m6J10l0N0j06J61j33j2r9J97j61Q0K0o4m9K2M6N0k8J38j11N4j18Q2O4j50
1599d9nO1m9l2J65L5j92Q3Q2j55m2L3Q7M7o1PM0r1N0Qq3J90j99J23m6n6j4K9J23r1j38LL2
1186a05P2J4N9n8j6O6j45N9j7Q4o2J8L2k0M0K7m5J9Lo0L1J6J0o0R4K9k21K5J1O8%L7R3m5Q
748F1n2pN1j06P5J5p6m9NO0P1K6l5j3o0p8J49o2k4k7K9N0J1r4K65j78k9m9onO6O6l2K6p4N7
297B7n2oqM7L3J31j48R4j46J07p5J03L1j80K2o1k6M8qP0j7K7m6J63j31L3L3M2o7J37q7l5r4
-116c9Q3K1k7j23L4j7lL6n3N9k7J10J4n4o8P7L9j1j6r4L1k3
-391e1
##PAGE=	F1=2105.76
##FIRST=	23146.675690215950453,	6006.5297639999989769,	0.48919114470481872559
##DATA TABLE=	(F2++(Y..Y)), PROFILE
$$ plain form
6007 -74 -13 41 -21 13 0 81 20 -12 -72 15 -7 -81 -117 -82 -35 -56 20 64 -17 52 -26 126 166 45 -49 -139 -48 173 -45 -102 32 -49 -102
5593 -102 1 89 55 32 -162 -54 42 -145 -13 16 -77 88 42 43 96 59 -96 -6 69 -25 26 -56 -18 24 -25 50 -3 143 86 65 127
5205 127 1 -121 -22 -46 20 -30 31 -78 -10 38 -29 -28 -24 41 -39 84 17 39 68 52 51 130 10 -136 60 -41 0 18 -60 71 121 103
4805 103 42 -22 -21 -10 24 36 -80 44 -134 -33 -64 -85 17 -8 -17 -148 -3 157 49 -14 24 -103 -14 -64 -51 -80 -71 -75 -141 -1 142
4416 142 -9 -40 -83 -32 36 -63 -40 -97 56 41 40 -12 -37 12 62 32 -108 -98 -175 -26 -56 -38 1 -13 83 -112 53 -67 -82 137 200
4028 200 -24 -17 -20 -49 160 106 20 -7 -4 -33 14 -63 -171 -29 97 -32 53 84 2 44 -46 -70 -4 159 53 -26 45 -21 57 -28 -54 129
3628 129 -44 5 -171 -58 64 50 65 24 -5 20 24 -66 23 61 97 68 73 26 47 61 78 30 36 31 115 51 15 -307 -381 -68 -47 84 21
3215 21 -144 -37 -102 97 -13 -9 56 38 -55 -45 -107 -37 96 26 151 -11 7 -64 -43 29 22 94 -268 -307 -45 -62 -72 70 66 -388 -638
$$ packed form
6007g4O1N4o2L4j3Q1o1l2o0Q7k2p4l6L5M7k1P6M4q1O9p8J52M0j21r4r0R1K21k18n7J34q1n3
5593a02J03Q8l4k3j94J08R6j87J32K9r3J65m6JN3l7j55R0P5r4N1q2L8M2m9P5n3J46n7k1O2
5205A27j26j22R9k4O6n0O1j09O8M8o7JMO5q0J23o7K2K9j6jP9j20j46J96j01M1J8p8J31N0j8
4805A03o1o4JJ1L4J2j16J24j78J01l1k1J02k5rj31J45J60j08o3L8j27Q9n0J3k9Rmo6J40J43
4416A42j51l1m3N1O8r9K3n7J53j5jn2k5M9N0l0j40J0p7J49l0J8L9j4R6j95J65j20j5K19O3
4028B00k24Plk9K09n4q6k7Lk9M7p7j08J42J26j29Q5L1q2M2r0k4O6J63j06p9P1o6P8q5k6J83
3628A29j73M9j76J13J22j4J5m1k9K5Mr0Q9L8L6k9Nm7K1J4J7m8OnQ4o4l6l22p4L13K1J31o3
3215B1j65J07o5J99j10MO5j8r3J0o2P0J33p0J25j62J8p1K1P2pP2l62l9K62j7j0J42mm54k50
$$ plain form
2826 -638 -6 127 -61 -115 57 49 10 98 -45 -78 49 47 71 -55 -31 61 -85 -30 -40 -74 -124 -14 -23 46 -99 -14 -82 52 52 70 -9
2438 -9 59 29 35 9 -22 -26 68 74 22 -63 -121 -63 84 -39 16 -23 -76 -100 -55 -3 48 -19 82 69 124 -54 -24 27 -18 55 -71 -56 -56 41 63
2000 63 -9 -32 -88 43 203 28 -72 86 4 24 -63 126 -2 -39 -109 65 -52 -19 43 -61 -69 -52 -16 52 -34 82 24 88 -33 54
1625 54 116 -77 -43 -3 -24 -21 91 102 -63 49 42 -23 -66 -72 -9 -17 -14 17 68 -41 -19 34 -75 114 -56 36 35 -32 -58 -58 53 -60 -129 -134
1199 -134 -156 -74 19 39 -41 -21 55 -94 -49 -45 8 -101 -37 -42 -24 70 10 0 -22 -35 -68 -26 40 15 -6 71 90 -100 -100 -113 -81 -44 -15 119
773 119 57 29 8 37 78 -25 51 29 -4 -58 -101 -23 54 14 54 40 -13 -45 74 -2 -34 -45 -44 3 -19 -38 182 20 26 -31 -49 -49 -48 39 -3
335 -3 15 -9 14 14 3 -48 25 15 163 11 89 -7 134 22 94 137 -41 -13 -49 -100 -31 -50 -38 -3 26 -37 125 -3 64 67 121 61 156 120
-91 120 89 -10 59 45 -16 -57 -5 -85 -89 33 -118 -49 -17 91 72 51 -43 -3 60 51 35 -52 -34 -49
$$ packed form
2826f38O32J33j88n4J72ql9Q8j43l3J27kK4j26K4R2j46N5j0l4n0J10rO9j45Q5o8J34%J8p9
2438iO8l0Ok6l1mR4On2q5n8N8J47j23N5l9n3k4M5N2N1o7J01j3N5j78L0N1m5P3j26J5%R7K2
2000F3p2k3n6J31J60j75j00J58q2K0q7J89j28l7p0J74j17L3O2j04qJ7L6O8q6J16n8O4j21Q7
1625E4O2j93L4M0k1LJ12J1j65J12po5m3oO3qLL1N1j09K2N3j09J89j70R2jo7k6%J11j13o9n
1199a34k2Q2R3K0q0K0P6j49M5MN3j09O4nJ8R4o0j0k2j3l3M2O6k5k1P7J9j90%j3L2L7K9J34
773A19o2k8k1K9M1j03P6k2l3n4m3P8P7m0M0j4n3l2J19p6l2j1JM7k2j9K20j62On7j8%JQ7m2
335cJ8k4K3%j1n1P3j0J48j52P8r6J41j12P2M3j78K8l6n1O9j9J2L5K9o3J62j28O7LN4o0R5l6
-91A20l1r9O9j4o1m1N2q0mJ22j51O9L2J08j9k1r4M0O3rj6q7J8j5
-391d9
##PAGE=	F1=2011.41
##FIRST=	23146.675690215950453,	6006.5297639999989769,	0.36943298578262329102
##DATA TABLE=	(F2++(Y..Y)), PROFILE
$$ plain form
6007 -39 -41 46 -14 -16 -26 95 -31 -35 -60 47 -10 -84 -94 -20 -17 -92 21 100 -15 60 -16 104 172 43 -45 -94 -58 151 -64 -82 3 -83 -108
5593 -108 -26 77 96 -16 -154 2 66 -211 -22 -7 -121 47 37 63 66 37 -92 0 74 -24 43 -78 23 2 -57 27 21 132 108 102
5218 102 125 -9 -118 -35 -68 17 -44 29 -56 -11 7 -30 -17 -8 47 -49 53 16 51 66 9 70 67 12 -48 90 -43 20 31 -70 38 90
4817 90 96 31 -26 -62 22 18 32 -67 37 -180 -86 -48 -88 -4 -17 27 -115 0 140 14 -18 42 -127 0 -82 -75 -103 -58 -104 -146 24 96
4416 96 14 -70 -36 -26 43 -49 -43 -105 39 20 65 7 -1 -13 72 54 -86 -93 -171 -5 -15 9 -10 -21 21 -111 98 -69 -54 153 172 -19 -36
4003 -36 -65 -42 107 109 36 26 -6 -18 -38 -122 -179 -74 81 -32 69 32 -37 39 -24 -37 -8 140 44 -87 -19 -53 23 -75 -88 78 -34
3615 -34 -21 -126 -66 34 -10 44 51 -32 -12 38 -52 38 41 103 58 58 51 24 43 29 37 43 41 130 63 59 -284 -374 -3 -31 63 -8 -131 -38 -93 72
3164 72 -7 -24 9 0 -57 -11 -75 -55 45 1 146 18 -27 -85 -39 41 37 63 -4 -26 -46 -63 -61 69 78 -252 297 337 103 -22 -76 77 44
$$ packed form
6007c9kQ7o0kj0J21j26mk5J07n7p4j0P4Lp5J13P9j15P5p6J20O8j29q8m9L6K09k15j8Q5q6k5
5593a08Q2J03J9j12j38J56O4k77J89J5j14J68j0K6Lk9j29R2P4r8O7j21J01k1n9Q4oJ11k4o
5218A02K3j34j09Q3l3Q5o1P3q5M5J8l7J3RN5r6J02l7L5J5n7O1ln5o0J38j33O3J1j01J08N2
4817I0Oo5n7l6Q4mJ4r9J04k17R4L8m0Q4j3M4j42J15J40j26l2O0j69J27q2Pk8M5m6m2J70P2
4416I6q2q4L4J0O9r2Oo2J44j9M5n8qj2Q5j8j40pp8J66j0K4j9j1M2j32K09j67J5K07J9j91j7
4003c6k9K3J49Kp3j0l2j2k0q4n7J05J55j13J01l7o9P6o3j3K9J48r6j31O8l4P6r8j3J66j12
3615c4J3j05O0J00m4N4Pq3K0N0r0R0LO2m5%pk7J9j4QOkQ9o7ml43r0L71k8R4p1j23R3n5J65
3164G2p9j7L3rn7M6o4K0J00m4J45j28m5n8M6Q0mK6o7k2k0j7KJ30Rl30N49M0k34j25n4J53l3
$$ plain form
2751 44 -21 92 5 -58 30 40 30 -75 -15 64 -94 -27 16 -71 -153 -20 31 75 -39 -49 -50 95 103 49 -42 89 38 -25 -14 -54 -70 9 46
2338 46 3 -38 -82 -24 79 -47 24 -21 -57 -136 -49 -5 40 13 85 82 160 -62 12 8 -7 77 -81 -44 -42 -36 34 -1 -7 -150 -4 198 61 -68
1912 -68 118 -17 -22 -81 119 -16 -72 -85 29 -4 -36 44 -56 -39 -30 -26 64 -39 24 23 89 -24 59 145 -106 -23 -30 12 40 75 65 -56 71
1499 71 -22 -1 -36 -56 -43 -86 -35 33 94 -51 -70 36 -76 85 -40 29 60 -33 -41 -69 23 -108 -104 -126 -185 -90 26 22 -57 16 71 -54 -43
1086 -43 -31 15 -107 -31 -58 -26 109 -14 -19 -55 -90 -95 -62 60 -16 25 72 84 -72 -95 -93 -124 -75 -38 120 45 -1 9 65 66 -10 69 14 37
660 37 -13 -108 -43 44 -50 78 45 0 24 95 16 -17 -11 -50 -18 -42 20 144 12 66 8 -6 -21 -82 24 -34 -26 8 9 36 27 -68 50 -5 141
222 141 22 71 -3 158 40 72 118 -25 3 -5 -62 -2 -32 -60 -6 21 -34 90 -16 76 41 105 41 117 140 107 32 58 28 -52 -21 36 -73
-191 -73 -98 90 -138 -65 27 112 64 66 -40 -53 43 42 30 -43 -55 -43
$$ packed form
2751D4o5J13q7o3Q8J0j0j05O0P9j58O7M3q7q2J33N1M4j14j0jJ45Qn4r1J31n1o3J1m0j6P9L7
2338D6m3m1m4N8J03j26P1m5l6p9Q7M4M5k7P2lP8k22P4mj5Q4j58L7KOP0l5oj43J46K02j37j29
1912f8J86j35nn9K00j35n6j3J14l3l2Q0j00J7RMR0j03O3jO6j13Q3Q6k51Q3pM2K8L5j0j21J27
1499G1r3K1l5k0J3m3N1O8O1j45j9J06j12J61j25O9L1r3qk8R2j31Mk2n9R5J16mp9P3N5j25J1
1086d3J2M6j22P6k7L2J35j23nl6l5nL3J22p6M1M7J2j56k3Kl1M9L7J58p5m6J0N6Jp6P9n5K3
660C7n0r5O5Q7r4J28l3m5K4P1p9l3Ol9L2k4O2J24j32N4n8j4j5o1J06n8QL4JK7rr5J18n5J46
222A41j19M9p4J61j18L2M6j43K8qn7O0l0k8N4K7n5J24j06R2l5O4o4P6K3l3p5K6l0q0L1N7j09
-191g3k5J88k28P3R2Q5m8Kj06j3R6jj2p3j2J2
-391d3
##PAGE=	F1=1917.06
##FIRST=	23146.675690215950453,	6006.5297639999989769,	0.19561411440372467041
##DATA TABLE=	(F2++(Y..Y)), PROFILE
$$ plain form
6007 -13 -63 41 -17 -48 -32 92 -83 -50 -31 96 0 -58 -60 23 12 -104 24 135 -9 66 5 80 147 35 -57 -39 -46 101 -59 -50 6
5618 6 -102 -93 -57 54 131 -53 -112 63 52 -246 -38 -10 -158 -1 6 77 23 15 -72 4 74 -8 70 -78 73 -12 -79 4 35 87 104 105 95
5205 95 3 -90 -49 -89 17 -34 24 -39 -27 -17 -33 -17 8 44 -70 6 -3 46 62 -43 88 -2 14 42 128 -45 18 14 -73 -13 43 87 27 -20
4780 -20 -105 37 19 18 -59 20 -206 -127 -21 -86 -14 -13 65 -68 12 124 -6 -25 61 -144 5 -102 -93 -105 -40 -109 -119 48 31 27 -88 7
4379 7 -26 38 -31 -44 -94 13 -4 69 14 34 -39 66 40 -78 -80 -143 33 38 38 -29 -36 -49 -96 112 -68 -30 156 113 -17 -23 -107 -38 38 79
3953 79 52 64 -7 0 -77 -165 -161 -101 68 -55 61 -30 -59 6 4 24 -8 108 29 -146 -76 -78 -10 -95 -109 18 -36 -36 -74 -63 -28 -83 9 62 -72
3515 -72 -49 45 -37 35 14 79 33 56 74 1 27 -24 18 16 41 143 69 84 -272 -402 27 -33 24 -39 -97 -51 -66 42 -2 -53 -56 -27 -34 22
3089 22 -38 -59 -11 -3 170 63 -54 -121 -34 52 39 17 353 202 -80 -73 -28 60 92 284 2481 1002 81 17 -27 87 18 -53 77
$$ packed form
6007a3n0J04n8l1J6J24j75L3J9J27r6n8kQ3j1j16J28J11j44P5o1P5O7j12r2J8pJ47j60RN6
5618Fj08RL6J11P7j84n9J75j1k98K08K8j48J57PP1n4qq7P6P0q2P8j48J51q5o7Q3L1N2J7Jj0
5205I5r2r3M1m0J06n1N8o3J2J0j6J6K5L6j14P6rM9J6j05J31r0J6K8Q6j73O3mq7O0N6M4o0m7
4780b0q5J42j8jp7P9k26P9J06o5P2JP8j33Q0J12j30j9Q6k05J49j07Rj2O5o9j0J67j7mj15R5
4379Gl3O4o9j3n0J07j7P3n5K0p3J05k6j18ko3J76N%o7pj3m7K08j80L8J86m3j30oq4O9P6M1
3953G9k7J2p1Pp7q8MO0J69j23J16r1k9O5kK0l2J16p9j75P0kO8q5j4J27n4%l8J1L5n5R2N3j34
3515g2K3R4q2P2k1O5m6K3J8p3K6n1M2kK5J02p4J5l56j30M29o0N7o3n8M6j5J08m4n1lK9pN6
3089B2o0k1M8QJ73j07j17o7Q7Q6j3k2L36j51k82PM5Q8L2J92K197j479r21o4m4J14o9p1J30
$$ plain form
2726 77 69 -16 21 32 -22 -89 6 75 -101 -34 57 -56 -147 -25 70 98 26 -66 4 126 134 7 -98 112 40 -57 -48 -82 -99 -45 29 -6 -10 -22
2301 -22 0 51 -55 58 2 -72 -160 -48 2 44 44 78 82 163 -53 35 -38 0 93 -78 -30 -22 -105 -13 8 22 -177 -54 188 74 -45 141
1900 141 -36 -53 -79 108 -41 -117 -57 -19 36 -50 17 -24 -13 -19 -50 51 -12 -16 25 80 -21 58 168 -119 -2 -74 53 84 56 17 -38
1512 -38 72 -69 2 -24 -23 -68 -120 -34 64 121 -54 -108 26 -55 54 -27 39 62 -44 -17 -67 -2 -126 -66 -113 -179 -72 15 0 -61 61
1124 61 74 -6 -32 -34 35 -64 -19 -48 -36 119 -31 -47 -64 -118 -100 -83 62 -60 41 61 79 -69 -97 -53 -151 -112 -53 97 23 -20 5 83
723 83 25 -2 80 -1 63 30 -108 -75 14 -107 106 31 0 70 96 24 7 23 -55 -50 -46 70 84 -19 95 34 40 2 -104 8 -76 -57 15
310 15 2 44 51 -78 76 -13 108 46 50 -11 141 52 46 87 -1 17 38 -6 15 -23 -64 -29 1 -18 29 -12 73 0 49 0 81 143 103 71 49
-128 49 20 -62 6 42 -32 -91 117 -139 -75 67 117 43 59 -43 -111 21 40 21 -37 -82 -37
$$ packed form
2726G7qq5L7J1n4o7R5O9j76O7R1j13r1J22R5K8p2r2P0J22Qj27j05K10p2r7Rl4j7N4P4l5mj2
2301b2K2N1j06J13n6p4q8J12N0M2%L4MQ1k16Q8p3L8R3j71M8Qq3R2K1J4j99J23K42j14j19J86
1900A41j77j7k6J87j49p6O0L8N5q6O7m1J1ol1J01o3mM1N5j01P9J10k87J17p2J27L1k8l9n5
1512c8J10j41P1k6Jm5n2Q6R8N7j75n4J34q1J09q1O6K3j06K7n0O5j24O0m7o6J07Q7j5o1J22
1124F1J3q0k6kO9r9M5k9J2J55j50j6j7n4J8J7J45j22J01K0J8j48k8M4r8L9N9J50p4m3K5P8
723H3n8k7Q2q1O4l3j38L3Q9j21K13p5l1P0K6p2j7J6p8NMJ16J4j03J14o1Ol8j06J12q4J9P2
310A5j3M2Pj29J54q9J21o2Mo1J52q9oM1q8J8K1m4K1l8m1L5L0j9M7m1Q5p3M9m9Q1O2m0l2k2
-128D9k9q2O8L6p4n9K08k56O4J42N0p4J6j02o8J32J9j9n8m5M5
-391c7
##PAGE=	F1=1822.7
##FIRST=	23146.675690215950453,	6006.5297639999989769,	0.12294942140579223633
##DATA TABLE=	(F2++(Y..Y)), PROFILE
$$ plain form
6007 2 -70 19 -18 -81 -14 77 -112 -53 8 145 12 -18 -23 26 46 -82 32 154 0 65 22 49 111 31 -76 16 -22 45 -34 -24 34 -103
5606 -103 -61 -71 34 153 -70 -50 103 1 -236 -58 6 -184 -50 -42 79 -23 3 -45 0 68 23 88 -67 110 -32 -84 -23 21
5255 21 21 80 74 46 36 -58 -59 -82 19 -4 29 -38 -50 -30 -33 -26 21 29 -85 -23 -30 28 55 -82 104 -47 24 101 162 -52 -2 -15 -67 -60 -3 73
4805 73 16 -19 -134 35 25 -6 -49 -3 -215 -136 10 -76 -11 6 82 -25 27 108 -1 -35 67 -142 -2 -122 -93 -89 -26 -98 -75 58
4429 58 -27 33 -93 35 -30 13 -9 -35 -76 -12 -35 48 10 61 -52 46 -6 -82 -66 -107 70 93 32 -54 -56 -101 -77 88 -62 -16 143 38
4028 38 -25 16 -131 -35 -29 27 62 92 -8 25 -111 -188 -124 -101 63 -94 42 -82 -63 -33 23 95 -8 86 12 -182 -105 -91 -35 -75 -107
3640 -107 -24 -48 -37 -38 -54 -93 -152 -31 47 -114 -90 40 -22 11 -11 34 0 62 92 0 14 -69 -22 -41 30 142 61 85 -284 -486 8 -50
3240 -50 -17 -63 -55 -64 -34 4 -13 -76 -111 -30 1 51 4 -49 -59 13 209 105 -84 -158 -30 56 37 -68 593 238 -137 -96 13 47 117 1165
$$ packed form
6007Bp2Q9l7o3O7R1j89N9O1J37j33l0nM9K0j28J14J22j54O5m3K7O2q0j07R2l8O7p9J0N8j37
5606a03M2j0J05J19k23K0J53j02k37J78O4j90J34QJ21j02K6m8M5O8m5O5j55J77j42n2O1M4
5255B1%N9ok8j0r4jk3J01k3L3o7j2K0lPM7Qj14O2pN8K7j37J86j51P1P7O1k14N0j3n2PN7P6
4805G3n7l5j15J69j0l1m3M6k12P9J46q6O5J7P6j07N2Q1j09l4J02k09J40j20K9MO3p2K3J33
4429E8q5O0j26J28o5M3k2k6m1O4k3Q3l8N1j13R8n2p6J6m1J77K3o1q6km5K4J65j50M6J59j05
4028C8o3M1j47R6ON6L5L0j00L3j36p7O4K3J64j57J36j24J9L0N6P2j03R4p4j94P7J4N6m0l2
3640a07Q3k4J1jj6l9n9J21P8j61K4J30o2L3k2M5l4O2L0r2J4q3M7j9P1J12q1K4l69k02M94n8
3240e0L3m6QrL0L8j7o3l5Q1L1N0m7n3j0P2J96j04j89p4J28Q6j9j05O61l55l75M1J09L4P0J048
$$ plain form
2839 1165 5450 1809 63 44 5 83 -21 -81 53 118 38 23 29 -68 -104 18 100 -105 -49 61 -29 -111 -29 80 109 80 -58 65
2488 65 139 138 -36 -146 119 36 -53 -73 -98 -111 -86 22 -8 18 40 -1 14 -59 100 40 -102 -156 -44 21 54 60 62 66 133 -27 34 -91 7
2075 7 95 -70 -17 -2 -135 -65 10 42 -160 -84 172 68 -8 162 -36 -54 -56 95 -63 -157 -32 -62 53 -56 -31 25 6 -23 -69 19
1700 19 35 -28 30 65 -25 60 164 -121 9 -128 74 91 45 -29 -11 54 -80 -7 -34 13 -81 -118 -11 103 133 -45 -110 11 -16 33
1324 33 -15 63 34 -43 0 -60 -21 -107 -26 -99 -145 -26 11 -7 -48 88 65 33 -16 -52 59 2 -9 -24 -55 104 -47 -75 -52 -114 -79 -70 46
911 46 -95 39 44 76 -91 -100 -8 -157 -141 -52 56 1 -23 -9 92 -20 7 81 -10 58 60 -105 -108 -32 -142 130 3 -11 76 80 21 41 61
498 61 -52 -72 -39 93 23 -64 110 34 71 20 -103 2 -118 -61 16 -8 45 91 -64 88 -8 68 56 12 -17 95 55 18 62 28 18
110 18 70 48 16 -26 -64 -56 -18 7 -45 21 69 -35 -35 -32 65 130 84 85 42 25 -52 18 13 15 -67 112 -119 -80 88 116 4 45 -43 -148 9
$$ packed form
2839A165M285l641j746j9l9P8j04o0J34O5q0j5Or7l6J22Q2k05N6J10r0q2Q2J09K9k9j38J23
2488F5P4jj74j10K65q3q9k0k5j3K5J08l0K6K2m1J5p3J59o0j42n4J12O5L3OKMO7j60O1j25R8
2075GQ8j65N3J5j33P0P5L2k02P6K56j04p6J70j98j8kJ51j58r4J25l0J15j09K5N6j9k9m6Q8
1700A9J6o3N8L5r0Q5J04k85J30j37K02J7m6p4J8O5j34P3k7M7r4l7J07J14L0j78o5J21k7M9
1324C3m8P8k9p7M3o0L9q6Q1p3m6J19L7j8m1J36k3l2m9l6J11n7j1j5l1J59j51k8K3o2L5RJ16
911D6j41J34NL2j67rR2j49J6Q9J08n5k4J4J01j12K7P4r1O8Kj65lP6j10K72j27j4Q7Mn9K0K0
498F1j13k0L3J32p0q7J74p6L7n1j23J05j20N7P7k4N3M6j55J52r6P6j2m4k9J12m0l7M4l4j0
110A8N2k2l2m2l8QL8K5n2O6M8j04%LR7O5m6Jm3j7p7P0nKq2J79k31L9J68K8j12M1q8j05J57
$$ plain form
-329 9 59 14 -39 -102 -32
$$ packed form
-329IN0m5n3o3P0
-391c2
##PAGE=	F1=1728.35
##FIRST=	23146.675690215950453,	6006.5297639999989769,	0.20154026150703430176
##DATA TABLE=	(F2++(Y..Y)), PROFILE
$$ plain form
6007 13 -62 -14 -6 -110 18 58 -114 -49 46 172 11 11 12 -10 70 -39 44 150 15 52 18 5 82 35 -85 58 -2 6 0 -16 64 -89
5606 -89 -29 -59 25 151 -68 8 106 -63 -184 -75 30 -190 -96 -96 62 -63 8 -22 -17 57 55 85 -61 115 -58 -84 -54 -22 -42 44 23
5218 23 -2 76 -37 -64 -38 17 25 48 -52 -69 -37 -26 -34 23 4 -84 -11 -46 2 47 -92 115 -51 44 103 177 -61 -29 -31 -48 -87 -36 53 -8
4792 -8 -40 -135 20 30 -38 -33 -29 -211 -112 33 -57 0 35 78 0 40 90 28 -45 52 -116 -19 -138 -64 -63 -17 -82 -27 51 -58 36 -80 38
4379 38 -33 -25 17 -15 -62 -32 -68 11 1 78 -52 22 -65 -94 -51 -77 88 139 4 -69 -70 -119 -61 42 -44 -5 126 -30 -41 64 -128 -33
3978 -33 -81 -29 54 99 -11 46 -148 -190 -77 -71 66 -131 26 -110 -57 -59 24 148 -7 85 0 -185 -105 -94 -49 -22 -88 -35 -58 -22 -32
3590 -32 -44 -132 -193 -68 7 -139 -122 19 -13 -26 -32 -11 -25 65 105 27 5 -93 -69 -109 13 117 39 65 -277 -530 -41 -63 -47 -76 -19 -66
3190 -66 -7 -39 -44 -82 -133 -5 37 66 50 -29 -86 46 246 125 -118 -174 -31 50 43 -157 805 219 -176 -123 50 38 150 2062 8029
$$ packed form
6007A3p5M8Qj04J28M0j72O5R5J26j61%Jk2Q0j09Q3J06j35L7l4j3P7m7j20J43o0Qoj6Q0j53
5606h9O0l0Q4J26k19P6R8j69j21J09J05k20R4%J58j25P1l0NP4kL0j46J76j73k6L0L2k0Q6k1
5218B3k5P8j13k7K6N5QK3j00j7L2J1qN7j9q8P3l5M8M5j39K07j66R5N9P4k38L2kj7l9N1Q9o1
4792hl2r5J55J0o8NMj82R9J45r0N7L5M3p8M0N0o2p3R7j68R7j19P4JM6o5N5P8j09R4j16J18
4379C8p1QM2l2m7L0l6P9j0P7j30P4q7k9M3k6J65N1j35p3jm9N8J03q6L9J31j56j1J05j92R5
3978c3m8N2Q3M5j10N7j94m2J13OJ37j97J57j36N3kQ3J24j55R2q5j85Q0J1M5K7o6N3k3L6j0
3590c2j2q8o1J25P5j46J7J41l2j3oK1j4R0M0p8k2r8K4m0J22J04p8K6l42k53M89k2J6k9N7m7
3190f6N9l2nl8n1J28M2K9j6p9n7J32K00j21k43n6J43Q1pk00R62n86l95N3J73j2J12J912N967
$$ plain form
2826 8029 2398 50 55 10 66 -57 -92 23 132 92 25 33 -92 -128 14 133 -103 -66 29 3 -66 -31 58 107 103 -32 111 133 121
2463 121 -63 -159 115 23 -21 -77 -98 -106 -112 13 -7 45 78 -20 -22 -56 128 79 -119 -122 -22 46 61 58 42 34 82 7 12 -123 14 77 -64 -8
2038 -8 13 -114 -106 -1 46 -118 -80 148 49 25 183 -14 -32 -24 72 -73 -175 -9 -83 45 -53 -81 72 19 -40 -73 -19 74 -21 38 48
1650 48 -37 68 125 -123 9 -179 65 64 52 -63 17 30 -54 -19 -54 40 -83 -96 16 134 119 -26 -77 6 25 25 -3 86 -15 -9 -1 -52
1249 -52 -25 -60 3 -93 -97 26 24 1 -22 84 42 56 0 -76 72 56 -3 -2 -73 80 -61 -94 -32 -82 -39 -21 24 -99 24 20 71 -125 -94
836 -94 24 -139 -150 -33 12 -13 -13 -31 97 -47 24 69 -8 26 77 -104 -133 -87 -148 141 -23 -27 45 57 12 77 99 -36 -75 -35 89 -24
435 -24 -102 109 11 80 26 -79 17 -147 -41 19 -18 44 149 -30 77 4 26 27 -42 -10 45 56 -7 51 56 6 83 87 5 -35 -74 -63 -22 30
9 30 -117 77 76 -48 -119 -31 74 110 61 66 47 40 -30 16 -26 43 -42 86 -78 -74 84 115 -50 37 -31 -143 11 97 8 -49 -107 -25
$$ packed form
2826H029n631k348Nm5N6j23l5J15J09m0o7Qj25l6J42J19k36L7R5k6o9L5Q9M9mj35J43K2j2
2463A21j84r6K74r2m4n6k1qoJ25k0N2L3r8kl4J84m9j98lJ00O8J5lj6qM8p5Nj35J37O3j41N6
2038hK1j27QJ05M7j64L8K28r9k4J58j97j8QR6j45j02J66p4J28r8k8J53n3n9l3N4R3r5N9J0
1650D8q5J05N7k48J32j88K44jj2j15Q0J3q4L5l5R4j23j3J12J18j5j45n1Q3J9%k8Q9j01OQn1
1249e2K7l5O3r6mJ23kk3k3J06m2J4n6p6J48j6n9Jp1J53j41l3O2n0M3J8M5j23J23mN1j96L1
836i4J18j63j1J17M5k5%j8J28j44P1M5p7L4N1j81k9M6o1K89j64mP2J2m5O5K2j35l9M0J24j13
435b4p8K11r8O9n4j05R6j64J06O0l7O2J05j79J07p3K2Jo9L2N5J1o3N8Nn0P7Mq2m0l9J1M1N2
9C0j47J94jj24p1Q8J05L6m9Nj9pp0M6m2O9q5J28j64MJ58L1j65Q7o8j12J54Q6q9n7n8Q2
-391b5
##PAGE=	F1=1633.99
##FIRST=	23146.675690215950453,	6006.5297639999989769,	0.21819332242012023926
##DATA TABLE=	(F2++(Y..Y)), PROFILE
$$ plain form
6007 21 -46 -46 22 -128 50 32 -102 -43 69 159 -7 14 39 -66 70 1 56 125 31 29 -10 -45 69 41 -73 72 5 -5 40 -20 74
5618 74 -62 -14 -28 22 124 -60 42 79 -112 -113 -85 48 -167 -131 -140 19 -91 25 -8 -47 37 69 67 -71 84 -79 -91 -79 -78 -88 5
5230 5 -28 -35 115 -27 -61 27 8 40 71 -68 -71 -45 -8 -27 19 -26 -69 43 -42 -24 43 -74 112 -23 69 48 160 -70 -45 -20 -18 -90 -54
4817 -54 36 -40 -81 -104 2 33 -64 -9 -50 -196 -75 28 -36 12 60 62 1 47 68 65 -51 19 -72 -37 -139 -1 -44 -10 -72 9 34 -53 44
4404 44 -50 19 -31 -67 46 14 -52 -44 -92 -26 -8 90 -45 -4 -112 -102 -32 -52 81 170 -15 -64 -71 -102 -46 1 -9 3 119 -71 -57 102
4003 102 -103 -37 -113 -68 22 78 -15 53 -186 -173 -24 -20 75 -149 22 -116 -54 -60 7 170 -2 103 -5 -161 -92 -94 -53 40 -67 -18
3628 -18 -57 5 -51 -39 -137 -192 -93 -38 -139 -128 -13 -15 -61 -47 -42 -32 53 112 80 1 -93 -100 -163 3 73 8 33 -206 -424 -84 -56 -57 -73 0
3202 0 -57 7 -76 -88 -68 -115 41 59 65 92 -8 -91 83 270 115 -152 -155 -35 43 68 -202 1008 247 -168 -143 79 39 179 2567
$$ packed form
6007B1o7%O8j50J78j8j34N9J12R0j66K1K5j05J36o9N5O9r4kl9l5J14k8j14J45o7j0M5o0R4
5618G4j36M8j4N0J02j84J02L7j91jK8J33k15L6rJ59j10J16l3l9Q4L2kj38J55j63j2J2Jj0R3
5230El3pJ50j42l4Q8j9L2L1j39lK6L7j9M6m5m3J12q5J8O7j17J86j35R2k1J12k30K5K5Kp2L6
4817e4R0p6m1k3J06L1r7N5m1j46J21J03o4M8M8Ko1M6K1lj16P0r1L5j02J38m3L4o2Q1K5q7R7
4404D4r4O9n0l6J13l2o6Qm8O6J8R8j35M1j08J0P0k0J33Q9j85m9pl1N6M7j0J2J16j90J4J59
4003A02k05O6p6M5R0N6r3O8k39J3J49MR5k24J71j38O2oO7J63j72J05j08j56O9kM1R3j07M9
3628a8l9O2n6J2r8n5R9N5j01J1J15km6J4NJ0Q5N9l2p9r4po3J66P0o5K5k39k18L40K8jj6P3
3202@n7O4q3j2K0m7J56J8OK7j00q3J74J87j55k67lJ20P8K5k70J210p61m15K5K22m0J40K388
$$ plain form
2839 2567 8979 2449 41 55 -6 39 -77 -79 -1 113 132 20 37 -85 -152 -4 163 -91 -85 -18 34 -32 -31 19 93 87 2 130 107
2476 107 99 -72 -129 111 5 19 -64 -81 -89 -124 -1 -4 66 76 -42 -50 -42 125 105 -104 -67 22 60 59 43 29 -1 32 35 -18 -112 21 45 -67
2050 -67 0 23 -54 -122 -20 35 -83 -44 121 24 38 192 18 -5 -1 35 -71 -158 12 -81 21 -43 -112 100 26 -61 -66 -51 81 -11 42
1662 42 25 -50 74 65 -126 8 -211 30 23 72 -70 43 12 -7 -22 -69 45 -78 -72 25 146 85 -3 -35 14 53 23 9 96 -70 55
1274 55 -31 -45 -7 1 11 -98 -51 58 46 17 7 53 8 53 11 -98 65 73 -1 9 -76 60 -69 -98 -22 -40 1 42 11 -65 9 -10 57
861 57 -145 -76 37 -104 -134 -4 -17 -20 2 -50 101 -47 39 42 1 -18 87 -104 -143 -136 -131 131 -38 -41 3 41 6 97 128 -11 -61 -43 70
448 70 -50 -114 95 -19 73 15 -43 55 -144 -11 33 -22 44 210 8 52 24 -3 -39 -95 11 8 60 -29 53 78 -15 80 99 -4 -43 -96
47 -96 -34 -4 40 -169 126 93 -35 -162 7 95 86 41 28 64 61 -9 6 -45 30 -38 55 -19 -53 62 112 -111 37 -12 -93 22 138 7
$$ packed form
2839B567O412o530k408J4o1M5j16kP8J14J9j12J7j22o7J48J67k54OO7N2o6JN0P4oq5J28k3
2476A07qj71n7K40j06J4q3j7ql5J23lP0J0j18qQJ67k0k09L7Q9L8jj6j4l0L3Ln3r4J33K4j12
2050f7O7K3p7o8J02N5j18L9J65r7J4J54j74k3ML6j06q7J70r3J02o4o9K12p4q7nJ5J32r2N3
1662D2j7p5J24rj91J34k19K41pM9j42J13l1j9j5m7J14j23OR7J21o1q8l2M9L9l0j4Q7j66J25
1274E5q6j4L8QJ0j09M7J09j2k9j0M6m5M5m2j09J63Qp4J0q5J36j29k9P6j8M1M1l1p6P4j9O7
861E7k02O9J13j41l0J30j3lK2n2J51j48Q6Lm1j9J05j91l9PNK62j69lM4L8l5R1L1j39n0J8J13
448G0j20o4K09j14R2n8n8R8j99J33M4n5O6J66k02M4k8k7l6n6J06lN2q9Q2K5r3R5J9j03l9n3
47i6O2L0M4k09K95l3j28j27J69Q8rm5j3L6lp0J5n1P5o8R3p4l4J15N0k23J48m9q1J15J16j31
$$ plain form
-354 7 -65 -104 -16
$$ packed form
-354Gp2l9Q8
-391a6
##PAGE=	F1=1539.64
##FIRST=	23146.675690215950453,	6006.5297639999989769,	0.087423048913478851318
##DATA TABLE=	(F2++(Y..Y)), PROFILE
$$ plain form
6007 20 -28 -60 62 -128 70 -1 -96 -40 70 106 -36 -13 44 -112 42 20 67 89 43 9 -47 -88 66 41 -42 53 7 3 74 -26 57
5618 57 -26 -17 -1 14 80 -55 46 41 -128 -51 -89 54 -114 -148 -163 -48 -102 47 2 -75 7 51 48 -91 28 -78 -114 -86 -118 -109 -28 -69
5218 -69 -50 152 -16 -53 80 -6 40 84 -73 -55 -58 17 1 19 -54 -52 114 -20 -44 42 -43 95 13 87 -36 109 -73 -42 16 12 -78 -65
4817 -65 28 -59 -125 -53 -10 38 -77 15 -61 -174 -50 -9 -23 21 70 47 -9 45 45 92 -44 -12 -25 -48 -117 81 -37 -2 -75 28 20 -16 58
4404 58 -10 -10 -24 -94 70 44 -40 -49 -89 -50 -20 103 -40 -35 -132 -91 -11 -28 63 182 -1 -44 -59 -61 -18 -12 38 11 126 -72 -62 128 -67
3991 -67 -42 -127 -79 -26 38 -17 48 -203 -140 32 33 85 -141 25 -112 -61 -39 -16 156 10 125 4 -130 -82 -99 -48 89 -53 7 -49
3615 -49 35 -80 -36 -113 -147 -106 -66 -118 -96 -43 -33 -83 -58 -50 -19 24 110 140 0 -74 -95 -184 9 30 -23 1 -115 -267 -98 -28 -44 -54 3
3202 3 -43 14 -86 -126 -42 -67 93 63 58 116 4 -82 109 275 86 -168 -104 -35 45 108 -185 1071 280 -119 -148 99 45 191 2458
$$ packed form
6007B0m8l2J22j90J98p1r5N6J10L6j42K3N7j56J54k2M7K2m6l4n6m1J54k5q3R5m6mP1j00Q3
5618E7q3RJ6J5O6j35J01nj69P7l8J43j68l4j5J15n4J49m5p7Q2M4lj39J19j06l6K8l2RQ1m1
5218f9J9K02j68l7J33q6M6M4j57J8lP5j6J8p3KJ66j34k4Q6q5J38q2P4j23J45j82L1N8mr0J3
4817f5R3q7o6P2M3M8j15R2p6j13J24M1j4M4M9k3n6N4%M7j36L2j3k3o9J98j18L5p3J03ql6P4
4404E8o8%j4p0J64k6q4rm0L9L0J23j43Nr7M1Q0j7R1J19j83m3j5kM3ON0k7J15j98J0J90j95
3991f7K5q5M8N3O4n5O5k51O3J72JN2k26J66j37N1K2K3J72j46J15j21j34M8j7N1J37j42O0n6
3615d9Q4j15M4p7l4M1M0n2K2N3J0n0K5QL1M3Q6L0j40p4k1q9J93K1n3K4j16j52J69P0j6j0N7
3202Cm6N7j00m0Q4k5J60l0nN8j12q6J91J66j89k54O4O9Q0O3k93J256p91l99k9K47n4J46K267
$$ plain form
2839 2458 7836 1911 37 56 -33 6 -74 -45 -12 80 148 8 39 -57 -157 -27 179 -69 -106 -57 56 -19 -29 -19 74 40 36 121 65
2476 65 73 -69 -74 115 -9 53 -51 -54 -64 -119 -12 0 75 36 -51 -64 -15 94 111 -64 -7 79 56 46 23 35 -33 -1 46 -44 -63 26 16
2063 16 -81 1 28 15 -109 -35 15 -75 3 97 4 23 171 44 4 0 -9 -61 -113 30 -63 -6 -37 -115 108 32 -78 -66 -70 54 -5 40 -11
1650 -11 -53 70 10 -121 17 -217 -9 0 94 -50 60 3 34 -14 -65 26 -67 -56 10 140 47 22 -7 29 67 20 21 87 -110 123 -79
1261 -79 -39 27 64 -5 -112 -12 57 52 21 32 17 -27 22 10 -107 46 58 0 9 -60 50 -70 -87 -27 -4 31 90 17 -6 0 -48 31 -131
848 -131 -51 24 -65 -101 18 -20 -26 16 -54 104 -31 42 7 12 -55 101 -101 -131 -171 -100 100 -41 -49 -24 42 8 83 136 16 -44 -62 49
448 49 -54 -96 73 -38 67 -6 -13 102 -109 15 58 -20 41 246 34 28 50 -11 -113 -125 39 -12 69 -43 55 82 -40 69 83 -3
72 -3 -48 -121 20 30 34 -187 144 107 -3 -147 70 111 63 22 -5 88 79 6 -2 -30 -22 -66 33 46 -17 42 100 -160 39 0 -23 34 159 13
$$ packed form
2839B458N378n925j874J9q9L9q0K9L3R2O8j40L1r6j00J30K06k48l7M9J13p5j0J0R3l4mQ5n6
2476F5Qj42nJ89j24O2j04lj0n5J07J2P5l9q7j3M9J09J7j75N7Q6k3j0k3J2o8L2M7r0j9Q9j0
2063A6r7Q2K7j3j24P4N0r0P8R4r3J9J48j27m0mrn2n2J43r3N7l1p8K23p6j10J2mJ24n9M5n1
1650a1m2J23o0j31J38k34K08RR4j44J10n7L1m8n1R1r3J1O6J30r3k5k9L6L8m7JO6j97K33k02
1261g9M0O6L7o9j07J00O9nl1J1j5m4M9j2j17J53J2n8Ro9J10j20j7O0K3L5N9p3k3Om8P9j62
848a31Q0P5q9l6J19l8oM2p0J58j35P3l5No7J56k02l0m0P1K00j41qK5O6l4P5N3j20o0j8J11
448D9j03m2J69j11J05p3pJ15k11J24M3p8O1K05k12oK2o1j02j2J64n1Q1j12R8K7j22J09J4q6
72cm5p3J41J0Mk21L31l7j10j44K17M1m8m1k7R3rp3qk8Qm4R9J3o3N9N8k60J99l9k3N7J25j46
$$ plain form
-354 13 -79 -102 -8
$$ packed form
-354A3r2k3R4
-391h
##PAGE=	F1=1445.29
##FIRST=	23146.675690215950453,	6006.5297639999989769,	0.10394935309886932373
##DATA TABLE=	(F2++(Y..Y)), PROFILE
$$ plain form
6007 10 -9 -50 97 -108 72 -37 -99 -40 55 30 -59 -62 21 -127 -9 11 70 57 47 12 -64 -104 63 34 -1 12 14 14 93 -29 24 12 -30
5593 -30 5 -3 35 -56 29 13 -114 -18 -90 49 -39 -140 -158 -127 -97 64 19 -90 -32 4 35 -109 -36 -51 -140 -77 -126 -109 -48 -97 -54 186
5193 186 4 -48 94 -23 37 78 -67 -28 -69 40 48 29 -66 -41 163 7 -55 44 -13 66 38 87 -111 38 -65 -20 62 35 -59 -71
4817 -71 32 -45 -150 -5 -15 48 -82 32 -57 -145 -47 -65 -25 30 63 38 -20 32 28 99 -25 -25 14 -47 -77 153 -38 2 -95 26 17 37
4416 37 75 27 -37 -18 -93 82 69 -15 -45 -49 -57 -37 116 -43 -65 -126 -49 13 1 48 172 44 -24 -42 -12 31 2 85 13 137 -43 -52 142
4003 142 -33 -39 -123 -61 -73 -4 -12 44 -182 -98 89 71 92 -118 31 -110 -72 -5 -39 120 30 137 32 -112 -84 -106 -35 112 -45 24
3628 24 -44 52 -100 -26 -72 -79 -108 -64 -98 -32 -56 -63 -90 -68 -36 3 -13 94 184 -1 -51 -54 -166 34 8 -41 -21 -159 -405 -100 4 -17
3227 -17 -26 -7 -31 17 -65 -142 -15 -12 131 54 56 114 2 -73 116 262 56 -153 -41 -27 62 149 -120 906 244 -61 -136 111 49 177
$$ packed form
6007A0j9m1J47k05J80j09o2N9R5k5q9lQ3j48J18K0N9j3j0l5p6m0J67k9l5J3K%P9j22N3j2m2
5593c0L5qL8r1Q5j6j27R6p2J39q8j01j8L1L0J61m5j09N8L6L1j44P3j5q9O3m9J7O1m9M3K40
5193A86j82n2J42j17O0M1j45L9m1J09Qj9r5K5K04j56o2R9n7P9k8M9j98J49j03M5Q2k7r4j2
4817g1J03p7j05J45j0O3j30J14q9q8R8j8M0N5L3k5n8N2mP1j24%L9o1l0K30j91M0r7J21rK0
4416C7L8m8o4J9p5J75j3q4l0mqK0J53j59k2o1P7O2j2M7J24j28o8j8L0M3k9Q3p2J24j80rJ94
4003A42j75oq4O2j2O9qN6k26Q4J87j8K1k10J49j41L8O7l4J59r0J07j05j44K8k2P1J47j57O9
3628B4o8R6j52P4m6pk9M4l4O6k4pk7K2L2L9j6J07R0j85n0lj12K00k6m9K0j38k46L05J04k1
3227a7rJ9k4M8q2p7J27LJ43p7KN8j12p5J89J46k06k09J12J4Q9Q7k69J026o62l05p5K47o2J28
$$ plain form
2851 177 1850 5246 1050 36 60 -64 -23 -57 -10 -7 53 142 -5 39 -22 -128 -42 175 -40 -131 -71 64 -21 -24 -44 52 -13 62 95
2488 95 19 36 -69 -22 126 -13 68 -54 -28 -37 -93 -4 0 65 -18 -42 -59 26 53 96 -24 41 120 36 21 6 61 -54 -11 40 -58 -2 32
2075 32 -2 -100 -6 28 65 -70 -44 -4 -93 40 88 -3 -11 113 50 -9 -20 -54 -54 -65 36 -46 -33 -46 -97 105 42 -87 -85 -71 15 1 34 -64
1650 -64 -40 54 -15 -97 37 -199 -33 13 102 -13 68 0 54 3 -33 -5 -46 -41 -16 124 23 52 -5 40 70 10 31 62 -120 161 -126
1261 -126 -37 61 116 -38 -126 18 29 25 2 48 -4 -58 -25 -1 -99 36 39 6 1 -36 44 -71 -68 -41 17 45 102 40 51 -5 -80 -2 -79 -33 -9
823 -9 -40 -64 22 4 -36 22 -41 104 -16 28 -17 17 -72 119 -90 -93 -185 -70 56 -40 -49 -25 61 19 33 115 39 -33 -82 32 -44 -61 44
410 44 -35 73 -26 -9 133 -57 32 86 -18 37 239 43 19 81 2 -162 -123 61 -24 70 -49 51 65 -63 57 44 6 -52 -134 73
34 73 64 16 -171 124 105 31 -88 124 110 38 0 -21 109 87 17 -2 3 -92 -118 24 105 25 44 76 -173 37 -10 29 39 150 24 -81
$$ packed form
2851A77J673L396m196j014K4j24M1l4M7LO0Q9j47M4o1j06Q6K17k15r1O0J35q5lk0R6o5P5L3
2488I5p6J7j05M7J48j39Q1j22K6rn6Q9MO5q3k4j7Q5K7M3j20O5P9q4j5j5N5j15M3N1r8N6L4
2075C2l4r8R4L4L7j35K6M0q9J33M8r1qJ24o3n9j1l4%j1J01q2J3j3n1K02o3j29KJ4Q6j4L3r8
1650f4K4R4o9q2J34k36J66M6Q9j15Q1o8N4n1l6K8m1NK5J40j01K9n7M5L0o0K1L1j82K81k87
1261a26Q9R8N5j54q8J44J1mk3M6n2n4L3K4r8J35Ll3nl7Q0j15LK7N8K8N7o2J1n6p5P8p7M6K4
823il1k4Q6j8m0N8o3J45j20M4m5L4q9J91k09lr2J15J26r6rK4Q6m2J4Q2p6p2m9J14p6j7J05
410D4p9J08r9J7J42j90Q9N4j04N5K02j96k4O2p9j64L9J84q5R4j19J00J4j28J20j3l8n8q2K07
34G3rm8j87K95j9p4j19K12j4p2l8k1J30k2p0j9Nr5k6J42Q1q0J9L2k49K10m7L9J0J11j26j05
$$ plain form
-366 -81 -107 -2
$$ packed form
-366h1k6J05
-391b
##PAGE=	F1=1350.93
##FIRST=	23146.675690215950453,	6006.5297639999989769,	0.21936403214931488037
##DATA TABLE=	(F2++(Y..Y)), PROFILE
$$ plain form
6007 -2 13 -24 113 -72 57 -61 -107 -42 39 -34 -62 -115 -19 -104 -70 -12 59 32 45 42 -49 -83 48 29 33 -31 31 12 90 -28 -9 46 -38 -12
5581 -12 -24 1 -58 6 -3 -88 -13 -91 41 43 -111 -122 -189 -80 72 44 -84 -76 -51 23 -112 -96 -11 -153 -60 -105 -100 -48 -108 -60 207 33 -54
5168 -54 66 -34 42 59 -52 -1 -69 43 98 41 -56 -38 166 29 -60 45 8 37 40 64 -143 -31 -46 11 95 41 -41 -67 40 6 -140
4780 -140 18 -14 63 -91 37 -39 -112 -62 -111 -40 43 46 33 -26 13 23 86 2 -13 40 -35 -41 181 -35 0 -122 11 27 88 89 47 -50 -17
4366 -17 -66 78 87 24 -32 21 -49 -59 122 -51 -86 -107 19 39 29 37 141 94 -22 -28 29 96 34 114 11 132 -8 -33 146 -9 -17 -98
3966 -98 -30 -101 -32 2 50 -120 -59 128 82 85 -93 37 -112 -75 30 -50 81 43 129 64 -116 -99 -112 -9 106 -38 20 -48 47 -99
3590 -99 -6 -26 -16 -103 -34 -96 39 -46 -97 -90 -81 -12 26 -45 63 196 -9 -32 9 -120 66 17 -38 -25 -431 -1009 -109 22 11 -1 -23
3202 -23 -18 17 -20 -128 8 24 138 35 63 83 -9 -67 107 233 42 -109 9 -15 88 171 -36 599 149 -23 -110 111 49 144
$$ packed form
6007bJ5l7J37j85J29j18m6O5Q1p3k8n3R6q5L4N8P1k7J3lr1l4J31j9Mo4O2j9P8j18J9N5q4K6
5581a2j2K5n9O4rq5P5p8J32Kj54j1o7J09J52k8j28QK5P4j35J6Q5j42R3m5NN2o0M8K67j74q7
5168e4J20j00P6J7j11N1o8J12N5n7r7J8K04j37q9J05l7K9LK4k07J12j5N7Q4n4q2k6J07l4j46
4780a40J58l2P7j54J28p6p3N0m9P1Q3Lj3n9L9J0O3q4j5N3p5oK22k16L5j22J33J6O1Jm2r7L3
4366a7m9J44Ro3n6N3p0j0J81j73l5k1J26K0j0QJ04m7j16oN7O7o2Q0j03J21j40k5J79j55qq1
3966i8O8p1O9L4M8j70O1J87m6Lj78J30j49L7J05q0J31l8Q6o5j80J7j3J03J15j44N8o8R5j46
3590i9R3k0J0q7O9o2J35q5n1PRO9L8p1J08J33k05k3M1j29J86m9n5J3m06n78R00J31j1j2k2
3202b3NL5l7j08J36J6J14j03K8K0r2n8J74J26j91j51J18k4J03Q3k07O35m50j72q7K21o2R5
$$ plain form
2851 144 1094 2497 265 37 64 -97 -44 -35 3 1 40 120 -13 48 5 -67 -44 153 -6 -157 -59 63 -24 -18 -52 30 -53 75 67 -17
2476 -17 -19 -79 10 136 0 57 -76 -11 -13 -47 29 -11 31 -60 -20 -35 73 25 68 -7 74 121 18 -4 -6 93 -63 -7 26 -54 45 38 -12 -118
2050 -118 -30 22 76 -14 -48 -13 -112 55 96 2 -47 34 40 -43 -51 -88 -59 -38 25 -42 -58 -74 -72 101 57 -80 -120 -58 -9 22 25 -123 -15 33
1625 33 -9 -58 57 -164 -32 55 88 23 64 1 49 20 21 -36 -15 -18 -30 110 14 79 -20 44 70 -6 44 27 -101 152 -147 -49 70 141
1224 141 -72 -126 39 -7 -31 -34 57 -12 -74 -69 -20 -78 48 47 30 -11 -21 36 -79 -46 -50 25 42 76 71 82 -10 -95 -34 -8 -32 -54 -37 -32 8 44
773 44 -52 19 -16 97 -10 0 -20 15 -67 136 -70 -39 -176 -49 14 -38 -40 -6 84 35 -34 62 53 -28 -89 16 -32 -31 11 -11 94 -30 -37
360 -37 128 -15 39 98 -22 36 188 40 24 110 23 -174 -99 66 -34 52 -51 43 32 -79 41 -2 18 -60 -122 98 77 -5 -131
-3 -131 80 82 54 -27 144 92 11 -27 -19 118 81 27 8 36 -148 -167 24 138 60 70 48 -139 31 -46 39 34 116 36 -71 -111 0
$$ packed form
2851A44R50J403k232k28K7j61N3RL8kL9Q0j33O1m3p2K3J97j59j51R8J22q7Ol4Q2q3J28qq4
2476a7ko0Q9J26j36N7j33O5kl4P6m0M2r1M0j5J08m8M3p5Q1M7j03k2kR9j56N6L3q0R9pn0j06
2050a18Q8N2N4r0l4L5r9J67M1r4m9Q1Oq3ql7K9K1O3o7j6j6KJ73m4j37m0O2M9L1Lj48J08M8
1625C3m2m9J15k21J32Q7L3o5M1o3M8k9Jn7K1lj2J40r6O5r9O4K6p6N0j7j28K53k99R8J19P1
1224A41k13n4J65m6k4lR1o9o2NM9n8J26jj7m1j0N7j15L3mP5J7L4nJ1r2q5O1K6k4k2J7NM0L6
773D4r6P1l5J13j07J0k0L5q2K03k06L1j37J27O3n2kL4R0m9o9R6rq1o1J05m8JM2k2J05j24p
360c7J65j43N4N9j20N8J52j48j6Q6q7j97P5J65j00Q6j03R4j1j11J20m3K0p8o2K20k1q2j26
-3a31K11Kk8q1J71n2q1l8QJ37l7n4j9K8j84j9J91J14p8J0k2j87J70p7Q5nQ2q0j07m0J11
-391@
##PAGE=	F1=1256.58
##FIRST=	23146.675690215950453,	6006.5297639999989769,	0.085773415863513946533
##DATA TABLE=	(F2++(Y..Y)), PROFILE
$$ plain form
6007 -10 38 -1 99 -31 33 -62 -110 -38 38 -62 -45 -152 -54 -53 -122 -35 31 7 35 91 -7 -32 21 34 52 -58 49 -6 64 -26 -34 60 -42
5593 -42 -42 -33 -21 -56 -12 -19 -70 -21 -95 34 113 -68 -68 -208 -60 72 69 -63 -114 -92 2 -98 -142 19 -142 -48 -74 -85 -26 -100 -73 201 58
5180 58 -70 21 -33 54 36 -31 24 -51 18 136 41 -27 -37 126 36 -64 39 24 18 24 26 -124 -81 -19 44 104 28 -29 -42 44 78 -98 10
4767 10 -14 74 -118 33 -9 -81 -74 -128 -57 62 29 26 -36 -8 29 67 33 14 55 -12 -29 150 -26 -11 -145 -5 46 120 95 41 -43 -16 -23
4354 -23 56 97 70 -9 100 -35 -86 110 -63 -90 -84 93 64 44 21 95 117 -41 -20 51 151 61 111 9 100 12 -15 132 5 18 -57
3966 -57 -5 -103 -31 21 59 -40 -39 134 65 56 -71 44 -109 -62 61 -48 49 36 101 83 -140 -121 -110 26 78 -30 0 -54 27 -79 14
3578 14 20 15 -93 3 -118 85 -25 -124 -95 -97 8 42 -58 24 176 -23 -21 72 -63 90 42 -19 -13 -719 -1490 -84 30 35 13 -37 1
3190 1 11 26 -93 32 32 111 9 75 39 -19 -62 92 194 45 -49 35 -7 107 158 27 334 78 -14 -74 99 50 103 528 654 -171
$$ packed form
6007a0M8l9J00j30O4r5m8P2P6j00J7j07R8Jo9Q7O6k4K8N6r8k5N3J3J8j10J07n5P0r0qR4j02
5593d2%RJ2l5M4pn1M9p4J29P9j81%j40J48J32lj32n1K2R4j00m4J61j61R4k6j1N9p4K7K74j43
5180E8j28R1n4Q7j8o7N5p5O9J18r5o8j0J63r0j00J03j5oOKj50M3O2O3O0p6n7j3Q6L4j76J08
4767A0k4Q8j92J51m2p2Pn4P1J19l3lo2K8L7L8l4j9M1o7j7J79j76J5j34J40N1P4k5n4q4K7p
4354b3P9M1k7p9J09j35n1J96j73k7OJ77k9k0k3P4K2j58K1P1J00r0N0j02R1q8k7J47j27J3p5
3966e7N2r8P2N2L8r9JJ73o9rj27J15j53M7J23j09R7j3O5j8k23J9J1J36N2j08L0n4Q1j06R3
3578A4Onj08R6j21K03j10r9K9kJ05L4j00Q2J52j99KR3j35J53m8o1Op06p71J406J14Nk2n0L8
3190AJ0J5j19J25%P9j02O6l6n8m3J54J02j49r4Q4m2J14N1j31L07k56r2o0J73m9N3M25J26q25
$$ plain form
2814 -171 38 59 -130 -53 -16 -11 4 37 95 -10 73 26 -1 -41 117 30 -172 -30 57 -20 -15 -51 6 -65 73 50 -31 -84 -95 21 132
2426 132 27 24 -106 -4 3 6 72 -33 -22 -78 0 0 118 18 34 -18 93 84 16 -22 -12 109 -64 -3 17 -38 64 42 -24 -128 -70 11
2025 11 50 44 -46 -9 -112 52 111 13 -71 -37 26 -83 -73 -109 -78 -38 0 -57 -81 -112 -56 95 74 -52 -150 -35 -4 57 14 -168 9 9
1625 9 13 -25 62 -119 -13 101 57 46 47 8 29 24 78 -55 21 14 -22 98 5 91 -37 50 66 -28 67 -7 -66 105 -133 -81 48 130 -88
1211 -88 -105 49 -38 -95 -67 62 -14 -69 -87 -37 -54 78 84 75 -24 -24 27 -93 -21 -45 25 30 27 102 75 -18 -89 -61 48 -43 -95 -53 -9 -7 78 -66
761 -66 14 10 83 -9 -27 0 9 -50 140 -47 10 -150 -39 -13 -36 -21 15 92 50 -85 -5 58 -20 -80 -2 -28 -21 -20 16 120 -10 -86 80 0
335 0 37 79 -35 44 112 32 27 126 32 -161 -70 50 -40 11 -57 40 -4 -87 18 -42 19 -68 -82 94 59 -24 -83 34 45 58 -5 123 63
-78 63 -13 -50 -8 110 58 38 29 55 -166 -186 21 136 76 106 29 -66 28 -85 5 17 74 41 -53 -106 -1
$$ packed form
2814a71K09K1j89P7L7NJ5L3N8j05Q3m7k7m0J58q7k02J42Q7p7Nl6N7p1J38k3q1n3j1J16J11
2426A32j05lj30J02PLO6j05J1n6P8%J18j00J6n2J11ro8l8J0J21j73O1K0n5J02k2o6j04N8Q1
2025A1L9or0L7j03J64N9r8q4L4O3j09J0l6L1M0L8n7k4l1N6J51k1j26r8J15L1O1m3j82J77%
1625IMl8Q7j81J06J14m4j1Jl9K1nN4j33P6pl6J20r3Q6j28Q7J6r4R5p4n9J71k38N2J29Q2k18
1211h8j7J54q7n7K8J29p6n5j8N0j7J32Orr9%N1j20P2k4P0NlP5k7r3p1K8J09r1n2M2M4KQ5j44
761f6Q0mP3r2j8K7Rn9J90j87N7j60J11K6k3J5L6P7m2j35Q0O3p8o0P8k6PJL6J04j30p6J66q0
335@L7M2j14P9O8q0nR9r4j93R1J20r0N1o8R7m4q3J05o0O1q7j4J76l5q3n9J17J1J3o3J28o0
-78F3p6l7M2J18n2k0rK6k21k0K07J15o0L0p7r5R4j13R0J2N7l3r4n3J05
-391a
##PAGE=	F1=1162.23
##FIRST=	23146.675690215950453,	6006.5297639999989769,	-0.10916037112474441528
##DATA TABLE=	(F2++(Y..Y)), PROFILE
$$ plain form
6007 -7 56 4 55 0 10 -45 -108 -26 57 -44 -26 -161 -58 10 -151 -49 -8 -31 18 135 33 22 -12 51 48 -61 58 -31 28 -18 -52 49
5606 49 -53 -69 -19 -45 -53 -23 -46 -72 -29 -106 22 151 -27 -14 -173 -50 66 79 -40 -136 -101 -28 -72 -170 25 -112 -45 -45 -60 6 -74
5218 -74 -88 161 72 -87 -12 -25 62 23 -1 52 -19 -28 152 27 13 -37 68 28 -74 26 39 16 2 -7 -70 -105 5 72 84 -1 -28 7
4817 7 40 141 -43 -22 -18 73 -164 22 24 -53 -70 -115 -70 81 22 9 -57 -33 39 56 63 40 55 14 -43 73 -18 -33 -151 -17 67 127 87
4404 87 11 -18 -9 21 25 99 101 18 159 -20 -110 76 -80 -77 -63 145 85 32 -8 46 97 -69 -12 53 165 67 76 15 47 15 -11 92 13 54
3978 54 -17 -2 -89 -3 34 59 27 -46 101 31 9 -48 55 -87 -37 80 -39 29 4 59 72 -170 -145 -98 67 36 -28 -19 -55 8 -55 20
3578 20 59 10 -75 35 -149 83 -16 -138 -106 -115 15 51 -49 -11 131 -39 -18 111 -13 90 58 -5 -5 -464 -466 85 54 56 22 -39 34
3190 34 0 64 -55 59 20 62 -21 82 6 -12 -45 86 155 55 6 35 -13 104 110 43 220 92 -18 -29 77 59 66 282 -18 -248
$$ packed form
6007gO3n2N1n5J0n5o3Q2Q3j01J8j35J03O8j61J02M1k3M9J17j02j1l4O3lj09J19q9N9m6l4J01
5606D9j02j6N0k6qL0k3k6M3p7J28J29j78J3j59J23J16J3j19r6L5P3m4r8J95j37O7%j5O6q0
5218g4j4K49q9j59P5j3Q7l9k4N3p1rJ80j25j4n0J05m0j02J00J3k3j4ro3l5J10O7J2q5k7L5
4817GL3J01j84K1MR1k37J86Kp7j7m5M5J51n9j3o6K4P2J7Pk3J5m1n7J16r1j5j18J34Q4O0m0
4404H7p6k9RL0MP4Kq3J41j79r0J86j56LJ4K08o0n3m0N4N1j66N7O5J12r8Ro1L2l2k6J03p9M1
3978E4p1J5q7Q6L7K5l2p3J47p0k2n7J03j42N0J17j19O8k5N5J3k42K5M7J65l1o4Rl6O3o3P5
3578B0L9m9q5J10j84K32r9j22L2rJ30L6j00L8J42j70K1J29j24J03l2o3%m59kN51l1Kl4o1P3
3190C4l4O4j19J14l9M2q3J03p6j8l3J31O9j00m9K9m8J17Oo7J77j28j10j1J06j8PK16l00k30
$$ plain form
2814 -248 38 42 -158 -52 0 -45 -4 36 73 3 110 47 39 -40 77 70 -167 0 50 -10 -14 -48 -17 -54 55 41 -28 -138 -107 17 110 47
2413 47 -20 -128 0 14 51 100 -63 -86 -77 11 31 149 21 -2 -41 100 33 29 -24 -13 103 -51 -7 19 -18 59 44 -45 -122 -113 0 6 92
2000 92 -34 4 -84 44 114 17 -80 -74 18 -116 -75 -119 -106 -52 -26 -87 -99 -141 -53 77 86 0 -160 -13 25 92 -1 -186 22 -17 29 -20
1599 -20 49 -67 9 123 20 55 19 20 4 7 113 -63 57 45 2 81 -25 80 -47 73 63 -51 97 -35 -37 49 -90 -125 5
1236 5 86 -74 -65 46 -60 -139 -79 68 -21 -43 -73 -46 -36 105 127 131 -41 -38 16 -100 5 -25 24 13 -16 127 43 -30 -73 -83 66 -53
836 -53 -116 -72 5 -9 82 -71 12 29 60 -7 -45 29 7 -34 126 -35 32 -114 -35 -19 -27 1 24 73 62 -93 -66 58 0 -58 -24 -35 -33 -47
410 -47 31 139 24 -137 6 -8 27 23 -49 58 34 21 12 121 17 -147 -52 20 -38 -39 -70 47 -27 -80 -10 -70 6 -64 -18 76 9 -41 -43
-3 -43 1 5 44 -32 78 34 -32 -56 4 87 20 43 51 66 -138 -166 7 100 69 131 27 18 28 -102 -48 -7 35 38 -38 -84 -6
$$ packed form
2814b48K86Mk00J06N2m5M1M0L7p0J07o3qp9J17pk37J67N0o0ml4L1l7J09j4o9j10L1J24R3o3
2413D7o7j08J28J4L7M9j63k3RQ8K0J18j28k3l9J41o7mn3J1J16j54M4K6l7P7j5q9p7RJ13OQ6
2000I2j26L8q8J28P0r7r7OR2j34M1m4J3N4K6o1j2m2Q8J30Rq6j60J47L8O7r3j85K08l9M6m9
1599b0O9j16P6J14j03L5l6Jj6LJ06j76J20j2m3P9j06J05j27J20j0j14J48j32kQ6j39l5J30
1236EQ1j60RJ11j06p9O0J47q9k2l0K7J0J41K2Mj72LN4j16J05l0M9j1k9J43q4p3m3j0J49j19
836e3o3M4P7j4R1j53Q3J7L1o7l8P4k2m1J60j61O7j46P9J6qK8K3M9j1j55K7J24n8n8L4j1Kj4
410d7P8J08j15j61J43j4L5mp2J07k4j3rJ09j04j64R5P2n8jl1J17p4n3P0o0P6p0M6R4o7n0k
-3d3M4ML9p6J10m4o6k4O0Q3o7K3QJ5k04k8J73R3l1O2j04rJ0j30N4M1M2Lp6m6P8
-391f
##PAGE=	F1=1067.87
##FIRST=	23146.675690215950453,	6006.5297639999989769,	-0.074629358947277069092
##DATA TABLE=	(F2++(Y..Y)), PROFILE
$$ plain form
6007 4 64 -8 -7 12 1 -26 -106 -5 85 2 -26 -145 -28 66 -152 -51 -48 -88 -6 155 49 61 -42 70 25 -47 50 -48 1 1 -69 17 -83
5593 -83 -86 8 -84 -52 -29 -86 -91 -34 -122 1 146 0 17 -102 -58 56 63 -30 -137 -78 -57 -45 -172 6 -78 -49 -16 -20 36 -39 -92 97 82
5180 82 -91 -21 -19 57 22 37 85 12 -77 136 12 51 -40 19 6 -93 9 58 23 -10 -22 -8 -109 22 88 44 -41 -42 68 30 175 0
4780 0 -61 -27 55 -217 9 53 -31 -45 -86 -77 96 28 -14 -89 -63 41 62 90 48 41 42 -64 -11 -20 -56 -137 -23 86 109 69 -32 15 7 59
4354 59 0 100 100 40 178 -6 -130 24 -101 -58 -43 158 97 -4 -52 4 40 -89 -4 40 127 46 22 29 -8 7 -24 27 12 72 -1 -25
3953 -25 -73 37 30 39 60 -81 42 -3 -42 -20 65 -48 -12 83 -37 15 -45 6 27 -192 -164 -78 98 -11 -37 -26 -44 3 -44 0 77 -17
3553 -17 -45 54 -164 36 -36 -137 -116 -128 7 50 -31 -36 74 -57 -17 115 13 62 45 -19 -26 895 3317 495 122 82 40 -22 74
3190 74 -11 89 -33 90 12 14 -48 77 2 16 -10 92 128 58 41 17 -33 74 44 2 222 180 -19 22 54 77 34 265 46 -138
$$ packed form
6007DO0p2JJ9j1k7q0J01R0q3k8j19J17R4k18J01Lm0Q2J61j06J2j03J12m5p2R7r8M9%p0Q6j00
5593h3lR4r2L2K3n7nN7q8J23J45j46J7j19M4J14Pr3j07N9K1J2j27J78q4K9L3mN6p5n3J89j5
5180H2j73P0KP6l5J5M8p3q9K13j24L9r1N9j3r9J02M9l5l3j2J4j01J31O6m4q5jJ10l8J45j75
4780@o1L4Q2k72K26M4q4j4m1RJ73o8m2p5K6J04K1K8m2pJj06N3rl6q1J14J09K3m0j01M7qN2
4354E9n9J00%o0J38j84j24J54j25M3J5K01o1j01m8N6L6j29Q5M4Q7q1k4Pl7J5l1N1j5O0p3k4
3953b5m8J10pRK1j41J23m5l9K2Q5j13L6R5j20N2o0N1K1k19K8Q6J76j09k6J1j8M7m7M4P7r4
3553a7k8R9k18K00p2j01K1j2J35M3q1nJ10j31M0J32j02M9j7o4pR21K422k822l73m0m2o2R6
3190G4q5J00j22J23p8Ko2J25p5J4k6J02L6p0j7k4n0J07l0m2K20m2j99M1L2K3m3K31k19j84
$$ plain form
2814 -138 38 23 -170 -44 18 -73 -21 30 58 27 140 71 34 -44 45 103 -145 17 40 -4 -13 -51 -34 -36 28 34 -22 -162 -106 5 71 39
2413 39 -61 -133 3 22 68 90 -89 -137 -75 8 45 163 18 -40 -53 98 -2 44 -11 -6 79 -19 -12 30 -8 46 45 -68 -96 -140 -4 -32
2013 -32 117 -7 13 -40 34 90 10 -78 -72 17 -133 -57 -120 -130 -61 -41 -119 -105 -141 -60 47 90 66 -145 0 63 105 -24 -174 16 -51
1625 -51 23 -52 24 -17 27 117 -8 59 -12 33 -23 -25 111 -71 85 55 22 48 -85 47 -47 116 63 -71 120 -55 -30 4 -38 -161
1249 -161 -31 26 -33 -18 34 -81 -147 -65 73 -31 -4 -40 -44 -28 109 140 171 -58 -49 1 -83 32 0 22 -4 -35 142 12 -47 -66 -102
861 -102 44 -49 -112 -78 16 5 48 -62 11 34 26 -5 -48 43 12 -31 97 -46 18 -78 -33 -6 -13 17 20 28 70 -61 -95 58 29 -33 -45 -49 -56
423 -56 -64 25 141 54 -170 -68 -22 11 -52 -51 70 -27 7 -21 98 -23 -144 -49 -14 -28 -82 -89 59 -29 -59 -38 -81 -13 -40 52 65 -59 -61
9 -61 -18 -19 -24 19 -83 42 11 -41 -42 20 54 -27 37 63 75 -80 -122 -23 43 46 130 37 83 25 -81 -91 -36 1 32 -33 -48 -18
$$ packed form
2814a38J76j5j93J26O2r1N2N1K8l1J13o9l7p8Q9N8k48J62K3m4rl8J7kO4On6j40N6J11O6l2
2413C9j00p2J36J9M6K2j79m8O2Q3L7J18j45n8j3J51j00M6n5NQ5r8PM2l8N4jj13k8m4J36k8
2013c2J49j24K0n3P4N6q0q8OQ9j50P6o3j0O9K0p8J4l6Q1J07M3k4k11J45O3M2j29j50J90o7
1625e1P4p5P6m1M4R0j25O7p1M5n6kJ36j82J56l0l3K6j33J32r4J63n3j34J91j75K5L4m2j23
1249a61J30N7n9J5N2j15o6Q2J38j04K7l6mJ6J37L1L1k29RN0q4J15l2K2k6l1J77j30n9j9l6
861a02J46r3o3L4R4j1M3j10P3K3ql1m3R1l1m3J28j43O4r6M5K7pL0LQM2j31l4J53k9o2j2mp
423e6qQ9J16q7k24J02M6L3o3JJ21r7L4k8J19j21j21R5L5j4n4pJ48q8l0K1m3O8k7R2J3j24k
9f1M3jnM3j02J25l1n2jO2L4q1O4K6J2j55m2R9O6LQ4r3M6n8j06j0N5L7L1o5j5L0
-391a8
##PAGE=	F1=973.517
##FIRST=	23146.675690215950453,	6006.5297639999989769,	0.040331482887268066406
##DATA TABLE=	(F2++(Y..Y)), PROFILE
$$ plain form
6007 15 59 -26 -69 5 13 -19 -105 19 105 48 -53 -117 21 98 -130 -45 -71 -147 -33 145 34 71 -59 76 -8 -25 29 -49 -2 31 -84
5618 -84 -20 -129 -98 28 -136 -59 -28 -121 -118 -45 -137 -29 99 0 15 -27 -87 37 22 -40 -116 -34 -64 -27 -146 -22 -53 -54 21 32 47 -8
5218 -8 -75 35 98 -76 -12 -23 41 30 75 119 28 -106 88 9 73 -46 -8 -24 -115 -7 74 31 -8 -12 39 -104 29 86 -1 -83 -75 115
4817 115 19 169 25 -85 -39 28 -258 -2 70 -16 -11 -56 -81 101 44 -36 -118 -99 27 83 112 35 11 65 -69 -65 -32 -71 -110 -29 99
4429 99 75 47 -71 48 28 84 -5 106 65 48 157 4 -143 -37 -118 -41 -21 137 92 -46 -94 -25 -29 -94 6 27 55 7 -27 43 -51
4041 -51 2 -53 -46 -1 65 -24 -63 -66 76 8 10 58 -127 -15 -29 -81 7 66 -4 -2 71 -47 0 -94 -46 -37 -195 -169 -56 108 -59 -55 -16 -27
3615 -27 10 -58 -43 68 -45 0 66 -150 -33 -83 -127 -114 -129 -6 42 -21 -49 19 -72 -19 85 10 11 -1 -69 -86 3376 9661 1106 232
3240 232 118 74 6 104 -12 106 -38 115 29 -11 -58 65 27 63 38 106 120 46 52 -10 -60 24 -16 -75 248 288 -15 74 38 98 6
$$ packed form
6007A5M4q5m3P4Ql2q6J24Q6n7j01o4J38P7k28Q5k6p6J14J78j11L7j30J35q4j7N4p8M7L3j15
5618h4O4j09L1J26j64P7L1r3LP3r2J08J28r9J5m2o0J24j5o2p6Q2l0L7j19J24l1jP5J1J5n5
5218ho7J10O3j74O4j1O4j1M5M4r1j34J94p9O4j19L8j6r1J08Q1m3l9mN1j43J33N7q7q2QJ90
4817A15r6J50j44j10M6O7k86K56P2q6Nm5k5J82n7q0q2J9J26N6K9p7k4N4j34ML3l9l9Q1J28
4429I9k4k8j18J19k0N6q9J11m1j7J09j53j47J06q1P7K0J58m5j38m8O9mo5J00K1K8m8l4P0r4
4041e1N3n5PM5O6q9l9lJ42o8KM8j85J12j4n2Q8N9p0KP3j18M7r4M8Rj58K6J13J64j67ML9j1
3615b7L7o8J5J11j13M5O6k16J17n0m4J3j5J23M8o3k8O8r1N3J04p5Jj2o8j7L462O285q555q74
3240B32j14m4o8R8j16J18j44J53q6m0m7J23l8L6k5O8J4p4Oo2n0Q4m0n9L23M0l03Q9l6O0r2
$$ plain form
2851 6 310 257 -25 44 13 -157 -35 39 -77 -37 18 42 60 146 96 -10 -50 26 115 -115 13 25 -9 -5 -60 -38 -28 1 22 -31 -151 -93
2451 -93 -16 23 -8 -88 -121 10 30 52 47 -105 -156 -88 -2 32 158 1 -71 -42 86 -11 41 6 8 54 33 -5 40 -15 36 47 -82 -54 -133
2038 -133 2 -52 114 34 7 3 22 37 0 -69 -47 14 -127 -28 -116 -139 -54 -34 -136 -100 -106 -69 11 84 124 -117 -3 92 86 -50 -139 -7
1637 -7 -89 1 -104 4 23 34 96 -21 67 -37 42 -57 -60 77 -88 105 37 17 -2 -153 8 -34 163 74 -86 119 -66 -43 -23 4
1261 4 -165 -40 -26 20 21 19 -105 -120 -42 73 -37 34 -10 -38 -29 86 102 170 -73 -48 -24 -40 50 17 20 -18 -23 148 1 -73 -73 -123 3 -27
836 -27 -89 -59 25 28 -9 -43 5 24 -22 -13 -43 27 18 -42 65 -76 -19 -48 -31 16 0 11 11 -17 74 -16 -87 63 58 -12 -61 -66 -79 -73 1 124 61
373 61 -176 -118 -21 -2 -125 -36 72 -67 -5 -61 71 -83 -144 -51 -39 -12 -106 -104 67 -7 -28 -60 -75 -26 3 108 69 -128 -88 -9 -34 -37
-28 -37 -6 -116 37 -2 -37 -15 36 18 -74 17 56 79 -23 -78 -64 -11 18 104 49 110 15 -34 -100 -59 -29 38 -35 -7 -37
$$ packed form
2851FL04n3k82O9l1j70J22P4j16M0N5K4J8Q6n0j06m0P6Q9k30J28J2l4Mn5K2J0K9K1n3j20N8
2451i3P7L9l1q0l3J31K0K2nj52n1O8Q6L4J26j57p2K9J28r7N2l5KM6k1l8M5n5N1J1j29K8p9
2038a33J35n4J66q0k7mJ9J5l7o9K2O1j41R9q8k3Q5K0j02L6oL7Q0P3M0k41J14R5oj36q9J32
1637gq2R0j05J08J9J1O2j17Q8j04P9r9lJ37j65J93o8k0j9j51J61m2J97q9j60K05j85K3K0K7
1261Dj69J25J4M6Jkj24j5P8J15j10P1m4k8RJ15J6O8k43K5K4j6R0l3Ll8nJ71j47p4%n0J26l0
836b7o2L0Q4Ll7l4M8J9m6Rl0P0ro0J07j41N7k9J7M7j6J1%k8R1r0p1J50np0m9nj3OP4J23o3
373F1k37N8R7J9j23Q9J08j39O2n6J32j54o1R3J2K7r4KJ71p4k1l2j5M9K9J05l9j97M0P9k5l
-28c7L1j10J53l9l5K2N1j8r2R1L9K3j02n5J4N3K9Q6n5O1r5m9o6M1L0O7p3K8l0
-391c7
##PAGE=	F1=879.164
##FIRST=	23146.675690215950453,	6006.5297639999989769,	0.11005596071481704712
##DATA TABLE=	(F2++(Y..Y)), PROFILE
$$ plain form
6007 16 47 -34 -107 -11 42 -24 -98 35 101 69 -93 -92 64 98 -94 -32 -67 -178 -50 113 2 61 -57 64 -39 -6 6 -35 16 56
5631 56 -93 -50 -173 -112 16 -185 -67 -16 -135 -137 -65 -139 -60 27 -26 -13 27 -124 4 -28 -67 -73 16 -38 -23 -100 -44 -39 -58 71 83 33
5230 33 6 -34 -3 123 -44 -6 -38 28 34 97 136 21 -103 15 24 74 -49 -15 -57 -131 -19 82 31 3 9 61 -99 26 64 -38 -117
4842 -117 -123 128 13 128 32 -83 -46 3 -273 -6 74 -9 12 -28 -84 99 68 -47 -130 -136 -3 108 122 6 -26 80 -49 -67 -44
4479 -44 -70 -81 -42 104 38 32 -91 76 42 96 12 125 7 43 113 13 -147 -96 -121 -24 1 103 72 -68 -118 -44 -89 -87 13 20 -11 -32
4078 -32 -54 48 -67 9 -84 -107 -32 43 -73 -98 -66 102 -19 -11 40 -163 -47 -41 -96 26 48 22 -7 51 -65 -16 -121 -85 -105 -177 -150
3690 -150 -39 93 -99 -74 3 -15 12 -92 -83 37 -58 55 75 -108 -94 -135 -111 -96 -116 -12 26 -26 -56 -17 -81 -22 37 -12 -40 -62 -139
3302 -139 -162 6183 16389 1700 340 150 112 32 112 2 118 -59 128 71 -5 -44 49 63 112 88 113 130 25 40 -43 -82 -32
$$ packed form
6007A6L1q1p3R6N3o6p4J33O6l2j62JJ56L4j92O2l5j11J28J63j11N9j18J21j03L3J2m1N1M0
5631E6j49M3j23O1J28k01J18N1j19kP2p4P9Q7n3J3M0j51J28l2l9oQ9n4J5p7N6Nj9J29J2n0
5230C3k7m0L1J26j67L8l2O6OO3L9j15j24J18RN0j23L4m2p4J12J01n1k8ON2j60J25L8j02p9
4842a17oK51j15J15r6j15L7M9k76K67Q0q3K1m0n6J83l1j15q3oJ33J11J4j16l2J06j29j8K3
4479d4k6j1L9J46o6oj23J67l4N4q4J13j18L6P0j00j60N1k5R7K5J02l1j40n0P4m5KJ00Pl1k1
4078c2k2J02j15P6r3k3P5P5j16k5L2J68j21QN1k03J16On5J22K2k6k9N8j16M9j05L6k0p2K7
3690a50J11J32j92K5P7j8K7j04RJ20r5J13K0j83J4m1K4J5k0J04L8n2l0L9o4N9N9m9k8k2p7
3302a39k3O345J0206j4689j360j90l8q0Q0j10J16j77J87n7p6l9R3J4M9k4K5J7j05J5q3l9N0
$$ plain form
2964 -32 -53 -150 250 368 -14 113 30 112 -18 311 307 14 57 22 -116 -28 55 -53 -45 -3 20 92 124 110 -68 -52 18 96 -91 -10 1
2576 1 -24 12 -73 -26 -31 -15 13 -55 -119 -74 -45 -23 -84 -96 -95 22 38 9 -7 -110 -133 -113 -16 -4 137 -18 -83 -20 65 -1 17 18 28 38 97
2138 97 16 45 -35 34 46 -86 -4 -91 17 -51 86 74 -17 35 0 -30 4 -53 -18 6 -99 -3 -109 -129 -37 -11 -128 -85 -45 -76 -17 75
1737 75 151 -90 -18 104 45 -63 -96 -36 -119 -19 -145 1 45 31 81 -21 83 -47 50 -89 -80 36 -111 121 -1 -18 -55 -194
1387 -194 -23 -9 188 95 -94 90 -71 -60 -44 28 -126 -18 -61 67 43 5 -126 -72 -29 68 -35 63 -2 -38 -35 50 22 120 -75 -38
1011 -38 -59 13 47 20 20 -25 11 147 14 -110 -85 -141 -27 1 -64 -19 33 40 -64 -23 -11 5 -78 -37 -44 -18 17 -62 38 -109 -54 -26 -31 34
585 34 2 -22 5 -38 69 6 -56 73 72 2 -70 -79 -94 -80 -25 91 40 -161 -134 0 -11 -168 -11 67 -86 -11 -85 49 -145 -127 -47 -48
185 -48 2 -113 -108 66 27 3 -71 -46 -24 50 129 83 -177 -118 -12 -46 -34 -22 -105 64 -9 -26 9 44 -15 -108 -8 38 67 2 -54 -99 -45
$$ packed form
2964c2k1r7M00J18l82J27q3Q2j30L29mk93M3l5j38Q8Q3j08QM2K3P2L2j4j78J6P0P8j87Q1J1
2576Ak5L6q5M7nJ6K8o8o4M5K9K2o1j2JJ17J6k9j6j03k3K0R7J2J41j55o5O3Q5o6J8JJ0J0N9
2138I7q1K9q0O9J2j32Q2q7J08o8J37j2r1N2l5l0L4n7L5K4j05R6j06k0R2K6j17M3M0l1N9R2
1737G5P6k41P2J22n9j08l3O0q3J00j26J46M4j4N0j02J04j30R7j39RJ16j47K32j22j7l7j39
1387a94J71J4J97r3j89J84j61J1J6P2j54J08m3J28k4l8j31N4M3R7j03R8o5l6LQ5k8R8j95L7
1011c8k1P2L4k7%m5L6J36j33j24K5n6J14K8o5M5N2Pj04M1J2J6q3M1pK6L5p9J00j47N5K8nO5
585C4l2k4K7m3J07o3o2J29jp0p2rj5J4N5J16n1k01K7J34j1j57J57P8j53P5p4J34j94J8Q0j
185d8N0j15NJ74l9k4p4K5K2P4P9m6k60N9J06l4J2J2q3J69p3j7L5L5n9r3J00M6K9o5n6m5N4
$$ plain form
-228 -45 -7 61 54 100 0 15 -77 -70 -55 58 -36 25 -59
$$ packed form
-228d5L8O8pM6j00J5r2PJ5J13r4O1q4
-391e9
##PAGE=	F1=784.81
##FIRST=	23146.675690215950453,	6006.5297639999989769,	0.22928513586521148682
##DATA TABLE=	(F2++(Y..Y)), PROFILE
$$ plain form
6007 4 35 -21 -109 -30 69 -28 -76 29 74 60 -118 -77 84 68 -58 -14 -34 -154 -49 68 -23 45 -42 39 -55 5 -7 -14 45 56 -91 -66
5606 -66 -191 -127 -29 -212 -68 8 -120 -136 -85 -118 -82 -46 -72 -52 54 -152 -41 -75 -101 -14 67 14 -27 -53 -51 -30 -65 118 108 1 8 22
5205 22 -18 145 -3 -17 -57 27 32 96 124 -3 -73 -64 43 55 -40 -6 -80 -129 -22 76 24 9 24 60 -93 20 23 -54 -137 -179 104 16 64
4792 64 32 -63 -46 -11 -259 1 67 -11 16 0 -81 93 97 -36 -120 -159 -39 126 116 -29 -63 83 -12 -25 -43 -50 -63 -59 104 15 31 -82
4391 -82 103 44 96 43 156 -47 37 70 16 -140 -138 -99 0 25 73 42 -51 -115 -54 -121 -76 13 21 -44 -53 -50 44 -55 27 -97 -135 -78 17 -117
3966 -117 -111 -68 109 -34 -15 27 -172 -46 -40 -89 31 6 21 -12 31 -75 -35 -118 -95 -158 -141 -104 -31 60 -126 -86 22 -17 -2 -127 -93
3578 -93 0 -55 101 77 -57 -123 -165 -89 -63 -95 0 12 -37 -57 -25 -80 -26 -10 -38 -75 -111 -199 -209 8069 20418 1999 388 153 125
3215 125 43 94 28 121 -72 121 119 23 -16 32 88 146 125 104 149 6 17 -77 -92 -83 -64 -185 237 392 -26 128 31 116 -40 264 228
$$ packed form
6007DL1n6q8P9R9r7m8J05M5j4j78M1J61j6j26M4k0j20J05J17r1O8q7Q1r4O0j2pN9J1j47K5
5606f6j25O4R8j83J44P6j28j6N1l3L6L6k6K0J06k06J11l4k6Q7Q1n3m1k6KK1l5J83j0j07PJ4
5205B2m0J63j48j4m0Q4NO4K8j27p0RJ07J2r5L4p4m9J07R8n2j5J5L6j53J13Lp7q3m2K83q8M8
4792F4l2r5J7L5k48K60O6p8K7j6q1J74Mj33q4l9J20J65j0j45l4J46r5j3j8pj3MJ63q9J6j13
4391h2J85n9N2n3J13k03Q4L3n4j56KL9R9K5M8l1r3o4O1o7M5Q9Qo5rLR4r9Q2j24l8N7R5j34
3966a17OM3J77j43J9M2j99J26Om9J20k5J5l3M3j06M0q3K3o3J7L7P3R1j86M0J08l9J5j25L4
3578i3R3n5J56k4j34o6m2P6K6l2R5J2m9k0L2n5N4J6k8l7l6q8j0Q278J2349j8419j611k35k8
3215A25q2N1o6R3j93J93kr6l9M8N6N8k1k1M5j43J1r4j5RJ9j21M22J55m18J54r7Q5j56L04l6
$$ plain form
2826 228 5 77 47 -52 -20 57 -16 -47 -33 -10 115 87 99 -109 -47 12 50 -80 -44 -30 -42 36 -83 -4 -36 -19 20 -73 -79 -56 -73 -60 -157
2413 -157 -91 -59 36 47 -46 -46 -112 -78 -136 -26 -50 108 -24 -63 -5 39 9 -16 24 50 28 149 46 41 -54 34 42 -88 39 -30 32 -37 47
2000 47 95 -52 53 -31 -89 33 -30 -2 -6 -52 5 -100 -103 -24 15 -96 -62 18 -78 -29 62 137 -64 -36 98 2 -50 -51 -54 -129 -18 -147 19
1587 19 45 17 82 -15 102 -40 62 -102 -72 19 -127 138 -36 -73 -88 -186 -44 28 171 119 -94 46 -70 -59 -70 34 -53 20 -80
1224 -80 91 46 -8 -137 -23 -37 61 -30 75 -15 -54 -44 21 -65 44 -55 -32 -93 55 22 5 25 -22 53 138 35 -149 -83 -147 -30 23
836 23 -50 31 39 32 -89 -8 -35 -4 -124 -69 -62 -78 7 -81 22 -124 -64 -11 -31 38 -13 -79 1 -20 54 -8 -31 81 67 14 -73 -85 -95 -94 -45
398 -45 54 5 -141 -122 29 -11 -171 7 61 -87 -5 -82 35 -191 -82 -26 -35 10 -111 -97 58 65 25 -73 4 -7 81 112 96 -191 -140
9 -140 -26 -52 -24 -22 -57 101 -16 -11 17 38 -43 -117 -28 22 37 -15 -47 -108 -52 -28 12 56 68 -10 49 -41 -69 -66 84 -27 42 -81
$$ packed form
2826B28k23P2l0r9L2P7p3l1J4K3J25k8J2k08O2N9L8j30L6J4j2P8j19P9l2J7L9r3oK3j7J3r7
2413a57O6L2R5J1r3%o6L4n8J10k4J58j32l9N8M4l0k5M0K6k2J21j03nr5Q8Qj30J27o9O2o9Q4
2000D7M8j47J05q4n8J22o3K8mm6N7j05lP9L9j11L4Q0r6M9R1P5k01K8J34r6n2jlp5J11j29J66
1587A9K6k8O5r7J17j42J02j64L0R1j46K65j74l7j5r8J42P2J43n2k13J40j16J1j1J04q7P3j00
1224h0J71m5n4j29J14j4R8r1J05r0l9J0O5q6J09r9K3o1J48l3j7K0m7P5Q5j03j84O6o4J17N3
836B3p3Q1Qpj21Q1k7L1j20N5Pj6Q5q8J03j46O0N3k0O9n1o6Q0k1P4o2k3J12j4n3q7j2j0JM9
398d5R9m9j46J9J51m0j60J78N4j48Q2p7J17k26J09N6rM5j21J4J55Pm0r8P7j1Q8L1j6k87N1
9a40J14k6K8Kl5J58j17NK8K1q1p4Q9N0J5n2l2o1N6K4M0M4J2p8N9r0k8LJ50j11O9j23
-391h1
##PAGE=	F1=690.456
##FIRST=	23146.675690215950453,	6006.5297639999989769,	0.34999144077301025391
##DATA TABLE=	(F2++(Y..Y)), PROFILE
$$ plain form
6007 -17 29 9 -75 -43 79 -19 -39 -4 33 32 -106 -68 76 26 -27 6 13 -76 -26 21 -29 31 -21 14 -51 10 -11 1 66 24 -77 -71 -171 -135
5581 -135 -91 -207 -56 41 -88 -108 -90 -73 -89 -97 -117 -82 62 -154 -91 -102 -129 48 116 74 -33 -27 -44 -21 -75 140 94 -34 12 79 -31
5193 -31 150 34 -46 -69 38 25 81 78 -33 -28 -126 49 22 -17 18 -90 -105 -15 55 18 -1 20 45 -85 15 -22 -44 -140 -230 58 25 -6
4792 -6 29 -45 -38 -17 -223 18 56 -16 1 37 -65 85 129 -5 -96 -154 -61 129 96 -63 -88 68 26 36 -26 -16 -58 -68 100 19 44 -47
4391 -47 133 32 87 72 179 -81 46 48 13 -121 -150 -60 33 44 52 14 0 -88 -53 -119 -67 11 21 -38 -49 -22 34 -19 45 -79 -128 -127 -4
3978 -4 -126 -90 -61 98 -27 -4 30 -148 -21 -27 -71 23 -53 -3 3 16 -63 -51 -86 -73 -187 -100 -39 -30 22 -134 -90 36 -36 -34 -142 -68 -24
3565 -24 -43 115 62 -17 -116 -163 -62 -27 -70 31 9 -38 -48 0 -66 -28 -40 -49 -80 -130 -220 -192 8130 19763 1844 344 110 90 38
3202 38 60 54 114 -58 95 149 58 8 11 91 153 143 81 165 -4 -4 -103 -84 -118 -64 -172 230 356 -50 113 40 116 -59 210 158 -8
$$ packed form
6007a7M6k0q4L2J22r8k0L5L7jj38L8J44n0n3L3Pq9N0M7n0O0n2L5o5O1k1J2O5m2j01Oj00L6
5581a35M4j16J51R7j29k0J8J7j6qk0L5J44k16O3j1k7J77O8m2j07Oj7K3n4K15m6j28M6O7j10
5193c1J81j16q0k3J07j3N6lj11Nr8J75k7l9L5j08j5R0P0l7j9K1K5j30J00l7k2r6r0K88l3l1
4792fL5p4PK1k06K41L8p2J7L6j02J50M4j34r1n8R3J90l3j59k5J56m2J0o2J0m2j0J68q1K5r1
4391d7J80j01N5j5J07k60J27Kl5j34k9R0R3J1Ql8j4q8L5o6N2P8J0n9j1K7N6n3O4j24m9JJ23
3978dj22L6K9J59j25K3L4j78J27om4R4p6N0OJ3p9J2l5J3j14Q7O1RN2j56M4J26p2Kj08P4M4
3565b4j9J58n3p9r9m7J01L5m3J01k2m7j0M8o6L8j2rl1n0r0K8Q322J1633j7919j500k34k0n2
3202C8K2oO0j72J53N4r1n0LQ0O2j0o2Q4j69%r9J9l4N4j08M02J26m06J63p3P6j75K69n2j66
$$ plain form
2814 -8 97 77 19 -9 43 7 -46 -68 -45 113 52 64 -119 -38 0 -1 -80 -72 -65 -57 51 -84 19 -34 -14 52 -62 -39 -41 -88 -86 -198 -85 -19
2388 -19 49 57 -96 -56 -114 -11 -142 -28 -84 78 -10 -7 -11 14 11 -37 28 65 10 172 68 28 -58 30 34 -96 68 23 41 -24 17 86 -85
1975 -85 60 -68 -119 79 -4 0 -20 0 -7 -90 -67 -21 33 -54 -35 62 -77 -22 46 95 -33 -48 80 -23 -8 -10 -50 -116 8 -106 49 32
1574 32 -5 89 -11 110 -24 85 -75 -38 33 -120 153 -49 -123 -86 -135 -59 69 117 129 -82 12 -66 -32 -103 28 27 51 -93 88
1211 88 34 -23 -135 12 -54 59 -28 71 -35 -84 -56 6 -126 -20 -11 -40 -104 69 -11 -21 31 -15 82 123 45 -177 -57 -129 -5 28 -53
823 -53 80 41 12 -77 0 -59 8 -142 -91 -98 -127 -11 -95 15 -109 -49 -4 -30 21 -42 -138 -7 25 24 -51 -39 73 48 30 -72 -80 -73 -112 -54
398 -54 20 -21 -133 -98 51 -6 -134 5 61 -74 10 -58 23 -200 -20 10 -5 15 -104 -78 52 92 33 -61 66 16 92 73 103 -163
22 -163 -144 -50 -40 -15 -4 -3 124 -28 2 1 16 -62 -103 -38 25 -4 -65 -43 -82 -35 -45 -33 60 31 -13 64 -11 -57 -53 97 -9 39 -98
$$ packed form
2814hJ05k0n8k8N2l6n3k2K3J58o1J2j83Q1L8jp9QPQJ08j35J03n3K0O6j14K3km7Kj12J13O6
2388a9O8Qj53M0n8J03j31J14n6J62q8LmK5lm8O5L7n5J62j04m0q6Q8Mj30J64m5J8o5M1O9j71
1975h5J45j28n1J98q3Mk0K0pq3K3M6N4q7J9R7j39N5O8M9j28j5J28j03J5km0o6J24j14J55j7
1574C2l7R4j00J21j34J09j60L7P1j53K73k02p4L7m9P6J28M8J2k11R4p8L4p1J31jK4j44J81
1211H8n4n7j12J47o6J13q7R9j06m9K8O2j32J06Rk9o4J73q0j0N2m6R7M1p8k22J20p2J24L3q1
823e3J33l9k9q9P7n9O7j50N1pk9J16q4J10j24O0M5k6N1o3r6J31L2jp5J2J12k5j8j02qPl9N8
398e4P4m1j12L5J49n7j28J39N6j35Q4o8Q1k23J80L0j5K0j19K6J30M0n9r4J27n0P6j9L0k66
22a63J9R4J0K5J1JJ27j52L0jJ5p8m1O5O3k9o1K2l9M7j0J2R3k9m4P7p5m6MJ50j06M8j37
-391i8
##PAGE=	F1=596.102
##FIRST=	23146.675690215950453,	6006.5297639999989769,	0.25912332534790039063
##DATA TABLE=	(F2++(Y..Y)), PROFILE
$$ plain form
6007 -39 31 46 -20 -52 66 1 3 -61 -6 0 -58 -58 52 -6 -3 23 59 29 5 -19 -18 17 -3 0 -29 9 -14 10 70 -28 -52 -70 -118 -125 -139 -178 -34
5543 -34 68 -59 -59 -71 -11 -83 -115 -141 -92 62 -122 -128 -102 -143 105 161 119 -37 -33 -30 -12 -82 125 48 -58 30 118 -59 131 60 -82 -69
5143 -69 48 21 70 13 -59 15 -145 38 -15 12 58 -88 -63 -2 27 17 -23 0 24 -70 17 -56 -16 -128 -268 12 31 -69 21 -51 -27
4755 -27 -21 -177 32 44 -18 -20 77 -33 77 159 39 -70 -119 -61 117 70 -85 -99 32 61 89 -8 24 -61 -57 93 49 62 2 167 16
4366 16 77 84 169 -85 76 48 2 -94 -124 -24 64 52 35 0 60 -52 -43 -87 -58 14 15 -12 -28 9 24 26 50 -31 -97 -167 -27 -95 -36 -42 69
3928 69 -2 4 45 -106 11 -5 -52 11 -116 -31 46 9 -26 -61 -38 -30 -185 -69 26 -33 -8 -119 -92 47 -63 -63 -128 -25 -24 -26 82 24 1
3515 1 -86 -135 -31 7 -45 67 23 -18 -22 48 -43 -26 -50 -40 -61 -115 -195 -113 6426 14927 1315 229 29 10 27 28 70 101 -17 59
$$ packed form
6007c9P0J5o6l2J18o5Ko4N5On8%J10n8LK6L6l0k4k4JL5k0Lk9L8k3K4O0r8k4j8m8pj4l9J44
5543c4J02j27%j2O0p2l2k6M9J54j84oK6m1K48N6m2j56MLJ8p0K07p7j06Q8Q8j77J90p1j42J3
5143f9J17k7M9n7p2P4j60J83n3K7M6j46K5O1K9j0m0K3K4r4Q7p3M0j12j40K80J9j00R0p2K4
4755b7Oj56K09J2o2kR7j10J10Q2j20j09m9N8J78m7j55j4J31K9K8r7L2q5MJ50m4J3o0J65j51
4366A6O1PQ5k54J61k8m6r6l0J00Q8j2j7l5O0j12Rm4K9P2Jk7j6L7J5KK4q1o6p0J40o8N9oJ11
3928F9p1OM1j51J17j6m7O3j27Q5P7l7l5l5K3Qj55J16R5n9K5j11K7J39j10%o5J03JkJ08n8k3
3515Aq7m9J04L8n2J12m4m1mP0r1J7k4J0k1n4q0Q2O539Q501j3612j086k00j9J7JM2L1j18P6
$$ [...]
-391A00
##END NTUPLES=	nD NMR SPECTRUM
##END=	
##END=	
