##TITLE=	Feb21-2022.1.fid
T Mies TM-VI-170 in d6-acetone ; 13C{1H} spectrum using DRX400 ; Feb21-2022/1
##JCAMP-DX=	6.0	$$ MestReNova 14.3.0-30573
##DATA TYPE=	LINK
##BLOCK_ID=	1
##BLOCKS=	3    
##ORIGIN=	Mestrelab Research S.L.
##OWNER=	hrzepa
##$MNOVA/LINK_BLOCK_TYPE=	ITEM	$$ NMR Spectrum
##$MNOVA/ITEM/POLYGON=	(XY..XY)
5321,5835
8722,5835
8722,8208
5321,8208
5321,5835
##$MNOVA/ITEM/Z=	0
##$MNOVA/ITEM/ANGLE=	0
##TITLE=	Feb21-2022.1.fid
##JCAMP-DX=	6.0	$$ MestReNova 14.3.0-30573
##BLOCK_ID=	2
##DATA TYPE=	MNOVA NMR VIEW DATA
##DATA CLASS=	MNOVA VIEW DATA
##$MNOVA/ITEM/ZOOM/X=	-11.477061178067060609,	217.80603993489785353
##$MNOVA/ITEM/ZOOM/Y=	-167.07194394320887909,	1600.9195071975032079
##END=	
##TITLE=	Feb21-2022.1.fid
##JCAMP-DX=	6.0	$$ MestReNova 14.3.0-30573
##BLOCK_ID=	3
##DATA TYPE=	NMR SPECTRUM
##DATA CLASS=	XYDATA
##NUMDIM=	1
##ORIGIN=	Bruker Analytik GmbH
##OWNER=	psm
##.OBSERVE FREQUENCY=	100.60145830999100269
##.OBSERVE NUCLEUS=	^13C
##.SOLVENT NAME=	Acetone
##.PULSE SEQUENCE=	zgpg30
##LONGDATE=	2022/02/21 18:46:28.000
##.ACQUISITIONMODE=	SIMULTANEOUS (DQD)
##$ORIGINAL FORMAT=	Bruker XWIN-NMR
##$MNOVA/SCALES_VERSION=	9
##$PARAMETER FILE=	(acqus, ASCII, //ch-nmrserv3.ch.ic.ac.uk/DRX-400/agmb/nmr/Feb21-2022/1/acqus, 0)
$$ ##TITLE= Parameter file, TOPSPIN		Version 1.3
$$ ##JCAMPDX= 5.0
$$ ##DATATYPE= Parameter Values
$$ ##ORIGIN= Bruker Analytik GmbH
$$ ##OWNER= psm
$$ $$ 2022-02-22 09:46:45.227 +0000  nmrsu@d400
$$ $$ /opt/topspin/data/agmb/nmr/Feb21-2022/1/acqus
$$ ##$AMP= (0..31)
$$ 100 100 100 100 100 100 100 100 100 100 100 100 100 100 100 100 100 100 
$$ 100 100 100 100 100 100 100 100 100 100 100 100 100 100
$$ ##$ANAVPT= -1
$$ ##$AQSEQ= 0
$$ ##$AQ_mod= 1
$$ ##$AUNM= <au_zgonly>
$$ ##$AUTOPOS= <>
$$ ##$BF1= 100.591395
$$ ##$BF2= 400.045
$$ ##$BF3= 100.591395
$$ ##$BF4= 100.591395
$$ ##$BF5= 500.13
$$ ##$BF6= 500.13
$$ ##$BF7= 500.13
$$ ##$BF8= 500.13
$$ ##$BYTORDA= 1
$$ ##$CFDGTYP= 0
$$ ##$CFRGTYP= 5
$$ ##$CHEMSTR= <none>
$$ ##$CNST= (0..63)
$$ 1 1 145 1 1 1 1 1 1 1 1 1 1 1 1 1 1 1 1 1 1 1 1 1 1 1 1 1 1 1 1 1 1 1 
$$ 1 1 1 1 1 1 1 1 1 1 1 1 1 1 1 1 1 1 1 1 1 1 1 1 1 1 1 1 1 1
$$ ##$CPDPRG= <waltz16>
$$ ##$CPDPRG1= <>
$$ ##$CPDPRG2= <waltz16>
$$ ##$CPDPRG3= <>
$$ ##$CPDPRG4= <mlev>
$$ ##$CPDPRG5= <mlev>
$$ ##$CPDPRG6= <mlev>
$$ ##$CPDPRG7= <mlev>
$$ ##$CPDPRG8= <mlev>
$$ ##$CPDPRGB= <>
$$ ##$CPDPRGT= <>
$$ ##$D= (0..63)
$$ 0 1 0.00345 0 0 0 0 0 0 0.06 0 0.03 2e-05 3e-06 0 0 0.0002 0 0 0 0 0 0 
$$ 0 0 0 0 0 0 0 0 0 0 0 0 0 0 0 0 0 0 0 0 0 0 0 0 0 0 0 0 0 0 0 0 0 0 0 
$$ 0 0 0 0 0 0
$$ ##$DATE= 1645469188
$$ ##$DBL= (0..7)
$$ 120 120 120 120 120 120 120 120
$$ ##$DBP= (0..7)
$$ 150 150 150 150 150 150 150 150
$$ ##$DBP07= 0
$$ ##$DBPNAM0= <>
$$ ##$DBPNAM1= <>
$$ ##$DBPNAM2= <>
$$ ##$DBPNAM3= <>
$$ ##$DBPNAM4= <>
$$ ##$DBPNAM5= <>
$$ ##$DBPNAM6= <>
$$ ##$DBPNAM7= <>
$$ ##$DBPOAL= (0..7)
$$ 0.5 0.5 0.5 0.5 0.5 0.5 0.5 0.5
$$ ##$DBPOFFS= (0..7)
$$ 0 0 0 0 0 0 0 0
$$ ##$DE= 6
$$ ##$DECBNUC= <off>
$$ ##$DECIM= 4
$$ ##$DECNUC= <off>
$$ [...]
$$ -1 -1 -1 -1 -1 -1 -1 -1 -1 -1 -1 -1 -1 -1 -1 -1 -1 -1 -1 -1 -1 -1 -1 -1 
$$ -1 -1 -1 -1 -1 -1 -1 -1 -1 -1 -1 -1 -1 -1 -1 -1 -1 -1 -1 -1 -1 -1 -1 -1 
$$ -1 -1 -1 -1 -1 -1 -1 -1 -1 -1 -1 -1 -1 -1 -1 -1 -1 -1 -1 -1 -1 -1 -1 -1 
$$ -1 -1 -1 -1 -1 -1 -1 -1 -1 -1 -1 -1 -1 -1 -1 -1 -1 -1 -1 -1 -1 -1 -1 -1 
$$ -1 -1 -1 -1 -1 -1 -1 -1 -1 -1 -1 -1 -1 -1 -1 -1 -1 -1 -1 -1 -1 -1 -1 -1 
$$ -1 -1 -1 -1 -1 -1 -1 -1 -1 -1 -1 -1 -1 -1 -1 -1 -1 -1 -1 -1 -1 -1 -1 -1 
$$ -1 -1 -1 -1 -1 -1 -1 -1 -1 -1 -1 -1 -1 -1 -1 -1 -1 -1 -1 -1 -1 -1 -1 -1 
$$ -1 -1 -1 -1 -1 -1 -1 -1 -1 -1 -1 -1 -1 -1 -1 -1 -1 -1 -1 -1 -1 -1 -1 -1 
$$ -1 -1 -1 -1 -1 -1 -1 -1 -1 -1 -1 -1 -1 -1 -1 -1 
$$ ##$RG_tab7= (0..255)
$$ -1 -1 -1 -1 -1 -1 -1 -1 -1 -1 -1 -1 -1 -1 -1 -1 -1 -1 -1 -1 -1 -1 -1 -1 
$$ -1 -1 -1 -1 -1 -1 -1 -1 -1 -1 -1 -1 -1 -1 -1 -1 -1 -1 -1 -1 -1 -1 -1 -1 
$$ -1 -1 -1 -1 -1 -1 -1 -1 -1 -1 -1 -1 -1 -1 -1 -1 -1 -1 -1 -1 -1 -1 -1 -1 
$$ -1 -1 -1 -1 -1 -1 -1 -1 -1 -1 -1 -1 -1 -1 -1 -1 -1 -1 -1 -1 -1 -1 -1 -1 
$$ -1 -1 -1 -1 -1 -1 -1 -1 -1 -1 -1 -1 -1 -1 -1 -1 -1 -1 -1 -1 -1 -1 -1 -1 
$$ -1 -1 -1 -1 -1 -1 -1 -1 -1 -1 -1 -1 -1 -1 -1 -1 -1 -1 -1 -1 -1 -1 -1 -1 
$$ -1 -1 -1 -1 -1 -1 -1 -1 -1 -1 -1 -1 -1 -1 -1 -1 -1 -1 -1 -1 -1 -1 -1 -1 
$$ -1 -1 -1 -1 -1 -1 -1 -1 -1 -1 -1 -1 -1 -1 -1 -1 -1 -1 -1 -1 -1 -1 -1 -1 
$$ -1 -1 -1 -1 -1 -1 -1 -1 -1 -1 -1 -1 -1 -1 -1 -1 -1 -1 -1 -1 -1 -1 -1 -1 
$$ -1 -1 -1 -1 -1 -1 -1 -1 -1 -1 -1 -1 -1 -1 -1 -1 -1 -1 -1 -1 -1 -1 -1 -1 
$$ -1 -1 -1 -1 -1 -1 -1 -1 -1 -1 -1 -1 -1 -1 -1 -1 
$$ ##$RG_tab8= (0..255)
$$ -1 -1 -1 -1 -1 -1 -1 -1 -1 -1 -1 -1 -1 -1 -1 -1 -1 -1 -1 -1 -1 -1 -1 -1 
$$ -1 -1 -1 -1 -1 -1 -1 -1 -1 -1 -1 -1 -1 -1 -1 -1 -1 -1 -1 -1 -1 -1 -1 -1 
$$ -1 -1 -1 -1 -1 -1 -1 -1 -1 -1 -1 -1 -1 -1 -1 -1 -1 -1 -1 -1 -1 -1 -1 -1 
$$ -1 -1 -1 -1 -1 -1 -1 -1 -1 -1 -1 -1 -1 -1 -1 -1 -1 -1 -1 -1 -1 -1 -1 -1 
$$ -1 -1 -1 -1 -1 -1 -1 -1 -1 -1 -1 -1 -1 -1 -1 -1 -1 -1 -1 -1 -1 -1 -1 -1 
$$ -1 -1 -1 -1 -1 -1 -1 -1 -1 -1 -1 -1 -1 -1 -1 -1 -1 -1 -1 -1 -1 -1 -1 -1 
$$ -1 -1 -1 -1 -1 -1 -1 -1 -1 -1 -1 -1 -1 -1 -1 -1 -1 -1 -1 -1 -1 -1 -1 -1 
$$ -1 -1 -1 -1 -1 -1 -1 -1 -1 -1 -1 -1 -1 -1 -1 -1 -1 -1 -1 -1 -1 -1 -1 -1 
$$ -1 -1 -1 -1 -1 -1 -1 -1 -1 -1 -1 -1 -1 -1 -1 -1 -1 -1 -1 -1 -1 -1 -1 -1 
$$ -1 -1 -1 -1 -1 -1 -1 -1 -1 -1 -1 -1 -1 -1 -1 -1 -1 -1 -1 -1 -1 -1 -1 -1 
$$ -1 -1 -1 -1 -1 -1 -1 -1 -1 -1 -1 -1 -1 -1 -1 -1 
$$ ##$ROUTER= 2
$$ ##$RX22TY= <tty10>
$$ ##$SCMTY= <no>
$$ ##$SPECTR= 5
$$ ##$SY2FLAG= 0
$$ ##$TFXNUM= 0
$$ ##$TRIPLO2= 0
$$ ##$VTUTY= <tty05>
$$ ##$WBREFAM= (0..15)
$$ 100 100 100 100 100 100 100 100 100 100 100 100 100 100 100 100 
$$ ##$WBREFPH= (0..15)
$$ 0 0 0 0 0 0 0 0 0 0 0 0 0 0 0 0 
$$ ##$XFAC= 2
$$ ##END=
$$ 
##$DECIM=	4
##$DSPFVS=	10
##XUNITS=	HZ
##YUNITS=	ARBITRARY UNITS
##FIRSTX=	24277.203142085912987
##LASTX=	-3970.9533892965355335
##DELTAX=	-0.43103923905367280689
##XFACTOR=	1
##YFACTOR=	0.10364426221987964316
##FIRSTY=	13.406902313232421875
##MINY=	-44.442592620849609375
##MAXY=	47173.0859375
##NPOINTS=	65536
##XYDATA=	(X++(Y..Y))
$$ plain form
24277 129 128 128 127 127 126 126 125 125 122 119 116 113 110 107 104 101 98 95 92 89 86 84 80 77 73 58 61 59 59 59 59 59 59 59 59 60 60 60 60 61 62 64 66 67 69 71 72 74 72 70 69 67 60 53 47 40 36 31 32 33 31 29 27 24 23 21 19
24248 19 18 16 14 12 11 9 8 6 5 8 12 16 19 21 23 25 26 28 30 32 33 40 47 53 60 67 73 80 86 89 91 93 96 93 90 87 84 86 87 88 90 91 93 94 96 98 101 103 106 109 111 114 117 117 118 118 119 120 120 120 121 116 109 103 97 91 85 78 72
24219 72 68 63 60 54 50 46 40 37 38 42 44 47 49 52 54 56 58 57 53 48 47 45 44 42 43 43 44 44 40 35 31 27 22 17 15 17 18 22 28 37 46 53 57 59 57 55 53 50 50 50 51 51 51 51 52 51 45 39 34 28 22 16 10 5 4 3 2 1 1
24189 1 0 -1 -1 5 12 18 25 28 29 30 32 36 40 44 47 52 59 70 80 92 104 113 118 121 121 119 114 109 107 107 109 112 115 118 121 122 123 121 115 106 97 88 79 73 71 72 73 71 69 69 66 61 56 51 46 46 46 46 46 48 51 54 56 59 62 64
24160 64 67 71 74 78 81 85 88 92 96 91 87 83 79 75 71 67 63 61 59 57 55 54 52 50 48 45 42 39 35 33 28 20 20 26 32 24 14 5 3 0 -7 -13 -14 -8 -5 -3 -5 -4 -4 -1 2 6 9 13 16 20 23 27 31 35 38 37 35 34 32 33 33 33
24131 33 33 33 33 33 33 35 38 40 42 39 36 33 30 28 25 23 20 23 26 28 31 33 35 37 39 41 43 45 47 47 48 49 50 51 52 53 54 45 37 29 21 18 15 12 9 5 1 -1 -5 -14 -24 -33 -42 -46 -50 -54 -58 -53 -48 -43 -38 -36 -34 -27 -15 -8 -6
24102 -6 -3 2 15 28 36 38 39 41 42 43 38 33 28 23 18 13 8 3 1 0 -2 -3 -5 -7 -9 -11 -11 -11 -11 -11 -6 -1 3 9 8 8 8 8 7 7 7 6 10 13 16 19 22 25 28 32 30 29 28 26 25 24 22 21 15 8 2 -3 -10 -16 -23 -29 -38 -48
24073 -48 -57 -67 -67 -68 -69 -70 -66 -62 -58 -55 -51 -47 -44 -40 -41 -42 -43 -44 -40 -35 -31 -27 -31 -36 -40 -44 -50 -53 -61 -63 -57 -50 -47 -46 -51 -50 -46 -33 -10 6 17 27 47 66 80 84 85 81 79 77 80 83 87 90 90 90 90 90 90 90
$$ packed form
24277A29j%j%j%j%lllllllllllllkmlmj5Lk%%%%%%%J%%%JJKKJKKJKkkjkppopmnJJkkkljkk
24248A9jkkkjkjkjLMMLKKKJKKKJPPOPPOPOLKKLllllKJJKJKJKKLKLLKLL%J%JJ%%Jnpoooopo
24219G2mnlommolJMKLKLKKKjmnjkjkJ%J%mnmmnnkKJMORRPMKkkkl%%J%%%Jjoonoooonjjjj%
24189Ajj%OPOPLJJKMMMLNPJ1J0J2J2RNL%knnk%KLLLLJJkorrrrokJJkk%lnnnn%%%%KLLKLLK
24160F4LMLMLMLMMnmmmmmmmkkkkjkkklllmknq%OOqj0rklpojOLKkJ%LLMLMLMLMMMLjkjkJ%%
24131C3%%%%%KLKKllllklklLLKLKKKKKKKK%JJJJJJJrqqqllllmmkmrj0rrmmmmNNNNKKPJ2PK
24102fLNJ3J3QKJKJJnnnnnnnnkjkjkkkk%%%%NNMOj%%%j%%jMLLLLLLMkjjkjjkjoponpoporj0
24073d8rj0%jjjMMMLMMLMjjjjMNMMmnmmolqkOPLJnJMJ3K3J6J1J0K0J9J4MJmkkLLML%%%%%%
$$ plain form
24047 90 90 90 92 95 97 100 100 100 99 99 95 90 90 82 69 57 47 32 15 3 -21 -46 -59 -57 -57 -69 -79 -88 -99 -110 -110 -111 -112 -113 -115 -116 -117 -118 -124 -130 -126 -121 -113 -104 -84 -54 -9 31 53 45 7
24025 7 -31 -59 -68 -76 -90 -102 -110 -107 -104 -101 -97 -98 -100 -101 -102 -94 -86 -79 -71 -63 -56 -48 -40 -35 -31 -26 -21 -24 -27 -29 -32 -38 -44 -50 -55 -61 -67 -72 -78 -79 -81 -82 -83 -87 -91 -94 -98 -96 -94 -92 -91 -84 -78 -72 -66 -56 -47 -38 -29 -25 -21 -18 -14 -15 -16
23997 -16 -10 0 13 25 37 49 57 59 60 69 86 98 103 108 118 122 112 103 96 99 101 94 77 54 32 15 0 -7 -18 -29 -38 -41 -47 -53 -55 -56 -57 -59 -52 -46 -39 -32 -26 -19 -13 -6 -6 -5 -5 -5 -10 -15 -22
23974 -22 -25 -18 -11 -17 -29 -37 -37 -41 -46 -47 -43 -41 -40 -33 -26 -19 -13 -7 -7 -14 -21 -22 -24 -25 -27 -23 -19 -16 -12 -6 -6 -12 -19 -22 -26 -30 -33 -32 -30 -28 -26 -21 -16 -11 -6 -6 -7 -8 -9 -9 -9 -9 -9 -6 -4 -1 1 0 -2 -5 -7 -13 -20 -26 -33 -39 -45 -54
23945 -54 -58 -59 -60 -60 -60 -64 -68 -72 -75 -79 -83 -87 -91 -96 -101 -107 -112 -112 -111 -111 -110 -113 -115 -118 -120 -123 -125 -128 -130 -122 -115 -107 -99 -92 -84 -76 -68 -62 -56 -50 -44 -38 -32 -26 -20 -14 -9 -3 1 7 12 18 23 25 26 28 29 31 32 34 35 32 28 25 22 19 16 19 21
23915 21 24 27 23 14 4 0 -3 3 18 39 69 105 129 118 76 34 9 0 -10 -15 -21 -27 -30 -28 -27 -26 -28 -24 -14 -9 -12 -14 -16 -19 -19 -14 -6 1 3 6 7 9 10 11 18 25 24 18 10 2 -1 -4 -3 -3 -2 -1 -9
23891 -9 -17 -25 -33 -45 -58 -70 -82 -91 -95 -103 -110 -117 -124 -131 -138 -142 -147 -152 -156 -161 -165 -169 -173 -174 -170 -164 -158 -156 -164 -176 -188 -193 -184 -160 -121 -80 -39 -8 10 16 13 4 -17 -32 -48 -63 -90 -124 -159 -176
23869 -176 -182 -173 -160 -151 -148 -150 -152 -151 -138 -122 -107 -100 -94 -84 -69 -57 -44 -40 -36 -31 -27 -22 -9 3 8 3 -1 -4 -2 0 -1 -11 -20 -21 -23 -26 -34 -45 -56 -67 -78 -89 -101 -112 -123 -126 -129 -132 -135
$$ packed form
24047I0%%KLKL%%j%mn%qj3j2j0j5j7j2k4k5j3K%j2j0rj1j1%jjjkjjjooMNQRK0L0M5M0K2ql8
24025Gl8k8rqj4j2qLLLMjkjjQQPQQPQQNMNNllklooonoonojkjjmmlmKKKJPOOOJ0RRRMMLMjj
23997a6OJ0J3J2J2J2QKJRJ7J2NNJ0Mj0rpLKpj7k3k2j7j5pj1j1rlookjjkPOPPOPOP%J%%nnp
23974b2lPPoj2q%mnjMKJPPPOO%ppjkjkMMLMO%oplmmlJKKKNNNN%jjj%%%%LKLKjklkopopoor
23945e4mjj%%mmmlmmmmnnon%J%JlklklklkQPQQPQQQOOOOOOOOONOMONONKJKJKJKJlmllllLK
23915B1LLmrj0mlOJ5K1L0L6K4j1m2m2k5rj0noolKJJkMJ0Nlkkl%NQPKLJKJJPPjoqqllJ%JJq
23891iqqqj2j3j2j2rmqpppppmnnmnmmmjMOOKqj2j2nRK4L9M1M1L1J8Olrk1j5j6j5k7l4l5j7
23869a76oRJ3RLkkJJ3J6J5POJ0J5J2J3MMNMNJ3J2NnmlKKjj0rjklqj1j1j1j1j1j2j1j1llll
$$ plain form
23848 -135 -136 -136 -136 -137 -133 -129 -125 -121 -121 -121 -122 -122 -122 -121 -121 -121 -114 -108 -102 -95 -95 -95 -97 -94 -78 -54 -29 -13 10 34 57 63 61 60 63 66 71 75 75 74 64 54 48 43 45 38 19 1 -13 -16 -26 -36 -49
23825 -49 -61 -70 -67 -69 -70 -76 -82 -78 -75 -71 -67 -64 -60 -57 -54 -60 -67 -74 -80 -85 -89 -83 -77 -72 -67 -71 -75 -85 -76 -61 -45 -35 -25 -20 -26 -27 -27 -24 -20 -11 -2 0 4 2 1 0 -2 -2 -3 -4 -4 0 3 13 23 37 51 54 58
23800 58 52 46 45 45 47 48 40 31 29 27 22 6 -5 -7 -5 -2 -6 -10 -13 -17 -19 -21 -23 -25 -28 -30 -32 -34 -40 -46 -51 -57 -54 -51 -48 -45 -53 -61 -69 -77 -79 -82 -85 -87 -87 -86 -86 -86 -85 -85 -84 -84 -82 -81 -79 -77 -73 -69 -64 -60 -55 -51 -46 -41 -39 -37 -41
23771 -41 -44 -43 -42 -52 -61 -76 -92 -100 -103 -104 -114 -129 -145 -136 -127 -123 -127 -130 -123 -112 -100 -98 -95 -87 -80 -75 -70 -65 -61 -58 -56 -63 -71 -74 -76 -73 -70 -61 -52 -48 -57 -99 -177 -253 -306 -320 -323 -320 -317 -312 -308 -303 -299 -298 -298 -295
23747 -295 -286 -277 -260 -236 -213 -184 -155 -137 -119 -103 -88 -77 -77 -71 -65 -56 -54 -57 -60 -63 -66 -66 -57 -48 -47 -55 -62 -69 -76 -71 -54 -36 -24 -13 -8 -7 -11 -21 -25 -27 -20 -15 -10 -10 -10 -15 -19 -24 -29 -33 -37 -40 -44
23724 -44 -43 -41 -40 -39 -33 -27 -21 -15 -16 -17 -7 3 11 14 15 16 17 24 30 31 32 33 34 35 31 26 22 18 9 0 -8 -18 -27 -36 -45 -54 -65 -76 -87 -98 -114 -134 -153 -178 -200 -216 -202 -173 -145 -134 -125 -116
23701 -116 -102 -89 -80 -79 -77 -76 -76 -75 -71 -66 -62 -58 -56 -55 -53 -52 -58 -64 -70 -77 -78 -79 -80 -81 -79 -77 -75 -73 -76 -79 -83 -86 -95 -104 -114 -123 -127 -131 -135 -139 -140 -141 -142 -143 -153 -163 -172 -182 -182 -177 -176 -174 -179 -189 -198 -201 -204 -174 -138
23676 -138 -93 -66 -45 -37 -33 -30 -27 -24 -21 -20 -18 -16 -15 -16 -17 -18 -19 -25 -31 -37 -44 -48 -53 -58 -63 -68 -73 -77 -82 -91 -100 -108 -117 -120 -124 -127 -130 -131 -131 -131 -131 -131 -131 -132 -132 -128 -124 -121 -117 -113 -109 -106 -102 -102 -103 -104 -104 -104 -105 -105 -105 -104 -102 -96 -89
$$ packed form
23848a35j%%jMMMM%%j%%J%%POOP%%kLJ6K4K5J6K3K4K3OkjLLNM%jj0j0onKpj9j8j4lj0j0j3
23825d9j2rLkjooMLMMLMLLopponmOONNmmj0RJ5J6J0J0Noj%LMRRKMkjjk%jj%MLJ0J0J4J4LM
23800E8ooj%KJqrkknj6j1kKLmmlmkkkklkkkoonoLLLLqqqqkllk%J%%J%J%KJKKMMNMNMNNKKm
23771d1lJJj0rj5j6qljj0j5j6RRMmlPJ1J2KLQPNNNMLKpqlkLLRRMrm2p8p6n3j4lLLNMNMJ%L
23747b95RRJ7K4K3K9K9J8J8J6J5J1%OORKllll%RRJqpppNJ7J8J2J1NJmj0mkPNN%%nmnnmmlm
23724d4JKJJOOOOjjJ0J0QLJJJPOJJJJJmnmmrrqj0rrrrj1j1j1j1j6k0j9k5k2j6J4K9K8J1RR
23701a16J4J3RJKJ%JMNMMKJKJooopjjjjKKKKllmlrrj0rmmmmjjjjj0j0rj0%NJKnj0rllL0L6
23676a38M5K7K1QMLLLLJKKJjjjjooopmnnnnnmnrrqrlmllj%%%%%j%MMLMMMLM%jj%%j%%JKOP
$$ plain form
23648 -89 -83 -82 -85 -90 -96 -96 -94 -92 -90 -88 -90 -93 -95 -92 -85 -76 -67 -64 -71 -82 -89 -90 -64 -29 11 40 64 76 74 71 68 65 63 61 59 58 57 57 57 56 56 56 56 55 51 47 43 39 44 49 53 58 58 58 57 57 57 57 57 56 52 47
23621 47 42 37 32 27 23 18 14 9 5 1 -2 -7 -11 -15 -14 -14 -13 -12 -16 -19 -22 -26 -25 -19 0 45 106 161 204 220 228 228 224 212 186 145 97 48 17 8 5 1 0 3 7 6 4 8 8 8 6 4 2 0 -6 -13 -19
23597 -19 -26 -31 -36 -30 -24 -23 -21 -19 -17 -14 -10 -13 -4 11 36 56 76 81 70 64 64 72 79 87 94 92 84 79 74 72 69 67 65 67 69 71 73 75 77 79 81 77 72 68 64 59 53 48 43 37 32 27 21 10 0 -10 -21 -31 -42
23571 -42 -53 -63 -70 -77 -83 -90 -88 -87 -86 -85 -85 -84 -84 -84 -78 -72 -66 -59 -53 -47 -41 -35 -34 -32 -30 -29 -25 -20 -16 -12 -8 -4 0 3 0 -3 -7 -11 -14 -18 -18 -24 -35 -46 -49 -48 -44 -41 -42 -53 -68 -79 -83 -73 -50 -22 2 27
23546 27 54 62 59 51 41 37 43 54 64 58 30 2 -18 -35 -53 -72 -89 -98 -94 -90 -90 -95 -97 -100 -100 -101 -102 -102 -106 -109 -112 -115 -115 -114 -114 -113 -113 -112 -112 -111 -107 -103 -99 -95 -89 -87 -83 -78 -73 -67 -61 -56 -50 -44 -39 -33 -32 -31
23521 -31 -30 -29 -35 -46 -54 -63 -71 -80 -88 -96 -98 -94 -93 -93 -94 -94 -95 -96 -97 -98 -99 -100 -93 -86 -79 -71 -64 -57 -50 -43 -43 -43 -44 -44 -42 -40 -37 -35 -34 -33 -32 -31 -42 -52 -62 -73 -79 -86 -93 -100 -101 -102 -102 -103 -113 -123 -133 -143 -147 -151
23495 -151 -155 -159 -158 -157 -155 -153 -156 -145 -122 -104 -91 -84 -74 -64 -61 -58 -55 -52 -46 -41 -35 -29 -30 -30 -31 -31 -30 -29 -27 -26 -20 -14 -9 -3 1 6 11 16 19 22 24 27 26 26 26 26 23 20 17 14 9 3 -1 -7 -12 -18 -23 -29 -30 -32 -33 -34
23469 -34 -35 -37 -38 -39 -36 -33 -30 -27 -23 -20 -17 -14 -18 -21 -25 -29 -32 -36 -40 -43 -41 -39 -37 -35 -36 -37 -37 -38 -42 -45 -49 -53 -47 -41 -35 -29 -24 -19 -13 -8 -9 -9 -10 -11 -11 -12 -12 -13 -7 -2 3 8 18 27 37 46 48 50 51 53 56 58 61 63 66 69 61
$$ packed form
23648h9OJlno%KKKKklkLPRRLpj1pjK6L5M0K9K4J2klllkkkjj%%j%%%jmmmmNNMN%%j%%%%jmn
23621D7nnnnmnmnmmlnmmJ%JJmllmJOJ9M5O1N5M3J6Q%mj2k6m1m8m9l1rlmjLMjkM%%kkkkopo
23597a9pnnOOJKKKLMlRJ5K5K0K0Nj1o%QPQPkqnnklkkKKKKKKKKmnmmnonnonnoj1j0j0j1j0j1
23571d2j1j0ppopKJJJ%J%%OOOPOOOOJKKJMNMMMMMLllmmlm%oj1j1lJMLjj1j5j1mJ0K3K8K4K5
23546B7K7Qlqj0mOJ1J0ok8k8k0j7j8j9j7rMM%nkl%jj%mlll%J%J%J%JMMMMOKMNNOONOONOJJ
23521c1JJoj1qrqrqqkMJ%j%jjjjjjPPPQPPPP%%j%KKLKJJJJj1j0j0j1opppjj%jj0j0j0j0mm
23495a51mmJJKKlJ1K3J8J3PJ0J0LLLLONOOj%j%JJKJOONOMNNNLLKLj%%%llllnomononojkjj
23469c4jkjjLLLLMLLLmlmmlmmlKKKKjj%jmlmmOOOONNONj%jj%j%jONNNJ0RJ0RKKJKLKLKLLq
$$ plain form
23440 61 53 54 54 37 8 -26 -61 -93 -102 -102 -111 -124 -137 -137 -138 -138 -139 -143 -146 -157 -155 -147 -139 -131 -122 -124 -125 -127 -128 -123 -119 -114 -110 -110 -110 -110 -110 -103 -85 -70 -60 -49 -33 -15 -6 -8 -10 -12 -15 -18 -21 -24 -27 -30 -33
23416 -33 -36 -39 -43 -47 -52 -56 -47 -38 -24 -19 -20 -22 -18 -6 13 29 33 32 33 34 40 54 70 80 79 74 67 60 55 63 77 82 82 82 83 84 74 64 60 55 51 46 47 47 47 47 57 66 75 84 88 88 81 75 73 72 70 68
23391 68 68 67 66 65 63 56 44 31 21 10 0 -9 -15 -20 -26 -31 -28 -25 -23 -20 -26 -31 -37 -43 -44 -45 -45 -46 -44 -43 -41 -39 -35 -30 -26 -22 -26 -30 -35 -39 -40 -42 -43 -44 -46 -47 -49 -50 -45 -41 -36 -32 -32 -33 -34 -34 -31 -28 -25 -22 -19 -16 -13 -10
23363 -10 -10 -9 -9 -9 -13 -18 -23 -28 -38 -48 -58 -69 -73 -78 -78 -78 -77 -76 -80 -90 -96 -91 -80 -70 -59 -48 -41 -43 -44 -40 -28 -16 -3 4 5 2 0 -2 -4 -7 0 6 14 21 25 30 35 39 36 34 31 28 23 18 10 7 7
23339 7 7 7 8 0 -15 -26 -38 -45 -53 -60 -67 -72 -77 -76 -76 -74 -72 -61 -51 -40 -34 -30 -26 -9 12 32 36 35 34 37 40 46 52 53 53 49 44 40 35 32 29 26 22 14 6 -2 -10 -19 -28 -36 -45 -46 -46 -46 -46 -47 -48 -49 -50 -53 -56
23313 -56 -60 -63 -64 -64 -65 -65 -60 -56 -51 -46 -46 -45 -45 -44 -41 -38 -35 -32 -29 -25 -22 -19 -21 -23 -24 -26 -26 -26 -27 -27 -24 -22 -26 -34 -43 -52 -56 -60 -65 -70 -70 -70 -68 -65 -62 -60 -58 -61 -70 -79 -85 -90 -95 -101 -102 -102 -103 -104 -104 -104 -107 -105 -97 -89 -75 -69 -67 -56
23283 -56 -34 -12 2 9 9 10 16 22 27 33 35 38 40 43 36 29 23 17 12 12 16 8 -10 -33 -55 -76 -99 -121 -135 -134 -129 -130 -136 -143 -144 -144 -144 -145 -140 -136 -131 -126 -124 -122 -123 -118 -108 -98 -88 -78 -73 -68 -63 -58 -54
23260 -54 -50 -47 -43 -35 -26 -17 -8 -4 -1 2 6 5 3 2 0 5 9 14 18 23 27 31 36 34 31 30 28 35 48 57 67 75 83 95 101 101 101 97 99 105 112 117 106 88 70 55 35 10 0 -1 -3 -8 -12 -17 -21 -31 -35 -31
$$ packed form
23440F1qJ%j7k9l4l5l2r%rj3j3%j%jmlj1KQQQRkjkjNMNM%%%%PJ8J5J0J1J6J8Rkkklllllll
23416c3llmmnmRRJ4NjkMJ2J9J6MjJJOJ4J6J0jnppnQJ4N%%JJj0j0mnmnJ%%%J0RRRM%pokjkk
23391F8%jjjkpj2j3j0j1j0rononLLKLonoojj%jKJKKMNMMmmnmjkjjkjkjNMNM%jj%LLLLLLLL
23363a0%J%%mnnnj0j0j0j1mn%%JJmj0oNJ1J0J1J1PkjMJ2J2J3PJlkkklPOQPMNNMlkllnnql%
23339G%%Jqj5j1j2pqppnnJ%KKJ1J0J1OMMJ7K1K0MjjLLOOJ%mnmnlllmqqqqrrqrj%%%jjjjll
23313e6mlj%j%NMNN%J%JLLLLLMLLkkjk%%j%LKmqrrmmnn%%KLLKKlrronnoj%jj%%lKQQJ4OKJ1
23283e6K2K2J4P%JOONOKLKLppoon%Mqj8k3k2k1k3k2j4JNjopj%%jNMNNKKjNJ0J0J0J0NNNNM
23260e4MLMQRRRMLLMjkjkNMNMNMMNkljkPJ3RJ0QQJ2O%%mKOPNj1j8j8j5k0k5j0jknmnmj0mM
$$ plain form
23235 -31 -28 -25 -22 -18 -15 -20 -25 -30 -34 -39 -44 -49 -54 -56 -58 -60 -63 -68 -73 -77 -82 -95 -107 -120 -133 -133 -133 -134 -134 -131 -128 -124 -121 -118 -115 -111 -108 -100 -92 -84 -76 -70 -65 -59 -54 -46 -38 -30 -23 -20 -18 -15 -13 -8 -3 0 5 4 3 3 2 6 11 15 19
23207 19 21 18 18 17 14 11 10 5 0 -5 -11 -16 -16 -16 -16 -16 -16 -16 -16 -15 -21 -27 -32 -38 -38 -39 -39 -40 -40 -41 -39 -42 -51 -66 -78 -90 -99 -109 -121 -129 -130 -132 -133 -134 -136 -138 -142 -141 -126 -92 -39 14 52 64 62 55 48 32
23182 32 18 9 3 -1 -6 -12 -22 -32 -45 -52 -51 -49 -51 -45 -28 -6 8 31 65 101 121 125 116 101 91 96 111 132 143 145 121 64 -1 -48 -67 -77 -81 -85 -86 -86 -90 -87 -79 -58 -41
23162 -41 -29 -25 -15 -4 5 12 14 12 4 0 1 1 -1 -8 -15 -12 -9 -9 -9 -9 -9 -6 -3 0 2 5 9 12 15 18 21 25 28 26 24 22 20 12 3 -4 -13 -16 -19 -22 -26 -27 -29 -31 -33 -37 -41 -46 -50 -46 -43 -39 -35 -29 -23 -17 -10 -7 -3 0 4 5
23134 5 7 8 9 15 21 27 32 36 39 42 45 49 53 56 60 64 67 71 75 84 94 104 114 118 123 128 132 133 133 133 134 129 124 119 114 106 98 90 82 67 52 42 33 22 12 -14 -42 -59 -65 -67 -78 -95 -113 -119 -116 -116
23110 -116 -115 -114 -112 -114 -115 -116 -118 -114 -111 -108 -104 -97 -90 -89 -96 -105 -109 -106 -103 -78 -48 -5 25 53 62 57 52 47 43 38 34 28 22 16 10 -2 -14 -26 -39 -46 -53 -60 -67 -70 -73 -76 -78 -76 -74 -72 -70 -64 -58 -58 -57 -60 -63 -59 -49
23084 -49 -39 -38 -43 -57 -74 -85 -96 -112 -131 -130 -117 -103 -103 -104 -105 -105 -102 -100 -87 -73 -71 -69 -67 -65 -70 -75 -80 -84 -89 -94 -99 -103 -100 -97 -94 -91 -96 -101 -96 -90 -89 -87 -80 -73 -66 -59 -47 -35 -24 -13 -3 7
23062 7 9 12 14 16 15 14 13 12 11 9 13 7 -8 -24 -44 -58 -67 -75 -84 -92 -100 -107 -115 -123 -125 -127 -127 -122 -113 -108 -107 -112 -110 -103 -93 -73 -51 -7 37 78 107 131 147 140 105 75 52 40 24 7 -3
$$ packed form
23235c1LLLMLnnnmnnnnkkklnnmnj3j2j3j3%%j%LLMLLLMLQQQQONONQQQPLKLKNNLNjj%jMNMM
23207A9Kl%jlljnnnon%%%%%%%Joono%j%j%jKlrj5j2j2rj0j2qjkjjkkmJJ5L4N3N3L8J2kppj6
23182C2j4romnoj0j0j3pJKkOJ7K2J4K3L4L6K0Mrj5j0NJ5K1J1Kk4n7o5m7j9j0mmj%mLQK1J7
23162d1J2MJ0J1RPKkqmJ%kppLL%%%%LLLKLMLLLLMLkkkkqrprlllmjkkkmmnmMLMMOOOPLMLMJ
23134EKJJOOONMLLLMMLMMLMMRJ0J0J0MNNMJ%%Jnnnnqqqqj5j5j0rj1j0k6k8j7okj1j7j8oL%
23110a16JJKkjjkMLLMPPJprmLLK5L0M3L0K8Rnnnmnmooooj2j2j2j3pppplllkKKKKOO%JllMJ0
23084d9J0Jnj4j7j1j1j6j9JJ3J4%jj%LKJ3J4KKKKnnnmnnnmLLLLnnNOJKPPPPJ2J2J1J1J0J0
23062GKLKKjjjjjkMoj5j6k0j4rqrqqpqqkk%NRNJnKPJ0K0K2M4M4M1K9K4J6pl5l0k3j2j6j7j0
$$ plain form
23040 -3 -13 -17 -22 -26 -30 -34 -38 -42 -46 -43 -40 -36 -33 -29 -26 -22 -18 -15 -11 -1 14 28 36 38 40 45 58 79 87 77 62 50 37 20 2 -11 0 26 52 56 60 67 78 79 75 70 65 67 74 82 91 92 88
23017 88 79 71 72 85 99 113 122 130 137 137 134 125 117 113 112 111 101 91 81 72 67 67 65 62 65 68 71 74 77 80 83 86 89 92 94 97 98 99 100 102 103 104 105 106 99 93 86 80 74 67 61 54 49 45 40 35 30 26 21 16 6 -3
22990 -3 -13 -23 -28 -33 -38 -43 -50 -57 -64 -71 -72 -68 -67 -66 -67 -69 -70 -72 -72 -67 -47 -28 5 34 56 52 25 -1 -15 -24 -39 -53 -60 -62 -60 -58 -63 -74 -81 -88 -90 -92 -89 -87 -84 -81 -76 -70 -65 -60 -55 -50 -44 -39 -41 -43 -44
22966 -44 -45 -38 -25 -15 -5 1 2 4 11 14 17 17 23 29 31 25 19 18 18 17 17 12 8 3 -1 -11 -21 -31 -41 -42 -43 -44 -46 -47 -48 -49 -50 -40 -30 -20 -10 -5 -1 3 8 10 13 15 17 20 22 25 27 26 25 24 22 19
22941 19 15 1 -12 -22 -31 -36 -40 -43 -46 -49 -52 -58 -63 -69 -74 -80 -86 -91 -97 -105 -113 -122 -130 -143 -156 -164 -189 -225 -257 -260 -252 -235 -218 -171 -99 -22 22 40 47 52 53 45 36 38 39 41 43 35 27 19 11 7 2 -1
22917 -1 -5 -5 -4 -3 -2 -8 -13 -19 -25 -30 -36 -41 -47 -46 -45 -44 -43 -42 -41 -40 -40 -43 -46 -54 -62 -73 -84 -85 -85 -79 -73 -67 -61 -54 -48 -41 -34 -34 -34 -33 -33 -32 -32 -32 -31 -30 -29 -24 -26 -43 -67 -91 -109 -121 -139 -156 -168 -168 -161 -155
22891 -155 -154 -158 -165 -170 -175 -180 -181 -177 -168 -153 -139 -131 -129 -129 -128 -127 -126 -122 -102 -76 -50 -55 -84 -110 -126 -132 -138 -142 -138 -133 -123 -113 -107 -105 -103 -101 -100 -93 -86 -79 -72 -71 -71 -70 -69 -74 -79 -83 -88 -93 -98 -102 -107 -112 -117 -122 -127 -132
22866 -132 -136 -141 -146 -146 -145 -145 -144 -137 -129 -122 -114 -107 -99 -92 -84 -81 -78 -75 -72 -69 -66 -63 -60 -59 -58 -57 -56 -60 -64 -69 -73 -71 -70 -69 -68 -67 -66 -65 -63 -56 -48 -40 -32 -16 0 16 33 43 53 63 73 78 83 88 93 91 90 89 87 91
$$ packed form
23040cj0mnmmmmmmLLMLMLMMLMJ0J5J4QKKNJ3K1Qj0j5j2j3j7j8j3J1K6K6MMPJ1JmnnKPQRJm
23017H8rqJJ3J4J4RQP%lrqmjjj0j0j0rn%klLLLLLLLLLLKLJJJKJJJJpopoopopnmnnnmnnj0r
22990cj0j0nnnnppppjMJJjkjk%NK0J9L3K9K2mk7k6j4rj5j4pkKKnj1ppkkLKLLNONNNNONkkj
22966d4jPJ3J0J0OJKPLL%OOKooj%j%nmnmj0j0j0j0jjjkjjjjJ0J0J0J0NMMNKLKKLKLKjjjkl
22941A9mj4j3j0rnmllllononoonoqqrqj3j3qk5l6l2lQJ7J7M7P2P7M4J8PNJqrKJKKqqqqmnl
22917am%JJJonoononoJJJJJJJ%llqqj1j1j%OOOOPOPP%%J%J%%JJJNkj7k4k4j8j2j8j7j2%PO
22891a55JmpnnnjMRJ5J4QK%JJJMK0K6K6nk9k6j6oomMNJ0J0OKKKJPPPPJ%JJnnmnnnmnnnnnn
22866a32mnn%J%JPQPQPQPQLLLLLLLLJJJJmmnmKJJJJJJKPQQQJ6J6J6J7J0J0J0J0NNNNkjjkM
$$ plain form
22841 91 95 94 83 55 22 -7 -38 -61 -84 -86 -83 -76 -74 -76 -83 -84 -79 -77 -76 -77 -78 -79 -80 -81 -82 -83 -84 -81 -77 -68 -68 -76 -79 -68 -56 -49 -41 -34 -27 -10 1 5 10 15 20 28 31 27 24 20 16 11 7 2 -2 -1 -1 0
22816 0 0 -1 -2 0 -3 -11 -14 0 20 42 51 65 84 99 106 103 96 91 92 90 87 79 70 62 54 41 29 17 5 -1 -8 -15 -22 -25 -28 -31 -34 -32 -30 -28 -26 -19 -13 -7 -1 5 12 19 26 20 14 15 22 32 43 38 18
22791 18 0 -17 -36 -55 -61 -62 -56 -51 -45 -46 -43 -40 -32 -23 -15 -7 1 10 19 28 28 28 28 28 24 19 15 11 7 2 -1 -5 -13 -21 -29 -37 -40 -43 -46 -49 -49 -49 -49 -49 -49 -49 -49 -49 -52 -54 -56 -58 -52 -45 -39 -32 -28 -24 -20 -15 -16 -17 -18 -19 -19
22763 -19 -20 -20 -21 -13 -5 3 11 16 21 27 32 37 43 48 53 58 62 67 71 75 78 82 85 88 91 86 62 33 -14 -55 -91 -92 -82 -71 -73 -87 -102 -109 -111 -113 -109 -102 -88 -83 -86 -84 -82 -84 -87 -81 -72 -67 -68 -69 -64 -61 -58 -55 -52
22738 -52 -58 -63 -67 -72 -77 -77 -72 -63 -56 -50 -42 -35 -28 -14 0 7 13 24 26 21 16 19 27 34 49 59 59 51 47 48 57 65 72 79 86 93 95 97 100 102 104 106 109 111 98 86 73 61 57 53 49 45 46 47 48 49 41 33 25 17
22712 17 8 -1 -10 -20 -21 -22 -23 -23 -24 -25 -26 -27 -28 -29 -30 -31 -35 -39 -43 -47 -46 -45 -44 -43 -40 -37 -34 -31 -28 -24 -21 -18 -19 -20 -21 -23 -19 -24 -27 -25 -25 -25 -25 -25 -37 -49 -61 -73 -80 -86 -93 -99 -101 -102 -103 -105 -103 -102 -100 -99 -98 -96 -95 -93
22684 -93 -88 -82 -77 -71 -66 -60 -55 -49 -48 -46 -44 -43 -41 -40 -38 -37 -37 -37 -38 -38 -38 -39 -39 -39 -44 -49 -54 -60 -65 -70 -75 -80 -83 -85 -88 -91 -93 -96 -98 -101 -103 -106 -108 -110 -104 -98 -91 -85 -79 -73 -67 -61 -55 -49 -42 -36 -29 -22 -15 -8 -1 6 13 20 21 23 24 25 27
22654 27 28 29 31 29 28 29 25 15 6 -3 -13 -13 -13 -14 -14 -14 -15 -12 -15 -22 -29 -39 -44 -43 -47 -58 -69 -77 -80 -81 -82 -88 -100 -106 -100 -97 -99 -103 -107 -106 -104 -101 -92 -77 -63 -56 -54 -55 -56 -57 -58 -59 -61 -62 -63 -64 -65 -66 -67 -68 -70
$$ packed form
22841I1Mjj1k8l3k9l1k3k3kLPKkpjNKJjjjjjjjjLMR%qlJ1J2PQPPJ7J1MNNNQLmlmmnmnmJ%J
22816@%jjKlqlJ4K0K2RJ4J9J5PlpnJklqrqqj3j2j2j2opppllllKKKKPOOOOPPPooJPJ0J1nk0
22791A8j8j7j9j9ojONOjLLQRQQQRRR%%%%mnmmmnlmqqqqllll%%%%%%%%lkkkOPOPMMMNjjjj%
22763a9j%jQQQQNNONNONNNMNMMLMLLLnk4k9m7m1l6jJ0J1kj4j5pkkMPJ4NlKKklORNjjNLLLL
22738e2onmnn%NRPOQPPJ4J4POJ1KnnLQPJ5J0%qmJRQPPPPKKLKKKLKj3j2j3j2mmmmJJJJqqqq
22712A7rrrj0jjj%jjjjjjjjmmmmJJJJLLLLLMLLjjjkMnlK%%%%j2j2j2j2popokjjkKJKJJKJK
22684i3NONONONOJKKJKJKJ%%j%%j%%nnnonnnnlkllklklklkkOOPOOOOOOOPOPPPPPPPPJKJJK
22654B7JJKkjJmj0rrj0%%j%%jLlppj0nJmj1j1qljjoj2oOLkmmJKLRJ5J4PKjjjjjkjjjjjjjk
$$ plain form
22628 -70 -72 -73 -77 -81 -80 -79 -75 -71 -60 -44 -28 -17 -13 -9 -3 2 7 13 14 14 17 15 10 5 10 14 12 -4 -18 -23 -10 -2 -8 -13 -11 1 13 16 10 3 -7 -29 -57 -84 -92 -81 -51 -22 -2 6 13 26
22606 26 40 46 44 43 42 40 38 36 34 33 22 11 0 -10 -12 -14 -16 -18 -16 -13 -11 -8 -14 -20 -27 -33 -33 -33 -33 -33 -33 -33 -33 -33 -30 -27 -24 -21 -27 -32 -36 -40 -36 -13 11 32 41 46 58 79 96 104 100 97 90 78 63
22581 63 40 13 -13 -24 -20 -12 -3 0 -3 1 6 11 15 19 23 27 31 29 27 25 23 30 43 52 62 68 75 81 88 94 101 105 114 123 131 140 149 157 165 173 181 192 203 205 192 171 151 118 77 37 16 6 0
22558 0 -2 -5 -11 -12 -6 -6 -13 -21 -27 -34 -41 -48 -51 -53 -56 -59 -62 -65 -68 -71 -78 -85 -93 -100 -102 -104 -106 -107 -104 -96 -91 -85 -74 -54 -29 -4 12 30 53 66 70 73 75 78 77 76 65 53 41 33 22 11 -1 -19 -30
22535 -30 -30 -30 -31 -30 -30 -34 -37 -41 -45 -43 -41 -40 -38 -32 -26 -20 -13 -7 -1 4 11 6 2 -1 -6 -10 -15 -16 -23 -29 -30 -35 -39 -35 -36 -44 -52 -55 -58 -58 -64 -66 -69 -76 -77 -77 -83 -86 -88 -91 -94 -97 -100 -107 -114 -121 -128 -126 -124 -125 -120 -113 -105 -98 -90 -82 -74 -66 -58
22505 -58 -52 -46 -40 -34 -33 -32 -32 -31 -30 -30 -27 -29 -36 -44 -52 -60 -62 -64 -65 -67 -66 -65 -64 -63 -60 -57 -54 -51 -42 -27 -16 -5 5 16 27 38 50 61 65 63 63 62 60 59 55 43 25 7 -9 -25 -42 -58 -68
22482 -68 -73 -70 -68 -65 -62 -59 -56 -50 -44 -38 -32 -29 -26 -23 -20 -17 -14 -12 -9 -9 -10 -11 -11 -17 -23 -29 -35 -43 -52 -60 -68 -67 -67 -66 -66 -64 -62 -60 -58 -56 -54 -52 -50 -43 -36 -32 -23 0 24 47 70 90 94 84 73 67 71 68 66 56 41
22456 41 29 17 2 -8 -11 -14 -17 -21 -24 -27 -35 -42 -50 -58 -58 -59 -59 -60 -52 -45 -38 -31 -26 -28 -36 -45 -48 -51 -56 -57 -55 -54 -52 -50 -61 -71 -82 -92 -101 -109 -118 -126 -129 -126 -126 -127 -122 -117 -114 -107 -92 -77 -68 -65 -54 -39 -21
$$ packed form
22628g0kjmmJJMMJ1J6J6J1MMONNOJ%LknnNMkj6j4nJ3QonKJ2J2Lopj0k2k8k7qJ1L0K9K0QPJ3
22606B6J4Okjjkkkkjj1j1j1j0kkkkKLKLoopo%%%%%%%%LLLLonmmMK3K4K1RNJ2K1J7Qmlpj2j5
22581F3k3k7k6j1MQRLlMNNMMMMMkkkkPJ3RJ0OPOPOPMRRQRRQQQQJ1J1Kj3k1k0l3m1m0k1j0o
22558@klojO%pqoppplkllllllppqpkkkjLQNOJ1K0K5K5J6J8K3J3MLKLjjj1j2j2qj1j1j2j8j1
22535c0%%jJ%mlmmKKJKOOOPOONPnmlnmnjpojnmMjqqll%oklpj%olkllllppppKKjNPQPQQQQQ
22505e8OOOOJJ%JJ%LkpqqqkkjkJJJJLLLLRJ5J1J1J0J1J1J1J2J1Mk%jkjmj2j8j8j6j6j7j6j0
22482f8nLKLLLLOOOOLLLLLLKL%jj%ooooqrqqJ%J%KKKKKKKKPPMRK3K4K3K3K0Mj0j1oMlkj0j5
22456D1j2j2j5j0lllmllqpqq%j%jQPPPNkqrllnjKJKKj1j0j1j0rqrqlL%jNNLPJ5J5RLJ1J5J8
$$ plain form
22431 -21 -13 -11 -10 -10 -9 -11 -13 -15 -18 -25 -32 -39 -47 -53 -60 -66 -72 -70 -68 -66 -63 -62 -61 -60 -59 -57 -56 -55 -54 -50 -47 -44 -41 -38 -35 -29 -28 -30 -32 -34 -36 -44 -51 -59 -66 -73 -80 -87 -95 -97 -99 -101 -103 -105 -108 -110 -112 -120 -119 -107 -94 -83 -78 -72 -62
22403 -62 -43 -24 -10 -5 -3 -2 0 0 -1 -3 -5 -7 -10 -13 -16 -19 -17 -14 -12 -10 -6 -2 1 5 5 3 0 1 6 9 15 19 15 12 8 4 -3 -11 -19 -28 -33 -39 -44 -50 -48 -46 -45 -43 -39 -35 -31 -27 -20 -13 -7 0 6 12 19 26 31 36 41 46 51 56
22375 56 61 66 68 69 71 73 72 72 71 70 68 65 63 60 53 45 37 30 19 9 -1 -12 -27 -43 -59 -75 -84 -92 -101 -110 -120 -129 -131 -129 -123 -120 -125 -132 -136 -140 -145 -148 -143 -134 -127 -120 -115 -111 -106 -101 -101 -101 -101 -101 -98 -95 -92 -89 -79
22349 -79 -68 -57 -47 -45 -43 -41 -39 -36 -33 -30 -28 -30 -32 -31 -35 -45 -55 -55 -55 -56 -56 -57 -58 -62 -66 -70 -74 -81 -88 -95 -102 -103 -104 -105 -106 -102 -97 -93 -89 -89 -89 -89 -89 -84 -79 -73 -68 -60 -52 -44 -36 -33 -30 -27 -24 -21 -18 -15 -12 -18 -24 -30 -36 -38
22322 -38 -40 -40 -45 -72 -103 -131 -144 -156 -175 -193 -203 -201 -191 -175 -159 -148 -143 -130 -108 -84 -73 -76 -84 -84 -78 -75 -72 -68 -64 -60 -56 -58 -60 -63 -65 -67 -70 -72 -74 -80 -85 -91 -96 -98 -100 -107 -122 -128 -118 -102
22300 -102 -95 -93 -92 -91 -90 -84 -72 -59 -55 -54 -53 -52 -52 -53 -55 -56 -58 -54 -50 -46 -43 -43 -43 -43 -44 -44 -44 -44 -44 -43 -41 -39 -38 -36 -34 -33 -31 -33 -36 -38 -40 -33 -27 -21 -15 -10 -10 -7 -4 -2 0 2 5 8 12 16 20 29 38 47 56 56 56 56 56 62
22272 62 67 72 78 84 90 96 103 109 115 121 128 124 120 119 113 107 103 98 92 90 88 73 39 6 -17 -44 -74 -102 -110 -106 -101 -100 -100 -99 -98 -95 -93 -90 -88 -80 -72 -64 -56 -46 -37 -27 -17 -7 2 11 21 20 19 18 17 14 17
22247 17 25 36 37 29 8 -24 -62 -104 -139 -165 -167 -166 -168 -167 -170 -176 -182 -185 -183 -176 -172 -168 -158 -148 -139 -129 -124 -124 -121 -119 -111 -103 -95 -87 -81 -75 -69 -63 -63 -63 -63 -63 -61 -60 -66 -77 -86 -94 -93 -91 -89 -87 -85 -83 -78 -78 -77 -72
$$ packed form
22431b1QKJ%JkkklpppqopooKKKLJJJJKJJJMLLLLLOJkkkkqpqppppqkkkkklkkqJJ2J3J1NOJ0
22403f2J9J9J4NKJK%jkkkllllKLKKMMLM%klJNLOMmlmmpqqrnonoKKJKMMMMPPOPOOPPNNNNNN
22375E6NNKJKKj%jjklklpqqpj1j0j0j1j5j6j6j6rqrrj0rkKOLnpmmnlNRPPNMNN%%%%LLLLJ0
22349g9J1J1J0KKKKLLLKkkJmj0j0%%j%jjmmmmppppjjjjMNMM%%%%NNONQQQQLLLLLLLLooook
22322c8k%nk7l1k8j3j2j9j8j0KJ0J6J6J1NJ3K2K4J1lq%OLLMMMMkklkklkkononkkpj5oJ0J6
22300a02PKJJJOJ2J3MJJJ%jkjkMMML%%%j%%%%JKKJKKJKklkkPOOON%LLKKKLLMMMRRRR%%%%O
22272F2NNOOOOPOOOPmmjoomnokkj5l4l3k3k7l0k8qMNJ%JJLKLKQQQQJ0RJ0J0J0RRJ0jjjjlL
22247A7QJ1Jqk1l2l8m2l5k6kJkJloolKPMMJ0J0RJ0N%LKQQQQOOOO%%%%KJoj1rqJKKKKKN%JN
$$ plain form
22222 -72 -62 -52 -43 -33 -26 -24 -19 -14 -9 -4 0 4 4 4 3 3 6 9 12 15 18 21 24 27 26 24 23 22 20 19 18 16 19 23 26 28 22 11 2 -6 -18 -30 -42 -54 -61 -68 -75 -82 -81 -80 -78 -77 -80 -84 -88 -92 -93 -95 -97 -98 -94
22196 -94 -91 -90 -83 -76 -69 -61 -53 -45 -37 -32 -21 0 26 50 74 81 76 68 60 55 55 52 50 41 33 25 17 4 -8 -21 -34 -43 -53 -68 -103 -154 -200 -216 -188 -163 -139 -129 -120 -119 -130 -160 -185
22175 -185 -197 -194 -190 -202 -227 -246 -252 -246 -234 -221 -212 -198 -188 -195 -195 -190 -180 -171 -161 -150 -149 -147 -146 -144 -140 -130 -124 -118 -109 -101 -93 -85 -76 -68 -60 -52 -45 -38 -31 -24 -23 -22 -20 -19 -14 -9 -11 -18 -41 -65 -100 -130
22153 -130 -158 -159 -149 -131 -117 -115 -120 -131 -133 -136 -128 -121 -118 -120 -119 -118 -111 -104 -98 -92 -87 -88 -91 -94 -96 -93 -82 -72 -59 -46 -38 -31 -30 -28 -30 -27 -17 -8 -12 -22 -32 -38 -43 -53 -65 -65 -59 -58 -63 -73 -78 -78 -75
22130 -75 -71 -62 -53 -46 -40 -34 -28 -21 -15 -8 -2 1 5 9 13 11 8 5 3 10 14 0 -20 -37 -46 -62 -82 -101 -110 -116 -119 -123 -129 -135 -138 -137 -133 -130 -127 -124 -121 -118 -115 -113 -110 -111 -106 -95 -85 -74 -63 -55 -46 -38 -29 -21 -12 -3 4
22105 4 9 14 19 24 24 23 23 23 20 17 14 12 4 -3 -11 -19 -25 -30 -35 -41 -46 -51 -57 -62 -62 -62 -61 -61 -56 -50 -45 -40 -37 -38 -39 -36 -36 -35 -34 -34 -37 -41 -45 -49 -53 -57 -60 -64 -69 -73 -78 -82 -86 -91 -95 -100 -99 -99 -98 -98 -94 -91 -82 -73 -67 -60 -44 -28
22075 -28 -16 -10 -6 -1 3 9 15 21 21 20 19 18 15 12 0 -25 -53 -72 -92 -118 -146 -161 -163 -147 -122 -103 -81 -58 -32 -15 -5 -3 -3 -2 4 17 29 42 47 47 48 49 50 51 56 62 70 74 75
22054 75 76 76 77 72 68 64 59 52 45 38 31 27 24 20 16 10 4 -1 -8 -17 -27 -37 -46 -56 -65 -75 -85 -87 -89 -91 -93 -94 -95 -96 -97 -93 -84 -74 -52 -23 6 3 -19 -38 -45 -43 -40 -41 -42 -45 -43 -38 -34 -28 -23 -18 -13 -8
$$ packed form
22222g2J0J0RJ0PKNNNNMM%%j%LLLLLLLLjkjjkjjkLMLKoj1rqj2j2j2j2ppppJJKJlmmmjkkjM
22196i4LJPPPQQQQNJ1K1K6K4K4Pnqqn%lkrqqqj3j2j3j3rj0j5l5n1m6j6K8K5K4J0RJj1l0k5
22175a85j2LMj2k5j9oOJ2J3RJ4J0p%NJ0RJ0J1JKJKMJ0OORQQQRQQQPPPPJJKJNNkpk3k4l5l0
22153a30k8jJ0J8J4Knj1klQPLkJJPPOONjllkLJ1J0J3J3QPJKkLJ0Rmj0j0onj0j2%OJnj0n%L
22130g5MRRPOOOPOPOLMMMkllkPMj4k0j7rj6k0j9rolmoolJMLLLLLLKLjNJ1J0J1J1QRQRQRRP
22105DNNNN%j%%lllkqpqqonnonnon%%J%NONNLjjL%JJ%lmmmmmlmnmnmmnmnJ%J%MLRROPJ6J6
22075b8J2OMNMOOO%jjjllj2k5k8j9k0k6k8j5kJ6K5J9K2K3K6J7J0K%JOJ3J2J3N%JJJJNOQMJ
22054G5J%Jnmmnppppmlmmoonprj0j0rj0rj0j0kkkkjjjjMRJ0K2K9K9lk2j9pKLjjlKNMONNNN
$$ plain form
22029 -8 -2 4 11 19 26 25 23 22 21 19 17 15 14 12 10 8 6 2 -2 -6 -11 -15 -20 -24 -29 -30 -32 -33 -34 -38 -42 -46 -50 -57 -63 -70 -76 -77 -79 -80 -81 -74 -67 -60 -52 -43 -33 -23 -14 -6 1 8 16 23 31 39 46 50 54 58 62 57 52 46 41 34 27 10
22000 10 -6 -18 -29 -41 -52 -64 -76 -88 -100 -112 -118 -118 -117 -115 -114 -113 -112 -107 -102 -98 -93 -87 -80 -73 -66 -60 -53 -46 -39 -35 -30 -26 -21 -17 -12 -8 -4 2 9 16 23 30 37 44 51 50 49 48 47 49 45 43 44 38 31 28 20 7
21975 7 -2 -4 -6 -12 -18 -25 -31 -31 -32 -32 -33 -32 -32 -31 -30 -25 -19 -12 -8 -4 -6 -9 -4 5 12 21 30 34 30 29 30 29 29 29 28 19 10 1 -7 -16 -26 -35 -44 -53 -62 -71 -80 -89 -98 -108 -117 -115 -114 -112 -111 -110 -108 -107 -105 -103 -101 -98 -96 -91 -86 -81 -76 -66
21946 -66 -55 -45 -34 -29 -24 -18 -13 -6 0 7 14 16 18 20 22 23 24 25 27 28 29 31 32 31 30 29 27 26 25 24 23 18 13 8 4 0 -5 -10 -15 -19 -24 -28 -32 -37 -41 -45 -50 -54 -59 -64 -69 -71 -73 -78 -77 -71 -64 -57 -51 -49 -48 -46 -44 -44 -43 -42
21917 -42 -42 -44 -46 -48 -50 -54 -58 -63 -67 -71 -80 -96 -112 -125 -129 -128 -127 -137 -152 -166 -158 -141 -125 -117 -109 -98 -81 -63 -54 -53 -51 -51 -50 -50 -49 -49 -48 -45 -42 -39 -37 -42 -48 -54 -60 -64 -68 -72 -76 -75 -73 -72 -71 -65 -60 -54 -49 -45
21892 -45 -47 -47 -25 3 40 72 105 127 135 136 132 127 122 122 121 120 119 107 96 84 73 61 49 39 30 20 10 6 1 -2 -6 -10 -15 -19 -23 -24 -24 -25 -25 -26 -26 -27 -27 -29 -30 -31 -32 -34 -35 -36 -37 -35 -32 -30
21869 -30 -27 -25 -22 -20 -17 -15 -13 -10 -8 -6 -4 -2 0 -2 -4 -6 -8 -10 -12 -15 -17 -15 -13 -12 -10 -8 -7 -5 -3 6 16 27 37 38 39 40 41 49 63 72 65 48 31 24 16 3 -15 -35 -47 -51 -55 -59 -63 -64 -66 -67 -69 -65 -61
21844 -61 -58 -54 -61 -68 -75 -82 -83 -85 -87 -88 -82 -76 -67 -64 -70 -81 -90 -99 -103 -107 -111 -115 -111 -106 -102 -97 -90 -83 -76 -69 -71 -72 -74 -76 -77 -78 -79 -80 -81 -83 -84 -85 -89 -94 -98 -103 -107 -112 -116 -121 -123 -126 -129 -132 -132 -132 -121 -110 -101 -92 -78 -64 -48
$$ packed form
22029hOOPQPjkjjkkkjkkkkmmmnmnmnjkjjmmmmpopojkjjPPPQRJ0J0RQPPQPQQPMMMMnnonppj7
22000A0j6j2j1j2j1j2j2j2j2j2o%JKJJJNNMNOPPPOPPPMNMNMNMMOPPPPPPPjjjjKmkJoplqj3
21975Grkkoopo%j%jJ%JJNOPMMklNRPRRMmjJj%%jrrrqrj0rrrrrrrrj0rKJKJJKJKKKLKNNNNJ0
21946f6J1J0J1NNONPOPPKKKKJJJKJJKJjjjkjjjjnnnmmnnnmnmmnmmnmnnnkknJOPPOKJKK%JJ
21917d2%kkkkmmnmmrj6j6j3mJJj0j5j4QJ7J6QQJ1J7J8RJK%J%J%JLLLKnooommmmJKJJONONM
21892d5k%K2K8L7L2L3K2QJmnn%jjjj2j1j2j1j2j2j0rj0j0mnlmmnmmj%j%j%j%kjjjkjjjKLK
21869c0LKLKLKKLKKKKKkkkkkklkKKJKKJKKRJ0J1J0JJJJQJ4Rpj7j7pqj3j8k0j2mmmmjkjkMM
21844f1LMppppjkkjOORLoj1rrmmmmMNMNPPPPkjkkjjjjjkjjmnmnmnmnklll%%J1J1RRJ4J4J6
$$ plain form
21816 -48 -38 -32 -31 -31 -26 -14 -1 7 11 14 -8 -52 -116 -161 -191 -198 -196 -188 -180 -179 -177 -173 -164 -152 -140 -127 -114 -96 -70 -45 -35 -38 -42 -36 -30 -22 -14 -12 -9 -16 -22 -28 -34 -40 -45 -51 -57 -62 -67 -79 -109
21794 -109 -141 -172 -194 -217 -233 -248 -247 -246 -239 -232 -226 -208 -187 -153 -116 -79 -65 -71 -79 -93 -104 -107 -97 -88 -92 -107 -119 -126 -131 -142 -155 -159 -152 -145 -142 -130 -112 -93 -73 -47 -21 -6
21776 -6 -2 1 6 10 15 20 26 31 37 43 43 44 44 44 42 39 36 34 36 39 41 44 46 49 51 54 51 49 46 43 38 33 27 22 17 12 7 2 -12 -27 -37 -48 -71 -102 -127 -136 -128 -120 -121 -122 -121 -120 -123 -127 -130 -117 -89 -61 -43
21751 -43 -32 -21 -4 10 20 19 12 9 6 3 0 -8 -16 -25 -34 -55 -75 -96 -117 -133 -149 -165 -181 -184 -187 -190 -193 -201 -209 -211 -205 -185 -165 -154 -144 -119 -90 -67 -56 -49 -47 -45 -38 -28 -12 5
21731 5 15 26 38 47 41 34 26 27 29 19 1 -37 -70 -103 -103 -81 -52 -28 -21 -17 -9 5 20 25 30 40 49 59 68 73 77 71 65 68 71 73 75 76 62 28 -21 -67 -105 -117 -117 -113 -110 -106 -102
21710 -102 -107 -117 -123 -110 -62 10 73 112 112 106 105 99 83 73 70 68 65 62 52 37 24 19 9 0 -10 -20 -30 -40 -42 -44 -45 -47 -49 -51 -53 -55 -60 -64 -68 -73 -72 -71 -70 -69 -64 -58 -53 -47 -41 -36 -30 -25
21688 -25 -21 -18 -15 -11 -8 -5 -1 1 3 5 8 10 7 4 1 -1 0 1 3 4 0 -2 -6 -10 -7 -4 0 2 5 8 12 15 13 11 9 8 1 -5 -12 -19 -26 -33 -41 -48 -61 -79 -95 -110 -122 -133 -145 -156 -162 -168 -173 -179 -181 -178 -172 -157
21662 -157 -138 -104 -68 -33 -20 -19 -29 -38 -38 -29 -23 -21 -26 -36 -44 -51 -56 -57 -60 -63 -65 -67 -69 -72 -79 -86 -94 -101 -109 -116 -123 -130 -127 -120 -116 -111 -110 -114 -114 -115 -113 -97 -75 -59 -53 -47 -28 -4 17 23 21 19 17 16 14
$$ packed form
21816d8J0OJ%NJ2J3QMLk2m4o4m5l0pKQQJKMRJ2J2J3J3J8K6K5J0lmOOQQKLpoooonoonnj2l0
21794a09l2l1k2k3j6j5JJPPOJ8K1L4L7L7J4oqj4j1lJ0Rmj5j2pnj1j3mPPLJ2J8J9K0K6K6J5
21776fMLNMNNONOO%J%%kllkKLKLKLKLlkllnnonnnnnj4j5j0j1k3l1k5rQQjjJJlmlJ3K8K8J8
21751d3J1J1J7J4J0jpllllqqrrk1k0k1k1j6j6j6j6llllqqkOK0K0J1J0K5K9K3J1PKKPJ0J6J7
21731EJ0J1J2RopqJKj0j8l8l3l3%K2K9K4PMQJ4J5NNJ0RJ0RNMooLLKKJj4l4m9m6l8j2%MLMM
21710a02nj0oJ3M8P2O3L9%ojoj6j0lkllj0j5j3nj0rj0j0j0j0kkjkkkkknmmnJJJJNONOONON
21688b5MLLMLLMKKKLKlllkJJKJmkmmLLMKLLMLkkkjpoppppqpj3j8j6j5j2j1j2j1oonokLOJ5
21662a57J9L4L6L5J3Jj0r%ROKnj0qpnjllkkklppqpqpppLPMNJm%jKJ6K2J6OOJ9K4K1Okkkjk
$$ plain form
21638 14 12 9 7 4 1 0 -1 -3 -5 -6 -8 -9 -11 -13 -14 -16 -17 -19 -21 -22 -24 -25 -27 -28 -29 -36 -42 -49 -55 -61 -67 -73 -79 -87 -96 -104 -113 -114 -116 -117 -118 -120 -121 -123 -124 -119 -114 -109 -104 -105 -105 -105 -105 -107 -108 -109 -110 -111 -113 -114 -115 -111 -107 -103 -99 -100 -101 -103 -104
21608 -104 -108 -113 -117 -122 -118 -113 -109 -105 -103 -101 -96 -96 -102 -108 -114 -121 -120 -119 -119 -118 -115 -112 -109 -105 -106 -107 -108 -109 -110 -111 -112 -113 -110 -106 -102 -98 -103 -108 -113 -118 -115 -113 -111 -108 -105 -103 -98 -82 -64 -48 -41 -37 -33 -27 -17 -8 -4 -5 -5 -3 0 0 2 2
21581 2 -2 -7 -13 -18 -23 -29 -34 -39 -39 -39 -38 -38 -40 -42 -44 -46 -54 -63 -71 -79 -82 -85 -88 -91 -92 -93 -94 -95 -101 -107 -112 -118 -122 -121 -114 -107 -105 -103 -101 -99 -97 -96 -95 -94 -92 -91 -89 -88 -83 -78 -68 -59 -46 -34 -31 -27 -25 -23 -19 -10 0 6 6 6 4 3
21552 3 2 0 0 -2 -4 -6 -8 -11 -13 -15 -17 -19 -22 -24 -22 -19 -17 -15 -12 -10 -8 -6 -2 0 3 7 5 3 1 0 -1 -1 -2 -3 -4 -5 -6 -7 -4 -2 0 2 0 -2 -5 -7 -10 -14 -17 -20 -18 -16 -14 -12 -9 -6 -3 0 5 11 20 23 20 17 14 20 31 42
21523 42 47 47 40 20 2 -16 -33 -58 -84 -101 -101 -102 -102 -102 -101 -99 -98 -97 -100 -104 -96 -69 -40 -15 0 21 45 60 60 50 46 42 46 55 65 66 54 30 0 -24 -53 -81 -109 -128 -129
21503 -129 -130 -128 -126 -124 -122 -124 -126 -128 -130 -129 -128 -127 -127 -121 -115 -110 -104 -103 -103 -102 -102 -111 -120 -129 -138 -144 -150 -157 -163 -165 -167 -169 -171 -170 -169 -169 -168 -164 -160 -156 -152 -145 -138 -131 -125 -113 -102 -91 -80 -71 -63 -54 -46 -47 -49 -51 -52 -49 -45 -42 -38 -40 -41 -42
21476 -42 -43 -35 -15 1 12 22 41 57 68 77 81 85 93 105 117 128 140 145 150 147 144 144 153 164 171 171 170 167 151 106 46 -7 -30 -43 -57 -76 -79 -68 -38 -14 3 11 23 32
21457 32 42 43 40 39 38 37 36 35 35 28 22 16 10 9 8 7 6 3 1 -1 -3 -11 -19 -27 -35 -33 -32 -30 -29 -30 -31 -31 -32 -27 -13 -1 4 2 0 6 17 26 26 22 19 20 22 23 25 21 16 12 8 4 0 -3 -7 -2 2 7 12 22 32
$$ packed form
21638A4klklljjkkjkjkkjkjkkjkjkjjpopoooooqrqrjkjjkjkjNNNNj%%%kjjjjkjjMMMMjjkj
21608a04mnmnMNMMKKN%ooopJJ%JLLLMjjjjjjjjLMMMnnnnLKKLLKNJ6J8J6PMMOJ0RMj%KL%K%
21581Bmnonnonn%%J%kkkkqrqqlllljjjjoonomJPPKKKKKJJJKJKJNNJ0RJ3J2LMKKMRJ0O%%kj
21552Cjk%kkkklkkkklkKLKKLKKKMKLMkkkjj%jjjjjjLKKKkklklmllKKKKLLLLNORLlllOJ1J1
21523D2N%pk0j8j8j7k5k6j7%j%%JKJJlmQK7K9K5J5K1K4J5%j0mmMRJ0Jj2k4l0k4k9k8k8j9j
21503a29jKKKKkkkkJJJ%OONOJ%J%rrrroopokkkkJJ%JMMMMPPPOJ2J1J1J1RQRQjkkjLMLMkjj
21476d2jQK0J6J1J0J9J6J1RMMQJ2J2J1J2NNll%RJ1P%jlj6m5o0n3k3j3j4j9lJ1L0K4J7QJ2R
21457C2J0Jljjjjj%pooojjjjlkkkqqqqKJKJjj%jNJ4J2NkkOJ1R%mlJKJKmnmmmmlmNMNNJ0J0
$$ plain form
21430 32 42 51 57 58 61 64 63 61 56 56 58 59 60 62 57 48 41 34 29 23 17 11 -3 -30 -53 -71 -81 -85 -94 -108 -122 -127 -125 -123 -120 -116 -104 -91 -83 -81 -70 -54 -40 -38 -45 -52 -56 -59 -62 -66 -68 -70 -72 -74 -81 -88
21406 -88 -96 -103 -105 -107 -109 -111 -108 -105 -102 -99 -96 -93 -91 -89 -96 -108 -117 -126 -131 -136 -142 -147 -143 -140 -136 -133 -133 -134 -135 -136 -134 -132 -130 -128 -124 -120 -116 -111 -107 -103 -99 -95 -94 -93 -92 -91 -90 -89 -88 -87 -90 -94 -97 -101 -102 -102 -103 -103 -103 -102 -96 -91 -87 -86 -89 -97 -107
21377 -107 -117 -122 -127 -126 -126 -120 -115 -108 -102 -101 -100 -101 -102 -103 -104 -105 -106 -106 -107 -108 -105 -99 -93 -91 -89 -96 -103 -110 -117 -119 -121 -117 -113 -109 -105 -100 -95 -83 -69 -58 -52 -42 -33 -21 -4 10 23 28 32 37 41 43 45 46 48 45 41 38 34
21351 34 36 38 39 41 38 33 30 26 23 19 15 12 13 13 14 15 16 17 18 19 19 16 15 13 12 10 9 7 9 11 13 15 16 18 20 22 20 18 17 14 12 10 7 6 10 14 19 22 19 13 9 5 6 11 14 16 21 23 26 29 29 28 28 27 20 10 1 -6
21322 -6 -13 -17 -17 -17 -19 -24 -34 -47 -57 -68 -75 -79 -82 -80 -76 -71 -67 -66 -69 -71 -71 -70 -70 -69 -73 -80 -85 -90 -92 -91 -91 -92 -90 -90 -93 -97 -101 -103 -99 -92 -89 -86 -83 -80 -77 -73 -69 -66 -56 -46 -36 -26 -16 -7 1 10 16 17 11 2 0
21296 0 4 11 21 28 16 -3 -23 -35 -52 -62 -63 -65 -68 -70 -72 -73 -75 -76 -77 -74 -71 -68 -65 -61 -58 -55 -52 -48 -45 -42 -38 -40 -42 -43 -45 -49 -53 -58 -62 -69 -76 -78 -80 -79 -78 -78 -77 -80 -86 -93 -95 -78 -61 -44 -35 -26 -8 12
21271 12 32 40 42 43 43 41 39 37 35 35 34 33 32 28 24 21 17 14 10 7 3 0 -3 -7 -10 -6 -1 3 7 10 12 9 6 2 -1 -5 -9 -14 -19 -23 -28 -31 -34 -38 -41 -47 -53 -59 -65 -71 -77 -82 -88 -88 -88 -88 -88 -88 -88 -83 -78 -70 -63 -55 -48 -37 -27
21242 -27 -17 -7 -2 2 7 12 10 9 8 7 11 15 19 23 23 22 22 21 19 16 13 10 5 0 0 0 4 9 9 8 5 2 0 -3 -9 -15 -21 -27 -32 -37 -42 -47 -50 -52 -55 -57 -64 -71 -80 -85 -81 -75 -70 -65 -61 -58 -54 -50 -49 -48 -47 -46 -48 -50 -52 -54 -56
$$ packed form
21430C2J0ROJLLjkn%KJJKnrppnoooj4k7k3j8j0mrj4j4nKKLMJ2J3QKJ1J6J4Kppmllmkkkkpp
21406h8qpkkkkLLLLLLKKpj2rrnnonMLML%jjjKKKKMMMNMMMMJJJJJJJJlmlmj%j%%JONMJlqj0
21377a07j0nnJ%ONPOJJjjjjjj%jjLOOKKppppkkMMMMNNJ2J4J1OJ0RJ2J7J4J3NMNMKKJKlmlm
21351C4KKJKlnlmlmmlJ%JJJJJJ%ljkjkjkKKKKJKKKkkjlkkljMMNLlommJNLKNKLL%j%jpj0rp
21322fpm%%knj0j3j0j1pmlKMNMJlk%J%JmpnnkJ%jK%lmmkMPLLLLLMMLJ0J0J0J0J0RQROJork
21296@MPJ0Pj2j9k0j2j7j0jklkkjkjjLLLLMLLLMLLMkkjkmmnmppkkJJ%JlopkJ7J7J7RRJ8K0
21271A2K0QKJ%kkkk%jjjmmlmlmlmllmlMNMMLKllmlmmnnmnllmloooooono%%%%%%NNQPQPJ1J0
21242b7J0J0NMNNkjjjMMMM%j%jklllnn%%MN%jllkloooonnnnlklkpprnMONNMLMMJJJJkkkkk
$$ plain form
21213 -56 -59 -56 -53 -52 -52 -52 -52 -56 -61 -66 -70 -71 -72 -72 -73 -72 -70 -63 -56 -45 -33 -19 -10 -6 -3 0 3 5 8 10 12 15 17 19 22 28 35 43 48 50 45 44 43 41 40 39 37 36 35 34 32 35 38 41 44 41 38 30 22 18 14 10 7 8 9 10
21184 10 11 8 5 2 0 2 4 7 9 12 14 17 19 19 19 18 18 16 15 13 11 7 2 -1 -6 -8 -11 -14 -16 -19 -21 -24 -27 -31 -36 -41 -45 -41 -37 -33 -29 -19 -10 0 8 9 4 2 0 0 -2 -4 -6 0 7 14 21 17 14 11 8 5 2 0 -3 -1 5
21156 5 9 13 17 21 27 29 23 14 6 -1 -3 -6 -9 -12 -21 -34 -45 -56 -67 -78 -89 -100 -106 -111 -116 -122 -125 -126 -121 -111 -104 -100 -92 -85 -83 -68 -45 -19 0 8 13 18 22 29 37 40 40 40 40 40 40 40 40 40 33 26 19 12
21131 12 14 16 17 19 28 38 47 56 65 75 84 93 97 95 97 99 106 114 121 127 129 112 77 27 -25 -66 -96 -103 -109 -106 -105 -108 -119 -135 -148 -161 -163 -159 -159 -159 -155 -156 -163 -171 -173 -167 -155 -142 -127 -97 -38 20
21108 20 53 64 70 76 80 84 92 94 80 66 52 38 23 14 11 21 31 33 23 13 13 19 21 24 33 42 51 60 64 68 72 76 79 83 86 89 93 96 100 103 102 101 99 98 97 96 95 93 87 80 73 66 59 53 46 39 34 28
21083 28 23 17 11 6 0 -4 -13 -22 -31 -40 -48 -57 -68 -74 -71 -68 -64 -61 -62 -64 -66 -67 -67 -66 -65 -64 -58 -51 -45 -39 -33 -26 -20 -13 -12 -11 -9 -8 -7 -7 -6 -6 -5 -5 -4 -4 -7 -11 -14 -18 -21 -25 -28 -32 -33 -34 -35 -36 -37 -38 -39 -40 -40 -40 -39 -39 -36 -33
21054 -33 -31 -28 -20 -12 -4 2 5 8 5 3 2 1 11 21 27 33 34 35 34 33 26 20 20 20 13 1 -11 -16 -18 -15 -13 -11 -14 -16 -18 -20 -21 -23 -24 -26 -30 -30 -33 -36 -38 -41 -42 -44 -48 -65 -85 -92 -90 -88 -93 -98 -97 -97 -95 -88 -78 -69
21027 -69 -59 -44 -32 -20 -13 -6 0 7 17 22 23 18 18 18 17 17 10 4 -1 -8 -15 -23 -31 -39 -47 -54 -62 -70 -71 -73 -74 -76 -75 -74 -72 -71 -70 -69 -71 -67 -62 -56 -50 -44 -32 -21 -9 1 10 19 28 37 42 46 51 55 54 53 55 52
$$ packed form
21213e6lLLJ%%%mnnmjj%jJKPPJ1J2J4RMLLLKLKKLKKLOPQNKnjjkjjkjjjkLLLLllqqmmmlJJJ
21184A0JlllkKKLKLKLK%%j%kjkkmnlnkllklkllmnnmMMMMJ0RJ0QJnkk%kkkOPPPmlllllklKO
21156EMMMMOKorqpklllrj3j1j1j1j1j1j1onnoljNJ0PMQPKJ5K3K6J9QNNMPQL%%%%%%%%pppp
21131A2KKJKRJ0RRRJ0RRMkKKPQPOKj7l5n0n2m1l0poLJlj1j6j3j3kM%%MjpqkOJ2J3J5L0N9N8
21108B0L3J1OOMMQKj4j4j4j4j5rlJ0J0Kj0j0%OKLRRRRMMMMLMLLMLMLjjkjjjjkoppppoppno
21083B8noonomrrrrqrj1oLLMLjkkj%JJJOPOOOPOPJJKJJ%J%J%J%lmlmlmlmjjjjjjjj%%J%LL
21054c3KLQQQOLLlkjjJ0J0OOJJjjpo%%pj2j2nkLKKlkkkjkjkm%llkljkmj7k0pKKnnJ%KPJ0R
21027f9J0J5J2J2PPOPJ0NJn%%j%ponppqqqqpqqjkjkJJKJJJkMNOOOJ2J1J2J0RRRRNMNMjjKl
$$ plain form
21001 52 43 35 25 16 5 -6 -17 -29 -36 -37 -39 -46 -49 -53 -56 -60 -58 -55 -53 -51 -53 -56 -59 -62 -63 -65 -66 -68 -72 -76 -80 -84 -86 -87 -89 -90 -91 -92 -93 -94 -97 -100 -96 -86 -74 -62 -52 -47 -48 -48 -49 -49 -49 -48 -43 -38 -30 -31 -34 -43
20975 -43 -45 -39 -28 -4 22 50 65 72 70 58 42 34 33 37 38 33 26 27 34 41 41 41 41 41 47 53 59 65 67 69 71 74 67 60 54 47 40 33 25 18 5 -8 -10 -13 -22 -31 -41 -50 -49 -49 -49 -49 -44 -40 -35 -31 -35 -39 -44
20950 -44 -48 -48 -48 -49 -49 -49 -49 -50 -50 -52 -53 -55 -57 -59 -60 -62 -64 -72 -80 -87 -95 -98 -101 -103 -106 -105 -104 -102 -101 -105 -109 -113 -117 -122 -126 -131 -135 -131 -127 -123 -118 -113 -108 -104 -99 -99 -99 -99 -100 -94 -89 -83 -78 -75 -72 -69 -66 -44 -13 48 110 165 186
20923 186 188 178 160 142 131 104 65 16 -20 -38 -39 -28 -23 -18 -16 -14 -12 -11 -8 -6 -4 -2 0 2 4 7 4 1 -1 -4 -12 -20 -28 -36 -44 -52 -60 -68 -71 -74 -76 -79 -74 -70 -65 -60 -50 -40 -30 -20 -6 7
20900 7 21 34 43 52 60 69 73 77 82 86 85 84 83 82 76 70 64 58 52 46 40 34 34 33 33 32 37 42 46 51 54 57 60 63 67 70 73 76 79 81 84 87 89 92 95 97 93 89 84 80 70 60 60 60 55 50 45 40 35 33 22 6 -6
20873 -6 -7 -3 -2 -6 -9 -12 -15 -13 -7 -3 0 0 -1 -2 -4 -1 0 2 4 6 8 11 13 19 25 29 36 50 59 68 82 101 125 147 168 183 198 207 208 210 212 214 216 217 218 219 221 212 203 194 185 178 170 158 136 117 108 109 110
20848 110 108 95 79 63 60 67 69 70 77 85 82 79 87 94 102 109 121 128 133 148 169 207 256 310 349 364 375 386 399 412 415 418 419 420 431 442 456 470 479 477 475 474 473 473 492 548 628
20828 628 708 751 783 804 825 841 858 875 892 910 934 954 956 961 966 980 994 1007 1020 1023 1026 1025 1023 1021 1020 1026 1033 1032 1013 995 981 970 949 932 926 928 935 946 957 959 961 965 979
$$ packed form
21001E2rqj0rj1j1j1j2pjkplmlmKLKKkllljkjkmmmmkjkjjjjjllMJ0J2J2J0Nj%j%%JNNQjlr
20975d3kOJ1K4K6K8J5Pkj2j6qjMJnpJPP%%%%OOOOKKKLppopppqpj3j3klrrj0rJ%%%NMNMmmn
20950d4m%%j%%%j%kjkkkjkkqqpqllklJJKJmmmmnmnmMMMNNNMN%%%jONONLLLLK2L1O1O2N5K1
20923A86Kj0j8j8j1k7l9m9l6j8jJ1NNKKKJLKKKKKKLllklqqqqqqqqllklNMNNJ0J0J0J0J4J3
20900GJ4J3RRQRMMNMjjjjoooooooo%j%jNNMNLLLLMLLLLKLLKLLKmmnmj0j0%%nnnnnkj1j6j2
20873fjMJmlllKOML%jjkLJKKKKLKOOMPJ4RRJ4J9K4K2K1J5J5RJKKKKJJJKrrrrpqj2k2j9rJJ
20848A10kj3j6j6lPKJPQllQPQPJ2PNJ5K1L8M9N4L9J5J1J1J3J3LLJJJ1J1J4J4Rkkjj%J9N6Q0
20828F28Q0M3L2K1K1J6J7J7J7J8K4K0KNNJ4J4J3J3LLjkkjOPjj9j8j4j1k1j7oKPJ1J1KKMJ4
$$ plain form
20809 979 1023 1068 1108 1123 1138 1158 1179 1194 1206 1212 1221 1235 1246 1257 1268 1279 1289 1300 1318 1335 1353 1371 1383 1394 1406 1418 1431 1445 1448 1451 1460 1469 1478 1487 1491 1495 1498 1502 1508 1513 1517 1526
20791 1526 1541 1572 1614 1664 1708 1747 1776 1797 1812 1819 1814 1809 1810 1822 1844 1870 1896 1938 1996 2065 2123 2180 2248 2317 2390 2463 2534 2606 2671 2714 2743 2764 2783 2798 2817 2832
20775 2832 2841 2845 2851 2858 2873 2888 2903 2917 2932 2942 2950 2969 3006 3066 3143 3219 3294 3319 3343 3354 3388 3451 3562 3733 3893 4024 4135 4242 4343 4488 4686 5003
20762 5003 5355 5743 6176 6687 7279 7890 8452 8929 9359 9613 9711 9702 9693 9577 9294 8967 8820 8803 8808 8809 8801 8816 8952 9239 9646 10054 10473
20750 10473 10943 11515 12197 12976 13889 14994 16296 17791 19560 21716 24341 27548 31585 36832 43744 52939 65300 81836
20742 81836 103423 130704 164057 203283 247205 293593 339567 381931 417299 442455 455144 454663 441742 418063
20736 418063 386059 348879 309888 271899 236777 205626 179019 156964 138944 124225 112150 102183 93832 86725
20730 86725 80642 75457 71019 67175 63822 60876 58226 55764 53417 51110 48744 46250 43655 41016 38372 35768 33294
$$ packed form
20809I79M4M5M0J5J5K0K1J5J2ORJ4J1J1J1J1J0J1J8J7J8J8J2J1J2J2J3J4LLRRRRMMLMONMR
20791A526J5L1M2N0M4L9K9K1J5PnnJJ2K2K6K6M2N8O9N8N7O8O9P3P3P1P2O5M3K9K1J9J5J9J5
20775B832RMOPJ5J5J5J4J5J0QJ9L7O0P7P6P5K5K4J1L4O3J11J71J60J31J11J07J01J45J98L17
20762E003L52L88M33N11N92O11N62M77M30K54R8rrj16k83l27j47j7NJqJ5J36K87M07M08M19
20750A0473M70N72O82P79R13J105J302J495J769K156K625L207M037N247O912R195J2361J6536
20742H1836K1587K7281L3353L9226M3922M6388M5974M2364L5368K5156J2689m81j2921k3679
20736D18063l2004l7180l8991l7989l5122l1151k6607k2055j8020j4719j2075r967q351p107
20730H6725o083n185m438l844l353k946k650k462k347k307k366k494k595k639k644k604k474
$$ plain form
20723 33294 31020 28972 27146 25560 24232 23137 22253 21581 21092 20697 20285 19813 19277 18667 17975 17238 16511 15808 15128 14487
20714 14487 13908 13389 12907 12450 12021 11592 11146 10700 10289 9910 9539 9168 8808 8479 8184 7915 7657 7389 7114 6857 6655 6459
20705 6459 6250 5988 5742 5542 5368 5213 5087 5000 4924 4849 4758 4667 4576 4486 4404 4322 4225 4104 3961 3812 3644 3471 3363 3300 3273 3257 3242
20693 3242 3218 3198 3168 3136 3098 3064 3030 3000 2982 2955 2929 2892 2856 2809 2762 2704 2645 2565 2475 2359 2248 2155 2106 2075 2060 2041 2022 1988 1939 1886 1827 1780 1749
20679 1749 1731 1719 1698 1667 1626 1553 1484 1421 1385 1354 1331 1321 1320 1320 1315 1301 1271 1236 1208 1189 1154 1113 1073 1056 1040 1024 1009 995 981 968 954 941 932 924 898 872
20663 872 850 828 816 805 794 778 758 751 751 752 742 733 724 716 707 698 699 699 700 701 692 684 676 668 657 646 634 623 612 601 589 578 571 563 556 549 541 534 527 520 511 503 494 486 482 479 476 472 471 470 469 468
20641 468 472 476 480 484 479 474 469 464 459 454 449 444 434 425 415 406 401 396 395 388 380 373 365 358 350 342 335 327 320 314 308 301 303 304 306 308 312 315 312 303 298 293 288 282 282 281 281 281 280 280 280 279 279 278 278 277 277 277 280 277 272 267 272 276 281 286
20613 286 307 328 331 316 309 307 298 294 302 315 314 308 306 303 301 299 297 295 297 299 303 303 296 283 274 264 256 249 241 233 231 229 226 224 218 212 207 201 196 190 185 179 181 184 186 188 191 194 198 202 203 217 234 251 254 257 256 263 277
$$ packed form
20723C3294k274k048j826j586j328j095q84o72m89l95m12m72n36o10o92p37p27p03o80o41
20714A4487n79n19m82m57m29m29m46m46m11l79l71l71l60l29k95k69k58k68k75k57k02j96
20705F459k09k62k46k00j74j55j26q7p6p5r1r1r1r0q2q2r7j21j43j49j68j73j08o3k7j6j5
20693C242k4k0l0l2l8l4l4l0j8k7k6l7l6m7m7n8n9q0r0j16j11r3m9l1j5j9j9l4m9n3n9m7l1
20679A749j8j2k1l1m1p3o9o3l6l1k3j0j%nj4l0l5k8j9l5m1m0j7j6j6j5j4j4j3j4j3rqk6k6
20663H72k2k2j2j1j1j6k0p%Jj0rrqrrJ%JJrqqqj1j1j2j1j1j1j2j1pqppqppprqrqmllmjjjj
20641D68MMMMnnnnnnnnj0rj0rnnjpqpqpqqpqpoopKJKKMLlrnnno%j%%j%%j%j%j%%LlnnNMNN
20613B86K1K1Lj5pkrmQJ3joklkkkkKKM%pj3rj0qpqqkklkoonononoKLKKLLMMJJ4J7J7LLjPJ4
$$ plain form
20587 277 292 299 301 298 289 273 257 233 209 179 159 155 152 152 148 135 123 121 119 123 127 131 135 140 144 148 152 157 162 167 172 167 163 169 174 174 174 174 174 170 166 162 158 161 163 155 147 150 162 170 177 182 196 221 246
20563 246 258 254 255 262 266 270 275 279 278 276 275 273 269 264 249 221 191 160 133 100 76 68 65 68 73 73 65 58 49 39 30 21 16 11 7 2 -7 -17 -27 -37 -33 -29 -25 -21 -22 -23 -25 -26 -21 -15 -10 -4 5 16 27
20540 27 37 40 43 46 49 52 54 57 59 65 71 71 65 59 66 90 113 130 138 147 162 176 183 179 171 171 170 170 169 162 155 148 142 136 130 125 119 114 108 103 97 92 87 81 76 71 66 60 55 48 42 33 29 27 31 35 34 26 18 8 3 11
20513 11 34 67 109 146 168 166 156 142 137 134 136 145 149 146 143 137 131 126 120 115 110 106 101 96 92 93 85 72 68 68 68 66 55 33 11 14 36 58 80 95 111 127 143 152 156 163 170 171 172 174 175
20491 175 172 169 166 162 165 167 169 171 174 177 180 182 180 178 176 173 176 178 177 182 183 185 189 189 182 176 169 162 154 147 143 133 120 108 95 82 81 80 79 78 73 67 61 55 58 60 63 66 69 73 76 79 83 86 89 93 96 98 101 104 99 93 87
20464 87 81 83 85 87 89 86 83 80 76 80 84 88 92 91 90 86 88 104 131 157 175 188 210 225 241 242 233 230 227 223 219 215 211 202 193 185 176 149 121 90 67 38 14 -19 -37 -41 -33 -30 -28 -17 -5
20442 -5 4 15 14 -5 -21 -25 -21 -18 -16 -10 -6 -2 1 5 8 10 10 15 26 36 50 58 60 62 66 65 58 51 44 36 25 9 -4 -17 -22 -27 -32 -37 -40 -43 -45 -48 -46 -43 -41 -39 -33 -27 -21 -15 -9 -3 2 8 12 15 21 21 12 -9
20416 -9 -26 -39 -45 -52 -68 -84 -94 -91 -85 -80 -78 -75 -68 -52 -30 -9 11 33 54 70 78 86 87 83 82 81 79 78 76 75 68 61 54 48 43 38 34 29 24 20 15 10 7 4 1 -1 -4 -7 -10 -13 -15 -17 -18 -20 -17 -13 -10 -6
$$ packed form
20587B77J5PKlrj6j6k4k4l0k0ml%mj3j2kkMMMMNMMMNNNNnmON%%%%mmmmLKqqLJ2QPNJ4K5K5
20563B46J2mJPMMNMjkjkmnj5k8l0l1k7l3k4qlLN%qprj0rrnnmnrj0j0j0MMMMjjkjNONORJ1J1
20540B7J0LLLLLKLKOO%ooPK4K3J7QRJ5J4Pmq%j%jpppooononononnonnnonpormkMMjqqj0nQ
20513A1K3L3M2L7K2kj0j4nlKRMlloononnmnnmJqj3m%%kj1k2k2LK2K2K2J5J6J6J6RMPPJJKJ
20491A75lllmLKKKLLLKkkklLKjNJKM%poppqpmj0j3j2j3j3jjjjnoooLKLLLMLLMLLMLKLLnoo
20464H7oKKKKlllmMMMMjjmKJ6K7K6J8J3K2J5J6Jrllmmmmrrqrk7k8l1k3k9k4l3j8mQLKJ1J2
20442eRJ1jj9j6mMLKOMMLMLK%NJ1J0J4QKKMjpppqj1j6j3j3nnnnllklKLKKOOOOOONOMLO%rk1
20416ij7j3opj6j6j0LONKLPJ6K2K1K0K2K1J6QQJmjjkjkjppponnmnnmnnlllkllllkkjkLMLM
$$ plain form
20391 -6 -6 -5 -5 -4 -4 -3 -3 -2 -1 -1 0 0 1 2 2 3 -4 -13 -22 -31 -31 -31 -31 -31 -27 -23 -18 -14 -10 -6 -2 1 10 18 26 34 42 50 58 66 71 76 82 87 92 97 102 107 109 112 114 116 110 104 97 91 85 79 74 68 62 57 51 45 41 36 32 27 22 18
20361 18 13 9 16 23 30 37 44 51 57 64 73 83 92 101 104 108 112 116 120 125 129 134 133 132 131 131 134 138 142 145 134 123 112 101 89 88 91 94 85 75 65 56 47 38 46 54 56 48 35 22 17 11 16 21 23 19 4 -28
20336 -28 -83 -137 -166 -149 -115 -80 -67 -54 -36 -18 0 16 26 25 30 35 42 50 57 64 66 68 70 72 74 77 80 82 73 63 54 44 36 27 18 10 10 10 10 10 11 12 13 14 8 1 -5 -12 -13 -14 -5 4 14
20313 14 24 27 25 26 37 59 81 93 105 113 127 139 140 137 134 131 128 125 122 113 103 94 85 78 76 72 67 69 72 74 76 79 81 83 86 94 102 111 119 128 136 144 153 156 159 162 166 169 172 175 178 182 186 189 193 197 201 204 208 206
20287 206 203 201 199 196 193 200 207 204 196 190 184 170 151 133 127 132 136 135 126 105 79 37 -13 -59 -92 -114 -127 -129 -132 -137 -137 -134 -131 -133 -134 -136 -125 -61 18 96 120 126 126 123 121 115 105 99 98 99 100
20265 100 92 79 68 58 51 44 37 29 25 21 17 14 7 0 0 6 11 17 17 18 19 20 26 33 33 34 34 35 42 49 56 63 72 81 93 100 99 98 96 94 93 91 89 87 82 72 65 57 53 49 40 30 17 3 -3 -3 -8 -13 -17 -22
20239 -22 -25 -29 -32 -36 -30 -25 -20 -14 -3 6 14 27 40 47 58 69 80 90 100 110 119 119 119 128 141 154 152 134 115 101 89 77 64 60 59 63 68 72 77 82 90 98 105 113 118 123 128 133 134 135 140 137
20217 137 123 109 99 90 85 81 69 53 39 31 24 18 11 4 -1 -8 -6 -4 -1 0 2 4 6 8 1 -4 -11 -17 -22 -27 -32 -37 -37 -37 -36 -36 -40 -44 -48 -53 -54 -56 -57 -59 -59 -60 -61 -62 -57 -53 -48 -44 -44 -44 -44 -44 -42 -40 -37 -35 -31 -27
$$ packed form
20391f%J%J%J%JJ%J%JJ%Jprrr%%%%MMNMMMMLRQQQQQQQNNONNNNNKLKKoopooonoonoomnmnnm
20361A8nmPPPPPPOPRJ0RRLMMMMNMNjjj%LMMLj1j1j1j1j2jLLrj0j0rrrQQKqj3j3noNNKmj5l2
20336b8n5n4k9J7L4L5J3J3J8J8J8J6J0jNNPQPPKKKKKLLKrj0rj0qrrq%%%%JJJJopopjjRRJ0
20313A4J0LkJJ1K2K2J2J2QJ4J2Jllllllrj0rrpkmnKLKKLKKLQQRQRQQRLLLMLLLLMMLMMMLMk
20287B06lkkllPPlqooj4j9j8oNMjrk1k6m2n0m6l3k2j3kln%LLkjkJ1O4P9P8K4O%lkoj0ojJJ
20265A00qj3j1j0pppqmmmlpp%ONO%JJJOP%J%JPPPPRRJ2Pjjkkjkkknj0pqmmrj0j3j4o%nnmn
20239b2lmlmONNOJ1RQJ3J3PJ1J1J1J0J0J0R%%RJ3J3kj8j9j4j2j2j3mjMNMNNQQPQNNNNJJNl
20217A37j4j4j0rnmj2j6j4qpoppnpKKLJKKKKpnponnnn%%J%mmmnjkjk%jjjNMNM%%%%KKLKMM
$$ plain form
20190 -27 -24 -20 -15 -9 -4 0 7 9 3 -1 -5 -8 -6 -4 -3 -2 -1 0 1 3 0 -2 -8 -14 -9 -4 -1 2 6 9 11 12 14 15 14 13 11 10 4 0 -6 -11 -10 -6 -5 -10 -16 -23 -22 -16 -10 -5 0 6 13 20 27 33 40 47 54 61 64 67 69 72 70 67 64
20160 64 61 54 38 24 16 12 9 0 -16 -29 -33 -32 -31 -31 -31 -31 -30 -27 -23 -19 -16 -9 -3 2 9 8 8 7 6 11 16 20 25 25 25 25 26 31 36 42 47 56 66 75 84 87 86 84 88 98 107 116 125 123 102 74 34 -2 -38
20135 -38 -49 -51 -51 -50 -50 -49 -54 -59 -64 -69 -74 -79 -83 -88 -90 -87 -87 -87 -82 -76 -71 -65 -57 -50 -42 -34 -32 -29 -26 -24 -12 3 20 31 41 50 59 69 72 76 79 83 82 80 78 77 81 84 88 92 96 99 103 107 103 100 97 93 90 87 83 80
20108 80 77 74 71 68 64 61 58 55 48 41 33 26 21 15 14 14 19 24 22 15 9 9 25 60 95 124 146 168 187 197 197 193 172 151 135 128 115 98 76 67 66 65 68 66 57 49 41 32 31 29 28 26 20 13 7
20084 7 0 -5 -11 -16 -22 -23 -22 -22 -22 -19 -16 -6 6 14 20 25 34 46 60 75 87 93 97 102 107 109 110 113 114 109 101 94 88 82 77 72 67 62 57 52 47 44 41 38 35 32 29 27 24 23 26 26 27 29 28 29 30 27 25 22 19 16 13 10
20057 10 8 6 7 6 6 11 16 21 26 27 28 29 31 32 34 34 36 43 50 57 64 68 68 72 72 68 64 59 54 50 46 40 37 39 43 48 50 48 47 45 44 43 43 42 42 37 30 25 19 17 15 12 11 10 6 4 2 0 -2 -5 -8 -11 -14 -19 -20 -16 -13 -9 -5
20027 -5 -2 0 7 8 0 -6 -14 -22 -21 -20 -19 -19 -22 -26 -29 -33 -36 -40 -43 -47 -46 -45 -43 -42 -32 -22 -13 -3 3 5 7 14 33 60 83 105 122 139 156 172 173 175 176 177 177 178 179 180 185 190 195 200 199 193 182 171 160
20003 160 159 161 169 168 154 140 125 111 96 86 84 82 80 79 78 75 72 89 116 140 152 171 190 210 217 219 216 212 209 211 212 207 197 190 182 170 149 130 116 108 99 91 83 74 65 53 47 37
$$ packed form
20190b7LMNONMPKommlKKJJJJJKlkooNNLLMLKJKJjjkjomonJMJnopJOONNOPPPOPPPPLLKLkll
20160F4lpj6j4qmlrj6j3mJJ%%%JLMMLPONPj%jjNNMN%%%JNNONRJ0RRLjkMJ0RRRkk1k8m0l6l6
20135c8j1k%J%JnnnnnnmnkL%%NONOQPQQKLLKJ2J5J7J1J0RRJ0LMLMjkkjMLMMMLMMmllmllml
20108H0llllmlllppqpnoj%NNkpo%J6L5L5K9K2K2J9J0%mk1k1j6pj3j7k2rjjLkrqqrjkjkopo
20084GpnonojJ%%LLJ0J2QONRJ2J4J5J2OMNNKJLJnqpoonnnnnnnllllllkljL%JKjJJlklllll
20057A0kkJj%NNNNJJJKJK%KPPPPM%M%mmnnmmolKMNKkjkjj%j%npnokkljjmkkkkllllnjMLMM
20027eLKPJqoqqJJJ%lmlmlmlmJJKJJ0J0RJ0OKKPJ9K7K3K2J7J7J7J6JKJJ%JJJNNNNjoj1j1j1
20003A60jKQjj4j4j5j4j5j0kkkjjllJ7K7K4J2J9J9K0PKlmlKJnj0pqj2k1j9j4qrqqrrj2oj0
$$ plain form
19982 37 28 19 10 6 2 -1 -5 -1 3 7 12 12 13 13 13 13 14 14 14 19 24 30 35 40 45 50 55 51 46 42 37 32 28 23 19 18 17 16 15 14 13 12 11 11 11 11 11 11 11 11 11 11 10 9 9 8 7 7 6 6 6 5 5 5 5 5 5 12 18
19952 18 25 32 39 46 53 60 61 62 63 64 65 66 67 69 71 74 77 79 72 60 51 42 38 34 26 24 32 39 46 54 60 67 76 80 78 76 74 72 76 80 83 87 90 94 98 101 94 87 80 73 60 48 38 24 5 -7 -24 -40 -56
19927 -56 -72 -91 -104 -110 -116 -122 -128 -131 -135 -142 -141 -118 -80 -23 24 69 80 81 77 73 74 79 90 91 90 92 92 89 86 82 79 76 73 69 66 63 61 59 56 54 51 49 46 50 54 58 62 66 70 74 78 79 79 80 80 81 82 82 83
19901 83 86 89 92 94 91 83 78 72 68 63 58 53 55 56 53 38 12 -24 -53 -56 -38 -21 -18 -18 -19 -26 -32 -34 -30 -22 -14 -10 -16 -24 -28 -37 -45 -50 -60 -64 -59 -53 -47 -41 -39 -38 -42 -37 -25 -14 -3 8 19 31 42
19878 42 53 63 68 75 83 85 87 89 91 95 100 104 108 107 107 106 105 101 97 93 89 90 91 92 94 95 96 97 98 94 90 85 81 77 72 68 64 71 79 87 94 99 104 110 115 117 119 122 124 129 133 138 142 141 140 140 139 133 126 120 114 105 96 87 78 69 59
19849 59 50 40 31 22 10 3 5 9 12 15 18 21 24 28 29 31 32 34 35 36 38 39 40 41 41 42 40 38 34 33 31 25 21 17 12 8 19 45 65 85 105 125 135 136 134 128 117 111 102 93 87 81 75 69 54 38 34
19824 34 29 23 18 12 6 1 -4 -9 -15 -18 -21 -24 -27 -28 -29 -30 -31 -35 -39 -42 -46 -48 -51 -53 -55 -55 -55 -55 -54 -51 -49 -46 -43 -43 -42 -42 -41 -40 -34 -30 -27 -23 -19 -15 -11 3 23 43 58 76 93 119 129 129 130 127 128 132 136 141 145
19798 145 151 157 162 167 170 165 172 184 206 218 225 232 232 226 223 221 220 218 215 196 154 100 53 22 3 -16 -29 -33 -30 -27 -30 -39 -46 -52 -59 -66 -65 -64 -63 -61 -59 -56 -53 -50 -47 -43 -35 -33 -33 -24 2 30 53 75
$$ packed form
19982C7rrrmmlmMMMN%J%%%J%%NNONNNNNmnmnnmnmjjjjjjjj%%%%%%%%%jj%jj%j%%j%%%%%PO
19952A8PPPPPPJJJJJJJKKLLKpj2rrmmqkQPPQOPRMkkkkMMLMLMMLppppj3j2j0j4j9j2j7j6j6
19927e6j6j9j3oooolmpJK3L8N7M7M5J1JmmJNJ1JjK%llmlllmllkklklklMMMMMMMMJ%J%JJ%J
19901H3LLLKlqnomnnnKJlj5k6l6k9lJ8J7L%jpokMQQMoqmrqnj0mNOOOKJmNJ2J1J1J1J1J2J1
19878D2J1J0NPQKKKKMNMMj%jjmmmmJJJKJJJJmmnmmnmmPQQPNNONKKLKNMNMjj%jopoorrrrrj0
19849E9rj0rrj2pKMLLLLLMJKJKJJKJJJ%JkkmjkommnmJ1K6K0K0K0K0J0Jkoj1orrooooj5j6m
19824C4nonoonnnolllljjjjmmlmklkk%%%JLKLL%J%JJOMLMMMMJ4K0K0J5J8J7K6J0%JlJMMNM
19798A45OONNLnPJ2K2J2PP%olkjklj9m2n4m7l1j9j9j3mLLlrpoppJJJKKLLLLMQK%RK6K8K3K2
$$ plain form
19775 75 100 120 122 119 109 99 78 62 53 44 26 2 -7 -4 -2 4 12 15 11 6 2 -1 4 14 21 29 34 39 44 49 54 59 64 69 73 78 82 86 96 106 116 125 130 135 140 145 145 145 144 144 138 132 127 121 118 114 111
19750 111 108 98 89 79 70 69 69 68 67 67 66 66 65 67 69 72 74 68 63 58 52 52 52 52 52 46 40 34 28 22 15 9 3 -3 -10 -16 -23 -30 -37 -44 -51 -60 -69 -78 -88 -92 -96 -100 -104 -109 -114 -119 -124 -129 -134 -139 -144 -148 -152 -157 -161 -157 -152 -148 -143
19722 -143 -139 -135 -131 -126 -123 -121 -104 -82 -62 -52 -46 -41 -30 -19 -8 2 7 13 2 -8 -20 -23 -25 -37 -51 -66 -75 -76 -76 -75 -74 -73 -70 -67 -63 -60 -54 -36 -21 -12 -9 -6 2 17 36 47 53 58 65
19701 65 72 79 87 84 82 80 78 80 81 83 85 84 83 83 82 75 69 62 56 55 53 52 51 54 56 59 61 60 58 56 54 51 49 57 65 70 75 80 84 82 79 77 74 69 64 59 54 55 57 58 60 64 68 73 77 81 86 91 95 103 110 117 125 127 130 132 135 135 135
19671 135 135 135 136 136 136 137 135 133 130 128 129 130 131 132 138 144 151 157 158 160 161 163 165 167 159 151 146 142 137 133 130 128 125 123 121 119 117 115 118 121 124 127 124 120 117 115 114 125 139 136 111 85 71 66 61 57 53 49 54 58 62 66 65
19644 65 64 63 62 71 85 94 103 104 72 24 -41 -91 -128 -140 -143 -139 -135 -131 -126 -120 -114 -118 -122 -118 -102 -93 -84 -73 -57 -43 -30 -25 -20 -18 -10 -5 0 6 12 9 7 4 1 2 3 4 4 5 6 7 8 2 -3 -8 -14 -11 -8
19619 -8 -5 -2 4 11 18 25 32 39 46 53 59 66 72 79 86 92 99 105 109 112 115 118 115 112 100 84 57 25 -3 -32 -60 -84 -88 -77 -50 -33 -28 -32 -24 -4 15 19 3 -30 -66 -102 -125 -156 -177 -190
19598 -190 -193 -196 -198 -200 -202 -203 -208 -207 -202 -197 -197 -188 -171 -154 -147 -140 -132 -119 -90 -54 -24 -20 -22 -16 4 33 53 64 64 61 57 58 63 71 77 83 86 84 74 64 62 59 56 54 50 47 44 40 42 44 47 49 46 42 39 36
$$ packed form
19775G5K5K0Klj0j0k1j6rrj8k4rLKOQLmnmlNJ0PQNNNNNNNNMNMMJ0J0J0RNNNN%%j%oonolml
19750A11lj0rj0rj%jj%j%jKKLKonno%%%%ooooopooopoppppprrrj0mmmmnnnnnnnnmmnmMNMN
19722a43MMMNLKJ7K2K0J0ONJ1J1J1J0NOj1j0j2lkj2j4j5rj%JJJLLMLOJ8J5RLLQJ5J9J1ONP
19701F5PPQlkkkKJKKjj%jpopojkjjLKLKjkkklkQQNNNMklklnnnnJKJKMMNMMNNMQPPQKLKL%%
19671A35%%J%%JkklkJJJJOOPOJKJKKKqqnmnmlklkkkkkLLLLlmlkjJ1J4lk5k6j4nnmmmNMMMj
19644F5jjjRJ4RRJl2m8o5n0l7j2lMMMNOOmmMJ6RRJ1J6J4J3NNKQNNOOlkllJJJ%JJJJonnoLL
19619hLLOPPPPPPPOPOPPOPOMLLLllj2j6k7l2k8k9k8k4mJ1K7J7NmQK0J9Mj6l3l6l6k3l1k1j3
19598a90llkkkjnJNN%RJ7J7PPQJ3K9L6L0MkOK0K9K0J1%lmJNQOOLkj0j0kllkmllmKKLKlmll
$$ plain form
19574 36 38 40 41 43 50 57 64 71 73 75 78 80 77 74 71 68 64 60 56 52 48 44 40 36 29 22 15 7 0 -6 -13 -20 -26 -31 -37 -42 -43 -43 -43 -44 -46 -49 -51 -54 -57 -60 -63 -66 -63 -61 -68 -75 -72 -54 -19 12 34 52 73 91 102
19547 102 101 97 91 90 89 88 87 86 84 82 81 73 65 58 50 43 35 28 20 15 9 4 -1 -6 -12 -17 -22 -21 -20 -19 -17 -16 -14 -16 -12 -3 5 14 23 27 31 35 39 41 42 47 46 29 13 4 0 -8 -25 -47 -68 -75 -76 -81 -85 -92 -99 -106 -113
19520 -113 -118 -117 -109 -100 -95 -95 -98 -107 -110 -102 -76 -50 -32 -8 25 53 61 61 55 49 51 53 55 57 55 53 44 29 16 -1 -20 -34 -39 -49 -56 -64 -71 -78 -80 -73 -63 -52 -51 -50 -45 -35 -28 -21 -15 -9 -2 3 11
19497 11 20 22 18 16 33 49 65 72 78 84 90 96 102 110 113 111 93 70 53 37 14 -13 -24 -23 -21 -18 -15 -12 -9 -7 -4 3 11 19 27 30 33 36 39 35 32 28 25 26 27 28 29 25 15 -1 -18 -30 -42 -53
19474 -53 -64 -68 -66 -64 -67 -73 -78 -79 -70 -61 -52 -43 -33 -20 -12 -10 -9 -4 6 17 23 22 22 21 20 22 24 26 28 39 50 61 72 72 72 72 72 66 61 56 51 50 55 56 57 59 61 62 64 64 63 63 63 62 62 62 62 64 66 68
19448 68 70 78 86 86 81 77 73 68 63 63 63 63 63 56 50 44 38 32 26 20 14 13 13 12 12 11 10 10 9 6 2 0 -3 -6 -10 -16 -16 -8 0 9 18 22 25 31 33 29 26 22 19 16 12 6 5 8 11 15 18 21 19 10 1 -4 -10 -16 -22 -23 -24 -26 -27
19419 -27 -21 -15 -9 -4 0 2 5 8 9 10 11 12 21 31 40 50 55 59 64 69 68 68 67 67 63 58 54 50 45 41 36 31 35 39 32 26 13 5 5 16 52 82 108 128 151 164 167 165 165 159 156 153 154 155 138 98 43
19394 43 -6 -44 -66 -77 -78 -73 -69 -69 -70 -70 -70 -69 -57 -44 -26 -8 4 17 35 61 86 101 105 103 106 116 126 129 132 135 138 137 137 126 115 104 92 91 91 83 70 50 47 49 46 36
$$ packed form
19574C6KKJKPPPPKKLKllllmmmmmmmmpppqpoppononj%%jklklllllLKppLJ8L5L1K2J8K1J8J1
19547A02jmojjjjjkkjqqpqpqpqnonnnonnJJJKJKkMRQRRMMMMKJNjj7j6rmqj7k2k1pjnmpppp
19520a13nJQRN%lrlQK6K6J8K4L3K8Q%ooKKKKkkrj5j3j7j9j4nj0pqppkPJ0J1JJNJ0PPOOPNQ
19497A1RKmkJ7J6J6POOOOOQLkj8k3j7j6k3k7j1JKLLLLKLPQQQLLLLmlmlJJJJmj0j6j7j2j2j1
19474e3j1mKKlonjRRRRJ0J3QKJNJ0J1Oj%jjKKKKJ1J1J1J1%%%%onnnjNJJKKJK%j%%j%%%KKK
19448F8KQQ%nmmnn%%%%poooooooj%j%jj%jlmkllmo%QQRRMLOKmlmllmojLLMLLkrrnooojjkj
19419b7OOONMKLLJJJJRJ0RJ0NMNNj%j%mnmmnmnnMMpoj3q%J1L6L0K6K0K3J3Lk%ollJJj7m0n5
19394D3m9l8k2j1jNM%j%%JJ2J3J8J8J2J3J8K6K5J5MkLJ0J0LLLLj%j1j1j1j2j%qj3k0lKlj0
$$ plain form
19374 36 26 18 10 1 -6 -3 0 3 6 1 -4 -10 -16 -21 -27 -33 -38 -37 -36 -34 -33 -32 -30 -29 -27 -30 -32 -34 -36 -33 -30 -27 -24 -22 -19 -16 -13 -16 -18 -20 -23 -27 -31 -34 -38 -37 -36 -34 -33 -32 -32 -31 -30 -29 -28 -27 -26 -7 16 38 58 81 107
19347 107 125 135 133 126 119 117 116 114 113 112 107 97 82 64 51 42 29 18 14 9 5 1 -2 -7 -11 -15 -17 -18 -19 -21 -22 -23 -25 -26 -28 -29 -30 -31 -33 -34 -35 -37 -36 -35 -34 -33 -33 -32 -31 -30 -26 -21 -17 -12 -8 -3 1 5 13 21
19321 21 28 36 44 51 62 67 66 64 63 62 62 68 73 75 74 72 71 69 74 77 74 65 54 44 32 21 21 21 21 20 13 6 -11 -29 -41 -54 -56 -58 -67 -76 -85 -94 -107 -121 -129 -128 -130 -132 -134 -135 -145 -155 -159 -153 -145 -120
19297 -120 -83 -40 0 42 79 92 98 98 100 102 103 103 104 104 102 100 98 96 89 82 74 67 58 50 41 32 24 15 6 -2 -3 -4 -5 -6 -7 -8 -8 -9 -9 -10 0 9 10 11 13 14 10 6 2 -1 0 1 2 3 3 2 -4 0 17 35
19271 35 44 53 62 77 77 68 52 47 46 45 42 39 25 12 0 -11 -24 -36 -48 -61 -73 -86 -90 -94 -98 -102 -102 -103 -104 -105 -106 -107 -99 -90 -79 -74 -65 -57 -40 -24 -11 -10 -9 -7 -7 -6 -3 -1 1 4 3 2 1
19248 1 0 5 9 14 18 14 9 5 1 0 -2 -4 -5 -3 -1 3 3 -2 -2 4 10 13 15 13 20 31 43 41 34 35 40 43 46 48 50 45 34 24 14 3 -7 -9 -12 -14 -17 -14 -11 -8 -5 -2 1 1 7 20 34 40 58 78 85
19223 85 82 80 86 93 99 105 105 99 96 93 93 92 91 91 90 90 89 89 86 83 80 77 75 72 69 66 66 66 66 66 60 55 50 44 33 21 9 -2 -8 -14 -21 -27 -29 -32 -34 -36 -38 -40 -42 -44 -45 -45 -45 -45 -37 -29 -20 -12 -11 -10 -8 -7 -9 -10 -12
19195 -12 -13 -15 -17 -19 -21 -18 -14 -11 -8 -7 -6 -6 -5 -5 -4 -4 -3 0 2 6 9 12 15 19 22 19 17 14 12 10 7 5 2 5 9 12 15 9 4 -1 -6 -12 -18 -23 -29 -30 -31 -32 -32 -30 -27 -29 -31 -31 -31 -26 -9 8 27 45 63 84 92
$$ packed form
19374C6j0qqrpLLLLnnoonoonJJKJJKJKlkkkLLLLKLLLlkklmmlmJJKJJ%JJJJJJJ9K3K2K0K3K6
19347A07J8J0kppkjkjjnj0j5j8j3rj3j1mnmmlnmmkjjkjjkjkjjjkjjkJJJJ%JJJMNMNMNMMQQ
19321B1PQQPJ1Njkjj%ONKjkjkNLlrj1j0j2j1%%%jppj7j8j2j3kkrrrrj3j4qJkkkjj0j0mOQK5
19297a20L7M3M0M2L7J3O%KKJ%J%kkkkppqprqrrqrrqjjjjjj%j%jJ0RJJKJmmmlJJJJ%joMJ7J8
19271C5RRRJ5%rj6njjllj4j3j2j1j3j2j2j3j2j3mmmm%jjjjjQRJ1NRQJ7J6J3JJK%JLKKLjjj
19248AjNMNMmnmmjkkjKKM%n%OOLKkPJ1J2kpJNLLKKnj1j0j0j1j0klklLLLLLL%OJ3J4OJ8K0P
19223H5lkOPOO%oll%jj%j%j%llllklll%%%%onnoj1j2j2j1oopoklkkkkkkj%%%QQRQJJKJkjk
19195a2jkkkkLMLLJJ%J%J%JLKMLLLMLlklkklklLMLLonnnoonojjj%KLkk%%NJ7J7J9J8J8K1Q
$$ plain form
19168 92 95 98 93 84 74 69 71 73 67 60 48 35 21 19 15 11 3 -5 -10 -14 -19 -23 -19 -9 -2 3 2 1 0 0 -1 -3 -4 -5 -3 -2 -3 0 10 19 29 39 43 46 49 52 50 47 45 43 45 48 50 52 55 55 51 42 32 22
19142 22 11 0 -5 -11 -17 -23 -28 -33 -38 -43 -43 -43 -42 -42 -45 -48 -51 -54 -48 -42 -36 -30 -25 -20 -15 -10 -10 -10 -10 -10 -10 -10 -10 -11 -5 0 4 9 13 16 20 24 19 15 11 7 1 0 2 9 17 25 28 31 32 34 36 37 38 40 41 42 46 49 52 56 59
19113 59 63 66 70 65 60 56 51 47 42 37 33 28 23 18 13 8 3 0 -5 -6 -6 -6 -6 -7 -7 -7 -7 -14 -20 -28 -33 -31 -29 -26 -24 -24 -24 -23 -23 -31 -40 -48 -56 -65 -72 -76 -86 -100 -110 -112 -111 -112 -118 -130 -143 -150 -151 -147 -138 -118 -93 -74
19086 -74 -49 -22 4 10 11 11 5 3 0 0 1 1 2 0 -1 -4 -6 -13 -21 -28 -36 -40 -45 -49 -54 -53 -53 -52 -51 -46 -41 -36 -31 -22 -19 -23 -27 -26 -26 -28 -25 -17 -10 -5 -13 -26 -40 -47 -50 -58 -76 -94 -101 -97 -93 -88 -83 -79 -74 -69 -64 -59
19059 -59 -53 -47 -42 -34 -26 -17 -9 -1 7 15 23 25 22 22 22 17 12 6 1 -6 -14 -22 -30 -31 -31 -33 -35 -35 -47 -62 -77 -81 -76 -59 -42 -24 -12 -2 -1 0 -4 -9 -9 -10 -11 -11 -12 -17 -23 -28 -33 -36 -39 -42 -44 -42 -41 -39 -37 -37 -38
19033 -38 -39 -39 -34 -29 -24 -19 -13 -8 -5 2 13 26 38 50 63 75 84 98 114 129 136 140 139 140 149 160 169 175 177 171 138 96 44 3 -35 -48 -51 -53 -56 -60 -63 -66 -65 -64 -64 -63 -57 -51 -45 -39 -33 -28 -22
19010 -22 -16 -13 -10 -7 -4 1 7 13 20 17 15 12 9 9 9 8 8 5 2 0 -3 -3 -3 -3 -3 -4 -4 -4 -4 -1 1 5 8 6 4 2 0 -2 -4 -7 -10 -15 -20 -25 -30 -41 -52 -63 -74 -80 -86 -91 -97 -97 -97 -96 -96 -96 -95 -95 -95 -93 -92 -91 -89
18982 -89 -79 -69 -59 -49 -44 -40 -36 -31 -31 -31 -31 -31 -32 -33 -34 -35 -27 -18 -10 -1 4 10 15 21 23 24 26 28 35 42 49 57 67 77 86 96 107 119 135 142 143 144 144 145 148 151 154 157 152 148 143 138 136 133 133 128 122 116 109
$$ packed form
19168I2LLnrj0nKKopj2j3j4kmmqqnmnmMJ0PNjjj%jkjjKJjLJ0RJ0J0MLLLklkkKLKKL%mrj0j0
19142B2j1j1nooonnnn%%J%llllOOOONNNN%%%%%%%jONMNMLMMnmmmojKPQQLLJKKJJKJJMLLML
19113E9MLMnnmnmnnmnnnnnnlnj%%%j%%%poqnKKLK%%J%qrqqrpmj0j4j0kJjoj2j3pjMRK0K5J9
19086g4K5K7K6OJ%okl%J%JkjlkpqpqmnmnJ%JJNNNNRLmmJ%kLQPNqj3j4plqj8j8pMMNNMNNNN
19059e9OONQQRQQQQQKl%%nnonpqqqj%kk%j2j5j5mNJ7J7J8J2J0JJmn%jj%jnonnlllkKJKK%j
19033c8j%NNNNONLPJ1J3J2J2J3J2RJ4J6J5PMjJRJ1ROKol3m2n2m1l8j3lklmllJJ%JOOOOONO
19010b2OLLLLNOOPlkll%%j%llkl%%%%j%%%LKMLkkkkkkllnnnnj1j1j1j1oono%%J%%J%%KJJK
18982h9J0J0J0J0NMMN%%%%jjjjQRQRNONOKJKKPPPQJ0J0RJ0J1J2J6PJJ%JLLLLnmnnkl%noop
$$ plain form
18957 109 103 100 97 93 90 90 90 89 89 85 82 79 75 68 61 50 45 43 40 38 36 31 27 22 17 18 18 18 19 24 29 32 39 51 65 81 92 94 90 89 89 91 94 96 98 101 103 106 108 108 108 108 108 103 99 95 91 94 102 107 112 118 124
18930 124 129 135 132 129 126 123 123 123 123 122 119 116 113 110 98 85 73 60 50 39 29 19 16 13 11 8 0 -7 -15 -23 -31 -39 -47 -55 -60 -64 -69 -73 -75 -77 -79 -81 -83 -84 -85 -86 -82 -77 -72 -67 -58 -49 -39 -30 -21 -11 -2 6
18905 6 19 32 45 57 64 71 77 84 91 97 104 110 132 153 199 291 383 452 478 465 393 316 256 234 224 215 209 202 191 181 170 160 147 133 120 106 99 91 84 77 76 75 74 73 70
18885 70 66 63 59 60 60 60 60 51 42 33 23 12 0 -11 -22 -30 -37 -44 -51 -46 -40 -34 -28 -23 -18 -3 -5 -4 7 12 17 23 29 34 40 35 30 26 21 16 11 7 2 -1 -6 -10 -15 -19 -23 -28 -32 -34 -35 -37 -38 -40 -41 -43 -44 -42 -41 -39
18859 -39 -37 -36 -34 -33 -31 -24 -17 -10 -3 -4 -5 -6 -7 -9 -10 -12 -14 -9 -5 0 3 9 15 21 27 33 39 45 51 58 66 74 81 92 102 112 123 129 135 141 148 146 145 143 142 142 142 142 142 138 134 130 126 123 121 119 116 114 112 110 107 110 113 116 119
18831 119 117 114 111 108 101 94 88 88 87 78 50 22 1 -6 -26 -45 -59 -61 -59 -56 -56 -55 -54 -54 -48 -42 -39 -30 -16 -1 12 27 34 41 48 55 58 60 62 65 67 69 72 74 78 83 87 92 91 85 82 79 79 78 77 77 76 75
18806 75 75 74 77 80 82 85 76 60 37 14 -7 -33 -54 -70 -65 -52 -35 -23 -25 -32 -36 -40 -37 -30 -25 -20 -12 -4 2 10 18 25 32 39 45 46 44 43 40 42 51 61 68 75 82 89 87 86 84 82 82 83 83 84 82 80 77 75
18781 75 75 74 74 73 70 67 64 61 60 59 59 58 53 48 42 37 27 17 7 -2 -7 -11 -15 -19 -23 -28 -32 -37 -41 -46 -50 -55 -57 -59 -61 -63 -59 -49 -37 -26 -16 -11 -13 -16 -17 -18 -19 -20 -20 -21 -22 -23 -19 -15 -11 -8 -2 -2 -9 -16 -24 -26
$$ packed form
18957A09ollml%%j%mllmppj1nklkknmnnJ%%JNNLPJ2J4J6J1Kmj%KLKKLKLK%%%%nmmmLQNNOO
18930A24NOllll%%%jllllj2j3j2j3j0j1j0j0llklqpqqqqqqnmnmkkkkkjjjMNNNRRJ0RRJ0RQ
18905FJ3J3J3J2PPOPPOPOK2K1M6R2R2O9K6j3p2p7o0k2j0ropj1j0j1j0j3j4j3j4pqppjjjjl
18885G0mlmJ%%%rrrj0j1j2j1j1qpppNOOONNJ5kJJ1NNOONOnnmnnnmnlnmnmmnmkjkjkjkjKJK
18859c9KJKJKPPPPjjjjkjkkNMNLOOOOOOOOPQQPJ1J0J0J1OOOPkjkj%%%%mmmmlkklkkklLLLL
18831A19klllppo%jrk8k8k1pk0j9j4kKL%JJ%OOLRJ4J5J3J5PPPPLKKLKKLKMNMNjoll%jj%jj
18806G5%jLLKLrj6k3k3k1k6k1j6NJ3J7J2kpmmLPNNQQOQQPPPOJkjlKRJ0PPPPkjkk%J%Jkklk
18781G5%j%jlllljj%jnnonj0j0j0rnmmmmnmnmnmnkkkkMJ0J2J1J0Nkljjjj%jjjMMMLO%ppqk
$$ plain form
18754 -26 -23 -16 -7 1 10 19 28 38 48 57 66 75 84 93 97 101 105 108 112 115 121 122 118 113 107 102 90 73 59 45 35 24 9 -5 -23 -33 -34 -30 -28 -31 -40 -50 -56 -53 -39 -9 12 40 75 109
18732 109 126 123 109 79 47 14 -17 -50 -72 -81 -80 -78 -77 -76 -71 -72 -73 -74 -69 -56 -32 -8 10 29 52 75 95 103 103 104 104 104 107 111 114 117 117 112 100 88 73 66 60 54 43 27 11
18712 11 0 -6 -19 -30 -19 -4 10 11 11 7 16 41 67 78 81 86 96 104 112 120 129 125 122 118 114 110 106 103 99 97 96 95 93 88 82 76 71 65 59 54 48 45 42 39 36 33 30 27 24 19 13 7 1 -3 -8 -17 -20 -17 -13
18687 -13 -10 -6 -5 -4 -3 -3 -2 -1 -1 0 -5 -9 -14 -18 -22 -26 -30 -34 -43 -52 -61 -70 -73 -71 -72 -73 -69 -64 -62 -55 -44 -34 -23 -12 1 14 28 41 51 56 64 72 77 82 87 92 92 92 93 93 93 93 93 93 88 77 70 63 55
18661 55 47 39 32 27 22 18 13 11 9 7 5 4 3 2 1 8 16 23 31 41 50 60 69 74 78 85 86 82 77 72 67 67 68 58 49 37 25 14 2 -4 -12 -19 -26 -27 -28 -29 -30 -27 -25 -28 -30 -33 -36 -31 -21 -12 -3 0 4 4 -1
18635 -1 -3 -6 -6 -6 -7 -7 -10 -12 -14 -16 -19 -21 -23 -25 -30 -34 -39 -44 -43 -42 -42 -41 -37 -34 -31 -27 -28 -28 -28 -27 -24 -8 21 55 92 120 142 141 129 116 108 109 109 115 126 131 127 114 89 63 40 16 -14 -39
18612 -39 -36 -13 19 46 67 82 98 109 116 122 118 114 113 111 115 119 121 123 126 128 125 122 120 135 150 165 168 177 196 221 242 246 241 235 231 232 237 246 252 258 256 241 189 126 60 22 -6 -12 -17 -18
18590 -18 -16 -11 -7 -5 -2 0 5 10 14 19 23 28 33 37 44 51 58 65 71 78 85 91 90 84 81 77 73 69 66 62 60 59 57 55 51 47 43 38 40 42 44 45 45 47 56 69 80 86 90 95 97 99 101 103 109 114 119 124 127 129 132 134 131 127 123 119 120
$$ packed form
18754b6LPRQRRRJ0J0RRRRRMMMLMLOJmnonj2j7j4j4j0j1j5j4j8j0jMKlrj0oLJ4L0K1K8L5L4
18732A09J7lj4l0l2l3l1l3k2rJKJJNjjjNJ3K4K4J8J9K3K3K0Q%J%%LMLL%nj2j2j5pooj1j6j6
18712A1j1oj3j1J1J5J4J%mRK5K6J1LNJ0QQQRmlmmmmlmkjjknoonoonollllllllnooomnrlLM
18687a3LMJJJ%JJ%JnmnmmmmmrrrrlKjjMNKPJ1J0J1J1J3J3J4J3J0NQQNNNN%%J%%%%%nj1ppq
18661E5qqpnnmnkkkkjjjjPQPQJ0RJ0RNMPJmnnn%Jj0rj2j2j1j2oqppjjjjLKlkllNJ0RRLM%n
18635akl%%j%lkkklkkknmnnJJ%JMLLMj%%JLJ6K9L4L7K8K2jj2j3qJ%OJ1Nmj3k5k6k3k4l0k5
18612c9LK3L2K7K1J5J6J1POmmjkMMKKLKllkJ5J5J5LRJ9K5K1MnomJNROOkj5n2o3o6l8k8onj
18590a8KNMKLKNNMNMNNMPPPPOPPOjolmmmlmkjkkmmmnKKKJ%KRJ3J1OMNKKKKONNNLKLKlmmmJ
$$ plain form
18561 120 121 122 123 127 130 134 137 135 133 131 130 126 122 118 114 113 112 110 109 106 104 101 98 95 92 90 87 87 88 88 88 89 89 89 90 89 87 86 85 81 77 74 70 69 68 67 66 59 53 47 41 31 22 12 3 -6 -15 -25 -35 -33 -31 -30 -28 -26
18534 -26 -25 -23 -21 -16 -10 -6 1 15 29 43 57 68 78 88 98 109 119 120 120 122 124 126 128 129 131 132 133 126 118 111 103 96 88 80 73 69 65 61 56 52 48 44 40 33 27 20 13 15 17 19 21 25 29 33 37 41 45 49 53
18508 53 56 58 61 64 66 69 71 74 78 81 85 88 87 85 83 82 83 84 85 87 88 89 90 92 87 81 76 71 72 72 66 53 40 29 18 5 0 3 4 0 -1 -4 -6 -9 -11 -8 0 12 22 33 48 64 75 87 93 99 102
18484 102 105 113 121 126 125 120 110 99 94 92 78 57 36 33 39 36 29 14 0 -12 -26 -31 -32 -43 -54 -70 -77 -83 -89 -92 -99 -110 -121 -121 -122 -123 -124 -119 -115 -113 -112 -110 -108 -100 -87 -77 -67 -58 -55 -48 -41
18462 -41 -41 -35 -27 -20 -14 -9 -10 -17 -25 -27 -22 -18 -17 -28 -43 -58 -69 -79 -95 -110 -124 -129 -128 -128 -124 -119 -116 -112 -109 -112 -109 -93 -66 -39 -23 -16 -3 14 31 35 26 18 16 20 23 26 25 23 20 16 13 9 12 15
18438 15 18 21 24 27 30 34 30 26 24 28 36 45 46 42 38 35 26 18 29 40 44 42 40 38 36 33 24 14 16 18 20 21 23 24 21 18 15 12 4 -2 -9 -17 -21 -21 -24 -27 -32 -43 -54 -61 -70 -88 -108 -116 -112 -108 -108 -114 -120 -120 -118 -111
18412 -111 -99 -88 -76 -65 -58 -57 -53 -49 -51 -53 -55 -57 -59 -61 -63 -65 -66 -67 -69 -70 -76 -82 -87 -93 -98 -99 -93 -88 -84 -80 -81 -82 -79 -76 -73 -70 -68 -65 -62 -60 -57 -55 -53 -51 -48 -46 -44 -42 -41 -39 -38 -37 -31 -24 -18 -12 -14 -17 -19 -21 -24 -26 -29 -31
18384 -31 -35 -39 -43 -47 -50 -54 -58 -62 -67 -71 -76 -81 -86 -91 -95 -100 -104 -108 -112 -116 -120 -124 -128 -132 -139 -146 -153 -160 -162 -164 -166 -168 -166 -164 -162 -161 -159 -157 -155 -153 -153 -153 -152 -152 -152 -151 -151 -151 -146 -141 -135 -130 -125 -120 -115 -110 -103 -95 -91 -82 -70 -58 -46 -34 -21
$$ packed form
18561A20JJJMLMLkkkjmmmmjjkjlkllllkl%J%%J%%Jjkjjmmlmjjjjpoooj0rj0rrrj0j0KKJKK
18534b6JKKNOMPJ4J4J4J4J1J0J0J0J1J0J%KKKKJKJJpqpqpqqpmmmnmmmmpoppKKKKMMMMMMMM
18508E3LKLLKLKLMLMLjkkjJJJKJJJKnonnJ%oj3j3j1j1j3nLJmjlklkLQJ2J0J1J5J6J1J2OOL
18484A02LQQNjnj0j1nkj4k1k1lOlpj5j4j2j4njj1j1j6poolpj1j1%jjjNMKJKKQJ3J0J0RLPP
18462d1%OQPONjpqkNMJj1j5j5j1j0j6j5j4nJ%MNLMLlLJ6K7K7J6PJ3J7J7MrqkMLLjklmlmLL
18438A5LLLLLMmmkMQRJmmlrqJ1J1Mkkkklrj0KKKJKJllllqopqm%llnj1j1prj8k0qMM%oo%KP
18412a11J2J1J2J1PJMMkkkkkkkkjjkjoononjONMMjjLLLLKLLKLKKKLKKKJKJJOPOOklkklklk
18384c1mmmmlmmmnmnnnnmnmmmmmmmmppppkkkkKKKJKKKK%%J%%J%%NNONNNNNPQMRJ2J2J2J2J3
$$ plain form
18356 -21 -7 5 18 28 37 38 39 38 37 37 36 40 43 47 51 51 51 51 51 51 51 51 51 50 49 48 47 51 55 60 64 58 53 47 41 35 30 24 18 15 12 8 5 2 -1 -7 -8 0 10 18 20 21 27 36 48 56 51 51 56 63 70 78 85
18329 85 85 86 86 86 87 87 87 87 90 93 96 99 102 105 109 110 104 93 87 78 68 62 52 45 44 44 44 44 41 38 36 33 31 29 55 110 175 224 250 256 253 244 237 230 230 230 230 230 221 203 166 129 94 69 46
18305 46 28 20 12 4 -3 -5 -7 -9 -11 -14 -16 -18 -20 -17 -14 -11 -8 -10 -13 -15 -17 -20 -22 -24 -26 -25 -24 -22 -21 -20 -18 -17 -15 -13 -10 -8 -5 -3 0 1 4 13 23 32 42 46 50 54 58 55 51 48 44 41 37 34 30 30 29 29 28 22 16 11 5 -1
18277 -1 -8 -15 -21 -28 -35 -42 -49 -51 -53 -55 -57 -56 -56 -55 -55 -58 -61 -63 -66 -70 -73 -66 -59 -51 -42 -33 -24 -16 -7 1 10 24 39 44 48 49 50 48 51 60 70 72 58 44 30 19 1 -27 -55 -72 -80 -83 -86 -89 -92 -97 -103 -108 -113
18251 -113 -105 -92 -78 -70 -62 -50 -32 -13 1 1 0 -1 2 6 10 14 9 4 0 -5 -11 -17 -23 -29 -26 -23 -28 -38 -48 -58 -58 -53 -35 21 92 153 180 187 180 172 170 167 164 160 161 156 133 105 78 64
18230 64 46 23 -2 -20 -28 -32 -32 -32 -32 -32 -31 -29 -36 -42 -42 -11 22 51 76 102 119 120 121 123 123 124 127 131 137 139 131 123 115 107 98 94 87 80 74 67 58 54 50 47 43 40 42 45 40 30 22 14 16 18 26 33 41 48
18205 48 50 52 53 55 49 42 36 30 23 16 19 23 25 28 31 34 27 21 14 8 2 -3 -9 -14 -16 -18 -10 -1 7 15 13 11 17 22 28 33 36 38 40 42 52 63 72 81 66 35 5 -29 -55 -81 -92 -98 -90 -65 -44 -31 -24
18180 -24 -4 17 39 46 44 46 49 55 60 66 72 68 65 61 57 55 53 41 29 18 16 9 2 0 -2 -5 -8 -5 -2 0 2 6 10 14 17 30 42 55 68 76 84 92 100 103 106 109 112 108 104 100 96 92 88 84 80 72 64 56 49
$$ packed form
18356b1J4J2J3J0RJJjj%jMLMM%%%%%%%%jjjjMMNMonooonoollmlllojQJ0QKJORJ2Qn%NPPQP
18329H5%J%%J%%%LLLLLLMJoj1orj0oj0pj%%%llklkkK6N5O5M9K6Olrpp%%%%rj8l7l7l5k5k3
18305D6j8qqqpkkkklkkkLLLLklkklkkkJJKJJKJKKLKLKLJLRJ0RJ0MMMMlmlmlmlm%j%joonoo
18277appoppppkkkkJ%J%llklmlPPQRRRQRQRJ4J5NMJJkLRJ0Kj4j4j4j1j8k8k8j7qllllnonn
18251a13QJ3J4QQJ2J8J9J4%jjLMMMnnmnooooLLnj0j0j0%NJ8N6P1O1K7PpqkllmJnk3k8k7j4
18230F4j8k3k5j8qm%%%%JKpo%L1L3K9K5K6J7JJK%JLMOKqqqqrmppoprmmlmlKLnj0qqKKQPQP
18205D8KKJKopooppLMKLLLpopoononkkQRQQkkONONLKKKJ0J1RRj5l1l0l4k6k6j1oQK5K1J3P
18180b4K0K1K2PkKLONOOmlmmkkj2j2j1kppkkllLLKKMMMLJ3J2J3J3QQQQLLLLmmmmmmmmqqqp
$$ plain form
18155 49 46 44 41 39 32 26 17 13 14 24 50 82 103 119 137 156 163 169 172 180 186 183 154 125 95 71 36 14 13 11 10 9 8 7 6 5 7 8 9 11 10 9 7 6 5 3 2 1 4 8 12 16 20 25 29 34
18131 34 39 43 48 52 57 61 65 70 69 68 67 67 67 67 67 67 70 73 76 78 76 73 71 68 74 80 86 92 96 100 103 107 105 104 102 101 97 93 89 85 86 87 88 89 81 72 63 55 51 53 57 52 32 12 -10 -28 -47 -53 -54 -46 -40 -34 -41 -53
18103 -53 -66 -63 -44 -13 28 82 123 146 141 136 130 125 120 121 122 117 107 97 87 77 66 56 45 34 33 31 28 26 21 10 2 -4 -15 -22 -20 -19 -19 -19 -19 -20 -19 -18 -18 -17 -15 -12 -9 -6 0 7 15 22
18081 22 34 45 46 47 54 61 68 75 79 82 86 89 92 95 98 101 102 103 96 85 76 67 55 47 49 45 28 11 0 -3 -11 -20 -31 -42 -52 -46 -36 -25 -21 -22 -26 -22 -7 8 19 9 -9 -22 -24 -26 -35
18059 -35 -49 -59 -58 -46 -35 -33 -36 -35 -35 -28 -16 -7 0 3 0 0 0 0 0 0 0 -8 -16 -24 -32 -40 -49 -57 -65 -74 -83 -92 -101 -102 -102 -103 -103 -102 -101 -100 -99 -97 -96 -95 -94 -87 -80 -73 -67 -60 -53 -46 -39 -38 -36 -34 -32 -30 -29 -27 -25 -22 -20 -17
18031 -17 -14 -11 -9 -6 -3 0 5 9 13 18 22 27 31 30 29 29 28 27 26 25 24 25 25 25 25 16 7 0 -9 -15 -21 -27 -34 -31 -29 -26 -24 -20 -15 -11 -7 1 11 20 30 33 36 39 42 45 48 51 55 52 49 47 44 37 29 21 13 2 -8 -18
18003 -18 -29 -31 -33 -36 -38 -40 -41 -43 -45 -42 -38 -35 -32 -29 -25 -22 -19 -17 -15 -13 -11 -13 -25 -42 -58 -69 -79 -80 -97 -127 -147 -150 -136 -109 -51 6 64 85 87 85 78 68 59 56 59 62 59 49 39 33 27
17981 27 23 24 25 26 27 29 25 21 18 14 15 16 17 19 20 21 22 23 25 28 30 32 26 20 13 7 0 -9 -17 -26 -29 -32 -35 -38 -39 -40 -41 -42 -47 -52 -56 -41 -8 46 99 144 156 153 148 143 147 152 156 159 149 130 110 99 89
$$ packed form
18155D9lklkpormJJ0K6L2K1J6J8J9POLQOlk9k9l0k4l5k2jkjjjjjjKJJKjjkjjkjjLMMMMNMN
18131C4NMNMNMMNjjj%%%%%LLLKklklOOOOMMLMkjkjmmmmJJJJqrrqmKMnk0k0k2j8j9ojQOOpj2
18103e3j3LJ9L1M1N4M1K3nnonnJJnj0j0j0j0j1j0j1j1jklknj1qoj1pKJ%%%jJJ%JKLLLOPQP
18081B2J2J1JJPPPPMLMLLLLLJJpj1rrj2qKmj7j7j1lqrj1j1j0OJ0J1MjmMJ5J5J1j0j8j3kkr
18059c5j4j0JJ2J1KlJ%PJ2RPLl%%%%%%qqqqqrqqrrrrj%j%JJJJKJJJPPPOPPPPJKKKKJKKLKL
18031a7LLKLLLNMMNMNMjj%jjjjjJ%%%rrprooopLKLKMNMMQJ0RJ0LLLLLLLMllklpqqqj1j0j0
18003a8j1kklkkjkkLMLLLMLLKKKKkj2j7j6j1j0jj7l0k0lJ4K7N8N7N8K1Kkpj0rlLLlj0j0oo
17981B7mJJJJKmmlmJJJKJJJJKLKKoopoprqrlllljjjjnnmJ5L3N4N3M5J2lnnMNMLj0j9k0j1j0
$$ plain form
17956 89 74 57 49 54 60 67 73 75 77 79 81 83 85 88 90 90 103 115 115 103 91 81 66 57 47 37 28 27 32 36 36 40 44 47 51 54 58 57 63 74 77 75 73 75 77 80 82 79 77 66 51 38 26 21
17933 21 21 23 25 27 30 32 35 37 40 39 38 32 26 19 18 21 29 38 46 50 53 52 51 55 59 63 67 66 65 59 53 49 50 54 58 55 47 35 24 13 1 -8 -9 -16 -22 -33 -44 -55 -67 -64 -62 -59 -57 -55 -52 -50 -48 -43 -39 -35 -30
17906 -30 -26 -22 -17 -13 -6 0 7 14 21 27 34 41 42 43 44 45 41 37 33 29 22 15 11 2 -3 -9 -15 -22 -30 -39 -47 -56 -58 -55 -56 -56 -52 -49 -45 -42 -33 -24 -15 -6 -1 3 8 12 12 12 12 11 7 3 0 -3 -7 -11 -15 -19 -33 -47 -61 -75 -80
17878 -80 -85 -90 -95 -93 -92 -90 -88 -87 -85 -83 -81 -80 -79 -81 -77 -71 -65 -62 -53 -42 -31 -20 -9 -3 2 11 14 15 16 17 18 21 24 28 31 36 41 46 51 51 51 51 50 43 35 27 19 17 14 12 9 8 7 6 6 7 9 11 12 13 13 13 14 19 25
17850 25 30 36 46 56 67 77 87 97 109 117 115 114 112 110 109 109 109 108 104 91 76 55 44 33 15 -7 -29 -38 -37 -37 -37 -42 -55 -67 -76 -85 -91 -93 -88 -84 -80 -75 -74 -78 -85 -82 -70 -58 -53 -52
17829 -52 -52 -46 -33 -20 -13 -7 0 6 8 11 14 17 24 43 77 115 159 194 211 213 210 206 201 197 195 193 191 188 184 170 151 132 106 75 36 -1 -35 -61 -56 -46 -40 -42 -44 -47 -50 -54 -50 -40 -31 -22
17807 -22 -17 -13 -14 -14 -15 -16 -13 -10 -7 -4 -1 1 4 7 6 6 5 4 -4 -13 -22 -32 -32 -32 -33 -33 -28 -23 -18 -13 -7 -2 3 8 14 20 25 31 45 59 73 87 92 97 102 108 111 115 121 121 109 85 66 48 31 9 -14
17783 -14 -29 -34 -33 -34 -36 -34 -33 -34 -30 -21 -11 -2 7 21 35 48 62 78 94 111 127 133 140 146 153 158 162 172 182 184 178 171 142 103 52 9 -27 -42 -48 -50 -46 -40 -34 -32 -31 -30 -29 -28 -27 -18 -9
$$ packed form
17956H9j5j7qNOPOKKKKKKLK%J3J2%j2j2j0j5rj0j0rjNM%MMLMLMjOJ1LkkKKLKlkj1j5j3j2n
17933B1%KKKLKLKLjjoopjLQRQMLjjMMMMjjoomJMMlqj2j1j1j2rjpoj1j1j1j2LKLKKLKKNMMN
17906c0MMNMPOPPPOPPJJJJmmmmppmrnoopqrqrkLj%MLMLRRRRNMNM%%%jmmllmmmmj4j4j4j4n
17878h0nnnKJKKJKKKJJkMOOLRJ1J1J1J1ONRLJJJJLLMLNNNN%%%jpqqqklkljjj%JKKJJ%%JNO
17850B5NOJ0J0J1J0J0J0J2Qkjkkj%%jmj3j5k1j1j1j8k2k2rJ%%nj3j2rrokNMMNJmpLJ2J2NJ
17829e2%OJ3J3POPOKLLLPJ9L4L8M4L5J7Klmnmkkklmj4j9j9k6l1l9l7l4k6NJ0OkkllmMJ0RR
17807b2NMj%jjLLLLLKLLj%jjqrrj0%%j%NNNNONNNOONOJ4J4J4J4NNNOLMO%j2k4j9j8j7k2k3
17783a4j5nJjkKJjMRJ0RRJ4J4J3J4J6J6J7J6OPOPNMJ0J0Kopk9l9n1m3l6j5okMOOKJJJJJRR
$$ plain form
17761 -9 0 8 13 18 24 29 31 34 36 39 36 34 31 29 29 29 29 29 33 36 39 43 44 44 45 46 49 51 54 57 59 60 61 61 62 40 15 -9 -24 -47 -70 -76 -76 -75 -73 -72 -70 -68 -66 -64 -60 -55 -51 -47 -40 -33 -26 -19 -16 -14 -11 -9 -12 -15
17733 -15 -17 -20 -25 -30 -35 -39 -39 -38 -38 -37 -34 -31 -28 -25 -25 -24 -24 -23 -19 -14 -10 -6 -1 2 6 11 14 17 20 23 26 29 32 36 42 48 54 60 71 82 94 105 110 114 119 124 129 134 139 144 138 133 127 122 121 121 124 119 101 70 43 21
17706 21 1 -19 -38 -58 -62 -58 -56 -59 -59 -59 -59 -58 -51 -44 -38 -31 -26 -27 -25 -23 -25 -26 -28 -30 -32 -34 -36 -37 -40 -42 -45 -47 -52 -57 -62 -67 -68 -68 -69 -69 -64 -60 -55 -50 -44 -37 -31 -24 -21 -17 -13 -9 -6 -2 0 3 2 0 -1 -3 -4 -5 -3 -6 -12
17678 -12 -18 -24 -30 -32 -35 -37 -40 -42 -44 -46 -47 -47 -42 -30 -19 -10 0 3 8 22 36 53 65 74 82 91 99 109 118 122 120 121 121 126 122 115 102 92 82 76 69 61 48 34 35 46 57 58 60 58 62 66 70 77
17655 77 79 79 78 77 76 70 63 51 39 27 19 19 19 19 19 17 10 5 13 24 34 42 49 57 56 54 58 64 69 70 72 71 65 57 48 44 40 33 21 4 -16 -47 -77 -112 -138 -164 -173 -177 -175 -172 -170 -168 -165 -161 -158 -154
17631 -154 -150 -138 -125 -113 -100 -87 -74 -61 -48 -40 -32 -24 -16 -12 -7 -3 0 5 9 13 18 14 10 7 3 0 -3 -7 -11 -10 -10 -10 -10 -10 -10 -10 -10 -7 -4 -1 1 4 6 9 12 14 16 17 19 12 5 0 -7 -12 -16 -20 -24 -31 -37 -44
17605 -44 -50 -50 -45 -42 -40 -37 -34 -32 -29 -26 -23 -20 -17 -14 -11 -8 -5 -2 0 3 6 8 11 14 17 19 21 24 26 33 41 49 56 68 81 93 105 112 119 127 134 135 136 137 138 130 123 115 107 101 95 89 83 77 71 65 59 47 35 23 11
17579 11 2 -6 -16 -25 -30 -34 -39 -44 -43 -43 -43 -43 -44 -50 -56 -56 -51 -37 -16 4 20 48 81 110 111 100 93 91 91 91 91 92 84 75 67 59 54 49 44 39 29 19 9 0 -7 -13 -20 -26 -35 -44 -53 -62 -68 -73 -78 -84 -86
$$ packed form
17761iRQNNONKLKLlklk%%%%MLLMJ%JJLKLLKJJ%Jk2k5k4j5k3k3o%JKJKKKKMNMMPPPPLKLKll
17733a5klnnnm%J%JLLLL%J%JMNMMNLMNLLLLLLLMOOOOJ1J1J2J1NMNNNNNNononj%Lnj8l1k7k2
17706B1k0k0j9k0mMKl%%%JPPOPNjKKkjkkkkkjlklknnnnj%j%NMNNOPOPLMMMLMKLjkjkjjKlo
17678a2oooklklkkkj%NJ2J1RJ0LNJ4J4J7J2RQRQJ0RMkJ%Nmpj3j0j0opqj3j4JJ1J1JKkMMMP
17655G7K%jjjopj2j2j2q%%%%kpnQJ1J0QPQjkMONJKjoqrmmpj2j7k0l1l0l5k6k6rmKLKKLMLM
17631a54MJ2J3J2J3J3J3J3J3QQQQMNMLNMMNmmlmllmmJ%%%%%%%LLLKLKLLKKJKppnpnmmmpop
17605d4o%NLKLLKLLLLLLLLLLKLLKLLLKKLKPQQPJ2J3J2J2PPQPJJJJqpqqooooooooj2j2j2j2
17579A1rqj0rnmnnJ%%%joo%NJ4K1K0J6K8L3K9Jj1pk%%%Jqrqqnnnnj0j0j0rpoporrrronnok
$$ plain form
17554 -86 -89 -92 -94 -94 -94 -94 -93 -96 -98 -100 -103 -101 -98 -96 -94 -89 -84 -79 -74 -70 -66 -62 -57 -56 -54 -52 -50 -39 -18 0 11 25 34 45 56 66 68 74 80 79 66 57 53 54 54 45 24 -1 -23 -23 -24 -30 -37 -44 -50 -55 -61
17530 -61 -66 -71 -68 -66 -64 -61 -59 -56 -56 -51 -43 -34 -26 -17 -3 9 26 37 45 53 60 68 75 82 92 97 94 87 80 73 53 11 -38 -83 -104 -120 -134 -139 -140 -141 -138 -141 -146 -151 -159 -162 -152 -143 -133 -123 -117 -111 -105 -99
17506 -99 -93 -87 -81 -75 -70 -65 -59 -54 -49 -44 -39 -34 -31 -33 -32 -32 -36 -41 -46 -51 -54 -57 -61 -64 -68 -71 -74 -78 -76 -75 -73 -72 -73 -74 -75 -77 -73 -70 -67 -64 -55 -47 -38 -30 -28 -31 -36 -31 -16 3 35 58 61 39 11 0 -2 -5 -8 -10 -18 -31
17480 -31 -37 -33 -31 -30 -28 -27 -30 -34 -38 -42 -37 -33 -28 -23 -17 -11 -5 0 7 13 10 6 0 -8 -15 -22 -14 -6 0 8 11 13 15 18 12 5 -6 -7 -5 -3 -10 -18 -30 -38 -42 -57 -74 -90 -90 -90 -87 -84 -81 -77 -82 -87 -81 -76 -61 -47 -32
17453 -32 -18 -11 -3 -13 -22 -27 -22 -23 -24 -21 -18 -16 -13 -18 -23 -29 -34 -42 -50 -51 -47 -41 -46 -61 -77 -87 -88 -94 -101 -102 -104 -105 -107 -108 -109 -110 -111 -110 -108 -107 -106 -106 -106 -106 -106 -106 -106 -107 -107 -112 -118 -124 -129 -131 -132 -133 -135 -130 -125 -117 -114 -112 -111 -95
17426 -95 -75 -54 -42 -38 -29 -15 -2 4 6 3 6 5 4 -1 -7 -12 -18 -27 -35 -43 -52 -63 -74 -85 -96 -100 -104 -108 -112 -113 -115 -116 -117 -117 -117 -116 -116 -115 -115 -115 -114 -109 -104 -100 -95 -90 -85 -80 -75 -72 -68 -65 -61 -48 -35 -22 -9
17401 -9 2 14 26 38 50 62 73 85 94 97 104 110 109 108 107 106 112 118 114 97 72 47 32 17 -5 -29 -41 -42 -44 -46 -47 -48 -43 -39 -35 -31 -24 -17 -8 -4 -4 -4 -8 -7 -1 0 -4 -13 -24 -40 -60
17379 -60 -85 -97 -90 -78 -65 -62 -65 -64 -63 -64 -57 -38 -18 -9 -1 7 17 30 48 66 79 89 99 112 120 126 132 138 144 148 152 156 161 164 168 171 175 177 179 171 163 154 146 137 129 120 112 107 96 82 68 51
$$ packed form
17554h6llk%%%JlkklKLKKNNNNMMMNJKKKJ1K1J8J1J4RJ1J1J0KOOjj3rmJ%rk1k5k2%joppono
17530f1nnLKKLKL%NQRQRJ4J2J7J1QQPQPPJ0Nlpppk0m2m9m5k1j6j4njjLlnnqlJ0RJ0J0OOOO
17506i9OOOONNONNNNNLkJ%mnnnllmlmllmKJKJjjjkMLLLRQRQKlnNJ5J9L2K3Lk2k8j1kllkqj3
17480c1oMKJKJlmmmNMNNOOONPOlmoqppQQOQLKKLopj1jKKpqj2qmj5j7j6%%LLLMnnONJ5J4J5
17453c2J4PQj0rnNjjLLKLnnonqqjMOnj5j6j0jopjkjkjjjjJKJJ%%%%%%j%noonkjjkNNQLKJJ6
17426i5K0K1J2MRJ4J3OKlLjjnonorqqrj1j1j1j1mmmmjkjj%%J%J%%JNNMNNNNNLMLMJ3J3J3J3
17401iJ1J2J2J2J2J2J1J2RLPOjjjjOOmj7k5k5j5j5k2k4j2jkkjjNMMMPPRM%%mJOJmrj1j6k0
17379f0k5j2PJ2J3LlJJjPJ9K0RQQJ0J3J8J8J3J0J0J3QOOOOMMMNLMLMKKqqrqrqrqnj1j4j4j7
$$ plain form
17357 51 39 28 18 -1 -21 -42 -53 -62 -66 -71 -76 -81 -86 -85 -85 -85 -84 -80 -75 -70 -66 -53 -41 -28 -16 -2 11 25 38 51 55 54 53 55 58 61 64 64 60 58 56 53 44 36 33 33 33 22 12 4 -2
17335 -2 -12 -17 -13 -8 -1 0 0 -1 -3 -4 -6 -7 -9 -10 -15 -21 -26 -31 -34 -36 -39 -41 -51 -61 -71 -81 -85 -89 -92 -96 -104 -111 -119 -127 -134 -140 -147 -154 -159 -164 -161 -155 -151 -153 -156 -159 -160 -152 -134 -100 -58 -14 21 39 37 35 38 47 55
17309 55 57 58 58 52 46 39 33 27 20 14 7 1 -5 -12 -18 -25 -32 -39 -45 -44 -42 -41 -40 -34 -28 -22 -17 -10 -4 2 8 15 21 27 34 42 51 59 67 71 75 79 83 85 87 88 90 94 98 103 107 106 104 103 102 105 108 111 114 112 110 108 106 99 93 86 80 76 72
17280 72 67 63 65 67 69 70 64 58 52 46 40 34 26 22 25 30 36 39 34 26 21 14 3 0 2 -4 -21 -39 -47 -55 -63 -71 -79 -87 -88 -83 -82 -80 -74 -68 -63 -57 -45 -32 -17 -7 -7 -6 3 13 13 4 -6 -5 0 6 6 0 -7 -7
17254 -7 -4 -7 -10 -13 -11 -9 -3 1 7 12 14 15 17 19 16 13 11 8 7 6 6 5 4 3 2 1 0 -2 -4 -7 -3 0 4 8 5 1 -1 -4 -5 -6 -6 -7 -4 -2 0 2 9 16 22 29 36 42 49 55 66 77 88 98 102 99 100 101 102 102 103 103
17225 103 99 95 90 86 76 65 55 45 39 33 28 22 24 26 28 30 33 36 38 41 43 46 48 51 54 56 59 61 59 56 54 51 46 41 36 31 29 27 25 23 17 11 5 0 -1 -1 -2 -3 -2 -2 -1 0 1 4 10 11 7 2 -1 -6 -7 -9 -11 -13
17198 -13 -13 -13 -12 -12 -14 -17 -19 -21 -27 -32 -38 -43 -40 -37 -34 -31 -24 -17 -11 -4 0 3 0 -7 -15 -18 -15 -10 -10 -15 -22 -29 -31 -33 -44 -57 -66 -66 -68 -75 -84 -91 -101 -109 -107 -102 -99 -96 -96 -96 -96 -97 -96 -96 -96 -96 -94 -92 -84 -77 -67 -56 -57 -57
17170 -57 -53 -50 -46 -42 -39 -36 -33 -30 -25 -20 -15 -10 -3 4 11 19 16 14 12 10 16 27 37 42 38 13 -11 -35 -46 -63 -82 -91 -83 -75 -71 -68 -68 -67 -64 -48 -28 -13 -11 -10 -1 7 16 25 20 16 11 7 7 8 9 10 11 12
$$ packed form
17357E1j2j1j0j9k0k1j1rmnnnnJ%%JMNNMJ3J2J3J2J4J3J4J3J3MjjKLLL%mkklrql%%j1j0qo
17335bj0nMNPJ%jkjkjkjnonnlklkj0j0j0j0mmlmqpqqpoppnnLOMklljQJ8L4M2M4L5J8kkLRQ
17309E5KJ%oopoopopoopopppoJKJJOOONPOOOPOOPQRQQMMMMKKJKMMNMjkjjLLLLkkkkpopomm
17280G2nmKKKJooooooqmLNOLnqnpj1lKoj7j8qqqqqqjNJKOONOJ2J3J5J0%JRJ0%rj0JNO%op%
17254gLlllKKOMONKJKKllkljj%jjjjjjkklMLMMlmkljj%jLKKKPPOPPOPOJ1J1J1J0MlJJJ%J%
17225A03mmnmj0j1j0j0oonoKKKKLLKLKLKLLKLKklklnnnnkkkkooonj%jjJ%JJJLOJmnlnjkkk
17198a3%%J%klkkononLLLLPPOPMLlpqlLN%nppkkj1j3r%kprpj0qKNLL%%%jJ%%%KKQPJ0J1j%
17170e7MLMMLLLLNNNNPPPQlkkkOJ1J0Nmk5k4k4j1j7j9rQQML%JLJ6K0J5KJRQRRnmnm%JJJJJ
$$ plain form
17145 12 14 15 12 8 4 0 0 -1 -2 -3 0 5 9 13 14 16 17 18 29 39 48 58 62 61 54 64 80 105 128 146 155 151 143 122 88 45 6 -33 -49 -66 -64 -53 -33 -20 -13 -6 8 23 26
17124 26 20 10 6 8 10 10 9 0 -11 -24 -37 -49 -62 -64 -65 -67 -68 -71 -74 -76 -78 -82 -78 -61 -44 -38 -40 -39 -25 -9 7 12 8 8 8 12 16 20 23 27 30 29 27 26 25 32 44 53 62 66 64 65 67 68 69 70 71
17100 71 67 63 59 54 53 52 51 50 43 37 31 24 21 18 15 12 9 6 3 0 2 3 5 6 8 10 13 15 13 12 18 29 44 65 86 101 118 139 164 177 178 178 179 179 179 179 181 177 158 127 94 57 23 -5
17076 -5 -16 -22 -22 -22 -21 -21 -21 -20 -20 -19 -16 -13 -10 -7 -1 3 9 14 20 25 33 36 32 29 25 21 20 19 18 16 19 22 31 31 26 30 45 61 70 75 82 90 98 106 114 122 126 130 133 137 135 133 132 130 126 122 118 115 113 112 111 110 112 114 116 118 120
17047 120 122 124 126 124 123 120 118 121 116 105 94 88 81 78 69 54 38 34 39 40 36 35 34 36 38 41 43 47 51 55 59 58 57 56 55 55 55 55 56 53 51 49 46 48 49 51 53 54 56 58 59 61 62 64 65 67 68 70 71 71 70 70 70 69
17020 69 69 68 68 67 67 67 66 66 65 65 64 60 56 52 48 44 40 36 32 29 27 25 23 19 14 10 6 -3 -13 -16 -13 -7 -1 4 11 18 26 33 41 46 45 49 52 60 73 87 95 103 112 117 128 142 156 160 163 163 163 153 143 140 142
16994 142 141 140 136 132 118 104 93 87 78 70 66 62 58 54 58 61 65 68 67 65 64 62 64 66 68 71 75 80 85 90 86 82 78 74 66 57 48 40 35 31 31 32 36 40 36 27 15 2 0 -1 -4 -6 -8 -22 -46 -82 -129 -175
16969 -175 -212 -233 -238 -231 -209 -182 -155 -115 -71 -37 -21 -4 12 30 29 6 -22 -45 -58 -66 -77 -89 -92 -79 -58 -43 -38 -38 -35 -27 -13 1 10 13 14 15 20 25 30 35 35 34 33 33 29
$$ packed form
17145A2KJlmmm%jjjLNMMJKJJJ1J0RJ0MjpJ0J6K5K3J8Rmqk1l4m3l9l9j6j7KJ1K0J3PPJ4J5L
17124B6oj0mKK%jrj1j3j3j2j3kjkjllkkmMJ7J7OkJJ4J6J6Nm%%MMMLMLjkjjPJ2RRMkJKJJJJ
17100G1mmmnjjjjpoopllllllllKJKJKKLKkjOJ1J5K1K1J5J7K1K5J3J%J%%%Kmj9l1l3l7l4k8
17076ej1o%%J%%J%JLLLLOMONONQLmlmmjjjkLLR%nMJ5J6RNPQQQQQMMLMkkjkmmmlkjjjKKKKK
17047A20KKKkjlkLnj1j1oplrj5j6mNJmjjKKLKMMMMjjjj%%%JlkklKJKKJKKJKJKJKJKJ%j%%j
17020F9%j%j%%j%j%jmmmmmmmmlkkkmnmmrj0lLOONPPQPQNjMLQJ3J4QQRNJ1J4J4ML%%j0j0lK
16994A42jjmmj4j4j1orqmmmmMLMLjkjkKKKLMNNNmmmmqrrqnm%JMMmrj2j3kjlkkj4k4l6m7m6
16969a75l7k1nPK2K7K7M0M4L4J6J7J6J8jk3k8k3j3qj1j2lJ3K1J5N%LQJ4J4RLJJNNNN%jj%m
$$ plain form
16949 29 26 23 19 21 23 24 26 27 28 28 29 30 30 31 32 33 34 35 36 37 38 39 40 40 41 41 41 41 42 42 42 39 36 35 30 23 16 9 1 -6 -12 -10 -5 0 5 5 5 9 12 16 19 22 25 28 32 40 49 57 66 75 82 93 100 99 98 96 95 93
16920 93 92 91 89 90 93 94 96 93 88 86 81 77 73 66 64 64 65 66 66 69 75 79 84 91 98 104 111 115 115 117 119 121 123 125 127 128 129 130 131 127 123 120 114 108 102 95 89 89 93 95 97 101 105 109 113 115 117 118 120 121 123 125 126 122 119 115 111 103 94
16890 94 89 78 64 52 39 25 16 9 1 -6 -16 -23 -31 -39 -45 -50 -56 -61 -54 -47 -41 -34 -33 -36 -39 -37 -15 18 45 73 90 103 123 134 135 135 134 134 137 135 136 136 131 121 110 105 95 81 70 58
16869 58 52 45 39 33 30 28 26 23 18 14 9 4 5 7 8 9 6 2 -1 -5 -7 -10 -13 -15 -15 -15 -15 -15 -21 -26 -32 -37 -42 -53 -60 -67 -69 -65 -65 -64 -58 -51 -45 -39 -38 -38 -38 -37 -31 -26 -20 -14 -12 -10 -7 -5 -5 -5 -6 -6 -9 -13 -16 -20 -18 -17 -15 -13
16839 -13 -17 -20 -23 -27 -18 -8 -4 7 30 48 68 88 111 115 109 104 106 114 119 124 122 114 110 106 95 83 72 61 55 49 43 37 27 17 2 -3 -9 -15 -20 -25 -29 -34 -41 -43 -36 -29 -21 -14 -12 -9 -11 -5 10 27
16816 27 49 62 75 92 106 120 124 123 122 127 133 138 137 127 108 59 -5 -71 -109 -117 -120 -124 -131 -139 -146 -153 -162 -171 -179 -188 -194 -200 -207 -213 -218 -224 -232 -235 -241 -247 -253 -258 -257 -250 -247 -243 -234 -225 -216 -207 -200 -194 -187 -181 -166 -151
16792 -151 -135 -120 -108 -97 -82 -73 -69 -65 -62 -59 -58 -57 -57 -56 -46 -37 -28 -18 -12 -6 0 5 5 6 7 8 12 16 20 24 28 32 36 40 41 41 41 41 36 25 17 9 6 3 0 -3 -5 -8 -8 -13 -22 -26 -23 -20 -18 -21 -42 -81
16767 -81 -119 -157 -185 -200 -207 -202 -198 -185 -169 -161 -158 -155 -146 -133 -112 -92 -70 -57 -46 -41 -39 -37 -35 -33 -31 -28 -26 -24 -29 -46 -67 -88 -99 -109 -130 -150 -171 -176 -180 -183 -187 -191 -195 -199 -196 -194 -192 -190 -190
$$ packed form
16949B9llmKKJKJJ%JJ%JJJJJJJJJJ%J%%%J%%lljnpppqpoKNNN%%MLMLLLLMQRQRRPJ1Pjjkjk
16920I3jjkJLJKlnknmmpk%JJ%LOMNPPOPM%KKKKKKJJJJmmlooopo%MKKMMMMKKJKJKKJmlmmqr
16890I4nj1j4j2j3j4rpqpj0pqqononPPOPJllKK2L3K7K8J7J3K0J1J%j%LkJ%nj0j1nj0j4j1j2
16869E8opoolkklnmnnJKJJlmlmkllk%%%%ononnj1ppkM%JOPOOJ%%JONOOKKLK%%j%lmlmKJKK
16839a3mllmRJ0MJ1K3J8K0K0K3MonKQNNkqmmj1j2j1j1ooooj0j0j5noonnmnpkPPQPKLkOJ5J7
16816B7K2J3J3J7J4J4MjjNONjj0j9m9o4o6l8qlmpqpprrqrooponoqlooonJPLMRRRRPOPOJ5J5
16792a51J6J5J2J1J5RMMLLJJ%JJ0RRJ0OOON%JJJMMMMMMMMJ%%%nj1qqllllkl%nrmLLKlk1l9
16767h1l8l8k8j5pNMJ3J6QLLRJ3K1K0K2J3J1NKKKKKLKKnj7k1k1j1j0k1k0k1nmlmmmmLKKK%
$$ plain form
16746 -190 -190 -190 -190 -190 -190 -190 -190 -189 -188 -187 -186 -185 -184 -183 -182 -185 -187 -190 -192 -190 -187 -184 -182 -176 -171 -165 -159 -153 -147 -141 -135 -129 -123 -110 -92 -79 -71 -67 -68 -74 -74 -67 -60 -57 -58 -58 -57 -61 -73 -84 -89 -89 -89 -89 -88 -91 -95 -98 -101 -96 -90 -85 -80
16718 -80 -77 -75 -73 -70 -68 -66 -64 -61 -60 -58 -57 -52 -33 10 88 157 206 215 231 242 244 231 204 173 144 116 88 59 38 25 18 11 1 -7 -16 -25 -33 -36 -32 -28 -27 -26 -29 -26 -17 -13 -17 -20 -15 -11 -3 -1
16696 -1 -3 -11 -16 -21 -21 -27 -40 -53 -66 -79 -85 -86 -86 -87 -88 -89 -89 -88 -88 -88 -88 -88 -87 -86 -85 -79 -73 -72 -73 -80 -99 -130 -146 -120 -87 -66 -63 -61 -59 -58 -49 -49 -55 -61 -64 -67 -70 -73 -71 -69 -75 -86 -95 -105 -118 -125 -123
16672 -123 -116 -112 -108 -106 -104 -102 -101 -99 -97 -96 -94 -92 -90 -89 -87 -80 -73 -66 -59 -51 -44 -37 -29 -28 -27 -21 -6 8 17 16 10 5 9 28 41 47 43 29 0 -45 -85 -110 -113 -101 -81 -64 -67 -82 -97 -100 -95 -82 -63
16649 -63 -43 -31 -42 -57 -67 -64 -61 -59 -59 -53 -43 -34 -31 -34 -37 -34 -27 -16 -4 6 18 30 44 58 72 86 94 97 102 108 108 108 108 108 108 108 108 108 104 101 98 94 91 88 84 81 80 79 77 76 75 74 73 72
16625 72 74 80 84 87 84 68 49 29 8 -24 -58 -79 -79 -79 -79 -78 -79 -80 -82 -83 -84 -85 -86 -88 -90 -93 -95 -98 -89 -80 -71 -63 -50 -43 -44 -45 -45 -45 -45 -45 -36 -21 -9 1 13 25 37 49 55 62 68 74 80 86
16602 86 93 99 103 107 111 116 115 114 113 111 107 103 99 95 91 87 83 79 79 79 79 78 78 78 78 78 78 78 79 79 79 80 80 80 87 93 99 106 103 101 98 96 91 86 81 75 70 65 60 55 45 35 25 15 5 -4 -14 -24 -37 -51
16576 -51 -64 -77 -87 -91 -90 -86 -81 -76 -77 -84 -92 -91 -85 -79 -77 -72 -66 -65 -65 -65 -66 -67 -71 -76 -81 -85 -90 -94 -99 -104 -105 -105 -106 -107 -108 -109 -110 -111 -113 -115 -120 -120 -112 -102 -93 -84 -77 -75 -77 -67 -52 -38 -34 -29 -18 -7 3 14
$$ packed form
16746a90%%%%%%%JJJJJJJJlklkKLLKONOOOOOOOOJ3J8J3QMjo%PPLj%Jmj2j1n%%%JlmllNONN
16718h0LKKLKKKLJKJNJ9M3P8O9M9RJ6J1Kj3k7l1k9k8k8k9k1j3ppj0qrrqlMMJJlLRMmlNMQK
16696akqnn%oj3j3j3j3oj%jjj%J%%%%JJJOOJjpj9l1j6K6L3K1LKKJR%oollllKKoj1rj0j3pK
16672a23PMMKKKJKKJKKKJKPPPPQPPQJJOJ5J4RjonMJ9J3Omj4k9m5m0k5lJ2K0J7lj5j5lNJ3J9
16649f3K0J2j1j5j0LLK%OJ0RLllLPJ1J2J0J2J2J4J4J4J4QLNO%%%%%%%%mllmllmljjkjjjjj
16625G2KOMLlj6j9k0k1l2l4k1%%%JjjkjjjjkklklRRRQJ3Pjj%%%%RJ5J2J0J2J2J2J2OPOOOO
16602H6POMMMNjjjkmmmmmmmm%%%j%%%%%%J%%J%%POOPlklknnnonnnnj0j0j0j0j0rj0j0j3j4
16576e1j3j3j0mJMNNjpqJOOKNOJ%%jjmnnmnmnnj%jjjjjjkkn%QJ0RRPKkJ0J5J4MNJ1J1J0J1
$$ plain form
16551 14 12 10 9 7 -1 -9 -18 -26 -28 -29 -41 -52 -64 -67 -62 -49 -38 -28 -22 -16 0 23 51 63 62 55 51 46 46 46 55 65 59 43 28 12 4 -4 4 12 14 16 13 9 12 16 24 33 41 49 52 55 55 55 56
16528 56 56 56 56 48 23 -1 -26 -46 -75 -103 -118 -113 -103 -97 -100 -108 -116 -117 -119 -120 -121 -115 -108 -108 -113 -116 -110 -99 -88 -82 -77 -82 -87 -94 -101 -108 -116 -119 -122 -125 -129 -127 -125 -123 -121 -121 -121 -121 -121 -121 -121 -121 -122 -115 -109 -103 -97 -91 -85
16502 -85 -79 -73 -69 -66 -62 -59 -61 -62 -64 -66 -63 -59 -56 -53 -50 -47 -44 -40 -30 -20 -10 0 9 19 29 39 51 64 77 90 97 105 113 120 121 121 121 122 125 123 117 106 94 82 69 56 46 31 16 6
16481 6 0 -4 -10 -15 -20 -26 -31 -36 -35 -35 -34 -33 -33 -32 -31 -30 -30 -30 -29 -29 -34 -39 -44 -49 -50 -52 -53 -55 -56 -58 -59 -61 -65 -68 -72 -75 -70 -65 -60 -55 -50 -46 -42 -37 -33 -29 -22 -21 -22 -24 -26 -28 -25 -22 -19 -16 -15 -15 -15 -15 -15 -15 -14 -14 -15 -15 -16 -17 -17 -18
16450 -18 -18 -19 -23 -27 -31 -36 -45 -54 -64 -73 -82 -91 -100 -109 -109 -109 -108 -107 -112 -112 -103 -93 -88 -88 -88 -83 -77 -71 -70 -75 -72 -69 -66 -63 -65 -67 -69 -70 -72 -74 -76 -78 -71 -65 -59 -53 -46 -40 -34 -28 -20 -13 -5 1 3 6 8 10 12 15 17 19 16 13 10 7 2
16422 2 -1 -6 -11 -21 -31 -41 -51 -53 -56 -58 -61 -58 -55 -52 -50 -46 -42 -38 -34 -23 -12 4 26 48 65 80 94 106 117 123 130 130 131 120 109 101 99 93 87 71 46 23 5 0 -5 -10 -16 -21 -27 -32
16400 -32 -37 -37 -31 -28 -26 -27 -29 -30 -31 -38 -45 -43 -41 -42 -49 -57 -65 -71 -76 -81 -86 -84 -82 -75 -77 -76 -71 -69 -67 -61 -55 -49 -43 -40 -41 -40 -39 -41 -43 -45 -46 -53 -60 -67 -74 -80 -85 -90 -95 -95 -95 -95 -95 -95 -95 -95 -95 -86 -77 -69 -60 -52 -44 -40 -30 -20 -15
16371 -15 -8 0 8 18 27 36 42 54 62 70 76 82 83 78 72 66 60 54 51 47 43 40 36 33 29 25 23 21 19 17 15 13 11 9 14 19 24 29 34 39 45 50 56 62 69 75 82 88 95 101 105 108 112 115 113 111 109 106 113 120 123 117 97 78 63
$$ packed form
16551A4kkjkqqrqkjj2j1j2lNJ3J1J0OOJ6K3K8J2jpmn%%RJ0oj6j5j6qqQQKKlmLMQRQQLL%%J
16528E6%%%qk5k4k5k0k9k8j5NJ0OlqqjkjjOP%nlOJ1J1ONnnpppqlllmKKKK%%%%%%%jPOOOOO
16502h5OOMLMLkjkkLMLLLLLMJ0J0J0J0RJ0J0J0J2J3J3J3PQQPJ%%JLkoj1j2j2j3j3j0j5j5j0
16481FomonnonnJ%JJ%JJJ%%J%nnnnjkjkjkjkmlmlNNNNNMMNMMPJjkkkLLLLJ%%%%%J%j%jj%j
16450a8%jmmmnrrj0rrrrr%%JJn%RJ0N%%NOOJnLLLLkkkjkkkkPOOOPOOOQPQOKLKKKLKKlllln
16422Blnnj0j0j0j0klklLLLKMMMMJ1J1J6K2K2J7J5J4J2J1OP%Jj1j1qkooj6k5k3j8nnnonon
16400c2n%OLKjkjjppKKjpqqonnnKKPkJNKKOOOOLjJJkkkjpppponnn%%%%%%%%RRQRQQMJ0J0N
16371a5PQQJ0RROJ2QQOOJnoooolmmlmlmmkkkkkkkkNNNNNNONOOPOPOPOMLMLkkklPPLok0j9j5
$$ plain form
16343 63 53 46 39 27 15 8 9 11 12 11 11 10 9 3 -1 -2 2 6 1 -7 -15 -18 -22 -30 -44 -56 -59 -51 -42 -38 -33 -29 -25 -18 -11 -5 1 8 15 21 27 23 10 2 -5 -8 -11 -11 -16 -26 -36 -39 -37 -38 -39 -40 -41 -48 -55 -66
16317 -66 -69 -62 -56 -59 -62 -64 -67 -69 -71 -74 -72 -70 -74 -83 -92 -104 -110 -108 -100 -95 -90 -79 -68 -64 -66 -61 -52 -43 -39 -37 -36 -38 -34 -31 -33 -32 -30 -28 -26 -23 -21 -27 -33 -40 -46 -52 -59 -65 -71 -72 -74 -75 -76 -73 -71 -69 -67 -74 -86 -94 -103 -112 -116 -112 -109
16289 -109 -103 -98 -100 -106 -119 -119 -103 -86 -72 -57 -40 -28 -16 -3 0 0 2 5 7 10 15 20 25 30 35 40 45 50 52 55 60 60 54 49 43 37 35 34 32 31 35 39 36 27 22 16 7 4 6 7 9 11 14 17 20 23 28 38
16264 38 46 53 58 58 61 64 69 74 79 84 87 89 91 93 100 106 113 119 126 127 120 114 107 101 95 89 89 89 90 90 85 80 75 70 58 46 35 23 13 4 -5 -14 -25 -35 -46 -57 -70 -84 -97 -110 -119 -127 -135 -143 -146 -149
16240 -149 -152 -155 -152 -148 -145 -142 -139 -137 -124 -100 -69 -44 -26 -7 16 41 64 71 72 73 73 73 78 83 80 73 68 68 65 62 62 62 52 41 33 26 18 10 7 4 1 -1 -2 -2 1 6 9 13 11 4 -2 -9 -11 -14 -14 -15 -15
16215 -15 -16 -19 -22 -25 -28 -29 -29 -30 -30 -34 -38 -42 -46 -48 -49 -50 -52 -51 -49 -51 -47 -41 -34 -27 -21 -16 -11 1 15 23 27 38 55 69 72 69 72 79 86 91 91 86 80 69 59 50 42 34 25 16 6 -2 -12 -22 -31 -41 -51
16191 -51 -57 -63 -71 -75 -76 -76 -78 -68 -53 -39 -31 -24 -18 -6 7 21 18 11 6 2 2 3 4 4 2 1 0 -2 -4 -6 -8 -10 -17 -25 -32 -39 -42 -44 -46 -48 -49 -51 -52 -53 -60 -67 -73 -80 -87 -95 -102 -109 -111 -107 -106 -105 -100 -94 -89 -84 -73 -62
16164 -62 -52 -41 -36 -32 -27 -23 -15 -8 -1 5 13 22 30 38 41 44 47 50 53 57 60 63 64 64 65 65 66 67 68 69 65 60 56 52 51 50 49 47 46 45 44 43 42 41 40 38 37 36 35 34 36 39 42 45 45 45 46 46 43 40 37 34 36 38 40 43 44
$$ packed form
16343F3j0ppj2j2pJKJj%jjomjMMnqqlmqj4j2lQRMNMMPPOOPPOOmj3qpll%nj0j0lKjjjjppj1
16317f6lPOllklkklKKmrrj2oKQNNJ1J1MkNRRMKJkMLkJKKKLKoopoopoojkjjLKKKpj2qrrmML
16289a09ONkoj3%J6J7J4J5J7J2J2J3L%KLKLNNNNNNNNKLN%onookjkjMMlrnorlKJKKLLLLNJ0
16264C8QPN%LLNNNNLKKKPOPOPJpopooo%%J%nnnnj2j2j1j2j0rrrj1j0j1j1j3j4j3j3rqqqll
16240a49llLMLLLKJ3K4L1K5J8J9K3K5K3PJJ%%NNlpn%ll%%j0j1qpqqlllkj%LNLMkpopkl%j%
16215a5jllllj%j%mmmmkjjkJKkMOPPONNJ2J4QMJ1J7J4LlLPPN%noj1j0rqqrrj0qj0j0rj0j0
16191e1ooqmj%kJ0J5J4QPOJ2J3J4lpnm%JJ%kjjkkkkkpqpplkkkjkjjppoppqppkMJJNONNJ1J1
16164f2J0J1NMNMQPPOQRQQLLLLLMLLJ%J%JJJJmnmmjjjkjjjjjjjkjjjjKLLL%%J%llllKKKLJ
$$ plain form
16135 44 46 48 50 46 43 39 36 39 41 44 47 50 53 57 58 50 37 26 16 5 -5 -15 -26 -28 -30 -32 -35 -37 -39 -41 -43 -48 -54 -61 -64 -59 -51 -46 -39 -30 -24 -16 -8 -3 1 6 11 12 12 13 14 14 15 16 16 8 1 -6 -14 -22 -29 -37
16109 -37 -45 -51 -57 -64 -70 -70 -71 -73 -81 -90 -97 -100 -95 -79 -62 -43 -11 17 31 19 -10 -60 -109 -151 -176 -194 -200 -202 -201 -196 -188 -181 -174 -166 -158 -150 -143 -135 -127 -119 -111 -103 -96 -88 -80 -69 -59 -48 -38 -29 -20 -11
16086 -11 -2 0 4 8 11 20 29 38 47 53 60 66 72 69 65 62 58 59 59 51 28 3 -20 -36 -51 -78 -105 -130 -140 -142 -141 -138 -140 -147 -157 -162 -164 -160 -147 -122 -97 -73 -49 -21 -1 4 5 0 -7 -8 -4 -2
16064 -2 -2 -5 -8 -12 -15 -13 -11 -9 -7 -8 -10 -11 -13 -17 -21 -25 -29 -29 -28 -28 -27 -22 -16 -10 -5 -6 -7 -8 -9 -12 -10 -2 35 84 157 228 289 325 344 344 326 302 288 272 246 213 174 139 103 80 67 60
16041 60 63 66 63 53 44 38 32 31 31 27 22 18 14 8 3 -2 -7 -13 -18 -24 -30 -33 -37 -41 -45 -51 -58 -64 -70 -72 -73 -75 -76 -72 -68 -65 -61 -52 -42 -33 -24 -12 0 11 23 36 49 63 76 85 93 101 109 112 115 118 121 119 117
16016 117 115 113 106 100 93 86 80 73 67 60 60 60 60 60 60 60 61 61 61 62 63 64 67 71 74 77 83 88 93 99 92 85 79 73 67 66 67 68 68 63 52 33 -15 -79 -139 -169 -179 -183 -180 -177 -170 -164 -158 -152 -148 -144 -142 -136 -119 -102
15990 -102 -84 -67 -55 -43 -29 -19 -13 -7 -1 4 9 15 21 27 32 38 43 49 48 43 40 37 35 34 32 30 31 32 33 34 28 22 16 10 0 -11 -22 -33 -42 -51 -61 -70 -79 -88 -97 -107 -114 -122 -130 -137 -143 -148 -153 -158 -159 -159
15966 -159 -160 -161 -167 -173 -179 -184 -188 -192 -196 -199 -198 -197 -196 -195 -192 -189 -192 -194 -199 -203 -201 -195 -182 -170 -158 -145 -137 -129 -122 -114 -109 -105 -101 -96 -92 -88 -84 -79 -72 -65 -58 -51 -44 -36 -29 -22 -23 -23 -24 -24 -27 -25 -21 -26 -30 -34 -30 -25 -26 -26 -30 -29 -28 -32
$$ packed form
16135D4KKKmlmlLKLLLLMJqj3j1j0j1j0j0j1kkklkkkknoplNQNPROQQNMNNJ%JJ%JJ%qppqqpq
16109c7qoopo%jkqrplNJ6J7J9L2K8J4j2k9n0m9m2k5j8okJNQPPQQQPQQQQQPQQJ1J0J1J0RRR
16086a1RKMMLRRRROPOOlmlmJ%qk3k5k3j6j5k7k7k5j0kJLkpj0nkMJ3K5K5K4K4K8K0NJnpjMK
16064b%llmlKKKKjkjkmmmm%J%JNOONjjjjlKQL7M9P3P1O1L6J9%j8k4j4j6k6l3l9l5l6k3j3p
16041F0LLlj0rooj%mnmmonnnonoolmmmopookjkjMMLMRJ0RRJ2J2J1J2J3J3J4J3RQQQLLLLkk
16016A17kkpoppopop%%%%%%J%%JJJLMLLONNOppooojJJ%nj1j9m8o4o0l0j0mLLPOOOMMKOJ7J7
15990a02J8J7J2J2J4J0OOONNOOONONOjnllkjkkJJJJooooj0j1j1j1rrj0rrrrj0pqqponnnj%
15966a59jjooonmmmlJJJJLLlknmKOJ3J2J2J3QQPQNMMNMMMNPPPPPQPPj%j%lKMnmmMNj%mJJm
$$ plain form
15938 -32 -33 -35 -36 -38 -39 -41 -36 -32 -28 -24 -25 -26 -27 -28 -26 -25 -23 -22 -15 -8 -1 4 7 10 12 15 20 25 31 36 38 41 43 45 45 45 45 45 41 38 35 32 28 25 22 19 15 12 8 5 2 -1 -4 -7 -10 -12 -17 -17 -20 -23 -26 -28 -32 -36 -39 -43 -46 -50 -53
15909 -53 -57 -55 -53 -51 -49 -45 -41 -34 -32 -36 -39 -46 -47 -43 -39 -34 -30 -29 -29 -29 -28 -25 -22 -19 -16 -14 -13 -11 -10 -8 -6 -5 -3 -8 -12 -16 -21 -20 -19 -18 -17 -16 -15 -14 -13 -12 -11 -11 -10 -13 -16 -19 -22 -25 -28 -31 -34 -31 -29 -27 -25 -23 -21 -19 -17 -15 -14 -12 -10
15879 -10 -10 -6 3 14 17 16 15 18 20 21 22 24 20 16 12 8 5 1 -2 -6 -11 -15 -20 -25 -30 -35 -40 -44 -46 -48 -46 -50 -63 -76 -90 -103 -112 -121 -130 -139 -139 -139 -139 -139 -136 -132 -128 -125 -121 -118 -114 -111 -103 -95 -87 -79 -66 -53 -40 -27
15853 -27 -22 -18 -13 -9 -10 -10 -11 -12 -15 -18 -20 -23 -26 -29 -32 -35 -34 -33 -31 -30 -29 -28 -27 -26 -25 -23 -21 -20 -18 -16 -15 -13 -4 4 13 22 26 24 22 26 42 62 88 101 118 139 164 177 174 171 168 164 160 155 151 146 138 125 106
15828 106 87 68 49 30 11 -8 -22 -33 -40 -44 -49 -52 -56 -62 -62 -59 -48 -26 22 66 102 103 95 80 65 55 53 55 57 55 47 34 21 12 4 -4 -13 -21 -29 -42 -55 -70 -85 -94 -98 -95
15808 -95 -92 -88 -85 -89 -99 -111 -114 -98 -81 -58 -45 -29 -8 8 26 30 35 39 43 48 52 56 60 57 54 47 39 35 35 42 49 57 65 67 64 64 64 64 64 64 65 65 65 65 65 65 65 61 57 53 50 46 42 38 34 27 19 12 4
15782 4 2 0 -1 -3 2 8 13 19 20 20 22 21 17 12 6 2 5 10 13 17 16 15 15 12 1 -13 -25 -38 -45 -48 -55 -59 -59 -59 -59 -59 -62 -68 -72 -76 -81 -85 -89 -93 -90 -84 -80 -76 -71 -67 -61 -58 -55 -55 -53 -52 -50 -48 -47 -45 -43 -41 -38 -36 -34 -31
15754 -31 -30 -27 -23 -20 -17 -13 -10 -7 -3 0 -1 -3 -4 -5 -7 -8 -9 -11 -14 -17 -20 -23 -26 -29 -32 -34 -33 -28 -26 -23 -21 -21 -24 -28 -31 -32 -26 -16 -14 -12 -12 -9 -7 -5 -4 -1 0 -1 -6 -10 -12 -9 2 13 18 23 29 33 34 35 36 37 43 50 56 62
$$ packed form
15938c2jkjkjkNMMMjjjjKJKJPPPNLLKLNNONKLKK%%%%mlllmlllmlmllllllkn%lllkmmlmlml
15909e3mKKKKMMPKmlpjMMNMJ%%JLLLLKJKJKKJKnmmnJJJJJJJJJJ%JllllllllLKKKKKKKKJKK
15879a0%MRJ1LjjLKJJKmmmmlmlmnmnnnnnmkkKmj3j3j4j3rrrr%%%%LMMLMLMLQQQQJ3J3J3J3
15853b7NMNMj%jjllklllllJJKJJJJJJKKJKKJKRQRRMkkMJ6K0K6J3J7K1K5J3lllmmnmnqj3j9
15828A06j9j9j9j9j9j9j4j1pmnlmo%LJ1K2M8M4L6Jqj5j5j0kKKkqj3j3rqqrqqj3j3j5j5rmL
15808i5LMLmj0j2lJ6J7K3J3J6K1J6J8MNMMNMMMllpqm%PPQQKl%%%%%J%%%%%%mmmlmmmmpqpq
15782DkkjkNONOJ%KjmnomLNLMjj%lj1j4j2j3plpm%%%%lommnmmmLOMMNMOLL%KJKKJKKKLKKL
15754c1JLMLLMLLMLjkjjkjjklllllllkJNKLK%lmljOJ0KK%LKKJLJjnmkLJ1J1NNOMJJJJOPOO
$$ plain form
15725 62 63 65 66 68 60 53 46 39 34 30 26 22 17 13 9 5 0 -6 -12 -18 -29 -40 -51 -62 -60 -58 -56 -53 -51 -49 -47 -44 -41 -37 -33 -29 -30 -32 -38 -45 -45 -46 -36 -26 -20 -13 -12 -11 -9 -6 -9 -11 -16 -22 -27 -32 -29 -25 -22 -18 -20 -21 -23
15698 -23 -24 -35 -46 -52 -58 -63 -79 -98 -118 -137 -146 -144 -153 -175 -197 -205 -196 -177 -158 -148 -139 -116 -94 -75 -68 -64 -59 -46 -32 -18 -4 -1 1 0 -1 1 5 7 9 11 3 -16 -36 -67 -97 -122
15678 -122 -136 -139 -142 -142 -142 -142 -142 -147 -152 -146 -141 -131 -122 -106 -101 -100 -98 -80 -62 -46 -35 -22 -9 -5 -10 -15 -11 -1 9 20 31 33 30 29 29 29 29 30 30 31 31 31 32 28 25 22 18 10 1 -6 -15 -23 -31 -39 -47
15655 -47 -46 -45 -44 -43 -45 -48 -40 -32 -25 -19 -15 -6 6 18 17 11 9 12 12 12 8 3 -1 -6 -8 -11 -13 -15 -13 -11 -9 -7 -11 -14 -17 -20 -19 -14 -11 -8 -11 -13 -15 -17 -17 -16 -16 -15 -14 -13 -12 -11 -10 -10 -2 10 20 31 34 32 32 32 39 52
15627 52 64 67 55 37 24 11 -1 -14 -20 -26 -32 -38 -44 -50 -55 -61 -62 -62 -63 -64 -66 -68 -70 -72 -71 -71 -70 -70 -66 -62 -59 -55 -54 -52 -51 -50 -47 -43 -40 -36 -28 -19 -11 -2 0 -1 1 1 -4 -7 -3 1 -3 -20 -36 -44 -44 -54 -69
15602 -69 -82 -90 -92 -87 -82 -83 -84 -85 -86 -88 -89 -90 -91 -92 -93 -95 -96 -99 -102 -105 -108 -110 -113 -116 -119 -124 -129 -134 -139 -143 -147 -152 -156 -153 -151 -141 -128 -118 -123 -134 -148 -144 -115 -79 -38 -7 23 46 64 70 71 74 79 80 84 87
15578 87 88 86 84 82 80 72 65 57 50 36 22 9 -4 -17 -25 -28 -27 -33 -42 -49 -56 -62 -69 -75 -82 -83 -84 -85 -85 -86 -87 -88 -89 -95 -100 -105 -111 -116 -122 -127 -133 -132 -131 -131 -130 -124 -118 -112 -106 -98 -90 -83 -75 -64 -54 -44 -34 -27 -26 -22
15552 -22 -18 -16 -15 -14 -13 -20 -27 -35 -42 -49 -57 -64 -71 -80 -89 -98 -106 -109 -107 -107 -108 -106 -104 -103 -101 -94 -87 -80 -73 -66 -59 -52 -45 -39 -32 -25 -18 -12 -6 0 5 2 0 -3 -5 -6 -7 -7 -8 -13 -19 -25 -31 -39 -48 -56 -65 -65 -64 -64 -64 -64 -65 -68 -66 -60 -48 -27
$$ packed form
15725F2JKJKqpppnmmmnmmmnoooj1j1j1j1KKKLKKKLLMMMjkop%jJ0J0OPJJKLlknonnLMLMkjk
15698b3jj1j1oonj6j9k0j9rKrk2k2qRJ9J9J0RK3K2J9PMNJ3J4J4J4LKjjKMKKKqj9k0l1l0k5
15678a22j4ll%%%%nnONJ0RJ6NJKJ8J8J6J1J3J3MnnMJ0J0J1J1Klj%%%J%J%%Jmllmqrprqqqq
15655d7JJJJklQQPOMRJ2J2jokL%%mnmnklkkKKKKmlllJNLLlkkk%J%JJJJJJ%QJ2J0J1Lk%%PJ3
15627E2J2Lj2j8j3j3j2j3oooooonoj%jjkkkkJ%J%MMLMJKJJLMLMQRQRKjK%nlMMmj7j6q%j0j5
15602f9j3qkNNjjjjkjjjjjkjllllklllnnnnmmnmLKJ0J3J0nj1j4MK9L6M1L1L0K3J8OJLNJML
15578H7Jkkkkqpqpj4j4j3j3j3qlJorppopopjjj%jjjjonnononoJJ%JOOOOQQPQJ1J0J0J0PJM
15552b2MKJJJppqppqpprrrqlK%jKKJKPPPPPPPPOPPPOOONlklkjj%jnoooqrqr%J%%%jlKOJ2K1
$$ plain form
15522 -27 2 27 53 78 104 119 125 125 126 128 130 131 132 137 131 113 84 49 14 -18 -36 -47 -45 -33 -20 -13 -10 -10 -10 -16 -21 -26 -31 -34 -36 -39 -42 -53 -64 -76 -87 -96 -105 -114 -124 -127 -131 -135 -139
15501 -139 -137 -135 -132 -129 -121 -107 -97 -86 -71 -57 -42 -27 -10 11 34 49 61 68 78 87 90 94 97 100 105 111 110 101 82 62 52 42 22 -1 -29 -45 -49 -48 -56 -70 -83 -96 -104 -112
15482 -112 -119 -126 -132 -139 -141 -143 -145 -146 -143 -140 -136 -133 -129 -119 -113 -107 -97 -88 -79 -70 -61 -57 -53 -43 -37 -31 -25 -19 -22 -25 -28 -30 -33 -36 -39 -42 -43 -44 -45 -46 -41 -37 -33 -29 -27 -30 -31 -31 -27 -22 -18 -14 -6 0 8 15 13 11 9 7 9 11 11 -3
15455 -3 -21 -35 -38 -36 -31 -32 -39 -47 -48 -43 -42 -41 -42 -42 -43 -43 -36 -29 -21 -14 -7 -1 5 12 11 10 9 8 12 16 20 24 21 19 18 16 18 26 32 34 23 0 -21 -36 -49 -71 -91 -103 -108 -103 -102 -103 -104 -105 -107 -108 -100 -91 -83 -75
15429 -75 -65 -56 -46 -37 -28 -19 -12 -1 19 43 61 69 80 95 116 138 138 119 96 81 75 66 50 32 14 2 -3 -6 -8 -10 -11 -12 -12 -11 -11 -10 0 9 20 30 62 99 132 124 95
15409 95 70 55 45 34 23 13 2 1 1 -6 -20 -32 -41 -43 -43 -42 -42 -41 -41 -46 -51 -56 -61 -62 -63 -64 -65 -67 -69 -71 -73 -75 -77 -79 -81 -79 -76 -74 -72 -69 -67 -65 -62 -59 -56 -53 -50 -43 -36 -28 -21 -22 -22 -23 -23 -28 -33 -38 -43 -47
15384 -47 -47 -49 -51 -56 -60 -59 -50 -36 -22 -8 5 26 46 72 88 93 98 103 107 105 104 102 100 100 99 98 96 93 80 62 32 1 -25 -53 -82 -107 -109 -103 -92 -85 -84 -80 -75 -72 -68 -57 -40 -23 -6
15362 -6 3 7 13 20 26 32 43 55 66 78 82 82 84 87 92 96 101 106 104 103 102 100 101 102 102 103 98 92 87 82 72 63 54 45 35 26 17 8 0 -7 -14 -22 -27 -32 -37 -42 -46 -50 -54 -58 -56 -48 -43 -38 -31 -24 -17 -9 -5 0 3 8 15 23
$$ packed form
15522b7K9K5K6K5K6J5O%JKKJJNoj8k9l5l5l2j8j1KJ2J3PL%%onnnlkllj1j1j2j1rrrj0lmmm
15501a39KKLLQJ4J0J1J5J4J5J5J7K1K3J5J2PJ0RLMLLNOjrj9k0j0j0k0k3k8j6mJqj4j3j3qq
15482a12ppopkkkjLLMLMJ0OOJ0RRRRMMJ0OOOOlllklllljjjjNMMMKlj%MNMMQOQPkkkkKK%j4
15455cj8j4lKNjpqjNJJj%j%PPQPPOOPjjjjMMMMlkjkKQOKj1k3k1j5j3k2k0j2nNJjjjkjQRQQ
15429g5J0RJ0RRRPJ1K0K4J8QJ1J5K1K2%j9k3j5orj6j8j8j2nlkkjj%J%JJ0RJ1J0L2L7L3qk9
15409I5k5j5j0j1j1j0j1j%pj4j2rk%J%J%nnnnjjjjkkkkkkkkKLKKLKKLLLLLPPQPj%j%nnnnm
15384d7%kknmJRJ4J4J4J3K1K0K6J6NNNMkjkk%jjklj3j8l0l1k6k8k9k5kOJ1PJMNLMJ1J7J7J7
15362fRMOPOOJ1J2J1J2M%KLNMNNkjjkJJ%Jnonnj0rrrj0rrrqppqnnnnmmmmKQNNPPPQMNLNPQ
$$ plain form
15335 23 30 38 39 40 42 43 38 32 27 21 18 15 12 9 5 2 -1 -5 -9 -13 -16 -20 -18 -16 -14 -12 -10 -8 -6 -4 0 3 7 11 9 7 6 4 -1 -7 -9 -10 -10 -18 -38 -57 -65 -63 -64 -70 -76 -83 -82 -76 -72 -69 -65 -61 -52 -43 -34 -26 -17 -8 3 9
15306 9 12 16 19 22 29 36 43 50 48 46 43 41 40 38 37 36 39 42 45 48 51 54 58 61 56 52 42 33 25 22 27 31 36 41 46 51 46 41 36 30 25 20 15 10 6 2 -1 -5 -9 -13 -17 -21 -30 -39 -48 -57 -58 -53 -52 -50 -49 -49 -48 -47 -47 -46 -45 -45 -48
15277 -48 -51 -51 -56 -63 -70 -78 -86 -94 -107 -127 -147 -162 -171 -184 -196 -207 -218 -229 -239 -242 -239 -234 -229 -231 -233 -231 -218 -205 -197 -194 -185 -172 -158 -155 -152 -146 -140 -130 -119 -111 -103 -100 -97 -92 -86 -80 -74 -60 -46 -32
15255 -32 -17 -6 4 16 27 33 38 44 49 51 52 53 54 54 54 54 54 48 41 35 29 23 18 12 6 7 7 7 8 7 6 5 4 9 15 20 25 26 22 22 22 24 32 36 40 43 40 40 40 37 33 29 25 27 23 12 1 -4 -10 -11 -12 -19
15228 -19 -31 -44 -51 -56 -60 -65 -69 -70 -70 -70 -70 -65 -60 -55 -50 -46 -43 -39 -35 -29 -23 -17 -11 -5 0 6 12 13 14 15 16 15 15 14 13 12 6 -6 -34 -68 -121 -163 -189 -190 -186 -177 -162 -156 -154 -157 -155 -150 -140 -128 -116 -100
15204 -100 -86 -78 -76 -77 -78 -75 -70 -63 -62 -66 -72 -77 -81 -86 -91 -95 -100 -105 -110 -112 -114 -116 -118 -113 -108 -103 -98 -94 -89 -84 -79 -74 -70 -65 -61 -56 -51 -47 -42 -41 -39 -38 -36 -38 -39 -40 -41 -45 -48 -52 -56 -51 -46 -41 -36 -36 -35 -35 -34 -34 -33 -32 -32 -32 -32 -32 -31
15175 -31 -31 -31 -31 -31 -30 -30 -29 -28 -28 -27 -26 -26 -29 -33 -37 -40 -44 -48 -51 -55 -54 -53 -53 -52 -58 -68 -75 -83 -90 -93 -99 -105 -101 -98 -95 -91 -96 -101 -105 -110 -115 -119 -124 -129 -123 -117 -112 -106 -100 -94 -89 -83 -81 -80 -78 -76 -75 -73 -71 -69 -65 -61 -52 -44 -35 -30 -29 -35
15146 -35 -39 -38 -29 -21 -14 -5 1 1 -3 -1 5 14 22 25 23 16 7 -4 -12 -16 -17 -18 -19 -19 -23 -27 -30 -34 -33 -31 -29 -28 -28 -27 -27 -27 -24 -21 -19 -16 -16 -16 -17 -17 -18 -18 -18 -19 -19 -20 -20 -20 -21 -21 -22 -22 -21 -20 -18 -17 -16 -15 -14 -12 -20 -28 -36 -43
$$ packed form
15335B3PQJJKJnonollllmllmmmlmKKKKKKKKMLMMkkjknokj%qk0j9qKjoopJOMLMMRRRQRRJ1O
15306ILMLLPPPPkklkjkjjLLLLLLMLnmj0rqlNMNNNNnnnonnnnmmlmmmmmrrrrjNJKJ%JJ%JJ%l
15277d8l%nppqqqj3k0k0j5rj3j2j1j1j1j0lLNNkkKJ3J3QLRJ3J4LLOOJ0J1QQLLNOOOJ4J4J4
15255c2J5J1J0J2J1ONONKJJJ%%%%opooonooJ%%JjjjjNONNJm%%KQMMLl%%lmmmKmj1j1nojjp
15228a9j2j3pnmnmj%%%NNNNMLMMOOOOONOOJJJJj%jjjoj2k8l4n3m2k6jMRJ5OKlKNJ0J2J2J6
15204a00J4QKjjLNPJmonmnnmnnnkkkkNNNNMNNNNMNMNNMNJKJKkjjjmlmmNNNN%J%J%JJ%%%%J
15175c1%%%%J%JJ%JJ%lmmlmmlmJJ%Joj0pqplooMLLMnnmnnmnnOONOOONOKJKKJKKKMMRQRNJo
15146c5mJRQPRO%mKORQLkprj1qmjjj%mmlmJKKJ%J%%LLKL%%j%j%%j%j%%j%j%JJKJJJJKqqqp
$$ plain form
15117 -43 -51 -59 -66 -74 -75 -75 -76 -76 -74 -72 -70 -68 -70 -72 -73 -75 -77 -73 -62 -51 -40 -30 -19 -8 -2 3 10 16 17 18 19 21 19 17 13 13 21 29 30 25 21 17 12 7 2 -2 -4 -12 -21 -30 -40 -49 -58 -67 -70 -67 -62 -66 -85 -98
15091 -98 -104 -95 -83 -71 -55 -24 14 53 65 62 50 39 37 44 47 49 46 37 33 28 25 27 26 26 18 11 7 -1 -12 -18 -18 -17 -22 -38 -69 -94 -116 -139 -163 -182 -192 -190 -182 -175 -151 -101 -44 3
15070 3 22 28 30 31 31 30 30 29 30 31 32 33 25 17 10 2 -5 -13 -21 -28 -34 -39 -44 -49 -61 -73 -85 -97 -103 -110 -116 -123 -124 -126 -127 -129 -131 -133 -124 -116 -108 -100 -92 -85 -82 -78 -75 -72 -66 -60 -54 -48 -42 -36 -30 -24 -16 -8 0 7 18 25 24 23
15043 23 28 41 55 60 62 64 59 46 29 4 -29 -57 -59 -46 -39 -36 -46 -56 -66 -76 -82 -83 -77 -71 -68 -66 -63 -61 -58 -55 -51 -48 -43 -38 -33 -28 -28 -28 -28 -28 -28 -27 -27 -27 -35 -43 -51 -60 -64 -68 -73 -77 -81 -85 -93 -94 -89
15018 -89 -83 -77 -71 -66 -60 -54 -48 -45 -41 -38 -34 -25 -17 -8 0 9 18 27 36 36 36 36 37 37 37 35 36 36 36 35 35 31 27 25 20 15 13 9 6 4 2 0 -1 -3 -4 -7 -8 -5 -3 0 2 5 8 10 13 10 4 1 -4 -8 -12 -16 -21 -24 -28 -32 -36 -43 -53
14988 -53 -62 -71 -78 -86 -95 -101 -100 -99 -98 -97 -93 -91 -95 -87 -73 -59 -44 -30 -18 -1 14 27 31 32 35 38 43 48 54 59 65 70 75 81 85 90 96 99 99 98 98 97 98 98 98 98 98 98 100 99 90 78 68 58 43 27
14964 27 12 -3 -11 -16 -23 -30 -37 -44 -51 -58 -59 -58 -59 -59 -55 -49 -44 -40 -31 -22 -13 -4 0 2 7 10 7 5 3 0 -1 -3 -6 -8 -13 -17 -21 -26 -35 -45 -54 -64 -65 -67 -68 -70 -62 -55 -53 -50 -44 -37 -23 -4 9 14 20 34 49 59
14938 59 58 51 45 39 38 36 38 39 34 21 2 -25 -56 -82 -114 -140 -166 -166 -155 -138 -130 -128 -127 -127 -127 -127 -119 -111 -103 -94 -90 -86 -82 -78 -74 -70 -66 -62 -52 -42 -32 -22 -13 -3 6 16 21 26 31 36 37 38 44
$$ packed form
15117d3qqpqj%j%KKKKkkjkkMJ1J1J1J0J1J1ONPOJJJKkkm%QQJnmmnnnmkqrrj0rrrlLNmj9j3
15091i8oRJ2J2J6L1L8L9J2lj2j1kPLKlrmnlKj%qpmqj1o%Jnj6l1k5k2k3k4j9j0KQPK4N0N7M7
15070CJ9OKJ%j%jJJJJqqpqpqqponnnj2j2j2j2opopjkjkkkRQQQQPLMLLOOOOOOOOQQQPJ1Pjj
15043B3NJ3J4NKKnj3j7k5l3k8kJ3PLj0j0j0j0ojOOLKLKLLMLNNNN%%%%%J%%qqqrmmnmmmqjN
15018h9OOONOOOLMLMRQRQRRRR%%%J%%kJ%%j%mmknnkmlkkkjkjljLKLKLLKLlolnmmmnlmmmpj0
14988e3rrpqroJJJJMKmQJ4J4J5J4J2J7J5J3MJLLNNONONNOMNOL%j%jJ%%%%%Kjrj2j0j0j5j6
14964B7j5j5qnppppppjJj%MONMRRRRMKNLlkkljklknmmnrj0rj0jkjkQPKLOPJ4J9J3NOJ4J5J0
14938E9jpoojkKJnj3j9k7l1k6l2k6k6%J1J7QKJ%%%QQQRMMMMMMMMJ0J0J0J0RJ0RJ0NNNNJJO
$$ plain form
14915 44 50 50 49 34 15 -3 -14 -26 -43 -67 -81 -84 -74 -61 -48 -37 -3 50 103 137 153 163 174 173 172 164 157 159 162 161 161 155 149 136 123 111 98 90 82 75 67 59 52 44 37 24
14896 24 12 0 -10 -25 -35 -37 -39 -42 -44 -47 -49 -57 -64 -71 -78 -80 -83 -85 -87 -81 -76 -71 -66 -57 -53 -57 -61 -63 -61 -62 -63 -65 -76 -93 -121 -156 -191 -222 -241 -244 -235 -220 -205 -195 -163 -112 -50 -6 25
14875 25 45 56 59 57 58 58 58 64 66 68 68 59 45 30 19 9 -12 -43 -73 -80 -84 -87 -97 -113 -125 -137 -145 -153 -161 -168 -175 -183 -190 -197 -203 -209 -204 -199 -200 -201 -201 -201 -192 -178 -156 -134 -90 -40 9 33
14853 33 41 43 47 50 56 56 59 62 63 65 66 67 68 70 71 72 63 54 45 35 32 28 23 19 11 -2 -15 -24 -29 -34 -45 -62 -76 -82 -75 -68 -72 -75 -78 -81 -83 -85 -86 -88 -90 -92 -93 -95 -100 -108 -117 -121 -123 -125 -127 -128 -130 -131 -132 -133 -129 -124 -120
14826 -120 -116 -108 -101 -93 -85 -78 -70 -62 -54 -54 -53 -53 -52 -52 -51 -50 -50 -46 -42 -38 -34 -30 -26 -22 -18 -18 -18 -19 -19 -21 -24 -18 -9 -2 0 -11 -37 -64 -88 -114 -140 -150 -145 -140 -133 -123 -118 -120 -123 -116 -108 -101 -94 -88 -81 -75 -68 -67 -66 -64
14800 -64 -63 -62 -60 -59 -58 -56 -55 -53 -52 -50 -48 -47 -45 -51 -56 -61 -66 -63 -59 -56 -52 -53 -54 -55 -56 -62 -68 -74 -80 -80 -80 -80 -80 -72 -63 -54 -46 -42 -39 -36 -33 -35 -37 -32 -22 -15 -8 -1 6 8 11 14 16 16 17 17 17 20 22 25 28 27 25 24 23 19 15 11
14771 11 7 -3 -13 -27 -35 -46 -56 -66 -76 -87 -93 -91 -90 -88 -87 -86 -85 -80 -76 -72 -68 -64 -60 -55 -51 -47 -44 -40 -36 -35 -33 -32 -31 -29 -28 -26 -25 -18 -11 -5 1 7 12 18 23 25 28 30 32 35 37 29 21 17 12 7 2 -5 -18 -30
14745 -30 -38 -40 -42 -44 -46 -51 -57 -62 -67 -70 -68 -68 -69 -68 -68 -67 -67 -67 -68 -61 -49 -36 -28 -27 -25 -19 -7 5 11 16 20 25 29 36 43 49 56 54 51 48 46 40 35 30 24 23 21 20 18 17 15 14 12 8 4 0 -3 -2 -1 0 0 5 10 15 20
$$ packed form
14915D4O%jj5j9j8j1j2j7k4j4lJ0J3J3J1L4N3N3L4J6J0J1jjqpKLj%ooj3j3j2j3qqpqqpqpj3
14896B4j2j2j0j5j0kklklkqpppklkkONNNRMmmkKjjkj1j7k8l5l5l1j9lRJ5J5J0L2N1O2M4L1
14875B5K0J1LkJ%%OKK%rj4j5j1j0k1l1l0pmlj0j6j2j2qqqppqppooNNjj%%RJ4K2K2M4N0M9K4
14853C3QKMLO%LLJKJJJKJJrrrj0lmnmqj3j3rnnj1j7j4oPPmlllkkjkkkjknqrmkkkjkjjjMNM
14826a20MQPQQPQQQ%J%J%JJ%MMMMMMMM%%j%klORPKj1k6k7k4k6k6j0NNPJ0NklPQPPOPOPJJK
14800f4JJKJJKJKJKKJKonnnLMLMjjjjoooo%%%%QRRQMLLLkkNJ0PPPPKLLK%J%%LKLLjkjjmmm
14771A1mj0j0j4qj1j0j0j0j1oKJKJJJNMMMMMNMMLMMJKJJKJKJPPOOONONKLKKLKqqmnnnpj3j2
14745c0qkkkknonnlK%jJ%J%%jPJ2J3QJKOJ2J2ONMNMPPOPkllkonnojkjkjkjkmmmlJJJ%NNNN
$$ plain form
14717 20 26 32 27 22 16 9 3 -2 -4 -5 -7 -9 -12 -15 -17 -20 -23 -26 -29 -32 -29 -27 -24 -22 -12 -1 8 19 31 44 46 49 52 55 58 61 67 73 85 86 48 10 -45 -85 -125 -133 -133 -134 -135 -136 -136 -137 -136 -136 -135 -135 -129 -123
14692 -123 -117 -111 -104 -97 -90 -83 -78 -74 -69 -65 -54 -44 -33 -23 -17 -12 -6 -1 2 7 11 16 20 24 29 33 36 39 42 45 43 41 38 36 28 20 17 5 -8 -21 -25 -29 -28 -27 -37 -56 -71 -73 -70 -59 -47 -36 -27 -13
14668 -13 1 7 1 -5 -3 -2 -1 0 1 2 -7 -16 -25 -33 -41 -50 -47 -45 -42 -40 -35 -30 -36 -41 -46 -51 -56 -61 -60 -58 -57 -55 -48 -42 -35 -28 -23 -17 -11 -5 -5 -4 -4 -3 -1 0 2 4 11 18 25 33 37 41 45 49 48 47 45 44 45 45 45 44 46 39 27
14640 27 14 12 10 7 4 -2 -17 -32 -39 -32 -20 -11 -2 5 12 19 26 26 25 24 24 23 22 22 21 16 10 5 0 0 0 0 0 -3 -6 -8 -11 -14 -17 -20 -22 -22 -22 -22 -22 -22 -22 -22 -22 -24 -26 -28 -30 -32 -34 -35 -37 -43 -48 -53 -59 -64 -69 -74 -80
14612 -80 -81 -83 -84 -85 -81 -71 -64 -57 -50 -43 -33 -27 -23 -13 -2 0 0 -7 -10 -14 -19 -23 -27 -31 -36 -41 -45 -50 -55 -60 -64 -68 -66 -56 -45 -43 -42 -41 -30 -20 -11 -14 -13 -7 -5 -2 0 4 -4 -12 -19 -27 -34 -37 -34 -27 -22 -16 -7 -3 4
14585 4 20 34 43 53 63 76 84 86 93 101 102 108 114 119 124 124 120 102 58 -10 -74 -114 -124 -131 -138 -143 -149 -151 -154 -157 -159 -159 -154 -149 -148 -153 -152 -145 -137 -127 -122 -115 -108 -101 -106 -106 -102 -92 -83 -74 -64 -61 -63 -61 -60 -54
14561 -54 -48 -42 -36 -24 -11 0 13 17 21 25 29 29 29 30 30 30 31 31 32 31 30 30 29 28 28 27 26 31 35 39 44 42 41 40 38 42 46 45 34 27 20 20 15 4 -6 -12 -9 -8 -6 -14 -22 -31 -35 -34 -28 -22 -17 -17 -17 -19 -21 -23
14534 -23 -26 -31 -36 -41 -46 -48 -50 -52 -54 -51 -48 -44 -41 -39 -37 -35 -32 -22 -11 1 9 16 22 26 35 47 68 90 99 86 49 20 -8 -31 -45 -49 -49 -46 -43 -36 -35 -35 -35 -35 -36 -30 -24 -19 -13 -13 -12 -12 -11 -8 -6 -3 0
$$ packed form
14717B0OOnnoponkjkkllklllllLKLKJ0J1RJ1J2J3KLLLLLOOJ2Jl8l8n5m0m0q%jjj%jJ%J%OO
14692a23OOPPPPNMNMJ1J0J1J0ONONLNMNMMNMLLLLkklkqqlj2j3j3mmJJj0j9j5kLJ1J2J1RJ4
14668a3J4OooKJJJJJrrrqqrLKLKNNonnnnnJKJKPOPPNOOO%J%JKJKKPPPQMMMMjjkjJ%%jKpj2
14640B7j3kklloj5j5pPJ2RRPPPP%jj%jj%jnonn%%%%llkllllk%%%%%%%%kkkkkkjkonnonnno
14612h0jkjjMJ0PPPPJ0OMJ0J1K%plmnmmmnnmnnnmmKJ0J1KJJJ1J0RlJOKLKMqqpqplLPNORMP
14585DJ6J4RJ0J0J3QKPQJOONN%mj8m4o8o4m0j0ppnokllk%NNJnJPQJ0NPPPn%MJ0RRJ0LkKJO
14561e4OOOJ2J3J1J3MMMM%%J%%J%Jjj%jj%jjNMMNkjjkMMjj1pp%nj1j0oLJKqqrmJOON%%kkk
14534b3lnnnnkkkkLLMLKKKLJ0J1J2QPOMRJ2K1K2Rj3l7k9k8k3j4m%LLPJ%%%jOONO%J%JLKLL
$$ plain form
14510 0 4 10 15 20 21 21 22 22 23 23 24 24 27 31 34 38 41 45 48 52 48 44 40 36 31 27 23 19 17 15 12 10 8 5 3 0 0 -1 0 -4 -9 -15 -22 -28 -24 -20 -16 -13 -9 -5 -1 2 1 0 0 -1 -7 -13 -19 -26 -26 -26 -26 -26 -29 -31 -34 -37 -39 -41
14480 -41 -43 -45 -45 -40 -37 -35 -34 -38 -39 -40 -44 -47 -51 -55 -56 -57 -58 -59 -54 -50 -45 -41 -36 -31 -26 -21 -16 -11 -6 -1 2 6 10 15 19 23 27 31 34 37 40 43 40 38 32 24 15 14 18 22 22 9 -8 -23 -38 -48 -65 -73 -76 -70 -68 -67 -66
14453 -66 -65 -67 -63 -54 -45 -36 -26 -20 -13 -4 0 1 3 4 5 8 11 14 17 11 5 0 -5 -11 -17 -18 -19 -14 -14 -18 -27 -27 -19 -5 9 18 28 42 57 58 52 40 28 24 25 23 21 14 8 1 -5 -10 -14 -19 -24 -28 -37 -48 -60
14427 -60 -68 -72 -68 -64 -61 -58 -56 -53 -49 -45 -45 -39 -29 -20 -11 -1 6 15 33 52 58 55 52 50 52 59 71 78 66 41 13 -14 -43 -72 -90 -96 -101 -106 -105 -104 -102 -101 -99 -97 -92 -87 -82 -78 -73 -68 -63 -58 -54 -50 -45 -41 -37
14403 -37 -32 -28 -24 -26 -28 -30 -33 -35 -37 -39 -41 -36 -31 -25 -20 -15 -10 -4 0 0 0 1 1 6 12 17 23 24 25 27 28 30 31 32 34 34 35 35 35 33 31 28 26 25 24 24 21 4 -25 -49 -71 -90 -114 -142 -158 -159 -158 -160 -159 -157 -159
14376 -159 -161 -159 -145 -129 -113 -99 -85 -73 -60 -48 -31 -21 -17 -14 -8 -2 3 9 10 10 10 10 5 0 -4 -9 -15 -20 -25 -30 -32 -33 -35 -37 -38 -40 -42 -43 -41 -38 -35 -33 -36 -38 -41 -44 -39 -35 -31 -27 -20 -13 -6 0 1 3 5 7
14351 7 6 6 7 7 8 14 28 41 50 54 55 56 55 55 54 54 53 52 51 50 51 51 52 52 49 43 33 23 13 6 3 0 -1 -6 -14 -22 -31 -37 -41 -42 -43 -44 -44 -45 -48 -51 -52 -57 -59 -62 -65 -68 -73 -79 -86 -90 -92 -91 -92 -92 -91 -89 -86 -90 -93
14323 -93 -92 -89 -86 -85 -84 -78 -72 -68 -66 -63 -59 -51 -42 -37 -31 -29 -28 -32 -35 -38 -41 -42 -42 -39 -36 -33 -29 -29 -28 -27 -26 -22 -18 -19 -20 -22 -24 -23 -22 -19 -16 -11 -5 0 4 9 14 17 20 18 16 15 16 21 26 31 33 33 34 35 35 35 36 36 36 36 36 37 38
$$ packed form
14510@MONNJ%J%J%J%LMLMLMLMmmmmnmmmkklkklkl%jJmnopoMMMLMMMLjj%jooop%%%%lkllkk
14480d1kk%NLKJmjjmlmmjjjjNMNMNNNNNNNNLMMNMMMMLLLLlkoqrjMM%j3j7j5j5j0j7qlOKJJ
14453f6JkMRRRJ0OPRMJKJJLLLLoonnoojjN%mr%QJ4J4RJ0J4J5Joj2j2mJkkpoponmnnmrj1j2
14427f0qmMMLLKLMM%OJ0RRJ0PRJ8J9OllkKPJ2Pj2k5k8k7k9k9j8onnJJKJKKNNNMNNNNMMNMM
14403c7NMMkkklkkkkNNONNNOM%%J%NONOJJKJKJJK%J%%kklkjj%lj7k9k4k2j9k4k8j6jJkJKk
14376a59kKJ4J6J6J4J4J2J3J2J7J0MLOONOJ%%%nnmnonnnkjkkjkkjKLLKlkllNMMMPPPOJKKK
14351Gj%J%JOJ4J3RMJJj%j%jjjjJ%J%loj0j0j0plljnqqromjjj%jlljnklllnopmkJj%JKLml
14323i3JLLJJOOMKLMQRNOKJmlllj%LLLM%JJJMMjjkkJJLLNONMNNLLkkjJNNNK%JJ%%J%%%%JJ
$$ plain form
14293 38 37 39 40 40 41 42 45 49 52 56 59 63 66 70 73 75 78 81 88 96 104 112 121 130 138 147 156 164 173 181 186 190 189 189 188 187 191 196 200 204 206 208 202 196 185 174 164 153 142 132 118 105 93 87 80 73 65 54 37
14268 37 10 -12 -23 -27 -34 -47 -60 -67 -76 -87 -92 -91 -89 -92 -95 -100 -101 -102 -98 -89 -78 -66 -57 -46 -35 -24 -13 -9 -4 0 5 10 14 19 24 22 20 19 17 15 13 12 10 0 -10 -21 -31 -36 -41 -47 -52 -53 -55
14245 -55 -57 -58 -60 -62 -63 -65 -70 -75 -79 -84 -80 -77 -73 -69 -74 -78 -83 -87 -90 -93 -91 -89 -82 -74 -77 -80 -72 -64 -66 -68 -66 -63 -65 -78 -82 -81 -84 -87 -98 -114 -134 -143 -141 -145 -153 -166 -173 -180 -195 -214 -219 -207 -186 -155 -123 -92 -68
14221 -68 -49 -34 -30 -30 -31 -31 -32 -33 -33 -29 -26 -22 -18 -21 -24 -27 -30 -33 -36 -39 -42 -34 -27 -19 -11 -3 4 11 19 21 23 25 27 29 31 33 35 34 32 31 29 33 37 40 44 42 40 37 35 33 31 28 26 28 30 32 34 36 38 40 42 36 31 25 19 19 19
14192 19 18 18 19 20 21 22 23 29 44 69 119 174 238 264 297 329 402 541 740 928 1066 1104 1068 889 652 426 245 104 34 15 3 -7 -18 -24 -23
14177 -23 -18 -12 -11 -12 -13 -14 -15 -10 0 6 14 21 29 37 44 45 46 47 48 57 70 79 73 55 37 20 2 -16 -23 -26 -30 -35 -45 -53 -60 -68 -76 -73 -70 -68 -67 -65 -63 -55 -47 -40 -32 -22 -13 -4 4 5 5 6 7 7 8 8 9 9
14151 9 10 10 11 11 11 8 11 17 23 19 15 11 8 11 20 23 20 20 20 19 18 17 15 14 13 11 10 12 14 16 18 29 40 50 61 68 75 82 89 95 102 109 116 116 116 115 115 115 115 115 115 104 94 84 73 68 63 58 52 41 29
14125 29 18 6 4 1 -1 -4 -7 -10 -13 -16 -19 -22 -25 -28 -30 -32 -34 -35 -36 -36 -31 -27 -19 -17 -22 -27 -17 -3 8 11 17 32 46 51 47 42 39 40 45 44 35 27 19 12 0 -12 -22 -21 -18 -20 -32 -45 -56 -61 -63 -61
$$ packed form
14293C8jKJ%JJLMLMLMLMLKLLPQQQRRQRRQRQNMj%jjMNMMKKooj1j1j0j1j1j0j4j3j2oppqj1j7
14268C7k7k2j1mpj3j3prj1nJKllnjjMRJ1J2RJ1J1J1J1MNMNNMNNkkjkkkjkj0j0j1j0nnonjk
14245e5kjkkjknnmnMLMMnmnmllKKPQllQQkkKLkj3mJllj1j6k0rKmqj3ppj5j9nJ2K1L1L2L1K4
14221f8J9J5M%j%jj%MLMMllllllllQPQQQPPQKKKKKKKKjkjkMMLMkklkkklkKKKKKKKKonoo%%
14192A9j%JJJJJOJ5K5N0N5O4K6L3L2P3J39J99J88J38L8l6j79k37k26j81j41p0j9j2j0j1oJ
14177b3NOJjjjjNJ0OQPQQPJJJJRJ3Roj8j8j7j8j8plmnj0qpqqLLKJKKQQPQJ0RRQJ%JJ%J%J%
14151IJ%J%%lLOOmmmlLRLl%%jjjkjjkjKKKKJ1J1J0J1PPPPOPPP%%j%%%%%j1j0j0j1nnnoj1j2
14125B9j1j2klklllllllllkkkjj%NMQKnnJ0J4J1LOJ5J4NmnlJNjrqqpj2j2j0JLkj2j3j1nkK
$$ plain form
14100 -61 -55 -50 -44 -38 -37 -36 -39 -42 -45 -47 -53 -59 -64 -70 -67 -59 -53 -48 -48 -48 -48 -47 -49 -50 -51 -52 -51 -49 -48 -46 -36 -26 -16 -7 -3 -4 -2 -1 -2 -4 -6 -7 -9 -11 -12 -14 -16 -18 -21 -23 -35 -52 -66 -79 -87 -90 -95 -101 -101 -101 -101 -101
14074 -101 -104 -106 -108 -110 -110 -109 -109 -108 -102 -96 -89 -83 -82 -81 -79 -78 -83 -87 -91 -95 -97 -94 -93 -93 -90 -87 -85 -82 -80 -77 -74 -72 -68 -63 -59 -55 -48 -41 -34 -27 -16 -5 5 16 18 21 23 26 26 26 26 27 32 38 43 48 46 43 40 37 34 31 28 25
14046 25 21 17 13 9 9 10 11 11 9 1 -8 -18 -27 -30 -27 -24 -22 -33 -61 -89 -109 -135 -162 -189 -193 -189 -179 -170 -169 -173 -180 -186 -183 -180 -178 -175 -172 -170 -167 -165 -158 -151 -144 -137 -133 -129 -125 -121 -116 -110 -105 -106 -97 -76 -60 -66 -81
14021 -81 -91 -86 -85 -89 -98 -105 -111 -116 -120 -122 -129 -138 -146 -155 -164 -168 -167 -159 -151 -144 -149 -165 -180 -178 -167 -156 -145 -134 -122 -118 -120 -123 -122 -116 -106 -96 -86 -81 -76 -71 -65 -60 -55 -47 -40 -32 -25 -19 -14 -8 -2 7 18 29 40
13998 40 51 62 73 84 90 96 102 108 113 118 123 128 130 133 135 137 138 138 139 139 135 130 125 120 108 96 83 71 61 52 42 32 30 28 26 23 21 19 17 15 15 16 16 17 22 28 34 39 47 54 62 69 74 79 84 89 92 95
13973 95 98 101 102 102 103 103 100 96 92 89 85 82 78 74 69 63 60 52 35 18 1 -16 -30 -44 -64 -74 -71 -67 -61 -59 -64 -69 -75 -81 -81 -81 -82 -82 -90 -98 -105 -113 -126 -139 -152 -165 -167 -168 -175 -182 -189 -196 -192 -189 -180 -172 -163
13948 -163 -155 -146 -136 -127 -118 -106 -94 -82 -71 -54 -36 -19 -2 4 11 17 24 29 33 37 42 33 25 17 8 5 1 -1 -5 -6 -8 -15 -22 -23 -23 -13 -4 4 13 28 49 60 56 48 46 52 63 72 80 80 79 79 79 79
13925 79 79 78 78 73 68 62 57 54 50 47 43 28 14 5 -4 -20 -36 -48 -49 -43 -38 -43 -47 -50 -52 -55 -58 -52 -47 -42 -36 -38 -39 -40 -42 -41 -39 -38 -37 -32 -26 -20 -15 3 22 36 58 90 117 112 92 71 66 62 58 52
$$ packed form
14100f1ONOOJJlllkoonoLQON%%%JkjjjJKJKJ0J0J0RMjKJjkkjkkjkkklkj2j7j4j3qlno%%%%
14074a01lkkk%J%JOOPOJJKJnmmmkLJ%LLKLKLLKMNMMPPPPJ1J1J0J1KLKL%%%JNONNklllllll
14046B5mmmm%JJ%kqrj0rlLLKj1k8k8k0k6k7k7mMJ0RJmpoLLKLLKLKPPPPMMMMNONjRK1J6oj5
14021h1j0NJmrponmkprqrrmJQQPnj6j5KJ1J1J1J1J2MklJOJ0J0J0NNNONNQPQPONOORJ1J1J1
13998D0J1J1J1J1OOOONNNNKLKKJ%J%mnnnj2j2j3j2j0rj0j0kkklkkkk%J%JNOONQPQPNNNNLL
13973I5LLJ%J%lmmlmlmmnolqj7j7j7j7j4j4k0j0LMOKnnoo%%j%qqpqj3j3j3j3kjppppMLRQR
13948a63QRJ0RRJ2J2J2J1J7J8J7J7OPOPNMMNrqqrlmkmjkppj%J0RQRJ5K1J1mqkOJ1RQ%j%%%
13925G9%j%nnonlmlmj5j4rrj6j6j2jONnmlkllONNOkjjkJKJJNOONJ8J9J4K2L2K7nk0k1nmmo
$$ plain form
13901 52 52 48 44 44 44 44 44 45 46 46 47 45 43 41 39 36 32 32 26 21 15 10 4 0 -4 -8 -12 -26 -34 -36 -25 -11 -2 0 2 9 21 35 40 32 30 35 39 38 37 36 35 30 24 18 12 7 1 -4 -10 -16 -22 -28 -34 -43 -52 -61 -70 -76
13873 -76 -83 -89 -96 -97 -98 -100 -101 -102 -102 -102 -103 -98 -93 -88 -83 -72 -60 -45 -36 -35 -28 -17 -1 11 24 36 49 54 53 53 58 63 68 72 77 70 57 45 37 30 22 19 10 -3 -9 -9 -9 -17 -25 -33 -41 -43 -45 -47 -49 -44 -40
13849 -40 -35 -30 -26 -21 -16 -11 -12 -12 -12 -12 -7 -3 1 6 12 17 23 28 29 29 29 30 24 18 11 5 -2 -11 -20 -28 -39 -49 -59 -70 -71 -73 -75 -76 -81 -85 -96 -95 -82 -63 -47 -31 -11 8 21 28 32 36 40 43 48 53 57
13824 57 62 62 61 61 60 52 44 36 27 19 11 3 -4 -8 -12 -15 -19 -28 -37 -46 -55 -59 -63 -67 -71 -76 -80 -84 -88 -86 -83 -81 -79 -82 -84 -87 -90 -96 -102 -109 -115 -116 -117 -117 -118 -117 -117 -115 -113 -106 -86 -70 -60 -56 -48 -33 -18 -14 -22 -23 -24 -26 -28 -30
13796 -30 -32 -37 -42 -46 -51 -53 -55 -56 -58 -55 -51 -48 -45 -35 -26 -17 -8 -1 4 11 17 20 23 26 29 23 16 13 5 -5 -15 -26 -37 -50 -63 -75 -88 -102 -111 -112 -113 -114 -116 -117 -119 -120 -121 -125 -124 -117 -110 -103 -95 -90 -85 -79 -73 -63
13771 -63 -45 -29 -19 -17 -20 -20 -20 -15 -6 5 8 4 0 -5 -10 -15 -20 -25 -30 -41 -52 -63 -73 -79 -85 -90 -96 -97 -97 -97 -98 -93 -88 -83 -78 -72 -66 -60 -54 -45 -36 -27 -18 -9 0 10 20 25 30 35 39 42 44 46 49 48 48 48 48
13746 48 40 32 24 16 13 11 8 5 0 -7 -14 -21 -27 -34 -41 -48 -54 -60 -66 -72 -78 -84 -90 -96 -94 -93 -91 -90 -88 -87 -85 -84 -79 -74 -67 -64 -61 -59 -56 -53 -49 -39 -32 -26 -18 -11 -11 -16 -16 -17 -17 -18 -16 -15 -14 -12 -18 -24 -29 -35 -36 -37 -34 -37 -43 -43 -46 -49
13717 -49 -50 -46 -41 -42 -49 -55 -62 -69 -74 -79 -78 -69 -57 -50 -54 -64 -74 -83 -94 -85 -48 -7 42 72 91 98 95 76 44 11 -13 -32 -55 -62 -60 -58 -57 -56 -55 -54 -57 -61 -54 -48 -40 -33 -25 -18 -13 -7 -2 3 2 0
$$ packed form
13901E2%mm%%%%JJ%Jkkkklm%ononommmmj4qkJ1J4RKKPJ2J4NqkNMjjjjnooononooooorrrro
13873g6popjjkjj%%jNNNNJ1J2J5RJPJ1J6J2J3J2J3Nj%NNNMNpj3j2qpqlrj3o%%qqqqkkkkNM
13849d0NNMNNNj%%%NMMNONONJ%%Joopoprrqj1j0j0j1jkkjnmj1JJ3J9J6J6K0J9J3PMMMLNNM
13824E7N%j%jqqqrqqqpmmlmrrrrmmmmnmmmKLKKlklloopojj%jJ%KKPK0J6J0MQJ5J5Mqjjkkk
13796c0knnmnkkjkLMLLJ0RRRPNPOLLLLoplqj0j0j1j1j3j3j2j3j4rjjjkjkjjmJPPPQNNOOJ0
13771f3J8J6J0Kl%%NRJ1Lmmnnnnnnj1j1j1j0oonoj%%jNNNNOOOORRRRRRJ0J0NNNMLKKLj%%%
13746D8qqqqlkllnpppopppooooooooKJKJKJKJNNPLLKLLMJ0POQP%n%j%jKJJKoonojjLlo%ll
13717d9jMNjpoppnnJRJ2Pmj0j0rj1RL7M1M9L0J9Plj9l2l3k4j9k3pKKJJJJlmPOQPQPNONNjk
$$ plain form
13693 0 0 -2 5 12 19 26 33 40 46 53 54 56 57 58 62 66 70 74 87 100 112 125 131 132 135 139 143 146 150 153 158 162 167 171 169 168 166 165 157 150 143 136 132 127 123 118 114 110 106 102 93 84 76 67 60 52 45 38 30 23 15 8 -4 -17
13666 -17 -30 -43 -50 -56 -63 -70 -76 -83 -89 -95 -95 -89 -78 -51 -19 11 43 75 89 88 86 83 73 69 72 74 74 74 68 63 57 51 46 40 34 28 22 16 13 10 7 4 2 0 -3 -6 -13 -21 -28 -35 -43 -50 -57 -65 -69 -74 -79 -84 -89
13640 -89 -94 -99 -104 -103 -102 -101 -100 -99 -99 -98 -97 -96 -94 -93 -92 -91 -89 -88 -87 -81 -74 -68 -62 -59 -55 -52 -48 -47 -46 -45 -43 -38 -32 -26 -20 -11 -2 9 25 40 50 54 56 56 55 57 63 65 65 64 66 68 70 71 73 74 74 64 54 45 35 36
13614 36 37 41 45 49 53 60 67 75 82 83 84 85 86 84 81 79 76 80 83 87 90 85 79 73 68 59 49 40 31 24 16 20 23 27 30 34 37 43 48 53 58 63 68 73 78 83 88 93 98 97 96 95 94 84 74 65 55 45 36 26 16 6
13587 6 -4 -14 -25 -35 -45 -58 -65 -64 -60 -58 -55 -52 -49 -46 -43 -44 -46 -47 -48 -49 -49 -53 -52 -48 -45 -41 -37 -40 -42 -44 -47 -52 -58 -64 -70 -75 -81 -87 -93 -95 -98 -101 -104 -106 -109 -114 -114 -112 -110 -107 -105 -102 -99 -97 -94 -84 -73 -63 -52 -40
13561 -40 -27 -14 -2 12 26 30 34 34 34 35 36 31 32 34 29 17 10 9 9 6 -1 -7 -12 -18 -23 -28 -33 -36 -39 -42 -46 -44 -43 -42 -41 -34 -27 -20 -13 -12 -11 -10 -9 -8 -6 -5 -3 2 7 13 19 26 33 40 46 44 41 38 36 30 23 17 11
13534 11 5 0 -6 -12 -15 -19 -22 -25 -28 -31 -30 -35 -44 -48 -47 -30 -8 13 35 58 84 98 95 91 93 95 100 100 83 67 55 53 34 16 1 0 -7 -15 -19 -27 -35 -38 -45 -50 -52 -55 -57 -59 -63 -68 -72 -77 -80 -84 -87 -90
13510 -90 -89 -88 -87 -86 -78 -70 -62 -55 -47 -39 -31 -24 -14 -4 7 15 15 16 17 17 27 36 46 55 62 63 59 52 49 48 46 44 38 33 28 23 21 19 17 15 8 1 -5 -13 -22 -28 -29 -24 -22 -23 -21 -21 -23 -22 -23 -24 -25 -25 -26 -27 -29 -31 -33 -35
$$ packed form
13693@%kPPPPPPOPJKJJMMMMJ3J3J2J3OJLMMLMLNMNMkjkjqpppmnmnmmmmrrqrpqppqpqpj2j3
13666a7j3j3poppopoo%OJ1K7L2L0L2L2J4jklj0mLK%%onoonooooollllkkllpqppqppqmnnnn
13640h9nnnJJJJJ%JJJKJJJKJJOPOOLMLMJJJKNOOORRJ1J6J5J0MK%jKOK%jKKKJKJ%j0j0rj0J
13614C6JMMMMPPQPJJJJklklMLMLnoonrj0rrpqMLMLMLONNNNNNNNNNNjjjjj0j0rj0j0rj0j0j0
13587Fj0j0j1j0j0j3pJMKLLLLLjkjjj%mJMLMMlkklnooonoooklllkln%KKLKLLKLJ0J1J0J1J2
13561d0J3J3J2J4J4MM%%JJnJKnj2pj%lpononnnlllmKJJJPPPPJJJJJKJKNNOOPPPOkllkopoo
13534A1onoolmllllJnrmJJ7K2K1K2K3K6J4lmKKN%j7j6j2kj9j8j5jpqmqqlpnklkkmnmnlmll
13510i0JJJJQQQPQQQPJ0J0J1Q%JJ%J0RJ0RPJmpljkkonnnkkkkppoqrojNKjK%kJjjj%jjkkkk
$$ plain form
13482 -35 -40 -45 -49 -54 -61 -68 -76 -83 -82 -82 -81 -81 -78 -76 -73 -70 -67 -55 -37 -20 -13 -6 0 7 18 28 33 29 27 24 22 19 11 3 -4 -11 -22 -32 -42 -52 -57 -61 -65 -69 -71 -73 -75 -76 -73 -70 -66 -63 -55 -48 -40 -32 -22 -11
13457 -11 -6 0 1 3 5 6 16 26 35 45 48 45 37 30 22 23 28 32 23 8 -3 -15 -31 -46 -49 -47 -44 -46 -53 -60 -67 -74 -72 -70 -68 -66 -64 -62 -64 -67 -69 -71 -69 -67 -59 -52 -47 -43 -38 -34 -31 -29 -26 -24 -21 -19 -17 -14 -17 -20 -23
13431 -23 -25 -25 -25 -30 -36 -38 -40 -43 -45 -42 -40 -37 -35 -31 -28 -25 -21 -18 -14 -11 -7 -9 -10 -12 -13 -14 -16 -17 -18 -25 -32 -39 -46 -53 -60 -67 -74 -73 -73 -72 -72 -71 -70 -69 -68 -65 -62 -54 -46 -41 -36 -31 -26 -22 -18 -14 -10 -7 -3 0 4 7 9 11 14 19 24 24 24
13401 24 17 10 4 -2 -8 -11 -16 -29 -46 -58 -66 -72 -79 -86 -92 -99 -103 -102 -103 -107 -108 -110 -111 -113 -108 -104 -99 -94 -89 -85 -80 -75 -71 -67 -63 -59 -55 -51 -47 -44 -43 -43 -42 -42 -41 -41 -40 -40 -41 -42 -42 -43 -39 -35 -30 -26 -29 -31 -34 -36 -33 -31 -28 -25 -23 -20
13373 -20 -17 -15 -13 -10 -7 -6 -11 -21 -32 -46 -58 -70 -78 -85 -92 -99 -106 -114 -125 -137 -149 -160 -163 -162 -158 -154 -153 -151 -150 -149 -143 -137 -131 -125 -119 -113 -107 -101 -98 -94 -91 -87 -89 -90 -92 -94 -94 -95 -95 -95 -96 -96 -97 -97 -95 -93 -91 -89 -86 -84
13347 -84 -82 -80 -75 -71 -66 -62 -57 -53 -48 -44 -42 -40 -39 -37 -40 -44 -47 -51 -46 -42 -37 -33 -33 -34 -30 -16 -1 9 17 34 52 62 67 60 53 51 57 62 66 71 69 59 30 -4 -31 -49 -68 -88 -97 -93 -90 -86 -82 -77 -80 -84
13323 -84 -87 -90 -93 -95 -98 -101 -104 -106 -109 -112 -116 -120 -124 -127 -131 -135 -139 -143 -141 -139 -137 -134 -132 -130 -128 -126 -118 -111 -104 -97 -90 -83 -75 -68 -62 -56 -49 -43 -37 -31 -24 -18 -10 -2 4 12 15 17 20 22 24 26 28 30 31 33 35 37 36 34 33 32 40 48 52 66 83
13294 83 126 188 284 386 477 514 523 474 334 199 127 97 80 74 74 70 67 64 61 58 56 54 52 55 57 60 62 65 67 70 72 70 69 67 66 59 53 44 39 34 29 24 19 10 0 -12 -19 -19 -15 -14 -12 -9
$$ packed form
13482c5nnmnppqpJ%J%LKLLLJ2J8J7PPOPJ1J0Nmklklqqppj1j0j0j0nmmmkkkjLLMLQPQQJ0J1
13457a1NOJKKJJ0J0RJ0LlqpqJNMrj5j1j2j6j5lKLkppppKKKKKKklkkKKQPNMNMLKLKLKKLlll
13431b3k%%nokklkLKLKMLLMLMLMkjkjjkjjppppppppJ%J%JJJJLLQQNNNNMMMMLMLMLKKLNN%%
13401B4ppooolnj3j7j2qoppopmJjmjkjkNMNNNMNNMMMMMMMLJ%J%J%J%jj%jMMNMlklkLKLLKL
13373b0LKKLLJnj0j1j4j2j2qppppqj1j2j2j1lJMMJKJJOOOOOOOOLMLMkjkk%j%%j%j%KKKKLK
13347h4KKNMNMNMNMKKJKlmlmNMNM%jMJ4J5J0QJ7J8J0NppkONMNkj0k9l4k7j8j9k0rMLMMNlm
13323h4lllklllkllmmmlmmmmKKKLKKKKQPPPPPQPOOPOOOPOQQOQLKLKKKKKJKKKjkjjQQMJ4J7
13294H3M3O2R6J02R1L7Rm9j40j35p2l0j7o%mllllkkkLKLKLKLKkjkjpornnnnnrj0j2p%MJKL
$$ plain form
13271 -9 -7 -5 -3 1 6 12 17 28 38 49 59 64 69 74 79 84 89 93 98 99 101 102 103 104 105 106 107 107 107 107 107 106 106 106 106 107 107 108 109 104 100 95 91 91 90 90 89 89 89 88 88 87 86 85 84 83 82 80 79 78 76 74 73 74 79 81
13243 81 84 93 102 104 100 100 109 115 116 119 123 120 110 95 86 81 80 80 74 64 49 31 13 -4 -23 -38 -54 -69 -85 -95 -106 -115 -125 -130 -129 -131 -133 -134 -136 -137 -138 -136 -134 -125 -110 -100 -89 -77 -66
13222 -66 -53 -39 -26 -13 -3 0 -1 -4 -2 -1 0 2 3 5 6 7 2 -2 -6 -11 -16 -21 -26 -30 -37 -44 -51 -57 -55 -54 -52 -50 -50 -51 -52 -53 -54 -55 -55 -56 -58 -59 -60 -61 -54 -46 -39 -32 -30 -29 -27 -25 -32 -38 -45 -51 -61 -71 -70 -69 -69 -68
13195 -68 -68 -68 -69 -71 -72 -74 -75 -76 -76 -77 -76 -71 -61 -46 -28 -11 0 4 13 21 30 38 46 55 63 71 72 73 83 94 113 132 150 228 347 491 669 808 829 825 805 760 673 534
13176 534 448 352 263 212 192 171 158 144 131 118 107 97 87 77 68 58 49 39 35 31 27 22 18 15 11 7 8 9 11 12 19 26 34 41 48 55 62 70 68 67 66 65 69 73 77 81 88 94 101 107 105 103
13154 103 101 99 91 83 75 67 58 49 41 32 28 23 8 -5 -14 -23 -32 -41 -49 -56 -64 -71 -79 -86 -94 -102 -105 -108 -112 -115 -113 -111 -110 -108 -107 -107 -106 -105 -105 -95 -66 -38 -3 25 52 69 76 77 81 85 91 97 103 109 115 122 128 134 135
13128 135 137 138 139 141 142 144 145 140 135 130 126 121 116 111 106 95 84 73 62 56 50 44 38 29 21 13 4 5 5 6 6 7 8 9 10 17 23 29 35 34 32 31 29 27 26 24 23 17 11 6 0 3 6 9 12 11 10 9 8 15 23 30 38 50
13101 50 57 62 76 97 117 128 138 151 163 183 209 241 283 376 500 686 882 1131 1460 1706 1865 1895 1837 1657 1375 1128 940 777 603
$$ packed form
13271iKKKMNONJ1J0J1J0NNNNNNMNJKJJJJJJ%%%%j%%%J%JJnmnm%j%j%%j%jjjjjjkjjkkjJNK
13243H1LRRKm%ROJLMlj0j5rnj%oj0j5j8j8j7j9j5j6j5j6j0j1rj0nJkkjkjjKKRJ5J0J1J2J1
13222f6J3J4J3J3J0LjlKJJKJKJJnmmnnnnmpppoKJKK%jjjjj%jkjjjPQPPKJKKpopoj0j0JJ%J
13195f8%%jkjkjj%jJNJ0J5J8J7J1MRQRQQRQQJJJ0J1J9J9J8P8J19J44J78J39K1mk0m5q7j39
13176E34q6r6q9n1k0k1j3j4j3j3j1j0j0j0rj0rj0mmmnmlmmJJKJPPQPPPPQkjjjMMMMPOPOkk
13154A03kkqqqqrrqrmnj5j3rrrrqpqpqpqqllmlKKJKJ%JJ%J0K9K8L5K8K7J7PJMMOOOOOPOOJ
13128A35KJJKJKJnnnmnnnnj1j1j1j1oooorqqrJ%J%JJJJPOOOjkjkkjkjoonoLLLLjjjjPQPQJ2
13101E0PNJ4K1K0J1J0J3J2K0K6L2M2R3J24J86J96K49L29K46J59L0n8j80k82k47j88j63j74
$$ plain form
13088 603 484 417 392 386 378 360 349 337 325 313 303 294 284 275 253 231 209 188 174 161 148 135 125 125 120 114 118 123 127 131 135 139 144 148 156 164 173 181 183 185 177 168 169 170 174 172 157
13068 157 132 112 93 73 59 60 71 85 92 93 94 100 106 112 118 123 128 133 138 139 140 142 143 143 144 144 145 143 140 127 114 97 80 73 77 82 69 50 30 21 12 3 -5 -12 -19 -15 -12 -14 -16 -19 -21 -16 -10 -4
13045 -4 0 1 1 2 2 0 -2 -5 -8 -17 -25 -23 -22 -23 -25 -27 -29 -30 -31 -32 -33 -34 -35 -35 -36 -43 -50 -63 -65 -54 -42 -48 -65 -74 -83 -93 -103 -96 -88 -81 -73 -71 -69 -66 -64 -51 -39 -26 -14 -10 -6 -2 1 11 20 29 39 43
13020 43 48 48 48 43 43 52 74 120 188 267 308 347 400 534 777 1142 1556 2000 2296 2348 2154 1809 1472 1168 953 763 604 413 303 256
13007 256 249 244 243 242 241 236 231 228 220 210 200 190 180 177 175 172 170 170 170 170 171 163 155 147 139 131 123 116 108 105 102 99 96 95 95 94 94 91 83 75 73 80 92 100 103 103 108 123 144 153 146 136 126 110 67 12
12983 12 -37 -65 -81 -86 -92 -93 -95 -97 -99 -109 -118 -127 -136 -134 -126 -121 -116 -111 -105 -100 -95 -98 -101 -103 -106 -99 -87 -78 -69 -60 -51 -42 -33 -21 -3 19 36 44 52 69 86 104 111 124 137 141 146 150 155 157 160 165 169 181
12959 181 217 277 375 489 603 797 1037 1436 1880 2259 2378 2179 1789 1383 1029 758 518 391 330 308 302 302 301 288 275 261 247 205
12947 205 153 97 59 34 19 13 13 13 13 13 13 5 -3 -11 -19 -22 -25 -28 -31 -31 -30 -29 -28 -30 -32 -34 -36 -41 -47 -53 -59 -60 -60 -61 -61 -58 -56 -53 -50 -52 -55 -57 -59 -58 -57 -56 -55 -45 -35 -25 -15 -10 -5 0 5 7 10 13 15
$$ packed form
13088F03j19o7k5oqj8j1j2j2j2j0rj0rk2k2k2k1j4j3j3j3j0%noMNMMMMNMQQRQKKqrJJMkj5
13068A57k5k0j9k0j4JJ1J4PJJOOOONNNNJJKJ%J%Jklj3j3j7j7pMNj3j9k0rrrqppMLkklkNOO
13045dMJ%J%kkllrqKJjkkkjjjjjj%jppj3kJ1J2oj7rrj0j0PQPQKKLKJ3J2J3J2MMMLJ0RRJ0M
13020D3N%%n%RK2M6O8P9M1L9N3J34K43L65M14M44K96N2j94l45l37l04k15j90j59j91j10m7
13007B56pnjjjnnlqj0j0j0j0lklk%%%Jqqqqqqpqllllj%j%lqqkPJ2QL%NJ5K1Rpj0j0j6m3n5
12983A2m9k8j6nojkkkj0rrrKQNNNONNllklPJ2RRRRRRJ2J8K2J7QQJ7J7J8PJ3J3MNMNKLNMJ2
12959A81L6O0R8J14J14J94K40L99M44L79J19j99l90m06l54k71k40j27o1k2o%jj3j3j4j4m2
12947B05n2n6l8k5j5o%%%%%qqqqllll%JJJkkkknoooj%j%LKLLklkkJJJJJ0J0J0J0NNNNKLLK
$$ plain form
12922 15 14 13 11 10 3 -3 -9 -16 -27 -38 -54 -70 -80 -90 -90 -89 -92 -95 -98 -101 -95 -89 -82 -76 -68 -60 -52 -44 -37 -30 -13 3 21 38 48 53 56 58 60 62 64 71 80 81 77 74 73 67 66 70 74 72 61 45 31
12898 31 17 12 6 0 -5 -10 -16 -22 -28 -32 -36 -40 -44 -51 -58 -65 -72 -75 -79 -83 -87 -85 -84 -83 -81 -81 -80 -79 -79 -78 -78 -77 -76 -74 -72 -70 -68 -66 -64 -62 -60 -54 -49 -44 -39 -33 -28 -23 -18 -21 -24 -27 -30 -33 -36 -37 -42 -55 -68 -79 -95 -109 -131
12871 -131 -152 -167 -166 -164 -167 -179 -185 -176 -162 -154 -157 -154 -145 -135 -128 -120 -118 -115 -107 -99 -91 -83 -84 -85 -86 -87 -92 -97 -102 -106 -106 -106 -105 -105 -103 -102 -100 -98 -98 -98 -103 -108 -114 -119 -114 -109 -98 -87 -73 -65 -57 -49 -42 -35 -25 -15 -5
12846 -5 4 7 11 14 17 15 13 11 8 3 -1 -7 -12 -12 -12 -12 -13 -21 -29 -37 -45 -53 -56 -52 -47 -42 -36 -31 -26 -22 -19 -15 -12 -8 -5 -1 1 5 8 12 16 17 23 26 29 19 -1 -20 -31 -33 -36 -40 -48 -56 -58 -44 -34 -33 -36 -41 -40 -38 -42 -42
12819 -42 -42 -44 -46 -45 -49 -63 -76 -90 -104 -114 -124 -134 -144 -148 -153 -156 -160 -162 -158 -149 -136 -126 -121 -107 -87 -68 -65 -70 -75 -74 -67 -63 -59 -65 -70 -76 -82 -87 -93 -98 -104 -102 -100 -98 -96 -94 -92 -90 -88 -92 -96 -100 -104 -108 -112 -116
12795 -116 -120 -124 -127 -131 -135 -138 -142 -145 -149 -154 -159 -165 -168 -166 -159 -155 -151 -149 -144 -127 -105 -89 -79 -56 -33 -17 -14 -7 4 16 22 32 42 39 36 33 30 27 24 21 18 13 8 3 -1 -6 -11 -16 -21 -23 -25 -27 -29 -31 -33 -35 -37
12770 -37 -36 -35 -34 -33 -41 -49 -56 -64 -71 -79 -86 -93 -100 -108 -115 -122 -125 -127 -130 -133 -135 -138 -140 -143 -143 -143 -143 -143 -137 -132 -127 -121 -117 -112 -108 -103 -99 -95 -90 -86 -77 -68 -59 -51 -42 -33 -25 -16 -14 -13 -11 -10 -9 -7 -6 -4 -10 -15 -20 -26 -32 -37 -43 -49 -49 -50 -53 -60 -70
12740 -70 -75 -64 -44 -24 -17 -11 0 8 12 11 5 1 -1 -1 0 -2 -9 -19 -28 -35 -42 -49 -56 -54 -53 -51 -49 -45 -42 -38 -34 -30 -26 -22 -18 -11 -4 2 9 10 12 14 16 14 12 10 8 6 3 1 -1 1 4 0 -9 -21 -34 -44 -50 -51 -53
$$ packed form
12922A5jjkjpoopj1j1j6j6j0j0%JllllOOPOQQQQPPJ7J6J8J7J0NLKKKKPRJmljojMMkj1j6j4
12898C1j4noonnooommmmpppplmmmKJJK%JJ%J%JJKKKKKKKKONNNONNNlllllljnj3j3j1j6j4k2
12871a31k1j5JKlj2oRJ4QlLRJ0PQKLQQQQjjjjnnnm%%J%KJKK%%nnonNNJ1J1J4QQQPPJ0J0J0
12846eRLMLLkkklnmon%%%jqqqqqlMNNONNMLMLMLMKMLMMJOLLj0k0j9j1klmqqkJ4J0JlnJKm%
12819d2%kkJmj4j3j4j4j0j0j0j0mnlmkMRJ3J0NJ4K0J9LnnJPMMonoononoKKKKKKKKmmmmmmm
12795a16mmlmmlmlmnnolKPMMKNJ7K2J6J0K3K3J6LPJ1J2OJ0J0llllllllnnnmnnnnkkkkkkkk
12770c7JJJJqqpqpqpppqpplkllklkl%%%%ONNOMNMNMMNMRRRQRRQRKJKJJKJKonnoonoo%jlpj0
12740g0nJ1K0K0POJ1QMjomk%Jkpj0rppppKJKKMLMMMMMMPPOPJKKKkkkkklkkKLmrj2j3j0ojk
$$ plain form
12714 -53 -57 -66 -74 -81 -90 -98 -98 -99 -99 -100 -100 -99 -104 -100 -89 -78 -64 -55 -40 -24 -8 -3 -6 -2 6 16 23 30 34 34 31 29 31 33 32 31 30 29 28 27 26 25 24 22 21 20 10 0 -10 -20 -24 -23 -21 -27 -34 -42 -41 -46
12689 -46 -54 -57 -45 -34 -32 -29 -20 -5 11 20 23 27 36 46 50 55 59 63 64 53 35 22 22 23 18 5 -7 -12 -8 -4 0 4 3 2 1 0 8 15 23 30 38 46 53 61 59 58 56 55 53 52 50 48 49 49 49 50 50 50 51
12664 51 51 45 38 32 26 19 13 6 0 -1 -3 -5 -7 -9 -11 -13 -15 -22 -29 -37 -44 -45 -47 -49 -51 -48 -45 -37 -29 -20 -17 -21 -25 -27 -28 -30 -32 -29 -26 -23 -20 -17 -14 -11 -7 -4 -1 1 4 6 9 12 14 17 19 22 25 21 17 14 10 7 3 0 -3 -6 -9 -12 -15
12634 -15 -15 -20 -24 -25 -25 -25 -24 -23 -20 -13 -5 -2 2 10 17 22 20 17 16 12 2 -8 -18 -28 -34 -37 -32 -25 -22 -21 -22 -26 -30 -34 -38 -42 -42 -43 -43 -44 -39 -34 -30 -25 -17 -9 -1 6 8 11 14 16 23 29 36 43 49 56 62 69 72 76 79 83 80
12606 80 72 68 63 53 43 33 23 13 3 -6 -16 -25 -34 -43 -52 -55 -59 -63 -66 -70 -74 -78 -82 -86 -89 -93 -97 -101 -105 -109 -112 -116 -120 -124 -128 -135 -142 -150 -157 -159 -162 -164 -166 -164 -162 -160 -158 -151 -144 -137 -129 -125 -120 -116 -111 -101 -91 -82 -72
12581 -72 -69 -65 -62 -59 -55 -52 -49 -45 -52 -58 -65 -71 -77 -84 -90 -97 -96 -96 -96 -96 -103 -111 -113 -107 -94 -80 -67 -53 -31 -8 4 -8 -18 -23 -17 -8 -3 -6 -19 -37 -51 -63 -75 -91 -113 -137 -150 -151 -153 -156 -158
12559 -158 -160 -158 -161 -164 -162 -152 -143 -133 -123 -112 -102 -92 -82 -71 -59 -47 -35 -26 -17 -7 1 7 13 18 24 24 18 16 14 14 14 14 14 15 15 15 15 14 12 10 8 7 5 3 2 5 8 11 14 14 15 15 16 7 0 -9
12534 -9 -17 -20 -24 -27 -30 -31 -32 -33 -34 -35 -36 -36 -37 -32 -27 -22 -17 -11 -6 -1 3 7 12 16 20 25 29 33 37 35 33 31 29 27 25 23 21 24 27 30 34 37 40 43 47 43 40 36 33 30 26 23 20 22 24 26 29 31 33 35 38 30 23 15 8 1 -6 -13 -21 -21
$$ packed form
12714e3mrqprq%j%j%JnMJ1J1J4RJ5J6J6NlMQJ0PPM%lkKKjjjjjjjjjkjjj0j0j0j0mJKopqJn
12689d6qlJ2J1KLRJ5J6RLMRJ0MNMMJj1j8j3%Jnj3j2nMMMMjjjjQPQPQQPQkjkjkjkkJ%%J%%J
12664E1%opoopopojkkkkkkkppqpjkkkLLQQRLmmkjkkLLLLLLLMLLKLKLLKLKLLmmlmlmllllll
12634a5%nmj%%JJLPQLMQPNkljmj0j0j0j0olNPLJjmmmmm%j%jNNMNQQQPKLLKPOPPOPOPLMLMl
12606H0qmnj0j0j0j0j0j0rj0rrrrlmmlmmmmmlmmmmmlmmmmppqpklkkKKKKPPPQMNMNJ0J0RJ0
12581g2LMLLMLLMpopoopopJ%%%pqkOJ3J4J3J4K2K3J2j2j0nORNlj3j8j4j2j2j6k2k4j3jklk
12559a58kKllKJ0RJ0J0J1J0J0J0J1J2J2J2RRJ0QOONO%okk%%%%J%%%jkkkjkkjLLLL%J%Jrpr
12534iqlmlljjjjjj%jNNNNONNMMNMMNMMMkkkkkkkkLLLMLLLMmlmllmllKKKLKKKLqpqppppq%
$$ plain form
12504 -21 -22 -23 -24 -25 -26 -26 -27 -35 -42 -49 -57 -64 -71 -81 -86 -82 -78 -74 -70 -66 -61 -57 -53 -60 -67 -74 -81 -91 -97 -94 -92 -95 -98 -101 -105 -113 -127 -141 -150 -151 -153 -164 -176 -181 -187 -192 -197 -193 -184 -178 -172 -171 -176 -186 -195 -196 -168 -131 -94
12479 -94 -55 -11 16 24 31 38 46 49 51 53 55 57 59 66 75 74 68 46 15 -15 -37 -59 -81 -104 -115 -126 -137 -149 -156 -164 -172 -179 -188 -188 -189 -189 -198 -212 -214 -201 -185 -165 -139 -109 -82 -60 -42
12459 -42 -30 -22 -14 -8 -7 -4 0 2 5 5 5 5 5 0 -3 -8 -13 -16 -18 -20 -23 -20 -18 -16 -14 -17 -20 -23 -26 -31 -35 -40 -45 -44 -44 -43 -43 -45 -47 -50 -52 -57 -62 -67 -72 -74 -75 -77 -79 -79 -78 -77 -77 -74 -72 -70 -68 -63 -59 -54 -49 -52 -54 -56 -59 -61 -63 -65
12429 -65 -67 -64 -56 -50 -45 -39 -34 -28 -23 -22 -20 -24 -28 -18 -8 -3 -9 -14 -20 -27 -33 -43 -53 -63 -72 -89 -105 -125 -139 -147 -156 -164 -172 -178 -184 -190 -196 -194 -191 -188 -186 -178 -171 -164 -156 -149 -141 -134 -127 -117 -107 -97 -88 -83 -79 -74 -70
12405 -70 -63 -57 -50 -43 -40 -36 -32 -28 -24 -20 -15 -11 -16 -22 -27 -32 -28 -25 -26 -37 -48 -53 -58 -70 -88 -100 -105 -110 -119 -127 -134 -135 -130 -125 -130 -134 -141 -136 -114 -93 -69 -53 -39 -33 -28 -23 -24 -25 -25 -25 -25 -25 -31 -36 -42 -48 -54 -59 -65
12379 -65 -71 -74 -78 -81 -84 -83 -82 -81 -80 -78 -77 -75 -74 -79 -84 -87 -84 -80 -80 -83 -95 -109 -124 -138 -152 -179 -193 -191 -176 -167 -164 -162 -160 -159 -158 -150 -137 -122 -108 -96 -89 -88 -86 -85 -84 -77 -70 -63 -55 -53 -51 -49 -47 -51 -55 -60 -64
12355 -64 -68 -72 -76 -80 -79 -78 -77 -76 -80 -84 -89 -93 -99 -105 -110 -116 -113 -111 -108 -105 -106 -107 -107 -108 -103 -97 -94 -86 -72 -59 -31 0 24 26 3 -19 -31 -30 -32 -42 -55 -68 -76 -75 -77 -79 -91 -102 -108 -113 -118 -123 -122 -120 -118 -117
12331 -117 -115 -114 -112 -111 -106 -102 -97 -93 -94 -94 -95 -96 -89 -82 -76 -69 -62 -55 -49 -42 -41 -40 -38 -37 -36 -35 -34 -32 -31 -31 -30 -29 -20 -10 1 7 7 2 -3 -3 4 12 14 25 37 33 20 8 -4 -23 -48 -73 -99 -120 -129 -133
$$ packed form
12504b1jjjjj%jqppqppj0nMMMMMNMMppppj0oLKlllmqj4j4rjkj1j2nonnMROOJnj0rjK8L7L7
12479i4L9M4K7QPPQLKKKKKPRjok2l1l0k2k2k2k3j1j1j1j2pqqpr%j%rj4kJ3J6K0K6L0K7K2J8
12459d2J2QQOJLMKL%%%%nlnnlkklLKKKllllnmnnJ%J%kklknnnnkjkk%JJ%LKKKNMNNlkklkkk
12429f5kLQONONONJKmmJ0J0Nonopoj0j0j0rj7j6k0j4qrqqooooKLLKQPPQPQPPJ0J0J0RNMNM
12405g0POPPLMMMMMNMnonnMLjj1j1nnj2j8j2nnrqpjNNnmpNK2K1K4J6J4ONNjj%%%%onooono
12379f5olmllJJJJKJKJnnlLM%lj2j4j5j4j4k7j4KJ5RLKKJJQJ3J5J4J2PJKJJPPPQKKKKmmnm
12355f4mmmmJJJJmmnmoonoLKLLjj%jNOLQJ4J3K8L1K4Kk3k2j2Jkj0j3j3qJkkj2j1onnnJKKJ
12331a17KJKJNMNMj%jjPPOPPPOPJJKJJJJKJ%JJRJ0J1O%nn%PQKJ1J2mj3j2j2j9k5k5k6k1rm
$$ plain form
12306 -133 -125 -117 -116 -119 -125 -126 -120 -113 -104 -95 -87 -78 -74 -70 -66 -62 -59 -55 -51 -47 -43 -39 -36 -32 -22 -13 -11 -14 -15 -16 -18 -19 -21 -24 -26 -28 -25 -22 -20 -17 -15 -13 -7 -7 -2 7 13 20 31 43 49 64 81 93 91 90 88 87 86 85 84 83
12280 83 82 81 75 69 62 56 54 52 49 47 45 42 40 38 43 48 54 59 56 53 49 46 46 45 45 45 45 44 44 44 45 47 49 50 52 54 55 57 60 64 67 71 74 77 81 84 86 88 89 91 87 84 80 77 67 58 49 40 30 21 11 2 -11 -29
12252 -29 -48 -62 -66 -71 -75 -80 -87 -100 -114 -119 -117 -102 -83 -65 -45 -25 -15 -5 -8 -12 -9 -7 3 15 16 17 15 14 12 11 6 0 -4 -9 -14 -19 -24 -30 -30 -30 -30 -30 -35 -40 -45 -51 -52 -53 -54 -55 -56 -57 -58 -59 -61 -63
12228 -63 -63 -59 -55 -71 -92 -114 -129 -143 -158 -172 -181 -191 -189 -188 -189 -189 -190 -191 -182 -173 -164 -156 -146 -136 -127 -117 -102 -88 -73 -58 -51 -45 -38 -32 -25 -19 -12 -6 -6 -7 -7 -7 -8 -8 -8 -9 -11 -13 -15 -17 -13 -10 -7 -4
12205 -4 -4 -4 -4 -4 -4 -4 -4 -4 -6 -9 -11 -14 -16 -19 -21 -24 -33 -42 -51 -60 -69 -78 -87 -96 -98 -101 -103 -106 -103 -100 -97 -95 -94 -92 -91 -90 -84 -78 -71 -65 -60 -55 -51 -46 -41 -36 -31 -27 -23 -20 -16 -13 -10 -6 -3 0 0 1 2 3 10 16 22 28 34 40 47 53 54 55
12174 55 56 56 56 55 54 53 52 52 51 50 46 42 38 34 30 26 22 18 10 1 -6 -15 -14 -14 -14 -14 -19 -24 -29 -34 -39 -44 -50 -55 -66 -82 -98 -109 -113 -114 -116 -118 -123 -133 -140 -145 -144 -134 -121 -113 -109 -104 -93 -76 -63 -58 -60 -59 -56
12149 -56 -52 -49 -46 -49 -51 -54 -56 -59 -61 -63 -66 -59 -53 -47 -41 -41 -46 -48 -50 -53 -55 -58 -60 -59 -58 -57 -56 -60 -64 -68 -72 -74 -76 -77 -79 -76 -72 -69 -65 -58 -45 -34 -26 -16 -6 3 13 22 34 49 55 59 60 63 65 63 56 51 48 47 46 40
12122 40 34 21 7 0 -3 -11 -24 -35 -43 -48 -48 -50 -53 -55 -57 -59 -61 -70 -78 -86 -94 -96 -99 -101 -103 -103 -97 -89 -82 -72 -62 -57 -58 -57 -54 -49 -41 -30 -19 -11 -7 -3 0 4 8 6 4 2 0 -4 -10 -16 -21 -15 -8 -2 4 2 1 0 -1
$$ packed form
12306a33QQJlojOPRRQRMMMMLMMMMMLMJ0RKljjkjklkkLLKLKKO%NROPJ1J2OJ5J7J2kjkjjjjj
12280H3jjoopokklkklkkNNONllml%j%%%j%%JKKJKKJKLMLMLLMLKKJKmlmlj0rrrj0rj0rj3j8
12252b9j9j4mnmnpj3j4nKJ5J9J8K0K0J0J0lmLKJ0J2JJkjkjnomnnnno%%%%nnnojjjjjjjjkk
12228f3%MMj6k1k2j5j4j5j4rj0KJj%jjRRRQJ0J0RJ0J5J4J5J5POPOPOPO%j%%j%%jkkkkMLLL
12205d%%%%%%%%klklklklrrrrrrrrklklLLLKJKJJOOPONNMNNNNMMLMLLMLL%JJJPOOOOOPOJJ
12174E5J%%jjjj%jjmmmmmmmmqrprJ%%%nnnnnnonj1j6j6j1mjkknj0pnJJ0J3QMNJ1J7J3NkJL
12149e6MLLlklklkklPOOO%nkklklkJJJJmmmmkkjkLMLMPJ3J1QJ0J0RJ0RJ2J5OMJLKkpnljjo
12122D0oj3j4plqj3j1qn%klkkkkrqqqklkk%OQPJ0J0NjJLNQJ1J1QMMLMMkkkkmoonOPOOkjjj
$$ plain form
12096 -1 -3 -5 -6 -8 -2 2 7 12 14 11 12 12 11 9 11 7 -1 -11 -21 -30 -32 -33 -34 -36 -37 -38 -39 -41 -39 -38 -36 -35 -25 -15 -4 5 13 22 30 39 47 56 64 73 71 70 73 68 58 49 39 29 17 0 -15 -29 -38 -42
12071 -42 -48 -55 -62 -68 -75 -81 -88 -94 -100 -106 -105 -98 -94 -90 -86 -81 -77 -73 -62 -51 -42 -39 -23 -7 6 2 0 4 16 27 40 46 48 49 49 49 50 50 49 49 49 49 55 62 68 74 71 63 58 52 48 45 41 37 28 19 10 1 -7 -16 -26
12045 -26 -35 -44 -53 -63 -72 -78 -85 -92 -98 -104 -110 -110 -105 -101 -96 -91 -86 -75 -64 -53 -43 -40 -37 -35 -32 -29 -27 -24 -21 -16 -10 -4 0 1 1 1 2 0 -3 -5 -8 -11 -14 -16 -19 -20 -20 -21 -22 -39 -61 -83 -100 -119 -143 -163 -184
12020 -184 -200 -209 -205 -201 -197 -202 -212 -222 -222 -210 -188 -165 -146 -126 -97 -68 -51 -44 -42 -40 -38 -36 -34 -32 -33 -39 -45 -46 -46 -45 -45 -44 -53 -61 -60 -47 -34 -30 -34 -32 -27 -23 -14 -11 -17 -18 -22 -25 -29 -32 -36 -39 -40 -41 -42
11996 -42 -43 -44 -45 -46 -47 -47 -47 -47 -47 -42 -37 -32 -26 -21 -15 -9 -3 -6 -8 -11 -14 -9 -5 0 3 8 13 17 22 19 16 13 11 8 5 2 0 1 3 4 6 7 9 10 12 12 12 12 12 8 3 -1 -6 -9 -12 -14 -16 -21 -20 -23 -26 -30 -40 -45 -35 -23
11968 -23 -15 -14 -12 -6 8 21 29 28 26 24 22 18 8 2 -4 -10 -17 -23 -29 -40 -51 -54 -52 -45 -33 -24 -14 -4 5 22 44 67 81 86 85 86 86 87 87 86 85 85 84 83 83 83 82 82 81 81 80 74 68 59 55 58 62
11943 62 58 48 35 17 -4 -33 -59 -85 -101 -117 -124 -131 -138 -145 -151 -158 -164 -170 -169 -168 -168 -167 -160 -153 -146 -139 -135 -131 -119 -102 -75 -49 -19 4 29 54 73 83 89 94 99 104 103 102 101 100 98 96 93 91
11922 91 84 72 46 19 -3 -14 -28 -47 -71 -86 -95 -105 -111 -118 -124 -130 -130 -130 -129 -129 -124 -118 -118 -109 -98 -87 -86 -85 -78 -72 -56 -40 -30 -29 -23 -18 -17 -16 -16 -15 -20 -25 -30 -35 -40 -44 -49 -54 -54 -54 -54 -53 -53 -53
$$ packed form
12096akkjkOMNNKlJ%jkKmqj0j0rkjjkjjjkKJKJJ0J0J1RQRQRQRQRkjLnj0rj0j0j2j7j5j4rm
12071d2oppopopoooJPMMMNMMJ1J1RLJ6J6J3mkMJ2J1J3OKJ%%J%j%%%OPOOlqnomlmmrrrrqrj0
12045b6rrrj0roppooo%NMNNNJ1J1J1J0LLKLLKLLNOOMJ%%Jklklllklj%jjj7k2k2j7j9k4k0k1
12020a84j6rMMMnj0j0%J2K2K3J9K0K9K9J7PKKKKKKjooj%J%JrqJJ3J3MmKNMRLojmlmlmljjj
11996d2jjjjj%%%%NNNONOOOlkllNMNLNNMNlllklllkJKJKJKJK%%%%mnmnllkknJllmj0nJ0J2
11968b3QJKOJ4J3Qjkkkmj0ooopooj1j1lKPJ2RJ0J0RJ7K2K3J4NjJ%J%jj%jj%%j%j%joormLM
11943F2mj0j3j8k1k9k6k6j6j6ppppopooJJ%JPPPPMMJ2J7K7K6L0K3K5K5J9J0ONNNjjjjkklk
11922I1pj2k6k7k2j1j4j9k4j5rj0opoo%%J%NO%RJ1J1JJPOJ6J6J0JONJJ%Jnnnnnmnn%%%J%%
$$ plain form
11899 -53 -53 -53 -47 -42 -36 -31 -20 -10 0 10 13 16 18 21 19 16 14 11 6 0 -4 -10 -18 -26 -34 -42 -49 -56 -62 -69 -71 -73 -74 -76 -83 -91 -98 -106 -105 -104 -105 -105 -108 -123 -145 -161 -168 -176 -192 -209 -229 -234 -230 -226 -225 -224 -223 -222 -220
11873 -220 -212 -193 -169 -142 -116 -92 -64 -36 -13 -6 -8 -3 0 4 7 8 9 10 11 10 8 6 5 3 1 0 -2 -13 -24 -35 -46 -54 -62 -70 -78 -81 -84 -87 -90 -89 -88 -87 -86 -85 -84 -83 -82 -83 -83 -84 -85 -86 -87 -88 -89 -94
11849 -94 -98 -103 -108 -113 -118 -123 -128 -134 -141 -147 -153 -162 -172 -159 -130 -65 -5 51 64 57 36 13 3 1 0 -10 -32 -55 -66 -64 -68 -73 -78 -84 -89 -87 -85 -88 -83 -77 -72 -63 -42 -28 -13 -1 15 23 32 43
11827 43 50 45 40 45 49 43 37 31 25 17 4 -8 -15 -21 -27 -36 -40 -42 -43 -45 -46 -49 -52 -65 -79 -86 -93 -101 -108 -103 -99 -94 -90 -90 -95 -96 -98 -101 -96 -74 -47 -15 16 46 60 64 63 64 65 67 70 72 75 71 67 60 59 63 73
11802 73 83 88 84 75 66 63 62 66 78 99 104 83 60 36 21 6 6 10 10 5 3 0 4 8 12 16 22 28 34 40 43 46 50 53 56 60 63 66 69 73 76 79 81 82 84 86 87 89 91 92 91 89 88 86 86 86 86 86 86 87 77
11776 77 52 13 -42 -94 -138 -155 -168 -176 -178 -174 -169 -161 -159 -161 -164 -167 -170 -168 -165 -163 -161 -154 -147 -136 -133 -137 -140 -125 -102 -81 -72 -66 -60 -53 -46 -37 -32 -29 -26 -24 -22 -26 -35 -41 -47 -48 -50 -51 -53 -52 -51 -50 -48 -49 -50 -51 -52 -52
11751 -52 -53 -54 -55 -57 -59 -62 -64 -64 -63 -69 -81 -91 -92 -98 -104 -111 -105 -96 -87 -82 -82 -84 -77 -57 -36 -26 -27 -27 -22 -10 1 6 11 16 21 20 19 17 16 20 24 28 32 35 38 42 45 40 35 29 24 17 10 3 -3 -9 -16 -23 -30 -44 -58
11724 -58 -69 -85 -108 -131 -145 -158 -178 -203 -220 -214 -194 -169 -145 -121 -103 -84 -73 -68 -69 -76 -83 -85 -86 -87 -87 -88 -93 -99 -105 -110 -111 -107 -106 -104 -103 -102 -93 -79 -73 -66 -59 -52 -47 -42 -34 -31 -35 -39 -33 -28 -22 -16
$$ packed form
11899e3%%ONONJ1J0J0J0LLKLklklnomoqqqqppopkkjkpqpqJJj%lj5k2j6pqj6j7k0nMMJJJJK
11873b20QJ9K4K7K6K4K8K8K3PkNLMLJJJJjkkjkkjkj1j1j1j1qqqqllllJJJJJJJJj%jjjjjjn
11849i4mnnnnnnopoorj0J3K9O5O0N6J3pk1k3j0kjj0k2k3j1KmnnonKKlNONRK1J4J5J2J6QRJ1
11827D3PnnNMooooqj3j2poormkjkjllj3j4ppqpNMNM%njklNK2K7L2L1L0J4MjJJKLKLmmpjMJ0
11802G3J0NmrrljMJ2K1Nk1k3k4j5j5%M%nklMMMMOOOOLLMLLMLLLMLLKJKKJKKJjkjk%%%%%Jj0
11776G7k5l9n5n2m4j7j3qkMNQKklllKLKKPPJ1LmlJ5K3K1ROOPPRNLLKKmroojkjkJJJKjjjj%
11751e2jjjkklk%Joj2j0joopORRN%kPK0K1J0j%NJ2J1NNNNjjkjMMMMLLMLnnonpppoopppj4j4
11724e8j1j6k3k3j4j3k0k5j7OK0K5K4K4J8J9J1Njppkjj%jnoonjMJKJJRJ4OPPPNNQLmmONOO
$$ plain form
11702 -16 -20 -25 -31 -36 -42 -48 -54 -60 -67 -73 -71 -68 -66 -64 -61 -59 -56 -54 -54 -53 -53 -53 -52 -52 -52 -51 -44 -37 -29 -22 -15 -8 0 6 9 12 16 19 22 25 29 32 30 27 25 23 21 19 16 14 2 -14 -31 -43 -50 -56 -63 -69 -74 -79 -87 -89 -86 -83 -80
11674 -80 -77 -71 -66 -61 -55 -50 -44 -39 -34 -30 -26 -22 -19 -15 -11 -8 -4 -2 0 0 2 0 -4 -7 -11 -13 -15 -17 -19 -21 -23 -25 -27 -26 -26 -26 -26 -26 -26 -26 -26 -28 -30 -36 -36 -30 -24 -18 -12 -8 -4 -1 2 1 0 -1 -3 -10 -17 -24 -31 -36 -40 -34 -28 -25 -22 -19 -16
11644 -16 -22 -33 -41 -49 -49 -49 -49 -48 -48 -48 -48 -47 -45 -43 -41 -39 -41 -44 -47 -50 -51 -51 -51 -51 -53 -55 -62 -69 -78 -85 -86 -82 -78 -77 -83 -91 -98 -108 -107 -78 -46 -5 24 49 55 53 56 58 60 61 62 64 63 63 62 61 61 60 60 59 59 59
11618 59 59 59 59 59 59 59 59 60 60 60 60 60 60 61 64 68 72 76 80 84 88 92 93 95 96 98 94 90 89 83 75 67 59 51 49 47 35 22 10 3 -3 -15 -24 -33 -42 -51 -60 -68 -66 -64 -63 -62 -60 -59 -59 -59 -59 -60 -60 -60 -60 -60 -54 -47 -41
11590 -41 -34 -28 -22 -13 -9 -9 -9 -10 -10 -5 0 3 8 15 21 28 34 35 37 38 39 40 41 42 43 43 44 45 46 37 28 19 9 0 -8 -17 -26 -24 -22 -20 -18 -21 -25 -21 -12 -6 -4 0 4 6 13 20 22 27 33 38 43 48 53 58 63 60 57 55 52 49 46 39
$$ packed form
11702a6mnonoooopoKLKKLKLK%J%%J%%JPPQPPPQOLLMLLLMLklkkkklkj2j6j7j2poponnqkLLL
11674h0LONNONONNMMMLMMLMKK%KkmlmkkkkkkkkJ%%%%%%%kko%OOOOMMLLjjjkppppnmOOLLLL
11644a6oj1qq%%%J%%%JKKKKklllj%%%kkpprpjMMJoqpj0JK9L2M1K9K5OkLKKJJKj%jj%j%j%%
11618E9%%%%%%%J%%%%%JLMMMMMMMJKJKmmjoqqqqkkj2j3j2poj2rrrrrqKKJJKJ%%%j%%%%OPO
11590d1POORM%%j%NNLNPOPOJKJJJJJJ%JJJrrrj0rqrrKKKKlmMROKMMKPPKNONNNNNNllklllp
$$ [...]
-3971A96
##END=	
##TITLE=	Feb21-2022.1.fid
##JCAMP-DX=	6.0	$$ MestReNova 14.3.0-30573
##BLOCK_ID=	4
##DATA TYPE=	NMR PEAK TABLE
##DATA CLASS=	PEAK TABLE
##CROSS REFERENCE=	NMR SPECTRUM: BLOCK_ID=3                                     
##.OBSERVE FREQUENCY=	100.60145830999100269
##.OBSERVE NUCLEUS=	^13C
##NPOINTS=	16
##FIRSTX=	18.903050131258666511
##LASTX=	187.85425393062934063
##XFACTOR=	1
##YFACTOR=	1
##FIRSTY=	185.24468843638260296
##XUNITS=	PPM
##YUNITS=	ARBITRARY UNITS
##PEAK TABLE=	(XYW..XYW)
18.903050131258666511,185.24468843638260296,0.031733860117884135632
47.89031712839722843,109.44628724948594822,0.055118327039909362219
55.37920767782974707,125.37749371338119886,0.031314815374346625931
57.732261923559690331,117.14096775921437654,0.032649272485167218916
105.1339240538433728,47.037586212158203125,0.045149440372598347027
114.24966262949814677,256.08200603435955145,0.037648970879324644701
128.78555348607619635,254.72749582516877354,0.031935620796069950911
129.34750085326641056,255.3044432722582826,0.032902563695528803944
130.14393897352226759,203.29016240757954392,0.041356917003364086771
131.00478897225596597,93.231683686850729487,0.04285054631083007326
132.12641462715237139,62.542041778564453125,0.045149440372598347027
140.98896626267938359,126.30523315484774116,0.033396412017122831251
141.93433902774003741,32.762386322021484375,0.045149440372598347027
159.52147049868449358,47.30268096923828125,0.045149440372598347027
166.10969615009594236,31.625650405883789063,0.045149440372598347027
187.85425393062934063,58.21530914306640625,0.045149440372598347027
##$MNOVA/PEAK_DATA_TABLE=	(T,F,A,ST,SP,APT,APC)
$$ Complementary to PEAK TABLE
$$ T: Type
$$ F: Flags
$$ A: Annotation
$$ ST: Shape Type
$$ SP: Shape Parameter
$$ APT: Attached Peaks Type
$$ APC: Attached Peaks Count
Compound,None,,1,-0.2000000000000000111,0,0
Compound,None,,1,0.30531226703326080907,0,0
Compound,None,,1,-0.76091862586503378196,0,0
Compound,None,,1,0.43656836564216600083,0,0
Compound,None,,0,0,0,0
Compound,None,,1,0.10233986200574002323,0,0
Compound,None,,1,-0.062995322840158976541,0,0
Compound,None,,1,-0.087359297488385168062,0,0
Compound,None,,1,-0.086008040332941015915,0,0
Compound,None,,1,0,0,0
Compound,None,,0,0,0,0
Compound,None,,1,0.32724319192800316314,0,0
Compound,None,,0,0,0,0
Compound,None,,0,0,0,0
Compound,None,,0,0,0,0
Compound,None,,0,0,0,0
##END=	
##END=	
