##TITLE=	Nov18-2021.60.fid
TM-VI-170 acetone-d6 Ca+Bz-pyr.
##JCAMP-DX=	6.0	$$ MestReNova 14.3.0-30573
##DATA TYPE=	LINK
##BLOCK_ID=	1
##BLOCKS=	3    
##ORIGIN=	Mestrelab Research S.L.
##OWNER=	hrzepa
##$MNOVA/LINK_BLOCK_TYPE=	ITEM	$$ NMR Spectrum
##$MNOVA/ITEM/POLYGON=	(XY..XY)
5321,5835
8722,5835
8722,8208
5321,8208
5321,5835
##$MNOVA/ITEM/Z=	0
##$MNOVA/ITEM/ANGLE=	0
##TITLE=	Nov18-2021.60.fid
##JCAMP-DX=	6.0	$$ MestReNova 14.3.0-30573
##BLOCK_ID=	2
##DATA TYPE=	MNOVA NMR VIEW DATA
##DATA CLASS=	MNOVA VIEW DATA
##$MNOVA/ITEM/ZOOM/X=	-1.1995438677717462639,	10.743836857799585971
##$MNOVA/ITEM/ZOOM/Y=	-419.48899698951822756,	4585.0394900418086763
##END=	
##TITLE=	Nov18-2021.60.fid
##JCAMP-DX=	6.0	$$ MestReNova 14.3.0-30573
##BLOCK_ID=	3
##DATA TYPE=	NMR SPECTRUM
##DATA CLASS=	XYDATA
##NUMDIM=	1
##ORIGIN=	Bruker BioSpin GmbH
##OWNER=	nmr
##.OBSERVE FREQUENCY=	400.20240119999999706
##.OBSERVE NUCLEUS=	^1H
##.SOLVENT NAME=	Acetone
##.PULSE SEQUENCE=	zg30
##LONGDATE=	2021/11/18 13:23:00.000
##.ACQUISITIONMODE=	SIMULTANEOUS (DQD)
##$ORIGINAL FORMAT=	Bruker XWIN-NMR
##$MNOVA/SCALES_VERSION=	7
##$PARAMETER FILE=	(acqus, ASCII, //ch-nmrserv3.ch.ic.ac.uk/Av400C/agmb/nmr/Nov18-2021/60/acqus, 0)
$$ ##TITLE= Parameter file, TOPSPIN		Version 3.2
$$ ##JCAMPDX= 5.0
$$ ##DATATYPE= Parameter Values
$$ ##NPOINTS= 11	$$ modification sequence number
$$ ##ORIGIN= Bruker BioSpin GmbH
$$ ##OWNER= nmr
$$ $$ 2021-11-18 13:23:03.291 +0000  nmr@CZC2439F63
$$ $$ /opt/topspin/data/agmb/nmr/Nov18-2021/60/acqus
$$ $$ process /opt/topspin3.2/prog/mod/shimcntl
$$ ##$ACQT0= -2.10084033613445
$$ ##$AMP= (0..31)
$$ 100 100 100 100 100 100 100 100 100 100 100 100 100 100 100 100 100 100
$$ 100 100 100 100 100 100 100 100 100 100 100 100 100 100
$$ ##$AMPCOIL= (0..19)
$$ 0 0 0 0 0 0 0 0 0 0 0 0 0 0 0 0 0 0 0 0
$$ ##$ANAVPT= -1
$$ ##$AQSEQ= 0
$$ ##$AQ_mod= 3
$$ ##$AUNM= <au_zg>
$$ ##$AUTOPOS= <48 >
$$ ##$BF1= 400.2
$$ ##$BF2= 400.2
$$ ##$BF3= 400.2
$$ ##$BF4= 400.2
$$ ##$BF5= 400.2
$$ ##$BF6= 400.2
$$ ##$BF7= 400.2
$$ ##$BF8= 400.2
$$ ##$BYTORDA= 0
$$ ##$CAGPARS= (0..11)
$$ 0 0 0 0 0 0 0 0 0 0 0 0
$$ ##$CFDGTYP= 0
$$ ##$CFRGTYP= 9
$$ ##$CHEMSTR= <none>
$$ ##$CNST= (0..63)
$$ 1 1 145 1 1 1 1 1 1 1 1 1 1 1 1 1 1 1 1 1 1 1 1 1 1 1 1 1 1 1 1 1 1 1 1
$$ 1 1 1 1 1 1 1 1 1 1 1 1 1 1 1 1 1 1 1 1 1 1 1 1 1 1 1 1 1
$$ ##$CPDPRG= (0..8)
$$ <> <> <> <> <mlev> <mlev> <mlev> <mlev> <mlev>
$$ ##$D= (0..63)
$$ 0 1 0 0 0 0 0 0 0 0.06 0 0 0 0 0 0 0.0002 0 0 0 0 0 0 0 0 0 0 0 0 0 0 0
$$ 0 0 0 0 0 0 0 0 0 0 0 0 0 0 0 0 0 0 0 0 0 0 0 0 0 0 0 0 0 0 0 0
$$ ##$DATE= 1637241782
$$ ##$DE= 6.5
$$ ##$DECBNUC= <off>
$$ ##$DECIM= 2496
$$ ##$DECNUC= <off>
$$ ##$DECSTAT= 4
$$ ##$DIGMOD= 1
$$ ##$DIGTYP= 12
$$ ##$DQDMODE= 0
$$ ##$DR= 22
$$ ##$DS= 2
$$ ##$DSPFIRM= 0
$$ ##$DSPFVS= 20
$$ ##$DTYPA= 0
$$ ##$EXP= <proton>
$$ ##$F1LIST= <111111111111111>
$$ ##$F2LIST= <222222222222222>
$$ ##$F3LIST= <333333333333333>
$$ ##$FCUCHAN= (0..9)
$$ 0 2 0 0 0 0 0 0 0 0
$$ ##$FL1= 90
$$ ##$FL2= 90
$$ ##$FL3= 90
$$ ##$FL4= 90
$$ [...]
$$ ##$Sgu3PowerLevels= (0..7)
$$ 0 0 0 0 0 0 0 0
$$ ##$Sgu4PowerLevels= (0..7)
$$ 0 0 0 0 0 0 0 0
$$ ##$Sgu5PowerLevels= (0..7)
$$ 0 0 0 0 0 0 0 0
$$ ##$Sgu6PowerLevels= (0..7)
$$ 0 0 0 0 0 0 0 0
$$ ##$Sgu7PowerLevels= (0..7)
$$ 0 0 0 0 0 0 0 0
$$ ##$Sgu8PowerLevels= (0..7)
$$ 0 0 0 0 0 0 0 0
$$ ##$SguType= 3
$$ ##$ShimPowMaxUA= (0..63)
$$ 130000 130000 130000 130000 130000 130000 130000 130000 130000 130000 130000
$$ 130000 130000 130000 130000 130000 130000 130000 130000 130000 0 0 0 0
$$ 0 0 0 0 0 0 0 0 0 0 0 0 0 0 0 0 0 0 0 0 0 0 0 0 0 0 0 0 0 0 0 0 0 0 0 0
$$ 0 0 0 0
$$ ##$ShimPowMaxUC= (0..63)
$$ 130000 130000 130000 130000 130000 130000 130000 130000 130000 130000 130000
$$ 130000 130000 130000 130000 130000 130000 130000 130000 130000 0 0 0 0
$$ 0 0 0 0 0 0 0 0 0 0 0 0 0 0 0 0 0 0 0 0 0 0 0 0 0 0 0 0 0 0 0 0 0 0 0 0
$$ 0 0 0 0
$$ ##$ShimPowMaxUG= (0..63)
$$ 524287 524287 524287 524287 524287 524287 524287 524287 524287 524287 524287
$$ 524287 524287 524287 524287 524287 524287 524287 524287 524287 0 0 0 0
$$ 0 0 0 0 0 0 0 0 0 0 0 0 0 0 0 0 0 0 0 0 0 0 0 0 0 0 0 0 0 0 0 0 0 0 0 0
$$ 0 0 0 0
$$ ##$ShimPowRcbType= 3
$$ ##$ShimPowRes= (0..63)
$$ 1e-20 1e-20 1e-20 1e-20 1e-20 1e-20 1e-20 1e-20 1e-20 1e-20 1e-20 1e-20
$$ 1e-20 1e-20 1e-20 1e-20 1e-20 1e-20 1e-20 1e-20 0 0 0 0 0 0 0 0 0 0 0 0
$$ 0 0 0 0 0 0 0 0 0 0 0 0 0 0 0 0 0 0 0 0 0 0 0 0 0 0 0 0 0 0 0 0
$$ ##$ShimPowRng0= (0..63)
$$ 1 1 1 1 1 1 1 1 1 1 1 1 1 1 1 1 1 1 1 1 0 0 0 0 0 0 0 0 0 0 0 0 0 0 0 0
$$ 0 0 0 0 0 0 0 0 0 0 0 0 0 0 0 0 0 0 0 0 0 0 0 0 0 0 0 0
$$ ##$ShimPowRng1= (0..63)
$$ 1 1 1 1 1 1 1 1 1 1 1 1 1 1 1 1 1 1 1 1 0 0 0 0 0 0 0 0 0 0 0 0 0 0 0 0
$$ 0 0 0 0 0 0 0 0 0 0 0 0 0 0 0 0 0 0 0 0 0 0 0 0 0 0 0 0
$$ ##$ShimPowRng2= (0..63)
$$ 1 1 1 1 1 1 1 1 1 1 1 1 1 1 1 1 1 1 1 1 0 0 0 0 0 0 0 0 0 0 0 0 0 0 0 0
$$ 0 0 0 0 0 0 0 0 0 0 0 0 0 0 0 0 0 0 0 0 0 0 0 0 0 0 0 0
$$ ##$ShimPowRng3= (0..63)
$$ 1 1 1 1 1 1 1 1 1 1 1 1 1 1 1 1 1 1 1 1 0 0 0 0 0 0 0 0 0 0 0 0 0 0 0 0
$$ 0 0 0 0 0 0 0 0 0 0 0 0 0 0 0 0 0 0 0 0 0 0 0 0 0 0 0 0
$$ ##$ShimSysFunc= (0..63)
$$ 1 2 3 4 5 7 9 11 15 16 8 10 12 14 6 17 13 18 19 20 0 0 0 0 0 0 0 0 0 0
$$ 0 0 0 0 0 0 0 0 0 0 0 0 0 0 0 0 0 0 0 0 0 0 0 0 0 0 0 0 0 0 0 0 0 0
$$ ##$ShimSysMatrix= 0
$$ ##$ShimSysType= 1
$$ ##$TFXNUM= 0
$$ ##$TRIPLO2= 0
$$ ##$VTU= 2
$$ ##$VTUETH= <149.236.99.20>
$$ ##$VTUTY= <no>
$$ ##$WBREFAM= (0..15)
$$ 135.5 97.7 100 100 100 100 100 100 100 100 100 100 100 100 100 100
$$ ##$WBREFLM= (0..15)
$$ 0 0 0 0 0 0 0 0 0 0 0 0 0 0 0 0
$$ ##$WBREFPH= (0..15)
$$ 72.26 -67.22 0 0 0 0 0 0 0 0 0 0 0 0 0 0
$$ ##$WBSGU= (0..15)
$$ 0 0 0 0 0 0 0 0 0 0 0 0 0 0 0 0
$$ ##$XFAC= 2
$$ ##END=
$$ 
##$DECIM=	2496
##$DSPFVS=	20
##XUNITS=	HZ
##YUNITS=	ARBITRARY UNITS
##FIRSTX=	6400.4466911039889965
##LASTX=	-1612.2515557785104647
##DELTAX=	-0.12226593800080108598
##XFACTOR=	1
##YFACTOR=	0.021159286103081927782
##FIRSTY=	7.8360719680786132813
##MINY=	-2.1778957843780517578
##MAXY=	3500.378662109375
##NPOINTS=	65536
##XYDATA=	(X++(Y..Y))
$$ [...]
2867 8561 8194 7800 7407 6979 6520 6075 5691 5335 4979 4678 4376 4101 3826 3538 3280 3080 2941 2820 2699 2568 2437 2306 2175
2865 2175 2084 1993 1933 1872 1808 1743 1678 1613 1554 1494 1434 1375 1363 1351 1339 1328 1310 1291 1273 1255 1243 1231 1188 1146 1139 1132 1155 1179 1156 1133 1111 1088 1109 1130 1081
2860 1081 1032 1024 1016 1008 1001 1020 1039 1089 1139 1152 1165 1178 1191 1170 1150 1179 1209 1225 1241 1254 1266 1281 1235 1160 1115 1135 1215 1265 1254 1180 1076 1022 1029 1087 1145 1117
2856 1117 1088 1075 1062 1049 1036 993 950 908 867 863 888 905 861 828 856 911 937 900 833 767 730 730 761 806 852 847 841 805 769 763 757 781 806 812 818 825 831 869 907
2851 907 945 983 1005 1027 998 970 970 971 1001 1032 1036 1040 1044 1048 1063 1078 1144 1210 1189 1168 1146 1125 1099 1072 1133 1194 1188 1122 1056 1050 1068 1086 1040 995 953 972 1008 1043 1050
2846 1050 1057 1095 1132 1128 1124 1120 1116 1123 1130 1106 1082 1060 1037 1085 1133 1161 1188 1215 1243 1178 1114 1099 1085 1081 1076 1081 1117 1130 1082 1051 1051 1048 1014 980 977 980 953 894 836 810 784
2841 784 754 785 828 871 868 864 883 902 891 879 881 882 853 824 812 801 789 777 752 727 732 737 745 754 735 717 693 730 797 833 798 702 655 668 718 768 771 774 749 724
2836 724 730 735 749 763 706 648 650 652 627 602 597 652 690 698 652 606 588 570 558 545 562 580 593 606 569 531 522 512 503 493 543 594 594 593 543 493 473 453 515 576
2832 576 587 598 603 607 612 616 627 637 617 566 537 558 568 548 527 537 559 529 471 443 446 448 474 500 526 552 541 531 551 570 577 584 540 496 514 533 521 509 499
2827 499 488 480 471 472 502 547 540 503 496 519 542 566 589 592 545 479 443 478 513 528 543 589 634 620 606 592 578 542 505 468 432 418 404 420 436 427 418 409 451
2822 451 501 521 491 460 453 446 490 534 547 560 543 526 500 474 498 523 496 470 474 478 466 454 493 562 600 588 576 564 544 524 514 534 558 531 485 470 459
2817 459 418 379 370 399 428 456 484 516 499 439 379 394 408 393 377 375 372 417 462 510 508 466 424 431 488 529 498 442 416 419 421 424 427 461 494 499 505 480 455 466
2813 466 477 515 553 544 485 437 420 422 423 427 431 424 417 379 342 366 390 414 439 452 465 427 389 409 429 449 469 454 440 426 412 438 464 444 423 416 459 503 496
2808 496 465 434 471 508 526 544 511 479 471 463 455 447 434 422 440 457 479 501 493 484 463 442 452 461 483 506 498 490 497 505 512 519 516 512 509 506 521 536 520 475 454 483 550
2803 550 616 655 642 611 610 632 653 628 603 616 659 683 657 636 614 620 626 615 603 592 581 580 578 607 636 653 669 655 641 653 665 677 689 741 792 773 724
2798 724 689 704 719 683 638 623 638 653 659 666 703 740 733 726 720 713 708 702 667 631 613 594 575 557 581 605 630 654 674 695 715 736 718 701 683 666 691 717 742
2793 742 768 746 724 703 681 717 753 718 683 694 705 716 727 742 758 803 849 842 836 799 762 757 753 750 747 779 841 858 805 777 801 839 847 833 819 805 791 789 818
2788 818 861 852 801 781 807 804 768 732 745 758 757 757 787 816 823 829 785 741 727 713 699 685 661 636 683 729 725 720 716 711 719 728 736 744 673 603 603 603 637 670 704 738 702
2783 702 665 629 593 595 596 598 600 614 627 641 655 658 661 664 667 627 587 577 567 591 616 640 664 688 712 705 699 719 739 728 718 720 723 725 727 691 655 730 805 790 774 728
2778 728 682 660 638 615 593 614 635 656 677 647 617 587 557 558 558 590 621 595 570 544 519 492 465 488 512 538 565 501 436 429 421 464 506 507 508 510 511 525 539
2773 539 552 566 566 565 565 564 543 522 470 419 398 377 426 476 485 494 503 511 520 528 506 484 449 415 471 528 518 509 500 490 496 501 506 511 478 444 460 507 518 469 404 401 414
2768 414 397 384 402 457 512 499 485 479 472 451 429 414 400 415 431 452 473 444 415 385 355 376 396 448 500 502 503 456 408 357 366 388 410 406 401 426 450 424
2763 424 398 355 312 320 328 352 376 370 364 350 335 372 408 433 459 480 502 502 441 368 326 346 396 448 470 445 420 424 428 423 418 443 468 470 471 472 474 460 447 419 390
2758 390 414 438 412 386 399 413 396 379 403 426 465 503 518 533 497 461 410 358 397 436 459 482 475 468 453 438 416 454 488 461 402 342 328 314 285 256
2754 256 288 320 337 354 356 359 376 394 404 415 411 407 444 482 520 558 527 495 463 431 464 496 478 460 459 459 427 396 409 422 420 418 433 449 449 450 438 427 415 403
2749 403 416 428 410 392 354 316 309 302 290 278 316 355 397 440 432 424 418 412 437 461 423 385 362 340 314 288 247 207 266 326 356 385 385 384 398 413 445 477 494
2744 494 511 527 543 509 474 443 411 410 409 379 350 321 292 293 293 324 355 343 331 348 366 379 392 435 478 515 551 497 442 414 386 409 431 428 425 452 480 474
2740 474 469 514 559 546 533 470 407 442 477 497 517 520 522 525 527 501 475 418 362 378 395 462 529 568 607 596 584 589 594 548 502 494 486 477 469 452 435 489 543 554
2735 554 565 576 587 544 501 528 556 572 588 554 519 504 489 474 458 483 508 562 617 572 527 512 498 553 608 633 658 630 602 573 545 530 516 532 548
2731 548 558 569 579 590 578 565 553 541 564 587 580 573 560 547 534 522 536 550 564 578 575 571 567 564 574 584 594 604 611 617 593 569 561 553 575 597 568 538 559 580
2726 580 641 703 694 685 683 681 649 616 610 604 597 591 605 619 633 647 628 609 661 713 725 737 749 761 736 710 684 658 645 632 618 605 599 593 588 582 625 669 641 614 624
2721 624 633 595 557 535 564 585 575 562 600 637 624 581 569 587 605 578 551 555 558 604 650 645 640 624 607 590 574 549 524 570 615 613 611 640 668 637 605 605 604
2716 604 613 622 661 731 782 783 743 703 688 673 657 642 634 626 619 611 577 542 546 600 676 681 618 555 559 564 568 573 590 606 592 579 569 560 581 602 601 599 598 597 626 655 634 613
2710 613 652 692 732 772 745 717 690 663 644 625 636 678 701 674 612 580 629 709 750 742 702 662 669 676 706 736 716 695 673 651 680 708 758 807 786 764
2706 764 757 749 741 734 739 744 718 693 685 677 670 662 680 698 716 734 745 756 768 779 754 729 705 680 692 705 671 637 634 692 775 756 687 649 678 707 724 742 759 777
2701 777 765 754 742 731 727 723 719 715 705 694 684 674 673 672 722 771 789 806 823 841 782 723 714 705 681 657 664 670 707 744 751 758 792 826 858 890 830 740 699 719 763
2696 763 746 700 684 704 724 747 769 760 750 750 781 799 757 713 730 800 809 729 648 625 662 682 672 663 655 645 634 649 663 678 692 710 728 700 671 678 747 768
2692 768 729 672 676 730 754 766 778 819 860 846 833 820 806 781 756 781 806 794 781 799 817 796 774 752 730 739 748 787 826 845 865 834 803 782 762 771 781
2687 781 802 824 778 733 725 777 831 824 795 796 827 857 826 794 792 791 811 832 853 873 907 940 943 947 898 848 832 876 934 932 859 817 844 870 852 834 859 945 1000
2682 1000 995 1002 1008 1016 964 909 884 909 934 918 901 885 868 884 899 941 983 1000 957 884 871 927 983 972 961 940 920 899 878 903 928 953 979 958 938 948
2678 948 958 1018 1077 1084 1029 967 965 976 987 986 985 984 983 960 937 965 992 995 998 1048 1098 1123 1097 1041 1036 1062 1087 1057 976 895 864 901 988 1083 1127 1111 1065 1022 1029 1077
2673 1077 1155 1221 1236 1211 1187 1159 1132 1104 1077 1102 1127 1124 1120 1138 1186 1197 1159 1119 1129 1178 1196 1191 1217 1271 1295 1287 1280 1301 1322 1325 1329 1348 1367 1376 1384 1377 1370 1388 1405 1422
2668 1422 1439 1438 1438 1468 1497 1511 1525 1554 1582 1598 1613 1659 1704 1692 1680 1684 1687 1706 1725 1744 1764 1841 1918 1964 2011 2012 2014 2046 2078 2105 2133 2191 2249 2328 2407 2471 2535
2664 2535 2587 2640 2707 2774 2842 2910 2963 3016 3086 3156 3275 3393 3469 3515 3598 3731 3869 3977 4073 4199 4362 4526 4691 4856 5028 5199 5386 5573
2660 5573 5747 5922 6147 6372 6657 6942 7278 7613 7918 8224 8559 8895 9294 9693 10149 10666 11142 11617 12078 12599 13170 13742 14313
2657 14313 14945 15639 16334 17062 17791 18590 19390 20219 21049 21924 22799 23618 24376 25063 25750 26393 26975 27477 27918 28289 28559 28708 28757
2654 28757 28732 28647 28463 28178 27808 27378 26913 26449 25903 25297 24702 24107 23539 22971 22371 21771 21201 20631 20116 19600 19115 18630 18209
2652 18209 17788 17421 17055 16737 16480 16263 16046 15892 15799 15753 15767 15813 15921 16068 16216 16418 16620 16892 17165 17501 17838 18211 18644 19093
2649 19093 19542 20010 20479 21024 21570 22115 22661 23230 23799 24312 24764 25205 25647 26031 26313 26545 26777 26947 26976 26876 26715 26560 26303
2646 26303 25915 25426 24891 24355 23759 23062 22290 21519 20729 19939 19179 18420 17694 16969 16246 15522 14835 14177 13547 12968 12413 11889 11405
2643 11405 10950 10516 10081 9649 9216 8842 8468 8124 7781 7499 7216 6934 6652 6381 6111 5827 5573 5387 5251 5090 4878 4653 4479
2640 4479 4347 4246 4131 4017 3875 3732 3584 3435 3358 3280 3214 3148 3081 3015 2957 2898 2840 2781 2754 2727 2613 2498 2433 2420 2378 2287 2212 2187 2178 2139
2637 2139 2063 1987 1961 1934 1931 1929 1876 1823 1794 1765 1736 1707 1662 1618 1644 1671 1673 1675 1677 1679 1636 1592 1579 1566 1529 1492 1455 1418 1451 1484 1467 1449 1449 1448 1417 1355 1297 1289 1301
2632 1301 1314 1322 1331 1340 1348 1338 1328 1317 1307 1240 1173 1197 1221 1205 1189 1203 1217 1191 1166 1141 1116 1125 1135 1171 1207 1184 1101 1045 1051 1090 1098 1077 1056 1088 1120 1121 1122 1122 1121 1121
2627 1121 1120 1098 1076 1084 1092 1080 1068 1026 985 1003 1021 1009 997 999 1001 1033 1065 1075 1084 1064 1043 1069 1095 1107 1058 992 956 950 944 941 938 934 931 914 897 948 998 1016 974 949
2622 949 955 957 960 965 969 964 959 954 950 914 879 894 909 935 961 917 873 878 883 889 894 903 911 920 928 912 896 880 864 869 874 909 944 904 865 825 786 791 795 800 805 773 742 777 813 812 750
2616 750 686 683 719 724 720 716 750 784 787 791 781 772 732 692 664 636 658 680 672 665 667 699 731 702 622 572 606 641 647 653 667 682 696 710 736 762 720 679 682 737 793
2611 793 849 853 858 832 806 803 800 749 699 704 760 787 764 722 710 707 705 682 659 666 673 675 676 678 679 685 690 726 761 755 749 773 798 804 811 797 814 832 799 738 728 763 798 765
2606 765 733 755 777 771 765 751 768 798 777 726 705 735 765 777 790 774 758 793 857 894 861 797 734 737 739 716 693 670 647 607 566 566 617 701 756 756 727 697
2601 697 668 687 706 714 721 729 737 733 729 725 721 709 698 656 614 627 639 621 603 630 657 654 651 658 665 673 680 714 747 731 714 718 723 727 732 699 666 654 611 550 539 589 638 662
2596 662 685 678 671 696 721 726 680 621 592 575 558 573 618 658 627 567 538 557 577 586 596 606 615 614 613 642 671 648 624 611 629 636 594 534 504 485 467 422 378
2591 378 392 457 508 529 508 456 403 380 389 398 440 511 591 620 588 557 540 524 507 491 483 475 497 519 495 470 474 478 492 475 445 466 515 533 502 470 479 489
2586 489 499 509 543 578 583 588 552 516 479 443 448 453 458 463 461 459 457 455 468 480 493 505 464 423 412 401 436 471 476 481 442 402 393 414 454 444 393 342 355 368 355
2581 355 342 353 425 528 570 532 493 436 379 403 426 449 473 483 493 533 573 567 561 566 571 603 574 528 483 495 507 504 501 549 598 609 560 550 539 555 570
2577 570 579 587 595 603 579 554 560 565 571 577 583 589 564 538 528 518 507 495 453 412 428 445 447 448 484 519 539 560 555 550 545 540 523 505 488 470 468 466 465 463 491 520 518 516 489 461
2571 461 464 466 499 532 549 505 457 409 408 406 388 370 403 435 447 458 470 482 522 562 586 549 515 481 493 505 528 551 589 627 592 557 552 547 566 586 555 524
2567 524 483 442 452 462 451 440 443 447 484 520 506 492 482 472 492 512 507 501 526 551 548 546 528 510 506 501 497 493 468 444 470 497 499 502 489 477 448 419 390 361 367
2562 367 374 396 417 430 444 407 369 331 293 326 358 393 427 411 395 358 322 336 350 394 438 452 465 411 356 352 348 361 374 356 339 350 360 371 381 378 376
2557 376 373 371 371 371 371 371 372 373 358 344 361 379 346 313 347 381 400 419 425 430 421 412 352 291 246 201 225 249 258 267 283 298 343 389 338 287 287 287 281 275 320 365 355 345
2552 345 320 295 312 329 345 362 368 374 381 387 391 394 368 341 352 363 328 292 286 341 378 385 340 295 278 261 260 258 222 247 311 376 374 342 336 390 442 434 397 360 370
2547 370 380 411 441 421 371 338 365 373 351 315 280 242 204 200 195 241 286 299 312 295 277 229 180 222 294 340 325 295 266 242 219 267 314 366 417 418 418
2542 418 419 420 421 421 421 421 420 420 382 344 306 268 274 281 288 295 301 307 313 320 302 285 315 344 346 288 247 236 269 303 307 312 317 322 357 392 368 344 322 300 343 417 460 441 394
2537 394 377 389 402 364 326 339 351 348 345 339 334 334 304 303 363 406 388 341 324 312 300 290 280 308 336 334 332 327 322 317 312 342 372 372 372 374 376 379 381 389 397 376 356 378 431
2531 431 452 413 367 351 405 459 480 501 471 441 410 379 399 418 410 403 365 327 327 328 329 329 359 390 389 389 372 355 365 376 343 278 228 237 271 305 312 319 304 289
2526 289 274 259 281 302 275 248 282 346 377 346 271 195 189 243 290 276 249 223 241 258 306 355 379 404 358 312 318 324 330 336 297 257 247 237 285 332 350
2522 350 367 337 307 277 246 228 210 222 234 238 241 276 310 318 327 305 283 304 326 296 267 235 204 223 242 292 341 341 340 336 332 343 355 354 354 353 353 340 326 313 300
2517 300 314 328 357 386 394 402 379 356 384 411 387 364 323 283 293 304 346 388 359 331 323 316 323 331 338 345 381 417 388 329 288 299 332 365 350 336 300 263 257
2512 257 251 287 323 328 333 355 377 348 319 329 339 319 299 334 368 364 309 275 293 326 329 291 253 263 273 332 391 420 448 431 414 396 379 344 310 305 301 296 291
2507 291 316 341 355 370 384 398 421 444 416 388 398 408 418 428 421 413 359 304 275 297 337 347 328 308 316 325 348 371 364 357 362 367 372 377 361 345 400 455 426 398
2502 398 382 427 496 505 445 384 361 398 420 381 323 265 294 323 331 339 347 355 379 403 360 317 261 265 286 307 265 223 211 200 196 193 205 216 249 282 285 287 326 365
2497 365 373 382 360 337 345 354 330 307 272 237 237 297 353 410 439 468 447 426 395 363 351 338 294 310 384 457 440 423 407 390 340 290 276 323 338 353 341
2493 341 330 307 285 292 300 304 308 282 256 293 330 370 351 322 293 275 258 251 244 288 332 352 372 403 434 389 284 250 276 304 332 333 334 322 309 309 370 407 384
2488 384 328 271 263 256 248 240 282 324 316 307 356 405 423 441 419 396 373 351 346 340 305 270 276 282 289 295 275 256 267 277 287 296 306 315 296 276 307 339 331 322 314 306 323 340
2483 340 383 427 427 377 326 327 347 368 391 415 410 405 369 333 316 298 280 312 350 338 291 273 317 360 337 314 324 365 370 325 303 331 375 389 408 428 445
2478 445 463 439 415 363 312 265 269 312 324 300 277 301 326 345 364 383 402 417 433 397 362 355 349 342 335 326 317 308 300 313 327 370 412 389 336 302 319 344 370
2474 370 368 366 298 230 204 228 294 360 378 396 359 321 334 377 418 407 359 342 374 407 411 415 415 416 417 418 425 433 370 307 322 336 351 365 372 378 385 391 430 468 427 336
2468 336 254 223 251 279 309 338 368 397 394 391 358 325 321 317 314 310 324 338 353 367 343 320 326 333 315 298 310 323 338 352 336 321 330 339 348 357 364 372 379 386 352 317 282
2463 282 247 278 308 338 369 386 404 452 500 478 456 434 412 420 428 436 444 434 425 385 345 341 338 304 270 252 234 247 259 260 261 262 263 288 314 309 304 327 349 341 333 316
2458 316 298 283 267 274 312 332 302 260 249 288 328 368 409 420 431 393 355 317 279 266 252 289 327 349 372 364 357 402 447 442 437 415 394 372 350 356 362 368 374
2453 374 338 302 317 331 337 342 332 322 346 370 410 449 434 419 373 327 331 334 337 341 312 284 306 328 348 368 373 378 387 396 405 415 417 420 392 364 382 400 417 435 403
2448 403 371 339 307 304 301 298 296 315 334 353 372 360 349 323 296 314 331 318 305 288 270 343 416 440 464 472 481 469 457 430 403 421 439 457 476 476 477 477 478 464
2443 464 450 436 422 434 446 427 409 388 368 362 357 387 418 397 377 401 424 420 417 411 457 519 531 498 495 542 590 597 605 582 559 534 510 485 460 435 410 456 502
2439 502 526 550 544 538 516 495 489 482 436 391 367 394 449 505 564 623 624 625 576 527 479 431 454 476 460 443 457 471 506 541 545 550 519 488 472 456 458 459 491 523
2434 523 496 469 452 466 466 416 355 364 425 455 437 418 446 475 472 470 480 489 514 539 522 506 490 474 463 452 457 462 510 559 536 514 487 460 463 466 477 488 484 480
2429 480 465 450 484 517 490 432 412 442 470 467 434 401 417 433 449 466 480 495 510 525 509 494 509 523 513 503 520 537 518 438 389 400 422 444 439 434
2424 434 461 488 485 482 468 454 440 427 401 376 380 385 416 446 447 447 439 432 475 518 518 518 518 518 529 540 551 562 578 594 579 565 574 584 522 461 439 417 396 374 382 390
2419 390 428 466 454 443 431 419 409 400 390 380 380 380 349 319 337 355 373 391 431 471 440 410 381 352 353 354 403 451 463 415 391 366 338 310 297 285 322
2415 322 360 377 394 411 428 457 485 427 368 367 426 486 484 473 462 481 439 381 322 331 339 329 319 339 359 375 392 408 425 397 369 392 415 415 415 415 415 435 454
2410 454 387 319 275 290 323 355 373 392 380 368 325 283 292 302 339 406 460 453 396 340 330 321 303 286 302 378 458 477 462 446 405 334 275 278 311 345 352
2405 352 359 391 422 384 346 355 394 422 389 342 325 337 350 356 363 370 376 328 280 282 284 324 364 374 384 358 331 305 279 336 393 433 413 386 358 357 356 335 315 294
2401 294 273 285 298 331 333 332 391 450 448 393 368 413 458 412 366 370 404 393 322 281 300 361 391 412 433 411 389 367 345 340 335 300 264 237 209 181 154 206
2396 206 259 281 304 262 220 228 237 253 270 284 299 326 323 328 394 457 449 373 297 310 323 306 288 300 312 309 306 312 317 338 359 400 442 453 464 419 375 381 388 393 398
2391 398 373 348 332 316 285 254 261 267 243 220 238 256 274 292 305 318 300 283 248 213 229 245 278 311 314 317 342 367 392 417 395 373 320 268 254 240 276
2386 276 313 331 349 316 283 288 292 297 302 270 239 237 236 278 320 312 304 311 319 311 303 305 306 338 370 379 389 368 347 315 283 302 320 339 359 348 337 331 325 289 223 170 186
2381 186 252 318 341 363 355 347 330 313 326 340 330 321 311 301 287 272 257 243 249 255 261 268 287 307 296 285 320 355 339 323 314 304 295 286 254 223 192 161 205 248
2376 248 310 312 294 277 286 295 283 271 310 348 335 321 307 293 272 251 226 261 307 354 353 353 390 428 395 362 372 382 422 462 469 476 412 349 317 285 284 283 274 265
2371 265 256 247 270 293 316 338 324 310 326 342 333 325 286 247 265 284 272 260 224 188 239 290 351 351 366 381 407 372 322 333 407 480 464 388 322 318 326 334 320
2367 320 305 290 275 331 388 394 400 396 392 341 290 279 328 378 367 345 324 369 415 444 474 450 366 309 312 348 384 377 371 379 388 403 419 434 450 406 362 349 336
2362 336 354 373 391 409 397 384 372 359 373 388 402 416 410 403 397 390 372 353 365 377 374 371 342 313 281 309 354 399 370 340 311 281 294 306 318 330 338 346 324
2357 324 302 301 300 329 358 322 287 322 358 376 394 381 369 347 325 304 282 281 280 309 339 353 368 353 337 298 258 269 280 304 327 351 374 378 382 386 390 388 386 354
2352 354 322 324 325 327 328 320 312 305 297 301 305 309 314 299 284 300 315 347 378 379 380 336 292 339 386 394 403 411 420 399 379 385 391 386 320 255 250 287 324 315 305 333 361 359 327 307 349
2346 349 374 368 345 353 391 429 396 333 284 295 325 355 354 293 216 170 196 283 331 318 341 364 358 322 295 329 381 371 329 287 230 173 127 183 292 370
2342 370 361 352 407 462 464 406 353 361 367 313 254 225 246 297 338 318 287 256 239 283 339 396 411 365 323 281 278 276 303 331 338 345 302 259 284 309 334 359 348
2337 348 338 327 316 356 395 404 413 400 386 373 360 371 382 392 403 361 320 328 337 303 268 234 200 228 256 254 253 239 226 263 300 333 365 397 429 461 493 455
2333 455 416 421 426 431 436 442 448 407 367 337 367 398 368 348 328 304 280 269 257 297 336 324 312 330 348 320 292 294 297 269 241 225 271 319 308 283 259 259 259 260
2328 260 260 318 375 382 389 382 374 397 420 425 430 384 338 333 327 321 315 302 289 306 324 304 284 295 305 325 345 315 284 292 299 307 314 294 273 253 232 268 304 339 375 329
2323 329 282 282 282 277 211 146 141 185 228 246 263 282 301 289 277 284 290 296 303 315 327 309 290 311 331 322 312 300 288 277 265 217 168 177 246 284 322 294 265 254
2318 254 243 263 282 296 310 324 338 325 313 270 227 238 248 211 174 178 232 287 291 282 273 265 256 247 289 350 380 340 301 290 278 255 233 240 248 282 316 320 323 291
2313 291 258 255 253 227 202 227 252 266 279 322 366 345 325 305 284 287 289 260 232 229 225 250 275 262 219 194 220 247 274 304 334 354 374 363 353 374 395 414
2308 414 434 407 350 310 320 366 381 346 311 319 326 304 281 248 215 182 149 174 199 223 248 267 286 305 324 339 354 338 322 325 328 280 232 191 150 200 250
2304 250 295 340 354 369 413 457 410 364 348 333 386 438 490 491 429 368 355 343 330 317 302 286 271 255 211 166 192 218 260 303 314 326 354 382 379 376
2299 376 357 338 319 300 256 213 219 226 262 299 304 310 309 307 305 303 310 316 322 328 264 199 185 272 401 470 468 465 462 459 388 318 270 283 292 300 274 248 225 202 196 250 305 298
2294 298 268 237 273 309 332 356 380 404 421 439 456 473 426 378 360 343 316 289 262 235 305 376 446 516 481 446 411 376 339 302 277 313 334 295 259
2289 259 283 318 353 340 328 322 317 311 305 369 434 462 429 377 324 305 346 393 441 421 402 403 403 374 344 341 338 366 393 394 395 396 396 396 396 396 396 405 415 424 433 390 348 335
2284 335 322 275 228 231 234 253 272 260 248 265 281 297 313 315 318 320 322 321 319 288 256 261 267 303 338 334 330 296 262 268 274 280 286 275 263 252 240 256 271 317 362 363 364 365
2279 365 365 384 403 421 440 434 428 422 416 412 408 374 340 385 429 422 416 394 372 350 328 355 381 395 349 302 316 363 409 378 346 362 377 397 357 304 251 238 286
2274 286 329 373 388 404 415 427 407 326 245 225 280 336 378 360 329 298 294 290 288 286 284 282 221 160 190 221 231 241 221 201 192 183 191 259 329 400 403 406 426 447
2269 447 437 427 389 352 280 269 292 314 290 266 313 360 376 393 386 378 371 363 367 371 375 378 360 342 323 305 329 353 310 267 269 331 394 396 395 395 391 387 364 341 368 396
2264 396 399 403 359 316 275 295 372 449 456 463 440 416 375 334 310 346 393 440 440 441 432 423 383 344 332 321 309 298 321 344 337 329 291 252 243 235 252 270 287 305 325
2259 325 344 314 283 278 273 299 324 315 307 328 349 340 330 290 250 288 326 364 401 372 343 313 284 322 359 367 374 381 388 394 401 389 378 366 354 407 459 516 512 495 478
2254 478 427 376 341 306 301 297 298 300 302 304 345 386 407 377 321 295 320 345 319 294 271 249 224 249 296 344 338 332 327 321 357 392 428 464 443 422 370 319 299 280
2249 280 331 383 397 412 397 381 398 416 394 321 258 245 271 297 328 358 358 359 346 333 352 371 362 383 417 400 351 332 364 395 367 340 362 415 429 392
2245 392 368 374 386 397 411 425 417 410 403 396 360 324 290 306 352 398 417 436 435 433 432 430 409 388 367 346 317 289 261 232 252 271 291 311 325 339 353 368 391
2240 391 415 408 402 370 338 309 280 291 353 414 425 395 364 331 297 271 245 270 294 302 311 289 267 258 250 292 334 316 297 263 229 226 222 289 356 355 353 352 350 339 328
2235 328 332 336 331 327 295 262 273 315 354 343 302 291 329 367 361 325 326 377 408 410 416 422 416 410 399 418 437 406 355 304 310 316 322 328 357 387 386 386 384 383 411 440 448 455 448 440
2229 440 426 412 428 444 434 425 415 406 423 440 457 474 441 409 406 404 407 411 399 388 400 413 453 493 498 453 386 319 319 319 319 320 306 293 310 327 360 393 411 429
2224 429 394 360 374 387 354 291 265 290 327 335 330 326 304 252 219 237 304 371 350 329 288 247 277 307 314 321 329 336 345 353 362 371 414 457 410 362 349 337 339 342 342 343
2219 343 375 406 445 483 472 460 456 452 433 414 419 423 457 492 502 512 452 391 375 359 313 237 199 222 296 341 359 378 394 411 357 303 286 330 364 399 418
2215 418 438 443 388 332 338 401 465 459 392 365 398 415 373 325 337 383 428 412 395 411 488 553 558 510 431 369 367 350 302 253 263 326 358 314 271 276 281 287 293
2210 293 331 431 518 545 518 460 376 322 340 387 396 344 293 301 318 305 276 309 373 407 392 376 361 346 316 286 308 330 383 435 470 506 491 476 448
2206 448 421 393 365 364 362 360 358 354 350 346 343 381 420 462 444 416 387 355 323 323 324 355 385 432 479 489 438 381 323 333 343 358 373 389 404 389 374 389 405 384
2201 384 362 341 320 327 334 392 449 502 556 538 521 438 356 269 243 305 366 401 436 427 418 435 453 433 352 272 252 290 328 320 311 391 471 494 456 438 421 399
2196 399 377 367 358 348 338 346 354 362 370 375 379 383 388 361 335 308 282 310 338 319 300 267 296 340 385 365 346 327 308 334 361 372 321 281 241 268 295 307 320
2191 320 332 345 329 313 297 281 279 278 276 274 294 315 383 450 457 404 337 301 302 304 307 311 345 379 342 305 303 302 331 359 362 365 367 370 385 400 416 431 425 419 387 355 325
2186 325 356 389 361 302 273 314 356 335 315 292 270 271 241 195 209 267 325 390 395 352 308 311 315 329 343 306 269 309 348 387 426 427 427 427 427 414 402 420 437
2181 437 458 479 450 420 389 359 399 439 483 528 501 475 447 418 390 361 338 316 343 371 427 483 468 454 429 404 410 415 423 432 411 359 300 300 353 405 409 353
2177 353 326 359 377 364 342 320 317 314 311 308 331 355 327 300 314 327 341 354 393 432 422 412 389 397 419 390 335 331 365 400 361 322 313 305 342 378 385 391 363 335
2172 335 357 379 423 467 440 413 363 314 335 356 368 379 371 393 413 382 352 372 405 408 383 389 417 445 405 364 334 303 303 303 342 381 367 354 330 275 211
2167 211 198 258 349 404 408 411 414 413 413 421 428 406 383 385 387 379 341 314 338 361 334 290 275 291 307 333 358 354 349 363 377 361 315 310 355 398 391 374 358 338 318 330
2162 330 341 352 364 346 327 339 352 364 377 390 403 348 293 309 325 360 394 398 403 385 368 351 334 340 346 352 358 350 342 303 265 268 271 304 337 341 346 381 416 428 440
2157 440 453 465 425 385 379 434 487 510 482 423 370 348 357 396 455 453 399 346 360 434 508 522 518 515 506 497 455 383 343 364 395 396 387 378 395 413 400 386 414 441
2152 441 438 435 413 392 420 449 452 455 427 400 367 334 301 268 253 237 252 267 252 237 223 208 241 273 306 339 350 361 371 382 347 312 331 410 503 536 493
2148 493 389 338 348 369 359 330 332 363 365 338 342 395 448 442 405 378 411 420 369 322 335 416 497 506 455 403 381 368 356 372 388 405 421 414 407 370 333 314
2143 314 295 347 399 408 417 395 374 370 367 363 359 366 373 379 386 402 418 404 389 372 355 338 321 331 340 320 269 254 299 373 386 384 381 396 381 332 343 426 509 498 426
2138 426 371 346 346 346 378 410 425 439 454 468 445 422 450 478 450 421 393 364 376 389 401 413 397 382 366 351 374 398 422 445 419 393 367 341 319 298
2134 298 327 356 354 353 352 351 374 397 390 384 365 347 379 441 486 471 424 408 428 448 420 391 396 400 405 409 430 450 399 349 319 290 292 295 347 430 497 504 481 428 400
2129 400 401 413 394 343 292 297 302 337 372 387 401 385 369 373 377 380 384 376 369 361 353 367 380 364 347 315 283 301 320 305 290 276 261 280 298 270 242 198 215 285
2124 285 355 356 297 284 331 367 343 322 362 442 522 495 468 452 437 421 405 395 385 426 466 441 416 361 305 307 309 311 313 298 284 302 381 443 445 393 342 343
2119 343 344 345 345 350 355 359 364 395 425 405 386 330 274 269 264 295 327 308 289 306 322 369 416 399 383 336 289 298 307 317 326 283 239 263 287 315 282 248 276 323 370
2114 370 390 410 422 433 414 396 400 404 408 412 376 339 275 212 214 277 337 396 397 398 399 400 398 396 394 392 382 373 363 353 359 365 370 376 378 379 351 322 315 308 331 353 348 342 337 331 307 283
2108 283 309 336 349 362 345 327 309 291 303 316 299 282 278 334 381 367 340 314 339 364 339 314 272 230 239 248 278 309 309 309 357 405 457 448 373 297 288 280 291
2103 291 303 345 387 382 377 342 307 333 359 412 464 471 417 367 316 326 336 346 356 349 343 336 329 353 377 370 363 362 361 390 419 383 346 340 334 324 314 270 286 300 315
2098 315 332 350 363 376 318 260 257 254 302 350 375 400 354 309 343 377 382 386 358 330 332 334 337 341 344 347 393 439 435 430 390 350 310 270 292 314 336 358 386 414 391
2093 391 369 334 299 266 233 280 358 399 389 395 431 476 470 458 446 431 415 396 376 357 337 305 273 271 299 342 335 288 241 257 273 289 305 324 343 334 325 325
2089 325 354 369 332 279 276 312 348 353 357 352 316 292 318 384 451 449 448 417 385 311 237 255 272 276 280 284 288 325 361 367 373 350 327 334 342 336 330 326 322 373 455 516 526 484
2083 484 411 353 294 235 175 207 269 285 251 230 240 259 279 300 322 335 348 362 375 353 332 343 414 475 476 464 451 473 494 465 436 407 377 347 318
2079 318 303 288 270 312 389 466 456 445 442 439 463 487 492 438 332 288 338 389 393 396 408 419 400 381 413 445 481 456 423 391 385 379 419 460 470 480 471 462 427
2074 427 392 350 370 405 441 407 374 340 306 309 312 314 317 330 343 402 462 499 476 416 356 335 314 294 273 258 242 227 211 197 183 240 296 342 387 401 416
2070 416 398 380 332 283 328 373 402 370 364 358 378 399 388 376 365 354 320 286 283 279 301 322 344 365 373 381 389 396 399 403 432 462 476 430 387 344 341 339 306 273 278
2065 278 283 288 293 326 360 393 427 443 459 387 315 271 277 326 375 434 493 462 430 378 326 305 283 294 304 315 325 321 318 344 371 361 352 373 394 397 399 372 345
2060 345 315 286 257 227 226 225 254 284 322 361 349 337 337 336 306 275 293 311 329 347 367 387 387 338 309 330 386 412 388 334 268 253 298 372 413 403 381
2055 381 389 397 375 334 344 374 404 400 395 391 386 377 368 408 448 417 356 334 362 368 374 383 391 375 358 342 325 323 321 319 316 342 367 341 316 325 333 342 351 369 388 376 364 376 388
2050 388 400 412 382 351 371 391 372 353 334 314 314 314 344 374 402 429 385 341 360 379 429 478 424 371 317 264 263 262 291 321 353 385 417 449 409 370 361
2045 361 352 369 385 401 417 466 515 473 431 424 418 411 404 430 456 431 407 393 379 395 411 447 482 446 411 380 350 350 350 362 375 438 501 500 498 447 395 403 412 451
2041 451 490 468 446 424 402 445 488 480 472 487 502 487 472 476 480 484 487 457 426 426 425 441 457 504 550 562 574 585 597 610 623 606 588 575 561 578 594 614 634
2036 634 654 673 688 702 746 790 832 873 864 855 836 817 799 780 733 686 689 692 690 688 655 622 593 565 526 458 414 432 500 568 563 496 447 428 424 419 417 414 403 392
2031 392 411 430 452 475 428 350 288 287 320 353 373 392 412 431 446 461 476 491 470 449 398 347 360 374 387 400 398 397 385 344 289 295 336 377 347 317 318
2026 318 318 348 379 436 493 494 435 362 320 317 313 313 313 327 370 431 431 398 365 378 392 344 297 322 409 446 423 407 392 401 410 419 428 397 366 370 434 464 464 481 498
2021 498 496 432 369 366 377 387 402 416 434 451 438 425 439 452 416 380 318 287 331 437 508 520 478 436 402 368 350 393 444 496 500 505 491 477 463 449
2017 449 414 379 374 369 396 422 434 445 438 430 449 467 446 365 283 262 310 358 359 360 393 425 427 430 427 424 452 479 489 498 477 457 453 449 429 410 405 399 424 449 435 420
2012 420 436 452 466 481 424 368 342 316 305 293 338 382 375 369 390 412 464 516 511 507 472 437 407 378 378 379 391 404 463 522 560 538 479 420 423 426 428 431 439 448 409
2007 409 370 368 427 471 453 420 387 400 414 445 475 456 436 421 405 390 375 336 297 348 400 436 471 476 481 460 440 419 398 418 439 459 479 464 449 433
2002 433 418 431 444 457 471 512 553 524 494 482 469 507 545 553 561 539 517 497 476 471 466 514 561 578 594 590 586 531 476 411 347 339 392 464 535 502 469 440
1998 440 471 484 496 487 478 500 521 521 520 519 519 519 519 473 426 372 379 402 425 412 398 381 424 469 513 511 509 493 476 490 503 533 562 587 612 621 569 486 464 544 623
1993 623 650 616 609 602 592 581 559 536 544 552 614 676 701 665 658 650 670 689 686 683 711 738 728 718 692 667 689 711 682 654 632 610 603 597 633 670 676 683 705 727 749
1988 749 771 738 705 723 741 757 773 761 749 769 819 861 833 771 709 693 677 689 701 743 786 791 796 831 866 838 809 781 752 730 707 724 791 833 823 795
1983 795 767 790 813 806 798 813 827 888 950 979 957 917 907 897 887 879 871 863 856 849 841 890 939 987 1036 1037 1037 1007 977 1009 1041 1072 1104 1072 1040 1038 1036 1070 1104 1138 1172
1978 1172 1185 1197 1210 1223 1260 1297 1334 1371 1359 1346 1363 1381 1439 1497 1554 1612 1589 1566 1583 1651 1718 1754 1792 1861 1952 2013 2023 2032 2097 2162 2227 2291 2363 2435 2507
1974 2507 2579 2634 2689 2775 2860 2968 3076 3184 3292 3393 3494 3624 3755 3913 4070 4227 4384 4593 4802 5015 5228 5469 5771 6149 6528
1971 6528 6909 7290 7644 8058 8545 9133 9789 10506 11252 12060 12996 14073 15286 16599 18047 19717 21627 23759 26088 28680
1969 28680 31588 34840 38357 42136 46187 50461 54905 59410 63941 68472 72799 76864 80595 83982 86934 89300 91025
1966 91025 92083 92507 92264 91330 89689 87406 84537 81153 77385 73301 68955 64424 59792 55186 50680 46352 42205 38327
1964 38327 34791 31611 28774 26208 23904 21814 19947 18292 16819 15496 14315 13248 12281 11389 10599 9900 9261 8652 8104
1962 8104 7637 7170 6756 6341 6004 5727 5432 5136 4861 4646 4429 4211 3994 3837 3709 3582 3428 3273 3184 3095 3036 2978 2900 2823 2700
1959 2700 2576 2492 2469 2412 2354 2266 2178 2120 2062 1985 1908 1882 1855 1798 1741 1714 1687 1662 1637 1612 1587 1553 1518 1514 1510 1498 1486 1443 1401 1387 1372 1358 1344 1328 1312
1955 1312 1248 1185 1211 1298 1334 1310 1251 1192 1160 1128 1099 1070 1044 1019 957 956 1009 1061 1016 911 834 857 894 931 923 916 937 958 908 858 861 863 866 868 892 917 854
1950 854 791 769 808 863 918 914 909 875 840 788 736 715 694 684 673 730 787 834 821 791 761 731 701 641 581 578 576 604 632 622 612 599 646 689 733 689 645
1946 645 620 595 569 544 550 556 531 507 510 513 516 520 494 468 493 518 491 464 503 543 591 579 570 562 606 650 663 677 650 623 596 569 571 574 546 519 560 602 596 591 582
1941 582 634 685 676 627 579 526 473 488 504 519 534 598 662 671 620 552 515 528 540 565 590 584 579 539 499 509 519 534 548 562 577 579 581 614 646 597 548 528
1936 528 509 514 519 554 589 614 638 632 626 594 562 561 559 587 614 640 666 640 584 537 551 591 570 517 463 477 491 477 463 462 491 538 524 497 471 441 411 422
1931 422 434 475 516 516 516 516 515 498 481 434 387 411 435 429 393 378 424 467 450 430 410 417 423 403 383 394 404 357 309 312 315 345 374 374 373 344 316 317 319 345 370
1926 370 426 482 495 507 517 528 488 418 398 438 477 455 423 422 438 454 441 429 395 361 357 354 345 337 342 407 484 501 464 428 414 401 388 375 407 439 421 403
1922 403 384 365 347 328 321 315 303 351 433 485 446 347 326 406 489 512 528 543 561 518 459 430 451 472 463 454 445 436 438 439 440 441 459 476 463 450 396 342 320 298
1917 298 330 391 423 395 327 321 347 373 377 381 416 450 442 434 474 513 528 483 457 431 447 464 527 591 585 520 452 445 452 429 378 387 453 520 540 560 557 554 554 553 561 599
1912 599 624 588 488 387 377 427 501 515 495 476 475 474 473 472 477 482 517 552 519 486 468 449 444 439 434 429 438 446 465 485 507 469 401 393 438 484 483 481 478 475 503 530
1906 530 496 463 429 395 376 358 369 381 409 438 437 435 387 340 325 371 401 370 312 315 363 411 412 413 430 447 450 452 454 456 442 429 421 414 406 399 427 455 453 451 487 523
1901 523 544 565 552 538 527 515 553 621 675 669 599 528 507 547 606 605 555 505 490 535 614 692 742 732 708 714 752 789 798 807 820 833 797 761 755 780 795 749
1897 749 719 750 809 808 780 783 813 844 806 738 701 725 743 730 688 646 641 635 600 565 541 518 545 573 598 623 598 573 564 555 546 537 512 486 461 435 397 360 393
1892 393 426 402 378 384 391 374 357 341 324 345 367 388 409 427 445 432 419 456 494 501 508 438 368 349 329 333 336 390 444 450 456 431 407 395 383 371 359 367 375 383
1887 383 391 402 413 424 435 399 364 379 394 440 487 503 520 509 498 487 476 488 500 512 524 477 431 414 398 393 387 382 376 402 428 454 480 485 490 465 440 423
1882 423 406 390 373 410 448 435 422 402 382 362 342 329 317 335 352 375 397 419 441 394 347 350 353 376 399 422 444 426 407 388 369 372 375 348 320 312 305 347
1878 347 390 448 506 457 408 382 417 452 426 388 350 358 367 355 342 360 378 383 387 345 303 251 261 327 393 444 494 514 533 502 471 440 408 358 308 329 349
1873 349 358 367 375 384 367 350 334 317 357 397 407 417 400 383 397 410 413 416 487 557 584 551 482 412 350 289 298 307 300 292 250 269 296 323 354 385 372 359 345 332
1868 332 338 344 303 262 278 354 400 385 328 272 285 358 408 398 395 392 382 371 361 350 343 335 328 321 329 337 346 354 358 362 336 309 325 340 355 371 396 421 396 370 394 418
1863 418 476 473 438 403 394 386 383 381 379 376 361 347 383 479 556 533 463 392 385 439 458 477 458 438 418 398 374 350 356 362 394 426 458 490 463 437 411 385 414 442
1858 442 471 500 465 431 426 422 435 447 389 331 313 294 306 318 311 303 327 350 400 450 450 450 437 424 411 398 370 342 314 286 285 285 285 285 302 320 338 355 357 359 361
1853 361 363 336 308 311 314 338 361 385 409 429 449 469 490 531 573 542 449 382 376 422 469 440 411 382 354 351 348 375 402 412 422 401 380 371 361 317 334 405
1849 405 476 477 417 349 341 346 351 379 407 435 464 433 402 401 401 409 418 426 434 425 416 376 337 339 341 343 346 357 368 328 289 302 316 329 343 314 285 286 287 268 248 233 218 215
1843 215 273 364 455 484 453 409 394 410 425 440 456 439 392 328 324 361 398 388 378 370 362 384 406 430 455 449 443 458 472 437 372 345 378 440 441 426 411 422
1839 422 434 392 350 339 327 389 451 513 575 552 530 507 485 457 430 469 508 480 390 329 329 330 300 273 275 276 246 201 217 285 353 374 396 413 430 396 362
1834 362 338 314 292 270 302 365 397 368 361 384 394 343 306 330 403 446 451 455 458 460 468 476 484 493 466 439 412 386 384 383 432 481 471 462 453 444 449 454 430 407 419 462 485
1829 485 459 403 348 360 372 388 403 419 434 442 450 410 369 367 394 433 422 374 327 306 286 288 290 293 295 302 308 345 382 365 347 329 311 365 418 472 526 507 488
1824 488 470 451 466 482 430 378 344 360 378 346 316 316 328 340 345 380 427 423 358 293 313 334 312 260 253 316 386 405 366 328 337 346 385 424 408 391 374 357
1819 357 358 359 360 361 392 423 424 425 372 319 316 313 311 309 307 305 305 306 276 246 275 303 332 360 373 387 333 278 299 371 442 463 433 403 369 336 361 386 411 435 421 406
1814 406 391 376 344 313 332 351 401 450 427 343 274 266 348 430 462 434 369 304 290 277 293 310 367 423 444 403 383 363 389 416 408 399 391 383 440 497 558
1810 558 559 485 412 405 399 387 376 338 300 320 401 483 503 453 403 379 355 311 268 221 234 251 267 335 402 468 473 422 370 350 330 361 391 396 401 405 410 474 538
1805 538 531 524 477 430 383 336 388 439 461 483 474 464 428 393 366 399 449 500 478 457 436 415 390 365 391 417 383 349 328 367 413 400 373 347 407 468
1801 468 512 496 446 395 371 347 362 376 391 405 430 455 410 364 371 379 386 394 428 462 457 402 354 356 398 440 455 470 485 500 476 453 429 406 412 419 426 433 459 485
1796 485 480 476 426 377 358 339 374 409 444 479 456 433 410 386 416 446 476 506 479 453 426 400 394 388 382 377 396 416 426 405 406 457 526 564 584 604 572 540
1791 540 491 442 463 485 460 435 410 385 400 416 431 447 480 513 515 518 487 457 457 457 450 442 435 427 427 427 417 377 339 352 402 422 383 343 352 362 366 370 402 435 414
1786 414 362 330 348 370 392 418 443 443 442 442 441 451 461 470 480 502 525 517 509 464 419 389 420 461 472 453 434 400 366 362 358 391 423 426 428 396 364 360 357 342 297
1781 297 264 291 343 364 355 346 373 401 375 288 223 218 228 238 274 342 397 393 347 333 347 362 334 305 306 308 306 304 389 475 504 472 456 470 474 448 424 430 419 408
1776 408 399 390 393 396 369 342 310 279 277 276 271 265 290 344 381 358 336 375 424 473 455 438 400 363 374 385 384 352 330 368 385 340 249 219 262 305 282 229 201
1771 201 233 280 327 321 315 308 302 348 394 389 385 373 362 400 439 434 428 423 418 426 434 442 450 417 383 380 377 331 284 260 287 330 373 417 461 441 390 365 411 490 538 527 467
1766 467 405 393 400 408 389 371 403 435 458 481 454 426 377 329 302 326 344 363 384 406 410 414 418 422 396 370 373 375 363 320 267 263 282 300 322 344 358 372 386
1761 386 400 401 402 403 404 399 395 388 382 372 331 295 329 413 445 420 394 416 438 460 482 515 549 511 474 470 466 462 458 442 426 410 394 429 463 498 532 483 435 386 337
1756 337 329 321 313 304 368 431 444 456 476 495 515 534 498 461 424 388 386 385 383 382 411 440 419 397 359 321 313 305 338 372 405 438 453 468 452 437 386 336 316 296
1751 296 297 299 350 402 440 478 465 453 409 365 352 338 357 376 395 414 378 342 373 403 420 375 335 294 308 322 366 410 432 455 427 399 399 399 386 313 237
1747 237 222 296 370 405 379 357 335 352 368 354 340 364 388 412 436 407 378 436 494 527 499 502 504 524 483 391 360 414 468 474 481 471 460 449 438 427 415
1742 415 403 391 351 311 321 331 351 370 389 409 405 402 399 395 371 347 353 359 394 429 413 398 417 435 454 473 470 466 493 520 523 526 498 470 449 427 406 384 389 395 400
1737 400 405 433 461 489 517 488 458 429 400 385 369 384 399 452 504 526 549 533 517 532 547 560 573 556 538 534 529 553 577 555 503 487 522 555 538 505
1733 505 502 535 567 530 494 455 417 365 363 426 488 474 410 355 351 386 422 438 454 455 456 476 496 488 480 483 516 524 462 387 363 376 390 397 404 411 418 441 463 501 538
1728 538 581 623 615 607 589 571 602 633 583 504 444 434 422 411 403 395 381 367 352 338 361 384 407 430 471 512 462 411 427 442 447 421 428 484 526 517 493 499 519
1723 519 508 485 491 509 527 508 489 470 451 464 477 490 503 493 484 474 464 450 436 422 408 402 396 389 383 384 385 386 387 359 331 370 409 454 438 426 413 449 485 470
1718 470 455 444 433 453 472 469 466 464 461 459 457 428 399 385 432 475 518 479 440 416 392 415 438 430 422 422 422 392 362 364 366 338 310 290 270 250 230 237 243 284 264 236
1713 236 208 247 286 277 268 290 312 378 445 494 484 428 372 362 353 340 327 345 362 330 298 302 367 393 418 448 478 483 489 494 499 503 506 495 483 534 585 586 587 561 535
1708 535 479 422 397 372 335 299 277 316 370 364 320 277 280 283 310 338 380 422 412 401 390 379 381 384 386 388 415 443 439 436 418 401 383 365 331 298 335 372 399
1703 399 426 423 419 437 454 441 428 413 397 381 365 386 406 426 447 445 444 443 442 418 394 370 346 358 371 384 396 372 348 375 401 355 309 313 348 366 334 302
1699 302 320 358 365 363 360 365 370 325 279 261 242 254 266 298 331 363 396 427 458 458 459 430 401 402 404 426 447 439 430 420 409 449 489 501 513 525 537 532 528 523 519 487
1694 487 455 454 483 491 448 405 411 437 412 351 320 321 322 325 328 360 393 354 316 338 360 352 344 363 383 402 421 388 354 322 341 403 464 458 453 473 493 482 472 447
1689 447 421 400 378 375 432 472 482 485 487 457 428 424 420 446 473 473 474 446 418 405 422 430 377 345 374 449 464 412 361 376 421 433 384 311 299 332 426 493 499
1684 499 463 427 437 448 417 386 386 415 422 369 287 266 329 392 408 424 416 408 400 392 389 387 415 443 404 365 377 389 401 412 374 335 323 312 331 350 379 408 386
1679 386 365 352 340 358 375 332 290 261 293 340 357 344 331 350 370 356 282 243 264 336 377 367 357 376 394 390 385 411 436 464 492 489 486 473 459 445 432
1675 432 452 473 493 514 527 540 523 505 433 360 358 356 351 347 343 338 366 394 422 450 434 419 403 387 423 459 465 471 467 464 489 514 496 448 398 409 447 486 478 469 452
1670 452 436 419 402 394 387 379 372 349 326 334 342 363 384 436 487 494 500 476 452 445 437 445 453 457 461 465 470 461 452 492 532 507 452 426 461 479 435 381 387 434 481 440 400 358
1664 358 316 325 333 349 364 410 456 463 470 477 484 478 473 481 489 475 431 396 422 447 410 364 349 348 346 362 378 418 458 494 531 545 499 420 370 382 393 407 420 418 417 415
1659 415 414 440 467 423 379 355 332 323 315 345 375 420 465 462 459 449 499 563 566 517 467 439 411 413 415 436 457 428 399 402 405 423 442 487 533 528 523 562 601 589 476
1654 476 383 350 388 426 461 495 529 563 525 487 480 472 462 453 458 463 479 495 481 466 445 424 403 382 420 459 446 434 436 438 440 441 440 439 438 436 455 474 493 512 488
1649 488 464 426 387 374 362 379 397 377 357 366 376 403 429 404 380 363 347 380 414 430 446 432 418 443 468 478 488 442 395 365 396 439 481 455 368
1645 368 311 315 352 389 358 328 312 297 307 317 357 398 436 474 443 412 424 466 478 430 392 414 435 395 340 316 361 407 393 379 364 350 348 345 374 402
1640 402 396 390 414 438 411 384 356 329 356 384 412 439 462 484 507 529 509 488 468 447 445 444 442 441 450 459 418 376 353 329 305 282 268 253 270 286 297 308 349
1636 349 391 426 462 467 473 435 396 358 320 322 324 327 329 312 296 350 404 429 453 477 500 470 411 381 411 464 455 435 446 447 419 373 388 398 379 361 373 407 410
1631 410 382 353 353 352 322 291 291 292 323 354 413 471 439 407 423 438 383 328 319 309 330 351 412 473 464 454 455 456 457 458 462 465 439 382 342 363 379 394 379 365 350
1626 350 335 322 309 296 283 297 310 324 338 378 418 430 441 454 498 512 465 445 485 524 502 464 456 476 467 429 422 446 471 462 454 415 377 354 331 340 350 357
1621 357 394 449 443 416 390 410 431 435 439 412 386 374 361 436 511 555 539 506 474 498 521 545 568 566 563 530 497 451 406 360 314 321 328 385 442 474 506 536
1617 536 566 522 447 406 425 460 494 482 470 452 433 465 497 543 588 584 579 541 502 514 556 556 496 436 436 470 473 449 456 492 527 516 504 545 615 616 556 501
1612 501 507 522 507 494 482 498 514 511 508 475 441 427 412 428 444 442 440 468 496 474 453 431 410 406 403 429 456 437 418 399 380 374 367 409 451 449 417 388 410 436
1607 436 462 491 520 549 578 556 535 543 551 529 507 481 454 458 461 471 480 490 499 472 445 420 446 504 561 551 542 527 513 499 485 499 513 558 602 633 664 645
1602 645 626 621 617 643 669 615 560 535 511 503 495 538 580 615 650 634 618 614 610 575 511 460 460 478 466 437 438 471 503 523 542 562 581 531 480 480 480 476 473 438 404
1597 404 383 361 390 419 414 410 453 495 494 441 420 448 477 506 523 540 528 516 519 522 512 502 522 542 502 461 421 380 378 375 420 464 493 462 445 459 486 482 494
1593 494 505 515 465 413 421 464 477 442 407 451 524 566 548 558 599 636 643 607 571 534 496 510 524 537 551 529 508 536 565 525 484 514 574 565 495 427
1588 427 419 469 520 503 486 472 457 493 529 519 510 470 430 410 390 354 318 280 241 253 264 281 297 293 319 373 367 310 252 283 374 452 469 446 454 471 488
1584 488 447 406 436 466 492 517 512 507 521 535 519 502 487 471 506 541 554 566 548 530 514 497 532 566 578 589 551 512 477 442 438 433 465 497 478 459 461
1579 461 464 466 469 490 511 461 411 377 342 379 415 454 494 482 471 435 399 454 509 559 609 589 568 551 534 548 561 556 552 547 542 562 583 532 482 445 408 401 394
1574 394 442 489 507 524 512 501 489 477 444 411 377 344 377 410 443 477 481 485 459 433 418 402 417 432 407 383 408 434 454 474 494 514 484 454 444 484
1570 484 545 574 591 607 629 600 509 417 393 368 344 319 338 356 346 337 337 368 384 349 306 313 360 406 425 444 415 387 379 422 466 460 443 455 499 542 537 532
1565 532 497 462 426 391 406 420 471 523 572 621 573 495 466 499 540 521 490 458 447 435 394 352 345 337 358 380 337 264 224 246 328 409 424 439 431 423 414
1561 414 406 402 399 426 453 483 513 513 513 473 434 411 448 499 550 533 517 506 495 483 472 461 449 489 528 494 460 426 392 414 436 458 480 490 500 509 519 476
1556 476 433 461 489 466 443 420 397 447 497 496 495 448 400 383 365 378 390 402 415 425 435 476 517 498 478 459 440 447 454 460 465 425 355 319 343 417 491 498
1552 498 504 461 417 404 390 431 472 462 453 469 485 532 578 571 564 557 549 514 479 474 470 470 471 472 472 485 498 494 490 475 431 399 428 484 539 528 517 504 491 525 558 597
1546 597 574 538 533 558 582 558 534 523 513 552 621 658 635 562 551 586 621 589 556 566 576 571 566 605 644 632 621 592 564 520 476 503 530 526 523 528 532 537 542
1542 542 563 585 606 627 635 642 664 686 668 649 601 522 449 436 458 480 487 495 472 449 472 495 518 541 547 552 558 563 570 576 613 650 678 707 668 630 613 656 697 739
1537 739 808 907 995 1022 1035 1078 1135 1161 1146 1162 1230 1298 1310 1323 1336 1349 1313 1278 1272 1267 1244 1221 1148 1075 1009 943 928 913 931 949 936 924 834 744 705 666
1532 666 673 680 672 664 670 676 697 718 762 805 852 838 800 762 770 779 753 726 699 673 612 550 558 566 580 565 558 613 664 654 616 608 658 738 807 815 782 749 742 736 729 723 701
1527 701 680 659 638 650 661 660 690 736 722 679 636 680 724 726 728 761 793 820 847 824 770 705 700 750 800 799 797 826 884 917 890 883 876 856 835 864 923 952 920
1522 920 860 861 863 865 870 876 891 906 901 925 951 917 882 908 957 975 984 993 984 976 968 960 975 991 935 880 850 821 807 855 905 955 978 1001 1008 1015 972 928 893 859 854 880
1517 880 901 872 826 810 830 849 820 791 800 810 820 830 846 862 878 894 903 911 889 867 860 853 816 778 767 755 774 793 804 815 826 838 832 827 822 816 840 863 815
1512 815 737 677 667 698 729 784 839 894 950 959 968 909 851 820 840 882 924 917 909 902 895 934 973 983 992 984 976 941 906 909 962 980 927 828 779 788 798 788 779 799 820
1507 820 854 888 892 896 894 893 892 890 888 887 935 984 971 959 976 994 1007 1021 1004 987 971 956 940 925 911 898 915 932 938 945 921 898 857 816 826 836 863 890 914 937
1502 937 943 899 836 802 803 804 807 809 823 836 849 863 837 811 784 758 760 762 763 765 782 798 815 831 869 907 875 812 806 861 916 910 884 889 904 918 915 912 909 907 911 916 921 926 939
1497 939 953 997 1040 1090 1140 1139 1138 1158 1178 1168 1158 1158 1157 1208 1258 1288 1318 1299 1280 1274 1298 1339 1319 1257 1195 1160 1124 1094 1065 1035 1005 993 981 968 956 967 977
1492 977 988 998 1012 1025 1039 1052 1028 1004 980 955 953 951 950 948 950 953 955 958 997 1036 1024 1013 1021 1029 1007 985 932 880 857 835 852 869 886 903 860 817 761 735 768 862
1488 862 909 895 859 854 858 862 862 861 891 921 935 949 933 917 883 849 884 919 891 833 808 844 888 932 931 930 976 1052 1119 1086 1014 973 979 985 987 988 1041 1093 1079 1066
1483 1066 1123 1181 1190 1199 1177 1156 1131 1106 1168 1230 1229 1167 1152 1198 1208 1158 1109 1119 1187 1195 1169 1144 1165 1187 1179 1170 1169 1168 1198 1227 1241 1255 1269 1284 1259 1234 1209 1184
1478 1184 1211 1238 1296 1353 1391 1429 1397 1364 1358 1352 1413 1473 1536 1538 1525 1512 1558 1633 1696 1698 1700 1701 1699 1697 1711 1724 1807 1921 2004 2028 2039 2081 2117 2154 2192 2230 2274 2318
1473 2318 2362 2406 2469 2533 2596 2660 2751 2843 2885 2926 3013 3101 3188 3276 3356 3437 3517 3598 3741 3885 4028 4172 4349 4526 4703 4879 5037 5195 5404
1470 5404 5612 5855 6098 6371 6644 6906 7168 7490 7873 8292 8771 9302 9892 10497 11162 11880 12659 13511 14463 15583 16884 18349
1467 18349 19956 21762 23831 26214 28941 32064 35652 39742 44417 49765 55819 62611 70150 78368 87171 96327 105483
1465 105483 114411 122873 130654 137605 143580 148442 152072 154268 154943 154142 151903 148269 143210 136797 129171 120595 111340
1463 111340 101700 92006 82615 73859 65890 58743 52385 46833 42028 37875 34269 31122 28359 25937 23778 21874 20192
1461 20192 18689 17328 16103 15020 14051 13222 12479 11735 11026 10377 9811 9306 8801 8297 7871 7546 7203 6860 6489 6180 5909
1458 5909 5638 5421 5205 5023 4842 4660 4478 4336 4194 4083 3971 3917 3862 3741 3619 3511 3463 3411 3359 3292 3224 3228 3232 3191 3150 3136 3122 3129 3076
1455 3076 3027 2978 2946 2914 2881 2849 2815 2780 2772 2764 2755 2685 2578 2472 2402 2333 2264 2195 2151 2107 2063 2019 1996 1973 1899 1826 1759 1692 1695 1699 1663 1627 1590 1554 1552 1550 1548
1450 1548 1546 1551 1557 1512 1467 1444 1422 1400 1377 1368 1358 1376 1393 1427 1400 1317 1234 1215 1196 1207 1218 1248 1278 1308 1337 1323 1308 1264 1219 1207 1195 1183 1172 1175 1179 1153 1127
1446 1127 1148 1170 1191 1213 1233 1253 1243 1233 1280 1328 1380 1371 1402 1434 1465 1496 1566 1697 1867 2038 2210 2442 2731 3020 3293 3565 3787 4009 4181
1442 4181 4352 4523 4634 4694 4693 4631 4570 4491 4412 4361 4250 4035 3720 3377 3094 2842 2650 2499 2347 2262 2176 2125 2073 2027 2042 2119 2258 2394
1439 2394 2531 2671 2812 3021 3231 3523 3877 4307 4838 5453 6129 6841 7552 8223 8893 9640 10488 11413 12339 13299 14319 15397
1436 15397 16534 17648 18661 19537 20191 20629 20925 21123 21220 21184 21007 20678 20208 19583 18776 17820 16763 15604 14344 12971 11598
1434 11598 10276 9094 8076 7199 6490 5922 5481 5181 4999 4879 4830 4781 4813 4946 5181 5518 5904 6350 6933 7698 8670 9864
1431 9864 11263 12844 14558 16374 18240 20105 22007 23969 25988 28008 30007 32006 33943 35880 37709 39356 40771
1429 40771 41884 42592 42836 42663 42186 41496 40625 39531 38255 36792 35106 33233 31179 29011 26701 24256 21812 19407 17144
1426 17144 15028 13135 11491 10150 9051 8174 7510 6988 6584 6281 6080 6021 6033 6105 6244 6484 6837 7332 8016 8921 10049 11358
1424 11358 12832 14407 16058 17769 19531 21354 23196 25039 26830 28622 30345 32007 33528 34867 35976 36863 37461 37755
1422 37755 37668 37238 36498 35536 34414 33151 31771 30249 28616 26883 25093 23202 21255 19308 17392 15537 13792 12188
1419 12188 10757 9508 8411 7455 6642 6010 5487 5066 4723 4482 4305 4128 3955 3843 3835 3887 3987 4087 4285 4585 4978 5372 5805
1417 5805 6239 6755 7332 7904 8477 9026 9575 10151 10726 11213 11640 12002 12263 12423 12523 12564 12545 12382 12078 11672 11205 10692 10180 9664
1414 9664 9148 8597 8046 7424 6802 6190 5578 4966 4414 3920 3486 3082 2739 2438 2199 2004 1808 1654 1560 1483 1406 1334 1262 1190 1119
1411 1119 1025 931 907 884 864 843 853 863 872 882 841 801 750 699 683 666 634 662 723 784 797 749 735 721 679 638 647 656 657 659 660 661 703 744 718 693 636 641
1406 641 682 723 692 662 661 661 677 694 681 667 629 591 586 641 662 622 585 609 612 615 584 613 656 638 588 538 558 579 599 620 630 640 599 559 520 482 480 539
1401 539 630 721 719 656 582 508 430 352 394 436 478 520 573 627 611 594 600 606 612 618 603 587 606 564 515 466 484 502 518 534 551 567 579 591 604 616 632
1397 632 648 613 579 605 631 626 622 616 610 635 660 621 583 542 560 614 667 634 600 595 590 585 580 621 661 701 742 781 821 830 839 847 854 932 1010 1090 1171 1221 1271 1307 1344
1392 1344 1330 1317 1288 1260 1232 1203 1210 1216 1223 1229 1174 1120 1065 1011 939 866 845 823 823 823 793 763 712 662 703 743 753 764 744 723 708 693 729 765 799 833 837 842
1387 842 920 999 986 974 932 889 897 905 894 884 903 923 907 890 874 857 840 822 805 787 740 693 661 629 625 620 646 672 631 591 551 511 518 526 503 480 519 558
1382 558 612 667 661 656 665 675 669 664 608 552 559 565 541 517 505 493 532 570 576 582 558 533 556 579 571 564 568 572 607 641 600 559 533 507 474 441 479 517 539 561 532
1377 532 504 506 507 539 571 559 547 565 583 595 607 620 632 632 633 582 532 549 565 566 567 552 537 553 568 590 612 633 655 630 606 611 616 682 747 863 979 1065
1373 1065 1150 1266 1381 1508 1635 1671 1707 1742 1776 1759 1743 1757 1771 1785 1799 1739 1680 1620 1561 1491 1421 1368 1375 1412 1448 1484 1581 1718 1854 1983 2142
1369 2142 2394 2746 3130 3574 4148 4864 5646 6367 7025 7622 8154 8585 8976 9367 9714 9960 10075 10130 10152 10113 9964 9753 9512 9211
1366 9211 8819 8367 7959 7583 7217 6882 6592 6363 6203 6103 6109 6175 6234 6262 6323 6413 6499 6555 6629 6805 7087 7470 8018 8747 9609 10532
1363 10532 11456 12380 13282 14082 14740 15256 15704 16050 16263 16334 16291 16106 15807 15367 14766 13983 12999 11874 10698 9522 8401 7380
1360 7380 6465 5691 5066 4582 4213 3986 3870 3815 3824 3895 4053 4313 4653 5054 5430 5807 6184 6622 7158 7754 8359 8864 9270 9575
1357 9575 9804 9972 10047 10021 9902 9682 9398 9013 8569 8125 7675 7225 6680 6134 5559 4983 4401 3818 3294 2871 2502 2194 1996 1858
1354 1858 1722 1587 1451 1377 1304 1231 1127 1085 1096 1107 1051 995 989 983 1008 1032 1045 1058 1108 1218 1321 1424 1528 1631 1705 1718 1715 1712 1757 1802 1777 1752
1350 1752 1745 1738 1714 1630 1548 1466 1380 1294 1171 1047 920 854 824 795 739 683 654 624 568 512 456 461 483 504 506 508 510 512 552 592 546 499 447 455 460 465 476 488
1346 488 500 511 542 573 573 573 565 556 518 479 475 471 467 463 411 360 399 439 481 523 535 546 508 469 430 391 387 383 378 374 425 476 457 437 393 349 355 362 387 413 439 465
1341 465 404 342 352 361 358 354 320 286 303 320 368 416 446 476 476 475 435 394 384 373 398 423 418 412 381 349 388 427 369 311 283 357 443 468 423 377 361 345
1336 345 379 413 414 415 365 316 351 386 421 456 462 468 474 480 486 493 449 405 396 386 376 366 325 284 293 302 345 387 429 472 451 430 409 388 378 367 386 405 411 417 424 430
1331 430 405 380 355 330 359 389 351 314 309 365 417 469 454 438 423 408 399 391 353 314 361 407 386 365 353 402 451 439 408 377 372 367 363 358 385 411 414 417 421 424
1326 424 430 436 442 448 439 429 389 349 360 371 382 394 431 468 505 542 528 515 502 489 480 471 513 554 526 498 470 442 450 458 466 473 514 554 595 635 611 586 592 597 627
1321 627 657 683 708 705 642 578 575 623 671 665 600 565 530 542 554 578 602 575 549 555 561 537 513 471 429 417 406 438 471 503 536 528 520 512 504 499 494 490 485 453 420
1316 420 439 457 475 493 461 429 420 411 402 393 400 408 415 423 471 520 519 517 487 458 428 399 392 385 408 431 457 482 477 472 435 398 392 385 398 410 423 435 437 439 441 443 408 374 391
1310 391 407 398 389 380 371 360 348 337 325 327 330 362 395 405 415 395 374 368 363 357 351 384 416 419 421 410 400 319 237 277 317 357 397 417 437 456 476 487 498 479 459
1305 459 470 481 441 401 367 334 351 368 426 484 472 460 434 407 351 294 265 237 279 321 330 340 320 299 309 318 328 337 349 361 424 487 482 477 472 467 478 488
1301 488 499 510 513 516 519 522 504 486 438 389 399 408 417 426 444 463 481 499 450 401 402 404 356 308 311 313 320 326 333 339 339 339 339 339 343 347 321 294 302 310 287 265 257 250 208 227 313
1295 313 398 434 410 373 397 431 434 407 380 402 423 416 409 402 395 408 421 404 386 382 377 372 367 424 481 487 493 481 470 489 509 525 542 508 474 482 489 450 411 432 514
1290 514 566 557 505 454 449 445 460 475 489 504 507 511 499 427 362 328 344 360 356 353 380 407 432 457 482 507 516 525 503 482 465 448 431 414 404 394 384 374 362
1285 362 349 387 425 442 458 445 431 369 307 299 351 413 415 404 393 415 438 460 483 443 402 375 407 440 413 372 332 347 362 377 392 426 461 465 469 475 481 457
1281 457 433 389 345 331 318 302 286 274 262 273 343 414 424 425 425 422 419 415 411 458 505 476 448 419 391 419 446 424 401 387 374 391 408 380 353 355 358 365 373 380
1276 380 388 391 394 425 457 417 348 311 335 395 455 447 440 426 412 398 384 385 385 453 520 551 521 454 387 409 430 452 473 452 430 409 387 416 445 421 336 278
1271 278 281 313 316 280 244 236 229 248 266 285 304 294 285 306 328 325 322 319 316 291 267 276 345 393 380 385 420 470 460 435 410 431 452 423 394 309 223 189 154 196
1266 196 238 281 323 321 320 349 378 374 371 337 303 315 326 308 289 321 352 415 477 482 487 462 437 455 473 461 448 444 439 434 430 406 383 359 336 322 308 345 382 375
1261 375 369 362 356 390 425 429 434 454 474 464 454 442 430 448 467 475 484 492 501 489 476 464 452 457 462 467 473 485 498 481 463 459 454 419 385 414 444 423 402 417 432 417
1256 417 401 375 349 354 358 354 349 345 341 343 346 318 291 377 463 478 493 437 380 394 408 431 454 447 439 446 453 489 526 515 503 441 380 362 344 357 369 386 404 411 387
1251 387 379 422 499 547 519 461 401 372 347 323 300 277 321 364 377 390 385 380 377 323 280 287 334 380 380 379 348 317 311 306 331 355 361 367 373 379 414 449 485 520 484
1246 484 447 441 434 411 387 414 442 450 458 436 413 395 377 410 442 480 518 506 494 472 451 430 408 378 347 346 346 304 263 244 275 327 378 402 427 436 445 454 463 468
1241 468 474 476 478 470 412 337 292 309 356 403 419 418 387 352 347 371 363 345 326 334 342 350 358 364 371 377 383 380 378 376 373 369 365 361 356 350 344 308 271 296 321 315 310 309 309 380 450 491 533
1235 533 523 514 469 424 410 395 410 425 441 456 412 368 354 340 332 324 316 308 331 355 379 403 363 324 335 346 360 373 356 339 358 376 395 414 417 420 393 365
1231 365 368 370 372 375 388 402 416 429 416 404 441 479 422 366 340 313 315 316 368 420 454 488 471 454 465 475 435 395 405 415 426 436 390 344 328 313 351 389
1226 389 377 365 366 367 398 430 431 432 433 434 437 440 443 446 408 370 332 294 340 385 431 476 464 452 439 427 411 394 429 463 452 441 460 480 491 502 463 423 407 390
1221 390 373 357 345 332 369 405 397 358 349 400 413 366 323 340 384 427 443 460 458 457 405 352 354 355 423 491 526 501 440 379 376 373 370 368 355 342 329 316 310 304 329
1216 329 353 355 357 328 300 308 316 324 332 343 353 414 504 571 577 528 479 455 432 438 445 465 486 476 466 495 524 539 493 412 361 383 466 500 474 418 393 422 450
1211 450 430 410 358 307 272 297 349 400 385 370 367 365 412 460 470 479 459 438 413 387 393 398 403 409 412 416 390 335 308 343 420 437 400 364 393 423 453 483 431
1206 431 380 342 366 422 447 422 398 374 350 325 301 341 382 422 462 479 496 447 397 392 458 512 515 452 389 354 390 439 488 470 453 400 348 296 244 265
1202 265 287 339 391 424 456 439 421 450 480 479 478 454 429 404 379 379 379 348 288 255 272 279 257 249 293 353 383 358 332 355 378 437 496 485 473 454 436 419
1197 419 402 404 436 479 472 452 432 412 392 371 400 449 467 449 432 463 495 504 513 492 471 451 431 412 392 398 404 411 417 415 413 411 409 368 328 375 422 437 401 377 383
1192 383 415 446 449 452 432 412 393 373 370 367 395 422 423 424 395 366 354 342 361 380 398 417 406 394 385 375 396 416 427 438 449 460 451 442 432 423 372 321 331 392
1188 392 436 449 483 517 526 535 513 492 503 515 526 537 474 410 394 379 383 357 348 390 436 452 440 427 445 492 523 503 467 462 506 549 525 471 436 451 494
1183 494 538 534 530 482 434 425 467 485 453 435 448 458 468 480 492 534 577 548 520 492 464 435 407 395 382 420 458 473 487 470 454 437 420 403 385 423
1179 423 460 497 534 566 598 599 601 568 536 503 471 506 542 527 512 522 533 543 553 572 591 559 527 524 521 517 514 517 520 522 525 539 552 568 583 619 686 733 730 684
1174 684 638 593 547 520 553 603 653 627 601 574 548 542 536 560 584 583 582 581 580 558 536 585 634 654 674 690 706 724 681 642 603 634 664 644 624 610 595 581
1169 581 566 566 566 617 667 627 587 564 601 611 621 636 650 625 600 575 550 578 606 634 662 630 597 565 532 529 525 552 579 583 587 560 534 575 615 656 696 690
1164 690 684 677 671 708 746 696 646 632 679 725 711 690 668 714 759 743 727 711 694 734 774 784 794 807 821 818 755 712 669 694 718 747 776 805 834 840 846 886
1160 886 866 813 761 776 790 805 819 834 848 835 823 840 858 822 787 788 849 902 955 1008 1060 1125 1129 1097 1064 1064 1063 1093 1123 1151 1179 1207 1235 1270 1306 1372 1438
1155 1438 1446 1454 1512 1570 1636 1701 1732 1824 1933 2042 2154 2267 2396 2526 2660 2793 2948 3163 3460 3857 4348 4839 5377 6057 6881 7847
1152 7847 8950 10234 11783 13594 15641 17950 20482 23076 25550 27722 29578 31132 32417 33400 34106 34590 34856 34901 34729
1150 34729 34335 33727 32856 31733 30308 28597 26623 24408 22011 19551 17152 14936 12982 11284 9848 8624 7582 6674
1148 6674 5948 5386 4966 4592 4218 3898 3638 3456 3273 3102 2931 2759 2588 2508 2427 2346 2266 2181 2096 2011 1926 1903 1881 1825 1709 1625 1602
1144 1602 1611 1621 1584 1547 1581 1615 1639 1662 1685 1709 1692 1676 1689 1703 1756 1809 1862 1915 1905 1895 1935 1976 2051 2127 2187 2247 2336 2425 2590 2817 3052 3286 3545
1140 3545 3865 4228 4652 5185 5818 6529 7300 8180 9201 10290 11439 12660 13941 15305 16668 18103 19537 20976 22354
1138 22354 23727 25100 26427 27613 28581 29367 30080 30691 31129 31304 31217 30908 30425 29760 28936 27931 26812 25632 24402 23071
1135 23071 21639 20146 18662 17238 15851 14464 13137 11870 10667 9566 8534 7563 6685 5909 5285 4762 4347 3992 3686
1133 3686 3380 3108 2836 2635 2434 2303 2173 2085 1998 1864 1730 1615 1562 1474 1386 1271 1157 1093 1029 1021 1014 1036 1059 1053 1047 1011 974 933 891 895 900
1129 900 893 825 757 750 771 792 787 782 803 824 814 805 827 849 820 791 784 777 770 763 739 715 741 768 721 674 657 640 650 660 655 650 679 707 648 589 595 662 715 706 634
1124 634 561 516 470 487 504 491 478 472 466 476 485 485 485 516 547 530 514 513 512 468 424 451 478 462 447 431 416 450 484 502 460 423 386 394 402 384 336 320 364
1120 364 424 454 435 417 450 513 563 552 522 492 473 455 424 394 394 394 428 462 465 469 447 425 418 411 368 325 313 301 312 323 304 285 306 327 347 368 409 451
1115 451 492 534 529 524 519 514 511 508 503 499 448 367 301 295 327 388 452 485 488 461 449 438 411 385 359 332 361 389 417 445 459 473 436 400 380 361 342 323 294 265
1110 265 249 294 361 367 326 314 368 452 468 423 383 403 404 375 335 326 348 370 417 464 495 465 425 384 390 397 399 401 404 406 406 406 406 406 403 400 427 454 467 480 462 445
1105 445 420 395 420 445 446 447 448 449 436 424 381 338 308 278 278 278 276 273 270 268 278 288 328 368 369 369 370 370 365 359 354 349 353 358 362 366 367 367 368 368 364 360 356 352 380 409 407 406 369 332 346
1099 346 360 398 436 403 370 345 320 326 332 283 234 222 271 351 430 479 468 447 457 476 495 509 522 536 550 507 464 422 379 368 357 347 336 338 340 342 343 363
1094 363 383 402 422 383 345 306 268 294 321 348 375 346 317 289 262 315 399 444 438 436 433 397 361 313 265 308 351 385 419 383 346 323 300 348 395 395 395
1089 395 394 394 376 358 339 321 372 422 415 357 316 345 399 423 376 328 302 325 349 372 379 416 467 468 411 354 326 349 373 398 407 417 396 375 375 375 375 375 400 424
1085 424 448 472 445 417 440 463 501 538 545 552 516 479 412 345 343 341 312 283 309 385 461 487 441 396 398 400 435 470 435 400 398 396 394 392 379 365 401 438 415 393
1080 393 370 347 344 341 368 394 382 369 356 343 343 344 344 345 375 405 435 465 478 491 454 417 398 380 362 343 370 397 393 390 393 395 398 401 368 336 333 331 345 359 444 529
1075 529 508 487 466 445 426 407 358 309 326 343 410 478 462 446 431 415 430 445 459 474 427 380 363 347 387 428 438 449 432 415 449 483 477 471 465 460 448
1070 448 436 424 412 426 441 426 410 394 378 362 346 372 399 426 453 432 410 440 469 447 426 373 321 271 220 240 260 302 343 355 366 341 316 341 366
1066 366 405 444 452 460 439 417 396 374 379 383 437 492 468 445 421 398 347 297 298 298 328 358 388 418 431 443 456 469 444 418 423 429 464 499 484 469 422 376 380
1061 380 385 406 427 448 469 437 405 373 341 381 421 411 401 374 346 370 393 450 508 495 482 450 418 416 414 391 367 394 421 429 437 444 452 464 476 488 500 460
1056 460 421 432 443 435 427 419 411 410 409 407 406 383 360 336 313 314 316 287 258 263 268 273 279 276 274 271 269 283 296 340 384 396 407 388 369 381 393 406 418 406 394 382 370 389
1051 389 409 428 448 463 478 493 508 534 560 515 470 445 420 395 370 397 424 421 418 390 362 421 480 518 494 454 414 421 427 433 439 458 477 465 454 415 376 322
1046 322 268 289 311 333 355 369 382 396 410 442 474 489 443 354 265 266 328 401 415 415 416 437 458 428 398 381 363 376 388 446 503 504 444 421 398 372 345
1042 345 285 225 259 353 418 424 376 328 354 381 377 374 370 366 393 420 429 437 416 395 357 318 310 302 316 330 329 328 388 449 453 396 369 342 342 342 383 424 433 380 336 352
1037 352 361 370 370 370 385 400 419 438 442 445 430 415 430 446 444 442 425 408 411 415 418 421 420 418 417 415 393 371 349 327 340 354 352 350 313 276 310 344 382 420 429 437 470 503 465
1031 465 427 395 362 330 297 317 338 358 379 380 382 337 292 288 344 415 426 396 366 348 329 340 351 362 373 371 368 366 364 320 276 282 289 342 395 377 359 337 315
1026 315 323 331 317 303 340 376 390 403 416 429 421 413 405 396 420 443 436 428 404 380 406 433 446 460 500 540 546 490 439 387 369 350 347 344 325 305 281 318 390 463
1021 463 448 433 432 431 430 429 440 451 447 443 441 440 412 384 374 424 474 463 411 359 374 388 402 416 430 444 463 481 429 376 340 303 317 331 326 321 301 281 304 327
1017 327 380 433 395 357 315 334 341 348 329 310 340 370 383 336 281 225 257 288 329 369 379 390 392 394 366 337 360 383 356 328 302 276 251 225 232 239 246 253 288
1012 288 324 329 334 362 391 446 501 530 499 431 363 350 338 326 313 308 303 298 293 338 384 417 389 335 342 362 381 414 447 480 513 468 422 394 426 451 476 434
1007 434 331 283 335 432 468 420 372 370 368 352 336 293 250 215 240 302 364 390 416 412 408 395 382 419 456 435 414 366 319 294 329 382 434 429 424 450 476
1003 476 442 409 388 427 462 436 397 358 352 346 390 434 441 448 455 462 452 441 401 360 388 417 446 474 438 402 395 389 389 388 417 447 435 424 412 401 396 390 415 441 461
998 461 482 503 523 491 459 427 394 405 416 423 430 415 340 265 250 313 375 393 411 421 461 488 455 391 326 329 331 326 321 345 368 341 283 274 327 353 318 257 257
993 257 261 264 272 280 309 339 338 337 324 310 297 283 292 301 279 258 272 287 251 215 217 218 270 323 360 398 404 409 396 352 291 291 358 425 422 359 321 343 395 417 423 429 432 436
987 436 436 437 409 381 395 439 470 440 388 337 337 398 447 467 436 406 388 371 384 397 420 443 416 388 360 331 353 375 356 338 352 427 493 499 452 404 399 394
983 394 419 444 451 458 465 473 450 428 435 443 476 509 512 515 508 502 495 488 442 395 419 443 428 414 369 324 296 269 271 274 336 397 409 420 393 367 370 374 382 391 369 347 380 413
977 413 395 348 303 318 367 417 427 437 416 395 387 378 370 361 378 395 382 368 381 395 408 421 427 432 468 504 464 423 433 443 432 420 418 446 471 435 347 260 268
973 268 337 406 415 381 348 361 404 441 417 379 340 325 310 265 220 210 201 192 182 202 222 272 322 347 372 396 421 435 449 464 478 465 453 441 429 427 426 424
968 424 423 410 396 434 471 498 524 519 515 488 460 433 406 404 403 401 400 414 429 443 458 417 376 331 347 379 410 374 339 363 386 363 340 308 336 361 385 364 343
963 343 407 471 511 450 358 267 273 340 400 460 478 435 392 410 442 473 437 402 430 458 435 413 410 407 408 409 381 412 461 509 500 490 481 472 463 454 445 436 475 513 586
958 586 598 548 498 461 484 501 518 489 459 474 488 503 518 512 507 532 556 563 570 577 584 501 418 331 305 336 367 401 435 421 406 391 376 359 341 354 367 386
954 386 405 393 382 401 419 408 397 379 361 358 355 329 303 328 383 402 372 341 361 404 417 383 379 427 475 465 405 366 376 386 396 393 389 368 295 225 205 224
949 224 244 297 350 388 426 426 425 453 481 468 423 398 423 475 527 511 495 468 441 402 364 347 381 432 452 431 379 340 331 378 424 442 460 450 440 414 389
944 389 347 305 314 322 325 327 359 391 397 404 359 315 315 315 345 375 404 433 432 430 420 410 430 451 423 396 399 402 388 373 359 345 334 322 340 359 349 340 357 374 382 340
939 340 279 248 291 335 351 366 381 396 426 456 480 504 543 582 540 499 458 416 418 419 394 369 358 408 454 500 451 402 404 406 409 412 441 471 482 432 370 307
935 307 289 331 354 377 339 301 333 427 473 418 359 361 397 434 424 414 413 413 412 412 419 426 433 440 465 489 483 477 482 487 445 403 351 359 384 409 400 392 383 374 394 414 403 392
929 392 413 433 423 413 424 436 397 358 358 358 332 305 270 294 335 376 387 398 409 420 418 417 415 414 404 394 414 434 427 419 427 434 443 452 460 469 441 413 386 358 350 341 379
924 379 417 462 446 377 308 287 326 346 367 366 366 395 425 403 381 358 336 345 354 393 433 388 344 314 285 277 269 227 245 298 352 356 299 284 329 386 444 406 368
919 368 360 353 367 381 395 409 378 347 316 284 266 248 245 241 242 243 257 331 398 405 358 312 316 320 324 328 357 386 415 444 468 493 487 481 457 434 426 417 440 463 456 448 385 323
914 323 290 258 265 272 309 346 380 415 399 383 371 358 346 333 353 372 407 442 437 432 397 362 365 368 371 373 381 388 381 373 398 423 417 411 400 389 393 397 463 528 564 498 423
909 423 408 444 480 446 411 443 476 480 424 402 381 386 392 397 403 397 392 387 382 376 369 357 406 462 487 482 508 555 541 472 403 371 338 377 415 480 544 497 450 448 445 443 440
903 440 434 428 421 415 401 386 372 357 380 402 374 316 308 361 412 402 354 306 305 304 322 340 359 377 387 398 408 418 412 407 401 396 395 394 424 454 433 413 407 402 381 359 389
898 389 418 458 497 507 516 510 504 467 430 458 486 463 440 426 412 449 486 492 497 488 479 483 487 491 496 509 522 486 450 441 463 486 449 400 351 302 253 247 302 359 356 331
893 331 337 393 449 410 372 364 356 370 384 399 413 427 441 485 530 521 512 503 495 503 511 546 581 595 549 486 423 429 435 394 353 334 374 432 489 515 542 569 596 626 655
888 655 685 715 740 764 788 812 804 795 787 778 813 849 884 919 948 977 975 974 976 978 1046 1115 1146 1115 1089 1062 1097 1131 1199 1207 1186 1165 1190 1216 1260 1305 1349 1393 1359 1325
883 1325 1288 1311 1297 1283 1273 1263 1230 1198 1195 1193 1176 1159 1142 1125 1081 1037 989 1002 1046 1090 1087 1085 1109 1134 1087 1041 999 958 916 874 839 803 768 732 716 700 735
879 735 770 790 810 779 749 669 590 526 524 555 586 571 556 567 578 559 540 535 531 556 582 566 549 533 516 519 522 525 528 496 464 431 399 420 441 461 482 485 487 489
874 489 492 481 470 459 448 437 426 464 533 531 468 405 403 442 450 409 367 400 432 414 397 391 385 380 376 411 477 529 520 499 478 427 375 341 367 389 412 414 417 419 422 395
869 395 369 342 316 333 349 337 293 272 311 380 450 477 444 379 344 363 411 462 482 489 496 529 562 533 472 426 439 501 563 554 484 404 354 334 314 326 338
864 338 349 361 354 347 339 332 366 399 383 336 316 356 408 430 430 430 428 426 420 414 409 403 385 368 380 393 389 386 412 439 465 491 517 543 555 567 549 531 521 511 501 491
859 491 473 455 467 479 461 443 476 509 511 513 516 518 515 511 508 505 472 439 436 434 479 524 569 614 628 643 627 610 562 514 516 518 528 538 548 557 561 564 568 572 532 493 453 414
853 414 455 496 536 577 560 543 475 407 414 420 457 494 494 494 564 635 614 593 571 550 544 538 532 526 535 544 523 501 518 534 551 567 574 581 558 534 553 571 559 547 559
848 559 570 581 593 593 593 592 592 560 527 544 562 579 596 643 691 677 664 680 697 669 641 613 585 596 607 588 569 607 646 685 724 703 681 710 740 771 802
844 802 802 803 826 849 805 760 742 785 827 809 786 763 787 811 802 793 784 776 748 719 742 764 760 756 752 748 704 660 672 745 754 763 775 788 827 866 875 883 875 866 857 848 851 854 903
838 903 953 911 808 755 763 767 770 777 784 831 877 873 869 875 881 891 901 932 1023 1113 1144 1117 1090 1110 1130 1144 1158 1172 1186 1216 1245 1274 1303 1323 1342 1362 1382 1368 1354
834 1354 1391 1428 1435 1443 1451 1459 1424 1390 1428 1528 1612 1635 1627 1681 1780 1820 1832 1905 2054 2203 2289 2375 2481 2647 2870 3093 3346 3599 3801 4004 4204
830 4204 4404 4604 4804 4968 5132 5246 5359 5530 5700 5901 6102 6303 6504 6795 7087 7388 7688 8060 8552 9099 9767 10547 11528
827 11528 12712 14099 15753 17771 20200 23236 26949 31187 35633 39876 43688 47137 50416 53633 56787 59657 62143
825 62143 64265 66231 68257 70419 72641 75045 77974 81649 85850 90025 93675 96810 99823 103109 106759 110542 114122
823 114122 117176 119624 121725 123766 125815 127803 129817 132276 135573 139476 143165 146005 148143 150160 152680 155805 159218
821 159218 162349 164516 165429 165363 164772 163697 161774 158830 155199 151246 146929 141905 136355 130881 126335 123144 121286 120466
819 120466 120009 119259 117984 116302 114417 112341 109659 106286 102306 97938 93206 88069 82650 77477 72992 69513 67043 65291
816 65291 63903 62471 60756 58854 56831 54720 52244 49239 45707 41668 37264 32616 27967 23661 19961 16945 14536
814 14536 12660 11147 9937 8929 8115 7422 6835 6308 5892 5536 5187 4837 4491 4245 4074 3903 3721 3538 3371 3204 3047 2891
812 2891 2751 2672 2590 2508 2400 2291 2211 2131 2067 2002 1967 1932 1882 1832 1760 1688 1667 1645 1644 1643 1591 1539 1491 1443 1426 1408 1387 1367 1377 1386 1367 1348 1298 1249 1212
807 1212 1175 1169 1163 1149 1136 1107 1079 1045 1011 1027 1044 1043 1041 989 938 897 856 902 949 966 922 849 836 829 822 789 756 759 762 698 634 620 667 664 661 652 644 609 573 543 573
802 573 633 633 569 505 473 502 515 528 556 584 658 672 629 586 619 651 653 655 660 664 618 512 410 409 458 507 530 552 574 596 589 583 606 630 622 615 593 571 497
798 497 423 406 449 495 541 560 579 597 616 603 591 568 544 571 598 563 528 489 511 546 581 570 558 531 504 477 450 428 405 433 461 490 518 516 514 520 527
793 527 560 593 600 546 496 446 451 457 513 569 606 643 609 575 579 582 586 590 541 492 473 455 483 511 539 567 587 606 554 503 468 434 450 466 481 497 482 467 480
788 480 493 507 520 546 572 526 481 450 418 437 455 454 452 477 502 533 503 456 410 408 406 405 403 429 455 482 508 537 567 567 566 550 534 517 501 495 488 482 475 510 544
783 544 541 478 439 400 428 456 501 547 519 431 387 404 451 467 469 471 471 470 454 437 420 403 424 445 457 438 425 473 521 508 448 419 459 500 504 509 482 456 434
779 434 411 440 468 461 454 475 497 470 414 370 387 391 395 401 407 407 376 355 395 445 434 390 346 350 354 357 361 388 415 391 367 344 320 347 374 378 382 386 390 385 380 374 369 386 403
773 403 419 436 480 523 497 470 450 430 410 390 371 353 364 376 397 418 439 460 444 429 414 399 393 386 380 374 406 438 470 503 506 510 447 384 357 392 409 395
768 395 384 373 360 347 359 371 383 394 398 402 436 470 490 509 478 448 422 396 401 405 399 392 416 439 455 471 457 443 388 333 349 365 375 386 365 345 374 404
764 404 402 401 393 384 426 467 458 449 439 430 460 489 550 610 625 640 656 671 674 677 680 683 717 752 756 760 806 852 847 842 839 837 885 933 980 1028 1025 1022 991 960 960 959 1027 1096 1125 1103
758 1103 1088 1122 1176 1230 1262 1294 1326 1358 1393 1428 1392 1357 1321 1286 1301 1316 1246 1175 1153 1131 1101 1040 1004 1038 1089 1089 1071 1053 1046 1039 1002 964 939 914 888 863
754 863 859 855 821 787 747 707 667 627 636 645 654 662 666 671 675 679 694 710 654 598 567 535 554 573 580 586 592 599 565 532 498 465 440 416 391 367 365 363 361 359 362 365 368 371 331 291
748 291 281 271 297 323 299 274 248 221 245 269 292 315 338 361 369 377 385 393 442 491 483 414 364 313 330 346 370 393 350 306 296 347 399 389 358 327 295 264
743 264 240 276 308 341 359 378 397 415 368 321 345 369 351 333 316 298 287 276 353 429 485 480 439 397 409 421 433 446 395 345 365 386 403 420 407 394
739 394 379 363 378 393 388 383 404 425 435 384 337 290 338 386 417 388 372 356 366 377 372 367 362 357 310 264 254 305 353 402 454 506 491 476 431 386 348 311
734 311 325 338 330 321 341 361 364 336 291 306 344 382 393 404 393 382 400 419 399 378 357 337 387 438 438 439 406 374 371 399 422 384 335 316 344 372 372 372 366 361
730 361 355 349 360 370 407 445 414 323 234 206 240 304 370 406 397 357 315 304 300 297 296 295 337 379 390 401 390 379 398 447 481 454 396 368 384 400 348 295 307
725 307 319 302 285 285 314 335 294 240 245 321 396 413 369 312 285 307 328 323 317 325 364 419 414 368 323 347 431 480 469 445 421 411 401 391 381 395 410 425
720 425 440 415 390 395 401 405 409 411 414 412 379 328 337 380 393 356 318 353 388 372 357 330 304 251 198 195 252 309 305 311 317 319 321 340 359 350 340 312 314 337 300 231 223 290
715 290 387 446 475 492 510 513 515 488 461 430 399 419 439 416 393 370 347 335 324 314 305 338 401 432 403 385 397 436 444 427 409 390 370 340 310 330 350
710 350 370 390 410 429 424 418 412 406 388 370 352 333 326 319 311 304 310 315 320 326 360 395 429 464 438 413 387 362 343 325 357 389 398 407 416 425 403 380 388 396 428 460 461 461 376
705 376 260 213 266 373 419 415 411 405 399 362 326 321 315 310 304 318 331 375 419 423 427 431 435 419 403 387 371 367 362 327 293 265 237 239 242 271 301 357 413 413 353 292 292
699 292 319 347 347 348 378 409 409 409 386 363 341 318 335 352 369 386 405 425 394 363 358 353 379 404 399 395 437 478 528 516 468 420 415 409 403 397 433 469 435 400 342
694 342 284 262 301 357 412 401 389 387 385 413 441 466 492 517 542 553 564 545 526 472 418 363 309 316 323 331 338 366 394 421 449 409 369 379 389 402 414 396
690 396 378 388 398 438 478 486 494 451 408 404 399 347 296 268 301 330 359 332 304 277 250 293 337 384 371 359 347 361 376 400 425 449 474 446 418 437 456
685 456 459 401 370 399 439 418 385 352 362 372 382 392 415 437 409 382 381 380 379 378 416 453 458 402 326 309 346 383 354 325 293 321 369 417 398 379 375 371 398
680 398 424 428 431 404 378 389 400 364 329 325 382 408 374 352 330 374 419 429 439 449 460 486 513 468 424 400 375 351 326 325 324 323 322 328 333 339 345 367 389 344 299
675 299 250 261 308 356 391 426 461 496 471 445 420 394 343 293 329 365 410 393 381 368 392 416 390 364 351 339 357 375 401 427 453 479 485 490 425 359
671 359 317 274 302 330 360 390 420 450 467 485 453 420 425 430 406 383 393 433 444 394 333 333 365 398 386 374 393 412 448 484 450 385 348 371 429 488 514
667 514 541 537 533 550 566 512 457 420 382 375 368 347 326 355 384 405 426 417 407 397 387 377 367 347 326 336 346 371 397 423 448 413 378 343 307 290 273 259
662 259 245 256 328 383 408 409 411 411 411 367 324 331 367 376 324 271 280 305 300 269 268 312 355 371 386 363 339 252 195 221 309 351 332 341 409 476 482 438 423 435 417
657 417 379 341 352 363 349 335 391 447 448 448 479 540 566 541 497 452 416 381 375 370 395 419 443 468 476 484 441 398 386 374 361 349 357 366 404 443 465 487 459
652 459 431 408 385 363 340 332 323 315 307 329 352 374 396 384 371 359 346 357 369 349 330 346 362 377 393 409 426 442 459 461 462 454 416 380 396 446 466 410 324
647 324 274 276 307 338 371 403 381 328 311 345 378 361 328 325 359 394 400 376 342 359 397 434 429 424 392 360 345 380 433 455 407 329 288 298 325 353 381 409
643 409 390 320 278 287 316 316 288 290 326 361 311 261 260 310 348 356 372 388 388 387 402 417 432 396 342 318 325 331 334 337 340 343 308 273 308 343 362 381 370 359 360 360 363
637 363 366 400 464 510 504 465 425 432 440 422 404 456 509 526 544 531 518 463 407 383 358 349 340 341 372 418 412 387 362 373 384 395 406 416 425 383 342 321 301 330
633 330 360 380 401 390 380 374 369 363 357 355 353 381 409 395 381 368 354 376 398 389 381 416 451 470 490 476 463 449 435 414 393 387 381 373 365 388 410 375 341 356 402
628 402 432 411 369 328 338 348 389 429 430 430 446 461 472 482 462 442 423 405 417 429 436 442 480 517 518 519 490 461 437 413 435 458 495 471 431 391 416 440
623 440 414 389 360 332 319 305 301 297 323 350 353 356 360 363 366 369 341 313 347 381 385 389 370 351 285 219 216 273 360 387 387 388 415 442 443 444 461 477 467 457 420 383 369
618 369 416 444 471 441 411 381 351 343 335 357 378 365 352 369 387 422 457 477 498 465 433 451 469 423 377 382 387 378 370 391 413 429 446 478 509 543 577 561
613 561 544 504 464 470 477 495 453 415 376 393 410 426 443 429 415 401 387 396 404 397 390 345 300 272 304 359 415 406 396 422 478 536 534 493 453 479 506 499 493 484 476
608 476 467 429 371 375 397 389 351 313 349 386 405 365 330 296 292 350 398 416 383 351 310 268 243 279 364 450 502 494 470 446 448 450 469 489 458 427 446 466 455
603 455 444 397 349 353 356 382 408 464 520 490 460 439 448 456 403 350 357 372 356 323 351 402 393 334 275 301 387 423 399 385 371 355 339 352 395 425 394 332
599 332 270 274 279 293 307 351 426 497 508 464 420 412 405 412 420 373 326 332 399 461 463 412 361 360 360 344 329 336 344 382 419 401 383 365 347 347 348 348 348 362 376 389 403
593 403 433 464 424 384 391 399 406 413 396 378 360 343 336 329 322 315 342 370 366 363 352 342 331 320 341 363 354 345 380 415 399 384 391 398 374 351 346 341 306 270 281 293 306
588 306 319 328 367 396 363 341 349 366 383 400 416 403 389 388 388 373 357 339 322 334 347 403 460 484 447 429 473 523 473 377 341 396 451 468 485 517 549
584 549 518 487 507 526 540 554 517 480 419 359 353 409 447 456 455 454 443 433 423 412 418 424 399 375 373 371 385 398 414 430 415 401 370 340 339 368 421 413 374 335
579 335 377 480 532 524 475 427 425 423 450 478 418 358 326 355 380 405 401 397 423 449 447 445 413 381 403 426 456 426 384 402 488 574 581 487 386 346 410 474
574 474 471 469 457 445 406 368 333 358 400 442 453 465 477 489 468 446 398 350 294 298 338 379 389 400 410 420 429 437 445 454 492 531 533 475 438 402 392 382 353
569 353 324 325 327 312 298 314 330 342 353 365 376 425 473 492 510 488 467 395 322 284 245 256 268 291 314 290 266 254 303 348 392 393 394 394 395 388 382 375 369 382
564 382 395 442 429 358 287 269 312 362 412 374 337 303 269 285 302 344 386 398 410 396 382 388 364 344 374 440 476 453 401 346 322 331 341 353 364 370 376
560 376 412 448 442 435 428 422 449 476 452 429 399 369 379 439 494 500 446 392 403 415 396 378 352 327 302 277 282 288 344 400 428 456 454 452 432 413 394 374 433 492
555 492 510 478 424 400 406 412 426 440 424 407 384 362 369 377 418 459 470 481 481 481 434 387 372 407 435 432 419 457 512 537 515 493 520 546 556 566 526 485 422
550 422 358 366 373 351 328 326 374 434 464 445 426 453 510 548 535 522 510 494 478 445 413 380 348 335 323 361 399 430 460 471 431 391 383 404 425 433 442 497
545 497 553 531 460 418 427 468 510 503 467 426 435 461 458 402 346 359 372 371 369 398 427 447 467 456 445 474 502 516 529 496 463 481 498 517 535 523 512 512 512
541 512 497 483 501 520 553 587 546 506 467 428 441 485 511 487 415 374 386 429 450 472 480 488 466 443 451 459 442 425 408 391 387 382 428 474 475 475 490 505 528
536 528 551 523 495 519 543 537 501 475 500 542 554 505 456 456 456 452 448 444 441 441 442 443 444 430 417 419 420 434 448 493 537 544 551 527 504 454 404 425 445 441 436 442 449 483 457
530 457 415 372 369 366 393 421 463 505 517 528 551 573 610 648 627 606 585 565 561 558 601 645 701 696 675 654 662 671 680 688 669 650 661 672 642 612 608 605 611 556 489
525 489 422 376 391 459 526 566 544 549 615 695 715 683 650 621 592 594 596 604 613 591 569 599 629 659 689 705 721 749 777 801 765 713 660 681 702 723 744 747
521 747 750 752 755 730 704 679 654 666 679 691 703 703 702 702 702 759 817 875 932 911 890 869 848 835 823 843 924 998 1012 973 934 974 1014 1054 1094 1173 1253 1302 1352
516 1352 1425 1499 1536 1512 1495 1477 1503 1528 1537 1486 1398 1310 1278 1247 1216 1184 1182 1179 1176 1173 1159 1145 1101 1057 1025 993 960 928 923 919 914 910 893 876 890 904 904 905 906 907 964
511 964 1020 1060 1039 994 949 951 953 986 1020 1053 1086 1144 1201 1258 1316 1308 1301 1344 1387 1426 1466 1475 1484 1472 1461 1449 1438 1408 1379 1350 1321 1282 1244 1156 1067 999 932 914
506 914 897 828 758 739 720 706 691 676 662 618 574 561 547 591 635 649 663 608 554 532 571 597 562 514 467 492 517 542 567 600 633 665 698 728 758
502 758 758 758 775 793 810 827 799 771 743 715 720 724 727 730 709 658 587 577 592 576 534 523 579 635 642 650 595 541 486 432 435 437 442 446 494 572 578 523 488 484 480 446 440
497 440 496 549 542 481 421 448 475 470 464 429 393 383 372 392 412 414 416 427 468 516 503 477 482 498 485 472 489 544 569 542 515 536 557 547 537 531 525 519 514 492
492 492 470 499 528 535 542 559 606 643 618 539 460 428 395 413 431 464 497 479 462 454 445 406 368 415 462 479 496 515 535 540 485 443 431 449 467 481 496 482
487 482 468 456 475 511 486 448 410 418 427 455 483 461 438 432 426 450 475 469 464 486 509 516 493 450 469 522 545 519 492 506 521 535 549 585 622 608 593 571 549
483 549 497 445 441 437 434 430 418 406 424 442 441 440 439 439 509 579 619 658 669 679 638 598 574 551 518 454 419 444 450 426 416 406 398 390 430 531 584 576 539 532 543
478 543 493 445 458 544 631 642 653 634 615 594 573 526 478 464 511 558 545 501 457 459 462 467 472 477 482 460 438 487 536 522 508 525 542 546 550 554 558 538 519 500
473 500 481 511 542 542 542 510 478 447 417 442 497 541 525 491 488 515 541 560 579 598 617 624 631 612 592 564 596 641 657 607 557 577 596 615 634 653 673 664
468 664 656 648 640 639 638 607 576 625 674 692 710 684 657 631 604 628 653 646 640 621 602 614 625 638 651 665 678 674 671 668 665 655 644 705 765 753 741 729 717 749 781
463 781 814 846 865 885 904 924 908 893 877 861 859 856 853 850 871 893 915 937 963 989 1015 1041 1118 1195 1222 1249 1251 1253 1255 1257 1258 1258 1258 1258 1313 1367 1452 1537 1611 1686 1730
458 1730 1774 1843 1913 2073 2233 2366 2499 2707 2915 3136 3418 3773 4250 4769 5350 6080 7012 8152 9575 11341 13551 16225 19262
455 19262 22489 25716 28994 32473 36304 40336 44173 47403 49865 51721 53204 54404 55167 55242 54481 52973 50824 48170
453 48170 45049 41625 38043 34461 30805 27088 23426 20067 17229 15018 13403 12293 11534 10957 10511 10166 9973 9881 9853 9825
450 9825 9810 9855 9978 10101 10214 10326 10522 10819 11206 11734 12482 13493 14854 16639 19002 22113 26136 31108 36900 43117 49323
448 49323 55529 62050 69278 77053 84646 91193 96266 100019 102944 105296 106940 107381 106186 103351 99243 94169 88307 81780
446 81780 74789 67561 60231 52839 45547 38762 32886 28175 24616 21994 20079 18637 17538 16712 16068 15577 15227 14933 14639
443 14639 14303 13967 13656 13344 12995 12586 12183 11779 11408 11096 10958 11123 11576 12332 13403 14939 17032 19632 22511 25451 28381
441 28381 31412 34733 38357 42021 45301 47906 49844 51310 52472 53322 53626 53190 51925 49971 47552 44767 41638 38233
439 38233 34646 31017 27388 23796 20345 17277 14755 12780 11311 10228 9448 8866 8426 8062 7759 7525 7291 7061 6831 6585
436 6585 6338 6092 5846 5510 5174 4768 4362 3899 3437 3069 2802 2556 2310 2161 2012 1924 1835 1798 1760 1746 1732 1668 1604 1538 1473 1437 1402
433 1402 1410 1418 1376 1333 1256 1180 1134 1087 1076 1064 982 900 889 878 867 856 833 810 817 825 792 760 778 796 821 846 841 835 823 810 782 754 769 783 747 711 728 745
428 745 777 809 795 781 782 783 803 824 874 925 913 902 906 909 904 898 862 826 893 960 996 1032 1020 1009 997 985 993 1001 1009 1017 955 893 846 799 788 776 795 813 806 798 740
423 740 682 702 722 651 580 573 567 611 655 619 583 578 573 569 566 562 559 582 605 598 591 595 599 577 554 566 639 711 723 706 689 668 647 616 586 606 626 623 620 566 512 444
418 444 377 346 375 443 510 531 552 554 555 527 498 468 438 458 478 466 454 442 430 439 448 457 466 478 489 500 511 507 502 544 586 587 527 465 464 478 461 447 462 471 450
413 450 401 381 415 449 454 460 454 448 442 436 490 544 563 522 477 462 478 493 497 502 476 450 418 385 382 410 453 435 385 366 379 392 376 360 381 402 373 343 352 360 338
408 338 315 344 374 373 342 343 405 439 412 372 392 463 503 491 479 516 553 565 578 520 462 404 346 338 330 382 435 470 446 422 399 372 345 379 413 451 428
404 428 417 405 441 476 442 408 441 473 543 552 488 424 371 379 403 428 392 355 335 376 449 521 560 539 533 527 548 568 551 534 543 552 573 534 479 423 437 452
399 452 466 481 501 522 475 429 363 358 370 381 395 410 424 438 436 434 432 430 404 377 402 426 456 487 518 548 538 529 472 415 358 362 418 475 492 449 409 370 387
394 387 404 422 439 410 381 352 323 345 367 389 411 400 389 428 468 479 491 502 514 557 601 594 587 590 594 648 702 724 747 739 731 696 660 675 690 710 730 720
389 720 710 634 557 531 506 477 448 420 391 415 438 432 425 406 387 400 475 524 513 469 425 453 480 507 534 566 598 579 560 573 586 573 559 557 615 638 662
385 662 661 660 709 759 807 856 905 954 969 985 1001 1017 988 958 960 961 920 880 839 798 741 683 656 628 603 577 520 464 468 472 475 479 544 608 599 530 494 518 508 498
380 498 463 489 532 574 537 500 463 425 441 457 520 582 602 562 505 448 448 448 479 509 549 588 654 720 762 743 728 713 741 770 748 726 721 715 710 705 643 581
375 581 520 458 468 478 487 497 499 501 503 506 505 504 503 502 550 598 606 563 544 555 545 536 532 528 524 520 476 432 409 355 320 336 392 448 468 487 456 425 394 362 382 401 370
370 370 340 359 379 363 347 381 415 425 435 446 456 446 436 426 416 388 359 398 437 425 362 342 351 346 342 358 425 467 459 463 497 517 487 420 383 405 426 418
366 418 411 435 459 483 507 510 512 515 517 535 552 539 526 503 479 425 371 407 444 450 456 441 427 462 498 498 499 499 499 475 451 477 503 532 561 540 518 517 516 484 453 440
360 440 428 483 539 526 463 399 386 418 449 484 519 526 534 540 546 554 531 506 542 604 666 682 697 723 749 687 626 608 650 703 727 716 676 634 621 636 651 639
356 639 627 658 720 781 781 728 644 584 624 713 741 701 660 688 746 771 736 709 683 683 683 710 738 735 733 757 782 778 775 778 812 850 828 815 832 861 859 820 782 812
351 812 842 855 869 834 799 822 876 898 859 809 789 769 718 677 696 715 673 621 599 606 614 597 579 592 605 584 563 557 551 515 478 512 546 601 655 680 704
346 704 698 692 736 780 784 787 776 765 737 710 712 715 681 646 642 638 672 706 740 774 751 729 706 683 661 638 615 592 584 576 568 560 564 568 556 545 574 603 566 528 492 518
341 518 539 560 545 530 546 561 552 542 564 585 563 542 521 499 477 455 448 441 476 512 517 523 470 417 422 487 533 579 539 498 450 403 426 450 459 467 461 455 461 468 490
336 490 511 476 440 419 399 423 447 456 465 451 438 512 586 596 545 490 496 486 416 373 431 510 529 476 424 448 472 426 379 384 388 393 398 428 459 457 394 371 409
331 409 476 542 567 531 479 426 436 445 455 465 438 411 385 358 361 364 367 370 375 380 415 450 422 394 380 367 385 402 420 437 447 456 435 415 397 380 393 406 435
327 435 464 462 461 424 386 349 312 355 398 410 423 402 382 392 401 356 311 316 322 358 394 430 466 510 555 512 469 426 444 458 472 458 444 481 517 487 456 456
322 456 456 462 469 476 482 422 362 314 327 376 365 340 316 349 383 386 389 400 411 392 373 374 375 376 377 414 451 488 526 495 464 434 403 380 357 334 311 313 315 318 320 283 246
317 246 242 299 350 339 317 294 328 362 366 369 399 428 426 425 400 375 380 385 423 461 429 396 409 423 436 449 479 509 489 468 465 462 433 403 383 423 463 442 406 371
312 371 418 466 477 427 412 396 417 438 408 378 391 404 386 369 356 343 360 378 380 382 385 387 409 431 457 422 358 294 297 300 324 349 373 398 388 378 368 358
307 358 344 330 346 362 362 363 363 364 363 362 361 361 386 410 385 359 364 368 373 377 371 364 387 410 405 399 393 388 434 481 457 433 421 409 427 445 405 365 356 346 349 352 355 358 368 378 388
301 388 398 387 376 366 355 401 447 442 438 436 434 432 430 417 404 421 439 391 343 295 248 275 302 329 357 327 297 318 339 388 437 395 352 312 272 302 333 345
297 345 358 371 384 397 409 451 492 482 442 384 388 418 449 432 416 412 407 403 399 367 336 355 374 413 452 441 429 388 347 357 366 359 351 343 336 340 344 375 406 433 399
292 399 352 335 343 351 330 310 345 380 365 349 292 235 213 251 353 425 404 323 314 366 417 406 372 367 372 377 341 305 269 233 249 265 311 358 407 457 415 374
287 374 353 331 341 350 354 358 362 367 349 331 313 295 305 315 315 285 275 325 358 361 346 362 377 362 357 382 422 401 313 225 210 256 304 351 372 393 387 380 374 368 363 359
282 359 384 410 347 283 250 217 219 221 273 326 329 332 336 339 334 330 325 321 292 262 250 298 321 344 372 399 408 418 397 376 376 375 374 373 367 361 324 287 356 425 477 469 442 415
277 415 435 455 464 474 433 392 379 366 326 286 271 316 358 400 405 411 416 422 391 360 325 351 399 447 448 449 405 360 311 323 371 418 419 419 393 367 314 262 257 313
272 313 335 357 376 395 414 433 430 427 424 421 457 493 496 439 366 353 353 353 299 245 247 311 339 368 400 432 477 522 510 438 398 357 401 444 465 426 356 347 376 405
267 405 387 369 378 388 350 313 273 293 309 326 308 290 273 255 277 299 352 404 401 398 422 446 427 348 303 258 277 297 346 396 391 386 381 375 354 332 311 290 266
262 266 243 220 196 245 293 345 337 271 205 229 313 388 403 364 325 337 348 329 310 333 357 381 404 393 382 371 360 355 350 345 340 328 316 354 392 391 389 357 326
257 326 331 337 342 348 317 286 326 366 431 495 489 483 451 418 416 413 407 401 395 389 358 328 297 267 282 298 314 329 353 376 369 362 347 332 317 303 309 316 292 268 274 281 287 294 351
252 351 408 394 380 381 383 384 385 367 349 381 413 451 489 511 472 417 362 334 305 292 278 315 382 445 457 428 369 310 281 285 319 349 348 319 321 356 392 399 406 455
247 455 504 502 500 484 467 451 435 437 440 412 354 326 348 370 342 288 264 271 277 272 266 261 256 297 338 329 320 336 352 368 384 413 442 450 408 338 298 309 320 309 298 287
242 287 277 273 270 337 405 403 401 396 392 401 379 344 360 416 441 419 396 419 472 487 450 416 381 344 306 303 300 348 396 422 448 444 439 409 379 399 420 402 385 368 350
237 350 349 347 346 344 346 347 349 350 352 354 355 357 344 331 319 306 323 340 357 374 361 349 367 384 395 405 415 425 413 400 418 436 419 402 385 369 380 391 403 414 417 419
232 419 392 364 346 327 339 351 352 353 353 354 383 413 442 472 436 401 397 392 411 430 399 338 265 253 295 368 424 420 401 382 351 320 290 259 301 343 332 260 247
227 247 295 373 420 421 422 421 421 435 449 464 478 421 364 378 392 372 351 331 311 326 342 327 312 326 340 354 368 336 304 341 378 358 308 270 294 300 306 325
222 325 375 416 397 347 297 274 312 366 420 424 428 402 376 390 404 418 432 396 361 325 289 285 282 278 274 295 316 336 357 377 397 367 336 358 380 351 323 294
218 294 265 287 308 292 276 290 304 339 375 381 387 422 457 442 427 405 384 362 341 342 343 379 353 322 291 363 435 478 461 447 433 438 443 447 452 425 398 371 344
213 344 331 318 352 385 443 440 380 320 315 311 306 301 308 316 323 330 324 318 312 306 284 261 268 275 316 356 397 437 409 381 403 425 465 505 474 443 401 358 403 448 470 431 375
208 375 320 283 247 247 308 372 436 454 471 445 419 362 306 312 318 323 329 333 337 341 345 367 389 410 432 383 334 301 329 360 391 376 360 359 357 355 353 344 335 326 317 308 298 289 280
202 280 296 311 327 343 358 374 390 405 409 412 415 419 436 453 440 427 394 360 280 200 192 245 264 283 291 300 339 378 376 373 371 368 396 424 379 273 225 237 282 327
197 327 308 289 300 311 313 315 347 380 396 412 398 383 415 446 447 448 400 353 303 312 339 365 328 291 282 333 380 428 429 431 365 300 279 318 324 329 347 365 387 348
192 348 329 310 291 272 269 327 385 383 358 333 354 376 397 418 439 460 426 391 356 321 289 257 275 293 275 256 288 320 335 350 432 514 530 485 474 463
188 463 435 407 379 352 360 369 377 386 377 368 359 350 360 369 379 388 395 402 436 470 447 364 311 319 321 324 330 337 347 356 366 376 389 402 416 429 468 508 476 445 433 420 408 396
182 396 352 308 295 281 278 275 244 213 247 311 362 353 319 285 278 271 301 331 361 391 375 359 343 327 321 316 311 305 300 294 289 284 326 369 412 455 449 444 439 434 412 391 370 349
177 349 357 365 374 382 414 447 429 410 425 440 424 408 398 387 377 366 350 334 317 301 297 294 290 287 278 270 314 419 493 506 466 426 401 376 350 325 367 409 399 327
172 327 320 374 424 413 357 301 313 324 365 407 418 430 410 391 372 353 349 344 340 336 302 267 304 340 367 393 370 346 343 341 369 397 402 407 382 357 366 376 355 334
167 334 346 358 370 382 339 296 254 213 232 282 349 355 317 279 288 298 307 316 326 335 318 301 300 298 342 386 399 413 410 407 389 371 360 349 369 388 375 361 347 333
162 333 337 341 345 348 366 383 370 357 375 393 396 399 370 340 341 342 354 366 329 261 210 219 263 307 303 299 268 238 225 272 354 404 383 361 368 374 341 307 303 300 322 345 367
157 367 390 371 353 365 406 428 389 369 379 379 379 331 282 276 270 294 318 346 374 372 370 388 407 396 354 309 325 353 381 345 280 227 235 295 355 389 422 420 418 445
152 445 473 452 430 409 387 402 418 402 387 387 387 387 387 375 363 418 473 468 403 366 390 448 476 452 398 329 290 305 349 379 378 366 354 333 312 291 270 293
148 293 316 339 362 387 411 404 398 412 425 388 351 332 313 324 336 363 390 401 413 376 338 333 389 443 436 380 356 387 448 462 446 428 441 465 488 490 492 443
143 443 394 404 415 441 467 475 484 492 501 469 437 392 346 355 393 421 387 330 303 347 390 389 387 384 380 382 353 336 379 427 445 413 381 387 392 398 404 411 419 396 373 386 400
138 400 383 336 327 378 410 412 388 363 310 257 222 246 269 292 304 346 405 403 376 349 348 347 376 405 440 414 352 320 359 397 382 368 353 338 330 323 285 247 274
133 274 301 328 355 335 315 294 274 261 248 266 283 262 240 249 258 284 310 316 352 388 363 328 322 359 395 383 372 360 347 335 323 338 354 318 283 254 225
128 225 226 228 230 232 235 239 257 305 339 313 245 177 179 241 330 358 313 238 191 205 233 262 288 314 290 266 284 303 325 346 361 436 483 469 416 393 400 407 369 331
124 331 363 396 422 448 424 400 379 359 369 380 387 394 370 347 369 391 413 435 396 358 322 286 267 279 310 280 241 233 274 315 294 273 284 356 403 390 364
119 364 339 351 363 375 387 363 339 345 352 359 366 399 433 434 375 315 317 331 345 332 320 283 246 221 257 317 316 282 249 220 190 191 192 234 275 312 350 370 329 236
114 236 174 191 239 241 243 264 285 276 266 315 363 412 460 435 411 386 361 372 382 363 314 288 322 357 331 251 201 223 306 377 387 364 341 361 381 371 331
110 331 307 343 390 408 420 433 444 455 407 359 341 324 318 312 373 434 471 448 387 327 306 285 315 344 317 289 313 336 371 407 392 377 338 300 292 284 295
105 295 307 315 323 369 353 265 176 155 194 264 273 283 293 299 306 323 339 356 372 320 267 264 262 247 232 213 255 294 333 345 357 344 331 318 305 347 390 361 333
100 333 337 340 343 346 328 310 292 274 247 221 282 343 400 397 378 358 354 350 315 281 254 227 230 233 236 239 293 346 360 374 358 342 317 291 317 342 336 331 326 321 340 359 378
95 378 397 409 420 431 443 433 424 414 405 347 290 228 228 257 287 290 294 286 278 301 324 328 333 334 335 333 280 238 227 270 313 307 301 311 321 331 341 348 356 363 370 370 369 369 369 371 374 377
89 377 380 375 370 395 421 396 371 377 383 391 399 358 318 342 396 415 383 323 314 340 337 314 291 316 342 325 308 290 273 285 297 309 321 313 306 298 290 247 204 211 218 255 292
84 292 298 305 318 331 394 458 490 521 486 450 431 463 511 530 472 384 351 368 377 335 266 248 283 318 306 264 238 263 308 353 343 332 322 311 296 280 295
79 295 310 318 327 335 344 327 311 264 217 242 268 293 318 309 301 322 344 334 324 314 304 314 324 304 284 272 261 279 298 347 396 374 353 321 288 327 365 377 388
75 388 399 410 400 389 328 266 240 215 239 264 293 323 301 280 260 241 221 202 234 267 269 271 273 276 279 282 288 295 332 369 377 385 393 401 386 372 357 343 329 316 272 228
70 228 249 270 291 313 332 351 371 390 341 292 294 295 303 311 288 265 276 286 296 306 329 351 373 395 397 398 369 340 329 318 307 296 292 287 283 278 333 388 372 357 341
65 341 325 310 294 316 337 328 319 330 341 382 423 395 367 369 372 346 321 295 269 308 347 386 425 412 400 388 375 376 378 409 441 443 444 446 448 440 432 424 415 390 364 338 312
59 312 319 326 333 339 332 325 348 372 340 308 292 337 376 414 386 358 349 341 363 385 375 365 325 284 291 298 305 312 328 344 360 376 416 457 502 486 405 324 253 283 353 424
54 424 431 437 444 452 409 366 356 346 366 386 376 365 354 344 327 310 323 337 374 412 399 385 395 404 413 423 386 349 343 336 338 339 370 402 411 420 428 437 415 393 370 348 326
49 326 304 281 259 304 348 389 430 489 487 448 410 422 433 394 356 384 413 409 345 312 340 330 320 283 246 240 233 281 329 347 365 342 319 311 303 341 379 366 353
44 353 369 386 402 419 395 370 346 322 327 332 367 403 429 455 451 447 474 502 476 390 347 365 395 426 418 411 377 343 323 364 379 333 266 259 265 271 244 217 206 194
39 194 234 273 332 331 311 292 340 388 416 445 457 409 347 286 291 297 350 404 441 417 370 323 323 323 321 319 333 346 324 301 366 431 462 432 406 381 342 303 315
34 315 327 315 303 322 340 328 315 318 320 318 316 314 311 283 254 255 257 271 285 268 252 250 247 245 242 255 269 282 295 292 288 284 280 291 302 313 323 345 366 336 307 300 293 316 339
29 339 340 341 312 283 285 286 316 346 328 280 235 241 309 376 425 423 383 343 299 256 233 210 237 295 323 300 277 254 263 273 283 293 291 289 318 346 392 438 412 387
24 387 344 301 289 276 283 290 297 304 315 326 307 288 324 360 345 300 281 313 343 322 289 256 271 286 333 380 405 380 332 285 264 244 250 255 311 367 349 331 312
19 312 294 314 333 353 373 356 339 322 304 305 305 321 337 334 330 357 385 407 430 438 445 463 481 448 415 386 356 311 267 245 223 232 240 260 279 251 223 218 263 297
14 297 300 290 281 269 257 230 202 226 249 293 338 382 427 408 390 341 292 277 261 246 231 236 241 297 353 393 433 443 453 392 332 302 272 281 291 301 310 296 282
10 282 267 253 296 339 361 334 267 230 245 290 313 305 286 267 287 306 324 341 322 272 211 200 252 303 286 240 220 251 282 263 237 241 246 220 192 214 292
5 292 340 307 244 215 238 276 285 293 331 368 354 320 286 304 323 341 359 330 300 271 241 290 338 357 375 395 415 404 393 381 370 358 346 321 297 323 349
1 349 332 316 299 282 230 178 168 209 267 325 355 386 382 378 374 370 323 277 260 244 235 226 268 310 310 309 309 309 310 310 311 312 353 394 404 414 358 302 276 250 238 226 244
-5 244 262 279 296 314 331 388 445 452 459 445 431 418 404 372 341 379 418 405 391 348 304 324 345 335 325 333 342 350 358 357 355 403 452 416 380 344 307 299 290 312 333
-10 333 362 391 390 389 378 366 355 343 342 342 290 239 240 242 274 305 307 309 312 314 347 381 384 388 330 272 265 257 295 332 340 347 336 326 315 305 291 278 264 250 318 386 404
-15 404 421 394 366 339 312 358 404 450 496 485 474 433 392 353 314 305 296 282 269 285 301 303 304 305 307 327 348 369 390 349 309 269 228 255 282 262 242 228
-20 228 274 316 358 363 367 372 377 391 405 389 373 343 312 332 352 355 358 361 364 282 201 176 212 250 288 299 311 303 295 318 340 378 415 366 316 272 289 359 429 451
-25 451 411 355 300 286 273 259 246 277 309 310 311 357 402 417 432 410 387 364 341 352 362 372 382 378 375 371 368 360 352 295 298 350 402 366 331 330 330 329 329 357 386 415
-30 415 443 459 474 439 404 385 367 364 361 383 406 378 350 343 335 328 321 324 327 315 303 345 388 391 344 304 314 323 332 343 355 348 290 252 265 314 333 316 299 310 321
-35 321 326 331 336 341 352 363 374 386 406 427 427 377 333 319 315 311 295 280 356 432 456 480 453 426 403 379 385 392 356 319 313 307 332 357 294 231 205 230 274 288 286
-40 286 284 265 247 254 262 285 308 290 273 286 298 290 282 325 367 366 364 378 392 393 394 394 395 350 305 260 215 197 178 210 242 269 296 349 403 417 381 354 357 352 317 303
-45 303 340 378 416 407 398 379 359 370 411 444 426 387 349 353 358 377 396 386 376 336 295 301 307 283 259 256 253 281 309 359 409 389 368 343 319 263 208 231 253
-50 253 276 299 307 315 323 331 324 316 308 301 284 268 282 295 314 334 282 230 212 193 245 297 311 324 308 291 304 316 359 402 416 430 393 357 380 404 427 450 476
-54 476 501 476 451 450 449 418 388 346 305 294 284 247 210 244 278 288 297 306 316 350 384 347 310 335 359 353 346 323 300 277 254 234 215 246 277 314 352 389
-59 389 427 391 355 350 345 370 396 421 447 408 369 329 290 282 274 296 318 303 288 273 258 303 349 343 338 288 238 219 200 272 344 366 388 385 382 414 384 333 282
-64 282 297 313 275 238 237 297 337 376 369 362 325 289 303 317 334 351 338 325 299 273 247 221 231 242 252 262 261 259 258 257 263 269 275 282 305 328 351 374 345 317 289
-69 289 261 289 317 299 280 307 394 451 448 422 396 366 336 337 338 339 340 344 348 352 356 350 345 370 394 389 384 378 373 380 387 344 300 282 264 250 236 183 191 255 320 305 291 272
-74 272 315 355 395 352 309 301 353 406 398 356 313 318 322 336 349 363 377 381 385 363 340 300 320 357 393 376 358 340 323 339 355 371 387 376 364 383 401 372
-79 372 343 344 345 338 330 369 408 422 375 315 255 257 320 379 438 423 409 424 440 420 400 379 359 343 326 339 353 367 381 395 410 393 376 360 343 346 349 352 355 361
-84 361 367 403 440 438 436 405 373 373 374 375 376 378 380 382 384 343 301 276 311 353 394 349 304 306 308 311 313 271 228 216 204 243 281 253 225 232 300 418 476 431 387 369 351
-89 351 371 392 412 433 380 326 306 346 387 366 317 268 251 295 339 323 286 248 278 308 294 281 314 347 363 318 307 296 283 270 257 244 220 196 172
-93 172 148 194 240 235 231 244 257 270 283 280 277 305 333 300 268 266 264 244 225 236 246 259 272 256 240 277 345 424 452 420 387 381 406 404 352 302 303 377 450 477
-98 477 503 456 409 362 314 305 296 317 338 329 321 312 303 333 363 363 362 349 336 354 371 371 371 398 424 446 418 347 276 252 228 235 242 239 237 285 333 324 316 335 354 348 291 235
-103 235 229 263 296 283 269 254 239 273 306 336 336 321 356 390 374 358 392 448 454 421 388 417 446 444 443 444 445 445 446 416 387 387 388 362 336 311 285 288 291 263 236
-109 236 244 252 261 269 319 370 370 340 324 360 412 434 382 329 327 386 448 449 418 386 364 341 318 295 338 381 394 406 364 322 280 237 273 309 317 325 323 352 398 383
-113 383 373 362 348 334 305 276 298 320 336 352 368 384 400 416 432 448 437 426 462 498 468 376 313 311 335 330 324 349 395 381 319 316 376 436 426 356 320
-118 320 344 367 329 290 282 300 288 253 217 250 283 305 326 347 368 369 370 340 311 274 238 197 218 268 317 320 323 308 294 279 264 281 297 313 329 336 343 303
-123 303 263 258 313 369 364 322 280 264 248 274 299 294 289 249 208 197 187 219 251 282 314 334 353 372 392 364 336 358 381 370 360 350 339 382 425 429 382
-127 382 326 320 351 383 341 269 234 250 293 305 287 270 256 242 248 303 347 340 296 281 308 305 255 235 280 355 382 378 403 429 414 349 308 337 402 417 379
-132 379 341 302 313 353 392 385 347 344 392 438 433 385 338 317 297 316 336 357 379 386 424 475 476 410 374 387 401 368 304 278 303 313 294 275 288 318 318 307
-136 307 295 287 278 270 261 292 322 303 283 296 309 322 336 288 240 242 244 241 237 284 331 363 394 395 396 403 410 417 424 455 485 424 364 345 326 338 349 376 403 379 355 343
-141 343 331 350 368 350 333 315 298 292 286 311 336 357 379 350 321 342 362 353 343 348 353 328 272 254 286 336 355 341 328 312 297 294 291 287 284 284 283 313 343 355
-146 355 367 409 451 443 435 380 325 324 374 424 423 364 304 274 244 273 332 372 362 328 294 307 320 337 355 342 329 369 408 377 346 340 334 328 322 319 316 314 311 326 342
-151 342 358 373 356 339 372 405 396 386 427 468 478 489 449 409 374 339 375 411 397 382 378 404 415 375 336 347 390 403 365 297 259 271 303 335 329 323 316
-156 316 310 309 308 306 305 304 303 302 300 291 281 271 261 277 292 261 230 268 368 419 409 369 359 381 403 406 441 492 482 407 332 304 275 276 277 304 332 346 298 268 269
-161 269 309 349 343 336 351 397 429 400 357 313 337 360 359 357 305 252 234 216 268 350 418 426 379 331 333 335 337 339 356 373 391 408 373 338 273 208 205 201 228 254
-166 254 278 303 297 291 262 234 275 347 387 366 360 385 429 412 360 309 324 340 325 310 311 312 313 314 290 266 293 320 351 382 363 344 359 375 340 305 310 315 321 328
-171 328 347 396 412 367 343 319 292 265 278 291 305 318 311 303 266 228 232 237 243 250 253 288 333 328 299 270 268 266 275 283 292 301 310 320 329 338 375 411 429 396 346 347 366 354
-176 354 307 290 346 401 392 383 374 366 352 338 296 254 237 250 277 255 207 209 230 252 233 214 246 278 276 274 273 271 222 173 195 217 245 273 328 384 384 335 296 288
-181 288 285 281 279 277 274 270 266 262 243 225 206 188 198 208 266 324 330 285 241 247 267 288 281 274 294 314 304 293 301 310 318 326 323 320 317 314 289 263 288 313 302 291 311 330 312
-186 312 294 306 318 326 334 342 350 384 418 421 425 411 397 383 369 333 298 235 173 170 227 270 282 284 317 367 356 313 300 317 334 330 325 321 317 270 222 226 229 203 177 150
-192 150 124 124 124 123 123 144 164 185 205 197 190 232 275 311 348 381 413 442 411 366 351 345 338 303 268 278 288 298 308 317 326 285 243 237 232 277 322 370 417 435 452
-197 452 422 391 391 391 409 427 394 362 373 384 345 276 232 249 297 315 310 305 298 292 273 255 267 279 318 357 347 338 349 391 424 395 371 407 440 411 338 265
-201 265 259 253 267 281 295 310 295 281 298 314 287 259 262 265 273 280 334 388 386 322 229 196 197 198 250 301 330 299 251 203 201 199 247 296 320 345 368 390 394 368 322
-206 322 338 381 395 358 321 308 296 283 270 251 233 244 256 294 332 339 347 337 328 318 309 297 285 304 322 309 296 283 270 320 369 388 407 393 379 393 408
-211 408 410 382 337 352 397 441 399 356 284 213 178 204 262 320 331 342 352 361 371 380 359 338 316 295 298 300 303 306 304 302 331 359 341 323 305 287 284 281 307 364
-216 364 376 327 248 200 215 261 280 269 267 296 337 377 376 374 373 372 320 268 267 265 260 255 220 184 194 203 212 222 256 290 294 297 276 255 265 274 261 247 230 274 329 384
-221 384 392 401 428 456 432 409 396 382 338 294 269 244 290 335 347 358 397 435 497 499 445 390 370 350 330 311 354 398 426 393 346 299 279 259 255 250 212
-225 212 234 292 350 322 293 279 266 252 238 250 261 303 344 334 324 314 304 291 279 236 194 226 259 291 324 341 358 375 392 348 304 310 316 343 369 396
-230 396 422 426 431 384 338 295 251 279 306 320 334 318 302 309 315 322 329 329 329 262 195 168 200 250 299 313 328 312 296 285 273 261 250 273 296 289 282 259 237 244
-235 244 252 238 224 211 199 234 300 335 309 266 253 270 286 301 315 300 254 218 242 280 318 309 299 289 280 294 308 323 337 331 324 287 251 276 301 316 302
-239 302 271 300 341 352 311 271 258 246 279 311 328 285 246 237 278 319 306 292 278 264 244 224 254 285 279 274 268 263 265 267 269 271 231 190 185 240 279 288 267 246
-244 246 252 258 265 271 252 233 223 244 274 243 181 148 189 229 221 213 246 279 262 245 267 289 312 334 337 340 296 252 254 316 380 384 361 370 404 409 369 329 288 246 251
-249 251 255 290 325 298 271 275 278 268 258 249 239 241 244 247 250 292 334 345 357 328 298 282 326 368 350 263 207 241 305 322 278 278 338 378 388 364 341 286 230
-254 230 194 157 151 145 190 235 249 264 271 278 284 291 284 276 270 265 262 289 334 318 280 242 200 158 179 201 223 244 253 261 300 339 324 309 294 280 263 246 280 314 333
-259 333 352 320 288 270 252 234 217 227 237 248 258 273 288 272 256 258 260 261 263 248 234 250 266 249 232 266 299 297 294 319 343 355 307 275 274 301 327 304
-263 304 282 262 243 223 204 172 140 178 215 209 173 168 225 272 289 256 223 205 187 200 212 222 232 272 312 285 257 280 303 337 371 335 298 274 249 255
-268 255 261 229 196 194 192 209 226 243 260 275 290 335 380 398 416 363 309 284 258 323 389 380 371 346 322 301 279 273 267 241 214 203 192 215 238 230 223 201 180
-273 180 189 197 234 271 258 244 207 169 147 124 162 201 224 247 299 352 334 316 259 203 177 151 191 231 241 251 265 278 322 366 311 255 230 205 237 268
-277 268 270 271 269 266 294 322 306 291 291 290 318 346 323 301 310 320 330 339 365 390 401 411 354 297 290 283 282 281 281 280 228 176 195 214 245 276 276 277 254 231 224 216 210 204 227
-282 227 251 241 232 214 257 308 298 255 212 214 217 234 251 280 309 308 307 302 297 266 234 188 203 254 306 328 350 342 334 307 279 318 357 390 362 318 274 231 188
-287 188 199 269 334 338 329 320 333 347 309 272 256 239 253 267 267 267 267 267 242 216 190 164 192 219 247 274 255 236 247 258 260 262 234 205 228 250 242 233 276 318
-292 318 344 310 263 215 215 214 166 118 86 114 172 229 260 292 331 370 380 389 335 281 257 233 223 212 228 244 288 271 238 205 241 278 284 290 304 319 283
-297 283 247 234 221 193 165 190 216 241 266 278 290 302 314 297 279 293 306 364 422 410 397 346 294 273 252 288 324 289 225 192 210 265 290 280 270
-301 270 231 193 160 178 219 259 260 261 262 263 245 227 238 250 280 310 309 308 272 235 229 222 240 257 274 291 277 263 219 175 156 136 165 195 203 181 147 165 224
-306 224 284 297 309 320 331 356 382 365 347 345 343 298 253 229 255 287 289 281 273 274 276 247 218 229 241 283 325 309 293 278 262 293 324 284 214 174 185 213
-310 213 211 195 179 192 204 233 261 320 379 370 360 351 341 338 335 302 268 267 265 263 262 242 222 233 244 238 232 242 251 271 290 238 187 163 139 185 232 274 316 328 340
-315 340 358 376 394 412 360 308 256 204 222 240 258 276 261 247 232 217 227 237 247 258 302 347 362 376 379 381 384 386 378 370 332 293 256 218 211 204 228 251 301
-320 301 351 348 286 269 314 373 372 318 264 277 290 334 377 378 380 351 323 335 348 311 273 279 285 264 243 247 311 358 375 373 371 367 363 337 311 285 259 273 287 300
-325 300 314 315 315 346 377 326 275 240 204 209 214 249 284 290 295 270 245 230 215 230 245 264 284 288 292 267 242 247 252 215 178 192 206 248 290 282 273 260 247 249 251 245
-330 245 240 234 228 219 211 232 254 262 269 210 151 83 76 105 135 188 241 306 370 355 279 203 187 180 172 169 165 224 284 293 302 316 329 374 418 409 400 361 322 322 321 291 260 214
-336 214 168 173 178 188 199 240 280 283 285 287 290 245 200 171 203 221 239 245 252 230 208 182 217 249 281 246 211 144 77 68 119 167 215 237 259 264 269 224 178 212
-340 212 245 264 282 262 241 236 231 278 324 371 418 413 409 374 339 341 342 313 284 254 224 224 224 233 242 251 260 260 260 260 259 277 295 298 301 277 253 259 265 289 313 287 261 255 249 243
-346 243 237 223 208 209 210 230 250 199 149 125 101 148 195 237 279 290 302 305 308 342 376 370 365 360 355 331 307 283 259 243 227 241 256 294 332 340 347 345 342 354 367
-351 367 361 356 350 345 333 320 308 296 298 300 287 274 271 268 234 201 191 182 203 223 232 240 279 317 300 283 282 280 270 260 265 270 278 286 294 302 295 288 251 214 231 249 281 314 338
-357 338 362 356 350 303 256 239 222 251 280 239 197 174 152 159 167 156 145 104 63 105 147 159 171 163 155 218 280 275 270 280 290 289 288 287 286 298 311 293 275 329 384
-362 384 367 351 340 328 317 305 333 361 388 416 414 412 410 407 354 300 297 294 303 312 293 273 327 411 446 419 395 432 465 438 385 333 347 362 336 310 284 258 257
-366 257 257 303 349 360 310 278 275 289 303 319 335 355 374 364 324 288 313 336 298 229 161 182 264 287 250 183 147 179 212 246 280 299 318 336 355 334
-371 334 313 292 271 313 355 367 379 373 367 330 294 343 392 407 361 304 277 279 282 279 277 275 273 241 209 177 145 166 188 210 232 272 313 324 334 302 270 269 268 251
-376 251 234 248 262 264 267 239 211 179 147 166 185 225 264 274 283 310 337 314 290 338 385 382 379 388 398 357 316 281 246 241 236 248 259 270 281 273 265 308 351 346
-381 346 341 285 229 216 202 189 176 135 94 125 155 236 317 287 256 265 274 253 232 206 180 204 228 253 277 251 225 217 210 232 255 261 267 273 279 288 297 306 315 310 305 299 294
-386 294 293 292 261 230 244 258 271 285 284 282 281 280 293 306 319 332 313 295 306 317 321 325 298 272 279 287 294 302 264 226 188 150 126 102 148 195 184 173 162 151 194
-391 194 237 281 324 270 215 231 247 252 258 263 268 329 389 399 410 404 398 392 386 362 337 384 430 398 366 362 358 322 256 202 208 223 207 178 210 283 357 361 304 240 237
-396 237 266 295 304 313 323 332 288 244 200 156 172 188 204 220 217 214 161 108 98 89 110 131 151 171 191 211 215 219 223 227 245 264 282 301 284 268 251 235 228 222 262
-401 262 302 309 255 205 154 137 119 131 144 185 227 269 310 300 290 280 271 251 232 212 193 208 223 207 192 214 236 259 281 301 321 311 301 261 220 251
-405 251 281 268 255 242 229 288 347 335 323 315 307 298 290 310 330 350 370 378 385 392 399 351 304 308 311 277 243 240 237 225 214 232 251 285 319 353 387 341 294 278 262
-410 262 270 278 255 233 240 247 254 261 255 248 292 337 321 306 291 275 237 199 192 184 169 155 175 256 303 320 327 335 329 324 318 312 314 316 318 319 318 317 316 314 251 187 159 191 236 251 256
-416 256 262 245 228 211 194 210 227 213 199 170 141 181 252 305 297 256 245 243 212 182 183 182 181 152 123 181 239 297 355 341 327 313 299 289 278 238 197 211
-421 211 226 209 193 185 177 219 261 265 270 274 278 270 261 253 244 221 198 175 152 167 181 166 150 151 153 154 156 160 164 169 173 188 203 219 234 262 291 289 287 277 268 258 249 214 180 196
-426 196 212 209 207 204 201 268 336 386 377 353 330 353 376 368 360 352 345 322 299 242 245 296 348 332 316 323 329 336 342 302 262 222 182 214 246 248 250 229 208 218 228 209 190
-432 190 171 152 170 189 257 326 335 344 302 260 244 227 261 294 297 299 301 303 310 318 325 332 316 301 285 269 251 232 214 195 213 230 248 265 238 212 155 98 20 -56
-436 -56 -36 44 99 154 209 264 337 349 325 301 341 381 364 286 226 166 133 100 124 148 202 256 265 273 251 229 215 201 188 174 161 149 137 124 117 109 152
-441 152 195 209 223 207 190 232 275 317 359 332 304 277 250 286 321 286 251 235 219 203 187 180 173 197 220 209 197 186 175 199 224 248 273 234 196 229
-445 229 262 248 234 220 207 254 300 297 293 283 273 262 252 261 271 280 289 266 243 220 198 190 183 176 169 202 235 237 240 212 184 227 270 258 246 234 221 260 298 336
-450 336 374 329 284 290 296 334 373 360 348 310 272 234 195 204 212 190 168 178 188 198 208 186 164 172 181 173 166 158 151 215 280 344 408 382 356 361 365 320 274 229 183
-455 183 197 212 226 240 238 235 262 290 272 254 235 217 236 254 242 230 221 212 203 195 222 249 276 303 291 280 268 256 229 202 174 147 135 122 141 159 180 202
-460 202 224 246 267 287 278 268 258 248 239 229 255 281 236 191 205 218 263 307 281 256 281 306 287 269 281 292 281 269 258 247 260 274 288 302 323 344
-464 344 295 245 233 220 238 256 271 287 251 216 171 127 153 178 206 233 260 287 295 303 280 257 246 235 254 273 257 242 196 150 168 187 205 223 224 225 225
-469 225 226 257 289 270 250 243 235 258 280 320 359 399 439 409 379 349 319 289 259 259 259 259 259 229 199 199 199 199 199 191 182 204 226 249 273 265 258 270 282 294 305 292
-474 292 279 267 254 261 268 245 222 209 195 231 266 264 232 211 251 284 288 261 235 252 269 256 243 318 392 379 264 187 211 240 209 159 170 193 217 240
-478 240 263 277 261 242 284 326 308 254 230 256 283 308 334 363 332 262 193 210 227 234 240 246 253 286 319 322 295 254 274 305 306 253 200 217 233 244 254 235
-483 235 216 197 179 191 203 260 316 356 335 301 267 300 333 334 336 337 338 343 349 354 360 336 313 289 265 311 357 332 308 272 237 232 227 204 181 189 196 186 176 216 257
-488 257 278 300 271 242 237 232 257 283 292 302 312 321 339 356 323 290 236 183 220 257 240 223 236 250 271 292 283 273 245 217 219 222 231 240 249 259 263 268 243 217 231
-493 231 246 230 214 182 151 210 270 282 295 256 218 234 250 266 281 266 251 267 282 272 261 281 302 307 311 246 180 167 154 191 228 250 271 262 254 255 256 257
-498 257 258 299 339 329 319 302 285 269 252 240 229 288 347 345 344 342 340 313 286 259 232 198 164 181 197 227 256 285 314 259 204 200 195 230 266 301 336 331 326
-502 326 321 315 277 239 201 163 180 197 248 239 199 159 186 214 229 245 234 223 180 197 267 337 363 328 296 265 279 292 306 319 283 246 260 274 238 202
-507 202 199 256 269 221 203 246 299 292 252 212 219 226 232 239 266 293 289 286 276 267 257 248 253 259 234 209 247 284 321 359 336 313 291 268 284 300 316 331 302 273 244
-512 244 215 250 284 288 292 270 249 227 205 240 274 305 336 363 329 279 229 228 227 175 123 135 146 158 169 205 242 278 314 330 346 365 325 271 218 232 246
-516 246 221 197 203 209 206 202 169 135 137 139 141 143 122 101 147 193 236 220 186 153 149 145 154 223 293 303 279 256 245 234 223 212 241 270 232 194 199 265 280 234 190
-521 190 145 147 148 162 177 191 205 211 217 192 168 131 94 128 161 195 229 232 235 245 255 295 336 346 356 315 274 265 255 219 183 151 179 225 270 258 246 234
-526 234 222 253 284 285 286 285 285 284 284 241 197 204 211 249 286 320 354 411 407 330 254 218 244 265 287 283 279 244 209 189 168 147 127 155 184 247 249 224 200 202 204 220
-531 220 237 223 209 230 250 254 197 153 109 96 82 78 135 188 241 208 175 139 163 188 213 196 178 183 248 313 317 311 305 326 346 315 284 253 221 200 178 206
-536 206 235 228 221 244 267 278 290 327 365 345 264 230 256 318 318 286 254 270 287 273 259 247 234 222 210 232 253 278 243 205 168 197 227 239 252 234
-540 234 216 186 156 126 95 142 189 235 282 303 324 275 225 217 209 201 193 171 149 157 166 184 202 189 177 159 141 153 165 184 203 260 256 192 189 255 321 323 264
-545 264 206 208 248 287 330 374 404 435 415 395 353 310 298 286 263 240 217 194 220 246 221 197 220 244 267 291 328 365 386 346 317 288 285 283 261 238
-549 238 263 288 295 242 189 196 248 300 299 237 186 134 150 166 190 215 209 204 185 166 177 188 208 228 248 268 285 302 268 235 201 167 204 241 272 303 303 304
-554 304 304 304 258 211 181 212 239 265 253 240 197 154 161 168 205 242 229 215 202 188 172 156 171 185 193 200 207 215 172 130 124 178 218 257 249 242 258 275 261 247
-559 247 259 271 313 355 305 255 221 248 290 331 290 248 204 221 271 321 314 246 178 171 194 217 244 271 315 360 334 307 264 221 174 188 235 282 242 202
-563 202 226 250 227 204 178 211 230 218 192 196 212 227 195 163 162 161 205 250 244 238 243 248 253 258 249 240 231 222 272 323 324 324 347 370 393 416 434 452 418 322 239 216
-568 216 206 196 204 213 252 291 265 239 263 287 297 306 316 325 320 315 263 211 190 230 281 301 294 256 216 206 185 163 146 128 170 243 284 265 221 207 241 276
-573 276 247 188 178 230 285 280 244 238 276 285 261 238 229 219 210 201 228 255 212 168 184 201 217 233 242 251 230 208 174 139 155 171 208 245 231 217 220 224 227 230 265
-578 265 300 306 313 294 305 334 302 242 182 155 189 220 251 235 219 212 204 197 189 155 121 138 154 164 175 185 195 164 133 137 202 237 242 238 234 223 211 170 128 153
-583 153 178 202 227 254 281 277 274 271 267 264 260 295 330 331 272 198 184 203 221 202 182 192 203 229 255 231 207 242 276 311 346 320 294 298 302 274 246 248 251 266
-588 266 281 266 250 228 206 153 101 94 87 111 135 151 168 184 201 233 265 267 269 283 296 259 222 191 160 179 198 228 258 288 318 344 369 345 320 287 255
-592 255 252 250 254 257 261 264 266 267 315 362 365 307 265 255 234 213 195 176 208 239 241 242 287 332 308 284 276 298 290 222 140 119 110 102 137 172 207 242 250 258 272 225 166
-598 166 138 140 141 102 62 77 153 192 200 210 250 273 265 229 223 258 293 300 306 302 297 262 227 244 261 247 233 231 228 256 283 281 279 277 275 244 214 214 213 257 301 296 292 268
-603 268 274 300 265 208 181 204 227 224 222 249 277 292 307 322 337 326 315 305 294 283 272 262 251 256 261 266 271 217 163 159 155 182 209 267 324 327 329 332 334 280 227
-608 227 203 180 149 118 137 157 155 153 150 148 124 101 77 53 88 123 128 133 155 177 199 221 224 227 234 240 253 325 383 380 320 260 226 192 146 100 146 191 240 290
-613 290 323 355 311 236 193 211 208 174 144 145 169 193 204 215 227 240 222 204 194 183 188 193 201 209 217 225 212 200 255 310 323 276 242 269 280 260 229 228 252
-618 252 276 271 267 269 271 303 336 360 384 404 424 410 336 273 271 327 322 248 174 161 209 252 296 324 351 308 235 175 174 172 140 100 91 133 176 181 187 192 197 229 261
-623 261 293 325 306 288 270 252 253 255 226 197 194 192 189 187 202 218 204 160 113 127 155 183 165 147 159 171 163 155 178 200 231 262 263 264 237 211 169 127 146 165
-628 165 154 143 159 174 190 206 251 296 311 326 284 243 202 160 162 164 165 167 142 117 123 128 143 157 201 275 325 305 259 244 242 241 212 182 174 166 158 149 177 205 233
-633 233 261 289 318 316 314 277 240 218 197 196 195 193 192 180 167 202 236 257 227 196 215 255 266 226 185 197 209 172 135 147 190 215 190 173 186 199 181 176
-637 176 222 267 262 222 212 212 212 209 207 206 206 200 225 261 247 199 151 191 231 251 272 242 212 183 154 176 197 241 284 313 341 291 242 222 203 185 167 200 233
-642 233 228 224 219 214 162 109 147 186 194 203 211 220 234 248 262 276 275 275 274 273 257 241 254 267 268 239 226 263 300 287 256 256 252 218 172 127 151 175 229 284 306 327
-647 327 346 365 349 282 216 199 201 203 209 214 219 224 229 234 215 196 176 157 192 228 233 239 244 249 254 259 237 214 164 164 206 249 224 168 151 185 218 201 180 188 207 226 219
-652 219 212 174 137 123 109 95 82 133 184 207 230 237 274 288 231 142 124 173 221 221 221 251 281 274 266 258 251 244 238 232 225 205 185 215 245 293 341 338 335 326 316 307 298
-658 298 290 282 274 266 234 201 169 187 221 225 199 173 188 203 217 232 237 241 246 250 230 210 221 231 233 235 237 239 209 180 191 252 308 334 310 285 272 258 245 232 213
-663 213 194 205 216 201 186 201 216 209 202 195 188 180 172 164 155 204 252 250 248 256 263 240 218 175 132 123 114 140 216 290 314 273 201 146 141 152 162 176 190 175 161 146
-668 146 131 192 253 255 206 179 202 226 198 154 160 203 214 201 188 221 254 248 212 212 262 321 328 277 225 223 220 247 274 277 280 310 340 347 304 242 210 228 246 235
-673 235 225 204 184 214 244 291 338 314 291 272 253 237 220 215 239 281 263 232 201 197 193 173 154 165 176 191 207 193 179 154 130 156 182 220 258 246
-677 246 204 159 175 222 269 236 142 79 77 109 141 146 152 191 231 240 250 246 242 211 181 191 261 331 340 274 209 210 211 195 179 163 148 163 178 194 209 224 240
-682 240 255 270 235 200 164 129 99 68 34 61 117 173 162 150 160 170 180 190 153 116 109 103 117 131 115 99 103 106 161 215 260 305 299 293 270 247 224 201
-687 201 240 280 285 229 192 186 189 192 201 210 220 229 233 237 210 183 163 143 173 203 199 195 191 187 172 156 141 126 130 134 108 82 88 94 130 167 153 138 195 251 262 273 254
-692 254 235 250 265 250 234 226 218 209 201 181 161 212 263 239 215 221 228 257 286 316 345 293 240 188 136 137 138 139 140 159 177 195 213 245 276 216 157 138 119 150
-697 150 182 188 195 202 208 243 277 312 346 311 275 270 264 263 261 260 258 269 279 259 239 294 348 332 316 304 293 282 270 238 205 202 200 214 228 243 257 274 291 257 223
-702 223 221 220 218 216 171 126 131 136 186 235 214 193 178 164 150 135 143 151 190 228 202 175 199 223 255 288 290 293 256 219 233 247 230 213 226 239 244 249 238 228 264
-707 264 300 286 272 229 187 161 196 232 268 258 248 256 265 203 141 156 172 123 75 74 174 290 304 289 274 268 262 249 236 273 249 181 112 131 150 174
-711 174 197 205 213 224 234 218 202 173 204 266 268 222 176 177 178 178 179 209 240 254 268 282 296 279 262 276 289 276 263 281 298 321 343 331 320 281 182 110
-716 110 140 201 262 222 182 155 188 218 247 253 258 233 209 192 175 188 202 163 125 86 48 97 145 193 242 231 219 223 227 237 247 207 166 158 150 159 168 168 199
-721 199 228 207 167 158 217 276 282 237 191 145 136 127 169 210 234 258 251 245 230 216 202 188 172 157 141 126 150 174 183 192 197 203 178 153 152 151 180 209 184 159 164
-726 164 169 210 251 292 333 333 333 303 273 243 213 214 214 231 248 264 279 239 169 138 157 189 220 240 259 289 319 299 278 241 204 198 221 239 207 137 97 121
-730 121 144 121 98 126 185 225 215 180 145 138 131 116 101 116 131 157 183 141 99 85 121 144 167 192 218 244 270 220 171 152 133 153 174 179 185 194 204
-735 204 244 284 308 332 326 320 301 283 265 247 230 213 227 240 247 254 231 207 221 234 263 292 252 212 172 132 132 131 131 130 107 84 93 102 136 201 252 243 184 124
-740 124 114 165 213 200 154 108 108 108 108 108 118 128 205 282 298 254 180 167 179 191 177 163 180 197 213 230 215 199 235 270 283 296 278 261 202 144 116
-744 116 87 96 105 145 184 203 223 221 250 274 237 201 196 219 212 193 175 198 221 214 207 211 214 187 160 154 148 142 136 113 91 99 108 148 188 180 172 189 237 272 246 204 163
-749 163 149 134 155 177 198 220 238 256 289 322 278 235 221 237 226 154 84 75 149 223 251 279 270 262 254 246 217 188 144 100 107 114 148 181 230 218 190 161
-754 161 189 216 193 170 156 141 142 143 173 203 166 128 149 230 264 237 188 200 244 288 276 263 277 290 296 240 189 137 141 145 165 184 192 200 178 156 183 210
-759 210 237 264 280 297 298 299 302 306 276 186 122 119 185 251 262 212 149 87 118 210 302 334 333 332 280 228 184 199 246 231 177 123 123 182 238 294 338 321 311
-763 311 302 319 335 267 198 145 153 192 230 222 214 202 191 180 168 168 167 218 268 260 252 244 236 274 312 320 327 258 189 135 81 86 90 145 200 218 235 237 240 261 283 290 297 268
-769 268 239 211 182 167 152 137 122 118 114 110 105 97 88 131 173 200 228 225 222 238 253 218 183 171 159 177 195 213 230 261 292 270 218 199 241 299 358 330 302
-774 302 262 222 198 173 181 189 212 236 250 263 247 201 151 162 207 252 272 293 298 303 217 131 98 126 172 157 132 138 151 164 150 136 176 246 283 259 230
-778 230 202 220 238 272 305 309 312 283 253 254 256 235 214 193 172 130 88 117 146 207 268 313 297 244 191 206 220 254 288 320 352 283 185 138 151 184 185
-783 185 177 170 168 166 194 222 245 269 224 180 151 172 195 219 203 187 218 250 259 218 187 186 199 182 164 176 180 133 100 97 112 126 143 160 187 214 238 262 283
-787 283 253 217 212 253 264 224 183 197 211 252 293 323 303 244 215 217 220 194 168 190 211 184 157 183 239 279 268 239 241 253 264 256 248 239 231 231 232 184 137 130
-792 130 172 234 265 249 233 216 198 189 181 173 165 185 205 226 246 229 211 144 76 81 87 122 158 168 178 159 141 138 166 206 194 164 134 160 237 314 341 308
-797 308 245 202 210 257 305 330 354 347 339 309 248 207 216 238 260 214 169 176 183 190 197 194 190 177 133 113 143 173 204 229 254 260 216 151 136 181 225 216 206 196 186
-802 186 161 137 112 87 120 153 214 276 277 248 235 273 306 289 254 218 252 286 317 349 338 276 215 204 243 282 273 265 262 260 258 255 234 212 191 170 142 114
-807 114 116 119 122 125 176 226 246 215 183 150 149 148 149 150 192 265 301 286 257 259 258 227 206 186 163 141 113 85 128 172 213 254 245 235 210 185 160 135 100 66
-812 66 101 137 178 219 230 240 252 264 276 287 262 237 213 188 173 157 193 228 245 262 249 236 181 125 140 185 218 189 150 141 167 193 171 148 180 212
-816 212 244 276 259 241 223 205 209 212 186 159 124 89 125 161 141 121 130 139 127 85 75 125 184 212 212 211 186 161 148 197 220 182 98 74 110 145 134 123
-821 123 211 300 295 230 165 162 191 220 229 239 249 258 218 178 169 159 172 185 168 151 148 144 141 138 197 256 299 281 237 193 175 158 159 160 192 224 225 227 198 169 186
-826 186 202 218 234 255 275 265 256 255 255 255 254 240 226 212 198 177 155 133 112 120 128 137 145 123 101 129 158 187 216 214 213 204 195 186 177 216 254 292 330 349 367 334
-831 334 302 234 167 170 173 177 180 153 126 164 202 210 218 226 235 245 256 257 288 301 263 177 91 102 163 194 174 139 134 155 177 150 123 92 62 47 31 54 77 70
-836 70 62 69 77 84 91 162 233 233 233 254 274 264 255 230 205 180 154 172 189 206 223 216 209 203 198 199 230 245 208 129 79 84 118 160 202 216 230 192 155 133 111 133
-841 133 154 146 137 109 80 122 165 168 170 204 237 217 197 207 217 240 263 272 280 239 199 188 178 197 216 247 278 254 179 143 178 217 256 296 336 363 339 292
-845 292 244 225 175 114 104 150 196 216 235 223 212 200 189 238 287 285 283 249 215 197 178 200 223 195 167 164 161 188 216 270 323 286 249 239 229 269 309
-850 309 330 351 301 221 159 148 158 167 180 193 191 188 160 132 154 176 190 204 188 172 170 168 136 73 40 57 95 132 165 197 229 261 267 273 249 225 150 74
-855 74 78 133 207 230 195 159 153 147 143 139 181 253 306 309 279 250 247 244 240 235 200 165 180 194 208 222 199 175 152 128 118 109 129 150 173 195 187 179 163 146 159 173
-860 173 141 109 148 187 184 181 193 206 242 279 265 250 224 198 172 146 164 182 200 218 191 163 206 250 240 230 205 180 173 165 173 181 174 167 160 153 154 156 188 219 227
-865 227 235 243 251 270 290 259 228 202 176 201 225 206 187 183 179 178 177 161 145 171 198 224 251 287 323 311 298 285 301 335 308 248 188 176 163 169 175 196 217
-869 217 218 218 218 218 175 132 119 107 100 93 116 140 162 185 157 129 79 28 69 109 125 140 183 225 230 175 117 120 166 182 131 81 56 91 141 191 179 135 90
-874 90 106 147 189 203 218 189 159 160 161 176 191 202 213 214 154 93 94 104 114 109 165 228 292 269 245 208 171 148 126 163 200 204 147 120 154 218 251 222
-879 222 193 193 192 160 128 126 124 125 126 156 217 259 240 190 170 191 212 205 198 217 236 225 214 168 122 89 116 197 218 169 120 129 198 253 247 247 248 275 302 332 362
-884 362 341 320 307 293 279 266 206 146 157 168 171 175 178 182 150 118 119 180 235 229 191 152 143 134 140 146 145 145 175 204 245 285 254 224 223 223 174 125 42 -11 11 95
-889 95 178 200 190 179 215 250 235 220 212 203 225 247 285 324 255 155 141 228 292 295 273 280 305 269 205 201 230 259 242 225 238 251 244 237 245 253 258 262 282 301
-894 301 309 318 296 274 304 334 314 294 238 183 162 202 238 243 219 195 201 208 229 250 284 319 353 387 356 325 264 203 186 169 152 135 130 126 121 117 111 104 128 152
-899 152 204 255 271 227 157 118 127 136 98 30 -6 17 88 128 119 109 135 160 138 117 128 199 242 225 230 266 289 251 200 210 249 258 243 229 227 226 191 157
-903 157 152 148 134 120 154 189 190 160 144 189 231 274 269 265 242 219 226 233 215 196 208 220 205 190 160 129 138 148 187 226 239 252 235 218 229 240 203 166 179
-908 179 222 261 249 200 152 120 138 168 167 155 193 270 296 222 119 77 85 94 102 142 181 172 163 164 196 210 174 123 103 93 83 75 67 109 152 148 144 170 196 189
-913 189 183 126 69 76 84 121 159 194 228 233 237 248 260 271 282 304 326 277 228 198 168 188 209 205 201 197 193 212 231 199 168 163 159 160 130 99 118 177 237 232 228 239
-918 239 250 246 241 222 202 216 229 212 196 188 181 205 228 200 172 194 216 248 280 262 243 228 212 200 188 177 216 293 339 324 278 248 217 208 199 218 237 205
-923 205 142 136 180 214 197 165 184 228 211 161 111 122 133 129 125 139 153 167 180 187 193 133 72 53 94 132 169 197 224 221 218 218 219 193 166 130 154 194 235
-928 235 229 222 201 180 189 198 177 156 142 129 146 162 166 169 173 176 186 197 177 157 115 73 81 90 142 195 197 199 184 168 167 166 212 257 252 247 259 270 285 240 217 194 197
-933 197 201 159 116 165 214 202 190 207 225 236 246 206 166 152 138 175 211 214 216 189 161 138 115 142 169 191 212 182 153 136 119 152 185 215 245 244 243
-937 243 204 164 137 171 218 205 159 113 122 131 89 47 65 82 130 178 251 323 341 298 266 265 293 321 293 265 190 115 73 91 126 160 165 169 174 178 167 155
-942 155 96 38 40 104 169 173 123 104 114 124 127 130 139 117 82 108 185 232 215 197 245 324 354 283 206 190 188 185 202 218 233 247 246 246 256 265 275 285 276 266
-947 266 284 301 305 248 193 168 184 201 189 177 184 191 229 266 261 255 234 213 218 222 227 232 199 166 164 161 184 207 200 192 231 269 216 163 126 89 103 116 129 141 153
-952 153 166 141 116 92 67 77 86 126 166 144 122 113 164 199 174 139 135 169 203 224 246 287 329 320 311 325 340 324 308 311 315 319 322 275 228 212 195 217 239
-957 239 230 222 270 318 298 277 255 264 255 196 101 37 45 82 108 104 101 129 171 212 205 168 134 151 188 225 201 177 153 129 182 234 256 278 283 288 262 237 226 216
-962 216 206 195 196 196 196 196 181 165 152 138 161 214 229 194 164 165 175 186 167 148 180 212 179 146 114 81 122 164 205 247 208 170 131 92 92 92 143 194
-966 194 195 197 198 199 241 282 273 264 255 246 238 229 230 231 232 233 209 186 212 269 314 308 262 215 218 220 222 224 218 212 206 200 196 192 188 184 217 250 252 255 234 214 243 273 306 339 302 264 233
-972 233 201 200 199 215 231 217 202 174 146 168 190 184 178 223 267 263 260 256 252 242 232 221 211 201 192 212 233 224 214 205 195 145 95 75 54 51 48 75 102 93 84 125
-977 125 167 180 193 207 220 222 223 225 227 243 258 243 229 238 247 256 265 243 220 248 277 299 321 344 366 324 281 239 196 188 180 142 104 102 99 97 95 108 121 135 148 133
-983 133 117 102 87 92 98 103 108 118 127 187 246 270 293 245 197 188 178 169 159 191 223 256 288 261 233 257 280 305 330 285 239 169 99 45 52 99 145 192 239
-987 239 256 213 174 135 133 130 127 125 186 248 239 230 200 171 172 173 186 198 211 224 224 224 177 131 136 202 268 274 248 222 192 162 169 176 214 251 276 300 273 247 244 240 206
-993 206 173 157 142 102 63 68 175 282 288 215 142 154 166 179 191 203 216 182 149 163 176 183 130 76 84 160 237 227 216 201 187 172 158 164 170 146 122
-997 122 108 93 109 124 98 73 93 114 137 99 64 30 61 93 151 208 283 296 236 177 152 189 221 254 258 263 238 212 209 205 202 198 154 110 117 123 155 186 217
-1002 217 248 253 258 263 268 261 254 247 240 291 343 360 316 280 273 276 279 229 179 133 87 62 98 147 166 164 162 225 288 294 239 182 185 214 212 160 108 127 146 166 185 216
-1007 216 247 227 178 135 152 225 297 312 328 292 257 223 190 170 211 271 299 297 264 251 269 284 269 226 183 189 194 195 195 196 196 227 259 219 180 200 219 209
-1012 209 168 167 227 285 283 249 215 177 139 141 143 175 207 229 251 203 154 159 165 170 176 183 190 196 203 201 198 166 133 133 133 164 194 191 187 184 180 158 135 113 90 98 105 143 181
-1017 181 162 143 124 105 116 126 109 91 113 165 205 185 146 138 176 184 161 138 144 150 124 99 160 222 244 206 196 247 315 353 361 369 349 328 278 227 182
-1022 182 137 141 176 185 133 110 148 222 235 196 156 183 211 238 265 253 241 229 217 218 219 219 220 218 217 215 214 218 222 226 230 223 216 179 141 160 179 167 156 112 69 61 113
-1027 113 174 204 164 124 146 169 161 153 154 155 186 217 232 246 230 185 155 185 231 276 287 297 278 258 267 275 289 242 189 167 171 145 86 27 23 80 133 185
-1032 185 192 198 190 182 177 171 149 158 186 153 94 65 110 185 198 211 196 181 160 138 147 156 160 164 234 305 320 273 197 181 195 209 227 245 235 226 186 146 196 245
-1037 245 260 214 186 188 189 160 137 144 181 218 198 147 108 129 163 167 144 152 183 214 157 69 32 56 135 214 256 299 290 282 242 202 192 182 207 232 227 221 201
-1041 201 181 163 145 159 203 235 207 141 106 120 135 152 170 187 205 179 153 128 102 146 190 204 218 220 222 223 225 200 175 200 256 311 305 265 225 203 181
-1046 181 159 137 204 271 302 274 225 207 219 230 210 189 168 147 147 147 147 148 160 172 185 197 199 200 175 149 127 156 186 166 126 117 154 162 108 54 89 124
-1050 124 129 134 138 143 163 183 202 222 208 193 226 259 269 228 214 251 280 259 239 219 185 152 119 85 126 167 208 249 268 286 274 262 227 193 188 184 194
-1055 194 203 213 222 190 158 126 94 77 60 83 157 232 277 306 305 263 190 141 161 206 200 177 184 220 205 156 136 171 236 286 335 356 377 347 317 345 373
-1059 373 330 258 224 240 292 313 300 257 211 196 218 240 233 227 230 232 205 178 173 169 136 103 138 203 212 170 170 221 268 265 254 243 260 276 250 225 201 177 212
-1064 212 276 302 277 274 271 265 259 232 205 178 151 162 173 184 195 171 148 154 161 144 127 109 92 133 174 215 256 286 315 315 314 274 234 194 154 112 70 101
-1069 101 192 265 277 236 195 197 199 201 202 211 220 229 238 209 180 151 122 160 198 220 181 144 107 137 167 167 167 137 107 107 106 105 105 158 212 270 266 274 282 286 290 297 303 280 256
-1074 256 254 252 250 248 207 165 154 142 120 98 105 113 132 151 200 249 234 219 205 190 196 202 239 275 282 288 264 241 200 159 169 178 197 216 236 255 249 244 238 233 218 203
-1080 203 189 174 195 217 191 166 173 241 308 315 230 144 145 146 142 137 163 189 188 188 188 188 219 249 250 251 213 175 167 159 126 92 91 150 199 187 143 98 103 108 113 118 132 145
-1085 145 154 164 190 156 122 148 191 234 210 186 221 255 277 238 188 198 220 243 243 243 243 243 235 227 192 158 122 146 208 269 291 314 285 257 209 162 165 168 160
-1090 160 152 144 136 108 79 101 123 113 104 94 84 36 -11 10 33 55 76 125 173 220 206 196 185 213 241 268 296 264 231 199 167 167 168 168 169 175 181 188 194 208
-1095 208 222 236 249 243 236 229 223 227 231 184 138 175 213 250 288 293 297 302 307 297 287 248 208 139 70 52 33 63 94 124 154 146 139 131 124 102 81 91 100 109 118 97 76
-1100 76 98 120 141 163 155 147 139 131 130 128 127 125 131 137 174 210 220 229 265 301 318 274 194 114 60 7 6 66 138 149 128 107 139 171 204 236 235 233 231 230 225 220 185 150
-1105 150 171 192 162 133 105 78 101 124 131 138 175 213 203 194 185 175 219 263 256 249 250 251 252 253 277 301 292 223 158 154 162 170 161 153 175 197 231 265 282 239 191 144
-1110 144 183 223 237 251 262 272 273 212 152 153 197 241 198 154 118 81 74 68 75 82 89 96 122 148 143 139 138 138 137 137 146 156 99 41 51 120 190 199 175 151 112 73
-1115 73 14 15 110 204 250 234 202 170 169 167 195 224 246 268 276 283 265 248 199 151 174 197 190 183 168 154 140 126 143 160 196 171 140 109 165 221 254 286
-1120 286 251 216 189 223 271 259 171 83 28 33 71 109 120 131 158 185 181 178 169 161 152 143 104 64 115 166 200 233 252 271 274 278 328 378 375 310 231 212 199
-1125 199 185 145 106 87 68 79 91 95 99 130 161 173 125 93 121 186 252 268 284 266 197 141 136 176 187 187 187 208 228 199 169 171 174 176 178 176 174 142 109 130
-1130 130 152 142 133 150 167 133 99 95 90 136 182 248 314 290 235 206 228 237 216 176 137 126 116 161 207 222 237 259 280 272 263 220 177 135 94 118 173
-1134 173 210 198 200 233 274 264 235 205 187 169 136 103 140 178 194 210 226 241 227 213 199 184 213 242 268 245 194 144 161 209 226 192 170 178 173 137
-1139 137 119 152 177 152 109 97 100 72 31 21 55 88 73 58 109 160 171 133 94 106 136 135 122 139 169 169 165 162 207 253 293 334 324 314 292 271 279
-1143 279 288 307 327 317 306 269 232 226 219 211 203 195 187 185 183 180 178 231 285 301 257 241 225 236 247 243 240 263 286 311 275 223 171 158 144 131 118 137 156 174 193
-1148 193 169 145 121 96 121 145 169 193 217 242 179 116 85 114 140 166 173 179 155 131 139 146 153 161 168 176 183 190 177 163 180 197 204 211 168 125 152 180 157 134
-1153 134 113 93 72 52 73 95 116 137 159 180 202 223 224 225 226 227 225 222 220 218 216 213 164 115 80 104 126 147 150 153 206 260 271 281 262 242 204 166 199 232
-1158 232 253 275 227 180 177 206 224 182 124 127 183 239 242 245 218 191 167 142 148 154 202 251 286 259 233 237 258 219 143 127 202 308 370 331 263 226 215
-1163 215 204 195 186 220 254 221 188 187 247 307 306 235 165 120 76 70 65 90 114 167 220 272 325 293 261 229 197 220 243 235 228 203 177 152 127 140 152 165
-1167 165 178 184 190 226 263 203 142 153 163 172 181 159 137 132 127 172 218 241 264 254 184 116 109 155 201 186 171 129 87 65 104 174 214 170 96 54 72 69
-1172 69 66 66 67 80 93 133 173 192 150 126 131 154 176 170 164 208 251 295 339 315 291 267 243 221 199 176 154 151 147 174 200 208 216 224 231 235 238 248 196 118 71 92
-1177 92 145 157 108 78 79 89 98 110 121 129 136 144 151 132 113 122 132 110 59 39 80 146 182 189 195 192 188 184 180 208 236 264 291 263 235 237 239 239 239 209 179 185 190 166
-1182 166 141 104 68 102 136 133 129 126 123 150 178 175 173 160 148 165 183 169 155 141 128 129 130 132 133 120 107 93 80 124 168 182 196 189 182 174 167 174 182 189 196 197 199 200 201
-1188 201 234 267 209 151 144 137 130 123 138 153 168 183 223 263 253 242 237 231 195 130 68 68 102 136 166 197 197 198 229 260 292 323 311 300 237 175 162 149 166
-1193 166 184 183 183 183 183 137 91 45 0 14 29 44 59 103 148 163 177 157 137 117 97 46 -4 -2 60 140 159 145 131 139 148 156 164 213 262 238 153 109 125
-1197 125 189 223 211 170 137 166 197 197 168 139 170 202 203 204 219 234 249 264 280 295 311 327 300 273 276 279 280 281 232 182 144 106 98 90 114 138 132 126 141 156
-1202 156 141 126 92 57 37 77 121 135 83 30 15 60 73 86 104 153 173 131 123 175 225 215 176 168 189 210 218 226 234 242 197 151 136 120 146 171 166 161
-1207 161 168 174 181 187 184 182 179 176 150 125 130 134 82 30 90 149 190 232 203 173 134 95 107 118 155 192 198 205 167 130 143 156 151 146 141 136 132 128 124 120 146 171 166 162 152
-1212 152 143 133 124 98 73 119 164 167 170 142 115 113 111 139 167 174 181 157 134 161 188 165 141 107 72 88 104 95 85 46 6 24 43 91 140 157 174 191 208
-1217 208 185 161 138 114 141 167 194 220 225 229 183 136 123 110 147 184 182 179 177 174 149 124 99 74 91 108 75 42 62 81 101 121 108 95 112 129 157
-1222 157 186 164 142 147 153 158 163 140 117 145 172 214 255 225 195 180 165 201 236 224 212 199 187 124 60 36 62 79 45 13 31 79 96 63 30 43
-1226 43 57 70 83 106 128 101 73 59 45 82 119 116 114 111 109 116 122 129 136 167 197 177 158 138 119 150 181 139 98 56 14 54 94 164 235 223 211 199 187
-1231 187 179 170 132 93 95 96 97 98 111 124 136 149 154 159 165 170 172 175 177 179 169 159 179 199 166 133 138 195 238 230 205 210 226 211 168 155 194 233 203 173 170 166 132 98
-1236 98 121 144 137 131 140 149 161 172 164 186 227 207 167 158 179 199 176 153 160 167 204 241 277 312 294 246 209 233 285 307 259 211 200 189 177 166 138 111 98
-1241 98 145 232 289 255 192 177 224 251 248 269 289 259 229 209 219 247 216 182 179 158 138 147 217 287 297 231 165 166 167 175 182 189 197 156 115 73 32 68 103
-1246 103 139 174 229 283 267 251 249 247 215 153 139 186 234 222 160 159 231 303 300 298 266 203 131 120 145 200 258 285 281 216 149 184 280 316 270 194 147
-1250 147 161 148 134 125 115 98 80 114 147 148 148 148 149 176 203 230 257 274 292 259 196 128 120 167 214 228 242 256 269 293 317 311 305 262 219 175 132 145
-1255 145 159 172 185 172 159 146 134 127 121 165 209 167 124 112 101 111 121 161 202 204 206 209 211 198 184 171 157 146 134 123 112 132 151 199 247 270 263 234
-1260 234 267 294 262 181 131 155 211 217 194 175 157 166 176 186 196 156 116 106 97 118 138 128 119 109 99 110 121 162 203 194 185 148 110 59 38 75 173
-1264 173 229 255 297 340 310 220 106 94 135 177 153 130 153 176 170 165 161 188 185 122 64 66 118 140 101 63 92 151 165 118 103 149 204 260 269 277 286 294
-1269 294 302 310 256 202 179 155 137 118 100 81 58 34 51 118 164 180 212 245 269 243 177 142 134 126 150 174 206 238 239 241 242 242 212 182 192 202 144 87
-1273 87 93 151 181 160 152 194 252 311 336 312 248 184 156 179 192 175 143 141 170 200 175 151 157 164 175 186 167 148 144 140 167 194 181 169 186 204 217 229
-1278 229 195 160 170 231 291 301 257 212 183 205 226 197 152 138 194 250 257 265 284 303 304 254 213 223 269 285 236 188 209 229 235 240 243 246 238 199 177 205
-1283 205 249 262 248 264 297 330 295 259 269 279 289 299 300 301 256 210 194 239 267 265 230 195 189 183 172 162 152 142 121 100 110 119 104 89 107 186 266
-1287 266 286 232 178 160 142 124 106 122 139 125 111 109 108 136 165 192 218 215 211 186 160 134 109 82 55 58 62 87 113 139 164 212 260 273 225 190 185 190
-1292 190 195 162 130 97 65 92 120 148 176 183 191 170 149 171 223 225 167 102 98 144 159 131 103 124 144 135 126 117 108 90 71 82 94 110 126 111 97 50 4
-1297 4 -5 45 82 118 158 199 188 176 195 244 263 223 210 258 305 290 243 195 202 208 245 281 265 248 231 215 208 202 195 189 228 268 237 205 148 91 105 119 141
-1301 141 163 135 106 97 87 129 170 163 156 99 41 42 43 74 105 150 195 170 145 118 91 65 38 49 60 71 82 110 138 136 134 129 125 120 116 123 130 106 83 98 113
-1306 113 128 143 130 116 133 150 183 216 218 220 217 214 211 207 211 215 188 162 180 198 216 234 233 232 231 229 201 174 176 179 199 218 208 198 159 120 152 184 194 204 214
-1311 214 225 230 235 240 246 237 228 189 150 118 85 103 121 128 136 143 151 149 147 145 143 157 170 184 197 213 230 215 201 208 214 190 166 132 99 116 133 149 166 182 198 197 195
-1317 195 194 193 237 281 275 268 233 197 162 126 184 241 262 222 193 164 131 98 86 75 68 60 88 177 215 192 179 166 179 192 195 198 188 118 45 32 36 41 35 90
-1322 90 145 140 121 102 130 158 145 131 147 164 171 177 184 190 167 144 171 199 149 99 120 140 139 138 137 135 131 127 154 180 212 244 246 247 257 267 246 225 163 101 68
$$ [...]
-1612C00
##$OBSERVED MULTIPLETS=	(I, X, Y, Hs, Vs, An, H, C, N, (J))
$$ I: Multiplet Index
$$ X: Strt Coordinate
$$ Y: End Coordinate
$$ Hs: Horizontal Chemical Shift
$$ Vs: Vertical Chemical Shift
$$ An: Normalised Integral Area
$$ H: Hydrogens
$$ C: Category
$$ N: Name
$$ (J): Coupling Constants
(1, 6.5895770905710273624, 6.6556349347710410669, 6.6226612869091043834, 1.9581261054520493481, 2, d, A, 8.08691)
(2, 7.1495807396061250572, 7.2162496079731148768, 7.1832806608667532089, 2, 2, d, B, 8.26636)
(3, 7.3596904970384837696, 7.3801607270622699986, 7.3719341788421983708, 1.333281910132529724, 1, s, C)
(4, 7.6145701306761823801, 7.6787949023752632982, 7.6462625643743251658, 2.0107791390416362987, 2, d, D, 7.52808)
(5, 7.4404618601707355197, 7.5138183772912734426, 7.4714109087917082164, 0.9765360952029846775, 1, t, E, 7.33606 7.33606)
(6, 7.3811592748683070297, 7.4225990088188966709, 7.3992465043597190899, 1.8564989092804544679, 2, d, F, 7.57349)
(7, 4.885279936944528778, 4.9298465620791436237, 4.913150063705223225, 1.9270865736901858778, 2, s, G)
(8, 1.0668351573427439227, 1.1558064078044227863, 1.1157788355440712014, 3.3784155501347679085, 3, t, H, 6.99344 6.99344)
(9, 3.635275243233663911, 3.680252753672946131, 3.6580866726537029088, 2.8281589251769805315, 3, s, I)
(10, 3.5124593856711392448, 3.6237330182275058199, 3.5687279669105813618, 1.9925199189547990741, 2, p, J, 6.74463 6.74463 6.9093 6.9093)
##$OBSERVED MULTIPLETS AREAS=	
(1, 73566.104033023148077)
(2, 75139.291415595333092)
(3, 50090.928992294866475)
(4, 75544.259850424699835)
(5, 36688.115117652305344)
(6, 69748.006278579472564)
(7, 72399.959821794007439)
(8, 126925.875272277568)
(9, 106252.92882424501295)
(10, 74858.267420861520804)
##$OBSERVED MULTIPLETS PEAKS=	(I, X, Y)
$$ I: Multiplet Peak Index
$$ X: Peak x Position
$$ Y: Peak Intensity
(1, 6.6327649716801753144, 567.54724515261148099)
(1, 6.6125576021380334524, 516.81972873746258301)
(2, 7.1936083297144675086, 942.37246641723118046)
(2, 7.1729529920190389092, 991.91571891956732543)
(3, 7.3719341788421983708, 1253.5934606287005408)
(4, 7.6556680498957927483, 678.18750211141104955)
(4, 7.6368570788528584714, 789.69088238930578427)
(5, 7.4898193088181388433, 112.17196205560074418)
(5, 7.4712557817960121298, 366.50835855464305268)
(5, 7.453157635760973676, 302.59744646353391317)
(6, 7.4087087131216664559, 457.77986699930613668)
(6, 7.3897842955977717239, 699.47653572300839642)
(7, 4.913150063705223225, 1939.8753847424814012)
(8, 1.1332418142243809722, 1117.7649059612942892)
(8, 1.1158026269093521687, 2315.2287384174942417)
(8, 1.0982920654984809072, 1088.2863781897071931)
(9, 3.6580866726537029088, 3301.6584100654222311)
(10, 3.6022716206169018704, 67.596763191328108178)
(10, 3.5858299008265186458, 427.04072997914857979)
(10, 3.5690538211200473206, 870.08622450129200843)
(10, 3.5518744528538106486, 762.50613454762174115)
(10, 3.5346100391356274351, 243.62199982168763768)
##END=	
##TITLE=	Nov18-2021.60.fid
$$ [...]
##.OBSERVE FREQUENCY=	400.20240119999999706
##.OBSERVE NUCLEUS=	^1H
##NPOINTS=	22
##FIRSTX=	1.0982920654984809072
##LASTX=	7.6556680498957927483
##XFACTOR=	1
##YFACTOR=	1
##FIRSTY=	1088.2863781897071931
##XUNITS=	PPM
##YUNITS=	ARBITRARY UNITS
##PEAK TABLE=	(XYW..XYW)
1.0982920654984809072,1088.2863781897071931,0.0066564758578073080636
1.1158026269093521687,2315.2287384174942417,0.0063347597129332442606
1.1332418142243809722,1117.7649059612942892,0.0066170646169203626435
3.5346100391356274351,243.62199982168763768,0.0081434550844144276693
3.5518744528538106486,762.50613454762174115,0.0080842009919898458886
3.5690538211200473206,870.08622450129200843,0.0080362274992847228944
3.5858299008265186458,427.04072997914857979,0.0078218992095653357838
3.6022716206169018704,67.596763191328108178,0.0059579712619251190206
3.6580866726537029088,3301.6584100654222311,0.0070753042981960573982
4.913150063705223225,1939.8753847424814012,0.0083707478766948516941
6.6125576021380334524,516.81972873746258301,0.013721787465148937643
6.6327649716801753144,567.54724515261148099,0.013812725433955268944
7.1729529920190389092,991.91571891956732543,0.0083277216892554475902
7.1936083297144675086,942.37246641723118046,0.0081206985721350658652
7.3719341788421983708,1253.5934606287005408,0.0084231482099394287821
7.3897842955977717239,699.47653572300839642,0.013009956417076770294
7.4087087131216664559,457.77986699930613668,0.01018344387671829554
7.453157635760973676,302.59744646353391317,0.01032548287530707723
7.4712557817960121298,366.50835855464305268,0.0098241353154115852037
7.4898193088181388433,112.17196205560074418,0.010095526208857464809
7.6368570788528584714,789.69088238930578427,0.011216621007487263817
7.6556680498957927483,678.18750211141104955,0.010730099408785448087
##$MNOVA/PEAK_DATA_TABLE=	(T,F,A,ST,SP,APT,APC)
$$ Complementary to PEAK TABLE
$$ T: Type
$$ F: Flags
$$ A: Annotation
$$ ST: Shape Type
$$ SP: Shape Parameter
$$ APT: Attached Peaks Type
$$ APC: Attached Peaks Count
Compound,None,,1,0.75145342433097339629,0,0
Compound,None,,1,0.97168553795828804809,0,0
Compound,None,,1,1.999999999999999778,0,0
Compound,None,,1,1.6449752601016036646,0,0
Compound,None,,1,1.725534423202345069,0,0
Compound,None,,1,1.8570769984866781765,0,0
Compound,None,,1,1.3720041706552814631,0,0
Compound,None,,1,1.999999999999999778,0,0
Compound,None,,1,0.86097376719055063177,0,0
Compound,None,,1,0.99138952826367310323,0,0
Compound,None,,1,0.33658977415253704679,0,0
Compound,None,,1,0.28852085803190552493,0,0
Compound,None,,1,0.75725494290231365468,0,0
Compound,None,,1,0.44950118629989649355,0,0
Compound,None,,1,0.57735690772279069094,0,0
Compound,None,,1,-0.0439059960155593898,0,0
Compound,None,,1,0.40000000000000007772,0,0
Compound,None,,1,0.94962653230628513157,0,0
Compound,None,,1,0.34206753565166819753,0,0
Compound,None,,1,1.0502926398813716702,0,0
Compound,None,,1,0.62176963462089629431,0,0
Compound,None,,1,0.72193903361083688885,0,0
##END=	
##END=	
