##TITLE=	Nov18-2021.64.ser
TM-VI-170 acetone-d6 Ca+Bz-pyr. hmbc
##JCAMP-DX=	6.0	$$ MestReNova 14.3.0-30573
##DATA TYPE=	LINK
##BLOCK_ID=	1
##BLOCKS=	2    
##ORIGIN=	Mestrelab Research S.L.
##OWNER=	hrzepa
##$MNOVA/LINK_BLOCK_TYPE=	ITEM	$$ NMR Spectrum
##$MNOVA/ITEM/POLYGON=	(XY..XY)
5321,5835
8722,5835
8722,8208
5321,8208
5321,5835
##$MNOVA/ITEM/Z=	0
##$MNOVA/ITEM/ANGLE=	0
##TITLE=	Nov18-2021.64.ser
##JCAMP-DX=	6.0	$$ MestReNova 14.3.0-30573
##BLOCK_ID=	2
##DATA TYPE=	MNOVA NMR VIEW DATA
##DATA CLASS=	MNOVA VIEW DATA
##$MNOVA/2D/THRESHOLD=	1.3452304601669311523
##$MNOVA/ITEM/ZOOM/X=	-0.47893593765563730047,	14.508265098244720548
##$MNOVA/ITEM/ZOOM/Y=	-9.5608502075342602922,	250.07132191408896915
##END=	
##TITLE=	Nov18-2021.64.ser
##JCAMP-DX=	6.0	$$ MestReNova 14.3.0-30573
##BLOCK_ID=	3
##DATA TYPE=	nD NMR SPECTRUM
##DATA CLASS=	NTUPLES
##NUMDIM=	2
##ORIGIN=	Bruker BioSpin GmbH
##OWNER=	nmr
##.OBSERVE FREQUENCY=	400.20280139999999847
##.OBSERVE NUCLEUS=	^1H
##.SOLVENT NAME=	Acetone
##.PULSE SEQUENCE=	hmbcgplpndqf
##LONGDATE=	2021/11/18 23:29:41.000
##.ACQUISITIONMODE=	SIMULTANEOUS (DQD)
##$ORIGINAL FORMAT=	Bruker XWIN-NMR
##$MNOVA/SCALES_VERSION=	7
##$PARAMETER FILE=	(acqu2s, ASCII, //ch-nmrserv3.ch.ic.ac.uk/Av400C/agmb/nmr/Nov18-2021/64/acqu2s, 0)
$$ ##TITLE= Parameter file, TOPSPIN		Version 3.2
$$ ##JCAMPDX= 5.0
$$ ##DATATYPE= Parameter Values
$$ ##NPOINTS= 129	$$ modification sequence number
$$ ##ORIGIN= Bruker BioSpin GmbH
$$ ##OWNER= nmr
$$ $$ 2021-11-18 23:49:17.546 +0000  nmr@CZC2439F63
$$ $$ /opt/topspin/data/agmb/nmr/Nov18-2021/64/acqu2s
$$ $$ process /opt/topspin3.2/prog/mod/go
$$ ##$ACQT0= 0
$$ ##$BF1= 100.63037
$$ ##$FnMODE= 1
$$ ##$NUC1= <13C>
$$ ##$NusJSP= 0
$$ ##$NusT2= 1
$$ ##$NusTD= 128
$$ ##$O1= 12075.7644147886
$$ ##$SFO1= 100.642445764415
$$ ##$SW= 260.109045168497
$$ ##$SW_h= 26178.0104712042
$$ ##$TD= 128
$$ ##END=
$$ 
##$PARAMETER FILE=	(acqus, ASCII, //ch-nmrserv3.ch.ic.ac.uk/Av400C/agmb/nmr/Nov18-2021/64/acqus, 0)
$$ ##TITLE= Parameter file, TOPSPIN		Version 3.2
$$ ##JCAMPDX= 5.0
$$ ##DATATYPE= Parameter Values
$$ ##NPOINTS= 12	$$ modification sequence number
$$ ##ORIGIN= Bruker BioSpin GmbH
$$ ##OWNER= nmr
$$ $$ 2021-11-18 23:49:21.023 +0000  nmr@CZC2439F63
$$ $$ /opt/topspin/data/agmb/nmr/Nov18-2021/64/acqus
$$ $$ process /opt/topspin3.2/prog/mod/shimcntl
$$ ##$ACQT0= 1000000
$$ ##$AMP= (0..31)
$$ 100 100 100 100 100 100 100 100 100 100 100 100 100 100 100 100 100 100
$$ 100 100 100 100 100 100 100 100 100 100 100 100 100 100
$$ ##$AMPCOIL= (0..19)
$$ 0 0 0 0 0 0 0 0 0 0 0 0 0 0 0 0 0 0 0 0
$$ ##$ANAVPT= -1
$$ ##$AQSEQ= 0
$$ ##$AQ_mod= 3
$$ ##$AUNM= <au_zg>
$$ ##$AUTOPOS= <48 >
$$ ##$BF1= 400.2
$$ ##$BF2= 100.63037
$$ ##$BF3= 400.2
$$ ##$BF4= 400.2
$$ ##$BF5= 400.2
$$ ##$BF6= 400.2
$$ ##$BF7= 400.2
$$ ##$BF8= 400.2
$$ ##$BYTORDA= 0
$$ ##$CAGPARS= (0..11)
$$ 0 0 0 0 0 0 0 0 0 0 0 0
$$ ##$CFDGTYP= 0
$$ ##$CFRGTYP= 9
$$ ##$CHEMSTR= <none>
$$ ##$CNST= (0..63)
$$ [...]
$$ 0 0 0 0
$$ ##$ShimPowMaxUC= (0..63)
$$ 130000 130000 130000 130000 130000 130000 130000 130000 130000 130000 130000
$$ 130000 130000 130000 130000 130000 130000 130000 130000 130000 0 0 0 0
$$ 0 0 0 0 0 0 0 0 0 0 0 0 0 0 0 0 0 0 0 0 0 0 0 0 0 0 0 0 0 0 0 0 0 0 0 0
$$ 0 0 0 0
$$ ##$ShimPowMaxUG= (0..63)
$$ 524287 524287 524287 524287 524287 524287 524287 524287 524287 524287 524287
$$ 524287 524287 524287 524287 524287 524287 524287 524287 524287 0 0 0 0
$$ 0 0 0 0 0 0 0 0 0 0 0 0 0 0 0 0 0 0 0 0 0 0 0 0 0 0 0 0 0 0 0 0 0 0 0 0
$$ 0 0 0 0
$$ ##$ShimPowRcbType= 3
$$ ##$ShimPowRes= (0..63)
$$ 1e-20 1e-20 1e-20 1e-20 1e-20 1e-20 1e-20 1e-20 1e-20 1e-20 1e-20 1e-20
$$ 1e-20 1e-20 1e-20 1e-20 1e-20 1e-20 1e-20 1e-20 0 0 0 0 0 0 0 0 0 0 0 0
$$ 0 0 0 0 0 0 0 0 0 0 0 0 0 0 0 0 0 0 0 0 0 0 0 0 0 0 0 0 0 0 0 0
$$ ##$ShimPowRng0= (0..63)
$$ 1 1 1 1 1 1 1 1 1 1 1 1 1 1 1 1 1 1 1 1 0 0 0 0 0 0 0 0 0 0 0 0 0 0 0 0
$$ 0 0 0 0 0 0 0 0 0 0 0 0 0 0 0 0 0 0 0 0 0 0 0 0 0 0 0 0
$$ ##$ShimPowRng1= (0..63)
$$ 1 1 1 1 1 1 1 1 1 1 1 1 1 1 1 1 1 1 1 1 0 0 0 0 0 0 0 0 0 0 0 0 0 0 0 0
$$ 0 0 0 0 0 0 0 0 0 0 0 0 0 0 0 0 0 0 0 0 0 0 0 0 0 0 0 0
$$ ##$ShimPowRng2= (0..63)
$$ 1 1 1 1 1 1 1 1 1 1 1 1 1 1 1 1 1 1 1 1 0 0 0 0 0 0 0 0 0 0 0 0 0 0 0 0
$$ 0 0 0 0 0 0 0 0 0 0 0 0 0 0 0 0 0 0 0 0 0 0 0 0 0 0 0 0
$$ ##$ShimPowRng3= (0..63)
$$ 1 1 1 1 1 1 1 1 1 1 1 1 1 1 1 1 1 1 1 1 0 0 0 0 0 0 0 0 0 0 0 0 0 0 0 0
$$ 0 0 0 0 0 0 0 0 0 0 0 0 0 0 0 0 0 0 0 0 0 0 0 0 0 0 0 0
$$ ##$ShimSysFunc= (0..63)
$$ 1 2 3 4 5 7 9 11 15 16 8 10 12 14 6 17 13 18 19 20 0 0 0 0 0 0 0 0 0 0
$$ 0 0 0 0 0 0 0 0 0 0 0 0 0 0 0 0 0 0 0 0 0 0 0 0 0 0 0 0 0 0 0 0 0 0
$$ ##$ShimSysMatrix= 0
$$ ##$ShimSysType= 1
$$ ##$TFXNUM= 0
$$ ##$TRIPLO2= 0
$$ ##$VTU= 2
$$ ##$VTUETH= <149.236.99.20>
$$ ##$VTUTY= <no>
$$ ##$WBREFAM= (0..15)
$$ 135.5 97.7 100 100 100 100 100 100 100 100 100 100 100 100 100 100
$$ ##$WBREFLM= (0..15)
$$ 0 0 0 0 0 0 0 0 0 0 0 0 0 0 0 0
$$ ##$WBREFPH= (0..15)
$$ 72.26 -67.22 0 0 0 0 0 0 0 0 0 0 0 0 0 0
$$ ##$WBSGU= (0..15)
$$ 0 0 0 0 0 0 0 0 0 0 0 0 0 0 0 0
$$ ##$XFAC= 2
$$ ##END=
$$ 
##$DECIM=	3328
##$DSPFVS=	20
##.ACQUISITIONSCHEME=	NOT PHASESENSITIVE
##NTUPLES=	nD NMR SPECTRUM
##VAR_NAME=	FREQUENCY1,	FREQUENCY2,	SPECTRUM
##SYMBOL=	F1,	F2,	Y
##.NUCLEUS=	13C,	1H
##.OBSERVE FREQUENCY=	100.64244576441500101,	400.20280139999999847
##VAR_TYPE=	INDEPENDENT,	INDEPENDENT,	DEPENDENT
##VAR_FORM=	AFFN,	AFFN,	ASDF
##VAR_DIM=	512,	512,	262144
##UNITS=	HZ,	HZ,	ARBITRARY UNITS
##FIRST=	25164.769650603881018,	5806.207692317537294,	-0.064631104469299316406
##LAST=	-962.11189389874937206,	-191.67016224978604555,	-0.078435540199279785156
##MIN=	-962.11189389874937206,	-191.67016224978604555,	-1.1623135805130004883
##MAX=	25164.769650603881018,	5806.207692317537294,	12.145982742309570313
##FACTOR=	1,	1,	0.0034501146359687462004
##PAGE=	F1=25164.8
##FIRST=	25164.769650603881018,	5806.207692317537294,	-0.064631104469299316406
##DATA TABLE=	(F2++(Y..Y)), PROFILE
$$ [...]
##PAGE=	F1=21994.8
##FIRST=	25164.769650603881018,	5806.207692317537294,	-0.26332330703735351563
##DATA TABLE=	(F2++(Y..Y)), PROFILE
3212c3P1M0j43J14n8mj8k6P9J2r3Q8k56J88L0L1j3K5j39K10P6k23J39l9q3k2N1N9j25qO8l9
2837d1K47j19o2l4l5k2P8o9N7j8Q9k5j37k5P3R3j8K8r9M4l3K4m4Q8Q9n2KM2n7p4lK9N6J1L4
2426A17q4kk9o5m8J55m4nM1O5n4K9Ok12M2Q4J34o9k0k1n8J29J2J1J84k75J00J7m5k2m1K6j31
2038g3K5J8K09m9j45J25m6k7N6J26k72m1O7Q9rj9p2J44j04j43J16J17j30l2K0J00p1J8N6l6
1686A7n7J5R8K8j28J2Jl0L8M6p7n5M2R7j24J76j01j6r9J05N2m8L4J30kj10k8n2J9q7J31L7
1311F4P5j64K21j67k5j3j4K05j1j26L3n4n3k1R6j9k0n3J3L4L5J8p8P2o8p6Q2K5n7J5k4P6j15
923i4N7K13j28j39Q2j7Q8m3p3J03K0k17K72O6j95J1J15j78O6l5K1K0j04J92n5J3K51j18j15
583G9p8O4j08N5K5l2O6l6m7J81k06L2k1oon9O9J86k60Q2O0K07k23k6OQ7j07L7n5RJ22r2l8
$$ plain form
3212 -33 38 78 -65 49 -9 -13 -31 -57 22 34 -59 29 -227 -39 -9 22 9 34 -105 105 181 -42 97 58 -25 -47 4 63 -62 -70 -2 -41
2837 -41 206 87 25 -9 -44 -66 12 -57 0 -18 71 46 -91 -116 -43 50 32 60 -39 5 -28 -4 -48 40 129 77 79 121 64 -10 -13 16 72 83 117
2426 117 33 31 2 -63 -111 44 0 -5 36 101 47 76 82 -130 -88 -4 130 61 41 20 -38 91 103 114 298 23 123 140 95 73 32 58 -73
2038 -73 -48 -30 179 130 -15 110 64 37 93 219 -53 -94 -27 62 53 34 -38 106 2 -141 -25 92 -38 -70 -50 50 -21 -3 53 17
1686 17 -40 -25 73 101 -27 -15 -14 -44 -6 40 -37 -92 -50 47 -77 99 -2 -18 -117 -12 40 -8 26 156 154 44 16 -36 -17 -104 27 64
1311 64 139 -25 196 29 4 -9 -23 182 171 45 78 24 -29 -50 46 27 7 -46 -33 1 36 54 -24 48 -20 -96 -14 11 -46 -31 -55 21 -94
923 -94 -37 176 48 -91 -9 -26 62 19 -54 49 69 -148 124 190 -5 6 121 -57 9 -26 -5 15 -89 103 48 61 312 194 79
583 79 1 65 -43 12 37 5 71 35 -12 169 -37 -5 -26 -32 -38 -97 -28 158 -102 -20 40 247 24 -2 4 91 -16 21 -34 -25 97 5 -33
196c3j8MK4j4R1N4j58Ll3L9J87Q6j74j35L2J94j26O2J53k02q4J18J2N0j6o9j42j2L8J35r5
-168b9L0p1
$$ plain form
196 -33 -51 -47 -23 -37 54 108 -50 -47 -80 -41 146 232 58 -77 -45 149 23 85 238 36 -48 70 82 132 116 47 -95 -107 -69 66 -29
-168 -29 1 -70
-192g0
##PAGE=	F1=21943.6
##FIRST=	25164.769650603881018,	5806.207692317537294,	-0.22812712192535400391
##DATA TABLE=	(F2++(Y..Y)), PROFILE
5806f6O5j0K2r8J6M7k5M9L9pM5j6m3j52J64j35J88j42o1J04J22j03j70Q5N0Ok2r3J00J7j16
5442a40J54J6J36M6j19j76J38l7k0L3q5Q3j11K5O1oq7O5K0M0j4J14j12j3j3l9MK7n3k0R9q1
5067f5K17o2k57J40J9l8J1L5j19J65j04Q4O3j47k7J41o7l2l1P7j01J64r5J06j02q1K6j6O0
4726c6Q5o8L6L8j36q4J65O0j26J9n8R4K47j89q7M7n1J13j25J09o1pJ59q2n1Q4J9j02n4K31
4374A89j22J4N0l3Q8k28jM3J3N3jn6m0j3N3j01J2l8J10k6k9K8J08L3p9l0q5N1O3K31k78O5
3999D4n5r1J36n7O4N9m8J1l2l2qL9J1j1K5Mr0J5J79K9j76j15Q4Q4J7j63O2j03K7MP2R5m1j34
3600i5l6L9M5N9oj7r0qJ11P7j82P2J9J8L6m0K68k88J5j11J75J38k12m3QPL1jO9K3l1n5k3K1
3200gJ00q9k3k2O2j07N6J0J9m5P2k28O5J70lk5J9j15K01N1k60K25n9r2j4J4P6j21O0M5p2J81
$$ plain form
5806 -66 -1 -11 11 -87 -71 -24 -49 0 39 32 77 61 18 -134 30 -105 83 -59 -120 -16 106 3 -167 -82 -32 -26 -48 -141 -41 -24 -140
5442 -140 14 30 166 212 93 -83 55 18 -2 31 -54 29 -82 -57 4 -2 -89 -24 -4 36 22 136 24 11 -2 -41 -37 -10 -63 -83 16 -65
5067 -65 152 90 -167 -27 -8 -46 -35 0 -119 46 -58 26 89 -58 -85 56 -11 -43 -74 3 -98 66 -29 77 -25 -106 -80 -96 -36
4726 -36 49 -19 17 55 -81 -165 0 60 -66 -47 -105 -11 236 47 -40 7 -44 69 -56 53 -8 -15 144 62 11 95 114 12 -42 189
4374 189 67 81 131 98 186 -42 -43 0 13 66 65 9 -31 -44 9 -92 -80 -118 -8 -34 -63 -35 73 106 27 -3 -88 -37 26 257 -21 44
3999 44 -11 -102 34 -23 41 100 52 63 31 -1 -9 30 41 30 55 59 -31 -16 163 192 16 -99 -15 69 86 -77 -15 -118 -91 -87 -15 80 39 -95
3600 -95 -131 -92 -47 12 6 -11 -101 -109 2 79 -103 -31 -12 6 42 2 270 -18 -3 -114 61 199 -13 -56 -48 -41 -10 -11 58 81 50 -5 -28 -7
3200 -7 93 4 -19 -41 21 -86 -30 -20 -1 -46 26 -202 -137 33 30 5 24 -91 110 161 -99 126 67 -25 -39 -25 51 -70 -10 35 -37 144
2825A44n9j07k1k1j7Q3k3j9K1P6m3j18J5J4P3J7J06o8p4j3k6J3O8M9J0j2J2m8o9L2M8lJ9J0
2426F9r9K8n3o1O8J11q2QK8Q4l1M9l2k12N3J00J09q8Lj6n2Q9nL5J69k38Q1m2k0J7l6J0r1O
2027d1L5J64n7j16J12o7j3J22J31k74j07Q0P8k6j3j8R1j34j6K5J06j10k8j4J30m9PR8n5o6
1675b5L4K8K9p5k2K2pj3l9L2l2LJ32j26J45r5k0r5J05J5k7J9J41J02j39p9j0j4q4J10N2O0
1299A27j37K24j85k6m8M4J68m2p5Lk0jj13R9j4l9QJJ9O7J5j20O3n7p0J24J0p1L3mMn1O2J66
900A64j28j04R5n3O7Jo9J7M7j81K60K4k13J04Q5j71Q8k7KK1n1J30p7K8K12j50o2j7j7j14P7
536a2J01p6O8Kr8J22j75K8JK3j0k4K1J81k27P7N3J88j97m7L9N9j56mK2oJ14p8j1K1J1k2j6
149b8Q4O6j42j3%RJ59R7j86r5M4R8j18Q3R6j45p2J08L1O1m9p5o5k7O4O4q0K5m9
$$ plain form
2825 144 85 -22 -43 -64 -81 2 -21 -40 -19 57 14 -104 -89 -75 -2 15 121 53 -21 -34 -60 -47 21 70 80 68 80 32 -37 -5 43 40 59 69
2426 69 -30 -2 -55 -116 -48 63 -19 -11 17 101 70 119 87 -125 -72 28 137 49 52 36 -16 73 68 103 272 34 115 73 53 70 34 44 -47 -41
2027 -41 -6 158 101 -15 97 30 17 139 270 -4 -111 -31 47 21 8 -10 81 -53 -69 -44 62 -48 -76 -90 40 -9 -2 96 41 -25
1675 -25 9 37 66 -9 -31 -9 -16 -29 -68 -36 -68 -65 67 -59 86 -9 -29 -124 -19 -4 -31 -12 129 231 92 13 3 -11 -95 15 67 127
1299 127 -10 214 29 3 -45 -1 167 125 50 53 33 32 -81 18 4 -35 -27 -26 -7 60 75 -45 18 -39 -109 15 25 -46 -13 -17 -13 -64 -2 164
900 164 36 -68 27 -26 41 42 -27 -10 37 -144 116 140 -73 31 116 -55 33 6 8 29 -22 108 31 59 271 121 59 42 25 -89 -12
536 -12 89 13 81 83 -15 107 -68 -40 -39 -16 -26 -50 -29 152 -75 2 55 243 46 -1 38 97 -59 -63 -41 -47 67 -11 -22 -1 10 -12 -28
149 -28 56 122 -20 -33 -33 -24 135 232 46 -49 -5 93 -25 58 154 9 -63 45 76 137 88 13 -52 -79 -15 49 -31 -6 -55
-192e5
##PAGE=	F1=21892.5
##FIRST=	25164.769650603881018,	5806.207692317537294,	-0.19293093681335449219
##DATA TABLE=	(F2++(Y..Y)), PROFILE
5806e5O0j3k3j1K0K0k4N0M7JK2n4l6r9J36j17J82j62q2J44R2j03j75J12P3o1J0j07J41k4j07
5442a43J48PJ43M8j18j66J48p6K7M3r2O9r5L2L1J9j17N8J1P7q8J67j19o0L2K0m2j6l8J7R2
5078A9j11J74l2j96J60N5r6k1K0p3J64j20Q7Q9j85k0J47m7r6L7L3j04J49o4Q9p5n1nk4K1O7
4715ij9N5L3j10j12J62K7o8Oo2J03K35j72j34Q9n5P9j60K04j16J9J46j10k7J39nj40j6J78
4374A60q6m1J05o2O4k83J39O2k9J6k0K6m7n7P7j17K6m9Q5k2m0R3R7qo5J1r2J3Q3J90k79O5
3999A5n0p3J43q1R9K4L3m3k3o8oO9J1l4J2J2m8mJ51M6j65j20Q2L6L7j28K8j07J14k2N4J10
3623A04r2j14q0J16kP2K0kj26O8L9Nj54J31K7K8L6o9K67k90k1p7J69R5j43p9N4k1L5m0R5R7
3247A48j12o5Nk8J40n5m7k2O4j12J19p5J5qN0k04O4J65k0k1Kj02J97L1k61K52n1p3rl2P5m7
$$ plain form
5806 -55 5 -8 -31 -42 -22 -2 -26 24 71 72 94 40 4 -95 41 -76 106 -56 -138 6 98 -5 -180 -68 5 -56 -46 -153 -12 -36 -143
5442 -143 5 12 155 203 85 -81 67 -9 18 61 -31 38 -57 -25 6 25 -92 -34 -23 54 -34 133 14 -46 -14 6 -36 -52 -90 -73 19
5078 19 -92 82 50 -146 14 69 -27 -48 -28 -101 63 -57 30 119 -66 -86 61 14 -82 -45 -12 -116 33 -31 58 -17 -68 -73 -97 -76 -9
4715 -9 -28 27 60 -50 -162 0 27 -41 -35 -97 6 241 69 -65 24 -31 48 -112 92 -24 -5 141 31 4 143 138 -2 -18 160
4374 160 74 33 138 76 140 -143 -4 58 29 45 25 51 4 -53 24 -93 -67 -116 -31 -53 -93 0 97 89 24 35 -57 -44 39 229 -50 15
3999 15 -35 -108 35 -46 53 77 110 67 44 -24 -30 39 50 16 28 40 -8 -12 139 185 20 -100 -18 18 55 -73 -45 -152 -38 -60 -6 104
3623 104 12 -102 -182 -66 -68 4 24 22 -104 -36 3 8 -146 -15 12 40 76 7 274 -16 -37 -114 55 150 7 -72 -18 -39 -4 -44 51 148
3247 148 36 -29 -24 -52 88 33 -14 -36 28 -84 35 -40 -25 -33 17 -187 -123 42 22 1 3 -99 98 129 -132 120 69 -4 -13 -45 30 -17
2872a7M5L5r7J27m4j08J%K0L1jk8j3Q0n4r3N3m4N3N2J72m6j65L8p4O9J7j8Q1j5k3m5k0K2O2
2461E3o7L8lj03O9p8n5J70N8j22K4MR1rP0n9k01M4J00Q9r8L7%m7N1l5M8J54k01P3q9MN6k9
2062C7ql1NK2R0n5p6J00q7j1J76J36k77j59J04O1m9L7j0O1j40M3m3J01q4k5m8J60k8k2J22
1698A02n7n5N4m4L7j6j9olPl4K1m3K2J05r9J06r5j2q0R4l4NJ6J30J83j57j19L4m7r4Q0O6M5
1299I3j18K19j71Kr5R0J20q4j4j4RM6j62N8Rm3N9k2rQ9K2j49O4l4p6J57oq7N2J5o8J4O1J15
900A42p2j04J05r7M5M6o2o1L6r5J84Qj19R7O1j56N5J4j1K7JO9j11L3J83j71k0L3o9r1L4K07
524A41p5K5J9q3Kj17J8J8O3mOl1J48j32RP5J62j76o4Q0Oj39oN0m3Q5n3K7M8J0p0j9O6O7j14
114aj7K0l1J42J19j99n5O7J4j34Q3O2o5p1Q5L9O2p1o9J1m3R0po3J8k6
$$ plain form
2872 -17 28 63 -34 93 49 -59 -58 -58 -38 -7 -8 -36 -49 31 -23 -116 -63 -107 -54 -2 170 124 -41 -3 -77 -8 9 -9 72 57 34 -11 -31 -9 53
2461 53 -14 24 21 -82 -13 -91 -146 24 82 -40 -16 -12 79 70 140 81 -120 -76 24 113 15 52 52 5 56 21 69 223 22 95 6 10 66 37
2062 37 29 -2 3 25 115 60 -16 84 -3 -14 162 298 21 -138 -34 27 -22 15 5 66 -74 -31 -74 27 -57 -82 -130 30 2 -20 102
1698 102 45 -10 44 0 37 21 2 -4 -7 0 -34 -13 -56 -34 71 -28 78 -17 -29 -109 -15 -49 -44 -28 102 285 128 9 43 -4 -98 -18 48 93
1299 93 -25 194 23 25 -70 20 140 56 42 28 37 83 -79 -21 -12 -55 4 -18 -27 62 84 -65 -1 -35 -111 46 40 -47 5 20 -48 -34 27 142
900 142 70 -34 71 -26 19 65 3 -58 -22 -117 67 75 -44 53 114 -42 13 27 16 43 44 113 2 35 218 47 27 60 -9 -100 -66 141
524 141 66 91 110 27 29 -88 -70 -52 11 7 13 -18 130 -2 7 82 244 68 4 84 90 -49 -55 -5 -48 37 -16 11 59 69 -1 -20 46 113 -1
114 -1 -18 2 -29 113 232 33 -22 45 59 -75 8 70 5 -66 19 58 120 49 -20 -9 -52 38 31 -32 -14 -40
-192d0
##PAGE=	F1=21841.4
##FIRST=	25164.769650603881018,	5806.207692317537294,	-0.11035823822021484375
##DATA TABLE=	(F2++(Y..Y)), PROFILE
5806c1M8%p0N5kM7o1K7O7K2j5l0n6m9J26j27J59j55n8J38N8j21j12R9R3k8k2j48J21m4o7J43
5431Gk5J24P7j19j21J32p5L1M8q7M3p5K8MM7j48O6k5J38j50J50p3o4Q9L3o7j0m4oR8j46J23
5055COj14J34Q1j19l0j9m4J85j24M0J22j81l1J38k8q0K4Lq8J22n4N2On6k3m6N3l5N9M9J6l3
4668a2j47J31M0m4l0n0J02K07j53j46J02l9N0j40K23j47K8J19j20K5J44pj72lJ47n0q0J26
4339A04n3K9j49Q7O2n4l6MN4j5j18P8j02Q4r7O1k9k2J27J06m5r5O3r5nQ0J35k36L5J9r0J22
3963Ip2J12qJ19p7p9l8lN7J5l1Lpj8NJ13O1j77p3J22n6K0p9J6j05J73m5K0J31j14q8q2J44
3576c2j5K3M6kp3R1n8pj15J56J7M0K1r8K47k48o4n2J44P1l8j42R2n6K7o3J04J73j37p6j4M
3200c4P6lk6l4N0o0Q7p8k8jM8j78J17R0j5Ql8j15K29Mj97J86m2l0qm0L6L3J2Or5Q3l2p5RK8
$$ plain form
5806 -31 17 17 -53 2 0 47 -14 13 80 102 87 57 1 -48 78 -49 110 -45 -103 35 93 -28 -140 -41 52 24 2 -146 -25 -69 -136 7
5431 7 -18 106 183 64 -57 75 0 31 79 -8 35 -40 -12 -8 39 -109 -43 -68 70 -80 70 -3 -67 22 55 -12 -22 -66 -72 26 -120 3
5055 3 9 -105 29 110 -9 -39 -58 -102 83 -41 -1 121 -60 -91 47 19 -61 -37 -34 -122 0 -54 -2 4 -52 -75 -121 -68 -103 -44 5 21 -12
4668 -12 -159 -28 12 -32 -62 -112 -10 197 44 -102 0 -39 11 -129 94 -53 -25 94 -26 -1 143 136 -36 -39 108 58 -22 104
4339 104 51 80 -69 18 80 26 -10 -6 48 33 -85 -7 -109 -25 -122 -61 -90 -112 15 121 76 -19 44 -51 -56 24 159 -77 -42 -23 -113 9
3963 9 -63 49 41 160 83 4 -34 -37 20 35 4 7 0 -18 -13 100 161 -16 -89 33 -23 -3 -82 -66 -171 2 -43 -23 108 -6 -94 -176 -32
3576 -32 -47 -24 22 20 -53 38 -20 -27 -142 14 31 71 92 -6 241 -7 -71 -123 21 92 54 -88 4 -52 -25 -88 16 189 52 -24 -38 -34
3200 -34 42 39 13 -21 29 -31 56 -22 -50 -51 -3 -181 -64 26 11 19 -19 -134 95 99 -98 88 46 16 8 -32 4 37 49 55 -40 43 11 -64 -55 -27
2778b7J2jjJ2o7Q2p8m9N3m5M8N9J93j8j85L9p9R2j1j22J28Rl3p0P2l8M5n0K2lj09J32p5m5
2379a08K00rj46L8oQ7k2R7m7j88kJ00R4j15N4J8j1ll4K5J57j81N6r9PR6m9MJ1KLL7m2l3P0
1968F1n6pJ79R1k40j48P7M3j8N3n0M2q6M0p4Q5n1k0n9J76k6o2J35p3lM5r8O3L1j0l1m6O6m
1569B5rn7J5Q3o6O6p5Lo5N9p0K0M2J15K06j45j45M4m6r4N6N5J9j03J87j08K7q6Q4N0j01K7
1193A3k0J9J04j57k9N8l3L4l5l0Q9P2j46L4j5o6J66J0j17O9J0r0O0K6Q7j3j01Q0j29P3M8q1
818a0p1j3j3J14K5n1O6N6j38K1O6m7O6K3Qj46N6J30j78K6O2q4n4L2K14o1k2L2n2q4o8J5M1
430c9R3j1Ol8R9n3n2J03J01j41m3O2l3n7J9L0n1K3%M1L1J2j02oK4O4o4j9J9o1J13J45k03k0
31hQ0j6j55N7O1J0q3L6L3N5n2j8Pl6J07p3k9L0m1
$$ plain form
2778 -27 -15 -16 -17 -5 -72 10 -68 -117 -64 -109 -61 -2 191 173 -12 27 -52 40 29 -93 35 44 11 -59 13 -25 20 -30 -8 -11 -120 12 -63 -108
2379 -108 92 83 -63 -25 -31 56 34 131 84 -104 -106 -6 88 -27 27 45 34 31 -3 22 179 -2 54 -45 -38 58 9 13 24 26 29 66 24 -9 61
1968 61 5 -2 177 268 28 -120 -43 0 -18 35 -15 27 -59 -19 -93 -8 -59 -79 -138 38 12 -50 85 12 9 54 -44 19 50 40 9 -37 29 25
1569 25 16 -41 -26 57 -9 57 -18 -15 -80 -21 -91 -71 -29 86 292 147 2 46 0 -94 -38 17 36 -67 120 12 39 -47 37 87 -14 13
1193 13 -7 12 116 -41 -70 -12 -45 -11 -46 -76 13 85 -61 -27 -42 -108 58 68 -49 20 30 -60 0 26 113 100 -1 79 -50 23 71 -10
818 -10 -81 -94 -107 7 32 -19 47 103 -35 -14 52 5 71 94 102 -44 12 142 -36 -10 52 -32 -86 -54 160 99 77 109 57 -27 -95 -80 -39
430 -39 54 43 49 11 110 57 5 108 209 68 25 87 54 -3 16 46 -5 18 18 59 90 102 0 -6 18 82 18 -1 18 -43 70 215 12 -8
31 -8 72 56 -99 -42 19 29 -54 -18 15 70 18 0 7 -29 78 5 -24 6 -35
-192c5
##PAGE=	F1=21790.3
##FIRST=	25164.769650603881018,	5806.207692317537294,	-0.027785420417785644531
##DATA TABLE=	(F2++(Y..Y)), PROFILE
5806hM2K0q5O8k3Q4j11pQ7M2k2K4r4j8J17j37J35j48l3J32K4j41m9Q7J01lm4j78J12n3l9J26
5431Hn7J06J07j20p7J16p2L4N2q3Qo6L3j2P6j79O9o7J84j37J04o0k1J02M9q6mm8l1J04j81
5067a49P4M3l2Q9Q9j25k0n8j4K06j27rJ56j65l1J16j9o4J1k7p1R2m2J4Q9o3m1n5J00j00Q4
4703d9L9oM1j82J11O5l1p7l7R8J81j34j58J16j8K6q7J87j72M1R3j31O5J39Kj93%J05mj08J49
4339G1m5OoJ6L7o7p7J6P2K7j68P9q6J59j25J9n6j5J50J37n8j48R4q8j3P8P9j80J5P7j17J01
3963a6o4J25l9J93j23j11J3j1L4J8k6ok9J4J4P5P6j90k5J75j40j9n3M7n8J62n0k0J45j24n0
3600f3r6J59j5j5N0k4k0J14j18J7j00J55PN2Oj29K23k12n1o1J15L9O8k05J32r2M5o0P6K11
3247B08j46p0p8Q0j0K2J6k8K4j8O5o8p1MM5j51J59NJ3N9q0j27K50l5j44J10k2K4Nm0k3R2j1
$$ plain form
5806 -8 34 54 -31 37 14 98 -13 -20 67 109 87 111 17 -1 116 -21 114 -34 -67 65 89 -52 -101 -14 87 84 40 -138 -26 -79 -118 8
5431 8 -49 57 164 44 -33 83 11 45 97 14 22 -44 -11 -23 53 -126 -57 -124 60 -77 27 -33 -54 48 97 11 7 -41 -72 32 -149
5067 -149 -75 -32 -64 25 114 -11 -31 -89 -103 103 -24 -33 123 -42 -73 43 24 -40 -29 -56 -127 -35 -77 -63 26 -37 -78 -133 -33 -133 -49
4703 -49 -10 -16 25 -157 -46 19 -12 -89 -126 -28 153 19 -139 -23 -41 -15 -102 85 -87 -46 47 -84 -19 120 122 -71 -71 34 30 -78 71
4339 71 26 32 26 42 79 12 -65 -49 23 50 -118 -39 -125 34 -91 -72 -128 -143 7 144 86 -62 32 -56 -69 9 88 -92 -77 0 -117 -16
3963 -16 -80 45 6 199 76 -35 -22 -33 1 19 -7 -13 -42 -28 -14 61 137 -53 -78 97 -43 -62 -115 -68 -126 36 -14 -34 111 -13 -63
3600 -63 -159 0 -15 -30 20 -4 -24 90 -28 -11 -111 44 51 103 109 -20 203 -9 -60 -121 -6 33 101 -104 28 -64 -19 -79 -3 208
3247 208 62 -8 -86 -6 -16 6 22 -6 18 0 65 -3 -74 -70 -25 -176 -17 -12 1 60 -20 -147 103 68 -76 34 12 36 41 1 -22 70 59
2860E9j2r3M1k1m4J8N5Nl2kN0j18Q3j03nO5l3L1N3J95pj86O0q6J16oj92J30j3l1q5J72r4P
2461b3L6n1K7j29J78p3l6K14r4j18J2M1N0p4J72l3j76j3M3J23j08N3J7K6n8l4LJ55j68On4
2097h6MJ32o7J5M0j1nnk8QN3j4j6J72L5k14j26O1K5J4N7j03K4l2O1q3N6k7nn8J76m2o9R2p1
1686c7O6L5j52P8O7Rm4j01J15L9k9p3QO2l5L9m5Po0M8q0l1R4Q4K13j22j60N3m4r5L2M7pq9
1287a08J55m6N2p7P9j1j07M7n0L2J60j40j04J06k2Pm7n0Q8J23j44MLn6J77K5j46Q5Nj12J05
923C3rO0M5r8N6j60J00M9r0o8p3N9M9M8l9O8N7j15j4J18q2J04M6n2j84Q2R5j67M1O3q2jO2
536AJ65m0o2L6l2p7p5LN6J23j9Pm5L8J6j03J43K7j17k3M5o2L7M6J0o1l7N3N4LLj23J7j6O0
125E1j2k4K0r2Q4J71k05J1R6m7j50N6L6N8r5j3K7M9j6N3k5o2J36j27NM2n8
$$ plain form
2860 59 47 -46 -5 -26 -70 -52 3 8 -24 -26 24 -94 -11 -114 -119 -54 -87 -56 -3 192 185 -1 59 -27 89 83 -109 21 8 -23 -108 64 -30 -23
2461 -23 13 -38 -11 -140 38 -35 -71 143 49 -69 -57 -16 34 -40 132 99 -77 -90 -47 76 -32 21 38 64 6 -28 -25 130 -38 -32 -86
2097 -86 -82 50 -17 -2 38 27 22 17 -11 -3 50 36 20 192 227 13 -113 -52 -27 -13 44 -59 -35 -67 -6 -89 -33 -60 -65 -123 53 11 -58 34 -37
1686 -37 29 64 -88 -10 57 66 22 -79 36 75 46 -27 -19 43 8 47 2 9 -51 -3 -83 -114 -20 64 277 155 -5 48 4 -91 -59 -12 -19 -108
1287 -108 47 1 53 -24 55 44 -63 -16 -66 -34 126 -14 -118 -12 -34 -27 -74 -124 -36 87 -57 -53 -50 -106 71 96 -50 35 40 -72 33
923 33 24 84 129 31 87 -73 27 76 -14 -82 -155 -96 -47 1 -38 30 87 -28 -42 76 -6 98 144 92 -92 -10 85 -82 -41 22 -60 -61 1
536 1 166 126 64 100 68 -9 -84 -81 -25 98 79 86 41 79 95 -8 135 162 45 22 67 5 42 88 98 37 0 53 107 110 113 -10 7 -9 51
125 51 39 15 35 -57 27 198 -7 4 100 53 -97 -41 -5 53 -42 -55 -28 21 5 58 33 -29 107 -20 -15 27 -31
-192c1
##PAGE=	F1=21739.1
##FIRST=	25164.769650603881018,	5806.207692317537294,	-0.018294930458068847656
##DATA TABLE=	(F2++(Y..Y)), PROFILE
5806eN0M0o9L1l3J33j67m8J42QJ1P2j22j6J18j52J03j37%J20L1j05n3N0J08j2m4j78J04j6
5454c6m9J01q5O5J42r7n3J10n5j4R9q2n0o6O6l4P2j67N8l3J62r9M1m2J4J12M4r1pn1l3J16
5078E8j84K7O2JK1R0o8J3j14OJ82j05l1J65j46k6R1l9oqm2o5J03n7K4J13q9m2q0J64o1QK6
4691il5J03k11R2J01p7q4J0O7J68j47j09P4QJ8m5J44j46K2P5j35Q1J17L3j62o3Q2K4r5J43
4339D4n0P3M5q1K8n7j23J5Q7O6j58Q4r7K23j37m3n8LJ24J37j3k10R5o6j2M8N9j12K3O5r8N3
3963d3k3R7n1K11j20j54P6m0L1J4Kln3K7NN7Q0k05N0J84j91o5nL2L8R4l4n7J51j10l6j10J74
3576B3ql1Mj2J6J20j45K1m3J37j7M3j2j47J93j51l0n8N6N6J11k54J69j29N8j7M1K05j27n2
3224B0j42J44j07L2P7m1K8QJ9l8p2LJ9j17J62o7O4J07j02q9J86l9j40O9lN7K0lj09J27l4k3
$$ plain form
5806 -5 45 85 16 47 14 147 -20 -68 74 82 93 165 43 27 145 -7 96 -41 -41 79 110 5 -48 2 110 98 54 -124 -20 -36
5454 -36 -85 16 -69 -4 138 41 -12 98 43 29 128 46 -4 -70 -4 -38 34 -133 -75 -108 54 -45 -4 -46 -32 80 124 33 26 -25 -58 58
5078 58 -126 -99 -37 -36 -15 75 7 20 -94 -88 94 -11 -42 123 -23 -49 42 3 -3 -11 -53 -118 -15 -72 -48 65 -24 -66 -146 18 -43 -35 -9
4691 -9 -44 59 -152 -60 41 -36 -120 -110 -43 125 -22 -131 -57 -49 -31 -76 68 -78 -56 19 -116 -35 82 115 -47 -110 -28 -4 -99 44
4339 44 -6 67 112 31 59 2 -121 -106 -19 47 -111 -27 -124 99 -38 -81 -139 -136 -12 125 112 -98 -3 -69 -81 -33 26 -86 -63 2 -96 -43
3963 -43 -66 31 -20 191 71 -83 -7 -47 -16 -2 0 -3 -56 -29 -24 33 113 -92 -42 142 -49 -114 -119 -87 -49 45 11 -46 105 -5 -41 -151 23
3576 23 15 -16 -12 -24 -8 112 -33 -12 -55 82 65 108 96 -51 142 -9 -39 -97 -41 15 126 -128 41 -88 -30 -47 -6 199 72 20
3224 20 -122 22 -85 -53 24 -17 11 19 38 0 -72 -69 -50 -167 -5 -72 -8 99 -3 -92 94 55 -85 -16 -19 38 58 55 -54 73 39 16
2848A6p4J6Mn5P7M4k4k9l1Q2r0L7r0J5P0l6J4O5J53oj51N9p9J31Jj78R3o4k5n2K20j28o1J35
2449E9j09M9j52K02o7k3J65j36k6l9P6K4j47K67m1j60J0k5J06nJ0rL1p3pl9J44j47n3RRJ21
2074B4j01P1L6j0on4JN2K8K1j0J17j4j71r1O7JL5K4j16J2%P2o5L0L0j7p6J62o2l2K0p0J37
1675D5Lj17M2Q5Ll6p0O2N0mq3j0N6lJJ7kn4K7n3r4J36O2J83r3j81M3l2o1J4J4jmK2J0P0m6
1240AN3o1j8m3m3J8J98q2j44J17j1k2q3N3MJ24j32qJ8k9J74Rj39O7Pp6R4o8R4M7o6J9j61J18
841B9K8j04m4r0Q1J6O6m1N6P4r0m3J47p6J06L7q3k02J02P7p1j4J7p0L5J03J06k6r4L4k6jj09
454g0j1P2J19j6Jl7j1L7j08J77l7j34J4Mn5J06L6K9o4o2Q8N5m5Mr9J2o8N8L5rQq1K9J87j70
43fnR9m2j44R3J4N3j18j3L0J6O7M6o3n5J18q6k2M4o8
$$ plain form
2848 16 -58 -42 -38 -93 -16 28 4 -25 -56 26 -64 -27 -117 -102 -32 -68 -54 11 164 158 7 66 -13 118 119 -59 34 -30 -55 -107 113 -15 -76 59
2449 59 -50 -1 -153 49 -18 -41 124 -12 -38 -77 -1 23 -124 143 102 -58 -48 -73 33 28 38 29 60 -13 -20 -59 85 -62 -115 -106 -97 24
2074 24 -77 -6 30 20 14 -40 -39 13 41 62 52 169 155 -16 -107 -40 -39 -4 20 -96 -84 -84 -12 -77 -47 -17 -34 -110 52 -10 -42 -22 -92 45
1675 45 48 -69 -27 58 61 25 -45 17 67 63 -20 -30 26 23 24 41 39 -15 12 -41 -135 1 63 246 153 -28 15 -17 -78 -64 -50 -51 -55 -33 -23 47 1
1240 1 54 -7 -25 -68 -111 -93 105 23 -121 -4 -15 -37 -120 -67 -63 61 -71 -79 -61 -90 84 93 -46 21 28 -48 46 -22 72 119 53 72 -89 29
841 29 57 -47 -91 -181 -100 -84 -18 -59 -3 71 -19 -62 85 9 115 152 69 -133 -31 46 -25 -39 -22 -92 -57 46 152 126 32 66 40 39 -70
454 -70 -81 -9 110 94 95 58 47 84 -24 153 116 -18 -4 0 -55 51 87 116 52 -10 78 133 88 92 -7 5 -63 -5 30 21 29 -52 -23 164 -6
43 -6 -11 88 46 -98 -5 9 62 -56 -69 -39 -23 44 90 27 -28 90 4 -18 26 -42
-192d2
##PAGE=	F1=21688
##FIRST=	25164.769650603881018,	5806.207692317537294,	-0.0088044404983520507813
##DATA TABLE=	(F2++(Y..Y)), PROFILE
5806bN9O0n3pn4J71k12p9J87l7N5J31j61k4J29j56N9j36M4J19L7o8p0NJ06k9k4j59J07L0o8
5442d0O4j12K2J79p5l0J06n1p2J55o9j20p5J20l2N7j68P2K7O4m7noK6R9N1q5k1o5j4J51j71
5067f5nM2lm6R2J1O8j76K0J13m0n6J68j26k2N4o9O1j4n7n8J24o0K2J26j22m7o0J83j8o1J2
4691io3J65k40P4J36j23r1N8L6J60j55j4j4K8NqR5p5m2P4j22Q5Q3P5j19j38M8O4p0J20p3J74
4316A24M0j66K9l9p4M6j9J16j39Q8j06K75j61r3m9J1Q5J31K7k25M8l8mK9N1n7K0N4q0OJ7P0
3940A7o3K12j34j40J04o2L1J0L2jp6M0mL8Q5k20J24J88k47m7J6pJ08L9nr7J58r7k1j36J80
3576B5Rl5m4JL3J08j34O0mJ01n3K3j9j53J64r0j0n5J4Q9Q6k79K13j62N9J5J7K12j07l1j50
3212i7J17j30K3J26o8K3K3j7Nm8K8k9j03J32q2Q4J28j14l8J22m2j26L8oO9M7M7j41O3l5j3
$$ plain form
5806 -2 57 117 64 57 3 174 -38 -117 70 33 88 219 58 34 163 7 66 -70 -26 93 130 62 -8 -3 103 74 50 -109 -2 28 -40
5442 -40 24 -88 -66 113 38 8 114 63 -9 146 77 -43 -118 2 -30 27 -141 -69 -42 22 -25 -30 -36 -10 89 140 55 34 -31 -45 106 -65
5067 -65 -70 -28 -31 -77 15 26 94 -82 -62 51 11 -45 123 -3 -25 29 -40 21 7 -50 -108 16 -44 -22 104 -18 -65 -125 58 40 -21 -9
4691 -9 -72 93 -147 -73 63 -60 -151 -93 -57 103 -52 -66 -80 -52 -47 -55 40 -35 -77 -3 -125 -40 43 118 -1 -139 -91 -27 -97 23 -50 124
4316 124 164 -2 27 -12 -86 -40 -59 57 -82 6 -100 175 14 -79 -128 -117 -32 99 126 -99 -51 -89 -93 -64 -13 -70 -50 4 -76 -70 -53 17
3940 17 -46 166 32 -108 -4 -66 -35 -25 7 6 -70 -30 -34 4 89 -131 -7 181 -66 -113 -97 -104 4 43 38 -59 99 2 -19 -155 25
3576 25 34 -1 -45 -44 -11 97 -37 23 19 120 67 90 71 -82 82 -8 -18 -73 -59 30 116 -163 50 -112 -53 -38 -21 191 84 53 -97
3212 -97 20 -110 -87 39 -29 -6 17 0 5 -43 -15 -44 -147 -15 -97 -13 115 1 -37 85 43 -83 -45 -51 18 65 112 -29 34 -1 -14
2848a4l7RJ0q4J35L3n1k7o0J13n0Kq9K4P5l7mP9R7j5j05O9q3J34K0j53N6j16j3j3K26j17p0
2461e6J42j38R8j92K05p1k1J26j66O7r1J16Mj75L17o5j61N6p1O6P7k4k4K6j01M4n8J47j15
2121c8Rp8MJ01j24J39J9j8Mr3J9Q5MN6oO3o3j30o0O8K8J6k4n4p1N4P7n1J4R7l9j06J49q3K2
1710a0l5j9J05j4o5L8M8Kk2m0J2N8K2r4k6M9K8l7Q0j1m9Rk9j57J80L9J52o3k02L5k3k6mjK2
1299d8L4o7N0P1j2K5j12P1r1Om9J83j2j73J27%l3j02J25k3M5j11NN7k1J52oj33M8J1m1Q4j29
912f9J28L8m5pj50J35Qj24k6o0N6RJ06o0K3Q7o9k9J32o3J11K3j19j64Q8N4J8n6k0o8O1J32
536H0L5jj14L2k0P7j44k5Q7J04k4Nj7o0N7j11K10j01j52N2l5o3J67K5M8n6p7J13M5q2J7p0
160BJ3j33J29lQlp1J8J60j30j8R9m3r3Q3%N3j30kM2j2J14Jr2m1J10l2n5M1l5
$$ plain form
2848 -14 -51 -42 -32 -116 19 52 1 -26 -86 27 -23 -21 -110 -86 -11 -48 -52 27 124 109 4 73 -10 124 144 -9 47 -69 -82 -95 131 14 -56
2461 -56 86 -52 46 -146 59 -12 -33 93 -73 -6 -97 19 23 -152 165 100 -61 -5 -76 -10 67 43 19 45 -56 -12 -70 77 -38
2121 -38 -29 -107 -103 -2 -126 13 32 14 18 -75 -56 29 33 89 83 146 83 -47 -107 -39 -11 5 -19 -73 -144 -90 -13 -64 -50 47 8 -98 51 -32 -10
1710 -10 -45 -64 41 27 -38 0 48 50 28 -12 0 58 80 -14 -40 9 37 0 80 69 20 29 0 -157 23 62 214 151 -51 -16 -39 -65 -69 -70 -48
1299 -48 -14 -81 -31 40 28 53 -59 12 -79 -73 -122 61 49 -124 3 3 -30 -132 -7 -30 15 -96 -91 -34 -55 97 91 -42 6 17 -24 60 -69
912 -69 59 97 52 45 -105 30 38 -86 -112 -172 -116 -107 -1 -61 -38 49 -20 -49 83 20 131 154 35 -129 -41 13 31 -25 -45 -113 -52 80
536 80 115 114 0 32 12 89 -55 -80 7 111 87 92 75 15 72 -39 171 70 -82 -30 -65 -128 39 64 112 56 -21 92 137 55 72 2
160 2 15 -118 11 8 16 13 -58 -40 120 -10 -28 71 28 -65 18 18 71 -59 -61 -19 -31 83 84 -8 -49 61 29 -26 15 -20
-192b0
##PAGE=	F1=21636.9
##FIRST=	25164.769650603881018,	5806.207692317537294,	-0.10284698009490966797
##DATA TABLE=	(F2++(Y..Y)), PROFILE
5806b9R6O0o1j5m5J67k23j3J37j02J22J38j66m6J33j38L0j20M7J06M7k8r9NR0o2nj30J24N0
5454G0p6K7q3PJ52k8o0J06n3j07K09m6j70r7J65mk0j18O7N5j3j5L1QLP8N4r7l8o6QK04j47
5067Fo2M3j7q5J00L3J45j94L0j1K5k9J36j20KK4j20J46j9r1k5J36o2J0J26j27p4j4J80J4j06
4703@Qq2J95k79Q4J26j44l7O3J5J56j74O0m8J0jON7Kj04N2p9P4R6P2p9k34N5O8j2R1q7K53
4316A83ok10J5J3mM8o5Q3j11R3j16L01j65j17k7J7M4R0N6k10Jj4k4M5O8j7lK9o2k5M2N3q2
3928g7J73j27o9O3o5O4K7J4J5q9L6k4O6N2j92J82J25k66J5J5p8J74jK8j29J70j03Jj81J94
3576A3%k2o6M0rQ5o5R9J7M6q4Om0o9N9j9j8m0pJ12N1k74K20j38K8J6J5K00m2k6j61Q3p0J8
3177d2J13j25K8J7m1L2pO6o9j08P1MN8J18j44K6P6m4j27O8m8N7Q0J04j29n6m3OkM4rr5J53
$$ plain form
5806 -29 67 127 66 51 6 173 -50 -63 74 -28 94 232 66 20 153 15 45 -75 -28 78 125 97 -2 3 93 31 26 -104 20 70
5454 70 -6 21 -62 -55 97 69 9 115 62 -45 164 118 -52 -149 16 12 -8 -126 -59 -4 -17 -32 -1 7 10 88 142 45 7 -59 -51 153 6
5067 6 -56 -13 -30 -115 -15 18 163 -31 -1 -12 13 -16 120 0 2 26 -94 52 33 -58 -83 53 -9 1 127 0 -74 -88 92 106 0
4703 0 8 -74 121 -158 -74 52 -92 -129 -66 -51 105 -69 -9 -57 -47 -48 -42 15 17 -87 -35 -114 -40 56 128 49 -185 -130 -62 -74 17 -70 183
4316 183 177 -33 -18 -5 -9 39 -26 57 -54 39 -77 224 59 -58 -85 -68 -24 66 122 -88 -87 -101 -125 -80 -12 -29 -32 -3 -65 -90 -48 5 -77
3928 -77 96 -31 -100 -37 -102 -38 -11 3 18 -71 -35 -59 7 59 -133 49 174 -92 -77 -62 -140 34 33 61 -68 102 -1 0 -181 13
3576 13 13 -9 -75 -35 -44 41 -24 75 92 138 54 60 20 -49 10 -9 -27 -67 -74 38 89 -185 35 -103 -75 -59 -44 156 114 88 -73 10 -60 -42
3177 -42 71 -54 -26 -9 -50 -18 -25 41 -28 -136 -65 -61 -3 115 -29 -3 73 29 -98 -30 -78 -21 59 163 34 -22 -65 -59 -61 -17 -26 -121 32
2790C2Pn1qj7L6Jj9n0mQ5o4K4N3N0k5o2N7p0J24M7j33K5j25j2j3K36q9m3J11j31J26k19J48
2402B7n4k8O0m1N3j27J00K5q9K58j22j35P0o6qJ53mm6l7p3P9n3J04m4M5j53j6Q3l5J14k7m
2027IK0j07K4R8k5P2lLo8j13k2O9O6l2n8M1r0N0O8l6J4J19o3j36J49p4N9n6qN3jm5O1Mk2p
1604A3j2l4N2N6p5l0L9M7q3J30j3m4Kj8j55J53J1J48l3k47K4Oj1JkK0P3o4K1N8PPj43J13j00
1193h3N1n4Q0N3j76J60nl5o9J00k9k9j02O9R4o9J49m0j03K0L3NK7j36J45Lml7j18J04J7j02
818h1l6k1mN1J40m9p0J04n9JQ0j0R5rj15j21O0M3Q2q2n3m9M9J28RL2j25N5o4J50j75j8P8O5
419H1k5J5K2o7K0p8K13j26j85J18n3NO7QP6m7n7Q4N1j16N2k3jj31J54o7J0k4m7M3J16p9l3
31b4N0k5m0N2JO9j23j2L4PJ10k4j05m5J10L3r4M0j3
$$ plain form
2790 32 39 -12 -20 -37 -1 0 -19 -69 -73 12 -52 -28 25 75 50 -12 45 -25 99 146 13 38 -87 -99 -112 124 35 -8 103 -28 98 -121 27
2402 27 -27 -55 5 -36 17 -110 -10 15 -74 184 62 -73 -3 -69 -77 76 72 26 -11 -84 -5 -58 46 2 47 -106 -122 -39 -74 40 13 9
2027 9 29 -78 -54 44 19 91 88 91 23 -90 -112 -43 23 -9 -67 -26 -116 -66 2 -34 -20 99 36 -100 49 -25 34 -22 -30 23 22 -23 38 42 20 13
1604 13 1 -33 19 75 0 -30 9 56 -27 103 90 46 48 30 -125 28 39 187 154 -93 -69 -63 -74 -73 -75 -55 18 -46 -25 33 40 47 -96 17 -83
1193 -83 -32 -86 -6 47 -129 31 26 -9 -78 22 -7 -36 -138 -69 25 -44 105 65 -38 -18 15 20 47 -89 56 59 55 18 -100 4 21 -81
818 -81 -117 -138 -142 -91 49 0 -70 34 -25 -24 56 46 141 132 17 -104 -44 -1 81 -1 -54 -103 -54 74 83 115 -10 45 -19 131 -44 -62 16 81
419 81 56 71 93 26 46 -32 181 55 -130 -12 -65 -60 7 15 91 44 -13 71 122 6 58 35 34 -97 57 -10 0 -24 -71 -28 88 9 -24
31 -24 26 1 -39 13 14 83 -40 -52 -18 -11 99 75 -30 -75 35 68 -26 14 1
-192A
##PAGE=	F1=21585.7
##FIRST=	25164.769650603881018,	5806.207692317537294,	-0.11893522739410400391
##DATA TABLE=	(F2++(Y..Y)), PROFILE
5806c4J11L6n7j2m4J48k32N2R8j56J71J27j64n9J35j20L1p3J1N6M9Mj00L3O0j05K6r0J23M9
5454G4p6lj5K8R9oj01R4m5j30K52l4j64n9J22K9j04p1N2P3j5n7P6L2k0N7M5j20l3m5K0K44
5078A99j32j32N3k2K6M4m2K13j91O6j46P8jJ03j16J8k0r7K07m8j21J4R2l2nJ18j22q7K1J66
4726A04N7j39Lj01K08l35J45P7j15k3P5jJ57j87Q7l6j3j3K1K0P8j66K9l5P5J19N1n4k67L7
4374a42N7L4O8r6K68k5k42J4N5N4P4r2L0j06R8j26L27j68j30NK4KL2O6j70k4%L4M2O4Km2l
3987a6m9j2K3O6o6J07j47lJ6j2O4K6j9M2r1L1m4R3J9j63K41N0k96P8J5p1J64l4P2j62J83j09
3611dK4k38J97KKq7P8o3N3J4J49J9k7r7Qm9K4o6K8j4j5k8J36J6k70K29j15j5QK3J98K4k1j85
3212f2M1J2L3R1j94L3J0o4N9K2R5j11j12J0Q9L3J07j75R1M1l3j28R7r1M5J03J49j04j67m9
$$ plain form
5806 -34 77 113 56 44 0 148 -84 -32 66 -90 81 208 44 -15 120 0 31 -42 -31 25 74 78 -22 11 71 -34 -8 -98 25 74
5454 74 -2 -5 -20 8 107 101 0 94 49 -81 171 137 -27 -86 36 65 -39 -110 -58 15 0 -57 19 51 31 88 133 13 -20 -65 -45 199
5078 199 67 -65 -12 -34 -8 36 -6 207 16 82 -64 14 13 116 0 18 -2 -99 108 60 -61 -47 45 13 8 126 4 -83 -62 104
4726 104 161 22 25 -76 132 -203 -58 19 -96 -119 -44 -45 112 -75 12 -24 -37 -50 -29 -9 69 -97 -68 -103 -28 91 142 88 -179 -142
4374 -142 -85 -51 17 -79 189 164 -78 -64 -9 45 119 27 57 -49 49 -77 250 82 -48 -43 -19 -17 15 81 -89 -113 -113 -79 -37 27 29 -13 -16
3987 -16 -65 -77 -54 12 -54 53 -94 -97 -81 -93 -29 -3 -22 20 -71 -40 -84 9 28 -135 106 156 -140 -62 -47 -118 46 12 84 -78 105 -4
3611 -4 20 -218 -21 -19 -17 -104 -26 -89 -36 -22 127 146 119 22 30 -19 5 -61 -33 -47 -62 -90 46 62 -208 21 -94 -109 -101 -78 120 144 123 -62
3212 -62 -21 -9 24 115 -79 -46 -36 -100 -41 -19 76 -35 -147 -137 -48 -15 92 -83 8 49 16 -112 -15 -106 -61 42 191 87 -80 -129
2860a29K5L9Q2m6l7Q4j8m0K7K4m1N4m2j0l2R6r1N2K7Kl4k0M6o9J02P6j13Mj23k3k3K46o1k3
2461A1P5o9J23k42R7l6l7QR4K7j74P1L8nJ99j67r8P8o6l7J85K0o3p5k0N0k1M3J1R2k17l6O5
2074g6N4R0p2QL6j22J8J00n3Q7Jn7n0p4NN7R6r0j7O1j01N7N9k1J2J42q6j67J56o0N2l3mmJ2
1663A6k4Q6m1n7nK7o9L7P7m4k2K3O1q6J35k1m3opj41J36j8J43k1j59q1K9kjlK0J01p3LN5K8
1240E3rj10O9j10R3m1pP2j32J87j5l8l7O0n4k0r9J12J11j19J47p4p3rN6M2m0n6R7l3L5o5q8
853i5P5K5n5j8Lq0Q1J63k6j53J11o0K9L0M2P9m2j09p9L3L0J46j08q5l0L7J25j8O5j37J03q4
477bJ61j80j8O4K7k6J8N7k9o3m0K22j11j78J35k7oj6j5R6l7l7N5N7j49Q6J8j9q6J35j27J9
102a6k1JNR8l3n5MqJ2K2KQ5j18k1K6K4J08n0j16m9J09R8j33L9J1
$$ plain form
2860 -129 -104 -65 17 -29 -66 18 0 -40 -13 11 -30 24 -18 -28 -60 36 -55 -3 24 26 -8 -28 18 -51 51 127 14 18 -105 -128 -151 95 34 11
2461 11 86 17 140 -102 -5 -41 -78 -70 24 51 -123 -52 -14 -19 180 13 -85 -7 -73 -110 75 95 32 -43 -63 -13 -34 9 20 112 -105 -141 -76
2074 -76 -22 68 -4 4 40 -82 -64 36 -17 70 71 14 -36 -110 -105 -48 48 -42 -59 2 -99 -42 17 -4 8 150 64 -103 53 -7 45 12 8 4 16
1663 16 -8 78 37 -20 -25 2 -67 -30 47 3 -19 4 65 -21 114 93 50 44 37 -104 32 14 157 136 -23 -104 -75 -77 -78 -81 -61 40 -33 -30 25 53
1240 53 44 -66 3 -107 -14 -55 -62 10 -122 65 50 12 -25 35 -19 -39 -138 -26 85 -34 113 39 -34 -43 13 55 15 -41 56 23 58 -7 -95
853 -95 -20 5 -50 -68 -65 -145 -64 99 73 -80 31 -29 0 30 72 151 109 0 -79 -46 -16 130 22 -63 -93 -56 69 51 116 -21 82 -2
477 -2 159 -21 -39 25 52 26 44 101 72 9 -31 191 80 -98 37 10 4 -12 -27 69 32 -5 50 107 -42 44 62 43 -43 92 -35 -16
102 -16 -37 -36 -31 67 34 -21 -17 -25 -13 9 11 96 -22 -43 -17 7 115 65 -51 -100 9 107 -26 13 24
-192B4
##PAGE=	F1=21534.6
##FIRST=	25164.769650603881018,	5806.207692317537294,	-0.10091841220855712891
##DATA TABLE=	(F2++(Y..Y)), PROFILE
5806b9J07J8n5j0o0J49k19N2Q5j54J70J25j67m6J12r6M6n6j3j3N9L6q1Q2Qn0k4p9R8N9p3j3
5431c2K4O7O9pj27O7l1j01K20mj46m1R3M7j82j4L8N9L6j11J13L8l9L7K5j25K2Ln3K78j24j62
5055f3K4LJ03M6j69K54j56J00j62J8J3Q9j06J3n3L1J44o7j28L6K3L7m2R5r8j09O2J63O5j30
4703C6Mj41J90l24J86L3l1o8N5J7J23j60Q4k8j5l8M8M7Q5k03j7K9N7J47J9n6k26K3K8N4M1
4339ao4K11l7j84mP1Q1Q9r1l3r9N9p5L00j36j47M7K7l5K1Kj31J%J15RP2lp6Rr1K9jP2j7M3
3916C3j66K3l3R6K6K1o9P0q0J6j6R1k8q9K41j9k89J15j8lQ3k5J09j86K04j11L8k38J37pL1
3553d3m8N7j15K6P7J96j1p1q3Oj3P5j67M7l7J7PJ26lk44K17r7m3j0PK07J01l4j91j1P6O5M5
3165A31k55M2Rn3N5L7J12j27j27oJ20N6M6j75J27J6Lj33R2p2J9R8J90r1k09r4M2N5J45q9K2
$$ plain form
5806 -29 78 96 41 31 -29 120 -99 -47 38 -116 54 179 12 -34 78 -18 28 -28 -41 -54 5 41 -40 42 50 0 -24 -103 -5 54 -19 -32
5431 -32 -8 59 128 121 -6 61 30 -71 149 145 -1 -42 51 98 -84 -98 -60 -1 35 -76 37 75 36 73 98 -27 -5 -2 -55 223 99 -63
5055 -63 -39 -36 67 113 -56 198 42 142 -20 -2 11 100 -6 7 -46 -15 129 62 -66 -30 -7 30 -12 83 -15 -124 -62 101 166 36
4703 36 40 -101 89 -235 -49 -16 -47 -115 -60 -43 80 -80 4 -24 -39 -77 -29 18 103 -100 -117 -88 -31 116 135 79 -147 -124 -96 -42 -1
4339 -1 -65 146 109 -75 -79 -8 73 162 71 38 -61 -2 -77 223 87 -60 -13 14 -21 0 2 -129 -128 -128 -13 -4 68 65 -11 -2 -93 -64 -65 7 -10 33
3916 33 -133 -110 -143 -47 -21 0 -69 1 -79 -63 -79 12 -16 -105 136 117 -172 -57 -75 -78 5 -20 89 -97 107 -4 34 -204 -67 -74 -43
3553 -43 -91 -34 -149 -123 -46 150 139 68 -15 -9 -22 53 -114 -67 -104 -87 -80 46 43 -201 16 -81 -124 -134 -127 80 181 147 -44 -55 21 86 131
3165 131 -124 -82 -73 -126 -71 -34 78 -49 -176 -182 -62 -6 40 -135 -8 8 11 -122 -30 -102 -83 15 205 114 -95 -189 -147 -92 53 -36 -14
2801a4K3q2KM7N7j14J08n7M1o2O7r5Q1Mj8l9k0M2l6N2J21q8k5j09j6j5J77l1NM7NJ01k27K1
2402d7Jl9qJ61Pk03O0L3K4J66j75p0N5o6J8J29P5j07n6pK6K3k5M5R6k12o8O3J13P0q2nL3j01
2003g3qR7p3R0J3r5ok9K6K6R8j27N1L3j28O9M0J0K9J34j09j49J09JRqj4m6O4k5P1n0q1oJ5
1592d2l3j2Q7oj3KO8o1J05k2n2kj3p9Q3m8J56Lp9j28L5j6mJ5k2J25j01M3K7K3Nn5no3N0qq6
1158a23Q0l3J36J0k8k9Lm6L7q0Q6J13j74J58r6m7%N9O4j16L3K3k5N0p6o1M1M4j9kRq9O9J81
759A52l3j75Q2p4N9k5P6Q4q6o3m7RNJ96j45o6j8MR1L3O0j20J29n9Q8j55k1J9K3l7K3R7%j10
360d%J73p0j52J43rn6m9j5O7km2K0J10j93J11K2Km7J13j63Ok0O9o3J08j4n9n6L4L4%J9R5j03
-51Ip1P4j3J07m3j42l7J04J47j49L1J5
$$ plain form
2801 -14 9 -73 -71 -24 33 -81 27 -30 11 -51 16 -79 2 6 -12 -51 -71 -29 -65 -13 108 20 -5 -114 -130 -145 32 1 6 53 58 159 -68 -47
2402 -47 -46 -85 -93 68 75 -128 -68 -35 -11 155 -20 -90 -35 -101 -83 46 121 14 -42 -49 -23 0 -25 20 116 -96 -164 -101 12 82 0 -5 28 -73
2003 -73 -81 16 -57 33 46 -49 -55 -84 -58 -32 66 -61 -10 23 -105 -36 4 14 43 177 68 -81 28 29 38 30 16 -30 34 9 80 30 -51 -57 -42
1592 -42 -75 -87 0 -6 -19 -17 51 -10 95 73 21 19 6 -73 10 -38 118 121 42 -86 -51 -67 -71 -56 -78 47 -54 -11 16 39 44 -11 -16 -79 -29 -37 -123
1158 -123 -43 -76 60 70 42 13 16 -30 7 -73 13 126 -48 110 14 -33 -33 26 90 -26 7 30 5 55 -21 -82 -41 3 -16 -18 -9 -98 -29 152
759 152 119 -56 26 -48 11 -14 62 146 60 -3 -50 -41 -36 160 15 -51 -69 -65 26 59 119 -1 128 69 157 2 -19 0 23 -14 9 106 106 -4
360 -4 -4 169 99 -53 90 81 25 -24 -39 28 26 -16 4 114 -79 32 54 56 9 122 -41 -35 -55 14 -49 59 45 -14 -70 -36 -2 -2 17 112 9
-51 9 -62 12 -1 106 63 -79 -116 -12 135 -14 17 32
-192C2
##PAGE=	F1=21483.5
##FIRST=	25164.769650603881018,	5806.207692317537294,	-0.082901597023010253906
##DATA TABLE=	(F2++(Y..Y)), PROFILE
5806b4J04jn4qp5J49k04N1Q3j40J56J13j69l5R0p3O3m0k6p0P6P6p0J23n9j5k6j14O5O4m5k
5431c7M0Q5M9Mj60L5M8r9J65%j29k2P0P1k04J0OK7J19j35J12Pm0L6jj36J21Oj18L18j17j91
5055f0oK8J64K9k51K52j05J51j80m2K8P5j01Mm2J13Q6p9j36N8m1J13m2K3q1m8J6J61P9j16
4703E0kj85J66k27J37N1K0j43M6M6Q9j34P2l4on0Q1Q0M9j94J5J9J1J45nn0j74K1jP4J9k6R7
4316E7j5j08mO3Q5J05r1q3q2J8k2K61j14j54J00K6p9N8j05nl5j0J85l5P0Mj00K0j32P1k4P7
3940BL2J5j49k8rJ30OJ0j24R8o9%J2Q8p5k6K30m4k39O9m3P2Pj8J46k10K25j12N3k28Q9k8M8
3553g0j8K7p2n7J18K23k9j05o9MJ7J21k23K1n3N2N4J28l4k29K05p8m0Nq1K34J61o5j85n0J29
3189D1Q4J1l05N7J2poM7J22j25j25P6L9P2k2j02Q7LM7j39Q7l3J2O9K05j12j94j33O4O1J96
$$ plain form
5806 -24 80 79 25 17 -58 91 -113 -62 21 -119 37 150 -19 -54 36 -37 26 -14 -40 -110 -34 42 -28 95 36 21 -5 -119 -54 10 -35 -37
5431 -37 3 88 137 141 -19 16 64 -35 130 130 1 -21 49 120 -84 -74 -68 -41 78 -57 55 62 22 58 57 -79 42 48 -70 248 131 -60
5055 -60 -66 -38 126 155 -96 156 51 202 22 -20 8 83 -18 -14 -56 57 143 64 -72 -14 -55 58 16 39 -42 -90 -74 87 166 50
4703 50 48 -137 29 -198 -61 -10 10 -133 -87 -41 48 -86 -14 -48 -54 -104 -23 57 106 -88 -73 -54 -43 102 97 47 -127 -106 -107 -33 -14 -40 57
4316 57 42 -66 -70 -7 78 183 92 9 -73 -55 -77 184 70 -84 16 42 -37 21 -84 -89 -124 -134 51 16 86 90 -10 10 -122 -51 -75 2
3940 2 34 49 -100 -128 -137 -7 -1 9 -115 -17 -86 -86 -74 14 -61 -87 143 99 -140 -71 -114 -42 -35 -53 93 -117 108 -4 49 -179 -90 -118 -70
3553 -70 -88 -61 -133 -190 -72 151 122 17 -52 -48 -31 90 -133 -112 -165 -113 -59 69 35 -194 11 -67 -107 -102 -183 51 212 147 -38 -88 41
3189 41 125 136 -169 -112 -100 -107 -113 -66 56 -69 -194 -118 -79 -7 -29 -131 -44 -41 6 -133 -46 -79 -67 2 207 95 -99 -232 -168 -107 89
2825H9j33Q0l5j48M5O8J01j76J50q2Q1j05N2r1J11j8l0k9l3K5%jJ69o5n5r4J2J1P1l8N0L8
2449B0P9P9k13n5N3l0LJ65j4k30J04nL5J17j61k0K1p7Q4Q3J14j67Pl8JO8o1K4J23j85n5J6
2074a15J68M2r0k1L2q0l3R4q9J00J4n6%k3M7nR8j64J18Oj55Q2K1M3L3J15j21j20O2O4m7Mj1
1686A3p7J16k5N5n8r4LJ2J2m2K6L8Jk9O4k5Q5k2o0Lk0j4L8m6J15L1Rj65N2m1j9L8n8J16p3
1276d1O5j7K4K4k0qn2l1J8q3M5K3R6M8k6k5p6K9P8p8N5J09j86J25j12j6RO2Q6j92J23n2j6
888a2O4q0k9M1QQJ0K5q7M6J89k9j85N2q8Q9q1J11R0j20ok0k1J3J90j75m2ol0N9Q4N4j05J57
489A74l2J4j30k6k6K2n0J7J26N1j37L1J14l0j27J32j0q6o3j4L9L2m8jJ75k09P1L1L0j3Q4j42
114am2k4J32j32J19ko8m6N5lRL1J00q7j23J23n1R5m6j25J7J7K03j58K8J8
$$ plain form
2825 89 -44 36 1 -147 -102 -34 67 -109 41 -41 40 -65 -13 -104 7 -11 -41 -70 -103 -78 -78 -79 90 25 -30 -124 -112 -101 -30 -68 -18 20
2449 20 99 178 -35 -90 -37 -67 -64 101 87 -143 -39 -44 -9 108 -53 -73 -52 -129 -45 38 152 -15 -8 -46 -45 23 -38 -14 109 -76 -131 -115
2074 -115 53 95 5 -16 16 -64 -97 -3 -92 8 22 -34 -34 -57 -10 -15 83 -81 37 43 -112 -30 -9 34 67 182 61 -59 3 67 20 24 13
1686 13 -64 52 27 82 24 -70 -67 -55 -43 -85 -59 -21 -20 -49 15 -10 75 53 -7 -4 -24 -38 0 -46 69 100 109 -56 -4 -45 -64 -26 -84 32 -41
1276 -41 24 7 31 55 35 27 -25 -56 -38 -121 -76 -53 43 91 65 40 -36 -7 71 -7 48 157 -29 96 -16 -32 -23 39 125 -67 56 4 -12
888 -12 52 -28 -57 -16 -8 0 10 35 -52 -6 183 154 -31 21 -67 22 -59 52 142 22 16 -4 -25 -12 178 3 -39 -45 -75 -16 68 122 17 174
489 174 142 156 26 0 -26 -4 -54 -37 89 140 3 34 148 118 -9 123 113 27 -36 -50 -11 21 -27 -28 147 -62 9 40 70 57 141 -1
114 -1 -43 -67 65 -67 52 50 -18 -64 -9 -12 -3 28 128 41 -82 41 -10 85 39 -86 -69 -52 151 -7 21 39
-192C9
##PAGE=	F1=21432.4
##FIRST=	25164.769650603881018,	5806.207692317537294,	-0.067117929458618164063
##DATA TABLE=	(F2++(Y..Y)), PROFILE
5806a9P9Mm6l3OJ02j99J2J17j37J50R1j67j7Q1n2N8l0km7J08M1p2J09r8prj49L3P0J2lJ1J10
5407A07M9Mj69J0J35j12Q3%j02j0O1Q4j87J7j7NJ88j42P7k9l9O6l0o4J13Kj43L16j21j81m8
5043g7P7J63M4k45J34j8J78k01o4L0P7q9k3J4J27M4r2j09N4o5J48k9n9q0M2l5J64N2o9mk47
4679a58J40j15R5Q3J3j98M6O8P3j20N1j4K6r5J09J21%j74M6Rm1J14Pn4j27K1NN4K1L7p4L8
4304Go9L0P4L4J20p6j33l7l5L9J91p8j48J20J4r9J30j49L4m3K3J88r3P3j8r3K4j60J42p0P9
3940B1N7J8j46o7M1J17Lk9r7Q4m9l9M4P1p6J8J68l4k00K5k5J25q8MJ68k07K12m3Kk46Q6l1
3564a13O0j1j1kj03R6K45o8j04l5k0M8J38j90o9J8J8Q1J29n2k48K34m9n3qr8K12J59o2j34
3212Hp7J16J16K0k81j9J1K2j7JJ22o9j07J09jN1q5j9K4j5J20j41O8j4J0N6J92j57j00j55P0
$$ plain form
5806 -19 60 64 18 -15 -9 93 -106 -94 23 -114 36 127 -40 -57 24 -28 30 0 -2 -49 59 100 28 137 39 32 23 -126 -93 -23 -11 -14 -3 107
5407 107 156 160 -9 1 136 24 107 107 5 -5 56 140 -47 -30 -47 -42 146 4 81 52 13 79 49 -15 98 100 -43 273 152 -29 -77
5043 -77 0 163 207 -38 96 78 256 55 -9 21 98 9 -14 0 127 171 79 -30 24 -41 107 78 19 -61 -19 -54 110 162 93 89 -158
4679 -158 -18 -133 -38 45 58 -140 -94 -26 47 -73 -22 -36 -10 -105 4 125 125 -49 -3 6 -35 79 86 32 -95 -74 -69 -15 6 43 -31 7
4304 7 -62 -32 42 76 196 120 -13 -50 -85 -46 145 67 -81 39 53 -46 84 -65 -31 -74 -51 137 44 117 99 6 30 -130 12 -58 21
3940 21 78 96 -50 -117 -76 41 44 15 -82 2 -47 -86 -42 29 -47 -29 139 105 -95 -70 -95 30 -58 -54 114 -93 119 76 78 -168 -82 -113
3564 -113 -53 -64 -75 -77 -180 -84 161 93 -11 -46 -66 -18 120 -70 -139 -121 -103 -22 107 55 -193 41 -8 -61 -69 -167 45 204 142 8
3212 8 -69 47 163 183 -98 -117 -106 -84 -101 -100 22 -47 -154 -45 -46 5 -80 -99 -75 -90 30 -111 -43 -57 -47 9 201 44 -56 -211 -141
2848a41L9K19j42J01l7j80K6P8J15j23J10j14R6j30K7o2J20k4k9j0n1J7L0k6J92n7n7r7LN2
2496e5Ko1P0M3J44L4j94n9O8k2qJ58j0k35J20k1k2J06j16J8j0p9J00R9Q2k00N7r9L2Q5n4k8
2121e5J49j30o2J6J57J5n4l2J5o6p2Q7p0P8N1Nm3j3O3k7Q0j82J60J8k06R1J2N6N9N1j03q4
1745c6LJ12r8K2Lj01J45J0ql0j09K0M4J8m3q3P9K6p2O6PO3or8M8n2L9N3j1K1O4O4j82M1j5
1334Dm4L7n3R4k0J6m3J3N6J3Qm4q9J4n6K6J6N1J13k7l9r7R8M9o5N2Q9j50N6j05JJ3O5R1k17
923g4J28j00L2N2m0k0J2k9L4K9jm5K0J85k9j87O1o5P5j03O5J25j24M9m0j2L5J35j78j7j8m1
548h6K4J23N6p4J35Ql6j26k6k7L0o2k0J39P3j07P3MK0r3Q4%j17l6l5J8O4p8O3J91j99K7j2
160bO4JO8p9j06mJ60j58J08m0n5K5M9q4N1L3Q6p7j20J65j01O6l9o1K9m1K08j51K0M
$$ plain form
2848 -141 -102 117 -25 76 39 -141 -115 -37 78 -45 65 -49 47 -83 -56 -118 2 -22 -51 -61 -112 -95 -65 -91 101 44 -13 -110 -107 -55
2496 -55 -53 -114 -44 -1 143 177 -17 -76 -8 -30 -38 120 110 -125 -5 -26 -48 58 -58 -40 -50 -129 -29 70 152 -48 9 -90 -58 27 -27 -55
2121 -55 94 -36 -98 -82 75 90 36 4 19 -47 -119 -32 -102 -24 27 32 -11 -24 39 12 92 -90 70 88 -118 -27 -15 41 100 151 48 -36
1745 -36 -33 79 -19 3 6 -95 50 60 52 22 -87 -67 -23 -5 -48 -131 -52 -26 -98 -32 -25 38 32 -66 -18 -70 -31 22 11 32 96 160 -22 19 4
1334 4 -40 -3 -56 38 18 34 -9 4 60 73 81 37 -52 -38 -94 -68 -52 -1 112 85 46 -51 47 96 31 83 172 22 78 -27 -26 -13 52 143 -74
923 -74 54 -46 -14 38 -2 -22 -10 -39 -5 24 23 -22 -2 183 154 -33 28 -37 38 -65 0 125 1 50 10 -2 33 168 -10 -27 -45 -86
548 -86 -62 61 117 43 178 186 150 24 -2 -29 1 -61 -81 58 131 24 97 101 121 28 112 112 -5 -41 -76 -58 6 -72 -9 182 -17 10 -2
160 -2 62 63 131 52 -54 -58 102 -56 52 12 -43 -18 31 -53 -2 31 117 40 -80 85 -16 50 11 -50 -21 -62 146 -5 15 19
-192A9
##PAGE=	F1=21381.2
##FIRST=	25164.769650603881018,	5806.207692317537294,	-0.051334142684936523438
##DATA TABLE=	(F2++(Y..Y)), PROFILE
5806a4N3Rl7n8R8O6j92k8J51j34J33N8j54J0O2m2M2l1L2j2J41Np3R3j35%K1j73jP5N9j5l7
5419b8J16N7J2j67kK09j36J1J2q5j1N2R8j71K4k9oK39j66M8n7l8R6n9OR0j5j54L31j22j65
5055a0m4P9J45L9j75rM1J76j88n2L3P7q6o2N2J29J5q9p6N7n6J26j0j34q1J32q6J68J5l1Rk04
4679a00M8o9O1J24Lk52O5J09M6j17N2K9M5j49J11J34m2j46Q3Rj08O6L4m0r0J5J9M1K5J02j71
4316f3J6l9N4Q6j8J35o1j75K0j3K4J20m5j50J34Qj15K00j04qm0M1J78j51P6m1q5K3r9J41j02
3952e3O8O9K9j35j06R0J05Jn9n8P8k7n5RP2o1M2Q9j2j47l0P5R8j75K0J85j93K11K6m9k63Q2
3576g4l4P2Km3K2j03M8K43q7q6%m4O1J36j28j28P7k8J08J32q3k77K74j1p0k6o9J44J36p9n7
3212B8p8Q4J30M7k38r0J6J7K8p2R4Lp2J03Rj1j07J3Jl8J88j45M9POL8J75k25O1j95O1J1K36
$$ plain form
5806 -14 39 48 11 -47 51 117 -75 -103 48 -86 47 105 -49 -39 23 -19 23 -8 24 12 153 158 85 178 43 43 64 -109 -110 -35 24 9 -28
5419 -28 88 145 157 -10 -12 197 61 72 84 -1 -12 40 138 -33 -9 -38 -44 195 29 77 20 -18 78 19 25 115 100 -54 277 155 -10
5055 -10 -54 25 170 209 34 25 66 242 54 2 35 112 26 -36 16 145 160 71 -5 52 -4 122 112 -22 -103 29 -57 111 126 95 104 -100
4679 -100 -52 -121 -60 64 67 -185 -120 -11 35 -82 -30 -1 44 -105 6 140 98 -48 35 44 -64 2 36 -4 -94 -79 -60 -19 6 108 -63
4316 -63 -47 -86 -32 54 36 171 110 -65 -45 -58 -34 86 41 -109 25 33 -82 118 14 6 -34 7 185 34 110 69 -16 7 -92 49 -53
3952 -53 15 84 113 -22 -128 -38 67 68 9 -49 29 2 -53 -44 28 -33 9 98 86 -61 -91 -16 82 -93 -73 112 -81 130 156 107 -156 -74
3576 -74 -108 -36 -34 -77 -55 -158 -110 133 46 -40 -40 -84 -23 113 -15 -143 -66 -94 14 146 63 -214 60 49 -21 -47 -116 28 164 85 28
3212 28 -50 34 164 211 -27 -117 -101 -84 -56 -128 -34 -31 -103 0 9 -2 -109 -96 -95 -133 55 -90 -41 -34 -28 10 185 -40 21 -174 -113 -102 134
2825A34j18O7Mj69k1O2J31p2O0j57J10j54L8JN6j6k8J0k5l7P9l5J92p1m9q7j2Q6L3p5rL9J95
2438A62k2j46l4P2k6l1J41Nk27J34l7p7R5p1N5m1q0J10J08K6j66L8q2L3O9l5p0J76p6o7J4
2074e0J47j1j9m2kn4j09Q0m2O8P7N5q6mO9o0P3j89J96K3k10N5QP5P4k4p4l6p0J50j38N3J7
1686@j26J62L4n9Rj24L7P0J8m3j01P0Ll9j0N0N0J0j36R3q4R2O9K4p2Q4J08k00L1K3n9L4m6
1299b8P1L5m5q2J6R8L5J2nj17k1n9J4J3N2J33l3n6m3R4Qn9N5P7j02mr6J6ON8J13k25P5j15
900a09P6L4J1%l5q5O8N5k6lj4J75k4j81Q1l0O1j26QJ50j17J14o9j6N1P5j26k4k7m9Q4M5O0
513H7m2J07L9q4j22J5J6l2o0J2P2J05o9J16j06N9o9K6Mj42%k6K8P0j31J60J49j72%o7Q9PM4
125H3Mj53pJ64j20P0p1l9Q5L4j55J04K3O1m9j01J61j04L0l7lL4n2J68j38J8j0
$$ plain form
2825 134 16 83 87 -82 -103 -41 90 18 78 -79 31 -123 -85 -84 -28 -44 -72 -62 -87 -124 -45 -80 112 41 -8 -95 -107 -21 12 -63 -72 -33 162
2438 162 140 -6 -40 32 6 -25 116 121 -106 28 -9 -86 9 -62 -7 -48 -128 -18 90 116 -50 -12 -94 -61 8 -27 -97 79 3 -64 -50
2074 -50 97 86 67 25 23 -31 -140 -60 -102 -34 43 98 12 8 77 17 90 -99 97 120 -90 -35 -27 48 122 98 24 -12 -82 68 -70 -17 0
1686 0 -126 36 70 11 20 -104 -67 3 21 -22 -123 -53 -50 -89 -99 -49 1 11 -125 -32 -116 -24 45 69 -3 81 189 -11 20 43 -16 18 -28
1299 -28 43 78 33 -49 -33 65 100 112 107 -10 -31 -90 -76 -63 -11 122 89 33 -10 84 92 33 88 165 63 59 -37 -21 -15 43 156 -69 6 -109
900 -109 -33 1 12 12 -23 -108 -40 15 -11 -14 -28 147 123 -58 23 -7 54 -72 -64 86 -31 83 14 -2 49 124 -2 -26 -53 -102 -18 27 87
513 87 45 152 191 107 -15 0 16 -16 -76 -64 8 113 44 160 54 113 44 70 74 -68 -68 -94 -66 4 -127 33 182 10 10 -57 32 39 83
125 83 87 -66 -73 91 -29 41 -30 -69 16 50 -105 -1 22 83 34 -67 94 -10 20 -17 -20 14 -38 130 -8 10 0
-192@
##PAGE=	F1=21330.1
##FIRST=	25164.769650603881018,	5806.207692317537294,	-0.027430176734924316406
##DATA TABLE=	(F2++(Y..Y)), PROFILE
5806gJ6J1j9n3J55L1j80l0J26q3P8M2j30L5N7m8J0m9Q4mJ62lj04R2j27pK8j36p0J11N1k2o4
5419d7Q8P5J5j45J8K12j50l4L4m8o1N4J15j65J6l5J4K47j88K7p7k2J13p3O4J7k3r5L09j37
5067A18j36LN2Q7L3q2l8j7J49j69kK4J00r8q4O5J04Lp3m0M7m3Q7J2j82n6J57q6J39k0RJ7j28
4679d8j1q2M2J56k0k30Q7Q7N9j50P0O9N1k05J11J22o6j19Q4L6r9n0Q5k0r0J5L7K6N0J40j06
4316C1j28k7Q3P9p0J34l2p8m3Qj8O5j6n6N5k0j00K38n6n5k9P4J32j81Q7r2m2J6k2J23j25M8
3940a7N8J8q6q5R6O7K7p3l4O9Om0q9P9k7L7K4J5q8r7J98M3k22K6J76j35J79R0j05k97R4JP6
3553a6ko1K1r4PK32q4p1Ql7P5Q8n6j32P6j4P6J41r1k56K46L7r1n6n5J19P2r4J0m5M3J26J11
3165B33k21j19j4L6O5p9LP9m2N9N1p6o1m0K3m3K06j35M4%jM8J40l00K50k37J7J2K37n9k0L9
$$ plain form
5806 -7 9 20 1 -52 103 134 -46 -76 50 -33 45 87 -43 -8 49 1 11 -38 46 42 204 201 97 189 62 55 83 -53 -123 -12 39 17 -47
5419 -47 41 116 131 -14 4 216 66 32 66 18 -43 11 126 -39 -23 -58 -44 203 15 42 -35 -57 56 -17 47 64 41 -54 255 118
5067 118 -18 -15 37 124 157 75 37 20 169 0 -2 22 122 24 -60 5 109 112 39 -1 46 3 90 102 -80 -136 21 -65 74 54 63 80 -48
4679 -48 -59 -141 -99 57 37 -193 -106 -19 40 -110 -40 29 80 -125 -14 108 42 -77 7 43 -56 -106 -21 -41 -131 -116 -79 -53 -3 137 31
4316 31 -97 -124 -41 38 -32 102 70 -8 -51 -43 -61 4 -12 -68 -13 -33 -133 105 49 -6 -35 39 171 -10 77 -15 -57 -41 -63 60 -65 -17
3940 -17 41 59 -27 -112 -16 51 78 5 -29 40 46 6 -83 -4 -31 6 30 45 -43 -140 58 101 -121 -95 81 -54 125 215 110 -187 -93 -92 -16
3553 -16 -18 -79 -58 -152 -145 87 3 -68 -60 -97 -22 66 10 -122 -46 -60 16 157 66 -190 56 93 2 -54 -109 10 82 -12 -2 -47 -4 122 233
3165 233 12 -107 -121 -85 -20 -99 -96 -17 -59 0 51 -25 -86 -126 -103 -146 60 -75 -31 -31 -32 16 156 -144 106 -131 -114 -102 135 76 56 95
2790I5j40o4N7J16j9L1k10R9j63J39MQk9rK0Np9Q3k5J77p1n9n8j1P2J01n5j14L3K16n5j24
2414b9K5M5k2m3J27rj58J07n7j36J12J2L4n6p5J06J05m8m6k8J5l2OK6r9J81k6q0L2J20l7K0
2038I2m8ln5j12N3k1O6R0O1q3j6N5o5M3j59J83N7j86J9J4O5R0j16K2n3r8J46j35N7Oj07J33
1663eO8r4M0r8k0J11L6m9m4J4j9K0o1L3M3J9j65J28m9K5J38Qp5N9J13j90J3M1l4JoJ01J1j14
1264aq4RJ21M4K1J7j12j8q7KLR8J02m3q7M8N2k7o0N9Q2m9o3p0K0k2N3J26j91Jl9R5p4R6j1
853A1o4k4mQ5q2N5l2J56l8j27J19m5L8j19L5P7p4J19q9qL8K1k6p8J3p8J41o2R4j3N6O3r0j41
454g3R1L5j00k6N2k9J16j9J50j62M0j1n4K2j05k3RO9M7j54J56J18j36J5q6M1QL7Q9j81m5J73
78F4r9O0j10K9N5N4j84J41%L8l0q3J38q1Qk4L6M4r3J41j09J8j8
$$ plain form
2790 95 -45 -109 -52 64 45 76 -134 -35 -198 -59 -55 -47 -76 -85 -65 -60 -139 -56 -81 96 25 -34 -92 -103 -31 70 15 -99 -66 150 95 -29
2414 -29 -4 41 19 -24 103 94 -64 43 -14 -150 -38 -26 8 -48 -123 -17 88 40 -6 -34 -19 -51 -45 -19 -118 63 37 -43 -11 109 72 92
2038 92 44 41 -14 -126 -73 -94 -28 62 123 40 24 79 14 57 -102 81 138 -48 -29 -15 50 140 24 46 -7 -105 41 -94 -37 -31 -138 -5
1663 -5 63 -31 9 -89 -109 2 38 -11 -55 -41 -60 -40 -101 -68 -25 -6 -171 -43 -92 -67 71 79 4 63 176 -14 -1 40 6 7 1 102 113 -1
1264 -1 -85 -76 45 89 110 127 15 -3 -90 -88 -85 13 115 72 -15 33 85 58 -2 57 139 90 27 -43 -23 -45 8 134 -57 -56 -95 0 -74 22 11
853 11 -53 -77 -81 4 -78 -23 -55 101 63 -64 55 10 48 -71 -36 41 -33 86 -3 -11 27 48 22 -56 -43 -121 20 -42 52 39 95 158 68 -73
454 -73 18 53 -47 -73 -21 -50 66 47 197 35 75 64 10 32 -73 -96 -87 -18 29 -125 31 149 13 28 -58 -17 -9 28 117 -64 -109 64
78 64 -35 25 -85 -56 -1 53 -131 10 10 48 18 -65 73 -8 0 -24 12 56 -37 104 -5 13 -5
-192e
##PAGE=	F1=21279
##FIRST=	25164.769650603881018,	5806.207692317537294,	-0.003526210784912109375
##DATA TABLE=	(F2++(Y..Y)), PROFILE
5806ak0J4K2k2J35J1j61k6J00l4K6K5j05N8N3n3k2o8J18j6J84j1j28R8j08lL7j00j39J45M0
5442D9l5l6K7Q7J2j23M1K12j64n3Q3k3j28M5J19j58Pk9M5K45k22K5p9l0J06m4P9n7l0RK43
5078B23j36r0M9K7K1K2pMj17P8j27O7J7J23j01j00M8M9Km4NM9l4M0K5j47k3J01p9J14o5L8
4703C2K9m5l0j48O3J38j2j76R4N0Q7j68O3Q4O5k50J01J00p9q1Q0N6p0n9Q5m9j09mP5K9O0J67
4327A78n7k00J1M3P8j16J14k0L5q9k7k6J6J6N2j1j00m7K48l7r1oJ08Q6k14J01j33J2kM4J17
3963H3j38J5L8J9k6n6J08J1L3q6j0O0L9j2j77P3lL2m1M8k5j29K66Mk52K1J55o6J59J43j73
3600A13l11J25K7P1np9K1q6k6K29q7o6K4k2O9K2K8j25P5%L2J39q1k16K00O5j10q6l6J00k4
3236b0n5N8k7JJ24J74k02j30k6L6Q1n1n2J19m5J6R3j29op7N9p5J99j14N0j8j9O4J10k09K75
$$ plain form
5806 -1 -21 -7 15 -7 128 139 -22 -48 52 18 44 69 -36 22 75 22 0 -68 50 34 218 207 79 177 69 66 103 3 -136 9 49
5442 49 14 -22 5 92 104 -19 22 234 70 17 100 77 -51 -6 113 -45 -38 -67 -22 223 1 26 -53 -83 23 -21 58 1 -29 -20 223
5078 223 87 -3 46 73 94 116 109 113 -4 74 -53 14 31 154 53 -47 1 50 52 8 13 62 28 68 93 -54 -77 24 -55 59 -6 32
4703 32 61 16 -14 -162 -99 39 27 -149 -55 -5 82 -86 -23 61 126 -124 -23 77 -2 -83 -3 53 -17 -76 9 -40 -149 -153 -78 -49 11 178
4327 178 121 -79 -68 -25 53 -63 51 31 66 -23 -50 -76 -60 -44 8 -3 -103 -150 98 61 -30 -36 72 158 -56 45 -88 -76 -78 -34 83
3963 83 -55 -40 -2 17 -9 -65 43 54 87 1 -9 51 90 78 -99 -26 -29 3 -38 10 -15 -144 122 126 -126 -105 50 -16 143 286 113
3600 113 -198 -73 -46 25 20 -59 -38 -124 -150 79 -8 -74 -50 -72 -3 19 47 -78 -3 -3 29 168 87 -129 71 136 26 -60 -96 4 -20
3236 -20 -75 -17 -44 -43 81 255 53 -77 -103 -67 14 -37 -89 30 -15 1 94 -35 -41 -118 -59 -134 65 -49 1 -17 -36 28 138 -71 204
2872B04k76k0JK26%j05P4j12r6O3R0K4J7k45O4j03K00l1l0l0kJ9M7j11P6k5J61p1p0k8j0N9
2496d0J57m5j98N1K24r9j03Q4J9j8n6J14k2r0Q0p7j77J46P8np0p2J03J01j14P6n9N6r5n9J64
2132E4j40J19M9r8M3R4o3M7o5Pm5r8M4n7R8Q7N0p0j7M2p0J3j30J61P8j49pJ9N6J05k06J13
1757F4p8q6R1q0K1J2p2R2R2j25P8l9j33J59O0n6J2l5l6M6n5LK5J5j17Q6jn9J92Ko6L4J16j90
1358b8j8P1Nk2M5J08l5j62o2rJ33M1J8L1j12J2q4lkP8R1m7j14J30jo2o2P4R8Oj22m4K3o1L7
947d9J50j46o9M4J00j05Q9k6l8Mk5P5j43J07n0J37n2p4J47p1K6j01O2Nl2J24j11JK5l0P3j32
571h5N6j01J80j01M8K4qP4o4j31J44L2j51K4M7q6J09J3J69j43qJ9j09O2o9m6L2R8L7j66J23
207B3N6q0M6j05qRL2J73k09r3J70p5N2o2L2J3O4j28J15k4J3j2o5J14n8j3j2O5M3j22J24p9
$$ plain form
2872 204 -72 -92 -91 135 135 30 104 -8 -104 -41 49 73 90 -155 -91 -194 6 -25 -55 -85 -87 -68 -21 -132 -56 -81 80 9 -61 -89 -99 -40
2496 -40 117 72 -126 -75 149 50 -53 31 50 32 -24 90 68 -22 58 -19 -196 -50 28 23 -47 -119 -16 85 -29 47 -12 44 -51 -110 54
2132 54 -86 33 82 -16 27 121 58 105 40 47 2 -96 -52 -109 -11 76 126 56 39 81 11 24 -106 55 133 -16 -23 -4 52 157 -49 64
1757 64 -14 -100 -9 -89 -68 -56 -128 -36 56 -69 9 -30 -163 -4 56 0 12 -23 -59 -13 -68 -65 -40 -25 -142 -56 -57 -116 76 78 12 46 162 -28
1358 -28 -46 25 30 8 53 161 126 -36 -98 -107 26 67 85 116 4 16 -68 -71 -73 5 96 49 -65 65 64 2 -60 14 112 118 -4 -48 -25 -86 -49
947 -49 101 -45 -114 -70 30 -75 14 -12 -50 -46 -71 4 -139 -32 -82 55 3 -71 76 5 31 -70 -8 -3 -35 89 -22 -21 4 -26 47 -85
571 -85 -29 -130 50 -51 -3 21 13 87 23 -108 36 68 -83 -59 -12 -98 11 24 193 50 42 61 -48 14 -55 -101 -69 29 66 -100 23
207 23 79 -1 45 -60 -68 -59 -27 146 -63 -156 14 -61 -9 -71 -39 -26 38 -90 25 1 14 2 -63 51 -7 -20 -32 33 76 -46 78 -1
-168aJ6k5
$$ plain form
-168 -1 15 -10
-192a0
##PAGE=	F1=21227.8
##FIRST=	25164.769650603881018,	5806.207692317537294,	-0.057982683181762695313
##DATA TABLE=	(F2++(Y..Y)), PROFILE
5806a6J5l0lM3Q1Qj19m0Q4nj6K1r0J04M1o4j6l9P8n6J66K3j54J19o7lJ5n2j90J70J7rrl8R7
5395F6qp6M3J66j51l0J06kj67M7J06j47k8K0N6K03k33L0n9j2N6K7N3j39rR3J82j32n6P4J0
5032H9qj9M5N0j87pl7Q2MJ54r5j05J0pL1k6N7M4l4MRm8k9K1l8P0n9K9M2Mm6j71Q7J00oj26
4609a16J14jR2j46N6Q8L8k32Q4P2l4m5PP7m3j3N7o3j07lK6Q0M1J47pk00KK9N7o2N7o2J34j19
4210En8LonJ34l4k04O9J55k5r8J6J05P2k17J12j25J4K2M6Q4j03k7K3K3J2NR8m9M4p7j7L1R4
3811A22L5k05J4jkm0P9Nq5K24l2k43M2R7J7J35J38j94k65J10M7N7J0j10L2q9k0J90o3n1Rj5
3435e2N4l4R0p8RM7oJ15l5j86J41R6j39q8k0J00j23J34n1km4J09K22k00j18j3L7Q1j9p1R2
3071D8n6l7J49j53M6o3P1j25J77q4M9m2l2O7J14j37K91k94n4k8K27O2j48J9p4p7N0Q3RL4k06
$$ plain form
5806 -16 -1 -31 -34 9 90 98 -21 -61 23 18 2 23 -67 37 78 14 -2 -41 37 -19 147 170 16 135 68 65 80 28 -162 8 25 16 7 -31 66
5395 66 58 -18 25 191 40 10 116 114 -53 -6 100 -47 -75 -55 1 204 -29 1 -58 -70 -14 13 66 -73 -82 11 193 61 5 79 89
5032 89 81 62 107 157 -30 -37 -74 8 12 166 71 -34 -24 -31 0 -26 31 75 41 45 54 6 -23 -2 -40 30 -29 0 42 46 0 -171 -84 16 10 -116
4609 -116 -2 -3 89 -57 -1 87 125 -107 -23 49 15 -30 -23 54 11 -2 55 -8 -115 -118 -92 -12 29 176 169 -31 -29 0 57 -5 52 -10 124 5
4210 5 -53 -50 -56 -61 73 39 -165 -96 59 34 -64 -48 57 129 -88 24 -101 -87 -65 -19 65 -38 -65 -42 -19 -7 -2 96 47 91 14 -3 28 122
3811 122 157 -48 -34 -35 -37 -77 2 7 -78 146 114 -129 -87 10 27 162 300 106 -159 -49 -2 55 65 -45 -13 -102 -122 68 5 -46 -37 -52
3435 -52 2 -32 58 -20 -11 36 30 145 110 -76 65 161 22 -66 -86 14 -109 25 -26 -28 -72 37 259 59 -59 -72 -35 46 27 -44 48
3071 48 -8 -45 104 -49 -3 -66 5 -120 57 -27 22 -20 -52 15 129 -8 283 -11 -65 -93 134 196 48 67 -7 -84 -34 49 58 92 -114
2707a14M5p4J54k5j9n4klM9o2M1j4J19l6j05J1J3K1J67l5j54L4J60q8q7R2Lmj9N6l8j4O4j16
2308c4j29J06J32m7r0n0R0P0q3J13l3K6j25J1J90j82K3J10q2L0O9o0N2r0J7j0j10N4p5J10
1956CP2K7k5m0J7l9m1p4J23R6j06k2K5J8J32k39J69j10p1L7m2QL0o0N6P5p6N8K5j38J08P6
1581G2n5L5n7n8N4l9JJ2mr7N6M6j04K00om1J4J04j73n4R2L9k4J04J17j16j90k9j2J16K4K3
1205E0K5r4P3r9Pk6O6O1o8j08J87m9n5q1O0J34L3j64J2Lp6jJ51o4o1J3J18m2rn8L4k6j2P9
806A3j96J31m3J06o1k4J67j03%o4P4m8K2J01r3j1j7PJ08j42N7j10J91n8o8O9q1Q2k2o8J24
442D3J2j53O0K7q8Q9OJ56q5o5N1j36J02o5m3N9J03L1j64N6K0k0O1j49k2M7O9J50j87q0J09
78fr1P4j2K4n4O5l6Q9p1J1J3o8Q2l6j3J3L9P1j59J18j5pk6
$$ plain form
2707 -114 -69 -143 11 -14 -33 -87 -89 -92 -43 -105 -64 -78 41 5 -100 -89 -76 -55 112 77 -77 -43 117 29 -58 34 37 33 14 70 32 18 82 -34
2308 -34 -163 -57 75 28 -62 -112 -22 48 -35 78 45 71 -54 -43 147 -35 -12 98 16 46 115 55 107 17 34 24 -86 -32 -107 3
1956 3 75 102 77 37 54 15 -26 -100 23 119 13 -9 16 34 166 -73 96 -14 -85 -48 -90 -82 -52 -112 -56 19 -57 1 26 -112 -4 72
1581 72 17 52 -5 -63 -9 -48 -47 -35 -39 -136 -80 -34 -138 62 56 15 29 133 -40 -94 -2 37 13 117 234 118 -72 -101 -113 3 27 50
1205 50 75 -19 54 -45 -38 -64 2 63 -5 -113 74 25 -30 -111 -51 83 116 -48 -36 -33 -109 -110 41 -23 -84 -71 47 5 -4 -62 -28 -54 -66 13
806 13 -183 -52 -95 11 -50 -74 93 -10 -10 -74 0 -48 -26 75 -18 -29 -46 -39 69 -73 -16 -126 65 7 -61 8 -73 9 -13 -81 43
442 43 55 -98 -38 -11 -99 -10 -4 152 67 2 53 -83 19 -46 -89 -30 73 104 -60 -4 16 -4 57 -92 -114 -67 2 152 -35 -115 -6
78 -6 -97 -23 -35 -11 -65 0 -36 53 -18 -7 6 -62 20 -16 -29 -16 23 94 -65 53 38 31 5
-192E
##PAGE=	F1=21176.7
##FIRST=	25164.769650603881018,	5806.207692317537294,	-0.034484624862670898438
##DATA TABLE=	(F2++(Y..Y)), PROFILE
5806ijl5l2J02K8Mp6n5O9K3n7J7p5J49L0p6JJK7j08J38M5j79J39j4Rj8j7k29K07pJ6K0j04
5407f7J06k8l9L3J30j26j6J17L0j96N0R4j26n1N7N7J60k45L7l9NNR0J7q1MM3J38j36l0J08
5043A01Ml7n9P0P0k05m0K6P1qJ86j00j22pm2N3k2J00K5j5j5n2R7m3o5NK6n4K1L4L6l6j71O4
4644a04J09j7r3J24n8J06j17M1Q5L0j96P8N5Jk2p7Q7k1K3N9m7j17j2k3J30KJ07J3j41j1RM8
4269E1KOr9J83j09m0pk7k8J55k8j67N4N8j5l0l8J11O7k18J26k6m6J9J9M5p7k3N2JK3N5P8j10
3870A7N6p0k3nJ41J01k15n5j0j5j5Q8J3n7J67m3k07O4M0Q7J00J32k14k08J07N4L2L6j29M2
3517A1r1j4J50k6k6l6l7O5p0J08J5p5P8m4R2J0j55P4J19j48p2oR8o8J44j01pm9M5K55k11q7
3142e9J8K6P0K5p9O6o9j07J90j21O3m9Q5j32J10n9M3m4k3O0J06q6K91k95o8n7K28J24j91l6
$$ plain form
5806 -9 -10 -45 -77 25 53 57 -19 -74 -5 18 -39 -22 -97 52 82 6 7 8 35 -73 65 110 -69 70 56 65 47 30 -199 8 1 17 37 -67
5407 -67 39 11 -28 5 135 9 -7 110 140 -56 -6 88 -38 -89 -32 25 185 -60 -23 -62 -57 -52 38 55 -26 -22 21 159 23 -7 101
5043 101 105 68 9 79 149 -56 -96 -70 1 -7 179 79 -43 -50 -92 -39 -61 39 64 49 34 -18 79 36 -29 -24 2 -52 -31 3 39 3 -168 -104
4644 -104 5 -12 -105 19 -39 67 -50 -9 76 106 -90 -12 43 44 22 -55 32 11 34 93 46 -71 -83 -106 24 26 133 146 5 -6 3 51
4269 51 53 59 -40 143 34 -6 -13 -40 -68 87 59 -108 -54 4 -11 -41 -79 32 99 -119 7 -19 -65 -46 -27 18 -59 -82 -30 -29 -6 49 127 17
3870 17 73 3 -20 -25 116 217 2 -53 -63 -78 -93 -5 8 -49 118 75 -132 -68 -28 59 159 291 77 -131 -24 30 62 98 -31 11
3517 11 -80 -94 56 30 4 -32 -69 -4 -74 34 49 -26 52 8 100 110 -45 29 148 0 -72 -78 20 -48 96 -5 -12 -61 -16 239 28 -59
3142 -59 -41 -15 55 80 1 67 -2 -109 81 -40 23 -26 59 -73 37 -22 21 -23 -46 14 120 34 325 30 -38 -95 133 257 66 30
2790C0l5o0L8O5j7P1j47Q2j39J18qJo6j3l5N6qk8N4N5k2p1L1J5l7J58m3r2L6J15n8r0Q2j4
2391B4RL1Ro5N1N8j45p9O5J76j02r8j7P2L3j9R5j1j1j33J03K06k38p2J71o5J8M2n6N8j15K5
2015B0K6j11P5r3J24M5qK0o2LLj07k8Q6J11n0k7K6k7J55j88J42j39m9j1LLM8m9K1N7l4L1R6
1616A12j35M8Q7o7M7o9o7M8l2J0J0k3p5J9Q7m3J03j0roR2j49q2R3N4j4J73J22k02j51j9k3
1240g1Q9kK1Rq9J45j02K5m2M6K4o2p4J77p5l7r2L0J57N9k06O9j7o4j1Q6M0n9k3J35K3j21j00
853a12J16m4LQ5k03J09k3Q8q5J1J87j34l3l2O8l1N6N6o2rq4J10P2j35M9j22J97k1j23Q2j57
489a21R1J8nR1k2j02N8Or1O8%J25m3o7N1j50J56q1n9Q5J09K6j62NOJ9N9j60kN1P3J26j66m7
90e5O5j24P8L7J5j20O8N2O5j07J9K8q3N3j5j5L8J5R8j96J12N1l1k7
$$ plain form
2790 30 -5 -65 -27 38 21 92 -55 27 -112 6 -2 -1 -67 -80 -115 -59 -67 -95 -41 14 -8 -79 -48 -33 -70 88 45 -47 -11 104 46 -44 38 24
2391 24 33 64 73 8 59 117 -28 -107 -42 134 32 -66 -83 -11 22 3 98 87 76 -57 46 252 14 -58 113 48 66 108 52 110 -5 20
2015 20 46 -65 10 -83 41 86 78 98 36 39 42 -65 -93 -7 104 54 27 53 26 181 -7 135 -4 -53 -64 -61 -58 -10 -59 -38 19 -15 16 112
1616 112 -23 25 112 45 92 23 -44 4 -28 -18 -8 -31 -106 -87 0 -43 60 50 41 35 127 -22 -104 -11 43 29 202 324 122 -29 -48 -71
1240 -71 18 16 37 46 -43 102 0 25 -17 29 53 -9 -83 94 19 -18 -110 -80 77 136 -70 -1 -18 -82 -93 -7 33 -26 -49 86 109 -12 -112
853 -112 4 -40 -37 48 -155 -46 -69 19 -66 -55 132 -2 -35 -67 1 -30 26 82 20 11 -73 37 109 -26 23 -99 98 77 -46 36 -121
489 -121 -30 -12 -17 74 52 -50 8 14 -77 -9 -9 116 73 6 57 -93 63 -18 -77 8 117 143 -19 -14 -8 11 70 -90 -92 -41 32 158 -8 -55
90 -55 10 -114 -36 1 16 -104 -36 16 81 -26 -7 21 -62 -9 -24 -39 -1 14 112 -84 28 79 48 21
-192B1
##PAGE=	F1=21125.6
##FIRST=	25164.769650603881018,	5806.207692317537294,	0.00038158893585205078125
##DATA TABLE=	(F2++(Y..Y)), PROFILE
5806@k6ok9R1k7%k0p7Q0K0n7rn5J69K0p0J3L6J8j62M0Q7j81J44J7J8k5lk08K11k5K1K4j14
5407h5J00m8j2K5Q1q3nJ00L2j63N2P4q8o4P5N1O9j67L3m2PQQ4J0oj5MQ9j14l7J21Jl7o0M1
4996C1O4j62Lj0N1j5K10r1j38l4N8Ol1P7K9kkj11K13q5r4nJ9k3pK9K2l8j24L6J36m4j05J47
4597A0j10J18p6J7P7Nj18N2O2J4Kj07N7j5K8Q6mj29k5n9J56j7M8Nn5k7OL8N4k6j30J77o7J
4198D8m5l5KQ8kj12L5k4rO2p8M8J16j85Q6J8n3Qj6%m8J9R4j6k7R8N7j24M0n6l5n4J88J50k11
3787B7r6l6M0j2M3K2k7O9k7j19M4L3R5Q5Q5j91j73J28M8JO3j57J06j42M5Q0JK4r0n4M3j5M0
3400a7J25j65R1n6M6O7j28J1J15j36j7jQ8k6J16q9k0l5%K21k14l8L6K3N5L7n2K1n1j19J37
3036B5l7L7k1J00j07J3k1Ql8N5k0J08o1K85l03l1p8K07J38j79r9J6k7j3Q4o0Q3p3J06k12O1
$$ plain form
5806 0 -26 -32 -61 30 3 3 -17 -94 -14 6 -51 -60 -115 54 74 4 17 53 71 -91 -51 36 -145 -1 16 34 9 6 -202 9 -16 5 29 -85
5407 -85 15 -33 -45 -20 61 -22 -27 73 105 -58 -6 68 -20 -84 -9 42 111 -56 -23 -65 -58 -50 34 44 38 23 27 116 2 -35 86 87 50 -10 31
4996 31 95 -67 -64 -74 -23 -38 172 81 -57 -91 -33 -27 -58 19 48 46 44 -67 146 61 -33 -38 -19 -42 -49 -20 2 -36 -160 -124 12 -32 -137 10
4597 10 -100 18 -58 -41 36 41 -77 -25 37 51 53 -54 3 -12 16 102 98 -31 -56 -115 41 24 72 77 22 -5 1 39 93 67 -63 114 47 48
4198 48 3 -32 -30 58 56 -56 -21 -45 -54 8 -70 -22 94 -91 -5 13 -40 -32 -48 -48 -96 -77 17 1 -26 72 129 5 45 -11 -46 -100 88 238 27
3787 27 -69 -105 -65 -77 -34 -12 -39 30 3 -116 -72 -39 56 141 226 35 -138 -10 38 39 102 -55 51 -91 -46 34 35 59 -31 -85 -42 -57 -17
3400 -17 108 -57 34 -22 24 91 -37 -26 89 -47 -64 -65 23 -3 113 24 4 -31 -31 190 -24 -62 -26 -3 52 89 37 58 7 -112 25
3036 25 -12 25 4 104 -3 10 -11 -3 -41 14 -6 102 41 326 23 -8 -86 121 259 80 -19 -3 -30 -43 41 -19 64 -9 97 -115 -54
2672e4O0kl4m6m6M7N3q3J20k6roM3k4o2Q7l7NJ9R1k9j09O5jJ0P7m4m7N1O1j56m3M0J83j31
2261B3p7j7N6M8j7P4jm4j12J81J92k61j21J76k5j0J6l2K7j00qR4j06P2o4J07Ml3M5p6j1O7
1886F7j50j3M8J33k8nj0l6J68j43J00j35m7l9K0K0O0l6J0J6J8j5J68j34K1O6o8L0o9n7L0j1
1510b1%K5qj06L9P1J0J8kJ0j0Q0j29p0R2NM0K10R8k56o9j3l9M2k0K4l0o6J90r5K4n0Q1n6n6
1099c7mJ27r8mq0N7R3P2k09R0m8j2L4o0J52n7o4J20J11k17j9M0N6l1K3j34L8JN7m9j9K08j22
712A5j07J5M6N1M8jk7%j41J75L4j03J1j16J79K1j10O3j39M0PO1N3n2m2M8k5o1N8jK4J0rKj22
301i5J69j06m6J11R0Nj24m5L3L4K0q8JK4N3R7j20l7L8j01N0L5L5j29NJ34L8j15L4K0p6K6q
-86c8OM2j5J11j65N9R7l1l4
$$ plain form
2672 -54 6 4 -30 -76 -122 -75 -22 -105 15 -11 -20 -26 17 -7 -69 18 -19 -14 5 96 67 -42 23 22 32 109 65 18 69 130 -26 -69 -29 154 23
2261 23 -54 -71 -15 33 16 90 89 45 -67 114 306 45 -76 100 75 65 81 49 76 -24 -32 62 -44 28 -36 71 75 42 87 11 0 67
1886 67 -83 -96 -48 85 57 52 42 6 174 31 131 -4 -51 -90 -70 -50 10 -26 -16 0 18 3 171 37 58 124 56 86 17 -40 -10 -21
1510 -21 -21 4 -4 -110 -71 0 10 28 26 36 26 106 -23 -93 -1 4 44 254 352 96 27 14 -25 17 -3 21 -9 -75 115 20 44 -6 75 19 -37
1099 -37 -41 86 -12 -16 -96 -39 54 126 -83 7 -41 -53 -19 -79 73 16 -48 72 183 -34 -53 -13 43 12 35 -99 -61 -60 -3 -52 -71 137 15
712 15 -92 -77 -31 20 68 67 40 40 -101 74 108 5 16 -100 79 100 -10 53 -86 -46 -39 22 75 23 -19 29 4 -57 1 0 24 34 25 27 -95
301 -95 74 -32 -78 33 123 128 4 -41 -8 26 46 -42 -41 -17 36 133 13 -24 14 -87 -37 -2 33 -96 -91 43 81 -34 0 20 -56 -30 -38
-86 -38 -32 10 -5 106 -59 0 97 66 32
-192C2
##PAGE=	F1=21074.5
##FIRST=	25164.769650603881018,	5806.207692317537294,	0.035247921943664550781
##DATA TABLE=	(F2++(Y..Y)), PROFILE
5806A0n2K2k5Q0q0nL5r9R2J6l1ro1J63J1o6K6P1L4j92MM1p6M5L7J2l1J2j90K16l9L3mo9Q8
5395A9p5J6J7L3m1j5N8M7j19N5N4m2o3O9K5On7J0o5J0J0P8MN9m7j3O1j00n6J33jk0m2oM0j08
4973f6N6l7L8k9K26q7j62j3J09k7k5L5J3J7J6q3K05j01j00k5jJ0l6K2J1l7p0O9J32q6j33J46
4597a3r8J05o1oP0k0m2K6P1J4J5j25L9j1L5J13L9j49m3m8J35k9olL0m1KK8J05m0j45J03kM8
4198I6p5m4K9K3K3n7J6p4L0Q3r9j2J72j62L4N1p1J6k9L0r5N3J28l4p8J41L7j39K5m3m4k7J59
3811F3J86k20j07l2Q9j7j5K0Nk8j1l4M2M2M7J05L3j73j50J37N4k1R0j84J71j94J04J0J7O2
3459I1j14l9J1L4m6K20k12O0o5J0J23j01n4J12j14N1qO6j1O4n1nk2m6J87k18%M4J9M0N0k6
3083E0k1l1m6K1M4J0j0R5o4o3J5k8l1J33j01J11n6K61k91K2j09J75J44j73j45Q6mp6J25q0
$$ plain form
5806 10 -42 -20 -45 35 -45 -50 -15 -114 -22 -6 -37 -46 -107 56 67 1 27 98 132 -60 -56 -15 -91 -46 -9 3 -28 -16 -206 10 -29 4 0 -69 19
5395 19 -56 -40 -23 10 -31 -46 12 59 -60 -5 49 7 -56 13 38 44 -13 -3 -68 -58 -48 30 34 93 46 33 94 -6 -62 71 70 50 8 2 42 -66
4973 -66 -10 -47 -9 -38 188 101 -61 -74 35 8 -17 18 31 48 64 -19 186 85 -15 -40 -41 -31 -67 -45 -34 -71 -141 -72 60 -26 -159 -13
4597 -13 -111 -6 -67 -73 -3 -23 -65 -39 32 46 61 -64 -25 -36 -1 112 151 2 -41 -89 46 17 11 8 38 -3 -1 27 132 92 -53 50 48 96
4198 96 21 -23 6 29 52 -5 11 -63 -33 50 -49 -61 111 -51 -17 34 -37 -21 -50 -20 -115 -62 66 32 -46 95 132 -7 18 -25 -69 -96 63
3811 63 249 29 -78 -110 -21 -38 -53 -33 -28 -56 -67 -101 -59 -17 30 135 168 -5 -155 -18 36 15 105 -79 92 -102 2 12 29 91
3459 91 -23 -62 -51 -17 -63 157 -55 5 -60 -50 73 -28 -82 30 -84 -33 -41 25 14 78 27 22 0 -46 141 -77 -77 -33 -14 26 76 50
3083 50 29 -2 -48 -27 17 27 17 112 48 -15 0 -28 -59 74 -27 84 28 289 -2 20 -89 86 230 57 -88 -2 -6 -82 43 -37
2731c7O6l0J31k85K1J48mnm9k8N4M0j03J31n9l4O3O3o4q7J7l3R0pO6%j27M9K2K2J17j03J7
2344F2NN9j73MK7J91j62n4j8M6O9p9P8Oq0m7K15J84k77r3J04K5k8k0k1J9o3o5J41j01P0l6
1968a2R0k4m7O8q9l4J22j06n9N7J11l0qk7k6J69j08O8j18m6o8L8L7P2k4jk3N9p2K31j40JN3
1581A14p7On0l0J2J1j1M2Oj36N7N6O4o7NK9j5O9j09n7Q8m1P3K29Q2l03K6Mn7ml9K8o9m3K24
1170A17j00K4n8J21j29oK0Q4j16K9o8Q8L7N6j49N0n2L6P3q8J10l6q9Q5J79k67J03j00J85p2
818F7m5n5k2J5J5jl9K19j20j95N2L4J46L9n9%jj23J65np2j6r9J48N2q7N7j03Rl4R7K6p1NK7
407B6m2k0N4Lm4RN2l9r6J82j31l4J19N3Ko6q6P1L9k9j9Nj4K1P0p4j5K0o5L3K0M5j07k4J33
-4E2J6j15N5J2p0j%K6M8m7J25j35PJ42l1m1
$$ plain form
2731 -37 29 -1 130 -155 -134 14 10 5 -44 -72 -18 22 -81 50 -9 -43 20 83 19 -68 -51 -84 6 -1 65 65 -62 -13 9 31 148 45 62
2344 62 67 126 -47 -43 -16 175 13 -41 -59 -13 56 -23 55 61 -19 -66 149 333 56 -37 67 92 64 44 23 42 -21 -86 55 -46 24 -12
1968 -12 78 54 7 75 -14 -48 74 -32 -91 -34 77 47 39 12 -14 155 47 115 -3 -49 -117 -79 -42 30 6 5 -18 41 -31 200 60 61 114
1581 114 37 43 -7 -37 -25 -14 -25 17 23 -113 -56 0 64 -3 2 31 16 85 -24 -81 7 -34 39 268 350 47 73 77 20 16 -23 5 -64 -107 117
1170 117 17 41 -17 104 -25 -31 -11 73 -43 -14 -82 6 43 99 -50 0 -52 -16 57 -31 79 43 -46 39 218 -49 54 -46 139 67
818 67 22 -33 -55 -40 -25 -26 -65 154 34 -161 -109 -75 71 110 51 51 50 -73 92 87 15 -1 -100 48 100 13 70 -33 -24 -58 39 65 -6 -1 26
407 26 -16 -36 18 21 -23 -14 38 -1 -97 85 -46 -80 39 92 94 28 -58 13 52 23 4 9 -5 16 86 12 -3 17 -48 -15 5 50 -57 -81 52
-4 52 68 -47 8 20 -50 -51 -51 -25 23 -24 101 -34 -27 115 84 43
-192D3
##PAGE=	F1=21023.3
##FIRST=	25164.769650603881018,	5806.207692317537294,	0.099753141403198242188
##DATA TABLE=	(F2++(Y..Y)), PROFILE
5806B8l7Rk3O6j06l1O7r8J14K3nj6p3J36ko2M2Q9L7j88N6m6j5K8l3K4nk1j67K23k9Pm6J2N0
5395Hn2J6J6Ok1kj6J5n1Q1J8L8q6L6K5m9O6k1q0QRK7L6R5q4qO7r9n4J05j4j2J5k2k2o4J00
4961C0l4K5k3K16j12j60K7J10l9j7m8K7N0J3o6K14j23q5o8oK5l6M1mo8k2J22J31j29j76J12
4597g3K1P0q0l9N0nj8OO5LM1j02J1j3M8J43N3j76n5j1Q6Jl8k3Q6o0J2J1J16k5j45L1N4P1r8
4186A8k3L6m7P2m0J9o7L5N9q5m3K00j70K4L3n6L8k0Q1j38K7J32n5p8J20L0q5k5kp1N0Q2J64
3799B15j97q3k3R6Pj9m7K5l2Qn5L4P1QJ35lj79j21J35L0nR8j91K28k41J46k3qR8j36K2J5L
3412A1j00K70k11pj6M5M8q5l2K8MM8l6O8m9K6qJ0ml7J27k17K3M5K9J8M6Rp3J3K1l6Q1n8LP8
2989H2j5r6L8l5m6J94j84J19l9K16k97Q7j05J19J09j47q5P7J6j29J48m1kQJ20l12Q6J31k2
$$ plain form
5806 28 -9 0 -23 43 -63 -94 -27 -125 -11 12 7 -9 -82 54 52 -10 32 121 158 -30 26 -20 -35 -7 -40 -16 -21 -42 -209 14 -15 -8 -54 -42 8
5395 8 -44 -28 -12 -6 -27 -29 -45 -30 -81 0 18 56 -30 6 31 -18 48 27 -53 -45 -36 -9 27 122 38 30 97 -2 -56 49 35 23 38 16 -6 -70 30
4961 30 -4 21 -2 214 102 -58 -31 79 40 23 -25 2 52 65 -1 213 90 5 -63 -69 -44 -80 -39 -43 -111 -133 -11 120 -9 -185 -73
4597 -73 -52 18 -62 -101 -51 -56 -74 -68 -3 0 41 -61 -50 -63 -15 128 181 5 -50 -61 25 26 -12 -35 51 -9 3 14 130 105 -40 -9 45 116 18
4186 18 -5 31 -16 56 16 35 -32 3 62 -23 -66 134 -36 -12 21 -35 3 -17 64 -74 -47 85 30 -48 72 102 17 -8 -10 -81 -31 51 215
3799 215 18 -65 -88 8 15 -4 -51 -26 -58 -50 -105 -71 0 8 143 140 -39 -160 -25 5 0 98 -93 135 -106 40 17 9 107 -29 -7 8 11
3412 11 -89 181 -30 -37 -53 -8 40 -45 -77 -49 -45 3 -33 35 -14 12 4 14 10 -27 100 -117 -94 -49 -20 -2 44 53 -20 -7 14 -22 59 1 4 82
2989 82 67 -29 9 -26 -72 122 -62 57 18 234 -63 24 -81 38 147 0 -85 -8 8 -121 27 -14 -16 -8 112 -200 -114 17 -5
2649eM1n0k1Q5Rj00R6o1m8J00Q3j01r3OL2M0m2Q8k9j46P0L5M6J20j29P3n0M4j73M0M0J64j72
2261hm9j0O4Q6j42P6k2r4L4K20J39k52n0K8O6l2n0j5JJ0j09J42p4M4k7R8n5l9N5m8q7J75o7
1874Hr1P7P8p0J3m5L2J22p4J3p0l8o9J3M8Q7K0m7m7R2j05K47j48RL7j07rPqm6M9K5L4j3j47
1463a23P6K7R6j02NM9l4N6q7n5J13j14J20K08M9k90J05L7q6m1k2J1r8LJ74p9K5n5J40j47J9
1099b0K0N2j19L8l7Q2JM9j01MmN3R2r1N0l3p0K3K23k42J75k26K05o7o0K5o8Pk1N7l3J92j02
712E4j75MN9J79J6j06RK8j20J25k5m1j0j17J11P3m8O4o1j5m5N9M8p9%K1m7K7M4J7k0j19J60
325G0r7o5J68j44OR3J0j4pn5M1O1q2N0L7o1j4L6l3lJ4m3M5k1O9r8PQ2j6q9P4j0o9kJ0K5N4
-110B9l2Q6j13qJ29Jl0
$$ plain form
2649 -5 36 -14 -35 50 59 -41 55 -6 -54 46 129 28 -65 -59 -27 13 -29 59 30 -116 -46 -11 35 155 26 99 49 93 -80 -40 0 164 -8
2261 -8 -57 -67 -3 83 -59 17 -5 -99 -65 155 294 42 -8 20 86 54 4 -11 -10 0 -109 33 -41 3 -24 74 19 -20 35 -13 -100 75 8
1874 8 -83 -6 72 2 15 -30 2 124 50 63 -7 -45 -114 -101 -53 34 54 7 -40 52 -53 194 46 55 92 -15 -24 -17 -25 -71 -22 3 37 24 -123
1463 -123 -47 -20 76 -26 -21 28 -6 50 -37 -92 21 -93 27 235 284 -6 99 136 50 9 -13 -2 -100 -97 77 -2 23 -32 108 -39 -20
1099 -20 0 52 -67 -29 -66 16 17 66 -35 -31 -35 18 110 19 69 36 -34 -11 212 -30 145 -81 124 57 -3 22 -46 -39 -60 -3 -36 156 54
712 54 -121 -117 -58 121 137 31 40 68 -52 73 48 7 -3 -120 -9 64 16 80 19 4 -41 18 66 -13 -13 8 -39 -12 32 49 29 -90 70
325 70 -27 -92 76 -68 -62 31 41 27 20 -35 6 67 -15 35 72 11 -3 33 0 -3 11 -32 13 -8 61 -37 -30 52 36 -53 21 11 -58 -60 -50 -25 29
-110 29 -3 83 -30 -38 91 92 62
-192F2
##PAGE=	F1=20972.2
##FIRST=	25164.769650603881018,	5806.207692317537294,	0.16425824165344238281
##DATA TABLE=	(F2++(Y..Y)), PROFILE
5806D7k4kk2N1j20m6Q9j08J35L1K1k4q5J09j6n9M9R6M6j79R2o2j7M0j07K8L4m2j56K20k0k1
5431b2q5R1J4l1J6J6k2%J2r3j6J7J07j6J05j19NK7l0J15m2q7PPk5O8J22j34RQ4q7m0O6l9l
5020cP1k0o5n7J07j3L2k0K07j37j58N6J01n2pj22N4Q3Ro1K13j45o9j02KN6j9J7K8p8m5J81
4644D4J37j55j99N8J22L6r9m0O6k6k7mP2l8L8n1J3k6M9J62N7k03o9L8M8N3n3k1P1p4K9pJ27
4257A28j6j50RP2N4p1pL7j19J23l4J1o1M2L9o5l0J85j69K5k9MN6j9J34j82j0J25o6o5R8K4
3881G3l2p5N4p9P0L8J37j79n8j5R9K4K5j50L8M8j1j16K5J01l6J58J8k19r8J29J3J3Q6j28K22
3517A75k63J38j6m9J15j48R6K1k4r2K34j90n5M2Q6m4q8K3k2P6Jn3Q1q6j2L6K4J5l0P9k05L5
3142a00L5L9oL8L9p5J8O6k6N6r7rL5N5j10P1l1p8K38k21Q2j8J78l02J51j01O4P3j20k0P4J6
$$ plain form
5806 47 23 21 -1 50 -70 -116 -27 -135 0 31 52 28 -57 52 36 -23 26 122 168 -11 81 19 2 42 -65 -37 -3 -45 -201 19 -1 -22
5431 -22 -107 -16 -2 -33 -17 -1 -23 -23 -11 -104 -120 -103 4 -12 93 -26 -21 6 -24 91 49 -38 -31 -24 -49 19 141 7 16 100 13 -27 39 0 -3
5020 -3 68 48 -17 -74 33 20 52 32 239 102 -56 0 101 49 42 -80 -26 57 66 5 218 73 4 -98 -96 -40 -59 -42 -14 -92 -137 44
4644 44 181 26 -173 -115 7 43 -56 -96 -30 -56 -83 -87 -15 -53 -15 -66 -53 -79 -30 132 189 -14 -83 -45 3 56 3 -18 53 -21 8 1 128
4257 128 112 -38 -29 43 97 26 19 56 -63 60 26 37 -24 18 57 -8 -38 147 -22 3 -26 -22 34 15 149 -33 -43 82 16 -49 49 73
3881 73 41 -34 20 -59 11 49 186 7 -51 -66 33 57 82 -68 -30 18 7 -109 -84 17 -19 139 157 -62 -160 -31 -18 -5 81 -47 175
3517 175 -88 50 34 -15 100 -48 48 69 45 -47 187 -3 -58 -16 70 26 -62 -39 -61 15 16 -37 44 -42 -54 -18 6 21 -9 70 -135 -100
3142 -100 -65 -26 -32 6 45 -30 -12 54 28 84 -13 -22 13 68 -42 29 -2 -80 158 -63 19 1 179 -123 28 -73 -9 64 -56 -76 -2 14
2766A4j13R1Np0M7R3k63J27Q9m1Q8n2j4J07l6r5O0n1n2J28R1j33r4N2O2j5q2R4p4r8O7M2O4
2379C8J24j55J17j15M0j63P7N3J38j85m1mP6J00j56L6m4j0NK04Q9k34J0k5J05l6p9j2k2P8
2027Ij07R8m2K5l1R6p5k2N5Mj51K17k7j24R7M5j09L3o4R3P3m0n3l2k1n9j0N7R1N5q8o6R8p8
1628e3K00j27J3J3j27j1O6J3j04Q7N0J4l2j58J01KR5q0jO5o7L4o7n5J44r2N7J66L2k60J76
1264I4O4j08o9jjr3qJ32n5L5m8J26j10J9lN0r1K3k9Q8k3L0o5l0N6M4Q3q5lk1m3J3J67j55K16
853A99j80j11P2l2N9p0J1m2J03l9J65q3j33k2N5J82J0j33QM5j25P7l7jNj22O1Q4rO9j1l4j2
466Ik2P5q1pJ6n3P5K0K0K0j40J42j31m2J44j47N9N3m2j9O2k4J3Q2j36J09N7r5m1nnK0J9k2
67a7N9o3R3j01K7M4l9o2R4l2o9lK0K4O1k0M9r0k4J15L4j9
$$ plain form
2766 14 -99 -8 -3 -73 -26 67 -196 -69 20 -21 67 15 1 108 72 -23 37 -14 -66 62 153 20 -74 -22 40 25 -57 37 -37 -135 -68 -26 38
2379 38 162 7 124 9 49 -114 -37 16 154 -31 -72 -76 0 100 -56 -20 -64 -74 -69 135 224 -10 0 -25 80 44 -35 -47 -69 9
2027 9 -98 0 -42 -17 -48 48 -27 -49 6 10 -141 76 49 -75 22 67 -42 -9 -73 20 93 53 0 -32 -53 -112 -122 -65 26 81 -7 -73 25 -53
1628 -53 147 20 33 46 -81 -92 -26 -13 -117 -30 20 34 2 -156 -55 -53 42 -38 -39 26 -41 -7 -74 -129 15 -77 -20 146 178 -82 94
1264 94 158 50 -19 -20 -21 -114 -122 10 -45 -10 -58 68 -42 -23 -26 24 -67 -44 -73 15 -8 22 -43 -73 -17 27 110 25 22 1 -42 -29 138 -17 199
853 199 19 -92 -20 -52 7 -63 -52 -94 9 -30 135 52 -81 -103 -48 134 144 11 19 64 -61 16 -21 -22 -17 -139 -78 6 -3 66 55 21 9
466 9 -13 62 -19 -26 -10 -63 12 32 52 72 -68 74 -57 -99 45 -102 -43 10 -32 -51 11 -13 0 82 -54 55 112 17 -24 -29 -34 -14 5 -17
67 -17 42 -21 72 -29 -2 42 3 -59 35 3 -66 -69 -49 -25 36 16 65 -25 -49 66 100 81
-192H1
##PAGE=	F1=20921.1
##FIRST=	25164.769650603881018,	5806.207692317537294,	0.20927488803863525391
##DATA TABLE=	(F2++(Y..Y)), PROFILE
5806F0J8m8l3N6j03j3Lq1J36P1K4k2r5N4k6o4N9R7M5j50Q8l3nM5j23J2L4m0j22J64k5J9j58
5419a56J38qPkL5j6k8K6j09j8rJ46n2J50j50k1J8R2O3m5r0k3M5n2J01P3j53J8J16r7OLm8%
5020d0J05l4n5p6R0L1L2nK05j76j33P0P1k9j8j22K6J19j5n6J87j25q6k7MoL9m5O4n4j04K26
4644F3J52j77j76L9J47Pr8mP0p5o5M7J07o7o7L6K4l8N3J27N2k35m5O1K8J11o8j2M5o7K3l7
4269c9J43J8j76N3M7K2m0J3kj32J40m7J2m3J5L9l4jJ43j65N9j05O9N8lJ36j94j9P0m3n7M8
3893a5N6Rj19J06p3N2L5Q9j13m6k6N9P4N4k30N1J08k5j75L5R4n0J83M7k28j15J21%N2K4l7
3529cJ78k37R4J9j03J07j13J45Oj6p7J69j66m5Q6Q6j15r9Q4RK8j0q7R2j06Q8l6J9K6j8M2j75
3154a28N0K6O7n3NP2l0o5J15J7K6r0p2j4R8o6Q7j7r6K33k06K9LJ67k60J17p5K9Rn1jO3J4o8
$$ plain form
5806 60 78 30 -3 53 -50 -63 -60 -141 -5 66 90 68 -27 27 1 -63 -4 93 138 -12 76 43 38 83 -40 -28 6 -34 -156 8 -17 2 -156
5419 -156 -18 -26 -19 -21 14 -2 -30 -4 -113 -131 -140 6 -46 104 -46 -67 -49 43 106 61 -29 -52 -7 -59 42 115 -38 -20 96 -1 5 8 -40 -40
5020 -40 65 31 -24 -100 -10 21 53 48 253 77 -56 14 85 56 38 -84 -58 61 46 -10 177 52 -34 -61 -57 -63 -24 -69 -5 -59 -163 63
4644 63 215 38 -138 -99 48 55 -43 -47 23 -52 -117 -70 37 -30 -97 -61 -37 -75 -22 105 157 -78 -123 -62 -34 77 9 -3 42 -25 -2 -39
4269 -39 104 122 -54 -1 46 68 28 41 39 -93 47 0 12 -31 -16 23 -11 -12 131 -34 25 -80 -11 47 44 180 -14 -33 37 -6 -63 -15
3893 -15 41 50 -69 37 -36 16 51 140 27 -19 -45 14 88 142 -88 -37 71 46 -129 -94 0 -50 133 180 -48 -163 -42 -42 10 34 -3
3529 -3 175 -62 32 51 -52 55 -58 87 93 77 0 169 3 -42 44 130 15 -84 0 9 37 27 -60 32 -74 14 -22 -3 23 5 47 -128
3154 -128 -78 -52 15 -38 -33 39 9 -56 59 76 102 12 -60 -74 24 -42 45 28 -68 165 -41 -12 -9 158 -102 15 -60 -31 -22 -73 -74 -11 3 -65
2754f5K2L5j09P3O4j93J19P3m7J13l7j8J06o0q9K1m9jJ19Q3j44o1M8J04q7n6O6j38M7%K2Q1
2379D2J04j45J27j28J4r3M5N9J15j80n0J7P4J21j44Jj3Mj5J63L5j98L2l6J17k7r4LrQ0q7N0
2003a6j7J7o8J13p3KL9L9j50J81Qj34R6K8j15N0n3R7M4kj12%l2l0k2N4J07O2j13o7O2rJ16
1616A02p2K5j5j15J6N8N8j63Q1R2k0n9j29P7J0P9m0K1O7j43N5n6l3J26n5jJ02K0j26J32Q8
1252A82j30r1K7J5r5j8P7k2N6n4Q7n5Nk5O8m3j2k0Q0l1K4n8oN0N1M4q3m0Ml5P5K7n4K66j5
841B51Lj08k07L7n5M2m1R7k9J26o1q9l4L8J82%j19j7O7j35L8m2J1M0o5K7K6MQ4N3p5K5r9J18
442I3p7n6L5n0O9L9kN3j06R6j48k4J11j39R0no0K4P7Nj6R8j72J26J01j33k0m0k2N5L8m0N9
55E9q6J15j02L2K2n9k8Q5k8r4K7J2J5P4j7J6j01M2M7M7Q
$$ plain form
2754 -65 -43 -8 -117 -44 20 -173 -54 19 -28 85 48 30 136 76 -13 8 -41 -42 77 160 16 -45 3 107 20 -36 30 -108 -61 -61 -39 42
2379 42 146 1 128 0 14 -79 -34 25 140 -40 -90 -73 1 122 -22 -21 -34 -30 -45 118 153 -45 -13 -49 68 41 -53 -50 -59 21 -66 -16
2003 -16 -33 -16 -84 29 -44 -42 -3 36 -114 67 75 -59 37 65 -50 0 -53 44 88 86 -26 -26 -58 -88 -110 -56 51 113 0 -67 -5 -14 102
1616 102 30 55 40 -75 -59 -1 57 -106 -25 67 47 -12 -141 -64 -54 25 -15 6 73 -70 -15 -71 -104 22 -33 -34 68 88 -38 94 182
1252 182 52 -39 -12 3 -92 -110 -33 -55 1 -53 34 -21 -16 -41 27 -16 -28 -48 32 1 25 -33 -39 11 62 106 23 -17 -13 -48 27 54 0 266 251
841 251 254 146 -61 -24 -79 -37 -78 19 -10 116 55 -34 -68 -30 152 152 33 16 83 -52 -14 -56 -45 -5 -70 -43 -17 -13 71 124 49 74 -25 93
442 93 16 -40 -5 -55 14 53 51 104 -2 94 -54 -78 33 -106 -16 -21 -81 -57 20 25 9 107 -65 61 162 29 9 -31 -53 2 40 0 59
55 59 -27 88 -14 18 40 -19 -47 38 10 -84 -57 -45 -30 44 27 43 -58 -16 31 78 86
-192H6
##PAGE=	F1=20869.9
##FIRST=	25164.769650603881018,	5806.207692317537294,	0.254291534423828125
##DATA TABLE=	(F2++(Y..Y)), PROFILE
5806G3M8j06l1P1q4K0q3n6J37J13J4l1r3Rl4p0M9Q1N1j13R4RoL9j27QL4l9r8R7j1Q1j76R1
5407c9k1N4k0N5k3o6N8j08M5o0J20o4J89j87m7J0K04kl7q0m8Q7m4P8K9j66K6J49j09N5m8m8
5032e8pJ27m7m6r5P2O5K1K0K16k16j08Q4M0j5l7k8o0J52m4j8J06r9r8N0No8R6j18Q8j7j52
4656a89K60J55j93j46O4J27j6r1L0P7j15r2Q7J32l9j13kO1n8M7Q1L6k31J3K1L3J54j01QL0
4304C0n9J6o6J58N3k03R8K3j0j0K9m8j00J13n6J9k5j3M1mK7J03j62R3j70J45L8qJ38k08j7
3940c5K8k3m6mR0N0j64J46p7M3M5M1m6l6l5%J04J03k92L8J42kj97L3P8p7J96Q9k26j32J13
3576e3j3R3l9N3J34k12N2N3j62R4m6J37J0Rp4R2j28k5J18P4j74j00J35L0k1k2j09J14j31J83
3224G2o6l0M4JKj44O4J9R4j00k9J06J6j49J46M1J3o2j37o3J43k2R1j3j05K39j90k6L7J72j92
$$ plain form
5806 73 121 15 -16 55 -29 -9 -92 -148 -11 102 116 85 -8 1 -33 -103 -54 27 78 -35 59 68 62 101 -26 -18 16 -23 -121 -24 -35 46 -130 -39
5407 -39 -60 -6 -26 29 6 -60 -2 -110 -65 -125 -5 -69 120 -67 -114 -104 100 98 61 -19 -67 20 -24 54 83 -83 -57 92 -17 38 -10 -58
5032 -58 -65 62 15 -31 -126 -54 11 32 52 268 52 -56 28 68 53 16 -12 -72 80 36 18 124 25 -73 -23 -18 -86 10 -108 -20 -37 -189
4656 -189 71 226 33 -113 -49 78 62 -29 1 78 -37 -129 -42 90 51 -62 -64 -3 -61 -14 67 103 -128 -115 -94 -61 93 -8 0 30
4304 30 -29 -13 -79 79 132 -71 27 50 40 30 59 11 -89 24 -32 -13 -38 -51 -10 -14 13 116 -46 47 -123 22 60 52 190 -18 -35
3940 -35 -7 -30 -76 -80 10 60 -104 42 -35 8 53 94 48 12 -23 -23 81 184 -108 -70 72 70 -127 -94 -16 -93 103 192 -34 -166 -53
3576 -53 -66 27 -12 41 175 -37 15 68 -94 0 -46 91 101 110 36 128 0 -25 93 167 -7 -107 28 58 37 15 -94 20 -111 72
3224 72 6 -24 20 21 23 -121 -57 -38 56 -44 -73 33 49 -100 46 87 100 38 -99 -162 -19 -41 50 37 -68 171 -19 -45 -8 164 -28
2860b8K0l4J1l5M0n3P1Pl0n3O0j03N4L0j30J17O4rR2k7k8J05q3p3nm9N0R3N5j36rK7J25j20
2461A6RNq9O5m2pR0Q3j35J37j39kj3j0M2J04j62o1L8O2J30j21k3J9J7l4J23k0j63M2n6J40
2085D5oj04K4L8K5o1OK0J9j14J17n9L7J2O3j49J44M3j43R4J3j22O5m0J01J5L6j70L2m3lk1
1710h6O2R9M8j26n9K6N9L4j8M4l8n1OL1Q5j77K9J28n9p6q8N4J7O4kM0O3j50N4r1L3R1l6n8
1311d8L9J8J8O0Q2j33r4N5L1q5j9J2%Q9n1L7j1rm6Q6Mm8j0P3l9J1n6O3jN2%o9o8K9k7J39j12
876b8L7L06K65L82m11n95Jn2P3l9R0k1Q8l9m5m4RJ70Kr5m0Q8j26J6o4LP5oJ4pm5J25J12j22
477G7O1j75J61p2j07N5m8O4M8l6Q6p4O3j54j0P1q6P6m1n2N0P1L6m6J14k09J44J45j71Lp7l9
102g2R1N5n5N7j09J37j14K7K2n9lO4j2j08M6pNQ8j6j6r9J17l3N0L4
$$ plain form
2860 -28 -8 -42 -31 -66 -26 -79 -8 -1 -31 -84 -24 -127 -73 -43 -173 -56 8 -1 91 64 36 141 58 -15 -20 -69 -19 74 129 -7 -16 11 136 16
2461 16 25 30 -59 6 -36 -43 47 130 -5 132 -7 -9 -22 -32 10 114 -48 -109 -71 -9 121 0 -23 -4 13 -21 102 82 -81 -39 -95 45
2085 45 39 -65 -41 -3 22 -39 -33 -13 6 -108 9 -50 -13 -1 62 -87 57 100 -43 51 64 -58 7 -33 68 83 119 -51 -19 -62 -65 -86
1710 -86 -24 75 123 -3 -62 -36 23 57 39 83 45 -6 0 31 116 -61 -32 96 37 -39 -127 -73 -56 8 6 46 109 -41 13 -78 -45 46 10 -48
1311 -48 -9 9 27 87 169 36 -58 -3 28 -57 -76 -64 -64 25 -26 11 0 -9 -55 31 35 -13 -23 50 11 22 -34 29 28 80 80 11 -57 -28 -55 84 -28
876 -28 9 315 580 962 551 -44 -43 -95 -22 -61 29 8 96 57 12 -32 -23 147 149 54 14 102 -24 -8 -72 -69 6 0 14 7 -38 87 199 77
477 77 138 -37 124 52 -55 0 -48 16 64 28 114 40 103 -51 -61 10 -76 0 -41 -93 -43 28 64 18 132 -77 67 212 41 44 -33 -72
102 -72 19 74 19 76 -33 104 -10 17 39 -20 -23 41 29 -79 -33 -40 -35 53 37 21 -78 39 6 56 90
-192I0
##PAGE=	F1=20818.8
##FIRST=	25164.769650603881018,	5806.207692317537294,	0.19496297836303710938
##DATA TABLE=	(F2++(Y..Y)), PROFILE
5806E6Q6j73k6J08p5M2j67RJ07J48nk6q7k3p1j1J3L1O7n6P0P8j7K8j27K2K2l7j09N6J6J55
5431A04k35M2L1O7PK2l0q9O2q9Q1p9R6l4J45j85m2MK77q9k8p2j0P9k1O3l5j49PJ75j31J18
5055F2o3m2PQ5r9Op9J5Q7J1O5K17k22j15Q0K0K5q4P1j05J33l2K4Rq0p1P9j0o6R9j19L3L2j49
4656a76K28J65j88j26Q3J03k3q2P8O5j81m9R8J20mr6q0J07q1O7QQk06Q2k6N7J31j09K1J0l1
4292b7Om2J23Q2j57O2j2J8m4M6q2o5P1m0K0J7p0N7M4J7M4j10Q4j55J59K8l2J16j98mj8N4q6
3905i4rR9M9j65J20l5JP7MK2l2n3n6J23J40l00M4Q2M8j56lP2r8J82J33j93j81R3pJ27l8N7
3529E3Q4j86J8R1j59N2J8J09PN3p9K6j23K0J47K8k03q8J44Q0q9k6j10J22o2J62o2o7N2Qj9
3165Aj04P2J3R3j01q0J31N8k36J52O0K4l6r4o8L6L6P0j4p7K22j55q3N2K17j62n4j2K1l3M1
$$ plain form
5806 56 142 -31 -57 51 -24 18 -149 -140 -33 115 110 84 -3 -26 -97 -108 -95 -64 3 -53 17 95 78 106 -21 1 23 -14 -123 -67 -51 104
5431 104 -131 -89 -58 9 16 38 8 -81 -19 -108 -27 -106 -10 -44 101 -84 -126 -122 155 66 38 -34 -44 35 14 77 42 -107 -100 75 -56 62
5055 62 -1 -43 -36 49 -50 -44 -123 -108 -21 -10 55 272 50 -65 15 35 60 -24 47 -58 75 43 67 76 -4 -75 4 -6 -72 27 -92 -59 -27 -176
4656 -176 52 217 29 -97 -14 89 66 -16 62 127 -54 -103 -5 115 111 15 -65 42 -39 28 36 44 -162 -80 -106 -49 82 -27 -6 4 -27
4292 -27 -21 -63 60 142 -15 47 35 53 9 55 -27 -92 -21 -61 -41 -24 -94 -37 7 24 68 -42 42 -113 46 74 42 158 -40 -44 -62 -8 -94
3905 -94 -103 -4 45 -120 0 -35 -34 43 47 69 37 -16 -72 51 191 -109 -65 17 65 -91 -94 -22 -120 62 195 2 -179 -86 -93 34 -4 53
3529 53 137 -49 -31 60 -99 -47 -29 80 87 140 61 87 -36 -16 131 159 -44 -132 12 92 3 -23 -133 -11 -73 89 27 -40 12 20 1
3165 1 -103 -31 -18 75 -26 -106 25 83 -153 -1 59 83 47 -47 -115 -79 -43 27 13 -64 158 3 -80 -28 189 27 -27 -39 -18 -51 -10
2801a0m7M9pJ5n6L4n7j9K1p7Q0L5P4L0j3l2O9p5p5Om0O6O0M3j21L9PJ26j40Q9k5l8Nl7j7N7
2379A9N2q2J02r7l8O6q4L0J02j43j0NM7J29p9l0J1K1j8O1o3j23L4o4J44K3r7N3N9k4l5k9O2
1992DK1j35R7m0N6K0K7j16Q4O3j08M6L2r2N0l8J11K3L4j84K5o0NNQ4Q6or3n8l7J40k4J4N8
1592I4l2j8%J7J06j67n2J43r1n1n4J2N0J2P8O0L7j37O0j47R1K6j0p6k8J04M9j1N6r3j00P8
1217FM9j00J9m8J2Q5j2J4l4K8q4Q6N9p8NO4n7Kl1R1n1N6n2m7o5Q5q3J96j74N7L75N91Q49p71
818A042j040nq1R3m1L1K9L7j5l8k5j1J32j3j8n8Q4j39Q0m8o4O9P9l4J1n7R6J47j47N2j92J78
442A34n4j54O1m0N1M7m8J10m7L9j55MN6o0M6m9k6N9P0L7l9J04k26J53J42j62J8j02n7J33N0
78I5o2J9r2J32j09mK9JrJ3K5j01L4QK1L5l1ml1J03l8k4M5
$$ plain form
2801 -10 -57 -8 -15 0 -56 -22 -79 -98 -77 -154 -74 -39 35 65 52 20 89 14 -61 -55 -95 -29 31 74 -47 -8 -1 125 -15 74 49 11 16 -21 -38 19
2379 19 71 -11 91 -6 -44 22 -62 -32 70 -73 -83 -78 -31 98 19 -11 0 21 3 64 1 -122 -88 -152 -8 15 -82 -29 30 6 -29 -58 4
1992 4 25 -110 -13 -53 3 23 50 -66 18 81 -27 19 51 -41 9 -29 82 105 139 -45 -20 -80 -75 -70 14 100 94 1 -57 -94 46 22 36 94
1592 94 62 44 44 61 167 0 -52 91 0 -51 -105 -93 -43 -31 47 107 144 7 67 -80 11 37 27 -49 -77 27 76 65 121 28 -72 6
1217 6 55 -45 -26 -74 -62 23 11 25 -9 19 -65 21 80 2 7 71 14 16 -15 76 25 81 29 -18 -83 2 -81 115 -59 -2 373 964 1813 1042
818 1042 2 -3 -84 9 -32 -1 28 65 50 12 -13 -24 108 95 77 19 103 -36 44 -4 -68 1 80 46 57 0 96 243 96 148 -44 134
442 134 80 -74 -13 -53 -2 45 -3 107 60 99 -56 -52 4 -56 -10 -59 -85 -26 44 81 42 146 -80 73 215 53 71 -31 -88 45 95
78 95 33 52 -40 92 -17 -21 8 9 0 13 38 -63 -29 -21 0 35 4 0 -31 72 34 10 55
-192E5
##PAGE=	F1=20767.7
##FIRST=	25164.769650603881018,	5806.207692317537294,	0.13563442230224609375
##DATA TABLE=	(F2++(Y..Y)), PROFILE
5806C9Q4j89l7J28o5O8j78kP6J81l0l1n4l3n2J3K6n9N9k7R1J03l4J0j15M9km6j15K1Q9J82
5431A50k87kQ2Q1K3k2k5j01P1o5O0o3O6j0J19j66m8Q0K31j45j6o2K8P2j0L6q1j15K1J45j58
5067a11J75o8k5K2M3j34Q0q4o0J07KJ11K18k28j22P5JP0j25J26j05J08k6O6q7n2l1R7l7p2
4715f6R1m4r9R1j35J85J63j72r5J01Q0l0p4J16M2k37OR7R9M0o6j59J54j06Q8p0k5j38J07o8
4362a24Q7J07j17L5j0lmj8Q7J12j13K8m6M5p7O3j19k8K8j8K6M0n4M0O1Pj6n7P5j41J73J9n6
3975C2R5j90L7l9J10j45L5O8kj25Q8Jm8J05J1M6k2o6j18J37J54k40K1mJ08j04l3P2q5J10J77
3611A86j58j67M7k1J44OJ8L9j56j6J30j06N7K2K2J4J08q4l9j30N4J87pk30p7J42J19j33j0
3271c9j21J17mJ31m8r1O5K2pj22Q7J0R3j01j31J55J02l23J57Q0L4j1m0o1q3Q3M9j3n1K05j00
$$ plain form
5806 39 123 -66 -103 25 -40 28 -150 -152 -76 105 75 44 -10 -43 -95 -82 -56 -115 -56 -83 8 111 77 87 -28 21 19 -27 -142 -121 -32 150
5431 150 -137 -139 -57 24 47 25 0 -101 -30 -95 -35 -98 -32 -42 77 -89 -137 -57 174 29 13 -49 -21 51 41 77 -4 -119 -98 47 -111
5067 -111 64 -4 -29 -7 36 -98 -18 -102 -162 -55 -53 58 276 48 -74 1 2 72 -53 73 -32 76 50 116 29 -23 -54 43 6 -66
4715 -66 25 -19 -118 -27 -162 23 186 14 -81 20 100 70 -4 112 154 -83 -77 20 119 159 93 -66 88 -18 70 0 -25 -163 -56 -124
4362 -124 -37 70 -47 -12 -22 -25 -29 -47 40 152 39 67 21 66 -11 52 -67 -95 -67 -85 -59 -19 -73 -33 28 35 19 -38 37 -104 69 88 32
3975 32 127 -63 -26 -65 45 -100 -65 3 1 -124 -36 -35 -83 22 33 79 57 -9 -127 10 164 -76 -55 -59 49 -55 -88 -16 -101 9 186
3611 186 28 -139 -92 -113 31 37 55 94 -62 -78 52 -54 3 25 47 61 169 85 46 -84 -30 157 150 -80 -157 -15 104 -29 -39
3271 -39 -160 -43 -47 84 36 -55 10 32 25 -97 -10 0 93 -8 -139 16 118 -205 -48 32 66 55 15 -46 -129 -46 3 -10 -61 144 44
2907D4j21M8K43j31j29RL2l2M3m1K7k1O0m2K4o7n7K6j2K4j4J59l3Jl7L3o4o9L0m2P1J7J8r5
2508i8R7k4J17j51J82o5Km5k2k7K5K1k9O2o1m1R0j25N2M3r0L5l3L2J28l7l7j5PJ6J7o4m2K4
2109e6p3O6O6r6P6Q2p3j1o3J04K3j57P6k0P6J6k1q3K6R2o0kN0p3K4l6J21M2M3k05J3m3m2M7
1710g1J25N1p7l8l9k3J45r4L2Q3j5j0l2J6J43j46j22J41j40L0n3j3J01n4J48O9%j24O5k02
1358a04J49m6Qm2m2J38K6o3N0n5j06R1N5j09O2o2k1Q0K9L5j03Q2j04N7Q3r9K7N4p4ppJ12j08
970a4N7j02K3j0Q4j07J86r6o4M55R08J307j112j467J5q3O8q9j0R8j4Rm5k4J3M9k2O5q4P3j33
606f6J62l3j31M6J47p2M1k0K0J74j79Nj56J96l8j55K1k6M2L8p4J29k9K3j49L0N3m1J2j3m6
243h9O4O3M8k0R5k44J50J29j43M5j15o4J62L5o9k0q6J16r2k5L9O0j6l8N1j05L4L4L5j7m5O
$$ plain form
2907 44 -77 -29 214 83 -46 -37 -5 -37 6 -35 -8 -29 31 -11 13 -54 -111 -85 -97 -73 -87 72 39 40 3 36 -28 -97 -67 -109 -38 -21 -3 -98
2508 -98 -1 -25 92 -59 123 58 60 15 -7 -34 -9 12 -17 45 -16 -57 33 -92 -40 3 -87 -52 -85 -53 75 38 1 -14 -7 9 26 -38 -80 -56
2109 -56 -129 -63 3 -93 -17 65 -8 -19 -82 22 45 -112 -36 -56 20 36 15 -68 -42 50 -10 -12 38 -35 -11 -47 74 116 159 -46 -33 -76 -118 -71
1710 -71 54 105 28 -10 -49 -72 73 -21 11 94 79 69 37 53 196 50 -72 69 -71 -41 -94 -107 -6 -60 88 157 157 33 98 -104
1358 -104 45 -1 7 -35 -77 61 87 24 74 19 -87 4 59 -50 12 -50 -71 9 38 73 -30 52 -52 5 88 -11 16 70 -4 -11 -18 94 -14
970 -14 43 -59 -36 -46 38 -69 117 21 -43 412 1320 2627 1515 48 63 -20 48 -41 -51 47 33 42 -3 -27 -14 35 13 78 -6 67 -66
606 -66 96 63 -68 -22 125 53 94 74 94 268 89 94 -62 134 96 -59 -38 -64 -22 16 -58 71 42 65 -84 -54 -1 -42 -30 -43 -89
243 -89 -25 38 86 66 161 -83 67 196 53 98 -17 -81 81 116 47 27 -59 57 -35 -60 -21 39 23 -15 36 -69 -35 -1 34 17 -28 -22
-133b2L7R1m5r7N6
$$ plain form
-133 -22 15 106 61 -36 20
-192B0
##PAGE=	F1=20716.6
##FIRST=	25164.769650603881018,	5806.207692317537294,	0.12827551364898681641
##DATA TABLE=	(F2++(Y..Y)), PROFILE
5806C7M7j12n3Q1m8Q5j56m1P7J67m3m7k5lk7pN0l1m3PJ38P7n4rj00O4nm9j53K2J82J46k97
5419a23j2Q6R7K4o6k3n0N2n3j5k2P0k9J21j47p2J85J56j69l9l0O8L9j2L3j04q2N6R9j35J28
5055C1l5j9L9J4j06J21j15j05R0jJ50K26k32j10L6MQ8j51J59p8N8rJ02j57m8L0Q2o6n3Q2L8
4691F5k16R7q5J36J60j52r1J09P7l9o1J39K0k40L5R0O9M8j6j78J51j20J20j08q4p7J12q4Q4
4351c9P9q6L7l9L1k1K4L7J38n8l3q1Q3j15P3j09Jl4OO7K4k2K8R0m1n2j8N0j18J66M5j14P8
3963G7j46O7rR5j60N7L5n1o1J8L7q4J29L2K6Nq5j04R1J36j37K9j02J37m5l7L8m7L4J98j21
3600E2j34M1o8J26L7k0Qj32l0J68n7R2pn9M1J28q0q1r6J3K39m6k43n9J23J33j64P8j35J03
3247b9RP7k6p0N4N5J0j60O2M5P4p6j33J22J44l41R4R3M3kRp0r8Q3J2k1mJ77n4j17M3K24j41
$$ plain form
5806 37 84 -28 -81 0 -48 37 -119 -160 -83 84 41 -6 -31 -34 -61 -68 -18 -49 -92 -85 53 130 76 67 -33 31 26 -23 -176 -154 28 174 -123
5419 -123 -135 -49 48 72 6 -17 -67 -15 -68 -83 -105 -35 -64 57 -90 -162 23 179 10 -29 -59 9 48 36 69 -35 -117 -61 38 -97 31
5055 31 -4 -23 16 30 -76 45 -70 -175 -85 -86 64 290 58 -52 -16 -12 76 -75 84 6 64 55 157 0 -48 -18 64 -2 -55 27 65
4691 65 -151 -54 -139 -3 157 5 -86 23 100 61 0 139 159 -81 -46 44 113 161 145 -33 118 -2 118 10 -74 -151 -39 -123 -39
4351 -39 40 -46 -9 -48 -17 -38 -14 23 161 103 70 -11 72 -43 30 -79 -78 -112 -106 -39 -15 -37 -9 81 40 -12 -30 20 -98 68 113 -1 77
3963 77 -69 -2 -11 84 -76 -19 16 -35 -96 -78 -41 -125 4 36 62 67 -18 -122 -31 105 -32 -3 -105 32 -13 -50 -12 -59 -25 173 52
3600 52 -82 -41 -109 17 54 34 42 -90 -120 48 -9 83 76 17 58 186 106 25 -71 -58 181 135 -108 -167 -44 89 -75 3 -132 -29
3247 -29 -20 57 31 -39 15 70 80 -80 -18 27 101 25 -108 14 158 -183 -89 4 47 45 54 -16 -114 -31 -19 -40 -44 133 79 -38 5 229 88
2860H8j28NL8k0K6l0K9j2Q4p7N8r7p3L9L9l3j0J87j10Rk8j6k3k6J1l7M7j4Mo1J24RM7j24K31
2449A56p8J2j06K9l2m2L5RJ5k0OK9j46J71n8m2K8m8K5J08%m9l5j4M5mrl1O7j12QQ1n2L4P5
2038E5n8k2n9J13Jj60Q7j4Q2K7n6n5K4M3j1m8J11n4n2l7J27R7j2j39m3k0j00Q9J46K4j34K9
1663a9l4K1J06j21qJ39Np5k3O3J28j19j48R8r0M6o0QJ35j49K04P2l3j17Q0k16J50r4L6j5m8
1299g8J38j2o3L0Kj03J03K9j15J16m5p3L2Q4N0q4Q5j25J2Q3j17O3K9r8qK5J11p7j4j41J23
935c8M5N6q8J25l9j47N28J139J662j382j781K7p9N1j44k2J37Kj4j09J7N2j0l2J14q7K4q7K08
595A28m2j47J8J79j12P6K3m4J33j46m1j11K07j9j67jlN0M8j32J34l1M3j77N6M7k3LM7p8K2
231f0O2N6J1O9k09J01J05q8O3j16n7J58L0p1o7o4P8p8lOJ41j0r8O4j14M4O9J8m9l6L9N3P0
$$ plain form
2860 88 -40 -35 3 -17 9 -21 8 -4 80 3 61 -36 -109 -70 -31 -64 -74 113 3 12 -16 -32 -55 -81 -70 -107 -60 -74 -70 -131 -7 2 49 -75 156
2449 156 78 90 -16 13 -19 -61 -26 -17 -2 -22 -16 13 -133 38 -20 -62 -34 -82 -57 51 51 2 -33 -47 -2 -6 -15 -46 21 -91 -83 -2 -54 -20 55
2038 55 -3 -25 -84 29 30 -130 -43 -57 25 52 -4 -59 -35 8 -3 -51 60 6 -46 -83 44 141 129 -10 -53 -73 -173 -84 62 86 -48 -19
1663 -19 -53 -32 74 -47 -55 84 89 14 -9 54 182 63 -85 13 -77 -31 -91 -83 52 -97 107 179 146 29 109 -107 43 -51 -15 -30 -78
1299 -78 60 48 -15 15 17 -86 17 46 -69 47 2 -71 -39 45 95 11 96 -29 -17 66 -51 12 41 -57 -65 -40 71 -6 -20 -161 -38
935 -38 7 63 -25 100 61 -86 442 1581 3243 1861 80 107 28 79 -65 -87 50 52 38 -71 -54 -2 -12 -44 70 -17 7 -80 128
595 128 86 -61 -43 136 24 100 123 79 212 66 25 -86 121 102 -65 -66 -69 -19 29 -103 31 0 43 -134 -78 -31 -54 -51 -4 -82 -60
231 -60 2 58 69 138 -71 30 135 47 110 -6 -63 95 125 54 -13 -77 1 -77 -80 -74 67 57 -41 23 -91 -47 22 40 -9 -45 -6 47 117
-156A17m4q7l8
$$ plain form
-156 117 73 -14 -52
-192e2
##PAGE=	F1=20665.4
##FIRST=	25164.769650603881018,	5806.207692317537294,	0.12091648578643798828
##DATA TABLE=	(F2++(Y..Y)), PROFILE
5806C5J0l5p0L5l2J03j35q0P9J54n6o6NK7kk5O6qq7OJ80M5p3k9q5P9pn2j73M3K55R2k97j1
5407a09P9J01K6j09k2%L4m1j02QQ6l8J16j39j5K22M4j40o7mR9oj0L6q1r3J00O6p8K6KqN2k3
5008A2l3J20j32j32P2lJ66K11k23q7mPJ12j71J35j7PQJ04j69o2P3P9q5k6P9R4k71O7o9J07
4644c1J82j45r7J06O2l7l6J46k0j85K8P8L3N0K6j79J66j45J41j33j33k3J13n6L8N5m9L8o7
4304g4O6m0O5j0J52j4p8r9Q1j02N1m3j5m8OQ2RJ0J4J21r0q9K4K3j06J48Q2j61O2j02Q5J0R1
3916A11j63O6pr6J0jL3o9J15L4j0M2r1p3O4R0o2M2m3L6k6k1K2k2L2J25r0p4N9j27R7O7n7l1
3517a8j19M3J41k1J15j9j24J02R2n9j03j7p2K72j04j99p6R3J37j35J39j88J37PPnm8M2Q8K7
3165A35j97L6P9N6n0j30R5J52l03J4Q9N2PL8r7q8J07n2L6J9J24qj13L9K05j52j28KM6j2J1
$$ plain form
5806 35 45 10 -60 -25 -57 46 -89 -169 -90 64 8 -58 -53 -26 -28 -53 13 5 -82 -76 104 149 76 47 -38 41 34 -18 -191 -148 107 199 -98 -109
5407 -109 -30 71 97 -12 -34 -34 0 -41 -143 -135 -49 -87 29 -110 -125 97 141 1 -66 -70 29 23 13 49 -32 -125 -25 41 -37 -11 -9 -17 35 12
5008 12 -21 99 -33 -165 -93 -96 70 281 58 -29 -33 -26 86 -85 50 33 40 48 152 -17 -79 -6 73 -12 -38 41 135 -136 -69 -138 -31
4644 -31 151 6 -91 15 77 40 4 150 130 -55 -27 51 84 134 160 -19 147 2 143 10 -123 -146 -33 -89 -51 4 -45 -7 -74
4304 -74 -8 -48 17 7 159 145 67 -32 49 -53 -2 -45 -60 -108 -102 -20 -11 -1 13 134 44 -45 -21 2 -104 44 126 -35 27 -75 10 20 111
3916 111 -52 14 7 -89 -79 -80 -47 -116 -1 33 23 65 -26 -99 -35 55 -7 35 -8 28 2 -19 3 -19 13 138 48 -26 33 -94 3 70 13 -18
3517 -18 -137 -94 47 26 141 122 -2 100 192 133 30 13 -59 213 109 -90 -166 -73 64 -71 68 -120 17 24 31 26 -22 20 108 135
3165 135 -62 -26 53 109 59 -71 24 176 -127 -113 -24 28 35 73 -24 -112 -5 -57 -21 -2 122 114 1 40 245 93 -35 -33 13 1 12
2801A2j9L1mJ08j22Q1j04o7K9O6m5L7J44j67J1k7n3L1Mj8l3K4j1K7k4O4L9k6k3K05r2K0j57
2414e9R4m0j08N4N4%l4N2k9j23K50q2o2K9n3QP6L7o1n5l4P3k5M6k0J04j57OO1j2j2O7m4l2
2015c1n6J23k0j65R8pQ9N3p5o9O9J5l2o8J95n2j49l8J35J51o7p0r1kp4L5J62Kj86R8l1O6O7
1628G5j36l9J85J4j39j6J00J00p4j56L5K8om8K3J66k58K49Q7n6j20Q3k24J57r8J8K0m8J26
1287D8o0l6M4L7j18J15Lj21J70k7j25j8J40O4o4Q2j51J2L7j28J03Oj22nO3P9J2j32j2N8Q8
923D2L7o1N6Qj54N25J211J856j493j937L1q1N3j79M1J01J6l8j79N2J07L7n7N8q0j3qJ97n1
583I7j63L6J66j57J04O6j08J03j00q8o6K18%j80k2L1O9N8j89J28m4P3j92O9L1ooJ06j10l1
231a07N2P4N2M4j75N5P9l2Q1j18m9J47K0q1l3p3J0m5L7m6K02kj59P8j23N3J05%q2k6P0O0L7
$$ plain form
2801 12 -7 24 20 128 6 87 -17 -84 -55 11 -34 3 147 -20 -9 -36 -89 -58 -54 -72 -105 -81 -92 -65 -89 -25 14 -12 -35 170 78 98 -59
2414 -59 35 -5 -113 -59 -5 -5 -39 13 -16 -139 111 29 -33 -4 -57 -49 27 64 3 -52 -86 -13 -38 8 -12 92 -65 -59 2 -10 -22 45 1 -31
2015 -31 -87 36 16 -149 -51 -58 31 84 9 -60 9 24 -8 -76 119 67 -82 -120 15 166 99 29 -62 -64 -138 -103 59 61 -125 -27 -58 8 75
1628 75 -61 -100 85 99 -40 -56 44 144 70 -86 -51 -23 -29 -77 -54 112 -146 103 190 134 14 97 -127 30 -68 -50 -30 -78 48
1287 48 -12 -48 -4 33 -85 30 33 -88 82 55 -70 -88 52 116 52 134 -17 -5 32 -96 7 13 -109 -114 -51 28 40 -92 -104 -46 42
923 42 79 18 74 82 -72 453 1664 3520 2027 90 121 40 93 -86 -45 56 72 34 -145 -93 14 51 -6 52 -28 -41 -49 148 97
583 97 -66 -30 136 -21 83 149 41 144 44 -44 -110 108 108 -72 -94 -63 6 64 -125 3 -41 32 -160 -91 -60 -66 -72 34 -76 -107
231 -107 -55 19 71 115 -60 -5 74 42 123 5 -44 103 123 42 9 -64 -54 -99 -62 -108 94 92 -67 11 -112 -59 46 46 -36 -62 8 68 105
-156A05j9n7j31
$$ plain form
-156 105 86 29 -102
-192a02
##PAGE=	F1=20614.3
##FIRST=	25164.769650603881018,	5806.207692317537294,	0.14076030254364013672
##DATA TABLE=	(F2++(Y..Y)), PROFILE
5806D0l6M9q1j7MR3j24q9N1J26m8n5K5O0J1o5P4J4p8j0J81L1q3k3q8P7Rn0j56K8K80O1k65
5419e4m0O8J16Nj15j8L1J6l2j68L1R4J0Q6j53N4K24m1j00j05L3P8m1nM9k8j18J21P4o5p4O8
5043Ak8M6j4K5J25j59j23M8jJ38K09k15o3nLR3j15L9M7l0QP5j35o8R8P3p6m3J21J18k97K1
4668h4m6Q0K30j43j42Q8N8l3J9Q4l7q8NL2N7jO5j56J43j46J43j22q8o6J30l2n3P3lJ9n6Q3
4292A3n0P2l4J37L1j17j04N0k6j2K3j1n1k9J21m7M9K4J46j36o8k0N5j14R5J20j53L0p5J17
3940C6lP1j38L5j1l9m0N4j2l6J08J0p8P7n5n5O7lK4N0j5k6l4K5k8K8M5K9q8k3J02j55P8M9
3541D9m7r2m4P1J02rJ26j0j60J28M0j1j16L8p2K18j42j31r3J07P5o7J52k00J35k5j3K5l5K2
3189B1R8L6k04j3J17M5l1r3N5J40k44j9M1O0JL7j13l0J04r9J16qO7K9r2N0J70j80j00ML7L1
$$ plain form
5806 40 4 53 -28 -45 -41 52 -72 -161 -110 16 -32 -87 -62 -2 9 -56 18 32 -46 -56 125 156 73 50 -38 39 48 -2 -158 -130 150 211 -54
5419 -54 -94 -26 90 95 -20 -38 -7 9 -23 -191 -160 -66 -56 30 -123 -69 155 114 14 -91 -58 20 -21 -26 23 -5 -123 -2 72 7 -67 1
5043 1 -27 19 5 30 155 -4 -127 -79 -80 58 267 52 -11 -16 -13 80 -35 4 51 21 29 104 -31 -99 -1 72 -4 -47 74 192 -105 -84
4668 -84 -130 -50 180 37 -105 -17 41 8 27 111 74 -14 -9 23 80 79 144 -12 131 -15 128 6 -82 -148 -18 -50 -103 -30 -33 -14 -70 13
4292 13 -37 35 1 138 169 52 -52 -2 -28 -40 -17 -28 -79 -108 13 -34 15 39 185 49 -19 -39 16 -98 -3 117 -36 -6 -81 36
3940 36 33 104 -34 1 -10 -49 -89 -35 -47 -83 25 35 -43 34 -21 -76 -9 -12 12 62 47 21 -13 12 -16 12 57 86 -2 -25 77 -78 0 49
3541 49 2 -90 -134 -63 39 30 156 146 -14 114 154 143 27 65 -7 211 69 -62 -155 -48 27 -40 112 -88 47 22 9 34 -1 21
3189 21 119 155 -49 -62 55 100 69 -24 31 171 -73 -92 -51 9 10 47 -66 -96 8 -91 25 17 84 113 21 71 241 61 -39 -35 2 33
2813C3J9p0O2oJ21j68J03j20l1J1M9m8J16R5k00j2j2j8J1K2l1l4OM8N5l6j4P4q8O0J54q8K5
2426H8j62J18n1j43Q0Q0Jp2J07j19l0K57r6p4L3l3mM1J4n9Jk2OJ3M8k6J21j87M2L5Mk9L7Q
2027B7p3n1J14j4j34O7K9Q8M2n6r5R8L4j16k6K43n1k30lJ16J53j20L9j12n5Nl8J51k5j60J07
1663d6k8O3P1j05l1J90J0j98K3O6P3l9j16k6J14p1j8M1J84k89K17Q2o0j24P1j79J44m4m3K7
1311d1j8P4o0RL5Qp4J25l3j09J91qj64k8J38Q0k6N9j67K0Jq8P1j9r9K4M7M5R9k16R4n2J48
923F6Ml4K1J8j32M97J143J824j451j850k4n3R0j65M0N6K4m3j39J9J02J08o1k2o8m6N0J79p3
583H0j78Q6J24j57R6R7j46L0m3k4q4K43mk07j9N2R0P3k28R6n4J13j82M7JK7j5J13r7o7K4R1
207b2R9j3j10J1O2k2J06r0n6J22K5q6Rj06Ok7L4p4K34Ok04P6p4N8Q4l5o5RN6M8KPj2j15
$$ plain form
2813 33 52 -18 44 38 159 -9 94 -26 -57 -46 3 -45 71 166 -34 -46 -58 -76 -65 -43 -74 -108 -102 -54 1 -35 -49 25 -63 -3 151 63 88
2426 88 -74 44 -7 -150 -70 10 11 -61 46 -73 -103 154 58 -16 17 -16 -20 21 35 -24 -23 -45 -39 -26 22 -4 117 -70 -28 7 11 -18 19 27
2027 27 -46 -97 17 3 -131 -64 -35 53 95 39 -56 42 76 -40 -66 177 126 -104 -107 9 162 42 81 -31 -86 -81 -119 32 7 -153 -46
1663 -46 -74 -11 60 -45 -76 114 124 -74 -51 15 88 49 -67 -93 21 -50 -68 -27 157 -132 85 167 107 -17 54 -125 19 -25 -68 -41
1311 -41 -59 15 -45 -36 -1 7 -67 58 25 -84 107 99 -65 -93 45 125 99 158 -9 11 12 -76 -5 -24 -123 -99 -52 -7 92 -124 -30 -82 66
923 66 70 36 57 75 -57 440 1583 3407 1956 106 82 29 119 -46 -6 50 74 31 -108 -89 13 121 60 38 -30 -76 -26 153 80
583 80 -98 -12 112 -45 51 148 2 32 -11 -35 -119 124 120 -87 -106 -54 36 109 -119 -23 -77 36 -146 -99 -98 -71 -86 27 -70 -137 -113 -22
207 -22 77 64 -46 -35 27 5 111 21 -35 87 112 26 35 -71 -65 -92 -58 -132 102 108 -96 -20 -94 -36 48 13 -52 -43 13 61 63 70 58 -57
-192e7
##PAGE=	F1=20563.2
##FIRST=	25164.769650603881018,	5806.207692317537294,	0.16060411930084228516
##DATA TABLE=	(F2++(Y..Y)), PROFILE
5806D6q1J31r3o8M5Q9j46m1J1Q7l7M9qL7K7j08Q2L8p1k6J71Pq2pq9P4K0n5r4l1K99K5k33o8
5407a00N5J30mj09k5N1Pj3r5j5L0P5N1j73J10K16j20n6r7K6O2p2%O3M0j24P9J11n9r1M7m8
5032d8M6JP2J18j66q9J2j1J00J94k00l4L9m6Q0n4n5J10o7QM6j00p4J21O8o8o0J65J42l24j3
4668h7j3M2K67j31j74N7M5l0P4J0o3J8pj2Q0o2R2j23J32j60J35r7l5r7J58jj35P1K6J1l5J02
4292E8o2O7o6J09O5j34q7PM1p7Q9qn2o4J60j04R0L4J69j71l5p5P7j18M7J32q1qn2J30l5N1
3916I7j13Oj7J7q8J18m5kJ02j4j49J03l2l4P1l2K4N7J2p8l2P3q0P9N8o7q8J8J34j55Q8nJ7
3529D3j08j4L3Q9j5J21J0j85J53j2L8j28R2p3J66j81o4j09J20J5%J66k13J33n6l3N4k2rR6
3177A07O7j88p1J42L4j2n8J7J29j86m1MO9nK4j40L9J14j58J86l6RO5p0O1J36k09p2OK9Q3M0
$$ plain form
5806 46 -35 96 3 -65 -20 69 -77 -118 -107 -20 -57 -8 -16 21 48 -60 22 60 -11 -37 134 141 59 52 -37 37 57 2 -92 -123 176 201 -32 -100
5407 -100 -45 85 81 -28 -53 -2 5 -8 -103 -118 -88 -13 38 -135 -25 191 71 15 -82 -56 6 -66 -66 -3 37 -87 -8 103 44 -47 0 -48
5032 -48 -2 -1 71 189 23 -66 -54 -65 35 229 29 -5 34 -12 68 14 -41 69 2 10 56 -44 -118 3 71 3 -57 108 250 -74 -87
4668 -87 -100 -58 209 78 -96 -39 6 -24 50 60 -3 15 8 -4 76 14 106 -17 115 -45 90 -7 -42 -139 19 18 -117 -46 -20 -9 -44 58
4292 58 -4 63 -3 106 171 37 -50 -43 -2 -79 10 2 -50 -114 46 -58 32 66 235 64 29 -46 31 -87 -40 92 11 3 -49 81 46 97
3916 97 -16 -10 -27 -10 -98 20 -25 -27 75 61 -88 15 -17 -51 20 -12 12 69 81 3 -29 44 -36 43 101 34 -54 -36 98 -57 31 26 43
3529 43 -65 -79 -46 43 28 149 159 -26 127 115 153 25 117 44 210 29 -35 -144 -24 -9 -9 157 -56 77 21 -12 42 20 11 107
3177 107 174 -14 -85 57 91 79 21 38 167 -19 -60 -56 13 8 32 -108 -69 45 -113 73 37 46 111 41 102 238 29 -43 -37 -8 75 115
2801A15j34Q3rJ35k15J26j37NnL2n2J95N6k21l4LJ6qM2m1Qn6R4P0n0r1J08j50J33R2o7M5j33
2414d5Q7l3j44Q1Q0Kj10J61k10N2K54r9p5L8j5j6Prn8O8Kn3N9L1n1J37k16O6jL0l5RO0j25
2015g1n9J29J4j15K6O5Q6L1l8j20J27O4j87rK70l9l01L2R8J55j72J59j23j24O7o6R6k8j11
1675a44R8m4M8O5n1%J73j5j55J3OJ5Qo2k3J15j26J9N4J97k87J29R4m8j28N9j32J30Rj03L5
1311e1J2O8j4m4K0j4k6J34o8j07J98K5j93l7J34Q5KL5j82N1j5n7K5k4n7K9PM6J31k23J24j19
935a05J62k9pM2pj28M51R46J574j230j584q0k4J50j27j6M5L8m4q6lO6J50m6q3n7q0R0J42q8
583C2j84J46R4j69P8J39j72m4J3M1j03K69rk22mN0Q7J00k54O9o0R9j38L0k3M8l5J31p4q3J4
219a34R0J26p5n0L1J9l6J06o3o2J08M1r1N1j21K1l7%j02K65K6k37P3k6N3N2m7k6L2L1L6l3
$$ plain form
2801 115 -19 64 55 190 -25 101 -36 -31 -36 -4 -56 139 195 -26 -60 -57 -41 -49 -7 -48 -40 -96 -2 68 18 -73 35 -115 18 110 43 88 -45
2414 -45 42 9 -135 -54 26 28 -82 79 -131 -79 175 76 1 39 24 8 15 6 -52 16 18 -35 24 55 4 141 -75 -9 -10 20 -15 -6 54 -71
2015 -71 -130 -1 13 -102 -76 -11 75 106 68 -52 75 139 -48 -57 213 174 -127 -95 3 158 -14 145 22 -102 -35 -101 -5 -33 -144
1675 -144 -46 -90 -42 23 -28 -28 145 130 -25 -12 -6 9 17 -45 -68 47 -79 -60 -6 191 -96 33 127 79 -49 10 -122 8 17 -86 -51
1311 -51 -39 29 15 -29 -9 -23 -49 85 17 -90 108 133 -60 -97 37 122 124 159 -23 28 13 -44 -19 -43 -100 -71 -64 -18 113 -110 14 -105
935 -105 57 28 21 63 56 -72 379 1325 2899 1669 85 5 -19 131 4 -12 33 71 27 -59 -62 4 154 108 25 -32 -112 -22 120 32
583 32 -152 -6 88 -81 -3 136 -36 -80 -67 -26 -129 140 131 -91 -95 -45 42 142 -112 -43 -103 -4 -142 -112 -135 -87 -122 9 -65 -148 -134
219 -134 -44 82 7 -43 -12 7 -29 77 14 -48 60 101 10 61 -60 -39 -76 -76 -178 87 113 -124 -51 -77 -24 28 -19 -45 -13 18 54 21
-156B1L3L4j01
$$ plain form
-156 21 54 88 -13
-192a3
##PAGE=	F1=20512
##FIRST=	25164.769650603881018,	5806.207692317537294,	0.10898983478546142578
##DATA TABLE=	(F2++(Y..Y)), PROFILE
5806C1m7J35r8p4O2O3j69K0K8j1j3J27k4J0K9j21M9O4k7p2J38Ln0J0p2L1M1l4p3n3K53K4k27
5419d7p8P2J31m3o2rK9LJ2m7l1KQ6kj61J47K01j52m2q7K2L8K2p6M6P4p6k2J84n0q9jp1N2K7
5008BQ6J08j52m6pm0M0J92j66j5Q4q6M8Lj18J51q6j2J2n9o5J35N0n5n1J58J31k89l9K3K1K62
4632B20j16j60QJ9NR3o7q1R9J1q9J39j14P4p6J03j48Q2m0J9o8J41K5j25j6O7j3KR9o6M9p2
4257DQ9M3j24o3%M6p8Q8L1q9l4J46j00O4N3J89j87l7j09J04j32M8Q6K0m2j1R4m2op1l1NN3
3870Gr5J25l9qJ11jj35K6nl4N5Jj6N7Mr1k2J05j08R6Q6j24q3lJ68j16O7l5O6o2l9j6O3j5J13
3459A03L1j78J32l2O4j31J18l1J19j97m2q8J07j9N5J39j74R4o9l5N7j7j0M7J00j41r0Q5P3
3118G0j0j1MP0j11l9nO1m3J4j51R5J09j63K12n9l8O1l0O2R9k06n8JL5J08P5j67O6j4J36k17
$$ plain form
5806 31 -16 119 21 -53 9 72 -97 -77 -49 -60 -73 54 30 40 69 -52 -3 61 34 -38 100 103 53 63 -9 22 63 29 -44 -97 156 180 -47
5419 -47 -125 -53 78 35 -27 -36 -7 -4 8 -39 -70 -68 18 16 -145 2 203 51 9 -78 -56 -18 4 -72 -26 48 -28 -50 134 84 -5 -6 -77 -25 2
5008 2 88 196 44 -2 -9 -49 -9 183 17 2 86 0 48 51 -67 84 -2 -14 -2 -61 -126 9 59 4 -47 111 242 -47 -86 -63 -42 220
4632 220 104 -56 -48 -29 -24 69 2 -79 20 31 -58 81 -33 41 -35 68 -80 2 -38 -19 -87 54 79 -46 -62 5 -8 -6 93 27 76 4
4257 4 93 136 12 -51 -51 -5 -83 5 36 -53 -87 59 -41 23 76 265 78 41 -68 36 -96 -48 38 58 16 5 99 57 51 -20 -51 -46 7
3870 7 -88 37 -2 -10 101 100 -35 -9 -14 -48 7 8 -8 49 53 -38 -60 45 -63 33 119 -5 -88 -91 77 -39 28 -7 59 -3 -42 -58 5 -10 103
3459 103 134 -44 88 56 120 -11 107 76 195 -2 -44 -132 -25 -44 11 150 -24 70 1 -34 23 6 -4 43 143 2 -88 -3 70
3118 70 60 49 53 123 12 -27 -32 29 -14 0 -151 -56 53 -110 102 43 5 66 36 98 197 -9 -67 -66 -31 77 152 -15 51 37 173 -44
2743d4J24j43L7pk8NK22K1k11l4MNJ4K7j5K6r9J34M5l8j39J14j56J43M2k7N6j07M3nj09M5
2367e5P8j2j17J90k04N3K25j03n0N1kl1%n0J3O2L0r4Q7Or0J19j95O4k5M4k4L8M6j59K1K4J14
1980E4j63O0P8O3Kl3j13J27J04j93j9K44m6l02M7R8J10j33K12j22j89J07q3M7K1r2N1j0m0
1639a13P8K4LJ63j6j13j6p0j7N1J1j0P7j71N7P5J74k52L5Q6j9p5jq2J28K0j15J8M2J25qj00
1264a1Mo4M2J31r5p9J59L3j76n2J22J21%j4j72P8J1m2n2j5QkK8M3J05k11J48r9Q9o7K3Q9m4
876C9j49M06O67J181r14j186j06nK03n9q9L6J7k4m3lM6J45n6q6o4o4O3J16q5j07J32N7j55
536h7M0J46j58k9L9L7r1K43Kk21K5K5O2J15k22K4j4K0r4K1NM0l4O8k8q8N6M9J46j50K7O1Q
149D3j11R8k8r2J02Q1q0P1j39N6q0k1n0K20K5k06L2MP1j1k5J2O4k9K8k5L3M4p1
$$ plain form
2743 -44 80 -63 -26 -33 -61 -56 166 187 -24 -58 -54 -49 -35 -8 -23 3 -96 38 83 45 -94 20 -136 7 49 22 78 -29 14 9 -100 -55
2367 -55 23 11 -106 84 -120 -67 158 55 5 56 54 23 23 -27 -14 48 78 -16 71 77 -13 106 -89 -25 -50 -6 -30 8 54 -105 -84 -60 54
1980 54 -109 -49 29 92 94 61 -52 75 179 -14 -33 211 165 -137 -90 8 118 -15 197 75 -114 -7 -90 -43 -22 -114 -63 -73 -113
1639 -113 -35 -11 -8 155 139 26 10 -60 -77 -26 -15 -25 52 -119 -62 13 187 -65 -30 56 37 -38 -39 -121 7 27 -88 -70 -28 97 89 -11
1264 -11 -7 -71 -29 102 7 -72 87 120 -56 -108 14 135 135 121 -51 27 38 -4 -56 -71 -63 -65 -37 6 111 -100 48 -51 38 -29 -6 83 39
876 39 -110 296 963 2144 1230 44 -62 -67 136 77 -12 24 41 17 -26 -29 17 162 106 20 -44 -108 -45 71 -14 -121 11 68 -87
536 -87 -47 99 -59 -88 -49 -12 -103 140 142 -79 -54 -29 33 148 -74 -50 -64 -44 -138 -117 -112 -72 -106 -38 -66 -154 -98 -49 97 -53 -26 35 43
149 43 -68 30 2 -90 12 93 13 84 -55 1 -79 -100 -150 70 95 -111 -79 -75 -4 -15 -40 -28 36 7 35 10 43 87 16
-192A6
##PAGE=	F1=20460.9
##FIRST=	25164.769650603881018,	5806.207692317537294,	0.057375550270080566406
##DATA TABLE=	(F2++(Y..Y)), PROFILE
5806A6J4P8p5n2P5L0j59K5N1j02J1K06m1j8M2j22MP8J8j18J05jj8K7n6j0O1j4l5n7J51N7j93
5419b2n9N4R8p0nmmQN3k0o3K0N4m0j32J67J69j27o3p1K3QJ13r4%R7l7j22K57n4r9k9p4M9M8
5008B9Q8Q7j28Pk3o6K9J55j41nJ18j39J6O2j71K04j05k9K2o2n8J48L2m2n4J40J32k45o4N9
4656dj0K45q9j34Nn1K6J01p2k6L7L3j17J56j15J7l2P0o6n2O4K9l3J31L8j26j04J09l6L7J08
4292A39n7L7o8N9J4j12l7L0lp2R2N9j36PJ42r5L9O0J96k08m3r8Q4j21P4K1J02p6L0N7m8o4
3916Dk8o8K7J02r2J19m4j4J22J2j23n1K3l4M0L4n8M7j6p7J7Q1j02J07J09j36k9j27J89l3J
3553Bj5P8k4o8l6O9l6Q6N3j72J12n1P8j47J38LR1j94l2p7J05m2R9J01j25O8q2l9O2j2k4j2
3177d3J38q7o4k0J20mL7qkm7k4lN2q1J5j51J29Q2j67K37p2p1M3%P4P4k06m1nM2J20R9j88N9
$$ plain form
5806 16 30 108 33 -19 56 86 -73 -48 3 -99 -88 118 77 59 101 -21 -17 61 79 -39 66 65 47 74 18 8 69 55 20 -37 114 171 -22
5419 -22 -81 -27 71 1 -4 -8 -12 -4 49 29 -34 -14 40 0 -132 35 204 77 14 -57 -34 -26 87 -7 -7 90 53 -69 188 134 35 6 -68 -19 29
5008 29 117 204 76 83 60 -6 23 178 37 32 150 11 27 89 -82 122 17 -12 10 -52 -110 38 70 28 -26 114 246 1 -63 -4
4656 -4 -14 231 142 8 13 -38 -12 89 17 -9 28 61 -56 100 -15 2 -30 40 -26 -78 -14 15 -18 113 151 25 -79 30 -6 31 139
4292 139 82 119 51 110 124 12 -25 5 2 -70 22 81 -55 -48 94 -1 38 98 294 86 43 -55 29 -92 -18 3 105 29 59 116 68 4
3916 4 -24 -92 -65 37 -55 64 20 6 128 140 17 -34 -11 -45 -5 29 -29 18 2 -75 -58 23 -79 28 137 1 -28 -155 34 1 2
3553 2 -13 65 41 -27 -63 6 -30 56 109 -63 49 -2 76 -71 67 70 161 -33 -65 -142 -37 -79 20 121 -4 64 -18 -57 5 -7 -31 -43
3177 -43 95 8 -56 -76 44 40 77 69 67 20 -4 -7 45 -36 -21 -172 -43 39 -128 109 37 -34 9 9 83 157 -49 -90 -95 -53 67 166 -22 37
2778C7l6J22j63Q7j54O2Np9M4K30Oj82m6pOM7J2J1M5j42J54kl6j06N8p9P8OJ9P0r2j0L4o4
2379f5kO6rj07J72j54L0J73q9oN2%l9km7L8N2N2j35J16j9j31J02j75O4n0O8jO9L1j81J12j05
1992a20J92k10R4R1M0k8k8j00J32J10j43n9J87k9k76N6R2L8l3J98r9k03J07o0L7L6j05MK6
1651e3o2JJ01KJ54j8p1m7j34N4lP8LM1j71M9R1J46k06m9P9J1j2n0m2J15L0j28LP1J72j5j50
1264a0po7O5J31j15o2J09M1j61n5J23J44j3n2j49J03L7l2j34L9K7k7N6K8O7j87J84q1J6j04
912h6N3J36q1j71L61L55P55n71p59o9j3K33j5j50L6mlkkQJ21m8p0p0m8L5R0p2j7J07J0j16
536f7K6R3j12M1K8J3r9K16J4k21N6%L5J32j91k1L1n9m8K1M4M7k1n9M5r9R3RJ65k27J06R3m
149H0j87R1Qj25J09J30p9P9j67Q0r3j2j7J55K6j76qL3Q7p3kN1R7r0L1oK1M4m2
$$ plain form
2778 37 1 123 -40 47 -107 -45 -40 -119 -75 155 161 -21 -67 -74 -68 -21 -9 2 47 -95 59 57 21 -85 -27 -106 -28 -22 -3 67 -25 -35 -1 -65
2379 -65 -67 -1 -10 -117 55 -99 -69 104 15 9 61 61 22 20 -27 11 63 115 -20 96 77 -54 48 -127 -63 -113 -45 -46 23 54 -127 -15 -120
1992 -120 72 -138 -44 47 87 59 31 -69 63 173 30 -29 158 129 -147 -91 1 39 6 204 105 -98 9 -51 -14 22 -83 -79 -53
1651 -53 -115 -114 -13 -11 143 125 54 7 -127 -73 -76 2 5 46 -125 -76 15 161 -45 -94 -15 -4 -16 -66 -108 7 37 -91 -88 -17 155 140 -10
1264 -10 -17 -84 -19 112 -3 -65 44 85 -76 -131 -8 136 123 71 -78 25 62 30 -104 -65 -38 -65 -9 19 86 -101 83 2 18 -86
912 -86 -33 103 22 -149 212 567 1322 751 -8 -77 -90 143 128 -22 14 10 7 5 3 11 132 84 14 -56 -104 -69 21 -51 -68 39 49 -67
536 -67 -41 52 -60 -19 9 22 -77 139 153 -68 -12 -12 23 155 -36 -57 -26 -85 -133 -112 -68 -21 -42 -101 -56 -155 -62 -53 112 -115 -9 84 80
149 80 -107 -16 -8 -133 -24 106 27 106 -61 19 -74 -86 -103 52 78 -98 -106 -73 14 -59 -61 -10 87 -3 28 22 43 87 45
-192D5
##PAGE=	F1=20409.8
##FIRST=	25164.769650603881018,	5806.207692317537294,	-0.0230655670166015625
##DATA TABLE=	(F2++(Y..Y)), PROFILE
5806fK4M6n4j8O4K1j05m5Q0j18JK21l1j9M1r5j8M0P1j23M1J2%M5m9k5O1J3m0k9M7Q3j28l6
5407b8K9O4q2J2nk7L6P0po6J4K0n9j02J54J55r4q4n5M2QJ42r8KN8K9k06L07o6j26l3n5M6O9
5008F4L2Q5p1J8k1o7O5J05j67K9J01j64OQ2j55K04j10l4L3p8p4J61J3k6j8O3J29j58q7Q1n
4644C6J75n2r7Pq7J4Q8k7k7mM8q9J30r5m2j8N7Po2P4K0mJ01N2j28j35R2k9O2J06k9K8p9N4
4245A47l7o5n0N0l4m2O1Q3j58O7R8q1QQ3J73k05q4l5M3n3O5p6J68q2O9Qm4j11K7r0L4J28o6
3858aO9j3j7J19L6j44o9N0l3l4R0r2N3p0l5N1L7m2O5J18p5k3j71J52K6n3J8M3J4q5l2J32j21
3470c7O2P4j07O2p2M6j18Q6N6R1j78l3o7Q2J1J08K6o5L2r5MK9ql5m6J71n5j8q7J30k4P5J4
3083A14q2LJ8k3O3j47N7j52J25M8j24K21p3m9rOP6N4j70l4K1K1P0J52j93L1l7R7j09O5r1q
$$ plain form
5806 -6 18 64 10 -8 56 77 -28 -73 7 -111 -110 111 80 61 102 7 -11 29 100 -23 18 30 30 75 26 1 62 75 35 6 53 136 8 -28
5407 -28 1 65 -17 -5 -10 -37 -1 69 62 -4 10 30 -29 -131 23 178 84 0 -55 -13 -5 137 39 41 99 128 -78 229 163 37 4 -51 -5 64
5008 64 96 181 110 128 107 40 105 210 43 72 173 9 15 97 -58 146 36 2 35 -43 -117 44 57 31 13 76 205 47 -40 41 36
4644 36 211 159 62 69 -18 -4 84 57 30 26 74 -15 115 20 -22 -40 17 24 -38 36 56 52 153 205 77 -58 34 5 67 173 144 172 93 147
4245 147 110 45 -5 45 11 -31 30 113 -45 22 120 39 47 130 303 98 14 -21 22 -31 34 -42 126 44 113 121 77 -34 -7 -97 -63 65 -1
3858 -1 68 55 38 157 193 49 -20 30 -3 -37 53 -39 14 -56 -91 -40 -3 -45 20 138 63 40 -131 21 47 -6 12 55 69 -16 -48 84 -37
3470 -37 25 99 -8 54 -18 28 -90 -4 52 143 -35 -68 -135 -53 -42 66 92 27 59 -36 -32 -3 -11 -46 -92 79 24 6 -81 49 25 100 114
3083 114 32 35 53 30 93 -54 3 -149 -24 24 -100 121 48 -1 -10 -4 72 126 -44 -78 -57 -36 34 186 -7 24 -13 84 -25 40 -51 -59
2707e9M2p8M3J84Jj40n9nk8R6jM6K7j31J68q9j2k8k7KK4jK3Q3p3m9N7m6n3O2Jr0J48j16J5
2297f3J50q7J7O0qn8K5m0N9L3N2j36J16n2j31M7r8K0lN7j2R6Qj27J57j44J59k35J14R1K3m5
1921D5l3o9J02J10n8q1O9k1j86K0Q8kM7J90r1j85P8k6O2L4j30j5L8m1K6J3K8J28k3n1n8j27
1545a19J29p7R7J2J3j54J2Q8J34j45m7K2L1Nl9m4J05J6r0j4N4K21m9j64k3k2L2J60j03q5N6
1182A2K2j29j6R2J67k8q9j18R8P9l6j66P3L4m7Q1j3L1j46K09p4k6j18O9J53q7j26K27J22L43
829E93k63l80J1kJ90Kj59K0ppj2K8J4N6m7l4p6J3l8P1k9L9J07m3m2j9L8o4N4M9Oj13J49O2
430A67j88N1k7kJ41j67j7M2p5m3L4N7N3Kj74R2p8R9k1J76k61J48R6J3k33R8pr4L9K05p4O2
55A14j84Q5r7M5k6J01J5j43k8L8R7j00M6N9Q4j17K6K7k0M8k7
$$ plain form
2707 -59 -17 -95 -52 132 133 -7 -66 -71 -99 -3 -4 42 69 -62 106 17 5 -23 -50 -48 -24 -25 -2 81 8 -41 16 -30 -83 -21 -20 -110 38 -78 -63
2297 -63 87 0 17 77 69 11 36 -4 55 88 140 4 120 68 -63 -16 -114 -94 -97 -40 -52 44 52 -75 82 -62 97 -138 -24 67 90 45
1921 45 12 -57 45 155 97 16 85 64 -122 -102 -14 -16 31 221 130 -55 23 -3 59 93 -37 -52 -14 -55 -29 -16 12 140 117 66 8 -119
1545 -119 10 -67 30 42 55 -99 -87 1 135 -10 -57 -35 -4 1 -38 -82 23 39 -51 -65 -11 210 161 -3 -26 -48 -16 144 41 -44 12
1182 12 34 -95 -111 -19 148 120 31 -87 11 90 54 -112 -39 -5 -52 29 16 47 -99 110 36 10 -108 -39 114 27 -99 128 250 593
829 593 330 -50 -39 -41 149 151 -8 12 5 -2 -14 14 28 84 37 3 -73 -60 -98 -27 -56 -17 90 47 5 -14 24 -40 14 63 69 -44 105 167
430 167 -21 30 3 1 142 -25 -42 0 -75 -118 -84 -27 26 28 -146 -54 -132 -33 -54 122 -139 9 105 118 -115 -17 -24 -118 -79 126 52 114
55 114 -70 15 -82 -37 -63 38 53 -90 -118 -80 17 -83 -37 22 106 -11 15 42 22 70 43
-192D3
##PAGE=	F1=20358.7
##FIRST=	25164.769650603881018,	5806.207692317537294,	-0.10350668430328369141
##DATA TABLE=	(F2++(Y..Y)), PROFILE
5806c0K5Kl1J4O6K2o6j28R6n9m4J99j3j3M0o6l1J4J25j28k2K3ON2k9k9N0K7l4J1n6J07p2k6
5407BJ1L5m9j7Jm5N3P5Oo9J0j2lj47J39J39n6j00PJ7oJ58q2K3oP0j74K64q4j59j8j8L4P7l0
4996D6P5k3K3on1J11O6k11M5R2j82lJ01j40K05j15l7M2r0j6J00j0j0J9j5J19p7o4N8kJ04j6
4621A38o1L0j06j6N7J7k8l5O8m4J20j17n9kM3M7j8N1k5K5P0O8j27j11M2j5R0R4j2J8q8N9p6
4233I7k0o4P1o4j4L2R5j91J28N4o8k2J05J49k00j24L6J5%M5o9J29q6J10m6m6r0O2p9j6J48
3870G7m7L0L1k1J15N0j77p5Q9k8j02J07p5K8o3K0QkK4J1J17k0k1j50R3Q0j14M1mO4r0l5J89
3482A50j49NQ8m7J1r3M8n6j0O4J03j52m0o2J17K9J12n4noj07M7JKn7%J58o8L4o0N6l8J07L2
3083A60j61N1N0n6R6j89Q8j66J21J6q1K03p3k8n0K2O8K3j21j7L5j0RJ93j86J5l9P2n5M2k7
$$ plain form
5806 -30 -5 -3 -34 -20 46 68 2 -126 -30 -89 -133 66 53 40 80 14 -17 -3 122 -6 -28 -5 1 53 24 -5 45 72 38 49 -7 100 28 2
5407 2 13 48 -1 -18 -17 -62 -9 66 72 3 13 1 -2 -149 -10 129 73 -27 -20 -3 -9 149 67 90 84 154 -20 244 160 1 -17 -35 -1 76 46
4996 46 121 98 121 115 64 175 241 30 75 167 -15 -18 83 -57 148 33 -4 38 -52 -68 32 22 12 31 16 135 58 -6 52 50 154 138
4621 138 77 107 1 -15 42 59 31 -4 64 20 140 23 -36 -38 5 52 34 85 60 85 155 223 96 -15 27 12 102 196 184 202 114 173 97
4233 97 77 13 84 20 6 38 133 -58 70 124 56 34 139 288 88 -36 0 15 15 60 -9 120 34 144 98 52 -38 24 -55 -71 77
3870 77 30 60 91 70 185 235 58 -17 72 44 -58 49 -26 2 -61 -41 -33 -35 -11 0 117 97 76 -74 19 99 -15 26 22 86 -4 -39 150
3482 150 1 6 94 47 58 -35 13 -43 -53 11 114 -38 -78 -140 -23 6 118 64 59 53 -54 -7 -6 -4 -61 -61 97 29 63 3 59 21 128 160
3083 160 -1 50 100 44 140 -49 39 -127 -6 10 -71 132 59 31 -19 3 71 94 -27 -44 -9 -19 -10 183 -3 12 -27 45 -10 32 5
2719Ep9R9n8J1J08Rq9n7Rl5P9j9P7J9j08J81j75PM3o5L5nJ7RP6l3p0O3n0j03N8J1p2J23p8
2308e7%J27q5M1N6k7o5O1m4P0QM7j00O2m7r6k0l2nO3K6m2J25j7o7K10j61O0j78O5Q7On1k6
1909fm0P2R9J6j00n1kq5j6Q2n3J18J73r1j48O9PQ9L2j56l3M7j8M9p2N4Q9l9k5o2q2J54j00
1522b9P5J6k2j25j3Q6J22q5m6l5N2K3k9n7Q4J2l9l2L7K51j01j61j8J0j2K00p9j07Mmj03O7
1146e8J7J95l8j14p5O9R5m6j16P1Mo5J06m9Lp3J78n1n1j32Q6J69r3q0R1jM0o3j12R2QJ21o
759A22j41L0j1j1m2M2K5Jl5J3p8Q1q3j1M7L6J31p2K2p5ooM9N0K0j08P0R8j55M7n1m1J49j43
360c6pN9m7q3N3P4M5Oj46Oj6N4m2J94k20J14Q9K2k36J47o6j8o7K44n7N6k02R1j01J01l3M7
-16B5lj15LKQ2o6P4N2P2j46K2O0o1N2j2
$$ plain form
2719 5 -74 25 -33 -22 86 95 6 -51 -42 -77 2 -17 60 79 -29 152 -23 -16 27 -38 -3 -8 9 18 94 61 -9 54 4 -99 -41 -30 -102 21 -57
2308 -57 -57 70 -15 26 82 55 -10 51 7 77 85 132 32 94 47 -49 -69 -101 -106 -43 -17 -59 66 49 -18 192 31 91 -87 -22 65 71 20 -6
1909 -6 -46 26 125 141 41 -10 -12 -97 -113 -31 -84 34 207 116 -32 37 44 133 165 9 -24 23 5 54 -18 36 125 86 61 -1 -83 71 -29
1522 -29 46 62 40 -85 -98 -12 110 25 -21 -56 -4 19 -10 -67 17 29 -10 -42 -5 246 145 -16 -34 -24 -36 164 85 -22 -18 -22 -125 -58
1146 -58 -41 154 116 2 -73 -4 91 45 -71 0 4 -61 45 -4 -1 -74 104 53 2 -130 -44 125 32 -48 43 42 82 19 -93 -1 7 128 122
759 122 -19 11 0 -11 -53 -11 14 15 -20 -7 -85 -4 -87 -98 -51 -15 116 44 66 -9 -15 -21 28 78 98 -10 60 158 3 50 -1 -42 107 -36
360 -36 -43 16 -31 -114 -61 13 58 64 -82 -76 -92 -38 -80 114 -106 8 97 119 -117 30 -36 -54 -121 123 66 122 -80 11 -90 11 -22 25
-16 25 22 -93 -90 -88 -6 -72 2 54 126 -20 2 62 1 53 41
-192D1
##PAGE=	F1=20307.5
##FIRST=	25164.769650603881018,	5806.207692317537294,	-0.075136661529541015625
##DATA TABLE=	(F2++(Y..Y)), PROFILE
5806b1jj3qL7M7K6k1j59O2K1r2J52J6oL9n1n2L1J35j06k8j6jP5k4k3L0K9l5M0q3Q3k3n3L8
5395D5mm6ok3k2L1Q8J2l7jn0O8k24J47J09l0j20P9pJ6R8m3M6m6P4j23K41j37j36m2M1RP1r5
4996a7P9PJ8NjJ19M4k39M7O2j72K8Q0j33K06j15n4M0k6kL3k0l2Q4o9O6J3k5J5L1JK6l4L2q8
4586Ij6j8N1l8j3L9pJ30j49n4L3N4J4K1L6n4M0L9Q1j31p4KJ4J05O8J5Rj11P8j01J7p3N2n3
4186A5OrR1j95J67J8m9m9J35J05j76q5K9j8M3K0j9J8n3J26j00k6k0O8r3k4J05lRO1m8J33N1
3799B33k20n3J26l1q9L3j2qkj9kj9M9jP3K5k8j17J01O2j17J2l4Q7r5JK11j40o2J09j0k7j06
3412g0N8j6mm4J24q6qj32J90J9J04j22K6k7q1M5k6K6o1M9J38j02R2n3%m6J06N9j87M2Q6j02
3036cJ42k03J11j88J14Qn3J72p0k5l9K0M1Qo6j4N2l7m5K14j64Qm2M2k9M0K6j30J37k7k6M0
$$ plain form
5806 -21 -22 -35 -43 -6 41 67 46 -113 -51 -30 -122 30 46 40 79 28 -24 7 142 36 8 -8 -9 66 42 19 49 78 43 83 0 83 60 7 45
5395 45 41 -5 -11 -34 -56 -25 63 75 38 37 -13 55 -169 -22 87 57 -63 16 9 25 123 80 126 80 154 31 272 135 -1 -43 -2 7 78 -17
4996 -17 62 69 87 92 91 210 254 15 62 124 -48 -20 60 -73 133 18 -36 4 -22 -24 9 -11 -43 41 -28 38 51 26 41 72 73 99 65 97 9
4586 9 -7 -25 26 -12 -25 14 7 137 -12 -66 -33 21 35 56 92 38 78 117 198 67 -7 -5 9 114 182 197 206 95 173 72 89 16 68 15
4186 15 21 12 103 -92 75 93 44 -5 130 235 59 -26 3 -15 28 48 29 47 -6 120 20 -6 -26 42 -51 -75 30 27 36 97 49 182 233
3799 233 13 -40 86 55 -34 -1 -13 -21 -23 -42 -44 -63 -14 -15 58 83 55 -62 39 101 -16 -4 -38 49 -46 -45 166 26 -36 73 63 36 -70
3412 -70 -12 -28 -32 -76 48 -38 -46 -178 12 31 135 13 39 12 -69 -24 -50 -24 -85 -36 102 0 92 39 39 -7 99 158 -29 13 99 -3
3036 -3 139 -64 47 -141 -27 -19 -72 100 30 5 -34 -14 27 35 -31 -45 7 -30 -75 139 -25 -17 -59 -17 -46 -6 20 -110 27 0 -26 14
2661A4J4m6l0L0m0J8l4J08j1o1J69k17P3M2n7M1j2%KP0np1M9o2j25O1K4q2J31n7k7J22p4L8
2261eL8l5p6J04m7N7J2Nl4j2l6j6o6Kk4J04J7p4R0KpK55j60o1j08J9P4pl5k4l1M5Q8O6q7j57
1839a24L3qm9P2l7Q3J69r4q4N0N2R3Qj58j4M4n3J19j62Q5M1n7Qm5n3J74j10M0Ok4j24lL4J39
1440E1m2n1m6O3K2j5o5O2J3J1m5K1K39j37j37l3M3m7K50n0j68PJj27J46j0J60j3j06n5K0Q3
1064D5n8j3K2jn5J11j09K8j2J14o1l3q1N5J29o5m7j0O0p2j0m6Q3O7N2l8j02L3Ol5n7M1M1n2
665g0nL6mN4n0mk9J4J65p7P5j41PPK0L9O1r6nJ32j18K4m8o4J49j50L9K9k9n7M3Q0L7Or6o9
243i5K4Qj8J55j52Q5L4M2j83J38n9J4j07K20o6N3j63N5o0J20n6J8j5j15L9J0M6k8J04L0Qj01
-133a5OO5p5N8k3
$$ plain form
2661 14 28 -18 -48 -18 -58 -40 -74 34 23 -38 131 -86 -13 29 -28 13 1 1 3 73 68 -3 46 -16 -141 -80 -56 -138 -7 -64 -91 31 -43 -5
2261 -5 33 -2 -78 26 -21 36 48 53 19 7 -29 -45 -111 -109 -133 -29 -12 -86 4 6 -1 254 94 33 -75 -56 18 11 -24 -48 -79 -34 54 120 33 -124
1839 -124 -91 -99 -148 -76 -113 -30 139 45 -39 11 63 156 164 6 -8 36 -17 102 -60 25 66 9 17 -28 -81 93 -17 23 29 5 -119 -122 -88 51
1440 51 9 -42 -88 -25 -3 -18 -83 -21 -8 3 -42 -21 218 81 -56 -89 -46 -93 157 107 -61 -54 -53 -180 -34 -44 116 103 -3 -58 -38 45
1064 45 -13 -26 -4 -5 -60 51 -58 -30 -42 72 11 -22 -103 -48 81 16 -31 -41 19 -53 -63 -109 -26 41 93 55 -47 -14 -8 -43 -100 -59 -18 -70
665 -70 -75 -39 -43 11 -39 -43 -72 -58 107 30 105 -36 -29 -22 -2 37 98 2 -3 129 11 35 -13 -77 72 -78 -39 -10 -39 -96 -53 27 64 70 -26 -95
243 -95 -71 -63 -81 74 -78 7 41 83 -100 38 -21 -7 -114 106 40 93 -70 -15 -75 45 -11 7 -8 -123 -84 -74 -28 -56 48 78 86 -15
-133 -15 -9 56 -19 39 16
-192A6
##PAGE=	F1=20256.4
##FIRST=	25164.769650603881018,	5806.207692317537294,	-0.046766519546508789063
##DATA TABLE=	(F2++(Y..Y)), PROFILE
5806a3%jj1L3L5L5Mj18j0O4r5O0N0OM0l7p2M9J32r3k5m5pR7j7j8J0L2l7O8j08N8J5r0P4l2
5384C3m1Lm5jkR0L0Pqq2R5k57J49P4nj39J52l2K7K7nP0r5P1o3K24j68r2q7P7j2O2j48R4J8
4973B1nJ5N0J26K1k59N4J7q8M3M3j38J95j03n9L7L7J2l2k6m8J23o0k7N8L4j1O4j00N5j9L5
4597F5p0oq1R6l7kjL2J38j82m7O6O5m3L1L0p4O1J6Q5j41j8k0L3J08M2M2pj43J17j09N4q2L4
4198E2m2K6m9P4k10K18ol2p6J55N0j23j7pq2Q8nM2q1l3J32j31J5K9N0q3j0M1J7kJ04p6J50
3811A78N3k63l1J63l3p8m2N3n7M9l7QL3qnL9M8n8p4J20M5j21Pl8M8p6L3K27j31j30J19J5k7
3423B9q2M2lK0j32J37k7J3k14K76K1R5j90N1n3j2jm8N7p8Q8J18j35J38n7l4l3R0O8j55jJ16
3048A04j56J89k15J34k11J25J9l1J33p9l2j8K8J4ok2k2P5n8m7J97j36Om3J0rK8Q9j73J56j6
$$ plain form
5806 -13 -13 -14 -25 8 43 78 82 -36 -46 18 -77 -17 33 39 79 42 -30 19 151 58 33 -12 -19 78 61 43 53 85 48 116 8 66 81 -9 65 33
5384 33 -8 -5 -50 -51 -53 37 67 74 66 -16 79 -178 -29 45 40 -99 53 21 48 75 70 140 45 116 53 277 109 17 -70 7 -5 57 -91 3 21
4973 21 16 31 81 207 228 -31 23 40 -48 -5 38 -100 95 -8 -67 -30 7 19 -13 -39 -87 36 -24 -51 7 41 30 94 -6 49 30 65
4597 65 -5 -11 -92 4 -33 -35 -36 -4 134 -48 -95 -29 36 -7 24 54 -20 41 57 142 1 -17 -37 -4 104 146 188 181 38 155 46 100 18 52
4198 52 10 36 -13 61 -149 69 63 31 -45 110 160 37 20 13 -69 19 14 56 -25 -58 74 -57 -42 -13 37 -46 -56 -15 2 0 104 28 178
3811 178 231 -32 -63 100 67 -11 -53 0 -57 -8 -45 -37 -4 -12 -17 22 70 12 -62 58 103 -18 -11 -49 -1 -77 -44 183 52 -78 41 56 29
3423 29 -53 -11 -14 6 -126 11 -16 -3 -217 59 80 175 -15 36 -17 -29 -30 -78 -21 -99 -11 107 -28 110 53 19 -14 76 144 -11 -12 104
3048 104 -52 137 -78 56 -155 -30 -11 -42 91 12 -20 -38 -10 4 -2 -24 -46 29 -29 -76 121 -15 -9 -52 -42 -51 -23 66 -107 49 33
2684C3m5qJ1j0NN7n1n3n9J27l4qJ45j80J10J4n0M8l0k9PP4J3q5M9o3r1K6M2q6J30m3o1J10
2285A5o3L3K2m4q6J46n1M6Mm7L6p9K9K9o9j2n6J33K4q6N0J2M1K90j49j70n0l9P4rj3j3j4K3
1886d3N8R6m7j48J0J0p4O9k0M7J50j11k1L1Q6Q7j8j60J6N3q7J89k52J15pp3M8k1m3J74j10
1522DJ9mk6j15J3k4J48j6p3jM1J5qo1N2J1O4n9PK14j83r5k9N7j02L01k2k16K1J4j44K17m5
1135b5J25J3j06l7J5K5p6Q5j8Nn3J04j42P9K2K4n8pm0J3Q8l5Nr1J16l9J0j01O1J13j7o9o3
747g4L5M1l9q6K7O6op4N1O2K5rJ4j27l0K11p1J29k09K0K0rK9R8r0l8J23p0J3o4j6J17j90P4
348d7j3J4rK2P5Rj3k8j24N8m4N1P3q0O2k0O2j32J30n8L9j00J51p0N7j25J8l0J27o6JKq0KL6
-63e0NNJ35Pn6n6j1P1r0O6l4
$$ plain form
2684 33 -12 -20 -9 -19 -14 43 -8 -61 -120 7 -27 -35 110 -70 40 54 4 52 22 -7 0 74 87 2 51 -12 -103 -77 -35 -121 9 -34 -95 15
2285 15 -48 -15 7 -37 -123 23 -28 18 22 -25 11 -68 -39 -10 -79 -91 -147 -14 10 -76 -26 -14 27 317 168 -2 -52 -91 -17 -26 -39 -52 -66 -43
1886 -43 15 111 64 -84 -74 -64 -138 -69 -89 -42 108 -3 -24 7 93 180 162 2 18 71 -16 173 -79 36 29 -44 4 -17 -60 114 4
1522 4 23 19 -7 -122 -109 -133 15 -1 -74 -75 -34 -19 -27 -88 -36 -25 39 -20 -13 201 18 -77 -106 -49 -151 150 128 -88 -67 -53 -197 20 -25
1135 -25 100 113 7 -30 -15 10 -66 19 1 6 -47 57 -85 -6 16 40 -18 -25 -65 -52 36 1 6 -85 31 -8 2 -99 -38 75 58 -11 -74
747 -74 -39 2 -37 -123 -96 -30 -36 -110 -59 3 28 19 33 -94 -124 87 16 145 -64 -44 -24 -33 -4 94 4 -34 89 19 32 -32 -48 69 -121 -47
348 -47 -60 -46 -55 -33 42 51 38 10 -114 -56 -100 -49 24 -56 6 -14 48 -84 46 -12 27 -73 78 8 65 -60 -42 -72 55 -11 -10 -8 -88 -86 -50
-63 -50 -45 -40 95 102 46 -10 -21 50 -40 26 -8
-192h
##PAGE=	F1=20205.3
##FIRST=	25164.769650603881018,	5806.207692317537294,	-0.071812391281127929688
##DATA TABLE=	(F2++(Y..Y)), PROFILE
5806b0J4L6j8j7K7J8L2l6q4Q0n7J9N7l2L0l0l3L4J11q4k2m5j2J23rl2oJ7j8Q8j42O2J1j09
5407d7J30q0M1l4o8Ok5R8K0P5Qj14N5k34J27N0J8j61K17n7O6n6K4P3r5J0J6K27k00m9j06P2
5032Gk0L8j04R9l5m6N0P3R9K4j98Lk0J9OM3j44J59q2o1P4N1%l3k5l7R0l8r7P9O6k3Q8j22M0
4621B3j9L1n9K3q4R7plq5P3J48j45n5N9N8j05L9No0N7J2J00j55J0L3J2Q8K5M7rj84J63q7N3
4222I9l7nl1K3q1L0j40J84Ml2o5J35J6q6N0n3j01Q9k0J03j25l5R9j41J10OL8q3K1k1J9L7J13
3834A20r1J34L6k65jJ78m6m5o6N6j00P4m0O5M0o2rL5K4o5m5J51Oj14J4Kk6n2N1K15j31j29
3459h6R8Qm1Oj0%N5j73J15M2L8k46K75N0P9k08Nl6L1j4p3M7m9Q7J11j58J39n6m9mO7O8j29
3071a1k9J43j15J43k17J53k45J39M8l4J14j01j2j3K2mj5K0l3P9q4pJ52r4Jl5k1j8M3R3j61
$$ plain form
5806 -20 -6 30 12 -5 22 40 72 36 -48 32 -25 -6 51 19 49 19 -14 20 131 47 25 -20 -32 91 82 50 44 61 43 131 -11 51 62 -47
5407 -47 83 3 44 10 -58 -52 -77 21 41 116 124 10 65 -169 -42 8 26 -135 82 25 91 35 59 132 37 47 63 290 90 41 -65 7
5032 7 -13 25 -79 20 -15 -61 -11 62 161 185 -13 -10 -30 -11 -5 38 -106 53 -29 -90 -16 35 35 2 -23 -60 30 -8 -105 -26 40 17 105 -17 23
4621 23 4 35 -24 -1 -85 12 5 2 -83 -10 138 -7 -62 -3 55 -50 -11 -6 -66 -9 3 103 -52 -42 -9 3 91 116 163 154 -30 133 46 99
4222 99 62 57 26 49 -32 -2 -142 42 46 14 -51 84 100 14 64 11 -90 -1 -21 82 -43 -78 21 -120 -10 -4 34 -49 -28 -49 -30 7 120
3834 120 29 163 199 -66 -67 111 65 20 -46 10 -90 -16 -56 9 49 -13 -22 13 37 -28 -73 78 84 -30 -16 -14 -40 -92 -41 174 43 -86
3459 -86 12 20 -21 -15 -25 -25 30 -143 -28 14 52 -194 81 131 210 2 7 -29 2 -12 -85 -38 -87 0 111 -47 92 36 -13 -17 50 118 -11
3071 -11 -40 103 -12 131 -86 67 -178 -39 9 -25 89 -12 -24 -37 -15 -19 -34 -14 -47 32 -52 -59 93 -1 0 -35 -56 -74 -31 62 -99
2707i9J48Om9l0PON6N6r1r1m7J02l8K5J01q5J15l4k4L6l5o7M3M3J9p2M4o1l0KJ3n1J40o1j02
2297a05J01JJm3Nn5J11k6nJ1p3P8q8R1ml4o3n0J08M4p5jK9R1L02j53j92l7k2oJ7Ql3lO5NP2
1862G2Jj19J3Jp5O1n0J17P3j45L7K9J11M7l6j40N2N3j10K18k65P1l0n4O6j0n5J85r3Nl6pp8
1475i1J3k1Q3Po0M7j9J2j0o7M9L0R7q6K8J56j74q7mL9k2J94J4k58L9N9j38K22m2R3K5j48J5
1088eK2l4m7J22o3K6p4J13j39J18J2n1l8K2j1j9L5J1K4j04J04l0N1j30K0J70q6k2r2K1R9k8
712cj16OR9J4j05N1Q6j2N0K0j87m5K06p4J59j77pK0j7j0R1m3j0M9n0N4q8L8M4j59N8m4N1M1
313a0J5M3k4l5Qj22O3p4J06J5k3M8o7N0o1R1m3M5q3Q9p0P1p1j2nJ00o4Knk2l8N8k6J6J43o
-110A02j10jj8P8n9L7m2
$$ plain form
2707 -99 49 55 6 -24 -17 -11 45 101 10 -81 -128 -26 -64 -39 62 -23 92 58 34 70 35 -32 11 54 73 1 45 -16 -46 -44 -31 -82 58 -3 -105
2297 -105 -4 -3 -2 -45 -40 -95 16 -10 -15 -4 -77 1 -87 4 0 -34 -97 -147 -39 5 -70 -71 -42 49 351 198 6 -31 -53 -59 -42 -34 -67 -70 -5 0 72
1862 72 73 -46 -33 -32 -107 -46 -96 21 94 -51 -14 15 126 173 137 -3 49 102 -8 210 -55 16 -14 -68 -2 -12 -67 118 25 30 -6 -13 -91
1475 -91 -78 -99 -16 -9 -69 -22 -41 -29 -39 -106 -57 -27 70 -16 12 168 -6 -93 -97 -58 -80 114 128 -130 -91 -32 -170 52 10 103 128 -20 -5
1088 -5 17 -17 -64 58 -5 21 -53 60 -79 39 51 0 -38 -16 -27 -46 -11 0 24 -80 24 -6 45 -85 -65 105 19 -3 -95 -74 25 -3
712 -3 -119 -113 -14 0 -105 -54 32 20 70 90 -97 -142 64 -10 149 -28 -35 -15 -32 -42 49 6 -4 45 -5 49 -39 -1 43 -116 -58 -102 -51 -10
313 -10 5 48 24 -11 -3 -125 -62 -136 -30 -15 -38 10 -57 -7 -68 23 -20 25 -58 31 -39 32 -39 -51 -56 44 -20 -18 -23 -45 -83 -25 -51 -35 108 102
-110 102 -8 -9 -27 51 -8 29 -13
-192a3
##PAGE=	F1=20154.1
##FIRST=	25164.769650603881018,	5806.207692317537294,	-0.018903970718383789063
##DATA TABLE=	(F2++(Y..Y)), PROFILE
5806ejM2nn0K1%M8L7j66Q8J7J6M6q8J4k8M9k5P0r5Pj9j7J48km6k1KrR5j65P8Oj28J87j28J24
5372I7p1r8PRP3qJ27M0j27m3j77J10L4O4j60K07o7J12j32M0O4q4l8R3K31k32nj26O7l4J0n
4996b2P0q8q8J07L0P7L3j19l3k4P0k9M4j06P8n6n7J11O4j0l3k6k6M8k5q2L5R8l7J31j25Ol7
4609b1K6m8N0q4R8K3nj69J14J57j08o2N1N1j55N8k1m5M2lJ14j70M0Q4pO8QN2j1k26K09o5N4
4222I9Qm5k1K1j13ln9J38Ml1n5J16j9n9J05o3q4L0mJ48r5p6K9p6J31l1J3p1O3q4K2P6J22j18
3823A8J08L0k56K9J93o4j8m6J6j39J04m2J23M7j17j3L2%p4j4J80l2j07K1M2j01k7N8J92j00
3470D3j00M2l3kO2o1JO7j45O3Q5P6k70K63O8P4k12m2k0P5k8r8L6j9Q4J06j80J21p4m8M6M4
3095B4O8r7n2J50kN4k62J85k69J53P8l8R6j25Rj9Mj2j2N1n5R5r9L3J08n4kk8n1k7N7R7j48
$$ plain form
5806 -5 -6 36 31 -19 2 2 50 87 -79 9 26 42 88 0 14 -14 35 10 80 -15 -8 -27 -44 104 102 56 35 37 28 123 -42 36 42 -86 101 -27 97
5372 97 26 -72 -65 -56 17 9 136 176 49 6 -171 -61 -27 37 -123 84 17 129 -3 37 101 17 -21 72 303 71 66 -60 7 -27 -17 -22
4996 -22 48 -40 -128 -21 9 86 119 0 -33 -57 13 -16 28 -78 0 -56 -113 -2 62 52 19 -7 -33 15 -10 -92 -57 41 4 135 10 16 -21
4609 -21 5 -43 7 -77 21 44 39 -130 -16 141 33 -29 22 73 -82 -24 -45 -90 -48 -51 63 -107 -67 17 10 78 86 138 127 -99 110 45 99
4222 99 107 62 41 62 -51 -54 -113 25 29 -2 -57 59 40 -19 86 23 -61 -31 -35 113 18 -58 -29 -105 26 -5 8 -63 0 -84 -62 14 136 18
3823 18 126 156 -100 -71 122 58 40 -6 10 -129 -25 -67 56 103 -14 -27 5 5 -69 -83 97 65 -42 -21 21 -80 -107 -49 143 43
3470 43 -57 -15 -48 -50 12 -49 -48 19 -126 -63 22 98 -172 91 159 233 21 -21 -41 34 6 -92 -56 -75 9 115 -65 56 -18 -66 -20 24
3095 24 92 -5 -57 93 91 145 -117 68 -201 -48 30 -8 88 -37 -28 -47 -43 -55 -67 -16 -71 24 -75 -42 66 12 10 -18 -69 -96 -39 58 -90
2707i0J28J7m2m1KK4R5M3j19j18l0Q3rKN3LJ21q3KK4k8r4P9J1J4o8M9m7L0k1j6j7J51q2j41
2297a15R1O5l2r6O6l4O4ln4P0m1OkN0m9J2j01m5Q3O5o3m1N7J10K85j34j88o9L9p2N6J1p2K0
1898f1J16n9L6L2j09L4J1p6N2p8J88Nj68Q3J6J36Qn4j22R0N4j34K48k79K8qJ3j5no1K02p7
1522D6j0o8J4m1J2j2K2OJ6P0j02Rj4p1M5L7J18r9O0J16j48q5J3J0M7Q1M4k42K3Q6j48K37k5
1135D7N9L6j90O7M5q2RR5j03N3j02J19r3J13Qj20j8N0J1n5K6J5O3r3O7M5J4j46l8K10j15O0
759E7j20QJ29m3j34mJ20K2j25O3Q7o9J19L7k01j3R7r2K01j33l2K0j5l7P4qJ7k4l1R6j11R0
383D5k2j22L7J1M3M2J1J0n7n8M8j14M1m2J00j8L1K9j16L8J1N2m0M1n7M0n2J04k6m7RO0o2N
-16b5k4K5o7R1n6K6J52k0j64N4k6Q6l4Lo
$$ plain form
2707 -90 38 55 13 -28 -26 -2 93 136 17 -101 -131 -48 -57 -55 -2 1 122 39 41 65 37 -57 22 33 47 -21 28 -19 11 -10 -26 -43 108 26 -115
2297 -115 -24 41 9 -87 -21 -55 9 6 -48 22 -19 -13 -15 35 -14 -2 -103 -148 -65 0 -63 -104 -47 63 348 214 26 -43 -4 -76 -20 -9 -81 -61
1898 -61 55 -4 32 64 -45 -11 0 -76 -24 -102 86 91 -77 6 22 158 166 112 -10 80 134 0 248 -31 -3 -11 2 -13 -18 -79 123 46
1522 46 36 -32 -18 -59 -47 -59 -37 -31 -15 55 -47 -38 -52 -123 -78 -41 77 -22 38 154 6 -79 -66 -56 -9 72 116 -126 -103 -17 -165 72 47
1135 47 106 142 -48 19 64 -18 -9 86 -17 36 -66 53 -40 73 81 -39 -57 -7 4 -51 -25 -10 53 -40 27 72 86 -60 -98 112 -3 57
759 57 -63 -55 74 31 -103 -107 13 35 -90 -27 60 -9 110 147 -54 -67 30 -62 139 6 -26 -6 -21 -58 16 8 25 1 -30 66 -45 45
383 45 23 -99 -62 -51 -8 34 45 55 -2 -60 -12 -126 -85 -127 -27 -45 -14 15 -101 -63 -52 0 -40 1 -56 -16 -68 36 10 -37 -28 32 -30 -25
-16 -25 -49 -24 -91 0 -56 -30 122 102 -62 -8 -34 52 18 21 15
-192A5
##PAGE=	F1=20103
##FIRST=	25164.769650603881018,	5806.207692317537294,	0.12657523155212402344
##DATA TABLE=	(F2++(Y..Y)), PROFILE
5806C6n8O1K7r1K9l3N0Q5j65K9P6L9L0j35kl6J21o7K4j10J8M5m8K03j8n2m3J1J2O5j93J25
5431C5or5J68j30J84j15j06l1R4K6l1J33P1r4j60j05R7K3R1j48J50n3J56j57M8K3p9q0J49
5090E8K40k15l5j06M3n9K2Q3M4j06j45J72m9O1L9k0o8NO1o3P6p7km9m8J40O6m7nk6mNk1o7
4691i7J5J15m7J58r7j4q8O1n9K7n1R7N9j0k04J13J73o0j05M8M9j96J22n3k8J3l1J11j42N2
4339f9J11k5L5J0L1j6k06K08nMO3o0k7Lj17l8J1Q3K0k5l8O3k6l6J30n1p2JOJ38k1j14l9k0
3940h8J36k4o2m0Q6q6LQ3J30j08M4J5j95O0J95j19J6j4l4j57J18j8J47L7j42m3M8Jr0K9J64
3576I2o3o2K5L6j21j6N5J45l2n5p8l9R8L8r9K4L1q2K0R8Q6k40K23J03M3j83r6OP9j1j14OR
3189g4P3J00j53N3q2J3K3N3N4p9l4J46J07m8k74J87k53J09J08m5Q7j04J5l9k8j6K3M1n9P3
$$ plain form
5806 36 -22 39 66 -25 4 -29 21 106 -59 -30 46 85 115 -20 -22 -58 63 -4 20 -90 -72 -27 -75 128 110 58 15 26 38 103 -90 35
5431 35 29 -66 102 -28 156 41 -65 -96 -2 24 -7 126 197 103 -57 -162 -65 -42 49 -99 51 -2 154 -3 45 68 -11 -91 58
5090 58 298 83 48 -58 -15 -74 -52 31 75 -31 -176 -4 -53 8 47 27 -41 -36 25 -38 38 -39 -41 -90 -138 2 68 21 16 -10 -14 -9 -30 -97
4691 -97 -82 33 -14 144 47 33 -55 6 -53 -26 -77 20 79 69 -135 -22 151 91 -14 34 83 -113 9 -44 -72 -59 -90 21 -121 -69
4339 -69 42 17 52 62 93 77 -129 79 74 78 141 81 54 57 -60 -98 -87 -4 16 -9 -47 16 -10 -46 84 33 -39 -38 -32 106 85 -29 -68 -88
3940 -88 48 24 -38 -78 8 -78 -75 8 138 30 74 89 -106 -46 149 30 46 32 -2 -159 -41 -59 88 125 -17 -60 -12 -11 -101 -72 92
3576 92 29 -33 -8 28 -93 -109 -54 91 59 4 -74 -113 -15 23 -76 -52 -21 -103 -83 15 101 -139 84 187 230 47 -49 -43 36 25 -89 -83 -74
3189 -74 -1 99 -54 -1 -83 -70 -47 6 60 -19 -53 93 200 152 -122 65 -188 -79 29 -16 71 -33 -18 -57 -85 -101 -78 -37 -96 -23
2837b3l7M7O1k5Kk5r1J7L3O6j30J23J1rl4k1N5R3M7j60r3j6P4J5n8PP7R1q2M7k0j0j00P9j1
2426@Pn2M8j0M3qm0j6J41q5j45J17P7m2j53J27l8M3jp5J21j4p3O1%o8N4j48pL7Q1o3K4RJ13
2015F5K58j28j54q1Q8q3M4j3r0M0J52r7k2P3j24K9O7q0K3m6K05m5j57Q8PJ42k4o0r4R6O6j23
1639B2K31k63j5N4M6q7k5o0K04n2j9q5K7Mj2J0j3mO5O6j22k5J2r5K9M1J26j02J04O7q5j14
1264g0N9l2P2JR9k13K2O7j57K13LM4lj42P3M7o6J1O5j22Q1j52J30l2J03m1j38K3N1J4n1M5
888Dk1R0p4M4R2l3j78n3K22j28J29j11K2J06o7j69N2J01J9r7N2N0r2J57M5j67k4L3j39K50
536A15p5n9O9p4k9L9RL1n9K4Q8j01P8m3j22Q0K5O0mK1l6l5r0M2q5M1lO5k9M8K8r6j1K8M6M
114a0k7k9K1J3J11k7p9M1J3m7No3M6m2R3o2MJ31Lj57N2l4R4l4LL7
$$ plain form
2837 -23 -60 -13 48 23 25 0 -91 -74 -41 25 -105 18 29 20 -14 -35 20 113 160 0 -93 -109 -35 -20 -78 -71 6 97 15 62 42 32 -68 11 0
2426 0 7 -45 3 -7 36 28 -12 -28 113 28 -117 0 77 35 -118 9 -29 14 13 -62 59 45 -28 33 33 -35 19 -129 -136 -99 -18 -81 -57 -48 65
2015 65 323 195 41 -40 48 -35 9 -4 -94 -54 98 1 -21 52 -72 -43 24 -56 -33 -79 126 81 -76 12 19 161 137 77 -17 79 145 22
1639 22 253 -10 -25 29 75 -12 -37 -97 107 55 36 -49 -22 -18 -30 -20 -33 -37 28 94 -28 -53 -41 -136 -107 -66 60 -42 62 129 44 -70
1264 -70 -11 -43 29 30 129 -84 -62 5 -152 61 64 108 105 -37 36 83 17 28 93 -29 52 -100 30 -2 101 60 -78 -55 -4 10 -41 4
888 4 -17 73 -1 43 135 102 -76 -129 93 -35 94 -17 5 111 44 -125 -73 28 47 -50 2 52 -40 117 162 -5 -29 4 -135 115
536 115 40 -19 50 -24 -53 -14 -5 26 -33 -9 79 -22 56 13 -109 -29 -4 56 52 73 37 2 -88 -46 -131 -90 -93 -28 -57 -9 19 -77 -88 -60 -14 -10
114 -10 -37 -66 -45 -32 79 52 -27 14 27 -20 -15 -78 -32 -74 19 -43 -39 92 95 -62 -10 -44 50 16 19 56
-192E6
##PAGE=	F1=20051.9
##FIRST=	25164.769650603881018,	5806.207692317537294,	0.27205455303192138672
##DATA TABLE=	(F2++(Y..Y)), PROFILE
5806G8j15P8O1j34N0n3Q0O9j59k5J25N1K4j71kk5J37p6j4j18J27mq4K51l4n7o5K0K9K8j64
5442i2J38k4o9J51j33K45j61j13o8J87pp7J17J08n7k32p8R2J6J18j36R9l3J55j38N1k5o2j09
5102a37J91K38j98o3q7J8n8N9J07M4j14j91J99p5O8O8pr9J5L7q6J19m8q2l0k9J49M4p1L2l7
4738b4Pk9mn2oJ34o0J87o9l4j39R5o8Kj6Q3Q5mk29J14J88k4j59N1N2j73J60q7j3j5o0J09j14
4351a12N2J27m3LNNqq3J15N3o3J03o6k0j0j15l9K5L1M2j8k0K1k4k2J43l8o1j7K8J05L0j29
3963@q4K5J29j6j40oJ10r1j6Q1J25q5j1K0j16P3J78j75N2J2r2j09J06qJ57K8j67p2O3J2r4
3600a11N0J24o9MJ8J9j29NM2Q7L5j0j80k6J74j1p2K0k0l1l3J02J04j98J72J27K3j43j51L3
3247d5Q2Pj18j4K6M9J09j16oq1J05o1O7M7p2k7J29K06j15k50J24k09N9J33n4P9q3K1m8m9l0
$$ plain form
5806 78 -37 41 102 -32 18 -35 45 114 -45 -70 55 106 130 -41 -43 -68 69 -7 -21 -139 -12 -16 -100 151 117 60 -5 15 44 72 -92
5442 -92 46 22 -47 104 -29 216 55 -58 -126 61 54 -23 94 202 145 -87 -165 -73 -57 61 -75 24 -9 146 8 59 34 -28 -137
5102 -137 54 292 94 31 -56 -38 -96 -37 70 114 0 -191 8 -67 1 69 62 -37 -22 15 -71 48 0 -82 -112 -141 8 52 -19 13 -24
4738 -24 -17 -46 -50 -102 -108 26 -34 153 84 50 -89 6 -62 -60 -76 7 92 88 -141 -27 161 137 -22 29 81 -92 68 -19 -32 -47 -107 2 -112
4351 -112 -60 67 24 27 32 37 29 -54 61 114 51 154 88 68 58 -57 -96 -71 -40 2 -16 -36 -15 -39 -61 82 44 -17 -34 -6 99 129 0
3963 0 -84 -59 70 54 -86 -92 18 -73 -89 -8 117 32 21 41 -75 -2 176 1 53 65 -27 -136 -30 -38 119 147 -20 -92 -29 -17 -111
3600 -111 -61 63 -6 -2 16 35 -94 -89 -47 40 75 65 -115 -141 33 22 -50 -30 -50 -81 -114 -12 92 -106 66 193 216 73 -78 -45
3247 -45 37 44 -74 -88 -62 -13 96 -20 -26 -107 -2 -63 4 51 -21 -48 81 287 172 -78 46 -163 -104 29 -25 54 -29 -8 -56 -105 -135
2884a35M6L1o3P6N2L4j1MNk0j32P3K0K2j23J19MK4k7m3Q7P9M0j77m7kO4L3j24nR6O7p5R2o6
2473A8K7q6O0n1%l8M8K5N9Oo7j4J31q7j50J42P7o6j05Q6l1L5J2q5J44j3j09Q1l6o8R6j95N5
2085i9J9P0q8R9k8R4K09j21j21q3J49r4L3k8r5L8J65j22p1J24j25J2J12r1j2K1J66p9j30R4
1733A8lJ48n4o7o6R0O8j11K12k35m6J04O8j47l6n7K05k7k8j01M0M1m0J6K7l7Q9O1j40n5M4
1369a9p4l2L5J20n7J02K3j5j45J05q4Q7o8J63j94RP2j45J66RL1m0k0MM8m9K2M5j45J02j56
1006a00R6K1R0p9j45N2M1K9l6O6o0J00p2M5P2m2j70q6K19r7J53r7M4Q7q6j58O3P6J0o9M3K2
630C2j04J77L4j33l4N4j02J40k3p0J36j33k2lK0L9j2M8M8j00N7Rj97J33M9O6o1M2p1J3r8l5
254a01l5Q0j4L5l4O0K1r0J7l4J07K7j16K0K0O0R9k9j10Q6k5n2j6k7qqJ05o8j7J09K7j52N2
$$ plain form
2884 -135 -89 -58 -121 -45 7 41 30 34 39 19 -113 -40 -20 2 -121 -2 2 26 -1 -44 43 122 162 -15 -62 -64 0 33 -91 -96 0 67 -8 84 18
2473 18 45 -41 19 -32 -32 -70 -22 3 62 68 1 -13 118 31 -119 23 100 34 -71 15 -16 19 31 -54 90 77 -32 49 13 -55 41 -154 -99
2085 -99 -80 -10 -98 1 -27 67 276 155 34 -49 100 6 39 11 -84 -46 119 -3 -74 50 -75 -63 49 -42 -54 -33 133 54 -76 18
1733 18 15 163 109 42 -24 66 134 23 235 0 -46 58 126 -21 -57 -114 91 64 36 -65 -25 16 -24 -8 19 -18 71 132 -8 -63 -19
1369 -19 -93 -125 -90 30 -27 75 98 83 -62 43 -41 46 -22 141 -53 -44 28 -117 49 58 89 49 29 33 81 32 54 99 -46 56 -100
1006 -100 -4 17 107 28 -117 -65 -24 5 -31 35 -25 75 3 48 120 78 -92 -178 41 -56 97 0 44 131 45 -113 -50 26 36 -33 10 32
630 32 -72 105 139 6 -28 26 -76 64 41 -29 107 -26 -48 -51 -31 8 -4 44 92 -8 49 58 -139 -6 43 109 48 90 19 32 -66 -101
254 -101 -136 -56 -70 -35 -69 -9 12 -78 -61 -95 12 39 -77 -57 -37 23 122 93 -17 69 44 -8 -24 -51 -59 -67 38 -30 -47 62 89 -63 -11
-133a1n5R2k3J4P9
$$ plain form
-133 -11 -66 26 3 17 96
-192I6
##PAGE=	F1=20000.7
##FIRST=	25164.769650603881018,	5806.207692317537294,	0.30425631999969482422
##DATA TABLE=	(F2++(Y..Y)), PROFILE
5806H8j10Q5O4j46M1j2P4jj27l7J18P1J1j69K9j9R0n8l5n0J54n3r6K52m4n5r4N0K0lj03J05
5431D0l5n7J58j25K38j63j02k9J98m2j00O4J13K4k29j16P6L3J34j49M7JJ43q0M2p9k8q8J58
5090D7K19j47j11o9om5J30Q1N0j25j99J91k7O7R0o2j09J4Kn6J18j7j11jj3J17kj06P4jk6n9
4715i2O3m4m4J45o3J65Jm9j84J18o0n4K5P3R6k9j79R0J79jj90N2O5j36J59p4l4l0n2P1r4P7
4339c0R1l8j5Nl1N1j4L6Q8j20J15n6j1j6j05l0KJ4N4lk5Oj7LJ37k5l7k9J6M9R3j34j11L5J39
3928H7j1j94L7R2q7KM5J05n7m0M3m5N7J49k20J04Nj14o1R9mJ45j5j49p7J33k0j26L8R8l7N1
3553C3J3k5p0j5J4P3J05%k06QJ34n6mrp9J6k9L8J00j41J53J20qq6j50L4N2L9j03k8K5K5J46
3165A19j09n2qJ25j23M7N8q0k0J06K67j43k20L0j43K9J48p0O3k4pl4Nk0Ol3jJ7J64qo8K7J6
$$ plain form
5806 88 -22 63 127 -19 22 10 84 83 -44 -81 37 108 119 -50 -21 -40 50 -8 -43 -93 61 8 -88 164 120 65 -29 21 41 38 -65 40
5431 40 5 -52 106 -19 219 56 -46 -75 123 81 -19 45 158 182 -47 -163 -87 -54 80 -69 -22 -21 122 42 84 5 -23 -111 47
5090 47 266 119 8 -61 -67 -112 18 99 149 24 -175 16 -11 56 146 84 -25 -11 -9 -65 53 36 -75 -76 -89 28 26 -80 -6 -7 -33 -92
4715 -92 -29 -73 -117 28 -35 130 131 82 -102 16 -44 -98 -73 0 96 67 -112 -22 157 156 -34 18 83 -53 106 32 -2 -32 -84 -13 -107 -30
4339 -30 61 23 8 13 -18 33 19 55 143 23 138 82 71 55 -50 -80 -78 -64 -10 -13 -38 -32 -49 -46 91 66 29 0 16 65 158 24 -87 -52 87
3928 87 76 -118 -81 11 -76 -74 -29 76 19 -21 22 -23 34 183 -37 67 72 -42 -103 -4 -8 137 122 -27 -104 29 9 -117 -79 19 -18 33
3553 33 46 21 -49 -64 -50 23 128 128 -78 -70 64 8 4 -5 -84 -68 -97 -59 41 -100 53 173 165 79 -71 -37 15 54 -49 -77 -52 -27 119
3165 119 10 -42 -50 75 -48 -1 57 -23 -43 63 330 187 -33 -3 -146 -117 31 -39 24 0 -7 -41 -36 -56 -50 -83 -84 -67 97 89 21 48 64
2778F4k9r5N9Nj3j27R2QM6Rm0R1K3N4j84PL1L2K9j57N5KO6o0J44j32P3o8M5o5k3k3M4M3K5
2367C1O1n4n3Q8m6j20J49K5o6m5M4k9K9L3q7J37k7j02N5m2l5R4j68P2M2J8j30J68l3L9J82
2003B30j13j23l9J86o8j6n7n6OJ55j44r0J62l4m0R8q8m6P1J08r3p7R1k8J50o0n6n4M4R3j16
1639dK07k09l6J07Q3j42q6k7J68j0m4n4M3N7p8J1Q8l5P0J5j20m5M3o8m9K3Q7PP0oL0j46J49
1252I9j27N1n9J79k01K4Q7j38J21J0ml5Q5q0M4k4MO4j21Q0j01K4O2N5j15j02L4K4M9K6L6q4
876c3Q2m6M5K4m1j30r4J75k8J17p1N7Q1j15r3M3L9j2n6O3pq8J55L5r2p9J24m1J2Rn3J83j59
489Fpk5l2O2K7O9Mj13L5P0k17J41N2O7j07M9q6N0j06q2J3R9m4M1l4L1M4o3L1j17J81P5j72
102e8J4M1N9J04l7j27J09m0n2n2L1p0M1R6r7j5R2N3j33M0o2O2k9M5R0
$$ plain form
2778 64 35 -60 -1 4 -9 -136 -44 -36 10 19 -21 70 93 147 -37 -30 1 33 62 -95 -40 -38 28 -32 112 -20 53 -15 30 -35 -58 -81 -37 6 31
2367 31 92 38 -15 73 27 -93 56 81 15 -30 14 -15 14 47 -40 97 70 -32 23 -19 -54 40 -128 -56 -14 4 -126 42 9 48 230
2003 230 117 -6 -45 141 73 57 0 -56 -50 105 -39 -129 33 -1 -41 57 -31 -77 -6 102 9 -68 23 -5 145 85 29 -25 19 112 -4
1639 -4 203 -6 -42 65 148 6 -80 -107 61 51 7 -47 -4 53 -25 -14 74 39 109 124 4 -41 2 -66 -115 -92 -5 2 72 66 96 -50 99
1252 99 -28 23 -36 143 -58 -34 53 -85 36 46 42 7 92 12 56 32 36 100 -21 59 -42 -18 44 99 -16 -118 -84 -60 -11 15 51 -33
876 -33 49 3 48 72 31 -99 -193 -18 -46 71 0 57 138 23 -70 -27 12 0 -56 7 0 -88 67 102 10 -69 55 14 26 35 -18 165 6
489 6 -1 -26 -58 4 31 100 104 -9 26 96 -121 20 72 139 32 81 -5 45 -61 -143 -130 -31 -75 -34 -68 -37 7 -56 -25 -142 39 114 -58
102 -58 -44 -3 56 160 123 -4 105 65 13 -39 -8 -78 -37 59 -38 -53 39 92 -41 -1 -63 -1 -30 15 105
-192A05
##PAGE=	F1=19949.6
##FIRST=	25164.769650603881018,	5806.207692317537294,	0.3364582061767578125
##DATA TABLE=	(F2++(Y..Y)), PROFILE
5806I7j03R1O7j58L1L1N5q1p3k8R0O9Rj57O1j3M4m1n7J9J77j08o4K08l9l8o9j2K1k4m3P2m5
5419a1m6J66j18K19j75q1K3K08p8j11K2R5Q4k16j41O0M9J51j63kM4Q6K3L8j27mq0J24K00r5
5067A44j58n0k8L1J17O3O4j23j96J72QO7J13j19j17J2l0M3L7lo5J4j0P4o0j22J33Pq6OP2m5
4691c5r1J56o7J44P0o4k28J43n0l5rO1J05n4j29N5J58L4k10N3P7j09J45m7m7l2l3K2q4J01
4339@N5l3l2J0o2J44jl7J28j87J15l6Rk0r6k6k7M2J9K0k4j0j0K7J32j2j3m1Mk5J37j20j19
3952h9L8J43oj61qP7p9K6rO5qn4O8K4L3J08k56J68jj35j3R1jJ34n8j32o9K15o4j69J5O0OJ10
3553F9Po9j2l5j4O0J70Mj93rO6m0N4n1r3K0J2J3J3p7J40J18n6m5q2J1J9O3q6m2K3JJ84j02
3154D1j05O0J23j19QN5q7j3N5L01j43j65o4p6kJ64q6M8K4m9oO8nk7j31J18o9K46l8j13L8J5
$$ plain form
5806 97 -6 85 152 -6 25 56 111 30 -43 -71 19 88 97 -60 1 -12 32 -9 -66 -47 130 22 -42 166 127 89 20 8 29 5 -38 34 -11
5419 -11 -57 109 -9 210 35 -46 -23 185 107 -4 18 113 197 -19 -160 -100 -51 100 -63 -65 -21 65 88 126 -1 -5 -85 39 239 144
5067 144 -14 -64 -92 -61 56 119 183 60 -136 36 44 111 224 105 -12 0 -30 13 50 47 -18 -4 -14 60 0 -122 11 18 -68 -62 10 -35
4691 -35 -126 30 -37 107 177 113 -115 28 -22 -57 -66 -5 100 46 -83 -28 130 164 -46 7 84 -25 120 73 26 -6 -39 -17 -101 0
4339 0 55 22 -10 0 -62 82 81 44 172 -15 100 64 73 53 -43 -69 -96 -54 -35 -15 -39 -49 -59 -32 100 88 75 34 38 13 150 30 -89
3952 -89 -51 92 86 -75 -83 -6 -85 -59 -68 -3 -11 -65 3 27 60 168 -88 80 79 -56 -69 22 21 155 97 -35 -104 111 47 -122 -107 -47 -41 69
3553 69 76 7 -5 -40 -54 6 176 180 -13 -22 44 4 58 7 -86 -66 -54 -41 -28 -105 35 153 97 52 -30 -19 0 63 -23 -65 -42 -41 143 41
3154 41 -64 -4 119 0 8 63 -24 -37 18 319 176 11 -53 -129 -131 33 -53 -5 19 -30 -36 32 27 0 -131 -13 -82 164 126 13 51 66
2778F6k6m7M9kp6o7K9k3P5N1PM8m2N6j34K6N2j5M5j72J14r1P8l4J85k11J20n1L2p9k7J0RL2
2379a3qJ16l0q1M4nj01J45k8o4K5J2k6K4N3r0J21n3r0L6om5R7j35Q8O5k1j62K28n0j8J56j05
1992G9j26OK24n4p7p5nm5J27j15n9J22P0m7L9j14j6Q4J4q7nQ8n3J52o6m4m3%J15j31J90j71
1616b3j5R1Q0j18j18MJ30Po0pM5P3j15PJ48m3L9k0q8l7M5p1p1O8K0N6K0k9Q1j03J48j65K2
1229Ao3J85k09M0J12j19P1Lk6O9N4j44M7J1j5Q3r8N9m7m6J03K1j60o2O0l8P5R6Mj08N2k9O6
841D8jn9j13k7N6N0R0o1M9R4j24m0J1J5k4m3Q4l6p4J22K6m1j11J88J5p9qJ4J90j58L0o0r7
454g4J19J0R5l3j39LJ42k26J39M2O8j51O6r0Q1j20p3K9J00r2P2j2j0N6m6L6j14J91J22k31
102d0J0O1M6R9l5j33J33n5o2j01J11j08O6O6j04RO5O7j19K2k5j4k9Q3J02
$$ plain form
2778 66 40 -7 42 40 -36 -103 -74 -97 -22 29 36 84 42 98 -36 -10 42 27 72 -100 14 -77 1 -33 152 -59 61 10 42 -37 -64 -54 -45 -13
2379 -13 -21 95 65 -16 28 23 -78 67 39 -25 0 12 -14 10 63 -27 94 41 -49 -13 -19 -64 33 -102 -14 51 30 -132 96 46 28 184 79
1992 79 -47 -41 183 129 52 -23 -28 -73 54 -61 -120 2 72 25 64 -50 -66 18 32 -55 -60 28 -25 127 61 17 -26 -26 89 -42 148 -23
1616 -23 -38 53 133 15 -103 -99 31 38 -22 -29 16 89 -26 -19 129 86 125 105 17 -20 25 -46 -117 -49 -29 27 47 18 99 -4 144 -21 1
1229 1 -62 123 -86 -46 66 -53 18 21 -5 64 118 -26 21 32 17 100 2 61 14 -32 71 92 -68 -130 -70 -108 -33 63 67 -41 11 -18 48
841 48 47 -12 -125 -152 -96 -46 44 -17 32 126 2 -38 -27 -12 -36 -79 5 -31 -105 17 43 2 -109 79 94 15 7 21 211 53 83 23 -74
454 -74 45 55 150 117 -22 -19 123 -103 36 78 146 -5 61 -29 52 -68 -141 -112 -12 -104 -32 -44 -54 2 -44 -8 -122 69 191 -40
102 -40 -30 31 77 176 141 8 141 86 24 -77 34 -74 -8 58 -46 -37 28 95 -24 -2 -27 -41 -70 13 115
-192A15
##PAGE=	F1=19898.5
##FIRST=	25164.769650603881018,	5806.207692317537294,	0.25010442733764648438
##DATA TABLE=	(F2++(Y..Y)), PROFILE
5806G2o3J18L5j31j2P0Nj31Kj3L2P2Nj29Q7j9Mk2j0nJ88j12k9J31j0l3k1r6J9k3qK7n4l2J92
5395A06j06J68j65k4L9K14j01j32M6M2R9k28j09O8M8J29j71Q3oRJ21K6j55J1p8R7J88p6j36
5055Gl9o6Q9R3L7R0j27j65J20J6O0J50j53j14M2m7J11n9nj4L6k9Q0j30q8J68Nj19N6K8m5j06
4679a18J31m7J12J38j06k10J34l0k3l4O4Q6r4n4K4J13M8j41pQ7p9J00j9m2l8J3j7r3J14J0
4327B2k6k7L1k8J70l0r0J37k00O3j0N0j9p9j5o7O1j2O2k9j4mM7J20j3K0n8j2j16J86j09r7
3952h6K6J44l5o4o9P3nl5n1P0m1MQ7M4LN2j77J62m7j14K8N8mJ32j15r9k4K45p3k07l6Q4K7
3564d3J32K7j08K3n5m6Q7J43L7j67k2oL4L7r8p7K0N8M6p0r1J70R3j13J5k8J8LP7j14l9L9n0
3177f8K26j21r5N5J00n8RL2r8l8K9K72r1j02n3j17j4J51m4M4j5j4l6J19K3m0k07K00j03K41
$$ plain form
5806 72 9 127 162 31 19 89 94 -37 -35 -48 -16 56 61 -68 19 0 4 -18 -28 -33 155 43 14 145 135 102 81 -15 4 -19 -27 0 -54 -86 106
5395 106 0 168 3 -21 18 232 131 -1 45 87 186 -42 -151 -83 -35 94 -77 6 0 9 130 156 1 12 -66 31 219 143 7
5055 7 -32 -98 -9 84 121 211 84 -81 39 55 115 265 112 -2 40 -7 104 45 40 26 62 33 113 -17 -105 63 68 -51 5 33 -12 -118
4679 -118 13 -34 78 216 110 -100 34 4 -19 -53 11 97 3 -51 -27 86 134 -7 -14 73 -6 94 75 33 -5 8 -9 -102 12 22
4327 22 -4 -31 0 -28 142 112 22 159 -41 22 12 62 43 -36 -51 -118 -57 -69 -7 -36 -50 -54 -7 113 100 120 62 50 -66 120 11 -86
3952 -86 -60 84 49 -15 -84 -11 -16 -51 -102 -32 -73 -69 18 62 65 117 -60 102 55 -59 -31 27 23 155 40 -59 -83 162 89 -118 -154 -70 -43
3564 -43 89 116 8 31 -24 -70 17 160 197 30 8 2 36 73 -25 -102 -82 -24 22 -48 -139 31 124 11 26 -2 16 19 96 -18 -57 -18 -68
3177 -68 158 37 -58 -3 97 39 48 80 -18 -56 -27 245 154 52 -1 -118 -132 19 -25 19 4 -10 -46 73 96 56 -151 49 -54 187
2825A87n5j30K3J3k5K1K4lj14Rj6o8M8R9M9K0r2M0m2LN0l8O1j72J45j51J38nJ47k59J27k2
2449A2N4q0m5L0Jk2o1K04j9p9j0N2j10J37o4q4Q7Kj0N0K2o7O8o8n3kM6o7R0r6J01P2m3j63
2050a15K20n0o5J39n9q1l4K52l4j40q1L5r0R1q0M3NJ64n0k5j17L4L5m0o0M6J26r8J19l8j9
1686C3n2m1J28j42J64j41M0P2L7q5j26K6R9j8l5K3O6O6j51L4J69m4mn8mm9K6o9o9J06j9N5
1311C7l0k8J00m2J23j91Nj4J29k25O8J39j00L5qOJ29l2j77P4L5l7J20r9N3Or4J22k0j88l8
947a42J32j11O7J64j5j42Lj1J12J6j11j12M5o6J46L5o0L6R3r4k9j5M7k2p7J04l1p6Q9J3J1
583aj06J91N6j17l8Q4J55j30P3r1j59J56qQ8j8j50m6J73k02J19N2M7j71P4o8M2r7k4K7P4j25
219a40J42j4p2Q0Pk1l8J56J16k28PN1N3P9n4j15J27m6p3j43J81r9M2M1j09P0L4O0r6J5Mr0
$$ plain form
2825 187 132 2 25 38 13 34 58 55 -59 -50 -66 -134 -86 13 62 82 -10 30 -12 -9 41 3 64 -108 37 -114 24 19 166 -93 34 12
2449 12 66 -14 -59 -29 -28 -50 -111 93 74 -5 -15 37 -73 64 0 -84 3 5 -5 45 67 0 68 0 -53 -55 -9 -76 14 -82 19 91 48 -115
2050 -115 105 55 -10 129 70 -11 -45 207 173 33 -48 -13 -103 -12 -92 -49 -44 120 70 45 -72 -38 -3 -43 -103 -57 69 -29 90 52 33
1686 33 -19 -60 68 -74 90 -51 -11 61 98 13 -113 -87 12 -6 -41 -18 48 114 -37 -3 166 122 118 60 56 7 33 -36 -105 1 -18 37
1311 37 7 -21 79 37 160 -31 -26 -40 89 -136 -68 71 -29 6 -2 4 133 101 -76 -2 33 -4 116 17 70 76 -18 104 84 -104 -142
947 -142 -10 -121 -54 110 95 -47 -44 -55 57 73 -38 -150 -105 -171 -25 10 -50 -14 79 -15 -44 -59 -12 -34 -111 -7 -38 -114 -25 -12 -1
583 -1 -107 84 140 23 -15 69 224 94 167 76 -83 73 65 153 135 -15 -61 112 -90 29 81 128 -43 31 -37 5 -92 -116 -89 -15 -140
219 -140 2 -12 -84 -4 3 -18 -56 100 216 -12 -5 46 99 178 124 9 136 90 17 -126 55 -44 -2 39 -70 0 34 94 -2 13 17 -73
-156g3jO7O3
$$ plain form
-156 -73 -74 -7 56
-192E6
##PAGE=	F1=19847.4
##FIRST=	25164.769650603881018,	5806.207692317537294,	0.16375076770782470703
##DATA TABLE=	(F2++(Y..Y)), PROFILE
5806D7l3J33J3r2p3R0k7j62P8Kk8P6Kj02J07k9Qm9K4m1K06j10QN4K9j6Pj99M4%j7K9n8j4K14
5395A21j02P4j10J6L8K13j34j28R6J2M5k29o5J20MJ11j72J69n6o8K16Lj91K5p8Q7J94j02o8
5055D1l6j10J20M5J8J24j14j13M9MN3J87j79j03Q8m7J35j11k4K2N0n6J04j82n8J98j5p9K6
4715C7pl2j08R6m0P3J99j41j85J18j5Nl9N5N6j34K0K2R6Ol9p2R1o1M4Rl6l3P1n6j02J28l6
4327a0k1k1N2OJ85p2j34J50j68l4K2R5k9p3M1o5J0k4R5l7l1qO5J10k1M3o1j5o3J08j00p7%
3940h2J36o3L0j16P8N8j06j7J47j25RQ5L9k0Kn5J12q8q6N8J3NJ42j71o7QK64o9k35m6J49m
3564a5J01N9j37N9p5r0J04J08O3j28k2k1P3Qj56lj5Q5O1m9k10K08P5j13M0K1K1j4R1j30k5
3200b6M2j11K67j38r7L8Q8J5J0J0j15p1L6J90k8k8J4j91l3J33QN4o7Rp6J59N3n1k09K08j40
$$ plain form
5806 47 14 147 160 68 -5 85 58 -104 -26 -24 -52 24 26 -76 31 2 10 -39 -15 -56 150 40 48 102 131 115 122 -77 -33 -33 -50 -21 -79 -93 121
5395 121 19 93 -17 -1 37 250 116 -12 84 96 141 -88 -153 -33 -29 82 -90 79 23 -45 171 174 -17 8 -70 17 211 109 41
5055 41 5 -105 15 60 78 202 88 -25 24 28 81 268 89 -14 74 27 162 51 27 49 99 43 147 -35 -93 105 90 11 37
4715 37 30 -2 -110 -14 -54 19 218 77 -108 10 -5 0 -39 16 72 -62 -42 -20 76 82 43 -29 62 1 45 54 18 -15 56 0 -102 26 -10
4327 -10 -31 -52 0 6 191 119 -15 135 -33 -67 -45 50 21 -52 -11 -76 -66 -90 5 -32 -63 -71 -6 104 83 126 65 50 -13 95 -5 -82 -82
3940 -82 54 -9 21 -95 -17 41 -65 -82 65 -60 -51 34 73 53 55 0 112 24 -62 -4 9 14 156 -15 -82 -74 190 121 -114 -160 -11 -15
3564 -15 86 145 8 67 -8 -98 6 114 177 49 27 6 79 87 -69 -72 -87 -2 59 10 -200 8 83 -30 10 31 52 38 129 -1 -26
3200 -26 16 -95 172 34 -63 -25 63 78 88 98 -17 -88 -52 138 110 82 96 -95 -128 5 13 67 0 9 -67 92 145 94 -115 93 -47
2837d7K35o1j35QRk2Q9klj52Q2j7p1k1J06Q9pj44K8L7l3N0o1Q3j68J69j27J65pJ07l05J32
2461FRP5q2o2N1j4q2L0J65j7q3k2O5j12J35q5q6R5K2KP0rm5K7p0nk7L5o3P8o4J15P9o6j62
2050i7K00o2r0J46j4l6r5K57rj97m1K9j23O5oR5p3K07n1r0p0M5j4ko7O2J63j43P5k2Jo6k5
1663d8J06j59J33j17Q8J01n4m5j28N9Q1m5rM0P7O0j89O2J91m7m6q4R2p3oo6o7J44n7M3q7M6
1287dM6J6R5j93RM2Q1k60P8J66q2Oj4O2J21j01j95J11P2p1J46r8M5O0j43J42o0j92J0J57j38
923h6J7J89j5j58m6PJ59L2j53j01R9n4J07ko9J3R2o4j7m0J03Oj35R7j4o7M8nK9m4J59O1j35
536A3n1J44J08j02J17j12k08J80l6R1Rj61r5J93j90J00O2L7j80Q1m5Mp5L1L1J4j03J97l6j31
184a13J02O2p9L7J21J12k28NM3M8M7o2q5J16m3r3j05J71q0K3K2j15J31KN5p5RM6j56J6L8K6
$$ plain form
2837 -47 188 127 -8 0 9 -13 76 74 71 -81 1 -16 -87 -108 -2 87 80 -64 -36 1 -32 18 -43 40 -128 41 -86 79 72 179 -126 6
2461 6 15 90 8 -54 -3 -17 -99 -69 96 79 -4 -26 39 -73 62 -23 -109 -14 8 10 80 71 26 53 -17 -22 -49 -14 -77 1 -63 52 131 65 -97
2050 -97 103 41 -49 97 83 47 -48 209 200 3 -38 -9 -132 -67 -73 22 -51 156 105 15 -55 -10 -24 -26 -93 -31 132 -11 64 42 43 -23 -48
1663 -48 58 -101 32 -85 3 104 50 5 -123 -64 17 -28 -37 3 80 140 -49 13 204 157 111 27 119 46 40 -26 -93 51 -6 37 -50 -4
1287 -4 42 58 153 -40 -31 11 92 -168 -90 76 -6 0 -14 48 169 68 -127 -16 56 -15 131 33 78 138 -5 137 77 -115 -105 52 -86
923 -86 -69 120 105 -53 -99 -92 67 99 -54 -155 -56 -110 -3 -5 -74 -61 31 -33 -50 -90 13 19 -116 -19 -33 -100 -52 -57 -28 -72 87 148 13
536 13 -38 106 214 112 229 117 -91 89 53 144 153 -8 -103 90 -100 0 62 99 -81 0 -45 -41 -116 -85 -54 -40 -143 54 18 -113
184 -113 -11 51 -28 9 130 242 14 19 62 110 157 95 10 126 83 -10 -115 56 -24 -1 21 -94 37 39 94 19 28 74 -82 -66 -28 -2
-192b
##PAGE=	F1=19796.2
##FIRST=	25164.769650603881018,	5806.207692317537294,	0.098915696144104003906
##DATA TABLE=	(F2++(Y..Y)), PROFILE
5806B8l3J47mn6o9K0m7l9M0Lq0P1K2q0Q8%%q0L9o9J96p4L8l1R6l3K0k36J4O9l8P6n4k1J93
5395A16p7l7k%K3K07j40j50J50K1l9j17j11J44k7R9j41J72n3n5J84j4k09Pl3O2K13j35j0l3
5043A5j21Q7K6j5J61r4p0Ql8Q3J74j69p8Q5nJ37j30m9M1K8o2J31j84m7J94m4k3nm4rj14M8
4668h3j9O3K30j89j34Q9kL2k9K1N8j60O9L9J43q6ko6N2n1J3Qk6j5J18o2j38J25j1p9j0Q7J1
4280dJ85q6j53J32r5o7K3Q1m3m5O4m1m0K7J00o3p4J9N4Q6j8P5r2K9j3L3q1n8l1J18l6M8j35
3893a01R0Q6j67J5K11j30o2Q5K6k8j6K6O9r2q0P8n6L7J56k12j7M3K08l8k42j4J66k7M8R7j59
3529@P0o4q1N4O0J00j06J5RN7n2j10L0k9L7R2m5k08J65N9o0K7K9M0k6R4j50%K5j43K81j69
3154Ap5L0M4J20K5m2j01j16Q5O9J9N7O3k43m0R5N9O0j06J5j07J89P4m6k12J98j47J84o1j20
$$ plain form
5806 28 -5 142 138 82 13 33 -14 -53 -13 -10 -90 -19 3 -77 11 11 11 -69 -30 -99 97 23 61 30 126 93 113 -123 -109 -40 -78 -2 -56 -77 116
5395 116 39 2 0 0 23 230 90 -60 90 111 72 -45 -156 -12 -39 60 -81 91 38 -17 167 153 -56 -49 -82 -20 193 58 48 15
5043 15 -106 -19 7 -8 153 59 -11 -3 -41 42 216 47 -31 54 49 186 56 7 48 76 14 145 -39 -86 108 64 41 36 -8 -17 -131 -83
4668 -83 -102 -39 191 2 -132 -43 -45 -13 -42 -21 37 -123 -54 -15 128 42 40 -26 26 -25 -12 -4 -30 -45 73 11 -127 -2 -13 -92 -102 -15 -4
4280 -4 181 95 -58 74 -21 -88 -65 16 -27 -72 -8 -49 -89 -62 38 -25 -99 -80 -26 60 42 117 25 54 41 74 -7 -65 -96 22 -14 34 -101
3893 -101 -11 75 -92 -77 134 4 -58 27 53 25 9 35 104 12 -68 10 -46 -9 147 -65 -82 -39 169 131 -111 -125 41 14 62 159 0
3529 0 70 6 -75 -21 39 139 33 48 57 114 62 -48 -18 -47 -10 82 37 -171 -6 53 -7 20 49 89 63 157 7 7 32 -111 170 1
3154 1 -74 -44 0 120 145 103 2 -114 -29 40 59 116 179 -64 -104 -9 50 110 4 19 -88 101 175 129 -83 115 -32 152 91 -29
2801b9Rj0J0J07k2j2j22J04ln4l5L9J01lj32j2R4r5L5k1O5j33J41n3J44J8M9k81P1M7R2o6
2426D3o9N0j8j24J50Q5n6m7k1O2j29J40q0m8K8L2K9R9n6j8L6q4Pk8J6m9N0l3J04Q7p2j83J55
2038E8n0o7J54J4Kj41K32Kk22J5Rj30J27n0J45j09J91o2j39kM3n7R3j10N4J97j71L1oJ9q5
1675a5j6R2j25R1j18J26J20j25m8r6P7J06r0K1%J09N0k23J11J87o0p9n8J42p7n4o1m3J41o8
1322A7J5j02J34m0O3O2j99L3Q6P2k33J5J88o0m9j0R9P8j44r5P7P7o8J42j15O6R1j80J61r5
970H6j84P8J31j55l8J86J5j49l7m3J80L9r1j45J21l5O2m0m6O6Jk2o2M5R9K4j53M9K1q3K7%
595e3K2kJ14N6j18o4J72N3m3J30j30k27J61l3P9M9j31j31J43j39O7P3J5j64Q0j8o3JM4K6k9
231f0l7K14o3j79J20Q5j10R1R9P4j90MK2M5J0q9k3R2Jj57k7J01m8OJ7o3J31n4O6l1J2M8j85
$$ plain form
2801 -29 -20 -30 -20 87 65 53 -69 35 32 -22 -57 -18 83 80 -52 -64 30 -65 -30 -51 14 -119 22 -31 113 131 180 -101 -30 17 109 43
2426 43 -26 24 6 -118 32 117 61 14 -7 55 -74 66 -14 -62 -34 -2 27 126 70 52 88 4 11 -17 -1 -50 0 -33 71 158 86 -97 58
2038 58 8 -59 95 109 111 -30 202 204 -18 -3 6 -124 3 -47 98 -11 180 118 -21 -23 20 -37 56 -54 0 197 26 57 51 70 -15
1675 -15 -31 61 -64 27 -91 35 155 30 -18 -114 -37 69 -21 0 0 109 159 -64 47 234 174 95 37 179 102 48 -13 -56 85 17
1322 17 32 -70 64 24 87 149 -50 -17 69 141 -92 -77 111 51 2 -8 91 169 25 -70 7 84 16 158 43 109 200 20 181 86
970 86 -98 -20 111 -44 -82 104 119 -30 -67 -110 70 109 18 -127 -6 -41 21 -19 -65 1 2 -20 -82 -37 62 86 -67 -18 3 -80 -53 -53
595 -53 -31 -33 81 137 19 -45 127 180 137 267 137 -90 71 38 117 166 35 -96 47 -92 -25 48 63 -101 -21 -39 -102 -101 -57 -31 -60
231 -60 -97 117 54 -125 -5 80 -30 61 160 234 44 48 70 115 125 36 13 105 106 -51 -78 23 -25 -19 -2 -65 66 12 78 47 59 107 -78
-156g8jM6k7
$$ plain form
-156 -78 -79 -33 -60
-192f0
##PAGE=	F1=19745.1
##FIRST=	25164.769650603881018,	5806.207692317537294,	0.11203491687774658203
##DATA TABLE=	(F2++(Y..Y)), PROFILE
5806C2n6J38k1k0o3n0p8P8K2K0j30O5M4o0P2K6J7q7k7r0J88l6O8j15J57n7J1j45o9Q5lR0o3
5419e7m2J92l4j47J06k6nK11j35j89J84L8j15nj59J69n6R6r8J64o1n0J45k5k19%K3K7K21j67
5067a4M6k9j34O6K0o2J89p4k7k4o8J04J48j47m2N6J1J64j22r2M0Po7J65j80l5J89q0K6l0p4
4703g0J5j20mmR5K19k20o6M6JN8j7rO7j42P3N6J91j34rn5K0m2k0Qj6rJ56n7j62J20J4j35J
4304a51J10NJ85j00j55J29m6l6kM3n9j4P5l0p6Q8J05q9j18M8L6N8J7N1r9R5qLo8m6o8R8L2
3916A3K2j47J07J15k30L0K55j27j25Q7J0j7j9M9O2r0o9R9j26O7J72k53L3O7J41Nk39PJ72n0
3564B1nJ34j81R3m1p2KKJ24p2O4K1K0q0l4N0n3l1J04l3j98J32N6qJ5L6N9m9Q7j63L0j5j09
3177i4K68k27l2M4k2K02M1r4p6j50J51l1L6J12J11k95l6O9R9N5j42K1p3J31J05l1k17J89j42
$$ plain form
5806 32 -24 114 93 73 10 -40 -118 -40 -18 2 -128 -63 -19 -79 -7 19 36 -51 -78 -168 20 -16 52 -63 94 37 48 -97 -166 -81 -84 6 -57
5419 -57 -99 93 59 -88 18 -8 -13 198 63 -126 58 96 -19 -24 -183 -14 -70 26 -72 92 31 -19 126 101 -118 -118 -95 -68 153 -14
5067 -14 32 3 -131 -65 -45 -107 82 8 -19 -43 -111 -7 141 -6 -48 8 19 183 61 -31 9 16 -51 114 -66 -101 88 8 34 4 -70
4703 -70 -55 -175 -179 -183 -88 131 -89 -155 -109 -108 -50 -67 -76 -9 -151 -78 -22 169 35 26 -29 -9 -51 -71 -63 -79 -88 68 11 -151 -31 -17 -152 -151
4304 -151 -41 -36 149 49 -106 23 -23 -59 -61 -18 -77 -91 -16 -46 -122 -34 71 -18 -136 -88 -52 6 23 74 -25 70 62 65 -3 -49 -117 -19 13
3916 13 35 -112 -5 110 -120 -90 165 38 -87 0 10 -7 -26 23 85 -5 -74 25 -101 -34 138 -115 -82 -15 126 131 -108 -101 71 21
3564 21 16 150 -31 62 21 -51 -49 -47 77 5 69 90 110 30 -4 46 -7 -38 66 33 -165 -33 23 15 30 66 125 76 163 0 30 15 -94
3177 -94 174 -53 -85 -41 -63 139 180 86 10 -140 11 -20 16 128 239 -56 -92 -23 76 131 -11 10 -63 68 173 142 -75 114 -28
2837b8J43o0j04Rk9L1J13m6k7l5R1jn3m1j9J13%r0k5R5j25L9L9j6p2R6KJ18L5Mk43N4M1J02
2438A11n6p5N1Mj38K03K6j01j5k8N1j27J65p6rn8K2N6J30q6K8M5r8Mm9N4o8K6MQ3Q3q5k12
2050a35J24k4JJ15K9K8j88K08L2k31P2rj49J78j03J89j38J82q1j96P6M9j02J89j43N9K19k09
1722D2j4RL8j04j5P0o7P4j03Q8J65j74o2p5R5J32j35N2m9J33M0k57J53J76o5j03J5J47p5r8
1369C3o4k7J38q0KqJ21p8L6M6k03O0J29O2k06m8K11l7j04qJ16J4j26k6M9Q7o4J39j40P9J22
1006B25k17J79j30j68J53R8j80r3J84N3j35lp2J65Pkj62J23l4L5o0k2J20r1K1j07J29P5K4
665A15j52K0M5j10J6J7lK0O3M1p2n1J73l0RJ37j15k12J31m1N1P4p2j43R4q8K1P3Mj37P2Nq5
278a30L2M5Po3L5K44p9k29J39R6j52J45P8L6j52J3J4M1k7j26K8P7N6k33M2M3oj1J2j1J32j11
$$ plain form
2837 -28 115 55 -49 -40 -69 -38 75 29 2 -33 58 57 4 -37 -56 57 57 -33 -58 37 -88 -49 -10 -26 -98 -2 0 118 153 157 -86 -32 9 111
2438 111 55 -20 31 35 -103 100 126 25 10 -18 33 -94 71 -5 -14 -72 -50 6 136 50 78 123 25 29 -20 34 -34 -8 -4 79 162 77 -135
2050 -135 -11 -35 -34 81 110 138 -50 158 190 -41 31 22 -127 51 -52 137 -1 181 100 -96 -20 29 -73 116 -27 32 251 42
1722 42 28 37 75 -29 -44 26 -41 33 -70 18 183 9 -53 -128 -33 99 -36 16 -33 100 140 -117 36 212 147 44 59 206 131 33
1369 33 -31 -58 80 0 2 -6 115 37 73 119 -84 -24 105 167 -39 -87 124 87 -17 -25 91 105 -21 -47 2 89 25 164 24 103 225
1006 225 8 187 57 -111 42 140 -40 -133 51 104 -31 -34 -106 59 66 64 -98 25 -9 26 -34 -56 64 -27 -6 -113 16 91 115
665 115 -37 -17 28 -82 -66 -49 -52 -32 31 72 0 -51 122 92 101 238 123 -89 42 1 52 126 54 -89 5 -83 -62 11 15 -122 -50 -45 -130
278 -130 -98 -53 -46 -109 -74 170 91 -138 1 97 -55 90 168 204 52 65 79 120 93 -33 -5 72 128 -105 -63 -20 -26 -37 -25 -36 96 -15
-98a5P6J5J4M9k13j8N4p9
$$ plain form
-98 -15 61 76 90 139 -74 -92 -38 -117
-192a17
##PAGE=	F1=19694
##FIRST=	25164.769650603881018,	5806.207692317537294,	0.10728967189788818359
##DATA TABLE=	(F2++(Y..Y)), PROFILE
5806C1n9J05k4j2m3o8q7R7J6K6j37P3O2n8P6N2J1p9j06p1J67k9R9j74J83o1m6l3r9P0M4P9
5431En4r6K15m1j45J18m0RJ98j16k05J55L9j31N9j85J72o9J37q8J14l6l7Q2k2k03L4L3j1K13
5078A04j85Q7k3j45M5L5j31K25m7j3l7l8Q7R7j12k2K3J2K09j05j20J5m0n0J76j54K2J45j22
4738f2P3o8n4Qr9K8n5J02J85j85n3J4k0P5j0j7Q9j08N1Q0K00j23p2k7jl8k6%j1J3J62m7j52
4351a48P1N5j27k2J00nJ74r6j22J04j2j8l2K8q4K2Q0k5q2J00J39j15j32O4j0L9R7j4j27J81
3999H3m0j3l7l8q1P0P3rj14R6J06k23L4K44r5j77J00l0J8k9L4P5o4p7J13r5K7J62k34K1J06
3635FN5K9j90lJ76m9m9J26j58J03l1m6j0l2R2n3R5K7Mj06M9O5q5q1R9o0j52J52K2OL1N2P5
3247A59r7P0j37M2o0l0K17k64j0Q1k8K03L7j28n4j58J73l9NJ25J34l03lN0R3M9j40ok1O4J06
$$ plain form
5806 31 -28 77 53 41 -2 -70 -157 -60 -44 -18 -155 -82 -20 -78 -2 50 61 -18 -124 -195 -28 -57 42 -132 51 -10 -56 -89 -188 -118 -74 5
5431 5 -49 -145 70 29 -116 2 -38 -29 169 53 -152 3 42 -89 -30 -215 -43 -112 25 -63 51 15 -22 60 38 -165 -131 -98 -109 104
5078 104 -81 6 -17 -162 -117 -82 -213 12 -35 -48 -85 -123 -36 61 -51 -73 -50 -38 171 66 -54 -39 -79 -129 47 -107 -85 60 -62
4738 -62 11 -57 -111 -103 -202 -174 -229 -127 58 -127 -180 -166 -186 -111 -121 -138 -49 -157 -106 -26 174 51 -21 -48 -49 -87 -113 -113 -124 -111 51 4 -148
4351 -148 -77 -22 -149 -171 -71 -76 98 2 -120 -16 -28 -46 -78 -50 -134 -112 -32 -57 -139 -39 100 -15 -147 -83 -93 -54 43 29 -98 83
3999 83 43 30 -7 -45 -126 -56 17 8 -106 -10 96 -127 -93 151 56 -121 -21 -51 -33 -62 -28 47 -17 -94 19 -76 -49 113 -121 -100 6
3635 6 61 90 -100 -103 73 24 -25 101 -57 46 15 -31 -41 -73 19 -34 61 88 92 -14 35 100 15 -66 33 -27 -179 -27 -5 1 32 84 159
3247 159 62 132 -5 37 -23 -53 164 -100 -110 -29 -57 146 183 55 1 -157 16 -23 -18 107 241 -62 -65 -15 78 127 -13 -19 -40 24 130
2884A30%k11J65r5Q5m8q1K6n6N9N9m2n2Q3M5k3l7m5l5Q3L3o1k9R0j20N4N3q5k1L9M2Q9N9m7
2484A06j90J10j1P4k4o6L7Rr6J93mj50J8l3K0p3J52r0L6k1r3O5J50q9O1Q5j18k4o0Q1r6K5
2109a6L8O7O6j01j30N1P7m6Q4NM8j66J25N4j93P0J1j91K32j38J99j46J74j17j72P8N8o5J90
1768A46j64Q3K03k27j4k5N3q9k7N6l8R5r1K0J95j44j13k3Q7J32j47O8r8J45L6k50J43J67p3
1428A06o6O8J16p8j23n6j1P8l5LM8J03o0m7P0j85M8J32Q1k02n3J80Pj31mQ1m9l1k2L9P1l6
1053D2J14j49R9J18k21J88j76j10J81N7j92p1J18Q1r8K3q8J35k2P9j72Q1Lnn2J8J22j18L4
712A9j53K18M1J4j66K8L9j27L4%MlM2J9k8oR7o2P5J05j01j49Q6l3J5O1k0r5M0m7M5j6kj14
313a40P4K1m7%K1lm1N0K52n7k48J26O5j38J56P3Qj12J1K2j0rj58O3O3J09l12Q3L6K4m6L2K4
$$ plain form
2884 130 130 -81 84 -11 74 26 -55 -29 -85 -26 33 -9 -61 22 67 44 7 -38 -73 10 43 -18 -47 43 -77 -23 30 -55 -76 -37 5 94 153 106
2484 106 -84 26 15 89 65 -1 36 45 -51 142 138 -12 6 -27 -7 -80 72 -18 18 -3 -96 -31 119 30 91 176 58 34 -26 55 -41 -16
2109 -16 22 89 155 54 -76 -25 52 6 90 95 143 -23 102 156 -37 33 44 -147 85 -53 146 0 174 57 -115 -37 21 -44 146
1768 146 -18 65 268 41 27 2 55 -34 -61 -5 -43 52 -39 -19 176 32 -81 -104 -17 115 -32 36 -62 83 119 -131 12 179 106
1428 106 40 108 224 146 23 -33 -44 34 -1 2 50 153 93 46 116 -69 -21 111 192 -10 -63 117 124 -7 -11 70 21 -10 -32 7 78 42
1053 42 156 7 106 224 3 191 15 -95 86 143 -49 -120 -2 79 -19 4 -84 51 29 108 -64 17 20 15 -37 -19 103 -15 19
712 19 -134 84 125 139 -27 1 40 -87 -53 -53 -49 -52 -10 9 -19 -25 72 10 85 190 89 -60 26 -7 8 69 49 -46 -6 -53 -8 -24 -26 -140
313 -140 -66 -45 -92 -92 -71 -74 -115 -65 187 130 -118 8 73 -65 91 164 172 60 71 93 83 74 -84 -21 42 151 -161 -78 -42 -18 -64 -32 -8
-74hJ13j52P9M8J3M2j99k9P9n6
$$ plain form
-74 -8 105 -47 32 80 93 135 -64 -93 -14 -70
-192g0
##PAGE=	F1=19642.8
##FIRST=	25164.769650603881018,	5806.207692317537294,	0.10254442691802978516
##DATA TABLE=	(F2++(Y..Y)), PROFILE
5806B9o1P2k1Kl5kj00K5K6M9j36R0P8n5Q5Q7lp7j64k8J35l1J21j51J37m8p6J7p9J6Q9O6l8
5419A9j43K38m7j50J22l2M4J88r9k21J23J4p9M8j94J84p0J69q6O4j0l2J3J6j47N1K8o1J92
5078A42j59Q3j4j48L9O1p1J18k7mm3KO9M6p7lj7LK57q9j47j2p1j6J72j43Q5J09j81J07q4j0
4703b3jp6P4r1P3J16r0o9k1m4R3kk6J09p3L1Q0J87r8j21Kk1k5k6JJJ1J46k9j34J3Q7j03k9
4304g8P5l0J63r2q1Q3Jk2m6K7j00O5P6k9r1J02J81j35j44P9m7K7J77p8j71K53q1l5%k3r3M2
3928b5J06m7q1Q3J07k09K3K17n5k21J12p1N5l9J7R1m8r2J43n1j9J44k22KJ51k6J6q8l5J60
3576I8l4p9J12j43J06k8nmk0J4o4J00M5jj44J22R0j05j31R3q7j07J79nJ6L8N7P9j44N2j00
3212@O6j04M8J81k85j4R1l3K03L3j63j4j48J39j5l2J33J56l09M1M1P6L2j38l4L2kR4K0j93
$$ plain form
5806 29 -32 40 19 21 -14 -16 -116 -91 -65 -16 -152 -62 16 -39 46 133 130 53 -111 -139 -4 -35 86 -65 72 24 -52 -35 -114 -98 -9 57 19
5419 19 -124 114 67 -83 39 7 51 239 140 -81 42 56 -23 25 -169 15 -55 114 28 92 82 50 63 79 -68 -17 11 -50 142
5078 142 -17 66 52 -96 -57 4 -67 51 24 20 -23 -21 48 94 17 14 -3 0 257 168 21 9 -62 -78 94 -49 36 145 -36 71 -13 -23
4703 -23 -24 -100 -26 -117 -44 72 -18 -87 -108 -152 -59 -61 -87 22 -51 -20 60 247 149 28 30 9 -16 -42 -41 -40 -29 117 88 -46 -33 54 -49 -78
4304 -78 -3 -33 130 38 -43 40 41 19 -27 0 -100 -35 41 12 -79 23 204 69 -75 4 -43 -16 161 83 -88 165 84 49 49 26 -67 -25
3928 -25 81 34 -47 36 143 -66 -43 174 119 -102 10 -61 -6 -45 -28 63 15 -77 66 15 -4 140 -82 -80 71 45 61 -27 -62 98
3576 98 64 -15 97 -46 60 32 27 23 3 17 -47 53 98 97 -47 75 165 60 -71 22 -65 -172 7 2 18 56 113 192 48 100 0
3212 0 66 -38 10 191 -94 -108 -17 -50 153 186 23 9 -139 0 -15 -47 86 242 -67 -26 15 91 123 -15 -49 -17 -19 75 95 -98
2860i8J52m8K6l5n8M4q5Q0mm3P2Q9k7n8l4l1l1N3O4m3m3R6j05O8O9j61K7K6L8N4P7q8j25J68
2461H6o4L4ln7K4J3n4J77m0j43J8l1qj9J39j17O9L2r9o2J89r4R2J17j46l2n4R8j35L4Q5M9
2085I8N0j15m7M3R2r4M8k6O0j25O2P6j56O3K6j89K41j87J96j36J74j46n1j7O1l2J85j85J07
1745G6J78k50Kl7O1q0PnmJ24j00o7K41j02j18j8P5J25j58Q8p8P5L5j52Q3J07m4RQ4M6o1j30
1369A2m7NJ9QNJ04Q5m3j29R4j67L6J17Q0j80l7J48N1j53OK7m0K0o1M1O6qQ9j57J19J13k24
$$ plain form
2860 -98 54 6 32 -3 -61 -17 -102 -22 -26 -69 3 92 65 7 -27 -58 -89 -36 28 -15 -58 38 -67 1 70 -91 -64 -38 0 54 131 43 -82 86
2461 86 22 56 53 -4 20 33 -21 156 116 -27 -9 -40 -48 -67 72 -45 24 56 -43 -105 84 -10 82 199 53 21 -33 65 -70 -36 49 98
2085 98 148 33 -14 29 121 27 75 49 109 -16 46 122 -34 29 55 -134 107 -80 116 -20 154 8 -43 -60 1 -31 154 -31 76
1745 76 254 4 6 -31 30 -50 -43 -48 -52 72 -28 -95 146 44 -74 -92 -17 108 -50 38 -40 35 70 -82 1 108 64 73 157 203 142 12
1369 12 -35 -30 -11 -3 2 106 191 148 19 113 -54 -18 99 179 -1 -38 110 161 8 14 41 1 21 -40 1 67 59 148 -9 110 223 -1
$$ [...]
-192b2
##END NTUPLES=	nD NMR SPECTRUM
##END=	
##END=	
