##TITLE=	Nov18-2021.62.ser
TM-VI-170 acetone-d6 Ca+Bz-pyr. hsqc
##JCAMP-DX=	6.0	$$ MestReNova 14.3.0-30573
##DATA TYPE=	LINK
##BLOCK_ID=	1
##BLOCKS=	2    
##ORIGIN=	Mestrelab Research S.L.
##OWNER=	hrzepa
##$MNOVA/LINK_BLOCK_TYPE=	ITEM	$$ NMR Spectrum
##$MNOVA/ITEM/POLYGON=	(XY..XY)
5321,5835
8722,5835
8722,8208
5321,8208
5321,5835
##$MNOVA/ITEM/Z=	0
##$MNOVA/ITEM/ANGLE=	0
##TITLE=	Nov18-2021.62.ser
##JCAMP-DX=	6.0	$$ MestReNova 14.3.0-30573
##BLOCK_ID=	2
##DATA TYPE=	MNOVA NMR VIEW DATA
##DATA CLASS=	MNOVA VIEW DATA
##$MNOVA/2D/THRESHOLD=	1.4006029367446899414
##$MNOVA/ITEM/ZOOM/X=	-0.57569417574404480042,	10.597559643135086915
##$MNOVA/ITEM/ZOOM/Y=	-9.5463928198744607556,	230.01759208461857042
##END=	
##TITLE=	Nov18-2021.62.ser
##JCAMP-DX=	6.0	$$ MestReNova 14.3.0-30573
##BLOCK_ID=	3
##DATA TYPE=	nD NMR SPECTRUM
##DATA CLASS=	NTUPLES
##NUMDIM=	2
##ORIGIN=	Bruker BioSpin GmbH
##OWNER=	nmr
##.OBSERVE FREQUENCY=	400.20200099999999566
##.OBSERVE NUCLEUS=	^1H
##.SOLVENT NAME=	Acetone
##.PULSE SEQUENCE=	hsqcetgpsi2.ph
##LONGDATE=	2021/11/18 14:29:00.000
##.ACQUISITIONMODE=	SIMULTANEOUS (DQD)
##$ORIGINAL FORMAT=	Bruker XWIN-NMR
##$MNOVA/SCALES_VERSION=	7
##$PARAMETER FILE=	(acqu2s, ASCII, //ch-nmrserv3.ch.ic.ac.uk/Av400C/agmb/nmr/Nov18-2021/62/acqu2s, 0)
$$ ##TITLE= Parameter file, TOPSPIN		Version 3.2
$$ ##JCAMPDX= 5.0
$$ ##DATATYPE= Parameter Values
$$ ##NPOINTS= 241	$$ modification sequence number
$$ ##ORIGIN= Bruker BioSpin GmbH
$$ ##OWNER= nmr
$$ $$ 2021-11-18 14:38:55.230 +0000  nmr@CZC2439F63
$$ $$ /opt/topspin/data/agmb/nmr/Nov18-2021/62/acqu2s
$$ $$ process /opt/topspin3.2/prog/mod/go
$$ ##$ACQT0= 0
$$ ##$BF1= 100.63037
$$ ##$FnMODE= 6
$$ ##$NUC1= <13C>
$$ ##$NusJSP= 0
$$ ##$NusT2= 1
$$ ##$NusTD= 240
$$ ##$O1= 11069.4607123918
$$ ##$SFO1= 100.641439460712
$$ ##$SW= 240.006397974962
$$ ##$SW_h= 24154.5893719807
$$ ##$TD= 240
$$ ##END=
$$ 
##$PARAMETER FILE=	(acqus, ASCII, //ch-nmrserv3.ch.ic.ac.uk/Av400C/agmb/nmr/Nov18-2021/62/acqus, 0)
$$ ##TITLE= Parameter file, TOPSPIN		Version 3.2
$$ ##JCAMPDX= 5.0
$$ ##DATATYPE= Parameter Values
$$ ##NPOINTS= 12	$$ modification sequence number
$$ ##ORIGIN= Bruker BioSpin GmbH
$$ ##OWNER= nmr
$$ $$ 2021-11-18 14:38:58.664 +0000  nmr@CZC2439F63
$$ $$ /opt/topspin/data/agmb/nmr/Nov18-2021/62/acqus
$$ $$ process /opt/topspin3.2/prog/mod/shimcntl
$$ ##$ACQT0= 1000000
$$ ##$AMP= (0..31)
$$ 100 100 100 100 100 100 100 100 100 100 100 100 100 100 100 100 100 100
$$ 100 100 100 100 100 100 100 100 100 100 100 100 100 100
$$ ##$AMPCOIL= (0..19)
$$ 0 0 0 0 0 0 0 0 0 0 0 0 0 0 0 0 0 0 0 0
$$ ##$ANAVPT= -1
$$ ##$AQSEQ= 0
$$ ##$AQ_mod= 3
$$ ##$AUNM= <au_zg>
$$ ##$AUTOPOS= <48 >
$$ ##$BF1= 400.2
$$ ##$BF2= 100.63037
$$ ##$BF3= 400.2
$$ ##$BF4= 400.2
$$ ##$BF5= 400.2
$$ ##$BF6= 400.2
$$ ##$BF7= 400.2
$$ ##$BF8= 400.2
$$ ##$BYTORDA= 0
$$ ##$CAGPARS= (0..11)
$$ 0 0 0 0 0 0 0 0 0 0 0 0
$$ ##$CFDGTYP= 0
$$ ##$CFRGTYP= 9
$$ ##$CHEMSTR= <none>
$$ ##$CNST= (0..63)
$$ [...]
$$ 0 0 0 0
$$ ##$ShimPowMaxUC= (0..63)
$$ 130000 130000 130000 130000 130000 130000 130000 130000 130000 130000 130000
$$ 130000 130000 130000 130000 130000 130000 130000 130000 130000 0 0 0 0
$$ 0 0 0 0 0 0 0 0 0 0 0 0 0 0 0 0 0 0 0 0 0 0 0 0 0 0 0 0 0 0 0 0 0 0 0 0
$$ 0 0 0 0
$$ ##$ShimPowMaxUG= (0..63)
$$ 524287 524287 524287 524287 524287 524287 524287 524287 524287 524287 524287
$$ 524287 524287 524287 524287 524287 524287 524287 524287 524287 0 0 0 0
$$ 0 0 0 0 0 0 0 0 0 0 0 0 0 0 0 0 0 0 0 0 0 0 0 0 0 0 0 0 0 0 0 0 0 0 0 0
$$ 0 0 0 0
$$ ##$ShimPowRcbType= 3
$$ ##$ShimPowRes= (0..63)
$$ 1e-20 1e-20 1e-20 1e-20 1e-20 1e-20 1e-20 1e-20 1e-20 1e-20 1e-20 1e-20
$$ 1e-20 1e-20 1e-20 1e-20 1e-20 1e-20 1e-20 1e-20 0 0 0 0 0 0 0 0 0 0 0 0
$$ 0 0 0 0 0 0 0 0 0 0 0 0 0 0 0 0 0 0 0 0 0 0 0 0 0 0 0 0 0 0 0 0
$$ ##$ShimPowRng0= (0..63)
$$ 1 1 1 1 1 1 1 1 1 1 1 1 1 1 1 1 1 1 1 1 0 0 0 0 0 0 0 0 0 0 0 0 0 0 0 0
$$ 0 0 0 0 0 0 0 0 0 0 0 0 0 0 0 0 0 0 0 0 0 0 0 0 0 0 0 0
$$ ##$ShimPowRng1= (0..63)
$$ 1 1 1 1 1 1 1 1 1 1 1 1 1 1 1 1 1 1 1 1 0 0 0 0 0 0 0 0 0 0 0 0 0 0 0 0
$$ 0 0 0 0 0 0 0 0 0 0 0 0 0 0 0 0 0 0 0 0 0 0 0 0 0 0 0 0
$$ ##$ShimPowRng2= (0..63)
$$ 1 1 1 1 1 1 1 1 1 1 1 1 1 1 1 1 1 1 1 1 0 0 0 0 0 0 0 0 0 0 0 0 0 0 0 0
$$ 0 0 0 0 0 0 0 0 0 0 0 0 0 0 0 0 0 0 0 0 0 0 0 0 0 0 0 0
$$ ##$ShimPowRng3= (0..63)
$$ 1 1 1 1 1 1 1 1 1 1 1 1 1 1 1 1 1 1 1 1 0 0 0 0 0 0 0 0 0 0 0 0 0 0 0 0
$$ 0 0 0 0 0 0 0 0 0 0 0 0 0 0 0 0 0 0 0 0 0 0 0 0 0 0 0 0
$$ ##$ShimSysFunc= (0..63)
$$ 1 2 3 4 5 7 9 11 15 16 8 10 12 14 6 17 13 18 19 20 0 0 0 0 0 0 0 0 0 0
$$ 0 0 0 0 0 0 0 0 0 0 0 0 0 0 0 0 0 0 0 0 0 0 0 0 0 0 0 0 0 0 0 0 0 0
$$ ##$ShimSysMatrix= 0
$$ ##$ShimSysType= 1
$$ ##$TFXNUM= 0
$$ ##$TRIPLO2= 0
$$ ##$VTU= 2
$$ ##$VTUETH= <149.236.99.20>
$$ ##$VTUTY= <no>
$$ ##$WBREFAM= (0..15)
$$ 135.5 97.7 100 100 100 100 100 100 100 100 100 100 100 100 100 100
$$ ##$WBREFLM= (0..15)
$$ 0 0 0 0 0 0 0 0 0 0 0 0 0 0 0 0
$$ ##$WBREFPH= (0..15)
$$ 72.26 -67.22 0 0 0 0 0 0 0 0 0 0 0 0 0 0
$$ ##$WBSGU= (0..15)
$$ 0 0 0 0 0 0 0 0 0 0 0 0 0 0 0 0
$$ ##$XFAC= 2
$$ ##END=
$$ 
##$DECIM=	4464
##$DSPFVS=	20
##.ACQUISITIONSCHEME=	ECHO-ANTIECHO
##NTUPLES=	nD NMR SPECTRUM
##VAR_NAME=	FREQUENCY1,	FREQUENCY2,	SPECTRUM
##SYMBOL=	F1,	F2,	Y
##.NUCLEUS=	13C,	1H
##.OBSERVE FREQUENCY=	100.64143946071199309,	400.20200099999999566
##VAR_TYPE=	INDEPENDENT,	INDEPENDENT,	DEPENDENT
##VAR_FORM=	AFFN,	AFFN,	ASDF
##VAR_DIM=	512,	512,	262144
##UNITS=	HZ,	HZ,	ARBITRARY UNITS
##FIRST=	23146.755397984237788,	4241.1433691826614449,	0.11286830902099609375
##LAST=	-960.65704162931024257,	-230.39280913276670049,	-0.16016638278961181641
##MIN=	-960.65704162931024257,	-230.39280913276670049,	-1.7114536762237548828
##MAX=	23146.755397984237788,	4241.1433691826614449,	8.7953701019287109375
##FACTOR=	1,	1,	0.0050820596184658348507
##PAGE=	F1=23146.8
##FIRST=	23146.755397984237788,	4241.1433691826614449,	0.11286830902099609375
##DATA TABLE=	(F2++(Y..Y)), PROFILE
$$ [...]
1380a4L6qql7P4kj5l7l8PJ9L3j3R6q1j0qM5o7k2P9k0l1O3m8rJ9K8J5n6k0M9l0NN2n1J6k0P
1038bK3q9Q3j0Ok2k9J04k8nJo6NM0J3l4LLO8q3J58j12l2K2L9l4p9N7j8J02Q7j31l6j1Lk03
723b07K37rJ4m3l3R1p2J7J95j03j04M9p3K08j42K5q5J5J1l0K0QP3r0K8K9n1K1p7J36k9k9m1
435d1j6L3m0L1ON3k9j7j6M5m2k5P4m4M8kl8N7j5n4O5n8n9K1K1k4J7K1k0J2j2J14n6N9j30P1
120A0J6l6Pn3k9PJ07pk0j1J2K3r7P1m8L0K8j6nm0L4J5rqqP6L3p1k8j98K27kk6n0Q5l2Pk1N1
-222B4j8
$$ plain form
1380 -14 22 14 6 -31 43 41 26 -11 -49 -42 -23 10 -3 93 12 2 -6 39 -28 -50 29 9 -22 41 -7 -16 3 31 46 -10 -30 19 -11 -6 46 -5 11 -9 -2
1038 -2 21 -68 15 5 11 -11 -40 64 36 31 32 -34 -29 11 24 -10 -7 -4 64 -19 139 27 -5 17 56 22 -57 0 -18 84 171 40 4 -7 -4 -207
723 -207 30 21 35 -8 -41 50 -22 -5 190 87 -17 32 -41 167 25 50 -35 -20 -9 -39 -19 -11 62 -28 0 29 -22 -1 -78 58 29 0 -41
435 -41 -57 -24 -64 -33 -27 26 -3 -20 -36 9 -33 -58 16 -28 20 18 -20 37 22 -32 33 -25 -84 -63 -42 -66 -49 -28 -48 -36 -48 66 10 69 -61 10
120 10 26 -10 -3 -56 -85 -78 29 22 2 -9 3 26 -71 0 -48 -18 10 -6 -11 -51 -17 -2 -11 -19 -27 49 82 11 -17 -215 12 10 -16 -66 19 -13 -6 -27 24
-222 24 6
-230F
##PAGE=	F1=23099.6
##FIRST=	23146.755397984237788,	4241.1433691826614449,	0.13169968128204345703
##DATA TABLE=	(F2++(Y..Y)), PROFILE
4241B5k1j25J09K8o2K7j0J9N6q0L8M4m4l9L2Lk4J5l0N9j9j5L7j1n1QL2m6L2Pl5Q6n5qmL9o4
3917d7K8m4J3O6j6k1mj25J29K0L2Ql2llJj18R6K3lK3j2M7n4j01J01Mk5J27j10m6Q5l9k0JM3
3602B4j5m9J7n4O0j4k6N1m6J05m0K0k9k4O5o6K2K8Ql4l2M1l8K5l1O5n4J4ll1j8N1k6J9k4M6
3287Gj33K02o0k8M8q1K3j0q5Q2J9lNKK2l7K7p0R1j0r2P7n0jM5mQ4o7K8n7J23r9J1o0J00p2
2972b3N5l8j6K3J2M0o9o0M3p4O6j6O3Jl8O1K3m8Om3J2J5oK2K0Mo9J9joP0k7J8l0K8r8J1ON5
2631A1k6K5n7k6LQ7l9M9M9ooMol5J4j9qJ43j19l5J0n1j3JJ13p7NJ8K8Pn5ROn4J16j8P5j20
2299Cj1k35K49L7o6K0l9O4m2J09n8j7k7m0P0q1M7K6j4J2k8O3M3r0J03k5o1n8K8M7J2O6r8m0
2001c1oM3k3ppJ7M1m3N1m3OJ8l6K1k1O7k5m0J5k1O9OPK0n7kn9J01o1J01m3q2L0JL3n7NQ0l5
$$ plain form
4241 25 4 -121 -12 16 -46 -19 -29 -10 46 -34 4 48 4 -35 -3 0 -24 -9 -39 20 1 -14 23 12 -39 -31 1 -45 -13 -6 -41 45 -10 -18 -22 17 -47
3917 -47 -19 -63 -50 16 0 -21 -25 -150 -21 -1 31 39 7 4 1 2 -116 -20 3 0 23 11 58 4 -97 4 8 -17 110 0 -46 39 0 -20 -19 24
3602 24 9 -40 -23 -77 -17 -31 -57 -6 -52 53 13 33 4 -20 45 -21 1 29 37 3 -29 12 -26 -1 -32 33 -21 -7 -10 -41 -59 -8 -34 -15 -39 7
3287 7 -126 76 16 -12 36 -45 -22 -32 -117 -35 -16 -19 -14 -12 10 -27 0 -70 21 11 -81 -4 -54 -55 -10 -14 70 3 31 -26 97 -2 9 -51 49 -23
2972 -23 32 -6 -22 1 13 53 -16 -76 -33 -107 -41 -57 6 7 -31 30 53 5 11 -32 -20 -5 -11 11 31 35 -34 -15 -16 -22 48 21 39 9 37 -61 -50 -44 11
2631 11 -15 10 -47 -73 -70 17 -22 27 76 70 64 68 62 27 41 22 14 157 38 3 13 -38 -51 -50 63 -14 -9 9 37 44 -11 -2 4 -50 66 48 123 3
2299 3 -8 -243 6 43 -23 -3 -42 22 -20 89 31 14 -13 -53 17 -64 -17 9 -5 7 -21 42 85 -5 98 73 12 -46 -18 29 41 107 9 -31
2001 -31 -37 6 -17 -24 -31 -14 27 -16 35 -8 -2 16 -20 1 -20 47 22 -18 -3 -24 45 51 58 78 21 19 -40 61 0 101 58 -24 6 7 40 -17 -12 68 33
1660C3n8O8k7k7n2O4O9R2n6j23j3P3l5R5N9r0j10Q2K6j1KM8K0j22qlR3p1L6l3k1pJ3N2l3l7
1345a2M4j3M1q1k8K6K8K0k7R3qr3l7Q5j1q2P7J5l7K8k8k8J21q6M8p2l9Q2j4O6Oj22N1QQj2
1030A7n1J5kO1n6n4J35Ml7l3k1K4J3M0k4j5k6J00r9J28j37LJ5M6km9jJ3J00M7j54%nK2k16
723a99K25k5J7j4J2Q3r8J5J73q6j46N2j7J56j75Q6n7k6K7p0J7O2L6l7K0M0j48P3n5J67j02
452FK0k6l6pJ2M2oP5j23M4m9J5J2QP0q9O0l4j2K8Mn1P5l2p6K3M4m3M8j0j5kl5J24n3j3l6N0
120A2Kk6mLl7M1L0k1k5L0ON5p9pJ9k7L0j0J6n7P5k5Mmk3N1K9l1m7k21K34l2pK0N6k9Kl5O7
$$ plain form
1660 33 -25 43 16 -11 -63 1 70 162 106 -17 -30 43 8 103 162 72 -38 44 70 59 61 109 129 7 -1 -4 89 18 54 21 0 -7 6 58 25 -12
1345 -12 32 19 60 -21 -49 -23 5 25 -2 91 83 -10 -47 38 27 -55 22 37 0 28 0 -28 93 7 55 -17 -56 26 12 78 84 -38 13 21 29 17
1030 17 -34 -19 -21 40 -16 -70 65 69 32 -1 -22 2 15 55 31 16 -10 90 -9 119 -18 -15 0 46 44 -5 -6 7 107 154 0 0 -5 17 -199
723 -199 26 1 18 4 16 99 1 16 189 103 -43 9 -8 148 -27 59 2 -24 3 -67 -50 12 48 11 31 71 -77 -4 -59 108 6
452 6 26 0 -36 -43 -31 11 5 80 -43 1 -48 -33 -21 -13 57 -32 28 -6 -18 10 14 -37 38 6 -70 -47 -3 -46 2 -8 -23 -25 -60 64 11 -2 -38 12
120 12 14 -12 -16 -13 -50 -9 21 0 -25 5 11 66 -13 -20 -1 -28 2 -8 8 -49 26 1 5 1 -22 29 58 27 -20 -241 -7 -39 -46 -26 30 1 3 -32 35
-222C5P
-230D2
##PAGE=	F1=23052.4
##FIRST=	23146.755397984237788,	4241.1433691826614449,	0.15053105354309082031
##DATA TABLE=	(F2++(Y..Y)), PROFILE
4241B9l9j14J09K0o7L8KJ9J9j06N8J07m1p0PK5l8K8l6N2Oj1J2Or9L3M6n3L1N4j20J63m7p0
3944d7K1K0o6P4p3j7Q9J1n5M0j52J36L8L8rl3j6j7l0q1J18k6K5K3nN2n9j16Q8jmJ49j88o1
3646a34J15Oj2K8%Om9K2r2R8k9k9R0m5Q6l3J3j2o5J03j09J7L7ll3l3O7n2M0l3N5o5mK1n5P7
3331fl0L8k5M1j7j17K10o0n6J9n4K0n0m4K5Q4k0J1j2K8n7J5n8J11L2j10Q2q0kO4qM7o6O4l9
3025b0J17j19m7n1J50p2M9j6PMNM6j02j19Q8k1L6j6O6Jn7J12Pq2Q0j11K5J7k4J8O7qp9M9o3
2719f3MJ57o4K5o7M7j59L6j7Q3l3P2j66j3J4J83j04P5J10r2P8m3m0m0M9j7k2J55j09l0Kq0
2439f9k7L9J43j22j3L8O7j6r2%K5l7J62o6oj01Q9k85K98N3q1Nq1J25p9Q9l3Pm1m2J06j43P5
2150a3L5NNo8N8O9j20J02l4n4m6M3M2M9M9j50o1M3l7O4J6opP5o9O7p6J8J7k1k2NM3L9p2nk9
$$ plain form
4241 29 -10 -124 -15 5 -62 -24 -22 -3 16 -90 -32 75 34 -36 -29 -4 -42 -14 -50 2 8 -3 9 15 -84 -51 -5 -58 -27 27 -93 70 23 -47
3944 -47 -26 -6 -72 2 -71 -88 1 12 -43 -3 -155 -19 19 57 48 15 -1 -18 -48 -129 -11 -37 -12 11 6 58 -1 -117 -29 -30 -34 115 -73 -134
3646 -134 -19 -13 -25 3 3 9 -40 -18 -110 -12 -41 -70 20 -25 61 28 41 29 -36 67 -42 -25 12 9 -24 -57 10 -42 -2 -35 20 -45 -49 -28 -83 -6
3331 -6 -36 2 -23 18 1 -116 94 34 -22 -3 -57 -37 -87 -131 -106 -22 -42 -31 -43 -15 -72 -57 -115 -4 28 -82 0 -80 -82 -18 -26 21 -45 19 -20
3025 -20 97 -22 -69 -120 30 -42 7 -9 -2 2 7 53 -49 -168 -80 -101 -65 -81 -15 -14 -71 41 48 -34 46 -65 -40 -23 -47 -29 38 30 -49 0 -63
2719 -63 -59 98 34 59 -8 39 -120 -84 -101 -18 -51 21 -145 -158 -144 39 -65 10 120 28 106 63 23 -17 32 15 -7 148 39 9 11 -69
2439 -69 -96 -57 86 -36 -49 -11 56 40 -52 -52 -27 -64 98 32 26 -75 14 -271 27 80 -1 4 -77 48 -31 58 25 32 -9 -51 55 -88 -13
2150 -13 22 27 32 -36 22 91 -29 73 39 -15 -61 -18 24 73 122 -28 -89 -46 -83 -19 -3 -9 -16 59 -10 57 -19 -1 16 -5 -27 -22 21 60 -12 -17 -46
1826d6Q1L4J5k0k6l3n3R0k4J21q1p4N8m8j3j4RP2j6r0Q6n8k1k1R0K2R2o0j31PJ29p7Q9O5j17
1520C7p8J04L1n8J6P0Jj15l4KQ2J6J6p1k1j6J5R7p4k9K4J4Q2j36l0O8J4J0l7P6N4j66n2J10
1222B2L1j22M9Q8n2rqk5J69j54P5j10l0R1j9J43k3j73N6Q0k8l4Jk5j3N3p5m8J50K3q3m1k6
933f7R4j4N0l0j3l7J25j24R6j13K4j0L5J0%m0L4Q6L1j55L1lmj65K19q4K0J4Q2N1j22J6J30
645A67q9j47R5K2Q8k31J75n5m8M0j18L5R1K5oKM3k26J42mJ46j67P2j3n3m8O3O0j3O8j65R0
365D1j01k1O2P8K2j06M9l9pLK5o1P4Oq2K6O6o1Q1n5k2Ql3J25o0j10Q3K2j6J8k6M4n9J12q8
58bnn1P5KQ6o1q4Q6p4L9RKp2J19o5J9Kl7MM8%p3j91K11n6J6O6Lj3J1m9Q6J0
$$ plain form
1826 -46 35 69 84 64 38 5 -48 42 18 139 58 -16 42 -6 -19 -33 -24 48 32 -58 28 -30 -51 -72 18 40 132 72 -59 -52 77 0 89 154 37
1520 37 -41 63 94 36 52 122 123 8 -26 -24 58 74 90 19 -2 -18 -3 94 20 -9 15 29 111 -25 -55 13 27 37 0 76 130 -36 -88 22
1222 22 53 -69 -20 68 16 7 -1 -26 143 -11 64 -46 -76 15 -4 139 116 -57 -1 79 51 17 18 -7 -20 33 -42 -90 60 83 0 -41 -67
933 -67 27 13 63 33 20 -17 108 -16 80 -33 -9 -19 16 26 26 -14 20 106 137 -18 13 10 6 -159 60 -24 -4 10 92 143 21 37 167
645 167 78 -69 26 48 136 -95 80 25 -23 17 -101 -66 25 50 44 46 89 -137 5 1 147 -20 52 39 -14 -62 1 61 48 116 -49 41
365 41 -60 -81 -19 59 81 -25 24 -15 -22 -19 6 -55 19 25 -57 -31 35 -26 55 0 -22 -14 -47 78 18 -92 -9 13 -3 15 -11 33 -26 86 -2
58 -2 -7 -58 17 19 105 44 -40 46 -28 11 20 22 -50 69 4 23 25 -12 -8 40 40 -33 -224 -13 -69 -53 13 16 3 14 -35 51 61
-230F1
##PAGE=	F1=23005.2
##FIRST=	23146.755397984237788,	4241.1433691826614449,	0.089700460433959960938
##DATA TABLE=	(F2++(Y..Y)), PROFILE
4241A7m5q2R1J1o4J7N5Ql7p8N0J15j9r0J8K8k6J1l0J7J8j2K3Oj22O9L9n6L3P2j82K20m5j01
3944g1L7Rq2J56r3m5Q9L4q9Q7j99J82K9K7k7j1l4oo6j7J12o1N2LK4pj1j29O9j2%J45j98o3
3646a66R4P2MM6p3N3j6l1q4J23m0k8Q8k4M7j4J0J0o9J13j50L5L7k8k9m3Q1o3P2l9P1q8Lk2
3349d8n6J64r9R5n9P8p4j02J85m0l5l3o2M8p6mJ7R9n4K6q%l8j4k6J13N8j23Q6r9K1N6j0pl6
3042e7M3qR1j35p1J4J51j16P2NK7jj3O7j13j79J18K6J2J5K8Ln3J41k8q8J38j66N4m3pM5M4
2754A6k3j9M8j26j4K16n7rp5P9j80M8m4R2j4R2k42lL3K31j79J16J60j63J43j32m0k1N9JJ2
2482ER9q1j8lj08k9P0J89j66jJ1O8m0q6j9N0J5J73j08j07p5J95l17K81Q3n1l3o6J45j00K1
2211cL5J0o0l3J07j01K2L7K4Mq0M7N0j29J02p1m7J8O0L0M0M1j82l7Q1j15J13O4k0j8Q2r3P6
$$ plain form
4241 17 -28 -110 -19 -8 -72 -55 0 8 -29 -107 -57 58 39 -51 -33 -5 -31 -20 -50 -33 -15 -27 -4 2 -120 -51 -12 -68 -35 37 -145 75 30 -71
3944 -71 -34 -25 -107 49 -44 -89 0 34 -55 32 -167 15 44 71 44 33 -1 -7 -73 -90 22 -39 13 16 40 33 22 -107 -38 -50 -50 95 -103 -166
3646 -166 -72 0 4 50 -23 30 14 -17 -101 22 -18 -46 42 18 65 51 61 71 2 115 -35 0 37 9 -20 -63 18 -45 27 -12 59 -29 -26 -48
3349 -48 -104 60 -39 56 -3 75 1 -101 84 44 9 -24 -86 -38 -114 -118 -101 -2 -56 -30 -38 -38 -76 -90 -116 -3 55 -68 18 -81 -60 -4 -14 -21 -57
3042 -57 -14 -22 69 -66 -137 -123 28 -88 -16 -11 16 15 2 69 -44 -223 -105 -79 -67 -52 -24 -21 -74 67 39 -49 89 -77 -23 -66 -73 -28 16
2754 16 -7 -26 22 -104 -118 98 41 32 -43 36 -144 -96 -140 -48 -62 30 -212 -215 -182 49 -130 -14 146 -17 126 -6 -46 -67 -8 -7 5
2482 5 104 23 5 2 -106 -135 -65 124 -42 -43 -32 36 -4 -90 -109 -59 -44 129 21 -86 -161 34 -283 -2 81 30 -3 -69 76 -24 -3
2211 -3 32 42 -18 -51 56 -45 -23 14 38 42 -38 9 59 -70 32 -39 -86 -68 -8 22 62 103 -79 -116 -35 -150 -37 27 7 -11 71 -22 54
1922E4j12K8K9no7N5j0Q4r2nm0Q2M8M2n8K6o3l8M6J6J77j37p6P5p0q3J2N4M2nq6O5o8MNO5
1607flQ4p5q3J3J80j10M3N5r7o2Q0P9r8J7N0Op4l6qQ6O6j2q5lq3N0J34j10k9J8O8Q8j72k4
1301e3J21k6J3o6M7R2k08l7J17J9j20K2J61o2m4nJ3J37j56J00j32l1P3k3J79j2j77L5J34p4
1038C7%K9l1k8k0n6m5J20L3q3l3n0J78m8N5p3K3%Q7j38Q1n2M5m4jj3N7o6M4P9M9j45N1oo3
732b7p9K21j90N0J1J41J4j17J2R5r1j10J32N2M1l03K27m6p0M3j30Q4O5K3mj2K0k32K10L2Q6
461A48j87J09rp3o2P9N8K1M5j56R2j30k4M2J52j7r6L1k5ol8P2j05O2P1j02J4R3n0Q5j01m4
181e1L1j0J31m4k22J49oLO4o2J02q3J76k17L9r1J06J8Q2k7j30J06r3O0L6l6o3J27q2JL0l9
-99Em6Q5j7p9j28J79o2L5O6l8NJ8p4J11q
$$ plain form
1922 54 -58 -30 -1 -6 -73 -18 -28 56 -36 -41 -81 1 49 91 33 59 -4 -42 4 20 197 60 -16 59 -11 -94 -82 -28 14 9 -77 -12 -80 -76 -71 -6
1607 -6 -9 75 0 -83 -70 110 0 43 98 1 -61 19 98 0 17 67 73 -1 -37 -45 41 107 95 10 7 -76 -26 108 -2 -31 -13 55 143 -29 -53
1301 -53 68 42 55 -11 36 128 -80 -117 0 19 -101 -79 82 20 -24 -29 -16 121 -35 65 -67 -98 -25 -48 131 119 -58 -23 111 37
1038 37 37 66 35 7 -13 -69 -114 6 39 -44 -77 -127 51 3 58 -15 8 8 95 -43 38 -14 31 -13 -14 -27 30 -36 8 87 136 -9 42 36 -27
732 -27 -106 115 -75 -25 -14 127 141 24 36 131 40 -70 62 114 155 -148 79 33 -37 6 -124 -40 25 48 44 32 52 -180 30 62 148
461 148 -39 70 61 -12 -74 5 63 84 129 -27 65 -65 -89 -47 105 88 -8 23 -2 -8 -46 26 -79 -17 54 -48 -34 59 9 94 -7 -51
181 -51 -20 -30 101 57 -165 -16 -22 -19 45 -17 85 2 178 -39 0 -91 15 33 115 88 -42 64 -29 31 67 31 -32 95 13 14 44 5
-99 5 -41 44 27 -52 -180 -1 -63 -28 38 0 5 23 -51 60 52
-230E2
##PAGE=	F1=22958
##FIRST=	23146.755397984237788,	4241.1433691826614449,	0.23444902896881103516
##DATA TABLE=	(F2++(Y..Y)), PROFILE
4241D6n9o0Q1Rp0j4J40j9q6m0L6P0J6r8N2QkMk9k4LRM8k2j02O7N1l6jN5j87K20k5j13L9j8
3926e1p3K14q6m4K8P8j19J40k37J94J1Nl3K4m0J7r6N0N6o9P2k5P5r0N3j26N0k3j3J23j36p4
3646a45K4J41J8N8j50J00L9j13n0J30n0k4Q6kooKK6j9R3j64P9J6p3k7n3R5p3J05m8J02j00
3366A1op8l8K21j27J11o9R5j00j06J24pJ9j01o8Q0j09K9P8O9r4L7lk8ql2JJ05N0r4N9j03O6
3077a6J8j1o2J8pL9L2j24o8Q9J60j82P5J3L7Qj7N9j04j86J19M1PN5koo2J67o7o9J73k18Q6
2789ej08QR7ll3M9K1j37o9K36l1k5o2Q4j57N5n2P3oJ05k82M3J2K40k28J35J94k04J68k11k9
2517a22J1L8L9P6j1n6L7k4j08j8O6K12j81Rj5M3m5m6n2Q0P3J61j26k08m5K53l16J95J24K9
2255G3p5j8J14j15m4J03J4p9k4J09n9l3M0K6j5l7J4J1j09R9j13l9Q2P5J9K0K0j70L2Q4j76
$$ plain form
4241 46 -13 -73 8 17 -53 -67 73 54 -32 -72 -36 34 50 -48 4 12 10 14 -15 -39 -36 -27 21 -1 -103 -36 15 -21 -22 33 -154 66 41 -72 -33 -51
3926 -51 -124 90 4 -40 -12 66 -53 87 -150 44 55 60 27 51 11 28 -68 -18 38 -31 41 16 91 1 54 -72 -22 -45 -58 65 -71 -145
3646 -145 -121 20 38 96 -54 46 85 -28 -78 52 2 -22 64 62 56 50 52 78 59 152 -12 67 83 10 -17 -70 25 -48 57 9 111 11
3366 11 5 -73 -111 110 -17 94 25 120 20 -86 38 31 50 -51 -119 -39 -148 -119 -41 28 -66 -29 -32 -60 -68 -100 -99 6 56 -38 21 -82 -16
3077 -16 2 -9 -71 -53 -60 -21 11 -113 -181 -92 68 -114 -39 -26 11 19 2 61 -43 -229 -110 -69 -62 -7 -9 -15 -77 90 23 -46 127 -91 -5
2789 -5 -113 -105 -8 -11 -44 5 26 -111 -180 56 25 0 -62 22 -135 -80 -132 -59 -65 40 -242 -199 -187 53 -175 -40 154 -50 118 -93 -122
2517 -122 -111 -73 -34 42 31 -25 12 -12 -120 -138 -72 140 -41 -32 -47 -4 -49 -95 -147 -67 6 167 41 -167 -212 41 -275 -80 44 73
2255 73 -2 -20 94 -21 -65 38 52 -27 -51 58 -1 -34 6 32 17 -20 -6 5 -104 -5 -118 -157 -75 0 19 39 59 -111 -79 5 -171
1983a71J39Q9l2l1R0j19Q6j49M2M2%p5Q9p9J30j11mn3Q6O0P0r7R0q2k1KM3K21j77o5N5q4j33
1695a49NJ31pjm4L9q0L3L2%j8J10j04k8K7J80j16j2L5l5q9M6J16r7RQL8k6k6k7P9R2j5j02
1397DJ3j35J00J36j31n8K8J31N0j47qJ57q4J7r5J8J31k39qJ09lj02J2J82m4q9rO0O7j22J13
1126E4j27n4O3j9J60K5j42LJ27o8Q1rkn6j08Jl0N5L2m3l6q4K22m3N5j22P3N0K5j76R3L5M3
837G8n6n2n2J10j00K6J24O5j38M6J1j03j8K34k83Q0m2K06k2j00K1N7r5m5J49M1L3l40K33k7
575D1q3Lj08J67oJ5rk0Nj94K39L3L8j57J13mr2l8N7M2M2K4r8N0j26kkJ73k8o7j6MJ0o6J29
268F9j59L5J37j21j7J04jM5j18q4O9K9J28l4k78J58k7L1J09r8J45j22K19k85P6j34J40L6M8
15A00K4j37N0o8P7O0p6l0Q1n8k3O1l9r6J21l2q7o3J45o2N8K7m0J9J9j10J23k5
$$ plain form
1983 -171 -32 57 25 -6 84 -35 51 -98 -56 -14 -14 -89 0 -79 51 -60 -64 -117 -31 29 99 2 92 10 -11 -9 34 255 78 13 68 -16 -149
1695 -149 -144 -13 -20 -21 -65 -26 -106 -73 -41 -41 -59 51 -53 -81 -54 126 10 -2 33 -2 -91 -45 71 -26 -17 -9 29 3 -23 -50 29 121 106 4
1397 4 17 -118 -18 118 -13 -71 -43 88 138 -9 -17 140 56 73 -22 -4 127 -112 -120 -11 -14 -116 -104 78 34 -55 -64 -4 63 -59 54
1126 54 -73 -127 -64 -83 77 102 -40 -37 90 22 103 94 92 36 -72 -71 -101 -46 -14 -57 -93 -177 45 2 57 -65 8 58 83 -93 0 35 78
837 78 22 -30 -82 28 -72 -46 78 143 5 51 62 -41 -59 175 -108 -28 -70 136 114 14 35 92 -3 -48 101 142 175 -165 68 41
575 41 -42 -39 -147 20 14 29 20 0 5 -189 50 83 121 -36 77 73 -19 -57 0 42 84 108 10 60 -66 -68 -70 103 75 8 -8 -4 6 -60 69
268 69 -90 -55 82 -39 -56 48 47 92 -26 -110 -41 -12 116 82 -196 -38 -65 -34 75 -23 122 0 219 -66 10 -124 16 52 100
15 100 124 -13 37 -31 46 106 30 0 81 23 0 61 22 -74 47 15 -72 -135 10 -52 6 33 -7 12 31 -79 44 19
-230A9
##PAGE=	F1=22910.9
##FIRST=	23146.755397984237788,	4241.1433691826614449,	0.22308599948883056641
##DATA TABLE=	(F2++(Y..Y)), PROFILE
4241D3m4q1R9J9r9k6K05n2r0k0K3K1J9n7Q0m2J3mMn0m9N1P7p9m9K6Q4Lm7jj26J70jr0K5l9
3926h4m8K09p1np2J18j09J73k59J45J4J2o0Q2m8M0j14J10k2l6O0n3J23j64J21j19K7j0rO4
3664A5n0q9m1J69K1O2j89J45R3j72j1R0n0j8O2J8k1m1K1K1M1O7j51J21J2j02p7n4J18o7J30
3392G3q6J48q7l0j18j2K19j14Q9o0R9r0j12N3J6R3j41p9J10j28K7J49Rr7J9Pl4K6l0K4P5Q
3112B6k5J1j02J18k7j9q2N2n7R3m4j14l3J61J67k46N9K5K0L9k4K7o6j41Q7M4K6P6k7k9m6J15
2832F4o1l4J70k31J05j59J1J51n4m0J20k7j11j11K02k2pl7N8p1L6m5L0QJ02k75J03j5K04k25
2570a61J20J96k30J45k23lM6j6O4J30j02m1R5l7p9j4K7K00j37J1l8Kn9M7r2J19J08J15j03
2316I0k69k4K31k85Q9J47J20r9K6P3r5r3J24ml2l2P5rn9L6Jl8Qj8jo8P0j32k2J47L6PJ3qj10
$$ plain form
4241 43 -1 -82 17 36 -63 -89 116 64 -26 -46 -23 -2 17 -40 40 -2 11 7 11 -39 -88 -37 40 -39 -88 -62 22 25 -22 -23 -149 21 20 -70 -45 -84
3926 -84 -132 77 6 1 -71 47 -62 111 -148 -3 11 23 -37 45 -3 37 -77 33 11 -25 35 -18 105 -59 62 -57 -30 -40 -49 15
3664 15 -35 -124 -165 4 25 87 -102 43 136 -36 -47 43 -7 -25 37 55 34 -7 14 35 76 143 -8 113 125 23 -54 -108 10 -57 73
3392 73 -13 135 48 18 -100 -112 107 -7 82 22 121 31 -81 -28 -12 81 -60 -139 -29 -157 -130 19 28 -69 -50 -43 -77 -51 -81 -57 18 26
3112 26 1 12 -90 28 1 -18 -100 -48 -105 -12 -56 -170 -203 -42 125 -121 -62 -37 -17 22 -2 25 -41 -182 -95 -51 -25 51 24 -5 -51 64
2832 64 3 -31 139 -92 13 -146 -135 16 -38 -78 42 15 -96 -207 -5 -27 -34 -71 -13 -84 -48 -93 -63 -55 47 -228 -125 -140 64 -161
2570 -161 -41 155 -75 70 -153 -156 -110 -126 -62 68 -34 -75 20 -17 -96 -110 -83 117 -20 -9 -47 -45 -104 -57 -149 -30 78 193 90
2316 90 -179 -203 28 -257 -168 -21 99 0 26 99 4 -89 35 31 -1 -33 42 33 -26 10 11 -27 -19 -37 -38 -106 -36 -168 -190 -43 -7 0 13 5 -105
2010a05R1O3j93J38J01n8l3P1j18Q7j54N0P3l3l6O2r6J11j30L5m7O3O2N9p3J21p3Ol9M3K54
1738C02j69n5Qq6j54k8J80m4KoL2p8L2P2o7pJ28j45J7L6J40q3n4pK7r2K0J17p1j8k7P3OPj7
1432iL4R2lr9J5j65J58Q5j39o4N0J51Kq5K5J42j33L4j10k2J68k29nP9j9o7J4J44Kr2k9P9j9
1143a5n9J15j20n9N0kR3P8j10nP5k5J72p4J3p1j58N2k0j0J7J9l3r8J89j4M2j35R1J02m2k03
863a45J30J01L7n9r5p3J29j38JJ89P3j38K9L8r8k3K60l39J23j18K37l0r6L7M5j07L1R8J2Q3
601A94l45J85Rq5n3n0K36o9l1j5k9K0j46K29K6qr5Q5k3r4K7J7K2O0%k8j2r2J1l8J48j7j7p0
303d8K2L9p7J57j82j7J99j43m9J13M8k6p7j42J20L8J34j2k75J12m2N8J13j18J83j47K07k57
58f9R4j49J26M5K7N3j22n0kP3P9r9MOlo5J08k8j13J68o1j08k5J11l2O5lj7PQj16J09k9
$$ plain form
2010 -105 -14 49 -144 -6 95 37 4 75 -43 44 -110 -60 13 -20 -56 6 -90 21 -109 -74 -121 -58 4 63 -10 111 38 44 5 48 302
1738 302 133 78 86 0 -154 -182 -2 -46 -44 -50 -18 -96 -64 8 -59 -66 62 -83 -66 -30 110 27 -27 -34 -7 -99 -79 38 -33 -51 -78 -5 1 8 -9
1432 -9 25 117 114 15 30 -135 23 108 -31 -95 -45 106 108 23 48 190 57 91 -19 -41 127 -102 -107 -28 -47 -114 -100 44 46 -46 -75 4 -15
1143 -15 -74 41 -79 -138 -88 -90 3 81 -29 -34 41 16 188 114 127 56 -102 -50 -70 -80 -63 -44 -77 -175 14 0 42 -93 -2 100 58 -145
863 -145 -15 86 123 64 -31 -104 25 -113 -112 77 150 12 41 79 -19 -42 218 -121 2 -116 121 91 -5 32 77 -30 1 99 111 194
601 194 -151 34 43 -42 -95 -145 91 22 -9 -24 -53 -33 -179 50 76 68 -27 58 35 -59 -32 -15 7 67 67 39 27 -65 -54 -92 56 39 22 -48
303 -48 -26 13 -64 93 -89 -106 93 -50 -99 14 62 36 -41 -183 -63 -25 109 97 -178 -66 -108 -50 63 -55 128 -19 188 -69
58 -69 25 -124 2 47 74 127 5 -45 -47 26 105 6 10 16 13 -52 56 28 -85 83 22 -86 -111 0 -32 33 30 13 20 28 -88 21 -8
-230h
##PAGE=	F1=22863.7
##FIRST=	23146.755397984237788,	4241.1433691826614449,	0.21172297000885009766
##DATA TABLE=	(F2++(Y..Y)), PROFILE
4241D1l0j03J17K9j26l8K65r2m1k7J7k2j1nJ08r2mLM2k3j10Q5O7j27K6m4J20M8q7m7n2Q5K4
3952do5K2n1j2J68n2L7j76J56q0J80k58P3M5kq5J42n9O0j06J46r4JJ7o4J43j87J61r2J3J3
3681a0j7qL1j09o7J58L0P1k27J94J23k07J2L6l9JL8L8l6p6M0J7R6M0j27J28K2j16j27n5J52
3410Fm8J32j50K06o1m2j46LK03j01O8n1J02p9j18j6M2J40j60o7J12j40K9J96l2q0k5K1l7P2
3147b1j8L5L4l3M4l9j00J74p0l7o3M9r9J44j23r1J3K14J59k69LM1PP1l1nk8q5O9M5M5J00n4
2859H1o6m1O5n4j8J51j94R3j78JJ76n3l9J49o5p4j11J29l2M2k6J5J3J4Jk2j4J12k51J33k1
2587h4J42j63Q3J71k33J00j77OO3n1N7J47j51l1J49n0n1noJ46n1Mo7mq4J47j25J53R1N6m3
2316A39k75KJ42k43OJ43J93r3L2L9n1j24J22m6L9j7J8J8p5M6k0o2K8k9K3m0K8j14k9J89ll
$$ plain form
4241 41 11 -92 25 54 -72 -110 155 63 22 -5 12 -10 -21 -26 82 -10 -14 -11 31 8 -102 -17 50 -77 -51 -95 25 73 -14 -61 -113 -28 -4
3952 -4 -69 -47 -98 -110 58 6 43 -133 23 -57 123 -135 -62 -17 -19 -104 38 -21 39 -67 79 -15 -14 3 -61 82 -105 56 -36 -23 -10
3681 -10 -27 -35 -4 -113 -180 -22 8 79 -148 46 169 -38 -26 10 -29 -28 10 48 12 -64 -24 -7 89 129 2 130 152 36 -91 -146 6
3410 6 -42 90 -60 146 85 43 -103 -100 103 2 70 19 121 42 -76 -92 -50 90 -70 -137 -25 -165 -136 60 28 -52 -77 -56 -93 -21
3147 -21 -39 -4 30 -3 41 2 -98 76 6 -31 -94 -45 -144 0 -123 -214 -201 13 172 -97 -94 -53 -46 25 -6 -11 -39 -124 -55 -10 35 135 81
2859 81 15 -26 39 -15 -33 118 -76 17 -161 -160 16 -37 -76 73 8 -66 -177 -48 -80 -38 -64 -49 -36 -22 -21 -43 -57 55 -196 -63 -84
2587 -84 58 -105 -22 149 -84 16 -161 -155 -92 -143 -86 61 -90 -121 28 -22 -73 -78 -84 62 11 15 -52 -56 -140 7 -118 35 126 182 139
2316 139 -136 -134 8 -235 -229 -86 107 14 46 85 34 -90 32 -14 25 8 26 44 -31 15 -5 -67 -39 -68 -45 -85 -57 -171 -200 -11 -14 -17
2036a7J7k3o1J40J8j85J21R7q2l4N4j15R0j13M3R1o2RQo3O4j79R8j6L2N7%k1J25m6M3o9L0
1747E1K73j47l3m0q8j56m3J61l6mK0O2q8K3J02j23J6J50j82K6N6R7n3q2l3M9r0L2P6m0m0n2
1467a36J20K4K6Lm5J05K5r9J3j70J93L5j43n4Q5J25m7j3O8J05k03P2j05n5K13j90n5N2k8l0
1205a09J9P0O1q0l3M3n1j4R8q8m1L7J4J9J21j02J0K5J7K26j26K0r5j50Q1m6l0mP8j9j00J33
925a6j2N4j22Q3J30r7k16J54J54L2o2j12o6J12j64k6K50O8j49J8O9n4j02K92l40J43j71K42
680I2j8r6N0M6j06P8J7l7J62l15J22M6q3j05J0K81j09q0k4k6M7j28J85M0l4l2N5l9r7R2k4
408c0JP3%J8p9o6K8k2P2j0M5j13JQ0p3J55j63p5K41j39q3J20Q4j09j2j75J60L9R9J7k10M6
128h0n9Q4P6r8K09j85J70j72R4j33R4L7K9N8j03j49N3N9J07j09L8o8N4j04J31Qj34K12q7j27
$$ plain form
2036 -17 0 -23 -84 56 74 -111 10 107 25 -9 45 -70 20 -93 -50 41 -21 -12 -4 -67 -3 -182 -84 -100 -68 -11 -11 -32 93 47 90 21 51
1747 51 324 177 144 104 16 -140 -183 -22 -58 -62 -42 20 -68 -45 57 -66 -50 100 -82 -56 0 97 44 -38 -71 -22 -112 -80 -4 -44 -84 -136
1467 -136 -16 8 34 37 -8 97 122 23 36 -134 59 94 -49 -103 -18 107 60 47 115 220 17 89 -16 -71 142 -48 -103 -51 -79 -109
1205 -109 -90 -20 41 -39 -72 -29 -80 -94 4 -84 -125 -88 -74 -55 66 -36 -26 -1 16 242 116 136 41 -109 -28 -74 -104 -108 -30 -49 -149 -16
925 -16 -28 26 -96 -13 117 20 -196 -42 112 144 82 -30 -96 16 -148 -174 76 144 -5 13 82 28 -74 218 -122 21 -150 92
680 92 74 -22 28 74 -32 46 63 26 188 -127 -5 41 -42 -147 -137 144 35 -45 -69 -95 -48 -176 9 49 15 -17 38 -1 -98 -6 -30
408 -30 -29 44 44 62 -17 -83 -55 -77 -5 -15 30 -83 -82 -2 -75 80 -83 -158 83 -56 -139 -19 65 -44 -56 -231 -71 -32 67 84 -126 -80
128 -80 -139 -55 21 -77 132 -53 117 -55 39 -94 0 37 66 124 21 -128 -75 -16 91 -18 20 -48 6 -98 33 41 -93 119 32 -95
-134i5k2Q8oO5Kmkjj26R3r
$$ plain form
-134 -95 -117 -29 -35 30 32 28 26 25 -101 -8 -17
-230a7
##PAGE=	F1=22816.5
##FIRST=	23146.755397984237788,	4241.1433691826614449,	0.33912587165832519531
##DATA TABLE=	(F2++(Y..Y)), PROFILE
4241F6l6j24J44K5j68PK74j24J2k6J5j8n7K3J14j22l7J8Q7J1j51R1K1j32J00j06J07R8o0o7
3979a5j2k3M8l8K9m3lJ07m7R3k37J35l0J64k24J2J04k1j02J58o5P0o2J40j44K1l7k5J38j60
3716f9J30n7kM3k6n6N1j03l9P9L6J00k31K22J28j99k0k1K4qK8J7J7j29M8L7Q8J7r7J03N3j01
3436F3j66n4J64J6Q7j93K04on2j64L9J67r6O7p2J39j02j01o1N8J49j39m1J00j58K4J91m8m7
3182c2n4K5j4P8kK3rk3Q6n6q6J77j08m6l7J5q9J73j84q3P4K18J30k40o5P3pJ00n3j8km2O6
2894a2N9O0R7q1j15j8J6m3k1J31j38L8j39OJ53j6m1J30o7n8n8N3n7Q3k4k4N7j1O7n0q0J36
2614C3k25J28J0Q1p8K4J37k21O2j19j4Q4m5L7J15j43j6J54l3n1M0m4N3M4j8q2K3j11K12j24
2351h7J52L5J6L7k36LK2k12kJ25K06p3J9K3mj16O5n7Q1J6rk9m9Q8o2o2nj0M4k0rn9m3J92p9
$$ plain form
4241 66 30 -94 50 75 -93 -86 188 64 76 50 65 47 -10 13 127 5 -32 -14 73 84 -67 24 45 -87 13 -93 14 112 52 -15
3979 -15 -27 -50 -2 -40 -11 -54 -57 50 3 96 -141 -6 -36 128 -96 -84 20 -1 -103 55 -10 60 -2 138 -6 15 -22 -47 91 -69
3716 -69 61 4 2 45 19 -37 14 -89 -128 -49 -13 87 -144 78 206 7 -13 -34 -10 -18 10 27 44 -85 -37 0 88 105 8 111 164 63
3436 63 -103 -157 7 23 110 -83 121 115 63 -101 -62 105 9 76 4 143 41 -60 -121 -63 86 -53 -94 6 -152 -128 63 15 -32
3182 -32 -86 -61 -75 3 1 24 15 -8 78 22 -64 113 5 -41 -78 -63 -152 21 -163 -246 -172 46 176 -64 -129 -56 -63 37 -16 -34 -36 -78 -12
2894 -12 47 107 204 123 8 -10 6 -37 -58 73 -65 -27 -166 -160 -7 -23 -64 66 -1 -59 -117 -64 -121 -38 -62 -86 -29 -40 27 -23 -103 33
2614 33 -192 -64 -54 27 -51 -27 110 -111 -49 -168 -182 -98 -143 -106 9 -134 -150 4 -29 -80 -40 -84 -31 13 -5 -87 -64 -175 37 -87
2351 -87 65 100 116 153 -83 -80 -58 -270 -272 -147 59 -14 5 28 24 -92 -27 -84 -3 13 4 -25 -74 14 -48 -110 -115 -125 -81 -101 -110 -169 -212 -20 -99
2045i9K8L4m3J4J18l7j37Q7Q6r2k8J6o9P4m3J3J06p3L8n2l%k11J30L3RO3q7M4R5nO3r9M7K42
1738B62r0qp7p8j45l3M5kJ8L1J38j15jJ11j42L7J31j76oP7N9j9r0n5M4p0P6L9n3m0l1J20K9
1450a4K9Qj05R4P8j26J9j31K05j6j44rR8N5n4K5R0P7k45J20j02o1K31j36j24M0k4KKJ1J11
1178Dn9Nm2k8QM5o2L0RK1l9J20q9K9J3L5K35j44Kr4r2O9j01J7k4Q9J0j02Q6k7N5p4Q2J17j44
872d0j72J37J56N2r6o3n8O7j72m4K56Q8j66K6P1J0j88L09k85J48j69K10Jj00L8N3j00J08o3
618A4o1K24k66O4N6o0j60P9K69j23j22j2kP8j47J20R3o3RK0m7r5J34j1k0O0JL0r7n5J9L8j1
330d4l2J03r6n1J03q6J44j17j16K54j04j03J42O3j42N6k05J78J5M3M3j02J0r4P4L3n9K15k03
76g8J32r3P6p5M4J7P1J1j03j64Q3K8J34j15K6q1R0j16R8O1j28K33j22j16m4R7lL2N6j0j6M
$$ plain form
2045 -99 -71 -37 -80 -66 52 15 -122 -35 51 -41 -69 -53 -122 -48 -91 -78 28 -45 -7 -59 -62 -62 -273 -143 -110 -101 -38 -125 -81 14 9 72 -27 20 262
1738 262 172 164 87 9 -136 -169 -124 -126 -108 -77 61 -54 -55 56 -86 -49 82 -94 -100 -23 36 17 -73 -128 -84 -154 -78 -39 -92 -132 -163 -43 -14
1450 -14 15 23 -82 12 90 -36 -17 -148 57 41 -103 -112 -14 41 -13 12 102 179 -66 54 -48 -109 122 -14 -138 -98 -122 -120 -118 -107 4
1178 4 -55 -50 -92 -120 -112 -67 -129 -99 -90 -69 -108 12 -77 -48 -35 0 235 91 93 -1 -93 -24 -125 -108 -132 -43 -33 -135 -49 -76 -21 -95 -13 104 -40
872 -40 -212 -75 81 133 37 -26 -84 -17 -189 -233 23 111 -55 -29 42 52 -136 173 -112 36 -133 77 78 -22 16 69 -31 77 14
618 14 -47 177 -89 -25 31 -29 -189 -110 159 36 -86 -98 -100 -22 -169 -49 44 -19 -10 10 -37 -132 2 -9 -29 31 32 62 -35 -90 -71 -33 -44
330 -44 -76 27 -69 -120 -17 -103 41 -76 -192 62 -42 -145 -3 60 -82 -26 -231 -53 -38 5 48 -54 -44 -138 -64 -31 -90 125 -78
76 -78 54 -39 37 -38 6 23 94 105 2 -162 -79 -51 83 -32 -6 -87 3 -113 -15 46 -82 151 29 -87 -131 -34 -37 -5 51 41 25 29
-204B9j14P9K
$$ plain form
-204 29 -85 -6 -4
-230d
##PAGE=	F1=22769.3
##FIRST=	23146.755397984237788,	4241.1433691826614449,	0.34318113327026367188
##DATA TABLE=	(F2++(Y..Y)), PROFILE
4241F7l0j34J60Qk05N4K50j40O3k7L2Pj24L3J25j41p2L3J29M2j77O5Lj07J35j30O2J12%n7
3979C6rj16O7j4L6l4J9N8o1J30k31O9LJ29j86NJ58m9r3J49q3O8JJ06j42J9q6K5J11j06N2k1
3699A0oQ2n6m5jo0nML9J27k06K31R5j46n9q2Q6j6J8nQ3j70M4M4O7k2m4N5R9p1j93m2J64P0
3401H9M1k35J81K9m2j62P5J30p7P7j04J63j26q3r1Q9J22j05j9Q6j77J9J89o0m0n9K9MQ5J4
3139D2Nn7K3Q5m1q6J54j21l3m0pp1J66j67q9J18J89O9j87j09R3J5J24p6m4J3%O1P5P5R4j09
2859A64j52J8l2l3l6J00q3j8p4L7O6L8k8P5k7p7K6Pp5Q3km4P6o1J21m3j50J54j89Q8N8L9j7
2570Ij1J06k08M9q5n4Q3J0J4P8r6nJ10j5m9J07o1n3P9j6p5O6j27K09j10J44k4j3J31j98Lr5
2290i7j78O6J02J61o6MMN2j01J4n9J14M3l7p5j5J38r9n8o9N7M7j9n3L6p6J74j37P4M4p1O1
$$ plain form
4241 67 37 -97 63 71 -134 -80 170 30 93 66 98 105 -19 14 139 -2 -74 -41 88 130 -47 18 21 -86 49 -81 -19 93 93 36
3979 36 27 -89 -22 -36 0 -34 -15 43 -18 112 -119 -50 -47 82 -104 -99 59 10 -83 66 -17 51 52 158 16 35 -51 -26 85 -21 31 10
3699 10 4 86 30 -15 -16 -76 -81 -77 -38 89 -117 114 209 63 4 -78 8 -8 10 5 88 -82 -38 6 73 51 7 62 161 90 -103 -145 19 89
3401 89 130 -105 76 105 63 -99 -24 106 29 106 2 165 39 -44 -135 -46 76 -29 -48 38 -139 -120 69 9 -31 -90 -61 -57 28 42
3139 42 47 -10 13 98 57 -29 125 4 -29 -69 -76 -147 19 -148 -237 -119 70 139 -48 -157 -64 -49 75 -1 -45 -32 -32 29 104 179 273 164
2859 164 12 30 -2 -35 -71 29 -54 -72 -146 -109 -43 -5 -33 42 15 -62 -36 -29 -104 -21 -23 -67 9 -52 69 26 -124 30 -159 -71 -13 26 9
2570 9 -2 104 -104 -55 -140 -194 -111 -101 -87 -9 -105 -110 0 -15 -64 43 -18 -71 8 -8 -83 -17 -144 65 -45 99 75 62 193 -5 -2 -97
2290 -97 -275 -209 -107 54 -12 -8 -4 48 -53 -39 -98 16 59 22 -53 -68 70 -29 -87 -156 -99 -52 -71 -124 -88 -164 10 -127 -53 -9 -80 -19
2010a9O6o9p1M5O8r2j1l8J0N4K4l0J09n2J7r8P0m0k19J39N8rP2j47Q3N4K3Q0j28N2J98l1J7
1721A85r5m6j28j5p1L3M0M1K15j43m3J01j27M4J01j35o0P5M5qq0n6L3n5J11M1p8n5J5R5J2
1450hJ0J0j22P3J20j45L1j11J96m1j21N4P7ln0K4P1Q2k57J74r2n1K17r0j97M5mJ8l0%R8k1
1170d3O0j34L6J8k0m2R3k5K4n9P5n0K4K8L1J79j15kq2m9L8j59J08o8P8M0j05N9k2M8l4Q0J05
881A15j67j02P9J18R2j58K7q7N3j49o7K11J19j72M9M2O3k34L16k40J33j07J50qq0KO7q5J13
627I3q8p1K23k10J5N0nj93J22K48j47j43J9JR0j53O4J49r5N1j5m2q3J46J6n6L1lL8o2p3KR1
338A0p6l6J08n0j08J20r6J36r1j26K35k1j37J50M2j27P5k32K04Jk5N7J9j2j63P6j3k4K31k12
76h5J07n1O2j6poJ42n6j16j13O3mJ64j16k7j8P1j05L3J36j38K39j45r3n3J17k5k4J10j6j8
$$ plain form
2010 -19 47 -22 -93 -48 20 -72 -83 -121 -111 -57 -33 -63 46 -6 11 -87 -17 -57 -276 -137 -79 -88 -16 -163 -80 -26 -3 77 -51 1 199 168 185
1721 185 90 44 -84 -99 -170 -137 -97 -56 159 16 -27 74 -53 -9 92 -43 -103 -28 17 9 -71 -127 -94 -149 -38 3 -75 -130 -115 -20 -8
1450 -8 2 12 -110 -37 83 -62 -31 -142 54 13 -108 -54 23 20 -30 -6 65 147 -110 64 -28 -79 138 48 -149 -104 -108 -90 -120 -120 -22 -43
1170 -43 17 -117 -81 -63 -83 -125 -32 -57 -33 -92 -17 -67 -43 -15 16 195 80 78 -4 -53 -15 -174 -66 -134 -56 -16 -121 -62 -84 -36 -70 10 115
881 115 -52 -154 -75 43 135 -23 4 -83 -30 -179 -246 -35 84 -88 -39 3 66 -168 148 -92 41 -66 84 76 -4 -2 65 -20 93
627 93 5 -66 157 -53 -38 12 7 -186 -64 184 37 -106 -87 -86 4 -149 -85 64 -31 20 5 -37 -120 26 42 -14 17 14 52 -10 -83 -81 10
338 10 -66 -102 6 -44 -152 -32 -128 8 -83 -209 26 5 -132 18 60 -67 8 -224 -20 -19 -44 13 32 20 -143 -67 -80 -104 127 -85
76 -85 22 -29 33 17 10 4 146 90 -26 -139 -76 -80 84 -32 -59 -77 -6 -111 -78 58 -80 159 14 -79 -132 -15 -40 -64 46 30 12
-195A2K2r1P8J2
$$ plain form
-195 12 34 -57 21 33
-230C3
##PAGE=	F1=22722.2
##FIRST=	23146.755397984237788,	4241.1433691826614449,	0.36972165107727050781
##DATA TABLE=	(F2++(Y..Y)), PROFILE
4241G2m2j22J79nk37P2K31j52P7j0L9M6j67rJ63j42o3JJ67K1j56J7J8o1J21j25LJ10O2j0k6
3970G2j70M3K2K9k7L9L9o3J02j61J4j6J02j43L7J68n9o7R8j09O8N3N0q6lp3P7N8q9k4J8QJ05
3681A12j25K1o2MKn7M6J25j67K24K9n9j03j17J35l3J6rJ32j66K4O9Rp8L4jJ43o0j63n6J52
3410B1J26k5k20J22M6j7j94J38Q8q4J51j50J49j39n8p1R2R0p8qO4j72J5J90q7m7k9K2K9N1
3147A5J6L0j16O3O7J3j10J27j26Or2nl5J32j00q6J30J19J4j35j19J05P4P9q4j8%JP8R6Q4Q5
2867C08j65j57L4k1o7m2J03m5o0k1N3k2P4NL7J5j22J12k6o4O4LnJ3j06J42mj81J63j70K8J16
2587hJ9roQ1j75P3j03r7R3O1QM4k8k0L7Rn1J67o4r4L9K6p7P8j11J58p3R5n8LJ71j54nj43j63
2281b77J48P6Q7n6Pl7P6n1l5m4J25O2l8j02pJ78j17n5j23J37rj4p9J40j35J68j60J24J4j00
$$ plain form
4241 72 30 -92 87 82 -155 -83 148 -4 73 63 102 148 -19 -28 135 -7 -70 -69 98 119 -37 -20 -2 -63 58 -67 -64 46 108 98 72
3970 72 -98 -55 -33 -4 -31 8 47 -16 86 -75 -61 -77 25 -118 -81 87 28 -39 59 -50 18 71 121 35 32 -41 36 94 5 -19 -1 7 112
3681 112 -13 8 -54 -50 -48 -105 -59 66 -101 123 152 93 -10 -127 8 -25 -9 -18 114 -52 -28 41 50 -28 6 5 148 88 -75 -131 21
3410 21 147 122 -98 24 70 53 -141 -3 85 1 152 2 151 12 -46 -117 -25 65 -13 -21 43 -129 -114 76 -11 -58 -87 -65 -36 15
3147 15 31 61 -55 8 75 88 -22 105 -21 -15 -107 -112 -147 -15 -115 -201 -71 48 62 -73 -192 -87 -13 66 -18 -36 -36 -35 43 139 223 308
2867 308 143 -14 20 -1 -68 -110 -7 -52 -112 -133 -80 -102 -28 -23 14 29 -93 19 -7 -71 -7 -4 -9 4 -102 40 36 -145 18 -152 -124 -8
2587 -8 11 2 -4 77 -98 -25 -128 -225 -132 -71 -63 -19 -47 -67 -30 -21 -72 95 31 -63 -24 2 -75 3 -108 50 -23 72 14 17 188 34 29 -114 -277
2281 -277 -129 -53 34 -22 -15 -52 24 -27 -62 -106 19 81 43 -59 -66 112 -5 -60 -183 -46 -55 -69 -148 -8 -143 25 -135 -11 3 -97
2019i7J04mp2K8l7O1q6J1j05J04L9M6m7Q3J0n4r8J25m5j92Q1O6rN6j44R8PK6R9j26L9J52J3
1730A32K6p2k5q3k6j60Q1O5K5K31j17q3M4n5L2Q3j06q5M3O8k8q2m6N0n7J27O6j00p8O9N0q
1450a9rpr8M7J40j38N5j20J83n8o2J01K3l7l7J2L6Q4k07K05r9l3J72n9k25N1J4J4n1K6L8J8
1170d0J14k03Q2K7n1l4J25n0L0l1k9J8LK8L5R4m4%l9o8oj83J83q2L2O4r4N6j0K4nQ7J01j80
872d6l3K9O3J20j99J13j49M8p3j08J40J65j50M9NO3k06K87j98J19l8Q9l8m5k7P5o9R6m0n6
610a4J72j90j5L9O6j98J15K34j65j36L6J3N7j27K1J95j21O4l5j6p3J37K9q4Ol3O2J3j03j7
347f8Q8q4j1N5Pj35J41j48J64q6j08J81M6j39J39L8p9M0k55K26J6r4N3J09j4k45J16k9k7K46
85A43k16R1n5O9j4rrJ97j36j22j0MnJ60r0q2N7J8n7n9J83j41J96j27n3k9J31p1q4J36j4OL9
$$ plain form
2019 -97 7 3 -69 -41 -78 -17 -103 -92 -197 -93 -54 -8 -55 28 38 -16 -114 11 -34 -226 -145 -79 -88 -32 -176 -78 -71 -45 54 -72 -33 119 132
1730 132 158 86 61 -22 -48 -208 -127 -62 -37 194 77 -6 38 -17 15 98 -8 -93 -50 18 -10 -92 -138 -88 -145 -18 48 -52 -130 -61 -11 -19
1450 -19 -28 -35 -133 -86 54 -84 -29 -149 34 -24 -86 15 38 1 -36 -24 12 96 -111 94 -5 -38 134 75 -150 -99 -85 -71 -122 -96 -58 -40
1170 -40 74 -129 -47 -20 -71 -105 20 -30 0 -31 -60 -42 -39 -11 24 118 74 74 35 -33 -39 -222 -39 -121 -89 -25 -119 -63 -73 -49 -54 33 134 -46
872 -46 -79 -50 13 133 -66 47 -102 -54 -127 -235 -95 70 -80 -31 -26 37 -169 118 -80 39 1 90 52 7 -20 55 -14 82 42 -14
610 -14 158 -32 -47 -8 58 -140 -25 209 44 -92 -56 -43 14 -113 -92 103 -18 46 11 -5 -78 59 88 4 10 -23 39 52 -51 -68
347 -68 20 -64 -75 -20 -13 -148 -7 -155 9 -77 -185 -4 42 -97 42 80 1 41 -214 12 28 -66 -13 96 82 -163 -47 -76 -103 143
85 143 -73 18 -37 32 18 9 0 197 61 -61 -71 -67 -72 88 -2 -84 -27 -9 -66 -125 58 -83 113 -14 -67 -96 35 -36 -120 16 2 8 47
-204D7q0Q0j1
$$ plain form
-204 47 -33 47 36
-230C6
##PAGE=	F1=22675
##FIRST=	23146.755397984237788,	4241.1433691826614449,	0.39626240730285644531
##DATA TABLE=	(F2++(Y..Y)), PROFILE
4241G7n4j10J95k2k44O5K16j63Q2oL2P3j50p1K07j39m2j8J71l0j19j5O1l5Q2r5l5Q0J10K2
3979A25l2j63k2O8J8k1N4J4l9K4n9qp2Q8r9P2J37k8m7M1j30P1O7Pk7k0k3Q6L2r5p3L5K6J32
3681A39j96Q8j18P3j9o7L6J07j29K17m7J5j17j17J63o9J8nJ39r7j3P5l6j24J20m8J66o8j23
3427c7o2J55J50j01j66M8M8Qk26K00M7p8K36k08J23j55l5k8P1O1n0%M0j42j2J92j10n4KJ4
3165f9N4J5J4P9k00J07N1N6j46J24j08L1j60K2k4J09k3n5Q9N7l0r5q9P8J41K0j07L4J6l5J06
2894F2R4P0R7k01j64N3j1j00l2J22n6p0mQ1n3N4J9L2N6j67J71l9l2J8J1L7m8j51J56L1j59
2622a23J44j56l6J50K3lnN4j46J21j44j34J12O7L6M5mk7k7Pk8K16p6p8o0R5n7M0o9J02l9M0
2342D0r5M7J57j09j4j17j51J90N8J2m9Rp9J02ko5qJ05M9k9j16j1K07j30l9j39K08j01Lq3K14
$$ plain form
4241 77 23 -87 108 86 -158 -93 123 -40 42 36 68 141 -9 -80 127 -12 -54 -72 99 69 -50 -65 -4 -39 43 -52 -87 -7 103 125
3979 125 93 -70 -92 -24 -6 -27 27 41 2 26 -33 -41 -113 -25 -124 -52 85 57 10 51 -79 -8 59 66 39 19 -4 82 114 19 -54 -19 7 139
3681 139 -57 31 -87 -14 -33 -100 -64 43 -86 131 84 99 -18 -135 28 -41 -23 -28 111 14 1 76 40 -84 36 -12 154 86 -37
3427 -37 -99 56 206 105 -61 -13 35 43 -183 17 64 -14 222 14 137 -18 -53 -81 -10 51 1 1 41 -101 -113 79 -31 -85 -83 -69
3165 -69 -15 0 14 93 -107 0 51 107 -39 85 -23 8 -152 -130 -154 -45 -68 -123 -34 23 -7 -102 -191 -113 28 48 -59 -25 -9 -44 62
2894 62 156 226 323 122 -42 11 0 -100 -132 -10 -66 -136 -140 -59 -112 -58 -39 -7 49 -118 53 14 -18 0 11 48 0 -151 5 36 -123
2622 -123 21 -135 -171 -21 2 -1 -6 48 -98 23 -121 -255 -143 -76 -40 5 1 -26 -53 -46 -74 142 66 -12 -72 23 -34 6 -63 39 0 40
2342 40 -55 -8 149 40 26 -91 -242 -52 6 18 -31 -22 -101 1 -1 -66 -74 31 80 51 -65 -76 131 1 -38 -177 31 -70 -67 -150 64
2071F4j93J63j44J64m5j10J19n3p7J21j05O5q2L1j51J69L7L0l6L7P0j29o9J30k2j37J3O1j2
1817i1L7j20Q5j1PJ20j20K6J05N9L5o3j4l5k7j97J01Q9RJ81m7j20pLJ0P3p2o8l0R5m3q7l9
1528a56R6q2J11J07j12q8R8K8k6k8l7l7OJ44j31P9j29J71p3%J14j9n1lj1j1J00j42K00r5l5
1257a2J09l2k09N3K9Rp2O5j0L8J50k11P6J1k8k3P9n0O1Rj22Q0k6j1P9MK2OOj19l3j54J99q8
960a15pQ9q4N2Mj3J1J04J05j68J2j6J5J24k16J85k28N6J5j34Q3J88j04M0m4K4j37K51j59Q9
697B2J7O3q0on4Q5n0N1K8lQ3j93j9M2J08j60O8K24j82j03K7J7J6o6J2K00j41N0l2No6J29M2
408A34j10k1o5Q8J01j23n9O0n8M6l4K9j15J62j95J94q2q8J08R7j16P3P5l7Pk75K46K8j22M1
146a1J30ol04J79j7q4K79k03O1p5Q0n5J6J6K09j79j09O5m1RJ52o6j13J06m5k1j14K16j55J42
$$ plain form
2071 64 -129 34 -110 54 9 -101 18 -35 -112 9 -96 -31 -113 -82 -233 -64 -27 3 -33 4 74 -55 -124 6 -16 -153 -140 -79 -91
1817 -91 -54 -174 -89 -100 -93 27 -93 -67 38 97 132 69 55 20 -7 -204 -103 -14 -5 176 129 9 2 5 15 88 16 -52 -82 13 -30 -117 -156
1528 -156 -60 -142 -31 76 -36 -124 -26 2 -24 -52 -89 -126 -120 24 -107 -28 -157 14 -59 -59 55 36 -15 -18 -29 -40 60 -82 118 23 -12
1257 -12 97 65 -144 -91 -62 -53 -125 -60 -70 -32 118 -93 -17 -6 -34 -57 22 -28 33 42 -80 0 -26 -37 42 46 68 74 80 -39 -72 -226 -27 -115
960 -115 -122 -33 -117 -65 -61 -74 -63 41 146 -22 -10 -26 -11 113 -103 82 -146 -90 -75 -209 -126 62 -42 -2 -46 -22 -159 92 -67 22
697 22 39 102 22 16 -38 47 -3 48 76 73 156 -37 -56 -14 94 -66 2 226 44 -59 -32 -15 1 -65 -53 147 6 56 24 29 -37 92 134
408 134 24 3 -62 26 127 4 -55 5 -53 -7 -41 -12 -127 35 -160 34 -48 -136 -28 69 -47 26 101 64 71 -204 42 70 -52 -11
146 -11 119 113 -191 -12 -29 -113 166 -37 24 -51 29 -26 -10 6 215 36 -73 -8 -49 -40 112 46 -67 39 -6 -27 -141 75 -80 62
-117F2q7l6lJ51j14j39J23K7K6N1p0Q1l3
$$ plain form
-117 62 -25 -61 -64 87 -27 -166 -43 -16 10 61 -9 72 39
-230C9
##PAGE=	F1=22627.8
##FIRST=	23146.755397984237788,	4241.1433691826614449,	0.30202507972717285156
##DATA TABLE=	(F2++(Y..Y)), PROFILE
4241E9n3j09J97Mk26J3J93j60Q1%J1Q4r3j32K42j34K2m2J15n4r4k3J22m1K8m3n1L4J00N3l1
3970G2q7j17J17mJO3Pj3p1K1J1j28R8q9R4O5J4k3K1j27L4O6k1L1l1K7O5L1j22o3K8N0J26k32
3672h6J15j11J04o2k3pJ07j15K15j37P5r2q1J37j11K6K5J00kl8Q2m7j81J89q9K04j05p5o4
3419d7J49J27j35j07J8J9K2k36K08L1n4K60k47Q4r5n6K5M5O0l5j4j1q4j7J77j10p3M1LO4j8
3147fqJ39k53J00N8P8j64J49r6K7k11P2k5J04Qj3PN3n8p6m4N5J81m3j30Q3O4q5J05R2L6J03
2867C02k05j52N7rr9j2J33q7m6l3R4k0k0L9N3P5j96J85o0J8%J2O8j08j61J63L5r8J10j41o2
2596a65J17N8Ok1L4r3J45j73j39R8K1P9R1k4k5o3j3LK21p1m4j34J44j7m6l9J07l0qj12Q1R2
2316H0n9Lo3j41J69N8k5o3J5r1P1M6k4k5J14Kj8j07J1J63j27k7j08K58k17K0m5K28k33J91
$$ plain form
4241 59 6 -103 94 98 -128 -115 78 -82 -1 -1 10 94 1 -131 111 -23 -1 -43 72 18 -76 -99 23 -18 10 -33 -84 -50 50 103 72
3970 72 -15 -132 -15 -19 -18 45 52 39 -32 -11 0 -128 -30 -119 -25 40 54 31 52 -75 -41 25 4 35 4 31 96 127 5 -58 -30 20 146 -86
3672 -86 29 -82 22 -40 -63 -70 37 -78 137 0 75 -17 -98 39 -72 -46 -21 79 77 39 121 74 -107 82 -7 197 92 17 -47
3419 -47 102 229 94 -13 5 24 46 -190 18 49 -5 255 8 92 -3 -59 -34 11 71 36 22 11 -73 -90 87 -23 -96 -55 -52 12 -6
3147 -6 -14 125 -128 -28 30 108 -56 93 -3 24 -187 -115 -140 -36 -28 -41 -34 19 -39 -115 -159 -104 77 34 -96 -13 51 -34 71 163 199 302
2867 302 97 -55 2 -7 -106 -118 15 -72 -118 -151 -57 -77 -97 -58 -5 70 -126 59 -1 17 17 29 97 -11 -172 -9 26 -72 38 -103 -165
2596 -165 -48 10 16 -5 29 -64 81 -92 -231 -133 -112 -33 58 34 9 -54 -67 -64 157 86 42 -92 52 35 -11 -50 57 27 19 -93 -12 80
2316 80 21 24 -39 -180 -11 47 22 -41 -26 -117 -46 0 -24 -49 65 67 49 -58 -47 116 -11 -38 -146 112 -105 -85 -130 98 -135 56
2054E6j11J67r2j13J05p8n2J70j37P5r4N3j63J70L1j2k%J02j69MO8J0p2m5O6n7L7r4Q1j9j0
1773a25J31p8nO0O9O6p0l4J7k6j90J12J05j8Q7P1j64l7O1m1Q5o0j8q3J07o8q3n9J44q5Q4J04
1493E9q4j14J04L6o8Kn6Oj9J13p6P3j32J77r7M6R7m6l9M0m9k6R9p7J42n4n8L7Pj65K8N7j2
1205d9n3J08n5K6J55j90K0OK4j1Lm6J12M6j73J06n5n7J36p6J02J3Kj49o5q9J53p3l2J05n8
933a14M3J9k8j2J05J06j07J7k6j8J01j78J77k61O8R0j67N6J90o4K2m2n3o7K16j30N7K5N3r4
671a6M4n3P3n4J7P7N4Rk26QN7J02j14K2K24j83o0lL3j0k0J9J68j36K0k2J6m7J00N8j19l8j01
382a01J37J42j15r0J5j8J00j17J7p0J61k19K18p8o1M3Q5o3KJ39l7qk73K35N8j09J8Q0j2k90
120b11K40nj55L15j68K7p8P4j28O7K2J70j68q0J06m6K7J39o2j02J05r4Oj13K12j70O4qk4L
$$ plain form
2054 56 -55 112 20 -93 12 -66 -118 52 -85 -10 -104 -51 -214 -44 -13 -25 -27 -27 75 -94 -90 -22 -12 -84 -129 -63 -120 -83 -177 -96 -115 -125
1773 -125 6 -72 -77 -17 52 118 48 14 31 5 -185 -73 32 14 101 172 8 -29 32 -9 76 16 -2 -85 22 -46 -129 -188 -44 -129 -45 59
1493 59 -25 -139 -35 1 -67 -65 -121 -115 -134 -21 -97 -24 -156 21 -76 -30 67 21 -18 22 -27 -53 46 -31 111 57 -1 36 43 -122 -94 -37 -49
1205 -49 -102 6 -49 -23 132 -58 -38 -32 -8 -19 -16 -62 50 96 -77 29 -26 -83 53 -23 79 92 94 -55 -120 -209 -56 -129 -161 -56 -114
933 -114 -71 -52 -80 -92 13 119 12 29 3 -15 86 -92 85 -176 -108 -18 -185 -129 61 -3 19 -23 -76 -143 73 -57 0 25 78 -16
671 -16 28 -25 48 -6 11 88 142 151 -75 -67 -10 92 -22 0 224 41 -19 -22 11 1 -19 0 168 32 52 30 46 -1 99 157 38 0 -101
382 -101 36 178 63 -27 -12 -30 70 -47 -30 -100 61 -158 60 -18 -79 -36 49 -14 -12 127 90 82 -191 44 102 -7 11 91 79 -211
120 -211 29 24 -131 184 16 43 -35 39 -89 -22 0 170 2 -78 28 -18 9 148 86 -16 89 -5 1 -112 100 -70 -6 -14 -38 -35
-143c5J38r8j91P0R4K4P0p5O8l7
$$ plain form
-143 -35 103 5 -186 -116 -22 2 72 -3 65 28
-230B8
##PAGE=	F1=22580.6
##FIRST=	23146.755397984237788,	4241.1433691826614449,	0.20778799057006835938
##DATA TABLE=	(F2++(Y..Y)), PROFILE
4241D0n0j09J99K9j95k6J70j58P9Pl4P1j1j69K64j41Q6o5P1o5p1l1J72o1k5Rm7RO9O4l3j5
3961C3j88J43k4K6P2%J8j61O1P1j69J24j03R2J8L1NMj00K0L6k9M9l3P3M0M0j40j9LO2J09k19
3672e5Q1o7R0q8L7m2J16j26J86j86R5n0k8J12j53L2N6N0Q0o4R1l1k09K29j59K46j39l8l2J29
3410A63Q9j70m8RJ0L6k46K17J5n2K65k74N8l7p6O2NR5l2k5n9k1j6J20p0q7Q2k7N5l8j2J69
3130A60k58P8N3J09j73J78q1j5k22J04m4J26j5L5o9P7n8p2j5O7J42o1j55J10J40j39J02O7
2885A71k2J19j97j27P3jq9JJ38j18j9r6J17L4p4K0Q2N2j88J94q7Q3ojQ8j52j54J72ll4P9j04
2605d9o4M1R6J4m2J8l7J42j82j02P7m2J05J23n5j0q8l0L6J96m9k8j48J76Qj38j2J37m3l4j06
2334i0R8Rl3M4j3j33J24L6j9q0L5q6K7Q3J5m1J23m5qr6K0J07j19om0K64l07J1K3J88k31K12
$$ plain form
4241 40 -10 -119 80 109 -86 -112 58 -100 -21 -14 -48 23 12 -157 107 -34 52 -13 58 -7 -78 -109 63 2 -23 -14 -61 -52 17 81 48 33
3961 33 -155 -12 -36 -10 62 62 80 -81 -20 51 -118 6 -97 -5 13 44 49 53 -47 -27 9 -20 29 -4 69 109 149 9 -10 -7 55 164 -55
3672 -55 26 -41 49 -39 -2 -44 72 -54 132 -54 41 -9 -37 75 -78 -46 10 60 140 76 167 136 -73 156 -3 243 104 66 34 163
3410 163 252 82 34 43 53 89 -157 60 75 23 288 14 72 35 -41 21 26 121 89 64 5 -16 -32 88 18 -69 13 -14 41 3 -9 160
3130 160 -98 -20 33 142 -31 147 66 51 -171 -67 -111 15 0 35 -34 43 -15 -87 -102 -35 107 46 -109 1 141 2 104 171
2885 171 149 268 71 -56 17 16 -73 -72 66 -52 -71 -167 -50 -16 -90 -70 12 64 -124 70 -17 66 60 59 147 -5 -159 13 10 -24 55 -49
2605 -49 -113 -72 24 38 -4 14 -23 119 -63 -165 -88 -130 -25 98 43 33 -55 -85 -49 147 98 70 -78 98 106 -32 -44 93 50 16 -90
2334 -90 8 17 -16 28 15 -118 6 42 23 -57 -22 -108 -81 2 17 -24 99 54 46 -50 -30 77 -42 -48 -88 176 -131 -120 -97 91 -140 72
2054G2q8J62j25j00O3q5nJ61j27P5r5Q2j31J03L2m9L9l3R4j69P2JL0j9r0Q2j02L7o8P8j5j4
1773a32J41l6m7JP9R9p5m9M2Jj87J20J10n7pJ88j81m0Q2q0Q2o0M5j22R6o8q0p9J62o9Q3M7
1493Il7j19Q5O7j14K4n3K2j6N9k1O7j00J68j04O2O0m6l1Q1p6k9P7l5N4Ko6j9O8j45oP5j8j8
1196g3J27p5nJ41j32m8pO6J2o2m5J57M3j53J02o9j09J87j31J58J2j4j55p6j4P2m0l9Q6k0J8
925h6J9l0k4R5R3n0J7l8rQ1j35J12k37N3J36j66O1J84l5ooj43j2J80j02J5K1N8r4P0k7N5o5
636a5%R2J00k5k61L1O3Q6q9OK06j50l3m7O6k2jN3J20j47KKJ4m2Q5Q6j28n4j33J92J29p9r4
347A3mj3J17j36j0l6J50k21K15n3n9K1L4mo5J85o0jk52K25Q8r4%j2j2k26K71J7k17L11r1J
67H2p2M5j77J09J9P4j04m9J03j4L6J26n9p9O8j33M6p3J67j67JN9k2nJ15n8k20J8J61RP8q4
$$ plain form
2054 72 -16 146 21 -79 -16 -101 -106 55 -72 3 -92 -10 -141 -38 -6 -55 -16 -49 45 -124 -52 -51 -21 -40 -130 -48 -150 -113 -181 -103 -118 -132
1773 -132 9 -27 -74 -73 6 105 30 -19 23 24 -163 -43 67 10 3 191 10 -30 52 -28 54 -6 39 -83 13 -55 -135 -214 -52 -121 -38 9
1493 9 -28 -147 -62 5 -109 -85 -138 -116 -132 -73 -94 -27 -127 41 -63 -1 59 13 -18 63 -13 -42 35 0 54 56 -10 -29 39 -106 -112 -37 -55 -73
1196 -73 54 -21 -26 115 -17 -65 -72 -6 6 -56 -101 56 99 -54 48 -21 -130 57 -74 84 96 82 -73 -149 -163 -91 -131 -170 -84 -104 -86
925 -86 -67 -97 -121 -26 67 17 34 -4 -13 68 -67 45 -192 -139 -3 -169 -108 76 41 35 29 -114 -126 54 -48 -33 -12 46 -48 22 -5 50 -15
636 -15 -15 77 177 152 -109 -78 -15 71 -18 -12 194 44 11 -36 30 8 7 60 180 33 35 37 51 9 94 180 52 -2 -135 57 186 107 13
347 13 9 -4 113 -23 -33 -69 81 -140 75 22 -37 -16 18 14 -51 134 74 73 -179 46 134 40 40 28 16 -210 61 78 -139 172 81 82
67 82 10 55 -122 -13 6 80 -24 -73 30 16 52 178 119 40 108 -25 21 -52 115 -52 -51 8 -14 -19 96 38 -182 -164 -3 6 84 0
-213@N1j7
$$ plain form
-213 0 51 34
-230C4
##PAGE=	F1=22533.5
##FIRST=	23146.755397984237788,	4241.1433691826614449,	0.14759993553161621094
##DATA TABLE=	(F2++(Y..Y)), PROFILE
4241B9l1j05J82K9j22m9J20j20M0L0q3N5L2j42K33j31J26q2M7p4m7m0J66p2l9O4o6J0J0P9
3979D9m1L2k02J31l2N1O9NJ8k01O5J21j55J19j33R4j0JJ6J5qk7OoJ3k8O1M9O0j29NnM1R2j83
3672d7L6l3O5r5R5p2J34j43J48j82O5LJ4O5j51L3N6J3J32q4R9Mj98K27k26K43j35j1LQ9M8
3401A95j83LK3K3J2j81J74Om5K05k53N3K4j04M8K1J28p7k2o1K1j4N8j1j03J17m7K8m4j2J50
3130A32k19Q6K1Q6j15J76o0n7j84P1l9J59q4Q2j24J11o4n2lJ16M7k1j90J16J96j52O4P5r6
2876G8R5j32r5R7m4j7%R6j28J1j45J43O8j02j4J19qj57J84j07J22RLM8j62j10J87m5k4O6m2
2605fm3n3J23L1o6J3lJ09j44o5O2j05R9J31r6L3r7LM8J46k0o1q7J68%j72RJ44l7m6q0N5k6
2316c3l2R9Oj15Q6kOj00O7o3J5N6N7n3R6m0J0p9PN0j03J1J8K22l36KR0J22j89K08o8J18j24
$$ plain form
4241 29 -2 -107 75 104 -18 -67 53 -67 -27 3 -80 -25 7 -135 98 -33 93 11 58 -16 -63 -103 63 -9 -48 16 -50 -40 -30 49
3979 49 8 40 -162 -31 -63 -12 57 62 80 -121 -56 65 -90 29 -104 -10 -20 -19 -3 12 4 -23 -17 -23 -10 -38 23 72 132 3 8 3 44 136 -47
3672 -47 -11 -44 21 -74 21 -51 83 -60 88 -94 -29 -26 -12 53 -98 -65 -9 4 136 52 151 155 -43 184 -42 201 66 55 58 147 195
3401 195 12 15 38 61 73 -108 66 72 27 232 -21 32 56 -48 0 21 149 72 50 -11 10 -4 54 43 -60 57 10 38 -6 -18 132
3130 132 -87 -1 20 106 -9 167 107 50 -134 -63 -102 57 -27 55 -69 42 -22 -74 -77 39 86 65 -125 -9 187 35 99 174 78
2876 78 173 41 -54 43 -1 -18 -18 78 -50 -39 -184 -41 27 -75 -89 30 22 -135 49 -58 64 73 76 124 -38 -148 39 -6 -30 36 -6
2605 -6 -49 -102 21 52 -14 -1 -4 105 -39 -104 -42 -147 -48 83 -13 20 -77 -74 -26 120 100 39 -48 120 120 -52 -43 101 64 18 -62 -7 -33
2316 -33 -65 34 40 -75 11 9 15 -85 -18 -81 -66 -10 47 -6 90 50 60 -19 -12 38 -65 -54 -36 186 -150 -148 -58 64 -125 83 15 133 9
2027In9K1p3K6Q7n8O7p2P1p5L5J4n2K3k4P8j13J03n1J7L3j34J06j39N7p5Q4Ql3J47j3n2m9
1738h6O2J29q2n7K3N3j78J11R2n1o0K56j75k8O6r7P5q6J05j18O7o0q0j02J45oR1k4k1j02P0
1467f8Q3j60Q4n4mQL3J0L2m5J61j06L7M3n1j1J13r2j4M0k9l2O0p1l6J51j37m0N7qJ4J12o2
1178A8l2R5q0q3%N9L0o8n9J67J3q8P6o6j35K18j46J87rm6j19p7M9j4Ll8M0K1KJj9j3M7Q6k9
872iL9q0L9P5r2K1j58K2J14j09N5J74k6l0M4j96rJ73q4l2K4N5o4Q2j5M0q2MP0R9k4k59N8N8
575b3N7p8L0J48r1k6o9P0lk0R1P6j43QnK2l1L9J05r4n7j55K27O8m0n5qk0O8p6l6k5J27k06
277a25J78op3M6l5L4q2J92j07K6j83J74R4o7k1p7j3j40K75K7k56K61Ok0n6%j70J25Ml9j2l5
-3g5P3L9M1J07o3p6M8j40O7l3J21j51l0R3nm2R0ok18j7J96j8O4p5K0J6
$$ plain form
2027 9 -50 -29 -102 -76 11 -47 20 -52 19 -56 -21 -7 -59 -36 -60 18 -95 8 -43 -26 7 -127 -21 -160 -103 -178 -94 -86 -119 28 15 -37 -86
1738 -86 -24 105 23 -34 -11 42 -136 -25 67 16 -44 212 37 9 75 -22 53 -33 72 -46 21 -39 -119 -221 -76 -82 9 -15 -36 -138 -68
1467 -68 15 -145 -61 -115 -119 -111 -78 -68 -36 -81 80 -26 11 54 3 -8 105 13 -1 39 10 -22 38 -33 -69 82 -55 -95 -38 -46 -32 80 18
1178 18 -14 81 1 -82 -82 -23 7 -61 -120 47 60 -28 48 -18 -153 65 -81 106 97 51 -68 -145 -96 -110 -107 -145 -105 -84 -82 -81 -100 -113 -66 20 -9
872 -9 30 -50 -11 64 -28 -7 -165 -143 -29 -138 -83 91 65 35 79 -117 -126 47 -37 -69 -45 10 -54 28 13 53 -29 -25 45 144 120 -139 -81 -23
575 -23 34 -44 -14 134 43 17 -52 18 15 -5 86 162 19 27 22 44 13 52 157 63 6 -149 78 146 106 51 43 23 91 15 -21 -46 81 -125
277 -125 53 47 -26 20 -15 19 -63 129 22 48 -135 39 133 66 45 -32 -45 -185 90 117 -139 122 128 108 52 52 -118 7 11 -28 -40 -75
-3 -75 -2 37 78 185 122 46 94 -46 21 -12 109 -42 -72 21 16 -26 64 58 -160 -177 19 1 65 -10 10 26
-230B6
##PAGE=	F1=22486.3
##FIRST=	23146.755397984237788,	4241.1433691826614449,	0.0874118804931640625
##DATA TABLE=	(F2++(Y..Y)), PROFILE
4241A7%q7J41Ml7o0P0q1jN5j15N4L9p2J61j15J52j14M7n8k4m8J44r9k8R7p5K4k2P6m5L1j56
3952a25J00l1L6P1J6Pk06N1J55j22Q9j28Q3j0n1J9J8J04n6j5K5l6l6J7P2N5r2J7K3k0Q5j38
3672b3kj5K4o7J08n8J16j44J22j36K6L1L0M0j29J9M4NJ32r7J15J8j61K04k66J96r3J0L4M7
3410A30Pj95N5L6L6Qr6J33mo0J27k13O8P7j41K4K3J64j18j9k0K1j5PN8j35J36m2k3m5oJ21
3130I9j44R0j4O7n5J25l9o5j15kk8J65j33J26j81J45p0l2RJ66m9L9k05Q5K15j13jR9j53N9
2867I0q0o2J21q8N4mN3j19J2j30J49M0q1n7J51o8j26J84j13J36%K0J9j59n5J96r6n3R3J1l0
2596Hj22J26N1q7QL0P8j08l0M3j40P3J14j13R5j38O3M0J02J5j18kJ32l7j27K6R1rn0m8K3n0
2316f1m2J43K4r5M7l9L0j20J10k6j0J5R0p9Q2k3K7o1j0qo3LN5J59l04MJ18O7j10J60n4O7j10
$$ plain form
4241 17 17 -70 71 75 38 -22 48 -33 -34 21 -94 -40 -1 -73 88 -27 125 11 58 0 -24 -72 72 -27 -55 42 -33 -9 -31 45 0 31 -125
3952 -125 -25 -56 -20 51 67 74 -132 -81 74 -48 41 -87 -4 -14 -65 -46 -28 76 20 5 30 -6 -42 -25 47 102 10 27 50 30 115 -23
3672 -23 -25 -40 -16 -83 25 -33 83 -61 61 -75 -49 -18 12 52 -77 -58 -14 -9 123 26 141 159 -2 202 -64 132 39 49 83 130
3410 130 137 -58 -3 33 69 77 -19 114 110 50 177 -36 32 109 -32 -8 15 179 61 42 22 43 28 35 93 -42 94 52 29 -16 -22 99
3130 99 -45 45 31 98 43 168 129 64 -51 -53 -81 84 -49 77 -104 41 -29 -61 -52 114 65 104 -101 -16 199 86 85 184 31 90
2867 90 10 -52 69 -19 35 31 84 -35 -23 -153 -4 36 -45 -102 49 -19 -145 39 -74 62 62 82 101 -58 -113 83 -13 -66 27 38 8
2596 8 -114 12 63 -24 -16 14 92 -16 -46 -3 -143 -70 44 -69 26 -112 -49 -9 93 108 -10 -12 120 83 -44 -18 73 64 14 -34 -11 -61
2316 -61 -103 40 64 -31 16 -23 7 -113 -3 -29 -39 -24 66 -13 69 46 73 12 2 -6 -69 -66 -11 148 -156 -152 -34 33 -77 83 29 96 -14
2027a4pk1o2N8J5J0N8m7O4m4qln1l4K5O2n6R5o5lP7j59J03j36O8r1Q2K9n1J42lm7r1O8J36
1721I9q7o1rR4j65J09L7%p7K48j23j5K7q6N6j20J39o0lm4o9j12J05Q0R8j01lq5L8Q5j70J31
1441d4n1k7M7K3MRqJ36p3KK8n1j4J26q7K0lk6q1Q0n9l5K22j43p3L9LM4Q6o0m4O7n7p1J8J3
1126d0M4k9p3J30k6l2N6n5j26K03j15J80k4p2o7o1P2n8L9m1pO3k5k4l3K2J3R4p4P7j14R4P0
837F1n1n3o1pM3k4K7J54l1k0P9k10j5J60p3j02N1N1l8R3jJ9j00L5K7P4%k23O9M4K0n6O5Q4
540I1l8o0n0P1J5p9J44M1j30K5%J9l2pJ24n0n0j67K27mrqlj3j9Jm8j5J05j90J40M2q7Q8q9
233a5L7n7J59j48N1j17J13R1n5rj02k0p0K62M8k83J80O9k9k9l6j08J16l8j14P1n3N7P9K9J00
-38A79n3q8J2j11P7nO8j19m8J03L7p9O6K7j84k9J73j8L3o4qM9
$$ plain form
2027 -14 -21 -42 -104 -46 -31 -21 37 -10 54 10 2 -1 -52 -86 -61 1 -55 40 -25 -28 49 -110 -7 -143 -75 -166 -84 -55 -106 36 33 -14 -105 -37 99
1721 99 12 -49 -58 36 -129 -20 17 17 -60 188 65 50 77 -9 47 -73 66 6 3 -41 -110 -222 -117 -37 61 -40 -43 -128 -90 -5 -175 -44
1441 -44 -95 -122 -75 -52 -48 -39 -47 89 16 18 46 -5 -19 107 20 40 37 11 -70 10 -49 -84 138 -5 -78 -39 -36 8 94 34 -10 57 0 -71 -53 -40
1126 -40 4 -25 -98 32 6 -26 30 -25 -151 52 -63 117 93 21 -46 -107 -35 -93 -54 -95 -102 -39 -64 -88 -121 -99 -86 8 -66 11 -103 -9 61
837 61 10 -43 -104 -111 -68 -92 -65 89 58 38 117 -93 -108 52 -21 -123 -72 -21 -59 34 33 52 -48 -13 14 88 88 -135 -66 -22 -2 -58 7 91
540 91 53 -7 -57 14 29 -50 94 135 5 30 30 49 17 10 134 84 34 -133 94 90 81 73 70 57 38 39 -9 -24 81 -109 31 73 -14 74 -15
233 -15 22 -35 124 -24 27 -90 23 114 59 50 -52 -72 -142 120 168 -115 65 134 105 76 40 -68 48 10 -104 -33 -86 -29 50 79 179
-38 179 126 38 50 -61 16 11 79 -40 -88 15 52 -27 39 66 -118 -147 26 8 41 -23 -31 18
-230A8
##PAGE=	F1=22439.1
##FIRST=	23146.755397984237788,	4241.1433691826614449,	0.0092355012893676757813
##DATA TABLE=	(F2++(Y..Y)), PROFILE
4241AJ2l2P4l7N1n3K3m1m2P8j41Q2J1KR6q9J35j63R9o2Kl8P8q7RR7r4L5oM3l2qn9L1Ok8J12
3917F5jj7j74L8J57p9N3r2M5J3o8j8qK17n1m8N7q3l8k9Q8M4o5J6O9q9O6q0j2oj4l8P4MN3j05
3602e6J04q5J5L5J6J2p2pL3j2J12j00J03K9r7J72k69J12l2J7K8K5Nk17R7L3O3Lk1J19j9j04
3322D2Q9j31L6Q1j28j5M5J75j79RN6k3k0kR0j35J06j2o9l4MQ6p8R7n6N4k0N4k0j7p3p5pJ47
3025G7j46J59j93J23p1jJ6J76j04R3j91N9J73o1o0J41j71Pk5n2J31j09J04k5J4p5qo2R8j0
2762Gk1o8J71j46j02J74p5J04qL3k0r0k6J55j12r0J26N3%j37Q5N5j02pL3N7o2k7O0j30L6O4
2482a0j02J41j81J20L6M7O0j67O4J12r8l8L2pM4m7j8On9o1J41L9o6N1r3L3j29J71j4lm2O4
2202B6j9M2j1O3n8m6j1k4j6N3N6k05QR8L3k3R8n5M2j18L5k4j7N4m5O2M4k9O7l2l6mk8j01O0
$$ plain form
4241 1 13 -19 55 18 69 16 39 -2 -44 34 -107 -25 -14 -12 84 -5 130 -33 66 4 6 -32 46 -41 -32 65 -29 6 0 43 11 3 -56 -25 -19 -47 65
3917 65 64 47 -127 -89 68 -11 42 -50 -5 8 -60 -78 -86 131 80 32 89 6 -32 -61 27 71 6 22 91 2 68 -12 -24 -30 -44 -82 -8 -4 49 -56
3602 -56 48 -37 -22 13 29 41 -31 -38 -5 -17 95 -5 98 127 30 202 -67 45 13 30 58 83 88 -129 -32 1 64 67 46 165 146 42
3322 42 131 0 36 117 -11 -26 19 194 15 24 80 57 37 35 125 -10 96 84 15 -19 -15 71 -7 90 34 88 68 122 102 85 12 -63 -70 77
3025 77 -69 90 -103 20 -51 -52 -36 140 36 129 -62 -3 170 109 49 190 19 26 1 -51 80 -29 75 50 64 -11 -19 -81 17 7
2762 7 -14 -82 89 -57 -159 15 -60 44 36 69 49 -41 -67 88 -24 -114 12 65 65 -72 13 68 -34 -41 -8 49 -13 -40 20 -110 -74 -10
2482 -10 -112 29 -152 -32 4 51 111 -56 8 120 22 -16 16 9 53 6 -12 -6 -65 -126 15 54 -12 39 -54 -21 -150 21 7 4 -38 26
2202 26 7 49 38 101 43 -3 -14 -38 -54 -1 55 -150 -142 -44 -11 -34 64 9 51 -67 -32 -56 -73 -19 -64 -2 42 13 80 48 12 8 -20 -121 -61
1896f1O6k5O4m3l0J13j68P4r2L8q1N2O4p8J17Nj9j03Q0Q1l7o0m8J11j26Q4k7O9o7J70o0lj7
1607D3o3O4j41J31M2r1m3n2r5O4J42N9j00j0o3J1M7j36J68m5m6R5J4m4J5QR1l4rQm2k9J03
1318F2m5M3l2k2q0O5n7pK67j51q8K4J8L5L6l6m3O8p0m0M2l4N5Po8P2p3J3P0n7q8J36p0J49
1021A01l1o6k6m6O1n0N2m5l6R1l1l3p6O8l4J40j56J10j26J23O5m0q4J7%k5M7l2J24k9jQ7j66
732d7j7J35o7j71Q6N6l3J05l0J1r3Q5KK1pj47O0M9%l2P8M0rj04j3K5K4j28J87N4j30M8K2M
435F4l1o8J26qm4j54K03n8M1pLQj00P9n5JR9j82J00M6r3J46r9Rk8Q3j42P4o9Q2L7n3J5q1J3
128d3n4K57N8k80Q0Q0l0j7l9k4P1m1j47J13r1P0Q4KJ11k7j12k1l0O2j3K4j02l2J02N0p7L6
-152B0L7j28oJ01j1Kl5l7N7
$$ plain form
1896 -61 5 -20 44 1 -29 84 -84 -10 -102 -64 -145 -93 -29 -107 10 15 -4 -107 -27 54 17 -43 -91 20 -106 -22 -49 20 -47 123 63 60 43
1607 43 -20 44 -97 34 76 -15 -58 -110 -205 -141 1 60 -40 -50 -113 -102 -55 -191 -23 -68 -114 -19 -5 -49 -34 -26 65 31 22 30 -12 -41 62
1318 62 17 60 28 6 -74 -9 -66 -73 194 43 -45 -21 -3 32 68 32 -11 57 -13 -53 -11 -45 10 17 -51 21 -52 -39 31 -26 -114 22 -48 101
1021 101 70 4 -22 -68 -7 -57 -5 -50 -86 5 -26 -59 -135 -67 -101 39 -117 -7 -133 -10 55 15 -69 -52 -52 -77 -30 -62 62 33 32 119 -47
732 -47 -64 71 4 -167 -81 -25 -58 47 17 28 -65 20 22 43 36 -111 -51 -2 -2 -34 44 84 75 -29 -42 -17 7 -121 66 120 -10 38 60 64
435 64 33 -35 91 83 39 -115 88 30 71 64 67 75 -25 54 -1 0 99 -83 17 63 -30 116 17 26 -2 81 -61 13 -56 26 63 10 25 -56 -43
128 -43 -97 160 218 -62 18 98 68 51 12 -12 59 18 -129 -16 -107 -37 47 49 160 133 21 0 -30 32 19 43 -59 -91 11 61 -16 20
-152 20 57 -71 -77 24 13 15 -20 -57 0
-230@
##PAGE=	F1=22391.9
##FIRST=	23146.755397984237788,	4241.1433691826614449,	-0.068940758705139160156
##DATA TABLE=	(F2++(Y..Y)), PROFILE
4241a3J0RK2o6J19o6j7Nq2J01j42J34k9O4L1o4J06k25J52o4M2j3j4n6N3N5p5L9RJ0Pp2M0l4
3944b4M1r1J40l0j5j19%J37k7L1n3RK5n0o3m6K79j9q5Q4j21l0n2Q0L7l6%R9j21L5j8k0J6m1
3646d8k0K6O7j0o6Q6l5MM1Jj7j6k0L4m3P6p9O7L1m1J64k47J7J6J1J1K7K7k40J40J9P5j4M3
3349H7J05l3j38O4n1NQ6j16n2O7J81k42N0R5o7k6K2J04j14J9M4q8k8J2O2m8J20q3K8Mk3nO7
3060A08p4j01J2R4j13J64j86R8p5L9L2J04r5J23j53M1R2Pj05J97j78n5J7o0J24r9J07k2Kl8
2797Gl1L2mm8N0l9J52k19p2J64l8O0k6N7m6k0NR0j03j29J55P9J3j00J5O5j14k1L5L8j7l7O7
2509B0q9L1lj07J65j96J49N5j8R7j75Q9R4j56O9J3p6P5m1J4j1o8p9J40N1l7O7j34L5j35K07
2237D6k5J5q8M0L9KKQ7o7o0J2Km8N2m6j08J4P7kO5L5n4J6j25P7k5L2L7o8R7J7rP2m4l8rrj59
$$ plain form
4241 -13 -3 6 28 -38 81 15 -2 3 -79 22 -120 14 -15 49 80 16 122 -103 49 -15 27 14 0 -56 -3 52 -23 16 25 35 42 -30 10 -24
3944 -24 17 -74 66 36 21 -98 -98 39 12 43 -10 -1 24 -26 -89 -135 144 125 40 124 3 -27 -79 1 38 2 2 101 -20 15 -3 -23 -7 -48
3646 -48 -68 -42 25 15 -51 35 0 4 45 46 29 13 -7 27 -16 60 -19 48 79 38 202 -45 -28 -12 -1 10 37 64 -176 -36 -17 58 44 87
3349 87 192 159 21 85 34 39 125 9 -43 24 205 -37 13 108 41 15 37 141 27 46 90 2 -26 -14 48 0 120 37 65 69 46 41 108
3060 108 34 -67 -55 39 -74 90 -96 2 -73 -34 -2 102 7 130 -23 18 110 117 12 209 31 -24 -7 -67 57 -42 65 43 45 7
2797 7 -24 8 4 -44 6 -33 119 -100 -172 -8 -46 14 -12 45 -1 -21 -16 74 -29 -158 -3 76 89 -11 4 69 -45 -66 -31 7 -10 -47 20
2509 20 -69 -38 -41 -148 17 -179 -30 25 7 104 -71 18 112 -44 25 38 -38 37 -4 10 -1 -69 -148 -8 43 6 73 -61 -26 -161 46
2237 46 21 36 -52 -12 27 29 31 118 51 -9 3 5 -43 9 -37 -145 -131 -54 -56 9 44 -10 6 -119 -42 -67 -35 2 -66 31 48 39 111 67 29 20 11 -148
1905a48J05P3l9J1Ro6J43j27M3n8nm6mJ03j02Q5Mpq2J11%K3n0m6Q7r2N1r2J40n8R2j2ok4n4
1598c8P6j59J24J42j77l8m9m4L7J70j8n6k2m6j5Rj03K04l9o3J29qp9L4J1L4J7pj4l7k2N2K5
1310C0M4o1j7m4L7o0J5K76j47r7J5L5j7kkl0Q1q2rO4q0O7M4o7J1r7L5Q8n7m9P0k8J18l3n7
1003fqlK1j9M3o8j1R2k4k3j30J02q7J81k02R5r0J17O1k7r1P2Qq9J04j02J07j4J7R5j22j8J06
715H7o3k05J09N0m0J40q2Mq2J34k9Nk6p9M1N2j8pR1mK0j37L8l6K2j77K29O9j33P6M7l9qj08
417e9J01L2m0j03J36p9P3m7J6O2j50J08o1K7J00j70O3K8p0J75q6k2mK0j23Q5l4N0j5n0L7m7
137d7N6m8K38O7k81NO5l0oj6L4K6m7j41J16j21R2O5jJ15oj04o8O5J4j8j7q4j7Q8M6l9nM7p4
-169c1L0oJ0j2On0M1
$$ plain form
1905 -148 -43 30 -9 2 11 -55 88 -39 4 -54 -59 -105 -109 -6 -108 -23 -19 -26 -108 3 3 26 -24 -70 17 -75 -24 -116 24 -34 58 46 40 16 -38
1598 -38 38 -121 3 145 -32 -70 -119 -163 -126 44 26 -30 -52 -98 -113 -104 -207 -3 -42 -105 24 16 -63 -29 -18 16 33 26 12 -25 -47 5 30
1310 30 74 13 -4 -48 -11 -71 -56 220 73 -24 -9 26 9 7 5 -25 56 -26 -35 29 -51 16 60 -7 4 -93 -58 30 -27 -76 -6 -34 84 51 -6
1003 -6 -14 -17 4 -15 28 -40 -51 41 17 -6 -136 -34 -121 60 -142 -47 -137 -20 41 14 -77 -5 3 -86 18 -84 23 9 26 121 -1 -19 87
715 87 24 -181 -72 -22 -62 78 -4 0 -82 52 23 28 2 -77 -36 16 -2 -9 82 78 98 -39 -1 -37 -15 -192 37 106 -27 49 96 57 49 -59
417 -59 42 74 34 -69 67 -12 61 14 30 92 -58 50 -11 16 116 -54 9 37 -33 142 56 34 30 50 -73 12 -22 28 13 -37 0 -47
137 -47 9 -39 199 266 -15 -10 55 25 19 3 37 63 16 -125 -9 -130 -38 27 26 141 135 31 -37 28 42 24 7 -77 -94 -6 40 1 -4 43 -31
-169 -31 -1 -7 3 -9 -3 -53 -12
-230a2
##PAGE=	F1=22344.7
##FIRST=	23146.755397984237788,	4241.1433691826614449,	-0.20638155937194824219
##DATA TABLE=	(F2++(Y..Y)), PROFILE
4241d0K1K1l0m6J51r0l3J6o5Q2j35J83k5O2ll3M7k46J87m6K6M6q6j5O6j1mJ0J1j6O0j06J14
3952G3r2N5j03J25q3Rm3k4Q1LP0m2l1J0J6r4r3K85L9j32P9j14j0n9L4N2l6rR8j09J1L4n3N0
3655cl9rpJ14n7n2N3MK4K8mj6j6nN2j05M9l3K6M2NJ43k04m3K5nk3P5L9k37J60J6M4j2P0R3
3340A92n3j51M9L8l8O9j01m1N4J59k55R2P3q9l4M9J11r6n6R8q5k4L7M1n0R7m7K4m1l6pJ31
3060A10r1q2J1L5o9J57j39Q2q4O8M1k5l6J39j07K1L4L5j08K18j64p8L4r2J00m7N7rk0L1n9
2789c7J08j11m7J00K2R5k42p2J30K6jk5N5m1O5KK1p5j33J58N8L2l1n7O0j03k3NK2K2l3N5l6
2500c1N1p6r2J56j50J01Q1r0J41j35O2Q7j71J31l5p4P0l5J2K3r0r2J11Q0m8J15j37K3j23J95
2237F0m7Po5J4R0rk9P7q5nL2j1n7O5j40l0OP8l7J07jo6K1j18R2k9P7L2q8J05RJ3N4n4k5m0
$$ plain form
4241 -40 -19 2 -28 -74 77 -13 -46 -30 -95 -13 -148 35 10 72 69 36 83 -163 24 -22 4 50 -36 -51 15 4 0 10 21 5 65 -41 73
3952 73 -19 36 -67 58 -25 -16 -59 -83 -2 1 71 29 -2 8 24 -70 -163 122 161 29 108 -6 -16 -75 -41 11 -25 -34 64 -45 -34 0 -53 -3
3655 -3 -42 -51 -58 56 -1 -53 0 4 28 56 52 36 20 15 67 -38 11 -22 4 46 51 194 -10 -53 -28 -33 -56 19 58 -179 -19 -3 41 29 99 192
3340 192 139 -12 37 75 37 106 5 -36 18 177 -78 14 87 -2 -36 13 124 28 -28 70 -15 -39 -2 39 -11 86 39 63 22 -14 -21 110
3060 110 19 -63 -52 -17 -86 71 -68 14 -70 -2 39 14 -22 117 10 31 65 100 -8 210 46 -32 2 -90 10 -37 20 11 -9 22 -37
2789 -37 71 -40 -87 13 35 130 -112 -184 -54 -28 -29 -54 1 -40 25 27 48 -27 -160 -2 56 88 57 0 60 -43 -66 -61 -39 -17 -50 5 -31
2500 -31 20 -56 -148 8 -142 -41 40 -50 91 -44 18 105 -66 65 30 -44 26 -9 3 26 -64 -156 -45 35 -13 102 -35 -12 -135 60
2237 60 13 20 -45 -31 59 50 21 98 13 8 40 29 -28 37 -103 -133 -127 -49 -86 21 20 -46 -25 -143 -51 -80 -3 29 -59 46 55 68 122 68 43 3
1922CJ8j60J13N6o1j7N6r8J59o9L9o1n6Nm3J05j08P9mj6k8J25q4R5o4RL8p0Lj00J43n4M0K3
1625A6j8Ko3Q0j47J21J91k17n3m0%K3J67j00km2l3j7j4o2K28l4p2J50n7q1O4qqO0pl9j4nm
1318c5P7%m7oj1L2q8K7K46j25j10J8P8r9l2O8m1J02q3j4Q0o3L2M6m0l6r3N1P9j9k6J1l1J11
1021E9k1l3j2J4m%K2n8J3O7onj43Q3j23K11j84M3l4P6P5k8r0P6L8j15J10j28R8k2LJ25o4q
723C5M6k9j94R5N7q6J84j37Jo7J65l9Kl3n8J3O3k5J3Q8l8K4j08M3p6J9k02K30Q3j17J10Q5
443A47r8Qj17N7N4m8l5M3l8R2j04M0J07j60P8m3P6M5j10K8rm8J73n8m6j7op7J01m3K7p1k3
155g5N8k5J05m5J89M9k42k7L3k0qQM4j4n0r8J16j48J18K7J8J47k8p0j08J23k3j0m3q1j4Q6
-125hkL1l1N1o1O8j00L7nN4n4q
$$ plain form
1922 3 21 -139 -26 30 -31 -48 8 -90 69 0 39 -22 -78 -73 -116 -11 -119 -40 -44 -60 -88 37 -47 48 -16 -7 31 -39 -36 -136 7 -47 -7 16
1625 16 -2 0 -63 17 -130 -9 182 -35 -88 -128 -128 -105 62 -38 -40 -82 -115 -132 -146 -208 20 -14 -86 64 7 -74 -10 -18 -26 34 27 -12 -26 -31 -35
1318 -35 42 42 -5 -11 -22 10 -78 -51 195 70 -40 -22 56 -43 -75 -7 -48 54 -29 -43 37 -26 6 52 12 -24 -117 -66 13 -6 -32 -21 -52 59
1021 59 38 5 -7 7 3 3 25 -33 -20 47 41 36 -107 -24 -147 64 -120 -77 -111 -35 40 12 -78 -2 36 -79 31 -97 1 -21 -18 107 43 35
723 35 81 52 -142 -47 10 -76 108 -29 -28 -95 70 31 33 0 -58 -45 18 -7 6 94 56 80 -28 15 -61 -42 -244 -14 69 -48 62 147
443 147 49 57 -60 -3 51 3 -32 11 -27 65 -39 1 108 -52 26 -17 59 104 -6 22 13 -35 138 80 34 17 11 -66 35 -8 19 -52 -75
155 -75 -17 -42 63 18 207 256 14 -13 20 0 -8 0 44 30 -20 -118 -2 -150 -32 -5 13 160 132 62 -46 77 54 44 1 -80 -94 -8
-125 -8 -10 21 -10 41 -20 48 -52 -15 -20 34 -20 -28
-230b8
##PAGE=	F1=22297.6
##FIRST=	23146.755397984237788,	4241.1433691826614449,	-0.22047495841979980469
##DATA TABLE=	(F2++(Y..Y)), PROFILE
4241d3RQn0OJ63j34m8K4m8N7j19J91K1J8MqLk53K10l9PJ01j29QM2l5O0k2Jn4J33j21J28r6
3944eQk9M2q9K6K6m8K5L8J11n2m5m6Q9o9j33K38R1j88O1q8L2o7j1O5m1j7N0l7lP9r5Q5l4j7
3637d8j0J30n6n3KL1L1K8Mk8k8K4Q0j67K3K3kM0M1J21j62r0M6k2n6J23N0k33J78J4J3l3P3
3349H7R3o1j65L6J26q1M0r7j6N6J21k35J25rq9j9O9J07q6r4J26o2k2O0Po5Q9JJ6q9j1j8J49
3060H9j03n4J9k1k2J24p1R5j10J11J7j38L6J45p3Nj8K5o8K10j31r2O1j37O5LJ0Nm0Q4n6J21
2780I1j68k8J19Q4L7k29q3Q6Q0n0j0M1m8J38j4l6l5j34J64MO6J5j06L9n9k8k8NO2k8M4MN9
2491E4j20m8J10o0PJ12j45J56o7J3R9j68J39q8k2L3k3J5N6j12j05Q2Q8p9J96j09jj21J69p9
2229a8J0l0j3J41j9o0O7j02N4N4n8n1Q3j81K3k8J07r1J12Oq3K0j10J08l3J20K9j09J13KK2
$$ plain form
4241 -43 -34 -26 -76 -70 93 -41 -89 -65 -113 -56 -175 16 37 55 59 51 54 -199 11 -28 -21 80 -49 -41 1 -34 26 4 5 -49 84 -37 91 -5
3944 -5 3 -26 16 -73 -47 -21 -69 -44 -6 105 53 8 -38 51 -18 -151 87 178 -10 51 -37 -5 -72 -83 -18 -59 -76 -26 -63 -66 13 -82 3 -31 -48
3637 -48 -58 72 16 -37 -35 -4 27 55 59 31 3 27 107 -60 -37 -14 -16 24 65 186 24 -66 -20 -42 -98 25 75 -158 20 34 47 14 87
3349 87 180 119 -46 -10 116 35 75 -22 -38 18 139 -96 29 20 -69 -88 -19 88 2 -92 34 -28 -50 10 17 -48 41 42 58 -31 -42 -60 89
3060 89 -14 -68 -49 -70 -92 32 -39 56 -54 57 74 -64 -28 117 44 49 31 56 -12 198 67 -25 36 -101 -36 -33 -23 -18 -58 26 -30 91
2780 91 -77 -105 14 98 135 -94 -177 -91 -11 -61 -71 -30 -78 60 46 10 -25 -159 5 9 75 90 -16 23 -36 -64 -92 -87 -25 -53 -9 -5 54
2491 54 -66 -114 -4 -64 -57 55 -90 66 -1 12 111 -57 82 -6 -28 5 -18 -3 53 -59 -164 -82 6 -73 123 14 13 -108 61 -18
2229 -18 -8 -38 -51 90 71 11 78 -24 30 84 26 -25 58 -123 -100 -128 -21 -112 0 6 -77 -57 -167 -59 -92 28 57 -52 61 63 85
1957H5K3n0kp3L7j16Q3J4n8rO1j46J60J2O0q9q3N7q3Q3r0Q3ml3J6J30j30J28o8O0j3m1l9p6
1660a11R7n4L2K0k4M4o2N7j14J23J98k29r0l0M4K1J28j68O8o3j9pk5l4K41k8p5J33r2p5J02
1388Hk6n2J05pn2K1K0n2R3p6LlkN1r1J4J74r5j18K6J32j68o3J38n5J21o0m3J00m4j4L4kp5
1091e8n3N5O5J2k8k2l8J02rj0j6L1m0QJ1l6K5K9K0K0j19K1j33K18j18j0OJ7R0l1r7P1M9j12
793h0Q5j05Q7l4l4J80k0j4pJ1j41M0P1j29K28j92J2l5J58l7lm2l8j5P8k6j8J12o9L0m1J1j05
505h2L1k02K04Q7j12J54Q8j42L8j25J1P7n3K5n3M2P2j43Q5J22j54OJ0J22j6n2nm5k7J56m5
233G4l8m3Pm0R7o9Mp9j0O4k1J37j0R2N4j81j8%j7j6K0M5n4n5m4J24j62J07LN3J67o1l2j42
-64d4J27l2J4n2o6m8Q9n0J16m7L7o8Q0j43P1RR1p2n7
$$ plain form
1957 85 108 58 56 -17 20 -96 -13 1 -57 -66 -5 -151 9 21 81 -8 -91 -34 -117 -34 -124 -41 -45 -78 -62 68 -62 66 -2 58 45 4 -35 -111
1660 -111 -14 -68 -36 -16 -40 4 -58 -1 -115 8 206 -23 -113 -143 -99 -78 50 -118 -50 -113 -132 -139 -164 -198 43 15 -60 73 -19 -94 8
1388 8 -18 -70 35 28 -24 -3 17 -35 58 -18 -15 -18 -20 31 -60 -46 128 33 -85 -59 73 -95 -158 -20 -75 46 -14 -57 43 -1 -15 19 17 -58
1091 -58 -111 -56 9 21 -7 -29 -67 35 26 16 0 31 -9 -1 10 -26 -1 28 48 68 -51 -30 -163 55 -63 -73 -67 -50 40 9 -88 -17 32 -80
793 -80 5 -100 -13 -47 -81 99 79 65 58 69 -72 -32 39 -90 138 -54 -42 -77 81 44 41 -1 -39 -54 24 -2 -20 92 23 53 12 23 -82
505 -82 -51 -253 -49 38 -74 80 168 26 64 -61 -50 27 -26 -1 -54 -12 60 -83 2 124 -30 -24 -14 108 92 40 35 -10 -37 119 74
233 74 36 -7 0 -40 57 -12 -8 -87 -97 -33 -54 83 73 165 219 38 20 20 3 -13 7 52 -2 -57 -101 23 -139 -32 -29 24 191 130 98 -44
-64 -44 83 51 65 13 -53 -101 -12 -62 54 7 44 -24 56 -87 -16 -7 84 12 -45
-230d5
##PAGE=	F1=22250.4
##FIRST=	23146.755397984237788,	4241.1433691826614449,	-0.22685921192169189453
##DATA TABLE=	(F2++(Y..Y)), PROFILE
4241d4K1m7j5N0J24j48l4J5l9M1j15J56Q9l5L4j7j2k03J93k8k8J14j07J7k2k8J23o8j7m6J64
3970H8j06P5m9p0J01q6n6L8R0o8l1L8J83p8k2j33J30rj45J73J13k18Qn5J06q7j5N5n0l6lM1
3690g8NR0j00R3l4l1K6J02k3p1m5O7OL1Pj6m4L8Q5j73j1O4j4L4O1Q8j10r3M7n7l9J60J9j96
3392a12J74K5mm4N3N2l6j75L5J76p9Pj22J7N3P5j95J36q6q2J5Q9Q3j08o7J18j8m9N8Ln3O7
3112FM4rj14M7j7J12j06l2K5k9rQ4J5J10j65J48l6j77J03J27q0mm3K3k3J67r7q6Q2j69L3N6
2832a4k3ko1J18j9N5j59J3J06J20l0j60j13P5J03r9L3J2l3J30j5m7Nj29J54n9P1L3r9Knjn8
2544i6l0Q0kJ4PR5j66L7O3J5q2J28j57J40j8l4J32j50R7j08L2j9lL6N0p9j37M1R2j18K58p2
2264D6j1j08J32r3nJ9oJ15op9K5o0Q8N2j08l3J00j39J6n1J43j31N9L5q4K1r8Q8j8J10K8j35
$$ plain form
4241 -44 -23 -70 -85 -35 89 -59 -93 -78 -117 -76 -191 -35 54 19 53 36 24 -179 14 -14 -42 72 -35 -18 -40 -68 55 -13 -30 -76 88
3970 88 -18 57 8 -62 39 -47 -103 -65 25 -43 -74 -36 147 69 47 -86 44 35 -110 63 176 -42 -34 -89 17 -70 -85 -30 -80 -116 -119 -78
3690 -78 -73 17 -83 10 -24 -55 -29 73 50 -21 -66 1 7 38 45 29 -15 23 108 -65 -76 -12 -26 8 69 157 47 -46 1 -56 -95 65 84 -112
3392 -112 62 87 83 39 92 144 108 -67 -32 144 65 72 -50 -33 20 95 -100 36 -50 -132 -117 -28 55 -53 -120 -2 -20 -69 -11 -8 -61 6
3112 6 50 41 -73 -26 -43 69 -37 -69 -44 -73 -82 2 17 127 -38 110 74 -103 0 127 47 43 0 23 0 167 70 -16 66 -103 -70 -14
2832 -14 -37 -39 -100 18 -1 54 -105 -92 14 134 104 -56 -169 -94 9 -90 -57 -45 -78 52 37 -10 -5 -134 20 -39 32 65 -34 -32 -37 -38 -96
2544 -96 -126 -46 -48 -34 -27 68 -98 -61 2 17 -65 63 -94 46 28 -6 126 -24 73 -35 -3 -22 -25 11 61 -18 -155 -114 -22 -140 118 46
2264 46 35 -73 59 -34 -39 -20 -26 89 83 4 29 -31 57 109 1 -32 68 -71 -55 -106 37 -94 -35 0 -84 -63 -161 -73 -91 19 47 -88
1983h8J23K7N1l2m7L3j01M0m9N2l5n2M8K9j83J25O6J12j31p6R2q6K6o1R4kl8M3J10j30J02
1712F2o1R8j8l3p3l9K9l4N0j7jP0n8J3n1J13J52k14j20mL4M7P5j98J11n1l2Kmk3K49k2j01
1423d9Q6o6p1J19l5o2J32m3l0N1L9n9M3j36O5nnO0n1k0Q8m9j23L8J49j94n6J68j03J39k0q2
1143h2J18j0o2L1lq5J9L6L2L7k7j1o2O9K2Rj7K1n8K2OQk1J0N9j4n5j6j14J66l2k7mlJ05l1
828C6j15O0K0p9N8m0O8n1q0K16j3ml7M2p9k6R2j87K64j98N1l5J12j6k0k8l6l5P5Lq9J75r8
540FK5Ll2q6N1j77J60O6j02K12Rj34O3j07k7P9l5L9j11J12M0j43J08J07j39o9Q3J30o7kl4
268B8k9l2J53p7j7m8K8oP8j16nl7lM9LJ03N0j8O1j18K6k6J2n3PK0m2p6NJ57j86M6J3R5J57
-38B02p2k7j28Q5l3M2k5n6r0Q3q6J65l9L1q2M3j32J30JJ00q0j08
$$ plain form
1983 -88 35 62 113 81 34 67 -34 6 -43 9 -26 -78 -30 -1 -184 -59 7 119 -12 -88 4 -82 -56 -117 -23 -25 -63 -20 90 -40 62
1712 62 1 99 81 48 -25 -64 -35 -69 -19 -36 -37 33 -25 -12 -63 50 202 -12 -132 -136 -102 -55 20 -178 -67 -118 -150 -148 -152 -175 74 52 -49
1423 -49 37 -29 -100 19 -16 -78 54 11 -19 32 71 12 55 -81 -16 -21 -26 34 -17 -37 51 2 -121 -83 66 -128 -184 -16 -119 20 0 -82
1143 -82 36 26 -36 -5 -8 -93 -74 -38 -6 31 4 -7 -69 0 22 31 14 35 -23 -1 5 13 -8 2 61 47 -8 -24 -138 28 -4 -31 -35 -38 67 36
828 36 -79 -19 1 -78 -20 -60 8 -43 -123 93 80 76 39 81 2 -24 68 -119 145 -53 -2 -37 75 59 39 11 -25 -60 15 18 -71 104 6
540 6 31 34 2 -84 -33 -210 -50 16 -86 126 135 1 64 -43 -70 9 -26 13 -98 14 54 -89 19 126 -13 -82 1 131 64 62 28
268 28 -1 -33 120 43 26 -22 6 0 78 -38 -43 -80 -83 -34 -31 72 122 104 165 47 73 47 59 6 13 33 -9 -85 -80 77 -109 -63 -50 45 202
-38 202 130 103 -25 60 27 69 44 -12 -102 -19 -105 60 21 52 -30 13 -119 11 12 112 32 -76
-230g6
##PAGE=	F1=22203.2
##FIRST=	23146.755397984237788,	4241.1433691826614449,	-0.23324334621429443359
##DATA TABLE=	(F2++(Y..Y)), PROFILE
4241d5M5r0QQ1R8j50j9Nl0K6j22J12J31o6Q1n6K1j55J55m0m0P1k8Kp9j2J62r2k1k2J48n9k2
3952bL3j50K30k19K1K7J31p5p6J4K31r5J1j96J45N6j56J09J34k34l4l3J68r5qL4p2l5l5J04
3690f7kP3n3Q4n3m1O4N1L4q2q0R0l0L3Rmo0M9Q3j25p4R9l4L0P8N6n9q1O6j18KJ83k7j72J57
3384G9M8qn6L4J2j2j80L8J87l7l1j53N1N0L4j50J28j05p8M3J06N6j68MP7M2p8NK6j4L5P4k3
3095C6j27J07j3M0r7j2K8k6J5L4R0J22k18J67j06j43J60R5j01j4o9K3K3J22o3q1J03j85J7
2841g3Q8k5n1m0J16K7m1j01M3Q2J14n6q7j38P4R2j46P8j6j7J09k9m6N7j22J43j18Q3J0n2m0
2570h2M3K7q8o6R8K5j6jJ19k06J28M3L4j34J35j29J14K3r2J66j33O2j23M6l4J4N3M2m6j56
2307a34J3Q8j63K66ok7r8J05r5k0O9JQ8Pr7nnR7K6j41KP9n3j5m9J38j32k3Q2p4L1r8N5JJ04
$$ plain form
4241 -45 0 -90 -82 -1 97 -53 -72 -67 -97 -71 -193 -81 50 -16 65 9 30 -125 30 -10 -50 21 -7 -5 -84 -96 66 -26 -47 -69 79 20 -2
3952 -2 31 -119 111 -108 -87 -60 71 -4 -80 -66 165 70 81 -115 30 86 -70 39 173 -61 -95 -128 40 -55 -63 -29 -101 -136 -171 -67
3690 -67 -69 4 -49 35 -18 -59 5 56 90 8 -72 18 -12 21 30 26 -34 15 98 -27 -101 -2 -36 -6 72 128 69 -12 54 -64 -62 121 94 -78 79
3384 79 127 119 63 97 109 97 -83 -45 142 105 74 -79 -28 22 56 -94 34 -71 -149 -106 0 56 -112 -108 -31 11 -67 -62 -36 -50 -15 59 36
3095 36 -91 16 3 43 -54 -66 -38 -64 -49 -15 75 197 -21 146 40 -103 57 152 51 37 -32 -9 14 136 73 -8 95 -90 -73
2841 -73 15 -10 -61 -101 15 42 1 -100 -57 25 139 83 -4 -142 -68 24 -122 -44 -60 -77 32 3 -43 14 -108 35 -83 0 10 -42 -82
2570 -82 -39 -12 -100 -166 -68 -43 -59 -60 59 -147 -19 24 58 -76 59 -70 44 67 -25 141 8 70 -53 -7 -41 -27 26 68 22 -134
2307 -134 -121 -33 -196 70 64 37 -61 44 -51 -71 -2 -1 87 94 -3 -8 -13 84 110 -31 -29 50 -3 -18 -67 71 -61 -84 -2 -76 -45 -143 -88 -87 17
2001A7Kj37J18L6R4p5m5O7j28M3J6K3p3l2J03lk18Q8Q9J31j50m5J04o7l6l7J27k2l8P5O9j02
1721fL9m0J07%j4r5k7j4mP5n0K4O2m4l3RR2R2j77j29L5j2P1K4j95J38qo4k2L2j5K53k2j34
1423e2J2J1p2J32m6p0J54q0J7O1M0l5l5j74J24j2oO7j1n3Llj25N3J57j81k1J46j56J50K1j22
1143a06J36K4r6M2m0q1Q3J2K2L9j3J1p3%N5L1j8J1p5L6MN4r2J7P7o7lj6k5P2J2kn9J2J28k6
828H6j43L5pm7L1K5N7o3r5K04m9J4k4O9n0p7J12k43K82j70J12o2O9Pm9k4j2k9O0K1j65K35
548A10j00jK7m9p0O8j52J16O1p4K71j16r8O4q2n9O2J3K1j21J63j2j20J07R3j25j11J38Q7n4
286E7J3m9Po4J54j06J6m1L9J6N6j61kJ6j3J7N9J9J01q4O3n7O9n2M2r0onj0p6L0J66j88m2N3
-20e3J19J30n0o4p8M1l7L4J5l9j22R4j09J78j7K2r9J5j13K06m1P2p6j35
$$ plain form
2001 17 19 -118 0 36 130 55 10 77 -51 -8 8 31 -42 -74 29 26 -192 -104 -15 116 -34 -79 25 -42 -78 -115 12 -10 -48 27 96 -6
1721 -6 33 -7 100 100 86 -9 -36 -50 -54 21 -29 -5 57 13 -20 -11 81 173 -4 -133 -98 -110 -39 -15 -210 -72 -80 -144 -166 -134 -149 104 82 -52
1423 -52 -40 -29 -101 31 -15 -85 69 -11 6 67 107 72 37 -137 -13 -25 -31 36 25 -28 -25 -28 -153 -100 57 -124 -145 1 -155 -5 16 -106
1143 -106 30 54 -42 0 -40 -121 -38 -26 -4 35 22 33 -40 -40 15 46 28 39 -36 0 4 58 -34 -17 60 -7 -10 -26 -51 21 33 31 -28 -16 112 86
828 86 -57 -22 -29 -76 -45 -20 37 -26 -121 83 34 48 24 93 43 -34 78 -165 117 -53 59 -3 66 73 24 0 -12 -41 19 40 -125 110
548 110 10 9 36 -13 -83 -15 -167 -51 10 -64 207 91 -7 57 -25 -84 -22 -9 12 -109 54 42 -78 29 122 -3 -114 24 111 57
286 57 70 21 28 -36 118 12 28 -13 26 42 98 -63 -65 -49 -62 -45 14 33 134 50 113 56 125 73 115 25 19 14 4 -72 -42 124 -64 -106 -53
-20 -53 66 196 146 82 4 45 8 42 57 18 -104 -10 -119 59 42 64 -35 -20 -133 73 32 104 28 -107
-230a07
##PAGE=	F1=22156
##FIRST=	23146.755397984237788,	4241.1433691826614449,	-0.20236635208129882813
##DATA TABLE=	(F2++(Y..Y)), PROFILE
4241c9O6j02K5O0N5j06j0roLj35Q3J32n8J06j13J04j13P2l0k2j4Q6k6j12oJ71j09k2L0R3k5
3961B9r2J25k16K85k78J06NJ34q5p2LJ88r0O1k12J24J06j50M8J43k23n5j4J88p9J0l0o2k7
3707a30k6J03j1N0J4P1q9l9J10l7P5o5q5J11o4M0Qk5l3M7N7n0j34J03m2J2P0N4k8l6P1j71
3427f9M9J78p4j39J43M7L2m9ml4L4j94O8J42K7m9j98O1M0J4j31J16n1q4P8J10J9k24P0K7J06
3156F1r8q4O1M0K3M5l6q7J22Jk5q4J7J7jK0pJ38J09k64J62j49n4K06L8j14k0j09M9K9J07l1
2876H2o9Q4j62J5Q3Oj10NR5N3j24m4P1M0O9k1m1j61J01M8j52J03l0kR7o3l5R4j30J44j53P3
2596c4k7J1o2P8M2j12r3J03L8j0k9J24k06J67O8lj32J16p7R6L2j40K00j11N9j38Pk0L2K2M8
2325D9Lj40k1O8j66K07O6l0j07R3p5l6Q6JQ8jj05k3K9J00j3j16J5L5N5l7m5J02j05q0J14p7
$$ plain form
4241 -39 27 -75 -50 10 65 -41 -51 -60 -66 -63 -198 -115 17 -41 65 -48 56 -57 15 -15 -37 -51 35 9 -103 -109 62 -47 -69 -39 54 29
3961 29 -63 62 -154 131 -147 -41 -36 98 13 -59 -56 132 42 103 -109 15 121 -29 19 162 -61 -116 -130 58 -21 -11 -41 -103 -130
3707 -130 -156 -53 -64 -14 0 71 -18 -57 53 16 91 26 -59 52 -12 28 36 11 -22 25 82 32 -102 1 -41 -29 41 95 67 31 102 -69
3427 -69 -20 158 84 -55 88 135 167 118 114 80 114 -80 -12 130 157 108 -90 -29 11 25 -106 10 -41 -125 -47 63 82 -142 -72 -45 61
3156 61 -37 -121 -60 -20 3 48 12 -75 47 48 23 -61 -44 -27 -28 -8 -15 123 232 -32 130 -19 -73 133 171 57 37 -72 -23 6 113 82
2876 82 13 97 -65 -50 33 39 -71 -66 29 82 -42 -86 -15 25 94 73 32 -129 -28 20 -132 -29 -59 -61 36 -27 -62 32 -98 46 -107 -34
2596 -34 -61 -50 -112 -34 8 -104 -197 -94 -56 -66 -95 29 -177 -10 58 55 -77 39 -38 58 90 -50 150 39 98 -40 -33 -53 -21 1 49
2325 49 52 -88 -109 -41 -207 0 66 36 -71 22 -53 -89 -3 -2 86 85 -20 -43 -14 86 73 -43 -28 7 62 25 -20 82 -23 -103 11 -66
2045f6N0j27N1KJ23o4j14J17MJ43m7r4P8j19N7N8J5r9j8J40k4k24L4P6J17j09k2R7k9q6%J41
1765F1q3j4R9J1o6j7%O1L3L6j36k9J1J9Q2q6M4K9k7l7M4M8M8j60q4P2o0P3pj56J32L7p7p0
1467a69O0jK26l3j45m6Q9o8J11k0q6J59j16R7K1M8j1q1j74J39l5jN6K3o0m8M0j21N4J60j39
1196g1J8P9j93J45L6j24J33L8r2O9q6o8J26j6OJ8J1L5n0q2Q8MOJ2j19Q7NO9j28J7R4j31J1
907e3L7J06n4J2M1j07K2J40j9j46K5k7k7kP2N3o8q0J45r3K7J4R5n7j11J19k70K67j25J85j05
636A6J8K5o3j5K3nM8J7k10K72o0n9J5k7n2O8j48R3Q6p5L00k25p3P6l8o9K6N7k3p8J58m1j17
347h0Q9R0j04j18J58J1J9j5m7N1q7J66j41K8K6LK2K3j81QN9l2j0J30p5J27r3O1m5J02q2R4
67A57j32j0j0K8o2M8J30j80j04Q0J25Q4rr4k6L3p2pP2k9j10Q8q8J27jL6j26Nq8K59q7L1m6
$$ plain form
2045 -66 -16 -143 -92 -90 33 -31 -145 -28 -24 119 72 -22 56 -63 -6 52 67 -32 -50 90 66 -158 -124 -48 69 -40 -62 35 6 -80 -80 61
1765 61 -22 -36 63 74 8 -9 -9 52 85 121 -15 -44 -33 -14 68 -18 26 55 28 -9 35 83 131 -29 -113 -41 -101 -28 -35 -191 -59 -22 -99 -169
1467 -169 -109 -110 116 83 -62 -108 -19 -87 24 4 -82 77 -39 58 79 127 116 35 -139 0 -35 -36 20 43 -17 -65 -25 -146 -92 68 -71
1196 -71 -53 26 -167 -22 14 -110 23 61 -31 38 -48 -116 10 -6 0 18 29 64 14 -68 20 24 30 42 -77 10 15 84 -44 -27 67 -64 -53
907 -53 -16 90 36 48 89 -18 4 144 125 -21 4 -23 -50 -52 20 73 5 -75 70 -23 4 18 113 56 -55 64 -206 61 -64 121 16
636 16 34 59 -4 -19 4 -1 47 64 -146 126 66 7 22 -5 -57 11 -137 -44 42 -33 267 42 -31 45 7 -62 -36 21 -2 -80 78 37 -80
347 -80 9 99 -5 -123 35 46 65 50 3 54 -33 133 -8 20 46 49 71 94 -87 -79 -20 -52 -62 68 -7 120 27 88 43 145 63 157
67 157 25 15 5 33 -29 19 149 -31 -135 -55 70 154 145 51 25 58 -14 -21 51 22 -88 0 -88 39 38 74 -52 -47 -135 124 37 68 22
-222B2j16
$$ plain form
-222 22 -94
-230i4
##PAGE=	F1=22108.9
##FIRST=	23146.755397984237788,	4241.1433691826614449,	-0.17148935794830322266
##DATA TABLE=	(F2++(Y..Y)), PROFILE
4241c3Q6j14L0L0K1n0Jk4J9k1j30P3P0nJ00j52J75q4k1J5Nq9J86p0j19k0J58j00k5Q0L2Lj08
3952h1J89k47K61k61J52l2J19o9m5j9J33r3J04j57O1J29j27j5J49j84m7k3J79o3K6p9m0j1
3707i1j1Q3l9K6Q2N8j26l8J58j37J03l7p7J33r9N9J9o1k1P2J1Pj66Q0l5J1K9R3l7L5N4j93
3427e5P6J40j04j09J24M7P2l0l0p9Q0j97J09P3O7m1k21O0J8lj09R3L6j00J00R9J6k71R7rJ87
3156A36j21j71Q4Q2J3J4m7m8J32J2n3q3L8lK2K4m3J89O5k93J27j45K2K39l3q9j9j39O4K2R1
2885H9Lp0N2j27K6P8L8j54O8O0J4j35k9J09J0KM2k3j63J18jj32P6k6L0R7q6m6J06j26J56j87
2605a31O2n4Q4n7R1K1j24q7R4N4ko4J22j62J38Q4m7r4Q4j8Q5J6j63K31r3N7j55l0oM9qN2N3
2316H2j25n3O8j50J16J06l4j15J05l1o4R1%Q9rj14m0O4R6n6n3j7J1J31m5k7O3q1j13J24p9
$$ plain form
4241 -33 53 -61 -31 -1 20 -30 -29 -53 -34 -55 -185 -112 -42 -47 53 -99 76 -8 -29 -14 -9 -98 88 18 -101 -121 37 -63 -88 -8 24 27 -81
3952 -81 108 -139 122 -139 13 -19 100 31 -14 -33 100 7 111 -46 15 144 17 2 151 -33 -80 -103 76 13 39 -40 -80 -91
3707 -91 -102 -19 -58 -32 50 108 -18 -56 102 -35 68 31 -46 87 -12 47 66 5 -16 56 67 74 -92 -12 -47 -36 -7 86 49 84 138 -55
3427 -55 21 161 57 -52 72 119 191 161 131 52 132 -65 44 117 184 143 -78 -18 0 -3 -112 -19 17 -83 17 116 132 -139 -42 -51 136
3156 136 15 -156 -72 10 23 37 -10 -58 74 86 33 -50 -12 -15 7 31 -12 177 242 -51 76 -69 -47 192 159 70 51 -88 -24 -2 89
2885 89 92 22 74 -53 -27 51 89 -65 3 63 77 -58 -87 22 32 34 76 53 -110 8 7 -125 -49 -75 -45 52 -34 -80 26 -100 56 -131
2605 -131 -69 -123 -39 -96 -5 16 -108 -195 -101 -47 -49 -113 9 -153 -15 69 22 -72 12 -6 79 95 -68 163 70 127 -28 -58 -64 -15 -23 29 82
2316 82 -43 -96 -28 -178 -62 44 10 -105 0 -31 -95 -4 -4 85 76 -38 -78 -14 82 26 -27 -44 -33 98 53 26 89 8 -105 19 -60
2045f0P2j55M6NJ41j19p8R7m9J66L2j63P0p0O1P5L3j03k6J42k9k11kP1O4m0k2R4J3j36L5J56
1765A10j44kJ11l8j9n2J6J9O9P8j87m5P5L4Q4r9M1j6k2oO8nnj29k3Q4q2Q3k9j29J15Q0q9j20
1467a74Q4K4J63l3j45o7J22l4P1J2r5J39j28J73k1M4Jq9j37R1m3K7J9L2m2o5O7j17N6J76j36
1196b5N9J8k31J41N0j26J28M8o4P3j13l4J17j7j4rL5N9j5j53R3n2K6N6j64J36j3O7j13j0J19
925G2j87%J15K36j86j3O0r6J4J53j1j12Mm8pl4P0P3m9n4N1j37M1P9R8q1j14J09k63K36r3K53
645A79j48j0J8p2JL5M1K9Mk02K80k2j21j0L0m8N5j46P1J05q0K84k65o7O8M0m9l0Q2n2j6J00
365H4m2j31N4J05o4r6J26n5R8o4j7P0q6J51j56L9R0n4RJ8j73L5O7o6nJ62j26J08o7N3l6J24
85A55j20J22j50klM2k6N3P8j48j41R6J18L8L2j26K1O2j19o8J11k8o3R2n9O4LM6j54L5p0K50
$$ plain form
2045 -60 12 -143 -97 -92 49 -70 -148 -51 -100 66 98 -65 5 -65 -4 71 104 1 -25 117 88 -123 -125 -54 10 -30 -52 42 55 -81 -46 110
1765 110 -34 -36 75 37 18 -34 -18 1 70 148 -39 -84 -9 25 109 10 51 35 13 7 75 70 65 -64 -87 -3 -85 -2 -31 -160 -45 35 -54 -174
1467 -174 -90 -66 97 64 -81 -148 -26 -60 11 23 -72 67 -61 112 91 135 136 47 -90 1 -42 -15 4 36 -6 -71 -4 -121 -65 111 -25
1196 -25 34 52 -179 -38 12 -114 14 62 -2 71 -42 -76 41 24 10 1 36 95 80 -73 20 -32 -6 50 -114 22 9 76 -37 -47 72
925 72 -115 -115 0 236 50 37 97 1 15 168 157 45 49 1 -6 -40 30 103 54 0 51 -86 -45 34 132 51 -63 46 -217 19 -74 179
645 179 31 21 39 -33 -32 3 44 73 77 -125 155 133 12 2 32 -16 39 -107 -36 69 -11 273 8 -59 9 49 0 -30 52 0 -16 84
365 84 42 -89 -35 70 6 -90 36 -19 79 15 -2 68 -18 133 -23 16 106 52 61 79 -94 -59 8 -58 -63 99 -27 81 14 67 31 155
85 155 35 157 7 5 2 44 18 71 149 1 -140 -44 74 112 144 18 39 101 -18 -86 25 -3 -66 26 -33 31 34 80 -74 -39 -109 141
-195A41j13oj3p3
$$ plain form
-195 141 28 22 9 -64
-230f4
##PAGE=	F1=22061.7
##FIRST=	23146.755397984237788,	4241.1433691826614449,	-0.14061236381530761719
##DATA TABLE=	(F2++(Y..Y)), PROFILE
4241b7R2r1KKqj7K4l2O9m9j14P2l4N9Q3j52K01n9q3P4K4j35K21r9j02l3J38j00k9J00J0%q5
3952g8K26k56J83j73J38m5R0m7j3k8P5j17J30m0qJ09j08n8J69j35n3j4J07j4L2j04QJj0L3
3690@m9K1Q5M4j09j6J79k26J16j8l6J24r2N4M7r8k6R8k4K5j75M0kJ6k7J51n8P9Qj65P6R8j20
3401B0p1J13N2O5Ln6r6J04j64J11K3P0lk16N5roj04O5J06r1Q8Q5K3k73R7k4K36j37j95Q3O3
3121A7J7k7j0l2J14Rm9p5P2n2M3%l8K10Qk78Q6j12P9K23p2k3l4j62R0KP4M2q4Oq2K6M8N8j27
2815c3J01K5p0q4m1J59k7n2J24n7j52J17l4j05L6ON4J18j06p5R2j11J63k03P7m2R6k3J03l0
2552B6j31n6P9P0lr3J02j13Q5R5o6m7L3K1R6j2j47K14o2P1j58o6NN7p1Q9N3r5n9N5r9L9R7
2264Il8j13J40j5n5N0K2P7qj04l7M4R3o6Ro4OJ45k1l3O7p3j12J14j05R1j79R1l3J87j56n7
$$ plain form
4241 -27 65 -26 -24 -22 -30 -47 -23 -55 14 -35 -149 -77 -111 -52 31 -121 80 21 -62 12 36 -99 122 23 -79 -112 26 -74 -103 -3 7 7 -78
3952 -78 148 -108 75 -98 40 -5 85 38 25 -3 72 -45 85 45 37 146 38 -20 149 14 -39 -53 54 40 72 -32 -24 -23 -33 0
3690 0 -49 -28 57 101 -8 -24 155 -71 45 27 -9 115 23 77 124 26 0 98 74 99 -76 -36 -38 -22 -49 102 44 123 131 -34 42 140 20
3401 20 -51 62 114 179 182 126 30 134 -30 81 104 174 171 -45 10 1 -5 -109 -44 62 -29 59 144 167 -106 -9 -33 203 66 -129 -46 17
3121 17 34 7 -3 -35 79 88 39 -36 36 -16 27 27 -11 199 207 -71 15 -97 -18 205 133 110 76 -86 4 6 80 122 38 44 -38 -12 36 94 -33
2815 -33 68 93 23 -61 -102 57 30 -22 102 45 -107 10 -24 -129 -93 -87 -33 85 -21 -96 -4 -115 48 -155 -78 -120 -24 -47 56 26
2552 26 -105 -161 -82 -12 -15 -108 -6 -119 -34 61 -5 -52 -19 2 98 86 -61 153 91 162 4 -62 -57 0 -71 18 71 -24 -83 -28 -127 -88 9
2264 9 -29 -142 -2 -17 -72 -22 0 77 69 -35 -72 -28 65 -1 8 -56 -50 95 74 41 108 35 -77 37 -68 23 -156 -65 -98 89 -67 -124
1983a24N3r2J66J23k23L7PM3J00K2r2l0J21l7j74j4O7j0L8l8P9O5j76R6J37j74l2J26o7Lk2
1712b2J2l4R2J08k09n6J35JQ3p4Lj9k2J4P5o0l6q3M8N8n0N8l7j05Q8J02r2j18N0Q1Q2l5j15
1423g7n6R9J4K6M7j14J19j03K00o8K1J7o5q8%j6M8NLk4l3M8r9M7K20j66Q5j2k31J07N7j20
1143a09J26K9l7P3j07L4M6j0m7J7M3M4L1j64N8j19M4J14k08J77k4M0o9q6J52j69l2J64L28
890C39k94l5M5j6l3J47J7n8k5n1kp3N7R7j6n4k2j36N1J27P9j02r0Q2k00J87j19K90j61j7j7
618cm6K7J3R6j5kj44K54J9j67l6N6j8J9j22P1Q7r7K17k04o2L4J13k4o5O6n4L6L8l8j56L8J30
330F1k3o8N5p0J33j07K8N1n2J14j33L8J43j20k5O3j61N2J1q7O1J44j30Q5l9J2l6J24j22J17
67A19j44J7J7M0J9M5J3j09j25P8J16J9L7j23K4R5j48j19J27l7k6J13l0PJ7L8k01R6l8J82j16
$$ plain form
1983 -124 -71 -163 3 126 -97 -60 -53 -10 90 112 20 -10 111 74 -100 -114 -47 -57 -19 -57 22 87 -89 7 144 -30 -62 64 -3 0 -22
1712 -22 -10 -44 48 156 -53 -109 26 27 110 36 39 20 -2 12 87 27 -9 -92 -44 14 -36 22 -15 -120 -32 70 -22 -140 -90 -9 73 38 -77
1423 -77 -133 -34 -20 6 53 -61 58 -45 155 87 108 125 60 -28 -28 -44 4 9 12 -12 -45 3 -96 -49 171 5 90 78 -153 -46 11 -109
1143 -109 17 46 9 82 -25 9 55 45 -2 15 58 102 133 -31 27 -92 -48 66 -142 35 11 51 -18 -104 48 -121 -153 11 339
890 339 45 10 55 39 6 153 170 112 87 36 34 -39 18 115 99 45 23 -113 -62 65 144 42 -48 34 -166 21 -98 192 31 14 -3
618 -3 -49 -22 -9 87 72 70 -74 180 199 32 -4 52 34 53 -69 2 89 -8 209 5 -57 -23 90 66 1 67 13 49 87 49 -107 -69 61
330 61 38 -30 25 -45 88 -19 9 60 8 122 -11 27 170 50 25 88 -73 -21 -10 -97 -36 108 -22 63 24 36 0 124 2 119
67 119 -25 -8 9 49 68 113 126 17 -108 -30 86 105 142 19 43 138 -10 -129 -2 -39 -65 48 18 25 42 80 -121 -25 -63 119 3
-204Ck3K8k1
$$ plain form
-204 3 -20 8 -13
-230a3
##PAGE=	F1=22014.5
##FIRST=	23146.755397984237788,	4241.1433691826614449,	-0.10973536968231201172
##DATA TABLE=	(F2++(Y..Y)), PROFILE
4241b1Q6q2j3j2n2ON9k9J22p9r9P1j35J26M5j24J82k8r3J08K5j19J99j06p8l8J06j12l6J17
3979dK1j7n9K17k49J19q5J25o0O1l5Oj7L9j31J22Q4p3O3o9q0J62q2n7mL5K4K4j17O7Kk2nm4
3681c9mO7M6p4K3J72k58J03nnJ18q5M9P4j35l0J25n6K0j60QM2Qr5K09p8R8o1j03N8P1j19l5
3392e1J03M5M5L3q9o3R7j18P9MN6K4j71M8m0jq8L5J28q7P2Q7M7k54P0k8K48j35j52M8QL3n5
3104b2K5j5R5Qm6o8J08j02O4k4m6K19l5k53M7q1J21J93p5L1l4j70J06l1N7Q0r7m1l6K4LN9
2824F4n9R4Pj36l2n0J84m4q3J82j25j23J24n9p7lL7P7J40j25j04P6r5J70k06J02k9J08jJ04
2561A18q2j38k5O4Q4lj20Q1o1L4Q4o2Rj0L9Q0k3j17J64j5O9j27j07J4O5j35J15M1o5o5M9m1
2281h6J8O4p5r4J71%l4K2K9N4pr5l3K3J06o3L3j04K3J01K8o1J08p8q4Q4j30J13j89J47q6K18
$$ plain form
4241 -21 65 -17 -30 -42 -94 -88 -29 -58 64 -15 -114 -43 -178 -52 -7 -131 51 23 -70 38 63 -56 143 37 -41 -79 27 -85 -121 -4
3979 -4 17 0 -59 158 -91 28 -57 68 8 69 34 40 23 62 -69 53 137 64 127 58 -22 140 58 1 -3 32 56 80 -37 30 32 10 5 -39
3681 -39 -43 24 70 -4 19 191 -67 36 31 26 144 59 108 182 47 17 142 86 106 -54 -46 -4 4 -91 118 40 138 77 -26 32 103 -16 -51
3392 -51 52 97 142 175 86 23 120 2 81 85 141 165 -6 42 2 1 -87 -52 76 -11 61 148 195 -59 11 -17 231 96 -56 -8 0 33 -22
3104 -22 3 -12 83 91 45 -23 85 -17 47 23 -23 196 161 -92 -45 -126 -5 188 113 144 110 -60 46 15 72 152 55 14 -22 2 5 64
2824 64 5 99 106 -30 -62 -112 72 28 -55 127 2 -121 3 -56 -133 -136 -99 -22 118 -7 -111 -35 -130 40 -166 -64 -93 15 14 118
2561 118 36 -102 -127 -63 21 18 -102 -21 -82 -48 36 -26 -17 -27 12 92 69 -48 116 101 170 43 -64 -50 15 -120 -5 36 -29 -94 -45 -86
2281 -86 -68 -4 -79 -173 -2 -2 -36 -14 15 69 62 -33 -66 -43 63 0 33 -71 -48 53 81 20 128 50 -34 50 -80 33 -156 -9 -95 123
2001A23j68o2L3j12J23J71k29QJ00rJ15Lp0k1Q9n8j25j3P4p3R3q0P6J24k01J25J21j55p9J23
1738D6p5jL4j2q0J24R9j92q4J79k0R2n2l8J4l4J3O2q6l8m2O6K4J9L2m9p9O6R6p4q3JJ28pl0
1432A9p8mL5N8k2N6j08J15o2J61o7l2M9n6n5p8K4O9j1k8j0K3Ko9OK62j97R3rk23Q3P5j00J11
1135C2jk2O0q8J13k3Jr2P9K8LO6j39M0j68L8J50k29J95l3J6k6j62J95j42m5J85L45l63n6L3
863a0P7o5J18O8on7o3nj26Q2J20J6q0p2q7O1J37K3j11n3P4j16J23j59K82j36mq2mO7m2J19
583H9n1Jq3K31M4j78m4N6J8j7r6P1N4j31J42p1p3j8J83jp7K1k9O9k4k9j69L2J44Ol6j1k6J11
286A08j41Q5nnO8j16M5J55j34q7J48j55N9n3j01J33O9p5N4j9k6l1J01r4Q3j18L4L3K7N1N2
15A45l6r4q6N6J06K1J5q8J1Q8j37j29J31o1oJ19j6lL2K3k53J35K1Q5j00k2M4K9
$$ plain form
2001 123 -45 -107 -74 -186 -63 108 -121 -113 -13 -22 93 96 26 5 94 36 -89 -102 -28 -101 -8 -88 -12 112 -89 36 157 2 -77 46
1738 46 -29 -30 4 -8 -88 36 135 -57 -141 38 18 110 58 20 34 0 13 75 -11 -49 -91 -25 -1 18 50 1 -78 -12 84 10 -73 -72 56 49 19
1432 19 -59 -63 -28 30 8 64 -44 71 9 170 103 71 120 64 9 -69 -45 24 13 -15 -25 -2 0 -69 -63 199 2 95 86 -137 -54 21 -79 32
1135 32 31 9 69 -19 94 71 72 -20 59 87 90 156 17 57 -111 -73 77 -152 43 10 26 0 -162 33 -109 -154 31 376 13 -43 -10
863 -10 67 2 120 188 182 125 62 57 -69 13 133 149 69 -3 -90 -29 108 131 20 -33 41 -75 48 -111 171 35 31 -51 -55 12 -30 89
583 89 38 39 -44 187 231 53 9 65 83 66 -30 41 95 -36 106 35 -38 -56 127 126 49 70 41 110 86 57 -112 -80 64 70 34 23 -3 108
286 108 -33 52 47 42 110 -6 39 194 60 -27 121 -34 25 -28 -129 4 73 -2 52 33 7 -24 77 -17 66 -52 -18 15 42 93 145
15 145 109 15 -71 -15 91 112 127 39 50 138 1 -128 3 -58 -64 55 39 36 68 91 -162 -27 -6 79 -21 -43 1 30
-230C0
##PAGE=	F1=21967.3
##FIRST=	23146.755397984237788,	4241.1433691826614449,	-0.045933485031127929688
##DATA TABLE=	(F2++(Y..Y)), PROFILE
4241iN9p7k5J3r6J8P0mJ30o3p0N6k17J45M6q6J25jn9R5J2n1J21r2p9J4Q4j30l3R6L8k2o2J60
3944A06k10R5k9J18p7L7m0K5l1P0j32O3J82r3Nl8p9J26j8r0J6J0K4K4r9J16l9k3l3J1l2qN6
3655A3k4O4J39k14J00l9OJ04n7K7J00j25n3J00n5Jj32j2R5Nj44K30p5M7r2m2K9O4j16J5J03
3384F2K4k0N8j04lO5o0L1K6M0Qj09L8m3K0r3K0R9p9M6R7O8k18M4l6K34j21p3K3p0L6l5M7k3
3086aR5j6p5j3J04j36J04m0o6K07n7k09K2m9J45J43m8M4l5j47R7l9J6J29j09m7l9PnN0MO0
2806I6j3j57Nn4J67j7r0J95j78r0J26q5m8j2K7J01J23q0j21M2m9J32j77J24qQ9K1J09j16j63
2544a01J6L3J01Mj45O1m8M2O6n9M4k5L0O3l8q4J11K3M4n8j20RL8j45J32Lm9n0M7J4J8K1j20
2255a22o0K02l0L7k0K9j3L2p2r%R2m5M4j12K7J1P2o9J47q4n4N5j30R7j57J63j15K18j51p4
$$ plain form
4241 -9 50 -27 -52 -39 -135 -117 -47 -51 79 16 -54 2 -215 -70 -24 -110 15 14 -45 50 62 11 132 40 -39 -25 59 -71 -104 -8 30 8 -54 106
3944 106 -104 -9 -38 80 3 40 0 25 -6 64 -68 -5 177 84 89 51 -28 98 80 -10 6 16 40 64 -35 81 42 19 -14 -3 -35 -43 13
3655 13 -11 53 192 -22 78 39 45 149 92 119 219 94 41 141 86 87 -45 -57 38 43 -101 129 54 101 9 -33 -4 60 -56 -41 62
3384 62 86 66 124 20 17 82 22 53 79 119 127 18 56 13 33 -60 -40 59 -20 26 123 191 -27 17 -19 215 94 21 44 -26 10 -25 22 -1
3086 -1 94 78 3 -10 94 -42 62 22 -44 163 106 -103 -81 -130 15 158 110 154 119 -28 69 30 46 175 66 19 -20 -13 -18 32 36 96
2806 96 83 -74 -69 -123 44 27 -63 132 -46 -136 -10 -95 -143 -155 -128 -27 96 16 -105 -63 -112 20 -157 -33 -41 48 69 178 62 -101
2544 -101 -85 -52 49 53 -92 -31 -79 -37 29 -30 14 -11 19 82 44 -40 71 94 138 80 -40 -31 7 -138 -6 -3 -52 -102 -55 -41 -23 -2 -122
2255 -122 -182 20 -10 27 7 36 23 55 -17 -26 -26 66 21 65 -47 -20 -9 63 -6 141 57 3 58 -72 25 -132 31 -84 134 -17 -91
1983i1L0j00M7J75j88KJ55q2J44l0q0J7P2p2j11J6Q5r3J18j38O2J55j81J23J01q9j26J16m9
1730a2l8R7o4q8J39N6j14j09J64l1J12n6m2N8m4j9L0o5nl4L2PQ0Pn7n5M2P2n4j7j1J33p4j7
1432B3p8P7k1N8n5M7p3J29l2Q1k7j14R4r6j1j14P4O8K3q1J6N0q3ll6K57j80P5Mj81P7N2o2
1143d2Q0j6l5M5l2J48p0J6j30J57pl1P6q4K6j83K3J38k27K08k5jj1k18K21j12m2J66K96l78
881d4m5J1J64n2L6J22J8p3q0Oj74J39J25Pq3r9j8O9J06l4j01QO4n5R7k06K44j05Mj28M4R4
601F1j05J06o3J1m1K17K9j18o9J6O5n1l8N9Mj42O6P7o4p6J97J2q4j5K1O1l5k9j62J4J52jJ5
312I0p1O1M4j72J39n0K5K7j10R4J04r6j38K30j86P0r7j16K12k3kL4k2m5o3Q9m0M9j07N3RL4
32B6O8M6l9r7n0O1P0L6rm9k5O7j05q8J29p0m2J32l7K5M2lk46J24Q6mr5QL0N1
$$ plain form
1983 -91 -61 -161 -114 61 -127 -125 30 -52 92 62 -18 -1 71 -1 -112 -96 -11 -104 14 -124 -62 93 -88 35 136 47 -79 37 -12
1730 -12 -50 47 -17 -105 34 90 -24 -133 31 0 112 56 14 72 28 9 39 -26 -31 -65 -33 -26 54 61 4 -51 -9 63 9 -8 -19 114 40 23
1432 23 -55 22 1 59 4 51 -22 107 75 156 129 15 109 13 2 -112 -38 30 53 -28 -12 38 -45 -48 -84 173 -7 68 72 -109 -32 20 -42
1143 -42 38 22 -13 32 0 148 78 94 -36 121 114 83 159 75 101 -82 -59 79 -148 60 35 34 23 -195 26 -86 -128 38 334 -44
881 -44 -89 -78 86 34 70 192 210 137 57 63 -111 28 153 160 77 -22 -40 29 135 101 0 8 72 17 114 -92 152 47 51 -77 -33 61
601 61 -44 62 -1 10 -31 186 215 97 28 44 109 58 20 79 83 -59 7 84 20 -56 141 153 69 54 75 136 101 72 -90 -76 76 75 90
312 90 19 80 124 -48 91 41 66 93 -17 77 181 85 -53 177 -9 61 -36 -152 60 37 35 69 47 2 -61 28 -12 37 -70 -17 -8 26
32 26 94 140 101 4 -46 15 85 121 112 63 38 105 0 -88 41 -29 -71 61 24 49 91 88 -158 -34 52 48 -47 -39 -9 42
-230D2
##PAGE=	F1=21920.2
##FIRST=	23146.755397984237788,	4241.1433691826614449,	0.017868280410766601563
##DATA TABLE=	(F2++(Y..Y)), PROFILE
4241CL2p3k3M9j52J8Q0K3J26n8l5N2k79J37Q7n7N5J5j4M6KK0N6o7q1O5O4j48k7P8L1jr5P3
3944Bj61J28j6J48r7Pn7L2l6J10j02j4K17o8m8jp8R1L2j36N1mK4K4r4J54q1k4n0P9n8q4O6
3655d4K6R0R0j21R7r4oJ04j7j5J05r2n1N1l2k3j11pJ24J1j85K14k5n1q6J0rQ1j35O7J07Lq5
3366iQ3j18N6L2lj6M8K4k0o0M1l3L6j00L2N0r4M8J04Q6j94On3K13j00J6Rj37N2mM7n7J08k8
3069F5j12L1Q8j33J42o0r8J83n7j46Rn3J69R0qj3lr2P8o0k3J77j05l9o5J2j1M4K0O0n3j14
2789g7%n1J43Jn8J64k04p4J28j07pppR9J05l8r1Pj3Q2j24J20J7P4L0J03j38j78M7j1J17J2
2509F4j54N6o0P4M8n6N7j9J6M0k9p5M9N1L2K3j33MK4j44J37m7k2k1K0M4M2Lj64k8K12q6J20
2220G8m8K7p8O9m9J5k3Q3k2J4q0K9q1R6n0J62o6n2M2j14M8q6J37r9J83j30p9M5o7n0J61j23
$$ plain form
4241 3 35 -38 -61 -12 -164 -146 -66 -43 83 25 -10 42 -237 -100 -13 -70 -15 0 -14 32 34 54 110 43 -38 27 91 -57 -84 -6 25 24 -71 2
3944 2 -159 -31 -47 101 4 11 -46 -14 -50 60 -42 -56 161 93 45 44 -34 57 89 -47 4 0 24 48 -46 108 27 3 -47 32 -26 -110 -44
3655 -44 -18 72 162 41 138 44 38 142 125 110 215 123 72 123 91 68 -43 -50 74 85 -100 114 89 38 -48 -38 -47 34 -101 -34 73 76 -9
3366 -9 74 -44 12 44 41 25 73 97 77 17 58 25 61 -39 -7 43 -51 -3 101 187 -7 -1 -54 159 59 75 84 -53 -1 -5 42 -15 93 65
3069 65 -47 -16 72 -61 81 21 -77 106 49 -97 -88 -141 28 118 110 97 94 2 80 20 -3 174 69 30 -35 -23 -34 10 30 90 37 -77
2789 -77 -77 -128 15 16 -42 122 -82 -156 -28 -135 -142 -149 -156 -57 48 10 -81 -74 -87 -5 -129 -9 8 82 112 215 77 -101 -54 -65 52 64
2509 64 -90 -34 -94 -20 28 -28 29 10 26 66 37 -38 11 62 94 117 -16 -12 12 -132 5 -42 -64 -85 -65 -21 21 24 -140 -168 44 -42 78
2220 78 30 57 -21 48 -1 14 -9 74 52 66 -14 15 -66 30 -20 142 76 24 66 -48 0 -86 51 -48 135 5 -74 -29 -96 -146 15 -108
1940a08K1J51j35J67o9r0N5O8p5j08L2J12r7J08j86M2J80j53Q3J04m6j22J12l1p9J32r4p2
1695i8J30j2j6r5J04l1J46j14J4P0l7n3nk5M9n1k7J8Q8%m8m2ON2k7K3L4R4j07qq2J58p8O2
1397I2q5J2j3J28j7RK3j71J15j51K1q7J08N6M6j04K3M1j26O3p8K14j19K9L6j43O7L0k4M9l1
1126A3n2K9K8J36r7M8j39J83k4m8O5m9M3j65pJ11k00J96j0rj5k15K19j09k4J14K37l54k0M
863a11J97j0m9J75Op7q9K7k10K08J06k6p4j13N1Q3L7p8q6P6N7l8R4k30K07p4K4j61P6J05j45
592d2O5l7J4j8J84Mk2r5k3P4p3J9M3k6j30KJ87n0j32J99J3p9l9M8L0kl2j53%J39k9Q6j09J45
295A61k7j81J65p9K1lr0J53J7l0j62K90k36Q0r2j49K72r2N0J3k7k7j06O5JN1j08O4k6M3Q4
23I5L9m0j16k8J03J9N4k9j1o1M7p3m8J28o6o5J31p0M3M4k8j92Q3J21m5r0K9NP6
$$ plain form
1940 -108 -87 64 -71 96 27 -63 -8 60 -15 -123 -91 21 -76 32 -154 -112 68 -85 -2 102 56 -66 46 15 -64 68 -26 -98
1695 -98 32 20 4 -91 13 -18 128 14 28 98 61 8 3 -22 27 -24 -51 -33 55 55 7 -35 -29 23 -4 19 53 147 40 32 -50 108 30 92
1397 92 7 19 6 134 117 126 149 -22 93 -58 -37 -124 -16 40 86 -18 5 46 -80 -17 -95 119 0 29 65 -78 -11 19 -5 44 13
1126 13 -39 -10 18 154 57 105 -34 149 125 77 142 93 136 -29 -36 75 -125 71 61 52 37 -178 41 -68 -92 22 259 -95 -115 -111
863 -111 86 76 27 202 208 131 42 69 -141 67 173 147 73 -40 11 94 131 53 -33 43 100 62 156 -74 133 59 83 -78 -2 103 -42
592 -42 23 -14 0 -18 166 170 148 53 30 104 31 50 93 67 -63 -61 126 76 -56 143 156 77 38 86 116 114 82 -71 -71 68 39 125 16 161
295 161 134 -47 118 39 60 57 -33 120 137 107 -55 235 -1 79 -13 -162 110 18 68 81 54 27 -79 -14 -13 38 -70 -6 -32 11 95
23 95 134 94 -22 -50 53 72 126 97 86 25 72 -1 -49 79 13 -52 79 9 52 96 68 -124 -41 80 35 -55 -26 -21 55
-230E5
##PAGE=	F1=21873
##FIRST=	23146.755397984237788,	4241.1433691826614449,	0.045693755149841308594
##DATA TABLE=	(F2++(Y..Y)), PROFILE
4241Hon9MP6j87J5P4M5R8p1K5M1k86J16J39n1J4nJ9j3k2P7L9n5r7J19L9j27j1N3k6N1j23q
3944i5j19J75k8J94j32J7j10N5l9J24o2o7J84k1o5oo1O8N8j35L8K9RQo0J40j21Rn0J21p5j57
3664a74Q2N0Q4N7pJ09j63m1R8J9j5P4o2l0Jnj7j05K4J09K7j98J54L1j36k9J1l2J11j56J05
3392b4R6l4j05P1j05J11oJ6k5P5J2l9m6L2k4P3j04M4Lj22Q4P5J18j96pm5J50o7O4L1j57L6
3112a5M6kp4J33m1j35N7N5r2J49o0j27J30k0o7Jp6J66P2Mj14M3k1M8n7m8J77o5m4j01M2J6
2832b0M3l4R0r2n0pn7J30Lj4J16j90p3J20j22M3Pp9R9P4ok2k9K0L3p5Q6K8Q5j3J18j04k00
2544i2M5n2J09K9j27O7p5J02L0m2L2MJ3J3j8q9J8N3K8P8j18Qmj24J31q6J7j0J2K4L6N4j68
2255a02k3J60j21K00p1j0r3R6k4M1m8N9j3orpj29J17l2J17Jr7M9q8L0k6O5n4J22j26l3N8l7
$$ plain form
4241 8 2 -57 -53 23 -164 -149 -75 -30 68 -3 22 63 -223 -107 32 -19 -5 -10 9 -4 -26 51 90 35 -62 57 96 -31 -42 11 -15 36 -87 -95
3944 -95 -214 -39 -67 127 -5 12 -98 -43 -82 42 -20 -87 97 76 11 5 -56 12 70 -65 -27 2 11 19 -41 99 -22 -13 -63 58 -17 -174
3664 -174 -92 -42 42 99 92 201 38 -3 95 114 99 173 111 81 82 77 60 -45 -21 88 115 -83 71 102 -34 -63 -52 -84 27 -129 -24
3392 -24 72 38 -67 4 -101 10 4 20 -5 70 82 43 -3 29 5 78 -26 18 21 -101 -17 58 176 -20 -27 -72 78 11 75 106 -51 -15
3112 -15 31 29 -45 88 47 -88 -31 24 -68 81 21 -106 24 4 -63 -62 -138 28 100 104 -10 33 12 60 3 -45 132 67 23 -78 -36 -20
2832 -20 23 -11 79 -13 -63 -70 -127 3 6 -8 108 -82 -155 -35 -157 -114 -107 -186 -87 -13 -19 -41 -70 -50 -17 -92 -6 22 107 94 212 108 -92
2544 -92 -47 -99 10 39 -88 -21 -96 6 36 -6 26 30 43 56 38 -51 -33 20 48 126 8 16 12 -112 19 -67 -50 -60 -48 -24 12 66 -102
2255 -102 -125 35 -86 114 43 33 -60 36 12 53 5 64 51 45 36 29 -100 17 -15 102 103 6 55 -33 -3 -29 36 -18 104 -22 -55 3 -34
1966c4j14J42o2L6P3j21J84j05q2O4Q1o3j29M8J33q9R6k09J1J75j17M2J20n6p4J00Qj17J20
1712F1q6m2Q7o1N6k6K3l1J58j67J05L6k1q7k2K7P5q1r2M9N9L6n7m9%L4oK0J25K2j06%q1J98
1415A56j10M5r9j5O2J00j3m9O6j73R4j84N9l7J07L8N2q2mkj02J25r8J35n4j8N4r4O5k0lL3
1135C4qn6j7P6Q9r5R3j39J50ro2N5m2O4j11n0P6j40J47J0J0j5j57J61j27nO5J88l08J2j0J98
855G7N7j47K07k0q1n6K3j99K34R5p0m4j08P2O7j9q8m6J17M8q1J19k18J92p9K7j51P9J02j44
592c5J8K2K4l8J38k2P2j27m5N4n0L9K4j3r3l5K26o7j49J76L2r5l0M5j4M4Kj46l4J30n4J32
312A31j28J84o1j87J41o2Qj5q7K06o8M9j38K76k65R5k4k17K60j05R3k2k2L0j53O2oQ7j29P6
50Io8O2Q2M2k9j50%J30k4M2k0Rq9N1m9l4J42l1r6J13q1K9K9m6r6K9J30m3r3M8l3Q0
$$ plain form
1966 -34 -148 -6 -68 -32 41 -80 104 -1 -83 -19 62 -1 -130 -82 51 -38 58 -151 -140 35 -82 -40 80 24 -50 50 58 -59 61
1712 61 -25 -67 20 -41 15 -11 12 -19 139 -28 77 113 92 5 -17 10 85 4 -88 -39 20 56 -1 -50 -50 -16 -22 -2 123 145 39 39 -42 156
1415 156 46 91 -8 -23 39 139 126 77 143 -30 64 -120 -61 -98 9 47 99 17 13 11 -91 34 -64 71 17 -1 53 -41 24 4 1 34
1135 34 26 -30 -47 29 118 23 116 -23 127 118 56 111 69 133 22 -28 48 -92 55 65 75 60 -97 64 -63 -68 -3 185 -123 -111 -121 77
855 77 134 -13 194 174 93 37 60 -139 95 190 120 76 -32 40 107 88 0 -46 71 119 38 157 -61 131 52 79 -72 7 109 -35
592 -35 -17 5 29 -9 129 107 179 52 7 61 11 50 74 61 -32 -67 159 92 -57 119 151 56 26 71 57 101 103 -43 -77 53 -1 131
312 131 3 187 126 -61 80 18 26 11 -76 130 62 111 -27 249 -16 79 55 -162 98 -7 86 64 42 72 -81 -19 -25 62 -67 9
50 9 -59 3 85 127 98 -52 -52 78 54 96 76 85 -4 47 -2 -36 106 75 -21 92 11 40 69 23 -73 -44 86 43 -50 -2 -35 45
-230D5
##PAGE=	F1=21825.8
##FIRST=	23146.755397984237788,	4241.1433691826614449,	0.073519229888916015625
##DATA TABLE=	(F2++(Y..Y)), PROFILE
4241A4l2l3J9R2k11K2N7N6O9q4P1J4k45R5J84n6k4j7Rl7l8R2M7j9j17J19Jp0J4L7r8R2j11
3952h8m9j04J95n4K28j42N1j65P4k7J05l0q2J19pj7k7n1L8R6j22J2N1opl8J14j55N2l6J26
3681E4o5k04Q7O2Q1K6O3J25k15n9Q1M2j4M3l2rl8L5j1r9M6Q5L0j74P7O7j70L1ok4J13j55J16
3392a1N9m7j02O0r3J60n2nNR9nn9l4K5j4R7j20O7l0j36J36lJ50j89j1m1Q6k7P1O2j17NQ3o5
3095Dj05J66m5j15M5Mk4J54o4j55P8J7J1lr3J26R7j2j98P6L5K9m1p7J73%p3j21Q7L2L4j12
2815g0J44j34J1j6o7J41j8L1P2j64o0J13j39Q2Rj54R6O6KN3n8K8Rm9K9M6J04o2J23m9k03M4
2535d0r3R9M2q1N0m8R4L1rm1K8K0npj04qO5L9O9q5K9l3j04J36j12N7%qqL1J05j72j9J08j57
2229a31K68j06l3r8J24LO5p3K4j7k1O8o0j12J20l1P2O8j53M2l7L5Pl2K5N0j20J8P1qj66J34
$$ plain form
4241 14 -18 -51 -32 60 -151 -129 -72 -16 53 -31 40 54 -191 -96 88 32 8 -9 0 -37 -75 17 64 45 -72 47 48 -22 -8 29 -69 23 -88
3952 -88 -137 -241 -46 -100 128 -14 37 -128 -54 -81 24 -6 -88 31 24 7 -20 -71 -33 63 -59 -47 4 -2 -9 -47 67 -88 -36 -72 54
3681 54 -11 -215 -128 -66 15 41 104 229 14 -45 36 78 64 107 75 66 28 63 52 -47 -1 84 114 -60 17 84 -86 -55 -61 -85 28 -127 -11
3392 -11 48 1 -101 -41 -134 26 -26 -31 -26 73 68 9 -25 0 -14 83 -37 30 0 -136 0 -3 147 -42 -53 -94 -8 -35 36 98 -19 -14 69 4
3095 4 -101 65 20 -95 -50 -46 -70 84 20 -135 -57 -40 -29 -32 -125 1 98 86 -112 -36 -1 28 -13 -90 83 83 10 -111 -24 8 42 -70
2815 -70 74 -60 -49 -65 -132 9 -9 22 94 -70 -130 -17 -156 -74 -65 -219 -123 -57 -55 -2 -60 -32 -23 -72 -43 3 107 45 168 119 -84 -40
2535 -40 -133 -34 8 -73 -23 -71 23 54 45 4 32 52 47 40 -64 -72 -7 32 101 16 45 12 -92 44 -68 -11 -11 -19 -27 4 109 -63 -82 26 -131
2229 -131 137 31 -2 -100 24 27 92 19 43 26 5 73 13 -99 21 -10 62 130 -23 19 -18 17 24 -8 17 67 -53 -35 36 28 -138 -4
1948doM1l9o4J70j22p6P0R0n4j25M0J48q6Q8j78j8J22o6J5J12r0j3R9N2j50O8l9k1L4p1Q9
1668A6N9m1m3J60k23J99j2j7r9j8Q1N1r5j42O7J9Q2n4n4oJ5J5lJ96k8q2j2n3J91j42M3j01
1388c1j6J13N8k4o1P4j17J8j69R9J4O1N7J6k6p7k6o0J74q7O5k6n1Q7o2N1m7nJ9J8o1o1J10
1100B7L1q3J47j36P3K8n3L4m8Q8n2j05P6r4Q2M1M2rr6O3j03RJ0J60k43L6l1J68R6k07K00l1
820A20p1mrj54K14P5p2j4j02M8N4o0q5K0J33K5j38J39j62J62r7M4j25L9J00j12kP1K1o1Q9
548H6m4J20j33m3L3k8O0Mno0m9K06q2j16J50M6j07j7J6l4Q9L2j39o7J23p7J49j26J69l4j72
277e0N7k7J2k3q1K25j38J20p5K07k39P7N9k79K06r4J17n4j4J09j79O9m9J28j48Q9j11O6O5
23D5Q2l0j76L5J19k4NJ0Kr6N5k6o2J60K1j10R5r1KJn0J1l6J26k9q4O5o9Q4
$$ plain form
1948 -4 -10 31 -8 -72 98 -24 -100 -30 60 6 -119 -79 69 -17 71 -107 -125 -3 -69 -54 58 -32 -45 54 106 -44 24 -15 -36 -2 -73 16
1668 16 75 34 -9 151 -72 127 115 98 -1 -19 62 113 18 -124 -57 -38 44 -10 -64 -70 -55 -40 -43 153 125 43 31 -22 169 27 70 -31
1388 -31 -47 66 124 100 39 113 -4 14 -155 -56 -42 19 76 92 66 -11 -37 -97 77 -10 55 29 -22 65 3 54 7 2 21 39 -22 -83 27
1100 27 58 -25 122 -14 59 87 34 68 20 108 56 -49 27 -67 15 56 98 89 -7 56 -47 -38 -28 132 -111 -75 -106 62 158 -49 151 120
820 120 49 45 36 -118 96 171 99 85 -17 31 85 25 -60 -40 93 118 -20 119 -43 119 22 66 -59 -20 80 -32 -34 37 58 -3 86
548 86 42 162 29 -14 19 -9 51 55 50 -10 -59 147 65 -51 99 145 38 21 37 3 92 124 -15 -82 41 -36 113 -13 156 122 -50
277 -50 7 -20 -8 -31 -112 113 -25 95 20 227 -12 65 124 -155 51 -43 74 20 6 115 -64 5 -44 84 -64 25 -86 -20 45
23 45 127 97 -79 -44 75 51 56 66 68 -28 27 1 -61 99 120 10 105 14 16 17 -33 -22 -58 68 39 -45 20 -49 35
-230C5
##PAGE=	F1=21778.6
##FIRST=	23146.755397984237788,	4241.1433691826614449,	0.045452833175659179688
##DATA TABLE=	(F2++(Y..Y)), PROFILE
4241Hm6OL2P9j84J7M3M3M1q7R0m0j67Q2J81j8o1ol8j9m0O2O7L4j36P3l5k8M9L7j59J28q5l9
3944a16j08J84n8J92j06R7j90O6jL0om3L4JN6n1n4L6P6o8k2N0Onl3O3j51N7kJ08n2k22Q3P1
3646g8N5J4Q1J33k18o6M4O8qK0j5ll3N3Lj01M3O2K2j26K0O9j31N2j3j0J11j29Q3K0n2o1J9
3357g2n8J75q4o2O1J11j7n3l9K9k0J05j28O2k7j26J70q8J68j82Mj9L5LM0P9n5k1P3p9j28J56
3077A3k5l9%l1M8J00o8j34K5N3P0j8r2O2J10l3k09O3P1L6Jj07J58L4j12j07J32K7K7j70J82
2806F7j44L6j1p4J54p1Q8O4j48n3Q9j04O0Lj74Q5P1k1Q3n4J4M5p6rO5J20j30J15J1j57J6j04
2526a44Q2K0j0K4lM4K6O3j15L5N2n1Lr8m3J06L2K7l0M8l0j02J07j10Q7%j0k9mJ49j21l9K4
2237a0j44K77j21l8o9J12J6Q9r7J7m7k9J28r8p2J55o1L6J05k10M6QP9k5j13J07or4O9O2j9
$$ plain form
4241 8 -38 -32 0 79 -105 -88 -45 -2 39 -48 42 2 -165 -83 98 80 19 13 -25 -44 -84 -22 45 79 -57 16 -19 -47 2 39 -120 8 -77 -116
3944 -116 -224 -40 -98 94 -12 85 -105 -39 -40 -10 -16 -59 -25 -24 32 -19 -73 -37 39 -29 -51 -1 5 0 -33 30 -121 -64 -66 42 -10 -232 -149 -78
3646 -78 -23 -9 72 205 -13 -79 -35 33 25 45 30 27 -6 47 50 -51 -8 54 76 -50 -30 39 -92 -40 -53 -63 48 -81 2 22 -30 -91 -72
3357 -72 -130 45 -39 -101 -40 71 54 1 -38 -9 -29 76 -52 10 -17 -143 27 -61 107 -75 -71 -90 -55 -52 -12 67 12 -9 64 -15 -143 13
3077 13 -12 -51 -51 -82 -34 66 -2 -136 -111 -58 12 -6 -98 -36 74 41 -168 -105 -34 2 3 -104 54 88 -24 -131 1 28 55 -115 67
2806 67 -77 -41 -52 -126 28 -43 45 109 -39 -92 -3 -107 -47 -44 -218 -133 -62 -83 0 -54 -40 5 -71 -80 -15 105 -25 90 101 -56 -40 -144
2526 -144 -62 -42 -52 -28 -31 13 39 102 -13 22 74 23 26 -72 -115 -9 23 50 20 68 38 -64 43 -67 20 20 10 -19 -23 126 5 -34 -10
2237 -10 -154 123 2 -36 -105 7 23 112 15 32 -15 -44 84 -14 -86 69 8 44 149 -61 -15 -7 72 47 -66 41 35 -59 10 72 53
1966E3j90J49NN4j42J6J60j28p9R9O7p6p6J8J65j11P7j12k3M9k2RJ02j40K4R3Q8j39J0jLl0
1686b8m1P6J18n5p6J32k16K46o0kr6kJ14kr6j76Q4j4J01j7o4J7pL0l8K01k1n2o3J3J42j45
1406CL2r6MJ15Qql5L2j6q4r2J19L7%J04p5M4j63kpJ72n3L2o3l4J28p4K3k1l7J8J9l6r0J16
1100B0j2o4J73j32QN2k8L3p4Q6Rj59J28q0j4P0P1J9m4l9n6L0k6J47j78N2p7J24J01k05J53
828H8pp7N7j9j16J52O3j8m8q0J9M3o5p9O1J30j1j67J27r3J31j04M3q3pJ00r2K6P9L3r1M5k4
540A6J10j29m1K2J2P6j2j2m1n2J51q4n8J44M0j09K9n3l5R3O6j23q6R9o1J31j19J08K3j38l9
268g2J7J8k4n1J82j66J57j0J17j56K3J51l11J14n6J25q3k0J79j69Q4j02J45j46R5j18M7J1
23a9J65k7j65L1N4M5m8J7j8p8O0J5j31J57Q4j09Q9r8l7l8j7Q4p6J03j8n6P0q2R2
$$ plain form
1966 53 -137 12 17 71 -71 -55 105 -23 -102 -3 64 -12 -88 -70 95 -16 61 -51 -74 -25 -47 -38 64 -76 -52 41 129 -10 0 -1 2 -28
1686 -28 -69 7 125 70 -6 126 -90 156 96 94 -2 -4 110 108 12 -164 -80 -94 7 -10 -74 -57 -64 -34 -72 129 108 56 -7 6 148 3
1406 3 35 -61 -57 58 66 58 23 55 39 -45 -137 -18 19 19 123 48 92 -71 -73 -80 92 39 71 8 -26 102 28 51 30 -7 11 30 -6 -96 20
1100 20 8 -56 117 -15 -7 45 17 50 -24 62 71 -88 40 -40 -54 16 87 106 62 23 -33 -3 -29 118 -60 -8 -85 39 140 -65 88
828 88 81 4 61 42 -74 78 141 123 75 -5 14 57 -8 -87 -26 104 93 -74 53 -40 91 -13 30 -53 -60 40 -52 -26 53 86 -5 40 16
540 16 126 -3 -44 -22 -10 66 54 42 1 -51 100 16 -42 102 142 33 62 9 -26 67 133 10 -76 23 -38 93 -26 82 105 -33 -72
268 -72 -55 -37 -61 -112 70 -96 61 51 168 12 35 186 -125 -11 -67 58 -25 -45 134 -35 49 -53 92 -54 41 -77 -30 -19
23 -19 146 119 -46 -15 39 84 36 53 35 -43 17 32 -99 58 142 33 122 24 -13 -51 -68 16 -60 43 25 -31 39 -43 49
-230D9
##PAGE=	F1=21731.4
##FIRST=	23146.755397984237788,	4241.1433691826614449,	0.01738643646240234375
##DATA TABLE=	(F2++(Y..Y)), PROFILE
4241Co0M4M3O8j57J3K9K8K6p7R6j04q6P4J29N1j16L8p8J0m0L4M9R7j38km6nQ2L4j77J28n9
3952f9K0j34J49o5J52n0J13j58L3J5n0J6qj6mJ34p3o8K1N7j5n6M9K0ml2Pj07K1L8R4k8k28
3664b26Q0Q0J6rP9J21j83l1j3P6lmLLl1P3J8j03M3M2j7n7pK4m7L8j2J3Q3p9M9k1o0k0pqJ56
3340E9j04j23J15J22l0l3l3K0l8J05j45M1Nq1J59j49J65j33J4j1K0J0j5R1KpK3p3j31J11O
3069c8K8n1k7P9N1o8r4j1Q0P3j9p4JJ31o6j52J6P4M4M4j24J57K8j45n5J35OPj62J71j18M5
2789c4k5n4J64j28J57O9j47n7O6p0L9kj82Q6Q2m0N9k0kP9j15j2O7J23k00J08P2j12Kj04O5
2517f6lN0j3K9j7K6J43j49KR2q9j0o8o9J54J1k9L6L0j2q3P7j08R9k2Rl1m0J94o8o2m6j13K46
2220A00j26j0n6R2J9J13j21J0p9m0J87j14n4J89q8J8J17k29M1M2J16n4j91J63m2m6R2N2k9
$$ plain form
4241 3 -57 -13 30 98 -59 -46 -17 11 37 -40 56 -48 -134 -60 69 120 4 42 -36 -26 -66 -32 17 114 -24 -26 -72 -77 5 39 -138 -10 -69
3952 -69 -49 -183 -34 -99 53 3 116 -42 -9 6 -44 -28 -36 -52 -56 78 5 -63 -42 15 0 -56 -7 13 9 -23 -16 -123 -102 -64 30 2 -226
3664 -226 -146 -66 -50 -59 20 141 -42 -73 -86 -10 -13 -17 -14 -11 -42 31 49 -54 -11 31 14 -43 -50 -26 -73 -35 -47 -34 49 -30 19 -2 -62 -82 -89 -97 59
3340 59 -45 -168 -53 69 39 6 -27 -7 -45 60 -85 -44 -39 -120 39 -110 55 -78 -64 -75 -55 -45 -60 31 33 26 49 -24 -155 -44 -38
3069 -38 -10 -61 -88 -9 42 -26 -120 -131 -51 22 3 -71 -70 61 -5 -157 -141 -67 -23 21 -103 54 82 -63 -118 17 23 30 -132 39 -79 -34
2789 -34 -59 -113 51 -77 80 149 2 -55 11 -59 -20 -22 -204 -118 -36 -76 -17 -37 -39 40 -75 -87 -20 103 -97 11 83 -29 -27 -131 -66
2517 -66 -69 -19 -32 -3 -20 6 149 0 2 94 5 -5 -73 -142 12 23 -6 30 60 48 -35 42 -66 33 11 20 -11 -51 143 75 13 -33 -146 100
2220 100 -26 -36 -92 0 19 132 11 21 -58 -98 89 -25 -79 110 22 40 157 -72 -31 11 127 73 -118 45 3 -43 49 101 72
1966G2j90J41J4O2j99N8J30j04q6J25M2j03Jk3J59j08O3m9k8k4K6OQ0j56N1P4R7j07k4J3J5
1695B8n8OK9J09k4q7P8j53K36p7kr1J5J37o8q4j97J15l0Q3L1o5M8k5M8o7J31L7j7j23P1R4
1415A28j48J6r8O5P7l6J1noO2j64j4J37L5m0J74j90Q8k27O3MJ36lK8j16RJ48r5j4K8m6PP%
1117B1j05J24n1l3J27j22mO1j8M7q6N0Q1k04J89p8j22R6R6N2l5j18J2O3m8J24j22M2r7O1Q5
846H8j50P8K1p7J17l0q9P8O2M9r5p0MM3n1n2P4R6m4j42P7j2P2r0M2m7m9J03r3Q1M7N4r8K0
548A7j6Q9j17k8K3J6R5k6l2l1m5J08p2J0J26K2j10P5j09k8P5P6q2q2O3n7J14j13M9Q4j16j01
268a23O0K0j7j8J00j55J76M0L9o0o3K08l02O1l8J15j09k2K02j29Q5j21J24j36J22j04J7n6
23h4K46k7j30JOJ28j11J0k1m5M0Q1k11J40J11r5R0r6o9o9M1J02q6N9kk6P4r4J00
$$ plain form
1966 72 -118 23 37 99 -100 -42 88 -16 -102 23 65 -38 -37 -60 99 -9 54 5 -23 -47 -21 -15 65 -91 -40 34 131 24 0 13 28
1695 28 -30 -24 5 114 90 3 81 -72 164 87 85 -6 9 146 78 -6 -203 -88 -118 -35 -4 -69 -21 -46 2 -65 66 103 86 -37 34 128
1415 128 -20 -4 -102 -37 40 4 15 10 4 66 -98 -112 25 60 20 194 4 92 -135 -72 -68 68 65 93 -23 -14 134 39 25 53 7 14 21 21
1117 21 -84 40 -11 -44 83 -39 -43 18 0 47 -39 11 92 -112 77 -1 -123 -27 69 121 86 -32 -20 43 -5 119 -3 39 -58 3 88
846 88 -62 16 37 -40 77 47 -42 36 98 147 52 -18 -14 29 -22 -74 0 96 52 -90 -13 -25 47 -43 -1 -48 -97 6 -87 -6 41 95 -3 17
548 17 1 90 -27 -55 -32 -16 79 53 21 -10 -55 53 -19 -9 117 139 29 104 -5 -33 42 118 36 -46 17 -40 74 -39 10 94 -22 -123
268 -123 -63 -43 -60 -78 22 -133 43 83 122 62 -1 207 -95 -34 -72 43 -66 -88 114 -15 70 -51 73 -63 59 -45 -28 -84
23 -84 162 135 5 6 12 140 29 39 18 -27 13 94 -117 23 134 39 129 33 -36 -105 -64 38 -48 11 9 -17 57 -37 63
-230F3
##PAGE=	F1=21684.3
##FIRST=	23146.755397984237788,	4241.1433691826614449,	-0.056935191154479980469
##DATA TABLE=	(F2++(Y..Y)), PROFILE
4241a1m5N1K9O3j16L6mlL5l7L3j13j4M7N6J22j59J07j19L1k1J6J5J52j21p0l5m5J16M0j48
3970a12J06n5O9j56J41o9R9QR4j00k6L6r4M4jl4pJ59p9n6jJ1M6n4J3K4J3k5k1n6n6Q3R7k0
3672B1j89O2R1o3qO2Q1j50N0n6Q1n3J4J8J7k9P6j1q3L8L6m9qL1n3K9j0K0J6N0j2%rp8Lj5K2
3349e8J09j12j11J28J11k6k8k7Pl2O6j34QO2k7R6j47J21o4Jk4M4jm2J00j1M2k7n3r4M7L4N7
3060A5r2K0O0K4l9p5k4P7L6Qn6l8J19o8o2m6M1N1Q6j22J71l2j43NJ06k4k4r0J32o9O2p8k5
2771i4J41j30J87Q2j58n1N1l7k8L6j52N1R1j4j2J4jR8j43kO2O5k07Q0J22p9K3r1N3k2O5l7
2491c7M0o1K7J66j23m1J27j25k3l1r3K16n2n9R8jJ1o1L5q3Q3n2N6j6m8J77l4o3q1o2J79j16
2211d7J5o9Q5K0J20j22Nq3o8K20q9q6K11p7MP3j87L8Q6J24j30j98J97n0QP6M5n0j69J04kR6
$$ plain form
4241 -11 -56 -5 24 87 -29 7 3 0 35 -2 31 -82 -96 -49 7 129 -30 77 -42 -11 -32 -16 -1 151 30 -40 -75 -120 -4 36 -112
3970 -112 -6 -61 8 -148 -7 -76 23 31 125 25 -1 35 -59 -15 -16 -50 -57 102 23 -33 -34 -23 23 -31 -18 6 19 -6 -27 -83 -139 -56 41 21
3672 21 -168 -106 -15 -78 -86 -24 57 -93 -43 -99 -18 -71 -57 -39 -22 -51 25 14 -69 -31 5 -44 -52 -21 -74 -45 -55 -35 -19 31 19 19 10 -68 -65 -80 -58
3349 -58 51 -61 -172 -44 67 41 13 -14 -7 -39 27 -107 -99 -37 -64 32 -115 6 -58 -57 -81 -37 -38 -80 20 9 51 24 -29 -123 -76 -42 15
3060 15 -77 -57 3 27 -12 -87 -111 -34 2 10 -46 -84 35 -33 -95 -141 -100 -49 37 -85 86 54 -89 -84 22 -2 -26 -116 16 -53 9 -69 -94
2771 -94 47 -83 104 186 28 -23 28 -9 -37 -1 -153 -102 -11 -25 -37 -23 -24 74 -69 -71 -9 56 -151 -71 51 -28 -5 -96 -43 -65 0 -37
2491 -37 3 -58 -31 135 12 -29 98 -27 -50 -81 -174 42 -10 -69 29 28 39 -22 13 -70 13 -39 17 1 -47 130 96 33 -48 -110 69 -47
2211 -47 -32 -101 -16 4 124 2 7 -76 -144 76 -13 -99 112 35 39 112 -75 -37 49 173 43 -155 42 -8 0 76 121 71 -98 6 4 100
1931A00j98P3Q0o3r3J47Oj21O0n9J40o5L0ml6n4O0PL2j28O7L8J07q3m8LK3l8L1j7O6J0n6J3
1633C0q5J80n7j8p3K3J50r5r0j73J21m1N1P2n3P4l7M3n5L2Q9K2j81J03N3j24Nj09J21K8p5
1362f9K2L4k2Q6j82M8J26J1o5K44k47P1k41J16l0R3M6K9j52M5J86j37k6O6m8mmK0p6J24q1
1091a7PM0j24L5M7ON6q7%J31k09K23p2k17J15R0P9n4j27N9J02o0P5p2K3r6QN5o9KN2p7J34
802E8qq3J6R6Q2j38p2J2M4m2k4M6Q1m8r7J4M7J1m7K4k4n2Q0j25J40J5P1j02K6pQ6j21j1L3
505a9pJ12l8n4l4m2P1l2O5J02k7j05J33j32k5O6M7m1o1K5m5R0q8J0J00j02j12R6J0j0K4J1
225a2r9J43P3j4K8j77K34k37K8KQ4j34k2J74q3Q4j00Q3j22J12o7J4j08K69Kp9o3l0J89j25
-38D7j1k5%J8J19k67J11J10p7J08j11o7j04J07R1o9PJRP5j00Q8
$$ plain form
1931 100 -98 -25 55 -8 -101 46 52 -69 -9 -68 72 7 37 33 -3 -57 3 10 42 -86 -19 19 126 43 -5 -2 21 -17 14 -3 63 73 17 30
1633 30 -55 125 68 50 -23 0 150 55 -35 -208 -87 -128 -77 -5 -58 16 -21 22 -33 -1 88 110 -71 32 85 -39 -34 -143 -22 6 -69
1362 -69 -47 -13 -35 51 -131 -83 43 54 -11 233 -14 57 -184 -68 -98 -5 41 70 -82 -37 149 12 -14 52 4 0 -4 16 -60 64 -17
1091 -17 -10 30 -94 -59 -12 -6 50 -37 -37 94 -115 108 36 -181 -66 24 103 49 -78 -19 83 23 98 26 49 -47 -39 16 -53 -51 1 -76 58
802 58 50 -33 -17 79 161 23 -49 -37 7 -35 -59 -13 68 20 -77 -63 -16 -5 -52 -28 -52 -104 -24 -149 -9 6 77 -25 1 -6 80 -41 -52 -19
505 -19 -26 86 48 -6 -40 -82 -11 -43 22 124 97 -8 125 -7 -32 34 81 40 -21 4 -41 49 -39 -29 71 -31 -143 -47 -37 -47 -23 -12
225 -12 -111 32 105 91 119 -58 176 -61 -33 -31 53 -81 -103 71 -12 72 -28 55 -67 45 -22 -8 -116 153 155 76 13 -17 172 47
-38 47 36 11 11 29 148 -119 -8 102 25 133 22 -45 -149 -42 49 -20 -13 -12 -3 72 -28 60
-230F0
##PAGE=	F1=21637.1
##FIRST=	23146.755397984237788,	4241.1433691826614449,	-0.13125681877136230469
##DATA TABLE=	(F2++(Y..Y)), PROFILE
4241b5l1N7OM6p6N9l5l4N4J4j3j07K0L2k1J87j80J54j57N4lkk8J99j08r6J7j25J16O5j09R1
3961B1p4R5j68J46o1N8L5M2l0p5M4j01N4j3j1j7J36n5l7j4l7J07n2k2J7J6nl6Oj21J15R0j4
3672C9j50M5J00j39qN6N6j31J19q7R9j04L3M0L9m6N7l8o3M0M1p1PQ4j09O8m7N1J6LM5k7L0
3384D8j09J2k2N1N7j27l2R7R4k6k3k2mk8K9j25j2J31J1J6q6N7j1k5l7O8jn8Q7m9J04o5l7o1
3086i8K6N4L5j06Q7J2J6Rj07rO9nL0m0m4R3m3Pj05J0L3J05j05K00j05j03L8M8m2m3nJ06l1
2797a3P3j54L2J01r8J81O1j48k8K5j5q3Q4j20J5J00J1q5M6K1Q9j31%M2mj69M8J42p5N8o1K2
2517c3j2M3k0Mp4K3J38m6q4J38j36k0k5q6K28r9p1J48m3M4k7mo1O9q5J05Jo7J50k8m6o5m3
2229h4J17j00L9q1P7K1J27j21Qp9q8K15l5j35J99n0j7K4r7L4R4R4j62j62J96m8M6M6N0n8j48
$$ plain form
4241 -25 -56 1 7 53 -23 36 1 -33 21 35 22 -85 -65 -33 -54 133 -47 107 -50 4 1 -1 -29 170 62 -34 -17 -142 -26 39 -70 21
3961 21 -53 42 -126 20 -41 17 52 94 64 -11 33 -68 -14 -27 -38 -55 81 26 -11 -25 -62 45 -7 -29 -12 4 -1 -37 -31 -152 -37 53 39
3672 39 -111 -66 34 -105 -113 -57 -1 -132 -13 -100 -1 -105 -72 -32 7 -39 18 -20 -83 -43 -2 -73 -66 18 -91 -23 -70 -19 -3 0 45 18 48
3384 48 -61 -49 -71 -20 37 -90 -122 -25 69 43 20 -2 -6 -34 -5 -130 -142 -11 0 16 -70 -13 -24 -49 -86 -18 -19 -77 10 -39 65 0 -37 -98
3086 -98 -72 -18 17 -89 -2 10 26 35 -72 -81 -12 -17 13 -27 -71 22 -21 -14 -119 -109 -76 29 -76 124 19 -84 -46 2 -40 -83 -88 18 -13
2797 -13 60 -94 -62 39 -59 122 183 35 7 32 17 -66 18 -102 -87 13 24 -61 -15 6 95 -36 -36 6 2 -167 -119 23 -52 6 -55 -33
2517 -33 -45 -2 -22 -18 -92 -69 69 23 -61 77 -59 -79 -104 -190 38 -61 -132 16 -27 17 -10 -14 -75 -6 -91 14 15 -52 98 70 24 -41 -84
2229 -84 33 -67 -28 -109 -32 -11 116 -5 3 -76 -164 51 16 -119 80 30 13 37 -60 -26 68 162 0 -162 34 -14 32 78 128 70 -78
1957g8O7j9J25j72O3L3j9j12J56j3j25R4p0J19k6JM3o5n8P0K7j8j05R5J5J03p5n0l1M0j5L4
1677C4m0J8L7%p5k8J16k9k3l0J2J42r5q9j38J21n6M7O0n2R2j5K7k1m3J14L5j83P7J9r2Nj07
1388a60J77k1j14L2P9l4O2j69O8J23Mp5K68k41Mj60J31j02N1R9J9j52O6K10j76l6Q0k6j5j6
1126b4J8k4J30j05N8q1j04R7J7J7L5l4o2J73j84K09o6k62J10O2R8p8q2N0J44o6M0n3pn7l3
855f4M0ll8M0p4J23L6p6m5J76M7j62n6K1M5m7pJ8O6k6k6m1O3l8Pkrm7O5j76J78j7Q7j05L2
548a5KQ3j12J7M2k9J17o2o4k5m2L1J9Q6Q0p4j03J88j30m6O0K1%m0ql3N1l0j5Q2r6n2J10j9
251fj5N1m8j4P7P1l0P1k46K25j57J3L0M2j36%J06l1N6n9M4j08P6nL2j36K20L8k8j28rJ93j31
-38E8k6j8N5JJ17k56O5P1m9J22j29o5j39J74P8n2m6NM4P8j07P6
$$ plain form
1957 -78 -11 -30 95 -77 -14 19 0 -112 44 31 -94 0 -70 49 23 24 67 2 -56 14 41 23 -82 13 28 131 56 6 -25 15 0 34
1677 34 -6 12 49 49 -26 -54 62 33 10 -20 -8 134 39 -50 -188 -67 -123 -76 -16 -68 24 9 36 15 -28 86 121 -62 15 34 -58 -53 -160
1388 -160 17 -4 -118 -86 -7 -41 21 -148 -80 43 47 -28 240 -1 3 -157 -26 -128 -77 22 41 -111 -45 165 -11 -47 33 7 -8 -24
1126 -24 -6 -30 100 -5 53 -28 -132 -35 -18 -1 34 0 -62 111 -73 136 70 -192 -82 -20 78 0 -82 -32 112 46 86 33 26 -31 -64
855 -64 -24 -27 -65 -25 -99 24 60 -16 -61 115 162 0 -56 -35 10 -37 -44 -26 40 14 -12 -53 10 -28 -21 -23 -32 -79 -14 -190 -12 -29 58 -47 -15
548 -15 -13 70 -42 -25 17 -12 105 43 -21 -46 -88 -57 -38 48 128 54 -49 139 9 -37 23 44 44 4 -4 -37 14 -16 -31 51 -45 -97 13 -6
251 -6 -21 30 -18 -32 45 116 86 157 -89 136 -21 -8 22 64 -72 -72 34 3 59 0 44 -64 12 7 39 -97 123 161 133 5 -4 189 58
-38 58 32 14 69 70 187 -69 -4 67 18 140 11 -54 -193 -19 59 7 -39 -34 10 88 -19 57
-230E7
##PAGE=	F1=21589.9
##FIRST=	23146.755397984237788,	4241.1433691826614449,	-0.19301092624664306641
##DATA TABLE=	(F2++(Y..Y)), PROFILE
4241c7j0L5j6L2m3P6n1n2P1K6m1l6J4K8q1J96j50J55j75P3J3mm3J86j17o6O7j93Q5R6o2P4
3961E0j02R0j51J80j02O7M1k6%r4M9n5K5k9M2k2P8l8Nl9n2J53o8k8NOJ1k8N3j38J05P2l9o7
3664d6NJ23j96j6O1M9j37J37o9J07j32M5M7P5o2J6p7k2Q4L0o9k2J40j52P1m0M6J6l8P3m8Q8
3384H7j14Oj0M6J7j36P2L5O8k8m1Lj7j4j9r6qJ58L4l8mJ5no7l0O7Ql9O8q3J28n6k8m1L5N8
3069C1k8j21J55k4K3N2j54J5N7k9O4n6j1P1kK3j21qmJ00o6J92j55m5L8j2j4r5O9J01J6M3k15
2780a10Q5O7m8J51J4j26L5om6p0J10q9k1R8M2j42O0M1O3j06K1J3q1r7L1J30q6J15n2k3K7l
2500cK1m1o1K0M2N2r7J10r7%m9m2J60j16m6J61p0N7J1k8k1L1r8J18J4m5P9j4k3j2o3O9n7J8
2202b0p1R0J7R5j11Ko1q1J71L9j68J55l2k0j9mJ3Q8L9j64o9J53n2Q7KL9k6j38N3n8J48j54
$$ plain form
4241 -37 -47 -12 -28 4 -39 37 -14 -66 5 31 -10 -46 -32 -4 -85 111 -39 116 -59 14 27 23 -20 166 49 -17 50 -143 -58 38 -24 50
3961 50 -52 38 -113 67 -35 32 73 47 47 -47 2 -53 -28 -57 -15 -37 41 3 8 -31 -83 70 2 -26 -21 -15 -4 -32 21 -117 -12 60 21 -46
3664 -46 -41 82 -114 -130 -69 -20 -157 -20 -89 18 -114 -69 -22 53 -9 7 -70 -92 -8 22 -47 -69 71 -81 -10 -50 -4 12 -26 47 -1 87
3384 87 -27 -21 -31 15 32 -104 -32 3 71 43 2 5 -12 -26 -45 -141 -149 9 43 5 1 16 11 -56 -86 -19 -11 -50 18 -65 63 7 -21 -62 -27 31
3069 31 3 -118 37 13 36 88 -66 -51 6 -23 41 -15 -26 45 43 66 -55 -63 -67 33 -33 159 4 -41 -3 -15 -29 -124 -55 46 62 105 -110
2780 -110 -25 42 -6 145 159 33 68 62 16 -54 56 -33 -54 44 86 -56 4 45 108 2 23 36 -45 -142 -111 19 -67 48 -4 -27 0 -3
2500 -3 18 -23 -84 -64 -22 30 -67 43 -54 -54 -103 -145 15 -101 -147 14 -56 1 12 -16 -37 -6 -104 14 28 -17 62 48 25 13 -50 19 -38 -20
2202 -20 -91 -1 16 111 0 2 -59 -140 31 70 -98 57 25 5 -14 -18 -5 83 122 -42 -111 42 -10 77 79 118 92 -46 7 -51 97 -57
1922e7O4RJ5j16J27%j13J06q6Q9N%Q2q7n9L6N6n7q2J34pQ7r1k5l6L2j3J3m7J2M2Q5j68PN5
1616A2pl5L2j5J12m5q9r1R3o9P0K5p6Q6K2OM2q5R8L4j23Qj4n0Jq0J94m6j41L7J05l8K9j26
1318a24N3J16lo7K31j54p8m3P5j47L1J27jj11L8K12j78l0N9j7mm%J7J20j08R8j72n4J25k0
1047a3J9kL3j01J73j28J58o6k43J09K8R0j02Mj5J73n3J9p5qj1m9K8K4m4Kn5Q4N9n7o4K57k9
758A45j61k5JK4m4JK8O2lRo4L7l9QJ9j8l1N5k01J56lP7j01M4qO6r6L5Q1n3R2o3n1ln8j1N8
435c5R0M5q4j01K19j21o3O8llj3j8jlK0l1O2r9M0R0m9pO0q1P3J5M5k8N8k42J83q7PN0j3j06
120f3L1L0J6K2l6O5j11RL1R0j42J22P1K5j71K2J48j07m3K3P3jP2j81K0J8k4J32j34n6j60J91
-160a8R1l7r1QO8P4j12O0
$$ plain form
1922 -57 7 16 31 -85 42 42 -71 35 -51 38 43 43 125 38 -21 15 71 14 -68 66 59 146 55 30 -6 26 13 26 -21 -9 33 118 -50 -43 12
1616 12 5 -30 2 -13 99 54 -35 -126 -33 -102 -32 -7 -83 3 25 31 73 -12 86 120 -3 5 -9 -59 -58 -138 56 10 -131 -94 11 -27 2 -124
1318 -124 -71 45 42 -25 206 52 -26 -69 6 -141 -110 17 16 -95 -57 155 -23 -53 6 -11 -15 -19 -19 -2 118 10 108 -64 -118 7 -13
1047 -13 6 4 37 -64 109 -19 139 73 -170 -61 -33 57 -45 -41 -56 117 64 83 8 0 -11 -60 -32 -8 -52 -50 -105 -21 38 -19 -83 174 145
758 145 -16 -41 -40 -16 -60 -59 -31 31 28 37 -27 10 -29 -21 -2 -20 -51 4 -197 -41 -44 33 -68 -24 -32 34 -62 -27 54 1 93 30 -21 -24 -82 -93 -35
435 -35 55 100 16 -85 134 13 -50 18 15 12 -1 -19 -20 -23 -3 -34 28 -71 -31 59 10 3 63 -18 55 70 115 87 145 -97 86 -1 6 56 43 -63
120 -63 -32 -2 14 36 0 65 -46 -37 -6 84 -58 64 135 160 -11 11 159 52 9 32 105 104 176 -5 15 33 9 141 7 -49 -209 -18
-160 -18 73 36 -55 -47 21 95 -17 43
-230D3
##PAGE=	F1=21542.7
##FIRST=	23146.755397984237788,	4241.1433691826614449,	-0.25476491451263427734
##DATA TABLE=	(F2++(Y..Y)), PROFILE
4241e0J2J2l7J9j1R2n5n5O1J0l1K6j8M4r4J72j06J22j54Q4J6j8l2J53j44pR3k42N2J23j5N8
3961H0j31Q4j32K13j39P8K8o4j4p5N1j1k8k2R2k9K0j9M2p2k2J62j02pmmqK6O7j07O5K6o4J4
3664fl7J43k16l8R1O4j75J23k8J42j61N6M2R9q0k2j05L2J10Om0p2J74j67P2l1J8M1q5R9q1
3392c2J35j08J1KM2qj29J39j4L9l5n8L0l3Ko1o1K8J38K4p4R1j3l9o9k8O0J9k2N0j18J53m7
3104A4l5l5Q0N1q5j32J98m0N1O8j98M2M7n5J00o9kP4K1K2r1k5n4Q1mJ30j47K2j1m1K4j35J05
2815b9J09L7j3k35J31M8l1J24l0r2J10l6p7n7J34n7n7Q1N8j63O3N1K7p4M7m2j05m0M5J03j13
2544h3J61n7o7O8l8P6q7m8K0n2J25q5Q0o1K7o2QN2o4l4J19p3O7M2n2J9J3r1J11Ok4J0llO7
2237H7j10K6j2Rm8R0JO2r8pm9m4J09P2j62J32m4qm8N7m0J03Nj55L6R9o9J31l9mJ9j42P3j00
$$ plain form
4241 -50 -38 -26 -63 -44 -55 37 -18 -73 -12 -2 -33 -7 -25 19 -75 97 -9 113 -41 43 59 41 9 162 18 11 104 -138 -86 37 22 80
3961 80 -51 33 -99 114 -25 53 81 17 3 -72 -21 -32 -60 -82 10 -19 1 -18 24 -48 -70 92 -10 -17 -21 -25 -33 -7 60 -47 18 44 -20 -6
3664 -6 -43 100 -116 -154 -63 1 -174 -51 -79 63 -98 -42 0 99 19 -3 -108 -76 34 40 0 -72 102 -65 7 -24 -6 35 -50 49 -32
3392 -32 103 -5 6 8 50 42 -87 52 38 77 42 -16 14 -19 -17 -78 -139 -111 27 51 -23 68 55 16 -53 -81 -21 -2 -24 26 -92 61 14
3104 14 -21 -56 24 75 -10 -142 56 16 67 135 -63 -21 26 -29 71 2 0 74 95 117 26 1 -53 28 24 154 7 29 18 -23 1 -134 -29
2815 -29 80 117 104 -131 0 48 17 141 111 19 129 93 16 -41 93 36 -21 60 118 -45 18 69 96 22 69 27 -78 -118 -73 30 -83
2544 -83 78 21 -46 22 -16 60 -27 -75 -55 -107 18 -67 13 -48 -21 -83 -75 -23 -87 -121 -2 -75 -8 34 -18 1 14 -77 34 40 16 26 23 20 87
2237 87 -23 3 -9 0 -48 42 43 105 7 0 -49 -93 16 88 -74 58 14 6 -42 15 -25 78 83 -72 -36 63 -6 125 86 82 101 -41 32 -68
1940f8J67j51N2J6L5r3P6J9r4R3p7N3K9K3R7j06n8%Q1p1q3J77k7P1j06Rl4J8o8J3l5L5K8J33
1642A54k18M0qpk6R2m6R6J6j02n4O3q2R4j1r8P9M7k7J17j15Q2L4n4m7o0j9Km7J69l0j53N7
1353f2J12o4J0p1K5R8Om2J40m2j26O1j5j50OJ50l3q1OK10j55m8M1pK1K0k6M7P1j00J28j90
1073f0K4J00o5J5m1R6j17J49q0J03o7j74J13jP4j35P6r0J99m3K3j22mL4m3L4j8nl4l5N9N2
793A7n7n2L10q5j51J8l4rm4PO3L2J9M3n4l2Ll2P3m3m2O9j76J01MN9r9N3MK1n2L0J26o9M2m1
478B2k7K7p4n2P1P0K0q5p6K27j09p7P6k6oJ2k6L0n7O9m9L9p4J10L4o5J9L7r0J36j3MJrj68
172g9J30l4j0K9k8p2O4k0L9j0rQ7j14o0O8J45j52N3Q2N7j88L9Q7p0m6M9Q1mK6r7j4j1k3J45
-125A40j37l0j63J45J23l9j04QR0O9j16M3
$$ plain form
1940 -68 99 -52 0 16 51 -42 34 53 -41 52 -25 28 57 80 177 71 13 13 94 23 -60 117 90 161 55 64 30 48 -20 -7 -42 -7 21 154
1642 154 -64 -24 -32 -39 -65 27 -19 77 93 -9 -63 0 -82 12 1 -97 -18 29 2 119 4 86 120 66 19 -41 -60 -58 -105 64 34 -119 -62
1353 -62 50 -14 -4 -75 -50 48 54 12 152 110 -16 45 30 -120 -114 36 3 -78 -72 138 -17 -65 -24 -31 -10 10 -16 31 102 2 130 -60
1073 -60 -36 64 -1 14 -27 69 -48 101 21 124 57 -117 -4 -5 69 -66 10 -80 119 76 99 -23 -27 7 -36 -2 -20 -25 -59 -94 -35 17
793 17 -40 -92 218 133 -18 0 -34 -43 -87 -80 -17 15 34 77 23 -9 -6 -38 35 -8 -50 19 -157 -56 -52 7 -92 -39 -35 -14 -66 -36 90 21 63 22
478 22 -5 22 -52 -104 -33 37 57 -28 -104 123 14 -63 13 -13 -19 -7 -33 -3 -60 9 -40 -1 -75 35 69 4 23 60 -30 106 93 97 98 89 -79
172 -79 51 17 7 36 8 -64 0 -20 19 9 0 87 -27 -87 -19 126 -26 27 109 166 -22 17 104 34 -12 37 118 114 140 43 29 18 -5 140
-125 140 3 -27 -190 -45 78 39 -65 -57 33 102 -14 29
-230B9
##PAGE=	F1=21495.6
##FIRST=	23146.755397984237788,	4241.1433691826614449,	-0.12378859519958496094
##DATA TABLE=	(F2++(Y..Y)), PROFILE
4241b4j5On2K9J7O9l5m9J1lK0N0n7P8p3J03n2P5r0P3Ll5rJ08j73L3J07k31j1J48J7K5j24P4
3944A3j12K58j84N6M3n3n7n7O0J3j06K8J21rk6j1L5j10M1J24j06L4rrp9J04O5n9J6mj00Q0
3664@n3J26j99l8J24N1j63N2nK04j39j1P8P9r5l0j02N3J18l1Mj03J64j60P6j2j0N9j16R2p7
3392f4J47p2K6l7M4j0j05J39l7K3m9o9M8j0j4p8l7P4Q7qn9J55or8n3k0N3%JM4r9J13k4l2o2
3086h9J29N5j21j60K17l8Q1M6j95K9O9o6J18o8k7J13J9jl3l6q3O8M8K4r1N8o6l3N9j63J08
2815b9J38M5j13k09J69K8l9J00l7p8J54n5p8l6J23l7p7Q1K6j53O2N0L9p0Q5j18q1mQ3N6j15
2544i0J63p2p7N3k1J10j10l4L3j57J86n4O4l2M3p7M7o0M8m3L1n8Q7N4r1N5J3l8O5j5j0n5L3
2255ijJ23j53J2L1j0mJ09n7K6r3kl4lK9P0r2J19j02M1m2N7r7R4K5j22Q4K2n3J68n5o5N5j42
$$ plain form
4241 -24 -39 -33 -85 -56 -39 30 -5 -54 -43 -46 -26 24 -33 45 -28 75 23 98 8 81 84 49 40 148 -25 8 115 -116 -127 21 38 63 -61 13
3944 13 -99 159 -25 31 74 21 -36 -93 -33 -20 -126 -98 23 14 -12 -23 12 -98 -57 67 -39 -5 -14 -23 -102 2 67 8 24 20 -80 0
3664 0 -53 73 -126 -164 -40 11 -152 -100 -105 99 -40 -51 27 106 11 -19 -121 -68 50 19 23 -80 84 -76 0 -12 -22 37 -79 13 -64
3392 -64 83 11 37 0 44 34 -71 68 31 54 5 -64 -16 -26 -40 -118 -155 -81 6 -2 -61 94 88 -10 -63 -83 -30 -30 -29 15 -84 29 5 -27 -89
3086 -89 40 95 -26 -186 31 -7 74 120 -75 -46 23 -43 75 7 -20 93 112 111 78 42 -41 27 75 99 8 66 0 -33 26 -137 -29
2815 -29 109 154 41 -168 1 29 -10 90 53 -25 129 74 -4 -40 83 46 -31 50 76 -77 -15 35 74 4 89 -29 -110 -114 -31 25 -90
2544 -90 73 1 -76 -23 -44 66 -44 -78 -45 -202 -16 -70 -6 -38 5 -72 -25 -85 -37 -80 -49 -107 -20 34 -57 -2 11 -27 38 23 13 -42 -9
2255 -9 -10 113 -40 -28 3 -7 -11 98 41 67 -26 -28 -62 -65 -36 34 -58 61 -41 0 -42 15 -82 12 37 -85 -1 21 -32 136 81 16 71 -71
1957g1J13j19J40j30J7O2N0p8M5L6r3P8m6J9QN5R6q5q5k6J01o4j05J99k8K6p9K4oj2j27J7
1677f8j9P3J3J46k03N0m7m1J8J05n8R4N5j12l1J8q2J10qj16P8K6l1J42j13Q2K1Rq3o9j6nn
1388f7J09J0j34O0P8r8M1j4j3O9L9k4L9L9j07R7q6j16k6J63o1o6rJ86j11p7K6kO1K2l4M8J6
1100E8p2J22j14P7N5r2k8n4J11j08J29k6M5q7p1J03j0O3j73J32j66K04k1O4j64j2M3l5N1o7
837d3N0m9k2L8K2p7K1K86j21j32O4n4m4k1lQ9oK5N0kr4L8r1J23l9l7P8j41M9J2K0q3N6K3l4
531d9rJ5J58p0%qj5L4n9q4P1M2Pp3k6K14j28n2N6n5j5N1k6L7n5N7j15N9j7J47m7o3N5qp5J63
216A17pk1K1q3p2P1rLl2No2J05n2M9k5k4J16j06q2O2J67j63K3O0Q4j78M2N4n6k3O0O6k0J0
-82A00l8l2j1l6J26j14%j22O5J41p5o1J9N3R6j21L6
$$ plain form
1957 -71 42 -77 63 -67 -50 12 62 -16 29 65 -28 50 4 23 31 86 182 97 12 -14 87 23 -82 117 89 115 36 60 54 42 -85 -68
1677 -68 -87 -14 -1 145 -58 -8 -55 -96 -78 27 -31 63 118 6 -25 -7 -89 21 13 -103 -25 1 -30 112 -1 81 102 111 28 -41 -57 -62 -67
1388 -67 42 52 -82 -22 56 -42 -1 -15 -28 41 80 56 95 134 27 124 38 -78 -104 59 -2 -68 -77 109 -2 -79 -53 -55 6 28 -6 42 58
1100 58 -14 108 -6 71 126 34 6 -48 63 -45 84 58 103 16 -55 48 38 101 -72 60 -106 98 77 141 -23 -35 8 -27 24 -43
837 -43 7 -42 -64 -26 -4 -81 -60 226 105 -27 37 -17 -61 -82 -85 4 -2 23 73 71 -23 15 -76 47 8 -29 49 -92 -43 -31 -11 -94 -38 -15 -49
531 -49 -58 -43 115 45 45 37 22 56 -3 -87 -16 26 33 -40 -66 148 20 -32 24 -31 -46 5 -21 16 -39 18 -97 -38 -55 92 45 -18 37 29 -46 117
216 117 110 89 110 27 -45 26 17 20 -12 -7 -69 36 -16 33 8 -16 100 -6 -88 -26 141 -22 1 61 145 -33 9 63 7 -16 44 110 90 100
-82 100 62 30 19 -17 109 -5 -5 -127 -62 79 4 -57 -38 15 111 -10 26
-230B6
##PAGE=	F1=21448.4
##FIRST=	23146.755397984237788,	4241.1433691826614449,	-0.11615967750549316406
##DATA TABLE=	(F2++(Y..Y)), PROFILE
4241b2m2%n5N1M6M5j4l7p0LJ08L3r6J15k9J0MK8%M2k9k3j5Q0j78N0R9j92p6J68M9oj05P4j03
3935h7K92k27L8N3Lj16n1Q0Jj53J08Q5O0p9oLj28J14M5q6R7k2k1j49J83N0k3j8j8j07R3n2
3655c8P7j50pJ42K1j42j1J7K66j38r8J15O0r2j8j05O5J14q0O1j23J55j53P5Mj3N3j36R6q1
3392f4J52m7K6p5M5Po4Q5l0K2n0r1N6M3m3r2j0J12K8m2m2K06j1j37j6j2M4k5J5M7p2O3ql0
3095a0q8J76N5j23k01K09j9R2Mj40j2Q4q3J34o7n0J50J8k3K4m8r6P1N8p5LM9r2OM8j59R6J52
2806A43K7j92j49J91jn7J05j5j07J59n9o3l9J36l1j13R4Nj43N9N0N1p6J09j58k1j2J24Oj20
2544i7J64q4r2L5K1J18j29j6O5k41K34l2N7l7O8q4N6j18J42o9m4l1R5N3j41P7K6K6K5l1l4
2272a8q2P0LJ23j38j2P1l1L9J14j31K6j00J1j3J6k4L0j4J14j52R7l4L5j27O7P3p8O5l3j9J78
$$ plain form
4241 -22 -64 -64 -119 -68 -22 23 9 -28 -98 -95 13 46 -50 65 36 46 50 78 78 120 91 68 53 133 -45 5 104 -88 -164 4 53 47 -58 16 -87
3935 -87 205 -22 16 69 72 -44 -95 -15 -14 -167 -59 26 86 7 1 4 -124 -10 35 -51 46 24 3 -146 37 87 64 46 28 -79 14 -38
3655 -38 39 -111 -118 24 45 -97 -108 -91 175 37 -61 54 114 22 4 -101 -36 78 -2 59 -64 91 -62 13 17 4 57 -79 17 -64
3392 -64 88 41 67 -8 37 44 -20 65 35 57 7 -84 -28 15 -28 -120 -130 -18 10 -32 -74 132 121 -16 -32 -44 0 -25 -10 37 -35 28 20 -10
3095 -10 -98 78 133 10 -191 18 -1 91 95 -45 -57 27 -56 78 11 -39 111 129 106 130 82 -14 57 115 40 43 92 0 6 54 -105 -9 143
2806 143 170 -22 -171 20 19 -38 67 52 -55 104 45 -18 -57 79 48 -65 29 34 -109 -50 0 51 -25 84 -74 -95 -107 17 23 -97
2544 -97 67 -17 -109 -74 -53 65 -64 -80 -15 -256 -22 -54 3 -34 34 -50 6 -112 30 -39 -83 -114 -19 34 -107 -30 -4 22 47 16 -18
2272 -18 -100 -30 -27 96 -42 -54 17 -14 25 139 8 34 -66 -55 -68 -52 -76 -46 -60 54 -98 -1 -35 0 -127 -60 13 -65 0 -33 -52 126
1992A26n1j15M9j29J66j17Q6q1m0J00N6n2K7N2r3N2k7j3j4P0P8m8r5m5J32k9j49J81k3%l0
1721B4KL3l2j76K1mJ04j0J20j49O7p8p1O4Q2n8J01J03j34j9k5q0J02K1j22Q7k4j9J15q2Q8
1450E1J5N6q4n8m1k0K8N0M8j14O2M4j32P0L8k5J5O9j1j9M7l1P4j22m5p9J56q5m5%J38n2r1
1161i3J0MQ7Qj7K3k9l7R1J5Q4Qj05n6m3J02j06J03MJ1j18K2R2j9P7j86J48k02J96j4R3j70
881a7l2M0n9Q4r9J23p7k1K8Mj04Q9K20j16j27J00o0o2L9k5R4o8K9N1M6j11P7j50J20nl5Q4
601F0j17L2J7k3o4N7N4p5K4rJ53n8l2L3k1J9k5r6P1J5ro4N1J81j70JL0q9jO6m0L1kJ8j81P8
286h5O9J31j12m4R3n3q0J69J9k7M6j49j9N4J3J3j18O3n6J39o2L7l7l6J41j04o3J5J78j83L1
15a7K4J06j76L4N8l0J0K6N6m7L1l7k7K1o7J14q7J6m9nJ20j11j7N4qJ26j23K7
$$ plain form
1992 126 75 -40 9 -120 46 -71 15 -66 -106 -6 50 -2 25 77 -16 36 9 -4 -18 52 130 82 -13 -58 74 45 -104 77 54 54 24
1721 24 26 59 27 -149 -128 -132 -28 -38 82 -67 0 -78 -149 -85 -3 -61 40 143 9 -10 -35 -115 -13 8 -114 -27 -51 -70 45 -37 51
1450 51 66 122 38 -20 -61 -81 -53 -3 45 -69 -7 37 -95 -25 13 -12 3 72 61 42 89 58 132 10 -35 -114 42 -43 -88 -88 50 -2 -93
1161 -93 -83 -79 8 16 -1 22 -7 -44 47 62 146 154 49 -7 -50 52 -54 49 53 64 -54 -32 60 41 118 -68 80 -122 74 60 153 -17
881 -17 -49 -9 -68 16 -83 40 -37 -58 -30 -26 -130 -41 179 63 -64 36 -24 -86 -47 -72 22 -46 -17 34 80 -31 46 -104 16 11 -24 60
601 60 -57 -25 -8 -31 -95 -38 16 -59 -35 -44 109 51 19 52 31 50 25 -71 0 15 6 -58 -7 174 4 5 35 -54 -55 11 -29 2 0 18 -163 -85
286 -85 -16 115 3 -41 52 -1 -81 88 107 80 126 -23 -42 12 25 38 -80 -17 -73 66 4 41 4 -32 109 5 -58 -43 135 -48 -17
15 -17 7 113 -63 -29 29 -1 9 35 91 44 75 38 11 32 -35 79 -8 8 -41 -46 74 -37 -54 0 -8 118 -5 22
-230B2
##PAGE=	F1=21401.2
##FIRST=	23146.755397984237788,	4241.1433691826614449,	-0.050069212913513183594
##DATA TABLE=	(F2++(Y..Y)), PROFILE
4241in7jo5R6L6J3pj9j21J4J74j2r7J39Mo5M2l4J07%o6mm9Q4j57L4J09j20j55J59Q8o9m0N5
3944Gr6K95k14k0O4O0j39q3J26k1j66J75J2J33j22jm1j11J48k9m5J33k5n2j88K62Kj5k4j2
3681A3p8P1l3L1j32P9J30l6j07n0K9K94j25j90J55L4p0oq2M7P8j15J41j27J14j38O8RQK9j37
3410i6J03p6J57o0K9r7L2OLK9j1L8n6q9K8J18o6r9rJ36Nq2k6K08k5j25J9j4N7p5K9P9q0M7
3112C7%m2r9J94N7q6k53J77pR5n0n2m1Q4r2J17l6o7J66Kl8M6k6j08R8L9j16O7Lq2M8Pj11Q7
2815A8J53j1k23q4J61ko5R8L9j17O8m6J2j00J55m0j37J19kj24L7O0N9o6P7j44M9m9J63k5j36
2544a03J71j06p6nO6J03j21J7Q2l06K65j9P5o8Q6r9M8r1J93j20q1j0P2M0j31L8M4O4K1l5p4
2272f0p0J02j3Q7q0k5R0k4L5J35k19M1q1L6K0j3m3k2M9Q9j46J30k4j5j13K9R7opp1M1J51k6
$$ plain form
4241 -9 -66 -67 -132 -36 0 13 6 -13 -134 -120 54 42 -55 84 88 23 65 31 138 138 72 68 19 103 -54 -20 89 -31 -186 -27 61 -8 -48 7
3944 7 -89 206 -8 -28 36 96 -43 -126 0 -21 -187 -12 0 133 11 10 -31 -142 6 -23 -68 65 40 -12 -200 62 64 49 25 13
3681 13 -65 6 -27 4 -128 -49 81 45 -62 -112 -83 211 86 -104 51 85 15 9 -73 -26 52 -63 78 -49 65 -73 -5 4 12 41 -96
3410 -96 7 -69 88 28 57 -40 -8 -2 1 30 19 57 1 -88 -60 58 -8 -107 -116 20 25 -57 -83 125 100 -25 -6 -20 37 -38 -9 70 -10 37
3112 37 37 -5 -104 90 147 61 -192 -15 -22 73 23 -29 -70 14 -78 39 3 -64 102 104 66 112 86 -22 76 115 -1 66 69 -13 35 42 -69 18
2815 18 171 160 -63 -147 14 12 -53 45 84 -33 35 -11 1 -99 56 16 -121 -2 -4 -128 -91 -31 28 -38 39 -105 -56 -105 58 33 -103
2544 -103 68 -38 -114 -119 -53 50 -71 -54 28 -278 -13 -32 43 -25 61 -38 10 -81 112 -8 -89 -99 -27 13 -118 -80 -36 28 49 14 -60
2272 -60 -130 -28 -41 46 -34 -59 31 7 42 177 -42 -1 -82 -46 -26 -39 -82 -104 -55 34 -112 18 -6 -21 -134 -105 -8 -14 -21 -92 -51 100 74
1983G4j31J2j10J94r4L2rj03J14P1l1L3M2p2ppm1j8N2L5pn5m5J33K2j88J54j9mKm1Q9o7j66
1686a56K7k3J14j5Q6r9Q7p2r3R6L1n5J08J20j61J1l0j09J07L4j14J11p8J2M9l0P8QO6o1l2
1415A7m7n1M6qJ09r4L4Mj24Q6L4Jm6J06k0j9qP0J8j20J1j02J09p5k4L3O5np3j5J5J05k3J0
1117A9k2j6j8K7J55M4k1q7q4k5R8j05R9j6J1j46P8P3l9R1j66J36j96J87l8J06j24o9N0j07
855a05J18q6J45j11j0J4kj20J36J68j10r8R7m4n6J10q0P4j12L5M6O4r7Q2j54P5L4KO6j41N8
583bJ7m6o0O2P7n6J7k3Q4l6l0O0l6j7J4q2R7j2J1p7J11J05j94P6l3j09N2O7n7kQ4l8k45R2
286a29J57R4j52l0J04n0r5J70L8rM2j85k0R0oJ4j53J19n8J46n9L5k9o5J34q7l7l3J74j96L5
15d1NR9j50L5O6j1Q1m9M9p8O1q1j4N2p8J01p5L0J5l7O6j26M2P7p2J57j22N9
$$ plain form
1983 74 -57 -45 -155 39 -55 -23 -32 -135 -21 50 19 52 94 22 15 8 -33 -51 1 36 29 -26 -71 62 84 -104 50 31 27 29 -12 77 10 -156
1686 -156 -129 -152 -38 -53 33 -66 21 -51 -144 -48 -17 -72 36 156 -5 6 -24 -133 -26 8 -106 5 -73 -61 -12 -42 36 44 110 49 17
1415 17 -30 -81 -35 -43 66 -28 6 10 -114 -28 6 7 -39 67 47 28 20 90 108 -12 -1 -103 6 -69 -93 -60 5 0 -73 -88 -73 32 9 19
1117 19 -3 -19 -37 -10 145 189 168 81 -3 -28 70 -35 64 48 59 -87 -9 64 25 116 -50 86 -110 77 39 145 21 -48 2 -105
855 -105 13 -73 72 -39 -49 -35 -37 -157 -21 147 37 -61 36 -8 -64 46 -34 40 -72 -37 9 73 -24 58 -96 -21 13 15 81 -60 -2
583 -2 15 -31 -91 -29 48 -8 9 -14 70 34 4 64 28 11 25 -57 40 28 39 -38 73 178 -16 60 27 -82 -30 37 -20 -22 62 24 -221 -129
286 -129 28 122 -30 -60 44 -6 -101 69 107 98 140 -45 -65 25 19 33 -120 -1 -59 87 28 63 34 -31 103 16 -21 -54 120 -76 -41
15 -41 -36 63 -87 -52 14 3 84 35 84 6 67 -14 -28 24 -54 47 -28 2 17 -20 46 -80 -38 39 -33 124 2 61
-230F1
##PAGE=	F1=21354
##FIRST=	23146.755397984237788,	4241.1433691826614449,	0.016021251678466796875
##DATA TABLE=	(F2++(Y..Y)), PROFILE
4241Cp2jp6J43K3j6j6j6j21K8K04m6p2J38J7j15O9j06J79k6q4L1q1Q6j36J6J18n2k09J25J27
3970F2j32M9J3q7L02j89o6M8R0j26j26J81k8j68K05p1J99j54J7o9p6J30p6pJ62l4r0j71K86
3716G4n2j2k1Mk5K6LLj51J75J22r1j13m7K3L05j01k69J94J0m9Po9J9L2j15K21j32M9r7N5J4
3436hK8Nj26J22q3J49q5K1j07L0KO9QlN3o3p1l3J69o5q2l2J40Rj27j3K11l9j14N4j7P2j26
3147e2M3J01j00M2J9m2r7J88L5k5k80J19j9J10r0L5p0Q3j01J01lr7J68jm1N6j6j20J23oo9
2876fJ10o5m7O7m3p3Q4J57n5j82m6J07J0o2P9Q0j29k4j1O4j56J79p1j38J53%j06J6N7N6n6
2605e1M7j23J27p4J62l1j73J85j22p2rQ1N7p1M3Q3l08K69k9R2r9R2j25N4m9K14j53p9l3N6
2342c9L1j09J1L1P0L6j9r9m2J00j4K2nj6Q2l1J6J52k64O5n1N2M6p4j5l1P3Mq7J32Jm8q0l0
$$ plain form
4241 3 -69 -70 -146 -3 20 4 -12 -28 -149 -121 83 37 -35 103 120 5 74 -32 147 121 37 68 -13 73 -63 -47 71 19 -190 -65 62
3970 62 -70 -21 -8 -95 207 18 -48 0 90 -36 -162 19 -9 -177 28 -43 156 2 19 -50 -126 4 -72 -79 83 49 -41 -212 74
3716 74 22 10 -11 -7 -32 -6 -3 0 -151 24 146 55 -58 -105 -82 223 122 -147 47 57 8 15 -54 -35 -3 -118 103 -29 20 -77 -22 -8
3436 -8 20 25 -101 21 -62 87 2 23 -84 -54 -52 17 25 22 75 12 -59 -92 77 12 -70 -102 38 47 -80 -93 118 79 -35 19 2 74 -52
3147 -52 -9 92 -8 34 53 11 -86 102 137 112 -168 -49 -68 42 -48 -13 -83 0 -101 0 -3 -100 68 67 26 82 66 -54 69 63 -6
2876 -6 104 39 -8 59 16 -57 27 184 129 -53 -99 8 18 -44 35 115 -14 -38 -49 15 -141 38 -33 -171 -18 -18 -124 -108 -51 5 -51
2605 -51 -4 -127 0 -74 88 57 -116 69 -53 -125 -134 -53 4 -67 -24 59 -249 20 -9 83 -16 76 -49 5 -44 170 17 -62 -95 -39
2342 -39 -8 -117 -106 -75 -5 31 12 -87 -129 -29 -43 -21 -26 -42 40 9 25 177 -87 -22 -73 -21 25 -49 -64 -95 -22 -18 -105 27 28 -20 -100 -130
2045a30J01N9q3o4O4J00K7j12l8o6J64o6j8P9j51R3R7k4K3M3l7o7J3o7j9J2J7M2pn6J21P3
1765A23k28J38pMkq2J49q2j36J3o2J22k4P6p4J06o9o2R9j5m5Q9J14j79N1j6j65J40K7j03J38
1493C8j21N6k8J5M2K5P4m0on5q1O5o6J70p5Pk6j08J01j8M4r4J43k8j7n9J32l0q9M8r9L9l8
1205g9k6P6Jmj7k2lJ27n1L4p2L3j5l6K50Jn4m8q9l1J19j08R4m0Qj51J09N2o1P9q6P6j54J77
907H9o4R4n2j11N8j61J47l2J26j52oJ9J2j09J32J28r0n6N7k4m8J74j45M2j21N5N3M8o7N8j35
636h1K5P1M4N0k03R6M0m8o5N7P8j0j6j6ll2RP4m8m8L9q1J36k7L0q9J48Oj75J49r5j25J05O8
338F3p2l3J45p2k77R1K35M4j55k5Q2l1q8J94kL3K4j87o1J37l4Oj38J43m1J21n2L6j9r0J01
67G8m5j6q1J81j97K8k8J02j14M6M1K2J66j35K8j06Q9j23LO0o6Q5o7L1O3l9nr6O2J06j32J89
$$ plain form
2045 -130 -29 30 -53 -117 -53 47 74 -38 -76 -142 22 -44 -62 17 -134 -41 56 32 55 98 61 -6 7 -60 -79 -67 -50 -8 -15 -71 50 123
1765 123 -105 33 26 30 28 -54 95 13 -123 -110 -172 -50 -74 2 -72 34 -35 -97 2 -13 -58 31 145 -34 17 1 -164 -24 3 -100 38
1493 38 -83 -27 -55 -40 2 27 101 61 55 0 -81 -16 -82 88 13 20 -6 -114 -13 -31 13 -81 62 34 17 -42 90 60 -29 19 -80 -41 -79
1205 -79 -105 -29 -28 -32 -49 -71 -74 53 2 36 -36 -3 -18 -54 196 197 143 95 6 -25 94 -14 80 40 48 -103 6 58 -3 76 -10 66 -88 89
907 89 25 119 67 -44 14 -147 0 -32 94 -58 -64 -45 -33 -142 -10 118 28 -28 29 5 -43 131 -14 28 -93 -38 15 63 -4 54 -81
636 -81 -56 15 59 109 -94 2 42 -6 -71 -14 64 54 38 22 19 -13 -4 70 22 -26 13 -68 68 41 71 -18 130 136 -39 110 15 -110 -5 63
338 63 -9 -42 103 31 -246 -155 80 124 -31 -56 26 -5 -93 101 99 132 156 -31 -92 45 11 17 -121 22 -19 102 50 86 67 -23 78
67 78 33 17 -64 117 -80 -52 -80 22 -92 -46 -5 17 183 48 76 -30 59 -64 -61 -1 -67 18 -49 -18 45 6 1 -95 -33 73 -59 130
-213A30j19R0
$$ plain form
-213 130 11 101
-230A01
##PAGE=	F1=21306.9
##FIRST=	23146.755397984237788,	4241.1433691826614449,	0.023007750511169433594
##DATA TABLE=	(F2++(Y..Y)), PROFILE
4241Dm7Jq7J54Jl0k5k5p3J6J95m2m7J34mj23P5j63K06k7q0K2r0R4j16K9J03J8k28P6J72k03
3961a10J18m0o2K66j46q5M3N0o7j54K23mj67J84j32K04j44L2m7n9R6p0j8J67n1j15r0K56j05
3707b7j6pNN2J0Jkj81K44R9r7j43pK8K54j00k60J54K6lk0o9K0rq5K70j37l4l8N1J0J4K8j12
3410h1J35j02J38j43J7n5j1jJ30M5l4N2o4n8q5J88j8n0p3J05L8j39l3K07m9j06O9K0L2j11
3147c7J7J00j07M2O0q7k6J29K3K5k72M3nJ01j03P4m6P1j12R4lq3J18J6m8L1K9j24J24l7K6
2876C3J04r6m0M6q0l0O7J57q3j05j5M4K3m1P4P4j36q4M6Q0k03J94j08j19J82j3q0JN5N4o9
2605f8L5q8J71p9J20%j86J77j38q4L7N0RNO6M3k48K38p6R2q5Q3j29O3j5J89j51l8q2K2M7m8
2325f8l5nL6M4J6o0l2O1%k4M9MO5o0KJ50k59O3K5M5M8j40N8ON2j00j3Q7L2p6l4m7O9Q7j35
$$ plain form
4241 4 -43 -42 -129 25 26 -4 -29 -54 -127 -111 84 42 -5 129 125 2 77 -86 120 93 13 35 -55 39 -77 -48 55 73 -155 -79 93 -110
3961 -110 8 -32 -94 172 26 -59 -16 34 -33 -187 36 32 -135 49 -83 121 -23 9 -38 -97 -1 -71 -89 78 27 -88 -178 78 -27
3707 -27 -43 -50 -45 7 17 18 16 -165 79 178 81 -62 -69 -41 213 113 -147 7 33 30 10 -59 -39 -48 -133 137 0 -34 -72 -21 -11 3 31 -81
3410 -81 54 -48 90 -53 -36 -91 -102 -103 27 72 38 90 26 -32 -117 71 53 3 -70 35 73 -66 -99 108 59 -47 22 42 74 -37
3147 -37 -20 80 -27 15 75 -12 -38 91 114 139 -133 -90 -95 6 -97 -23 -69 2 -110 -16 -19 -102 16 32 -16 15 44 -80 44 7 33
2876 33 137 41 1 47 -33 -63 4 161 78 -27 -42 2 25 -16 58 132 -4 -88 -42 38 -165 29 -79 -198 -16 -29 -109 -108 -53 1 -68
2605 -68 -33 -121 50 -29 91 91 -95 82 -56 -140 -103 -53 -44 -39 27 70 -178 60 -16 76 -9 74 -55 8 -7 182 31 -7 -89 -67 -20 -68
2325 -68 -103 -108 -72 -28 -12 -72 -104 -43 -43 -67 -18 -14 51 -9 -7 143 -116 -53 -28 17 65 -75 -17 -11 41 -59 -72 15 47 -29 -63 -110 -41 46 -89
2019h9j3N1M2O0n4q6j8J04n3qJ37j67L4J37l1oM2Jj08L3r7j8l6L7Q3K3p1J07J05k35J44j3
1738C7K9k7j08J79q3j28J1p2J04rR1q8J17p5j3O5k7l2N9O1j64P6Mj76J69rq2J42j29J12q2
1467d8L3KL3O8k9jk5j03M3r4K25n2j0l7p7J02r1O7j28J77l3l0n2J28l2o8N7o9l7J5k7R3l9
1178c9m9O0Km3J35m3Pj21J00jn2K60m0q6Pr2k8J48j29R7m6J9j52J04N4j04M6J5Jr6J71q6N3
890G2K4j23P8k21J81J2P1j78KL9Mo0Q8J03n7pRk6k5K06k32L0q8O8O6J8m0L1j05j1N9R8M4k67
592a37J29M4j2r2N2P0L6m7Lq4k7M5O5k4o7L1o7J66l3O3j11J52q6j28J67j24j09J28N7l4o2
321c6J35p8k33P4K45j1q7l8L6np7K57r8Q9j1j84p5J65q2j3o5J25k6R2n4N2lj08O9j6j3j19
41i3J94j43Lm5O8o1O6%N4K01j69J1j29J03j18j4N1k3P3j02L9P6j0n8m4M0J16j38J75j09J25
$$ plain form
2019 -89 -102 -51 -9 51 -3 -89 -107 -3 -56 -64 73 -94 -60 77 46 40 82 83 -25 8 -89 -107 -143 -106 -23 0 -71 36 141 -94 50 37
1738 37 66 39 -69 110 27 -101 -90 -162 -58 -67 24 -64 53 -22 -35 30 3 -29 30 91 -73 3 7 -169 0 -9 -91 51 -78 34 -48
1467 -48 -15 -13 20 88 59 58 33 -70 -27 -121 104 52 42 5 -72 30 -61 6 -122 55 22 -8 -60 68 36 -32 25 -44 -81 -66 -93 0 -39
1178 -39 -88 -28 -26 -69 66 23 30 -91 9 8 -44 216 176 90 97 5 -23 125 -4 93 47 66 -86 18 72 -32 14 29 30 -66 105 19 72
890 72 96 -27 51 -170 11 23 94 -84 -82 -43 -39 -99 -11 92 35 28 37 11 -14 192 -40 -10 -98 -30 36 54 14 45 -60 -71 -12 86 130 -137
592 -137 -8 36 24 -68 -16 54 90 43 46 -38 -65 -20 45 21 -46 -15 -82 84 51 114 3 155 69 -59 108 -16 -125 3 60 26 -36
321 -36 99 21 -212 -138 107 96 9 -29 7 2 -75 182 84 173 162 -22 -97 68 -14 -27 -92 33 7 99 45 97 94 -14 55 39 26 -93
41 -93 101 -42 -39 -84 -16 -77 -11 -11 43 244 75 86 -43 60 -58 -72 -21 -44 29 -73 -34 42 32 -26 -70 -30 86 -52 123 14 139
-230A39
##PAGE=	F1=21259.7
##FIRST=	23146.755397984237788,	4241.1433691826614449,	0.029994249343872070313
##DATA TABLE=	(F2++(Y..Y)), PROFILE
4241ErJ2j09J56k2m5k2k2l3kJ45Lk8J26k1j25M3j75J99j1n4j3r8J04r5M2P2P3k08K0K00k42
3961a34J41n9j7K00j01j00M0J5j8j43K26L0j75J54j51J68j21O2j4p7P5m6m2J59n8j30j1J78
3716E1j30OnnJ31poj3j79K63O9o2j77L1K1J91p5k27J03L0M2m7o8K0k4l1K46j33j12L1M6O%
3427a4N0q4J59j46J04j91K7J5l5QJ56J00r5L2l4o6j12J51N6j0j09O8O2j26p7K18m3j12P3N7
3165H2rr6rJ01j15M4R9j34M5O5LM7k10l8KJ06j06J03l5P2j12P4j5o8O9M4m4pN8j07R8l5J04
2876G6O1q4n2Mq1KM2J46r8j8J5j6L5k0N6N6j15j13J03M6k06J72j20p5J77n7l0J1M0M1p1L5
2596c8o7J98o0N5M8j79J32j43r8Q1J7l9Q8R3l7j48K07j22N2l2O9j39P7K1J41j27jj32j1O2
2334c2K6p0m0%M0L9qrJ6J0m3N1L2N6j11J6J37k19J8J06L9kj48J37N8Jk04O5M0N9q2j7l0K0
$$ plain form
4241 5 -4 8 -101 55 33 -12 -34 -56 -89 -91 54 57 29 155 134 9 52 -123 76 65 11 -2 -100 4 -91 -49 23 96 -112 -92 108 -134
3961 -134 7 -52 -69 131 30 -70 -30 -15 -33 -176 50 80 -95 59 -92 76 -45 17 3 -74 1 -45 -87 72 14 -116 -127 51
3716 51 -79 -73 -78 -83 48 41 35 22 -157 106 175 113 -64 -33 -12 179 104 -123 -20 10 52 5 -63 -43 -67 -98 148 15 -97 -66 -20 -14 -14
3427 -14 36 -48 111 -35 69 -122 -95 -80 -115 -107 49 149 54 86 52 -14 -126 25 81 71 -38 30 92 -34 -111 107 64 -48 25 82
3165 82 73 -23 -32 69 -46 -2 97 -37 8 73 76 123 -87 -125 -123 -17 -123 -20 -55 17 -95 -21 -36 -104 -35 9 -35 -42 16 -91 7 -28 76
2876 76 137 53 1 5 -76 -74 -32 114 16 -2 13 -3 32 12 68 124 9 -104 -1 45 -161 11 -109 -184 -7 -64 -94 -83 -43 -2 -73 -38
2596 -38 -105 93 33 88 136 -43 89 -54 -152 -71 -54 -93 -5 88 51 -97 110 -12 40 8 77 -62 15 36 177 50 49 -83 -94 -32
2334 -32 -6 -76 -116 -116 -76 -37 -45 -54 -38 -28 -71 -20 12 68 -43 -27 110 -109 -91 15 54 52 -96 41 99 100 -104 -39 1 60 -22 -39 -69 -49
2036d9R0j32K1K2j9R4J7j22J9L0l4QJ54j42l0J70l6l7K9K8j37O4j27j6n5Q4R7K2q1R6J14k19
1756g7J48k4N0n8r6J67o4j49jm2R5J4R5j15J25q4M6rJ3j7J7pj20M8N5j53J62l4o5J45j40J66
1476I1j13K5l5M4N1l0J6J7j28J8j10K44j5j0m8m7J27j40M6j55J88j4n4nO7qn1O0l0j04Q4o2
1196h1Q7n0r8J34K5q0J45l2n3j56J47L9l1J95l3j21M0o7l1J71j27P7n2L0j29P4P2j32KJ04
933F9q7n0J74r9L7P5j34R8k57J90N6J7j83j9Q7k5rM8P9k6M4m0l5j0J90k86M5k8O9O7j2j2k
645C1q0mRJ30O5l10J34N2K8j24M5O4L4m5Nj15j7P2M6J4p5J2o1J73j6R9j30J14j37q9J75j25
365b6j15J33P1Pr1P0n6j56M7K05l4j2m5j0K3o8L21k08J33l8j74m9J53j28l0L2Q2j9N4n5O7
93H4K4j13M0J6l4j32K04r3j0m9L3qQ9l8Q3J51j56qj29R0n3n5K4M7M6j57P2O5K2j09J5K1R0
$$ plain form
2036 -49 41 -91 -70 -48 -67 27 44 -78 -59 -29 -63 -55 99 -43 -73 97 61 24 53 81 -56 8 -119 -135 -190 -106 -9 13 -68 28 142 -77
1756 -77 71 47 97 39 -57 110 46 -103 -104 -146 -51 -37 58 -57 68 -16 30 21 34 17 34 27 -93 -45 10 -143 19 -15 -80 65 -75 91
1476 91 -22 3 -32 12 63 33 49 66 -62 -44 -154 90 75 65 17 -30 97 -43 3 -152 36 22 -32 -37 30 22 -29 31 1 -103 -19 -81
1196 -81 6 -44 -142 -8 17 -63 82 50 -3 -159 -12 27 -4 191 158 37 77 10 -21 150 23 100 48 78 -51 23 95 -37 -35 69
933 69 -18 -68 106 7 44 119 -15 83 -174 16 72 89 -94 -113 -26 -51 -60 -12 67 41 85 45 10 0 190 -96 -51 -79 -10 57 45 33 31
645 31 -49 -53 -44 86 151 -159 -25 27 55 -69 -24 40 74 29 34 -81 -98 -26 20 34 -41 -29 -90 83 67 166 36 150 13 -76 99 -26
365 -26 -141 -8 63 70 -21 49 -7 -163 -116 89 55 43 -2 -12 11 -57 264 56 189 151 -23 -72 81 -47 -77 -45 37 18 72 17 84
93 84 108 -5 35 51 17 -115 89 -4 -14 -63 -30 -38 51 13 96 247 91 83 -46 44 -9 -64 -40 7 53 -104 -32 33 55 -54 -39 -18 72
-195G2j01J23q8J35
$$ plain form
-195 72 -29 94 6 141
-230A41
##PAGE=	F1=21212.5
##FIRST=	23146.755397984237788,	4241.1433691826614449,	-0.045411586761474609375
##DATA TABLE=	(F2++(Y..Y)), PROFILE
4241hM2L5j21J20m1k4k0k1kk1R6N1o2J20Lj26kj47J79J4n0n2q3J12j02R3j3J31j70j2J95k22
3961a08R2l8J8J24q4j04N9nkj08K24N9j78J11j62J31r0R3Qj09O9l5l4J44p5j33N0O9r7L3N
3690g3l8K02l6k3l2j28K28N4k8j76M7L2J19p6j52M8N5K4o4q2P2l2K3J68j23j39Q1N3j7k3Q3
3419D7l2J30j71P1j97K8P1m4K8J40J22j41J2Qj09q1Q8J19J9j42M6Q5r6j17K27j7j53O8J21
3165A30p7o4m1J06j17K7J44j93J25J9k8M6j30j06M0R3n7O9k0Q1j28J02o6p1N8P8m9l6M6n6
2902g5N2mJ34kk3r6k6m3K7k0J38r9L5K9l6M4j1M3M3r1j01J22j0j49J09q8m2J35j15K8M7J1
2622c4N5r1O2o2J71k5j1P5j28N8j16r4Q8lo0J19J14j08k7J64j63J0K6O4j27Q4K1R5j01J0j55
2351h9k4J03N0r2j8m8j0N9P1Mm3L5m0K8N0N0j70N0J16j71k6J71J2q1j03K02J00m8k46Q8j5
$$ plain form
4241 -8 34 69 -52 68 27 3 -17 -38 -40 -61 35 86 24 144 147 21 19 -128 51 65 15 -37 -120 -8 -110 -17 -30 101 -69 -81 114 -108
3961 -108 -16 -54 -36 88 4 -100 -41 -46 -48 -156 68 127 -51 60 -102 29 -61 32 40 -69 0 -35 -69 75 0 -133 -83 -14 -111 -78 -73
3690 -73 -111 91 55 32 0 -128 100 154 126 -50 -3 29 148 72 -80 -32 23 47 -17 -99 -27 -59 -36 132 9 -130 -49 4 -13 -36 47
3419 47 15 145 -26 45 -152 -124 -53 -97 -69 71 193 52 64 72 -37 -118 -30 89 108 -34 12 97 1 -116 111 94 -59 9 130
3165 130 53 -11 -52 54 -63 -36 108 -85 40 59 31 77 -53 -159 -119 -26 -83 -14 -34 47 -81 21 -45 -116 -58 20 -29 -65 -19 -75
2902 -75 -23 -27 107 105 82 -14 -40 -83 -56 -76 62 -37 -2 27 -9 35 24 67 110 19 -82 40 30 -119 -10 -98 -140 -5 -120 -92 -45 -34
2622 -34 21 -70 -8 -70 101 76 65 140 12 70 -46 -140 -52 -55 -115 4 118 10 -17 147 -16 -6 20 84 -43 41 62 157 56 66 -89
2351 -89 -113 -10 40 -52 -70 -118 -128 -69 2 6 -37 -2 -42 -14 36 86 -84 -34 82 -89 -115 56 68 -13 -116 86 186 138 -108 -20 -35
2080c5P5o4l0L1J5N2j11N3po5R2N9j33N0ml5L2J24j12p4J97k1p7K6K6j35J05j73J6o0J19Q4
1800B0l0m0O3R0j68J43k3O4n2q1J10m5j57k8J8R4J3J03j22R5q1Q3r3R3k2jo6q0j7J01r3J29
1520B0l3l6J09j38K14j19qk2J6L8k7K8M8j45j6p9K12J4K0p6oJ64j45pj82J79Jn2M9j2K4l8
1240eM2Mj42J52j21P3k0j56J78K8q7J47j4j16j77J71P5J7R7lj32K7l0j2J24r8M7l0N0q6K0
968B3J00j57l6J54j50j1J74q4M6Q6j53R4k52J66Q6oj42n9J29p8L3J0M2QP3n9l2JJ37k96P1
697h2L5O7J0j9K2lp3L2o7J35Q2k74J17M1L0j42P9O1k3j7J2j20OO2L6N0q6ko2J45RJ18j26M8
400A01j02p5J75r6j39R3J06N9j26k5j7o2K1J15k0P1n7m1M1o1L52l03J79n3j82J1Q3j22k4J04
137FL4l7M2n0M6L0q2N3L0p4j07J78k4k4p2QM7R7l9Q9N3j14Nj10M8K6r1j6J06Qj92R9N0M8j35
$$ plain form
2080 -35 40 -24 -54 -23 -8 44 -67 -14 -21 -86 6 65 -68 -18 -22 -57 -25 99 -13 -87 110 89 12 38 64 -71 34 -139 -123 -183 -64 20
1800 20 -10 -50 13 103 -65 78 55 119 67 -14 96 51 -106 -134 -116 -22 -9 94 -28 67 -14 69 -24 69 47 46 -20 -100 -117 -16 -109 20
1520 20 -13 -49 60 -78 136 17 9 -13 3 41 14 42 90 -55 -71 -150 62 76 96 20 14 178 33 26 -156 23 24 -28 21 9 33 -5
1240 -5 37 41 -101 51 -70 3 -17 -173 5 33 -54 93 79 -37 -214 -43 32 49 146 143 11 38 8 -4 120 22 69 39 89 3 23
968 23 123 -34 -70 84 -66 -77 97 13 59 145 -8 86 -166 0 86 80 -62 -121 8 -70 -37 -27 15 23 96 37 5 6 143 -153 -82
697 -82 -47 20 30 11 33 30 -43 -11 -78 57 139 -135 -18 23 53 -89 -10 51 28 11 23 -97 -91 -29 7 57 -29 -31 -93 52 61 179 53 101
400 101 -1 -76 99 3 -136 -43 63 122 -4 -29 -46 -108 -87 28 8 79 22 -19 22 -39 313 10 189 136 -46 -35 48 -74 -98 6
137 6 40 3 45 -5 41 71 -11 42 72 -2 -109 69 45 21 -51 -43 4 101 62 151 204 90 95 -15 33 59 -32 -48 58 66 -126 -27 23 71 -64
-169f4O6qN1m7P1p2J04
$$ plain form
-169 -64 2 -6 45 -2 69 -3 101
-230A01
##PAGE=	F1=21165.3
##FIRST=	23146.755397984237788,	4241.1433691826614449,	-0.12081730365753173828
##DATA TABLE=	(F2++(Y..Y)), PROFILE
4241b3Q4M5j21R5n8kj7j6Lj4M3R5j08J04M1j12n8q3J59L8q1q0p1J16j08J42j10J78j14k7J52
3970I2j58J5PK5P0p0j11Q2k3j0n0K09P1j68Q0j60J05p1J12K9j39O3k6k5J28p6j16M5k4m3P8
3699e9J6p2K47r4oo8m6J70K4pj24L4N2N1p8p6qQ0Oq1r9J20j1N4O4q9j30Q9O3m1k5R0L7O5j80
3392c2N3j89M5R1m1L9J16Q1j40RO5j62j4J1J71Qj64N6R2n8j52K12L4j95O4J59j20l6p6J13
3130D0j21PJ86k31J80J1o7L5n9j59R3N6J6J9j9Q9j42J42j07p3M7R8p0m4OM0%J6J03m2O0j39
2850b9n7QO4p8J33p9L3K3k6L8j8M2M2o4q7J04n7o5K5%l4Q6j80Q5Q5j8O9j12Q8o9J32K6o2O6
2552A14o5j1q2o6P1no2R5J24j73R8J31j94j3N8Q6j37R2K1P8r8Jj52l4J45K3q7L0o9p9N8J49
2272D7J3p8L6l3PO7M5k30Q4J04j12o9J92k7j25n3K22J22o8k25N9n1O5l4k7R2RJ5r0R7k4j21
$$ plain form
4241 -23 61 106 -15 80 22 20 3 -13 -10 -24 19 114 6 110 151 39 -19 -102 57 95 14 -66 -137 -21 -129 13 -97 81 -33 -60 92
3970 92 -66 -51 -44 -19 51 -19 -130 -48 -71 -81 -131 78 149 -19 61 -99 6 -65 47 76 -63 0 -26 -51 77 1 -115 -70 -94 -137 -59
3699 -59 -43 -115 132 38 32 -36 -82 88 112 105 -19 15 67 118 40 -36 -44 36 42 -39 -138 -18 -29 25 89 0 -130 -41 22 -19 -44 46 83 148 -32
3392 -32 21 -168 -123 -32 -73 -34 82 163 23 32 97 -65 -79 -68 103 111 -53 3 95 37 -115 97 131 -64 0 159 39 3 -73 40
3130 40 -81 -74 112 -119 61 72 5 40 -19 -178 -85 -29 -13 6 -13 76 -66 76 -31 -104 -57 41 -29 -73 -67 -27 -27 -11 92 50 110 -29
2850 -29 -86 -78 -14 -92 41 -38 -5 18 -8 30 12 54 96 32 -55 49 -8 -73 -48 -48 -82 4 -176 -91 -6 -24 45 -67 21 -48 84 110 48 114
2552 114 49 38 -44 -110 -39 -44 -106 -11 113 -60 38 169 -25 -38 20 106 -31 61 82 160 62 63 -89 -123 22 45 -42 -12 -81 -160 -102 47
2272 47 60 -18 18 -15 -8 59 104 -126 -42 62 -50 -119 73 46 -79 -132 90 212 144 -81 -22 -73 -8 -42 -69 23 32 47 -43 54 30 -91
1992i1Q3Q2j15L5mj7K5Q1r5q0J85J2j01K1K0j20J09j87Q0n8J14M9n6jK9N5j27J30J7N0k5q0
1712B0L8j4j53n6P9R2J2J00j41P7o7J21j78J73k6Kj05o1j02J49k9P1pj0P0j47K48j11l0j0
1450ErK4k3L7Q1j56m3j6J29K5Q0j04L6J75j25o5k10J65J4k8P6o6L6j9L0J8j54J82j72P6K5
1178B4j81J72J0o4J36qj70j41J70Q8O8mK9j43J1LL0N4o6K1k2N9k8j9R9j63n4J44j56MJ77o6
898A4P8P2j82P7k10J30J18k5q3p7J51j53P6k9J0M4O5o6j5K4P1k70Q2Q2O7m7k9N2J9r0P1j39
618a12J34R5j85P0K4K5j59J11N9p8J1J7j04M9L1PQ6r8j3o0R6O2J01j11j2j6q5J47l7j86L5
347i6J72P0j52j08L5PK0K5nJ26m7m3M0p0L19l41K31o8j90R2j3o9k0J60l2m2M1n7J5L5n3O7
67D9M4r5o0J31K7l9r5j3J08O6MN4l8o6K4o3j2O5q8l7J36k5k25J28L8N5j35R1j8J0LK4n4M9
$$ plain form
1992 -91 -8 74 -41 -6 -10 -27 -2 79 -16 -96 89 101 0 21 41 -79 30 -157 -77 -135 -21 28 -28 -29 0 55 -72 58 75 125 100 20
1712 20 58 44 -109 -165 -86 6 18 118 -23 54 -13 108 -70 103 77 79 -26 -87 -189 -40 -69 2 -5 -15 55 -92 156 45 15 5
1450 5 -4 20 -3 34 115 -41 -84 -100 29 54 134 30 66 241 116 51 -159 6 20 -8 68 2 38 19 49 67 -87 95 -77 -1 24
1178 24 -157 15 25 -39 97 89 -81 -222 -52 36 104 100 129 -14 -3 0 30 84 18 39 17 76 48 29 128 -35 -89 55 -101 -97 80 14
898 14 92 164 -18 59 -151 -21 97 72 -11 -88 63 -90 -14 -43 -33 11 76 10 -5 19 90 -180 -98 -16 51 4 -25 27 46 -44 27 -112
618 -112 22 117 -68 2 26 51 -108 3 62 -16 -5 12 -92 -43 -12 -5 81 -17 -30 -90 6 68 169 58 46 30 -55 92 55 -131 -96
347 -96 76 146 -6 -114 -79 -72 -52 -27 -32 94 47 4 44 -26 293 -48 183 115 -75 17 4 -65 -85 75 43 1 42 -15 0 35 -18 49
67 49 93 -2 -62 69 96 57 -38 -51 57 123 127 181 143 77 101 38 26 91 3 -34 102 77 -148 -20 18 73 -62 29 11 21 24 48 -6 43
-230D3
##PAGE=	F1=21118.1
##FIRST=	23146.755397984237788,	4241.1433691826614449,	-0.16795599460601806641
##DATA TABLE=	(F2++(Y..Y)), PROFILE
4241c3J00M4j08Q6q5K7j1Rj8j4L1R8j29Q1P2j26p6kJ28O6j38p4n7J26j43J75j70K11q3j1J05
3970H1j09m4M5K0N9p7j25R1on4j6K26M9j28M2j49J08o6J17Nj15L8k7K0R5n7q8qp8KJ36J3j08
3681a08K85j72J2r5M6J33j5m5m9J6P1J0p4l7jQ6m9q0p6J27L3L1ql8q4L9Q0p2JP8P6Kj60N3
3384A6j53M9N6k2N9Q2k1q4K7R2j81L8j3J63n8j41J15O8n2j17J48Q4j98M5J62j04m5q5J19j38
3121h9PJ73k12J59O6j01K7n2j42J18NR3k6LN8j51J64j01r9Q7P3r6l7k9J37l2oM8m7J11j46
2850c7o1K7R1r7J12l7j6J4j5N6l3J3R0k4j44N8n6L3p9J16n0M4k22J22J18n4Q3q2M7n3Q3L1
2570G8o5L2no1pl0L0k8k2L2J14j91J82R9k02pM1J53j81R7RQ6j27lj19k4J56k6n3P1o6j21M8
2281a10J38O9q5Rk9J8N2M0k27P1Q8n5q4J54n6q6m8K07Q7m5j59J4n1L0k7nJ27K9k0p2J20l8
$$ plain form
4241 -33 67 111 3 89 4 31 20 29 11 -3 28 126 -3 78 150 24 -52 -54 74 140 2 -72 -129 -3 -146 29 -141 70 -13 -24 81
3970 81 -28 -72 -27 -7 52 -25 -150 -59 -65 -119 -135 91 140 12 54 -95 13 -53 64 69 -46 -8 -35 -15 80 23 -65 -73 -151 -149 -13 0 -108
3681 -108 177 5 17 -78 -32 101 86 41 -8 8 79 89 15 -22 -23 63 14 -66 -142 -15 18 49 41 3 -81 -42 38 -34 -33 45 121 123 -37 16
3384 16 -137 -88 -32 -54 5 87 66 -18 9 101 -80 -42 -55 108 50 -91 24 92 40 -77 71 155 -43 2 164 60 15 -70 49 -89
3121 -89 -82 91 -121 38 104 3 30 -22 -164 -46 -41 52 26 29 87 -64 100 -1 -100 -13 60 -36 -73 -102 35 3 -3 45 -2 109 -37
2850 -37 -98 -71 20 -77 35 -2 -18 -4 -19 37 4 17 107 83 -61 -3 -59 -26 -105 11 -39 5 -217 -95 23 -31 52 -30 17 -36 47 78
2570 78 13 45 40 -21 -28 -58 -28 -56 -78 -46 68 -123 59 158 -44 -51 -10 143 -38 59 68 154 27 24 -95 -119 37 11 -42 29 -37 -158 -110
2281 -110 28 97 12 21 -8 10 62 102 -125 -54 34 -21 -105 49 -7 -93 -141 66 153 108 -51 -37 -88 -58 -85 -90 37 66 46 -26 94 56
2001E6j47O4Q6j06J5L2K1k7K0p0m2J19O4j09L2K0j12O5j58J51l3N6j2m4M8j2L4j09J12O6L7
1730A17jr4j5K4j06r9R0J04K3M6j47P8j7J19k38K13k7K3r2o5j64J66LL2L6k5L8j23K49j16
1467C2j8j2l4M6l2M8P1j45l6N6L9MJ17r7N1J79j09r1k21J39J1L0O5p3K7k8L7%j42J81j96R0
1187a1P7j82J41k4k3J03J9k00q3J41N9R8o1N8j38j0K9N7qm7L0m3Q3nj1M0j52l1R4j00NJ65
907G0o1J30L8k12M7j32R5J37n1k5n4J20j83O4o2J4O5L1l8KM2K3k17J01O4P8j02k8N3M6q5J11
627H1j93J02R4r2K0L7j6j50J53O0j00j5M9q8Q1Jj1O4j05K1o3L0R4Q7p9m3P5j25J45J6k31j2
347a13K37K1j71j31P7L4J9l6M5J33n1l7O5j08K48l18K41o3j75J33j01K2k7J80o7m2L4n0l2
93c3J6lQ8N0j07lO1N8o1j08j0J31L0P0op7k3N0j8p5O5n0n9J32m5j98J15J8N0j17Q2Nk0L4O
$$ plain form
2001 56 -91 -27 59 -47 -32 0 21 -6 14 -56 -98 21 85 -24 8 28 -84 -19 -177 -26 -59 -3 -15 -59 -11 -23 11 -98 14 80 117
1730 117 116 22 7 31 -75 -174 -84 20 43 89 -58 20 3 122 -116 97 70 93 1 -64 -228 -62 -59 -27 9 -16 22 -101 148 32
1467 32 14 2 -32 14 -18 30 101 -44 -80 -24 15 19 136 39 90 269 160 69 -152 -13 -2 28 93 20 47 19 56 56 -86 95 -101 -11
1187 -11 66 -116 25 1 -22 81 100 -100 -183 -42 17 115 54 112 -26 -36 -7 50 42 -5 25 -18 65 60 49 89 -63 -94 0 -100 -95 70
907 70 9 139 177 -35 12 -120 -25 112 61 36 -18 102 -81 -17 -79 -65 0 31 -7 -5 37 60 -157 -56 8 86 -16 -44 9 55 -30 81
627 81 -112 -10 84 -8 12 49 33 -117 36 96 -4 -19 30 -58 23 24 13 77 -28 -7 -70 -40 54 141 62 19 94 -31 114 130 -101 -113
347 -113 124 145 -26 -157 -80 -46 -27 -63 -18 115 64 27 92 -16 232 -86 155 92 -83 50 -51 -29 -56 124 57 15 49 -1 -33
93 -33 -17 -20 68 118 11 8 69 127 66 -42 -52 79 109 179 173 96 73 123 105 30 95 45 -14 118 73 -125 -10 8 58 -59 23 28 8 42 48
-213D8m1%
$$ plain form
-213 48 7 7
-230G
##PAGE=	F1=21071
##FIRST=	23146.755397984237788,	4241.1433691826614449,	-0.0095155239105224609375
##DATA TABLE=	(F2++(Y..Y)), PROFILE
4241aQ2J1q2Q8j11N6oL5m2j8L9P4j12N1R1j53p0N6R8R3j71r2m0J39j83K03j90K04m9NP5r0
3961a0m5L1K1N5q2j40R7Rq7j9K39K1o6K2j37J12q3J02Kp0%m0O4O3k1m3j01r1K9J77Mj49L08
3672A72k17M3j12J11J16n2j29L5J1Q9l2n7J4pQ1r1o9n2J33N5j6l7Ok4m5J13q7J9N9O6k9j25
3392e8O9j17N2mk8O6P8j04j5M2J14j64M3J3J23j42r1J64L4p4k9O3J14j57K0J11k9o1j00J22
3130E5j58K6J31j49J00J23j33L5p4p0Q7k7J42n7M2J3j72J98q4j23J25M8j21k7o1K13l6o6P
2876a3J3Q3r9o0K7R8p3Q9lo8rj4P3m6j7J37J6k01K5l8R3j69K30p1K3k43J38J31q9R5n1Nl7
2587b5L5M9n7j3M1r6Q3j7J2n2J4l7J01j78K16N4j73M5j3K17k27Q9j4J04j47K9r7kJ29o2mO9
2307G3o2j37O5R7R9r2j9j4M3L5L6k16O7P2%j07J10n4j5q4J50M0J5q8k5m0On1L8J15N0n9n7
$$ plain form
4241 -1 81 92 10 98 -13 43 37 72 30 12 51 125 13 64 155 2 -68 -12 86 179 8 -84 -124 15 -168 35 -155 49 0 5 80 -10
3961 -10 -55 -24 -3 52 -30 -170 -73 -64 -151 -170 69 90 24 46 -91 21 -62 40 42 -28 -28 -68 -4 59 38 -5 -106 -197 -168 9 13 -136 172
3672 172 -45 -2 -114 -3 113 61 -68 -33 -22 67 35 -22 -8 -15 66 -25 -94 -146 -13 42 26 -11 -5 -29 -74 39 -48 -29 30 96 67 -58
3392 -58 11 -106 -54 -58 -86 -20 58 -46 -61 -19 95 -69 -26 -13 110 -32 -123 41 75 1 -28 35 149 -8 12 123 94 33 -67 55
3130 55 -103 -77 54 -95 5 128 -5 30 -44 -114 -27 -54 88 31 73 86 -86 112 28 -95 30 78 -43 -70 -131 82 46 -20 -13
2876 -13 0 83 -16 -76 -49 49 -24 65 62 -6 -15 -29 44 -2 -19 118 134 -67 -42 -80 13 -156 74 3 26 -217 -79 52 -37 58 7 12 -25
2587 -25 10 59 2 -11 30 -66 17 0 12 -40 -26 -63 38 -140 76 130 -43 2 -11 206 -21 68 54 158 11 40 -57 -59 70 8 4 73
2307 73 11 -126 -61 36 135 43 24 10 53 88 124 -92 -25 47 47 -60 50 -4 -19 -103 47 87 102 14 -11 -51 -45 -96 -58 57 107 48 -9
2019iJ40n5j26M5O0p7qO6M6r2k8l4mN4J16j19M9K5r0j6j01K00j7j2m9qO9l0L0j20J14Q4J8
1730A21J7j09k2M0l6j20M1J08K9Lj41Q3L6J05k61J92pL1m5q0j89J60J4J5N7m2Oq6K14j17m
1458A3j3o1P9l3P1K5j15qR5km5J26o6M2J74j01r8k09J34j6O8K7m3Nl3M8j4j25J41j81R6J20
1178A01j57Q4n3K0P0M6k09oR7J4R3p6N4j16pL1O6m1m4P4p4R6j8M0m8j23j3L6j8j8J44o4J78
890A59Jk05Om4P2J59j23J8%O0j64L1j17N5P4JrK1O1k7j62J23M9O0j36nK8O5q6J27k23P9J03
601E1k0m9O3m1j20J35R0r7p5R3q2J01k1k1L0j22Q6q1m2J22P6m4l3J25j55J53L8k27n0K65n4
330I4j68j02R0K7L2o0Q2R2n6j8J03j59J64k35K30m9j52J39j79J07m0J66n7k2mk8o3mM7R5M0
58A12r4L1qR2q2j21qJ55j9J23o3o3mN4L7j26L8Ro2J02n0j55R3j1L7o1M4M5l2L6J4m8m9
$$ plain form
2019 -9 131 76 -50 -5 55 -22 -30 36 82 -10 -38 -72 -76 -22 94 -25 24 49 -41 -57 -158 42 25 13 -36 -44 25 -5 25 -95 19 103 121
1730 121 138 29 7 47 11 -109 -68 40 69 72 -69 14 50 155 -106 86 79 110 65 -15 -204 -44 -30 -15 42 0 6 -80 134 17 13
1458 13 0 -61 18 -15 56 81 -34 -42 53 51 6 132 66 108 282 181 83 -126 8 -8 60 87 44 49 16 64 50 -75 66 -115 -19 101
1178 101 -56 28 -25 -5 65 111 -98 -104 -7 7 100 24 78 -38 -45 -14 52 11 -33 41 -33 63 45 85 37 -86 -99 -63 -81 -99 45 -19 159
890 159 160 -45 -39 -83 -11 148 25 43 43 103 -61 -30 -147 -92 -18 -17 -26 -5 56 29 -133 -10 39 99 -37 -42 -14 51 -35 92 -131 -52 51
601 51 31 -18 45 4 -116 19 109 12 -63 30 -52 49 28 7 37 -85 1 -80 -122 0 76 32 -1 124 -31 122 160 -67 -117 148 94
330 94 -74 -176 -86 -59 -27 -87 -5 87 31 13 116 -43 121 -114 116 67 -85 54 -125 -18 -58 108 51 29 25 -3 -66 -70 -23 72 112
58 112 18 49 41 133 51 -70 -78 77 58 181 118 55 51 105 142 16 54 63 1 103 53 -102 -9 -20 17 -44 0 45 13 49 63 15 -34
-230c4
##PAGE=	F1=21023.8
##FIRST=	23146.755397984237788,	4241.1433691826614449,	0.11551833152770996094
##DATA TABLE=	(F2++(Y..Y)), PROFILE
4241B2J4No2J13j43N7K1P7o5m0N1L3n4K9P6j67k7Q5N6J07j47j26pJ26j90K02j49J57k3oP9
3970A04j13J0k2M9N4r0j40P5M3q8l4K32k5l2L3j05R6q2M6J4l5j0l0N2N3L9lj94o1L5J91k6
3690C6j69K99k04L8p3J07J11q1j81R3K6Q2q1j7N3j9N3p1p1k6J10O3o0l0L0M3j23J28r7L8M2
3419D9Kj5n4N6o6L9p6m7O7J01j63M1M9J21j18j5O7R0k03l0K01kj38O3j5J37q4j7M0N6n6j08
3139b8Q1j52P1O7q3M2J48j32L3r9K9K9l7J19n2Q8j1j98J86n5j18J31oj10j7n5K46j5j24l0
2876e2J06rl4l4j6Q0qN4L2j15j5LO2p4j7J59K6k33J2j5J29k07K52n0Ok60J71J01r2Q4m8k1
2596b3rQN3k7o4P0j25J62k7K5q2M5q7Q1j19K09j3j28R7n8K40k54Q7m9J02j31Q1r0J8Q5q7M9
2316C9K4l4j35P5L4Q8o0k4pN5kM2j70N6L3O3j23O0j0N5j32Q4j4P0m2o0MPq1N9P0N5p3k3J19
$$ plain form
4241 22 36 41 -21 92 -51 6 27 104 39 -1 50 83 29 58 134 -33 -60 25 81 188 41 -85 -92 34 -156 46 -103 54 31 25 104
3970 104 -9 1 -21 28 82 -8 -148 -73 -30 -118 -152 80 55 23 56 -49 47 -35 11 25 -10 -20 -50 2 55 94 91 -103 -164 -129 62 36
3690 36 -133 166 -38 0 -73 34 145 64 -117 -24 2 84 3 -14 39 20 73 2 -69 -95 15 78 18 -12 18 61 -62 66 -31 7 49
3419 49 51 36 -18 38 -28 11 -65 -112 -45 56 -107 -66 -17 104 -14 -29 38 128 -75 -105 96 94 -44 19 4 141 57 40 80 136 80 -28
3139 -28 53 -99 -28 39 -44 -2 146 14 47 -52 -23 6 -31 88 36 124 113 -85 101 46 -72 59 53 -57 -74 -129 117 102 -22 -52
2876 -52 54 45 11 -23 -39 41 33 87 119 4 -11 -8 54 -20 -37 122 148 -85 -73 -88 41 -166 86 36 42 -218 -47 54 -38 46 -2 -23
2596 -23 -32 -24 29 2 -62 8 -117 45 18 43 -39 6 -81 0 -119 90 77 -51 46 -12 228 -26 61 12 114 -17 64 -26 -8 77 -10 39
2316 39 63 29 -106 -31 3 91 31 7 0 55 53 95 -75 -19 14 77 -46 14 4 59 -73 11 -3 67 25 -35 -31 -24 -105 -46 24 79 6 -17 102
2010A02o3q0RM6m6j8Q1M9j29m7nJ5mJ64j27N9K3n0q4m2J96mo2n5M5M7k2K0j26J18O2J0kq7
1712gmN0J5q5n2R0N0n3j01J14L6R0k31J32QK6Pp2j81J24K4K5K3l2l1j2J42j01J1k7o4J10o7
1423d3R7l3o7OQ8K6p9J02m0J6J96j24r2j72J27j9Q5l3mjk4K0Nj21P8j08Q2J50j17M1p1K7L4
1135C2P7j74K1M2k3Q1m2N2r0kmO8m0l2J15r0Q9n2P9j21n7Jj3N0m2J01o3J92l1j55j1RQ3J67
837B17k21M6O6Qj23k1j36Q3Q0jPnP5o6r1J43K9J5j22M4l4O0n6J19k34N3J36nj08J08o5n2O8
548A7J08o0j37J16n5O7k1l3Qj21J44r9q4J18Q5j2KJ14j68J77J4j99n4K49j10j29n2N9K7M2
286A3o1J20L0q8j0J40j75Q4j31J74Jj52J15k16J82p9J38rmm4j1q5j6R1O4N6p8L5l8J01j01
15D6j12lJ52m4J12j04j4J5L3P0j26lL9m0N6n0j04R4n0K6j2jN5nL1L2o5p3
$$ plain form
2010 102 39 -41 -32 14 -32 -50 31 80 -49 -96 -101 -86 -90 74 -53 6 29 -21 -105 -147 49 45 -17 -72 -27 20 -2 18 -108 10 72 82 80 -7
1712 -7 -11 39 54 -31 -83 7 57 4 -97 17 53 143 -88 44 52 78 85 13 -168 -44 -20 5 28 -4 -35 -47 95 -6 5 -22 -86 24 -43
1423 -43 54 21 -46 -40 48 74 -5 97 57 73 269 145 53 -119 8 -11 74 41 37 36 12 32 37 -84 -6 -114 -32 118 1 42 -29 -2 32
1135 32 109 -65 -44 -2 -25 56 14 66 -24 -26 -30 38 -2 -34 81 -9 80 28 107 -14 -71 -70 -83 -33 -75 26 -37 155 124 -31 -42 -33 50 217
837 217 -4 42 108 116 -7 -28 -164 -81 -1 -2 5 0 75 9 -82 61 90 105 -17 27 -7 53 -3 116 -118 -65 71 66 -42 66 1 -51 17
548 17 125 65 -72 44 -11 56 35 2 10 -111 33 -66 -150 -32 53 41 43 157 -11 166 180 -19 -73 176 66 -63 -115 -56 -29 13
286 13 -48 72 102 14 4 144 -31 53 -78 96 97 -55 60 -156 26 -53 85 76 72 28 17 -68 -84 7 71 127 49 84 46 147 46
15 46 -66 -69 83 39 151 47 33 48 81 151 25 22 61 21 77 27 -77 17 -33 -7 -19 -20 35 30 61 93 28 -45
-230d5
##PAGE=	F1=20976.6
##FIRST=	23146.755397984237788,	4241.1433691826614449,	0.24055218696594238281
##DATA TABLE=	(F2++(Y..Y)), PROFILE
4241D7m5J2m4J41j87M6M6J20q8o2O3rRJ0L3j61L5Q6K4Q4p5j59L6P6j58J61p9R0pl0J18j48
3961a5O7p5J00K8r5j35N3P6p7l7K14q4LM3q4O7o9MJ2j1k0k1M2M2Q9L2k59lL4J47l8j75K62
3672A17j38L0m1Q3Q5p8j99J37L2P3j28RQ1m0J7l0n4j2P6O6j04LL7Q5j48J26j23N8K4n2QK7
3392B7Pj3L2j33n2L7J41j67L6N1J22q0q0J24N9k08OK03k4j83J26o6J37on2m0J32m2j08N5j29
3121h8R4L3o7J5J27r5L7j16J22l2l0L1rJ23j9k11J63l9j11J37m5q5k5k0K11K0j41p6K04r6
2859A2RJ5p3M6N3J3O0j20kpN4r8l0J71M3k55L1rJ19j81K01Prk76K28M7r1P6m5m7L1rN9Kj28
2552a03Q3j42K05l6L6p5O5j19Q3n6J56o0o6J20q5K04k26P8r0R9j16J33q5L8M4j14J03k1pj33
2290h7Q5m0O5j6j6kO9m0M9j25M5nJ26j28K3K3J11j84J7l0J16k7p6L1L6q8N3J5N2q4J4P3m7
$$ plain form
4241 47 2 14 -30 111 -76 -30 16 136 48 -14 49 40 49 59 92 -69 -34 52 76 160 85 -74 -38 38 -120 41 -38 52 45 15 133 -15
3961 -15 52 -23 77 105 10 -125 -72 4 -73 -110 104 20 23 66 -18 49 -20 -16 -4 -15 -35 -56 -14 28 117 149 -110 -113 -79 68 30 -145 117
3672 117 -21 9 -32 51 136 58 -141 -4 28 101 -27 -18 63 23 40 10 -44 -56 20 86 -18 -15 22 107 -41 85 -38 20 44 -8 0 27
3392 27 34 21 53 -80 -132 -95 46 -121 -85 -34 88 8 -72 52 111 -97 -91 112 88 -95 31 -35 102 96 44 4 136 94 -14 41 -88
3121 -88 6 39 -28 -13 114 19 56 -60 62 30 0 31 22 145 126 -85 78 39 -72 65 20 -65 -90 -110 101 121 -20 -96 108 12
2859 12 21 36 -37 9 62 75 135 15 13 6 60 -38 -68 103 146 -109 -78 -87 32 -149 52 59 50 -226 2 49 -42 34 -11 -58 -27 -36 23 25 -103
2552 -103 -20 -162 43 7 43 -32 33 -86 -3 -59 97 37 -29 91 6 210 -16 62 -28 71 -45 88 3 41 85 -29 74 53 46 -87
2290 -87 -2 -42 23 7 -9 -11 58 18 67 -58 -13 -18 108 -20 3 26 137 -47 -30 -60 56 29 -47 -16 20 -68 -15 0 52 -32 -18 55 8
2001Hl6l1L0k0JP4K8j42k8J5PqJ63j36N5PK7j11k1J56pq0k2Q4p%K9j15J01K0Kk2n4K6K8K9
1686E0pj47P5P4q8m1J12NQ5j88P1K3RM8n0j62J00M5K5k4k4o8O2P1p3L9m2o7J32j09J07n6r
1397b2j6M5O6q0O3j2pK19j47q7j34J24k0O8p7J9K6j6j1K5j14MLM2J55r0L0o7O%J06j27J3J
1100a2m7P2rM6o6K5o1P4l8k3J53q2N8r4J08j81K1L0m6P9n2N4o3J93p4p7KjJ15J56k88N1J09
811A32k0o0q4j20R2O6L5j5l8Q2j12l0J65Pk1j00R4r7N6k1Q7k22M1J84m3j38J61q3LrJ13l4
531G1j67J24l4K8j2l6%j05J74r6j03Q6R6K4J5P9j55J80l6j49j2J97j48p4kK8J4L7l9J34k9
260I0j17j3J65j46%k5J22M1j60Q2k15K12j19J08L6K5p4qp5nJ09J9N9n5nk6J06j09r0K1J20
-12G3m0M6j01K8J8%Q1j00PL7j4J6o0o8J08p7J1L5k3M3K3L0M7q5p3
$$ plain form
2001 8 -28 -59 -29 -49 -48 26 54 -88 -116 -101 -94 -102 61 -75 -20 -13 14 -97 -118 38 31 -49 -71 13 6 6 35 -80 21 41 43 21 -33 -7 21 50
1686 50 43 -104 -29 45 -43 -84 28 33 118 -70 1 24 33 81 31 -131 -31 14 39 15 -9 -77 -15 56 -17 22 -20 -87 45 -64 43 -13 -22
1397 -22 -38 7 73 -7 56 44 37 256 109 22 -112 12 -8 60 -17 2 28 12 1 26 -88 -84 -81 -39 116 26 56 -11 -5 -5 101 -26 -13 -12
1100 -12 -59 13 4 50 -16 9 -52 22 -16 -39 114 32 90 -4 104 -77 -56 -26 -72 7 -45 9 -54 139 65 -12 -10 -11 104 260 -28 23 132
811 132 112 52 -32 -152 -60 6 41 26 -12 70 -42 -72 93 100 79 -21 73 -24 32 11 98 -124 -83 101 58 -80 81 -2 1 -8 105 71
531 71 -96 28 -6 22 10 -26 -26 -131 43 -53 -156 -70 26 50 65 144 -11 169 133 -16 -28 169 21 -53 -55 -27 -13 24 -15 119 90
260 90 -27 -40 125 -21 -21 -46 76 117 -43 39 -176 36 -83 25 61 86 12 4 -71 -76 33 52 111 56 51 25 131 22 -68 -47 73
-12 73 33 79 -22 6 24 24 105 5 12 49 35 51 -9 -77 31 -46 -35 0 -23 20 43 73 120 35 -38
-230c8
$$ [...]
-230c1
##END NTUPLES=	nD NMR SPECTRUM
##END=	
##END=	
