##TITLE=	Oct25-2021.44.fid
TM-VI-136solid 13C

##JCAMP-DX=	6.0	$$ MestReNova 14.3.0-30573
##DATA TYPE=	LINK
##BLOCK_ID=	1
##BLOCKS=	2    
##ORIGIN=	Mestrelab Research S.L.
##OWNER=	hrzepa
##$MNOVA/LINK_BLOCK_TYPE=	ITEM	$$ NMR Spectrum
##$MNOVA/ITEM/POLYGON=	(XY..XY)
5321,5835
8722,5835
8722,8208
5321,8208
5321,5835
##$MNOVA/ITEM/Z=	0
##$MNOVA/ITEM/ANGLE=	0
##TITLE=	Oct25-2021.44.fid
##JCAMP-DX=	6.0	$$ MestReNova 14.3.0-30573
##BLOCK_ID=	2
##DATA TYPE=	MNOVA NMR VIEW DATA
##DATA CLASS=	MNOVA VIEW DATA
##$MNOVA/ITEM/ZOOM/X=	-31.150195598113686657,	251.15679998888273872
##$MNOVA/ITEM/ZOOM/Y=	-283.83272361755371094,	2862.5955810546875
##END=	
##TITLE=	Oct25-2021.44.fid
##JCAMP-DX=	6.0	$$ MestReNova 14.3.0-30573
##BLOCK_ID=	3
##DATA TYPE=	NMR SPECTRUM
##DATA CLASS=	XYDATA
##NUMDIM=	1
##ORIGIN=	Bruker BioSpin GmbH
##OWNER=	nmr
##.OBSERVE FREQUENCY=	100.64143946071199309
##.OBSERVE NUCLEUS=	^13C
##.SOLVENT NAME=	CDCl3
##.PULSE SEQUENCE=	zgpg30
##LONGDATE=	2021/10/26 00:07:00.000
##.ACQUISITIONMODE=	SIMULTANEOUS (DQD)
##$ORIGINAL FORMAT=	Bruker XWIN-NMR
##$MNOVA/SCALES_VERSION=	9
##$PARAMETER FILE=	(acqus, ASCII, /private/var/folders/f6/rjf_tdyn2v98c5c0wvkgn4s80000gn/T/gq5V+V6vR9Gn2AeunJ6bAw/44/acqus, 0)
$$ ##TITLE= Parameter file, TOPSPIN		Version 3.2
$$ ##JCAMPDX= 5.0
$$ ##DATATYPE= Parameter Values
$$ ##NPOINTS= 11	$$ modification sequence number
$$ ##ORIGIN= Bruker BioSpin GmbH
$$ ##OWNER= nmr
$$ $$ 2021-10-26 00:07:12.428 +0100  nmr@CZC2439F63
$$ $$ /opt/topspin/data/agmb/nmr/Oct25-2021/44/acqus
$$ $$ process /opt/topspin3.2/prog/mod/shimcntl
$$ ##$ACQT0= -2.26890760309556
$$ ##$AMP= (0..31)
$$ 100 100 100 100 100 100 100 100 100 100 100 100 100 100 100 100 100 100
$$ 100 100 100 100 100 100 100 100 100 100 100 100 100 100
$$ ##$AMPCOIL= (0..19)
$$ 0 0 0 0 0 0 0 0 0 0 0 0 0 0 0 0 0 0 0 0
$$ ##$ANAVPT= -1
$$ ##$AQSEQ= 0
$$ ##$AQ_mod= 3
$$ ##$AUNM= <au_zg>
$$ ##$AUTOPOS= <51 >
$$ ##$BF1= 100.63037
$$ ##$BF2= 400.2
$$ ##$BF3= 100.63037
$$ ##$BF4= 100.63037
$$ ##$BF5= 100.63037
$$ ##$BF6= 100.63037
$$ ##$BF7= 100.63037
$$ ##$BF8= 100.63037
$$ ##$BYTORDA= 0
$$ ##$CAGPARS= (0..11)
$$ 0 0 0 0 0 0 0 0 0 0 0 0
$$ ##$CFDGTYP= 0
$$ ##$CFRGTYP= 9
$$ ##$CHEMSTR= <none>
$$ ##$CNST= (0..63)
$$ 1 1 145 1 1 1 1 1 1 1 1 1 1 1 1 1 1 1 1 1 1 1 1 1 1 1 1 1 1 1 1 1 1 1 1
$$ 1 1 1 1 1 1 1 1 1 1 1 1 1 1 1 1 1 1 1 1 1 1 1 1 1 1 1 1 1
$$ ##$CPDPRG= (0..8)
$$ <waltz16> <> <waltz16> <> <mlev> <mlev> <mlev> <mlev> <mlev>
$$ ##$D= (0..63)
$$ 0 1 0.00345 0 0 0 0 0 0 0.06 0 0.03 2e-05 3e-06 0 0 0.0002 0 0 0 0 0 0
$$ 0 0 0 0 0 0 0 0 0 0 0 0 0 0 0 0 0 0 0 0 0 0 0 0 0 0 0 0 0 0 0 0 0 0 0 0
$$ 0 0 0 0 0
$$ ##$DATE= 1635203231
$$ ##$DE= 6.5
$$ ##$DECBNUC= <off>
$$ ##$DECIM= 704
$$ ##$DECNUC= <off>
$$ ##$DECSTAT= 4
$$ ##$DIGMOD= 1
$$ ##$DIGTYP= 12
$$ ##$DQDMODE= 0
$$ ##$DR= 21
$$ ##$DS= 4
$$ ##$DSPFIRM= 0
$$ ##$DSPFVS= 20
$$ ##$DTYPA= 0
$$ ##$EXP= <c13>
$$ ##$F1LIST= <111111111111111>
$$ ##$F2LIST= <222222222222222>
$$ ##$F3LIST= <333333333333333>
$$ ##$FCUCHAN= (0..9)
$$ [...]
$$ ##$Sgu3PowerLevels= (0..7)
$$ 0 0 0 0 0 0 0 0
$$ ##$Sgu4PowerLevels= (0..7)
$$ 0 0 0 0 0 0 0 0
$$ ##$Sgu5PowerLevels= (0..7)
$$ 0 0 0 0 0 0 0 0
$$ ##$Sgu6PowerLevels= (0..7)
$$ 0 0 0 0 0 0 0 0
$$ ##$Sgu7PowerLevels= (0..7)
$$ 0 0 0 0 0 0 0 0
$$ ##$Sgu8PowerLevels= (0..7)
$$ 0 0 0 0 0 0 0 0
$$ ##$SguType= 3
$$ ##$ShimPowMaxUA= (0..63)
$$ 130000 130000 130000 130000 130000 130000 130000 130000 130000 130000 130000
$$ 130000 130000 130000 130000 130000 130000 130000 130000 130000 0 0 0 0
$$ 0 0 0 0 0 0 0 0 0 0 0 0 0 0 0 0 0 0 0 0 0 0 0 0 0 0 0 0 0 0 0 0 0 0 0 0
$$ 0 0 0 0
$$ ##$ShimPowMaxUC= (0..63)
$$ 130000 130000 130000 130000 130000 130000 130000 130000 130000 130000 130000
$$ 130000 130000 130000 130000 130000 130000 130000 130000 130000 0 0 0 0
$$ 0 0 0 0 0 0 0 0 0 0 0 0 0 0 0 0 0 0 0 0 0 0 0 0 0 0 0 0 0 0 0 0 0 0 0 0
$$ 0 0 0 0
$$ ##$ShimPowMaxUG= (0..63)
$$ 524287 524287 524287 524287 524287 524287 524287 524287 524287 524287 524287
$$ 524287 524287 524287 524287 524287 524287 524287 524287 524287 0 0 0 0
$$ 0 0 0 0 0 0 0 0 0 0 0 0 0 0 0 0 0 0 0 0 0 0 0 0 0 0 0 0 0 0 0 0 0 0 0 0
$$ 0 0 0 0
$$ ##$ShimPowRcbType= 3
$$ ##$ShimPowRes= (0..63)
$$ 1e-20 1e-20 1e-20 1e-20 1e-20 1e-20 1e-20 1e-20 1e-20 1e-20 1e-20 1e-20
$$ 1e-20 1e-20 1e-20 1e-20 1e-20 1e-20 1e-20 1e-20 0 0 0 0 0 0 0 0 0 0 0 0
$$ 0 0 0 0 0 0 0 0 0 0 0 0 0 0 0 0 0 0 0 0 0 0 0 0 0 0 0 0 0 0 0 0
$$ ##$ShimPowRng0= (0..63)
$$ 1 1 1 1 1 1 1 1 1 1 1 1 1 1 1 1 1 1 1 1 0 0 0 0 0 0 0 0 0 0 0 0 0 0 0 0
$$ 0 0 0 0 0 0 0 0 0 0 0 0 0 0 0 0 0 0 0 0 0 0 0 0 0 0 0 0
$$ ##$ShimPowRng1= (0..63)
$$ 1 1 1 1 1 1 1 1 1 1 1 1 1 1 1 1 1 1 1 1 0 0 0 0 0 0 0 0 0 0 0 0 0 0 0 0
$$ 0 0 0 0 0 0 0 0 0 0 0 0 0 0 0 0 0 0 0 0 0 0 0 0 0 0 0 0
$$ ##$ShimPowRng2= (0..63)
$$ 1 1 1 1 1 1 1 1 1 1 1 1 1 1 1 1 1 1 1 1 0 0 0 0 0 0 0 0 0 0 0 0 0 0 0 0
$$ 0 0 0 0 0 0 0 0 0 0 0 0 0 0 0 0 0 0 0 0 0 0 0 0 0 0 0 0
$$ ##$ShimPowRng3= (0..63)
$$ 1 1 1 1 1 1 1 1 1 1 1 1 1 1 1 1 1 1 1 1 0 0 0 0 0 0 0 0 0 0 0 0 0 0 0 0
$$ 0 0 0 0 0 0 0 0 0 0 0 0 0 0 0 0 0 0 0 0 0 0 0 0 0 0 0 0
$$ ##$ShimSysFunc= (0..63)
$$ 1 2 3 4 5 7 9 11 15 16 8 10 12 14 6 17 13 18 19 20 0 0 0 0 0 0 0 0 0 0
$$ 0 0 0 0 0 0 0 0 0 0 0 0 0 0 0 0 0 0 0 0 0 0 0 0 0 0 0 0 0 0 0 0 0 0
$$ ##$ShimSysMatrix= 0
$$ ##$ShimSysType= 1
$$ ##$TFXNUM= 0
$$ ##$TRIPLO2= 0
$$ ##$VTU= 2
$$ ##$VTUETH= <149.236.99.20>
$$ ##$VTUTY= <no>
$$ ##$WBREFAM= (0..15)
$$ 135.5 97.7 100 100 100 100 100 100 100 100 100 100 100 100 100 100
$$ ##$WBREFLM= (0..15)
$$ 0 0 0 0 0 0 0 0 0 0 0 0 0 0 0 0
$$ ##$WBREFPH= (0..15)
$$ 72.26 -67.22 0 0 0 0 0 0 0 0 0 0 0 0 0 0
$$ ##$WBSGU= (0..15)
$$ 0 0 0 0 0 0 0 0 0 0 0 0 0 0 0 0
$$ ##$XFAC= 2
$$ ##END=
$$ 
##$DECIM=	704
##$DSPFVS=	20
##XUNITS=	HZ
##YUNITS=	ARBITRARY UNITS
##FIRSTX=	25274.001712016048259
##LASTX=	-3134.6557087493106337
##DELTAX=	-0.43348832563920586258
##XFACTOR=	1
##YFACTOR=	0.085743502121930284532
##FIRSTY=	1.0811772346496582031
##MINY=	-23.596761703491210938
##MAXY=	2602.359619140625
##NPOINTS=	65536
##XYDATA=	(X++(Y..Y))
$$ [...]
13805E9l0pJ3J3kj8k6k2pJ3K3J7NNK3L3J5k1l5j3K0K6PlJ0J2j3m4m4j5QR%qj4k6l1j3K4O1
$$ 59 29 22 35 48 46 28 2 -20 -27 -14 9 26 31 36 59 92 107 86 51 38 58 84 91 88 98 110 97 53 9 -6 2 11 11 3 -11 -37 -68 -81 -57 4
13787DP5N4J3k3l6l2k8k8k3%L1N6N5L1jk5l3k4qNQOOJ6K2J2j6m8n8m4k1rj9l6l2jL3M2K7J2
$$ 4 79 133 146 123 87 55 27 -1 -24 -24 7 63 118 149 148 123 90 66 58 63 71 77 83 99 121 133 117 69 11 -33 -54 -63 -82 -118 -150 -151 -118 -76 -49 -37
13770c7RQMJ0K8M4K6j3l7k4J1L2L0J3ok2k5j8pqk2l7l5j7%OPRJ3J3J2J4J9J8Lj5j8qNR%o%
$$ -37 -28 -20 -16 -6 22 66 92 79 42 18 29 61 91 104 98 76 51 33 26 18 -4 -41 -76 -93 -93 -87 -80 -71 -58 -45 -33 -19 0 18 21 6 -12 -20 -15 -6 -6 -12 -12
13751a2J5K4J5lj4j7k6l6l5j9plOK6L7K1knJ0J3QJ2K7L0J2lMJ3Jj5j2NJ2%j2j6j5j5j5j5j8
$$ -12 3 27 42 39 25 8 -18 -54 -89 -108 -115 -118 -112 -86 -49 -28 -30 -35 -25 -12 -4 8 35 65 77 74 78 91 92 77 65 70 82 82 70 54 39 24 9 -6 -24
13734b4j5MK8L6K3ONJ5J7Kj9k3j0KLnkJ1J9J2mpJPRRJ0J0M%mj4l0m4m8m6l4j1J5K3RrpMNm
$$ -24 -39 -35 -7 29 52 58 63 78 95 97 78 55 45 47 50 45 43 54 73 85 81 74 75 82 91 100 110 120 124 124 120 106 76 32 -16 -62 -96 -107 -92 -69 -60 -69 -76 -72 -67 -71
13714g1lJ6L6L7K5Oj0k3l3m4m8l6j1J3K3J6PRJ7K9M3M9L9Rj9k0p%qj2%J8K4J9J5J7J5Rkj1
$$ -71 -74 -58 -22 15 40 46 36 13 -20 -64 -112 -148 -159 -146 -123 -107 -100 -91 -74 -45 -2 47 86 95 76 56 49 49 41 29 29 47 71 90 105 122 137 146 144 133
13696A33k0k4k5l1m1m5k5NJ6Lj1%K3L3K3J5J1kj6rK3M5K9lkL2M8K0k6m2k4mlj3j3nMLj0k4
$$ 133 113 89 64 33 -8 -53 -78 -73 -57 -54 -65 -65 -42 -9 14 29 40 38 22 13 36 81 110 107 105 137 185 205 179 137 113 109 106 93 80 75 79 82 72 48
13679D8k6j1J0J1qk7l0rK3M4M1J2j4j2J1K0om5n3l1njj1j3jJ1J8J9J9K2K6K7J8%j6j9j2no
$$ 48 22 11 21 32 24 -3 -33 -42 -19 25 66 78 64 52 63 83 77 32 -21 -52 -57 -58 -69 -82 -83 -72 -54 -35 -16 6 32 59 77 77 61 42 30 25 19
13662A9jJ4L2L5J7qk6l8m8n4m7l1j3%QJ3J7K8M4N1M4K0jojKL%nnjPJ3J3J2J1%k2m3m2k2%Q
$$ 19 18 32 64 99 116 108 82 44 -4 -58 -105 -136 -149 -149 -141 -128 -111 -83 -39 12 56 76 75 69 68 70 73 73 68 63 62 69 82 95 107 118 118 96 53 11 -11 -11 -3
13644cLljJ0K2J8Kj6k0j7k6l7l7k1kM%nj2j8j3QL3N1N7N3M2K3Lj0j6k0k1j7j4j3j1%J2J2%
$$ -3 0 -3 -4 6 28 46 48 32 12 -5 -31 -68 -105 -126 -128 -124 -124 -129 -141 -159 -172 -164 -131 -80 -23 30 72 95 98 88 72 52 31 14 0 -13 -24 -24 -12 0 0
13626@k1l6m1l0rJ0J6J9L2M7M4J9j1j8kK7M7M5J8k2m8n2l4pJ4K6J1j5l1k6qNJ0J6J7Rpj1k
$$ 0 -21 -57 -98 -128 -137 -127 -111 -92 -60 -13 31 50 39 21 19 46 93 138 156 134 86 34 0 -7 7 33 44 29 -2 -28 -36 -31 -21 -5 12 21 14 3 1
13609AKpj9j6OK7L3K8J9Poj8k2j8j1j2j9k1j7ojlonLJ4K2K3K2J8J1%mmoj5k1j6mMPJ3K5L3
$$ 1 3 -4 -23 -39 -33 -6 27 55 74 81 75 57 35 17 6 -6 -25 -46 -63 -69 -70 -73 -79 -84 -81 -67 -45 -22 0 18 29 29 25 21 15 0 -21 -37 -41 -37 -30 -17 8 41
13590D1K8J7J4J6J1nk2l5l5k2JK0L2L1J3k0m7m9k4NJ1lj4nJ3K8L3K7J9Q%onJ2L8M7K4j5m1
$$ 41 69 86 100 116 127 122 100 65 30 8 9 29 61 92 105 85 38 -11 -35 -30 -19 -22 -36 -41 -28 0 33 60 79 87 87 81 76 88 126 173 197 182 141
13573A41m0l4l3k9oJ6K4J1LJ2K2J5oj7j3j2k8m6m7k1J2L0K7J7RO%j2k3k9j9jJ4K4K4K0J4R
$$ 141 101 67 34 5 -1 15 39 50 53 65 87 102 96 79 66 54 26 -20 -67 -88 -76 -46 -19 -2 7 13 13 1 -22 -51 -70 -71 -57 -33 -9 11 25 34
13556C4JkolJLnk1l1l0j5jRP%jJ0L1L6J4j8l0j8PK3K9L2K8J6jj3j4j1mk%pj9l0l2k1jJ5K6
$$ 34 35 33 27 24 25 28 23 2 -29 -59 -74 -75 -66 -59 -59 -60 -50 -19 17 31 13 -17 -35 -28 -5 24 56 84 100 99 86 72 61 57 55 55 48 29 -1 -33 -54 -55 -40 -14
13537a4L4M3L9K0lj6j8qLJ2Qnj5j7k0l4m4k8QL2K3JoNJ7K0Mk1l7l8k3j2qmJ1K3J9jj3j4j4
$$ -14 20 63 102 122 119 103 85 77 80 92 100 95 80 63 43 9 -35 -63 -55 -23 0 1 -5 0 17 37 41 20 -17 -55 -78 -90 -98 -102 -91 -68 -49 -50 -63 -77 -91
13520i1j7j9j0OK1K6K7L0K8K2QkkNPmj6j9j0oprqKK1L6K9mm0n0l5j3jMJ1K0K9L3L4K6J4Kl
$$ -91 -108 -127 -137 -131 -110 -84 -57 -27 1 23 31 29 27 32 39 35 19 0 -10 -16 -23 -32 -40 -38 -17 19 48 44 4 -46 -81 -94 -95 -91 -80 -60 -31 2 36 62 76 78 75
13501G5mOK5L7K6ql2l2j8rqkJ0J0lj6rJ1K2J7NJRJ2Lj8l3l3l0k8l1k6j0J0K3K8K7L2L6L0J3
$$ 75 71 77 102 139 165 157 125 93 75 66 58 56 66 76 73 57 48 59 81 98 103 104 113 125 128 110 77 44 14 -14 -45 -71 -81 -71 -48 -20 7 39 75 105 118
13483A18qk0k7l1k8j1PJ6J4RJ1J6J6J7J9J5Jj6j8j0omNJ6J8R%Kjqj6j5j0lPJ2mk9l5lL2L5
$$ 118 110 90 63 32 4 -7 0 16 30 39 50 66 82 99 118 133 134 118 100 90 84 80 85 101 119 128 128 130 129 121 105 90 80 77 84 96 92 63 28 25 57 92
13465I2J0mNPj6m2m4k1lM%j0k4k6j2PJ2LkRK1K1J2KkpplNJ1J3J4J1kk3m0m3k4OL0M1M2M2L1
$$ 92 102 98 103 110 94 52 8 -13 -16 -12 -12 -22 -46 -72 -84 -77 -65 -62 -64 -55 -34 -13 -1 1 -1 -8 -15 -18 -13 -2 11 25 36 34 11 -29 -72 -96 -90 -60 -19 23 65 96
13446I6Qj5k9k8k0rKNqk5k9j2PJ5K0K5K4%k2j6RK1Mk2k7j0MJj1j4%J8K0ml4m7l3rJ1K3L1L4
$$ 96 104 89 60 32 12 3 5 10 2 -23 -52 -64 -57 -42 -22 3 27 27 5 -11 -2 19 23 1 -26 -36 -32 -31 -42 -56 -56 -38 -18 -22 -56 -103 -136 -145 -134 -111 -80 -46
13428d6K5J4Nlj2k1k1j4nPK4M1M0K2mj7j5nPJ4J9K4K9K6J6LNJ4J7Lj6l0l7m4m5l4j9q%J0K2
$$ -46 -21 -7 -2 -5 -17 -38 -59 -73 -78 -71 -47 -6 34 56 52 35 20 15 22 36 55 79 108 134 150 153 158 172 189 192 176 146 109 65 20 -14 -33 -41 -41 -31 -9
13410iK4J7Kj4k8k9j2J1K2J2orkJ0J4J4Nj1k0j6lNOJ1J8K1J4PPNnk2l3l6l5k5rJ3L6M6L4J3
$$ -9 15 32 34 20 -8 -37 -49 -38 -16 -4 -10 -19 -21 -11 3 17 22 11 -9 -25 -28 -23 -17 -6 12 33 47 54 61 66 61 39 6 -30 -65 -90 -99 -86 -50 -4 30 43
13392D3opjLKJ3L2M5M1L2K6J9RMJ4J6nl8n1l4j2oj2k0j9j1QK3J9MKK0K3qn3o3k6K1M6M2K0
$$ 43 37 30 29 32 34 47 79 124 165 197 223 242 251 255 269 285 280 242 191 157 145 139 127 107 88 77 85 108 127 131 133 153 176 168 115 52 26 47 93 135 155
13374A55ok4k2nNlk2l1k0MK3J8ok4j5RK3K5K7K4lm3o1l8mJ0RJ6K5K0NJJ1J8Oj7k9k3r%lqL
$$ 155 149 125 103 98 103 100 78 47 27 31 54 72 66 42 27 36 59 84 111 135 132 89 28 -10 -14 -4 5 21 46 66 71 72 83 101 107 90 61 38 29 29 26 18 21
13355B1K3K2lk9k1J0K8K4J1%j6l8m2k4JJ6J7J1qk8l2j2OLj3j8j4r%K0L6L2J7J6K7K6Kk2l3
$$ 21 44 66 63 34 13 23 51 75 86 86 70 32 -10 -34 -33 -17 0 11 3 -25 -57 -69 -63 -60 -73 -91 -105 -114 -114 -94 -58 -26 -9 7 34 60 62 40 7
13338Gl9m6l0RM5M6K1jqmMJ0Pnj1kJ5K1Qj5l7m5l1mJ7K0K0K7L1K0Klkj6m2n0k5J2L5M7N9N8
$$ 7 -32 -78 -108 -99 -54 -8 13 12 4 0 4 14 21 16 5 3 18 39 47 32 -5 -50 -81 -85 -68 -48 -28 -1 30 50 52 49 47 31 -11 -61 -86 -74 -39 8 67 125
13320A25K9j3m3m8l8k3pLkoRL6N0K7j4l9l8k0qkJQJ9K8K0ql2k8mJ8J8Kj0mJ0J8J7J1OJ1J9
$$ 125 154 141 98 50 12 -11 -18 -15 -17 -23 -14 22 72 99 85 46 8 -12 -20 -22 -21 -13 6 34 54 46 14 -14 -18 0 18 20 10 6 16 34 51 62 68 79 98
13302I8K4J6mk0j8ppk2l1k1kQJ3K1K4Kl3m8l4pNRJ6K0J7J0J2J8J8J4RKj1j4kJ1kl6n7n3k9
$$ 98 122 138 134 114 96 89 82 60 29 8 6 14 27 48 72 74 41 -7 -41 -48 -43 -34 -18 2 19 29 41 59 77 91 100 102 91 77 75 86 84 48 -9 -62 -91
13285i1oJ2J9J4RJ9L3K9ml2l1j2JJJJ0K0K5K6J7kj3j4j1j2j3nORMLJj2k8l2j5MRKoj0j1j0
$$ -91 -97 -85 -66 -52 -43 -24 9 38 34 2 -29 -41 -40 -39 -38 -28 -8 17 43 60 58 45 31 20 8 -5 -10 -4 5 9 12 13 1 -27 -59 -74 -70 -61 -59 -65 -75 -86 -96
13266i6lJ3M0O0O3M2J3mrj4k5k5j5jQJ7K5K8J6jj8k5k1rJ%JRK0J7jj4j5j6k3l2l0k2j0J1L0
$$ -96 -99 -86 -46 14 77 119 132 128 119 105 80 55 40 39 47 64 89 117 133 132 114 89 68 59 60 60 61 70 90 107 106 92 77 61 38 6 -24 -46 -56 -45 -15
13248a5L2J6loLRJ1J2J3K0L4M6M0Rj9k7k4k7l6l7l2k8k4j0M%j3j3jMJjMONJ7M1N7M7K1mj7
$$ -15 17 33 30 24 27 36 47 59 72 92 126 172 212 221 202 175 151 124 88 51 19 -9 -33 -43 -39 -39 -52 -65 -66 -62 -61 -62 -58 -52 -47 -30 11 68 115 136 132 115
13230A15j7%K2L0J9J0RLj9l4k4lLrj9j9k1k9k1jJ7J3klJ6L2K4ok6k1lKj4k4rJ9M5M9L9K1m
$$ 115 98 98 120 150 169 179 188 191 172 138 114 111 114 105 86 67 46 17 -4 -5 12 25 23 20 36 68 92 86 60 39 36 38 24 0 -9 10 55 104 143 164 160
13212A60k9m3l7k0nknnMJ0Kj2nL1P1P6M5Pk1m1n9n5j9K6M0J9pj1%%j2j9j4pj3k6k6qJ5L1K4
$$ 160 131 88 51 31 26 24 19 14 18 28 30 18 13 44 115 191 236 243 222 181 122 67 48 74 114 133 126 115 115 115 103 84 70 63 50 24 -2 -10 5 36 60
13194F0Mj6k2j4lKNJ2K0J7Jj8k8k0kJ7K3Nj9k8k5j9j6oJ3K2J0qnJ9L6L2Qj9l4k9j4%%nmOJ3
$$ 60 64 48 26 12 9 11 16 28 48 65 66 48 20 0 -2 15 38 43 24 -4 -29 -48 -64 -70 -57 -35 -25 -33 -38 -19 17 49 57 38 4 -25 -39 -39 -39 -44 -48 -42 -29
13176b9Pmj0j0qrpMK0K6J2j8l0j3K1M0L2J5JlpoMJ8K4J1j8l8k7ML8M6L0Nj8l7m3k7KK6L0J8
$$ -29 -22 -26 -36 -46 -54 -63 -70 -66 -46 -20 -8 -26 -56 -69 -48 -8 24 39 40 37 30 24 28 46 70 81 63 25 -2 2 40 86 116 121 103 66 23 -4 -2 24 54 72
13158G2mk4l4k6lJ8K0J1%j0j7j3jJ6K6K0QKKmj4k1rPJ1kj1JK6M0L8K4OoqkJqk1k2j4j3k3k9
$$ 72 68 44 10 -16 -19 -1 19 30 30 20 3 -10 -11 5 31 51 59 61 63 59 45 24 15 22 33 31 20 21 47 87 125 149 155 149 141 139 140 132 111 89 75 62 39 10
13138A0k4k1k2j6J0M6O0M9K2Jj0j8k4j9kJ6K2J6J2J8K1J7J0OJj3k6k7k0j9k3j5KJ0nk1k1l
$$ 10 -14 -35 -57 -73 -63 -17 43 92 114 115 105 87 63 44 42 58 80 96 108 126 147 164 174 180 181 168 142 115 95 76 53 38 40 50 45 24 3 0
13122@J9L9M2K6Kj1j0j3k3k4kK4K7QpmJ1J9Pj7l1k4nKknlpj8j5J0K7J4qj0MJ3J6K8L7K2pj8
$$ 0 19 58 100 126 128 117 107 94 71 47 45 69 96 104 97 93 104 123 130 113 82 58 53 55 53 48 45 38 20 5 15 42 56 48 38 42 55 71 99 136 158 151 133
13103A33kJ0ql4m1k6qkmqqqj8l4l5j1K4L4Qk8m3l4j6KJ5K1J8J3J1RRJ0J8K0J8J9K2K2J0oj4
$$ 133 131 141 133 99 58 32 24 22 18 10 2 -6 -24 -58 -93 -104 -80 -46 -38 -66 -109 -143 -159 -157 -142 -121 -103 -90 -79 -70 -61 -51 -33 -13 5 24 46 68 78 72 58
13086E8j3j0j4j7j6j0rj6k9l7k5kJ9K8K4J6Loj0jJ3K3J3j0k7j7J1K8K3RQJ4J0nj5qKL%KOO
$$ 58 45 35 21 4 -12 -22 -31 -47 -76 -113 -138 -140 -121 -93 -69 -53 -50 -56 -66 -67 -54 -31 -18 -28 -55 -72 -61 -33 -10 -1 7 21 31 26 11 3 5 8 8 10 16 22
13067B2K%JPQNMK1M8N5J8m1p6o8l2q%npNK5L5K9J0kqj5j4LK4K3%j4j1oj5k2j9j8k2j8lJ6K7
$$ 22 24 24 25 32 40 45 49 70 118 173 191 150 74 6 -26 -34 -34 -39 -46 -41 -16 19 48 58 56 48 33 19 22 46 69 69 55 44 38 23 1 -18 -36 -58 -76 -79 -63 -36
13048c6L8M8L7Nk1j8jMlj0rpj0rj1j6j3jPlj4kJ8J6j2l6k6MK3J6mj2KJ6J1j1k4j0J8L2K5J2
$$ -36 2 50 87 92 71 53 52 56 53 43 34 27 17 8 -3 -19 -32 -33 -26 -29 -43 -45 -27 -11 -23 -59 -85 -81 -58 -42 -46 -58 -56 -40 -29 -40 -64 -74 -56 -24 1 13
13030A3Jqp%Kok5l0j7KJ2J0%j7l0l2k0lJ8L6M9M8L2Rj4j5PL3L8K5OmomJMj2l5m0k4j6k5l2
$$ 13 14 6 -1 -1 1 -5 -30 -60 -77 -75 -63 -53 -53 -70 -100 -132 -152 -155 -137 -101 -52 -4 28 37 23 8 15 48 86 111 117 113 107 103 104 108 96 61 21 -3 -19 -44 -76
13011g6j6J1K7L1L5L7K5Lj4l1m0l6rJ5J9J1J8L4L9K9J1qk4k8j6rj5j7lJ6J8J0Jj1l1k9KM1
$$ -76 -92 -81 -54 -23 12 49 74 77 63 32 -8 -44 -53 -38 -19 -8 10 44 83 112 123 115 91 63 47 38 23 6 3 19 37 47 48 37 6 -23 -21 20
12995B0M7L0J4kl3n6m0nRJJ0L8N0L9L9N5N0Ql6m7m1l8l5k1oMJ7K5J9LlMJj1j0%jj9k7k0j4
$$ 20 67 97 111 109 76 20 -20 -25 -16 -15 -5 33 83 122 161 216 266 274 238 191 150 112 77 56 50 54 71 96 115 118 115 119 120 109 99 99 98 79 52 32 18
12977A8j1RL9M5L0K1K3J6jPK9L0RNK0K3J3K9O5O7L6L0O0P7P0R0J35J49J48K08L13L63L91N55
$$ 18 7 16 55 100 130 151 174 190 189 196 225 255 264 269 289 312 325 354 419 486 522 552 612 689 759 849 984 1133 1281 1489 1802 2165 2556 3111
12962C111Q74J223J664K420L234L159J517j028k903l210k463j681j251r54o50m61m14l57k37
$$ 3111 3985 5208 6872 9292 12526 15685 17202 16174 13271 10061 7598 5917 4666 3712 3062 2601 2187 1830 1593
12954A593j58j66j61r5l9m5o2n2m9q0j03r2p5o5m0jJ4JoNOj4j9opk9m1k6j8l0m3l5k3j3QM0
$$ 1593 1435 1269 1108 1013 974 929 867 815 766 686 583 491 416 351 311 310 324 325 319 324 330 316 297 291 284 255 214 188 170 140 97 62 39 26 34 74
12939G4N4M1K3K0J6MkNJ2J0J2K3K7J7J1J4J3PJ2J3j4n6p4n0k5k6l5k1JJ1J2J7J8Kj6j6kOO
$$ 74 128 169 192 212 228 232 230 235 247 257 269 292 319 336 347 361 374 381 393 406 392 336 262 212 187 161 126 105 106 117 129 146 164 166 150 134 132 138 144
12922A44%rk2k8k2j7k5k9j7J0L1M4M2K4nk2j2LJj3j6lMok6l4k7oJ3J7QLMPPjj0j7j4OK4K3
$$ 144 144 135 113 85 63 46 21 -8 -25 -15 16 60 102 126 121 99 87 90 91 78 62 59 63 57 31 -3 -30 -36 -23 -6 2 5 9 16 23 22 12 -5 -19 -13 11 34
12904C4%j2nKoj4oQJ0lj1j1j0j4j1kRJ3J0PPK0M1M3K2qk0j2jOPNkrj3j8k5l0j8MK5L4K2Kj8
$$ 34 34 22 17 19 13 -1 -7 1 11 8 -3 -14 -24 -38 -49 -51 -42 -29 -19 -12 -5 15 56 99 121 113 93 81 80 86 93 98 96 87 74 56 31 1 -17 -13 12 46 68 70 52
12884E2k0j0lmkJ6L3K8PmLJ0Nqj2nNJ1J3J5J1Kj3k8k7j1K%j0qJLj1k6k9j9oJkrj2lJ2J8J7
$$ 52 32 22 19 15 13 29 62 90 97 93 96 106 111 103 91 86 91 102 115 130 141 143 130 102 75 64 66 66 56 48 49 52 41 15 -14 -33 -39 -38 -40 -49 -61 -64 -52 -34 -17
12865a7J9K4K3J4RJ5J9Oj8l5l0j4kkoqqo%Mlj6j8NM0N9N6M1K1pl9m8k3J6L4K5Nj5l1l9l0j2
$$ -17 2 26 49 63 72 87 106 112 94 59 29 15 13 11 5 -3 -11 -17 -17 -13 -16 -32 -50 -45 -5 54 110 151 172 165 126 78 55 71 105 130 135 120 89 50 20 8
12846H%jnk%oj0pljQK7M8M9K4nk3j7kQJ0MLPJ0Pkj4k4l0k6j7jJ4K2J7Kj3j7j5j0rprj6j9r
$$ 8 8 7 2 0 0 -6 -16 -23 -26 -27 -19 8 56 105 129 124 101 84 82 90 100 104 107 114 124 131 129 115 91 61 35 18 17 31 53 70 72 59 42 27 17 8 1 -8 -24 -43 -52
12826e2NJ1MjPK3K6J2j0k3j9mJ0J5J0krqrqmNPpk6k6nJ2Lj4j3QJ5lk1j6%RJ0RLrj3KJ9J6l
$$ -52 -47 -36 -32 -33 -26 -3 23 35 25 2 -17 -21 -11 4 14 12 3 -5 -14 -22 -26 -21 -14 -21 -47 -73 -78 -66 -63 -77 -90 -82 -67 -70 -91 -107 -107 -98 -88 -79 -76 -85 -98 -96 -77 -61 -64
12806f4j1ok%J4L1L4K1J7L0M0L1J5Mlj1j4mNLoqlmmJLlj3rOJ5Rkrj0j5j7j8j3omoj3j6j8k0
$$ -64 -75 -81 -83 -83 -69 -38 -4 17 34 64 104 135 150 154 151 140 126 122 127 130 124 116 113 109 105 106 109 106 93 84 90 105 114 112 103 93 78 61 43 30 24 20 14 1 -15 -33 -53
12785e3k1j7r%lpoNK0L1M1M4M1L0J9Qrl6n4m7k2NJ7J7J7J6jk7m0k0K2N3N7L5jl8o0n4k3QJ3
$$ -53 -74 -91 -100 -100 -103 -110 -116 -111 -91 -60 -19 25 66 96 115 123 114 78 24 -23 -45 -40 -23 -6 11 27 26 -1 -41 -61 -39 14 71 106 105 67 7 -47 -70 -62 -49
12767d9MjJ0K4K5J5OMMqk5k6j1L%oNK7L2Qj9j9kJ1QJqj9k9k7j4JQJ4J9K5K6J9PkMJ4J1mj1
$$ -49 -45 -46 -36 -12 13 28 34 38 42 34 9 -17 -28 -25 -25 -31 -26 1 33 41 22 3 1 12 20 21 13 -6 -35 -62 -76 -75 -67 -53 -34 -9 17 36 43 41 45 59 70 66 55
12748E5mjj2j9oJ3Nj6k1jJ5Rpj2nNJ4K5K3Lk6m5m3k2LK1K5J7Nj1k3k4j1LNkKJ8K9K1PKLK%
$$ 55 51 50 38 19 13 26 31 15 -6 -7 8 17 10 -2 -7 -2 12 37 60 63 37 -8 -51 -73 -70 -49 -24 -7 -2 -13 -36 -60 -71 -68 -63 -65 -63 -45 -16 5 12 14 17 19 19
12728A9nj7l3l1jL7M4J6j8l2l3l0j8J5N2O8N2J9kmNJ1ROQOok0j9qnj7j8QM3L9qn6o9n2l1r
$$ 19 14 -3 -36 -67 -68 -31 13 29 11 -21 -54 -84 -102 -87 -35 33 85 104 102 98 103 114 123 129 137 143 137 117 98 90 85 68 50 58 101 140 132 76 7 -45 -76 -85
12710h5K1M7M1Nk5k4%K0K0J1kj0j1rpqnOJ8K1J0j4m0n6m5j0K9N2N0L7K2J1Mkpj1j2j1j3j5
$$ -85 -64 -17 24 29 4 -20 -20 0 20 31 29 19 8 -1 -8 -16 -21 -15 3 24 34 20 -20 -76 -121 -131 -102 -50 0 37 59 70 74 72 65 54 42 31 18 3
12693Cj4qOK1L4L2K0PLjj1k3j5RK4Rj6k3j0Jpj8j5J1L9M6K5nk0j6nMJ1K2K3Rqj4j6k0k5j9
$$ 3 -11 -19 -13 8 42 74 94 101 104 103 92 69 54 63 87 96 80 57 47 48 41 23 8 19 58 104 129 124 104 88 83 87 98 120 143 152 144 130 114 94 69 50
12675E0kJ0J1LmmPK0K1J1K%%qj4pORPQJ7L8O9R8R4O1L1L5O2R1J26J69K11K50L17M35N92P86
$$ 50 48 58 69 72 68 64 71 91 112 123 125 125 125 117 103 96 102 111 118 126 143 181 250 348 442 503 534 569 631 722 848 1017 1228 1478 1795 2230 2822 3608
12658C608J031J236J148N86k85j013j277j142q89o80n03l36k21j72j49j18q7p0n2l4k6l3m4
$$ 3608 4639 5875 7023 7609 7324 6311 5034 3892 3003 2323 1820 1484 1263 1091 942 824 737 667 615 581 555 522 478
12648D78n2o4o0j7M1O5M0Jk4m0m7l5j3j0k7k9nJ7J0mllj7l0j5J1J8Lj1j8k9m1m2l5l1k6nK2
$$ 478 426 362 302 285 326 391 431 432 408 368 321 286 273 263 236 207 202 219 229 225 222 219 202 172 157 168 186 189 178 160 131 90 48 13 -18 -44 -49 -27
12632b7L0K2J8K3J9Kj5j8j3j0qLJ8K7L2L4K7Lk9m1k4%jk5l9j7K1M6L9J1j3k4j9oJpj9k1j1
$$ -27 3 25 43 66 85 87 72 54 41 31 23 26 44 71 103 137 164 167 138 97 73 73 72 47 8 -9 12 58 97 108 95 71 52 46 47 40 21 0 -11
12615a1j7l1k6J1N6P0N6M2L9L0Rj0j3rj9m4o4o5m6k0OK1K4K0K2K2J1j1k7k4nJ3K3K4J5MkO
$$ -11 -28 -59 -85 -74 -18 52 108 150 189 219 228 218 205 196 177 133 69 4 -42 -62 -56 -35 -11 9 31 53 64 53 26 2 -3 10 33 57 72 76 74 80
12598H0J9J8Jj1pMMmJJ6J9jk4l1k3j9k0j6%J5K0J2Kqj6j3NK5L0J2j0j6rpj8k4j4nqj6oJ6K4
$$ 80 99 117 118 107 100 104 108 104 105 121 140 139 115 84 61 42 22 6 6 21 41 53 55 47 31 18 23 48 78 90 80 64 55 48 30 6 -8 -13 -21 -37 -43 -27 -3
12580cJ2kommjOPJnpj2j5JL1M7L0KrnknmNJ2J7J9J1kj3j2j2k4l4k4j1j8m3n0k8NK7L4L0J2
$$ -3 9 7 1 -3 -7 -8 -2 5 6 1 -6 -18 -33 -32 -1 46 76 78 69 64 62 57 53 58 70 87 106 117 115 102 90 78 54 20 -4 -15 -33 -76 -126 -154 -149 -122 -88 -58 -46
12560d6poJ6L9M1K8Qj6l7m0k5mJ1J8K3K0PpoOJ2Onj8k3j7LJ9J7Mnqj0j0jJ7K8K6J9J6J5J1
$$ -46 -53 -59 -43 -4 37 65 73 57 20 -20 -45 -49 -38 -20 3 23 30 23 17 23 35 41 36 18 -5 -22 -19 0 17 21 16 8 -2 -12 -13 4 32 58 77 93 108 119
12542A19NLJnj2j3nkj0k7l3k7j1J2L7N5N2K6lj3l%j8m0m5k9nJ1J3P%nlmj1j7rNJ2J4J3K1L5
$$ 119 124 127 128 123 111 98 93 91 81 54 21 -6 -17 -5 32 87 139 165 162 149 146 146 128 88 43 14 9 20 33 40 40 35 32 28 17 0 -9 -4 8 22 35 56 91
12523I1M6L8J2j9l5k8j3mj3l0l8k7pRMj4k5j5NJ6K0L0M9N3L2Nj0rj0j5j7j5j7k4k3pOLrj0
$$ 91 137 175 187 168 133 105 92 88 75 45 7 -20 -27 -18 -14 -28 -53 -68 -63 -47 -27 3 52 105 137 142 132 123 113 98 81 66 49 25 2 -5 1 4 -5 -15
12506a5J0L2L6K1LloroLJ1Mj4k4j4LJ2J4J9K2J2j3k8k2mNJnj2k0k3j1N%k3l7j7J2J9%j6j5
$$ -15 -5 27 63 84 87 84 78 69 63 66 77 81 67 43 29 32 44 58 77 99 111 98 70 48 44 49 50 45 33 13 -10 -21 -16 -16 -39 -76 -93 -81 -62 -62 -78 -93
12488i3%J0J3J2NkoJJ7L5L7K2ok8k9j5QK4K8Rk5m6l8rJ1J8K6L2K3pk6j4J1J7PKJ6L3L3J7%
$$ -93 -93 -83 -70 -58 -53 -55 -61 -60 -43 -8 29 51 45 17 -12 -27 -19 5 33 42 17 -29 -67 -76 -65 -47 -21 11 34 27 1 -13 -2 15 22 24 40 73 106 123 123
12470A23j1j2j0j2k4l3l2l1l5l6j4K6N9O4N7M9M2J6k0m4l7rJ6K3J8Qok5l4k4kPrl3l5j3PN
$$ 123 112 100 90 78 54 21 -11 -42 -77 -113 -127 -101 -42 22 79 128 170 186 166 122 85 76 92 115 133 141 135 110 76 52 50 57 48 15 -20 -33 -26 -21
12454b1rrLRql3m4l1mJ9K6J9%j1oJ7L9M4L1J3jmlnj0r%J4J8J2OJ0J7J9J4ROkj8k8l0k8l1m3
$$ -21 -30 -39 -36 -27 -35 -68 -112 -143 -147 -128 -102 -83 -83 -94 -100 -83 -44 0 31 44 43 39 36 31 21 12 12 26 44 56 62 72 89 108 122 131 137 135 117 89 59 31 0 -43
12435d3m6l9k2jK1L8N1N1M3K4LmMJ1Mj4k5k4j8j4olmrpMJ0lk0j6J4L9L2Kk2k0qjlm%RJ9L5
$$ -43 -89 -128 -150 -151 -130 -92 -41 10 53 77 80 76 80 91 95 81 56 32 14 0 -6 -9 -13 -22 -29 -25 -15 -18 -38 -54 -40 -1 31 33 11 -9 -17 -18 -21 -25 -25 -16 3 38
12415C8M3L4Mk5l9k8rLjj0qJ3L1K7RLJ7L8L8J9%pnpk0l4m3l8j9NK5L3K2%oJ2L1K0j7m2l5k0
$$ 38 81 115 119 94 55 27 18 21 20 10 2 15 46 73 82 85 102 140 178 197 197 190 185 178 158 124 81 43 24 29 54 87 109 109 103 115 146 166 149 107 72 52
12397E2j7k2k0k0k3j9KJ8Mk1k6pQRJ0J5J2mj4j0op%J4K3J7J1J4J6J1%oj0j1pPJ2PjLJ2Qlm
$$ 52 35 13 -7 -27 -50 -69 -67 -49 -45 -66 -92 -99 -91 -82 -72 -57 -45 -49 -63 -73 -79 -86 -86 -72 -49 -32 -21 -7 9 20 20 14 4 -7 -14 -7 5 12 11 14 26 34 31 27
12378B7PJ5J6J0lj6rK3N2M6Rj9k3j4j2j4j3ojknj4j9j4njmkPJ3NprlMPJ6K6K3Mj2j0OJ8J4
$$ 27 34 49 65 75 72 56 47 70 122 168 177 158 135 121 109 95 82 76 75 73 68 54 35 21 16 15 11 9 16 29 34 27 18 15 19 26 42 68 91 95 83 73 79 97 111
12359A11KooprnNJ7J9J2Koj2j4pQK4L2K6J2lj1j5k8m4m9l6j2RJ5J1ok6l4k4KK4L4L5K1Ko%
$$ 111 113 107 101 94 85 80 85 102 121 133 135 129 117 103 96 104 128 160 186 198 195 184 169 141 97 48 12 0 9 24 35 29 3 -31 -55 -53 -29 5 40 61 63 57 57
12340E7J3J4Kj2j4mJ2L0L4J9kpNRlj4rlqj6j2jJj0k5l3l3k5r%pj6rRJ6RQJ5J2pj8mK1K8J5
$$ 57 70 84 86 74 60 56 68 98 132 151 149 142 147 156 153 139 130 127 119 103 91 90 91 81 56 23 -10 -35 -44 -44 -51 -67 -76 -67 -51 -42 -34 -19 -7 -14 -32 -36 -15 13 28
12321B8Jmqj4j8j9j8j0J1M0N5N0L0J3PRJ2Mk0m4m9k8rpj1jK1K6Rj2j5pJNJ0K2K8J3k4o2o9
$$ 28 29 25 17 3 -15 -34 -52 -62 -51 -11 44 94 124 137 144 153 165 169 149 105 56 28 19 12 1 0 21 47 56 44 29 22 23 28 38 60 88 101 77 15 -54
12303e4m1jJ6J3J4K9M4M5K3nl2m2l3j5jNJ8L6N0L7Nk2k9k5k5l2m1l4j2J1J9K0K7M2M6K5ok3
$$ -54 -95 -96 -80 -67 -53 -24 20 65 88 83 51 9 -24 -39 -40 -35 -17 19 69 106 111 89 60 35 10 -22 -63 -97 -109 -98 -79 -59 -32 10 56 81 75 52
12286E2k2j4j0nMQLj0j7j2QL3M4L4J7J2K0K4Qj3k3j2LQmk7l8k9qRRlj5rQK3J4j3l4k8mK0L0
$$ 52 30 16 6 1 5 13 16 6 -11 -23 -15 18 62 96 113 125 145 169 177 164 141 129 132 140 136 109 71 42 34 43 52 49 34 25 33 56 70 57 23 -5 -9 11 41
12268D1K3J2NPOj0l3m6l9k3mJ7L9M8L7J7Mjj3k7l4k6j8mJ4L0L0J5MMOlj5k4k5k1j2kkmMK2
$$ 41 64 76 81 88 94 84 51 5 -34 -57 -61 -44 -5 43 80 97 101 100 87 60 26 0 -18 -22 -8 22 52 67 71 75 81 78 63 39 14 -7 -19 -21 -23 -27 -23 -1
12249aK7K0J9L7N6M3Nk5l0k7l0l3k1JJ0Jj0nJ1K1J5Lnj8l8m9l4kK7L2K9J9%k2l2j7J1K7L4
$$ -1 26 46 65 102 158 201 206 181 151 124 94 61 40 41 51 52 42 37 48 69 84 87 82 64 26 -23 -57 -59 -32 0 29 48 48 26 -6 -23 -12 15 49
12233D9L5L1J7oj9j7j3j8k8k7j6rnkOJ4RjlRK5K5J0koooqn%QJ7K1J6J2J4J6Opj1lPJ6K5K3
$$ 49 84 115 132 126 107 90 77 59 31 4 -12 -21 -26 -28 -22 -8 1 0 -3 6 31 56 66 64 58 52 46 38 33 33 41 58 79 95 107 121 137 143 136 125 122 129 145 170 193
12213A93Jl2m4k8n%klpk2l1j7OJ1j1l0k4JJ8J2pk1j9oRK7L5K2j7n0m2KM2M7L3J8J3J5K0J3
$$ 193 194 162 118 90 85 85 83 80 73 51 20 3 9 20 9 -21 -45 -44 -26 -14 -21 -42 -61 -67 -58 -31 4 26 9 -41 -83 -81 -39 8 41 59 72 87 107 120
12196A20j1m3n1l4j8k0k2rJ1J6J2QOlj5j9j3pn%LMNQROOJ3J3NklnoJ2M5N7K7j6k6j1ok0k7
$$ 120 109 66 15 -19 -37 -57 -79 -88 -77 -61 -49 -41 -35 -38 -53 -72 -85 -92 -97 -97 -94 -90 -85 -77 -68 -62 -56 -43 -30 -25 -27 -30 -35 -41 -29 16 73 100 84 58 47 41 21 -6
12177fj5QK4K8J3j1k6k1r%PJ4J0j4l1j7J0J3l%K7M4L6J8Qlj2j0OK0K2J9J2MKJ1J2pk6k6j4
$$ -6 -21 -13 11 39 52 41 15 -6 -15 -15 -8 6 16 2 -29 -46 -36 -23 -26 -26 1 45 81 99 107 104 92 82 88 108 130 149 161 165 167 178 190 183 157 131 117
12159A17j2j5j1nj1oK3M7K6k1l5j2MjNK3K6Mj2j5k7l3mM5O4N1M4M4K0j8j6K2L8K3L5Q1R9Q0
$$ 117 105 90 79 74 63 57 80 127 153 132 97 85 89 88 93 116 142 146 134 119 92 59 55 100 164 215 259 303 323 305 289 311 349 372 407 488 587 667
12142F67R0J40J74J86K37L20L66M17O08R25J241J634K342L109L013J411j036k819l107k408
$$ 667 757 897 1071 1257 1494 1814 2180 2597 3205 4130 5371 7005 9347 12456 15469 16880 15844 13025 9918 7510
12134G510j677j260r47o29m33l83l36k39j78j79j57r0n4q0r8q0o9p9o7k4Kqk0j6k5m6l7jJ2
$$ 7510 5833 4573 3626 2997 2564 2181 1845 1606 1428 1249 1092 1002 948 868 770 690 621 542 475 451 453 445 425 409 384 338 301 300 312
12121C12rk4j1Jqj7j4j5k5j7PJ7%j6j6j8k2lK7K8j0m3l9k0pJ2M4O0M6K1J0jl5o3n3j9OJ3J9
$$ 312 303 279 268 269 261 244 230 215 190 173 180 197 197 181 165 147 125 122 149 177 167 124 85 65 58 70 114 174 220 241 251 250 215 152 99 80 86 99 118
12104A18K5J8OMOjj6k2j8j9k6k3mJ9K9K0Kj6k7k6j9nJ0K3K5J1nj2oMJ2RKjMLj0k2j7nmj5j9
$$ 118 143 161 167 171 177 176 160 138 120 101 75 52 48 67 96 116 118 102 75 49 30 25 35 58 83 94 89 77 71 75 87 96 98 97 101 104 94 72 55 50 46 31 12
12086A2j0mpqkLJ1K5M4M7L4K0Mj7m2m6l1j6j4oJ5L6L4K1J5QmrNK5K9J3rk6l5k5%J8Qj1k0j5
$$ 12 2 -2 -9 -17 -19 -16 -5 20 64 111 145 165 169 152 110 64 33 17 3 -3 12 48 82 103 118 126 122 113 118 143 172 185 176 150 115 90 90 108 116 105 85 70
12067G0j2j1omqj1lO%j0lJ8K9K2J4Rjk1l3k9j7oOJ0MpmJ9L6K2j3m0l9j8KOnk0k3j3OK3L5L7
$$ 70 58 47 41 37 29 18 15 21 21 11 8 26 55 77 91 100 99 78 45 16 -1 -7 -1 9 13 6 2 21 57 79 66 26 -13 -31 -29 -23 -28 -48 -71 -84 -78 -55 -20 17
12048A7K7J4OOOlj8l1l6l3k1oNQQJ0J5K4K5J3j4l0k3MK4K2Nj3j7nJ1J9J1JMJ5J7Kj5j9j0L
$$ 17 44 58 64 70 76 73 55 24 -12 -45 -66 -72 -67 -59 -51 -41 -26 -2 23 36 22 -8 -31 -27 -3 19 24 11 -6 -11 0 19 30 31 35 50 67 69 54 35 25 28
12030B8Nnj6k1j7j0mKJ0K0K6K5J2pk3k1mRQOQOnj3pLkqNK9L3Pk5m4m6m0j6J7L9M1K8Rj5l1
$$ 28 33 28 12 -9 -26 -36 -40 -38 -28 -8 18 43 55 48 25 4 0 9 17 23 31 37 32 19 12 15 13 5 10 39 72 79 54 10 -36 -76 -92 -75 -36 5 33 42 27 -4
12011dk7nOmj6j0MJ0OKkj1j5pNONJ3K6K9K5K2J6mk7l6k8j9j2OL4M6L6J8RKj2k2j7%ROJlj2
$$ -4 -31 -36 -30 -34 -50 -60 -56 -46 -40 -38 -40 -51 -66 -73 -68 -62 -57 -44 -18 11 36 58 74 70 43 7 -21 -40 -52 -46 -12 34 70 88 97 99 87 65 48 48 57 63 64 61 49
11991D9k1j7LK5K7J0rj8j1OK0K5J5JmkKnj5k2j5mNJ4K1J2j7m2l4%K1Pk7m0k5kJ5K5L0J8oj9
$$ 49 28 11 14 39 66 76 67 49 38 44 64 89 104 105 101 99 101 96 81 59 44 40 45 59 80 92 75 33 -1 -1 20 27 0 -40 -65 -67 -52 -27 3 21 15 -4
11973dj4qj2j2QK6J2k4l7rL0M7M9M6L4Ll0l9k8j9j9j5lkj2j0K3N3N2J9rj3kMlj9l1k3jJ6L
$$ -4 -18 -26 -38 -50 -42 -16 -4 -28 -65 -74 -44 3 52 98 132 135 105 66 38 19 0 -15 -18 -20 -32 -42 -19 34 86 105 96 83 81 85 82 63 32 9 8 24 27
11956B7k8m3k1J3L3L4L2K9J7jj8l0l6l4j9LJ0%rmJ1J6Mj0j3pkjKJ2K4K3Kk4k9nK3K4Kj4rN
$$ 27 -1 -44 -65 -52 -19 15 47 76 93 92 74 44 8 -26 -45 -42 -32 -32 -41 -45 -34 -18 -14 -24 -37 -44 -46 -47 -45 -33 -9 14 16 -8 -37 -42 -19 5 7 -7 -16 -11
11937a1PlpjJ2J9K0Rrk4k4qQJ3PMJ0J2jl0n1n0l0j0jKOPMjlnjJ3M1N9M7J9oj2j8l1m4l5qK1
$$ -11 -4 -7 -14 -15 -3 16 36 45 36 12 -12 -20 -12 1 8 12 22 34 33 3 -48 -98 -128 -138 -139 -137 -131 -124 -120 -121 -124 -129 -130 -117 -76 -17 30 49 43 31 13 -18 -62 -97 -105 -84
11917h4L6L1J2qj4lQLrj1MK9M3L6Mk7l5j5RRj1k4j7LJ5J4LkJJ1K7L3K1nl5n4n9m0pK0K8J5
$$ -84 -48 -17 -5 -13 -27 -30 -22 -19 -28 -39 -35 -6 37 73 77 50 15 0 9 18 7 -17 -34 -31 -16 -2 1 -1 0 11 38 71 92 87 52 -2 -61 -101 -108 -88 -60 -45
11899d5oj9k1j5j3j1j0mKJ1K6M7N6M2J8KOJ4Rj2l1k8rJ0J3jj0kJ6K6J4j1k6j7PK8L0J7jj1
$$ -45 -51 -70 -91 -106 -119 -130 -140 -144 -142 -131 -105 -58 -2 40 58 60 66 80 89 77 46 18 9 19 32 31 21 19 35 61 75 64 38 21 28 56 86 103 102 91
11882I1oOJ0nk6m1l8k4mJ6K9K8J2mj0pqj3oPJ7Oj3k5k7k5k0nK3M2L7J4jMJ4Kk5l2qK6L2Ok2
$$ 91 85 91 101 96 70 29 -9 -33 -37 -21 8 36 48 44 34 27 19 6 0 7 24 30 17 -8 -35 -60 -80 -85 -62 -20 17 31 30 34 48 50 25 -7 -15 11 43 49 27
11863B7k9j9nMKrk5l1l1l3l9l5j9k%noPK3L6M2L6K3J7K4L0K7K4K6K8J7kj4j4j0plK%j2k4k8
$$ 27 -2 -21 -26 -22 -20 -29 -54 -85 -116 -149 -188 -223 -242 -244 -244 -249 -255 -248 -225 -189 -147 -111 -88 -71 -47 -17 10 34 60 88 105 103 89 75 65 58 55 57 57 45 21 -7
11845gk5j9rJJ3K5L6L2Rj7k6j3JJ3K1K9K7J5KmopjJ3J9Pj5k7k3qRK0Rk0n1n9m7k7j1lKMMO
$$ -7 -32 -51 -60 -59 -46 -21 15 47 56 39 13 0 1 14 35 64 91 106 108 104 98 91 90 103 122 129 114 87 64 56 65 85 94 74 23 -36 -83 -110 -121 -124 -122 -118 -114 -108
11826a08Pkj1rLJ2RMRK0K9K6J7J0J0J3J0kk1l0k2KK7L8L1J6POQRKj2k8l6l0j5jJ2K6K9J7k
$$ -108 -101 -103 -114 -123 -120 -108 -99 -95 -86 -66 -37 -11 6 16 26 39 49 47 26 -4 -26 -24 3 41 72 88 95 101 109 118 120 108 80 44 14 -1 -2 10 36 65 82 80
11808H0j0jMql4n6o5n6l5j1MJ5L1N2O3M6K0Klj0j8j4jJ0J7J4J1lj8k3pJ1K5K4K1K2L2M0K6
$$ 80 70 69 73 65 31 -25 -90 -146 -181 -192 -188 -173 -142 -90 -27 19 39 41 38 28 10 -4 -5 5 22 36 47 44 26 3 -4 7 32 56 77 99 131 171 197
11791A97rl9m2k1mjNK2L3K4J0Mjj6l0k2KJ7J2Llj1k8m3m8m5m0k3QK9K9J8J5K4K2OrpJ0K5L1
$$ 197 188 149 107 86 82 81 86 108 141 165 175 179 178 162 132 110 112 129 141 144 141 130 102 59 11 -34 -74 -97 -89 -60 -31 -13 2 26 48 54 45 38 48 73 104
11773A04K5J0mj3k2l7n0m6k5mjj1j5nJ3L1M4M2K8NqnONj5l5l7k5nOPMK%mjPJ3J4J6L0M1L6
$$ 104 129 139 135 122 100 63 13 -33 -58 -62 -63 -74 -89 -94 -81 -50 -6 36 64 69 61 56 62 67 52 17 -20 -45 -50 -44 -37 -33 -31 -31 -35 -36 -29 -16 -2 14 44 85 121
11754A21J5%oj3l2m5l7j4joj8k0j3JJ1J6J3PMlj5k5k1mRRPJ4K3K3J5Ojj3k4l2l3l1k7j2J1
$$ 121 136 136 130 117 85 40 3 -11 -12 -18 -36 -56 -69 -68 -57 -41 -28 -21 -17 -20 -35 -60 -81 -85 -76 -67 -60 -46 -23 0 15 21 20 7 -17 -49 -82 -113 -140 -152 -141
11737a41K8K7K2K7L7L3K1J4K1K9K4Ppk2l8m3k6LJ5Mj1rOJ5J4J2RMJLjj7l3k7kJ8K8K8K8K4
$$ -141 -113 -86 -64 -37 0 33 54 68 89 118 142 149 142 120 82 39 13 16 31 35 24 15 21 36 50 62 71 75 76 79 78 61 28 1 -1 17 45 73 101 125
11719A25J5PKj0k3k3%K0J8kj0qj2k6k9j5qj8k6j3J2K4K0J6J8J5MLJ3K1J1nj2pqj2nJ6L3K3
$$ 125 140 147 149 139 116 93 93 113 131 129 119 111 99 73 44 29 21 3 -23 -36 -24 0 20 36 54 69 73 76 89 110 121 116 104 97 89 77 72 88 121 144
11702A44jk3l0l1k5j0QK2K6K4J9Qoj6j7j3rqj3k1k3j2jPQJ1J4J2PMLJkNJ5J9J6J2J0jj7j7
$$ 144 143 120 90 59 34 24 32 54 80 104 123 131 125 109 92 79 70 62 49 28 5 -7 -8 -1 7 18 32 44 51 55 58 59 57 62 77 96 112 124 134 133 116 99
11684I9PK5J4j5l0k0mLLKlnLJ3J1lj5j1k%lMJ0Mj2k2j8j1oLJ5K1J3%lJQRNkj3k3l1l3l5k9
$$ 99 106 131 145 130 100 80 76 79 82 84 81 76 79 92 103 100 85 74 72 72 69 73 83 87 75 53 35 24 18 21 36 57 70 70 67 68 76 85 90 88 75 52 21 -12 -47 -76
11664g6j8pk%J3L3M4L8K5K1J8Nj3j4mql6o0n0j2K1K5J1nr%J3J8QkKJ8K6J9Pnj5k2k0j1mnK
$$ -76 -94 -101 -103 -103 -90 -57 -13 25 50 71 89 94 81 67 63 55 19 -41 -91 -103 -82 -57 -46 -51 -60 -60 -47 -29 -21 -23 -21 -3 23 42 49 44 29 7 -13 -24 -28 -33 -31
11645c1J8K6J7KPK3K2ll3m6l9k5rMQQJ0J4Nj2j4J1M6O0M3J1omLJj8l7l6qK2K8Oj5j4NK6L7
$$ -31 -13 13 30 32 39 62 84 81 48 2 -37 -62 -71 -67 -59 -51 -41 -27 -22 -34 -48 -37 9 69 112 123 117 113 116 117 99 62 26 18 40 68 74 59 45 50 76 113
11627A13M3M3M0K7Jl4n8n8l7k3k9l6k4KJ8J1%MJ9K1J2PJ0J1Mmpm%NJ2J5Kk7n0m2pK7L3Qj9
$$ 113 156 199 239 266 267 233 175 117 80 57 28 -8 -32 -30 -12 -1 -1 3 22 43 55 62 72 83 87 83 76 72 72 77 89 104 106 79 29 -13 -20 7 40 48 29
11609B9k9k7k0j2MJ2Jj6j7RL2K6KpLQj4l8k9J0M2L7J7OJ0Oj3l0k7j0OJ8K3K1Jk2k5oJ6K6K4
$$ 29 0 -27 -47 -59 -55 -43 -42 -58 -75 -66 -34 -8 -6 -13 -10 -2 -16 -54 -83 -73 -31 6 23 29 39 45 32 2 -25 -35 -29 -11 12 33 34 12 -13 -19 -3 23 47
11591D7K3K3K3J4mj9k4j7j0rrJJ6K2J4lj8j8kK2L5K6OrrnjOJ4J2jj1j5oMJ4J2ok9l6k8j8j9
$$ 47 70 93 116 130 126 107 83 66 56 47 38 39 55 77 91 88 70 52 50 72 107 133 139 130 121 116 115 121 135 147 146 135 120 114 118 132 144 138 109 73 45 27 8
11573Hj9j5j0j5j9j0J1K4K4J6J1J3J4J5J4J2QKjj%%oj7k3j3KPmj7j3JQJj3j9j1mj1k4k0KK0
$$ 8 -11 -26 -36 -51 -70 -80 -69 -45 -21 -5 6 19 33 48 62 74 82 84 83 82 82 82 76 59 36 23 25 32 28 11 -2 -1 7 8 -5 -24 -35 -39 -50 -74 -94 -92 -72
11554g2J8MnjPJ4K1K0Rj0j5kJ0Lk2m1l5j5KMKJ3K9L7K5LoJJ1Qrk4j8J0L5L4Mk7l7k4lJ3K2
$$ -72 -54 -50 -55 -56 -49 -35 -14 6 15 5 -10 -12 -2 1 -21 -62 -97 -112 -110 -106 -104 -91 -62 -25 0 3 -3 -2 9 17 8 -16 -34 -24 11 45 49 22 -15 -39 -42 -29 -7
11535gJ9Rjkjoj2j1jOPQJ3J1%omJkj2j8k4k8k4j0J0K6L0J7j0l5l9k1kjj1j7j3oOJ9K6J8PJ0
$$ -7 12 21 20 18 17 11 -1 -12 -13 -7 0 8 21 32 32 26 22 23 21 9 -9 -33 -61 -85 -95 -85 -59 -29 -12 -22 -57 -96 -117 -119 -120 -131 -148 -161 -167 -161 -142 -116 -98 -91 -81
11516h1K7M4M5L4K3J8J7Pqj6rKmk4l4j6QOj4k2qKkj4j7r%J1K4K6J7QJ3J9J3mj8k6l3l6l9m0
$$ -81 -54 -10 35 69 92 110 127 134 126 110 101 103 99 75 41 25 33 39 25 3 -5 -3 -5 -19 -36 -45 -45 -34 -10 16 33 41 54 73 86 82 64 38 5 -31 -70 -110
11498a10m3l9j5J1K2J7J3J4J0MRK7L4K0MRK4L3K4J6J2J1J0J0Oqk4k6j5jPJ6K2J2j0k7k1JJ4
$$ -110 -153 -192 -207 -196 -174 -157 -144 -130 -120 -116 -107 -80 -46 -26 -22 -13 11 44 68 84 96 107 117 127 133 125 101 75 60 59 66 82 104 116 106 79 58 59 73
11481G3Lk9n6n7k6J5L4L0J6J4Qlj7j5oMJ0PKpj0jJ1J5Nmokkmnm%Ljj1qQK0Pk4m1k7MK2K0J2
$$ 73 76 47 -9 -66 -92 -77 -43 -13 3 17 25 22 5 -10 -16 -12 -2 5 7 0 -10 -11 0 15 20 16 10 8 6 2 -3 -7 -7 -4 -5 -16 -24 -16 4 11 -13 -54 -81 -77 -55 -35 -23
11460b3N%mrj0rjOONQJ1PJKJ2K0J4QJ3K2K0Prk2l4l8k8j3kkJJ1J9J7J3J0Pnk4l4k8qRJ4J5
$$ -23 -18 -18 -22 -31 -41 -50 -51 -45 -39 -34 -26 -15 -8 -7 -5 7 27 41 49 62 84 104 111 102 80 46 8 -20 -33 -35 -37 -36 -25 -6 11 24 34 41 36 12 -22 -50 -58 -49 -35 -20
11441b0K1L2L0J2j6l2l2k3j3pLK3M9O6O0M0K2J2Mrk7m0l7j9LPpk3j6knk6l7k7qjmrj3k0j8
$$ -20 1 33 63 75 59 27 -5 -28 -41 -48 -45 -22 27 93 153 193 215 227 231 222 195 155 118 99 102 109 102 79 63 61 56 30 -7 -34 -42 -43 -47 -56 -69 -89 -107
11423a07%J9K0J1J0J5J1LJ1L0L4Nk7l5k0nnrlJ2K1Rqj1OK5K9J7P%pj1JJ9K0%j7j7o%JJMLQ
$$ -107 -107 -88 -68 -57 -47 -32 -21 -18 -7 23 57 62 35 0 -20 -25 -30 -39 -42 -30 -9 0 -8 -19 -13 12 41 58 65 65 58 47 48 67 87 87 70 53 47 47 48 49 53 56 64
11403F4J3J5Mj5l3l9k7JL1L3Lk3j6J5L6L0J1pk3l4l2k0q%Llj2j5%K2L2K6J2Kmrj0njlqo%O
$$ 64 77 92 96 81 48 9 -18 -17 14 47 50 27 11 26 62 92 103 96 73 39 7 -13 -21 -21 -18 -21 -33 -48 -48 -26 6 32 44 46 42 33 23 18 17 14 6 0 0 6
11384FLk%J0J4Mj2k2j6oJ1K6M0M6M6L8J6j4l4k7lNj3l5l7k6j8k1k5k7k3j0J8L9L3Oj2qjqk2
$$ 6 9 7 7 17 31 35 23 1 -15 -21 -10 16 56 102 148 186 202 188 154 127 124 129 116 81 44 18 0 -21 -46 -73 -96 -106 -88 -49 -16 -10 -22 -30 -31 -39 -61
11366f1k8k2j1%J8L3M0L1J4rk0j5QK6K5J1MNNnk0l0l3k6j5o%MJ4K9L4K2%j4qLJ9L6N2N2L6
$$ -61 -89 -111 -122 -122 -104 -71 -31 0 14 5 -15 -30 -22 4 29 40 44 49 54 49 29 -1 -34 -60 -75 -81 -81 -77 -63 -34 0 22 22 8 0 3 22 58 110 162 198
11349A98J5Loj9l3l2j8qqqjkj2j5lJ2J0%qj2k7l3k2%QLLJ5J2mrLJ3jj5nJ9K9J8J2K0K4J2l
$$ 198 213 216 210 191 158 126 108 100 92 84 83 81 69 54 51 63 73 73 65 53 26 -7 -29 -29 -21 -18 -15 0 12 8 -1 2 15 14 -1 -6 13 42 60 72 92 116 128 125
11330A25j0j2j6j5oNPMJkj5k8k8j5qrj3pPK8M6N5M1J0k3l8l7l0k1qONj5l1k7rjpj7k0j7rJ3
$$ 125 115 103 87 72 66 71 78 82 83 81 66 38 10 -5 -13 -22 -35 -42 -35 -7 39 94 135 145 122 84 47 17 -4 -12 -6 -1 -16 -47 -74 -83 -84 -91 -108 -128 -145 -154 -141
11311a41M2O2N9M0K4J7J6J4J3J4J3Jj5l1l3k6j6j1rn%NOJ1J9K6K6K0J3J1J2Rmk1k6j1OLj2
$$ -141 -99 -37 22 62 86 103 119 133 146 160 173 174 159 128 95 69 53 42 33 28 28 33 39 50 69 95 121 141 154 165 177 186 182 161 135 124 130 133 121
11294A21j2NJ1nk5k6j7j2nJ2K8K1ok0j2nj3k1j2NLj1j9j2JRJ2J2J5J7K2K5J7kj8k5k2j5%J9
$$ 121 109 114 125 120 95 69 52 40 35 47 75 96 90 70 58 53 40 19 7 12 15 4 -15 -27 -26 -17 -5 7 22 39 61 86 103 101 83 58 36 21 21 40
11277D0L1K1kk5l5l5l5k9j1J8M2M2K6OlJJrk0k0qpj6k1oJ5K5K5L3M2L8J2j6l2l7l7k3jJ2J3
$$ 40 71 92 90 65 30 -5 -40 -69 -80 -62 -20 22 48 54 51 52 53 44 24 4 -4 -11 -27 -48 -54 -39 -14 11 44 86 124 136 120 88 51 14 -9 -10 2 15
11259A5RK1L3L0J0nplmoprj1pj%KJ0J6Pj6l5l7k2kJ5J2ok1j4RJ7PJ0L1M3K0k5n2m5k7rJJ3
$$ 15 24 45 78 108 118 113 106 103 99 93 86 77 66 59 58 58 60 70 86 93 77 42 5 -17 -19 -4 8 2 -19 -33 -24 -7 0 10 41 84 104 79 27 -18 -45 -54 -53 -40
11240d0K1K9L5K8J1qj3oKLlk0l4k6%J9J2poJ1K1J1LJ8L6L0%k5k4rJlj1j6oQJ9K0J7J0ok8m7
$$ -40 -19 10 45 73 84 76 63 57 59 62 59 39 5 -21 -21 -2 10 3 -3 8 29 40 43 61 97 127 127 102 78 69 70 67 56 40 34 42 61 81 98 108 102 74 27
11222B7n1l6j0J3K4K2K1K3J8%j5kL0M8K7j2l4k7j5j1rqj2j9k4j6kJ1K0J9RKPJ5J2lqKRjj1
$$ 27 -24 -60 -70 -57 -33 -11 10 33 51 51 36 34 64 112 139 127 93 66 51 40 31 23 11 -8 -32 -48 -50 -39 -19 0 9 11 18 33 45 42 34 36 45 44 33
11204C3mROj2k3j8j3j2jK4M2L9J5lqn%PJ5J7Rj1l6m7l3qOjrJJ8K0Rnj0j0pqj1j8j7lJ0J0P
$$ 33 29 38 44 32 9 -9 -22 -34 -35 -11 31 70 85 82 74 69 69 76 91 108 117 106 70 23 -10 -18 -12 -13 -22 -21 -3 17 26 21 11 1 -6 -14 -25 -43 -60 -63 -53 -43 -36
11184c6J5K4J8pj4OK8K8J1mj7l1l3j8KJ2J6K2K1QnLJ8J5nj6lOql2l7j8NJ5RJlJOQOPROlok
$$ -36 -21 3 21 14 0 6 34 62 73 69 52 21 -12 -30 -28 -16 0 22 43 51 46 49 67 82 77 61 58 64 56 24 -13 -31 -26 -11 -2 -1 -4 -3 3 11 17 24 33 39 36 30 28
11164B8PJ2Rql6n9n5k2J4L8M5M3L2Nk0l1k3j8j6j4nOJ5J6Mj3j8oQMj0j1OK0J8Qkj1k1k0%J6
$$ 28 35 47 56 48 12 -47 -102 -124 -110 -72 -27 16 48 53 33 2 -21 -39 -55 -69 -74 -68 -53 -37 -33 -46 -64 -70 -62 -58 -68 -79 -73 -53 -35 -27 -29 -40 -61 -81 -81 -65
11146f5Rj3j8LK5K9K1J5J6J3NJjlJNJj0j8pOJk1l9l4j8JK6N6O9N3K1nj3j1pqj0j2pLPkj3q
$$ -65 -56 -69 -87 -84 -59 -30 -9 6 22 35 40 41 40 37 38 43 44 34 16 9 15 16 -5 -44 -78 -96 -95 -69 -13 56 109 130 125 112 101 94 86 76 64 57 60 67 65 52 44
11126D4J0J7Jk2k9k1j1qoNJ5J3KpmJJlpjPRJ7K5K6J6Lmnqj1j4j2rLK2L3K8J0jlkorpj0k1l4
$$ 44 54 71 72 50 21 0 -11 -19 -25 -20 -5 8 10 3 -1 0 1 -2 -9 -10 -3 6 23 48 74 90 93 89 84 76 65 51 39 30 33 55 88 116 126 125 122 120 114 105 98 88 67 33
11105C3m1l8k2mPRJ0K0L0K6Pppoj6k6k4jK4L4K8J4PJ4J8J1mnOJ3Mj1k0k4l4m0l4j1OJ1Loq
$$ 33 -8 -46 -68 -72 -65 -56 -46 -26 4 30 37 30 23 17 1 -25 -49 -50 -26 8 36 50 57 71 89 100 96 91 97 110 114 103 83 59 25 -15 -49 -60 -54 -43 -40 -46 -54
11087e4JJ6K4K1J0krqjPRLKKqk8l9k1RK0J1LORKqj0j0oMJ8K5J1rj8j9j8k0j6%K1L2L0K1J4
$$ -54 -53 -37 -13 8 18 16 7 -1 -2 5 14 17 19 21 13 -15 -54 -75 -66 -46 -35 -32 -26 -17 -15 -23 -33 -43 -49 -45 -27 -2 9 0 -18 -37 -55 -75 -91 -91 -70 -38 -8 13 27
11067B7J2J2J4J1Mlnoqj2j1nlj0j7k2j8j2%J8L1K0lk0j1J1K7K8K0Rkrj4j5j7j6pLQ%j1j9j5
$$ 27 39 51 65 76 80 77 72 66 58 46 35 30 27 17 0 -22 -40 -52 -52 -34 -3 17 14 -6 -17 -6 21 49 69 78 76 67 53 38 21 5 -2 1 9 9 -2 -21 -36
11049c6kJ3K5L1K8J9Lj4k7l1k0p%j0k7k9j0J1J3OJ2L2L8K6J3J4J3ok6k5rlj4k0j5oNK6M6N0
$$ -36 -38 -25 0 31 59 78 81 67 40 9 -11 -18 -18 -28 -55 -84 -94 -83 -70 -64 -52 -20 18 44 57 71 84 78 52 27 18 15 1 -19 -34 -40 -35 -9 37 87
11031H7K9Mj0j7j7oPMj8l2k3nkqj0mnj0j0%RJ0J1J0OLKQRnk7m0l3j1RRoj9j5%J1J4J3Rkj6
$$ 87 116 120 110 93 76 70 77 81 63 31 8 3 1 -7 -17 -21 -26 -36 -46 -46 -37 -27 -16 -6 0 3 5 13 22 17 -10 -50 -83 -94 -85 -76 -82 -101 -116 -116 -105 -91 -78 -69 -71 -87
11011h7k4k1j1KJ6K7L2K6J0pj6j2jNLKNOJj1k1k2oJ5K3J3KQK0K1J1Mjj3k8k5jJ5QmOK6K5P
$$ -87 -111 -132 -143 -141 -125 -98 -66 -40 -30 -37 -53 -65 -66 -61 -58 -56 -51 -45 -44 -55 -76 -98 -104 -89 -66 -53 -51 -43 -23 -2 9 13 12 -1 -29 -54 -55 -40 -32 -36 -30 -4 21 28
10992B8onj%OJ5J1j0k8k9k0j9k3k2rJ2K7K7J5lqmNJ3K3K7K1Jj6j9j1mkoj0j2j2j1oJ2L0K9
$$ 28 22 17 16 16 22 37 48 38 10 -19 -39 -58 -81 -103 -112 -100 -73 -46 -31 -34 -42 -46 -41 -28 -5 22 43 44 28 9 -2 -6 -8 -14 -24 -36 -48 -59 -65 -53 -23 6
10974FPk2l4k7j7pJ1L4L5J1qJJ6J2j3k6j3RJ7Qj0k5k8j2J8M1M7M0K4Lk3m0m0l2k1j3jJ2J7
$$ 6 13 -9 -43 -70 -87 -94 -83 -49 -14 -3 -11 -10 6 18 5 -21 -34 -25 -8 0 -10 -35 -63 -75 -57 -16 31 71 95 98 75 35 -5 -37 -58 -71 -72 -60 -43
10957d3J5J0Qmk2l0j0J7K8J6LQJ9J7Jk0l0l2k4qPJ6J4%j5j5QM0N5M2J9Mpk6l9k6JJ8J3Mjq
$$ -43 -28 -18 -10 -14 -36 -66 -76 -59 -31 -15 -12 -4 15 32 33 13 -17 -49 -73 -81 -74 -58 -44 -44 -59 -74 -66 -26 29 71 90 94 87 61 22 -4 -3 15 28 32 31 23
10939B3k3k8j3OJ2OMRJ4J8J9J6PKPJ5J4Moj1j9l0l4k2lRMqj5nJ2J9J7J0RJ0J1ROmj5j6rj0
$$ 23 0 -28 -41 -35 -23 -17 -13 -4 10 28 47 63 70 72 79 94 108 112 106 95 76 46 12 -10 -13 -4 0 -8 -23 -28 -16 3 20 30 39 49 60 69 75 71 56 40 31 21
10920B1l1m8l4JK2J8RJ0Rmj6j4jJ0J3J5K0J9K1K1J3lj9k0j3j9l7n1l8j1J1K6L5L9L4K4J8J5
$$ 21 -10 -58 -92 -91 -69 -51 -42 -32 -23 -27 -43 -57 -58 -48 -35 -20 0 19 40 61 74 71 52 32 19 0 -37 -88 -126 -137 -126 -100 -65 -26 8 32 50 65
10903F5Lk1l9l2j4jmj8k9l0j8kJ0J3J6K7L8K8Jk1k2rkKJ1K2K4J8J0lj6j7%K5L6L1K3K0J1n
$$ 65 68 47 8 -24 -38 -39 -43 -61 -90 -120 -138 -140 -130 -117 -101 -74 -36 -8 -7 -28 -50 -59 -61 -59 -48 -26 -2 16 26 23 7 -10 -10 15 51 82 105 125 136 131
10886A31k1k7k6k2j6j4j6j6mJ8K2Lj5j2PJ7R%lqj1pJ1K9L2K1Qkj0j7j7j6j6j3JJ4J4pl1m0
$$ 131 110 83 57 35 19 5 -11 -27 -31 -13 9 12 -3 -15 -8 9 18 18 15 7 -4 -11 0 29 61 82 90 88 78 61 44 28 12 -1 0 14 28 21 -10 -50
10869e0l1j3PK0K2J3J2K3L4K4kk2k7k1j8j0jrk6l4k2oJJ0K7L3J2j5j8NK2J8J3K1L2K2qk8j8
$$ -50 -81 -94 -87 -67 -45 -32 -20 3 37 61 59 37 10 -11 -29 -39 -40 -49 -75 -109 -131 -137 -136 -126 -99 -66 -54 -69 -87 -82 -60 -42 -29 -8 24 46 38 10 -8
10852hJ1L7L2Pj2pPJ2Pjj2k6k6mK3K3Lq%Pmj6j4j2j7k1j3MJ9K7L2J5j8l3j1K0K1JlJ4K0Rj
$$ -8 3 40 72 79 67 60 67 79 86 85 73 47 21 17 40 63 66 58 58 65 61 45 31 19 2 -19 -32 -28 -9 18 50 65 47 14 3 23 44 45 42 56 76 85 84
10833H4kj0k6k5kJ5J1NJ8K9Qk9m1j4J7J9%j4rLQkj4j6oMKnmNJ4J3QOJ1J1QQJ2J4Jj9l1k5j3
$$ 84 82 72 46 21 19 34 45 50 68 97 105 76 35 21 38 57 57 43 34 37 45 43 29 13 7 11 13 8 4 9 23 36 44 50 61 72 80 88 100 114 115 96 65 40 27
10814B7j1j6j1QK5K2jk5l0j7KJ2RKjJ%nqrjJ2K4K6J4JKOLorlLPJ6K0Pj5k7j8j1k0k9k3nRJ1
$$ 27 16 0 -11 -3 22 44 43 18 -12 -29 -27 -15 -6 -4 -5 -4 -4 -9 -17 -26 -27 -15 9 35 49 50 52 58 61 55 46 43 46 53 69 89 96 81 54 36 25 5 -24 -47 -52 -43 -32
10793c2J3J9K3J7Mj5k7k3j4oomL%rj0NJ8J6J0J3J6J1%LJ6K5K8L0J9kj8oQom1n2k4OOmNK4K8
$$ -32 -19 0 23 40 44 29 2 -21 -35 -41 -47 -51 -48 -48 -57 -67 -62 -44 -28 -18 -5 11 22 22 25 41 66 94 124 143 141 123 117 125 119 78 26 2 8 14 10 15 39 67
10774F7J4%oqoLPnk5k5rMjj7k9k8j2QK5K7K0J6Nj0j6%K4K6Lj4nJ0J0J%ROj3l0k6pNlk5l9k4
$$ 67 81 81 75 67 61 64 71 66 41 16 7 11 10 -7 -36 -64 -76 -68 -43 -16 4 20 25 15 -1 -1 23 49 52 38 33 43 53 54 54 63 69 56 26 0 -7 -2 -5 -30 -69 -93
10754i3QL1L5L1L2L0J4j2k6k8k6l1l0j5JOKlloj2rKJ3J3J0J2K0K5J2mj4JK2K8J1rj6j2j4j7
$$ -93 -85 -54 -19 12 44 74 88 76 50 22 -4 -35 -65 -80 -79 -73 -71 -74 -77 -83 -95 -104 -102 -89 -76 -66 -54 -34 -9 3 -1 -15 -14 8 36 47 38 22 10 -4 -21
10737b1oJ4J8MrkOMnLK1K2mk5j9jLnj0njknrj6j5NL1M2L3J6QLoj6j2jJ1J3Lj3j6lRjk8l3j1
$$ -21 -27 -13 5 9 0 -2 4 8 3 6 27 49 45 20 1 0 3 -2 -12 -17 -18 -20 -25 -34 -50 -65 -60 -29 13 46 62 70 73 67 51 39 38 49 62 65 52 36 33 42 41 13 -20 -31
10716c1J0jk6l1j9j1j6j5lJ%PL1M5L3J2J2K4K8J8QMkj0pJ2L2L5J0l0o5p1m6kL3M1K5Jk2m0
$$ -31 -21 -22 -48 -79 -98 -109 -125 -140 -143 -142 -142 -135 -104 -59 -26 -14 -2 22 50 68 76 80 78 68 61 73 105 140 150 120 55 -16 -62 -64 -31 10 35 36 14 -26
10698b6m6l3%L5N0L2ll0l5j6OJ9J7J4J5K2K9K7K0J1RR%j8l9n3m1pL6O0M4Qj7j5JJ2J3Qjj5
$$ -26 -72 -105 -105 -70 -20 12 9 -21 -56 -72 -66 -47 -30 -16 -1 21 50 77 97 108 117 126 126 108 69 16 -25 -32 4 64 108 116 99 84 85 97 110 118 117 102
10681A02l6n4n8m5k5j1omRK9M1L5K3J8K3K8K3J2Kqk5m6n6m5j7MNMJ0K3K5J3ONPLOK0K8J5j1
$$ 102 66 12 -46 -91 -116 -127 -133 -137 -128 -99 -58 -23 0 18 41 69 92 104 106 98 73 27 -29 -74 -91 -87 -82 -78 -68 -45 -20 -7 -1 4 11 14 20 40 68 83 72
10663G2k2pJ3J8Mqp%Jpj1OL2M0J9j3l2l4k9k4j2lnk3l8l2j1MMmoonojJ8M0M7L0OmJRROM%j2
$$ 72 50 43 56 74 78 70 63 63 64 57 46 52 84 124 143 130 98 64 35 11 -1 -4 -9 -32 -70 -102 -113 -109 -105 -109 -115 -121 -126 -132 -133 -115 -75 -28 2 8 4 5 14 23 29 33 33 21
10642B1k2j6J0L4M0K7J4J2J3Nj0j3lN%j4j7j1j0j6j5JK2K8J7mk0k4j5oqk2l3l3j5J6M6N7M5
$$ 21 -1 -17 -7 27 67 94 108 120 133 138 128 115 112 117 117 103 86 75 65 49 34 35 57 85 102 98 78 54 39 33 25 3 -30 -63 -78 -62 -16 41 86
10626H6J9MPJ4J1Jnqj8k5j7OK0J2jmkqj8k0j4j2j9j9j0nj5k4j4J5L8L6K3J3J3J2M%LLrk6k8
$$ 86 105 109 116 130 141 142 137 129 111 86 69 75 95 107 106 102 100 92 74 54 40 28 9 -10 -20 -25 -40 -64 -78 -63 -25 11 34 47 60 72 76 76 79 82 73 47 19
10607A9rJ4K3J8J1J1J5J8J8Ok1m8n1l0rnrNL1M5L5J3jmpj3j4j4j5j9j8j2qj0j4j0LJ8K8L0
$$ 19 10 24 47 65 76 87 102 120 138 144 123 75 24 -6 -15 -20 -29 -24 7 52 87 100 99 95 88 75 61 47 32 13 -5 -17 -25 -35 -49 -59 -56 -38 -10 20
10590B0K3Oj6k5j7oKOJ3K2K0kk3k2jJ9J6Jj4k2l1l6k8nJ4K0J5J3J6K0K1J9J1nk3k7k4k1k3
$$ 20 43 49 33 8 -9 -15 -13 -7 6 28 48 46 23 1 0 19 35 36 22 0 -31 -67 -95 -100 -86 -66 -51 -38 -22 -2 19 38 49 44 21 -6 -30 -51 -74
10573g4k5j4QK8M5N3N1L2Pj0j4j3j4j3lJ6L0K4kl1l9k3rj4k8k0J0L2K0mj7j7rjJ1K0J0mj3
$$ -74 -99 -113 -105 -77 -32 21 72 104 111 101 87 74 60 47 44 60 90 114 112 81 42 19 10 -4 -32 -52 -42 -10 10 6 -11 -28 -37 -38 -27 -7 3 -1 -14
10556a4n%MJ8M0M4K1mqqj8l4l1j5pqlJ1K3K7L1L2K8J6J0QMpj5j7j8j6oJ4K4J7JqrpJNkj8k8
$$ -14 -19 -19 -15 3 43 87 108 104 96 88 70 36 5 -10 -17 -25 -28 -17 6 33 64 96 124 140 150 158 162 155 140 123 105 89 83 97 121 138 139 131 122 115 116 121 119 101 73
10536G3k4j3qkJ2K6K4J0Kjoj9k9l4l1k6j4LJ5J8J5Oj%NJ0PMMJj2l2l7j6J7M3M2K4mk5l0k6
$$ 73 49 36 28 26 38 64 88 98 100 99 93 74 45 11 -20 -46 -60 -57 -42 -24 -9 -3 -4 -4 1 11 18 22 26 27 15 -17 -54 -70 -53 -10 32 56 52 27 -3 -29
10518b9k0j0KJ8K9L5L4K2jk5m0l9k9j2NJ4J3J1J0Onj2pkj2k3j2J3K1Oj1j2MK1L9M8L1kk2j5
$$ -29 -49 -59 -57 -39 -10 25 59 81 80 55 15 -24 -53 -65 -60 -46 -33 -22 -12 -6 -11 -23 -30 -32 -44 -67 -79 -66 -45 -39 -50 -62 -58 -37 2 50 81 79 57 42
10501D2nj3k3rJ8L8L5L1L0J6j6m5n0m0k7j7LK2K7J8O%nj1j2%RMrj3mMmk1k7k0j0%J1J7Qpl
$$ 42 37 24 1 -8 10 48 83 114 144 160 144 99 49 9 -18 -35 -32 -10 17 35 41 41 36 25 13 13 22 26 17 4 0 4 0 -21 -48 -68 -78 -78 -67 -50 -42 -49 -52
10482e2K0L4K1mj2lLjrj3j4rjLklJ0L2L8K9J4ONJ1K4L2J4k0m4m5l5l2l4k2JK5M2N2M2J4k1
$$ -52 -32 2 23 19 7 4 7 6 -3 -16 -30 -39 -40 -37 -39 -42 -32 0 38 67 81 87 92 103 127 159 173 153 109 64 29 -3 -37 -59 -58 -33 9 61 103 117 96
10464I6l7k8qK%llJNJ2K1K1Mk4k9rJ8K7K3K6L1J9qk4k1j4j2oOLj2j1J4M0L2Mj8k3k4k1j1j
$$ 96 59 31 23 25 25 22 19 20 25 37 58 79 83 59 30 21 39 66 89 115 146 165 157 133 112 98 86 80 86 89 77 66 80 120 152 156 138 115 91 70 59 58
10446E8ok1k4j3nlKJ3J7%k2k7j1J0K2J5MkNJ7K0J2MKkj4k3k1j0qj5l2l9k7JK1K0OMJ3J3lj4
$$ 58 52 31 7 -6 -11 -14 -12 1 18 18 -4 -31 -42 -32 -10 5 9 7 12 29 49 61 65 67 65 51 28 7 -3 -11 -26 -58 -97 -124 -123 -102 -82 -76 -72 -59 -46 -49 -63
10427f3qJ2K0J2lj3j4lOJj8k6oK5L9K9J0M%jNJ8K8K2Lj5j9j2mLNOjonjJqj9k0j7k0k4j7MK0
$$ -63 -71 -59 -39 -27 -30 -43 -57 -60 -54 -53 -71 -97 -103 -78 -39 -10 0 4 4 3 8 26 54 76 79 64 45 33 29 32 37 43 42 36 31 30 31 23 4 -16 -33 -53 -77 -94 -90 -70
10408g0J7Jo%J3K9L9L7J7rj9j8j1jJ2J8Lk2l2j7PJ9J6Jk0l1j9J0K5Pk1k4nJ1PJNJ6J7J5J4
$$ -70 -53 -52 -58 -58 -45 -16 23 60 77 68 49 31 20 19 31 49 52 30 -2 -19 -12 7 23 24 4 -27 -46 -36 -11 -4 -25 -49 -54 -43 -36 -35 -30 -14 3 18 32
10390C2J6J6J5J2Qmj8k6k3j2kkj2k4k6j4JJ1RJpmJ0K1K2Qnj6k9l5k2NK1K1J6K2K0Kj4mK7M3
$$ 32 48 64 79 91 99 95 77 51 28 16 14 12 0 -24 -50 -64 -63 -52 -43 -42 -49 -53 -43 -22 0 8 3 -13 -42 -77 -99 -94 -73 -52 -36 -14 6 8 -6 -10 17 60
10372F0K6PJ0J9Pj5j8mLjn%lk6l7j8J9L5K0krmKJkj0j5j6j2j0rqkLnj7k4j7%J9L0K6J4J3J8
$$ 60 86 93 103 122 129 114 96 92 95 94 89 89 86 60 23 5 24 59 79 77 68 64 66 67 65 55 40 24 12 2 -7 -15 -17 -14 -19 -36 -60 -77 -77 -58 -28 -2 12 25 43
10352D3K1J5J2K1K7J0k3m8m9l4j8lJ2J4NkOK0K6J8QM%k%NM%PJ8K0Nj3j7j3j1qPL0M0L3K0J2
$$ 43 64 79 91 112 139 149 126 78 29 -5 -23 -26 -14 0 5 3 9 29 55 73 81 85 85 83 83 88 92 92 99 117 137 142 129 112 99 88 80 87 117 157 190 210 222
10333B22pl7n4m2j2J0J9K9M1L3kl7m7l5k7k6k6j7pjMLoj2kJ9K4Nk5m2m5m1l2j0J7L2L0K3K0
$$ 222 215 178 124 82 70 80 99 128 169 202 200 163 116 81 54 28 2 -15 -22 -23 -19 -16 -22 -34 -36 -17 7 12 -13 -55 -100 -141 -173 -183 -166 -134 -104 -81 -61
10316f1K0J9K1K5K6J3lrkJ0J6Roj5j4ppj4k0j8j5j3qLJ3J3Mrj7j8pQJ7Qqj4lJ3K0K4K1J2l
$$ -61 -41 -22 -1 24 50 63 60 51 49 59 75 84 78 63 49 42 35 21 1 -17 -32 -45 -53 -50 -37 -24 -20 -29 -46 -64 -71 -63 -46 -38 -46 -60 -63 -50 -30 -6 15 27 24
10298B4oJ2L6L7Pk7l3rK1K5Mk1k5qOKj5k2j3JJ4K4K7K1J1OQRnk0k2j1qj7j8JK3K5Oj5k4k5
$$ 24 18 30 66 103 110 83 50 41 62 87 91 70 45 37 43 45 30 8 -5 -4 10 34 61 82 93 99 107 116 111 91 69 58 50 33 15 16 39 64 70 55 31 6
10280Fj7kJ3J9J5J0Olj6j9rmj4k1j1J1K3K2K0J2mj8j7jPmj7k0j0lKOJ0RRJ4J7Qpj8j3pnj0
$$ 6 -11 -13 0 19 34 44 50 47 31 12 3 -1 -15 -36 -47 -36 -13 9 29 41 37 19 2 1 8 4 -13 -33 -43 -46 -44 -38 -28 -19 -10 4 21 29 22 4 -9 -16 -21 -31
10261c1j0KJ7K3J7NLJ3J9J7J0OPMmj1j0j0j9k6k2rMNQJ5K4K7J8J0JnroNJ3Rkj4j9k1k1j3k
$$ -31 -41 -39 -22 1 18 23 26 39 58 75 85 91 98 102 98 87 77 67 48 22 0 -9 -5 0 8 23 47 74 92 102 103 98 89 83 88 101 110 108 94 75 54 33 20 18
10241A8NLnj0rjJ3K0J1jqnpj8k9l1j6NK0K3J6LoppoKJ0J0nj5pJ4K6K2J5J3Rlj0kJ6K2Nk2l4
$$ 18 23 26 21 11 2 1 14 34 45 44 36 31 24 6 -23 -54 -70 -65 -45 -22 -6 -3 -9 -16 -23 -29 -27 -17 -7 -12 -27 -34 -20 6 28 43 56 65 62 52 50 66 88 93 71 37
10222C7k1mkj3k4j9oKNQRLmJJ4J8J1KNJ5J9J5Qkj4k6k5j2lpj3qOJ6J4J0J2J6J3NMPKj4k4j6
$$ 37 16 12 10 -3 -27 -46 -52 -50 -45 -37 -28 -25 -29 -28 -14 4 15 17 22 37 56 71 79 77 63 37 12 0 -3 -10 -23 -31 -25 -9 5 15 27 43 56 61 65 72 74 60 36 20
10202B0MJ4Q%MJ5J8J4PJnj5j5oPJ4J0OKqk5l4k7j3rj4pJ8L3K3lk2k8l2k7mK7L8K2NLJ0J4J4
$$ 20 24 38 46 46 50 65 83 97 104 105 100 85 70 64 71 85 95 101 103 95 70 36 9 -4 -13 -27 -34 -16 17 40 37 15 -13 -45 -72 -76 -49 -11 11 16 19 29 43 57
10183E7J7J2mk2k6j9j3pNJ8J7jj8j4JRJ0RQNJjnj7k6j5J4L7L4J0j4k7k9k5j8pLNLJLOPM%m
$$ 57 74 86 82 60 34 15 2 -5 0 18 35 34 16 2 3 12 22 31 39 44 45 44 39 22 -4 -19 -5 32 66 76 62 35 6 -19 -37 -44 -41 -36 -33 -32 -29 -23 -16 -12 -12 -16
10163a6mlkKRJ0Krj7k0j9j3JJ9L0L1K9K9K0%j9k5k3k4k2mK2L1J4j3k6k4rJ2L2M0K8J0JJNP
$$ -16 -20 -23 -25 -23 -14 -4 -2 -11 -28 -48 -67 -80 -79 -60 -30 1 30 59 79 79 60 35 12 -12 -34 -38 -16 15 29 16 -10 -34 -43 -31 1 41 69 79 80 81 86 93
10144I3PNLJ1K6K9Rk0l4k8j8j6j9j9k0k3l1l1k1jJ8K5J9J3RKqqQK2J2j4k5oJ7J7Jj6k7l0j6
$$ 93 100 105 108 119 145 174 183 163 129 101 83 67 48 29 9 -14 -45 -76 -97 -98 -80 -55 -36 -23 -14 -12 -20 -28 -20 2 14 0 -25 -31 -14 3 4 -12 -39 -69 -85
10127h5K3N9O2L7J3J1Rj6n0o1m0j3OK1L4L7K3Nnorj6k0j8j0%J2K0J7QJmj3k5k9k2j1jPPjj3
$$ -85 -62 -3 59 96 109 120 129 113 63 2 -38 -51 -45 -24 10 47 70 75 70 64 55 39 19 1 -9 -9 3 23 40 48 49 45 32 7 -22 -44 -55 -56 -49 -42 -43 -56
10108e6j6qk%J4L8M9L3lk3k2j0nLJ6L1L7K7Pj5l4l7k6j4j0rlJ0K4L4L0J6lj5j8j5qjMKl%J1
$$ -56 -72 -80 -82 -82 -68 -30 19 52 49 26 4 -6 -11 -8 8 39 76 103 110 95 61 24 -2 -16 -26 -35 -38 -28 -4 30 60 76 73 58 40 25 17 16 20 22 19 19 30
10090C0J9J4KjMQJ0RPnk3l6l2j8qrj1oLMpk1k8j9KK6L5J9qk1j2QK5L2K9J6lj5j8j6k0j8lJ3
$$ 30 49 63 65 64 68 76 86 95 102 97 74 38 6 -12 -20 -29 -40 -46 -43 -39 -46 -67 -95 -114 -112 -86 -51 -32 -40 -61 -73 -65 -40 -8 21 37 34 19 1 -15 -35 -53 -56 -43
10071d3K1K8M2M5K0j8l3j8%MKPJ1NkmKQJ5J5ml4m8l2mRJ2K1K9K4NrmMJ0J6K2J9Mj0j5j1j4
$$ -43 -22 6 48 93 113 95 62 44 44 48 50 57 68 73 71 67 69 77 92 107 103 69 21 -11 -15 -6 6 27 56 80 85 76 72 76 86 102 124 143 147 137 122 111 97
10052I7k0k5k2j4lJ0J6Pj2k5k0oMMjjpj8k5mL2M9L5J5J2K2K0J0RJ3Qj0k1j9j1roJMmrjQjk2
$$ 97 77 52 30 16 13 23 39 46 34 9 -11 -17 -13 -9 -10 -11 -18 -36 -61 -65 -33 16 51 66 78 100 120 130 139 152 160 150 129 110 99 90 84 85 89 85 76 75 83 82 60
10033F0l4j8J5L7L5Rk0l1k5j0KJ1J4Jk9n0l7J1N2N2K5JjLlpMK5L4K4QK%j1k3k1oOOqj8j8q
$$ 60 26 8 23 60 95 104 84 53 28 18 20 31 45 46 17 -33 -70 -59 -7 45 70 71 70 73 70 63 67 92 126 150 158 160 160 149 126 105 99 105 111 103 85 67 59
10014E9ORjj5k0j4plKJ3K4K0Lj8k6j8nNJ3K1K4J2j0k1j5pj1k1k2j3lQK0J8rm6n8l4nQONLn
$$ 59 65 74 73 58 38 24 17 14 16 29 53 73 76 58 32 14 9 14 27 48 72 84 74 53 38 31 20 -1 -23 -36 -39 -31 -11 7 -2 -48 -106 -140 -145 -137 -131 -126 -123 -128
9995a28j2j0omLK4M8N3L5J3llRK3J8ok8k4kJ1J1OJ0J2OkmKRJ0kk1l2k6oJ1J3J0Noj6j5mQJ0
$$ -128 -140 -150 -156 -160 -157 -133 -85 -32 3 16 13 10 19 42 60 54 26 2 0 11 22 28 38 50 56 54 50 52 61 71 69 48 16 -10 -16 -5 8 18 23 17 1 -14 -18 -10 0
9975@OKLLOPMjl%KJKQJ6J9J2JqoOJ7J4Omrj8k3j9nnj8l1k6j0jjKNMkmNJ2RJ%LMLJ0K4K9J4
$$ 0 6 8 11 14 20 27 31 30 27 27 29 30 32 40 56 75 87 88 80 74 80 97 111 117 113 104 86 63 44 39 34 16 -15 -41 -51 -52 -53 -51 -46 -42 -44 -48 -43 -31 -22 -21 -21 -18 -14 -11 -1 23 52 66
9952F6qj4%J9K4J8Qnk8n3o0m6k6k1k6j4J6M4M6L2K2J6J0rk6l2k8j9j1MJ8K6K8K5J5kk5l6k3
$$ 66 58 44 44 63 87 105 113 108 80 27 -33 -79 -105 -126 -152 -166 -150 -106 -60 -28 -6 10 20 11 -15 -47 -75 -94 -105 -101 -83 -57 -29 -4 11 9 -16 -52 -75
9935g5lJj0j5lJ3K1J9K3L2L5K0Jj1j4j8k4k8j1J7L7L2Mk3k5nJ5K0Jk4l7l0rJ4K3J8PPJ8K5
$$ -75 -78 -77 -87 -102 -105 -92 -71 -52 -29 3 38 58 59 48 34 16 -8 -36 -47 -30 7 39 43 20 -5 -10 5 25 26 2 -35 -65 -74 -60 -37 -19 -12 -5 13 38
9918C8J3j3k7k0mQNkrj0mOJ2J2R%j3k4k4rKnj5j9j4j4rOK4K6J1KJ1K4K8K5K3J7jk1k8j5MJ2
$$ 38 51 38 11 -9 -13 -5 0 -2 -11 -21 -25 -19 -7 5 14 14 1 -23 -47 -56 -54 -59 -74 -93 -107 -121 -130 -124 -100 -74 -63 -61 -50 -26 2 27 50 67 66 45 17 2 6 18
9899A8Roj7k2k4k5k1mJ5J9QJ0L2N2M4J2qrmpj8k3k4j6nQJ2PjlLJ7K9K3nl7m4k9j3rmJ8M2N0
$$ 18 27 21 4 -18 -42 -67 -88 -92 -77 -58 -50 -40 -8 44 88 100 92 83 79 72 54 31 7 -9 -14 -6 6 13 12 9 12 29 58 81 76 39 -5 -34 -47 -56 -60 -42 0 50
9880E0L3Qj2k5l1k5j2KLmqmMQPJk%Jnj7k4j8oOJ2J5J9K1J5Jj3k5k1qK%j6k2j1PJ5J0QJ6J9
$$ 50 83 91 79 54 23 -2 -14 -12 -9 -13 -21 -25 -21 -13 -6 -5 -7 -7 -6 -11 -28 -52 -70 -76 -70 -58 -43 -24 -3 12 13 0 -25 -46 -54 -52 -52 -68 -90 -101 -94 -79 -69 -61 -45 -26
9860b6RmnJJnnlj0k0j7MK5K9K0J3Ppk1j3K0M9M9J9j4k9l4l5l8l0j7mklnlNJ6L0L5K6PmKJ4
$$ -26 -17 -21 -26 -25 -24 -29 -34 -37 -47 -67 -84 -80 -55 -26 -6 7 14 7 -14 -27 -7 42 91 110 96 67 33 -2 -40 -70 -87 -91 -93 -96 -101 -104 -99 -83 -53 -18 8 15 11 13 27
9840B7J0j2l6m4l1j4kMJ3K0J6MjPJ6J3QJ3K4K4J1K%kpqjPQRJ4J5Lj4k6k5j7oJ3L1L8K5jk8
$$ 27 37 25 -11 -55 -86 -100 -102 -98 -85 -65 -49 -45 -46 -39 -23 -10 -2 11 35 59 70 72 72 70 63 55 54 61 69 78 92 107 110 96 70 45 28 22 35 66 104 129 128 100
9821A00m3l8k1qmoprj9l3l3j2J6K7K1J2J8K8K5Qj0j4j0pm%%orOK9L6K0lj3j6k0k0rJ1J6kk3
$$ 100 57 19 -2 -10 -14 -20 -27 -36 -55 -88 -121 -133 -117 -90 -69 -57 -39 -11 14 22 12 -2 -12 -19 -23 -23 -23 -29 -38 -32 -3 33 53 50 37 21 1 -19 -28 -17 -1 -3 -26
9802b6l3k4pJ3L1L5K2PNK2M0L6J0j4k0j8k3l7m0l0j8k2l3l1j1OJ1RJ2J9J8J0PJ6K7K8J8J8
$$ -26 -59 -83 -90 -77 -46 -11 11 18 23 45 85 121 131 117 97 79 56 19 -21 -51 -69 -91 -124 -155 -166 -160 -149 -140 -128 -109 -91 -81 -74 -58 -31 -3 15 33
9786C3K4K9J8JrojPJ5J7Mj4k0j3mKJ0K4L2K9J5jj9k8k3j5j9l0k9qLnj8j4mNJ3L0L9K8J0NN
$$ 33 57 86 104 105 96 90 89 96 111 128 132 118 98 85 81 83 93 117 149 178 193 192 173 145 122 107 88 58 29 21 24 19 1 -13 -17 -12 1 31 70 98 108 113 118
9767A18qk1j2J2J5qk8k1NL1M6L5kl9m3k1rj7k0lPok0qJ8L2K3J3Nlpokrj3kRLj2j1NJ0qk7k9
$$ 118 110 89 77 89 104 96 68 47 52 83 129 164 162 123 80 59 50 33 13 10 17 11 -9 -17 1 33 56 69 74 71 64 58 56 47 34 32 41 44 32 21 26 36 28 1 -28
9748b8j6LK0K1Jl2m8l1KL2M9N1L7J2j0k1l3m4m5k3NJ4PKQJ0nk3k5qJ0K0K2K1J3LlLJ2J0KK
$$ -28 -44 -41 -21 0 1 -31 -79 -110 -108 -76 -27 24 61 73 63 42 9 -35 -80 -103 -98 -84 -77 -75 -67 -57 -62 -85 -110 -118 -108 -88 -66 -45 -32 -29 -32 -29 -17 -7 -5 -3
9730cJ0J5jk1j8QL2L9K9J7J0QJ1Rol5n8m8j4J4J4KjJ2J6OnjPMrj7j8j9j9rQJ5J1J9M2N1K8
$$ -3 7 22 21 0 -18 -10 22 61 90 107 117 125 136 145 139 104 46 -2 -16 -2 12 14 13 25 41 47 42 41 48 52 43 26 8 -11 -30 -39 -31 -16 -5 14 56 107 135
9711A35qk3j2%LMOLkNJ9K1Mj6k4k2k4k7k4j6mjoj1j3ojKNJ7K5K3J1OJ1K1K1Rrk6k6oJ8K0P
$$ 135 127 104 92 92 95 99 105 108 106 111 130 151 155 139 115 93 69 42 18 2 -2 -3 -9 -20 -33 -39 -40 -38 -33 -16 9 32 43 49 60 81 102 111 102 76 50 44 62 82 89
9691H9%MLooPJ3Kj6j9k0l0l5k1LNj2k1rM%j1j1MJ7K3K1J9J5J1LmmPJ2Jj8k2j5pqj0m%klRL1
$$ 89 89 93 96 90 84 91 104 106 90 71 51 21 -14 -35 -32 -27 -39 -60 -69 -65 -65 -76 -87 -83 -66 -43 -22 -3 12 23 26 22 18 25 37 38 20 -2 -17 -24 -32 -42 -46 -46 -48 -51 -42 -11
9671a1M5L9J7lnJ0K4K8J8Noqqrj8k5k3pRMj2k2j3NJ4J2PPJ6K5K5J8Pj2l6n0m1j1PKj2pJ0J7
$$ -11 34 73 90 87 82 92 116 144 162 167 161 153 145 136 118 93 70 63 72 76 64 42 29 34 48 60 67 74 90 115 140 158 165 153 117 67 26 15 22 24 12 5 15 32
9652C2J0JJKkj0j6k2k4j5rj3j6kK4M0L8L2K7J5pk1j0J3K3J7QJnpjJ1K3K6K0Lj7k8l1l4l4j7
$$ 32 42 43 44 46 44 34 18 -4 -28 -43 -52 -65 -81 -83 -59 -19 19 51 78 93 86 65 55 68 91 108 116 117 112 105 104 115 138 164 184 187 170 142 111 77 43 26
9633B6J6L9L0Lj1mMLrj6j9j8j7k2k9k6j0RK1K5K3J2j2k4j7LJ3OMJ6K4J9NjNJ6K0J7Olnoj2
$$ 26 42 81 111 114 103 99 103 106 97 81 62 44 27 5 -24 -50 -60 -51 -30 -5 18 30 18 -6 -23 -20 -7 -1 3 19 43 62 67 66 71 87 107 124 130 127 122 116 104
9615A04k1k0pPJ6J6RjpmJ%nj2j8k9l3k1%J3QJKLKlnokPJ3J4MkmJJ1J9J9O%J1L0K6Mj1j3j4
$$ 104 83 63 56 63 79 95 104 103 96 92 93 93 88 76 58 29 -4 -25 -25 -12 -4 -3 -1 2 4 1 -4 -10 -12 -5 8 22 26 24 20 21 32 51 70 76 76 87 117 143 147 136 123 109
9594A09j8j4%jk0l3k3qqj8k0j3oNJ9K2J6RJ0J0lqNJ3nl2l7j7PK6M8O5N3J8j2j9j2nJPPJrj6
$$ 109 91 77 77 76 56 23 0 -8 -16 -34 -54 -67 -73 -68 -49 -27 -11 -2 8 18 15 7 12 25 20 -12 -49 -66 -59 -33 15 80 133 151 139 120 108 103 104 111 118 119 110 94
9575I4k3j3J2L8M0K7Qj1k6k3LJ8Jk8k7mRNNJ1NolPkj0J3M9O0O5J12J86K41L29N49P92P33K20
$$ 94 71 58 70 108 148 175 183 172 146 123 126 144 145 117 90 86 95 100 105 116 121 115 112 119 117 107 120 169 229 294 406 592 833 1162 1711 2503 3236 3456
9558C456m44p92o96m38k89k39j72q9o0p0n2qOj0j5k%j2nJ4J1j1k3j4nj3j8pOJ5K2K7J8Lmk
$$ 3456 3012 2220 1524 1086 797 558 386 297 237 167 115 107 113 103 88 86 86 74 69 83 94 83 60 46 41 28 10 3 9 24 46 73 91 94 90 88
9543H8j0j8j1J1J8ml2l5j8jJj1k4k4j2JKmlOJ1OJkoqlNJ2J8K9M1M2K6J0NLjqj1j0j0j2j1j0
$$ 88 78 60 49 60 78 74 42 7 -11 -12 -11 -22 -46 -70 -82 -81 -79 -83 -86 -80 -69 -63 -62 -64 -70 -78 -81 -76 -64 -46 -17 24 66 92 102 107 110 109 101 90 80 70 58 47 37
9523C7qpoLK1L8L9K3J1J4J8Mj5j7pqk0k0nMjLK4L7K2kj0qj7k8l3l6m9n2k6J5L1Rj4j8j2j6
$$ 37 29 22 16 19 40 78 117 140 151 165 183 187 172 155 148 140 120 100 95 99 98 101 125 162 184 182 172 164 147 119 86 50 1 -51 -77 -62 -31 -22 -36 -54 -66 -82
9505h2k2j9kJ3J9J7J0NPJ2QOJ5L1L6K4J3J5J6RNROj5l3k2KQoj1%Lj3k4rJ7K1Kj6k3j8j4nN
$$ -82 -104 -123 -125 -112 -93 -76 -66 -61 -54 -42 -34 -28 -13 18 54 78 91 106 122 131 136 145 151 136 103 81 83 91 85 74 74 77 64 40 31 48 69 71 55 32 14 0 -5 0
9486@J0Rjj0j0lKjj1k3k9k7k4j6rmMJ6L4M5M1K2Mqj1qqj6k8k7pK1L4L1J9Mj8m4n1l0jJ7K0
$$ 0 10 19 18 8 -2 -5 -3 -4 -15 -38 -67 -94 -118 -134 -143 -147 -143 -127 -93 -48 -7 15 19 11 0 -8 -16 -32 -60 -87 -94 -73 -39 -8 11 15 -3 -47 -98 -128 -129 -112 -92
9467i2K1K3J8jk3k8j1J8L8L7J4oj5j8j2LK9M3L6J6QQMrj4pnj4j9KL0L7J5j1k0k1k8m1m3l4
$$ -92 -71 -48 -30 -31 -54 -82 -93 -75 -37 0 14 8 -7 -25 -37 -34 -5 38 74 90 98 106 110 101 87 80 75 61 42 44 74 111 126 115 95 74 46 5 -38 -72
9450g2j5MK2K8J6j3m2m8k5OK3K1J5J9K0Qj5k4nK3L1J3j0j1NK1K0J6K1K7J6j0k9k5j2j0k1k7
$$ -72 -87 -83 -61 -33 -17 -30 -72 -120 -145 -139 -116 -95 -80 -61 -41 -33 -48 -72 -77 -54 -23 -10 -20 -31 -26 -5 15 31 52 79 95 85 56 31 19 9 -12 -39
9433c9j1J7L0J5j3l4l4k1oQK6L7K9RplRJ5J9K3K1J2LOJ5J2Jnljm%J5L0K6Qj2k2k3k2k3k5k2
$$ -39 -50 -33 -3 12 -1 -35 -69 -90 -96 -88 -62 -25 4 13 6 3 12 27 46 69 90 102 105 111 126 138 139 134 131 130 126 126 141 171 197 205 193 171 148 126 103 78 56
9415E6j1jnj6k5k8k7j5J4M8N4K9pj7kJ3J0lpjJ3K1J4jj5j9j8j8k0j9j8j6j3nLJ2J5J0mj7j7
$$ 56 45 44 39 23 -2 -30 -57 -72 -58 -10 44 73 66 49 47 60 70 67 60 59 72 93 107 106 91 72 54 36 16 -3 -21 -37 -50 -55 -52 -40 -25 -15 -19 -36 -53
9397e3nkrj0MJ6QpmJ5K1PkMOj1l0k1QK4J3lkJ0J9K3K7K4Oj8l4l1k3j9j3PL4M6L5Pj4j8j0P
$$ -53 -58 -60 -69 -79 -75 -59 -51 -58 -62 -47 -26 -19 -21 -17 -11 -22 -52 -73 -65 -41 -28 -31 -33 -23 -4 19 46 70 76 58 24 -7 -30 -49 -62 -55 -21 25 60 67 53 35 25 32
9378C2K2K1Lj8j8mPKmkKnj8k0j4qkNQlk3l1j4J5L1K9J4PNMJmj1j3j3rLK5M3L7J6QK1M0M0K2
$$ 32 54 75 78 60 42 38 45 47 43 41 43 38 20 0 -14 -22 -24 -19 -11 -14 -37 -68 -82 -67 -36 -7 7 14 19 23 24 20 9 -4 -17 -26 -23 2 45 82 98 106 127 167 207 229
9358B29Lrk3m3n3m3k6j7j8j2LJ2J0lj3j8j4nJ1K5L0K7J1qj9j1J2L5M0L3K1J1ql1m3l9k9k4
$$ 229 232 223 200 157 104 61 35 18 0 -12 -9 3 13 10 -3 -21 -35 -40 -29 -4 26 53 64 56 37 26 38 73 113 146 167 178 170 139 96 57 28 4
9342Dj3LJ8J3rj8nJ2J0moJ2K9K3lk4k0%Rql1l5j1J3J5MLJ3J5J1J3L1M5L3kl1m1l5l2l3l2k1
$$ 4 -9 -6 12 25 16 -2 -7 5 15 11 5 17 46 69 66 42 22 22 31 23 -8 -43 -54 -41 -26 -22 -19 -6 9 20 33 64 109 142 140 109 68 33 1 -32 -64 -85
9323h5MK7L3J6j3k5j6KJ2J1J6K8L6K3kj9j3KQLk%OLnj3k3l4m6l6oL1N2M8K8Kj7j9j0%kj1k0
$$ -85 -81 -54 -21 -5 -18 -43 -59 -57 -45 -34 -18 10 46 69 67 48 35 37 45 48 46 46 52 55 50 37 14 -20 -66 -102 -108 -77 -25 23 51 53 36 17 7 7 5 -6 -26
9305b6k0rPJ8J8MrqLJ2J4J6J8J3LJRJ6J2%pj1j8j7%K3K9J5%MJ4Oj5k7k4j6k1k6j5OK1J4j0
$$ -26 -46 -55 -48 -30 -12 -8 -17 -25 -22 -10 4 20 38 51 54 55 64 80 92 92 85 74 56 39 39 62 91 106 106 110 124 130 115 88 64 48 27 1 -14 -8 13 27 17
9286A7k8k8j1OJ3Ork3k3qK0M0L3Pj3pJ8L7L1J2nj3j0KJ6K0J1jlLLmj4j7j1njnqojkj1j7j0
$$ 17 -11 -39 -50 -44 -31 -25 -34 -57 -80 -88 -68 -28 5 12 -1 -8 10 47 78 90 85 72 62 64 80 100 111 110 107 110 113 109 95 78 67 62 61 56 48 42 41 39 28 11 1
9267AMMqj3jJ8L1L0K3J0lj1j0rj7k6k2lJ2J3JpmQJ6J0ok2l2l4k5jL0N0M7J8j0j9oJ5L3M1L2
$$ 1 5 9 1 -12 -13 5 36 66 89 99 96 85 75 66 49 23 1 -2 10 23 24 17 13 21 37 47 41 19 -13 -47 -72 -73 -43 7 54 72 62 43 37 52 85 126 158
9248A58J2rk2k8l0l3l7m1m7m0j8J0K7K3J1QJ3J3Lj0j1jJ2K1K3J4pk8l2j3QJ6J3J6K7L1J9L
$$ 158 170 161 139 111 81 48 11 -30 -77 -117 -135 -125 -98 -75 -64 -56 -43 -30 -27 -37 -48 -49 -37 -16 7 21 14 -14 -46 -59 -51 -35 -22 -6 21 52 71 74
9231G4ooqj2j6j5j0n%PJ9K8K7J6Komlqj5k0j6nNPkj5k3k3j5nMNNORLk1m6m6k0PJ7Q%KJ0J3
$$ 74 68 62 54 42 26 11 1 -4 -4 3 22 50 77 93 95 89 85 82 74 59 39 23 18 23 30 28 13 -10 -33 -48 -53 -49 -44 -39 -33 -24 -21 -42 -88 -134 -154 -147 -130 -122 -122 -120 -110 -97
9211i7PjkPJ7J5L%J6L5L7K8J7Pnk2k9k7k4k5k0lPNmmOJ0J0J0J3J1%j1j2j0j3j4oRJ1kj2oJ2
$$ -97 -90 -91 -93 -86 -69 -54 -51 -51 -35 0 37 65 82 89 84 62 33 6 -18 -43 -63 -66 -59 -54 -58 -62 -56 -46 -36 -26 -13 -2 -2 -13 -25 -35 -48 -62 -68 -59 -48 -50 -62 -68 -56
9191e6K9L1J9%j6j9j3MJ7K3K2J2ok8l8l7k2lJ1J0jj1qMJ4J6RMLJ1J9J7Lj3j6j1qj3j5j2j1
$$ -56 -27 4 23 23 7 -12 -25 -21 -4 19 41 53 47 19 -19 -56 -78 -81 -70 -60 -61 -72 -80 -76 -62 -46 -37 -33 -30 -19 0 17 20 7 -9 -20 -28 -41 -56 -68 -79
9173g9j3j6j1JJ8L2L9K9J3OJ1J1ONJ4J5lk4l0k4k3j4J2M0M2J5j0j6j6k2k2j1KKrj6j4kJ2K5
$$ -79 -92 -108 -119 -118 -100 -68 -29 0 13 19 30 41 47 52 66 81 78 54 24 0 -23 -37 -25 15 57 72 62 46 30 8 -14 -25 -23 -21 -30 -46 -60 -62 -50 -25
9156b5L3L8L8K6jk9l7l3l8n6m9mM6N5K7mj1%J3K6L3K1LnjJj1j6pLL%QK2L0L1L0K1jk5l7l7
$$ -25 8 46 84 110 109 80 43 10 -28 -84 -133 -137 -91 -36 -9 -13 -24 -24 -11 15 48 69 72 67 66 67 56 40 33 36 39 39 47 69 99 130 160 181 180 155 118 81
9138H1l1k7k3j3kJ3K8L3K1Mprj6k4k6j5kPJ3K1K9L4L1J6nj7j4j%qj8j8j5j3j3j4k2l2l2j6
$$ 81 50 23 0 -13 -15 -2 26 59 80 84 77 68 52 28 2 -13 -15 -8 5 26 55 89 120 136 131 114 100 99 99 91 73 55 40 27 14 0 -22 -54 -86 -102
9120a02LJ3J7J4%k1l2k8j5p%J1K1K1J5J6J7Nj1j6p%MJ8L2K4mj8lJ7J6RK0L0J3k3l8j7RK2J5
$$ -102 -99 -86 -69 -55 -55 -76 -108 -136 -151 -158 -158 -147 -126 -105 -90 -74 -57 -52 -63 -79 -86 -86 -82 -64 -32 -8 -12 -30 -33 -16 0 9 29 59 72 49 11 -6 3 25 40
9103D0Mj1k0j4JRRJ0J5J1rk3j8pj1j9j5qj9l6k8J0M3M1J2j4j7nPPnrJ1M1M7K1j8l1j4QJ5R
$$ 40 44 33 13 -1 0 9 18 28 43 54 45 22 4 -3 -14 -33 -48 -56 -75 -111 -139 -129 -86 -45 -33 -47 -64 -69 -62 -55 -60 -69 -58 -17 30 51 33 2 -12 -4 11 20
9085B0kj3j4j6k2l4l8k6jJ7K0J9K4L1K6J4POKj5k9k5mJ1Jj7k0lJ1Ppj2lJ1J8J3JpqJQJ1J6
$$ 20 18 5 -9 -25 -47 -81 -119 -145 -146 -129 -109 -90 -66 -35 -9 5 12 18 20 5 -24 -49 -53 -42 -41 -58 -78 -81 -70 -63 -70 -82 -85 -74 -56 -43 -42 -49 -57 -56 -48 -37 -21
9066b1K2K7K1Qpj6j6kJ8K7J8LlLLmplJlpkQQnj8k3j3PK8L8L2K1J0lk3l8l4j0J4K4K2K2K2J5
$$ -21 1 28 49 57 50 34 18 16 34 61 79 82 79 82 85 81 74 71 72 69 62 60 68 76 71 53 30 17 24 52 90 122 143 153 150 127 89 55 45 59 83 105 127 149 164
9046A64Npj5k6l2k6j2JJ3J9J2j2l6l5j1POmokoj3rLKqlJ7K9K2QQJ3Pj2l1l7l8k9j3LJ4J8K6
$$ 164 169 162 147 121 89 63 51 52 65 84 96 84 48 13 2 9 15 11 5 3 -3 -16 -25 -22 -20 -28 -31 -14 15 37 45 53 66 73 61 30 -7 -45 -74 -87 -84 -70 -52 -26
9027b6L2L0J1qj1jJ5L1L6L0Rj5l0l1j4J1K2Rk4m3l3qKoj1MK2K7Pj6k3j4JJ3K0K8L1K5J3NJ
$$ -26 6 36 47 39 28 27 42 73 109 139 148 133 103 72 58 69 91 100 76 33 0 -8 -6 -12 -23 -19 3 30 37 21 -2 -16 -15 -2 18 46 77 102 115 120 121
9010A21%mj3j8k2k1j8j7j9k7l5l5k3%J9K6J7ol1m3l2JL2M1K9J6J8K5K4J9J9K2K1J1Jj1l0m9
$$ 121 121 117 104 86 64 43 25 8 -11 -38 -73 -108 -131 -131 -112 -86 -69 -75 -106 -149 -181 -180 -148 -107 -78 -62 -44 -19 5 24 43 65 86 97 98 87 57 8
8993Hm5j9QJ5POJ0J2J2J7K1Nk2l4j4J4K4J0rj9k0j3QL0L6J6j5l0k4j4j3k4l4k7LL8N4M5K3
$$ 8 -37 -56 -48 -33 -26 -20 -10 2 14 31 52 57 35 1 -13 1 25 35 26 7 -13 -26 -18 12 48 64 49 19 -5 -19 -32 -56 -90 -117 -114 -76 -22 23 46
8976D6Qmk2m1l9rK7L6K1Kpj0qLK6L6K4MkPJ2Kj6k9l3j9QK8K7Qpj0j4k8l9l3j4QK7M5N1L5Q
$$ 46 54 50 28 -13 -52 -61 -34 2 23 25 18 8 0 3 29 65 89 93 91 98 110 112 96 67 34 15 23 51 78 86 79 69 55 27 -12 -45 -59 -51 -24 21 72 107 115
8958A15j0qOJ5J3Kj6l1l0j0J8L6L7J9mk2l5m5m6l2mK0K5J5Kpj1j4k2k9l3k9j3J0K2J8OjLJ4
$$ 115 105 97 103 118 131 133 117 86 56 46 64 100 137 156 152 130 95 50 4 -28 -32 -12 13 28 30 23 12 -2 -24 -53 -86 -115 -128 -118 -96 -78 -72 -73 -70 -56
8940e6K4K6K6K6J8QjNJ5J0j3l7l5j7onoLJ2J5J6J7J2KookJPJ6J3j0l8m3k1J4M1M8L4J0nqr
$$ -56 -32 -6 20 46 64 72 71 76 91 101 88 51 16 -1 -7 -12 -18 -15 -3 12 28 45 57 59 53 47 45 46 53 69 82 72 34 -9 -30 -16 25 73 107 117 112 104 95
8922I5j5k1k0j6j4pRK0J2kmQJ2Kppkpj5k1k3k3k0k0k8l6k3QK4J4nmJ2K0J7J9L0L3J5pj5pQ
$$ 95 80 59 39 23 9 2 11 31 43 41 37 45 57 59 52 45 43 36 21 0 -23 -46 -66 -86 -114 -150 -173 -165 -141 -127 -132 -136 -124 -104 -87 -68 -38 -5 10 3 -12 -19 -11
8903a1J5Rnj2nRK1J9Rkj3k3k3qJ8L9M2K2%qNJ7J4lpQK3J5pk3j4KNrk2j2J3L3L2J7Knj0j3q
$$ -11 4 13 8 -4 -9 0 21 40 49 47 34 11 -12 -20 -2 37 79 101 101 93 98 115 129 126 119 127 150 165 158 135 121 123 128 119 97 85 98 131 163 180 182 177 167 154 146
8883A46jqk8m2l1%K3K0lk3k8k1j4r%J1J3MopKRJ3RKqj2j1oqj1q%NLloj1j6j5lJ6K3J8Lrj1
$$ 146 145 137 109 67 36 36 59 79 76 53 25 4 -10 -19 -19 -8 5 9 3 -4 -2 7 20 29 31 23 11 0 -6 -14 -25 -33 -33 -28 -25 -28 -34 -45 -61 -76 -79 -63 -40 -22 -19 -28 -39
8863c9KJ7K0Ppj9k4j9nJ2J9QopRK8L4K6Lk4l6k7jJ4J0lkJ5L0J8j4l3k0PK0Rqj0ljojJ0K0K0
$$ -39 -37 -20 0 7 0 -19 -43 -62 -67 -55 -36 -28 -34 -41 -32 -4 30 56 59 35 -1 -28 -29 -15 -5 -8 -10 5 35 53 39 6 -14 -7 13 22 14 4 1 0 -6 -7 3 23 43
8843D3J5Rkj2j6j2j3j6j5oOJ1J4J9K1J9J6J4Ppj4qJ%j6k9l1j8LJ9K2J0rj7j4qnoqj5k1k4j3
$$ 43 58 67 65 53 37 25 12 -4 -19 -25 -19 -8 6 25 46 65 81 95 102 95 81 73 74 74 58 29 -2 -20 -17 2 24 34 25 8 -6 -14 -19 -25 -33 -48 -69 -93 -106
8825a06OK6L4L1J8RLKJKJ0J9K2J1pk1l1l7m4m3k9j3pj5k5k0nPPJ1K8M8M9L0Pkj0k4l7k6NL3
$$ -106 -100 -74 -40 -9 9 18 21 23 24 26 36 55 77 88 81 60 29 -8 -52 -95 -124 -137 -144 -159 -184 -204 -209 -202 -195 -184 -156 -108 -59 -29 -22 -24 -34 -58 -95 -121 -116 -83
8807h3M3L4K5K0J5J3J0mk3m0l7k2rkOJ6K7L3M5M8L5J0qj0j6l2m2l5j9j9k9k4kK0K5J7Jj5k3
$$ -83 -40 -6 19 39 54 67 77 73 50 10 -27 -49 -58 -60 -54 -38 -11 22 67 115 150 160 152 142 126 94 52 17 -2 -21 -50 -74 -76 -56 -31 -14 -13 -28 -51
8790e1j3KJk0l8l4j8mKRJ6J6J3J3K0K8K8Rj8l3k3%J4J7K4K8J2j4k6mK3K3PnnlKJ5K3Rj4j6
$$ -51 -64 -62 -61 -81 -119 -153 -171 -175 -173 -164 -148 -132 -119 -106 -86 -58 -30 -21 -39 -72 -95 -95 -81 -64 -40 -12 0 -14 -40 -44 -21 2 9 4 -1 -4 -2 13 36 45 31 15
8772A5KJ8J4NLRJ4J4Mj8l5l1j5pmJ0L5M3K7J2J4J8Jk5k8j3lpj2j2j7k4k2qJok1k3rJ0K0J1
$$ 15 17 35 49 54 57 66 80 94 98 80 45 14 -1 -8 -12 -2 33 76 103 115 129 147 148 123 95 82 79 72 60 48 31 7 -15 -23 -22 -28 -49 -72 -81 -71 -51 -40
8753d0j4l1k4lPJJJ3K1J0olJ7L5L6K6Qj3k8l1k2j0mjkljJ3L4N0M7K6PKQNj7l9m1j8MKj7l0
$$ -40 -54 -85 -109 -112 -105 -104 -103 -90 -69 -59 -65 -68 -51 -16 20 46 54 41 13 -18 -40 -50 -54 -55 -57 -60 -61 -48 -14 36 83 109 116 118 126 131 114 75 34 16 20 22 5 -25
8734b5k1%J9K8K8J6kj3j0%LMPRNl%QMj6l1l0k4k0j6kRMj3j9lJ4J5Mmmlnpqj0j3j0NK5L2J6
$$ -25 -46 -46 -27 1 29 45 43 30 20 20 23 27 34 43 48 45 45 53 57 41 10 -20 -44 -64 -80 -82 -73 -69 -82 -101 -104 -90 -75 -71 -75 -79 -82 -87 -94 -102 -112 -125 -135 -130 -105 -73 -57
8714e7oj4MK5K9J5lj9l3m7m8l7j8KJ7L0L5L2K5J2jj3j2onj0pRK8L8M3M2J6l0o5o3l0mMJ0K1
$$ -57 -63 -77 -73 -48 -19 -4 -7 -26 -59 -106 -154 -191 -209 -207 -190 -160 -125 -93 -68 -56 -57 -70 -82 -88 -93 -103 -110 -101 -73 -35 8 50 66 36 -29 -92 -122 -126 -122 -112 -91
8696i1K4Oj5k2k1k8l8k8LL7N0M4L2K6K2J5ok7l6k1LJ4J3J3K3K7J5pqJ2L8M0J8j2l1l2k3qM
$$ -91 -67 -61 -76 -98 -119 -147 -185 -213 -210 -173 -123 -79 -47 -21 1 16 10 -17 -53 -74 -71 -57 -44 -31 -8 19 34 27 19 31 69 109 127 115 84 52 29 21 25
8679B5Kj1k2k1r%JNJ5K1J5jpnlj0j2nLjpKK5L5K1ok5l1l7m2l1oK4L7K9J4PJ6L4M1K9J2Kkr
$$ 25 27 16 -6 -27 -36 -36 -35 -30 -15 6 21 20 13 8 5 -5 -17 -22 -19 -20 -27 -25 0 35 56 50 25 -6 -43 -85 -116 -122 -98 -61 -32 -18 -11 5 39 80 109 121 123 121 112
8660A12j7j0PJ0j0k4j8pj3l1l4j7mKJ5L6M5L7K6L1L5K3jj8k7k6j6llk4m5l6mK5L6L5K8J2j2
$$ 112 95 85 92 102 92 68 50 43 30 -1 -35 -52 -56 -54 -39 -3 42 79 105 136 171 194 193 175 148 122 106 103 100 76 31 -5 -9 16 52 87 115 127 115
8643A15l9n8n9m3j5OJ0PJ4K3J9MMK6M4L8J3ok0l5m8m3j9J1K3J9NnlJ0K2K6J1oj1kPNj0j8j1
$$ 115 76 18 -41 -84 -99 -93 -83 -76 -62 -39 -20 -16 -12 14 58 96 109 103 83 48 0 -43 -62 -51 -28 -9 -4 -9 -12 -2 20 46 57 51 40 38 45 50 40 22 11
8625A1LJ5J8J7J0lj5j1NJ6Mk2l7l1j5KJ2J4PNJ0K0J8ml1m2l1rJ0K2K5J1j1k9j6J9M8N3L9L0
$$ 11 14 29 47 64 74 71 56 45 50 66 70 48 11 -20 -35 -33 -21 -7 0 5 15 35 53 49 18 -24 -55 -64 -54 -32 -7 4 -7 -36 -52 -33 15 68 107 137
8608A37K5J0j5l2l1k3k3k7j9OL1L9K3lj5oQPrk2k5k1j5mMLoj4pMLpj4j5j2oJ1L0L6K5Kj9k4
$$ 137 162 172 157 125 94 71 48 21 2 8 39 78 101 98 83 77 85 92 83 61 36 15 0 -4 0 3 -3 -17 -24 -20 -17 -24 -38 -53 -65 -71 -60 -30 6 31 33 14 -10
8589a0j3RK1J4%KJ6J9MmJ0K7J9j1l2k8j4j0j8j6JK4L9L3J3ok2l1l3k1oMQJ4K7L6K9J1%JML
$$ -10 -23 -14 7 21 21 23 39 58 62 58 68 95 114 103 71 43 29 19 1 -15 -14 10 49 82 95 89 67 36 3 -18 -24 -20 -12 2 29 65 94 105 105 106 110 113
8571A13mj0j9k6k6j2Jlj5k1oJ5K2J5J2J3Pj5l5l6k2nMM%okJ6L4K5mk7k8k0j6j3%J5J4lj4q
$$ 113 109 99 80 54 28 16 17 14 -1 -22 -28 -13 9 24 36 49 56 41 6 -30 -52 -57 -53 -49 -49 -55 -57 -41 -7 18 14 -13 -41 -61 -77 -90 -90 -75 -61 -64 -78 -86
8553h6LJ1J8K6L0K7J5Mmpj0k1l0k9j3Jlj7j4J3M2M9L9K4J6K1K6J8pl0k7mJ1Oqj2j1k0k8k5
$$ -86 -83 -72 -54 -28 2 29 44 48 44 37 27 6 -24 -53 -66 -65 -68 -85 -99 -86 -44 5 44 68 84 105 131 149 142 112 85 81 92 98 90 78 67 47 19 -6
8535frNJ5K9M0L9K0nk0k0j2kMKoj4j6pPJ2jk5l8l3j3KJ1K1K8L9M5M6K9nl0k1J2L1K5J1ONm
$$ -6 -15 -10 5 34 74 113 133 128 108 88 76 74 78 80 74 60 44 37 44 56 55 30 -8 -41 -54 -52 -41 -20 8 47 92 138 167 162 132 111 123 154 179 190 196 201 197
8517A97j7j9j4j5k8m0l8k2n%rk0k0pQJ4J1QLJLJ1K0K3J8Ppj1JK0K1nl3l5j4NNj3l1m0l6j9
$$ 197 180 161 147 132 104 64 26 4 -1 -1 -10 -30 -50 -57 -49 -35 -24 -16 -13 -12 -9 2 22 45 63 70 63 52 53 73 94 89 56 21 7 12 17 4 -27 -67 -103 -122
8498a22lOPJ0J9L0L8L4J6j2l3l2k0j1lJ8M5N1L0Qmqj4j0NJ2nl0l7l0k7k9k3lK0L6M2L2Rk2
$$ -122 -125 -119 -112 -102 -83 -53 -15 19 35 23 -10 -42 -62 -73 -76 -58 -13 38 68 76 72 64 50 40 45 57 52 22 -15 -45 -72 -101 -124 -127 -107 -71 -29 3 12 -10
8481a0m0l7k7j8kJ7L0K6J9J7J1mj8k1j0LJ7L0L4K2ok3j0J9M1L1pl9m5k6pOJ9L2L8K6Mj5k3
$$ -10 -50 -87 -114 -132 -134 -117 -87 -61 -42 -25 -14 -18 -36 -57 -67 -64 -47 -17 17 39 33 10 0 19 60 91 84 45 0 -26 -33 -27 -8 24 62 88 92 77 54
8464E4j9lJ5J9J3QJ2Pqj8rNMplJ3K0Oj1j8k6l7l3j0J1%k7l7j7J4L0K9K2J6J7J4MroJ2K9K4
$$ 54 35 32 47 66 79 87 99 106 98 80 71 76 80 73 70 83 103 109 98 80 54 17 -16 -26 -15 -15 -42 -79 -96 -82 -52 -23 -1 15 32 46 50 41 35 47 76 100
8446A00Kk0l0l7l8k8pJ1J9J7J1jnMJ9K3QpjJ4K0Oj6l4l6k5oMRJ7K7L3K2J0jj4l4m2l0qLjl
$$ 100 102 82 52 15 -23 -51 -58 -47 -28 -11 0 -1 -6 -2 17 40 48 41 40 54 74 80 64 30 -6 -31 -37 -33 -24 -7 20 53 75 85 84 70 36 -6 -36 -44 -41 -42 -45
8427d5LOMOJ6K0J6J1J3J9J6KqpJlj4j5OL2L4J0j2j4j5k6k7kL0L2Nj7j9j9l0l0j5KJnkNRJ7
$$ -45 -42 -36 -32 -26 -10 10 26 37 50 69 85 87 79 72 73 70 56 41 47 79 113 123 111 97 82 56 29 27 57 89 94 77 58 39 9 -21 -36 -34 -33 -38 -40 -35 -26 -9
8408iL0L3Pk4k7mJ0Onj1j0oPJ7J2loQK1J8J2J1Ppj6pJ2K8L7M3L5J1j4k4k2k0j8oPJk3m4m2
$$ -9 21 54 61 37 10 6 16 22 17 6 -4 -10 -3 14 26 23 17 25 46 64 76 87 94 87 71 64 76 104 141 184 219 230 216 192 170 150 132 126 133 134 111 67 25
8390B5j8QK4K1J1PJ2K0J8Opj6j4%J9K3kl3l5j2lk5m4l0OK1Kk2j9KJ7K2J9J9J6J1PRQKqj7k5
$$ 25 7 15 39 60 71 78 90 110 128 134 127 111 97 97 116 139 137 104 69 57 54 29 -15 -45 -39 -18 -16 -38 -57 -55 -38 -16 3 22 38 49 56 65 73 75 67 50 25
8371B5l2l4k1MK9L7K9Rj1k2j6okrrJJ1Kj8k0NK7K4NlMPLNK4M0L3Mk1k3pPJ0Mkkjmj1qPJ7J2
$$ 25 -7 -41 -62 -58 -29 8 37 46 35 13 -3 -9 -11 -20 -29 -28 -17 -15 -33 -53 -48 -21 3 8 5 9 16 19 24 48 88 121 125 104 81 74 81 91 95 93 91 90 86 75 67 74 91 103
8350A03mroj1k6l1j1K4M3L3J1mnqk4m6n2l9j0J6L4M2M5L6J8lj4j6j6j4j7j6q%lj7k9j9kLr
$$ 103 99 90 84 73 47 16 5 29 72 105 116 112 107 99 75 29 -23 -62 -72 -56 -22 20 65 101 119 116 102 86 70 56 39 23 15 15 12 -5 -34 -53 -55 -52 -61
8332f1k1k5k6l0k6oJ5K8K8L1K8J9QJ1J6Pj9l5k5qkqnJ1K5K6J3jn%QRJ1J7K6K5J7K0K7J6j9
$$ -61 -82 -107 -133 -163 -189 -195 -180 -152 -124 -93 -65 -46 -38 -27 -11 -4 -23 -58 -83 -91 -93 -101 -106 -95 -70 -44 -31 -32 -37 -37 -29 -20 -9 8 34 59 76 96 123 139 120
8315A20n1m6j7LJn%QPlj0j1j1kJ4K6K9K3K2K4K0Mj4k2k2k3l0l3k2%J1NqrKJ3J1JrrOK0J8k
$$ 120 69 23 6 9 10 5 5 13 20 17 7 -4 -15 -17 -3 23 52 75 97 121 141 145 131 109 87 64 34 1 -21 -21 -10 -5 -13 -22 -20 -7 4 5 -4 -13 -7 13 31 29
8296B9j6rPRjJJ8L1K7J2lj9l0k3jJ8J8RNMkp%J2Pj1k4k2j5j7j0PL0L1Rj1j7j3j1j5k3l2l0
$$ 29 13 4 11 20 19 20 38 69 96 108 105 86 56 33 32 50 68 77 82 86 84 77 77 89 96 85 61 39 24 7 -3 4 34 65 74 63 46 33 22 7 -16 -48 -78
8277g8j5J4M1M8L4J3RK0K6J4j4l9m7l4j4LJ1QJ1J7K0J5NJJKjpj9l0k6rQJk2l5j8J5L9L8J6
$$ -78 -93 -79 -38 10 44 57 66 86 112 126 112 73 26 -8 -22 -19 -8 0 11 28 48 63 68 69 70 72 71 64 45 15 -11 -20 -12 -11 -33 -68 -86 -71 -32 6 22
8259B2j1k2j7KK1K7K2ll5n1m1j1J0J3OjooJJ1J3QKJ%JOJ2Oj4k3rJ7L0K5J7Kj5k2qJ7K7J7L
$$ 22 11 -11 -28 -26 -5 22 44 41 6 -45 -86 -97 -87 -74 -68 -69 -75 -81 -80 -69 -56 -48 -46 -45 -45 -44 -38 -26 -20 -34 -57 -66 -49 -19 6 23 25 10 -12 -20 -3 24 41 44
8240D4mj1k4k6j1J1J7Lj8k5j5QL3M7M0J7j0j8j0%pl2m4l2lJ0Ml%J2J6J9K3K7K1Nj0k0k2j2
$$ 44 40 29 5 -21 -32 -21 -4 -1 -19 -44 -59 -51 -18 29 69 86 76 58 48 48 41 9 -35 -67 -70 -60 -56 -59 -59 -47 -31 -12 11 38 59 64 54 34 12 0
8223@JOkj3k5l7m2l1JK9L2K0J5K6K8J8MNJ1Nj3k4j7rrj3qJ1L0K9Qj2j8j7k2k8k3oOMjNJ8K1
$$ 0 1 7 5 -8 -33 -70 -112 -143 -142 -113 -81 -61 -46 -20 8 26 30 35 46 51 38 14 -3 -12 -21 -34 -42 -31 -1 28 36 24 6 -11 -33 -61 -84 -90 -84 -80 -81 -76 -58 -37
8204c7J5RJ1RKnLJ7K0Rpj4qMJ6J6Nqj0jJ0J8K0J8J4QL%pj7k2j9j3j0pjkroJ7M4M2J2j7j9r
$$ -37 -22 -13 -2 7 9 4 7 24 44 53 46 32 24 28 44 60 65 57 47 46 56 74 94 112 126 134 137 137 130 113 91 72 59 49 42 41 39 30 24 41 85 127 139 122 103 94
8184I4j0j6j7qknplNJ1J3Lj5l6m5m1k1OL2L8J6k1l7k4LJ9J8ROKjkOK3L4L4K4J2PKoj5j8j6
$$ 94 84 68 51 43 41 36 29 26 31 42 55 58 43 7 -38 -79 -100 -94 -62 -24 -8 -29 -66 -90 -87 -68 -50 -41 -35 -33 -34 -36 -30 -7 27 61 85 97 104 106 100 85 67 51
8165E1j2j4j8k1k3j8qMJ5K3K5K1Qop%Mqk5l3k3j2j0j4qJ6M0M3K2N%Koj7k1j8j6j8j3lNONO
$$ 51 39 25 7 -14 -37 -55 -63 -59 -44 -21 4 25 33 27 20 20 24 16 -9 -42 -65 -77 -87 -101 -109 -93 -53 -10 12 17 17 19 13 -4 -25 -43 -59 -77 -90 -93 -88 -82 -77 -71
8146g1LljJ0K0J9J4J2J7J8J5Opk5l3k9j3NJ6J6OKJ1K0Nk3l2rK3L2K1Pmj6k3j6ppj3j1JJ2K2
$$ -71 -68 -71 -72 -62 -42 -23 -9 3 20 38 53 59 52 27 -6 -35 -48 -43 -27 -11 -5 -3 8 28 33 10 -22 -31 -8 24 45 52 48 32 9 -7 -14 -21 -34 -45 -44 -32 -10
8127a0K9K7Mk2k7j0mj0j2LJ6Rkmkj4l3l8k9j6oJ2L0M1L9L4K6Pj2j4PK4J8j0l0k4kJ5J4lj3
$$ -10 19 46 50 28 1 -9 -13 -23 -35 -32 -16 -7 -9 -13 -15 -29 -62 -100 -129 -145 -151 -139 -109 -68 -29 5 31 38 26 12 19 43 61 51 21 -3 -5 10 24 21 8
8109HpPJ3J0JlkNRLrj1JJ1%k3l0k1j0roJ2L1K7Mj2j0KMpj5j1lj0k3k7qJ6K5J8J6K4L0K9K2
$$ 8 1 8 21 31 32 29 27 32 41 44 35 24 25 36 36 13 -17 -38 -48 -57 -63 -51 -20 7 11 -1 -11 -9 -5 -12 -27 -38 -41 -51 -74 -101 -109 -93 -68 -50 -34 -10 20 49 71
8090G1J3MllOJ8K4K2J1lj3j0nj0k6l2j6MNj6m1m3j7K5N1L9lm0m1k1kmj7k5j9MK9M0L6K8K5
$$ 71 84 88 85 82 88 106 130 152 163 160 147 137 132 122 96 64 48 52 57 41 0 -43 -60 -35 16 55 52 12 -29 -50 -52 -56 -73 -98 -117 -113 -84 -44 -8 20 45
8072D5K1RNJ7L0J7k0m4l7j0PLpqJQNnnRK1J0j6l4k6pJ0J8K0J5RJ2J8J4ql0l3j6NK2L2K7Kk7
$$ 45 66 75 80 97 127 144 124 80 43 33 40 43 36 28 29 37 42 37 32 41 62 72 56 22 -4 -11 -1 17 37 52 61 73 91 105 97 67 34 18 23 45 77 104 106 79
8053G9l9l1j8j1o%jpj1mJ0K2K8L2L1K5J5Jj5k5k3j3qj1pJ6M7O0M7K5J2Mrk8l4k5j1j6l0k8
$$ 79 40 9 -9 -20 -26 -26 -27 -34 -45 -49 -39 -17 11 43 74 99 114 115 100 75 52 39 31 20 13 29 76 136 183 208 220 224 215 187 153 128 117 101 71 43
8035D3JL2L5Ok8l9l2k2j9pJ1J9Rrj0LJ2J3QQMpj3kJ2J1j0k7k7j9j2pNJ8K1J5QRJ1Nnj5j9j2
$$ 43 44 76 111 117 89 50 18 -4 -23 -30 -19 0 9 0 -10 -7 5 18 26 34 38 31 18 16 28 39 29 2 -25 -44 -56 -63 -58 -40 -19 -4 4 13 24 29 24 9 -10 -22
8016b2MJ9K5K2K0J8Nk0l8l4j7nj0j8pJ4K0Jk3k4kK1K7K2J8Pj9m4m7k9j4j3j0OK4L0K7K4K2
$$ -22 -18 1 26 48 68 86 91 71 33 -1 -18 -23 -33 -51 -58 -44 -24 -23 -46 -70 -72 -51 -24 -2 16 23 4 -40 -87 -116 -130 -143 -153 -147 -123 -93 -66 -42 -20
7999b0J3KJMLk%J0J8K0J8J4jk4l0rJ5J6ok6k8k3j8j5j0jQK0L0K9K2J1M%qj5j6rqj6k9l3k0
$$ -20 -7 -5 -4 0 3 1 1 11 29 49 67 81 80 56 26 17 32 48 42 16 -12 -35 -53 -68 -78 -79 -71 -51 -21 8 30 41 45 45 37 22 6 -3 -11 -27 -56 -89 -109
7981a09NK2J9OmjJ2K4L7M7M2J7j5m3n9o1m3rK1K4NoNK7L2K1J2Pjj4k0j3pj5k3j7PK9L6L1K6
$$ -109 -104 -82 -63 -57 -61 -62 -50 -26 11 58 100 117 102 59 0 -61 -104 -113 -92 -68 -63 -69 -64 -37 -5 16 28 35 34 20 0 -13 -20 -35 -58 -75 -68 -39 -3 28 54
7963E4K0J0jppKJ2J6RlrnJjpkJ1J8J0loMJ3J5J1Mnj6k7l2l3l0j8mNNMJ2J9J5JqKJ2Lj8k8j7
$$ 54 74 84 83 76 69 71 83 99 108 105 96 91 92 91 84 82 93 111 121 118 112 116 129 144 155 159 154 138 111 79 46 16 -2 -6 -1 4 8 20 39 54 55 47 49 61 64 46 18 1
7942AKOKLJ1J0pk5k3%K2K7J0pj4j3roPK2L0K5J3PL%nqj2k6m0l8k2m%JJ2K6K2Mj3j5pKJ6L5
$$ 1 3 9 11 14 25 35 28 3 -20 -20 2 29 39 32 18 5 -4 -10 -3 19 49 74 87 94 97 97 92 84 72 46 6 -32 -54 -58 -58 -57 -45 -19 3 7 -6 -21 -28 -26 -10 25
7922B5M6L3Jk5k3JK5L1K0J0J2K1J8mk7l7l5k9k1qMjj6k3j2PJ5J6J2Nqk5l9m4l3qK1L6L4K0
$$ 25 71 104 105 80 57 58 83 114 134 144 156 177 195 191 164 127 92 63 42 34 38 37 21 -2 -14 -7 8 24 36 41 33 8 -31 -75 -108 -116 -95 -59 -25 -5
7905eRLkmOK3L4K6Kk4l2k5j2pqpmKNQJ1RRJ1J4J2jj3j2oj2k3k7j5qj4j8kJ9K3J1NJ6K9K9J8
$$ -5 4 7 5 1 7 30 64 90 92 68 36 11 -1 -8 -16 -23 -27 -25 -20 -12 -1 8 17 28 42 54 53 40 28 22 10 -13 -40 -55 -63 -77 -95 -97 -78 -55 -44 -39 -23 6 35 53
7885E3J3K1K6J6mj9k0j1nmoprj6k3k1j2KPmj6j5LK1K0NkQK5K7J2jJJ3K0J2JMJ9K9K7J6RLr
$$ 53 66 87 113 129 125 106 86 75 70 66 60 53 44 28 5 -16 -28 -26 -19 -23 -39 -54 -51 -30 -10 -5 -7 1 26 53 65 64 65 78 98 110 111 115 134 163 190 206 215 218 209
7866B09k7m1m2l2j3MPnk0k1j0j%NJ2Pj2k5j6LQKJJ0J3%j2qorqLJ6Pj8l0k0jLqk1k8k6j1J1
$$ 209 182 141 99 67 54 58 65 60 40 19 9 8 8 13 25 32 20 -5 -21 -18 -10 -8 -7 3 16 16 4 -4 -10 -19 -27 -24 -8 -1 -19 -49 -69 -70 -67 -75 -96 -124 -150 -161 -150
7846a50K6J8NPK5M0L5K3J4Poj4mJ3J4nj3lJ2J0MPJ2Mj0j6j5k1k5rK0L0Rj0jK0K3J0%nj9l7
$$ -150 -124 -106 -101 -94 -69 -29 6 29 43 50 44 30 26 39 53 48 35 32 44 54 58 65 77 81 71 55 40 19 -6 -15 5 35 44 34 33 53 76 86 86 81 62 25
7828B5l3oK4L3J3j2k6k1j0rk4m1l4KM6P0O0L2kk5l2j8RL6M4K6LqkLLNJ4K1J6ROOjjQJ9J7J1
$$ 25 -8 -14 10 43 56 44 18 -3 -13 -22 -46 -87 -121 -119 -73 -3 57 89 87 62 30 12 21 57 101 127 130 122 120 123 126 131 145 166 182 191 197 203 202 201 209 228 245 256
7809B56PKqj7j2%PJ3L2M6L7J2MJ7K2RkOJ9K8M0N7O4N2M5N7O9O5N0M6N9Q6J22J55J75J89K21
$$ 256 263 265 257 240 228 228 235 248 280 326 363 375 379 396 418 427 425 431 450 478 518 575 639 691 736 793 862 927 977 1023 1082 1168 1290 1445 1620 1809 2030
7793B030K62K98L47M52O07P74R71J274J723K304L061L981M674M334K440n10l186m508m431
$$ 2030 2292 2590 2937 3389 3996 4770 5741 7015 8738 11042 14103 18084 22758 27092 29532 29022 25836 21328 16897
7784A6897l661k832k146j589j166q88o93n36m24l61l10k49j98j68j40r9n4j8J1K3J0j8m4p6
$$ 16897 13236 10404 8258 6669 5503 4615 3922 3386 2962 2601 2291 2042 1844 1676 1536 1437 1383 1365 1376 1399 1409 1391 1347 1271
7774A271j18j44j14n3j5j9k9l2l9m9l9j4pj0J2N7Q0O5N2O1O8N8N7P9R9J06J21J47J62J67J92
$$ 1271 1153 1009 895 842 827 808 779 747 708 659 620 606 599 589 601 658 738 803 855 916 984 1042 1099 1178 1277 1383 1504 1651 1813 1980 2172
7761B172K47L07L82N01O58Q24J046J403J911K549L375M332M864M092J687j486l939m815m405
$$ 2172 2419 2726 3108 3609 4267 5091 6137 7540 9451 12000 15375 19707 24571 28663 30350 28864 24925 20110 15705
7752A5705l524k688j993j435j049q12o40m97l95l26k61k08j87j71j26p0n2o5p5o8o2n0k9j4
$$ 15705 12181 9493 7500 6065 5016 4204 3564 3067 2672 2346 2085 1877 1690 1519 1393 1323 1271 1206 1131 1063 1001 951 922 908
7742I08k6m2l5j5pj2j0opnJ1K2J5PJ2J2jNL7O3N7N8R3J31J29J14J21J32J25J39K16L07L55
$$ 908 882 840 805 790 783 771 761 755 748 743 754 776 791 798 810 822 821 826 863 926 983 1041 1134 1265 1394 1508 1629 1761 1886 2025 2241 2548 2903
7728B903L99N14O90Q79J120J494K020K701L575M459M674L443P79k209m175m627m069l238k481
$$ 2903 3302 3816 4506 5385 6505 7999 10019 12720 16295 20754 25428 28871 29650 27441 23266 18639 14570 11332 8851
7719H851j836j322r75p54n86m56l78l24k55j87j57j53j44j22j10j05r4q0p8q6q7p4n2k3LJ4
$$ 8851 7015 5693 4718 3964 3378 2922 2544 2220 1965 1778 1621 1468 1324 1202 1092 987 893 813 735 649 562 488 436 413 416 430
7708D30Pnj5k8m9n7m2k3k1l5l7j9PK8M2N0M5L0Rj4l2l7k8j3kJJK%lqj2roj1j8j5KK0J4j0l1
$$ 430 437 432 417 389 340 283 241 218 197 162 125 106 113 141 183 233 278 308 317 303 271 234 206 193 191 192 193 195 195 192 184 172 163 157 146 128 113 115 135 149 139 108
7690A08m3m6l2MM1M6J3k0j5J3K9J8JnKQMj5m4n8m3j0J4J6J2J0J5J0JKJ0J8J5J0RJ1Lj8l3l5
$$ 108 65 19 -13 -9 32 78 91 71 56 69 98 116 117 112 114 122 126 111 67 9 -34 -44 -30 -14 -2 8 23 33 34 36 46 64 79 89 98 109 112 94 61 26
7673B6k4j5j1kJ2K2L0L7M0K4pl0k9j7j1j4j3kJ3J7J7J3J0RLnj0mPJ4PknJROok1k8k0pjmmO
$$ 26 2 -13 -24 -26 -14 8 38 75 115 139 132 102 73 56 45 31 18 16 29 46 63 76 86 95 98 93 83 79 86 100 107 105 100 101 110 116 110 89 61 41 34 33 29 25 31
7653C1K2K9K5J3lj7j9pMMj0k2k5k0j1nMJ5L3M8M2J7j2k2j3k%nqrj2j5j0JP%j9k9j8OJ9J6R
$$ 31 53 82 107 120 117 100 81 74 78 82 72 50 25 5 -6 -11 -7 8 41 89 131 148 136 114 101 99 99 94 86 77 65 50 40 41 48 48 29 0 -18 -12 7 23 32
7634C2J1J7Roj4rmlpnMJ6J7Kk2l3l0k8k9k3ML4L9K1PJ2K2K3J5Lj4l4m2l3j9j2nJ4L3L0PmJ
$$ 32 43 60 69 63 49 40 36 33 26 21 25 41 58 60 38 5 -25 -53 -82 -105 -101 -67 -28 -7 0 12 34 57 72 75 61 27 -15 -48 -67 -79 -84 -70 -37 -7 0 -4 -3
7616cJ0Jj9l0k2j0rj0mQJ7J8J9K0J3Jj3j8j7j2kQJ0POJ2J6J2J4J9J6lk1j6LJ0nk2k6k4j3J
$$ -3 7 8 -11 -41 -63 -73 -82 -92 -96 -88 -71 -53 -34 -14 -1 0 -13 -31 -48 -60 -62 -54 -44 -37 -31 -19 -3 9 23 42 58 55 34 18 21 31 26 4 -22 -46 -59 -58
7598e8J2J1jrnjjJ0L2L7J2k1k3JJ7Nj7k2rNJ2J4K4L2K3mk7k2PK2J1opkj5l8m4k6pmqjJ1J8
$$ -58 -46 -35 -36 -45 -50 -51 -52 -42 -10 27 39 18 -5 -4 13 18 1 -21 -30 -25 -13 1 25 57 80 76 49 27 34 56 67 61 54 52 37 -1 -45 -71 -78 -82 -90 -91 -80 -62
7579f2J6J3RJnjJ1K0J7Nrj2ppj6k6k4qQJ9K8L0J9nk1j7JJ4J8K1K4J7Lljkk0l9l4jL4M3K5J
$$ -62 -46 -33 -24 -23 -28 -29 -18 2 19 24 15 3 -4 -11 -27 -53 -77 -85 -77 -58 -30 0 19 14 -7 -24 -23 -9 9 30 54 71 74 71 70 68 48 9 -25 -26 8 51 76 77
7560G7j4k2k6k3rJ0J9K0K4L1L1J9MLRJ2Mqk3l9m7l9j4PJ7K0K6L3K9Rj4k2j2KPjj6k5k3j5p
$$ 77 63 41 15 -8 -17 -7 12 32 56 87 118 137 141 144 153 165 169 161 138 99 52 13 -1 6 23 43 69 102 131 140 126 104 92 94 101 100 84 59 36 21 14
7542A4mprj2j1lLRJ5K7L6L1J2KJ2K8K9J3KKLrk1k3j5j0j4j4MK7L5J9j1l0l2k4j8j3oqj6j3
$$ 14 10 3 -6 -18 -29 -32 -29 -20 -5 22 58 89 101 103 115 143 172 185 187 189 192 183 162 139 124 114 100 86 90 117 152 171 160 130 98 74 56 43 37 29 13 0
7524@PL5L7J7OJ5K3J4NJ4K4Rj9l0k4k5m2n6m4k2jJ4K6K6J8J2J6J4kj6j1QJ8J3RK0L1K8Oj6
$$ 0 7 42 79 96 102 117 140 154 159 173 197 206 187 157 133 108 66 10 -34 -56 -57 -43 -17 9 27 39 55 69 67 51 40 48 66 79 88 108 139 167 173 157
7506A57k7k3j1mllKJ1J3%j6k0mJ8K0%k0j8lLrk1j7mJlj1k0k2qJ5K8J9KjRJ3OMJ4K4J0k1m4
$$ 157 130 107 96 92 89 86 88 99 112 112 96 76 72 90 110 110 90 72 69 72 63 42 25 21 22 19 8 -12 -34 -42 -27 1 20 22 21 30 43 49 53 67 91 101 80 36
7487C6m1k5j2j1rJJ0Nj3k3pK6N1N2L8J8%j4k0j9j1ljnj0j3j5j8j6j2pmjQJ3J1NMJ0QJmmj1
$$ 36 -5 -30 -42 -53 -62 -61 -51 -46 -59 -82 -89 -63 -12 40 78 96 96 82 62 43 32 29 28 23 13 0 -15 -33 -49 -61 -68 -72 -73 -65 -52 -41 -36 -32 -22 -14 -13 -17 -21 -32
7468c2k6l3j9JPmj0mJ1K8L4K4Jj1KK3K2Kj6j6nJMJ1J5K1K6K7J2j7l6l1j7j7k4k4j7j3j2rN
$$ -32 -58 -91 -110 -109 -102 -106 -116 -120 -109 -81 -47 -23 -22 -33 -31 -8 14 16 0 -16 -21 -20 -16 -5 10 31 57 84 96 79 43 12 -5 -22 -46 -70 -87 -100 -112 -121 -116
7450a16K2K9K4J2LPPj3m2n0k9nKKJ1K6K3QLJ6L5M5N0M5K1j1l1l6l9m4l8j6NRQJ6K2Qk3m2l0
$$ -116 -94 -65 -41 -29 -26 -19 -12 -25 -67 -117 -146 -151 -149 -147 -136 -110 -87 -79 -76 -60 -25 20 70 115 136 125 94 58 19 -25 -63 -79 -74 -65 -57 -41 -19 -11 -34 -76 -106
7432a06kJ2Jj1LM0O4N7L0J5J0ol3m1j9RJ3nk0k2k0j0QK7L5L6L0J6lj7pJ3J7kk0j9p%Ljj5l3
$$ -106 -108 -96 -95 -106 -103 -63 1 58 88 103 113 107 74 33 14 23 36 31 11 -11 -31 -41 -33 -6 29 65 95 111 108 91 84 97 114 112 92 73 66 66 69 68 53 20
7414B0l1lK0Rk3l6j8joqJ6M6M4J8jQK3K4Qpj8k4k2j1koj7j7rJLMLkpq%PQQJ2K1K7L0K3Rrj9
$$ 20 -11 -14 6 15 -8 -44 -62 -63 -69 -77 -61 -15 29 47 46 54 77 101 109 102 84 60 38 27 25 19 2 -15 -24 -23 -20 -16 -13 -15 -22 -30 -30 -23 -15 -7 5 26 53 83 106 115 106 87
7393H7j8q%%j0k4k8k0pMJ2K7M1L2Lk2k4j7k2k9j9RL2L0J8J1Qol4n7n2k1J4K7J1okJ8L4K7J3
$$ 87 69 61 61 61 51 27 -1 -21 -28 -24 -12 15 56 88 91 69 45 28 6 -23 -42 -33 -1 29 47 58 66 60 26 -31 -83 -104 -90 -63 -52 -58 -60 -42 -8 19 32
7376C2NRJ2J3J2J6K4K7J8ml2n0m6k3MK0K0J5J4J8J4%j5k1k1k0j6r%RJ5J9J5%k2l3k9k4k2j6
$$ 32 37 46 58 71 83 99 123 150 168 164 132 82 36 13 17 37 57 72 86 104 118 118 103 82 61 41 25 16 16 25 40 59 74 74 52 19 -10 -34 -56 -72
7358g2kJ3J6QJjmqj0mNRMJMJ1J2PNRJ3Nj1j6pPJ4J5J3RN%lqj0qjjopk%rk1j6%J0J0Lqk0k5
$$ -72 -74 -61 -45 -37 -36 -37 -41 -49 -59 -63 -58 -49 -45 -44 -40 -29 -17 -10 -5 4 17 22 11 -5 -12 -5 9 24 37 46 51 51 48 40 30 22 21 20 14 7 5 5 -4 -25 -41 -41 -31 -21 -18 -26 -46 -71
7336g1rJ6K6J5NQJ2Mj3k0j0%jnlMJ4K2K6K0NqqPJ7Oj7l2j7J0K8K3Qlj2k4k8k6k0k0j7JK0K5
$$ -71 -80 -64 -38 -23 -18 -10 2 6 -7 -27 -37 -37 -38 -43 -46 -42 -28 -6 20 40 45 37 29 36 53 59 42 10 -7 3 31 54 62 59 47 23 -5 -31 -51 -71 -88 -87 -67 -42
7317d2J6QPlk8n2n5l5mK6M5M6L3J9J4J1jj8k9k8k7k6k0qPJ4J5PkqlJ6L5L4J3j1k0j2lmpnQ
$$ -42 -26 -18 -11 -14 -42 -94 -149 -184 -188 -162 -117 -71 -38 -19 -5 6 5 -13 -42 -70 -97 -123 -143 -151 -144 -130 -115 -108 -110 -118 -121 -105 -70 -36 -23 -34 -54 -66 -69 -73 -80 -85 -77
7298g7J8K2J9J2NJ%ok1k8j7J1K8K3Kj5k0j7qJkj7k6j1K2M8N0L2Rrj8j3nMRJ4Pj1l2m2k6KK5
$$ -77 -59 -37 -18 -6 -1 0 0 -6 -27 -55 -72 -61 -33 -10 -8 -23 -43 -60 -68 -67 -69 -86 -112 -123 -101 -53 -3 29 38 29 11 -2 -7 -3 6 20 27 16 -16 -58 -84 -82 -57
7279e7K4RpnJ1K8L4K5Rj3k9k6mR%j7j4QJ8NrmJ0K0J5Qlj5j9pKkqnKj0k9k6OL2K2nj5jJ6J7
$$ -57 -33 -24 -31 -36 -25 3 37 62 71 58 29 3 -1 8 8 -9 -23 -15 3 8 -1 -5 5 25 40 48 45 30 11 4 6 4 -4 -9 -7 -17 -46 -72 -66 -34 -12 -17 -32 -33 -17 0
7260@J2J0J3J2%j9l4l6k1NK4L0K1Lj1j3qoj1j6j3NK9M9N7M3J8oj3j0oj0k1l5l9k8j1LRJ1J6
$$ 0 12 22 35 47 47 28 -6 -42 -63 -58 -34 -4 17 20 9 -4 -12 -18 -29 -45 -58 -53 -24 25 82 125 143 137 124 114 108 98 77 42 3 -25 -36 -33 -24 -13 3
7242CK0K0J8J9K2K5K5J4j4m9o5n4l1j2%%pj8j7kQMJK2N0N2K9Nkoj4j5KJ8J5JpolJJ4K5K3J5
$$ 3 23 43 61 80 102 127 152 166 152 103 38 -16 -47 -59 -59 -59 -66 -84 -101 -103 -95 -91 -90 -68 -18 34 63 68 66 60 46 31 33 51 66 67 60 54 51 52 66 91 114 129
7223A29J5J6Mj4j4J0K1Nk4l2k0rj0j3qpj4k6l1k5nJ2J1qk3j9okrnJ6L7L6J3j2l2l5k6j0OJ4
$$ 129 144 160 164 150 136 146 167 172 148 116 96 87 77 64 56 49 35 9 -22 -47 -52 -40 -29 -37 -60 -79 -85 -87 -96 -101 -85 -48 -12 1 -11 -43 -78 -104 -114 -108 -94
7205i4K2K7K2Mj2j2ork2k7j6MK1M0N8O3M6J8%nj1j4qK%j4j9nJ0Lj3j6jJ0OjKPLoj1rmRJ9J7
$$ -94 -72 -45 -23 -19 -31 -43 -49 -58 -80 -107 -123 -119 -98 -58 0 63 109 127 127 122 111 97 89 91 91 77 58 53 63 66 53 37 36 46 52 51 53 60 63 57 46 37 33 42 61 78
7185G8jk2k2j0rk1l0j8J3L7M1K7kk6k2RM1M0J7kNK2K6Rj1k3j9roj4k1j2QJ5Jj9k5j2QK7L8
$$ 78 77 55 33 23 14 -7 -37 -55 -42 -5 36 63 61 35 13 22 63 103 120 118 123 145 171 180 169 146 127 118 112 98 77 65 73 88 89 70 45 33 41 68 106
7167A06K6lk5k0lKqpJ3L0K8Rqj9l2m3m7m4k9pJ6L1L5M3N4M8K0pj1NRj2l4l3j4PJ5J1mk5m8
$$ 106 132 129 104 84 81 83 75 68 81 111 139 148 140 121 89 46 -1 -45 -74 -81 -65 -34 1 44 98 146 166 159 148 153 162 150 116 83 69 76 91 102 98 73 25
7149B5n5m0qJ9K8J7MLQRNkj2k4l2k0JPkqLJ0nk4k0J1L4K8QmmjQK3L8L8K0%j5j8j9j9k5l2k7
$$ 25 -30 -70 -78 -59 -31 -14 -10 -7 1 10 15 13 1 -23 -55 -75 -74 -67 -69 -77 -74 -64 -69 -93 -113 -102 -68 -40 -32 -36 -40 -41 -33 -10 28 66 86 86 71 53 34 15 -10 -42 -69
7130f9oK1L4K6J1LKjpj1mLJ0P%rj5k0j5qk%JJrk3l4l2k0kJ6L0K5Mj7k0oNNoj1pLJ3J1%pPK5
$$ -69 -75 -54 -20 6 17 20 22 21 14 3 -1 2 12 19 19 10 -5 -25 -40 -48 -50 -50 -49 -48 -57 -80 -114 -146 -166 -168 -152 -122 -97 -93 -110 -130 -136 -131 -126 -132 -143 -150 -147 -134 -123 -123 -130 -123 -98
7109i8K6Mj4lK3L4J8mj1n%KPK0L0L4K2Pkj2k5l2k3oLrj7JK7K8Kk9l9k6q%qk3k6mL2M8L0NK
$$ -98 -72 -68 -82 -85 -62 -28 -10 -14 -25 -30 -30 -28 -21 -1 29 63 85 92 90 78 53 21 -2 -8 -5 -14 -31 -30 -3 25 27 -2 -41 -67 -75 -75 -83 -106 -132 -136 -104 -56 -26 -21 -19
7089a9J6J7KpJQkk3l4k4%K4L5K7J2LMRPKOJ2Pj4l5m3m1k5%K7L8K7J1%qj5j4n%j7l9l2J2M9
$$ -19 -3 14 16 9 10 18 16 -7 -41 -65 -65 -41 -6 21 33 36 40 49 56 58 64 76 83 69 34 -9 -50 -75 -75 -48 -10 17 28 28 20 5 -9 -14 -14 -31 -70 -102 -90 -41
7070d1M1LmK5N1L5ok6j4%ok5k9j3NJ8J9J1jj2j2p%Jkon%J1J9K0J6Mj2l2m7n0l1jK5L8L8L6
$$ -41 0 3 -1 24 75 110 104 78 64 64 58 33 4 -9 -4 14 33 44 43 31 19 12 12 13 11 5 0 0 11 30 50 66 70 58 26 -21 -71 -102 -103 -78 -40 -2 34
7051C4L5K7Pj6l0l0j8lPO%jLJpqJ0K5J4j6l2j6NMj8l7l3j5QK5L2K8K1J5RKnj2k1k6k1pMK%
$$ 34 69 96 103 87 57 27 9 6 13 19 19 18 21 22 15 7 17 42 56 40 8 -8 -3 1 -17 -54 -87 -102 -94 -69 -37 -9 12 27 36 38 33 21 0 -26 -47 -54 -50 -48 -48
7032d8J2K8L2K9M0O4P0M1jk9m0m4m4l0j6k1m1n1m1k1oJQJ1J1J1J4J9J9J9J9J6OjNRKj0rNJ5
$$ -48 -36 -8 24 53 93 157 227 268 267 238 198 154 110 80 64 43 2 -49 -90 -111 -117 -116 -108 -97 -86 -75 -61 -42 -23 -4 15 31 37 36 41 50 52 42 33 38 53
7014E3Qnj1j2j0p%%moLK0L0J8ok4k0JJ7Rj4k9k6j9j5j1kKnj0lJ3K0J9K3K3J2j1k0pJ1J8R%
$$ 53 61 56 45 33 23 16 16 16 12 6 9 29 59 77 71 47 27 28 45 54 40 11 -15 -34 -49 -60 -62 -60 -65 -75 -78 -65 -45 -26 -3 20 32 21 1 -6 5 23 32 32
6995C2mojPR%j1j5j4j2qlj1k8l0JM5O3N3L6K6J4qk2j5JOlj3j5j1oj1k6l6k8OL8M6L6J6pk9
$$ 32 28 22 21 28 37 37 26 11 -3 -15 -23 -26 -37 -65 -95 -94 -49 14 67 103 129 143 135 113 98 99 105 102 89 74 63 57 46 20 -16 -44 -38 0 46 82 98 91 62
6976F2m3l7k7k6l1l1k1mJ6L8N2N4M9L9K1j1m0m4k4qqj2mJ0J5J8K6K9J6lj3qoj2j8j6j7k4l0
$$ 62 19 -18 -45 -71 -102 -133 -154 -158 -142 -104 -52 2 51 90 111 100 60 16 -8 -16 -24 -36 -40 -30 -15 3 29 58 74 71 58 50 44 32 14 -2 -19 -43 -73
6960g3k0KJ5Qpj3nKLRK9N1N0J7j9l1k2j8k6k9j7QL3M8M9L5Oj9k4j6j2j5j1J2L6L2%k8k6nJ1
$$ -73 -93 -91 -76 -68 -75 -88 -93 -91 -88 -79 -50 1 51 68 49 18 -4 -22 -48 -77 -94 -86 -53 -5 44 79 85 66 42 26 14 -1 -12 0 36 68 68 40 14 9 20
6942B0Lj3k1k1j5pJLmj9k7k7j9j3lJ3K3K5K4L4M8N0L3J2PJ0%k5m6l8rJ2J6MkJMLNK3M4M3J7
$$ 20 23 10 -11 -32 -47 -54 -53 -50 -54 -73 -100 -127 -146 -159 -162 -149 -126 -101 -77 -43 5 55 88 100 107 117 117 92 46 8 -1 11 27 31 29 30 34 37 42 65 109 152 169
6923A69j7k7j1J1K5K5J0j3l1k8pJ5J8QJ%jnj1qJjj7l5m1l0k2k3j9NL7M9L4J5J1J8J2j0k9l3
$$ 169 152 125 114 125 150 175 185 172 141 113 106 121 139 147 148 148 147 142 131 123 124 123 106 71 30 0 -22 -45 -64 -59 -22 27 61 76 87 105 117 107 78 45
6906D5k7j8nMOkj4k2k2j3lMMJNJ0J2LnnLQLpj3j0%PQQJ8K6J8jj2%J4Pj3k2j3lj1l1l8k0J3
$$ 45 18 0 -5 -1 5 3 -11 -33 -55 -68 -71 -67 -63 -62 -57 -47 -35 -32 -37 -42 -39 -31 -28 -35 -48 -58 -58 -51 -43 -35 -17 9 27 26 14 14 28 35 22 0 -13 -16 -27 -58 -96 -116 -103
6885a03L5L6K4K0K3K2RjKROpj3qjjjJMMPRPkj5k3k6j7%J3J8J5J6J7Lk2l2j3RLk4l6k2%J0J4
$$ -103 -68 -32 -8 12 35 57 66 65 67 76 82 75 62 54 53 52 51 52 56 60 67 76 83 81 66 43 17 0 0 13 31 46 62 79 82 60 28 15 24 27 3 -33 -55 -55 -45 -31
6865c1K4K4Lk9m4l0oJ4K3K4J5JlQK5M1M8M3J6k4n2m8k8j7k1k1mJ5J8J1NK%oj5j9qJ5L3K8n
$$ -31 -7 17 20 -9 -53 -83 -89 -75 -52 -28 -13 -12 -15 -7 18 59 107 150 166 142 90 42 14 -3 -24 -45 -49 -34 -16 -5 0 2 2 -4 -19 -38 -46 -31 2 30 25
6848B5l3l5qJ6K6K2J1j1k8k6kJ7Qj5k1mJ3J0pj1KK1L3L7K6kl6n3m2j1J0Nrj3nMNKllRL2N7
$$ 25 -8 -43 -51 -35 -9 13 24 13 -15 -41 -43 -26 -18 -33 -54 -58 -45 -35 -42 -53 -51 -30 3 40 66 64 28 -25 -67 -78 -68 -63 -72 -85 -90 -86 -81 -79 -82 -85 -76 -44 13
6829A3O6M7J0k1l2j9KJ6J5Njlnrj4j7k1k9l0k4pRJ3Mj0j7mJ3J8Jj7j8pLOJ2K4K7J1j4l2k9
$$ 13 79 126 136 115 83 64 66 82 97 102 101 98 93 84 70 53 32 3 -27 -51 -58 -49 -36 -32 -42 -59 -63 -50 -32 -31 -48 -66 -73 -70 -64 -52 -28 -1 10 -4 -36 -65
6811f5j8oRK6L7L0RqnJ3K4K1J5J6J9J8J0Jqj8k1rJ2J8Nj5k7k9k8k3j3njqj6k2j8mJ7K9K1L
$$ -65 -83 -89 -80 -54 -17 13 22 14 9 22 46 67 82 98 117 135 145 146 138 120 99 90 102 120 125 110 83 54 26 3 -10 -15 -16 -24 -40 -62 -80 -84 -67 -38 -17 -14
6793a4j3j8j8j3%J3J2lj1LK9L9K3j1l2k4QL3K7pl4l3rOPRK3L5K7Kj8k2j4nj%MJ6K5K2Q%jo
$$ -14 -27 -45 -63 -76 -76 -63 -51 -54 -65 -62 -33 6 29 18 -14 -38 -30 3 30 23 -11 -44 -53 -47 -40 -31 -8 27 54 56 38 16 2 -3 -4 -4 0 16 41 63 71 71 70 64
6774F4j8k0JK2J5j4l0k0pj1j7kK4L3K5J4Qjj3j5%J5J4ONJ3J7J5J2Mj6l6l8j5J1K0J5J0OJm
$$ 64 46 26 27 49 64 50 20 0 -7 -18 -35 -37 -13 20 45 59 67 66 53 38 38 53 67 73 78 91 108 123 135 139 123 87 49 34 45 65 80 90 96 97 93
6756I3KJ2Pj5k6pJ9K1%qNJ3ol3l9j7QK4L2L4K6Oj5l1m1l9k5nLKMOjj3j0J3L2K4lk3l1l6l7
$$ 93 95 107 114 99 73 66 85 106 106 98 103 116 110 77 38 21 29 53 85 119 145 151 136 105 64 25 0 -5 -2 0 4 10 9 -4 -14 -1 31 55 52 29 -2 -38 -75
6737g5k5mPQORJ1J2J9L2M2L4J6Jlljpk9n3o5n1k6mQJ5J1mj7qJ6K9K2J0RJ2Qoj4j0mpj5j9j3
$$ -75 -100 -104 -97 -89 -83 -74 -63 -51 -32 0 42 76 92 93 90 87 86 79 50 -3 -68 -119 -145 -149 -141 -126 -115 -119 -136 -144 -128 -99 -77 -67 -58 -46 -38 -44 -58 -68 -72 -79 -94 -113 -126
6718a26nKJ5L1L6K1lnJ4K3lm5o1m5j8%K2M5N3L7J4QR%j4j3n%kMJ7K2J2lrqj3j7k2j9pJ5L4
$$ -126 -131 -129 -114 -83 -47 -26 -29 -34 -20 3 0 -45 -106 -151 -169 -169 -147 -102 -49 -12 2 10 19 19 5 -8 -13 -13 -15 -11 6 28 40 37 28 20 7 -10 -32 -51 -58 -43 -9
6699iL9K3Jj0qJJ1J7J1pk8l8k7pJ1K1K3J8J5Ook0k4k1j4nQJ7J3ORJ6Oj3j8KK3K0LjQJ3J4J6
$$ -9 30 53 54 44 36 37 48 65 76 69 41 3 -24 -31 -20 1 24 42 57 63 57 37 13 -8 -22 -27 -19 -2 11 17 26 42 48 35 17 19 42 62 65 64 72 85 99 115
6680A15J3pl0l3j2kj8l8l8j8MK0L3L0J3JNK0K3J3PJ4J8J5RL%nj1j6k6l5l0j7pj0j4qMJ1Nj
$$ 115 128 121 91 58 46 44 26 -12 -50 -68 -64 -44 -11 19 32 33 38 58 81 94 101 115 133 148 157 160 160 155 144 128 102 67 37 20 13 3 -11 -19 -15 -4 1 0
6662@%J1K4K2Kk0k0kJ6J2pj8j0PJ4J2Nnj9k9k5lK0K3J6Mmj3j4oJ7M3N1L6Jk2j9MJ3%j6j2l
$$ 0 0 11 35 57 59 39 19 17 33 45 38 20 10 17 31 43 48 43 24 -5 -30 -33 -13 10 26 30 26 13 -1 -7 10 53 104 140 141 119 100 104 117 117 101 89 86
6643H6qk1j7LJ6J4J1J5J0pk6l1l4l6k6KK6K4J1PJ3Oj1j4JJ4J4Nlqj6j9j6j3j0j0j5k1j3OK4
$$ 86 78 57 40 43 59 73 84 99 109 102 76 45 11 -25 -51 -49 -23 1 12 19 32 38 27 13 14 28 42 47 44 36 20 1 -15 -28 -38 -48 -63 -84 -97 -91 -67
6625f7K0MjPJ1KnkPNlj2j9j5OL5M1K0lmRJ1ok1k2j4kLJj1k1j9qOJ6K4L2L0J1j7l6l5j3J0K5
$$ -67 -47 -43 -44 -37 -26 -24 -29 -31 -24 -19 -22 -34 -53 -68 -62 -27 14 34 31 27 36 47 41 20 -2 -16 -18 -15 -14 -25 -46 -65 -73 -67 -51 -27 5 35 46 29 -7 -42 -55 -45 -20
6606b0K7L0K9K4J2%j3k7m0m7m7l9k5kK2K7J2pj2kJ2K3K7J7pk7k5lK4L8K8Nj6j9lJ0QLLMj0
$$ -20 7 37 66 90 102 102 89 62 22 -25 -72 -111 -136 -138 -116 -89 -77 -84 -96 -98 -86 -63 -36 -19 -26 -53 -78 -81 -57 -19 9 14 -2 -21 -24 -14 -6 -3 0 4 -6
6588fk7k1KK3K8K2J5Ooj2rqj2j8k0j7oOJ2PlkNJ1RKLJ0J4J6J7K1K8K9J4j0k6k7j8j5j1mRJ5
$$ -6 -33 -54 -52 -29 -1 21 36 42 36 24 15 7 -5 -23 -43 -60 -66 -60 -48 -41 -44 -46 -41 -30 -21 -19 -16 -6 8 24 41 62 90 119 133 123 97 70 52 37 26 22 31 46
6569D6J8K0J6jk0k9k8k3j7nJmrLK2K3P%QQk0n2n7l1p%nmKJ2K4L6M0L3K4J8J3Kj0j5lJ1J6Q
$$ 46 64 84 100 99 79 50 22 -1 -18 -23 -22 -26 -35 -32 -10 13 20 20 28 36 16 -36 -93 -124 -131 -131 -136 -140 -138 -126 -102 -66 -26 7 31 49 62 64 54 39 36 47 63 71
6550G1KOPnj5jK7L4Ll3m1k1opolmj1j2kJj0j5JK0K3J6K0L8M5K7lk3k9l2l7l6k7j0PK0K3J5
$$ 71 73 79 86 81 66 65 92 126 129 96 55 34 28 21 15 12 8 -3 -15 -17 -16 -26 -41 -40 -20 3 19 39 77 122 149 146 123 94 62 25 -11 -38 -48 -41 -21 2 17
6531A7lj8k8l0k5rQJ2KolPJ3J4J6K1K1J8J2Moj6k6l6l6j7RJ9Nj0kJ7K3J3QJ2Nj1j8p%rj3L
$$ 17 14 -4 -32 -62 -87 -96 -88 -76 -74 -80 -83 -76 -63 -49 -33 -12 9 27 39 43 37 21 -5 -41 -77 -94 -85 -66 -61 -71 -73 -56 -33 -20 -12 0 5 -6 -24 -31 -31 -40 -53 -50
6512e0K2K1J5K4L8K8kk3k3j7k0k2k0j6j0JRMj6k8k0ojqj9k2j5MK0J5kj0JJ2J1MMQOMJ0K7L7
$$ -50 -28 -7 8 32 70 98 96 73 50 33 13 -9 -29 -45 -55 -54 -45 -41 -57 -85 -105 -111 -112 -120 -139 -161 -176 -172 -152 -137 -139 -149 -148 -136 -125 -121 -117 -109 -103 -99 -89 -62 -25
6494b5L8L3K1lk7l4j4J1K4K2J8J5jk5l7k8j3j2j8j7mQJ2J7L0L3K0ok6k6j7nJ%oj5k9m1l9j7
$$ -25 13 46 67 64 37 3 -11 0 24 46 64 79 78 53 16 -12 -25 -37 -55 -72 -76 -68 -56 -39 -9 24 44 38 12 -14 -31 -36 -35 -35 -41 -56 -85 -126 -165 -182
6476a82J3L3L7L6L7K9K0K2L4K8kl0k3JOj3k3j1QJ5J4J2MopOJ0ok2k1j2rj3rMJ5J6J3Krj1K
$$ -182 -169 -136 -99 -63 -26 3 23 45 79 107 105 75 52 53 59 46 23 12 20 35 49 61 65 59 52 58 68 62 40 19 7 -2 -15 -24 -20 -5 11 24 26 17 6 8
6458HJ8J8PPK0L0J8rk8l2k6k5k1j1J1K3J5KNJ6Rk0m2l4mJ7J8J0%j7l3m0k5RM9O7N2J4j7k0
$$ 8 26 44 51 58 78 108 126 117 89 57 31 6 -15 -26 -15 8 23 25 30 46 55 35 -7 -41 -45 -28 -10 0 0 -17 -50 -90 -115 -106 -57 10 62 76 59 39
6441C9mJ3J7Pj0j2QK9K2j1l3k0Jkj5j4MJ2Mkloj6j6mPKonKO%lJJ2J7Qrj4lJ3K1J9J9J3%j5
$$ 39 35 48 65 72 62 50 58 87 109 98 65 45 46 44 29 15 19 31 35 33 30 24 8 -8 -12 -5 -3 -9 -14 -12 -6 -6 -9 -8 4 21 29 20 6 3 16 37 56 75 88 88 73
6420G3j7qjJK%qj4rNRlj1rJRJ2J0KmjQJk1l6k8oJ1J3RPQRQkj3j7j7j9j9pK1L9L0Lj5qOJ6J6
$$ 73 56 48 47 48 50 50 42 28 19 24 33 30 19 10 11 20 32 42 44 40 39 47 48 27 -9 -37 -43 -32 -19 -10 -3 5 14 22 20 7 -10 -27 -46 -65 -72 -51 -12 18 21 6 -2 4 20 36
6399C6J7K0J7Lj0j4lP%j7k9k6j9j2jJ1J4LlJPPRJ7K3Qj9l3k2KK0K9K2Oj1j5pKjj7k2rRJ3n
$$ 36 53 73 90 93 83 69 66 73 73 56 27 1 -18 -30 -31 -20 -6 -3 -6 -5 2 9 18 35 58 66 47 14 -8 -6 14 43 65 71 60 45 38 40 39 22 0 -9 0 13 8
6379Hk1j5J2L1L0J5M%NJ3J6PmJJ3J0j2l2l3k5k2j5OL2M2L0J2mj5j5mRQjlMJ2RMOJ2J3Nrk0
$$ 8 -13 -28 -16 15 45 60 64 64 69 82 98 105 101 102 115 125 113 81 48 23 1 -14 -8 24 66 96 108 104 89 74 70 79 87 86 83 87 99 108 112 118 130 143 148 139 119
6360A19j7j2k3n0o5m4kK5K3J2J1J9K3J7LnJJ1Lk7m2k2J8L0Oj8j6mqk1j8nLMJ1K3K4J2MJ0J8
$$ 119 102 90 67 17 -48 -92 -94 -69 -46 -34 -23 -4 19 36 39 34 35 46 49 22 -20 -42 -24 6 12 -6 -22 -26 -34 -55 -73 -78 -75 -71 -60 -37 -13 -1 3 13 31
6342C1J6QJnokJ0K1K8K7K1Mj7l4l7k9j7lJ5K5J9kj6rRJ0j2l1k9rQJ0%j0j7j6rJJ1J6J5QOJ1
$$ 31 47 55 56 51 45 43 53 74 102 129 150 154 137 103 66 37 20 17 32 57 76 74 58 49 58 68 56 25 -4 -13 -5 5 5 -5 -22 -38 -47 -46 -35 -19 -4 4 10 21
6323B1K4L2K8Qj5k8k6j4lJ0K7M4M6K5Kokrj7qJ7K9K2K2M3O2O3O0O9Q4R6J18J58J91K28L08
$$ 21 45 77 105 113 98 70 44 30 27 37 64 108 154 179 181 175 173 164 147 139 156 185 207 229 272 334 397 457 526 610 706 824 982 1173 1401 1709
6307A709M50O22Q21J091J360J350P97j71j054j435j324j030p70n71m01k79k17j74j26r1q0
$$ 1709 2159 2781 3602 4693 6053 7403 8200 8029 6975 5540 4216 3186 2416 1845 1444 1165 948 774 648 557 477
6298D77o6l2npj8j5qpj2j5k4m5n8m8l0k9m2m7m4l1qK0L8K8%j9rJ6L7L8K3Mj2j9k3j9pLjj5
$$ 477 411 379 374 367 349 334 326 319 307 292 268 223 165 117 87 58 16 -31 -75 -106 -114 -94 -56 -28 -28 -47 -56 -40 -3 35 58 62 50 31 8 -11 -18 -15 -16 -31
6281c1j9kK2L6M3M2L8K1pl0l6k4qJkojJoj6j7j0pj2j2o%%%Lkj7k4j6jQJ7K8L0J8krpm%QJ6
$$ -31 -50 -52 -30 6 49 91 129 150 143 113 77 53 45 46 44 38 37 38 32 16 -1 -11 -18 -30 -42 -48 -48 -48 -48 -45 -47 -64 -88 -104 -105 -97 -80 -52 -22 -4 -6 -15 -22 -26 -26 -18 -2
6260bJ3Plj1j6j2J1K7K2nk1j0QJ5J1J2Qol2m2l4j4%PK3M5N9M4J0j9k9k8k7j8LL3N3M4J3j6
$$ -2 11 18 15 4 -12 -24 -13 14 36 31 10 0 8 23 34 46 54 48 16 -26 -60 -74 -74 -67 -44 1 60 104 114 95 66 38 11 -7 -4 29 82 126 139 123
6243A23k2qNkk1l1k5j4qjJ4L5M1K9Mj5k0pJ1K1J7J1J3J6Rpj6j0%jj0j6j5j3j6k4k3rQPj1k9
$$ 123 101 93 98 96 75 44 19 5 -3 -4 10 45 86 115 119 104 84 77 88 109 126 137 150 166 175 168 152 142 142 141 131 115 100 87 71 47 24 15 23 30 19 -10
6225a0k3RL9M7K6rk6j6J0K0Mj2nQJk4l9l2j4qmQJ9J8QK%pk1l2k6oJ8K9K6K2K2K3Pk1l4k0O
$$ -10 -33 -24 15 62 88 79 53 37 47 67 71 59 54 62 63 39 0 -32 -46 -54 -58 -50 -31 -13 -5 -3 -3 -10 -31 -63 -89 -95 -77 -48 -22 0 22 45 52 31 -3 -23 -17
6206a7J7Mrj4j0rpKJ3J6J0jj4k2k7j7NL2M5M1L3K8K2Prj3rj0k4l6l0j8j2j4nJ7L4L1J8J1J3
$$ -17 0 4 -5 -19 -29 -38 -45 -43 -30 -14 -4 -5 -19 -41 -68 -85 -80 -48 -3 38 71 99 121 128 119 106 97 87 63 27 -3 -21 -33 -47 -52 -35 -1 30 48 59 72
6188G2J1KqqkmrnJ4K7K1%qJJ0ol3m4k9kJ4J4J5J6J4MnoJRJ3J2Ooj7j7mJ4K0J0lrnlj2k4k4
$$ 72 83 85 77 69 67 63 54 49 63 90 111 111 103 104 114 108 75 31 2 0 14 28 43 59 73 77 72 66 67 76 89 101 107 101 84 67 63 77 97 107 104 95 90 87 75 51 27
6168B7jK9M5L3Pk3m1m4k6LK4K4J0nqKK2L8M1K6Lj1k0k9l3k0%J4J2RPjk8o2p4n9k3J8N1O3M6
$$ 27 26 55 100 133 140 117 76 32 6 9 33 57 67 62 54 56 78 116 157 183 186 175 155 126 93 73 73 87 99 108 115 114 86 24 -50 -109 -132 -114 -63 0 46
6150D6J0j7j8kJ1Oqj4qOJ2mk9m9m6k5kQQQJ3K1J5%j0MK6L6K0mj1lMKnj0j7k2j8kK0K7J7kj7
$$ 46 56 39 21 19 30 36 28 14 6 12 24 20 -9 -58 -104 -129 -131 -123 -115 -107 -94 -73 -58 -58 -68 -64 -38 -2 18 14 3 0 4 6 1 -9 -26 -48 -66 -68 -48 -21 -4 -6 -23
6131b3k2j9oJ3L0L4K9J2j0k1j7jJ2J9K9L9L8J8qk3k4k6l2l1j3LROjpqpkjqj3j5j3romj0k3
$$ -23 -45 -64 -70 -57 -27 7 36 48 38 17 0 -1 11 30 59 98 136 154 146 123 99 73 41 10 -3 0 9 15 14 7 -1 -8 -10 -11 -19 -32 -47 -60 -69 -75 -79 -89 -112
6112a12k1PM8O4M1Mj6pRJ5OmnJ0K8L5J9j3l7m0k7j9k8l6k5MK7K9J8J1J5K9M1L9J6k1m2l0M
$$ -112 -133 -126 -78 -14 27 31 15 8 17 32 38 34 29 39 67 102 121 108 71 31 4 -15 -43 -79 -104 -100 -73 -44 -26 -15 0 29 70 109 125 104 62 32 36
6095C6K7K5Lj7k0jK6L4J3k0l0j2QNj1k2k1j2jJ7L5L7J7pj7j0jkolLKooOJ3jk7l3j4J4K2Rj3
$$ 36 63 88 91 74 54 53 79 113 126 106 76 64 72 77 66 44 23 11 10 27 62 99 116 109 92 82 81 79 73 70 73 75 69 63 69 82 81 54 21 7 21 43 52 39
6076C9l1l1j9jNqj7rJ5L1K4Kj6k0j3lNPNQK0L2L3J3j6l7l4k5j8k7l5k7jK2K3OjJ3L3L7K8K2
$$ 39 8 -23 -42 -43 -38 -46 -63 -72 -57 -26 -2 0 -16 -36 -49 -52 -47 -40 -35 -27 -7 25 58 71 55 18 -16 -41 -59 -86 -121 -148 -149 -127 -104 -98 -99 -86 -53 -16 12 34
6058C4J6%j7qK3M2K4JJ0L8M1Pl2m8m6m2l7k9k8l3k5NL7M2J8mnKJ1J7K0Oj9l0j7JNoj5j4j0
$$ 34 50 50 33 25 48 90 114 115 125 163 204 211 179 131 85 43 6 -23 -51 -84 -109 -104 -67 -25 -7 -11 -16 -14 -3 14 34 40 21 -9 -26 -25 -20 -26 -41 -55 -65
6040f5jJ8L9L8J6qj6j8k8l7k5MK5K8K6K4J6Jj0j2j7l9n2m1j9nkOJ4RKJ1L4N1M8M6M5L3Nk4
$$ -65 -66 -48 -9 29 45 37 21 3 -25 -62 -87 -83 -58 -30 -4 20 36 37 27 15 -2 -41 -93 -134 -153 -158 -160 -154 -140 -131 -129 -118 -84 -33 15 61 106 139 144 120
6023A20k7j6qo%J7K9L2J9ml1n0n1l4j7jQJ0QPQOJjQJ3J1J1J4Ok3n4o3n5m4l3mL7N8M4J8QJ8
$$ 120 93 77 69 63 63 80 109 141 160 156 125 75 24 -10 -27 -28 -20 -10 -2 5 13 19 20 19 27 40 51 62 76 82 59 5 -58 -113 -157 -190 -194 -157 -99 -55 -37 -29 -11
6004a1K2J6QKpj5j7j1lNJ1J9K5K0Lj5k7k5j3jMKKOJ1Kk2m1l2oJ0OOK9N4N4K8%j2j7k4k3j2
$$ -11 11 27 35 37 30 15 -2 -13 -16 -11 0 19 44 64 67 52 25 0 -13 -14 -10 -8 -6 0 11 13 -9 -50 -82 -88 -78 -72 -66 -37 17 71 99 99 87 70 46 23 11
5986A1lm%J5L4L5K3J4J0PKoj4k2k3j2lj1k7k7j1PJ0J2J5J6Orj2qormRJ9J2%KJ5J8ll6n5m8
$$ 11 8 4 4 19 53 88 111 125 135 142 144 138 124 102 79 67 64 53 26 -1 -12 -5 5 17 32 48 54 45 33 25 19 10 6 15 34 46 46 48 63 81 78 42 -13 -61
5966f1k1MJ0lj0kJ7K0QmKJ3J1lj5rMK1L2L2J0k0l0j4%%j0pNJ6J2KqmJ1K6J7j3l4j7J2J7rl0
$$ -61 -82 -78 -68 -71 -81 -83 -66 -46 -38 -42 -40 -27 -16 -19 -34 -43 -39 -18 14 46 56 36 6 -8 -8 -8 -18 -25 -20 -4 8 10 2 -2 9 35 52 39 5 -12 0 17 8 -22
5947b2k6oKloJPROlj8l1k6JL4M5L5J6Jj0j1JK3L6J8k1n2m9k2J2K8K5J4QRJ1Nknqj4j6qMRP
$$ -22 -48 -54 -52 -55 -61 -60 -53 -44 -38 -41 -59 -90 -116 -115 -81 -36 -1 15 16 6 -5 -4 19 55 73 52 0 -49 -71 -59 -31 -6 8 16 25 36 41 39 34 26 12 -4 -12 -8 1 8
5927HKJoj6j8jK0K7J8jk3l6l5j5LQRJ5K3J8RjmkOJ5J3jj8k5k3j4KK1K3Jk2k0OK3J3klPK1K7
$$ 8 10 11 5 -11 -29 -30 -10 17 35 34 11 -25 -60 -75 -72 -64 -55 -40 -17 1 10 9 5 3 9 24 37 36 18 -7 -30 -44 -42 -21 2 3 -19 -39 -33 -10 3 1 -2 5 26 53
5907E3J8kj6j8j0qj0jJ6J5mj8j2jKklpj2j0JOmj2%J4J2JJJ5K5K9L5L9K8Jk4l3k8j5JRnl0m0
$$ 53 71 69 53 35 25 17 7 6 22 37 33 15 3 2 4 2 -1 -8 -20 -30 -29 -23 -27 -39 -39 -25 -13 -12 -11 4 29 58 93 132 160 161 137 104 76 61 62 71 66 36 -4
5888dl4j8kJ5L0K5RJJ2J9Mk1k5j1kj1j8qJ0K3K8L1K9J3j0k5k0oKnj2pPJ8K0J8J9K3K0J1nk1
$$ -4 -38 -56 -58 -43 -13 12 21 22 34 53 57 36 11 0 -2 -13 -31 -39 -29 -6 22 53 82 95 85 60 40 34 36 31 19 12 19 37 57 75 94 117 137 148 143 122
5870A22l7m6m6l7j6RK6K7K3K0J9J3J0J6L0L2J1j8k8j3NMj9m4n6m9l4j2RK8L0J5jo%jj2j6j0
$$ 122 85 39 -7 -44 -60 -51 -25 2 25 45 64 77 87 103 133 165 176 158 130 117 122 126 107 63 7 -42 -76 -88 -79 -51 -21 -6 -7 -13 -13 -14 -26 -42 -52
5853e2nj4k2j2OJ0ok0j1PJ6QjJRJ3Qjnnqj3j2NK6L5K7Qj0j8j5nMJ3K3L5M1K8PjNQkj0lPJj4
$$ -52 -57 -71 -93 -105 -99 -89 -95 -115 -126 -119 -103 -95 -96 -95 -86 -73 -65 -66 -71 -76 -84 -97 -109 -104 -78 -43 -16 -8 -18 -36 -51 -56 -52 -39 -16 19 60 88 95 94 99 107 105 95 92 99 100 86
5832H6j9j3j1j5j8lJ9L4K9Pk3m4m2j8J2K2J2nj3j2mNJ6K9L6L3K4J4kk0l3k5jK1J7%j0kLnj2
$$ 86 67 54 43 28 10 7 26 60 89 96 73 29 -13 -31 -19 3 15 10 -3 -15 -19 -14 2 31 67 100 124 138 136 116 83 58 57 78 95 95 85 83 86 81 69
5814F9lJ3J2j0l5l7j8KJ3K0J6lk9l7j5K5M6L1KmJ6L3K3lk2k9l3l3k4qKmj4j3%O%qnLMnj0j
$$ 69 66 79 91 81 46 9 -9 -7 6 26 42 39 10 -27 -42 -17 29 60 62 58 74 107 130 127 105 76 43 10 -14 -22 -20 -24 -38 -51 -51 -45 -45 -53 -58 -55 -51 -56 -66 -67
5795f7PKj3j5MK1J9MnnljNJ5J8J3QPMKJ1K2K0jk6l6k8j5LJ9K6K0Rkj1j6j1PK1J6J%J3J9J3
$$ -67 -60 -58 -71 -86 -82 -61 -42 -38 -43 -48 -51 -52 -47 -32 -14 -1 7 14 18 20 31 53 73 72 46 10 -18 -33 -30 -11 15 35 44 42 31 15 4 11 32 48 49 49 62 81 94
5776I4Jkjmj3k2k7k5j4jNkj1j1kK%lJQJ0OMJ3K7K5J0llPROQJ6K3K6K1J3Llknk2m8n5l0JJ0
$$ 94 95 93 92 88 75 53 26 1 -13 -14 -9 -11 -22 -33 -35 -33 -33 -36 -35 -27 -17 -11 -7 6 33 58 68 65 62 69 78 84 92 108 131 157 178 191 194 191 189 184 162 114 59 29 30 40
5755D0lj5j1knj8k7j3J3L0K0rl4l6j2J5K8K1Jj2qRK6K5J7Nqj8k4k8k9l1k8j7MK1K8K2RLRK0
$$ 40 37 22 11 9 4 -14 -41 -54 -41 -11 9 0 -34 -70 -82 -67 -39 -18 -17 -29 -37 -28 -2 23 40 45 37 19 -5 -33 -62 -93 -121 -138 -134 -113 -85 -63 -54 -51 -42 -22
5737b2K4K4K0J7Oj2k3j3J0K4J7%j6j8nJ4K4J2j0k1j4LJ5J7J2jj8l0l0k1j3j5j8j5jJ1J4J5
$$ -22 2 26 46 63 69 57 34 21 31 55 72 72 56 38 33 47 71 83 73 52 38 41 56 73 85 84 66 36 6 -15 -28 -43 -61 -76 -77 -66 -52 -37
5720c7K2K7K4Nj4j6j1ljMPLkMK1L1J9mk1j9jJ4J2rl0l1j5KQKqk0k6k0mKrk6k6oJ6L0L2K5R
$$ -37 -15 12 36 41 27 11 0 -3 -4 0 7 10 8 12 33 64 83 79 58 39 38 52 64 55 25 -6 -21 -19 -11 -9 -17 -37 -63 -83 -87 -85 -94 -120 -146 -152 -136 -106 -74 -49 -40
5701d0j0j9j5p%J2L3M7M3K1kk0l3l7k2PK5J7NRK7L9L7K3Oj3k4j6%Lj2k7l4m0m8m7k5%J5J9
$$ -40 -50 -69 -84 -91 -91 -79 -46 1 44 65 63 43 10 -27 -49 -42 -17 0 5 14 41 80 117 140 146 133 109 93 93 96 84 57 23 -17 -65 -112 -137 -137 -122 -103
5683a03K6L1J9nj8j1JMMJ0J3QmpkNNLjkknqoJOLrj4j1nKJ2K2K4Rqj2jMpk6l7l1rJ6K9K0lj3
$$ -103 -77 -46 -27 -32 -50 -61 -60 -56 -52 -42 -29 -21 -25 -32 -34 -29 -24 -21 -22 -24 -26 -31 -39 -45 -44 -38 -35 -44 -58 -69 -74 -72 -60 -38 -14 -5 -13 -25 -26 -22 -29 -55 -92 -123 -132 -116 -87 -67 -70 -83
5662h3kJ5K3J8J2J3Rpk7k9j8qnRL8N6M3Lk7l3k4j1KNj0l6m1j8J0J6NKRJ0LPK3L2J7j2l5l2
$$ -83 -85 -70 -47 -29 -17 -4 5 -2 -29 -58 -76 -84 -89 -80 -42 14 57 60 33 0 -24 -35 -33 -28 -38 -74 -115 -133 -123 -107 -102 -100 -91 -81 -78 -71 -48 -16 1 -11 -46 -78
5643g8j2J3L6M9N2L4jl2l9k8k2k8l8l3j4RK7L7L4J9jj7l3m0k3J3L6K6ORL3M0K4Lqj2j7j5r
$$ -78 -90 -77 -41 8 60 94 93 61 22 -6 -28 -56 -94 -127 -141 -132 -105 -68 -34 -15 -16 -33 -66 -106 -129 -116 -80 -54 -48 -39 -6 34 58 61 53 41 24 9 0
5627@j4k8l1j5LOON%j7k5j1J4K5K4K7L2L0J5LRK3L4L0Rj5k8k5k2k4k3rMkj1mJ6K3Pj0rPK2
$$ 0 -14 -42 -73 -88 -85 -79 -73 -68 -68 -85 -110 -121 -107 -82 -58 -31 1 31 46 49 58 81 115 145 154 139 111 86 64 40 17 8 12 10 -1 -5 11 34 41 31 22 29 51
5608E1L0L1J9Jj2rkjj0k4l5k8nJ6Nk5l8k0J0K1J7J6K0J7Moj0j0pNJ4J7J6K1K5J4j3l2k6oO
$$ 51 81 112 131 132 120 111 109 108 98 74 39 11 6 22 27 2 -36 -56 -46 -25 -8 8 28 45 49 43 33 23 16 21 35 52 68 89 114 128 115 83 57 51 57
5590E7kj2nJ6K3Kk8l4j1J1J4J1J4J5kj6j0OLk0k7nJ5Qj4k4j8lNJ4J8J6J6K6L8L8K1N%NNkj5
$$ 57 55 43 38 54 77 79 51 17 6 17 31 42 56 71 69 53 43 49 52 32 5 0 15 23 9 -15 -33 -36 -31 -17 1 17 33 59 97 135 156 161 161 166 171 169 154
5572A54k2k0j0oj1j6rKQPRJ5J8J7J7J4%k5m3l6pJ4J1j1k8k7j4k%klkLPJ2RKMJ1J3jk1k9j6
$$ 154 132 112 102 96 85 69 60 62 70 77 86 101 119 136 153 167 167 142 99 63 56 70 81 70 42 15 1 -1 -1 -3 -6 -8 -5 2 14 23 25 29 40 53 52 31 2 -14
5552a4KJ6K4K3J2nj5j5p%QJ6J6%k2k8j2PJ3Kj6j9j0NJ3J1O%ookNQkj0j0m%mj4k2k7k7j7NL6
$$ -14 -12 4 28 51 63 58 43 28 21 21 29 45 61 61 39 11 -1 6 19 21 5 -14 -24 -19 -6 5 11 11 5 -1 -3 2 10 8 -2 -12 -16 -16 -20 -34 -56 -83 -110 -127 -122 -86
5533h6N6M6J6j4j8ronKJ3Oj3k4j4%oj9j7LJ7J3Jrj2lJ0Rj0k7k6j1%PJ3J1nj9oK6M5L5K4K4
$$ -86 -30 16 32 18 0 -9 -15 -20 -18 -5 1 -12 -36 -50 -50 -56 -75 -92 -89 -72 -59 -58 -67 -79 -82 -72 -63 -73 -100 -126 -137 -137 -130 -117 -106 -111 -130 -136 -110 -65 -30 -6 18
5514A8L2K6J2Llj1j4lOlk5m3n1m1k1KJ4RMJ6L6L8K2Jj1j6j9k5l1l5l1j5jKPK8O0P5O4L0nk6
$$ 18 50 76 88 91 88 77 63 60 66 63 38 -5 -56 -97 -118 -116 -102 -93 -89 -73 -37 1 23 24 13 -3 -22 -47 -78 -113 -144 -159 -160 -158 -151 -123 -63 12 76 106 101 75
5496G5k3KL0L7K3J1QQjojNnk6l4k3qj0k6l6l1j3jLMJ1J6J1Jlpj0qKJ6J6Lj3k1j6%K3L6L4K0
$$ 75 52 54 84 121 144 155 163 171 170 164 163 168 163 137 103 80 72 62 36 0 -31 -44 -45 -42 -38 -27 -11 0 1 -2 -9 -19 -27 -25 -9 7 10 -3 -24 -40 -40 -17 19 53 73
5476G3Nj1k9l9l1nJ1J4K2M2M5J7k4m4l7j7JJ2Pj5l0j6J0J5JpMJ7J2Klkqj7j9j1%RJ4J6J2O
$$ 73 78 67 38 -1 -32 -37 -26 -12 10 52 97 114 90 46 9 -8 -7 5 12 -3 -33 -49 -39 -24 -23 -30 -26 -9 3 5 2 0 -8 -25 -44 -55 -55 -46 -32 -16 -4 2
5458BONmk1l6l6k4oPJ4J8J8J9K3K8K7K1J6J5Mk2m9n1l0nRJ2J2Pnj3oQJ6J0Mj%KJpj5j5LK3
$$ 2 8 13 9 -12 -48 -84 -108 -114 -107 -93 -75 -57 -38 -15 13 40 61 77 92 96 74 25 -26 -56 -61 -52 -40 -28 -21 -26 -39 -45 -37 -21 -11 -7 -8 -8 -6 -5 -12 -27 -42 -39 -16
5438a6K9K9K4J3j5m1m4k2MJ9L0L8L2J0j1j7j1l%kmnkkpj0pknqJJ2RooJ6L2K1MOK2K1jk5l7
$$ -16 13 42 66 79 64 23 -21 -43 -39 -20 10 48 80 90 79 62 51 48 48 46 42 37 35 33 26 16 9 7 2 -6 -5 7 16 10 4 20 52 73 77 83 105 126 125 100 63
5419F3l8k7rNLmMK0K6J0j1j6rllljJLLkj2j8j8j3j0oQK5L4K7QnnjJlrj0mJ0K1J2j7l8l3pJ0
$$ 63 25 -2 -11 -6 -3 -7 -3 17 43 53 42 26 17 14 11 8 7 8 11 14 12 0 -18 -36 -49 -59 -65 -57 -32 2 29 37 32 27 26 27 24 15 5 1 11 32 44 27 -11 -44 -51 -41
5398d1Lj2k2k4j7OL5M8M0K8K2Rk1m7m0j9j0j6rK0M3L8J6loKJ1J2PLJ3K6K2%j6j5j5k3l0k4
$$ -41 -38 -50 -72 -96 -113 -107 -72 -24 16 44 66 75 54 7 -33 -52 -62 -78 -87 -67 -24 14 30 27 21 23 34 46 53 56 69 95 117 117 101 86 71 48 18 -6
5381fj3qj0o%%rk0k5k7j6OL4N0M7K6LpjQPJOK0K3Qj0j7j6j6j7j6k2k2mL1M9K6j4k8qJ7K1R
$$ -6 -19 -27 -37 -43 -43 -43 -52 -72 -97 -124 -140 -134 -100 -50 -3 23 26 19 18 26 33 34 40 60 83 91 81 64 48 32 15 -1 -23 -45 -49 -18 31 57 43 15 7 24 45 54
5362E4Jpj6k3j9j2j5k8m4m4k2J4M2M4L0J6J4J6J3NlonLRQok7m8o2o1l9qJ8L6M8N3M7K9J8J4
$$ 54 55 48 32 9 -10 -22 -37 -65 -109 -153 -175 -161 -119 -75 -45 -29 -15 1 14 19 16 10 5 8 17 25 19 -8 -56 -118 -179 -218 -226 -208 -172 -124 -71 -24 5 23 37
5344C7Mj2j9lK3L3K4J2Njrj5j0JQJ0Lqj7j7mOOmj1oNJ4J4J5J1Lj1k2k1j5k0l1l7k4PL7N1M4
$$ 37 41 29 10 7 30 63 87 99 104 103 94 79 69 70 78 88 91 83 66 49 45 51 57 53 42 36 41 55 69 84 95 98 87 65 44 29 9 -22 -59 -83 -76 -39 12 56
5325E6K2MJOQNMO%j2j7j0nj1j7j2nj3k9l3j6NJ1RJ0J4J5J3K1L2L4K2lk3k8j2J2K3J8PL%pj5
$$ 56 78 82 83 89 97 102 106 112 112 100 83 73 68 57 40 28 23 10 -19 -52 -68 -63 -52 -43 -33 -19 -4 9 30 62 96 118 115 92 64 52 64 87 105 112 115 115 108 93
5306I3k1k0j8j8j5j3rlJ1K1K1Oj3k2j5mQJ3J1%rpjJrk4k5qJ3K0J0mj1rrj0nMPjj2j2jJ0Pk
$$ 93 72 52 34 16 1 -12 -21 -24 -13 8 29 35 22 0 -15 -19 -11 2 13 13 4 -3 -4 -3 -12 -36 -61 -69 -56 -36 -26 -30 -41 -50 -59 -69 -74 -70 -63 -64 -76 -88 -89 -79 -72 -74
5286g4jJ5L2K9J7J1K1L4K4kk2k9l2l3k4kJ3J4J1J9K1Mk2k6j0OOJRK1K7K2J4Nmql%KKOMj0k3
$$ -74 -75 -60 -28 1 18 29 50 84 108 106 84 55 23 -10 -34 -36 -23 -9 2 21 42 46 24 -2 -12 -6 0 1 10 31 58 80 94 99 95 87 84 84 86 88 94 98 88 65
5267F5l0k5k0j6kJ6J9Kk5l5j5J8L0J3roJ5K7K2J2J0Mj9m3l7pK9M5M3K8J5J6K7K8Kl7n1l2p
$$ 65 35 10 -10 -26 -28 -12 7 9 -16 -51 -66 -48 -18 -5 -14 -20 -5 22 44 56 66 70 51 8 -29 -36 -7 38 81 109 124 140 167 195 197 160 109 77 70
5250G0pk3l5k7j1QK2K9K3RjllooKJ1J0ql4m2k3J7N0N4L0ol4m2l8k8j5lOPJLRJ1KnOK0J6Jo
$$ 70 63 40 5 -22 -33 -25 -3 26 49 58 57 54 51 45 39 41 52 62 54 20 -22 -45 -28 22 76 106 100 66 24 -14 -42 -57 -60 -54 -47 -46 -43 -34 -23 -21 -26 -20 0 16 17 11
5230A1QJ8J0lj0j4k0j8kNj0l5l7j5MJ2J6K1J4MMJ2Rj2k8l1k7k4qJ7K9J0j7j9JK0L1L7L7K4
$$ 11 19 37 47 44 34 20 0 -18 -20 -15 -25 -60 -97 -112 -108 -96 -80 -59 -45 -41 -37 -25 -16 -28 -56 -87 -114 -138 -146 -129 -100 -90 -107 -126 -125 -105 -74 -37 0 24
5213B4Lrj2j6k3j3J1K4J0j8k7qK3M0L7J9Jj1j4j4j4k1l5m5m3k6oPJ5K4L1K9K3K0J4jk2k6j5
$$ 24 27 18 6 -10 -33 -46 -35 -11 -1 -19 -46 -54 -31 9 46 65 66 55 41 27 13 -8 -43 -88 -131 -157 -163 -156 -141 -117 -86 -57 -34 -14 0 -1 -23 -49 -64
5196f4qk0l6l1lK5L2J9MLQJ5J8K2K3J5jj4j5j6k4l2k1PL1L3J7j0l1l6k0KOj1k2pK1L9L7K5
$$ -64 -72 -92 -128 -159 -162 -137 -105 -86 -82 -79 -71 -56 -38 -16 7 22 21 7 -8 -24 -48 -80 -101 -94 -63 -30 -13 -23 -54 -90 -110 -108 -102 -113 -135 -142 -121 -82 -45 -20
5178b0J1LMPPOJ4K7J6k3n8n6k5lMJ6L9M4K9J2J5J9Oj5k2j2monjjprkMNRK3L6L2Rk2l9l5k1
$$ -20 -9 -6 -2 5 12 18 32 59 75 52 -6 -62 -87 -90 -86 -70 -31 13 42 54 69 88 94 79 57 45 41 35 30 29 28 21 12 10 14 19 28 51 87 119 128 106 67 32 11
5159A1j3k0k5j3J1L1L5L5L7L2J5mj1lLkj7k0qNNoj1nKMJ0K3L2J5j7l9l2rOMkjLLknLJ7K2J3
$$ 11 -2 -22 -47 -60 -49 -18 17 52 89 121 136 132 121 118 121 119 102 82 74 79 84 78 67 62 64 68 78 101 133 148 131 92 60 51 57 61 59 58 61 64 62 57 60 77 99 112
5139A12lj0pmnpqqlPJ1mk9l8j8PJ2lk0k9k5qJ6L2K2mk4j7jQOKJLJ1J8J8Pj5k4k1j2j3k2k6
$$ 112 109 99 92 88 83 76 68 60 57 64 75 71 42 4 -14 -7 5 2 -18 -47 -72 -80 -64 -32 -10 -14 -38 -55 -56 -48 -42 -40 -39 -36 -25 -7 11 18 3 -21 -42 -54 -67 -89 -115
5119a15j4J2K8K8J5PLmj2qJ1L0K8J5ONlk0k5j2QRmj2qj%MJ7K1Mk1l0j1J0J6J0K%jLJ3K2K1
$$ -115 -129 -117 -89 -61 -46 -39 -36 -40 -52 -60 -49 -19 9 24 30 35 32 12 -13 -25 -17 -8 -12 -24 -32 -33 -33 -29 -12 9 13 -8 -38 -49 -39 -23 -13 -11 -11 -12 -9 4 26 47
5100D7J0K%klNJ7K1Oj7k8k2rJNLkooqj1mJ1K8L1J6%j0j5j9j4%Qlk3l4l2k6k1oK0M3M7L6K0
$$ 47 57 59 59 57 54 59 76 97 103 86 58 36 27 28 33 36 34 28 22 14 3 -1 10 38 69 85 85 75 60 41 27 27 35 32 9 -25 -57 -83 -104 -110 -90 -47 0 36 56
5081E6Opj2rkj%LMkj3j5kRJ2J8L3M6L3jk5k7k5l5m5l7pJ2Qj1k3k1qPK1L1K9J9Lk2m6n5l8n
$$ 56 62 55 43 34 32 31 31 34 38 36 23 8 6 15 27 45 78 124 157 156 131 104 79 44 -1 -38 -45 -33 -25 -36 -59 -80 -88 -81 -60 -29 0 19 22 0 -46 -101 -139 -144
5062a44K0K5J6QJ0K2L2K9J3ornqj7qK4N0L4rl7k9nRJ3J8K0Pj5k9k8k1k7l5l6k3pLOPJ0K0L5
$$ -144 -124 -99 -83 -75 -65 -43 -11 18 31 25 16 11 3 -14 -22 2 52 86 77 40 11 6 15 28 46 66 73 58 29 1 -20 -47 -82 -118 -141 -148 -145 -139 -132 -122 -102 -67
5044f7M2L4J9Lmj0j8k2j0J2K1J3lj4k1k4j5J4M4M7K5Mkjnq%J0RJKJ1J5Mj3k3k6k3j9j7k0j5
$$ -67 -25 9 28 31 27 17 -1 -23 -33 -21 0 13 10 -4 -25 -49 -64 -50 -6 41 66 70 68 67 62 54 54 64 73 74 76 87 102 106 93 70 44 21 2 -15 -35 -50
5025e0lNqk9l4j4Kkj1nJ5K9K7K5K5K4J4Nmj0j0lQJ3J2PKnj7k9l4k8j3llqj0kRJ8K5L7M5M0
$$ -50 -53 -48 -56 -85 -119 -133 -131 -133 -144 -149 -134 -105 -78 -53 -28 -4 10 15 11 1 -9 -12 -4 9 21 28 30 25 8 -21 -55 -83 -96 -99 -102 -110 -120 -122 -113 -95 -70 -33 12 52
5006E2K3J0PPmj6k2k2j5mJ3K4K0OnrpppojLNKnj2j2oQK3L0J9ql2m1m0m1l6j4J9M4N0M0K9K5
$$ 52 75 85 92 99 95 79 57 35 20 16 29 53 73 79 74 65 58 51 44 38 37 40 45 47 42 30 18 12 20 43 73 92 84 52 11 -29 -70 -106 -120 -101 -57 -7 33 62 87
4987H7K0J3jj6k3j8j2j7k3j8lJ1J8J5Nj4k8k5nJ0J8K4K8K3J6J8K0nm9o6l3J3K8RqnLMJ1K6
$$ 87 107 120 119 103 80 62 50 33 10 -8 -11 0 18 33 38 24 -4 -29 -34 -24 -6 18 46 69 85 103 123 118 69 3 -30 -17 11 20 12 7 10 14 25 51
4969E1L4K8J3ql3m6k8J0K5Kl2l2lK9M1M0L5K6Nk3m1l9j8JMrj6j7k7m7n7l8qRNNJ6K5K2J2K
$$ 51 85 113 126 118 85 39 11 21 46 48 16 -16 -19 10 51 91 126 152 157 134 93 54 36 37 41 32 16 -1 -28 -75 -132 -170 -178 -169 -164 -159 -143 -118 -96 -84 -82
4952h2ormOQLmjJ1K6L6L2J9PNJ0Plj0rj6l0l2pK4L2J6%kMQJ4K2J7j0l6l4mK6K7Qj0j4j5j4
$$ -82 -88 -97 -101 -95 -87 -84 -88 -89 -78 -52 -16 16 35 42 47 57 64 61 51 42 26 -4 -36 -43 -19 13 29 29 27 31 39 53 75 92 82 46 12 8 34 61 69 59 45 30 16
4932A6rQK6L0J4mpMJ2Kj8k8k7k0j6j0jMkj1j0LJ2MrrLJ1Pkj2j4j1JJ1J4J3K0L0L1J4oj2lQ
$$ 16 7 15 41 71 85 81 74 78 90 92 74 46 19 -1 -17 -27 -28 -24 -26 -37 -47 -44 -32 -28 -37 -46 -43 -32 -25 -27 -39 -53 -64 -63 -52 -38 -25 -5 25 56 70 64 52 49 57
4913E7J6J9J4Kpj6k9m4m2j7J4K5J0LPJ1mk0j5J2K9K6J0LJ0J6J4Rkk0l4l4j3J2K2J8Qkj5k7
$$ 57 73 92 106 108 101 85 56 12 -30 -47 -33 -8 2 5 12 23 19 -1 -16 -4 25 51 61 64 74 90 104 113 111 91 57 23 10 22 44 62 70 68 53 26
4895B6k9k4k0j6lK0L3K7J2%j2k5l7l3k5k9l6k1J2L1J9nj6j0%RJ5Ok0l6k2J6L9L3J3LRK0K5
$$ 26 -3 -27 -47 -63 -66 -46 -13 14 26 26 14 -11 -48 -81 -106 -135 -171 -192 -180 -149 -130 -135 -151 -161 -161 -152 -137 -131 -151 -187 -209 -193 -154 -121 -108 -105 -96 -76 -51
4878e1K3J8J4J6J4R%rj3j2nOJ1Kj5k7k9k1j1kLkj6k5k0%J8K0Ppj0kQRMmkJ2L4M9M6L0Oj4k8
$$ -51 -28 -10 4 20 34 43 43 34 21 9 4 10 21 23 8 -19 -48 -69 -80 -82 -79 -81 -97 -122 -142 -142 -124 -104 -97 -104 -114 -116 -108 -99 -95 -99 -101 -89 -55 -6 40 70 76 62 34
4859C4k6nK5L6K1NMPnj5%L4M7K1k0l8l3k3k0j8j3j1j2rLJ1Mj2k3j3QK0J5QJ2J6RoqKJ2QJo
$$ 34 8 3 28 64 85 90 94 101 96 81 81 115 162 183 163 125 92 69 49 31 18 7 -5 -14 -11 0 4 -8 -31 -44 -36 -16 -1 7 19 35 44 38 30 32 44 52 53 47
4840D7j6l1l2j2K1L7K8Kj7k0j3qj2k0k2j1LJ2K3L5L9L0J4jj3k3k6rJ8L6L8L2K7J6mk3l3l3
$$ 47 31 0 -32 -44 -23 14 42 44 27 7 -6 -14 -26 -46 -68 -79 -76 -64 -41 -6 33 63 77 76 63 40 14 5 23 59 97 129 156 172 168 145 112 79
4823G9l0k1j4j2j8l1l2k1jJ5J8J0PJ4K1K0K0K4K5Ok2l0j1QJj9j5RK7J6lnJ3K3J3j1k1rJ4K3
$$ 79 49 28 14 2 -16 -47 -79 -100 -101 -86 -68 -58 -51 -37 -16 4 24 48 73 79 57 27 16 24 25 6 -9 0 27 43 40 35 48 71 84 73 52 43 57 80
4806H0Oj8k1kJ2Lj8k0mRNJJ1K7L2K4J6J7J1rl3m3l4j2J1L4M0K3ol2l7k7j2JMlj9l0l5k8j5
$$ 80 86 68 47 45 57 60 42 22 18 27 32 33 44 71 103 127 143 160 171 162 129 86 52 40 51 85 125 148 142 110 73 46 34 35 39 36 17 -13 -48 -76 -91
4788i1jRRjj1lJ7L9M5L8K1J1QNjnmlmrqnlklqk1l0k4%K1K3J4KjJPJ4Qoj5pJ1K4K4J6Jk1l5
$$ -91 -92 -83 -74 -75 -86 -89 -72 -33 12 50 71 82 90 95 94 89 85 82 78 69 61 56 53 51 48 40 19 -11 -35 -35 -14 9 23 25 24 25 32 46 54 48 33 26 37 61 85 101 102 81 46
4767D6k9j4nmMJ5J3nj8j1%%ojJ4K3J6j2m2o2n2j7J2J2mpJ5L6L6K0RO%j1j5pKjj2rJ7L9L2j
$$ 46 17 3 -2 -6 -2 13 26 21 3 -8 -8 -8 -14 -15 -1 22 38 26 -16 -78 -130 -147 -135 -123 -127 -134 -119 -83 -47 -27 -18 -12 -12 -23 -38 -45 -43 -44 -56 -65 -48 -9 23 22
4748B2k7k1RL0K4Kj3rMJ3J2nk5l5k2NK7K5Qj6l2l5k5qNJ1J3J7K2K1J5J3Q%j2j8j4j1oPK4L6
$$ 22 -5 -26 -17 13 37 39 26 17 21 34 46 41 16 -19 -41 -36 -9 16 24 8 -24 -59 -84 -92 -87 -76 -63 -46 -24 -3 12 25 33 33 21 3 -11 -22 -28 -21 3 39
4730C9K6jl0m4l7rJ4J4nk4k6j3KK0L5L0Pj3qJ5K4K2J6J7Prj9j3orpJKj2k3j1RJ2jpOK0K1J1
$$ 39 65 64 34 -10 -47 -56 -42 -28 -33 -57 -83 -96 -94 -74 -39 -9 -2 -15 -23 -8 16 38 54 71 78 69 50 37 31 22 15 16 18 6 -17 -28 -19 -7 -8 -15 -9 11 32 43
4711D3Llj0j8j9j7j2lJkooKONOJ3J7Oj4l5m1l1j2OJ2J1QMmj1rJNNJ4L5N2M9K7PLRJ4Prk8l3
$$ 43 46 43 33 15 -4 -21 -33 -36 -35 -37 -43 -49 -47 -41 -36 -30 -17 0 6 -8 -43 -84 -115 -127 -121 -109 -98 -90 -86 -90 -101 -110 -109 -104 -99 -85 -50 2 51 78 85 88 97 111 118 109 81 48
4690D8k2jJ4J7Roj8j9j3rj5j7oJ0J3Jrrnoqprj0pPJ8J5mk2k7j5KJ4Qqj7j1%KjMJ3J2kpKJ1
$$ 48 26 25 39 56 65 59 41 22 9 0 -15 -32 -38 -28 -15 -14 -23 -32 -37 -43 -51 -58 -67 -77 -84 -77 -59 -44 -48 -70 -97 -112 -110 -96 -88 -96 -113 -124 -124 -122 -123 -119 -106 -94 -96 -103 -101 -90
4669i0QJJ2L3L9K3%j0j5k3l3l0j5n%PK1L1L3K6K3K0J4J1J1J0Moj5k1k2k0j6j4j1lKjokJ4K1
$$ -90 -82 -81 -69 -36 3 26 26 16 1 -22 -55 -85 -100 -105 -105 -98 -77 -46 -13 13 36 56 70 81 92 102 106 100 85 64 42 22 6 -8 -19 -22 -20 -21 -27 -29 -15 6
4651FJ1oj1jJmk0k8k7j4PL2M4L3Pj9k4j7rj2j8j3ljo%J3J7kj9j0J0J3kpQK4K2K0K5L1J5j4
$$ 6 17 11 0 -1 0 -4 -24 -52 -79 -93 -86 -54 -10 23 30 11 -13 -30 -39 -51 -69 -82 -85 -86 -92 -92 -79 -62 -64 -83 -93 -83 -70 -72 -79 -71 -47 -25 -5 20 51 66 52
4632E2l4l1j9oLKrk5k8j9nJOJ1K0K6J7mk5l2k0KK1K9K0nk7k2LK4K0JpNJ8J7NrpPK5L0K0J0
$$ 52 18 -13 -32 -38 -35 -33 -42 -67 -95 -114 -119 -118 -112 -101 -81 -55 -38 -42 -67 -99 -119 -117 -96 -67 -47 -52 -79 -101 -98 -74 -54 -53 -60 -55 -37 -20 -15 -24 -31 -24 1 31 51 61
4613F1RNj2k8k6oPQjj0j6j8pQJ1PNJ3J8J6J3Oj0k8k5mMpj9nK0K3RKMlk0k2jK4K6Oj2j3KJ6
$$ 61 70 75 63 35 9 3 10 18 17 7 -9 -27 -34 -26 -15 -8 -3 10 28 44 57 63 53 25 0 -4 0 -7 -26 -31 -11 12 21 23 27 24 4 -18 -19 5 31 37 25 12 14 30
4593C0K0Pnj0qj4l0l7k4JJ4J5J4J9K4K5J4lj6k0j2OK0K2Oj6k2qJ3J9Rjkkj3k5k6j6oljLJ0
$$ 30 50 57 52 42 34 20 -10 -47 -71 -70 -56 -41 -27 -8 16 41 55 52 36 16 4 10 30 52 58 42 20 12 25 44 53 52 50 48 35 10 -16 -32 -38 -41 -42 -39 -29
4575b9J4J5J2J2RKnj7k1j7jJ9K3J4%m%lj8k6j6QK8L4L3J9pl3l2lK4K0oj8jK4L1J3j2k6l0k4
$$ -29 -15 0 12 24 33 35 30 13 -8 -25 -26 -7 16 30 30 26 26 23 5 -21 -37 -29 -1 33 66 85 78 45 13 10 34 54 48 30 29 53 84 97 85 59 29 5
4556EnJ1J7Jj4mK3L4Pk7l5j7nmMK3L2Rk0k2%J5Roj5j1kQPj1k8k8j2LMKJK%LQOkpnjJJ0K5L3
$$ 5 0 11 28 29 15 11 34 68 75 48 13 -4 -9 -13 -9 14 46 55 35 13 13 28 37 31 16 5 3 11 18 7 -21 -49 -61 -58 -54 -52 -51 -49 -49 -46 -38 -32 -34 -41 -46 -47 -46 -36 -11 22
4535B2K9J9J1pl1m4k4J1K7K3J3J6J7Kk0l1k8k2j5qjmj5j8kK4L8K9J1KPJ0NlkKkrj0MJ9K5J8
$$ 22 51 70 81 74 43 -1 -25 -14 13 36 49 65 82 84 64 33 5 -17 -32 -40 -41 -45 -60 -78 -80 -56 -18 11 22 24 31 41 46 43 41 43 41 32 22 26 45 70 88
4516H8Kk1l4k6%J8Qj9l3k2JJ8K6L3L4J7j0l1l7l1k5j3lJkkJ1K5K6J7J2K0L0K8J9Lj3k3k4j7
$$ 88 90 69 35 9 9 27 35 16 -17 -39 -38 -20 6 39 73 90 80 49 12 -19 -44 -57 -60 -59 -61 -63 -52 -27 -1 16 28 48 78 106 125 128 115 92 68 51
4499E1j5k0k7l0k8k5j5LJ8K1K0K1J7ll0l8k5mNNjj6l0k9pK9N4N9M2J6rj9rJ1K4K5J0j0j7j
$$ 51 36 16 -11 -41 -69 -94 -109 -106 -88 -67 -47 -26 -9 -12 -42 -80 -105 -109 -104 -99 -100 -116 -146 -175 -182 -153 -99 -40 2 18 9 -10 -19 -8 16 41 51 41 24 23
4481B3K1K3Mj7k2k1k4k7j4PK3K7K8K2Pj3k3k1j2%J5K6J9KmNJ2O%MR%j9k1jK0K2NpkP%k8n8
$$ 23 44 67 71 54 32 11 -13 -40 -54 -47 -24 3 31 53 60 47 24 3 -9 -9 6 32 51 53 49 54 66 72 72 76 85 85 66 45 44 64 86 91 84 82 89 89 61 3
4462Co5m9k0%RJ1J1J1K0L7M8M8L8L1K3Pj7l7l3rJ5J9Nj0j8k0k7l1k7j8j5j3mJ8L7L6J9%j1
$$ 3 -62 -111 -131 -131 -122 -111 -100 -89 -69 -32 16 64 102 133 156 163 146 109 76 67 82 101 106 96 78 58 31 0 -27 -45 -60 -73 -77 -59 -22 14 33 33 22
4445B2j5pQK3K2J1QJ2Pj7m4m2j7%pk2j6NJ4mk6k1QL0K5PMK1L4K6jj9k4k3k9k9j6NJ5J0MPJ3
$$ 22 7 0 8 31 53 64 72 84 91 74 30 -12 -29 -29 -36 -58 -74 -69 -55 -59 -85 -106 -98 -68 -43 -36 -32 -11 23 49 48 29 5 -18 -47 -76 -92 -87 -72 -62 -58 -51 -38
4427c8K0K6L3K4ll3l7k4j2j1nQJ2jj1JJ9J0k3m2l1oJ4K8M0M1K4Pnj3k3k8j8%PMKPJ6K5K9J5
$$ -38 -18 8 41 65 62 29 -8 -32 -44 -55 -60 -52 -40 -41 -52 -51 -32 -22 -45 -87 -118 -124 -110 -82 -42 -1 23 30 25 12 -11 -39 -57 -57 -50 -46 -44 -37 -21 4 33 48
4408D8j4l1k2opk1j7J0L4L1K5L4M3K8ql5l7l1k6k1j0MJ3K2K7J5j0l4m4l9k2jJ9L3L5L3L2K7
$$ 48 34 3 -19 -25 -32 -53 -70 -60 -26 5 30 64 107 135 127 92 55 24 -2 -23 -33 -29 -16 6 33 48 38 4 -40 -79 -101 -102 -83 -50 -15 18 50 77
4392G7J2qk1k9l1l3l0k1mJ7L4L6K0kk0k4j7mK%oqqrj0lJ3L4M6M6L0Rlj1k1l0k3nkk2m3l6l
$$ 77 89 81 60 31 0 -33 -63 -84 -88 -71 -37 -1 19 17 -3 -27 -44 -48 -46 -46 -52 -60 -68 -77 -87 -90 -77 -43 3 49 79 88 85 74 53 23 0 -5 -7 -29 -72 -108 -111
4373a11J5OnLJ9K2K7M6O6N2%m6n2k7JJ1P%%J0K1K3J6Onj8k5j8%J3J4Mpj5j1MJ4Nj4k1pJ1J8
$$ -111 -96 -90 -95 -92 -73 -51 -24 22 88 140 140 94 42 15 16 27 34 34 34 44 65 88 104 110 105 87 62 44 44 57 71 75 68 53 42 46 60 65 51 30 23 34 52
4355E2J0jq%K0L6K4j0l7l5k1j2j3oKQRJ0PLjNPLprj0j0%J8L0J7j2j9JK1J8mk1k2oJ4K0Mk0
$$ 52 62 61 53 53 73 109 133 123 86 51 30 18 5 -1 1 9 18 28 35 38 37 42 49 52 45 36 26 16 16 34 64 81 69 50 51 72 90 86 65 43 37 51 71 75 55
4335E5l0j4J0K2J4qk6k2J0M8N5L4J0Jnk1l8l9l0k6k4j1J5L8N7O7O3L7jl0l9l7k8j1OQj4l5
$$ 55 25 11 21 43 57 49 23 1 11 59 114 148 158 159 154 133 95 56 26 0 -24 -35 -20 18 75 142 205 242 241 211 172 135 107 96 102 110 96 61
4319F1l8j9LJ6J8J6J2J0J0NkoolkOJ6K3K2K0K2K5J3j3l8m7l2mJ7J9NokRJ0Jj3k2k7k1lJ8J7
$$ 61 23 4 7 23 41 57 69 79 89 94 92 86 80 77 75 81 97 120 142 162 184 209 222 209 171 124 92 88 105 124 129 123 121 130 140 141 128 106 79 58 55 73 90
4300I0rl5k9KK4J6nj8k1k4k7j5PJ9J8J5J6Nj9l3k4nRK0L0K7kl5l6kL4M4M2L9K9Oj2oJ5K3L
$$ 90 81 46 17 19 43 59 54 36 15 -9 -36 -51 -44 -25 -7 8 24 29 10 -23 -47 -52 -43 -23 7 34 32 -3 -39 -41 -7 37 79 118 147 153 141 135 150 173 176
4282A76k7m4l8k0onj0qKNqk9l8k8oJ7L9M8L8Pk6l4j4J2L1L3K5J2%lMJ7K3J3nk1k9l1k5j0O
$$ 176 149 105 67 47 41 36 26 18 20 25 17 -12 -50 -78 -84 -67 -28 20 58 65 39 5 -9 3 34 67 92 104 104 101 105 122 145 158 153 132 103 72 47 37 43
4265D3NorPK1J5%lJ3K2J0j1k7l1l1k4j1OJ5J6J1NjpokQJ5J7J3ONJ3J8J1rk9l7l2k1j2jJ3K1
$$ 43 48 42 33 40 61 76 76 73 86 108 118 107 80 49 18 -6 -17 -11 4 20 31 36 35 28 22 20 28 43 60 73 79 84 97 115 126 117 88 51 19 -2 -14 -15 -2 19
4245A9J7Nk%PPMJ0K7L5K7J2Kqk5n3p8p4l7J7N9O6M5K1J2J1Mj2k6l1k3nJ8L5K9RokJ0J2Lj1
$$ 19 36 41 39 39 46 53 57 67 94 129 156 168 170 162 137 84 6 -68 -105 -88 -29 37 82 103 115 126 130 118 92 61 38 33 51 86 115 124 118 116 126 138 141 130
4227A30k6l4l1j5kkppnj4k7j8J5L8K5rl6m1k9rJ6L6L7J7mk1j8lJ7K7K7K4K7L1K0lk6l4l0k4
$$ 130 104 70 39 24 22 20 13 6 1 -13 -40 -58 -43 -5 20 11 -25 -66 -95 -104 -88 -52 -15 2 -2 -23 -41 -44 -27 0 27 51 78 109 129 126 100 66 36 12
4210A2k0k2k4k4j6KK2K7K1J6J7K0J9J1ONMkrj2r%PJ3J8J4JplJ1J1nk6l1k2j5j2rjOkk0l2k6
$$ 12 -8 -30 -54 -78 -94 -92 -70 -43 -22 -6 11 31 50 61 67 72 76 74 65 53 44 44 51 64 82 96 97 90 87 98 109 104 78 47 25 10 -2 -11 -12 -6 -8 -28 -60 -86
4191h6qKkmJ0K8K6Kj6qJ5K4J7NJkmKJ1J3jj8k0rjnj9j8OL7M7L4J8J0PjlJ2K8J9j1l3l2k1k0
$$ -86 -94 -92 -94 -98 -88 -60 -34 -32 -48 -56 -41 -17 0 5 6 4 0 2 13 26 25 7 -13 -22 -23 -28 -47 -65 -59 -22 25 59 77 87 94 93 90 102 130 149 138 105 73 52 32
4171C2k0nJ6K7K1Mj1k1k4k0j7j8j5j1ooj0j0mJ0K9M2M0L0J8J9J5kk8m3l8k4j0MJ7K2J8Pnj4
$$ 32 12 7 23 50 71 75 64 43 19 -1 -18 -36 -51 -62 -68 -74 -84 -94 -98 -88 -59 -17 23 53 71 90 105 103 75 32 -6 -30 -40 -36 -19 3 21 28 23 9
4154Ij6j6j5j6rJ4L8M0K2kj8k7k9k3j1j0k0k6j8pnjJ6K9J8oj0J3L4K3pk7k2oJ4K7K9J5KKR
$$ 9 -7 -23 -38 -54 -63 -49 -11 29 51 49 31 4 -25 -48 -59 -69 -89 -115 -133 -140 -145 -146 -130 -101 -83 -89 -99 -86 -52 -29 -36 -63 -85 -91 -77 -50 -21 -6 -4 -2 7
4136GKj8l2k1%RKqpKJ3K0J8Lj1j0%Kqk3k9k0KK4L2K0LojJ3K4K7J2j4k4mK3L0Oj0JJ6J1rj7
$$ 7 9 -9 -41 -62 -62 -53 -51 -59 -66 -64 -51 -31 -13 -10 -21 -31 -31 -29 -37 -60 -89 -109 -107 -83 -51 -31 -28 -34 -35 -22 2 29 41 27 3 -1 22 52 58 48 49 65 76 67 50
4117E0rkKKlj5k3j2J4L4K9J0pj7k1k0j2kJ1J9J6KpJJ8K1NrqJ%rj4oNPnk5l7l2j3Kjj7l0k2
$$ 50 41 39 41 43 40 25 2 -10 4 38 67 77 70 53 32 12 0 -2 9 28 44 46 39 40 58 79 84 75 67 68 68 59 45 39 44 51 46 21 -16 -48 -61 -59 -60 -77 -107 -129
4097a29JK1J9mk3k3pQJ9L8O1P1N9L1Kk1l6l8k7j2kNJ3J6J1Jpp%RJ3Kj4k1rRJ1mk1k9k9j7k
$$ -129 -128 -107 -88 -92 -115 -138 -145 -137 -118 -80 -19 52 111 142 144 123 87 49 22 10 8 13 26 42 53 54 47 40 40 49 62 64 50 29 20 29 40 36 15 -14 -43 -60 -62
4078f2ROkj0j5k3k0JL3N6N7M5J9j5l7l5rJ1J2ok2l0j7KJ3J0OJ3J9J0rpJ7M2L6J0j3j8rmj0
$$ -62 -53 -47 -49 -59 -74 -97 -117 -116 -83 -27 30 75 94 79 42 7 -2 9 21 15 -7 -37 -54 -52 -39 -29 -23 -10 9 19 10 3 20 62 98 108 95 77 68 64 54
4060E4j9j8nKrk3k6k3l1l9j6L9P9O8K7kppj0j2nnj0j0KJ7K7J9mk6k7oJ6K3J1Kqj9k6k3j2j1
$$ 54 35 17 12 14 5 -18 -44 -67 -98 -137 -153 -114 -35 33 60 58 51 44 34 22 17 12 2 -8 -6 11 38 57 53 27 0 -6 10 33 44 46 38 19 -7 -30 -42 -53
4042e3j6rPJ7K1L3M8M5J3j8k2plj3k1j6%J6K2J1qk0j6j1j9j9jK6L8L2J9J3Lj4k9l1k2j1jl
$$ -53 -69 -78 -71 -54 -33 0 48 93 106 88 66 59 56 43 22 6 6 22 44 55 47 27 11 0 -19 -38 -39 -13 25 57 76 89 92 78 49 18 -4 -15 -16 -19
4025a9j4k7k9k8k4j4J9N3O5M6L1K7J7j0l6l3oJ2J0JLJ2K1K1J1pj9k0j4k1l3l2pK1L3L1K5J2
$$ -19 -33 -60 -89 -117 -141 -155 -136 -83 -18 28 59 86 103 93 57 24 18 30 40 41 44 56 77 98 109 102 83 63 49 28 -5 -37 -44 -23 10 41 66 78
4008G8j1l2l0oJ1J5J5J8J5jj5j0LNqj6nOOjLJ5K1Rqk0k3k5k1j4JJ4J6RPJ5K3J0k2m7l6KL6
$$ 78 67 35 5 -1 10 25 40 58 73 72 57 47 50 55 47 31 26 32 38 37 40 55 76 85 77 57 34 9 -12 -26 -25 -11 5 14 21 36 59 69 47 0 -36 -34 2
3990BM5K4ok2k0mOJj0j6k3l0l6k8mJ9L3M1M4M1J9nj3jJ2J2Jrj4j4j3j6k0k5k4j3JJ3K1K0J5
$$ 2 47 71 65 43 23 19 25 26 16 0 -23 -53 -89 -117 -121 -102 -69 -28 16 57 76 71 58 57 69 81 82 73 59 45 32 16 -4 -29 -53 -66 -65 -52 -31 -11 4
3972DJ8K5K4Lk9m3k4J4L6M2M0M5M1J3k2l9l0j7j2qNJ8K0J1Koj8l0l2k4j6j1mLNLOJ6K0J2L
$$ 4 22 47 71 74 45 2 -22 -8 28 70 110 155 196 209 187 148 118 101 89 81 86 104 124 135 137 131 113 83 51 27 11 0 -4 -1 4 7 13 29 49 61 64
3954F4LOJj3j7j2j0j9k7k5j0MJ5K1K3K2K3K6L0K1LqnJlk2l7l6j9m%rj8j2J3L6M0K0mnJ1J9
$$ 64 67 73 74 61 44 32 22 3 -24 -49 -59 -55 -40 -19 4 26 49 75 105 126 129 121 116 117 114 92 55 19 0 -4 -4 -13 -31 -43 -30 6 46 66 62 57 68 87
3936H7QmMK5L1J2rqRJ3kk1k3j3j3j9j6kPoj9j4RK2J5KMJ1J1Joqj8l2l7k0OK1J8Jj7k3j3J1
$$ 87 95 91 95 120 151 163 154 146 155 168 166 145 122 109 96 77 61 59 66 60 41 27 36 58 73 75 79 90 101 102 96 88 70 38 1 -19 -13 8 26 27 10 -13 -26 -15
3917a5L1L4J6oj7j6mJ1K5L2L1K5J2rl2m1l2j5j3j8pK2M5L2jj5JJ8Qj3k1oJ2J7J3Ojpp%J2J7
$$ -15 16 50 66 60 43 27 23 34 59 91 122 147 159 150 118 77 45 30 17 -1 -8 14 59 91 90 75 76 94 102 89 68 62 74 91 104 110 109 102 95 95 107 124
3899A24Pj9m5m8k4jKlNK2K3QlNJ2kk5l2k4j7r%J0J3J8K3K2OrkJ7J8nl0l9l0qJ5K7K0Mnpj3
$$ 124 131 112 67 19 -5 -6 -4 -7 -2 20 43 51 48 53 65 63 38 6 -18 -35 -44 -44 -34 -21 -3 20 42 48 39 37 54 72 67 37 -2 -32 -40 -25 2 22 26 21 14 1
3880Aj8pK0L6K4Kj0j2j3j3mJ0J4Pj0k7m3m2k6j0okJ9M9O0L7jl1l4j6JLj1k2k0j2nQK4L1K3
$$ 1 -17 -24 -4 32 56 58 48 36 23 10 6 16 30 37 27 0 -43 -85 -111 -121 -127 -129 -110 -61 -1 36 35 4 -30 -46 -45 -42 -53 -75 -95 -107 -112 -104 -80 -49 -26
3862b6J5J9K9J8j0l2l0j3J2L1L3J1j2rJ7K8Nk6m0k9qJ3K8K9J1rj8j7j8j8j5lJ2L1M0K7mk2
$$ -26 -11 8 37 55 45 13 -17 -30 -18 13 46 57 45 36 53 81 86 60 20 -9 -17 -4 24 53 64 55 37 20 2 -16 -31 -34 -22 9 49 76 72 50
3845E0j5jnj8j4JLpj5kQMjRK5K9J4Kkklqj2j3j0mjl%J0K1K1J1mj6k7l0k5j5j0j0j2j3j8j8
$$ 50 35 34 29 11 -3 -2 1 -6 -21 -23 -15 -11 -12 -3 22 51 65 67 65 63 60 52 40 27 17 13 12 9 9 19 40 61 72 68 52 25 -5 -30 -45 -55 -65 -77 -90 -108 -126
3826a26kK8M6L9J6PJ5J9Pj7l2k9j1J1J9J1nj9j8pNJ2J3Qkj7k4j5QL0L0J3nnMPKJQJ1Kj0r%
$$ -126 -128 -100 -54 -15 1 8 23 42 49 32 0 -29 -40 -29 -10 1 -4 -23 -41 -48 -43 -31 -18 -10 -12 -29 -53 -68 -60 -30 0 13 8 3 7 14 16 17 25 36 38 28 19 19
3807A9ONmj6k2k2j4j4j6nK4M9M4J8kolnpjRJ5J4%k4l9l0pJ0RRJ8K5Rj9k8k1j2j1j0lJ0K8M2
$$ 19 25 30 26 10 -12 -34 -48 -62 -78 -83 -59 -10 34 52 50 44 41 36 29 28 37 52 66 66 42 3 -27 -34 -24 -15 -6 12 37 46 27 -1 -22 -34 -45 -55 -58 -48 -20 22
3788B2L9J6oqMQjlPJ1jj7k6k8k8j9LJ9J2mj0rnkPJ6J3KrplMJ1J5RkmKOQJ7L1L2J4j0k1j8j3
$$ 22 61 77 71 63 67 75 74 71 78 89 88 71 45 17 -11 -30 -27 -8 4 0 -10 -19 -24 -26 -19 -3 10 12 3 -4 -7 -3 8 23 32 30 26 28 34 42 59 90 122 136 126 105 87 74
3767G4j3j6j5nJ7L5L0kl6m5k3NJ3kk1k6j1MMj2k1j2J0K9L8L2J8LjRJ9J7Ojnj4k4k1jJ8J4o
$$ 74 61 45 30 25 42 77 107 105 69 24 1 6 19 17 -4 -30 -41 -37 -33 -45 -66 -78 -68 -39 -1 31 49 52 51 60 79 96 102 101 96 82 58 37 36 54 68 62
3749F2j7oOKj3j6mJ1QlnJ2L4M2K7Jj6j7oMQNOOOJmnkjnj4k4l5l7k4j0qk2l2k3lJ6K8L8M5M1
$$ 62 45 39 45 47 34 18 14 25 33 30 25 37 71 113 140 141 125 108 102 106 114 119 125 131 137 138 134 129 127 126 121 107 83 48 11 -13 -23 -31 -53 -85 -108 -111 -95 -67 -29 16 57
3728E7K2QNLj2l1l7k2%J6K6K5J3krnKOJ1J7K3K1J2%j2j6qLJj4k6k6k1k9l7l3j6mm%J3K5K7
$$ 57 79 87 92 95 83 52 15 -7 -7 9 35 60 73 71 62 57 59 65 76 93 116 137 149 149 137 121 113 116 117 103 77 51 30 1 -36 -69 -85 -89 -93 -93 -80 -55 -28
3710b8K3J9J8J1Joj0j2j4ro%RK0K4Rj9l5l0pJ0J5RQJ1J2KqnJ0K3J9Rjoj2j9j7rJPJ8L4N1N4
$$ -28 -5 14 32 43 44 38 28 16 2 -7 -13 -13 -4 16 40 49 30 -5 -35 -42 -32 -17 -8 0 11 23 25 17 12 22 45 64 73 72 66 54 35 18 9 10 17 35 69 120 174
3690A74L2ml3l7k3j4j7j4J0L6L6Ok4l2k0j0pqrj4k1j8kK0L6L4K2QK%mj4j8qJ1K4J2k2n3n0
$$ 174 206 202 169 132 109 95 78 64 74 110 146 152 128 96 76 66 59 51 42 28 7 -11 -13 7 43 77 99 107 109 109 105 91 73 65 76 100 112 90 37 -13
3673a3k0J0J0j0j8lJ5J6Lj0j7k0j2PK4K4RnnKJ2K3L8M1K7Kj9k9k6j4MJ5J5Rjj7m1n8o1m4j7
$$ -13 -33 -23 -13 -23 -41 -44 -29 -13 -10 -20 -37 -57 -69 -62 -38 -14 -5 -10 -15 -13 -1 22 60 101 128 130 111 82 56 42 46 61 76 85 84 67 26 -32 -93 -137 -154
3655a54J4L5L5J6kjJ7K8K5K2K6K0nl8m8l2nOL%KNjj8l2l3k3qOJ6K3K1J5J0NLJkj0k3k9k1j
$$ -154 -140 -105 -70 -54 -56 -57 -40 -12 13 35 61 81 76 38 -10 -42 -47 -41 -38 -38 -36 -31 -32 -50 -82 -115 -138 -146 -140 -124 -101 -80 -65 -55 -50 -47 -46 -48 -58 -81 -110 -131 -132
3636a32J4J8K1K8K4Jk1j4J2K4J0j0j5j6k2j7PK8L0J9K1L1K4Jj1KK5K8J6Koqrpprj1j7k5k8
$$ -132 -118 -100 -79 -51 -27 -26 -47 -61 -49 -25 -15 -25 -40 -56 -78 -95 -88 -60 -30 -11 10 41 65 66 55 57 82 110 126 128 122 114 105 98 91 82 71 54 29 1
3619ArJ3K4J1mnj%LJ4J8NpJJ4J0omQNk3m2l0rJPK1L5K6jk2k6j6lRJ6Rlqqonmj4l9n0k9NJ3
$$ 1 -8 5 29 40 36 31 30 30 33 47 65 70 63 64 78 88 82 78 86 91 68 26 -4 -13 -12 -5 16 51 77 76 54 28 12 9 18 34 43 40 32 24 18 13 9 -5 -44 -94 -123 -118 -105
3598a05ok1oJ4K2K0J9J3j2m2m5j3K9N1M2J4pqNK0K2J4jj1qJ2K7J5j4k4mJ9J7Jmnj6l1k8lJ0
$$ -105 -111 -132 -138 -124 -102 -82 -63 -50 -62 -104 -149 -162 -133 -82 -40 -26 -33 -41 -36 -16 6 20 19 8 0 12 39 54 40 16 12 31 48 49 45 40 24 -7 -35 -38 -28
3580b8%j1nMJpKK2L2K7J4PJl%J2K6K9K0Mj4k6l2l7l7l0j5lnj2mJ9L4K7J6J3J3kk5k4ML3L0
$$ -28 -28 -39 -44 -40 -39 -46 -44 -22 10 37 51 58 59 56 56 68 94 123 143 147 133 107 75 38 1 -29 -44 -47 -52 -64 -68 -49 -15 12 28 41 54 52 27 3 7 40 70
3561G0%k0j2QK0K1J8J1Jj0k0k5k4qJ2J9Pj0j3mMJ0K1K9J5j3k9k5k0k4k8k2romOJ8J7J1OJj0
$$ 70 70 50 38 46 66 87 105 116 117 107 87 62 38 30 42 61 68 58 45 41 45 55 76 105 120 107 78 53 33 9 -19 -41 -50 -56 -60 -54 -36 -19 -8 -2 -1 -11
3543a1j8j0LJj2j7o%%PK4L1J2okJ8L1K2J0OMoj4j0NJ4Nj6k3qJ1J4MjORok1j9jJ2Rqk2k5j5
$$ -11 -29 -39 -36 -35 -47 -64 -70 -70 -70 -63 -39 -8 4 -2 -4 14 45 67 77 83 87 81 67 57 62 76 81 65 42 34 45 59 63 62 68 77 71 50 31 30 42 51 43 21 -4 -19
3523a9JRjj8k1pJ2K6K7K0J0Llrj4j2mKMMRJ6J6J0JllJNMkkJ0K2K2Prk3l7m7m1j6J5L4L1K3
$$ -19 -18 -9 -10 -28 -49 -56 -44 -18 9 29 39 42 39 30 16 4 0 2 6 10 19 35 51 61 62 59 56 57 62 66 64 62 72 94 116 123 114 91 54 7 -34 -50 -35 -1 30 53
3503E3J7J5J5J3R%j4k7l3k7j6poKJ8L2L5K7J2lj4j6j1j2k2k7j3KNnj0qkRL4N9O1L3Omj0k5
$$ 53 70 85 100 113 122 122 108 81 48 21 5 -2 -8 -6 12 44 79 106 118 115 101 85 74 62 40 13 0 2 7 2 -8 -16 -18 -9 25 84 145 178 184 180 170 145
3485A45m1l3j0jj5k9k3kJ3J2lj3j1OK4L1K8J9Lj7l1k8j3llnJRRKKJ7K8K7J5J2K1K3Pj8k6j6
$$ 145 104 71 61 60 45 16 -7 -9 4 16 13 0 -11 -5 19 50 78 97 100 83 52 24 11 8 5 0 1 10 19 21 23 40 68 95 110 122 143 166 173 155 129 113
3467A13MJ4J3Lj6l8m8l3j1jrj6j1LJ1J1Nmj3j3kQNqj2KK3K8J2rj7j7j1kJ3K1J5M%QRnj7j1
$$ 113 117 131 144 147 131 93 45 12 1 0 -9 -25 -36 -33 -22 -11 -6 -10 -23 -36 -38 -30 -25 -33 -45 -43 -20 8 20 11 -6 -23 -34 -36 -23 -2 13 17 17 25 34 29 12 1
3448ALPKNJ6J9Kj7k2j1NJ0LkPK8M3L1kk4k2oKlojQJ3J0%j5k8k8j6jPNLNLrk3k3j4mpqQK9L0
$$ 1 4 11 13 18 34 53 55 38 16 5 10 20 23 21 28 56 99 130 128 104 82 76 78 75 69 68 76 89 99 99 84 56 28 12 11 18 23 26 31 34 25 2 -21 -35 -39 -46 -54 -46 -17 13
3426A3J2ljJ0J2JmLJ8K4Ol0n7n2k6KJ1J3J4J3Jj0j1noj1j0lLMNQJ1RNKJoj4k1k5k4k1j1MJ9
$$ 13 25 22 21 31 43 44 40 43 61 85 91 61 4 -48 -74 -72 -61 -48 -34 -21 -20 -30 -41 -46 -52 -63 -73 -76 -73 -69 -64 -56 -45 -36 -31 -29 -28 -34 -48 -69 -94 -118 -139 -150 -146 -127
3406a27K2J1lj1j7k4k2JL0L8J6rj1NK0J8R%lLJ5K0ProJ6L3L0Nk0k8j9lQJ1PLlmRL2M5L0Jj3
$$ -127 -105 -94 -97 -108 -125 -149 -171 -170 -140 -102 -86 -95 -106 -101 -81 -63 -54 -54 -57 -54 -39 -19 -12 -21 -27 -11 22 52 57 37 9 -10 -13 -5 6 13 16 13 9 18 50 95 125 126 113
3387A13j0pj9l0k2KK1K3Rpk4l5l3j5J8M5N0K9Mrj2j3j6j3j0j5k1j4LJ4J6J7K0J0j4k5nK4L0
$$ 113 103 96 77 47 25 27 48 71 80 73 49 14 -19 -34 -16 29 79 108 112 103 91 78 62 49 39 24 3 -11 -8 6 22 39 59 69 55 30 25 49 79
3370G9J2%NPqk6k7j1RJ8J3pk8l4j8mnj7j9qJ0K5L4M5M5L3K0J3J0OLOJ1Pqj7j3qj4k9l3k1o
$$ 79 91 91 96 103 95 69 42 31 40 58 71 64 36 2 -16 -20 -25 -42 -61 -69 -59 -34 0 45 90 123 143 156 166 172 175 181 192 199 191 174 161 153 139 110 77 56 50
3351E0%%jjmj1j7j4lJ1K5L1K9K1Ok0l9l1nJ2KrLK4J8j5m1l2rOPJ0J6J3jj1qjPJ5J7Qqj8j7
$$ 50 50 50 49 48 44 33 16 2 -1 10 35 66 95 116 122 102 63 32 27 39 41 32 35 59 77 62 21 -11 -20 -14 -7 3 19 32 31 20 12 11 18 33 50 58 50 32 15
3332A5j5j6j9j5poojRJ4J3RO%pmPJ3Lj1j8j4q%J0J8J5PMNQL%nj0j0PK3J4k2m5k9QK8K3J2%
$$ 15 0 -16 -35 -50 -57 -63 -69 -70 -61 -47 -34 -25 -19 -19 -26 -30 -23 -10 -7 -18 -36 -50 -58 -58 -48 -30 -15 -8 -4 1 9 12 12 7 -3 -13 -6 17 31 9 -36 -65 -57 -29 -6 6 6
3311Fj6k7j3J4J5j3l2j5J3J7LKJ4K4K7L7M6L5Nj2jK1K9J8%k0l5m0k7qNJ0J1Pkj5k1k6l1k5
$$ 6 -10 -37 -50 -36 -21 -34 -66 -81 -68 -51 -48 -46 -32 -8 19 56 102 137 142 130 129 150 179 197 197 177 142 102 75 67 72 82 93 100 98 83 62 36 5 -20
3294b0qJ0J3NJ0K8L5J1k4l7k0%OOJ0J7J4kj6k0qJ1K9K8J2opLRNMQNj7m2m8k5MK0J9J3RMnk0
$$ -20 -28 -18 -5 0 10 38 73 84 60 23 3 3 9 15 25 42 56 54 38 18 10 21 50 78 90 84 77 80 89 94 98 106 111 94 52 4 -21 -17 3 22 35 44 48 43 23
3274B3l1l2j9%J1RJJJ6L3L9K4Jj6k4k3k1j8j3nLPJ2J8K2J6NJOR%j2rJ1L0L1K1RMjoj2j7k3
$$ 23 -8 -40 -59 -59 -48 -39 -38 -37 -21 12 51 75 76 60 36 13 -8 -26 -39 -44 -41 -34 -22 -4 18 34 39 40 46 55 55 43 34 45 75 106 127 136 140 139 133 121 104 81
3255H1k0rJnk1k8k2j1qj1qJ0L8N9O2L3nk4j4QJ3mj8j5jQjj8k7k3qJJkJJ3K1J6jk0l6m3l8j2
$$ 81 61 52 53 48 27 -1 -23 -34 -42 -53 -61 -51 -13 46 108 141 136 112 98 106 119 115 97 82 81 89 88 70 43 20 12 13 14 12 13 26 47 63 62 42 6 -37 -75 -87
3236h7K0M1L4J0j4k0j8j2p%OMoj1nJ2L3M7M9L1Prj3mPJ4Oj7l6l1rJ2J4J5J6J3j0l5l8j8kQ
$$ -87 -67 -26 8 18 4 -16 -34 -46 -53 -53 -47 -43 -49 -60 -65 -53 -20 27 76 107 114 105 92 88 95 109 115 98 62 31 22 34 48 63 79 92 82 47 9 -9 -11 -3
3218cJ4L2M7M6L2J6PNjj6l4l8j8QJ6Kk2l5l8l0j6LJ4J4J4J6J3Jj0j4j8k3k2nJ1Nj2j4JJ4J5
$$ -3 11 43 90 136 168 184 191 196 195 179 145 107 89 97 113 115 93 58 20 -10 -26 -23 -9 5 19 35 48 49 39 25 7 -16 -38 -43 -32 -27 -39 -53 -52 -38 -23
3200b3J8L0L7J8j1k3j7j2j8k6k3j6j6j6j1KJ1J6K2L2L3K1KqJK2L2L1K0Nj4l1l7k6j1qj9k9
$$ -23 -5 25 62 80 69 46 29 17 -1 -27 -50 -66 -82 -98 -109 -107 -96 -80 -58 -26 7 28 30 22 23 45 77 108 128 133 119 88 51 25 14 6 -13 -42
3184d2j5J7M0L3J2mmkj1j7pONj4k4oK5L4J5j1k5k2j3oj0k0j8QM5N5K9KNK5K4KqLKk6n3m6j7
$$ -42 -57 -40 0 33 45 41 37 35 24 7 0 6 11 -3 -27 -33 -8 26 41 30 5 -17 -30 -36 -46 -66 -84 -76 -31 24 53 55 60 85 109 111 103 106 108 82 29 -17 -34
3165c4rk2k2PL5L6J7QNoj7j7lLKLJ4J7J3QJ2J6QmrlJkqj5j7pJ6L5K9Mk0k8l1l4l5k1JJ6J5
$$ -34 -43 -65 -87 -80 -45 -9 8 16 21 15 -2 -19 -22 -19 -17 -14 0 17 30 38 50 66 74 70 61 58 59 57 49 34 17 10 26 61 90 94 74 46 15 -19 -54 -75 -74 -58 -43
3146d3J3J5J7J3%j9l6l9k4nJj1k4k0jK4M3N6N1K8nk5k2pPJ3PjkRJ8J0j1k1qQROJ1K4K9K0O
$$ -43 -30 -15 2 15 15 -4 -40 -79 -103 -108 -107 -118 -142 -162 -163 -139 -96 -40 11 39 34 9 -13 -20 -13 0 7 6 4 13 31 41 30 9 1 9 18 24 35 59 88 108 114
3127A14j0l2n3n5l4j1NJ8L7M7L3Mj4j4j4k9m3l2ML3L3J0mNK0K4J3OJ6K4J4j3l8m9m6l7k0M
$$ 114 104 72 19 -36 -70 -81 -76 -58 -21 26 59 63 49 35 21 -8 -51 -83 -79 -46 -13 -3 -7 -2 18 42 55 61 77 101 115 102 64 15 -31 -68 -88 -84
3111h4L0M2L1J0mnnj0rMK1K4J1KMQN%jpj5j3LJ3Prj5j3j2pPJ7RqpJ2K7K0Mpj1j4j2rj4k8l1
$$ -84 -54 -12 19 29 25 20 15 5 -4 0 21 45 56 58 62 70 75 75 74 67 52 39 42 55 62 53 38 25 13 6 13 30 39 31 24 36 63 83 87 80 69 55 43 34 20 -8 -39
3090c9j2QJ2J0J6K3J8PKKj1k8l0j9nNJ6K3J2rj9rNJ2J7L0L4K2OKjj7l2k7mJ1J1Klnnqj4j6
$$ -39 -51 -43 -31 -21 -5 18 36 43 45 47 36 8 -22 -41 -46 -41 -25 -2 10 1 -18 -27 -22 -10 7 37 71 93 99 101 100 83 51 24 20 31 42 44 41 36 31 23 9 -7
3071gnK3N0M8K3ok6l9l9k4pjj0k1k5k4k1qRJ8J8K0K4J9%j2mJ3J8J4Lj2k4k2KK9K9J0lkjom
$$ -7 -12 11 61 109 132 126 100 61 22 -2 -9 -10 -20 -41 -66 -90 -111 -119 -110 -92 -74 -54 -30 -11 -11 -23 -27 -14 4 18 21 9 -15 -37 -35 -6 23 33 30 28 27 21 17
3053A7J3L2K9Oj4k2k2k5k8k1jK1L2L1K1Pj1k8l6k0PK4J6rk2j1J4L5L3J2jMJ6J2j2m1n4m5l2
$$ 17 30 62 91 97 83 61 39 14 -14 -35 -36 -15 17 48 69 76 65 37 1 -19 -12 12 28 19 -3 -14 0 35 68 80 79 83 99 111 99 58 4 -41 -73
3036g3k0rJO%rqJ3M1N1L6K2K7M7M7J4k8m9m0j5QK0K1J3jpkJ2J9J7J6K3K8J2k4n2n1k8j1pm
$$ -73 -93 -102 -101 -95 -95 -104 -112 -99 -58 -7 29 51 78 125 172 186 158 109 69 54 62 82 103 116 115 108 106 118 137 154 170 193 221 233 209 157 106 78 67 60 56
3018E6lj1k4k4j3qj9l1k3jJ7K7L6L6K2kj9k0j5mJ0K0K1J6J4J4Pjoj1k5l3j4J4K4Nj4j3oj2
$$ 56 53 42 18 -6 -19 -27 -46 -77 -100 -101 -84 -57 -21 15 37 35 16 -4 -19 -23 -13 7 28 44 58 72 79 78 72 61 36 3 -11 3 27 32 18 5 -1 -13
3001a3j2PK7K5NjJ3K5K4K1K8L7L8L0K1J8K3K8J8j4n1o9o1m4k8j0J2K8K7J4Krk3l2k8j2kqk7
$$ -13 -25 -18 9 34 39 38 51 76 100 121 149 186 224 254 275 293 316 344 362 348 297 228 167 123 95 85 97 125 152 166 168 159 136 104 76 64 62 54 27
2984B7l3k5j0mnjJ5L0L1K3J1N%jNJ8K3J9Qmj3j8j2kORRJ0PL%%jljJ2K8L9L8J7j9n2n3k3J0
$$ 27 -6 -31 -41 -45 -50 -51 -36 -6 25 48 59 64 64 63 68 86 109 128 136 132 119 101 89 87 93 102 111 121 128 131 131 131 130 127 126 138 166 205 243 260 241 189 136 113 123
2964A23K0Rjmnj6l1m1l6j4J4L6L6K3Pqj9k9k9k6k8k9j8LK0K7L0L7M0K2rl2l2j4MJ2J0J0J2
$$ 123 143 152 151 147 142 126 95 54 18 4 18 54 90 113 120 112 93 64 35 9 -19 -48 -66 -63 -43 -16 14 51 91 113 104 72 40 26 30 42 52 62 74
2947G4J1Kopmnj0j9k6l4l3j5J0K1J2oj7j2LJ6K0RlkJ1J8J9J5J1jj6j8kRNrj4j5k2k9j7J4M3
$$ 74 85 87 81 74 70 65 55 36 10 -24 -57 -72 -62 -41 -29 -35 -52 -64 -61 -45 -25 -16 -19 -21 -10 8 27 42 53 52 36 18 16 25 30 21 7 -8 -30 -59 -76 -62 -19
2929a9N0L3Kk3k4lK3L1K3J5J5Qj0k5k9j7%J8K5J8JnLPJokQRjj6l8n8o4m4j0J6L0M4N5N6M0
$$ -19 31 64 66 43 19 16 39 70 93 108 123 131 121 96 67 50 50 68 93 111 112 107 110 117 118 112 110 118 127 126 110 72 14 -50 -94 -104 -88 -58 -14 41 97 137
2910A37K0RKpj3j9j8pJ7M4N0K3j5m0l8j9KPql1m5l9k7k0pJ5L3L0Kk4l1l0k6j9qNJ3J2QJ0J8
$$ 137 157 166 168 161 148 129 111 104 121 165 215 238 223 183 145 126 128 135 127 96 51 12 -15 -35 -42 -27 6 36 38 14 -17 -47 -73 -92 -100 -95 -82 -70 -62 -52 -34
2893c4K2Qk0l6k1J6L9L3J8J0QKmmkj0k3j5J2L6L6J7ok2l7m2k5J0L6L7J6%PJ9J9lk7l9l6l2
$$ -34 -12 -4 -24 -60 -81 -65 -26 7 25 35 43 45 41 37 35 25 2 -13 -1 35 71 88 82 60 23 -19 -44 -34 2 39 55 55 62 81 100 97 70 31 -5 -37
2875c7l1k7j9j2qOK6M1L6J8J1J5J2mj4jK0K6J9J7K0J5lj7j1KJj1k3k5k5k5k4pK2M3L9Rk4m4
$$ -37 -68 -95 -114 -126 -134 -128 -102 -61 -25 -7 4 19 31 27 13 12 32 58 77 94 114 129 126 109 98 100 101 90 67 42 17 -8 -32 -39 -17 26 65 74 50 6
2858Fm5l6j9J1M3N9M4Rj3rOJ4J1PMlj2k1l0l4l6k8j4j0j4j2QK9K9J2jJNmj0NL2L8J3j9k7j3
$$ 6 -39 -75 -94 -83 -40 19 63 72 59 50 56 70 81 88 92 89 77 56 26 -8 -44 -72 -86 -96 -110 -122 -114 -85 -56 -44 -45 -44 -39 -43 -53 -48 -16 22 35 16 -11 -24
2840b4KPPRRJmjLok1k4nK0K7K1Ppk1j8LL1L9K2Ljlj7l9l8j3J4K6K5J9Qj4l9m6k4J8N3N8L7
$$ -24 -22 -15 -8 1 10 11 7 6 9 3 -18 -42 -47 -27 0 21 28 21 0 -18 -15 16 55 77 80 79 76 59 20 -18 -31 -17 9 34 53 61 47 8 -38 -62 -44 9 67 104
2821A04J9J7J8Kk7m0k4OK5K3J4RQMok0l5l7k3kJ2J6Rmj7k1j1MK0L2L9L4J4j2k5k5j4kPOj0
$$ 104 123 140 158 160 133 93 69 75 100 123 137 146 154 158 152 132 97 60 37 35 47 63 72 68 51 30 19 23 43 75 114 148 162 150 125 100 86 84 91 97 87
2803H7l2l9k5mQNlj7k1rJ3K8K8J4mk0l6n4n9m2j0K0L5L2K2J7J3J1J2J5J5J1JooPL0M7L7Kl3
$$ 87 55 16 -9 -13 -5 0 -3 -20 -41 -50 -37 -9 19 33 29 9 -27 -81 -140 -182 -192 -172 -137 -105 -83 -66 -53 -42 -30 -15 0 11 12 6 0 7 37 84 121 123 90
2785I0m3l2j6j3nRK4L0K0%k1l2k3j2j1k3k3nJ5K0K2L2M7M6K7J1%j1k7l3k0llk2m2m9l4mK3
$$ 90 47 15 -1 -14 -19 -10 14 44 64 64 43 11 -12 -24 -35 -58 -81 -86 -71 -51 -29 3 50 96 123 134 134 123 96 63 43 40 37 15 -27 -76 -110 -114 -91
2768i1L4K4J0Jmj3k4k5rOOpj3pjkkJ3L2L4J2rqPJ6PmkJ3K3J7kj3lJ3Nk6m8l8j1NJ0K4M6N0
$$ -91 -57 -33 -23 -22 -26 -39 -63 -88 -97 -91 -85 -92 -105 -112 -113 -115 -117 -104 -72 -38 -26 -35 -43 -36 -20 -13 -17 -19 -6 17 34 32 19 16 29 34 8 -40 -78 -89 -84 -74 -50 -4 46
2749D6K8LJJ2J3LjLkj6l0k9j8j1j1j6j5qmjjmj1j5j0RK5J9jj3mQPmj5k0j7qJ2K9L1K0RPQL
$$ 46 74 77 78 90 103 106 105 108 106 90 60 31 13 2 -9 -25 -40 -48 -52 -53 -54 -58 -69 -84 -94 -85 -60 -41 -42 -55 -59 -51 -44 -48 -63 -83 -100 -108 -96 -67 -36 -16 -7 0 8 11
2729A1qj7k5l0l1k7j4KJ8K7K5J9J0RJ9L1L8L0J6J0Mqk4k6j2JLkjJnj1qlqj5mK1L2Rk5l3j7
$$ 11 3 -14 -39 -69 -100 -127 -141 -139 -121 -94 -69 -50 -40 -31 -12 19 57 87 103 113 117 109 85 59 47 48 51 49 48 49 44 33 25 22 14 -1 -5 16 48 57 32 -1 -18
2710a8jNQK0L1K3lk3j9MK3K5J4ONLoj6k2k1j4j2j5k3k5j1J0K8M1M8M1K0JJJ3J4ok7k3oNON
$$ -18 -19 -14 -6 14 45 68 65 42 23 27 50 75 89 95 100 103 97 81 59 38 24 12 -3 -26 -51 -62 -52 -24 17 65 106 126 127 128 141 155 149 122 99 93 98 104 109
2691A09Mkj3j9k6l7m5l0LK4J8NQK0K2J5J1J4J1qk5k9k2j3j0qpojRJ7J3Jj7k8j8J0L4L8K4J0
$$ 109 113 111 98 79 53 16 -29 -59 -56 -32 -14 -9 -1 19 41 56 67 81 92 84 59 30 8 -5 -15 -23 -30 -36 -37 -28 -11 2 3 -14 -42 -60 -50 -16 22 46 56
2674E6NLqj7j3npj7j7NK9L2J6pj9k6k8k7j7JJ8L0L1K8J9Qrk1k6j8j1%J2J9Ll1n1l9qOKLJ9
$$ 56 61 64 56 39 26 21 14 -3 -20 -15 14 46 62 55 36 10 -18 -45 -62 -61 -43 -13 18 46 65 73 64 43 17 -1 -12 -12 0 19 22 -9 -60 -99 -107 -101 -99 -96 -77
2655g7L3L0J5Lnj1oNRKlJjj4k0JL9O2M7Ol3n0m3k6j4j3j0QL0L0Oj9l0j8PK7K4%k9l5k1pll
$$ -77 -44 -14 1 4 -1 -12 -18 -13 -4 -2 -5 -4 -5 -19 -39 -38 1 63 110 116 83 33 -10 -36 -50 -63 -73 -65 -35 -5 1 -18 -48 -66 -59 -32 -8 -8 -37 -72 -93 -100 -103 -106
2636a06JMRK2L9M1J8k2n3o2m6j0L4O1N8M0L3L4K6Jk6l6l4k8l0k9k0NK8L6K8J8J5J2jj7k5k3
$$ -106 -105 -101 -92 -70 -31 10 28 6 -47 -109 -155 -165 -131 -70 -12 28 61 95 121 122 96 60 26 -2 -32 -61 -81 -76 -48 -12 16 34 49 61 60 43 18 -5
2619ek1j2OJ7Oj6k2kK4L2K7J0qj7pJ3K2Jk8m3l6j2J3L1L6K7J1nj3j1%Qkk2l2j9OJ8J9J4Oj0
$$ -5 -26 -38 -32 -15 -9 -25 -47 -49 -25 7 34 44 36 19 12 25 47 48 20 -23 -59 -71 -58 -27 9 36 47 42 29 18 18 26 24 2 -30 -49 -43 -25 -6 8 14 4
2601Dk1j4J2K9K8J5Lnj2j4j0jRJ4J0lj2rPJ4Mj6k9k8j3RK3J0j5l4k9j3nplJ1K7L6L2K5J8J4
$$ 4 -17 -31 -19 10 38 53 56 51 39 25 15 14 23 37 47 44 32 23 30 44 48 32 3 -25 -38 -29 -6 4 -11 -45 -74 -87 -92 -99 -102 -91 -64 -28 4 29 47 61
2583F1J3Kj4k5j9rqj3j3o%JLMJlLJ4J7Q%QK6L2K0LjKnj8k0jK4L1K2Qmj9l0k1LJ4NoLJ6J1j0
$$ 61 74 76 62 37 18 9 1 -12 -25 -31 -31 -30 -27 -23 -22 -25 -22 -8 9 17 17 25 51 83 103 106 105 107 102 84 64 63 87 118 140 148 144 125 95 74 77 91 96 90 93 109 120 110
2562A10j4NK5K3Kk0k8k0kQ%j6j4MJ7Mj8k7k5j6nJ9M3M9L0Nj2j4j3j9k8k3%K5K7Oj0rjj%J0
$$ 110 96 101 126 149 151 131 103 83 81 89 89 73 59 63 80 84 66 39 14 -2 -7 12 55 104 134 139 127 113 100 81 53 30 30 55 82 88 78 69 68 67 67 77
2544G7J8J1lomj2k7k8j0PRkj3j4qjJLJ0K7K9J2nNL7N2L3lk3k2j5j3j5j8j6j0j4l4n8n7k3J7
$$ 77 95 106 103 97 93 81 54 26 16 23 32 30 17 3 -5 -6 -5 -2 8 35 64 76 71 76 113 165 198 195 172 150 135 122 107 89 73 63 49 15 -43 -100 -123 -106
2526a06K8J4LJ3K6J9pk6j7RK8K1MolkmMK4M2L7J5pj8j9j2LJ9K7K0Mj2j7j3ljnqj2j9k7j8K
$$ -106 -78 -64 -61 -48 -22 -3 -10 -36 -53 -44 -16 5 9 3 0 -2 -6 -2 22 64 101 116 109 91 72 60 63 82 109 129 133 121 104 91 88 87 82 74 62 43 16 -2 0
2507@J8J5QJ3J6Jk5l2j7npj5j5j0%J2K2K1OjMJ0MrpOJ7J3KnmjLJ0K2K8K1Jj8k6k2j0OJ6Nj9
$$ 0 18 33 41 54 70 71 46 14 -3 -8 -15 -30 -45 -55 -55 -43 -21 0 6 5 9 19 23 14 7 13 30 43 45 40 36 35 38 48 70 98 119 120 102 76 54 44 50 66 71 52
2487E2k9oL0L7J0k3l5l6l4k6j0jnj0LJ7J5KjRJ9K2J7J2MLPQqk6k5oPKmNJ4J3QJ4K9L1K1Pk
$$ 52 23 17 47 84 94 71 36 0 -34 -60 -70 -71 -76 -86 -83 -66 -51 -49 -50 -41 -22 0 17 29 33 36 43 51 43 17 -8 -14 -7 -5 -9 -4 10 23 31 45 74 105 126 133 131
2468A31%RJ7J3kj9l3m5n5n1k8kP%lQK4L5M2M0K4Lj1j5j7k1pK5M6K9ok4j1Kqk8l1j6LJ0Jj8
$$ 131 131 140 157 170 168 149 116 71 16 -35 -63 -65 -58 -58 -61 -53 -29 6 48 88 112 115 104 89 72 51 44 69 115 144 138 114 103 105 97 69 38 22 25 35 36 18
2450A8l8m5l4j6qqlQK1K5K2J7J0QJ4J6J0m%J8K8Qk3l5j8%NOJ6K9K9J3j2l2m1l4j5RJ8J0nr
$$ 18 -20 -65 -99 -115 -123 -131 -134 -126 -105 -80 -58 -41 -31 -23 -9 7 17 13 13 31 59 67 44 9 -9 -9 -4 2 18 47 76 89 77 45 4 -30 -45 -36 -18 -8 -13 -22
2431b2jOkk2l1k2lNkj6k1rJ7M2M2K1lrklrj1mjmoLJ6J8J2NLMJ0K2J8kk9l9k5MK4K5Mj4k0k
$$ -22 -23 -17 -19 -41 -72 -94 -97 -92 -94 -110 -131 -140 -123 -81 -39 -18 -21 -30 -32 -35 -44 -55 -59 -60 -64 -70 -67 -51 -33 -21 -16 -13 -9 1 23 41 39 10 -29 -54 -50 -26 -1 3 -11 -31 -33
2411c3K3K9J5j1k7l0k1j7k0k5j9kJ2J5J5K1K3J5NJ2L2L6Qk3k5kK0K5K1J7J3RKlnpj1k5m2m8
$$ -33 -10 19 34 23 -4 -34 -55 -72 -92 -117 -136 -138 -126 -111 -96 -75 -52 -37 -32 -20 12 48 56 33 8 6 26 51 72 89 102 111 113 110 105 98 87 62 20 -28
2394b8l4qNql1l4pL1N2M4K4J2MloPL3M5K4pk1j4j0j6k3j5lQJ9K6J7j2l8l7k3j2pjJj6m2m7
$$ -28 -62 -70 -65 -73 -104 -138 -145 -114 -62 -18 6 18 22 19 13 20 53 98 122 115 94 80 70 54 31 16 13 21 40 66 83 71 33 -4 -27 -39 -46 -47 -46 -62 -104 -151
2375a51k1J2K8K9K8K7J5%mLKj0j8j6j5k5l3k0K0O4Q2O7L5kl1m3l6k3j2j1j0nok3l8k6J1M4
$$ -151 -172 -160 -132 -103 -75 -48 -33 -33 -37 -34 -32 -42 -60 -76 -91 -116 -149 -169 -149 -85 -3 64 99 97 66 23 -13 -36 -48 -59 -69 -74 -80 -103 -141 -167 -156 -112
2359a12M5K4Mnj6k1j7oklKJ1J2JroJORJ0Kj1j7mPjj5j6nPJ1J3J7J3RONpk3k2JK5K2jk0j4P
$$ -112 -67 -43 -39 -44 -60 -81 -98 -104 -106 -109 -107 -96 -84 -83 -92 -98 -97 -91 -82 -72 -70 -81 -98 -102 -95 -96 -111 -127 -132 -125 -114 -101 -84 -71 -62 -56 -51 -58 -81 -103 -102 -77 -55 -56 -76 -90 -83
2339h3K9L5J8j6m3m3j2K2L2J6kmOJ6J8J5J6J6RMLOOJj1k9l7l3j5klj1j3mQJ5J4PJMJ4J1j1
$$ -83 -54 -19 -1 -17 -60 -103 -115 -93 -61 -45 -47 -51 -45 -29 -11 4 20 36 45 49 52 58 64 65 54 25 -12 -45 -60 -62 -65 -76 -89 -93 -85 -70 -56 -49 -48 -44 -30 -19 -30
2320c0k4rK2L2J6KOJ4J1NPJ2Lj6k8k6j9rJ0L1L9K1pl0l5l5k9k2qJ0L1M3M0K1jj4j0KQMnj0
$$ -30 -54 -63 -41 -9 7 9 15 29 40 45 52 64 67 51 23 -3 -22 -31 -21 10 49 70 63 33 -2 -37 -66 -88 -96 -86 -55 -12 28 49 48 34 24 26 34 38 33 23
2302B3pkJOJ3J2NJKLpk2k5j0PJ7K1J7J1%rj0oLQPjrlJ4L3L8K1j0l9n1l4JK5J7j1l1k8k4k9
$$ 23 16 14 15 21 34 46 51 52 54 57 50 28 3 -7 0 17 38 55 66 66 57 47 41 44 52 59 58 49 46 60 93 131 152 142 103 52 18 19 44 61 50 19 -9 -33 -62
2282f2l3j2K8N6M6J6rj3lPJ3Qnj6j8roj3k2k4k0pJ3L2L1J2okJ3J6Qmj5k8l7l0j4mnnQJ9J2
$$ -62 -95 -107 -79 -23 23 39 30 17 14 21 34 42 37 21 3 -6 -12 -25 -47 -71 -91 -98 -85 -53 -22 -10 -16 -18 -5 11 19 15 0 -28 -65 -95 -109 -113 -118 -123 -115 -96 -84
2264h4j4l2k5ML9N7M8K8J6Pok0j6MJ7jl6n8m1mK8L1J3mnRK3K4J8QkoMK0K7J8QKnk1l0k6k0
$$ -84 -98 -130 -155 -151 -112 -55 -7 21 37 44 38 18 2 6 23 22 -14 -72 -113 -117 -89 -58 -45 -49 -54 -45 -22 2 20 28 26 20 24 44 71 89 97 99 94 73 43 17 -3
2245ck3k3qRPj1j9pKKnj1k3l1j7J0K4J3jOK6L2K4J3J1QMOJ0J2J2RNpk5l4l5l2k6qK2N4O7N4
$$ -3 -26 -49 -57 -48 -41 -52 -71 -78 -76 -74 -79 -90 -113 -144 -161 -151 -127 -114 -115 -109 -83 -51 -27 -14 -3 5 9 15 25 37 49 58 63 56 31 -3 -38 -70 -96 -104 -82 -28 39 93
2226I3K0j7l9m0k5nJ9L2K4mk5k3pkrj4jJ2Qqj9j6j0mNK1L1K4Jk1k2pNjj9k4j2OJ1LoqkMLk
$$ 93 113 96 57 17 -8 -13 6 38 62 58 33 10 3 1 -8 -22 -23 -11 -3 -11 -30 -46 -56 -60 -55 -34 -3 21 22 1 -21 -28 -23 -24 -43 -67 -79 -73 -62 -59 -65 -73 -75 -71 -68 -70
2206g0nKJ2J5J2J2J9K3K4K6L1L3K5J4Kj4l8n5m7j4J7K8J8NMNok9m7m0j4Llj9k7k3j7qPK2K5
$$ -70 -75 -73 -61 -46 -34 -22 -3 20 44 70 101 134 159 173 175 161 123 68 21 7 24 52 70 75 79 84 78 49 2 -38 -52 -49 -52 -71 -98 -121 -138 -146 -139 -117 -92
2188i2J6J4J8J6nk8k7lK3K5jl2l9k0NRoj6mJ7K3RoqKJ2J6J9K8L8L8K0jnOJ2Mj0j3j2j7k4j6
$$ -92 -76 -62 -44 -28 -33 -61 -88 -91 -68 -43 -44 -76 -115 -135 -130 -121 -127 -143 -147 -130 -107 -98 -104 -112 -110 -98 -82 -63 -35 3 41 61 60 55 61 73 77 67 54 42 25 1 -15
2170a5%J2ROQJ3J6K1K2Rj4k3mJ9K0ol1l1oJ9K8J4j2l4l8k6j4j0j0qkNMqj8j6jJ3J2%mJJno
$$ -15 -15 -3 6 12 20 33 49 70 92 101 87 64 60 79 99 93 62 31 25 44 72 86 74 40 2 -24 -38 -48 -58 -66 -68 -63 -59 -67 -85 -101 -102 -89 -77 -77 -81 -80 -79 -84 -90
2150i0MJ7J7O%lj1k2j3J8M4L7Mk2k3qJKQJ8J8Kj6k3j7pPK2K6J0j4k6j2NPNJ6K5J0k8m8k0L2
$$ -90 -86 -69 -52 -46 -46 -49 -60 -82 -95 -77 -33 4 8 -14 -37 -45 -44 -42 -34 -16 2 4 -12 -35 -52 -59 -52 -30 -4 6 -8 -34 -46 -41 -34 -29 -13 12 22 -6 -54 -74 -42
2131d2O0M9J7lmknj1j5j2rqj3j7j6j1kLRJ3J2LpqKQMopKPkj4j6pkNK1M5N6L4jj9k2k5l2k3
$$ -42 18 67 84 81 77 75 70 59 44 32 23 15 2 -15 -31 -42 -44 -41 -32 -19 -7 -4 -11 -19 -17 -9 -5 -11 -18 -16 -9 -11 -25 -41 -48 -50 -45 -24 21 77 111 110 91 69 44 12 -11
2111a1MK4K1Jj2j7k1k5j4MJ6J9K1K7K1ol2m2l7k7j4LK2L0L0K7K5J3oj8j6%J5J8Oj2k3k1j4
$$ -11 -7 17 38 39 27 10 -11 -36 -50 -46 -30 -11 10 37 58 52 20 -22 -59 -86 -100 -97 -75 -45 -15 12 37 50 44 26 10 10 25 43 49 37 14 -7 -21
2094b1qjJ0J9J1qj7pJ8L1K4%j8k2nJ8L1K5R%JNOMRJ8K7K8J7pl1m7m9l4mK8M1K6jj6j1oj7k9
$$ -21 -29 -30 -20 -1 10 2 -15 -22 -4 27 51 51 33 11 6 24 55 80 89 89 90 95 101 105 114 132 159 187 204 197 166 119 70 36 32 60 101 127 126 110 99 93 76 47
2075D7k2PL2L6K8J8Nj6l4k1J8M6L4ml4m0l6l0k0nlj1j0J2L0K7Kj4j5k0l0l1j1J6L0K9K4K2
$$ 47 25 32 64 100 128 146 151 135 101 80 98 144 178 174 140 100 64 34 14 9 6 -5 -15 -3 27 54 56 42 27 7 -23 -54 -65 -49 -19 10 34 56
2059E6J9J0nj9k2j8j4j6j5OL8N5M4K3Pkj8l7m2l2k3k8l4k4KL0M0K7Qrj1rjJ1J7J0j4k9k5j0
$$ 56 75 85 80 61 39 21 7 -9 -24 -18 20 75 119 142 149 147 129 92 50 18 -5 -33 -67 -91 -89 -59 -19 8 16 7 -4 -13 -14 -3 14 24 10 -19 -44 -54
2041e4k%J0L0M0L6K1Mj4k4j7JJ2Jk0k3nJ8K8K1OlKJ9K9K6Qj5l7m2k6njj7k8j9nrk2k5j1JJ
$$ -54 -56 -56 -46 -16 24 60 81 85 71 47 30 31 43 44 24 1 -4 14 42 63 69 66 68 87 116 142 150 135 98 56 30 25 24 7 -21 -40 -45 -54 -76 -101 -112 -111 -110
2023a10LJ1J8J5QQJ1J1QPQPQJ4K3K1Prj8k2k2k0k5l0k3KL3M6L6K7L0L4K5Noqj0k2m4n8n5k8
$$ -110 -107 -96 -78 -63 -55 -47 -36 -25 -17 -10 -2 5 13 27 50 71 78 69 51 29 7 -13 -38 -68 -91 -89 -56 -10 26 53 83 117 142 147 141 133 123 101 57 -1 -56 -84
2004h4NK0Rj1j9j0KJ5K7K8J2j3j6RL7M4L0J6Lk1n2o4m8j2J8L6L9K9Rj0j2NK2J9Jj2rOJ4J7
$$ -84 -79 -59 -50 -61 -80 -90 -88 -73 -46 -18 -6 -19 -35 -26 11 55 85 101 104 83 31 -33 -81 -93 -75 -39 0 29 38 28 16 21 43 62 63 51 42 48 62 79
1987G9J5J0kj8k4j7qKJ1J8J3lj3pLLpj3j1qnJOOKOJ5J1j0k6k2poj7j7JK4L3L1K2J2MNJ6K4
$$ 79 94 104 102 84 60 43 35 37 48 66 79 76 63 56 59 62 55 42 31 23 18 19 25 31 33 39 54 65 55 29 7 0 -6 -23 -40 -39 -15 18 49 71 83 87 92 108 132
1968A32J8nl0m3l8k0KJ1Jj8k6k1j0pqlRJ7Qj0k0j8j3pjORPnj9k6j7J4M0M0J9MJ5L0K9J0JR
$$ 132 150 145 115 72 34 14 16 27 28 10 -16 -37 -47 -54 -62 -65 -56 -39 -31 -41 -61 -79 -92 -99 -100 -94 -85 -78 -83 -102 -128 -145 -131 -91 -51 -32 -28 -13 17 46 56 57 66
1949F6K0K3J2mk3l5l1j4kpj6j0RK4K3J3RJ3J7J9J3%j1j0QK1J3rk7l2l0k5j0J0J4ql7m9m6m6
$$ 66 86 109 121 117 94 59 28 14 12 5 -11 -21 -12 12 35 48 57 70 87 106 119 119 108 98 106 127 140 131 104 72 42 17 7 17 31 23 -14 -63 -109 -155
1932a55m6k3K3N6N3K4%nLJ5K4J9%j8j7kJ1J8K4K6J4mj6k1k8k7oK5L9K6%k2l6m1k6OL0K8J2
$$ -155 -201 -224 -201 -145 -92 -68 -68 -73 -70 -55 -31 -12 -12 -30 -47 -49 -38 -20 4 30 44 40 24 3 -25 -52 -58 -33 6 32 32 10 -26 -67 -93 -87 -57 -29 -17
1915a7LNRJ2J2Mqj2lPL%PK1J9Kj8k4k0j4j2nOJ4J8J6Qkj3k3l0k3jJ9K7K7K6J9ml6m8l2kJ1
$$ -17 -14 -9 0 12 24 28 20 8 5 12 15 15 22 43 62 64 46 22 2 -12 -24 -29 -23 -9 9 25 33 31 18 -5 -35 -58 -59 -40 -13 14 40 59 55 19 -29 -61 -63 -52
1896e2MokRJ0%pkJ5K6J7Kj0lJ8M1N0L8J7Jjlj5l1l7k7j2k%%NQNKNK1L5L8K5Jk2l6k9nJ3J0
$$ -52 -48 -54 -56 -47 -37 -37 -44 -46 -31 -5 12 14 4 1 19 60 110 148 165 166 165 162 147 116 79 52 40 38 38 38 43 51 56 58 63 84 119 157 182 183 161 125 96 91 104 114
1876A14j0k4j9j2n%Okk0l2k6j2pLK3M4N4N2M3J9k2n2m3rR%qnnj2rPK2K3K2K5J9nk7k9j6nL
$$ 114 104 80 61 49 44 44 50 48 28 -4 -30 -42 -49 -46 -23 21 75 127 170 189 167 115 72 63 72 72 64 59 54 42 33 40 62 85 107 132 151 146 119 90 74 69 72
1857G2J2K0K2K3J4j4n5p3m9j1QJ2J9L8M7L5Rj5k3j5jlk4l6j9LJj5j4QK1Nj6k2pJ5K8K2Lj6
$$ 72 84 104 126 149 163 149 94 21 -28 -39 -31 -19 0 38 85 120 129 114 91 76 75 72 48 12 -7 -4 -3 -18 -32 -24 -3 2 -14 -36 -43 -28 0 22 25 9
1840Ij4JJ1RJ0J3Oj7l3k8mJ7K4J8kk0k7j6nlmJONlj0j0%J5J7ml6n3m2k6k0j8jK0K5J6J3J9
$$ 9 -5 -4 7 16 26 39 45 28 -5 -33 -37 -20 4 22 20 0 -27 -43 -48 -51 -55 -54 -48 -43 -46 -56 -66 -66 -51 -34 -38 -74 -127 -169 -195 -215 -233 -234 -214 -189 -173 -160 -141
1821a41K2J6ROOJKJ2K9L6J8j0k7k1kQjpJ0L2L1Pk0l0l1k5j5MJ8J6%j3j2nok2l2k2NK2J4%R
$$ -141 -119 -103 -94 -88 -82 -81 -79 -67 -38 -2 16 6 -21 -42 -44 -36 -37 -44 -34 -2 29 36 16 -14 -45 -70 -85 -81 -63 -47 -47 -60 -72 -77 -83 -105 -137 -159 -154 -132 -118 -118 -109
1802a09L7M9K3j7m0k7oRJ7L5N4N8L3nk6k4j3qpJJ2J4LqrlJNJ4J9Qj3k3j3LRKkK%qj4j5j5j5
$$ -109 -72 -23 0 -17 -57 -84 -90 -81 -64 -29 25 83 116 111 85 61 48 40 33 34 46 60 63 55 46 43 44 49 63 82 90 77 54 41 44 53 55 53 55 55 47 33 18 3 -12
1783a2j1kJrj7pJ2K5K4J9Qj3l4l6j5MQNOOlj0nJ3K4J9Nj4k7k9k4j8j3oJNJ1K0K8J9JnOJ4M
$$ -12 -23 -25 -24 -33 -50 -57 -45 -20 4 23 31 18 -16 -52 -67 -63 -55 -50 -44 -38 -41 -51 -56 -43 -19 0 5 -9 -36 -65 -89 -107 -120 -126 -125 -120 -109 -89 -61 -42 -41 -46 -40 -26 -22
1763b2oRL8N6M1Nl6o4o4l6mOlnNJ6J7J8J5Lj0nJ7L0K0%jJ2K0J6J0%j7k9k3MK4J9lj7j0OJ5
$$ -22 -28 -19 19 75 116 121 85 21 -43 -79 -83 -77 -80 -85 -80 -64 -47 -29 -14 -11 -21 -26 -9 21 41 41 40 52 72 88 98 98 81 52 29 33 57 76 73 56 46 52 67
1745F7J3Mjpj5k2k1j6j3j8k3k1j1jJkmkJ3L1M3L7J7nj1kJ1J2PJ0J7J7PJMJj5k8j8KQqk1j8
$$ 67 80 84 83 76 61 39 18 2 -11 -29 -52 -73 -84 -85 -84 -86 -90 -92 -79 -48 -5 32 49 44 33 31 42 54 61 71 88 105 112 113 117 118 103 75 57 59 67 59 38 20
1726B0ojnj1k0j9jK6M8N4M5J9k2n8o2l5rnmNJ5Oj2j5MK6L9M3L1Pj6k6k7l4l9k8JK7K5Nj4j3
$$ 20 14 13 8 -3 -23 -42 -43 -17 31 85 130 149 127 69 7 -28 -37 -42 -46 -41 -26 -20 -32 -47 -43 -17 22 65 96 103 87 61 34 0 -39 -67 -66 -39 -14 -9 -23 -36
1707c6KJ8K2J6Jj2k1k5k0jJ7K0Lj3j3JQml0m3l1JL0M1L5J8ql2m3l3j5%RJ7J9J7J5J8J8NlQ
$$ -36 -34 -16 6 22 23 11 -10 -35 -55 -56 -39 -19 -16 -29 -42 -41 -33 -37 -67 -110 -141 -140 -110 -69 -34 -16 -24 -56 -99 -132 -147 -147 -138 -121 -102 -85 -70 -52 -34 -29 -32 -24
$$ [...]
-3135b5
##END=	
##END=	
