##TITLE=	Oct25-2021.40.fid
TM-VI-136solid

##JCAMP-DX=	6.0	$$ MestReNova 14.3.0-30573
##DATA TYPE=	LINK
##BLOCK_ID=	1
##BLOCKS=	2    
##ORIGIN=	Mestrelab Research S.L.
##OWNER=	hrzepa
##$MNOVA/LINK_BLOCK_TYPE=	ITEM	$$ NMR Spectrum
##$MNOVA/ITEM/POLYGON=	(XY..XY)
5321,5835
8722,5835
8722,8208
5321,8208
5321,5835
##$MNOVA/ITEM/Z=	0
##$MNOVA/ITEM/ANGLE=	0
##TITLE=	Oct25-2021.40.fid
##JCAMP-DX=	6.0	$$ MestReNova 14.3.0-30573
##BLOCK_ID=	2
##DATA TYPE=	MNOVA NMR VIEW DATA
##DATA CLASS=	MNOVA VIEW DATA
##$MNOVA/ITEM/ZOOM/X=	-4.0107147498308073352,	16.011019999997905927
##$MNOVA/ITEM/ZOOM/Y=	-536.09093308448791504,	5853.38897705078125
##END=	
##TITLE=	Oct25-2021.40.fid
##JCAMP-DX=	6.0	$$ MestReNova 14.3.0-30573
##BLOCK_ID=	3
##DATA TYPE=	NMR SPECTRUM
##DATA CLASS=	XYDATA
##NUMDIM=	1
##ORIGIN=	Bruker BioSpin GmbH
##OWNER=	nmr
##.OBSERVE FREQUENCY=	400.20240119999999706
##.OBSERVE NUCLEUS=	^1H
##.SOLVENT NAME=	CDCl3
##.PULSE SEQUENCE=	zg30
##LONGDATE=	2021/10/25 16:00:00.000
##.ACQUISITIONMODE=	SIMULTANEOUS (DQD)
##$ORIGINAL FORMAT=	Bruker XWIN-NMR
##$MNOVA/SCALES_VERSION=	9
##$PARAMETER FILE=	(acqus, ASCII, /private/var/folders/f6/rjf_tdyn2v98c5c0wvkgn4s80000gn/T/WAFeMGp6S8+nF9XZRRSpUA/40/acqus, 0)
$$ ##TITLE= Parameter file, TOPSPIN		Version 3.2
$$ ##JCAMPDX= 5.0
$$ ##DATATYPE= Parameter Values
$$ ##NPOINTS= 11	$$ modification sequence number
$$ ##ORIGIN= Bruker BioSpin GmbH
$$ ##OWNER= nmr
$$ $$ 2021-10-25 16:00:23.294 +0100  nmr@CZC2439F63
$$ $$ /opt/topspin/data/agmb/nmr/Oct25-2021/40/acqus
$$ $$ process /opt/topspin3.2/prog/mod/shimcntl
$$ ##$ACQT0= -2.10084033613445
$$ ##$AMP= (0..31)
$$ 100 100 100 100 100 100 100 100 100 100 100 100 100 100 100 100 100 100
$$ 100 100 100 100 100 100 100 100 100 100 100 100 100 100
$$ ##$AMPCOIL= (0..19)
$$ 0 0 0 0 0 0 0 0 0 0 0 0 0 0 0 0 0 0 0 0
$$ ##$ANAVPT= -1
$$ ##$AQSEQ= 0
$$ ##$AQ_mod= 3
$$ ##$AUNM= <au_zg>
$$ ##$AUTOPOS= <51 >
$$ ##$BF1= 400.2
$$ ##$BF2= 400.2
$$ ##$BF3= 400.2
$$ ##$BF4= 400.2
$$ ##$BF5= 400.2
$$ ##$BF6= 400.2
$$ ##$BF7= 400.2
$$ ##$BF8= 400.2
$$ ##$BYTORDA= 0
$$ ##$CAGPARS= (0..11)
$$ 0 0 0 0 0 0 0 0 0 0 0 0
$$ ##$CFDGTYP= 0
$$ ##$CFRGTYP= 9
$$ ##$CHEMSTR= <none>
$$ ##$CNST= (0..63)
$$ 1 1 145 1 1 1 1 1 1 1 1 1 1 1 1 1 1 1 1 1 1 1 1 1 1 1 1 1 1 1 1 1 1 1 1
$$ 1 1 1 1 1 1 1 1 1 1 1 1 1 1 1 1 1 1 1 1 1 1 1 1 1 1 1 1 1
$$ ##$CPDPRG= (0..8)
$$ <> <> <> <> <mlev> <mlev> <mlev> <mlev> <mlev>
$$ ##$D= (0..63)
$$ 0 1 0 0 0 0 0 0 0 0.06 0 0 0 0 0 0 0.0002 0 0 0 0 0 0 0 0 0 0 0 0 0 0 0
$$ 0 0 0 0 0 0 0 0 0 0 0 0 0 0 0 0 0 0 0 0 0 0 0 0 0 0 0 0 0 0 0 0
$$ ##$DATE= 1635174022
$$ ##$DE= 6.5
$$ ##$DECBNUC= <off>
$$ ##$DECIM= 2496
$$ ##$DECNUC= <off>
$$ ##$DECSTAT= 4
$$ ##$DIGMOD= 1
$$ ##$DIGTYP= 12
$$ ##$DQDMODE= 0
$$ ##$DR= 22
$$ ##$DS= 2
$$ ##$DSPFIRM= 0
$$ ##$DSPFVS= 20
$$ ##$DTYPA= 0
$$ ##$EXP= <proton>
$$ ##$F1LIST= <111111111111111>
$$ ##$F2LIST= <222222222222222>
$$ ##$F3LIST= <333333333333333>
$$ ##$FCUCHAN= (0..9)
$$ 0 2 0 0 0 0 0 0 0 0
$$ ##$FL1= 90
$$ ##$FL2= 90
$$ ##$FL3= 90
$$ ##$FL4= 90
$$ [...]
$$ ##$Sgu3PowerLevels= (0..7)
$$ 0 0 0 0 0 0 0 0
$$ ##$Sgu4PowerLevels= (0..7)
$$ 0 0 0 0 0 0 0 0
$$ ##$Sgu5PowerLevels= (0..7)
$$ 0 0 0 0 0 0 0 0
$$ ##$Sgu6PowerLevels= (0..7)
$$ 0 0 0 0 0 0 0 0
$$ ##$Sgu7PowerLevels= (0..7)
$$ 0 0 0 0 0 0 0 0
$$ ##$Sgu8PowerLevels= (0..7)
$$ 0 0 0 0 0 0 0 0
$$ ##$SguType= 3
$$ ##$ShimPowMaxUA= (0..63)
$$ 130000 130000 130000 130000 130000 130000 130000 130000 130000 130000 130000
$$ 130000 130000 130000 130000 130000 130000 130000 130000 130000 0 0 0 0
$$ 0 0 0 0 0 0 0 0 0 0 0 0 0 0 0 0 0 0 0 0 0 0 0 0 0 0 0 0 0 0 0 0 0 0 0 0
$$ 0 0 0 0
$$ ##$ShimPowMaxUC= (0..63)
$$ 130000 130000 130000 130000 130000 130000 130000 130000 130000 130000 130000
$$ 130000 130000 130000 130000 130000 130000 130000 130000 130000 0 0 0 0
$$ 0 0 0 0 0 0 0 0 0 0 0 0 0 0 0 0 0 0 0 0 0 0 0 0 0 0 0 0 0 0 0 0 0 0 0 0
$$ 0 0 0 0
$$ ##$ShimPowMaxUG= (0..63)
$$ 524287 524287 524287 524287 524287 524287 524287 524287 524287 524287 524287
$$ 524287 524287 524287 524287 524287 524287 524287 524287 524287 0 0 0 0
$$ 0 0 0 0 0 0 0 0 0 0 0 0 0 0 0 0 0 0 0 0 0 0 0 0 0 0 0 0 0 0 0 0 0 0 0 0
$$ 0 0 0 0
$$ ##$ShimPowRcbType= 3
$$ ##$ShimPowRes= (0..63)
$$ 1e-20 1e-20 1e-20 1e-20 1e-20 1e-20 1e-20 1e-20 1e-20 1e-20 1e-20 1e-20
$$ 1e-20 1e-20 1e-20 1e-20 1e-20 1e-20 1e-20 1e-20 0 0 0 0 0 0 0 0 0 0 0 0
$$ 0 0 0 0 0 0 0 0 0 0 0 0 0 0 0 0 0 0 0 0 0 0 0 0 0 0 0 0 0 0 0 0
$$ ##$ShimPowRng0= (0..63)
$$ 1 1 1 1 1 1 1 1 1 1 1 1 1 1 1 1 1 1 1 1 0 0 0 0 0 0 0 0 0 0 0 0 0 0 0 0
$$ 0 0 0 0 0 0 0 0 0 0 0 0 0 0 0 0 0 0 0 0 0 0 0 0 0 0 0 0
$$ ##$ShimPowRng1= (0..63)
$$ 1 1 1 1 1 1 1 1 1 1 1 1 1 1 1 1 1 1 1 1 0 0 0 0 0 0 0 0 0 0 0 0 0 0 0 0
$$ 0 0 0 0 0 0 0 0 0 0 0 0 0 0 0 0 0 0 0 0 0 0 0 0 0 0 0 0
$$ ##$ShimPowRng2= (0..63)
$$ 1 1 1 1 1 1 1 1 1 1 1 1 1 1 1 1 1 1 1 1 0 0 0 0 0 0 0 0 0 0 0 0 0 0 0 0
$$ 0 0 0 0 0 0 0 0 0 0 0 0 0 0 0 0 0 0 0 0 0 0 0 0 0 0 0 0
$$ ##$ShimPowRng3= (0..63)
$$ 1 1 1 1 1 1 1 1 1 1 1 1 1 1 1 1 1 1 1 1 0 0 0 0 0 0 0 0 0 0 0 0 0 0 0 0
$$ 0 0 0 0 0 0 0 0 0 0 0 0 0 0 0 0 0 0 0 0 0 0 0 0 0 0 0 0
$$ ##$ShimSysFunc= (0..63)
$$ 1 2 3 4 5 7 9 11 15 16 8 10 12 14 6 17 13 18 19 20 0 0 0 0 0 0 0 0 0 0
$$ 0 0 0 0 0 0 0 0 0 0 0 0 0 0 0 0 0 0 0 0 0 0 0 0 0 0 0 0 0 0 0 0 0 0
$$ ##$ShimSysMatrix= 0
$$ ##$ShimSysType= 1
$$ ##$TFXNUM= 0
$$ ##$TRIPLO2= 0
$$ ##$VTU= 2
$$ ##$VTUETH= <149.236.99.20>
$$ ##$VTUTY= <no>
$$ ##$WBREFAM= (0..15)
$$ 135.5 97.7 100 100 100 100 100 100 100 100 100 100 100 100 100 100
$$ ##$WBREFLM= (0..15)
$$ 0 0 0 0 0 0 0 0 0 0 0 0 0 0 0 0
$$ ##$WBREFPH= (0..15)
$$ 72.26 -67.22 0 0 0 0 0 0 0 0 0 0 0 0 0 0
$$ ##$WBSGU= (0..15)
$$ 0 0 0 0 0 0 0 0 0 0 0 0 0 0 0 0
$$ ##$XFAC= 2
$$ ##END=
$$ 
##$DECIM=	2496
##$DSPFVS=	20
##XUNITS=	HZ
##YUNITS=	ARBITRARY UNITS
##FIRSTX=	6407.6102040000005218
##LASTX=	-1605.0880428824991668
##DELTAX=	-0.12226593800080109986
##XFACTOR=	1
##YFACTOR=	0.015499724899033570993
##FIRSTY=	8.1906366348266601563
##MINY=	-3.9646513462066650391
##MAXY=	5321.2626953125
##NPOINTS=	65536
##XYDATA=	(X++(Y..Y))
$$ [...]
1966B42k2m4k2J3L0L0L9N2M9K5Jj4k7l3j5J6J4l4o8m6rok0ON5O0K1RM8P1L2j9k9k7n1p0l0
1962B27L3M2%k7j7jmj1j1j4qK2M9L4mj4OJ0rj8rk1m6l8KJ1k8m3RO9O9K4mrk4l2qL4M6J9j0
1957B96k4k3qJ1%n0q2l6N3R4N7lk4j2nk0l6k8MK9K1j0j6J0J5k6n7j9M9O0Ql1j6RLrLK1J3j4
1952B07l1l0j3K0N8O5L0rpK4L9J0l8o1m2%K8K9K3K1%m8q2n2J7M7J5k3k1LJ3K0K9K0j1k3JJ6
1947B44j5m8k9J8J7k8l5J3M8K1k0j6J2J1j3oL8O2L3j3k6j1j0l9n6k9K4M9K7mmJ4Qj7k0J3L7
1943B50J6k5l3kK6J7pk0rJ0J7Lk8n5n4k8MK1K3K2K3L7N3M4pn8n0J3M8Ko8o8MN9M6Lj5mJ2J8
1938B40J4Kj1lJ4Qk4l6kL7K6k1m7k3K5O3O6K7k8m9j4K3ko0p3k6J7J1pPL3L4J4OJ1Jk0k4jK4
1933B32L0J7Jj3k6l5k7lK2K8J3LQJ7K6L8N3M5Jm3m7k1jKLnl3m7j3L8L1l6p4m1J4L5L8M9M9
$$ y = [242, 220, 176, 154, 167, 197, 227, 266, 318, 367, 392, 393, 379, 352, 319, 304, 320, 334, 300, 232, 186, 177, 171, 151, 157, 212, 272, 293, 302, 350, 421, 453, 434, 405, 378, 327, 257, 227, 260, 302, 302, 275, 258, 257, 253, 242, 231, 217, 209, 231, 280, 314, 310, 296, 302, 312, 303, 285, 276, 255, 209, 171, 173, 184, 156, 113, 122, 191, 260, 284, 280, 271, 247, 215, 207, 241, 287, 306, 296, 272, 249, 241, 252, 252, 202, 120, 84, 137, 231, 288, 285, 261, 249, 244, 224, 188, 160, 164, 193, 214, 204, 188, 198, 213, 187, 130, 111, 160, 220, 228, 197, 181, 190, 193, 184, 187, 208, 221, 207, 176, 146, 133, 153, 211, 276, 306, 297, 290, 314, 353, 363, 325, 264, 222, 222, 250, 279, 302, 323, 323, 275, 193, 141, 158, 205, 220, 197, 176, 179, 192, 212, 241, 261, 250, 227, 228, 244, 229, 181, 152, 170, 187, 159, 124, 137, 185, 206, 186, 170, 182, 193, 180, 174, 212, 274, 307, 294, 268, 257, 247, 208, 152, 123, 147, 196, 223, 219, 215, 229, 237, 220, 200, 213, 250, 266, 241, 208, 206, 232, 249, 242, 222, 213, 223, 240, 243, 215, 160, 106, 78, 82, 103, 126, 148, 171, 208, 261, 305, 298, 240, 190, 203, 251, 253, 185, 117, 121, 180, 226, 229, 214, 210, 222, 240, 254, 256, 245, 242, 256, 264, 240, 204, 202, 239, 265, 244, 197, 174, 199, 262, 328, 355, 327, 278, 264, 287, 285, 225, 152, 126, 143, 154, 147, 154, 187, 221, 235, 241, 252, 253, 233, 209, 208, 232, 262, 279, 280, 267, 241, 206, 179, 176, 198, 226, 239, 242, 250, 267, 293, 331, 384, 429, 430, 387, 340, 319, 318, 320, 323, 318, 285, 238, 225, 263, 294, 258, 184, 143, 157, 192, 230, 279, 328]
1928C28J6j4pNj5m0k0K1J9k5m6j8K0K6Lj2JL7O6M6j5n4k9J8K8RKPj1l7l4rlj1NL2J5m5q0m8
1923A31MK3K0J8RrqJ8L7L3L1M6M0jl3k1Lj1m5n3l2j6rOJ6kk4rL6N8L3nj7KK9L6J5j8l4j7J
1918B81lk3k5oQO%KJ0K5M1M0J1k5l9k7j1jMPNKQJ4J0mj1j1qkPOkojj3m4n7j7M2O0L0lj2j0
1913B58qMK4K1%j3j1j9l8k9J5M6K1k2k9mMj4k4kL3M7L7Qk2m4n0l9j1K3M7L3j1l9k2J4K1lj9
1908A83pK1M2M9L6km3m6j3Lk7n9l5K5N5L6J4K2L7K7MlKjlJ1K3J4mKJ4rn9o7pN5N1Kk3j3j8
1903B89l6k4K9N8K8k4l9j5QJ7J8J1j2l8l9j3K1M2M6K8rm2l9mK3J7j%J4Pk4m6l3j0pk2k1MK9
1898A91K6LoPK7M1L9J6k2n0l5J7N2K7m6r3o0L0R1P0Nk4%K7Ql6n1k5J1J9NpKK7L9J3k8m3j6
1893B51RKj7j6OJ9K4K9K0pk6jL0J1l6l6K2N9J8n1o9l6LK9M0K2j7l0J4O5N1j5m6j1K9J3l3m2
$$ y = [328, 344, 330, 323, 328, 313, 273, 253, 274, 293, 268, 222, 204, 224, 250, 253, 241, 242, 279, 345, 391, 376, 322, 293, 311, 339, 348, 350, 357, 346, 309, 275, 266, 263, 252, 257, 289, 304, 259, 179, 131, 135, 158, 178, 196, 205, 196, 188, 206, 243, 276, 307, 353, 393, 392, 359, 338, 341, 330, 285, 232, 200, 184, 175, 181, 197, 195, 171, 162, 198, 256, 289, 284, 267, 269, 298, 334, 349, 331, 297, 280, 281, 278, 255, 230, 224, 232, 238, 238, 240, 250, 275, 316, 356, 367, 342, 303, 276, 265, 264, 268, 275, 280, 282, 290, 304, 314, 310, 299, 288, 280, 278, 285, 291, 289, 283, 282, 269, 225, 168, 151, 193, 253, 283, 280, 268, 258, 250, 254, 278, 299, 299, 286, 275, 256, 218, 189, 204, 250, 271, 249, 220, 216, 220, 206, 182, 180, 213, 260, 297, 305, 283, 239, 189, 150, 139, 162, 209, 242, 231, 192, 170, 184, 205, 202, 183, 176, 197, 239, 288, 324, 322, 279, 233, 220, 223, 196, 137, 102, 127, 182, 218, 232, 254, 291, 318, 322, 319, 321, 320, 317, 328, 351, 365, 361, 363, 377, 368, 309, 242, 235, 290, 341, 343, 320, 307, 289, 253, 229, 258, 316, 344, 320, 281, 266, 274, 291, 309, 320, 308, 270, 231, 218, 239, 281, 327, 355, 346, 304, 265, 261, 284, 301, 300, 300, 314, 321, 297, 251, 218, 208, 201, 179, 158, 162, 191, 217, 220, 214, 221, 248, 289, 328, 344, 322, 272, 237, 254, 306, 333, 287, 194, 134, 164, 255, 325, 330, 306, 306, 333, 341, 305, 254, 229, 240, 259, 264, 257, 259, 286, 325, 338, 310, 267, 251, 260, 262, 245, 229, 235, 254, 278, 307, 327, 320, 294, 293, 323, 334, 298, 262, 284, 343, 361, 310, 241, 205, 208, 237, 277, 299, 282, 252, 266, 331, 382, 367, 321, 310, 339, 352, 319, 277]
1889B77lL2J6l2o0l9jJ3PJ9N3O1J5m5o1l0nnjK4M5L2Jj7pJ1J2nj2JJ3rn3o2j2M4M9J3j0qj5
1884B46l0j8K0L8J3j2jK1J3j3k0kJ2RLOJ0Jk1m4m2qL8N0J8j4j3PMj7j3K2M2J5k5k8J2N2N3
1879C84K2qj1Jol6o1m0J4N1M5J6kj3l3n0l2J4M1L0Nmnj4j9lK2K2rl4k6KK7L6L3J7jj2k0l4
1874C09m4k4J7L7J7j2j1J0K1J1oj8k4j8lMloJ2L1K2MPK1J2j7k4OK5Pk2j4K3L7Qk8k4RK0j3
1869C59m3k2L0L7j7o7n3j2LMK7O0N9K5RJ0j1l9k2L4N7J8j9pNk8o8n1KJ7mj1J2K1mk7j7Jql7
1864B23m1%N8P4L4pRN2M5j9o1l4NJj5QM1K5j5k1ok8p1n4K7Q1N5Prj9n2o7k5K8K5j7k1K0N6
1860B92M8K5J3Onqlrl2m5k6J2K9K2J4J8K7K3K0K8L2Km5o0k7RQqnPok6j7Njk6qN2Q1K9l9n3
1854C53k6j7k1JM3N0Ol9m4j7J8M6N0J5l7n8k5K5M2K5PNQOMOMnj1qKPkk1l4l0j0QLk1l1JM8
$$ y = [277, 274, 306, 322, 290, 230, 191, 190, 203, 210, 229, 282, 343, 358, 313, 252, 222, 217, 212, 211, 235, 280, 312, 313, 296, 289, 300, 312, 307, 295, 296, 309, 300, 247, 185, 173, 217, 266, 279, 269, 261, 246, 216, 198, 218, 256, 269, 257, 256, 277, 290, 277, 257, 255, 267, 276, 279, 285, 295, 296, 275, 231, 189, 181, 219, 269, 287, 273, 260, 267, 271, 254, 241, 263, 305, 320, 295, 267, 279, 331, 384, 406, 398, 387, 388, 382, 346, 285, 245, 259, 310, 355, 371, 369, 356, 323, 273, 241, 255, 296, 326, 331, 327, 322, 308, 289, 286, 308, 330, 321, 287, 261, 263, 290, 326, 359, 376, 375, 363, 343, 309, 265, 241, 258, 295, 312, 300, 289, 299, 320, 331, 325, 307, 283, 265, 262, 266, 263, 257, 269, 300, 322, 326, 333, 354, 366, 349, 325, 331, 356, 363, 341, 327, 350, 387, 395, 367, 343, 352, 372, 359, 316, 294, 324, 361, 344, 277, 224, 212, 215, 219, 246, 306, 365, 390, 399, 409, 398, 359, 337, 371, 428, 446, 427, 420, 425, 397, 329, 278, 280, 297, 293, 282, 294, 315, 311, 284, 267, 268, 260, 223, 182, 182, 240, 314, 348, 341, 350, 402, 447, 428, 367, 333, 338, 339, 324, 332, 373, 398, 383, 362, 356, 328, 257, 203, 230, 311, 366, 373, 364, 345, 293, 226, 201, 229, 254, 237, 216, 236, 292, 340, 365, 378, 384, 379, 371, 368, 359, 327, 282, 256, 268, 297, 319, 333, 351, 378, 401, 421, 449, 481, 483, 438, 378, 351, 360, 368, 360, 355, 362, 356, 330, 313, 318, 317, 291, 283, 335, 416, 445, 406, 353, 327, 310, 289, 290, 333, 383, 389, 350, 306, 289, 307, 353, 403, 418, 381, 323, 298, 323, 365, 390, 397, 402, 410, 416, 420, 426, 430, 425, 414, 406, 408, 415, 413, 392, 358, 328, 318, 326, 329, 308, 277, 278, 326]
1849C26N4J1k1MM4L1k4m0MM2J2m9o3k6OPoqonkJ1K0J4ok7k0K5P4O7Ol5oM6M3rk9mJ2j8m2k6
1844C87pk7n3k4M0O4K1k8k5J8M6L1j0l1k1PK1J3JJmk8m8l4J4N2N2K8Nk1n5p2m4J9N7L5j6m0
1839C24j8J4K9L4M1L7Ql2m4j6K1L0Lk3j9J2L0J5j1j4kmk2k2NK8J7jPK4J6j2j7NJ6M%J7K0o
1834D94k4lK4Ql4l9jL2K4jqkj0j8lL1M7K7j2l4l1j9j1j0rmPJ9J8lk3j2L0O2M7jl3k2J0L0K6
1829E69J9J7K1J5lk5l1j2J7K8J5LJ3L3M5L8J9lk2l4k7pJ9L0K6J0Jjnk7n9o4k5L6P3O2K7QJ1
1825H10J8Pj7k8j8JJ5J3lj7k2j2JJ0J3K0L1L2J4qj8nK5N3N1J2l4l7NL4J7j0J0N9P3M0J0J7
1820A162L0K1RK2M0K6mj4J3L8L2kl7m6k2J3J7j6m6l3J1L7K2j8n3o7o4n0l4j1J7L9K7j3m1l4
1816I71rmoJ2M6N5L2OJRQJLJ6L4L9K1mnK2M4K9KJ1M7O1L9J7Rj5n9o7j1N1N1Oj6kJ0jj5k2l4
$$ y = [326, 380, 391, 370, 374, 418, 449, 425, 385, 389, 431, 443, 394, 331, 305, 311, 318, 312, 304, 298, 293, 291, 302, 322, 336, 330, 303, 283, 308, 382, 449, 455, 420, 414, 460, 503, 494, 465, 461, 473, 455, 413, 387, 380, 353, 300, 276, 316, 380, 401, 373, 348, 366, 412, 443, 433, 402, 381, 388, 409, 422, 423, 424, 420, 392, 344, 310, 324, 376, 428, 456, 461, 440, 385, 313, 269, 288, 345, 380, 364, 324, 306, 320, 349, 383, 424, 461, 469, 437, 393, 377, 398, 428, 431, 408, 389, 401, 431, 446, 435, 421, 419, 415, 393, 371, 376, 404, 421, 420, 427, 451, 467, 455, 438, 443, 459, 463, 463, 480, 500, 494, 470, 467, 491, 499, 465, 426, 425, 457, 481, 480, 472, 470, 460, 442, 439, 470, 517, 544, 532, 498, 467, 448, 437, 427, 418, 414, 421, 440, 458, 455, 432, 420, 450, 512, 559, 558, 525, 503, 513, 543, 569, 588, 605, 626, 641, 638, 613, 582, 570, 587, 615, 630, 633, 646, 679, 724, 762, 781, 778, 756, 722, 695, 688, 707, 737, 763, 773, 774, 773, 768, 741, 682, 618, 593, 629, 702, 764, 791, 799, 810, 828, 835, 818, 790, 772, 773, 788, 801, 798, 781, 759, 747, 748, 758, 771, 791, 822, 854, 868, 860, 842, 837, 862, 915, 966, 978, 944, 907, 912, 946, 963, 953, 963, 1022, 1095, 1135, 1145, 1162, 1192, 1213, 1222, 1244, 1284, 1310, 1306, 1292, 1305, 1343, 1375, 1373, 1336, 1290, 1268, 1281, 1298, 1282, 1236, 1203, 1214, 1251, 1273, 1255, 1202, 1135, 1071, 1021, 987, 976, 993, 1032, 1059, 1046, 1005, 971, 962, 958, 952, 964, 1010, 1065, 1097, 1103, 1104, 1113, 1121, 1122, 1125, 1141, 1175, 1214, 1235, 1231, 1226, 1248, 1292, 1321, 1323, 1334, 1381, 1442, 1481, 1498, 1507, 1492, 1433, 1366, 1355, 1406, 1457, 1463, 1447, 1445, 1455, 1454, 1439, 1417, 1383]
1810A383m4l3jOj9m2l9l9o2p8n3j3kj8j7J9M6L4LrJQjj8l5l7j8J3K8K1RQQlj4qlk2m4l0J1
1805H96K9J1J5N2O7J7m0k4L9N5Mm3m0k8m0m5j5J0j2m6l3RJ7k7n9m5j3OJ4L0L7K0pj8oJ6K6
1801H29K0NPK5K6j2n4m3RL0kl8k8oj8l9j1M9O6K3k2k0Kjj5qK3M5L8Ql6p1p0k6K0K4RJ4M4N2
1796H48J9j9l5l6l5j8K4N3L0k0l6MN0N3J9rj8j9k5k9j8JJ5J4J0J6K8L2K2NlnnNK0K4jm2n9
1791H60m1j3RL2N3M8Ql3l2mR%LL0M3J6j9k0JJ1NQJ7Kl3l5J1N3L7k0o0n4k3J3M6N7L2j4l4j3
1786I56J8L9N7O8M4j6o0m5JJ3j2k1J4O0P2M2NrQK5J5j9l5j4J2Mj0J2O1O7J4l4k3J2J2j8k1
1782A294J0L5L0J8K3M1M9M3J4l2o7n2QO1N7J6j2%J9K2J4K4M8O3M9J2k7m0k1J7L3J2j9j6J7
1778A743L4J7lMK3K3K2L8M8J6l3m3qJ8J3RK7L4J4J0M8Q4N5j2m3pN2Q0O2J5l1l5NM7M5Rj4m
$$ y = [1383, 1339, 1306, 1305, 1311, 1292, 1250, 1211, 1172, 1110, 1032, 979, 966, 964, 946, 929, 948, 994, 1028, 1031, 1022, 1023, 1031, 1030, 1012, 977, 940, 922, 935, 963, 984, 993, 1001, 1009, 1006, 992, 984, 981, 959, 915, 885, 896, 925, 936, 951, 1003, 1070, 1087, 1047, 1023, 1062, 1117, 1121, 1078, 1038, 1010, 970, 925, 910, 920, 908, 862, 829, 838, 855, 828, 769, 724, 711, 717, 731, 761, 798, 818, 811, 793, 787, 803, 829, 849, 854, 861, 886, 912, 900, 846, 803, 812, 842, 840, 802, 774, 768, 750, 711, 700, 749, 815, 838, 816, 796, 798, 797, 782, 774, 797, 842, 880, 888, 852, 781, 711, 685, 705, 729, 738, 752, 796, 848, 867, 848, 813, 777, 742, 724, 748, 801, 831, 811, 775, 779, 829, 882, 901, 892, 874, 855, 830, 801, 783, 784, 799, 813, 823, 839, 867, 899, 921, 926, 923, 918, 913, 918, 938, 962, 961, 919, 860, 819, 806, 815, 847, 900, 948, 956, 923, 891, 887, 896, 896, 899, 929, 972, 988, 969, 949, 950, 961, 966, 974, 991, 993, 960, 925, 936, 989, 1026, 1006, 946, 892, 869, 882, 928, 985, 1017, 1003, 969, 956, 974, 1013, 1070, 1138, 1182, 1166, 1106, 1061, 1062, 1075, 1063, 1042, 1056, 1116, 1188, 1230, 1235, 1226, 1234, 1259, 1274, 1255, 1220, 1206, 1218, 1222, 1212, 1224, 1285, 1352, 1366, 1332, 1309, 1321, 1333, 1315, 1294, 1304, 1339, 1369, 1387, 1410, 1451, 1500, 1543, 1557, 1525, 1458, 1406, 1414, 1475, 1532, 1548, 1536, 1536, 1555, 1577, 1591, 1615, 1663, 1726, 1775, 1787, 1760, 1720, 1699, 1716, 1749, 1761, 1742, 1726, 1743, 1777, 1794, 1791, 1795, 1818, 1841, 1863, 1901, 1949, 1965, 1932, 1889, 1881, 1899, 1912, 1921, 1948, 1982, 1996, 2006, 2054, 2138, 2193, 2181, 2138, 2131, 2183, 2263, 2325, 2340, 2309, 2274, 2279, 2326, 2371, 2380, 2366, 2362]
1773B362K2M3N3M3J9J0L3N7M5J3MQj0l8k2L0N5L6K2M2M8J4MN3R0M2l5l8K4M5%k1L4R7Q8L9
1768C311K5N1O0L7K8N3P3N2J8J3L9N9O3P1R0R0N2RML3N9O1O1Q0R8Q5N0L4N8R8J14R1O0M9O1
1764E290P0O3O1P5Q7P4M8M5O5Q5Q9R6J15J24J13J01J08J25J32J23J14J16J30J42J37J11Q9
1761G928J07J60K02K11K06K02J89J67J68J99K23K10K02K40K92L02K89L13L60L67L17K86L35
1758A3475M22M70M65M51M56M82N12N46N83O21O50O64O79P24Q09R00R54R83J038J126J205J257
1755B9472J310J387J468J533J594J674J760J826J871J906J935J946J927J870J783J692J613
1753E8567J524J383J204J031Q65O56L94J47k9j67l28m99o29p13p75p98p51o64o05n77n05l56
1751E8375j93q3mJ00K46M14N89P66R26J059J189J356J560J770J965K162K383K632K883L120
$$ y = [2362, 2384, 2427, 2480, 2523, 2542, 2552, 2585, 2642, 2687, 2700, 2704, 2712, 2702, 2664, 2642, 2672, 2727, 2763, 2785, 2827, 2875, 2889, 2893, 2946, 3036, 3078, 3043, 3005, 3029, 3074, 3074, 3053, 3087, 3184, 3272, 3311, 3336, 3387, 3447, 3484, 3512, 3565, 3638, 3690, 3708, 3721, 3760, 3819, 3882, 3953, 4043, 4133, 4185, 4194, 4198, 4231, 4290, 4351, 4412, 4492, 4590, 4675, 4725, 4759, 4817, 4915, 5029, 5120, 5180, 5229, 5290, 5360, 5423, 5484, 5559, 5646, 5720, 5768, 5813, 5878, 5963, 6052, 6148, 6263, 6387, 6500, 6601, 6709, 6834, 6966, 7089, 7203, 7319, 7449, 7591, 7728, 7839, 7928, 8035, 8195, 8397, 8608, 8814, 9016, 9205, 9372, 9540, 9739, 9962, 10172, 10374, 10614, 10906, 11208, 11497, 11810, 12170, 12537, 12854, 13140, 13475, 13897, 14367, 14832, 15283, 15739, 16221, 16733, 17279, 17862, 18483, 19133, 19797, 20476, 21200, 22009, 22909, 23863, 24846, 25884, 27010, 28215, 29472, 30782, 32169, 33637, 35170, 36764, 38438, 40198, 42024, 43895, 45801, 47736, 49682, 51609, 53479, 55262, 56954, 58567, 60091, 61474, 62678, 63709, 64574, 65230, 65624, 65771, 65742, 65575, 65247, 64748, 64119, 63406, 62631, 61833, 61082, 60418, 59813, 59236, 58731, 58375, 58182, 58099, 58095, 58195, 58441, 58855, 59444, 60210, 61136, 62195, 63384, 64740, 66300, 68070, 70035, 72197, 74580, 77212, 80095, 83215]
1748H3215L350L598L869M130M344M525M696M857M974N027N024M969M853M676M447M150L760
1746A58464L282K748K164J502P69K3o90j398k118k789l317l701l995m215m313m282m181m056
1744A29897l892l669l427l217l030k805k522k218j933j674j419j153q75o05l60j29J36M53
1742I7558P83J068J314J582J905K247K565K848L116L369L594L801L993M147M230M249M229
1740A46598M166M034L823L537L167K696K134J532R14K50m80j255k022k753l424l996m428m727
1737A49766m933n064n116n084m978m809m592m369m188m034l856l627l383l159k954k742k530
1735H0348k333k143j939j727j535j360j183j007q63p51o19m39k41p8M3J54K75L96M99N71O15
1733F6683O38O59O89O91O30N12L99L10K01K5j91l92n85q18j087j323j485j617j766j907j987
$$ y = [83215, 86565, 90163, 94032, 98162, 102506, 107031, 111727, 116584, 121558, 126585, 131609, 136578, 141431, 146107, 150554, 154704, 158464, 161746, 164494, 166658, 168160, 168929, 168952, 168262, 166864, 164746, 161957, 158640, 154939, 150944, 146729, 142416, 138134, 133953, 129897, 126005, 122336, 118909, 115692, 112662, 109857, 107335, 105117, 103184, 101510, 100091, 98938, 98063, 97458, 97098, 96969, 97105, 97558, 98341, 99409, 100723, 102305, 104210, 106457, 109022, 111870, 114986, 118355, 121949, 125750, 129743, 133890, 138120, 142369, 146598, 150764, 154798, 158621, 162158, 165325, 168021, 170155, 171687, 172601, 172851, 172371, 171116, 169094, 166341, 162917, 158921, 154493, 149766, 144833, 139769, 134653, 129569, 124591, 119782, 115190, 110821, 106633, 102599, 98743, 95116, 91733, 88574, 85620, 82878, 80348, 78015, 75872, 73933, 72206, 70671, 69311, 68128, 67121, 66258, 65507, 64888, 64449, 64208, 64130, 64173, 64327, 64602, 64998, 65497, 66068, 66683, 67321, 67980, 68669, 69360, 69990, 70502, 70901, 71211, 71412, 71437, 71246, 70854, 70269, 69451, 68364, 67041, 65556, 63939, 62173, 60266, 58279]
1730E8279k012k031k047k017j942j872j832j780j684j584j529j497j431j332j250j202j155
1728C0082j093j034r94r44q71q14q07q22q00p36o73o37o02n49n00m80m78m66m42m20m07l98
1725A5115l95m00l84l31k70k66l21l59l16k34k00k35k75k64k22k00j99j93j76j72j94k11k03
1723I095j71j44j39j58j85j92j63j16q5r5j22j36j24j06j02j16j30j27j10r1q7j02j25j36
1720F033j21q6n7n2o9q5p5m2j2j6n4r4r8p2n0n3n4l2j0j7m8o2n0l5l4m2m9n9o0k8J9K6k3p5
1716D364q0n2m2n1n4m7n0n7m9l3l2l7k3kol7n1k6kj9o4r4q9n4j2Nk0o2p1n2n0p8q0k4M0M9
1711B958J4j4k2l3m0j1L4M0%l4l1k2l7n1l8j2mrJJ6J7jj4j3kJ0K2K4Kl6o4o3m2j6Jjk2m5m8
1706B414k8nol4n4l1K4N3K3l5o2m3k1j6rJ8K8km0l5KJ6kj0RK2km5o2l8qJj7l6k8J0M4L9Oj0
$$ y = [58279, 56267, 54236, 52189, 50172, 48230, 46358, 44526, 42746, 41062, 39478, 37949, 36452, 35021, 33689, 32439, 31237, 30082, 28989, 27955, 26961, 26017, 25146, 24332, 23525, 22703, 21903, 21167, 20494, 19857, 19255, 18706, 18206, 17726, 17248, 16782, 16340, 15920, 15513, 15115, 14720, 14320, 13936, 13605, 13335, 13069, 12748, 12389, 12073, 11839, 11639, 11404, 11129, 10865, 10643, 10443, 10244, 10051, 9875, 9703, 9509, 9298, 9095, 8924, 8780, 8641, 8483, 8298, 8106, 7943, 7827, 7742, 7647, 7525, 7389, 7265, 7159, 7057, 6941, 6811, 6684, 6574, 6483, 6396, 6294, 6169, 6033, 5912, 5826, 5769, 5717, 5648, 5563, 5488, 5446, 5434, 5418, 5364, 5270, 5172, 5100, 5050, 4997, 4943, 4911, 4901, 4884, 4836, 4774, 4724, 4689, 4655, 4613, 4564, 4505, 4445, 4417, 4436, 4462, 4439, 4364, 4284, 4232, 4190, 4139, 4085, 4038, 3988, 3931, 3882, 3849, 3817, 3780, 3757, 3755, 3749, 3712, 3661, 3635, 3633, 3614, 3550, 3456, 3367, 3313, 3301, 3306, 3286, 3224, 3153, 3101, 3051, 2973, 2893, 2869, 2909, 2958, 2972, 2958, 2936, 2903, 2863, 2852, 2886, 2926, 2926, 2892, 2861, 2839, 2802, 2751, 2713, 2701, 2697, 2688, 2689, 2705, 2722, 2721, 2707, 2694, 2692, 2702, 2724, 2748, 2750, 2714, 2650, 2587, 2545, 2529, 2530, 2529, 2507, 2462, 2414, 2386, 2381, 2375, 2341, 2287, 2256, 2280, 2333, 2356, 2321, 2259, 2216, 2195, 2179, 2170, 2188, 2216, 2214, 2174, 2139, 2141, 2157, 2155, 2145, 2154, 2176, 2174, 2129, 2067, 2029, 2021, 2022, 2005, 1969, 1941, 1951, 1995, 2034, 2040, 2030]
1701B030jLj9m3m2k1lJ1J6lm0n8k9J3J8j2l5l1j5%J6K2Pj3nK7K8j6n1l2QRk3l0J3N2M2J2J3
1697A818L6J8n1j02p5qJ6k0m6j2M7O2L0Kok1n5p7o2k1J3L5M0J9k2n9n5j8K5M2K7j0l2j3L1
1692A496M5Mn6p0l8n%n%J5K1J1lj1oJ1K1K0K0K7K2j1m8n5l8k7k7j1K3L4Pj7j0Lrk7j8K%k3
1688A267l4l0l1l0jL6L2pk7lJ3rk2J5N9M4j1l7k0j0k6k5NJ6j9n1k5K3L2%j2J1K1j0m3l1J5
1683A075L4Nl4l8oK0J3j0k0j1knnRK2J5nj3KK2L5L1J2j6k7nK6L7K7K1K5J6j4m0l7j1J6L0K5
1678A219PnJ5N1N7J9k2l5l3l6k7J3M4K4k3k9J1L5J3j9k1prk0j7mkj3j3KK2K6Ml2m5j0M6O2
1674A248J9k9l1NK9K5J7J7K1K9M7N7L6%rJ7L7J9j4j5J4L1K1J4L3O7O8K6k7m7k8KJ7K3K5J4
1669A778k1o6q6p8n5k9kJ5Kl5m6j4K8K0l3o4l1L2N8L0oj5lLjPK4K8J0j6j8NL1L9K8J7K1M0
$$ y = [2030, 2029, 2032, 2013, 1970, 1928, 1907, 1904, 1915, 1931, 1928, 1888, 1830, 1801, 1814, 1832, 1820, 1785, 1754, 1739, 1739, 1755, 1777, 1784, 1771, 1766, 1793, 1821, 1805, 1754, 1722, 1730, 1739, 1716, 1686, 1699, 1751, 1793, 1805, 1818, 1854, 1872, 1821, 1719, 1644, 1636, 1652, 1632, 1586, 1574, 1621, 1683, 1713, 1715, 1709, 1688, 1633, 1556, 1494, 1473, 1486, 1521, 1561, 1580, 1558, 1499, 1444, 1426, 1451, 1493, 1520, 1510, 1478, 1465, 1496, 1541, 1545, 1489, 1419, 1381, 1376, 1376, 1371, 1371, 1386, 1407, 1418, 1415, 1404, 1398, 1409, 1430, 1450, 1470, 1497, 1519, 1508, 1460, 1405, 1367, 1340, 1313, 1302, 1325, 1359, 1366, 1349, 1339, 1342, 1333, 1306, 1288, 1290, 1290, 1267, 1233, 1203, 1172, 1142, 1141, 1177, 1209, 1202, 1175, 1172, 1185, 1176, 1154, 1169, 1228, 1272, 1261, 1224, 1204, 1194, 1168, 1143, 1148, 1164, 1145, 1094, 1069, 1092, 1124, 1124, 1112, 1123, 1144, 1134, 1091, 1060, 1075, 1109, 1114, 1080, 1042, 1036, 1056, 1069, 1059, 1039, 1028, 1026, 1021, 1016, 1025, 1047, 1062, 1057, 1044, 1046, 1068, 1103, 1134, 1146, 1130, 1103, 1098, 1124, 1161, 1188, 1209, 1234, 1250, 1236, 1196, 1159, 1148, 1164, 1194, 1219, 1226, 1221, 1236, 1287, 1344, 1363, 1341, 1306, 1273, 1237, 1210, 1223, 1267, 1291, 1268, 1239, 1250, 1285, 1298, 1279, 1258, 1251, 1242, 1222, 1205, 1201, 1199, 1186, 1173, 1175, 1197, 1223, 1227, 1195, 1150, 1140, 1186, 1248, 1267, 1238, 1207, 1212, 1241, 1266, 1283, 1300, 1321, 1350, 1397, 1454, 1490, 1490, 1481, 1498, 1535, 1554, 1540, 1525, 1539, 1570, 1591, 1605, 1638, 1705, 1773, 1799, 1772, 1725, 1697, 1699, 1716, 1739, 1764, 1778, 1757, 1691, 1605, 1527, 1472, 1443, 1441, 1456, 1458, 1423, 1377, 1363, 1391, 1411, 1378, 1314, 1283, 1315, 1373, 1403, 1397, 1382, 1379, 1382, 1381, 1388, 1412, 1440, 1450, 1434, 1416, 1421, 1452, 1491, 1519, 1536, 1557, 1597]
1665A597N9O0L7%k8k8mK1K7K4K1Rk2n1l8RK8j0n6n0j1mk8k5J1J7l6q0m7K2M0jm2m7l8l4l1
1660A271k7k8k3OL8K7k6o2l7J5L8K6RJ0J6J0qk8l9l5rL5P1O4Po4p9k9K0J3k8l3lOk3l7mK8
1655A088J3k6l3qJ2Nj8l6m0l0j6j6j9lL5N1K6j1j7nqk3l1k8k8j4J9M5K5k3m5k6jNkj2k7k5
1651G53JK3ln3n3QN7L5j2j5K5M1Ql6m6k4jOnrPL1K9nl6l4j9k7m1j9L7P9O0Ok8j1K8M4K4j3
1646H12l7l4k3k0k2j5KQpk7k7nJ4J2NJ7L3K1j9m0k0Lj3m1l9lK2J8Ook1k3J8P2O5kl7ON9L3
1641G45m0o1j5K4Qk7m5n2n6l8MK5Lk9k9mJ0MjMJ5L0L4J5k0l6j7J1J0ooJ6L1K6K2K6J8rl6m0
1636E14k6j3kK1L6J8k1l0PM7L5rk8lK4J8mj5k8n2o3k9K9O4O0L7J0k0m0k6J0K6Kk8l0j4mjj
1631D71%J0M4Q6Q2J0p1q4l1J2Mk3k6qLkqj0j0%J8L0K4J0J0K8L1Ml6m6k3%pk4j6J6K6ml4k5
$$ y = [1597, 1656, 1716, 1753, 1753, 1725, 1697, 1693, 1714, 1741, 1765, 1786, 1795, 1773, 1722, 1684, 1693, 1721, 1711, 1655, 1605, 1594, 1590, 1562, 1537, 1548, 1565, 1529, 1449, 1402, 1424, 1464, 1463, 1421, 1374, 1336, 1302, 1271, 1244, 1216, 1193, 1199, 1237, 1264, 1238, 1176, 1139, 1154, 1192, 1218, 1227, 1237, 1253, 1263, 1255, 1227, 1188, 1153, 1144, 1179, 1250, 1314, 1321, 1257, 1178, 1149, 1169, 1182, 1154, 1121, 1118, 1124, 1101, 1064, 1060, 1088, 1101, 1075, 1042, 1034, 1046, 1051, 1033, 997, 957, 927, 911, 895, 876, 873, 908, 959, 985, 974, 957, 952, 944, 921, 890, 862, 834, 820, 839, 884, 909, 886, 841, 815, 814, 819, 817, 805, 778, 753, 754, 777, 774, 721, 668, 676, 733, 768, 756, 741, 766, 807, 815, 779, 733, 709, 708, 714, 709, 700, 707, 738, 767, 762, 726, 692, 673, 646, 605, 586, 623, 702, 762, 768, 740, 729, 757, 801, 825, 812, 775, 741, 718, 698, 676, 661, 663, 671, 664, 637, 610, 605, 619, 631, 636, 653, 686, 707, 688, 648, 628, 631, 618, 577, 538, 535, 557, 575, 581, 575, 554, 531, 549, 621, 686, 684, 647, 653, 712, 745, 705, 644, 629, 653, 661, 634, 589, 537, 481, 443, 447, 472, 475, 446, 417, 413, 423, 427, 426, 430, 445, 475, 509, 524, 504, 468, 451, 462, 472, 466, 460, 476, 507, 533, 555, 581, 599, 590, 554, 514, 488, 475, 473, 494, 530, 548, 527, 497, 504, 551, 586, 577, 549, 546, 570, 588, 584, 569, 541, 489, 426, 397, 426, 490, 550, 587, 597, 577, 537, 511, 521, 547, 549, 521, 491, 477, 473, 472, 471, 471, 481, 525, 611, 693, 703, 632, 548, 517, 529, 533, 510, 484, 476, 479, 477, 469, 459, 449, 449, 467, 497, 521, 531, 541, 569, 600, 604, 568, 522, 499, 499, 492, 468, 452, 468, 494, 490, 456, 431]
1626D31RK1%j8j2%mj0njqj7lK8N2N4L4Jl1m0k2RK3J7J2J6J1j7m5m5rK5K8Jk6l0j5MJ8K0%l6
1621D20n5l0K0N3M7K6J3RMKQQok4k9k2pK4N8N8J0m4n3k4j1k2j5K6N6M4J2%ol2n3l3J6M0K3
1616E11%poj2j5j2nqrqrj3j2pqj2j2JJ9L3M0K5j5n0m3%K4J6LJ2K0Kj4%L3M0J5j1k0j0MJ0l
1611D87k6k5KJ3j2k2K0P1N6rm0j2Rj5l6j2K6L5K1J0j0m5n8k0L3M9L6J9kl0l1J2M6K2k4k1J0
1607E27mn5n0K4O6J8m9m2J5L2kl4k5QM1N8L9j5o2n8j2J9J8Kj0j9k2pRNj2j2J3K8Pl4n2k8J6
1602C41M0J7k7m3j6Qok9j1L4N5M3K5J6j0m2m7j7%j3j2J8L2Kk8oL4K7j2k3OK4Rnkj0m0m9j8
1597B65J8L0L3N3N7K0k7l6j1%qj4j1k1k9mL7K8m4r2m7M2P3L6%J5M3M1J2qplnj2j8j7JK2L0
1592D42K4J3Mj0k5k1kJj7l0j2J6K5J6Qkk3l5pM4N8Qn4o6j9L6N2L2Mpmlprnjk%Lj5n0o5k8K4
$$ y = [431, 440, 461, 461, 443, 431, 431, 427, 417, 412, 411, 403, 386, 383, 411, 463, 517, 551, 552, 521, 481, 459, 468, 491, 508, 520, 536, 547, 530, 485, 440, 431, 456, 484, 485, 459, 429, 414, 418, 436, 456, 456, 420, 365, 335, 355, 408, 455, 481, 494, 503, 507, 509, 517, 525, 519, 495, 466, 444, 437, 461, 519, 577, 587, 543, 490, 466, 455, 433, 418, 444, 500, 544, 556, 556, 550, 518, 465, 432, 448, 488, 511, 511, 504, 498, 486, 471, 459, 454, 446, 437, 429, 420, 407, 395, 388, 380, 368, 356, 357, 376, 409, 449, 474, 459, 409, 366, 366, 390, 406, 409, 421, 441, 443, 429, 429, 462, 502, 517, 506, 486, 476, 480, 490, 487, 461, 436, 438, 451, 439, 417, 437, 508, 564, 555, 515, 503, 512, 497, 461, 449, 475, 510, 531, 541, 531, 486, 428, 408, 441, 490, 526, 545, 543, 513, 482, 494, 540, 562, 538, 517, 527, 523, 468, 418, 442, 508, 526, 477, 435, 450, 482, 480, 446, 421, 429, 470, 528, 567, 552, 490, 432, 420, 439, 457, 459, 449, 430, 408, 401, 410, 415, 403, 391, 404, 432, 439, 405, 353, 325, 341, 381, 398, 371, 328, 312, 320, 314, 285, 274, 308, 363, 406, 431, 447, 437, 395, 348, 331, 331, 318, 306, 324, 356, 358, 330, 324, 358, 385, 373, 350, 356, 380, 389, 384, 382, 372, 332, 283, 265, 283, 313, 346, 399, 456, 476, 449, 413, 402, 402, 394, 380, 369, 348, 319, 315, 352, 380, 336, 244, 197, 239, 312, 348, 348, 363, 406, 447, 459, 451, 444, 441, 436, 424, 406, 389, 390, 412, 442, 466, 479, 483, 473, 448, 427, 425, 426, 409, 379, 367, 383, 408, 424, 432, 430, 407, 372, 365, 409, 467, 475, 421, 355, 336, 372, 424, 456, 460, 453, 449, 446, 439, 430, 425, 424, 422, 422, 425, 410, 360, 295, 267, 291]
1587B91L3kk4pJ0%j3KK6K9J5QQQJ9M8O1K5k9n4m5l9l7pM0N0%m7l9MK4J1norj8k2j4KJ9L1K9
1582C76Qk5n3n8l7NM1M4J9LJ6L3J9qoK8M0Ql3l6j5mj2j2NJ8Pj8l4k6LL8N7L4j1l4j3K2K2n
1577D06k1j6k1l6l1OK7kl0OP0O9j1o9l1M0M6nj8L5P4L3m8p4k3L8N1K2j1k3j9pkoj9k6pK4M0
1572D31K3pj2J1K8J0j9k7j5j4l7m5j2L2K3l8q0l9M5Q5M8j4l5j4QJ2Q%j3j7OM2N1K6LPJ6Kk4
1567D55l1k5k4k9j4J6L2J8lrlpk1l5l0j2J1K0J0mkJ4J8RJJ2K2J3j5k6qK2L2J1j5oL7P2N5k
1563E59m7m3k0j7l7m4k1J0K0Npplj0j7j1OJ4LrlNKkJ3L9M3J7j9l7l7k3jJ6J8J3J4Nl1o4m8
1558B44J2L7Jl6rM9O1K9Okk9o2m4J7M6Qk8oL3K8k%K8L2Oj8l2n2n6k1K5K3j4j5L2N6K3j2%J6
1553C74rl8j8L1L5j4m4k2J5K6K2K0J6nj8lK2K4jl4n1m2j4J9L7L9K8Ok3l9k0J6K8Mk3k7k2k4
$$ y = [291, 324, 322, 298, 291, 301, 301, 288, 290, 316, 345, 360, 368, 376, 384, 403, 451, 512, 537, 508, 454, 409, 370, 333, 326, 366, 416, 416, 369, 330, 334, 358, 369, 364, 358, 349, 331, 309, 295, 297, 316, 347, 376, 384, 359, 306, 248, 211, 216, 257, 301, 320, 323, 339, 372, 391, 383, 377, 405, 445, 453, 420, 384, 369, 365, 353, 341, 346, 364, 371, 353, 319, 293, 296, 334, 391, 425, 414, 380, 367, 389, 411, 406, 385, 369, 348, 312, 281, 287, 314, 312, 282, 288, 358, 427, 416, 347, 316, 356, 402, 397, 379, 414, 488, 521, 473, 399, 376, 414, 465, 487, 476, 453, 434, 427, 425, 419, 400, 374, 367, 391, 431, 454, 447, 435, 446, 474, 484, 465, 438, 423, 409, 372, 327, 315, 347, 370, 332, 252, 213, 258, 343, 391, 377, 342, 328, 336, 348, 356, 356, 343, 326, 332, 374, 425, 451, 454, 461, 477, 479, 455, 424, 399, 375, 346, 332, 348, 380, 398, 395, 386, 383, 376, 355, 320, 290, 278, 289, 309, 319, 315, 313, 327, 345, 354, 355, 367, 389, 402, 387, 361, 353, 375, 407, 418, 403, 397, 434, 506, 561, 559, 512, 469, 449, 432, 395, 351, 330, 340, 360, 365, 358, 351, 348, 338, 321, 310, 316, 330, 333, 324, 321, 326, 328, 326, 339, 378, 421, 438, 419, 382, 345, 322, 321, 337, 355, 368, 382, 387, 356, 292, 244, 256, 293, 294, 258, 249, 298, 359, 388, 394, 392, 363, 301, 257, 274, 320, 328, 300, 294, 327, 355, 353, 353, 381, 413, 419, 401, 369, 317, 261, 240, 265, 288, 274, 259, 291, 347, 370, 358, 358, 374, 365, 327, 309, 340, 375, 361, 317, 295, 310, 336, 358, 378, 394, 389, 371, 368, 390, 414, 413, 379, 328, 286, 272, 291, 328, 367, 395, 401, 378, 339, 319, 335, 363, 367, 344, 317, 295, 271]
1548B71k0jQrk3%M0M8J9nrnlJjk3l8oN4O7Pn8o0j7Qmj6j2plQK8L6L2K3J7Pkmqj8k3j3JJJJ5
1542C04L2K4MKJ4Mk2j8K3L9qo0m8J2M7L0%j2j2mJ6L6J2m5p6m1K1L7J2kJ4K8J4KJ6L3J1m0o4
1538C35l3J2K9J5Jmj6l1l0mK0J7PQJ2kk4k4pjj4j9pjj8l1k1kKmLJ5J4J1L5O6M9k4p8n7OL6
1532B41Pl4m0j0L0N7N1J3k2j7K0L5J1k0j7J0K6J6nk3k8pK8M9L2pl1l0k1j7qJ0K9L7K9Rp%K5
1528D21L0Lj9KL7J9m7q5m5J8K8nk0KK6K4J4J2Pj7m5m8k1K3N6N5K3pj1nk7o7p3j9M8O7M8M0
1523D42N5M2j5o4m9jJ2k3m3pM1L7rl9k0J1J5KjJ2J4nk6k2OL8N1L6Ll4n1l9mL2M7M3L5K9J7
1518E68ql1m0l1j2J0K5J5k1n0m5j3J5K9L5L1J2nLK8M1L2K1Pk2m2j3M9O9K2k5nM8N2mm9l9j
1514F56L0M7N7M4J9PK1K9J3kRL9N8O9Q0P7L8j7m2rN1R0R2P3N6M6L7K7J2j1l2k5QL7K4j2l1
$$ y = [271, 251, 250, 258, 249, 226, 226, 266, 314, 333, 328, 319, 314, 311, 312, 311, 288, 250, 244, 298, 365, 372, 314, 254, 237, 245, 241, 225, 213, 206, 203, 211, 239, 275, 307, 330, 347, 354, 352, 348, 340, 322, 299, 286, 287, 288, 289, 304, 336, 360, 364, 366, 380, 384, 362, 344, 367, 406, 398, 338, 290, 302, 349, 379, 379, 367, 355, 351, 367, 403, 415, 370, 294, 253, 274, 311, 323, 321, 335, 363, 377, 379, 395, 428, 439, 399, 335, 302, 314, 343, 358, 359, 355, 339, 308, 278, 274, 294, 311, 318, 326, 338, 336, 312, 288, 281, 280, 266, 247, 240, 239, 221, 190, 169, 167, 169, 165, 168, 183, 197, 208, 243, 309, 358, 334, 256, 199, 205, 241, 248, 214, 174, 164, 194, 251, 302, 315, 293, 276, 296, 331, 342, 322, 305, 315, 341, 357, 352, 329, 301, 294, 322, 371, 403, 396, 365, 335, 314, 297, 289, 299, 328, 365, 394, 403, 396, 396, 421, 451, 454, 435, 437, 474, 493, 446, 361, 316, 334, 362, 357, 337, 339, 365, 389, 403, 415, 422, 405, 360, 312, 291, 314, 370, 425, 448, 441, 430, 425, 398, 331, 258, 239, 287, 354, 402, 442, 497, 539, 524, 460, 411, 410, 422, 399, 356, 349, 390, 427, 418, 379, 359, 370, 385, 387, 386, 398, 412, 407, 381, 359, 365, 403, 454, 490, 493, 459, 408, 369, 365, 397, 444, 487, 522, 551, 568, 560, 529, 489, 458, 446, 456, 481, 496, 475, 425, 380, 367, 382, 411, 446, 477, 489, 484, 487, 515, 556, 588, 609, 616, 594, 552, 539, 588, 657, 679, 654, 649, 697, 749, 745, 696, 657, 656, 686, 733, 790, 834, 853, 860, 881, 910, 923, 921, 930, 969, 1027, 1096, 1176, 1253, 1291, 1274, 1232, 1223, 1274, 1364, 1456, 1529, 1585, 1631, 1668, 1695, 1707, 1696, 1664, 1639, 1647, 1684, 1708, 1696, 1665]
1509A665k9l1l7j6K7K7l1p9n7j0j6m9l0L4N4J2mM4P6K5l5mQ3J04M4LL6Q2P7M7N2Q2R1Q9J16
1505B442J67J73J10L9L4Q3J14J01P8P5O7L3%PL3L1j3n8p8q5q9q7q1q8j05j08r7r4j03j00p5
1501B326n6n0m3k7k9m5l5J3L9Mn0n7k6KK0N4R2Q9N3L3M8O3N9N7P4R8J07J03Q7O1M6O1Q5Q4
1497C340N8M6N8O1L5J0RK0J1k7p6j17j34j23j07j04j11j13j14j19j09p6n1o8j02r4n9o1j04
1493A779j10m9ROk5k2nk5o0m8QL9Pl7l8LM4O0N1L7K5Pj6k5LM9O3K6k1l2j3J%jOJ3J2nm5r5
1488A576j12p4j5Rj3n0o7n5k9j4k1k7qPl2r8j04k2M5J3o3p7k3Rmj6mpl0k8NJ2j6j9K4M2j7
1484F97r6j07n0OK0RjLJ5K3Nk8m0j7J6L0K8J5pl0k2J0K3P%K4L2j1o3o5l2j3j2OL0K0j7k9q
1479C71J0JjJ8L3K2Lj1k0k3j1Kqk9k2J3K1j2l1jL8K7k1m2k3j%NJ5Qj8k3K1O8O0km7k8K9N4
$$ y = [1665, 1636, 1605, 1568, 1552, 1579, 1606, 1575, 1496, 1439, 1429, 1413, 1364, 1334, 1368, 1422, 1434, 1430, 1474, 1550, 1575, 1540, 1536, 1619, 1723, 1767, 1770, 1806, 1888, 1965, 2012, 2064, 2146, 2237, 2326, 2442, 2609, 2782, 2892, 2931, 2965, 3048, 3162, 3263, 3341, 3416, 3483, 3516, 3516, 3523, 3556, 3587, 3574, 3516, 3438, 3353, 3264, 3177, 3096, 3008, 2903, 2795, 2698, 2604, 2501, 2401, 2326, 2270, 2220, 2177, 2150, 2121, 2076, 2041, 2054, 2093, 2097, 2047, 1990, 1964, 1966, 1986, 2040, 2132, 2221, 2274, 2307, 2355, 2418, 2477, 2534, 2608, 2706, 2813, 2916, 3003, 3064, 3110, 3171, 3256, 3340, 3398, 3444, 3502, 3563, 3598, 3608, 3617, 3637, 3648, 3621, 3545, 3428, 3294, 3171, 3064, 2960, 2849, 2736, 2622, 2503, 2394, 2318, 2267, 2199, 2097, 2003, 1944, 1883, 1779, 1669, 1620, 1629, 1635, 1610, 1588, 1583, 1558, 1498, 1450, 1458, 1497, 1504, 1467, 1429, 1432, 1476, 1536, 1587, 1624, 1649, 1656, 1640, 1615, 1618, 1667, 1730, 1756, 1735, 1703, 1690, 1691, 1691, 1690, 1696, 1709, 1721, 1716, 1671, 1576, 1464, 1390, 1375, 1384, 1371, 1321, 1254, 1199, 1170, 1156, 1135, 1108, 1100, 1107, 1075, 977, 873, 851, 896, 909, 846, 769, 746, 755, 751, 735, 731, 724, 694, 666, 671, 683, 667, 648, 672, 714, 697, 601, 494, 444, 450, 470, 479, 478, 481, 496, 519, 524, 496, 456, 439, 455, 485, 513, 528, 521, 491, 469, 479, 502, 509, 509, 533, 565, 554, 491, 426, 394, 381, 369, 375, 405, 425, 408, 379, 371, 381, 382, 381, 399, 432, 454, 457, 446, 426, 403, 392, 394, 386, 357, 335, 348, 369, 357, 326, 325, 363, 390, 369, 327, 304, 303, 303, 308, 323, 331, 313, 290, 311, 379, 439, 437, 390, 362, 391, 445]
1474D45J3n0o8l1J5K2j0l3k1J2L1K7J5PMJoj1j5k0j6NL2L5Ok9l1kJ7Jk9l5rK7N0M7J5k4m0
1469C47k0J4K6Oj7j9nOJ0Rll0m8l2J2M7M6K3R%j3j7JK2Nn0q4m8K7O9M9J2MJ8J4k3n3l6PK8
1465C13Jl3k6J6L5Nm0m7qL5M6L4K4K3J4j8n3n1mM3L4k5o7m4K2O7N8J3k8m6l6qK7N1M7K5kj1
1460C86olj4k8j6J6L5J8j7l7k9mJ5J8Kj4rJ6L0J7pj2lLLQJ6J3MMLj8m6n0j8J6L4M0M0J7l0
1455C93o8o2j9K8N1M5J7j5l4l8l4k1jJ2ol4k7K0M9K6j0j6nj9n4o1k7L%qJ3M6N7M1K8K7K7J5
1450C39ok3k7j5J0K9K5Lj6nJ9K3nl0j7J5J8k3n1k5K7M3J9j1k4k6k1ML7M0jm7o2m3j3K4N2M2
1446B78Jk2J5O7O1Ll3j0J8Nj8oK0Jm8n2MM9K2l2m2mK9K2mk9m7m1LN9P7M3kj9k6m0m3j1L2M4
1441C24K2kj0j0nQK3J5j4l3j9J0J8kk6k9j4lmoPK5K3kk4k9k6k5nL8O9N4Pj9j2ok0l5k9oJ4
$$ y = [445, 458, 408, 340, 309, 324, 346, 336, 303, 282, 294, 325, 352, 367, 374, 378, 379, 373, 362, 347, 327, 311, 316, 348, 383, 389, 360, 329, 327, 344, 345, 316, 281, 272, 299, 349, 396, 411, 387, 347, 327, 341, 367, 373, 356, 337, 332, 338, 348, 357, 354, 324, 276, 244, 256, 303, 349, 372, 381, 381, 368, 351, 352, 374, 379, 329, 245, 197, 224, 293, 342, 354, 358, 376, 390, 367, 314, 278, 285, 313, 314, 281, 255, 271, 306, 311, 271, 224, 216, 251, 297, 331, 355, 378, 392, 374, 321, 270, 266, 309, 343, 318, 251, 207, 229, 296, 354, 367, 339, 293, 257, 249, 276, 327, 374, 399, 397, 386, 380, 377, 363, 335, 319, 335, 370, 388, 371, 334, 305, 301, 316, 334, 336, 322, 313, 329, 359, 376, 369, 357, 354, 357, 360, 368, 384, 397, 401, 405, 408, 390, 344, 294, 276, 292, 326, 366, 406, 423, 393, 325, 263, 244, 272, 323, 368, 385, 370, 336, 298, 264, 243, 242, 254, 248, 214, 187, 207, 256, 282, 272, 256, 251, 232, 178, 117, 90, 93, 93, 85, 98, 144, 201, 242, 270, 297, 324, 339, 333, 310, 283, 268, 278, 307, 332, 335, 319, 314, 333, 356, 351, 321, 304, 319, 337, 314, 263, 238, 265, 308, 327, 316, 292, 266, 245, 249, 286, 326, 325, 278, 216, 173, 160, 184, 236, 278, 279, 257, 272, 339, 400, 403, 370, 360, 378, 383, 365, 359, 379, 380, 332, 280, 284, 333, 355, 323, 281, 277, 306, 328, 324, 295, 248, 207, 210, 269, 346, 389, 387, 368, 342, 302, 259, 248, 280, 324, 346, 344, 334, 324, 319, 327, 350, 365, 351, 318, 299, 309, 327, 325, 299, 270, 256, 253, 249, 243, 250, 275, 298, 296, 272, 243, 217, 192, 187, 225, 294, 348, 355, 336, 324, 318, 298, 263, 234, 228, 242]
1436B42K7L2J2k9n9m4KL6L3J1lJJ0J1jj7k2j5mRL1N0M9K3j0k9l2k2%J6Ok1k9oNj8l5jN2N4
1431C15Ll0nK4Pk4j4K5K6j5l9j5K1L3L5M3L5om9n0k4j8l0k4PK0%j9nJ2OnJ0L3K0k4m8k6KJ
1426B08j6j4J0K7K4K2L6N0L3j7o2o0j8K1K7J7J2J2Mrk1l2m9m4kN3P0L9jk0j8j4qkpj7j2RJ9
1421B50PoJJ3J6J0Rjk8n4n1j9L1Q0J05P8J5k1pRk1n8m2PJ7j8k8QL5J3j2LK1%l5k5RJ1j2kM2
1416C50N5Mm8l5J1K3jrJ0J9jj7oOkj3JJ9J2olJ4Oj9j9J5L0Jl3k8NJ3j9n4o1l0J8M6L1j0k9
1411B46pJ7J7J6L3L0j6n6k6L1K4m7q1k5M3M4kk5j3LJ8M0M9K2j3j3POj7k0NL3M1M3M2K3j8n1
1406D03n3k6J2L1Om6p4m2J9N1M0J9Ooj8qJ9K6qm4l9KM4N2K7j1l1j9MJ2RJ2J0k3n9m5K0N7K9
1402C58j3j4Nqk7JN2N2mm5l1j1k8m8k6J9M1L4K9L6M0L2J9kl1m8l4kJ5J0%nj4j8j1KJj3j6o
$$ y = [242, 269, 301, 313, 284, 225, 181, 183, 219, 252, 263, 260, 261, 271, 282, 281, 264, 242, 227, 223, 232, 263, 313, 362, 385, 375, 346, 314, 292, 292, 308, 314, 293, 264, 258, 263, 245, 210, 209, 261, 315, 318, 288, 283, 307, 314, 290, 276, 301, 327, 312, 273, 258, 279, 312, 347, 390, 425, 419, 370, 320, 296, 278, 248, 224, 231, 251, 251, 232, 227, 239, 245, 240, 250, 283, 303, 279, 231, 205, 207, 208, 192, 178, 188, 215, 239, 261, 297, 347, 380, 363, 301, 241, 223, 244, 271, 288, 300, 312, 316, 307, 286, 254, 205, 161, 159, 212, 282, 321, 320, 300, 282, 268, 260, 258, 251, 234, 222, 231, 250, 257, 251, 252, 265, 281, 291, 300, 299, 271, 217, 166, 147, 178, 258, 363, 441, 456, 435, 428, 437, 416, 358, 316, 323, 340, 322, 294, 302, 337, 350, 338, 341, 362, 362, 327, 302, 311, 322, 310, 308, 350, 405, 409, 361, 326, 337, 360, 359, 350, 360, 379, 378, 361, 355, 361, 359, 346, 347, 366, 378, 372, 369, 383, 389, 370, 351, 366, 396, 397, 364, 336, 341, 354, 335, 281, 220, 190, 208, 254, 285, 275, 246, 239, 256, 273, 289, 322, 352, 336, 280, 254, 285, 309, 262, 181, 156, 199, 243, 241, 216, 203, 206, 224, 264, 313, 335, 322, 309, 316, 322, 305, 285, 290, 323, 364, 407, 449, 472, 454, 403, 350, 324, 336, 367, 373, 327, 253, 211, 230, 281, 321, 340, 346, 340, 322, 314, 333, 359, 351, 307, 268, 270, 314, 366, 393, 382, 351, 332, 336, 348, 357, 369, 379, 356, 297, 252, 272, 329, 358, 345, 331, 336, 328, 301, 302, 354, 406, 402, 357, 326, 315, 287, 239, 213, 232, 273, 307, 336, 372, 412, 444, 463, 461, 430, 382, 348, 346, 361, 371, 371, 366, 352, 334, 323, 325, 326, 313, 297, 291]
1397B91nk1k6lK2K0%j2lJ0K2K6J2j8l0oL0K6j6m5k7RK2Mj5j7j3j3k2l1k8oK4M0M1M0N2N8K8
1392D20k9o8n8j0K6J8k2m5j9K6L2pk9KM8L8j9n1k2J6J1j8k1PJ6oj7QL2J0m3n5nM9M8Qj5qm
1387B44k3k9kL3L8J9%j1k1k1%J2ql7k6J6L0ml3rL8N0K2kj0j6k4j6LNj1j7KK7L8L5K0j1m2m6
1382B13j8PJ2RJ2Pj5k6pK1K1OQK6K2ok6j8LJ6J9J2j0k9k1J4L2J7prLK2M4N2J4n8q8l5L0K1
1377B90l5n2j5Oj3k1J2L8J2k6k9oLLJ4K2J1JJ6L2K0jPK4Ol0l2PL4J9j3l1l4k4%J4pl3rM6N1
1372B77j9q8q4l8rPL8N7K9j9j9K5M6K0nMJ8PqOK9K5%j5j0qj8l0k5j4j1j6j0QJ1j0j6K7R3R8
1368C53K0o5p6j4L9L9Ok5l5k2QL2K8jk6k5oP%j4j6LJ3j1m7l4L0P4N4J4MPj3k8jM0L3kkJ9j0
1363C50p5q1kO0L3j8j0L1K9j4m0l4k4j0J9L5J0k6k2J0J8KKK5L5K5J8J7Pj4k3l3n4o3k1L6M2
$$ y = [291, 286, 265, 239, 236, 258, 278, 278, 266, 263, 273, 295, 321, 333, 315, 285, 279, 309, 335, 319, 274, 247, 256, 278, 282, 267, 250, 237, 224, 202, 171, 143, 137, 161, 201, 242, 282, 334, 392, 420, 391, 323, 265, 255, 281, 299, 277, 232, 213, 239, 271, 264, 235, 237, 285, 323, 304, 253, 231, 247, 258, 240, 219, 226, 242, 236, 219, 227, 259, 269, 226, 171, 166, 215, 263, 271, 256, 248, 244, 221, 192, 190, 223, 261, 280, 280, 269, 248, 227, 227, 239, 231, 194, 168, 184, 214, 210, 177, 168, 206, 256, 278, 276, 266, 250, 226, 210, 213, 218, 207, 190, 192, 219, 257, 292, 312, 301, 259, 213, 195, 202, 214, 223, 235, 242, 227, 201, 194, 215, 236, 242, 250, 276, 298, 292, 266, 248, 251, 267, 286, 298, 288, 259, 238, 252, 284, 301, 294, 285, 288, 310, 354, 406, 420, 362, 274, 239, 269, 290, 255, 203, 188, 194, 181, 160, 172, 210, 222, 196, 167, 161, 164, 167, 181, 203, 214, 215, 231, 263, 283, 282, 289, 313, 319, 289, 257, 264, 298, 317, 304, 273, 239, 215, 215, 229, 222, 189, 180, 226, 277, 258, 170, 86, 48, 39, 46, 84, 141, 170, 151, 132, 157, 203, 223, 218, 222, 240, 247, 239, 245, 274, 299, 299, 284, 274, 266, 248, 218, 193, 179, 168, 152, 142, 150, 161, 151, 135, 162, 255, 353, 373, 308, 232, 218, 257, 296, 302, 277, 242, 220, 228, 260, 288, 287, 261, 236, 230, 237, 237, 223, 207, 210, 223, 212, 165, 131, 161, 235, 289, 303, 307, 314, 301, 273, 272, 312, 345, 343, 341, 360, 350, 275, 194, 192, 252, 285, 267, 257, 288, 317, 303, 263, 229, 205, 195, 214, 249, 259, 233, 211, 221, 239, 241, 243, 268, 303, 328, 346, 363, 370, 356, 333, 300, 246, 183, 162, 198, 240]
1358B40Nj0J0J1j8k9%J4rj8K7O7L8l2o5l9ML0L8L4J9J2J5J1j3k1JJ1k9q7r3m7pKKJ5L0L8M4
1353B01M1J9j0j7ppk0j8QK4J5MJ1J7%k3j7J2L2J8j2k2KL0J6l6p1m4J2L3Nl1l3j0J4L0L8K8
1349B32Mrj%k1l5j5K6M4K2j0k4j0J6L8M6L1kk9k7KK0nn2o1qN7P2L3j2k7k5k2j8j1j0j1%J9
1344B17K7J8J2J2NkJ0L0J6l0m9j2L6L5kk8k6rJ6M7M6%m9m9j8j1j9lL1K5k1m0OO2P1M0Rk1n4
1339C28o9n0j2J5K9K9Jl7l5J8N3J1n0m0L1N6np0n5RM0K1oj5j4j0OK2J4j3j3K8N9L1l0m8j0
1335B19K9K2kjJ0pl7l2QL2J5pJJ5%l9n8l8mJ9J9J0RK3L0Qk8l1OL1Qk7j8K2L5Kk9k3%Jj4j8
1329A61KK8L9K6jj7oJ6K5J3ok6m2l9pL2M6K6jk2k7j4RJ9mk6jN0N7Pl6k7rl2n9k9L9P1L7j1
1325B61k7j1J5L8M6K4j6l1nK8K7Jj7j5j4k2l6l4oK6L3Ok2j6J2K0%j8j1NLpq%nk2k3%K4K7J2
$$ y = [240, 245, 235, 245, 256, 238, 209, 209, 223, 214, 196, 223, 290, 328, 296, 231, 192, 196, 226, 264, 298, 317, 329, 344, 355, 342, 321, 322, 333, 304, 217, 124, 77, 70, 72, 74, 89, 119, 157, 201, 242, 261, 251, 234, 227, 220, 200, 182, 190, 214, 229, 233, 244, 261, 261, 238, 221, 233, 265, 283, 271, 249, 251, 281, 297, 261, 190, 146, 158, 191, 196, 165, 132, 122, 136, 166, 204, 232, 236, 227, 226, 226, 205, 170, 155, 181, 225, 247, 237, 213, 203, 219, 257, 303, 334, 332, 303, 276, 278, 298, 293, 241, 180, 172, 229, 301, 334, 322, 295, 270, 248, 230, 219, 209, 198, 198, 217, 244, 262, 274, 286, 291, 289, 299, 329, 345, 315, 266, 254, 290, 325, 323, 295, 269, 260, 276, 323, 369, 369, 320, 271, 253, 242, 223, 220, 251, 276, 255, 215, 221, 283, 354, 394, 403, 382, 328, 259, 209, 197, 212, 241, 270, 271, 234, 199, 217, 270, 281, 231, 191, 222, 278, 273, 203, 148, 157, 197, 218, 212, 197, 183, 173, 179, 201, 215, 202, 189, 217, 276, 307, 277, 229, 219, 248, 270, 268, 267, 277, 270, 233, 201, 209, 241, 256, 249, 250, 265, 265, 226, 168, 130, 126, 145, 164, 174, 183, 206, 236, 244, 216, 185, 191, 222, 230, 203, 185, 207, 242, 244, 215, 192, 192, 193, 179, 161, 163, 191, 230, 256, 255, 238, 232, 248, 273, 286, 280, 254, 212, 173, 166, 198, 244, 270, 269, 247, 220, 206, 215, 234, 230, 204, 203, 253, 310, 317, 281, 254, 245, 213, 154, 125, 164, 235, 272, 261, 234, 223, 238, 276, 322, 346, 330, 299, 294, 322, 349, 350, 333, 318, 304, 282, 246, 212, 206, 232, 265, 271, 249, 233, 245, 265, 265, 247, 236, 241, 244, 237, 229, 229, 224, 202, 179, 179, 203, 230, 242]
1320B42LJ4K5J1j6k3ML1K3j4m2m2k6jK9M6K0l6n6j9K3J1l1k9K5O1L9j1l2k1j1nMOj3l4k1J7
1315A51L8J8nmMj2l2j5L0N0K4lJ1M1L5Jj8lOpk1rMj1m0l7PM9M9Ol7m3j3J1%k3j7K2M3K5mj4
1310B57j6l8o2m5OM4M0J6lj6j8KL2L9J3j1%J8Ml0m1j6QQpj1jJ4K8L5L4K4Lk4l9k2J7L7J4k5
1305B68l3pJ8J5jj6k1j4OK3J7npJ3K1Jk4j4J4K4Oj0JK6L7K1j2l2k8j0mj8l1l0j5jJ1K2J7j0
1300B18m1l9lL2L3OnJ8N0M5Jl8k6J9L7Mm0m8j7J1J7ROJ1J1ok8l4rK3J9j9m7l6oOJ2L0M8L2
1295B56mj2J2K5Mk6l7k3KL3M8K1l3o1l5MJ2KJ3M0M7J6k2l4k6j6j9l0k7JL5M4L3L1M3L6om9
1290B98n7l5j2LJ2Lk0k8NM6M9K0KQQrk1j2RJ8Ok2m6l6OL4Mm7n1LN8O8M0Lk7l5j6Kmj8kL9N3
1285B99K4j4l2l4k2QL7K3j6j6L0M8%m6l2QJl4l4OK5J0JJ5K4Rk1m4m9k4J8M0J3k3k8j1lKL1
$$ y = [242, 245, 259, 284, 295, 279, 256, 260, 291, 314, 300, 258, 216, 190, 189, 218, 264, 284, 248, 192, 173, 196, 207, 176, 147, 172, 233, 272, 261, 229, 208, 197, 192, 196, 202, 189, 155, 134, 151, 189, 207, 202, 198, 202, 190, 158, 143, 173, 223, 247, 244, 255, 296, 331, 332, 314, 311, 317, 310, 289, 280, 284, 273, 233, 196, 203, 252, 301, 307, 270, 227, 214, 225, 225, 202, 185, 207, 250, 275, 271, 257, 241, 203, 141, 96, 102, 146, 186, 202, 199, 183, 165, 167, 199, 238, 251, 240, 240, 258, 262, 232, 191, 175, 183, 191, 184, 173, 172, 186, 214, 249, 283, 307, 310, 286, 247, 225, 242, 279, 293, 268, 235, 228, 246, 261, 260, 244, 223, 209, 215, 238, 255, 250, 243, 256, 277, 278, 254, 240, 254, 278, 284, 274, 275, 301, 338, 359, 347, 315, 287, 277, 273, 255, 224, 194, 179, 178, 189, 211, 228, 218, 177, 138, 135, 167, 200, 206, 201, 219, 269, 314, 315, 277, 251, 270, 307, 311, 271, 223, 206, 217, 234, 243, 249, 260, 271, 265, 237, 203, 194, 217, 236, 217, 170, 134, 128, 134, 146, 176, 224, 256, 252, 240, 252, 277, 281, 255, 218, 195, 197, 230, 278, 299, 266, 205, 170, 174, 186, 188, 201, 241, 288, 304, 282, 248, 222, 206, 187, 157, 130, 131, 166, 210, 243, 274, 317, 353, 347, 298, 241, 206, 194, 197, 209, 212, 192, 164, 169, 215, 264, 284, 286, 294, 302, 293, 272, 260, 269, 287, 293, 271, 225, 189, 195, 229, 233, 186, 135, 138, 196, 264, 304, 307, 280, 245, 229, 231, 227, 209, 207, 246, 299, 323, 309, 277, 243, 221, 229, 266, 289, 273, 257, 287, 335, 335, 289, 257, 265, 266, 232, 198, 204, 229, 239, 240, 255, 279, 288, 267, 223, 174, 150, 168, 208, 221, 198, 170, 159, 156, 158, 189]
1280A89N5K8k8m4j1J6J2J3L8M5J8mnj8n0n4qL3J4l1l5lK3K0Qj3m2m8j3L8N7M3K6J9Oj3k1j9
1276B41rMJ8J1k0m1k5KQNJ8L3K7J1J0J4ql3k2J2J8j3k7nJ1%rMQj7m4l4qlrQM3N8L0j2m1m7
1271A67l3nJ9K9K2J1jj1j2%J4J8J2NkrmK3N1M6mo1q2o0k2PL0N0N2K2k1l3qJ6jl6l6PM9M3m
1266B48m8n8l2NK6L1L3L6K6NLK8M2Ln6p2l0Njj8mK3K9J7J3K0J6%k3l7l0JK9J7k8n1k4Njj9
1261A29pJ7J2qoK6M7M0K4km0o8m3J1L0ml7k5LJ1QJ7K8K1Ooj6k3oL1M7K1j1%K3J2k5k8J3L3
1256B55%m6n1j8NJlJ3L4L3J1qoNRRK1M4M6J5k0k7k0k8m1k6J2K4pl4j2L1L6%l2k8mQlj8k2n
1251A53K1L3J8KJ3M0M1Qj4%K0Kl5m5k1qk0k7PM7M9J2k3l1k1pPJ2NokJ5K2J2mj1j3j4pJ0K0
1246B60Mk1k7j8k0l8m0kO0R5O5lm7l1J3K9on1n7k2K0L7K8Jj9j7J0L2K9J1MMkj7j7LK3K8J4
$$ y = [189, 244, 272, 244, 200, 189, 205, 217, 230, 268, 313, 331, 327, 322, 304, 254, 200, 192, 225, 239, 208, 173, 170, 193, 213, 221, 208, 166, 118, 105, 143, 200, 243, 269, 288, 294, 281, 260, 241, 232, 236, 254, 265, 245, 204, 179, 181, 189, 194, 212, 245, 272, 283, 293, 307, 299, 266, 244, 256, 274, 261, 234, 229, 240, 240, 231, 235, 243, 226, 182, 148, 140, 137, 128, 136, 179, 237, 267, 255, 214, 167, 134, 129, 148, 177, 199, 210, 209, 198, 186, 186, 200, 218, 230, 235, 233, 224, 220, 243, 294, 340, 336, 275, 193, 133, 111, 118, 148, 198, 250, 272, 251, 218, 210, 226, 225, 189, 153, 160, 209, 252, 248, 200, 142, 110, 115, 141, 172, 205, 241, 267, 272, 275, 303, 345, 348, 292, 220, 190, 195, 194, 176, 172, 195, 224, 241, 254, 274, 290, 290, 267, 230, 200, 201, 230, 247, 219, 168, 144, 149, 148, 129, 122, 139, 151, 143, 137, 163, 210, 250, 274, 272, 232, 164, 121, 132, 162, 158, 121, 96, 99, 110, 118, 135, 163, 184, 190, 184, 168, 145, 139, 170, 217, 238, 227, 227, 250, 262, 237, 209, 222, 255, 255, 209, 158, 140, 145, 146, 143, 156, 190, 223, 234, 226, 220, 225, 234, 243, 264, 308, 354, 369, 349, 322, 302, 274, 233, 207, 219, 243, 236, 202, 190, 221, 257, 257, 225, 197, 193, 201, 198, 180, 158, 153, 174, 207, 225, 227, 240, 280, 321, 329, 315, 315, 335, 337, 302, 257, 236, 228, 208, 181, 188, 235, 284, 296, 273, 242, 221, 214, 221, 233, 238, 232, 230, 245, 267, 279, 275, 264, 251, 237, 230, 240, 260, 264, 243, 216, 198, 178, 140, 100, 98, 158, 253, 318, 315, 268, 237, 250, 279, 273, 222, 165, 143, 163, 200, 228, 229, 210, 193, 203, 235, 264, 275, 279, 283, 281, 264, 247, 250, 273, 301, 315]
1241C15pk8m3l7j2J5L1L6K8Jk6k8qKj4k7rK3K9Mk2k2kJ9K5J6ol0m2k8J2M9N3J4k8l2nJk7m2
1236A48j0L2L4Kj5qj1k5j8J9L5Ol2l7k4k8m4k9K0P0P5M3J2QJ6J4nj6lJ2OoKJ3kk8j6K4K8j8
1231B44m2OO0L3l8m8NL0j1l9MO0N4Mj1J6K7jk5nL5N3L4nm1n9n0l2k1k2k2j7j5j9k0rRJ3P%
1226A42J0L3M6L0j0m2m3j4K4M1K5ok0mK5L5L0K7K2mm8o7l4J1J9j0k8j0J9K6Mk0j7J0L6L4N
1222B77j8rJ5K7J6pl0l9j6K8M7Ln9o1J0P5N7k6q6p1nM4L9Jk4pL2N1M0Qk6n4n7k2K7M0J1j8
1217B13j5LKrpkj8m0l0J0L5K4OJ6L6L5J6lj6l0l9k2RK3RmNJ6Mk8m1k4kNPK3L7L2J7QOj1l7
1212B19m6k6JJ2K0L0L8K5kk0k2j5j0ppj2j3mJ4K4J5pj5KK8L2Jl1j9K7N0J9l3m6k2rk8l6kN4
1207A79P3L7pk0n%j6k1%K5K9J8J2Qqk3j4J7L0Rk2l7m7m8j5M7O8Pp0o3K6Q3N0j4k2J9M0K1p
$$ y = [315, 308, 280, 237, 200, 188, 203, 234, 270, 298, 299, 273, 245, 237, 239, 225, 198, 189, 212, 241, 245, 223, 201, 199, 218, 243, 259, 253, 223, 181, 153, 165, 214, 267, 281, 253, 221, 216, 217, 190, 148, 138, 170, 204, 206, 191, 183, 172, 147, 129, 148, 183, 189, 157, 120, 96, 68, 24, -5, 15, 85, 160, 203, 215, 223, 239, 253, 248, 232, 229, 241, 247, 241, 243, 256, 254, 226, 210, 234, 262, 244, 202, 208, 268, 301, 263, 215, 220, 250, 239, 200, 204, 264, 318, 322, 311, 327, 354, 353, 328, 323, 358, 411, 445, 440, 399, 340, 290, 258, 237, 215, 193, 176, 161, 142, 122, 113, 122, 135, 142, 142, 152, 185, 231, 261, 251, 209, 166, 152, 176, 217, 242, 236, 216, 212, 237, 272, 302, 329, 351, 347, 299, 232, 198, 209, 228, 218, 190, 180, 199, 225, 229, 209, 192, 202, 238, 272, 277, 259, 250, 265, 292, 308, 301, 271, 232, 216, 244, 291, 294, 235, 174, 184, 259, 316, 290, 204, 133, 128, 172, 211, 212, 188, 181, 213, 264, 304, 312, 286, 232, 175, 153, 180, 220, 231, 213, 198, 201, 203, 194, 187, 185, 167, 127, 97, 107, 142, 166, 172, 188, 224, 259, 275, 272, 256, 226, 187, 165, 174, 197, 206, 202, 207, 223, 227, 199, 158, 134, 132, 137, 144, 167, 204, 236, 253, 261, 267, 256, 219, 173, 147, 148, 160, 180, 210, 248, 273, 271, 251, 229, 214, 204, 197, 190, 178, 165, 161, 175, 199, 214, 207, 192, 194, 222, 254, 255, 224, 205, 232, 282, 301, 268, 222, 200, 191, 163, 127, 125, 179, 252, 289, 282, 262, 257, 257, 241, 220, 220, 245, 274, 292, 304, 312, 304, 281, 267, 284, 314, 323, 301, 264, 217, 169, 154, 201, 269, 276, 206, 143, 169, 252, 302, 288, 266, 285, 325, 346, 339]
1202C39j5j4k1l1k9k1rNK1L0J9j4m7m5KN7N9Ql5k7OJ0rnK3K3k1o1m8%L1L3K6K1J2RJ3Rj3l7
1197B54k3K0L6Ol4l8j2J1J8J6J2Jj0j1j1j8k6j6MMk2n1n6k9J3N3O9N6L4K9L0J1k4l7j9KMO
1193B52K6M3K7ql3l8l4k2JJ4Mj4j3MK1K3J9Mj5j7QK5Nk4k1PJ1j4k2JJ8J0J4M0N0Rm6o4m4k2
1188A85j1KJ8K4K3J7P%NJ8J5LJ7N0M2k8q3n1K2K9l5p6m3K0N6P0P2M0k4o5m8j1JlJ3L0Om3o0
1183B04k6J2J7NKLmj2RM1L9pn1l5K2N7M6K2J5Lm1p8o0mK6J3LJ8L2K2O%mj6k2j8k0l2k8kJ9
1178A76J1%NJ2kqK2N0K8k5m8k7oj5j9OL4L4Qk1l9l1J7P4Q4L1k9l8r%k1m0k7LK3K2QjPK6L0
1173C05Kl3l8qJ9J6oj8mJ8K9J3j4k9j6QJ1pk4j7OK5L3K8Ll4n9l8J1L9K1j8l1rK9N0M0Om1o7
1168B01m9PO4Q3N7J2k6l7k1KNj2k6j6%ok5k7oJ1Kj0OK9J9j7l5j5J0J0lkkk5m3pO5R6M5l1n2
$$ y = [339, 324, 310, 289, 258, 229, 208, 199, 204, 225, 255, 274, 260, 213, 168, 170, 227, 286, 294, 259, 232, 238, 248, 239, 234, 257, 280, 259, 198, 150, 150, 181, 214, 240, 261, 273, 282, 295, 304, 291, 254, 231, 251, 287, 293, 259, 221, 209, 220, 238, 254, 266, 267, 257, 246, 235, 217, 191, 175, 179, 183, 161, 110, 54, 25, 38, 91, 160, 216, 250, 279, 309, 320, 296, 259, 240, 242, 246, 252, 278, 321, 348, 340, 307, 269, 235, 213, 214, 228, 232, 218, 205, 209, 230, 253, 272, 276, 261, 244, 252, 277, 282, 258, 237, 244, 255, 241, 219, 220, 238, 248, 262, 302, 352, 361, 315, 251, 207, 185, 174, 176, 194, 218, 241, 258, 265, 265, 270, 288, 303, 306, 323, 373, 415, 387, 304, 253, 275, 304, 269, 193, 150, 170, 226, 296, 368, 408, 384, 319, 271, 260, 261, 258, 271, 301, 307, 264, 204, 178, 190, 207, 212, 214, 217, 213, 201, 210, 251, 290, 283, 232, 197, 219, 276, 322, 344, 359, 362, 321, 243, 183, 179, 205, 218, 221, 239, 271, 293, 299, 299, 295, 279, 257, 239, 219, 187, 159, 157, 176, 187, 187, 192, 204, 202, 194, 216, 266, 294, 269, 221, 194, 188, 173, 154, 160, 194, 228, 236, 215, 176, 145, 162, 236, 320, 351, 322, 284, 275, 275, 254, 214, 187, 190, 213, 235, 243, 242, 249, 275, 305, 307, 274, 236, 228, 247, 263, 257, 239, 235, 253, 282, 295, 281, 252, 236, 244, 255, 248, 224, 207, 213, 238, 271, 299, 302, 268, 209, 171, 182, 221, 242, 224, 193, 184, 213, 263, 303, 309, 268, 201, 152, 159, 223, 306, 363, 375, 349, 312, 291, 293, 298, 286, 260, 244, 244, 238, 213, 186, 180, 191, 193, 183, 189, 218, 237, 220, 185, 170, 180, 190, 187, 185, 183, 158, 115, 108, 173, 269, 314, 283, 231]
1163B31qK8J3l3n3l4JK3K5J4MLJ4K7K4%k6k7oOok1j2PPmNL2L8Rj8k1k2l4k3J8M2Nl8j7M4M6
1158B63j7n1%N7L9k5m5mL2J7j8l2k2rlPK6M0L2Nj7j8mnk0l6m3m3k6J4N3N1J8%K1L4J5j5l1
1153B40l6m3k7J3L0Mj9J2O2O9L3jj3j5MM0M1l1j20j15j8O7O8K5j1l3m6l6kJ1qk8k0j7l0k5
1149B5J9O0N0J1lPRkjJ6K2Qpj0NK5L1Ml2m0j5%j7k4ML6K6j0j9KK1K7L0K7Kk9l9k5j3lRK0Q
1143B15j4k1nK1M7O3M4ml5j5J1j2n7n4JL8K0pkJ3Lj6j2J3L2L3K4kl6n4l4RL8L8J4j7l4k8j3
1139B05j0j7nK7M8L6Pj3k3l6m9m5j4K8N5N8M2L0L2K9Nk9m1k8j5j3j3ompj5k3l5l9k5JJ1QJ2
1134A29K4J6j2k8jM2N5J7l3m2RO7N5k0o4k4L5J6n1n0L2Q5L5l7l3J9L7J0rjMl%J2J4Loj4k6
1129B62k6pJj8l3j4Rpl3j3M0N8L5J7K1Ol2l9PM9L7jj9j5j5k1k2k3l3l8k1OK3K2Mk3l1jN2Q1
$$ y = [231, 223, 251, 264, 231, 178, 144, 145, 168, 193, 207, 211, 214, 228, 255, 279, 279, 253, 226, 220, 226, 220, 199, 187, 194, 201, 197, 202, 234, 272, 281, 263, 242, 220, 186, 163, 181, 223, 228, 190, 173, 217, 263, 246, 195, 195, 252, 291, 266, 221, 217, 249, 266, 248, 216, 194, 185, 182, 189, 215, 255, 287, 292, 275, 257, 253, 248, 228, 192, 149, 106, 80, 94, 147, 198, 216, 216, 237, 271, 286, 271, 240, 204, 161, 134, 147, 177, 181, 162, 174, 236, 305, 338, 337, 324, 309, 313, 353, 394, 363, 243, 128, 110, 177, 245, 270, 259, 226, 180, 144, 142, 153, 145, 117, 97, 80, 50, 25, 44, 104, 154, 165, 162, 169, 178, 176, 175, 191, 213, 221, 214, 204, 209, 234, 265, 269, 237, 197, 182, 182, 165, 141, 145, 181, 207, 197, 178, 180, 201, 228, 258, 285, 287, 258, 219, 194, 181, 178, 187, 207, 215, 201, 180, 175, 196, 243, 306, 350, 346, 311, 296, 307, 295, 238, 184, 185, 223, 243, 236, 234, 247, 250, 234, 222, 235, 267, 300, 324, 322, 286, 232, 198, 207, 245, 283, 297, 280, 246, 218, 205, 195, 178, 173, 200, 248, 284, 291, 278, 255, 219, 170, 125, 111, 139, 194, 252, 294, 324, 356, 385, 390, 361, 320, 292, 277, 264, 251, 245, 241, 234, 219, 196, 161, 122, 97, 98, 109, 117, 129, 153, 169, 157, 129, 128, 170, 225, 242, 209, 167, 176, 243, 298, 278, 214, 190, 225, 241, 190, 140, 172, 257, 292, 255, 222, 241, 278, 288, 279, 278, 282, 279, 279, 291, 305, 308, 302, 288, 262, 236, 229, 230, 212, 179, 165, 174, 167, 134, 121, 161, 219, 254, 271, 292, 298, 266, 227, 234, 283, 320, 319, 300, 285, 270, 249, 227, 204, 171, 133, 112, 118, 141, 163, 167, 144, 113, 112, 164, 245]
1124B45N7Rk5l7m1m1l5k0PM1O0M4J0lJ2K0NnPJ8Lk8n2o4o3l6J1M0K9LJJ4J2j0k9l0j6JJ2J2
1119A38KMJ1Kk3k3K0N9M7QKL2L8mm8m7j2Pnk6l4j9J1L9M0J0j8j2J6K6Jl8n2k8QL0K6Nk2l4
1114A37k1J4M5N0L4K3J7Mj0j3rk0l8l5pQkrKPj9l8oM8N3lm8l3K1N0L5J5J8L1K4j3m8m6j9j2
1110A87l1l7mL0K5MJ6M6M0j3m9l4oj2l0j8J7K5jj8QN4O0J3m4n6k0J6J6lnJ4K8K4Qj3m0o0m0
1105I7J3N3M4RJK8M8K2k9n2k4J2J2k0l5j6J3J8J6K6M2L6J6kj5k8l2rJ5Ok1k2NJ0j2k1jPk1
1100A89m7l1PK9M0N1M3Ok3j2J3Qj4j2Kmj5NL5J6m6o8j8L6L1pj9pjNK8M3J8j9j4K5K5k9o9l9
1095A61J9M0J6ppj2k6k2J1L9L4Rj1k4m1m9k7J8M8M3J9mk3l8l0LM0N0L6K5K8K4pm0l7OL7J6
1091C17m0o8m3jJ0rk4j5J3M3N2K3l0n6j9L8M7Mk5JL3J6k6l4LK4pn2n7k2RJ4J0K1L2J6k1l4
$$ y = [245, 302, 311, 286, 249, 208, 167, 132, 112, 119, 160, 220, 264, 274, 271, 283, 303, 308, 303, 310, 328, 331, 303, 251, 187, 124, 88, 99, 139, 168, 171, 172, 186, 198, 188, 159, 129, 113, 114, 126, 138, 140, 144, 155, 157, 134, 111, 131, 190, 237, 245, 247, 279, 317, 313, 265, 218, 206, 213, 208, 182, 148, 129, 140, 179, 219, 229, 211, 199, 215, 241, 242, 204, 152, 124, 132, 162, 188, 193, 171, 137, 116, 130, 175, 225, 259, 282, 299, 303, 293, 280, 271, 251, 213, 178, 171, 179, 177, 168, 170, 177, 158, 120, 114, 162, 215, 212, 164, 131, 152, 202, 237, 252, 270, 301, 325, 312, 264, 218, 199, 187, 156, 119, 115, 145, 170, 174, 190, 236, 276, 263, 214, 180, 174, 162, 132, 114, 131, 156, 155, 137, 145, 199, 259, 272, 228, 172, 152, 168, 184, 181, 176, 190, 218, 242, 250, 237, 197, 137, 97, 110, 163, 207, 216, 217, 245, 293, 315, 286, 234, 210, 222, 234, 214, 179, 163, 176, 194, 210, 236, 278, 314, 330, 328, 313, 285, 253, 244, 259, 265, 244, 222, 227, 237, 225, 204, 203, 210, 189, 142, 111, 118, 147, 187, 238, 281, 287, 264, 252, 265, 273, 259, 247, 249, 245, 230, 235, 270, 286, 240, 172, 154, 190, 221, 214, 195, 188, 187, 192, 220, 263, 281, 262, 248, 273, 298, 269, 200, 161, 180, 220, 236, 229, 222, 210, 184, 162, 173, 212, 246, 255, 244, 220, 179, 130, 103, 121, 169, 212, 231, 227, 204, 166, 136, 139, 179, 229, 265, 290, 318, 342, 335, 295, 258, 264, 301, 317, 277, 209, 166, 165, 175, 166, 142, 127, 140, 183, 235, 258, 228, 172, 153, 191, 238, 242, 217, 218, 251, 267, 241, 207, 210, 234, 227, 175, 118, 96, 105, 119, 129, 150, 182, 198, 177, 143]
1086A43jM0L8LrJ0K4J6J3K8J7l3o4k2N4Q1L3k9n0l4j0J1K8L8L2Ol8o5m7RM4K8pj9j7k7k9k
1081A93J9on3n6j0K4K8L7O0M9lm2k8JLroJjJJ9L0Qk8m8m5j8K7O3M2k7o4k6L0L7OlJ7K3Qmq
1076B41k2l4j3K4M1L3K5J8ol4l5j2mqPL6L1j3l6j3J1kk4j4RJ3MMJ0Kj0mJk2n6n4j5K3L6L7
1071A75L4J1l2n2j9L6N6K6nlJ8J4j2k7j2J0J1%olLJ6L4M2K5%o%oj9j3J0J4j0k7nL1M1J8j6
1066C52m1n0m0j1J7K2J0loMK2L1Nm6p8n4LL6K7Jj4j6j3okmlJ3L4L1jl0k2MJ6NLJ5K0ll0k6
1061A72PL4K8J5K0L4K6mk3j4QRj6l8l5j9j8m0n1k1K8N1L5J7K1J8pk4nK0J0k2k3J1K7Mk1oK2
1056B30K6Nj1kJ5K2Pk5m1j5K7L9Rk7m0l7l3j9OJ9K1L0M3J7m0n8kN8L7l1m7J0O6O2J9j6l3l0
1052B61j1Nj4n3o6l7J1M6N3K9j5m1k0J4J2k2l0nJ4J1K1M4L6rl3mK4J0j5kK3J1l0m1j5NJo%
$$ y = [143, 142, 182, 220, 223, 214, 224, 248, 264, 277, 305, 322, 289, 225, 203, 257, 338, 371, 342, 292, 258, 248, 259, 287, 325, 357, 363, 325, 260, 213, 222, 266, 294, 287, 268, 251, 224, 195, 193, 212, 206, 153, 97, 87, 111, 139, 176, 236, 285, 282, 240, 212, 213, 216, 207, 201, 202, 201, 202, 221, 251, 259, 231, 183, 138, 120, 147, 210, 252, 225, 161, 135, 165, 202, 208, 205, 222, 245, 253, 249, 241, 219, 185, 172, 196, 237, 270, 295, 313, 307, 273, 238, 226, 222, 214, 221, 257, 288, 275, 239, 226, 237, 235, 211, 197, 206, 219, 223, 227, 237, 239, 229, 225, 226, 204, 148, 94, 79, 102, 138, 175, 209, 220, 188, 136, 117, 153, 209, 235, 230, 227, 245, 259, 247, 220, 208, 218, 229, 229, 223, 220, 223, 239, 273, 315, 340, 340, 334, 334, 328, 309, 296, 306, 320, 310, 283, 278, 309, 350, 368, 352, 311, 261, 221, 210, 227, 249, 259, 256, 250, 254, 276, 307, 312, 266, 188, 134, 137, 173, 200, 201, 187, 171, 158, 152, 150, 146, 143, 156, 190, 221, 220, 190, 168, 172, 188, 193, 196, 211, 231, 228, 198, 172, 179, 213, 241, 256, 276, 310, 336, 332, 309, 295, 303, 312, 296, 258, 223, 204, 186, 146, 95, 74, 102, 153, 188, 205, 226, 244, 237, 213, 208, 228, 238, 216, 193, 204, 231, 235, 214, 208, 230, 256, 261, 250, 248, 263, 285, 292, 267, 226, 211, 238, 277, 286, 259, 219, 182, 149, 130, 136, 155, 176, 206, 249, 266, 226, 168, 166, 224, 261, 230, 183, 193, 259, 321, 340, 324, 291, 261, 250, 255, 241, 188, 122, 85, 96, 142, 195, 224, 209, 168, 148, 162, 174, 152, 122, 117, 131, 142, 163, 207, 243, 234, 201, 197, 221, 231, 216, 214, 237, 248, 218, 177, 162, 167, 168, 162, 162]
1047A62J1L0N5O6L4k0m0j1J6Kl1m6l6j5MK3L1K2jj7k0j3nllQK6L7L0J5jj1j8j7oKkj1j3mJ1
1042B41J5ml1k8J5N4L2l7q4o2pL4O1P3M7j5n7l1K0J9k6m6rL7M6K9J0pk0j7KJ4J0PPjj6j4K
1037B63Mj2j7opk9k8J7O4O0J8rnNKmkMQMj5l4l0NL3L3K2J7Kl5n8k3L6M8jn2n6l3j3LJ9J2k7
1032A83m3JO0N9Qj2L0O9M4j5l8j3J1J6J4Ml1o1l6L0N2Kn3m2NK3J6L0N1K0m8p4k5K6K6mr%l
1027B73j4j7j8j4J1M3L9pl7k1ql3l8K1P5L9m6o6j0K4jj5K2M9J5l2l1mMkQJ3j6n0l7J5N6O0
1023B50L8Pk2l4k6k3l7m1j2K1K5J2J6K8K3J0J3K0mm0l8J2N6M8Ml9n6m2nK7K8J3Knk8m3j4L6
1018A80L8j2m4j9Rnk7JM9M8Pj6%Oj4k3QL7K9Jj8k5l2l1j6mrj0J1L5K9OOK6K3j7m5k5J4L3L4
1013B38L9L4nn1m2K1O3L7pnK5K5j2m1l6l0l6k9KK4RrJK1J5nkJ9J2l1n4k7J4J7oqJ5K7Qk0k7
$$ y = [162, 173, 203, 258, 324, 358, 338, 298, 287, 303, 305, 274, 228, 192, 177, 181, 204, 235, 257, 256, 239, 219, 206, 201, 198, 195, 203, 229, 266, 296, 311, 310, 299, 281, 264, 258, 260, 258, 247, 234, 230, 241, 256, 252, 221, 193, 208, 262, 294, 257, 173, 111, 104, 138, 199, 272, 319, 304, 247, 216, 236, 255, 229, 183, 174, 211, 257, 286, 296, 289, 269, 252, 254, 268, 278, 285, 292, 291, 275, 261, 263, 267, 255, 238, 232, 225, 196, 168, 185, 249, 309, 327, 318, 313, 318, 320, 316, 314, 318, 326, 330, 315, 281, 251, 256, 289, 322, 344, 361, 363, 328, 270, 247, 283, 331, 330, 278, 222, 189, 176, 179, 198, 210, 183, 140, 141, 201, 260, 268, 256, 286, 355, 399, 384, 346, 333, 344, 360, 374, 378, 347, 286, 250, 280, 332, 334, 281, 239, 244, 267, 283, 313, 364, 384, 336, 262, 237, 263, 289, 285, 276, 276, 273, 259, 242, 224, 210, 221, 264, 303, 296, 259, 238, 230, 197, 159, 180, 255, 294, 248, 182, 172, 196, 195, 180, 202, 251, 266, 234, 203, 199, 203, 201, 209, 222, 206, 156, 119, 134, 190, 250, 288, 295, 273, 239, 213, 190, 153, 112, 100, 121, 146, 158, 174, 202, 225, 235, 248, 268, 264, 224, 186, 198, 254, 302, 306, 267, 211, 169, 164, 191, 219, 232, 234, 229, 201, 158, 144, 180, 218, 206, 162, 143, 152, 147, 120, 121, 170, 218, 225, 209, 209, 215, 201, 178, 186, 223, 252, 253, 235, 210, 178, 147, 131, 127, 118, 108, 119, 154, 183, 189, 195, 221, 244, 227, 182, 157, 171, 204, 238, 277, 311, 306, 255, 213, 234, 297, 334, 327, 322, 347, 372, 360, 319, 283, 253, 217, 188, 190, 214, 223, 214, 215, 236, 251, 246, 244, 263, 275, 244, 190, 163, 177, 194, 188, 180, 195, 222, 230, 210, 183]
1008A83j8j3j4j5qkJOJ6K2K2J2Krj0KK9M7L8Kk6k0Jjl1m4j3K8K5k7o7m7J8O3N8K3llNKj1q
1003B15J6L6K4oj3K0M8L2j8n3m7k1LJ8J2j5l9l0QL1J5jRK9J8j6l0j3J4L0L4K2nk3j6oj7l7
998B28k2J7K8ql6j0L4M2J0j8k3k0j4LK6L2K8K6J9lk5j5J7L1Mk8l1j0J2J9J5Jj4j3OK0J2rl1
993C00l9l4j3J1K7K7K0J2Jj0qOJ8J8J6J7Qk1m4l6nJ0%j8k5j7KK6L8K0j5k9rJ2jl5l7J2O2O4
988C31J9k7m3m1l0mL2M2J1j9jM2M9J0k6k7j7j8j1J8L0%m7o3m3rK6N0M1%k6pJ8jl5j7M1O1J0
984C19m6n0k0%J4L3M5L2J8K1K3kk6k0NKk5l7j7OJ0J1J8J8Oqj5j9j8%L0M6L0ol1l1j2LJqnJ3
979C08K0%k4j6J5K5QkJ2K4Ok1k1lJj1jL4N4K8j9m3l5j5JJ3K0J8%k0k7k1roj6k4j0J3J5rj9
974B43LK3Kk9j1M4N5kn0k7K8L8NkK3K5j0l0oK2J3j6l2l4k9j1J7K2pk1J7N9M2k1o0m0kK3K6
$$ y = [183, 165, 152, 138, 123, 115, 113, 114, 120, 136, 158, 180, 192, 194, 185, 175, 177, 206, 253, 291, 293, 267, 247, 248, 247, 216, 172, 159, 187, 212, 185, 118, 71, 89, 152, 210, 233, 230, 227, 232, 234, 223, 215, 231, 267, 291, 285, 272, 292, 340, 372, 354, 301, 254, 233, 236, 254, 266, 251, 212, 182, 190, 221, 236, 235, 244, 273, 291, 275, 245, 232, 246, 276, 310, 332, 327, 304, 288, 282, 265, 228, 206, 223, 251, 243, 207, 197, 231, 273, 283, 265, 242, 222, 208, 211, 237, 269, 297, 323, 342, 339, 314, 299, 316, 347, 351, 323, 292, 282, 294, 313, 328, 329, 315, 302, 308, 328, 340, 331, 300, 261, 227, 214, 225, 252, 279, 299, 311, 312, 302, 294, 300, 318, 336, 352, 369, 377, 356, 312, 276, 271, 281, 281, 263, 238, 221, 223, 249, 287, 307, 292, 263, 254, 266, 265, 230, 193, 205, 267, 331, 350, 323, 280, 239, 209, 205, 237, 279, 290, 271, 270, 312, 361, 371, 345, 318, 301, 283, 272, 290, 320, 320, 273, 210, 167, 158, 184, 234, 275, 275, 249, 242, 260, 259, 224, 207, 248, 309, 319, 273, 223, 203, 203, 217, 250, 295, 327, 345, 366, 389, 387, 361, 341, 346, 348, 323, 286, 269, 275, 285, 296, 314, 332, 338, 330, 315, 296, 278, 278, 308, 354, 384, 378, 347, 316, 304, 307, 308, 300, 295, 308, 328, 328, 304, 288, 303, 328, 336, 334, 346, 370, 376, 355, 334, 331, 332, 321, 320, 354, 408, 436, 417, 374, 339, 324, 325, 338, 358, 376, 376, 356, 329, 308, 299, 293, 277, 253, 243, 256, 271, 262, 243, 246, 269, 271, 242, 231, 275, 330, 328, 278, 251, 279, 317, 322, 320, 343, 368, 358, 328, 322, 344, 357, 341, 309, 275, 246, 235, 252, 274, 267, 246, 263, 322, 364, 343, 283, 243, 241, 264, 290]
969B90J6lrQJ8j1m6k4M0O0Om4k6K2K1l1o6m9oK5L3J8rl3l3j9nJ6N5Q6O9J2l9n1m2k9rK4N0
964B85M7K5J4J4J2qm0o7o9l3K5O0M2mk3kK3K8K4L2L0ll9l2OK3Kk3k0j3j9k7k2j6k1j4J7L7
959B51J9oMK9J2l0l3J8N1K5j5j9oj1k6j4J2K1J4PPJ0K4M2L4pl7k1ml1o9m4L4P2K9l0l6pPL
954B79RK5J8pj7JK1J7%lQQk1n5o1l7j1%J2K9K9Jj5J4O2P1L0j5m0m8l9j1J6Pk8l4%L2K8J4J9
949C08L0J9mk0l1n2o2l8RM0M8M3L1J6QJ4K4J4rk5l2k9j4J6M1L3Mj3nNJj2j6nRQj1k4%N0O6
944D35K0m2n2j6J5Oj7k2j3LJ2Nj9m1l1KJ9J4RK1K6Pj9l4l1j5J7N4N4J2l7l7PM2L2Kj3lJ2K0
940D04K4K4Qk3n1n3m0k8j3K0O0O5K2k8m5l3j6jJ8K7Qk3l2j1J1K7M3N7N7L7J6%j4k1j8j8l1
935D29m3l1kRjmQJ3NKJ1Prj2jol9n8l1J9N2O3N3K1l0o0m9k1jK1M8M3qn1l3J4J2l4m7nM1M0
$$ y = [290, 306, 303, 294, 302, 320, 309, 263, 239, 279, 339, 345, 301, 275, 297, 318, 287, 221, 172, 166, 191, 224, 242, 233, 200, 167, 148, 143, 159, 214, 300, 369, 381, 342, 291, 249, 220, 211, 235, 285, 332, 357, 371, 385, 397, 389, 349, 282, 213, 180, 205, 265, 307, 303, 280, 278, 301, 329, 353, 385, 415, 412, 373, 341, 347, 370, 372, 349, 329, 316, 297, 270, 248, 232, 211, 197, 214, 251, 270, 264, 268, 297, 309, 279, 246, 264, 315, 340, 325, 306, 300, 289, 263, 249, 261, 282, 296, 303, 310, 320, 344, 386, 420, 413, 376, 355, 351, 320, 251, 207, 241, 313, 342, 312, 276, 269, 276, 279, 288, 313, 331, 324, 307, 308, 329, 346, 346, 343, 351, 359, 338, 283, 222, 185, 174, 174, 186, 215, 244, 245, 230, 244, 306, 377, 407, 392, 352, 304, 265, 254, 270, 277, 249, 215, 215, 247, 275, 289, 308, 338, 357, 353, 333, 302, 250, 188, 150, 159, 199, 247, 290, 321, 337, 345, 359, 383, 397, 388, 363, 331, 302, 288, 304, 345, 378, 382, 369, 364, 369, 370, 358, 342, 337, 346, 354, 343, 319, 319, 369, 435, 455, 413, 361, 345, 360, 366, 349, 327, 314, 317, 329, 334, 315, 274, 243, 245, 264, 278, 287, 308, 334, 341, 322, 288, 257, 242, 259, 313, 367, 379, 342, 305, 312, 354, 386, 388, 375, 372, 384, 404, 428, 452, 460, 437, 386, 333, 293, 265, 252, 272, 332, 397, 419, 391, 346, 313, 297, 296, 314, 341, 349, 326, 294, 283, 294, 321, 364, 421, 478, 515, 531, 531, 517, 496, 478, 460, 429, 386, 355, 353, 362, 361, 357, 365, 378, 383, 385, 396, 403, 394, 382, 381, 375, 336, 278, 247, 266, 318, 381, 434, 455, 425, 365, 316, 295, 294, 315, 363, 406, 398, 347, 314, 328, 340, 306, 259, 254, 295, 335]
930C35J9J6L0L4K0%k4m2l9qK3K9Nk5m0k3K3N8N4K7J9L2K9ml2k9j5k2l4k6lJ1Lj0j1J0M1N3
925D84J4n3q0l8K6M3Rk3k6j2MK3M7N1K6rk8j6J6M4M1Mm1o0n8n2m6k0K8O3N0km0k7K6O9O5J7
921E19k8l0LL3L7K1Ojpj7l4m5m7l8l0k2lK7M1J0l8m7NO3O1Km3l0PJ4j5k8nK4K3NjRJ6Qjjp
915D16k4l7k6lJ1J6K0K2Pj9l3j8J2L0J8j3l4k1J3L0Ml4l7MM6M3Jl0k4mjk4l9j7K2M1K5jj8
911C24k5k7qL2M9J1n4p6l4J6K1LJ5O0Q8N2l1j01j03l8L5N3J5j9rJ8J8j0k7k0j4j5lK1L0Lk7
906B23k9mK8N7P0N0Ml4l6k1j8j3J9M4J5m6o0mN2N2J5mkjjJ6L3J7k4m5k9jJ0J0J2K1L3L1ln6
901C81p8m1J9M1J8j0j8k7l5k0J3K8J4QK6L8J7j0j4mNJ3J5j2n6o1j3K9J4qK4O6L8l9o1MO2M8
896D14%j8j7k1k4j5j0j4%L8M4mm6j8L5L4k6o5l9RL8M1L5K5J4Pnk6k8J2N9M6k1p0n0JJ8pk8
$$ y = [335, 354, 370, 400, 434, 454, 454, 430, 388, 349, 341, 364, 393, 398, 373, 333, 310, 333, 391, 445, 472, 491, 523, 552, 548, 516, 487, 472, 450, 416, 390, 387, 398, 401, 391, 380, 390, 431, 484, 498, 445, 365, 327, 353, 396, 405, 382, 356, 344, 348, 371, 418, 469, 495, 486, 458, 442, 458, 502, 543, 547, 506, 446, 388, 336, 290, 270, 298, 361, 411, 409, 369, 342, 368, 437, 502, 519, 491, 461, 464, 497, 534, 555, 561, 560, 553, 536, 502, 457, 410, 372, 342, 320, 317, 344, 385, 395, 357, 310, 315, 378, 439, 441, 398, 368, 375, 389, 374, 346, 341, 365, 388, 393, 392, 401, 417, 425, 424, 423, 416, 392, 355, 329, 326, 337, 353, 373, 395, 402, 383, 350, 332, 344, 374, 392, 379, 345, 324, 337, 367, 371, 337, 300, 304, 350, 393, 394, 364, 340, 336, 335, 311, 272, 255, 277, 318, 343, 342, 324, 299, 272, 264, 296, 345, 356, 302, 226, 192, 208, 229, 232, 247, 307, 395, 447, 416, 315, 212, 174, 209, 262, 277, 258, 249, 267, 285, 275, 248, 228, 214, 199, 196, 217, 247, 250, 223, 194, 190, 218, 275, 345, 395, 399, 365, 329, 308, 290, 277, 296, 340, 355, 309, 249, 245, 297, 349, 364, 360, 358, 357, 356, 372, 405, 422, 398, 353, 324, 323, 333, 343, 355, 376, 409, 440, 437, 381, 303, 262, 281, 322, 340, 330, 312, 285, 250, 230, 243, 271, 285, 293, 319, 357, 374, 364, 350, 346, 351, 364, 379, 367, 311, 250, 237, 266, 280, 272, 296, 362, 400, 361, 300, 304, 366, 414, 414, 396, 379, 358, 334, 319, 309, 295, 295, 333, 377, 373, 327, 309, 344, 378, 352, 287, 248, 257, 295, 336, 371, 396, 410, 417, 412, 386, 358, 370, 429, 475, 454, 384, 334, 335, 353, 346, 318]
892C18j4J9M0K9Jj2QL2K6pk1j2j3l7m6rL1K8rk5rJj3k4j1J0J7J8K0J2j8m8m7pL2L9J6orjR
887C08J9L5M7L4jl3l6j0J2J2nk0k0mOjj6j9LK6K7J3NNJj2j8pRJ7J6J8K3K3J7MmkPJ7J9J5K
881E32k1l7j5M3Q2O1kl8l2k3l4l5%L5K9nk2j9k5l1oM1N7K5j2j9k2l8m2j2J6%l2k7J2L1J6J2
877D43L4M4J0k8k5LJ4mj7j4jJ2K3J4k4o3n8kM8L1l0o6l6J4K2j3k4K1O9M7k5n9k1L3L4NkNq
872D06l6k9J2L7K7J9L4L6Qj0J2L1Jm4m1MK3rm5l5J0N3O7N2J5j5j9mNJoj6l2l7j0K7L0mk3o
867D89Ok0m9l4QJ8j1k8jM4N6K3j8k8nNk8o5m5L4R3P6K1qMJ8J3ok7l9k3NMl1l7J8O7L4m5o6
862D22j3K3lk7%L6L0lj4j3j7j6kol9m7RP6P2Ql5j9J6M0M7L8Ok2j5Rjk9k4K2N0K9oj3kpk1k4
857E15j4jJ2K5J9Jj1jJ3J8J2lk6m4l4KK7K3Oj0k9m2k4J9M0J7qQM1L0k2n0k3J9K2nk6j9pNK3
$$ y = [318, 304, 323, 363, 392, 393, 381, 389, 421, 447, 440, 419, 407, 394, 357, 311, 302, 333, 361, 352, 327, 318, 319, 306, 282, 271, 281, 298, 316, 336, 348, 330, 282, 235, 228, 260, 299, 315, 309, 300, 299, 308, 327, 362, 409, 443, 442, 409, 373, 363, 375, 387, 382, 362, 342, 338, 344, 343, 327, 308, 311, 337, 364, 377, 382, 387, 388, 376, 358, 351, 360, 377, 393, 411, 434, 457, 474, 478, 474, 472, 479, 496, 515, 530, 532, 511, 474, 459, 502, 584, 645, 643, 605, 573, 550, 516, 481, 481, 516, 545, 540, 518, 499, 474, 443, 437, 478, 535, 560, 548, 529, 507, 469, 427, 415, 431, 431, 399, 372, 384, 415, 431, 443, 477, 521, 531, 503, 478, 481, 495, 491, 474, 460, 459, 471, 494, 508, 484, 421, 363, 361, 409, 440, 410, 344, 308, 322, 344, 331, 307, 328, 397, 444, 419, 360, 339, 372, 406, 411, 409, 414, 406, 370, 341, 353, 390, 417, 436, 470, 506, 514, 504, 516, 547, 548, 504, 463, 467, 490, 481, 436, 401, 411, 464, 531, 583, 598, 583, 564, 560, 565, 566, 560, 544, 512, 475, 465, 492, 522, 518, 495, 489, 495, 475, 426, 392, 400, 418, 407, 379, 378, 422, 478, 501, 483, 455, 450, 455, 427, 362, 317, 351, 444, 520, 541, 533, 537, 555, 568, 562, 535, 496, 473, 478, 482, 451, 414, 432, 499, 533, 488, 422, 409, 432, 429, 402, 402, 438, 468, 465, 451, 438, 421, 405, 403, 397, 358, 311, 320, 396, 468, 476, 441, 422, 438, 478, 525, 563, 569, 547, 532, 541, 540, 511, 487, 509, 559, 588, 582, 569, 567, 560, 539, 515, 501, 500, 512, 537, 556, 557, 546, 545, 558, 576, 588, 585, 559, 515, 481, 483, 510, 533, 539, 529, 500, 458, 434, 453, 493, 510, 502, 510, 551, 581, 559, 509, 486, 505, 527, 522, 496, 477, 470, 475, 498]
852D98M9N3J9k9m3k5j6l2l7%L5K0k4k8OJ6k3n3l0J9M3M1L8K8QjK3N1M3Pj2j2k2m2m6j3K6L2
847E67nm4m0J5N7L3l2n0PO7N9Ql0m6o0n2MP3Q9N6K4J9J1j4l2l6l5l1k0k2l6k0M7R7N4m2o7
843E73mM2J1k6jM0L1j2k8j1JJPJ3J3K0M3M7J2l1l9l0l1k7NL1J9%K6O3M2k8p5o2k9kL3O8O2
838G67J3k7j8J8K9Ok5l9k2NJ0j5k6ML4J0m1m6%L0J7J7N3P3L0k6m1l3l8l9mL6L1rl4l1k2qK4
833F63M4J5l2l0K1N1K9OJ5J8joK9M6%n1k9L4L9k4n7rN1N0J0jJ5J5oj0MJ1MKPjj3kK8K5j6n3
828H91n4m4m2k7K0N5L3j5k5%J4QJ5L7K7j5l4QO1O0Rm7p2o6l1J8M4K0k8m8k2J9M4M5L3K4K0
824I35J4mk7k7kJ9Qj7k4j3j5k6j6K2M7L4Nn%jnJ0L1K6pl6l2j2qk1k8j2J4L9O1O9M5mm7n1k5
819I14JPOM%lMK6L8K0j5l3j0K4K8kl1k3J2K9J4j2k3j9j2oJOJ3K8L6J1l6n4j1M6N2Ml6k9QM3
$$ y = [498, 547, 600, 619, 590, 547, 522, 506, 474, 437, 437, 472, 492, 468, 440, 446, 462, 439, 386, 356, 375, 418, 459, 497, 525, 533, 532, 555, 606, 649, 656, 644, 632, 610, 568, 522, 509, 535, 567, 562, 518, 478, 493, 550, 583, 551, 501, 508, 575, 634, 642, 612, 566, 506, 454, 458, 531, 620, 676, 700, 719, 730, 716, 684, 648, 613, 582, 562, 540, 504, 484, 531, 628, 682, 640, 573, 569, 611, 622, 596, 595, 635, 666, 654, 626, 615, 616, 617, 624, 637, 650, 670, 713, 760, 772, 741, 702, 672, 641, 614, 619, 650, 669, 669, 695, 758, 800, 772, 697, 635, 606, 604, 637, 705, 767, 780, 753, 735, 753, 782, 788, 763, 724, 702, 707, 717, 702, 676, 680, 714, 724, 683, 637, 637, 667, 684, 701, 754, 827, 857, 831, 790, 757, 719, 680, 676, 712, 743, 734, 700, 669, 647, 639, 663, 707, 722, 690, 660, 681, 732, 761, 767, 782, 800, 799, 793, 822, 868, 868, 817, 788, 822, 861, 837, 780, 771, 822, 872, 882, 881, 896, 911, 905, 895, 899, 910, 914, 916, 923, 922, 909, 907, 935, 960, 944, 891, 837, 793, 751, 724, 744, 799, 832, 817, 792, 792, 806, 814, 829, 866, 893, 878, 844, 852, 913, 973, 982, 935, 863, 797, 766, 784, 828, 848, 820, 772, 750, 769, 813, 858, 891, 915, 935, 949, 945, 918, 891, 889, 908, 916, 899, 875, 862, 847, 821, 805, 827, 874, 908, 913, 908, 908, 907, 902, 912, 943, 969, 962, 926, 894, 882, 874, 853, 825, 813, 827, 866, 927, 996, 1041, 1037, 990, 939, 914, 915, 922, 928, 932, 932, 929, 933, 959, 997, 1017, 1002, 969, 959, 983, 1011, 1009, 978, 955, 967, 996, 1010, 998, 975, 956, 944, 938, 939, 945, 958, 986, 1022, 1033, 997, 943, 932, 978, 1030, 1034, 998, 969, 977, 1020]
814A020N9M4Jm7o1l4PL0L6K7%k7k5JPk6n6l8J7N2M2J0j7k2j0RJ4%j0%J7K2J1RK3L6L1J7QO
809A183%j9k7KM7N6J2k6j1J8po5o2J7O7K5l9l5J2J8k1l2%J8NKK6L6lm9m7pK6K9J2j0k3j9P
804A116L7N0L3pl8l5KL4K9Kj6rRK6L3J0l5o0l2J3K1j3l3j7jqj3OL4M7M4L6J0l2n6l6QL4K6
799A219J3J1J7J4Jj8l0l1k2j0KPoj7jM4O8M1KNL3L4%k3mK7L0Ml0n1m7j9OJ1J7M7O6K7l9n3
794A345j1K0Lj5LK6J6j0k3k3j9jK2J4j6j1M0O6K0l8m4j2MPK2K5rl6oL0Rm5m1K3O2L8LjJ1K2
789A470L3L3Jm6n8k8JPLlj8k4kK8K0qJL3L3rk4QK8om2l2QL0L2J9lk6k3nrl3k8J8M7K8kpmp
784A434J0N1O6K8j2k1k1l9l5J1M2J0l2j4L4M3J7J3K9J3k6k8J4M2J9k1l9l3k1j0j3k6k7jJ7
780A474NnJ8L9K2JK4N5J9n0n9lK4j1l4kL3K7J7L3L9QrK1L9j2p3o0LK7%rL1O2M1pl3j8K0N1
$$ y = [1020, 1079, 1123, 1124, 1077, 1016, 982, 989, 1019, 1055, 1082, 1082, 1055, 1030, 1031, 1038, 1012, 956, 918, 935, 987, 1029, 1039, 1022, 1000, 990, 999, 1013, 1013, 1003, 1003, 1020, 1042, 1053, 1062, 1085, 1121, 1152, 1169, 1177, 1183, 1183, 1164, 1137, 1139, 1186, 1242, 1254, 1228, 1217, 1235, 1228, 1163, 1101, 1118, 1185, 1210, 1171, 1136, 1148, 1166, 1145, 1113, 1113, 1131, 1136, 1138, 1164, 1200, 1197, 1148, 1101, 1094, 1120, 1149, 1161, 1151, 1128, 1109, 1116, 1153, 1203, 1236, 1229, 1191, 1156, 1158, 1192, 1221, 1223, 1207, 1198, 1207, 1233, 1266, 1276, 1241, 1181, 1149, 1162, 1183, 1170, 1137, 1120, 1119, 1111, 1098, 1104, 1138, 1185, 1229, 1265, 1275, 1243, 1187, 1151, 1159, 1193, 1219, 1232, 1243, 1260, 1274, 1275, 1257, 1227, 1196, 1174, 1164, 1166, 1173, 1167, 1150, 1149, 1193, 1261, 1302, 1304, 1309, 1342, 1376, 1376, 1353, 1349, 1376, 1406, 1410, 1380, 1329, 1282, 1263, 1269, 1280, 1297, 1344, 1410, 1437, 1398, 1345, 1334, 1354, 1357, 1342, 1345, 1371, 1387, 1377, 1354, 1331, 1312, 1311, 1333, 1347, 1331, 1320, 1360, 1426, 1446, 1408, 1364, 1352, 1356, 1363, 1385, 1410, 1401, 1365, 1359, 1389, 1398, 1353, 1312, 1335, 1397, 1435, 1438, 1437, 1448, 1470, 1503, 1536, 1537, 1491, 1433, 1405, 1406, 1413, 1416, 1413, 1395, 1371, 1369, 1397, 1417, 1409, 1410, 1443, 1476, 1467, 1443, 1451, 1479, 1473, 1431, 1399, 1407, 1437, 1469, 1488, 1485, 1459, 1436, 1431, 1422, 1389, 1361, 1379, 1426, 1454, 1452, 1445, 1441, 1434, 1444, 1495, 1561, 1589, 1577, 1556, 1535, 1496, 1461, 1472, 1514, 1524, 1492, 1478, 1512, 1555, 1572, 1585, 1614, 1627, 1601, 1573, 1587, 1629, 1648, 1627, 1588, 1555, 1534, 1524, 1511, 1485, 1458, 1457, 1474, 1479, 1474, 1492, 1531, 1553, 1554, 1578, 1633, 1652, 1602, 1543, 1540, 1564, 1553, 1519, 1517, 1550, 1577, 1594, 1627, 1666, 1674, 1665, 1686, 1725, 1713, 1640, 1580, 1583, 1610, 1610, 1601, 1632, 1694, 1735, 1728, 1695, 1677, 1697, 1748]
775A748M8J2k8l9l1l0l8l3j4MK3M2M2Pl5l4LK6J5mrj7l7l4RN5N4J0k2j7oj6l3k3J2M3N1L8
770A742J8jr%J7K7K1Rjj7l8m5k1QOj7k1LJ9PlK0M9M0Jk1j1LJKJ4J1k4n7m2J1N0M2J3J0L7N9
765A912M8J7mqj4l0l9k4kNLJ3L0L3J3nmJ1J9K1J6jk6l7pL7M0rn5m5QM2L1RPK5L6L4K1Jj8k3
760B081j7j5j7qJ1Rk7n2k2L1N1K6OQNk6n3m0kK1J7MMJ8L6M1K0j9m2l1RM6N6K8j0j9J5M7L0
755B220j6l0KL1K5QMkk2l1j4Mkj4pQRLJ4K6K2J4K2L4K4LqpoQL6M4J0l0k9nlj7kM0N8L6J8J9
750B497Rk4m4k5J4L8M4L2Jl8n4l6NN2Q7P6Rn9n6jK8Nj7KK7K6J0nk7m3j5N1Q6N9J6jmj1NM5
745B764M7j0n2j4N1N3J4PK8J9j4qL3M2Mj9lPqj3J7M4L7J4%j7l2k1K0M8M0K6K1Kl3m8k1J7L3
740C075L4L4K7J0J%pj2J7O7P4J8m2m4j0J0K0M3O0M0NlQRJJ0J9Pj3KL4K8j4l6pK9K9J2J4M1
$$ y = [1748, 1796, 1808, 1780, 1741, 1710, 1680, 1642, 1609, 1595, 1599, 1622, 1664, 1706, 1713, 1678, 1644, 1647, 1673, 1688, 1684, 1675, 1658, 1621, 1587, 1596, 1651, 1705, 1715, 1693, 1676, 1670, 1654, 1621, 1598, 1610, 1653, 1704, 1742, 1760, 1759, 1750, 1750, 1767, 1794, 1815, 1824, 1823, 1806, 1768, 1723, 1702, 1710, 1716, 1699, 1678, 1681, 1700, 1707, 1704, 1724, 1773, 1813, 1814, 1793, 1782, 1785, 1786, 1788, 1802, 1813, 1789, 1732, 1690, 1701, 1751, 1793, 1806, 1816, 1853, 1912, 1960, 1977, 1973, 1965, 1951, 1921, 1882, 1858, 1856, 1861, 1864, 1877, 1907, 1940, 1953, 1948, 1944, 1955, 1974, 1995, 2011, 2010, 1984, 1947, 1940, 1977, 2017, 2008, 1953, 1908, 1916, 1958, 1989, 1998, 2005, 2030, 2066, 2100, 2121, 2122, 2104, 2081, 2064, 2049, 2032, 2024, 2035, 2044, 2017, 1965, 1943, 1974, 2025, 2051, 2057, 2065, 2070, 2044, 1991, 1951, 1949, 1970, 1987, 1991, 1995, 2013, 2049, 2090, 2110, 2091, 2049, 2018, 2027, 2073, 2129, 2157, 2147, 2128, 2143, 2190, 2220, 2204, 2174, 2176, 2207, 2232, 2240, 2244, 2242, 2220, 2189, 2175, 2179, 2177, 2163, 2156, 2164, 2173, 2176, 2190, 2216, 2238, 2252, 2274, 2308, 2332, 2335, 2327, 2320, 2314, 2322, 2358, 2402, 2412, 2382, 2353, 2348, 2345, 2328, 2326, 2366, 2424, 2460, 2478, 2497, 2506, 2482, 2438, 2413, 2427, 2465, 2509, 2541, 2542, 2504, 2450, 2414, 2419, 2471, 2558, 2634, 2643, 2584, 2528, 2527, 2555, 2560, 2543, 2545, 2572, 2598, 2608, 2603, 2576, 2533, 2518, 2569, 2655, 2714, 2730, 2729, 2725, 2714, 2719, 2764, 2811, 2801, 2749, 2735, 2786, 2839, 2853, 2860, 2888, 2907, 2893, 2885, 2918, 2960, 2964, 2945, 2942, 2949, 2941, 2928, 2945, 2989, 3026, 3040, 3040, 3023, 2991, 2970, 2990, 3038, 3078, 3104, 3125, 3127, 3094, 3046, 3025, 3042, 3075, 3109, 3143, 3170, 3180, 3181, 3181, 3174, 3162, 3179, 3246, 3320, 3338, 3296, 3252, 3242, 3252, 3272, 3315, 3375, 3415, 3420, 3417, 3425, 3434, 3435, 3445, 3464, 3471, 3458, 3460, 3494, 3522, 3508, 3472, 3465, 3494, 3523, 3535, 3549, 3590]
735C590N6M6K8K1K7L1J9LPK7K9%j9%L2L0LjK1L4K8L2N0N3K8MJPJ0K0M6O2M3Lj8j0K0M7N0L8
730D498L3N5Q0P0K9kprj0J7O3P9M1jkK4N0Q2J14J01K1n6n0K1P2O6M6M8M7K0lJ1N0Q0Q0O1M4
726E863M8O6O3K7nJ5O1P2M4L6O8Q3M7J5L6Q0Q4N6N2Q0Q6N2K0K3M6P1R6J16J00N0J3L1P7R2
722G764P2O2Q1J02R1O6O7R8J17J00O6O2J01J42J43J07P9Q3J01J04R3R3J12J29J30J08Q4Q4
718A0441J16J60J74J50J26J30J46J52J50J69J97K01J73J53J68J94J96J81J87K13K32K23K00
715A4432J93K09K32K41K35K37K60K89K89K60K46K73L11L19L02L05L38L65L64L50L42L48L63
713B1103L87M16M36M43M45M39M23M25M69N32N56N30M99M93M94M89N05N61O19O34O10N89N90
710C2687O09O29O42O42O43O72P18P26O87O64P01P44P35P03P07P27O94O25O10O58O78O35N93
$$ y = [3590, 3646, 3692, 3720, 3741, 3768, 3799, 3818, 3821, 3828, 3855, 3884, 3884, 3865, 3865, 3897, 3927, 3930, 3929, 3950, 3984, 4012, 4044, 4094, 4147, 4175, 4179, 4180, 4187, 4197, 4217, 4263, 4325, 4368, 4371, 4353, 4343, 4363, 4410, 4460, 4498, 4531, 4586, 4666, 4736, 4765, 4763, 4756, 4747, 4737, 4754, 4817, 4896, 4937, 4936, 4934, 4958, 5008, 5090, 5204, 5305, 5326, 5270, 5220, 5241, 5313, 5379, 5425, 5473, 5520, 5540, 5537, 5548, 5598, 5678, 5758, 5819, 5863, 5911, 5977, 6040, 6067, 6062, 6077, 6138, 6210, 6254, 6290, 6358, 6441, 6488, 6503, 6539, 6619, 6703, 6759, 6811, 6891, 6977, 7029, 7049, 7072, 7118, 7189, 7285, 7401, 7501, 7551, 7564, 7595, 7672, 7764, 7836, 7898, 7979, 8081, 8172, 8238, 8305, 8403, 8520, 8620, 8686, 8748, 8849, 8991, 9134, 9241, 9320, 9403, 9504, 9608, 9701, 9794, 9906, 10035, 10165, 10273, 10357, 10441, 10557, 10717, 10891, 11041, 11167, 11297, 11443, 11595, 11745, 11914, 12111, 12312, 12485, 12638, 12806, 13000, 13196, 13377, 13564, 13777, 14009, 14232, 14432, 14625, 14834, 15066, 15307, 15542, 15779, 16039, 16328, 16617, 16877, 17123, 17396, 17707, 18026, 18328, 18633, 18971, 19336, 19700, 20050, 20392, 20740, 21103, 21490, 21906, 22342, 22785, 23230, 23669, 24092, 24517, 24986, 25518, 26074, 26604, 27103, 27596, 28090, 28579, 29084, 29645, 30264, 30898, 31508, 32097, 32687, 33296, 33925, 34567, 35209, 35852, 36524, 37242, 37968, 38655, 39319, 40020, 40764, 41499, 42202, 42909, 43636, 44330, 44955, 45565, 46223, 46901, 47536, 48129]
707D8129N96N87N23M61M62M82M45L72L33L38L34K95K46J92J20N2K5Rm7j34j75j52j37j93k78
704E2885l23l21l31l84m51m93m92m72m71n05n50n66n59n60n87o21o41o44o34o09n94o13o52
701D0812o66o32n89n83o09o29o27o11n89n63n39n28n38n60n72n51n11m89n05n22n01m49m22
698B8027m36m55m45m20m08m06m01l92l83l65l43l29l30l29l19l15l26l30l17l08l08k92k53
695A9817k35k69l08k91k42k34k76k97k57j99j76j78j62j37j41j87k37k55k28j79j43j36j42
693A4908j36j14j03j21j46j55j56j68j73j50j09r7j29j59j43r8q4j19j49j30q6p3r7j06q0
690A1827o2q9j30j34j03p9p3o7o0p2j06j16q6n0n3q1r2o8m3m6o2o1m1k9m3o7p4o3n8n9m8j7
686I595%l5r5j16p3oJ8j3n1o0m6m9p4q7o7m0m7o8n8j9kk0l1oQl0p0n0jqo8r6n7k1l4o0m4j0
$$ y = [48129, 48725, 49312, 49835, 50296, 50758, 51240, 51685, 52057, 52390, 52728, 53062, 53357, 53603, 53795, 53915, 53967, 53992, 54001, 53954, 53820, 53645, 53493, 53356, 53163, 52885, 52562, 52241, 51910, 51526, 51075, 50582, 50090, 49618, 49147, 48642, 48092, 47526, 46967, 46407, 45820, 45199, 44558, 43914, 43280, 42671, 42077, 41464, 40812, 40146, 39514, 38925, 38342, 37733, 37104, 36477, 35866, 35277, 34714, 34175, 33647, 33109, 32549, 31977, 31426, 30915, 30426, 29921, 29399, 28898, 28449, 28027, 27591, 27136, 26691, 26271, 25863, 25457, 25056, 24664, 24281, 23916, 23573, 23244, 22914, 22585, 22266, 21951, 21625, 21295, 20978, 20670, 20362, 20070, 19817, 19582, 19313, 19005, 18714, 18472, 18238, 17962, 17665, 17408, 17209, 17033, 16855, 16693, 16556, 16415, 16228, 15991, 15736, 15508, 15329, 15186, 15050, 14908, 14772, 14658, 14555, 14434, 14288, 14133, 13977, 13809, 13636, 13486, 13377, 13280, 13151, 12992, 12849, 12751, 12667, 12548, 12399, 12269, 12183, 12110, 12013, 11907, 11827, 11765, 11676, 11546, 11412, 11309, 11230, 11157, 11090, 11030, 10958, 10852, 10736, 10650, 10600, 10547, 10466, 10374, 10306, 10263, 10217, 10155, 10094, 10053, 10024, 9981, 9914, 9840, 9777, 9719, 9660, 9612, 9595, 9595, 9560, 9465, 9349, 9276, 9270, 9288, 9275, 9224, 9164, 9118, 9069, 8995, 8908, 8841, 8801, 8754, 8686, 8628, 8609, 8607, 8587, 8556, 8550, 8558, 8528, 8458, 8408, 8407, 8399, 8331, 8235, 8178, 8157, 8123, 8063, 8019, 8009]
681H009mj7j3kj2l3l3j9j7k1j5j8m8o9m2MNl0m1j2ll7o1l0J5Qm4p8n9j1K0J3j9m7n5m8m7n0
676G039l8j5pj6j4NOl2o7n7j5ml7p3o6k7PJ1qk6k6j9j7k5l4l2k0nJ0J7J1qj9j9j6k3l2l8l9
672F232k8kL0L0qm5m7k4j1q%Mj6m1l3QL1J7mMK8L3J5nj7k2l0l7l9k6OL0J2l5o3l9lml3m2j6
667E802K5N0N4L8J5jok3n7o1qN5M6k2n9k5J0k1p6p3j6K1J1j1j2j4k7l0oJ5Nj3qK3L7J3k2l4
662E595j9nj1j9pK0K4Jk0j1RJ3Ljnj9k7nK9L4J5J1K4Rn1r7q1k3J8L6M6M8K6ok4k9l1k0J7N1
657E518M1pl8k5KNj0k0j1K0N8P3L8k7o9n3nK8K0j3m2m5j9J7M2M4K0k4o7p4k9L6O4M0jj8j0
653E459KQJ5K6L6L0Kl1m1k4j3k9l7KO3Q7N5Qrqj1k2k5j7KK2J4k7o7o0j5J5J5J8L4L2Kj1J4
648E514K5j5n5l5K2M2J7ljok3j5J7K3j3l4NO4P3K6k5l6rL2O3O4K6k9o3n1nL3L6J3j1j2LJ5
$$ y = [8009, 8005, 7988, 7975, 7973, 7961, 7928, 7895, 7876, 7859, 7838, 7823, 7805, 7757, 7688, 7646, 7650, 7655, 7625, 7584, 7572, 7569, 7532, 7471, 7441, 7456, 7464, 7420, 7342, 7283, 7272, 7292, 7305, 7286, 7239, 7184, 7136, 7089, 7039, 7001, 6986, 6979, 6963, 6949, 6954, 6960, 6928, 6861, 6804, 6789, 6785, 6748, 6675, 6609, 6582, 6589, 6600, 6592, 6566, 6540, 6521, 6504, 6479, 6445, 6413, 6393, 6388, 6398, 6415, 6426, 6418, 6399, 6380, 6364, 6341, 6309, 6271, 6232, 6204, 6202, 6232, 6262, 6254, 6209, 6162, 6138, 6127, 6119, 6119, 6123, 6107, 6066, 6033, 6041, 6072, 6089, 6085, 6089, 6117, 6150, 6165, 6160, 6143, 6121, 6091, 6054, 6015, 5989, 5995, 6025, 6037, 6002, 5939, 5900, 5897, 5893, 5860, 5818, 5802, 5827, 5877, 5931, 5969, 5984, 5983, 5977, 5954, 5897, 5836, 5828, 5883, 5929, 5907, 5848, 5823, 5833, 5812, 5736, 5663, 5647, 5668, 5679, 5668, 5656, 5642, 5615, 5585, 5579, 5594, 5599, 5586, 5578, 5601, 5638, 5651, 5629, 5595, 5576, 5571, 5560, 5541, 5534, 5554, 5578, 5579, 5559, 5548, 5557, 5570, 5573, 5572, 5567, 5548, 5521, 5516, 5545, 5579, 5594, 5605, 5629, 5638, 5587, 5490, 5409, 5386, 5404, 5440, 5486, 5534, 5560, 5554, 5530, 5501, 5470, 5450, 5467, 5518, 5559, 5552, 5514, 5489, 5491, 5496, 5486, 5466, 5455, 5475, 5533, 5606, 5644, 5617, 5548, 5495, 5490, 5518, 5538, 5525, 5483, 5438, 5419, 5436, 5478, 5522, 5542, 5518, 5451, 5377, 5348, 5384, 5448, 5488, 5487, 5469, 5459, 5461, 5469, 5484, 5510, 5546, 5576, 5578, 5547, 5506, 5482, 5469, 5440, 5403, 5405, 5468, 5555, 5610, 5618, 5609, 5601, 5590, 5568, 5543, 5526, 5528, 5550, 5564, 5537, 5470, 5410, 5395, 5410, 5425, 5443, 5477, 5509, 5511, 5500, 5514, 5539, 5524, 5469, 5434, 5456, 5498, 5515, 5512, 5511, 5505, 5482, 5467, 5484, 5507, 5494, 5460, 5465, 5529, 5602, 5628, 5603, 5567, 5558, 5590, 5653, 5717, 5743, 5714, 5651, 5600, 5595, 5628, 5664, 5677, 5666, 5654, 5657, 5672]
643E672J4PKkj3l1m3l0%J5nk8j2L3N3L4J3J7J0l9p7m2L8O8K1l3k7J6L8L7L2K4ll8m9k6KJ5
638E663J0QJ5K4J5j3l6l0nMj1k1j2RK8L9M0K0j2k6mK6K4pl5k7MK5J4j0k3j2L%rpkj4k9j4K7
633E639M2Jn1m3K8Q9P5jo7n9OO1N9K7Mkm%K1K9qo1o5j5J9Jk4jM3N3K7Nkj4k7k0J1L9N5O0M5
628E975J3j1rJoj5kJ8Ml3n0k4J0K6K6J8J%L0N5L0l1n4j8J7Oj4JK9K3LJ6N3O3K4j7k8qK5N8
624F205O6L1j3j4M0Q8Q0L7J5K2K3%j7kL1N0M7L9L5L1L6N0O1M4%l4l1jL0M6M2K0j3l1k6j9k3
619F945l0j6J1K1J1nj8l5m0j5K4L2Nk3j8PK3K9L1K7J6J0K4M7O0N3K4j0j7K3Q2R7O1L7O3R5
615G631O7Lj3L9Q6P0K5MK0M4O3P6O0J0m5n4j7Pj3n7q2q5q3p9o2m2k9k2jK1Nm6q6o7rK0jl3
610G325l4j4qk7m6l7oJ1Jk0j6PK3J4J2L5N4L0j8l8j1K4K8QqpRL1M1L3J7J2J0ok4j7jj1m2l8
$$ y = [5672, 5686, 5693, 5695, 5693, 5680, 5649, 5606, 5576, 5576, 5591, 5586, 5558, 5546, 5579, 5632, 5666, 5679, 5696, 5706, 5667, 5590, 5548, 5586, 5654, 5675, 5642, 5615, 5631, 5669, 5706, 5738, 5762, 5759, 5721, 5672, 5646, 5648, 5663, 5673, 5681, 5696, 5720, 5735, 5722, 5686, 5656, 5651, 5655, 5644, 5623, 5611, 5620, 5648, 5687, 5727, 5747, 5735, 5709, 5705, 5731, 5755, 5748, 5713, 5686, 5690, 5715, 5729, 5719, 5696, 5684, 5687, 5687, 5678, 5671, 5669, 5655, 5626, 5612, 5639, 5681, 5682, 5631, 5588, 5616, 5705, 5780, 5779, 5712, 5653, 5659, 5720, 5779, 5806, 5810, 5808, 5804, 5804, 5825, 5854, 5846, 5785, 5720, 5705, 5724, 5725, 5701, 5700, 5743, 5796, 5823, 5828, 5826, 5812, 5785, 5765, 5776, 5815, 5870, 5930, 5975, 5988, 5977, 5968, 5969, 5963, 5948, 5946, 5964, 5968, 5935, 5885, 5861, 5871, 5897, 5923, 5941, 5942, 5942, 5972, 6027, 6057, 6026, 5972, 5954, 5971, 5977, 5963, 5964, 5993, 6016, 6019, 6035, 6088, 6151, 6175, 6158, 6130, 6122, 6147, 6205, 6271, 6302, 6289, 6275, 6315, 6403, 6483, 6520, 6535, 6557, 6580, 6580, 6563, 6561, 6592, 6642, 6689, 6728, 6763, 6794, 6830, 6880, 6941, 6985, 6985, 6951, 6920, 6919, 6949, 6995, 7037, 7057, 7044, 7013, 6987, 6968, 6945, 6915, 6899, 6910, 6931, 6942, 6937, 6919, 6884, 6844, 6829, 6853, 6885, 6890, 6867, 6849, 6856, 6879, 6908, 6939, 6966, 6982, 6992, 7016, 7063, 7123, 7176, 7200, 7190, 7173, 7196, 7278, 7375, 7436, 7473, 7536, 7631, 7698, 7701, 7688, 7727, 7813, 7883, 7908, 7912, 7932, 7976, 8039, 8115, 8175, 8185, 8140, 8086, 8069, 8076, 8063, 8006, 7924, 7839, 7756, 7677, 7615, 7573, 7544, 7522, 7521, 7542, 7547, 7501, 7415, 7348, 7339, 7359, 7358, 7325, 7291, 7277, 7269, 7242, 7196, 7159, 7153, 7164, 7165, 7145, 7129, 7136, 7159, 7173, 7185, 7220, 7274, 7304, 7286, 7248, 7237, 7261, 7289, 7297, 7289, 7282, 7291, 7322, 7363, 7396, 7413, 7425, 7435, 7429, 7405, 7388, 7387, 7376, 7334, 7296]
605G296MJ9k7q1p6l9l0m9m4j9j3k8k6kJk9n2m0j0LNNMjrk2l5l1OM6M1qm4l7oJ0Mj7m2n0j2
600F565M8P2L9ok3l1m9m3J8Q8Q9K4k9k5mok4k5j9l1m5k8J7N1M3J7KKkomMPPJ9L2K1pj1K0L7
595F804Nk9lM7L4m2p7j7O1N7j1m7j0M6O2L5N%K0L8K2j8l8j1K9L6J0qkJ5L5N7O6M6Rj1j1j4
590G190k0pK2L5K0LQK2K0MoLJ9K7K4J9K3L0J9kNM1N4J0l7j5O0R3N5J7L1N6L1j4j3L5P2N9K5
586H018J2L5P9J04Q0J7k4pM7P8P3N3L2J8K6N5P3N2J9K6N6M6mk5J9P1P2M2K9L3K7J0QJ9K8L8
581I335M6K6m0r5o9J8P2N0J0J3L6L3J9K7M6L1j2k2K2O3O0L0K5M4N7N0L6K4J7K1L9O0O2N4N6
577A0244P8R7R4P4N0K0kMM4Q9J06J01Q8O6K5j4j0K8M4J8qJ4P1J13J23J21J14Q6M4K5N5R7J07
573A2206Q6P6R2J10J04Q2P1P8Q9R3J03J22J33J21R9R4J18J44J43J16R3J04J47J87J93J62J30
$$ y = [7296, 7300, 7319, 7292, 7211, 7135, 7096, 7066, 7017, 6973, 6954, 6941, 6913, 6887, 6885, 6886, 6857, 6805, 6765, 6755, 6758, 6763, 6768, 6772, 6771, 6762, 6740, 6705, 6674, 6680, 6726, 6767, 6759, 6715, 6678, 6672, 6682, 6686, 6669, 6627, 6577, 6565, 6613, 6685, 6724, 6718, 6695, 6664, 6615, 6572, 6590, 6678, 6767, 6791, 6762, 6737, 6733, 6727, 6703, 6678, 6659, 6628, 6583, 6555, 6572, 6623, 6666, 6683, 6685, 6687, 6685, 6679, 6675, 6679, 6686, 6693, 6712, 6744, 6765, 6758, 6747, 6767, 6804, 6809, 6780, 6777, 6824, 6858, 6816, 6739, 6722, 6783, 6840, 6829, 6782, 6772, 6818, 6880, 6915, 6920, 6920, 6940, 6978, 7000, 6982, 6944, 6933, 6962, 6998, 7008, 7000, 6998, 7013, 7048, 7105, 7171, 7217, 7226, 7215, 7204, 7190, 7170, 7163, 7185, 7220, 7240, 7243, 7251, 7273, 7293, 7297, 7291, 7294, 7313, 7340, 7364, 7383, 7406, 7436, 7455, 7453, 7458, 7499, 7553, 7563, 7526, 7511, 7571, 7664, 7719, 7736, 7767, 7823, 7854, 7840, 7827, 7862, 7934, 7993, 8018, 8030, 8065, 8144, 8248, 8328, 8345, 8321, 8314, 8361, 8439, 8512, 8565, 8597, 8615, 8641, 8696, 8769, 8821, 8840, 8866, 8922, 8968, 8964, 8939, 8958, 9029, 9101, 9143, 9172, 9205, 9232, 9242, 9250, 9269, 9297, 9335, 9381, 9407, 9367, 9272, 9203, 9221, 9293, 9343, 9353, 9366, 9402, 9435, 9454, 9481, 9527, 9558, 9546, 9524, 9546, 9609, 9669, 9699, 9724, 9768, 9825, 9875, 9911, 9935, 9952, 9973, 10012, 10072, 10134, 10188, 10244, 10322, 10419, 10513, 10587, 10637, 10657, 10655, 10659, 10703, 10792, 10898, 10999, 11087, 11153, 11178, 11164, 11154, 11182, 11226, 11244, 11236, 11250, 11321, 11434, 11557, 11678, 11792, 11878, 11922, 11947, 12002, 12099, 12206, 12292, 12368, 12460, 12570, 12674, 12756, 12827, 12905, 12994, 13087, 13190, 13312, 13445, 13566, 13665, 13759, 13877, 14021, 14164, 14280, 14373, 14477, 14624, 14811, 15004, 15166, 15296]
570A5296J29J50J60J55J63J93K05J75J39J39J72J91J87J85J91J77J40J26J68K33K73K88K91
567A9526K81K48K23K34K64K79K72K78L06L37L59L80L94L94L91M11M47M70M77M90N14N20N19
564B8014N46O11O67O89P05P43P71P70P77Q47R57J033J061J084J133J198J264J352J458J548
562D7228J611J684J796J928K044K145K275K448K636K817K991L182L402L639L881M123M367
560I4197M615M862N105N333N527N672N761N805N804N754N643N468N214M870M450L981L458
557A81519K838K108J326N49k19j001j755k390k868l222l484l625l629l541l411l234k991k708
555A50262k436k178j879j519j146q15n23k02J85O15J030J414J803K223K660L087L518L996
553A60095M531N083N618O159O733P318P869Q371Q839R264R612R851R983J0032R998R843R517
$$ y = [15296, 15425, 15575, 15735, 15890, 16053, 16246, 16451, 16626, 16765, 16904, 17076, 17267, 17454, 17639, 17830, 18007, 18147, 18273, 18441, 18674, 18947, 19235, 19526, 19807, 20055, 20278, 20512, 20776, 21055, 21327, 21605, 21911, 22248, 22607, 22987, 23381, 23775, 24166, 24577, 25024, 25494, 25971, 26461, 26975, 27495, 28014, 28560, 29171, 29838, 30527, 31232, 31975, 32746, 33516, 34293, 35140, 36097, 37130, 38191, 39275, 40408, 41606, 42870, 44222, 45680, 47228, 48839, 50523, 52319, 54247, 56291, 58436, 60711, 63159, 65795, 68612, 71603, 74785, 78187, 81826, 85707, 89830, 94197, 98812, 103674, 108779, 114112, 119639, 125311, 131072, 136877, 142681, 148435, 154078, 159546, 164760, 169630, 174080, 178061, 181519, 184357, 186465, 187791, 188340, 188121, 187120, 185365, 182975, 180107, 176885, 173401, 169776, 166147, 162606, 159195, 155961, 152970, 150262, 147826, 145648, 143769, 142250, 141104, 140289, 139766, 139564, 139749, 140364, 141394, 142808, 144611, 146834, 149494, 152581, 156099, 160095, 164626, 169709, 175327, 181486, 188219, 195537, 203406, 211777, 220616, 229880, 239492, 249343, 259326, 269358, 279356, 289199, 298716]
551B98716Q999Q304P459O471N342M091K725J206m92k285m005n530o855q003q929r563r914
549B87737j0056j0026r821r485r108q736q336p883p411o959o506o017n512n041m612m183l732
547A64313l273k838k444k080j718j334r30n33j50K43O48J026J359J685K035K383K665K874
545A63931L050L200L289L291L229L123K944K660K291J871J406Q66K35m72j227k006k779l507
542A85395m148m680n106n433n654n751n724n622n503n376n206m981m751m554m379m186l973
540A00368l769l574l365l151k972k838k718k576k424k286k176k081j989j885j759j633j546
538E7626j507j464j369j245j155j115j092j063j029r88r18q30p71p52p39p03o73o74o74o25
536C8240n47n08n19n26m92m57m59m68m31l58l19l44l83l74l16k67k60k83k98k94k84k73k55
$$ y = [298716, 307715, 316019, 323478, 329949, 335291, 339382, 342107, 343313, 342821, 340536, 336531, 331001, 324146, 316143, 307214, 297651, 287737, 277681, 267655, 257834, 248349, 239241, 230505, 222169, 214286, 206875, 199916, 193410, 187393, 181881, 176840, 172228, 168045, 164313, 161040, 158202, 155758, 153678, 151960, 150626, 149696, 149163, 149013, 149256, 149904, 150930, 152289, 153974, 156009, 158392, 161057, 163931, 166981, 170181, 173470, 176761, 179990, 183113, 186057, 188717, 191008, 192879, 194285, 195151, 195386, 194914, 193687, 191681, 188902, 185395, 181247, 176567, 171461, 166028, 160374, 154623, 148899, 143277, 137774, 132398, 127192, 122211, 117460, 112906, 108527, 104341, 100368, 96599, 93025, 89660, 86509, 83537, 80699, 77981, 75405, 72981, 70695, 68519, 66438, 64449, 62564, 60805, 59172, 57626, 56119, 54655, 53286, 52041, 50886, 49771, 48679, 47616, 46587, 45599, 44681, 43851, 43080, 42328, 41589, 40886, 40213, 39539, 38865, 38240, 37693, 37185, 36666, 36140, 35648, 35191, 34732, 34264, 33833, 33475, 33156, 32812, 32429, 32055, 31739, 31472, 31212, 30929, 30631, 30337, 30053, 29780, 29525]
533B9525k28k00j88j88j88j81j71j63j60j56j46j33j28j43j67j81j73j39q9l6j9n5j04j01
530B6088m3pm9j15j14m3J0ll1j5K9M8K9LrrML5O2N5K2rj9j7lK5O2P9O6M2K1QjKJ0J0NRJ8N
525B6260k4k4K4P2O9L6K8N2O1L1PK3O3Q4R0J03J26J38J31J14R2P8R3J37J66J42J00J12J81
522B8565K35K32K15K32K50K26J89J98K44K71K69K86L22L26K95L08L99M74M41L42L12L87M72
519C5490M82M44M31M54M76M88N16N55N67N51N49N89O39O53O35O20O28O36O38O39O36O15N78
516D8509N55N59N60N39N14N03M83M19L36K88K82K64J99J09K7l9r4j43j97k79l75m48m78n04
513E1589n57o23o70p06p44p76p77p64p68p86p88p67p38p04o58o13o01o11o08n75n35n09m96
510C6215m91m82m48l81l22l19l55l62l08k44k25k34k27j88j46j21j15j17j15r4n7k5rkmk5
$$ y = [29525, 29297, 29097, 28909, 28721, 28533, 28352, 28181, 28018, 27858, 27702, 27556, 27423, 27295, 27152, 26985, 26804, 26631, 26492, 26403, 26367, 26348, 26293, 26189, 26088, 26045, 26038, 25989, 25874, 25760, 25717, 25727, 25724, 25693, 25678, 25707, 25755, 25784, 25787, 25778, 25769, 25773, 25808, 25870, 25925, 25947, 25938, 25919, 25902, 25899, 25924, 25986, 26065, 26131, 26173, 26194, 26202, 26201, 26203, 26213, 26223, 26228, 26237, 26255, 26260, 26236, 26212, 26236, 26308, 26377, 26413, 26441, 26493, 26554, 26585, 26592, 26615, 26678, 26762, 26852, 26955, 27081, 27219, 27350, 27464, 27556, 27634, 27727, 27864, 28030, 28172, 28272, 28384, 28565, 28800, 29032, 29247, 29479, 29729, 29955, 30144, 30342, 30586, 30857, 31126, 31412, 31734, 32060, 32355, 32663, 33062, 33536, 33977, 34319, 34631, 35018, 35490, 35972, 36416, 36847, 37301, 37777, 38265, 38781, 39336, 39903, 40454, 41003, 41592, 42231, 42884, 43519, 44139, 44767, 45403, 46041, 46680, 47316, 47931, 48509, 49064, 49623, 50183, 50722, 51236, 51739, 52222, 52641, 52977, 53265, 53547, 53811, 54010, 54119, 54146, 54107, 54013, 53870, 53673, 53394, 53019, 52571, 52093, 51589, 51032, 50409, 49739, 49033, 48289, 47513, 46736, 45972, 45204, 44418, 43630, 42863, 42125, 41421, 40763, 40150, 39549, 38938, 38330, 37755, 37220, 36711, 36215, 35724, 35242, 34794, 34413, 34091, 33772, 33417, 33055, 32747, 32503, 32278, 32044, 31817, 31629, 31483, 31362, 31247, 31130, 31015, 30921, 30864, 30839, 30830, 30828, 30824, 30799]
507C0799n7o8m4l0o9j42j93k03k13k50l07l55l84l97l99l96l90l74l44l13l07l27l52l58l34
504B4193k84k30k04k19k39k21j66j26j39j75j85j57j24j26j52j59j22o2l3m8p6p0l6rorKJ5
501B0833J3PJ0J1j2m4n4l2j2l5r1j33j33j07q7r3j23j65k02k26k39k45k26j77j29j30j74j94
497A7811j53j06j20j63j57j00p8j14j40r9n1p1j24j20o2l5o6r0o0k0l3q5j05o5j7k4p7j10
494A5366q2k6j4n1p0l7jk5p7q8n9m7o3o8o0p6j14j13o6l5n8p8n4l5o5j02q5m5n1q6q7n1l0
490A3367l4k3jj0m0l6KJ0k5l9kK3%k8j1J6J1OM3P7M5j9l1J2L1jk7mJ8kk8j4J8Pl7o6n7m2m8
485A3061n7m8l4l9o3q9r6q1n8l1j7k6o2r4r2o0l8n2o9n3j5%k4n3n0k0J4K7Ol9p1n9j2J9J3
481A1638JQK2K1RLNJ1L2N5N5K6lnjj4j9QL1Ql1j9J8lr3j45r1KL2Lj5%Qj2k6k2k2l3l3j6pk4
$$ y = [30799, 30742, 30674, 30630, 30600, 30531, 30389, 30196, 29993, 29780, 29530, 29223, 28868, 28484, 28087, 27688, 27292, 26902, 26528, 26184, 25871, 25564, 25237, 24885, 24527, 24193, 23909, 23679, 23475, 23256, 23017, 22796, 22630, 22504, 22365, 22190, 22005, 21848, 21724, 21598, 21446, 21287, 21165, 21103, 21070, 21022, 20946, 20876, 20840, 20831, 20825, 20816, 20818, 20833, 20846, 20853, 20863, 20874, 20862, 20818, 20764, 20732, 20720, 20685, 20594, 20461, 20328, 20221, 20134, 20041, 19918, 19753, 19551, 19325, 19086, 18841, 18615, 18438, 18309, 18179, 18005, 17811, 17658, 17552, 17432, 17269, 17112, 17012, 16934, 16820, 16680, 16581, 16530, 16459, 16335, 16215, 16153, 16118, 16052, 15962, 15902, 15882, 15849, 15764, 15659, 15594, 15577, 15553, 15476, 15366, 15284, 15258, 15244, 15193, 15123, 15086, 15085, 15060, 14983, 14895, 14836, 14789, 14726, 14658, 14598, 14522, 14408, 14295, 14229, 14194, 14136, 14058, 14004, 13969, 13904, 13802, 13717, 13672, 13621, 13535, 13448, 13397, 13367, 13333, 13310, 13309, 13299, 13259, 13223, 13225, 13235, 13210, 13171, 13169, 13192, 13192, 13164, 13153, 13169, 13180, 13186, 13229, 13306, 13351, 13332, 13301, 13313, 13344, 13343, 13316, 13312, 13330, 13328, 13300, 13286, 13304, 13311, 13274, 13208, 13151, 13109, 13061, 13004, 12956, 12922, 12883, 12820, 12731, 12635, 12554, 12496, 12465, 12448, 12422, 12360, 12266, 12174, 12114, 12076, 12024, 11955, 11902, 11887, 11887, 11863, 11810, 11760, 11740, 11754, 11781, 11787, 11748, 11677, 11618, 11606, 11625, 11638, 11639, 11647, 11669, 11690, 11699, 11702, 11707, 11718, 11750, 11805, 11860, 11886, 11883, 11878, 11877, 11863, 11844, 11852, 11883, 11891, 11860, 11841, 11859, 11856, 11763, 11618, 11527, 11529, 11561, 11564, 11549, 11549, 11557, 11545, 11519, 11497, 11475, 11442, 11409, 11393, 11386, 11362]
476A1362m4m2l2l2m1l9k3pjmj0j6j9k2k5l4m1l9j2L0N0K2m0p2m5LK6K4K6K8kn4q2o2k9j8k1
471A0663j4KNnrMK4L1Ql7o2m4%J9O%K2M2L0kk1k9l8m3l1j9l4n3l7J6M6K1k6l8j8j1m0o6n1
466A0211j2jk4l9j7J2Pk0k1NPk3m5k3Lok7j9J1J5k0n3n9m0j5NLk6n0k9J3K4j1m9m8j2K5L9
462I691K4j4m2l6pQmj5j7k8n1n3l1j9k8l2pJ7J1omKj2l0k6j9l3n0l9qnk9l8k2rj5j6jQMNJ0
456I034j2n5p1l0J8J5k7n0m2l1k5%L9N3K9j0l3l4j3J8K9nn0n0qRl2p6n5KK7ll0k3rj8l0j5
452H436K0M4M0K3LqmLkj9k0NL0K5%j0qj4k9k6ML4L7J2j4k3qJ8K4%l1k3K2M8J9k6m6m2m2m4
447H408j4M1O9M7Qrqj3k1rJ3Pm0p5n4OM8M3K3K8L6J2l0l9MM3L4LpLml3m8k8nnj3mK0L0J9l
442H483rkOJj4k2j5KQrm2p1o8k4K8L7%l0j3J8Lm2m8%M0K1k0k1J4L1Qk8m8n2m2k1%QNMMlj5
$$ y = [11362, 11318, 11276, 11244, 11212, 11171, 11132, 11109, 11102, 11101, 11097, 11087, 11071, 11052, 11030, 11005, 10971, 10930, 10891, 10879, 10909, 10959, 10981, 10941, 10869, 10824, 10827, 10853, 10877, 10903, 10931, 10929, 10875, 10793, 10731, 10702, 10684, 10663, 10649, 10651, 10656, 10651, 10642, 10646, 10670, 10701, 10709, 10672, 10610, 10566, 10566, 10585, 10591, 10591, 10613, 10655, 10685, 10683, 10662, 10633, 10595, 10552, 10521, 10502, 10468, 10415, 10378, 10394, 10440, 10461, 10435, 10397, 10379, 10368, 10328, 10262, 10211, 10199, 10198, 10174, 10135, 10118, 10130, 10137, 10117, 10096, 10101, 10108, 10085, 10040, 10017, 10020, 10014, 9987, 9968, 9979, 9994, 9974, 9921, 9862, 9822, 9807, 9812, 9815, 9789, 9739, 9710, 9723, 9747, 9736, 9687, 9639, 9627, 9652, 9691, 9715, 9701, 9659, 9623, 9616, 9624, 9620, 9605, 9588, 9560, 9509, 9456, 9425, 9406, 9378, 9346, 9339, 9356, 9367, 9361, 9357, 9359, 9347, 9317, 9291, 9272, 9239, 9189, 9150, 9142, 9137, 9108, 9070, 9048, 9039, 9024, 9008, 9007, 9015, 9019, 9024, 9034, 9022, 8967, 8896, 8866, 8884, 8899, 8872, 8822, 8780, 8749, 8724, 8724, 8763, 8816, 8845, 8835, 8802, 8768, 8755, 8773, 8802, 8797, 8747, 8697, 8689, 8698, 8666, 8590, 8535, 8537, 8564, 8561, 8531, 8508, 8499, 8481, 8451, 8436, 8456, 8500, 8540, 8563, 8566, 8558, 8554, 8557, 8555, 8536, 8516, 8521, 8551, 8576, 8576, 8566, 8558, 8544, 8515, 8489, 8493, 8527, 8564, 8576, 8562, 8539, 8531, 8549, 8573, 8573, 8542, 8519, 8541, 8589, 8608, 8582, 8536, 8494, 8452, 8408, 8394, 8435, 8504, 8551, 8559, 8550, 8542, 8529, 8508, 8499, 8512, 8519, 8479, 8404, 8350, 8356, 8404, 8447, 8470, 8498, 8534, 8546, 8516, 8477, 8481, 8524, 8558, 8561, 8554, 8557, 8553, 8520, 8472, 8444, 8439, 8434, 8421, 8417, 8437, 8467, 8486, 8483, 8474, 8472, 8478, 8479, 8465, 8443, 8428, 8430, 8438, 8429, 8387, 8316, 8248, 8224, 8252, 8289, 8289, 8259, 8246, 8264, 8267, 8225, 8177, 8177, 8217, 8238, 8218, 8197, 8211, 8242, 8250, 8222, 8174, 8122, 8080, 8059, 8059, 8067, 8072, 8076, 8080, 8077, 8062]
437H062j9j1LJ7J7jk6l1k6l7o5o0KO1M8j4m8l2k0l1k4J7K8j5n5k8K8L6kk0pol3m2k0rl0m2
432G565j6Pj8o0n6jM2M0K4K2L0K3Mqj2j7k0j3pj2k3k1j2j2l1m7l8j5nqoOMk7o6p2k9L8Q1O7
427G301Lo9r6p7m8m0l5j1K1K4Kj3j2j2k6l0rJ3Oj9l7l4k1LK5K5jk0rRqm0l3J2L6mo0o9k8J2
422F631J5j2m2n0k9J0K7Ok8m0l2l0k4J0N4N6Ql3k1J4J5j5k9nK6L0J5mk1l3k9qPNKQJ3PlKQ
417F481Jj7j5LJ1jj3j3pj0rJJ2J8K2K6J5j6l9l2kK2L3M0L9J4k2l4qK3K3%j1lNK%LN%%Oml3
412F516n9m2PL8J9k0l5j7NJ8K3K2Qj3k4j7nOJ6K0J1noJ6L5K9Oj3j9j6kJ4K2J8J3Nj9m2l0J0
407F493K6Jj3K4O4M7%%L9L8k0n8k5L3O0N8N2K8j9m6k5RJ7K0M7O5K6l9o0k9NK3L9N9O1M8M4
402G092M5K4j0j8LJ7Mj7k0jL1N5M2j1m3mO7Q7M5J2J3Mk6k8K4O5M5%j1jjML9P8P5L9J5K4M2
$$ y = [8062, 8043, 8032, 8035, 8052, 8069, 8068, 8042, 8011, 7985, 7948, 7883, 7823, 7825, 7886, 7934, 7920, 7872, 7840, 7820, 7789, 7765, 7782, 7810, 7795, 7740, 7712, 7740, 7776, 7774, 7754, 7747, 7741, 7708, 7666, 7646, 7637, 7607, 7565, 7549, 7556, 7538, 7478, 7422, 7421, 7463, 7503, 7527, 7549, 7579, 7602, 7606, 7598, 7586, 7569, 7549, 7536, 7529, 7517, 7494, 7473, 7461, 7449, 7418, 7371, 7333, 7318, 7313, 7305, 7299, 7305, 7309, 7282, 7216, 7144, 7115, 7153, 7234, 7301, 7304, 7235, 7139, 7062, 7014, 6974, 6939, 6928, 6949, 6973, 6975, 6962, 6950, 6938, 6912, 6882, 6873, 6886, 6892, 6873, 6836, 6802, 6781, 6784, 6809, 6834, 6833, 6813, 6804, 6813, 6805, 6765, 6732, 6744, 6780, 6776, 6716, 6647, 6619, 6631, 6646, 6634, 6592, 6542, 6513, 6523, 6550, 6556, 6528, 6488, 6456, 6426, 6402, 6412, 6466, 6522, 6530, 6497, 6476, 6490, 6505, 6490, 6461, 6456, 6482, 6512, 6527, 6523, 6502, 6469, 6440, 6432, 6439, 6444, 6446, 6454, 6467, 6474, 6471, 6473, 6481, 6482, 6465, 6450, 6453, 6464, 6463, 6450, 6437, 6430, 6420, 6411, 6412, 6424, 6442, 6464, 6490, 6505, 6489, 6450, 6418, 6416, 6438, 6471, 6511, 6550, 6564, 6542, 6508, 6500, 6523, 6546, 6546, 6535, 6532, 6537, 6539, 6539, 6542, 6547, 6547, 6547, 6553, 6549, 6516, 6457, 6415, 6422, 6460, 6479, 6459, 6424, 6407, 6412, 6430, 6453, 6475, 6483, 6470, 6446, 6429, 6424, 6430, 6446, 6466, 6477, 6472, 6466, 6482, 6517, 6546, 6552, 6539, 6520, 6504, 6502, 6516, 6538, 6556, 6569, 6574, 6555, 6513, 6483, 6493, 6519, 6520, 6507, 6531, 6595, 6642, 6642, 6642, 6681, 6719, 6699, 6641, 6616, 6649, 6709, 6767, 6819, 6847, 6828, 6782, 6757, 6766, 6783, 6803, 6850, 6915, 6941, 6902, 6842, 6813, 6818, 6841, 6880, 6939, 7000, 7048, 7092, 7137, 7161, 7151, 7133, 7136, 7153, 7157, 7140, 7120, 7119, 7150, 7205, 7247, 7236, 7193, 7189, 7256, 7343, 7388, 7400, 7413, 7417, 7391, 7363, 7387, 7452, 7497, 7497, 7486, 7485, 7484, 7488, 7527, 7605, 7680, 7719, 7734, 7758, 7800]
398G800N3N1K6poL5O8N0K0K9N1L3j2j8K2N0M9N5P7P3L8J5K8L3Jk5lL3L3KpJ7L0Pk0pL4M9J4
393H771l6l7RL8J4j9lL9L7j9n7k8K5M9M6M2L8J6j0j6NL1M7L2j4n8m7K1Q0P3K8PL0N7N2K0j7
388I246l2qL6N8L2j4l1j6J2L4M5L8Ok1j3J5K3NoMJ6OqJK5M2L6J3oj0mk%J3K5J5j4k5rMpj3
383I511J3M6M9K8K9M7N3M2M1M4K5rj6MNj9k3MJ8ok8nL7N0L9L4L5K9K8M1L9RpL6R5R6N4L9O3
378A0570O3J1k7PO7P9M7L1N1P6P6O3N1M4M9P9J12J16Q2N0O0R9J19R6O0O1J09J54J50J12R9
375A2816J33J63J40R5R1J37J75J71J52J57J70J60J44J47J63J62J46J55J91K19K12J93J82J72
372A6646J47J29J37J49J37J18J33J79K06J87J54J46J58J60J52J51J59J57J35J00P5P6J05J50
369B0046J89J99J87J74J74J79J74J64J62J81K09K19K06J90K02K37K61K53K34K43K84L18L03
$$ y = [7800, 7853, 7904, 7930, 7923, 7917, 7952, 8020, 8070, 8090, 8119, 8170, 8203, 8191, 8173, 8195, 8245, 8294, 8349, 8426, 8499, 8537, 8552, 8580, 8613, 8614, 8589, 8586, 8619, 8652, 8654, 8647, 8664, 8694, 8701, 8681, 8674, 8708, 8757, 8771, 8735, 8698, 8707, 8745, 8759, 8740, 8737, 8776, 8813, 8794, 8737, 8709, 8734, 8783, 8829, 8871, 8909, 8925, 8915, 8899, 8904, 8935, 8982, 9014, 9000, 8942, 8895, 8916, 8996, 9069, 9097, 9104, 9134, 9191, 9243, 9263, 9246, 9214, 9206, 9242, 9300, 9332, 9318, 9287, 9271, 9283, 9317, 9362, 9400, 9406, 9385, 9372, 9387, 9410, 9415, 9409, 9413, 9429, 9435, 9427, 9428, 9453, 9495, 9531, 9544, 9538, 9528, 9524, 9522, 9522, 9535, 9560, 9575, 9561, 9536, 9527, 9531, 9524, 9511, 9524, 9570, 9619, 9647, 9676, 9723, 9776, 9818, 9859, 9903, 9928, 9919, 9903, 9907, 9912, 9893, 9870, 9874, 9892, 9886, 9858, 9853, 9890, 9940, 9979, 10013, 10048, 10077, 10105, 10146, 10185, 10194, 10187, 10223, 10318, 10414, 10468, 10507, 10570, 10633, 10644, 10617, 10624, 10691, 10770, 10817, 10848, 10899, 10975, 11051, 11114, 11165, 11209, 11258, 11337, 11449, 11565, 11647, 11697, 11757, 11856, 11975, 12071, 12131, 12192, 12301, 12455, 12605, 12717, 12816, 12949, 13112, 13252, 13347, 13438, 13575, 13750, 13921, 14073, 14230, 14400, 14560, 14704, 14851, 15014, 15176, 15322, 15477, 15668, 15887, 16099, 16292, 16474, 16646, 16793, 16922, 17059, 17208, 17345, 17463, 17596, 17775, 17981, 18168, 18322, 18468, 18626, 18786, 18938, 19089, 19248, 19405, 19540, 19640, 19715, 19791, 19896, 20046, 20235, 20434, 20621, 20795, 20969, 21148, 21322, 21486, 21648, 21829, 22038, 22257, 22463, 22653, 22855, 23092, 23353, 23606, 23840, 24083, 24367, 24685, 24988]
366B4988K58K40K80L36L36K73K21K42L00L12K66K21K29K55K47K12J97K11K12J78J38J40J74
363C0466J94J65J10P5Q0R5Q7O2N9Q7J09R5P1P0Q6Q1M1pl1k7oJ7K2J5QJ3Qk3n7n6k4QL4N0M2
359C2019lm4j7N6Q9N1QK2O1P1N8O1O7M6L1P0J31J31O8K0L3N6M6L5O7J02R4N5L7L9K7NMJ5o
354C3605n3p2m2j5m7j19j64j46r4n7o7j11j60j94k12k23k19j96j67j60j81k03k06k03k06k13
351B9875k12k09k00j75j33j04j18j60j86j75j51j50j65j68j44j18j12j20j18j00r1r9j12j02
348B6453q5q4r6r1o3m2n1p2p9p2o9o2l9k3n0j19j75j68j12o4p3j36k07k31j94j40j24j53j86
345B3393j88j68j55j57j73j89k01j96j86j90k11k14j67r9q0j31j96k08j73j47j58j79j83j82
342A9262j89j90j63j31j38j78j95j69j38j46j77j82j56j23j03r6j14j49j70j47j06r9j21j17
$$ y = [24988, 25246, 25486, 25766, 26102, 26438, 26711, 26932, 27174, 27474, 27786, 28052, 28273, 28502, 28757, 29004, 29216, 29413, 29624, 29836, 30014, 30152, 30292, 30466, 30660, 30825, 30935, 31010, 31090, 31185, 31272, 31334, 31393, 31480, 31589, 31684, 31755, 31825, 31911, 31992, 32033, 32026, 31995, 31968, 31962, 31979, 32001, 32016, 32024, 32037, 32045, 32022, 31965, 31909, 31885, 31893, 31927, 31977, 32019, 32016, 31972, 31955, 32011, 32100, 32151, 32159, 32181, 32242, 32313, 32371, 32432, 32499, 32545, 32576, 32646, 32777, 32908, 32976, 32996, 33029, 33085, 33131, 33166, 33233, 33335, 33429, 33484, 33521, 33560, 33587, 33592, 33596, 33611, 33605, 33552, 33480, 33438, 33423, 33376, 33257, 33093, 32947, 32853, 32796, 32729, 32618, 32458, 32264, 32052, 31829, 31610, 31414, 31247, 31087, 30906, 30703, 30497, 30294, 30088, 29875, 29663, 29454, 29254, 29079, 28946, 28842, 28724, 28564, 28378, 28203, 28052, 27902, 27737, 27569, 27425, 27307, 27195, 27075, 26957, 26857, 26766, 26667, 26555, 26453, 26368, 26284, 26188, 26097, 26034, 25992, 25941, 25869, 25790, 25718, 25649, 25587, 25548, 25525, 25475, 25356, 25181, 25013, 24901, 24837, 24764, 24628, 24421, 24190, 23996, 23856, 23732, 23579, 23393, 23205, 23037, 22882, 22725, 22552, 22363, 22162, 21966, 21780, 21590, 21379, 21165, 20998, 20899, 20819, 20688, 20492, 20284, 20111, 19964, 19806, 19627, 19444, 19262, 19073, 18883, 18720, 18589, 18451, 18273, 18078, 17909, 17771, 17625, 17448, 17266, 17110, 16987, 16884, 16788, 16674, 16525, 16355, 16208, 16102, 16003, 15882, 15765]
339A5765p0k3k3n2p7r4j07r9o5l8n2q4q4m9k3l2o0q2r2r8r1p6o9p0o2l4j2j8n4r1r8p7n3m8
335A3608n7o2o0o5p2o0l1k8p6j20r7k4J7om5n6n5p1q5p1m4m0n9o0l3lJk3o0r7j15j08q3n5
331A1705m2m7o9r2r2p0n2n9p8p3m2k7m7q5j10j15j10r5o7l9l9p2j12j16q0m1l4n4p3q2r2r9
327I400p9m1k5n6q9p3k2jl3o8o2l7k9l0j1Qon0p3n2k0j0j7k1k9m4m9k6QJ3j7n0o7o6n1k1K
322H106j1n4q3p4m0j1Ljk7n6n4k0%k0m6m1k2k9o3p7o2m7m8m5k5j5k7m1m3m1m1l4k0j8l9n2
318F782l7k3m1q0r4n4QM7L5j6n8n7k4Jmj8j8rqqlrl8o5n6j8QJk8n8p5o3j9L1M7J2l5n1k6j
313E878j2n3p6n5j5%j4j9kJ2Prk6m9o7n5k1j5n0o7l4Kj7n8n4nJ8j0m1m6l6l4k3kRN%%j3l1
308D922k3J3L4Pm3p9q3o2l0mLjok0m8n5j0N2N6nn3m1pnk2j6JKj3k2l0m6n9m8k2JJ8J7j1m7
$$ y = [15765, 15695, 15672, 15649, 15597, 15520, 15426, 15319, 15220, 15155, 15117, 15065, 14981, 14897, 14848, 14825, 14793, 14733, 14651, 14559, 14461, 14370, 14294, 14225, 14155, 14093, 14059, 14047, 14029, 13975, 13884, 13786, 13709, 13656, 13608, 13551, 13489, 13429, 13364, 13292, 13232, 13201, 13173, 13097, 12977, 12880, 12856, 12873, 12867, 12822, 12766, 12711, 12640, 12555, 12484, 12440, 12400, 12341, 12281, 12248, 12245, 12246, 12223, 12163, 12066, 11951, 11843, 11760, 11705, 11663, 11616, 11547, 11455, 11363, 11293, 11241, 11182, 11104, 11031, 10989, 10962, 10915, 10830, 10720, 10605, 10495, 10400, 10333, 10294, 10255, 10183, 10071, 9955, 9875, 9834, 9800, 9746, 9673, 9591, 9499, 9400, 9321, 9280, 9255, 9199, 9110, 9037, 9015, 9014, 8981, 8913, 8851, 8814, 8785, 8755, 8744, 8752, 8746, 8696, 8623, 8571, 8551, 8541, 8524, 8503, 8474, 8430, 8381, 8355, 8363, 8376, 8359, 8309, 8242, 8176, 8125, 8104, 8106, 8095, 8041, 7958, 7884, 7844, 7833, 7836, 7835, 7808, 7752, 7698, 7678, 7678, 7658, 7612, 7571, 7549, 7520, 7457, 7380, 7318, 7271, 7223, 7178, 7153, 7138, 7111, 7070, 7027, 6986, 6945, 6911, 6891, 6873, 6834, 6782, 6745, 6722, 6681, 6601, 6507, 6453, 6461, 6508, 6543, 6527, 6469, 6412, 6388, 6389, 6385, 6367, 6349, 6340, 6332, 6324, 6321, 6312, 6274, 6209, 6153, 6135, 6143, 6144, 6116, 6058, 5983, 5920, 5901, 5932, 5979, 5991, 5956, 5905, 5879, 5878, 5866, 5813, 5737, 5682, 5667, 5667, 5653, 5634, 5632, 5644, 5651, 5642, 5616, 5567, 5500, 5445, 5424, 5409, 5359, 5292, 5258, 5260, 5243, 5185, 5131, 5126, 5144, 5134, 5093, 5047, 5011, 4977, 4954, 4952, 4961, 4966, 4966, 4966, 4953, 4922, 4899, 4912, 4946, 4953, 4910, 4831, 4748, 4686, 4656, 4652, 4655, 4654, 4648, 4628, 4580, 4525, 4515, 4567, 4623, 4618, 4565, 4524, 4517, 4512, 4490, 4474, 4475, 4477, 4464, 4442, 4412, 4366, 4307, 4259, 4237, 4238, 4256, 4273, 4262, 4215]
303D215m0J3L6on1k9J8Qm7o4l2k4n6o2qL6J5k4j5K1J6j9k2J6K8k2q0p4k0J2mk8rL4M7J6rl
298C783Rj1m5m9j3J2jk7k7mNk2n7n9l2j2j6j3K8P0M9k8q0m7K1M0Ll2m0m4m7k6K2M4J3m4p2
294C251n1mL4M0J8lj3k1m0n1m1l1l7l0J8O2M2k7n8k9ql7n6j4M9N8J5j2lQok7k8j5mj3l3m0
289B863mM8N3j0p8p6j7K8J1l0m5k7%Rol1l6j3J5K1PlJNmj7k6j9lJ2J0%j1j8l3m5l2MK3Nk0
284B511k2qj3k7j7J9N0N7M4J4k5n4m9k3j8l7m9k9kjk8m8m1j2J4J7mj9kL4M5J8j5j6LNk2m2
280B208j7L3N7K9j5k7j1kk0k7pK0J1k3m3l2j0K%qk1m0n5n0j9K5N7O2L7Jk6l0%L6L9pn2m6j2
275B017ok7j6K7L4j9o0k5L0L7J0J1L0J3k9l9j6j8m6m3J2O5P4N2K1j8n3n2k4j0j4ML9M7J9O
270B033J7Rl2n3k0J6J9J4L4M9L7J7lm4r1p6OO1K6j6J3N7J7o7q2k8%k8l2J0K6j8n4k6K2K4r
$$ y = [4215, 4175, 4188, 4224, 4218, 4167, 4138, 4156, 4164, 4117, 4053, 4021, 3997, 3941, 3879, 3871, 3907, 3922, 3898, 3883, 3904, 3920, 3901, 3879, 3895, 3923, 3901, 3821, 3747, 3727, 3739, 3735, 3707, 3698, 3732, 3779, 3795, 3786, 3783, 3792, 3781, 3736, 3687, 3674, 3686, 3685, 3658, 3631, 3627, 3632, 3610, 3553, 3494, 3462, 3450, 3434, 3421, 3449, 3519, 3568, 3540, 3460, 3413, 3434, 3474, 3477, 3445, 3405, 3361, 3314, 3288, 3310, 3354, 3367, 3323, 3251, 3200, 3196, 3230, 3270, 3288, 3285, 3272, 3251, 3211, 3160, 3119, 3088, 3051, 3021, 3039, 3101, 3143, 3116, 3058, 3029, 3021, 2984, 2928, 2914, 2963, 3021, 3036, 3024, 3021, 3029, 3023, 2996, 2968, 2953, 2949, 2936, 2903, 2863, 2859, 2907, 2960, 2950, 2872, 2796, 2779, 2807, 2818, 2788, 2743, 2716, 2716, 2725, 2719, 2688, 2652, 2639, 2654, 2675, 2682, 2679, 2680, 2685, 2681, 2664, 2638, 2619, 2616, 2628, 2638, 2638, 2627, 2609, 2576, 2531, 2499, 2503, 2526, 2531, 2511, 2489, 2481, 2468, 2441, 2424, 2443, 2493, 2550, 2594, 2608, 2583, 2529, 2480, 2457, 2439, 2402, 2353, 2324, 2322, 2321, 2293, 2245, 2204, 2192, 2206, 2223, 2219, 2200, 2198, 2232, 2277, 2295, 2280, 2264, 2267, 2272, 2250, 2208, 2191, 2224, 2281, 2310, 2295, 2268, 2257, 2255, 2235, 2208, 2201, 2221, 2232, 2209, 2166, 2134, 2124, 2126, 2126, 2118, 2097, 2057, 2002, 1952, 1933, 1958, 2015, 2077, 2114, 2115, 2089, 2059, 2059, 2095, 2134, 2127, 2075, 2029, 2017, 2011, 1984, 1968, 1995, 2029, 2010, 1950, 1925, 1955, 1992, 2002, 2013, 2043, 2056, 2027, 1988, 1972, 1954, 1908, 1865, 1877, 1942, 2016, 2068, 2089, 2071, 2018, 1966, 1942, 1932, 1918, 1922, 1961, 2008, 2027, 2033, 2050, 2059, 2027, 1974, 1954, 1970, 1989, 2003, 2037, 2086, 2123, 2140, 2137, 2093, 2002, 1926, 1932, 1993, 2019, 2003, 2016, 2073, 2090, 2023, 1941, 1913, 1913, 1885, 1853, 1863, 1889, 1871, 1817, 1791, 1813, 1837, 1828]
266A828l4l1oL0N3K5l2n7k6J2K1K6M1M2Ll6k8PK3Nj8k7j8oj0m0o6m6MK5LrK9O6M9ll7m6m3
261A673k3J0J8k6o2k4M9O3Ol4rK2%m2l6J4M3K6nj4qmMJ6J2k3o4o2j1L6L4NOL7L5k3p0l0N6
256A595Q7K9m2n7l2k2k6j4Lmk6j2M0O5K3l7m6lL3K9Pj7m5n7k3L5M5j2o8o0k7k3l1MO2O9K4
252A466lJ1Pl6o2k6K2K4JkJ0Kj3j2PJ9K0J3j4n0n5rL8L5Kj3j2j7j9NL5L4J1jql3m7j6L5M0
247A389Nk1l0o1r1n1M5R2M8j2j3J6J5kPK4J7ok1m3p5q2l3K2L6K4K5K4j0m4k2L1M5Rk0j7j2
242A208j1NL2K3j4k5PK8Rj4kRj7m7k7K4L6Lk1nQj1l1qM1N1Ql3k4J1J9ok4qJ4J5ML%j9l7k5
237A149KMk0l0qJ1LrJK3K9J2j1k7l5l2j4%jj4j6ML2M6K5j3l3j9M%k1j2L0O1L5k8p1p5n6l4
232H92pL2O2N9K0j4mM3O2J3o0o8mN0L2j7k7JJm0o2j9M3M9nn5n6j9J2J7J0J0J2%j5j3J2L7L8
$$ y = [1828, 1794, 1763, 1757, 1787, 1840, 1865, 1833, 1776, 1750, 1762, 1783, 1809, 1850, 1892, 1895, 1859, 1831, 1838, 1861, 1866, 1848, 1821, 1803, 1797, 1787, 1747, 1681, 1635, 1639, 1664, 1667, 1658, 1687, 1753, 1802, 1799, 1762, 1716, 1673, 1650, 1660, 1678, 1652, 1590, 1566, 1615, 1678, 1684, 1650, 1641, 1663, 1663, 1621, 1585, 1599, 1642, 1668, 1663, 1649, 1641, 1637, 1641, 1657, 1669, 1646, 1582, 1520, 1509, 1545, 1579, 1584, 1590, 1627, 1662, 1639, 1569, 1539, 1595, 1682, 1711, 1669, 1612, 1580, 1558, 1532, 1518, 1521, 1517, 1491, 1479, 1519, 1584, 1607, 1570, 1524, 1521, 1554, 1583, 1590, 1573, 1528, 1471, 1448, 1483, 1528, 1516, 1448, 1388, 1361, 1338, 1307, 1311, 1373, 1442, 1466, 1463, 1474, 1481, 1445, 1383, 1357, 1379, 1403, 1404, 1402, 1412, 1414, 1401, 1389, 1396, 1415, 1435, 1448, 1434, 1384, 1329, 1320, 1358, 1393, 1395, 1382, 1370, 1353, 1334, 1339, 1374, 1408, 1419, 1418, 1410, 1377, 1330, 1314, 1349, 1389, 1394, 1373, 1343, 1282, 1191, 1140, 1185, 1277, 1325, 1313, 1300, 1316, 1331, 1329, 1336, 1360, 1377, 1371, 1350, 1307, 1232, 1150, 1117, 1139, 1175, 1199, 1224, 1248, 1238, 1194, 1172, 1203, 1248, 1257, 1237, 1220, 1208, 1197, 1202, 1234, 1257, 1243, 1218, 1225, 1253, 1262, 1248, 1246, 1255, 1238, 1191, 1164, 1188, 1224, 1227, 1206, 1201, 1209, 1198, 1167, 1159, 1200, 1251, 1259, 1226, 1202, 1213, 1232, 1226, 1202, 1194, 1208, 1223, 1227, 1230, 1230, 1211, 1174, 1149, 1151, 1155, 1135, 1105, 1097, 1108, 1111, 1102, 1103, 1126, 1155, 1167, 1156, 1129, 1094, 1062, 1048, 1048, 1047, 1033, 1017, 1021, 1053, 1099, 1124, 1111, 1078, 1059, 1063, 1063, 1042, 1030, 1060, 1121, 1156, 1128, 1057, 982, 926, 892, 885, 917, 979, 1038, 1058, 1044, 1040, 1083, 1145, 1158, 1098, 1030, 1026, 1076, 1108, 1091, 1064, 1065, 1066, 1026, 964, 945, 988, 1037, 1032, 977, 921, 902, 914, 931, 941, 951, 963, 963, 948, 935, 947, 984, 1022]
228A022K2J2Oj9n6o9l9J5M7M0Ml8o0m0J1N1M3Jk6nL3L4j1m8k9K4M3Ok6kM6M7rn5m2j1j6m3
223H63l6J3M7L3PJ4L6K3k5m8k1J5J8nj3lok7l6j4J2J3OJ6L4L0Jk3k2nNJ1J0mk1j8RL2J8j4
218I25k2JJ2j3m4l5J5O4P1M4Lm1p0o3j6K9K4rqL2M1j9q0n3K9O1Rm0k0K0Lm5m8%L1J1j2%K1
213H08K2K1L5L7oo0n5RO0M0k7p2o0rM1O0M8J9oj7k0k2k4j7jJ3K1K5K1km1n8k3M3P8N5J3p%
209I42jj1j3oqk3k9j3RJ9K2K2Lk5l6j1J4J4J0L0N4L1l2p1m6OJ8k1n9m7J2O2O3K9LLLj7l1j2
204H57J3kl7l5J0L1lm6l9QM0L6J1j9l2j2K9L9mm7l9%J2JOK9K5nj3J0K2ll1l4k6k2oK1J8k4
199G39m5oN2O1L0QOpl1l3pK3L9M6L6mm8n7l0mLJ4L1K8jk1j8j2k0j5J7L7J5j9k6rnqPL1K5j4
194H08m3m4l3k2PN4P3L5k6m9k0J4K7L1M2L3rm8l6NJ8qk1RL6J5j9j0K5J8l1n6k7Kj2l4j3K9
$$ y = [1022, 1044, 1056, 1062, 1043, 987, 918, 879, 894, 941, 981, 985, 947, 887, 847, 858, 909, 952, 953, 927, 922, 955, 989, 978, 930, 901, 925, 968, 974, 948, 946, 992, 1039, 1030, 975, 933, 922, 906, 863, 827, 840, 887, 920, 927, 941, 977, 1000, 975, 927, 906, 921, 939, 934, 921, 918, 912, 885, 849, 835, 847, 860, 866, 882, 916, 946, 947, 924, 902, 897, 902, 913, 923, 919, 898, 880, 889, 921, 939, 925, 903, 904, 916, 903, 859, 824, 839, 903, 974, 1018, 1021, 980, 910, 847, 831, 860, 884, 875, 867, 899, 940, 921, 841, 788, 817, 878, 887, 847, 827, 847, 850, 805, 757, 757, 788, 799, 787, 787, 808, 830, 851, 886, 923, 917, 857, 802, 811, 871, 911, 884, 812, 752, 743, 784, 844, 892, 911, 905, 888, 868, 846, 822, 805, 804, 817, 838, 863, 884, 882, 841, 783, 760, 803, 881, 936, 949, 942, 942, 941, 930, 917, 911, 903, 880, 851, 838, 847, 866, 888, 910, 913, 888, 852, 841, 855, 869, 879, 909, 963, 994, 962, 891, 845, 851, 869, 848, 789, 742, 754, 816, 879, 908, 911, 914, 917, 900, 869, 857, 870, 868, 831, 796, 806, 837, 834, 788, 749, 757, 797, 833, 844, 825, 793, 781, 810, 849, 845, 798, 759, 759, 771, 772, 778, 807, 832, 827, 814, 824, 846, 843, 812, 778, 752, 730, 724, 745, 763, 739, 694, 688, 740, 801, 831, 839, 845, 838, 807, 774, 767, 790, 829, 875, 911, 907, 859, 802, 772, 768, 771, 785, 816, 844, 843, 822, 804, 792, 772, 757, 774, 811, 826, 807, 781, 772, 767, 759, 766, 797, 822, 808, 765, 721, 688, 666, 673, 727, 800, 835, 809, 760, 740, 754, 781, 812, 854, 887, 878, 830, 794, 799, 817, 809, 788, 797, 833, 848, 829, 819, 844, 862, 831, 775, 748, 750, 738, 704, 691, 720]
189G20L4ol6j9K1L9J8j6k6lJ5nm2m4jK7Pk3mL8M3J3jJ5J6j5l7k9j5k0k8j2OPMJ6L2L2J7Kj1
184G29k3k3j3j6l3l1LK3ml7j8L9N1Jn0l6J8N0L5Onmnj3rJ5M1M2J4j4k1j8k7l7l2j1OJ0J5K6
179F44L1K0kl0n8n9k0L1N0L4K1L0L0Lk6k8mJ6K2J2j0l2k8%J7Mj6j4Jjj4j4%kk4m7n1l2J3O4
174E31P8K9l4m7j8j0l8m6lM7N6M0L7L0pm1l0QRl2n1j3L5M0Rj0%J7J9%j9k0JK0J6qk3j2PJ0
169E77ok9m6m6k0J8L7K1jkJ5K7K4J5Mqj5rKM%jJ0K4L7M3L8J6j4l4m2n1p0q1o5j3M9P5M6Jo
164E24K2K8j1l3ON5L3l2m7LK9j7o0k1M6M5k0n7k3K4L2Rrj1lRJ1mj2RL4K4nj2OJl3l6J0M0L
159E57n2n2kK3QkJ6L0J4n%J3Kk4l7j9MOj9l9k1K0L9J5j1nJ6Nk8l9rK2K6K4K3Ll4n0k1K0K5
154D42J7L1N5L8k2o6n5j8JjPM0O7O5L3ql7m8m5l2j4LMmnJ4L6L1nm8o7m5MM7N5K4pj0J1J5p
$$ y = [720, 754, 748, 712, 693, 714, 753, 771, 755, 729, 726, 741, 736, 694, 650, 649, 676, 683, 660, 656, 694, 737, 750, 749, 764, 780, 765, 728, 699, 684, 664, 636, 624, 630, 637, 641, 657, 689, 721, 738, 740, 729, 706, 683, 670, 654, 621, 590, 593, 616, 612, 575, 557, 596, 647, 648, 598, 562, 580, 630, 665, 671, 666, 662, 657, 644, 635, 650, 691, 733, 747, 733, 712, 694, 667, 630, 598, 587, 593, 603, 618, 644, 675, 695, 693, 663, 605, 546, 526, 557, 607, 641, 662, 692, 722, 725, 699, 671, 667, 683, 705, 717, 707, 675, 647, 647, 664, 668, 652, 638, 639, 638, 624, 610, 610, 608, 584, 537, 486, 454, 467, 531, 609, 638, 604, 557, 539, 529, 491, 445, 442, 489, 545, 585, 622, 652, 645, 604, 574, 582, 591, 559, 508, 495, 530, 570, 579, 569, 569, 586, 605, 605, 586, 566, 567, 587, 603, 595, 572, 560, 567, 577, 571, 542, 496, 450, 430, 448, 485, 506, 505, 503, 518, 545, 569, 584, 588, 580, 565, 556, 558, 562, 562, 561, 571, 595, 632, 675, 713, 729, 715, 681, 639, 588, 518, 437, 372, 359, 408, 483, 529, 530, 524, 546, 574, 563, 530, 536, 591, 624, 592, 545, 548, 577, 560, 500, 479, 525, 570, 550, 493, 470, 494, 526, 535, 526, 515, 512, 521, 532, 528, 516, 525, 559, 583, 578, 566, 572, 573, 540, 504, 514, 554, 557, 505, 453, 451, 474, 482, 480, 496, 526, 540, 535, 535, 548, 550, 526, 489, 470, 474, 480, 461, 422, 401, 421, 460, 475, 464, 459, 475, 480, 452, 413, 404, 426, 452, 476, 499, 502, 468, 418, 397, 417, 442, 459, 490, 545, 583, 561, 495, 440, 422, 423, 422, 429, 469, 536, 601, 634, 626, 589, 541, 496, 464, 450, 453, 457, 453, 448, 462, 498, 529, 524, 476, 409, 364, 368, 415, 470, 494, 487, 477, 488, 503, 496]
149D96k4qJ5J3j5l1k0KJ4J6J5Lj9l6k4J1L7L5Nk6l7j5K3M7L6PmOMl0o3n1rJ4nk8k0QK1J1p
144C67j8j2J0M1N7L9Mj7j5lJnk4m7n1k5QK1J5K2L4K2j6l6k0JnqJ8M9L5j3k6J1M4K0l6o1l7
140C44KJ5jk5l1j7%MPK8N7O3M0J1Kok6m8m0qJ6J2kmJ6M0M4K5kj2j0j7l4l1JK2qn7o2j7K2J2
134C25k0k4nOnj7j3PL7O1N5K0qLL0L0pl2j7K0L6J4k6n3n0k1J2K0Rnj1j4j4rlqk0k3j4pnMK6
129B84L9K5LMJ9K1jl0n2n8l6RN5O3L5PJ4L9M1J0k3k4%J1ok7rL9O1K2m2p6o4l7k2j3NK2K0%
124C28k5l3j3K0L4J8%NJ4nl8l5J2N1L9jk6l2m0l9j0L0M2K0llRJ0jk3l6k0L3Q5Q4K5l1m2k7
119C76k4l2k7q%kOL0M3L4K3K4K0j0n3p1m8j1L%NL2M9L7J2jnk0l4j0M9P9L3n2q7n0jOj8k1%
114B76J3NKJ6K7J3mMK8L3Jl3l2%K9K6kk6k1RK6Ol3m7j9J5J7j1k9j8PJ5Kj4j5KK0J9Jj7j2J0
$$ y = [496, 472, 464, 479, 492, 477, 446, 426, 428, 442, 458, 473, 476, 457, 421, 397, 408, 445, 480, 485, 459, 422, 407, 430, 477, 513, 520, 516, 522, 526, 496, 433, 382, 373, 387, 382, 354, 334, 342, 363, 374, 367, 349, 337, 347, 388, 445, 484, 488, 471, 456, 453, 454, 449, 425, 378, 327, 302, 310, 331, 346, 368, 402, 424, 408, 372, 352, 353, 348, 340, 358, 407, 442, 429, 403, 414, 458, 478, 442, 381, 344, 346, 361, 360, 335, 304, 287, 287, 291, 298, 326, 383, 446, 486, 497, 499, 493, 467, 419, 379, 371, 387, 399, 397, 393, 409, 449, 493, 518, 516, 504, 494, 477, 443, 412, 413, 435, 427, 370, 308, 291, 313, 325, 305, 281, 276, 282, 277, 260, 247, 254, 291, 352, 407, 427, 419, 422, 452, 482, 475, 443, 426, 446, 482, 496, 470, 417, 367, 346, 358, 378, 387, 382, 371, 357, 343, 334, 331, 323, 303, 280, 266, 259, 254, 258, 284, 323, 348, 351, 355, 374, 395, 394, 364, 312, 254, 218, 227, 282, 345, 380, 387, 401, 440, 481, 491, 468, 444, 444, 455, 449, 422, 413, 452, 513, 535, 493, 417, 353, 316, 294, 281, 286, 308, 328, 328, 303, 270, 257, 277, 311, 329, 329, 334, 348, 343, 305, 270, 282, 333, 372, 371, 345, 313, 273, 234, 224, 254, 296, 316, 313, 310, 319, 329, 328, 305, 269, 249, 282, 367, 451, 476, 445, 403, 376, 352, 320, 293, 285, 285, 283, 289, 319, 362, 396, 419, 443, 463, 453, 400, 329, 281, 270, 273, 273, 278, 310, 359, 396, 408, 407, 402, 382, 348, 338, 387, 466, 499, 447, 360, 310, 309, 315, 297, 276, 276, 289, 294, 296, 312, 339, 352, 348, 352, 380, 413, 414, 381, 349, 349, 378, 404, 402, 376, 355, 364, 390, 396, 363, 316, 297, 312, 329, 318, 289, 271, 278, 293, 295, 281, 266, 268, 288, 307, 308, 291, 279, 289]
109B89L0L4K7J7Nkj0k0l3m0k4J2M5N5L1j3n5o9n0oL5N2L5pm6m7qK0Mk9k7QK7J4PK6M3K4np
104C42J2K3K3K6K0j2m5m8j5J3J9J5Nj3k3j0J1Ll3m8j9J9L1J9QJ1J5K1K0Nj6k2j0Llj2j1qj4
100C02k2j9j1JK0L7K9%j3RM0M7L5J8qm5n5j8K8L2NlKj7m9l5L0O7K8l9n5k2Nlj5nJ4J4j4m6
95B69m8qM6O8M1ok6lL8N1J3m5o3j8L9L9qk7%J5j8m5j4L6K6k6l3K7O4K4l6l5J1K0k2m9k3J8
90B92K6RQK7L0Lk9m2l4j2K0M3L3rl9k7LMk2l7k0J0L2M9N5K9k0n4m7j9m%P%k2k8J2P0Q8N5O
85D46j7j7rjkj6k6j6OOk0l6k2QK8L1K8K4J5kj5j5KJ7J2j4l0k1%J1J1Pqk6k9qjk8m3JO9P3j
80C72o6o2j6J7K8L9L7J2k1l3k8j6kJ3J1lpOKk8m0oL5L4RPK7K3kj1OQrj3QK3Mk9m0k8nJ6K3
75B95Pj3k1j2pmJ5L4J6l5o1k6L3N5L5OJJ5K7K0j6n6o8m1qmj6j3J5M3M5J7j8k5KM3N9L5j1m8
$$ y = [289, 319, 353, 380, 397, 402, 400, 390, 370, 337, 297, 273, 285, 330, 385, 416, 403, 348, 279, 229, 223, 258, 310, 345, 338, 292, 245, 237, 257, 261, 232, 205, 213, 240, 254, 261, 287, 330, 354, 349, 342, 354, 377, 400, 426, 446, 434, 389, 341, 326, 339, 358, 373, 378, 365, 342, 332, 343, 346, 313, 265, 246, 265, 296, 315, 323, 334, 349, 370, 390, 395, 379, 357, 347, 350, 347, 335, 324, 316, 302, 280, 261, 250, 251, 271, 308, 337, 337, 324, 333, 373, 420, 455, 473, 465, 420, 365, 347, 375, 407, 412, 409, 411, 394, 345, 310, 340, 407, 435, 396, 341, 319, 324, 321, 306, 301, 315, 329, 315, 269, 221, 213, 259, 327, 368, 362, 336, 333, 371, 422, 435, 390, 327, 309, 348, 387, 379, 352, 352, 367, 349, 304, 290, 326, 352, 326, 293, 320, 384, 408, 372, 337, 348, 368, 346, 297, 274, 292, 318, 327, 335, 362, 392, 395, 366, 324, 290, 278, 298, 341, 374, 365, 326, 299, 302, 306, 284, 247, 227, 237, 269, 318, 373, 402, 382, 328, 281, 262, 258, 258, 265, 265, 243, 215, 227, 297, 385, 440, 446, 429, 412, 403, 402, 400, 384, 358, 342, 348, 354, 334, 298, 276, 284, 312, 343, 371, 395, 410, 408, 393, 378, 380, 397, 409, 395, 365, 344, 344, 355, 366, 373, 365, 339, 310, 302, 301, 273, 230, 231, 300, 373, 372, 306, 244, 228, 245, 273, 312, 349, 361, 340, 307, 279, 263, 261, 274, 285, 282, 275, 281, 283, 255, 215, 209, 244, 278, 287, 294, 321, 344, 342, 331, 337, 345, 336, 323, 331, 354, 358, 329, 289, 261, 256, 272, 295, 302, 289, 268, 256, 249, 245, 260, 294, 310, 275, 214, 188, 221, 276, 311, 317, 318, 333, 360, 380, 364, 308, 240, 199, 191, 187, 171, 158, 173, 216, 261, 278, 260, 235, 237, 280, 339, 374, 363, 315]
70C15m6mL9L6j2l9nM1K4l4m7RN1K3k0j1K6J8k7m3rK4J3j5j8nj2l8m6nM9O4K6j6j7%j0l3k1
65B25K7M7J5k4k5j6k1j8J3L3J0j9lL3K7mjL5M3Pk8m0n4o6m3NJ9JJ7P4R3L0m4n1k1j0j3NK2
60B80ll7j7L6M6Jk8JN2O3K4l3p2o9l3%LkJ6L9K8JJ1M1K6m5q4l1N2O2%m6k2L4N9M3J6mk0k7
55C61j9qj1k4l4k7j7j6j3J2N0O3M0OjJ1J5MjKkk1l5l5k6k1j2RK7J7j6l5j1L0M0J2j4kK1J1
50C30k7m2k1pk2l4lM1N1K6NRJ5K2L9N5L1l0p0n4j8pj9j2J9L5J3k3l8k4j0j4k0LM8O3L4LJ7
46C64M5L2k3n2k8OJ3MMJj3rK5M4Mo0o9k0K7L8L1K8Qk8l9nL5L4%j9mK1K7K0R%j7l8m5j8L0O2
40D25M8Nk5k2rj7m5o5n3j2L5O0O0M4K5jl1n1m7k1J3M2M9K3j7l1j1Oj2l4j5K6K8j2l8k2%qk5
36B65j3K0L8L4K1Nj7l2l2l2l8k9MK9J8j1rJ4K2QOK1J5k9o0l6J9M2K2llKj1k7j7J3L3K6J5J8
$$ y = [315, 269, 265, 304, 340, 328, 289, 284, 325, 349, 315, 268, 277, 328, 351, 331, 320, 346, 364, 337, 294, 285, 309, 322, 307, 289, 284, 272, 234, 188, 183, 232, 296, 322, 306, 289, 289, 279, 246, 225, 252, 299, 314, 290, 265, 249, 228, 210, 223, 256, 266, 247, 244, 277, 304, 300, 299, 334, 377, 384, 356, 316, 262, 196, 153, 158, 177, 178, 195, 269, 362, 392, 348, 297, 276, 266, 253, 258, 280, 277, 240, 223, 259, 305, 306, 278, 279, 331, 394, 418, 385, 313, 244, 211, 211, 214, 212, 228, 267, 295, 296, 307, 348, 374, 329, 245, 214, 266, 328, 328, 282, 260, 294, 353, 396, 412, 408, 388, 361, 342, 334, 323, 299, 265, 238, 221, 205, 192, 204, 254, 317, 357, 363, 362, 373, 388, 392, 391, 393, 391, 370, 335, 300, 274, 253, 241, 250, 277, 294, 278, 243, 232, 262, 302, 314, 300, 298, 319, 330, 303, 261, 240, 233, 211, 177, 174, 215, 266, 292, 297, 306, 321, 343, 382, 437, 468, 438, 368, 314, 296, 289, 270, 258, 277, 312, 325, 302, 264, 240, 230, 216, 196, 199, 247, 310, 344, 347, 364, 409, 441, 418, 366, 338, 344, 357, 361, 365, 366, 353, 344, 369, 413, 417, 357, 288, 268, 295, 333, 364, 392, 400, 372, 333, 328, 363, 397, 397, 378, 374, 395, 422, 442, 451, 451, 434, 396, 351, 333, 363, 425, 473, 478, 453, 431, 422, 405, 360, 295, 242, 230, 265, 325, 385, 429, 454, 453, 422, 371, 324, 303, 316, 358, 407, 430, 413, 382, 371, 377, 365, 331, 316, 342, 370, 358, 320, 298, 298, 290, 265, 252, 272, 310, 344, 365, 370, 353, 321, 289, 257, 219, 190, 194, 223, 241, 230, 221, 235, 257, 265, 271, 292, 307, 278, 218, 182, 201, 243, 265, 262, 259, 261, 250, 223, 206, 219, 252, 278, 293, 311]
31C11J5j7n1l5J6M2J2k0j4ml2o6l7L4O3J9k6j9J3J9J0J1J0j1k6jL6L5Jj3JQpj0J1J5k0n8m9
26A66j1J3QNJ5K1Rrj4o%NNmj9k8pL4O3N5K1nj2j5k6k9j3J0J6ONJ5K5J8MnokLJqj8k1k2k1j4
20B08RL1K6kk1j4oj4k6k5j1%J5L4M0J5j9k7oRPjoj5l2l4qL0N3N8L9no5r5o2J7Q3J00P4L6%
15C90k6m1l9k4mRMj7l1j0K9L7Kk9j2L3L8j3n5l5K4N0K1j6k2jJ1Onj0pLJ5K4J9Kk0k8j2J4J9
10B93pk9j3J3mn7p8k9L7N4K9J7K6J5j9l6j6OROJ5J0j8m2l5j4okK4N0M6J3j0rLRQLnnRJ7pm1
5B30l7OL7K1j7l9l5k3rNRQJ8L7L4Jk1NN0N3Lm3m5k6j8j7kK7M2L3J7J2Qj5n3p1n0lK9K4LkJ6
0B02L9M8L6J0j3j6nkk4n1m4%L4K2qlL9N8J4m5m5J2N0K9oJL6L5j1m4k8kj3m7n5k0L2O5N5Pn2
-5B90p5n1j6qj1J2N2O0K9MJ4K8K1Jrj9m4o1m4rQ%pNJ7J7J0Lj0k2k0jJ5Qj0j2J1L4L1%l7n3
$$ y = [311, 326, 309, 258, 223, 239, 281, 293, 273, 259, 255, 223, 157, 120, 154, 217, 236, 210, 191, 204, 223, 233, 244, 254, 243, 217, 216, 252, 287, 288, 275, 276, 284, 277, 267, 278, 293, 273, 215, 166, 155, 168, 176, 181, 196, 217, 226, 217, 203, 197, 197, 202, 207, 203, 184, 156, 149, 183, 246, 301, 322, 317, 305, 290, 264, 235, 222, 232, 248, 254, 259, 274, 299, 317, 321, 316, 310, 308, 311, 312, 304, 286, 265, 243, 222, 208, 217, 248, 274, 272, 251, 237, 231, 217, 191, 166, 155, 155, 170, 204, 244, 259, 240, 213, 207, 216, 223, 222, 216, 201, 169, 135, 127, 157, 210, 268, 307, 302, 237, 142, 80, 97, 180, 280, 354, 390, 390, 364, 323, 284, 260, 256, 265, 269, 252, 221, 211, 240, 277, 279, 250, 238, 271, 309, 296, 241, 206, 230, 280, 301, 285, 263, 262, 273, 279, 274, 264, 257, 260, 275, 299, 318, 320, 300, 272, 260, 274, 293, 286, 257, 244, 257, 253, 196, 118, 89, 126, 180, 209, 226, 252, 267, 248, 212, 196, 202, 211, 217, 232, 242, 224, 182, 147, 133, 127, 125, 149, 199, 245, 258, 248, 239, 242, 251, 259, 262, 257, 252, 261, 278, 271, 230, 193, 199, 236, 257, 240, 201, 166, 143, 134, 139, 148, 156, 174, 211, 245, 246, 225, 230, 280, 333, 336, 293, 248, 222, 204, 187, 185, 212, 254, 287, 304, 316, 324, 309, 256, 185, 135, 132, 161, 185, 188, 186, 202, 241, 289, 325, 335, 322, 306, 301, 299, 275, 224, 180, 180, 214, 236, 228, 225, 264, 322, 336, 291, 246, 258, 308, 337, 331, 332, 368, 403, 392, 348, 320, 318, 305, 258, 203, 183, 215, 280, 335, 342, 290, 215, 164, 148, 140, 129, 141, 193, 253, 282, 286, 300, 328, 349, 350, 341, 322, 278, 217, 173, 164, 172, 172, 165, 170, 187, 204, 214, 217, 207, 185, 165, 164, 179, 187, 177, 165, 176, 210, 241, 241, 204, 151]
-10A51l8%M0O5O2L9J3Jjj4l3m3l3j9j2%K3L5J6j2j7LJ3J0J4K7J6k7o6o2k1K2M5N0L8J1j4k3
-15B59k0j3jJ6K4J3JLOqj5QM2M2nn0n6l6j8pRK1J5lj9k2j3MJ2PKK1N0M1j3n8l8J7M2J6j8k8
-20B30k2qRJ5j5n8o0j2K7J5j0PM0L5ok6lK2J2j5l0l3l0j3K0M4L2Jj4oJ1J9J4LnNK1K2Kj7k3
-25B00k4l0k3J0M0M0J3j0j8j6KL9O8M8om2l2nJj2j9j3lLQPJ1K3L5K7Opoj1k4k7j5j0k2k8r
-30A69J6K9K3Oj6k2PM6M4Jk4qKk4l6mK3j9p3n3K3N2J3j7LK3J2PK8K8j5m0k0qm0n2J6R0P3q
-35B55l8kJ8j6m2k0J3J7J4L0L6J2j3j6j6l3l9j2K5K8Pprj5k1JM1N7K3l3o3m9j6LQJ3K1J7k
-40A77j5pJ1PqrRK3K6K5J2k3n6m4J1N1L6pl4l3j7J4M8N8K9qk4k1k1j6QK9J7j6k8oK4L7L4K3
-45C16Rmj4k5l3k5lRlk2k6k0j3OL7M9K3j0j0J1Rj4j6MRj2k5oK7M7M6K4j8m9m2j0OjlPJ0KJ5
$$ y = [151, 113, 113, 153, 218, 280, 319, 332, 333, 332, 318, 285, 242, 209, 190, 178, 178, 201, 236, 252, 240, 223, 226, 239, 249, 263, 290, 306, 279, 213, 151, 130, 152, 197, 247, 285, 296, 282, 259, 239, 226, 225, 241, 265, 278, 279, 282, 288, 280, 265, 273, 315, 357, 352, 302, 246, 210, 192, 185, 194, 215, 230, 227, 208, 186, 173, 177, 189, 196, 198, 219, 269, 310, 297, 239, 201, 218, 260, 276, 258, 230, 208, 200, 209, 224, 209, 151, 91, 79, 106, 121, 111, 118, 158, 193, 187, 161, 158, 180, 192, 177, 147, 114, 84, 71, 91, 135, 167, 168, 154, 148, 159, 178, 192, 195, 190, 195, 216, 238, 240, 223, 200, 176, 146, 123, 133, 173, 213, 226, 216, 198, 182, 184, 223, 291, 339, 333, 291, 259, 254, 255, 243, 224, 211, 208, 211, 219, 226, 237, 260, 295, 322, 328, 321, 315, 304, 280, 253, 238, 228, 206, 178, 169, 185, 214, 237, 243, 227, 205, 212, 258, 302, 303, 279, 271, 273, 249, 213, 209, 232, 213, 140, 87, 110, 162, 175, 158, 161, 184, 196, 203, 231, 259, 244, 204, 184, 176, 136, 84, 100, 190, 263, 255, 217, 215, 233, 217, 175, 155, 168, 185, 199, 229, 265, 277, 264, 248, 232, 199, 160, 148, 173, 201, 208, 201, 192, 177, 156, 157, 198, 255, 278, 245, 182, 133, 117, 120, 128, 141, 162, 179, 177, 162, 155, 166, 173, 165, 156, 165, 188, 214, 239, 251, 228, 172, 128, 139, 190, 226, 219, 185, 152, 135, 149, 197, 255, 284, 276, 252, 231, 210, 194, 202, 231, 248, 232, 204, 198, 222, 259, 293, 316, 325, 321, 307, 282, 249, 224, 221, 230, 227, 205, 179, 159, 146, 152, 189, 238, 261, 251, 241, 252, 261, 247, 231, 235, 244, 232, 207, 201, 228, 275, 321, 345, 327, 278, 236, 226, 232, 231, 228, 235, 245, 247, 262]
-50B62L9L5NlK4K1m2j03q9k4K4M1N4N1Nn6o4j6L3M3L7L8K9kl3m2l8l4k2PL0K9Ll0n9o3k2L9
-55A07O5L4j2j8J3L5K5PJpl3n0k5K7M7J1l7l8LL3K9J6J5Lk7m1j9Mql2k1J3J5j8l4lL5L6J3
-59A64RK7L3Nk5k0J8M2J3m2n6qM1L1j6k4J6M1J5l6n7m6k2NL2M5L9K1mm1o3m0J9N4L6MjNjj0
-64B03JQj8m7l1J8L5Nk0lK5K3nk6k7rK5N0L7%j2J9M4K0k7l2oj2n8p4j3O6P2Mn2l8RL2K3Lj5
-69A97k9k4J3M9L6j5m3k0J9K9J9Nj1k7j7J8L5J1j2J1M7L1l5p7n8k1lJ6M4N5K8j%Oj6m1k6J6
-74B09K8Lj1LJ3kj8j1lj9m5m5j9J1L1M4M3K4OJ4K5Pk9l3PM0K0k7m7k9rmjJqk0j1K1L6K1QJ9
-79B43K7jl8l4RL3J2j7j7mj3l1k2J5L7J3l0m5k1J4L2L3L1K4Mk7m6l9j5OK0K5J1j6l0nL9N4
-84B31K2k2m2l3k0j7k0k1oK3N3M9Pl7l9LM1M1J4mOK3K7J2qk2k7j4J0L1K7om5n9m0nK2K3Nr
$$ y = [262, 301, 336, 341, 338, 362, 383, 341, 238, 149, 125, 149, 190, 244, 295, 300, 244, 180, 164, 197, 240, 277, 315, 344, 342, 309, 267, 229, 195, 173, 180, 210, 239, 242, 212, 153, 90, 68, 107, 172, 206, 194, 176, 189, 224, 249, 256, 257, 250, 217, 167, 142, 169, 216, 227, 190, 152, 155, 188, 217, 233, 248, 251, 224, 183, 164, 168, 160, 128, 107, 120, 135, 117, 83, 80, 115, 151, 164, 173, 200, 233, 238, 213, 193, 211, 253, 266, 224, 168, 160, 201, 232, 216, 192, 208, 249, 264, 228, 171, 125, 103, 108, 140, 185, 224, 245, 241, 200, 137, 97, 116, 170, 206, 210, 209, 214, 213, 203, 204, 212, 194, 147, 116, 134, 169, 174, 154, 151, 176, 199, 194, 168, 141, 132, 157, 207, 244, 244, 232, 251, 295, 315, 288, 256, 250, 238, 180, 106, 93, 159, 231, 235, 183, 145, 154, 186, 209, 212, 197, 168, 144, 157, 206, 242, 227, 184, 164, 183, 212, 231, 236, 225, 198, 181, 199, 234, 245, 233, 244, 291, 322, 287, 210, 152, 131, 128, 144, 188, 243, 271, 270, 270, 276, 260, 219, 193, 209, 237, 240, 229, 232, 245, 243, 225, 214, 211, 192, 147, 102, 83, 94, 125, 169, 212, 236, 242, 256, 281, 288, 259, 226, 233, 273, 293, 266, 219, 190, 181, 177, 176, 177, 169, 149, 138, 159, 195, 216, 224, 243, 270, 269, 231, 197, 206, 239, 251, 234, 217, 213, 200, 169, 147, 162, 199, 212, 182, 137, 116, 130, 162, 195, 226, 250, 254, 227, 181, 142, 127, 133, 153, 178, 189, 173, 143, 138, 177, 231, 253, 231, 189, 156, 136, 119, 99, 78, 72, 95, 148, 197, 204, 167, 128, 131, 172, 213, 227, 223, 229, 252, 279, 291, 283, 261, 234, 220, 230, 261, 288, 282, 237, 178, 138, 133, 155, 178, 183, 174]
-89A74kJ1Ok1m4l8j4J3L4M2K3k0m5j8L7O9O0L1Nj9l5l2j1MJ1K6L8K7ok0nKk2m1k0J5K0JJK2
-94B59K5lk8k1RK5Qk4m4k3J8L9J3k5l0jK5K1Mj8l3k9RN4O2K9K%ll4o2m9oK4K0JqnOJ8K2Kl1
-99B18n0l3NK7J7mlJ6J5k2n8m4J1N0M0J2MJ4J6LnqnJPPqj7jL2M7K9ll1m7m6j6K9N3L7Lk8m7
-104B17n8m5KM8N1Qk6j8RJ8%j1nJ2K3K6J7lk7k4RM4M4Rk9l9k3pnj7l2l4k2%K2K3Mj1KL4L8
-109B24Mj8J0N4M8j3o0m9j8pj2pPMrj4j0mJ1L4M0K0MJ7L3K0qj6j4k4k2J9O9O1ln3n7m8m2j0
-114A61L2K0m5p8k8L6L2rnL9M9%m6l7PL9L9J0k5k8J0M8L2k2n4l0J8M3L4Kk5k4JJ4NlJ4K4o
-119B44m5m1lJ5NJ5M7L2l5p5l3L0K7k0l0J2K8j6n6k4M8P5L0k6l0OK7J2j6k6k3k0j4nlnJ4N2
-123A73N9J5l9l8JJ6ok3j1mj5j6RL2K9J7J2%j9j7RK3J1LJ1nn0o3j1L6Ln6m3L3P0K5k7k7j0
$$ y = [174, 172, 183, 189, 168, 124, 86, 72, 85, 119, 161, 184, 164, 119, 101, 138, 207, 267, 298, 303, 284, 249, 217, 206, 210, 221, 247, 285, 312, 306, 286, 281, 283, 261, 220, 200, 215, 235, 236, 237, 259, 284, 281, 253, 232, 241, 266, 274, 250, 206, 183, 201, 240, 253, 228, 198, 197, 222, 243, 247, 229, 196, 167, 176, 230, 292, 321, 323, 323, 320, 286, 224, 175, 169, 193, 213, 214, 206, 201, 207, 225, 247, 249, 218, 168, 135, 140, 167, 184, 180, 177, 193, 208, 186, 128, 84, 95, 145, 185, 197, 201, 215, 231, 234, 229, 221, 216, 217, 224, 231, 223, 206, 205, 237, 284, 313, 310, 279, 232, 186, 170, 199, 252, 289, 292, 264, 217, 159, 114, 116, 164, 215, 223, 197, 179, 188, 206, 206, 195, 190, 202, 225, 251, 268, 265, 238, 214, 223, 267, 311, 320, 291, 252, 229, 222, 217, 200, 168, 134, 112, 112, 134, 157, 161, 150, 152, 186, 224, 228, 210, 220, 274, 322, 309, 249, 200, 182, 175, 163, 156, 163, 167, 158, 144, 134, 130, 141, 175, 215, 235, 239, 256, 289, 309, 301, 285, 271, 247, 225, 244, 313, 374, 371, 318, 261, 213, 171, 161, 193, 213, 168, 90, 62, 98, 130, 121, 116, 155, 204, 204, 158, 121, 128, 167, 206, 216, 191, 163, 173, 221, 253, 231, 177, 147, 165, 208, 242, 244, 219, 195, 196, 210, 215, 212, 226, 250, 244, 199, 158, 155, 170, 175, 190, 237, 269, 234, 159, 126, 156, 183, 163, 133, 145, 173, 157, 101, 77, 125, 200, 230, 204, 174, 180, 207, 219, 203, 177, 154, 134, 120, 115, 112, 107, 121, 173, 232, 247, 208, 170, 171, 187, 181, 158, 147, 143, 128, 112, 121, 153, 182, 199, 211, 211, 192, 175, 184, 207, 218, 221, 232, 227, 177, 114, 103, 139, 142, 86, 43, 76, 146, 171, 144, 117, 107]
-128A07j4j9QL6K4pj1K0M6L5qn3o3l2RK1Jj5j0nJK5N8O4K8jRK7Pj9pK5J7k4l7oK2Nk6l4k3
-133A81j6%L3N5M2Nj7k0k0j4QK5Ql5n1k2J6K8J5Jj7l7l8j2J9K7J9RMKOK2L3K2Mnk1m3l6K5
-138B05Q6P0j3p2o3l1k4k3%K3K1J5K5K7Jk0lK2Pk7k4J1K1rl1j9%J0K0L6L1Kk0j2JRJ4J3j6
-143B63n5n1JM2K5j4k1j0k0m5l8LK8J8k%J8K9K5J1%l%mk2l3k6qQK2L8M0J6j8l7l3j6kNOJ2
-148A52L2N0L6pl8k4MQj1j9rmMK7N1L6j6n2l7mLoJK0K1mj5LK5K2%qKkk7m0j7K4L5J4j0j3l
-153B04lonj1k4l3k0JJ6K2L0L2K5J2RJ2jl0m9l4lJ4OJK7O6N9pp0o3j0K0J2J0K9L2Lj8j0j0
-158B35m4o3l1J3J7OK2M6K9j0j5Njj6PN1M3j1k8J1J8m5r4m6L7N1%l6k2%kj8k1j2J0L5M1J5
-163A77j8l3l5k9oM1P7O7K2k1l9l2oJ9K3MjJ4K1KqORk9o8n2%K6J7J1J2Kj7k2j7k7l2%M6N4
$$ y = [107, 93, 74, 82, 118, 142, 135, 124, 144, 190, 225, 217, 164, 101, 69, 78, 99, 100, 85, 75, 70, 71, 96, 154, 218, 246, 245, 254, 281, 288, 269, 262, 287, 304, 280, 243, 237, 259, 264, 238, 204, 181, 165, 165, 198, 253, 295, 300, 283, 263, 243, 229, 237, 262, 270, 235, 184, 162, 178, 206, 221, 222, 205, 168, 130, 118, 137, 164, 183, 192, 196, 198, 204, 226, 259, 281, 285, 280, 259, 216, 180, 205, 291, 361, 348, 276, 213, 182, 158, 135, 135, 158, 179, 194, 219, 246, 247, 227, 224, 246, 253, 226, 202, 213, 234, 225, 194, 175, 175, 185, 205, 241, 272, 274, 254, 242, 243, 252, 266, 279, 263, 208, 157, 158, 200, 225, 211, 190, 180, 160, 115, 77, 80, 108, 126, 124, 124, 142, 171, 196, 207, 207, 204, 204, 200, 178, 145, 119, 111, 119, 141, 179, 219, 235, 217, 180, 147, 131, 129, 134, 140, 152, 184, 234, 270, 263, 225, 201, 205, 213, 202, 183, 174, 170, 174, 201, 252, 288, 272, 220, 183, 179, 182, 176, 177, 197, 218, 214, 199, 202, 227, 249, 249, 241, 243, 241, 214, 174, 157, 181, 216, 230, 220, 207, 204, 201, 195, 190, 179, 155, 122, 102, 103, 119, 141, 171, 203, 228, 240, 249, 261, 260, 230, 181, 147, 144, 158, 164, 165, 192, 258, 317, 310, 240, 177, 167, 187, 199, 209, 238, 270, 273, 255, 245, 235, 191, 128, 97, 110, 127, 133, 155, 201, 230, 220, 205, 210, 209, 193, 200, 251, 294, 283, 255, 266, 284, 239, 145, 99, 136, 187, 187, 151, 129, 129, 127, 109, 88, 76, 86, 121, 162, 177, 159, 126, 91, 62, 56, 97, 174, 241, 263, 242, 203, 171, 165, 184, 207, 211, 210, 224, 245, 247, 239, 245, 254, 225, 157, 105, 105, 131, 148, 159, 171, 173, 156, 134, 117, 90, 58, 58, 104, 158]
-167A58J6j5oJ2J5J7K7K4%j4jJ2ol7n3m9l5nL1N3M6K7Qj2k5j9MK5L7M6M3J0l5n3l0oqk0j3
-172A69OJ8K2K5K1Rmj2j6j0Jkk9m6j5L0K8j5k8MJ8k5n8k2M0N2K3NKrk1mK9L7L1L6L8ln7n9
-177B09j0K2Jk9l0j6j2oRK2K4K3J8PlKLk6n9m2RL3QnJ9K9j1n3l5J8M0K7J8K1RoLK4J4k3m3
-182B03l1j8k0rJ6K1jqK6N1K3l1l9mJ3j4l5mM5M5Jj9PL5J7k6m1k1qj8k7j3Ljj0nJ1J8J3N%
-187A50lLJ3Rj3k7j2J2J8J1J4K0Nk6l2j2jj3j8ML0K5%j9l0l6j6L2N2Mo1n3J4L4k4o4mR3J10
-192A89M6j0k2l4o1n5%L8K5NJ7K5nl1j0K5J1k5j4M1N9Mn5n8j7J3J4MJJ2L3L8Nm2n3j0M1N5
-197A99K8j4m6m1RO1M8k3p2m3J9L7Nl2m5m1k5omk0k0K6Q2R3N8K0QKpj6k0k4k7k0j4j5j4MJ9
-201A29Nk8l8j1K5M1M2L2K1J7K1J0k9o1m7oRj2j9J0M0L7J4jrj3jL2N5M9K5%l2o2o4k5K0L5
$$ y = [158, 174, 159, 153, 165, 180, 197, 224, 248, 248, 234, 233, 245, 239, 202, 149, 100, 65, 60, 91, 144, 190, 217, 225, 213, 188, 169, 173, 198, 235, 281, 324, 334, 299, 246, 216, 210, 202, 182, 169, 175, 193, 215, 240, 261, 270, 266, 254, 238, 228, 229, 227, 198, 152, 137, 167, 195, 180, 152, 156, 174, 149, 91, 69, 109, 161, 184, 189, 191, 182, 161, 157, 186, 223, 254, 290, 328, 325, 268, 209, 199, 221, 222, 193, 163, 147, 135, 129, 138, 160, 184, 207, 225, 232, 229, 231, 234, 208, 149, 107, 116, 149, 157, 152, 171, 200, 189, 136, 101, 119, 159, 186, 204, 225, 234, 228, 231, 255, 269, 246, 203, 172, 154, 134, 125, 141, 162, 161, 153, 179, 230, 253, 222, 183, 179, 192, 178, 143, 139, 184, 229, 230, 211, 218, 253, 270, 244, 203, 182, 174, 156, 129, 116, 119, 118, 108, 103, 114, 132, 145, 150, 150, 147, 150, 163, 172, 159, 132, 120, 132, 150, 161, 175, 195, 200, 174, 142, 130, 129, 116, 98, 102, 132, 157, 157, 138, 108, 72, 56, 88, 140, 144, 83, 30, 44, 78, 54, -10, -14, 79, 189, 235, 225, 203, 169, 108, 53, 53, 91, 116, 121, 138, 163, 158, 127, 117, 142, 153, 128, 114, 155, 214, 218, 163, 105, 88, 101, 115, 119, 120, 132, 165, 203, 208, 166, 113, 103, 144, 199, 227, 213, 167, 126, 135, 196, 244, 221, 149, 106, 125, 162, 167, 135, 90, 49, 24, 18, 14, -6, -26, 0, 82, 175, 233, 253, 261, 263, 256, 240, 220, 196, 169, 149, 135, 120, 106, 110, 129, 134, 106, 68, 57, 82, 123, 165, 197, 218, 235, 256, 266, 237, 176, 129, 123, 132, 120, 101, 111, 151, 188, 202, 201, 192, 179, 178, 210, 265, 314, 339, 339, 307, 245, 181, 156, 176, 211]
-206B11K8L1M1K8j1n2o7n1k0%mrJ2M1L3ok4LL2J7j2j3Jjj5lK0J7j5l5l0j6lK3M5L2qk7j7j3
-211A63l2l0J0M1K5j1k2j1qj4j4qlJ4M8O2K7k3l5j0Nko%rk8j4K9L7j3o0m0J9M5K5%jJ1K2K9
-216B18J9j2l6k4OPk0l3mL1L7J7oj8j9j5j6k2j2K9N8K5m8o9oN8M6nj3K4L4kl3l6l1l5j9K2
-220I7M9L8J6Nnj3jK1J0l7n9k3K1J6k1l7k2nNJ7K5Oj9j6J8N2N3J9l0n9l9J2L8K2KNlm5p5m1
-225cK0L8J5KJ2Pj8j9OJ9RJ5L5K0l2n0rL3K7J6M7P4L6l7o3k6J1K1K3K1rn8p5m3pmrMK2J6%
-230H7RL9M4Rk8k3RK7J7NOmk7l2jK2%l9k6L0N1J1k9j7J2J0qJJ9Mk5j5K9M6Ol9m0j1J1J8J9
-235A77J2jrKJ4J3mj9k4j9pKLmo%RPJkPJ8J6pk8k3KJ2KnRJ6ol2l0j2j0k1j0J5J4j7l6j4K1
-241B6K7OqoQK0K4QrnK8N5M0jk5j2RNj9k8qJ2Jk0j1K4K9j6n2k1M3N5Ll6j6J9J5j6k0J4M5L4
$$ y = [211, 239, 270, 311, 339, 328, 276, 209, 158, 138, 138, 134, 125, 137, 178, 211, 205, 181, 184, 216, 233, 221, 208, 209, 208, 193, 190, 210, 227, 212, 177, 147, 131, 128, 151, 196, 228, 220, 193, 176, 163, 131, 101, 111, 152, 177, 166, 144, 133, 125, 111, 97, 89, 86, 100, 148, 210, 237, 214, 179, 169, 174, 172, 166, 166, 157, 129, 115, 144, 181, 168, 108, 68, 87, 132, 157, 157, 156, 167, 189, 218, 237, 225, 189, 165, 171, 178, 158, 125, 121, 152, 189, 206, 200, 182, 163, 148, 132, 110, 98, 127, 185, 210, 162, 93, 87, 145, 191, 186, 173, 197, 231, 229, 196, 160, 129, 94, 75, 97, 146, 184, 200, 205, 200, 187, 186, 207, 217, 180, 121, 98, 119, 135, 114, 77, 55, 50, 55, 72, 97, 103, 84, 68, 86, 138, 191, 210, 180, 121, 82, 94, 132, 154, 156, 161, 158, 113, 38, -3, 17, 55, 70, 72, 84, 91, 73, 54, 60, 79, 88, 103, 138, 158, 126, 76, 67, 100, 127, 143, 190, 264, 300, 263, 200, 174, 185, 206, 229, 250, 241, 183, 108, 65, 58, 54, 45, 49, 71, 87, 87, 96, 135, 179, 188, 160, 137, 146, 173, 190, 195, 201, 197, 170, 138, 137, 159, 159, 120, 94, 124, 175, 186, 157, 140, 152, 162, 154, 155, 174, 178, 153, 138, 167, 213, 219, 180, 140, 129, 140, 158, 177, 189, 188, 179, 181, 195, 208, 204, 185, 161, 142, 135, 137, 140, 136, 130, 130, 139, 146, 147, 145, 152, 170, 186, 179, 151, 128, 130, 142, 144, 139, 148, 164, 158, 126, 96, 84, 74, 53, 43, 58, 72, 55, 19, 5, 26, 53, 59, 51, 45, 53, 73, 97, 105, 96, 91, 119, 174, 214, 213, 188, 176, 185, 190, 171, 143, 135, 147, 148, 128, 117, 141, 170, 154, 102, 81, 124, 179, 182, 146, 130, 149, 164, 148, 128, 142, 187, 221]
-246B21qm0k9RK6Nk5k7jK1K7K5Qk5m5k0J8Pl5m1ML2Oj3J8L5j4o7l7M1N9Mk9MM2L1lj2KJ0O
-251A90Jnj3j4njj0pQJ7J2J4K8L2Pk4k9j0OLrj4j0j4l4n4l6K1N8K3m4n2K2Q9P1mn0l8mOlm
-256A20J3L1K8%k1j6kj2l5k7J7M2J1k8k5Klm2n0JO7Q4N0Nj8j3OK2K5Rk2m7m4rK7L3J6RK0Q
-261B32l9p4n0J4N1L6Jj0%QNqj6j0J0K9K3jk2k3j0K%j3k7j8QK6J2j3j8nKkkQQjkJ4K8K6J0
-266A89j3l2k6OK3ml9j9M2O1Jn7m0J6K4j7l3PN0M4J0j6j8j2omj1j5mRRLJ1K5Ql1m2kL6K0l0
-271A23m7k1QJ2J1K5L3J1k3l0pJ4Lj9k1PL4K7%j1J0L3K4ok1j2qj4kM0O8M1k0m7k2Jj8m5l0
-276A01J1K7OpJ2K8Ml2l3kJ8Nj7k3j8j3oJLjkNP%JK2M4M4K5Oj0k9l6j5K5N2M6J8j5l7m0k3
-281A52qqk2k9j9oKJ6L0K8Nj7j6LJ8J8PnpPK9L3Ok2k6qJj0k3k0lJ1Rlj2kK2L1J6ppKkk6m1
$$ y = [221, 213, 173, 144, 153, 179, 184, 159, 132, 131, 152, 179, 204, 212, 187, 142, 122, 140, 147, 112, 71, 75, 107, 113, 100, 118, 153, 139, 72, 35, 76, 135, 139, 110, 114, 156, 187, 184, 172, 174, 184, 190, 191, 186, 173, 159, 154, 153, 143, 136, 144, 161, 173, 187, 215, 247, 254, 230, 201, 191, 197, 200, 191, 177, 167, 153, 119, 65, 29, 50, 108, 131, 87, 35, 57, 146, 217, 213, 163, 125, 121, 127, 124, 120, 133, 164, 192, 192, 171, 155, 153, 141, 106, 79, 96, 138, 149, 121, 96, 98, 95, 53, 3, 4, 71, 155, 205, 210, 192, 179, 185, 207, 232, 241, 219, 172, 128, 119, 146, 179, 195, 204, 224, 232, 193, 119, 69, 83, 134, 170, 171, 161, 161, 169, 174, 166, 150, 140, 150, 179, 202, 201, 179, 156, 146, 148, 148, 135, 108, 90, 98, 124, 136, 123, 105, 100, 102, 100, 98, 106, 114, 113, 111, 125, 153, 179, 189, 176, 144, 118, 124, 147, 143, 104, 85, 127, 188, 189, 132, 92, 108, 132, 115, 82, 89, 139, 183, 193, 177, 159, 147, 141, 137, 126, 111, 107, 116, 125, 128, 139, 164, 172, 141, 99, 97, 133, 153, 123, 76, 55, 63, 75, 86, 111, 144, 155, 132, 102, 95, 109, 112, 93, 72, 79, 113, 140, 140, 129, 139, 172, 196, 190, 169, 157, 149, 135, 133, 173, 241, 282, 262, 215, 193, 194, 176, 131, 101, 112, 139, 145, 138, 150, 178, 182, 150, 117, 115, 133, 138, 121, 98, 80, 67, 61, 62, 65, 64, 62, 67, 74, 74, 75, 97, 141, 185, 210, 216, 206, 177, 141, 126, 151, 203, 249, 267, 252, 215, 175, 152, 144, 136, 114, 85, 66, 60, 62, 78, 108, 136, 141, 124, 108, 111, 129, 147, 154, 149, 142, 149, 178, 211, 217, 195, 169, 161, 162, 152, 129, 109, 106, 117, 126, 123, 111, 109, 131, 162, 178, 171, 164, 166, 164, 138, 97]
-287I7k8jJ5K0J9J5Oqk3k5oK5N0M9K9Nj9l7l4lK5J7j9m1l3k4k3j1J8K5nl1j8J2J2qoJ7K7J3
-292I3OOrk9j5L2N1J3m3n8l3j2lPK3K7K3K4K7J5lpMLk3m5l1J5N4O1L4nk5j7LJ3J2RLj3k2j
-297A64K6Qn2q4l7L1L1j4rO8J12N1n1p4j7K9J9jPJ0k2n2m3j4qj9j3J0J9J0NQ%j6j6NJ6Qjj
-302I3j2l3l3J5P0P1J1n0n9k5RJ2kj2j4j7j7ML6N3L5QMK7M4L4%l8n6m4KM5N4K6qk2j7qlrk2
-307A52k9j7lnpJ2M2M0Mj7%K4J6j1k3j4nkjpk1k1JJ3j3l7j2L7M4kl2MN9O9K3k5m1k8j6k0l2
-312I9l2j3RJ8K1L1L6J5k2l5pK7L8L0K1Rrk0j0QJ6J0j2m2o2m0NK7Nj4OL4K0j4j2K5L5pm7l1
-317A16QJ6j1k7pK6L8K6NjJ5L2K8jk8l2k3j9j8oJ1J4NPK3K9Nk2k9j5nJQJ2pl9n1k1K5M7L2
-322A67kk8m5m8k5K8P6P8K8j8j3K3K7k0o0m0QJ5j8l0J3O2N4jm4m6k9k2j8pJ0K0K1J4MnnPK9
$$ y = [97, 69, 68, 83, 103, 122, 137, 143, 135, 112, 87, 81, 106, 156, 205, 234, 239, 220, 183, 149, 146, 171, 188, 169, 128, 95, 71, 48, 37, 55, 80, 75, 44, 26, 38, 50, 42, 36, 53, 80, 93, 99, 105, 96, 67, 52, 84, 135, 148, 105, 47, 14, 2, -1, 6, 29, 56, 79, 103, 130, 145, 142, 135, 139, 142, 119, 74, 43, 58, 112, 173, 207, 202, 177, 160, 163, 176, 188, 197, 200, 187, 165, 164, 190, 198, 146, 62, 25, 56, 87, 73, 64, 132, 244, 295, 244, 170, 153, 182, 201, 200, 207, 217, 195, 143, 100, 86, 78, 59, 46, 56, 75, 85, 90, 98, 98, 82, 66, 71, 87, 95, 94, 93, 81, 48, 15, 30, 100, 171, 182, 132, 73, 48, 57, 69, 67, 55, 41, 24, 7, 11, 47, 100, 135, 143, 147, 174, 218, 252, 252, 214, 158, 114, 116, 161, 215, 241, 233, 211, 194, 186, 183, 174, 152, 123, 106, 103, 98, 91, 103, 145, 185, 189, 172, 172, 196, 212, 201, 178, 164, 159, 157, 156, 149, 128, 107, 108, 121, 108, 71, 59, 96, 140, 138, 106, 110, 169, 238, 261, 236, 195, 167, 151, 131, 99, 67, 54, 63, 81, 102, 133, 169, 184, 162, 127, 120, 147, 185, 215, 236, 245, 236, 216, 206, 214, 230, 240, 228, 186, 124, 84, 89, 116, 121, 107, 113, 147, 167, 153, 141, 166, 201, 194, 147, 116, 124, 140, 129, 102, 95, 121, 159, 185, 190, 189, 204, 236, 264, 263, 235, 203, 180, 161, 143, 137, 148, 162, 167, 174, 197, 226, 231, 209, 180, 165, 160, 161, 169, 181, 174, 135, 84, 63, 88, 135, 167, 165, 137, 92, 44, 19, 47, 123, 201, 229, 211, 198, 221, 248, 228, 168, 128, 136, 151, 133, 103, 116, 178, 232, 231, 187, 141, 112, 90, 72, 65, 75, 95, 116, 130, 134, 129, 124, 131, 160]
-326A60M1L0om2m9k3LMj0j5nNJ2J9K2%l6n2k6J7M2M4L9L1Qk0k2J3N4N1Mm0l9j0mj9k1jMk9
-331A34n5l0J8K9lk4kL4L6Qj1rNJ3J2QLqk8m5l7mK1J3nmJ4J6LRL4M0J4j1j0lj1j6qmj9k5M
-336I6L3J9k3m1j8Ojk5l6j5K3N7M6Qj3J0L5J8j8k7qMJLJ5K1J7J4J0%J0M4O0J1n8o5j3K5J9
-341B44J4K0j1q0j02l1N1M8j0k6J5M0J6j3j2MPLJjolJLLOQmj3qpl4o7n6qK8K0m%K2L4K5J5
-346A32J5J5Mj3j2NK2Qk4l5pK4J8j3k1NK1%k5j6J9L1Kl5l4RM6M0J3MJ5J1j9m4m1l3l6k4K7
-351E4P5N9%k9qPj6m2l0lRRJ6K0J2LNMnjK5M0J2k7l1rJkRL0K5lj3J0K8J1j9k5k0k3l0j8PJ9
-357A36PrmJ6K3Jl8n6l8kJ9K4L1M2L5J1nJ0L4L2Oj7k4j7KK7M0J8k6m8k9MMk5m0k0MKj1OM2
-362A67M3j1o2n2%L7L6L3M8N0J4l5n0k6%Kj0j5j3j8k5j9KJ3kk2j3K0L5J1j6nL1L3nl5k1J1
$$ y = [160, 201, 231, 225, 183, 134, 111, 114, 118, 108, 93, 88, 93, 105, 124, 146, 146, 110, 58, 32, 49, 91, 135, 174, 205, 213, 193, 171, 184, 238, 289, 293, 253, 214, 204, 200, 181, 160, 159, 163, 134, 79, 49, 67, 96, 93, 69, 67, 101, 137, 145, 134, 125, 130, 143, 155, 163, 166, 158, 130, 85, 48, 44, 65, 78, 73, 69, 83, 99, 102, 111, 145, 185, 199, 188, 178, 175, 164, 148, 140, 136, 117, 92, 96, 129, 148, 125, 84, 66, 72, 71, 46, 10, -5, 18, 75, 121, 129, 116, 126, 161, 179, 161, 134, 126, 130, 131, 134, 149, 170, 187, 201, 211, 211, 221, 265, 325, 336, 278, 213, 200, 225, 244, 258, 278, 267, 187, 85, 54, 105, 153, 143, 117, 132, 172, 188, 175, 163, 167, 174, 177, 178, 177, 171, 168, 169, 172, 175, 181, 189, 185, 172, 164, 157, 123, 56, 0, -8, 20, 40, 36, 36, 58, 92, 117, 132, 147, 162, 166, 153, 141, 146, 168, 176, 152, 117, 110, 134, 152, 139, 118, 123, 144, 144, 119, 103, 122, 153, 155, 120, 86, 95, 141, 181, 194, 198, 213, 224, 205, 161, 120, 87, 51, 27, 54, 129, 188, 188, 159, 151, 158, 142, 100, 70, 67, 76, 85, 101, 121, 133, 136, 141, 145, 140, 139, 164, 204, 216, 189, 158, 149, 150, 148, 157, 187, 212, 209, 196, 206, 234, 245, 226, 201, 181, 158, 128, 110, 117, 136, 143, 134, 130, 146, 169, 170, 132, 76, 38, 36, 55, 79, 110, 152, 187, 198, 193, 203, 237, 269, 275, 258, 234, 217, 219, 246, 286, 304, 278, 230, 201, 205, 209, 184, 144, 124, 128, 130, 119, 125, 167, 210, 199, 137, 85, 85, 122, 158, 191, 239, 289, 303, 268, 218, 192, 192, 194, 184, 169, 156, 138, 113, 94, 96, 109, 107, 85, 72, 92, 127, 138, 122, 117, 148, 181, 176, 141, 120, 131]
-366A31J3qj2J0K2Jk3j3K0L4J5qnJ0Oj6k9k3k0l8n9m4%L3K9RKMok5k1J7O2O9L6j1l9l9k0%
-371F4PMPJ6J1k3n7m6OM7L8OMK7L4Nk3k6j2LJ6K1Mk5k9OL5J8j9k8lJ2KLL0N5M8J7oj4j7k2
-376A96k6k1j1KMmj8k4k5j8QN5Q7O5Mm0l1jJ3J7K5L2J6j3l1j8QK1jm9p4m2J9L8mn0n4l1j2
-381A2JK0K6J1%J0Rk7n1j6L8M0ok0K2N1K5j4k4k1l9n3l5NL0L5M2L9K6K1L4L8J5rj1rl0n4m6
-386H5j4J3K7L5L0Jk2j1J9J9j2l3l0k3k2j2PJ4J1K0L6L5J2mNQj4l8m0k5j1mMOnj7j6MK1J8
-391G7qk8j4K9N4L3kpRLk3l0mK7M0L5J0l6p0m4K0M8K0LK5L6jl3qL1J1l8l9kLk8k4K9N6J0m2
-396A28k8K7M4J1j4jK4K2j0m1m2j1J7J4j5k6KL9M1%m6n2j1L2K9j8m1qL4J7m0m9J1O4M8MoJ5
-400A64J3j9l5j5J0Pj7l0j8J1K7J3j3qL4N8J7m7o3k4J5J9J7K2J9jpJ3K4Oj2lPj4m2j9L8O0
$$ y = [131, 144, 136, 124, 134, 156, 157, 134, 121, 141, 175, 190, 182, 177, 187, 193, 177, 148, 125, 105, 67, 8, -36, -36, -3, 26, 35, 37, 41, 35, 10, -11, 6, 68, 137, 173, 162, 123, 84, 64, 64, 71, 75, 82, 98, 109, 86, 29, -17, -11, 36, 74, 80, 84, 111, 145, 150, 127, 101, 89, 92, 108, 129, 133, 108, 79, 85, 120, 138, 119, 91, 88, 100, 102, 105, 135, 190, 238, 255, 249, 235, 218, 196, 170, 149, 138, 140, 144, 140, 122, 98, 73, 55, 63, 118, 205, 270, 274, 234, 203, 202, 215, 232, 257, 289, 305, 292, 261, 243, 251, 272, 271, 222, 148, 106, 125, 163, 159, 109, 55, 24, 12, 13, 33, 59, 70, 70, 80, 89, 62, 11, -5, 33, 73, 67, 47, 69, 120, 145, 131, 107, 86, 47, -6, -41, -36, -6, 29, 71, 110, 136, 157, 191, 229, 244, 235, 224, 215, 185, 131, 85, 71, 84, 111, 146, 176, 177, 155, 144, 163, 182, 170, 137, 107, 84, 62, 50, 57, 71, 82, 102, 138, 173, 185, 181, 186, 194, 180, 142, 102, 77, 66, 62, 66, 72, 67, 50, 34, 38, 59, 77, 69, 41, 27, 56, 110, 143, 141, 134, 143, 146, 123, 93, 89, 116, 156, 191, 201, 165, 95, 51, 71, 119, 139, 142, 167, 203, 202, 169, 161, 192, 203, 165, 126, 124, 127, 99, 75, 104, 160, 170, 128, 100, 127, 171, 182, 168, 167, 191, 213, 203, 162, 120, 109, 126, 140, 125, 99, 101, 140, 181, 181, 135, 83, 72, 104, 133, 115, 74, 66, 100, 117, 77, 28, 39, 103, 151, 155, 149, 164, 177, 158, 123, 108, 118, 125, 108, 78, 60, 71, 98, 111, 98, 90, 124, 182, 199, 152, 89, 65, 80, 99, 116, 138, 157, 156, 149, 162, 186, 192, 180, 177, 184, 170, 128, 109, 147, 207]
-405B07K1k7l9l1k6j6K4N9N5K0lmpj7j1RJ8PJMrm5n7k7PLj8j5Klk5k9mJ4J9K6L2J7j1j6J3
-410A18L9L3J2ok8n2m7nK7J8qpJ5K2Pmmlj0j8k5k1%K7K8O%L1O2M7Jl1m1m4l5j0Jk1m0qM6M2
-415A14k1o2l1K7N5M3J1k7n5m0PL6K2LJ3K5Pj9j4J1J8PLmk9m6qN7Q1M1rj6NPrj8j4j2j6j2
-420A31kJj4l3l5j0K4M1L0Nj7j8kJ2J1jkORoj2NK1Jl4l0K0N0K3j9k8rmj4j0OJ0jj0j1j2kK6
-425I6M3J8k0k1J3K5kk1oJ3MlJ8M1L0LjQrm4n3k4jpj5JK7K8Lk2k8j6QK6K4MoJ0L6L7J0j5k1
-431A91j7k0k0kK1K0j2l4k3JNqmJ2Nk7l8NN7N0qm4k4QNnJ5M7M0kk4oJ0mj8rKj6m2l1J3M3M3
-436A55L0K0J0kqj4l5n5m0LL2K3Kj5l3n2l3K3O5M4lk0pj1l5l9mM1N8M5J4j2j1J6K1j5m8k0
-441I0M3O3K4j5j6j5l1k7J2M1K2j1oJ9J9j1k5rJ5K5J6jk7m3m4l9k7jK9K3l3p5m8K1M7Qm0l6
$$ y = [207, 228, 201, 162, 131, 105, 89, 113, 172, 227, 247, 244, 240, 233, 216, 205, 214, 232, 239, 240, 244, 235, 190, 133, 106, 113, 116, 98, 83, 85, 82, 57, 28, 24, 38, 57, 83, 115, 132, 121, 105, 118, 157, 190, 202, 196, 168, 116, 69, 64, 91, 109, 101, 94, 109, 131, 138, 134, 130, 127, 117, 99, 74, 53, 53, 80, 108, 114, 114, 145, 207, 254, 255, 224, 183, 139, 104, 94, 95, 74, 34, 26, 72, 114, 93, 31, 0, 27, 82, 125, 136, 109, 54, 14, 21, 57, 79, 82, 95, 120, 127, 108, 94, 105, 123, 130, 133, 129, 100, 54, 46, 103, 184, 225, 216, 200, 205, 212, 203, 185, 171, 159, 143, 131, 129, 130, 116, 83, 48, 38, 62, 103, 133, 138, 121, 103, 101, 113, 124, 123, 121, 127, 136, 130, 118, 123, 144, 145, 111, 81, 101, 151, 174, 155, 127, 118, 114, 100, 90, 96, 106, 105, 95, 84, 72, 70, 96, 139, 157, 137, 116, 129, 154, 152, 131, 125, 138, 142, 139, 157, 198, 228, 231, 230, 238, 229, 185, 132, 108, 107, 100, 85, 86, 113, 141, 144, 122, 94, 78, 86, 112, 136, 140, 134, 144, 180, 217, 227, 212, 191, 174, 154, 134, 132, 153, 173, 161, 127, 104, 105, 110, 102, 98, 110, 115, 88, 50, 55, 112, 162, 154, 110, 86, 94, 99, 94, 109, 156, 196, 194, 170, 164, 174, 170, 152, 143, 145, 129, 87, 56, 69, 112, 155, 185, 205, 215, 213, 205, 191, 156, 101, 61, 64, 96, 119, 121, 106, 73, 21, -12, 11, 76, 120, 117, 97, 90, 79, 44, 5, 1, 42, 100, 145, 159, 147, 136, 152, 173, 158, 110, 90, 133, 196, 220, 205, 189, 174, 143, 116, 128, 169, 191, 180, 174, 193, 212, 201, 176, 167, 182, 207, 223, 222, 195, 152, 108, 69, 42, 41, 70, 93, 60, -15, -63, -42, 5, 13, -27, -63]
-445f3RM3L6QoJ2M4M6J3k0k4k3m2m9KQ3J09M8l9p2m7j9j4k5k3mJ4Mj6j3K9N9L8JOM8N7J4k4
-450B00j9LRROj7n8p0l4PJ0OK3L0kl0lM5M1j4m8l5k5l4j8L9P1L0k9k9J8L1j7o0m4NL3L2K4
-455H6L0K7nm9o2k7K2M3L1J2NNOQJ2Mj5k8k1%K2K9J2k1m0j7K6L9Qk3j4K3M3K5j1l3l2j9j0
-459I1p%J4J9Jk8l2j5kljRPoKL6M8J2k7j8J6J9rj8KQj1j7PK0Kk1j4QJ6Mj5l7m4j9K2M4K6j
-465H8pj4m1n4k9J8M4M9M8L9J4qj2k2n7p2l0L5N0K4J4L2K3k0m4j3K7L4K4J8Lk7l7j7pk8m1
-469Dj5Oj2m2l1J1L0K3K6M4M2Rj7j2J0L0L5K0kj0MQj4l2j8OR%NOk5o1m0K2O3M6J7Mpk7l0o
-474G9J2J3J2Qj6l7j9J6%n0m1L8P6Np3m0N6Q7L1k1j6mj5k1pkj7j9PK7K0O%j1l0l1j3kML2P8
-480A22Q6L1k9l1J2M4K5k7o9o2j3K5Nm1l7K6O9M0k0m3k5j2j5j8pJ2M2P4P8L5k3n2m8l3j2J5
$$ y = [-63, -54, -11, 25, 33, 27, 39, 83, 129, 142, 122, 98, 75, 33, -16, -14, 69, 178, 226, 187, 115, 68, 49, 35, 10, -13, -17, -3, 1, -15, -28, 1, 60, 98, 99, 105, 153, 210, 224, 200, 181, 184, 193, 202, 208, 191, 133, 63, 29, 36, 46, 52, 75, 105, 103, 73, 70, 115, 156, 142, 94, 59, 34, 0, -18, 21, 92, 122, 93, 64, 82, 113, 96, 36, -8, -3, 30, 62, 86, 116, 143, 138, 89, 27, 0, 22, 65, 96, 108, 113, 118, 124, 132, 144, 148, 133, 105, 84, 84, 106, 135, 147, 126, 86, 69, 95, 134, 142, 119, 105, 128, 171, 196, 185, 152, 120, 101, 91, 84, 84, 98, 117, 118, 90, 58, 43, 41, 38, 37, 46, 53, 47, 49, 85, 133, 145, 118, 100, 116, 135, 126, 108, 110, 118, 107, 90, 97, 117, 119, 98, 84, 92, 108, 112, 97, 60, 16, -3, 19, 63, 89, 88, 81, 67, 26, -28, -57, -39, 5, 54, 102, 141, 155, 147, 135, 113, 56, -16, -46, -11, 39, 63, 77, 109, 132, 112, 68, 55, 82, 116, 140, 158, 161, 134, 97, 80, 73, 45, 4, -11, -5, -17, -59, -90, -79, -49, -26, 0, 44, 86, 95, 78, 66, 76, 106, 141, 161, 159, 149, 153, 161, 147, 115, 97, 103, 112, 112, 117, 123, 98, 37, -3, 19, 82, 128, 145, 149, 142, 115, 85, 79, 91, 104, 116, 124, 108, 71, 52, 68, 68, 18, -23, 15, 91, 96, 23, -17, 39, 126, 157, 136, 120, 116, 101, 80, 73, 71, 54, 35, 42, 69, 89, 95, 95, 84, 54, 23, 10, 8, 12, 44, 122, 208, 239, 210, 179, 191, 235, 260, 233, 164, 102, 89, 114, 119, 78, 41, 67, 136, 176, 156, 113, 88, 76, 61, 43, 36, 48, 90, 164, 242, 277, 254, 202, 154, 121, 109, 124]
-484A24L7L3J6J1Pj3l4l1j8l0n2m0QL8K4mj7j5mK0L9K0k0k1K7O1K9l4o2m7k8j2J5L2J5j3P
-488F8O0P4J8m7n0nK4Rj5k7k3rJ7M4M6J9nnmk6n4m9j1K2K3J4J5Rk3o0n4j3J6QKK8N8N4J9j
-493A66J0K6K2Jk7n5n9k5K0K5pk3NL0J3k2k2PJ9kk0rJ7L7M1J9k7o5n7qL2K7mj8j5roNJ4Qm
-498F0QM9P7N5nm6l3J2K2j4m8k6K6M4Ql3l2qQJ1J9K2Oj3kK0J8pk0rqk7l3%L5L0MML1K8k4o9
-503A40n3LL2Nl7m6l0j2OL8O2M4nk7j1Kk1l8JO5P9K5k9l3j3j8m2m2JM6M9Rk8k6LJ2j6m3k9
-508B3J6M0K1mpjqj8j2QJ4J0RJ3Mk5m7l3J4N3N1J4j8k2qlkNJ0ol3k8J2M4L2j0l7k7mNok0j4
-513EJ3L6K9jk4j6MQoj5nJ5J9jk7k1J5L8J8k3l8k3j3k1k3nJ3J4POPJ0K5M4M0J3j0k0l0m2k4
-519iJ3K8Mj6JJ9Kk0rJ6J8J4K8L4nn5m7OL5K1J0J8Pl7n9k7J6K7Jk5l3j8K0M6L4j%L3N0K4l
$$ y = [124, 161, 194, 210, 221, 228, 215, 181, 150, 132, 102, 50, 10, 18, 56, 80, 76, 59, 44, 40, 60, 99, 119, 99, 78, 105, 166, 195, 161, 99, 52, 24, 12, 27, 59, 74, 61, 68, 128, 202, 220, 173, 123, 118, 142, 151, 136, 109, 86, 77, 94, 138, 184, 203, 198, 193, 189, 163, 109, 60, 49, 71, 94, 108, 123, 132, 109, 49, -5, -18, -2, 6, 8, 36, 94, 148, 167, 166, 176, 202, 224, 225, 198, 143, 84, 59, 79, 104, 97, 74, 79, 109, 122, 100, 78, 85, 104, 102, 82, 73, 90, 127, 168, 187, 160, 95, 38, 30, 62, 89, 85, 67, 52, 43, 37, 42, 56, 64, 60, 68, 117, 194, 249, 244, 198, 165, 177, 199, 185, 137, 111, 137, 181, 189, 156, 124, 116, 124, 135, 154, 176, 182, 169, 167, 187, 205, 198, 178, 169, 161, 134, 101, 101, 136, 166, 170, 174, 205, 233, 209, 140, 87, 90, 122, 127, 90, 44, 14, 2, 8, 46, 108, 152, 147, 120, 109, 111, 90, 52, 53, 118, 197, 222, 193, 160, 147, 129, 87, 45, 46, 92, 141, 150, 122, 96, 99, 111, 95, 52, 23, 39, 79, 100, 96, 89, 88, 80, 62, 50, 58, 72, 82, 91, 104, 108, 83, 36, 3, 17, 70, 121, 135, 117, 95, 87, 84, 82, 87, 97, 91, 58, 30, 42, 86, 118, 108, 71, 44, 40, 45, 39, 19, 5, 18, 54, 83, 82, 58, 42, 46, 54, 48, 33, 28, 43, 62, 61, 34, 13, 28, 66, 84, 61, 23, 0, -13, -34, -57, -62, -49, -35, -28, -22, -15, -5, 20, 64, 104, 117, 107, 87, 57, 15, -9, 4, 32, 36, 20, 21, 40, 42, 22, 13, 29, 47, 61, 89, 123, 118, 63, 16, 22, 57, 78, 88, 106, 113, 76, 17, -10, 6, 33, 34, 9, -24, -42, -22, 24, 58, 57, 57, 90, 140, 164, 161]
-524A61KJ7Rrj3j9l1k7ML3K9J2RQnj0J1K7Ql4m8k9rmrj2j0JK2K9J3oj2j1j7k2nJ9K9K0Nrj7
-529A00oJ0%l1l6NM2K5j5j3K3M1K4Kpj8k1%L4M2K2jk1m5n2j5L1K7j9l3QL8Qm5n9l2rooQL5
-534C5N6M5Lk7qL3L6MqNpn1n2J2N8J1o3n6K5O9L3k4l6j7%%qk5k9oK5K9Prooj1NL1J9l5n9j0
-539a2N2N1j0m2qL6M1K1K2M1L1j3n0m7j8%kkJ0J9J3QJ5K1lm1n5k6J1J9%j7j0RJ8Nj7k5oK5
-544F4M4K7j6m5l0J9N3L8rl4j6Pkk9k4K4O2N0Jl1l4l3m1l9oL3L7Pj2LK5K1rk9k5j2nPL0M6
-549A17L4Jk0j5npk4l8l3j4J0L4L7J0l7o3m1QL5J5j4j4J6L9M0K8J8Nj6j8NK5Jn4p9m7J2M3
-553fL9M0N2M3mm4l4LJ3opJ4J3k6n4k9RJ3nQM4N2J5k7m1l0qJ9L6L3J6Rjl1n6l1L3O5K8l0n3
-558G4m1j9PL3L5Oj9j7qj0lK4M2J6k5l8k9k8k8lK8L0J6K0K8Ml6l5J2M8L8Mk4l8l3lL4M6L5
$$ y = [161, 163, 180, 189, 180, 167, 148, 117, 90, 94, 127, 156, 168, 177, 185, 180, 170, 181, 208, 216, 182, 134, 105, 96, 92, 83, 71, 61, 62, 84, 113, 126, 120, 108, 97, 80, 58, 53, 72, 101, 121, 126, 117, 100, 94, 104, 104, 73, 37, 42, 84, 109, 94, 81, 104, 145, 169, 171, 164, 146, 125, 125, 159, 201, 223, 222, 201, 156, 104, 89, 120, 147, 128, 95, 103, 141, 149, 104, 45, 13, 4, -2, -8, 0, 35, 91, 136, 139, 112, 104, 137, 173, 177, 169, 174, 167, 116, 64, 76, 134, 145, 82, 26, 51, 120, 153, 129, 93, 76, 76, 76, 68, 43, 14, 8, 33, 62, 69, 60, 54, 48, 37, 42, 73, 92, 57, -2, -12, 40, 91, 81, 39, 31, 67, 108, 129, 151, 192, 223, 210, 160, 113, 95, 95, 93, 91, 101, 120, 133, 141, 156, 177, 174, 133, 78, 52, 63, 82, 82, 65, 55, 64, 82, 87, 70, 45, 39, 64, 108, 135, 119, 74, 44, 63, 116, 154, 145, 111, 95, 102, 100, 71, 47, 71, 133, 183, 184, 153, 119, 86, 45, 6, 0, 33, 70, 77, 65, 68, 93, 114, 105, 76, 51, 39, 34, 41, 71, 117, 151, 152, 132, 117, 112, 105, 81, 43, 10, -4, 6, 40, 77, 87, 50, -13, -54, -46, -11, 4, -10, -24, -8, 31, 71, 99, 117, 122, 106, 88, 93, 118, 119, 65, -14, -61, -49, -6, 33, 73, 125, 168, 164, 120, 86, 89, 102, 96, 89, 103, 116, 90, 36, 7, 16, 29, 24, 32, 76, 128, 143, 116, 75, 45, 37, 56, 92, 125, 141, 150, 149, 118, 62, 31, 64, 129, 157, 127, 74, 33, 14, 21, 54, 89, 95, 76, 59, 51, 41, 38, 62, 104, 120, 95, 57, 28, 0, -28, -31, -3, 27, 43, 63, 91, 95, 59, 24, 36, 84, 122, 126, 102, 64, 31, 28, 62, 108, 143]
-563A43K6J3j6l3MN8M6k7n4MN6K4m0m9j6mj2jJ3j3m9l3K0L1j0l4nK2Nj6JK4Ol4m6j9J8M7N1
-568A01K6j4k4LK4Lk9k8kQKQK2J3j6k9j5jMRJ4Jk5k7oNqj2J1L1K4J0J3J9Mj0%J1mk0kK5J0
-573A29l8m5jL1J0j5KL8M1K3J7Rl2p7o3NM4J3m1m9mM3O4M5jm3n0k5Jlk2k2LL5M9L1Jj9j4k
-578F8j0l7m4j1M6P9N8J1j9j4OJ3MJJ1J2jj3nRNmPK3J1k7m8l3j1j0j7j1pk0l0qM0P8O7J3m6
-583A36o6k7L5N9K1l1m1pL1M5L7J5rk6k3j3j1j1nK%j1j0J1L3L7J2k2m4m3k9j1J2L8N1K8j7
-588A46m6l4kK0K7K6J7jk0l0l3k4%K5L3J8kj3j9j4RK8Pl2l3J3L8Pk5oK6J1k4j1L0L1j9m6k0
-592E8J2J1%MLrpJ9L4J2k6l7k1PL5L8jn4n6pK4rm7l0K1M2L0K0J8Mj1%K3J5j5k6pLj7l8l4j5
-598c4J1L1K7j6n2l2K5M2Qj2K3O5M9Jj9qj4m0l9%K7J9J0K4L3%m4m3LM2M1J7jj3k3k9k4kK9
$$ y = [143, 169, 182, 166, 133, 137, 195, 241, 214, 160, 164, 220, 244, 204, 155, 139, 135, 123, 122, 135, 122, 73, 40, 60, 91, 81, 47, 42, 64, 69, 53, 54, 78, 84, 50, 4, -15, 3, 50, 101, 127, 113, 89, 92, 116, 119, 90, 62, 60, 68, 70, 78, 100, 113, 97, 68, 53, 52, 56, 65, 79, 80, 55, 28, 22, 27, 19, 7, 18, 49, 73, 83, 96, 115, 119, 109, 109, 120, 116, 96, 94, 119, 129, 91, 46, 45, 76, 86, 71, 73, 111, 152, 175, 192, 201, 169, 92, 29, 34, 78, 91, 50, 1, -3, 40, 104, 149, 148, 105, 55, 30, 31, 28, 6, -16, -13, 22, 71, 102, 103, 84, 70, 68, 58, 21, -23, -34, 12, 91, 149, 160, 141, 127, 133, 146, 150, 151, 162, 174, 173, 160, 155, 164, 169, 165, 172, 195, 206, 179, 131, 98, 87, 77, 60, 49, 42, 22, -8, -16, 24, 102, 169, 182, 136, 70, 43, 78, 137, 158, 127, 86, 79, 110, 155, 192, 207, 198, 172, 149, 136, 125, 114, 109, 111, 111, 100, 90, 101, 134, 171, 183, 161, 117, 74, 45, 34, 46, 84, 135, 163, 146, 100, 66, 64, 84, 111, 137, 154, 153, 133, 103, 70, 46, 46, 71, 104, 122, 120, 107, 88, 74, 83, 111, 118, 86, 53, 66, 104, 111, 86, 80, 106, 117, 93, 82, 112, 143, 124, 78, 58, 70, 81, 81, 85, 88, 79, 72, 91, 125, 137, 111, 74, 53, 60, 95, 133, 132, 78, 22, 15, 39, 30, -17, -47, -26, 16, 46, 66, 84, 88, 77, 77, 100, 115, 100, 74, 67, 70, 53, 15, -19, -34, -23, 8, 35, 19, -33, -65, -40, 2, 10, -2, 21, 86, 135, 136, 117, 109, 95, 55, 16, 16, 43, 62, 72, 96, 129, 129, 85, 42, 45, 87, 128, 145, 144, 131, 108, 79, 55, 53, 82]
-602H2M9L3k0p5p6k1L5M9K0mlMnk5l1j4Njk8l6MN9P4L5qk1j7k3k4nJ5RrJK9L6Qk0k5j3jRJ1
-608F2JrkJ2Kk2k3J4N4N1Rl6n7m3kL6M5K3oj6j0J1L8M1Km0l6J2L5Ok6j4J2J3%LJ5Nj3mK7M0
-613B10K2jj1j3j2j1k0l8m9l3kK2L0K1ql8k9K0N5K8k8m9k8j5k2j2L5P7O2Kn1n9l4mLqj3kJ5
-618A2K5L0M0L9J3k2m2l6j2K5N4M1j4n4l1K5M6J6k1k5j1OK0K3QMK6N0K7l1o0l9n%j5k0j1l
-622G8mj9l9k8J2M1J4l1k6J3K2j2k1J6M2J7j2mLk0k4J7M5np5p6pM8N5M6M3K9RLKj3k6kL2K2
-627A65k7n6m8l6k9RO7Q3L0k2j9J0Qk0l1j7qj2pMKj3j4NJ9J5J5L4M7J5m0n6j3L0J3l1l0K1
-632F3M7J5j8oK2J5qrKj0k4nJ9km4l0L8P4L8%RK1j5n7m6JJ6j2k9j4QJ0PPMLJ6L8L4Kk5j8J
-637A38Jj1pJ2J7j0m0m2j1K4L9L2Pl0n2l2J9M5J4l5m1kL5L6K7K6K1Jk1l0l1k9j6OK0J8J3J3
$$ y = [82, 131, 164, 144, 69, -7, -28, 7, 56, 76, 72, 69, 73, 68, 43, 12, -2, 3, 2, -26, -62, -58, 1, 75, 110, 102, 81, 64, 41, 17, 12, 27, 36, 27, 28, 57, 93, 101, 81, 56, 43, 42, 51, 62, 63, 54, 52, 64, 66, 44, 21, 35, 89, 140, 149, 113, 56, 13, 11, 47, 92, 115, 109, 93, 83, 94, 132, 173, 175, 135, 99, 111, 146, 152, 126, 112, 124, 137, 137, 140, 155, 160, 147, 143, 170, 210, 232, 231, 220, 207, 195, 184, 164, 126, 77, 44, 42, 64, 94, 115, 107, 69, 40, 60, 115, 143, 115, 66, 38, 23, 1, -11, 24, 101, 163, 165, 114, 55, 21, 17, 20, 12, -1, -3, 12, 37, 67, 107, 146, 159, 137, 95, 59, 47, 72, 126, 167, 153, 99, 68, 93, 139, 155, 134, 109, 98, 104, 124, 147, 155, 159, 185, 235, 262, 231, 171, 132, 127, 127, 112, 92, 81, 78, 74, 55, 16, -12, 0, 41, 55, 24, -2, 11, 33, 21, 0, 16, 58, 75, 63, 59, 62, 42, 18, 35, 80, 75, 0, -76, -83, -35, 20, 66, 109, 138, 147, 150, 152, 139, 113, 111, 143, 165, 138, 82, 34, -2, -31, -22, 45, 128, 158, 136, 117, 127, 135, 115, 84, 67, 59, 47, 40, 44, 46, 33, 19, 24, 43, 58, 73, 107, 154, 169, 129, 73, 60, 90, 103, 72, 42, 63, 110, 125, 107, 101, 123, 138, 130, 121, 123, 113, 89, 84, 103, 101, 57, 27, 65, 139, 177, 177, 186, 207, 192, 135, 89, 90, 106, 94, 65, 51, 59, 69, 76, 83, 87, 90, 106, 144, 178, 180, 155, 137, 138, 139, 128, 121, 133, 150, 140, 100, 58, 47, 71, 110, 142, 149, 119, 67, 35, 54, 99, 113, 78, 37, 35, 70, 106, 133, 159, 180, 181, 160, 130, 99, 70, 54, 60, 80, 98, 111, 124]
-642A24J8K2K7K1kk7k5j0k0n4o1j8J6J1oQK4%l0rM2N0Jk9MM2K4k0k8MK4Mk1j3J7L7K3j1l9
-646A20m0j9RK7K1j6o2p1k9K3K9KJM2P3M8ol3k6j1OL0L2j1o2n7nK6ll7j8K9M9K2j4l0k2lJ5
-651B9J6%mJ7K9nn8n8%N1M8J5%OMj5m0o0o8l4L3Q1O7J0l3m5m4k9RM6M1Lj8jK2K5K2K6J3k4
-656G7n7m8j5J0J0J%J1K8L3J2j5j6J7L7K0qj9j4j2lJ5K4Oj6j2NRJ1L5O1M3j4m5k6J1J5ok7
-661A38l1j9MK8K8pm2m2j3Qmk5k7rQPMK0M7M9Qm5o7m5qK3L9M0K1rk5j0K5N1M7J7j2k0k0k8
-666A04l6k0J0J5j4l4j0L0M3L5K7J5qj7J2L7Qm9n6nK5qn5n0j6%j1lL5O7N6Ol4l2%K0Oj1RM5
-671A36M4mn1n3k3JJ0J3QOJ8L5K2k4m7j5K6J6j6j2L0M4Pl1k9j8l2n1l6%J5%rJ7N2O1L6Qml
-676A47nj1j1rolpj8k9k1LJ4nk8j7RJ3j2k3ML9N1L6J5qk2j8lnk8k9OL4Kn5n9MP1P8K9k7m8
$$ y = [124, 142, 164, 191, 212, 210, 183, 158, 148, 128, 74, 13, -5, 11, 22, 16, 24, 48, 48, 18, 9, 51, 101, 102, 73, 77, 119, 143, 123, 95, 99, 123, 127, 106, 93, 110, 147, 170, 159, 120, 80, 61, 70, 97, 118, 102, 40, -31, -60, -37, -8, -6, -5, 37, 110, 158, 152, 119, 93, 82, 88, 118, 150, 139, 77, 20, 15, 41, 38, 1, -17, 12, 61, 83, 69, 39, 17, 14, 29, 45, 45, 41, 58, 87, 82, 24, -34, -34, 17, 65, 80, 80, 86, 90, 75, 35, -25, -93, -127, -94, -13, 54, 64, 31, -14, -58, -87, -78, -32, 9, 12, -6, -7, 15, 40, 62, 88, 101, 77, 20, -28, -43, -33, -23, -22, -22, -11, 17, 50, 62, 47, 31, 48, 85, 105, 97, 78, 64, 52, 49, 64, 88, 94, 78, 66, 71, 80, 91, 126, 187, 230, 216, 171, 145, 156, 171, 165, 138, 107, 88, 92, 120, 148, 141, 99, 57, 44, 52, 48, 23, -4, -13, -5, 2, 6, 26, 73, 122, 130, 85, 18, -27, -35, -12, 27, 67, 88, 79, 54, 44, 69, 120, 167, 184, 172, 152, 132, 104, 68, 48, 58, 73, 59, 25, 15, 45, 88, 123, 150, 165, 157, 140, 152, 189, 197, 148, 92, 87, 112, 104, 49, -1, -17, -17, -28, -31, 4, 71, 127, 133, 99, 67, 67, 87, 93, 82, 91, 136, 180, 176, 125, 72, 49, 50, 60, 73, 81, 87, 105, 140, 162, 138, 91, 76, 102, 118, 102, 90, 120, 164, 171, 140, 111, 93, 61, 10, -26, -26, -11, -11, -20, -3, 49, 110, 146, 154, 150, 147, 142, 131, 120, 111, 105, 102, 95, 77, 48, 27, 30, 44, 39, 11, -6, 3, 16, 4, -19, -15, 24, 75, 111, 126, 118, 96, 78, 75, 70, 42, 13, 19, 53, 55, 0, -59, -55, 16, 94, 123, 96, 48]
-681D8l4jK2K2Nj4k2j6LK9L8L3K9K7J1j7k5QL4J4k9l7oJ6Nqj2k7n3m4RN8N2J2plj3l4l1jK1
-686F2Rj0pK0L9L2jl8n1k1K6L9po0n2J2N7L6j4k0K1N0L6Ork0m2n2k3K8N8M7J8rk3k6j6mKJ
-691I4JjKJ2J9Qj5k1kOj4k4OL8K0l4n0j0K9K7Qmj6k9j9J6K9%k5KN2N7Rl8m6k4kQPnj9k6k7
-696ak7k0nJ6L3M2M2K7J4J1Pk0o3p5l6J9M1L2K4K5K0Kk1l4l9l3j9jK2M3N9M1Jl0k1QJ8J2O
-701A20jk0l4k6j2j9l1kN7Q4L9k4m6l3k3k1jK9L7J6%QRj2k8jM7O0K3k0l1l0m7o5m6lK5J8M
-705@J3K6J9%j1pJPJ3RNJ1K6K8Mk9m3l6k4mJ7K0ok8j1K8M3K5PMnk6l2nL1M1K3lk4l0j8OJ6
-711H1Mj1j2kjqj3qNK1K5J3pj4j3j1j0%J2Nk1l6l8l9n0l5K3P3O0Lk6nJ4mk9j7J3K4K0K7M4
-716E7L1j0l4j9QJ2J2K5L4J6j5k2rpj4oJ1J0lJ0L5J8m6p3j4N3L2l3l3L6O0no8l8L4M3j3n0
$$ y = [48, 14, 13, 35, 57, 62, 48, 26, 10, 13, 42, 80, 113, 142, 169, 180, 163, 138, 146, 180, 194, 165, 128, 122, 138, 143, 135, 123, 96, 43, -1, 8, 66, 118, 130, 123, 120, 107, 73, 42, 41, 62, 71, 61, 54, 74, 113, 145, 144, 106, 55, 34, 60, 99, 92, 32, -20, -8, 49, 85, 71, 51, 72, 122, 158, 164, 155, 135, 93, 41, 18, 46, 104, 151, 169, 160, 137, 111, 95, 91, 93, 94, 95, 94, 96, 108, 127, 135, 120, 99, 97, 103, 89, 65, 71, 109, 129, 95, 45, 35, 64, 91, 99, 95, 79, 50, 31, 47, 76, 76, 51, 53, 105, 162, 171, 133, 87, 63, 61, 69, 76, 71, 52, 26, -1, -28, -48, -53, -37, -4, 38, 80, 107, 121, 132, 139, 119, 56, -19, -55, -36, 5, 37, 61, 86, 106, 108, 87, 53, 14, -19, -38, -39, -17, 26, 85, 126, 127, 97, 76, 84, 102, 114, 120, 119, 99, 65, 39, 27, 8, -23, -25, 32, 116, 155, 131, 85, 52, 29, 8, 7, 36, 73, 89, 89, 97, 106, 94, 66, 65, 112, 172, 195, 175, 144, 114, 67, 2, -44, -47, -22, -4, 0, 13, 39, 58, 58, 47, 40, 41, 48, 61, 70, 75, 86, 112, 140, 144, 115, 72, 36, 12, 8, 25, 45, 39, 11, 0, 28, 71, 96, 103, 107, 102, 76, 44, 39, 70, 111, 134, 131, 107, 77, 59, 65, 81, 85, 74, 62, 60, 59, 51, 38, 30, 35, 56, 81, 94, 87, 73, 60, 49, 39, 39, 51, 56, 35, -1, -39, -78, -128, -163, -140, -67, -7, -4, -30, -35, -21, -25, -54, -71, -58, -34, -14, 13, 57, 88, 78, 44, 25, 33, 45, 57, 82, 116, 132, 117, 95, 86, 79, 65, 59, 70, 80, 77, 87, 122, 140, 94, 21, 7, 60, 92, 59, 26, 62, 122, 117, 49, 11, 45, 88, 75, 25]
-720B5k5J6L5M2N2M0Jl5l1lOj5l0k0LRJkOJ4J0jmnlQK7K8qn2n9j8K6M0L8M1L6Pl3m3k0MKj8
-726I2l0k1kRjj6j6RL6L3Mk0j8m%oKK7M3J4m0o6l5J3L3K9L8N4L7k6p5n8OM4L4Lj0%PMlmKP
-731A29Lkj0k6m3l6MM0L2nj5PJ9mk9l3k2j1K1P0Q0K2l8l1J9K9nk3lPk0m2k2J5K0lk0j9j1o
-736C8jLL%qk1j9NK8J9j0j8ppj5RO3P3J0n3l9J9L7J2LK8L8J3j3j9k8n0n2j6J8J6KJ1K4J0j9
-741H7k8j0NPRK4L3K8Nk8n9o4k7J8L0PjK9N7M3Nj9k3k8l3j4Oll4k9J9N3K2k7k8J7L9J1k3k4
-746E2oj1l1l4j3J3K6K8K6J0j7l2j4J1J5oj4J3L7K2j5k0Jjl5m1NN0L7j2k6mJ5J8L6N4K8l3
-750A32o0l6j0j9k4QM0L1JKK8K6lj7jRpk2j7oj4k1jL8N0J3m2o8n0k3lK0N9Q4M5l6q1m5K3N8
-755F1L5rl8k8RM2L1j2k7LL5K5lj6k6n9p6l3M2N9Rl3j3L6N3L2RJOJ1%l0m5qN2O4J6k5pK3K
$$ y = [25, 0, 16, 51, 93, 145, 185, 186, 151, 120, 117, 123, 108, 78, 58, 61, 70, 71, 69, 75, 89, 99, 98, 94, 89, 86, 94, 121, 149, 141, 89, 30, 12, 38, 78, 116, 157, 193, 200, 167, 124, 104, 108, 110, 92, 62, 41, 39, 48, 47, 31, 15, 24, 60, 93, 97, 77, 59, 55, 55, 49, 51, 78, 121, 135, 95, 29, -6, 7, 40, 69, 107, 161, 198, 172, 97, 39, 45, 89, 123, 126, 116, 116, 123, 127, 124, 120, 122, 129, 132, 130, 120, 94, 51, 15, 19, 59, 91, 86, 71, 78, 97, 93, 64, 31, 9, -2, 19, 89, 169, 191, 153, 122, 141, 170, 165, 142, 139, 146, 126, 84, 62, 77, 97, 94, 74, 55, 44, 38, 37, 40, 43, 43, 35, 14, -5, 0, 28, 47, 37, 19, 12, 5, -10, -1, 62, 135, 145, 92, 53, 72, 109, 121, 124, 152, 190, 203, 190, 171, 143, 93, 41, 25, 43, 59, 61, 72, 96, 106, 87, 59, 49, 54, 61, 70, 94, 127, 155, 160, 132, 73, 9, -18, 0, 30, 37, 36, 65, 122, 165, 170, 151, 128, 100, 67, 53, 59, 56, 22, -7, 12, 65, 87, 60, 32, 49, 88, 99, 76, 52, 46, 35, 4, -30, -43, -30, -4, 24, 50, 60, 43, 11, -3, 8, 23, 17, 3, 16, 53, 75, 60, 40, 41, 40, 5, -36, -31, 19, 56, 44, 18, 14, 29, 47, 83, 137, 165, 132, 72, 36, 26, 7, -17, -9, 31, 62, 63, 65, 93, 119, 116, 99, 98, 107, 100, 78, 61, 55, 41, 20, 19, 57, 107, 120, 78, 10, -40, -63, -66, -46, 13, 97, 142, 106, 25, -20, 3, 61, 96, 87, 49, 21, 30, 72, 103, 91, 64, 67, 102, 127, 124, 108, 82, 23, -53, -86, -44, 15, 24, -9, -22, 14, 67, 99, 108, 109, 115, 126, 126, 96, 51, 43, 95, 159, 175, 150, 143, 166, 168]
-760A68m9o0j5M1O3M4ln1o6l6mpk5kN2P4L3k3l4jJ9Nj8j7PK1J2JQK5K0j4m5m3j6OOj2l6m7
-765a9l2RL7K9Kj0JJ8K2J0qj7kK7L6J0j8j3J1K1J7K5L0Ql1m4k6j6l6m3j4K0K3KoKNJmj6l9
-770b8m1NN9O1J0l0j6J8K4Jj7j3kJ1K7L8K6j2m6m4j3J4J0lPL1L1Jk1j5mj8l8k3QJ3%KL0L8
-775H1Nk2%L8K6l3o9l5K6N4K3k6m0lM8O2J9l4m0NM7M0kl1k0NJ5Poj5k0j3PK7J9j1k7j1Mj4
-780H6l9k5K1L5nm2k3L3N6K6j7l4k3kRKj4j9rkj4k7qK6K9Lj3LK5K8K0J7Pj8m4n2m3k1QL5M0
-785A5K2KKRMJJ0J1j9n6m9PN7O0K6JJKqj3JJ4mm0m6j3J4Nj0J1M1K3l2m3J1N9M7Q%J1ol5l3
-790F8pKpjJ9K0ORK6K0j8l9k0Lnk8l0mK2K4om3l9J5O1M1k9o0j8L7N6M8L8J9j5l1j2Oj1l7k9
-795E1OK5J5OJ3K2J7qm3o4m5j0Kj5j2J8K7nl4j6Nrk0K4P3N0k1l4K0M7no7o4k0J1J8K2K4K4
$$ y = [168, 119, 59, 44, 85, 148, 192, 189, 138, 72, 36, 32, 25, 0, -2, 50, 124, 157, 134, 100, 99, 118, 123, 105, 88, 95, 116, 128, 129, 137, 162, 182, 168, 123, 80, 64, 70, 76, 64, 28, -19, -51, -42, -5, 24, 26, 16, 17, 35, 57, 67, 59, 42, 40, 67, 103, 113, 95, 82, 93, 114, 131, 156, 186, 194, 163, 119, 93, 77, 41, -2, -16, 4, 27, 29, 23, 25, 30, 31, 27, 11, -28, -69, -64, -5, 56, 66, 36, 20, 38, 62, 63, 46, 33, 31, 42, 69, 107, 133, 121, 75, 31, 18, 32, 42, 39, 46, 77, 108, 109, 88, 73, 69, 51, 13, -10, -2, 11, 11, 13, 43, 81, 86, 64, 64, 102, 128, 95, 26, -9, 17, 71, 94, 68, 28, 25, 73, 135, 154, 120, 80, 85, 132, 172, 170, 139, 119, 124, 139, 146, 140, 125, 105, 92, 99, 126, 145, 134, 107, 96, 100, 86, 47, 22, 43, 78, 73, 31, 8, 41, 97, 123, 106, 72, 49, 47, 56, 58, 44, 25, 16, 14, 0, -27, -35, -9, 20, 23, 10, 13, 38, 66, 86, 103, 110, 92, 48, -4, -47, -68, -60, -25, 15, 37, 39, 41, 50, 54, 55, 65, 76, 57, 1, -48, -41, 16, 76, 102, 103, 104, 106, 98, 85, 86, 100, 96, 56, 10, -3, 11, 16, 6, 17, 58, 81, 49, 6, 17, 76, 123, 131, 131, 142, 136, 101, 68, 61, 63, 56, 55, 74, 94, 100, 109, 135, 155, 137, 98, 78, 81, 76, 48, 18, 14, 36, 60, 54, 11, -28, -13, 48, 89, 60, 0, -18, 19, 75, 123, 161, 180, 165, 134, 122, 128, 117, 80, 51, 57, 82, 97, 103, 116, 138, 155, 147, 104, 40, -5, -15, -13, -28, -40, -22, 5, 0, -34, -50, -45, -54, -74, -50, 23, 73, 52, 18, 38, 85, 80, 13, -51, -71, -60, -42, -20, 4, 28]
-800B8L6N6N4J1l4n1n1n1l4RM2L5Oj0j9l7m7k3J9L7K2LkJK0M8N6K9pj8j9l5n5l3K3O5M9Kk9
-805I6k8j3rk0k5%L8M7J8j7j8JQRK5M1K4j5k6JJ8kk2pK1J8j2l3l4l6m0k3QK6J9OJ3K0Qj3j2
-810F0RJ3j6m8m7k7qPK9N0M0PpJ4K7Lk8k1J4L4K3Ooj8k9k5j3j4k5j6J5L5J7rmK4L5J3j8k8
-815F8j1RQj0j9jL0M2K3nk2l1l8k5J5N3M8kn0m6kK3Ml0k5QJ9rk9%L7K5k2k9K3O1L7j0k1qp
-820H1j7j0nk5m8k9J7K8mk8j4LJ0K4M7L7j6m2jM4Nq0j00k2O5P6L2Knqj4nMJj0j2JJ4J7Qj6
-825Em7n6j4M8P1M5Jj7j2j1j5qJ4L0J3k3m0j8K5M2K5J0K3L9K2rj8nrk9k4J9M4J3l8m6j4Nj
-830D0j0nj0k6k7kK3K4J8J9J7LnPJ6rm7m2J3N4K9l1n5k5Mnk8j9J2K4LqJ6N5Q1O5J1n8r0n5
-834b3J5N0K8mlNj1k3OM0J9l6n0KN9O5L6%k9m4k1K5M3J2j9j4nl5p1n6nL7M7M8L3qn2n6l0j9
$$ y = [28, 64, 120, 174, 185, 151, 100, 49, -2, -36, -27, 15, 50, 56, 46, 27, -10, -57, -80, -61, -24, -2, 1, -1, 0, 20, 68, 124, 153, 146, 128, 109, 74, 19, -14, 9, 74, 123, 125, 96, 68, 55, 46, 26, 1, 1, 39, 86, 104, 87, 69, 70, 78, 87, 112, 153, 177, 162, 136, 137, 155, 153, 131, 124, 145, 163, 151, 118, 84, 48, 8, -15, -7, 19, 38, 44, 57, 77, 85, 72, 60, 69, 82, 66, 18, -29, -56, -64, -57, -28, 22, 62, 69, 62, 76, 103, 106, 78, 57, 71, 105, 128, 134, 128, 110, 81, 56, 43, 29, 4, -12, 3, 38, 55, 46, 42, 66, 101, 114, 96, 68, 57, 66, 74, 64, 45, 44, 74, 116, 139, 134, 112, 81, 43, 18, 33, 86, 134, 132, 82, 36, 34, 57, 61, 31, 6, 14, 33, 24, -5, -5, 32, 57, 35, 6, 29, 90, 127, 117, 96, 88, 81, 64, 54, 49, 24, -24, -53, -36, -8, -12, -40, -54, -51, -41, -17, 30, 67, 51, 9, 8, 52, 57, -23, -123, -145, -80, -4, 28, 30, 25, 17, 3, -2, 2, 3, -7, -19, -18, -4, 13, 21, 5, -42, -98, -112, -64, 7, 52, 53, 36, 24, 13, -2, -10, 4, 34, 47, 24, -16, -34, -9, 33, 58, 68, 91, 130, 152, 143, 125, 120, 111, 82, 58, 77, 121, 134, 96, 50, 36, 41, 40, 30, 25, 15, -11, -38, -40, -17, 7, 25, 44, 61, 64, 59, 66, 82, 73, 26, -16, -3, 51, 80, 49, -6, -31, -27, -32, -60, -79, -67, -43, -40, -48, -32, 23, 104, 169, 180, 122, 32, -23, -8, 42, 70, 66, 63, 68, 57, 34, 40, 80, 99, 63, 13, 15, 74, 139, 175, 175, 146, 102, 81, 106, 149, 161, 142, 128, 123, 88, 17, -39, -44, -7, 40, 88, 121, 113, 61, 5, -25, -44]
-839d4k1KM4N5K3jJ4K6Kl0k6oj3k5%L9M5Pj3jLj4j3L0N8K1l9m5mJ1k3n4l3LOj4j1K3M5M4L1
-844A02K3Kk5l5j1K1K4Q%Jmk0j7J0L4K2j5l6k4J1L8L7Rk9m6k7PRk9o7n5J1O8O2J0l4l1OL6
-849D6L4Oj6qJ9L6K2mj4nMOmk8n5n3j0L5L2j6l9j5J7J3%OJ1j1l2oM0M1mk4J2M7K8j3k2NK6
-854A07K1Qkj2k1k5k1j3LK0K3Jk4k9j9j3pOK7K8%k7k4J3M5L6ol9l4j0mj3kL2M0jm0j7M1N5
-859A03Mm0k2K1K6j0l7k5PK3J7Kj1j4j0llrj6j2jJ5J9QkJQll4n1l1QK5Nj9j4J3L1K0pj4RL5
-864A2M0J9kqj5k2j3K3N6M4Kj6J2L9J5m0n9k7O%k3j7J9M5L6Jk9l9k5JJ5PrpJ3K9L9M5M5K0
-869B32k3m7l4j4k6n9o5l0J4L2K0J1J7L0K7Kk3k3kPj9n8o8m0NM0O3O6L6j5m7l6j0NRK2L7L4
-874G0J8J5K1Ql0m6j8J8J0k7l6MM1K7j8m7l7j9%J7K7J2j1j0K2M1J5k1j6K3M2K6PPMj6k6jK6
$$ y = [-44, -65, -63, -19, 36, 59, 58, 72, 98, 100, 70, 44, 38, 25, 0, 0, 39, 84, 91, 78, 77, 80, 66, 53, 83, 141, 162, 123, 78, 74, 85, 62, 8, -25, -22, -16, -30, -41, -18, 27, 71, 102, 125, 127, 102, 67, 56, 77, 101, 109, 109, 110, 106, 86, 69, 79, 113, 135, 120, 84, 60, 71, 109, 146, 155, 126, 80, 53, 60, 69, 40, -27, -82, -71, -3, 59, 69, 35, 4, 10, 46, 80, 86, 70, 62, 81, 117, 139, 135, 121, 116, 120, 126, 122, 94, 39, -14, -24, 11, 43, 27, -12, -27, -10, 3, 3, 9, 20, 9, -23, -29, 11, 52, 48, 24, 36, 83, 111, 98, 76, 81, 107, 128, 136, 134, 122, 101, 76, 55, 42, 45, 65, 88, 89, 65, 36, 17, 4, -3, 3, 30, 58, 58, 31, 7, 20, 65, 101, 95, 56, 22, 12, 8, -5, -7, 25, 65, 64, 24, 7, 48, 103, 107, 67, 45, 66, 92, 82, 45, 20, 27, 50, 67, 69, 58, 44, 34, 31, 28, 19, 3, -9, -10, 5, 24, 32, 30, 31, 39, 36, 2, -49, -80, -72, -47, -42, -61, -75, -62, -31, -11, -18, -32, -23, 12, 52, 71, 69, 61, 46, 24, 11, 34, 90, 134, 136, 120, 132, 171, 186, 146, 87, 60, 66, 66, 43, 26, 45, 90, 126, 127, 98, 59, 34, 35, 50, 57, 48, 41, 54, 83, 122, 167, 212, 232, 209, 162, 128, 114, 88, 29, -36, -66, -52, -20, 0, 11, 28, 58, 85, 87, 64, 41, 39, 46, 27, -31, -99, -139, -134, -94, -31, 35, 71, 56, 9, -27, -37, -32, -23, -1, 36, 70, 88, 103, 124, 132, 102, 56, 38, 56, 66, 39, 3, 7, 48, 75, 57, 10, -27, -46, -46, -29, -2, 10, -1, -11, 11, 52, 67, 46, 30, 53, 95, 121, 128, 135, 139, 123, 97, 96, 122]
-879A22J8k0m2l4j5poKJ2K7L5K6nl7m3k4kJ6K8J8j5l4KN9O4J2k8k2j1l4m8rL5K3j7rL4L5j9
-883H7m6kM1J9k5k1K7M6K7ORRj1l2l8l4k0KJ7RonKkj1OL2L3QOL6M6np0p3k1K1J4q%K1K1j1
-889A04l7k0K4M5J8l0m7k1J6K5QnKJ4Mk7m2qM9O4J6l9l7LJ4k1m2j6K1K4J1K1L3Rl9n5j7L9
-893F1O5M5oo0p9m6QM5N1M1L0J8ml0m7m7k3MJ0pj9j2rk2j6L6Q7O9j1o7m8OL4K3pl2l9j9RJ3
-898Ej6l9j6L3N6M5K5J7J1j5m7n7k6K3O1O2L2mk7l1j6QJ3j0k6rJ2j1n8n7RO3L7k7m5j0K3J8
-903FQPQMPJ6Mk9m1j6J3J1mKK3K0j1k6%L4L2Jj3MJ6Kj8k0poj9k2j5j4l1m5k7K2P0Q2M8ql9
-908B9j8K2L1rm6m3j4LjKK6M8M9K8%j5j2qj6k8j8J4L1J0k3k4LJ5lj6JK0km6o4k8K6N2M6L4
-913E6K2Roj6j7k6l7k7J6M6K6j9k7K1O9P3M1Kl7o8o6l0nk3m8k8K4N0L4Qmo%J2J2oj9kK6K4
$$ y = [122, 140, 120, 78, 44, 29, 22, 16, 18, 30, 57, 92, 118, 113, 76, 33, 9, 7, 23, 51, 69, 54, 20, 22, 81, 145, 157, 129, 107, 96, 62, 14, 5, 40, 63, 46, 37, 71, 106, 87, 41, 39, 80, 99, 74, 53, 80, 126, 153, 159, 168, 177, 166, 134, 96, 62, 42, 44, 61, 70, 64, 59, 61, 59, 48, 54, 86, 119, 127, 133, 169, 215, 210, 140, 67, 46, 67, 81, 73, 73, 94, 115, 104, 67, 47, 71, 116, 134, 104, 57, 36, 52, 77, 85, 80, 82, 96, 100, 73, 31, 23, 72, 136, 152, 113, 76, 79, 93, 72, 30, 14, 35, 59, 70, 91, 124, 133, 94, 39, 22, 61, 126, 171, 165, 105, 26, -20, -12, 33, 84, 125, 155, 173, 169, 139, 92, 45, 22, 26, 36, 29, 10, -2, -11, -33, -49, -13, 74, 143, 132, 65, 17, 23, 57, 80, 73, 41, 2, -17, -8, 5, -11, -50, -66, -33, 23, 68, 93, 110, 121, 106, 59, 2, -24, -1, 60, 122, 154, 150, 123, 92, 76, 84, 97, 87, 61, 52, 64, 53, -5, -62, -53, 10, 47, 20, -25, -35, -12, 6, 14, 21, 29, 33, 40, 56, 60, 31, -10, -26, -13, -2, -6, -4, 19, 39, 28, 2, 2, 36, 68, 69, 56, 60, 76, 78, 60, 40, 33, 27, 8, -14, -29, -43, -74, -119, -146, -124, -54, 28, 76, 68, 29, 11, 33, 64, 55, 9, -34, -48, -45, -46, -44, -18, 30, 79, 107, 107, 92, 80, 72, 56, 28, 10, 24, 55, 65, 42, 18, 21, 36, 33, 17, 18, 38, 36, -10, -74, -102, -76, -24, 22, 56, 78, 87, 81, 65, 48, 22, -15, -42, -26, 20, 46, 27, 0, 21, 90, 163, 204, 206, 169, 101, 35, 5, 0, -23, -71, -99, -75, -25, 9, 17, 13, 7, 7, 19, 31, 25, 6, 4, 30, 54]
-918E4MPL0K7j2m6m8k8kL7O6L7m0r0p3k1QJ8L4N0M0J7OLj3l1k6%K2K4J4mk1k2nOKjJ1J8nk8
-923A9k2qj6l9m3k7k0j6QM2N1L6K8L5L0%j3QL4K8jk5l7m4l6nK5J9j9m2j6L4N0K2j3j2Ppm7
$$ y = [54, 58, 65, 95, 122, 110, 64, 16, -12, -14, 23, 89, 126, 86, -4, -77, -98, -90, -72, -38, 12, 52, 69, 75, 78, 65, 34, 8, 8, 30, 54, 68, 64, 43, 21, 16, 22, 24, 23, 34, 52, 47, 19, -3, -11, -27, -66, -109, -136, -156, -172, -164, -122, -71, -35, -7, 28, 58, 58, 45, 53, 87, 115, 114, 89, 52, 8, -28, -33, -8, 11, -8, -50, -66, -32, 18, 40, 27, 15, 22, 15, -32]
$$ [...]
-1605C57
##END=	
##END=	
