##TITLE=	0SACfbFpRNKhEQPSzV7dwA.43.ser
TM-VI-136solid hmbc

##JCAMP-DX=	6.0	$$ MestReNova 14.3.0-30573
##DATA TYPE=	LINK
##BLOCK_ID=	1
##BLOCKS=	2    
##ORIGIN=	Mestrelab Research S.L.
##OWNER=	hrzepa
##$MNOVA/LINK_BLOCK_TYPE=	ITEM	$$ NMR Spectrum
##$MNOVA/ITEM/POLYGON=	(XY..XY)
5321,5835
8722,5835
8722,8208
5321,8208
5321,5835
##$MNOVA/ITEM/Z=	0
##$MNOVA/ITEM/ANGLE=	0
##TITLE=	0SACfbFpRNKhEQPSzV7dwA.43.ser
##JCAMP-DX=	6.0	$$ MestReNova 14.3.0-30573
##BLOCK_ID=	2
##DATA TYPE=	MNOVA NMR VIEW DATA
##DATA CLASS=	MNOVA VIEW DATA
##$MNOVA/2D/THRESHOLD=	5.187335968017578125
##$MNOVA/ITEM/ZOOM/X=	-0.47893103590269503478,	14.508270000071124883
##$MNOVA/ITEM/ZOOM/Y=	-9.5608721214139968936,	250.07129999451962021
##END=	
##TITLE=	0SACfbFpRNKhEQPSzV7dwA.43.ser
##JCAMP-DX=	6.0	$$ MestReNova 14.3.0-30573
##BLOCK_ID=	3
##DATA TYPE=	nD NMR SPECTRUM
##DATA CLASS=	NTUPLES
##NUMDIM=	2
##ORIGIN=	Bruker BioSpin GmbH
##OWNER=	nmr
##.OBSERVE FREQUENCY=	400.20280139999999847
##.OBSERVE NUCLEUS=	^1H
##.SOLVENT NAME=	CDCl3
##.PULSE SEQUENCE=	hmbcgplpndqf
##LONGDATE=	2021/10/25 23:14:28.000
##.ACQUISITIONMODE=	SIMULTANEOUS (DQD)
##$ORIGINAL FORMAT=	Bruker XWIN-NMR
##$MNOVA/SCALES_VERSION=	9
##$PARAMETER FILE=	(acqu2s, ASCII, /private/var/folders/f6/rjf_tdyn2v98c5c0wvkgn4s80000gn/T/0SACfbFpRNKhEQPSzV7dwA/43/acqu2s, 0)
$$ ##TITLE= Parameter file, TOPSPIN		Version 3.2
$$ ##JCAMPDX= 5.0
$$ ##DATATYPE= Parameter Values
$$ ##NPOINTS= 129	$$ modification sequence number
$$ ##ORIGIN= Bruker BioSpin GmbH
$$ ##OWNER= nmr
$$ $$ 2021-10-25 23:34:04.731 +0100  nmr@CZC2439F63
$$ $$ /opt/topspin/data/agmb/nmr/Oct25-2021/43/acqu2s
$$ $$ process /opt/topspin3.2/prog/mod/go
$$ ##$ACQT0= 0
$$ ##$BF1= 100.63037
$$ ##$FnMODE= 1
$$ ##$NUC1= <13C>
$$ ##$NusJSP= 0
$$ ##$NusT2= 1
$$ ##$NusTD= 128
$$ ##$O1= 12075.7644147886
$$ ##$SFO1= 100.642445764415
$$ ##$SW= 260.109045168497
$$ ##$SW_h= 26178.0104712042
$$ ##$TD= 128
$$ ##END=
$$ 
##$PARAMETER FILE=	(acqus, ASCII, /private/var/folders/f6/rjf_tdyn2v98c5c0wvkgn4s80000gn/T/0SACfbFpRNKhEQPSzV7dwA/43/acqus, 0)
$$ ##TITLE= Parameter file, TOPSPIN		Version 3.2
$$ ##JCAMPDX= 5.0
$$ ##DATATYPE= Parameter Values
$$ ##NPOINTS= 12	$$ modification sequence number
$$ ##ORIGIN= Bruker BioSpin GmbH
$$ ##OWNER= nmr
$$ $$ 2021-10-25 23:34:08.199 +0100  nmr@CZC2439F63
$$ $$ /opt/topspin/data/agmb/nmr/Oct25-2021/43/acqus
$$ $$ process /opt/topspin3.2/prog/mod/shimcntl
$$ ##$ACQT0= 1000000
$$ ##$AMP= (0..31)
$$ 100 100 100 100 100 100 100 100 100 100 100 100 100 100 100 100 100 100
$$ 100 100 100 100 100 100 100 100 100 100 100 100 100 100
$$ ##$AMPCOIL= (0..19)
$$ 0 0 0 0 0 0 0 0 0 0 0 0 0 0 0 0 0 0 0 0
$$ ##$ANAVPT= -1
$$ ##$AQSEQ= 0
$$ ##$AQ_mod= 3
$$ ##$AUNM= <au_zg>
$$ ##$AUTOPOS= <51 >
$$ ##$BF1= 400.2
$$ ##$BF2= 100.63037
$$ ##$BF3= 400.2
$$ ##$BF4= 400.2
$$ ##$BF5= 400.2
$$ ##$BF6= 400.2
$$ ##$BF7= 400.2
$$ ##$BF8= 400.2
$$ ##$BYTORDA= 0
$$ ##$CAGPARS= (0..11)
$$ 0 0 0 0 0 0 0 0 0 0 0 0
$$ ##$CFDGTYP= 0
$$ ##$CFRGTYP= 9
$$ ##$CHEMSTR= <none>
$$ [...]
$$ 0 0 0 0
$$ ##$ShimPowMaxUC= (0..63)
$$ 130000 130000 130000 130000 130000 130000 130000 130000 130000 130000 130000
$$ 130000 130000 130000 130000 130000 130000 130000 130000 130000 0 0 0 0
$$ 0 0 0 0 0 0 0 0 0 0 0 0 0 0 0 0 0 0 0 0 0 0 0 0 0 0 0 0 0 0 0 0 0 0 0 0
$$ 0 0 0 0
$$ ##$ShimPowMaxUG= (0..63)
$$ 524287 524287 524287 524287 524287 524287 524287 524287 524287 524287 524287
$$ 524287 524287 524287 524287 524287 524287 524287 524287 524287 0 0 0 0
$$ 0 0 0 0 0 0 0 0 0 0 0 0 0 0 0 0 0 0 0 0 0 0 0 0 0 0 0 0 0 0 0 0 0 0 0 0
$$ 0 0 0 0
$$ ##$ShimPowRcbType= 3
$$ ##$ShimPowRes= (0..63)
$$ 1e-20 1e-20 1e-20 1e-20 1e-20 1e-20 1e-20 1e-20 1e-20 1e-20 1e-20 1e-20
$$ 1e-20 1e-20 1e-20 1e-20 1e-20 1e-20 1e-20 1e-20 0 0 0 0 0 0 0 0 0 0 0 0
$$ 0 0 0 0 0 0 0 0 0 0 0 0 0 0 0 0 0 0 0 0 0 0 0 0 0 0 0 0 0 0 0 0
$$ ##$ShimPowRng0= (0..63)
$$ 1 1 1 1 1 1 1 1 1 1 1 1 1 1 1 1 1 1 1 1 0 0 0 0 0 0 0 0 0 0 0 0 0 0 0 0
$$ 0 0 0 0 0 0 0 0 0 0 0 0 0 0 0 0 0 0 0 0 0 0 0 0 0 0 0 0
$$ ##$ShimPowRng1= (0..63)
$$ 1 1 1 1 1 1 1 1 1 1 1 1 1 1 1 1 1 1 1 1 0 0 0 0 0 0 0 0 0 0 0 0 0 0 0 0
$$ 0 0 0 0 0 0 0 0 0 0 0 0 0 0 0 0 0 0 0 0 0 0 0 0 0 0 0 0
$$ ##$ShimPowRng2= (0..63)
$$ 1 1 1 1 1 1 1 1 1 1 1 1 1 1 1 1 1 1 1 1 0 0 0 0 0 0 0 0 0 0 0 0 0 0 0 0
$$ 0 0 0 0 0 0 0 0 0 0 0 0 0 0 0 0 0 0 0 0 0 0 0 0 0 0 0 0
$$ ##$ShimPowRng3= (0..63)
$$ 1 1 1 1 1 1 1 1 1 1 1 1 1 1 1 1 1 1 1 1 0 0 0 0 0 0 0 0 0 0 0 0 0 0 0 0
$$ 0 0 0 0 0 0 0 0 0 0 0 0 0 0 0 0 0 0 0 0 0 0 0 0 0 0 0 0
$$ ##$ShimSysFunc= (0..63)
$$ 1 2 3 4 5 7 9 11 15 16 8 10 12 14 6 17 13 18 19 20 0 0 0 0 0 0 0 0 0 0
$$ 0 0 0 0 0 0 0 0 0 0 0 0 0 0 0 0 0 0 0 0 0 0 0 0 0 0 0 0 0 0 0 0 0 0
$$ ##$ShimSysMatrix= 0
$$ ##$ShimSysType= 1
$$ ##$TFXNUM= 0
$$ ##$TRIPLO2= 0
$$ ##$VTU= 2
$$ ##$VTUETH= <149.236.99.20>
$$ ##$VTUTY= <no>
$$ ##$WBREFAM= (0..15)
$$ 135.5 97.7 100 100 100 100 100 100 100 100 100 100 100 100 100 100
$$ ##$WBREFLM= (0..15)
$$ 0 0 0 0 0 0 0 0 0 0 0 0 0 0 0 0
$$ ##$WBREFPH= (0..15)
$$ 72.26 -67.22 0 0 0 0 0 0 0 0 0 0 0 0 0 0
$$ ##$WBSGU= (0..15)
$$ 0 0 0 0 0 0 0 0 0 0 0 0 0 0 0 0
$$ ##$XFAC= 2
$$ ##END=
$$ 
##$DECIM=	3328
##$DSPFVS=	20
##.ACQUISITIONSCHEME=	NOT PHASESENSITIVE
##NTUPLES=	nD NMR SPECTRUM
##VAR_NAME=	FREQUENCY1,	FREQUENCY2,	SPECTRUM
##SYMBOL=	F1,	F2,	Y
##.NUCLEUS=	13C,	1H
##.OBSERVE FREQUENCY=	100.64244576441500101,	400.20280139999999847
##VAR_TYPE=	INDEPENDENT,	INDEPENDENT,	DEPENDENT
##VAR_FORM=	AFFN,	AFFN,	ASDF
##VAR_DIM=	512,	512,	262144
##UNITS=	HZ,	HZ,	ARBITRARY UNITS
##FIRST=	25164.767445380970457,	5806.2096540000038658,	0.093690223991870880127
##LAST=	-962.11409912165936476,	-191.66820056731904742,	0.69905149936676025391
##MIN=	-962.11409912165936476,	-191.66820056731904742,	0.00067582994233816862106
##MAX=	25164.767445380970457,	5806.2096540000038658,	63.423122406005859375
##FACTOR=	1,	1,	0.0033463442019353939819
##PAGE=	F1=25164.8
##FIRST=	25164.767445380970457,	5806.2096540000038658,	0.093690223991870880127
##DATA TABLE=	(F2++(Y..Y)), PROFILE
$$ [...]
##PAGE=	F1=6349.32
##FIRST=	25164.767445380970457,	5806.2096540000038658,	0.23535172641277313232
##DATA TABLE=	(F2++(Y..Y)), PROFILE
4691 30 120 162 161 258 228 38 161 140 130 73 78 169 211 58 82 182 47 90 98 135 71 45 38 69 164 73 79 136 11 100 146 153 146 164 153 164
4269 164 187 193 190 100 206 168 256 85 183 326 125 124 225 254 113 83 27 75 76 94 111 141 15 120 95 175 184 163 69 179 240 173 143
3881 143 165 199 136 119 116 180 93 158 215 212 171 340 280 87 113 114 136 61 35 110 74 57 59 126 274 198 182 113 84 255 149 176 1 198
3482 198 149 16 101 62 110 295 190 87 137 300 201 89 180 73 140 259 54 147 70 108 115 93 77 138 225 72 110 183 80 171
3130 171 192 73 87 157 50 76 70 106 293 102 105 21 124 184 155 50 82 47 71 130 35 165 217 8 96 63 77 115 41 109 42 67
2754 67 71 166 98 108 80 14 30 105 268 234 93 71 181 108 146 163 43 337 197 136 143 280 125 174 195 92 186 43 204 231 55
2391 55 132 251 135 126 20 58 124 96 140 85 275 186 101 126 29 41 64 54 91 86 196 283 362 190 32 66 124 167 106 92 72 95 174
2003 174 85 201 59 154 124 182 215 136 164 241 152 22 60 133 97 110 41 113 79 208 302 163 93 217 11 212 88 179 183 120 149
1639 149 127 208 88 256 244 58 126 251 206 223 301 203 144 191 93 100 248 213 135 105 203 33 22 249 164 105 121 258 214 104 203
1276 203 98 161 167 195 307 238 57 59 129 105 27 132 9 124 245 70 327 337 165 84 156 134 202 227 143 104 245 206 171 114
923 114 159 135 202 120 41 172 29 246 89 222 147 79 218 100 188 26 112 49 38 183 72 98 105 102 27 148 118 245 294 172
571 172 94 144 135 100 124 54 366 388 156 104 246 261 48 122 193 211 98 83 46 141 311 121 215 52 83 91 187 191 274 341 161 53
196 53 87 92 105 71 102 96 215 108 29 5 211 369 233 48 100 55 104 61 219 167 249 210 170 200 104 81 104 42 107 62 63 50 149
-192A49
##PAGE=	F1=6247.06
##FIRST=	25164.767445380970457,	5806.2096540000038658,	0.27047589421272277832
##DATA TABLE=	(F2++(Y..Y)), PROFILE
5806 216 43 133 231 90 51 59 92 14 290 244 46 92 209 219 115 206 246 226 13 183 279 244 110 45 34 243 201 129 130 91 54
5442 54 208 96 37 65 145 109 67 100 87 82 77 1 252 223 86 23 275 264 55 317 200 131 183 194 354 257 182 117 70 56 237
5078 237 250 171 120 43 65 42 42 142 83 82 73 130 85 26 153 223 32 130 31 71 85 14 71 127 56 134 224 313 225 131 240 144 58 73
4679 73 123 125 209 200 16 163 164 103 43 88 127 188 29 120 217 22 116 103 116 60 61 35 30 142 57 108 163 44 59 144 151 149 140 183 162 121
4257 121 194 189 86 158 157 268 127 163 307 118 130 226 267 125 157 46 55 73 138 155 67 55 128 112 150 155 192 84 183 234 182 155 171
3870 171 178 71 112 114 190 120 163 187 199 211 335 239 87 96 132 142 14 11 76 86 58 84 170 281 145 160 149 89 244 130 167 4
3494 4 206 182 26 155 89 108 223 186 116 106 254 224 110 167 72 114 225 21 183 122 116 113 60 43 136 236 107 140 211 116 186
3130 186 208 155 43 144 88 68 66 127 270 120 76 28 111 177 154 46 87 70 111 129 31 199 240 19 84 71 71 136 86 124 103 82
2754 82 88 181 172 196 177 80 30 104 276 239 143 72 178 121 146 170 39 309 223 98 215 298 133 163 118 24 128 27 125 161 76 191
2379 191 304 129 137 72 107 143 76 171 109 275 151 119 122 26 4 37 73 130 80 174 248 336 169 25 49 84 179 108 60 82 98 189 67
1992 67 191 65 155 99 143 183 138 138 229 185 45 128 162 55 113 57 141 108 242 291 172 102 167 45 186 103 150 164 110 134 89 180
1616 180 136 290 257 73 69 265 166 190 321 236 184 195 87 107 298 225 72 117 171 38 38 280 229 155 104 188 190 74 176 54
1264 54 121 181 210 250 214 24 66 108 144 69 97 52 69 209 81 405 399 153 36 188 186 214 231 168 112 262 194 200 87 142 153 252
888 252 157 15 105 16 248 72 223 157 134 276 102 262 48 87 72 48 113 57 83 138 140 115 94 80 228 256 152 116 103 125 143
524 143 141 72 333 367 141 126 287 272 21 160 258 255 123 70 71 167 346 155 197 63 89 108 154 132 221 327 202 40 92 117 66
160 66 83 84 107 171 74 70 67 228 362 260 69 83 22 122 123 240 161 251 218 252 192 60 51 115 67 112 74 52 60 161
-192A61
##PAGE=	F1=6144.81
##FIRST=	25164.767445380970457,	5806.2096540000038658,	0.34899660944938659668
##DATA TABLE=	(F2++(Y..Y)), PROFILE
5806 189 52 129 254 97 63 60 95 61 267 229 7 92 186 203 114 171 173 126 74 184 293 248 96 23 42 217 220 172 140 101 49 186
5431 186 88 77 49 103 102 59 151 112 68 129 37 178 168 94 44 303 268 29 281 220 148 213 156 326 293 184 115 75 67 252 267 170
5055 170 150 5 72 60 57 168 90 58 83 128 70 70 183 202 34 173 86 105 67 106 155 136 39 127 266 339 213 132 199 124 97 53
4679 53 93 107 155 149 25 161 193 110 39 102 92 148 20 162 236 31 117 93 92 44 100 46 6 123 33 143 180 76 20 137 150 153
4304 153 136 195 142 77 188 181 86 106 144 264 173 135 288 114 135 201 252 138 232 86 51 78 178 214 89 105 110 114 121 138 219 120 201
3916 201 202 160 155 176 143 27 112 91 187 142 167 142 170 249 311 183 77 68 143 128 40 56 49 87 58 118 190 257 90 167 161 89 224 112
3517 112 148 6 190 194 57 197 109 136 127 147 128 78 212 223 130 149 77 68 161 43 194 170 129 106 50 64 133 225 132 156 220 156 176
3130 176 195 189 24 114 127 81 50 152 242 125 90 65 92 183 140 48 98 73 134 124 55 212 256 48 66 84 61 151 119 147 151 109 98
2743 98 224 249 259 233 130 26 104 268 237 175 74 153 129 148 177 75 268 230 53 274 296 117 137 38 82 62 27 69 85 102
2391 102 238 324 99 134 132 158 148 53 207 156 266 125 132 114 60 53 27 98 160 100 168 191 264 124 69 84 40 162 143 134 119 105 205
2003 205 46 175 71 131 58 125 156 135 113 187 204 92 179 201 135 149 85 160 132 246 255 176 90 102 86 165 115 137 135 108 107 44 141 165
1604 165 299 265 115 38 269 130 160 319 264 222 188 81 103 305 230 49 121 145 43 71 287 267 190 80 121 157 41 135 4
1264 4 85 191 210 177 203 81 127 94 168 113 68 88 50 163 102 460 442 174 20 217 222 218 214 187 121 260 171 212 52 110 144 277
888 277 182 54 51 40 248 58 216 168 170 299 104 321 88 74 101 68 23 51 78 151 171 188 72 53 213 219 140 134 69 133 182 159
513 159 106 275 319 112 154 297 262 43 212 294 265 154 125 94 175 343 150 159 60 116 117 95 57 141 278 242 103 85 131 41 88
149 88 103 115 107 58 130 108 226 321 256 84 47 10 158 169 233 187 246 226 299 166 22 28 116 69 97 87 33 62 172
-192A72
##PAGE=	F1=6042.55
##FIRST=	25164.767445380970457,	5806.2096540000038658,	0.24004726111888885498
##DATA TABLE=	(F2++(Y..Y)), PROFILE
5806 156 73 130 262 98 84 54 119 93 215 197 46 104 139 171 104 112 99 46 161 197 303 252 78 79 60 176 208 188 144 122 37 166
5431 166 118 97 41 42 87 55 206 135 129 175 58 90 109 106 85 303 246 64 219 246 189 243 111 286 324 184 115 91 77 263 274 165
5055 165 175 55 82 94 77 191 114 62 92 104 62 113 209 168 81 196 134 166 85 217 232 152 60 128 283 336 183 130 150 130 128 60
4679 60 80 105 97 83 71 157 219 135 68 120 69 106 66 198 236 49 90 64 80 35 147 65 6 109 34 166 180 105 62 120 149 155 157 192
4280 192 109 64 169 169 99 66 132 250 201 105 273 121 148 148 208 149 291 130 63 94 200 255 150 133 78 101 106 139 236 154 206 154
3905 154 113 144 178 116 55 98 49 159 150 164 91 137 282 270 119 75 59 146 93 73 101 26 71 64 150 183 209 51 180 151 89 206 115
3517 115 121 20 157 186 91 218 128 171 55 84 120 55 174 199 149 137 86 22 82 85 182 205 148 103 80 103 134 186 142 163 214 191 151
3130 151 141 162 34 68 152 99 30 177 198 110 118 94 66 199 131 53 112 66 141 117 81 205 267 85 61 93 59 154 130 160 180 155 98
2743 98 259 297 283 239 152 34 102 243 238 185 72 117 133 157 181 116 225 214 47 308 282 93 103 54 185 40 47 84 10 132 265
2379 265 305 54 120 186 190 148 38 236 199 253 110 129 132 118 91 31 119 177 129 167 124 151 66 112 129 16 122 174 210 154 111 215
2003 215 24 155 77 83 37 130 149 133 111 130 219 133 201 219 209 194 133 168 152 220 206 173 57 32 120 154 124 144 112 115 82 16 106 182
1604 182 281 260 134 36 265 109 142 295 280 251 176 82 93 274 216 83 126 130 54 88 268 267 187 41 103 133 8 86 43 72 185
1240 185 197 101 205 123 188 105 182 144 51 108 74 118 135 484 455 206 47 252 247 208 178 204 130 242 132 202 52 69 115 278 195
876 195 88 71 81 252 63 203 167 180 285 108 362 125 73 118 100 72 44 83 142 193 230 117 55 197 198 143 141 64 162 218 176
513 176 135 218 260 88 176 276 234 55 241 300 246 170 182 134 150 307 112 106 53 143 112 21 47 47 204 272 174 75 128 66 87 146 124
125 124 39 99 183 121 210 253 226 108 62 35 189 193 206 240 233 229 300 125 16 20 103 55 78 102 36 54 175
-192A75
##PAGE=	F1=5940.29
##FIRST=	25164.767445380970457,	5806.2096540000038658,	0.12128761410713195801
##DATA TABLE=	(F2++(Y..Y)), PROFILE
5806 126 78 132 254 88 100 37 134 106 144 162 79 119 75 127 102 75 86 92 237 214 305 260 57 126 83 127 163 170 139 147 22 175 150
5419 150 92 78 46 66 55 246 152 203 205 62 13 80 118 121 277 211 110 146 281 241 267 83 248 342 179 121 111 87 263 271 162
5055 162 193 104 95 126 102 203 145 97 96 65 77 147 224 132 102 194 173 234 98 303 283 157 92 140 266 302 147 125 102 161 148 62 82
4668 82 105 40 12 111 151 234 159 95 140 59 80 114 217 218 59 42 10 97 36 185 83 10 102 59 176 160 127 115 97 149 153 188 186 72
4269 72 60 146 157 117 48 123 225 193 81 262 142 167 75 144 157 327 174 88 110 192 260 190 142 85 75 120 149 239 188 181 105 54 127
3881 127 176 127 74 58 26 109 143 151 43 116 308 221 84 96 87 144 43 86 133 5 42 78 171 154 146 71 189 124 99 195 148 87 46
3494 46 128 164 122 217 148 189 100 32 100 43 140 163 162 149 98 54 1 113 150 217 171 115 119 136 137 120 137 169 199 214 132 66 90 34 19 156
3071 156 107 47 205 138 76 136 121 37 208 127 54 128 65 135 108 91 184 271 121 83 96 67 142 118 152 188 199 97 265 307 269 202
2696 202 149 53 94 206 237 181 63 80 132 167 180 147 190 177 80 311 261 76 65 116 280 119 64 127 59 160 272 250 10 98
2344 98 219 193 156 36 247 221 246 103 102 175 182 109 33 129 180 155 166 72 21 64 142 158 22 82 187 266 170 111 206 29 132 82
1968 82 20 81 134 162 135 128 75 237 164 197 208 254 235 186 173 170 173 162 163 21 30 145 154 130 166 106 125 74 51 91 191 240 237 120 57 252
1545 252 102 140 255 277 264 162 87 95 225 184 119 140 129 77 90 228 228 141 16 146 133 40 38 81 73 165 176 48 212 149 234 131
1170 131 195 154 50 110 88 83 170 475 437 234 70 287 264 185 130 223 136 207 75 172 83 32 76 258 200 109 108 119 257 81 185
806 185 142 169 243 120 383 156 78 121 137 152 36 89 127 210 240 171 84 180 195 151 133 72 196 250 189 150 198 212 94 183 234 198
430 198 54 240 280 213 168 205 194 88 250 65 67 66 150 94 55 102 41 125 284 225 77 107 97 87 182 139 56 150 219 109 189 165
55 165 181 144 131 50 200 195 173 290 213 225 259 76 22 34 80 64 70 117 62 41 167
-192A67
##PAGE=	F1=5838.03
##FIRST=	25164.767445380970457,	5806.2096540000038658,	0.50364911556243896484
##DATA TABLE=	(F2++(Y..Y)), PROFILE
5806 101 64 131 235 64 104 7 131 106 71 148 99 123 16 77 114 114 133 149 286 227 297 271 39 158 100 90 88 125 125 170 56 216
5431 216 159 66 133 123 51 61 261 158 259 214 57 65 103 131 146 235 182 137 78 315 286 278 113 237 344 169 135 130 97 246 258
5067 258 164 202 143 107 149 126 198 167 135 96 42 104 165 219 102 91 171 200 291 91 359 295 136 129 176 219 244 122 118 67 196 154 54
4679 54 92 95 56 60 137 143 234 174 105 155 53 79 155 218 186 57 32 68 138 41 205 92 26 97 84 178 130 144 155 76 150 146 207 186 41
4269 41 46 126 145 136 59 119 190 147 77 251 171 184 12 81 160 337 214 119 116 152 228 199 145 139 43 151 153 233 229 134 65 3 108 168 164 66
3846 66 11 92 50 124 125 7 112 320 178 118 129 122 136 16 75 146 24 24 100 176 107 86 119 190 92 123 186 192 49 82 121 140 147 199
3447 199 165 180 153 70 80 45 107 143 167 183 115 97 71 121 109 202 185 137 153 162 140 33 120 175 182 219 134 40 11 29 53 141 101 91 237
3036 237 96 53 137 149 14 199 116 44 146 74 121 98 85 162 265 149 112 90 79 114 89 121 172 221 108 231 281 229 138 128 68
2672 68 77 160 223 167 49 45 120 166 173 164 169 126 101 285 237 62 34 154 351 201 65 159 118 180 260 175 43 76 224 166 173 40 239
2285 239 211 249 99 51 214 231 107 34 123 175 168 161 76 122 124 150 160 30 80 179 295 169 97 174 61 106 85 46 128 122 186 138 141 46
1886 46 259 180 171 174 271 269 229 176 185 119 146 154 70 74 161 154 126 196 105 132 80 83 107 196 187 195 81 82 229 104 154 206 253 258 142 90 114 175 136
1428 136 142 162 142 110 85 174 165 78 78 197 145 87 36 111 61 141 150 64 222 170 255 155 212 140 72 101 84 66 198 436 392 251 86
1041 86 308 267 153 88 243 137 160 8 139 102 27 42 226 202 113 118 149 256 104 163 91 148 189 135 384 179 81 111 167 197
689 197 38 90 129 225 222 208 122 167 198 149 110 71 220 276 194 150 218 186 119 172 190 165 60 217 246 188 158 185 259 13 188 55
313 55 91 105 133 75 121 131 111 84 273 247 91 74 112 100 199 166 106 183 233 85 167 72 143 173 196 60 184 181 149 316 185 216 192
-74 192 45 28 63 64 107 77 127 86 30 149
-192A49
##PAGE=	F1=5735.78
##FIRST=	25164.767445380970457,	5806.2096540000038658,	0.66912657022476196289
##DATA TABLE=	(F2++(Y..Y)), PROFILE
5806 83 37 124 215 31 97 32 112 111 48 160 106 104 66 28 123 156 164 173 296 228 276 280 34 171 104 93 2 82 106 189 113 269 139 30
5407 30 184 189 58 76 244 152 279 199 50 107 134 141 157 191 177 141 35 333 307 274 175 266 324 163 157 148 98 212 235 171 200 166 113
5020 113 161 137 177 173 163 97 79 123 160 191 81 54 137 213 325 67 387 270 85 173 232 157 170 119 113 57 222 151 43 101 73 130
4644 130 124 147 132 213 177 94 162 47 84 182 204 151 44 88 159 187 49 203 87 44 91 104 179 101 157 177 78 156 137 201 188 31
4269 31 33 117 135 151 93 119 147 68 102 237 201 195 84 53 160 331 245 147 104 88 171 184 159 194 22 181 143 227 273 106 28 49 89
3881 89 153 197 47 84 164 41 103 94 21 113 315 150 167 156 145 123 73 47 145 48 45 127 165 51 45 165 184 65 159 171 230 11 122
3494 122 126 125 164 170 170 141 169 106 66 54 82 156 162 217 131 125 126 107 83 166 181 155 173 174 141 66 98 176 169 206 144 67 67 53 101 121 84 138 278
3036 278 134 76 128 180 17 173 93 27 159 80 103 87 81 154 247 168 133 75 82 74 54 71 139 210 133 164 229 180 68 98 71 48 111 188
2637 188 150 33 26 93 147 161 171 160 71 106 238 209 51 53 165 388 265 50 177 166 184 235 110 73 61 198 118 190 44 216
2285 216 174 254 105 29 232 249 107 43 101 171 165 154 113 231 166 133 132 72 114 154 295 160 68 118 93 79 90 101 155 92 218 140
1909 140 137 75 280 179 133 132 268 292 250 180 194 75 164 160 135 96 166 147 107 221 92 130 84 103 139 199 134 142 28 97 194 114 179
1522 179 152 210 232 116 84 132 132 80 147 185 164 145 88 116 123 117 137 228 150 134 73 140 30 126 119 100 232 193 251 165 230 101 113 87 71
1111 71 76 211 375 329 251 95 301 250 120 90 261 136 105 89 125 97 43 37 187 198 101 93 167 242 132 140 21 139 139 143 369 193
736 193 80 90 182 198 59 88 157 237 185 222 160 161 193 129 80 61 230 294 190 137 237 173 137 141 166 146 84 188 215 185 154 126 308
348 308 95 133 81 140 156 97 70 169 126 152 118 241 236 105 45 111 127 199 197 129 184 226 66 145 23 129 176 238 84 144 161 140 311
-39 311 151 204 130 77 58 100 68 154 89 126 100 18 125
-192A25
##PAGE=	F1=5633.52
##FIRST=	25164.767445380970457,	5806.2096540000038658,	0.52042120695114135742
##DATA TABLE=	(F2++(Y..Y)), PROFILE
5806 68 11 110 203 27 85 71 87 133 92 179 96 63 110 26 112 160 158 162 271 213 247 282 42 169 95 119 89 96 83 203 168 311 93
5419 93 22 219 233 78 98 196 132 259 165 48 122 148 145 155 157 190 128 47 329 295 256 238 313 281 166 182 163 84 170 206 182 186 171 108
5020 108 162 131 145 165 177 106 123 123 133 145 66 30 107 210 329 32 393 222 10 224 285 103 101 137 112 78 237 145 38 112 46
4656 46 205 177 141 116 173 166 69 161 43 90 188 185 131 25 130 245 229 65 182 66 59 85 119 174 86 170 185 107 166 134 171 183 37
4269 37 44 112 122 156 141 127 107 28 138 218 225 197 142 73 162 321 260 166 77 34 125 163 186 231 49 201 119 225 310 149 15 84 68
3881 68 137 213 61 156 227 91 93 70 35 107 291 139 192 169 147 101 122 25 136 64 58 159 151 12 35 197 171 50 203 152 253
3517 253 47 159 126 119 172 140 157 79 148 110 50 59 75 182 147 233 142 136 163 80 95 126 151 156 177 160 144 151 83 164 166 180 143 61 104 95 133
3083 133 122 76 184 324 197 104 120 214 33 144 73 17 164 75 88 80 109 165 222 181 137 55 72 28 28 20 102 171 163 85 168 137 29
2696 29 70 59 11 67 131 127 19 62 53 113 145 180 160 41 110 186 175 71 99 148 386 298 26 181 201 170 202 94 87 52 148 65 197
2308 197 54 186 126 249 121 91 224 230 140 56 68 173 143 140 143 294 167 100 89 136 149 118 271 161 27 48 114 53 102 136 152
1945 152 73 253 138 124 129 294 164 95 99 254 300 244 179 194 59 194 185 188 96 159 123 74 233 67 116 76 109 171 199 93 103 27
1569 27 88 144 127 207 102 156 188 84 68 135 93 25 136 201 184 176 107 71 156 219 179 233 136 173 101 169 14 120 82 125 239 215 223
1182 223 161 240 42 162 77 70 97 206 303 258 233 93 260 211 90 124 270 132 46 178 135 67 49 62 143 184 83 35 178 213
829 213 163 118 70 154 109 140 343 196 76 62 177 153 90 89 191 241 138 216 195 162 174 88 70 60 225 298 173 117 227 157 134
466 134 90 172 153 112 168 202 196 158 53 326 178 96 94 178 201 58 79 198 95 159 162 192 200 111 47 100 160 191 216 118 152 198 57 120
67 120 91 134 148 246 124 91 147 140 277 116 191 110 125 101 137 89 184 104 115 112 14 100
-192A00
##PAGE=	F1=5531.26
##FIRST=	25164.767445380970457,	5806.2096540000038658,	0.22299788892269134521
##DATA TABLE=	(F2++(Y..Y)), PROFILE
5806 54 42 96 202 58 77 100 67 160 126 189 68 31 128 61 79 120 119 126 217 185 213 277 54 156 93 137 154 150 58 217 207 331 40
5419 40 50 233 250 91 124 131 103 201 120 45 119 143 140 146 137 201 116 81 307 251 236 286 351 218 176 203 174 56 143 176 193 164 161 94 152
5008 152 114 113 152 177 117 151 104 94 98 54 72 94 192 301 13 387 184 82 276 318 79 92 164 111 124 252 145 45 130 47 270
4644 270 218 125 95 116 144 62 156 48 106 170 166 147 36 148 306 254 96 150 41 67 86 132 152 86 181 188 142 177 144 136 166 49 64
4257 64 106 107 150 189 142 85 121 167 194 235 194 175 89 169 317 254 171 43 77 133 152 210 247 83 209 84 224 326 215 65 118
3893 118 60 124 208 97 206 271 130 106 66 37 94 251 137 184 165 128 66 161 48 129 68 45 189 159 61 29 209 150 48 240
3541 240 134 258 93 184 111 112 168 114 139 6 100 81 19 60 82 195 125 227 142 136 182 54 121 111 95 136 160 115 155 211 85 136
3165 136 169 145 126 36 109 134 144 147 94 229 366 234 114 130 248 53 127 78 22 155 59 80 78 163 186 198 193 126 38 53 34 28 64
2778 64 86 124 187 65 113 107 57 49 33 29 33 67 103 9 113 35 73 126 198 165 66 132 145 141 112 136 120 353 296 32 173 222 144 164 113
2367 113 87 41 90 26 189 74 155 102 226 140 141 201 182 198 62 32 175 107 116 158 301 122 71 73 199 169 79 232 178 21 24 115
1992 115 35 121 146 118 104 284 132 115 184 299 143 73 85 235 293 215 171 183 65 219 213 214 78 143 84 43 223 61 88 57 98
1628 98 190 193 67 119 72 54 81 137 230 61 108 131 50 44 118 65 35 117 206 196 198 135 65 221 301 198 220 110 198 115 192 55 110 49
1229 49 142 236 227 173 145 235 35 207 74 87 115 183 229 189 200 79 196 157 67 147 265 126 21 255 149 23 47 94 98 161 75
865 75 58 183 175 190 100 145 177 102 125 308 190 72 32 153 77 129 97 218 232 84 199 222 161 141 33 98 85 209 286 144 89
501 89 184 137 109 41 200 183 128 163 209 202 158 71 306 234 85 84 198 226 37 88 208 51 136 183 136 152 109 73 92 186 183 213 76
114 76 91 156 45 89 135 137 103 223 170 64 142 138 225 90 178 124 165 140 167 116 189 116 98 130 43 80
-192H0
##PAGE=	F1=5429
##FIRST=	25164.767445380970457,	5806.2096540000038658,	0.1970290839672088623
##DATA TABLE=	(F2++(Y..Y)), PROFILE
5806 45 82 96 205 81 81 113 53 179 138 183 31 85 122 85 41 50 63 75 152 151 181 263 68 146 126 135 183 197 41 233 218 324 49
5419 49 70 227 241 85 148 78 74 120 82 47 109 125 128 135 120 196 122 117 275 183 227 316 364 148 179 213 177 40 158 159 199 140 142 75 137
5008 137 95 97 141 162 122 158 78 57 90 41 109 96 159 246 56 375 194 176 321 319 85 153 186 101 186 274 158 76 157 78 312 242
4632 242 102 80 55 120 97 151 58 133 129 150 195 72 137 327 256 142 120 51 73 105 146 112 102 188 192 166 184 166 138 159 67 75 99 91 135
4222 135 224 160 86 193 180 162 230 183 182 88 184 319 225 161 31 121 171 153 215 247 109 203 51 218 312 264 114 153 90 121 192 120
3846 120 225 288 150 132 76 29 78 202 142 145 149 91 20 189 73 128 63 18 212 195 105 14 199 124 54 257 118 251 130 189
3494 189 86 98 150 95 140 68 42 31 31 63 83 185 105 203 128 127 187 44 135 127 25 96 125 52 174 235 102 90 167 108 101 63 95 160
3095 160 135 174 124 271 394 234 105 161 273 78 129 97 42 132 38 81 84 220 210 177 204 109 32 62 75 37 123 103 107 198 119 73
2719 73 82 80 35 14 64 18 33 82 10 161 78 43 103 220 170 92 169 130 110 137 150 113 301 262 62 158 227 122 123 121 79 19 40 14 168
2308 168 101 124 122 183 146 160 172 135 251 52 22 166 62 82 155 255 47 69 106 240 171 43 190 201 66 84 96 42 144 135
1956 135 62 156 301 126 114 226 292 124 81 95 212 273 174 156 163 69 231 229 208 51 127 59 49 194 94 64 33 72 189 177 51
1592 51 171 102 19 20 138 242 37 85 71 23 16 87 79 77 101 197 191 209 159 84 270 339 195 207 91 204 112 202 82 100 72 156 214
1205 214 215 108 123 207 114 238 74 105 122 144 158 126 161 55 131 107 49 137 242 115 68 305 155 23 50 128 54 144 87 149 184
841 184 133 205 94 197 189 108 104 265 181 72 5 116 53 172 106 236 207 29 181 237 150 96 42 136 121 180 256 108 51 122 123 73
466 73 86 235 213 125 161 222 196 144 132 254 257 92 62 201 224 33 87 202 11 90 173 87 106 99 98 92 196 173 180 16 15 106 16 56
67 56 149 123 93 182 204 98 143 129 170 83 161 134 189 163 181 141 167 119 91 153 79 64
-192F4
##PAGE=	F1=5326.74
##FIRST=	25164.767445380970457,	5806.2096540000038658,	0.37779721617698669434
##DATA TABLE=	(F2++(Y..Y)), PROFILE
5806 50 119 116 206 87 97 109 45 181 127 164 59 146 102 94 55 30 21 23 88 117 158 240 89 151 181 121 173 222 70 252 198 291 93 79
5407 79 201 212 67 164 82 53 44 76 73 114 102 112 126 99 175 133 146 243 105 235 325 349 87 162 206 167 71 201 177 197 121 121 56 120
5008 120 88 100 131 134 116 147 74 45 132 33 123 98 115 173 95 356 244 259 352 294 110 220 192 73 252 304 186 125 188 104 325
4644 325 248 74 89 45 114 135 142 71 159 77 137 253 107 106 304 243 196 117 93 78 133 162 74 130 187 197 165 182 190 182 184 88 80 94 82 124
4222 124 238 176 90 231 173 124 209 164 166 73 203 316 176 135 51 135 197 152 196 242 121 186 47 202 270 281 146 179 140 134 175
3858 175 120 214 276 152 158 82 14 64 151 158 86 125 45 41 207 82 137 60 62 223 236 139 9 167 95 58 245 101 237 151 170 58
3482 58 81 122 82 171 126 15 34 89 76 71 154 100 174 105 114 183 40 131 149 66 51 79 47 185 223 120 33 149 74 84 113 80 170 112
3083 112 185 147 303 396 200 82 200 280 103 148 112 62 102 18 86 103 270 228 156 203 96 39 113 106 50 171 132 132 189 156 53
2719 53 56 90 25 41 87 17 64 77 20 201 127 37 83 231 171 102 204 140 85 128 139 154 243 205 82 138 216 120 88 108 69 19 32 27
2320 27 144 123 101 149 129 130 141 144 129 279 22 44 141 24 45 137 173 96 83 138 247 153 25 157 216 102 120 60 75 168 114 9
1945 9 198 293 124 114 245 272 107 102 121 187 243 140 143 143 64 230 223 172 22 120 84 69 156 129 81 24 38 170 149 56 219 118 63
1557 63 66 131 240 30 83 35 23 14 52 118 107 102 177 166 209 171 98 287 329 182 215 105 194 93 191 90 106 127 167 167 174 40 101 163
1158 163 192 245 73 114 117 97 94 70 122 31 96 97 49 94 201 100 106 320 148 60 64 159 18 153 99 229 178 96 202 97 214 182
783 182 110 81 214 168 76 22 75 128 214 103 249 173 35 164 241 127 53 105 163 159 141 212 79 25 86 128 61 166 266 222 105
419 105 152 225 179 116 161 182 248 101 52 191 192 29 82 183 18 35 142 68 70 85 119 96 185 156 122 50 58 66 34 51 135 91 136 154
20 154 215 141 145 109 127 95 140 127 196 163 177 159 126 107 101 171 108 52
-192E2
##PAGE=	F1=5224.49
##FIRST=	25164.767445380970457,	5806.2096540000038658,	0.46394446492195129395
##DATA TABLE=	(F2++(Y..Y)), PROFILE
5806 62 150 144 199 76 120 97 48 171 94 143 126 185 90 88 95 85 33 28 39 91 149 211 115 168 233 107 136 222 131 272 153 240 120 77
5407 77 160 173 79 175 109 46 63 96 124 144 86 97 124 83 150 130 159 214 31 249 316 312 52 121 179 141 108 240 223 188 109 104 34 109
5008 109 90 113 121 100 101 126 100 50 184 43 116 96 65 96 120 326 296 319 365 259 151 268 174 46 307 331 222 177 211 111 305
4644 305 234 44 118 90 138 154 124 91 175 51 132 298 132 63 245 232 247 148 136 82 156 175 88 159 177 197 133 169 200 228 232 103
4269 103 91 98 92 132 229 184 84 233 146 86 179 134 135 52 220 299 115 93 65 116 198 136 158 239 121 161 74 174 209 268 152 184 187
3881 187 158 169 105 184 238 145 171 82 29 54 105 186 39 97 17 101 217 74 160 70 126 220 258 161 32 121 67 52 200 79 225
3517 225 153 132 34 80 94 73 207 160 44 89 147 102 74 109 111 152 89 111 173 21 114 163 136 61 38 95 175 188 127 42 115 66 82 149
3118 149 81 164 81 174 152 316 368 145 56 232 263 126 173 108 58 92 4 92 132 306 236 131 182 95 50 173 125 69 206 155 154
2754 154 159 155 48 28 95 13 66 96 29 85 92 27 231 164 40 75 224 163 92 222 156 65 75 120 215 191 141 88 109 188 129 72 87 56
2355 56 64 45 65 131 133 101 160 88 92 87 116 153 273 28 60 103 33 30 106 101 208 95 143 216 119 31 136 221 122 125 31 120 192 109 73 218
1933 218 258 125 105 235 238 87 118 153 163 201 124 144 131 56 219 198 118 4 125 122 73 119 146 128 46 21 143 117 88 247 119
1569 119 108 123 128 224 25 77 58 35 36 25 148 128 115 154 120 196 166 104 271 285 179 240 136 171 65 162 78 133 175 172 98 104 69 89
1170 89 116 259 230 76 118 113 59 45 18 87 36 95 123 78 34 145 85 125 298 127 77 78 182 11 180 95 280 166 70 179 97
806 97 195 158 103 58 156 153 87 43 42 186 249 81 257 140 86 148 237 106 71 156 173 195 93 161 86 77 121 150 90 233 284 200 73
419 73 133 212 152 83 147 108 217 100 69 170 142 58 84 155 20 21 110 84 48 90 140 99 151 130 51 101 112 57 95 98 109 46 174 168 200
8 200 168 147 73 108 115 118 106 190 142 158 162 77 81 118 175 118 41
-192D1
##PAGE=	F1=5122.23
##FIRST=	25164.767445380970457,	5806.2096540000038658,	0.44088929891586303711
##DATA TABLE=	(F2++(Y..Y)), PROFILE
5806 72 169 168 181 52 141 90 64 160 50 133 192 192 98 73 122 101 34 61 21 73 152 180 145 183 269 101 108 196 199 288 109 178 124 64 106
5395 106 133 138 192 118 46 107 115 184 192 90 84 127 92 135 105 148 187 34 257 293 263 48 70 135 97 126 258 278 174 100 91 15 108 90
4996 90 127 123 74 83 100 124 50 231 66 100 91 38 33 125 282 331 353 354 233 195 286 138 102 341 339 255 216 218 98 257 201 27 150 125
4597 125 182 144 94 114 176 84 136 316 142 30 181 241 279 193 170 81 160 179 134 173 160 193 74 144 191 253 274 105 116 110 115 156 201
4210 201 182 69 200 102 56 151 103 90 33 228 269 67 37 66 73 177 101 112 243 121 135 101 136 148 232 132 158 213 188 181 102 154
3834 154 185 139 168 77 67 55 74 216 72 69 51 153 223 64 194 92 181 211 247 170 51 70 40 32 131 58 215 137 83 15 102 94
3459 94 61 224 165 50 134 192 134 120 68 127 137 97 128 161 12 96 169 186 112 43 118 148 155 117 101 81 108 80 166 99 147 55 139 134 301
3048 301 313 85 67 248 225 142 186 70 64 133 10 95 169 327 225 98 138 103 70 225 138 94 230 168 149 111 119 51 5 102 4
2684 4 79 94 55 84 123 26 252 183 41 86 196 146 67 218 160 62 15 130 269 148 92 86 71 142 130 82 86 50 109 45 113 128 125 129
2285 129 149 93 61 9 95 166 244 87 69 71 58 57 71 128 301 116 119 156 77 39 124 217 127 100 57 171 212 131 123 218 203 128 91 204
1886 204 191 64 120 174 146 143 114 157 134 58 200 162 64 24 130 138 55 91 137 171 72 43 124 110 135 250 105 128 161 142 199 24 61
1499 61 82 40 49 24 158 144 127 141 55 173 144 116 231 236 198 260 159 143 39 124 56 158 199 170 28 22 151 93 96 307 198 88
1123 88 128 127 61 58 42 56 52 93 143 118 79 84 79 120 244 90 73 81 190 20 200 71 292 148 56 137 85 152 127 86 40 96 132 104
724 104 62 24 204 269 39 256 119 125 132 226 122 136 188 164 224 43 124 117 135 170 178 121 271 281 146 37 109 181 119 59 97 69 175
337 175 82 88 144 108 109 95 124 4 59 107 111 44 131 171 105 102 107 41 127 134 68 154 157 102 32 178 212 165 172 151 23 110 133 108 84 176 116 132
-110 132 151 35 50 132 164 104 29
-192B9
##PAGE=	F1=5019.97
##FIRST=	25164.767445380970457,	5806.2096540000038658,	0.33857735991477966309
##DATA TABLE=	(F2++(Y..Y)), PROFILE
5806 73 172 179 154 29 149 95 83 159 35 138 245 165 114 60 137 72 34 76 43 64 165 155 174 182 283 95 125 149 258 294 109
5442 109 114 115 38 49 100 201 220 109 47 120 126 238 242 112 69 129 114 134 62 110 156 78 250 262 216 67 78 96 50 121 252 321 164
5055 164 88 78 69 120 81 139 155 74 69 71 127 52 265 87 98 89 62 6 109 228 345 359 320 225 220 267 114 194 348 320 273 233 209 72
4656 72 194 156 49 176 140 228 110 58 125 162 120 136 300 136 49 168 267 278 229 192 69 141 170 169 160 143 193 4 111 165 251
4292 251 291 92 145 128 139 179 159 168 53 142 59 46 134 102 32 22 221 232 80 25 58 22 140 59 76 246 130 116 123 91 107 185
3916 185 98 105 210 213 208 131 140 144 146 147 68 108 81 72 235 117 52 77 183 225 72 232 117 218 208 202 169 63 36 12 27 65 58 207 117
3506 117 45 7 127 125 45 213 142 36 167 218 165 181 55 135 119 117 156 149 53 85 174 208 155 72 123 132 154 85 149 94 176 64 161 121
3107 121 122 50 89 94 257 243 55 108 245 175 148 175 48 170 198 27 95 205 330 195 68 79 121 100 259 157 126 241 171
2766 171 113 55 60 55 16 114 29 77 88 83 71 164 14 266 184 39 104 156 124 43 193 145 83 117 175 303 111 85 85 43 80 111 103 115
2367 115 63 146 35 155 127 101 164 124 128 93 74 110 160 218 145 75 67 77 92 49 204 357 157 76 82 38 42 117 211 124 51 92 214 225
1968 225 164 148 209 146 127 76 168 136 58 106 174 131 70 90 169 146 84 179 129 19 38 123 123 22 74 107 196 93 58 124 144 179 228 81
1569 81 121 176 170 167 46 58 88 37 51 45 150 160 130 153 38 150 112 140 181 215 229 256 159 120 30 96 39 163 192 164 80 84 230 105
1170 105 109 328 160 106 153 153 85 100 86 24 51 69 149 154 157 33 85 92 171 50 56 74 178 20 198 41 271 131 56 81 68 113 104
783 104 66 43 49 107 123 84 21 180 268 42 235 112 145 117 209 171 203 195 142 241 5 118 145 175 199 202 135 271 254 74 7 86 136
395 136 85 52 24 96 131 51 97 122 122 154 105 100 36 78 136 137 59 193 213 120 59 100 97 126 122 68 197 210 132 86 150 252 130 157 160 45
-27 45 119 142 123 70 159 110 108 133 8 41 142 153 73 14
-192A4
##PAGE=	F1=4917.71
##FIRST=	25164.767445380970457,	5806.2096540000038658,	0.19781284034252166748
##DATA TABLE=	(F2++(Y..Y)), PROFILE
5806 66 155 176 124 34 142 104 98 167 81 145 276 111 119 56 148 43 82 71 81 59 187 139 197 157 279 77 161 87 297 284 147 54
5431 54 110 2 31 73 241 248 104 53 101 130 274 281 141 52 125 124 133 33 54 116 106 230 228 183 111 144 110 66 95 232 345 160 78
5043 78 64 147 141 66 146 205 91 64 40 115 71 283 100 122 96 86 14 81 176 341 344 266 227 211 214 141 282 332 274 269 222 186 46 128
4644 128 110 83 194 141 265 70 35 110 137 136 120 253 117 80 219 289 243 243 201 47 102 147 180 122 134 200 71 72 139 229 277 64
4269 64 165 145 154 186 107 147 43 75 61 51 125 139 37 20 199 195 124 83 53 25 95 42 67 237 141 113 138 40 96 135 80 36 177
3881 177 223 238 175 145 146 163 111 55 145 122 99 232 143 70 87 182 225 97 263 137 236 218 134 164 66 49 18 67 75 73 198 118 59 23
3482 23 143 159 42 175 99 42 191 224 190 229 75 129 93 127 171 139 90 77 182 201 180 93 130 145 184 50 181 146 252 37
3130 37 134 139 89 69 40 44 193 174 70 133 225 129 142 141 136 311 258 51 89 228 316 155 65 21 151 136 274 193 163 233 164 55 43
2743 43 28 60 28 126 58 66 87 103 67 202 15 272 171 29 114 115 104 46 159 110 113 212 215 309 84 112 92 74 5 71 122 153 85 167
2344 167 34 174 117 71 190 100 161 150 145 157 148 225 192 83 85 95 125 67 261 366 205 38 19 34 41 114 204 122 13 113 238
1980 238 225 191 145 203 120 120 58 149 83 85 77 150 114 24 70 167 160 125 164 106 15 45 97 80 16 63 65 197 106 60 131 190 209 187 69 93
1557 93 171 199 132 84 87 78 32 45 73 132 179 120 183 122 138 85 170 140 230 255 223 135 113 35 94 42 145 158 155 146 163 297 114 120 320 120
1135 120 116 184 171 101 129 112 12 27 27 154 181 215 46 97 59 92 71 43 79 148 18 170 53 242 120 67 40 83 112 97 51 64
759 64 48 83 143 121 17 122 243 111 191 107 144 103 183 221 259 181 119 239 28 132 155 186 199 221 133 235 199 41 28 73 86
395 86 66 52 50 138 91 39 94 112 158 172 100 95 79 79 169 157 82 253 256 143 69 106 132 101 87 47 215 244 173 141 120 274 125 130 172 114
-27 114 124 146 149 67 142 126 95 125 5 52 153 155 49 2
-192B
##PAGE=	F1=4815.45
##FIRST=	25164.767445380970457,	5806.2096540000038658,	0.23445589840412139893
##DATA TABLE=	(F2++(Y..Y)), PROFILE
5806 51 119 163 97 57 123 112 106 172 129 143 280 55 109 55 161 112 145 45 130 54 212 135 211 108 266 39 181 43 308 254
5454 254 178 9 126 48 78 50 240 259 123 62 61 129 283 304 168 43 108 109 116 68 33 66 122 204 196 173 168 205 165 126 65 216 347
5067 347 161 86 60 233 166 52 145 250 104 68 50 111 97 282 104 163 109 90 18 56 137 324 317 199 226 165 136 191 342 301
4715 301 219 247 187 158 43 76 92 118 203 139 291 69 52 63 105 131 85 190 89 100 277 293 181 230 199 19 71 118 170 90 149
4351 149 209 123 37 134 200 239 28 169 160 156 177 54 133 41 29 101 57 114 180 114 31 169 162 157 123 53 55 51 70 80 208 137 123 150 20
3940 20 94 82 103 35 119 209 258 213 160 179 178 71 36 168 160 132 202 149 111 82 149 220 119 277 145 241 234 60 161 60 73 49 109
3553 109 124 81 184 145 93 46 146 179 63 120 47 83 209 214 201 251 99 110 62 115 159 135 109 63 192 172 187 104 150 155 217 85
3177 85 204 198 323 35 89 150 52 94 46 41 124 128 74 120 197 97 124 100 215 421 290 81 74 230 288 118 85 32 185 168 275
2813 275 241 201 202 144 27 86 84 69 39 131 86 57 87 106 82 224 52 271 155 14 107 93 87 75 142 65 140 276 222 287 76 144
2438 144 101 122 75 25 135 185 102 169 49 166 96 54 201 100 182 192 187 204 148 257 216 93 99 121 152 106 286 331 238 34 53
2074 53 59 41 115 194 130 76 115 235 208 200 116 209 132 109 30 151 44 119 52 111 92 93 111 154 170 171 160 94 42 45 62 20 50 59 29 176
1651 176 110 58 125 219 216 145 96 61 158 215 94 126 125 65 40 32 100 113 197 99 214 199 142 74 191 120 257 264 166 95 123 43 111 53 114
1240 114 116 146 180 212 345 116 108 282 80 108 205 169 112 136 112 53 22 26 178 197 241 80 109 77 29 133 48 112 107 29 126 89 237
853 237 122 83 72 130 136 98 40 83 70 71 163 178 10 61 194 179 128 95 125 88 151 252 298 156 115 214 36 141 144 167 175 233 122
466 122 170 116 108 58 67 40 72 49 109 164 60 68 82 119 178 152 76 110 119 74 193 167 102 292 286 163 107 108 137 63 60 12 204 254 204 181
43 181 144 270 143 100 186 176 122 157 167 72 127 139 95 139 23 57 168 167 63 6
-192F
##PAGE=	F1=4713.2
##FIRST=	25164.767445380970457,	5806.2096540000038658,	0.41705662012100219727
##DATA TABLE=	(F2++(Y..Y)), PROFILE
5806 37 78 149 80 77 111 118 108 165 161 130 260 70 89 51 169 194 197 13 185 44 233 144 216 59 258 24 176 99 294 204 184
5442 184 47 152 103 122 36 193 242 152 71 31 126 264 306 187 60 78 76 85 109 92 20 128 183 167 177 221 239 217 178 55 217
5078 217 330 161 118 77 307 189 52 136 272 104 81 101 139 114 263 97 212 125 71 52 43 113 300 288 129 218 90 50 224
4738 224 356 269 180 221 136 127 65 48 119 153 204 148 304 104 91 11 74 109 57 142 60 105 307 274 121 195 188 19 96 101 151 126 186
4351 186 209 143 37 151 178 192 23 155 173 144 156 41 149 49 68 136 57 94 202 187 54 139 132 171 137 54 66 25 96 93 159
3987 159 105 137 159 73 88 34 140 96 49 169 259 242 177 204 180 54 12 172 178 153 150 145 152 74 94 208 128 272 134 242 240 5 166
3600 166 47 88 71 137 151 71 162 176 120 74 140 175 91 69 13 123 216 193 196 250 117 84 47 79 118 135 103 44 196 128 183 112 177
3212 177 142 236 160 226 231 374 66 36 157 39 121 80 82 78 107 59 115 179 81 99 71 236 449 288 112 50 205 247 96 92 52 208
2837 208 187 273 290 230 149 110 88 119 128 88 54 122 103 65 77 87 97 223 94 266 147 42 81 100 71 104 165 55 162 296 187
2473 187 237 86 177 109 152 155 57 141 206 104 154 66 132 73 64 197 126 194 203 191 231 155 280 214 101 104 152 165 148 279 262 240 37
2085 37 90 81 46 113 179 144 128 100 206 177 189 70 218 149 97 29 159 32 139 74 86 66 149 188 137 174 214 166 92 71 44 52 46 75
1686 75 62 46 143 105 66 95 217 196 123 137 43 146 212 56 164 153 68 60 15 119 100 211 70 231 250 150 74 197 114 275
1334 275 252 105 64 144 59 128 61 98 112 145 176 223 371 111 72 220 45 80 207 147 127 123 88 95 87 86 217 205 235 98 115 134 42
947 42 187 53 156 82 48 80 113 261 132 99 111 178 147 98 29 92 78 77 185 251 8 92 131 228 66 72 101 69 117 263 317 136
571 136 139 170 47 138 110 130 139 241 110 93 14 179 84 62 18 82 45 142 168 41 94 65 134 173 100 36 131 146 82 202 163 114 301
184 301 288 172 133 96 116 28 76 36 167 239 215 200 210 243 153 72 198 222 115 188 168 77 114 132 105 167 50 51 181 170 84 12
-192A2
##PAGE=	F1=4610.94
##FIRST=	25164.767445380970457,	5806.2096540000038658,	0.49704757332801818848
##DATA TABLE=	(F2++(Y..Y)), PROFILE
5806 35 66 145 76 90 124 122 103 146 171 114 224 119 71 54 166 251 226 55 236 28 240 162 210 89 258 93 157 177 263 144
5454 144 163 88 170 159 158 53 113 201 174 76 65 117 220 292 196 95 39 68 58 136 143 45 128 174 139 179 255 241 246 206 67 229 302 156
5055 156 159 110 354 204 64 128 266 93 98 151 184 115 228 77 256 141 36 88 29 98 267 266 66 206 26 52 223 320 243
4715 243 172 207 83 98 100 48 158 188 200 166 306 136 135 86 50 80 91 145 35 94 297 234 108 152 174 46 148 113 141 200 231
4351 231 197 131 64 169 167 153 61 127 184 117 134 88 193 68 111 153 55 64 194 240 89 116 110 165 122 49 63 39 107 100 95 49 146 169 118
3940 118 93 61 171 136 37 107 239 261 188 200 165 83 33 154 168 151 93 147 184 77 47 185 123 248 100 245 227 37 173 47
3588 47 94 75 142 150 49 128 188 138 103 132 144 112 54 44 147 205 167 174 247 127 61 56 32 65 141 75 36 190 80 178 119 205 115 237
3189 237 228 248 237 395 86 19 163 78 144 97 103 71 88 72 198 184 87 77 64 193 377 261 138 28 163 196 81 70 42 208
2837 208 186 277 329 240 101 59 139 135 145 117 77 100 104 90 51 49 98 200 133 265 156 86 48 123 51 125 214 105 184 270 118 169 100
2449 100 212 122 150 229 115 138 210 89 129 75 83 66 75 179 157 203 182 161 233 151 271 186 106 102 179 161 185 248 176 207 25 115 99
2062 99 58 100 155 158 159 75 162 136 160 29 219 149 89 82 164 32 136 124 110 44 177 262 123 169 243 170 103 97 52 84 101 91 66 79
1663 79 114 94 82 44 183 155 134 165 46 142 191 26 192 168 89 76 15 121 99 220 36 227 263 144 73 186 106 281 225 83
1311 83 82 165 89 132 73 113 155 161 140 197 376 101 38 149 51 42 185 115 151 100 72 129 157 149 248 206 207 100 114 184 71 216 44 190
912 190 98 70 50 114 283 138 110 124 205 134 93 27 88 71 89 209 324 33 169 83 249 77 38 93 63 93 262 318 138 174
560 174 123 88 132 61 98 104 249 104 27 105 236 101 57 29 74 47 144 148 33 99 50 149 146 76 30 143 156 105 198 145 117 276 259
172 259 163 137 74 79 13 98 81 118 205 206 194 269 199 139 50 203 248 106 232 161 70 103 104 122 193 77 42 180 155 88 24
-192B4
##PAGE=	F1=4508.68
##FIRST=	25164.767445380970457,	5806.2096540000038658,	0.37071245908737182617
##DATA TABLE=	(F2++(Y..Y)), PROFILE
5806 47 102 155 85 97 153 116 91 116 159 103 184 147 62 73 155 275 228 106 270 10 229 182 195 157 265 167 147 242 228 102 120 124
5431 124 168 208 188 96 51 150 179 76 104 99 159 268 192 135 37 111 62 146 172 80 120 184 107 163 261 217 247 207 74 232 269 146 197
5043 197 147 363 210 78 133 232 78 117 187 220 99 186 47 279 153 8 108 5 102 226 254 17 192 97 118 184 243 223
4715 223 175 210 57 72 148 72 186 218 190 181 300 153 177 145 27 55 151 183 19 79 248 182 129 113 163 63 189 144 152 264 270
4351 270 179 98 84 173 160 130 97 98 188 76 123 136 245 92 136 152 55 26 154 264 129 101 103 140 83 39 55 52 100 106 31 34 145 180
3952 180 144 127 131 196 155 99 38 211 268 185 163 137 122 74 121 133 123 77 171 201 92 72 149 107 206 44 248 199 42 172 74 96
3576 96 56 121 135 55 81 171 151 127 138 87 124 65 66 153 174 141 143 262 130 50 64 49 87 152 36 48 174 41 182 123 212 90 223
3189 223 265 258 212 376 83 45 166 126 161 89 91 66 52 104 303 205 119 81 69 157 237 232 155 40 131 134 61 19 15 181 165 286 348 230
2790 230 122 8 169 139 136 155 110 67 88 118 9 17 79 166 160 269 183 122 50 144 31 134 262 160 209 213 54 101 112 247 147
2426 147 117 290 164 127 197 65 101 71 36 85 73 144 176 211 138 123 211 128 225 137 105 94 192 136 210 203 93 147 42 141 118 71 75
2038 75 122 163 167 47 130 89 124 61 203 127 87 139 174 49 110 171 158 24 176 313 111 151 254 166 124 114 63 119 137 99 66 104
1663 104 105 81 96 38 134 105 153 172 70 143 156 28 204 168 119 76 50 108 114 222 13 200 237 114 67 162 88 280 190 111 120 180
1287 180 123 120 89 135 203 190 95 148 361 88 70 90 91 51 144 93 174 91 109 151 217 213 256 201 173 90 103 208 80 213 24 204 134
900 134 92 50 94 280 131 113 108 206 102 93 40 74 69 97 231 381 67 238 114 238 136 10 108 93 91 259 305 156 203 102
548 102 142 138 43 98 80 257 109 49 212 276 98 52 32 42 55 125 110 31 86 45 162 104 145 77 138 150 126 182 127 116 226 203 139
160 139 122 50 45 18 96 118 72 166 181 162 297 152 107 32 195 257 98 272 166 44 94 65 143 208 95 41 161 123 75 46
-192D6
##PAGE=	F1=4406.42
##FIRST=	25164.767445380970457,	5806.2096540000038658,	0.098284967243671417236
##DATA TABLE=	(F2++(Y..Y)), PROFILE
5806 61 142 167 99 100 175 91 72 85 131 94 150 144 57 103 152 271 208 146 275 7 200 197 175 210 271 234 161 283 194 126 64 157 144 245
5407 245 215 147 102 114 168 72 125 70 93 240 177 172 80 154 76 144 175 100 103 211 79 120 240 177 220 185 66 215 240 137 222 178
5032 178 331 205 93 148 178 69 130 203 235 73 145 28 274 161 49 103 44 134 179 249 16 175 170 165 119 147 204 165 214 73
4679 73 58 200 113 192 241 177 180 286 157 202 164 12 45 202 215 13 80 168 125 135 86 160 68 206 175 175 299 289 163 76 85 167
4304 167 152 117 123 86 173 21 132 172 285 109 143 138 62 20 89 255 165 87 106 105 36 29 56 52 82 117 39 101 135 193 144 175 202 216 158
3893 158 150 48 189 258 160 99 112 155 117 91 97 74 117 211 202 107 108 107 89 152 34 245 168 29 155 110 102 13 81 129 96 35 124 163 140
3482 140 164 14 131 61 73 147 130 114 113 289 127 49 58 102 171 164 28 58 147 41 197 119 163 40 202 258 239 157 318 59 48
3118 48 162 163 169 60 52 37 36 104 353 222 160 109 61 186 103 207 157 73 143 70 34 65 53 134 131 294 342 209 191 79 177 147 113
2731 113 197 151 47 58 138 40 64 44 141 167 273 215 139 92 151 58 133 292 202 232 143 89 57 124 274 179 81 336 198 107 170 56
2355 56 73 58 50 115 63 95 170 212 96 131 175 93 151 73 97 79 183 97 217 157 57 77 85 181 140 76 60 81 159 157 24 130 41 110
1956 110 114 179 89 85 185 200 95 66 201 201 12 157 337 96 119 245 157 146 114 68 144 154 100 64 120 107 72 101 100 113 78 157 163
1569 163 115 139 113 49 194 156 150 53 98 83 140 219 49 155 180 64 63 130 72 275 156 135 145 182 151 92 106 143 230 219 96 105 330
1182 330 73 116 73 124 102 94 98 185 110 166 159 256 271 237 186 152 75 88 201 75 182 32 194 161 110 61 61 246 106 110 75 179 69
794 69 101 53 56 92 100 243 405 103 287 185 201 185 58 128 147 110 255 280 175 217 123 188 159 103 118 73 263 126 91 293 288 75
419 75 51 22 17 65 102 73 49 85 54 173 52 224 114 114 134 130 161 133 122 170 135 107 94 31 31 27 67 141 40 134 148 112 289 120 81
8 81 31 170 250 93 291 194 6 85 32 163 212 99 43 127 84 51 72
-192G2
##PAGE=	F1=4304.17
##FIRST=	25164.767445380970457,	5806.2096540000038658,	0.28169241547584533691
##DATA TABLE=	(F2++(Y..Y)), PROFILE
5806 71 165 168 107 96 179 43 56 65 118 78 123 110 50 131 174 255 182 171 247 20 162 202 151 231 267 283 183 292 156 185 6 186
5431 186 102 263 238 199 156 97 143 61 128 33 34 211 155 201 120 176 72 136 155 106 77 248 95 62 200 135 174 150 43 181 214
5067 214 132 230 196 265 194 112 156 112 73 135 201 226 47 110 59 240 161 82 75 90 171 128 241 39 163 228 193 47 80 179 138 205
4691 205 92 63 241 158 174 254 161 158 266 152 200 133 69 47 233 225 21 104 78 73 107 71 169 60 200 192 197 301 283 154 86 65
4316 65 162 145 108 135 99 130 45 162 195 304 111 133 118 71 54 16 216 187 72 108 65 38 35 66 42 57 136 75 152 119 204 119 218
3928 218 261 234 152 182 103 180 225 113 42 111 177 156 91 109 15 158 254 190 113 118 71 76 90 110 232 150 44 117 139 116 47 31 149
3541 149 137 70 55 175 136 203 64 137 31 72 149 98 89 99 306 116 44 45 141 251 171 52 55 114 73 217 99 53 68 180 205
3177 205 186 89 229 42 28 150 181 165 22 49 21 100 82 322 228 188 145 11 178 70 164 145 99 183 53 33 150 110 82 96
2825 96 292 312 194 253 149 171 163 97 238 198 64 29 144 87 112 33 132 152 264 241 132 131 138 120 124 298 226 240 83 142 51 140
2449 140 286 208 112 367 213 79 135 72 43 51 98 148 59 48 136 202 94 179 134 59 69 6 81 59 153 66 205 121 89 20 123 230
2074 230 162 66 86 41 146 138 25 147 5 137 160 173 48 78 212 244 157 31 211 229 40 135 337 76 73 222 152 157 99 60
1722 60 157 161 91 72 125 102 70 97 150 146 91 139 155 168 126 70 70 165 137 176 26 157 55 164 214 95 105 113 37 66 97 81 270 124
1322 124 133 152 165 166 52 116 130 232 235 137 111 284 62 142 81 139 145 55 118 176 142 211 155 265 311 201 163 156 62 80 162 65 135 63
923 63 166 170 120 63 27 196 65 105 53 135 68 112 55 49 128 99 240 389 132 317 245 154 212 111 137 203 143 243 250 184 208 160 211
536 211 185 169 135 78 261 146 122 335 270 49 55 6 70 76 100 81 85 130 76 187 13 274 135 79 117 113 144 167 142 130 74 77 63 22
137 22 33 46 25 147 25 120 115 61 247 108 86 48 131 233 86 288 231 66 78 20 179 208 88 41 87 50 30 94
-192I4
##PAGE=	F1=4201.91
##FIRST=	25164.767445380970457,	5806.2096540000038658,	0.48088321089744567871
##DATA TABLE=	(F2++(Y..Y)), PROFILE
5806 73 167 150 102 87 164 24 57 73 146 60 97 59 56 150 216 245 168 179 187 31 128 194 128 216 250 308 192 269 113 241 50 207 63
5419 63 259 255 246 173 78 109 44 116 9 16 188 137 219 150 175 47 130 119 107 47 285 160 71 152 101 119 119 11 144 189 128 218 197
5032 197 177 183 138 143 44 81 131 186 196 31 88 101 193 156 104 46 126 188 79 223 59 159 273 212 41 97 145 114 184 97 74 256
4656 256 195 136 257 147 113 242 142 164 62 142 48 240 206 44 135 41 43 49 71 185 44 175 190 212 275 254 147 103 34 173
4304 173 144 103 127 116 64 118 203 208 297 92 113 99 70 81 75 160 187 56 99 29 79 53 78 32 33 151 91 175 100 207 78 239 301
3916 301 249 141 194 139 176 169 48 91 136 188 188 119 157 44 183 288 170 106 102 64 70 28 177 204 150 85 72 154 132 107 20 181 161
3529 161 139 37 189 117 245 135 138 20 70 164 101 66 98 296 98 34 49 157 306 163 57 43 74 112 235 63 156 219 163
3189 163 116 108 80 133 73 25 129 173 148 43 108 86 169 141 245 226 195 178 99 144 176 82 121 111 216 104 63 223 159 58 74 277
2813 277 264 196 284 205 156 178 107 268 239 91 37 134 119 147 84 130 118 233 253 113 151 109 191 114 277 230 224 52 164 45 160
2449 160 281 225 182 381 208 49 110 90 7 66 146 186 65 54 85 184 126 216 100 49 25 57 54 61 106 79 179 100 119 31 142 273
2074 273 182 38 132 45 129 119 40 155 45 179 194 211 40 64 221 293 220 67 200 242 81 123 320 56 18 196 156 150 78
1733 78 45 163 172 72 97 120 79 75 88 173 190 112 104 163 209 102 34 90 124 116 192 76 219 36 178 213 144 72 75 96 73 65 110 265
1334 265 108 106 146 131 165 38 118 105 216 232 172 146 221 64 142 80 134 168 60 138 152 168 231 144 243 326 166 135 180 60 90 100
959 100 74 92 83 130 157 116 52 7 151 14 107 70 82 93 116 47 74 161 97 223 338 144 327 280 121 217 158 131 252 180 224 218
583 218 181 175 193 206 211 219 145 84 246 158 146 333 222 74 63 15 118 83 119 121 119 192 106 204 79 283 143 73 113 77 138 205 174 120
184 120 39 62 39 36 33 65 42 137 21 117 86 58 187 99 98 64 86 205 73 270 255 133 74 9 187 199 69 40 59 33 25 106
-192A06
##PAGE=	F1=4099.65
##FIRST=	25164.767445380970457,	5806.2096540000038658,	0.48510685563087463379
##DATA TABLE=	(F2++(Y..Y)), PROFILE
5806 63 151 118 87 76 139 94 71 96 194 64 63 37 88 155 266 251 176 175 106 49 113 174 112 169 221 305 180 222 73 279 95 217 71
5419 71 234 262 284 160 45 77 35 100 33 35 173 136 226 167 170 44 129 77 105 23 312 238 148 105 79 71 102 26 124 159 121 188 184 92
5020 92 178 166 105 23 87 127 168 150 43 83 131 153 145 113 57 141 172 33 190 79 162 306 230 84 129 104 112 158 87 87 240 211 98
4632 98 255 139 51 215 132 98 70 212 44 225 160 76 159 105 51 32 88 202 26 145 172 219 234 209 132 103 43 199 148 102
4280 102 98 120 63 184 238 212 269 55 87 86 59 98 148 102 165 42 78 2 110 71 90 29 13 150 88 170 82 194 43 233 317 259
3905 259 130 184 150 164 100 27 162 167 186 208 150 199 83 188 308 149 90 78 81 70 42 219 163 155 120 68 158 140 151 57 206 168
3529 168 202 107 203 87 273 186 130 86 70 180 123 49 98 258 74 41 76 146 325 138 42 36 29 155 240 21 319 357 149 22
3177 22 54 149 91 115 59 103 140 122 85 150 151 217 226 213 227 186 199 241 301 355 46 92 103 225 145 91 265 197 80 66 250 207 205 282
2778 282 236 141 182 126 281 267 107 57 108 129 165 139 124 81 179 242 101 147 83 253 111 234 213 184 63 157 65 187 265 224 242
2414 242 377 182 25 108 99 40 96 189 229 70 83 64 174 156 216 74 66 60 105 20 96 53 115 150 92 129 38 142 296 200 11 172
2038 172 83 108 108 53 152 79 209 209 271 70 45 216 334 271 114 176 243 121 119 291 45 46 179 164 126 72 41 169 200 46 131
1675 131 106 37 85 74 163 217 126 70 178 222 69 26 104 86 108 192 145 277 33 175 214 191 76 96 156 81 42 139 256 127 66
1311 66 141 87 152 79 115 80 193 215 184 170 146 85 116 65 115 172 93 157 126 183 226 140 195 310 148 110 208 69 108 25 108 79 84 93
912 93 122 100 28 8 124 58 121 101 30 115 110 40 118 183 90 194 268 138 318 284 116 204 192 111 283 207 212 188 171 127 219 181 231 243
513 243 150 81 216 151 163 297 162 128 70 24 143 83 137 155 140 242 142 222 148 259 154 123 122 32 136 222 207 123 38 71 28
149 28 59 35 72 81 115 30 108 62 95 133 84 90 68 50 167 46 250 253 189 73 23 188 188 50 41 64 35 34 105
-192A05
##PAGE=	F1=3997.39
##FIRST=	25164.767445380970457,	5806.2096540000038658,	0.3733291923999786377
##DATA TABLE=	(F2++(Y..Y)), PROFILE
5806 44 126 93 76 67 119 158 83 113 231 100 27 70 126 145 310 274 199 164 41 81 116 147 114 102 180 277 155 168 73 294 127 214
5431 214 109 194 261 311 140 26 76 58 90 39 42 163 153 220 171 179 88 128 50 98 20 319 303 214 66 70 51 95 69 125 122 107 146 168
5032 168 85 178 191 49 84 88 136 153 101 89 97 141 134 134 113 84 130 122 27 140 92 164 322 249 109 133 64 131 136 67 106 197 200 93 251
4621 251 138 23 188 123 13 172 263 42 193 91 113 172 153 68 98 113 212 9 129 146 219 193 158 108 85 89 228 155 91 58
4269 58 106 146 230 252 206 231 11 62 80 50 107 208 60 135 28 48 13 122 81 104 30 18 126 71 148 64 161 48 201 309 261
3905 261 120 154 144 140 46 92 216 189 168 214 171 217 96 179 311 131 70 86 97 78 92 228 110 152 139 114 155 134 168 78 215
3541 215 167 250 161 215 59 280 210 109 153 67 182 137 43 90 203 55 75 105 113 302 103 52 35 22 203 228 44 385 406 137
3189 137 80 85 210 145 146 90 73 90 89 113 147 203 229 237 222 235 179 205 359 483 500 147 71 76 207 158 112 268 223 113 61 214 154
2801 154 200 253 238 129 172 137 272 272 110 65 71 113 168 184 121 75 109 208 105 116 94 293 112 175 180 128 94 141 137 228 250 206 273 354
2402 354 137 9 120 100 92 123 221 271 75 88 111 189 168 174 48 96 70 131 26 138 12 140 128 91 120 19 134 287 217 58
2050 58 199 115 85 106 59 145 100 214 203 321 96 29 208 356 297 145 151 237 147 116 249 49 107 172 168 94 94 55 177 239 24
1686 24 160 82 22 97 55 125 216 144 75 179 200 36 46 102 70 114 176 201 321 44 156 216 227 89 122 191 87 44 156 239 169
1322 169 55 144 63 131 122 113 62 169 193 175 169 65 114 74 58 90 166 127 179 114 183 202 156 130 265 139 98 227 83 117 54 154
947 154 92 63 62 69 87 26 11 110 128 147 138 19 124 94 50 160 198 76 159 204 127 290 260 120 184 204 85 289 213 223 163 165 88
560 88 234 158 239 237 153 61 175 123 175 241 122 175 72 23 135 74 140 168 137 261 176 235 204 219 181 187 136 10 126 211 233 117
184 117 56 100 33 79 46 62 101 93 43 84 42 121 112 90 57 58 42 128 6 239 222 220 72 69 185 173 41 47 88 49 43 95
-192I5
##PAGE=	F1=3895.13
##FIRST=	25164.767445380970457,	5806.2096540000038658,	0.26876649260520935059
##DATA TABLE=	(F2++(Y..Y)), PROFILE
5806 20 108 103 88 70 111 207 90 116 243 139 29 90 151 121 341 303 222 149 92 125 126 120 138 40 133 233 131 130 110 290 146 201 141
5419 141 147 250 326 136 50 105 91 85 18 60 155 178 202 164 198 130 120 70 86 26 300 336 244 39 74 56 84 114 124 79 85 99 171 155
5020 155 180 207 48 137 88 159 142 84 156 121 128 124 125 107 94 97 53 72 76 93 157 316 261 121 114 55 156 126 49 135 154 161 123 246 148 85
4597 85 163 121 75 256 281 50 149 21 149 175 175 76 143 131 211 6 135 125 214 164 112 77 55 129 245 159 61 55 79 216 245 234
4222 234 188 195 57 42 82 64 114 252 56 125 23 17 19 117 81 122 35 40 81 45 124 49 112 73 151 282 252 112 107 130 106 64 142 247
3823 247 198 135 203 175 207 82 164 303 119 54 125 105 98 129 202 54 137 136 154 153 111 151 83 209 178 276 191 222 49 260 206 85
3447 85 212 59 164 134 49 76 145 67 119 124 72 240 73 109 30 79 253 194 82 287 309 127 127 92 234 206 166 108 40 50 56 123
3071 123 88 234 202 143 205 240 185 195 378 477 471 190 66 30 164 139 127 232 242 145 71 175 111 173 212 211 121 158 130 239 253 102
2696 102 62 30 77 162 212 134 107 41 156 111 63 127 297 112 112 133 69 130 137 224 281 247 173 273 313 80 10 129 101 141 143 234 304
2308 304 94 61 158 219 159 112 18 129 48 136 68 170 29 144 114 90 95 15 136 245 228 105 211 135 59 109 59 141 107 194 174
1945 174 337 103 28 203 358 294 150 136 228 154 110 194 68 166 167 161 77 126 74 187 277 31 179 51 79 106 32 71 195 181
1592 181 113 156 148 24 68 78 72 121 154 226 341 66 127 211 240 85 129 195 92 67 157 210 208 91 147 84 107 153 116 45 146 175 154
1205 154 143 42 140 37 71 67 160 158 206 120 171 171 193 73 202 122 94 227 98 104 123 196 104 25 43 5 105 77 27 106 197 182 188 64
806 64 121 77 73 186 206 51 120 166 129 250 217 109 163 193 65 270 192 247 139 175 103 237 152 227 205 149 30 135 84 185 184
442 184 129 203 70 28 95 54 128 160 110 241 202 238 236 184 227 246 145 39 99 176 247 99 92 143 50 89 56 37 94 84 47 47 27 126
43 126 118 139 44 39 49 102 44 232 169 220 70 117 182 148 49 71 117 62 43 82
-192H2
##PAGE=	F1=3792.88
##FIRST=	25164.767445380970457,	5806.2096540000038658,	0.17443889379501342773
##DATA TABLE=	(F2++(Y..Y)), PROFILE
5806 11 104 129 117 90 107 237 99 103 226 163 51 78 152 86 351 323 234 132 156 176 141 108 169 53 83 190 122 123 145 270 152
5442 152 188 152 100 228 325 144 60 129 116 75 30 104 146 200 167 150 206 149 103 115 73 39 257 327 231 26 85 52 66 157 107 37 59
5055 59 57 195 221 179 213 116 177 87 183 137 130 232 146 92 105 120 103 84 53 19 125 62 83 142 285 257 136 83 75 185 131 49 164
4668 164 152 100 153 243 164 134 140 128 150 301 262 66 96 74 179 173 172 73 154 140 197 22 152 117 202 152 81 48 19 152 244 156 19
4280 19 107 62 248 223 184 162 168 117 27 83 89 124 280 75 148 40 14 17 96 72 141 53 65 54 13 107 38 61 93 100 245 227 104 55
3881 55 118 64 100 173 255 194 89 178 160 172 48 155 291 110 47 162 105 126 149 148 23 112 113 170 153 77 108 76 191 208 280 199
3506 199 220 60 215 179 82 253 55 130 119 61 64 98 111 160 127 62 151 66 170 38 143 297 139 100 47 97 120 123 31 221 246
3142 246 184 115 5 75 26 117 21 248 144 195 300 234 193 175 250 169 192 137 72 30 106 97 133 164 253 171 103 138 80 127 174 159 116
2754 116 151 109 187 213 87 61 18 33 149 222 159 144 57 99 102 12 148 265 106 51 82 25 156 140 292 335 256 130 249 259 37
2391 37 48 123 107 179 153 222 319 132 8 176 240 133 94 34 151 8 128 103 184 33 130 105 84 63 49 151 181 226 141 207 148
2027 148 34 111 60 135 99 157 129 309 89 36 202 340 262 127 133 221 139 98 131 102 221 160 142 98 150 94 194 303 47 182
1675 182 47 131 112 8 22 164 232 152 115 83 33 88 44 67 115 149 214 331 94 100 195 225 59 116 170 91 95 145 168 226 127 137 112
1287 112 83 171 123 24 118 166 127 99 107 156 43 83 46 155 183 235 130 144 144 235 82 133 91 89 202 115 70 175 225 103 19 39 63
900 63 147 135 48 124 257 219 242 105 110 74 99 185 206 20 81 153 144 212 167 79 148 162 64 228 148 258 116 200 152 224 156 195 166 141
501 141 32 111 56 199 139 148 206 69 58 38 33 105 133 68 188 213 227 236 168 284 295 147 50 59 141 249 74 140 193 71 88 58 23
114 23 65 90 41 5 26 115 116 199 95 48 47 100 97 217 109 188 66 153 180 110 69 119 147 63 40 78
-192G8
##PAGE=	F1=3690.62
##FIRST=	25164.767445380970457,	5806.2096540000038658,	0.22431461513042449951
##DATA TABLE=	(F2++(Y..Y)), PROFILE
5806 26 113 145 139 124 99 252 113 82 191 165 52 40 125 46 338 319 230 112 194 227 173 120 195 92 35 168 123 128 161 242 149 182
5431 182 144 57 193 309 153 38 131 123 54 96 158 141 209 114 136 189 139 81 165 67 65 196 275 179 18 93 28 66 189 68 46 42
5055 42 31 219 263 174 210 178 204 75 189 132 197 300 169 36 72 115 109 66 17 67 180 136 69 125 233 232 158 53 87 209 147
4691 147 66 185 190 38 162 239 182 158 119 139 201 302 213 79 40 138 197 171 149 64 130 144 173 46 169 120 181 157 64 31 19 159
4316 159 222 144 68 161 82 235 171 112 150 152 176 24 75 104 141 297 96 176 62 33 16 71 63 157 79 88 97 49 102 37 49 105 67 206
3916 206 189 97 28 107 18 119 185 245 181 43 143 124 119 5 158 278 104 54 183 103 158 150 78 46 83 75 157 154 47 50 62 167
3541 167 248 264 195 208 74 151 141 105 271 72 98 105 75 65 65 163 190 114 100 51 76 214 82 209 323 73 94 279 247 113 94
3177 94 88 196 265 214 115 33 118 13 107 158 253 76 431 514 215 188 160 46 400 364 1 71 96 67 45 125 81 257 184 144 106
2813 106 64 87 148 95 110 156 79 124 160 65 68 45 46 130 218 180 174 112 61 80 76 145 207 96 20 41 18 159 126 321 372 270 84 215
2414 215 200 79 101 107 113 199 156 186 309 171 57 160 235 101 151 82 151 39 125 125 181 11 105 94 66 44 71 166 122 204 158 187
2038 187 163 12 103 70 118 81 124 95 239 52 48 200 309 211 76 129 214 114 77 74 150 274 157 110 134 162 120 193 311 55
1686 55 173 88 170 112 11 45 139 281 185 71 42 28 104 71 47 94 170 172 289 118 92 170 183 20 92 127 83 119 127 118 218 150 108
1299 108 123 63 178 132 50 89 172 95 66 161 159 60 77 26 143 197 255 131 106 126 270 135 72 55 75 156 130 36 203 233 91 59
923 59 42 126 187 185 60 159 297 251 288 139 97 97 124 152 195 31 58 148 151 191 119 38 141 119 87 177 90 239 99 227 196 195 151 147
524 147 155 134 66 114 57 215 108 144 180 73 95 56 38 86 100 36 120 203 205 204 166 346 333 143 54 16 138 246 52 188 242 88
149 88 83 53 59 30 97 36 40 33 105 87 242 145 89 32 112 139 190 62 135 59 167 180 70 98 179 169 47 51 86
-192H6
##PAGE=	F1=3588.36
##FIRST=	25164.767445380970457,	5806.2096540000038658,	0.31660294532775878906
##DATA TABLE=	(F2++(Y..Y)), PROFILE
5806 31 122 139 140 161 93 255 125 64 153 147 27 41 84 21 305 283 206 91 202 269 227 152 207 113 18 167 117 124 153 208 137 182 118
5419 118 23 147 277 169 26 109 111 42 165 206 146 200 46 134 149 109 70 219 65 94 127 192 102 6 93 19 107 202 19 97 49
5055 49 35 224 274 166 198 222 216 47 170 122 256 345 187 26 35 104 120 69 36 84 228 212 66 109 170 189 179 31 82 216 159
4691 159 90 192 224 77 145 232 193 155 107 148 225 267 148 86 20 178 200 170 114 57 77 154 142 78 181 125 150 171 64 33 59 152
4316 152 184 118 144 201 117 184 101 46 172 143 228 53 51 101 162 306 116 184 74 38 21 54 61 162 104 107 147 104 110 41 78 107 65 173
3916 173 145 95 47 93 34 123 184 221 163 49 107 71 54 36 173 264 101 72 188 103 190 136 15 65 57 48 126 151 54 20 51 140 284
3529 284 238 190 183 83 80 102 129 267 103 88 104 92 73 44 209 203 88 140 41 90 226 142 273 318 17 68 449 421 95 117 215
3165 215 196 268 260 121 72 141 29 109 290 262 28 541 616 181 163 154 309 997 867 148 50 153 107 43 99 5 251 177 178 82
2813 82 78 97 136 32 101 164 49 65 106 39 75 61 93 106 205 190 197 152 70 54 131 119 148 92 64 56 22 137 84 302 376 276 49 181
2414 181 145 135 159 102 111 198 155 137 277 197 120 113 201 75 206 130 121 75 139 128 166 31 84 79 34 67 78 166 109 161 158 149 185 11 82
2003 82 89 92 58 116 116 144 6 69 193 271 155 8 112 202 99 54 67 204 326 171 68 164 164 151 179 300 56 157 133 193 110
1639 110 23 77 131 319 211 36 62 2 120 133 18 69 202 126 218 131 103 140 126 38 68 79 66 137 109 72 188 158 69 111 48
1276 48 177 147 107 71 194 59 91 190 155 55 49 40 119 196 254 117 61 116 289 183 38 42 51 94 138 61 206 217 74 87 49 177
900 177 209 217 59 190 306 271 312 161 85 133 144 95 174 73 76 149 131 186 81 14 138 76 122 131 41 187 102 243 218 157 127 110
524 110 184 139 90 129 67 221 92 109 126 77 126 123 62 87 72 58 77 174 174 150 174 400 358 138 72 39 162 246 36 226 284 93
149 93 80 50 101 54 95 50 69 40 109 36 253 172 133 13 120 162 155 59 74 44 157 176 58 128 232 177 19 80 101
-192A01
##PAGE=	F1=3486.1
##FIRST=	25164.767445380970457,	5806.2096540000038658,	0.34134984016418457031
##DATA TABLE=	(F2++(Y..Y)), PROFILE
5806 29 121 122 118 191 102 245 126 63 122 126 43 95 74 33 261 213 162 67 182 296 293 192 200 115 48 169 99 106 119 170 114 174 81 28 95
5395 95 231 194 87 70 85 73 221 235 162 169 53 158 102 73 84 273 64 114 59 107 23 24 83 71 159 191 62 150 74 59 200 252
5020 252 157 177 242 215 32 125 105 294 357 202 85 13 89 123 96 64 66 259 259 80 92 110 136 187 26 74 191 155 117 186 231 145
4644 145 107 218 192 128 115 150 226 214 84 88 69 189 189 166 71 55 15 168 109 115 190 129 104 183 80 37 93 138 151 80 211 220 148 112
4245 112 31 63 210 135 272 100 14 83 185 312 138 165 66 27 29 50 66 154 123 120 170 155 126 44 95 97 78 147 108 103 50 75 88 121
3846 121 178 189 145 92 83 17 11 67 192 243 101 98 182 110 223 113 52 81 48 64 95 144 78 63 50 115 309 216 181 147 90 13 70 140
3447 140 244 131 94 117 109 75 31 243 195 52 164 104 107 202 199 325 274 53 69 272 294 54 155 270 200 255 314 135 109 135
3095 135 44 132 382 288 12 352 396 132 113 137 444 1221 1012 196 28 183 160 109 55 74 235 149 194 61 118 136 136 13 89
2754 89 166 22 53 68 18 75 62 132 79 190 186 219 175 90 36 164 81 118 102 109 93 23 104 19 244 344 269 50 152 103 173 209 129
2367 129 99 180 152 89 229 201 166 50 142 64 233 172 64 91 162 111 149 83 78 59 29 105 78 148 134 101 146 97 211 42 61 113
1992 113 80 37 134 173 73 62 101 176 235 115 73 82 180 107 51 106 255 369 197 20 178 156 180 151 274 60 140 163 199 105 27
1628 27 97 143 342 230 14 77 44 137 182 25 70 221 121 129 129 111 111 78 84 55 37 55 148 98 53 145 156 58 79 33 167 168 164 73 226
1217 226 40 139 193 150 25 8 82 102 178 225 91 42 114 288 215 43 56 18 32 135 105 187 180 57 99 62 211 206 223 46 199
853 199 282 275 310 171 79 167 153 43 155 114 118 158 80 174 53 35 136 52 163 106 43 114 127 245 212 122 95 114 221 155 96 139
477 139 65 208 87 52 48 65 146 177 81 105 59 87 99 135 142 91 187 434 365 141 105 75 180 250 29 248 310 81 83 55 133 107 81
90 81 76 79 48 122 39 229 167 163 19 118 159 124 76 19 22 133 166 81 152 260 169 27 108 115
-192A15
##PAGE=	F1=3383.84
##FIRST=	25164.767445380970457,	5806.2096540000038658,	0.28794053196907043457
##DATA TABLE=	(F2++(Y..Y)), PROFILE
5806 34 108 119 83 205 125 220 113 88 98 137 112 133 110 39 213 121 104 42 144 298 357 235 178 106 70 154 79 79 61 126 80 149 47
5419 47 56 55 172 213 146 45 57 120 250 236 183 117 138 199 71 47 113 320 74 115 15 93 44 60 68 120 199 155 132 197 105 101 152 201
5020 201 148 147 237 209 95 61 84 307 333 211 126 32 79 109 127 90 25 264 260 97 70 75 82 174 42 89 131 128 149 172 204 192 57 201
4621 201 175 86 137 142 212 162 40 94 112 173 165 156 32 63 54 181 75 153 201 133 45 182 109 33 111 121 151 41 256 220 167 50 22
4233 22 109 236 126 303 153 45 62 201 318 161 125 38 12 34 41 67 132 136 128 159 188 137 50 85 77 91 127 97 114 27 62 138 123
3846 123 167 154 130 123 75 48 65 84 205 208 102 128 174 131 255 86 86 113 69 87 80 134 92 101 62 95 324 210 161 104 99 43 60 137 209
3435 209 141 100 137 127 67 28 260 165 28 164 131 122 150 240 355 190 91 166 435 286 22 116 158 141 220 364 146 137 102 53 173
3071 173 407 331 58 448 455 132 35 75 229 639 436 40 111 171 169 176 4 124 207 104 190 39 166 165 146 32 78 157 22
2731 22 83 69 23 66 54 157 52 177 171 242 183 101 39 169 47 121 122 149 123 40 100 62 169 284 246 76 130 78 182 239 176 78
2355 78 151 149 65 176 183 190 32 74 55 226 205 25 85 179 79 136 130 81 31 92 143 82 117 149 42 130 41 236 88 77 134 102 39
1968 39 162 224 121 121 141 147 205 107 146 55 151 123 77 143 293 393 218 30 172 144 197 112 241 79 128 169 192 97 30 108 163 353
1592 353 241 46 72 98 158 198 46 93 216 150 51 115 102 76 75 118 53 3 82 155 95 65 101 152 99 40 19 144 187 204 82 256
1217 256 63 173 176 146 24 41 130 128 152 172 61 78 115 268 228 54 63 22 48 119 132 156 128 42 95 78 229 182 202 37 184 230
841 230 262 287 170 82 188 143 80 159 147 161 175 14 135 37 43 127 59 208 103 67 37 157 235 181 104 79 140 241 175 89 138 55
466 55 170 89 11 54 33 158 213 89 124 55 101 123 102 119 64 196 433 350 152 135 96 175 248 35 252 317 54 94 75 152 155 64
90 64 102 70 62 130 98 179 135 174 38 107 133 108 82 19 16 121 149 101 165 253 144 52 119 124
-192A24
##PAGE=	F1=3281.59
##FIRST=	25164.767445380970457,	5806.2096540000038658,	0.15637503564357757568
##DATA TABLE=	(F2++(Y..Y)), PROFILE
5806 56 81 145 74 200 149 179 102 138 93 184 178 136 141 30 169 41 58 34 96 270 404 276 146 95 80 120 76 50 32 77 38 105
5431 105 46 81 49 102 206 183 70 49 158 250 206 201 53 218 238 69 26 143 350 103 93 61 144 88 99 58 152 214 101 196
5078 196 229 137 160 106 135 136 118 206 207 170 7 81 295 281 207 139 65 92 75 150 118 36 239 214 106 51 82 40 146 58 120 48 83
4691 83 186 158 156 210 10 183 141 42 154 128 194 124 35 103 141 137 136 136 50 77 103 183 43 185 223 144 23 164 145 34 102 99 181
4304 181 57 272 203 175 58 49 145 239 116 320 204 95 45 204 321 177 76 25 45 34 24 59 98 148 138 119 193 131 77 57
3952 57 55 100 113 116 120 53 70 180 128 153 119 120 133 70 86 100 90 206 158 104 158 169 164 285 62 96 159 110 89 76 123 94 135 85 86 333
3529 333 217 125 61 118 81 85 133 175 126 99 156 143 53 38 260 118 61 145 131 125 102 258 355 74 133 322 1672 1349 139 75
3177 75 202 71 165 398 143 154 56 55 232 351 387 170 1559 1699 283 115 52 501 1134 1251 456 244 131 108 223 60
2872 60 155 164 60 171 12 209 174 150 25 68 139 61 106 101 29 63 68 168 33 166 145 261 179 102 63 155 38 130 143 180 139 65
2496 65 141 130 108 212 209 101 120 65 160 241 223 58 119 148 66 128 153 191 81 29 33 196 231 97 63 182 39 131 160 85 2 163
2121 163 172 88 86 135 51 118 46 254 139 118 150 134 75 192 255 191 170 184 109 183 124 203 75 121 130 105 162 308 387 216 72 145 129
1733 129 192 67 208 108 123 151 177 88 36 115 180 354 246 107 71 146 181 178 50 109 182 171 85 98 75 24 100 132 56 38 139
1369 139 161 98 77 64 150 146 33 34 115 194 217 83 274 93 180 145 140 82 80 171 190 130 111 48 116 116 230 223 59 61 69 101 93 137 122 78
947 78 24 81 94 237 149 158 56 151 165 232 252 163 92 192 113 136 187 167 196 191 82 63 34 42 105 76 252 117 80 25 181 222 130 103
548 103 93 153 232 186 82 124 51 113 94 60 154 28 175 231 94 137 50 99 115 100 103 89 190 391 312 168 148 97 148 228 53 243
172 243 303 39 115 121 154 191 60 127 50 78 124 138 118 96 163 58 89 97 106 73 39 52 142 131 102 163 208 110 54 107 128
-192A28
##PAGE=	F1=3179.33
##FIRST=	25164.767445380970457,	5806.2096540000038658,	0.11032747477293014526
##DATA TABLE=	(F2++(Y..Y)), PROFILE
5806 84 46 177 112 178 168 132 125 204 136 239 221 99 144 31 134 101 83 58 57 213 421 305 115 88 76 73 88 32 110 36 38 56 79
5419 79 101 51 23 166 190 105 69 182 224 148 211 55 275 259 75 14 169 355 140 58 109 182 118 131 62 163 202 52 244 238
5067 238 165 229 117 82 122 117 153 215 229 62 105 262 212 183 129 112 127 31 162 147 82 193 141 103 62 106 36 114 70 148 51 33 219
4679 219 151 110 193 32 164 96 27 150 112 179 105 50 108 153 91 108 108 98 97 128 174 15 207 263 165 94 128 182 70 64 72 210 103
4292 103 259 178 172 87 58 184 229 109 323 243 133 28 191 315 178 33 75 90 31 50 44 55 165 151 64 171 101 125 50 42
3940 42 94 106 148 111 133 91 208 133 137 87 113 120 62 104 113 87 194 96 104 186 168 199 306 47 88 203 158 71 80 114 86 170 115 93 336
3529 336 223 82 33 149 102 130 142 159 94 102 165 152 51 58 248 72 105 113 130 108 122 259 323 71 202 510 3312 2779 289
3189 289 397 815 370 125 410 126 151 68 55 309 222 441 327 3035 3362 516 302 243 1738 4007 3847 1219 410
2919 410 168 57 236 113 172 106 69 147 23 243 164 137 59 58 119 110 111 140 38 82 125 166 32 155 109 270 162 101 97 131 45
2555 45 145 158 199 142 85 186 172 85 152 159 116 127 56 112 216 255 54 90 151 64 94 122 175 116 68 25 154 248 163 34 171 1
2179 1 131 169 98 32 229 190 82 73 98 99 111 95 265 182 152 156 150 128 221 257 234 200 224 69 168 144 236 128 101 126 123 156 292 347 185
1768 185 102 103 114 159 20 180 136 126 116 159 74 40 118 186 342 245 173 99 177 195 129 37 104 126 163 152 83 49 49 124 128 59 81 199
1369 199 168 104 77 36 152 177 63 64 98 183 202 74 278 117 158 114 132 135 102 200 252 121 77 61 136 117 176 200 64 61 119 145 59
982 59 122 93 49 3 66 109 240 121 103 89 113 108 187 219 156 105 177 67 172 219 175 217 203 156 32 47 57 70 92 290 142 82 65
595 65 193 213 81 104 113 140 197 179 78 97 58 52 106 83 245 90 200 233 111 144 40 88 70 124 90 122 162 313 261 181 139 77
219 77 110 185 74 231 267 83 142 187 142 209 79 148 28 90 106 147 67 88 135 82 64 77 108 55 43 90 178 120 83 149 138 75 27
-168 27 83 129
-192A29
##PAGE=	F1=3077.07
##FIRST=	25164.767445380970457,	5806.2096540000038658,	0.12445870041847229004
##DATA TABLE=	(F2++(Y..Y)), PROFILE
5806 112 16 191 155 150 182 110 176 273 217 280 226 31 117 59 117 175 135 84 54 135 401 312 95 88 59 33 95 40 184 49 90 54 115
5419 115 124 34 58 103 170 129 106 194 184 76 207 128 302 253 80 69 183 331 171 48 147 189 152 147 78 157 167 79 272 222 183
5055 183 296 175 85 109 156 89 228 253 95 137 216 141 141 112 163 166 33 161 173 114 152 107 92 95 120 51 103 83 164 128 29 242 154
4668 154 102 145 52 141 50 48 119 102 169 102 65 99 144 53 89 79 139 118 129 159 11 216 316 196 159 83 216 124 41 57 222 139
4292 139 223 158 160 94 74 237 235 115 313 264 151 4 162 292 158 19 126 128 27 101 39 8 183 165 37 128 53 182 95
3952 95 37 69 103 180 88 217 111 220 129 122 61 107 90 64 107 110 79 168 33 95 210 169 222 316 40 73 229 200 70 113 105 77 199
3564 199 147 111 329 216 66 46 186 113 180 165 171 92 118 159 152 71 81 231 69 139 79 161 74 185 253 271 208 294 701 5054 4316
3200 4316 449 849 1629 795 177 398 108 128 138 63 393 52 481 494 4579 5126 773 524 471 3341 7683 7091 2159
2931 2159 584 323 253 210 154 184 41 121 137 62 264 150 102 138 56 104 163 108 181 74 115 204 154 51 146 64 262 133 107
2590 107 127 110 54 177 166 206 139 96 211 179 91 115 103 119 144 44 56 172 267 77 66 157 50 77 96 152 130 112 78 113 254
2226 254 205 24 151 27 133 164 135 56 279 193 58 76 47 134 103 132 268 204 165 149 143 184 243 234 243 211 254 47 156 161 245 185
1851 185 98 117 127 127 242 283 133 113 67 103 98 32 164 152 130 79 138 57 36 115 177 314 240 225 137 183 190 83 26 79 60 128 196 71
1452 71 71 139 141 111 69 120 248 172 106 71 37 154 187 85 90 119 157 170 60 273 142 111 94 122 172 108 211 296 115 92 78 134 122
1064 122 114 163 77 73 165 178 28 96 68 54 25 53 126 240 110 60 119 82 71 132 196 151 120 150 19 185 238 171 222 210 206 135 76 90
665 90 43 104 316 171 79 83 191 204 72 96 123 107 147 156 73 62 73 35 132 77 311 150 220 220 147 150 32 77 21 153 70 143 118 210
266 210 206 183 116 41 73 122 91 226 214 145 165 257 125 204 101 158 16 92 84 125 57 115 103 110 38 91 108 40 39 119 205 117 53 124 61
-145 61 51 28 87 129
-192A29
##PAGE=	F1=2974.81
##FIRST=	25164.767445380970457,	5806.2096540000038658,	0.1372839808464050293
##DATA TABLE=	(F2++(Y..Y)), PROFILE
5806 137 40 175 177 126 196 140 226 328 308 297 189 69 69 91 114 218 171 96 82 71 343 290 99 93 31 36 83 55 230 83 139 94
5431 94 143 157 18 133 82 134 144 153 204 142 38 192 191 298 215 98 138 181 282 189 89 171 172 191 141 97 150 126 136 277 182 185 350
5043 350 233 113 107 203 39 234 234 99 161 159 84 101 114 203 195 68 149 186 126 145 165 90 126 117 59 123 114 176 177 51 245 168 130 77
4644 77 52 108 26 59 61 108 164 105 83 75 115 53 81 58 165 134 113 143 18 209 360 230 207 41 239 180 114 93 214 155 177 154
4269 154 135 80 104 296 273 138 293 263 149 45 120 251 116 42 158 152 31 146 55 37 199 171 59 76 16 234 146 29
3940 29 38 98 201 55 284 126 212 110 115 45 99 61 88 107 106 67 133 25 79 225 166 222 311 33 60 229 230 113 171 93 76 208
3564 208 174 127 309 196 96 67 221 118 220 188 200 153 148 135 138 93 100 213 105 156 52 211 56 234 247 220 328 384 852
3224 852 6515 5628 590 1346 2503 1262 282 363 109 82 213 78 468 151 494 632 5858 6615 1003 742 688 5005
2966 5005 11461 10344 3084 737 507 482 160 182 195 47 171 143 104 269 147 63 229 87 93 211 109 221 132 151 286
2672 286 134 77 145 15 236 95 124 144 86 74 218 168 199 136 94 210 156 119 91 50 108 157 29 47 120 256 115 51 166 30
2320 30 74 76 128 130 141 139 77 249 217 43 128 41 136 167 193 68 305 179 30 82 11 151 88 151 270 198 154 131 117 231 248 192
1945 192 226 203 270 61 145 175 237 232 112 115 120 80 168 216 97 106 75 97 22 81 158 151 126 65 118 37 24 106 155 270 236 248 165 166 166 88
1522 88 44 50 38 86 213 61 118 227 150 87 83 143 272 168 103 77 70 152 174 90 108 158 125 138 44 268 173 52 96 118 186 105 204
1135 204 313 96 117 98 109 135 53 115 100 90 197 203 23 70 62 62 59 44 145 229 110 67 137 62 54 71 183 147 135 123 47 184 242
747 242 161 208 212 227 226 114 120 67 113 328 192 75 93 179 186 96 82 120 71 96 126 66 45 96 69 167 58 343 188 218 190 188 160 30
348 30 71 97 174 44 149 82 103 159 172 97 5 48 69 101 226 151 206 174 313 117 176 110 149 20 83 69 81 86 140 87 133 22 113
-39 113 107 34 37 132 209 113 35 94 30 58 94 125 128
-192A28
##PAGE=	F1=2872.56
##FIRST=	25164.767445380970457,	5806.2096540000038658,	0.2480099797248840332
##DATA TABLE=	(F2++(Y..Y)), PROFILE
5806 158 69 133 172 115 215 191 255 356 384 288 121 157 18 119 110 220 178 87 116 101 256 238 122 97 7 52 60 57 237 102 175
5442 175 122 163 201 74 190 140 95 152 202 220 106 93 170 230 268 148 137 201 158 222 194 132 179 144 221 112 115 155 96 178 265 129
5067 129 170 382 274 124 117 236 65 222 172 74 167 97 46 99 131 220 205 85 127 180 123 163 231 111 143 96 55 154 164 189 188 52
4691 52 227 187 159 30 35 62 50 53 18 131 161 106 108 57 73 74 80 49 167 139 88 125 11 185 376 259 232 41 247 226 195 154 196
4304 196 145 136 161 97 50 129 345 325 169 267 242 133 93 73 199 69 73 166 160 47 171 75 77 206 165 67 30 59 271 184 37 59
3928 59 87 204 27 320 138 184 78 117 43 97 64 118 120 112 64 94 66 64 229 161 194 293 21 54 208 242 160 227 76 85 187 186 130
3541 130 275 175 128 79 245 123 241 197 228 231 184 98 110 105 117 199 135 152 37 249 88 250 241 190 412 440 930 7347 6401
3200 6401 680 1781 3248 1671 376 315 121 23 274 91 513 315 469 709 6574 7486 1156 910 843 6356 14499
2954 14499 12866 3776 835 663 679 111 199 207 99 203 152 144 256 165 69 308 144 79 247 124 251 192 183 354 113 99
2649 99 152 37 197 52 145 144 49 113 247 166 182 141 75 183 119 172 65 39 83 160 11 86 70 223 152 49 174 12 78 62
2297 62 109 125 153 191 47 232 202 62 101 47 137 191 254 67 305 152 57 86 40 153 64 157 278 172 125 108 89 257 235 140
1945 140 196 183 272 89 139 186 218 262 133 123 110 25 95 177 120 84 103 96 64 123 152 130 111 85 107 20 15 97 123 214 233 238 177 135 128 117
1522 117 68 67 90 71 206 74 159 296 142 60 94 141 266 152 93 107 110 142 142 79 119 192 100 119 26 266 207 35 116 121 183 105 182
1135 182 303 63 136 131 73 154 18 73 129 106 206 220 42 55 99 62 100 49 165 204 110 93 137 53 46 13 169 142 152 108 87 181
759 181 232 150 183 208 224 289 154 132 106 123 324 194 74 106 162 155 108 69 109 61 58 106 66 71 128 90 199 71 341 198 184 144 221
372 221 177 41 74 177 182 33 141 89 15 128 150 104 39 38 108 105 221 85 254 165 336 118 129 99 118 43 65 72 34 120 141 95
-4 95 140 31 121 107 40 46 123 190 99 49 73 64 89 153 157 123
-192A23
##PAGE=	F1=2770.3
##FIRST=	25164.767445380970457,	5806.2096540000038658,	0.31233319640159606934
##DATA TABLE=	(F2++(Y..Y)), PROFILE
5806 171 84 90 149 116 236 231 256 354 428 260 50 223 21 145 94 183 157 57 152 158 155 163 147 96 53 54 63 39 204 97 192 123 172 247
5407 247 139 219 195 60 155 241 235 82 146 148 238 222 62 185 242 114 165 192 160 170 120 223 65 127 168 87 195 239 82 137 389
5043 389 298 119 129 242 102 188 96 33 154 33 25 122 136 220 194 80 100 156 111 172 264 149 145 65 45 179 223 199 167 42 189
4679 189 204 173 87 9 29 74 33 96 166 161 101 134 84 37 86 78 46 145 129 66 99 11 145 347 273 230 68 238 253 254 213 181 116 114 165
4269 165 49 14 139 369 362 196 242 206 113 135 28 150 60 104 146 155 73 170 86 105 201 146 45 7 95 284 202 63 98 80 183
3905 183 23 318 149 141 56 124 51 109 86 140 145 128 85 58 85 68 215 160 144 266 5 56 174 235 182 261 53 97 137 176 117 233
3529 233 168 140 80 254 125 236 189 245 295 221 66 66 101 135 193 146 132 32 256 128 232 230 178 446 439 914 7342 6441 695
3189 695 2046 3676 1922 430 262 120 46 314 99 511 424 401 702 6553 7531 1197 987 894 7062 16055 14033 4060
2931 4060 849 751 793 85 208 213 127 209 150 178 228 197 108 357 210 54 265 146 264 240 207 395 98 110 162 78 150 21
2602 21 160 134 11 162 247 165 155 155 38 140 101 229 37 75 43 150 15 113 31 173 175 56 176 9 82 57 95 124 148 225
2250 225 22 204 168 72 69 58 132 221 303 58 284 116 102 88 58 143 32 152 295 151 90 98 84 256 209 88 163 163 258 115
1898 115 151 200 196 269 151 129 111 30 96 175 161 66 115 95 125 151 132 93 85 118 115 19 32 94 88 157 233 203 180 106 102 128 88 119 134 95 187
1463 187 116 187 329 108 30 92 112 231 121 81 148 146 121 96 58 125 208 91 112 2 267 229 91 149 135 178 114 152 271 64
1111 64 165 180 46 175 47 83 162 121 187 232 57 56 160 62 145 88 183 166 108 102 115 51 60 51 142 132 168 106 111 182 215 145 157 197 207
700 207 316 187 121 129 136 306 173 78 121 146 111 95 67 99 76 42 110 77 98 162 97 213 111 314 180 121 92 233 199 71 91
337 91 232 171 62 123 115 63 112 120 130 55 41 186 106 203 26 282 137 316 115 72 71 69 73 51 95 22 149 118 106 123 38 109 111 54
-63 54 69 94 151 73 69 83 82 123 188 164 110
-192A10
##PAGE=	F1=2668.04
##FIRST=	25164.767445380970457,	5806.2096540000038658,	0.23502139747142791748
##DATA TABLE=	(F2++(Y..Y)), PROFILE
5806 175 84 106 133 122 251 244 235 325 433 219 71 253 36 170 78 118 113 14 188 185 64 80 161 86 103 49 104 18 154 69 189
5442 189 101 174 286 195 219 218 39 149 258 236 70 184 130 219 173 52 233 248 67 123 188 170 151 107 194 13 131 175 85 183
5090 183 200 70 95 374 311 122 137 220 118 138 96 38 129 26 18 128 114 220 171 63 77 123 93 158 265 187 139 32 35 195
4738 195 278 192 127 57 141 212 173 142 17 81 90 12 167 203 163 91 154 137 48 81 74 43 100 101 49 63 42 91 272 271 207 87 216 259
4339 259 278 254 169 85 110 154 9 19 132 364 369 212 223 162 96 159 15 118 94 125 106 148 107 143 84 117 185 119 6 14 112 270
3963 270 201 81 119 95 140 27 282 159 88 90 136 57 134 98 145 173 144 120 39 84 83 182 174 81 236 36 74 137 213 167 265 23 110
3576 110 70 142 87 189 173 129 77 246 123 205 168 246 334 253 70 15 82 156 197 144 112 31 230 150 192 220 157 427 376 807 6501
3212 6501 5736 632 2068 3665 1945 431 212 98 99 325 101 456 460 296 613 5803 6743 1117 958 822 6942 15735
2954 15735 13549 3863 771 753 798 66 203 209 125 187 131 203 187 234 131 363 271 43 262 165 254 264 218 399 93 105 166
2637 166 107 107 39 160 122 68 210 216 167 123 173 33 87 117 266 26 109 15 132 37 123 6 114 175 63 165 20 81 58 84
2285 84 133 125 236 19 167 127 71 34 81 120 235 326 47 251 83 132 91 64 123 4 138 318 162 64 109 99 226 182 47
1945 47 134 149 234 139 190 221 175 249 156 123 133 72 151 176 175 78 103 92 149 159 92 56 53 153 140 30 56 99 52 110 234 160 179 89 104
1534 104 114 115 176 162 121 168 166 202 320 45 16 72 71 174 80 80 183 169 91 47 34 125 205 99 107 33 263 230 143 188 167 185 124 122 226
1123 226 126 204 228 50 190 79 136 192 139 147 238 63 71 219 70 191 158 202 131 106 87 73 49 89 97 97 117 179 106 119 185 196 147
736 147 146 182 193 310 204 90 128 146 277 135 82 126 136 67 67 83 93 98 51 123 88 106 185 99 202 142 273 145 42 64 219 221
360 221 117 120 252 139 100 100 128 103 104 84 156 42 49 254 110 168 21 286 103 256 98 29 54 19 101 52 135 42 162 75 103
-4 103 82 30 80 121 72 100 49 104 56 80 119 90 152 187 144 87
-192H7
##PAGE=	F1=2565.78
##FIRST=	25164.767445380970457,	5806.2096540000038658,	0.20355539023876190186
##DATA TABLE=	(F2++(Y..Y)), PROFILE
5806 168 78 166 153 124 255 227 213 281 397 176 120 245 28 188 104 61 59 32 219 172 63 4 154 70 152 58 148 66 151 24
5454 24 168 64 171 310 229 192 205 57 130 247 214 74 208 113 182 132 139 275 221 80 93 189 161 130 117 146 45 123 169 78
5102 78 148 147 88 59 348 321 152 143 174 112 88 173 85 102 76 34 103 72 238 149 56 71 99 72 124 255 214 137 13 31 202 319 160
4715 160 86 91 104 212 160 176 35 144 104 32 219 236 166 80 156 185 77 61 77 40 44 59 34 30 74 29 167 254 178 95 191 249 262
4327 262 269 151 92 111 129 63 42 118 332 342 214 214 117 84 164 43 100 117 127 55 150 140 103 77 110 163 92 61 9 113 233 183 75
3940 75 121 132 86 20 228 163 46 143 152 54 155 87 135 198 157 151 41 75 94 134 206 31 208 77 108 102 180 125 248 12 118 49
3564 49 89 46 153 174 99 79 224 113 157 144 232 347 275 96 59 58 169 204 146 105 28 182 151 156 224 111 359 262 633 5030
3212 5030 4456 511 1838 3199 1725 384 172 74 127 305 100 353 425 165 464 4507 5319 935 831 643 6028
2966 6028 13628 11544 3239 613 674 701 31 177 190 99 141 100 218 144 267 127 326 318 88 240 178 219 260 213 364 93
2661 93 85 159 121 73 74 141 113 124 251 166 175 90 187 99 36 136 269 36 136 79 115 53 122 12 58 148 65 141 51 79 57 72 151 92
2261 92 226 42 127 92 57 30 106 98 217 318 37 217 69 140 94 75 98 39 115 341 190 52 132 106 174 164 48 111 146 205
1909 205 160 246 252 160 204 139 103 165 102 187 159 153 111 73 84 126 152 38 57 27 182 162 34 78 109 26 80 235 127 177 81 113 90
1522 90 160 226 176 131 154 206 209 276 36 68 37 70 107 34 94 196 172 57 35 18 115 187 116 107 78 249 207 179 228 212 201 125 94 185
1123 185 194 234 261 66 199 111 188 216 158 115 240 68 94 263 80 231 245 231 115 107 56 17 39 112 127 42 103 178 101 114 183 180
747 180 152 160 168 192 281 203 62 109 141 240 94 80 115 132 36 61 116 89 123 83 129 87 90 187 102 165 151 232 108 37 81 180 236 170 150
337 150 235 90 131 78 117 117 95 41 173 5 62 297 114 121 52 269 100 171 84 62 79 45 116 63 181 67 154 25 82 33 9
-27 9 42 136 85 128 4 60 78 84 157 112 171 150 105 58
-192E8
##PAGE=	F1=2463.52
##FIRST=	25164.767445380970457,	5806.2096540000038658,	0.38241481781005859375
##DATA TABLE=	(F2++(Y..Y)), PROFILE
5806 151 77 219 193 111 247 180 209 238 330 136 140 206 13 185 165 97 12 70 235 123 117 58 126 59 196 84 177 128 220 31 135
5442 135 28 165 319 240 143 165 97 99 210 166 100 226 96 140 106 206 304 170 140 79 197 138 114 153 126 85 106 151 68 96 81
5078 81 105 58 323 334 193 163 114 90 72 235 118 89 112 63 57 55 267 142 72 82 92 60 85 252 227 146 27 31 205 339 106
4715 106 65 119 109 206 138 188 39 197 122 61 247 259 165 73 132 217 97 30 92 39 29 17 22 47 97 36 88 229 163 96 173 230 217
4327 217 257 118 134 106 98 113 51 109 282 287 204 213 78 75 151 58 78 115 107 17 160 167 68 79 88 138 76 116 12 104 180 154 43 132 172
3916 172 48 28 175 158 58 184 171 38 160 55 121 221 167 168 49 85 102 90 244 52 185 119 151 64 141 89 233 54
3588 54 121 108 29 24 131 158 60 88 195 98 127 135 207 343 285 115 123 50 162 203 162 107 20 134 138 144 243 45 256 130 435 3279
3212 3279 2900 377 1413 2390 1314 304 145 93 123 258 104 223 336 31 290 2966 3595 692 642 400 4556 10283
2954 10283 8537 2353 411 542 540 13 128 152 66 84 76 224 117 285 98 258 342 147 201 183 162 231 193 302 87 57
2649 57 141 123 53 111 115 105 160 277 111 191 63 189 167 15 135 237 40 157 149 108 57 114 23 45 105 58 110 96 87 47 64 174
2273 174 55 201 67 99 70 30 61 122 73 167 282 28 192 80 128 99 100 68 69 92 354 199 48 151 94 115 155 86 100 150
1921 150 178 178 302 286 155 139 101 70 188 122 186 127 99 142 50 71 62 149 51 88 24 198 168 29 98 119 47 60 236 112 169 67
1545 67 103 74 212 267 179 124 139 223 212 216 121 133 41 119 41 35 112 179 152 25 67 14 91 161 128 113 128 221 175 197 263 259 209 113 70 163
1123 163 244 237 266 76 198 138 222 231 174 133 232 82 116 281 83 257 334 270 111 107 30 45 30 116 136 15 92 160 96 106 174 164
747 164 154 187 159 199 242 187 74 97 117 200 67 66 91 133 21 88 157 82 152 129 128 73 53 166 100 113 145 198 86 98 102 121 236 218
348 218 169 186 48 152 63 87 117 84 22 181 55 82 308 115 68 66 239 153 96 110 105 111 76 113 71 225 110 127 25 43 70 35
-27 35 12 151 84 142 46 50 121 95 181 146 177 89 70 28
-192B8
##PAGE=	F1=2361.27
##FIRST=	25164.767445380970457,	5806.2096540000038658,	0.50058650970458984375
##DATA TABLE=	(F2++(Y..Y)), PROFILE
5806 125 85 243 225 76 237 114 219 205 242 100 127 149 31 156 227 160 34 93 229 51 154 94 90 71 229 116 187 180 301
5466 301 86 95 37 158 312 234 81 114 139 61 154 100 147 239 80 105 92 239 320 115 192 108 209 110 109 203 164 110 82 128 62 40
5090 40 33 116 84 310 344 218 199 66 65 97 259 131 98 134 92 55 89 280 147 89 94 82 79 54 257 223 158 55 34 207 335 53
4715 53 76 135 150 194 115 185 28 232 143 89 254 267 158 80 89 228 104 14 114 46 68 32 24 81 105 82 138 202 174 101 162 208 163
4327 163 223 71 177 91 75 150 50 106 223 216 191 216 45 72 130 62 43 92 69 51 170 180 64 97 62 112 71 153 26 92 123
3963 123 118 43 182 201 64 56 144 142 91 203 188 26 142 12 114 239 176 167 64 123 125 90 277 80 169 154 193 34 112 108 234
3600 234 99 123 155 41 50 127 123 43 98 166 87 154 148 180 333 284 117 178 67 130 184 182 103 29 112 119 143 262 67 143 80 255 1627
3212 1627 1408 294 906 1444 817 218 131 140 94 196 118 114 222 82 129 1508 1945 438 439 158 2886 6521 5262 1422
2931 1422 228 397 367 50 64 93 47 28 84 221 117 283 67 183 342 195 152 183 97 184 161 236 70 37 118 114 42 148
2602 148 113 95 164 287 67 216 48 173 217 41 109 182 38 174 210 118 46 96 34 78 74 44 89 146 111 32 67 196 26 168
2250 168 89 95 70 10 87 126 61 102 228 18 181 95 103 107 132 35 89 88 356 174 41 158 66 74 151 129 107 157 159 191 342 312 158
1862 158 67 55 36 189 136 151 105 31 159 64 58 24 166 111 113 38 201 155 20 117 126 89 38 233 107 151 39 66 63 250 291 173
1487 173 102 116 215 214 163 190 199 94 170 39 83 120 129 110 3 92 10 68 134 122 114 178 185 160 193 287 290 200 90 49 170 268 205 240 84
1076 84 187 147 232 234 182 183 214 104 133 271 73 266 411 315 95 100 39 93 43 98 124 50 84 126 99 105 159 145 148 214 154 199 203 165 113
665 113 118 82 164 59 41 60 135 7 108 191 67 174 176 129 53 25 129 85 72 138 178 91 139 105 56 217 248 169 120 80 160 58
290 58 54 114 84 83 181 110 108 289 111 23 66 211 228 100 162 133 125 83 93 70 256 165 88 64 18 136 77 44 163 63 135 76 74 160
-110 160 124 181 174 169 20 61 6
-192F
##PAGE=	F1=2259.01
##FIRST=	25164.767445380970457,	5806.2096540000038658,	0.53448820114135742188
##DATA TABLE=	(F2++(Y..Y)), PROFILE
5806 89 91 232 234 24 240 47 218 181 149 68 92 93 45 106 268 201 53 97 201 27 172 106 85 96 248 144 180 214 359 135
5454 135 50 66 148 291 222 17 72 173 41 89 41 208 250 70 86 81 232 317 88 217 170 217 83 113 248 218 119 57 110 66
5102 66 10 87 126 109 313 347 216 239 85 46 122 243 122 118 144 118 105 117 257 150 89 97 56 122 34 251 203 163 92 41 207 312
4726 312 71 103 146 196 176 96 177 8 248 165 115 247 260 148 115 71 221 102 45 133 64 88 55 37 107 107 104 208 172 198 116 152
4351 152 187 133 178 22 202 65 66 172 52 102 165 141 182 218 21 81 106 64 30 60 23 86 173 176 80 116 57 86 71 165 33 82
3975 82 78 79 111 247 210 93 81 137 122 115 202 195 51 104 34 117 249 183 152 91 169 164 130 294 88 160 175 228 63 115 147 244 146 126
3576 126 171 84 71 134 78 67 100 145 96 217 170 159 325 274 103 219 85 81 145 191 85 61 124 100 129 266 145 65 155 126 381
3212 381 259 289 449 600 361 150 125 179 61 141 149 124 114 160 30 400 690 219 266 89 1388 3168 2426 648 170 275
2907 275 227 65 43 37 54 16 115 214 134 259 72 141 323 216 98 180 58 133 122 199 48 39 98 102 37 178 149 82 133 283 39
2543 39 246 48 136 238 52 63 127 36 188 252 138 34 67 46 107 89 28 99 187 139 20 77 214 22 132 104 107 89 45 101
2191 101 117 74 73 170 14 180 104 76 119 160 4 96 116 348 115 37 153 34 73 152 164 121 163 149 196 357 322 161 16 47
1839 47 25 162 148 90 108 33 161 91 49 110 197 153 121 54 193 131 27 137 132 128 20 227 106 121 11 30 42 256 295 158 70
1475 70 84 186 213 139 231 258 147 204 91 130 111 75 65 18 100 7 72 113 90 95 222 147 178 166 293 299 178 70 47 190 266 150
1099 150 190 96 160 129 221 227 181 222 185 123 142 234 56 254 460 357 50 85 52 120 63 61 103 61 73 75 115 115 140 119 131 234 152 181
700 181 169 151 147 151 69 141 54 33 32 138 35 103 207 40 177 209 132 37 62 95 58 76 143 169 125 169 90 55 179 259 144 57 131
313 131 154 59 59 120 106 148 177 145 132 247 106 33 58 194 295 146 204 145 114 69 62 64 271 213 52 96 66 187 115 81 169 26
-63 26 104 88 96 186 170 156 186 148 39 68 33
-192C3
##PAGE=	F1=2156.75
##FIRST=	25164.767445380970457,	5806.2096540000038658,	0.49076384305953979492
##DATA TABLE=	(F2++(Y..Y)), PROFILE
5806 48 80 191 220 42 261 57 185 157 84 38 53 56 41 74 279 216 54 84 154 90 177 102 115 115 250 162 167 223 377 171 17
5442 17 91 135 261 215 55 69 195 68 25 76 272 261 65 78 67 188 297 100 207 236 218 62 119 275 251 120 38 102 84
5102 84 46 147 139 129 328 337 183 266 134 42 131 194 96 134 147 138 143 119 196 142 74 88 69 169 21 224 169 152 128 52 205 278 121
4715 121 132 166 229 151 86 166 20 250 182 141 231 242 143 177 129 204 99 74 141 92 84 55 50 125 126 99 238 136 217 142 133 170 146 140 37
4304 37 204 34 58 175 65 91 113 75 182 216 24 102 83 78 79 41 23 110 166 157 93 121 77 62 66 150 32 77 70 38 182 295 196
3916 196 115 91 145 113 128 188 186 86 56 66 123 245 187 136 129 202 202 167 293 79 154 178 251 115 146 163 250 194 136 156 105 73 146 37
3517 37 99 87 133 126 275 184 146 316 256 81 241 95 63 95 179 62 93 151 86 93 252 205 95 201 68 359 425 299 176 151
3165 151 71 114 122 198 59 122 191 186 61 193 62 285 294 69 147 193 333 797 505 190 221 193 137 59 102 97 85 43 143 207 154
2801 154 225 102 154 289 204 46 174 80 89 83 205 52 45 89 92 33 194 196 65 73 271 28 277 64 89 222 45 32 102 36 196
2438 196 265 160 61 63 60 122 114 14 122 209 161 17 87 227 41 97 111 116 122 80 102 102 93 115 121 16 181 105 58 132 176 39 89 155
2038 155 335 41 47 138 29 90 159 180 124 165 147 193 346 313 155 50 78 31 114 155 19 110 74 155 113 50 173 219 165 112 70
1675 70 184 111 46 154 137 154 36 214 113 85 57 72 9 222 274 132 41 57 146 207 145 240 303 190 218 138 169 98 127 80 30
1311 30 96 20 94 99 34 66 256 115 203 122 280 284 162 71 69 201 245 108 134 109 117 81 200 211 172 235 152 132 143 178 45 225 473
923 473 386 23 75 64 120 68 13 97 54 70 16 138 130 115 87 104 243 151 137 136 157 168 170 101 132 60 88 18 142 82 74 199 7 156
524 156 220 133 38 103 95 41 97 153 169 176 197 62 119 128 251 98 36 160 135 64 100 135 134 203 173 145 142 203 112 61 51 187 337 170
125 170 219 139 79 41 34 61 268 238 36 132 116 215 141 113 172 25 55 80 103 197 218 112 182 118 80 79 72
-192G2
##PAGE=	F1=2054.49
##FIRST=	25164.767445380970457,	5806.2096540000038658,	0.38829877972602844238
##DATA TABLE=	(F2++(Y..Y)), PROFILE
5806 45 50 132 192 101 286 114 115 125 110 32 29 56 30 103 256 210 46 60 98 129 175 88 142 117 237 164 154 212 354 189 60 113 117
5419 117 222 212 106 95 206 106 33 141 325 275 63 83 61 121 258 121 167 285 208 57 121 274 254 119 27 105 115 62
5090 62 180 158 147 342 310 127 265 173 46 124 127 67 141 150 153 156 105 120 126 58 81 144 209 23 175 125 127 150 63 201 247 151 152 193 241
4679 241 117 85 144 46 246 194 164 211 215 147 250 201 185 106 98 136 120 67 34 58 148 170 75 222 92 221 171 112 161 177 119 67 183
4292 183 34 41 161 81 72 70 53 189 207 45 129 64 105 125 47 57 120 150 131 100 107 97 40 59 112 27 81 88 13 240 304 165 134 80
3893 80 168 135 137 173 162 112 32 79 122 223 187 131 170 214 218 187 278 62 148 161 261 162 179 146 249 243 150 114 101 67 157 41 126 61
3494 61 129 168 311 183 133 300 226 57 247 100 105 67 150 63 110 181 89 62 232 233 135 196 64 555 626 270 150 259 111 102
3142 102 119 194 69 133 230 209 74 188 69 467 466 62 75 231 273 442 483 184 247 145 84 52 150 182 133 56 157 204 173 200
2790 200 125 185 248 164 20 166 109 62 51 228 88 44 94 92 33 193 234 43 13 257 22 306 89 69 175 33 78 108 30
2449 30 195 248 178 111 115 77 124 121 16 133 202 172 26 90 237 69 68 113 116 162 108 93 92 97 159 89 22 175 102 52 142 178 75 75 185
2038 185 315 66 72 118 38 100 160 170 104 158 148 190 317 290 137 67 94 24 77 159 60 86 85 146 123 57 202 215 145 93 84 179 104 64
1639 64 166 141 164 56 196 125 51 111 124 49 151 228 97 49 66 108 197 161 228 329 222 214 176 202 120 233 136 43 96 40 102 92
1264 92 35 91 277 91 207 72 251 256 166 91 94 190 217 120 97 110 58 23 182 193 161 226 127 130 139 114 54 185 445 398 109 96 101
876 101 104 52 52 121 71 98 48 161 142 82 68 69 240 152 69 101 183 175 165 135 124 103 166 19 144 127 31 168 51 115 209 130 55 126
477 126 120 65 99 153 176 228 221 28 184 74 235 46 54 159 105 69 142 151 150 237 174 110 131 182 134 77 55 183 345 160 201 116 37
90 37 18 27 70 251 234 53 178 158 217 154 138 174 67 20 59 92 196 256 62 175 85 105 99 118
-192A18
##PAGE=	F1=1952.23
##FIRST=	25164.767445380970457,	5806.2096540000038658,	0.29568240046501159668
##DATA TABLE=	(F2++(Y..Y)), PROFILE
5806 96 17 81 162 146 296 162 19 87 179 65 29 75 47 142 204 199 40 28 52 139 172 68 146 98 213 151 144 188 293 185 115 136
5431 136 94 178 202 134 119 210 139 81 195 356 286 69 97 68 62 205 130 109 309 189 72 114 248 232 120 21 113 148 55 181
5078 181 184 161 347 265 60 236 191 50 107 60 52 139 154 165 148 96 99 122 80 97 220 233 35 113 77 96 153 68 195 228 158 155 213
4691 213 226 77 91 106 67 243 197 180 187 184 154 315 256 171 126 117 120 140 68 18 66 181 220 53 173 54 208 198 106 159 201 112 77
4304 77 144 76 12 132 89 43 36 86 197 188 63 152 56 130 151 56 78 117 129 107 107 78 106 22 58 60 25 93 106 46 280 271 124 155 59
3893 59 207 181 149 164 128 121 59 71 114 182 176 133 203 203 203 190 257 50 141 131 256 194 195 103 247 292 164 69 78 73 165 73 152 33 133
3482 133 209 315 164 112 273 181 38 245 114 146 99 120 97 101 206 117 87 223 226 149 151 71 402 490 196 140 177 82 102 116 172
3118 172 63 141 250 182 78 165 48 336 364 101 28 214 396 734 637 189 223 113 58 60 170 242 189 61 154 197 186 196 135
2778 135 205 205 110 53 158 125 61 29 236 124 41 113 105 36 176 254 22 82 239 19 326 116 109 107 57 129 113 22 185 209 186 154
2402 154 176 95 115 106 29 124 164 174 48 88 245 102 54 111 115 201 130 78 100 83 179 69 37 160 98 67 149 166 106 71 202 283 135
2015 135 99 99 36 103 142 130 65 137 148 203 288 259 113 56 87 1 106 164 123 38 77 135 117 64 200 183 101 68 93 180 95 78 168 138
1616 138 155 63 177 132 26 159 158 98 58 163 57 81 95 82 183 175 212 338 248 199 205 233 194 326 181 57 114 63 85 88 99 171
1240 171 287 74 174 58 210 225 184 110 112 157 192 153 95 94 13 81 170 177 158 210 117 126 134 59 70 143 383 387 193 144 159 96 40 113
841 113 154 122 148 101 172 142 44 84 36 226 151 10 63 217 172 140 156 107 167 250 36 142 157 15 133 103 64 183 134 81 130
477 130 139 101 86 137 191 267 226 20 241 50 217 53 54 125 71 72 172 156 143 245 185 66 100 192 165 78 68 175 323 122 157
114 157 79 30 24 39 89 228 207 91 228 188 199 157 153 179 93 61 32 72 187 269 39 170 64 123 129 161
-192A61
##PAGE=	F1=1849.98
##FIRST=	25164.767445380970457,	5806.2096540000038658,	0.33953291177749633789
##DATA TABLE=	(F2++(Y..Y)), PROFILE
5806 152 59 69 140 170 283 200 94 52 246 108 29 87 71 160 133 189 44 25 54 125 171 47 129 60 182 130 129 156 205 158 168 162
5431 162 69 132 175 136 134 208 160 116 236 361 283 87 113 77 83 143 126 51 305 165 104 102 206 198 119 25 119 175 26 159 215 164 335
5043 335 204 11 182 189 51 86 39 63 128 162 175 127 106 156 142 131 134 266 237 38 53 34 75 140 64 188 223 146 139 213 187 41
4668 41 105 57 82 247 194 186 160 151 160 357 282 161 148 132 102 145 95 56 75 221 253 48 111 73 186 221 122 157 210 108 64 97 126
4280 126 30 92 102 33 19 118 199 159 72 165 65 140 153 59 87 101 104 96 121 62 104 14 74 18 26 109 116 84 303 202 89 177 69 255
3881 255 232 160 161 99 114 84 49 105 126 149 129 224 178 160 185 245 56 130 98 234 209 187 54 241 332 175 77 51 97 169 102 182 44
3494 44 146 240 289 130 84 236 123 28 239 140 161 144 109 135 62 216 157 131 231 192 146 92 72 124 203 98 134 46 24 100 111
3130 111 136 49 126 241 115 56 149 56 138 165 115 22 173 300 548 434 121 172 90 47 78 169 262 235 68 137 177 187 204 134 210
2766 210 169 74 86 157 141 92 27 220 144 48 143 129 43 152 257 25 144 212 41 334 136 160 41 99 163 99 36 164 164 182
2414 182 177 218 116 98 93 42 96 100 171 77 83 252 131 65 110 121 230 149 69 131 60 174 58 60 142 93 100 153 143 127 93 205 238 181
2015 181 123 87 32 100 98 69 50 101 143 239 277 225 93 28 73 32 159 173 167 60 85 118 91 76 179 132 47 41 98 182 67 95 158 120
1616 120 126 55 160 124 13 195 169 132 64 91 19 106 115 74 165 180 205 332 273 182 227 266 290 381 194 71 150 86 57 83 140 255
1240 255 288 69 107 93 165 202 199 117 121 113 171 166 100 61 80 160 154 172 176 207 112 130 132 53 77 113 298 349 257 193 209 107 85 170 174 173 194 138
794 138 168 128 16 116 27 202 140 87 31 245 161 117 175 96 233 325 65 131 161 42 124 148 20 159 154 108 116 139 128 98 122 213
419 213 282 202 70 290 98 194 102 30 68 42 73 178 145 113 228 200 92 61 213 193 69 82 162 281 72 104 36 51 40 52
67 52 111 204 175 137 271 207 171 156 154 186 95 90 8 62 169 252 46 163 67 141 155 192
-192A92
##PAGE=	F1=1747.72
##FIRST=	25164.767445380970457,	5806.2096540000038658,	0.42487901449203491211
##DATA TABLE=	(F2++(Y..Y)), PROFILE
5806 196 106 81 126 170 247 230 193 35 299 149 22 86 75 161 57 180 52 70 84 95 169 29 111 13 147 114 105 117 105 116 213
5442 213 190 49 93 135 122 136 205 169 135 263 342 258 111 119 77 140 89 109 34 282 142 139 99 160 171 110 42 120 190 22 142 241
5067 241 151 307 139 60 119 173 46 69 76 80 109 170 190 104 115 208 176 188 173 266 219 25 43 28 76 132 57 179 223 127 113 192 131
4679 131 22 127 44 93 256 183 178 132 118 159 368 279 149 158 144 90 137 125 96 83 257 258 44 60 128 178 241 142 146 206 98 41 56
4292 56 176 73 47 140 81 46 128 192 120 69 165 80 127 131 63 90 76 80 97 144 89 96 24 101 67 27 127 120 118 311 117 72 190 119 295
3881 295 270 163 161 89 101 99 25 102 68 105 109 230 147 102 180 247 82 117 74 197 204 159 48 217 351 179 133 65 117 168 123 212 73
3494 73 167 254 236 93 62 196 62 24 228 174 145 174 121 165 8 202 194 157 246 142 146 60 60 187 89 41 157 220 107 83 95 93
3118 93 63 89 200 26 24 149 100 288 226 117 41 133 199 350 291 59 122 74 29 103 159 243 260 86 113 136 168 205 132 204 147 81
2743 81 106 172 176 147 45 180 139 70 174 152 52 128 245 52 182 170 92 325 144 196 40 137 176 64 61 138 132 165 168 227 134 75
2367 75 105 54 60 25 166 101 78 257 149 90 110 130 244 166 79 173 62 153 56 84 133 83 138 155 111 136 128 201 182 201 138 86 54 95
1968 95 29 45 96 55 133 284 291 189 79 31 88 64 193 182 185 139 125 91 46 95 156 75 24 12 102 183 34 121 138 81 79 61 150 100
1569 100 25 213 160 144 151 49 17 115 119 85 142 174 207 315 295 175 239 300 384 388 170 81 192 103 75 79 147 320 282 87 42 128 124
1182 124 193 207 109 128 91 153 155 88 19 142 228 126 180 218 222 97 145 135 83 72 107 205 287 286 222 224 118 144 212 174 202 217 155 147 102
771 102 29 136 44 172 116 144 28 257 144 117 212 138 287 379 98 104 139 51 150 182 24 144 178 127 90 119 145 155 135 238 272
407 272 151 127 330 170 162 135 10 36 37 70 157 116 69 194 210 157 39 219 208 59 92 149 236 46 61 23 53 59 66 130 186 157 177
20 177 298 217 151 159 142 192 85 87 24 73 143 205 41 139 80 159 165 202
-192B02
##PAGE=	F1=1645.46
##FIRST=	25164.767445380970457,	5806.2096540000038658,	0.4410285651683807373
##DATA TABLE=	(F2++(Y..Y)), PROFILE
5806 219 134 79 113 153 195 253 264 35 337 180 25 72 52 175 22 164 58 116 108 65 159 28 117 33 108 106 79 71 43 99 244
5442 244 214 49 77 92 116 130 197 166 138 276 305 209 128 107 70 181 78 82 59 251 130 168 111 121 169 91 64 118 188 81 170 255
5067 255 125 271 95 93 61 154 37 60 104 90 85 172 213 103 107 224 206 237 199 222 182 4 85 43 83 144 58 167 219 111 97 167
4691 167 70 27 147 88 101 264 170 157 109 87 156 349 253 130 142 155 94 123 142 124 86 280 238 37 31 184 207 261 149 126 198
4327 198 85 48 65 224 114 22 203 137 89 114 179 74 55 150 95 92 95 74 99 44 58 103 170 128 92 39 127 125 33 146 120 149 302
3940 302 64 83 194 173 311 283 150 162 91 95 111 21 107 50 67 75 218 120 55 178 262 117 104 73 149 183 124 88 163 337 174
3576 174 188 117 120 159 130 232 88 189 245 165 67 64 160 23 16 207 206 106 182 138 183 76 170 218 155 253 94 155 77 50 305 230
3200 230 99 127 236 112 39 68 48 97 36 136 65 39 152 137 415 306 110 42 108 215 400 384 92 98 66 20 130 148 208
2860 208 265 115 93 80 125 192 133 192 138 95 109 202 229 210 67 125 110 99 193 165 58 109 225 95 196 118 154 299 141 207 72
2496 72 157 168 17 83 113 120 136 126 206 149 50 133 65 34 61 163 113 77 255 152 116 109 129 238 185 108 211 96 126 54 98 137 66
2109 66 171 153 79 134 160 196 128 203 146 99 89 87 50 107 143 21 122 318 316 148 69 62 124 84 198 184 173 209 170 61 44 118 133
1722 133 31 56 22 111 175 78 158 115 26 46 109 148 68 55 213 137 137 214 84 36 103 118 107 113 155 208 289 307 185 239 326 459 351
1334 351 116 88 233 111 133 84 121 353 270 122 98 147 92 203 214 88 136 120 136 138 54 31 193 281 86 205 271 244 69 162
982 162 143 107 62 122 122 207 274 218 190 110 186 231 155 198 206 151 119 74 39 129 60 142 90 174 40 245 119 134 267 225 322 401 126 63
583 63 99 46 183 203 57 141 192 133 59 84 150 224 176 256 243 90 180 358 247 122 141 57 96 48 67 107 75 33 153 209 205 52
207 52 203 203 54 98 139 201 72 46 62 30 83 80 143 175 154 197 304 222 151 165 118 189 104 51 53 84 108 144 43 93 84 169 154 189
-192A89
##PAGE=	F1=1543.2
##FIRST=	25164.767445380970457,	5806.2096540000038658,	0.45519715547561645508
##DATA TABLE=	(F2++(Y..Y)), PROFILE
5806 219 137 56 96 126 139 263 297 36 356 197 46 72 69 219 74 138 61 149 120 51 136 38 141 67 71 99 67 26 101 149 256
5442 256 227 68 87 77 132 116 182 155 126 277 257 147 129 77 67 197 104 49 74 225 139 180 129 102 200 83 86 117 173 142 232 250
5067 250 102 236 102 103 37 135 29 55 112 88 59 160 244 140 79 203 220 267 206 156 139 31 116 44 79 163 64 148 206 107 113 167
4691 167 31 43 157 124 104 268 160 129 106 57 152 310 220 101 98 163 111 112 144 137 80 291 203 72 20 233 268 278 134 99 195
4327 195 76 94 122 267 147 60 267 178 138 84 160 26 43 127 112 42 63 91 119 12 48 105 194 154 98 54 144 177 49 162 117
3963 117 173 274 109 117 190 207 291 267 121 161 90 102 122 33 116 81 91 35 191 93 62 178 279 153 96 86 101 152 98 129 82 284
3588 284 160 227 177 100 138 124 231 83 200 209 84 68 78 131 57 19 169 229 55 174 147 191 142 148 226 131 243 73 163 93 78
3224 78 286 241 140 69 81 100 27 48 24 126 21 71 134 77 148 141 379 244 95 40 118 245 505 493 147 101 60 35 141 114
2872 114 181 263 148 84 48 65 173 137 175 136 88 92 235 285 262 87 75 68 129 191 161 64 98 204 154 191 81 212 258 131 194 82
2496 82 153 144 38 93 95 117 99 60 169 158 38 150 76 38 124 173 112 79 244 140 133 102 113 212 202 141 234 129 99 41 98 142 48
2109 48 188 141 69 127 180 194 91 204 152 126 120 82 124 164 169 57 115 326 335 105 56 75 150 87 175 171 134 252 196 56 103 129 111
1722 111 26 74 59 125 153 149 196 97 47 107 178 153 53 90 197 108 124 244 121 42 75 130 134 78 123 207 254 298 209 224 337 503 289
1334 289 55 90 267 110 189 98 74 350 250 157 172 146 73 224 218 57 146 167 120 143 9 65 235 323 46 240 318 258 39
994 39 180 158 116 66 143 65 122 226 177 112 81 199 226 124 161 158 131 103 55 35 89 79 114 96 178 42 206 83 145 319 321 338 386
606 386 145 34 64 43 202 217 99 148 187 127 35 47 146 281 219 255 205 67 215 370 320 101 124 102 160 54 72 38 29 46 112
243 112 197 219 65 165 178 54 102 136 176 103 43 97 29 107 92 147 170 146 188 292 227 168 169 90 173 164 34 87 78 86 111 92 32 73 169
-168 169 129 154
-192A54
##PAGE=	F1=1440.95
##FIRST=	25164.767445380970457,	5806.2096540000038658,	0.42155283689498901367
##DATA TABLE=	(F2++(Y..Y)), PROFILE
5806 198 118 27 74 100 89 258 292 39 356 201 73 114 162 276 109 103 63 157 122 52 97 43 154 84 45 90 80 44 158 228 250
5442 250 228 91 105 99 158 99 155 136 100 268 204 104 117 39 70 183 122 24 76 210 158 172 140 125 262 122 106 125 150 193 291 227
5067 227 102 209 135 90 46 114 26 50 104 76 39 131 271 193 45 155 217 273 194 116 115 54 122 37 58 168 61 121 182 114 142 200
4691 200 44 77 148 135 104 265 156 104 124 40 150 269 196 66 35 163 133 106 136 137 65 290 173 132 34 274 330 288 97 68
4339 68 207 81 146 194 303 169 100 313 188 186 68 135 25 61 103 134 13 70 110 147 22 52 100 213 157 114 68 149 222 71
3987 71 172 110 188 232 169 165 186 210 236 220 82 151 78 109 127 46 122 102 143 28 151 61 100 177 285 178 95 102 67 122 96 164 16
3600 16 199 136 243 234 67 102 108 206 59 193 149 28 78 81 109 94 56 113 235 6 159 143 192 186 169 217 98 213 86 154 89
3236 89 123 193 165 149 172 161 212 102 81 56 152 70 53 173 107 138 94 203 92 78 66 141 164 343 352 118 116 56 35 136 49 163
2860 163 266 173 80 90 9 160 139 151 132 59 60 257 329 290 100 74 58 152 163 138 79 97 184 219 179 95 249 210 122 160 72 127 113
2473 113 80 92 84 109 74 46 142 161 61 149 89 46 166 205 110 81 223 121 136 88 89 171 216 167 234 145 72 35 81 138 54 186 116
2085 116 94 126 186 198 77 213 165 162 139 79 177 194 167 99 118 303 338 82 41 65 149 73 136 141 77 262 193 85 151 119 97 35 74
1698 74 99 143 111 209 226 88 107 187 249 164 72 119 173 85 117 244 135 35 58 163 160 53 84 203 213 266 234 192 327 511 231
1334 231 73 91 293 105 230 119 43 316 221 182 215 129 64 245 212 18 155 206 104 168 49 84 272 355 25 274 346 259
1006 259 45 198 180 112 89 164 50 58 151 104 82 55 182 201 91 101 83 100 106 51 48 29 114 91 140 169 34 144 35 141 349
642 349 400 337 339 152 68 66 59 201 224 145 168 168 110 30 26 131 314 245 230 172 94 224 365 380 125 96 137 208 53 87 48 19 70 76
243 76 178 199 63 111 139 52 105 141 156 118 33 123 86 119 98 142 165 115 150 269 229 184 166 70 139 237 111 124 56 110 148 157 47 51
-156 51 167 110 108
-192A08
##PAGE=	F1=1338.69
##FIRST=	25164.767445380970457,	5806.2096540000038658,	0.29115143418312072754
##DATA TABLE=	(F2++(Y..Y)), PROFILE
5806 163 87 40 57 87 56 236 258 42 339 199 97 177 273 322 123 64 69 142 121 48 52 40 145 87 48 99 104 84 191 301 227 220
5431 220 115 121 128 178 77 117 113 64 249 153 118 97 28 64 141 118 48 73 207 174 146 145 183 340 191 122 144 127 225 327 189 116 188
5043 188 162 59 51 87 26 42 90 62 47 85 279 233 33 99 199 254 165 130 128 63 103 55 35 148 42 85 150 130 162 233 53 125
4668 125 121 121 105 256 162 94 148 74 152 237 186 43 58 151 150 96 125 129 59 285 154 188 74 304 371 283 44 49 243 110 191 269 326
4280 326 181 133 325 163 224 91 105 63 99 89 155 54 112 127 170 50 64 89 221 137 135 79 142 255 89 169 97 190 181 210 219 185
3905 185 178 154 153 52 130 58 111 119 61 120 97 175 51 104 29 144 177 270 187 101 114 56 105 108 186 98 109 102 234 274 51 54 89 157 37
3494 37 169 75 104 79 78 104 126 109 43 223 32 152 130 191 196 214 196 67 167 108 123 68 157 140 93 135 255 297 312 161 135 97
3118 97 190 102 82 180 129 129 63 187 193 92 111 129 206 438 369 101 127 101 40 169 189 194 283 180 76 124 53 157 132 118 122 18 50
2731 50 258 355 288 104 117 99 162 112 109 110 106 160 269 172 127 254 164 118 115 65 87 82 107 85 77 100 94 119 141 162 101 137 108 47 184 255
2308 255 127 82 192 106 121 66 82 122 222 180 211 143 46 72 55 127 87 166 75 130 133 179 203 66 227 189 198 147 71 199 192 143 132
1921 132 129 253 322 117 25 42 122 50 96 98 47 240 161 117 170 83 108 35 66 136 158 51 244 238 83 145 245 307 179 94 133 147
1545 147 91 125 227 127 26 88 205 179 63 51 198 168 216 250 145 300 485 198 133 90 309 101 254 137 65 259 182
1229 182 190 221 98 61 249 184 29 158 228 86 189 96 84 312 376 30 294 343 247 80 212 212 101 114 181 57 68 69 47 190
876 190 69 145 169 65 35 7 64 114 47 97 93 162 80 187 164 26 73 28 124 347 445 323 267 146 105 91 85 182 220 179 198 146 90
489 90 35 33 109 321 248 185 151 114 205 346 420 165 82 154 235 47 104 121 57 84 49 157 155 54 51 101 49 104 152 138 119 22 143 144
90 144 114 95 130 157 60 97 243 225 191 155 70 88 299 194 162 27 160 207 208 104 39 166 119 68
-192F8
##PAGE=	F1=1236.43
##FIRST=	25164.767445380970457,	5806.2096540000038658,	0.22190886735916137695
##DATA TABLE=	(F2++(Y..Y)), PROFILE
5806 122 66 65 49 91 59 198 209 32 307 195 109 236 372 342 117 28 79 123 124 45 30 32 116 91 64 138 122 110 204 356 193 210
5431 210 137 134 149 184 53 77 86 20 221 117 162 83 52 36 78 99 86 76 212 179 109 157 250 413 258 135 171 112 235 329 143
5067 143 123 168 176 16 48 62 23 31 77 57 78 36 258 241 43 59 171 213 124 154 158 58 72 96 50 114 21 42 114 149 162 241 41
4679 41 174 84 92 118 247 176 99 162 139 163 215 182 66 134 126 158 82 124 119 86 274 138 220 123 320 377 258 17 80 301 158 224
4304 224 334 331 186 155 300 109 239 122 69 94 137 96 172 78 157 142 180 74 71 72 215 99 156 89 127 274 99 154 78 176 133
3940 133 230 269 185 114 65 77 52 103 37 111 101 79 112 70 172 60 58 34 190 182 233 175 110 120 63 97 118 187 156 106 61 203 289 76
3541 76 26 78 95 50 133 57 189 68 103 131 151 171 39 191 57 163 114 184 175 249 174 45 109 119 77 48 171 161 85 120 209 206
3165 206 315 186 182 140 242 114 97 164 146 130 252 516 396 156 169 84 870 2061 1790 510 133 206 80 296 468 360
2860 360 317 163 78 116 80 154 110 83 104 21 102 234 364 262 101 155 137 157 47 95 148 119 119 285 179 144 225 130 115 71 82
2496 82 47 55 118 81 78 107 142 181 144 163 141 125 130 52 187 305 164 76 156 105 87 42 110 83 218 178 170 129 32 125 45 130 122 132 24
2085 24 158 143 162 204 44 235 219 225 144 50 188 163 106 156 140 186 288 185 13 57 75 28 70 47 88 193 113 135 160 34 141
1722 141 29 66 161 163 20 248 224 77 150 262 341 192 101 124 122 123 140 208 107 35 135 245 186 90 51 187 123 164 248 92 265
1358 265 430 184 175 92 312 100 261 149 85 195 136 180 195 61 60 227 129 88 158 233 64 190 131 82 354 382 36 288 307
1017 307 225 117 218 251 89 125 191 66 107 26 123 301 97 102 140 51 26 85 29 108 38 158 199 212 85 210 167 29 60 102
665 102 101 314 448 293 181 127 117 110 111 148 194 187 223 138 81 32 40 88 309 230 131 139 109 171 318 440 192 88 153 237 40 114 177
278 177 88 92 42 136 102 50 12 97 47 95 168 124 112 30 158 189 92 83 118 142 43 80 218 207 196 145 87 33 338 264 198 26 202 249
-121 249 226 136 53 168 148 70
-192G0
##PAGE=	F1=1134.17
##FIRST=	25164.767445380970457,	5806.2096540000038658,	0.31246954202651977539
##DATA TABLE=	(F2++(Y..Y)), PROFILE
5806 83 71 74 47 97 90 153 159 12 269 190 102 277 438 335 99 4 94 143 138 76 52 25 76 104 78 184 127 116 206 385 155 208 158
5419 158 149 164 180 27 67 60 34 183 111 199 81 63 15 26 89 120 87 223 173 73 188 303 457 305 145 201 107 228 299 98
5067 98 110 147 186 41 49 56 14 20 73 68 113 44 205 206 45 48 140 161 77 158 185 51 69 138 83 86 56 19 77 165 142 213 17 209 58
4656 58 61 147 244 192 107 161 214 179 194 171 103 198 97 157 80 138 114 129 255 111 219 170 316 344 214 78 144 372 216 244 375
4292 375 314 189 164 244 50 224 137 41 116 166 123 188 80 196 163 170 93 70 56 194 58 172 96 106 275 103 126 50 146 90
3940 90 231 305 178 51 53 7 67 91 27 116 93 96 105 41 134 50 40 59 237 196 176 146 119 119 81 84 117 160 180 178 22 156 271 100
3541 100 79 84 37 77 93 134 263 55 166 179 162 230 110 143 69 186 104 164 133 258 174 45 49 115 68 82 171 166 71 137 44 139 279
3154 279 169 212 180 298 105 87 142 161 149 513 870 558 246 245 179 1857 4449 3857 1095 155 338 119 501 822 635
2860 635 369 125 95 62 78 149 72 76 82 45 166 194 358 227 96 174 153 145 31 107 182 130 58 257 199 144 173 115 109 65 108 18 32
2473 32 120 87 96 136 191 214 127 161 174 118 149 77 185 338 203 62 119 116 43 20 147 80 202 163 126 117 44 170 70 158 148 98 31
2085 31 170 145 138 197 37 227 245 234 135 21 153 115 74 172 147 117 243 253 14 106 24 15 59 7 130 137 86 138 139 65 174 26
1710 26 78 169 152 83 225 185 76 120 228 342 197 89 94 103 159 158 194 89 53 175 275 176 104 79 166 85 132 228 58 225 357
1346 357 166 195 103 307 99 249 149 85 148 103 157 154 21 56 180 55 156 153 224 41 170 153 104 396 366 52 257 245 197
1006 197 154 213 292 88 116 187 80 138 75 212 369 110 66 120 42 60 146 5 84 39 213 298 252 100 202 165 35 127 178 72
653 72 257 407 243 95 94 102 121 132 107 143 160 231 154 98 33 45 75 289 198 84 130 87 144 285 445 194 93 133 214 42 110
290 110 204 114 102 62 120 54 58 65 129 47 80 188 120 106 47 170 214 64 65 110 123 118 134 188 176 217 142 108 69 350 309 230 53 218
-110 218 259 199 133 71 167 177 105
-192A05
##PAGE=	F1=1031.91
##FIRST=	25164.767445380970457,	5806.2096540000038658,	0.39619714021682739258
##DATA TABLE=	(F2++(Y..Y)), PROFILE
5806 52 84 66 45 87 124 120 116 76 235 179 78 294 457 307 79 27 108 196 163 133 66 17 36 119 91 215 118 102 201 387 123 208
5431 208 175 167 180 169 18 103 60 91 135 125 221 80 55 70 80 114 145 99 237 163 49 231 323 455 318 154 232 110 213 248
5078 248 58 80 128 199 88 63 68 2 25 74 83 143 86 128 134 38 46 109 115 33 152 201 51 101 170 106 79 103 64 41 174 107 153 32
4679 32 217 65 31 185 248 199 109 156 282 192 168 150 130 239 80 151 110 160 113 167 222 80 190 210 291 278 152 133 214 441
4327 441 271 256 380 274 191 154 173 69 175 132 57 130 183 160 211 72 221 191 138 107 58 45 166 50 176 100 85 258 106
3987 106 89 17 104 48 220 322 167 102 112 46 78 116 25 128 108 105 104 49 74 27 62 71 274 213 110 106 125 115 116 57 104 107 173 232 32
3576 32 101 223 104 142 105 46 95 56 207 315 72 239 223 154 275 168 87 71 206 111 125 88 248 206 69 32 95 138 148 169
3224 169 140 22 185 250 564 358 118 222 211 344 82 60 127 178 190 796 1187 669 333 333 376 3004 7202 6194 1734
2931 1734 218 462 151 754 1191 949 432 81 117 35 55 146 27 111 59 50 218 161 336 201 104 165 145 142 83 120 202 142 33
2590 33 188 229 140 115 120 98 108 120 11 11 122 106 130 176 227 215 88 153 193 108 159 117 184 344 228 43 86 127 19 15 172 108
2215 108 176 141 103 113 61 192 98 194 157 84 83 165 138 107 179 78 203 256 220 121 45 110 62 69 181 148 66 198 302 30 150 26
1839 26 3 66 51 147 93 122 130 146 129 196 33 88 154 122 134 183 132 94 70 148 306 189 67 52 100 181 171 190 83 64 203 290 145
1452 145 96 106 134 55 127 193 71 184 280 134 199 129 298 107 219 139 67 141 104 127 120 32 47 117 30 228 142 205 23 143 164
1088 164 154 429 326 83 208 171 166 185 200 329 103 88 170 102 161 108 275 381 107 37 104 31 64 179 31 56 66 249 372
747 372 273 112 162 147 34 190 245 34 186 335 170 48 58 92 128 138 66 77 106 219 188 136 59 59 77 273 162 61 119 68
395 68 144 251 435 175 84 99 168 58 96 203 134 118 88 125 29 74 111 167 49 67 208 133 106 60 178 214 60 45 108 106 192 201
20 201 147 143 261 147 126 139 338 326 259 87 204 237 129 96 79 157 196 137
-192A37
##PAGE=	F1=929.656
##FIRST=	25164.767445380970457,	5806.2096540000038658,	0.37917357683181762695
##DATA TABLE=	(F2++(Y..Y)), PROFILE
5806 29 89 57 50 56 154 132 81 167 213 157 68 287 431 266 80 45 113 242 194 194 61 6 3 120 111 221 97 77 190 366 102 202
5431 202 186 186 206 155 46 147 98 147 81 141 229 69 56 119 131 154 158 105 248 155 47 269 300 402 294 161 260 114 199 195 27
5067 27 42 117 209 120 87 82 11 48 79 90 164 111 56 48 32 39 80 98 14 152 206 55 126 183 112 74 136 112 19 176 72 74 57 190 83
4656 83 6 216 253 187 105 166 326 193 141 130 141 254 86 146 155 181 115 186 176 76 149 239 249 192 82 175 269 490 310 268 346
4292 346 216 187 126 109 128 98 122 97 134 187 196 247 78 227 225 90 118 42 45 146 87 167 101 68 227 112 50 25 66 33 202 318
3916 318 163 190 147 76 87 158 23 139 130 103 110 66 42 35 82 63 294 222 47 64 127 113 158 25 91 64 154 244 64 57 149 82 201
3529 201 131 85 100 21 253 334 118 299 245 125 301 206 42 70 215 135 69 62 234 254 96 78 71 222 212 168 108 33 233 425
3177 425 794 415 59 221 221 375 56 40 122 200 242 1045 1429 738 399 413 566 4069 9712 8262 2273 305 545 199
2895 199 1009 1504 1230 486 73 135 121 31 152 41 154 38 48 245 163 297 187 134 131 118 154 118 115 203 162 114 95 256 146
2555 146 69 141 84 162 112 33 14 124 136 165 214 250 190 42 137 194 89 156 163 184 323 232 25 65 134 54 22 175 140 142 123 122 116 77
2156 77 187 113 214 147 102 124 145 128 70 152 125 168 249 183 100 85 77 17 96 185 144 63 163 318 46 177 56 26 104 87 139 92
1780 92 179 119 187 178 202 46 87 119 77 171 130 104 128 75 44 236 170 70 23 117 184 172 188 90 70 229 287 98 66 124 98 34 126
1393 126 152 94 140 210 96 196 169 292 138 172 119 43 164 126 101 114 78 38 53 100 292 121 182 26 129 169 210 447 266
1053 266 117 162 106 135 203 188 357 126 47 144 129 182 126 303 337 98 39 90 34 41 183 46 64 102 262 409 273 116 106 116
700 116 26 230 290 15 114 251 76 107 59 139 133 124 34 65 57 192 227 178 103 81 92 265 135 54 108 79 162 216 409 140 60 61 109
313 109 81 80 179 149 141 109 157 47 94 145 199 53 72 222 162 118 68 181 189 86 31 104 103 243 252 91 137 309 150 138 198 306 317
-74 317 282 132 165 189 26 41 74 139 201 158
-192A58
##PAGE=	F1=827.398
##FIRST=	25164.767445380970457,	5806.2096540000038658,	0.25258219242095947266
##DATA TABLE=	(F2++(Y..Y)), PROFILE
5806 18 87 70 76 7 176 186 53 265 202 129 112 265 366 222 107 62 104 257 225 242 52 26 40 98 140 203 84 58 170 327
5454 327 95 181 193 203 238 150 82 179 146 198 30 147 225 45 91 146 156 184 160 103 250 154 66 288 236 311 239 169 283 115 185
5090 185 160 5 8 110 204 128 115 100 23 76 92 84 176 115 86 75 34 45 52 108 38 151 196 48 125 177 101 70 147 152 38 171 66
4703 66 24 69 132 94 53 227 249 151 96 194 334 187 115 130 134 246 99 150 199 191 116 181 124 106 123 255 202 98 28 201 294 501
4327 501 320 276 280 148 174 84 75 179 25 139 136 126 187 222 290 114 208 252 57 126 34 54 151 136 153 97 65 191 124 31 59 73
3952 73 81 180 293 178 262 153 80 97 197 28 142 143 90 114 66 85 78 90 46 293 211 17 27 126 114 197 43 96 112 140 215 88
3576 88 71 61 39 251 148 108 99 19 262 313 168 331 234 94 304 223 37 73 208 163 11 55 233 290 111 115 64 292 252 153
3224 153 92 69 250 340 483 198 39 221 201 390 43 70 117 226 288 1206 1560 769 432 464 683 4810 11362 9538 2572
2931 2572 384 567 257 1186 1683 1411 501 111 140 174 38 156 83 182 22 62 243 188 241 172 176 80 82 169 133 90 183 189 192 29
2578 29 269 157 47 172 73 213 87 73 38 119 171 186 242 262 151 60 113 177 67 143 208 181 282 213 24 61 137 82 26 156
2226 156 166 107 117 162 118 98 155 109 206 121 130 149 114 128 34 128 162 133 223 130 74 108 61 38 135 185 142 93 139 297 54 185 70
1839 70 72 169 110 113 120 221 110 228 200 194 61 83 76 44 197 75 140 168 150 77 144 146 109 49 135 166 156 180 102 77 259 262 63 21 131
1428 131 63 28 115 113 97 99 163 81 189 216 289 185 112 90 32 191 138 95 135 124 38 30 148 338 91 164 38 138 170 253 446 195
1053 195 145 139 70 103 200 180 368 142 7 122 152 200 146 298 257 91 81 87 65 6 168 47 105 136 251 403 254 110 71 83
700 83 14 243 304 71 81 176 33 185 102 215 130 87 38 130 82 164 255 214 147 104 117 264 126 44 99 108 178 185 361 97 28 54
325 54 81 102 69 143 160 162 119 201 77 116 165 226 61 94 221 202 138 75 175 146 116 28 92 117 261 279 26 171 340 145 143 236
-51 236 263 290 297 181 118 123 90 46 62 114 194 166
-192A66
##PAGE=	F1=725.14
##FIRST=	25164.767445380970457,	5806.2096540000038658,	0.16811905801296234131
##DATA TABLE=	(F2++(Y..Y)), PROFILE
5806 27 93 97 112 51 192 249 39 344 192 114 177 234 279 181 141 80 81 235 248 267 68 62 84 57 170 174 100 66 143 279 99 145 193
5419 193 212 269 161 121 197 189 237 32 143 210 17 139 145 151 195 157 100 236 160 95 283 140 213 164 178 297 108 164 152 30 13
5055 13 101 176 106 142 123 32 102 116 66 183 98 155 154 31 66 38 121 63 131 169 31 102 153 76 98 139 179 63 161 97 91 73 51 98
4656 98 105 208 227 93 83 222 300 189 88 149 112 216 100 167 232 187 112 156 77 137 124 261 162 13 70 214 280 467 295 269
4304 269 194 80 150 44 68 216 110 186 168 106 194 231 324 158 166 258 84 129 48 67 176 187 147 86 83 158 145 59 88 121 134 155
3928 155 248 210 306 135 63 106 222 47 137 143 70 114 73 120 123 84 48 272 172 31 15 123 113 222 81 121 188 133 159 102 122
3564 122 30 18 282 149 110 95 56 231 250 207 333 192 105 288 221 40 84 185 183 52 40 241 292 107 130 84 337 253 110
3224 110 100 100 214 221 646 532 85 235 147 397 48 120 105 258 313 1243 1556 762 432 470 682 5062 11745 9695 2554
2931 2554 428 525 272 1203 1678 1446 462 144 127 168 92 145 109 184 14 95 212 198 171 146 216 61 46 171 134 58 148 213
2602 213 252 100 256 153 47 203 77 254 74 120 61 105 202 184 256 272 116 110 87 145 69 136 247 173 233 171 32 71 140 93
2250 93 25 116 188 85 125 202 120 127 107 89 170 85 151 154 82 143 48 121 179 110 184 69 47 106 48 70 169 179 144 124 121 242 53 175
1851 175 72 130 245 120 82 147 240 100 244 195 174 73 100 61 77 219 28 197 202 230 160 47 128 153 80 136 133 121 156 115 91
1487 91 287 216 96 30 137 38 47 97 86 78 69 145 109 180 260 281 227 51 57 55 206 124 114 166 163 46 57 165 359 68 154 47 161
1099 161 166 273 429 128 163 136 64 69 170 173 353 138 35 114 167 212 181 269 176 83 127 104 106 43 143 39 147 158 223 358 224
736 224 102 87 64 19 230 286 129 121 135 143 261 145 280 116 51 70 186 126 138 259 240 179 125 147 265 131 33 93 137 187 163
372 163 291 52 4 91 127 113 60 106 166 177 112 237 103 136 172 250 65 118 202 241 162 82 160 95 135 37 76 133 243 280 49 215
-4 215 340 128 142 247 215 250 300 218 85 52 197 98 44 86 177 161
-192A61
##PAGE=	F1=622.883
##FIRST=	25164.767445380970457,	5806.2096540000038658,	0.24539171159267425537
##DATA TABLE=	(F2++(Y..Y)), PROFILE
5806 42 114 118 145 103 204 303 58 384 173 128 236 205 187 152 169 101 56 185 259 264 101 99 129 24 192 146 133 93 111 228 108
5442 108 98 185 208 289 179 162 202 216 261 62 129 187 20 178 122 125 186 153 109 206 168 125 258 41 161 85 183 300 92 132 155
5078 155 65 20 89 129 59 165 147 37 120 147 42 191 72 209 209 20 87 63 121 87 91 124 25 69 116 46 154 124 186 78 147
4715 147 137 148 83 35 101 143 155 183 35 67 229 230 209 60 167 82 172 87 194 255 169 103 119 47 152 134 254 137 64 119 216
4351 216 231 393 236 237 113 25 119 31 61 241 203 242 192 77 212 221 336 195 110 236 126 127 69 82 201 232 159 72 114 131 183
3987 183 94 112 170 173 129 189 247 321 105 29 109 228 71 130 140 52 119 134 127 162 69 76 236 112 29 42 122 103 231 106 145 245
3611 245 120 93 110 174 112 71 290 128 94 87 95 162 153 229 308 129 154 257 206 17 99 152 187 87 15 240 252 88 120 107 353
3247 353 210 38 132 166 115 1149 2628 1720 178 271 80 402 55 171 87 291 311 1153 1406 711 410 429 552 4794
2966 4794 10794 8705 2228 424 433 198 1012 1483 1324 369 150 96 166 198 118 110 159 18 127 161 176 99 111 240 113 15
2661 15 160 131 51 109 222 290 159 212 122 63 217 105 280 103 162 77 93 218 155 256 287 101 149 72 106 96 153 271 160
2320 160 185 112 36 82 147 90 29 67 206 87 142 234 123 159 55 66 114 48 155 140 74 166 89 136 178 104 139 21 40 81 28 91
1945 91 186 166 147 146 103 164 52 155 69 194 317 119 58 162 234 85 228 176 150 83 142 93 130 237 40 238 222 294 202 58
1592 58 120 185 108 110 89 77 112 124 106 300 154 157 74 146 28 77 82 74 47 56 144 156 171 292 260 247 12 41 103 209 83 145 199 186
1193 186 48 73 155 354 78 151 51 180 153 269 405 79 168 130 64 33 121 163 311 105 67 122 173 214 225 228 150 67 158 139
841 139 143 74 117 51 176 165 189 283 190 100 110 62 46 199 239 178 174 126 240 328 175 310 98 81 109 213 142 107 233 256 190 151
466 151 172 264 136 38 87 161 199 158 205 9 32 132 188 107 41 74 166 176 88 253 119 146 172 267 58 136 166 266 184 86 136 63
90 63 142 54 63 140 192 256 108 246 305 101 135 235 166 201 288 227 72 16 275 133 20 57 151 149
-192A49
##PAGE=	F1=520.625
##FIRST=	25164.767445380970457,	5806.2096540000038658,	0.35458913445472717285
##DATA TABLE=	(F2++(Y..Y)), PROFILE
5806 55 143 128 165 135 208 334 95 372 141 158 276 185 105 143 182 124 58 129 255 236 128 131 164 59 196 127 156 121 80 184 118
5442 118 53 168 188 291 188 201 202 228 267 76 109 156 39 199 93 90 163 150 130 162 170 144 220 86 182 25 182 288 68 96
5090 96 153 103 23 82 99 53 182 161 38 127 175 46 206 50 241 232 34 96 107 106 109 81 67 51 52 80 29 207 117 168 86 132 171
4703 171 186 101 104 102 149 77 123 70 51 206 138 234 35 166 57 119 70 226 270 143 93 84 38 154 136 234 113 116 149 209 166 298
4327 298 159 179 70 16 87 29 46 251 277 287 211 46 234 195 320 213 68 185 144 117 87 98 211 262 181 69 151 110 236
3987 236 125 137 204 189 109 125 279 309 73 15 105 217 94 123 147 54 134 224 113 187 53 107 199 76 35 70 123 81 224 112
3635 112 151 272 92 39 111 218 178 118 273 90 70 69 127 70 35 231 271 65 196 216 188 35 111 120 167 95 49 220 177 82 80
3271 80 118 345 127 52 188 258 39 2466 5281 3298 325 324 111 411 55 217 67 321 284 959 1124 614 380 353 320
2977 320 4114 8794 6842 1685 373 318 115 646 1151 1068 244 125 48 318 352 104 86 115 30 149 102 121 60 74 240
2684 240 170 11 144 129 72 82 208 306 193 153 67 87 205 149 290 148 189 81 104 215 108 247 306 108 168 85 71 120 192
2344 192 277 147 142 43 51 88 161 84 43 30 217 103 161 254 134 181 11 66 61 19 140 110 107 183 122 157 168 111 91 37 63 68 23 100
1945 100 179 146 148 153 89 88 65 129 66 254 372 110 55 169 207 72 182 158 131 88 188 132 174 245 80 250 221 332 199 127 113
1581 113 197 139 59 50 54 48 126 115 288 85 210 108 157 32 111 73 75 44 57 146 198 172 307 224 233 40 72 164 201 28 174 226 187
1193 187 38 78 130 326 107 148 56 189 128 248 386 56 158 113 85 22 75 148 243 48 97 137 167 203 263 186 192 69 163 182
841 182 166 83 96 87 189 152 157 192 160 109 113 60 81 165 176 211 207 121 310 380 195 299 93 134 146 209 124 76 181 263 178 187 183 259 130
430 130 57 83 172 222 170 117 27 60 160 227 85 12 57 160 159 48 243 122 144 170 270 38 145 123 266 198 84 106 83 141
78 141 69 62 138 118 212 148 255 242 64 124 204 122 150 257 200 64 67 311 149 13 27 121 134
-192A34
##PAGE=	F1=418.367
##FIRST=	25164.767445380970457,	5806.2096540000038658,	0.38280701637268066406
##DATA TABLE=	(F2++(Y..Y)), PROFILE
5806 67 172 135 168 139 200 335 135 308 100 180 292 178 47 154 177 144 84 96 236 193 136 151 180 93 181 110 158 144 54 150
5454 150 126 17 142 155 271 177 231 201 226 255 76 86 118 45 202 81 62 136 149 153 114 163 145 180 166 222 66 171 260 40 75
5090 75 142 132 42 83 135 126 192 159 36 120 194 82 223 43 251 230 74 93 153 76 118 137 21 82 55 63 46 237 123 129 100 119
4715 119 195 207 109 139 97 113 33 69 129 45 150 50 243 47 142 51 64 79 251 275 114 86 63 48 148 128 193 74 145 157 195
4351 195 133 221 100 110 87 30 58 5 39 244 324 313 225 23 250 159 278 205 86 116 132 102 94 111 199 269 194 87 187 96 291
3987 291 148 172 214 180 105 72 300 281 46 62 93 188 113 120 161 66 156 312 98 191 42 132 176 128 74 94 129 51 206 99 132
3623 132 265 52 15 106 248 223 151 236 51 69 39 148 66 86 217 236 34 205 172 178 103 113 100 122 86 103 180 99 113 20 114
3259 114 323 25 143 264 342 223 3931 8164 5003 503 381 222 426 50 253 53 344 239 714 756 475 348 261
2989 261 88 3216 6261 4575 1061 289 206 275 249 780 728 148 80 44 568 530 141 45 78 47 158 53 64 81 47 213
2684 213 208 35 133 124 86 78 172 305 204 122 30 102 162 193 283 184 193 71 126 195 71 238 325 118 171 117 59 128 236 266 136 115
2308 115 54 88 84 184 91 62 49 214 111 177 257 159 188 22 88 61 22 105 72 154 186 137 168 161 128 41 58 93 101 48 94 144 122 144
1909 144 143 98 65 86 102 65 300 400 95 75 172 170 80 117 160 124 91 221 162 202 237 111 230 200 340 160 171 96 189 169 25
1545 25 69 84 28 121 128 254 24 247 129 158 47 148 55 78 80 78 140 220 185 302 181 187 57 117 225 188 46 190 239 165 26
1182 26 86 105 287 130 143 64 188 93 226 383 68 134 99 137 70 72 133 163 58 130 149 150 178 280 147 242 111 143 224 169 65
818 65 82 125 186 119 135 97 136 120 98 50 113 144 107 224 209 106 344 411 213 255 113 166 174 186 84 88 122 263 149 233 176 251 112
430 112 85 90 167 249 194 50 51 91 170 230 63 45 81 153 126 8 213 120 131 170 254 11 144 81 242 203 82 73 122 138 71 66 135
43 135 38 152 162 243 166 13 115 165 95 121 207 142 62 100 306 167 57 4 91 121
-192A21
##PAGE=	F1=316.109
##FIRST=	25164.767445380970457,	5806.2096540000038658,	0.26498517394065856934
##DATA TABLE=	(F2++(Y..Y)), PROFILE
5806 84 193 147 152 119 174 302 166 207 58 185 285 180 46 177 156 156 104 90 205 148 123 155 173 104 145 87 136 160 35 126 129
5442 129 8 116 114 230 146 246 195 215 227 69 68 79 39 194 87 59 111 143 169 74 145 124 142 217 244 116 152 216 31 78 126
5078 126 144 75 85 197 199 197 141 36 100 196 120 235 41 242 212 118 84 193 36 107 199 41 116 53 74 73 250 135 83 129 113
4715 113 203 219 91 131 85 38 114 69 165 55 70 56 221 82 103 67 25 117 260 267 86 87 62 77 136 111 125 14 154 143 173 167
4339 167 202 119 85 112 25 33 45 44 220 344 317 231 16 250 122 217 171 122 54 97 88 87 122 166 248 191 108 216 99 334 164 215
3963 215 199 155 118 50 306 243 28 105 79 146 127 118 165 66 170 374 104 170 38 147 168 196 120 113 138 30 181 75 90 232
3611 232 15 11 97 257 246 169 190 43 112 17 154 173 195 197 215 46 175 135 182 170 103 95 59 92 154 130 109 160 68 99 294 84
3236 84 215 350 391 406 5252 10712 6503 675 428 333 439 49 273 49 356 187 478 370 318 316 187 261 2311 3769
2954 3769 2404 491 192 108 427 238 481 366 166 55 110 818 699 201 18 93 64 156 43 87 105 36 163 218 58
2661 58 129 108 84 82 123 284 200 159 85 92 92 227 261 199 177 49 136 172 77 237 337 123 161 153 76 116 272 243 134 119 136 138 67 218
2261 218 120 78 78 190 103 182 244 196 175 41 109 93 50 57 55 193 170 131 164 166 151 21 65 119 143 66 77 87 98 132 115 130 98 100 82
1851 82 69 327 398 73 103 176 131 114 43 177 135 91 234 183 214 209 127 187 159 317 108 187 65 166 187 84 128 124 102 112 163 210
1475 210 35 261 139 142 66 185 36 72 113 112 121 210 192 279 154 120 62 154 275 176 93 187 234 124 49 100 88 246 137 139 74 177
1099 177 50 225 403 108 101 111 201 124 101 123 101 143 161 152 128 137 272 110 270 162 106 256 157 27 76 147 171 66 130 16
747 16 117 125 82 36 134 145 47 219 180 77 338 415 237 206 143 164 184 158 46 143 91 261 119 278 154 237 97 127 110 145 265
383 265 220 55 64 123 162 195 81 99 134 153 86 59 173 123 111 171 221 27 133 53 200 199 92 43 149 135 52 73 142 37 86 152
8 152 217 99 54 117 127 96 140 144 67 95 112 272 206 106 36 77 116
-192A16
##PAGE=	F1=213.851
##FIRST=	25164.767445380970457,	5806.2096540000038658,	0.13348138332366943359
##DATA TABLE=	(F2++(Y..Y)), PROFILE
5806 109 200 164 122 83 128 238 183 92 23 170 260 186 73 198 124 154 104 81 174 118 92 142 148 90 96 64 97 172 26 114 126 15 101
5419 101 71 174 102 240 182 197 189 62 68 60 30 185 93 77 97 131 174 57 123 88 103 232 247 158 125 158 62 84 110 138 114 86 243
5032 243 248 196 116 39 72 183 148 238 32 220 186 159 80 226 22 75 238 56 158 37 90 100 264 149 66 165 113 193 225 47
4679 47 83 71 62 180 105 173 70 22 99 168 119 88 84 41 158 246 243 60 92 82 113 120 85 31 63 144 113 148 220 227 172 130 126 11 17 110
4257 110 45 187 339 302 225 30 235 99 149 120 137 75 77 85 69 134 118 202 170 117 234 126 353 172 257 168 134 144 47 298 205
3893 205 19 137 67 94 134 111 147 45 168 396 128 126 38 154 159 237 154 124 147 31 150 57 34 185 37 36 98 242 249 173 150
3529 150 60 170 65 143 273 276 178 211 48 108 127 195 218 85 96 33 127 192 83 176 201 150 85 258 173 255 421 397 554 6147
3177 6147 12381 7480 802 446 413 447 58 270 57 358 138 300 47 190 282 166 450 1559 1768 718 98 106 45
2907 45 422 314 293 48 225 94 170 997 825 249 61 139 76 145 57 138 105 41 103 206 81 122 81 67 75 83 245 180 215 134
2555 134 61 8 241 230 190 145 30 121 163 91 245 334 119 144 184 104 92 297 215 142 150 214 185 37 258 161 86 92 144 93 175 214
2179 214 238 148 50 119 110 88 17 82 210 133 110 145 181 170 66 64 135 167 65 64 19 78 114 77 166 124 100 81 76 334 364 42 130 177
1780 177 98 156 26 194 161 89 226 200 212 167 130 130 104 267 67 185 26 138 183 134 185 153 160 102 220 176 71 251 144 108
1428 108 88 215 57 54 132 144 91 164 178 243 157 50 70 176 303 166 114 159 212 75 83 110 74 212 131 141 84 160 5 263 441
1064 441 157 73 143 257 175 123 116 103 216 179 145 117 81 239 75 265 195 66 278 147 17 79 147 149 15 150 57 99 118 86
712 86 31 139 158 14 203 129 40 293 388 260 187 166 126 172 136 50 193 109 260 108 307 127 213 103 181 139 119 259 234 90
360 90 83 156 141 127 138 149 196 166 62 108 135 133 94 169 182 54 113 48 157 187 117 26 159 133 22 93 158 87 23 128 187 67 133
-27 133 138 103 120 189 85 40 151 104 238 258 149 67 82 119
-192A19
##PAGE=	F1=111.593
##FIRST=	25164.767445380970457,	5806.2096540000038658,	0.25006633996963500977
##DATA TABLE=	(F2++(Y..Y)), PROFILE
5806 136 189 177 85 54 67 156 181 19 6 139 222 189 94 209 90 133 81 52 160 116 53 116 111 56 48 57 53 181 46 114 118 20 107 24
5407 24 109 59 217 161 169 148 60 90 90 38 174 91 101 99 114 168 51 104 44 57 218 240 192 94 92 101 75 99 124 151 92 260 267 190 97 45
4985 45 43 156 165 230 19 190 159 190 88 252 68 29 250 44 210 11 98 127 294 170 96 192 114 168 225 26 47 66 162 211
4632 211 130 160 85 111 109 94 149 126 97 70 183 210 210 39 93 114 142 100 49 85 147 120 80 126 254 248 209 177 133 37 16 171 36 150
4233 150 314 273 201 67 210 106 101 90 123 133 106 88 61 151 63 145 139 105 235 162 343 173 287 143 141 171 32 273 171 22
3881 22 154 64 41 134 96 106 25 149 373 150 65 46 153 130 238 166 125 148 37 113 71 26 137 62 85 125 198 235 169 125 76
3517 76 217 119 118 348 322 164 219 41 18 148 206 234 63 95 101 167 214 54 219 226 219 83 214 235 255 444 365 643 6414 12798
3165 12798 7715 856 424 447 443 69 243 72 352 96 194 188 155 254 198 534 1022 482 326 198 64 132 249 179 144 204
2860 204 251 136 205 1057 882 271 101 181 86 128 65 156 81 60 52 183 100 109 46 44 51 82 195 146 249 154 74 76 230 196 161 113 55
2473 55 87 174 73 258 311 108 124 205 129 66 312 190 160 185 275 216 30 299 201 83 93 93 120 154 172 273 116 51 119 107 132
2109 132 57 117 198 78 85 121 194 178 103 70 139 162 46 89 61 62 92 64 194 133 87 98 84 322 305 8 148 171 71 195 85
1745 85 192 192 88 203 215 199 119 123 70 40 201 48 175 15 112 157 155 225 169 192 95 279 159 102 218 144 63 108 228 97 22
1381 22 138 155 53 89 136 199 173 30 87 184 305 163 106 107 173 30 104 106 65 189 119 152 92 140 32 323 481 200 70 174
1029 174 290 211 130 104 132 255 177 125 137 24 192 53 229 196 38 290 161 57 87 127 127 75 188 103 80 99 99 41 129 167
677 167 32 183 71 8 218 331 272 205 173 62 141 128 67 214 141 263 113 311 103 178 125 233 168 124 229 227 117 123 187
337 187 121 40 203 188 250 190 77 146 109 141 86 167 150 71 89 62 135 172 144 26 152 133 58 130 172 106 44 101 164 71 215 174 98
-51 98 147 233 75 102 203 79 234 303 174 93 94 125
-192A25
##PAGE=	F1=9.33551
##FIRST=	25164.767445380970457,	5806.2096540000038658,	0.40620774030685424805
##DATA TABLE=	(F2++(Y..Y)), PROFILE
5806 154 161 173 50 50 34 90 161 92 30 99 176 183 105 208 63 92 44 10 174 138 26 81 72 32 43 71 23 188 87 126 106 31 126
5419 126 26 42 30 192 138 129 115 69 125 137 59 161 85 120 115 95 156 40 99 10 2 186 233 217 65 36 135 56 102 124 179 121 249
5032 249 258 176 89 49 40 124 173 214 14 156 134 208 105 271 115 22 240 7 262 13 97 151 329 195 125 198 108 130 216 92
4679 92 119 78 242 204 139 142 96 187 86 33 170 172 104 90 183 155 175 41 87 148 156 81 29 200 221 90 65 116 258 244 222 199 138
4292 138 79 24 209 32 113 278 235 161 122 188 133 113 125 92 180 141 82 94 175 45 104 103 70 214 195 309 171 295 146 172 188
3928 188 8 231 143 43 157 74 18 127 73 56 66 126 311 161 3 69 150 80 198 154 113 139 48 68 104 77 100 73 139 178
3576 178 130 211 161 114 90 242 163 82 388 330 156 227 50 75 179 205 213 43 92 159 188 218 50 219 236 262 100 175 268 217 402
3212 402 308 661 5983 11853 7144 824 358 427 427 69 198 87 341 66 126 272 182 246 238 508 676 178 713 272 75
2919 75 246 278 360 107 343 239 157 201 984 859 263 131 208 97 109 70 132 47 87 38 163 114 101 13 34 12 110 156 108 248
2567 248 141 157 144 195 164 121 107 100 77 192 15 270 269 91 105 212 140 51 317 170 181 208 309 222 77 335 228 69 89
2226 89 106 190 123 129 289 93 47 118 93 176 99 139 158 11 66 104 197 168 120 83 131 131 37 145 128 45 69 112 208 132 73 121 91 295
1827 295 230 33 152 155 47 223 132 166 215 102 173 229 179 78 113 29 26 136 32 168 46 90 118 142 241 178 196 89 321 151
1475 151 136 164 144 25 116 217 122 26 142 139 44 29 78 154 177 58 110 185 285 167 91 56 122 14 102 97 85 169 110 167 94 120
1099 120 55 376 505 223 85 194 296 225 128 82 138 247 153 100 182 71 142 70 169 165 29 298 195 79 95 99 104 140 232 128
747 128 62 73 102 54 112 165 44 166 23 45 125 252 267 227 164 18 104 137 64 203 166 270 115 285 92 136 141 267 192 173
395 173 185 197 137 175 209 115 48 261 213 285 217 111 169 104 137 96 172 132 78 72 81 137 156 162 30 132 137 114 177 178 94 90 85 156 74 284
-27 284 214 108 164 253 114 151 232 42 259 319 174 110 97 129
-192A29
##PAGE=	F1=-92.9223
##FIRST=	25164.767445380970457,	5806.2096540000038658,	0.49028614163398742676
##DATA TABLE=	(F2++(Y..Y)), PROFILE
5806 154 117 149 21 54 94 114 126 133 67 62 124 166 107 197 51 39 28 31 203 170 44 45 62 70 76 86 54 190 135 143 91 45 147 79 16
5395 16 38 187 120 80 100 96 161 175 79 143 80 127 133 76 144 28 111 30 59 150 226 232 47 64 159 50 121 152 193 169 218 236 154 90 49
4985 49 74 103 180 193 16 125 113 212 121 286 154 58 215 43 300 25 91 163 342 212 136 180 91 87 193 144 199 108 287 169
4632 169 138 136 103 237 43 75 179 199 108 104 157 91 144 62 74 170 156 80 74 295 270 80 79 124 234 216 211 198 146 121 41 213 45
4245 45 77 239 196 113 185 179 163 159 181 64 209 149 63 143 201 86 108 69 21 171 215 267 166 279 170 203 188 45 176 120 74
3881 74 156 100 55 113 51 38 114 119 224 158 54 107 152 24 126 121 88 120 84 22 133 113 77 73 188 237 50 184 155 113 106 237 190
3494 190 50 392 308 151 222 68 153 201 188 163 36 90 189 185 211 72 178 231 274 133 170 275 152 298 241 609 4923 9701
3165 9701 5863 712 256 354 397 47 153 100 319 48 62 233 187 262 258 395 467 266 635 238 83 305 518 663 219
2872 219 375 208 155 158 802 763 232 151 223 116 89 89 72 43 114 50 152 126 105 18 48 35 135 151 89 217 100 248 184 145 140
2508 140 86 140 147 123 203 74 283 210 69 92 202 131 46 309 153 200 214 308 201 131 360 235 48 86 180 271 90 103 284
2168 284 83 55 120 87 212 129 142 98 59 60 105 191 144 111 94 113 87 69 206 182 29 51 177 207 130 75 138 95 255 153 65 144
1792 144 127 28 240 167 115 218 134 138 239 157 64 107 48 84 88 15 169 68 66 85 103 234 185 177 86 332 138 172 103 143 31 105
1416 105 178 120 70 156 99 84 103 68 112 159 57 130 186 247 177 120 90 65 23 73 113 137 146 108 180 87 103 57 394 496 221 92 204
1029 204 273 210 126 51 106 193 112 77 231 145 109 110 100 113 45 301 225 80 99 88 81 191 268 137 53 42 88 62 102 153 47 153
653 153 19 86 34 163 243 230 143 79 79 160 41 178 185 276 109 234 96 103 138 275 208 234 143 146 153 217 218 124 122 301 223 293 242 142
254 142 177 120 125 122 187 119 84 71 97 140 144 165 34 105 141 152 216 177 62 121 83 163 64 329 250 125 166 242 149 174 229 18 286 300
-145 300 148 117 86 124
-192A24
##PAGE=	F1=-195.18
##FIRST=	25164.767445380970457,	5806.2096540000038658,	0.45262885093688964844
##DATA TABLE=	(F2++(Y..Y)), PROFILE
5806 132 63 109 4 46 151 180 90 142 110 51 68 139 97 180 54 32 56 55 230 206 71 31 104 118 103 92 113 184 178 157 70 58 166
5419 166 130 59 63 201 110 35 102 137 188 190 95 124 79 127 143 60 139 37 138 46 115 118 215 231 43 114 167 72 147 188 188 221 183 215 124
5008 124 92 44 117 107 185 171 20 105 95 202 129 295 182 74 177 90 313 22 85 156 316 211 126 141 59 49 156 163 249 151
4656 151 294 123 138 146 109 254 14 119 176 195 109 112 115 39 113 82 58 175 150 104 125 350 287 99 105 150 190 175 183 180 156 150 73 181
4257 181 56 49 200 160 88 242 182 184 197 222 63 220 121 57 182 220 127 140 47 34 108 221 234 160 241 188 219 166 86 113 104 109 168
3870 168 136 83 94 40 57 142 135 132 144 87 149 161 53 41 78 54 96 137 44 143 129 67 67 223 288 51 163 154 122 114 203 194 44 363 266
3459 266 150 193 73 197 209 161 98 41 82 185 166 200 114 115 213 257 175 216 261 73 163 171 498 3408 6701 4080 544 133
3130 133 242 353 15 142 111 280 36 52 116 162 289 244 238 354 133 285 144 94 239 469 580 165 309 179 147 87 565
2813 565 615 184 163 233 136 68 118 2 76 141 54 149 139 111 27 74 82 150 169 106 167 42 321 192 91 123 80 189 192 178 202 174
2438 174 291 145 51 91 176 98 42 284 130 210 206 271 157 178 370 218 21 84 247 340 65 100 258 81 90 125 93 232 145
2097 145 127 51 122 56 120 179 112 80 96 93 62 109 258 219 31 49 233 198 131 95 147 98 205 86 85 132 94 45 247 193 61 197
1722 197 175 97 237 134 69 109 69 128 59 58 181 80 37 71 56 215 192 147 88 311 124 198 70 141 47 73 120 92 109 177 53
1358 53 127 175 124 74 119 27 140 187 192 186 182 167 44 22 30 163 198 116 113 180 68 89 38 361 448 203 88 207 231 168 127 36 41 105
959 105 66 68 267 208 104 152 50 83 84 290 237 68 96 103 62 223 285 133 60 34 67 66 99 133 48 142 31 121 58 89 208 216 115
571 115 121 76 181 13 186 203 277 110 172 112 97 117 255 215 279 115 85 163 235 206 138 170 318 220 273 258 163 174 153 123 159 209
196 209 102 98 81 107 123 134 155 42 81 136 160 235 170 60 136 89 178 50 341 272 142 153 203 165 176 194 61 295 249 105 115
-168 115 66 112
-192A12
##PAGE=	F1=-297.438
##FIRST=	25164.767445380970457,	5806.2096540000038658,	0.28546151518821716309
##DATA TABLE=	(F2++(Y..Y)), PROFILE
5806 92 30 64 19 34 185 231 96 131 147 73 9 106 78 163 68 82 73 55 244 243 91 49 160 151 123 90 183 171 205 161 45 70 184
5419 184 171 83 85 213 107 36 111 180 198 177 105 108 79 131 136 48 146 56 171 54 156 93 194 212 42 148 157 94 166 217 167 262 159
5032 159 201 93 94 34 157 127 184 152 41 99 82 181 126 294 197 70 126 123 296 12 83 124 253 191 105 93 14 26 119 144 257
4668 257 195 275 91 145 157 116 234 40 135 162 163 103 114 93 48 75 92 43 158 152 141 160 358 268 126 126 187 139 132 142 151 162 159 117 123
4257 123 53 50 165 135 109 281 189 193 212 236 70 215 66 107 195 223 154 172 57 86 40 216 217 148 188 186 215 131 117 62 92 141 198
3870 198 173 98 73 43 57 139 159 64 125 91 186 171 97 52 36 32 80 188 94 133 127 66 64 244 318 113 147 157 137 104 153 178 60 310
3470 310 218 154 141 54 199 201 138 46 43 60 152 154 192 161 93 186 218 219 292 236 37 67 97 343 1665 3299 2058 354 46 132 296
3107 296 88 179 136 220 41 115 73 128 309 193 80 308 289 195 65 179 124 346 277 258 177 168 168 64 343 441 134 165 243 151
2754 151 48 143 66 106 170 52 149 157 104 19 104 120 155 179 130 115 24 360 172 44 107 100 228 232 213 192 262 287 88 67 101 137 48
2367 48 43 239 95 207 196 208 100 208 358 183 8 74 281 379 55 99 221 75 137 132 97 233 149 100 85 170 47 140 167
2027 167 86 39 91 88 89 137 291 237 56 73 267 183 134 126 151 102 151 45 94 125 68 83 244 206 78 154 211 56 220 111 73 124
1651 124 72 152 30 115 198 84 7 68 47 197 200 119 100 265 114 205 110 132 62 32 63 51 134 199 48 155 220 173 40 67 49
1287 49 138 183 123 180 238 235 95 14 60 223 249 85 122 162 39 80 32 276 368 181 78 208 183 107 132 76 49 35 32 69 280 253
912 253 112 186 52 117 139 260 228 58 83 121 67 237 280 120 75 73 73 71 92 109 52 132 44 145 112 74 173 200 87 136 82 184
536 184 42 245 215 268 139 128 132 106 79 218 209 289 89 26 164 223 172 143 187 310 211 229 258 169 164 192 145 196 229 92 122 86 110
149 110 85 127 138 56 70 116 133 225 155 111 134 95 191 50 319 278 159 129 144 163 162 134 109 280 179 56 105 44 93
-192I3
##PAGE=	F1=-399.696
##FIRST=	25164.767445380970457,	5806.2096540000038658,	0.061451811343431472778
##DATA TABLE=	(F2++(Y..Y)), PROFILE
5806 52 66 31 36 43 188 254 151 110 164 100 50 78 55 154 88 120 66 45 245 278 104 60 205 159 144 82 250 150 209 153 20 80
5431 80 201 195 88 97 203 108 51 123 215 189 138 109 96 75 153 111 51 158 66 197 65 174 72 168 175 32 160 129 95 165 231 134
5055 134 282 152 187 74 96 26 190 149 171 137 76 107 74 150 115 276 198 55 72 133 250 32 87 73 172 158 89 47 48 38 117
4691 117 92 223 228 244 86 159 158 128 180 48 125 141 122 86 110 116 76 26 85 31 127 165 181 171 320 218 138 139 224 105 96 93 112 161 144
4280 144 164 51 32 63 130 119 141 291 191 191 200 225 61 205 28 175 176 205 165 192 91 131 46 206 212 131 131 164 196 95 139 77
3905 77 86 163 234 204 101 55 48 40 110 178 80 108 70 213 174 116 118 17 49 77 221 132 103 113 71 70 254 320 146 134 160 149 74 111 148
3494 148 71 245 173 162 72 14 162 181 143 59 37 29 99 169 182 200 161 153 171 258 381 233 103 116 37 166 115 92 90 210 139 170 227
3107 227 188 241 188 142 79 180 192 108 308 116 46 333 665 720 227 351 570 1624 1865 1001 141 191 237 153 204 271 114 155
2778 155 258 156 32 154 100 123 202 51 153 177 84 28 139 140 157 170 138 76 86 357 132 13 83 118 244 262 214 177 319
2438 319 263 74 115 116 91 51 59 179 46 193 197 148 56 220 318 134 38 53 270 380 64 81 181 65 181 140 89 212 141 73
2085 73 135 193 33 160 158 75 35 79 109 133 146 298 238 85 115 273 168 140 167 154 104 104 40 100 130 70 123 231 205 137 102 232
1710 232 51 186 87 72 150 68 150 18 171 216 79 27 60 77 187 209 104 117 205 115 194 174 113 100 54 52 31 142 211 78 160
1346 160 240 198 14 31 126 125 166 59 156 267 280 147 14 122 266 276 72 131 124 3 76 78 152 278 173 74 206 150 46 136
994 136 129 140 118 30 77 265 274 113 202 69 166 200 216 204 64 61 122 100 239 252 104 91 123 108 81 72 87 59 126 74 153 136 95 150
595 150 198 65 126 86 161 82 319 214 245 187 127 143 103 41 184 193 258 50 33 156 185 122 134 173 283 201 167 234 159 149 224 180
219 180 220 240 105 149 85 107 40 119 120 73 71 79 86 185 134 169 118 99 197 61 269 268 171 100 85 151 143 68 152 246 107 25 92 32 73
-192G3
##PAGE=	F1=-501.954
##FIRST=	25164.767445380970457,	5806.2096540000038658,	0.10801283270120620728
##DATA TABLE=	(F2++(Y..Y)), PROFILE
5806 65 105 30 52 61 162 251 211 86 154 117 102 67 37 155 104 137 40 70 234 305 108 48 220 139 175 76 295 125 189 138 19
5442 19 90 215 199 85 92 170 111 42 141 231 164 82 106 83 61 186 77 69 167 70 206 79 164 65 151 126 13 153 86 75 140 231
5067 231 99 275 156 173 81 97 34 211 163 149 127 116 118 74 112 99 239 188 50 62 122 183 59 97 42 105 126 90 19 108 70 156
4691 156 23 164 240 210 99 181 149 140 105 31 102 120 106 57 103 145 88 29 64 18 91 181 217 156 250 149 132 140 248 112 75 45 66
4304 66 151 110 207 29 3 63 96 109 155 266 183 187 171 200 35 205 87 231 132 163 163 197 127 166 100 198 210 109 76 131 169 68
3928 68 157 129 83 175 258 219 99 49 58 64 83 189 134 99 42 224 168 110 158 30 69 80 224 149 65 96 81 82 254 292 135 120 159
3541 159 151 45 97 115 71 184 137 172 5 38 117 156 175 97 30 34 45 202 162 215 251 122 130 285 469 291 167 168 109 64 1665
3177 1665 3116 1765 240 241 307 149 296 311 260 67 133 242 277 105 284 99 127 468 1122 1271 472 583 1250 3584
2895 3584 4200 2048 348 259 338 253 161 127 153 134 277 162 35 148 95 125 234 47 166 195 75 72 179 142 160 155 125 58
2567 58 139 318 87 34 50 120 232 279 182 160 336 217 102 168 129 48 120 88 115 16 170 215 151 71 215 253 81 66 47 214
2215 214 344 89 62 146 58 211 148 78 174 116 65 161 189 26 177 153 83 70 64 145 170 138 278 225 113 160 249 152 148 211 160 107
1839 107 72 57 116 140 93 158 207 187 179 80 231 98 139 67 83 180 82 124 81 218 229 67 51 52 92 177 216 107 136 146 126 178 233
1452 233 89 156 108 71 50 136 208 98 146 243 201 10 68 207 102 136 82 114 264 298 182 24 172 278 274 84 134 70 34 73
1099 73 127 23 212 178 78 197 143 33 131 172 217 198 39 90 225 272 97 198 78 198 256 174 175 69 33 102 141 234 210 86
747 86 103 167 140 91 41 75 67 134 110 144 127 101 142 205 60 107 93 113 119 374 194 208 230 153 138 79 62 174 171 186 14 74 140 133 67
337 67 112 136 245 198 98 184 134 130 243 213 224 236 130 169 87 95 55 108 105 89 69 34 65 119 125 218 102 100 191 66 203 247 177 76
-63 76 72 138 126 40 184 201 52 33 77 28 57
-192E7
##PAGE=	F1=-604.212
##FIRST=	25164.767445380970457,	5806.2096540000038658,	0.16558063030242919922
##DATA TABLE=	(F2++(Y..Y)), PROFILE
5806 107 126 33 62 67 115 226 251 65 118 118 140 76 33 172 109 135 5 122 214 318 107 33 196 95 211 84 302 102 153
5466 153 125 30 97 222 185 89 71 130 111 22 166 225 133 38 96 71 48 213 61 94 169 86 194 89 128 77 162 77 19 132 34
5102 34 61 92 223 80 246 161 170 111 94 57 218 163 130 120 149 126 80 72 81 183 166 62 112 95 106 76 108 90 87 113 101 29 158 113
4703 113 202 46 118 226 170 118 208 136 145 41 8 82 106 139 34 98 150 84 79 32 12 64 188 241 124 168 79 113 127 249 139 72
4327 72 47 24 133 90 242 92 31 43 71 98 145 212 168 191 140 175 31 222 139 261 86 107 151 187 156 186 130 198 212 94 33
3963 33 101 144 52 178 181 86 178 261 213 97 61 85 122 98 193 183 92 44 219 155 89 169 36 77 76 196 140 32 87 92 98 240 235 83
3564 83 105 154 141 64 95 90 69 142 110 175 53 92 131 135 216 133 39 65 26 229 125 199 330 98 106 292 540 395 213 193 214 213 2943
3177 2943 5562 3220 366 322 431 71 394 378 330 86 185 303 311 116 240 206 168 695 1621 1811 744 834 2015 5846
2895 5846 6859 3201 590 354 447 338 149 56 221 117 298 183 48 133 63 115 258 37 185 205 102 125 219 127 168
2602 168 163 92 53 182 254 49 75 45 100 195 282 122 145 320 159 126 211 136 28 186 118 67 78 140 241 212 108 207 179 36
2250 36 88 91 125 279 122 95 120 56 223 150 91 125 75 92 155 161 40 186 155 104 97 45 180 194 120 237 203 141 194 197 133 150 252
1862 252 174 108 60 93 140 145 118 185 172 152 189 118 213 150 88 72 109 201 120 77 148 250 233 66 77 58 83 154 220 129 150 98 148 176
1463 176 278 68 214 152 73 63 119 188 101 116 243 195 12 114 272 74 101 150 67 236 294 192 46 199 253 240 102 124
1135 124 8 62 66 156 112 203 185 82 178 149 63 112 195 268 248 42 101 168 250 63 171 93 210 298 158 147 61 14 71 179 224
771 224 162 72 111 195 151 96 17 78 78 158 137 123 94 82 141 209 81 104 103 56 153 393 156 160 256 171 114 39 124 192 158 86 86 105 122 80
348 80 20 81 84 207 205 32 112 104 110 247 234 207 216 142 172 103 78 106 93 91 100 52 36 103 43 151 253 111 96 169 64 132 221 173 58
-63 58 111 132 117 75 202 154 27 36 59 24 61
-192F1
##PAGE=	F1=-706.469
##FIRST=	25164.767445380970457,	5806.2096540000038658,	0.25602981448173522949
##DATA TABLE=	(F2++(Y..Y)), PROFILE
5806 141 125 29 64 56 66 192 257 52 67 102 157 91 51 205 101 119 28 172 187 307 112 91 137 41 245 112 268 87 113 119
5454 119 25 98 214 158 99 49 112 105 63 190 196 104 58 77 73 64 224 86 125 169 122 163 86 76 94 187 44 46 111 46 100 35 211 92
5055 92 213 164 188 147 90 85 210 147 126 116 171 130 89 35 59 114 138 76 163 62 32 79 113 140 96 124 107 53 188 163 231 96 128
4668 128 193 118 137 232 126 138 72 50 77 108 191 54 97 120 82 120 6 25 53 181 247 84 94 42 99 109 224 161 85 88 49 110
4292 110 119 268 147 52 10 68 84 117 146 153 207 119 158 68 242 167 257 94 68 135 162 172 188 128 203 223 102 46 85 132 67 201 227
3905 227 94 175 240 187 99 89 124 170 124 196 223 79 67 202 137 70 152 33 76 62 146 104 24 90 100 116 209 154 22 99 145 121
3529 121 106 75 84 75 123 87 162 83 136 197 123 246 169 57 77 34 237 86 152 387 82 101 277 577 494 242 209 307 343 3835
3177 3835 7269 4234 475 382 507 32 467 430 379 155 225 357 305 136 186 331 186 952 2094 2277 993 1055 2715
2907 2715 7943 9284 4205 802 446 541 401 165 101 285 124 312 222 54 124 62 94 272 32 202 206 144 168 252 103
2614 103 179 197 52 50 212 182 27 123 101 64 142 268 51 141 286 110 129 235 137 51 235 140 65 127 103 266 273 131 207 143
2261 143 41 103 152 27 198 151 157 106 61 215 139 121 75 47 145 123 122 61 183 164 135 109 30 205 205 102 184 181 168 204 124 109 143
1874 143 280 193 108 64 142 157 137 138 202 123 103 168 174 189 190 45 105 132 203 155 26 206 263 225 95 115 74 53 114 218 164 153 68
1487 68 176 193 301 61 255 181 57 64 97 151 89 83 244 189 6 146 307 51 71 199 30 197 274 179 78 201 198 183 108
1146 108 103 52 74 56 154 197 229 180 88 149 148 85 85 196 287 266 41 100 103 215 34 127 120 206 317 165 122 38 33 65 209 206 117 63 114
736 114 199 136 91 28 88 92 189 148 106 54 53 134 205 114 125 108 29 178 370 105 108 257 169 81 32 186 226 171 35 159 123 102 40
348 40 9 49 28 176 223 42 50 95 101 241 244 173 181 131 156 134 73 146 74 83 102 20 75 139 75 201 271 153 90 131 73 69 198 159 38
-63 38 153 138 115 100 204 108 29 22 40 32 90
-192I0
##PAGE=	F1=-808.727
##FIRST=	25164.767445380970457,	5806.2096540000038658,	0.25619280338287353516
##DATA TABLE=	(F2++(Y..Y)), PROFILE
5806 155 102 34 60 37 51 166 226 55 34 72 151 107 90 249 82 96 49 206 150 271 134 181 78 55 269 154 202 85 83 108
5454 108 7 98 184 119 105 65 121 93 118 201 151 82 89 51 93 104 218 122 157 172 165 120 69 20 96 200 42 68 109 111 163 48 200
5067 200 121 199 168 215 177 92 114 190 118 136 110 177 127 92 24 34 48 109 86 200 29 38 70 109 165 104 150 103 88 191 212 237 122
4679 122 163 158 62 145 239 124 123 112 87 77 126 237 87 103 64 95 149 38 42 62 162 233 51 43 61 105 107 178 178 111 121 90 87 169 287
4269 287 195 55 28 76 71 92 112 145 222 104 148 99 246 167 224 141 98 126 131 175 168 93 208 241 132 88 85 143 131 223 267 109 169 199
3870 199 146 106 126 167 190 125 200 249 62 80 177 116 58 117 28 77 42 87 45 40 104 106 135 161 62 97 113 128 96 140 32 97 84 119 63
3459 63 128 88 162 251 116 258 205 66 56 27 223 106 80 411 69 111 240 566 552 254 224 367 417 4291 8143 4752 534
3142 534 424 520 74 507 451 390 207 244 393 276 157 143 431 195 1173 2450 2584 1166 1195 3194 9393 10913 4816
2872 4816 946 504 600 438 225 143 327 153 314 264 44 130 118 62 272 50 210 198 175 189 267 82 191 233 52 47 230
2555 230 121 24 170 172 29 89 240 19 149 249 97 110 233 135 79 259 150 85 149 66 282 304 133 216 174 71 112 205
2226 205 63 116 163 206 105 71 188 115 138 37 100 209 87 86 77 169 176 167 112 40 213 201 91 128 166 192 183 38 78 125 291 217
1851 217 104 83 190 153 115 149 205 64 49 124 221 171 213 21 144 139 182 168 58 246 254 207 137 167 89 17 60 211 201 143 56 199
1475 199 212 295 62 270 199 59 63 77 105 69 54 245 183 29 157 303 44 59 212 14 164 243 154 114 181 135 115 95 84 108
1123 108 69 49 117 235 249 155 105 110 133 117 84 178 277 257 45 82 41 175 65 75 148 195 307 168 98 23 54 97 227 177 82 59
747 59 110 174 94 79 39 97 111 214 141 109 34 52 115 190 144 155 102 56 187 308 71 68 233 148 68 73 235 269 204 138 216 125 81 19
348 19 14 26 23 155 244 94 92 122 112 233 248 134 135 101 122 173 100 167 54 100 96 33 101 148 157 240 267 207 90 82 104 29 179 136 28
-63 28 185 153 113 109 190 62 56 4 19 60 131
-192A31
##PAGE=	F1=-910.985
##FIRST=	25164.767445380970457,	5806.2096540000038658,	0.11189555376768112183
##DATA TABLE=	(F2++(Y..Y)), PROFILE
5806 152 64 55 60 39 73 162 167 64 56 46 129 122 141 294 61 74 67 219 108 216 175 270 119 111 278 195 144 94 75 85 52 113 134 74
5407 74 97 107 128 84 156 187 106 66 99 23 116 139 199 149 187 172 200 79 43 46 76 187 56 78 129 177 213 100 192 142 208 179 231 192
5008 192 105 138 159 77 142 97 172 117 84 52 27 34 88 92 220 3 90 60 99 159 132 178 91 134 167 256 223 123 178 145 49 132 220 127
4609 127 113 119 106 66 150 269 108 115 32 115 171 61 57 90 133 200 34 19 72 122 136 123 201 149 140 120 67 213 302 240 41 56 80 64
4210 64 94 137 147 223 79 142 111 221 143 173 176 148 132 108 165 130 31 205 254 169 129 95 171 214 244 301 129 164 149 99 115 168 208 177
3811 177 90 204 260 64 76 152 94 47 79 31 79 28 40 38 72 121 111 154 109 31 175 145 98 68 162 38 128 87 117 37 79 78 167 263
3412 263 103 246 231 56 14 36 191 183 36 401 53 127 187 506 546 251 225 384 424 4295 8161 4765 537 448 466 110
3107 110 513 429 356 229 240 403 236 168 131 484 196 1298 2604 2658 1220 1217 3339 9843 11348 4878 996 508 611
2837 611 446 287 163 340 182 300 293 26 142 170 23 262 73 204 183 188 177 256 73 199 251 101 55 234 91 41 204
2520 204 240 54 61 199 64 163 216 108 73 206 136 97 258 145 95 139 69 286 297 110 223 219 87 118 238 119 46 155 224
2179 224 111 86 145 87 125 38 174 271 87 70 78 145 177 194 109 62 205 183 87 85 167 207 129 58 41 101 285 238 95 109 223 125
1804 125 87 154 191 11 16 73 248 164 218 15 173 125 140 151 115 267 227 181 171 220 105 36 12 200 227 119 58 208 215 258 59
1440 59 255 211 97 68 67 71 49 39 239 170 61 146 260 50 61 189 10 148 208 126 144 148 117 76 63 102 154 57 56 56 233 241 114
$$ [...]
-192B08
##END NTUPLES=	nD NMR SPECTRUM
##END=	
##END=	
